{
    "IsRecentlyVerified": false,
    "ID": 130100,
    "UUID": "DC7A5BBA-24DA-4029-BD32-9266693FD24F",
    "DataProviderID": 1,
    "OperatorID": 89,
    "UsageTypeID": 1,
    "UsageCost": "Free",
    "AddressInfo": {
        "ID": 130446,
        "Title": "Centennial Square, Sparwood",
        "AddressLine1": "100 Centnnial Square",
        "Town": "Sparwood",
        "StateOrProvince": "BC",
        "Postcode": "V0B 2G0",
        "CountryID": 44,
        "Latitude": 49.7328530789929,
        "Longitude": -114.885788942387,
        "DistanceUnit": 0
    },
    "Connections": [
        {
            "ID": 182106,
            "ConnectionTypeID": 2,
            "StatusTypeID": 50,
            "LevelID": 3,
            "PowerKW": 50,
            "CurrentTypeID": 30
        },
        {
            "ID": 182107,
            "ConnectionTypeID": 32,
            "StatusTypeID": 50,
            "LevelID": 3,
            "PowerKW": 50,
            "CurrentTypeID": 30
        }
    ],
    "NumberOfPoints": 1,
    "GeneralComments": "BC Hydro dual-standard fast charger (one vehicle at a time) located off Highway 3 (Crowsnest), in parking lot of shopping and dining area of Sparwood.",
    "StatusTypeID": 50,
    "DateLastStatusUpdate": "2019-08-03T18:28:00Z",
    "DataQualityLevel": 1,
    "DateCreated": "2019-08-01T02:06:00Z",
    "SubmissionStatusTypeID": 200
}