{
    "IsRecentlyVerified": false,
    "ID": 119519,
    "UUID": "C58EBA70-E4D1-49ED-9B9F-95F118F40359",
    "DataProviderID": 2,
    "DataProvidersReference": "43136",
    "UsageTypeID": 2,
    "AddressInfo": {
        "ID": 119865,
        "Title": "Baptist Health - South Miami Hospital",
        "AddressLine1": "6200 SW 73rd St",
        "Town": "South Miami",
        "StateOrProvince": "FL",
        "Postcode": "33143",
        "CountryID": 2,
        "Latitude": 25.70218849,
        "Longitude": -80.29307556,
        "ContactTelephone1": "",
        "AccessComments": "Employee use only",
        "RelatedURL": "",
        "DistanceUnit": 0
    },
    "Connections": [
        {
            "ID": 168793,
            "ConnectionTypeID": 1,
            "LevelID": 2,
            "Amps": 16,
            "Voltage": 230,
            "PowerKW": 3.7,
            "CurrentTypeID": 10,
            "Quantity": 1
        }
    ],
    "DateLastStatusUpdate": "2020-06-26T02:52:00Z",
    "DataQualityLevel": 3,
    "DateCreated": "2019-04-01T04:59:00Z",
    "SubmissionStatusTypeID": 100
}