{
    "IsRecentlyVerified": false,
    "ID": 13706,
    "UUID": "DDAC6775-89F9-47C6-A687-3E2452AA9F0F",
    "DataProviderID": 1,
    "OperatorID": 1,
    "UsageTypeID": 0,
    "UsageCost": "Free",
    "AddressInfo": {
        "ID": 13603,
        "Title": "Cora Wittenheim",
        "AddressLine1": "130, route de Soultz ",
        "AddressLine2": "",
        "Town": "Wittenheim",
        "StateOrProvince": "",
        "Postcode": "68271",
        "CountryID": 80,
        "Latitude": 47.8082904,
        "Longitude": 7.311997700000006,
        "ContactTelephone1": "03 89 52 84 84 ",
        "ContactTelephone2": "",
        "ContactEmail": "wi@cora.fr",
        "AccessComments": "",
        "RelatedURL": "http://www.cora.fr/wittenheim/",
        "DistanceUnit": 0
    },
    "Connections": [
        {
            "ID": 11143,
            "ConnectionTypeID": 2,
            "StatusTypeID": 0,
            "LevelID": 3,
            "Quantity": 1
        },
        {
            "ID": 11144,
            "ConnectionTypeID": 25,
            "StatusTypeID": 0,
            "LevelID": 3,
            "Quantity": 1
        }
    ],
    "NumberOfPoints": 1,
    "GeneralComments": "",
    "StatusTypeID": 50,
    "DateLastStatusUpdate": "2012-11-30T12:08:00Z",
    "DataQualityLevel": 1,
    "DateCreated": "2012-11-30T12:00:00Z",
    "SubmissionStatusTypeID": 200
}