{
    "IsRecentlyVerified": false,
    "ID": 160015,
    "UUID": "95AEB60A-D998-4BAA-ACEC-15BC5F33CFF0",
    "DataProviderID": 2,
    "DataProvidersReference": "156483",
    "OperatorID": 5,
    "UsageTypeID": 1,
    "AddressInfo": {
        "ID": 160372,
        "Title": "LEXINGTON MA",
        "AddressLine1": "18 Muzzey St",
        "Town": "Lexington",
        "StateOrProvince": "MA",
        "Postcode": "02421",
        "CountryID": 2,
        "Latitude": 42.446877,
        "Longitude": -71.22888,
        "ContactTelephone1": "888-758-4389",
        "AccessComments": "24 hours daily",
        "RelatedURL": "http://www.chargepoint.com/",
        "DistanceUnit": 0
    },
    "Connections": [
        {
            "ID": 230248,
            "ConnectionTypeID": 1,
            "LevelID": 2,
            "Amps": 16,
            "Voltage": 230,
            "PowerKW": 3.7,
            "CurrentTypeID": 10,
            "Quantity": 2
        }
    ],
    "StatusTypeID": 50,
    "DateLastStatusUpdate": "2020-06-26T03:06:00Z",
    "DataQualityLevel": 3,
    "DateCreated": "2020-06-26T03:06:00Z",
    "SubmissionStatusTypeID": 100
}