{
    "IsRecentlyVerified": false,
    "ID": 34303,
    "UUID": "E9CFAA98-3540-4BCE-B5F4-5011E4A0618B",
    "DataProviderID": 26,
    "DataProvidersReference": "47656",
    "OperatorID": 178,
    "OperatorsReference": "EVnetNL AL807",
    "UsageCost": "0.00 jaarabonnement",
    "AddressInfo": {
        "ID": 34649,
        "Title": "Regenboogkade 135",
        "AddressLine1": "Regenboogkade 135",
        "Town": "Rotterdam",
        "Postcode": "3077 CX",
        "CountryID": 159,
        "Latitude": 51.903129,
        "Longitude": 4.558208,
        "ContactTelephone1": "0800-3522365",
        "RelatedURL": "http://www.evnet.nl",
        "DistanceUnit": 0
    },
    "Connections": [
        {
            "ID": 37814,
            "ConnectionTypeID": 25,
            "LevelID": 2,
            "PowerKW": 11,
            "CurrentTypeID": 10
        }
    ],
    "NumberOfPoints": 2,
    "StatusTypeID": 50,
    "DateLastStatusUpdate": "2016-06-04T02:42:00Z",
    "DataQualityLevel": 3,
    "DateCreated": "2015-01-09T06:04:00Z",
    "SubmissionStatusTypeID": 100
}