{
    "IsRecentlyVerified": false,
    "ID": 110798,
    "UUID": "7A8ABBD4-596A-43E3-80C9-9B21867FBA55",
    "DataProviderID": 2,
    "DataProvidersReference": "99411",
    "OperatorID": 5,
    "UsageTypeID": 1,
    "AddressInfo": {
        "ID": 111144,
        "Title": "EVCO",
        "AddressLine1": "113 Winniett St",
        "Town": "Woodstock",
        "StateOrProvince": "ON",
        "Postcode": "N4S 5Z8",
        "CountryID": 44,
        "Latitude": 43.1322602,
        "Longitude": -80.7684537,
        "ContactTelephone1": "888-758-4389",
        "AccessComments": "24 hours daily",
        "RelatedURL": "http://www.chargepoint.com/",
        "DistanceUnit": 0
    },
    "Connections": [
        {
            "ID": 156091,
            "ConnectionTypeID": 1,
            "LevelID": 2,
            "Amps": 16,
            "Voltage": 230,
            "PowerKW": 3.7,
            "CurrentTypeID": 10,
            "Quantity": 2
        }
    ],
    "DateLastStatusUpdate": "2020-06-26T03:06:00Z",
    "DataQualityLevel": 3,
    "DateCreated": "2018-10-18T23:36:00Z",
    "SubmissionStatusTypeID": 100
}