{
    "IsRecentlyVerified": false,
    "ID": 28989,
    "UUID": "4BCD3E98-70AA-411A-A589-5C3F0144D84A",
    "DataProviderID": 2,
    "DataProvidersReference": "52285",
    "OperatorID": 5,
    "UsageTypeID": 1,
    "AddressInfo": {
        "ID": 29335,
        "Title": "NATIONAL GRID",
        "AddressLine1": "1220 NY-146",
        "Town": "Clifton Park",
        "StateOrProvince": "NY",
        "Postcode": "12065",
        "CountryID": 2,
        "Latitude": 42.8696062,
        "Longitude": -73.8239864,
        "ContactTelephone1": "888-758-4389",
        "AccessComments": "24 hours daily",
        "RelatedURL": "http://www.chargepoint.com/",
        "DistanceUnit": 0
    },
    "Connections": [
        {
            "ID": 31851,
            "ConnectionTypeID": 1,
            "LevelID": 2,
            "Amps": 16,
            "Voltage": 230,
            "PowerKW": 3,
            "CurrentTypeID": 10,
            "Quantity": 2
        }
    ],
    "DateLastStatusUpdate": "2019-12-24T09:21:00Z",
    "DataQualityLevel": 3,
    "DateCreated": "2014-11-28T03:38:00Z",
    "SubmissionStatusTypeID": 100
}