{
    "IsRecentlyVerified": false,
    "ID": 115828,
    "UUID": "D86C1959-1A07-4D07-B468-A22983E28E66",
    "DataProviderID": 2,
    "DataProvidersReference": "105139",
    "OperatorID": 9,
    "UsageTypeID": 1,
    "AddressInfo": {
        "ID": 116174,
        "Title": "Whole Foods - Newtown Square",
        "AddressLine1": "3737 West Chester Pike",
        "Town": "Newtown Square",
        "StateOrProvince": "PA",
        "Postcode": "19073",
        "CountryID": 2,
        "Latitude": 39.9882,
        "Longitude": -75.404149,
        "ContactTelephone1": "888-998-2546",
        "AccessComments": "MON: 24 hours | TUE: 24 hours | WED: 24 hours | THU: 24 hours | FRI: 24 hours | SAT: 24 hours | SUN: 24 hours",
        "RelatedURL": "http://www.blinkcharging.com/",
        "DistanceUnit": 0
    },
    "Connections": [
        {
            "ID": 162870,
            "ConnectionTypeID": 1,
            "LevelID": 2,
            "Amps": 16,
            "Voltage": 230,
            "PowerKW": 3.7,
            "CurrentTypeID": 10,
            "Quantity": 2
        }
    ],
    "DateLastStatusUpdate": "2020-06-26T03:02:00Z",
    "DataQualityLevel": 3,
    "DateCreated": "2019-02-11T07:13:00Z",
    "SubmissionStatusTypeID": 100
}