{
    "UserComments": [
        {
            "ID": 9848,
            "ChargePointID": 31367,
            "CommentTypeID": 10,
            "UserName": "PatrickDetige",
            "Comment": "",
            "DateCreated": "2016-03-03T11:49:25.513Z",
            "User": {
                "ID": 7838,
                "Username": "PatrickDetige"
            },
            "CheckinStatusTypeID": 10
        },
        {
            "ID": 4913,
            "ChargePointID": 31367,
            "CommentTypeID": 10,
            "UserName": "filip.vanrickstal",
            "Comment": "Reliable charging point: two 22 kW type 2 and two 3,7 kW schuko",
            "Rating": 5,
            "DateCreated": "2015-07-13T06:35:59.77Z",
            "User": {
                "ID": 1761,
                "Username": "filip.vanrickstal"
            },
            "CheckinStatusTypeID": 10
        }
    ],
    "MediaItems": [
        {
            "ID": 852,
            "ChargePointID": 31367,
            "ItemURL": "https://s3-ap-southeast-2.amazonaws.com/openchargemap/images/BE/OCM31367/OCM-31367.orig.2015010518513866.jpg",
            "ItemThumbnailURL": "https://s3-ap-southeast-2.amazonaws.com/openchargemap/images/BE/OCM31367/OCM-31367.thmb.2015010518513866.jpg",
            "Comment": "",
            "IsEnabled": true,
            "IsVideo": false,
            "IsFeaturedItem": false,
            "IsExternalResource": false,
            "User": {
                "ID": 1761,
                "Username": "filip.vanrickstal"
            },
            "DateCreated": "2015-01-05T18:52:00Z"
        },
        {
            "ID": 851,
            "ChargePointID": 31367,
            "ItemURL": "https://s3-ap-southeast-2.amazonaws.com/openchargemap/images/BE/OCM31367/OCM-31367.orig.2015010518453977.jpg",
            "ItemThumbnailURL": "https://s3-ap-southeast-2.amazonaws.com/openchargemap/images/BE/OCM31367/OCM-31367.thmb.2015010518453977.jpg",
            "Comment": "",
            "IsEnabled": true,
            "IsVideo": false,
            "IsFeaturedItem": false,
            "IsExternalResource": false,
            "User": {
                "ID": 1761,
                "Username": "filip.vanrickstal"
            },
            "DateCreated": "2015-01-05T18:46:00Z"
        },
        {
            "ID": 850,
            "ChargePointID": 31367,
            "ItemURL": "https://s3-ap-southeast-2.amazonaws.com/openchargemap/images/BE/OCM31367/OCM-31367.orig.2015010516175941.jpg",
            "ItemThumbnailURL": "https://s3-ap-southeast-2.amazonaws.com/openchargemap/images/BE/OCM31367/OCM-31367.thmb.2015010516175941.jpg",
            "Comment": "",
            "IsEnabled": true,
            "IsVideo": false,
            "IsFeaturedItem": false,
            "IsExternalResource": false,
            "User": {
                "ID": 1761,
                "Username": "filip.vanrickstal"
            },
            "DateCreated": "2015-01-05T16:18:00Z"
        }
    ],
    "IsRecentlyVerified": false,
    "ID": 31367,
    "UUID": "F6E97B3B-F86A-4C0B-A201-B594EDDE235B",
    "DataProviderID": 1,
    "OperatorID": 36,
    "UsageTypeID": 1,
    "AddressInfo": {
        "ID": 31713,
        "Title": "EVA Leuven II",
        "AddressLine1": "Sint Jacobsplein 30",
        "Town": "Leuven",
        "Postcode": "3000",
        "CountryID": 26,
        "Latitude": 50.8793937287933,
        "Longitude": 4.69154038813895,
        "DistanceUnit": 0
    },
    "Connections": [
        {
            "ID": 34835,
            "ConnectionTypeID": 25,
            "StatusTypeID": 50,
            "LevelID": 2,
            "Amps": 32,
            "Voltage": 400,
            "PowerKW": 22,
            "CurrentTypeID": 20,
            "Quantity": 2
        },
        {
            "ID": 34836,
            "ConnectionTypeID": 23,
            "StatusTypeID": 50,
            "LevelID": 2,
            "Amps": 16,
            "Voltage": 230,
            "PowerKW": 3.7,
            "CurrentTypeID": 10,
            "Quantity": 2
        }
    ],
    "NumberOfPoints": 4,
    "StatusTypeID": 50,
    "DateLastStatusUpdate": "2016-03-03T11:49:00Z",
    "DataQualityLevel": 1,
    "DateCreated": "2015-01-05T15:59:00Z",
    "SubmissionStatusTypeID": 200
}