{
    "IsRecentlyVerified": false,
    "ID": 36401,
    "UUID": "44CA85A4-52E4-4752-A050-2F89583F090A",
    "DataProviderID": 26,
    "DataProvidersReference": "56028",
    "OperatorID": 5,
    "OperatorsReference": "Chargepoint 1500152",
    "UsageCost": "0.00 afhankelijk van pas",
    "AddressInfo": {
        "ID": 36747,
        "Title": "Smallepad 34B",
        "AddressLine1": "Smallepad 34B",
        "Town": "Amersfoort",
        "Postcode": "3811 MG",
        "CountryID": 159,
        "Latitude": 52.156113,
        "Longitude": 5.38088,
        "RelatedURL": "http://www.chargepoint.nl",
        "DistanceUnit": 0
    },
    "Connections": [
        {
            "ID": 39912,
            "ConnectionTypeID": 25,
            "LevelID": 2,
            "PowerKW": 11,
            "CurrentTypeID": 10
        }
    ],
    "NumberOfPoints": 1,
    "StatusTypeID": 50,
    "DateLastStatusUpdate": "2016-06-04T02:51:00Z",
    "DataQualityLevel": 3,
    "DateCreated": "2015-01-09T06:05:00Z",
    "SubmissionStatusTypeID": 100
}