{
    "IsRecentlyVerified": false,
    "ID": 39092,
    "UUID": "A4DC63ED-A8DC-486B-963D-27B376F95495",
    "DataProviderID": 26,
    "DataProvidersReference": "34889",
    "OperatorID": 73,
    "OperatorsReference": "EV-Box EVB-P1335096",
    "UsageCost": "0.00 jaarabonnement",
    "AddressInfo": {
        "ID": 39438,
        "Title": "Koldingweg 14",
        "AddressLine1": "Koldingweg 14",
        "Town": "Groningen",
        "Postcode": "9723 HK",
        "CountryID": 159,
        "Latitude": 53.22015,
        "Longitude": 6.60628,
        "RelatedURL": "http://www.ev-box.nl",
        "DistanceUnit": 0
    },
    "Connections": [
        {
            "ID": 42603,
            "ConnectionTypeID": 25,
            "LevelID": 2,
            "PowerKW": 5,
            "CurrentTypeID": 10
        }
    ],
    "NumberOfPoints": 1,
    "StatusTypeID": 50,
    "DateLastStatusUpdate": "2016-03-03T12:41:00Z",
    "DataQualityLevel": 3,
    "DateCreated": "2015-01-09T06:08:00Z",
    "SubmissionStatusTypeID": 100
}