{
    "IsRecentlyVerified": false,
    "ID": 34096,
    "UUID": "741CE557-AEC7-4B29-8517-B1561F2B4C4D",
    "DataProviderID": 26,
    "DataProvidersReference": "20399",
    "OperatorsReference": "Synorga groep bv",
    "UsageCost": "0.00 gratis",
    "AddressInfo": {
        "ID": 34442,
        "Title": "Deventerseweg 5",
        "AddressLine1": "Deventerseweg 5",
        "Town": "Barendrecht",
        "Postcode": "2994 LE",
        "CountryID": 159,
        "Latitude": 51.861521353245,
        "Longitude": 4.5126571809509,
        "RelatedURL": "http://www.synorga.nl",
        "DistanceUnit": 0
    },
    "Connections": [
        {
            "ID": 37607,
            "ConnectionTypeID": 25,
            "LevelID": 2,
            "PowerKW": 11,
            "CurrentTypeID": 10
        }
    ],
    "NumberOfPoints": 1,
    "StatusTypeID": 50,
    "DateLastStatusUpdate": "2016-06-04T02:41:00Z",
    "DataQualityLevel": 3,
    "DateCreated": "2015-01-09T06:04:00Z",
    "SubmissionStatusTypeID": 100
}