{
    "UserComments": [
        {
            "ID": 14740,
            "ChargePointID": 20790,
            "CommentTypeID": 1000,
            "UserName": "Torsten",
            "Comment": "The right hand side Chademo/CCS could not be activated by the app.",
            "DateCreated": "2016-12-27T06:40:53.543Z",
            "User": {
                "ID": 4992,
                "Username": "Torsten"
            },
            "CheckinStatusTypeID": 20
        },
        {
            "ID": 13824,
            "ChargePointID": 20790,
            "CommentTypeID": 10,
            "UserName": "sdlra1",
            "Comment": "",
            "Rating": 4,
            "DateCreated": "2016-07-13T18:26:29.84Z",
            "User": {
                "ID": 6716,
                "Username": "sdlra1"
            },
            "CheckinStatusTypeID": 10
        },
        {
            "ID": 10436,
            "ChargePointID": 20790,
            "CommentTypeID": 100,
            "UserName": "Torsten",
            "Comment": "All equipment here IS operational. Please change Status.",
            "Rating": 4,
            "DateCreated": "2016-05-17T21:16:16.167Z",
            "User": {
                "ID": 4992,
                "Username": "Torsten"
            },
            "CheckinStatusTypeID": 10
        },
        {
            "ID": 8454,
            "ChargePointID": 20790,
            "CommentTypeID": 10,
            "UserName": "ClioBel",
            "Comment": "",
            "DateCreated": "2016-01-07T18:52:03.96Z",
            "User": {
                "ID": 6430,
                "Username": "ClioBel"
            },
            "CheckinStatusTypeID": 10
        },
        {
            "ID": 6355,
            "ChargePointID": 20790,
            "CommentTypeID": 10,
            "UserName": "James Alexander",
            "Comment": "",
            "Rating": 5,
            "DateCreated": "2015-08-30T14:55:53.47Z",
            "User": {
                "ID": 6294,
                "Username": "James Alexander"
            },
            "CheckinStatusTypeID": 10
        },
        {
            "ID": 6227,
            "ChargePointID": 20790,
            "CommentTypeID": 10,
            "UserName": "Fred",
            "Comment": "All good",
            "DateCreated": "2015-08-19T16:39:26.127Z",
            "User": {
                "ID": 6253,
                "Username": "Fred"
            },
            "CheckinStatusTypeID": 10
        },
        {
            "ID": 3787,
            "ChargePointID": 20790,
            "CommentTypeID": 10,
            "UserName": "the_davew",
            "Comment": "15-Feb-2015: M3 Winchester Services, Southbound - Ecotricity Rapid Charge\nRenault ZOE\nHooked up at 14:11 (22%), unhooked at 14:31 (78%) - 56% charge in 20 minutes\nEverything went like clockwork\n",
            "Rating": 5,
            "DateCreated": "2015-02-16T09:16:24.18Z",
            "User": {
                "ID": 1829,
                "Username": "the_davew"
            },
            "CheckinStatusTypeID": 10
        },
        {
            "ID": 3766,
            "ChargePointID": 20790,
            "CommentTypeID": 10,
            "UserName": "Alexis",
            "Comment": "Point to note: Ecotricity highway don't seem to pick up on weekends.\n\nAt the time of posting the charger wasn't accepting any of the cards I had present. ",
            "Rating": 1,
            "DateCreated": "2015-02-14T11:32:20.15Z",
            "User": {
                "ID": 4530,
                "Username": "Alexis"
            },
            "CheckinStatusTypeID": 25
        },
        {
            "ID": 1301,
            "ChargePointID": 20790,
            "CommentTypeID": 10,
            "UserName": "the_davew",
            "Comment": "12-Oct-2014 12:44 - Renault Zoe\nEverything good.  Started charging straight away, 66% charge in 23 minutes\n",
            "Rating": 5,
            "DateCreated": "2014-10-14T15:19:47.047Z",
            "User": {
                "ID": 1829,
                "Username": "the_davew"
            },
            "CheckinStatusTypeID": 10
        },
        {
            "ID": 909,
            "ChargePointID": 20790,
            "CommentTypeID": 50,
            "UserName": "SYWND",
            "Comment": "Unfortunately the type 2 charger seems to be dead. Tried to charge my i3 without success. Left a message for ecotricity but didn't receive a call back. ",
            "Rating": 1,
            "DateCreated": "2014-06-19T05:40:04.077Z",
            "User": {
                "ID": 2040,
                "Username": "SYWND"
            },
            "CheckinStatusTypeID": 20
        },
        {
            "ID": 684,
            "ChargePointID": 20790,
            "CommentTypeID": 50,
            "UserName": "jrmonger",
            "Comment": "The Nissan Leaf charger (Chardemo) pug unit appears to have a broken leaver so I could not plug-in.  The unit itself seems to be working.  I have reported this to Ecotricity who advise that due to parts shortage this could take 2 weeks to fix (02/03/14). ",
            "Rating": 2,
            "DateCreated": "2014-03-03T16:57:44.797Z",
            "User": {
                "ID": 1646,
                "Username": "jrmonger"
            },
            "CheckinStatusTypeID": 25
        }
    ],
    "MediaItems": [
        {
            "ID": 3128,
            "ChargePointID": 20790,
            "ItemURL": "https://s3-ap-southeast-2.amazonaws.com/openchargemap/images/GB/OCM20790/OCM-20790.orig.2015083015003050.jpg",
            "ItemThumbnailURL": "https://s3-ap-southeast-2.amazonaws.com/openchargemap/images/GB/OCM20790/OCM-20790.thmb.2015083015003050.jpg",
            "Comment": "",
            "IsEnabled": true,
            "IsVideo": false,
            "IsFeaturedItem": false,
            "IsExternalResource": false,
            "User": {
                "ID": 6294,
                "Username": "James Alexander"
            },
            "DateCreated": "2015-08-30T15:01:00Z"
        }
    ],
    "IsRecentlyVerified": false,
    "ID": 20790,
    "UUID": "575743ED-96B8-4358-B83B-8A7A12E00816",
    "DataProviderID": 1,
    "OperatorID": 24,
    "OperatorsReference": "0166,0168",
    "UsageTypeID": 5,
    "UsageCost": "£0.30/kWh",
    "AddressInfo": {
        "ID": 21135,
        "Title": "Winchester Moto M3 (S) Services",
        "AddressLine1": "Shroner Wood",
        "Town": "Winchester",
        "StateOrProvince": "Hampshire",
        "Postcode": "SO21 1PP",
        "CountryID": 1,
        "Latitude": 51.115714,
        "Longitude": -1.254505,
        "DistanceUnit": 0
    },
    "Connections": [
        {
            "ID": 22615,
            "ConnectionTypeID": 2,
            "Reference": "0166",
            "StatusTypeID": 50,
            "LevelID": 3,
            "Amps": 200,
            "Voltage": 500,
            "PowerKW": 50,
            "CurrentTypeID": 30,
            "Quantity": 1
        },
        {
            "ID": 22616,
            "ConnectionTypeID": 33,
            "Reference": "0166",
            "StatusTypeID": 50,
            "LevelID": 3,
            "Amps": 200,
            "Voltage": 920,
            "PowerKW": 120,
            "CurrentTypeID": 30,
            "Quantity": 1
        },
        {
            "ID": 75091,
            "ConnectionTypeID": 33,
            "Reference": "0168",
            "StatusTypeID": 50,
            "LevelID": 3,
            "Amps": 200,
            "Voltage": 920,
            "PowerKW": 120,
            "CurrentTypeID": 30,
            "Quantity": 2
        }
    ],
    "NumberOfPoints": 2,
    "GeneralComments": "M3 junctions 8/9",
    "StatusTypeID": 50,
    "DateLastStatusUpdate": "2021-06-27T16:14:00Z",
    "DataQualityLevel": 1,
    "DateCreated": "2014-01-12T12:57:00Z",
    "SubmissionStatusTypeID": 200
}