{
    "IsRecentlyVerified": false,
    "ID": 91684,
    "UUID": "BA5684FB-70C4-4945-8BF7-995F4B7EEC8B",
    "DataProviderID": 1,
    "OperatorID": 1,
    "UsageTypeID": 6,
    "AddressInfo": {
        "ID": 92030,
        "Title": " Hotel Paradiso",
        "AddressLine1": "Via Santa Cristina, 13",
        "Town": "Bardolino",
        "StateOrProvince": "VR",
        "Postcode": "37011 ",
        "CountryID": 112,
        "Latitude": 45.54167861456786,
        "Longitude": 10.726125784239668,
        "ContactTelephone1": "+39 0456227162",
        "ContactEmail": "info@paradisohotel.info",
        "RelatedURL": "http://www.paradisohotel.info/it/",
        "DistanceUnit": 0
    },
    "Connections": [
        {
            "ID": 129994,
            "ConnectionTypeID": 25,
            "StatusTypeID": 50,
            "LevelID": 2,
            "Amps": 16,
            "Voltage": 400,
            "PowerKW": 11,
            "CurrentTypeID": 20,
            "Quantity": 1
        }
    ],
    "NumberOfPoints": 1,
    "GeneralComments": "https://nextcharge.network/",
    "StatusTypeID": 50,
    "DateLastStatusUpdate": "2017-08-13T12:57:00Z",
    "DataQualityLevel": 1,
    "DateCreated": "2017-08-13T12:57:00Z",
    "SubmissionStatusTypeID": 200
}