{
    "IsRecentlyVerified": false,
    "ID": 17325,
    "UUID": "B754C258-0E6C-40BE-ADA0-9240B4FFFEC8",
    "DataProviderID": 22,
    "DataProvidersReference": "65F675B3CF48B79D1D4FE970F1688C6B",
    "AddressInfo": {
        "ID": 17670,
        "Title": "京都日産自動車亀岡大井南店",
        "AddressLine1": "京都府亀岡市大井町並河3丁目18-26",
        "CountryID": 114,
        "Latitude": 35.02833981,
        "Longitude": 135.554776,
        "ContactTelephone1": "0771-24-2211",
        "DistanceUnit": 0
    },
    "Connections": [
        {
            "ID": 17566,
            "ConnectionTypeID": 2,
            "LevelID": 2,
            "Amps": 100,
            "Voltage": 480,
            "PowerKW": 48,
            "Quantity": 1
        }
    ],
    "DateLastStatusUpdate": "2013-06-29T08:56:00Z",
    "DataQualityLevel": 2,
    "DateCreated": "2013-06-29T08:56:00Z",
    "SubmissionStatusTypeID": 200
}