{
    "IsRecentlyVerified": false,
    "ID": 3385,
    "UUID": "3D682FDA-5673-4869-97A5-7E8A563146B6",
    "DataProviderID": 1,
    "OperatorID": 1,
    "AddressInfo": {
        "ID": 3386,
        "Title": "Plug In Carolina",
        "AddressLine1": "100 Dunbar St.",
        "Town": "Spartanburg",
        "StateOrProvince": "SC",
        "Postcode": "29306",
        "CountryID": 2,
        "Latitude": 34.95,
        "Longitude": -81.933,
        "DistanceUnit": 0
    },
    "Connections": [],
    "NumberOfPoints": 1,
    "GeneralComments": "Cost To Charge: Unknown Access Hours: Unknown",
    "DateLastStatusUpdate": "2019-12-15T06:07:00Z",
    "DateCreated": "2010-02-28T00:00:00Z",
    "SubmissionStatusTypeID": 200
}