{
    "IsRecentlyVerified": false,
    "ID": 165450,
    "UUID": "944AEE3F-B50B-403D-8E62-C6DEF537C778",
    "DataProviderID": 28,
    "DataProvidersReference": "FR*S64*PMB64*67",
    "OperatorID": 3407,
    "UsageTypeID": 5,
    "AddressInfo": {
        "ID": 165809,
        "Title": "LACQ - Chemin Du Moulin",
        "AddressLine1": "Chemin Du Moulin 64170 LACQ",
        "CountryID": 80,
        "Latitude": 43.411995,
        "Longitude": -0.616958,
        "AccessComments": "24h/24 7j/7",
        "DistanceUnit": 0
    },
    "Connections": [
        {
            "ID": 238845,
            "ConnectionTypeID": 25,
            "StatusTypeID": 50,
            "LevelID": 2,
            "PowerKW": 18,
            "CurrentTypeID": 20
        },
        {
            "ID": 238846,
            "ConnectionTypeID": 28,
            "StatusTypeID": 50,
            "LevelID": 2,
            "PowerKW": 18,
            "CurrentTypeID": 10
        },
        {
            "ID": 238847,
            "ConnectionTypeID": 25,
            "StatusTypeID": 50,
            "LevelID": 2,
            "PowerKW": 18,
            "CurrentTypeID": 20
        },
        {
            "ID": 238848,
            "ConnectionTypeID": 28,
            "StatusTypeID": 50,
            "LevelID": 2,
            "PowerKW": 18,
            "CurrentTypeID": 10
        }
    ],
    "GeneralComments": "Recharge par badge et avec une application smartphone",
    "StatusTypeID": 50,
    "DateLastStatusUpdate": "2020-08-27T05:10:00Z",
    "DataQualityLevel": 2,
    "DateCreated": "2020-08-27T05:10:00Z",
    "SubmissionStatusTypeID": 100
}