{
    "IsRecentlyVerified": false,
    "ID": 31375,
    "UUID": "F926F20F-7C0D-4E2C-BC17-49F8E75B6E68",
    "DataProviderID": 1,
    "OperatorID": 104,
    "UsageTypeID": 1,
    "UsageCost": "Free",
    "AddressInfo": {
        "ID": 31721,
        "Title": "Drummond Street Car Park ",
        "AddressLine1": "37 Drummond Street",
        "Town": "Rotherham",
        "StateOrProvince": "South Yorkshire",
        "Postcode": "S65 1HP",
        "CountryID": 1,
        "Latitude": 53.4331276050391,
        "Longitude": -1.35200511478888,
        "AccessComments": "Max stay 2 hours",
        "DistanceUnit": 0
    },
    "Connections": [
        {
            "ID": 34863,
            "ConnectionTypeID": 25,
            "StatusTypeID": 50,
            "LevelID": 2,
            "Amps": 32,
            "Voltage": 400,
            "PowerKW": 22,
            "CurrentTypeID": 20,
            "Quantity": 2
        }
    ],
    "NumberOfPoints": 2,
    "StatusTypeID": 50,
    "DateLastStatusUpdate": "2016-03-09T16:17:00Z",
    "DataQualityLevel": 1,
    "DateCreated": "2015-01-05T21:32:00Z",
    "SubmissionStatusTypeID": 200
}