{
    "IsRecentlyVerified": false,
    "ID": 52547,
    "UUID": "58E07250-4616-43D7-8E9E-6E39280E78B6",
    "DataProviderID": 1,
    "OperatorID": 1,
    "UsageTypeID": 6,
    "AddressInfo": {
        "ID": 52893,
        "Title": "ffinance, a.s. ",
        "AddressLine1": "Růžová 307",
        "AddressLine2": "Louky nad Dřevnicí",
        "Town": "Zlín",
        "StateOrProvince": "okres Zlín",
        "Postcode": "76302",
        "CountryID": 64,
        "Latitude": 49.2155971,
        "Longitude": 17.6298474,
        "ContactTelephone1": "+420 608 116 570",
        "ContactEmail": "jason@ffinance.cz",
        "DistanceUnit": 0
    },
    "Connections": [
        {
            "ID": 65255,
            "ConnectionTypeID": 17,
            "StatusTypeID": 0,
            "LevelID": 2,
            "Amps": 32,
            "Voltage": 400,
            "PowerKW": 22,
            "CurrentTypeID": 20,
            "Quantity": 1
        },
        {
            "ID": 65256,
            "ConnectionTypeID": 23,
            "StatusTypeID": 0,
            "LevelID": 2,
            "Amps": 16,
            "Voltage": 230,
            "PowerKW": 3.6,
            "CurrentTypeID": 10,
            "Quantity": 1
        }
    ],
    "NumberOfPoints": 1,
    "StatusTypeID": 0,
    "DateLastStatusUpdate": "2015-09-04T08:34:00Z",
    "DataQualityLevel": 1,
    "DateCreated": "2015-09-02T18:35:00Z",
    "SubmissionStatusTypeID": 200
}