{
    "IsRecentlyVerified": false,
    "ID": 8740,
    "UUID": "D4EE035B-CAFC-45DA-B815-FAC76A814957",
    "DataProviderID": 15,
    "DataProvidersReference": "271",
    "OperatorID": 5,
    "AddressInfo": {
        "ID": 8637,
        "Title": "University Drive S Bruce ACT 2617",
        "AddressLine1": "University Drive S Bruce ACT 2617",
        "Town": "Canberra",
        "StateOrProvince": "",
        "Postcode": "",
        "CountryID": 18,
        "Latitude": -35.24051,
        "Longitude": 149.08711,
        "ContactTelephone1": "",
        "RelatedURL": "http://carstations.com/271",
        "DistanceUnit": 0
    },
    "Connections": [
        {
            "ID": 6153,
            "ConnectionTypeID": 9,
            "Reference": "NEMA5",
            "LevelID": 1
        }
    ],
    "StatusTypeID": 0,
    "DateLastStatusUpdate": "2017-11-04T14:03:00Z",
    "DataQualityLevel": 1,
    "DateCreated": "2011-11-11T12:07:00Z",
    "SubmissionStatusTypeID": 100
}