{
    "IsRecentlyVerified": false,
    "ID": 145302,
    "UUID": "79E409AD-7CB6-4A94-B26D-4807BDB26285",
    "DataProviderID": 2,
    "DataProvidersReference": "147785",
    "OperatorID": 39,
    "UsageTypeID": 1,
    "AddressInfo": {
        "ID": 145654,
        "Title": "Walgreens - Des Moines, WA #9423 |P908",
        "AddressLine1": "23003 Pacific Highway South",
        "Town": "Des Moines",
        "StateOrProvince": "WA",
        "Postcode": "98198",
        "CountryID": 2,
        "Latitude": 47.3951507,
        "Longitude": -122.2953153,
        "ContactTelephone1": "800-663-5633",
        "AccessComments": "MO: 12:00am-12:00am; TU: 12:00am-12:00am; WE: 12:00am-12:00am; TH: 12:00am-12:00am; FR: 12:00am-12:00am; SA: 12:00am-12:00am; SU: 12:00am-12:00am",
        "RelatedURL": "http://www.semacharge.com/",
        "DistanceUnit": 0
    },
    "Connections": [
        {
            "ID": 201947,
            "ConnectionTypeID": 1,
            "LevelID": 2,
            "Amps": 16,
            "Voltage": 230,
            "PowerKW": 3.7,
            "CurrentTypeID": 10,
            "Quantity": 1
        }
    ],
    "StatusTypeID": 50,
    "DateLastStatusUpdate": "2020-06-26T03:10:00Z",
    "DataQualityLevel": 3,
    "DateCreated": "2019-12-24T09:24:00Z",
    "SubmissionStatusTypeID": 100
}