{
    "IsRecentlyVerified": false,
    "ID": 85291,
    "UUID": "1EA88A72-B497-4717-BD27-70332DBC349F",
    "DataProviderID": 1,
    "OperatorID": 23,
    "OperatorsReference": "26209",
    "UsageTypeID": 4,
    "AddressInfo": {
        "ID": 85637,
        "Title": "Lambert Bridge Winery",
        "AddressLine1": "4085 W Dry Creek RD",
        "Town": "Healdsburg",
        "StateOrProvince": "California",
        "Postcode": "95448",
        "CountryID": 2,
        "Latitude": 38.646898,
        "Longitude": -122.927687,
        "ContactTelephone1": "(707) 431-9600",
        "DistanceUnit": 0
    },
    "Connections": [
        {
            "ID": 121114,
            "ConnectionTypeID": 30,
            "StatusTypeID": 50,
            "LevelID": 2,
            "PowerKW": 8,
            "CurrentTypeID": 10,
            "Quantity": 1
        }
    ],
    "NumberOfPoints": 1,
    "GeneralComments": "1 Tesla Connector, up to 8kW.Available for customers. Self park.",
    "StatusTypeID": 50,
    "DateLastStatusUpdate": "2017-06-09T14:34:00Z",
    "DataQualityLevel": 1,
    "DateCreated": "2017-04-01T05:43:00Z",
    "SubmissionStatusTypeID": 200
}