{
    "IsRecentlyVerified": false,
    "ID": 119542,
    "UUID": "4CA9714E-CB0F-4168-AFFA-DC2AE30F2651",
    "DataProviderID": 2,
    "DataProvidersReference": "99619",
    "OperatorID": 5,
    "UsageTypeID": 1,
    "AddressInfo": {
        "ID": 119888,
        "Title": "MIAMI-DADE",
        "AddressLine1": "11897 NW 12th St",
        "Town": "Miami",
        "StateOrProvince": "FL",
        "Postcode": "33172",
        "CountryID": 2,
        "Latitude": 25.784662,
        "Longitude": -80.389046,
        "ContactTelephone1": "888-758-4389",
        "AccessComments": "24 hours daily",
        "RelatedURL": "http://www.chargepoint.com/",
        "DistanceUnit": 0
    },
    "Connections": [
        {
            "ID": 168816,
            "ConnectionTypeID": 1,
            "LevelID": 2,
            "Amps": 16,
            "Voltage": 230,
            "PowerKW": 3.7,
            "CurrentTypeID": 10,
            "Quantity": 4
        }
    ],
    "DateLastStatusUpdate": "2020-06-26T02:52:00Z",
    "DataQualityLevel": 3,
    "DateCreated": "2019-04-01T04:59:00Z",
    "SubmissionStatusTypeID": 100
}