{
    "IsRecentlyVerified": false,
    "ID": 79458,
    "UUID": "73F0AEFD-84EA-4250-A936-6CCB64CCDA0F",
    "DataProviderID": 1,
    "OperatorID": 23,
    "OperatorsReference": "9272",
    "UsageTypeID": 6,
    "UsageCost": "Free",
    "AddressInfo": {
        "ID": 79804,
        "Title": "Comfort Inn & Suites Custer",
        "AddressLine1": "339 MT Rushmore RD",
        "Town": "Custer",
        "StateOrProvince": "SD",
        "Postcode": "57730",
        "CountryID": 2,
        "Latitude": 43.76373,
        "Longitude": -103.613702,
        "ContactTelephone1": "(605) 673-2331",
        "DistanceUnit": 0
    },
    "Connections": [
        {
            "ID": 114097,
            "ConnectionTypeID": 30,
            "StatusTypeID": 50,
            "LevelID": 2,
            "PowerKW": 8,
            "CurrentTypeID": 10,
            "Quantity": 1
        }
    ],
    "NumberOfPoints": 1,
    "GeneralComments": "1 Tesla Connector, up to 8kW.Available for patrons only. Self park.",
    "StatusTypeID": 50,
    "DateLastStatusUpdate": "2017-06-09T13:00:00Z",
    "DataQualityLevel": 1,
    "DateCreated": "2017-01-29T17:17:00Z",
    "SubmissionStatusTypeID": 200
}