{
    "IsRecentlyVerified": false,
    "ID": 33220,
    "UUID": "25519034-F46B-41B6-9F49-7D2578BEE3E6",
    "DataProviderID": 26,
    "DataProvidersReference": "48783",
    "OperatorID": 178,
    "OperatorsReference": "EVnetNL TIL_001",
    "UsageCost": "0.00 jaarabonnement",
    "AddressInfo": {
        "ID": 33566,
        "Title": "Koopvaardijstraat",
        "AddressLine1": "Koopvaardijstraat",
        "Town": "Tilburg",
        "Postcode": "5017 BG",
        "CountryID": 159,
        "Latitude": 51.553225,
        "Longitude": 5.09127,
        "ContactTelephone1": "0800-3522365",
        "RelatedURL": "http://www.evnet.nl",
        "DistanceUnit": 0
    },
    "Connections": [
        {
            "ID": 36731,
            "ConnectionTypeID": 25,
            "LevelID": 2,
            "PowerKW": 11,
            "CurrentTypeID": 10
        }
    ],
    "NumberOfPoints": 2,
    "StatusTypeID": 50,
    "DateLastStatusUpdate": "2016-06-04T02:39:00Z",
    "DataQualityLevel": 3,
    "DateCreated": "2015-01-09T06:04:00Z",
    "SubmissionStatusTypeID": 100
}