{
    "IsRecentlyVerified": false,
    "ID": 41658,
    "UUID": "73CE11E4-92A0-4547-9CFF-7D6CE860E9DE",
    "DataProviderID": 26,
    "DataProvidersReference": "50527",
    "OperatorID": 180,
    "OperatorsReference": "Alfen GDH0472",
    "UsageCost": "0.00 jaarabonnement",
    "AddressInfo": {
        "ID": 42004,
        "Title": "Johan van Oldenbarneveltlaan 84",
        "AddressLine1": "Johan van Oldenbarneveltlaan 84",
        "Town": "Den Haag",
        "Postcode": "2582 NX",
        "CountryID": 159,
        "Latitude": 52.098645,
        "Longitude": 4.278185,
        "ContactTelephone1": "036 - 549 34 00",
        "RelatedURL": "http://www.icu-charging-stations.com/",
        "DistanceUnit": 0
    },
    "Connections": [
        {
            "ID": 45660,
            "ConnectionTypeID": 25,
            "LevelID": 2,
            "PowerKW": 11,
            "CurrentTypeID": 10
        },
        {
            "ID": 45661,
            "ConnectionTypeID": 25,
            "LevelID": 2,
            "PowerKW": 11,
            "CurrentTypeID": 10
        }
    ],
    "NumberOfPoints": 1,
    "StatusTypeID": 50,
    "DateLastStatusUpdate": "2016-06-04T02:50:00Z",
    "DataQualityLevel": 3,
    "DateCreated": "2015-02-09T03:25:00Z",
    "SubmissionStatusTypeID": 100
}