{
    "IsRecentlyVerified": false,
    "ID": 112759,
    "UUID": "8738CCDC-9C77-4E9D-9DFE-C00160C6C1AE",
    "DataProviderID": 1,
    "OperatorID": 80,
    "UsageTypeID": 4,
    "AddressInfo": {
        "ID": 113105,
        "Title": "Municipio di Corigliano Calabro | EnelX",
        "AddressLine1": "Via Villa Margherita",
        "Town": "Corigliano Calabro",
        "StateOrProvince": "CS",
        "Postcode": "87064 ",
        "CountryID": 112,
        "Latitude": 39.59830113301426,
        "Longitude": 16.519185586959626,
        "ContactTelephone1": "800.069.850",
        "RelatedURL": "https://www.enelx.com/it/it/emobility",
        "DistanceUnit": 0
    },
    "Connections": [
        {
            "ID": 158781,
            "ConnectionTypeID": 25,
            "StatusTypeID": 150,
            "LevelID": 2,
            "Amps": 32,
            "Voltage": 400,
            "PowerKW": 22,
            "CurrentTypeID": 20,
            "Quantity": 1
        },
        {
            "ID": 158782,
            "ConnectionTypeID": 36,
            "StatusTypeID": 150,
            "LevelID": 2,
            "Amps": 16,
            "Voltage": 240,
            "PowerKW": 3.7,
            "CurrentTypeID": 10,
            "Quantity": 1
        }
    ],
    "NumberOfPoints": 2,
    "GeneralComments": "Posizione esatta della colonnina da verificare",
    "StatusTypeID": 150,
    "DateLastStatusUpdate": "2018-11-13T13:52:00Z",
    "DataQualityLevel": 1,
    "DateCreated": "2018-11-13T13:52:00Z",
    "SubmissionStatusTypeID": 200
}