{
    "IsRecentlyVerified": false,
    "ID": 143973,
    "UUID": "35390FC7-CCB6-464F-BE2C-9B446E7537B5",
    "DataProviderID": 2,
    "DataProvidersReference": "98986",
    "OperatorID": 59,
    "UsageTypeID": 1,
    "AddressInfo": {
        "ID": 144325,
        "Title": "Greenlots - 43023",
        "AddressLine1": "1627 County B Road West",
        "Town": "Roseville",
        "StateOrProvince": "MN",
        "Postcode": "55113",
        "CountryID": 2,
        "Latitude": 45.0066223144531,
        "Longitude": -93.1686401367188,
        "ContactTelephone1": "855-900-7584",
        "AccessComments": "24 hours daily",
        "RelatedURL": "http://greenlots.com/",
        "DistanceUnit": 0
    },
    "Connections": [
        {
            "ID": 200413,
            "ConnectionTypeID": 2,
            "LevelID": 3,
            "Amps": 100,
            "Voltage": 400,
            "PowerKW": 40,
            "CurrentTypeID": 30,
            "Quantity": 1
        },
        {
            "ID": 200414,
            "ConnectionTypeID": 32,
            "LevelID": 3,
            "Amps": 100,
            "Voltage": 400,
            "PowerKW": 40,
            "CurrentTypeID": 30,
            "Quantity": 1
        }
    ],
    "StatusTypeID": 50,
    "DateLastStatusUpdate": "2020-06-26T03:08:00Z",
    "DataQualityLevel": 3,
    "DateCreated": "2019-12-24T09:22:00Z",
    "SubmissionStatusTypeID": 100
}