{
    "IsRecentlyVerified": false,
    "ID": 152468,
    "UUID": "AF3BB37F-FD2B-4789-8649-D63FFD6FB795",
    "DataProviderID": 28,
    "DataProvidersReference": "FR*S86*PSORE*B074",
    "UsageTypeID": 5,
    "AddressInfo": {
        "ID": 152821,
        "Title": "B074",
        "AddressLine1": "Rue de la Girouarirre - 86120 - Morton",
        "CountryID": 80,
        "Latitude": 47.10853,
        "Longitude": -0.02363,
        "AccessComments": "24/24 7/7 jours",
        "DistanceUnit": 0
    },
    "Connections": [
        {
            "ID": 213449,
            "ConnectionTypeID": 28,
            "StatusTypeID": 50,
            "LevelID": 2,
            "PowerKW": 18,
            "CurrentTypeID": 10
        },
        {
            "ID": 213450,
            "ConnectionTypeID": 25,
            "StatusTypeID": 50,
            "LevelID": 2,
            "PowerKW": 18,
            "CurrentTypeID": 20
        },
        {
            "ID": 246427,
            "ConnectionTypeID": 28,
            "StatusTypeID": 50,
            "LevelID": 2,
            "PowerKW": 18,
            "CurrentTypeID": 10
        },
        {
            "ID": 246428,
            "ConnectionTypeID": 25,
            "StatusTypeID": 50,
            "LevelID": 2,
            "PowerKW": 18,
            "CurrentTypeID": 20
        }
    ],
    "GeneralComments": "",
    "StatusTypeID": 50,
    "DateLastStatusUpdate": "2020-08-27T05:13:00Z",
    "DataQualityLevel": 2,
    "DateCreated": "2020-03-15T10:53:00Z",
    "SubmissionStatusTypeID": 100
}