{
    "IsRecentlyVerified": false,
    "ID": 119589,
    "UUID": "C9DE4C8A-1387-41F5-AF23-676EDED7DAA2",
    "DataProviderID": 2,
    "DataProvidersReference": "100351",
    "OperatorID": 5,
    "UsageTypeID": 1,
    "AddressInfo": {
        "ID": 119935,
        "Title": "ROTO",
        "AddressLine1": "6001 N Ocean Drive",
        "Town": "Hollywood",
        "StateOrProvince": "FL",
        "Postcode": "33019",
        "CountryID": 2,
        "Latitude": 26.052092,
        "Longitude": -80.113097,
        "ContactTelephone1": "888-758-4389",
        "AccessComments": "24 hours daily",
        "RelatedURL": "http://www.chargepoint.com/",
        "DistanceUnit": 0
    },
    "Connections": [
        {
            "ID": 168865,
            "ConnectionTypeID": 1,
            "LevelID": 2,
            "Amps": 16,
            "Voltage": 230,
            "PowerKW": 3.7,
            "CurrentTypeID": 10,
            "Quantity": 4
        }
    ],
    "DateLastStatusUpdate": "2020-06-26T02:52:00Z",
    "DataQualityLevel": 3,
    "DateCreated": "2019-04-01T04:59:00Z",
    "SubmissionStatusTypeID": 100
}