{
    "IsRecentlyVerified": false,
    "ID": 93768,
    "UUID": "06E6A01E-89D2-43C8-8607-EE1A652B3872",
    "DataProviderID": 1,
    "OperatorID": 23,
    "OperatorsReference": "36111",
    "UsageTypeID": 4,
    "AddressInfo": {
        "ID": 94114,
        "Title": "Hotel Eastlund",
        "AddressLine1": "1021 Ne Grand Ave",
        "Town": "Portland",
        "StateOrProvince": "Oregon",
        "Postcode": "97232",
        "CountryID": 2,
        "Latitude": 45.530299,
        "Longitude": -122.660825,
        "ContactTelephone1": "(503) 235-2100",
        "DistanceUnit": 0
    },
    "Connections": [
        {
            "ID": 132750,
            "ConnectionTypeID": 30,
            "StatusTypeID": 50,
            "LevelID": 2,
            "PowerKW": 13,
            "CurrentTypeID": 20,
            "Quantity": 4
        }
    ],
    "NumberOfPoints": 4,
    "GeneralComments": "4 Tesla Connectors, up to 13kW.Available for customers. Self park.",
    "StatusTypeID": 50,
    "DateLastStatusUpdate": "2017-10-08T05:33:00Z",
    "DataQualityLevel": 1,
    "DateCreated": "2017-10-08T05:33:00Z",
    "SubmissionStatusTypeID": 200
}