{
    "IsRecentlyVerified": false,
    "ID": 157734,
    "UUID": "3DCE0E7B-031E-4612-9034-8D37FB8C9325",
    "DataProviderID": 18,
    "DataProvidersReference": "e1fe49b4ad0b8fba305c459cd6d72119",
    "UsageTypeID": 1,
    "AddressInfo": {
        "ID": 158088,
        "Title": "1 Davy Road",
        "AddressLine1": "1 Davy Road",
        "Town": "Plymouth",
        "Postcode": "PL6 8BX",
        "CountryID": 1,
        "Latitude": 50.417533,
        "Longitude": -4.108911,
        "AccessComments": "",
        "RelatedURL": "http://www.national-charge-point-registry.uk/",
        "DistanceUnit": 0
    },
    "Connections": [
        {
            "ID": 227252,
            "ConnectionTypeID": 25,
            "Reference": "4002016",
            "StatusTypeID": 50,
            "LevelID": 2,
            "Amps": 32,
            "Voltage": 230,
            "PowerKW": 7,
            "CurrentTypeID": 10
        }
    ],
    "StatusTypeID": 0,
    "DateLastStatusUpdate": "2020-06-25T10:00:00Z",
    "MetadataValues": [
        {
            "ID": 7267,
            "MetadataFieldID": 4,
            "ItemValue": "Contains public sector information licensed under the Open Government Licence v2.0. http://www.nationalarchives.gov.uk/doc/open-government-licence/version/2/"
        }
    ],
    "DataQualityLevel": 3,
    "DateCreated": "2020-06-25T10:00:00Z",
    "SubmissionStatusTypeID": 100
}