{
    "IsRecentlyVerified": false,
    "ID": 102063,
    "UUID": "05D48F1E-678D-436F-AC6B-8907231F2F52",
    "DataProviderID": 1,
    "OperatorID": 23,
    "OperatorsReference": "42219",
    "UsageTypeID": 4,
    "AddressInfo": {
        "ID": 102409,
        "Title": "Una Hotel One",
        "AddressLine1": "Via Diodoro Siculo",
        "Town": "4",
        "StateOrProvince": "Siracusa",
        "Postcode": "96100",
        "CountryID": 112,
        "Latitude": 37.082593,
        "Longitude": 15.294643,
        "ContactTelephone1": "+39 0931 411 355",
        "DistanceUnit": 0
    },
    "Connections": [
        {
            "ID": 144046,
            "ConnectionTypeID": 30,
            "StatusTypeID": 50,
            "LevelID": 2,
            "Amps": 32,
            "Voltage": 400,
            "PowerKW": 22,
            "CurrentTypeID": 20,
            "Quantity": 1
        }
    ],
    "NumberOfPoints": 1,
    "GeneralComments": "1 Tesla Connector, up to 22kW.Available to the public. Please call ahead.",
    "StatusTypeID": 50,
    "DateLastStatusUpdate": "2018-10-03T22:26:00Z",
    "DataQualityLevel": 1,
    "DateCreated": "2018-04-16T05:05:00Z",
    "SubmissionStatusTypeID": 200
}