{
    "UserComments": [
        {
            "ID": 14052,
            "ChargePointID": 33266,
            "CommentTypeID": 10,
            "UserName": "Bert van Sas",
            "Rating": 4,
            "DateCreated": "2016-08-13T20:58:02.1Z",
            "User": {
                "ID": 11617,
                "Username": "Bert van Sas"
            },
            "CheckinStatusTypeID": 140
        }
    ],
    "MediaItems": [
        {
            "ID": 8033,
            "ChargePointID": 33266,
            "ItemURL": "https://s3-ap-southeast-2.amazonaws.com/openchargemap/images/NL/OCM33266/OCM-33266.orig.2016081320572415.jpg",
            "ItemThumbnailURL": "https://s3-ap-southeast-2.amazonaws.com/openchargemap/images/NL/OCM33266/OCM-33266.thmb.2016081320572415.jpg",
            "Comment": "",
            "IsEnabled": true,
            "IsVideo": false,
            "IsFeaturedItem": false,
            "IsExternalResource": false,
            "User": {
                "ID": 11617,
                "Username": "Bert van Sas"
            },
            "DateCreated": "2016-08-13T20:58:00Z"
        },
        {
            "ID": 8034,
            "ChargePointID": 33266,
            "ItemURL": "https://s3-ap-southeast-2.amazonaws.com/openchargemap/images/NL/OCM33266/OCM-33266.orig.2016081320574541.jpg",
            "ItemThumbnailURL": "https://s3-ap-southeast-2.amazonaws.com/openchargemap/images/NL/OCM33266/OCM-33266.thmb.2016081320574541.jpg",
            "Comment": "",
            "IsEnabled": true,
            "IsVideo": false,
            "IsFeaturedItem": false,
            "IsExternalResource": false,
            "User": {
                "ID": 11617,
                "Username": "Bert van Sas"
            },
            "DateCreated": "2016-08-13T20:58:00Z"
        },
        {
            "ID": 8031,
            "ChargePointID": 33266,
            "ItemURL": "https://s3-ap-southeast-2.amazonaws.com/openchargemap/images/NL/OCM33266/OCM-33266.orig.2016081320563957.jpg",
            "ItemThumbnailURL": "https://s3-ap-southeast-2.amazonaws.com/openchargemap/images/NL/OCM33266/OCM-33266.thmb.2016081320563957.jpg",
            "Comment": "",
            "IsEnabled": true,
            "IsVideo": false,
            "IsFeaturedItem": false,
            "IsExternalResource": false,
            "User": {
                "ID": 11617,
                "Username": "Bert van Sas"
            },
            "DateCreated": "2016-08-13T20:57:00Z"
        },
        {
            "ID": 8032,
            "ChargePointID": 33266,
            "ItemURL": "https://s3-ap-southeast-2.amazonaws.com/openchargemap/images/NL/OCM33266/OCM-33266.orig.2016081320570427.jpg",
            "ItemThumbnailURL": "https://s3-ap-southeast-2.amazonaws.com/openchargemap/images/NL/OCM33266/OCM-33266.thmb.2016081320570427.jpg",
            "Comment": "",
            "IsEnabled": true,
            "IsVideo": false,
            "IsFeaturedItem": false,
            "IsExternalResource": false,
            "User": {
                "ID": 11617,
                "Username": "Bert van Sas"
            },
            "DateCreated": "2016-08-13T20:57:00Z"
        }
    ],
    "IsRecentlyVerified": false,
    "ID": 33266,
    "UUID": "F96D9A4A-6650-4722-BEAE-AF710D2EF904",
    "DataProviderID": 26,
    "DataProvidersReference": "47180",
    "OperatorID": 178,
    "OperatorsReference": "EVnetNL AL330",
    "UsageCost": "0.00 jaarabonnement",
    "AddressInfo": {
        "ID": 33612,
        "Title": "Burgemeester P Wissestraat 1",
        "AddressLine1": "Burgemeester P Wissestraat 1",
        "Town": "Noord-Beveland",
        "Postcode": "4494 NS",
        "CountryID": 159,
        "Latitude": 51.564963,
        "Longitude": 3.770113,
        "ContactTelephone1": "0800-3522365",
        "RelatedURL": "http://www.evnet.nl",
        "DistanceUnit": 0
    },
    "Connections": [
        {
            "ID": 36777,
            "ConnectionTypeID": 25,
            "LevelID": 2,
            "PowerKW": 11,
            "CurrentTypeID": 10
        }
    ],
    "NumberOfPoints": 2,
    "StatusTypeID": 50,
    "DateLastStatusUpdate": "2016-08-13T20:58:00Z",
    "DataQualityLevel": 3,
    "DateCreated": "2015-01-09T06:04:00Z",
    "SubmissionStatusTypeID": 100
}