{
    "IsRecentlyVerified": false,
    "ID": 117792,
    "UUID": "AFC8A5D0-6CD3-4D73-A882-5AA61B0AC9B3",
    "DataProviderID": 1,
    "OperatorID": 3324,
    "UsageTypeID": 5,
    "UsageCost": "0,30€/kWh",
    "AddressInfo": {
        "ID": 118138,
        "Title": "Easycharger - Tordesillas",
        "AddressLine1": "A62, Salida 142",
        "AddressLine2": "VP-5804",
        "Town": "Tordesillas",
        "StateOrProvince": "Valladolid",
        "Postcode": "47132",
        "CountryID": 210,
        "Latitude": 41.5415607892263,
        "Longitude": -4.89648413744487,
        "ContactTelephone1": "979300600",
        "ContactEmail": "info@easycharger.es",
        "AccessComments": "Salida 142 dirección Villamarciel",
        "RelatedURL": "http://www.easycharger.es",
        "DistanceUnit": 0
    },
    "Connections": [
        {
            "ID": 166678,
            "ConnectionTypeID": 33,
            "StatusTypeID": 50,
            "LevelID": 3,
            "Amps": 125,
            "Voltage": 400,
            "PowerKW": 50,
            "CurrentTypeID": 30,
            "Quantity": 2
        },
        {
            "ID": 166679,
            "ConnectionTypeID": 2,
            "StatusTypeID": 50,
            "LevelID": 3,
            "Amps": 125,
            "Voltage": 400,
            "PowerKW": 50,
            "CurrentTypeID": 30,
            "Quantity": 2
        },
        {
            "ID": 166680,
            "ConnectionTypeID": 25,
            "StatusTypeID": 50,
            "LevelID": 3,
            "Amps": 63,
            "Voltage": 400,
            "PowerKW": 43,
            "CurrentTypeID": 20,
            "Quantity": 2
        },
        {
            "ID": 166681,
            "ConnectionTypeID": 25,
            "StatusTypeID": 50,
            "LevelID": 2,
            "Amps": 32,
            "Voltage": 230,
            "PowerKW": 22,
            "CurrentTypeID": 20,
            "Quantity": 2
        }
    ],
    "NumberOfPoints": 8,
    "StatusTypeID": 50,
    "DateLastStatusUpdate": "2019-07-24T10:55:00Z",
    "DataQualityLevel": 1,
    "DateCreated": "2019-03-02T12:06:00Z",
    "SubmissionStatusTypeID": 200
}