{
    "UserComments": [
        {
            "ID": 21983,
            "ChargePointID": 146226,
            "CommentTypeID": 10,
            "UserName": "Someone_Just_",
            "Rating": 4,
            "DateCreated": "2020-01-02T20:36:32.177Z",
            "User": {
                "ID": 1107,
                "Username": "Someone_Just_"
            },
            "CheckinStatusTypeID": 140,
            "IsActionedByEditor": false
        }
    ],
    "MediaItems": [
        {
            "ID": 20808,
            "ChargePointID": 146226,
            "ItemURL": "https://s3-ap-southeast-2.amazonaws.com/openchargemap/images/BE/OCM146226/OCM-146226.orig.2020010220384997.jpg",
            "ItemThumbnailURL": "https://s3-ap-southeast-2.amazonaws.com/openchargemap/images/BE/OCM146226/OCM-146226.thmb.2020010220384997.jpg",
            "Comment": "No markings ...",
            "IsEnabled": true,
            "IsVideo": false,
            "IsFeaturedItem": false,
            "IsExternalResource": false,
            "User": {
                "ID": 1107,
                "Username": "Someone_Just_"
            },
            "DateCreated": "2020-01-02T20:39:00Z"
        },
        {
            "ID": 20807,
            "ChargePointID": 146226,
            "ItemURL": "https://s3-ap-southeast-2.amazonaws.com/openchargemap/images/BE/OCM146226/OCM-146226.orig.2020010220380005.jpg",
            "ItemThumbnailURL": "https://s3-ap-southeast-2.amazonaws.com/openchargemap/images/BE/OCM146226/OCM-146226.thmb.2020010220380005.jpg",
            "Comment": "Instructions",
            "IsEnabled": true,
            "IsVideo": false,
            "IsFeaturedItem": false,
            "IsExternalResource": false,
            "User": {
                "ID": 1107,
                "Username": "Someone_Just_"
            },
            "DateCreated": "2020-01-02T20:38:00Z"
        }
    ],
    "IsRecentlyVerified": false,
    "ID": 146226,
    "UUID": "E5133981-EC42-46E4-B3E7-B76B23448AB9",
    "DataProviderID": 1,
    "OperatorID": 36,
    "UsageTypeID": 1,
    "AddressInfo": {
        "ID": 146578,
        "Title": "Parking Heilig-Hart kerk ",
        "AddressLine1": "Sint Huibrechtlei 5, 2930 Brasschaat",
        "Town": "Brasschaat",
        "Postcode": "2930",
        "CountryID": 26,
        "Latitude": 51.279790842918345,
        "Longitude": 4.453354347401728,
        "DistanceUnit": 0
    },
    "Connections": [
        {
            "ID": 203192,
            "ConnectionTypeID": 25,
            "StatusTypeID": 50,
            "LevelID": 2,
            "PowerKW": 22,
            "CurrentTypeID": 20,
            "Quantity": 2
        }
    ],
    "NumberOfPoints": 2,
    "StatusTypeID": 50,
    "DateLastStatusUpdate": "2020-01-03T14:45:00Z",
    "DataQualityLevel": 1,
    "DateCreated": "2020-01-02T20:35:00Z",
    "SubmissionStatusTypeID": 200
}