{
    "IsRecentlyVerified": false,
    "ID": 152761,
    "UUID": "E9C6C987-E392-44DD-B978-342807A216A7",
    "DataProviderID": 28,
    "DataProvidersReference": "",
    "UsageTypeID": 5,
    "AddressInfo": {
        "ID": 153114,
        "Title": "POCE SUR CISSE 1381 - Clos du Potager",
        "AddressLine1": "Parking - Clos du Potager - 37530 POCE SUR CISSE",
        "CountryID": 80,
        "Latitude": 47.443928,
        "Longitude": 0.990664,
        "AccessComments": "24/24 7/7",
        "DistanceUnit": 0
    },
    "Connections": [
        {
            "ID": 213996,
            "ConnectionTypeID": 28,
            "StatusTypeID": 50,
            "LevelID": 2,
            "PowerKW": 18,
            "CurrentTypeID": 10
        },
        {
            "ID": 213997,
            "ConnectionTypeID": 25,
            "StatusTypeID": 50,
            "LevelID": 2,
            "PowerKW": 18,
            "CurrentTypeID": 10
        }
    ],
    "GeneralComments": "www.virtaev.fr",
    "StatusTypeID": 50,
    "DateLastStatusUpdate": "2020-03-15T10:54:00Z",
    "DataQualityLevel": 2,
    "DateCreated": "2020-03-15T10:54:00Z",
    "SubmissionStatusTypeID": 100
}