{
    "IsRecentlyVerified": false,
    "ID": 116168,
    "UUID": "7C2FDED3-0288-4AED-8FF2-EF69F684DAFA",
    "DataProviderID": 2,
    "DataProvidersReference": "116743",
    "OperatorID": 59,
    "UsageTypeID": 1,
    "AddressInfo": {
        "ID": 116514,
        "Title": "Greenlots - 42027",
        "AddressLine1": "602 N. Havana",
        "Town": "Spokane Valley",
        "StateOrProvince": "WA",
        "Postcode": "99202",
        "CountryID": 2,
        "Latitude": 47.6626930236816,
        "Longitude": -117.346687316895,
        "ContactTelephone1": "855-900-7584",
        "AccessComments": "24 hours daily",
        "RelatedURL": "http://greenlots.com/",
        "DistanceUnit": 0
    },
    "Connections": [
        {
            "ID": 163239,
            "ConnectionTypeID": 1,
            "LevelID": 2,
            "Amps": 16,
            "Voltage": 230,
            "PowerKW": 3.7,
            "CurrentTypeID": 10,
            "Quantity": 2
        }
    ],
    "DateLastStatusUpdate": "2020-06-26T03:11:00Z",
    "DataQualityLevel": 3,
    "DateCreated": "2019-02-11T07:13:00Z",
    "SubmissionStatusTypeID": 100
}