{
    "IsRecentlyVerified": false,
    "ID": 154854,
    "UUID": "092537CC-8746-45AC-8CCB-64495EAFDBA2",
    "DataProviderID": 1,
    "OperatorID": 80,
    "UsageTypeID": 4,
    "AddressInfo": {
        "ID": 155207,
        "Title": "Torre Pali Litoranea | EnelX",
        "AddressLine1": "SP91 Via Litoranea",
        "AddressLine2": "Torre Pali",
        "Town": "Salve",
        "StateOrProvince": "LE",
        "Postcode": "73050 ",
        "CountryID": 112,
        "Latitude": 39.843989717933795,
        "Longitude": 18.211490125494038,
        "ContactTelephone1": "800.069.850",
        "RelatedURL": "https://www.enelx.com/it/it/emobility",
        "DistanceUnit": 0
    },
    "Connections": [
        {
            "ID": 217929,
            "ConnectionTypeID": 25,
            "StatusTypeID": 50,
            "LevelID": 2,
            "Amps": 32,
            "Voltage": 400,
            "PowerKW": 22,
            "CurrentTypeID": 20,
            "Quantity": 1
        },
        {
            "ID": 217930,
            "ConnectionTypeID": 36,
            "StatusTypeID": 50,
            "LevelID": 2,
            "Amps": 16,
            "Voltage": 240,
            "PowerKW": 3.7,
            "CurrentTypeID": 10,
            "Quantity": 1
        }
    ],
    "NumberOfPoints": 2,
    "StatusTypeID": 50,
    "DateLastStatusUpdate": "2020-03-20T18:07:00Z",
    "DataQualityLevel": 1,
    "DateCreated": "2020-03-20T18:07:00Z",
    "SubmissionStatusTypeID": 200
}