{
    "IsRecentlyVerified": false,
    "ID": 179972,
    "UUID": "7C64473B-9913-4D11-837D-946B4DA19633",
    "DataProviderID": 29,
    "DataProvidersReference": "13742",
    "OperatorID": 69,
    "AddressInfo": {
        "ID": 180331,
        "Title": "Johann-Sebastian-Bach-Straße 6",
        "AddressLine1": "Johann-Sebastian-Bach-Straße 6",
        "Town": "Fehrbellin",
        "Postcode": "16833",
        "CountryID": 87,
        "Latitude": 52.814602,
        "Longitude": 12.76641,
        "DistanceUnit": 0
    },
    "Connections": [
        {
            "ID": 282503,
            "ConnectionTypeID": 25,
            "StatusTypeID": 50,
            "LevelID": 2,
            "PowerKW": 22,
            "CurrentTypeID": 20
        },
        {
            "ID": 282504,
            "ConnectionTypeID": 25,
            "StatusTypeID": 50,
            "LevelID": 2,
            "PowerKW": 22,
            "CurrentTypeID": 20
        },
        {
            "ID": 282505,
            "ConnectionTypeID": 25,
            "StatusTypeID": 50,
            "LevelID": 2,
            "PowerKW": 22,
            "CurrentTypeID": 20
        },
        {
            "ID": 282506,
            "ConnectionTypeID": 25,
            "StatusTypeID": 50,
            "LevelID": 2,
            "PowerKW": 22,
            "CurrentTypeID": 20
        }
    ],
    "StatusTypeID": 50,
    "DateLastStatusUpdate": "2021-07-12T02:50:00Z",
    "MetadataValues": [
        {
            "ID": 12266,
            "MetadataFieldID": 4,
            "ItemValue": "Data from the German chargepoint registry provided by Bundesnetzagentur.de under the CC-BY 4.0 license"
        }
    ],
    "DataQualityLevel": 3,
    "DateCreated": "2021-07-08T10:00:00Z",
    "SubmissionStatusTypeID": 100
}