{
    "IsRecentlyVerified": false,
    "ID": 38972,
    "UUID": "222814FB-EA49-4FDB-AA20-7ADEC46C6E26",
    "DataProviderID": 26,
    "DataProvidersReference": "57311",
    "OperatorID": 157,
    "OperatorsReference": "NewMotion ICUEVE000510",
    "UsageCost": "0.00 jaarabonnement",
    "AddressInfo": {
        "ID": 39318,
        "Title": "Fahrenheitlaan 10-TR01",
        "AddressLine1": "Fahrenheitlaan 10-TR01",
        "Town": "Opsterland",
        "Postcode": "9207 HE",
        "CountryID": 159,
        "Latitude": 53.0979804992676,
        "Longitude": 6.12832307815552,
        "ContactTelephone1": "088 0109500",
        "RelatedURL": "http://thenewmotion.nl/",
        "DistanceUnit": 0
    },
    "Connections": [
        {
            "ID": 42483,
            "ConnectionTypeID": 25,
            "LevelID": 2,
            "PowerKW": 22,
            "CurrentTypeID": 10
        }
    ],
    "NumberOfPoints": 2,
    "StatusTypeID": 50,
    "DateLastStatusUpdate": "2016-06-04T02:56:00Z",
    "DataQualityLevel": 3,
    "DateCreated": "2015-01-09T06:08:00Z",
    "SubmissionStatusTypeID": 100
}