{
    "IsRecentlyVerified": false,
    "ID": 155253,
    "UUID": "3880D4C3-CA81-4980-9CDD-F860349A73BC",
    "DataProviderID": 1,
    "OperatorID": 103,
    "UsageTypeID": 4,
    "UsageCost": "€0,05/min, maximum of €5,00",
    "AddressInfo": {
        "ID": 155607,
        "Title": "Interparking Monnaie/Munt",
        "AddressLine1": "Place de la Monnaie - Muntplein",
        "Town": "Ville de Bruxelles - Stad Brussel",
        "StateOrProvince": "Brussels-Capital",
        "Postcode": "1000",
        "CountryID": 26,
        "Latitude": 50.8502638893992,
        "Longitude": 4.35352862433092,
        "DistanceUnit": 0
    },
    "Connections": [
        {
            "ID": 218550,
            "ConnectionTypeID": 25,
            "StatusTypeID": 50,
            "LevelID": 2,
            "Amps": 20,
            "Voltage": 240,
            "PowerKW": 14,
            "CurrentTypeID": 20,
            "Quantity": 2
        }
    ],
    "NumberOfPoints": 2,
    "GeneralComments": "Level -1, near entrance of parking",
    "StatusTypeID": 50,
    "DateLastStatusUpdate": "2020-04-03T16:03:00Z",
    "DataQualityLevel": 1,
    "DateCreated": "2020-04-03T09:14:00Z",
    "SubmissionStatusTypeID": 200
}