{
    "IsRecentlyVerified": false,
    "ID": 160238,
    "UUID": "B67D6569-8277-4347-B606-D66BE8EF7CB0",
    "DataProviderID": 2,
    "DataProvidersReference": "153736",
    "OperatorID": 39,
    "UsageTypeID": 1,
    "AddressInfo": {
        "ID": 160595,
        "Title": "So Roc on Maine location",
        "AddressLine1": "4850 Maine Ave SE",
        "Town": "Rochester",
        "StateOrProvince": "ME",
        "Postcode": "55904",
        "CountryID": 2,
        "Latitude": 43.9502936,
        "Longitude": -92.4600338,
        "ContactTelephone1": "800-663-5633",
        "AccessComments": "MO: Not Specified; TU: Not Specified; WE: Not Specified; TH: Not Specified; FR: Not Specified; SA: Not Specified; SU: Not Specified",
        "RelatedURL": "http://www.semacharge.com/",
        "DistanceUnit": 0
    },
    "Connections": [
        {
            "ID": 230542,
            "ConnectionTypeID": 1,
            "LevelID": 2,
            "Amps": 16,
            "Voltage": 230,
            "PowerKW": 3.7,
            "CurrentTypeID": 10,
            "Quantity": 2
        }
    ],
    "StatusTypeID": 50,
    "DateLastStatusUpdate": "2020-06-26T03:07:00Z",
    "DataQualityLevel": 3,
    "DateCreated": "2020-06-26T03:07:00Z",
    "SubmissionStatusTypeID": 100
}