{
    "IsRecentlyVerified": false,
    "ID": 182898,
    "UUID": "9943F8DC-38E8-49B5-AA1E-3918F8791D2B",
    "DataProviderID": 29,
    "DataProvidersReference": "20548",
    "OperatorID": 45,
    "AddressInfo": {
        "ID": 183257,
        "Title": "Petkumer Str. 223",
        "AddressLine1": "Petkumer Str. 223",
        "Town": "Emden",
        "Postcode": "26725",
        "CountryID": 87,
        "Latitude": 53.345904,
        "Longitude": 7.223654,
        "DistanceUnit": 0
    },
    "Connections": [
        {
            "ID": 289213,
            "ConnectionTypeID": 33,
            "StatusTypeID": 50,
            "LevelID": 3,
            "PowerKW": 22,
            "CurrentTypeID": 30
        },
        {
            "ID": 289214,
            "ConnectionTypeID": 25,
            "StatusTypeID": 50,
            "LevelID": 2,
            "PowerKW": 11,
            "CurrentTypeID": 20
        }
    ],
    "StatusTypeID": 50,
    "DateLastStatusUpdate": "2021-07-12T02:51:00Z",
    "MetadataValues": [
        {
            "ID": 15191,
            "MetadataFieldID": 4,
            "ItemValue": "Data from the German chargepoint registry provided by Bundesnetzagentur.de under the CC-BY 4.0 license"
        }
    ],
    "DataQualityLevel": 3,
    "DateCreated": "2021-07-08T10:03:00Z",
    "SubmissionStatusTypeID": 100
}