{
    "IsRecentlyVerified": false,
    "ID": 144011,
    "UUID": "907CA0BB-2584-4955-ADD1-C8CCE851C668",
    "DataProviderID": 2,
    "DataProvidersReference": "114633",
    "OperatorID": 23,
    "UsageTypeID": 1,
    "AddressInfo": {
        "ID": 144363,
        "Title": "Yodeler Motel - Tesla Destination",
        "AddressLine1": "601 S Broadway Ave",
        "Town": "Red Lodge",
        "StateOrProvince": "MT",
        "Postcode": "59068",
        "CountryID": 2,
        "Latitude": 45.180651,
        "Longitude": -109.247175,
        "ContactTelephone1": "406-446-1435  877-798-3752",
        "AccessComments": "24 hours daily; for customer use only; see front desk for access",
        "RelatedURL": "https://www.tesla.com/destination-charging",
        "DistanceUnit": 0
    },
    "Connections": [
        {
            "ID": 200465,
            "ConnectionTypeID": 30,
            "LevelID": 2,
            "Amps": 16,
            "Voltage": 230,
            "PowerKW": 3.7,
            "CurrentTypeID": 10,
            "Quantity": 4
        }
    ],
    "StatusTypeID": 50,
    "DateLastStatusUpdate": "2020-06-26T03:08:00Z",
    "DataQualityLevel": 3,
    "DateCreated": "2019-12-24T09:22:00Z",
    "SubmissionStatusTypeID": 100
}