{
    "IsRecentlyVerified": false,
    "ID": 91355,
    "UUID": "CF9672E9-A3AC-4220-ABEA-89A1864D9A73",
    "DataProviderID": 2,
    "DataProvidersReference": "86130",
    "UsageTypeID": 2,
    "AddressInfo": {
        "ID": 91701,
        "Title": "Duke Energy",
        "AddressLine1": "4800 Concord Rd",
        "Town": "York",
        "StateOrProvince": "SC",
        "Postcode": "29745",
        "CountryID": 2,
        "Latitude": 35.052307,
        "Longitude": -81.071097,
        "ContactTelephone1": "",
        "AccessComments": "Employee and fleet vehicle use only",
        "RelatedURL": "",
        "DistanceUnit": 0
    },
    "Connections": [
        {
            "ID": 129507,
            "ConnectionTypeID": 1,
            "LevelID": 2,
            "Amps": 16,
            "Voltage": 230,
            "PowerKW": 3,
            "CurrentTypeID": 10,
            "Quantity": 2
        }
    ],
    "DateLastStatusUpdate": "2019-04-06T04:02:00Z",
    "DataQualityLevel": 3,
    "DateCreated": "2017-08-03T12:25:00Z",
    "SubmissionStatusTypeID": 100
}