{
    "IsRecentlyVerified": false,
    "ID": 33516,
    "UUID": "14C7BB2A-A57B-42B9-B42C-EAE438180B0F",
    "DataProviderID": 26,
    "DataProvidersReference": "47381",
    "OperatorID": 178,
    "OperatorsReference": "EVnetNL AL539",
    "UsageCost": "0.00 jaarabonnement",
    "AddressInfo": {
        "ID": 33862,
        "Title": "Hoofdstraat 9",
        "AddressLine1": "Hoofdstraat 9",
        "Town": "Dongen",
        "Postcode": "5109 AA",
        "CountryID": 159,
        "Latitude": 51.657486,
        "Longitude": 4.940696,
        "ContactTelephone1": "0800-3522365",
        "RelatedURL": "http://www.evnet.nl",
        "DistanceUnit": 0
    },
    "Connections": [
        {
            "ID": 37027,
            "ConnectionTypeID": 25,
            "LevelID": 2,
            "PowerKW": 11,
            "CurrentTypeID": 10
        }
    ],
    "NumberOfPoints": 2,
    "StatusTypeID": 50,
    "DateLastStatusUpdate": "2016-06-04T02:39:00Z",
    "DataQualityLevel": 3,
    "DateCreated": "2015-01-09T06:04:00Z",
    "SubmissionStatusTypeID": 100
}