{
    "IsRecentlyVerified": false,
    "ID": 91995,
    "UUID": "9463EECA-ACC3-4733-914B-A3F6F6177C53",
    "DataProviderID": 1,
    "OperatorID": 198,
    "UsageTypeID": 1,
    "UsageCost": "DC 0,20/0,25 € / min, AC 0,04 € / min.",
    "AddressInfo": {
        "ID": 92341,
        "Title": "Jari-Pekka Hartola",
        "AddressLine1": "Yhdystie 2",
        "Town": "Hartola",
        "Postcode": "19600",
        "CountryID": 79,
        "Latitude": 61.5787274,
        "Longitude": 26.0083148,
        "ContactTelephone1": "0201557701",
        "AccessComments": "Charger behind a gas station with a restaurant, open 24 h.",
        "RelatedURL": "http://www.jari-pekka.fi/hartola/",
        "DistanceUnit": 0
    },
    "Connections": [
        {
            "ID": 130424,
            "ConnectionTypeID": 33,
            "StatusTypeID": 50,
            "LevelID": 3,
            "Amps": 125,
            "Voltage": 500,
            "PowerKW": 62.5,
            "CurrentTypeID": 30,
            "Quantity": 1
        },
        {
            "ID": 130425,
            "ConnectionTypeID": 2,
            "StatusTypeID": 50,
            "LevelID": 3,
            "Amps": 125,
            "Voltage": 500,
            "PowerKW": 62.5,
            "CurrentTypeID": 30,
            "Quantity": 1
        },
        {
            "ID": 130426,
            "ConnectionTypeID": 25,
            "StatusTypeID": 50,
            "LevelID": 2,
            "Amps": 32,
            "Voltage": 400,
            "PowerKW": 22.2,
            "CurrentTypeID": 20,
            "Quantity": 2
        }
    ],
    "NumberOfPoints": 3,
    "GeneralComments": "One DC charger with CCS and CHAdeMO cables, and two Mennekes (type 2) charge ports.",
    "StatusTypeID": 50,
    "DateLastStatusUpdate": "2017-08-23T22:23:00Z",
    "DataQualityLevel": 1,
    "DateCreated": "2017-08-22T19:38:00Z",
    "SubmissionStatusTypeID": 200
}