{
    "IsRecentlyVerified": false,
    "ID": 31144,
    "UUID": "7338A1BA-7CE2-4238-903D-49D0BF8DD265",
    "DataProviderID": 2,
    "DataProvidersReference": "64538",
    "UsageTypeID": 2,
    "AddressInfo": {
        "ID": 31490,
        "Title": "Westar Energy - Hutchinson Energy Center",
        "AddressLine1": "3200 E 30th",
        "Town": "Hutchinson",
        "StateOrProvince": "KS",
        "Postcode": "67502",
        "CountryID": 2,
        "Latitude": 38.0902,
        "Longitude": -97.871451,
        "ContactTelephone1": "",
        "AccessComments": "Fleet use only",
        "RelatedURL": "",
        "DistanceUnit": 0
    },
    "Connections": [
        {
            "ID": 34408,
            "ConnectionTypeID": 1,
            "LevelID": 2,
            "Amps": 16,
            "Voltage": 230,
            "PowerKW": 3,
            "CurrentTypeID": 10,
            "Quantity": 1
        }
    ],
    "DateLastStatusUpdate": "2019-04-06T04:02:00Z",
    "DataQualityLevel": 3,
    "DateCreated": "2014-12-11T07:11:00Z",
    "SubmissionStatusTypeID": 100
}