{
    "IsRecentlyVerified": false,
    "ID": 157829,
    "UUID": "5A636D5D-4843-4F19-8739-909736DC66D9",
    "DataProviderID": 18,
    "DataProvidersReference": "cde10036088c0b7354dcc9ae662f154d",
    "OperatorID": 8,
    "UsageTypeID": 4,
    "AddressInfo": {
        "ID": 158183,
        "Title": "Blackfen Road 12",
        "AddressLine1": "Blackfen Road 12",
        "Town": "Sidcup",
        "Postcode": "DA15 9LU",
        "CountryID": 1,
        "Latitude": 51.450371,
        "Longitude": 0.104195,
        "AccessComments": "",
        "RelatedURL": "https://www.bpchargemaster.com",
        "DistanceUnit": 0
    },
    "Connections": [
        {
            "ID": 227414,
            "ConnectionTypeID": 25,
            "Reference": "1",
            "StatusTypeID": 50,
            "LevelID": 2,
            "Amps": 32,
            "Voltage": 230,
            "PowerKW": 7,
            "CurrentTypeID": 10
        },
        {
            "ID": 227415,
            "ConnectionTypeID": 25,
            "Reference": "2",
            "StatusTypeID": 50,
            "LevelID": 2,
            "Amps": 32,
            "Voltage": 400,
            "PowerKW": 22,
            "CurrentTypeID": 20
        }
    ],
    "StatusTypeID": 0,
    "DateLastStatusUpdate": "2020-06-25T10:00:00Z",
    "MetadataValues": [
        {
            "ID": 7362,
            "MetadataFieldID": 4,
            "ItemValue": "Contains public sector information licensed under the Open Government Licence v2.0. http://www.nationalarchives.gov.uk/doc/open-government-licence/version/2/"
        }
    ],
    "DataQualityLevel": 3,
    "DateCreated": "2020-06-25T10:00:00Z",
    "SubmissionStatusTypeID": 100
}