{
    "IsRecentlyVerified": false,
    "ID": 166666,
    "UUID": "C45C2131-8E87-4F35-837D-F1B216E7D152",
    "DataProviderID": 28,
    "DataProvidersReference": "FR*S77*P77475A",
    "OperatorID": 3413,
    "UsageTypeID": 5,
    "AddressInfo": {
        "ID": 167025,
        "Title": "Trilport",
        "AddressLine1": "rue du Général de Gaulle",
        "CountryID": 80,
        "Latitude": 48.958482,
        "Longitude": 2.947197,
        "AccessComments": "",
        "DistanceUnit": 0
    },
    "Connections": [
        {
            "ID": 250590,
            "ConnectionTypeID": 28,
            "StatusTypeID": 50,
            "LevelID": 2,
            "PowerKW": 18,
            "CurrentTypeID": 10
        },
        {
            "ID": 250591,
            "ConnectionTypeID": 25,
            "StatusTypeID": 50,
            "LevelID": 2,
            "PowerKW": 18,
            "CurrentTypeID": 20
        },
        {
            "ID": 250592,
            "ConnectionTypeID": 28,
            "StatusTypeID": 50,
            "LevelID": 2,
            "PowerKW": 18,
            "CurrentTypeID": 10
        },
        {
            "ID": 250593,
            "ConnectionTypeID": 25,
            "StatusTypeID": 50,
            "LevelID": 2,
            "PowerKW": 18,
            "CurrentTypeID": 20
        }
    ],
    "GeneralComments": "badge, appli et QR code",
    "StatusTypeID": 50,
    "DateLastStatusUpdate": "2020-08-27T05:16:00Z",
    "DataQualityLevel": 2,
    "DateCreated": "2020-08-27T05:16:00Z",
    "SubmissionStatusTypeID": 100
}