{
    "IsRecentlyVerified": false,
    "ID": 140150,
    "UUID": "8612BD43-4907-433C-B0C3-49D8B085FB79",
    "DataProviderID": 2,
    "DataProvidersReference": "96344",
    "OperatorID": 9,
    "UsageTypeID": 1,
    "AddressInfo": {
        "ID": 140502,
        "Title": "Criminal Justice Center",
        "AddressLine1": "245 Washington Ave",
        "Town": "Memphis",
        "StateOrProvince": "TN",
        "Postcode": "38103",
        "CountryID": 2,
        "Latitude": 35.147539,
        "Longitude": -90.046249,
        "ContactTelephone1": "888-998-2546",
        "AccessComments": "MON: 24 hours | TUE: 24 hours | WED: 24 hours | THU: 24 hours | FRI: 24 hours | SAT: 24 hours | SUN: 24 hours",
        "RelatedURL": "http://www.blinkcharging.com/",
        "DistanceUnit": 0
    },
    "Connections": [
        {
            "ID": 195710,
            "ConnectionTypeID": 1,
            "LevelID": 2,
            "Amps": 16,
            "Voltage": 230,
            "PowerKW": 3.7,
            "CurrentTypeID": 10,
            "Quantity": 2
        }
    ],
    "StatusTypeID": 50,
    "DateLastStatusUpdate": "2020-06-26T02:57:00Z",
    "DataQualityLevel": 3,
    "DateCreated": "2019-12-24T09:12:00Z",
    "SubmissionStatusTypeID": 100
}