{
    "IsRecentlyVerified": false,
    "ID": 85180,
    "UUID": "A87CCFB4-7178-4C64-9559-41026DCB8525",
    "DataProviderID": 1,
    "OperatorID": 160,
    "UsageTypeID": 4,
    "AddressInfo": {
        "ID": 85526,
        "Title": "Sachsenpark ",
        "AddressLine1": "Handelsstraße 4",
        "Town": "Leipzig",
        "StateOrProvince": "Leipzig",
        "Postcode": "04356",
        "CountryID": 87,
        "Latitude": 51.400834897620875,
        "Longitude": 12.39976726812289,
        "AccessComments": "24/7 nutzbare Ladesäule steht auf dem Parkplatz von Bowl Play, die 1. Einfahrt rechts nach McDonalds und gleich wieder rechts.",
        "RelatedURL": "http://www.l.de/stadtwerke",
        "DistanceUnit": 0
    },
    "Connections": [
        {
            "ID": 120944,
            "ConnectionTypeID": 2,
            "StatusTypeID": 50,
            "LevelID": 3,
            "PowerKW": 20,
            "CurrentTypeID": 30,
            "Quantity": 1
        },
        {
            "ID": 120945,
            "ConnectionTypeID": 33,
            "StatusTypeID": 50,
            "LevelID": 3,
            "PowerKW": 20,
            "CurrentTypeID": 30,
            "Quantity": 1
        }
    ],
    "NumberOfPoints": 2,
    "StatusTypeID": 50,
    "DateLastStatusUpdate": "2017-03-27T07:18:00Z",
    "DataQualityLevel": 1,
    "DateCreated": "2017-03-27T07:18:00Z",
    "SubmissionStatusTypeID": 200
}