{
    "MediaItems": [
        {
            "ID": 27910,
            "ChargePointID": 175531,
            "ItemURL": "https://s3-ap-southeast-2.amazonaws.com/openchargemap/images/PL/OCM175531/OCM-175531.orig.2021052909010495.jpg",
            "ItemThumbnailURL": "https://s3-ap-southeast-2.amazonaws.com/openchargemap/images/PL/OCM175531/OCM-175531.thmb.2021052909010495.jpg",
            "Comment": "",
            "IsEnabled": true,
            "IsVideo": false,
            "IsFeaturedItem": false,
            "IsExternalResource": false,
            "User": {
                "ID": 31820,
                "Username": "Gandalf"
            },
            "DateCreated": "2021-05-29T09:01:00Z"
        }
    ],
    "IsRecentlyVerified": false,
    "ID": 175531,
    "UUID": "2A508006-2F72-440F-9E03-BC5FC98DFB28",
    "DataProviderID": 1,
    "OperatorID": 3451,
    "UsageTypeID": 4,
    "UsageCost": "AC/DC<= 25kW: 1,29PLN/kWh +0,05PLN/min po 180min, DC>25kW: 2,09PLN/kWh +0,40PLN/min po 60min",
    "AddressInfo": {
        "ID": 175890,
        "Title": "GreenWay Galeria Katowicka",
        "AddressLine1": "3 Maja 30",
        "Town": "Katowice",
        "Postcode": "40-097",
        "CountryID": 179,
        "Latitude": 50.25814278416246,
        "Longitude": 19.01668241458151,
        "ContactTelephone1": "+48583251077",
        "ContactTelephone2": "+48583251017",
        "AccessComments": "Poziom -3, Sektor F5",
        "RelatedURL": "https://galeriakatowicka.eu/parking/",
        "DistanceUnit": 0
    },
    "Connections": [
        {
            "ID": 272455,
            "ConnectionTypeID": 1036,
            "StatusTypeID": 50,
            "LevelID": 2,
            "PowerKW": 22,
            "CurrentTypeID": 20,
            "Quantity": 1
        },
        {
            "ID": 272456,
            "ConnectionTypeID": 33,
            "StatusTypeID": 50,
            "LevelID": 3,
            "PowerKW": 40,
            "CurrentTypeID": 30,
            "Quantity": 1
        },
        {
            "ID": 272457,
            "ConnectionTypeID": 2,
            "StatusTypeID": 50,
            "LevelID": 3,
            "PowerKW": 40,
            "CurrentTypeID": 30,
            "Quantity": 1
        }
    ],
    "NumberOfPoints": 3,
    "GeneralComments": "Parking 3PLN/h, darmowy przez pierwsze 2h w godzinach 7-22",
    "StatusTypeID": 50,
    "DateLastStatusUpdate": "2021-05-30T11:29:00Z",
    "DataQualityLevel": 1,
    "DateCreated": "2021-05-27T09:45:00Z",
    "SubmissionStatusTypeID": 200
}