{
    "UserComments": [
        {
            "ID": 13831,
            "ChargePointID": 70196,
            "CommentTypeID": 10,
            "UserName": "xester",
            "Rating": 4,
            "DateCreated": "2016-07-13T21:56:55.02Z",
            "User": {
                "ID": 6169,
                "Username": "xester"
            },
            "CheckinStatusTypeID": 10
        }
    ],
    "IsRecentlyVerified": false,
    "ID": 70196,
    "UUID": "7B3C5674-C7FA-475D-AD60-A47CFF8F3919",
    "DataProviderID": 1,
    "OperatorID": 212,
    "UsageTypeID": 4,
    "AddressInfo": {
        "ID": 70542,
        "Title": "Parking La Fira",
        "AddressLine1": "Avinguda de Sant Jordi 6",
        "Town": "Reus",
        "StateOrProvince": "Tarragona",
        "Postcode": "43201",
        "CountryID": 210,
        "Latitude": 41.161499,
        "Longitude": 1.110389,
        "ContactTelephone1": "+34 977 300 006",
        "ContactEmail": "amersam@amersam.com",
        "RelatedURL": "http://www.amersam.com",
        "DistanceUnit": 0
    },
    "Connections": [
        {
            "ID": 100222,
            "ConnectionTypeID": 25,
            "StatusTypeID": 50,
            "LevelID": 2,
            "Amps": 16,
            "Voltage": 230,
            "PowerKW": 3.6,
            "CurrentTypeID": 10,
            "Quantity": 1
        },
        {
            "ID": 100223,
            "ConnectionTypeID": 28,
            "StatusTypeID": 50,
            "LevelID": 2,
            "Amps": 16,
            "Voltage": 230,
            "PowerKW": 3.6,
            "CurrentTypeID": 10,
            "Quantity": 1
        },
        {
            "ID": 100224,
            "ConnectionTypeID": 25,
            "StatusTypeID": 50,
            "LevelID": 2,
            "Amps": 16,
            "Voltage": 230,
            "PowerKW": 3.6,
            "CurrentTypeID": 10,
            "Quantity": 1
        },
        {
            "ID": 100225,
            "ConnectionTypeID": 28,
            "StatusTypeID": 50,
            "LevelID": 2,
            "Amps": 16,
            "Voltage": 230,
            "PowerKW": 3.6,
            "CurrentTypeID": 10,
            "Quantity": 1
        }
    ],
    "NumberOfPoints": 2,
    "StatusTypeID": 50,
    "DateLastStatusUpdate": "2018-09-20T10:18:00Z",
    "DataQualityLevel": 1,
    "DateCreated": "2016-07-13T21:57:00Z",
    "SubmissionStatusTypeID": 200
}