{
    "IsRecentlyVerified": false,
    "ID": 134043,
    "UUID": "C1FE3363-6D0A-49F6-86EA-3BCC9B4AC48E",
    "DataProviderID": 1,
    "OperatorID": 1,
    "UsageTypeID": 6,
    "AddressInfo": {
        "ID": 134389,
        "Title": "Stansbury Parkway",
        "AddressLine1": "Stansbury Parkway",
        "Town": "Tooele County",
        "StateOrProvince": "Tooele County",
        "Postcode": "84704",
        "CountryID": 2,
        "Latitude": 40.6470496582587,
        "Longitude": -112.289097275616,
        "DistanceUnit": 0
    },
    "Connections": [
        {
            "ID": 187555,
            "ConnectionTypeID": 2,
            "StatusTypeID": 50,
            "LevelID": 3,
            "Quantity": 1
        },
        {
            "ID": 187556,
            "ConnectionTypeID": 32,
            "StatusTypeID": 50,
            "LevelID": 3,
            "Quantity": 1
        },
        {
            "ID": 187557,
            "ConnectionTypeID": 1,
            "StatusTypeID": 50,
            "LevelID": 2,
            "Quantity": 1
        }
    ],
    "NumberOfPoints": 2,
    "StatusTypeID": 50,
    "DateLastStatusUpdate": "2019-11-02T19:50:00Z",
    "DataQualityLevel": 1,
    "DateCreated": "2019-11-01T19:42:00Z",
    "SubmissionStatusTypeID": 200
}