{
    "IsRecentlyVerified": false,
    "ID": 143843,
    "UUID": "490F2FC3-F3F4-43D6-B859-BC9DC839C846",
    "DataProviderID": 2,
    "DataProvidersReference": "104719",
    "OperatorID": 5,
    "UsageTypeID": 1,
    "AddressInfo": {
        "ID": 144195,
        "Title": "B E CHARGERS",
        "AddressLine1": "BE11 95 Summit St",
        "Town": "Burlington",
        "StateOrProvince": "VT",
        "Postcode": "05401",
        "CountryID": 2,
        "Latitude": 44.4731812,
        "Longitude": -73.2029178,
        "ContactTelephone1": "888-758-4389",
        "AccessComments": "24 hours daily",
        "RelatedURL": "http://www.chargepoint.com/",
        "DistanceUnit": 0
    },
    "Connections": [
        {
            "ID": 200250,
            "ConnectionTypeID": 1,
            "LevelID": 2,
            "Amps": 16,
            "Voltage": 230,
            "PowerKW": 3.7,
            "CurrentTypeID": 10,
            "Quantity": 2
        }
    ],
    "StatusTypeID": 50,
    "DateLastStatusUpdate": "2020-06-26T03:08:00Z",
    "DataQualityLevel": 3,
    "DateCreated": "2019-12-24T09:22:00Z",
    "SubmissionStatusTypeID": 100
}