{
    "IsRecentlyVerified": false,
    "ID": 8219,
    "UUID": "7A679A40-CEF2-4088-8BA5-AE65FFD41395",
    "DataProviderID": 15,
    "DataProvidersReference": "7308",
    "OperatorID": 26,
    "AddressInfo": {
        "ID": 8116,
        "Title": "3707 Summerhill Rd",
        "AddressLine1": "3707 Summerhill Rd",
        "Town": "Texarkana",
        "StateOrProvince": "TX",
        "Postcode": "75503",
        "CountryID": 2,
        "Latitude": 33.45282,
        "Longitude": -94.0651,
        "ContactTelephone1": " (903) 793-5661",
        "RelatedURL": "http://carstations.com/7308",
        "DistanceUnit": 0
    },
    "Connections": [
        {
            "ID": 5648,
            "ConnectionTypeID": 1,
            "Reference": "J1772",
            "LevelID": 2
        }
    ],
    "StatusTypeID": 0,
    "DateLastStatusUpdate": "2017-11-04T14:04:00Z",
    "DataQualityLevel": 1,
    "DateCreated": "2011-11-11T12:06:00Z",
    "SubmissionStatusTypeID": 100
}