{
    "IsRecentlyVerified": false,
    "ID": 33884,
    "UUID": "8480C869-6AD3-450A-A6E7-150622A5C980",
    "DataProviderID": 26,
    "DataProvidersReference": "48050",
    "OperatorID": 178,
    "OperatorsReference": "EVnetNL DB0291",
    "UsageCost": "0.00 jaarabonnement",
    "AddressInfo": {
        "ID": 34230,
        "Title": "Nijverheidstraat 21b",
        "AddressLine1": "Nijverheidstraat 21b",
        "Town": "Nissewaard",
        "Postcode": "3214 CL",
        "CountryID": 159,
        "Latitude": 51.822241,
        "Longitude": 4.258237,
        "ContactTelephone1": "0800-3522365",
        "RelatedURL": "http://www.evnet.nl",
        "DistanceUnit": 0
    },
    "Connections": [
        {
            "ID": 37395,
            "ConnectionTypeID": 25,
            "LevelID": 2,
            "PowerKW": 11,
            "CurrentTypeID": 10
        }
    ],
    "NumberOfPoints": 2,
    "StatusTypeID": 50,
    "DateLastStatusUpdate": "2016-06-04T02:40:00Z",
    "DataQualityLevel": 3,
    "DateCreated": "2015-01-09T06:04:00Z",
    "SubmissionStatusTypeID": 100
}