{
    "IsRecentlyVerified": false,
    "ID": 149961,
    "UUID": "C8318402-8880-4E67-BD4C-1FE28BECE0DA",
    "DataProviderID": 1,
    "OperatorID": 80,
    "UsageTypeID": 4,
    "AddressInfo": {
        "ID": 150314,
        "Title": "Municipio di COSTABISSARA | ENELX",
        "AddressLine1": "Via Giuseppe Mazzini",
        "Town": "Costabissara",
        "StateOrProvince": "VI",
        "Postcode": "36030",
        "CountryID": 112,
        "Latitude": 45.58523600976949,
        "Longitude": 11.486385964065903,
        "RelatedURL": "https://www.enelx.com/it/it/emobility",
        "DistanceUnit": 0
    },
    "Connections": [
        {
            "ID": 208195,
            "ConnectionTypeID": 25,
            "StatusTypeID": 50,
            "LevelID": 2,
            "Amps": 32,
            "Voltage": 400,
            "PowerKW": 22,
            "CurrentTypeID": 20,
            "Quantity": 2
        }
    ],
    "NumberOfPoints": 2,
    "StatusTypeID": 50,
    "DateLastStatusUpdate": "2020-03-09T17:24:00Z",
    "DataQualityLevel": 1,
    "DateCreated": "2020-03-09T17:24:00Z",
    "SubmissionStatusTypeID": 200
}