{
    "IsRecentlyVerified": false,
    "ID": 143448,
    "UUID": "BEBA0E4F-751B-404F-BEF7-E3F2E6C1F738",
    "DataProviderID": 2,
    "DataProvidersReference": "123346",
    "UsageTypeID": 2,
    "AddressInfo": {
        "ID": 143800,
        "Title": "Verizon - Syracuse",
        "AddressLine1": "6360 Thompson Rd",
        "Town": "Syracuse",
        "StateOrProvince": "NY",
        "Postcode": "13206",
        "CountryID": 2,
        "Latitude": 43.078242,
        "Longitude": -76.088462,
        "ContactTelephone1": "",
        "AccessComments": "For employee use only",
        "RelatedURL": "",
        "DistanceUnit": 0
    },
    "Connections": [
        {
            "ID": 199769,
            "ConnectionTypeID": 1,
            "LevelID": 2,
            "Amps": 16,
            "Voltage": 230,
            "PowerKW": 3.7,
            "CurrentTypeID": 10,
            "Quantity": 4
        }
    ],
    "StatusTypeID": 50,
    "DateLastStatusUpdate": "2020-06-26T03:06:00Z",
    "DataQualityLevel": 3,
    "DateCreated": "2019-12-24T09:21:00Z",
    "SubmissionStatusTypeID": 100
}