{
    "UserComments": [
        {
            "ID": 24579,
            "ChargePointID": 127725,
            "CommentTypeID": 10,
            "UserName": "ForumElettrico.it",
            "Comment": "Siamo a circa 10 minuti dal mare, e nel mentre troviamo di tutto per passare il tempo della ricarica:  leggi la recensione completa qui >  https://www.forumelettrico.it/forum/colonnina-enel-x-20-kw-cervia-ra-largo-emilio-segre-pinarella-t19058.html",
            "RelatedURL": "https://www.forumelettrico.it/forum/colonnina-enel-x-20-kw-cervia-ra-largo-emilio-segre-pinarella-t19058.html",
            "DateCreated": "2021-07-11T16:07:11.263Z",
            "User": {
                "ID": 11749,
                "Username": "ForumElettrico.it"
            },
            "CheckinStatusTypeID": 10,
            "IsActionedByEditor": false
        }
    ],
    "MediaItems": [
        {
            "ID": 28556,
            "ChargePointID": 127725,
            "ItemURL": "https://s3-ap-southeast-2.amazonaws.com/openchargemap/images/IT/OCM127725/OCM-127725.orig.2021071116072923.jpg",
            "ItemThumbnailURL": "https://s3-ap-southeast-2.amazonaws.com/openchargemap/images/IT/OCM127725/OCM-127725.thmb.2021071116072923.jpg",
            "Comment": "",
            "IsEnabled": true,
            "IsVideo": false,
            "IsFeaturedItem": false,
            "IsExternalResource": false,
            "User": {
                "ID": 11749,
                "Username": "ForumElettrico.it"
            },
            "DateCreated": "2021-07-11T16:08:00Z"
        },
        {
            "ID": 28557,
            "ChargePointID": 127725,
            "ItemURL": "https://s3-ap-southeast-2.amazonaws.com/openchargemap/images/IT/OCM127725/OCM-127725.orig.2021071116073764.jpg",
            "ItemThumbnailURL": "https://s3-ap-southeast-2.amazonaws.com/openchargemap/images/IT/OCM127725/OCM-127725.thmb.2021071116073764.jpg",
            "Comment": "",
            "IsEnabled": true,
            "IsVideo": false,
            "IsFeaturedItem": false,
            "IsExternalResource": false,
            "User": {
                "ID": 11749,
                "Username": "ForumElettrico.it"
            },
            "DateCreated": "2021-07-11T16:08:00Z"
        },
        {
            "ID": 28558,
            "ChargePointID": 127725,
            "ItemURL": "https://s3-ap-southeast-2.amazonaws.com/openchargemap/images/IT/OCM127725/OCM-127725.orig.2021071116074517.jpg",
            "ItemThumbnailURL": "https://s3-ap-southeast-2.amazonaws.com/openchargemap/images/IT/OCM127725/OCM-127725.thmb.2021071116074517.jpg",
            "Comment": "",
            "IsEnabled": true,
            "IsVideo": false,
            "IsFeaturedItem": false,
            "IsExternalResource": false,
            "User": {
                "ID": 11749,
                "Username": "ForumElettrico.it"
            },
            "DateCreated": "2021-07-11T16:08:00Z"
        },
        {
            "ID": 28559,
            "ChargePointID": 127725,
            "ItemURL": "https://s3-ap-southeast-2.amazonaws.com/openchargemap/images/IT/OCM127725/OCM-127725.orig.2021071116075255.jpg",
            "ItemThumbnailURL": "https://s3-ap-southeast-2.amazonaws.com/openchargemap/images/IT/OCM127725/OCM-127725.thmb.2021071116075255.jpg",
            "Comment": "",
            "IsEnabled": true,
            "IsVideo": false,
            "IsFeaturedItem": false,
            "IsExternalResource": false,
            "User": {
                "ID": 11749,
                "Username": "ForumElettrico.it"
            },
            "DateCreated": "2021-07-11T16:08:00Z"
        },
        {
            "ID": 28555,
            "ChargePointID": 127725,
            "ItemURL": "https://s3-ap-southeast-2.amazonaws.com/openchargemap/images/IT/OCM127725/OCM-127725.orig.2021071116072249.jpg",
            "ItemThumbnailURL": "https://s3-ap-southeast-2.amazonaws.com/openchargemap/images/IT/OCM127725/OCM-127725.thmb.2021071116072249.jpg",
            "Comment": "",
            "IsEnabled": true,
            "IsVideo": false,
            "IsFeaturedItem": false,
            "IsExternalResource": false,
            "User": {
                "ID": 11749,
                "Username": "ForumElettrico.it"
            },
            "DateCreated": "2021-07-11T16:07:00Z"
        }
    ],
    "IsRecentlyVerified": false,
    "ID": 127725,
    "UUID": "0F4E7F55-B836-44D7-B3FF-FBC3203553A2",
    "DataProviderID": 1,
    "OperatorID": 80,
    "UsageTypeID": 4,
    "AddressInfo": {
        "ID": 128071,
        "Title": "Cervia Montale | EnelX",
        "AddressLine1": "Via Eugenio Montale",
        "Town": "Cervia",
        "StateOrProvince": "RA",
        "Postcode": "48015",
        "CountryID": 112,
        "Latitude": 44.24103026685577,
        "Longitude": 12.36433266352276,
        "ContactTelephone1": "800.069.850",
        "RelatedURL": "https://www.enelx.com/it/it/emobility",
        "DistanceUnit": 0
    },
    "Connections": [
        {
            "ID": 178805,
            "ConnectionTypeID": 25,
            "StatusTypeID": 50,
            "LevelID": 2,
            "Amps": 32,
            "Voltage": 400,
            "PowerKW": 22,
            "CurrentTypeID": 20,
            "Quantity": 2
        }
    ],
    "NumberOfPoints": 2,
    "StatusTypeID": 50,
    "DateLastStatusUpdate": "2021-07-11T16:08:00Z",
    "DataQualityLevel": 1,
    "DateCreated": "2019-06-10T16:09:00Z",
    "SubmissionStatusTypeID": 200
}