{
    "IsRecentlyVerified": false,
    "ID": 65183,
    "UUID": "6118A92D-A609-4C8B-B804-684B9F0286C1",
    "DataProviderID": 1,
    "OperatorID": 125,
    "UsageTypeID": 4,
    "AddressInfo": {
        "ID": 65529,
        "Title": "Kreisverwaltung ",
        "AddressLine1": "Putlitzer Straße 25",
        "Town": "Parchim",
        "StateOrProvince": "Landkreis Ludwigslust-Parchim",
        "Postcode": "19370",
        "CountryID": 87,
        "Latitude": 53.41888012296685,
        "Longitude": 11.841947523803693,
        "ContactTelephone1": "+49 3871 6235-0",
        "AccessComments": "24/7 nutzbar mit RWE Vertrag. ",
        "RelatedURL": "http://www.stadtwerke-parchim.de/",
        "DistanceUnit": 0
    },
    "Connections": [
        {
            "ID": 89736,
            "ConnectionTypeID": 25,
            "StatusTypeID": 50,
            "LevelID": 2,
            "Amps": 32,
            "Voltage": 400,
            "PowerKW": 22,
            "CurrentTypeID": 20,
            "Quantity": 2
        }
    ],
    "NumberOfPoints": 2,
    "GeneralComments": "Unklar ob öffentliche Ladestation oder nur für e-Carsharing.",
    "StatusTypeID": 50,
    "DateLastStatusUpdate": "2016-04-19T07:55:00Z",
    "DataQualityLevel": 1,
    "DateCreated": "2016-04-19T07:55:00Z",
    "SubmissionStatusTypeID": 200
}