{
    "IsRecentlyVerified": false,
    "ID": 100046,
    "UUID": "7473D534-D156-41AA-BF6F-9B1BB21794BD",
    "DataProviderID": 1,
    "OperatorID": 3272,
    "UsageTypeID": 4,
    "AddressInfo": {
        "ID": 100392,
        "Title": "Emotì Evpass Viale Verbano 45",
        "AddressLine1": "Viale Verbano 45",
        "AddressLine2": "Piazza Burbaglio",
        "Town": "Muralto",
        "StateOrProvince": "Distretto di Locarno",
        "Postcode": "6602",
        "CountryID": 217,
        "Latitude": 46.1714758312881,
        "Longitude": 8.80718715456703,
        "ContactTelephone1": "+41 91 946 39 28",
        "ContactTelephone2": "+41 58 221 96 60",
        "RelatedURL": "https://emoti.evpass.ch/",
        "DistanceUnit": 0
    },
    "Connections": [
        {
            "ID": 141320,
            "ConnectionTypeID": 1036,
            "StatusTypeID": 50,
            "LevelID": 2,
            "Amps": 32,
            "Voltage": 400,
            "PowerKW": 22,
            "CurrentTypeID": 20,
            "Quantity": 2
        },
        {
            "ID": 141321,
            "ConnectionTypeID": 1,
            "StatusTypeID": 50,
            "LevelID": 2,
            "Amps": 32,
            "Voltage": 240,
            "PowerKW": 7,
            "CurrentTypeID": 10,
            "Quantity": 2
        },
        {
            "ID": 141322,
            "ConnectionTypeID": 1037,
            "StatusTypeID": 50,
            "LevelID": 2,
            "Amps": 16,
            "Voltage": 240,
            "PowerKW": 3.7,
            "CurrentTypeID": 10,
            "Quantity": 2
        }
    ],
    "NumberOfPoints": 2,
    "StatusTypeID": 50,
    "DateLastStatusUpdate": "2018-02-10T11:56:00Z",
    "DataQualityLevel": 1,
    "DateCreated": "2018-02-09T17:04:00Z",
    "SubmissionStatusTypeID": 200
}