{
    "IsRecentlyVerified": false,
    "ID": 140195,
    "UUID": "B7A95737-7FB6-4C70-9065-2E4FEB4EA04F",
    "DataProviderID": 2,
    "DataProvidersReference": "150253",
    "OperatorID": 5,
    "UsageTypeID": 1,
    "AddressInfo": {
        "ID": 140547,
        "Title": "CHARLOTTE, NC",
        "AddressLine1": "5100 NC-16",
        "Town": "Charlotte",
        "StateOrProvince": "NC",
        "Postcode": "28216",
        "CountryID": 2,
        "Latitude": 35.280396,
        "Longitude": -80.889666,
        "ContactTelephone1": "888-758-4389",
        "AccessComments": "24 hours daily",
        "RelatedURL": "http://www.chargepoint.com/",
        "DistanceUnit": 0
    },
    "Connections": [
        {
            "ID": 195772,
            "ConnectionTypeID": 1,
            "LevelID": 2,
            "Amps": 16,
            "Voltage": 230,
            "PowerKW": 3,
            "CurrentTypeID": 10,
            "Quantity": 6
        }
    ],
    "StatusTypeID": 50,
    "DateLastStatusUpdate": "2019-12-24T09:12:00Z",
    "DataQualityLevel": 3,
    "DateCreated": "2019-12-24T09:12:00Z",
    "SubmissionStatusTypeID": 100
}