{
    "IsRecentlyVerified": false,
    "ID": 180233,
    "UUID": "A090B1C1-39BF-4D78-84C4-D8A87EA19264",
    "DataProviderID": 29,
    "DataProvidersReference": "4040",
    "AddressInfo": {
        "ID": 180592,
        "Title": "Zimmertal",
        "AddressLine1": "Zimmertal",
        "Town": "Plaue",
        "Postcode": "99338",
        "CountryID": 87,
        "Latitude": 50.780059,
        "Longitude": 10.899607,
        "DistanceUnit": 0
    },
    "Connections": [
        {
            "ID": 283050,
            "ConnectionTypeID": 25,
            "StatusTypeID": 50,
            "LevelID": 2,
            "PowerKW": 22,
            "CurrentTypeID": 20
        },
        {
            "ID": 283051,
            "ConnectionTypeID": 25,
            "StatusTypeID": 50,
            "LevelID": 2,
            "PowerKW": 22,
            "CurrentTypeID": 20
        }
    ],
    "StatusTypeID": 50,
    "DateLastStatusUpdate": "2021-07-12T02:45:00Z",
    "MetadataValues": [
        {
            "ID": 12527,
            "MetadataFieldID": 4,
            "ItemValue": "Data from the German chargepoint registry provided by Bundesnetzagentur.de under the CC-BY 4.0 license"
        }
    ],
    "DataQualityLevel": 3,
    "DateCreated": "2021-07-08T10:00:00Z",
    "SubmissionStatusTypeID": 100
}