{
    "IsRecentlyVerified": false,
    "ID": 176772,
    "UUID": "B308CFF6-AB91-4A23-9628-976AD894BE50",
    "DataProviderID": 29,
    "DataProvidersReference": "18205",
    "AddressInfo": {
        "ID": 177131,
        "Title": "Crailsheimstr. 13",
        "AddressLine1": "Crailsheimstr. 13",
        "Town": "Traunstein",
        "Postcode": "83278",
        "CountryID": 87,
        "Latitude": 47.867987,
        "Longitude": 12.639716,
        "DistanceUnit": 0
    },
    "Connections": [
        {
            "ID": 275067,
            "ConnectionTypeID": 25,
            "StatusTypeID": 50,
            "LevelID": 2,
            "PowerKW": 22,
            "CurrentTypeID": 20
        },
        {
            "ID": 275068,
            "ConnectionTypeID": 25,
            "StatusTypeID": 50,
            "LevelID": 2,
            "PowerKW": 22,
            "CurrentTypeID": 20
        }
    ],
    "StatusTypeID": 0,
    "DateLastStatusUpdate": "2021-07-09T03:10:00Z",
    "MetadataValues": [
        {
            "ID": 9067,
            "MetadataFieldID": 4,
            "ItemValue": "Data from the German chargepoint registry provided by Bundesnetzagentur.de under the CC-BY 4.0 license"
        }
    ],
    "DataQualityLevel": 3,
    "DateCreated": "2021-07-08T09:48:00Z",
    "SubmissionStatusTypeID": 100
}