{
    "IsRecentlyVerified": false,
    "ID": 183150,
    "UUID": "5D00E110-7D55-4A59-8A32-613A804E3168",
    "DataProviderID": 29,
    "DataProvidersReference": "9210",
    "OperatorID": 45,
    "AddressInfo": {
        "ID": 183509,
        "Title": "Friedrich-Ebert-Straße 55",
        "AddressLine1": "Friedrich-Ebert-Straße 55",
        "Town": "Seeheim",
        "Postcode": "64342",
        "CountryID": 87,
        "Latitude": 49.77437,
        "Longitude": 8.636492,
        "DistanceUnit": 0
    },
    "Connections": [
        {
            "ID": 289776,
            "ConnectionTypeID": 25,
            "StatusTypeID": 50,
            "LevelID": 3,
            "PowerKW": 50,
            "CurrentTypeID": 30
        },
        {
            "ID": 289777,
            "ConnectionTypeID": 33,
            "StatusTypeID": 50,
            "LevelID": 3,
            "PowerKW": 50,
            "CurrentTypeID": 30
        },
        {
            "ID": 297301,
            "ConnectionTypeID": 2,
            "StatusTypeID": 50,
            "LevelID": 3,
            "PowerKW": 50,
            "CurrentTypeID": 30
        }
    ],
    "StatusTypeID": 50,
    "DateLastStatusUpdate": "2021-07-12T02:43:00Z",
    "MetadataValues": [
        {
            "ID": 15443,
            "MetadataFieldID": 4,
            "ItemValue": "Data from the German chargepoint registry provided by Bundesnetzagentur.de under the CC-BY 4.0 license"
        }
    ],
    "DataQualityLevel": 3,
    "DateCreated": "2021-07-08T10:03:00Z",
    "SubmissionStatusTypeID": 100
}