{
    "MediaItems": [
        {
            "ID": 24996,
            "ChargePointID": 108319,
            "ItemURL": "https://s3-ap-southeast-2.amazonaws.com/openchargemap/images/HU/OCM108319/OCM-108319.orig.2020100813070487.jpg",
            "ItemThumbnailURL": "https://s3-ap-southeast-2.amazonaws.com/openchargemap/images/HU/OCM108319/OCM-108319.thmb.2020100813070487.jpg",
            "Comment": "",
            "IsEnabled": true,
            "IsVideo": false,
            "IsFeaturedItem": false,
            "IsExternalResource": false,
            "User": {
                "ID": 27440,
                "Username": "bivett"
            },
            "DateCreated": "2020-10-08T13:07:00Z"
        },
        {
            "ID": 24997,
            "ChargePointID": 108319,
            "ItemURL": "https://s3-ap-southeast-2.amazonaws.com/openchargemap/images/HU/OCM108319/OCM-108319.orig.2020100813071633.jpg",
            "ItemThumbnailURL": "https://s3-ap-southeast-2.amazonaws.com/openchargemap/images/HU/OCM108319/OCM-108319.thmb.2020100813071633.jpg",
            "Comment": "",
            "IsEnabled": true,
            "IsVideo": false,
            "IsFeaturedItem": false,
            "IsExternalResource": false,
            "User": {
                "ID": 27440,
                "Username": "bivett"
            },
            "DateCreated": "2020-10-08T13:07:00Z"
        }
    ],
    "IsRecentlyVerified": false,
    "ID": 108319,
    "UUID": "C9374841-21F9-4296-A3FA-95B730E6BEB5",
    "DataProviderID": 1,
    "OperatorID": 45,
    "UsageTypeID": 1,
    "UsageCost": "AC 22kW: 79huf/kWh AC 43 kW: 89huf/kWh+ after finished charging 50 Huf/min",
    "AddressInfo": {
        "ID": 108665,
        "Title": "TEA. Szekszárd (43kW AC fast charger)",
        "AddressLine1": "Szluha György utca 7.",
        "Town": "Szekszárd",
        "StateOrProvince": "Tolna megye",
        "Postcode": "7100",
        "CountryID": 104,
        "Latitude": 46.355179,
        "Longitude": 18.704952,
        "ContactTelephone1": "+36305509858",
        "RelatedURL": "http://www.teapont.hu",
        "DistanceUnit": 0
    },
    "Connections": [
        {
            "ID": 153130,
            "ConnectionTypeID": 1036,
            "StatusTypeID": 50,
            "LevelID": 3,
            "Amps": 63,
            "Voltage": 400,
            "PowerKW": 43,
            "CurrentTypeID": 20,
            "Quantity": 1
        },
        {
            "ID": 153131,
            "ConnectionTypeID": 25,
            "StatusTypeID": 50,
            "LevelID": 2,
            "Amps": 32,
            "Voltage": 400,
            "PowerKW": 22,
            "CurrentTypeID": 20,
            "Quantity": 1
        }
    ],
    "NumberOfPoints": 2,
    "GeneralComments": "Start charging with QR code  HELPDESK: help@teapont.hu +36305509858  WEB: www.teapont.hu",
    "StatusTypeID": 50,
    "DateLastStatusUpdate": "2021-04-10T10:57:00Z",
    "DataQualityLevel": 1,
    "DateCreated": "2018-09-21T16:40:00Z",
    "SubmissionStatusTypeID": 200
}