{
    "IsRecentlyVerified": false,
    "ID": 29437,
    "UUID": "E3A9D6FC-B0D2-4946-AF04-48CDFA4B6243",
    "DataProviderID": 2,
    "DataProvidersReference": "49759",
    "UsageTypeID": 2,
    "AddressInfo": {
        "ID": 29783,
        "Title": "City of Bellevue - Bellevue Service Center",
        "AddressLine1": "2901 115th Ave NE",
        "Town": "Bellevue",
        "StateOrProvince": "WA",
        "Postcode": "98004",
        "CountryID": 2,
        "Latitude": 47.63811493,
        "Longitude": -122.1882,
        "ContactTelephone1": "",
        "AccessComments": "Fleet vehicles and employee use only",
        "RelatedURL": "",
        "DistanceUnit": 0
    },
    "Connections": [
        {
            "ID": 32374,
            "ConnectionTypeID": 1,
            "LevelID": 2,
            "Amps": 16,
            "Voltage": 230,
            "PowerKW": 3.7,
            "CurrentTypeID": 10,
            "Quantity": 1
        }
    ],
    "DateLastStatusUpdate": "2020-06-26T03:11:00Z",
    "DataQualityLevel": 3,
    "DateCreated": "2014-11-28T03:39:00Z",
    "SubmissionStatusTypeID": 100
}