{
    "IsRecentlyVerified": false,
    "ID": 71864,
    "UUID": "DED9CC41-F432-41A7-87C5-234D87ED7738",
    "DataProviderID": 1,
    "OperatorID": 45,
    "UsageTypeID": 6,
    "AddressInfo": {
        "ID": 72210,
        "Title": " Berghotel",
        "AddressLine1": "Via Monte Elmo, 10",
        "Town": "Sesto",
        "StateOrProvince": "BZ",
        "Postcode": "39030",
        "CountryID": 112,
        "Latitude": 46.692028303523486,
        "Longitude": 12.367195042382848,
        "ContactTelephone1": "0039 0474 710386",
        "ContactEmail": "info@berghotel.com",
        "RelatedURL": "http://www.berghotel.com",
        "DistanceUnit": 0
    },
    "Connections": [
        {
            "ID": 102975,
            "ConnectionTypeID": 1036,
            "StatusTypeID": 50,
            "LevelID": 2,
            "Amps": 16,
            "Voltage": 400,
            "PowerKW": 11,
            "CurrentTypeID": 20,
            "Quantity": 1
        }
    ],
    "NumberOfPoints": 1,
    "GeneralComments": "Tesla Destination Charger",
    "StatusTypeID": 50,
    "DateLastStatusUpdate": "2016-09-19T15:36:00Z",
    "DataQualityLevel": 1,
    "DateCreated": "2016-09-19T15:36:00Z",
    "SubmissionStatusTypeID": 200
}