{
    "IsRecentlyVerified": false,
    "ID": 167704,
    "UUID": "4DF9CB60-D981-4F1D-89DE-671B09AD302F",
    "DataProviderID": 1,
    "OperatorID": 125,
    "UsageTypeID": 1,
    "UsageCost": "Free of charge",
    "AddressInfo": {
        "ID": 168063,
        "Title": "Bauamt",
        "AddressLine1": "Bauamt",
        "Town": "Sinzig",
        "StateOrProvince": "Rhineland-Palatinate",
        "Postcode": "53489",
        "CountryID": 87,
        "Latitude": 50.54549460254205,
        "Longitude": 7.251460562520833,
        "AccessComments": "ro the eight of rhe town hall. You may dirve across the square, and the around the back of the town hall. ",
        "DistanceUnit": 0
    },
    "Connections": [
        {
            "ID": 254649,
            "ConnectionTypeID": 25,
            "StatusTypeID": 50,
            "LevelID": 2,
            "Amps": 32,
            "Voltage": 400,
            "PowerKW": 22,
            "CurrentTypeID": 20,
            "Quantity": 2
        }
    ],
    "NumberOfPoints": 2,
    "StatusTypeID": 50,
    "DateLastStatusUpdate": "2020-09-13T13:38:00Z",
    "DataQualityLevel": 1,
    "DateCreated": "2020-09-10T13:32:00Z",
    "SubmissionStatusTypeID": 200
}