{
    "IsRecentlyVerified": false,
    "ID": 17961,
    "UUID": "1F0EC3D4-3E7F-4BA2-9D93-52F02A5360F0",
    "DataProviderID": 22,
    "DataProvidersReference": "57574E4F5E30961F96C7E320BF15A5DD",
    "AddressInfo": {
        "ID": 18306,
        "Title": "三菱自動車工業水島製作所",
        "AddressLine1": "岡山県倉敷市水島海岸通1-1",
        "CountryID": 114,
        "Latitude": 34.52558676,
        "Longitude": 133.7325393,
        "ContactTelephone1": "086-444-4114",
        "DistanceUnit": 0
    },
    "Connections": [
        {
            "ID": 18202,
            "ConnectionTypeID": 2,
            "LevelID": 2,
            "Amps": 100,
            "Voltage": 480,
            "PowerKW": 48,
            "Quantity": 1
        }
    ],
    "DateLastStatusUpdate": "2013-06-29T09:05:00Z",
    "DataQualityLevel": 2,
    "DateCreated": "2013-06-29T09:05:00Z",
    "SubmissionStatusTypeID": 200
}