{
    "IsRecentlyVerified": false,
    "ID": 176375,
    "UUID": "1DE46763-54E1-4C2B-B410-96E7152A750F",
    "DataProviderID": 29,
    "DataProvidersReference": "17262",
    "AddressInfo": {
        "ID": 176734,
        "Title": "Schöttlkarstraße 10",
        "AddressLine1": "Schöttlkarstraße 10",
        "Town": "Mittenwald",
        "Postcode": "82481",
        "CountryID": 87,
        "Latitude": 47.44419,
        "Longitude": 11.26467,
        "DistanceUnit": 0
    },
    "Connections": [
        {
            "ID": 274208,
            "ConnectionTypeID": 25,
            "StatusTypeID": 50,
            "LevelID": 2,
            "PowerKW": 22,
            "CurrentTypeID": 20
        },
        {
            "ID": 274209,
            "ConnectionTypeID": 25,
            "StatusTypeID": 50,
            "LevelID": 2,
            "PowerKW": 22,
            "CurrentTypeID": 20
        }
    ],
    "StatusTypeID": 0,
    "DateLastStatusUpdate": "2021-07-09T03:10:00Z",
    "MetadataValues": [
        {
            "ID": 8670,
            "MetadataFieldID": 4,
            "ItemValue": "Data from the German chargepoint registry provided by Bundesnetzagentur.de under the CC-BY 4.0 license"
        }
    ],
    "DataQualityLevel": 3,
    "DateCreated": "2021-07-08T09:48:00Z",
    "SubmissionStatusTypeID": 100
}