{
    "IsRecentlyVerified": false,
    "ID": 101705,
    "UUID": "736DAA6F-04A0-4C7F-A83F-19DCDC23F976",
    "DataProviderID": 1,
    "OperatorID": 125,
    "UsageTypeID": 4,
    "AddressInfo": {
        "ID": 102051,
        "Title": "Universitätsallee",
        "AddressLine1": "Universitätsallee 1",
        "Town": "Bremen",
        "StateOrProvince": "Bremen",
        "Postcode": "28359",
        "CountryID": 87,
        "Latitude": 53.104420003971065,
        "Longitude": 8.852372469975307,
        "AccessComments": "24/7 open",
        "DistanceUnit": 0
    },
    "Connections": [
        {
            "ID": 143567,
            "ConnectionTypeID": 25,
            "StatusTypeID": 50,
            "LevelID": 2,
            "Amps": 32,
            "Voltage": 400,
            "PowerKW": 22,
            "CurrentTypeID": 20,
            "Quantity": 2
        }
    ],
    "NumberOfPoints": 2,
    "StatusTypeID": 50,
    "DateLastStatusUpdate": "2018-04-05T06:47:00Z",
    "DataQualityLevel": 1,
    "DateCreated": "2018-04-05T06:47:00Z",
    "SubmissionStatusTypeID": 200
}