{
    "IsRecentlyVerified": false,
    "ID": 46803,
    "UUID": "538BDEE6-23A1-41AC-971C-EBD81BBB299F",
    "DataProviderID": 1,
    "OperatorID": 189,
    "UsageTypeID": 4,
    "AddressInfo": {
        "ID": 47149,
        "Title": "E-Wald Ladesäule in Tittling",
        "AddressLine1": "Parkplatz Kirchweg",
        "Town": "Tittling",
        "Postcode": "94104",
        "CountryID": 87,
        "Latitude": 48.728970483805,
        "Longitude": 13.3781497027527,
        "DistanceUnit": 0
    },
    "Connections": [
        {
            "ID": 57527,
            "ConnectionTypeID": 25,
            "StatusTypeID": 50,
            "LevelID": 2,
            "Amps": 32,
            "Voltage": 400,
            "PowerKW": 22,
            "CurrentTypeID": 20,
            "Quantity": 2
        },
        {
            "ID": 57528,
            "ConnectionTypeID": 28,
            "StatusTypeID": 50,
            "LevelID": 2,
            "Amps": 16,
            "Voltage": 230,
            "PowerKW": 3.7,
            "CurrentTypeID": 10,
            "Quantity": 2
        }
    ],
    "NumberOfPoints": 2,
    "StatusTypeID": 50,
    "DateLastStatusUpdate": "2015-05-08T07:41:00Z",
    "DataQualityLevel": 1,
    "DateCreated": "2015-05-07T16:31:00Z",
    "SubmissionStatusTypeID": 200
}