{
    "IsRecentlyVerified": false,
    "ID": 49020,
    "UUID": "E78D1463-FC8A-43FC-BA21-BA9A32AA161F",
    "DataProviderID": 1,
    "OperatorID": 195,
    "UsageTypeID": 1,
    "AddressInfo": {
        "ID": 49366,
        "Title": "Nappenplatz",
        "AddressLine1": "Nappenplatz",
        "Town": "Bad Salzungen",
        "StateOrProvince": "Bad Salzungen",
        "Postcode": "36433",
        "CountryID": 87,
        "Latitude": 50.81419016846937,
        "Longitude": 10.236328806676518,
        "AccessComments": "Blaue Ladesäule mit Schild \"Werraenergie\" auf dem Parkplatz, der ausschließlich für Elektrofahrzeuge reserviert ist. 24/7 geöffnet.",
        "RelatedURL": "https://www.werraenergie.de/privatkunden/unternehmen/e-mobilitat.html?OpenDocument&Curren",
        "DistanceUnit": 0
    },
    "Connections": [
        {
            "ID": 60584,
            "ConnectionTypeID": 25,
            "StatusTypeID": 50,
            "LevelID": 2,
            "Amps": 32,
            "Voltage": 400,
            "PowerKW": 22,
            "CurrentTypeID": 20,
            "Quantity": 1
        },
        {
            "ID": 60585,
            "ConnectionTypeID": 28,
            "StatusTypeID": 50,
            "LevelID": 2,
            "Amps": 16,
            "Voltage": 230,
            "PowerKW": 3.7,
            "CurrentTypeID": 10,
            "Quantity": 1
        }
    ],
    "NumberOfPoints": 2,
    "StatusTypeID": 50,
    "DateLastStatusUpdate": "2017-02-19T13:26:00Z",
    "DataQualityLevel": 1,
    "DateCreated": "2015-07-08T09:40:00Z",
    "SubmissionStatusTypeID": 200
}