{
    "IsRecentlyVerified": false,
    "ID": 186477,
    "UUID": "67DE678D-59A1-4828-B87C-EAC2D47E9577",
    "DataProviderID": 29,
    "DataProvidersReference": "7506",
    "OperatorID": 45,
    "AddressInfo": {
        "ID": 186836,
        "Title": "Am Ankerglasplatz 8",
        "AddressLine1": "Am Ankerglasplatz 8",
        "Town": "Bernsdorf",
        "Postcode": "02994",
        "CountryID": 87,
        "Latitude": 51.37539,
        "Longitude": 14.06989,
        "DistanceUnit": 0
    },
    "Connections": [
        {
            "ID": 299246,
            "ConnectionTypeID": 25,
            "StatusTypeID": 50,
            "LevelID": 2,
            "PowerKW": 22,
            "CurrentTypeID": 20
        },
        {
            "ID": 299247,
            "ConnectionTypeID": 25,
            "StatusTypeID": 50,
            "LevelID": 2,
            "PowerKW": 22,
            "CurrentTypeID": 20
        }
    ],
    "StatusTypeID": 50,
    "DateLastStatusUpdate": "2021-07-12T02:47:00Z",
    "MetadataValues": [
        {
            "ID": 18718,
            "MetadataFieldID": 4,
            "ItemValue": "Data from the German chargepoint registry provided by Bundesnetzagentur.de under the CC-BY 4.0 license"
        }
    ],
    "DataQualityLevel": 3,
    "DateCreated": "2021-07-12T02:47:00Z",
    "SubmissionStatusTypeID": 100
}