{
    "IsRecentlyVerified": false,
    "ID": 184471,
    "UUID": "773EADC5-B4A7-4047-AE2A-375D57D44B80",
    "DataProviderID": 29,
    "DataProvidersReference": "12315",
    "OperatorID": 3297,
    "AddressInfo": {
        "ID": 184830,
        "Title": "Robert-Bosch-Str. 7",
        "AddressLine1": "Robert-Bosch-Str. 7",
        "Town": "Darmstadt",
        "Postcode": "64293",
        "CountryID": 87,
        "Latitude": 49.87143,
        "Longitude": 8.625534,
        "DistanceUnit": 0
    },
    "Connections": [
        {
            "ID": 292801,
            "ConnectionTypeID": 25,
            "StatusTypeID": 50,
            "LevelID": 2,
            "PowerKW": 22,
            "CurrentTypeID": 20
        },
        {
            "ID": 292802,
            "ConnectionTypeID": 25,
            "StatusTypeID": 50,
            "LevelID": 2,
            "PowerKW": 22,
            "CurrentTypeID": 20
        }
    ],
    "StatusTypeID": 50,
    "DateLastStatusUpdate": "2021-07-12T02:44:00Z",
    "MetadataValues": [
        {
            "ID": 16762,
            "MetadataFieldID": 4,
            "ItemValue": "Data from the German chargepoint registry provided by Bundesnetzagentur.de under the CC-BY 4.0 license"
        }
    ],
    "DataQualityLevel": 3,
    "DateCreated": "2021-07-08T10:05:00Z",
    "SubmissionStatusTypeID": 100
}