{
    "UserComments": [
        {
            "ID": 21484,
            "ChargePointID": 131563,
            "CommentTypeID": 10,
            "UserName": "i3_REx",
            "Comment": "No marked bays. Might be a squeeze for access if the car park is full. ",
            "Rating": 4,
            "DateCreated": "2019-09-09T13:39:04.16Z",
            "User": {
                "ID": 22202,
                "Username": "i3_REx"
            },
            "CheckinStatusTypeID": 10
        }
    ],
    "MediaItems": [
        {
            "ID": 19534,
            "ChargePointID": 131563,
            "ItemURL": "https://s3-ap-southeast-2.amazonaws.com/openchargemap/images/AU/OCM131563/OCM-131563.orig.2019091000485910.png",
            "ItemThumbnailURL": "https://s3-ap-southeast-2.amazonaws.com/openchargemap/images/AU/OCM131563/OCM-131563.thmb.2019091000485910.png",
            "Comment": "BYO Type 2 cable",
            "IsEnabled": true,
            "IsVideo": false,
            "IsFeaturedItem": false,
            "IsExternalResource": false,
            "User": {
                "ID": 22202,
                "Username": "i3_REx"
            },
            "DateCreated": "2019-09-10T00:49:00Z"
        }
    ],
    "IsRecentlyVerified": false,
    "ID": 131563,
    "UUID": "DB56D948-7C13-4813-89D5-69D84D034E0D",
    "DataProviderID": 1,
    "OperatorID": 45,
    "UsageTypeID": 1,
    "UsageCost": "Free",
    "AddressInfo": {
        "ID": 131909,
        "Title": "Jax EV @ Warrawong Plaza",
        "AddressLine1": "Corner King St & Cowper Street",
        "Town": "Warrawong",
        "StateOrProvince": "New South Wales",
        "Postcode": "2502",
        "CountryID": 18,
        "Latitude": -34.4868830425302,
        "Longitude": 150.890772967401,
        "AccessComments": "Western wall of JAX Tyres on the rooftop car park ",
        "DistanceUnit": 0
    },
    "Connections": [
        {
            "ID": 184137,
            "ConnectionTypeID": 25,
            "StatusTypeID": 50,
            "LevelID": 2,
            "Amps": 32,
            "PowerKW": 22,
            "CurrentTypeID": 20,
            "Quantity": 2
        }
    ],
    "NumberOfPoints": 2,
    "StatusTypeID": 50,
    "DateLastStatusUpdate": "2020-12-15T14:49:00Z",
    "DataQualityLevel": 1,
    "DateCreated": "2019-09-09T13:11:00Z",
    "SubmissionStatusTypeID": 200
}