{
    "IsRecentlyVerified": false,
    "ID": 179245,
    "UUID": "147E4B45-1E72-446F-B5AD-73DDB536064D",
    "DataProviderID": 29,
    "DataProvidersReference": "6026",
    "AddressInfo": {
        "ID": 179604,
        "Title": "Rothermundstraße 1b",
        "AddressLine1": "Rothermundstraße 1b",
        "Town": "Dresden",
        "Postcode": "01277",
        "CountryID": 87,
        "Latitude": 51.033222,
        "Longitude": 13.78316,
        "DistanceUnit": 0
    },
    "Connections": [
        {
            "ID": 280790,
            "ConnectionTypeID": 25,
            "StatusTypeID": 50,
            "LevelID": 2,
            "PowerKW": 22,
            "CurrentTypeID": 20
        },
        {
            "ID": 280791,
            "ConnectionTypeID": 25,
            "StatusTypeID": 50,
            "LevelID": 2,
            "PowerKW": 22,
            "CurrentTypeID": 20
        }
    ],
    "StatusTypeID": 50,
    "DateLastStatusUpdate": "2021-07-12T02:46:00Z",
    "MetadataValues": [
        {
            "ID": 11539,
            "MetadataFieldID": 4,
            "ItemValue": "Data from the German chargepoint registry provided by Bundesnetzagentur.de under the CC-BY 4.0 license"
        }
    ],
    "DataQualityLevel": 3,
    "DateCreated": "2021-07-08T09:59:00Z",
    "SubmissionStatusTypeID": 100
}