{
    "IsRecentlyVerified": false,
    "ID": 158455,
    "UUID": "9EB6F4BB-F3E7-44FD-941B-2674EFDCF072",
    "DataProviderID": 2,
    "DataProvidersReference": "151050",
    "OperatorID": 3293,
    "UsageTypeID": 1,
    "AddressInfo": {
        "ID": 158812,
        "Title": "Plaza Paseo Real",
        "AddressLine1": "6941- 6985 El Camino Real",
        "Town": "Carlsbad",
        "StateOrProvince": "CA",
        "Postcode": "92009",
        "CountryID": 2,
        "Latitude": 33.104661,
        "Longitude": -117.268415,
        "ContactTelephone1": "888-264-2208",
        "AccessComments": "6am-12am daily",
        "RelatedURL": "https://voltacharging.com/",
        "DistanceUnit": 0
    },
    "Connections": [
        {
            "ID": 228439,
            "ConnectionTypeID": 1,
            "LevelID": 2,
            "Amps": 16,
            "Voltage": 230,
            "PowerKW": 3.7,
            "CurrentTypeID": 10,
            "Quantity": 2
        }
    ],
    "StatusTypeID": 50,
    "DateLastStatusUpdate": "2020-06-26T02:55:00Z",
    "DataQualityLevel": 3,
    "DateCreated": "2020-06-26T02:55:00Z",
    "SubmissionStatusTypeID": 100
}