{
    "IsRecentlyVerified": false,
    "ID": 129305,
    "UUID": "7AB84A2C-73E4-40B9-892E-4B9A1F49EEDD",
    "DataProviderID": 1,
    "OperatorID": 80,
    "UsageTypeID": 4,
    "AddressInfo": {
        "ID": 129651,
        "Title": "Oristano Campanelli | EnelX",
        "AddressLine1": "Via Ernesto Campanelli",
        "Town": "Oristano",
        "StateOrProvince": "OR",
        "Postcode": "09170",
        "CountryID": 112,
        "Latitude": 39.91082552614816,
        "Longitude": 8.584428765098437,
        "RelatedURL": "https://www.enelx.com/it/it/emobility",
        "DistanceUnit": 0
    },
    "Connections": [
        {
            "ID": 180970,
            "ConnectionTypeID": 25,
            "StatusTypeID": 50,
            "LevelID": 2,
            "Amps": 32,
            "Voltage": 400,
            "PowerKW": 22,
            "CurrentTypeID": 20,
            "Quantity": 4
        }
    ],
    "NumberOfPoints": 4,
    "StatusTypeID": 50,
    "DateLastStatusUpdate": "2019-07-16T14:55:00Z",
    "DataQualityLevel": 1,
    "DateCreated": "2019-07-16T14:55:00Z",
    "SubmissionStatusTypeID": 200
}