{
    "UserComments": [
        {
            "ID": 771,
            "ChargePointID": 13169,
            "CommentTypeID": 10,
            "UserName": "rosemarylaw23",
            "Comment": "",
            "DateCreated": "2014-04-25T19:17:02.063Z",
            "User": {
                "ID": 1825,
                "Username": "rosemarylaw23"
            },
            "CheckinStatusTypeID": 10
        }
    ],
    "IsRecentlyVerified": false,
    "ID": 13169,
    "UUID": "14399FD9-9E84-4F9C-9730-23EC4062C53F",
    "DataProviderID": 1,
    "OperatorID": 93,
    "OperatorsReference": "SC23",
    "UsageTypeID": 4,
    "AddressInfo": {
        "ID": 13066,
        "Title": "On-street charging point on Little Donegall Street, usual parking restrictions and charges apply",
        "AddressLine1": "128 Little Donegall Street, Belfast BT1, UK",
        "Town": "Belfast",
        "Postcode": "BT1 2JD",
        "CountryID": 1,
        "Latitude": 54.604646,
        "Longitude": -5.931866,
        "AccessComments": "On-street charging point on Little Donegall Street, usual parking restrictions and charges apply (Socket 2)",
        "DistanceUnit": 0
    },
    "Connections": [
        {
            "ID": 10588,
            "ConnectionTypeID": 25,
            "StatusTypeID": 50,
            "LevelID": 2,
            "Amps": 32,
            "Voltage": 400,
            "PowerKW": 22,
            "CurrentTypeID": 20,
            "Quantity": 2
        }
    ],
    "NumberOfPoints": 2,
    "StatusTypeID": 50,
    "DateLastStatusUpdate": "2019-06-23T05:37:00Z",
    "DataQualityLevel": 3,
    "DateCreated": "2012-09-08T22:19:00Z",
    "SubmissionStatusTypeID": 100
}