{
    "IsRecentlyVerified": false,
    "ID": 42457,
    "UUID": "54F52BB4-2D51-415F-BA73-C6043EED7ED4",
    "DataProviderID": 1,
    "OperatorID": 167,
    "UsageTypeID": 7,
    "UsageCost": "0",
    "AddressInfo": {
        "ID": 42803,
        "Title": "Autohaus in der Südstadt GmbH",
        "AddressLine1": "Ohsener Straße 65",
        "AddressLine2": "",
        "Town": "Hameln",
        "StateOrProvince": "Landkreis Hameln-Pyrmont",
        "Postcode": "31789",
        "CountryID": 87,
        "Latitude": 52.0959491733174,
        "Longitude": 9.36953756018535,
        "ContactTelephone1": "05151 7041 ",
        "ContactTelephone2": "",
        "ContactEmail": "",
        "AccessComments": "Nissan Autohaus nimmt am \"Freistrom für Alle\" Programm teil, siehe Webseite.  Geöffnet von Mo.-Fr. 7:45 bis 18.00 Uhr, Sa 9-13Uhr. Ladeplatz an der Werkstatt.",
        "RelatedURL": "http://www.nissan.de/DE/de/vehicle/electric-vehicles/leaf/charging-and-battery/freistrom-info.html",
        "DistanceUnit": 0
    },
    "Connections": [
        {
            "ID": 51114,
            "ConnectionTypeID": 28,
            "StatusTypeID": 50,
            "LevelID": 2,
            "Amps": 12,
            "Voltage": 230,
            "PowerKW": 2.8,
            "CurrentTypeID": 10,
            "Quantity": 1
        }
    ],
    "NumberOfPoints": 1,
    "GeneralComments": "",
    "StatusTypeID": 50,
    "DateLastStatusUpdate": "2015-03-19T13:08:00Z",
    "DataQualityLevel": 1,
    "DateCreated": "2015-03-11T13:48:00Z",
    "SubmissionStatusTypeID": 200
}