{
    "IsRecentlyVerified": false,
    "ID": 90462,
    "UUID": "D647310A-2EB8-4257-AEAA-4757B8AB7BF4",
    "DataProviderID": 1,
    "OperatorID": 3267,
    "UsageTypeID": 6,
    "AddressInfo": {
        "ID": 90808,
        "Title": "frigotermica",
        "AddressLine1": "Via dell'Avena, 12",
        "AddressLine2": "Marghera",
        "Town": "Venezia",
        "StateOrProvince": "VE",
        "Postcode": "30175 ",
        "CountryID": 112,
        "Latitude": 45.460245538635206,
        "Longitude": 12.217073975110697,
        "ContactTelephone1": " +39 041 92 56 76 ",
        "ContactEmail": "info@frigotermica.it",
        "RelatedURL": "http://www.frigotermica.it/",
        "DistanceUnit": 0
    },
    "Connections": [
        {
            "ID": 128115,
            "ConnectionTypeID": 25,
            "StatusTypeID": 50,
            "LevelID": 2,
            "Amps": 32,
            "Voltage": 240,
            "PowerKW": 7.4,
            "CurrentTypeID": 10,
            "Quantity": 1
        }
    ],
    "NumberOfPoints": 1,
    "StatusTypeID": 50,
    "DateLastStatusUpdate": "2017-07-13T16:16:00Z",
    "DataQualityLevel": 1,
    "DateCreated": "2017-07-13T16:16:00Z",
    "SubmissionStatusTypeID": 200
}