{
    "IsRecentlyVerified": false,
    "ID": 184350,
    "UUID": "99DADED6-6E3C-479E-9DB4-42BBC6C266BE",
    "DataProviderID": 29,
    "DataProvidersReference": "10606",
    "OperatorID": 86,
    "AddressInfo": {
        "ID": 184709,
        "Title": "Mühlweg 5",
        "AddressLine1": "Mühlweg 5",
        "Town": "Jagsthausen",
        "Postcode": "74249",
        "CountryID": 87,
        "Latitude": 49.308252,
        "Longitude": 9.4670461,
        "DistanceUnit": 0
    },
    "Connections": [
        {
            "ID": 292514,
            "ConnectionTypeID": 25,
            "StatusTypeID": 50,
            "LevelID": 2,
            "PowerKW": 22,
            "CurrentTypeID": 20
        },
        {
            "ID": 292515,
            "ConnectionTypeID": 25,
            "StatusTypeID": 50,
            "LevelID": 2,
            "PowerKW": 22,
            "CurrentTypeID": 20
        }
    ],
    "StatusTypeID": 50,
    "DateLastStatusUpdate": "2021-07-12T02:43:00Z",
    "MetadataValues": [
        {
            "ID": 16641,
            "MetadataFieldID": 4,
            "ItemValue": "Data from the German chargepoint registry provided by Bundesnetzagentur.de under the CC-BY 4.0 license"
        }
    ],
    "DataQualityLevel": 3,
    "DateCreated": "2021-07-08T10:05:00Z",
    "SubmissionStatusTypeID": 100
}