{
    "IsRecentlyVerified": false,
    "ID": 97873,
    "UUID": "31D2D29A-8D03-4556-9F95-640F7EE03A46",
    "DataProviderID": 1,
    "OperatorID": 23,
    "OperatorsReference": "39793",
    "UsageTypeID": 4,
    "AddressInfo": {
        "ID": 98219,
        "Title": "Parking Chardonney",
        "AddressLine1": "Fraz. Chardonney",
        "Town": "Champorcher",
        "Postcode": "11020",
        "CountryID": 112,
        "Latitude": 45.621361,
        "Longitude": 7.607194,
        "ContactTelephone1": "+39 012 537 106",
        "DistanceUnit": 0
    },
    "Connections": [
        {
            "ID": 138781,
            "ConnectionTypeID": 30,
            "StatusTypeID": 50,
            "LevelID": 2,
            "Amps": 32,
            "Voltage": 230,
            "PowerKW": 7,
            "CurrentTypeID": 10,
            "Quantity": 2
        }
    ],
    "NumberOfPoints": 2,
    "GeneralComments": "2 Tesla Connectors, up to 7kW.Available to the public. Self park.",
    "StatusTypeID": 50,
    "DateLastStatusUpdate": "2018-10-03T22:08:00Z",
    "DataQualityLevel": 1,
    "DateCreated": "2018-01-21T16:52:00Z",
    "SubmissionStatusTypeID": 200
}