{
    "IsRecentlyVerified": false,
    "ID": 112271,
    "UUID": "1B46AE0D-35BE-4DBF-AB6F-D89A14123CEB",
    "DataProviderID": 1,
    "OperatorID": 32,
    "OperatorsReference": "10832",
    "UsageTypeID": 4,
    "UsageCost": "£0.108/kWh; for Polar Plus subscription members only",
    "AddressInfo": {
        "ID": 112617,
        "Title": "Frosts Garden Centre",
        "AddressLine1": "Frosts Garden Centre",
        "AddressLine2": "Woburn Sands",
        "Town": "Milton Keynes",
        "Postcode": "MK17 8UE",
        "CountryID": 1,
        "Latitude": 52.020542,
        "Longitude": -0.659941,
        "DistanceUnit": 0
    },
    "Connections": [
        {
            "ID": 157879,
            "ConnectionTypeID": 25,
            "StatusTypeID": 50,
            "LevelID": 2,
            "Amps": 32,
            "Voltage": 230,
            "PowerKW": 7,
            "CurrentTypeID": 10,
            "Quantity": 2
        }
    ],
    "NumberOfPoints": 2,
    "GeneralComments": "Unit located in the staff parking.",
    "StatusTypeID": 50,
    "DateLastStatusUpdate": "2019-03-09T06:13:00Z",
    "DataQualityLevel": 1,
    "DateCreated": "2018-10-20T05:31:00Z",
    "SubmissionStatusTypeID": 200
}