{
    "IsRecentlyVerified": false,
    "ID": 155658,
    "UUID": "B94CA8E9-B5AF-4E26-B0AF-BD88C493CD9C",
    "DataProviderID": 1,
    "OperatorID": 3389,
    "UsageTypeID": 1,
    "UsageCost": "$1.00/session+$0.21/minute",
    "AddressInfo": {
        "ID": 156012,
        "Title": "Town and Country Village - Francis Energy",
        "AddressLine1": "12311 N May Ave",
        "Town": "The Village",
        "StateOrProvince": "OK",
        "Postcode": "73120",
        "CountryID": 2,
        "Latitude": 35.5957110497734,
        "Longitude": -97.56733597641778,
        "AccessComments": "Use EVGateway App to manage charging",
        "RelatedURL": "https://francis.energy/",
        "DistanceUnit": 0
    },
    "Connections": [
        {
            "ID": 219174,
            "ConnectionTypeID": 32,
            "StatusTypeID": 50,
            "LevelID": 3,
            "PowerKW": 50,
            "CurrentTypeID": 30,
            "Quantity": 2,
            "Comments": "BTCPower 50kW"
        },
        {
            "ID": 219175,
            "ConnectionTypeID": 2,
            "StatusTypeID": 50,
            "LevelID": 3,
            "PowerKW": 50,
            "CurrentTypeID": 30,
            "Quantity": 2,
            "Comments": "BTCPower 50kW"
        }
    ],
    "NumberOfPoints": 2,
    "GeneralComments": "50kW DC Fast Chargers Provided by Francis Energy",
    "StatusTypeID": 50,
    "DateLastStatusUpdate": "2020-04-21T17:48:00Z",
    "DataQualityLevel": 1,
    "DateCreated": "2020-04-21T02:40:00Z",
    "SubmissionStatusTypeID": 200
}