{
    "IsRecentlyVerified": false,
    "ID": 146291,
    "UUID": "C1713446-61D9-47FD-88BA-D96614463870",
    "DataProviderID": 1,
    "OperatorID": 213,
    "OperatorsReference": "594b8946e4b0821fefd9a96d,595209bfe4b05b2f0c493462,5a7076bae4b0dbfa486063bc,5a70780be4b0dbfa48606ebe",
    "UsageTypeID": 1,
    "UsageCost": "0.00€",
    "AddressInfo": {
        "ID": 146643,
        "Title": "Place de l'Église",
        "AddressLine1": "0 Place de l'Église",
        "Town": "SAINT BRANDAN",
        "StateOrProvince": "Côtes-d'Armor",
        "Postcode": "22800",
        "CountryID": 80,
        "Latitude": 48.389687,
        "Longitude": -2.869649,
        "DistanceUnit": 0
    },
    "Connections": [
        {
            "ID": 203315,
            "ConnectionTypeID": 26,
            "StatusTypeID": 50,
            "LevelID": 2,
            "PowerKW": 22,
            "CurrentTypeID": 20,
            "Quantity": 1
        },
        {
            "ID": 203316,
            "ConnectionTypeID": 1036,
            "StatusTypeID": 50,
            "LevelID": 2,
            "Amps": 32,
            "Voltage": 400,
            "PowerKW": 22,
            "CurrentTypeID": 20,
            "Quantity": 1
        }
    ],
    "NumberOfPoints": 1,
    "StatusTypeID": 50,
    "DateLastStatusUpdate": "2020-01-05T20:23:00Z",
    "DataQualityLevel": 1,
    "DateCreated": "2020-01-05T20:23:00Z",
    "SubmissionStatusTypeID": 200
}