{
    "IsRecentlyVerified": false,
    "ID": 81355,
    "UUID": "BA04F5B9-90C8-45ED-9B04-E9F797D24D62",
    "DataProviderID": 1,
    "OperatorID": 23,
    "OperatorsReference": "15734",
    "UsageTypeID": 4,
    "UsageCost": "Free",
    "AddressInfo": {
        "ID": 81701,
        "Title": "Bluebonnet Country Club",
        "AddressLine1": "27521 FM 1602",
        "Town": "Hico",
        "StateOrProvince": "TX",
        "Postcode": "76457",
        "CountryID": 2,
        "Latitude": 31.959619,
        "Longitude": -98.01877,
        "ContactTelephone1": "(713) 907-3793",
        "DistanceUnit": 0
    },
    "Connections": [
        {
            "ID": 116071,
            "ConnectionTypeID": 30,
            "StatusTypeID": 50,
            "LevelID": 2,
            "PowerKW": 16,
            "CurrentTypeID": 20,
            "Quantity": 3
        }
    ],
    "NumberOfPoints": 3,
    "GeneralComments": "3 Tesla Connectors, up to 16kW.Available to the public. Please see front desk.",
    "StatusTypeID": 50,
    "DateLastStatusUpdate": "2017-02-01T09:35:00Z",
    "DataQualityLevel": 1,
    "DateCreated": "2017-02-01T09:35:00Z",
    "SubmissionStatusTypeID": 200
}