{
    "IsRecentlyVerified": false,
    "ID": 110950,
    "UUID": "C6CA3CE6-F10B-4EA2-B5EF-BEEA8EE2D34F",
    "DataProviderID": 2,
    "DataProvidersReference": "91484",
    "OperatorID": 5,
    "UsageTypeID": 1,
    "AddressInfo": {
        "ID": 111296,
        "Title": "PFAFF BMW",
        "AddressLine1": "4505 Dixie Rd",
        "Town": "Mississauga",
        "StateOrProvince": "ON",
        "Postcode": "L4W 4N3",
        "CountryID": 44,
        "Latitude": 43.6329972,
        "Longitude": -79.6157983,
        "ContactTelephone1": "888-758-4389",
        "AccessComments": "24 hours daily",
        "RelatedURL": "http://www.chargepoint.com/",
        "DistanceUnit": 0
    },
    "Connections": [
        {
            "ID": 156274,
            "ConnectionTypeID": 1,
            "LevelID": 2,
            "Amps": 16,
            "Voltage": 230,
            "PowerKW": 3,
            "CurrentTypeID": 10,
            "Quantity": 1
        }
    ],
    "DateLastStatusUpdate": "2019-12-24T09:21:00Z",
    "DataQualityLevel": 3,
    "DateCreated": "2018-10-18T23:36:00Z",
    "SubmissionStatusTypeID": 100
}