{
    "IsRecentlyVerified": false,
    "ID": 124112,
    "UUID": "9A401D81-1D78-488D-AA7E-0F100B490AD6",
    "DataProviderID": 2,
    "DataProvidersReference": "66694",
    "OperatorID": 5,
    "UsageTypeID": 1,
    "AddressInfo": {
        "ID": 124458,
        "Title": "SAN LEANDRO",
        "AddressLine1": "2506-3098 Davis St",
        "Town": "San Leandro",
        "StateOrProvince": "CA",
        "Postcode": "94577",
        "CountryID": 2,
        "Latitude": 37.7149991,
        "Longitude": -122.1939881,
        "ContactTelephone1": "888-758-4389",
        "AccessComments": "24 hours daily",
        "RelatedURL": "http://www.chargepoint.com/",
        "DistanceUnit": 0
    },
    "Connections": [
        {
            "ID": 174168,
            "ConnectionTypeID": 1,
            "LevelID": 2,
            "Amps": 16,
            "Voltage": 230,
            "PowerKW": 3,
            "CurrentTypeID": 10,
            "Quantity": 2
        }
    ],
    "DateLastStatusUpdate": "2019-12-24T09:14:00Z",
    "DataQualityLevel": 3,
    "DateCreated": "2019-04-06T05:03:00Z",
    "SubmissionStatusTypeID": 100
}