{
    "IsRecentlyVerified": false,
    "ID": 105769,
    "UUID": "6D74A271-10A2-41C4-B22B-3A496BED2B3D",
    "DataProviderID": 2,
    "DataProvidersReference": "96728",
    "UsageTypeID": 1,
    "AddressInfo": {
        "ID": 106115,
        "Title": "The Herman T. Costello Lyceum Hall",
        "AddressLine1": "432 High St",
        "Town": "Burlington",
        "StateOrProvince": "NJ",
        "Postcode": "08016",
        "CountryID": 2,
        "Latitude": 40.076462,
        "Longitude": -74.857778,
        "ContactTelephone1": "609-239-0029  410-685-1109",
        "AccessComments": "24 hours daily",
        "RelatedURL": "",
        "DistanceUnit": 0
    },
    "Connections": [
        {
            "ID": 148967,
            "ConnectionTypeID": 1,
            "LevelID": 2,
            "Amps": 16,
            "Voltage": 230,
            "PowerKW": 3.7,
            "CurrentTypeID": 10,
            "Quantity": 2
        }
    ],
    "DateLastStatusUpdate": "2020-06-26T03:02:00Z",
    "DataQualityLevel": 3,
    "DateCreated": "2018-06-09T04:01:00Z",
    "SubmissionStatusTypeID": 100
}