{
    "IsRecentlyVerified": false,
    "ID": 65154,
    "UUID": "C3E262EA-261D-4BDB-814C-05C1DACD9822",
    "DataProviderID": 1,
    "OperatorID": 3,
    "OperatorsReference": "PG-80238",
    "UsageTypeID": 6,
    "UsageCost": "Free",
    "AddressInfo": {
        "ID": 65500,
        "Title": "Brakes",
        "AddressLine1": "Nicholas Road",
        "AddressLine2": "Eureka Business Park",
        "Town": "Ashford",
        "StateOrProvince": "Kent",
        "Postcode": "TN25 4AG",
        "CountryID": 1,
        "Latitude": 51.1697797,
        "Longitude": 0.865544900000032,
        "AccessComments": "Located in the car park of the headquarters of Brakes wholesale caterers",
        "RelatedURL": "http://www.brake.co.uk/",
        "DistanceUnit": 0
    },
    "Connections": [
        {
            "ID": 89690,
            "ConnectionTypeID": 25,
            "StatusTypeID": 50,
            "LevelID": 2,
            "Amps": 32,
            "Voltage": 230,
            "PowerKW": 7,
            "CurrentTypeID": 10,
            "Quantity": 2
        }
    ],
    "NumberOfPoints": 2,
    "GeneralComments": "Pod-Point T7-S, web/app login may be required for proper charge",
    "StatusTypeID": 50,
    "DateLastStatusUpdate": "2016-11-10T13:09:00Z",
    "DataQualityLevel": 1,
    "DateCreated": "2016-04-16T09:06:00Z",
    "SubmissionStatusTypeID": 200
}