{
    "IsRecentlyVerified": false,
    "ID": 45599,
    "UUID": "9B4D5C1D-FCD7-41F8-910E-182AB97032E8",
    "DataProviderID": 1,
    "DataProvidersReference": "2766",
    "AddressInfo": {
        "ID": 45945,
        "Title": "ONAB vid IUC",
        "AddressLine1": "Vällaregatan 30",
        "Town": "OLOFSTRÖM",
        "StateOrProvince": "BLEKINGE",
        "Postcode": "29338",
        "CountryID": 216,
        "Latitude": 56.2839,
        "Longitude": 14.51467,
        "AccessComments": "På besöksparkering framför entrén till IUC. Laddstolpen är ceriserosa.",
        "DistanceUnit": 0
    },
    "Connections": [
        {
            "ID": 56262,
            "ConnectionTypeID": 0,
            "Reference": "1",
            "LevelID": 2,
            "Amps": 32,
            "Voltage": 400,
            "PowerKW": 22,
            "Comments": "Mode 3"
        },
        {
            "ID": 87779,
            "ConnectionTypeID": 0,
            "Reference": "2",
            "LevelID": 2,
            "Amps": 32,
            "Voltage": 400,
            "PowerKW": 22,
            "Comments": "Mode 3"
        }
    ],
    "NumberOfPoints": 2,
    "DateLastStatusUpdate": "2020-05-26T08:21:00Z",
    "DataQualityLevel": 2,
    "DateCreated": "2015-05-03T00:54:00Z",
    "SubmissionStatusTypeID": 100
}