{
    "IsRecentlyVerified": false,
    "ID": 93893,
    "UUID": "18D0DF17-8A8B-4AD2-8D4F-48936737947C",
    "DataProviderID": 1,
    "OperatorID": 1,
    "UsageTypeID": 1,
    "AddressInfo": {
        "ID": 94239,
        "Title": "Coop Storheden Parkering",
        "AddressLine1": "Storhedsvägen 3",
        "Town": "Luleå",
        "StateOrProvince": "Norrbotten",
        "Postcode": "973 45",
        "CountryID": 216,
        "Latitude": 65.618212,
        "Longitude": 22.044494,
        "DistanceUnit": 0
    },
    "Connections": [
        {
            "ID": 132914,
            "ConnectionTypeID": 2,
            "StatusTypeID": 50,
            "LevelID": 3,
            "Amps": 100,
            "Voltage": 500,
            "PowerKW": 50,
            "CurrentTypeID": 30,
            "Quantity": 1
        },
        {
            "ID": 132915,
            "ConnectionTypeID": 33,
            "StatusTypeID": 50,
            "LevelID": 3,
            "Amps": 100,
            "Voltage": 500,
            "PowerKW": 50,
            "CurrentTypeID": 30,
            "Quantity": 1
        },
        {
            "ID": 132916,
            "ConnectionTypeID": 1036,
            "StatusTypeID": 50,
            "LevelID": 2,
            "Amps": 32,
            "Voltage": 400,
            "PowerKW": 12,
            "Quantity": 1
        }
    ],
    "NumberOfPoints": 3,
    "StatusTypeID": 50,
    "DateLastStatusUpdate": "2017-10-11T16:06:00Z",
    "DataQualityLevel": 1,
    "DateCreated": "2017-10-11T13:40:00Z",
    "SubmissionStatusTypeID": 200
}