{
    "IsRecentlyVerified": false,
    "ID": 74980,
    "UUID": "59FD9369-C533-46C6-B3FD-AFFBD0FDA5AD",
    "DataProviderID": 1,
    "OperatorID": 45,
    "UsageTypeID": 6,
    "UsageCost": "Free",
    "AddressInfo": {
        "ID": 75326,
        "Title": "Budapest, ELMŰ Észak-pesti régió",
        "AddressLine1": "Megyeri út 118.",
        "Town": "Budapest",
        "StateOrProvince": "Budapest",
        "Postcode": "1044",
        "CountryID": 104,
        "Latitude": 47.5885859934946,
        "Longitude": 19.0971350669861,
        "AccessComments": " ELMŰ Oktatási Központ.",
        "DistanceUnit": 0
    },
    "Connections": [
        {
            "ID": 108173,
            "ConnectionTypeID": 25,
            "StatusTypeID": 50,
            "LevelID": 2,
            "Amps": 16,
            "Voltage": 400,
            "PowerKW": 11,
            "CurrentTypeID": 20,
            "Quantity": 1
        }
    ],
    "NumberOfPoints": 1,
    "StatusTypeID": 50,
    "DateLastStatusUpdate": "2017-08-21T20:09:00Z",
    "DataQualityLevel": 1,
    "DateCreated": "2016-12-10T05:45:00Z",
    "SubmissionStatusTypeID": 200
}