{
    "IsRecentlyVerified": false,
    "ID": 149269,
    "UUID": "9FDDBB8A-77E6-43CA-B31C-7A1B99261F96",
    "DataProviderID": 1,
    "OperatorID": 80,
    "UsageTypeID": 4,
    "AddressInfo": {
        "ID": 149622,
        "Title": "Parcheggio SEA Montone | EnelX",
        "AddressLine1": "Zona Industriale Santa Maria di Sette",
        "AddressLine2": "Santa Maria Di Sette",
        "Town": "Montone",
        "StateOrProvince": "PG",
        "Postcode": "06014",
        "CountryID": 112,
        "Latitude": 43.327730533182574,
        "Longitude": 12.320532661206471,
        "RelatedURL": "https://www.enelx.com/it/it/emobility",
        "DistanceUnit": 0
    },
    "Connections": [
        {
            "ID": 207261,
            "ConnectionTypeID": 25,
            "StatusTypeID": 50,
            "LevelID": 2,
            "Amps": 32,
            "Voltage": 400,
            "PowerKW": 22,
            "CurrentTypeID": 20,
            "Quantity": 2
        },
        {
            "ID": 207262,
            "ConnectionTypeID": 36,
            "StatusTypeID": 50,
            "LevelID": 2,
            "Amps": 16,
            "Voltage": 240,
            "PowerKW": 3.7,
            "CurrentTypeID": 10,
            "Quantity": 2
        }
    ],
    "NumberOfPoints": 4,
    "StatusTypeID": 50,
    "DateLastStatusUpdate": "2020-02-21T11:44:00Z",
    "DataQualityLevel": 1,
    "DateCreated": "2020-02-21T11:44:00Z",
    "SubmissionStatusTypeID": 200
}