{
    "IsRecentlyVerified": false,
    "ID": 134825,
    "UUID": "5FDBF5CD-F188-46DE-A81E-36B9D68E9FDA",
    "DataProviderID": 1,
    "OperatorID": 3378,
    "UsageTypeID": 5,
    "AddressInfo": {
        "ID": 135171,
        "Title": "MOL Kranj ČIRČE",
        "AddressLine1": "Cesta Boštjana Hladnika 4",
        "AddressLine2": "Čirče",
        "Town": "Kranj",
        "Postcode": "4000",
        "CountryID": 205,
        "Latitude": 46.231011851133445,
        "Longitude": 14.37241690031658,
        "ContactTelephone1": "+386 30 711 354",
        "AccessComments": "https://www.plugshare.com/location/165083",
        "DistanceUnit": 0
    },
    "Connections": [
        {
            "ID": 188636,
            "ConnectionTypeID": 33,
            "StatusTypeID": 50,
            "LevelID": 3,
            "PowerKW": 50,
            "CurrentTypeID": 30,
            "Quantity": 1
        },
        {
            "ID": 188637,
            "ConnectionTypeID": 2,
            "StatusTypeID": 50,
            "LevelID": 3,
            "PowerKW": 50,
            "CurrentTypeID": 30,
            "Quantity": 1
        },
        {
            "ID": 188638,
            "ConnectionTypeID": 1036,
            "StatusTypeID": 50,
            "LevelID": 3,
            "Amps": 63,
            "Voltage": 400,
            "PowerKW": 43,
            "CurrentTypeID": 20,
            "Quantity": 1
        }
    ],
    "NumberOfPoints": 1,
    "GeneralComments": "Winter: 6:00 - 22:00\r\nSummer: 8:00 - 20:00\r\n1x50kW CHAdeMO\r\n1x50kW CCS\r\n1x43kW Type2\r\n\r\n8€ per session\r\n\r\nCharging is possible when gas station is opened - between 6:00 and 22:00 in winter and between 8:00 - 20:00 in summer.",
    "StatusTypeID": 50,
    "DateLastStatusUpdate": "2019-11-24T20:04:00Z",
    "DataQualityLevel": 1,
    "DateCreated": "2019-11-24T17:36:00Z",
    "SubmissionStatusTypeID": 200
}