{
    "IsRecentlyVerified": false,
    "ID": 46502,
    "UUID": "353B0E79-5144-4EDA-ABDB-F92337110796",
    "DataProviderID": 1,
    "DataProvidersReference": "153",
    "AddressInfo": {
        "ID": 46848,
        "Title": "Kleppestø Senter, Askøy",
        "AddressLine1": "Kleppestø Senter ",
        "Town": "KLEPPESTØ",
        "StateOrProvince": "Vestland",
        "Postcode": "5323",
        "CountryID": 168,
        "Latitude": 60.410093,
        "Longitude": 5.227099,
        "AccessComments": "Lademuligheter ved inngang G på taket.",
        "DistanceUnit": 0
    },
    "Connections": [
        {
            "ID": 57165,
            "ConnectionTypeID": 0,
            "Reference": "1",
            "LevelID": 2,
            "Amps": 16,
            "Voltage": 230,
            "PowerKW": 3.7,
            "Comments": "Mode 1"
        },
        {
            "ID": 89042,
            "ConnectionTypeID": 0,
            "Reference": "2",
            "LevelID": 2,
            "Amps": 16,
            "Voltage": 230,
            "PowerKW": 3.7,
            "Comments": "Mode 1"
        }
    ],
    "NumberOfPoints": 2,
    "DateLastStatusUpdate": "2020-05-26T08:24:00Z",
    "DataQualityLevel": 2,
    "DateCreated": "2015-05-03T00:54:00Z",
    "SubmissionStatusTypeID": 100
}