{
    "IsRecentlyVerified": false,
    "ID": 156931,
    "UUID": "CA50963F-82D9-4D87-B526-9CB76C64D950",
    "DataProviderID": 19,
    "DataProvidersReference": "5792",
    "AddressInfo": {
        "ID": 157285,
        "Title": "Väsbyhem Hjortvägen S554",
        "AddressLine1": "Hjortvägen 49 ",
        "Town": "UPPLANDS VÄSBY",
        "StateOrProvince": "STOCKHOLM",
        "Postcode": "19479",
        "CountryID": 216,
        "Latitude": 59.52716,
        "Longitude": 17.91947,
        "AccessComments": "",
        "DistanceUnit": 0
    },
    "Connections": [
        {
            "ID": 223081,
            "ConnectionTypeID": 25,
            "Reference": "1",
            "LevelID": 2,
            "Amps": 16,
            "Voltage": 230,
            "PowerKW": 3.7,
            "CurrentTypeID": 10,
            "Comments": "Mode 3"
        },
        {
            "ID": 223082,
            "ConnectionTypeID": 25,
            "Reference": "2",
            "LevelID": 3,
            "Amps": 32,
            "Voltage": 400,
            "PowerKW": 22,
            "CurrentTypeID": 30,
            "Comments": "Mode 3"
        }
    ],
    "NumberOfPoints": 2,
    "StatusTypeID": 0,
    "DateLastStatusUpdate": "2021-03-24T05:11:00Z",
    "DataQualityLevel": 2,
    "DateCreated": "2020-05-26T08:23:00Z",
    "SubmissionStatusTypeID": 100
}