{
    "MediaItems": [
        {
            "ID": 22029,
            "ChargePointID": 155563,
            "ItemURL": "https://s3-ap-southeast-2.amazonaws.com/openchargemap/images/CZ/OCM155563/OCM-155563.orig.2020041919154967.jpg",
            "ItemThumbnailURL": "https://s3-ap-southeast-2.amazonaws.com/openchargemap/images/CZ/OCM155563/OCM-155563.thmb.2020041919154967.jpg",
            "Comment": "",
            "IsEnabled": true,
            "IsVideo": false,
            "IsFeaturedItem": false,
            "IsExternalResource": false,
            "User": {
                "ID": 19523,
                "Username": "Martin1713"
            },
            "DateCreated": "2020-04-19T19:16:00Z"
        },
        {
            "ID": 22026,
            "ChargePointID": 155563,
            "ItemURL": "https://s3-ap-southeast-2.amazonaws.com/openchargemap/images/CZ/OCM155563/OCM-155563.orig.2020041919143350.jpg",
            "ItemThumbnailURL": "https://s3-ap-southeast-2.amazonaws.com/openchargemap/images/CZ/OCM155563/OCM-155563.thmb.2020041919143350.jpg",
            "Comment": "",
            "IsEnabled": true,
            "IsVideo": false,
            "IsFeaturedItem": false,
            "IsExternalResource": false,
            "User": {
                "ID": 19523,
                "Username": "Martin1713"
            },
            "DateCreated": "2020-04-19T19:15:00Z"
        },
        {
            "ID": 22027,
            "ChargePointID": 155563,
            "ItemURL": "https://s3-ap-southeast-2.amazonaws.com/openchargemap/images/CZ/OCM155563/OCM-155563.orig.2020041919145046.jpg",
            "ItemThumbnailURL": "https://s3-ap-southeast-2.amazonaws.com/openchargemap/images/CZ/OCM155563/OCM-155563.thmb.2020041919145046.jpg",
            "Comment": "",
            "IsEnabled": true,
            "IsVideo": false,
            "IsFeaturedItem": false,
            "IsExternalResource": false,
            "User": {
                "ID": 19523,
                "Username": "Martin1713"
            },
            "DateCreated": "2020-04-19T19:15:00Z"
        },
        {
            "ID": 22028,
            "ChargePointID": 155563,
            "ItemURL": "https://s3-ap-southeast-2.amazonaws.com/openchargemap/images/CZ/OCM155563/OCM-155563.orig.2020041919152147.jpg",
            "ItemThumbnailURL": "https://s3-ap-southeast-2.amazonaws.com/openchargemap/images/CZ/OCM155563/OCM-155563.thmb.2020041919152147.jpg",
            "Comment": "",
            "IsEnabled": true,
            "IsVideo": false,
            "IsFeaturedItem": false,
            "IsExternalResource": false,
            "User": {
                "ID": 19523,
                "Username": "Martin1713"
            },
            "DateCreated": "2020-04-19T19:15:00Z"
        }
    ],
    "IsRecentlyVerified": false,
    "ID": 155563,
    "UUID": "95D83897-8AEA-4E6A-BA2C-87F85747349B",
    "DataProviderID": 1,
    "OperatorID": 1,
    "UsageTypeID": 1,
    "UsageCost": "Dočasně zdarma/Temporary free",
    "AddressInfo": {
        "ID": 155917,
        "Title": "MOL 5. května (D1)",
        "AddressLine1": "směr/direction Brno ",
        "Town": "Prague",
        "StateOrProvince": "Prague",
        "Postcode": "CZ14100",
        "CountryID": 64,
        "Latitude": 50.03719972670481,
        "Longitude": 14.490064154050174,
        "AccessComments": "The petrol station staff will turn on charging",
        "DistanceUnit": 0
    },
    "Connections": [
        {
            "ID": 218988,
            "ConnectionTypeID": 33,
            "Reference": "",
            "StatusTypeID": 50,
            "LevelID": 3,
            "PowerKW": 50,
            "CurrentTypeID": 30,
            "Quantity": 1,
            "Comments": ""
        },
        {
            "ID": 218989,
            "ConnectionTypeID": 2,
            "Reference": "https://molcesko.cz/",
            "StatusTypeID": 50,
            "LevelID": 3,
            "PowerKW": 50,
            "CurrentTypeID": 30,
            "Quantity": 1,
            "Comments": ""
        },
        {
            "ID": 218990,
            "ConnectionTypeID": 1036,
            "StatusTypeID": 50,
            "LevelID": 2,
            "PowerKW": 22,
            "Quantity": 1
        }
    ],
    "NumberOfPoints": 1,
    "GeneralComments": "Obsluha spustí a zastaví nabíjení",
    "StatusTypeID": 50,
    "DateLastStatusUpdate": "2020-04-23T07:26:00Z",
    "DataQualityLevel": 1,
    "DateCreated": "2020-04-18T16:04:00Z",
    "SubmissionStatusTypeID": 200
}