{
    "IsRecentlyVerified": false,
    "ID": 160397,
    "UUID": "775BA470-6195-439B-9AF6-4D7A2D70E769",
    "DataProviderID": 2,
    "DataProvidersReference": "152372",
    "OperatorID": 90,
    "UsageTypeID": 1,
    "AddressInfo": {
        "ID": 160754,
        "Title": "10001 Jules-Crépeau",
        "AddressLine1": "10001 jules crépeau",
        "Town": "Montréal",
        "StateOrProvince": "QC",
        "Postcode": "H4N 2Z3",
        "CountryID": 44,
        "Latitude": 45.535466,
        "Longitude": -73.669593,
        "ContactTelephone1": "877-505-2674",
        "AccessComments": "24 hours daily",
        "RelatedURL": "https://lecircuitelectrique.com/",
        "DistanceUnit": 0
    },
    "Connections": [
        {
            "ID": 230781,
            "ConnectionTypeID": 1,
            "LevelID": 2,
            "Amps": 16,
            "Voltage": 230,
            "PowerKW": 3.7,
            "CurrentTypeID": 10,
            "Quantity": 2
        }
    ],
    "StatusTypeID": 50,
    "DateLastStatusUpdate": "2020-06-26T03:09:00Z",
    "DataQualityLevel": 3,
    "DateCreated": "2020-06-26T03:09:00Z",
    "SubmissionStatusTypeID": 100
}