{
    "IsRecentlyVerified": false,
    "ID": 180822,
    "UUID": "24BFD553-D346-4EB8-AD72-E8E18CAFADD9",
    "DataProviderID": 29,
    "DataProvidersReference": "14675,11181",
    "AddressInfo": {
        "ID": 181181,
        "Title": "Am Stadtgraben 9",
        "AddressLine1": "Am Stadtgraben 9",
        "Town": "Lichtenfels",
        "Postcode": "96215",
        "CountryID": 87,
        "Latitude": 50.144833,
        "Longitude": 11.063453,
        "DistanceUnit": 0
    },
    "Connections": [
        {
            "ID": 284403,
            "ConnectionTypeID": 25,
            "StatusTypeID": 50,
            "LevelID": 2,
            "PowerKW": 11,
            "CurrentTypeID": 20
        },
        {
            "ID": 284404,
            "ConnectionTypeID": 25,
            "StatusTypeID": 50,
            "LevelID": 2,
            "PowerKW": 11,
            "CurrentTypeID": 20
        }
    ],
    "StatusTypeID": 50,
    "DateLastStatusUpdate": "2021-07-09T03:19:00Z",
    "MetadataValues": [
        {
            "ID": 13116,
            "MetadataFieldID": 4,
            "ItemValue": "Data from the German chargepoint registry provided by Bundesnetzagentur.de under the CC-BY 4.0 license"
        }
    ],
    "DataQualityLevel": 3,
    "DateCreated": "2021-07-08T10:01:00Z",
    "SubmissionStatusTypeID": 100
}