{
    "IsRecentlyVerified": false,
    "ID": 177945,
    "UUID": "B130A9C2-D7C1-448C-9302-E9F17FE4071A",
    "DataProviderID": 29,
    "DataProvidersReference": "10731",
    "OperatorID": 127,
    "AddressInfo": {
        "ID": 178304,
        "Title": "Borgfelder Heerstraße 38a",
        "AddressLine1": "Borgfelder Heerstraße 38a",
        "Town": "Bremen",
        "Postcode": "28357",
        "CountryID": 87,
        "Latitude": 53.125353180918,
        "Longitude": 8.901629447937,
        "DistanceUnit": 0
    },
    "Connections": [
        {
            "ID": 277718,
            "ConnectionTypeID": 25,
            "StatusTypeID": 50,
            "LevelID": 2,
            "PowerKW": 22,
            "CurrentTypeID": 20
        },
        {
            "ID": 277719,
            "ConnectionTypeID": 25,
            "StatusTypeID": 50,
            "LevelID": 2,
            "PowerKW": 22,
            "CurrentTypeID": 20
        }
    ],
    "StatusTypeID": 0,
    "DateLastStatusUpdate": "2021-07-12T02:50:00Z",
    "MetadataValues": [
        {
            "ID": 10239,
            "MetadataFieldID": 4,
            "ItemValue": "Data from the German chargepoint registry provided by Bundesnetzagentur.de under the CC-BY 4.0 license"
        }
    ],
    "DataQualityLevel": 3,
    "DateCreated": "2021-07-08T09:49:00Z",
    "SubmissionStatusTypeID": 100
}