{
    "UserComments": [
        {
            "ID": 11643,
            "ChargePointID": 68676,
            "CommentTypeID": 10,
            "UserName": "Anon74856763534",
            "Comment": "CHAdeMO charge.",
            "DateCreated": "2016-06-15T15:06:28.233Z",
            "User": {
                "ID": 1192,
                "Username": "Anon74856763534"
            },
            "CheckinStatusTypeID": 10
        }
    ],
    "MediaItems": [
        {
            "ID": 6618,
            "ChargePointID": 68676,
            "ItemURL": "https://s3-ap-southeast-2.amazonaws.com/openchargemap/images/GB/OCM68676/OCM-68676.orig.2016061515092330.jpg",
            "ItemThumbnailURL": "https://s3-ap-southeast-2.amazonaws.com/openchargemap/images/GB/OCM68676/OCM-68676.thmb.2016061515092330.jpg",
            "Comment": "",
            "IsEnabled": true,
            "IsVideo": false,
            "IsFeaturedItem": false,
            "IsExternalResource": false,
            "User": {
                "ID": 1192,
                "Username": "Anon74856763534"
            },
            "DateCreated": "2016-06-15T15:10:00Z"
        }
    ],
    "IsRecentlyVerified": false,
    "ID": 68676,
    "UUID": "93FC692D-2A9E-4533-B7E2-5EA8410A024F",
    "DataProviderID": 1,
    "OperatorID": 3315,
    "OperatorsReference": "51069",
    "UsageTypeID": 4,
    "UsageCost": "Free",
    "AddressInfo": {
        "ID": 69022,
        "Title": "Community Hall Car Park",
        "AddressLine1": "Braeroy Road",
        "Town": "Roybridge",
        "StateOrProvince": "Highland",
        "Postcode": "PH31 4EU",
        "CountryID": 1,
        "Latitude": 56.891117,
        "Longitude": -4.841578,
        "DistanceUnit": 0
    },
    "Connections": [
        {
            "ID": 96313,
            "ConnectionTypeID": 2,
            "StatusTypeID": 50,
            "LevelID": 3,
            "Amps": 125,
            "Voltage": 400,
            "PowerKW": 50,
            "CurrentTypeID": 30,
            "Quantity": 1
        },
        {
            "ID": 96314,
            "ConnectionTypeID": 33,
            "StatusTypeID": 100,
            "LevelID": 3,
            "Amps": 125,
            "Voltage": 400,
            "PowerKW": 50,
            "CurrentTypeID": 30,
            "Quantity": 1
        },
        {
            "ID": 96315,
            "ConnectionTypeID": 1036,
            "StatusTypeID": 50,
            "LevelID": 3,
            "Amps": 63,
            "Voltage": 400,
            "PowerKW": 43,
            "CurrentTypeID": 20,
            "Quantity": 1
        }
    ],
    "NumberOfPoints": 2,
    "GeneralComments": "Will accept any card (set to 'free vend' due to poor comms).",
    "StatusTypeID": 50,
    "DateLastStatusUpdate": "2020-09-30T15:12:00Z",
    "DataQualityLevel": 1,
    "DateCreated": "2016-06-15T14:43:00Z",
    "SubmissionStatusTypeID": 200
}