{
    "IsRecentlyVerified": false,
    "ID": 130600,
    "UUID": "E431A8E5-8EAA-4C02-B075-65323687087F",
    "DataProviderID": 1,
    "OperatorID": 1,
    "UsageTypeID": 1,
    "UsageCost": "0",
    "AddressInfo": {
        "ID": 130946,
        "Title": "Inlandsgatan",
        "AddressLine1": "Inlandsgatan",
        "AddressLine2": "Kullen",
        "Town": "Kungälvs kommun",
        "StateOrProvince": "Kungälvs kommun",
        "Postcode": "442 35",
        "CountryID": 216,
        "Latitude": 57.8738377,
        "Longitude": 11.9674827,
        "DistanceUnit": 0
    },
    "Connections": [
        {
            "ID": 182832,
            "ConnectionTypeID": 25,
            "StatusTypeID": 50,
            "LevelID": 2,
            "Quantity": 12
        }
    ],
    "NumberOfPoints": 12,
    "GeneralComments": "2 hours parking is free, after that it is only parking fee that needs to be paid for. ",
    "StatusTypeID": 50,
    "DateLastStatusUpdate": "2019-08-11T15:07:00Z",
    "DataQualityLevel": 1,
    "DateCreated": "2019-08-07T12:30:00Z",
    "SubmissionStatusTypeID": 200
}