{
    "IsRecentlyVerified": false,
    "ID": 97043,
    "UUID": "68052171-1AAC-4F75-9E78-F5585D63BF81",
    "DataProviderID": 1,
    "DataProvidersReference": "4445",
    "AddressInfo": {
        "ID": 97389,
        "Title": "Nes sykehjem, ansatte",
        "AddressLine1": "Hagaskogvegen 19",
        "Town": "ÅRNES",
        "StateOrProvince": "Viken",
        "Postcode": "2150",
        "CountryID": 168,
        "Latitude": 60.11988,
        "Longitude": 11.47681,
        "AccessComments": "Nes Sykehjem",
        "DistanceUnit": 0
    },
    "Connections": [
        {
            "ID": 137672,
            "ConnectionTypeID": 0,
            "Reference": "1",
            "LevelID": 2,
            "Amps": 16,
            "Voltage": 400,
            "PowerKW": 11,
            "Comments": "Mode 3"
        },
        {
            "ID": 137673,
            "ConnectionTypeID": 0,
            "Reference": "2",
            "LevelID": 2,
            "Amps": 16,
            "Voltage": 400,
            "PowerKW": 11,
            "Comments": "Mode 3"
        },
        {
            "ID": 137674,
            "ConnectionTypeID": 0,
            "Reference": "3",
            "LevelID": 2,
            "Amps": 16,
            "Voltage": 400,
            "PowerKW": 11,
            "Comments": "Mode 3"
        },
        {
            "ID": 137675,
            "ConnectionTypeID": 0,
            "Reference": "4",
            "LevelID": 2,
            "Amps": 16,
            "Voltage": 400,
            "PowerKW": 11,
            "Comments": "Mode 3"
        }
    ],
    "NumberOfPoints": 4,
    "DateLastStatusUpdate": "2020-05-26T08:23:00Z",
    "DataQualityLevel": 2,
    "DateCreated": "2018-01-04T08:28:00Z",
    "SubmissionStatusTypeID": 100
}