{
    "IsRecentlyVerified": false,
    "ID": 87758,
    "UUID": "6D8E3E80-A6CC-4B67-BFF2-10D42062DF17",
    "DataProviderID": 1,
    "OperatorID": 45,
    "UsageTypeID": 7,
    "UsageCost": "By negotiation.",
    "AddressInfo": {
        "ID": 88104,
        "Title": "Invercargill Top 10 Holiday Park",
        "AddressLine1": "77 McIvor Road",
        "Town": "Waikiwi, Invercargill ",
        "Postcode": "9876",
        "CountryID": 161,
        "Latitude": -46.3643336,
        "Longitude": 168.3563044,
        "ContactTelephone1": "(643) 215-9032",
        "DistanceUnit": 0
    },
    "Connections": [
        {
            "ID": 124382,
            "ConnectionTypeID": 4,
            "StatusTypeID": 50,
            "LevelID": 2,
            "Amps": 16,
            "Voltage": 230,
            "PowerKW": 3.6,
            "CurrentTypeID": 10,
            "Quantity": 2
        }
    ],
    "NumberOfPoints": 2,
    "GeneralComments": "Phone prior to arrival and ask.",
    "StatusTypeID": 50,
    "DateLastStatusUpdate": "2017-05-16T10:42:00Z",
    "DataQualityLevel": 1,
    "DateCreated": "2017-05-16T10:35:00Z",
    "SubmissionStatusTypeID": 200
}