{
    "IsRecentlyVerified": false,
    "ID": 167589,
    "UUID": "D33C3954-3F54-473F-BA3F-38DB59F3998B",
    "DataProviderID": 19,
    "DataProvidersReference": "6753",
    "AddressInfo": {
        "ID": 167948,
        "Title": "Tinggata",
        "AddressLine1": "Tinggata 3",
        "Town": "STRYN",
        "StateOrProvince": "Vestland",
        "Postcode": "6783",
        "CountryID": 168,
        "Latitude": 61.90287,
        "Longitude": 6.72332,
        "AccessComments": "",
        "DistanceUnit": 0
    },
    "Connections": [
        {
            "ID": 254367,
            "ConnectionTypeID": 25,
            "Reference": "1",
            "LevelID": 2,
            "Amps": 32,
            "Voltage": 230,
            "PowerKW": 7.4,
            "CurrentTypeID": 10,
            "Comments": "Mode 3"
        },
        {
            "ID": 254368,
            "ConnectionTypeID": 25,
            "Reference": "2",
            "LevelID": 2,
            "Amps": 32,
            "Voltage": 230,
            "PowerKW": 7.4,
            "CurrentTypeID": 10,
            "Comments": "Mode 3"
        },
        {
            "ID": 254369,
            "ConnectionTypeID": 25,
            "Reference": "3",
            "LevelID": 2,
            "Amps": 32,
            "Voltage": 230,
            "PowerKW": 7.4,
            "CurrentTypeID": 10,
            "Comments": "Mode 3"
        },
        {
            "ID": 254370,
            "ConnectionTypeID": 25,
            "Reference": "4",
            "LevelID": 2,
            "Amps": 32,
            "Voltage": 230,
            "PowerKW": 7.4,
            "CurrentTypeID": 10,
            "Comments": "Mode 3"
        },
        {
            "ID": 254371,
            "ConnectionTypeID": 25,
            "Reference": "5",
            "LevelID": 2,
            "Amps": 32,
            "Voltage": 230,
            "PowerKW": 7.4,
            "CurrentTypeID": 10,
            "Comments": "Mode 3"
        },
        {
            "ID": 254372,
            "ConnectionTypeID": 25,
            "Reference": "6",
            "LevelID": 2,
            "Amps": 32,
            "Voltage": 230,
            "PowerKW": 7.4,
            "CurrentTypeID": 10,
            "Comments": "Mode 3"
        },
        {
            "ID": 254373,
            "ConnectionTypeID": 25,
            "Reference": "7",
            "LevelID": 2,
            "Amps": 32,
            "Voltage": 230,
            "PowerKW": 7.4,
            "CurrentTypeID": 10,
            "Comments": "Mode 3"
        },
        {
            "ID": 254374,
            "ConnectionTypeID": 25,
            "Reference": "8",
            "LevelID": 2,
            "Amps": 32,
            "Voltage": 230,
            "PowerKW": 7.4,
            "CurrentTypeID": 10,
            "Comments": "Mode 3"
        }
    ],
    "NumberOfPoints": 8,
    "StatusTypeID": 0,
    "DateLastStatusUpdate": "2021-03-24T05:12:00Z",
    "DataQualityLevel": 2,
    "DateCreated": "2020-09-08T04:14:00Z",
    "SubmissionStatusTypeID": 100
}