{
    "IsRecentlyVerified": false,
    "ID": 170976,
    "UUID": "1911EF92-2E46-49D9-8927-3D89A4EB90A7",
    "DataProviderID": 1,
    "OperatorID": 23,
    "OperatorsReference": "55222",
    "UsageTypeID": 4,
    "UsageCost": "€0.24/kWh; Autres tarifs pour les voitures anciennes",
    "AddressInfo": {
        "ID": 171335,
        "Title": "Aire de la Vendée Supercharger",
        "AddressLine1": "Autoroute A83",
        "Town": "Sainte-Hermine",
        "Postcode": "85210",
        "CountryID": 80,
        "Latitude": 46.573233,
        "Longitude": -1.11793,
        "DistanceUnit": 0
    },
    "Connections": [
        {
            "ID": 261225,
            "ConnectionTypeID": 27,
            "StatusTypeID": 50,
            "LevelID": 3,
            "PowerKW": 250,
            "CurrentTypeID": 30,
            "Quantity": 9
        }
    ],
    "NumberOfPoints": 9,
    "GeneralComments": "9 superchargers, available 24/7",
    "StatusTypeID": 50,
    "DateLastStatusUpdate": "2021-11-03T02:40:00Z",
    "DataQualityLevel": 1,
    "DateCreated": "2020-12-15T08:38:00Z",
    "SubmissionStatusTypeID": 200
}