{
    "IsRecentlyVerified": false,
    "ID": 175091,
    "UUID": "EBFFF6D9-A006-4FF8-8091-187C95B05D1B",
    "DataProviderID": 1,
    "OperatorID": 3299,
    "UsageTypeID": 1,
    "AddressInfo": {
        "ID": 175450,
        "Title": "IONITY Sandelingen West",
        "AddressLine1": "Sandelingen West, A16, 16",
        "Town": "Hendrik-Ido-Ambacht",
        "Postcode": "3342 LE",
        "CountryID": 159,
        "Latitude": 51.834832,
        "Longitude": 4.618082,
        "DistanceUnit": 0
    },
    "Connections": [
        {
            "ID": 271349,
            "ConnectionTypeID": 33,
            "StatusTypeID": 50,
            "LevelID": 3,
            "PowerKW": 350,
            "CurrentTypeID": 30,
            "Quantity": 2
        }
    ],
    "NumberOfPoints": 2,
    "StatusTypeID": 50,
    "DateLastStatusUpdate": "2021-04-26T20:41:00Z",
    "DataQualityLevel": 1,
    "DateCreated": "2021-04-26T13:00:00Z",
    "SubmissionStatusTypeID": 200
}