{
    "UserComments": [
        {
            "ID": 20496,
            "ChargePointID": 81881,
            "CommentTypeID": 10,
            "UserName": "Steveve ",
            "Comment": "One Tesla (Red) destination charger not working. But the second one I tried works well. ",
            "Rating": 4,
            "DateCreated": "2018-12-08T13:09:42.04Z",
            "User": {
                "ID": 16929,
                "Username": "Steveve "
            },
            "CheckinStatusTypeID": 10
        }
    ],
    "IsRecentlyVerified": false,
    "ID": 81881,
    "UUID": "CB81330A-69F0-4DD9-A052-64E296B534E0",
    "DataProviderID": 1,
    "OperatorID": 23,
    "OperatorsReference": "20414",
    "UsageTypeID": 6,
    "AddressInfo": {
        "ID": 82227,
        "Title": "Centre Commercial Carrefour Villiers en Bière",
        "AddressLine1": "Route Nationale 7",
        "Town": "Villiers-en-Bière",
        "Postcode": "77190",
        "CountryID": 80,
        "Latitude": 48.497899,
        "Longitude": 2.581907,
        "ContactTelephone1": "+33 1 64 87 91 84",
        "DistanceUnit": 0
    },
    "Connections": [
        {
            "ID": 116640,
            "ConnectionTypeID": 30,
            "StatusTypeID": 50,
            "LevelID": 2,
            "Amps": 16,
            "Voltage": 400,
            "PowerKW": 11,
            "CurrentTypeID": 20,
            "Quantity": 2
        }
    ],
    "NumberOfPoints": 2,
    "GeneralComments": "2 Tesla Connectors, up to 11kW.Available for patrons only. Self park.",
    "StatusTypeID": 50,
    "DateLastStatusUpdate": "2018-12-08T13:10:00Z",
    "DataQualityLevel": 1,
    "DateCreated": "2017-02-03T13:23:00Z",
    "SubmissionStatusTypeID": 200
}