{
    "IsRecentlyVerified": false,
    "ID": 94928,
    "UUID": "50986362-8D7C-4B44-B42A-D4575C2A7B92",
    "DataProviderID": 1,
    "DataProvidersReference": "4393",
    "AddressInfo": {
        "ID": 95274,
        "Title": "Mattssons i Godby",
        "AddressLine1": "Von Knorringsvägen 2",
        "Town": "Godby",
        "StateOrProvince": "Ahvenanmaa",
        "Postcode": "22410",
        "CountryID": 79,
        "Latitude": 60.23046,
        "Longitude": 19.98895,
        "AccessComments": "Ostoskeskuksen/tavaratalon parkkialueella tai -hallissa",
        "DistanceUnit": 0
    },
    "Connections": [
        {
            "ID": 134393,
            "ConnectionTypeID": 0,
            "Reference": "1",
            "LevelID": 2,
            "Amps": 63,
            "Voltage": 400,
            "PowerKW": 43,
            "Comments": "Mode 4"
        },
        {
            "ID": 134394,
            "ConnectionTypeID": 0,
            "Reference": "2",
            "LevelID": 2,
            "Amps": 63,
            "Voltage": 400,
            "PowerKW": 43,
            "Comments": "Mode 4"
        },
        {
            "ID": 134395,
            "ConnectionTypeID": 0,
            "Reference": "3",
            "LevelID": 2,
            "Amps": 63,
            "Voltage": 400,
            "PowerKW": 43,
            "Comments": "Mode 4"
        }
    ],
    "NumberOfPoints": 3,
    "DateLastStatusUpdate": "2020-05-26T08:24:00Z",
    "DataQualityLevel": 2,
    "DateCreated": "2017-10-28T13:36:00Z",
    "SubmissionStatusTypeID": 100
}