{
    "IsRecentlyVerified": false,
    "ID": 109049,
    "UUID": "8194EC1C-AA25-4E47-88A9-624FDD50065F",
    "DataProviderID": 1,
    "OperatorID": 23,
    "OperatorsReference": "46347",
    "UsageTypeID": 4,
    "AddressInfo": {
        "ID": 109395,
        "Title": "Holiday Inn Express & Suites West des Moines",
        "AddressLine1": "240 Jordan Creek Pkwy",
        "Town": "West Des Moines",
        "StateOrProvince": "Iowa",
        "Postcode": "50266",
        "CountryID": 2,
        "Latitude": 41.572729,
        "Longitude": -93.809383,
        "ContactTelephone1": "(515) 223-4050",
        "DistanceUnit": 0
    },
    "Connections": [
        {
            "ID": 154167,
            "ConnectionTypeID": 30,
            "StatusTypeID": 50,
            "LevelID": 2,
            "PowerKW": 16,
            "CurrentTypeID": 20,
            "Quantity": 3
        }
    ],
    "NumberOfPoints": 3,
    "GeneralComments": "3 Tesla Connectors, up to 16kW.Available for customers. Self park.",
    "StatusTypeID": 50,
    "DateLastStatusUpdate": "2018-10-11T13:27:00Z",
    "DataQualityLevel": 1,
    "DateCreated": "2018-10-11T13:27:00Z",
    "SubmissionStatusTypeID": 200
}