{
    "IsRecentlyVerified": false,
    "ID": 31657,
    "UUID": "B63FAA86-13BE-49F8-9A1A-FF8C7D625C54",
    "DataProviderID": 26,
    "DataProvidersReference": "30710",
    "OperatorsReference": "CORA",
    "UsageCost": "0.00 onbekend",
    "AddressInfo": {
        "ID": 32003,
        "Title": "Rue de Soultz",
        "AddressLine1": "Rue de Soultz",
        "Town": "Wittenheim",
        "Postcode": "68270",
        "CountryID": 80,
        "Latitude": 47.80874,
        "Longitude": 7.31468,
        "DistanceUnit": 0
    },
    "Connections": [
        {
            "ID": 35168,
            "ConnectionTypeID": 2,
            "LevelID": 3,
            "PowerKW": 50,
            "CurrentTypeID": 30
        }
    ],
    "NumberOfPoints": 1,
    "StatusTypeID": 50,
    "DateLastStatusUpdate": "2016-03-03T12:34:00Z",
    "DataQualityLevel": 3,
    "DateCreated": "2015-01-09T06:03:00Z",
    "SubmissionStatusTypeID": 100
}