{
    "IsRecentlyVerified": false,
    "ID": 160651,
    "UUID": "4C77D965-2CB3-4E22-BE91-B12D6B06BE11",
    "DataProviderID": 2,
    "DataProvidersReference": "156711",
    "UsageTypeID": 2,
    "AddressInfo": {
        "ID": 161008,
        "Title": "Hydro-Quebec",
        "AddressLine1": "45 place Quévillon",
        "Town": "Lebel-sur-Quévillon",
        "StateOrProvince": "QC",
        "Postcode": "J0Y 1X0",
        "CountryID": 44,
        "Latitude": 49.052146,
        "Longitude": -76.979057,
        "ContactTelephone1": "",
        "AccessComments": "",
        "RelatedURL": "",
        "DistanceUnit": 0
    },
    "Connections": [
        {
            "ID": 231166,
            "ConnectionTypeID": 2,
            "LevelID": 3,
            "Amps": 100,
            "Voltage": 400,
            "PowerKW": 40,
            "CurrentTypeID": 30,
            "Quantity": 1
        },
        {
            "ID": 231167,
            "ConnectionTypeID": 32,
            "LevelID": 3,
            "Amps": 100,
            "Voltage": 400,
            "PowerKW": 40,
            "CurrentTypeID": 30,
            "Quantity": 1
        }
    ],
    "GeneralComments": "Planned for future date. Not Operational.",
    "DatePlanned": "2020-09-01T00:00:00Z",
    "StatusTypeID": 150,
    "DateLastStatusUpdate": "2020-06-26T03:11:00Z",
    "DataQualityLevel": 3,
    "DateCreated": "2020-06-26T03:11:00Z",
    "SubmissionStatusTypeID": 100
}