{
    "MediaItems": [
        {
            "ID": 17433,
            "ChargePointID": 114731,
            "ItemURL": "https://s3-ap-southeast-2.amazonaws.com/openchargemap/images/IT/OCM114731/OCM-114731.orig.2019011411280769.jpg",
            "ItemThumbnailURL": "https://s3-ap-southeast-2.amazonaws.com/openchargemap/images/IT/OCM114731/OCM-114731.thmb.2019011411280769.jpg",
            "Comment": "",
            "IsEnabled": true,
            "IsVideo": false,
            "IsFeaturedItem": false,
            "IsExternalResource": false,
            "User": {
                "ID": 16306,
                "Username": "e-station"
            },
            "DateCreated": "2019-01-14T11:28:00Z"
        }
    ],
    "IsRecentlyVerified": false,
    "ID": 114731,
    "UUID": "BC2EC418-D8AF-49F9-883F-61CF07663B99",
    "DataProviderID": 1,
    "OperatorID": 45,
    "UsageTypeID": 1,
    "AddressInfo": {
        "ID": 115077,
        "Title": "Villa San Lorenza | e-Station",
        "AddressLine1": "Via Lama di Priso, 1",
        "Town": "Scala",
        "Postcode": "84010",
        "CountryID": 112,
        "Latitude": 40.6510862084104,
        "Longitude": 14.6051029840699,
        "ContactTelephone1": "3662286580",
        "ContactEmail": "albinoferrigno@hotmail.it",
        "DistanceUnit": 0
    },
    "Connections": [
        {
            "ID": 161468,
            "ConnectionTypeID": 25,
            "StatusTypeID": 50,
            "LevelID": 2,
            "Amps": 16,
            "Voltage": 230,
            "PowerKW": 3.7,
            "CurrentTypeID": 10,
            "Quantity": 1
        }
    ],
    "NumberOfPoints": 1,
    "StatusTypeID": 50,
    "DateLastStatusUpdate": "2019-01-14T13:12:00Z",
    "DataQualityLevel": 1,
    "DateCreated": "2019-01-14T11:28:00Z",
    "SubmissionStatusTypeID": 200
}