{
    "IsRecentlyVerified": false,
    "ID": 33539,
    "UUID": "644465E2-A832-4834-AD44-CDBA9B00409E",
    "DataProviderID": 26,
    "DataProvidersReference": "37725",
    "OperatorID": 179,
    "OperatorsReference": "Ecotap 112060",
    "UsageCost": "0.00 afhankelijk van pas",
    "AddressInfo": {
        "ID": 33885,
        "Title": "Overbeeke 10",
        "AddressLine1": "Overbeeke 10",
        "Town": "Sint-Michielsgestel",
        "Postcode": "5258 BL",
        "CountryID": 159,
        "Latitude": 51.675562,
        "Longitude": 5.392592,
        "RelatedURL": "http://www.ecotap.nl",
        "DistanceUnit": 0
    },
    "Connections": [
        {
            "ID": 37050,
            "ConnectionTypeID": 25,
            "LevelID": 2,
            "PowerKW": 11,
            "CurrentTypeID": 10
        }
    ],
    "NumberOfPoints": 2,
    "StatusTypeID": 50,
    "DateLastStatusUpdate": "2016-06-04T02:40:00Z",
    "DataQualityLevel": 3,
    "DateCreated": "2015-01-09T06:04:00Z",
    "SubmissionStatusTypeID": 100
}