{
    "IsRecentlyVerified": false,
    "ID": 152963,
    "UUID": "054BDF7D-8FE3-4E02-952C-AAD5B71E9E58",
    "DataProviderID": 28,
    "DataProvidersReference": "FR*S56*P56168*A",
    "OperatorID": 3379,
    "UsageTypeID": 5,
    "AddressInfo": {
        "ID": 153316,
        "Title": "Rue du Tramway",
        "AddressLine1": "Rue du Tramway 56340 Plouharnel",
        "CountryID": 80,
        "Latitude": 47.599028,
        "Longitude": -3.112396,
        "AccessComments": "24/24 7/7 jours",
        "DistanceUnit": 0
    },
    "Connections": [
        {
            "ID": 214377,
            "ConnectionTypeID": 1036,
            "StatusTypeID": 50,
            "LevelID": 2,
            "PowerKW": 22,
            "CurrentTypeID": 20
        },
        {
            "ID": 247665,
            "ConnectionTypeID": 33,
            "StatusTypeID": 50,
            "LevelID": 3,
            "PowerKW": 20,
            "CurrentTypeID": 30
        },
        {
            "ID": 247666,
            "ConnectionTypeID": 1036,
            "StatusTypeID": 50,
            "LevelID": 2,
            "PowerKW": 22,
            "CurrentTypeID": 20
        }
    ],
    "GeneralComments": "Recharge Gratuite",
    "StatusTypeID": 50,
    "DateLastStatusUpdate": "2020-08-27T05:13:00Z",
    "DataQualityLevel": 2,
    "DateCreated": "2020-03-15T10:54:00Z",
    "SubmissionStatusTypeID": 100
}