{
    "IsRecentlyVerified": false,
    "ID": 17381,
    "UUID": "B9C71F1A-32A4-4D4A-9DAF-FAD154134674",
    "DataProviderID": 22,
    "DataProvidersReference": "57574E4F5E30961F96C7E320BF15A5DD",
    "AddressInfo": {
        "ID": 17726,
        "Title": "日産プリンス兵庫販売灘店",
        "AddressLine1": "兵庫県神戸市灘区烏帽子町3-3-11",
        "CountryID": 114,
        "Latitude": 34.71012104,
        "Longitude": 135.2354338,
        "ContactTelephone1": "078-861-0877",
        "DistanceUnit": 0
    },
    "Connections": [
        {
            "ID": 17622,
            "ConnectionTypeID": 2,
            "LevelID": 2,
            "Amps": 100,
            "Voltage": 480,
            "PowerKW": 48,
            "Quantity": 1
        }
    ],
    "DateLastStatusUpdate": "2013-06-29T08:57:00Z",
    "DataQualityLevel": 2,
    "DateCreated": "2013-06-29T08:57:00Z",
    "SubmissionStatusTypeID": 200
}