{
    "IsRecentlyVerified": false,
    "ID": 130768,
    "UUID": "43D7EFFD-9D29-48E3-B61B-745E2EBB0B10",
    "DataProviderID": 1,
    "OperatorID": 5,
    "UsageTypeID": 1,
    "UsageCost": "$0.10/kWh",
    "AddressInfo": {
        "ID": 131114,
        "Title": "Burnsville Pillsbury Ave",
        "AddressLine1": "12751 Pillsbury Ave",
        "Town": "Burnsville",
        "StateOrProvince": "Minnesota",
        "Postcode": "55337",
        "CountryID": 2,
        "Latitude": 44.7729235967871,
        "Longitude": -93.2798190564154,
        "DistanceUnit": 0
    },
    "Connections": [
        {
            "ID": 183083,
            "ConnectionTypeID": 1,
            "LevelID": 2,
            "PowerKW": 6.6,
            "CurrentTypeID": 10,
            "Quantity": 2
        }
    ],
    "NumberOfPoints": 1,
    "GeneralComments": "When not charging:  $2.00/hr After 1 hr grace period",
    "StatusTypeID": 50,
    "DateLastStatusUpdate": "2019-08-14T22:26:00Z",
    "DataQualityLevel": 1,
    "DateCreated": "2019-08-14T09:05:00Z",
    "SubmissionStatusTypeID": 200
}