{
    "IsRecentlyVerified": false,
    "ID": 88626,
    "UUID": "4F9D9B6B-5B64-48FE-9686-468ABF3CE36B",
    "DataProviderID": 1,
    "OperatorID": 86,
    "UsageTypeID": 1,
    "AddressInfo": {
        "ID": 88972,
        "Title": "Volkskunde Museum",
        "AddressLine1": "Berggasse 3",
        "Town": "Burglengenfeld",
        "StateOrProvince": "Landkreis Schwandorf",
        "Postcode": "93133",
        "CountryID": 87,
        "Latitude": 49.20925025910822,
        "Longitude": 12.040301575393636,
        "ContactTelephone1": "+49 9471 701811",
        "AccessComments": "24/7 nutzbar auf dem Parkplatz des Oberpfälzer Volkskundemuseums neben den Fahrradständern. Die SM!GHT Base Ladesäule ist mit jeder RFID Karte freischaltbar. Zuparkgefahr da unbeschildert!",
        "RelatedURL": "http://burglengenfeld.de/",
        "DistanceUnit": 0
    },
    "Connections": [
        {
            "ID": 125703,
            "ConnectionTypeID": 25,
            "StatusTypeID": 50,
            "LevelID": 2,
            "Amps": 32,
            "Voltage": 400,
            "PowerKW": 22,
            "CurrentTypeID": 20,
            "Quantity": 1
        }
    ],
    "NumberOfPoints": 1,
    "StatusTypeID": 50,
    "DateLastStatusUpdate": "2017-06-06T06:16:00Z",
    "DataQualityLevel": 1,
    "DateCreated": "2017-06-06T06:16:00Z",
    "SubmissionStatusTypeID": 200
}