{
    "IsRecentlyVerified": false,
    "ID": 126222,
    "UUID": "A2755DA7-12B5-458C-A079-109414114CA2",
    "DataProviderID": 1,
    "OperatorID": 3,
    "OperatorsReference": "PG-81841",
    "UsageTypeID": 4,
    "UsageCost": "£1.00/hour",
    "AddressInfo": {
        "ID": 126568,
        "Title": "Seaview Holiday Village",
        "AddressLine1": "Polperro",
        "Town": "Looe",
        "StateOrProvince": "Cornwall",
        "Postcode": "PL13 2JE",
        "CountryID": 1,
        "Latitude": 50.344824,
        "Longitude": -4.510346,
        "DistanceUnit": 0
    },
    "Connections": [
        {
            "ID": 176904,
            "ConnectionTypeID": 25,
            "StatusTypeID": 50,
            "LevelID": 2,
            "Amps": 32,
            "Voltage": 230,
            "PowerKW": 7,
            "CurrentTypeID": 10,
            "Quantity": 2
        }
    ],
    "NumberOfPoints": 2,
    "GeneralComments": "This is an open charge unit installed at the Seaview Holiday Village car park in Polperro, Looe, Cornwall",
    "StatusTypeID": 50,
    "DateLastStatusUpdate": "2019-07-16T08:28:00Z",
    "DataQualityLevel": 1,
    "DateCreated": "2019-05-13T14:54:00Z",
    "SubmissionStatusTypeID": 200
}