{
    "IsRecentlyVerified": false,
    "ID": 85462,
    "UUID": "FB4EDA33-6E55-41B8-9539-71E8B6B4039B",
    "DataProviderID": 1,
    "OperatorID": 23,
    "OperatorsReference": "26412",
    "UsageTypeID": 6,
    "AddressInfo": {
        "ID": 85808,
        "Title": "Le Moulin de la Coudre",
        "AddressLine1": "2 Rue des Gravottes",
        "Town": "Venoy",
        "Postcode": "89290",
        "CountryID": 80,
        "Latitude": 47.802153,
        "Longitude": 3.660254,
        "ContactTelephone1": "+33 3 86 40 23 79",
        "DistanceUnit": 0
    },
    "Connections": [
        {
            "ID": 121539,
            "ConnectionTypeID": 30,
            "StatusTypeID": 50,
            "LevelID": 2,
            "Amps": 32,
            "Voltage": 230,
            "PowerKW": 17,
            "CurrentTypeID": 20,
            "Quantity": 1
        }
    ],
    "NumberOfPoints": 1,
    "GeneralComments": "1 Tesla Connector, up to 17kW.Available for patrons only. Please see front desk.",
    "StatusTypeID": 50,
    "DateLastStatusUpdate": "2018-10-03T15:41:00Z",
    "DataQualityLevel": 1,
    "DateCreated": "2017-04-05T05:41:00Z",
    "SubmissionStatusTypeID": 200
}