{
    "IsRecentlyVerified": false,
    "ID": 14500,
    "UUID": "42D4C08C-7927-41CF-82AC-0CA36A46588A",
    "DataProviderID": 2,
    "DataProvidersReference": "48030",
    "UsageTypeID": 2,
    "AddressInfo": {
        "ID": 14397,
        "Title": "Florida Power & Light - Central Broward Area Office",
        "AddressLine1": "7201 Cypress Rd",
        "Town": "Plantation",
        "StateOrProvince": "FL",
        "Postcode": "33317",
        "CountryID": 2,
        "Latitude": 26.124731,
        "Longitude": -80.243828,
        "ContactTelephone1": "",
        "AccessComments": "",
        "RelatedURL": "",
        "DistanceUnit": 0
    },
    "Connections": [
        {
            "ID": 11977,
            "ConnectionTypeID": 1,
            "LevelID": 2,
            "Amps": 16,
            "Voltage": 230,
            "PowerKW": 3.7,
            "CurrentTypeID": 10,
            "Quantity": 4
        },
        {
            "ID": 21781,
            "ConnectionTypeID": 1,
            "LevelID": 2,
            "Quantity": 3
        }
    ],
    "DateLastStatusUpdate": "2020-06-26T02:52:00Z",
    "DataQualityLevel": 3,
    "DateCreated": "2012-12-06T16:49:00Z",
    "SubmissionStatusTypeID": 100
}