{
    "IsRecentlyVerified": false,
    "ID": 181130,
    "UUID": "52B6A2C1-0C26-4285-9884-CA28EEB8D69B",
    "DataProviderID": 29,
    "DataProvidersReference": "5563",
    "OperatorID": 45,
    "AddressInfo": {
        "ID": 181489,
        "Title": "Berliner Str. 21",
        "AddressLine1": "Berliner Str. 21",
        "Town": "Gersfeld (Rhön)",
        "Postcode": "36129",
        "CountryID": 87,
        "Latitude": 50.451256,
        "Longitude": 9.911904,
        "DistanceUnit": 0
    },
    "Connections": [
        {
            "ID": 285066,
            "ConnectionTypeID": 33,
            "StatusTypeID": 50,
            "LevelID": 3,
            "PowerKW": 22,
            "CurrentTypeID": 30
        },
        {
            "ID": 285067,
            "ConnectionTypeID": 25,
            "StatusTypeID": 50,
            "LevelID": 2,
            "PowerKW": 11,
            "CurrentTypeID": 20
        }
    ],
    "StatusTypeID": 50,
    "DateLastStatusUpdate": "2021-07-09T03:19:00Z",
    "MetadataValues": [
        {
            "ID": 13424,
            "MetadataFieldID": 4,
            "ItemValue": "Data from the German chargepoint registry provided by Bundesnetzagentur.de under the CC-BY 4.0 license"
        }
    ],
    "DataQualityLevel": 3,
    "DateCreated": "2021-07-08T10:01:00Z",
    "SubmissionStatusTypeID": 100
}