{
    "IsRecentlyVerified": false,
    "ID": 167069,
    "UUID": "1FCE516E-E03F-47E6-A1A7-F9D764D680BA",
    "DataProviderID": 18,
    "DataProvidersReference": "44048328f9d564d2626e5059184b1b1e",
    "OperatorID": 3345,
    "UsageTypeID": 5,
    "AddressInfo": {
        "ID": 167428,
        "Title": "41 Druid Road",
        "AddressLine1": "41 Druid Road",
        "Town": "Coventry",
        "Postcode": "CV2 4AU",
        "CountryID": 1,
        "Latitude": 52.409803,
        "Longitude": -1.476903,
        "AccessComments": "",
        "RelatedURL": "https://char.gy",
        "DistanceUnit": 0
    },
    "Connections": [
        {
            "ID": 252979,
            "ConnectionTypeID": 25,
            "Reference": "00410",
            "StatusTypeID": 50,
            "LevelID": 2,
            "Amps": 16,
            "Voltage": 230,
            "PowerKW": 3.7,
            "CurrentTypeID": 10
        }
    ],
    "StatusTypeID": 0,
    "DateLastStatusUpdate": "2020-08-27T08:10:00Z",
    "MetadataValues": [
        {
            "ID": 7826,
            "MetadataFieldID": 4,
            "ItemValue": "Contains public sector information licensed under the Open Government Licence v2.0. http://www.nationalarchives.gov.uk/doc/open-government-licence/version/2/"
        }
    ],
    "DataQualityLevel": 3,
    "DateCreated": "2020-08-27T08:10:00Z",
    "SubmissionStatusTypeID": 100
}