{
    "IsRecentlyVerified": false,
    "ID": 130407,
    "UUID": "F150BED5-D6C5-46D9-B352-7B8CA4637398",
    "DataProviderID": 1,
    "OperatorID": 80,
    "UsageTypeID": 4,
    "AddressInfo": {
        "ID": 130753,
        "Title": "Casale Monferrato Valentino | EnelX",
        "AddressLine1": "Corso Valentino, 153",
        "Town": "Casale Monferrato",
        "StateOrProvince": "AL",
        "Postcode": "15033",
        "CountryID": 112,
        "Latitude": 45.1250028642515,
        "Longitude": 8.45076198280799,
        "ContactTelephone1": "800.069.850",
        "RelatedURL": "https://www.enelx.com/it/it/emobility",
        "DistanceUnit": 0
    },
    "Connections": [
        {
            "ID": 182575,
            "ConnectionTypeID": 25,
            "StatusTypeID": 50,
            "LevelID": 2,
            "Amps": 32,
            "Voltage": 400,
            "PowerKW": 22,
            "CurrentTypeID": 20,
            "Quantity": 2
        }
    ],
    "NumberOfPoints": 2,
    "StatusTypeID": 50,
    "DateLastStatusUpdate": "2019-08-05T06:55:00Z",
    "DataQualityLevel": 1,
    "DateCreated": "2019-08-05T06:55:00Z",
    "SubmissionStatusTypeID": 200
}