{
    "IsRecentlyVerified": false,
    "ID": 53617,
    "UUID": "970CD025-ABFF-44A2-AE17-BDAB23621EFB",
    "DataProviderID": 26,
    "DataProvidersReference": "67704",
    "OperatorID": 78,
    "OperatorsReference": "Essent EM-LU-00003290-01-00001",
    "UsageCost": "0.00 jaarabonnement",
    "AddressInfo": {
        "ID": 53963,
        "Title": "Rue Charles Jacquinot",
        "AddressLine1": "Rue Charles Jacquinot",
        "Town": "Bettembourg",
        "Postcode": "3290",
        "CountryID": 132,
        "Latitude": 49.5081801,
        "Longitude": 6.1032353,
        "RelatedURL": "http://www.essent.nl",
        "DistanceUnit": 0
    },
    "Connections": [
        {
            "ID": 66792,
            "ConnectionTypeID": 25,
            "LevelID": 2,
            "PowerKW": 11,
            "CurrentTypeID": 10
        },
        {
            "ID": 66793,
            "ConnectionTypeID": 25,
            "LevelID": 2,
            "PowerKW": 11,
            "CurrentTypeID": 10
        }
    ],
    "NumberOfPoints": 1,
    "StatusTypeID": 50,
    "DateLastStatusUpdate": "2016-06-04T02:38:00Z",
    "DataQualityLevel": 3,
    "DateCreated": "2015-09-20T11:50:00Z",
    "SubmissionStatusTypeID": 100
}