{
    "MediaItems": [
        {
            "ID": 28306,
            "ChargePointID": 175839,
            "ItemURL": "https://s3-ap-southeast-2.amazonaws.com/openchargemap/images/DE/OCM175839/OCM-175839.orig.2021062615524366.jpg",
            "ItemThumbnailURL": "https://s3-ap-southeast-2.amazonaws.com/openchargemap/images/DE/OCM175839/OCM-175839.thmb.2021062615524366.jpg",
            "Comment": "",
            "IsEnabled": true,
            "IsVideo": false,
            "IsFeaturedItem": false,
            "IsExternalResource": false,
            "User": {
                "ID": 32810,
                "Username": "Tom_Fred"
            },
            "DateCreated": "2021-06-26T15:53:00Z"
        },
        {
            "ID": 28307,
            "ChargePointID": 175839,
            "ItemURL": "https://s3-ap-southeast-2.amazonaws.com/openchargemap/images/DE/OCM175839/OCM-175839.orig.2021062615530045.jpg",
            "ItemThumbnailURL": "https://s3-ap-southeast-2.amazonaws.com/openchargemap/images/DE/OCM175839/OCM-175839.thmb.2021062615530045.jpg",
            "Comment": "",
            "IsEnabled": true,
            "IsVideo": false,
            "IsFeaturedItem": false,
            "IsExternalResource": false,
            "User": {
                "ID": 32810,
                "Username": "Tom_Fred"
            },
            "DateCreated": "2021-06-26T15:53:00Z"
        },
        {
            "ID": 28308,
            "ChargePointID": 175839,
            "ItemURL": "https://s3-ap-southeast-2.amazonaws.com/openchargemap/images/DE/OCM175839/OCM-175839.orig.2021062615532044.jpg",
            "ItemThumbnailURL": "https://s3-ap-southeast-2.amazonaws.com/openchargemap/images/DE/OCM175839/OCM-175839.thmb.2021062615532044.jpg",
            "Comment": "",
            "IsEnabled": true,
            "IsVideo": false,
            "IsFeaturedItem": false,
            "IsExternalResource": false,
            "User": {
                "ID": 32810,
                "Username": "Tom_Fred"
            },
            "DateCreated": "2021-06-26T15:53:00Z"
        }
    ],
    "IsRecentlyVerified": false,
    "ID": 175839,
    "UUID": "FA824839-FB5D-4463-8FDA-10312EDD9B7E",
    "DataProviderID": 1,
    "OperatorID": 214,
    "UsageTypeID": 4,
    "AddressInfo": {
        "ID": 176198,
        "Title": "Fritz-Haber-Institut",
        "AddressLine1": "Faradayweg",
        "Town": "Berlin",
        "StateOrProvince": "Berlin",
        "Postcode": "14195",
        "CountryID": 87,
        "Latitude": 52.44873435219759,
        "Longitude": 13.283618941100485,
        "DistanceUnit": 0
    },
    "Connections": [
        {
            "ID": 273071,
            "ConnectionTypeID": 25,
            "Reference": "DE*MDS*E000846",
            "StatusTypeID": 50,
            "LevelID": 2,
            "Amps": 32,
            "Voltage": 400,
            "PowerKW": 22,
            "CurrentTypeID": 20,
            "Quantity": 6
        }
    ],
    "NumberOfPoints": 6,
    "StatusTypeID": 50,
    "DateLastStatusUpdate": "2021-06-26T15:53:00Z",
    "DataQualityLevel": 1,
    "DateCreated": "2021-06-16T17:17:00Z",
    "SubmissionStatusTypeID": 200
}