{
    "IsRecentlyVerified": false,
    "ID": 133775,
    "UUID": "B7C45EF6-EDF6-4891-B177-19D9CFCF9210",
    "DataProviderID": 1,
    "OperatorID": 23,
    "OperatorsReference": "34764",
    "UsageTypeID": 4,
    "UsageCost": "€0.30/kWh; altre tariffe per le auto più vecchie",
    "AddressInfo": {
        "ID": 134121,
        "Title": "Vicenza Supercharger",
        "AddressLine1": "20 Via Brescia",
        "Town": "Vicenza",
        "Postcode": "36040",
        "CountryID": 112,
        "Latitude": 45.50845,
        "Longitude": 11.626019,
        "DistanceUnit": 0
    },
    "Connections": [
        {
            "ID": 187218,
            "ConnectionTypeID": 27,
            "StatusTypeID": 50,
            "LevelID": 3,
            "PowerKW": 120,
            "CurrentTypeID": 30,
            "Quantity": 12
        }
    ],
    "NumberOfPoints": 12,
    "GeneralComments": "12 Superchargers, available 24/7, up to 120kW",
    "StatusTypeID": 50,
    "DateLastStatusUpdate": "2019-10-30T16:33:00Z",
    "DataQualityLevel": 1,
    "DateCreated": "2019-10-26T05:55:00Z",
    "SubmissionStatusTypeID": 200
}