{
    "IsRecentlyVerified": false,
    "ID": 129415,
    "UUID": "0CDC1C27-C1D1-42A8-9838-F45629EC4DCF",
    "DataProviderID": 1,
    "OperatorID": 80,
    "UsageTypeID": 4,
    "AddressInfo": {
        "ID": 129761,
        "Title": "Torre Melissa Berlinguer | EnelX",
        "AddressLine1": "Viale E. Berlinguer",
        "AddressLine2": "Torre Melissa",
        "Town": "Melissa",
        "StateOrProvince": "KR",
        "Postcode": "88814",
        "CountryID": 112,
        "Latitude": 39.3107449101564,
        "Longitude": 17.1080078459265,
        "ContactTelephone1": "800.069.850",
        "RelatedURL": "https://www.enelx.com/it/it/emobility",
        "DistanceUnit": 0
    },
    "Connections": [
        {
            "ID": 181121,
            "ConnectionTypeID": 25,
            "StatusTypeID": 150,
            "LevelID": 2,
            "Amps": 32,
            "Voltage": 400,
            "PowerKW": 22,
            "CurrentTypeID": 20,
            "Quantity": 2
        }
    ],
    "NumberOfPoints": 2,
    "StatusTypeID": 150,
    "DateLastStatusUpdate": "2019-07-19T14:28:00Z",
    "DataQualityLevel": 1,
    "DateCreated": "2019-07-19T14:28:00Z",
    "SubmissionStatusTypeID": 200
}