{
    "IsRecentlyVerified": false,
    "ID": 7690,
    "UUID": "0DEFC0F6-D964-4058-AA39-77D4E0178FCF",
    "DataProviderID": 15,
    "DataProvidersReference": "10747",
    "OperatorID": 42,
    "UsageTypeID": 1,
    "AddressInfo": {
        "ID": 7587,
        "Title": "17420 Hall Rd.",
        "AddressLine1": "17420 Hall Rd.",
        "Town": "Clinton Township",
        "StateOrProvince": "MI",
        "Postcode": "48038",
        "CountryID": 2,
        "Latitude": 42.6258553834295,
        "Longitude": -82.9459947194136,
        "ContactTelephone1": "(586) 226-0330",
        "RelatedURL": "http://carstations.com/10747",
        "DistanceUnit": 0
    },
    "Connections": [],
    "NumberOfPoints": 2,
    "GeneralComments": "see OCM-28912 This is that charge location. ",
    "StatusTypeID": 0,
    "DateLastStatusUpdate": "2019-05-13T12:48:00Z",
    "DataQualityLevel": 1,
    "DateCreated": "2011-11-11T12:04:00Z",
    "SubmissionStatusTypeID": 100
}