{
    "IsRecentlyVerified": false,
    "ID": 37402,
    "UUID": "1F9DFB6D-5B59-4C54-83B3-A024B32E8BB7",
    "DataProviderID": 26,
    "DataProvidersReference": "49645",
    "OperatorID": 78,
    "OperatorsReference": "Essent EM-NL-00000363-04-00060",
    "UsageCost": "0.00 jaarabonnement",
    "AddressInfo": {
        "ID": 37748,
        "Title": "Baarsstraat 27A",
        "AddressLine1": "Baarsstraat 27A",
        "Town": "Amsterdam",
        "Postcode": "1075 RV",
        "CountryID": 159,
        "Latitude": 52.349995,
        "Longitude": 4.854641,
        "RelatedURL": "http://www.essent.nl",
        "DistanceUnit": 0
    },
    "Connections": [
        {
            "ID": 40913,
            "ConnectionTypeID": 25,
            "LevelID": 2,
            "PowerKW": 11,
            "CurrentTypeID": 10
        },
        {
            "ID": 48939,
            "ConnectionTypeID": 25,
            "LevelID": 2,
            "PowerKW": 11,
            "CurrentTypeID": 10
        }
    ],
    "NumberOfPoints": 1,
    "StatusTypeID": 50,
    "DateLastStatusUpdate": "2016-06-04T02:53:00Z",
    "DataQualityLevel": 3,
    "DateCreated": "2015-01-09T06:07:00Z",
    "SubmissionStatusTypeID": 100
}