{
    "IsRecentlyVerified": false,
    "ID": 20180,
    "UUID": "D37CACEE-EBB7-4A6C-9196-832CA1A7408B",
    "DataProviderID": 1,
    "OperatorID": 1,
    "UsageTypeID": 0,
    "UsageCost": "",
    "AddressInfo": {
        "ID": 20525,
        "Title": "Ecomobiles 33",
        "AddressLine1": "84 Rue Jean Mermoz ",
        "AddressLine2": "",
        "Town": "",
        "StateOrProvince": "Le Haillan",
        "Postcode": "33185",
        "CountryID": 80,
        "Latitude": 44.86977,
        "Longitude": -0.66244,
        "ContactTelephone1": "",
        "ContactTelephone2": "",
        "ContactEmail": "",
        "AccessComments": "Ouvert à tous",
        "RelatedURL": "",
        "DistanceUnit": 0
    },
    "Connections": [],
    "GeneralComments": "",
    "StatusTypeID": 50,
    "DateLastStatusUpdate": "2013-11-06T14:19:00Z",
    "DataQualityLevel": 1,
    "DateCreated": "2013-11-06T11:50:00Z",
    "SubmissionStatusTypeID": 200
}