{
    "UserComments": [
        {
            "ID": 14206,
            "ChargePointID": 67845,
            "CommentTypeID": 1000,
            "UserName": "riccardofox",
            "Comment": "Zurich or Croatia? I think Zurich, because the point shown on the map there is nothing.",
            "DateCreated": "2016-09-04T08:22:30.697Z",
            "User": {
                "ID": 9245,
                "Username": "riccardofox"
            },
            "CheckinStatusTypeID": 150
        }
    ],
    "IsRecentlyVerified": false,
    "ID": 67845,
    "UUID": "C4B001C5-0262-4B2A-B61A-78F37B26A83B",
    "DataProviderID": 26,
    "DataProvidersReference": "93621",
    "OperatorID": 73,
    "OperatorsReference": "EV-Box EVB-P1408206",
    "UsageCost": "0.00 jaarabonnement",
    "AddressInfo": {
        "ID": 68191,
        "Title": "Funkwiesenstrasse 83",
        "AddressLine1": "Funkwiesenstrasse 83",
        "Town": "Zürich",
        "Postcode": "8050",
        "CountryID": 60,
        "Latitude": 45.36178,
        "Longitude": 13.63066,
        "RelatedURL": "http://www.ev-box.nl",
        "DistanceUnit": 0
    },
    "Connections": [
        {
            "ID": 94408,
            "ConnectionTypeID": 25,
            "LevelID": 2,
            "PowerKW": 11,
            "CurrentTypeID": 10
        }
    ],
    "NumberOfPoints": 1,
    "StatusTypeID": 50,
    "DateLastStatusUpdate": "2016-09-04T08:23:00Z",
    "DataQualityLevel": 3,
    "DateCreated": "2016-06-04T02:37:00Z",
    "SubmissionStatusTypeID": 100
}