{
    "IsRecentlyVerified": false,
    "ID": 179515,
    "UUID": "E7009F81-CEA6-4B66-AEF4-88A8501810E1",
    "DataProviderID": 29,
    "DataProvidersReference": "15601",
    "AddressInfo": {
        "ID": 179874,
        "Title": "Marktplatz 10",
        "AddressLine1": "Marktplatz 10",
        "Town": "Heilsbronn",
        "Postcode": "91560",
        "CountryID": 87,
        "Latitude": 49.338558,
        "Longitude": 10.790433,
        "DistanceUnit": 0
    },
    "Connections": [
        {
            "ID": 281433,
            "ConnectionTypeID": 25,
            "StatusTypeID": 50,
            "LevelID": 2,
            "PowerKW": 22,
            "CurrentTypeID": 20
        },
        {
            "ID": 281434,
            "ConnectionTypeID": 25,
            "StatusTypeID": 50,
            "LevelID": 2,
            "PowerKW": 22,
            "CurrentTypeID": 20
        }
    ],
    "StatusTypeID": 50,
    "DateLastStatusUpdate": "2021-07-09T03:16:00Z",
    "MetadataValues": [
        {
            "ID": 11809,
            "MetadataFieldID": 4,
            "ItemValue": "Data from the German chargepoint registry provided by Bundesnetzagentur.de under the CC-BY 4.0 license"
        }
    ],
    "DataQualityLevel": 3,
    "DateCreated": "2021-07-08T09:59:00Z",
    "SubmissionStatusTypeID": 100
}