{
    "IsRecentlyVerified": false,
    "ID": 158036,
    "UUID": "4B78A34E-76B7-43BD-9617-7FA408806578",
    "DataProviderID": 1,
    "OperatorID": 8,
    "UsageTypeID": 2,
    "AddressInfo": {
        "ID": 158390,
        "Title": "Hamil Road",
        "AddressLine1": "Hamil Road",
        "Town": "Stoke-on-Trent",
        "Postcode": "ST6 1AW",
        "CountryID": 1,
        "Latitude": 53.048576,
        "Longitude": -2.192185,
        "AccessComments": "",
        "RelatedURL": "https://www.bpchargemaster.com",
        "DistanceUnit": 0
    },
    "Connections": [
        {
            "ID": 227823,
            "ConnectionTypeID": 0,
            "Reference": "2",
            "StatusTypeID": 210,
            "LevelID": 2,
            "Amps": 125,
            "Voltage": 400,
            "PowerKW": 7,
            "CurrentTypeID": 10,
            "Quantity": 1
        }
    ],
    "StatusTypeID": 210,
    "DateLastStatusUpdate": "2020-10-06T20:34:00Z",
    "MetadataValues": [
        {
            "ID": 7569,
            "MetadataFieldID": 4,
            "ItemValue": "Contains public sector information licensed under the Open Government Licence v2.0. http://www.nationalarchives.gov.uk/doc/open-government-licence/version/2/"
        }
    ],
    "DataQualityLevel": 3,
    "DateCreated": "2020-06-25T10:00:00Z",
    "SubmissionStatusTypeID": 100
}