{
    "IsRecentlyVerified": false,
    "ID": 132062,
    "UUID": "857BF6C2-9B41-4886-AC96-32568E1FD5C9",
    "DataProviderID": 1,
    "OperatorID": 80,
    "UsageTypeID": 4,
    "AddressInfo": {
        "ID": 132408,
        "Title": "Biccari Mia Gioia | EnelX",
        "AddressLine1": "Via Mia Gioia",
        "Town": "Biccari",
        "StateOrProvince": "FG",
        "Postcode": "71032",
        "CountryID": 112,
        "Latitude": 41.3991988370021,
        "Longitude": 15.196351113838,
        "ContactTelephone1": "800.069.850",
        "RelatedURL": "https://www.enelx.com/it/it/emobility",
        "DistanceUnit": 0
    },
    "Connections": [
        {
            "ID": 184782,
            "ConnectionTypeID": 25,
            "StatusTypeID": 50,
            "LevelID": 2,
            "Amps": 32,
            "Voltage": 400,
            "PowerKW": 22,
            "CurrentTypeID": 20,
            "Quantity": 2
        }
    ],
    "NumberOfPoints": 2,
    "StatusTypeID": 50,
    "DateLastStatusUpdate": "2019-09-19T13:31:00Z",
    "DataQualityLevel": 1,
    "DateCreated": "2019-09-19T13:31:00Z",
    "SubmissionStatusTypeID": 200
}