{
    "IsRecentlyVerified": false,
    "ID": 122959,
    "UUID": "3407B35D-0AC6-4F8C-BB27-08631B78E20B",
    "DataProviderID": 2,
    "DataProvidersReference": "113353",
    "OperatorID": 23,
    "UsageTypeID": 2,
    "AddressInfo": {
        "ID": 123305,
        "Title": "Airbnb - Vista House - Tesla Destination",
        "AddressLine1": "4510 Prefumo Canyon Rd",
        "Town": "San Luis Obispo",
        "StateOrProvince": "CA",
        "Postcode": "93405",
        "CountryID": 2,
        "Latitude": 35.255364,
        "Longitude": -120.764393,
        "ContactTelephone1": "",
        "AccessComments": "Available for Airbnb patrons only; for Tesla use only",
        "RelatedURL": "https://www.tesla.com/destination-charging",
        "DistanceUnit": 0
    },
    "Connections": [
        {
            "ID": 172888,
            "ConnectionTypeID": 0,
            "LevelID": 2,
            "Amps": 16,
            "Voltage": 230,
            "PowerKW": 3,
            "CurrentTypeID": 10,
            "Quantity": 1
        }
    ],
    "DateLastStatusUpdate": "2019-04-06T05:03:00Z",
    "DataQualityLevel": 3,
    "DateCreated": "2019-04-06T05:03:00Z",
    "SubmissionStatusTypeID": 100
}