{
    "IsRecentlyVerified": false,
    "ID": 80029,
    "UUID": "BF621397-0268-45D5-816D-43C9D7AD332F",
    "DataProviderID": 1,
    "OperatorID": 23,
    "OperatorsReference": "23424",
    "UsageTypeID": 6,
    "UsageCost": "Free",
    "AddressInfo": {
        "ID": 80375,
        "Title": "Vitalhotel Therme Geinberg",
        "AddressLine1": "1 Thermenpl.",
        "Town": "Geinberg",
        "Postcode": "4943",
        "CountryID": 19,
        "Latitude": 48.262336,
        "Longitude": 13.297336,
        "ContactTelephone1": "+43 7723 8501 0",
        "DistanceUnit": 0
    },
    "Connections": [
        {
            "ID": 114678,
            "ConnectionTypeID": 30,
            "StatusTypeID": 50,
            "LevelID": 2,
            "Amps": 32,
            "Voltage": 400,
            "PowerKW": 22,
            "CurrentTypeID": 20,
            "Quantity": 1
        }
    ],
    "NumberOfPoints": 1,
    "GeneralComments": "1 Tesla Connector, up to 22kW.Available for patrons only. Please see front desk.",
    "StatusTypeID": 50,
    "DateLastStatusUpdate": "2018-10-03T21:06:00Z",
    "DataQualityLevel": 1,
    "DateCreated": "2017-01-30T18:21:00Z",
    "SubmissionStatusTypeID": 200
}