{
    "IsRecentlyVerified": false,
    "ID": 84661,
    "UUID": "B8C668FC-FCBA-40F6-9E46-BD990D5F9E55",
    "DataProviderID": 1,
    "OperatorID": 45,
    "UsageTypeID": 1,
    "AddressInfo": {
        "ID": 85007,
        "Title": "Gemeindeamt",
        "AddressLine1": "Wennedacher Straße 5",
        "Town": "Maselheim",
        "StateOrProvince": "Verwaltungsgemeinschaft Biberach an der Riß",
        "Postcode": "88437",
        "CountryID": 87,
        "Latitude": 48.1338356,
        "Longitude": 9.885448999999994,
        "AccessComments": "24/7 kostenlos nutzbare SM!GT Ladelaterne .",
        "DistanceUnit": 0
    },
    "Connections": [
        {
            "ID": 120257,
            "ConnectionTypeID": 25,
            "StatusTypeID": 50,
            "LevelID": 2,
            "Amps": 32,
            "Voltage": 400,
            "PowerKW": 22,
            "CurrentTypeID": 20,
            "Quantity": 1
        },
        {
            "ID": 120258,
            "ConnectionTypeID": 28,
            "StatusTypeID": 50,
            "LevelID": 2,
            "Amps": 16,
            "Voltage": 230,
            "PowerKW": 3.7,
            "CurrentTypeID": 10,
            "Quantity": 1
        }
    ],
    "NumberOfPoints": 1,
    "StatusTypeID": 50,
    "DateLastStatusUpdate": "2017-03-08T09:19:00Z",
    "DataQualityLevel": 1,
    "DateCreated": "2017-03-08T09:19:00Z",
    "SubmissionStatusTypeID": 200
}