{
    "IsRecentlyVerified": false,
    "ID": 31914,
    "UUID": "44C7D45B-8A9A-4029-9D53-A6BDFD26E2C5",
    "DataProviderID": 26,
    "DataProvidersReference": "30723",
    "OperatorsReference": "IKEA",
    "UsageCost": "0.00 onbekend",
    "AddressInfo": {
        "ID": 32260,
        "Title": "Rue Émile Zola",
        "AddressLine1": "Rue Émile Zola",
        "Town": "Plaisir",
        "Postcode": "78370",
        "CountryID": 80,
        "Latitude": 48.817223,
        "Longitude": 1.949075,
        "DistanceUnit": 0
    },
    "Connections": [
        {
            "ID": 35425,
            "ConnectionTypeID": 2,
            "LevelID": 3,
            "PowerKW": 50,
            "CurrentTypeID": 30
        }
    ],
    "NumberOfPoints": 1,
    "StatusTypeID": 50,
    "DateLastStatusUpdate": "2016-03-03T12:34:00Z",
    "DataQualityLevel": 3,
    "DateCreated": "2015-01-09T06:03:00Z",
    "SubmissionStatusTypeID": 100
}