{
    "IsRecentlyVerified": false,
    "ID": 93579,
    "UUID": "43F799D1-469A-452D-ABA4-5C6B1B2B59E0",
    "DataProviderID": 1,
    "OperatorID": 23,
    "OperatorsReference": "35937",
    "UsageTypeID": 4,
    "AddressInfo": {
        "ID": 93925,
        "Title": "La Quinta Inn & Suites Houston Katy East",
        "AddressLine1": "22455 Katy Fwy",
        "Town": "Katy",
        "StateOrProvince": "Texas",
        "Postcode": "77450",
        "CountryID": 2,
        "Latitude": 29.784211,
        "Longitude": -95.761397,
        "ContactTelephone1": "(281) 392-9800",
        "DistanceUnit": 0
    },
    "Connections": [
        {
            "ID": 132516,
            "ConnectionTypeID": 30,
            "StatusTypeID": 50,
            "LevelID": 2,
            "PowerKW": 16,
            "CurrentTypeID": 20,
            "Quantity": 2
        }
    ],
    "NumberOfPoints": 2,
    "GeneralComments": "2 Tesla Connectors, up to 16kW.Available for customers. Self park.",
    "StatusTypeID": 50,
    "DateLastStatusUpdate": "2017-10-02T05:34:00Z",
    "DataQualityLevel": 1,
    "DateCreated": "2017-10-02T05:34:00Z",
    "SubmissionStatusTypeID": 200
}