{
    "IsRecentlyVerified": false,
    "ID": 51343,
    "UUID": "5A513713-F037-42BA-AED1-BB5C66954C12",
    "DataProviderID": 26,
    "DataProvidersReference": "26075",
    "OperatorID": 78,
    "OperatorsReference": "Essent EM-PL-00000001-01-00002",
    "UsageCost": "0.00 jaarabonnement",
    "AddressInfo": {
        "ID": 51689,
        "Title": "Plac Defilad 1",
        "AddressLine1": "Plac Defilad 1",
        "Town": "Warszawa",
        "Postcode": "00-017",
        "CountryID": 179,
        "Latitude": 52.230524,
        "Longitude": 21.007401,
        "RelatedURL": "http://www.essent.nl",
        "DistanceUnit": 0
    },
    "Connections": [
        {
            "ID": 63555,
            "ConnectionTypeID": 25,
            "LevelID": 2,
            "PowerKW": 11,
            "CurrentTypeID": 10
        },
        {
            "ID": 63556,
            "ConnectionTypeID": 25,
            "LevelID": 2,
            "PowerKW": 11,
            "CurrentTypeID": 10
        }
    ],
    "NumberOfPoints": 1,
    "StatusTypeID": 50,
    "DateLastStatusUpdate": "2016-06-04T02:52:00Z",
    "DataQualityLevel": 3,
    "DateCreated": "2015-07-24T06:28:00Z",
    "SubmissionStatusTypeID": 100
}