{
    "IsRecentlyVerified": true,
    "DateLastVerified": "2021-08-11T08:24:00Z",
    "ID": 188695,
    "UUID": "9F2378D0-2240-4FBF-B579-44E1A2ED9120",
    "DataProviderID": 1,
    "OperatorID": 3364,
    "UsageTypeID": 4,
    "UsageCost": "35 CLP/min",
    "AddressInfo": {
        "ID": 189054,
        "Title": "Los Angeles Sur",
        "AddressLine1": "RUTA 5 SUR KM 518,5, Los Ángeles",
        "Town": "Los Ángeles",
        "StateOrProvince": "Biobío Region",
        "Postcode": "",
        "CountryID": 49,
        "Latitude": -37.54679675982506,
        "Longitude": -72.30950137724187,
        "RelatedURL": "https://copecvoltex.cl/",
        "DistanceUnit": 0
    },
    "Connections": [
        {
            "ID": 304849,
            "ConnectionTypeID": 25,
            "StatusTypeID": 50,
            "LevelID": 2,
            "PowerKW": 43,
            "Quantity": 1
        },
        {
            "ID": 304850,
            "ConnectionTypeID": 2,
            "StatusTypeID": 50,
            "LevelID": 2,
            "PowerKW": 50,
            "Quantity": 1
        },
        {
            "ID": 304851,
            "ConnectionTypeID": 33,
            "StatusTypeID": 50,
            "LevelID": 2,
            "PowerKW": 50,
            "Quantity": 1
        }
    ],
    "NumberOfPoints": 1,
    "StatusTypeID": 50,
    "DateLastStatusUpdate": "2021-08-11T08:24:00Z",
    "DataQualityLevel": 1,
    "DateCreated": "2021-08-11T08:24:00Z",
    "SubmissionStatusTypeID": 200
}