{
    "IsRecentlyVerified": false,
    "ID": 176979,
    "UUID": "8CB32E78-4544-486C-9F0B-48F76E1DD499",
    "DataProviderID": 29,
    "DataProvidersReference": "15535",
    "AddressInfo": {
        "ID": 177338,
        "Title": "Karlstraße 26",
        "AddressLine1": "Karlstraße 26",
        "Town": "Heyerode",
        "Postcode": "99988",
        "CountryID": 87,
        "Latitude": 51.164651,
        "Longitude": 10.313755,
        "DistanceUnit": 0
    },
    "Connections": [
        {
            "ID": 275581,
            "ConnectionTypeID": 25,
            "StatusTypeID": 50,
            "LevelID": 2,
            "PowerKW": 22,
            "CurrentTypeID": 20
        },
        {
            "ID": 275582,
            "ConnectionTypeID": 25,
            "StatusTypeID": 50,
            "LevelID": 2,
            "PowerKW": 22,
            "CurrentTypeID": 20
        }
    ],
    "StatusTypeID": 0,
    "DateLastStatusUpdate": "2021-07-12T02:46:00Z",
    "MetadataValues": [
        {
            "ID": 9273,
            "MetadataFieldID": 4,
            "ItemValue": "Data from the German chargepoint registry provided by Bundesnetzagentur.de under the CC-BY 4.0 license"
        }
    ],
    "DataQualityLevel": 3,
    "DateCreated": "2021-07-08T09:48:00Z",
    "SubmissionStatusTypeID": 100
}