{
    "IsRecentlyVerified": false,
    "ID": 182781,
    "UUID": "9B37E84C-8F55-4CB2-B24A-474948C2DE2F",
    "DataProviderID": 29,
    "DataProvidersReference": "19020",
    "OperatorID": 105,
    "AddressInfo": {
        "ID": 183140,
        "Title": "Hauptstraße 19",
        "AddressLine1": "Hauptstraße 19",
        "Town": "Möhnesee",
        "Postcode": "59519",
        "CountryID": 87,
        "Latitude": 51.496778,
        "Longitude": 8.12878,
        "DistanceUnit": 0
    },
    "Connections": [
        {
            "ID": 288937,
            "ConnectionTypeID": 25,
            "StatusTypeID": 50,
            "LevelID": 2,
            "PowerKW": 22,
            "CurrentTypeID": 20
        },
        {
            "ID": 288938,
            "ConnectionTypeID": 25,
            "StatusTypeID": 50,
            "LevelID": 2,
            "PowerKW": 22,
            "CurrentTypeID": 20
        }
    ],
    "StatusTypeID": 50,
    "DateLastStatusUpdate": "2021-07-12T02:47:00Z",
    "MetadataValues": [
        {
            "ID": 15074,
            "MetadataFieldID": 4,
            "ItemValue": "Data from the German chargepoint registry provided by Bundesnetzagentur.de under the CC-BY 4.0 license"
        }
    ],
    "DataQualityLevel": 3,
    "DateCreated": "2021-07-08T10:03:00Z",
    "SubmissionStatusTypeID": 100
}