{
    "IsRecentlyVerified": false,
    "ID": 122461,
    "UUID": "DA472EB4-44C4-4361-AB1A-A26273A9CBE1",
    "DataProviderID": 2,
    "DataProvidersReference": "94738",
    "OperatorID": 3372,
    "UsageTypeID": 2,
    "AddressInfo": {
        "ID": 122807,
        "Title": "Harbor Freight Tools",
        "AddressLine1": "26541 Agoura Rd",
        "Town": "Calabasas",
        "StateOrProvince": "CA",
        "Postcode": "91302",
        "CountryID": 2,
        "Latitude": 34.143918,
        "Longitude": -118.701718,
        "ContactTelephone1": "",
        "AccessComments": "Employee use only",
        "RelatedURL": "http://evconnect.com/",
        "DistanceUnit": 0
    },
    "Connections": [
        {
            "ID": 172354,
            "ConnectionTypeID": 1,
            "LevelID": 2,
            "Amps": 16,
            "Voltage": 230,
            "PowerKW": 3.7,
            "CurrentTypeID": 10,
            "Quantity": 9
        }
    ],
    "DateLastStatusUpdate": "2020-06-26T02:57:00Z",
    "DataQualityLevel": 3,
    "DateCreated": "2019-04-06T05:03:00Z",
    "SubmissionStatusTypeID": 100
}