{
    "IsRecentlyVerified": false,
    "ID": 38950,
    "UUID": "B13A7EFC-475E-4AA0-8076-5FCB191FBDC4",
    "DataProviderID": 26,
    "DataProvidersReference": "47881",
    "OperatorID": 178,
    "OperatorsReference": "EVnetNL DB0117",
    "UsageCost": "0.00 jaarabonnement",
    "AddressInfo": {
        "ID": 39296,
        "Title": "Waalderstraat 47",
        "AddressLine1": "Waalderstraat 47",
        "Town": "Texel",
        "Postcode": "1791 EB",
        "CountryID": 159,
        "Latitude": 53.056888,
        "Longitude": 4.798067,
        "ContactTelephone1": "0800-3522365",
        "RelatedURL": "http://www.evnet.nl",
        "DistanceUnit": 0
    },
    "Connections": [
        {
            "ID": 42461,
            "ConnectionTypeID": 25,
            "LevelID": 2,
            "PowerKW": 11,
            "CurrentTypeID": 10
        }
    ],
    "NumberOfPoints": 2,
    "StatusTypeID": 50,
    "DateLastStatusUpdate": "2016-06-04T02:56:00Z",
    "DataQualityLevel": 3,
    "DateCreated": "2015-01-09T06:08:00Z",
    "SubmissionStatusTypeID": 100
}