{
    "IsRecentlyVerified": false,
    "ID": 48374,
    "UUID": "EAECDFE6-AEE6-4540-A40C-BCDC610E630B",
    "DataProviderID": 1,
    "OperatorID": 3315,
    "OperatorsReference": "50462",
    "UsageTypeID": 4,
    "UsageCost": "Free",
    "AddressInfo": {
        "ID": 48720,
        "Title": "Rosyth Rail Halt Car Park",
        "AddressLine1": "Queensferry Road",
        "Town": "Rosyth",
        "Postcode": "KY11 2JE",
        "CountryID": 1,
        "Latitude": 56.04545,
        "Longitude": -3.427365,
        "DistanceUnit": 0
    },
    "Connections": [
        {
            "ID": 59812,
            "ConnectionTypeID": 25,
            "StatusTypeID": 50,
            "LevelID": 2,
            "Amps": 32,
            "Voltage": 230,
            "PowerKW": 7,
            "CurrentTypeID": 10,
            "Quantity": 2
        }
    ],
    "NumberOfPoints": 2,
    "StatusTypeID": 50,
    "DateLastStatusUpdate": "2018-07-28T05:17:00Z",
    "DataQualityLevel": 1,
    "DateCreated": "2015-06-25T07:53:00Z",
    "SubmissionStatusTypeID": 200
}