{
    "IsRecentlyVerified": false,
    "ID": 120489,
    "UUID": "155C8875-FB5E-4FCE-ABFE-6AD0819C7EDD",
    "DataProviderID": 2,
    "DataProvidersReference": "65746",
    "OperatorID": 5,
    "UsageTypeID": 1,
    "AddressInfo": {
        "ID": 120835,
        "Title": "VW KEARNY MESA",
        "AddressLine1": "8040 Balboa Ave",
        "Town": "San Diego",
        "StateOrProvince": "CA",
        "Postcode": "92111",
        "CountryID": 2,
        "Latitude": 32.8230886,
        "Longitude": -117.1494336,
        "ContactTelephone1": "888-758-4389",
        "AccessComments": "24 hours daily",
        "RelatedURL": "http://www.chargepoint.com/",
        "DistanceUnit": 0
    },
    "Connections": [
        {
            "ID": 169839,
            "ConnectionTypeID": 1,
            "LevelID": 2,
            "Amps": 16,
            "Voltage": 230,
            "PowerKW": 3,
            "CurrentTypeID": 10,
            "Quantity": 2
        }
    ],
    "DateLastStatusUpdate": "2019-12-24T09:09:00Z",
    "DataQualityLevel": 3,
    "DateCreated": "2019-04-01T04:59:00Z",
    "SubmissionStatusTypeID": 100
}