{
    "IsRecentlyVerified": false,
    "ID": 92837,
    "UUID": "2F9510DF-FBC8-4545-8F16-B55DCD1E05A6",
    "DataProviderID": 1,
    "OperatorID": 3,
    "OperatorsReference": "PG-81280,PSL-103149",
    "UsageTypeID": 6,
    "UsageCost": "Free",
    "AddressInfo": {
        "ID": 93183,
        "Title": "The Hyundai Centre-Hutchings Hyundai",
        "AddressLine1": "The Hyundai Centre",
        "Town": "Pontypridd",
        "Postcode": "CF37 5YH",
        "CountryID": 1,
        "Latitude": 51.575511,
        "Longitude": -3.295223,
        "DistanceUnit": 0
    },
    "Connections": [
        {
            "ID": 131508,
            "ConnectionTypeID": 25,
            "StatusTypeID": 50,
            "LevelID": 2,
            "Amps": 32,
            "Voltage": 230,
            "PowerKW": 7,
            "CurrentTypeID": 10,
            "Quantity": 3
        }
    ],
    "NumberOfPoints": 3,
    "GeneralComments": "This is an open charge unit installed at the Hutchings - The Hyundai center dealership in Pontypridd",
    "StatusTypeID": 50,
    "DateLastStatusUpdate": "2017-09-12T15:18:00Z",
    "DataQualityLevel": 1,
    "DateCreated": "2017-09-12T05:28:00Z",
    "SubmissionStatusTypeID": 200
}