{
    "IsRecentlyVerified": false,
    "ID": 134766,
    "UUID": "FA6C9F1D-C7AC-4A1D-9FEB-DF47A0DD9B94",
    "DataProviderID": 1,
    "OperatorID": 3296,
    "UsageTypeID": 5,
    "UsageCost": "£0.40/kWh",
    "AddressInfo": {
        "ID": 135112,
        "Title": "Booths Fulwood",
        "AddressLine1": "256/270 Sharoe Green Lane",
        "AddressLine2": "Fuylwood",
        "Town": "Preston",
        "StateOrProvince": "Lancashire",
        "Postcode": "PR2 9HD",
        "CountryID": 1,
        "Latitude": 53.79247051487371,
        "Longitude": -2.70591537274413,
        "DistanceUnit": 0
    },
    "Connections": [
        {
            "ID": 188560,
            "ConnectionTypeID": 33,
            "StatusTypeID": 50,
            "LevelID": 3,
            "CurrentTypeID": 30,
            "Quantity": 2
        },
        {
            "ID": 188561,
            "ConnectionTypeID": 2,
            "StatusTypeID": 50,
            "LevelID": 3,
            "CurrentTypeID": 30,
            "Quantity": 2
        }
    ],
    "NumberOfPoints": 2,
    "StatusTypeID": 50,
    "DateLastStatusUpdate": "2021-05-26T10:33:00Z",
    "DataQualityLevel": 1,
    "DateCreated": "2019-11-21T09:58:00Z",
    "SubmissionStatusTypeID": 200
}