{
    "IsRecentlyVerified": false,
    "ID": 165389,
    "UUID": "E6D1B944-CDB2-484F-8193-07810C6DAA5C",
    "DataProviderID": 28,
    "DataProvidersReference": "FR*M13*P13203*004",
    "UsageTypeID": 5,
    "AddressInfo": {
        "ID": 165748,
        "Title": "MARSEILLE-3E - 418 Rue René Cassin",
        "AddressLine1": "Allée des Coudercs - Parking aire de jeu 0 MARSEILLE-3E",
        "CountryID": 80,
        "Latitude": 43.315151,
        "Longitude": 5.372985,
        "AccessComments": "24h/24 7j/7",
        "DistanceUnit": 0
    },
    "Connections": [
        {
            "ID": 238386,
            "ConnectionTypeID": 28,
            "StatusTypeID": 50,
            "LevelID": 2,
            "PowerKW": 22,
            "CurrentTypeID": 10
        },
        {
            "ID": 238387,
            "ConnectionTypeID": 1036,
            "StatusTypeID": 50,
            "LevelID": 2,
            "PowerKW": 22,
            "CurrentTypeID": 20
        }
    ],
    "GeneralComments": "Recharge par badge et avec une application smartphone",
    "StatusTypeID": 50,
    "DateLastStatusUpdate": "2020-08-27T05:10:00Z",
    "DataQualityLevel": 2,
    "DateCreated": "2020-08-27T05:10:00Z",
    "SubmissionStatusTypeID": 100
}