{
    "IsRecentlyVerified": false,
    "ID": 157002,
    "UUID": "77BCA495-2985-43B4-9678-830E7F489F0D",
    "DataProviderID": 19,
    "DataProvidersReference": "5975",
    "AddressInfo": {
        "ID": 157356,
        "Title": "Rema 1000 Fitjar",
        "AddressLine1": "Fitjarsjøen 73",
        "Town": "FITJAR",
        "StateOrProvince": "Vestland",
        "Postcode": "5419",
        "CountryID": 168,
        "Latitude": 59.91991,
        "Longitude": 5.32625,
        "AccessComments": "",
        "DistanceUnit": 0
    },
    "Connections": [
        {
            "ID": 223908,
            "ConnectionTypeID": 33,
            "Reference": "1",
            "LevelID": 3,
            "Amps": 100,
            "Voltage": 500,
            "PowerKW": 50,
            "CurrentTypeID": 30,
            "Comments": "Mode 4"
        },
        {
            "ID": 223909,
            "ConnectionTypeID": 2,
            "Reference": "2",
            "LevelID": 3,
            "Amps": 100,
            "Voltage": 500,
            "PowerKW": 50,
            "CurrentTypeID": 30,
            "Comments": "Mode 4"
        },
        {
            "ID": 223910,
            "ConnectionTypeID": 25,
            "Reference": "3",
            "LevelID": 3,
            "Amps": 32,
            "Voltage": 400,
            "PowerKW": 22,
            "CurrentTypeID": 30,
            "Comments": "Mode 3"
        },
        {
            "ID": 223911,
            "ConnectionTypeID": 33,
            "Reference": "4",
            "LevelID": 3,
            "Amps": 375,
            "Voltage": 400,
            "PowerKW": 150,
            "CurrentTypeID": 30,
            "Comments": "Mode 4"
        },
        {
            "ID": 223912,
            "ConnectionTypeID": 33,
            "Reference": "5",
            "LevelID": 3,
            "Amps": 375,
            "Voltage": 400,
            "PowerKW": 150,
            "CurrentTypeID": 30,
            "Comments": "Mode 4"
        },
        {
            "ID": 223913,
            "ConnectionTypeID": 2,
            "Reference": "6",
            "LevelID": 3,
            "Amps": 100,
            "Voltage": 500,
            "PowerKW": 50,
            "CurrentTypeID": 30,
            "Comments": "Mode 4"
        }
    ],
    "NumberOfPoints": 6,
    "StatusTypeID": 0,
    "DateLastStatusUpdate": "2021-03-24T05:11:00Z",
    "DataQualityLevel": 2,
    "DateCreated": "2020-05-26T08:23:00Z",
    "SubmissionStatusTypeID": 100
}