{
    "IsRecentlyVerified": false,
    "ID": 175428,
    "UUID": "329553BA-D288-418C-9D62-D80797D79E8A",
    "DataProviderID": 1,
    "OperatorID": 3447,
    "UsageTypeID": 1,
    "AddressInfo": {
        "ID": 175787,
        "Title": "Total - Relais Amiral Mouchez",
        "AddressLine1": "Boulevard de l'Amiral Mouchez",
        "Town": "Le Havre",
        "CountryID": 80,
        "Latitude": 49.48798555787988,
        "Longitude": 0.14978996766535602,
        "RelatedURL": "https://apps.total-ev-charge.com/charge-points/TOTAL-NF078171-001",
        "DistanceUnit": 0
    },
    "Connections": [
        {
            "ID": 272188,
            "ConnectionTypeID": 33,
            "Reference": "FR*HPC*ENF078171*002*1",
            "StatusTypeID": 50,
            "LevelID": 3,
            "PowerKW": 175,
            "CurrentTypeID": 30,
            "Quantity": 1
        },
        {
            "ID": 272189,
            "ConnectionTypeID": 2,
            "Reference": "FR*HPC*ENF078171*002*2",
            "StatusTypeID": 50,
            "LevelID": 3,
            "PowerKW": 100,
            "CurrentTypeID": 30,
            "Quantity": 1
        },
        {
            "ID": 272190,
            "ConnectionTypeID": 33,
            "Reference": "FR*HPC*ENF078171*001*3",
            "StatusTypeID": 50,
            "LevelID": 3,
            "PowerKW": 50,
            "CurrentTypeID": 30,
            "Quantity": 1
        },
        {
            "ID": 272191,
            "ConnectionTypeID": 2,
            "Reference": "FR*HPC*ENF078171*001*2",
            "StatusTypeID": 50,
            "LevelID": 3,
            "PowerKW": 50,
            "CurrentTypeID": 30,
            "Quantity": 1
        },
        {
            "ID": 272192,
            "ConnectionTypeID": 1036,
            "Reference": "FR*HPC*ENF078171*001*1",
            "StatusTypeID": 50,
            "LevelID": 3,
            "PowerKW": 43,
            "CurrentTypeID": 20,
            "Quantity": 1
        },
        {
            "ID": 272193,
            "ConnectionTypeID": 28,
            "Reference": "FR*HPC*ENF078171*001*4",
            "StatusTypeID": 50,
            "CurrentTypeID": 10,
            "Quantity": 1
        }
    ],
    "NumberOfPoints": 2,
    "StatusTypeID": 50,
    "DateLastStatusUpdate": "2021-05-19T21:35:00Z",
    "DataQualityLevel": 1,
    "DateCreated": "2021-05-19T13:00:00Z",
    "SubmissionStatusTypeID": 200
}