{
    "IsRecentlyVerified": false,
    "ID": 66815,
    "UUID": "7999096C-65A0-4758-A639-588BE73BBE3B",
    "DataProviderID": 1,
    "OperatorID": 23,
    "OperatorsReference": "14006",
    "UsageTypeID": 1,
    "UsageCost": "$0.20/min >=60kW; $0.10/min <60kW; other tariffs for older cars",
    "AddressInfo": {
        "ID": 67161,
        "Title": "La Quinta Inn and Suites - Tesla",
        "AddressLine1": "3107 S Laurent St",
        "Town": "Victoria",
        "StateOrProvince": "TX",
        "Postcode": "77901",
        "CountryID": 2,
        "Latitude": 28.7673034,
        "Longitude": -96.9789208,
        "ContactTelephone1": "877-798-3752",
        "AccessComments": "24 hours daily; for Tesla use only",
        "RelatedURL": "http://www.teslamotors.com/supercharger",
        "DistanceUnit": 0
    },
    "Connections": [
        {
            "ID": 92302,
            "ConnectionTypeID": 27,
            "StatusTypeID": 50,
            "LevelID": 3,
            "Amps": 100,
            "Voltage": 400,
            "PowerKW": 120,
            "CurrentTypeID": 30,
            "Quantity": 6
        }
    ],
    "NumberOfPoints": 6,
    "StatusTypeID": 50,
    "DateLastStatusUpdate": "2018-03-13T13:20:00Z",
    "DataQualityLevel": 3,
    "DateCreated": "2016-05-29T02:04:00Z",
    "SubmissionStatusTypeID": 100
}