{
    "IsRecentlyVerified": false,
    "ID": 9431,
    "UUID": "B26BD229-CFF7-405F-B7FB-1559E212B3AF",
    "DataProviderID": 1,
    "DataProvidersReference": "LSB-00074",
    "OperatorID": 21,
    "UsageTypeID": 4,
    "UsageCost": "Mobi.E compatible card",
    "AddressInfo": {
        "ID": 9328,
        "Title": "LSB-00074",
        "AddressLine1": "Jardim 9 de Abril",
        "Town": "Lisboa",
        "Postcode": "1200-736",
        "CountryID": 180,
        "Latitude": 38.704317,
        "Longitude": -9.16235,
        "RelatedURL": "http://www.mobie.pt",
        "DistanceUnit": 0
    },
    "Connections": [
        {
            "ID": 33213,
            "ConnectionTypeID": 25,
            "StatusTypeID": 50,
            "LevelID": 2,
            "Amps": 16,
            "Voltage": 230,
            "PowerKW": 3.7,
            "CurrentTypeID": 10,
            "Quantity": 4
        }
    ],
    "NumberOfPoints": 4,
    "StatusTypeID": 50,
    "DateLastStatusUpdate": "2020-08-16T09:10:00Z",
    "DataQualityLevel": 3,
    "DateCreated": "2012-02-08T15:16:00Z",
    "SubmissionStatusTypeID": 100
}