{
    "IsRecentlyVerified": false,
    "ID": 23245,
    "UUID": "2850118D-C32A-460B-8A2C-C1249BF566D6",
    "DataProviderID": 1,
    "OperatorID": 62,
    "UsageTypeID": 4,
    "AddressInfo": {
        "ID": 23590,
        "Title": "Auchan CLAMECY",
        "AddressLine1": "D 977",
        "Town": "Clamecy",
        "StateOrProvince": "Clamecy",
        "Postcode": "58500",
        "CountryID": 80,
        "Latitude": 47.4563003,
        "Longitude": 3.50950465887547,
        "ContactTelephone1": "O3.86.27.15.22 ",
        "RelatedURL": "http://www.auchan.fr/magasins/clamecy/187/informations-pratiques/",
        "DistanceUnit": 0
    },
    "Connections": [
        {
            "ID": 25066,
            "ConnectionTypeID": 2,
            "LevelID": 3,
            "CurrentTypeID": 30,
            "Quantity": 1
        },
        {
            "ID": 25067,
            "ConnectionTypeID": 25,
            "LevelID": 3,
            "CurrentTypeID": 20,
            "Quantity": 1
        }
    ],
    "NumberOfPoints": 1,
    "StatusTypeID": 150,
    "DateLastStatusUpdate": "2014-09-25T13:05:00Z",
    "DataQualityLevel": 1,
    "DateCreated": "2014-05-07T14:44:00Z",
    "SubmissionStatusTypeID": 200
}