{
    "IsRecentlyVerified": false,
    "ID": 142896,
    "UUID": "8F1209D4-7AE1-4AF5-B32B-7E6FEE64E5CB",
    "DataProviderID": 2,
    "DataProvidersReference": "92515",
    "OperatorID": 5,
    "UsageTypeID": 1,
    "AddressInfo": {
        "ID": 143248,
        "Title": "ULSTER COUNTY",
        "AddressLine1": "380 Boulevard",
        "Town": "Kingston",
        "StateOrProvince": "NY",
        "Postcode": "12401",
        "CountryID": 2,
        "Latitude": 41.9130185,
        "Longitude": -74.0146564,
        "ContactTelephone1": "888-758-4389",
        "AccessComments": "24 hours daily",
        "RelatedURL": "http://www.chargepoint.com/",
        "DistanceUnit": 0
    },
    "Connections": [
        {
            "ID": 199125,
            "ConnectionTypeID": 1,
            "LevelID": 2,
            "Amps": 16,
            "Voltage": 230,
            "PowerKW": 3,
            "CurrentTypeID": 10,
            "Quantity": 2
        }
    ],
    "StatusTypeID": 50,
    "DateLastStatusUpdate": "2019-12-24T09:19:00Z",
    "DataQualityLevel": 3,
    "DateCreated": "2019-12-24T09:19:00Z",
    "SubmissionStatusTypeID": 100
}