{
    "IsRecentlyVerified": false,
    "ID": 15930,
    "UUID": "390FEEF5-41A9-4A87-9AF2-18670812FC23",
    "DataProviderID": 1,
    "OperatorID": 1,
    "UsageTypeID": 5,
    "UsageCost": "Free",
    "AddressInfo": {
        "ID": 16275,
        "Title": "Parking Biekorf ",
        "AddressLine1": "Naaldenstraat 8",
        "AddressLine2": "",
        "Town": "Bruges",
        "StateOrProvince": "",
        "Postcode": "8000 ",
        "CountryID": 26,
        "Latitude": 51.2099401,
        "Longitude": 3.2219780000000355,
        "ContactTelephone1": " 050/44.66.06",
        "ContactTelephone2": "",
        "ContactEmail": "BIEKORF@interparking.com",
        "AccessComments": "",
        "RelatedURL": "http://www.interparking.be/en/find-parking/Biekorf/",
        "DistanceUnit": 0
    },
    "Connections": [],
    "NumberOfPoints": 1,
    "GeneralComments": "Parking charges apply",
    "StatusTypeID": 50,
    "DateLastStatusUpdate": "2013-02-15T14:44:00Z",
    "DataQualityLevel": 1,
    "DateCreated": "2013-02-15T14:44:00Z",
    "SubmissionStatusTypeID": 200
}