{
    "IsRecentlyVerified": false,
    "ID": 134954,
    "UUID": "54F04CD6-84CD-497A-8554-EF4D0BE367BD",
    "DataProviderID": 1,
    "OperatorID": 3345,
    "UsageTypeID": 5,
    "AddressInfo": {
        "ID": 135300,
        "Title": "Keslake Road ",
        "AddressLine1": "Keslake Road ",
        "Town": "Kensal Green",
        "Postcode": "NW6 6DH",
        "CountryID": 1,
        "Latitude": 51.534199,
        "Longitude": -0.215557,
        "RelatedURL": "https://char.gy",
        "DistanceUnit": 0
    },
    "Connections": [
        {
            "ID": 188882,
            "ConnectionTypeID": 25,
            "Reference": "109",
            "StatusTypeID": 50,
            "LevelID": 2,
            "Amps": 16,
            "Voltage": 230,
            "PowerKW": 3.7,
            "CurrentTypeID": 10
        }
    ],
    "StatusTypeID": 0,
    "DateLastStatusUpdate": "2019-12-03T14:33:00Z",
    "MetadataValues": [
        {
            "ID": 5295,
            "MetadataFieldID": 4,
            "ItemValue": "Contains public sector information licensed under the Open Government Licence v2.0. http://www.nationalarchives.gov.uk/doc/open-government-licence/version/2/"
        }
    ],
    "DataQualityLevel": 3,
    "DateCreated": "2019-12-03T13:42:00Z",
    "SubmissionStatusTypeID": 100
}