{
    "IsRecentlyVerified": false,
    "ID": 2769,
    "UUID": "B305E941-14A0-488D-8555-FD6C96174A0B",
    "DataProviderID": 1,
    "OperatorID": 5,
    "UsageTypeID": 1,
    "AddressInfo": {
        "ID": 2770,
        "Title": "City of Palo Alto - City Hall Garage",
        "AddressLine1": "250 Hamilton Ave",
        "Town": "Palo Alto",
        "StateOrProvince": "CA",
        "Postcode": "94301",
        "CountryID": 2,
        "Latitude": 37.44462,
        "Longitude": -122.16042,
        "ContactTelephone1": "650-329-2100",
        "AccessComments": "Underground parking structure; first level.",
        "RelatedURL": "http://www.cityofpaloalto.org/electricvehicle",
        "DistanceUnit": 0
    },
    "Connections": [
        {
            "ID": 20008,
            "ConnectionTypeID": 1,
            "StatusTypeID": 50,
            "LevelID": 2,
            "Amps": 30,
            "Voltage": 240,
            "PowerKW": 7.2,
            "CurrentTypeID": 10,
            "Quantity": 2
        },
        {
            "ID": 20009,
            "ConnectionTypeID": 6,
            "StatusTypeID": 0,
            "Quantity": 1
        }
    ],
    "NumberOfPoints": 3,
    "DateLastConfirmed": "2010-08-31T00:00:00Z",
    "StatusTypeID": 50,
    "DateLastStatusUpdate": "2013-11-06T07:26:00Z",
    "DataQualityLevel": 1,
    "DateCreated": "2010-08-31T00:00:00Z",
    "SubmissionStatusTypeID": 200
}