{
    "UserComments": [
        {
            "ID": 22467,
            "ChargePointID": 125189,
            "CommentTypeID": 10,
            "UserName": "ForumElettrico.it",
            "Comment": "Di lato al supermercato Rossetto, appena prima della rampa per il parcheggio sotteraneo. Leggi la recensione completa qui > https://www.forumelettrico.it/forum/colonnina-a2a-ac-2x22kw-cremona-in-via-delle-fiamme-gialle-vicino-supermercato-rossetto-t7114.html",
            "RelatedURL": "https://www.forumelettrico.it/forum/colonnina-a2a-ac-2x22kw-cremona-in-via-delle-fiamme-gialle-vicino-supermercato-rossetto-t7114.html",
            "DateCreated": "2020-04-19T16:20:38.24Z",
            "User": {
                "ID": 11749,
                "Username": "ForumElettrico.it"
            },
            "CheckinStatusTypeID": 10,
            "IsActionedByEditor": false
        }
    ],
    "MediaItems": [
        {
            "ID": 22023,
            "ChargePointID": 125189,
            "ItemURL": "https://s3-ap-southeast-2.amazonaws.com/openchargemap/images/IT/OCM125189/OCM-125189.orig.2020041916204995.jpg",
            "ItemThumbnailURL": "https://s3-ap-southeast-2.amazonaws.com/openchargemap/images/IT/OCM125189/OCM-125189.thmb.2020041916204995.jpg",
            "Comment": "",
            "IsEnabled": true,
            "IsVideo": false,
            "IsFeaturedItem": false,
            "IsExternalResource": false,
            "User": {
                "ID": 11749,
                "Username": "ForumElettrico.it"
            },
            "DateCreated": "2020-04-19T16:21:00Z"
        },
        {
            "ID": 22024,
            "ChargePointID": 125189,
            "ItemURL": "https://s3-ap-southeast-2.amazonaws.com/openchargemap/images/IT/OCM125189/OCM-125189.orig.2020041916205790.jpg",
            "ItemThumbnailURL": "https://s3-ap-southeast-2.amazonaws.com/openchargemap/images/IT/OCM125189/OCM-125189.thmb.2020041916205790.jpg",
            "Comment": "",
            "IsEnabled": true,
            "IsVideo": false,
            "IsFeaturedItem": false,
            "IsExternalResource": false,
            "User": {
                "ID": 11749,
                "Username": "ForumElettrico.it"
            },
            "DateCreated": "2020-04-19T16:21:00Z"
        },
        {
            "ID": 22025,
            "ChargePointID": 125189,
            "ItemURL": "https://s3-ap-southeast-2.amazonaws.com/openchargemap/images/IT/OCM125189/OCM-125189.orig.2020041916210425.jpg",
            "ItemThumbnailURL": "https://s3-ap-southeast-2.amazonaws.com/openchargemap/images/IT/OCM125189/OCM-125189.thmb.2020041916210425.jpg",
            "Comment": "",
            "IsEnabled": true,
            "IsVideo": false,
            "IsFeaturedItem": false,
            "IsExternalResource": false,
            "User": {
                "ID": 11749,
                "Username": "ForumElettrico.it"
            },
            "DateCreated": "2020-04-19T16:21:00Z"
        }
    ],
    "IsRecentlyVerified": false,
    "ID": 125189,
    "UUID": "A1E394E4-19B2-4858-B263-D969DEA52D20",
    "DataProviderID": 1,
    "OperatorID": 82,
    "UsageTypeID": 4,
    "AddressInfo": {
        "ID": 125535,
        "Title": "A2A C.C. I Navigli",
        "AddressLine1": "Via delle Fiamme Gialle",
        "Town": "Cremona",
        "StateOrProvince": "CR",
        "Postcode": "26100",
        "CountryID": 112,
        "Latitude": 45.151791809414505,
        "Longitude": 10.014572715798067,
        "ContactTelephone1": "800035151",
        "RelatedURL": "http://www.e-moving.it/",
        "DistanceUnit": 0
    },
    "Connections": [
        {
            "ID": 175447,
            "ConnectionTypeID": 25,
            "StatusTypeID": 50,
            "LevelID": 2,
            "Amps": 32,
            "Voltage": 400,
            "PowerKW": 22,
            "CurrentTypeID": 20,
            "Quantity": 2
        },
        {
            "ID": 175448,
            "ConnectionTypeID": 36,
            "StatusTypeID": 50,
            "LevelID": 2,
            "Amps": 16,
            "Voltage": 240,
            "PowerKW": 3.7,
            "CurrentTypeID": 10,
            "Quantity": 2
        }
    ],
    "NumberOfPoints": 2,
    "StatusTypeID": 50,
    "DateLastStatusUpdate": "2020-04-19T16:21:00Z",
    "DataQualityLevel": 1,
    "DateCreated": "2019-04-11T15:46:00Z",
    "SubmissionStatusTypeID": 200
}