{
    "IsRecentlyVerified": false,
    "ID": 120623,
    "UUID": "EC1B42EF-0EDC-4E45-8FBE-BBDDAF02F728",
    "DataProviderID": 2,
    "DataProvidersReference": "77562",
    "UsageTypeID": 1,
    "AddressInfo": {
        "ID": 120969,
        "Title": "Holiday Inn - Oceanside",
        "AddressLine1": "1401 Carmelo Dr",
        "Town": "Oceanside",
        "StateOrProvince": "CA",
        "Postcode": "92054",
        "CountryID": 2,
        "Latitude": 33.207383,
        "Longitude": -117.387849,
        "ContactTelephone1": "877-676-6266  760-231-7000",
        "AccessComments": "24 hours daily",
        "RelatedURL": "",
        "DistanceUnit": 0
    },
    "Connections": [
        {
            "ID": 169984,
            "ConnectionTypeID": 2,
            "LevelID": 3,
            "Amps": 100,
            "Voltage": 400,
            "PowerKW": 40,
            "CurrentTypeID": 30,
            "Quantity": 1
        }
    ],
    "DateLastStatusUpdate": "2020-06-26T02:55:00Z",
    "DataQualityLevel": 3,
    "DateCreated": "2019-04-01T04:59:00Z",
    "SubmissionStatusTypeID": 100
}