{
    "IsRecentlyVerified": false,
    "ID": 119367,
    "UUID": "A053C50F-C87C-4596-BB79-08DC75ECF26C",
    "DataProviderID": 2,
    "DataProvidersReference": "98917",
    "OperatorID": 59,
    "UsageTypeID": 1,
    "AddressInfo": {
        "ID": 119713,
        "Title": "Greenlots - 43005",
        "AddressLine1": "68-1330 Mauna Lani Dr,",
        "Town": "Kamuela",
        "StateOrProvince": "HI",
        "Postcode": "96743",
        "CountryID": 2,
        "Latitude": 19.9411106109619,
        "Longitude": -155.858093261719,
        "ContactTelephone1": "855-900-7584",
        "AccessComments": "24 hours daily",
        "RelatedURL": "http://greenlots.com/",
        "DistanceUnit": 0
    },
    "Connections": [
        {
            "ID": 168617,
            "ConnectionTypeID": 2,
            "LevelID": 3,
            "Amps": 100,
            "Voltage": 400,
            "PowerKW": 40,
            "CurrentTypeID": 30,
            "Quantity": 1
        },
        {
            "ID": 168618,
            "ConnectionTypeID": 32,
            "LevelID": 3,
            "Amps": 100,
            "Voltage": 400,
            "PowerKW": 40,
            "CurrentTypeID": 30,
            "Quantity": 1
        }
    ],
    "DateLastStatusUpdate": "2020-06-26T02:52:00Z",
    "DataQualityLevel": 3,
    "DateCreated": "2019-04-01T04:59:00Z",
    "SubmissionStatusTypeID": 100
}