{
    "IsRecentlyVerified": false,
    "ID": 106458,
    "UUID": "09D23612-8080-4151-8A29-5C6E551B0AF2",
    "DataProviderID": 1,
    "OperatorID": 23,
    "OperatorsReference": "44399",
    "UsageTypeID": 4,
    "AddressInfo": {
        "ID": 106804,
        "Title": "Days Inn By Wyndham Airport/Maine Mall",
        "AddressLine1": "461 Maine Mall RD",
        "Town": "South Portland",
        "StateOrProvince": "Maine",
        "Postcode": "04106",
        "CountryID": 2,
        "Latitude": 43.6325566,
        "Longitude": -70.3410371,
        "ContactTelephone1": "(207) 772-3450",
        "DistanceUnit": 0
    },
    "Connections": [
        {
            "ID": 149835,
            "ConnectionTypeID": 30,
            "StatusTypeID": 50,
            "LevelID": 2,
            "PowerKW": 16,
            "CurrentTypeID": 20,
            "Quantity": 3
        }
    ],
    "NumberOfPoints": 3,
    "GeneralComments": "3 Tesla Connectors, up to 16kW.Available for customers. Please see front desk.",
    "StatusTypeID": 50,
    "DateLastStatusUpdate": "2019-06-05T11:37:00Z",
    "DataQualityLevel": 1,
    "DateCreated": "2018-06-23T05:31:00Z",
    "SubmissionStatusTypeID": 200
}