{
    "IsRecentlyVerified": false,
    "ID": 133726,
    "UUID": "252B5CBC-27AE-45E4-9F00-B27FE4C41AE6",
    "DataProviderID": 1,
    "OperatorID": 20,
    "OperatorsReference": "70875,70876,70877,70878",
    "UsageTypeID": 4,
    "UsageCost": "£0.20/kWh;min £1.00",
    "AddressInfo": {
        "ID": 134072,
        "Title": "New Street Car Park, NG17 1BW",
        "AddressLine1": "New Street Car Park, NG17 1BW",
        "Postcode": "NG17 1BW",
        "CountryID": 1,
        "Latitude": 53.1233,
        "Longitude": -1.2624,
        "DistanceUnit": 0
    },
    "Connections": [
        {
            "ID": 187154,
            "ConnectionTypeID": 25,
            "StatusTypeID": 50,
            "LevelID": 2,
            "Amps": 32,
            "Voltage": 230,
            "PowerKW": 7,
            "CurrentTypeID": 10,
            "Quantity": 8
        }
    ],
    "NumberOfPoints": 8,
    "StatusTypeID": 50,
    "DateLastStatusUpdate": "2020-04-18T05:16:00Z",
    "DataQualityLevel": 1,
    "DateCreated": "2019-10-25T05:18:00Z",
    "SubmissionStatusTypeID": 200
}