{
    "IsRecentlyVerified": false,
    "ID": 28134,
    "UUID": "381F5F81-013B-40CC-84C0-F9EAE68B204B",
    "DataProviderID": 2,
    "DataProvidersReference": "61641",
    "OperatorID": 5,
    "UsageTypeID": 1,
    "AddressInfo": {
        "ID": 28480,
        "Title": "BMW OF DENVER",
        "AddressLine1": "900 S Colorado Blvd",
        "Town": "Denver",
        "StateOrProvince": "CO",
        "Postcode": "80246",
        "CountryID": 2,
        "Latitude": 39.7002,
        "Longitude": -104.940407,
        "ContactTelephone1": "888-758-4389",
        "AccessComments": "24 hours daily",
        "RelatedURL": "http://www.chargepoint.com/",
        "DistanceUnit": 0
    },
    "Connections": [
        {
            "ID": 30917,
            "ConnectionTypeID": 1,
            "LevelID": 2,
            "Amps": 16,
            "Voltage": 230,
            "PowerKW": 3,
            "CurrentTypeID": 10,
            "Quantity": 4
        }
    ],
    "DateLastStatusUpdate": "2019-04-06T04:03:00Z",
    "DataQualityLevel": 3,
    "DateCreated": "2014-11-28T03:38:00Z",
    "SubmissionStatusTypeID": 100
}