{
    "MediaItems": [
        {
            "ID": 25129,
            "ChargePointID": 162170,
            "ItemURL": "https://s3-ap-southeast-2.amazonaws.com/openchargemap/images/AT/OCM162170/OCM-162170.orig.2020101815034377.jpg",
            "ItemThumbnailURL": "https://s3-ap-southeast-2.amazonaws.com/openchargemap/images/AT/OCM162170/OCM-162170.thmb.2020101815034377.jpg",
            "Comment": "",
            "IsEnabled": true,
            "IsVideo": false,
            "IsFeaturedItem": false,
            "IsExternalResource": false,
            "User": {
                "ID": 26760,
                "Username": "interssl.com"
            },
            "DateCreated": "2020-10-18T15:04:00Z"
        },
        {
            "ID": 25130,
            "ChargePointID": 162170,
            "ItemURL": "https://s3-ap-southeast-2.amazonaws.com/openchargemap/images/AT/OCM162170/OCM-162170.orig.2020101815035620.jpg",
            "ItemThumbnailURL": "https://s3-ap-southeast-2.amazonaws.com/openchargemap/images/AT/OCM162170/OCM-162170.thmb.2020101815035620.jpg",
            "Comment": "",
            "IsEnabled": true,
            "IsVideo": false,
            "IsFeaturedItem": false,
            "IsExternalResource": false,
            "User": {
                "ID": 26760,
                "Username": "interssl.com"
            },
            "DateCreated": "2020-10-18T15:04:00Z"
        },
        {
            "ID": 25131,
            "ChargePointID": 162170,
            "ItemURL": "https://s3-ap-southeast-2.amazonaws.com/openchargemap/images/AT/OCM162170/OCM-162170.orig.2020101815040883.jpg",
            "ItemThumbnailURL": "https://s3-ap-southeast-2.amazonaws.com/openchargemap/images/AT/OCM162170/OCM-162170.thmb.2020101815040883.jpg",
            "Comment": "",
            "IsEnabled": true,
            "IsVideo": false,
            "IsFeaturedItem": false,
            "IsExternalResource": false,
            "User": {
                "ID": 26760,
                "Username": "interssl.com"
            },
            "DateCreated": "2020-10-18T15:04:00Z"
        }
    ],
    "IsRecentlyVerified": false,
    "ID": 162170,
    "UUID": "3788BC6C-B9DA-4472-A7DD-9C801E5E4567",
    "DataProviderID": 1,
    "OperatorID": 3320,
    "UsageTypeID": 1,
    "UsageCost": "paid charging, free parking",
    "AddressInfo": {
        "ID": 162527,
        "Title": "Andy's Fachwerkstatt GmbH",
        "AddressLine1": "Gewerbepark 9",
        "AddressLine2": "Bachl",
        "Town": "Gemeinde Axams",
        "StateOrProvince": "Bezirk Innsbruck-Land",
        "Postcode": "6094",
        "CountryID": 19,
        "Latitude": 47.23644966919673,
        "Longitude": 11.274733387443575,
        "RelatedURL": "https://da-emobil.at/",
        "DistanceUnit": 0
    },
    "Connections": [
        {
            "ID": 233383,
            "ConnectionTypeID": 33,
            "StatusTypeID": 50,
            "LevelID": 3,
            "Amps": 200,
            "PowerKW": 75,
            "CurrentTypeID": 30,
            "Quantity": 1
        },
        {
            "ID": 233384,
            "ConnectionTypeID": 25,
            "StatusTypeID": 50,
            "LevelID": 3,
            "PowerKW": 43,
            "CurrentTypeID": 20,
            "Quantity": 1
        }
    ],
    "NumberOfPoints": 1,
    "StatusTypeID": 50,
    "DateLastStatusUpdate": "2020-10-18T15:04:00Z",
    "DataQualityLevel": 1,
    "DateCreated": "2020-08-02T08:54:00Z",
    "SubmissionStatusTypeID": 200
}