{
    "IsRecentlyVerified": false,
    "ID": 86011,
    "UUID": "C35E45FF-042B-4358-9F9F-D3F8FFD8FCF6",
    "DataProviderID": 1,
    "OperatorID": 23,
    "OperatorsReference": "25245",
    "UsageTypeID": 6,
    "AddressInfo": {
        "ID": 86357,
        "Title": "Osa-Bu",
        "AddressLine1": "Suldalsvegen 1682",
        "Town": "SULDALSOSEN",
        "Postcode": "4237",
        "CountryID": 168,
        "Latitude": 59.494877,
        "Longitude": 6.52703,
        "ContactTelephone1": "+47 52 79 92 60",
        "DistanceUnit": 0
    },
    "Connections": [
        {
            "ID": 122306,
            "ConnectionTypeID": 30,
            "StatusTypeID": 50,
            "LevelID": 2,
            "Amps": 32,
            "Voltage": 230,
            "PowerKW": 8,
            "CurrentTypeID": 10,
            "Quantity": 1
        }
    ],
    "NumberOfPoints": 1,
    "GeneralComments": "1 Tesla Connector, up to 8kW.Available for patrons only. Please see front desk.",
    "StatusTypeID": 50,
    "DateLastStatusUpdate": "2020-08-24T09:11:00Z",
    "DataQualityLevel": 1,
    "DateCreated": "2017-04-21T05:26:00Z",
    "SubmissionStatusTypeID": 200
}