{
    "UserComments": [
        {
            "ID": 22127,
            "ChargePointID": 148731,
            "CommentTypeID": 10,
            "UserName": "Someone_Just_",
            "Rating": 3,
            "DateCreated": "2020-02-09T19:20:47.493Z",
            "User": {
                "ID": 1107,
                "Username": "Someone_Just_"
            },
            "CheckinStatusTypeID": 140,
            "IsActionedByEditor": false
        }
    ],
    "MediaItems": [
        {
            "ID": 21204,
            "ChargePointID": 148731,
            "ItemURL": "https://s3-ap-southeast-2.amazonaws.com/openchargemap/images/BE/OCM148731/OCM-148731.orig.2020020919201444.jpg",
            "ItemThumbnailURL": "https://s3-ap-southeast-2.amazonaws.com/openchargemap/images/BE/OCM148731/OCM-148731.thmb.2020020919201444.jpg",
            "Comment": "instructions",
            "IsEnabled": true,
            "IsVideo": false,
            "IsFeaturedItem": false,
            "IsExternalResource": false,
            "User": {
                "ID": 1107,
                "Username": "Someone_Just_"
            },
            "DateCreated": "2020-02-09T19:20:00Z"
        },
        {
            "ID": 21203,
            "ChargePointID": 148731,
            "ItemURL": "https://s3-ap-southeast-2.amazonaws.com/openchargemap/images/BE/OCM148731/OCM-148731.orig.2020020919192383.jpg",
            "ItemThumbnailURL": "https://s3-ap-southeast-2.amazonaws.com/openchargemap/images/BE/OCM148731/OCM-148731.thmb.2020020919192383.jpg",
            "Comment": "only 1 place available. ",
            "IsEnabled": true,
            "IsVideo": false,
            "IsFeaturedItem": false,
            "IsExternalResource": false,
            "User": {
                "ID": 1107,
                "Username": "Someone_Just_"
            },
            "DateCreated": "2020-02-09T19:19:00Z"
        }
    ],
    "IsRecentlyVerified": false,
    "ID": 148731,
    "UUID": "FD3C2751-C1C4-4220-8CA4-13B89A87A283",
    "DataProviderID": 1,
    "OperatorID": 36,
    "UsageTypeID": 1,
    "AddressInfo": {
        "ID": 149083,
        "Title": "Molenweg Brasschaat",
        "AddressLine1": "Molenweg",
        "Town": "Brasschaat",
        "Postcode": "2930",
        "CountryID": 26,
        "Latitude": 51.2914528275179,
        "Longitude": 4.445133440356585,
        "DistanceUnit": 0
    },
    "Connections": [
        {
            "ID": 206520,
            "ConnectionTypeID": 25,
            "StatusTypeID": 50,
            "LevelID": 2,
            "PowerKW": 22,
            "CurrentTypeID": 20,
            "Quantity": 2
        }
    ],
    "NumberOfPoints": 1,
    "GeneralComments": "1 place reserved for taxis ",
    "StatusTypeID": 50,
    "DateLastStatusUpdate": "2020-02-09T22:18:00Z",
    "DataQualityLevel": 1,
    "DateCreated": "2020-02-09T19:17:00Z",
    "SubmissionStatusTypeID": 200
}