{
    "IsRecentlyVerified": false,
    "ID": 89839,
    "UUID": "DDF1B4BA-76E4-46CC-AE0C-D7B5433702FA",
    "DataProviderID": 1,
    "UsageTypeID": 1,
    "AddressInfo": {
        "ID": 90185,
        "Title": "City of Bridgeport - City Hall",
        "AddressLine1": "1206 Columbia Ave",
        "Town": "Bridgeport",
        "StateOrProvince": "WA",
        "Postcode": "98813",
        "CountryID": 2,
        "Latitude": 48.009356,
        "Longitude": -119.672953,
        "ContactTelephone1": "509-686-4041",
        "AccessComments": "24 hours daily",
        "DistanceUnit": 0
    },
    "Connections": [
        {
            "ID": 127294,
            "ConnectionTypeID": 1,
            "LevelID": 2,
            "Amps": 48,
            "Voltage": 240,
            "PowerKW": 12,
            "CurrentTypeID": 10,
            "Quantity": 1
        }
    ],
    "StatusTypeID": 0,
    "DateLastStatusUpdate": "2019-02-02T09:13:00Z",
    "DataQualityLevel": 3,
    "DateCreated": "2017-06-22T08:16:00Z",
    "SubmissionStatusTypeID": 100
}