{
    "IsRecentlyVerified": false,
    "ID": 44662,
    "UUID": "19D135F5-A9A3-4EA1-B75B-4264A19C8B4B",
    "DataProviderID": 26,
    "DataProvidersReference": "61248",
    "OperatorID": 179,
    "OperatorsReference": "Ecotap 1500261",
    "UsageCost": "0.00 afhankelijk van pas",
    "AddressInfo": {
        "ID": 45008,
        "Title": "Persephonéstraat 7a",
        "AddressLine1": "Persephonéstraat 7a",
        "Town": "Tilburg",
        "Postcode": "5047 TT",
        "CountryID": 159,
        "Latitude": 51.589917,
        "Longitude": 5.01498,
        "RelatedURL": "http://www.ecotap.nl",
        "DistanceUnit": 0
    },
    "Connections": [
        {
            "ID": 54855,
            "ConnectionTypeID": 25,
            "LevelID": 2,
            "PowerKW": 22,
            "CurrentTypeID": 10
        },
        {
            "ID": 54856,
            "ConnectionTypeID": 25,
            "LevelID": 2,
            "PowerKW": 22,
            "CurrentTypeID": 10
        }
    ],
    "NumberOfPoints": 2,
    "StatusTypeID": 50,
    "DateLastStatusUpdate": "2016-06-04T02:39:00Z",
    "DataQualityLevel": 3,
    "DateCreated": "2015-04-18T13:02:00Z",
    "SubmissionStatusTypeID": 100
}