{
    "IsRecentlyVerified": false,
    "ID": 158853,
    "UUID": "FA5DA897-905E-4DE1-98A2-30C38D2882EA",
    "DataProviderID": 2,
    "DataProvidersReference": "152970",
    "OperatorID": 89,
    "UsageTypeID": 1,
    "AddressInfo": {
        "ID": 159210,
        "Title": "23385 W Burbank Blvd",
        "AddressLine1": "23385 W Burbank Blvd",
        "Town": "Los Angeles",
        "StateOrProvince": "CA",
        "Postcode": "91367",
        "CountryID": 2,
        "Latitude": 34.17198198,
        "Longitude": -118.636027,
        "ContactTelephone1": "888-356-8911",
        "AccessComments": "24 hours daily",
        "RelatedURL": "https://flo.ca/",
        "DistanceUnit": 0
    },
    "Connections": [
        {
            "ID": 228888,
            "ConnectionTypeID": 1,
            "LevelID": 2,
            "Amps": 16,
            "Voltage": 230,
            "PowerKW": 3.7,
            "CurrentTypeID": 10,
            "Quantity": 1
        }
    ],
    "StatusTypeID": 50,
    "DateLastStatusUpdate": "2020-06-26T02:57:00Z",
    "DataQualityLevel": 3,
    "DateCreated": "2020-06-26T02:57:00Z",
    "SubmissionStatusTypeID": 100
}