{
    "IsRecentlyVerified": false,
    "ID": 36416,
    "UUID": "24BF309E-34BB-4240-8C9D-1582DF827C1A",
    "DataProviderID": 26,
    "DataProvidersReference": "39417",
    "OperatorID": 157,
    "OperatorsReference": "NewMotion ICUCOMPACT001831",
    "UsageCost": "0.00 jaarabonnement",
    "AddressInfo": {
        "ID": 36762,
        "Title": "Walikerstraat",
        "AddressLine1": "Walikerstraat",
        "Town": "Amersfoort",
        "Postcode": "3814 BG",
        "CountryID": 159,
        "Latitude": 52.1590690612793,
        "Longitude": 5.3918399810791,
        "ContactTelephone1": "088 0109500",
        "RelatedURL": "http://thenewmotion.nl/",
        "DistanceUnit": 0
    },
    "Connections": [
        {
            "ID": 39927,
            "ConnectionTypeID": 25,
            "LevelID": 2,
            "PowerKW": 11,
            "CurrentTypeID": 10
        },
        {
            "ID": 48353,
            "ConnectionTypeID": 25,
            "LevelID": 2,
            "PowerKW": 11,
            "CurrentTypeID": 10
        }
    ],
    "NumberOfPoints": 1,
    "StatusTypeID": 50,
    "DateLastStatusUpdate": "2016-06-04T02:51:00Z",
    "DataQualityLevel": 3,
    "DateCreated": "2015-01-09T06:05:00Z",
    "SubmissionStatusTypeID": 100
}