{
    "IsRecentlyVerified": false,
    "ID": 29941,
    "UUID": "03BADAA8-B0C4-44F4-BC00-659AF53D2A57",
    "DataProviderID": 15,
    "DataProvidersReference": "21152",
    "OperatorID": 5,
    "UsageTypeID": 1,
    "AddressInfo": {
        "ID": 30287,
        "Title": "2100-2150 Wilson Ave",
        "AddressLine1": "2100-2150 Wilson Ave",
        "Town": "St Paul",
        "StateOrProvince": "Minnesota",
        "Postcode": "55119",
        "CountryID": 2,
        "Latitude": 44.954344,
        "Longitude": -93.01123,
        "ContactTelephone1": "651-501-6300",
        "RelatedURL": "http://carstations.com/21152",
        "DistanceUnit": 0
    },
    "Connections": [
        {
            "ID": 32926,
            "ConnectionTypeID": 1,
            "Reference": "J1772",
            "LevelID": 2
        }
    ],
    "NumberOfPoints": 2,
    "StatusTypeID": 0,
    "DateLastStatusUpdate": "2017-11-04T14:05:00Z",
    "DataQualityLevel": 2,
    "DateCreated": "2014-11-29T05:39:00Z",
    "SubmissionStatusTypeID": 100
}