{
    "IsRecentlyVerified": false,
    "ID": 139666,
    "UUID": "BC2DECA3-33AF-43F0-AEFF-554907F31127",
    "DataProviderID": 2,
    "DataProvidersReference": "146968",
    "OperatorID": 5,
    "UsageTypeID": 1,
    "AddressInfo": {
        "ID": 140018,
        "Title": "SANTA MONICA",
        "AddressLine1": "1217 Euclid St.",
        "Town": "Santa Monica",
        "StateOrProvince": "CA",
        "Postcode": "90404",
        "CountryID": 2,
        "Latitude": 34.025791,
        "Longitude": -118.489228,
        "ContactTelephone1": "888-758-4389",
        "AccessComments": "24 hours daily",
        "RelatedURL": "http://www.chargepoint.com/",
        "DistanceUnit": 0
    },
    "Connections": [
        {
            "ID": 195098,
            "ConnectionTypeID": 1,
            "LevelID": 2,
            "Amps": 16,
            "Voltage": 230,
            "PowerKW": 3,
            "CurrentTypeID": 10,
            "Quantity": 4
        }
    ],
    "StatusTypeID": 50,
    "DateLastStatusUpdate": "2019-12-24T09:11:00Z",
    "DataQualityLevel": 3,
    "DateCreated": "2019-12-24T09:11:00Z",
    "SubmissionStatusTypeID": 100
}