{
    "IsRecentlyVerified": false,
    "ID": 27925,
    "UUID": "5AD92674-B376-4967-B55D-252A731EE681",
    "DataProviderID": 2,
    "DataProvidersReference": "63838",
    "OperatorID": 5,
    "UsageTypeID": 1,
    "AddressInfo": {
        "ID": 28271,
        "Title": "CAMPUS",
        "AddressLine1": "6511 Sprint Pkwy Garage I",
        "Town": "Overland Park",
        "StateOrProvince": "KS",
        "Postcode": "66251",
        "CountryID": 2,
        "Latitude": 38.9199373,
        "Longitude": -94.6597033,
        "ContactTelephone1": "888-758-4389",
        "AccessComments": "24 hours daily",
        "RelatedURL": "http://www.chargepoint.com/",
        "DistanceUnit": 0
    },
    "Connections": [
        {
            "ID": 30670,
            "ConnectionTypeID": 1,
            "LevelID": 2,
            "Amps": 16,
            "Voltage": 230,
            "PowerKW": 3.7,
            "CurrentTypeID": 10,
            "Quantity": 2
        }
    ],
    "DateLastStatusUpdate": "2020-06-26T03:00:00Z",
    "DataQualityLevel": 3,
    "DateCreated": "2014-11-28T03:38:00Z",
    "SubmissionStatusTypeID": 100
}