{
    "IsRecentlyVerified": false,
    "ID": 166959,
    "UUID": "FB4C4583-CBA0-4D87-9131-9F1134DD5E3E",
    "DataProviderID": 1,
    "OperatorID": 21,
    "UsageTypeID": 4,
    "UsageCost": "Mobi.E compatible card or App",
    "AddressInfo": {
        "ID": 167318,
        "Title": "CHT-00001",
        "AddressLine1": "Travessas – Ribeira Seca",
        "Town": "Calheta",
        "Postcode": "9850-000",
        "CountryID": 180,
        "Latitude": 38.606058,
        "Longitude": -27.983061,
        "RelatedURL": "https://www.mobie.pt",
        "DistanceUnit": 0
    },
    "Connections": [
        {
            "ID": 252762,
            "ConnectionTypeID": 2,
            "StatusTypeID": 50,
            "LevelID": 3,
            "Amps": 120,
            "Voltage": 500,
            "PowerKW": 50,
            "CurrentTypeID": 30,
            "Quantity": 1
        },
        {
            "ID": 264437,
            "ConnectionTypeID": 1036,
            "StatusTypeID": 50,
            "LevelID": 3,
            "Amps": 63,
            "Voltage": 400,
            "PowerKW": 43,
            "CurrentTypeID": 20,
            "Quantity": 1
        },
        {
            "ID": 264438,
            "ConnectionTypeID": 33,
            "StatusTypeID": 50,
            "LevelID": 3,
            "Amps": 125,
            "Voltage": 500,
            "PowerKW": 50,
            "CurrentTypeID": 30,
            "Quantity": 1
        }
    ],
    "NumberOfPoints": 2,
    "StatusTypeID": 50,
    "DateLastStatusUpdate": "2021-02-20T19:04:00Z",
    "DataQualityLevel": 3,
    "DateCreated": "2020-08-27T06:37:00Z",
    "SubmissionStatusTypeID": 100
}