{
    "UserComments": [
        {
            "ID": 20654,
            "ChargePointID": 114987,
            "CommentTypeID": 10,
            "UserName": "Shaunsap",
            "Comment": "Nissan Leaf booked in for Airport Parking, booked on Secure Airparks Website, car left for 3 days, fully charged on return",
            "Rating": 5,
            "RelatedURL": "https://www.secureairparks.com",
            "DateCreated": "2019-01-21T11:50:03.367Z",
            "User": {
                "ID": 19805,
                "Username": "Shaunsap"
            },
            "CheckinStatusTypeID": 10
        }
    ],
    "MediaItems": [
        {
            "ID": 17477,
            "ChargePointID": 114987,
            "ItemURL": "https://s3-ap-southeast-2.amazonaws.com/openchargemap/images/GB/OCM114987/OCM-114987.orig.2019012111471480.jpg",
            "ItemThumbnailURL": "https://s3-ap-southeast-2.amazonaws.com/openchargemap/images/GB/OCM114987/OCM-114987.thmb.2019012111471480.jpg",
            "Comment": "Airport Parking Edinburgh - Book Your Electric Bays for your Airport Parking Sale now available at Secure Airparks - Book at www.secureairparks.com, Wider Space, VIP right at Reception.  Electric price included in the parking charge",
            "IsEnabled": true,
            "IsVideo": false,
            "IsFeaturedItem": false,
            "IsExternalResource": false,
            "User": {
                "ID": 19805,
                "Username": "Shaunsap"
            },
            "DateCreated": "2019-01-21T11:47:00Z"
        }
    ],
    "IsRecentlyVerified": false,
    "ID": 114987,
    "UUID": "A0536914-D1F1-4471-8FEC-5A6CC41DA3B3",
    "DataProviderID": 1,
    "OperatorID": 1,
    "UsageTypeID": 6,
    "AddressInfo": {
        "ID": 115333,
        "Title": "Secure Airparks",
        "AddressLine1": "100 Ingliston Road",
        "AddressLine2": "Ingliston",
        "Town": "Edinburgh",
        "Postcode": "EH28 8AU",
        "CountryID": 1,
        "Latitude": 55.944689109541,
        "Longitude": -3.37138522114866,
        "ContactTelephone1": "01313333377",
        "ContactEmail": "supervisor@secureairparks.com",
        "AccessComments": "Secure Airparks Electric Bays for Airport Parking booking on website www.secureairparks.com",
        "RelatedURL": "https://www.secureairparks.com/",
        "DistanceUnit": 0
    },
    "Connections": [
        {
            "ID": 161842,
            "ConnectionTypeID": 25,
            "StatusTypeID": 50,
            "LevelID": 2,
            "Amps": 16,
            "Voltage": 230,
            "PowerKW": 3.6,
            "CurrentTypeID": 10,
            "Quantity": 10
        }
    ],
    "NumberOfPoints": 10,
    "GeneralComments": "Type 2 connection, 3.5 kw for Airport Parking Customers",
    "StatusTypeID": 50,
    "DateLastStatusUpdate": "2020-01-13T20:59:00Z",
    "DataQualityLevel": 1,
    "DateCreated": "2019-01-21T11:42:00Z",
    "SubmissionStatusTypeID": 200
}