{
    "IsRecentlyVerified": false,
    "ID": 135349,
    "UUID": "81292144-25FD-4F76-A6D0-BF321FC30256",
    "DataProviderID": 1,
    "OperatorID": 80,
    "UsageTypeID": 4,
    "AddressInfo": {
        "ID": 135695,
        "Title": "U2 Supermercato Rovello Porro | EnelX",
        "AddressLine1": "SP 31 Via Como Ang, Via Marchese Pagani",
        "Town": "Rovello Porro",
        "StateOrProvince": "CO",
        "Postcode": "22070",
        "CountryID": 112,
        "Latitude": 45.64775749389844,
        "Longitude": 9.05136186079801,
        "RelatedURL": "https://www.enelx.com/it/it/emobility",
        "DistanceUnit": 0
    },
    "Connections": [
        {
            "ID": 189639,
            "ConnectionTypeID": 25,
            "StatusTypeID": 50,
            "LevelID": 2,
            "Amps": 32,
            "Voltage": 400,
            "PowerKW": 22,
            "CurrentTypeID": 20,
            "Quantity": 7
        },
        {
            "ID": 189640,
            "ConnectionTypeID": 36,
            "StatusTypeID": 50,
            "LevelID": 2,
            "Amps": 16,
            "Voltage": 240,
            "PowerKW": 3.7,
            "CurrentTypeID": 10,
            "Quantity": 1
        }
    ],
    "NumberOfPoints": 8,
    "StatusTypeID": 50,
    "DateLastStatusUpdate": "2019-12-18T15:48:00Z",
    "DataQualityLevel": 1,
    "DateCreated": "2019-12-18T15:46:00Z",
    "SubmissionStatusTypeID": 200
}