{
    "IsRecentlyVerified": false,
    "ID": 94802,
    "UUID": "11340640-9FF3-49B5-B520-DCF9B00E468F",
    "DataProviderID": 1,
    "OperatorID": 3297,
    "UsageTypeID": 4,
    "AddressInfo": {
        "ID": 95148,
        "Title": "Im Rosengarten",
        "AddressLine1": "Im Rosengarten",
        "AddressLine2": "Klein-Rohrheim",
        "Town": "Gernsheim",
        "StateOrProvince": "Kreis Groß-Gerau",
        "Postcode": "64579",
        "CountryID": 87,
        "Latitude": 49.7500633,
        "Longitude": 8.484021600000005,
        "AccessComments": "24/7 nutzbar.",
        "RelatedURL": "http://www.wormser-zeitung.de/lokales/biblis/zwei-neue-ladesaeulen-in-gernsheim-um-das-elektroauto-aufzuladen_18261346.htm",
        "DistanceUnit": 0
    },
    "Connections": [
        {
            "ID": 133999,
            "ConnectionTypeID": 25,
            "StatusTypeID": 50,
            "LevelID": 2,
            "Amps": 32,
            "Voltage": 400,
            "PowerKW": 22,
            "CurrentTypeID": 20,
            "Quantity": 2
        }
    ],
    "NumberOfPoints": 2,
    "StatusTypeID": 50,
    "DateLastStatusUpdate": "2017-10-27T10:43:00Z",
    "DataQualityLevel": 1,
    "DateCreated": "2017-10-27T10:43:00Z",
    "SubmissionStatusTypeID": 200
}