{
    "IsRecentlyVerified": false,
    "ID": 173927,
    "UUID": "FB2BF95C-0F2F-4A7D-8E47-8995465D7EC6",
    "DataProviderID": 1,
    "OperatorID": 3324,
    "UsageTypeID": 1,
    "AddressInfo": {
        "ID": 174286,
        "Title": "Torrent 2 - Dir Castellón",
        "AddressLine1": "GALP",
        "Town": "Torrent",
        "StateOrProvince": "Valencian Community",
        "Postcode": "46900",
        "CountryID": 210,
        "Latitude": 39.400693908360466,
        "Longitude": -0.49169083754497933,
        "DistanceUnit": 0
    },
    "Connections": [
        {
            "ID": 267642,
            "ConnectionTypeID": 2,
            "StatusTypeID": 50,
            "LevelID": 3,
            "PowerKW": 90,
            "CurrentTypeID": 30,
            "Quantity": 2
        },
        {
            "ID": 267643,
            "ConnectionTypeID": 33,
            "StatusTypeID": 50,
            "LevelID": 3,
            "PowerKW": 90,
            "CurrentTypeID": 30,
            "Quantity": 2
        },
        {
            "ID": 267644,
            "ConnectionTypeID": 25,
            "StatusTypeID": 50,
            "LevelID": 2,
            "PowerKW": 22,
            "Quantity": 2
        }
    ],
    "NumberOfPoints": 4,
    "StatusTypeID": 50,
    "DateLastStatusUpdate": "2021-04-27T01:12:00Z",
    "DataQualityLevel": 1,
    "DateCreated": "2021-03-07T13:30:00Z",
    "SubmissionStatusTypeID": 200
}