{
    "IsRecentlyVerified": false,
    "ID": 180969,
    "UUID": "168849AD-888B-4E4E-91D1-FC8834CEB2D4",
    "DataProviderID": 29,
    "DataProvidersReference": "19449",
    "AddressInfo": {
        "ID": 181328,
        "Title": "Am Sportzentrum 19",
        "AddressLine1": "Am Sportzentrum 19",
        "Town": "Sandersdorf-Brehna",
        "Postcode": "06792",
        "CountryID": 87,
        "Latitude": 51.62357,
        "Longitude": 12.269897,
        "DistanceUnit": 0
    },
    "Connections": [
        {
            "ID": 284711,
            "ConnectionTypeID": 25,
            "StatusTypeID": 50,
            "LevelID": 2,
            "PowerKW": 22,
            "CurrentTypeID": 20
        },
        {
            "ID": 284712,
            "ConnectionTypeID": 25,
            "StatusTypeID": 50,
            "LevelID": 2,
            "PowerKW": 22,
            "CurrentTypeID": 20
        }
    ],
    "StatusTypeID": 50,
    "DateLastStatusUpdate": "2021-07-12T02:48:00Z",
    "MetadataValues": [
        {
            "ID": 13263,
            "MetadataFieldID": 4,
            "ItemValue": "Data from the German chargepoint registry provided by Bundesnetzagentur.de under the CC-BY 4.0 license"
        }
    ],
    "DataQualityLevel": 3,
    "DateCreated": "2021-07-08T10:01:00Z",
    "SubmissionStatusTypeID": 100
}