{
    "IsRecentlyVerified": false,
    "ID": 139388,
    "UUID": "FC2DA700-F419-422E-89C1-F9BEFE1540CC",
    "DataProviderID": 2,
    "DataProvidersReference": "49980",
    "OperatorID": 5,
    "UsageTypeID": 1,
    "AddressInfo": {
        "ID": 139740,
        "Title": "EVSP WALGREENS",
        "AddressLine1": "5913 Carson St",
        "Town": "Lakewood",
        "StateOrProvince": "CA",
        "Postcode": "90713",
        "CountryID": 2,
        "Latitude": 33.83283,
        "Longitude": -118.1161656,
        "ContactTelephone1": "888-758-4389",
        "AccessComments": "24 hours daily",
        "RelatedURL": "http://www.chargepoint.com/",
        "DistanceUnit": 0
    },
    "Connections": [
        {
            "ID": 194721,
            "ConnectionTypeID": 1,
            "LevelID": 2,
            "Amps": 16,
            "Voltage": 230,
            "PowerKW": 3,
            "CurrentTypeID": 10,
            "Quantity": 1
        }
    ],
    "StatusTypeID": 50,
    "DateLastStatusUpdate": "2019-12-24T09:10:00Z",
    "DataQualityLevel": 3,
    "DateCreated": "2019-12-24T09:10:00Z",
    "SubmissionStatusTypeID": 100
}