{
    "IsRecentlyVerified": false,
    "ID": 182301,
    "UUID": "2813588E-8CC3-4652-8F36-5EEBD4432180",
    "DataProviderID": 29,
    "DataProvidersReference": "16032",
    "AddressInfo": {
        "ID": 182660,
        "Title": "Ruhrstraße 9",
        "AddressLine1": "Ruhrstraße 9",
        "Town": "Fröndenberg",
        "Postcode": "58730",
        "CountryID": 87,
        "Latitude": 51.471004,
        "Longitude": 7.768302,
        "DistanceUnit": 0
    },
    "Connections": [
        {
            "ID": 287869,
            "ConnectionTypeID": 25,
            "StatusTypeID": 50,
            "LevelID": 2,
            "PowerKW": 22,
            "CurrentTypeID": 20
        },
        {
            "ID": 287870,
            "ConnectionTypeID": 25,
            "StatusTypeID": 50,
            "LevelID": 2,
            "PowerKW": 22,
            "CurrentTypeID": 20
        }
    ],
    "StatusTypeID": 50,
    "DateLastStatusUpdate": "2021-07-12T02:47:00Z",
    "MetadataValues": [
        {
            "ID": 14595,
            "MetadataFieldID": 4,
            "ItemValue": "Data from the German chargepoint registry provided by Bundesnetzagentur.de under the CC-BY 4.0 license"
        }
    ],
    "DataQualityLevel": 3,
    "DateCreated": "2021-07-08T10:02:00Z",
    "SubmissionStatusTypeID": 100
}