{
    "IsRecentlyVerified": false,
    "ID": 140209,
    "UUID": "8D362FD0-CBC0-47EB-BB1A-6F45E94CF630",
    "DataProviderID": 2,
    "DataProvidersReference": "121307",
    "UsageTypeID": 1,
    "AddressInfo": {
        "ID": 140561,
        "Title": "Glenwood Acres RV Park",
        "AddressLine1": "4632 Delrae Cir",
        "Town": "Concord",
        "StateOrProvince": "NC",
        "Postcode": "28027",
        "CountryID": 2,
        "Latitude": 35.351959,
        "Longitude": -80.69282,
        "ContactTelephone1": "704-455-9282",
        "AccessComments": "9am-5pm M-F, 10am-5pm Sat, 12pm-5pm Sun",
        "RelatedURL": "",
        "DistanceUnit": 0
    },
    "Connections": [
        {
            "ID": 195791,
            "ConnectionTypeID": 11,
            "LevelID": 1,
            "Amps": 16,
            "Voltage": 120,
            "PowerKW": 1.9,
            "CurrentTypeID": 10,
            "Quantity": 2
        }
    ],
    "StatusTypeID": 50,
    "DateLastStatusUpdate": "2020-06-26T02:58:00Z",
    "DataQualityLevel": 3,
    "DateCreated": "2019-12-24T09:12:00Z",
    "SubmissionStatusTypeID": 100
}