{
    "IsRecentlyVerified": false,
    "ID": 127340,
    "UUID": "DA778E94-DF37-4FE4-8632-D36725B10F54",
    "DataProviderID": 1,
    "OperatorID": 22,
    "OperatorsReference": "C4G6V",
    "UsageTypeID": 4,
    "AddressInfo": {
        "ID": 127686,
        "Title": "Bus Station Car Park",
        "AddressLine1": "Donore Road",
        "Town": "Drogheda",
        "StateOrProvince": "County Louth",
        "CountryID": 3,
        "Latitude": 53.710949,
        "Longitude": -6.355072,
        "DistanceUnit": 0
    },
    "Connections": [
        {
            "ID": 178298,
            "ConnectionTypeID": 25,
            "StatusTypeID": 50,
            "LevelID": 2,
            "Amps": 32,
            "Voltage": 400,
            "PowerKW": 22,
            "CurrentTypeID": 20,
            "Quantity": 2
        }
    ],
    "NumberOfPoints": 2,
    "StatusTypeID": 50,
    "DateLastStatusUpdate": "2019-06-03T08:48:00Z",
    "DataQualityLevel": 1,
    "DateCreated": "2019-06-03T08:48:00Z",
    "SubmissionStatusTypeID": 200
}