{
    "IsRecentlyVerified": false,
    "ID": 183119,
    "UUID": "BE4E5FD9-6339-46FF-99DB-1987D70D4CC8",
    "DataProviderID": 29,
    "DataProvidersReference": "20604",
    "OperatorID": 45,
    "AddressInfo": {
        "ID": 183478,
        "Title": "Im Stangenwald 46",
        "AddressLine1": "Im Stangenwald 46",
        "Town": "Bischofswiesen",
        "Postcode": "83483",
        "CountryID": 87,
        "Latitude": 47.617659,
        "Longitude": 12.969435,
        "DistanceUnit": 0
    },
    "Connections": [
        {
            "ID": 289710,
            "ConnectionTypeID": 25,
            "StatusTypeID": 50,
            "LevelID": 2,
            "PowerKW": 22,
            "CurrentTypeID": 20
        },
        {
            "ID": 289711,
            "ConnectionTypeID": 25,
            "StatusTypeID": 50,
            "LevelID": 2,
            "PowerKW": 22,
            "CurrentTypeID": 20
        }
    ],
    "StatusTypeID": 50,
    "DateLastStatusUpdate": "2021-07-12T02:39:00Z",
    "MetadataValues": [
        {
            "ID": 15412,
            "MetadataFieldID": 4,
            "ItemValue": "Data from the German chargepoint registry provided by Bundesnetzagentur.de under the CC-BY 4.0 license"
        }
    ],
    "DataQualityLevel": 3,
    "DateCreated": "2021-07-08T10:03:00Z",
    "SubmissionStatusTypeID": 100
}