{
    "IsRecentlyVerified": false,
    "ID": 119388,
    "UUID": "5A74EED7-83F3-4AD8-8120-83F610EFFCA2",
    "DataProviderID": 2,
    "DataProvidersReference": "81335",
    "UsageTypeID": 1,
    "AddressInfo": {
        "ID": 119734,
        "Title": "J. Walter Cameron Center",
        "AddressLine1": "2295 N King St",
        "Town": "Wailuku",
        "StateOrProvince": "HI",
        "Postcode": "96793",
        "CountryID": 2,
        "Latitude": 20.887,
        "Longitude": -156.48835,
        "ContactTelephone1": "808-244-5546",
        "AccessComments": "24 hours daily",
        "RelatedURL": "",
        "DistanceUnit": 0
    },
    "Connections": [
        {
            "ID": 168642,
            "ConnectionTypeID": 2,
            "LevelID": 3,
            "Amps": 100,
            "Voltage": 400,
            "PowerKW": 40,
            "CurrentTypeID": 30,
            "Quantity": 4
        }
    ],
    "DateLastStatusUpdate": "2020-06-26T02:52:00Z",
    "DataQualityLevel": 3,
    "DateCreated": "2019-04-01T04:59:00Z",
    "SubmissionStatusTypeID": 100
}