{
    "IsRecentlyVerified": false,
    "ID": 141312,
    "UUID": "B7B10190-64D6-47D1-B1B0-2A9C1948FDD2",
    "DataProviderID": 2,
    "DataProvidersReference": "118346",
    "OperatorID": 9,
    "UsageTypeID": 2,
    "AddressInfo": {
        "ID": 141664,
        "Title": "BELLE PRE",
        "AddressLine1": "1125 Madison St",
        "Town": "Alexandria",
        "StateOrProvince": "VA",
        "Postcode": "22314",
        "CountryID": 2,
        "Latitude": 38.813768,
        "Longitude": -77.050057,
        "ContactTelephone1": "888-998-2546",
        "AccessComments": "MON: 24 hours | TUE: 24 hours | WED: 24 hours | THU: 24 hours | FRI: 24 hours | SAT: 24 hours | SUN: 24 hours",
        "RelatedURL": "http://www.blinkcharging.com/",
        "DistanceUnit": 0
    },
    "Connections": [
        {
            "ID": 197218,
            "ConnectionTypeID": 1,
            "LevelID": 2,
            "Amps": 16,
            "Voltage": 230,
            "PowerKW": 3.7,
            "CurrentTypeID": 10,
            "Quantity": 1
        }
    ],
    "StatusTypeID": 50,
    "DateLastStatusUpdate": "2020-06-26T03:00:00Z",
    "DataQualityLevel": 3,
    "DateCreated": "2019-12-24T09:15:00Z",
    "SubmissionStatusTypeID": 100
}