{
    "IsRecentlyVerified": false,
    "ID": 52210,
    "UUID": "BB286C46-F54D-44F5-801F-B6AF4F808441",
    "DataProviderID": 1,
    "OperatorID": 44,
    "UsageTypeID": 3,
    "UsageCost": "Free",
    "AddressInfo": {
        "ID": 52556,
        "Title": "Home",
        "AddressLine1": "615 North Poplar Street",
        "Town": "Beloit ",
        "StateOrProvince": "KS",
        "Postcode": "67420",
        "CountryID": 2,
        "Latitude": 39.461672752735865,
        "Longitude": -98.1205382666131,
        "ContactTelephone1": "7855455629",
        "ContactEmail": "windydrew@gmail.com",
        "AccessComments": "Inside garage but have a cord to charge in driveway",
        "DistanceUnit": 0
    },
    "Connections": [
        {
            "ID": 64832,
            "ConnectionTypeID": 1,
            "StatusTypeID": 50,
            "LevelID": 2,
            "Amps": 32,
            "Voltage": 240,
            "PowerKW": 9,
            "CurrentTypeID": 10,
            "Quantity": 1
        },
        {
            "ID": 271011,
            "ConnectionTypeID": 30,
            "StatusTypeID": 50,
            "LevelID": 2,
            "Amps": 48,
            "Voltage": 240,
            "PowerKW": 11.4,
            "CurrentTypeID": 10,
            "Quantity": 1
        }
    ],
    "NumberOfPoints": 1,
    "StatusTypeID": 50,
    "DateLastStatusUpdate": "2021-04-17T15:59:00Z",
    "DataQualityLevel": 1,
    "DateCreated": "2015-08-23T20:30:00Z",
    "SubmissionStatusTypeID": 200
}