{
    "IsRecentlyVerified": false,
    "ID": 62608,
    "UUID": "C92897E6-0C77-4295-A5CE-E214021C6138",
    "DataProviderID": 26,
    "DataProvidersReference": "19924",
    "OperatorID": 162,
    "OperatorsReference": "中部三菱自動車販売㈱グリーンロード店",
    "UsageCost": "0.00 onbekend",
    "AddressInfo": {
        "ID": 62954,
        "Title": "春日井長久手線",
        "AddressLine1": "春日井長久手線",
        "Town": "愛知郡",
        "Postcode": "4880801",
        "CountryID": 114,
        "Latitude": 35.184128,
        "Longitude": 137.048767,
        "DistanceUnit": 0
    },
    "Connections": [
        {
            "ID": 79529,
            "ConnectionTypeID": 2,
            "LevelID": 3,
            "PowerKW": 50,
            "CurrentTypeID": 30
        }
    ],
    "NumberOfPoints": 1,
    "StatusTypeID": 50,
    "DateLastStatusUpdate": "2016-03-03T12:28:00Z",
    "DataQualityLevel": 3,
    "DateCreated": "2016-03-03T12:28:00Z",
    "SubmissionStatusTypeID": 100
}