{
    "IsRecentlyVerified": false,
    "ID": 53023,
    "UUID": "0FCA1282-8D15-4FF9-A98B-34987BF4FB31",
    "DataProviderID": 1,
    "OperatorID": 32,
    "OperatorsReference": "2195",
    "UsageTypeID": 4,
    "UsageCost": "Inclusive; for Polar Plus subscription members only",
    "AddressInfo": {
        "ID": 53369,
        "Title": "Hayes End Library",
        "AddressLine1": "1346 Uxbridge Road",
        "Town": "London",
        "StateOrProvince": "England",
        "Postcode": "UB4 8JQ",
        "CountryID": 1,
        "Latitude": 51.525902,
        "Longitude": -0.436126,
        "ContactTelephone1": "0845 850 0653",
        "DistanceUnit": 0
    },
    "Connections": [
        {
            "ID": 66059,
            "ConnectionTypeID": 25,
            "StatusTypeID": 50,
            "LevelID": 2,
            "Amps": 32,
            "Voltage": 230,
            "PowerKW": 7,
            "CurrentTypeID": 10,
            "Quantity": 2
        }
    ],
    "NumberOfPoints": 2,
    "GeneralComments": "Chargemaster post. Polar Network cards / App accepted as well as Source London",
    "StatusTypeID": 50,
    "DateLastStatusUpdate": "2019-03-07T06:40:00Z",
    "DataQualityLevel": 1,
    "DateCreated": "2015-09-17T10:57:00Z",
    "SubmissionStatusTypeID": 200
}