{
    "IsRecentlyVerified": false,
    "ID": 102405,
    "UUID": "680D9AE4-466D-4EE5-9C23-DA41FD8E5EF8",
    "DataProviderID": 2,
    "DataProvidersReference": "94792",
    "UsageTypeID": 1,
    "AddressInfo": {
        "ID": 102751,
        "Title": "Office Building",
        "AddressLine1": "1101 W MacArthur Blvd",
        "Town": "Santa Ana",
        "StateOrProvince": "CA",
        "Postcode": "92707",
        "CountryID": 2,
        "Latitude": 33.700247,
        "Longitude": -117.882008,
        "ContactTelephone1": "866-816-7584",
        "AccessComments": "Office business hours; for employee and guest use only",
        "RelatedURL": "http://evconnect.com/",
        "DistanceUnit": 0
    },
    "Connections": [
        {
            "ID": 144476,
            "ConnectionTypeID": 1,
            "LevelID": 2,
            "Amps": 16,
            "Voltage": 230,
            "PowerKW": 3,
            "CurrentTypeID": 10,
            "Quantity": 12
        }
    ],
    "DateLastStatusUpdate": "2019-04-06T04:01:00Z",
    "DataQualityLevel": 3,
    "DateCreated": "2018-04-21T04:13:00Z",
    "SubmissionStatusTypeID": 100
}