{
    "IsRecentlyVerified": false,
    "ID": 165176,
    "UUID": "677E404A-8A7E-4221-B8BA-E015DD49CCA4",
    "DataProviderID": 1,
    "DataProvidersReference": "TR-BOL-002",
    "OperatorID": 70,
    "UsageTypeID": 1,
    "AddressInfo": {
        "ID": 165535,
        "Title": "Eşarj - Highway Outlet Alışveriş ve Yaşam Merkezi",
        "AddressLine1": "Ankara-İstanbul Otoyolu, 227. Km, Elmalık Mevkii",
        "Town": "Bolu",
        "StateOrProvince": "Bolu",
        "Postcode": "14030",
        "CountryID": 229,
        "Latitude": 40.724181,
        "Longitude": 31.463743,
        "ContactTelephone1": "+90 (850) 433 72 75",
        "ContactEmail": "destek@esarj.com",
        "RelatedURL": "https://esarj.com/en/map?s=TR-BOL-002",
        "DistanceUnit": 0
    },
    "Connections": [
        {
            "ID": 236816,
            "ConnectionTypeID": 33,
            "LevelID": 2,
            "Amps": 175,
            "Voltage": 920,
            "PowerKW": 161,
            "Quantity": 1
        }
    ],
    "GeneralComments": "Eşarj Charging Systems",
    "StatusTypeID": 50,
    "DateLastStatusUpdate": "2020-08-26T08:19:00Z",
    "DataQualityLevel": 3,
    "DateCreated": "2020-08-26T08:19:00Z",
    "SubmissionStatusTypeID": 200
}