{
    "IsRecentlyVerified": false,
    "ID": 17901,
    "UUID": "8C893F16-4CE7-4E03-A316-3C8C73318D4B",
    "DataProviderID": 22,
    "DataProvidersReference": "6AACD73D825E28970D6D9B8AC7F0D8D8",
    "AddressInfo": {
        "ID": 18246,
        "Title": "京都三菱本社十条店・クリーンカー十条",
        "AddressLine1": "京都府京都市南区西九条菅田町15",
        "CountryID": 114,
        "Latitude": 34.97500998,
        "Longitude": 135.7467403,
        "ContactTelephone1": "075-662-7611",
        "DistanceUnit": 0
    },
    "Connections": [
        {
            "ID": 18142,
            "ConnectionTypeID": 2,
            "LevelID": 2,
            "Amps": 100,
            "Voltage": 480,
            "PowerKW": 48,
            "Quantity": 1
        }
    ],
    "DateLastStatusUpdate": "2013-06-29T09:04:00Z",
    "DataQualityLevel": 2,
    "DateCreated": "2013-06-29T09:04:00Z",
    "SubmissionStatusTypeID": 200
}