{
    "IsRecentlyVerified": false,
    "ID": 177993,
    "UUID": "9E1DA566-870C-440C-8DF7-EEAF6EB8EEE8",
    "DataProviderID": 29,
    "DataProvidersReference": "14153",
    "AddressInfo": {
        "ID": 178352,
        "Title": "Bismarckstraße 53",
        "AddressLine1": "Bismarckstraße 53",
        "Town": "Oberhausen",
        "Postcode": "46047",
        "CountryID": 87,
        "Latitude": 51.4768820796301,
        "Longitude": 6.86955356987464,
        "DistanceUnit": 0
    },
    "Connections": [
        {
            "ID": 277831,
            "ConnectionTypeID": 25,
            "StatusTypeID": 50,
            "LevelID": 2,
            "PowerKW": 22,
            "CurrentTypeID": 20
        },
        {
            "ID": 277832,
            "ConnectionTypeID": 25,
            "StatusTypeID": 50,
            "LevelID": 2,
            "PowerKW": 22,
            "CurrentTypeID": 20
        }
    ],
    "StatusTypeID": 0,
    "DateLastStatusUpdate": "2021-07-12T02:47:00Z",
    "MetadataValues": [
        {
            "ID": 10287,
            "MetadataFieldID": 4,
            "ItemValue": "Data from the German chargepoint registry provided by Bundesnetzagentur.de under the CC-BY 4.0 license"
        }
    ],
    "DataQualityLevel": 3,
    "DateCreated": "2021-07-08T09:49:00Z",
    "SubmissionStatusTypeID": 100
}