{
    "IsRecentlyVerified": false,
    "ID": 183534,
    "UUID": "92C6A430-F4A8-4762-9830-E26DC3310D5B",
    "DataProviderID": 29,
    "DataProvidersReference": "5714",
    "AddressInfo": {
        "ID": 183893,
        "Title": "Konrad-Adenauer-Allee 20b",
        "AddressLine1": "Konrad-Adenauer-Allee 20b",
        "Town": "Oelde",
        "Postcode": "59302",
        "CountryID": 87,
        "Latitude": 51.818447,
        "Longitude": 8.142111,
        "DistanceUnit": 0
    },
    "Connections": [
        {
            "ID": 290636,
            "ConnectionTypeID": 25,
            "StatusTypeID": 50,
            "LevelID": 2,
            "PowerKW": 22,
            "CurrentTypeID": 20
        },
        {
            "ID": 290637,
            "ConnectionTypeID": 25,
            "StatusTypeID": 50,
            "LevelID": 2,
            "PowerKW": 22,
            "CurrentTypeID": 20
        }
    ],
    "StatusTypeID": 50,
    "DateLastStatusUpdate": "2021-07-09T03:25:00Z",
    "MetadataValues": [
        {
            "ID": 15827,
            "MetadataFieldID": 4,
            "ItemValue": "Data from the German chargepoint registry provided by Bundesnetzagentur.de under the CC-BY 4.0 license"
        }
    ],
    "DataQualityLevel": 3,
    "DateCreated": "2021-07-08T10:04:00Z",
    "SubmissionStatusTypeID": 100
}