{
    "IsRecentlyVerified": false,
    "ID": 96730,
    "UUID": "B0FAC4FF-09D2-412C-A337-0EB4BB96F79E",
    "DataProviderID": 2,
    "DataProvidersReference": "88037",
    "UsageTypeID": 1,
    "AddressInfo": {
        "ID": 97076,
        "Title": "City of Mount Vernon - City Hall",
        "AddressLine1": "213 1st St W",
        "Town": "Mount Vernon",
        "StateOrProvince": "IA",
        "Postcode": "52314",
        "CountryID": 2,
        "Latitude": 41.923375,
        "Longitude": -91.418377,
        "ContactTelephone1": "319-895-8742",
        "AccessComments": "24 hours daily",
        "RelatedURL": "",
        "DistanceUnit": 0
    },
    "Connections": [
        {
            "ID": 137007,
            "ConnectionTypeID": 1,
            "LevelID": 2,
            "Amps": 16,
            "Voltage": 230,
            "PowerKW": 3.7,
            "CurrentTypeID": 10,
            "Quantity": 2
        }
    ],
    "DateLastStatusUpdate": "2020-06-26T03:05:00Z",
    "DataQualityLevel": 3,
    "DateCreated": "2017-12-29T21:01:00Z",
    "SubmissionStatusTypeID": 100
}