{
    "IsRecentlyVerified": false,
    "ID": 173174,
    "UUID": "D7CDEAF5-015D-4938-81D8-EC8EAB5E27A3",
    "DataProviderID": 19,
    "DataProvidersReference": "7075",
    "AddressInfo": {
        "ID": 173533,
        "Title": "Esso Ryen",
        "AddressLine1": "Enebakkveien 139",
        "Town": "OSLO",
        "StateOrProvince": "Oslo",
        "Postcode": "0680",
        "CountryID": 168,
        "Latitude": 59.8945622,
        "Longitude": 10.8050726,
        "AccessComments": "",
        "DistanceUnit": 0
    },
    "Connections": [
        {
            "ID": 265612,
            "ConnectionTypeID": 2,
            "Reference": "1",
            "LevelID": 3,
            "Amps": 100,
            "Voltage": 500,
            "PowerKW": 50,
            "CurrentTypeID": 30,
            "Comments": "Mode 4"
        },
        {
            "ID": 265613,
            "ConnectionTypeID": 33,
            "Reference": "2",
            "LevelID": 3,
            "Amps": 100,
            "Voltage": 500,
            "PowerKW": 50,
            "CurrentTypeID": 30,
            "Comments": "Mode 4"
        },
        {
            "ID": 265614,
            "ConnectionTypeID": 2,
            "Reference": "3",
            "LevelID": 3,
            "Amps": 100,
            "Voltage": 500,
            "PowerKW": 50,
            "CurrentTypeID": 30,
            "Comments": "Mode 4"
        },
        {
            "ID": 265615,
            "ConnectionTypeID": 33,
            "Reference": "4",
            "LevelID": 3,
            "Amps": 100,
            "Voltage": 500,
            "PowerKW": 50,
            "CurrentTypeID": 30,
            "Comments": "Mode 4"
        },
        {
            "ID": 265616,
            "ConnectionTypeID": 2,
            "Reference": "5",
            "LevelID": 3,
            "Amps": 100,
            "Voltage": 500,
            "PowerKW": 50,
            "CurrentTypeID": 30,
            "Comments": "Mode 4"
        },
        {
            "ID": 265617,
            "ConnectionTypeID": 33,
            "Reference": "6",
            "LevelID": 3,
            "Amps": 100,
            "Voltage": 500,
            "PowerKW": 50,
            "CurrentTypeID": 30,
            "Comments": "Mode 4"
        },
        {
            "ID": 265618,
            "ConnectionTypeID": 33,
            "Reference": "7",
            "Comments": "Mode 4"
        },
        {
            "ID": 265619,
            "ConnectionTypeID": 33,
            "Reference": "8",
            "Comments": "Mode 4"
        }
    ],
    "NumberOfPoints": 8,
    "StatusTypeID": 0,
    "DateLastStatusUpdate": "2021-03-24T05:11:00Z",
    "DataQualityLevel": 2,
    "DateCreated": "2021-03-03T09:02:00Z",
    "SubmissionStatusTypeID": 100
}