{
    "IsRecentlyVerified": false,
    "ID": 175053,
    "UUID": "AC2CE45E-0905-4392-A898-2221B1A3838E",
    "DataProviderID": 1,
    "OperatorID": 3299,
    "UsageTypeID": 1,
    "AddressInfo": {
        "ID": 175412,
        "Title": "IONITY Mayenne",
        "AddressLine1": "Aire de la Mayenne",
        "Town": "Bonchamp-lès-Laval",
        "Postcode": "53960",
        "CountryID": 80,
        "Latitude": 48.09518,
        "Longitude": -0.693474,
        "DistanceUnit": 0
    },
    "Connections": [
        {
            "ID": 271300,
            "ConnectionTypeID": 33,
            "StatusTypeID": 50,
            "LevelID": 2,
            "PowerKW": 350
        }
    ],
    "NumberOfPoints": 4,
    "StatusTypeID": 50,
    "DateLastStatusUpdate": "2021-04-28T15:53:00Z",
    "DataQualityLevel": 1,
    "DateCreated": "2021-04-25T15:39:00Z",
    "SubmissionStatusTypeID": 200
}