{
    "IsRecentlyVerified": false,
    "ID": 90978,
    "UUID": "19E8BC90-F750-4CA9-A670-C35B1AC5AABC",
    "DataProviderID": 1,
    "OperatorID": 23,
    "OperatorsReference": "32362",
    "UsageTypeID": 6,
    "AddressInfo": {
        "ID": 91324,
        "Title": "Weinlandhof Hotel - Restaurant Gamlitz",
        "AddressLine1": "Untere Hauptstrasse 15",
        "Town": "Gamlitz",
        "Postcode": "8462",
        "CountryID": 19,
        "Latitude": 46.721539,
        "Longitude": 15.558626,
        "ContactTelephone1": "+43 3453 2584",
        "DistanceUnit": 0
    },
    "Connections": [
        {
            "ID": 129033,
            "ConnectionTypeID": 30,
            "StatusTypeID": 50,
            "LevelID": 2,
            "Amps": 16,
            "Voltage": 400,
            "PowerKW": 11,
            "CurrentTypeID": 20,
            "Quantity": 2
        }
    ],
    "NumberOfPoints": 2,
    "GeneralComments": "2 Tesla Connectors, up to 11kW.Available for patrons only. Please see front desk.",
    "StatusTypeID": 50,
    "DateLastStatusUpdate": "2018-10-03T14:46:00Z",
    "DataQualityLevel": 1,
    "DateCreated": "2017-07-28T05:34:00Z",
    "SubmissionStatusTypeID": 200
}