{
    "IsRecentlyVerified": false,
    "ID": 176044,
    "UUID": "792F62FE-817A-433B-ABF2-CDB79F32D409",
    "DataProviderID": 1,
    "DataProvidersReference": "1",
    "OperatorID": 3425,
    "UsageTypeID": 1,
    "AddressInfo": {
        "ID": 176403,
        "Title": "Rezidence Na Plachtě",
        "AddressLine1": "Antonína Petrofa",
        "Town": "Hradec Králové 500 09",
        "CountryID": 64,
        "Latitude": 50.193504,
        "Longitude": 15.857499,
        "RelatedURL": "http://rnp-elektromobilni.cz/",
        "DistanceUnit": 0
    },
    "Connections": [
        {
            "ID": 273487,
            "ConnectionTypeID": 1036,
            "LevelID": 2,
            "Amps": 32,
            "Voltage": 500,
            "PowerKW": 22
        },
        {
            "ID": 273488,
            "ConnectionTypeID": 33,
            "LevelID": 2,
            "Amps": 60,
            "Voltage": 500,
            "PowerKW": 30
        }
    ],
    "StatusTypeID": 50,
    "DateLastStatusUpdate": "2021-06-24T09:44:00Z",
    "DataQualityLevel": 3,
    "DateCreated": "2021-06-24T08:43:00Z",
    "SubmissionStatusTypeID": 200
}