{
    "IsRecentlyVerified": false,
    "ID": 170366,
    "UUID": "38258379-3D3D-42E2-B5AC-84A9EF21E59B",
    "DataProviderID": 1,
    "OperatorID": 32,
    "UsageTypeID": 5,
    "UsageCost": "Rapids Polar Card 15p/kWh, Contactless 20p/kWh",
    "AddressInfo": {
        "ID": 170725,
        "Title": "Miller & Carter Enderby",
        "AddressLine1": "Leicester Road",
        "AddressLine2": "Leicestershire",
        "Town": "Enderby",
        "StateOrProvince": "England",
        "Postcode": "LE19 2BJ",
        "CountryID": 1,
        "Latitude": 52.58284216605688,
        "Longitude": -1.1917552002029197,
        "RelatedURL": "https://polar-network.com/",
        "DistanceUnit": 0
    },
    "Connections": [
        {
            "ID": 259869,
            "ConnectionTypeID": 33,
            "StatusTypeID": 50,
            "LevelID": 3,
            "PowerKW": 50,
            "CurrentTypeID": 30,
            "Quantity": 1
        },
        {
            "ID": 259870,
            "ConnectionTypeID": 2,
            "StatusTypeID": 50,
            "LevelID": 3,
            "PowerKW": 50,
            "CurrentTypeID": 30,
            "Quantity": 1
        },
        {
            "ID": 259871,
            "ConnectionTypeID": 1036,
            "StatusTypeID": 50,
            "LevelID": 3,
            "PowerKW": 43,
            "CurrentTypeID": 20,
            "Quantity": 1
        }
    ],
    "NumberOfPoints": 1,
    "StatusTypeID": 50,
    "DateLastStatusUpdate": "2020-11-24T17:14:00Z",
    "DataQualityLevel": 1,
    "DateCreated": "2020-11-24T17:14:00Z",
    "SubmissionStatusTypeID": 200
}