{
    "IsRecentlyVerified": false,
    "ID": 174907,
    "UUID": "DBD83DD9-40F9-4B8F-8D48-3D33AFAD71AD",
    "DataProviderID": 1,
    "OperatorID": 21,
    "UsageTypeID": 4,
    "UsageCost": "Mobi.E compatible card or App",
    "AddressInfo": {
        "ID": 175266,
        "Title": "MUR-00001",
        "AddressLine1": "ER 15",
        "Town": "Murça",
        "StateOrProvince": "Vila Real",
        "Postcode": "5090-139 MURÇA",
        "CountryID": 180,
        "Latitude": 41.40573086169235,
        "Longitude": -7.450624510346188,
        "DistanceUnit": 0
    },
    "Connections": [
        {
            "ID": 271043,
            "ConnectionTypeID": 25,
            "StatusTypeID": 50,
            "LevelID": 2,
            "Amps": 32,
            "Voltage": 400,
            "PowerKW": 22,
            "CurrentTypeID": 20,
            "Quantity": 2
        }
    ],
    "NumberOfPoints": 2,
    "StatusTypeID": 50,
    "DateLastStatusUpdate": "2021-04-18T13:06:00Z",
    "DataQualityLevel": 1,
    "DateCreated": "2021-04-18T13:06:00Z",
    "SubmissionStatusTypeID": 200
}