{
    "IsRecentlyVerified": false,
    "ID": 80249,
    "UUID": "7BD2489A-3622-4FC6-A023-794DA9B2606E",
    "DataProviderID": 2,
    "DataProvidersReference": "81011",
    "OperatorID": 39,
    "UsageTypeID": 1,
    "AddressInfo": {
        "ID": 80595,
        "Title": "College Park Downtown Parking Garage",
        "AddressLine1": "7364 Yale Avenue",
        "Town": "College Park",
        "StateOrProvince": "MD",
        "Postcode": "20740",
        "CountryID": 2,
        "Latitude": 38.9804536,
        "Longitude": -76.9367647,
        "ContactTelephone1": "800-663-5633",
        "AccessComments": "MO: 12:00am-12:00am; TU: 12:00am-12:00am; WE: 12:00am-12:00am; TH: 12:00am-12:00am; FR: 12:00am-12:00am; SA: 12:00am-12:00am; SU: 12:00am-12:00am",
        "RelatedURL": "http://www.semacharge.com/",
        "DistanceUnit": 0
    },
    "Connections": [
        {
            "ID": 114919,
            "ConnectionTypeID": 1,
            "LevelID": 2,
            "Amps": 16,
            "Voltage": 230,
            "PowerKW": 3,
            "CurrentTypeID": 10,
            "Quantity": 2
        }
    ],
    "DateLastStatusUpdate": "2019-04-06T05:04:00Z",
    "DataQualityLevel": 3,
    "DateCreated": "2017-01-31T01:05:00Z",
    "SubmissionStatusTypeID": 100
}