{
    "IsRecentlyVerified": false,
    "ID": 133883,
    "UUID": "1D8CFFF3-4960-424E-BB54-7BEB516AE89A",
    "DataProviderID": 1,
    "OperatorID": 105,
    "UsageTypeID": 4,
    "AddressInfo": {
        "ID": 134229,
        "Title": "Sachsenstraße 23",
        "AddressLine1": "Sachsenstraße 23",
        "Town": "Essen",
        "StateOrProvince": "Nordrhein-Westfalen",
        "Postcode": "45128",
        "CountryID": 87,
        "Latitude": 51.4492615208495,
        "Longitude": 7.00478047420484,
        "DistanceUnit": 0
    },
    "Connections": [
        {
            "ID": 187353,
            "ConnectionTypeID": 25,
            "StatusTypeID": 50,
            "LevelID": 2,
            "PowerKW": 22,
            "CurrentTypeID": 20,
            "Quantity": 2
        }
    ],
    "NumberOfPoints": 1,
    "StatusTypeID": 50,
    "DateLastStatusUpdate": "2019-10-29T17:00:00Z",
    "DataQualityLevel": 1,
    "DateCreated": "2019-10-29T17:00:00Z",
    "SubmissionStatusTypeID": 200
}