{
    "IsRecentlyVerified": false,
    "ID": 153574,
    "UUID": "EBDEDD7C-A7E6-4623-B786-10984983551D",
    "DataProviderID": 28,
    "DataProvidersReference": "FR*S53*P53147*001",
    "UsageTypeID": 5,
    "AddressInfo": {
        "ID": 153927,
        "Title": "MAYENNE - Rue Volney",
        "AddressLine1": "Rue Volney 53100 MAYENNE",
        "CountryID": 80,
        "Latitude": 48.297358,
        "Longitude": -0.611277,
        "AccessComments": "24h/24 7j/7",
        "DistanceUnit": 0
    },
    "Connections": [
        {
            "ID": 215528,
            "ConnectionTypeID": 25,
            "StatusTypeID": 50,
            "LevelID": 2,
            "PowerKW": 18,
            "CurrentTypeID": 20
        },
        {
            "ID": 215529,
            "ConnectionTypeID": 28,
            "StatusTypeID": 50,
            "LevelID": 2,
            "PowerKW": 18,
            "CurrentTypeID": 10
        },
        {
            "ID": 249046,
            "ConnectionTypeID": 25,
            "StatusTypeID": 50,
            "LevelID": 2,
            "PowerKW": 18,
            "CurrentTypeID": 20
        },
        {
            "ID": 249047,
            "ConnectionTypeID": 28,
            "StatusTypeID": 50,
            "LevelID": 2,
            "PowerKW": 18,
            "CurrentTypeID": 10
        }
    ],
    "GeneralComments": "Recharge par badge et avec une application smartphone",
    "StatusTypeID": 50,
    "DateLastStatusUpdate": "2020-08-27T05:14:00Z",
    "DataQualityLevel": 2,
    "DateCreated": "2020-03-15T10:54:00Z",
    "SubmissionStatusTypeID": 100
}