{
    "UserComments": [
        {
            "ID": 24331,
            "ChargePointID": 175355,
            "CommentTypeID": 10,
            "UserName": "ForumElettrico.it",
            "Comment": "L'inaugurazione ufficiale ci sarà il 24/5/21 ma è già attivabile con RFID Plugsurfing. Leggi la recensione completa qui >  https://www.forumelettrico.it/forum/fast-concessionaria-nissan-viale-montegrappa-341-t17176.html",
            "RelatedURL": "https://www.forumelettrico.it/forum/fast-concessionaria-nissan-viale-montegrappa-341-t17176.html",
            "DateCreated": "2021-05-13T05:28:07.593Z",
            "User": {
                "ID": 11749,
                "Username": "ForumElettrico.it"
            },
            "CheckinStatusTypeID": 10,
            "IsActionedByEditor": false
        }
    ],
    "MediaItems": [
        {
            "ID": 27646,
            "ChargePointID": 175355,
            "ItemURL": "https://s3-ap-southeast-2.amazonaws.com/openchargemap/images/IT/OCM175355/OCM-175355.orig.2021051305283106.jpg",
            "ItemThumbnailURL": "https://s3-ap-southeast-2.amazonaws.com/openchargemap/images/IT/OCM175355/OCM-175355.thmb.2021051305283106.jpg",
            "Comment": "",
            "IsEnabled": true,
            "IsVideo": false,
            "IsFeaturedItem": false,
            "IsExternalResource": false,
            "User": {
                "ID": 11749,
                "Username": "ForumElettrico.it"
            },
            "DateCreated": "2021-05-13T05:29:00Z"
        },
        {
            "ID": 27647,
            "ChargePointID": 175355,
            "ItemURL": "https://s3-ap-southeast-2.amazonaws.com/openchargemap/images/IT/OCM175355/OCM-175355.orig.2021051305283761.jpg",
            "ItemThumbnailURL": "https://s3-ap-southeast-2.amazonaws.com/openchargemap/images/IT/OCM175355/OCM-175355.thmb.2021051305283761.jpg",
            "Comment": "",
            "IsEnabled": true,
            "IsVideo": false,
            "IsFeaturedItem": false,
            "IsExternalResource": false,
            "User": {
                "ID": 11749,
                "Username": "ForumElettrico.it"
            },
            "DateCreated": "2021-05-13T05:29:00Z"
        },
        {
            "ID": 27644,
            "ChargePointID": 175355,
            "ItemURL": "https://s3-ap-southeast-2.amazonaws.com/openchargemap/images/IT/OCM175355/OCM-175355.orig.2021051305281828.jpg",
            "ItemThumbnailURL": "https://s3-ap-southeast-2.amazonaws.com/openchargemap/images/IT/OCM175355/OCM-175355.thmb.2021051305281828.jpg",
            "Comment": "",
            "IsEnabled": true,
            "IsVideo": false,
            "IsFeaturedItem": false,
            "IsExternalResource": false,
            "User": {
                "ID": 11749,
                "Username": "ForumElettrico.it"
            },
            "DateCreated": "2021-05-13T05:28:00Z"
        },
        {
            "ID": 27645,
            "ChargePointID": 175355,
            "ItemURL": "https://s3-ap-southeast-2.amazonaws.com/openchargemap/images/IT/OCM175355/OCM-175355.orig.2021051305282447.jpg",
            "ItemThumbnailURL": "https://s3-ap-southeast-2.amazonaws.com/openchargemap/images/IT/OCM175355/OCM-175355.thmb.2021051305282447.jpg",
            "Comment": "",
            "IsEnabled": true,
            "IsVideo": false,
            "IsFeaturedItem": false,
            "IsExternalResource": false,
            "User": {
                "ID": 11749,
                "Username": "ForumElettrico.it"
            },
            "DateCreated": "2021-05-13T05:28:00Z"
        }
    ],
    "IsRecentlyVerified": false,
    "ID": 175355,
    "UUID": "01E20FED-27BB-40F8-B230-6D6C003AD313",
    "DataProviderID": 1,
    "OperatorID": 1,
    "UsageTypeID": 1,
    "AddressInfo": {
        "ID": 175714,
        "Title": "Loginet Nissan Lenzi Automobili",
        "AddressLine1": "Viale Montegrappa 343",
        "Town": "Prato",
        "StateOrProvince": "PO",
        "CountryID": 112,
        "Latitude": 43.864937,
        "Longitude": 11.116519,
        "RelatedURL": "https://www.forumelettrico.it/forum/fast-concessionaria-nissan-viale-montegrappa-341-t17176.html",
        "DistanceUnit": 0
    },
    "Connections": [
        {
            "ID": 272008,
            "ConnectionTypeID": 33,
            "LevelID": 2,
            "PowerKW": 50,
            "Quantity": 1
        },
        {
            "ID": 272009,
            "ConnectionTypeID": 2,
            "LevelID": 2,
            "PowerKW": 50
        },
        {
            "ID": 272010,
            "ConnectionTypeID": 25,
            "LevelID": 2,
            "PowerKW": 7
        }
    ],
    "NumberOfPoints": 1,
    "StatusTypeID": 50,
    "DateLastStatusUpdate": "2021-05-13T05:29:00Z",
    "DataQualityLevel": 1,
    "DateCreated": "2021-05-13T05:28:00Z",
    "SubmissionStatusTypeID": 200
}