{
    "IsRecentlyVerified": false,
    "ID": 156658,
    "UUID": "520E3798-4D56-416A-B89D-55D39F183130",
    "DataProviderID": 19,
    "DataProvidersReference": "5950",
    "AddressInfo": {
        "ID": 157012,
        "Title": "Kungsleden Gårdskobben",
        "AddressLine1": "Datavägen 24 ",
        "Town": "ASKIM",
        "StateOrProvince": "VÄSTRA GÖTALAND",
        "Postcode": "43632",
        "CountryID": 216,
        "Latitude": 57.64087,
        "Longitude": 11.95781,
        "AccessComments": "",
        "DistanceUnit": 0
    },
    "Connections": [
        {
            "ID": 220932,
            "ConnectionTypeID": 25,
            "Reference": "1",
            "LevelID": 2,
            "Amps": 16,
            "Voltage": 230,
            "PowerKW": 3.7,
            "CurrentTypeID": 10
        },
        {
            "ID": 220933,
            "ConnectionTypeID": 25,
            "Reference": "2",
            "LevelID": 2,
            "Amps": 16,
            "Voltage": 230,
            "PowerKW": 3.7,
            "CurrentTypeID": 10
        },
        {
            "ID": 220934,
            "ConnectionTypeID": 25,
            "Reference": "3",
            "LevelID": 2,
            "Amps": 16,
            "Voltage": 230,
            "PowerKW": 3.7,
            "CurrentTypeID": 10
        },
        {
            "ID": 220935,
            "ConnectionTypeID": 25,
            "Reference": "4",
            "LevelID": 2,
            "Amps": 16,
            "Voltage": 230,
            "PowerKW": 3.7,
            "CurrentTypeID": 10
        },
        {
            "ID": 220936,
            "ConnectionTypeID": 25,
            "Reference": "5",
            "LevelID": 2,
            "Amps": 16,
            "Voltage": 230,
            "PowerKW": 3.7,
            "CurrentTypeID": 10
        },
        {
            "ID": 220937,
            "ConnectionTypeID": 25,
            "Reference": "6",
            "LevelID": 2,
            "Amps": 16,
            "Voltage": 230,
            "PowerKW": 3.7,
            "CurrentTypeID": 10
        }
    ],
    "NumberOfPoints": 6,
    "StatusTypeID": 0,
    "DateLastStatusUpdate": "2020-05-26T08:21:00Z",
    "DataQualityLevel": 2,
    "DateCreated": "2020-05-26T08:21:00Z",
    "SubmissionStatusTypeID": 100
}