{
    "UserComments": [
        {
            "ID": 16124,
            "ChargePointID": 20792,
            "CommentTypeID": 10,
            "UserName": "Someone_Just_",
            "Rating": 4,
            "DateCreated": "2017-03-24T22:11:57.043Z",
            "User": {
                "ID": 1107,
                "Username": "Someone_Just_"
            },
            "CheckinStatusTypeID": 140
        },
        {
            "ID": 11608,
            "ChargePointID": 20792,
            "CommentTypeID": 10,
            "UserName": "Someone_Just_",
            "Rating": 4,
            "DateCreated": "2016-06-10T22:01:46.153Z",
            "User": {
                "ID": 1107,
                "Username": "Someone_Just_"
            },
            "CheckinStatusTypeID": 100
        }
    ],
    "MediaItems": [
        {
            "ID": 182,
            "ChargePointID": 20792,
            "ItemURL": "https://s3-ap-southeast-2.amazonaws.com/openchargemap/images/BE/OCM20792/OCM-20792.orig.2014011222581126.jpg",
            "ItemThumbnailURL": "https://s3-ap-southeast-2.amazonaws.com/openchargemap/images/BE/OCM20792/OCM-20792.thmb.2014011222581126.jpg",
            "Comment": "2 places for cars, one iced...",
            "IsEnabled": true,
            "IsVideo": false,
            "IsFeaturedItem": false,
            "IsExternalResource": false,
            "User": {
                "ID": 1107,
                "Username": "Someone_Just_"
            },
            "DateCreated": "2014-01-12T22:58:00Z"
        }
    ],
    "IsRecentlyVerified": false,
    "ID": 20792,
    "UUID": "126C191A-C6D0-4FE8-94CB-64931AF677CE",
    "DataProviderID": 1,
    "OperatorID": 36,
    "UsageTypeID": 4,
    "UsageCost": "Free",
    "AddressInfo": {
        "ID": 21137,
        "Title": "EVA Turnhout 2",
        "AddressLine1": "Begijnenstraat 9",
        "Town": "Turnhout",
        "CountryID": 26,
        "Latitude": 51.3244556238622,
        "Longitude": 4.94722803643049,
        "DistanceUnit": 0
    },
    "Connections": [
        {
            "ID": 22619,
            "ConnectionTypeID": 25,
            "StatusTypeID": 50,
            "LevelID": 2,
            "Amps": 32,
            "Voltage": 220,
            "PowerKW": 12.2,
            "CurrentTypeID": 20,
            "Quantity": 1
        },
        {
            "ID": 22620,
            "ConnectionTypeID": 23,
            "StatusTypeID": 50,
            "LevelID": 2,
            "Amps": 16,
            "Voltage": 220,
            "PowerKW": 3.5,
            "CurrentTypeID": 10,
            "Quantity": 1
        }
    ],
    "NumberOfPoints": 2,
    "StatusTypeID": 50,
    "DateLastStatusUpdate": "2017-03-24T22:12:00Z",
    "MetadataValues": [
        {
            "ID": 415,
            "MetadataFieldID": 4,
            "ItemValue": "Data © OpenStreetMap contributors, ODbL 1.0. http://www.openstreetmap.org/copyright"
        }
    ],
    "DataQualityLevel": 1,
    "DateCreated": "2014-01-12T22:39:00Z",
    "SubmissionStatusTypeID": 200
}