{
    "IsRecentlyVerified": false,
    "ID": 182113,
    "UUID": "64321095-7B8C-4C3F-9D18-8DC459977268",
    "DataProviderID": 29,
    "DataProvidersReference": "5059",
    "OperatorID": 69,
    "AddressInfo": {
        "ID": 182472,
        "Title": "Düsseldorfer Straße 16",
        "AddressLine1": "Düsseldorfer Straße 16",
        "Town": "Aalen",
        "Postcode": "73431",
        "CountryID": 87,
        "Latitude": 48.844287,
        "Longitude": 10.096807,
        "DistanceUnit": 0
    },
    "Connections": [
        {
            "ID": 287448,
            "ConnectionTypeID": 25,
            "StatusTypeID": 50,
            "LevelID": 2,
            "PowerKW": 22,
            "CurrentTypeID": 20
        },
        {
            "ID": 287449,
            "ConnectionTypeID": 25,
            "StatusTypeID": 50,
            "LevelID": 2,
            "PowerKW": 22,
            "CurrentTypeID": 20
        }
    ],
    "StatusTypeID": 50,
    "DateLastStatusUpdate": "2021-07-12T02:42:00Z",
    "MetadataValues": [
        {
            "ID": 14407,
            "MetadataFieldID": 4,
            "ItemValue": "Data from the German chargepoint registry provided by Bundesnetzagentur.de under the CC-BY 4.0 license"
        }
    ],
    "DataQualityLevel": 3,
    "DateCreated": "2021-07-08T10:02:00Z",
    "SubmissionStatusTypeID": 100
}