{
    "IsRecentlyVerified": false,
    "ID": 44779,
    "UUID": "B07A4AF5-FE99-4711-9B3A-C797A86BBC84",
    "DataProviderID": 26,
    "DataProvidersReference": "61243",
    "OperatorID": 157,
    "OperatorsReference": "NewMotion 01000807",
    "UsageCost": "0.00 jaarabonnement",
    "AddressInfo": {
        "ID": 45125,
        "Title": "Parmentierstraat 3",
        "AddressLine1": "Parmentierstraat 3",
        "Town": "Hoogeveen",
        "Postcode": "7903 TN",
        "CountryID": 159,
        "Latitude": 52.7342987060547,
        "Longitude": 6.5104398727417,
        "ContactTelephone1": "088 0109500",
        "RelatedURL": "http://thenewmotion.nl/",
        "DistanceUnit": 0
    },
    "Connections": [
        {
            "ID": 55021,
            "ConnectionTypeID": 25,
            "LevelID": 2,
            "PowerKW": 3.7,
            "CurrentTypeID": 10
        },
        {
            "ID": 82391,
            "ConnectionTypeID": 25,
            "LevelID": 2,
            "PowerKW": 3.7,
            "CurrentTypeID": 10
        }
    ],
    "NumberOfPoints": 1,
    "StatusTypeID": 50,
    "DateLastStatusUpdate": "2016-06-04T02:55:00Z",
    "DataQualityLevel": 3,
    "DateCreated": "2015-04-18T13:02:00Z",
    "SubmissionStatusTypeID": 100
}