{
    "IsRecentlyVerified": false,
    "ID": 160839,
    "UUID": "2C7E3458-74AD-46CC-BE4E-ADF32A3816FF",
    "DataProviderID": 1,
    "OperatorID": 3,
    "UsageTypeID": 6,
    "AddressInfo": {
        "ID": 161196,
        "Title": "The Old Barn",
        "AddressLine1": "High Road",
        "AddressLine2": "North Cave",
        "Town": "Everthorpe",
        "StateOrProvince": "East Riding of Yorkshire",
        "Postcode": "HU15 2AD",
        "CountryID": 1,
        "Latitude": 53.776466835119834,
        "Longitude": -0.6317083973410718,
        "DistanceUnit": 0
    },
    "Connections": [
        {
            "ID": 231508,
            "ConnectionTypeID": 1036,
            "LevelID": 2,
            "CurrentTypeID": 10,
            "Quantity": 1
        }
    ],
    "NumberOfPoints": 1,
    "StatusTypeID": 50,
    "DateLastStatusUpdate": "2020-07-03T07:44:00Z",
    "DataQualityLevel": 1,
    "DateCreated": "2020-06-29T21:35:00Z",
    "SubmissionStatusTypeID": 200
}