{
    "IsRecentlyVerified": false,
    "ID": 141877,
    "UUID": "A4F6137A-0FE1-450D-85EC-79D9EFAAB8EF",
    "DataProviderID": 2,
    "DataProvidersReference": "143522",
    "OperatorID": 5,
    "UsageTypeID": 1,
    "AddressInfo": {
        "ID": 142229,
        "Title": "HIX CHICO",
        "AddressLine1": "2074 E 20th St",
        "Town": "Chico",
        "StateOrProvince": "CA",
        "Postcode": "95928",
        "CountryID": 2,
        "Latitude": 39.7288545,
        "Longitude": -121.7990478,
        "ContactTelephone1": "888-758-4389",
        "AccessComments": "24 hours daily",
        "RelatedURL": "http://www.chargepoint.com/",
        "DistanceUnit": 0
    },
    "Connections": [
        {
            "ID": 197915,
            "ConnectionTypeID": 1,
            "LevelID": 2,
            "Amps": 16,
            "Voltage": 230,
            "PowerKW": 3,
            "CurrentTypeID": 10,
            "Quantity": 2
        }
    ],
    "StatusTypeID": 50,
    "DateLastStatusUpdate": "2019-12-24T09:16:00Z",
    "DataQualityLevel": 3,
    "DateCreated": "2019-12-24T09:16:00Z",
    "SubmissionStatusTypeID": 100
}