{
    "IsRecentlyVerified": false,
    "ID": 158899,
    "UUID": "987A6887-CDF9-4B9D-B610-492147F982D4",
    "DataProviderID": 2,
    "DataProvidersReference": "155353",
    "OperatorID": 89,
    "UsageTypeID": 1,
    "AddressInfo": {
        "ID": 159256,
        "Title": "7428 S Sepulveda Blvd",
        "AddressLine1": "7428 S Sepulveda Blvd",
        "Town": "Los Angeles",
        "StateOrProvince": "CA",
        "Postcode": "90045",
        "CountryID": 2,
        "Latitude": 34.20560476,
        "Longitude": -118.4663241,
        "ContactTelephone1": "888-356-8911",
        "AccessComments": "24 hours daily",
        "RelatedURL": "https://flo.ca/",
        "DistanceUnit": 0
    },
    "Connections": [
        {
            "ID": 228936,
            "ConnectionTypeID": 1,
            "LevelID": 2,
            "Amps": 16,
            "Voltage": 230,
            "PowerKW": 3.7,
            "CurrentTypeID": 10,
            "Quantity": 1
        }
    ],
    "StatusTypeID": 50,
    "DateLastStatusUpdate": "2020-06-26T02:57:00Z",
    "DataQualityLevel": 3,
    "DateCreated": "2020-06-26T02:57:00Z",
    "SubmissionStatusTypeID": 100
}