{
    "IsRecentlyVerified": false,
    "ID": 102096,
    "UUID": "58608594-460F-41F8-A90C-486591F1427E",
    "DataProviderID": 1,
    "OperatorID": 86,
    "UsageTypeID": 4,
    "AddressInfo": {
        "ID": 102442,
        "Title": "Moskauer Straße ",
        "AddressLine1": "Moskauer Straße 1",
        "Town": "Stuttgart",
        "StateOrProvince": "Stuttgart",
        "Postcode": "70173",
        "CountryID": 87,
        "Latitude": 48.78875761358947,
        "Longitude": 9.18268743098713,
        "AccessComments": "24/7 nutzbar; mehrere Säulen in unmittelbarer Umgebung",
        "RelatedURL": "https://www.enbw.com/unternehmen/konzern/elektromobilitaet/elektromobilitaet-bei-der-enbw/",
        "DistanceUnit": 0
    },
    "Connections": [
        {
            "ID": 144081,
            "ConnectionTypeID": 25,
            "StatusTypeID": 50,
            "LevelID": 2,
            "Amps": 32,
            "Voltage": 400,
            "PowerKW": 22,
            "CurrentTypeID": 20,
            "Quantity": 2
        },
        {
            "ID": 144082,
            "ConnectionTypeID": 28,
            "StatusTypeID": 50,
            "LevelID": 2,
            "Amps": 16,
            "Voltage": 230,
            "PowerKW": 3.7,
            "CurrentTypeID": 10,
            "Quantity": 2
        }
    ],
    "NumberOfPoints": 4,
    "StatusTypeID": 50,
    "DateLastStatusUpdate": "2018-04-16T07:47:00Z",
    "DataQualityLevel": 1,
    "DateCreated": "2018-04-16T07:47:00Z",
    "SubmissionStatusTypeID": 200
}