{
    "IsRecentlyVerified": false,
    "ID": 13941,
    "UUID": "A91134FA-54E8-483D-A723-4D0AEB260240",
    "DataProviderID": 1,
    "OperatorID": 1,
    "UsageTypeID": 2,
    "UsageCost": "",
    "AddressInfo": {
        "ID": 13838,
        "Title": "Ohio Statehouse Parking Garage",
        "AddressLine1": "60 E State St",
        "AddressLine2": "",
        "Town": "Columbus",
        "StateOrProvince": "OH",
        "Postcode": "43215",
        "CountryID": 2,
        "Latitude": 39.960544,
        "Longitude": -82.998122,
        "ContactTelephone1": "614-728-2564",
        "ContactTelephone2": "",
        "ContactEmail": "",
        "AccessComments": "24 hours daily; pay lot",
        "RelatedURL": "",
        "DistanceUnit": 0
    },
    "Connections": [
        {
            "ID": 11370,
            "ConnectionTypeID": 0,
            "StatusTypeID": 0,
            "LevelID": 2,
            "Quantity": 6
        },
        {
            "ID": 21388,
            "ConnectionTypeID": 1,
            "StatusTypeID": 0,
            "LevelID": 2,
            "Quantity": 6
        }
    ],
    "GeneralComments": "",
    "StatusTypeID": 50,
    "DateLastStatusUpdate": "2014-06-28T09:41:00Z",
    "DataQualityLevel": 3,
    "DateCreated": "2012-12-06T16:48:00Z",
    "SubmissionStatusTypeID": 100
}