{
    "IsRecentlyVerified": false,
    "ID": 137032,
    "UUID": "F3572231-09E7-406F-B07C-81BF204E368C",
    "DataProviderID": 1,
    "OperatorID": 3315,
    "UsageTypeID": 4,
    "AddressInfo": {
        "ID": 137378,
        "Title": "PA26 8BL",
        "AddressLine1": "",
        "Town": "Clachan, Cairndow",
        "Postcode": "PA26 8BL",
        "CountryID": 1,
        "Latitude": 56.269597,
        "Longitude": -4.933294,
        "AccessComments": "",
        "RelatedURL": "",
        "DistanceUnit": 0
    },
    "Connections": [
        {
            "ID": 191825,
            "ConnectionTypeID": 25,
            "Reference": "1",
            "StatusTypeID": 50,
            "LevelID": 2,
            "Amps": 32,
            "Voltage": 400,
            "PowerKW": 22,
            "CurrentTypeID": 20
        },
        {
            "ID": 191826,
            "ConnectionTypeID": 33,
            "Reference": "2",
            "StatusTypeID": 50,
            "LevelID": 3,
            "Amps": 60,
            "Voltage": 400,
            "PowerKW": 22,
            "CurrentTypeID": 30
        },
        {
            "ID": 303841,
            "ConnectionTypeID": 2,
            "StatusTypeID": 50,
            "LevelID": 3,
            "Amps": 60,
            "Voltage": 400,
            "PowerKW": 22,
            "CurrentTypeID": 30,
            "Quantity": 1
        }
    ],
    "StatusTypeID": 0,
    "DateLastStatusUpdate": "2021-07-15T13:38:00Z",
    "MetadataValues": [
        {
            "ID": 6884,
            "MetadataFieldID": 4,
            "ItemValue": "Contains public sector information licensed under the Open Government Licence v2.0. http://www.nationalarchives.gov.uk/doc/open-government-licence/version/2/"
        }
    ],
    "DataQualityLevel": 3,
    "DateCreated": "2019-12-24T05:23:00Z",
    "SubmissionStatusTypeID": 100
}