{
    "IsRecentlyVerified": false,
    "ID": 139322,
    "UUID": "A424275D-FA70-49B0-A59C-BF98056CFDC2",
    "DataProviderID": 2,
    "DataProvidersReference": "85819",
    "OperatorID": 5,
    "UsageTypeID": 1,
    "AddressInfo": {
        "ID": 139674,
        "Title": "MIDTOWN",
        "AddressLine1": "165 6th St NE",
        "Town": "Atlanta",
        "StateOrProvince": "GA",
        "Postcode": "30308",
        "CountryID": 2,
        "Latitude": 33.7770905,
        "Longitude": -84.3823845,
        "ContactTelephone1": "888-758-4389",
        "AccessComments": "24 hours daily",
        "RelatedURL": "http://www.chargepoint.com/",
        "DistanceUnit": 0
    },
    "Connections": [
        {
            "ID": 194637,
            "ConnectionTypeID": 1,
            "LevelID": 2,
            "Amps": 16,
            "Voltage": 230,
            "PowerKW": 3.7,
            "CurrentTypeID": 10,
            "Quantity": 2
        }
    ],
    "StatusTypeID": 50,
    "DateLastStatusUpdate": "2020-06-26T02:56:00Z",
    "DataQualityLevel": 3,
    "DateCreated": "2019-12-24T09:10:00Z",
    "SubmissionStatusTypeID": 100
}