{
    "IsRecentlyVerified": false,
    "ID": 182519,
    "UUID": "1C3876F0-0084-498A-9810-058EC6B1AA15",
    "DataProviderID": 29,
    "DataProvidersReference": "15998",
    "AddressInfo": {
        "ID": 182878,
        "Title": "Jakob-Krebs-Straße",
        "AddressLine1": "Jakob-Krebs-Straße",
        "Town": "Willich",
        "Postcode": "47877",
        "CountryID": 87,
        "Latitude": 51.285234,
        "Longitude": 6.449981,
        "DistanceUnit": 0
    },
    "Connections": [
        {
            "ID": 288365,
            "ConnectionTypeID": 25,
            "StatusTypeID": 50,
            "LevelID": 2,
            "PowerKW": 22,
            "CurrentTypeID": 20
        },
        {
            "ID": 288366,
            "ConnectionTypeID": 25,
            "StatusTypeID": 50,
            "LevelID": 2,
            "PowerKW": 22,
            "CurrentTypeID": 20
        }
    ],
    "StatusTypeID": 50,
    "DateLastStatusUpdate": "2021-07-09T03:23:00Z",
    "MetadataValues": [
        {
            "ID": 14812,
            "MetadataFieldID": 4,
            "ItemValue": "Data from the German chargepoint registry provided by Bundesnetzagentur.de under the CC-BY 4.0 license"
        }
    ],
    "DataQualityLevel": 3,
    "DateCreated": "2021-07-08T10:03:00Z",
    "SubmissionStatusTypeID": 100
}