{
    "IsRecentlyVerified": false,
    "ID": 167225,
    "UUID": "2E451429-5BDF-4D31-87B4-C071DC74C2FD",
    "DataProviderID": 1,
    "OperatorID": 136,
    "UsageTypeID": 4,
    "AddressInfo": {
        "ID": 167584,
        "Title": "ABC Riihimäki",
        "AddressLine1": "Kinturintie 2",
        "Town": "Riihimäki",
        "Postcode": "11120",
        "CountryID": 79,
        "Latitude": 60.75238938293978,
        "Longitude": 24.735047576644547,
        "DistanceUnit": 0
    },
    "Connections": [
        {
            "ID": 253248,
            "ConnectionTypeID": 33,
            "StatusTypeID": 50,
            "LevelID": 3,
            "PowerKW": 150,
            "CurrentTypeID": 30
        },
        {
            "ID": 253249,
            "ConnectionTypeID": 33,
            "StatusTypeID": 50,
            "LevelID": 3,
            "PowerKW": 150,
            "CurrentTypeID": 30
        },
        {
            "ID": 253250,
            "ConnectionTypeID": 25,
            "StatusTypeID": 50,
            "LevelID": 2,
            "PowerKW": 22,
            "CurrentTypeID": 20
        },
        {
            "ID": 253251,
            "ConnectionTypeID": 25,
            "StatusTypeID": 50,
            "LevelID": 2,
            "PowerKW": 22,
            "CurrentTypeID": 20
        }
    ],
    "NumberOfPoints": 2,
    "StatusTypeID": 50,
    "DateLastStatusUpdate": "2020-09-01T07:53:00Z",
    "DataQualityLevel": 1,
    "DateCreated": "2020-08-31T10:16:00Z",
    "SubmissionStatusTypeID": 200
}