{
    "IsRecentlyVerified": false,
    "ID": 22862,
    "UUID": "C41918B7-C192-4C6A-9838-36C39C97E53A",
    "DataProviderID": 1,
    "OperatorID": 3,
    "OperatorsReference": "PP-12586",
    "UsageTypeID": 4,
    "UsageCost": "Free",
    "AddressInfo": {
        "ID": 23207,
        "Title": "Walkergate Health Centre",
        "AddressLine1": "Benfield Road",
        "Town": "Newcastle upon Tyne",
        "Postcode": "NE6 4QD",
        "CountryID": 1,
        "Latitude": 54.986205,
        "Longitude": -1.560457,
        "AccessComments": "Walkergate Health Centre",
        "RelatedURL": "http://pod-point.com/",
        "DistanceUnit": 0
    },
    "Connections": [
        {
            "ID": 24543,
            "ConnectionTypeID": 25,
            "StatusTypeID": 50,
            "LevelID": 2,
            "Amps": 32,
            "Voltage": 230,
            "PowerKW": 7,
            "CurrentTypeID": 10,
            "Quantity": 1
        },
        {
            "ID": 105300,
            "ConnectionTypeID": 3,
            "StatusTypeID": 50,
            "LevelID": 2,
            "Amps": 13,
            "Voltage": 230,
            "PowerKW": 3,
            "CurrentTypeID": 10,
            "Quantity": 1
        }
    ],
    "NumberOfPoints": 1,
    "StatusTypeID": 0,
    "DateLastStatusUpdate": "2017-10-10T09:33:00Z",
    "MetadataValues": [
        {
            "ID": 849,
            "MetadataFieldID": 4,
            "ItemValue": "Contains public sector information licensed under the Open Government Licence v2.0. http://www.nationalarchives.gov.uk/doc/open-government-licence/version/2/"
        }
    ],
    "DataQualityLevel": 3,
    "DateCreated": "2014-03-22T08:42:00Z",
    "SubmissionStatusTypeID": 100
}