{
    "IsRecentlyVerified": false,
    "ID": 146492,
    "UUID": "ADBE209F-935E-4555-A029-7603E0248840",
    "DataProviderID": 1,
    "OperatorID": 3,
    "OperatorsReference": "PG-83013",
    "UsageTypeID": 4,
    "UsageCost": "Free",
    "AddressInfo": {
        "ID": 146844,
        "Title": "Abbey Retail Park",
        "AddressLine1": "Savins Mill Way",
        "Town": "Kirkstall",
        "StateOrProvince": "Leeds",
        "Postcode": "LS5 3RP",
        "CountryID": 1,
        "Latitude": 53.8154127,
        "Longitude": -1.6037756,
        "DistanceUnit": 0
    },
    "Connections": [
        {
            "ID": 203682,
            "ConnectionTypeID": 25,
            "StatusTypeID": 50,
            "LevelID": 2,
            "Amps": 32,
            "Voltage": 230,
            "PowerKW": 7,
            "CurrentTypeID": 10,
            "Quantity": 2
        }
    ],
    "NumberOfPoints": 2,
    "GeneralComments": "This is an open charge unit installed at the Abbey Retail Park at Savins Mill Way, Kirkstall, Leeds",
    "StatusTypeID": 50,
    "DateLastStatusUpdate": "2020-01-10T10:23:00Z",
    "DataQualityLevel": 1,
    "DateCreated": "2020-01-10T10:23:00Z",
    "SubmissionStatusTypeID": 200
}