{
    "IsRecentlyVerified": false,
    "ID": 179073,
    "UUID": "DC59D1E3-03A9-42F7-9D47-0ACF5D45DBF7",
    "DataProviderID": 29,
    "DataProvidersReference": "20257",
    "AddressInfo": {
        "ID": 179432,
        "Title": "Hauptstraße 40",
        "AddressLine1": "Hauptstraße 40",
        "Town": "Wenzenbach",
        "Postcode": "93173",
        "CountryID": 87,
        "Latitude": 49.07552,
        "Longitude": 12.194106,
        "DistanceUnit": 0
    },
    "Connections": [
        {
            "ID": 280343,
            "ConnectionTypeID": 25,
            "StatusTypeID": 50,
            "LevelID": 2,
            "PowerKW": 22,
            "CurrentTypeID": 20
        },
        {
            "ID": 280344,
            "ConnectionTypeID": 25,
            "StatusTypeID": 50,
            "LevelID": 2,
            "PowerKW": 22,
            "CurrentTypeID": 20
        }
    ],
    "StatusTypeID": 50,
    "DateLastStatusUpdate": "2021-07-09T03:15:00Z",
    "MetadataValues": [
        {
            "ID": 11367,
            "MetadataFieldID": 4,
            "ItemValue": "Data from the German chargepoint registry provided by Bundesnetzagentur.de under the CC-BY 4.0 license"
        }
    ],
    "DataQualityLevel": 3,
    "DateCreated": "2021-07-08T09:59:00Z",
    "SubmissionStatusTypeID": 100
}