{
    "IsRecentlyVerified": false,
    "ID": 105302,
    "UUID": "52800356-4784-4493-8E2C-FA5C62AD95F3",
    "DataProviderID": 1,
    "OperatorID": 69,
    "UsageTypeID": 4,
    "AddressInfo": {
        "ID": 105648,
        "Title": "Supermarkt Rewe",
        "AddressLine1": "Bahnhofstraße 12a",
        "Town": " Tambach-Dietharz",
        "StateOrProvince": "Apfelstädtaue",
        "Postcode": "99897",
        "CountryID": 87,
        "Latitude": 50.7982148,
        "Longitude": 10.617319100000032,
        "AccessComments": "24/7 nutzbare Ladesäule auf dem Kundenparkplatz.",
        "RelatedURL": "http://www.teag.de/",
        "DistanceUnit": 0
    },
    "Connections": [
        {
            "ID": 148454,
            "ConnectionTypeID": 25,
            "StatusTypeID": 50,
            "LevelID": 2,
            "Amps": 32,
            "Voltage": 400,
            "PowerKW": 22,
            "CurrentTypeID": 20,
            "Quantity": 2
        }
    ],
    "NumberOfPoints": 2,
    "StatusTypeID": 50,
    "DateLastStatusUpdate": "2018-06-05T05:16:00Z",
    "DataQualityLevel": 1,
    "DateCreated": "2018-06-05T05:16:00Z",
    "SubmissionStatusTypeID": 200
}