{
    "IsRecentlyVerified": false,
    "ID": 13764,
    "UUID": "97B7DB71-669B-40B2-8923-686AD0E590D0",
    "DataProviderID": 15,
    "DataProvidersReference": "23583",
    "OperatorID": 5,
    "AddressInfo": {
        "ID": 13661,
        "Title": "1701 I-20",
        "AddressLine1": "1701 I-20",
        "Town": "Big Spring",
        "StateOrProvince": "Texas",
        "Postcode": "79720",
        "CountryID": 2,
        "Latitude": 32.24671936,
        "Longitude": -101.4954681,
        "ContactTelephone1": "",
        "RelatedURL": "http://carstations.com/23583",
        "DistanceUnit": 0
    },
    "Connections": [
        {
            "ID": 11211,
            "ConnectionTypeID": 1,
            "Reference": "J1772",
            "LevelID": 2
        },
        {
            "ID": 13453,
            "ConnectionTypeID": 9,
            "Reference": "NEMA5",
            "LevelID": 1,
            "Quantity": 1
        }
    ],
    "StatusTypeID": 0,
    "DateLastStatusUpdate": "2017-11-04T14:03:00Z",
    "DataQualityLevel": 2,
    "DateCreated": "2012-12-06T11:08:00Z",
    "SubmissionStatusTypeID": 100
}