{
    "IsRecentlyVerified": false,
    "ID": 184844,
    "UUID": "9C4AB456-4684-4DCA-B9AF-17B536EC07D8",
    "DataProviderID": 29,
    "DataProvidersReference": "10961",
    "OperatorID": 45,
    "AddressInfo": {
        "ID": 185203,
        "Title": "Allacher Str. 252",
        "AddressLine1": "Allacher Str. 252",
        "Town": "München",
        "Postcode": "80999",
        "CountryID": 87,
        "Latitude": 48.18183,
        "Longitude": 11.464959,
        "DistanceUnit": 0
    },
    "Connections": [
        {
            "ID": 293610,
            "ConnectionTypeID": 33,
            "StatusTypeID": 50,
            "LevelID": 3,
            "PowerKW": 22,
            "CurrentTypeID": 30
        },
        {
            "ID": 293611,
            "ConnectionTypeID": 25,
            "StatusTypeID": 50,
            "LevelID": 2,
            "PowerKW": 11,
            "CurrentTypeID": 20
        }
    ],
    "StatusTypeID": 50,
    "DateLastStatusUpdate": "2021-07-12T02:40:00Z",
    "MetadataValues": [
        {
            "ID": 17135,
            "MetadataFieldID": 4,
            "ItemValue": "Data from the German chargepoint registry provided by Bundesnetzagentur.de under the CC-BY 4.0 license"
        }
    ],
    "DataQualityLevel": 3,
    "DateCreated": "2021-07-08T10:05:00Z",
    "SubmissionStatusTypeID": 100
}