{
    "IsRecentlyVerified": false,
    "ID": 100553,
    "UUID": "03607BCB-3C03-4AC7-B85B-6BE48A5660FF",
    "DataProviderID": 1,
    "OperatorID": 86,
    "UsageTypeID": 4,
    "AddressInfo": {
        "ID": 100899,
        "Title": "Rasthof Lorsch West",
        "AddressLine1": "A67",
        "Town": "Lorsch",
        "StateOrProvince": "Kreis Bergstraße",
        "Postcode": "64653",
        "CountryID": 87,
        "Latitude": 49.64288081983714,
        "Longitude": 8.551942241086635,
        "AccessComments": "24/7 nutzbar",
        "DistanceUnit": 0
    },
    "Connections": [
        {
            "ID": 142031,
            "ConnectionTypeID": 1036,
            "StatusTypeID": 50,
            "LevelID": 2,
            "Amps": 32,
            "Voltage": 400,
            "PowerKW": 22,
            "CurrentTypeID": 20,
            "Quantity": 1
        },
        {
            "ID": 142032,
            "ConnectionTypeID": 2,
            "StatusTypeID": 50,
            "LevelID": 3,
            "PowerKW": 50,
            "CurrentTypeID": 30,
            "Quantity": 1
        },
        {
            "ID": 142033,
            "ConnectionTypeID": 33,
            "StatusTypeID": 50,
            "LevelID": 3,
            "PowerKW": 50,
            "CurrentTypeID": 30,
            "Quantity": 1
        }
    ],
    "NumberOfPoints": 3,
    "GeneralComments": "\r\n",
    "StatusTypeID": 50,
    "DateLastStatusUpdate": "2018-03-01T06:45:00Z",
    "DataQualityLevel": 1,
    "DateCreated": "2018-03-01T06:45:00Z",
    "SubmissionStatusTypeID": 200
}