{
    "IsRecentlyVerified": false,
    "ID": 19342,
    "UUID": "FEE2ECB9-C068-4535-BF62-A506899DBBA1",
    "DataProviderID": 1,
    "OperatorID": 32,
    "OperatorsReference": "1434,1554",
    "UsageTypeID": 4,
    "UsageCost": "Inclusive; for Polar Plus subscription members only",
    "AddressInfo": {
        "ID": 19687,
        "Title": "Waitrose Mill Hill",
        "AddressLine1": "2 Langstone Way",
        "AddressLine2": "Barnet",
        "Town": "London",
        "Postcode": "NW7 1GU",
        "CountryID": 1,
        "Latitude": 51.6074934132062,
        "Longitude": -0.209512710571289,
        "ContactTelephone1": "0845 850 0653",
        "AccessComments": "Car park open during Waitrose / Virgin Active opening hours Mo-Th 06:30-22:30 Fr 06:30-21:30 Sa,Su 08:00-20:00",
        "RelatedURL": "http://www.waitrose.com/bf_home/bf/670.html",
        "DistanceUnit": 0
    },
    "Connections": [
        {
            "ID": 19640,
            "ConnectionTypeID": 25,
            "StatusTypeID": 50,
            "LevelID": 2,
            "Amps": 32,
            "Voltage": 230,
            "PowerKW": 7,
            "CurrentTypeID": 10,
            "Quantity": 4
        }
    ],
    "NumberOfPoints": 4,
    "GeneralComments": "Chargemaster unit. Polar Network cards accepted, but no longer accepts Source London",
    "StatusTypeID": 50,
    "DateLastStatusUpdate": "2019-03-07T06:33:00Z",
    "DataQualityLevel": 1,
    "DateCreated": "2013-09-22T11:38:00Z",
    "SubmissionStatusTypeID": 200
}