{
    "IsRecentlyVerified": false,
    "ID": 140718,
    "UUID": "7D347E07-02AB-453B-8562-D93FDE0B0838",
    "DataProviderID": 2,
    "DataProvidersReference": "148626",
    "OperatorID": 39,
    "UsageTypeID": 1,
    "AddressInfo": {
        "ID": 141070,
        "Title": "Midpeninsula Regional Openspace District",
        "AddressLine1": "330 Distel Circle",
        "Town": "Los Altos",
        "StateOrProvince": "CA",
        "Postcode": "94022",
        "CountryID": 2,
        "Latitude": 37.3964543,
        "Longitude": -122.1059893,
        "ContactTelephone1": "800-663-5633",
        "AccessComments": "MO: 12:00am-12:00am; TU: 12:00am-12:00am; WE: 12:00am-12:00am; TH: 12:00am-12:00am; FR: 12:00am-12:00am; SA: 12:00am-12:00am; SU: 12:00am-12:00am",
        "RelatedURL": "http://www.semacharge.com/",
        "DistanceUnit": 0
    },
    "Connections": [
        {
            "ID": 196426,
            "ConnectionTypeID": 1,
            "LevelID": 2,
            "Amps": 16,
            "Voltage": 230,
            "PowerKW": 3.7,
            "CurrentTypeID": 10,
            "Quantity": 4
        }
    ],
    "StatusTypeID": 50,
    "DateLastStatusUpdate": "2020-06-26T02:59:00Z",
    "DataQualityLevel": 3,
    "DateCreated": "2019-12-24T09:13:00Z",
    "SubmissionStatusTypeID": 100
}