{
    "IsRecentlyVerified": false,
    "ID": 111944,
    "UUID": "BD21B139-9B59-4592-9F2E-2437E4EDD17D",
    "DataProviderID": 2,
    "DataProvidersReference": "84281",
    "UsageTypeID": 2,
    "AddressInfo": {
        "ID": 112290,
        "Title": "Ministere des Transports du Quebec",
        "AddressLine1": "625 boul. Lafleche",
        "Town": "Baie-Comeau",
        "StateOrProvince": "QC",
        "Postcode": "G5C 1C5",
        "CountryID": 44,
        "Latitude": 49.2027102345146,
        "Longitude": -68.2546647632294,
        "ContactTelephone1": "",
        "AccessComments": "For government vehicles only",
        "RelatedURL": "",
        "DistanceUnit": 0
    },
    "Connections": [
        {
            "ID": 157461,
            "ConnectionTypeID": 1,
            "LevelID": 2,
            "Amps": 16,
            "Voltage": 230,
            "PowerKW": 3.7,
            "CurrentTypeID": 10,
            "Quantity": 2
        }
    ],
    "DateLastStatusUpdate": "2020-06-26T03:11:00Z",
    "DataQualityLevel": 3,
    "DateCreated": "2018-10-18T23:37:00Z",
    "SubmissionStatusTypeID": 100
}