{
    "IsRecentlyVerified": false,
    "ID": 14130,
    "UUID": "5E4AACAB-EC10-4CEF-9449-CDCD42A4184B",
    "DataProviderID": 2,
    "DataProvidersReference": "45722",
    "UsageTypeID": 7,
    "AddressInfo": {
        "ID": 14027,
        "Title": "Kings Nissan",
        "AddressLine1": "9819 Kings Auto Mall Rd",
        "Town": "Cincinnati",
        "StateOrProvince": "OH",
        "Postcode": "45249",
        "CountryID": 2,
        "Latitude": 39.295523,
        "Longitude": -84.311517,
        "ContactTelephone1": "513-697-9770",
        "AccessComments": "Dealership business hours\r\nPublic - Call ahead",
        "RelatedURL": "",
        "DistanceUnit": 0
    },
    "Connections": [
        {
            "ID": 16463,
            "ConnectionTypeID": 1,
            "LevelID": 2,
            "Amps": 16,
            "Voltage": 230,
            "PowerKW": 3.7,
            "CurrentTypeID": 10,
            "Quantity": 1
        },
        {
            "ID": 21540,
            "ConnectionTypeID": 1,
            "LevelID": 2,
            "Quantity": 1
        }
    ],
    "DateLastStatusUpdate": "2020-06-26T03:01:00Z",
    "DataQualityLevel": 3,
    "DateCreated": "2012-12-06T16:48:00Z",
    "SubmissionStatusTypeID": 100
}