{
    "IsRecentlyVerified": false,
    "ID": 124841,
    "UUID": "F5BBD9F6-520E-482B-9230-2A129AD8CE8E",
    "DataProviderID": 2,
    "DataProvidersReference": "64343",
    "UsageTypeID": 1,
    "AddressInfo": {
        "ID": 125187,
        "Title": "Carnegie Science Center",
        "AddressLine1": "One Allegheny Ave",
        "Town": "Pittsburgh",
        "StateOrProvince": "PA",
        "Postcode": "15212",
        "CountryID": 2,
        "Latitude": 40.446466,
        "Longitude": -80.018355,
        "ContactTelephone1": "412-237-3400",
        "AccessComments": "Museum business hours; pay lot",
        "RelatedURL": "",
        "DistanceUnit": 0
    },
    "Connections": [
        {
            "ID": 174993,
            "ConnectionTypeID": 1,
            "LevelID": 2,
            "Amps": 16,
            "Voltage": 230,
            "PowerKW": 3.7,
            "CurrentTypeID": 10,
            "Quantity": 1
        }
    ],
    "DateLastStatusUpdate": "2020-06-26T03:03:00Z",
    "DataQualityLevel": 3,
    "DateCreated": "2019-04-06T05:04:00Z",
    "SubmissionStatusTypeID": 100
}