{
    "UserComments": [
        {
            "ID": 17874,
            "ChargePointID": 84635,
            "CommentTypeID": 10,
            "UserName": "Leodendula",
            "Comment": "27.10.2017 se dalo nabijet bez cipu. Tak by to mohlo byt vsude :-)\r\nAz na ten smrad od spalovaku je to parada. Obchodni centrum 50 m od nabijecky.",
            "Rating": 5,
            "DateCreated": "2017-10-30T23:00:45.737Z",
            "User": {
                "ID": 16277,
                "Username": "Leodendula"
            },
            "CheckinStatusTypeID": 10
        },
        {
            "ID": 16082,
            "ChargePointID": 84635,
            "CommentTypeID": 50,
            "UserName": "ozana",
            "Comment": "Z technických důvodů (nástřik označení na parkovacích místech určených pro dobíjení) bude v pátek 24. března 2017 omezen provoz.",
            "DateCreated": "2017-03-23T11:35:25.317Z",
            "User": {
                "ID": 6224,
                "Username": "ozana"
            },
            "CheckinStatusTypeID": 0
        }
    ],
    "MediaItems": [
        {
            "ID": 21307,
            "ChargePointID": 84635,
            "ItemURL": "https://s3-ap-southeast-2.amazonaws.com/openchargemap/images/CZ/OCM84635/OCM-84635.orig.2020022214074022.jpg",
            "ItemThumbnailURL": "https://s3-ap-southeast-2.amazonaws.com/openchargemap/images/CZ/OCM84635/OCM-84635.thmb.2020022214074022.jpg",
            "Comment": "#cez #ocNisa #liberec #hyundai #ioniq ",
            "IsEnabled": true,
            "IsVideo": false,
            "IsFeaturedItem": false,
            "IsExternalResource": false,
            "User": {
                "ID": 22495,
                "Username": "MAJKL_elektro🔋"
            },
            "DateCreated": "2020-02-22T14:08:00Z"
        },
        {
            "ID": 21305,
            "ChargePointID": 84635,
            "ItemURL": "https://s3-ap-southeast-2.amazonaws.com/openchargemap/images/CZ/OCM84635/OCM-84635.orig.2020022214065815.jpg",
            "ItemThumbnailURL": "https://s3-ap-southeast-2.amazonaws.com/openchargemap/images/CZ/OCM84635/OCM-84635.thmb.2020022214065815.jpg",
            "Comment": "#cez #ocNisa #liberec #hyundai #ioniq ",
            "IsEnabled": true,
            "IsVideo": false,
            "IsFeaturedItem": false,
            "IsExternalResource": false,
            "User": {
                "ID": 22495,
                "Username": "MAJKL_elektro🔋"
            },
            "DateCreated": "2020-02-22T14:07:00Z"
        },
        {
            "ID": 21306,
            "ChargePointID": 84635,
            "ItemURL": "https://s3-ap-southeast-2.amazonaws.com/openchargemap/images/CZ/OCM84635/OCM-84635.orig.2020022214072168.jpg",
            "ItemThumbnailURL": "https://s3-ap-southeast-2.amazonaws.com/openchargemap/images/CZ/OCM84635/OCM-84635.thmb.2020022214072168.jpg",
            "Comment": "#cez #ocNisa #liberec #hyundai #ioniq ",
            "IsEnabled": true,
            "IsVideo": false,
            "IsFeaturedItem": false,
            "IsExternalResource": false,
            "User": {
                "ID": 22495,
                "Username": "MAJKL_elektro🔋"
            },
            "DateCreated": "2020-02-22T14:07:00Z"
        },
        {
            "ID": 10636,
            "ChargePointID": 84635,
            "ItemURL": "https://s3-ap-southeast-2.amazonaws.com/openchargemap/images/CZ/OCM84635/OCM-84635.orig.2017031210101587.jpg",
            "ItemThumbnailURL": "https://s3-ap-southeast-2.amazonaws.com/openchargemap/images/CZ/OCM84635/OCM-84635.thmb.2017031210101587.jpg",
            "Comment": "",
            "IsEnabled": true,
            "IsVideo": false,
            "IsFeaturedItem": false,
            "IsExternalResource": false,
            "User": {
                "ID": 6224,
                "Username": "ozana"
            },
            "DateCreated": "2017-03-12T10:10:00Z"
        }
    ],
    "IsRecentlyVerified": false,
    "ID": 84635,
    "UUID": "E6B3650A-36C8-4089-A2B4-B06602CC3C7F",
    "DataProviderID": 1,
    "OperatorID": 115,
    "UsageTypeID": 4,
    "AddressInfo": {
        "ID": 84981,
        "Title": "OC Nisa",
        "AddressLine1": "České mládeže 456",
        "AddressLine2": "Doubí u Liberce",
        "Town": "Liberec",
        "StateOrProvince": "okres Liberec",
        "Postcode": "46006",
        "CountryID": 64,
        "Latitude": 50.741,
        "Longitude": 15.048,
        "AccessComments": "V podzemním parkovišti",
        "RelatedURL": "http://www.elektromobilita.cz",
        "DistanceUnit": 0
    },
    "Connections": [
        {
            "ID": 120223,
            "ConnectionTypeID": 2,
            "StatusTypeID": 50,
            "LevelID": 3,
            "PowerKW": 50,
            "CurrentTypeID": 30,
            "Quantity": 1
        },
        {
            "ID": 120224,
            "ConnectionTypeID": 33,
            "StatusTypeID": 50,
            "LevelID": 3,
            "PowerKW": 50,
            "CurrentTypeID": 30,
            "Quantity": 1
        },
        {
            "ID": 120225,
            "ConnectionTypeID": 25,
            "StatusTypeID": 50,
            "LevelID": 2,
            "Amps": 32,
            "Voltage": 400,
            "PowerKW": 22,
            "CurrentTypeID": 20,
            "Quantity": 1
        }
    ],
    "NumberOfPoints": 1,
    "StatusTypeID": 50,
    "DateLastStatusUpdate": "2020-02-22T14:08:00Z",
    "DataQualityLevel": 1,
    "DateCreated": "2017-03-07T13:47:00Z",
    "SubmissionStatusTypeID": 200
}