{
    "IsRecentlyVerified": false,
    "ID": 73862,
    "UUID": "5F0443D4-D8E8-4B45-9B36-59FE233D6723",
    "DataProviderID": 1,
    "OperatorID": 89,
    "OperatorsReference": "CEB-10130,CEB-10134",
    "UsageTypeID": 4,
    "UsageCost": "CAD 2.50",
    "AddressInfo": {
        "ID": 74208,
        "Title": "Amt-Stationnement Chambly",
        "AddressLine1": "3001 boul. Fréchette",
        "Town": "Chambly",
        "StateOrProvince": "QC",
        "Postcode": "J3L 4A7",
        "CountryID": 44,
        "Latitude": 45.4322509765625,
        "Longitude": -73.3038787841797,
        "DistanceUnit": 0
    },
    "Connections": [
        {
            "ID": 106173,
            "ConnectionTypeID": 1,
            "StatusTypeID": 50,
            "LevelID": 2,
            "Amps": 32,
            "Voltage": 230,
            "PowerKW": 7,
            "CurrentTypeID": 10,
            "Quantity": 2
        }
    ],
    "NumberOfPoints": 2,
    "StatusTypeID": 50,
    "DateLastStatusUpdate": "2017-11-12T06:40:00Z",
    "DataQualityLevel": 1,
    "DateCreated": "2016-11-23T23:22:00Z",
    "SubmissionStatusTypeID": 200
}