{
    "IsRecentlyVerified": false,
    "ID": 180001,
    "UUID": "62456611-D216-4CBE-91F6-347EA9FBDC37",
    "DataProviderID": 29,
    "DataProvidersReference": "20453",
    "OperatorID": 86,
    "AddressInfo": {
        "ID": 180360,
        "Title": "Bahnhofplatz 1",
        "AddressLine1": "Bahnhofplatz 1",
        "Town": "Esslingen",
        "Postcode": "73728",
        "CountryID": 87,
        "Latitude": 48.739303,
        "Longitude": 9.299276,
        "DistanceUnit": 0
    },
    "Connections": [
        {
            "ID": 282565,
            "ConnectionTypeID": 28,
            "StatusTypeID": 50,
            "LevelID": 2,
            "PowerKW": 22,
            "CurrentTypeID": 20
        },
        {
            "ID": 282566,
            "ConnectionTypeID": 25,
            "StatusTypeID": 50,
            "LevelID": 2,
            "PowerKW": 22,
            "CurrentTypeID": 20
        },
        {
            "ID": 282567,
            "ConnectionTypeID": 28,
            "StatusTypeID": 50,
            "LevelID": 2,
            "PowerKW": 22,
            "CurrentTypeID": 20
        },
        {
            "ID": 296113,
            "ConnectionTypeID": 25,
            "StatusTypeID": 50,
            "LevelID": 2,
            "PowerKW": 22,
            "CurrentTypeID": 20
        }
    ],
    "StatusTypeID": 50,
    "DateLastStatusUpdate": "2021-07-12T02:41:00Z",
    "MetadataValues": [
        {
            "ID": 12295,
            "MetadataFieldID": 4,
            "ItemValue": "Data from the German chargepoint registry provided by Bundesnetzagentur.de under the CC-BY 4.0 license"
        }
    ],
    "DataQualityLevel": 3,
    "DateCreated": "2021-07-08T10:00:00Z",
    "SubmissionStatusTypeID": 100
}