{
    "UserComments": [
        {
            "ID": 21406,
            "ChargePointID": 8027,
            "CommentTypeID": 1000,
            "UserName": "BoltEV",
            "Comment": "not working. Staff unaware, unconcerned.",
            "DateCreated": "2019-08-23T19:26:24.783Z",
            "User": {
                "ID": 22028,
                "Username": "BoltEV"
            },
            "CheckinStatusTypeID": 20
        }
    ],
    "IsRecentlyVerified": false,
    "ID": 8027,
    "UUID": "96A2500B-68AA-4B3F-9AB5-22182342AC30",
    "DataProviderID": 15,
    "DataProvidersReference": "7607",
    "OperatorID": 94,
    "UsageTypeID": 1,
    "AddressInfo": {
        "ID": 7924,
        "Title": "1500 East Garrison Boulevard",
        "AddressLine1": "1500 East Garrison Boulevard",
        "Town": "Gastonia",
        "StateOrProvince": "NC",
        "Postcode": "28054",
        "CountryID": 2,
        "Latitude": 35.25408,
        "Longitude": -81.15806,
        "ContactTelephone1": "(704) 866-6924",
        "RelatedURL": "http://carstations.com/7607",
        "DistanceUnit": 0
    },
    "Connections": [
        {
            "ID": 5456,
            "ConnectionTypeID": 1,
            "Reference": "J1772",
            "LevelID": 2
        },
        {
            "ID": 10770,
            "ConnectionTypeID": 9,
            "Reference": "NEMA5",
            "LevelID": 1,
            "Quantity": 1
        }
    ],
    "NumberOfPoints": 2,
    "StatusTypeID": 50,
    "DateLastStatusUpdate": "2019-08-23T19:26:00Z",
    "DataQualityLevel": 1,
    "DateCreated": "2011-11-11T12:05:00Z",
    "SubmissionStatusTypeID": 100
}