{
    "IsRecentlyVerified": false,
    "ID": 72670,
    "UUID": "2AA4AF9C-D381-4F17-970E-40D1A135EFCD",
    "DataProviderID": 1,
    "OperatorID": 45,
    "UsageTypeID": 6,
    "UsageCost": "gratis",
    "AddressInfo": {
        "ID": 73016,
        "Title": "Surseepark III",
        "AddressLine1": "Bahnhofstrasse 24",
        "Town": "Sursee",
        "StateOrProvince": "Luzern",
        "Postcode": "6210",
        "CountryID": 217,
        "Latitude": 47.17278072177438,
        "Longitude": 8.10345938559725,
        "AccessComments": "Während Ladenöffnungszeiten Surseepark. \r\nIm Parking im Untergeschoss (Surseepark III)",
        "RelatedURL": "http://www.surseepark.ch/oeffnungszeiten/",
        "DistanceUnit": 0
    },
    "Connections": [
        {
            "ID": 104189,
            "ConnectionTypeID": 1036,
            "StatusTypeID": 50,
            "LevelID": 2,
            "Amps": 16,
            "Voltage": 400,
            "PowerKW": 11,
            "CurrentTypeID": 20,
            "Quantity": 2
        }
    ],
    "NumberOfPoints": 2,
    "GeneralComments": "Während Ladenöffnungszeiten Surseepark. \r\nIm Parking (Surseepark III)",
    "StatusTypeID": 50,
    "DateLastStatusUpdate": "2016-11-01T21:37:00Z",
    "DataQualityLevel": 1,
    "DateCreated": "2016-10-31T12:32:00Z",
    "SubmissionStatusTypeID": 200
}