{
    "IsRecentlyVerified": false,
    "ID": 60566,
    "UUID": "7774FB0E-F558-43D0-83DB-39767A858E3C",
    "DataProviderID": 1,
    "OperatorID": 1238,
    "UsageTypeID": 4,
    "AddressInfo": {
        "ID": 60912,
        "Title": "Rathaus",
        "AddressLine1": "Schulstraße 3",
        "Town": "Owingen",
        "StateOrProvince": "Bodenseekreis",
        "Postcode": "88696",
        "CountryID": 87,
        "Latitude": 47.8090971029464,
        "Longitude": 9.17260960545785,
        "AccessComments": "Rund um die Uhr (24/7) nutzbar, emma Ladekarte erforderlich. ",
        "DistanceUnit": 0
    },
    "Connections": [
        {
            "ID": 76747,
            "ConnectionTypeID": 25,
            "StatusTypeID": 50,
            "LevelID": 2,
            "Amps": 32,
            "Voltage": 400,
            "PowerKW": 22,
            "CurrentTypeID": 20,
            "Quantity": 2
        },
        {
            "ID": 76748,
            "ConnectionTypeID": 28,
            "StatusTypeID": 50,
            "LevelID": 2,
            "Amps": 16,
            "Voltage": 230,
            "PowerKW": 3.7,
            "CurrentTypeID": 10,
            "Quantity": 2
        }
    ],
    "NumberOfPoints": 2,
    "StatusTypeID": 50,
    "DateLastStatusUpdate": "2016-03-01T08:19:00Z",
    "DataQualityLevel": 1,
    "DateCreated": "2016-02-02T08:38:00Z",
    "SubmissionStatusTypeID": 200
}