{
    "IsRecentlyVerified": false,
    "ID": 146624,
    "UUID": "5B0C0FCA-7DDB-488F-B9D4-9DA8E8C899A7",
    "DataProviderID": 1,
    "OperatorID": 3371,
    "UsageTypeID": 1,
    "UsageCost": "0,45 €/kWh",
    "AddressInfo": {
        "ID": 146976,
        "Title": "Avenida Madrid - Valencia",
        "AddressLine1": "Avenida Madrid - Valencia",
        "AddressLine2": "Las termas de Segóbtidas",
        "Town": "Saelices",
        "StateOrProvince": "Cuenca",
        "Postcode": "16431",
        "CountryID": 210,
        "Latitude": 39.92120908035457,
        "Longitude": -2.813171950872629,
        "ContactTelephone1": "915060600",
        "AccessComments": "Primera salida de Saelices direccion Madrid-Valencia",
        "RelatedURL": "http://www.wenea.com",
        "DistanceUnit": 0
    },
    "Connections": [
        {
            "ID": 203873,
            "ConnectionTypeID": 33,
            "StatusTypeID": 50,
            "LevelID": 3,
            "PowerKW": 50,
            "CurrentTypeID": 30,
            "Quantity": 2
        },
        {
            "ID": 203937,
            "ConnectionTypeID": 2,
            "StatusTypeID": 50,
            "LevelID": 3,
            "PowerKW": 50,
            "CurrentTypeID": 30,
            "Quantity": 2
        },
        {
            "ID": 203938,
            "ConnectionTypeID": 1036,
            "StatusTypeID": 50,
            "LevelID": 3,
            "Amps": 63,
            "Voltage": 400,
            "PowerKW": 43,
            "CurrentTypeID": 20,
            "Quantity": 2
        }
    ],
    "NumberOfPoints": 2,
    "StatusTypeID": 50,
    "DateLastStatusUpdate": "2020-01-13T13:00:00Z",
    "DataQualityLevel": 1,
    "DateCreated": "2020-01-12T15:05:00Z",
    "SubmissionStatusTypeID": 200
}