{
    "IsRecentlyVerified": false,
    "ID": 51540,
    "UUID": "12662FD0-EABF-486A-92C2-BB45C800C351",
    "DataProviderID": 1,
    "OperatorID": 201,
    "UsageTypeID": 4,
    "AddressInfo": {
        "ID": 51886,
        "Title": "Tiefgarage Schäferwiese",
        "AddressLine1": "Münchner Straße 10",
        "Town": "Pullach",
        "StateOrProvince": "Landkreis München",
        "Postcode": "82049",
        "CountryID": 87,
        "Latitude": 48.058520924947,
        "Longitude": 11.5226148121643,
        "AccessComments": "2 kostenlose (bis 5 Stunden mit Parkscheibe) Parkplätze. \"München Umland\" oder \"KommEnergie\" Ladekarte erforderlich.",
        "RelatedURL": "http://www.pullach.de/",
        "DistanceUnit": 0
    },
    "Connections": [
        {
            "ID": 63876,
            "ConnectionTypeID": 25,
            "StatusTypeID": 50,
            "LevelID": 2,
            "Amps": 16,
            "Voltage": 400,
            "PowerKW": 11,
            "CurrentTypeID": 20,
            "Quantity": 2
        },
        {
            "ID": 63877,
            "ConnectionTypeID": 28,
            "StatusTypeID": 50,
            "LevelID": 2,
            "Amps": 16,
            "Voltage": 230,
            "PowerKW": 3.7,
            "CurrentTypeID": 10,
            "Quantity": 2
        }
    ],
    "NumberOfPoints": 2,
    "StatusTypeID": 50,
    "DateLastStatusUpdate": "2015-07-28T13:18:00Z",
    "DataQualityLevel": 1,
    "DateCreated": "2015-07-28T12:34:00Z",
    "SubmissionStatusTypeID": 200
}