{
    "IsRecentlyVerified": false,
    "ID": 70488,
    "UUID": "84087C31-8822-4D0F-8F6A-3E0A4A9D2CD6",
    "DataProviderID": 1,
    "OperatorID": 80,
    "UsageTypeID": 2,
    "UsageCost": "0,40 €/kW",
    "AddressInfo": {
        "ID": 70834,
        "Title": "Eneldrive Marina",
        "AddressLine1": "Via Marina",
        "Town": "Roccella Ionica",
        "StateOrProvince": "RC",
        "Postcode": "89047",
        "CountryID": 112,
        "Latitude": 38.3217840327789,
        "Longitude": 16.4081447089161,
        "RelatedURL": "http://eneldrive.it",
        "DistanceUnit": 0
    },
    "Connections": [
        {
            "ID": 100822,
            "ConnectionTypeID": 36,
            "StatusTypeID": 50,
            "LevelID": 2,
            "Amps": 16,
            "Voltage": 240,
            "PowerKW": 3,
            "CurrentTypeID": 10,
            "Quantity": 1
        },
        {
            "ID": 100823,
            "ConnectionTypeID": 25,
            "StatusTypeID": 50,
            "LevelID": 2,
            "Amps": 32,
            "Voltage": 400,
            "PowerKW": 22,
            "CurrentTypeID": 20,
            "Quantity": 1
        }
    ],
    "NumberOfPoints": 2,
    "StatusTypeID": 50,
    "DateLastStatusUpdate": "2018-06-19T13:11:00Z",
    "DataQualityLevel": 1,
    "DateCreated": "2016-07-19T08:36:00Z",
    "SubmissionStatusTypeID": 200
}