{
    "IsRecentlyVerified": false,
    "ID": 96838,
    "UUID": "53927606-B235-4EE9-83ED-BDD54D6C85C9",
    "DataProviderID": 1,
    "OperatorID": 3272,
    "UsageTypeID": 4,
    "AddressInfo": {
        "ID": 97184,
        "Title": "Emotì Evpass Collina d'Oro",
        "AddressLine1": "Piazza Brocchi",
        "Town": "Montagnola",
        "StateOrProvince": "Distretto di Lugano",
        "Postcode": "6926 ",
        "CountryID": 217,
        "Latitude": 45.9823391584933,
        "Longitude": 8.91804001378284,
        "ContactTelephone1": "+41 91 946 39 28",
        "ContactTelephone2": "+41 58 221 96 60",
        "RelatedURL": "https://emoti.evpass.ch/",
        "DistanceUnit": 0
    },
    "Connections": [
        {
            "ID": 137147,
            "ConnectionTypeID": 1036,
            "StatusTypeID": 50,
            "LevelID": 2,
            "Amps": 32,
            "Voltage": 400,
            "PowerKW": 22,
            "CurrentTypeID": 20,
            "Quantity": 2
        },
        {
            "ID": 137148,
            "ConnectionTypeID": 1,
            "StatusTypeID": 50,
            "LevelID": 2,
            "Amps": 32,
            "Voltage": 240,
            "PowerKW": 7,
            "CurrentTypeID": 10,
            "Quantity": 2
        },
        {
            "ID": 137149,
            "ConnectionTypeID": 1037,
            "StatusTypeID": 50,
            "LevelID": 2,
            "Amps": 16,
            "Voltage": 240,
            "PowerKW": 3.7,
            "CurrentTypeID": 10,
            "Quantity": 2
        }
    ],
    "NumberOfPoints": 2,
    "StatusTypeID": 50,
    "DateLastStatusUpdate": "2018-01-02T12:16:00Z",
    "DataQualityLevel": 1,
    "DateCreated": "2017-12-31T14:59:00Z",
    "SubmissionStatusTypeID": 200
}