{
    "IsRecentlyVerified": false,
    "ID": 167244,
    "UUID": "2B4B6363-7467-406D-9AD5-5CACF54122EF",
    "DataProviderID": 1,
    "OperatorID": 44,
    "UsageTypeID": 3,
    "AddressInfo": {
        "ID": 167603,
        "Title": "Twizy Ladepunkt",
        "AddressLine1": "Raitestraße 40",
        "Town": "Möglingen",
        "StateOrProvince": "Landkreis Ludwigsburg",
        "Postcode": "71696",
        "CountryID": 87,
        "Latitude": 48.89184799999998,
        "Longitude": 9.119913999999994,
        "ContactTelephone1": "+49 1573 3701725 ",
        "AccessComments": "Bitte vorher unter der Telefonnummer per Anruf oder SMS anmelden. Der Ladeplatz liegt in einer abgeschlossenen Tiefgarage. Kaffee oder Tee gibt's auch nach Möglichkeit!",
        "DistanceUnit": 0
    },
    "Connections": [
        {
            "ID": 253272,
            "ConnectionTypeID": 28,
            "StatusTypeID": 50,
            "LevelID": 2,
            "Amps": 16,
            "Voltage": 230,
            "PowerKW": 3.7,
            "CurrentTypeID": 10,
            "Quantity": 1
        }
    ],
    "NumberOfPoints": 1,
    "StatusTypeID": 50,
    "DateLastStatusUpdate": "2020-09-02T09:22:00Z",
    "DataQualityLevel": 1,
    "DateCreated": "2020-09-02T09:22:00Z",
    "SubmissionStatusTypeID": 200
}