{
    "UserComments": [
        {
            "ID": 17785,
            "ChargePointID": 41835,
            "CommentTypeID": 50,
            "UserName": "Bearlissimo",
            "Comment": "CCS charge error - fault on unit",
            "Rating": 4,
            "DateCreated": "2017-10-08T21:30:33.723Z",
            "User": {
                "ID": 16049,
                "Username": "Bearlissimo"
            },
            "CheckinStatusTypeID": 25
        },
        {
            "ID": 17783,
            "ChargePointID": 41835,
            "CommentTypeID": 1000,
            "UserName": "Bearlissimo",
            "Comment": "CCS failed to charge (error after init) reported to operator several times. AC working at 22Kw but limited to 1 hour max use penalty charge therefor pretty useless.",
            "DateCreated": "2017-10-08T15:10:58.81Z",
            "User": {
                "ID": 16049,
                "Username": "Bearlissimo"
            },
            "CheckinStatusTypeID": 25
        },
        {
            "ID": 14075,
            "ChargePointID": 41835,
            "CommentTypeID": 10,
            "UserName": "Torsten",
            "Comment": "CCS OK",
            "Rating": 4,
            "DateCreated": "2016-08-15T14:14:47.813Z",
            "User": {
                "ID": 4992,
                "Username": "Torsten"
            },
            "CheckinStatusTypeID": 10
        },
        {
            "ID": 10191,
            "ChargePointID": 41835,
            "CommentTypeID": 10,
            "UserName": "Torsten",
            "Comment": "CCS and AC ok",
            "DateCreated": "2016-04-15T19:37:25.91Z",
            "User": {
                "ID": 4992,
                "Username": "Torsten"
            },
            "CheckinStatusTypeID": 10
        },
        {
            "ID": 6637,
            "ChargePointID": 41835,
            "CommentTypeID": 1000,
            "UserName": "psilosopher",
            "Comment": "Tried charging the i3 on the CCS today. It gave a CCS error code after trying to initialise charging. I spent 20 minutes on the phone to ChargePoint Genie, who tried to remotely operate the charging station. She even rebooted the charger to no avail. I read all the on screen error codes, so hopefully an engineer will be out soon.\n\nTwo days beforehand I had trouble getting the charger to communicate with the vehicle. No error codes, but on the fourth attempt, it started charging.",
            "Rating": 1,
            "DateCreated": "2015-09-29T12:59:07.943Z",
            "User": {
                "ID": 6421,
                "Username": "psilosopher"
            },
            "CheckinStatusTypeID": 25
        },
        {
            "ID": 4113,
            "ChargePointID": 41835,
            "CommentTypeID": 10,
            "UserName": "",
            "Comment": "Could not charge using iphone app - claimed it couldn't communicate with the chargepost. don't have a compatible card, think ChargepointGenie issue them but not sure how to order once registered!",
            "DateCreated": "2015-03-30T22:23:11.407Z",
            "CheckinStatusTypeID": 40
        },
        {
            "ID": 3749,
            "ChargePointID": 41835,
            "CommentTypeID": 10,
            "UserName": "snfosberry",
            "Comment": "30/12/2014. There is a costa in the leisure centre!",
            "Rating": 4,
            "DateCreated": "2015-02-11T22:22:43.273Z",
            "User": {
                "ID": 1059,
                "Username": "snfosberry"
            },
            "CheckinStatusTypeID": 10
        }
    ],
    "MediaItems": [
        {
            "ID": 18146,
            "ChargePointID": 41835,
            "ItemURL": "https://s3-ap-southeast-2.amazonaws.com/openchargemap/images/GB/OCM41835/OCM-41835.orig.2019042408322256.png",
            "ItemThumbnailURL": "https://s3-ap-southeast-2.amazonaws.com/openchargemap/images/GB/OCM41835/OCM-41835.thmb.2019042408322256.png",
            "Comment": "",
            "IsEnabled": true,
            "IsVideo": false,
            "IsFeaturedItem": false,
            "IsExternalResource": false,
            "User": {
                "ID": 20254,
                "Username": "donhulio"
            },
            "DateCreated": "2019-04-24T08:33:00Z"
        },
        {
            "ID": 988,
            "ChargePointID": 41835,
            "ItemURL": "https://s3-ap-southeast-2.amazonaws.com/openchargemap/images/GB/OCM41835/OCM-41835.orig.2015021122214713.jpg",
            "ItemThumbnailURL": "https://s3-ap-southeast-2.amazonaws.com/openchargemap/images/GB/OCM41835/OCM-41835.thmb.2015021122214713.jpg",
            "Comment": "",
            "IsEnabled": true,
            "IsVideo": false,
            "IsFeaturedItem": false,
            "IsExternalResource": false,
            "User": {
                "ID": 1059,
                "Username": "snfosberry"
            },
            "DateCreated": "2015-02-11T22:22:00Z"
        }
    ],
    "IsRecentlyVerified": false,
    "ID": 41835,
    "UUID": "AE313857-A6C9-47AB-858D-AD9B13EF61FA",
    "DataProviderID": 1,
    "OperatorID": 150,
    "OperatorsReference": "The Rapids, Romsey - SSE,The Rapids, Romsey - SSE",
    "UsageTypeID": 4,
    "UsageCost": "Â£1.00 + Â£0.30/kWh; Â£10.00 overstay after 65 mins",
    "AddressInfo": {
        "ID": 42181,
        "Title": "Romsey Rapids Leisure Centre",
        "AddressLine1": "Southampton Road",
        "Town": "Romsey",
        "StateOrProvince": "Hampshire",
        "Postcode": "SO51 8AF",
        "CountryID": 1,
        "Latitude": 50.9861934878697,
        "Longitude": -1.48858308792114,
        "AccessComments": "On the right as you enter the car park.",
        "DistanceUnit": 0
    },
    "Connections": [
        {
            "ID": 50117,
            "ConnectionTypeID": 2,
            "StatusTypeID": 50,
            "LevelID": 3,
            "PowerKW": 50,
            "CurrentTypeID": 30,
            "Quantity": 1
        },
        {
            "ID": 50118,
            "ConnectionTypeID": 33,
            "StatusTypeID": 50,
            "LevelID": 3,
            "PowerKW": 50,
            "CurrentTypeID": 30,
            "Quantity": 1
        },
        {
            "ID": 50119,
            "ConnectionTypeID": 1036,
            "StatusTypeID": 50,
            "LevelID": 3,
            "Voltage": 400,
            "PowerKW": 43,
            "CurrentTypeID": 20,
            "Quantity": 1
        }
    ],
    "NumberOfPoints": 2,
    "GeneralComments": "Separate faults on AC and DC sides, reported",
    "StatusTypeID": 50,
    "DateLastStatusUpdate": "2019-04-24T08:33:00Z",
    "DataQualityLevel": 1,
    "DateCreated": "2015-02-10T11:46:00Z",
    "SubmissionStatusTypeID": 200
}