{
    "IsRecentlyVerified": false,
    "ID": 110733,
    "UUID": "17DFB3C6-433D-4ABA-BB98-AC1E7D0CB864",
    "DataProviderID": 2,
    "DataProvidersReference": "94483",
    "UsageTypeID": 1,
    "AddressInfo": {
        "ID": 111079,
        "Title": "Scotiabank",
        "AddressLine1": "4 Norfolk St N",
        "Town": "Simcoe",
        "StateOrProvince": "ON",
        "Postcode": "N3Y 3N6",
        "CountryID": 44,
        "Latitude": 42.837253,
        "Longitude": -80.304252,
        "ContactTelephone1": "519-426-7330",
        "AccessComments": "24 hours daily",
        "RelatedURL": "",
        "DistanceUnit": 0
    },
    "Connections": [
        {
            "ID": 156014,
            "ConnectionTypeID": 2,
            "LevelID": 3,
            "Amps": 100,
            "Voltage": 400,
            "PowerKW": 40,
            "CurrentTypeID": 30,
            "Quantity": 1
        },
        {
            "ID": 156015,
            "ConnectionTypeID": 32,
            "LevelID": 3,
            "Amps": 100,
            "Voltage": 400,
            "PowerKW": 40,
            "CurrentTypeID": 30,
            "Quantity": 1
        }
    ],
    "DateLastStatusUpdate": "2020-06-26T03:06:00Z",
    "DataQualityLevel": 3,
    "DateCreated": "2018-10-18T23:36:00Z",
    "SubmissionStatusTypeID": 100
}