{
    "IsRecentlyVerified": false,
    "ID": 96773,
    "UUID": "2ACFC8AB-08FE-4122-8451-FB8411ABC4E9",
    "DataProviderID": 2,
    "DataProvidersReference": "88732",
    "OperatorID": 5,
    "UsageTypeID": 1,
    "AddressInfo": {
        "ID": 97119,
        "Title": "BRIDGESTREETLOT",
        "AddressLine1": "63 Bridge St",
        "Town": "Amsterdam",
        "StateOrProvince": "NY",
        "Postcode": "12010",
        "CountryID": 2,
        "Latitude": 42.9343726,
        "Longitude": -74.1972709,
        "ContactTelephone1": "888-758-4389",
        "AccessComments": "24 hours daily",
        "RelatedURL": "http://www.chargepoint.com/",
        "DistanceUnit": 0
    },
    "Connections": [
        {
            "ID": 137052,
            "ConnectionTypeID": 1,
            "LevelID": 2,
            "Amps": 16,
            "Voltage": 230,
            "PowerKW": 3,
            "CurrentTypeID": 10,
            "Quantity": 2
        }
    ],
    "DateLastStatusUpdate": "2019-12-24T09:21:00Z",
    "DataQualityLevel": 3,
    "DateCreated": "2017-12-29T21:01:00Z",
    "SubmissionStatusTypeID": 100
}