{
    "IsRecentlyVerified": false,
    "ID": 154034,
    "UUID": "E4CE6DC9-9DE8-43CE-97B2-14920085970E",
    "DataProviderID": 28,
    "DataProvidersReference": "FR*S27*PBONNEVILLE*LORRAINE",
    "UsageTypeID": 5,
    "AddressInfo": {
        "ID": 154387,
        "Title": "900103",
        "AddressLine1": "Place Lorraine La Bonneville/Iton",
        "CountryID": 80,
        "Latitude": 48.992145,
        "Longitude": 1.03789,
        "AccessComments": "24/24 7/7 jours",
        "DistanceUnit": 0
    },
    "Connections": [
        {
            "ID": 216447,
            "ConnectionTypeID": 28,
            "StatusTypeID": 50,
            "LevelID": 2,
            "PowerKW": 22,
            "CurrentTypeID": 10
        },
        {
            "ID": 216448,
            "ConnectionTypeID": 1036,
            "StatusTypeID": 50,
            "LevelID": 2,
            "PowerKW": 22,
            "CurrentTypeID": 20
        },
        {
            "ID": 250612,
            "ConnectionTypeID": 28,
            "StatusTypeID": 50,
            "LevelID": 2,
            "PowerKW": 22,
            "CurrentTypeID": 10
        },
        {
            "ID": 250613,
            "ConnectionTypeID": 1036,
            "StatusTypeID": 50,
            "LevelID": 2,
            "PowerKW": 22,
            "CurrentTypeID": 20
        }
    ],
    "GeneralComments": "Borne en service",
    "StatusTypeID": 50,
    "DateLastStatusUpdate": "2020-08-27T05:16:00Z",
    "DataQualityLevel": 2,
    "DateCreated": "2020-03-15T10:54:00Z",
    "SubmissionStatusTypeID": 100
}