{
    "MediaItems": [
        {
            "ID": 21414,
            "ChargePointID": 118277,
            "ItemURL": "https://s3-ap-southeast-2.amazonaws.com/openchargemap/images/IT/OCM118277/OCM-118277.orig.2020030115485255.jpg",
            "ItemThumbnailURL": "https://s3-ap-southeast-2.amazonaws.com/openchargemap/images/IT/OCM118277/OCM-118277.thmb.2020030115485255.jpg",
            "Comment": "",
            "IsEnabled": true,
            "IsVideo": false,
            "IsFeaturedItem": false,
            "IsExternalResource": false,
            "User": {
                "ID": 1606,
                "Username": "polianto"
            },
            "DateCreated": "2020-03-01T15:49:00Z"
        }
    ],
    "IsRecentlyVerified": false,
    "ID": 118277,
    "UUID": "BF4713ED-D81A-4FD5-A47D-6EF02CF0884E",
    "DataProviderID": 1,
    "OperatorID": 80,
    "UsageTypeID": 4,
    "AddressInfo": {
        "ID": 118623,
        "Title": "Fiorenzuola d'Arda Via Roma | EnelX",
        "AddressLine1": "Via Roma angolo Vicolo Brandacci",
        "Town": "Fiorenzuola d'Arda",
        "StateOrProvince": "PC",
        "Postcode": "29017",
        "CountryID": 112,
        "Latitude": 44.9308682668717,
        "Longitude": 9.90919735627074,
        "ContactTelephone1": "800.069.850",
        "RelatedURL": "https://www.enelx.com/it/it/emobility",
        "DistanceUnit": 0
    },
    "Connections": [
        {
            "ID": 167353,
            "ConnectionTypeID": 25,
            "StatusTypeID": 50,
            "LevelID": 2,
            "Amps": 32,
            "Voltage": 400,
            "PowerKW": 22,
            "CurrentTypeID": 20,
            "Quantity": 2
        }
    ],
    "NumberOfPoints": 2,
    "StatusTypeID": 50,
    "DateLastStatusUpdate": "2020-03-01T15:49:00Z",
    "DataQualityLevel": 1,
    "DateCreated": "2019-03-20T17:43:00Z",
    "SubmissionStatusTypeID": 200
}