{
    "IsRecentlyVerified": false,
    "ID": 99241,
    "UUID": "3C8EE4B1-9893-49E9-9FE4-BC0B2A633410",
    "DataProviderID": 1,
    "OperatorID": 45,
    "UsageTypeID": 5,
    "AddressInfo": {
        "ID": 99587,
        "Title": "Maldon District Council",
        "AddressLine1": "Princes Road",
        "Town": "Maldon",
        "StateOrProvince": "Essex",
        "Postcode": "CM9 5DL",
        "CountryID": 1,
        "Latitude": 51.728844,
        "Longitude": 0.680297,
        "AccessComments": "Adjacent to main entrance to Council office building",
        "DistanceUnit": 0
    },
    "Connections": [
        {
            "ID": 140205,
            "ConnectionTypeID": 25,
            "Reference": "N/A",
            "StatusTypeID": 0,
            "LevelID": 2,
            "Amps": 16,
            "Voltage": 230,
            "PowerKW": 3.7,
            "CurrentTypeID": 10,
            "Quantity": 1
        }
    ],
    "NumberOfPoints": 1,
    "StatusTypeID": 0,
    "DateLastStatusUpdate": "2018-01-24T16:00:00Z",
    "MetadataValues": [
        {
            "ID": 4082,
            "MetadataFieldID": 4,
            "ItemValue": "Contains public sector information licensed under the Open Government Licence v2.0. http://www.nationalarchives.gov.uk/doc/open-government-licence/version/2/"
        }
    ],
    "DataQualityLevel": 3,
    "DateCreated": "2018-01-24T15:53:00Z",
    "SubmissionStatusTypeID": 200
}