{
    "IsRecentlyVerified": true,
    "DateLastVerified": "2021-10-03T05:54:00Z",
    "ID": 189477,
    "UUID": "EB530F24-60E1-42FE-B41B-40BE05A1B72D",
    "DataProviderID": 1,
    "OperatorID": 23,
    "UsageTypeID": 4,
    "AddressInfo": {
        "ID": 189836,
        "Title": "Susanville, CA Supercharger",
        "AddressLine1": "Diamond Mountain Casino & Hotel",
        "AddressLine2": " 900 Skyline Road ",
        "Town": "Susanville",
        "StateOrProvince": "CA",
        "Postcode": "96130",
        "CountryID": 2,
        "Latitude": 40.43043670245319,
        "Longitude": -120.6578957019019,
        "DistanceUnit": 0
    },
    "Connections": [
        {
            "ID": 306464,
            "ConnectionTypeID": 27,
            "Reference": "See on Tesla's Supercharger Map",
            "StatusTypeID": 50,
            "LevelID": 3,
            "PowerKW": 250,
            "CurrentTypeID": 30,
            "Quantity": 1,
            "Comments": "Susanville Tesla Supercharger Just Opened "
        }
    ],
    "NumberOfPoints": 8,
    "StatusTypeID": 50,
    "DateLastStatusUpdate": "2021-10-06T06:08:00Z",
    "DataQualityLevel": 1,
    "DateCreated": "2021-10-03T05:54:00Z",
    "SubmissionStatusTypeID": 200
}