{
    "IsRecentlyVerified": false,
    "ID": 53833,
    "UUID": "5C0DF223-DA71-458D-9E78-CE07CD85AA3C",
    "DataProviderID": 26,
    "DataProvidersReference": "67385",
    "OperatorID": 179,
    "OperatorsReference": "Ecotap 1601148",
    "UsageCost": "0.00 afhankelijk van pas",
    "AddressInfo": {
        "ID": 54179,
        "Title": "Prinses Margrietlaan",
        "AddressLine1": "Prinses Margrietlaan",
        "Town": "Alphen aan den Rijn",
        "Postcode": "2404 XJ",
        "CountryID": 159,
        "Latitude": 52.135215,
        "Longitude": 4.64972,
        "RelatedURL": "http://www.ecotap.nl",
        "DistanceUnit": 0
    },
    "Connections": [
        {
            "ID": 67215,
            "ConnectionTypeID": 25,
            "LevelID": 2,
            "PowerKW": 5,
            "CurrentTypeID": 10
        }
    ],
    "NumberOfPoints": 1,
    "StatusTypeID": 50,
    "DateLastStatusUpdate": "2016-03-03T12:38:00Z",
    "DataQualityLevel": 3,
    "DateCreated": "2015-09-20T11:50:00Z",
    "SubmissionStatusTypeID": 100
}