{
    "IsRecentlyVerified": false,
    "ID": 57389,
    "UUID": "026889EC-C583-4900-82FA-9F2101F4E56D",
    "DataProviderID": 2,
    "DataProvidersReference": "70942",
    "OperatorID": 5,
    "UsageTypeID": 1,
    "AddressInfo": {
        "ID": 57735,
        "Title": "PILGRIM PARKING",
        "AddressLine1": "99 Kneeland Street",
        "Town": "Boston",
        "StateOrProvince": "MA",
        "Postcode": "02111",
        "CountryID": 2,
        "Latitude": 42.3500878,
        "Longitude": -71.0601936,
        "ContactTelephone1": "888-758-4389",
        "AccessComments": "24 hours daily",
        "RelatedURL": "http://www.chargepoint.com/",
        "DistanceUnit": 0
    },
    "Connections": [
        {
            "ID": 72495,
            "ConnectionTypeID": 1,
            "LevelID": 2,
            "Amps": 16,
            "Voltage": 230,
            "PowerKW": 3,
            "CurrentTypeID": 10,
            "Quantity": 2
        }
    ],
    "DateLastStatusUpdate": "2019-12-24T09:20:00Z",
    "DataQualityLevel": 3,
    "DateCreated": "2015-11-30T11:50:00Z",
    "SubmissionStatusTypeID": 100
}