{
    "IsRecentlyVerified": false,
    "ID": 95538,
    "UUID": "6A19F662-DEF7-4570-A483-AB50E26D06CF",
    "DataProviderID": 1,
    "OperatorID": 23,
    "OperatorsReference": "37669",
    "UsageTypeID": 4,
    "AddressInfo": {
        "ID": 95884,
        "Title": "Galerias Valle Oriente",
        "AddressLine1": "Av Lazaro Cardenas 1000 Paseo de Las Privanzas",
        "Town": "Monterrey",
        "StateOrProvince": "Nuevo Leon",
        "Postcode": "64700",
        "CountryID": 146,
        "Latitude": 25.637913,
        "Longitude": -100.31443,
        "ContactTelephone1": "+52 81 8133 2400",
        "DistanceUnit": 0
    },
    "Connections": [
        {
            "ID": 135321,
            "ConnectionTypeID": 30,
            "StatusTypeID": 50,
            "LevelID": 2,
            "PowerKW": 18,
            "CurrentTypeID": 20,
            "Quantity": 4
        }
    ],
    "NumberOfPoints": 4,
    "GeneralComments": "4 Tesla Connectors, up to 18kW.Available to the public. Self park.",
    "StatusTypeID": 50,
    "DateLastStatusUpdate": "2017-11-12T06:59:00Z",
    "DataQualityLevel": 1,
    "DateCreated": "2017-11-12T06:59:00Z",
    "SubmissionStatusTypeID": 200
}