{
    "IsRecentlyVerified": false,
    "ID": 123782,
    "UUID": "8D45534D-A65E-4DF9-98B6-09EBB1C14EB0",
    "DataProviderID": 2,
    "DataProvidersReference": "71896",
    "UsageTypeID": 2,
    "AddressInfo": {
        "ID": 124128,
        "Title": "Caltrans - District 9",
        "AddressLine1": "500 S Main St",
        "Town": "Bishop",
        "StateOrProvince": "CA",
        "Postcode": "93514",
        "CountryID": 2,
        "Latitude": 37.356482,
        "Longitude": -118.394188,
        "ContactTelephone1": "",
        "AccessComments": "Employee and state vehicle use only",
        "RelatedURL": "",
        "DistanceUnit": 0
    },
    "Connections": [
        {
            "ID": 173808,
            "ConnectionTypeID": 1,
            "LevelID": 2,
            "Amps": 16,
            "Voltage": 230,
            "PowerKW": 3,
            "CurrentTypeID": 10,
            "Quantity": 1
        }
    ],
    "DateLastStatusUpdate": "2019-04-06T05:03:00Z",
    "DataQualityLevel": 3,
    "DateCreated": "2019-04-06T05:03:00Z",
    "SubmissionStatusTypeID": 100
}