{
    "UserComments": [
        {
            "ID": 24716,
            "ChargePointID": 70146,
            "CommentTypeID": 50,
            "UserName": "Sfabris",
            "Comment": "Be careful: if you have the charge socket on the left your are going to partially sit on thr road. Road is one way so parking in reverse is not an option.",
            "Rating": 3,
            "DateCreated": "2021-08-10T21:53:53.343Z",
            "User": {
                "ID": 33584,
                "Username": "Sfabris"
            },
            "CheckinStatusTypeID": 10,
            "IsActionedByEditor": false
        }
    ],
    "MediaItems": [
        {
            "ID": 9139,
            "ChargePointID": 70146,
            "ItemURL": "https://s3-ap-southeast-2.amazonaws.com/openchargemap/images/IT/OCM70146/OCM-70146.orig.2017011515093153.jpg",
            "ItemThumbnailURL": "https://s3-ap-southeast-2.amazonaws.com/openchargemap/images/IT/OCM70146/OCM-70146.thmb.2017011515093153.jpg",
            "Comment": "",
            "IsEnabled": true,
            "IsVideo": false,
            "IsFeaturedItem": false,
            "IsExternalResource": false,
            "User": {
                "ID": 12207,
                "Username": "aldodal"
            },
            "DateCreated": "2017-01-15T15:10:00Z"
        }
    ],
    "IsRecentlyVerified": false,
    "ID": 70146,
    "UUID": "9E9F4B24-A3EC-4A0A-BA82-7735255BA518",
    "DataProviderID": 1,
    "OperatorID": 1,
    "UsageTypeID": 1,
    "AddressInfo": {
        "ID": 70492,
        "Title": "Nova Thiene",
        "AddressLine1": "Piazza Nova",
        "AddressLine2": "accesso da Via Gorizia",
        "Town": "Thiene ",
        "StateOrProvince": "VI",
        "Postcode": "36016",
        "CountryID": 112,
        "Latitude": 45.707187256046566,
        "Longitude": 11.479459481303147,
        "DistanceUnit": 0
    },
    "Connections": [
        {
            "ID": 100076,
            "ConnectionTypeID": 25,
            "StatusTypeID": 50,
            "LevelID": 2,
            "PowerKW": 7,
            "CurrentTypeID": 10,
            "Quantity": 1
        },
        {
            "ID": 304367,
            "ConnectionTypeID": 36,
            "StatusTypeID": 50,
            "LevelID": 2,
            "PowerKW": 3.5,
            "CurrentTypeID": 10,
            "Quantity": 1
        }
    ],
    "NumberOfPoints": 2,
    "StatusTypeID": 50,
    "DateLastStatusUpdate": "2021-08-10T21:54:00Z",
    "DataQualityLevel": 1,
    "DateCreated": "2016-07-10T15:23:00Z",
    "SubmissionStatusTypeID": 200
}