{
    "IsRecentlyVerified": false,
    "ID": 36461,
    "UUID": "831DD3C0-F548-4E5F-8297-4E4888E0C10F",
    "DataProviderID": 26,
    "DataProvidersReference": "46209",
    "OperatorID": 73,
    "OperatorsReference": "EV-Box EVB-P1402082",
    "UsageCost": "0.00 jaarabonnement",
    "AddressInfo": {
        "ID": 36807,
        "Title": "Dwarsdijk 9",
        "AddressLine1": "Dwarsdijk 9",
        "Town": "Stichtse Vecht",
        "Postcode": "3612 AN",
        "CountryID": 159,
        "Latitude": 52.16873,
        "Longitude": 5.09356,
        "RelatedURL": "http://www.ev-box.nl",
        "DistanceUnit": 0
    },
    "Connections": [
        {
            "ID": 39972,
            "ConnectionTypeID": 25,
            "LevelID": 2,
            "PowerKW": 5,
            "CurrentTypeID": 10
        }
    ],
    "NumberOfPoints": 1,
    "StatusTypeID": 50,
    "DateLastStatusUpdate": "2016-06-04T02:51:00Z",
    "DataQualityLevel": 3,
    "DateCreated": "2015-01-09T06:05:00Z",
    "SubmissionStatusTypeID": 100
}