{
    "IsRecentlyVerified": false,
    "ID": 113431,
    "UUID": "1BC49446-7D8A-43B6-B992-888D10F12BA6",
    "DataProviderID": 1,
    "OperatorID": 44,
    "UsageTypeID": 1,
    "UsageCost": "98 Ft/kWh",
    "AddressInfo": {
        "ID": 113777,
        "Title": "Mercure Buda Hotel",
        "AddressLine1": "1013 Budapest, Krisztina krt. 41-43.",
        "Town": "Budapest",
        "StateOrProvince": "Pest",
        "Postcode": "1013",
        "CountryID": 104,
        "Latitude": 47.49886079386627,
        "Longitude": 19.02745149834186,
        "ContactTelephone1": "+36309719900",
        "ContactEmail": "info@parkl.net",
        "RelatedURL": "https://parkl.net/",
        "DistanceUnit": 0
    },
    "Connections": [
        {
            "ID": 159792,
            "ConnectionTypeID": 25,
            "StatusTypeID": 50,
            "LevelID": 2,
            "Amps": 16,
            "Voltage": 400,
            "PowerKW": 11,
            "CurrentTypeID": 20,
            "Quantity": 1
        },
        {
            "ID": 159793,
            "ConnectionTypeID": 25,
            "StatusTypeID": 50,
            "LevelID": 2,
            "Amps": 32,
            "Voltage": 400,
            "PowerKW": 22,
            "CurrentTypeID": 20,
            "Quantity": 1
        }
    ],
    "NumberOfPoints": 1,
    "GeneralComments": "Töltési teljesítmény: 2*11kW, vagy 1*22kW\r\nTulajdonos: SZALONTAI Rendszerintegrátor Kft.\r\nwww.szalontai.co.hu\r\nA parkoláshoz szükséges alkalmazás letölthető:\r\nhttps://play.google.com/store/apps/details?id=net.parkl.androidclient&hl=hu\r\nhttps://itunes.apple.com/us/app/parkl/id1187301023?mt=8",
    "StatusTypeID": 50,
    "DateLastStatusUpdate": "2020-03-12T12:07:00Z",
    "DataQualityLevel": 1,
    "DateCreated": "2018-12-12T11:46:00Z",
    "SubmissionStatusTypeID": 200
}