{
    "IsRecentlyVerified": false,
    "ID": 174129,
    "UUID": "FCB067C2-825A-4128-A6E7-A14775B89FF1",
    "DataProviderID": 1,
    "OperatorID": 3377,
    "UsageTypeID": 4,
    "UsageCost": "Free",
    "AddressInfo": {
        "ID": 174488,
        "Title": "Ajuntament d'Orís",
        "AddressLine1": "Ajuntament d'Orís",
        "Town": "Orís",
        "StateOrProvince": "Catalonia",
        "Postcode": "08571",
        "CountryID": 210,
        "Latitude": 42.05818447062089,
        "Longitude": 2.2388167432548016,
        "RelatedURL": "http://etecnic.es",
        "DistanceUnit": 0
    },
    "Connections": [
        {
            "ID": 269065,
            "ConnectionTypeID": 25,
            "StatusTypeID": 50,
            "LevelID": 2,
            "Amps": 32,
            "Voltage": 399,
            "PowerKW": 22.2,
            "CurrentTypeID": 20,
            "Quantity": 2
        }
    ],
    "NumberOfPoints": 2,
    "StatusTypeID": 50,
    "DateLastStatusUpdate": "2021-03-17T11:58:00Z",
    "DataQualityLevel": 1,
    "DateCreated": "2021-03-17T11:58:00Z",
    "SubmissionStatusTypeID": 200
}