{
    "IsRecentlyVerified": false,
    "ID": 135157,
    "UUID": "665E2562-59C8-49E4-BE17-8CD5C8E569A7",
    "DataProviderID": 1,
    "OperatorID": 80,
    "UsageTypeID": 4,
    "AddressInfo": {
        "ID": 135503,
        "Title": "Guidi Car S.R.L. Volkswagen Service | EnelX",
        "AddressLine1": "Via Camporcioni, 11",
        "Town": "Montecatini Terme",
        "StateOrProvince": "PT",
        "Postcode": "51016",
        "CountryID": 112,
        "Latitude": 43.862591687723295,
        "Longitude": 10.768707716904373,
        "RelatedURL": "https://www.enelx.com/it/it/emobility",
        "DistanceUnit": 0
    },
    "Connections": [
        {
            "ID": 189198,
            "ConnectionTypeID": 25,
            "StatusTypeID": 50,
            "LevelID": 2,
            "Amps": 32,
            "Voltage": 400,
            "PowerKW": 22,
            "CurrentTypeID": 20,
            "Quantity": 2
        }
    ],
    "NumberOfPoints": 2,
    "GeneralComments": "\tLUN - SAB 09:00 - 13:00 / 15:30 - 19:30 DOM CHIUSO",
    "StatusTypeID": 50,
    "DateLastStatusUpdate": "2019-12-09T11:50:00Z",
    "DataQualityLevel": 1,
    "DateCreated": "2019-12-09T11:50:00Z",
    "SubmissionStatusTypeID": 200
}