{
    "IsRecentlyVerified": false,
    "ID": 120508,
    "UUID": "771DF3B8-13BB-47DA-836B-858B9A6DF1A6",
    "DataProviderID": 2,
    "DataProvidersReference": "75455",
    "OperatorID": 5,
    "UsageTypeID": 1,
    "AddressInfo": {
        "ID": 120854,
        "Title": "AMERICANAIRLINE",
        "AddressLine1": "4700 American Blvd",
        "Town": "Fort Worth",
        "StateOrProvince": "TX",
        "Postcode": "76155",
        "CountryID": 2,
        "Latitude": 32.8329481,
        "Longitude": -97.0686288,
        "ContactTelephone1": "888-758-4389",
        "AccessComments": "24 hours daily",
        "RelatedURL": "http://www.chargepoint.com/",
        "DistanceUnit": 0
    },
    "Connections": [
        {
            "ID": 169861,
            "ConnectionTypeID": 1,
            "LevelID": 2,
            "Amps": 16,
            "Voltage": 230,
            "PowerKW": 3,
            "CurrentTypeID": 10,
            "Quantity": 2
        }
    ],
    "DateLastStatusUpdate": "2019-12-24T09:09:00Z",
    "DataQualityLevel": 3,
    "DateCreated": "2019-04-01T04:59:00Z",
    "SubmissionStatusTypeID": 100
}