{
    "IsRecentlyVerified": false,
    "ID": 66212,
    "UUID": "B41B48E1-E95B-4F5C-BB95-4D4216C56501",
    "DataProviderID": 1,
    "OperatorID": 45,
    "UsageTypeID": 3,
    "UsageCost": "frei",
    "AddressInfo": {
        "ID": 66558,
        "Title": "Elektro Wilkens",
        "AddressLine1": "Mittelweg 4",
        "AddressLine2": "Tinnum",
        "Town": "Sylt",
        "StateOrProvince": "Kreis Nordfriesland",
        "Postcode": "25980",
        "CountryID": 87,
        "Latitude": 54.8994783464206,
        "Longitude": 8.33848344047544,
        "ContactTelephone1": "+49465133232",
        "AccessComments": "Nach Anmeldung im Firmenbüro, das von Mo-Fr 8-16Uhr geöffnet ist. Graue Mennekes Ladesäule am Straßenrand.",
        "DistanceUnit": 0
    },
    "Connections": [
        {
            "ID": 91513,
            "ConnectionTypeID": 25,
            "StatusTypeID": 50,
            "LevelID": 2,
            "Amps": 32,
            "Voltage": 400,
            "PowerKW": 22,
            "CurrentTypeID": 20,
            "Quantity": 2
        },
        {
            "ID": 91514,
            "ConnectionTypeID": 28,
            "StatusTypeID": 50,
            "LevelID": 2,
            "Amps": 16,
            "Voltage": 230,
            "PowerKW": 3.7,
            "CurrentTypeID": 10,
            "Quantity": 2
        }
    ],
    "NumberOfPoints": 2,
    "StatusTypeID": 50,
    "DateLastStatusUpdate": "2016-05-14T08:02:00Z",
    "DataQualityLevel": 1,
    "DateCreated": "2016-05-13T12:39:00Z",
    "SubmissionStatusTypeID": 200
}