{
    "IsRecentlyVerified": false,
    "ID": 70991,
    "UUID": "EDD81C8D-2AF8-48EE-A84B-5163B2262CE5",
    "DataProviderID": 1,
    "OperatorID": 1,
    "UsageTypeID": 6,
    "AddressInfo": {
        "ID": 71337,
        "Title": "Elektra Landaben",
        "AddressLine1": "Polígono Ipertegui II, 12",
        "Town": "Orcoyen",
        "StateOrProvince": "Navarra",
        "Postcode": "31160",
        "CountryID": 210,
        "Latitude": 42.8186678,
        "Longitude": -1.6929132999999865,
        "ContactEmail": "pamplona@elektra-sa.es",
        "AccessComments": "Opening: 8am-6pm",
        "RelatedURL": "http://www.grupoelektra.es",
        "DistanceUnit": 0
    },
    "Connections": [
        {
            "ID": 101716,
            "ConnectionTypeID": 25,
            "StatusTypeID": 50,
            "LevelID": 2,
            "Amps": 32,
            "Voltage": 400,
            "PowerKW": 22,
            "Quantity": 1
        }
    ],
    "NumberOfPoints": 1,
    "StatusTypeID": 50,
    "DateLastStatusUpdate": "2016-08-22T14:17:00Z",
    "DataQualityLevel": 1,
    "DateCreated": "2016-08-22T14:17:00Z",
    "SubmissionStatusTypeID": 200
}