{
    "IsRecentlyVerified": false,
    "ID": 80228,
    "UUID": "5112E034-CEB7-41E1-86C6-7B8FFD5EBFAF",
    "DataProviderID": 2,
    "DataProvidersReference": "81003",
    "OperatorID": 5,
    "UsageTypeID": 1,
    "AddressInfo": {
        "ID": 80574,
        "Title": "LG&E",
        "AddressLine1": "315 East Main Street",
        "Town": "Louisville",
        "StateOrProvince": "KY",
        "Postcode": "40202",
        "CountryID": 2,
        "Latitude": 38.2556425,
        "Longitude": -85.7470093,
        "ContactTelephone1": "888-758-4389",
        "AccessComments": "24 hours daily",
        "RelatedURL": "http://www.chargepoint.com/",
        "DistanceUnit": 0
    },
    "Connections": [
        {
            "ID": 114897,
            "ConnectionTypeID": 1,
            "LevelID": 2,
            "Amps": 16,
            "Voltage": 230,
            "PowerKW": 3,
            "CurrentTypeID": 10,
            "Quantity": 1
        }
    ],
    "DateLastStatusUpdate": "2019-04-06T04:02:00Z",
    "DataQualityLevel": 3,
    "DateCreated": "2017-01-31T01:05:00Z",
    "SubmissionStatusTypeID": 100
}