{
    "IsRecentlyVerified": false,
    "ID": 162917,
    "UUID": "9C183588-6B37-482A-B92C-BD42824EB1DD",
    "DataProviderID": 1,
    "OperatorID": 3353,
    "UsageTypeID": 5,
    "UsageCost": "20 snt/kWh, 10 snt/kWh for registered customers",
    "AddressInfo": {
        "ID": 163274,
        "Title": "Motonet Konala",
        "AddressLine1": "21 Ristipellontie",
        "Town": "Helsinki",
        "StateOrProvince": "Southern Finland",
        "Postcode": "00390",
        "CountryID": 79,
        "Latitude": 60.24184464102939,
        "Longitude": 24.84740606841558,
        "AccessComments": "At the last row of the parking lot",
        "RelatedURL": "https://www.motonet.fi/fi/sivut/motolataus",
        "DistanceUnit": 0
    },
    "Connections": [
        {
            "ID": 234454,
            "ConnectionTypeID": 25,
            "StatusTypeID": 50,
            "LevelID": 2,
            "Amps": 32,
            "Voltage": 400,
            "PowerKW": 22,
            "CurrentTypeID": 20,
            "Quantity": 2
        }
    ],
    "NumberOfPoints": 2,
    "StatusTypeID": 50,
    "DateLastStatusUpdate": "2020-08-21T07:25:00Z",
    "DataQualityLevel": 1,
    "DateCreated": "2020-08-18T12:49:00Z",
    "SubmissionStatusTypeID": 200
}