{
    "IsRecentlyVerified": false,
    "ID": 57949,
    "UUID": "B892081C-6A44-42F2-B02E-9A29350420C8",
    "DataProviderID": 1,
    "OperatorID": 234,
    "UsageTypeID": 4,
    "UsageCost": "0",
    "AddressInfo": {
        "ID": 58295,
        "Title": "Sparkasse Stein",
        "AddressLine1": "Deutenbacher Straße 2",
        "Town": "Stein",
        "Postcode": "90547",
        "CountryID": 87,
        "Latitude": 49.41287,
        "Longitude": 11.01366,
        "AccessComments": "Rund um die Uhr (24/7) nutzbar.\r\nKein ausgewiesener Parkplatz für Elektrofahrzeuge, unter Umständen längeres Kabel notwendig\r\n",
        "DistanceUnit": 0
    },
    "Connections": [
        {
            "ID": 73679,
            "ConnectionTypeID": 28,
            "StatusTypeID": 50,
            "LevelID": 2,
            "Amps": 16,
            "Voltage": 230,
            "PowerKW": 3.7,
            "CurrentTypeID": 10,
            "Quantity": 2
        },
        {
            "ID": 73680,
            "ConnectionTypeID": 25,
            "StatusTypeID": 50,
            "LevelID": 2,
            "Amps": 32,
            "Voltage": 400,
            "PowerKW": 22,
            "CurrentTypeID": 20,
            "Quantity": 2
        }
    ],
    "NumberOfPoints": 4,
    "StatusTypeID": 50,
    "DateLastStatusUpdate": "2016-09-20T07:34:00Z",
    "DataQualityLevel": 1,
    "DateCreated": "2015-12-29T13:32:00Z",
    "SubmissionStatusTypeID": 200
}