{
    "IsRecentlyVerified": false,
    "ID": 182007,
    "UUID": "03164D10-0671-41C0-9F87-017B03010A6B",
    "DataProviderID": 29,
    "DataProvidersReference": "6456",
    "OperatorID": 3403,
    "AddressInfo": {
        "ID": 182366,
        "Title": "Kaiser-Karl-V-Allee bei 48",
        "AddressLine1": "Kaiser-Karl-V-Allee bei 48",
        "Town": "Bad Abbach",
        "Postcode": "93077",
        "CountryID": 87,
        "Latitude": 48.931553,
        "Longitude": 12.03483,
        "DistanceUnit": 0
    },
    "Connections": [
        {
            "ID": 287184,
            "ConnectionTypeID": 25,
            "StatusTypeID": 50,
            "LevelID": 2,
            "PowerKW": 11,
            "CurrentTypeID": 20
        },
        {
            "ID": 287185,
            "ConnectionTypeID": 25,
            "StatusTypeID": 50,
            "LevelID": 2,
            "PowerKW": 22,
            "CurrentTypeID": 20
        }
    ],
    "StatusTypeID": 50,
    "DateLastStatusUpdate": "2021-07-12T02:42:00Z",
    "MetadataValues": [
        {
            "ID": 14301,
            "MetadataFieldID": 4,
            "ItemValue": "Data from the German chargepoint registry provided by Bundesnetzagentur.de under the CC-BY 4.0 license"
        }
    ],
    "DataQualityLevel": 3,
    "DateCreated": "2021-07-08T10:02:00Z",
    "SubmissionStatusTypeID": 100
}