{
    "IsRecentlyVerified": false,
    "ID": 39157,
    "UUID": "2D04ED7A-BC72-4E60-BB43-A327910063EA",
    "DataProviderID": 1,
    "OperatorID": 220,
    "OperatorsReference": "2445,2445,2444",
    "UsageTypeID": 1,
    "UsageCost": "€1.73 + €0.3213/kWh; Andere Tarife möglich",
    "AddressInfo": {
        "ID": 39503,
        "Title": "Sand 13",
        "AddressLine1": "Sand 13",
        "Town": "Hamburg",
        "Postcode": "21073",
        "CountryID": 87,
        "Latitude": 53.46141,
        "Longitude": 9.98079,
        "AccessComments": "1 kostenloser 24/7 verfügbarer Ladeplatz in Parkbucht .",
        "DistanceUnit": 0
    },
    "Connections": [
        {
            "ID": 42668,
            "ConnectionTypeID": 25,
            "StatusTypeID": 50,
            "LevelID": 2,
            "Amps": 32,
            "Voltage": 400,
            "PowerKW": 11,
            "CurrentTypeID": 20,
            "Quantity": 1
        },
        {
            "ID": 49880,
            "ConnectionTypeID": 25,
            "StatusTypeID": 50,
            "LevelID": 2,
            "Amps": 32,
            "Voltage": 400,
            "PowerKW": 22,
            "CurrentTypeID": 20,
            "Quantity": 1
        },
        {
            "ID": 49881,
            "ConnectionTypeID": 28,
            "StatusTypeID": 50,
            "LevelID": 2,
            "Amps": 16,
            "Voltage": 230,
            "PowerKW": 3.7,
            "CurrentTypeID": 10,
            "Quantity": 2
        }
    ],
    "NumberOfPoints": 2,
    "StatusTypeID": 50,
    "DateLastStatusUpdate": "2017-06-10T05:44:00Z",
    "DataQualityLevel": 3,
    "DateCreated": "2015-01-09T06:08:00Z",
    "SubmissionStatusTypeID": 200
}