{
    "IsRecentlyVerified": false,
    "ID": 81359,
    "UUID": "FCA5C9AE-54E6-4533-AF08-F7F68A96FC8A",
    "DataProviderID": 1,
    "OperatorID": 23,
    "OperatorsReference": "10277",
    "UsageTypeID": 4,
    "UsageCost": "Free",
    "AddressInfo": {
        "ID": 81705,
        "Title": "Sebonack Golf Club",
        "AddressLine1": "405 Sebonac RD",
        "Town": "Southampton",
        "StateOrProvince": "NY",
        "Postcode": "11968",
        "CountryID": 2,
        "Latitude": 40.910893,
        "Longitude": -72.455539,
        "ContactTelephone1": "(631) 287-4444",
        "DistanceUnit": 0
    },
    "Connections": [
        {
            "ID": 116075,
            "ConnectionTypeID": 30,
            "StatusTypeID": 50,
            "LevelID": 2,
            "PowerKW": 16,
            "CurrentTypeID": 20,
            "Quantity": 2
        }
    ],
    "NumberOfPoints": 2,
    "GeneralComments": "2 Tesla Connectors, up to 16kW.Available for members only. Please see front desk.",
    "StatusTypeID": 50,
    "DateLastStatusUpdate": "2017-02-01T09:37:00Z",
    "DataQualityLevel": 1,
    "DateCreated": "2017-02-01T09:37:00Z",
    "SubmissionStatusTypeID": 200
}