{
    "IsRecentlyVerified": false,
    "ID": 187792,
    "UUID": "B97BCCC0-0E3F-490F-9945-692B41D7E4C3",
    "DataProviderID": 18,
    "DataProvidersReference": "a5a4fd638ea093d7b3898ea244d90245",
    "OperatorID": 150,
    "UsageTypeID": 5,
    "AddressInfo": {
        "ID": 188151,
        "Title": "Laindon",
        "AddressLine1": "Laindon",
        "Town": "Basildon",
        "Postcode": "SS15 6EE",
        "CountryID": 1,
        "Latitude": 51.580412,
        "Longitude": 0.406863,
        "AccessComments": "",
        "RelatedURL": "http://www.chargepointservices.com/",
        "DistanceUnit": 0
    },
    "Connections": [
        {
            "ID": 303048,
            "ConnectionTypeID": 25,
            "Reference": "1",
            "StatusTypeID": 50,
            "LevelID": 2,
            "Amps": 32,
            "Voltage": 230,
            "PowerKW": 7,
            "CurrentTypeID": 10
        }
    ],
    "StatusTypeID": 0,
    "DateLastStatusUpdate": "2021-07-12T03:39:00Z",
    "MetadataValues": [
        {
            "ID": 20032,
            "MetadataFieldID": 4,
            "ItemValue": "Contains public sector information licensed under the Open Government Licence v2.0. http://www.nationalarchives.gov.uk/doc/open-government-licence/version/2/"
        }
    ],
    "DataQualityLevel": 3,
    "DateCreated": "2021-07-12T03:39:00Z",
    "SubmissionStatusTypeID": 100
}