{
    "IsRecentlyVerified": false,
    "ID": 52183,
    "UUID": "E2ECE18F-6E33-4BE8-ACA7-555C12157AF4",
    "DataProviderID": 1,
    "OperatorID": 45,
    "OperatorsReference": "36687,36687",
    "UsageTypeID": 6,
    "UsageCost": "0",
    "AddressInfo": {
        "ID": 52529,
        "Title": "Strandhotel Ostseeblick",
        "AddressLine1": "Kulmstraße 28",
        "Town": "Heringsdorf",
        "Postcode": "17424",
        "CountryID": 87,
        "Latitude": 53.957927,
        "Longitude": 14.1655481079346,
        "ContactTelephone1": "+49 38378 540",
        "RelatedURL": "http://www.strandhotel-ostseeblick.de/",
        "DistanceUnit": 0
    },
    "Connections": [
        {
            "ID": 64772,
            "ConnectionTypeID": 25,
            "StatusTypeID": 50,
            "LevelID": 2,
            "Amps": 32,
            "Voltage": 400,
            "PowerKW": 22,
            "CurrentTypeID": 20,
            "Quantity": 1
        }
    ],
    "NumberOfPoints": 2,
    "GeneralComments": "Kostenloses Laden nach Anmeldung an der Rezeption.",
    "StatusTypeID": 50,
    "DateLastStatusUpdate": "2017-10-20T05:37:00Z",
    "DataQualityLevel": 1,
    "DateCreated": "2015-08-23T09:22:00Z",
    "SubmissionStatusTypeID": 200
}