{
    "IsRecentlyVerified": false,
    "ID": 182555,
    "UUID": "25C6D657-C75A-46C5-9096-F0B40FACD8FC",
    "DataProviderID": 29,
    "DataProvidersReference": "16142",
    "OperatorID": 69,
    "AddressInfo": {
        "ID": 182914,
        "Title": "Kirchstraße 25",
        "AddressLine1": "Kirchstraße 25",
        "Town": "Kernen",
        "Postcode": "71394",
        "CountryID": 87,
        "Latitude": 48.7904961610934,
        "Longitude": 9.34238328680166,
        "DistanceUnit": 0
    },
    "Connections": [
        {
            "ID": 288453,
            "ConnectionTypeID": 25,
            "StatusTypeID": 50,
            "LevelID": 2,
            "PowerKW": 22,
            "CurrentTypeID": 20
        },
        {
            "ID": 288454,
            "ConnectionTypeID": 25,
            "StatusTypeID": 50,
            "LevelID": 2,
            "PowerKW": 22,
            "CurrentTypeID": 20
        }
    ],
    "StatusTypeID": 50,
    "DateLastStatusUpdate": "2021-07-12T02:41:00Z",
    "MetadataValues": [
        {
            "ID": 14848,
            "MetadataFieldID": 4,
            "ItemValue": "Data from the German chargepoint registry provided by Bundesnetzagentur.de under the CC-BY 4.0 license"
        }
    ],
    "DataQualityLevel": 3,
    "DateCreated": "2021-07-08T10:03:00Z",
    "SubmissionStatusTypeID": 100
}