{
    "IsRecentlyVerified": false,
    "ID": 24617,
    "UUID": "3C43E02A-CE9F-4929-8CCA-C96A8E09A2D1",
    "DataProviderID": 1,
    "OperatorID": 63,
    "UsageTypeID": 4,
    "UsageCost": "",
    "AddressInfo": {
        "ID": 24963,
        "Title": "Tesla Supercharger Van der Valk Drachten",
        "AddressLine1": "Lavendelheide 4",
        "AddressLine2": "Drachten",
        "Town": "Smallingerland",
        "StateOrProvince": "Friesland",
        "Postcode": "9202PC",
        "CountryID": 159,
        "Latitude": 53.1057936,
        "Longitude": 6.127916599999935,
        "ContactTelephone1": "+31 512 520 705",
        "ContactTelephone2": "",
        "ContactEmail": "drachten@valk.com",
        "AccessComments": "",
        "RelatedURL": "http://www.hoteldrachten.nl/",
        "DistanceUnit": 0
    },
    "Connections": [
        {
            "ID": 26899,
            "ConnectionTypeID": 25,
            "StatusTypeID": 0,
            "LevelID": 2,
            "PowerKW": 22,
            "CurrentTypeID": 20
        },
        {
            "ID": 102873,
            "ConnectionTypeID": 27,
            "StatusTypeID": 50,
            "LevelID": 3,
            "Amps": 300,
            "Voltage": 400,
            "PowerKW": 115,
            "CurrentTypeID": 30,
            "Quantity": 8
        }
    ],
    "NumberOfPoints": 1,
    "GeneralComments": "",
    "StatusTypeID": 50,
    "DateLastStatusUpdate": "2016-09-14T07:25:00Z",
    "DataQualityLevel": 1,
    "DateCreated": "2014-10-24T13:04:00Z",
    "SubmissionStatusTypeID": 200
}