{
    "IsRecentlyVerified": false,
    "ID": 47355,
    "UUID": "BCB081C1-BE8A-4B5D-BFC8-07861F80686C",
    "DataProviderID": 1,
    "OperatorID": 1,
    "UsageTypeID": 1,
    "UsageCost": "",
    "AddressInfo": {
        "ID": 47701,
        "Title": "City of Americus - Visitor Center",
        "AddressLine1": "101 W Lamar St",
        "AddressLine2": "",
        "Town": "Americus",
        "StateOrProvince": "GA",
        "Postcode": "31709",
        "CountryID": 2,
        "Latitude": 32.0725018,
        "Longitude": -84.2329402,
        "ContactTelephone1": " 229-928-6059",
        "ContactTelephone2": "",
        "ContactEmail": "",
        "AccessComments": "24 hours daily",
        "RelatedURL": "",
        "DistanceUnit": 0
    },
    "Connections": [
        {
            "ID": 58392,
            "ConnectionTypeID": 1,
            "StatusTypeID": 0,
            "LevelID": 2,
            "Amps": 16,
            "Voltage": 230,
            "PowerKW": 3,
            "CurrentTypeID": 10,
            "Quantity": 1
        },
        {
            "ID": 101140,
            "ConnectionTypeID": 24,
            "StatusTypeID": 0
        }
    ],
    "GeneralComments": "",
    "StatusTypeID": 50,
    "DateLastStatusUpdate": "2016-07-31T19:48:00Z",
    "DataQualityLevel": 3,
    "DateCreated": "2015-05-27T08:50:00Z",
    "SubmissionStatusTypeID": 100
}