{
    "IsRecentlyVerified": false,
    "ID": 152636,
    "UUID": "3ED06372-86F6-44FD-A580-5FFEF179FBAB",
    "DataProviderID": 28,
    "DataProvidersReference": "FR*S49*P49149*001",
    "UsageTypeID": 5,
    "AddressInfo": {
        "ID": 152989,
        "Title": "GENNES - Place Du 19 Mars",
        "AddressLine1": "Place Du 19 Mars 49350 GENNES",
        "CountryID": 80,
        "Latitude": 47.341862,
        "Longitude": -0.231524,
        "AccessComments": "24h/24 7j/7",
        "DistanceUnit": 0
    },
    "Connections": [
        {
            "ID": 213759,
            "ConnectionTypeID": 25,
            "StatusTypeID": 50,
            "LevelID": 2,
            "PowerKW": 18,
            "CurrentTypeID": 20
        },
        {
            "ID": 213760,
            "ConnectionTypeID": 28,
            "StatusTypeID": 50,
            "LevelID": 2,
            "PowerKW": 18,
            "CurrentTypeID": 10
        },
        {
            "ID": 246896,
            "ConnectionTypeID": 25,
            "StatusTypeID": 50,
            "LevelID": 2,
            "PowerKW": 18,
            "CurrentTypeID": 20
        },
        {
            "ID": 246897,
            "ConnectionTypeID": 28,
            "StatusTypeID": 50,
            "LevelID": 2,
            "PowerKW": 18,
            "CurrentTypeID": 10
        }
    ],
    "GeneralComments": "Recharge par badge et avec une application smartphone",
    "StatusTypeID": 50,
    "DateLastStatusUpdate": "2020-08-27T05:13:00Z",
    "DataQualityLevel": 2,
    "DateCreated": "2020-03-15T10:54:00Z",
    "SubmissionStatusTypeID": 100
}