{
    "IsRecentlyVerified": false,
    "ID": 127212,
    "UUID": "F0ED8A43-7D0B-41AD-983F-D9E8879EB5A3",
    "DataProviderID": 1,
    "OperatorID": 1,
    "UsageTypeID": 1,
    "AddressInfo": {
        "ID": 127558,
        "Title": "MAKRO Gdańsk - RAWICOM",
        "AddressLine1": "Główna 6a",
        "Town": "Wiślina",
        "StateOrProvince": "pomorskie",
        "Postcode": "83-021",
        "CountryID": 179,
        "Latitude": 54.3373969167687,
        "Longitude": 18.7352771518401,
        "DistanceUnit": 0
    },
    "Connections": [
        {
            "ID": 178128,
            "ConnectionTypeID": 2,
            "StatusTypeID": 50,
            "LevelID": 3,
            "PowerKW": 50,
            "CurrentTypeID": 30,
            "Quantity": 1
        }
    ],
    "NumberOfPoints": 2,
    "GeneralComments": "Unusual Efacec QC45 with Chademo only.",
    "StatusTypeID": 50,
    "DateLastStatusUpdate": "2019-05-30T12:13:00Z",
    "DataQualityLevel": 1,
    "DateCreated": "2019-05-30T10:50:00Z",
    "SubmissionStatusTypeID": 200
}