{
    "IsRecentlyVerified": false,
    "ID": 117887,
    "UUID": "F4E0A8AB-D9B3-472F-BEB1-2B9EA3ACE546",
    "DataProviderID": 1,
    "OperatorID": 32,
    "OperatorsReference": "22013",
    "UsageTypeID": 4,
    "UsageCost": "£0.108/kWh; for Polar Plus subscription members only",
    "AddressInfo": {
        "ID": 118233,
        "Title": "Xscape",
        "AddressLine1": "Xscape",
        "Town": "Avebury Boulevard",
        "StateOrProvince": "Milton Keynes",
        "Postcode": "MK9 3XS",
        "CountryID": 1,
        "Latitude": 52.041348,
        "Longitude": -0.751173,
        "DistanceUnit": 0
    },
    "Connections": [
        {
            "ID": 166836,
            "ConnectionTypeID": 2,
            "StatusTypeID": 50,
            "LevelID": 3,
            "PowerKW": 50,
            "CurrentTypeID": 30,
            "Quantity": 1
        },
        {
            "ID": 166837,
            "ConnectionTypeID": 33,
            "StatusTypeID": 50,
            "LevelID": 3,
            "PowerKW": 50,
            "CurrentTypeID": 30,
            "Quantity": 1
        },
        {
            "ID": 166838,
            "ConnectionTypeID": 1036,
            "StatusTypeID": 50,
            "LevelID": 3,
            "PowerKW": 43,
            "CurrentTypeID": 20,
            "Quantity": 1
        }
    ],
    "NumberOfPoints": 2,
    "GeneralComments": "Adjacent to Tesco Express",
    "StatusTypeID": 50,
    "DateLastStatusUpdate": "2019-06-20T05:13:00Z",
    "DataQualityLevel": 1,
    "DateCreated": "2019-03-08T06:22:00Z",
    "SubmissionStatusTypeID": 200
}