{
    "IsRecentlyVerified": false,
    "ID": 137709,
    "UUID": "714913E8-0178-4661-9903-C8088303D193",
    "DataProviderID": 2,
    "DataProvidersReference": "148873",
    "OperatorID": 39,
    "UsageTypeID": 1,
    "AddressInfo": {
        "ID": 138057,
        "Title": "Manchester Financial Fifth Ave",
        "AddressLine1": "2550 Fifth Ave\n#900",
        "Town": "San Diego",
        "StateOrProvince": "CA",
        "Postcode": "92103",
        "CountryID": 2,
        "Latitude": 32.7319608,
        "Longitude": -117.1606582,
        "ContactTelephone1": "800-663-5633",
        "AccessComments": "MO: 06:00am-05:00pm; TU: 06:00am-05:00pm; WE: 06:00am-05:00pm; TH: 06:00am-05:00pm; FR: 06:00am-05:00pm; SA: 08:00am-02:00pm; SU: Closed",
        "RelatedURL": "http://www.semacharge.com/",
        "DistanceUnit": 0
    },
    "Connections": [
        {
            "ID": 192682,
            "ConnectionTypeID": 1,
            "LevelID": 2,
            "Amps": 16,
            "Voltage": 230,
            "PowerKW": 3,
            "CurrentTypeID": 10,
            "Quantity": 2
        }
    ],
    "StatusTypeID": 50,
    "DateLastStatusUpdate": "2019-12-24T09:06:00Z",
    "DataQualityLevel": 3,
    "DateCreated": "2019-12-24T09:06:00Z",
    "SubmissionStatusTypeID": 100
}