{
    "MediaItems": [
        {
            "ID": 29058,
            "ChargePointID": 188812,
            "ItemURL": "https://s3-ap-southeast-2.amazonaws.com/openchargemap/images/IT/OCM188812/OCM-188812.orig.2021082018445445.jpg",
            "ItemThumbnailURL": "https://s3-ap-southeast-2.amazonaws.com/openchargemap/images/IT/OCM188812/OCM-188812.thmb.2021082018445445.jpg",
            "Comment": "",
            "IsEnabled": true,
            "IsVideo": false,
            "IsFeaturedItem": false,
            "IsExternalResource": false,
            "User": {
                "ID": 27477,
                "Username": "AndreaL77"
            },
            "DateCreated": "2021-08-20T18:45:00Z"
        },
        {
            "ID": 29059,
            "ChargePointID": 188812,
            "ItemURL": "https://s3-ap-southeast-2.amazonaws.com/openchargemap/images/IT/OCM188812/OCM-188812.orig.2021082018451349.jpg",
            "ItemThumbnailURL": "https://s3-ap-southeast-2.amazonaws.com/openchargemap/images/IT/OCM188812/OCM-188812.thmb.2021082018451349.jpg",
            "Comment": "",
            "IsEnabled": true,
            "IsVideo": false,
            "IsFeaturedItem": false,
            "IsExternalResource": false,
            "User": {
                "ID": 27477,
                "Username": "AndreaL77"
            },
            "DateCreated": "2021-08-20T18:45:00Z"
        }
    ],
    "IsRecentlyVerified": true,
    "DateLastVerified": "2021-08-18T16:34:00Z",
    "ID": 188812,
    "UUID": "9FDB2193-6DFA-406E-A8EE-2DDC97AE3627",
    "DataProviderID": 1,
    "OperatorID": 3382,
    "UsageTypeID": 4,
    "AddressInfo": {
        "ID": 189171,
        "Title": "enelx fast Corso Vercelli",
        "AddressLine1": "Corso Vercelli",
        "Town": "Borgosesia",
        "StateOrProvince": "Piemont",
        "Postcode": "13011",
        "CountryID": 112,
        "Latitude": 45.71360813167101,
        "Longitude": 8.277355355540635,
        "DistanceUnit": 0
    },
    "Connections": [
        {
            "ID": 305064,
            "ConnectionTypeID": 33,
            "StatusTypeID": 50,
            "LevelID": 3,
            "PowerKW": 50,
            "CurrentTypeID": 30,
            "Quantity": 1
        },
        {
            "ID": 305065,
            "ConnectionTypeID": 2,
            "StatusTypeID": 50,
            "LevelID": 2,
            "PowerKW": 50,
            "Quantity": 1
        },
        {
            "ID": 305066,
            "ConnectionTypeID": 1036,
            "StatusTypeID": 50,
            "LevelID": 2,
            "PowerKW": 43,
            "Quantity": 1
        }
    ],
    "NumberOfPoints": 2,
    "StatusTypeID": 50,
    "DateLastStatusUpdate": "2021-08-20T18:45:00Z",
    "DataQualityLevel": 1,
    "DateCreated": "2021-08-18T16:34:00Z",
    "SubmissionStatusTypeID": 200
}