{
    "IsRecentlyVerified": false,
    "ID": 115901,
    "UUID": "4D721A43-8219-4F19-AC79-10E48FC29691",
    "DataProviderID": 2,
    "DataProvidersReference": "115442",
    "OperatorID": 23,
    "UsageTypeID": 1,
    "AddressInfo": {
        "ID": 116247,
        "Title": "Microtel Inn & Suites by Wyndham Clarion - Tesla Destination",
        "AddressLine1": "121 N Point Dr",
        "Town": "Clarion",
        "StateOrProvince": "PA",
        "Postcode": "16214",
        "CountryID": 2,
        "Latitude": 41.180584,
        "Longitude": -79.393409,
        "ContactTelephone1": "814-227-2223  877-798-3752",
        "AccessComments": "24 hours daily; for customer use only; see front desk for access",
        "RelatedURL": "https://www.tesla.com/destination-charging",
        "DistanceUnit": 0
    },
    "Connections": [
        {
            "ID": 162945,
            "ConnectionTypeID": 30,
            "LevelID": 2,
            "Amps": 16,
            "Voltage": 230,
            "PowerKW": 3.7,
            "CurrentTypeID": 10,
            "Quantity": 2
        }
    ],
    "DateLastStatusUpdate": "2020-06-26T03:04:00Z",
    "DataQualityLevel": 3,
    "DateCreated": "2019-02-11T07:13:00Z",
    "SubmissionStatusTypeID": 100
}