{
    "IsRecentlyVerified": false,
    "ID": 174811,
    "UUID": "78F1D1A5-2ACF-489A-8757-E33F6E8D3EC4",
    "DataProviderID": 1,
    "OperatorID": 21,
    "UsageTypeID": 4,
    "UsageCost": "Mobi.E compatible card or App",
    "AddressInfo": {
        "ID": 175170,
        "Title": "OHP-00002",
        "AddressLine1": "Rua Doutor António Garcia Ribeiro Vasconcelos",
        "Town": "Oliveira do Hospital",
        "StateOrProvince": "Coimbra",
        "Postcode": "3400",
        "CountryID": 180,
        "Latitude": 40.359247231245746,
        "Longitude": -7.861343253217683,
        "DistanceUnit": 0
    },
    "Connections": [
        {
            "ID": 270877,
            "ConnectionTypeID": 25,
            "StatusTypeID": 50,
            "LevelID": 2,
            "Amps": 32,
            "Voltage": 400,
            "PowerKW": 22,
            "CurrentTypeID": 20,
            "Quantity": 2
        }
    ],
    "NumberOfPoints": 2,
    "StatusTypeID": 50,
    "DateLastStatusUpdate": "2021-04-13T20:32:00Z",
    "DataQualityLevel": 1,
    "DateCreated": "2021-04-13T20:32:00Z",
    "SubmissionStatusTypeID": 200
}