{
    "IsRecentlyVerified": false,
    "ID": 90650,
    "UUID": "F403161B-35A1-4E95-A92C-8EF46AD8F1B0",
    "DataProviderID": 1,
    "OperatorID": 224,
    "UsageTypeID": 5,
    "UsageCost": "€ 1,00 + € 0,50/h + € 0,28/kWh",
    "AddressInfo": {
        "ID": 90996,
        "Title": "Bahnhof",
        "AddressLine1": "Karl-Bautz-Straße 2/1",
        "Town": "Emmendingen",
        "StateOrProvince": "VVG der Stadt Emmendingen",
        "Postcode": "79312",
        "CountryID": 87,
        "Latitude": 48.11916079330196,
        "Longitude": 7.8473555023773445,
        "AccessComments": "24/7 nutzbare Ladesäule vor dem großen Graffiti am Bahnhof, kann mit jeder NFC - Scheck oder Kreditkarte freigeschaltet werden (PayPass oder PayWave).",
        "RelatedURL": "http://www.energiedienst.de/unsere-angebote/elektromobilitaet/ladestationen",
        "DistanceUnit": 0
    },
    "Connections": [
        {
            "ID": 128360,
            "ConnectionTypeID": 25,
            "StatusTypeID": 50,
            "LevelID": 2,
            "Amps": 32,
            "Voltage": 400,
            "PowerKW": 22,
            "CurrentTypeID": 20,
            "Quantity": 2
        }
    ],
    "NumberOfPoints": 2,
    "StatusTypeID": 50,
    "DateLastStatusUpdate": "2017-07-21T08:12:00Z",
    "DataQualityLevel": 1,
    "DateCreated": "2017-07-21T08:12:00Z",
    "SubmissionStatusTypeID": 200
}