{
    "IsRecentlyVerified": false,
    "ID": 99794,
    "UUID": "41236B5E-622A-42EA-898E-85A92967E540",
    "DataProviderID": 1,
    "OperatorID": 45,
    "UsageTypeID": 1,
    "AddressInfo": {
        "ID": 100140,
        "Title": "Elektrofachmarkt Expert",
        "AddressLine1": "Sieghütter Hauptweg 11",
        "Town": "Siegen",
        "StateOrProvince": "Kreis Siegen-Wittgenstein",
        "Postcode": "57072",
        "CountryID": 87,
        "Latitude": 50.88159899999999,
        "Longitude": 8.027102900000045,
        "AccessComments": "Kostenlos nutzbar (mindestens) während der Öffnungszeiten.",
        "DistanceUnit": 0
    },
    "Connections": [
        {
            "ID": 140998,
            "ConnectionTypeID": 25,
            "StatusTypeID": 50,
            "LevelID": 2,
            "Amps": 16,
            "Voltage": 400,
            "PowerKW": 11,
            "CurrentTypeID": 20,
            "Quantity": 1
        }
    ],
    "NumberOfPoints": 1,
    "StatusTypeID": 50,
    "DateLastStatusUpdate": "2018-02-05T15:11:00Z",
    "DataQualityLevel": 1,
    "DateCreated": "2018-02-05T15:11:00Z",
    "SubmissionStatusTypeID": 200
}