{
    "IsRecentlyVerified": false,
    "ID": 144656,
    "UUID": "8D52E381-B710-46E1-AAD5-59F08B681B63",
    "DataProviderID": 2,
    "DataProvidersReference": "130730",
    "OperatorID": 90,
    "UsageTypeID": 1,
    "AddressInfo": {
        "ID": 145008,
        "Title": "2923 St-Zotique",
        "AddressLine1": "2923A St-Zotique",
        "Town": "Montréal",
        "StateOrProvince": "QC",
        "Postcode": "H1Y 1E4",
        "CountryID": 44,
        "Latitude": 45.553515,
        "Longitude": -73.592311,
        "ContactTelephone1": "877-505-2674",
        "AccessComments": "24 hours daily",
        "RelatedURL": "https://lecircuitelectrique.com/",
        "DistanceUnit": 0
    },
    "Connections": [
        {
            "ID": 201170,
            "ConnectionTypeID": 1,
            "LevelID": 2,
            "Amps": 16,
            "Voltage": 230,
            "PowerKW": 3.7,
            "CurrentTypeID": 10,
            "Quantity": 2
        }
    ],
    "StatusTypeID": 50,
    "DateLastStatusUpdate": "2020-06-26T03:09:00Z",
    "DataQualityLevel": 3,
    "DateCreated": "2019-12-24T09:23:00Z",
    "SubmissionStatusTypeID": 100
}