{
    "IsRecentlyVerified": false,
    "ID": 122567,
    "UUID": "A82DAFA3-A60F-48D3-87BB-81EF6114C48D",
    "DataProviderID": 2,
    "DataProvidersReference": "94740",
    "OperatorID": 3372,
    "UsageTypeID": 1,
    "AddressInfo": {
        "ID": 122913,
        "Title": "Los Angeles Metro - Canoga Station",
        "AddressLine1": "6650 Canoga Ave",
        "Town": "Canoga Park",
        "StateOrProvince": "CA",
        "Postcode": "91303",
        "CountryID": 2,
        "Latitude": 34.191637,
        "Longitude": -118.597035,
        "ContactTelephone1": "213-922-4638",
        "AccessComments": "24 hours daily; pay lot; must have EV Connect account to access, see www.metro.net/projects/ev/ for more information",
        "RelatedURL": "http://evconnect.com/",
        "DistanceUnit": 0
    },
    "Connections": [
        {
            "ID": 172465,
            "ConnectionTypeID": 1,
            "LevelID": 2,
            "Amps": 16,
            "Voltage": 230,
            "PowerKW": 3.7,
            "CurrentTypeID": 10,
            "Quantity": 3
        }
    ],
    "DateLastStatusUpdate": "2020-06-26T02:57:00Z",
    "DataQualityLevel": 3,
    "DateCreated": "2019-04-06T05:03:00Z",
    "SubmissionStatusTypeID": 100
}