{
    "IsRecentlyVerified": false,
    "ID": 53626,
    "UUID": "B8B6A723-0FAB-4EF4-BA01-754DABBDF1D8",
    "DataProviderID": 1,
    "OperatorID": 105,
    "OperatorsReference": "Essent EM-DE-06438001-01-00001",
    "UsageTypeID": 4,
    "UsageCost": "0",
    "AddressInfo": {
        "ID": 53972,
        "Title": "Rathausparkplatz",
        "AddressLine1": "OffenbacherStr 11",
        "Town": "Dietzenbach",
        "Postcode": "63128",
        "CountryID": 87,
        "Latitude": 50.019377,
        "Longitude": 8.781886,
        "RelatedURL": "http://www.essent.nl",
        "DistanceUnit": 0
    },
    "Connections": [
        {
            "ID": 66807,
            "ConnectionTypeID": 25,
            "StatusTypeID": 50,
            "LevelID": 2,
            "PowerKW": 11,
            "CurrentTypeID": 20,
            "Quantity": 1
        },
        {
            "ID": 66808,
            "ConnectionTypeID": 25,
            "StatusTypeID": 50,
            "LevelID": 2,
            "PowerKW": 11,
            "CurrentTypeID": 20,
            "Quantity": 1
        }
    ],
    "NumberOfPoints": 2,
    "StatusTypeID": 50,
    "DateLastStatusUpdate": "2015-09-30T12:45:00Z",
    "DataQualityLevel": 3,
    "DateCreated": "2015-09-20T11:50:00Z",
    "SubmissionStatusTypeID": 200
}