{
    "UserComments": [
        {
            "ID": 21494,
            "ChargePointID": 77431,
            "CommentTypeID": 10,
            "UserName": "cptobvious",
            "Comment": "Badly advertised, but free charging if parking in the parking lot (€2/hr). Great for taking the boat for an excursion.",
            "Rating": 5,
            "DateCreated": "2019-09-10T16:00:27.407Z",
            "User": {
                "ID": 22213,
                "Username": "cptobvious"
            },
            "CheckinStatusTypeID": 10
        }
    ],
    "MediaItems": [
        {
            "ID": 19540,
            "ChargePointID": 77431,
            "ItemURL": "https://s3-ap-southeast-2.amazonaws.com/openchargemap/images/IT/OCM77431/OCM-77431.orig.2019091015544703.png",
            "ItemThumbnailURL": "https://s3-ap-southeast-2.amazonaws.com/openchargemap/images/IT/OCM77431/OCM-77431.thmb.2019091015544703.png",
            "Comment": "Charging a Tesla Model 3.",
            "IsEnabled": true,
            "IsVideo": false,
            "IsFeaturedItem": false,
            "IsExternalResource": false,
            "User": {
                "ID": 22213,
                "Username": "cptobvious"
            },
            "DateCreated": "2019-09-10T15:55:00Z"
        },
        {
            "ID": 9187,
            "ChargePointID": 77431,
            "ItemURL": "https://s3-ap-southeast-2.amazonaws.com/openchargemap/images/IT/OCM77431/OCM-77431.orig.2017011523194020.jpg",
            "ItemThumbnailURL": "https://s3-ap-southeast-2.amazonaws.com/openchargemap/images/IT/OCM77431/OCM-77431.thmb.2017011523194020.jpg",
            "Comment": "",
            "IsEnabled": true,
            "IsVideo": false,
            "IsFeaturedItem": false,
            "IsExternalResource": false,
            "User": {
                "ID": 12207,
                "Username": "aldodal"
            },
            "DateCreated": "2017-01-15T23:20:00Z"
        }
    ],
    "IsRecentlyVerified": false,
    "ID": 77431,
    "UUID": "592E9F55-58BA-450F-BCB9-FA4E9741D44F",
    "DataProviderID": 1,
    "OperatorID": 1,
    "UsageTypeID": 6,
    "AddressInfo": {
        "ID": 77777,
        "Title": "Salerno energia",
        "AddressLine1": "Piazza della concordia",
        "Town": "Salerno",
        "StateOrProvince": "SA",
        "Postcode": "84123",
        "CountryID": 112,
        "Latitude": 40.6738917,
        "Longitude": 14.7691548,
        "DistanceUnit": 0
    },
    "Connections": [
        {
            "ID": 111572,
            "ConnectionTypeID": 25,
            "StatusTypeID": 50,
            "LevelID": 2,
            "Amps": 32,
            "Voltage": 230,
            "PowerKW": 11,
            "CurrentTypeID": 10,
            "Quantity": 1
        }
    ],
    "NumberOfPoints": 1,
    "StatusTypeID": 50,
    "DateLastStatusUpdate": "2019-09-11T12:54:00Z",
    "DataQualityLevel": 1,
    "DateCreated": "2017-01-15T23:19:00Z",
    "SubmissionStatusTypeID": 200
}