{
    "IsRecentlyVerified": false,
    "ID": 96333,
    "UUID": "2140F68B-8FF2-4675-9ABE-17CA9E226DB2",
    "DataProviderID": 1,
    "OperatorID": 156,
    "UsageTypeID": 4,
    "AddressInfo": {
        "ID": 96679,
        "Title": "Neanderbad",
        "AddressLine1": "Hochdahler Straße 145",
        "Town": "Erkrath",
        "StateOrProvince": "Kreis Mettmann",
        "Postcode": "40699",
        "CountryID": 87,
        "Latitude": 51.22117,
        "Longitude": 6.932909999999993,
        "AccessComments": "24/7 nutzbar",
        "RelatedURL": "http://www.stadtwerke-erkrath.de/",
        "DistanceUnit": 0
    },
    "Connections": [
        {
            "ID": 136485,
            "ConnectionTypeID": 25,
            "StatusTypeID": 50,
            "LevelID": 2,
            "Amps": 32,
            "Voltage": 400,
            "PowerKW": 22,
            "CurrentTypeID": 20,
            "Quantity": 2
        }
    ],
    "NumberOfPoints": 2,
    "StatusTypeID": 50,
    "DateLastStatusUpdate": "2017-12-21T08:43:00Z",
    "DataQualityLevel": 1,
    "DateCreated": "2017-12-21T08:43:00Z",
    "SubmissionStatusTypeID": 200
}