{
    "IsRecentlyVerified": false,
    "ID": 61074,
    "UUID": "C040C4D0-11C4-45F5-A305-3A7935C2DC6F",
    "DataProviderID": 27,
    "DataProvidersReference": "319",
    "UsageTypeID": 1,
    "AddressInfo": {
        "ID": 61420,
        "Title": "Circuit de Catalunya",
        "AddressLine1": "Camino Mas Moreneta",
        "Town": "Montmeló",
        "StateOrProvince": "Montmeló",
        "Postcode": "08160",
        "CountryID": 210,
        "Latitude": 41.566026,
        "Longitude": 2.258772,
        "ContactTelephone1": "ND",
        "RelatedURL": "http://www.circuitcat.com",
        "DistanceUnit": 0
    },
    "Connections": [
        {
            "ID": 77629,
            "ConnectionTypeID": 28
        }
    ],
    "GeneralComments": "Pedir tarjeta al encargado",
    "DateLastStatusUpdate": "2016-02-13T00:23:00Z",
    "DataQualityLevel": 3,
    "DateCreated": "2016-02-13T00:23:00Z",
    "SubmissionStatusTypeID": 200
}