{
    "IsRecentlyVerified": false,
    "ID": 97428,
    "UUID": "DDD0DE94-F4B3-4547-AD4E-54E9186BF5EF",
    "DataProviderID": 1,
    "OperatorID": 23,
    "OperatorsReference": "38572",
    "UsageTypeID": 4,
    "AddressInfo": {
        "ID": 97774,
        "Title": "The Grand Ahrenshoop",
        "AddressLine1": "Schifferberg 24",
        "Town": "Ahrenshoop",
        "Postcode": "18347",
        "CountryID": 87,
        "Latitude": 54.384082,
        "Longitude": 12.425815,
        "ContactTelephone1": "+49 3822 06780",
        "DistanceUnit": 0
    },
    "Connections": [
        {
            "ID": 138335,
            "ConnectionTypeID": 30,
            "StatusTypeID": 50,
            "LevelID": 2,
            "Amps": 32,
            "Voltage": 230,
            "PowerKW": 17,
            "CurrentTypeID": 20,
            "Quantity": 2
        }
    ],
    "NumberOfPoints": 2,
    "GeneralComments": "2 Tesla Connectors, up to 17kW.Available for customers. Please see front desk.",
    "StatusTypeID": 50,
    "DateLastStatusUpdate": "2018-10-03T16:04:00Z",
    "DataQualityLevel": 1,
    "DateCreated": "2018-01-21T15:24:00Z",
    "SubmissionStatusTypeID": 200
}