{
    "IsRecentlyVerified": false,
    "ID": 18942,
    "UUID": "DB4B56A0-1048-4770-924E-7AA58EB3F73B",
    "DataProviderID": 15,
    "DataProvidersReference": "21842",
    "OperatorID": 1,
    "UsageTypeID": 1,
    "AddressInfo": {
        "ID": 19287,
        "Title": "Zirmunu Str. 68",
        "AddressLine1": "Zirmunu Str. 68",
        "Town": "Vilnius",
        "StateOrProvince": "0",
        "Postcode": "09108",
        "CountryID": 131,
        "Latitude": 54.714674,
        "Longitude": 25.273178,
        "ContactTelephone1": "+37068611131 ",
        "RelatedURL": "http://carstations.com/21842",
        "DistanceUnit": 0
    },
    "Connections": [
        {
            "ID": 19204,
            "ConnectionTypeID": 1,
            "Reference": "J1772",
            "LevelID": 2
        }
    ],
    "NumberOfPoints": 1,
    "StatusTypeID": 0,
    "DateLastStatusUpdate": "2017-11-04T14:05:00Z",
    "DataQualityLevel": 2,
    "DateCreated": "2013-09-03T03:35:00Z",
    "SubmissionStatusTypeID": 200
}