{
    "IsRecentlyVerified": false,
    "ID": 7729,
    "UUID": "120DA17B-299A-43EC-96BD-EAFD8CCDE20B",
    "DataProviderID": 15,
    "DataProvidersReference": "7411",
    "OperatorID": 26,
    "AddressInfo": {
        "ID": 7626,
        "Title": "3013 Mall Park Dr",
        "AddressLine1": "3013 Mall Park Dr",
        "Town": "Dayton",
        "StateOrProvince": "OH",
        "Postcode": "45459",
        "CountryID": 2,
        "Latitude": 39.6384,
        "Longitude": -84.22068,
        "ContactTelephone1": " (937) 434-4723",
        "RelatedURL": "http://carstations.com/7411",
        "DistanceUnit": 0
    },
    "Connections": [
        {
            "ID": 5161,
            "ConnectionTypeID": 1,
            "Reference": "J1772",
            "LevelID": 2
        }
    ],
    "StatusTypeID": 0,
    "DateLastStatusUpdate": "2017-11-04T14:04:00Z",
    "DataQualityLevel": 1,
    "DateCreated": "2011-11-11T12:05:00Z",
    "SubmissionStatusTypeID": 100
}