{
    "IsRecentlyVerified": false,
    "ID": 159970,
    "UUID": "76315F12-7558-4270-9BAC-862C73327B28",
    "DataProviderID": 2,
    "DataProvidersReference": "158075",
    "UsageTypeID": 2,
    "AddressInfo": {
        "ID": 160327,
        "Title": "Real Canadian Superstore",
        "AddressLine1": "2430 Dougall St",
        "Town": "Windsor",
        "StateOrProvince": "ON",
        "Postcode": "N8X 1T2",
        "CountryID": 44,
        "Latitude": 42.2890479,
        "Longitude": -83.0222068,
        "ContactTelephone1": "",
        "AccessComments": "",
        "RelatedURL": "",
        "DistanceUnit": 0
    },
    "Connections": [
        {
            "ID": 230195,
            "ConnectionTypeID": 2,
            "LevelID": 3,
            "Amps": 100,
            "Voltage": 400,
            "PowerKW": 40,
            "CurrentTypeID": 30,
            "Quantity": 1
        },
        {
            "ID": 230196,
            "ConnectionTypeID": 32,
            "LevelID": 3,
            "Amps": 100,
            "Voltage": 400,
            "PowerKW": 40,
            "CurrentTypeID": 30,
            "Quantity": 1
        }
    ],
    "GeneralComments": "Planned for future date. Not Operational.",
    "DatePlanned": "2020-09-01T00:00:00Z",
    "StatusTypeID": 150,
    "DateLastStatusUpdate": "2020-06-26T03:05:00Z",
    "DataQualityLevel": 3,
    "DateCreated": "2020-06-26T03:05:00Z",
    "SubmissionStatusTypeID": 100
}