{
    "IsRecentlyVerified": false,
    "ID": 99818,
    "UUID": "622FA969-EB18-4B62-8B7B-F7D4B4FC9A32",
    "DataProviderID": 1,
    "OperatorID": 23,
    "OperatorsReference": "40420",
    "UsageTypeID": 4,
    "AddressInfo": {
        "ID": 100164,
        "Title": "Hotel Grifone",
        "AddressLine1": "Via Passo Campolongo",
        "Town": "27",
        "StateOrProvince": "Livinallongo del Coldilana",
        "Postcode": "32020",
        "CountryID": 112,
        "Latitude": 46.510924,
        "Longitude": 11.875351,
        "ContactTelephone1": "+39 0436 780 034",
        "DistanceUnit": 0
    },
    "Connections": [
        {
            "ID": 141035,
            "ConnectionTypeID": 30,
            "StatusTypeID": 50,
            "LevelID": 2,
            "Amps": 32,
            "Voltage": 400,
            "PowerKW": 22,
            "CurrentTypeID": 20,
            "Quantity": 1
        }
    ],
    "NumberOfPoints": 1,
    "GeneralComments": "1 Tesla Connector, up to 22kW.Seasonal Availability Please call ahead.",
    "StatusTypeID": 50,
    "DateLastStatusUpdate": "2018-10-03T23:54:00Z",
    "DataQualityLevel": 1,
    "DateCreated": "2018-02-06T06:40:00Z",
    "SubmissionStatusTypeID": 200
}