{
    "IsRecentlyVerified": false,
    "ID": 62035,
    "UUID": "7D744708-985F-4BAC-B00E-EEBB47C601A5",
    "DataProviderID": 2,
    "DataProvidersReference": "71475",
    "OperatorID": 39,
    "UsageTypeID": 4,
    "AddressInfo": {
        "ID": 62381,
        "Title": "Park Potomac HOA",
        "AddressLine1": "12500 Park Potomac Ave.",
        "Town": "Potomac",
        "StateOrProvince": "MD",
        "Postcode": "20854",
        "CountryID": 2,
        "Latitude": 39.060186278898,
        "Longitude": -77.158701934988,
        "ContactTelephone1": "800-663-5633",
        "AccessComments": "MO: 12:00am-12:00am; TU: 12:00am-12:00am; WE: 12:00am-12:00am; TH: 12:00am-12:00am; FR: 12:00am-12:00am; SA: 12:00am-12:00am; SU: 12:00am-12:00am",
        "RelatedURL": "http://www.semacharge.com/",
        "DistanceUnit": 0
    },
    "Connections": [
        {
            "ID": 78937,
            "ConnectionTypeID": 1,
            "LevelID": 2,
            "Amps": 16,
            "Voltage": 230,
            "PowerKW": 3,
            "CurrentTypeID": 10,
            "Quantity": 2
        }
    ],
    "DateLastStatusUpdate": "2019-04-06T05:04:00Z",
    "DataQualityLevel": 3,
    "DateCreated": "2016-03-03T11:38:00Z",
    "SubmissionStatusTypeID": 100
}