{
    "IsRecentlyVerified": false,
    "ID": 32498,
    "UUID": "C7E8A2A0-6D99-44AE-B2C3-F830CDCA7B34",
    "DataProviderID": 1,
    "OperatorID": 105,
    "OperatorsReference": "Essent EM-DE-15084355-01-00001",
    "UsageTypeID": 4,
    "AddressInfo": {
        "ID": 32844,
        "Title": "Freyburgstr. 19",
        "AddressLine1": "Freyburgstr. 19",
        "Town": "Naumburg",
        "Postcode": "6618",
        "CountryID": 87,
        "Latitude": 51.15358,
        "Longitude": 11.803943,
        "DistanceUnit": 0
    },
    "Connections": [
        {
            "ID": 36009,
            "ConnectionTypeID": 25,
            "LevelID": 2,
            "PowerKW": 11
        },
        {
            "ID": 46402,
            "ConnectionTypeID": 25,
            "LevelID": 2,
            "PowerKW": 11
        }
    ],
    "NumberOfPoints": 1,
    "StatusTypeID": 50,
    "DateLastStatusUpdate": "2015-04-13T19:16:00Z",
    "DataQualityLevel": 3,
    "DateCreated": "2015-01-09T06:03:00Z",
    "SubmissionStatusTypeID": 200
}