{
    "IsRecentlyVerified": false,
    "ID": 70083,
    "UUID": "89732B68-35C7-46E0-8D62-39E359C69A6F",
    "DataProviderID": 1,
    "OperatorID": 45,
    "UsageTypeID": 1,
    "AddressInfo": {
        "ID": 70429,
        "Title": "Rummelsberg",
        "AddressLine1": "Rummelsberg 47",
        "Town": "Schwarzenbruck",
        "StateOrProvince": "Nürnberger Land",
        "Postcode": "90592",
        "CountryID": 87,
        "Latitude": 49.36521,
        "Longitude": 11.269450000000006,
        "AccessComments": "In der Zufahrt zur Rummelsberger KFZ-Werkstatt zwischen Haus Nr. 47 und dem Rummelsberger Laden/Rummelsberger Bäckerei. 24/7 nutzbar.",
        "DistanceUnit": 0
    },
    "Connections": [
        {
            "ID": 99982,
            "ConnectionTypeID": 25,
            "StatusTypeID": 50,
            "LevelID": 2,
            "Amps": 16,
            "Voltage": 400,
            "PowerKW": 11,
            "CurrentTypeID": 20,
            "Quantity": 1
        }
    ],
    "NumberOfPoints": 1,
    "StatusTypeID": 50,
    "DateLastStatusUpdate": "2016-07-06T21:28:00Z",
    "DataQualityLevel": 1,
    "DateCreated": "2016-07-06T21:28:00Z",
    "SubmissionStatusTypeID": 200
}