{
    "IsRecentlyVerified": false,
    "ID": 99533,
    "UUID": "9BB67E6C-24D7-4CE4-BE36-E1E52A407ED9",
    "DataProviderID": 1,
    "OperatorID": 1,
    "UsageTypeID": 4,
    "AddressInfo": {
        "ID": 99879,
        "Title": "BMW Autohaus Schubert Motors",
        "AddressLine1": "Anderslebener Straße 49",
        "Town": "Oschersleben",
        "StateOrProvince": "Landkreis Börde",
        "Postcode": "39387",
        "CountryID": 87,
        "Latitude": 52.02891750000001,
        "Longitude": 11.243275700000027,
        "ContactTelephone1": "+49 89 248837755",
        "RelatedURL": "http://www.schubert-motors.de/",
        "DistanceUnit": 0
    },
    "Connections": [
        {
            "ID": 140656,
            "ConnectionTypeID": 25,
            "StatusTypeID": 50,
            "LevelID": 2,
            "Amps": 32,
            "Voltage": 400,
            "PowerKW": 22,
            "CurrentTypeID": 20,
            "Quantity": 2
        }
    ],
    "NumberOfPoints": 2,
    "GeneralComments": "Ladestation im Verbund \"Digital Energy Solutions\", Freischaltung mit New Motion Ladekarte.",
    "StatusTypeID": 50,
    "DateLastStatusUpdate": "2018-01-29T09:27:00Z",
    "DataQualityLevel": 1,
    "DateCreated": "2018-01-29T09:27:00Z",
    "SubmissionStatusTypeID": 200
}