{
    "IsRecentlyVerified": false,
    "ID": 151748,
    "UUID": "EF153E89-882C-4E5F-B23D-7CB66318D23A",
    "DataProviderID": 28,
    "DataProvidersReference": "FRS42P42223A1",
    "UsageTypeID": 5,
    "AddressInfo": {
        "ID": 152101,
        "Title": "Parking médiathèque",
        "AddressLine1": "2 rue jules ferry",
        "CountryID": 80,
        "Latitude": 45.444849,
        "Longitude": 4.336845,
        "AccessComments": "24/24 - 7/7",
        "DistanceUnit": 0
    },
    "Connections": [
        {
            "ID": 212078,
            "ConnectionTypeID": 28,
            "StatusTypeID": 50,
            "LevelID": 2,
            "PowerKW": 22,
            "CurrentTypeID": 10
        },
        {
            "ID": 212079,
            "ConnectionTypeID": 1036,
            "StatusTypeID": 50,
            "LevelID": 2,
            "PowerKW": 22,
            "CurrentTypeID": 20
        },
        {
            "ID": 244446,
            "ConnectionTypeID": 28,
            "StatusTypeID": 50,
            "LevelID": 2,
            "PowerKW": 22,
            "CurrentTypeID": 10
        },
        {
            "ID": 244447,
            "ConnectionTypeID": 1036,
            "StatusTypeID": 50,
            "LevelID": 2,
            "PowerKW": 22,
            "CurrentTypeID": 20
        }
    ],
    "GeneralComments": "En service",
    "StatusTypeID": 50,
    "DateLastStatusUpdate": "2020-08-27T05:12:00Z",
    "DataQualityLevel": 2,
    "DateCreated": "2020-03-15T10:53:00Z",
    "SubmissionStatusTypeID": 100
}