{
    "IsRecentlyVerified": false,
    "ID": 80188,
    "UUID": "61D8D9CC-092D-4593-B391-BF3C4336B312",
    "DataProviderID": 2,
    "DataProvidersReference": "80497",
    "OperatorID": 5,
    "UsageTypeID": 1,
    "AddressInfo": {
        "ID": 80534,
        "Title": "HOWARD HUGHES",
        "AddressLine1": "La Madre Mountain Dr",
        "Town": "Las Vegas",
        "StateOrProvince": "NV",
        "Postcode": "89135",
        "CountryID": 2,
        "Latitude": 36.1474568,
        "Longitude": -115.3344202,
        "ContactTelephone1": "888-758-4389",
        "AccessComments": "24 hours daily",
        "RelatedURL": "http://www.chargepoint.com/",
        "DistanceUnit": 0
    },
    "Connections": [
        {
            "ID": 114854,
            "ConnectionTypeID": 1,
            "LevelID": 2,
            "Amps": 16,
            "Voltage": 230,
            "PowerKW": 3,
            "CurrentTypeID": 10,
            "Quantity": 2
        }
    ],
    "DateLastStatusUpdate": "2019-04-06T04:02:00Z",
    "DataQualityLevel": 3,
    "DateCreated": "2017-01-31T01:05:00Z",
    "SubmissionStatusTypeID": 100
}