{
    "IsRecentlyVerified": false,
    "ID": 181175,
    "UUID": "81C14FE4-928C-495B-91C6-9C27E01D193E",
    "DataProviderID": 29,
    "DataProvidersReference": "11901",
    "OperatorID": 86,
    "AddressInfo": {
        "ID": 181534,
        "Title": "A3 Raststätte Landsberg an der Warthe",
        "AddressLine1": "A3 Raststätte Landsberg an der Warthe",
        "Town": "Sessenhausen",
        "Postcode": "56244",
        "CountryID": 87,
        "Latitude": 50.521421,
        "Longitude": 7.695711,
        "DistanceUnit": 0
    },
    "Connections": [
        {
            "ID": 285156,
            "ConnectionTypeID": 1036,
            "StatusTypeID": 50,
            "LevelID": 3,
            "PowerKW": 43,
            "CurrentTypeID": 20
        },
        {
            "ID": 285157,
            "ConnectionTypeID": 33,
            "StatusTypeID": 50,
            "LevelID": 3,
            "PowerKW": 50,
            "CurrentTypeID": 30
        }
    ],
    "StatusTypeID": 50,
    "DateLastStatusUpdate": "2021-07-09T03:19:00Z",
    "MetadataValues": [
        {
            "ID": 13469,
            "MetadataFieldID": 4,
            "ItemValue": "Data from the German chargepoint registry provided by Bundesnetzagentur.de under the CC-BY 4.0 license"
        }
    ],
    "DataQualityLevel": 3,
    "DateCreated": "2021-07-08T10:01:00Z",
    "SubmissionStatusTypeID": 100
}