{
    "IsRecentlyVerified": false,
    "ID": 136685,
    "UUID": "FC2B7B15-48C1-417C-827F-72CA8BA6B1DD",
    "DataProviderID": 18,
    "DataProvidersReference": "d77e3d3610e7b872ea34964e65bcb667",
    "OperatorID": 3345,
    "UsageTypeID": 5,
    "AddressInfo": {
        "ID": 137031,
        "Title": "132 Hollis Road",
        "AddressLine1": "132 Hollis Road",
        "Town": "Coventry",
        "Postcode": "CV3 1AT",
        "CountryID": 1,
        "Latitude": 52.403804,
        "Longitude": -1.486537,
        "AccessComments": "EV Bay on Hollis Road, cnr Hollis Road & Humber Road",
        "RelatedURL": "https://char.gy",
        "DistanceUnit": 0
    },
    "Connections": [
        {
            "ID": 191224,
            "ConnectionTypeID": 25,
            "Reference": "00380",
            "StatusTypeID": 50,
            "LevelID": 2,
            "Amps": 16,
            "Voltage": 230,
            "PowerKW": 3.7,
            "CurrentTypeID": 10
        }
    ],
    "StatusTypeID": 0,
    "DateLastStatusUpdate": "2019-12-24T05:22:00Z",
    "MetadataValues": [
        {
            "ID": 6537,
            "MetadataFieldID": 4,
            "ItemValue": "Contains public sector information licensed under the Open Government Licence v2.0. http://www.nationalarchives.gov.uk/doc/open-government-licence/version/2/"
        }
    ],
    "DataQualityLevel": 3,
    "DateCreated": "2019-12-24T05:22:00Z",
    "SubmissionStatusTypeID": 100
}