{
    "IsRecentlyVerified": false,
    "ID": 139756,
    "UUID": "DB5BF1E2-8825-400F-A31A-3543D387EA7D",
    "DataProviderID": 2,
    "DataProvidersReference": "120883",
    "OperatorID": 59,
    "UsageTypeID": 2,
    "AddressInfo": {
        "ID": 140108,
        "Title": "Greenlots - 52388",
        "AddressLine1": "5750 Wilshire Blvd",
        "Town": "Los Angeles",
        "StateOrProvince": "CA",
        "Postcode": "90036",
        "CountryID": 2,
        "Latitude": 34.0611381530762,
        "Longitude": -118.354797363281,
        "ContactTelephone1": "855-900-7584",
        "AccessComments": "24 hours daily",
        "RelatedURL": "http://greenlots.com/",
        "DistanceUnit": 0
    },
    "Connections": [
        {
            "ID": 195206,
            "ConnectionTypeID": 1,
            "LevelID": 2,
            "Amps": 16,
            "Voltage": 230,
            "PowerKW": 3.7,
            "CurrentTypeID": 10,
            "Quantity": 2
        }
    ],
    "StatusTypeID": 50,
    "DateLastStatusUpdate": "2020-06-26T02:56:00Z",
    "DataQualityLevel": 3,
    "DateCreated": "2019-12-24T09:11:00Z",
    "SubmissionStatusTypeID": 100
}