{
    "IsRecentlyVerified": false,
    "ID": 185250,
    "UUID": "D9910F4B-A1FC-49DB-A61E-D56EF5181A9E",
    "DataProviderID": 29,
    "DataProvidersReference": "197",
    "AddressInfo": {
        "ID": 185609,
        "Title": "Friedländer Landstraße 20B",
        "AddressLine1": "Friedländer Landstraße 20B",
        "Town": "Anklam",
        "Postcode": "17389",
        "CountryID": 87,
        "Latitude": 53.841658,
        "Longitude": 13.684375,
        "DistanceUnit": 0
    },
    "Connections": [
        {
            "ID": 294506,
            "ConnectionTypeID": 33,
            "StatusTypeID": 50,
            "LevelID": 3,
            "PowerKW": 22,
            "CurrentTypeID": 30
        },
        {
            "ID": 294507,
            "ConnectionTypeID": 25,
            "StatusTypeID": 50,
            "LevelID": 2,
            "PowerKW": 11,
            "CurrentTypeID": 20
        }
    ],
    "StatusTypeID": 50,
    "DateLastStatusUpdate": "2021-07-09T03:30:00Z",
    "MetadataValues": [
        {
            "ID": 17541,
            "MetadataFieldID": 4,
            "ItemValue": "Data from the German chargepoint registry provided by Bundesnetzagentur.de under the CC-BY 4.0 license"
        }
    ],
    "DataQualityLevel": 3,
    "DateCreated": "2021-07-08T10:06:00Z",
    "SubmissionStatusTypeID": 100
}