{
    "IsRecentlyVerified": false,
    "ID": 157213,
    "UUID": "4E887FC7-8AB4-40A4-BC60-501E9A941E45",
    "DataProviderID": 19,
    "DataProvidersReference": "5462",
    "AddressInfo": {
        "ID": 157567,
        "Title": "TrP Søndre Gate",
        "AddressLine1": "Søndre gate 10",
        "Town": "TRONDHEIM",
        "StateOrProvince": "Trøndelag",
        "Postcode": "7011",
        "CountryID": 168,
        "Latitude": 63.43121,
        "Longitude": 10.400056,
        "AccessComments": "",
        "DistanceUnit": 0
    },
    "Connections": [
        {
            "ID": 225977,
            "ConnectionTypeID": 25,
            "Reference": "1",
            "LevelID": 2,
            "Amps": 16,
            "Voltage": 400,
            "PowerKW": 11,
            "CurrentTypeID": 20,
            "Comments": "Mode 3"
        },
        {
            "ID": 225978,
            "ConnectionTypeID": 25,
            "Reference": "2",
            "LevelID": 2,
            "Amps": 16,
            "Voltage": 400,
            "PowerKW": 11,
            "CurrentTypeID": 20,
            "Comments": "Mode 3"
        },
        {
            "ID": 225979,
            "ConnectionTypeID": 25,
            "Reference": "3",
            "LevelID": 2,
            "Amps": 16,
            "Voltage": 400,
            "PowerKW": 11,
            "CurrentTypeID": 20,
            "Comments": "Mode 3"
        },
        {
            "ID": 225980,
            "ConnectionTypeID": 25,
            "Reference": "4",
            "LevelID": 2,
            "Amps": 16,
            "Voltage": 400,
            "PowerKW": 11,
            "CurrentTypeID": 20,
            "Comments": "Mode 3"
        },
        {
            "ID": 225981,
            "ConnectionTypeID": 25,
            "Reference": "5",
            "LevelID": 2,
            "Amps": 16,
            "Voltage": 400,
            "PowerKW": 11,
            "CurrentTypeID": 20,
            "Comments": "Mode 3"
        },
        {
            "ID": 225982,
            "ConnectionTypeID": 25,
            "Reference": "6",
            "LevelID": 2,
            "Amps": 16,
            "Voltage": 400,
            "PowerKW": 11,
            "CurrentTypeID": 20,
            "Comments": "Mode 3"
        },
        {
            "ID": 225983,
            "ConnectionTypeID": 25,
            "Reference": "7",
            "LevelID": 2,
            "Amps": 16,
            "Voltage": 400,
            "PowerKW": 11,
            "CurrentTypeID": 20,
            "Comments": "Mode 3"
        },
        {
            "ID": 225984,
            "ConnectionTypeID": 25,
            "Reference": "8",
            "LevelID": 2,
            "Amps": 16,
            "Voltage": 400,
            "PowerKW": 11,
            "CurrentTypeID": 20,
            "Comments": "Mode 3"
        },
        {
            "ID": 225985,
            "ConnectionTypeID": 25,
            "Reference": "9",
            "LevelID": 2,
            "Amps": 16,
            "Voltage": 400,
            "PowerKW": 11,
            "CurrentTypeID": 20,
            "Comments": "Mode 3"
        },
        {
            "ID": 225986,
            "ConnectionTypeID": 25,
            "Reference": "10",
            "LevelID": 2,
            "Amps": 16,
            "Voltage": 400,
            "PowerKW": 11,
            "CurrentTypeID": 20,
            "Comments": "Mode 3"
        },
        {
            "ID": 225987,
            "ConnectionTypeID": 25,
            "Reference": "11",
            "LevelID": 2,
            "Amps": 16,
            "Voltage": 400,
            "PowerKW": 11,
            "CurrentTypeID": 20,
            "Comments": "Mode 3"
        },
        {
            "ID": 225988,
            "ConnectionTypeID": 25,
            "Reference": "12",
            "LevelID": 2,
            "Amps": 16,
            "Voltage": 400,
            "PowerKW": 11,
            "CurrentTypeID": 20,
            "Comments": "Mode 3"
        },
        {
            "ID": 225989,
            "ConnectionTypeID": 25,
            "Reference": "13",
            "LevelID": 2,
            "Amps": 16,
            "Voltage": 400,
            "PowerKW": 11,
            "CurrentTypeID": 20,
            "Comments": "Mode 3"
        },
        {
            "ID": 225990,
            "ConnectionTypeID": 25,
            "Reference": "14",
            "LevelID": 2,
            "Amps": 16,
            "Voltage": 400,
            "PowerKW": 11,
            "CurrentTypeID": 20,
            "Comments": "Mode 3"
        }
    ],
    "NumberOfPoints": 14,
    "StatusTypeID": 0,
    "DateLastStatusUpdate": "2021-03-24T05:12:00Z",
    "DataQualityLevel": 2,
    "DateCreated": "2020-05-26T08:25:00Z",
    "SubmissionStatusTypeID": 100
}