{
    "IsRecentlyVerified": false,
    "ID": 188018,
    "UUID": "608C37CB-26B0-4B74-8BD5-21165AF16081",
    "DataProviderID": 18,
    "DataProvidersReference": "5e5ac7d31de712da215cf9194a241b76",
    "OperatorID": 3,
    "UsageTypeID": 1,
    "AddressInfo": {
        "ID": 188377,
        "Title": "Chesterfield road",
        "AddressLine1": "Chesterfield road",
        "Town": "Hardstoft",
        "Postcode": "S45 8AX",
        "CountryID": 1,
        "Latitude": 53.1,
        "Longitude": -1.34,
        "AccessComments": "",
        "RelatedURL": "http://pod-point.com",
        "DistanceUnit": 0
    },
    "Connections": [
        {
            "ID": 303390,
            "ConnectionTypeID": 25,
            "Reference": "0",
            "StatusTypeID": 50,
            "LevelID": 2,
            "Amps": 32,
            "Voltage": 230,
            "PowerKW": 7,
            "CurrentTypeID": 10
        }
    ],
    "StatusTypeID": 0,
    "DateLastStatusUpdate": "2021-07-12T03:39:00Z",
    "MetadataValues": [
        {
            "ID": 20258,
            "MetadataFieldID": 4,
            "ItemValue": "Contains public sector information licensed under the Open Government Licence v2.0. http://www.nationalarchives.gov.uk/doc/open-government-licence/version/2/"
        }
    ],
    "DataQualityLevel": 3,
    "DateCreated": "2021-07-12T03:39:00Z",
    "SubmissionStatusTypeID": 100
}