{
    "MediaItems": [
        {
            "ID": 4758,
            "ChargePointID": 54536,
            "ItemURL": "https://s3-ap-southeast-2.amazonaws.com/openchargemap/images/IT/OCM54536/OCM-54536.orig.2016011116552306.jpg",
            "ItemThumbnailURL": "https://s3-ap-southeast-2.amazonaws.com/openchargemap/images/IT/OCM54536/OCM-54536.thmb.2016011116552306.jpg",
            "Comment": "",
            "IsEnabled": true,
            "IsVideo": false,
            "IsFeaturedItem": false,
            "IsExternalResource": false,
            "User": {
                "ID": 1606,
                "Username": "polianto"
            },
            "DateCreated": "2016-01-11T16:56:00Z"
        }
    ],
    "IsRecentlyVerified": false,
    "ID": 54536,
    "UUID": "60CE01E2-334A-4E20-98DC-0CB84B72C16C",
    "DataProviderID": 1,
    "UsageTypeID": 6,
    "UsageCost": "free",
    "AddressInfo": {
        "ID": 54882,
        "Title": "Distributore IP Area di Servizio Adige Ovest",
        "AddressLine1": "Autostrada A22 Brennero-Modena Direzione Sud KM 187",
        "Town": "Brentino Belluno",
        "StateOrProvince": "VR",
        "Postcode": "37020",
        "CountryID": 112,
        "Latitude": 45.69217444178442,
        "Longitude": 10.910819953426406,
        "ContactTelephone1": "+39 045 723 0120",
        "DistanceUnit": 0
    },
    "Connections": [
        {
            "ID": 68823,
            "ConnectionTypeID": 25,
            "StatusTypeID": 50,
            "LevelID": 2,
            "Voltage": 240,
            "PowerKW": 3.7,
            "CurrentTypeID": 10,
            "Quantity": 2
        }
    ],
    "NumberOfPoints": 2,
    "StatusTypeID": 50,
    "DateLastStatusUpdate": "2016-01-11T16:56:00Z",
    "DataQualityLevel": 1,
    "DateCreated": "2015-10-07T15:33:00Z",
    "SubmissionStatusTypeID": 200
}