{
    "IsRecentlyVerified": false,
    "ID": 21323,
    "UUID": "36DB9739-C52C-4DA9-A1F9-922F1244A290",
    "DataProviderID": 1,
    "OperatorID": 5,
    "UsageTypeID": 1,
    "AddressInfo": {
        "ID": 21668,
        "Title": "FULLCHARGER / SOFIA 009",
        "AddressLine1": "Славянска   /   8, Slavianska Str",
        "AddressLine2": "ж.к. Лозенец",
        "Town": "Sofia",
        "StateOrProvince": "Sofia-City Region",
        "Postcode": "1142",
        "CountryID": 39,
        "Latitude": 42.693125620626525,
        "Longitude": 23.32876754078372,
        "DistanceUnit": 0
    },
    "Connections": [
        {
            "ID": 23171,
            "ConnectionTypeID": 13,
            "LevelID": 2,
            "Amps": 16,
            "Voltage": 230,
            "PowerKW": 3.7,
            "CurrentTypeID": 10,
            "Quantity": 1
        }
    ],
    "NumberOfPoints": 1,
    "StatusTypeID": 50,
    "DateLastStatusUpdate": "2014-03-21T13:03:00Z",
    "DataQualityLevel": 1,
    "DateCreated": "2014-03-21T13:03:00Z",
    "SubmissionStatusTypeID": 200
}