{
    "UserComments": [
        {
            "ID": 23060,
            "ChargePointID": 92091,
            "CommentTypeID": 10,
            "UserName": "interssl.com",
            "Comment": "This is the highest charger for EVs above sea level. On the planet. Stunning view!",
            "Rating": 5,
            "RelatedURL": "https://www.grossglockner.at/gg/en/index",
            "DateCreated": "2020-08-11T17:09:59.487Z",
            "User": {
                "ID": 26760,
                "Username": "interssl.com"
            },
            "CheckinStatusTypeID": 10,
            "IsActionedByEditor": false
        }
    ],
    "MediaItems": [
        {
            "ID": 24112,
            "ChargePointID": 92091,
            "ItemURL": "https://s3-ap-southeast-2.amazonaws.com/openchargemap/images/AT/OCM92091/OCM-92091.orig.2020081117091685.jpg",
            "ItemThumbnailURL": "https://s3-ap-southeast-2.amazonaws.com/openchargemap/images/AT/OCM92091/OCM-92091.thmb.2020081117091685.jpg",
            "Comment": "",
            "IsEnabled": true,
            "IsVideo": false,
            "IsFeaturedItem": false,
            "IsExternalResource": false,
            "User": {
                "ID": 26760,
                "Username": "interssl.com"
            },
            "DateCreated": "2020-08-11T17:09:00Z"
        }
    ],
    "IsRecentlyVerified": false,
    "ID": 92091,
    "UUID": "68BA5427-B2A9-4B75-A3F9-438069791786",
    "DataProviderID": 1,
    "OperatorID": 23,
    "OperatorsReference": "33182",
    "UsageTypeID": 4,
    "AddressInfo": {
        "ID": 92437,
        "Title": "Grossglockner Hochalpenstrasse",
        "AddressLine1": "Grossglockner Hochalpenstrasse",
        "Town": "Heiligenblut",
        "Postcode": "9844",
        "CountryID": 19,
        "Latitude": 47.074598,
        "Longitude": 12.752074,
        "ContactTelephone1": "+43 662 8736730",
        "DistanceUnit": 0
    },
    "Connections": [
        {
            "ID": 130564,
            "ConnectionTypeID": 30,
            "StatusTypeID": 50,
            "LevelID": 2,
            "Amps": 32,
            "Voltage": 400,
            "PowerKW": 22,
            "CurrentTypeID": 20,
            "Quantity": 2
        }
    ],
    "NumberOfPoints": 2,
    "GeneralComments": "2 Tesla Connectors, up to 22kW.Available for customers. Self park.",
    "StatusTypeID": 50,
    "DateLastStatusUpdate": "2020-08-11T17:10:00Z",
    "DataQualityLevel": 1,
    "DateCreated": "2017-08-26T05:34:00Z",
    "SubmissionStatusTypeID": 200
}