{
    "IsRecentlyVerified": false,
    "ID": 9730,
    "UUID": "F68E30F0-55D8-4FE5-A056-C759A755F528",
    "DataProviderID": 15,
    "DataProvidersReference": "16119",
    "OperatorID": 1,
    "UsageTypeID": 1,
    "AddressInfo": {
        "ID": 9627,
        "Title": "2701 Fairburn Rd",
        "AddressLine1": "2701 Fairburn Rd",
        "Town": "Douglasville",
        "StateOrProvince": "GA",
        "Postcode": "30135",
        "CountryID": 2,
        "Latitude": 33.73257,
        "Longitude": -84.66901,
        "ContactTelephone1": "770-489-2734",
        "RelatedURL": "http://carstations.com/16119",
        "DistanceUnit": 0
    },
    "Connections": [
        {
            "ID": 7537,
            "ConnectionTypeID": 1,
            "Reference": "J1772",
            "LevelID": 2
        }
    ],
    "NumberOfPoints": 1,
    "StatusTypeID": 50,
    "DateLastStatusUpdate": "2017-11-04T14:04:00Z",
    "DataQualityLevel": 2,
    "DateCreated": "2012-04-16T15:46:00Z",
    "SubmissionStatusTypeID": 100
}