{
    "IsRecentlyVerified": false,
    "ID": 90103,
    "UUID": "AA96F8C7-2DD6-4575-BED7-87A0118DB044",
    "DataProviderID": 1,
    "OperatorID": 3,
    "OperatorsReference": "PG-81147",
    "UsageTypeID": 6,
    "UsageCost": "Free",
    "AddressInfo": {
        "ID": 90449,
        "Title": "Bank of America Merrill Lynch-Chester",
        "AddressLine1": "Chester Business Park",
        "Town": "Chester",
        "Postcode": "CH4 9FB",
        "CountryID": 1,
        "Latitude": 53.160382,
        "Longitude": -2.898747,
        "DistanceUnit": 0
    },
    "Connections": [
        {
            "ID": 127729,
            "ConnectionTypeID": 25,
            "StatusTypeID": 50,
            "LevelID": 2,
            "Amps": 32,
            "Voltage": 230,
            "PowerKW": 7,
            "CurrentTypeID": 10,
            "Quantity": 2
        }
    ],
    "NumberOfPoints": 10,
    "GeneralComments": "This is an open charge unit installed at the Bank of America Merrill Lynch site in Chester Business Park, Chester",
    "StatusTypeID": 50,
    "DateLastStatusUpdate": "2017-12-21T06:35:00Z",
    "DataQualityLevel": 1,
    "DateCreated": "2017-07-09T05:35:00Z",
    "SubmissionStatusTypeID": 200
}