{
    "IsRecentlyVerified": false,
    "ID": 152261,
    "UUID": "3FF68E95-5C19-4D7E-AB8A-5EF3A6DF201E",
    "DataProviderID": 28,
    "DataProvidersReference": "FR*S86*PSORE*B115",
    "UsageTypeID": 5,
    "AddressInfo": {
        "ID": 152614,
        "Title": "B115",
        "AddressLine1": "Place du Mail - 86110 - Mirebeau",
        "CountryID": 80,
        "Latitude": 46.79024,
        "Longitude": 0.18378,
        "AccessComments": "24/24 7/7 jours",
        "DistanceUnit": 0
    },
    "Connections": [
        {
            "ID": 213095,
            "ConnectionTypeID": 28,
            "StatusTypeID": 50,
            "LevelID": 2,
            "PowerKW": 18,
            "CurrentTypeID": 10
        },
        {
            "ID": 213096,
            "ConnectionTypeID": 25,
            "StatusTypeID": 50,
            "LevelID": 2,
            "PowerKW": 18,
            "CurrentTypeID": 20
        },
        {
            "ID": 245955,
            "ConnectionTypeID": 28,
            "StatusTypeID": 50,
            "LevelID": 2,
            "PowerKW": 18,
            "CurrentTypeID": 10
        },
        {
            "ID": 245956,
            "ConnectionTypeID": 25,
            "StatusTypeID": 50,
            "LevelID": 2,
            "PowerKW": 18,
            "CurrentTypeID": 20
        }
    ],
    "GeneralComments": "",
    "StatusTypeID": 50,
    "DateLastStatusUpdate": "2020-08-27T05:13:00Z",
    "DataQualityLevel": 2,
    "DateCreated": "2020-03-15T10:53:00Z",
    "SubmissionStatusTypeID": 100
}