{
    "IsRecentlyVerified": false,
    "ID": 154465,
    "UUID": "CBD3A819-4DCA-4421-BA08-63D7DB33FB03",
    "DataProviderID": 28,
    "DataProvidersReference": "FR*SOD*S*NPDC*245*1*_*_",
    "UsageTypeID": 5,
    "AddressInfo": {
        "ID": 154818,
        "Title": "Hallennes lez Haubourdin - Eglise",
        "AddressLine1": "Rue Louis Pasteur, Hallennes lez Haubourdin",
        "CountryID": 80,
        "Latitude": 50.615394,
        "Longitude": 2.960664,
        "AccessComments": "24/24 7/7 jours",
        "DistanceUnit": 0
    },
    "Connections": [
        {
            "ID": 217236,
            "ConnectionTypeID": 28,
            "StatusTypeID": 50,
            "LevelID": 2,
            "PowerKW": 22,
            "CurrentTypeID": 10
        },
        {
            "ID": 217237,
            "ConnectionTypeID": 1036,
            "StatusTypeID": 50,
            "LevelID": 2,
            "PowerKW": 22,
            "CurrentTypeID": 20
        }
    ],
    "GeneralComments": "\"Type charge indiquée selon décret de 2017",
    "StatusTypeID": 50,
    "DateLastStatusUpdate": "2020-08-27T05:16:00Z",
    "DataQualityLevel": 2,
    "DateCreated": "2020-03-15T10:55:00Z",
    "SubmissionStatusTypeID": 100
}