{
    "IsRecentlyVerified": false,
    "ID": 109213,
    "UUID": "13381FE7-E6E0-4B3B-B8DB-586894155A3B",
    "DataProviderID": 1,
    "OperatorID": 23,
    "OperatorsReference": "45002",
    "UsageTypeID": 7,
    "AddressInfo": {
        "ID": 109559,
        "Title": "Locanda Rossa",
        "AddressLine1": "Strada Capalbio Pescia Fiorentina",
        "Town": "Capalbio",
        "Postcode": "58011",
        "CountryID": 112,
        "Latitude": 42.446476,
        "Longitude": 11.463811,
        "ContactTelephone1": " +39 0564 890 462",
        "DistanceUnit": 0
    },
    "Connections": [
        {
            "ID": 154331,
            "ConnectionTypeID": 30,
            "StatusTypeID": 50,
            "LevelID": 2,
            "Amps": 32,
            "Voltage": 400,
            "PowerKW": 22,
            "CurrentTypeID": 20,
            "Quantity": 1
        }
    ],
    "NumberOfPoints": 1,
    "GeneralComments": "1 Tesla Connector, up to 22kW.Available by reservation only. Please call ahead.",
    "StatusTypeID": 50,
    "DateLastStatusUpdate": "2018-10-11T13:57:00Z",
    "DataQualityLevel": 1,
    "DateCreated": "2018-10-11T13:57:00Z",
    "SubmissionStatusTypeID": 200
}