{
    "IsRecentlyVerified": false,
    "ID": 112844,
    "UUID": "9943CAAD-0B96-491E-9C09-7AF28166AD39",
    "DataProviderID": 1,
    "OperatorID": 32,
    "OperatorsReference": "11340",
    "UsageTypeID": 4,
    "UsageCost": "Inclusive; for Polar Plus subscription members only",
    "AddressInfo": {
        "ID": 113190,
        "Title": "XQ7",
        "AddressLine1": "XQ7",
        "Town": "Taylorson Street south",
        "StateOrProvince": "Salford",
        "Postcode": "M5 3FN",
        "CountryID": 1,
        "Latitude": 53.467239,
        "Longitude": -2.28261,
        "DistanceUnit": 0
    },
    "Connections": [
        {
            "ID": 158930,
            "ConnectionTypeID": 25,
            "StatusTypeID": 50,
            "LevelID": 2,
            "Amps": 16,
            "Voltage": 230,
            "PowerKW": 4,
            "CurrentTypeID": 10,
            "Quantity": 2
        }
    ],
    "NumberOfPoints": 2,
    "GeneralComments": "GROUND",
    "StatusTypeID": 50,
    "DateLastStatusUpdate": "2018-11-21T06:15:00Z",
    "DataQualityLevel": 1,
    "DateCreated": "2018-11-21T06:15:00Z",
    "SubmissionStatusTypeID": 200
}