{
    "IsRecentlyVerified": false,
    "ID": 141806,
    "UUID": "9CA67CB7-445D-4901-BB76-A16BCB821F80",
    "DataProviderID": 2,
    "DataProvidersReference": "148194",
    "OperatorID": 39,
    "UsageTypeID": 1,
    "AddressInfo": {
        "ID": 142158,
        "Title": "Firaxis Games",
        "AddressLine1": "10 Loveton Cir",
        "Town": "Sparks Glencoe",
        "StateOrProvince": "MD",
        "Postcode": "21152",
        "CountryID": 2,
        "Latitude": 39.5212999,
        "Longitude": -76.646339,
        "ContactTelephone1": "800-663-5633",
        "AccessComments": "MO: 12:00am-12:00am; TU: 12:00am-12:00am; WE: 12:00am-12:00am; TH: 12:00am-12:00am; FR: 12:00am-12:00am; SA: 12:00am-12:00am; SU: 12:00am-12:00am",
        "RelatedURL": "http://www.semacharge.com/",
        "DistanceUnit": 0
    },
    "Connections": [
        {
            "ID": 197822,
            "ConnectionTypeID": 1,
            "LevelID": 2,
            "Amps": 16,
            "Voltage": 230,
            "PowerKW": 3.7,
            "CurrentTypeID": 10,
            "Quantity": 8
        }
    ],
    "StatusTypeID": 50,
    "DateLastStatusUpdate": "2020-06-26T03:01:00Z",
    "DataQualityLevel": 3,
    "DateCreated": "2019-12-24T09:16:00Z",
    "SubmissionStatusTypeID": 100
}