{
    "UserComments": [
        {
            "ID": 21181,
            "ChargePointID": 127529,
            "CommentTypeID": 10,
            "UserName": "ForumElettrico.it",
            "RelatedURL": "https://www.forumelettrico.it/forum/colonnina-enel-x-22-kw-terme-di-tabiano-salsomaggiore-terme-pr-via-castello-17-bagni-di-tabiano-t6188.html",
            "DateCreated": "2019-07-08T08:01:16.2Z",
            "User": {
                "ID": 11749,
                "Username": "ForumElettrico.it"
            },
            "CheckinStatusTypeID": 10
        }
    ],
    "MediaItems": [
        {
            "ID": 18823,
            "ChargePointID": 127529,
            "ItemURL": "https://s3-ap-southeast-2.amazonaws.com/openchargemap/images/IT/OCM127529/OCM-127529.orig.2019070808013158.jpg",
            "ItemThumbnailURL": "https://s3-ap-southeast-2.amazonaws.com/openchargemap/images/IT/OCM127529/OCM-127529.thmb.2019070808013158.jpg",
            "Comment": "",
            "IsEnabled": true,
            "IsVideo": false,
            "IsFeaturedItem": false,
            "IsExternalResource": false,
            "User": {
                "ID": 11749,
                "Username": "ForumElettrico.it"
            },
            "DateCreated": "2019-07-08T08:02:00Z"
        },
        {
            "ID": 18824,
            "ChargePointID": 127529,
            "ItemURL": "https://s3-ap-southeast-2.amazonaws.com/openchargemap/images/IT/OCM127529/OCM-127529.orig.2019070808013793.jpg",
            "ItemThumbnailURL": "https://s3-ap-southeast-2.amazonaws.com/openchargemap/images/IT/OCM127529/OCM-127529.thmb.2019070808013793.jpg",
            "Comment": "",
            "IsEnabled": true,
            "IsVideo": false,
            "IsFeaturedItem": false,
            "IsExternalResource": false,
            "User": {
                "ID": 11749,
                "Username": "ForumElettrico.it"
            },
            "DateCreated": "2019-07-08T08:02:00Z"
        },
        {
            "ID": 18825,
            "ChargePointID": 127529,
            "ItemURL": "https://s3-ap-southeast-2.amazonaws.com/openchargemap/images/IT/OCM127529/OCM-127529.orig.2019070808014443.jpg",
            "ItemThumbnailURL": "https://s3-ap-southeast-2.amazonaws.com/openchargemap/images/IT/OCM127529/OCM-127529.thmb.2019070808014443.jpg",
            "Comment": "",
            "IsEnabled": true,
            "IsVideo": false,
            "IsFeaturedItem": false,
            "IsExternalResource": false,
            "User": {
                "ID": 11749,
                "Username": "ForumElettrico.it"
            },
            "DateCreated": "2019-07-08T08:02:00Z"
        },
        {
            "ID": 18826,
            "ChargePointID": 127529,
            "ItemURL": "https://s3-ap-southeast-2.amazonaws.com/openchargemap/images/IT/OCM127529/OCM-127529.orig.2019070808014993.jpg",
            "ItemThumbnailURL": "https://s3-ap-southeast-2.amazonaws.com/openchargemap/images/IT/OCM127529/OCM-127529.thmb.2019070808014993.jpg",
            "Comment": "",
            "IsEnabled": true,
            "IsVideo": false,
            "IsFeaturedItem": false,
            "IsExternalResource": false,
            "User": {
                "ID": 11749,
                "Username": "ForumElettrico.it"
            },
            "DateCreated": "2019-07-08T08:02:00Z"
        }
    ],
    "IsRecentlyVerified": false,
    "ID": 127529,
    "UUID": "0ADABCE5-72AB-49EF-93FF-A7C8D5499CF3",
    "DataProviderID": 1,
    "OperatorID": 80,
    "UsageTypeID": 4,
    "AddressInfo": {
        "ID": 127875,
        "Title": " Bagni di Tabiano Castello | EnelX",
        "AddressLine1": "Via Castello",
        "AddressLine2": " Bagni di Tabiano",
        "Town": " Salsomaggiore Terme",
        "StateOrProvince": "PR",
        "Postcode": "43039",
        "CountryID": 112,
        "Latitude": 44.8036352945747,
        "Longitude": 10.0221268229461,
        "ContactTelephone1": "800.069.850",
        "RelatedURL": "https://www.enelx.com/it/it/emobility",
        "DistanceUnit": 0
    },
    "Connections": [
        {
            "ID": 178526,
            "ConnectionTypeID": 25,
            "StatusTypeID": 150,
            "LevelID": 2,
            "Amps": 32,
            "Voltage": 400,
            "PowerKW": 22,
            "CurrentTypeID": 20,
            "Quantity": 1
        },
        {
            "ID": 178527,
            "ConnectionTypeID": 36,
            "StatusTypeID": 150,
            "LevelID": 2,
            "Amps": 16,
            "Voltage": 240,
            "PowerKW": 3.7,
            "CurrentTypeID": 10,
            "Quantity": 1
        }
    ],
    "NumberOfPoints": 2,
    "StatusTypeID": 50,
    "DateLastStatusUpdate": "2019-07-08T10:06:00Z",
    "DataQualityLevel": 1,
    "DateCreated": "2019-06-04T12:28:00Z",
    "SubmissionStatusTypeID": 200
}