{
    "IsRecentlyVerified": false,
    "ID": 9858,
    "UUID": "075502EE-75FF-4DB2-BB8B-BD3A05F25D02",
    "DataProviderID": 15,
    "DataProvidersReference": "17560",
    "OperatorID": 5,
    "AddressInfo": {
        "ID": 9755,
        "Title": "6001 N Western Ave",
        "AddressLine1": "6001 N Western Ave",
        "Town": "Oklahoma City",
        "StateOrProvince": "Oklahoma",
        "Postcode": "73118",
        "CountryID": 2,
        "Latitude": 35.53384,
        "Longitude": -97.53104,
        "ContactTelephone1": "(405) 879-3500",
        "RelatedURL": "http://carstations.com/17560",
        "DistanceUnit": 0
    },
    "Connections": [
        {
            "ID": 7711,
            "ConnectionTypeID": 1,
            "Reference": "J1772",
            "LevelID": 2
        },
        {
            "ID": 8476,
            "ConnectionTypeID": 9,
            "Reference": "NEMA5",
            "LevelID": 1,
            "Quantity": 1
        }
    ],
    "StatusTypeID": 0,
    "DateLastStatusUpdate": "2017-11-04T14:04:00Z",
    "DataQualityLevel": 2,
    "DateCreated": "2012-05-01T20:37:00Z",
    "SubmissionStatusTypeID": 100
}