{
    "IsRecentlyVerified": false,
    "ID": 135842,
    "UUID": "560B7D33-DFA0-40D1-8817-9BDF70CAA4CF",
    "DataProviderID": 18,
    "DataProvidersReference": "67b07395cef92859853c0886060ee98e",
    "OperatorID": 2244,
    "UsageTypeID": 5,
    "AddressInfo": {
        "ID": 136188,
        "Title": "Shakespeare Road",
        "AddressLine1": "Shakespeare Road",
        "Town": "London",
        "Postcode": "SE24 0QD",
        "CountryID": 1,
        "Latitude": 51.462499,
        "Longitude": -0.102707,
        "AccessComments": "",
        "RelatedURL": "https://www.ubitricity.com",
        "DistanceUnit": 0
    },
    "Connections": [
        {
            "ID": 190263,
            "ConnectionTypeID": 25,
            "Reference": "suby1100001742",
            "StatusTypeID": 50,
            "LevelID": 2,
            "Amps": 16,
            "Voltage": 230,
            "PowerKW": 3.7,
            "CurrentTypeID": 10
        }
    ],
    "StatusTypeID": 0,
    "DateLastStatusUpdate": "2021-04-25T05:46:00Z",
    "MetadataValues": [
        {
            "ID": 5694,
            "MetadataFieldID": 4,
            "ItemValue": "Contains public sector information licensed under the Open Government Licence v2.0. http://www.nationalarchives.gov.uk/doc/open-government-licence/version/2/"
        }
    ],
    "DataQualityLevel": 3,
    "DateCreated": "2019-12-24T05:22:00Z",
    "SubmissionStatusTypeID": 100
}