{
    "MediaItems": [
        {
            "ID": 12096,
            "ChargePointID": 87695,
            "ItemURL": "https://s3-ap-southeast-2.amazonaws.com/openchargemap/images/NZ/OCM87695/OCM-87695.orig.2017051605155162.jpg",
            "ItemThumbnailURL": "https://s3-ap-southeast-2.amazonaws.com/openchargemap/images/NZ/OCM87695/OCM-87695.thmb.2017051605155162.jpg",
            "Comment": "",
            "IsEnabled": true,
            "IsVideo": false,
            "IsFeaturedItem": false,
            "IsExternalResource": false,
            "User": {
                "ID": 15365,
                "Username": "sliday"
            },
            "DateCreated": "2017-05-16T05:16:00Z"
        },
        {
            "ID": 12097,
            "ChargePointID": 87695,
            "ItemURL": "https://s3-ap-southeast-2.amazonaws.com/openchargemap/images/NZ/OCM87695/OCM-87695.orig.2017051605160185.jpg",
            "ItemThumbnailURL": "https://s3-ap-southeast-2.amazonaws.com/openchargemap/images/NZ/OCM87695/OCM-87695.thmb.2017051605160185.jpg",
            "Comment": "",
            "IsEnabled": true,
            "IsVideo": false,
            "IsFeaturedItem": false,
            "IsExternalResource": false,
            "User": {
                "ID": 15365,
                "Username": "sliday"
            },
            "DateCreated": "2017-05-16T05:16:00Z"
        }
    ],
    "IsRecentlyVerified": false,
    "ID": 87695,
    "UUID": "79EFC4F4-DBF8-4AF8-9D7F-6F37D33005A9",
    "DataProviderID": 1,
    "UsageCost": "$5",
    "AddressInfo": {
        "ID": 88041,
        "Title": "Featherston Motels and Camping",
        "AddressLine1": "4 Fitzherbert St",
        "Town": "Featherston",
        "Postcode": "5710",
        "CountryID": 161,
        "Latitude": -41.1164974,
        "Longitude": 175.32071700000006,
        "ContactTelephone1": "063089852",
        "DistanceUnit": 0
    },
    "Connections": [
        {
            "ID": 124307,
            "ConnectionTypeID": 4
        },
        {
            "ID": 124308,
            "ConnectionTypeID": 29,
            "Amps": 15
        }
    ],
    "NumberOfPoints": 2,
    "GeneralComments": "Negotiable, eg $5 for a charge.\r\nOn main highway, just a few meters before cafès and shops. Convenient location. Manager is \"Colin\" and he is happy for responsible car owners to recharge at his park. The Blue Commando plugs are outdoor, located where campervans park. A plug adapter to alter the blue commando berths into a small 3-point plug (i.e. 10 amp S3112; this is not the larger earth S3112 15amp plug) is only available if you ring up and arrange prior to visiting.",
    "StatusTypeID": 50,
    "DateLastStatusUpdate": "2017-05-16T05:16:00Z",
    "DataQualityLevel": 1,
    "DateCreated": "2017-05-16T05:16:00Z",
    "SubmissionStatusTypeID": 200
}