{
    "IsRecentlyVerified": false,
    "ID": 183198,
    "UUID": "46F38876-D9C5-4728-B312-50982A1506EA",
    "DataProviderID": 29,
    "DataProvidersReference": "3991",
    "AddressInfo": {
        "ID": 183557,
        "Title": "Schlettstadtallee",
        "AddressLine1": "Schlettstadtallee",
        "Town": "Waldkirch",
        "Postcode": "79183",
        "CountryID": 87,
        "Latitude": 48.094181,
        "Longitude": 7.95892,
        "DistanceUnit": 0
    },
    "Connections": [
        {
            "ID": 289885,
            "ConnectionTypeID": 28,
            "StatusTypeID": 50,
            "LevelID": 2,
            "PowerKW": 22,
            "CurrentTypeID": 20
        },
        {
            "ID": 289886,
            "ConnectionTypeID": 25,
            "StatusTypeID": 50,
            "LevelID": 2,
            "PowerKW": 22,
            "CurrentTypeID": 20
        },
        {
            "ID": 295522,
            "ConnectionTypeID": 28,
            "StatusTypeID": 50,
            "LevelID": 2,
            "PowerKW": 22,
            "CurrentTypeID": 20
        },
        {
            "ID": 295523,
            "ConnectionTypeID": 25,
            "StatusTypeID": 50,
            "LevelID": 2,
            "PowerKW": 22,
            "CurrentTypeID": 20
        }
    ],
    "StatusTypeID": 50,
    "DateLastStatusUpdate": "2021-07-12T02:40:00Z",
    "MetadataValues": [
        {
            "ID": 15491,
            "MetadataFieldID": 4,
            "ItemValue": "Data from the German chargepoint registry provided by Bundesnetzagentur.de under the CC-BY 4.0 license"
        }
    ],
    "DataQualityLevel": 3,
    "DateCreated": "2021-07-08T10:03:00Z",
    "SubmissionStatusTypeID": 100
}