{
    "IsRecentlyVerified": false,
    "ID": 26059,
    "UUID": "6894BEB2-DAA4-4BB4-9344-DA8A99ABDB89",
    "DataProviderID": 2,
    "DataProvidersReference": "61222",
    "UsageTypeID": 1,
    "AddressInfo": {
        "ID": 26405,
        "Title": "Home Depot",
        "AddressLine1": "380 Makaala St",
        "Town": "Hilo",
        "StateOrProvince": "HI",
        "Postcode": "96720",
        "CountryID": 2,
        "Latitude": 19.6985907264786,
        "Longitude": -155.05914064418,
        "ContactTelephone1": "808-920-8400",
        "AccessComments": "24 hours daily",
        "RelatedURL": "",
        "DistanceUnit": 0
    },
    "Connections": [
        {
            "ID": 28426,
            "ConnectionTypeID": 1,
            "LevelID": 2,
            "Amps": 16,
            "Voltage": 230,
            "PowerKW": 3.7,
            "CurrentTypeID": 10,
            "Quantity": 1
        }
    ],
    "DateLastStatusUpdate": "2020-06-26T02:52:00Z",
    "DataQualityLevel": 3,
    "DateCreated": "2014-11-28T03:37:00Z",
    "SubmissionStatusTypeID": 100
}