{
    "IsRecentlyVerified": false,
    "ID": 75803,
    "UUID": "5495FF70-41A1-4C8D-B628-3F45EC34EB92",
    "DataProviderID": 1,
    "OperatorID": 23,
    "OperatorsReference": "23202",
    "UsageTypeID": 1,
    "AddressInfo": {
        "ID": 76149,
        "Title": "Pacific Crest Hotel - Tesla",
        "AddressLine1": "433 Corona Del Mar Dr",
        "Town": "Santa Barbara",
        "StateOrProvince": "CA",
        "Postcode": "93103",
        "CountryID": 2,
        "Latitude": 34.4183195,
        "Longitude": -119.6713812,
        "ContactTelephone1": "805-966-3103  877-798-3752",
        "AccessComments": "24 hours daily; for Tesla use only; for guest use only; see front desk for access",
        "RelatedURL": "http://www.teslamotors.com/supercharger",
        "DistanceUnit": 0
    },
    "Connections": [
        {
            "ID": 109309,
            "ConnectionTypeID": 30,
            "StatusTypeID": 50,
            "LevelID": 2,
            "Amps": 16,
            "Voltage": 230,
            "PowerKW": 16,
            "CurrentTypeID": 10,
            "Quantity": 1
        }
    ],
    "NumberOfPoints": 1,
    "StatusTypeID": 50,
    "DateLastStatusUpdate": "2017-02-02T17:41:00Z",
    "DataQualityLevel": 3,
    "DateCreated": "2016-12-23T01:25:00Z",
    "SubmissionStatusTypeID": 100
}