{
    "IsRecentlyVerified": false,
    "ID": 18738,
    "UUID": "C42C8D22-100B-4984-8762-569EE08794F4",
    "DataProviderID": 15,
    "DataProvidersReference": "30234",
    "OperatorID": 1,
    "UsageTypeID": 1,
    "AddressInfo": {
        "ID": 19083,
        "Title": "?????????????",
        "AddressLine1": "?????????????",
        "Town": "??",
        "StateOrProvince": "",
        "Postcode": "255300",
        "CountryID": 50,
        "Latitude": 36.811209,
        "Longitude": 118.02372,
        "ContactTelephone1": "",
        "RelatedURL": "http://carstations.com/30234",
        "DistanceUnit": 0
    },
    "Connections": [
        {
            "ID": 18971,
            "ConnectionTypeID": 1,
            "Reference": "J1772",
            "LevelID": 2,
            "Quantity": 1
        }
    ],
    "NumberOfPoints": 1,
    "StatusTypeID": 0,
    "DateLastStatusUpdate": "2014-03-22T04:39:00Z",
    "DataQualityLevel": 2,
    "DateCreated": "2013-08-25T03:31:00Z",
    "SubmissionStatusTypeID": 200
}