{
    "IsRecentlyVerified": false,
    "ID": 7029,
    "UUID": "FAF7FFAF-BCAF-4193-A332-74E2869F4F08",
    "DataProviderID": 1,
    "UsageTypeID": 1,
    "UsageCost": "Free",
    "AddressInfo": {
        "ID": 6930,
        "Title": "Parking St Louis",
        "AddressLine1": "1 Rue Claude Vellefaux",
        "AddressLine2": "",
        "Town": "Paris",
        "StateOrProvince": "",
        "Postcode": "75010",
        "CountryID": 80,
        "Latitude": 48.873494,
        "Longitude": 2.369784999999979,
        "ContactTelephone1": "+33 (0)1 42 41 51 80",
        "ContactTelephone2": "",
        "ContactEmail": "st-louis@saemes.fr",
        "AccessComments": "",
        "DistanceUnit": 0
    },
    "Connections": [],
    "NumberOfPoints": 2,
    "GeneralComments": "",
    "DateLastConfirmed": "2011-10-18T09:53:00Z",
    "StatusTypeID": 0,
    "DateLastStatusUpdate": "2011-10-18T09:53:00Z",
    "DataQualityLevel": 1,
    "DateCreated": "2011-10-18T09:53:00Z",
    "SubmissionStatusTypeID": 200
}