{
    "IsRecentlyVerified": false,
    "ID": 56470,
    "UUID": "409A8EEC-1D72-47FF-A6FC-64477D6774C7",
    "DataProviderID": 2,
    "DataProvidersReference": "70680",
    "OperatorID": 5,
    "UsageTypeID": 1,
    "AddressInfo": {
        "ID": 56816,
        "Title": "EVOASIS",
        "AddressLine1": "419 Storke Rd",
        "Town": "Goleta",
        "StateOrProvince": "CA",
        "Postcode": "93117",
        "CountryID": 2,
        "Latitude": 34.4253066,
        "Longitude": -119.8700758,
        "ContactTelephone1": "888-758-4389",
        "AccessComments": "24 hours daily",
        "RelatedURL": "http://www.chargepoint.com/",
        "DistanceUnit": 0
    },
    "Connections": [
        {
            "ID": 71227,
            "ConnectionTypeID": 32,
            "LevelID": 2,
            "Amps": 100,
            "Voltage": 400,
            "PowerKW": 40,
            "CurrentTypeID": 10,
            "Quantity": 1
        }
    ],
    "DateLastStatusUpdate": "2019-04-06T04:02:00Z",
    "DataQualityLevel": 3,
    "DateCreated": "2015-11-04T08:42:00Z",
    "SubmissionStatusTypeID": 100
}