{
    "IsRecentlyVerified": false,
    "ID": 140023,
    "UUID": "E8EA91A6-9238-45D8-8EAF-55C64B96ABA9",
    "DataProviderID": 2,
    "DataProvidersReference": "96085",
    "OperatorID": 9,
    "UsageTypeID": 1,
    "AddressInfo": {
        "ID": 140375,
        "Title": "Patagonia Corporate Office",
        "AddressLine1": "259 W. Santa Clara St.",
        "Town": "Ventura",
        "StateOrProvince": "CA",
        "Postcode": "93001",
        "CountryID": 2,
        "Latitude": 34.280058,
        "Longitude": -119.304035,
        "ContactTelephone1": "888-998-2546",
        "AccessComments": "MON: 24 hours | TUE: 24 hours | WED: 24 hours | THU: 24 hours | FRI: 24 hours | SAT: 24 hours | SUN: 24 hours",
        "RelatedURL": "http://www.blinkcharging.com/",
        "DistanceUnit": 0
    },
    "Connections": [
        {
            "ID": 195546,
            "ConnectionTypeID": 1,
            "LevelID": 2,
            "Amps": 16,
            "Voltage": 230,
            "PowerKW": 3.7,
            "CurrentTypeID": 10,
            "Quantity": 4
        }
    ],
    "StatusTypeID": 50,
    "DateLastStatusUpdate": "2020-06-26T02:57:00Z",
    "DataQualityLevel": 3,
    "DateCreated": "2019-12-24T09:12:00Z",
    "SubmissionStatusTypeID": 100
}