{
    "IsRecentlyVerified": false,
    "ID": 19828,
    "UUID": "ABBBBE77-18DC-4837-AFA4-6E29BF5640ED",
    "DataProviderID": 1,
    "OperatorID": 1,
    "UsageTypeID": 0,
    "UsageCost": "",
    "AddressInfo": {
        "ID": 20173,
        "Title": "Atelier Communautaire LTA",
        "AddressLine1": "Route de Trégastel",
        "AddressLine2": "",
        "Town": "",
        "StateOrProvince": "LANNION",
        "Postcode": "22300",
        "CountryID": 80,
        "Latitude": 48.76196,
        "Longitude": -3.46996,
        "ContactTelephone1": "",
        "ContactTelephone2": "",
        "ContactEmail": "",
        "AccessComments": "Réservé aux clients de l'établissement",
        "RelatedURL": "",
        "DistanceUnit": 0
    },
    "Connections": [],
    "GeneralComments": "",
    "StatusTypeID": 50,
    "DateLastStatusUpdate": "2013-10-18T16:16:00Z",
    "MetadataValues": [
        {
            "ID": 362,
            "MetadataFieldID": 4,
            "ItemValue": "Data © OpenStreetMap contributors, ODbL 1.0. http://www.openstreetmap.org/copyright"
        }
    ],
    "DataQualityLevel": 1,
    "DateCreated": "2013-10-18T04:17:00Z",
    "SubmissionStatusTypeID": 200
}