{
    "IsRecentlyVerified": false,
    "ID": 9022,
    "UUID": "737EF577-3B30-4852-9CFF-50AA462DEEB3",
    "DataProviderID": 15,
    "DataProvidersReference": "12306",
    "OperatorID": 5,
    "AddressInfo": {
        "ID": 8919,
        "Title": "20185 Marketplace Ave",
        "AddressLine1": "20185 Marketplace Ave",
        "Town": "Kyle",
        "StateOrProvince": "Texas",
        "Postcode": "78640",
        "CountryID": 2,
        "Latitude": 29.98910522,
        "Longitude": -97.87722778,
        "ContactTelephone1": "",
        "RelatedURL": "http://carstations.com/12306",
        "DistanceUnit": 0
    },
    "Connections": [
        {
            "ID": 6593,
            "ConnectionTypeID": 1,
            "Reference": "J1772",
            "LevelID": 2,
            "Quantity": 1
        },
        {
            "ID": 7316,
            "ConnectionTypeID": 9,
            "Reference": "NEMA5",
            "LevelID": 1
        }
    ],
    "StatusTypeID": 0,
    "DateLastStatusUpdate": "2017-11-04T14:03:00Z",
    "DataQualityLevel": 1,
    "DateCreated": "2011-12-10T20:50:00Z",
    "SubmissionStatusTypeID": 100
}