{
    "IsRecentlyVerified": false,
    "ID": 33622,
    "UUID": "B49C283B-C2F3-4FCB-A0F0-E8D711AD5766",
    "DataProviderID": 26,
    "DataProvidersReference": "48399",
    "OperatorID": 178,
    "OperatorsReference": "EVnetNL PNB-REE0036",
    "UsageCost": "0.00 jaarabonnement",
    "AddressInfo": {
        "ID": 33968,
        "Title": "Frederik Hendriklaan 100",
        "AddressLine1": "Frederik Hendriklaan 100",
        "Town": "'s-Hertogenbosch",
        "Postcode": "5212 BH",
        "CountryID": 159,
        "Latitude": 51.697644,
        "Longitude": 5.313348,
        "ContactTelephone1": "0800-3522365",
        "RelatedURL": "http://www.evnet.nl",
        "DistanceUnit": 0
    },
    "Connections": [
        {
            "ID": 37133,
            "ConnectionTypeID": 25,
            "LevelID": 1,
            "PowerKW": 2.3,
            "CurrentTypeID": 10
        }
    ],
    "NumberOfPoints": 1,
    "StatusTypeID": 50,
    "DateLastStatusUpdate": "2016-06-04T02:40:00Z",
    "DataQualityLevel": 3,
    "DateCreated": "2015-01-09T06:04:00Z",
    "SubmissionStatusTypeID": 100
}