{
    "IsRecentlyVerified": false,
    "ID": 144621,
    "UUID": "0E2DFABA-8322-445B-A03B-A1C244158643",
    "DataProviderID": 2,
    "DataProvidersReference": "130691",
    "OperatorID": 90,
    "UsageTypeID": 1,
    "AddressInfo": {
        "ID": 144973,
        "Title": "1348 Jean-Talon",
        "AddressLine1": "1348 Jean-Talon",
        "Town": "Montréal",
        "StateOrProvince": "QC",
        "Postcode": "H2E 1S1",
        "CountryID": 44,
        "Latitude": 45.54519,
        "Longitude": -73.60918,
        "ContactTelephone1": "877-505-2674",
        "AccessComments": "24 hours daily",
        "RelatedURL": "https://lecircuitelectrique.com/",
        "DistanceUnit": 0
    },
    "Connections": [
        {
            "ID": 201134,
            "ConnectionTypeID": 1,
            "LevelID": 2,
            "Amps": 16,
            "Voltage": 230,
            "PowerKW": 3.7,
            "CurrentTypeID": 10,
            "Quantity": 2
        }
    ],
    "StatusTypeID": 50,
    "DateLastStatusUpdate": "2020-06-26T03:09:00Z",
    "DataQualityLevel": 3,
    "DateCreated": "2019-12-24T09:23:00Z",
    "SubmissionStatusTypeID": 100
}