{
    "MediaItems": [
        {
            "ID": 28899,
            "ChargePointID": 188501,
            "ItemURL": "https://s3-ap-southeast-2.amazonaws.com/openchargemap/images/CA/OCM188501/OCM-188501.orig.2021080502360022.jpg",
            "ItemThumbnailURL": "https://s3-ap-southeast-2.amazonaws.com/openchargemap/images/CA/OCM188501/OCM-188501.thmb.2021080502360022.jpg",
            "Comment": "",
            "IsEnabled": true,
            "IsVideo": false,
            "IsFeaturedItem": false,
            "IsExternalResource": false,
            "User": {
                "ID": 29018,
                "Username": "Ryan Bullock"
            },
            "DateCreated": "2021-08-05T02:36:00Z"
        }
    ],
    "IsRecentlyVerified": false,
    "ID": 188501,
    "UUID": "9036FF09-A601-4469-AA1E-58CB1E63ADEA",
    "DataProviderID": 1,
    "OperatorID": 89,
    "UsageTypeID": 1,
    "AddressInfo": {
        "ID": 188860,
        "Title": "Lakelse Lake Provincial Park - Furlong Bay",
        "AddressLine1": "3951 Hwy 37 South",
        "Town": "Terrace",
        "StateOrProvince": "BC",
        "Postcode": "V8G 5K8",
        "CountryID": 44,
        "Latitude": 54.38820791500109,
        "Longitude": -128.53440479310393,
        "DistanceUnit": 0
    },
    "Connections": [
        {
            "ID": 304428,
            "ConnectionTypeID": 1,
            "StatusTypeID": 50,
            "LevelID": 2,
            "Voltage": 230,
            "PowerKW": 7,
            "CurrentTypeID": 10,
            "Quantity": 2
        }
    ],
    "NumberOfPoints": 2,
    "StatusTypeID": 50,
    "DateLastStatusUpdate": "2021-08-05T02:36:00Z",
    "DataQualityLevel": 1,
    "DateCreated": "2021-07-30T02:32:00Z",
    "SubmissionStatusTypeID": 200
}