{
    "IsRecentlyVerified": false,
    "ID": 125651,
    "UUID": "F1B3F3B1-717B-46F6-A9A7-2FD711E3F293",
    "DataProviderID": 1,
    "OperatorID": 3,
    "OperatorsReference": "PG-82897",
    "UsageTypeID": 4,
    "UsageCost": "£0.30/kWh",
    "AddressInfo": {
        "ID": 125997,
        "Title": "Horton Park Golf Course",
        "AddressLine1": "Hook Road",
        "AddressLine2": "Stoneleigh",
        "Town": "Epsom",
        "StateOrProvince": "Surrey",
        "Postcode": "KT19 8QG",
        "CountryID": 1,
        "Latitude": 51.355742,
        "Longitude": -0.275281,
        "DistanceUnit": 0
    },
    "Connections": [
        {
            "ID": 176058,
            "ConnectionTypeID": 25,
            "StatusTypeID": 50,
            "LevelID": 2,
            "Amps": 32,
            "Voltage": 230,
            "PowerKW": 7,
            "CurrentTypeID": 10,
            "Quantity": 2
        }
    ],
    "NumberOfPoints": 2,
    "StatusTypeID": 50,
    "DateLastStatusUpdate": "2019-05-13T12:56:00Z",
    "DataQualityLevel": 1,
    "DateCreated": "2019-04-23T09:41:00Z",
    "SubmissionStatusTypeID": 200
}