{
    "IsRecentlyVerified": false,
    "ID": 187312,
    "UUID": "0869067D-8928-46C5-9FF6-A4B88A5C7743",
    "DataProviderID": 29,
    "DataProvidersReference": "14812",
    "OperatorID": 45,
    "AddressInfo": {
        "ID": 187671,
        "Title": "Zum Rauhen Berg 26",
        "AddressLine1": "Zum Rauhen Berg 26",
        "Town": "Grimmen",
        "Postcode": "18507",
        "CountryID": 87,
        "Latitude": 54.105026,
        "Longitude": 13.065589,
        "DistanceUnit": 0
    },
    "Connections": [
        {
            "ID": 302290,
            "ConnectionTypeID": 33,
            "StatusTypeID": 50,
            "LevelID": 3,
            "PowerKW": 22,
            "CurrentTypeID": 30
        },
        {
            "ID": 302291,
            "ConnectionTypeID": 25,
            "StatusTypeID": 50,
            "LevelID": 2,
            "PowerKW": 11,
            "CurrentTypeID": 20
        }
    ],
    "StatusTypeID": 50,
    "DateLastStatusUpdate": "2021-07-12T02:52:00Z",
    "MetadataValues": [
        {
            "ID": 19552,
            "MetadataFieldID": 4,
            "ItemValue": "Data from the German chargepoint registry provided by Bundesnetzagentur.de under the CC-BY 4.0 license"
        }
    ],
    "DataQualityLevel": 3,
    "DateCreated": "2021-07-12T02:52:00Z",
    "SubmissionStatusTypeID": 100
}