{
    "IsRecentlyVerified": false,
    "ID": 104605,
    "UUID": "95F27996-57B7-414A-9B51-A450A23AA8E5",
    "DataProviderID": 1,
    "OperatorID": 125,
    "UsageTypeID": 4,
    "AddressInfo": {
        "ID": 104951,
        "Title": "Donnerschweer Straße",
        "AddressLine1": "Donnerschweer Straße 26",
        "Town": "Oldenburg",
        "StateOrProvince": "Oldenburg",
        "Postcode": "26121",
        "CountryID": 87,
        "Latitude": 53.14612,
        "Longitude": 8.217809999999986,
        "AccessComments": "Rechts neben dem beschranktem Parkplatz. Zufahrt eine Einfahrt vorher. 24/7 nutzbar.",
        "RelatedURL": "http://iam.innogy.com/ueber-innogy/elektromobilitaet",
        "DistanceUnit": 0
    },
    "Connections": [
        {
            "ID": 147640,
            "ConnectionTypeID": 25,
            "StatusTypeID": 50,
            "LevelID": 2,
            "Amps": 32,
            "Voltage": 400,
            "PowerKW": 22,
            "CurrentTypeID": 20,
            "Quantity": 2
        }
    ],
    "NumberOfPoints": 2,
    "StatusTypeID": 50,
    "DateLastStatusUpdate": "2018-05-22T13:53:00Z",
    "DataQualityLevel": 1,
    "DateCreated": "2018-05-22T13:53:00Z",
    "SubmissionStatusTypeID": 200
}