{
    "IsRecentlyVerified": false,
    "ID": 153405,
    "UUID": "CF2668D6-ADCA-44EF-9668-B32448428CC4",
    "DataProviderID": 28,
    "DataProvidersReference": "FRS29PSDE29EKDKM",
    "OperatorID": 3379,
    "UsageTypeID": 5,
    "AddressInfo": {
        "ID": 153758,
        "Title": "Pouldergat - Venelle de Dinaou",
        "AddressLine1": "Venelle de Dinaou - 29224 Pouldergat",
        "CountryID": 80,
        "Latitude": 48.043824,
        "Longitude": -4.326583,
        "AccessComments": "24/24_7/7",
        "DistanceUnit": 0
    },
    "Connections": [
        {
            "ID": 215199,
            "ConnectionTypeID": 1036,
            "StatusTypeID": 50,
            "LevelID": 2,
            "PowerKW": 22,
            "CurrentTypeID": 20
        },
        {
            "ID": 215200,
            "ConnectionTypeID": 28,
            "StatusTypeID": 50,
            "LevelID": 2,
            "PowerKW": 22,
            "CurrentTypeID": 10
        },
        {
            "ID": 248605,
            "ConnectionTypeID": 1036,
            "StatusTypeID": 50,
            "LevelID": 2,
            "PowerKW": 22,
            "CurrentTypeID": 20
        },
        {
            "ID": 248606,
            "ConnectionTypeID": 28,
            "StatusTypeID": 50,
            "LevelID": 2,
            "PowerKW": 22,
            "CurrentTypeID": 10
        }
    ],
    "GeneralComments": "",
    "StatusTypeID": 50,
    "DateLastStatusUpdate": "2020-08-27T05:14:00Z",
    "DataQualityLevel": 2,
    "DateCreated": "2020-03-15T10:54:00Z",
    "SubmissionStatusTypeID": 100
}