{
    "IsRecentlyVerified": false,
    "ID": 70018,
    "UUID": "68C0EC7F-8F7F-4A38-BB67-E52508DC6683",
    "DataProviderID": 1,
    "OperatorID": 32,
    "OperatorsReference": "2609",
    "UsageTypeID": 4,
    "UsageCost": "£0.108/kWh; for Polar Plus subscription members only. Parking fees apply",
    "AddressInfo": {
        "ID": 70364,
        "Title": "Kennet Centre Multi-Storey Car Park",
        "AddressLine1": "Bartholomew Street",
        "Town": "Newbury",
        "StateOrProvince": "West Berkshire",
        "Postcode": "RG14 5EN",
        "CountryID": 1,
        "Latitude": 51.4000195,
        "Longitude": -1.32406230000004,
        "AccessComments": "1st floor, at top of ramp. One bay for general public,  one reserved for Co wheels car club",
        "DistanceUnit": 0
    },
    "Connections": [
        {
            "ID": 98896,
            "ConnectionTypeID": 25,
            "StatusTypeID": 50,
            "LevelID": 2,
            "Amps": 32,
            "Voltage": 400,
            "PowerKW": 22,
            "CurrentTypeID": 20,
            "Quantity": 2
        }
    ],
    "NumberOfPoints": 2,
    "StatusTypeID": 50,
    "DateLastStatusUpdate": "2019-05-04T10:56:00Z",
    "DataQualityLevel": 1,
    "DateCreated": "2016-07-01T21:15:00Z",
    "SubmissionStatusTypeID": 200
}