{
    "IsRecentlyVerified": false,
    "ID": 137122,
    "UUID": "178ACDF1-345C-4BA0-8010-76F2257A8C6F",
    "DataProviderID": 1,
    "DataProvidersReference": "LSB-01100",
    "OperatorID": 21,
    "UsageTypeID": 4,
    "UsageCost": "Mobi.E compatible card",
    "AddressInfo": {
        "ID": 137468,
        "Title": "LSB-01100",
        "AddressLine1": "Entrecampos",
        "Town": "Lisboa",
        "Postcode": "1700-087",
        "CountryID": 180,
        "Latitude": 38.74861111,
        "Longitude": -9.148888889,
        "RelatedURL": "http://www.mobie.pt",
        "DistanceUnit": 0
    },
    "Connections": [
        {
            "ID": 191979,
            "ConnectionTypeID": 25,
            "StatusTypeID": 50,
            "LevelID": 2,
            "Amps": 16,
            "Voltage": 230,
            "PowerKW": 3.7,
            "CurrentTypeID": 10,
            "Quantity": 6
        }
    ],
    "NumberOfPoints": 6,
    "StatusTypeID": 50,
    "DateLastStatusUpdate": "2020-08-18T21:55:00Z",
    "DataQualityLevel": 3,
    "DateCreated": "2019-12-24T08:08:00Z",
    "SubmissionStatusTypeID": 100
}