{
    "IsRecentlyVerified": false,
    "ID": 110406,
    "UUID": "78C794E7-8484-4600-AFA2-5FD2835A0BE8",
    "DataProviderID": 2,
    "DataProvidersReference": "70784",
    "OperatorID": 5,
    "UsageTypeID": 1,
    "AddressInfo": {
        "ID": 110752,
        "Title": "EVERGY",
        "AddressLine1": "914 E North Ave @ Kohls",
        "Town": "Belton",
        "StateOrProvince": "MO",
        "Postcode": "64012",
        "CountryID": 2,
        "Latitude": 38.816621,
        "Longitude": -94.51806,
        "ContactTelephone1": "888-758-4389",
        "AccessComments": "24 hours daily",
        "RelatedURL": "http://www.chargepoint.com/",
        "DistanceUnit": 0
    },
    "Connections": [
        {
            "ID": 155656,
            "ConnectionTypeID": 1,
            "LevelID": 2,
            "Amps": 16,
            "Voltage": 230,
            "PowerKW": 3,
            "CurrentTypeID": 10,
            "Quantity": 6
        }
    ],
    "DateLastStatusUpdate": "2019-12-24T09:15:00Z",
    "DataQualityLevel": 3,
    "DateCreated": "2018-10-18T23:36:00Z",
    "SubmissionStatusTypeID": 100
}