{
    "UserComments": [
        {
            "ID": 8117,
            "ChargePointID": 53055,
            "CommentTypeID": 100,
            "UserName": "rus23",
            "Comment": "Point was installed around 18 months ago but NEVER commissioned (no comms apparently)\n\nIt's on Level 1 not 2 and there are 2 plugs not 4. (I've checked other levels of the car park)",
            "DateCreated": "2015-11-30T14:51:49.11Z",
            "User": {
                "ID": 6643,
                "Username": "rus23"
            },
            "CheckinStatusTypeID": 20
        }
    ],
    "IsRecentlyVerified": false,
    "ID": 53055,
    "UUID": "DFB2C07F-397F-4087-A584-E03151EA8051",
    "DataProviderID": 1,
    "OperatorID": 25,
    "OperatorsReference": "CM-259,CM-294",
    "UsageTypeID": 4,
    "UsageCost": "Free. Parking fees apply.",
    "AddressInfo": {
        "ID": 53401,
        "Title": "NCP Aldersgate",
        "AddressLine1": "158-170 Aldersgate Street",
        "AddressLine2": "City of London",
        "Town": "London",
        "Postcode": "EC1A 4HY",
        "CountryID": 1,
        "Latitude": 51.5181749210381,
        "Longitude": -0.0972906984862987,
        "ContactTelephone1": "0845 850 0653",
        "AccessComments": "On level 2. Max Height - 1.98m",
        "RelatedURL": "http://www.ncp.co.uk/find-a-car-park/car-parks/london-aldersgate/",
        "DistanceUnit": 0
    },
    "Connections": [
        {
            "ID": 66134,
            "ConnectionTypeID": 25,
            "StatusTypeID": 75,
            "LevelID": 2,
            "Amps": 32,
            "Voltage": 230,
            "PowerKW": 4,
            "CurrentTypeID": 10,
            "Quantity": 4
        }
    ],
    "NumberOfPoints": 4,
    "GeneralComments": "Chargemaster posts. Polar Network cards accepted as well as Source London.",
    "StatusTypeID": 75,
    "DateLastStatusUpdate": "2019-04-24T05:16:00Z",
    "DataQualityLevel": 1,
    "DateCreated": "2015-09-17T16:49:00Z",
    "SubmissionStatusTypeID": 200
}