{
    "UserComments": [
        {
            "ID": 13977,
            "ChargePointID": 32922,
            "CommentTypeID": 10,
            "UserName": "Bert van Sas",
            "Rating": 4,
            "DateCreated": "2016-08-05T18:56:55.623Z",
            "User": {
                "ID": 11617,
                "Username": "Bert van Sas"
            },
            "CheckinStatusTypeID": 140
        }
    ],
    "MediaItems": [
        {
            "ID": 7949,
            "ChargePointID": 32922,
            "ItemURL": "https://s3-ap-southeast-2.amazonaws.com/openchargemap/images/NL/OCM32922/OCM-32922.orig.2016080518563213.jpg",
            "ItemThumbnailURL": "https://s3-ap-southeast-2.amazonaws.com/openchargemap/images/NL/OCM32922/OCM-32922.thmb.2016080518563213.jpg",
            "Comment": "",
            "IsEnabled": true,
            "IsVideo": false,
            "IsFeaturedItem": false,
            "IsExternalResource": false,
            "User": {
                "ID": 11617,
                "Username": "Bert van Sas"
            },
            "DateCreated": "2016-08-05T18:57:00Z"
        },
        {
            "ID": 7948,
            "ChargePointID": 32922,
            "ItemURL": "https://s3-ap-southeast-2.amazonaws.com/openchargemap/images/NL/OCM32922/OCM-32922.orig.2016080518561037.jpg",
            "ItemThumbnailURL": "https://s3-ap-southeast-2.amazonaws.com/openchargemap/images/NL/OCM32922/OCM-32922.thmb.2016080518561037.jpg",
            "Comment": "Avec le card eg. de TheNewMotion les points de charge s'ouvrirent. / Use eg. the TheNewMotion card and the charging points 'open'.",
            "IsEnabled": true,
            "IsVideo": false,
            "IsFeaturedItem": false,
            "IsExternalResource": false,
            "User": {
                "ID": 11617,
                "Username": "Bert van Sas"
            },
            "DateCreated": "2016-08-05T18:56:00Z"
        },
        {
            "ID": 7946,
            "ChargePointID": 32922,
            "ItemURL": "https://s3-ap-southeast-2.amazonaws.com/openchargemap/images/NL/OCM32922/OCM-32922.orig.2016080518502649.jpg",
            "ItemThumbnailURL": "https://s3-ap-southeast-2.amazonaws.com/openchargemap/images/NL/OCM32922/OCM-32922.thmb.2016080518502649.jpg",
            "Comment": "",
            "IsEnabled": true,
            "IsVideo": false,
            "IsFeaturedItem": false,
            "IsExternalResource": false,
            "User": {
                "ID": 11617,
                "Username": "Bert van Sas"
            },
            "DateCreated": "2016-08-05T18:51:00Z"
        },
        {
            "ID": 7947,
            "ChargePointID": 32922,
            "ItemURL": "https://s3-ap-southeast-2.amazonaws.com/openchargemap/images/NL/OCM32922/OCM-32922.orig.2016080518505623.jpg",
            "ItemThumbnailURL": "https://s3-ap-southeast-2.amazonaws.com/openchargemap/images/NL/OCM32922/OCM-32922.thmb.2016080518505623.jpg",
            "Comment": "",
            "IsEnabled": true,
            "IsVideo": false,
            "IsFeaturedItem": false,
            "IsExternalResource": false,
            "User": {
                "ID": 11617,
                "Username": "Bert van Sas"
            },
            "DateCreated": "2016-08-05T18:51:00Z"
        }
    ],
    "IsRecentlyVerified": false,
    "ID": 32922,
    "UUID": "8A370248-F3FD-40F9-86C8-737804E65082",
    "DataProviderID": 26,
    "DataProvidersReference": "48476",
    "OperatorID": 178,
    "OperatorsReference": "EVnetNL REE031",
    "UsageCost": "0.00 jaarabonnement",
    "AddressInfo": {
        "ID": 33268,
        "Title": "Zanddijk",
        "AddressLine1": "Zanddijk",
        "Town": "Reimerswaal",
        "Postcode": "4416 PS",
        "CountryID": 159,
        "Latitude": 51.464716,
        "Longitude": 4.027234,
        "ContactTelephone1": "0800-3522365",
        "RelatedURL": "http://www.evnet.nl",
        "DistanceUnit": 0
    },
    "Connections": [
        {
            "ID": 36433,
            "ConnectionTypeID": 25,
            "LevelID": 2,
            "PowerKW": 11,
            "CurrentTypeID": 10
        },
        {
            "ID": 95387,
            "ConnectionTypeID": 25,
            "LevelID": 2,
            "PowerKW": 11,
            "CurrentTypeID": 10
        },
        {
            "ID": 95388,
            "ConnectionTypeID": 25,
            "LevelID": 2,
            "PowerKW": 11,
            "CurrentTypeID": 10
        },
        {
            "ID": 95389,
            "ConnectionTypeID": 25,
            "LevelID": 2,
            "PowerKW": 11,
            "CurrentTypeID": 10
        }
    ],
    "NumberOfPoints": 2,
    "StatusTypeID": 50,
    "DateLastStatusUpdate": "2016-08-05T18:57:00Z",
    "DataQualityLevel": 3,
    "DateCreated": "2015-01-09T06:03:00Z",
    "SubmissionStatusTypeID": 100
}