{
    "IsRecentlyVerified": false,
    "ID": 54106,
    "UUID": "EEE8899F-27C9-406F-A764-E2DA58192085",
    "DataProviderID": 1,
    "OperatorID": 101,
    "UsageTypeID": 4,
    "AddressInfo": {
        "ID": 54452,
        "Title": "Autohaus Hettinger",
        "AddressLine1": "Würzburger Straße 17-21",
        "Town": "Kolitzheim",
        "Postcode": "97509",
        "CountryID": 87,
        "Latitude": 49.8411157,
        "Longitude": 9.6075697,
        "ContactTelephone1": "+49 (0)9391 9844-0",
        "AccessComments": "Rund um die Uhr (24/7) nutzbar. Position: Säule befindet sich vor Karosserie Lackzentrum\r\n",
        "RelatedURL": "http://www.autohaus-hettinger.de",
        "DistanceUnit": 0
    },
    "Connections": [
        {
            "ID": 67880,
            "ConnectionTypeID": 28,
            "StatusTypeID": 50,
            "LevelID": 2,
            "PowerKW": 3.7,
            "CurrentTypeID": 10,
            "Quantity": 1
        },
        {
            "ID": 67881,
            "ConnectionTypeID": 25,
            "StatusTypeID": 50,
            "LevelID": 2,
            "PowerKW": 11,
            "CurrentTypeID": 20,
            "Quantity": 1
        },
        {
            "ID": 67882,
            "ConnectionTypeID": 16,
            "StatusTypeID": 50,
            "LevelID": 2,
            "PowerKW": 3.7,
            "CurrentTypeID": 10,
            "Quantity": 0
        },
        {
            "ID": 67883,
            "ConnectionTypeID": 17,
            "StatusTypeID": 50,
            "LevelID": 2,
            "PowerKW": 0,
            "CurrentTypeID": 20,
            "Quantity": 0
        },
        {
            "ID": 67884,
            "ConnectionTypeID": 2,
            "StatusTypeID": 50,
            "LevelID": 2,
            "PowerKW": 0,
            "CurrentTypeID": 30,
            "Quantity": 0
        },
        {
            "ID": 67885,
            "ConnectionTypeID": 33,
            "StatusTypeID": 50,
            "LevelID": 2,
            "PowerKW": 0,
            "CurrentTypeID": 30,
            "Quantity": 0
        }
    ],
    "NumberOfPoints": 2,
    "StatusTypeID": 50,
    "DateLastStatusUpdate": "2015-09-23T18:59:00Z",
    "DataQualityLevel": 1,
    "DateCreated": "2015-09-22T21:40:00Z",
    "SubmissionStatusTypeID": 200
}