{
    "IsRecentlyVerified": false,
    "ID": 183015,
    "UUID": "A4F82847-06B4-4E21-A42A-7C2C3F33E57D",
    "DataProviderID": 29,
    "DataProvidersReference": "17568,7777",
    "OperatorID": 86,
    "AddressInfo": {
        "ID": 183374,
        "Title": "Vietingstr. 50",
        "AddressLine1": "Vietingstr. 50",
        "Town": "Bochum",
        "Postcode": "44866",
        "CountryID": 87,
        "Latitude": 51.476168,
        "Longitude": 7.153307,
        "DistanceUnit": 0
    },
    "Connections": [
        {
            "ID": 289463,
            "ConnectionTypeID": 33,
            "StatusTypeID": 50,
            "LevelID": 3,
            "PowerKW": 300,
            "CurrentTypeID": 30
        },
        {
            "ID": 289464,
            "ConnectionTypeID": 33,
            "StatusTypeID": 50,
            "LevelID": 3,
            "PowerKW": 300,
            "CurrentTypeID": 30
        },
        {
            "ID": 289465,
            "ConnectionTypeID": 33,
            "StatusTypeID": 50,
            "LevelID": 3,
            "PowerKW": 300,
            "CurrentTypeID": 30
        },
        {
            "ID": 289466,
            "ConnectionTypeID": 33,
            "StatusTypeID": 50,
            "LevelID": 3,
            "PowerKW": 300,
            "CurrentTypeID": 30
        }
    ],
    "StatusTypeID": 50,
    "DateLastStatusUpdate": "2021-07-09T03:24:00Z",
    "MetadataValues": [
        {
            "ID": 15308,
            "MetadataFieldID": 4,
            "ItemValue": "Data from the German chargepoint registry provided by Bundesnetzagentur.de under the CC-BY 4.0 license"
        }
    ],
    "DataQualityLevel": 3,
    "DateCreated": "2021-07-08T10:03:00Z",
    "SubmissionStatusTypeID": 100
}