{
    "IsRecentlyVerified": false,
    "ID": 155345,
    "UUID": "BC217E8D-5FE7-4958-9A2A-1454EC89B9BE",
    "DataProviderID": 1,
    "OperatorID": 32,
    "UsageTypeID": 5,
    "UsageCost": "£0.30/kWh (Contactless Payment); £0.15/kWh (Polar Plus subscription); £0.25/kWh (Polar Instant app)",
    "AddressInfo": {
        "ID": 155699,
        "Title": "Harvester Grays",
        "AddressLine1": " Arterial Road A1306",
        "AddressLine2": "South Stifford",
        "Town": "Thurrock",
        "StateOrProvince": "Essex",
        "Postcode": "RM16 6UT",
        "CountryID": 1,
        "Latitude": 51.49427868620688,
        "Longitude": 0.30408532745582306,
        "DistanceUnit": 0
    },
    "Connections": [
        {
            "ID": 218705,
            "ConnectionTypeID": 33,
            "StatusTypeID": 50,
            "LevelID": 3,
            "PowerKW": 50,
            "CurrentTypeID": 30,
            "Quantity": 1
        },
        {
            "ID": 218706,
            "ConnectionTypeID": 2,
            "StatusTypeID": 50,
            "LevelID": 3,
            "PowerKW": 50,
            "CurrentTypeID": 30,
            "Quantity": 1
        },
        {
            "ID": 218707,
            "ConnectionTypeID": 1036,
            "StatusTypeID": 50,
            "LevelID": 3,
            "Amps": 63,
            "Voltage": 400,
            "PowerKW": 43,
            "CurrentTypeID": 20,
            "Quantity": 1
        }
    ],
    "NumberOfPoints": 1,
    "StatusTypeID": 50,
    "DateLastStatusUpdate": "2020-04-07T09:35:00Z",
    "DataQualityLevel": 1,
    "DateCreated": "2020-04-07T09:35:00Z",
    "SubmissionStatusTypeID": 200
}