{
    "UserComments": [
        {
            "ID": 19958,
            "ChargePointID": 13944,
            "CommentTypeID": 10,
            "UserName": "Hypermile",
            "Comment": "Equipment looks new.  Display is clear and with good contrast.",
            "DateCreated": "2018-08-01T23:53:34.16Z",
            "User": {
                "ID": 11824,
                "Username": "Hypermile"
            },
            "CheckinStatusTypeID": 140
        }
    ],
    "MediaItems": [
        {
            "ID": 16096,
            "ChargePointID": 13944,
            "ItemURL": "https://s3-ap-southeast-2.amazonaws.com/openchargemap/images/US/OCM13944/OCM-13944.orig.2018080123522099.jpg",
            "ItemThumbnailURL": "https://s3-ap-southeast-2.amazonaws.com/openchargemap/images/US/OCM13944/OCM-13944.thmb.2018080123522099.jpg",
            "Comment": "",
            "IsEnabled": true,
            "IsVideo": false,
            "IsFeaturedItem": false,
            "IsExternalResource": false,
            "User": {
                "ID": 11824,
                "Username": "Hypermile"
            },
            "DateCreated": "2018-08-01T23:53:00Z"
        },
        {
            "ID": 16097,
            "ChargePointID": 13944,
            "ItemURL": "https://s3-ap-southeast-2.amazonaws.com/openchargemap/images/US/OCM13944/OCM-13944.orig.2018080123524873.jpg",
            "ItemThumbnailURL": "https://s3-ap-southeast-2.amazonaws.com/openchargemap/images/US/OCM13944/OCM-13944.thmb.2018080123524873.jpg",
            "Comment": "",
            "IsEnabled": true,
            "IsVideo": false,
            "IsFeaturedItem": false,
            "IsExternalResource": false,
            "User": {
                "ID": 11824,
                "Username": "Hypermile"
            },
            "DateCreated": "2018-08-01T23:53:00Z"
        }
    ],
    "IsRecentlyVerified": false,
    "ID": 13944,
    "UUID": "89D7BD95-6542-4547-A3FA-C729DE34FAFB",
    "DataProviderID": 1,
    "OperatorID": 5,
    "UsageTypeID": 1,
    "AddressInfo": {
        "ID": 13841,
        "Title": "East Palatine Road",
        "AddressLine1": "East Palatine Road",
        "Town": "Palatine",
        "StateOrProvince": "Cook County",
        "Postcode": "60067",
        "CountryID": 2,
        "Latitude": 42.11084927919614,
        "Longitude": -88.03436750793458,
        "ContactTelephone1": "888-758-4389",
        "AccessComments": "24 hours daily",
        "RelatedURL": "http://www.chargepoint.com/",
        "DistanceUnit": 0
    },
    "Connections": [
        {
            "ID": 11373,
            "ConnectionTypeID": 1,
            "LevelID": 2,
            "Amps": 16,
            "Voltage": 230,
            "PowerKW": 3,
            "CurrentTypeID": 10,
            "Quantity": 1
        },
        {
            "ID": 21392,
            "ConnectionTypeID": 1,
            "LevelID": 2,
            "Quantity": 1
        }
    ],
    "NumberOfPoints": 2,
    "StatusTypeID": 0,
    "DateLastStatusUpdate": "2018-08-02T21:50:00Z",
    "DataQualityLevel": 3,
    "DateCreated": "2012-12-06T16:48:00Z",
    "SubmissionStatusTypeID": 100
}