{
    "IsRecentlyVerified": false,
    "ID": 170686,
    "UUID": "D09B4726-BFFD-4D5A-A4BC-1C1B89B013C8",
    "DataProviderID": 1,
    "OperatorID": 3,
    "OperatorsReference": "PG-80619",
    "UsageTypeID": 4,
    "UsageCost": "Free",
    "AddressInfo": {
        "ID": 171045,
        "Title": "Sainsbury's Mansfield",
        "AddressLine1": "Nottingham Road",
        "Town": "Mansfield",
        "Postcode": "NG18 1BW",
        "CountryID": 1,
        "Latitude": 53.134298,
        "Longitude": -1.198228,
        "DistanceUnit": 0
    },
    "Connections": [
        {
            "ID": 260671,
            "ConnectionTypeID": 25,
            "StatusTypeID": 50,
            "LevelID": 2,
            "Amps": 16,
            "Voltage": 230,
            "PowerKW": 3,
            "CurrentTypeID": 10,
            "Quantity": 2
        }
    ],
    "NumberOfPoints": 2,
    "GeneralComments": "This is an open charge unit installed at the Sainsbury's store in Nottingham Road, Mansfield",
    "StatusTypeID": 50,
    "DateLastStatusUpdate": "2020-12-05T11:10:00Z",
    "DataQualityLevel": 1,
    "DateCreated": "2020-12-05T10:33:00Z",
    "SubmissionStatusTypeID": 200
}