{
    "IsRecentlyVerified": false,
    "ID": 42737,
    "UUID": "68631B50-840B-4F66-A7BB-0C1A182A2750",
    "DataProviderID": 1,
    "OperatorID": 7,
    "OperatorsReference": "PG-80566",
    "UsageTypeID": 4,
    "UsageCost": "Free",
    "AddressInfo": {
        "ID": 43083,
        "Title": "Wilsons of Epsom Nissan",
        "AddressLine1": "Kiln Lane",
        "Town": "Epsom",
        "StateOrProvince": "Surrey",
        "Postcode": "KT17 1DH",
        "CountryID": 1,
        "Latitude": 51.3413094172363,
        "Longitude": -0.261697769165039,
        "ContactTelephone1": "+44 844 244 7100",
        "AccessComments": "Available during dealer opening hours only Mo-Sa 09:00-18:00 Su 10:00-17:00",
        "RelatedURL": "http://www.wilsons.co.uk/",
        "DistanceUnit": 0
    },
    "Connections": [
        {
            "ID": 51573,
            "ConnectionTypeID": 25,
            "StatusTypeID": 50,
            "LevelID": 2,
            "Amps": 32,
            "Voltage": 230,
            "PowerKW": 7,
            "CurrentTypeID": 10,
            "Quantity": 6
        }
    ],
    "NumberOfPoints": 6,
    "StatusTypeID": 50,
    "DateLastStatusUpdate": "2020-06-02T09:40:00Z",
    "DataQualityLevel": 1,
    "DateCreated": "2015-03-20T06:35:00Z",
    "SubmissionStatusTypeID": 200
}