{
    "IsRecentlyVerified": false,
    "ID": 153053,
    "UUID": "12D6AAF6-5497-457F-A1CA-77607FCBBCF2",
    "DataProviderID": 28,
    "DataProvidersReference": "FR*S56*P56255*A",
    "OperatorID": 3379,
    "UsageTypeID": 5,
    "AddressInfo": {
        "ID": 153406,
        "Title": "Rue des Templiers",
        "AddressLine1": "Rue des Templiers 56250 Treffléan",
        "CountryID": 80,
        "Latitude": 47.682369,
        "Longitude": -2.614167,
        "AccessComments": "24/24 7/7 jours",
        "DistanceUnit": 0
    },
    "Connections": [
        {
            "ID": 214535,
            "ConnectionTypeID": 25,
            "StatusTypeID": 50,
            "LevelID": 2,
            "PowerKW": 18,
            "CurrentTypeID": 20
        },
        {
            "ID": 214536,
            "ConnectionTypeID": 28,
            "StatusTypeID": 50,
            "LevelID": 2,
            "PowerKW": 18,
            "CurrentTypeID": 10
        },
        {
            "ID": 247857,
            "ConnectionTypeID": 25,
            "StatusTypeID": 50,
            "LevelID": 2,
            "PowerKW": 18,
            "CurrentTypeID": 20
        },
        {
            "ID": 247858,
            "ConnectionTypeID": 28,
            "StatusTypeID": 50,
            "LevelID": 2,
            "PowerKW": 18,
            "CurrentTypeID": 10
        }
    ],
    "GeneralComments": "Tarif abonné Morbihan Energies: 18€ ttc/an, puis 0,25€ ttc/kWh consommé. Non abonné: 2€ ttc/charge (3€ sur bornes rapides), puis 0,25€ ttc/kWh consommé. Pénalités applicables au temps si branchement > 6 heures (2 heures sur bornes rapides) : 5€ ttc/heure",
    "StatusTypeID": 50,
    "DateLastStatusUpdate": "2020-08-27T05:14:00Z",
    "DataQualityLevel": 2,
    "DateCreated": "2020-03-15T10:54:00Z",
    "SubmissionStatusTypeID": 100
}