{
    "IsRecentlyVerified": false,
    "ID": 100940,
    "UUID": "34F42D56-2FD5-4540-AAB1-EED791B4704C",
    "DataProviderID": 1,
    "OperatorID": 23,
    "OperatorsReference": "41247",
    "UsageTypeID": 4,
    "AddressInfo": {
        "ID": 101286,
        "Title": "Torre Reforma",
        "AddressLine1": "Paseo de la Reforma 483",
        "Town": "Cuauhtemoc",
        "StateOrProvince": "Ciudad de Mexico",
        "Postcode": "06500",
        "CountryID": 146,
        "Latitude": 19.424493,
        "Longitude": -99.174288,
        "ContactTelephone1": "+52 55 91563500",
        "DistanceUnit": 0
    },
    "Connections": [
        {
            "ID": 142535,
            "ConnectionTypeID": 30,
            "StatusTypeID": 50,
            "LevelID": 2,
            "PowerKW": 16,
            "CurrentTypeID": 20,
            "Quantity": 2
        }
    ],
    "NumberOfPoints": 2,
    "GeneralComments": "2 Tesla Connectors, up to 16kW.Available for customers. Self park.",
    "StatusTypeID": 50,
    "DateLastStatusUpdate": "2018-03-13T06:52:00Z",
    "DataQualityLevel": 1,
    "DateCreated": "2018-03-13T06:52:00Z",
    "SubmissionStatusTypeID": 200
}