{
    "IsRecentlyVerified": false,
    "ID": 61987,
    "UUID": "0118EB29-B57E-495C-B9D5-C887FA321E37",
    "DataProviderID": 2,
    "DataProvidersReference": "72883",
    "OperatorID": 1242,
    "UsageTypeID": 2,
    "AddressInfo": {
        "ID": 62333,
        "Title": "Station L",
        "AddressLine1": "1900  Prairie City Rd",
        "Town": "Folsom",
        "StateOrProvince": "CA",
        "Postcode": "95630",
        "CountryID": 2,
        "Latitude": 38.6440988062,
        "Longitude": -121.1645737814,
        "ContactTelephone1": "855-443-3873",
        "AccessComments": "",
        "RelatedURL": "https://www.gewattstation.com",
        "DistanceUnit": 0
    },
    "Connections": [
        {
            "ID": 78886,
            "ConnectionTypeID": 1,
            "LevelID": 2,
            "Amps": 16,
            "Voltage": 230,
            "PowerKW": 3.7,
            "CurrentTypeID": 10,
            "Quantity": 1
        }
    ],
    "DateLastStatusUpdate": "2020-06-26T03:00:00Z",
    "DataQualityLevel": 3,
    "DateCreated": "2016-03-03T11:38:00Z",
    "SubmissionStatusTypeID": 100
}