{
    "IsRecentlyVerified": false,
    "ID": 123457,
    "UUID": "BF507CB5-20AA-47B7-B89E-BE71C62856A0",
    "DataProviderID": 2,
    "DataProvidersReference": "81653",
    "OperatorID": 5,
    "UsageTypeID": 1,
    "AddressInfo": {
        "ID": 123803,
        "Title": "HPD",
        "AddressLine1": "319 N Douty St",
        "Town": "Hanford",
        "StateOrProvince": "CA",
        "Postcode": "93230",
        "CountryID": 2,
        "Latitude": 36.3286162,
        "Longitude": -119.6454176,
        "ContactTelephone1": "888-758-4389",
        "AccessComments": "24 hours daily",
        "RelatedURL": "http://www.chargepoint.com/",
        "DistanceUnit": 0
    },
    "Connections": [
        {
            "ID": 173438,
            "ConnectionTypeID": 1,
            "LevelID": 2,
            "Amps": 16,
            "Voltage": 230,
            "PowerKW": 3,
            "CurrentTypeID": 10,
            "Quantity": 2
        }
    ],
    "DateLastStatusUpdate": "2019-12-24T09:13:00Z",
    "DataQualityLevel": 3,
    "DateCreated": "2019-04-06T05:03:00Z",
    "SubmissionStatusTypeID": 100
}