{
    "IsRecentlyVerified": false,
    "ID": 145538,
    "UUID": "38E87CD3-A722-4CFE-99B7-B9AA797C87CA",
    "DataProviderID": 2,
    "DataProvidersReference": "147786",
    "OperatorID": 39,
    "UsageTypeID": 1,
    "AddressInfo": {
        "ID": 145890,
        "Title": "Lake Crescent Lodge",
        "AddressLine1": "416 Lake Crescent Road",
        "Town": "Port Angeles",
        "StateOrProvince": "WA",
        "Postcode": "98363",
        "CountryID": 2,
        "Latitude": 48.0570862,
        "Longitude": -123.800045,
        "ContactTelephone1": "800-663-5633",
        "AccessComments": "MO: Not Specified; TU: Not Specified; WE: Not Specified; TH: Not Specified; FR: Not Specified; SA: Not Specified; SU: Not Specified",
        "RelatedURL": "http://www.semacharge.com/",
        "DistanceUnit": 0
    },
    "Connections": [
        {
            "ID": 202239,
            "ConnectionTypeID": 1,
            "LevelID": 2,
            "Amps": 16,
            "Voltage": 230,
            "PowerKW": 3.7,
            "CurrentTypeID": 10,
            "Quantity": 2
        }
    ],
    "StatusTypeID": 50,
    "DateLastStatusUpdate": "2020-06-26T03:11:00Z",
    "DataQualityLevel": 3,
    "DateCreated": "2019-12-24T09:25:00Z",
    "SubmissionStatusTypeID": 100
}