{
    "IsRecentlyVerified": false,
    "ID": 34355,
    "UUID": "E858E971-779C-47D1-92C3-1D9BBE70BCF6",
    "DataProviderID": 26,
    "DataProvidersReference": "49254",
    "OperatorID": 73,
    "OperatorsReference": "EV-Box EVB-P1415079",
    "UsageCost": "0.00 jaarabonnement",
    "AddressInfo": {
        "ID": 34701,
        "Title": "Maasstraat 8B",
        "AddressLine1": "Maasstraat 8B",
        "Town": "Rotterdam",
        "Postcode": "3016 DC",
        "CountryID": 159,
        "Latitude": 51.90881,
        "Longitude": 4.48125,
        "RelatedURL": "http://www.ev-box.nl",
        "DistanceUnit": 0
    },
    "Connections": [
        {
            "ID": 37866,
            "ConnectionTypeID": 25,
            "LevelID": 2,
            "PowerKW": 11,
            "CurrentTypeID": 10
        },
        {
            "ID": 47207,
            "ConnectionTypeID": 25,
            "LevelID": 2,
            "PowerKW": 11,
            "CurrentTypeID": 10
        }
    ],
    "NumberOfPoints": 1,
    "StatusTypeID": 50,
    "DateLastStatusUpdate": "2016-06-04T02:42:00Z",
    "DataQualityLevel": 3,
    "DateCreated": "2015-01-09T06:04:00Z",
    "SubmissionStatusTypeID": 100
}