{
    "IsRecentlyVerified": false,
    "ID": 160321,
    "UUID": "10ECAA27-51FD-4A70-9CCC-0AA149315E9B",
    "DataProviderID": 1,
    "OperatorID": 5,
    "UsageTypeID": 1,
    "AddressInfo": {
        "ID": 160678,
        "Title": "PACIFIC POWER",
        "AddressLine1": "1264 Salmon River Hwy",
        "Town": "Otis",
        "StateOrProvince": "OR",
        "Postcode": "97368",
        "CountryID": 2,
        "Latitude": 45.019003,
        "Longitude": -123.949451,
        "ContactTelephone1": "888-758-4389",
        "AccessComments": "24 hours daily",
        "RelatedURL": "http://www.chargepoint.com/",
        "DistanceUnit": 0
    },
    "Connections": [
        {
            "ID": 230669,
            "ConnectionTypeID": 2,
            "LevelID": 3,
            "Amps": 150,
            "Voltage": 400,
            "PowerKW": 62.5,
            "CurrentTypeID": 30,
            "Quantity": 4
        },
        {
            "ID": 230670,
            "ConnectionTypeID": 32,
            "LevelID": 3,
            "Amps": 150,
            "Voltage": 400,
            "PowerKW": 62.5,
            "CurrentTypeID": 30,
            "Quantity": 4
        }
    ],
    "NumberOfPoints": 4,
    "StatusTypeID": 50,
    "DateLastStatusUpdate": "2020-08-21T07:28:00Z",
    "DataQualityLevel": 3,
    "DateCreated": "2020-06-26T03:08:00Z",
    "SubmissionStatusTypeID": 100
}