{
    "IsRecentlyVerified": false,
    "ID": 60297,
    "UUID": "EDD98E92-EE1E-4F69-BEE4-4E44D7445B20",
    "DataProviderID": 1,
    "OperatorID": 80,
    "UsageTypeID": 4,
    "UsageCost": "0,40 €/kW",
    "AddressInfo": {
        "ID": 60643,
        "Title": "Eneldrive (ex SILFI) Centro Sportivo Galluzzo",
        "AddressLine1": "Piazza Don Pietro Puliti, 7",
        "AddressLine2": "Gavinana Galluzzo",
        "Town": "Firenze",
        "StateOrProvince": "FI",
        "Postcode": "50124",
        "CountryID": 112,
        "Latitude": 43.7352843682095,
        "Longitude": 11.226145015534,
        "RelatedURL": "http://eneldrive.it",
        "DistanceUnit": 0
    },
    "Connections": [
        {
            "ID": 76334,
            "ConnectionTypeID": 36,
            "StatusTypeID": 50,
            "LevelID": 2,
            "Amps": 16,
            "Voltage": 240,
            "PowerKW": 3,
            "CurrentTypeID": 10,
            "Quantity": 3
        },
        {
            "ID": 76335,
            "ConnectionTypeID": 25,
            "StatusTypeID": 50,
            "LevelID": 2,
            "Amps": 32,
            "Voltage": 400,
            "PowerKW": 22,
            "CurrentTypeID": 20,
            "Quantity": 1
        }
    ],
    "NumberOfPoints": 4,
    "StatusTypeID": 50,
    "DateLastStatusUpdate": "2016-01-19T13:47:00Z",
    "DataQualityLevel": 1,
    "DateCreated": "2016-01-19T13:42:00Z",
    "SubmissionStatusTypeID": 200
}