{
    "IsRecentlyVerified": false,
    "ID": 110150,
    "UUID": "2B879217-5ED2-4C1C-8383-252723D7EFCC",
    "DataProviderID": 2,
    "DataProvidersReference": "103608",
    "OperatorID": 59,
    "UsageTypeID": 1,
    "AddressInfo": {
        "ID": 110496,
        "Title": "Greenlots - 12937",
        "AddressLine1": "321 S Gardner St",
        "Town": "Los Angeles",
        "StateOrProvince": "CA",
        "Postcode": "90036",
        "CountryID": 2,
        "Latitude": 34.0694885253906,
        "Longitude": -118.353126525879,
        "ContactTelephone1": "855-900-7584",
        "AccessComments": "24 hours daily",
        "RelatedURL": "http://greenlots.com/",
        "DistanceUnit": 0
    },
    "Connections": [
        {
            "ID": 155383,
            "ConnectionTypeID": 1,
            "LevelID": 2,
            "Amps": 16,
            "Voltage": 230,
            "PowerKW": 3,
            "CurrentTypeID": 10,
            "Quantity": 1
        }
    ],
    "DateLastStatusUpdate": "2019-04-06T04:01:00Z",
    "DataQualityLevel": 3,
    "DateCreated": "2018-10-18T23:35:00Z",
    "SubmissionStatusTypeID": 100
}