{
    "IsRecentlyVerified": false,
    "ID": 74915,
    "UUID": "5F4B88B7-E335-45CA-AA5D-8BC7222143BD",
    "DataProviderID": 1,
    "OperatorID": 234,
    "UsageTypeID": 4,
    "AddressInfo": {
        "ID": 75261,
        "Title": "Sparkasse",
        "AddressLine1": "Wallensteinstraße 24",
        "Town": "Nürnberg",
        "StateOrProvince": "Bayern",
        "Postcode": "90439",
        "CountryID": 87,
        "Latitude": 49.4396293969439,
        "Longitude": 11.0375333417336,
        "AccessComments": "24/7 nutzbar. Freischaltung per sms/ladekarte oder App.",
        "RelatedURL": "http://www.ladeverbund-frankenplus.de/",
        "DistanceUnit": 0
    },
    "Connections": [
        {
            "ID": 108089,
            "ConnectionTypeID": 25,
            "StatusTypeID": 50,
            "LevelID": 2,
            "Amps": 32,
            "Voltage": 400,
            "PowerKW": 22,
            "CurrentTypeID": 20,
            "Quantity": 2
        }
    ],
    "NumberOfPoints": 2,
    "StatusTypeID": 50,
    "DateLastStatusUpdate": "2018-11-29T09:48:00Z",
    "DataQualityLevel": 1,
    "DateCreated": "2016-12-08T07:24:00Z",
    "SubmissionStatusTypeID": 200
}