{
    "IsRecentlyVerified": false,
    "ID": 89578,
    "UUID": "B7C04715-C233-40B2-927E-0ED806B3F58F",
    "DataProviderID": 2,
    "DataProvidersReference": "85626",
    "UsageTypeID": 2,
    "AddressInfo": {
        "ID": 89924,
        "Title": "Eagle River Water & Sanitation District",
        "AddressLine1": "870 Beaver Creek Blvd",
        "Town": "Avon",
        "StateOrProvince": "CO",
        "Postcode": "81620",
        "CountryID": 2,
        "Latitude": 39.637812,
        "Longitude": -106.534988,
        "ContactTelephone1": "",
        "AccessComments": "For fleet vehicle use only",
        "RelatedURL": "",
        "DistanceUnit": 0
    },
    "Connections": [
        {
            "ID": 126993,
            "ConnectionTypeID": 1,
            "LevelID": 2,
            "Amps": 16,
            "Voltage": 230,
            "PowerKW": 3.7,
            "CurrentTypeID": 10,
            "Quantity": 1
        }
    ],
    "DateLastStatusUpdate": "2020-06-26T03:02:00Z",
    "DataQualityLevel": 3,
    "DateCreated": "2017-06-22T08:16:00Z",
    "SubmissionStatusTypeID": 100
}