{
    "UserComments": [
        {
            "ID": 159,
            "ChargePointID": 2635,
            "CommentTypeID": 10,
            "UserName": "Lloyd",
            "Comment": "Not operational, though new equipment planned",
            "DateCreated": "2012-09-02T06:09:46.07Z"
        }
    ],
    "IsRecentlyVerified": false,
    "ID": 2635,
    "UUID": "2C27BFF1-5EB1-4BA1-B39D-BF6EFBC19B59",
    "DataProviderID": 2,
    "DataProvidersReference": "21713",
    "UsageTypeID": 1,
    "AddressInfo": {
        "ID": 2636,
        "Title": "San Luis Obispo County Air Pollution Control District",
        "AddressLine1": "3433 Roberto Ct",
        "Town": "San Luis Obispo",
        "StateOrProvince": "CA",
        "Postcode": "93401",
        "CountryID": 2,
        "Latitude": 35.25939,
        "Longitude": -120.64492,
        "ContactTelephone1": "805-781-5912",
        "AccessComments": "8am-5pm M-F; see front desk for code",
        "RelatedURL": "",
        "DistanceUnit": 0
    },
    "Connections": [
        {
            "ID": 15233,
            "ConnectionTypeID": 9,
            "LevelID": 1,
            "Amps": 16,
            "Voltage": 120,
            "PowerKW": 1,
            "CurrentTypeID": 10,
            "Quantity": 1
        },
        {
            "ID": 15234,
            "ConnectionTypeID": 1,
            "LevelID": 2,
            "Amps": 16,
            "Voltage": 230,
            "PowerKW": 3,
            "CurrentTypeID": 10,
            "Quantity": 1
        },
        {
            "ID": 20197,
            "ConnectionTypeID": 1,
            "LevelID": 2,
            "Quantity": 1
        }
    ],
    "DateLastConfirmed": "2010-03-31T00:00:00Z",
    "StatusTypeID": 0,
    "DateLastStatusUpdate": "2019-04-06T04:02:00Z",
    "DataQualityLevel": 1,
    "DateCreated": "2010-03-31T00:00:00Z",
    "SubmissionStatusTypeID": 100
}