{
    "IsRecentlyVerified": false,
    "ID": 127057,
    "UUID": "297D8254-8950-4068-B6B6-AD1E1516E63A",
    "DataProviderID": 1,
    "OperatorID": 32,
    "OperatorsReference": "10678",
    "UsageTypeID": 4,
    "UsageCost": "Inclusive; for Polar Plus subscription members only",
    "AddressInfo": {
        "ID": 127403,
        "Title": "Glendon Bed and Breakfast",
        "AddressLine1": "Glendon Bed and Breakfast",
        "Town": "7 Knowleston Place",
        "StateOrProvince": "Matlock",
        "Postcode": "DE4 3BU",
        "CountryID": 1,
        "Latitude": 53.135151,
        "Longitude": -1.550959,
        "DistanceUnit": 0
    },
    "Connections": [
        {
            "ID": 177934,
            "ConnectionTypeID": 25,
            "StatusTypeID": 50,
            "LevelID": 2,
            "Amps": 32,
            "Voltage": 230,
            "PowerKW": 7,
            "CurrentTypeID": 10,
            "Quantity": 2
        }
    ],
    "NumberOfPoints": 2,
    "GeneralComments": "Unit is located in the main car park, parking bays 1 and 2 next to the building",
    "StatusTypeID": 50,
    "DateLastStatusUpdate": "2019-05-27T05:18:00Z",
    "DataQualityLevel": 1,
    "DateCreated": "2019-05-27T05:18:00Z",
    "SubmissionStatusTypeID": 200
}