{
    "IsRecentlyVerified": false,
    "ID": 142941,
    "UUID": "7A1AF868-085F-429B-99BB-96DB404371EA",
    "DataProviderID": 2,
    "DataProvidersReference": "73379",
    "UsageTypeID": 2,
    "AddressInfo": {
        "ID": 143293,
        "Title": "ComEd",
        "AddressLine1": "375 2nd St",
        "Town": "Elgin",
        "StateOrProvince": "IL",
        "Postcode": "60123",
        "CountryID": 2,
        "Latitude": 42.023829,
        "Longitude": -88.320627,
        "ContactTelephone1": "",
        "AccessComments": "Employee use only",
        "RelatedURL": "",
        "DistanceUnit": 0
    },
    "Connections": [
        {
            "ID": 199177,
            "ConnectionTypeID": 1,
            "LevelID": 2,
            "Amps": 16,
            "Voltage": 230,
            "PowerKW": 3.7,
            "CurrentTypeID": 10,
            "Quantity": 2
        }
    ],
    "StatusTypeID": 50,
    "DateLastStatusUpdate": "2020-06-26T03:05:00Z",
    "DataQualityLevel": 3,
    "DateCreated": "2019-12-24T09:19:00Z",
    "SubmissionStatusTypeID": 100
}