{
    "IsRecentlyVerified": false,
    "ID": 106912,
    "UUID": "218D1489-A52C-4EF9-B2FD-3569D06714EF",
    "DataProviderID": 1,
    "OperatorID": 156,
    "UsageTypeID": 4,
    "AddressInfo": {
        "ID": 107258,
        "Title": "Supermarkt Edeka",
        "AddressLine1": "Am Wulfter Turm 6",
        "Town": "Osnabrück",
        "StateOrProvince": "Osnabrück",
        "Postcode": "49082",
        "CountryID": 87,
        "Latitude": 52.242768513594505,
        "Longitude": 8.037189571896192,
        "AccessComments": "24/7 nutzbare Ladebox Typ ICU EVE vor 2 grün markierten Parkplätzen. ",
        "DistanceUnit": 0
    },
    "Connections": [
        {
            "ID": 150709,
            "ConnectionTypeID": 25,
            "StatusTypeID": 50,
            "LevelID": 2,
            "Amps": 32,
            "Voltage": 400,
            "PowerKW": 22,
            "CurrentTypeID": 20,
            "Quantity": 2
        }
    ],
    "NumberOfPoints": 2,
    "StatusTypeID": 50,
    "DateLastStatusUpdate": "2018-07-09T05:32:00Z",
    "DataQualityLevel": 1,
    "DateCreated": "2018-07-09T05:32:00Z",
    "SubmissionStatusTypeID": 200
}