{
    "UserComments": [
        {
            "ID": 23971,
            "ChargePointID": 149535,
            "CommentTypeID": 10,
            "UserName": "ForumElettrico.it",
            "Comment": "La ricarica è gratuita e viene attivata con tessera, fornita dai gestori dell'Hotel ai clienti. Leggi la recensione completa qui >  https://www.forumelettrico.it/forum/re-power-hotel-rendez-vous-chatillon-ao-localita-soleil-3-t9559.html",
            "RelatedURL": "https://www.forumelettrico.it/forum/re-power-hotel-rendez-vous-chatillon-ao-localita-soleil-3-t9559.html",
            "DateCreated": "2021-03-04T10:25:05.093Z",
            "User": {
                "ID": 11749,
                "Username": "ForumElettrico.it"
            },
            "CheckinStatusTypeID": 10,
            "IsActionedByEditor": false
        }
    ],
    "MediaItems": [
        {
            "ID": 26755,
            "ChargePointID": 149535,
            "ItemURL": "https://s3-ap-southeast-2.amazonaws.com/openchargemap/images/IT/OCM149535/OCM-149535.orig.2021030410253371.jpg",
            "ItemThumbnailURL": "https://s3-ap-southeast-2.amazonaws.com/openchargemap/images/IT/OCM149535/OCM-149535.thmb.2021030410253371.jpg",
            "Comment": "",
            "IsEnabled": true,
            "IsVideo": false,
            "IsFeaturedItem": false,
            "IsExternalResource": false,
            "User": {
                "ID": 11749,
                "Username": "ForumElettrico.it"
            },
            "DateCreated": "2021-03-04T10:26:00Z"
        },
        {
            "ID": 26752,
            "ChargePointID": 149535,
            "ItemURL": "https://s3-ap-southeast-2.amazonaws.com/openchargemap/images/IT/OCM149535/OCM-149535.orig.2021030410251489.jpg",
            "ItemThumbnailURL": "https://s3-ap-southeast-2.amazonaws.com/openchargemap/images/IT/OCM149535/OCM-149535.thmb.2021030410251489.jpg",
            "Comment": "",
            "IsEnabled": true,
            "IsVideo": false,
            "IsFeaturedItem": false,
            "IsExternalResource": false,
            "User": {
                "ID": 11749,
                "Username": "ForumElettrico.it"
            },
            "DateCreated": "2021-03-04T10:25:00Z"
        },
        {
            "ID": 26753,
            "ChargePointID": 149535,
            "ItemURL": "https://s3-ap-southeast-2.amazonaws.com/openchargemap/images/IT/OCM149535/OCM-149535.orig.2021030410252112.jpg",
            "ItemThumbnailURL": "https://s3-ap-southeast-2.amazonaws.com/openchargemap/images/IT/OCM149535/OCM-149535.thmb.2021030410252112.jpg",
            "Comment": "",
            "IsEnabled": true,
            "IsVideo": false,
            "IsFeaturedItem": false,
            "IsExternalResource": false,
            "User": {
                "ID": 11749,
                "Username": "ForumElettrico.it"
            },
            "DateCreated": "2021-03-04T10:25:00Z"
        },
        {
            "ID": 26754,
            "ChargePointID": 149535,
            "ItemURL": "https://s3-ap-southeast-2.amazonaws.com/openchargemap/images/IT/OCM149535/OCM-149535.orig.2021030410252755.jpg",
            "ItemThumbnailURL": "https://s3-ap-southeast-2.amazonaws.com/openchargemap/images/IT/OCM149535/OCM-149535.thmb.2021030410252755.jpg",
            "Comment": "",
            "IsEnabled": true,
            "IsVideo": false,
            "IsFeaturedItem": false,
            "IsExternalResource": false,
            "User": {
                "ID": 11749,
                "Username": "ForumElettrico.it"
            },
            "DateCreated": "2021-03-04T10:25:00Z"
        }
    ],
    "IsRecentlyVerified": false,
    "ID": 149535,
    "UUID": "D74F39EB-32E5-492C-BC2E-A0C5973B5950",
    "DataProviderID": 1,
    "OperatorID": 3330,
    "UsageTypeID": 4,
    "AddressInfo": {
        "ID": 149888,
        "Title": "La Cave Des Amis Ristorante Pizzeria",
        "AddressLine1": "Località Soleil, 3",
        "Town": "Châtillon",
        "StateOrProvince": "AO",
        "Postcode": "11024",
        "CountryID": 112,
        "Latitude": 45.75020445553292,
        "Longitude": 7.621134131746203,
        "RelatedURL": "http://www.lacavedesamis.it/",
        "DistanceUnit": 0
    },
    "Connections": [
        {
            "ID": 207613,
            "ConnectionTypeID": 25,
            "StatusTypeID": 50,
            "LevelID": 2,
            "Amps": 32,
            "Voltage": 400,
            "PowerKW": 22,
            "CurrentTypeID": 20,
            "Quantity": 2
        }
    ],
    "NumberOfPoints": 2,
    "StatusTypeID": 50,
    "DateLastStatusUpdate": "2021-03-04T10:26:00Z",
    "DataQualityLevel": 1,
    "DateCreated": "2020-02-27T16:48:00Z",
    "SubmissionStatusTypeID": 200
}