{
    "IsRecentlyVerified": false,
    "ID": 65689,
    "UUID": "E61F0139-C451-4AF2-9AE0-F8285311E4B2",
    "DataProviderID": 26,
    "DataProvidersReference": "86329",
    "OperatorID": 178,
    "OperatorsReference": "EVnetNL AL922",
    "UsageCost": "0.00 jaarabonnement",
    "AddressInfo": {
        "ID": 66035,
        "Title": "Kolkplein 7b",
        "AddressLine1": "Kolkplein 7b",
        "Town": "Bunschoten",
        "Postcode": "3751 EE",
        "CountryID": 159,
        "Latitude": 52.243321,
        "Longitude": 5.375164,
        "ContactTelephone1": "0800-3522365",
        "RelatedURL": "http://www.evnet.nl",
        "DistanceUnit": 0
    },
    "Connections": [
        {
            "ID": 90654,
            "ConnectionTypeID": 25,
            "LevelID": 1,
            "PowerKW": 2.3,
            "CurrentTypeID": 10
        }
    ],
    "NumberOfPoints": 2,
    "StatusTypeID": 50,
    "DateLastStatusUpdate": "2016-06-04T02:52:00Z",
    "DataQualityLevel": 3,
    "DateCreated": "2016-04-27T09:42:00Z",
    "SubmissionStatusTypeID": 100
}