{
    "IsRecentlyVerified": false,
    "ID": 85114,
    "UUID": "25DA0578-22CF-4646-B756-A2AE7B552628",
    "DataProviderID": 1,
    "OperatorID": 23,
    "OperatorsReference": "26053",
    "UsageTypeID": 6,
    "AddressInfo": {
        "ID": 85460,
        "Title": "Fattoria la Vialla",
        "AddressLine1": "26 Via Meliciano",
        "Town": "Castiglion Fibocchi (AR)",
        "Postcode": "52100",
        "CountryID": 112,
        "Latitude": 43.528657,
        "Longitude": 11.779867,
        "ContactTelephone1": "+39 347 503 7397",
        "DistanceUnit": 0
    },
    "Connections": [
        {
            "ID": 120872,
            "ConnectionTypeID": 30,
            "StatusTypeID": 50,
            "LevelID": 2,
            "Amps": 32,
            "Voltage": 400,
            "PowerKW": 22,
            "CurrentTypeID": 20,
            "Quantity": 2
        }
    ],
    "NumberOfPoints": 2,
    "GeneralComments": "2 Tesla Connectors, up to 22kW.Available for patrons only. Please call ahead.",
    "StatusTypeID": 50,
    "DateLastStatusUpdate": "2018-10-03T23:44:00Z",
    "DataQualityLevel": 1,
    "DateCreated": "2017-03-26T05:26:00Z",
    "SubmissionStatusTypeID": 200
}