{
    "IsRecentlyVerified": false,
    "ID": 161600,
    "UUID": "FEDA4AA5-5D46-4C38-AB2F-4CA268B914ED",
    "DataProviderID": 1,
    "OperatorID": 23,
    "OperatorsReference": "54079",
    "UsageTypeID": 4,
    "AddressInfo": {
        "ID": 161957,
        "Title": "Forest Villas Hotel",
        "AddressLine1": "3645 Lee Circle",
        "Town": "Prescott",
        "StateOrProvince": "AZ",
        "Postcode": "86301",
        "CountryID": 2,
        "Latitude": 34.549028,
        "Longitude": -112.399996,
        "ContactTelephone1": "(928) 717-1200",
        "DistanceUnit": 0
    },
    "Connections": [
        {
            "ID": 232558,
            "ConnectionTypeID": 30,
            "StatusTypeID": 50,
            "LevelID": 2,
            "PowerKW": 8,
            "CurrentTypeID": 20,
            "Quantity": 2
        }
    ],
    "NumberOfPoints": 2,
    "GeneralComments": "2 Tesla Connectors, up to 8kW.Available to the public. Self park.",
    "StatusTypeID": 50,
    "DateLastStatusUpdate": "2020-07-17T05:31:00Z",
    "DataQualityLevel": 1,
    "DateCreated": "2020-07-17T05:31:00Z",
    "SubmissionStatusTypeID": 200
}