{
    "IsRecentlyVerified": false,
    "ID": 87843,
    "UUID": "54BACA84-D57C-47F7-BE1E-CC71190E4FD1",
    "DataProviderID": 1,
    "DataProvidersReference": "4058",
    "AddressInfo": {
        "ID": 88189,
        "Title": "Skellefteå Kraft Skellefteå Airport",
        "AddressLine1": "Skellefteå Airport ",
        "Town": "SKELLEFTEÅ",
        "StateOrProvince": "VÄSTERBOTTEN",
        "Postcode": "93192",
        "CountryID": 216,
        "Latitude": 64.62244,
        "Longitude": 21.06804,
        "AccessComments": "Skellefteå Airport korttidsparkering",
        "DistanceUnit": 0
    },
    "Connections": [
        {
            "ID": 124623,
            "ConnectionTypeID": 0,
            "Reference": "1",
            "LevelID": 2,
            "Amps": 32,
            "Voltage": 400,
            "PowerKW": 22,
            "Comments": "Mode 3"
        },
        {
            "ID": 124624,
            "ConnectionTypeID": 0,
            "Reference": "2",
            "LevelID": 2,
            "Amps": 32,
            "Voltage": 400,
            "PowerKW": 22,
            "Comments": "Mode 3"
        },
        {
            "ID": 124625,
            "ConnectionTypeID": 0,
            "Reference": "3",
            "LevelID": 2,
            "Amps": 32,
            "Voltage": 400,
            "PowerKW": 22,
            "Comments": "Mode 3"
        },
        {
            "ID": 124626,
            "ConnectionTypeID": 0,
            "Reference": "4",
            "LevelID": 2,
            "Amps": 32,
            "Voltage": 400,
            "PowerKW": 22,
            "Comments": "Mode 3"
        }
    ],
    "NumberOfPoints": 4,
    "DateLastStatusUpdate": "2020-05-26T08:25:00Z",
    "DataQualityLevel": 2,
    "DateCreated": "2017-05-16T11:07:00Z",
    "SubmissionStatusTypeID": 100
}