{
    "IsRecentlyVerified": false,
    "ID": 186893,
    "UUID": "677877C2-4729-4952-9127-BB67447287E9",
    "DataProviderID": 29,
    "DataProvidersReference": "20533",
    "AddressInfo": {
        "ID": 187252,
        "Title": "Weimarer Str. 6",
        "AddressLine1": "Weimarer Str. 6",
        "Town": "Seelze",
        "Postcode": "30926",
        "CountryID": 87,
        "Latitude": 52.39556,
        "Longitude": 9.64455,
        "DistanceUnit": 0
    },
    "Connections": [
        {
            "ID": 300498,
            "ConnectionTypeID": 25,
            "StatusTypeID": 50,
            "LevelID": 2,
            "PowerKW": 22,
            "CurrentTypeID": 20
        },
        {
            "ID": 300499,
            "ConnectionTypeID": 25,
            "StatusTypeID": 50,
            "LevelID": 2,
            "PowerKW": 22,
            "CurrentTypeID": 20
        }
    ],
    "StatusTypeID": 50,
    "DateLastStatusUpdate": "2021-07-12T02:49:00Z",
    "MetadataValues": [
        {
            "ID": 19133,
            "MetadataFieldID": 4,
            "ItemValue": "Data from the German chargepoint registry provided by Bundesnetzagentur.de under the CC-BY 4.0 license"
        }
    ],
    "DataQualityLevel": 3,
    "DateCreated": "2021-07-12T02:49:00Z",
    "SubmissionStatusTypeID": 100
}