{
    "IsRecentlyVerified": false,
    "ID": 175316,
    "UUID": "23F1667B-C64D-490E-8EC5-C70F271758A9",
    "DataProviderID": 1,
    "OperatorID": 21,
    "UsageTypeID": 4,
    "UsageCost": "Mobi.E compatible card or App",
    "AddressInfo": {
        "ID": 175675,
        "Title": "TVR-00005",
        "AddressLine1": "Avenida Zeca Afonso",
        "Town": "Tavira",
        "StateOrProvince": "Faro",
        "Postcode": "8800-452",
        "CountryID": 180,
        "Latitude": 37.13169950953586,
        "Longitude": -7.641802466529612,
        "DistanceUnit": 0
    },
    "Connections": [
        {
            "ID": 271916,
            "ConnectionTypeID": 25,
            "StatusTypeID": 50,
            "LevelID": 2,
            "Amps": 32,
            "Voltage": 400,
            "PowerKW": 22,
            "CurrentTypeID": 20,
            "Quantity": 2
        }
    ],
    "NumberOfPoints": 2,
    "StatusTypeID": 50,
    "DateLastStatusUpdate": "2021-05-08T18:35:00Z",
    "DataQualityLevel": 1,
    "DateCreated": "2021-05-08T18:35:00Z",
    "SubmissionStatusTypeID": 200
}