{
    "IsRecentlyVerified": false,
    "ID": 162188,
    "UUID": "83855F51-80DF-41AF-8584-4E1C4767A51C",
    "DataProviderID": 1,
    "OperatorID": 3253,
    "UsageTypeID": 1,
    "UsageCost": "paid",
    "AddressInfo": {
        "ID": 162545,
        "Title": "Bahnhofplatz Bludenz",
        "AddressLine1": "Bahnhofplatz",
        "Town": "Stadt Bludenz",
        "StateOrProvince": "Bezirk Bludenz",
        "Postcode": "6700",
        "CountryID": 19,
        "Latitude": 47.155473914231834,
        "Longitude": 9.814735076163288,
        "RelatedURL": "https://oebb.smatrics.com/",
        "DistanceUnit": 0
    },
    "Connections": [
        {
            "ID": 233410,
            "ConnectionTypeID": 25,
            "StatusTypeID": 50,
            "LevelID": 2,
            "Amps": 16,
            "PowerKW": 11,
            "CurrentTypeID": 20,
            "Quantity": 1
        },
        {
            "ID": 233411,
            "ConnectionTypeID": 25,
            "StatusTypeID": 50,
            "LevelID": 2,
            "Amps": 13,
            "PowerKW": 3.7,
            "CurrentTypeID": 10,
            "Quantity": 1
        }
    ],
    "NumberOfPoints": 2,
    "GeneralComments": "Operator: ÖBB Infra (SMATRICS)",
    "StatusTypeID": 50,
    "DateLastStatusUpdate": "2020-08-04T09:33:00Z",
    "DataQualityLevel": 1,
    "DateCreated": "2020-08-02T11:23:00Z",
    "SubmissionStatusTypeID": 200
}