{
    "IsRecentlyVerified": false,
    "ID": 179822,
    "UUID": "A0400CF8-7A9A-45AC-B579-472461E6332B",
    "DataProviderID": 29,
    "DataProvidersReference": "15864",
    "OperatorID": 103,
    "AddressInfo": {
        "ID": 180181,
        "Title": "Carl-Zeiss-Str. 10",
        "AddressLine1": "Carl-Zeiss-Str. 10",
        "Town": "Koblenz",
        "Postcode": "56070",
        "CountryID": 87,
        "Latitude": 50.388186,
        "Longitude": 7.558341,
        "DistanceUnit": 0
    },
    "Connections": [
        {
            "ID": 282153,
            "ConnectionTypeID": 33,
            "StatusTypeID": 50,
            "LevelID": 3,
            "PowerKW": 50,
            "CurrentTypeID": 30
        },
        {
            "ID": 282154,
            "ConnectionTypeID": 2,
            "StatusTypeID": 50,
            "LevelID": 3,
            "PowerKW": 50,
            "CurrentTypeID": 30
        },
        {
            "ID": 297762,
            "ConnectionTypeID": 1036,
            "StatusTypeID": 50,
            "LevelID": 3,
            "PowerKW": 43,
            "CurrentTypeID": 20
        }
    ],
    "StatusTypeID": 50,
    "DateLastStatusUpdate": "2021-07-12T02:44:00Z",
    "MetadataValues": [
        {
            "ID": 12116,
            "MetadataFieldID": 4,
            "ItemValue": "Data from the German chargepoint registry provided by Bundesnetzagentur.de under the CC-BY 4.0 license"
        }
    ],
    "DataQualityLevel": 3,
    "DateCreated": "2021-07-08T10:00:00Z",
    "SubmissionStatusTypeID": 100
}