{
    "IsRecentlyVerified": false,
    "ID": 150074,
    "UUID": "9DBBA0E4-0041-4D25-9C23-8A1BF2CE3828",
    "DataProviderID": 1,
    "OperatorID": 2244,
    "UsageTypeID": 5,
    "AddressInfo": {
        "ID": 150427,
        "Title": "Offord Road",
        "AddressLine1": "Offord Road",
        "Town": "London",
        "Postcode": "N1 1DJ",
        "CountryID": 1,
        "Latitude": 51.542356,
        "Longitude": -0.116729,
        "RelatedURL": "https://www.ubitricity.com",
        "DistanceUnit": 0
    },
    "Connections": [
        {
            "ID": 208360,
            "ConnectionTypeID": 25,
            "Reference": "suby1100004022",
            "StatusTypeID": 50,
            "LevelID": 2,
            "Amps": 16,
            "Voltage": 230,
            "PowerKW": 3.7,
            "CurrentTypeID": 10
        }
    ],
    "StatusTypeID": 0,
    "DateLastStatusUpdate": "2020-03-12T16:52:00Z",
    "MetadataValues": [
        {
            "ID": 7101,
            "MetadataFieldID": 4,
            "ItemValue": "Contains public sector information licensed under the Open Government Licence v2.0. http://www.nationalarchives.gov.uk/doc/open-government-licence/version/2/"
        }
    ],
    "DataQualityLevel": 3,
    "DateCreated": "2020-03-12T15:48:00Z",
    "SubmissionStatusTypeID": 100
}