{
    "IsRecentlyVerified": false,
    "ID": 33286,
    "UUID": "9C5596CC-C732-4F72-8085-2EFB63FACE5B",
    "DataProviderID": 1,
    "OperatorID": 105,
    "OperatorsReference": "Essent EM-DE-05513000-08-00001",
    "UsageTypeID": 4,
    "AddressInfo": {
        "ID": 33632,
        "Title": "Brauckstraße 160",
        "AddressLine1": "Brauckstraße 160",
        "Town": "Gelsenkirchen",
        "Postcode": "45892",
        "CountryID": 87,
        "Latitude": 51.570722,
        "Longitude": 7.101886,
        "DistanceUnit": 0
    },
    "Connections": [
        {
            "ID": 36797,
            "ConnectionTypeID": 2,
            "LevelID": 3,
            "PowerKW": 50,
            "CurrentTypeID": 30
        },
        {
            "ID": 46745,
            "ConnectionTypeID": 25,
            "LevelID": 2,
            "PowerKW": 11
        }
    ],
    "NumberOfPoints": 1,
    "StatusTypeID": 50,
    "DateLastStatusUpdate": "2015-04-13T15:14:00Z",
    "DataQualityLevel": 3,
    "DateCreated": "2015-01-09T06:04:00Z",
    "SubmissionStatusTypeID": 200
}