{
    "IsRecentlyVerified": false,
    "ID": 93355,
    "UUID": "FB56A848-0D5F-46DD-ADCA-DE0E9C0B1DDF",
    "DataProviderID": 1,
    "OperatorID": 23,
    "OperatorsReference": "35801",
    "UsageTypeID": 6,
    "AddressInfo": {
        "ID": 93701,
        "Title": "Familotel Ebbinghof",
        "AddressLine1": "Ebbinghof 5",
        "Town": "Schmallenberg",
        "Postcode": "57392",
        "CountryID": 87,
        "Latitude": 51.179219,
        "Longitude": 8.284093,
        "ContactTelephone1": "+49 2972 97550",
        "RelatedURL": "http://www.familotel-ebbinghof.de/",
        "DistanceUnit": 0
    },
    "Connections": [
        {
            "ID": 132232,
            "ConnectionTypeID": 30,
            "StatusTypeID": 50,
            "LevelID": 2,
            "Amps": 32,
            "Voltage": 400,
            "PowerKW": 14,
            "CurrentTypeID": 20,
            "Quantity": 2
        }
    ],
    "NumberOfPoints": 3,
    "GeneralComments": "3 Tesla Connectors, up to 22kW. Available for patrons only. Please call ahead.",
    "StatusTypeID": 50,
    "DateLastStatusUpdate": "2018-10-03T20:24:00Z",
    "DataQualityLevel": 1,
    "DateCreated": "2017-09-27T19:21:00Z",
    "SubmissionStatusTypeID": 200
}