{
    "IsRecentlyVerified": false,
    "ID": 142333,
    "UUID": "D92E55AA-E894-4A8C-B2CB-A13B7588B3DF",
    "DataProviderID": 2,
    "DataProvidersReference": "143784",
    "UsageTypeID": 1,
    "AddressInfo": {
        "ID": 142685,
        "Title": "Fortuna Open Door Community Health Clinic",
        "AddressLine1": "3750 Rohnerville Rd",
        "Town": "Fortuna",
        "StateOrProvince": "CA",
        "Postcode": "95540",
        "CountryID": 2,
        "Latitude": 40.581945,
        "Longitude": -124.130942,
        "ContactTelephone1": "888-758-4389",
        "AccessComments": "24 hours daily",
        "RelatedURL": "",
        "DistanceUnit": 0
    },
    "Connections": [
        {
            "ID": 198448,
            "ConnectionTypeID": 1,
            "LevelID": 2,
            "Amps": 16,
            "Voltage": 230,
            "PowerKW": 3.7,
            "CurrentTypeID": 10,
            "Quantity": 7
        }
    ],
    "StatusTypeID": 50,
    "DateLastStatusUpdate": "2020-06-26T03:03:00Z",
    "DataQualityLevel": 3,
    "DateCreated": "2019-12-24T09:17:00Z",
    "SubmissionStatusTypeID": 100
}