{
    "IsRecentlyVerified": false,
    "ID": 34801,
    "UUID": "D16F3AF4-0334-46BC-AC0E-4DB7A8CD9D99",
    "DataProviderID": 26,
    "DataProvidersReference": "46833",
    "OperatorID": 73,
    "OperatorsReference": "EV-Box EVB-P1415029",
    "UsageCost": "0.00 jaarabonnement",
    "AddressInfo": {
        "ID": 35147,
        "Title": "Burgemeester Le Fèvre de Montignyplein 5",
        "AddressLine1": "Burgemeester Le Fèvre de Montignyplein 5",
        "Town": "Rotterdam",
        "Postcode": "3055 NL",
        "CountryID": 159,
        "Latitude": 51.95805,
        "Longitude": 4.50132,
        "RelatedURL": "http://www.ev-box.nl",
        "DistanceUnit": 0
    },
    "Connections": [
        {
            "ID": 38312,
            "ConnectionTypeID": 25,
            "LevelID": 2,
            "PowerKW": 11,
            "CurrentTypeID": 10
        },
        {
            "ID": 47519,
            "ConnectionTypeID": 25,
            "LevelID": 2,
            "PowerKW": 11,
            "CurrentTypeID": 10
        }
    ],
    "NumberOfPoints": 1,
    "StatusTypeID": 50,
    "DateLastStatusUpdate": "2016-06-04T02:43:00Z",
    "DataQualityLevel": 3,
    "DateCreated": "2015-01-09T06:04:00Z",
    "SubmissionStatusTypeID": 100
}