{
    "IsRecentlyVerified": false,
    "ID": 137280,
    "UUID": "76086C78-6474-4DB8-993C-A8B77A2E6C92",
    "DataProviderID": 2,
    "DataProvidersReference": "147137",
    "OperatorID": 9,
    "UsageTypeID": 2,
    "AddressInfo": {
        "ID": 137626,
        "Title": "Garcia Stromberg - Akoya Boca West",
        "AddressLine1": "20583 Boca West Drive",
        "Town": "Boca Raton",
        "StateOrProvince": "FL",
        "Postcode": "33434",
        "CountryID": 2,
        "Latitude": 26.378041,
        "Longitude": -80.163204,
        "ContactTelephone1": "888-998-2546",
        "AccessComments": "MON: 24 hours | TUE: 24 hours | WED: 24 hours | THU: 24 hours | FRI: 24 hours | SAT: 24 hours | SUN: 24 hours",
        "RelatedURL": "http://www.blinkcharging.com/",
        "DistanceUnit": 0
    },
    "Connections": [
        {
            "ID": 192155,
            "ConnectionTypeID": 1,
            "LevelID": 2,
            "Amps": 16,
            "Voltage": 230,
            "PowerKW": 3,
            "CurrentTypeID": 10,
            "Quantity": 4
        }
    ],
    "StatusTypeID": 50,
    "DateLastStatusUpdate": "2019-12-24T09:04:00Z",
    "DataQualityLevel": 3,
    "DateCreated": "2019-12-24T09:04:00Z",
    "SubmissionStatusTypeID": 100
}