{
    "IsRecentlyVerified": false,
    "ID": 75849,
    "UUID": "BC8101AE-60C1-40EB-B06C-31D9D6D2F669",
    "DataProviderID": 1,
    "OperatorID": 5,
    "UsageTypeID": 1,
    "AddressInfo": {
        "ID": 76195,
        "Title": "KCPL",
        "AddressLine1": "13915 W 159th Ter @ Heritage Park",
        "Town": "Olathe",
        "StateOrProvince": "KS",
        "Postcode": "66062",
        "CountryID": 2,
        "Latitude": 38.8356154387257,
        "Longitude": -94.7464438844685,
        "ContactTelephone1": "888-758-4389",
        "AccessComments": "24 hours daily",
        "RelatedURL": "http://www.chargepoint.com/",
        "DistanceUnit": 0
    },
    "Connections": [
        {
            "ID": 109359,
            "ConnectionTypeID": 1,
            "LevelID": 2,
            "Amps": 16,
            "Voltage": 230,
            "PowerKW": 3,
            "CurrentTypeID": 10,
            "Quantity": 6
        }
    ],
    "StatusTypeID": 0,
    "DateLastStatusUpdate": "2019-06-14T15:57:00Z",
    "DataQualityLevel": 3,
    "DateCreated": "2016-12-23T01:25:00Z",
    "SubmissionStatusTypeID": 100
}