{
    "IsRecentlyVerified": false,
    "ID": 93216,
    "UUID": "3EEFC2D7-0018-4832-AD09-16A9CB927672",
    "DataProviderID": 1,
    "OperatorID": 3,
    "OperatorsReference": "PG-81444",
    "UsageTypeID": 6,
    "UsageCost": "1",
    "AddressInfo": {
        "ID": 93562,
        "Title": "Ancaster Croydon-Hyundai",
        "AddressLine1": "421a Brighton Road",
        "Town": "South Croydon",
        "Postcode": "CR2 6EU",
        "CountryID": 1,
        "Latitude": 51.348917,
        "Longitude": -0.099977,
        "DistanceUnit": 0
    },
    "Connections": [
        {
            "ID": 132040,
            "ConnectionTypeID": 25,
            "StatusTypeID": 50,
            "LevelID": 2,
            "Amps": 32,
            "Voltage": 230,
            "PowerKW": 7,
            "CurrentTypeID": 10,
            "Quantity": 2
        }
    ],
    "NumberOfPoints": 2,
    "GeneralComments": "This is an open charge unit installed at the Ancaster Croydon - Hyundai dealership in Brighton Road, Fronting Brantwood Road, South Croydon",
    "StatusTypeID": 0,
    "DateLastStatusUpdate": "2020-01-23T06:43:00Z",
    "DataQualityLevel": 1,
    "DateCreated": "2017-09-23T05:19:00Z",
    "SubmissionStatusTypeID": 200
}