{
    "MediaItems": [
        {
            "ID": 15482,
            "ChargePointID": 104059,
            "ItemURL": "https://s3-ap-southeast-2.amazonaws.com/openchargemap/images/FR/OCM104059/OCM-104059.orig.2018051516523917.jpg",
            "ItemThumbnailURL": "https://s3-ap-southeast-2.amazonaws.com/openchargemap/images/FR/OCM104059/OCM-104059.thmb.2018051516523917.jpg",
            "Comment": "",
            "IsEnabled": true,
            "IsVideo": false,
            "IsFeaturedItem": false,
            "IsExternalResource": false,
            "User": {
                "ID": 1002,
                "Username": "Jean-Christophe"
            },
            "DateCreated": "2018-05-15T16:53:00Z"
        },
        {
            "ID": 15481,
            "ChargePointID": 104059,
            "ItemURL": "https://s3-ap-southeast-2.amazonaws.com/openchargemap/images/FR/OCM104059/OCM-104059.orig.2018051516425040.jpg",
            "ItemThumbnailURL": "https://s3-ap-southeast-2.amazonaws.com/openchargemap/images/FR/OCM104059/OCM-104059.thmb.2018051516425040.jpg",
            "Comment": "",
            "IsEnabled": true,
            "IsVideo": false,
            "IsFeaturedItem": false,
            "IsExternalResource": false,
            "User": {
                "ID": 1002,
                "Username": "Jean-Christophe"
            },
            "DateCreated": "2018-05-15T16:43:00Z"
        },
        {
            "ID": 15480,
            "ChargePointID": 104059,
            "ItemURL": "https://s3-ap-southeast-2.amazonaws.com/openchargemap/images/FR/OCM104059/OCM-104059.orig.2018051512570607.jpg",
            "ItemThumbnailURL": "https://s3-ap-southeast-2.amazonaws.com/openchargemap/images/FR/OCM104059/OCM-104059.thmb.2018051512570607.jpg",
            "Comment": "",
            "IsEnabled": true,
            "IsVideo": false,
            "IsFeaturedItem": false,
            "IsExternalResource": false,
            "User": {
                "ID": 1002,
                "Username": "Jean-Christophe"
            },
            "DateCreated": "2018-05-15T12:57:00Z"
        },
        {
            "ID": 15478,
            "ChargePointID": 104059,
            "ItemURL": "https://s3-ap-southeast-2.amazonaws.com/openchargemap/images/FR/OCM104059/OCM-104059.orig.2018051512410500.jpeg",
            "ItemThumbnailURL": "https://s3-ap-southeast-2.amazonaws.com/openchargemap/images/FR/OCM104059/OCM-104059.thmb.2018051512410500.jpeg",
            "Comment": "",
            "IsEnabled": true,
            "IsVideo": false,
            "IsFeaturedItem": false,
            "IsExternalResource": false,
            "User": {
                "ID": 1002,
                "Username": "Jean-Christophe"
            },
            "DateCreated": "2018-05-15T12:41:00Z"
        }
    ],
    "IsRecentlyVerified": false,
    "ID": 104059,
    "UUID": "7536408D-31DD-4508-9F1D-DAD6464A5B1C",
    "DataProviderID": 1,
    "OperatorID": 1,
    "UsageTypeID": 1,
    "AddressInfo": {
        "ID": 104405,
        "Title": "Sentier des Pêcheurs",
        "AddressLine1": "Sentier des Pêcheurs",
        "AddressLine2": "La Favière",
        "Town": "Bormes-les-Mimosas",
        "StateOrProvince": "Toulon",
        "Postcode": "83230",
        "CountryID": 80,
        "Latitude": 43.1241332321347,
        "Longitude": 6.36206943402317,
        "DistanceUnit": 0
    },
    "Connections": [
        {
            "ID": 147134,
            "ConnectionTypeID": 25,
            "StatusTypeID": 50,
            "LevelID": 2,
            "Amps": 32,
            "Voltage": 400,
            "PowerKW": 22,
            "CurrentTypeID": 20,
            "Quantity": 2
        },
        {
            "ID": 147135,
            "ConnectionTypeID": 23,
            "StatusTypeID": 50,
            "LevelID": 2,
            "Amps": 16,
            "Voltage": 230,
            "PowerKW": 3.6,
            "CurrentTypeID": 10,
            "Quantity": 2
        }
    ],
    "NumberOfPoints": 2,
    "GeneralComments": "Close to boat slipway\r\nFree wi-Fi  at the tourist-office",
    "StatusTypeID": 50,
    "DateLastStatusUpdate": "2018-05-17T08:17:00Z",
    "DataQualityLevel": 1,
    "DateCreated": "2018-05-15T10:57:00Z",
    "SubmissionStatusTypeID": 200
}