{
    "IsRecentlyVerified": false,
    "ID": 160850,
    "UUID": "BE0561B4-E19A-49B2-AF91-2B67EEEC0646",
    "DataProviderID": 1,
    "OperatorID": 22,
    "UsageTypeID": 4,
    "AddressInfo": {
        "ID": 161207,
        "Title": "Strand Road (South), Bray",
        "AddressLine1": "Strand Road",
        "Town": "Bray",
        "StateOrProvince": "",
        "Postcode": "",
        "CountryID": 3,
        "Latitude": 53.19842901253523,
        "Longitude": -6.095310867964031,
        "DistanceUnit": 0
    },
    "Connections": [
        {
            "ID": 231529,
            "ConnectionTypeID": 25,
            "StatusTypeID": 50,
            "LevelID": 2,
            "Amps": 32,
            "Voltage": 400,
            "PowerKW": 22,
            "CurrentTypeID": 20,
            "Quantity": 2
        }
    ],
    "NumberOfPoints": 1,
    "StatusTypeID": 50,
    "DateLastStatusUpdate": "2020-07-03T07:43:00Z",
    "DataQualityLevel": 1,
    "DateCreated": "2020-07-01T15:35:00Z",
    "SubmissionStatusTypeID": 200
}