{
    "IsRecentlyVerified": false,
    "ID": 38733,
    "UUID": "CA11CE66-07D6-4A92-87BF-A411133EC45E",
    "DataProviderID": 26,
    "DataProvidersReference": "45752",
    "OperatorID": 73,
    "OperatorsReference": "EV-Box EVB-P1347212",
    "UsageCost": "0.00 jaarabonnement",
    "AddressInfo": {
        "ID": 39079,
        "Title": "Waterdrieblad 22",
        "AddressLine1": "Waterdrieblad 22",
        "Town": "Langedijk",
        "Postcode": "1724 XK",
        "CountryID": 159,
        "Latitude": 52.7083,
        "Longitude": 4.80573,
        "RelatedURL": "http://www.ev-box.nl",
        "DistanceUnit": 0
    },
    "Connections": [
        {
            "ID": 42244,
            "ConnectionTypeID": 25,
            "LevelID": 2,
            "PowerKW": 5,
            "CurrentTypeID": 10
        }
    ],
    "NumberOfPoints": 1,
    "StatusTypeID": 50,
    "DateLastStatusUpdate": "2016-06-04T02:55:00Z",
    "DataQualityLevel": 3,
    "DateCreated": "2015-01-09T06:08:00Z",
    "SubmissionStatusTypeID": 100
}