{
    "IsRecentlyVerified": false,
    "ID": 47309,
    "UUID": "44CBB4F7-F910-4E0A-ADDF-71D978A585CB",
    "DataProviderID": 1,
    "OperatorID": 1,
    "UsageTypeID": 1,
    "UsageCost": "Free",
    "AddressInfo": {
        "ID": 47655,
        "Title": "Opera House",
        "AddressLine1": "J. Lelevelio g. 6",
        "AddressLine2": "",
        "Town": "Vilnius",
        "StateOrProvince": "",
        "Postcode": "",
        "CountryID": 131,
        "Latitude": 54.688502,
        "Longitude": 25.277522,
        "ContactTelephone1": "",
        "ContactTelephone2": "",
        "ContactEmail": "",
        "AccessComments": "Opera House parking lot",
        "RelatedURL": "",
        "DistanceUnit": 0
    },
    "Connections": [],
    "NumberOfPoints": 1,
    "GeneralComments": "",
    "StatusTypeID": 50,
    "DateLastStatusUpdate": "2015-05-25T20:56:00Z",
    "DataQualityLevel": 1,
    "DateCreated": "2015-05-25T20:42:00Z",
    "SubmissionStatusTypeID": 200
}