{
    "IsRecentlyVerified": false,
    "ID": 131575,
    "UUID": "8B785060-43B5-461B-87E4-A070C601D339",
    "DataProviderID": 1,
    "OperatorID": 3315,
    "OperatorsReference": "51698,51699,51700",
    "UsageTypeID": 4,
    "UsageCost": "Free",
    "AddressInfo": {
        "ID": 131921,
        "Title": "Penston House Car Park, Macmerry",
        "AddressLine1": "Penston House Car Park",
        "Town": "Macmerry Industrial Estate",
        "StateOrProvince": "Macmerry",
        "Postcode": "EH33 1EX",
        "CountryID": 1,
        "Latitude": 55.94473,
        "Longitude": -2.89714,
        "DistanceUnit": 0
    },
    "Connections": [
        {
            "ID": 184156,
            "ConnectionTypeID": 25,
            "StatusTypeID": 50,
            "LevelID": 2,
            "Amps": 32,
            "Voltage": 230,
            "PowerKW": 7,
            "CurrentTypeID": 10,
            "Quantity": 5
        }
    ],
    "NumberOfPoints": 5,
    "StatusTypeID": 50,
    "DateLastStatusUpdate": "2019-09-10T13:34:00Z",
    "DataQualityLevel": 1,
    "DateCreated": "2019-09-10T05:19:00Z",
    "SubmissionStatusTypeID": 200
}