{
    "IsRecentlyVerified": false,
    "ID": 143115,
    "UUID": "A68E6651-1368-42E4-B9AF-716AD4BF84F9",
    "DataProviderID": 2,
    "DataProvidersReference": "148111",
    "OperatorID": 39,
    "UsageTypeID": 1,
    "AddressInfo": {
        "ID": 143467,
        "Title": "55 Cambridge Parkway LLC",
        "AddressLine1": "55 Cambridge Parkway",
        "Town": "Cambridge",
        "StateOrProvince": "MA",
        "Postcode": "02142",
        "CountryID": 2,
        "Latitude": 42.3657917,
        "Longitude": -71.0758793,
        "ContactTelephone1": "800-663-5633",
        "AccessComments": "MO: Not Specified; TU: Not Specified; WE: Not Specified; TH: Not Specified; FR: Not Specified; SA: Not Specified; SU: Not Specified",
        "RelatedURL": "http://www.semacharge.com/",
        "DistanceUnit": 0
    },
    "Connections": [
        {
            "ID": 199381,
            "ConnectionTypeID": 1,
            "LevelID": 2,
            "Amps": 16,
            "Voltage": 230,
            "PowerKW": 3.7,
            "CurrentTypeID": 10,
            "Quantity": 8
        }
    ],
    "StatusTypeID": 50,
    "DateLastStatusUpdate": "2020-06-26T03:05:00Z",
    "DataQualityLevel": 3,
    "DateCreated": "2019-12-24T09:20:00Z",
    "SubmissionStatusTypeID": 100
}