{
    "IsRecentlyVerified": false,
    "ID": 135874,
    "UUID": "56F15DC0-4285-4694-832A-E70BAFFD3B09",
    "DataProviderID": 18,
    "DataProvidersReference": "3e51d9b5566a471230a7dabf580fc921",
    "OperatorID": 2244,
    "UsageTypeID": 5,
    "AddressInfo": {
        "ID": 136220,
        "Title": "Selwyn Avenue",
        "AddressLine1": "Selwyn Avenue",
        "Town": "Richmond",
        "Postcode": "TW9 2HA",
        "CountryID": 1,
        "Latitude": 51.466217,
        "Longitude": -0.296066,
        "AccessComments": "",
        "RelatedURL": "https://www.ubitricity.com",
        "DistanceUnit": 0
    },
    "Connections": [
        {
            "ID": 190295,
            "ConnectionTypeID": 25,
            "Reference": "suby1100002172",
            "StatusTypeID": 50,
            "LevelID": 2,
            "Amps": 16,
            "Voltage": 230,
            "PowerKW": 3.7,
            "CurrentTypeID": 10
        }
    ],
    "StatusTypeID": 0,
    "DateLastStatusUpdate": "2021-04-25T05:46:00Z",
    "MetadataValues": [
        {
            "ID": 5726,
            "MetadataFieldID": 4,
            "ItemValue": "Contains public sector information licensed under the Open Government Licence v2.0. http://www.nationalarchives.gov.uk/doc/open-government-licence/version/2/"
        }
    ],
    "DataQualityLevel": 3,
    "DateCreated": "2019-12-24T05:22:00Z",
    "SubmissionStatusTypeID": 100
}