{
    "IsRecentlyVerified": false,
    "ID": 143992,
    "UUID": "E9EB63D4-1350-40E3-A300-77A84F6D3040",
    "DataProviderID": 2,
    "DataProvidersReference": "62025",
    "OperatorID": 5,
    "UsageTypeID": 1,
    "AddressInfo": {
        "ID": 144344,
        "Title": "GRE CORP CAMPUS",
        "AddressLine1": "12300 Elm Creek Blvd N",
        "Town": "Maple Grove",
        "StateOrProvince": "MN",
        "Postcode": "55369",
        "CountryID": 2,
        "Latitude": 45.095093,
        "Longitude": -93.437135,
        "ContactTelephone1": "888-758-4389",
        "AccessComments": "24 hours daily",
        "RelatedURL": "http://www.chargepoint.com/",
        "DistanceUnit": 0
    },
    "Connections": [
        {
            "ID": 200442,
            "ConnectionTypeID": 1,
            "LevelID": 2,
            "Amps": 16,
            "Voltage": 230,
            "PowerKW": 3.7,
            "CurrentTypeID": 10,
            "Quantity": 4
        }
    ],
    "StatusTypeID": 50,
    "DateLastStatusUpdate": "2020-06-26T03:08:00Z",
    "DataQualityLevel": 3,
    "DateCreated": "2019-12-24T09:22:00Z",
    "SubmissionStatusTypeID": 100
}