{
    "IsRecentlyVerified": false,
    "ID": 95973,
    "UUID": "9AC9383F-AD9B-464C-A529-9098942D4B33",
    "DataProviderID": 1,
    "OperatorID": 101,
    "UsageTypeID": 4,
    "AddressInfo": {
        "ID": 96319,
        "Title": "Amt für Landwirtschaft und Umwelt Vorpommern",
        "AddressLine1": "Heilgeiststraße 60",
        "Town": "Stralsund",
        "StateOrProvince": "Landkreis Vorpommern-Rügen",
        "Postcode": "18439",
        "CountryID": 87,
        "Latitude": 54.313967746161225,
        "Longitude": 13.094849212303208,
        "AccessComments": "24/7 nutzbare Ladesäule am rechten Straßenrand mit 2 markierten Parkplätzen.",
        "RelatedURL": "http://www.stadtwerke-stralsund.de/",
        "DistanceUnit": 0
    },
    "Connections": [
        {
            "ID": 135955,
            "ConnectionTypeID": 25,
            "StatusTypeID": 50,
            "LevelID": 2,
            "Amps": 32,
            "Voltage": 400,
            "PowerKW": 22,
            "CurrentTypeID": 20,
            "Quantity": 2
        }
    ],
    "NumberOfPoints": 2,
    "GeneralComments": "Belectric Drive renamed itself to chargeIt Mobility. Roaming with New Motion, PlugSurfing, Charge&Fuel and many other RFID cards.",
    "StatusTypeID": 50,
    "DateLastStatusUpdate": "2017-12-04T08:55:00Z",
    "DataQualityLevel": 1,
    "DateCreated": "2017-12-04T08:55:00Z",
    "SubmissionStatusTypeID": 200
}