{
    "IsRecentlyVerified": false,
    "ID": 17451,
    "UUID": "E9920C77-BB62-4724-94BD-C388DA4F0137",
    "DataProviderID": 22,
    "DataProvidersReference": "57574E4F5E30961F96C7E320BF15A5DD",
    "AddressInfo": {
        "ID": 17796,
        "Title": "日産サティオ福山　府中店",
        "AddressLine1": "広島県府中市中須町61-1",
        "CountryID": 114,
        "Latitude": 34.55376174,
        "Longitude": 133.2678377,
        "ContactTelephone1": "0847-52-3211",
        "DistanceUnit": 0
    },
    "Connections": [
        {
            "ID": 17692,
            "ConnectionTypeID": 2,
            "LevelID": 2,
            "Amps": 100,
            "Voltage": 480,
            "PowerKW": 48,
            "Quantity": 1
        }
    ],
    "DateLastStatusUpdate": "2013-06-29T08:58:00Z",
    "DataQualityLevel": 2,
    "DateCreated": "2013-06-29T08:58:00Z",
    "SubmissionStatusTypeID": 200
}