{
    "IsRecentlyVerified": false,
    "ID": 100543,
    "UUID": "A4A40934-84BF-40F8-82B1-586C62F9B531",
    "DataProviderID": 1,
    "OperatorID": 3291,
    "UsageTypeID": 4,
    "UsageCost": "free",
    "AddressInfo": {
        "ID": 100889,
        "Title": "evway Bennet Chivasso",
        "AddressLine1": "Via Moie 50",
        "AddressLine2": "Consorzio Pichi",
        "Town": "Chivasso ",
        "StateOrProvince": "TO",
        "Postcode": "10034",
        "CountryID": 112,
        "Latitude": 45.201834411153754,
        "Longitude": 7.892602057875592,
        "ContactTelephone1": "+390119107014",
        "RelatedURL": "https://www.bennet.com/ipermercati/schedaIpermercato.aspx?idIper=0148",
        "DistanceUnit": 0
    },
    "Connections": [
        {
            "ID": 142020,
            "ConnectionTypeID": 25,
            "StatusTypeID": 50,
            "LevelID": 2,
            "Amps": 32,
            "Voltage": 400,
            "PowerKW": 22,
            "CurrentTypeID": 20,
            "Quantity": 4
        }
    ],
    "NumberOfPoints": 4,
    "StatusTypeID": 50,
    "DateLastStatusUpdate": "2018-02-28T16:55:00Z",
    "DataQualityLevel": 1,
    "DateCreated": "2018-02-28T16:55:00Z",
    "SubmissionStatusTypeID": 200
}