{
    "IsRecentlyVerified": false,
    "ID": 140945,
    "UUID": "719CAC7D-F28A-4216-A775-8C40EC210245",
    "DataProviderID": 2,
    "DataProvidersReference": "76876",
    "OperatorID": 5,
    "UsageTypeID": 1,
    "AddressInfo": {
        "ID": 141297,
        "Title": "222 GARAGE",
        "AddressLine1": "222 2nd St",
        "Town": "San Francisco",
        "StateOrProvince": "CA",
        "Postcode": "94105",
        "CountryID": 2,
        "Latitude": 37.786325,
        "Longitude": -122.39824,
        "ContactTelephone1": "888-758-4389",
        "AccessComments": "24 hours daily",
        "RelatedURL": "http://www.chargepoint.com/",
        "DistanceUnit": 0
    },
    "Connections": [
        {
            "ID": 196727,
            "ConnectionTypeID": 1,
            "LevelID": 2,
            "Amps": 16,
            "Voltage": 230,
            "PowerKW": 3,
            "CurrentTypeID": 10,
            "Quantity": 4
        }
    ],
    "StatusTypeID": 50,
    "DateLastStatusUpdate": "2019-12-24T09:14:00Z",
    "DataQualityLevel": 3,
    "DateCreated": "2019-12-24T09:14:00Z",
    "SubmissionStatusTypeID": 100
}