{
    "IsRecentlyVerified": false,
    "ID": 9227,
    "UUID": "4A984808-2B78-4730-B7B4-81DE2C441A1E",
    "DataProviderID": 15,
    "DataProvidersReference": "13510",
    "OperatorID": 5,
    "AddressInfo": {
        "ID": 9124,
        "Title": "5000 Rocklin Rd",
        "AddressLine1": "5000 Rocklin Rd",
        "Town": "Rocklin",
        "StateOrProvince": "California",
        "Postcode": "95677",
        "CountryID": 2,
        "Latitude": 38.78928375,
        "Longitude": -121.208786,
        "ContactTelephone1": "",
        "RelatedURL": "http://carstations.com/13510",
        "DistanceUnit": 0
    },
    "Connections": [
        {
            "ID": 6908,
            "ConnectionTypeID": 9,
            "Reference": "NEMA5",
            "Quantity": 1
        },
        {
            "ID": 7066,
            "ConnectionTypeID": 1,
            "Reference": "J1772",
            "LevelID": 2
        }
    ],
    "StatusTypeID": 0,
    "DateLastStatusUpdate": "2017-11-04T14:04:00Z",
    "DataQualityLevel": 2,
    "DateCreated": "2012-01-23T15:12:00Z",
    "SubmissionStatusTypeID": 100
}