{
    "UserComments": [
        {
            "ID": 23681,
            "ChargePointID": 170845,
            "CommentTypeID": 10,
            "UserName": "ForumElettrico.it",
            "Comment": "Unico svantaggio delle colonnine affiancate in questo modo è che il cartello è presente solo da una parte. Leggi la recensione completa qui > https://www.forumelettrico.it/forum/colonnine-be-charge-22-kw-ristorante-km90-fidenza-pr-via-rita-levi-montalcini-280-a-t14674.html\r\n",
            "RelatedURL": "https://www.forumelettrico.it/forum/colonnine-be-charge-22-kw-ristorante-km90-fidenza-pr-via-rita-levi-montalcini-280-a-t14674.html",
            "DateCreated": "2020-12-22T17:50:18.87Z",
            "User": {
                "ID": 11749,
                "Username": "ForumElettrico.it"
            },
            "CheckinStatusTypeID": 10,
            "IsActionedByEditor": false
        }
    ],
    "MediaItems": [
        {
            "ID": 25921,
            "ChargePointID": 170845,
            "ItemURL": "https://s3-ap-southeast-2.amazonaws.com/openchargemap/images/IT/OCM170845/OCM-170845.orig.2020122217503017.jpg",
            "ItemThumbnailURL": "https://s3-ap-southeast-2.amazonaws.com/openchargemap/images/IT/OCM170845/OCM-170845.thmb.2020122217503017.jpg",
            "Comment": "",
            "IsEnabled": true,
            "IsVideo": false,
            "IsFeaturedItem": false,
            "IsExternalResource": false,
            "User": {
                "ID": 11749,
                "Username": "ForumElettrico.it"
            },
            "DateCreated": "2020-12-22T17:51:00Z"
        },
        {
            "ID": 25922,
            "ChargePointID": 170845,
            "ItemURL": "https://s3-ap-southeast-2.amazonaws.com/openchargemap/images/IT/OCM170845/OCM-170845.orig.2020122217503691.jpg",
            "ItemThumbnailURL": "https://s3-ap-southeast-2.amazonaws.com/openchargemap/images/IT/OCM170845/OCM-170845.thmb.2020122217503691.jpg",
            "Comment": "",
            "IsEnabled": true,
            "IsVideo": false,
            "IsFeaturedItem": false,
            "IsExternalResource": false,
            "User": {
                "ID": 11749,
                "Username": "ForumElettrico.it"
            },
            "DateCreated": "2020-12-22T17:51:00Z"
        },
        {
            "ID": 25923,
            "ChargePointID": 170845,
            "ItemURL": "https://s3-ap-southeast-2.amazonaws.com/openchargemap/images/IT/OCM170845/OCM-170845.orig.2020122217504318.jpg",
            "ItemThumbnailURL": "https://s3-ap-southeast-2.amazonaws.com/openchargemap/images/IT/OCM170845/OCM-170845.thmb.2020122217504318.jpg",
            "Comment": "",
            "IsEnabled": true,
            "IsVideo": false,
            "IsFeaturedItem": false,
            "IsExternalResource": false,
            "User": {
                "ID": 11749,
                "Username": "ForumElettrico.it"
            },
            "DateCreated": "2020-12-22T17:51:00Z"
        },
        {
            "ID": 25924,
            "ChargePointID": 170845,
            "ItemURL": "https://s3-ap-southeast-2.amazonaws.com/openchargemap/images/IT/OCM170845/OCM-170845.orig.2020122217504900.jpg",
            "ItemThumbnailURL": "https://s3-ap-southeast-2.amazonaws.com/openchargemap/images/IT/OCM170845/OCM-170845.thmb.2020122217504900.jpg",
            "Comment": "",
            "IsEnabled": true,
            "IsVideo": false,
            "IsFeaturedItem": false,
            "IsExternalResource": false,
            "User": {
                "ID": 11749,
                "Username": "ForumElettrico.it"
            },
            "DateCreated": "2020-12-22T17:51:00Z"
        }
    ],
    "IsRecentlyVerified": false,
    "ID": 170845,
    "UUID": "8D06ADF8-BF85-4328-81D3-5C30991F691F",
    "DataProviderID": 1,
    "OperatorID": 3327,
    "UsageTypeID": 4,
    "AddressInfo": {
        "ID": 171204,
        "Title": "BECHARGE Km90 Risto Bottega Emiliana Fidenza ",
        "AddressLine1": "Via Rita Levi Montalcini, 280/A",
        "Town": "Fidenza ",
        "StateOrProvince": "PA",
        "Postcode": "43036",
        "CountryID": 112,
        "Latitude": 44.88719367815895,
        "Longitude": 10.086233562967777,
        "ContactTelephone1": "02-49527730",
        "ContactEmail": "emobility@buildingenergy.it",
        "RelatedURL": "https://www.bec.energy/",
        "DistanceUnit": 0
    },
    "Connections": [
        {
            "ID": 261053,
            "ConnectionTypeID": 25,
            "StatusTypeID": 50,
            "LevelID": 2,
            "Amps": 32,
            "Voltage": 400,
            "PowerKW": 22,
            "CurrentTypeID": 20,
            "Quantity": 4
        }
    ],
    "NumberOfPoints": 4,
    "StatusTypeID": 50,
    "DateLastStatusUpdate": "2020-12-22T17:51:00Z",
    "DataQualityLevel": 1,
    "DateCreated": "2020-12-11T08:39:00Z",
    "SubmissionStatusTypeID": 200
}