{
    "IsRecentlyVerified": false,
    "ID": 146715,
    "UUID": "C301FA01-16A8-41E6-8D09-378A3E30AC4C",
    "DataProviderID": 1,
    "OperatorID": 3,
    "OperatorsReference": "PG-70116,PG-83931",
    "UsageTypeID": 4,
    "UsageCost": "Free",
    "AddressInfo": {
        "ID": 147067,
        "Title": "Tesco Superstore-Rugby",
        "AddressLine1": "1 Leicester Road",
        "Town": "Rugby",
        "Postcode": "CV21 1RG",
        "CountryID": 1,
        "Latitude": 52.387153,
        "Longitude": -1.256546,
        "DistanceUnit": 0
    },
    "Connections": [
        {
            "ID": 204024,
            "ConnectionTypeID": 25,
            "StatusTypeID": 50,
            "LevelID": 2,
            "Amps": 32,
            "Voltage": 230,
            "PowerKW": 7,
            "CurrentTypeID": 10,
            "Quantity": 4
        }
    ],
    "NumberOfPoints": 4,
    "GeneralComments": "This is an open charge unit installed at the Tesco superstore at Leicester Road, Rugby",
    "StatusTypeID": 50,
    "DateLastStatusUpdate": "2020-06-02T09:08:00Z",
    "DataQualityLevel": 1,
    "DateCreated": "2020-01-14T17:02:00Z",
    "SubmissionStatusTypeID": 200
}