{
    "IsRecentlyVerified": false,
    "ID": 146195,
    "UUID": "393BF918-E0F0-43ED-8642-6A9E2F2DE81F",
    "DataProviderID": 1,
    "OperatorID": 20,
    "OperatorsReference": "81006",
    "UsageTypeID": 5,
    "UsageCost": "Polar Plus 15p/kWh CYC app 20p/kWh (min £1.50) Contactless",
    "AddressInfo": {
        "ID": 146547,
        "Title": "Appleton Gate Car-Park, Newark",
        "AddressLine1": "Appleton Gate Car-Park",
        "Town": "Newark",
        "StateOrProvince": "Nottinghamshire",
        "Postcode": "NG24 1JR",
        "CountryID": 1,
        "Latitude": 53.0777,
        "Longitude": -0.806,
        "ContactTelephone1": "0330 016 5126",
        "AccessComments": "Paid Parking _Charging hours 8am to 11.59pm, Monday to Sunday",
        "RelatedURL": "http://www.polar-network.com",
        "DistanceUnit": 0
    },
    "Connections": [
        {
            "ID": 203137,
            "ConnectionTypeID": 33,
            "StatusTypeID": 50,
            "LevelID": 3,
            "PowerKW": 50,
            "CurrentTypeID": 30,
            "Quantity": 1
        },
        {
            "ID": 203138,
            "ConnectionTypeID": 2,
            "StatusTypeID": 50,
            "LevelID": 3,
            "PowerKW": 50,
            "CurrentTypeID": 30,
            "Quantity": 1
        },
        {
            "ID": 203139,
            "ConnectionTypeID": 1036,
            "StatusTypeID": 50,
            "LevelID": 3,
            "PowerKW": 43,
            "CurrentTypeID": 20,
            "Quantity": 1
        }
    ],
    "NumberOfPoints": 1,
    "GeneralComments": "Please Note: £10 per hour overstay fee applies to this site after 90 minutes",
    "StatusTypeID": 50,
    "DateLastStatusUpdate": "2020-10-07T00:36:00Z",
    "DataQualityLevel": 1,
    "DateCreated": "2020-01-02T08:29:00Z",
    "SubmissionStatusTypeID": 200
}