{
    "IsRecentlyVerified": false,
    "ID": 44896,
    "UUID": "584FFA6A-FCE2-4901-ACA8-80F61298679C",
    "DataProviderID": 1,
    "OperatorID": 19,
    "UsageTypeID": 1,
    "AddressInfo": {
        "ID": 45242,
        "Title": "Rusland Pool Hotel ",
        "AddressLine1": "A590",
        "AddressLine2": "Haverthwaite",
        "Town": "Ulverston",
        "StateOrProvince": "Cumbria",
        "Postcode": "LA12 8AA",
        "CountryID": 1,
        "Latitude": 54.249569783399,
        "Longitude": -3.03367448936467,
        "ContactTelephone1": "01229 861384",
        "ContactEmail": "ruslandpool@gmail.com",
        "RelatedURL": "http://www.ruslandpool.co.uk/",
        "DistanceUnit": 0
    },
    "Connections": [
        {
            "ID": 55215,
            "ConnectionTypeID": 25,
            "StatusTypeID": 50,
            "LevelID": 2,
            "Amps": 32,
            "Voltage": 230,
            "PowerKW": 7,
            "CurrentTypeID": 10,
            "Quantity": 1
        }
    ],
    "NumberOfPoints": 1,
    "StatusTypeID": 50,
    "DateLastStatusUpdate": "2019-02-20T12:57:00Z",
    "DataQualityLevel": 1,
    "DateCreated": "2015-03-26T08:45:00Z",
    "SubmissionStatusTypeID": 200
}