{
    "IsRecentlyVerified": false,
    "ID": 19201,
    "UUID": "C3BE2687-1729-41D0-BF17-32F7998ED330",
    "DataProviderID": 2,
    "DataProvidersReference": "52792",
    "OperatorID": 5,
    "UsageTypeID": 1,
    "AddressInfo": {
        "ID": 19546,
        "Title": "CARCHARGING",
        "AddressLine1": "170 N Main St",
        "Town": "Randolph",
        "StateOrProvince": "MA",
        "Postcode": "02368",
        "CountryID": 2,
        "Latitude": 42.1651833,
        "Longitude": -71.0434622,
        "ContactTelephone1": "888-758-4389",
        "AccessComments": "24 hours daily",
        "RelatedURL": "http://www.chargepoint.com/",
        "DistanceUnit": 0
    },
    "Connections": [
        {
            "ID": 19476,
            "ConnectionTypeID": 9,
            "LevelID": 1,
            "Amps": 16,
            "Voltage": 120,
            "PowerKW": 1,
            "CurrentTypeID": 10,
            "Quantity": 1
        },
        {
            "ID": 19477,
            "ConnectionTypeID": 1,
            "LevelID": 2,
            "Amps": 16,
            "Voltage": 230,
            "PowerKW": 3,
            "CurrentTypeID": 10,
            "Quantity": 1
        },
        {
            "ID": 22332,
            "ConnectionTypeID": 1,
            "LevelID": 2,
            "Quantity": 1
        }
    ],
    "DateLastStatusUpdate": "2019-12-24T09:19:00Z",
    "DataQualityLevel": 3,
    "DateCreated": "2013-09-15T03:45:00Z",
    "SubmissionStatusTypeID": 200
}