{
    "IsRecentlyVerified": false,
    "ID": 35779,
    "UUID": "9118F968-8C16-4557-BCA5-3E6E5873C933",
    "DataProviderID": 26,
    "DataProvidersReference": "51564",
    "OperatorID": 73,
    "OperatorsReference": "EV-Box EVB-P1351190",
    "UsageCost": "0.00 jaarabonnement",
    "AddressInfo": {
        "ID": 36125,
        "Title": "Klein Landaas 20",
        "AddressLine1": "Klein Landaas 20",
        "Town": "Woudenberg",
        "Postcode": "3931 GC",
        "CountryID": 159,
        "Latitude": 52.07937,
        "Longitude": 5.44828,
        "RelatedURL": "http://www.ev-box.nl",
        "DistanceUnit": 0
    },
    "Connections": [
        {
            "ID": 39290,
            "ConnectionTypeID": 25,
            "LevelID": 2,
            "PowerKW": 5,
            "CurrentTypeID": 10
        }
    ],
    "NumberOfPoints": 1,
    "StatusTypeID": 50,
    "DateLastStatusUpdate": "2016-06-04T02:49:00Z",
    "DataQualityLevel": 3,
    "DateCreated": "2015-01-09T06:05:00Z",
    "SubmissionStatusTypeID": 100
}