{
    "IsRecentlyVerified": false,
    "ID": 121893,
    "UUID": "3CBEC9C9-0F65-4E1E-86C8-E612219A7184",
    "DataProviderID": 2,
    "DataProvidersReference": "105380",
    "OperatorID": 5,
    "UsageTypeID": 1,
    "AddressInfo": {
        "ID": 122239,
        "Title": "SIGNAL HILL",
        "AddressLine1": "1919 E Hill St",
        "Town": "Signal Hill",
        "StateOrProvince": "CA",
        "Postcode": "90755",
        "CountryID": 2,
        "Latitude": 33.797721,
        "Longitude": -118.168784,
        "ContactTelephone1": "888-758-4389",
        "AccessComments": "24 hours daily",
        "RelatedURL": "http://www.chargepoint.com/",
        "DistanceUnit": 0
    },
    "Connections": [
        {
            "ID": 171731,
            "ConnectionTypeID": 1,
            "LevelID": 2,
            "Amps": 16,
            "Voltage": 230,
            "PowerKW": 3,
            "CurrentTypeID": 10,
            "Quantity": 4
        }
    ],
    "DateLastStatusUpdate": "2019-12-24T09:10:00Z",
    "DataQualityLevel": 3,
    "DateCreated": "2019-04-06T05:02:00Z",
    "SubmissionStatusTypeID": 100
}