{
    "IsRecentlyVerified": false,
    "ID": 102733,
    "UUID": "4A27AD31-F6E8-42B5-AAC3-0A7C6A5C448B",
    "DataProviderID": 2,
    "DataProvidersReference": "76306",
    "OperatorID": 5,
    "UsageTypeID": 1,
    "AddressInfo": {
        "ID": 103079,
        "Title": "EVERGY",
        "AddressLine1": "1924 Van Brunt Blvd @ East High School",
        "Town": "Kansas City",
        "StateOrProvince": "MO",
        "Postcode": "64127",
        "CountryID": 2,
        "Latitude": 39.0887692,
        "Longitude": -94.5201908,
        "ContactTelephone1": "888-758-4389",
        "AccessComments": "24 hours daily",
        "RelatedURL": "http://www.chargepoint.com/",
        "DistanceUnit": 0
    },
    "Connections": [
        {
            "ID": 144853,
            "ConnectionTypeID": 1,
            "LevelID": 2,
            "Amps": 16,
            "Voltage": 230,
            "PowerKW": 3,
            "CurrentTypeID": 10,
            "Quantity": 6
        }
    ],
    "DateLastStatusUpdate": "2019-12-24T09:15:00Z",
    "DataQualityLevel": 3,
    "DateCreated": "2018-04-21T04:13:00Z",
    "SubmissionStatusTypeID": 100
}