{
    "IsRecentlyVerified": false,
    "ID": 117702,
    "UUID": "DF32189F-6C53-45F4-A138-DF074F581CFC",
    "DataProviderID": 1,
    "OperatorID": 3315,
    "OperatorsReference": "51602",
    "UsageTypeID": 4,
    "UsageCost": "£0.16/kWh; minimum fee £1.00",
    "AddressInfo": {
        "ID": 118048,
        "Title": "Shorthope Street Car Park Charging Hub, Rapid Charger",
        "AddressLine1": "Shorthope Street",
        "Town": "Musselburgh",
        "Postcode": "EH21 7DB",
        "CountryID": 1,
        "Latitude": 55.94324,
        "Longitude": -3.05107,
        "DistanceUnit": 0
    },
    "Connections": [
        {
            "ID": 166512,
            "ConnectionTypeID": 33,
            "Reference": "51602",
            "StatusTypeID": 50,
            "LevelID": 3,
            "PowerKW": 50,
            "CurrentTypeID": 30,
            "Quantity": 1
        },
        {
            "ID": 166513,
            "ConnectionTypeID": 2,
            "Reference": "51602",
            "StatusTypeID": 50,
            "LevelID": 3,
            "PowerKW": 50,
            "CurrentTypeID": 30,
            "Quantity": 1
        },
        {
            "ID": 166514,
            "ConnectionTypeID": 1036,
            "Reference": "51602",
            "StatusTypeID": 50,
            "LevelID": 3,
            "PowerKW": 43,
            "CurrentTypeID": 20,
            "Quantity": 1
        },
        {
            "ID": 271427,
            "ConnectionTypeID": 33,
            "Reference": "54045",
            "StatusTypeID": 50,
            "LevelID": 3,
            "PowerKW": 50,
            "CurrentTypeID": 30,
            "Quantity": 1
        },
        {
            "ID": 271428,
            "ConnectionTypeID": 2,
            "Reference": "54045",
            "StatusTypeID": 50,
            "LevelID": 3,
            "PowerKW": 50,
            "CurrentTypeID": 30,
            "Quantity": 1
        }
    ],
    "NumberOfPoints": 2,
    "StatusTypeID": 50,
    "DateLastStatusUpdate": "2021-04-27T11:13:00Z",
    "DataQualityLevel": 1,
    "DateCreated": "2019-02-23T06:16:00Z",
    "SubmissionStatusTypeID": 200
}