{
    "IsRecentlyVerified": false,
    "ID": 90094,
    "UUID": "0E686175-57A2-4B91-8E18-E2C34F0EDEE0",
    "DataProviderID": 1,
    "OperatorID": 45,
    "UsageTypeID": 7,
    "AddressInfo": {
        "ID": 90440,
        "Title": "MacCallum Suites",
        "AddressLine1": "10691 Palette Drive",
        "Town": "mendocino",
        "StateOrProvince": "ca",
        "Postcode": "95460",
        "CountryID": 2,
        "Latitude": 39.3090335,
        "Longitude": -123.798065,
        "ContactTelephone1": "7079370289",
        "ContactTelephone2": "8006090492",
        "ContactEmail": "info@maccallumhouse.com",
        "AccessComments": "9 am to 7 pm daily ,2 hours free, Tesla and Universal chargers",
        "DistanceUnit": 0
    },
    "Connections": [
        {
            "ID": 127716,
            "ConnectionTypeID": 30,
            "StatusTypeID": 50,
            "LevelID": 1,
            "Amps": 32,
            "Voltage": 120,
            "PowerKW": 7.7,
            "Quantity": 3
        }
    ],
    "NumberOfPoints": 3,
    "StatusTypeID": 50,
    "DateLastStatusUpdate": "2017-07-22T10:22:00Z",
    "DataQualityLevel": 1,
    "DateCreated": "2017-07-07T22:40:00Z",
    "SubmissionStatusTypeID": 200
}