{
    "IsRecentlyVerified": false,
    "ID": 35970,
    "UUID": "5B7A86D4-29AF-46AA-9694-1D257F4E835B",
    "DataProviderID": 26,
    "DataProvidersReference": "23136",
    "OperatorID": 157,
    "OperatorsReference": "NewMotion 02001032",
    "UsageCost": "0.00 jaarabonnement",
    "AddressInfo": {
        "ID": 36316,
        "Title": "Stationsdwarsstraat",
        "AddressLine1": "Stationsdwarsstraat",
        "Town": "Utrecht",
        "Postcode": "3511 EL",
        "CountryID": 159,
        "Latitude": 52.0898857116699,
        "Longitude": 5.11233329772949,
        "ContactTelephone1": "088 0109500",
        "RelatedURL": "http://thenewmotion.nl/",
        "DistanceUnit": 0
    },
    "Connections": [
        {
            "ID": 39481,
            "ConnectionTypeID": 25,
            "LevelID": 2,
            "PowerKW": 3.7,
            "CurrentTypeID": 10
        }
    ],
    "NumberOfPoints": 1,
    "StatusTypeID": 50,
    "DateLastStatusUpdate": "2016-06-04T02:50:00Z",
    "DataQualityLevel": 3,
    "DateCreated": "2015-01-09T06:05:00Z",
    "SubmissionStatusTypeID": 100
}