{
    "IsRecentlyVerified": false,
    "ID": 68149,
    "UUID": "F02FD07F-6BFE-4E18-9040-0E1685A796E2",
    "DataProviderID": 26,
    "DataProvidersReference": "93827",
    "OperatorID": 103,
    "OperatorsReference": "Allego NLALLEGO0011942",
    "UsageCost": "0.00 jaarabonnement",
    "AddressInfo": {
        "ID": 68495,
        "Title": "Maarten Lutherweg 142",
        "AddressLine1": "Maarten Lutherweg 142",
        "Town": "Amstelveen",
        "Postcode": "1185 AS",
        "CountryID": 159,
        "Latitude": 52.2930857,
        "Longitude": 4.8631728,
        "ContactTelephone1": "0800-3745337",
        "RelatedURL": "http://www.allego.eu/",
        "DistanceUnit": 0
    },
    "Connections": [
        {
            "ID": 94943,
            "ConnectionTypeID": 25,
            "LevelID": 2,
            "PowerKW": 11,
            "CurrentTypeID": 10
        },
        {
            "ID": 94944,
            "ConnectionTypeID": 25,
            "LevelID": 2,
            "PowerKW": 11,
            "CurrentTypeID": 10
        }
    ],
    "NumberOfPoints": 1,
    "StatusTypeID": 50,
    "DateLastStatusUpdate": "2016-06-04T02:37:00Z",
    "DataQualityLevel": 3,
    "DateCreated": "2016-06-04T02:37:00Z",
    "SubmissionStatusTypeID": 100
}