{
    "IsRecentlyVerified": false,
    "ID": 31559,
    "UUID": "E5944A7D-C0FC-4750-BBF7-EFC0406D8864",
    "DataProviderID": 26,
    "DataProvidersReference": "54267",
    "OperatorID": 78,
    "OperatorsReference": "Essent EM-CH-00002000-01-00006",
    "UsageCost": "0.00 jaarabonnement",
    "AddressInfo": {
        "ID": 31905,
        "Title": "Esplanade du Mont-Blanc",
        "AddressLine1": "Esplanade du Mont-Blanc",
        "Town": "Neuchâtel",
        "Postcode": "2001",
        "CountryID": 217,
        "Latitude": 46.9893,
        "Longitude": 6.9285,
        "RelatedURL": "http://www.essent.nl",
        "DistanceUnit": 0
    },
    "Connections": [
        {
            "ID": 35070,
            "ConnectionTypeID": 25,
            "LevelID": 2,
            "PowerKW": 11,
            "CurrentTypeID": 10
        },
        {
            "ID": 45972,
            "ConnectionTypeID": 25,
            "LevelID": 2,
            "PowerKW": 11,
            "CurrentTypeID": 10
        }
    ],
    "NumberOfPoints": 1,
    "StatusTypeID": 50,
    "DateLastStatusUpdate": "2016-06-04T02:37:00Z",
    "DataQualityLevel": 3,
    "DateCreated": "2015-01-09T06:03:00Z",
    "SubmissionStatusTypeID": 100
}