{
    "IsRecentlyVerified": false,
    "ID": 77334,
    "UUID": "3C51270E-609B-4B1B-B327-E70B337A5FA9",
    "DataProviderID": 1,
    "OperatorID": 3253,
    "OperatorsReference": "AT*SMA*EAT0700141*001AC,AT*SMA*EAT0700141*002AC",
    "UsageTypeID": 1,
    "UsageCost": "€0,15/min ; Andere Tarife möglich",
    "AddressInfo": {
        "ID": 77680,
        "Title": "Ladestation Stadtwerke",
        "AddressLine1": "Untere Feldgasse 4 (Fischergries 2)",
        "Town": "Kufstein",
        "StateOrProvince": "Tirol",
        "Postcode": "6330",
        "CountryID": 19,
        "Latitude": 47.585214,
        "Longitude": 12.168203,
        "DistanceUnit": 0
    },
    "Connections": [
        {
            "ID": 111416,
            "ConnectionTypeID": 25,
            "StatusTypeID": 50,
            "LevelID": 2,
            "Amps": 32,
            "Voltage": 400,
            "PowerKW": 22,
            "CurrentTypeID": 20,
            "Quantity": 1
        },
        {
            "ID": 111421,
            "ConnectionTypeID": 1036,
            "StatusTypeID": 50,
            "LevelID": 2,
            "Amps": 32,
            "Voltage": 400,
            "PowerKW": 22,
            "CurrentTypeID": 20,
            "Quantity": 1
        }
    ],
    "NumberOfPoints": 3,
    "StatusTypeID": 50,
    "DateLastStatusUpdate": "2017-10-19T10:26:00Z",
    "DataQualityLevel": 1,
    "DateCreated": "2017-01-09T09:45:00Z",
    "SubmissionStatusTypeID": 200
}