{
    "IsRecentlyVerified": false,
    "ID": 156897,
    "UUID": "DE3A45A1-1D45-4CC3-BB52-E182E0DFD622",
    "DataProviderID": 19,
    "DataProvidersReference": "6443",
    "AddressInfo": {
        "ID": 157251,
        "Title": "Teatern",
        "AddressLine1": "Malmtorgsgatan 1",
        "Town": "KARLSTAD",
        "StateOrProvince": "VÄRMLAND",
        "Postcode": "65340",
        "CountryID": 216,
        "Latitude": 59.38169,
        "Longitude": 13.49655,
        "AccessComments": "",
        "DistanceUnit": 0
    },
    "Connections": [
        {
            "ID": 222887,
            "ConnectionTypeID": 25,
            "Reference": "1",
            "LevelID": 2,
            "Amps": 16,
            "Voltage": 400,
            "PowerKW": 11,
            "CurrentTypeID": 20
        },
        {
            "ID": 222888,
            "ConnectionTypeID": 25,
            "Reference": "2",
            "LevelID": 2,
            "Amps": 16,
            "Voltage": 400,
            "PowerKW": 11,
            "CurrentTypeID": 20
        },
        {
            "ID": 222889,
            "ConnectionTypeID": 25,
            "Reference": "3",
            "LevelID": 2,
            "Amps": 16,
            "Voltage": 400,
            "PowerKW": 11,
            "CurrentTypeID": 20
        },
        {
            "ID": 222890,
            "ConnectionTypeID": 25,
            "Reference": "4",
            "LevelID": 2,
            "Amps": 16,
            "Voltage": 400,
            "PowerKW": 11,
            "CurrentTypeID": 20
        }
    ],
    "NumberOfPoints": 4,
    "StatusTypeID": 0,
    "DateLastStatusUpdate": "2021-03-24T05:11:00Z",
    "DataQualityLevel": 2,
    "DateCreated": "2020-05-26T08:22:00Z",
    "SubmissionStatusTypeID": 100
}