{
    "IsRecentlyVerified": false,
    "ID": 27711,
    "UUID": "C3833F23-D67C-46E1-BC51-75BDE321F3A0",
    "DataProviderID": 2,
    "DataProvidersReference": "51923",
    "UsageTypeID": 1,
    "AddressInfo": {
        "ID": 28057,
        "Title": "Lodi Public Library",
        "AddressLine1": "201 W Locust St",
        "Town": "Lodi",
        "StateOrProvince": "CA",
        "Postcode": "95240",
        "CountryID": 2,
        "Latitude": 38.137038,
        "Longitude": -121.275506,
        "ContactTelephone1": "209-333-6762",
        "AccessComments": "24 hours daily",
        "RelatedURL": "",
        "DistanceUnit": 0
    },
    "Connections": [
        {
            "ID": 30406,
            "ConnectionTypeID": 1,
            "LevelID": 2,
            "Amps": 16,
            "Voltage": 230,
            "PowerKW": 3,
            "CurrentTypeID": 10,
            "Quantity": 1
        }
    ],
    "DateLastStatusUpdate": "2019-04-06T04:02:00Z",
    "DataQualityLevel": 3,
    "DateCreated": "2014-11-28T03:38:00Z",
    "SubmissionStatusTypeID": 100
}