{
    "IsRecentlyVerified": false,
    "ID": 92498,
    "UUID": "D990544A-E89B-4998-9B21-38C54A5A5F7D",
    "DataProviderID": 1,
    "OperatorID": 23,
    "OperatorsReference": "33582",
    "UsageTypeID": 4,
    "AddressInfo": {
        "ID": 92844,
        "Title": "Hampton Inn Stony Creek/Petersburg Area",
        "AddressLine1": "10476 Blue Star Hwy",
        "Town": "Stony Creek",
        "StateOrProvince": "Virginia",
        "Postcode": "23882",
        "CountryID": 2,
        "Latitude": 36.974829,
        "Longitude": -77.394007,
        "ContactTelephone1": "(434) 246-5500",
        "DistanceUnit": 0
    },
    "Connections": [
        {
            "ID": 131099,
            "ConnectionTypeID": 30,
            "StatusTypeID": 50,
            "LevelID": 2,
            "PowerKW": 8,
            "CurrentTypeID": 10,
            "Quantity": 3
        }
    ],
    "NumberOfPoints": 3,
    "GeneralComments": "3 Tesla Connectors, up to 8kW.Available for customers. Please see front desk.",
    "StatusTypeID": 50,
    "DateLastStatusUpdate": "2019-06-05T11:54:00Z",
    "DataQualityLevel": 1,
    "DateCreated": "2017-09-07T05:51:00Z",
    "SubmissionStatusTypeID": 200
}