{
    "IsRecentlyVerified": false,
    "ID": 62083,
    "UUID": "05687ABE-D736-4D65-B813-8949827351C0",
    "DataProviderID": 2,
    "DataProvidersReference": "73465",
    "UsageTypeID": 1,
    "AddressInfo": {
        "ID": 62429,
        "Title": "Carbondale Bus Rapid Transit Station - Park and Ride",
        "AddressLine1": "345 State Highway 133",
        "Town": "Carbondale",
        "StateOrProvince": "CO",
        "Postcode": "81623",
        "CountryID": 2,
        "Latitude": 39.412498,
        "Longitude": -107.221581,
        "ContactTelephone1": "970-925-8484",
        "AccessComments": "24 hours daily; no overnight parking",
        "RelatedURL": "",
        "DistanceUnit": 0
    },
    "Connections": [
        {
            "ID": 78986,
            "ConnectionTypeID": 1,
            "LevelID": 2,
            "Amps": 16,
            "Voltage": 230,
            "PowerKW": 3.7,
            "CurrentTypeID": 10,
            "Quantity": 1
        }
    ],
    "DateLastStatusUpdate": "2020-06-26T03:01:00Z",
    "DataQualityLevel": 3,
    "DateCreated": "2016-03-03T11:38:00Z",
    "SubmissionStatusTypeID": 100
}