{
    "IsRecentlyVerified": false,
    "ID": 188541,
    "UUID": "9FEF60DE-168A-4267-A05F-6FDFFB5EFAA3",
    "DataProviderID": 1,
    "OperatorID": 23,
    "UsageTypeID": 4,
    "AddressInfo": {
        "ID": 188900,
        "Title": "Escanaba, MI Supercharger",
        "AddressLine1": "505 North 26th Street",
        "Town": "Escanaba",
        "StateOrProvince": "MI",
        "Postcode": "49783",
        "CountryID": 2,
        "Latitude": 45.750542,
        "Longitude": -87.085129,
        "DistanceUnit": 0
    },
    "Connections": [
        {
            "ID": 304528,
            "ConnectionTypeID": 33,
            "StatusTypeID": 50,
            "LevelID": 3,
            "PowerKW": 250,
            "CurrentTypeID": 30,
            "Quantity": 8
        }
    ],
    "NumberOfPoints": 8,
    "StatusTypeID": 50,
    "DateLastStatusUpdate": "2021-08-03T12:46:00Z",
    "DataQualityLevel": 1,
    "DateCreated": "2021-08-01T13:57:00Z",
    "SubmissionStatusTypeID": 200
}