{
    "IsRecentlyVerified": false,
    "ID": 38720,
    "UUID": "977B6D86-AC74-4739-B564-DA1C389482D9",
    "DataProviderID": 26,
    "DataProvidersReference": "48322",
    "OperatorID": 178,
    "OperatorsReference": "EVnetNL EV0212",
    "UsageCost": "0.00 jaarabonnement",
    "AddressInfo": {
        "ID": 39066,
        "Title": "Kloosterstraat",
        "AddressLine1": "Kloosterstraat",
        "Town": "Langedijk",
        "Postcode": "1723 HG",
        "CountryID": 159,
        "Latitude": 52.697902,
        "Longitude": 4.810166,
        "ContactTelephone1": "0800-3522365",
        "RelatedURL": "http://www.evnet.nl",
        "DistanceUnit": 0
    },
    "Connections": [
        {
            "ID": 42231,
            "ConnectionTypeID": 25,
            "LevelID": 2,
            "PowerKW": 11,
            "CurrentTypeID": 10
        }
    ],
    "NumberOfPoints": 1,
    "StatusTypeID": 50,
    "DateLastStatusUpdate": "2016-06-04T02:55:00Z",
    "DataQualityLevel": 3,
    "DateCreated": "2015-01-09T06:08:00Z",
    "SubmissionStatusTypeID": 100
}