{
    "IsRecentlyVerified": false,
    "ID": 56347,
    "UUID": "29DF8F5D-E548-4C1E-B6C7-98C0C59317E7",
    "DataProviderID": 1,
    "OperatorID": 45,
    "UsageTypeID": 1,
    "AddressInfo": {
        "ID": 56693,
        "Title": "Autohaus Kahle",
        "AddressLine1": "Ernst-Abbe-Ring 4",
        "Town": "Neustadt",
        "StateOrProvince": "Region Hannover",
        "Postcode": "31535",
        "CountryID": 87,
        "Latitude": 52.5065453243554,
        "Longitude": 9.476826138028756,
        "ContactTelephone1": " +49 5032 8040",
        "AccessComments": "Vor dem Tor an der Hauswand des VW / Skoda / Audi Autohauses.",
        "RelatedURL": "http://www.kahle.de/",
        "DistanceUnit": 0
    },
    "Connections": [
        {
            "ID": 71080,
            "ConnectionTypeID": 25,
            "StatusTypeID": 50,
            "LevelID": 2,
            "Amps": 16,
            "Voltage": 230,
            "PowerKW": 3.7,
            "CurrentTypeID": 10,
            "Quantity": 1
        }
    ],
    "NumberOfPoints": 1,
    "StatusTypeID": 50,
    "DateLastStatusUpdate": "2015-10-30T21:02:00Z",
    "DataQualityLevel": 1,
    "DateCreated": "2015-10-30T21:02:00Z",
    "SubmissionStatusTypeID": 200
}