{
    "IsRecentlyVerified": false,
    "ID": 97100,
    "UUID": "963BDEAC-6A45-43B8-90D5-F6FA5B6B2F3F",
    "DataProviderID": 1,
    "OperatorID": 45,
    "UsageTypeID": 6,
    "AddressInfo": {
        "ID": 97446,
        "Title": "H4 Hotel Kassel",
        "AddressLine1": "Baumbachstraße 2",
        "Town": "Kassel",
        "StateOrProvince": "Hessen",
        "Postcode": "34119",
        "CountryID": 87,
        "Latitude": 51.3169956,
        "Longitude": 9.459933699999965,
        "ContactTelephone1": " +49561 78100",
        "AccessComments": "Durchgehend nutzbare Wallboxen in Tiefgarage des Hotels für Hotelgäste",
        "RelatedURL": "https://www.h-hotels.com/de/h4/hotels/h4-hotel-kassel",
        "DistanceUnit": 0
    },
    "Connections": [
        {
            "ID": 137856,
            "ConnectionTypeID": 28,
            "StatusTypeID": 50,
            "LevelID": 2,
            "Amps": 16,
            "Voltage": 230,
            "PowerKW": 3.7,
            "CurrentTypeID": 10,
            "Quantity": 1
        },
        {
            "ID": 137857,
            "ConnectionTypeID": 25,
            "StatusTypeID": 50,
            "LevelID": 2,
            "Amps": 16,
            "Voltage": 230,
            "PowerKW": 3.7,
            "CurrentTypeID": 10,
            "Quantity": 1
        }
    ],
    "NumberOfPoints": 2,
    "StatusTypeID": 50,
    "DateLastStatusUpdate": "2018-01-05T07:40:00Z",
    "DataQualityLevel": 1,
    "DateCreated": "2018-01-05T07:40:00Z",
    "SubmissionStatusTypeID": 200
}