{
    "IsRecentlyVerified": false,
    "ID": 23265,
    "UUID": "0A6426A4-8F26-45FE-A1A5-9CDE9B58EB4D",
    "DataProviderID": 1,
    "OperatorID": 19,
    "UsageTypeID": 1,
    "UsageCost": "",
    "AddressInfo": {
        "ID": 23610,
        "Title": "National Trust Tywyn Cemaes Cottage",
        "AddressLine1": "",
        "AddressLine2": "",
        "Town": "Anglesey",
        "StateOrProvince": "Wales",
        "Postcode": "LL67 0ND",
        "CountryID": 1,
        "Latitude": 53.413432,
        "Longitude": -4.44845,
        "ContactTelephone1": "0844 335 1287",
        "ContactTelephone2": "",
        "ContactEmail": "",
        "AccessComments": "",
        "RelatedURL": "http://www.nationaltrustcottages.co.uk/cottage/tywyn-cottage-008011/",
        "DistanceUnit": 0
    },
    "Connections": [
        {
            "ID": 25094,
            "ConnectionTypeID": 25,
            "StatusTypeID": 50,
            "LevelID": 2,
            "Amps": 32,
            "Voltage": 230,
            "PowerKW": 7,
            "CurrentTypeID": 10,
            "Quantity": 1
        }
    ],
    "NumberOfPoints": 1,
    "GeneralComments": "",
    "StatusTypeID": 50,
    "DateLastStatusUpdate": "2014-05-09T16:14:00Z",
    "DataQualityLevel": 1,
    "DateCreated": "2014-04-30T11:45:00Z",
    "SubmissionStatusTypeID": 200
}