{
    "IsRecentlyVerified": false,
    "ID": 56534,
    "UUID": "8ADFE824-575A-4B58-8B52-4F7F212C1669",
    "DataProviderID": 2,
    "DataProvidersReference": "70588",
    "UsageTypeID": 1,
    "AddressInfo": {
        "ID": 56880,
        "Title": "Woodland Joint Unified School District - Rhoda Maxwell Elementary School",
        "AddressLine1": "50 Ashley Ave",
        "Town": "Woodland",
        "StateOrProvince": "CA",
        "Postcode": "95695",
        "CountryID": 2,
        "Latitude": 38.683943,
        "Longitude": -121.79905,
        "ContactTelephone1": "530-662-1784",
        "AccessComments": "24 hours daily; check in with office during school hours",
        "RelatedURL": "",
        "DistanceUnit": 0
    },
    "Connections": [
        {
            "ID": 71292,
            "ConnectionTypeID": 1,
            "LevelID": 2,
            "Amps": 16,
            "Voltage": 230,
            "PowerKW": 3.7,
            "CurrentTypeID": 10,
            "Quantity": 2
        }
    ],
    "DateLastStatusUpdate": "2020-06-26T03:00:00Z",
    "DataQualityLevel": 3,
    "DateCreated": "2015-11-04T08:42:00Z",
    "SubmissionStatusTypeID": 100
}