{
    "IsRecentlyVerified": false,
    "ID": 163774,
    "UUID": "DEDECC65-FA1F-43D0-A409-30D1980AFFA7",
    "DataProviderID": 1,
    "OperatorID": 23,
    "OperatorsReference": "50560",
    "UsageTypeID": 4,
    "UsageCost": "€0.33/kWh; Andere Tarife für ältere Autos",
    "AddressInfo": {
        "ID": 164131,
        "Title": "Seed & Greet Hilden Superchargers",
        "AddressLine1": "Nordpark 2-4",
        "Town": "Hilden",
        "Postcode": "40724",
        "CountryID": 87,
        "Latitude": 51.191119,
        "Longitude": 6.936912,
        "RelatedURL": "https://seedandgreet.de/",
        "DistanceUnit": 0
    },
    "Connections": [
        {
            "ID": 235371,
            "ConnectionTypeID": 33,
            "StatusTypeID": 50,
            "LevelID": 3,
            "PowerKW": 250,
            "CurrentTypeID": 30,
            "Quantity": 12,
            "Comments": "Supercharger V3"
        },
        {
            "ID": 273422,
            "ConnectionTypeID": 27,
            "StatusTypeID": 50,
            "LevelID": 3,
            "PowerKW": 150,
            "CurrentTypeID": 30,
            "Quantity": 8,
            "Comments": "Supercharger V2"
        }
    ],
    "NumberOfPoints": 20,
    "GeneralComments": "Charging16 Superchargers, available 24/7, up to 150kW",
    "StatusTypeID": 50,
    "DateLastStatusUpdate": "2021-06-22T13:56:00Z",
    "DataQualityLevel": 1,
    "DateCreated": "2020-08-24T17:13:00Z",
    "SubmissionStatusTypeID": 200
}