{
    "UserComments": [
        {
            "ID": 10384,
            "ChargePointID": 57923,
            "CommentTypeID": 10,
            "UserName": "GUN-ZE1",
            "Rating": 4,
            "DateCreated": "2016-05-12T13:58:34.843Z",
            "User": {
                "ID": 9368,
                "Username": "GUN-ZE1"
            },
            "CheckinStatusTypeID": 10
        }
    ],
    "MediaItems": [
        {
            "ID": 6418,
            "ChargePointID": 57923,
            "ItemURL": "https://s3-ap-southeast-2.amazonaws.com/openchargemap/images/DE/OCM57923/OCM-57923.orig.2016051213585081.jpg",
            "ItemThumbnailURL": "https://s3-ap-southeast-2.amazonaws.com/openchargemap/images/DE/OCM57923/OCM-57923.thmb.2016051213585081.jpg",
            "Comment": "",
            "IsEnabled": true,
            "IsVideo": false,
            "IsFeaturedItem": false,
            "IsExternalResource": false,
            "User": {
                "ID": 9368,
                "Username": "GUN-ZE1"
            },
            "DateCreated": "2016-05-12T13:59:00Z"
        },
        {
            "ID": 6419,
            "ChargePointID": 57923,
            "ItemURL": "https://s3-ap-southeast-2.amazonaws.com/openchargemap/images/DE/OCM57923/OCM-57923.orig.2016051213590019.jpg",
            "ItemThumbnailURL": "https://s3-ap-southeast-2.amazonaws.com/openchargemap/images/DE/OCM57923/OCM-57923.thmb.2016051213590019.jpg",
            "Comment": "",
            "IsEnabled": true,
            "IsVideo": false,
            "IsFeaturedItem": false,
            "IsExternalResource": false,
            "User": {
                "ID": 9368,
                "Username": "GUN-ZE1"
            },
            "DateCreated": "2016-05-12T13:59:00Z"
        }
    ],
    "IsRecentlyVerified": false,
    "ID": 57923,
    "UUID": "824741B4-3940-4DE3-A72C-ACBC6D9210B5",
    "DataProviderID": 1,
    "OperatorID": 234,
    "UsageTypeID": 4,
    "UsageCost": "0",
    "AddressInfo": {
        "ID": 58269,
        "Title": "N-Ergie-Ladesäule Insingen",
        "AddressLine1": "Diebacher Straße 4",
        "Town": "Insingen",
        "Postcode": "91610",
        "CountryID": 87,
        "Latitude": 49.30392847380549,
        "Longitude": 10.166682085948535,
        "ContactEmail": "elektromobilitaet@n-ergie.de",
        "AccessComments": "Rund um die Uhr (24/7) nutzbar.\r\nParkplätze öffentlich, kostenlos\r\n",
        "DistanceUnit": 0
    },
    "Connections": [
        {
            "ID": 73527,
            "ConnectionTypeID": 25,
            "StatusTypeID": 50,
            "LevelID": 2,
            "Amps": 32,
            "Voltage": 400,
            "PowerKW": 22,
            "CurrentTypeID": 20,
            "Quantity": 2
        }
    ],
    "NumberOfPoints": 2,
    "GeneralComments": "Ladeverbund Franken+\r\nderzeit noch ohne Karte nutzbar",
    "StatusTypeID": 50,
    "DateLastStatusUpdate": "2016-05-13T07:07:00Z",
    "DataQualityLevel": 1,
    "DateCreated": "2015-12-29T11:26:00Z",
    "SubmissionStatusTypeID": 200
}