{
    "IsRecentlyVerified": false,
    "ID": 142661,
    "UUID": "87AF9133-6E54-4575-ABAA-A1E8A0BD9A0D",
    "DataProviderID": 2,
    "DataProvidersReference": "93698",
    "OperatorID": 15,
    "UsageTypeID": 4,
    "AddressInfo": {
        "ID": 143013,
        "Title": "Peck Lane Plaza Shopping Center",
        "AddressLine1": "550 Boston Post Rd",
        "Town": "Orange",
        "StateOrProvince": "CT",
        "Postcode": "06477",
        "CountryID": 2,
        "Latitude": 41.251801,
        "Longitude": -73.017784,
        "ContactTelephone1": "877-455-3833",
        "AccessComments": "24 hours daily\r\nPublic - Card key at all times",
        "RelatedURL": "https://www.evgo.com/",
        "DistanceUnit": 0
    },
    "Connections": [
        {
            "ID": 198842,
            "ConnectionTypeID": 2,
            "LevelID": 3,
            "Amps": 100,
            "Voltage": 400,
            "PowerKW": 40,
            "CurrentTypeID": 30,
            "Quantity": 1
        },
        {
            "ID": 198843,
            "ConnectionTypeID": 32,
            "LevelID": 3,
            "Amps": 100,
            "Voltage": 400,
            "PowerKW": 40,
            "CurrentTypeID": 30,
            "Quantity": 1
        }
    ],
    "StatusTypeID": 50,
    "DateLastStatusUpdate": "2020-06-26T03:04:00Z",
    "DataQualityLevel": 3,
    "DateCreated": "2019-12-24T09:18:00Z",
    "SubmissionStatusTypeID": 100
}