{
    "IsRecentlyVerified": false,
    "ID": 139294,
    "UUID": "E517C5D0-5408-43F9-BDB1-8EE914ABA5D9",
    "DataProviderID": 2,
    "DataProvidersReference": "143933",
    "OperatorID": 59,
    "UsageTypeID": 1,
    "AddressInfo": {
        "ID": 139646,
        "Title": "Greenlots - 182053",
        "AddressLine1": "2175 John S Gibson Dr",
        "Town": "San Pedro",
        "StateOrProvince": "CA",
        "Postcode": "90732",
        "CountryID": 2,
        "Latitude": 33.765155,
        "Longitude": -118.282149,
        "ContactTelephone1": "855-900-7584",
        "AccessComments": "24 hours daily",
        "RelatedURL": "http://greenlots.com/",
        "DistanceUnit": 0
    },
    "Connections": [
        {
            "ID": 194600,
            "ConnectionTypeID": 1,
            "LevelID": 2,
            "Amps": 16,
            "Voltage": 230,
            "PowerKW": 3.7,
            "CurrentTypeID": 10,
            "Quantity": 3
        }
    ],
    "StatusTypeID": 50,
    "DateLastStatusUpdate": "2020-06-26T02:56:00Z",
    "DataQualityLevel": 3,
    "DateCreated": "2019-12-24T09:10:00Z",
    "SubmissionStatusTypeID": 100
}