{
    "IsRecentlyVerified": false,
    "ID": 65538,
    "UUID": "1F72BA31-130F-47B7-BA2F-23593F2E270A",
    "DataProviderID": 26,
    "DataProvidersReference": "85025",
    "OperatorID": 73,
    "OperatorsReference": "EV-Box EVB-P1512013",
    "UsageCost": "0.00 jaarabonnement",
    "AddressInfo": {
        "ID": 65884,
        "Title": "Willem Hasekampstraat 2",
        "AddressLine1": "Willem Hasekampstraat 2",
        "Town": "Schiedam",
        "Postcode": "3117 ZB",
        "CountryID": 159,
        "Latitude": 51.9117,
        "Longitude": 4.37485,
        "RelatedURL": "http://www.ev-box.nl",
        "DistanceUnit": 0
    },
    "Connections": [
        {
            "ID": 90340,
            "ConnectionTypeID": 25,
            "LevelID": 2,
            "PowerKW": 11,
            "CurrentTypeID": 10
        },
        {
            "ID": 90341,
            "ConnectionTypeID": 25,
            "LevelID": 2,
            "PowerKW": 11,
            "CurrentTypeID": 10
        }
    ],
    "NumberOfPoints": 1,
    "StatusTypeID": 50,
    "DateLastStatusUpdate": "2016-06-04T02:42:00Z",
    "DataQualityLevel": 3,
    "DateCreated": "2016-04-27T09:41:00Z",
    "SubmissionStatusTypeID": 100
}