{
    "IsRecentlyVerified": false,
    "ID": 171673,
    "UUID": "D5EA8231-1338-4E7F-82B6-937C1A6B2D3F",
    "DataProviderID": 1,
    "OperatorID": 36,
    "UsageTypeID": 4,
    "AddressInfo": {
        "ID": 172032,
        "Title": "Trapstraat",
        "AddressLine1": "Trapstraat",
        "Town": "Antwerp",
        "StateOrProvince": "Flanders",
        "Postcode": "2060",
        "CountryID": 26,
        "Latitude": 51.22961714031513,
        "Longitude": 4.4243655582477,
        "DistanceUnit": 0
    },
    "Connections": [
        {
            "ID": 262518,
            "ConnectionTypeID": 25,
            "StatusTypeID": 50,
            "Quantity": 2
        }
    ],
    "NumberOfPoints": 1,
    "StatusTypeID": 50,
    "DateLastStatusUpdate": "2021-01-11T09:37:00Z",
    "DataQualityLevel": 1,
    "DateCreated": "2021-01-09T12:40:00Z",
    "SubmissionStatusTypeID": 200
}