{
    "IsRecentlyVerified": false,
    "ID": 133843,
    "UUID": "3B3DD27E-6EF6-4939-84A0-AD5960134871",
    "DataProviderID": 1,
    "OperatorID": 1,
    "UsageTypeID": 1,
    "AddressInfo": {
        "ID": 134189,
        "Title": "Gaspeed Andares",
        "AddressLine1": "Carretera San Luis Potosí-Querétaro",
        "AddressLine2": "El Polvorín",
        "Town": "Zaragoza",
        "StateOrProvince": "Zaragoza",
        "Postcode": "79526",
        "CountryID": 146,
        "Latitude": 21.980135,
        "Longitude": -100.82295,
        "DistanceUnit": 0
    },
    "Connections": [
        {
            "ID": 187295,
            "ConnectionTypeID": 32,
            "StatusTypeID": 50,
            "LevelID": 3,
            "PowerKW": 50,
            "CurrentTypeID": 30,
            "Quantity": 1
        },
        {
            "ID": 187296,
            "ConnectionTypeID": 1,
            "StatusTypeID": 50,
            "LevelID": 2,
            "PowerKW": 19.2,
            "CurrentTypeID": 10,
            "Quantity": 2
        },
        {
            "ID": 187297,
            "ConnectionTypeID": 2,
            "StatusTypeID": 50,
            "LevelID": 3,
            "PowerKW": 50,
            "CurrentTypeID": 30
        }
    ],
    "NumberOfPoints": 1,
    "StatusTypeID": 50,
    "DateLastStatusUpdate": "2019-11-01T09:28:00Z",
    "DataQualityLevel": 1,
    "DateCreated": "2019-10-28T07:34:00Z",
    "SubmissionStatusTypeID": 200
}