{
    "IsRecentlyVerified": false,
    "ID": 167439,
    "UUID": "5129E1DC-60D1-44D0-8028-F5056DDBB586",
    "DataProviderID": 19,
    "DataProvidersReference": "2422",
    "AddressInfo": {
        "ID": 167798,
        "Title": "Tesla Superlader Rødekro",
        "AddressLine1": "Kometvej Aabenraa 1",
        "Town": "Rødekro",
        "StateOrProvince": "Syddanmark",
        "Postcode": "6230",
        "CountryID": 65,
        "Latitude": 55.07312,
        "Longitude": 9.36328,
        "AccessComments": "",
        "DistanceUnit": 0
    },
    "Connections": [
        {
            "ID": 253623,
            "ConnectionTypeID": 27,
            "Reference": "1",
            "LevelID": 3,
            "Amps": 100,
            "Voltage": 500,
            "PowerKW": 50,
            "CurrentTypeID": 30,
            "Comments": "Mode 4"
        },
        {
            "ID": 253624,
            "ConnectionTypeID": 27,
            "Reference": "2",
            "LevelID": 3,
            "Amps": 100,
            "Voltage": 500,
            "PowerKW": 50,
            "CurrentTypeID": 30,
            "Comments": "Mode 4"
        },
        {
            "ID": 253625,
            "ConnectionTypeID": 27,
            "Reference": "3",
            "LevelID": 3,
            "Amps": 100,
            "Voltage": 500,
            "PowerKW": 50,
            "CurrentTypeID": 30,
            "Comments": "Mode 4"
        },
        {
            "ID": 253626,
            "ConnectionTypeID": 27,
            "Reference": "4",
            "LevelID": 3,
            "Amps": 100,
            "Voltage": 500,
            "PowerKW": 50,
            "CurrentTypeID": 30,
            "Comments": "Mode 4"
        },
        {
            "ID": 253627,
            "ConnectionTypeID": 27,
            "Reference": "5",
            "LevelID": 3,
            "Amps": 100,
            "Voltage": 500,
            "PowerKW": 50,
            "CurrentTypeID": 30,
            "Comments": "Mode 4"
        },
        {
            "ID": 253628,
            "ConnectionTypeID": 27,
            "Reference": "6",
            "LevelID": 3,
            "Amps": 100,
            "Voltage": 500,
            "PowerKW": 50,
            "CurrentTypeID": 30,
            "Comments": "Mode 4"
        }
    ],
    "NumberOfPoints": 6,
    "StatusTypeID": 0,
    "DateLastStatusUpdate": "2020-09-08T04:14:00Z",
    "DataQualityLevel": 2,
    "DateCreated": "2020-09-08T04:14:00Z",
    "SubmissionStatusTypeID": 100
}