{
    "IsRecentlyVerified": false,
    "ID": 46078,
    "UUID": "86DA59AA-1369-4686-A5C6-6BF2F1D27C17",
    "DataProviderID": 1,
    "DataProvidersReference": "284",
    "AddressInfo": {
        "ID": 46424,
        "Title": "Jernbanestasjonen, Mjøndalen",
        "AddressLine1": "Jernbanegata 2",
        "Town": "MJØNDALEN",
        "StateOrProvince": "Viken",
        "Postcode": "3050",
        "CountryID": 168,
        "Latitude": 59.75061,
        "Longitude": 10.01286,
        "AccessComments": "",
        "DistanceUnit": 0
    },
    "Connections": [
        {
            "ID": 56741,
            "ConnectionTypeID": 0,
            "Reference": "1",
            "LevelID": 2,
            "Amps": 16,
            "Voltage": 230,
            "PowerKW": 3.7,
            "Comments": "Mode 1"
        },
        {
            "ID": 85052,
            "ConnectionTypeID": 0,
            "Reference": "2",
            "LevelID": 2,
            "Amps": 16,
            "Voltage": 230,
            "PowerKW": 3.7,
            "Comments": "Mode 1"
        },
        {
            "ID": 85053,
            "ConnectionTypeID": 0,
            "Reference": "3",
            "LevelID": 2,
            "Amps": 16,
            "Voltage": 230,
            "PowerKW": 3.7,
            "Comments": "Mode 1"
        },
        {
            "ID": 88430,
            "ConnectionTypeID": 0,
            "Reference": "4",
            "LevelID": 2,
            "Amps": 16,
            "Voltage": 230,
            "PowerKW": 3.7,
            "Comments": "Mode 1"
        }
    ],
    "NumberOfPoints": 4,
    "DateLastStatusUpdate": "2020-05-26T08:23:00Z",
    "DataQualityLevel": 2,
    "DateCreated": "2015-05-03T00:54:00Z",
    "SubmissionStatusTypeID": 100
}