{
    "IsRecentlyVerified": false,
    "ID": 24050,
    "UUID": "041ADCDE-6B0D-4944-A790-A9695E7C0123",
    "DataProviderID": 1,
    "OperatorID": 5,
    "UsageTypeID": 1,
    "UsageCost": "Free",
    "AddressInfo": {
        "ID": 24395,
        "Title": "Metro DEV / Granite 38 #2",
        "AddressLine1": "36-38 Granite St.",
        "Town": "Barre",
        "StateOrProvince": "Vermont",
        "Postcode": "05641",
        "CountryID": 2,
        "Latitude": 44.1977615842643,
        "Longitude": -72.5075149368779,
        "DistanceUnit": 0
    },
    "Connections": [
        {
            "ID": 26051,
            "ConnectionTypeID": 2,
            "StatusTypeID": 50,
            "LevelID": 3,
            "Quantity": 1
        },
        {
            "ID": 26053,
            "ConnectionTypeID": 1,
            "StatusTypeID": 50,
            "LevelID": 2,
            "Voltage": 240,
            "Quantity": 2
        }
    ],
    "NumberOfPoints": 3,
    "GeneralComments": "All three chargers are down as of 2019-11-18, the level2s say \"not provisioned\" and the chademo says error 103",
    "StatusTypeID": 30,
    "DateLastStatusUpdate": "2019-11-20T17:24:00Z",
    "MetadataValues": [
        {
            "ID": 987,
            "MetadataFieldID": 4,
            "ItemValue": "Data © OpenStreetMap contributors, ODbL 1.0. http://www.openstreetmap.org/copyright"
        }
    ],
    "DataQualityLevel": 1,
    "DateCreated": "2014-06-07T00:11:00Z",
    "SubmissionStatusTypeID": 200
}