{
    "IsRecentlyVerified": false,
    "ID": 42423,
    "UUID": "80DC15CE-155A-42F4-90FD-C899CC1524A0",
    "DataProviderID": 1,
    "OperatorID": 165,
    "UsageTypeID": 1,
    "UsageCost": "kostenfrei",
    "AddressInfo": {
        "ID": 42769,
        "Title": " Parkplatz Innenstadt in Usingen",
        "AddressLine1": "Marstallweg",
        "Town": "Usingen",
        "StateOrProvince": "Hessen",
        "Postcode": "61250",
        "CountryID": 87,
        "Latitude": 50.33377630716397,
        "Longitude": 8.539645331274404,
        "ContactTelephone1": "ServiceLine: 0800 11 444 88 (kostenfrei aus dem deutschen Festnetz)",
        "ContactEmail": "online-redaktion@mainova.de",
        "AccessComments": "Zum Laden einfach mit dem Handy die kostenfreie Nummer anrufen und den Ladeprozess starten. Laden zu jeder Zeit möglich.",
        "RelatedURL": "https://www.mainova.de/privatkunden/mobilitaet/stromtankstellen.html",
        "DistanceUnit": 0
    },
    "Connections": [
        {
            "ID": 51049,
            "ConnectionTypeID": 25,
            "StatusTypeID": 50,
            "LevelID": 2,
            "Amps": 32,
            "Voltage": 400,
            "PowerKW": 22,
            "CurrentTypeID": 20,
            "Quantity": 1
        },
        {
            "ID": 51088,
            "ConnectionTypeID": 28,
            "StatusTypeID": 50,
            "LevelID": 2,
            "Amps": 16,
            "Voltage": 230,
            "PowerKW": 3.7,
            "CurrentTypeID": 10,
            "Quantity": 1
        }
    ],
    "NumberOfPoints": 2,
    "StatusTypeID": 50,
    "DateLastStatusUpdate": "2015-03-10T12:17:00Z",
    "DataQualityLevel": 1,
    "DateCreated": "2015-03-10T08:30:00Z",
    "SubmissionStatusTypeID": 200
}