{
    "IsRecentlyVerified": false,
    "ID": 3352,
    "UUID": "2A8636FC-A12C-4080-A056-C9DA426017AB",
    "DataProviderID": 1,
    "OperatorID": 6,
    "UsageTypeID": 6,
    "AddressInfo": {
        "ID": 3353,
        "Title": "Quality Nissan",
        "AddressLine1": "41895 Motor Car Parkway",
        "Town": "Temecula",
        "StateOrProvince": "CA",
        "Postcode": "92591",
        "CountryID": 2,
        "Latitude": 33.517,
        "Longitude": -117.155,
        "ContactTelephone1": "888-284-0966",
        "DistanceUnit": 0
    },
    "Connections": [],
    "NumberOfPoints": 2,
    "GeneralComments": "Cost To Charge: Free Access Hours: Unknown",
    "DateLastStatusUpdate": "2019-12-15T06:07:00Z",
    "DateCreated": "2010-02-28T00:00:00Z",
    "SubmissionStatusTypeID": 200
}