{
    "IsRecentlyVerified": false,
    "ID": 48321,
    "UUID": "E5177463-AEB9-462D-B317-85B68B67CF09",
    "DataProviderID": 1,
    "OperatorID": 3315,
    "OperatorsReference": "50488",
    "UsageTypeID": 2,
    "UsageCost": "Free",
    "AddressInfo": {
        "ID": 48667,
        "Title": "High School Yards",
        "AddressLine1": "Infirmary Street",
        "Town": "Edinburgh",
        "Postcode": "EH1 1LT",
        "CountryID": 1,
        "Latitude": 55.948659,
        "Longitude": -3.184486,
        "AccessComments": "Bay for use of City Car Club Only\r\n*Please note that there is only two parking spaces available for charging your vehicle at this site.* This is a publicly available charging point within a University of Edinburgh Car Park. There is no requirement to display a permit when parked within the designated bay AND charging. Vehicle must be charging. 4 hour maximum stay. Available 24 hours a day 365 days a year. If gates to High School Yards are closed please contact University of Edinburgh Security on 0131 650 2257.",
        "DistanceUnit": 0
    },
    "Connections": [
        {
            "ID": 59747,
            "ConnectionTypeID": 25,
            "StatusTypeID": 50,
            "LevelID": 2,
            "Amps": 32,
            "Voltage": 400,
            "PowerKW": 22,
            "CurrentTypeID": 20,
            "Quantity": 2
        }
    ],
    "NumberOfPoints": 4,
    "StatusTypeID": 50,
    "DateLastStatusUpdate": "2020-04-24T05:15:00Z",
    "DataQualityLevel": 1,
    "DateCreated": "2015-06-24T12:38:00Z",
    "SubmissionStatusTypeID": 200
}