{
    "IsRecentlyVerified": false,
    "ID": 62058,
    "UUID": "D2229867-E1CB-417E-B17C-D964658400E4",
    "DataProviderID": 1,
    "OperatorID": 23,
    "OperatorsReference": "13931",
    "UsageTypeID": 7,
    "UsageCost": "Free",
    "AddressInfo": {
        "ID": 62404,
        "Title": "Envision Cinemas Bar & Grille - Tesla",
        "AddressLine1": "4780 Cornell Rd",
        "Town": "Cincinnati",
        "StateOrProvince": "OH",
        "Postcode": "45241",
        "CountryID": 2,
        "Latitude": 39.2700093,
        "Longitude": -84.3740025,
        "ContactTelephone1": "513-421-3000  877-798-3752",
        "AccessComments": "24 hours daily; for guest use only",
        "RelatedURL": "http://www.teslamotors.com/supercharger",
        "DistanceUnit": 0
    },
    "Connections": [
        {
            "ID": 78961,
            "ConnectionTypeID": 30,
            "StatusTypeID": 50,
            "LevelID": 2,
            "Amps": 16,
            "Voltage": 230,
            "PowerKW": 16,
            "CurrentTypeID": 10,
            "Quantity": 2
        }
    ],
    "NumberOfPoints": 2,
    "StatusTypeID": 50,
    "DateLastStatusUpdate": "2017-01-31T22:29:00Z",
    "DataQualityLevel": 3,
    "DateCreated": "2016-03-03T11:38:00Z",
    "SubmissionStatusTypeID": 100
}