{
    "IsRecentlyVerified": false,
    "ID": 18709,
    "UUID": "9F1E1429-73B8-4F7C-B08A-6756CF03D538",
    "DataProviderID": 15,
    "DataProvidersReference": "30209",
    "OperatorID": 1,
    "UsageTypeID": 1,
    "AddressInfo": {
        "ID": 19054,
        "Title": "????????????",
        "AddressLine1": "????????????",
        "Town": "???",
        "StateOrProvince": "",
        "Postcode": "116033",
        "CountryID": 50,
        "Latitude": 38.963146,
        "Longitude": 121.528702,
        "ContactTelephone1": "",
        "RelatedURL": "http://carstations.com/30209",
        "DistanceUnit": 0
    },
    "Connections": [
        {
            "ID": 18942,
            "ConnectionTypeID": 1,
            "Reference": "J1772",
            "LevelID": 2,
            "Quantity": 1
        }
    ],
    "NumberOfPoints": 1,
    "StatusTypeID": 0,
    "DateLastStatusUpdate": "2014-03-22T04:39:00Z",
    "DataQualityLevel": 2,
    "DateCreated": "2013-08-25T03:30:00Z",
    "SubmissionStatusTypeID": 200
}