{
    "IsRecentlyVerified": false,
    "ID": 7841,
    "UUID": "976AA77C-31EA-4662-87BE-3BE10884F357",
    "DataProviderID": 15,
    "DataProvidersReference": "316",
    "OperatorID": 41,
    "AddressInfo": {
        "ID": 7738,
        "Title": "701 Carrier Drive",
        "AddressLine1": "701 Carrier Drive",
        "Town": "Harrisonburg",
        "StateOrProvince": "Virginia",
        "Postcode": "22807",
        "CountryID": 2,
        "Latitude": 38.434389,
        "Longitude": -78.8629,
        "ContactTelephone1": "",
        "RelatedURL": "http://carstations.com/316",
        "DistanceUnit": 0
    },
    "Connections": [
        {
            "ID": 5271,
            "ConnectionTypeID": 0,
            "Reference": "LPI"
        }
    ],
    "StatusTypeID": 0,
    "DateLastStatusUpdate": "2017-11-04T14:04:00Z",
    "DataQualityLevel": 1,
    "DateCreated": "2011-11-11T12:05:00Z",
    "SubmissionStatusTypeID": 100
}