{
    "IsRecentlyVerified": false,
    "ID": 50837,
    "UUID": "27809DB5-6A68-45D3-B941-DB2011AFA8AF",
    "DataProviderID": 26,
    "DataProvidersReference": "63305",
    "OperatorID": 157,
    "OperatorsReference": "NewMotion 03000899",
    "UsageCost": "0.00 jaarabonnement",
    "AddressInfo": {
        "ID": 51183,
        "Title": "Tormentil 19",
        "AddressLine1": "Tormentil 19",
        "Town": "Pijnacker-Nootdorp",
        "Postcode": "2631 DD",
        "CountryID": 159,
        "Latitude": 52.0415441,
        "Longitude": 4.395801,
        "ContactTelephone1": "088 0109500",
        "RelatedURL": "http://thenewmotion.nl/",
        "DistanceUnit": 0
    },
    "Connections": [
        {
            "ID": 62745,
            "ConnectionTypeID": 25,
            "LevelID": 2,
            "PowerKW": 22,
            "CurrentTypeID": 10
        }
    ],
    "NumberOfPoints": 1,
    "StatusTypeID": 50,
    "DateLastStatusUpdate": "2016-06-04T02:44:00Z",
    "DataQualityLevel": 3,
    "DateCreated": "2015-07-22T09:54:00Z",
    "SubmissionStatusTypeID": 100
}