{
    "IsRecentlyVerified": false,
    "ID": 65227,
    "UUID": "FBC34835-7F81-4F79-8A60-2EE797D47056",
    "DataProviderID": 1,
    "OperatorID": 45,
    "UsageTypeID": 1,
    "UsageCost": "Spende",
    "AddressInfo": {
        "ID": 65573,
        "Title": "Solarteam Ostsee",
        "AddressLine1": "Marienthaler Straße 9a",
        "Town": "Eckernförde",
        "StateOrProvince": "Kreis Rendsburg-Eckernförde",
        "Postcode": "24340",
        "CountryID": 87,
        "Latitude": 54.4457066998281,
        "Longitude": 9.83142129049067,
        "ContactTelephone1": "+49 4351 754799",
        "AccessComments": "Grüne Ladesäule vom RWE Typ durchgehend nutzbar am Haupteingang. Stromspende entsprechend 0,30€/kWh bitte in Briefkasten werfen.",
        "RelatedURL": "http://www.solarteam-ostsee.com/",
        "DistanceUnit": 0
    },
    "Connections": [
        {
            "ID": 89802,
            "ConnectionTypeID": 25,
            "StatusTypeID": 50,
            "LevelID": 2,
            "Amps": 32,
            "Voltage": 400,
            "PowerKW": 22,
            "CurrentTypeID": 20,
            "Quantity": 2
        }
    ],
    "NumberOfPoints": 2,
    "StatusTypeID": 50,
    "DateLastStatusUpdate": "2016-04-22T06:57:00Z",
    "DataQualityLevel": 1,
    "DateCreated": "2016-04-22T06:50:00Z",
    "SubmissionStatusTypeID": 200
}