{
    "IsRecentlyVerified": false,
    "ID": 84620,
    "UUID": "92543BBF-9B86-47B7-8611-F6DF0456C56E",
    "DataProviderID": 1,
    "OperatorID": 3261,
    "UsageTypeID": 1,
    "AddressInfo": {
        "ID": 84966,
        "Title": "Wap WaschBär",
        "AddressLine1": "Am Alten Celluloidwerk 2",
        "Town": "Eilenburg",
        "StateOrProvince": "Landkreis Nordsachsen",
        "Postcode": "04838",
        "CountryID": 87,
        "Latitude": 51.46502361648701,
        "Longitude": 12.649631254769949,
        "ContactTelephone1": "+49 7306 72444",
        "AccessComments": "24/7 nutzbar neben der Gastankstelle. Freischaltbar mit New Motion Ladekarte, PlugSurfing Keyhanger oder auf der emobility community Webseite von be energised.",
        "RelatedURL": "http://www.wap-waschbaer.org/",
        "DistanceUnit": 0
    },
    "Connections": [
        {
            "ID": 120192,
            "ConnectionTypeID": 25,
            "StatusTypeID": 50,
            "LevelID": 2,
            "Amps": 32,
            "Voltage": 400,
            "PowerKW": 22,
            "CurrentTypeID": 20,
            "Quantity": 1
        }
    ],
    "NumberOfPoints": 1,
    "StatusTypeID": 50,
    "DateLastStatusUpdate": "2017-03-06T07:24:00Z",
    "DataQualityLevel": 1,
    "DateCreated": "2017-03-06T07:24:00Z",
    "SubmissionStatusTypeID": 200
}