{
    "IsRecentlyVerified": false,
    "ID": 94483,
    "UUID": "5CCF0066-0FD5-4453-A809-B8263D5A03A2",
    "DataProviderID": 1,
    "UsageTypeID": 1,
    "AddressInfo": {
        "ID": 94829,
        "Title": "City of Bemidji - City Hall",
        "AddressLine1": "317 4th St NW",
        "Town": "Bemidji",
        "StateOrProvince": "MN",
        "Postcode": "56601",
        "CountryID": 2,
        "Latitude": 47.4717273349404,
        "Longitude": -94.88330796247664,
        "ContactTelephone1": "218-759-3560",
        "AccessComments": "6am-2:30am daily",
        "DistanceUnit": 0
    },
    "Connections": [
        {
            "ID": 133595,
            "ConnectionTypeID": 1,
            "LevelID": 2,
            "Amps": 40,
            "Voltage": 230,
            "PowerKW": 8,
            "CurrentTypeID": 10,
            "Quantity": 1
        },
        {
            "ID": 264075,
            "ConnectionTypeID": 32,
            "LevelID": 2,
            "PowerKW": 50,
            "Quantity": 1
        },
        {
            "ID": 264076,
            "ConnectionTypeID": 2,
            "LevelID": 2,
            "PowerKW": 50,
            "Quantity": 1
        }
    ],
    "StatusTypeID": 0,
    "DateLastStatusUpdate": "2021-02-13T01:09:00Z",
    "DataQualityLevel": 3,
    "DateCreated": "2017-10-19T02:06:00Z",
    "SubmissionStatusTypeID": 100
}