{
    "IsRecentlyVerified": false,
    "ID": 41796,
    "UUID": "5FE9D8B4-69CD-48A4-86A1-198593CFAD9C",
    "DataProviderID": 1,
    "OperatorID": 108,
    "UsageTypeID": 1,
    "UsageCost": "0",
    "AddressInfo": {
        "ID": 42142,
        "Title": "Parkplatz Golfclub Wannsee",
        "AddressLine1": "Golfweg 22",
        "AddressLine2": "Wannsee",
        "Town": "Berlin",
        "StateOrProvince": "Berlin",
        "Postcode": "14109",
        "CountryID": 87,
        "Latitude": 52.4152161786408,
        "Longitude": 13.1290232704913,
        "AccessComments": "Auf dem Parkplatz des Golfclubs.",
        "RelatedURL": "http://www.wannsee.de/",
        "DistanceUnit": 0
    },
    "Connections": [
        {
            "ID": 50063,
            "ConnectionTypeID": 25,
            "StatusTypeID": 50,
            "LevelID": 2,
            "Amps": 32,
            "Voltage": 400,
            "PowerKW": 11,
            "CurrentTypeID": 20,
            "Quantity": 2
        },
        {
            "ID": 50064,
            "ConnectionTypeID": 28,
            "StatusTypeID": 50,
            "LevelID": 2,
            "Amps": 16,
            "Voltage": 230,
            "PowerKW": 3.7,
            "CurrentTypeID": 10,
            "Quantity": 2
        }
    ],
    "NumberOfPoints": 4,
    "GeneralComments": "RFID Karte von Vattenfall oder Roamingpartner (ladeticket, PlugSurfing, Hamburg Energie oder SUN Stadtwerke) nötig.",
    "StatusTypeID": 50,
    "DateLastStatusUpdate": "2015-02-16T21:05:00Z",
    "DataQualityLevel": 1,
    "DateCreated": "2015-02-10T07:58:00Z",
    "SubmissionStatusTypeID": 200
}