{
    "IsRecentlyVerified": false,
    "ID": 49086,
    "UUID": "6FFA5F35-260E-4464-A735-8FBCB2246D08",
    "DataProviderID": 1,
    "OperatorID": 80,
    "UsageTypeID": 4,
    "UsageCost": "0,40 €/kW",
    "AddressInfo": {
        "ID": 49432,
        "Title": "Eneldrive Sesto Rondò",
        "AddressLine1": "Via Roma",
        "Town": "Sesto San Giovanni",
        "StateOrProvince": "Milano",
        "Postcode": "20099",
        "CountryID": 112,
        "Latitude": 45.53377342058658,
        "Longitude": 9.231206979450901,
        "RelatedURL": "http://eneldrive.it",
        "DistanceUnit": 0
    },
    "Connections": [
        {
            "ID": 60660,
            "ConnectionTypeID": 25,
            "StatusTypeID": 50,
            "LevelID": 2,
            "PowerKW": 22,
            "CurrentTypeID": 20,
            "Quantity": 2
        }
    ],
    "NumberOfPoints": 4,
    "StatusTypeID": 50,
    "DateLastStatusUpdate": "2015-07-10T08:19:00Z",
    "DataQualityLevel": 1,
    "DateCreated": "2015-07-10T08:19:00Z",
    "SubmissionStatusTypeID": 200
}