{
    "MediaItems": [
        {
            "ID": 13350,
            "ChargePointID": 93459,
            "ItemURL": "https://s3-ap-southeast-2.amazonaws.com/openchargemap/images/CZ/OCM93459/OCM-93459.orig.2017092720301692.jpg",
            "ItemThumbnailURL": "https://s3-ap-southeast-2.amazonaws.com/openchargemap/images/CZ/OCM93459/OCM-93459.thmb.2017092720301692.jpg",
            "Comment": "",
            "IsEnabled": true,
            "IsVideo": false,
            "IsFeaturedItem": false,
            "IsExternalResource": false,
            "User": {
                "ID": 6224,
                "Username": "ozana"
            },
            "DateCreated": "2017-09-27T20:30:00Z"
        }
    ],
    "IsRecentlyVerified": false,
    "ID": 93459,
    "UUID": "AE3E280F-069D-456A-95E3-4CF62B391FD5",
    "DataProviderID": 1,
    "OperatorID": 221,
    "UsageTypeID": 1,
    "AddressInfo": {
        "ID": 93805,
        "Title": "Svitavy Fabrika",
        "AddressLine1": "Wolkerova alej 92/18",
        "AddressLine2": "Svitavy-předměstí",
        "Town": "Svitavy",
        "StateOrProvince": "okres Svitavy",
        "Postcode": "56802",
        "CountryID": 64,
        "Latitude": 49.75600559999999,
        "Longitude": 16.47236339999995,
        "ContactEmail": "info@evmapa.cz",
        "RelatedURL": "https://www.evmapa.cz/svitavy-fabrika",
        "DistanceUnit": 0
    },
    "Connections": [
        {
            "ID": 132336,
            "ConnectionTypeID": 2,
            "StatusTypeID": 50,
            "LevelID": 3,
            "PowerKW": 44,
            "CurrentTypeID": 30,
            "Quantity": 1
        },
        {
            "ID": 132337,
            "ConnectionTypeID": 1036,
            "StatusTypeID": 50,
            "LevelID": 2,
            "Amps": 32,
            "Voltage": 400,
            "PowerKW": 22,
            "CurrentTypeID": 20,
            "Quantity": 1
        }
    ],
    "NumberOfPoints": 1,
    "StatusTypeID": 50,
    "DateLastStatusUpdate": "2017-09-27T20:30:00Z",
    "DataQualityLevel": 1,
    "DateCreated": "2017-09-27T20:29:00Z",
    "SubmissionStatusTypeID": 200
}