{
    "IsRecentlyVerified": false,
    "ID": 163408,
    "UUID": "5C99B9E6-CEBC-4E7D-9122-392A8DC6A905",
    "DataProviderID": 1,
    "OperatorID": 21,
    "UsageTypeID": 4,
    "UsageCost": "Mobi.E compatible card",
    "AddressInfo": {
        "ID": 163765,
        "Title": "GRD-00006",
        "AddressLine1": "Rua Evelina Coelho",
        "Town": "Guarda",
        "StateOrProvince": "Centro",
        "Postcode": "6300",
        "CountryID": 180,
        "Latitude": 40.53911324845086,
        "Longitude": -7.286760848625363,
        "DistanceUnit": 0
    },
    "Connections": [
        {
            "ID": 234988,
            "ConnectionTypeID": 25,
            "StatusTypeID": 50,
            "LevelID": 2,
            "Amps": 32,
            "Voltage": 400,
            "PowerKW": 22,
            "CurrentTypeID": 20,
            "Quantity": 2
        }
    ],
    "NumberOfPoints": 2,
    "StatusTypeID": 50,
    "DateLastStatusUpdate": "2020-08-23T18:41:00Z",
    "DataQualityLevel": 1,
    "DateCreated": "2020-08-23T18:41:00Z",
    "SubmissionStatusTypeID": 200
}