{
    "IsRecentlyVerified": false,
    "ID": 64633,
    "UUID": "AB0BAA0F-EA57-4542-AA78-B51F7BF94B39",
    "DataProviderID": 2,
    "DataProvidersReference": "74204",
    "OperatorID": 5,
    "UsageTypeID": 1,
    "AddressInfo": {
        "ID": 64979,
        "Title": "DC SOLAR",
        "AddressLine1": "Hamilton Trce",
        "Town": "Marietta",
        "StateOrProvince": "GA",
        "Postcode": "30062",
        "CountryID": 2,
        "Latitude": 33.9569798,
        "Longitude": -84.5014479,
        "ContactTelephone1": "888-758-4389",
        "AccessComments": "24 hours daily",
        "RelatedURL": "http://www.chargepoint.com/",
        "DistanceUnit": 0
    },
    "Connections": [
        {
            "ID": 83068,
            "ConnectionTypeID": 1,
            "LevelID": 2,
            "Amps": 16,
            "Voltage": 230,
            "PowerKW": 3,
            "CurrentTypeID": 10,
            "Quantity": 2
        }
    ],
    "DateLastStatusUpdate": "2019-04-06T04:01:00Z",
    "DataQualityLevel": 3,
    "DateCreated": "2016-03-16T09:07:00Z",
    "SubmissionStatusTypeID": 100
}