{
    "IsRecentlyVerified": false,
    "ID": 184041,
    "UUID": "A1F10A1E-12A4-47D1-862A-E058A1D45470",
    "DataProviderID": 29,
    "DataProvidersReference": "20828",
    "AddressInfo": {
        "ID": 184400,
        "Title": "Roßlaufstr. 999 z",
        "AddressLine1": "Roßlaufstr. 999 z",
        "Town": "Neustadt",
        "Postcode": "67433",
        "CountryID": 87,
        "Latitude": 49.354587,
        "Longitude": 8.160406,
        "DistanceUnit": 0
    },
    "Connections": [
        {
            "ID": 291763,
            "ConnectionTypeID": 25,
            "StatusTypeID": 50,
            "LevelID": 2,
            "PowerKW": 22,
            "CurrentTypeID": 20
        },
        {
            "ID": 291764,
            "ConnectionTypeID": 25,
            "StatusTypeID": 50,
            "LevelID": 2,
            "PowerKW": 22,
            "CurrentTypeID": 20
        }
    ],
    "StatusTypeID": 50,
    "DateLastStatusUpdate": "2021-07-12T02:43:00Z",
    "MetadataValues": [
        {
            "ID": 16333,
            "MetadataFieldID": 4,
            "ItemValue": "Data from the German chargepoint registry provided by Bundesnetzagentur.de under the CC-BY 4.0 license"
        }
    ],
    "DataQualityLevel": 3,
    "DateCreated": "2021-07-08T10:04:00Z",
    "SubmissionStatusTypeID": 100
}