{
    "IsRecentlyVerified": false,
    "ID": 119790,
    "UUID": "F1354D40-D6D7-413D-AC93-FE1CA6DA0891",
    "DataProviderID": 2,
    "DataProvidersReference": "118065",
    "OperatorID": 59,
    "UsageTypeID": 1,
    "AddressInfo": {
        "ID": 120136,
        "Title": "Greenlots - 112014D",
        "AddressLine1": "508 Live Oak Street",
        "Town": "Tarpon Springs",
        "StateOrProvince": "FL",
        "Postcode": "34689",
        "CountryID": 2,
        "Latitude": 28.1545543670654,
        "Longitude": -82.7536010742188,
        "ContactTelephone1": "855-900-7584",
        "AccessComments": "24 hours daily",
        "RelatedURL": "http://greenlots.com/",
        "DistanceUnit": 0
    },
    "Connections": [
        {
            "ID": 169079,
            "ConnectionTypeID": 1,
            "LevelID": 2,
            "Amps": 16,
            "Voltage": 230,
            "PowerKW": 3.7,
            "CurrentTypeID": 10,
            "Quantity": 2
        }
    ],
    "DateLastStatusUpdate": "2020-06-26T02:52:00Z",
    "DataQualityLevel": 3,
    "DateCreated": "2019-04-01T04:59:00Z",
    "SubmissionStatusTypeID": 100
}