{
    "IsRecentlyVerified": false,
    "ID": 138970,
    "UUID": "4D4B1DAB-07A2-4A38-8386-ED2B4B2C0D18",
    "DataProviderID": 2,
    "DataProvidersReference": "122359",
    "OperatorID": 23,
    "UsageTypeID": 1,
    "AddressInfo": {
        "ID": 139322,
        "Title": "Arizona Grand Resort & Spa - Tesla Destination",
        "AddressLine1": "8000 S Arizona Grand Pkwy",
        "Town": "Phoenix",
        "StateOrProvince": "AZ",
        "Postcode": "85044",
        "CountryID": 2,
        "Latitude": 33.377301,
        "Longitude": -111.971901,
        "ContactTelephone1": "602-438-9000  877-798-3752",
        "AccessComments": "24 hours daily; for customer use only; see front desk for access",
        "RelatedURL": "https://www.tesla.com/destination-charging",
        "DistanceUnit": 0
    },
    "Connections": [
        {
            "ID": 194209,
            "ConnectionTypeID": 30,
            "LevelID": 2,
            "Amps": 16,
            "Voltage": 230,
            "PowerKW": 3.7,
            "CurrentTypeID": 10,
            "Quantity": 6
        }
    ],
    "StatusTypeID": 50,
    "DateLastStatusUpdate": "2020-06-26T02:55:00Z",
    "DataQualityLevel": 3,
    "DateCreated": "2019-12-24T09:09:00Z",
    "SubmissionStatusTypeID": 100
}