{
    "IsRecentlyVerified": false,
    "ID": 73731,
    "UUID": "CAB09177-3A3C-4875-B888-56C735370C74",
    "DataProviderID": 1,
    "OperatorID": 89,
    "OperatorsReference": "AAA-138",
    "UsageTypeID": 4,
    "UsageCost": "CAD 1.00/hour",
    "AddressInfo": {
        "ID": 74077,
        "Title": "Édifice de la Haute-Ville Québec",
        "AddressLine1": "700 boul. René-Lévesque Est",
        "Town": "Québec",
        "StateOrProvince": "QC",
        "Postcode": "G1R 5A9",
        "CountryID": 44,
        "Latitude": 46.80943,
        "Longitude": -71.218189,
        "DistanceUnit": 0
    },
    "Connections": [
        {
            "ID": 106032,
            "ConnectionTypeID": 1,
            "StatusTypeID": 50,
            "LevelID": 2,
            "Amps": 32,
            "Voltage": 230,
            "PowerKW": 7,
            "CurrentTypeID": 10,
            "Quantity": 1
        }
    ],
    "NumberOfPoints": 1,
    "StatusTypeID": 50,
    "DateLastStatusUpdate": "2016-11-27T20:17:00Z",
    "DataQualityLevel": 1,
    "DateCreated": "2016-11-23T22:52:00Z",
    "SubmissionStatusTypeID": 200
}