{
    "IsRecentlyVerified": false,
    "ID": 152254,
    "UUID": "DC38E92E-0614-45EF-A7EE-43E7F2546116",
    "DataProviderID": 28,
    "DataProvidersReference": "FRSEOPAB07005A",
    "OperatorID": 3383,
    "UsageTypeID": 5,
    "AddressInfo": {
        "ID": 152607,
        "Title": "Réseau AlterBase - Courlay - Salle des Fêtes",
        "AddressLine1": "Place de la Solidarité - 79440 COURLAY",
        "CountryID": 80,
        "Latitude": 46.779143,
        "Longitude": -0.567109,
        "AccessComments": "24/24 7/7 jours",
        "DistanceUnit": 0
    },
    "Connections": [
        {
            "ID": 213081,
            "ConnectionTypeID": 28,
            "StatusTypeID": 50,
            "LevelID": 2,
            "PowerKW": 3.18,
            "CurrentTypeID": 10
        },
        {
            "ID": 213082,
            "ConnectionTypeID": 26,
            "StatusTypeID": 50,
            "LevelID": 2,
            "PowerKW": 3.18
        },
        {
            "ID": 245941,
            "ConnectionTypeID": 28,
            "StatusTypeID": 50,
            "LevelID": 2,
            "PowerKW": 3.18,
            "CurrentTypeID": 10
        },
        {
            "ID": 245942,
            "ConnectionTypeID": 26,
            "StatusTypeID": 50,
            "LevelID": 2,
            "PowerKW": 3.18
        }
    ],
    "GeneralComments": "www.alterbase.fr",
    "StatusTypeID": 50,
    "DateLastStatusUpdate": "2020-08-27T05:13:00Z",
    "DataQualityLevel": 2,
    "DateCreated": "2020-03-15T10:53:00Z",
    "SubmissionStatusTypeID": 100
}