{
    "IsRecentlyVerified": false,
    "ID": 43286,
    "UUID": "EDEC1E91-98FF-4D71-8A9A-49E51A604830",
    "DataProviderID": 2,
    "DataProvidersReference": "66414",
    "UsageTypeID": 2,
    "AddressInfo": {
        "ID": 43632,
        "Title": "Idaho Power - Boise Operations Center",
        "AddressLine1": "10790 Franklin Rd",
        "Town": "Boise",
        "StateOrProvince": "ID",
        "Postcode": "83709",
        "CountryID": 2,
        "Latitude": 43.6061872247381,
        "Longitude": -116.3181258,
        "ContactTelephone1": "",
        "AccessComments": "Fleet use only",
        "RelatedURL": "",
        "DistanceUnit": 0
    },
    "Connections": [
        {
            "ID": 52464,
            "ConnectionTypeID": 1,
            "LevelID": 2,
            "Amps": 16,
            "Voltage": 230,
            "PowerKW": 3.7,
            "CurrentTypeID": 10,
            "Quantity": 1
        }
    ],
    "DateLastStatusUpdate": "2020-06-26T03:07:00Z",
    "DataQualityLevel": 3,
    "DateCreated": "2015-03-25T04:44:00Z",
    "SubmissionStatusTypeID": 100
}