{
    "IsRecentlyVerified": false,
    "ID": 15600,
    "UUID": "6B490828-40FB-4386-833B-9F3185E33D27",
    "DataProviderID": 1,
    "OperatorID": 19,
    "UsageTypeID": 1,
    "AddressInfo": {
        "ID": 15945,
        "Title": "K+K Hotel George Kensington",
        "AddressLine1": "1 - 15 Templeton Place",
        "StateOrProvince": "London",
        "Postcode": "SW5 9NB ",
        "CountryID": 1,
        "Latitude": 51.4925145800465,
        "Longitude": -0.19522289403551,
        "ContactTelephone1": "020 7370 228",
        "ContactEmail": "colm.kelly@kkhotels.co.uk",
        "RelatedURL": "http://www.kkhotels.com/george",
        "DistanceUnit": 0
    },
    "Connections": [
        {
            "ID": 13921,
            "ConnectionTypeID": 25,
            "StatusTypeID": 50,
            "LevelID": 2,
            "Amps": 32,
            "Voltage": 230,
            "PowerKW": 7,
            "CurrentTypeID": 10,
            "Quantity": 1
        },
        {
            "ID": 13922,
            "ConnectionTypeID": 3,
            "StatusTypeID": 50,
            "LevelID": 2,
            "Amps": 13,
            "Voltage": 230,
            "PowerKW": 3,
            "CurrentTypeID": 10,
            "Quantity": 1
        }
    ],
    "NumberOfPoints": 2,
    "StatusTypeID": 50,
    "DateLastStatusUpdate": "2019-05-02T16:08:00Z",
    "DataQualityLevel": 1,
    "DateCreated": "2013-01-14T15:01:00Z",
    "SubmissionStatusTypeID": 200
}