{
    "IsRecentlyVerified": false,
    "ID": 38570,
    "UUID": "BF7FC67B-541C-4BA1-A89D-9940B52DA9EB",
    "DataProviderID": 26,
    "DataProvidersReference": "53976",
    "OperatorID": 73,
    "OperatorsReference": "EV-Box EVB-P1403117",
    "UsageCost": "0.00 jaarabonnement",
    "AddressInfo": {
        "ID": 38916,
        "Title": "De Hoghe Weijdt 3",
        "AddressLine1": "De Hoghe Weijdt 3",
        "Town": "Heiloo",
        "Postcode": "1851 EB",
        "CountryID": 159,
        "Latitude": 52.6024,
        "Longitude": 4.71875,
        "RelatedURL": "http://www.ev-box.nl",
        "DistanceUnit": 0
    },
    "Connections": [
        {
            "ID": 42081,
            "ConnectionTypeID": 25,
            "LevelID": 2,
            "PowerKW": 5,
            "CurrentTypeID": 10
        }
    ],
    "NumberOfPoints": 1,
    "StatusTypeID": 50,
    "DateLastStatusUpdate": "2016-06-04T02:55:00Z",
    "DataQualityLevel": 3,
    "DateCreated": "2015-01-09T06:08:00Z",
    "SubmissionStatusTypeID": 100
}