{
    "IsRecentlyVerified": false,
    "ID": 89677,
    "UUID": "C9E104DE-88A9-47B3-8940-5E21720D0A3C",
    "DataProviderID": 2,
    "DataProvidersReference": "82463",
    "UsageTypeID": 1,
    "AddressInfo": {
        "ID": 90023,
        "Title": "The Soundings Resort",
        "AddressLine1": "79 Chase Ave",
        "Town": "Dennis",
        "StateOrProvince": "MA",
        "Postcode": "02639",
        "CountryID": 2,
        "Latitude": 41.655972,
        "Longitude": -70.119368,
        "ContactTelephone1": "508-394-6561",
        "AccessComments": "24 hours daily; for guest use only",
        "RelatedURL": "",
        "DistanceUnit": 0
    },
    "Connections": [
        {
            "ID": 127105,
            "ConnectionTypeID": 1,
            "LevelID": 2,
            "Amps": 16,
            "Voltage": 230,
            "PowerKW": 3.7,
            "CurrentTypeID": 10,
            "Quantity": 1
        }
    ],
    "DateLastStatusUpdate": "2020-06-26T03:04:00Z",
    "DataQualityLevel": 3,
    "DateCreated": "2017-06-22T08:16:00Z",
    "SubmissionStatusTypeID": 100
}