{
    "IsRecentlyVerified": false,
    "ID": 17959,
    "UUID": "842D9203-15E6-4B4D-8A55-51E54CE113D4",
    "DataProviderID": 22,
    "DataProvidersReference": "5075DC36E6FB5B2F19A38AC28D8A7FCA",
    "AddressInfo": {
        "ID": 18304,
        "Title": "道の駅ロード銀山",
        "AddressLine1": "島根県大田市久手町刺鹿1945-1",
        "CountryID": 114,
        "Latitude": 35.22212152,
        "Longitude": 132.5139418,
        "ContactTelephone1": "0854-82-1991",
        "DistanceUnit": 0
    },
    "Connections": [
        {
            "ID": 18200,
            "ConnectionTypeID": 2,
            "LevelID": 2,
            "Amps": 100,
            "Voltage": 480,
            "PowerKW": 48,
            "Quantity": 1
        }
    ],
    "DateLastStatusUpdate": "2013-06-29T09:05:00Z",
    "DataQualityLevel": 2,
    "DateCreated": "2013-06-29T09:05:00Z",
    "SubmissionStatusTypeID": 200
}