{
    "IsRecentlyVerified": true,
    "DateLastVerified": "2021-08-13T11:15:00Z",
    "ID": 188726,
    "UUID": "A7D60670-B14D-477C-887D-3EF6BA9F14DA",
    "DataProviderID": 1,
    "OperatorID": 3434,
    "UsageTypeID": 4,
    "AddressInfo": {
        "ID": 189085,
        "Title": "מחסני השוק קריית גת",
        "AddressLine1": "HaDarom",
        "Town": "Kiryat Gat",
        "StateOrProvince": "South District",
        "Postcode": "",
        "CountryID": 111,
        "Latitude": 31.602294829549535,
        "Longitude": 34.77300518796471,
        "DistanceUnit": 0
    },
    "Connections": [
        {
            "ID": 304916,
            "ConnectionTypeID": 25,
            "StatusTypeID": 50,
            "LevelID": 2,
            "Amps": 32,
            "Voltage": 400,
            "PowerKW": 22,
            "CurrentTypeID": 20,
            "Quantity": 12
        },
        {
            "ID": 304917,
            "ConnectionTypeID": 2,
            "StatusTypeID": 50,
            "LevelID": 3,
            "PowerKW": 50,
            "CurrentTypeID": 30,
            "Quantity": 1
        },
        {
            "ID": 304918,
            "ConnectionTypeID": 33,
            "StatusTypeID": 50,
            "LevelID": 3,
            "PowerKW": 50,
            "CurrentTypeID": 30,
            "Quantity": 1
        }
    ],
    "NumberOfPoints": 1,
    "StatusTypeID": 50,
    "DateLastStatusUpdate": "2021-08-13T11:15:00Z",
    "DataQualityLevel": 1,
    "DateCreated": "2021-08-13T11:15:00Z",
    "SubmissionStatusTypeID": 200
}