{
    "IsRecentlyVerified": false,
    "ID": 47527,
    "UUID": "8F16271F-0DC0-4E41-963E-86E1BB818A8B",
    "DataProviderID": 1,
    "OperatorID": 3315,
    "OperatorsReference": "51296",
    "UsageTypeID": 4,
    "UsageCost": "Free",
    "AddressInfo": {
        "ID": 47873,
        "Title": "Paisley Campus University of West Scotland",
        "AddressLine1": "University of West Scotland",
        "Town": "Paisley",
        "StateOrProvince": "Renfewshire",
        "Postcode": "PA1 2BE",
        "CountryID": 1,
        "Latitude": 55.84256,
        "Longitude": -4.43204,
        "DistanceUnit": 0
    },
    "Connections": [
        {
            "ID": 58583,
            "ConnectionTypeID": 25,
            "StatusTypeID": 50,
            "LevelID": 2,
            "Amps": 32,
            "Voltage": 400,
            "PowerKW": 22,
            "CurrentTypeID": 20,
            "Quantity": 2
        }
    ],
    "NumberOfPoints": 2,
    "StatusTypeID": 50,
    "DateLastStatusUpdate": "2019-05-02T16:12:00Z",
    "DataQualityLevel": 1,
    "DateCreated": "2015-05-29T12:47:00Z",
    "SubmissionStatusTypeID": 200
}