{
    "IsRecentlyVerified": false,
    "ID": 87970,
    "UUID": "8F1B9CB1-F351-46B8-AE79-7E5A42D6A551",
    "DataProviderID": 1,
    "OperatorID": 1,
    "UsageTypeID": 6,
    "UsageCost": "A small donation is recommend. ",
    "AddressInfo": {
        "ID": 88316,
        "Title": "Bridge Street Inn",
        "AddressLine1": "4314 Bridge Street",
        "Town": "Cambria",
        "StateOrProvince": "CA",
        "Postcode": "93428",
        "CountryID": 2,
        "Latitude": 35.5658234,
        "Longitude": -121.0818652,
        "ContactTelephone1": "805-215-0724",
        "ContactTelephone2": "805-423-9060",
        "ContactEmail": "bsicambria@gmail.com",
        "AccessComments": "EV station is powered by a Type 2 40amp charger.  Simply remove the cone in the EV parking space, pull in, flip the electric lever and connect.   The Bridge Street Inn is located within walking distances of restaurants, galleries, and shops.",
        "RelatedURL": "https://www.bsicambria.com",
        "DistanceUnit": 0
    },
    "Connections": [
        {
            "ID": 124785,
            "ConnectionTypeID": 1,
            "StatusTypeID": 50,
            "LevelID": 2,
            "Amps": 40,
            "Voltage": 240,
            "PowerKW": 9.6,
            "CurrentTypeID": 10,
            "Quantity": 0
        }
    ],
    "NumberOfPoints": 1,
    "GeneralComments": "EV station is powered by a Type 2 40amp charger.  Simply remove the cone in the EV parking space, pull in, flip the electric lever, and connect.   The Bridge Street Inn is located within walking distances of restaurants, galleries, and shops.",
    "StatusTypeID": 50,
    "DateLastStatusUpdate": "2017-05-18T20:56:00Z",
    "DataQualityLevel": 1,
    "DateCreated": "2017-05-18T14:23:00Z",
    "SubmissionStatusTypeID": 200
}