{
    "IsRecentlyVerified": false,
    "ID": 45930,
    "UUID": "F782D035-F37D-4459-915A-6D198F1B4A5B",
    "DataProviderID": 1,
    "DataProvidersReference": "2311",
    "AddressInfo": {
        "ID": 46276,
        "Title": "Vattenfall InCharge Snabbladdning",
        "AddressLine1": "Sandhamnsgatan 72",
        "Town": "STOCKHOLM",
        "StateOrProvince": "STOCKHOLM",
        "Postcode": "11528",
        "CountryID": 216,
        "Latitude": 59.34175,
        "Longitude": 18.11041,
        "AccessComments": "På Stockholm Parkerings parkeringsplats. Belägen högst upp mot Kampementsbadet.",
        "DistanceUnit": 0
    },
    "Connections": [
        {
            "ID": 56593,
            "ConnectionTypeID": 0,
            "Reference": "1",
            "LevelID": 2,
            "Amps": 100,
            "Voltage": 500,
            "PowerKW": 50
        },
        {
            "ID": 84675,
            "ConnectionTypeID": 0,
            "Reference": "2",
            "LevelID": 2,
            "Amps": 100,
            "Voltage": 500,
            "PowerKW": 50,
            "Comments": "Mode 4"
        },
        {
            "ID": 88231,
            "ConnectionTypeID": 0,
            "Reference": "3",
            "LevelID": 2,
            "Amps": 63,
            "Voltage": 400,
            "PowerKW": 43
        }
    ],
    "NumberOfPoints": 3,
    "DateLastStatusUpdate": "2020-05-26T08:22:00Z",
    "DataQualityLevel": 2,
    "DateCreated": "2015-05-03T00:54:00Z",
    "SubmissionStatusTypeID": 100
}