{
    "UserComments": [
        {
            "ID": 21868,
            "ChargePointID": 135086,
            "CommentTypeID": 50,
            "UserName": "EV Charging LLC",
            "Comment": "download the app, and its eazy to use. https://www.evconnect.com/ev-driver-charging-app/",
            "Rating": 5,
            "RelatedURL": "https://evchargingus.com/",
            "DateCreated": "2019-12-05T23:07:22.69Z",
            "User": {
                "ID": 23195,
                "Username": "EV Charging LLC"
            },
            "CheckinStatusTypeID": 10,
            "IsActionedByEditor": false
        }
    ],
    "MediaItems": [
        {
            "ID": 20507,
            "ChargePointID": 135086,
            "ItemURL": "https://s3-ap-southeast-2.amazonaws.com/openchargemap/images/US/OCM135086/OCM-135086.orig.2019120522423399.jpg",
            "ItemThumbnailURL": "https://s3-ap-southeast-2.amazonaws.com/openchargemap/images/US/OCM135086/OCM-135086.thmb.2019120522423399.jpg",
            "Comment": "",
            "IsEnabled": true,
            "IsVideo": false,
            "IsFeaturedItem": false,
            "IsExternalResource": false,
            "User": {
                "ID": 23195,
                "Username": "EV Charging LLC"
            },
            "DateCreated": "2019-12-05T22:43:00Z"
        },
        {
            "ID": 20505,
            "ChargePointID": 135086,
            "ItemURL": "https://s3-ap-southeast-2.amazonaws.com/openchargemap/images/US/OCM135086/OCM-135086.orig.2019120522373442.jpg",
            "ItemThumbnailURL": "https://s3-ap-southeast-2.amazonaws.com/openchargemap/images/US/OCM135086/OCM-135086.thmb.2019120522373442.jpg",
            "Comment": "",
            "IsEnabled": true,
            "IsVideo": false,
            "IsFeaturedItem": false,
            "IsExternalResource": false,
            "User": {
                "ID": 23195,
                "Username": "EV Charging LLC"
            },
            "DateCreated": "2019-12-05T22:38:00Z"
        },
        {
            "ID": 20506,
            "ChargePointID": 135086,
            "ItemURL": "https://s3-ap-southeast-2.amazonaws.com/openchargemap/images/US/OCM135086/OCM-135086.orig.2019120522380342.jpg",
            "ItemThumbnailURL": "https://s3-ap-southeast-2.amazonaws.com/openchargemap/images/US/OCM135086/OCM-135086.thmb.2019120522380342.jpg",
            "Comment": "",
            "IsEnabled": true,
            "IsVideo": false,
            "IsFeaturedItem": false,
            "IsExternalResource": false,
            "User": {
                "ID": 23195,
                "Username": "EV Charging LLC"
            },
            "DateCreated": "2019-12-05T22:38:00Z"
        },
        {
            "ID": 20504,
            "ChargePointID": 135086,
            "ItemURL": "https://s3-ap-southeast-2.amazonaws.com/openchargemap/images/US/OCM135086/OCM-135086.orig.2019120522371540.jpg",
            "ItemThumbnailURL": "https://s3-ap-southeast-2.amazonaws.com/openchargemap/images/US/OCM135086/OCM-135086.thmb.2019120522371540.jpg",
            "Comment": "",
            "IsEnabled": true,
            "IsVideo": false,
            "IsFeaturedItem": false,
            "IsExternalResource": false,
            "User": {
                "ID": 23195,
                "Username": "EV Charging LLC"
            },
            "DateCreated": "2019-12-05T22:37:00Z"
        }
    ],
    "IsRecentlyVerified": false,
    "ID": 135086,
    "UUID": "B70FDB98-29BD-454A-BD78-5643DD868FB5",
    "DataProviderID": 1,
    "OperatorID": 15,
    "UsageTypeID": 1,
    "AddressInfo": {
        "ID": 135432,
        "Title": "Lebanese Grill EV Charging",
        "AddressLine1": "1600 Rochester Rd",
        "Town": "Troy",
        "StateOrProvince": "Oakland County",
        "Postcode": "48083",
        "CountryID": 2,
        "Latitude": 42.548999673461594,
        "Longitude": -83.13169243313371,
        "AccessComments": "EV Charging LLC \r\nhttps://evchargingus.com/",
        "RelatedURL": "https://www.evconnect.com/ev-driver-charging-app/",
        "DistanceUnit": 0
    },
    "Connections": [
        {
            "ID": 189045,
            "ConnectionTypeID": 1,
            "StatusTypeID": 50,
            "LevelID": 2,
            "Amps": 32,
            "Voltage": 240,
            "PowerKW": 7.4,
            "CurrentTypeID": 10,
            "Quantity": 2
        },
        {
            "ID": 189115,
            "ConnectionTypeID": 1,
            "StatusTypeID": 50,
            "LevelID": 2,
            "Amps": 32,
            "Voltage": 240,
            "PowerKW": 7.4,
            "CurrentTypeID": 10,
            "Quantity": 2
        }
    ],
    "NumberOfPoints": 2,
    "GeneralComments": "Download the evconnect app, https://www.evconnect.com/ev-driver-charging-app/",
    "StatusTypeID": 50,
    "DateLastStatusUpdate": "2019-12-06T13:15:00Z",
    "DataQualityLevel": 1,
    "DateCreated": "2019-12-05T05:11:00Z",
    "SubmissionStatusTypeID": 200
}