{
    "IsRecentlyVerified": false,
    "ID": 176931,
    "UUID": "7CB81177-77EF-4006-989E-F063B229C947",
    "DataProviderID": 29,
    "DataProvidersReference": "77",
    "OperatorID": 45,
    "AddressInfo": {
        "ID": 177290,
        "Title": "Platzstraße 24",
        "AddressLine1": "Platzstraße 24",
        "Town": "Bad Salgau",
        "Postcode": "88348",
        "CountryID": 87,
        "Latitude": 48.0075806,
        "Longitude": 9.5135969,
        "DistanceUnit": 0
    },
    "Connections": [
        {
            "ID": 275468,
            "ConnectionTypeID": 1036,
            "StatusTypeID": 50,
            "LevelID": 3,
            "PowerKW": 43,
            "CurrentTypeID": 20
        },
        {
            "ID": 275469,
            "ConnectionTypeID": 33,
            "StatusTypeID": 50,
            "LevelID": 3,
            "PowerKW": 50,
            "CurrentTypeID": 30
        }
    ],
    "StatusTypeID": 0,
    "DateLastStatusUpdate": "2021-07-09T03:11:00Z",
    "MetadataValues": [
        {
            "ID": 9226,
            "MetadataFieldID": 4,
            "ItemValue": "Data from the German chargepoint registry provided by Bundesnetzagentur.de under the CC-BY 4.0 license"
        }
    ],
    "DataQualityLevel": 3,
    "DateCreated": "2021-07-08T09:48:00Z",
    "SubmissionStatusTypeID": 100
}