{
    "UserComments": [
        {
            "ID": 23544,
            "ChargePointID": 170145,
            "CommentTypeID": 10,
            "UserName": "ForumElettrico.it",
            "Comment": "Una quick ed una fast (in arrivo) davanti all'ospedale Infermi di Rimini. Leggi la recensione completa qui > https://www.forumelettrico.it/forum/colonnine-becharge-fast-rimini-rm-viale-luigi-settembrini-17h-t13975.html",
            "RelatedURL": "https://www.forumelettrico.it/forum/colonnine-becharge-fast-rimini-rm-viale-luigi-settembrini-17h-t13975.html",
            "DateCreated": "2020-11-25T08:22:56.58Z",
            "User": {
                "ID": 11749,
                "Username": "ForumElettrico.it"
            },
            "CheckinStatusTypeID": 140,
            "IsActionedByEditor": false
        }
    ],
    "MediaItems": [
        {
            "ID": 25572,
            "ChargePointID": 170145,
            "ItemURL": "https://s3-ap-southeast-2.amazonaws.com/openchargemap/images/IT/OCM170145/OCM-170145.orig.2020112508230627.jpg",
            "ItemThumbnailURL": "https://s3-ap-southeast-2.amazonaws.com/openchargemap/images/IT/OCM170145/OCM-170145.thmb.2020112508230627.jpg",
            "Comment": "",
            "IsEnabled": true,
            "IsVideo": false,
            "IsFeaturedItem": false,
            "IsExternalResource": false,
            "User": {
                "ID": 11749,
                "Username": "ForumElettrico.it"
            },
            "DateCreated": "2020-11-25T08:23:00Z"
        },
        {
            "ID": 25573,
            "ChargePointID": 170145,
            "ItemURL": "https://s3-ap-southeast-2.amazonaws.com/openchargemap/images/IT/OCM170145/OCM-170145.orig.2020112508231365.jpg",
            "ItemThumbnailURL": "https://s3-ap-southeast-2.amazonaws.com/openchargemap/images/IT/OCM170145/OCM-170145.thmb.2020112508231365.jpg",
            "Comment": "",
            "IsEnabled": true,
            "IsVideo": false,
            "IsFeaturedItem": false,
            "IsExternalResource": false,
            "User": {
                "ID": 11749,
                "Username": "ForumElettrico.it"
            },
            "DateCreated": "2020-11-25T08:23:00Z"
        }
    ],
    "IsRecentlyVerified": false,
    "ID": 170145,
    "UUID": "638C4A34-4791-4DCD-9215-2784F97E42AC",
    "DataProviderID": 1,
    "OperatorID": 3327,
    "UsageTypeID": 4,
    "AddressInfo": {
        "ID": 170504,
        "Title": "BECHARGE Rimini Settembrini",
        "AddressLine1": "Viale Luigi Settembrini",
        "Town": "Rimini",
        "StateOrProvince": "RN",
        "Postcode": "47924",
        "CountryID": 112,
        "Latitude": 44.04506220460817,
        "Longitude": 12.59093653528339,
        "ContactTelephone1": "02-49527730",
        "ContactEmail": "emobility@buildingenergy.it",
        "RelatedURL": "https://www.bec.energy/",
        "DistanceUnit": 0
    },
    "Connections": [
        {
            "ID": 259382,
            "ConnectionTypeID": 33,
            "StatusTypeID": 150,
            "LevelID": 3,
            "PowerKW": 75,
            "CurrentTypeID": 30,
            "Quantity": 1
        },
        {
            "ID": 259383,
            "ConnectionTypeID": 2,
            "StatusTypeID": 150,
            "LevelID": 3,
            "PowerKW": 50,
            "CurrentTypeID": 30,
            "Quantity": 1
        },
        {
            "ID": 259384,
            "ConnectionTypeID": 25,
            "StatusTypeID": 150,
            "LevelID": 2,
            "Amps": 32,
            "Voltage": 400,
            "PowerKW": 22,
            "CurrentTypeID": 20,
            "Quantity": 1
        },
        {
            "ID": 259385,
            "ConnectionTypeID": 25,
            "StatusTypeID": 150,
            "LevelID": 2,
            "Amps": 22,
            "Voltage": 400,
            "PowerKW": 22,
            "CurrentTypeID": 20,
            "Quantity": 2
        }
    ],
    "NumberOfPoints": 4,
    "StatusTypeID": 150,
    "DateLastStatusUpdate": "2020-11-25T08:23:00Z",
    "DataQualityLevel": 1,
    "DateCreated": "2020-11-19T14:46:00Z",
    "SubmissionStatusTypeID": 200
}