{
    "IsRecentlyVerified": false,
    "ID": 85583,
    "UUID": "3CD8AF4F-602F-498D-A98C-BA0E81F77BB5",
    "DataProviderID": 1,
    "OperatorID": 23,
    "OperatorsReference": "26357",
    "UsageTypeID": 4,
    "AddressInfo": {
        "ID": 85929,
        "Title": "Old Log Theatre With Cast & Cru Restaurant",
        "AddressLine1": "5185 Meadville St",
        "Town": "Excelsior",
        "StateOrProvince": "Minnesota",
        "Postcode": "55331",
        "CountryID": 2,
        "Latitude": 44.910286,
        "Longitude": -93.558302,
        "ContactTelephone1": "(952) 474-5951",
        "DistanceUnit": 0
    },
    "Connections": [
        {
            "ID": 121687,
            "ConnectionTypeID": 30,
            "StatusTypeID": 50,
            "LevelID": 2,
            "PowerKW": 16,
            "CurrentTypeID": 20,
            "Quantity": 3
        }
    ],
    "NumberOfPoints": 3,
    "GeneralComments": "3 Tesla Connectors, up to 16kW.Available to the public. Self park.",
    "StatusTypeID": 50,
    "DateLastStatusUpdate": "2017-04-08T05:41:00Z",
    "DataQualityLevel": 1,
    "DateCreated": "2017-04-08T05:41:00Z",
    "SubmissionStatusTypeID": 200
}