{
    "IsRecentlyVerified": false,
    "ID": 114739,
    "UUID": "31334ECE-D43C-4DD1-9063-87CB92293399",
    "DataProviderID": 1,
    "OperatorID": 103,
    "OperatorsReference": "BEALLEGO001333",
    "UsageTypeID": 6,
    "AddressInfo": {
        "ID": 115085,
        "Title": "Battmobiel Brugsesteenweg ",
        "AddressLine1": "Brugsesteenweg 219",
        "Town": "GENT",
        "StateOrProvince": "Oost-Vlaanderen",
        "Postcode": "9000",
        "CountryID": 26,
        "Latitude": 51.0667558,
        "Longitude": 3.68753229999993,
        "AccessComments": "Eén van de toegangspunten is voorbehouden voor klanten van Battmobiel",
        "DistanceUnit": 0
    },
    "Connections": [
        {
            "ID": 161478,
            "ConnectionTypeID": 1036,
            "StatusTypeID": 50,
            "LevelID": 2,
            "Amps": 16,
            "Voltage": 400,
            "PowerKW": 11,
            "CurrentTypeID": 20,
            "Quantity": 2
        }
    ],
    "NumberOfPoints": 2,
    "StatusTypeID": 50,
    "DateLastStatusUpdate": "2019-01-15T15:08:00Z",
    "DataQualityLevel": 1,
    "DateCreated": "2019-01-14T15:08:00Z",
    "SubmissionStatusTypeID": 200
}