{
    "IsRecentlyVerified": false,
    "ID": 3580,
    "UUID": "23B4CC05-C37B-4EF3-9E42-2E420952AFE1",
    "DataProviderID": 1,
    "OperatorID": 5,
    "UsageTypeID": 1,
    "AddressInfo": {
        "ID": 3581,
        "Title": "State of Maryland Capital Complex",
        "AddressLine1": "29 Saint Johns St",
        "Town": "Annapolis",
        "StateOrProvince": "MD",
        "Postcode": "21402",
        "CountryID": 2,
        "Latitude": 38.9816882,
        "Longitude": -76.4936067,
        "ContactTelephone1": "888-758-4389",
        "DistanceUnit": 0
    },
    "Connections": [
        {
            "ID": 95,
            "ConnectionTypeID": 1,
            "Quantity": 1
        }
    ],
    "NumberOfPoints": 1,
    "DateLastStatusUpdate": "2019-12-15T06:07:00Z",
    "DateCreated": "2010-02-28T00:00:00Z",
    "SubmissionStatusTypeID": 200
}