{
    "IsRecentlyVerified": false,
    "ID": 181352,
    "UUID": "7BC31BA1-EC67-472F-8796-2E596F6B53AE",
    "DataProviderID": 29,
    "DataProvidersReference": "13080",
    "OperatorID": 45,
    "AddressInfo": {
        "ID": 181711,
        "Title": "Hauptstraße 3",
        "AddressLine1": "Hauptstraße 3",
        "Town": "Dülmen",
        "Postcode": "48249",
        "CountryID": 87,
        "Latitude": 51.896061,
        "Longitude": 7.275495,
        "DistanceUnit": 0
    },
    "Connections": [
        {
            "ID": 285556,
            "ConnectionTypeID": 33,
            "StatusTypeID": 50,
            "LevelID": 3,
            "PowerKW": 22,
            "CurrentTypeID": 30
        },
        {
            "ID": 285557,
            "ConnectionTypeID": 25,
            "StatusTypeID": 50,
            "LevelID": 2,
            "PowerKW": 11,
            "CurrentTypeID": 20
        }
    ],
    "StatusTypeID": 50,
    "DateLastStatusUpdate": "2021-07-12T02:48:00Z",
    "MetadataValues": [
        {
            "ID": 13646,
            "MetadataFieldID": 4,
            "ItemValue": "Data from the German chargepoint registry provided by Bundesnetzagentur.de under the CC-BY 4.0 license"
        }
    ],
    "DataQualityLevel": 3,
    "DateCreated": "2021-07-08T10:01:00Z",
    "SubmissionStatusTypeID": 100
}