{
    "IsRecentlyVerified": false,
    "ID": 107502,
    "UUID": "F78B95D9-A0EF-45C5-A879-06B96946E626",
    "DataProviderID": 1,
    "UsageTypeID": 1,
    "AddressInfo": {
        "ID": 107848,
        "Title": "Electrify America - Wal-Mart Forsyth",
        "AddressLine1": "180 N Lee St",
        "Town": "Forsyth",
        "StateOrProvince": "GA",
        "Postcode": "31029",
        "CountryID": 2,
        "Latitude": 33.040951482082015,
        "Longitude": -83.94192747015893,
        "ContactTelephone1": "866-816-7584",
        "RelatedURL": "https://www.electrifyamerica.com/",
        "DistanceUnit": 0
    },
    "Connections": [
        {
            "ID": 151668,
            "ConnectionTypeID": 2,
            "StatusTypeID": 50,
            "LevelID": 3,
            "Amps": 125,
            "Voltage": 400,
            "PowerKW": 50,
            "CurrentTypeID": 30,
            "Quantity": 1
        },
        {
            "ID": 151669,
            "ConnectionTypeID": 32,
            "StatusTypeID": 50,
            "LevelID": 3,
            "Amps": 350,
            "Voltage": 1000,
            "PowerKW": 350,
            "CurrentTypeID": 30,
            "Quantity": 2
        },
        {
            "ID": 151670,
            "ConnectionTypeID": 32,
            "StatusTypeID": 50,
            "LevelID": 3,
            "Amps": 300,
            "Voltage": 500,
            "PowerKW": 150,
            "CurrentTypeID": 30,
            "Quantity": 2
        }
    ],
    "NumberOfPoints": 4,
    "StatusTypeID": 50,
    "DateLastStatusUpdate": "2021-07-12T07:49:00Z",
    "DataQualityLevel": 1,
    "DateCreated": "2018-07-30T14:35:00Z",
    "SubmissionStatusTypeID": 100
}