{
    "IsRecentlyVerified": false,
    "ID": 137854,
    "UUID": "BB215359-A229-47A8-96C6-BC83BA8B0414",
    "DataProviderID": 2,
    "DataProvidersReference": "104210",
    "OperatorID": 5,
    "UsageTypeID": 1,
    "AddressInfo": {
        "ID": 138203,
        "Title": "QCOM",
        "AddressLine1": "6455P Lusk Blvd",
        "Town": "San Diego",
        "StateOrProvince": "CA",
        "Postcode": "92121",
        "CountryID": 2,
        "Latitude": 32.903291,
        "Longitude": -117.202723,
        "ContactTelephone1": "888-758-4389",
        "AccessComments": "24 hours daily",
        "RelatedURL": "http://www.chargepoint.com/",
        "DistanceUnit": 0
    },
    "Connections": [
        {
            "ID": 192871,
            "ConnectionTypeID": 1,
            "LevelID": 2,
            "Amps": 16,
            "Voltage": 230,
            "PowerKW": 3,
            "CurrentTypeID": 10,
            "Quantity": 4
        }
    ],
    "StatusTypeID": 50,
    "DateLastStatusUpdate": "2019-12-24T09:06:00Z",
    "DataQualityLevel": 3,
    "DateCreated": "2019-12-24T09:06:00Z",
    "SubmissionStatusTypeID": 100
}