{
    "IsRecentlyVerified": false,
    "ID": 186931,
    "UUID": "A0A714CD-1E9D-4CB0-B813-EF5ECAFFF341",
    "DataProviderID": 29,
    "DataProvidersReference": "13928",
    "OperatorID": 127,
    "AddressInfo": {
        "ID": 187290,
        "Title": "Kokenhorststraße 18",
        "AddressLine1": "Kokenhorststraße 18",
        "Town": "Großburgwedel",
        "Postcode": "30938",
        "CountryID": 87,
        "Latitude": 52.485599492073,
        "Longitude": 9.844651222229,
        "DistanceUnit": 0
    },
    "Connections": [
        {
            "ID": 300652,
            "ConnectionTypeID": 33,
            "StatusTypeID": 50,
            "LevelID": 3,
            "PowerKW": 75,
            "CurrentTypeID": 30
        },
        {
            "ID": 300653,
            "ConnectionTypeID": 33,
            "StatusTypeID": 50,
            "LevelID": 3,
            "PowerKW": 75,
            "CurrentTypeID": 30
        }
    ],
    "StatusTypeID": 50,
    "DateLastStatusUpdate": "2021-07-12T02:49:00Z",
    "MetadataValues": [
        {
            "ID": 19171,
            "MetadataFieldID": 4,
            "ItemValue": "Data from the German chargepoint registry provided by Bundesnetzagentur.de under the CC-BY 4.0 license"
        }
    ],
    "DataQualityLevel": 3,
    "DateCreated": "2021-07-12T02:49:00Z",
    "SubmissionStatusTypeID": 100
}