{
    "IsRecentlyVerified": false,
    "ID": 71750,
    "UUID": "CB053ECF-6196-42A6-A50D-6994D4670D4E",
    "DataProviderID": 1,
    "OperatorID": 3252,
    "UsageTypeID": 1,
    "UsageCost": "9.95 $",
    "AddressInfo": {
        "ID": 72096,
        "Title": "Westlake Shopping Center - Daly City",
        "AddressLine1": "Westlake Shopping Center - Daly City",
        "Town": "San Francisco",
        "StateOrProvince": "California",
        "Postcode": "94015",
        "CountryID": 2,
        "Latitude": 37.690104,
        "Longitude": -122.461762,
        "DistanceUnit": 0
    },
    "Connections": [
        {
            "ID": 102778,
            "ConnectionTypeID": 32,
            "StatusTypeID": 50,
            "LevelID": 3,
            "PowerKW": 60,
            "CurrentTypeID": 30,
            "Quantity": 1
        },
        {
            "ID": 102779,
            "ConnectionTypeID": 2,
            "StatusTypeID": 50,
            "LevelID": 3,
            "CurrentTypeID": 30,
            "Quantity": 1
        }
    ],
    "NumberOfPoints": 1,
    "StatusTypeID": 50,
    "DateLastStatusUpdate": "2016-10-02T19:14:00Z",
    "DataQualityLevel": 1,
    "DateCreated": "2016-09-05T17:15:00Z",
    "SubmissionStatusTypeID": 200
}