{
    "IsRecentlyVerified": false,
    "ID": 181427,
    "UUID": "6E3F3E71-3D71-4C55-955F-382C51AAED69",
    "DataProviderID": 29,
    "DataProvidersReference": "5870",
    "AddressInfo": {
        "ID": 181786,
        "Title": "Mühlstraße",
        "AddressLine1": "Mühlstraße",
        "Town": "Neustadt an der Orla",
        "Postcode": "07806",
        "CountryID": 87,
        "Latitude": 50.738882,
        "Longitude": 11.744593,
        "DistanceUnit": 0
    },
    "Connections": [
        {
            "ID": 285734,
            "ConnectionTypeID": 25,
            "StatusTypeID": 50,
            "LevelID": 2,
            "PowerKW": 22,
            "CurrentTypeID": 20
        },
        {
            "ID": 285735,
            "ConnectionTypeID": 25,
            "StatusTypeID": 50,
            "LevelID": 2,
            "PowerKW": 22,
            "CurrentTypeID": 20
        }
    ],
    "StatusTypeID": 50,
    "DateLastStatusUpdate": "2021-07-09T03:20:00Z",
    "MetadataValues": [
        {
            "ID": 13721,
            "MetadataFieldID": 4,
            "ItemValue": "Data from the German chargepoint registry provided by Bundesnetzagentur.de under the CC-BY 4.0 license"
        }
    ],
    "DataQualityLevel": 3,
    "DateCreated": "2021-07-08T10:01:00Z",
    "SubmissionStatusTypeID": 100
}