{
    "IsRecentlyVerified": false,
    "ID": 38035,
    "UUID": "1304F857-C4C1-4404-ACAD-EEBEA3F440FC",
    "DataProviderID": 26,
    "DataProvidersReference": "48648",
    "OperatorID": 178,
    "OperatorsReference": "EVnetNL REE525",
    "UsageCost": "0.00 jaarabonnement",
    "AddressInfo": {
        "ID": 38381,
        "Title": "Schokkerkade 5",
        "AddressLine1": "Schokkerkade 5",
        "Town": "Haarlem",
        "Postcode": "2022 GD",
        "CountryID": 159,
        "Latitude": 52.403843,
        "Longitude": 4.655915,
        "ContactTelephone1": "0800-3522365",
        "RelatedURL": "http://www.evnet.nl",
        "DistanceUnit": 0
    },
    "Connections": [
        {
            "ID": 41546,
            "ConnectionTypeID": 25,
            "LevelID": 1,
            "PowerKW": 2.3,
            "CurrentTypeID": 10
        }
    ],
    "NumberOfPoints": 1,
    "StatusTypeID": 50,
    "DateLastStatusUpdate": "2016-06-04T02:54:00Z",
    "DataQualityLevel": 3,
    "DateCreated": "2015-01-09T06:07:00Z",
    "SubmissionStatusTypeID": 100
}