{
    "IsRecentlyVerified": false,
    "ID": 121734,
    "UUID": "C9CE68D4-7ECA-46C2-9537-CAEA28672A8B",
    "DataProviderID": 2,
    "DataProvidersReference": "93746",
    "OperatorID": 15,
    "UsageTypeID": 4,
    "AddressInfo": {
        "ID": 122080,
        "Title": "Walmart",
        "AddressLine1": "705 College Blvd",
        "Town": "Oceanside",
        "StateOrProvince": "CA",
        "Postcode": "92057",
        "CountryID": 2,
        "Latitude": 33.241632,
        "Longitude": -117.291319,
        "ContactTelephone1": "877-455-3833",
        "AccessComments": "24 hours daily\r\nPublic - Card key at all times",
        "RelatedURL": "https://www.evgo.com/",
        "DistanceUnit": 0
    },
    "Connections": [
        {
            "ID": 171550,
            "ConnectionTypeID": 2,
            "LevelID": 3,
            "Amps": 100,
            "Voltage": 400,
            "PowerKW": 40,
            "CurrentTypeID": 30,
            "Quantity": 1
        },
        {
            "ID": 171551,
            "ConnectionTypeID": 32,
            "LevelID": 3,
            "Amps": 100,
            "Voltage": 400,
            "PowerKW": 40,
            "CurrentTypeID": 30,
            "Quantity": 1
        }
    ],
    "DateLastStatusUpdate": "2020-06-26T02:55:00Z",
    "DataQualityLevel": 3,
    "DateCreated": "2019-04-06T05:02:00Z",
    "SubmissionStatusTypeID": 100
}