{
    "IsRecentlyVerified": false,
    "ID": 115612,
    "UUID": "323ED379-BF23-4EBC-BF40-A11DA650ACAA",
    "DataProviderID": 2,
    "DataProvidersReference": "117228",
    "OperatorID": 5,
    "UsageTypeID": 1,
    "AddressInfo": {
        "ID": 115958,
        "Title": "APPLE",
        "AddressLine1": "1 Apple Park Way",
        "Town": "Cupertino",
        "StateOrProvince": "CA",
        "Postcode": "95014",
        "CountryID": 2,
        "Latitude": 37.3294281,
        "Longitude": -122.0102583,
        "ContactTelephone1": "888-758-4389",
        "AccessComments": "24 hours daily",
        "RelatedURL": "http://www.chargepoint.com/",
        "DistanceUnit": 0
    },
    "Connections": [
        {
            "ID": 162636,
            "ConnectionTypeID": 1,
            "LevelID": 2,
            "Amps": 16,
            "Voltage": 230,
            "PowerKW": 3,
            "CurrentTypeID": 10,
            "Quantity": 4
        }
    ],
    "DateLastStatusUpdate": "2019-04-06T04:02:00Z",
    "DataQualityLevel": 3,
    "DateCreated": "2019-02-11T07:13:00Z",
    "SubmissionStatusTypeID": 100
}