{
    "IsRecentlyVerified": false,
    "ID": 139071,
    "UUID": "681D971C-0B65-49D4-8CFD-509CB14B94A7",
    "DataProviderID": 2,
    "DataProvidersReference": "96489",
    "OperatorID": 9,
    "UsageTypeID": 1,
    "AddressInfo": {
        "ID": 139423,
        "Title": "Camelback Toyota - South Side of Dealership",
        "AddressLine1": "1550 E. Camelback Road",
        "Town": "Phoenix",
        "StateOrProvince": "AZ",
        "Postcode": "85014",
        "CountryID": 2,
        "Latitude": 33.509391,
        "Longitude": -112.048106,
        "ContactTelephone1": "888-998-2546",
        "AccessComments": "MON: 24 hours | TUE: 24 hours | WED: 24 hours | THU: 24 hours | FRI: 24 hours | SAT: 24 hours | SUN: 24 hours",
        "RelatedURL": "http://www.blinkcharging.com/",
        "DistanceUnit": 0
    },
    "Connections": [
        {
            "ID": 194322,
            "ConnectionTypeID": 1,
            "LevelID": 2,
            "Amps": 16,
            "Voltage": 230,
            "PowerKW": 3.7,
            "CurrentTypeID": 10,
            "Quantity": 2
        },
        {
            "ID": 194323,
            "ConnectionTypeID": 2,
            "LevelID": 3,
            "Amps": 100,
            "Voltage": 400,
            "PowerKW": 40,
            "CurrentTypeID": 30,
            "Quantity": 2
        }
    ],
    "StatusTypeID": 50,
    "DateLastStatusUpdate": "2020-06-26T02:55:00Z",
    "DataQualityLevel": 3,
    "DateCreated": "2019-12-24T09:10:00Z",
    "SubmissionStatusTypeID": 100
}