{
    "IsRecentlyVerified": false,
    "ID": 126279,
    "UUID": "EF46AF49-499E-4605-8DBA-98923FB58F86",
    "DataProviderID": 1,
    "OperatorID": 73,
    "UsageTypeID": 1,
    "UsageCost": "0,23",
    "AddressInfo": {
        "ID": 126625,
        "Title": "Zeeschipstraat",
        "AddressLine1": "Zeeschipstraat",
        "Town": "Ghent",
        "StateOrProvince": "Flanders",
        "Postcode": "9000",
        "CountryID": 26,
        "Latitude": 51.0911463919787,
        "Longitude": 3.7239222539868706,
        "DistanceUnit": 0
    },
    "Connections": [
        {
            "ID": 176975,
            "ConnectionTypeID": 25,
            "StatusTypeID": 50,
            "LevelID": 2,
            "Amps": 32,
            "Voltage": 400,
            "PowerKW": 22,
            "CurrentTypeID": 20,
            "Quantity": 2
        }
    ],
    "NumberOfPoints": 2,
    "StatusTypeID": 50,
    "DateLastStatusUpdate": "2020-11-06T15:24:00Z",
    "DataQualityLevel": 1,
    "DateCreated": "2019-05-14T08:40:00Z",
    "SubmissionStatusTypeID": 200
}