{
    "IsRecentlyVerified": false,
    "ID": 52289,
    "UUID": "F47E5482-AB3C-43B5-B48E-FE9D05754E42",
    "DataProviderID": 1,
    "OperatorID": 105,
    "UsageTypeID": 1,
    "AddressInfo": {
        "ID": 52635,
        "Title": "E-Bike Station Parkplatz Georg-Melches-Stadion",
        "AddressLine1": "Hafenstrasse 97A",
        "Town": "Essen",
        "StateOrProvince": "Nordrhein-Westfalen",
        "Postcode": "45356",
        "CountryID": 87,
        "Latitude": 51.4858,
        "Longitude": 6.97650999999996,
        "ContactTelephone1": "0800 99 44 009",
        "RelatedURL": "http://www.rwe.com/web/cms/de/494436/e-bikes-on-tour/ladestationen/",
        "DistanceUnit": 0
    },
    "Connections": [
        {
            "ID": 64940,
            "ConnectionTypeID": 28,
            "StatusTypeID": 50,
            "LevelID": 1,
            "Amps": 10,
            "Voltage": 230,
            "PowerKW": 2.3,
            "CurrentTypeID": 10,
            "Quantity": 3
        }
    ],
    "NumberOfPoints": 3,
    "StatusTypeID": 50,
    "DateLastStatusUpdate": "2015-08-28T09:33:00Z",
    "DataQualityLevel": 1,
    "DateCreated": "2015-08-28T06:37:00Z",
    "SubmissionStatusTypeID": 200
}