{
    "IsRecentlyVerified": false,
    "ID": 174111,
    "UUID": "2CC9F7F3-9C31-46D0-83DA-D51D8E258EEE",
    "DataProviderID": 1,
    "OperatorID": 45,
    "UsageTypeID": 1,
    "UsageCost": "0,50€",
    "AddressInfo": {
        "ID": 174470,
        "Title": "E Bike Station Gasthaus Dammsiel",
        "AddressLine1": "Niederblockland 32",
        "Town": "Bremen",
        "StateOrProvince": "Freie Hansestadt Bremen",
        "Postcode": "28357",
        "CountryID": 87,
        "Latitude": 53.158276065092,
        "Longitude": 8.777602007128962,
        "DistanceUnit": 0
    },
    "Connections": [
        {
            "ID": 268973,
            "ConnectionTypeID": 28,
            "StatusTypeID": 50,
            "LevelID": 2,
            "Amps": 16,
            "Voltage": 230,
            "PowerKW": 3.7,
            "CurrentTypeID": 10,
            "Quantity": 3
        }
    ],
    "NumberOfPoints": 3,
    "GeneralComments": "3 abschließbare Ladefächer in der Gaststätte, Schlüssel gibt es gegen 0,50€ ",
    "StatusTypeID": 50,
    "DateLastStatusUpdate": "2021-03-15T09:16:00Z",
    "DataQualityLevel": 1,
    "DateCreated": "2021-03-15T09:16:00Z",
    "SubmissionStatusTypeID": 200
}