{
    "IsRecentlyVerified": false,
    "ID": 157197,
    "UUID": "36D464C6-CAE3-4203-91EB-CA19D78F3EA2",
    "DataProviderID": 19,
    "DataProvidersReference": "5030",
    "AddressInfo": {
        "ID": 157551,
        "Title": "OKQ8 Stugun",
        "AddressLine1": "Stuguvägen 1",
        "Town": "STUGUN",
        "StateOrProvince": "JÄMTLAND",
        "Postcode": "83076",
        "CountryID": 216,
        "Latitude": 63.16582,
        "Longitude": 15.59933,
        "AccessComments": "",
        "DistanceUnit": 0
    },
    "Connections": [
        {
            "ID": 225888,
            "ConnectionTypeID": 25,
            "Reference": "1",
            "LevelID": 2,
            "Amps": 16,
            "Voltage": 400,
            "PowerKW": 11,
            "CurrentTypeID": 20,
            "Comments": "Mode 3"
        },
        {
            "ID": 225889,
            "ConnectionTypeID": 25,
            "Reference": "2",
            "LevelID": 2,
            "Amps": 16,
            "Voltage": 400,
            "PowerKW": 11,
            "CurrentTypeID": 20,
            "Comments": "Mode 3"
        }
    ],
    "NumberOfPoints": 2,
    "StatusTypeID": 0,
    "DateLastStatusUpdate": "2020-05-26T08:25:00Z",
    "DataQualityLevel": 2,
    "DateCreated": "2020-05-26T08:25:00Z",
    "SubmissionStatusTypeID": 100
}