{
    "IsRecentlyVerified": false,
    "ID": 121216,
    "UUID": "ECEB2CC8-B5BF-4329-B845-2C88ECC86514",
    "DataProviderID": 2,
    "DataProvidersReference": "120895",
    "OperatorID": 39,
    "UsageTypeID": 4,
    "AddressInfo": {
        "ID": 121562,
        "Title": "Alexan 20th Street Station",
        "AddressLine1": "2080 California St",
        "Town": "Denver",
        "StateOrProvince": "CO",
        "Postcode": "80205",
        "CountryID": 2,
        "Latitude": 39.7496899,
        "Longitude": -104.986315,
        "ContactTelephone1": "800-663-5633",
        "AccessComments": "MO: Not Specified; TU: Not Specified; WE: Not Specified; TH: Not Specified; FR: Not Specified; SA: Not Specified; SU: Not Specified",
        "RelatedURL": "http://www.semacharge.com/",
        "DistanceUnit": 0
    },
    "Connections": [
        {
            "ID": 170656,
            "ConnectionTypeID": 1,
            "LevelID": 2,
            "Amps": 16,
            "Voltage": 230,
            "PowerKW": 3,
            "CurrentTypeID": 10,
            "Quantity": 2
        }
    ],
    "DateLastStatusUpdate": "2019-04-01T05:00:00Z",
    "DataQualityLevel": 3,
    "DateCreated": "2019-04-01T05:00:00Z",
    "SubmissionStatusTypeID": 100
}