{
    "IsRecentlyVerified": false,
    "ID": 137995,
    "UUID": "C61D7B7A-B233-40A6-8121-D27E2482F775",
    "DataProviderID": 2,
    "DataProvidersReference": "96062",
    "OperatorID": 9,
    "UsageTypeID": 1,
    "AddressInfo": {
        "ID": 138344,
        "Title": "South Lakes Park",
        "AddressLine1": "556 Hobson Lane",
        "Town": "Denton",
        "StateOrProvince": "TX",
        "Postcode": "76205",
        "CountryID": 2,
        "Latitude": 33.178101,
        "Longitude": -97.127593,
        "ContactTelephone1": "888-998-2546",
        "AccessComments": "MON: 24 hours | TUE: 24 hours | WED: 24 hours | THU: 24 hours | FRI: 24 hours | SAT: 24 hours | SUN: 24 hours",
        "RelatedURL": "http://www.blinkcharging.com/",
        "DistanceUnit": 0
    },
    "Connections": [
        {
            "ID": 193034,
            "ConnectionTypeID": 1,
            "LevelID": 2,
            "Amps": 16,
            "Voltage": 230,
            "PowerKW": 3,
            "CurrentTypeID": 10,
            "Quantity": 2
        }
    ],
    "StatusTypeID": 50,
    "DateLastStatusUpdate": "2019-12-24T09:06:00Z",
    "DataQualityLevel": 3,
    "DateCreated": "2019-12-24T09:06:00Z",
    "SubmissionStatusTypeID": 100
}