{
    "IsRecentlyVerified": false,
    "ID": 158468,
    "UUID": "BD12B215-D52E-49D9-8C16-9BB8912138DC",
    "DataProviderID": 2,
    "DataProvidersReference": "72882",
    "OperatorID": 1242,
    "UsageTypeID": 2,
    "AddressInfo": {
        "ID": 158825,
        "Title": "OC2 Station D",
        "AddressLine1": "4500 South Dobson Rd",
        "Town": "Chandler",
        "StateOrProvince": "AZ",
        "Postcode": "85248",
        "CountryID": 2,
        "Latitude": 33.251996243,
        "Longitude": -111.8833254749,
        "ContactTelephone1": "855-443-3873",
        "AccessComments": "",
        "RelatedURL": "https://www.gewattstation.com",
        "DistanceUnit": 0
    },
    "Connections": [
        {
            "ID": 228454,
            "ConnectionTypeID": 1,
            "LevelID": 2,
            "Amps": 16,
            "Voltage": 230,
            "PowerKW": 3.7,
            "CurrentTypeID": 10,
            "Quantity": 1
        }
    ],
    "StatusTypeID": 50,
    "DateLastStatusUpdate": "2020-06-26T02:55:00Z",
    "DataQualityLevel": 3,
    "DateCreated": "2020-06-26T02:55:00Z",
    "SubmissionStatusTypeID": 100
}