{
    "IsRecentlyVerified": false,
    "ID": 140271,
    "UUID": "70DA76A9-5428-4CF2-902E-66DDAFED0C92",
    "DataProviderID": 2,
    "DataProvidersReference": "150179",
    "UsageTypeID": 1,
    "AddressInfo": {
        "ID": 140623,
        "Title": "ShowBiz Cinemas",
        "AddressLine1": "3001 Market St",
        "Town": "Edmond",
        "StateOrProvince": "OK",
        "Postcode": "73034",
        "CountryID": 2,
        "Latitude": 35.6823899,
        "Longitude": -97.4206793,
        "ContactTelephone1": "405-562-6516",
        "AccessComments": "24 hours daily; Also accepts Charge Point card or app",
        "RelatedURL": "",
        "DistanceUnit": 0
    },
    "Connections": [
        {
            "ID": 195868,
            "ConnectionTypeID": 1,
            "LevelID": 2,
            "Amps": 16,
            "Voltage": 230,
            "PowerKW": 3.7,
            "CurrentTypeID": 10,
            "Quantity": 2
        }
    ],
    "StatusTypeID": 50,
    "DateLastStatusUpdate": "2020-06-26T02:58:00Z",
    "DataQualityLevel": 3,
    "DateCreated": "2019-12-24T09:12:00Z",
    "SubmissionStatusTypeID": 100
}