{
    "IsRecentlyVerified": false,
    "ID": 77386,
    "UUID": "AF6893A4-B508-4845-8EE6-A2E1FD5D89F5",
    "DataProviderID": 1,
    "OperatorID": 32,
    "OperatorsReference": "3785",
    "UsageTypeID": 4,
    "UsageCost": "Inclusive; for Polar Plus subscription members only",
    "AddressInfo": {
        "ID": 77732,
        "Title": "Hotel Ibis Preston",
        "AddressLine1": "Eastway",
        "AddressLine2": "Sharoe Green",
        "Town": "Preston",
        "StateOrProvince": "Lancashire",
        "Postcode": "PR3 5JE",
        "CountryID": 1,
        "Latitude": 53.8002469952983,
        "Longitude": -2.71443225078736,
        "DistanceUnit": 0
    },
    "Connections": [
        {
            "ID": 111509,
            "ConnectionTypeID": 25,
            "StatusTypeID": 50,
            "LevelID": 2,
            "Amps": 32,
            "Voltage": 230,
            "PowerKW": 7,
            "CurrentTypeID": 10,
            "Quantity": 2
        }
    ],
    "NumberOfPoints": 2,
    "StatusTypeID": 50,
    "DateLastStatusUpdate": "2019-03-08T06:26:00Z",
    "DataQualityLevel": 1,
    "DateCreated": "2017-01-14T08:31:00Z",
    "SubmissionStatusTypeID": 200
}