{
    "IsRecentlyVerified": false,
    "ID": 113171,
    "UUID": "4279D5F2-2228-4FCF-9393-ADC9C48E5B71",
    "DataProviderID": 2,
    "DataProvidersReference": "104878",
    "OperatorID": 3318,
    "UsageTypeID": 1,
    "AddressInfo": {
        "ID": 113517,
        "Title": "Walmart 1834 Grants Pass",
        "AddressLine1": "135 NE Terry Ln",
        "Town": "Grants Pass",
        "StateOrProvince": "OR",
        "Postcode": "97526",
        "CountryID": 2,
        "Latitude": 42.435787,
        "Longitude": -123.302141,
        "ContactTelephone1": "833-632-2778",
        "AccessComments": "24 hours daily",
        "RelatedURL": "https://www.electrifyamerica.com/",
        "DistanceUnit": 0
    },
    "Connections": [
        {
            "ID": 159352,
            "ConnectionTypeID": 2,
            "LevelID": 2,
            "Amps": 100,
            "Voltage": 400,
            "PowerKW": 40,
            "CurrentTypeID": 10,
            "Quantity": 1
        },
        {
            "ID": 159353,
            "ConnectionTypeID": 32,
            "LevelID": 2,
            "Amps": 100,
            "Voltage": 400,
            "PowerKW": 40,
            "CurrentTypeID": 10,
            "Quantity": 1
        }
    ],
    "DateLastStatusUpdate": "2019-04-06T05:05:00Z",
    "DataQualityLevel": 3,
    "DateCreated": "2018-11-28T02:04:00Z",
    "SubmissionStatusTypeID": 100
}