{
    "IsRecentlyVerified": false,
    "ID": 101935,
    "UUID": "76F817D0-934E-4F41-8BD6-75DB57566E3D",
    "DataProviderID": 1,
    "OperatorID": 23,
    "OperatorsReference": "42033",
    "UsageTypeID": 4,
    "AddressInfo": {
        "ID": 102281,
        "Title": "Tampa Airport Marriott",
        "AddressLine1": "4200 George J Bean Pkwy",
        "Town": "Tampa",
        "StateOrProvince": "Florida",
        "Postcode": "33607",
        "CountryID": 2,
        "Latitude": 27.981481,
        "Longitude": -82.534576,
        "ContactTelephone1": "(813) 879-5151",
        "DistanceUnit": 0
    },
    "Connections": [
        {
            "ID": 143918,
            "ConnectionTypeID": 30,
            "StatusTypeID": 50,
            "LevelID": 2,
            "PowerKW": 16,
            "CurrentTypeID": 20,
            "Quantity": 2
        }
    ],
    "NumberOfPoints": 2,
    "GeneralComments": "2 Tesla Connectors, up to 16kW.Available for customers. Self park.",
    "StatusTypeID": 50,
    "DateLastStatusUpdate": "2018-04-16T04:38:00Z",
    "DataQualityLevel": 1,
    "DateCreated": "2018-04-16T04:38:00Z",
    "SubmissionStatusTypeID": 200
}