{
    "IsRecentlyVerified": false,
    "ID": 132192,
    "UUID": "22E67ADC-F8C9-430C-8190-B1B747DD56B4",
    "DataProviderID": 1,
    "OperatorID": 80,
    "UsageTypeID": 4,
    "AddressInfo": {
        "ID": 132538,
        "Title": "Fermignano Metauro | EnelX",
        "AddressLine1": "Via Metauro, 17",
        "Town": "Fermignano",
        "StateOrProvince": "PU",
        "Postcode": "61033",
        "CountryID": 112,
        "Latitude": 43.6918986680064,
        "Longitude": 12.6551842238787,
        "RelatedURL": "https://www.enelx.com/it/it/emobility",
        "DistanceUnit": 0
    },
    "Connections": [
        {
            "ID": 185014,
            "ConnectionTypeID": 25,
            "StatusTypeID": 50,
            "LevelID": 2,
            "Amps": 32,
            "Voltage": 400,
            "PowerKW": 22,
            "CurrentTypeID": 20,
            "Quantity": 1
        },
        {
            "ID": 185015,
            "ConnectionTypeID": 36,
            "StatusTypeID": 50,
            "LevelID": 2,
            "Amps": 16,
            "Voltage": 240,
            "PowerKW": 3.7,
            "CurrentTypeID": 10,
            "Quantity": 1
        }
    ],
    "NumberOfPoints": 2,
    "StatusTypeID": 50,
    "DateLastStatusUpdate": "2019-09-23T14:28:00Z",
    "DataQualityLevel": 1,
    "DateCreated": "2019-09-23T14:27:00Z",
    "SubmissionStatusTypeID": 200
}