{
    "IsRecentlyVerified": false,
    "ID": 95293,
    "UUID": "AF5A3A56-3AC5-46A9-901D-B64895C4AB9D",
    "DataProviderID": 1,
    "OperatorID": 69,
    "UsageTypeID": 4,
    "AddressInfo": {
        "ID": 95639,
        "Title": "Apotheke am Rosengarten",
        "AddressLine1": "Dr.-Robert-Koch-Straße 4",
        "Town": "Nordhausen",
        "StateOrProvince": "Landkreis Nordhausen",
        "Postcode": "99734",
        "CountryID": 87,
        "Latitude": 51.5145581,
        "Longitude": 10.800340799999958,
        "ContactTelephone1": "+49 3631 634 5",
        "AccessComments": "24/7 nutzbare Ladesäule direkt an der Straße.",
        "RelatedURL": "http://www.energie-nordhausen.de/",
        "DistanceUnit": 0
    },
    "Connections": [
        {
            "ID": 134976,
            "ConnectionTypeID": 25,
            "StatusTypeID": 50,
            "LevelID": 2,
            "Amps": 16,
            "Voltage": 400,
            "PowerKW": 11,
            "CurrentTypeID": 20,
            "Quantity": 2
        }
    ],
    "NumberOfPoints": 2,
    "StatusTypeID": 50,
    "DateLastStatusUpdate": "2017-11-06T08:24:00Z",
    "DataQualityLevel": 1,
    "DateCreated": "2017-11-06T08:24:00Z",
    "SubmissionStatusTypeID": 200
}