{
    "IsRecentlyVerified": false,
    "ID": 121722,
    "UUID": "B3AC0A7A-C281-4D7F-8AA4-F094988E5B73",
    "DataProviderID": 2,
    "DataProvidersReference": "117469",
    "OperatorID": 5,
    "UsageTypeID": 1,
    "AddressInfo": {
        "ID": 122068,
        "Title": "PALOMAR ESC",
        "AddressLine1": "1951 E Valley Pkwy",
        "Town": "Escondido",
        "StateOrProvince": "CA",
        "Postcode": "92027",
        "CountryID": 2,
        "Latitude": 33.136834,
        "Longitude": -117.052763,
        "ContactTelephone1": "888-758-4389",
        "AccessComments": "24 hours daily",
        "RelatedURL": "http://www.chargepoint.com/",
        "DistanceUnit": 0
    },
    "Connections": [
        {
            "ID": 171534,
            "ConnectionTypeID": 1,
            "LevelID": 2,
            "Amps": 16,
            "Voltage": 230,
            "PowerKW": 3,
            "CurrentTypeID": 10,
            "Quantity": 8
        }
    ],
    "DateLastStatusUpdate": "2019-04-06T05:02:00Z",
    "DataQualityLevel": 3,
    "DateCreated": "2019-04-06T05:02:00Z",
    "SubmissionStatusTypeID": 100
}