{
    "IsRecentlyVerified": false,
    "ID": 186198,
    "UUID": "33DDF497-35EC-4C48-91E8-E6C0BA960944",
    "DataProviderID": 29,
    "DataProvidersReference": "1325",
    "OperatorID": 45,
    "AddressInfo": {
        "ID": 186557,
        "Title": "Rathausstr. 75",
        "AddressLine1": "Rathausstr. 75",
        "Town": "Windeck-Rosbach",
        "Postcode": "51570",
        "CountryID": 87,
        "Latitude": 50.8055,
        "Longitude": 7.6081,
        "DistanceUnit": 0
    },
    "Connections": [
        {
            "ID": 298219,
            "ConnectionTypeID": 25,
            "StatusTypeID": 50,
            "LevelID": 2,
            "PowerKW": 22,
            "CurrentTypeID": 20
        },
        {
            "ID": 298220,
            "ConnectionTypeID": 1036,
            "StatusTypeID": 50,
            "LevelID": 2,
            "PowerKW": 22,
            "CurrentTypeID": 20
        },
        {
            "ID": 298221,
            "ConnectionTypeID": 25,
            "StatusTypeID": 50,
            "LevelID": 3,
            "PowerKW": 22,
            "CurrentTypeID": 30
        },
        {
            "ID": 298222,
            "ConnectionTypeID": 1036,
            "StatusTypeID": 50,
            "LevelID": 3,
            "PowerKW": 22,
            "CurrentTypeID": 30
        },
        {
            "ID": 298223,
            "ConnectionTypeID": 2,
            "StatusTypeID": 50,
            "LevelID": 3,
            "PowerKW": 22,
            "CurrentTypeID": 30
        }
    ],
    "StatusTypeID": 50,
    "DateLastStatusUpdate": "2021-07-12T02:45:00Z",
    "MetadataValues": [
        {
            "ID": 18439,
            "MetadataFieldID": 4,
            "ItemValue": "Data from the German chargepoint registry provided by Bundesnetzagentur.de under the CC-BY 4.0 license"
        }
    ],
    "DataQualityLevel": 3,
    "DateCreated": "2021-07-12T02:45:00Z",
    "SubmissionStatusTypeID": 100
}