{
    "IsRecentlyVerified": false,
    "ID": 183923,
    "UUID": "418BD9A1-437D-4890-8059-6FED73845663",
    "DataProviderID": 29,
    "DataProvidersReference": "4728",
    "AddressInfo": {
        "ID": 184282,
        "Title": "Am Sportpark 9",
        "AddressLine1": "Am Sportpark 9",
        "Town": "Salzgitter",
        "Postcode": "38239",
        "CountryID": 87,
        "Latitude": 52.191995,
        "Longitude": 10.48042,
        "DistanceUnit": 0
    },
    "Connections": [
        {
            "ID": 291514,
            "ConnectionTypeID": 25,
            "StatusTypeID": 50,
            "LevelID": 2,
            "PowerKW": 22,
            "CurrentTypeID": 20
        },
        {
            "ID": 291515,
            "ConnectionTypeID": 25,
            "StatusTypeID": 50,
            "LevelID": 2,
            "PowerKW": 22,
            "CurrentTypeID": 20
        }
    ],
    "StatusTypeID": 50,
    "DateLastStatusUpdate": "2021-07-09T03:26:00Z",
    "MetadataValues": [
        {
            "ID": 16216,
            "MetadataFieldID": 4,
            "ItemValue": "Data from the German chargepoint registry provided by Bundesnetzagentur.de under the CC-BY 4.0 license"
        }
    ],
    "DataQualityLevel": 3,
    "DateCreated": "2021-07-08T10:04:00Z",
    "SubmissionStatusTypeID": 100
}