{
    "IsRecentlyVerified": false,
    "ID": 17279,
    "UUID": "8EAD0A21-972A-4949-BFDD-0594DB00B04A",
    "DataProviderID": 22,
    "DataProvidersReference": "F38575EE8AF23BA6D923C0D98EE767FC",
    "AddressInfo": {
        "ID": 17624,
        "Title": "愛知日産自動車東海店",
        "AddressLine1": "愛知県東海市富木島町北広75",
        "CountryID": 114,
        "Latitude": 35.01347613,
        "Longitude": 136.9072004,
        "ContactTelephone1": "052-603-5523",
        "DistanceUnit": 0
    },
    "Connections": [
        {
            "ID": 17520,
            "ConnectionTypeID": 2,
            "LevelID": 2,
            "Amps": 100,
            "Voltage": 480,
            "PowerKW": 48,
            "Quantity": 1
        }
    ],
    "DateLastStatusUpdate": "2013-06-29T08:56:00Z",
    "DataQualityLevel": 2,
    "DateCreated": "2013-06-29T08:56:00Z",
    "SubmissionStatusTypeID": 200
}