{
    "IsRecentlyVerified": false,
    "ID": 60344,
    "UUID": "022D649B-DC1E-4EF7-978E-80757577BBB3",
    "DataProviderID": 1,
    "OperatorID": 214,
    "UsageTypeID": 4,
    "AddressInfo": {
        "ID": 60690,
        "Title": "Reichenberger Straße",
        "AddressLine1": "Reichenberger Straße 20",
        "AddressLine2": "Kreuzberg",
        "Town": "Berlin",
        "StateOrProvince": "Berlin",
        "Postcode": "10999",
        "CountryID": 87,
        "Latitude": 52.498455,
        "Longitude": 13.419856799999934,
        "AccessComments": "Rund um die Uhr (24/7) nutzbar. Ladekarte von be eMobil oder Roamingpartnern The New Motion, LichtBlick Fahrstrom Chip oder ACE Ladekarte Power Me erforderlich.",
        "DistanceUnit": 0
    },
    "Connections": [
        {
            "ID": 76408,
            "ConnectionTypeID": 25,
            "StatusTypeID": 50,
            "LevelID": 2,
            "Amps": 16,
            "Voltage": 400,
            "PowerKW": 11,
            "CurrentTypeID": 20,
            "Quantity": 2
        }
    ],
    "NumberOfPoints": 2,
    "StatusTypeID": 50,
    "DateLastStatusUpdate": "2016-01-22T07:01:00Z",
    "DataQualityLevel": 1,
    "DateCreated": "2016-01-22T07:01:00Z",
    "SubmissionStatusTypeID": 200
}