{
    "IsRecentlyVerified": false,
    "ID": 119725,
    "UUID": "9EA75657-37E9-4A33-8F56-F7B42E606A5A",
    "DataProviderID": 2,
    "DataProvidersReference": "115811",
    "OperatorID": 23,
    "UsageTypeID": 1,
    "AddressInfo": {
        "ID": 120071,
        "Title": "Cinnamon Shore - Tesla Destination",
        "AddressLine1": "5009 TX-361",
        "Town": "Port Aransas",
        "StateOrProvince": "TX",
        "Postcode": "78373",
        "CountryID": 2,
        "Latitude": 27.77269,
        "Longitude": -97.109113,
        "ContactTelephone1": "888-893-0658  877-798-3752",
        "AccessComments": "24 hours daily",
        "RelatedURL": "https://www.tesla.com/destination-charging",
        "DistanceUnit": 0
    },
    "Connections": [
        {
            "ID": 169008,
            "ConnectionTypeID": 30,
            "LevelID": 2,
            "Amps": 16,
            "Voltage": 230,
            "PowerKW": 3.7,
            "CurrentTypeID": 10,
            "Quantity": 4
        }
    ],
    "DateLastStatusUpdate": "2020-06-26T02:52:00Z",
    "DataQualityLevel": 3,
    "DateCreated": "2019-04-01T04:59:00Z",
    "SubmissionStatusTypeID": 100
}