{
    "IsRecentlyVerified": false,
    "ID": 156419,
    "UUID": "D5ECB65E-7C91-4281-9294-D1D5AFC354C6",
    "DataProviderID": 1,
    "OperatorID": 3327,
    "UsageTypeID": 4,
    "AddressInfo": {
        "ID": 156773,
        "Title": "BECHARGE Bennet di Anzano del Parco",
        "AddressLine1": "Strada Provinciale ex Strada Statale 342 Briantea",
        "AddressLine2": "Via Provinciale, 2,",
        "Town": "Anzano del Parco",
        "StateOrProvince": "CO",
        "Postcode": "22040",
        "CountryID": 112,
        "Latitude": 45.763272579271785,
        "Longitude": 9.206595826636203,
        "ContactTelephone1": "02-49527730",
        "ContactEmail": "emobility@buildingenergy.it",
        "RelatedURL": "https://www.bec.energy/",
        "DistanceUnit": 0
    },
    "Connections": [
        {
            "ID": 220090,
            "ConnectionTypeID": 25,
            "StatusTypeID": 50,
            "LevelID": 2,
            "Amps": 32,
            "Voltage": 400,
            "PowerKW": 22,
            "CurrentTypeID": 20,
            "Quantity": 4
        }
    ],
    "NumberOfPoints": 4,
    "StatusTypeID": 50,
    "DateLastStatusUpdate": "2020-05-19T07:37:00Z",
    "DataQualityLevel": 1,
    "DateCreated": "2020-05-19T07:37:00Z",
    "SubmissionStatusTypeID": 200
}