{
    "IsRecentlyVerified": false,
    "ID": 42372,
    "UUID": "EAF70B70-E573-4CCA-9E1A-903CAE33743C",
    "DataProviderID": 1,
    "OperatorID": 106,
    "UsageTypeID": 4,
    "AddressInfo": {
        "ID": 42718,
        "Title": "Autohaus Markötter Bielefeld",
        "AddressLine1": "Artur-Ladebeck-Straße 208",
        "AddressLine2": "Brackwede",
        "Town": "Bielefeld",
        "StateOrProvince": "Nordrhein-Westfalen",
        "Postcode": "33647",
        "CountryID": 87,
        "Latitude": 51.9995459,
        "Longitude": 8.50333180000007,
        "ContactTelephone1": "0621 82039226",
        "ContactTelephone2": "052414010",
        "AccessComments": " Ovale Wallbox direkt am Eingang des Volvo, LandRover, Peugeot Autohauses.",
        "RelatedURL": "https://www.ladefoxx.com",
        "DistanceUnit": 0
    },
    "Connections": [
        {
            "ID": 50970,
            "ConnectionTypeID": 25,
            "StatusTypeID": 50,
            "LevelID": 2,
            "Amps": 16,
            "Voltage": 400,
            "PowerKW": 11,
            "CurrentTypeID": 20,
            "Quantity": 1
        },
        {
            "ID": 50971,
            "ConnectionTypeID": 25,
            "StatusTypeID": 50,
            "LevelID": 2,
            "Amps": 32,
            "Voltage": 400,
            "PowerKW": 22,
            "CurrentTypeID": 20,
            "Quantity": 0
        }
    ],
    "NumberOfPoints": 1,
    "StatusTypeID": 50,
    "DateLastStatusUpdate": "2017-08-09T12:00:00Z",
    "DataQualityLevel": 1,
    "DateCreated": "2015-03-06T12:03:00Z",
    "SubmissionStatusTypeID": 200
}