{
    "IsRecentlyVerified": false,
    "ID": 111104,
    "UUID": "9CB1A566-E880-4C4B-9A97-0BCA79E7B4A9",
    "DataProviderID": 2,
    "DataProvidersReference": "92590",
    "OperatorID": 5,
    "UsageTypeID": 1,
    "AddressInfo": {
        "ID": 111450,
        "Title": "VW RICHMOND HIL",
        "AddressLine1": "10440 Yonge St",
        "Town": "Richmond Hill",
        "StateOrProvince": "ON",
        "Postcode": "L4C 3C4",
        "CountryID": 44,
        "Latitude": 43.881988,
        "Longitude": -79.440544,
        "ContactTelephone1": "888-758-4389",
        "AccessComments": "24 hours daily",
        "RelatedURL": "http://www.chargepoint.com/",
        "DistanceUnit": 0
    },
    "Connections": [
        {
            "ID": 156464,
            "ConnectionTypeID": 1,
            "LevelID": 2,
            "Amps": 16,
            "Voltage": 230,
            "PowerKW": 3,
            "CurrentTypeID": 10,
            "Quantity": 2
        },
        {
            "ID": 159461,
            "ConnectionTypeID": 32,
            "LevelID": 3,
            "Amps": 100,
            "Voltage": 400,
            "PowerKW": 40,
            "CurrentTypeID": 30,
            "Quantity": 1
        }
    ],
    "DateLastStatusUpdate": "2019-12-24T09:22:00Z",
    "DataQualityLevel": 3,
    "DateCreated": "2018-10-18T23:36:00Z",
    "SubmissionStatusTypeID": 100
}