{
    "IsRecentlyVerified": false,
    "ID": 153702,
    "UUID": "31AFBE46-12D7-4D93-AE97-8E5791412EA7",
    "DataProviderID": 28,
    "DataProvidersReference": "FR*ION*P1264",
    "UsageTypeID": 5,
    "AddressInfo": {
        "ID": 154055,
        "Title": "IONITY Chartres Gasville",
        "AddressLine1": "Aire de Chartres Gasville - A11 - 28300 Mainvilliers",
        "CountryID": 80,
        "Latitude": 48.468541,
        "Longitude": 1.580005,
        "AccessComments": "24/24 7/7 jours",
        "DistanceUnit": 0
    },
    "Connections": [
        {
            "ID": 215784,
            "ConnectionTypeID": 33,
            "StatusTypeID": 50,
            "LevelID": 2,
            "PowerKW": 350
        },
        {
            "ID": 215785,
            "ConnectionTypeID": 33,
            "StatusTypeID": 50,
            "LevelID": 2,
            "PowerKW": 350
        },
        {
            "ID": 215786,
            "ConnectionTypeID": 33,
            "StatusTypeID": 50,
            "LevelID": 2,
            "PowerKW": 350
        },
        {
            "ID": 215787,
            "ConnectionTypeID": 33,
            "StatusTypeID": 50,
            "LevelID": 2,
            "PowerKW": 350
        }
    ],
    "GeneralComments": "Recharge jusqu'à 350KW - CCS",
    "StatusTypeID": 50,
    "DateLastStatusUpdate": "2020-03-15T10:54:00Z",
    "DataQualityLevel": 2,
    "DateCreated": "2020-03-15T10:54:00Z",
    "SubmissionStatusTypeID": 100
}