{
    "IsRecentlyVerified": false,
    "ID": 138256,
    "UUID": "EA0B025E-36C2-459A-8F81-1B3D38044EB7",
    "DataProviderID": 2,
    "DataProvidersReference": "149599",
    "OperatorID": 59,
    "UsageTypeID": 1,
    "AddressInfo": {
        "ID": 138605,
        "Title": "Greenlots - 162257",
        "AddressLine1": "203 4th Ave",
        "Town": "Indian Rocks Beach",
        "StateOrProvince": "FL",
        "Postcode": "33785",
        "CountryID": 2,
        "Latitude": 27.8824977874756,
        "Longitude": -82.8495025634766,
        "ContactTelephone1": "855-900-7584",
        "AccessComments": "24 hours daily",
        "RelatedURL": "http://greenlots.com/",
        "DistanceUnit": 0
    },
    "Connections": [
        {
            "ID": 193331,
            "ConnectionTypeID": 1,
            "LevelID": 2,
            "Amps": 16,
            "Voltage": 230,
            "PowerKW": 3.7,
            "CurrentTypeID": 10,
            "Quantity": 1
        }
    ],
    "StatusTypeID": 50,
    "DateLastStatusUpdate": "2020-06-26T02:52:00Z",
    "DataQualityLevel": 3,
    "DateCreated": "2019-12-24T09:08:00Z",
    "SubmissionStatusTypeID": 100
}