{
    "UserComments": [
        {
            "ID": 24753,
            "ChargePointID": 174421,
            "CommentTypeID": 10,
            "UserName": "ForumElettrico.it",
            "Comment": "Situata nel parcheggio del McDonald's. Leggi la recensione completa qui >  https://www.forumelettrico.it/forum/post231270.html#p231270",
            "RelatedURL": "https://www.forumelettrico.it/forum/post231270.html#p231270",
            "DateCreated": "2021-08-20T16:27:01.473Z",
            "User": {
                "ID": 11749,
                "Username": "ForumElettrico.it"
            },
            "CheckinStatusTypeID": 140,
            "IsActionedByEditor": false
        },
        {
            "ID": 24079,
            "ChargePointID": 174421,
            "CommentTypeID": 10,
            "UserName": "ForumElettrico.it",
            "Comment": "Per raggiungerla bisogna fare il giro dietro il Mc Donald's e tenere la destra. Leggi la recensione completa qui >  https://www.forumelettrico.it/forum/enelfast-sarzana-mcdonald-via-aurelia-49-t16682.html",
            "RelatedURL": "https://www.forumelettrico.it/forum/enelfast-sarzana-mcdonald-via-aurelia-49-t16682.html",
            "DateCreated": "2021-03-28T15:05:17.333Z",
            "User": {
                "ID": 11749,
                "Username": "ForumElettrico.it"
            },
            "CheckinStatusTypeID": 140,
            "IsActionedByEditor": false
        }
    ],
    "MediaItems": [
        {
            "ID": 29054,
            "ChargePointID": 174421,
            "ItemURL": "https://s3-ap-southeast-2.amazonaws.com/openchargemap/images/IT/OCM174421/OCM-174421.orig.2021082016283357.jpg",
            "ItemThumbnailURL": "https://s3-ap-southeast-2.amazonaws.com/openchargemap/images/IT/OCM174421/OCM-174421.thmb.2021082016283357.jpg",
            "Comment": "",
            "IsEnabled": true,
            "IsVideo": false,
            "IsFeaturedItem": false,
            "IsExternalResource": false,
            "User": {
                "ID": 11749,
                "Username": "ForumElettrico.it"
            },
            "DateCreated": "2021-08-20T16:29:00Z"
        },
        {
            "ID": 29055,
            "ChargePointID": 174421,
            "ItemURL": "https://s3-ap-southeast-2.amazonaws.com/openchargemap/images/IT/OCM174421/OCM-174421.orig.2021082016284149.jpg",
            "ItemThumbnailURL": "https://s3-ap-southeast-2.amazonaws.com/openchargemap/images/IT/OCM174421/OCM-174421.thmb.2021082016284149.jpg",
            "Comment": "",
            "IsEnabled": true,
            "IsVideo": false,
            "IsFeaturedItem": false,
            "IsExternalResource": false,
            "User": {
                "ID": 11749,
                "Username": "ForumElettrico.it"
            },
            "DateCreated": "2021-08-20T16:29:00Z"
        },
        {
            "ID": 29056,
            "ChargePointID": 174421,
            "ItemURL": "https://s3-ap-southeast-2.amazonaws.com/openchargemap/images/IT/OCM174421/OCM-174421.orig.2021082016285490.jpg",
            "ItemThumbnailURL": "https://s3-ap-southeast-2.amazonaws.com/openchargemap/images/IT/OCM174421/OCM-174421.thmb.2021082016285490.jpg",
            "Comment": "",
            "IsEnabled": true,
            "IsVideo": false,
            "IsFeaturedItem": false,
            "IsExternalResource": false,
            "User": {
                "ID": 11749,
                "Username": "ForumElettrico.it"
            },
            "DateCreated": "2021-08-20T16:29:00Z"
        },
        {
            "ID": 29057,
            "ChargePointID": 174421,
            "ItemURL": "https://s3-ap-southeast-2.amazonaws.com/openchargemap/images/IT/OCM174421/OCM-174421.orig.2021082016290488.jpg",
            "ItemThumbnailURL": "https://s3-ap-southeast-2.amazonaws.com/openchargemap/images/IT/OCM174421/OCM-174421.thmb.2021082016290488.jpg",
            "Comment": "",
            "IsEnabled": true,
            "IsVideo": false,
            "IsFeaturedItem": false,
            "IsExternalResource": false,
            "User": {
                "ID": 11749,
                "Username": "ForumElettrico.it"
            },
            "DateCreated": "2021-08-20T16:29:00Z"
        },
        {
            "ID": 29053,
            "ChargePointID": 174421,
            "ItemURL": "https://s3-ap-southeast-2.amazonaws.com/openchargemap/images/IT/OCM174421/OCM-174421.orig.2021082016282518.jpg",
            "ItemThumbnailURL": "https://s3-ap-southeast-2.amazonaws.com/openchargemap/images/IT/OCM174421/OCM-174421.thmb.2021082016282518.jpg",
            "Comment": "",
            "IsEnabled": true,
            "IsVideo": false,
            "IsFeaturedItem": false,
            "IsExternalResource": false,
            "User": {
                "ID": 11749,
                "Username": "ForumElettrico.it"
            },
            "DateCreated": "2021-08-20T16:28:00Z"
        },
        {
            "ID": 27066,
            "ChargePointID": 174421,
            "ItemURL": "https://s3-ap-southeast-2.amazonaws.com/openchargemap/images/IT/OCM174421/OCM-174421.orig.2021032815054526.jpg",
            "ItemThumbnailURL": "https://s3-ap-southeast-2.amazonaws.com/openchargemap/images/IT/OCM174421/OCM-174421.thmb.2021032815054526.jpg",
            "Comment": "",
            "IsEnabled": true,
            "IsVideo": false,
            "IsFeaturedItem": false,
            "IsExternalResource": false,
            "User": {
                "ID": 11749,
                "Username": "ForumElettrico.it"
            },
            "DateCreated": "2021-03-28T15:06:00Z"
        },
        {
            "ID": 27067,
            "ChargePointID": 174421,
            "ItemURL": "https://s3-ap-southeast-2.amazonaws.com/openchargemap/images/IT/OCM174421/OCM-174421.orig.2021032815060058.jpg",
            "ItemThumbnailURL": "https://s3-ap-southeast-2.amazonaws.com/openchargemap/images/IT/OCM174421/OCM-174421.thmb.2021032815060058.jpg",
            "Comment": "",
            "IsEnabled": true,
            "IsVideo": false,
            "IsFeaturedItem": false,
            "IsExternalResource": false,
            "User": {
                "ID": 11749,
                "Username": "ForumElettrico.it"
            },
            "DateCreated": "2021-03-28T15:06:00Z"
        }
    ],
    "IsRecentlyVerified": false,
    "ID": 174421,
    "UUID": "FBE63BC8-362A-4F0B-A4A5-681C9F1201CB",
    "DataProviderID": 1,
    "OperatorID": 80,
    "UsageTypeID": 1,
    "AddressInfo": {
        "ID": 174780,
        "Title": "Enel X McDonald's",
        "AddressLine1": "Via Variante Aurelia 49",
        "Town": "Sarzana",
        "StateOrProvince": "SP",
        "CountryID": 112,
        "Latitude": 44.105141,
        "Longitude": 9.963674,
        "RelatedURL": "https://www.forumelettrico.it/forum/enelfast-sarzana-mcdonald-via-aurelia-49-t16682.html",
        "DistanceUnit": 0
    },
    "Connections": [
        {
            "ID": 270183,
            "ConnectionTypeID": 33,
            "LevelID": 2,
            "PowerKW": 50
        },
        {
            "ID": 270184,
            "ConnectionTypeID": 2,
            "LevelID": 2,
            "PowerKW": 50
        },
        {
            "ID": 270185,
            "ConnectionTypeID": 1036,
            "LevelID": 2,
            "PowerKW": 43
        }
    ],
    "NumberOfPoints": 1,
    "StatusTypeID": 150,
    "DateLastStatusUpdate": "2021-08-20T16:29:00Z",
    "DataQualityLevel": 1,
    "DateCreated": "2021-03-28T15:05:00Z",
    "SubmissionStatusTypeID": 200
}