{
    "IsRecentlyVerified": false,
    "ID": 115228,
    "UUID": "7AD33CDA-74D0-4DB5-A70E-0DD4BC85AD1D",
    "DataProviderID": 1,
    "OperatorID": 3,
    "OperatorsReference": "t53_hu1_4718_008",
    "UsageTypeID": 4,
    "UsageCost": "£0.25/kWh",
    "AddressInfo": {
        "ID": 115574,
        "Title": "Lidl White Rock Way",
        "AddressLine1": "White Rock Way",
        "Town": "Paignton",
        "Postcode": "TQ4 7FP",
        "CountryID": 1,
        "Latitude": 50.413014,
        "Longitude": -3.579482,
        "DistanceUnit": 0
    },
    "Connections": [
        {
            "ID": 162219,
            "ConnectionTypeID": 1036,
            "StatusTypeID": 50,
            "LevelID": 3,
            "PowerKW": 43,
            "CurrentTypeID": 20,
            "Quantity": 1
        },
        {
            "ID": 162220,
            "ConnectionTypeID": 2,
            "StatusTypeID": 50,
            "LevelID": 3,
            "PowerKW": 50,
            "CurrentTypeID": 30,
            "Quantity": 1
        },
        {
            "ID": 162221,
            "ConnectionTypeID": 33,
            "StatusTypeID": 50,
            "LevelID": 3,
            "PowerKW": 50,
            "CurrentTypeID": 30,
            "Quantity": 1
        }
    ],
    "NumberOfPoints": 3,
    "StatusTypeID": 50,
    "DateLastStatusUpdate": "2021-03-22T19:39:00Z",
    "DataQualityLevel": 1,
    "DateCreated": "2019-02-09T23:25:00Z",
    "SubmissionStatusTypeID": 200
}