{
    "IsRecentlyVerified": false,
    "ID": 91604,
    "UUID": "64EAFAE2-CE4B-46D6-81C3-5F3495C01EDE",
    "DataProviderID": 1,
    "OperatorID": 105,
    "UsageTypeID": 4,
    "AddressInfo": {
        "ID": 91950,
        "Title": "Römerstraße",
        "AddressLine1": "Römerstraße 461",
        "AddressLine2": "Ecke Kaiserstraße",
        "Town": "Lampertheim",
        "StateOrProvince": "Kreis Bergstraße",
        "Postcode": "68623",
        "CountryID": 87,
        "Latitude": 49.59406152217306,
        "Longitude": 8.467631311639359,
        "AccessComments": "24/7 open",
        "DistanceUnit": 0
    },
    "Connections": [
        {
            "ID": 129864,
            "ConnectionTypeID": 25,
            "StatusTypeID": 50,
            "LevelID": 2,
            "Amps": 16,
            "Voltage": 400,
            "PowerKW": 11,
            "CurrentTypeID": 20,
            "Quantity": 2
        }
    ],
    "NumberOfPoints": 2,
    "StatusTypeID": 50,
    "DateLastStatusUpdate": "2017-08-08T09:57:00Z",
    "DataQualityLevel": 1,
    "DateCreated": "2017-08-08T09:57:00Z",
    "SubmissionStatusTypeID": 200
}