{
    "IsRecentlyVerified": false,
    "ID": 124907,
    "UUID": "D5A42BA2-8A42-4C1A-8C9E-6D65B4C57BBC",
    "DataProviderID": 2,
    "DataProvidersReference": "121124",
    "OperatorID": 5,
    "UsageTypeID": 1,
    "AddressInfo": {
        "ID": 125253,
        "Title": "WILSONVILLECHEV",
        "AddressLine1": "26051 SW Boones Ferry Rd",
        "Town": "Wilsonville",
        "StateOrProvince": "OR",
        "Postcode": "97070",
        "CountryID": 2,
        "Latitude": 45.3315975,
        "Longitude": -122.7705553,
        "ContactTelephone1": "888-758-4389",
        "AccessComments": "24 hours daily",
        "RelatedURL": "http://www.chargepoint.com/",
        "DistanceUnit": 0
    },
    "Connections": [
        {
            "ID": 175078,
            "ConnectionTypeID": 32,
            "LevelID": 3,
            "Amps": 100,
            "Voltage": 400,
            "PowerKW": 40,
            "CurrentTypeID": 30,
            "Quantity": 1
        }
    ],
    "DateLastStatusUpdate": "2020-06-26T03:08:00Z",
    "DataQualityLevel": 3,
    "DateCreated": "2019-04-06T05:04:00Z",
    "SubmissionStatusTypeID": 100
}