{
    "IsRecentlyVerified": false,
    "ID": 157675,
    "UUID": "7D6B865A-18FC-42D9-A7E7-4B073666467E",
    "DataProviderID": 1,
    "OperatorID": 21,
    "UsageTypeID": 4,
    "UsageCost": "Mobi.E compatible card or App",
    "AddressInfo": {
        "ID": 158029,
        "Title": "SCR-00011",
        "AddressLine1": "Rua João Paulo II",
        "Town": "Santa Cruz",
        "StateOrProvince": "Madeira",
        "Postcode": "9125-035",
        "CountryID": 180,
        "Latitude": 32.65194298062005,
        "Longitude": -16.839873563685956,
        "RelatedURL": "https://www.mobie.pt",
        "DistanceUnit": 0
    },
    "Connections": [
        {
            "ID": 227189,
            "ConnectionTypeID": 25,
            "StatusTypeID": 50,
            "LevelID": 2,
            "Amps": 32,
            "Voltage": 400,
            "PowerKW": 22,
            "CurrentTypeID": 20,
            "Quantity": 2
        }
    ],
    "NumberOfPoints": 2,
    "StatusTypeID": 50,
    "DateLastStatusUpdate": "2021-04-18T13:15:00Z",
    "DataQualityLevel": 3,
    "DateCreated": "2020-06-25T05:42:00Z",
    "SubmissionStatusTypeID": 100
}