{
    "MediaItems": [
        {
            "ID": 18289,
            "ChargePointID": 16209,
            "ItemURL": "https://s3-ap-southeast-2.amazonaws.com/openchargemap/images/GB/OCM16209/OCM-16209.orig.2019050909323617.jpeg",
            "ItemThumbnailURL": "https://s3-ap-southeast-2.amazonaws.com/openchargemap/images/GB/OCM16209/OCM-16209.thmb.2019050909323617.jpeg",
            "Comment": "",
            "IsEnabled": true,
            "IsVideo": false,
            "IsFeaturedItem": false,
            "IsExternalResource": false,
            "User": {
                "ID": 15366,
                "Username": "ZCWCara"
            },
            "DateCreated": "2019-05-09T09:33:00Z"
        },
        {
            "ID": 18288,
            "ChargePointID": 16209,
            "ItemURL": "https://s3-ap-southeast-2.amazonaws.com/openchargemap/images/GB/OCM16209/OCM-16209.orig.2019050909320961.jpg",
            "ItemThumbnailURL": "https://s3-ap-southeast-2.amazonaws.com/openchargemap/images/GB/OCM16209/OCM-16209.thmb.2019050909320961.jpg",
            "Comment": "",
            "IsEnabled": true,
            "IsVideo": false,
            "IsFeaturedItem": false,
            "IsExternalResource": false,
            "User": {
                "ID": 15366,
                "Username": "ZCWCara"
            },
            "DateCreated": "2019-05-09T09:32:00Z"
        }
    ],
    "IsRecentlyVerified": false,
    "ID": 16209,
    "UUID": "5F1D8C48-D776-460C-8ECA-81BE6AAD86B1",
    "DataProviderID": 1,
    "OperatorID": 19,
    "UsageTypeID": 1,
    "AddressInfo": {
        "ID": 16554,
        "Title": "Wroxton House Hotel",
        "AddressLine1": "Wroxton",
        "Town": "Banbury",
        "StateOrProvince": "Oxfordshire",
        "Postcode": "OX15 6QB",
        "CountryID": 1,
        "Latitude": 52.0745008,
        "Longitude": -1.3923661999999695,
        "ContactTelephone1": "01295 730777",
        "ContactEmail": "reservations@wroxtonhousehotel.com",
        "RelatedURL": "http://www.bw-wroxtonhousehotel.co.uk",
        "DistanceUnit": 0
    },
    "Connections": [
        {
            "ID": 14637,
            "ConnectionTypeID": 25,
            "StatusTypeID": 50,
            "LevelID": 2,
            "Amps": 32,
            "Voltage": 230,
            "PowerKW": 7,
            "CurrentTypeID": 20,
            "Quantity": 1
        }
    ],
    "NumberOfPoints": 1,
    "StatusTypeID": 50,
    "DateLastStatusUpdate": "2019-05-09T09:33:00Z",
    "DataQualityLevel": 1,
    "DateCreated": "2013-03-12T14:34:00Z",
    "SubmissionStatusTypeID": 200
}