{
    "IsRecentlyVerified": false,
    "ID": 187460,
    "UUID": "C567EC01-091B-4046-833E-A4613DA1F46C",
    "DataProviderID": 18,
    "DataProvidersReference": "643e5e5ce6f4195ae62aadef5c1a811c",
    "OperatorID": 2244,
    "UsageTypeID": 5,
    "AddressInfo": {
        "ID": 187819,
        "Title": "38 Southdean Gardens",
        "AddressLine1": "38 Southdean Gardens",
        "Town": "London",
        "Postcode": "SW19 6NU",
        "CountryID": 1,
        "Latitude": -0.207797,
        "Longitude": 51.441536,
        "AccessComments": "",
        "RelatedURL": "https://www.ubitricity.com",
        "DistanceUnit": 0
    },
    "Connections": [
        {
            "ID": 302594,
            "ConnectionTypeID": 25,
            "Reference": "suby1100005192",
            "StatusTypeID": 50,
            "LevelID": 2,
            "Amps": 16,
            "Voltage": 230,
            "PowerKW": 3.7,
            "CurrentTypeID": 10
        }
    ],
    "StatusTypeID": 0,
    "DateLastStatusUpdate": "2021-07-12T03:38:00Z",
    "MetadataValues": [
        {
            "ID": 19700,
            "MetadataFieldID": 4,
            "ItemValue": "Contains public sector information licensed under the Open Government Licence v2.0. http://www.nationalarchives.gov.uk/doc/open-government-licence/version/2/"
        }
    ],
    "DataQualityLevel": 3,
    "DateCreated": "2021-07-12T03:38:00Z",
    "SubmissionStatusTypeID": 100
}