{
    "IsRecentlyVerified": false,
    "ID": 140888,
    "UUID": "A63CCCCF-CE4D-447F-AB3D-EC225E143087",
    "DataProviderID": 2,
    "DataProvidersReference": "97078",
    "OperatorID": 5,
    "UsageTypeID": 1,
    "AddressInfo": {
        "ID": 141240,
        "Title": "HACIENDA",
        "AddressLine1": "5120 Hacienda Dr",
        "Town": "Dublin",
        "StateOrProvince": "CA",
        "Postcode": "94568",
        "CountryID": 2,
        "Latitude": 37.709584,
        "Longitude": -121.8887061,
        "ContactTelephone1": "888-758-4389",
        "AccessComments": "24 hours daily",
        "RelatedURL": "http://www.chargepoint.com/",
        "DistanceUnit": 0
    },
    "Connections": [
        {
            "ID": 196654,
            "ConnectionTypeID": 1,
            "LevelID": 2,
            "Amps": 16,
            "Voltage": 230,
            "PowerKW": 3,
            "CurrentTypeID": 10,
            "Quantity": 2
        }
    ],
    "StatusTypeID": 50,
    "DateLastStatusUpdate": "2019-12-24T09:14:00Z",
    "DataQualityLevel": 3,
    "DateCreated": "2019-12-24T09:14:00Z",
    "SubmissionStatusTypeID": 100
}