{
    "IsRecentlyVerified": false,
    "ID": 70729,
    "UUID": "5D718979-2B3C-48BB-BA86-75988406C993",
    "DataProviderID": 1,
    "OperatorID": 156,
    "UsageTypeID": 4,
    "AddressInfo": {
        "ID": 71075,
        "Title": "Media Saturn Holding",
        "AddressLine1": "Wankelstraße 5",
        "Town": "Ingolstadt",
        "StateOrProvince": "Ingolstadt",
        "Postcode": "85053",
        "CountryID": 87,
        "Latitude": 48.74722829762142,
        "Longitude": 11.472354576721159,
        "AccessComments": "Links neben dem Haupteingang des Media-Saturn Bürokomplexes ist die graue Allego Ladesäule. Nutzbar mit The New Motion Ladekarte oder von Roamingpartnern.",
        "DistanceUnit": 0
    },
    "Connections": [
        {
            "ID": 101316,
            "ConnectionTypeID": 2,
            "StatusTypeID": 50,
            "LevelID": 3,
            "PowerKW": 50,
            "CurrentTypeID": 30,
            "Quantity": 1
        },
        {
            "ID": 101317,
            "ConnectionTypeID": 33,
            "StatusTypeID": 50,
            "LevelID": 3,
            "PowerKW": 50,
            "CurrentTypeID": 30,
            "Quantity": 1
        },
        {
            "ID": 101318,
            "ConnectionTypeID": 1036,
            "StatusTypeID": 50,
            "LevelID": 3,
            "Amps": 63,
            "Voltage": 400,
            "PowerKW": 43,
            "CurrentTypeID": 20,
            "Quantity": 1
        }
    ],
    "NumberOfPoints": 2,
    "StatusTypeID": 50,
    "DateLastStatusUpdate": "2016-08-08T06:31:00Z",
    "DataQualityLevel": 1,
    "DateCreated": "2016-08-08T06:31:00Z",
    "SubmissionStatusTypeID": 200
}