{
    "IsRecentlyVerified": false,
    "ID": 162600,
    "UUID": "13E4009B-CEA0-4987-8370-A25E28ECAF6B",
    "DataProviderID": 1,
    "OperatorID": 21,
    "UsageTypeID": 4,
    "UsageCost": "Mobi.E compatible card",
    "AddressInfo": {
        "ID": 162957,
        "Title": "MFR-00011",
        "AddressLine1": "",
        "Town": "Ericeira",
        "StateOrProvince": "Lisboa",
        "Postcode": "2655-246 Ericeira",
        "CountryID": 180,
        "Latitude": 38.97036907061104,
        "Longitude": -9.419673696744894,
        "DistanceUnit": 0
    },
    "Connections": [
        {
            "ID": 234030,
            "ConnectionTypeID": 2,
            "StatusTypeID": 50,
            "LevelID": 3,
            "Amps": 120,
            "Voltage": 500,
            "PowerKW": 50,
            "CurrentTypeID": 30,
            "Quantity": 1
        },
        {
            "ID": 234031,
            "ConnectionTypeID": 33,
            "StatusTypeID": 50,
            "LevelID": 3,
            "Amps": 125,
            "Voltage": 500,
            "PowerKW": 50,
            "CurrentTypeID": 30,
            "Quantity": 1
        }
    ],
    "NumberOfPoints": 2,
    "StatusTypeID": 50,
    "DateLastStatusUpdate": "2020-08-12T11:04:00Z",
    "DataQualityLevel": 1,
    "DateCreated": "2020-08-12T11:04:00Z",
    "SubmissionStatusTypeID": 200
}