{
    "IsRecentlyVerified": false,
    "ID": 137218,
    "UUID": "756DB7C6-230A-46E1-952A-FE59657A13D3",
    "DataProviderID": 2,
    "DataProvidersReference": "145469",
    "OperatorID": 5,
    "UsageTypeID": 1,
    "AddressInfo": {
        "ID": 137564,
        "Title": "OBE POWER",
        "AddressLine1": "1497 NW 7th Street",
        "Town": "Miami",
        "StateOrProvince": "FL",
        "Postcode": "33125",
        "CountryID": 2,
        "Latitude": 25.779364,
        "Longitude": -80.21994,
        "ContactTelephone1": "888-758-4389",
        "AccessComments": "24 hours daily",
        "RelatedURL": "http://www.chargepoint.com/",
        "DistanceUnit": 0
    },
    "Connections": [
        {
            "ID": 192085,
            "ConnectionTypeID": 1,
            "LevelID": 2,
            "Amps": 16,
            "Voltage": 230,
            "PowerKW": 3,
            "CurrentTypeID": 10,
            "Quantity": 2
        }
    ],
    "StatusTypeID": 50,
    "DateLastStatusUpdate": "2019-12-24T09:04:00Z",
    "DataQualityLevel": 3,
    "DateCreated": "2019-12-24T09:04:00Z",
    "SubmissionStatusTypeID": 100
}