{
    "UserComments": [
        {
            "ID": 19725,
            "ChargePointID": 85795,
            "CommentTypeID": 10,
            "UserName": "Steveve ",
            "Comment": "NB you need speak with the Facilities or Site Security staff and fill in a registration/ disclaimer form to get permission to use it",
            "Rating": 4,
            "DateCreated": "2018-06-25T15:53:50.027Z",
            "User": {
                "ID": 16929,
                "Username": "Steveve "
            },
            "CheckinStatusTypeID": 10
        },
        {
            "ID": 19722,
            "ChargePointID": 85795,
            "CommentTypeID": 10,
            "UserName": "Steveve ",
            "Comment": "The spots are a little tight to get into because of 3 big metal boxes (ship containers) positioned in front and to the one side of the parking spots. Leaving only one side to gain access. And that was blocked with a kitchen supplies delivery first thing in the morning. ",
            "Rating": 4,
            "DateCreated": "2018-06-25T12:44:16.37Z",
            "User": {
                "ID": 16929,
                "Username": "Steveve "
            },
            "CheckinStatusTypeID": 10
        }
    ],
    "IsRecentlyVerified": false,
    "ID": 85795,
    "UUID": "897087F8-9DA2-4664-A559-89E62B173335",
    "DataProviderID": 1,
    "OperatorID": 3,
    "OperatorsReference": "PG-80862",
    "UsageTypeID": 6,
    "UsageCost": "Free",
    "AddressInfo": {
        "ID": 86141,
        "Title": "Dell UK-Berkshire",
        "AddressLine1": "Dell House",
        "Town": "Bracknell",
        "StateOrProvince": "Berkshire",
        "Postcode": "RG12 1LF",
        "CountryID": 1,
        "Latitude": 51.413069,
        "Longitude": -0.779322,
        "DistanceUnit": 0
    },
    "Connections": [
        {
            "ID": 121948,
            "ConnectionTypeID": 25,
            "StatusTypeID": 50,
            "LevelID": 2,
            "Amps": 32,
            "Voltage": 230,
            "PowerKW": 7,
            "CurrentTypeID": 10,
            "Quantity": 2
        }
    ],
    "NumberOfPoints": 2,
    "GeneralComments": "This is an open charge unit installed at the Dell office in Dell House, St Peters Way, Bracknell, Berkshire",
    "StatusTypeID": 50,
    "DateLastStatusUpdate": "2018-06-25T15:54:00Z",
    "DataQualityLevel": 1,
    "DateCreated": "2017-04-15T10:20:00Z",
    "SubmissionStatusTypeID": 200
}