{
    "IsRecentlyVerified": false,
    "ID": 94689,
    "UUID": "0C48F4E1-EED7-4777-99E3-F3DD4F4AA507",
    "DataProviderID": 1,
    "OperatorID": 46,
    "UsageTypeID": 4,
    "AddressInfo": {
        "ID": 95035,
        "Title": "Tartuer Straße",
        "AddressLine1": "Tartuer Straße 17",
        "Town": "Lüneburg",
        "StateOrProvince": "Landkreis Lüneburg",
        "Postcode": "21337",
        "CountryID": 87,
        "Latitude": 53.253597,
        "Longitude": 10.433156000000054,
        "AccessComments": "24/7 nutzbare Werbeladesäule mit großem Touchscreen. Betreiber ist Avacon. Stand 10/2017: Freischaltung kostenlos und mit beliebiger RFID Karte.",
        "DistanceUnit": 0
    },
    "Connections": [
        {
            "ID": 133846,
            "ConnectionTypeID": 25,
            "StatusTypeID": 50,
            "LevelID": 2,
            "Amps": 32,
            "Voltage": 400,
            "PowerKW": 22,
            "CurrentTypeID": 20,
            "Quantity": 2
        }
    ],
    "NumberOfPoints": 2,
    "StatusTypeID": 50,
    "DateLastStatusUpdate": "2017-10-23T05:52:00Z",
    "DataQualityLevel": 1,
    "DateCreated": "2017-10-23T05:52:00Z",
    "SubmissionStatusTypeID": 200
}