{
    "IsRecentlyVerified": false,
    "ID": 145611,
    "UUID": "2C212849-780F-4585-9A8C-A145D4898E49",
    "DataProviderID": 2,
    "DataProvidersReference": "131287",
    "OperatorID": 90,
    "UsageTypeID": 1,
    "AddressInfo": {
        "ID": 145963,
        "Title": "Rimouski Toyota",
        "AddressLine1": "409 Avenue Léonidas S",
        "Town": "Rimouski",
        "StateOrProvince": "QC",
        "Postcode": "G5M 1A1",
        "CountryID": 44,
        "Latitude": 48.453878,
        "Longitude": -68.49929,
        "ContactTelephone1": "877-505-2674",
        "AccessComments": "24 hours daily",
        "RelatedURL": "https://lecircuitelectrique.com/",
        "DistanceUnit": 0
    },
    "Connections": [
        {
            "ID": 202324,
            "ConnectionTypeID": 1,
            "LevelID": 2,
            "Amps": 16,
            "Voltage": 230,
            "PowerKW": 3.7,
            "CurrentTypeID": 10,
            "Quantity": 1
        }
    ],
    "StatusTypeID": 50,
    "DateLastStatusUpdate": "2020-06-26T03:11:00Z",
    "DataQualityLevel": 3,
    "DateCreated": "2019-12-24T09:25:00Z",
    "SubmissionStatusTypeID": 100
}