{
    "IsRecentlyVerified": false,
    "ID": 130735,
    "UUID": "ABA96D2B-314B-4A86-B670-80E0EEE222FA",
    "DataProviderID": 1,
    "OperatorID": 3251,
    "UsageTypeID": 6,
    "AddressInfo": {
        "ID": 131081,
        "Title": "Sallingsundvej",
        "AddressLine1": "Sallingsundvej",
        "AddressLine2": "Nørre Tranders",
        "Town": "Aalborg",
        "StateOrProvince": "Aalborg Kommune",
        "Postcode": "9220",
        "CountryID": 65,
        "Latitude": 57.0254027207697,
        "Longitude": 9.99541674472653,
        "AccessComments": "Most outlets restricted (except one) to TADAA shared car service",
        "DistanceUnit": 0
    },
    "Connections": [
        {
            "ID": 183023,
            "ConnectionTypeID": 25,
            "StatusTypeID": 50,
            "LevelID": 2,
            "Amps": 16,
            "Voltage": 400,
            "PowerKW": 11,
            "CurrentTypeID": 20,
            "Quantity": 1
        }
    ],
    "NumberOfPoints": 1,
    "GeneralComments": "Most outlets restricted (except one) to TADAA shared car service",
    "StatusTypeID": 50,
    "DateLastStatusUpdate": "2019-08-11T20:11:00Z",
    "DataQualityLevel": 1,
    "DateCreated": "2019-08-11T19:44:00Z",
    "SubmissionStatusTypeID": 200
}