{
    "IsRecentlyVerified": false,
    "ID": 75241,
    "UUID": "2E9719AC-A3A0-4090-81F2-49893C277F00",
    "DataProviderID": 1,
    "OperatorID": 23,
    "OperatorsReference": "19437",
    "UsageTypeID": 6,
    "UsageCost": "Free",
    "AddressInfo": {
        "ID": 75587,
        "Title": "Tannisby Camping",
        "AddressLine1": "86 Tannisbugtvej",
        "Town": "Bindslev",
        "Postcode": "9881",
        "CountryID": 65,
        "Latitude": 57.590651,
        "Longitude": 10.188783,
        "ContactTelephone1": "+45 98 93 12 50",
        "DistanceUnit": 0
    },
    "Connections": [
        {
            "ID": 108546,
            "ConnectionTypeID": 30,
            "StatusTypeID": 50,
            "LevelID": 2,
            "Amps": 16,
            "Voltage": 400,
            "PowerKW": 11,
            "CurrentTypeID": 20,
            "Quantity": 1
        }
    ],
    "NumberOfPoints": 1,
    "GeneralComments": "1 Tesla Connector, up to 11kW.Available for patrons only. Please see front desk.",
    "StatusTypeID": 50,
    "DateLastStatusUpdate": "2018-10-03T22:24:00Z",
    "DataQualityLevel": 1,
    "DateCreated": "2016-12-14T16:00:00Z",
    "SubmissionStatusTypeID": 200
}