{
    "IsRecentlyVerified": false,
    "ID": 178063,
    "UUID": "420E15F5-1FA3-4963-A3F3-4DB9B227DB2C",
    "DataProviderID": 29,
    "DataProvidersReference": "7298",
    "AddressInfo": {
        "ID": 178422,
        "Title": "Erzberger Str. 3-5",
        "AddressLine1": "Erzberger Str. 3-5",
        "Town": "Lamperheim-Hofheim",
        "Postcode": "68623",
        "CountryID": 87,
        "Latitude": 49.65541,
        "Longitude": 8.41944,
        "DistanceUnit": 0
    },
    "Connections": [
        {
            "ID": 277997,
            "ConnectionTypeID": 25,
            "StatusTypeID": 50,
            "LevelID": 2,
            "PowerKW": 22,
            "CurrentTypeID": 20
        },
        {
            "ID": 277998,
            "ConnectionTypeID": 25,
            "StatusTypeID": 50,
            "LevelID": 2,
            "PowerKW": 22,
            "CurrentTypeID": 20
        }
    ],
    "StatusTypeID": 0,
    "DateLastStatusUpdate": "2021-07-12T02:43:00Z",
    "MetadataValues": [
        {
            "ID": 10357,
            "MetadataFieldID": 4,
            "ItemValue": "Data from the German chargepoint registry provided by Bundesnetzagentur.de under the CC-BY 4.0 license"
        }
    ],
    "DataQualityLevel": 3,
    "DateCreated": "2021-07-08T09:49:00Z",
    "SubmissionStatusTypeID": 100
}