{
    "IsRecentlyVerified": false,
    "ID": 64936,
    "UUID": "B2EC3649-19AD-4EE3-8187-D774D0BF5A58",
    "DataProviderID": 1,
    "OperatorID": 1,
    "UsageTypeID": 1,
    "AddressInfo": {
        "ID": 65282,
        "Title": "E-Mobil Saar Ladepunkt",
        "AddressLine1": "Poststraße 20",
        "Town": "Illingen",
        "StateOrProvince": "Landkreis Neunkirchen",
        "Postcode": "66557",
        "CountryID": 87,
        "Latitude": 49.37529749862872,
        "Longitude": 7.0495521781686055,
        "AccessComments": "2 kostenlose reservierte durchgehend verfügbare Parkplätze vor der Ladesäule. Betreiber ist e-mobil Saar; Zugang mit EC oder Kreditkarte (kostenlos, keine Abrechnung).",
        "RelatedURL": "http://www.saarland.de/dokumente/thema_elektromobilitaet/e-Mobil_Saar-Zugang_Ladesaeulen.pdf",
        "DistanceUnit": 0
    },
    "Connections": [
        {
            "ID": 83574,
            "ConnectionTypeID": 25,
            "StatusTypeID": 50,
            "LevelID": 2,
            "Amps": 16,
            "Voltage": 400,
            "PowerKW": 11,
            "CurrentTypeID": 20,
            "Quantity": 2
        },
        {
            "ID": 83575,
            "ConnectionTypeID": 28,
            "StatusTypeID": 50,
            "LevelID": 2,
            "Amps": 16,
            "Voltage": 230,
            "PowerKW": 3.7,
            "CurrentTypeID": 10,
            "Quantity": 2
        }
    ],
    "NumberOfPoints": 2,
    "StatusTypeID": 50,
    "DateLastStatusUpdate": "2016-04-01T06:59:00Z",
    "DataQualityLevel": 1,
    "DateCreated": "2016-04-01T06:59:00Z",
    "SubmissionStatusTypeID": 200
}