{
    "IsRecentlyVerified": false,
    "ID": 144349,
    "UUID": "F31F6E0A-631B-42FC-B5EB-D57EEC10F11A",
    "DataProviderID": 2,
    "DataProvidersReference": "144961",
    "OperatorID": 9,
    "UsageTypeID": 1,
    "AddressInfo": {
        "ID": 144701,
        "Title": "McDonald's on Cedar Hills Blvd #2160",
        "AddressLine1": "3519 SW Cedar Hills Boulevard",
        "Town": "Beaverton",
        "StateOrProvince": "OR",
        "Postcode": "97005",
        "CountryID": 2,
        "Latitude": 45.493975,
        "Longitude": -122.810759,
        "ContactTelephone1": "888-998-2546",
        "AccessComments": "MON: 24 hours | TUE: 24 hours | WED: 24 hours | THU: 24 hours | FRI: 24 hours | SAT: 24 hours | SUN: 24 hours",
        "RelatedURL": "http://www.blinkcharging.com/",
        "DistanceUnit": 0
    },
    "Connections": [
        {
            "ID": 200846,
            "ConnectionTypeID": 1,
            "LevelID": 2,
            "Amps": 16,
            "Voltage": 230,
            "PowerKW": 3.7,
            "CurrentTypeID": 10,
            "Quantity": 2
        }
    ],
    "StatusTypeID": 50,
    "DateLastStatusUpdate": "2020-06-26T03:09:00Z",
    "DataQualityLevel": 3,
    "DateCreated": "2019-12-24T09:23:00Z",
    "SubmissionStatusTypeID": 100
}