{
    "IsRecentlyVerified": false,
    "ID": 39079,
    "UUID": "0E154317-8B70-4E08-A623-678060095196",
    "DataProviderID": 26,
    "DataProvidersReference": "29891",
    "OperatorsReference": "Makro Groningen",
    "UsageCost": "0.00 gratis",
    "AddressInfo": {
        "ID": 39425,
        "Title": "Verlengde Bremenweg",
        "AddressLine1": "Verlengde Bremenweg",
        "Town": "Groningen",
        "Postcode": "9723 JV",
        "CountryID": 159,
        "Latitude": 53.212187740587,
        "Longitude": 6.6157111153007,
        "RelatedURL": "http://www.makro.nl/public/groningen",
        "DistanceUnit": 0
    },
    "Connections": [
        {
            "ID": 42590,
            "ConnectionTypeID": 25,
            "LevelID": 2,
            "PowerKW": 11,
            "CurrentTypeID": 10
        }
    ],
    "NumberOfPoints": 1,
    "StatusTypeID": 50,
    "DateLastStatusUpdate": "2016-06-04T02:56:00Z",
    "DataQualityLevel": 3,
    "DateCreated": "2015-01-09T06:08:00Z",
    "SubmissionStatusTypeID": 100
}