{
    "IsRecentlyVerified": false,
    "ID": 17149,
    "UUID": "C3FF0377-714D-4C21-B412-C5D18CEF9818",
    "DataProviderID": 22,
    "DataProvidersReference": "228A37C4A96D1CDC1659B9E2BF4B0000",
    "AddressInfo": {
        "ID": 17494,
        "Title": "日産プリンス神奈川販売小田原店",
        "AddressLine1": "神奈川県小田原市扇町5-16-10",
        "CountryID": 114,
        "Latitude": 35.27293775,
        "Longitude": 139.1611346,
        "ContactTelephone1": "0465-34-1323",
        "DistanceUnit": 0
    },
    "Connections": [
        {
            "ID": 17390,
            "ConnectionTypeID": 2,
            "LevelID": 2,
            "Amps": 100,
            "Voltage": 480,
            "PowerKW": 48,
            "Quantity": 1
        }
    ],
    "DateLastStatusUpdate": "2013-06-29T08:54:00Z",
    "DataQualityLevel": 2,
    "DateCreated": "2013-06-29T08:54:00Z",
    "SubmissionStatusTypeID": 200
}