{
    "MediaItems": [
        {
            "ID": 29485,
            "ChargePointID": 146723,
            "ItemURL": "https://s3-ap-southeast-2.amazonaws.com/openchargemap/images/ES/OCM146723/OCM-146723.orig.2021101011360737.jpg",
            "ItemThumbnailURL": "https://s3-ap-southeast-2.amazonaws.com/openchargemap/images/ES/OCM146723/OCM-146723.thmb.2021101011360737.jpg",
            "Comment": "",
            "IsEnabled": true,
            "IsVideo": false,
            "IsFeaturedItem": false,
            "IsExternalResource": false,
            "User": {
                "ID": 19254,
                "Username": "RamonB"
            },
            "DateCreated": "2021-10-10T11:36:00Z"
        }
    ],
    "IsRecentlyVerified": false,
    "ID": 146723,
    "UUID": "6B66673A-AD0E-4683-AC9A-DCFA5D035D55",
    "DataProviderID": 1,
    "OperatorID": 1,
    "UsageTypeID": 1,
    "UsageCost": "0",
    "AddressInfo": {
        "ID": 147075,
        "Title": "Avinguda de les Comarques Catalanes",
        "AddressLine1": "Avinguda de les Comarques Catalanes",
        "Town": "Mora d'Ebre",
        "StateOrProvince": "Tarragona",
        "Postcode": "43740",
        "CountryID": 210,
        "Latitude": 41.08969489734508,
        "Longitude": 0.6433830715222939,
        "DistanceUnit": 0
    },
    "Connections": [
        {
            "ID": 204034,
            "ConnectionTypeID": 33,
            "StatusTypeID": 50,
            "LevelID": 3,
            "PowerKW": 50,
            "CurrentTypeID": 30,
            "Quantity": 1
        },
        {
            "ID": 204035,
            "ConnectionTypeID": 2,
            "StatusTypeID": 50,
            "LevelID": 3,
            "PowerKW": 50,
            "CurrentTypeID": 30,
            "Quantity": 1
        },
        {
            "ID": 204036,
            "ConnectionTypeID": 1036,
            "StatusTypeID": 50,
            "LevelID": 3,
            "Amps": 63,
            "Voltage": 400,
            "PowerKW": 43,
            "CurrentTypeID": 20,
            "Quantity": 1
        }
    ],
    "NumberOfPoints": 1,
    "GeneralComments": "App. EVCharge",
    "StatusTypeID": 50,
    "DateLastStatusUpdate": "2021-10-10T11:36:00Z",
    "DataQualityLevel": 1,
    "DateCreated": "2020-01-14T21:05:00Z",
    "SubmissionStatusTypeID": 200
}