{
    "IsRecentlyVerified": false,
    "ID": 24162,
    "UUID": "60AB7687-3EDD-4631-A29E-466AC38A2845",
    "DataProviderID": 1,
    "OperatorID": 1,
    "UsageTypeID": 0,
    "AddressInfo": {
        "ID": 24507,
        "Title": "Van Limburg Stirumstraat",
        "AddressLine1": "Van Limburg Stirumstraat 1",
        "AddressLine2": "Den Haag",
        "Town": "Den Haag",
        "StateOrProvince": "Stadsgewest Haaglanden",
        "Postcode": "2515PA",
        "CountryID": 159,
        "Latitude": 52.0720213,
        "Longitude": 4.319543299999964,
        "DistanceUnit": 0
    },
    "Connections": [],
    "NumberOfPoints": 1,
    "StatusTypeID": 50,
    "DateLastStatusUpdate": "2014-07-09T14:51:00Z",
    "DataQualityLevel": 1,
    "DateCreated": "2014-07-09T14:51:00Z",
    "SubmissionStatusTypeID": 200
}