{
    "IsRecentlyVerified": false,
    "ID": 42198,
    "UUID": "178E3859-6FD6-4299-9B13-BA3C7DA6CA45",
    "DataProviderID": 1,
    "OperatorID": 45,
    "UsageTypeID": 3,
    "AddressInfo": {
        "ID": 42544,
        "Title": "Optikpark Rathenow",
        "AddressLine1": "Schwedendamm 1",
        "AddressLine2": "Rathenow West",
        "Town": "Rathenow",
        "StateOrProvince": "Landkreis Havelland",
        "Postcode": "14712",
        "CountryID": 87,
        "Latitude": 52.6085848019515,
        "Longitude": 12.32720892973,
        "ContactTelephone1": "03385 49850",
        "AccessComments": "Einfahrt am Haupteingang, kostenloses Laden und Parken im hinteren Teil des Mühlenhofes während der Öffnungszeiten täglich 8-19Uhr. Schlüssel für Ladesäule am Besucherzentrum ausleihen, sonst im Cafe Speicher. Stromverteilerbox in der hinteren linken Ecke des Mühlenhofs. ",
        "RelatedURL": "http://www.optikpark-rathenow.de/",
        "DistanceUnit": 0
    },
    "Connections": [
        {
            "ID": 50701,
            "ConnectionTypeID": 25,
            "StatusTypeID": 50,
            "LevelID": 2,
            "Amps": 16,
            "Voltage": 400,
            "PowerKW": 11,
            "CurrentTypeID": 20,
            "Quantity": 1
        }
    ],
    "NumberOfPoints": 2,
    "StatusTypeID": 50,
    "DateLastStatusUpdate": "2015-09-27T09:34:00Z",
    "DataQualityLevel": 1,
    "DateCreated": "2015-02-26T09:15:00Z",
    "SubmissionStatusTypeID": 200
}