{
    "IsRecentlyVerified": false,
    "ID": 110676,
    "UUID": "EB0ABDE6-E669-4C05-BFFD-E1A12DD79553",
    "DataProviderID": 2,
    "DataProvidersReference": "83767",
    "UsageTypeID": 1,
    "AddressInfo": {
        "ID": 111022,
        "Title": "Comfort Inn & Suites",
        "AddressLine1": "2330 Huron Church Rd",
        "Town": "Windsor",
        "StateOrProvince": "ON",
        "Postcode": "N9E 3S6",
        "CountryID": 44,
        "Latitude": 42.273169,
        "Longitude": -83.047966,
        "ContactTelephone1": "519-972-1100",
        "AccessComments": "24 hours daily",
        "RelatedURL": "",
        "DistanceUnit": 0
    },
    "Connections": [
        {
            "ID": 155952,
            "ConnectionTypeID": 1,
            "LevelID": 2,
            "Amps": 16,
            "Voltage": 230,
            "PowerKW": 3.7,
            "CurrentTypeID": 10,
            "Quantity": 1
        }
    ],
    "DateLastStatusUpdate": "2020-06-26T03:05:00Z",
    "DataQualityLevel": 3,
    "DateCreated": "2018-10-18T23:36:00Z",
    "SubmissionStatusTypeID": 100
}