{
    "IsRecentlyVerified": false,
    "ID": 64995,
    "UUID": "B0EF93D0-AC3A-4788-9583-7FD30EEECA19",
    "DataProviderID": 1,
    "OperatorID": 80,
    "UsageTypeID": 4,
    "UsageCost": "0,40 €/kW",
    "AddressInfo": {
        "ID": 65341,
        "Title": "Eneldrive Aeroporto di Alghero Fertilia",
        "AddressLine1": "SP44",
        "AddressLine2": "Fertilia",
        "Town": "Alghero",
        "StateOrProvince": "SS",
        "Postcode": "07041",
        "CountryID": 112,
        "Latitude": 40.6307187951877,
        "Longitude": 8.29748585849983,
        "RelatedURL": "http://eneldrive.it",
        "DistanceUnit": 0
    },
    "Connections": [
        {
            "ID": 83649,
            "ConnectionTypeID": 25,
            "StatusTypeID": 50,
            "LevelID": 2,
            "Amps": 32,
            "Voltage": 400,
            "PowerKW": 22,
            "CurrentTypeID": 20,
            "Quantity": 1
        },
        {
            "ID": 83650,
            "ConnectionTypeID": 36,
            "StatusTypeID": 50,
            "LevelID": 2,
            "Amps": 16,
            "Voltage": 240,
            "PowerKW": 3,
            "CurrentTypeID": 10,
            "Quantity": 1
        }
    ],
    "NumberOfPoints": 2,
    "StatusTypeID": 50,
    "DateLastStatusUpdate": "2016-04-04T08:04:00Z",
    "DataQualityLevel": 1,
    "DateCreated": "2016-04-04T08:03:00Z",
    "SubmissionStatusTypeID": 200
}