{
    "IsRecentlyVerified": false,
    "ID": 167644,
    "UUID": "A909D491-EF6C-4DA5-88B6-D332E39B41A6",
    "DataProviderID": 1,
    "OperatorID": 44,
    "UsageTypeID": 3,
    "UsageCost": "Free",
    "AddressInfo": {
        "ID": 168003,
        "Title": "Ladepunkt Hofburgweg",
        "AddressLine1": "Hofburgweg",
        "Town": "Söchau",
        "StateOrProvince": "Styria",
        "Postcode": "8362",
        "CountryID": 19,
        "Latitude": 47.01174372097998,
        "Longitude": 16.008469783329247,
        "ContactTelephone1": "+43 6641680201",
        "AccessComments": "Bitte vorher telefonisch anmelden. Primär Ladestation für Renault Twizy. Wenn jemand zuhause ist gibt es Kaffee, wenn nicht, dann nicht. Die Pferde daneben bitte nur angucken und nicht füttern! Sollte reifes Obst an den Bäumen hängen darf dieses verkostet werden.",
        "RelatedURL": "http://www.heisti.at/",
        "DistanceUnit": 0
    },
    "Connections": [
        {
            "ID": 254566,
            "ConnectionTypeID": 28,
            "StatusTypeID": 50,
            "LevelID": 2,
            "Amps": 16,
            "Voltage": 230,
            "PowerKW": 3.7,
            "CurrentTypeID": 10,
            "Quantity": 1
        }
    ],
    "NumberOfPoints": 1,
    "StatusTypeID": 50,
    "DateLastStatusUpdate": "2020-09-08T07:08:00Z",
    "DataQualityLevel": 1,
    "DateCreated": "2020-09-08T07:06:00Z",
    "SubmissionStatusTypeID": 200
}