{
    "IsRecentlyVerified": false,
    "ID": 129211,
    "UUID": "10210DDD-F0F9-46B7-A596-EFCF09F6964F",
    "DataProviderID": 1,
    "OperatorID": 23,
    "OperatorsReference": "43086",
    "UsageTypeID": 7,
    "AddressInfo": {
        "ID": 129557,
        "Title": "Trevase Granary",
        "AddressLine1": "St. Owens Cross",
        "Town": "Hereford",
        "Postcode": "HR2 8ND",
        "CountryID": 1,
        "Latitude": 51.92598,
        "Longitude": -2.711679,
        "ContactTelephone1": "+44 198 973 0210",
        "DistanceUnit": 0
    },
    "Connections": [
        {
            "ID": 180859,
            "ConnectionTypeID": 30,
            "StatusTypeID": 50,
            "LevelID": 2,
            "PowerKW": 13,
            "CurrentTypeID": 20,
            "Quantity": 2
        }
    ],
    "NumberOfPoints": 2,
    "GeneralComments": "2 Tesla Connectors, up to 13kW.Available by reservation only. Please call ahead.",
    "StatusTypeID": 50,
    "DateLastStatusUpdate": "2019-07-15T16:19:00Z",
    "DataQualityLevel": 1,
    "DateCreated": "2019-07-15T16:19:00Z",
    "SubmissionStatusTypeID": 200
}