{
    "IsRecentlyVerified": false,
    "ID": 133528,
    "UUID": "8865E600-925B-4591-A152-C660AF296387",
    "DataProviderID": 1,
    "OperatorID": 80,
    "UsageTypeID": 4,
    "AddressInfo": {
        "ID": 133874,
        "Title": "Municipio di Trino | EnelX",
        "AddressLine1": "parcheggio interno ingresso da Via Vincenzo Gioberti",
        "Town": "Trino",
        "StateOrProvince": "VC",
        "Postcode": "13039",
        "CountryID": 112,
        "Latitude": 45.1937384418997,
        "Longitude": 8.29768006311883,
        "ContactTelephone1": "800.069.850",
        "RelatedURL": "https://www.enelx.com/it/it/emobility",
        "DistanceUnit": 0
    },
    "Connections": [
        {
            "ID": 186912,
            "ConnectionTypeID": 25,
            "StatusTypeID": 50,
            "LevelID": 2,
            "Amps": 32,
            "Voltage": 400,
            "PowerKW": 22,
            "CurrentTypeID": 20,
            "Quantity": 2
        }
    ],
    "NumberOfPoints": 2,
    "StatusTypeID": 50,
    "DateLastStatusUpdate": "2019-10-20T14:44:00Z",
    "DataQualityLevel": 1,
    "DateCreated": "2019-10-20T14:44:00Z",
    "SubmissionStatusTypeID": 200
}