{
    "IsRecentlyVerified": false,
    "ID": 126983,
    "UUID": "3B505C4A-94F7-4C18-BF3B-6157B9F0BBC9",
    "DataProviderID": 1,
    "OperatorID": 80,
    "UsageTypeID": 4,
    "AddressInfo": {
        "ID": 127329,
        "Title": "Iper Lando Veggiano | EnelX",
        "AddressLine1": "Via Pedagni, 50",
        "Town": "Veggiano",
        "StateOrProvince": "PD",
        "Postcode": "35030",
        "CountryID": 112,
        "Latitude": 45.44597938357077,
        "Longitude": 11.734780796518862,
        "ContactTelephone1": "800.069.850",
        "RelatedURL": "https://www.enelx.com/it/it/emobility",
        "DistanceUnit": 0
    },
    "Connections": [
        {
            "ID": 177835,
            "ConnectionTypeID": 25,
            "StatusTypeID": 50,
            "LevelID": 2,
            "Amps": 32,
            "Voltage": 400,
            "PowerKW": 22,
            "CurrentTypeID": 20,
            "Quantity": 4
        },
        {
            "ID": 177836,
            "ConnectionTypeID": 36,
            "StatusTypeID": 50,
            "LevelID": 2,
            "Amps": 16,
            "Voltage": 240,
            "PowerKW": 3.7,
            "CurrentTypeID": 10,
            "Quantity": 4
        }
    ],
    "NumberOfPoints": 8,
    "StatusTypeID": 50,
    "DateLastStatusUpdate": "2019-05-24T15:28:00Z",
    "DataQualityLevel": 1,
    "DateCreated": "2019-05-24T15:28:00Z",
    "SubmissionStatusTypeID": 200
}