{
    "IsRecentlyVerified": false,
    "ID": 77603,
    "UUID": "27180DF5-99BD-4768-87F1-8392807584A4",
    "DataProviderID": 1,
    "OperatorID": 3266,
    "UsageTypeID": 4,
    "AddressInfo": {
        "ID": 77949,
        "Title": "Parkplatz",
        "AddressLine1": "Hintere Straße 13",
        "AddressLine2": "Uhlensen",
        "Town": "Kreis Lippe",
        "StateOrProvince": "Kreis Lippe",
        "Postcode": "32676",
        "CountryID": 87,
        "Latitude": 51.9585450160932,
        "Longitude": 9.24506060249883,
        "AccessComments": "24/7 nutzbar mit PlugSurfing Keyhanger oder App.",
        "RelatedURL": "http://www.dewezet.de/region/weserbergland/luegde_artikel,-endlich-etankstelle-in-luegde-_arid,2342426.html",
        "DistanceUnit": 0
    },
    "Connections": [
        {
            "ID": 112114,
            "ConnectionTypeID": 25,
            "StatusTypeID": 50,
            "LevelID": 2,
            "Amps": 32,
            "Voltage": 400,
            "PowerKW": 22,
            "CurrentTypeID": 20,
            "Quantity": 2
        }
    ],
    "NumberOfPoints": 2,
    "StatusTypeID": 50,
    "DateLastStatusUpdate": "2017-01-30T07:22:00Z",
    "DataQualityLevel": 1,
    "DateCreated": "2017-01-20T06:27:00Z",
    "SubmissionStatusTypeID": 200
}