{
    "IsRecentlyVerified": false,
    "ID": 104030,
    "UUID": "0BDCB3D1-7793-40D4-AA1E-EA2CE8827D7F",
    "DataProviderID": 1,
    "OperatorID": 105,
    "UsageTypeID": 4,
    "AddressInfo": {
        "ID": 104376,
        "Title": "Winnender Straße",
        "AddressLine1": "Winnender Straße 42",
        "Town": "Korb",
        "StateOrProvince": "Rems-Murr-Kreis",
        "Postcode": "71404",
        "CountryID": 87,
        "Latitude": 48.84439813754218,
        "Longitude": 9.358543566746107,
        "AccessComments": "24/7 nutzbare weißgründe Ladesäule vom RWE Typ.",
        "DistanceUnit": 0
    },
    "Connections": [
        {
            "ID": 146839,
            "ConnectionTypeID": 25,
            "StatusTypeID": 50,
            "LevelID": 2,
            "Amps": 32,
            "Voltage": 400,
            "PowerKW": 22,
            "CurrentTypeID": 20,
            "Quantity": 2
        }
    ],
    "NumberOfPoints": 2,
    "StatusTypeID": 50,
    "DateLastStatusUpdate": "2018-05-15T06:07:00Z",
    "DataQualityLevel": 1,
    "DateCreated": "2018-05-15T06:07:00Z",
    "SubmissionStatusTypeID": 200
}