{
    "IsRecentlyVerified": false,
    "ID": 9147,
    "UUID": "BC4E3154-F419-4ED2-8AA7-C923DBAE9F98",
    "DataProviderID": 15,
    "DataProvidersReference": "13506",
    "OperatorID": 5,
    "AddressInfo": {
        "ID": 9044,
        "Title": "700 N Adams St",
        "AddressLine1": "700 N Adams St",
        "Town": "Green Bay",
        "StateOrProvince": "Wisconsin",
        "Postcode": "54301",
        "CountryID": 2,
        "Latitude": 44.51890945,
        "Longitude": -88.01081085,
        "ContactTelephone1": "",
        "RelatedURL": "http://carstations.com/13506",
        "DistanceUnit": 0
    },
    "Connections": [
        {
            "ID": 6828,
            "ConnectionTypeID": 1,
            "Reference": "J1772",
            "LevelID": 2
        },
        {
            "ID": 7042,
            "ConnectionTypeID": 9,
            "Reference": "NEMA5",
            "LevelID": 1,
            "Quantity": 1
        }
    ],
    "StatusTypeID": 0,
    "DateLastStatusUpdate": "2017-11-04T14:05:00Z",
    "DataQualityLevel": 2,
    "DateCreated": "2012-01-23T15:11:00Z",
    "SubmissionStatusTypeID": 100
}