{
    "IsRecentlyVerified": false,
    "ID": 186780,
    "UUID": "F7E62FA9-5836-462C-BD58-320BC4F6F9C2",
    "DataProviderID": 29,
    "DataProvidersReference": "6450",
    "AddressInfo": {
        "ID": 187139,
        "Title": "Wiegbold 2",
        "AddressLine1": "Wiegbold 2",
        "Town": "Ahaus",
        "Postcode": "48683",
        "CountryID": 87,
        "Latitude": 52.074136,
        "Longitude": 6.91786,
        "DistanceUnit": 0
    },
    "Connections": [
        {
            "ID": 300145,
            "ConnectionTypeID": 25,
            "StatusTypeID": 50,
            "LevelID": 2,
            "PowerKW": 22,
            "CurrentTypeID": 20
        },
        {
            "ID": 300146,
            "ConnectionTypeID": 25,
            "StatusTypeID": 50,
            "LevelID": 2,
            "PowerKW": 22,
            "CurrentTypeID": 20
        }
    ],
    "StatusTypeID": 50,
    "DateLastStatusUpdate": "2021-07-12T02:48:00Z",
    "MetadataValues": [
        {
            "ID": 19021,
            "MetadataFieldID": 4,
            "ItemValue": "Data from the German chargepoint registry provided by Bundesnetzagentur.de under the CC-BY 4.0 license"
        }
    ],
    "DataQualityLevel": 3,
    "DateCreated": "2021-07-12T02:48:00Z",
    "SubmissionStatusTypeID": 100
}