{
    "IsRecentlyVerified": false,
    "ID": 3623,
    "UUID": "8AF59FB3-2E69-4EC4-873C-2E7A4C037003",
    "DataProviderID": 1,
    "UsageTypeID": 1,
    "AddressInfo": {
        "ID": 3624,
        "Title": "SCE Service Center ",
        "AddressLine1": "6090 N. Irwindale Ave.",
        "Town": "Irwindale",
        "StateOrProvince": "CA",
        "Postcode": "91702",
        "CountryID": 2,
        "Latitude": 34.122,
        "Longitude": -117.933,
        "DistanceUnit": 0
    },
    "Connections": [
        {
            "ID": 138,
            "ConnectionTypeID": 1,
            "Quantity": 1
        }
    ],
    "NumberOfPoints": 8,
    "DateLastStatusUpdate": "2019-12-15T06:07:00Z",
    "DateCreated": "2010-02-28T00:00:00Z",
    "SubmissionStatusTypeID": 200
}