{
    "IsRecentlyVerified": false,
    "ID": 139890,
    "UUID": "79DC72E5-783E-474E-9929-31FE4FEE79C0",
    "DataProviderID": 2,
    "DataProvidersReference": "69079",
    "OperatorID": 5,
    "UsageTypeID": 1,
    "AddressInfo": {
        "ID": 140242,
        "Title": "STUDIO",
        "AddressLine1": "Muddy Waters Drive",
        "Town": "Universal City",
        "StateOrProvince": "CA",
        "Postcode": "91602",
        "CountryID": 2,
        "Latitude": 34.143037,
        "Longitude": -118.3582825,
        "ContactTelephone1": "888-758-4389",
        "AccessComments": "24 hours daily",
        "RelatedURL": "http://www.chargepoint.com/",
        "DistanceUnit": 0
    },
    "Connections": [
        {
            "ID": 195383,
            "ConnectionTypeID": 1,
            "LevelID": 2,
            "Amps": 16,
            "Voltage": 230,
            "PowerKW": 3,
            "CurrentTypeID": 10,
            "Quantity": 12
        }
    ],
    "StatusTypeID": 50,
    "DateLastStatusUpdate": "2019-12-24T09:11:00Z",
    "DataQualityLevel": 3,
    "DateCreated": "2019-12-24T09:11:00Z",
    "SubmissionStatusTypeID": 100
}