{
    "IsRecentlyVerified": false,
    "ID": 95489,
    "UUID": "6FE93D2F-913A-4E2D-BA4B-9DCF867A8650",
    "DataProviderID": 1,
    "OperatorID": 23,
    "OperatorsReference": "37712",
    "UsageTypeID": 4,
    "AddressInfo": {
        "ID": 95835,
        "Title": "Brownsover Hall Hotel",
        "AddressLine1": "Brownsover Hall Hotel Old Brownsover",
        "Town": "Rugby",
        "StateOrProvince": "Warwickshire",
        "Postcode": "CV21 1HU",
        "CountryID": 1,
        "Latitude": 52.393495,
        "Longitude": -1.25599,
        "ContactTelephone1": "+44 178 854 6100",
        "DistanceUnit": 0
    },
    "Connections": [
        {
            "ID": 135272,
            "ConnectionTypeID": 30,
            "StatusTypeID": 50,
            "LevelID": 2,
            "Amps": 32,
            "Voltage": 400,
            "PowerKW": 22,
            "CurrentTypeID": 20,
            "Quantity": 3
        }
    ],
    "NumberOfPoints": 3,
    "GeneralComments": "3 Tesla Connectors, up to 22kW.Available for customers. Please see front desk.",
    "StatusTypeID": 50,
    "DateLastStatusUpdate": "2018-10-03T19:36:00Z",
    "DataQualityLevel": 1,
    "DateCreated": "2017-11-12T06:51:00Z",
    "SubmissionStatusTypeID": 200
}