{
    "IsRecentlyVerified": false,
    "ID": 73729,
    "UUID": "252ABAC4-6C7F-46F5-A156-0B632E726713",
    "DataProviderID": 1,
    "OperatorID": 89,
    "OperatorsReference": "AAA-217",
    "UsageTypeID": 4,
    "UsageCost": "CAD 1.00/hour",
    "AddressInfo": {
        "ID": 74075,
        "Title": "Pneus Ratté Lévis (Kennedy)",
        "AddressLine1": "159 route du Président-Kennedy",
        "Town": "Lévis",
        "StateOrProvince": "QC",
        "Postcode": "G6V 6E2",
        "CountryID": 44,
        "Latitude": 46.7861841496279,
        "Longitude": -71.1625246650124,
        "DistanceUnit": 0
    },
    "Connections": [
        {
            "ID": 106030,
            "ConnectionTypeID": 1,
            "StatusTypeID": 50,
            "LevelID": 2,
            "Amps": 32,
            "Voltage": 230,
            "PowerKW": 7,
            "CurrentTypeID": 10,
            "Quantity": 1
        }
    ],
    "NumberOfPoints": 1,
    "StatusTypeID": 50,
    "DateLastStatusUpdate": "2016-11-27T20:18:00Z",
    "DataQualityLevel": 1,
    "DateCreated": "2016-11-23T22:52:00Z",
    "SubmissionStatusTypeID": 200
}