{
    "IsRecentlyVerified": false,
    "ID": 182747,
    "UUID": "E9C05FD4-D112-481C-8949-59C89BE451BF",
    "DataProviderID": 29,
    "DataProvidersReference": "18442",
    "AddressInfo": {
        "ID": 183106,
        "Title": "Philipp-Reis-Straße 3",
        "AddressLine1": "Philipp-Reis-Straße 3",
        "Town": "Bevern",
        "Postcode": "37639",
        "CountryID": 87,
        "Latitude": 51.859,
        "Longitude": 9.485,
        "DistanceUnit": 0
    },
    "Connections": [
        {
            "ID": 288870,
            "ConnectionTypeID": 25,
            "StatusTypeID": 50,
            "LevelID": 2,
            "PowerKW": 22,
            "CurrentTypeID": 20
        },
        {
            "ID": 288871,
            "ConnectionTypeID": 25,
            "StatusTypeID": 50,
            "LevelID": 2,
            "PowerKW": 22,
            "CurrentTypeID": 20
        }
    ],
    "StatusTypeID": 50,
    "DateLastStatusUpdate": "2021-07-12T02:48:00Z",
    "MetadataValues": [
        {
            "ID": 15040,
            "MetadataFieldID": 4,
            "ItemValue": "Data from the German chargepoint registry provided by Bundesnetzagentur.de under the CC-BY 4.0 license"
        }
    ],
    "DataQualityLevel": 3,
    "DateCreated": "2021-07-08T10:03:00Z",
    "SubmissionStatusTypeID": 100
}