{
    "IsRecentlyVerified": false,
    "ID": 155148,
    "UUID": "99A4A901-B33D-4CAD-91C4-9FE70A7AB1FD",
    "DataProviderID": 1,
    "OperatorID": 3387,
    "UsageTypeID": 4,
    "UsageCost": "€0,34/kWh",
    "AddressInfo": {
        "ID": 155502,
        "Title": "Onderdreef 1A",
        "AddressLine1": "Onderdreef",
        "Town": "Buren",
        "StateOrProvince": "Gelderland",
        "Postcode": "4116CC",
        "CountryID": 159,
        "Latitude": 51.91202628008102,
        "Longitude": 5.331636984511761,
        "DistanceUnit": 0
    },
    "Connections": [
        {
            "ID": 218388,
            "ConnectionTypeID": 25,
            "StatusTypeID": 50,
            "LevelID": 2,
            "Amps": 32,
            "PowerKW": 22,
            "CurrentTypeID": 20,
            "Quantity": 6
        }
    ],
    "NumberOfPoints": 6,
    "StatusTypeID": 50,
    "DateLastStatusUpdate": "2020-03-29T09:32:00Z",
    "DataQualityLevel": 1,
    "DateCreated": "2020-03-28T22:05:00Z",
    "SubmissionStatusTypeID": 200
}