{
    "IsRecentlyVerified": false,
    "ID": 72433,
    "UUID": "3CEB113F-ADAF-4B44-9F37-8B24F0737341",
    "DataProviderID": 1,
    "OperatorID": 31,
    "UsageTypeID": 7,
    "AddressInfo": {
        "ID": 72779,
        "Title": "Collision Consultants Auto Body and Paint",
        "AddressLine1": "2627 La Cienega Ave",
        "Town": "Los Angeles",
        "StateOrProvince": "CA",
        "Postcode": "90034",
        "CountryID": 2,
        "Latitude": 34.0339922,
        "Longitude": -118.3785251,
        "AccessComments": "Facility works on EV's and will let you charge if you ask.",
        "RelatedURL": "http://www.CollisionBodyShop.com/services/specialty-repairs/hybrid-car-repair-electric-car-repair",
        "DistanceUnit": 0
    },
    "Connections": [
        {
            "ID": 103802,
            "ConnectionTypeID": 1,
            "StatusTypeID": 50,
            "LevelID": 2,
            "Amps": 32,
            "Voltage": 240,
            "PowerKW": 7.7,
            "Quantity": 1
        }
    ],
    "NumberOfPoints": 3,
    "GeneralComments": "Ask the manager, he'll let you charge.",
    "StatusTypeID": 50,
    "DateLastStatusUpdate": "2016-11-06T07:12:00Z",
    "DataQualityLevel": 1,
    "DateCreated": "2016-10-14T16:33:00Z",
    "SubmissionStatusTypeID": 200
}