{
    "IsRecentlyVerified": false,
    "ID": 63735,
    "UUID": "428BF9C5-2012-4122-BF49-E27C3EEE8A3E",
    "DataProviderID": 26,
    "DataProvidersReference": "82801",
    "OperatorID": 73,
    "OperatorsReference": "EV-Box EVB-P1541578",
    "UsageCost": "0.00 jaarabonnement",
    "AddressInfo": {
        "ID": 64081,
        "Title": "Magnesiumweg 4",
        "AddressLine1": "Magnesiumweg 4",
        "Town": "Amersfoort",
        "Postcode": "3812 PW",
        "CountryID": 159,
        "Latitude": 52.19003,
        "Longitude": 5.60842,
        "RelatedURL": "http://www.ev-box.nl",
        "DistanceUnit": 0
    },
    "Connections": [
        {
            "ID": 81403,
            "ConnectionTypeID": 25,
            "LevelID": 2,
            "PowerKW": 11,
            "CurrentTypeID": 10
        }
    ],
    "NumberOfPoints": 1,
    "StatusTypeID": 50,
    "DateLastStatusUpdate": "2016-06-04T02:51:00Z",
    "DataQualityLevel": 3,
    "DateCreated": "2016-03-03T12:31:00Z",
    "SubmissionStatusTypeID": 100
}