{
    "IsRecentlyVerified": false,
    "ID": 124419,
    "UUID": "756E9503-F93C-4771-A114-9FC4243CBFE9",
    "DataProviderID": 2,
    "DataProvidersReference": "25516",
    "UsageTypeID": 1,
    "AddressInfo": {
        "ID": 124765,
        "Title": "Office of Housing & Redevelopment",
        "AddressLine1": "40 Eldridge Ave",
        "Town": "Vacaville",
        "StateOrProvince": "CA",
        "Postcode": "95688",
        "CountryID": 2,
        "Latitude": 38.356907,
        "Longitude": -122.001886,
        "ContactTelephone1": "707-449-5424",
        "AccessComments": "24 hours daily",
        "RelatedURL": "",
        "DistanceUnit": 0
    },
    "Connections": [
        {
            "ID": 174515,
            "ConnectionTypeID": 1,
            "LevelID": 2,
            "Amps": 16,
            "Voltage": 230,
            "PowerKW": 3.7,
            "CurrentTypeID": 10,
            "Quantity": 1
        }
    ],
    "GeneralComments": "1 SP Inductive",
    "DateLastStatusUpdate": "2020-06-26T02:59:00Z",
    "DataQualityLevel": 3,
    "DateCreated": "2019-04-06T05:03:00Z",
    "SubmissionStatusTypeID": 100
}