{
    "IsRecentlyVerified": false,
    "ID": 89787,
    "UUID": "0F8CB863-DD1B-413B-B5E1-169A983309BA",
    "DataProviderID": 2,
    "DataProvidersReference": "51699",
    "UsageTypeID": 1,
    "AddressInfo": {
        "ID": 90133,
        "Title": "Hilltop Collision Center",
        "AddressLine1": "275 Beavercreek Rd",
        "Town": "Oregon City",
        "StateOrProvince": "OR",
        "Postcode": "97045",
        "CountryID": 2,
        "Latitude": 45.333825,
        "Longitude": -122.596795,
        "ContactTelephone1": "503-722-5885",
        "AccessComments": "24 hours daily",
        "RelatedURL": "",
        "DistanceUnit": 0
    },
    "Connections": [
        {
            "ID": 127231,
            "ConnectionTypeID": 9,
            "LevelID": 1,
            "Amps": 16,
            "Voltage": 120,
            "PowerKW": 1.9,
            "CurrentTypeID": 10,
            "Quantity": 1
        },
        {
            "ID": 127232,
            "ConnectionTypeID": 1,
            "LevelID": 2,
            "Amps": 16,
            "Voltage": 230,
            "PowerKW": 3.7,
            "CurrentTypeID": 10,
            "Quantity": 1
        }
    ],
    "DateLastStatusUpdate": "2020-06-26T03:08:00Z",
    "DataQualityLevel": 3,
    "DateCreated": "2017-06-22T08:16:00Z",
    "SubmissionStatusTypeID": 100
}