{
    "IsRecentlyVerified": false,
    "ID": 59061,
    "UUID": "32CB279C-2204-4972-95EF-A6A4BC81D081",
    "DataProviderID": 1,
    "OperatorID": 235,
    "UsageTypeID": 4,
    "UsageCost": "0",
    "AddressInfo": {
        "ID": 59407,
        "Title": "SWD Henkel Parkplatz Tor 1",
        "AddressLine1": "Henkelstraße 67",
        "AddressLine2": "Holthausen",
        "Town": "Düsseldorf",
        "Postcode": "40589",
        "CountryID": 87,
        "Latitude": 51.175407754,
        "Longitude": 6.837769533,
        "ContactTelephone1": "0211/821-8210",
        "ContactTelephone2": "0211/821-4093",
        "ContactEmail": "elektromobilitaet@swd-ag.de",
        "AccessComments": "Direkt am Tor 1 der Henkel AG und auf dem Werksgelände. Sollte der Parkplatz abgeschrankt sein, bitte beim Pförtner melden.",
        "RelatedURL": "http://www.emobil-nrw.de",
        "DistanceUnit": 0
    },
    "Connections": [
        {
            "ID": 74940,
            "ConnectionTypeID": 25,
            "StatusTypeID": 50,
            "LevelID": 2,
            "Amps": 32,
            "Voltage": 400,
            "PowerKW": 22,
            "CurrentTypeID": 20,
            "Quantity": 2
        },
        {
            "ID": 74941,
            "ConnectionTypeID": 28,
            "StatusTypeID": 50,
            "LevelID": 2,
            "Amps": 16,
            "Voltage": 230,
            "PowerKW": 3.7,
            "CurrentTypeID": 10,
            "Quantity": 2
        }
    ],
    "NumberOfPoints": 2,
    "GeneralComments": "Nutzbar mit:\r\nElektronauten-Ladekarte (EnBW)\r\nLadekarte der Stadtwerke Hilden GmbH\r\nLadekarte der Stadtwerke Düsseldorf AG\r\nhttps://www.swd-ag.de/formulare/tankkarte/",
    "StatusTypeID": 50,
    "DateLastStatusUpdate": "2016-01-12T12:55:00Z",
    "DataQualityLevel": 1,
    "DateCreated": "2016-01-06T14:24:00Z",
    "SubmissionStatusTypeID": 200
}