{
    "IsRecentlyVerified": false,
    "ID": 119631,
    "UUID": "84796FD5-482A-4C3E-A0BA-39BEBF5C4B3E",
    "DataProviderID": 2,
    "DataProvidersReference": "75907",
    "OperatorID": 39,
    "UsageTypeID": 4,
    "AddressInfo": {
        "ID": 119977,
        "Title": "Town Center Boca Raton",
        "AddressLine1": "6000 Glades Road",
        "Town": "Boca Raton",
        "StateOrProvince": "FL",
        "Postcode": "33431",
        "CountryID": 2,
        "Latitude": 26.3659037,
        "Longitude": -80.1343444,
        "ContactTelephone1": "800-663-5633",
        "AccessComments": "MO: Not Specified; TU: Not Specified; WE: Not Specified; TH: Not Specified; FR: Not Specified; SA: Not Specified; SU: Not Specified",
        "RelatedURL": "http://www.semacharge.com/",
        "DistanceUnit": 0
    },
    "Connections": [
        {
            "ID": 168910,
            "ConnectionTypeID": 1,
            "LevelID": 2,
            "Amps": 16,
            "Voltage": 230,
            "PowerKW": 3,
            "CurrentTypeID": 10,
            "Quantity": 1
        }
    ],
    "DateLastStatusUpdate": "2019-04-01T04:59:00Z",
    "DataQualityLevel": 3,
    "DateCreated": "2019-04-01T04:59:00Z",
    "SubmissionStatusTypeID": 100
}