{
    "IsRecentlyVerified": false,
    "ID": 161416,
    "UUID": "B3EB6429-75A0-4872-819C-BF63B28BBDAD",
    "DataProviderID": 1,
    "UsageTypeID": 1,
    "AddressInfo": {
        "ID": 161773,
        "Title": "Greenway",
        "AddressLine1": "Szosa Kępińska 81",
        "Town": "Syców",
        "Postcode": "56-500",
        "CountryID": 179,
        "Latitude": 51.30379612622011,
        "Longitude": 17.754888439666843,
        "ContactTelephone1": "+48583251077",
        "ContactTelephone2": "+48583251017",
        "RelatedURL": "https://greenwaypolska.pl/",
        "DistanceUnit": 0
    },
    "Connections": [
        {
            "ID": 232306,
            "ConnectionTypeID": 25,
            "StatusTypeID": 50,
            "LevelID": 2,
            "PowerKW": 22,
            "CurrentTypeID": 20,
            "Quantity": 1
        }
    ],
    "NumberOfPoints": 1,
    "StatusTypeID": 50,
    "DateLastStatusUpdate": "2020-07-12T07:51:00Z",
    "DataQualityLevel": 1,
    "DateCreated": "2020-07-11T06:52:00Z",
    "SubmissionStatusTypeID": 200
}