{
    "IsRecentlyVerified": false,
    "ID": 146609,
    "UUID": "C754AAAA-4048-4DA9-A09A-18C7CBA355F4",
    "DataProviderID": 1,
    "OperatorID": 1,
    "UsageTypeID": 1,
    "UsageCost": "Free",
    "AddressInfo": {
        "ID": 146961,
        "Title": "Service Food Market",
        "AddressLine1": "321 West Lincoln Avenue",
        "Town": "Fergus Falls",
        "StateOrProvince": "Otter Tail County",
        "Postcode": "56537",
        "CountryID": 2,
        "Latitude": 46.29206,
        "Longitude": -96.148657,
        "DistanceUnit": 0
    },
    "Connections": [
        {
            "ID": 203855,
            "ConnectionTypeID": 2,
            "StatusTypeID": 50,
            "LevelID": 2,
            "PowerKW": 50,
            "Quantity": 1
        },
        {
            "ID": 203856,
            "ConnectionTypeID": 32,
            "StatusTypeID": 50,
            "LevelID": 2,
            "PowerKW": 50
        },
        {
            "ID": 203857,
            "ConnectionTypeID": 1,
            "LevelID": 2
        }
    ],
    "NumberOfPoints": 3,
    "StatusTypeID": 50,
    "DateLastStatusUpdate": "2020-01-13T01:26:00Z",
    "DataQualityLevel": 1,
    "DateCreated": "2020-01-12T12:41:00Z",
    "SubmissionStatusTypeID": 200
}