{
    "IsRecentlyVerified": false,
    "ID": 182121,
    "UUID": "F8A1DA7D-D96B-429A-B821-3D4EC5A9933E",
    "DataProviderID": 29,
    "DataProvidersReference": "6736",
    "AddressInfo": {
        "ID": 182480,
        "Title": "Öttinger Straße 8",
        "AddressLine1": "Öttinger Straße 8",
        "Town": "Reischach",
        "Postcode": "84571",
        "CountryID": 87,
        "Latitude": 48.2898836,
        "Longitude": 12.7245378,
        "DistanceUnit": 0
    },
    "Connections": [
        {
            "ID": 287470,
            "ConnectionTypeID": 1036,
            "StatusTypeID": 50,
            "LevelID": 3,
            "PowerKW": 43,
            "CurrentTypeID": 20
        },
        {
            "ID": 287471,
            "ConnectionTypeID": 33,
            "StatusTypeID": 50,
            "LevelID": 3,
            "PowerKW": 50,
            "CurrentTypeID": 30
        },
        {
            "ID": 295710,
            "ConnectionTypeID": 2,
            "StatusTypeID": 50,
            "LevelID": 3,
            "PowerKW": 50,
            "CurrentTypeID": 30
        }
    ],
    "StatusTypeID": 50,
    "DateLastStatusUpdate": "2021-07-12T02:40:00Z",
    "MetadataValues": [
        {
            "ID": 14415,
            "MetadataFieldID": 4,
            "ItemValue": "Data from the German chargepoint registry provided by Bundesnetzagentur.de under the CC-BY 4.0 license"
        }
    ],
    "DataQualityLevel": 3,
    "DateCreated": "2021-07-08T10:02:00Z",
    "SubmissionStatusTypeID": 100
}