{
    "IsRecentlyVerified": false,
    "ID": 159592,
    "UUID": "2AD6D27B-EE86-451C-86EB-8D67466D1372",
    "DataProviderID": 2,
    "DataProvidersReference": "154783",
    "OperatorID": 5,
    "UsageTypeID": 1,
    "AddressInfo": {
        "ID": 159949,
        "Title": "MIDDLETOWN TWP",
        "AddressLine1": "5 Municipal Way",
        "Town": "Langhorne",
        "StateOrProvince": "PA",
        "Postcode": "19047",
        "CountryID": 2,
        "Latitude": 40.1831923,
        "Longitude": -74.9061051,
        "ContactTelephone1": "888-758-4389",
        "AccessComments": "24 hours daily",
        "RelatedURL": "http://www.chargepoint.com/",
        "DistanceUnit": 0
    },
    "Connections": [
        {
            "ID": 229789,
            "ConnectionTypeID": 1,
            "LevelID": 2,
            "Amps": 16,
            "Voltage": 230,
            "PowerKW": 3.7,
            "CurrentTypeID": 10,
            "Quantity": 2
        }
    ],
    "StatusTypeID": 50,
    "DateLastStatusUpdate": "2020-06-26T03:02:00Z",
    "DataQualityLevel": 3,
    "DateCreated": "2020-06-26T03:02:00Z",
    "SubmissionStatusTypeID": 100
}