{
    "IsRecentlyVerified": false,
    "ID": 51054,
    "UUID": "A19B3BDE-2B0A-4E15-927A-FF9162276A78",
    "DataProviderID": 26,
    "DataProvidersReference": "63386",
    "OperatorID": 157,
    "OperatorsReference": "NewMotion ICUEVE000616",
    "UsageCost": "0.00 jaarabonnement",
    "AddressInfo": {
        "ID": 51400,
        "Title": "P.R. Roelfsema Rzn.-weg 24",
        "AddressLine1": "P.R. Roelfsema Rzn.-weg 24",
        "Town": "Midden-Drenthe",
        "Postcode": "9423 RA",
        "CountryID": 159,
        "Latitude": 52.8939849,
        "Longitude": 6.3870904,
        "ContactTelephone1": "088 0109500",
        "RelatedURL": "http://thenewmotion.nl/",
        "DistanceUnit": 0
    },
    "Connections": [
        {
            "ID": 63110,
            "ConnectionTypeID": 25,
            "LevelID": 2,
            "PowerKW": 22,
            "CurrentTypeID": 10
        }
    ],
    "NumberOfPoints": 2,
    "StatusTypeID": 50,
    "DateLastStatusUpdate": "2016-06-04T02:55:00Z",
    "DataQualityLevel": 3,
    "DateCreated": "2015-07-22T09:54:00Z",
    "SubmissionStatusTypeID": 100
}