{
    "IsRecentlyVerified": false,
    "ID": 151501,
    "UUID": "45A4A1CD-D286-4CE4-A9BD-300ABAAC8639",
    "DataProviderID": 28,
    "DataProvidersReference": "FR*S46*P46087*001",
    "OperatorID": 3257,
    "UsageTypeID": 5,
    "AddressInfo": {
        "ID": 151854,
        "Title": "DEGAGNAC - Garage",
        "AddressLine1": "Garage 46340 DEGAGNAC",
        "CountryID": 80,
        "Latitude": 44.664793,
        "Longitude": 1.312516,
        "AccessComments": "24h/24 7j/7",
        "DistanceUnit": 0
    },
    "Connections": [
        {
            "ID": 211610,
            "ConnectionTypeID": 2,
            "StatusTypeID": 50,
            "LevelID": 3,
            "PowerKW": 36,
            "CurrentTypeID": 30
        },
        {
            "ID": 242603,
            "ConnectionTypeID": 1036,
            "StatusTypeID": 50,
            "LevelID": 2,
            "PowerKW": 36,
            "CurrentTypeID": 20
        },
        {
            "ID": 242604,
            "ConnectionTypeID": 28,
            "StatusTypeID": 50,
            "LevelID": 2,
            "PowerKW": 4,
            "CurrentTypeID": 10
        },
        {
            "ID": 242605,
            "ConnectionTypeID": 2,
            "StatusTypeID": 50,
            "LevelID": 3,
            "PowerKW": 36,
            "CurrentTypeID": 30
        }
    ],
    "GeneralComments": "Recharge par badge et avec une application smartphone",
    "StatusTypeID": 50,
    "DateLastStatusUpdate": "2020-08-27T05:11:00Z",
    "DataQualityLevel": 2,
    "DateCreated": "2020-03-15T10:53:00Z",
    "SubmissionStatusTypeID": 100
}