{
    "UserComments": [
        {
            "ID": 813,
            "ChargePointID": 8421,
            "CommentTypeID": 100,
            "UserName": "epweet",
            "Comment": "Magic Nissan of Everett. This is a ChargePoint location for the Chademo free for customers and $3/session for non-customers, free J1772 L2 charging.  Now open 24hrs",
            "Rating": 5,
            "DateCreated": "2014-05-13T17:12:09.203Z",
            "User": {
                "ID": 1869,
                "Username": "epweet"
            },
            "CheckinStatusTypeID": 140
        }
    ],
    "IsRecentlyVerified": false,
    "ID": 8421,
    "UUID": "987B72C5-C880-465B-938E-142BC310B418",
    "DataProviderID": 1,
    "OperatorID": 5,
    "UsageTypeID": 1,
    "AddressInfo": {
        "ID": 8318,
        "Title": "Nissan of Everett",
        "AddressLine1": "10500 Highway 99 S",
        "Town": "Everett",
        "StateOrProvince": "WA",
        "Postcode": "98204",
        "CountryID": 2,
        "Latitude": 47.9028,
        "Longitude": -122.24702,
        "ContactTelephone1": "800-776-5337",
        "RelatedURL": "http://carstations.com/4272",
        "DistanceUnit": 0
    },
    "Connections": [
        {
            "ID": 5848,
            "ConnectionTypeID": 1,
            "Reference": "J1772",
            "LevelID": 2,
            "Quantity": 1
        },
        {
            "ID": 15019,
            "ConnectionTypeID": 2,
            "Reference": "CHADEMO",
            "LevelID": 3,
            "Quantity": 1
        }
    ],
    "GeneralComments": "Free CHADEMO for Customers, 3$ for non-Nissans,  Free j1772\r\naccesible 24/7",
    "StatusTypeID": 0,
    "DateLastStatusUpdate": "2014-05-15T17:31:00Z",
    "DataQualityLevel": 1,
    "DateCreated": "2011-11-11T12:06:00Z",
    "SubmissionStatusTypeID": 100
}