{
    "IsRecentlyVerified": false,
    "ID": 159268,
    "UUID": "8340B4F2-B267-4C32-8976-8700F3FA039B",
    "DataProviderID": 2,
    "DataProvidersReference": "151069",
    "OperatorID": 3293,
    "UsageTypeID": 1,
    "AddressInfo": {
        "ID": 159625,
        "Title": "Solano Town Center - Macy's",
        "AddressLine1": "1350 Travis Blvd",
        "Town": "Fairfield",
        "StateOrProvince": "CA",
        "Postcode": "94533",
        "CountryID": 2,
        "Latitude": 38.259248,
        "Longitude": -122.055144,
        "ContactTelephone1": "888-264-2208",
        "AccessComments": "6am-12am daily",
        "RelatedURL": "https://voltacharging.com/",
        "DistanceUnit": 0
    },
    "Connections": [
        {
            "ID": 229404,
            "ConnectionTypeID": 1,
            "LevelID": 2,
            "Amps": 16,
            "Voltage": 230,
            "PowerKW": 3.7,
            "CurrentTypeID": 10,
            "Quantity": 2
        }
    ],
    "StatusTypeID": 50,
    "DateLastStatusUpdate": "2020-06-26T02:59:00Z",
    "DataQualityLevel": 3,
    "DateCreated": "2020-06-26T02:59:00Z",
    "SubmissionStatusTypeID": 100
}