{
    "IsRecentlyVerified": false,
    "ID": 40797,
    "UUID": "F4262452-E693-4D11-98A1-2A1A57DE345C",
    "DataProviderID": 26,
    "DataProvidersReference": "58760",
    "OperatorID": 5,
    "OperatorsReference": "Chargepoint 1500311",
    "UsageCost": "0.00 afhankelijk van pas",
    "AddressInfo": {
        "ID": 41143,
        "Title": "Limburglaan 10",
        "AddressLine1": "Limburglaan 10",
        "Town": "Maastricht",
        "Postcode": "6229 GA",
        "CountryID": 159,
        "Latitude": 50.839713,
        "Longitude": 5.702423,
        "RelatedURL": "http://www.chargepoint.nl",
        "DistanceUnit": 0
    },
    "Connections": [
        {
            "ID": 44420,
            "ConnectionTypeID": 25,
            "LevelID": 2,
            "PowerKW": 22,
            "CurrentTypeID": 10
        },
        {
            "ID": 46324,
            "ConnectionTypeID": 25,
            "LevelID": 2,
            "PowerKW": 22,
            "CurrentTypeID": 10
        },
        {
            "ID": 67585,
            "ConnectionTypeID": 25,
            "LevelID": 2,
            "PowerKW": 22,
            "CurrentTypeID": 10
        },
        {
            "ID": 67586,
            "ConnectionTypeID": 25,
            "LevelID": 2,
            "PowerKW": 22
        },
        {
            "ID": 67587,
            "ConnectionTypeID": 25,
            "LevelID": 2,
            "PowerKW": 22
        },
        {
            "ID": 67588,
            "ConnectionTypeID": 25,
            "LevelID": 2,
            "PowerKW": 22
        }
    ],
    "NumberOfPoints": 2,
    "StatusTypeID": 50,
    "DateLastStatusUpdate": "2016-06-04T02:38:00Z",
    "DataQualityLevel": 3,
    "DateCreated": "2015-01-15T09:05:00Z",
    "SubmissionStatusTypeID": 100
}