{
    "UserComments": [
        {
            "ID": 20269,
            "ChargePointID": 73078,
            "CommentTypeID": 10,
            "UserName": "ForumElettrico.it",
            "Rating": 4,
            "RelatedURL": "https://www.forumelettrico.it/forum/colonnina-garda-uno-7-4-kw-la-rocca-lonato-bs-via-cesare-battisti-2-t3783.html",
            "DateCreated": "2018-10-06T12:51:13.023Z",
            "User": {
                "ID": 11749,
                "Username": "ForumElettrico.it"
            },
            "CheckinStatusTypeID": 10
        },
        {
            "ID": 20268,
            "ChargePointID": 73078,
            "CommentTypeID": 10,
            "UserName": "ForumElettrico.it",
            "Comment": "https://www.forumelettrico.it/forum/colonnina-garda-uno-7-4-kw-la-rocca-lonato-bs-via-cesare-battisti-2-t3783.html",
            "Rating": 5,
            "DateCreated": "2018-10-06T12:20:28.253Z",
            "User": {
                "ID": 11749,
                "Username": "ForumElettrico.it"
            }
        }
    ],
    "MediaItems": [
        {
            "ID": 16727,
            "ChargePointID": 73078,
            "ItemURL": "https://s3-ap-southeast-2.amazonaws.com/openchargemap/images/IT/OCM73078/OCM-73078.orig.2018100612213289.png",
            "ItemThumbnailURL": "https://s3-ap-southeast-2.amazonaws.com/openchargemap/images/IT/OCM73078/OCM-73078.thmb.2018100612213289.png",
            "Comment": "",
            "IsEnabled": true,
            "IsVideo": false,
            "IsFeaturedItem": false,
            "IsExternalResource": false,
            "User": {
                "ID": 11749,
                "Username": "ForumElettrico.it"
            },
            "DateCreated": "2018-10-06T12:22:00Z"
        },
        {
            "ID": 16728,
            "ChargePointID": 73078,
            "ItemURL": "https://s3-ap-southeast-2.amazonaws.com/openchargemap/images/IT/OCM73078/OCM-73078.orig.2018100612215466.png",
            "ItemThumbnailURL": "https://s3-ap-southeast-2.amazonaws.com/openchargemap/images/IT/OCM73078/OCM-73078.thmb.2018100612215466.png",
            "Comment": "",
            "IsEnabled": true,
            "IsVideo": false,
            "IsFeaturedItem": false,
            "IsExternalResource": false,
            "User": {
                "ID": 11749,
                "Username": "ForumElettrico.it"
            },
            "DateCreated": "2018-10-06T12:22:00Z"
        },
        {
            "ID": 16729,
            "ChargePointID": 73078,
            "ItemURL": "https://s3-ap-southeast-2.amazonaws.com/openchargemap/images/IT/OCM73078/OCM-73078.orig.2018100612221867.png",
            "ItemThumbnailURL": "https://s3-ap-southeast-2.amazonaws.com/openchargemap/images/IT/OCM73078/OCM-73078.thmb.2018100612221867.png",
            "Comment": "",
            "IsEnabled": true,
            "IsVideo": false,
            "IsFeaturedItem": false,
            "IsExternalResource": false,
            "User": {
                "ID": 11749,
                "Username": "ForumElettrico.it"
            },
            "DateCreated": "2018-10-06T12:22:00Z"
        },
        {
            "ID": 16726,
            "ChargePointID": 73078,
            "ItemURL": "https://s3-ap-southeast-2.amazonaws.com/openchargemap/images/IT/OCM73078/OCM-73078.orig.2018100612211394.png",
            "ItemThumbnailURL": "https://s3-ap-southeast-2.amazonaws.com/openchargemap/images/IT/OCM73078/OCM-73078.thmb.2018100612211394.png",
            "Comment": "",
            "IsEnabled": true,
            "IsVideo": false,
            "IsFeaturedItem": false,
            "IsExternalResource": false,
            "User": {
                "ID": 11749,
                "Username": "ForumElettrico.it"
            },
            "DateCreated": "2018-10-06T12:21:00Z"
        },
        {
            "ID": 9099,
            "ChargePointID": 73078,
            "ItemURL": "https://s3-ap-southeast-2.amazonaws.com/openchargemap/images/IT/OCM73078/OCM-73078.orig.2017011511171017.jpg",
            "ItemThumbnailURL": "https://s3-ap-southeast-2.amazonaws.com/openchargemap/images/IT/OCM73078/OCM-73078.thmb.2017011511171017.jpg",
            "Comment": "",
            "IsEnabled": true,
            "IsVideo": false,
            "IsFeaturedItem": false,
            "IsExternalResource": false,
            "User": {
                "ID": 12207,
                "Username": "aldodal"
            },
            "DateCreated": "2017-01-15T11:17:00Z"
        }
    ],
    "IsRecentlyVerified": false,
    "ID": 73078,
    "UUID": "9D6C48F2-41DB-4681-B361-C226E294E80E",
    "DataProviderID": 1,
    "OperatorID": 204,
    "UsageTypeID": 4,
    "AddressInfo": {
        "ID": 73424,
        "Title": "GardaUno Lonato Famila",
        "AddressLine1": "Via Cesare Battisti",
        "Town": "Lonato del Garda ",
        "StateOrProvince": "BS",
        "Postcode": "25017",
        "CountryID": 112,
        "Latitude": 45.46026141369695,
        "Longitude": 10.490948916551153,
        "ContactTelephone1": "800-601 328",
        "RelatedURL": "http://www.gardauno.it/la-mappa-dei-punti-di-ricarica/",
        "DistanceUnit": 0
    },
    "Connections": [
        {
            "ID": 105038,
            "ConnectionTypeID": 25,
            "StatusTypeID": 50,
            "LevelID": 2,
            "Amps": 32,
            "Voltage": 240,
            "PowerKW": 7,
            "CurrentTypeID": 10,
            "Quantity": 2
        }
    ],
    "NumberOfPoints": 2,
    "GeneralComments": "http://www.gardauno.it/modulo-richiesta-mobility-card/",
    "StatusTypeID": 50,
    "DateLastStatusUpdate": "2018-10-06T12:51:00Z",
    "DataQualityLevel": 1,
    "DateCreated": "2016-11-04T12:05:00Z",
    "SubmissionStatusTypeID": 200
}