{
    "IsRecentlyVerified": false,
    "ID": 179889,
    "UUID": "B0180D15-4990-4FD4-AD14-9AD91F3FF52E",
    "DataProviderID": 29,
    "DataProvidersReference": "11816",
    "OperatorID": 86,
    "AddressInfo": {
        "ID": 180248,
        "Title": "Badstubengasse 6",
        "AddressLine1": "Badstubengasse 6",
        "Town": "Schömberg",
        "Postcode": "72355",
        "CountryID": 87,
        "Latitude": 48.211526,
        "Longitude": 8.760009,
        "DistanceUnit": 0
    },
    "Connections": [
        {
            "ID": 282318,
            "ConnectionTypeID": 28,
            "StatusTypeID": 50,
            "LevelID": 2,
            "PowerKW": 22,
            "CurrentTypeID": 20
        },
        {
            "ID": 282319,
            "ConnectionTypeID": 25,
            "StatusTypeID": 50,
            "LevelID": 2,
            "PowerKW": 22,
            "CurrentTypeID": 20
        },
        {
            "ID": 295650,
            "ConnectionTypeID": 28,
            "StatusTypeID": 50,
            "LevelID": 2,
            "PowerKW": 22,
            "CurrentTypeID": 20
        },
        {
            "ID": 295651,
            "ConnectionTypeID": 25,
            "StatusTypeID": 50,
            "LevelID": 2,
            "PowerKW": 22,
            "CurrentTypeID": 20
        }
    ],
    "StatusTypeID": 50,
    "DateLastStatusUpdate": "2021-07-12T02:40:00Z",
    "MetadataValues": [
        {
            "ID": 12183,
            "MetadataFieldID": 4,
            "ItemValue": "Data from the German chargepoint registry provided by Bundesnetzagentur.de under the CC-BY 4.0 license"
        }
    ],
    "DataQualityLevel": 3,
    "DateCreated": "2021-07-08T10:00:00Z",
    "SubmissionStatusTypeID": 100
}