{
    "IsRecentlyVerified": false,
    "ID": 128934,
    "UUID": "243E9600-88A7-4332-BE7D-483B1994D048",
    "DataProviderID": 1,
    "OperatorID": 80,
    "UsageTypeID": 4,
    "AddressInfo": {
        "ID": 129280,
        "Title": "U2 Supermercato Biassono | EnelX",
        "AddressLine1": "Via Trento e Trieste, 114",
        "Town": "Biassono ",
        "StateOrProvince": "MB",
        "Postcode": "20853",
        "CountryID": 112,
        "Latitude": 45.6292352012445,
        "Longitude": 9.26065634776739,
        "RelatedURL": "https://www.enelx.com/it/it/emobility",
        "DistanceUnit": 0
    },
    "Connections": [
        {
            "ID": 180494,
            "ConnectionTypeID": 25,
            "StatusTypeID": 50,
            "LevelID": 2,
            "Amps": 32,
            "Voltage": 400,
            "PowerKW": 22,
            "CurrentTypeID": 20,
            "Quantity": 3
        },
        {
            "ID": 180495,
            "ConnectionTypeID": 36,
            "StatusTypeID": 50,
            "LevelID": 2,
            "Amps": 16,
            "Voltage": 240,
            "PowerKW": 3.7,
            "CurrentTypeID": 10,
            "Quantity": 1
        }
    ],
    "NumberOfPoints": 4,
    "GeneralComments": "Lun - Sab 08:00/20:00 Dom 08:30/13:00",
    "StatusTypeID": 50,
    "DateLastStatusUpdate": "2019-07-09T15:46:00Z",
    "DataQualityLevel": 1,
    "DateCreated": "2019-07-09T15:46:00Z",
    "SubmissionStatusTypeID": 200
}