{
    "UserComments": [
        {
            "ID": 21358,
            "ChargePointID": 14958,
            "CommentTypeID": 10,
            "UserName": "RonnieLast",
            "Comment": "",
            "Rating": 3,
            "DateCreated": "2019-08-19T21:34:02.343Z",
            "User": {
                "ID": 21963,
                "Username": "RonnieLast"
            }
        }
    ],
    "IsRecentlyVerified": false,
    "ID": 14958,
    "UUID": "FFD4F7A7-DD58-406C-8C46-439096662F29",
    "DataProviderID": 1,
    "OperatorID": 22,
    "OperatorsReference": "C8KQD",
    "UsageTypeID": 4,
    "AddressInfo": {
        "ID": 15304,
        "Title": "Old Dublin Road",
        "AddressLine1": "Stillorgan",
        "Town": "Dublin",
        "StateOrProvince": "County Dublin",
        "Postcode": "A94",
        "CountryID": 3,
        "Latitude": 53.290242783101,
        "Longitude": -6.19956961359253,
        "DistanceUnit": 0
    },
    "Connections": [
        {
            "ID": 13345,
            "ConnectionTypeID": 25,
            "StatusTypeID": 50,
            "LevelID": 2,
            "Amps": 32,
            "Voltage": 400,
            "PowerKW": 22,
            "CurrentTypeID": 20,
            "Quantity": 2
        }
    ],
    "NumberOfPoints": 2,
    "StatusTypeID": 50,
    "DateLastStatusUpdate": "2019-08-20T07:20:00Z",
    "DataQualityLevel": 2,
    "DateCreated": "2012-12-11T15:08:00Z",
    "SubmissionStatusTypeID": 100
}