{
    "IsRecentlyVerified": false,
    "ID": 153908,
    "UUID": "47406CE7-968C-4D68-BC67-887FE3BF5CBF",
    "DataProviderID": 28,
    "DataProvidersReference": "FR*A07*PCCHVC15",
    "AddressInfo": {
        "ID": 154261,
        "Title": "CCHVC 15 - St-Remy-les-Chevreuse - RER - EF + T2 (1)",
        "AddressLine1": "5 Rue Ditte, Saint Rémy-lès-Chevreuse",
        "CountryID": 80,
        "Latitude": 48.703298,
        "Longitude": 2.071103,
        "AccessComments": "24h/24 7j/7",
        "DistanceUnit": 0
    },
    "Connections": [
        {
            "ID": 216195,
            "ConnectionTypeID": 1036,
            "StatusTypeID": 50,
            "LevelID": 2,
            "PowerKW": 22,
            "CurrentTypeID": 20
        },
        {
            "ID": 216196,
            "ConnectionTypeID": 28,
            "StatusTypeID": 50,
            "LevelID": 2,
            "PowerKW": 22,
            "CurrentTypeID": 10
        },
        {
            "ID": 250157,
            "ConnectionTypeID": 1036,
            "StatusTypeID": 50,
            "LevelID": 2,
            "PowerKW": 22,
            "CurrentTypeID": 20
        },
        {
            "ID": 250158,
            "ConnectionTypeID": 28,
            "StatusTypeID": 50,
            "LevelID": 2,
            "PowerKW": 22,
            "CurrentTypeID": 10
        }
    ],
    "GeneralComments": "Recharge normale et accélérée, accessible par badge après réservation sur le site internet cchvc.clem.mobi ou depuis l'application mobile Clem' Ecomobilité -Informations sur le site : cchvc.clem.mobi",
    "StatusTypeID": 50,
    "DateLastStatusUpdate": "2020-08-27T05:15:00Z",
    "DataQualityLevel": 2,
    "DateCreated": "2020-03-15T10:54:00Z",
    "SubmissionStatusTypeID": 100
}