{
    "IsRecentlyVerified": false,
    "ID": 65022,
    "UUID": "C402A3EA-9E68-4A49-8D84-A70A77B35D42",
    "DataProviderID": 1,
    "OperatorID": 45,
    "UsageTypeID": 3,
    "AddressInfo": {
        "ID": 65368,
        "Title": "Autohaus Schuster",
        "AddressLine1": "Stollberger Straße 38",
        "Town": "Zwönitz",
        "StateOrProvince": "Erzgebirgskreis",
        "Postcode": "08297",
        "CountryID": 87,
        "Latitude": 50.65016,
        "Longitude": 12.818160000000034,
        "ContactTelephone1": "+49 377543080",
        "AccessComments": "Kostenloses Laden beim Renault Autohaus nach Anmeldung, da Freischaltung der Schlüsselschalter. Nutzbar von Mo-Fr 6-18:30, Sa 9-12Uhr.",
        "RelatedURL": "http://www.autohaus-schuster.com/",
        "DistanceUnit": 0
    },
    "Connections": [
        {
            "ID": 83688,
            "ConnectionTypeID": 25,
            "StatusTypeID": 50,
            "LevelID": 2,
            "Amps": 16,
            "Voltage": 400,
            "PowerKW": 11,
            "CurrentTypeID": 20,
            "Quantity": 1
        }
    ],
    "NumberOfPoints": 1,
    "StatusTypeID": 50,
    "DateLastStatusUpdate": "2016-04-05T08:43:00Z",
    "DataQualityLevel": 1,
    "DateCreated": "2016-04-05T08:43:00Z",
    "SubmissionStatusTypeID": 200
}