{
    "IsRecentlyVerified": false,
    "ID": 107414,
    "UUID": "AE1A2481-7963-4FF3-BC2E-82D7BAA9A4C8",
    "DataProviderID": 1,
    "OperatorID": 3319,
    "UsageTypeID": 1,
    "UsageCost": "AC:  bruttó 80 Ft/kWh DC:80 Ft/perc",
    "AddressInfo": {
        "ID": 107760,
        "Title": "Békéscsaba, Szabó Dezső utca",
        "AddressLine1": "Szabó Dezső utca",
        "Town": "Békéscsaba",
        "StateOrProvince": "Békés megye",
        "Postcode": "5600",
        "CountryID": 104,
        "Latitude": 46.676543,
        "Longitude": 21.0883109,
        "ContactTelephone1": "+36 80 21-00-12",
        "ContactEmail": "kommunikacio@e-mobi.hu",
        "RelatedURL": "https://e-mobi.hu/",
        "DistanceUnit": 0
    },
    "Connections": [
        {
            "ID": 151561,
            "ConnectionTypeID": 33,
            "StatusTypeID": 50,
            "LevelID": 3,
            "Amps": 32,
            "Voltage": 400,
            "PowerKW": 50,
            "CurrentTypeID": 30,
            "Quantity": 1
        },
        {
            "ID": 176805,
            "ConnectionTypeID": 2,
            "StatusTypeID": 50,
            "LevelID": 3,
            "Amps": 32,
            "Voltage": 400,
            "PowerKW": 50,
            "CurrentTypeID": 30,
            "Quantity": 1
        }
    ],
    "NumberOfPoints": 2,
    "StatusTypeID": 50,
    "DateLastStatusUpdate": "2020-05-09T09:12:00Z",
    "DataQualityLevel": 1,
    "DateCreated": "2018-07-29T12:26:00Z",
    "SubmissionStatusTypeID": 200
}