{
    "UserComments": [
        {
            "ID": 11630,
            "ChargePointID": 36517,
            "CommentTypeID": 10,
            "UserName": "Hachy",
            "Comment": "This is a charging point on private property",
            "DateCreated": "2016-06-13T14:40:34.173Z",
            "User": {
                "ID": 9497,
                "Username": "Hachy"
            },
            "CheckinStatusTypeID": 130
        }
    ],
    "IsRecentlyVerified": false,
    "ID": 36517,
    "UUID": "44C34F08-FCC1-447A-B3D3-E9D6F8A78291",
    "DataProviderID": 1,
    "OperatorID": 47,
    "OperatorsReference": "NewMotion 02008620",
    "UsageTypeID": 2,
    "UsageCost": "0.00 jaarabonnement",
    "AddressInfo": {
        "ID": 36863,
        "Title": "Brouwersmolenweg 376",
        "AddressLine1": "Brouwersmolenweg 376",
        "Town": "Apeldoorn",
        "Postcode": "7339 ED",
        "CountryID": 159,
        "Latitude": 52.1868858337402,
        "Longitude": 5.92878341674805,
        "ContactTelephone1": "088 0109500",
        "RelatedURL": "http://thenewmotion.nl/",
        "DistanceUnit": 0
    },
    "Connections": [
        {
            "ID": 40028,
            "ConnectionTypeID": 25,
            "LevelID": 2,
            "PowerKW": 3.7,
            "CurrentTypeID": 10
        }
    ],
    "NumberOfPoints": 1,
    "StatusTypeID": 50,
    "DateLastStatusUpdate": "2016-06-14T08:23:00Z",
    "DataQualityLevel": 3,
    "DateCreated": "2015-01-09T06:05:00Z",
    "SubmissionStatusTypeID": 100
}