{
    "IsRecentlyVerified": false,
    "ID": 99827,
    "UUID": "0050EEB1-F8C2-435C-B50B-CF941A6555CB",
    "DataProviderID": 1,
    "OperatorID": 23,
    "OperatorsReference": "40409",
    "UsageTypeID": 4,
    "AddressInfo": {
        "ID": 100173,
        "Title": "Hotel Edelweiss",
        "AddressLine1": "Dorfstrasse 192",
        "Town": "Hinterglemm",
        "Postcode": "5754",
        "CountryID": 19,
        "Latitude": 47.378829,
        "Longitude": 12.599673,
        "ContactTelephone1": "+43 6541 6355",
        "DistanceUnit": 0
    },
    "Connections": [
        {
            "ID": 141044,
            "ConnectionTypeID": 30,
            "StatusTypeID": 50,
            "LevelID": 2,
            "Amps": 32,
            "Voltage": 400,
            "PowerKW": 22,
            "CurrentTypeID": 20,
            "Quantity": 2
        }
    ],
    "NumberOfPoints": 2,
    "GeneralComments": "2 Tesla Connectors, up to 22kW.Available for customers. Please see front desk.",
    "StatusTypeID": 50,
    "DateLastStatusUpdate": "2018-10-03T21:52:00Z",
    "DataQualityLevel": 1,
    "DateCreated": "2018-02-06T06:42:00Z",
    "SubmissionStatusTypeID": 200
}