{
    "IsRecentlyVerified": false,
    "ID": 176391,
    "UUID": "650E18A5-F265-4C4B-846B-B908C7DD55B2",
    "DataProviderID": 29,
    "DataProvidersReference": "17422",
    "OperatorID": 103,
    "AddressInfo": {
        "ID": 176750,
        "Title": "Pasteuratr. 12",
        "AddressLine1": "Pasteuratr. 12",
        "Town": "Berlin",
        "Postcode": "10407",
        "CountryID": 87,
        "Latitude": 52.533674,
        "Longitude": 13.432955,
        "DistanceUnit": 0
    },
    "Connections": [
        {
            "ID": 274243,
            "ConnectionTypeID": 25,
            "StatusTypeID": 50,
            "LevelID": 2,
            "PowerKW": 11,
            "CurrentTypeID": 20
        },
        {
            "ID": 300762,
            "ConnectionTypeID": 25,
            "StatusTypeID": 50,
            "LevelID": 2,
            "PowerKW": 11,
            "CurrentTypeID": 20
        }
    ],
    "StatusTypeID": 0,
    "DateLastStatusUpdate": "2021-07-12T02:50:00Z",
    "MetadataValues": [
        {
            "ID": 8686,
            "MetadataFieldID": 4,
            "ItemValue": "Data from the German chargepoint registry provided by Bundesnetzagentur.de under the CC-BY 4.0 license"
        }
    ],
    "DataQualityLevel": 3,
    "DateCreated": "2021-07-08T09:48:00Z",
    "SubmissionStatusTypeID": 100
}