{
    "IsRecentlyVerified": false,
    "ID": 129675,
    "UUID": "3991D035-1362-41F0-B317-A2F7B9DA56C9",
    "DataProviderID": 1,
    "OperatorID": 80,
    "UsageTypeID": 4,
    "AddressInfo": {
        "ID": 130021,
        "Title": "Cantello Via Milano | EnelX",
        "AddressLine1": "Via Milano",
        "Town": "Cantello",
        "StateOrProvince": "VA",
        "Postcode": "21050",
        "CountryID": 112,
        "Latitude": 45.822506963859695,
        "Longitude": 8.896206153713024,
        "RelatedURL": "https://www.enelx.com/it/it/emobility",
        "DistanceUnit": 0
    },
    "Connections": [
        {
            "ID": 181483,
            "ConnectionTypeID": 25,
            "StatusTypeID": 50,
            "LevelID": 2,
            "Amps": 32,
            "Voltage": 400,
            "PowerKW": 22,
            "CurrentTypeID": 20,
            "Quantity": 2
        }
    ],
    "NumberOfPoints": 2,
    "StatusTypeID": 50,
    "DateLastStatusUpdate": "2019-07-23T10:40:00Z",
    "DataQualityLevel": 1,
    "DateCreated": "2019-07-23T10:40:00Z",
    "SubmissionStatusTypeID": 200
}