{
    "IsRecentlyVerified": false,
    "ID": 175459,
    "UUID": "9D48FA3B-6209-4FA9-9267-23B6231A1BBA",
    "DataProviderID": 1,
    "OperatorID": 3,
    "UsageTypeID": 1,
    "AddressInfo": {
        "ID": 175818,
        "Title": "Travelodge Emersons Green",
        "AddressLine1": "Fieldfare",
        "Town": "Bury Hill",
        "Postcode": "BS16 7FN",
        "CountryID": 1,
        "Latitude": 51.50557399157725,
        "Longitude": -2.4866709312398143,
        "DistanceUnit": 0
    },
    "Connections": [
        {
            "ID": 272266,
            "ConnectionTypeID": 25,
            "StatusTypeID": 50,
            "LevelID": 2,
            "Amps": 32,
            "Voltage": 230,
            "PowerKW": 7,
            "CurrentTypeID": 10,
            "Quantity": 6
        }
    ],
    "NumberOfPoints": 6,
    "StatusTypeID": 50,
    "DateLastStatusUpdate": "2021-05-21T20:29:00Z",
    "DataQualityLevel": 1,
    "DateCreated": "2021-05-20T12:34:00Z",
    "SubmissionStatusTypeID": 200
}