{
    "IsRecentlyVerified": false,
    "ID": 18051,
    "UUID": "0EE813BF-630B-418B-91DF-CBD161E0D398",
    "DataProviderID": 22,
    "DataProvidersReference": "F38575EE8AF23BA6D923C0D98EE767FC",
    "AddressInfo": {
        "ID": 18396,
        "Title": "福岡日産自動車福岡店",
        "AddressLine1": "福岡県福岡市博多区千代1丁目21-37",
        "CountryID": 114,
        "Latitude": 33.60208595,
        "Longitude": 130.4171405,
        "ContactTelephone1": "092-633-5539",
        "DistanceUnit": 0
    },
    "Connections": [
        {
            "ID": 18292,
            "ConnectionTypeID": 2,
            "LevelID": 2,
            "Amps": 100,
            "Voltage": 480,
            "PowerKW": 48,
            "Quantity": 1
        }
    ],
    "DateLastStatusUpdate": "2013-06-29T09:06:00Z",
    "DataQualityLevel": 2,
    "DateCreated": "2013-06-29T09:06:00Z",
    "SubmissionStatusTypeID": 200
}