{
    "IsRecentlyVerified": false,
    "ID": 111978,
    "UUID": "63AE288A-08F7-49B8-B79A-A1E4453491A3",
    "DataProviderID": 2,
    "DataProvidersReference": "91449",
    "OperatorID": 5,
    "UsageTypeID": 1,
    "AddressInfo": {
        "ID": 112324,
        "Title": "GWLRA",
        "AddressLine1": "4621 Canada Way",
        "Town": "Burnaby",
        "StateOrProvince": "BC",
        "Postcode": "V5G",
        "CountryID": 44,
        "Latitude": 49.2553326,
        "Longitude": -122.9938106,
        "ContactTelephone1": "888-758-4389",
        "AccessComments": "24 hours daily",
        "RelatedURL": "http://www.chargepoint.com/",
        "DistanceUnit": 0
    },
    "Connections": [
        {
            "ID": 157503,
            "ConnectionTypeID": 1,
            "LevelID": 2,
            "Amps": 16,
            "Voltage": 230,
            "PowerKW": 3,
            "CurrentTypeID": 10,
            "Quantity": 2
        }
    ],
    "DateLastStatusUpdate": "2019-04-06T05:07:00Z",
    "DataQualityLevel": 3,
    "DateCreated": "2018-10-18T23:37:00Z",
    "SubmissionStatusTypeID": 100
}