{
    "UserComments": [
        {
            "ID": 20398,
            "ChargePointID": 95897,
            "CommentTypeID": 10,
            "UserName": "Simon Hewison",
            "Comment": "Chademo was most excellent ",
            "Rating": 4,
            "DateCreated": "2018-11-08T13:01:05.433Z",
            "User": {
                "ID": 4575,
                "Username": "Simon Hewison"
            },
            "CheckinStatusTypeID": 10
        },
        {
            "ID": 20201,
            "ChargePointID": 95897,
            "CommentTypeID": 10,
            "UserName": "Simon Hewison",
            "Comment": "Max charge rate was 22kW on chademo ",
            "DateCreated": "2018-09-22T18:40:38.937Z",
            "User": {
                "ID": 4575,
                "Username": "Simon Hewison"
            },
            "CheckinStatusTypeID": 10
        }
    ],
    "IsRecentlyVerified": false,
    "ID": 95897,
    "UUID": "90847E96-E737-4193-A5DE-957A2F238DDF",
    "DataProviderID": 1,
    "OperatorID": 3,
    "OperatorsReference": "t53_hu1_4117_005",
    "UsageTypeID": 4,
    "UsageCost": "£0.25/kWh",
    "AddressInfo": {
        "ID": 96243,
        "Title": "Lidl-South Ruislip",
        "AddressLine1": "Victoria Road",
        "Town": "London",
        "Postcode": "HA4 0QQ",
        "CountryID": 1,
        "Latitude": 51.558206,
        "Longitude": -0.383076,
        "DistanceUnit": 0
    },
    "Connections": [
        {
            "ID": 135843,
            "ConnectionTypeID": 2,
            "StatusTypeID": 50,
            "LevelID": 3,
            "Amps": 125,
            "Voltage": 500,
            "PowerKW": 50,
            "CurrentTypeID": 30,
            "Quantity": 1
        },
        {
            "ID": 135844,
            "ConnectionTypeID": 1036,
            "StatusTypeID": 50,
            "LevelID": 3,
            "Amps": 63,
            "Voltage": 400,
            "PowerKW": 43,
            "CurrentTypeID": 20,
            "Quantity": 1
        },
        {
            "ID": 136049,
            "ConnectionTypeID": 33,
            "StatusTypeID": 50,
            "LevelID": 3,
            "Amps": 125,
            "Voltage": 500,
            "PowerKW": 50,
            "CurrentTypeID": 30,
            "Quantity": 1
        }
    ],
    "NumberOfPoints": 3,
    "GeneralComments": "This is a POD Point rapid charge unit installed at the Lidl superstore in Victoria Road, South Ruislip, London",
    "StatusTypeID": 50,
    "DateLastStatusUpdate": "2021-03-22T19:38:00Z",
    "DataQualityLevel": 1,
    "DateCreated": "2017-11-30T06:31:00Z",
    "SubmissionStatusTypeID": 200
}