{
    "IsRecentlyVerified": false,
    "ID": 9285,
    "UUID": "A72203C0-9314-40F1-A0A2-C97C47A902EE",
    "DataProviderID": 15,
    "DataProvidersReference": "14102",
    "OperatorID": 5,
    "AddressInfo": {
        "ID": 9182,
        "Title": "1100 S Hayes St",
        "AddressLine1": "1100 S Hayes St",
        "Town": "Arlington",
        "StateOrProvince": "Virginia",
        "Postcode": "22202",
        "CountryID": 2,
        "Latitude": 38.8648262,
        "Longitude": -77.05979156,
        "ContactTelephone1": "",
        "RelatedURL": "http://carstations.com/14102",
        "DistanceUnit": 0
    },
    "Connections": [
        {
            "ID": 6999,
            "ConnectionTypeID": 1,
            "Reference": "J1772",
            "LevelID": 2
        },
        {
            "ID": 9111,
            "ConnectionTypeID": 9,
            "Reference": "NEMA5",
            "Quantity": 1
        }
    ],
    "StatusTypeID": 0,
    "DateLastStatusUpdate": "2017-11-04T14:04:00Z",
    "DataQualityLevel": 2,
    "DateCreated": "2012-02-08T14:36:00Z",
    "SubmissionStatusTypeID": 100
}