{
    "IsRecentlyVerified": false,
    "ID": 129081,
    "UUID": "C30C26E7-9DDD-473C-85D9-BB7C10A3BF66",
    "DataProviderID": 1,
    "OperatorID": 1,
    "UsageTypeID": 1,
    "AddressInfo": {
        "ID": 129427,
        "Title": "Municipalidad de Osa",
        "AddressLine1": "Transversal 3, El Mango",
        "Town": "Puerto Cortés, Osa",
        "StateOrProvince": "Puntarenas",
        "Postcode": "60501",
        "CountryID": 58,
        "Latitude": 8.97866733044457,
        "Longitude": -83.5326573802981,
        "ContactTelephone1": "+506 27820000",
        "AccessComments": "L, M, M y J de 07:00 a 16:00 h / V de 07:00 a 15:00 h",
        "DistanceUnit": 0
    },
    "Connections": [
        {
            "ID": 180705,
            "ConnectionTypeID": 1,
            "StatusTypeID": 50,
            "LevelID": 2,
            "Amps": 32,
            "PowerKW": 7.7,
            "CurrentTypeID": 10,
            "Quantity": 1
        }
    ],
    "NumberOfPoints": 1,
    "GeneralComments": "L, M, M y J de 07:00 a 16:00 h / V de 07:00 a 15:00 h",
    "StatusTypeID": 50,
    "DateLastStatusUpdate": "2019-07-15T11:37:00Z",
    "DataQualityLevel": 1,
    "DateCreated": "2019-07-13T01:13:00Z",
    "SubmissionStatusTypeID": 200
}