{
    "IsRecentlyVerified": false,
    "ID": 122855,
    "UUID": "D2AA5ED7-BEF2-4D8A-AE31-53214228EF92",
    "DataProviderID": 2,
    "DataProvidersReference": "104588",
    "UsageTypeID": 2,
    "AddressInfo": {
        "ID": 123201,
        "Title": "Mountain View Chevrolet",
        "AddressLine1": "310 E 20th St",
        "Town": "Chattanooga",
        "StateOrProvince": "TN",
        "Postcode": "37408",
        "CountryID": 2,
        "Latitude": 35.0297050460099,
        "Longitude": -85.305937661377,
        "ContactTelephone1": "423-266-0181",
        "AccessComments": "Dealership business hours",
        "RelatedURL": "",
        "DistanceUnit": 0
    },
    "Connections": [
        {
            "ID": 172778,
            "ConnectionTypeID": 1,
            "LevelID": 2,
            "Amps": 16,
            "Voltage": 230,
            "PowerKW": 3.7,
            "CurrentTypeID": 10,
            "Quantity": 1
        }
    ],
    "DateLastStatusUpdate": "2020-06-26T02:57:00Z",
    "DataQualityLevel": 3,
    "DateCreated": "2019-04-06T05:03:00Z",
    "SubmissionStatusTypeID": 100
}