{
    "IsRecentlyVerified": false,
    "ID": 85086,
    "UUID": "B2FD0D5E-E5A9-4367-82AA-B4F3DD77BF5A",
    "DataProviderID": 1,
    "OperatorID": 23,
    "OperatorsReference": "25953",
    "UsageTypeID": 6,
    "AddressInfo": {
        "ID": 85432,
        "Title": "Hotel el Balcon de la Vera",
        "AddressLine1": "Carretera EX-203 KM. 75,6",
        "Town": "Villanueva de la Vera",
        "StateOrProvince": "Cáceres",
        "Postcode": "10470",
        "CountryID": 210,
        "Latitude": 40.132696,
        "Longitude": -5.416378,
        "ContactTelephone1": "+34 927567164",
        "DistanceUnit": 0
    },
    "Connections": [
        {
            "ID": 120844,
            "ConnectionTypeID": 30,
            "StatusTypeID": 50,
            "LevelID": 2,
            "Amps": 16,
            "Voltage": 400,
            "PowerKW": 11,
            "CurrentTypeID": 20,
            "Quantity": 2
        }
    ],
    "NumberOfPoints": 2,
    "GeneralComments": "2 Tesla Connectors, up to 11kW.Available for patrons only. Please see front desk.",
    "StatusTypeID": 50,
    "DateLastStatusUpdate": "2020-08-17T12:18:00Z",
    "DataQualityLevel": 1,
    "DateCreated": "2017-03-25T06:27:00Z",
    "SubmissionStatusTypeID": 200
}