{
    "IsRecentlyVerified": false,
    "ID": 128203,
    "UUID": "231DEA67-D640-479A-B9A8-D955D57105B5",
    "DataProviderID": 1,
    "OperatorID": 213,
    "OperatorsReference": "56815326e4b01a4163735482",
    "UsageTypeID": 1,
    "AddressInfo": {
        "ID": 128549,
        "Title": "Aire de Venoy Soleil Levant",
        "AddressLine1": "A6",
        "Town": "Venoy",
        "CountryID": 80,
        "Latitude": 47.7904672961183,
        "Longitude": 3.67060323039959,
        "DistanceUnit": 0
    },
    "Connections": [
        {
            "ID": 179416,
            "ConnectionTypeID": 33,
            "StatusTypeID": 0,
            "LevelID": 3,
            "PowerKW": 43,
            "CurrentTypeID": 30,
            "Quantity": 1
        },
        {
            "ID": 179417,
            "ConnectionTypeID": 2,
            "StatusTypeID": 100,
            "LevelID": 3,
            "PowerKW": 50,
            "CurrentTypeID": 30,
            "Quantity": 1
        },
        {
            "ID": 179418,
            "ConnectionTypeID": 1036,
            "StatusTypeID": 100,
            "LevelID": 3,
            "PowerKW": 43,
            "CurrentTypeID": 20,
            "Quantity": 1
        },
        {
            "ID": 203378,
            "ConnectionTypeID": 23,
            "StatusTypeID": 50,
            "LevelID": 2,
            "PowerKW": 3,
            "CurrentTypeID": 20,
            "Quantity": 1
        }
    ],
    "NumberOfPoints": 1,
    "StatusTypeID": 75,
    "DateLastStatusUpdate": "2020-01-05T20:28:00Z",
    "DataQualityLevel": 1,
    "DateCreated": "2019-06-17T19:53:00Z",
    "SubmissionStatusTypeID": 200
}