{
    "IsRecentlyVerified": false,
    "ID": 95773,
    "UUID": "9BD6B359-02E9-4486-8492-E9BE9B232E56",
    "DataProviderID": 1,
    "OperatorID": 2245,
    "UsageTypeID": 4,
    "AddressInfo": {
        "ID": 96119,
        "Title": "SWU Landratsamt",
        "AddressLine1": "Schillerstraße 30",
        "Town": "Ulm",
        "StateOrProvince": "Baden-Württemberg",
        "Postcode": "89077",
        "CountryID": 87,
        "Latitude": 48.395508963824064,
        "Longitude": 9.981331590018963,
        "ContactTelephone1": "+49 731 166 8810",
        "AccessComments": "24/7 nutzbar an der Kreuzung Schillerstraße/Hauffstraße. Betreiber sind die Stadtwerke Ulm SWU.",
        "RelatedURL": "http://www.swu.de/",
        "DistanceUnit": 0
    },
    "Connections": [
        {
            "ID": 135670,
            "ConnectionTypeID": 25,
            "StatusTypeID": 50,
            "LevelID": 2,
            "Amps": 16,
            "Voltage": 400,
            "PowerKW": 11,
            "CurrentTypeID": 20,
            "Quantity": 2
        },
        {
            "ID": 135671,
            "ConnectionTypeID": 28,
            "StatusTypeID": 50,
            "LevelID": 2,
            "Amps": 16,
            "Voltage": 230,
            "PowerKW": 3.7,
            "CurrentTypeID": 10,
            "Quantity": 2
        }
    ],
    "NumberOfPoints": 2,
    "StatusTypeID": 50,
    "DateLastStatusUpdate": "2017-11-24T06:52:00Z",
    "DataQualityLevel": 1,
    "DateCreated": "2017-11-24T06:52:00Z",
    "SubmissionStatusTypeID": 200
}