{
    "IsRecentlyVerified": false,
    "ID": 150569,
    "UUID": "95B854D0-347C-4C29-B3BA-4EA80712F8D9",
    "DataProviderID": 28,
    "DataProvidersReference": "FR*M13*P13031*001",
    "UsageTypeID": 5,
    "AddressInfo": {
        "ID": 150922,
        "Title": "LA DESTROUSSE - Avenue Du Mistral",
        "AddressLine1": "Avenue Du Mistral 0 LA DESTROUSSE",
        "CountryID": 80,
        "Latitude": 43.376505,
        "Longitude": 5.60471,
        "AccessComments": "24h/24 7j/7",
        "DistanceUnit": 0
    },
    "Connections": [
        {
            "ID": 209472,
            "ConnectionTypeID": 28,
            "StatusTypeID": 50,
            "LevelID": 2,
            "PowerKW": 22,
            "CurrentTypeID": 10
        },
        {
            "ID": 209473,
            "ConnectionTypeID": 1036,
            "StatusTypeID": 50,
            "LevelID": 2,
            "PowerKW": 22,
            "CurrentTypeID": 20
        },
        {
            "ID": 238705,
            "ConnectionTypeID": 28,
            "StatusTypeID": 50,
            "LevelID": 2,
            "PowerKW": 22,
            "CurrentTypeID": 10
        },
        {
            "ID": 238706,
            "ConnectionTypeID": 1036,
            "StatusTypeID": 50,
            "LevelID": 2,
            "PowerKW": 22,
            "CurrentTypeID": 20
        }
    ],
    "GeneralComments": "Recharge par badge et avec une application smartphone",
    "StatusTypeID": 50,
    "DateLastStatusUpdate": "2020-08-27T05:10:00Z",
    "DataQualityLevel": 2,
    "DateCreated": "2020-03-15T06:17:00Z",
    "SubmissionStatusTypeID": 100
}