{
    "IsRecentlyVerified": false,
    "ID": 88245,
    "UUID": "2E0846C2-75D8-4639-BB7E-0F4FE21F51B1",
    "DataProviderID": 1,
    "OperatorID": 23,
    "OperatorsReference": "30043",
    "UsageTypeID": 6,
    "AddressInfo": {
        "ID": 88591,
        "Title": "Hotel Castelbrac",
        "AddressLine1": "17 Avenue George V",
        "Town": "Dinard",
        "Postcode": "35800",
        "CountryID": 80,
        "Latitude": 48.634445,
        "Longitude": -2.049374,
        "ContactTelephone1": "+33 2 99 80 30 00",
        "DistanceUnit": 0
    },
    "Connections": [
        {
            "ID": 125172,
            "ConnectionTypeID": 30,
            "StatusTypeID": 50,
            "LevelID": 2,
            "Amps": 32,
            "Voltage": 400,
            "PowerKW": 22,
            "CurrentTypeID": 20,
            "Quantity": 1
        }
    ],
    "NumberOfPoints": 1,
    "GeneralComments": "1 Tesla Connector, up to 22kW.Available for patrons only. Self park.",
    "StatusTypeID": 50,
    "DateLastStatusUpdate": "2018-10-03T18:09:00Z",
    "DataQualityLevel": 1,
    "DateCreated": "2017-05-25T05:59:00Z",
    "SubmissionStatusTypeID": 200
}