{
    "IsRecentlyVerified": false,
    "ID": 73215,
    "UUID": "02755535-ACEA-4888-9818-7774FC27B83A",
    "DataProviderID": 1,
    "OperatorID": 1,
    "UsageTypeID": 4,
    "AddressInfo": {
        "ID": 73561,
        "Title": "Andorra Ana Maria Pla",
        "AddressLine1": "Carrer Maria Plà",
        "Town": "Andorra la Vella",
        "StateOrProvince": "Andorra la Vella",
        "Postcode": "AD500",
        "CountryID": 10,
        "Latitude": 42.5074970948136,
        "Longitude": 1.53325993232204,
        "RelatedURL": "http://www.feda.ad",
        "DistanceUnit": 0
    },
    "Connections": [
        {
            "ID": 105343,
            "ConnectionTypeID": 25,
            "StatusTypeID": 50,
            "LevelID": 2,
            "PowerKW": 22,
            "CurrentTypeID": 20,
            "Quantity": 2
        },
        {
            "ID": 105344,
            "ConnectionTypeID": 13,
            "StatusTypeID": 50,
            "LevelID": 2,
            "PowerKW": 3,
            "CurrentTypeID": 10,
            "Quantity": 2
        }
    ],
    "NumberOfPoints": 2,
    "StatusTypeID": 50,
    "DateLastStatusUpdate": "2016-11-15T21:28:00Z",
    "DataQualityLevel": 1,
    "DateCreated": "2016-11-14T11:38:00Z",
    "SubmissionStatusTypeID": 200
}