{
    "IsRecentlyVerified": false,
    "ID": 130054,
    "UUID": "56C4C308-80FF-463C-A12F-4FD317701B74",
    "DataProviderID": 1,
    "OperatorID": 3299,
    "UsageTypeID": 5,
    "UsageCost": "€8,00/session",
    "AddressInfo": {
        "ID": 130400,
        "Title": "IONITY Neckarburg Ost",
        "AddressLine1": "Rastanlage Neckarburg Ost, A81, 78661 Dietingen, Deutschland",
        "Town": "Dietingen",
        "Postcode": "78661",
        "CountryID": 87,
        "Latitude": 48.206218,
        "Longitude": 8.627155,
        "DistanceUnit": 0
    },
    "Connections": [
        {
            "ID": 182045,
            "ConnectionTypeID": 33,
            "StatusTypeID": 50,
            "LevelID": 3,
            "PowerKW": 350,
            "CurrentTypeID": 30,
            "Quantity": 4
        }
    ],
    "NumberOfPoints": 4,
    "StatusTypeID": 50,
    "DateLastStatusUpdate": "2019-08-01T22:19:00Z",
    "DataQualityLevel": 1,
    "DateCreated": "2019-07-30T12:58:00Z",
    "SubmissionStatusTypeID": 200
}