{
    "IsRecentlyVerified": false,
    "ID": 4042,
    "UUID": "47609896-99CE-4479-954A-303A24B123B9",
    "DataProviderID": 2,
    "DataProvidersReference": "38083",
    "UsageTypeID": 2,
    "AddressInfo": {
        "ID": 4043,
        "Title": "King County - King County Van Distribution Center",
        "AddressLine1": "18655 NE Union Hill Rd",
        "Town": "Redmond",
        "StateOrProvince": "WA",
        "Postcode": "98052",
        "CountryID": 2,
        "Latitude": 47.675897,
        "Longitude": -122.091237,
        "ContactTelephone1": "",
        "AccessComments": "",
        "RelatedURL": "",
        "DistanceUnit": 0
    },
    "Connections": [
        {
            "ID": 3343,
            "ConnectionTypeID": 1,
            "LevelID": 2,
            "Amps": 16,
            "Voltage": 230,
            "PowerKW": 3.7,
            "CurrentTypeID": 10,
            "Quantity": 3
        },
        {
            "ID": 20456,
            "ConnectionTypeID": 1,
            "LevelID": 2,
            "Quantity": 3
        }
    ],
    "DateLastConfirmed": "2011-08-25T00:00:00Z",
    "StatusTypeID": 0,
    "DateLastStatusUpdate": "2020-06-26T03:11:00Z",
    "DataQualityLevel": 1,
    "DateCreated": "2011-02-28T00:00:00Z",
    "SubmissionStatusTypeID": 100
}