{
    "IsRecentlyVerified": false,
    "ID": 157398,
    "UUID": "F2A643F3-ACE0-46B0-88F8-E959719F66DB",
    "DataProviderID": 1,
    "OperatorID": 19,
    "UsageTypeID": 1,
    "UsageCost": "Free",
    "AddressInfo": {
        "ID": 157752,
        "Title": "The Newt in Somerset",
        "AddressLine1": "Haspen",
        "Town": "Bruton",
        "StateOrProvince": "Somerset",
        "Postcode": "BA7 7NG",
        "CountryID": 1,
        "Latitude": 51.078181,
        "Longitude": -2.486792,
        "ContactTelephone1": "+44 (0)1963 577777",
        "AccessComments": "https://thenewtinsomerset.com/visitor-information  OPENING TIMES 1 May – 30 September 10am–6pm, last entrance 5pm 1 October – 30 April 10am–4.30pm, last entrance 3.30pm",
        "RelatedURL": "https://thenewtinsomerset.com/visitor-information",
        "DistanceUnit": 0
    },
    "Connections": [
        {
            "ID": 226700,
            "ConnectionTypeID": 25,
            "StatusTypeID": 150,
            "LevelID": 2,
            "Amps": 32,
            "Voltage": 230,
            "PowerKW": 22,
            "Quantity": 4
        }
    ],
    "NumberOfPoints": 4,
    "GeneralComments": "Public access during opening hours",
    "StatusTypeID": 50,
    "DateLastStatusUpdate": "2020-10-19T20:08:00Z",
    "DataQualityLevel": 1,
    "DateCreated": "2020-06-02T09:31:00Z",
    "SubmissionStatusTypeID": 200
}