{
    "IsRecentlyVerified": false,
    "ID": 63420,
    "UUID": "5B42E7E7-5120-48EE-AD8E-64346C8E0731",
    "DataProviderID": 26,
    "DataProvidersReference": "73800",
    "OperatorID": 73,
    "OperatorsReference": "EV-Box EVB-P1521015",
    "UsageCost": "0.00 jaarabonnement",
    "AddressInfo": {
        "ID": 63766,
        "Title": "Moeckenkamp 4",
        "AddressLine1": "Moeckenkamp 4",
        "Town": "Rheden",
        "Postcode": "6994 AX",
        "CountryID": 159,
        "Latitude": 52.01854,
        "Longitude": 6.05992,
        "RelatedURL": "http://www.ev-box.nl",
        "DistanceUnit": 0
    },
    "Connections": [
        {
            "ID": 80864,
            "ConnectionTypeID": 25,
            "LevelID": 2,
            "PowerKW": 11,
            "CurrentTypeID": 10
        },
        {
            "ID": 80865,
            "ConnectionTypeID": 25,
            "LevelID": 2,
            "PowerKW": 11,
            "CurrentTypeID": 10
        }
    ],
    "NumberOfPoints": 1,
    "StatusTypeID": 50,
    "DateLastStatusUpdate": "2016-06-04T02:44:00Z",
    "DataQualityLevel": 3,
    "DateCreated": "2016-03-03T12:30:00Z",
    "SubmissionStatusTypeID": 100
}