{
    "IsRecentlyVerified": false,
    "ID": 97960,
    "UUID": "B1EEF342-5991-41A7-9144-7C615D5D085D",
    "DataProviderID": 1,
    "OperatorID": 23,
    "OperatorsReference": "38586",
    "UsageTypeID": 4,
    "AddressInfo": {
        "ID": 98306,
        "Title": "Grand Hotel Guinigi",
        "AddressLine1": "Via Romana",
        "Town": "1247",
        "StateOrProvince": "Lucca",
        "Postcode": "55100",
        "CountryID": 112,
        "Latitude": 43.844908,
        "Longitude": 10.533249,
        "ContactTelephone1": "+39 0583 4991",
        "DistanceUnit": 0
    },
    "Connections": [
        {
            "ID": 138868,
            "ConnectionTypeID": 30,
            "StatusTypeID": 50,
            "LevelID": 2,
            "Amps": 32,
            "Voltage": 400,
            "PowerKW": 22,
            "CurrentTypeID": 20,
            "Quantity": 1
        }
    ],
    "NumberOfPoints": 1,
    "GeneralComments": "1 Tesla Connector, up to 22kW.Available for customers. Please call ahead.",
    "StatusTypeID": 50,
    "DateLastStatusUpdate": "2018-10-03T23:25:00Z",
    "DataQualityLevel": 1,
    "DateCreated": "2018-01-21T17:24:00Z",
    "SubmissionStatusTypeID": 200
}