{
    "IsRecentlyVerified": false,
    "ID": 18390,
    "UUID": "FFFB677A-3680-4338-84C3-673A93FE3A15",
    "DataProviderID": 18,
    "DataProvidersReference": "d40c4b6c8105a36bbe7f46b2375446e6",
    "OperatorID": 20,
    "UsageTypeID": 4,
    "AddressInfo": {
        "ID": 18735,
        "Title": "Loganberry Avenue",
        "AddressLine1": "Loganberry Avenue",
        "Town": "Salford",
        "Postcode": "M6 5FN",
        "CountryID": 1,
        "Latitude": 53.487846,
        "Longitude": -2.286247,
        "AccessComments": "",
        "RelatedURL": "http://www.chargeyourcar.org.uk",
        "DistanceUnit": 0
    },
    "Connections": [
        {
            "ID": 18612,
            "ConnectionTypeID": 25,
            "Reference": "1",
            "StatusTypeID": 50,
            "LevelID": 2,
            "Amps": 32,
            "Voltage": 230,
            "PowerKW": 7,
            "CurrentTypeID": 10
        },
        {
            "ID": 189393,
            "ConnectionTypeID": 25,
            "Reference": "2",
            "StatusTypeID": 50,
            "LevelID": 2,
            "Amps": 32,
            "Voltage": 230,
            "PowerKW": 7,
            "CurrentTypeID": 10
        }
    ],
    "DateLastStatusUpdate": "2020-03-12T15:48:00Z",
    "DataQualityLevel": 3,
    "DateCreated": "2013-07-19T08:10:00Z",
    "SubmissionStatusTypeID": 200
}