{
    "IsRecentlyVerified": false,
    "ID": 144454,
    "UUID": "CC530908-A2CD-4023-9DA1-CEE0EDE7CE67",
    "DataProviderID": 2,
    "DataProvidersReference": "145625",
    "UsageTypeID": 1,
    "AddressInfo": {
        "ID": 144806,
        "Title": "Virginia Garcia Dental Clinic",
        "AddressLine1": "44 N 11th Ave",
        "Town": "Cornelius",
        "StateOrProvince": "OR",
        "Postcode": "97113",
        "CountryID": 2,
        "Latitude": 45.52046,
        "Longitude": -123.057275,
        "ContactTelephone1": "503-359-8505",
        "AccessComments": "24 hours daily",
        "RelatedURL": "",
        "DistanceUnit": 0
    },
    "Connections": [
        {
            "ID": 200959,
            "ConnectionTypeID": 1,
            "LevelID": 2,
            "Amps": 16,
            "Voltage": 230,
            "PowerKW": 3.7,
            "CurrentTypeID": 10,
            "Quantity": 2
        }
    ],
    "StatusTypeID": 50,
    "DateLastStatusUpdate": "2020-06-26T03:09:00Z",
    "DataQualityLevel": 3,
    "DateCreated": "2019-12-24T09:23:00Z",
    "SubmissionStatusTypeID": 100
}