{
    "IsRecentlyVerified": false,
    "ID": 35684,
    "UUID": "882FB705-B684-48C5-A196-B3FB0C565649",
    "DataProviderID": 26,
    "DataProvidersReference": "33822",
    "OperatorID": 73,
    "OperatorsReference": "EV-Box EVB-P1228138",
    "UsageCost": "0.00 jaarabonnement",
    "AddressInfo": {
        "ID": 36030,
        "Title": "Dintelstraat 23",
        "AddressLine1": "Dintelstraat 23",
        "Town": "Den Haag",
        "Postcode": "2515 VJ",
        "CountryID": 159,
        "Latitude": 52.07298,
        "Longitude": 4.32634,
        "RelatedURL": "http://www.ev-box.nl",
        "DistanceUnit": 0
    },
    "Connections": [
        {
            "ID": 39195,
            "ConnectionTypeID": 25,
            "LevelID": 2,
            "PowerKW": 11,
            "CurrentTypeID": 10
        },
        {
            "ID": 48000,
            "ConnectionTypeID": 25,
            "LevelID": 2,
            "PowerKW": 11,
            "CurrentTypeID": 10
        }
    ],
    "NumberOfPoints": 1,
    "StatusTypeID": 50,
    "DateLastStatusUpdate": "2016-06-04T02:47:00Z",
    "DataQualityLevel": 3,
    "DateCreated": "2015-01-09T06:05:00Z",
    "SubmissionStatusTypeID": 100
}