{
    "IsRecentlyVerified": false,
    "ID": 128560,
    "UUID": "6475098B-5C19-4700-BA45-950CB796F5DB",
    "DataProviderID": 1,
    "OperatorID": 80,
    "UsageTypeID": 4,
    "AddressInfo": {
        "ID": 128906,
        "Title": "Genova Tommaseo | EnelX",
        "AddressLine1": "Piazza Tommaseo",
        "Town": "Genova",
        "StateOrProvince": "GE",
        "Postcode": "16129",
        "CountryID": 112,
        "Latitude": 44.4022984747691,
        "Longitude": 8.9545140609589,
        "RelatedURL": "https://www.enelx.com/it/it/emobility",
        "DistanceUnit": 0
    },
    "Connections": [
        {
            "ID": 179950,
            "ConnectionTypeID": 25,
            "StatusTypeID": 50,
            "LevelID": 2,
            "Amps": 32,
            "Voltage": 400,
            "PowerKW": 22,
            "CurrentTypeID": 20,
            "Quantity": 1
        },
        {
            "ID": 179951,
            "ConnectionTypeID": 36,
            "StatusTypeID": 50,
            "LevelID": 2,
            "Amps": 16,
            "Voltage": 240,
            "PowerKW": 3.7,
            "CurrentTypeID": 10,
            "Quantity": 1
        }
    ],
    "NumberOfPoints": 2,
    "StatusTypeID": 50,
    "DateLastStatusUpdate": "2019-06-26T10:23:00Z",
    "DataQualityLevel": 1,
    "DateCreated": "2019-06-26T10:23:00Z",
    "SubmissionStatusTypeID": 200
}