{
    "IsRecentlyVerified": false,
    "ID": 61696,
    "UUID": "5C48FEE3-95DC-4EA8-BB20-4993D63A8ADC",
    "DataProviderID": 1,
    "OperatorID": 23,
    "OperatorsReference": "13121",
    "UsageTypeID": 1,
    "UsageCost": "Free",
    "AddressInfo": {
        "ID": 62042,
        "Title": "Embassy Suites Myrtle Beach - Tesla",
        "AddressLine1": "9800 Queensway Blvd",
        "Town": "Myrtle Beach",
        "StateOrProvince": "SC",
        "Postcode": "29572",
        "CountryID": 2,
        "Latitude": 33.7670929,
        "Longitude": -78.7779998,
        "ContactTelephone1": "800-876-0010  877-798-3752",
        "AccessComments": "24 hours daily; for Tesla use only; see valet for access",
        "RelatedURL": "http://www.teslamotors.com/supercharger",
        "DistanceUnit": 0
    },
    "Connections": [
        {
            "ID": 78585,
            "ConnectionTypeID": 30,
            "StatusTypeID": 50,
            "LevelID": 2,
            "Amps": 16,
            "Voltage": 230,
            "PowerKW": 8,
            "CurrentTypeID": 10,
            "Quantity": 1
        }
    ],
    "NumberOfPoints": 1,
    "StatusTypeID": 50,
    "DateLastStatusUpdate": "2017-01-26T20:23:00Z",
    "DataQualityLevel": 3,
    "DateCreated": "2016-03-03T11:38:00Z",
    "SubmissionStatusTypeID": 100
}