{
    "IsRecentlyVerified": false,
    "ID": 112056,
    "UUID": "18A9BD04-58BE-4BD2-ABB8-D27FC60F55C2",
    "DataProviderID": 1,
    "OperatorID": 3385,
    "UsageTypeID": 1,
    "UsageCost": "$0.21/minute",
    "AddressInfo": {
        "ID": 112402,
        "Title": "BC Hydro - Britton Creek",
        "AddressLine1": "Exit 228 Coquihalla Lakes Rd,",
        "Town": "Fraser Valley B",
        "StateOrProvince": "BC",
        "Postcode": "V0X 1L0",
        "CountryID": 44,
        "Latitude": 49.6516669763748,
        "Longitude": -121.0010682754878,
        "ContactTelephone1": "855-900-7584",
        "AccessComments": "24 hours daily",
        "RelatedURL": "http://bchydro.com",
        "DistanceUnit": 0
    },
    "Connections": [
        {
            "ID": 157593,
            "ConnectionTypeID": 2,
            "StatusTypeID": 50,
            "LevelID": 3,
            "Amps": 100,
            "Voltage": 400,
            "PowerKW": 50,
            "CurrentTypeID": 30,
            "Quantity": 2
        },
        {
            "ID": 157594,
            "ConnectionTypeID": 32,
            "StatusTypeID": 50,
            "LevelID": 3,
            "Amps": 125,
            "Voltage": 400,
            "PowerKW": 50,
            "CurrentTypeID": 30,
            "Quantity": 2
        }
    ],
    "NumberOfPoints": 2,
    "StatusTypeID": 50,
    "DateLastStatusUpdate": "2021-08-05T08:33:00Z",
    "DataQualityLevel": 3,
    "DateCreated": "2018-10-18T23:37:00Z",
    "SubmissionStatusTypeID": 100
}