{
    "IsRecentlyVerified": false,
    "ID": 144356,
    "UUID": "FCFCFED0-BED1-494B-8CC5-E9B0B82EDC42",
    "DataProviderID": 2,
    "DataProvidersReference": "123283",
    "UsageTypeID": 2,
    "AddressInfo": {
        "ID": 144708,
        "Title": "Nike - Windrunner",
        "AddressLine1": "15405 SW Beaverton Creek Ct",
        "Town": "Beaverton",
        "StateOrProvince": "OR",
        "Postcode": "97003",
        "CountryID": 2,
        "Latitude": 45.495039,
        "Longitude": -122.835414,
        "ContactTelephone1": "",
        "AccessComments": "For employee use only",
        "RelatedURL": "",
        "DistanceUnit": 0
    },
    "Connections": [
        {
            "ID": 200855,
            "ConnectionTypeID": 1,
            "LevelID": 2,
            "Amps": 16,
            "Voltage": 230,
            "PowerKW": 3.7,
            "CurrentTypeID": 10,
            "Quantity": 4
        }
    ],
    "StatusTypeID": 50,
    "DateLastStatusUpdate": "2020-06-26T03:09:00Z",
    "DataQualityLevel": 3,
    "DateCreated": "2019-12-24T09:23:00Z",
    "SubmissionStatusTypeID": 100
}