{
    "IsRecentlyVerified": false,
    "ID": 152513,
    "UUID": "4DF726D1-6514-4DDB-AB54-7ACD5F1234C1",
    "DataProviderID": 28,
    "DataProvidersReference": "",
    "UsageTypeID": 5,
    "AddressInfo": {
        "ID": 152866,
        "Title": "BEAUMONT EN VERON 2691 - Rue du Parc",
        "AddressLine1": "Rue du Parc - Parvis Salle Polyvalente - 37420 BEAUMONT EN VERON",
        "CountryID": 80,
        "Latitude": 47.195244,
        "Longitude": 0.183346,
        "AccessComments": "24/24 7/7",
        "DistanceUnit": 0
    },
    "Connections": [
        {
            "ID": 213533,
            "ConnectionTypeID": 28,
            "StatusTypeID": 50,
            "LevelID": 2,
            "PowerKW": 18,
            "CurrentTypeID": 10
        },
        {
            "ID": 213534,
            "ConnectionTypeID": 25,
            "StatusTypeID": 50,
            "LevelID": 2,
            "PowerKW": 18,
            "CurrentTypeID": 10
        }
    ],
    "GeneralComments": "www.virtaev.fr",
    "StatusTypeID": 50,
    "DateLastStatusUpdate": "2020-03-15T10:53:00Z",
    "DataQualityLevel": 2,
    "DateCreated": "2020-03-15T10:53:00Z",
    "SubmissionStatusTypeID": 100
}