{
    "IsRecentlyVerified": false,
    "ID": 183413,
    "UUID": "770A84DC-48F3-4F8F-A1E1-9B8D2DA85447",
    "DataProviderID": 29,
    "DataProvidersReference": "13797",
    "OperatorID": 86,
    "AddressInfo": {
        "ID": 183772,
        "Title": "Krumme Meer 3",
        "AddressLine1": "Krumme Meer 3",
        "Town": "Haltern am See",
        "Postcode": "45721",
        "CountryID": 87,
        "Latitude": 51.732961,
        "Longitude": 7.167524,
        "DistanceUnit": 0
    },
    "Connections": [
        {
            "ID": 290373,
            "ConnectionTypeID": 1036,
            "StatusTypeID": 50,
            "LevelID": 3,
            "PowerKW": 43,
            "CurrentTypeID": 20
        },
        {
            "ID": 290374,
            "ConnectionTypeID": 33,
            "StatusTypeID": 50,
            "LevelID": 3,
            "PowerKW": 50,
            "CurrentTypeID": 30
        }
    ],
    "StatusTypeID": 50,
    "DateLastStatusUpdate": "2021-07-09T03:24:00Z",
    "MetadataValues": [
        {
            "ID": 15706,
            "MetadataFieldID": 4,
            "ItemValue": "Data from the German chargepoint registry provided by Bundesnetzagentur.de under the CC-BY 4.0 license"
        }
    ],
    "DataQualityLevel": 3,
    "DateCreated": "2021-07-08T10:04:00Z",
    "SubmissionStatusTypeID": 100
}