{
    "IsRecentlyVerified": false,
    "ID": 103669,
    "UUID": "D9B1F55F-0C28-41D2-85ED-3770BD83B28A",
    "DataProviderID": 1,
    "OperatorID": 23,
    "OperatorsReference": "42777",
    "UsageTypeID": 4,
    "AddressInfo": {
        "ID": 104015,
        "Title": "Lønborggaard Feriecenter",
        "AddressLine1": "Lønborggaardvej 1",
        "Town": "Tarm",
        "Postcode": "6880",
        "CountryID": 65,
        "Latitude": 55.902843,
        "Longitude": 8.414935,
        "ContactTelephone1": "+45 23447899",
        "DistanceUnit": 0
    },
    "Connections": [
        {
            "ID": 146339,
            "ConnectionTypeID": 30,
            "StatusTypeID": 50,
            "LevelID": 2,
            "Amps": 32,
            "Voltage": 230,
            "PowerKW": 17,
            "CurrentTypeID": 20,
            "Quantity": 2
        }
    ],
    "NumberOfPoints": 2,
    "GeneralComments": "2 Tesla Connectors, up to 17kW.Available for customers. Self park.",
    "StatusTypeID": 50,
    "DateLastStatusUpdate": "2018-10-03T15:03:00Z",
    "DataQualityLevel": 1,
    "DateCreated": "2018-05-05T05:50:00Z",
    "SubmissionStatusTypeID": 200
}