{
    "IsRecentlyVerified": false,
    "ID": 50677,
    "UUID": "C52D4C72-FEF9-4206-9457-344EA8D6E589",
    "DataProviderID": 26,
    "DataProvidersReference": "62887",
    "OperatorID": 178,
    "OperatorsReference": "EVnetNL PNB-ENO082",
    "UsageCost": "0.00 jaarabonnement",
    "AddressInfo": {
        "ID": 51023,
        "Title": "Suiteweg 27",
        "AddressLine1": "Suiteweg 27",
        "Town": "'s-Hertogenbosch",
        "Postcode": "5245 BW",
        "CountryID": 159,
        "Latitude": 51.733304,
        "Longitude": 5.34832,
        "ContactTelephone1": "0800-3522365",
        "RelatedURL": "http://www.evnet.nl",
        "DistanceUnit": 0
    },
    "Connections": [
        {
            "ID": 62464,
            "ConnectionTypeID": 25,
            "LevelID": 2,
            "PowerKW": 11,
            "CurrentTypeID": 10
        }
    ],
    "NumberOfPoints": 2,
    "StatusTypeID": 50,
    "DateLastStatusUpdate": "2016-06-04T02:40:00Z",
    "DataQualityLevel": 3,
    "DateCreated": "2015-07-22T09:53:00Z",
    "SubmissionStatusTypeID": 100
}