{
    "UserComments": [
        {
            "ID": 23105,
            "ChargePointID": 162842,
            "CommentTypeID": 10,
            "UserName": "Robert Seemueller",
            "Rating": 4,
            "DateCreated": "2020-08-18T01:58:42.867Z",
            "User": {
                "ID": 19108,
                "Username": "Robert Seemueller"
            },
            "CheckinStatusTypeID": 140,
            "IsActionedByEditor": false
        }
    ],
    "MediaItems": [
        {
            "ID": 24302,
            "ChargePointID": 162842,
            "ItemURL": "https://s3-ap-southeast-2.amazonaws.com/openchargemap/images/US/OCM162842/OCM-162842.orig.2020081802003193.jpg",
            "ItemThumbnailURL": "https://s3-ap-southeast-2.amazonaws.com/openchargemap/images/US/OCM162842/OCM-162842.thmb.2020081802003193.jpg",
            "Comment": "",
            "IsEnabled": true,
            "IsVideo": false,
            "IsFeaturedItem": false,
            "IsExternalResource": false,
            "User": {
                "ID": 19108,
                "Username": "Robert Seemueller"
            },
            "DateCreated": "2020-08-18T02:01:00Z"
        },
        {
            "ID": 24301,
            "ChargePointID": 162842,
            "ItemURL": "https://s3-ap-southeast-2.amazonaws.com/openchargemap/images/US/OCM162842/OCM-162842.orig.2020081802000651.jpg",
            "ItemThumbnailURL": "https://s3-ap-southeast-2.amazonaws.com/openchargemap/images/US/OCM162842/OCM-162842.thmb.2020081802000651.jpg",
            "Comment": "",
            "IsEnabled": true,
            "IsVideo": false,
            "IsFeaturedItem": false,
            "IsExternalResource": false,
            "User": {
                "ID": 19108,
                "Username": "Robert Seemueller"
            },
            "DateCreated": "2020-08-18T02:00:00Z"
        },
        {
            "ID": 24300,
            "ChargePointID": 162842,
            "ItemURL": "https://s3-ap-southeast-2.amazonaws.com/openchargemap/images/US/OCM162842/OCM-162842.orig.2020081801591943.jpg",
            "ItemThumbnailURL": "https://s3-ap-southeast-2.amazonaws.com/openchargemap/images/US/OCM162842/OCM-162842.thmb.2020081801591943.jpg",
            "Comment": "",
            "IsEnabled": true,
            "IsVideo": false,
            "IsFeaturedItem": false,
            "IsExternalResource": false,
            "User": {
                "ID": 19108,
                "Username": "Robert Seemueller"
            },
            "DateCreated": "2020-08-18T01:59:00Z"
        }
    ],
    "IsRecentlyVerified": false,
    "ID": 162842,
    "UUID": "B71D5B13-8EC8-472D-BF15-CBB190F6DD18",
    "DataProviderID": 1,
    "OperatorID": 59,
    "UsageTypeID": 1,
    "UsageCost": "Free",
    "AddressInfo": {
        "ID": 163199,
        "Title": "Catholic Health Genesee Ramp",
        "AddressLine1": "144 Genesee Street",
        "Town": "Buffalo",
        "StateOrProvince": "NY",
        "Postcode": "14203",
        "CountryID": 2,
        "Latitude": 42.89125356858784,
        "Longitude": -78.86818825877197,
        "DistanceUnit": 0
    },
    "Connections": [
        {
            "ID": 234374,
            "ConnectionTypeID": 1,
            "StatusTypeID": 50,
            "LevelID": 2,
            "PowerKW": 7,
            "Quantity": 8
        }
    ],
    "NumberOfPoints": 4,
    "StatusTypeID": 50,
    "DateLastStatusUpdate": "2020-08-18T02:01:00Z",
    "DataQualityLevel": 1,
    "DateCreated": "2020-08-18T01:58:00Z",
    "SubmissionStatusTypeID": 200
}