{
    "IsRecentlyVerified": false,
    "ID": 126140,
    "UUID": "44667B15-03EE-4A5B-AC60-3B5471F3D741",
    "DataProviderID": 1,
    "OperatorID": 3,
    "OperatorsReference": "PG-81113",
    "UsageTypeID": 4,
    "UsageCost": "£0.18/kWh",
    "AddressInfo": {
        "ID": 126486,
        "Title": "Milton Park-5 Park Drive",
        "AddressLine1": "5 Park Drive",
        "Town": "Milton Park",
        "StateOrProvince": "Oxon",
        "Postcode": "OX14 4RY",
        "CountryID": 1,
        "Latitude": 51.621078,
        "Longitude": -1.298187,
        "DistanceUnit": 0
    },
    "Connections": [
        {
            "ID": 176786,
            "ConnectionTypeID": 25,
            "StatusTypeID": 50,
            "LevelID": 2,
            "Amps": 32,
            "Voltage": 230,
            "PowerKW": 7,
            "CurrentTypeID": 10,
            "Quantity": 2
        }
    ],
    "NumberOfPoints": 2,
    "GeneralComments": "This is an open charge unit installed at the Milton Park Innovation Centre in Park Drive, Milton Park, Oxfordshire",
    "StatusTypeID": 50,
    "DateLastStatusUpdate": "2019-05-13T12:06:00Z",
    "DataQualityLevel": 1,
    "DateCreated": "2019-05-13T12:06:00Z",
    "SubmissionStatusTypeID": 200
}