{
    "IsRecentlyVerified": false,
    "ID": 136089,
    "UUID": "EFE4D7A9-99D3-432B-8E0F-88AAD525FAC3",
    "DataProviderID": 18,
    "DataProvidersReference": "1cb3a246a0d7e6a0e47110a1cd5723af",
    "OperatorID": 2244,
    "UsageTypeID": 4,
    "AddressInfo": {
        "ID": 136435,
        "Title": "Foster Road",
        "AddressLine1": "Foster Road",
        "Town": "London",
        "Postcode": "W4 4NT",
        "CountryID": 1,
        "Latitude": 51.48936,
        "Longitude": -0.2615,
        "AccessComments": "",
        "RelatedURL": "https://www.ubitricity.com",
        "DistanceUnit": 0
    },
    "Connections": [
        {
            "ID": 190516,
            "ConnectionTypeID": 25,
            "Reference": "steob100000663",
            "StatusTypeID": 50,
            "LevelID": 2,
            "Amps": 16,
            "Voltage": 230,
            "PowerKW": 3.7,
            "CurrentTypeID": 10
        }
    ],
    "StatusTypeID": 0,
    "DateLastStatusUpdate": "2021-04-25T05:46:00Z",
    "MetadataValues": [
        {
            "ID": 5941,
            "MetadataFieldID": 4,
            "ItemValue": "Contains public sector information licensed under the Open Government Licence v2.0. http://www.nationalarchives.gov.uk/doc/open-government-licence/version/2/"
        }
    ],
    "DataQualityLevel": 3,
    "DateCreated": "2019-12-24T05:22:00Z",
    "SubmissionStatusTypeID": 100
}