{
    "IsRecentlyVerified": false,
    "ID": 38192,
    "UUID": "AE327529-C061-4C8C-A5F3-DEC975353EAB",
    "DataProviderID": 26,
    "DataProvidersReference": "35124",
    "OperatorID": 73,
    "OperatorsReference": "EV-Box EVB-P1339215",
    "UsageCost": "0.00 jaarabonnement",
    "AddressInfo": {
        "ID": 38538,
        "Title": "Kamerlingh Onneslaan",
        "AddressLine1": "Kamerlingh Onneslaan",
        "Town": "Lelystad",
        "Postcode": "8218 MA",
        "CountryID": 159,
        "Latitude": 52.47359,
        "Longitude": 5.51045,
        "RelatedURL": "http://www.ev-box.nl",
        "DistanceUnit": 0
    },
    "Connections": [
        {
            "ID": 41703,
            "ConnectionTypeID": 25,
            "LevelID": 2,
            "PowerKW": 11,
            "CurrentTypeID": 10
        },
        {
            "ID": 49513,
            "ConnectionTypeID": 25,
            "LevelID": 2,
            "PowerKW": 11,
            "CurrentTypeID": 10
        },
        {
            "ID": 90942,
            "ConnectionTypeID": 25,
            "LevelID": 2,
            "PowerKW": 11
        },
        {
            "ID": 90943,
            "ConnectionTypeID": 25,
            "LevelID": 2,
            "PowerKW": 11
        }
    ],
    "NumberOfPoints": 1,
    "StatusTypeID": 50,
    "DateLastStatusUpdate": "2016-06-04T02:54:00Z",
    "DataQualityLevel": 3,
    "DateCreated": "2015-01-09T06:07:00Z",
    "SubmissionStatusTypeID": 100
}