{
    "IsRecentlyVerified": false,
    "ID": 143462,
    "UUID": "8939F4AF-9228-4471-9EDF-3D0BD88E6C1E",
    "DataProviderID": 2,
    "DataProvidersReference": "129477",
    "OperatorID": 89,
    "UsageTypeID": 1,
    "AddressInfo": {
        "ID": 143814,
        "Title": "County of Lambton 6 - North Lambton Lodge",
        "AddressLine1": "39 Morris Street",
        "Town": "Forest",
        "StateOrProvince": "ON",
        "Postcode": "N0N 1J0",
        "CountryID": 44,
        "Latitude": 43.092505,
        "Longitude": -81.995403,
        "ContactTelephone1": "888-356-8911",
        "AccessComments": "24 hours daily",
        "RelatedURL": "https://flo.ca/",
        "DistanceUnit": 0
    },
    "Connections": [
        {
            "ID": 199784,
            "ConnectionTypeID": 1,
            "LevelID": 2,
            "Amps": 16,
            "Voltage": 230,
            "PowerKW": 3.7,
            "CurrentTypeID": 10,
            "Quantity": 2
        }
    ],
    "StatusTypeID": 50,
    "DateLastStatusUpdate": "2020-06-26T03:06:00Z",
    "DataQualityLevel": 3,
    "DateCreated": "2019-12-24T09:21:00Z",
    "SubmissionStatusTypeID": 100
}