{
    "IsRecentlyVerified": false,
    "ID": 115581,
    "UUID": "A3567ECB-5618-4367-94B1-51573BE50EF7",
    "DataProviderID": 2,
    "DataProvidersReference": "113195",
    "OperatorID": 23,
    "UsageTypeID": 2,
    "AddressInfo": {
        "ID": 115927,
        "Title": "Airbnb - Sunset - Tesla Destination",
        "AddressLine1": "1500 Sunset Dr",
        "Town": "Pacific Grove",
        "StateOrProvince": "CA",
        "Postcode": "93950",
        "CountryID": 2,
        "Latitude": 36.631798,
        "Longitude": -121.937173,
        "ContactTelephone1": "",
        "AccessComments": "Available for Airbnb patrons only; for Tesla use only",
        "RelatedURL": "https://www.tesla.com/destination-charging",
        "DistanceUnit": 0
    },
    "Connections": [
        {
            "ID": 162602,
            "ConnectionTypeID": 0,
            "LevelID": 2,
            "Amps": 16,
            "Voltage": 230,
            "PowerKW": 3,
            "CurrentTypeID": 10,
            "Quantity": 1
        }
    ],
    "DateLastStatusUpdate": "2019-04-06T04:02:00Z",
    "DataQualityLevel": 3,
    "DateCreated": "2019-02-11T07:13:00Z",
    "SubmissionStatusTypeID": 100
}