{
    "IsRecentlyVerified": false,
    "ID": 68582,
    "UUID": "9899D449-2068-4299-B047-5E64433BF992",
    "DataProviderID": 1,
    "OperatorID": 2245,
    "UsageTypeID": 4,
    "AddressInfo": {
        "ID": 68928,
        "Title": "SWU Ladesäule",
        "AddressLine1": "Pranger 9",
        "Town": "Ulm-Wiblingen",
        "Postcode": "89077",
        "CountryID": 87,
        "Latitude": 48.3601732,
        "Longitude": 9.988255999999978,
        "ContactTelephone1": "0731 60000",
        "AccessComments": "Rund um die Uhr (24/7) nutzbar\r\n",
        "RelatedURL": "http://www.swu.de/",
        "DistanceUnit": 0
    },
    "Connections": [
        {
            "ID": 96078,
            "ConnectionTypeID": 28,
            "StatusTypeID": 50,
            "LevelID": 2,
            "Voltage": 230,
            "PowerKW": 3.7,
            "CurrentTypeID": 10,
            "Quantity": 2
        },
        {
            "ID": 96079,
            "ConnectionTypeID": 25,
            "StatusTypeID": 50,
            "LevelID": 2,
            "PowerKW": 11,
            "CurrentTypeID": 20,
            "Quantity": 2
        },
        {
            "ID": 96080,
            "ConnectionTypeID": 16,
            "StatusTypeID": 50,
            "LevelID": 2,
            "Amps": 16,
            "Voltage": 230,
            "PowerKW": 3.7,
            "CurrentTypeID": 10,
            "Quantity": 0
        },
        {
            "ID": 96081,
            "ConnectionTypeID": 17,
            "Quantity": 0
        }
    ],
    "NumberOfPoints": 4,
    "GeneralComments": "\r\n",
    "StatusTypeID": 50,
    "DateLastStatusUpdate": "2016-06-12T15:00:00Z",
    "DataQualityLevel": 1,
    "DateCreated": "2016-06-12T15:00:00Z",
    "SubmissionStatusTypeID": 200
}