{
    "IsRecentlyVerified": false,
    "ID": 5405,
    "UUID": "E9C41C58-BA93-4E2E-9BF4-36789E2CC51F",
    "DataProviderID": 1,
    "DataProvidersReference": "LRS-00031",
    "OperatorID": 21,
    "UsageTypeID": 4,
    "UsageCost": "Mobi.E compatible card",
    "AddressInfo": {
        "ID": 5344,
        "Title": "LRS-00031",
        "AddressLine1": "Rua Mouzinho de Albuquerque ",
        "Town": "Loures",
        "Postcode": "2685-221",
        "CountryID": 180,
        "Latitude": 38.783417,
        "Longitude": -9.111183,
        "RelatedURL": "http://www.mobie.pt",
        "DistanceUnit": 0
    },
    "Connections": [
        {
            "ID": 33318,
            "ConnectionTypeID": 25,
            "StatusTypeID": 50,
            "LevelID": 2,
            "Amps": 16,
            "Voltage": 230,
            "PowerKW": 11,
            "CurrentTypeID": 20,
            "Quantity": 2
        }
    ],
    "NumberOfPoints": 2,
    "StatusTypeID": 50,
    "DateLastStatusUpdate": "2020-08-11T20:54:00Z",
    "DataQualityLevel": 1,
    "DateCreated": "2011-08-25T12:48:00Z",
    "SubmissionStatusTypeID": 100
}