{
    "IsRecentlyVerified": false,
    "ID": 49170,
    "UUID": "9E53F359-8F43-439B-9C92-DC8C005E27A2",
    "DataProviderID": 1,
    "OperatorID": 45,
    "UsageTypeID": 1,
    "UsageCost": "0",
    "AddressInfo": {
        "ID": 49516,
        "Title": "Beschaffungsamt",
        "AddressLine1": "Brühler Straße 3",
        "AddressLine2": "Nordstadt",
        "Town": "Bonn",
        "StateOrProvince": "Bonn",
        "Postcode": "53119",
        "CountryID": 87,
        "Latitude": 50.7409428680458,
        "Longitude": 7.0741455566223,
        "AccessComments": "Aufgeständerte Box vor großem grünen \"Tanke schön\" Plakat . Durchgehend kostenlos nutzbar! Betreiber sind die Stadtwerke Bonn, jedoch keine Ladekarte nötig.",
        "DistanceUnit": 0
    },
    "Connections": [
        {
            "ID": 60763,
            "ConnectionTypeID": 25,
            "StatusTypeID": 50,
            "LevelID": 2,
            "Amps": 32,
            "Voltage": 400,
            "PowerKW": 22,
            "CurrentTypeID": 20,
            "Quantity": 1
        },
        {
            "ID": 60764,
            "ConnectionTypeID": 28,
            "StatusTypeID": 50,
            "LevelID": 2,
            "Amps": 16,
            "Voltage": 230,
            "PowerKW": 2.7,
            "CurrentTypeID": 10,
            "Quantity": 1
        }
    ],
    "NumberOfPoints": 2,
    "StatusTypeID": 50,
    "DateLastStatusUpdate": "2015-07-12T16:56:00Z",
    "DataQualityLevel": 1,
    "DateCreated": "2015-07-12T16:29:00Z",
    "SubmissionStatusTypeID": 200
}