{
    "IsRecentlyVerified": false,
    "ID": 88988,
    "UUID": "34888DB6-0479-4E24-B99F-EED549F91D00",
    "DataProviderID": 1,
    "OperatorID": 3,
    "OperatorsReference": "PG-81104",
    "UsageTypeID": 6,
    "UsageCost": "1",
    "AddressInfo": {
        "ID": 89334,
        "Title": "Murley Stratford-Hyundai",
        "AddressLine1": "Western Road",
        "Town": "Warwickshire",
        "Postcode": "CV37 0AH",
        "CountryID": 1,
        "Latitude": 52.196416,
        "Longitude": -1.714807,
        "DistanceUnit": 0
    },
    "Connections": [
        {
            "ID": 126287,
            "ConnectionTypeID": 25,
            "StatusTypeID": 50,
            "LevelID": 2,
            "Amps": 32,
            "Voltage": 230,
            "PowerKW": 7,
            "CurrentTypeID": 10,
            "Quantity": 2
        }
    ],
    "NumberOfPoints": 3,
    "GeneralComments": "This is an open charge unit installed at the Murley Stratford - Hyundai dealership in Western Road, Stratford-Upon-Avon, Warwickshire",
    "StatusTypeID": 0,
    "DateLastStatusUpdate": "2020-02-02T06:25:00Z",
    "DataQualityLevel": 1,
    "DateCreated": "2017-06-17T05:35:00Z",
    "SubmissionStatusTypeID": 200
}