{
    "IsRecentlyVerified": false,
    "ID": 87782,
    "UUID": "7EF07AD9-61F2-4FC1-963C-B2A5A8F04AAC",
    "DataProviderID": 1,
    "DataProvidersReference": "4020",
    "AddressInfo": {
        "ID": 88128,
        "Title": "Vattenfall Destinationsladdning",
        "AddressLine1": "Brobacken 1",
        "Town": "LERUM",
        "StateOrProvince": "VÄSTRA GÖTALAND",
        "Postcode": "44330",
        "CountryID": 216,
        "Latitude": 57.77017,
        "Longitude": 12.27022,
        "AccessComments": "",
        "DistanceUnit": 0
    },
    "Connections": [
        {
            "ID": 124428,
            "ConnectionTypeID": 0,
            "Reference": "1",
            "LevelID": 2,
            "Amps": 16,
            "Voltage": 230,
            "PowerKW": 3.7,
            "Comments": "Mode 3"
        },
        {
            "ID": 124429,
            "ConnectionTypeID": 0,
            "Reference": "2",
            "LevelID": 2,
            "Amps": 16,
            "Voltage": 230,
            "PowerKW": 3.7,
            "Comments": "Mode 3"
        }
    ],
    "NumberOfPoints": 2,
    "DateLastStatusUpdate": "2020-05-26T08:21:00Z",
    "DataQualityLevel": 2,
    "DateCreated": "2017-05-16T11:07:00Z",
    "SubmissionStatusTypeID": 100
}