{
    "IsRecentlyVerified": false,
    "ID": 178736,
    "UUID": "DD10847E-27AB-4A98-AE4E-D8387E68694E",
    "DataProviderID": 29,
    "DataProvidersReference": "4888",
    "AddressInfo": {
        "ID": 179095,
        "Title": "Industriestraße 42",
        "AddressLine1": "Industriestraße 42",
        "Town": "Ötigheim",
        "Postcode": "76470",
        "CountryID": 87,
        "Latitude": 48.888488,
        "Longitude": 8.240907,
        "DistanceUnit": 0
    },
    "Connections": [
        {
            "ID": 279580,
            "ConnectionTypeID": 25,
            "StatusTypeID": 50,
            "LevelID": 2,
            "PowerKW": 22,
            "CurrentTypeID": 20
        },
        {
            "ID": 279581,
            "ConnectionTypeID": 25,
            "StatusTypeID": 50,
            "LevelID": 2,
            "PowerKW": 22,
            "CurrentTypeID": 20
        }
    ],
    "StatusTypeID": 0,
    "DateLastStatusUpdate": "2021-07-09T03:14:00Z",
    "MetadataValues": [
        {
            "ID": 11030,
            "MetadataFieldID": 4,
            "ItemValue": "Data from the German chargepoint registry provided by Bundesnetzagentur.de under the CC-BY 4.0 license"
        }
    ],
    "DataQualityLevel": 3,
    "DateCreated": "2021-07-08T09:50:00Z",
    "SubmissionStatusTypeID": 100
}