{
    "IsRecentlyVerified": false,
    "ID": 185674,
    "UUID": "1205731D-1E57-429E-8E27-4EDF7DCED0FB",
    "DataProviderID": 29,
    "DataProvidersReference": "21349",
    "OperatorID": 86,
    "AddressInfo": {
        "ID": 186033,
        "Title": "Landstraße 83",
        "AddressLine1": "Landstraße 83",
        "Town": "Forbach",
        "Postcode": "76596",
        "CountryID": 87,
        "Latitude": 48.652921,
        "Longitude": 8.32294,
        "DistanceUnit": 0
    },
    "Connections": [
        {
            "ID": 295980,
            "ConnectionTypeID": 28,
            "StatusTypeID": 50,
            "LevelID": 2,
            "PowerKW": 22,
            "CurrentTypeID": 20
        },
        {
            "ID": 295981,
            "ConnectionTypeID": 25,
            "StatusTypeID": 50,
            "LevelID": 2,
            "PowerKW": 22,
            "CurrentTypeID": 20
        },
        {
            "ID": 295982,
            "ConnectionTypeID": 28,
            "StatusTypeID": 50,
            "LevelID": 2,
            "PowerKW": 22,
            "CurrentTypeID": 20
        },
        {
            "ID": 295983,
            "ConnectionTypeID": 25,
            "StatusTypeID": 50,
            "LevelID": 2,
            "PowerKW": 22,
            "CurrentTypeID": 20
        }
    ],
    "StatusTypeID": 50,
    "DateLastStatusUpdate": "2021-07-12T02:41:00Z",
    "MetadataValues": [
        {
            "ID": 17918,
            "MetadataFieldID": 4,
            "ItemValue": "Data from the German chargepoint registry provided by Bundesnetzagentur.de under the CC-BY 4.0 license"
        }
    ],
    "DataQualityLevel": 3,
    "DateCreated": "2021-07-12T02:41:00Z",
    "SubmissionStatusTypeID": 100
}