{
    "IsRecentlyVerified": false,
    "ID": 160783,
    "UUID": "789AB32F-A1CF-4CBE-A540-B17EAD7E1781",
    "DataProviderID": 2,
    "DataProvidersReference": "157790",
    "UsageTypeID": 2,
    "AddressInfo": {
        "ID": 161140,
        "Title": "British Columbia Hydro and Power Authority",
        "AddressLine1": "41395 Highway 16",
        "Town": "Tlell",
        "StateOrProvince": "BC",
        "Postcode": "V0T 1Y0",
        "CountryID": 44,
        "Latitude": 53.544769,
        "Longitude": -131.944337,
        "ContactTelephone1": "",
        "AccessComments": "",
        "RelatedURL": "",
        "DistanceUnit": 0
    },
    "Connections": [
        {
            "ID": 231396,
            "ConnectionTypeID": 2,
            "LevelID": 3,
            "Amps": 100,
            "Voltage": 400,
            "PowerKW": 40,
            "CurrentTypeID": 30,
            "Quantity": 1
        },
        {
            "ID": 231397,
            "ConnectionTypeID": 32,
            "LevelID": 3,
            "Amps": 100,
            "Voltage": 400,
            "PowerKW": 40,
            "CurrentTypeID": 30,
            "Quantity": 1
        }
    ],
    "GeneralComments": "Planned for future date. Not Operational.",
    "DatePlanned": "2020-09-01T00:00:00Z",
    "StatusTypeID": 150,
    "DateLastStatusUpdate": "2020-06-26T03:12:00Z",
    "DataQualityLevel": 3,
    "DateCreated": "2020-06-26T03:12:00Z",
    "SubmissionStatusTypeID": 100
}