{
    "IsRecentlyVerified": false,
    "ID": 162567,
    "UUID": "597F45ED-3A0E-47C1-A14E-44A85ABD5008",
    "DataProviderID": 1,
    "OperatorID": 125,
    "UsageTypeID": 4,
    "AddressInfo": {
        "ID": 162924,
        "Title": "Schnellrestaurant McDonalds",
        "AddressLine1": "Eutiner Straße 57-59",
        "Town": "Neustadt in Holstein",
        "StateOrProvince": "Ostholstein",
        "Postcode": "23730",
        "CountryID": 87,
        "Latitude": 54.09995832427356,
        "Longitude": 10.79468904593773,
        "AccessComments": "24/7 verfügbare Ladesäule direkt unter dem weithin sichtbaren gelben Schild mit dem \"M\". ",
        "DistanceUnit": 0
    },
    "Connections": [
        {
            "ID": 233976,
            "ConnectionTypeID": 25,
            "StatusTypeID": 50,
            "LevelID": 3,
            "Amps": 63,
            "Voltage": 400,
            "PowerKW": 43,
            "CurrentTypeID": 20,
            "Quantity": 1
        },
        {
            "ID": 233977,
            "ConnectionTypeID": 33,
            "StatusTypeID": 50,
            "LevelID": 3,
            "PowerKW": 50,
            "CurrentTypeID": 30,
            "Quantity": 1
        },
        {
            "ID": 233978,
            "ConnectionTypeID": 2,
            "StatusTypeID": 50,
            "LevelID": 3,
            "PowerKW": 50,
            "CurrentTypeID": 30,
            "Quantity": 1
        }
    ],
    "NumberOfPoints": 3,
    "StatusTypeID": 50,
    "DateLastStatusUpdate": "2020-08-12T05:20:00Z",
    "DataQualityLevel": 1,
    "DateCreated": "2020-08-12T05:20:00Z",
    "SubmissionStatusTypeID": 200
}