{
    "IsRecentlyVerified": false,
    "ID": 111313,
    "UUID": "B89D16AF-ABA3-4D33-8046-64E89B250F3B",
    "DataProviderID": 1,
    "OperatorID": 5,
    "UsageTypeID": 2,
    "UsageCost": "0",
    "AddressInfo": {
        "ID": 111659,
        "Title": "Cisco Systems OTT01",
        "AddressLine1": "2000 Innovation Dr",
        "Town": "Ottawa",
        "StateOrProvince": "ON",
        "Postcode": "K2K 3E8",
        "CountryID": 44,
        "Latitude": 45.3427931749001,
        "Longitude": -75.9264941517694,
        "ContactTelephone1": "888-758-4389",
        "AccessComments": "24 hours daily",
        "RelatedURL": "http://www.chargepoint.com/",
        "DistanceUnit": 0
    },
    "Connections": [
        {
            "ID": 156714,
            "ConnectionTypeID": 1,
            "StatusTypeID": 50,
            "LevelID": 2,
            "Amps": 16,
            "Voltage": 230,
            "PowerKW": 3,
            "CurrentTypeID": 10,
            "Quantity": 4
        }
    ],
    "NumberOfPoints": 4,
    "StatusTypeID": 50,
    "DateLastStatusUpdate": "2019-08-06T08:34:00Z",
    "DataQualityLevel": 3,
    "DateCreated": "2018-10-18T23:37:00Z",
    "SubmissionStatusTypeID": 100
}