{
    "IsRecentlyVerified": false,
    "ID": 152390,
    "UUID": "EFA29A2E-8547-4052-971B-2D225859ED4A",
    "DataProviderID": 28,
    "DataProvidersReference": "FR*S86*PSORE*B056",
    "UsageTypeID": 5,
    "AddressInfo": {
        "ID": 152743,
        "Title": "B056",
        "AddressLine1": "Place de la mairie - 86200 - Loudun",
        "CountryID": 80,
        "Latitude": 47.0102,
        "Longitude": 0.08278,
        "AccessComments": "24/24 7/7 jours",
        "DistanceUnit": 0
    },
    "Connections": [
        {
            "ID": 213324,
            "ConnectionTypeID": 28,
            "StatusTypeID": 50,
            "LevelID": 2,
            "PowerKW": 18,
            "CurrentTypeID": 10
        },
        {
            "ID": 213325,
            "ConnectionTypeID": 25,
            "StatusTypeID": 50,
            "LevelID": 2,
            "PowerKW": 18,
            "CurrentTypeID": 20
        },
        {
            "ID": 246207,
            "ConnectionTypeID": 28,
            "StatusTypeID": 50,
            "LevelID": 2,
            "PowerKW": 18,
            "CurrentTypeID": 10
        },
        {
            "ID": 246208,
            "ConnectionTypeID": 25,
            "StatusTypeID": 50,
            "LevelID": 2,
            "PowerKW": 18,
            "CurrentTypeID": 20
        }
    ],
    "GeneralComments": "",
    "StatusTypeID": 50,
    "DateLastStatusUpdate": "2020-08-27T05:13:00Z",
    "DataQualityLevel": 2,
    "DateCreated": "2020-03-15T10:53:00Z",
    "SubmissionStatusTypeID": 100
}