{
    "MediaItems": [
        {
            "ID": 23571,
            "ChargePointID": 162143,
            "ItemURL": "https://s3-ap-southeast-2.amazonaws.com/openchargemap/images/AT/OCM162143/OCM-162143.orig.2020080206385106.jpg",
            "ItemThumbnailURL": "https://s3-ap-southeast-2.amazonaws.com/openchargemap/images/AT/OCM162143/OCM-162143.thmb.2020080206385106.jpg",
            "Comment": "",
            "IsEnabled": true,
            "IsVideo": false,
            "IsFeaturedItem": false,
            "IsExternalResource": false,
            "User": {
                "ID": 26760,
                "Username": "interssl.com"
            },
            "DateCreated": "2020-08-02T06:39:00Z"
        },
        {
            "ID": 23572,
            "ChargePointID": 162143,
            "ItemURL": "https://s3-ap-southeast-2.amazonaws.com/openchargemap/images/AT/OCM162143/OCM-162143.orig.2020080206390389.jpg",
            "ItemThumbnailURL": "https://s3-ap-southeast-2.amazonaws.com/openchargemap/images/AT/OCM162143/OCM-162143.thmb.2020080206390389.jpg",
            "Comment": "",
            "IsEnabled": true,
            "IsVideo": false,
            "IsFeaturedItem": false,
            "IsExternalResource": false,
            "User": {
                "ID": 26760,
                "Username": "interssl.com"
            },
            "DateCreated": "2020-08-02T06:39:00Z"
        },
        {
            "ID": 23573,
            "ChargePointID": 162143,
            "ItemURL": "https://s3-ap-southeast-2.amazonaws.com/openchargemap/images/AT/OCM162143/OCM-162143.orig.2020080206391581.jpg",
            "ItemThumbnailURL": "https://s3-ap-southeast-2.amazonaws.com/openchargemap/images/AT/OCM162143/OCM-162143.thmb.2020080206391581.jpg",
            "Comment": "",
            "IsEnabled": true,
            "IsVideo": false,
            "IsFeaturedItem": false,
            "IsExternalResource": false,
            "User": {
                "ID": 26760,
                "Username": "interssl.com"
            },
            "DateCreated": "2020-08-02T06:39:00Z"
        }
    ],
    "IsRecentlyVerified": false,
    "ID": 162143,
    "UUID": "8A5C50CD-66DE-4356-A6BD-4CDE8ABF7FE2",
    "DataProviderID": 1,
    "OperatorID": 45,
    "UsageTypeID": 1,
    "UsageCost": "0,50 EUR / hour",
    "AddressInfo": {
        "ID": 162500,
        "Title": "Bahnhof",
        "AddressLine1": "Bahnhofplatz",
        "Town": "Gemeinde Seefeld in Tirol",
        "StateOrProvince": "Bezirk Innsbruck-Land",
        "Postcode": "6100",
        "CountryID": 19,
        "Latitude": 47.329538758606844,
        "Longitude": 11.188942268586288,
        "RelatedURL": "https://oebb.smatrics.com/",
        "DistanceUnit": 0
    },
    "Connections": [
        {
            "ID": 233354,
            "ConnectionTypeID": 25,
            "StatusTypeID": 50,
            "LevelID": 2,
            "Amps": 16,
            "PowerKW": 11,
            "CurrentTypeID": 20,
            "Quantity": 2
        }
    ],
    "NumberOfPoints": 2,
    "GeneralComments": "Operator: ÖBB Infra",
    "StatusTypeID": 50,
    "DateLastStatusUpdate": "2020-08-04T09:49:00Z",
    "DataQualityLevel": 1,
    "DateCreated": "2020-08-02T06:39:00Z",
    "SubmissionStatusTypeID": 200
}