{
    "IsRecentlyVerified": false,
    "ID": 117600,
    "UUID": "76EC07B3-3613-4878-BCD5-3DC55F69BADF",
    "DataProviderID": 1,
    "OperatorID": 80,
    "UsageTypeID": 4,
    "AddressInfo": {
        "ID": 117946,
        "Title": "Parcheggio Via Porta Napoli | EnelX",
        "AddressLine1": "Via Porta Napoli",
        "Town": "Castel di Sangro",
        "StateOrProvince": "AQ",
        "Postcode": "67031",
        "CountryID": 112,
        "Latitude": 41.78233172827058,
        "Longitude": 14.107521116949442,
        "RelatedURL": "https://www.enelx.com/it/it/emobility",
        "DistanceUnit": 0
    },
    "Connections": [
        {
            "ID": 166350,
            "ConnectionTypeID": 25,
            "StatusTypeID": 50,
            "LevelID": 2,
            "Amps": 32,
            "Voltage": 400,
            "PowerKW": 22,
            "CurrentTypeID": 20,
            "Quantity": 1
        },
        {
            "ID": 166351,
            "ConnectionTypeID": 36,
            "StatusTypeID": 50,
            "LevelID": 2,
            "Amps": 16,
            "Voltage": 240,
            "PowerKW": 3.7,
            "CurrentTypeID": 10,
            "Quantity": 1
        }
    ],
    "NumberOfPoints": 2,
    "StatusTypeID": 50,
    "DateLastStatusUpdate": "2019-02-19T13:46:00Z",
    "DataQualityLevel": 1,
    "DateCreated": "2019-02-19T13:46:00Z",
    "SubmissionStatusTypeID": 200
}