{
    "IsRecentlyVerified": false,
    "ID": 6996,
    "UUID": "C1863391-EE31-4F2F-B2E6-9618821BE6B9",
    "DataProviderID": 1,
    "UsageTypeID": 4,
    "UsageCost": "Free",
    "AddressInfo": {
        "ID": 6897,
        "Title": "109 bd Massena",
        "AddressLine1": "109 boulevard Massena",
        "AddressLine2": "",
        "Town": "Paris",
        "StateOrProvince": "",
        "Postcode": "",
        "CountryID": 80,
        "Latitude": 48.8199407,
        "Longitude": 2.365365699999984,
        "ContactTelephone1": "+33 01 53 20 09 69 ",
        "ContactTelephone2": "",
        "ContactEmail": "sim@semeru.fayat.com",
        "AccessComments": "http://www.paris.fr/pratique/voitures-deux-roues-motorises/bornes-de-recharge-pour-vehicules-electriques/p5775",
        "DistanceUnit": 0
    },
    "Connections": [],
    "NumberOfPoints": 1,
    "GeneralComments": "Où se procurer la carte pour recharger son véhicule électrique ? La carte est gratuite. Où la trouver ? Espace mobilités électriques 112 quater rue Marcadet (18e)- +33 01 53 20 09 69 ",
    "DateLastConfirmed": "2011-10-12T20:23:00Z",
    "StatusTypeID": 0,
    "DateLastStatusUpdate": "2011-10-12T20:23:00Z",
    "DataQualityLevel": 1,
    "DateCreated": "2011-10-12T20:23:00Z",
    "SubmissionStatusTypeID": 200
}