{
    "IsRecentlyVerified": false,
    "ID": 52163,
    "UUID": "3339630E-531C-4196-BBE4-2E30FA54C377",
    "DataProviderID": 1,
    "OperatorID": 1,
    "UsageTypeID": 4,
    "AddressInfo": {
        "ID": 52509,
        "Title": "Circontrol",
        "AddressLine1": "Carrer Longitudinal 1, 29, Zona Franca",
        "Town": "Barcelona",
        "StateOrProvince": "Barcelona",
        "Postcode": "08040",
        "CountryID": 210,
        "Latitude": 41.3294774,
        "Longitude": 2.11608620000004,
        "AccessComments": "Amb targeta / Ask for card",
        "RelatedURL": "http://www.circontrol.com/",
        "DistanceUnit": 0
    },
    "Connections": [
        {
            "ID": 64736,
            "ConnectionTypeID": 28,
            "StatusTypeID": 0,
            "Quantity": 2
        }
    ],
    "NumberOfPoints": 2,
    "StatusTypeID": 0,
    "DateLastStatusUpdate": "2015-09-04T19:38:00Z",
    "DataQualityLevel": 1,
    "DateCreated": "2015-08-20T16:12:00Z",
    "SubmissionStatusTypeID": 200
}