{
    "IsRecentlyVerified": false,
    "ID": 73850,
    "UUID": "36171C30-6BBA-4A87-A37A-EF911940F620",
    "DataProviderID": 1,
    "OperatorID": 89,
    "OperatorsReference": "CEA-10120",
    "UsageTypeID": 4,
    "UsageCost": "CAD 1.00/hour",
    "AddressInfo": {
        "ID": 74196,
        "Title": "St-Hubert-Berthierville",
        "AddressLine1": "1091 av Gilles-Villeneuve",
        "Town": "Berthierville",
        "StateOrProvince": "QC",
        "Postcode": "J0K 1A0",
        "CountryID": 44,
        "Latitude": 46.0883518674836,
        "Longitude": -73.1966844907379,
        "DistanceUnit": 0
    },
    "Connections": [
        {
            "ID": 106159,
            "ConnectionTypeID": 1,
            "StatusTypeID": 50,
            "LevelID": 2,
            "Amps": 32,
            "Voltage": 230,
            "PowerKW": 7,
            "CurrentTypeID": 10,
            "Quantity": 1
        }
    ],
    "NumberOfPoints": 1,
    "StatusTypeID": 50,
    "DateLastStatusUpdate": "2016-11-27T19:50:00Z",
    "DataQualityLevel": 1,
    "DateCreated": "2016-11-23T23:19:00Z",
    "SubmissionStatusTypeID": 200
}