{
    "IsRecentlyVerified": false,
    "ID": 135633,
    "UUID": "77686FED-25DE-4D77-8C82-EBBD4DB613BE",
    "DataProviderID": 18,
    "DataProvidersReference": "52f567614a900ad127dc800b26318803",
    "OperatorID": 2244,
    "UsageTypeID": 5,
    "AddressInfo": {
        "ID": 135979,
        "Title": "Hailsham Avenue",
        "AddressLine1": "Hailsham Avenue",
        "Town": "London",
        "Postcode": "SW2 3AJ",
        "CountryID": 1,
        "Latitude": 51.436063,
        "Longitude": -0.119366,
        "AccessComments": "",
        "RelatedURL": "https://www.ubitricity.com",
        "DistanceUnit": 0
    },
    "Connections": [
        {
            "ID": 190041,
            "ConnectionTypeID": 25,
            "Reference": "suby1100000442",
            "StatusTypeID": 50,
            "LevelID": 2,
            "Amps": 16,
            "Voltage": 230,
            "PowerKW": 3.7,
            "CurrentTypeID": 10
        }
    ],
    "StatusTypeID": 0,
    "DateLastStatusUpdate": "2021-04-25T05:46:00Z",
    "MetadataValues": [
        {
            "ID": 5485,
            "MetadataFieldID": 4,
            "ItemValue": "Contains public sector information licensed under the Open Government Licence v2.0. http://www.nationalarchives.gov.uk/doc/open-government-licence/version/2/"
        }
    ],
    "DataQualityLevel": 3,
    "DateCreated": "2019-12-24T05:22:00Z",
    "SubmissionStatusTypeID": 100
}