{
    "IsRecentlyVerified": false,
    "ID": 5715,
    "UUID": "6DAA11B0-4E11-4359-881E-539E350C0700",
    "DataProviderID": 1,
    "OperatorID": 23,
    "UsageTypeID": 6,
    "UsageCost": "Free",
    "AddressInfo": {
        "ID": 5637,
        "Title": "ヒカリヤ",
        "AddressLine1": "大手 4-7-14",
        "Town": "松本市",
        "StateOrProvince": "長野県",
        "Postcode": "390-0874",
        "CountryID": 114,
        "Latitude": 36.2354525,
        "Longitude": 137.9737701,
        "ContactTelephone1": "0263-38-0068",
        "ContactTelephone2": "0120-975-214",
        "AccessComments": "Generally 11:30-21:00\r\n施設ご利用のお客様のみ。 セルフパーク。",
        "RelatedURL": "http://hikari-ya.com/",
        "DistanceUnit": 0
    },
    "Connections": [
        {
            "ID": 464,
            "ConnectionTypeID": 8,
            "StatusTypeID": 50,
            "LevelID": 3,
            "Amps": 90,
            "Voltage": 230,
            "PowerKW": 16.8,
            "CurrentTypeID": 30
        }
    ],
    "NumberOfPoints": 1,
    "StatusTypeID": 50,
    "DateLastStatusUpdate": "2015-10-14T14:24:00Z",
    "DataQualityLevel": 1,
    "DateCreated": "2011-09-09T11:40:00Z",
    "SubmissionStatusTypeID": 200
}