{
    "IsRecentlyVerified": false,
    "ID": 159499,
    "UUID": "CF2088C3-E244-4752-8F92-F0C7795064A3",
    "DataProviderID": 2,
    "DataProvidersReference": "153515",
    "OperatorID": 5,
    "UsageTypeID": 1,
    "AddressInfo": {
        "ID": 159856,
        "Title": "WESTMINSTER1",
        "AddressLine1": "10650 Westminster Blvd",
        "Town": "Westminster",
        "StateOrProvince": "CO",
        "Postcode": "80020",
        "CountryID": 2,
        "Latitude": 39.8917549,
        "Longitude": -105.0662746,
        "ContactTelephone1": "888-758-4389",
        "AccessComments": "24 hours daily",
        "RelatedURL": "http://www.chargepoint.com/",
        "DistanceUnit": 0
    },
    "Connections": [
        {
            "ID": 229687,
            "ConnectionTypeID": 1,
            "LevelID": 2,
            "Amps": 16,
            "Voltage": 230,
            "PowerKW": 3.7,
            "CurrentTypeID": 10,
            "Quantity": 2
        }
    ],
    "StatusTypeID": 50,
    "DateLastStatusUpdate": "2020-06-26T03:02:00Z",
    "DataQualityLevel": 3,
    "DateCreated": "2020-06-26T03:02:00Z",
    "SubmissionStatusTypeID": 100
}