{
    "IsRecentlyVerified": false,
    "ID": 146328,
    "UUID": "87EF2F83-0FD1-4220-A4D2-C45F27679752",
    "DataProviderID": 1,
    "OperatorID": 21,
    "UsageTypeID": 4,
    "AddressInfo": {
        "ID": 146680,
        "Title": "FAR-00003",
        "AddressLine1": "Avenida da Republica",
        "Town": "Faro",
        "StateOrProvince": "Algarve",
        "Postcode": "8000-078 Faro",
        "CountryID": 180,
        "Latitude": 37.01777342056211,
        "Longitude": -7.938850828345721,
        "DistanceUnit": 0
    },
    "Connections": [
        {
            "ID": 203414,
            "ConnectionTypeID": 25,
            "StatusTypeID": 50,
            "LevelID": 2,
            "Amps": 16,
            "Voltage": 230,
            "PowerKW": 3,
            "CurrentTypeID": 10,
            "Quantity": 2
        }
    ],
    "NumberOfPoints": 2,
    "StatusTypeID": 50,
    "DateLastStatusUpdate": "2020-01-09T15:27:00Z",
    "DataQualityLevel": 1,
    "DateCreated": "2020-01-06T22:30:00Z",
    "SubmissionStatusTypeID": 200
}