{
    "IsRecentlyVerified": false,
    "ID": 61499,
    "UUID": "8D3CCF78-A347-4DDF-8E93-A3D1B87DCD04",
    "DataProviderID": 1,
    "OperatorID": 98,
    "UsageTypeID": 4,
    "AddressInfo": {
        "ID": 61845,
        "Title": "NE-Solartechnik",
        "AddressLine1": "Rudolf-Diesel-Straße 17",
        "Town": "Werneck",
        "StateOrProvince": "Landkreis Schweinfurt",
        "Postcode": "97440",
        "CountryID": 87,
        "Latitude": 49.97871,
        "Longitude": 10.09226000000001,
        "ContactTelephone1": "+49-9722-944610",
        "AccessComments": "2 Parkplätze an der Emco Ladesäule direkt am Firmengebäude . ",
        "RelatedURL": "http://www.ne-solartechnik.de",
        "DistanceUnit": 0
    },
    "Connections": [
        {
            "ID": 78367,
            "ConnectionTypeID": 17,
            "StatusTypeID": 50,
            "LevelID": 2,
            "Amps": 16,
            "Voltage": 400,
            "PowerKW": 11,
            "CurrentTypeID": 20,
            "Quantity": 1
        },
        {
            "ID": 78368,
            "ConnectionTypeID": 28,
            "StatusTypeID": 50,
            "LevelID": 2,
            "Amps": 16,
            "Voltage": 230,
            "PowerKW": 3.7,
            "CurrentTypeID": 10,
            "Quantity": 1
        },
        {
            "ID": 78369,
            "ConnectionTypeID": 16,
            "StatusTypeID": 50,
            "LevelID": 2,
            "Amps": 16,
            "Voltage": 230,
            "PowerKW": 3.7,
            "CurrentTypeID": 10,
            "Quantity": 1
        }
    ],
    "NumberOfPoints": 2,
    "StatusTypeID": 50,
    "DateLastStatusUpdate": "2016-03-02T10:29:00Z",
    "DataQualityLevel": 1,
    "DateCreated": "2016-03-02T10:29:00Z",
    "SubmissionStatusTypeID": 200
}