{
    "IsRecentlyVerified": false,
    "ID": 80047,
    "UUID": "259F1A5F-E8AF-49C7-A598-D233B7561744",
    "DataProviderID": 1,
    "OperatorID": 23,
    "OperatorsReference": "23388",
    "UsageTypeID": 4,
    "UsageCost": "Free",
    "AddressInfo": {
        "ID": 80393,
        "Title": "Le Grand Aigle Hôtel & Spa",
        "AddressLine1": "Hameau du Bez Chemin du Cavaillou",
        "Town": "La Salle-les-Alpes",
        "Postcode": "5240",
        "CountryID": 80,
        "Latitude": 44.945033,
        "Longitude": 6.553155,
        "ContactTelephone1": "+33 4 92 40 00 90",
        "DistanceUnit": 0
    },
    "Connections": [
        {
            "ID": 114696,
            "ConnectionTypeID": 30,
            "StatusTypeID": 50,
            "LevelID": 2,
            "Amps": 32,
            "Voltage": 400,
            "PowerKW": 22,
            "CurrentTypeID": 20,
            "Quantity": 1
        }
    ],
    "NumberOfPoints": 1,
    "GeneralComments": "1 Tesla Connector, up to 22kW.Available for customers. Please call ahead.",
    "StatusTypeID": 50,
    "DateLastStatusUpdate": "2018-10-03T17:38:00Z",
    "DataQualityLevel": 1,
    "DateCreated": "2017-01-30T18:25:00Z",
    "SubmissionStatusTypeID": 200
}