{
    "IsRecentlyVerified": false,
    "ID": 139873,
    "UUID": "90E00B60-497A-4040-9F73-5423D08B5A86",
    "DataProviderID": 2,
    "DataProvidersReference": "127975",
    "OperatorID": 9,
    "UsageTypeID": 1,
    "AddressInfo": {
        "ID": 140225,
        "Title": "City of Azusa - 110 W 6th St",
        "AddressLine1": "110 W 6th St",
        "Town": "Azusa",
        "StateOrProvince": "CA",
        "Postcode": "91702",
        "CountryID": 2,
        "Latitude": 34.131652,
        "Longitude": -117.90881,
        "ContactTelephone1": "888-998-2546",
        "AccessComments": "MON: 24 hours | TUE: 24 hours | WED: 24 hours | THU: 24 hours | FRI: 24 hours | SAT: 24 hours | SUN: 24 hours",
        "RelatedURL": "http://www.blinkcharging.com/",
        "DistanceUnit": 0
    },
    "Connections": [
        {
            "ID": 195359,
            "ConnectionTypeID": 2,
            "LevelID": 3,
            "Amps": 100,
            "Voltage": 400,
            "PowerKW": 40,
            "CurrentTypeID": 30,
            "Quantity": 2
        }
    ],
    "StatusTypeID": 50,
    "DateLastStatusUpdate": "2019-12-24T09:11:00Z",
    "DataQualityLevel": 3,
    "DateCreated": "2019-12-24T09:11:00Z",
    "SubmissionStatusTypeID": 100
}