{
    "IsRecentlyVerified": false,
    "ID": 108754,
    "UUID": "39A2FFF1-F1A1-4559-BA97-49DE5F72ED24",
    "DataProviderID": 1,
    "OperatorID": 23,
    "OperatorsReference": "44563",
    "UsageTypeID": 4,
    "AddressInfo": {
        "ID": 109100,
        "Title": "Hotel Fredericia",
        "AddressLine1": "Vestre Ringvej 96",
        "Town": "Fredericia",
        "Postcode": "7000",
        "CountryID": 65,
        "Latitude": 55.576118,
        "Longitude": 9.727365,
        "ContactTelephone1": "+45 75910000",
        "DistanceUnit": 0
    },
    "Connections": [
        {
            "ID": 153869,
            "ConnectionTypeID": 30,
            "StatusTypeID": 50,
            "LevelID": 2,
            "Amps": 16,
            "Voltage": 400,
            "PowerKW": 11,
            "CurrentTypeID": 20,
            "Quantity": 2
        }
    ],
    "NumberOfPoints": 2,
    "GeneralComments": "2 Tesla Connectors, up to 11kW.Available for customers. Please see front desk.",
    "StatusTypeID": 50,
    "DateLastStatusUpdate": "2018-10-11T12:35:00Z",
    "DataQualityLevel": 1,
    "DateCreated": "2018-10-11T12:35:00Z",
    "SubmissionStatusTypeID": 200
}