{
    "UserComments": [
        {
            "ID": 21384,
            "ChargePointID": 130832,
            "CommentTypeID": 10,
            "UserName": "RonnieLast",
            "Comment": "",
            "DateCreated": "2019-08-21T23:30:06.49Z",
            "User": {
                "ID": 21963,
                "Username": "RonnieLast"
            },
            "CheckinStatusTypeID": 10
        }
    ],
    "IsRecentlyVerified": false,
    "ID": 130832,
    "UUID": "896B0399-97D2-436E-91A1-A5DED7198218",
    "DataProviderID": 1,
    "OperatorID": 22,
    "UsageTypeID": 4,
    "AddressInfo": {
        "ID": 131178,
        "Title": "Stillorgan Village Shopping Centre",
        "AddressLine1": "Kilmacud Road Lower",
        "Town": "Stillorgan",
        "StateOrProvince": "County Dublin",
        "Postcode": "A94",
        "CountryID": 3,
        "Latitude": 53.2886961987507,
        "Longitude": -6.19990867014144,
        "ContactTelephone1": "00 353 01 2886004",
        "AccessComments": "Located in a private car-park, access may be limited.\r\nhttp://stillorganvillageshopping.com/opening-hours/",
        "RelatedURL": "http://stillorganvillageshopping.com",
        "DistanceUnit": 0
    },
    "Connections": [
        {
            "ID": 183176,
            "ConnectionTypeID": 25,
            "StatusTypeID": 50,
            "LevelID": 2,
            "PowerKW": 7.5,
            "CurrentTypeID": 10,
            "Quantity": 2
        },
        {
            "ID": 183177,
            "ConnectionTypeID": 25,
            "StatusTypeID": 50,
            "LevelID": 2,
            "PowerKW": 7.5,
            "CurrentTypeID": 10,
            "Quantity": 2
        },
        {
            "ID": 183178,
            "ConnectionTypeID": 25,
            "StatusTypeID": 50,
            "LevelID": 2,
            "PowerKW": 7.5,
            "CurrentTypeID": 10,
            "Quantity": 2
        },
        {
            "ID": 183179,
            "ConnectionTypeID": 25,
            "StatusTypeID": 50,
            "LevelID": 2,
            "PowerKW": 7.4,
            "CurrentTypeID": 10,
            "Quantity": 2
        }
    ],
    "NumberOfPoints": 8,
    "StatusTypeID": 50,
    "DateLastStatusUpdate": "2019-08-22T12:12:00Z",
    "DataQualityLevel": 1,
    "DateCreated": "2019-08-18T22:56:00Z",
    "SubmissionStatusTypeID": 200
}