{
    "IsRecentlyVerified": false,
    "ID": 90220,
    "UUID": "E787A29C-8C31-44CC-8A5A-03859D4EFC49",
    "DataProviderID": 1,
    "OperatorID": 23,
    "OperatorsReference": "31290",
    "UsageTypeID": 4,
    "AddressInfo": {
        "ID": 90566,
        "Title": "Santa Fe Hills",
        "AddressLine1": "Av. Vasco de Quiroga 4299 Loma de San Pedro",
        "Town": "Ciudad de MÃ©xico",
        "StateOrProvince": "Ciudad de Mexico",
        "Postcode": "05370",
        "CountryID": 146,
        "Latitude": 19.35575,
        "Longitude": -99.283797,
        "ContactTelephone1": "+52 55 2489 6000",
        "DistanceUnit": 0
    },
    "Connections": [
        {
            "ID": 127873,
            "ConnectionTypeID": 30,
            "StatusTypeID": 50,
            "LevelID": 2,
            "PowerKW": 18,
            "CurrentTypeID": 20,
            "Quantity": 2
        }
    ],
    "NumberOfPoints": 2,
    "GeneralComments": "2 Tesla Connectors, up to 18kW.Available for customers. Please see valet.",
    "StatusTypeID": 50,
    "DateLastStatusUpdate": "2017-07-13T14:19:00Z",
    "DataQualityLevel": 1,
    "DateCreated": "2017-07-13T14:19:00Z",
    "SubmissionStatusTypeID": 200
}