{
    "MediaItems": [
        {
            "ID": 18610,
            "ChargePointID": 75133,
            "ItemURL": "https://s3-ap-southeast-2.amazonaws.com/openchargemap/images/DE/OCM75133/OCM-75133.orig.2019060821463980.jpg",
            "ItemThumbnailURL": "https://s3-ap-southeast-2.amazonaws.com/openchargemap/images/DE/OCM75133/OCM-75133.thmb.2019060821463980.jpg",
            "Comment": "4 Parkplätze leider ohne Bodenmarkierung",
            "IsEnabled": true,
            "IsVideo": false,
            "IsFeaturedItem": false,
            "IsExternalResource": false,
            "User": {
                "ID": 20487,
                "Username": "docloy"
            },
            "DateCreated": "2019-06-08T21:47:00Z"
        },
        {
            "ID": 18609,
            "ChargePointID": 75133,
            "ItemURL": "https://s3-ap-southeast-2.amazonaws.com/openchargemap/images/DE/OCM75133/OCM-75133.orig.2019060821452714.jpg",
            "ItemThumbnailURL": "https://s3-ap-southeast-2.amazonaws.com/openchargemap/images/DE/OCM75133/OCM-75133.thmb.2019060821452714.jpg",
            "Comment": "Ladesäule mit 50 kW CCS, 50 kW Chademo & 43 kW Type 2",
            "IsEnabled": true,
            "IsVideo": false,
            "IsFeaturedItem": false,
            "IsExternalResource": false,
            "User": {
                "ID": 20487,
                "Username": "docloy"
            },
            "DateCreated": "2019-06-08T21:46:00Z"
        },
        {
            "ID": 18608,
            "ChargePointID": 75133,
            "ItemURL": "https://s3-ap-southeast-2.amazonaws.com/openchargemap/images/DE/OCM75133/OCM-75133.orig.2019060821434628.jpg",
            "ItemThumbnailURL": "https://s3-ap-southeast-2.amazonaws.com/openchargemap/images/DE/OCM75133/OCM-75133.thmb.2019060821434628.jpg",
            "Comment": "Ladesäule mit 50 kW CCS & 22 kW Type2",
            "IsEnabled": true,
            "IsVideo": false,
            "IsFeaturedItem": false,
            "IsExternalResource": false,
            "User": {
                "ID": 20487,
                "Username": "docloy"
            },
            "DateCreated": "2019-06-08T21:44:00Z"
        },
        {
            "ID": 8847,
            "ChargePointID": 75133,
            "ItemURL": "https://s3-ap-southeast-2.amazonaws.com/openchargemap/images/DE/OCM75133/OCM-75133.orig.2016122314044136.jpg",
            "ItemThumbnailURL": "https://s3-ap-southeast-2.amazonaws.com/openchargemap/images/DE/OCM75133/OCM-75133.thmb.2016122314044136.jpg",
            "Comment": "",
            "IsEnabled": true,
            "IsVideo": false,
            "IsFeaturedItem": false,
            "IsExternalResource": false,
            "User": {
                "ID": 12082,
                "Username": "Nobbi2406"
            },
            "DateCreated": "2016-12-23T14:05:00Z"
        },
        {
            "ID": 8845,
            "ChargePointID": 75133,
            "ItemURL": "https://s3-ap-southeast-2.amazonaws.com/openchargemap/images/DE/OCM75133/OCM-75133.orig.2016122314021579.jpg",
            "ItemThumbnailURL": "https://s3-ap-southeast-2.amazonaws.com/openchargemap/images/DE/OCM75133/OCM-75133.thmb.2016122314021579.jpg",
            "Comment": "",
            "IsEnabled": true,
            "IsVideo": false,
            "IsFeaturedItem": false,
            "IsExternalResource": false,
            "User": {
                "ID": 12082,
                "Username": "Nobbi2406"
            },
            "DateCreated": "2016-12-23T14:03:00Z"
        },
        {
            "ID": 8846,
            "ChargePointID": 75133,
            "ItemURL": "https://s3-ap-southeast-2.amazonaws.com/openchargemap/images/DE/OCM75133/OCM-75133.orig.2016122314030002.jpg",
            "ItemThumbnailURL": "https://s3-ap-southeast-2.amazonaws.com/openchargemap/images/DE/OCM75133/OCM-75133.thmb.2016122314030002.jpg",
            "Comment": "",
            "IsEnabled": true,
            "IsVideo": false,
            "IsFeaturedItem": false,
            "IsExternalResource": false,
            "User": {
                "ID": 12082,
                "Username": "Nobbi2406"
            },
            "DateCreated": "2016-12-23T14:03:00Z"
        },
        {
            "ID": 8843,
            "ChargePointID": 75133,
            "ItemURL": "https://s3-ap-southeast-2.amazonaws.com/openchargemap/images/DE/OCM75133/OCM-75133.orig.2016122314012972.jpg",
            "ItemThumbnailURL": "https://s3-ap-southeast-2.amazonaws.com/openchargemap/images/DE/OCM75133/OCM-75133.thmb.2016122314012972.jpg",
            "Comment": "",
            "IsEnabled": true,
            "IsVideo": false,
            "IsFeaturedItem": false,
            "IsExternalResource": false,
            "User": {
                "ID": 12082,
                "Username": "Nobbi2406"
            },
            "DateCreated": "2016-12-23T14:02:00Z"
        },
        {
            "ID": 8844,
            "ChargePointID": 75133,
            "ItemURL": "https://s3-ap-southeast-2.amazonaws.com/openchargemap/images/DE/OCM75133/OCM-75133.orig.2016122314015442.jpg",
            "ItemThumbnailURL": "https://s3-ap-southeast-2.amazonaws.com/openchargemap/images/DE/OCM75133/OCM-75133.thmb.2016122314015442.jpg",
            "Comment": "",
            "IsEnabled": true,
            "IsVideo": false,
            "IsFeaturedItem": false,
            "IsExternalResource": false,
            "User": {
                "ID": 12082,
                "Username": "Nobbi2406"
            },
            "DateCreated": "2016-12-23T14:02:00Z"
        }
    ],
    "IsRecentlyVerified": false,
    "ID": 75133,
    "UUID": "0971D4A1-575A-4EA9-B54D-310BC0A63E8B",
    "DataProviderID": 1,
    "OperatorID": 86,
    "OperatorsReference": "DE*EBW*4002*1,DE*EBW*4002*2,DE*EBW*4000*1,DE*EBW*4000*2,DE*EBW*4000*3",
    "UsageTypeID": 4,
    "AddressInfo": {
        "ID": 75479,
        "Title": "EnBW Rasthof Denkendorf Nord",
        "AddressLine1": "A8",
        "Town": "Denkendorf",
        "StateOrProvince": "Baden-Württemberg12",
        "Postcode": "73770",
        "CountryID": 87,
        "Latitude": 48.6938540011401,
        "Longitude": 9.30375771738703,
        "ContactTelephone1": "+49 711 93445340",
        "AccessComments": "24/7 nutzbare Ladesäulen mit 4 Parkplätzen im PKW Parkbereich in der Nähe des Restaurants.",
        "RelatedURL": "http://rastanlage-denkendorf.de/",
        "DistanceUnit": 0
    },
    "Connections": [
        {
            "ID": 108354,
            "ConnectionTypeID": 33,
            "StatusTypeID": 50,
            "LevelID": 3,
            "Amps": 125,
            "Voltage": 500,
            "PowerKW": 50,
            "CurrentTypeID": 30,
            "Quantity": 2
        },
        {
            "ID": 108355,
            "ConnectionTypeID": 25,
            "StatusTypeID": 50,
            "LevelID": 2,
            "Amps": 32,
            "Voltage": 400,
            "PowerKW": 22,
            "CurrentTypeID": 20,
            "Quantity": 0
        },
        {
            "ID": 178766,
            "ConnectionTypeID": 1036,
            "StatusTypeID": 50,
            "LevelID": 3,
            "Amps": 63,
            "Voltage": 400,
            "PowerKW": 43,
            "CurrentTypeID": 20,
            "Quantity": 1
        },
        {
            "ID": 178767,
            "ConnectionTypeID": 2,
            "StatusTypeID": 50,
            "LevelID": 3,
            "Amps": 125,
            "Voltage": 400,
            "PowerKW": 50,
            "CurrentTypeID": 30,
            "Quantity": 1
        }
    ],
    "NumberOfPoints": 4,
    "StatusTypeID": 50,
    "DateLastStatusUpdate": "2019-06-08T22:11:00Z",
    "DataQualityLevel": 1,
    "DateCreated": "2016-12-12T07:56:00Z",
    "SubmissionStatusTypeID": 200
}