{
    "IsRecentlyVerified": false,
    "ID": 131012,
    "UUID": "1137293F-E1A3-4B31-A570-8D047A51EFFC",
    "DataProviderID": 1,
    "OperatorID": 23,
    "OperatorsReference": "51471",
    "UsageTypeID": 4,
    "AddressInfo": {
        "ID": 131358,
        "Title": "Lime Wood",
        "AddressLine1": "Beaulieu RD",
        "Town": "Lyndhurst",
        "Postcode": "SO43 7FZ",
        "CountryID": 1,
        "Latitude": 50.862364,
        "Longitude": -1.554802,
        "ContactTelephone1": "+44 23 8028 7177",
        "DistanceUnit": 0
    },
    "Connections": [
        {
            "ID": 183507,
            "ConnectionTypeID": 30,
            "StatusTypeID": 50,
            "LevelID": 2,
            "PowerKW": 11,
            "CurrentTypeID": 20,
            "Quantity": 2
        }
    ],
    "NumberOfPoints": 2,
    "GeneralComments": "2 Tesla Connectors, up to 11kW.Available for customers. Self park.",
    "StatusTypeID": 50,
    "DateLastStatusUpdate": "2019-08-28T19:56:00Z",
    "DataQualityLevel": 1,
    "DateCreated": "2019-08-28T19:56:00Z",
    "SubmissionStatusTypeID": 200
}