{
    "IsRecentlyVerified": false,
    "ID": 150169,
    "UUID": "56B6EDAE-9D9E-47A5-9B9A-DEC32D026C33",
    "DataProviderID": 28,
    "DataProvidersReference": "FR*M13*P13003*001",
    "UsageTypeID": 5,
    "AddressInfo": {
        "ID": 150522,
        "Title": "ALLEINS - Avenue René Cassin",
        "AddressLine1": "Avenue René Cassin 13980 ALLEINS",
        "CountryID": 80,
        "Latitude": 43.704091,
        "Longitude": 5.1569112,
        "AccessComments": "24h/24 7j/7",
        "DistanceUnit": 0
    },
    "Connections": [
        {
            "ID": 208553,
            "ConnectionTypeID": 28,
            "StatusTypeID": 50,
            "LevelID": 2,
            "PowerKW": 22,
            "CurrentTypeID": 10
        },
        {
            "ID": 208554,
            "ConnectionTypeID": 1036,
            "StatusTypeID": 50,
            "LevelID": 2,
            "PowerKW": 22,
            "CurrentTypeID": 20
        },
        {
            "ID": 240332,
            "ConnectionTypeID": 28,
            "StatusTypeID": 50,
            "LevelID": 2,
            "PowerKW": 22,
            "CurrentTypeID": 10
        },
        {
            "ID": 240333,
            "ConnectionTypeID": 1036,
            "StatusTypeID": 50,
            "LevelID": 2,
            "PowerKW": 22,
            "CurrentTypeID": 20
        }
    ],
    "GeneralComments": "Recharge par badge et avec une application smartphone",
    "StatusTypeID": 50,
    "DateLastStatusUpdate": "2020-08-27T05:11:00Z",
    "DataQualityLevel": 2,
    "DateCreated": "2020-03-15T06:17:00Z",
    "SubmissionStatusTypeID": 100
}