{
    "IsRecentlyVerified": false,
    "ID": 88723,
    "UUID": "B6D63430-FEC8-4A68-B7B4-90F7250F6059",
    "DataProviderID": 1,
    "DataProvidersReference": "4131",
    "AddressInfo": {
        "ID": 89069,
        "Title": "Ställdalens tåg- och busstopp",
        "AddressLine1": "Ställbergsvägen 16",
        "Town": "STÄLLDALEN",
        "StateOrProvince": "ÖREBRO",
        "Postcode": "71472",
        "CountryID": 216,
        "Latitude": 59.93306,
        "Longitude": 14.943831,
        "AccessComments": "Tåg- och busshållsplatsen i Ställdalen",
        "DistanceUnit": 0
    },
    "Connections": [
        {
            "ID": 125936,
            "ConnectionTypeID": 0,
            "Reference": "1",
            "LevelID": 2,
            "Amps": 16,
            "Voltage": 400,
            "PowerKW": 11,
            "Comments": "Mode 3"
        },
        {
            "ID": 125937,
            "ConnectionTypeID": 0,
            "Reference": "2",
            "LevelID": 2,
            "Amps": 16,
            "Voltage": 400,
            "PowerKW": 11,
            "Comments": "Mode 3"
        }
    ],
    "NumberOfPoints": 2,
    "DateLastStatusUpdate": "2020-05-26T08:23:00Z",
    "DataQualityLevel": 2,
    "DateCreated": "2017-06-09T11:08:00Z",
    "SubmissionStatusTypeID": 100
}