{
    "IsRecentlyVerified": false,
    "ID": 48837,
    "UUID": "E7DC7215-0822-4297-A675-C899C77F6C1C",
    "DataProviderID": 1,
    "OperatorID": 45,
    "UsageTypeID": 1,
    "AddressInfo": {
        "ID": 49183,
        "Title": "Gemeindeverwaltung",
        "AddressLine1": "Hahlestraße 1",
        "Town": "Gieboldehausen",
        "StateOrProvince": "Samtgemeinde Gieboldehausen",
        "Postcode": "37434",
        "CountryID": 87,
        "Latitude": 51.6104035,
        "Longitude": 10.2133709,
        "ContactTelephone1": "+49 5527 911-0",
        "AccessComments": "Gegenüber dem Rathaus auf dem Parkplatz in der Hahlestraße.",
        "RelatedURL": "http://www.samtgemeinde-gieboldehausen.de/magazin/artikel.php?artikel=5718&type=2&menuid=48&topmenu=10",
        "DistanceUnit": 0
    },
    "Connections": [
        {
            "ID": 60351,
            "ConnectionTypeID": 25,
            "StatusTypeID": 50,
            "LevelID": 2,
            "Amps": 32,
            "Voltage": 400,
            "PowerKW": 22,
            "CurrentTypeID": 20,
            "Quantity": 2
        },
        {
            "ID": 60352,
            "ConnectionTypeID": 28,
            "StatusTypeID": 50,
            "LevelID": 2,
            "Amps": 16,
            "Voltage": 230,
            "PowerKW": 3.7,
            "CurrentTypeID": 10,
            "Quantity": 2
        }
    ],
    "NumberOfPoints": 2,
    "StatusTypeID": 50,
    "DateLastStatusUpdate": "2015-07-04T12:14:00Z",
    "DataQualityLevel": 1,
    "DateCreated": "2015-07-03T09:05:00Z",
    "SubmissionStatusTypeID": 200
}