{
    "IsRecentlyVerified": false,
    "ID": 114407,
    "UUID": "292DF88C-1189-4879-B737-31B19C6FBA85",
    "DataProviderID": 1,
    "OperatorID": 80,
    "UsageTypeID": 4,
    "AddressInfo": {
        "ID": 114753,
        "Title": "Borgaro Torinese Gramsci | EnelX",
        "AddressLine1": "Via Antonio Gramsci",
        "Town": "Borgaro Torinese",
        "StateOrProvince": "TO",
        "Postcode": "10071",
        "CountryID": 112,
        "Latitude": 45.1520438458153,
        "Longitude": 7.6595508049294,
        "ContactTelephone1": "800.069.850",
        "RelatedURL": "https://www.enelx.com/it/it/emobility",
        "DistanceUnit": 0
    },
    "Connections": [
        {
            "ID": 161050,
            "ConnectionTypeID": 25,
            "StatusTypeID": 50,
            "LevelID": 2,
            "Amps": 32,
            "Voltage": 400,
            "PowerKW": 22,
            "CurrentTypeID": 20,
            "Quantity": 2
        }
    ],
    "NumberOfPoints": 2,
    "StatusTypeID": 50,
    "DateLastStatusUpdate": "2019-01-07T16:52:00Z",
    "DataQualityLevel": 1,
    "DateCreated": "2019-01-07T16:51:00Z",
    "SubmissionStatusTypeID": 200
}