{
    "IsRecentlyVerified": false,
    "ID": 3418,
    "UUID": "ED96D9A5-3EB1-4CD8-AD0B-DCB6234BF972",
    "DataProviderID": 1,
    "OperatorID": 1,
    "AddressInfo": {
        "ID": 3419,
        "Title": "Nashville Scooters",
        "AddressLine1": "2612 Winford Avenue",
        "Town": "Nashville",
        "StateOrProvince": "TN",
        "Postcode": "37211",
        "CountryID": 2,
        "Latitude": 36.1157,
        "Longitude": -86.7525,
        "ContactTelephone1": "615-573-0367",
        "DistanceUnit": 0
    },
    "Connections": [],
    "NumberOfPoints": 1,
    "GeneralComments": "Cost To Charge: Unknown Access Hours: Verify",
    "DateLastStatusUpdate": "2019-12-15T06:07:00Z",
    "DateCreated": "2010-02-28T00:00:00Z",
    "SubmissionStatusTypeID": 200
}