{
    "IsRecentlyVerified": false,
    "ID": 44972,
    "UUID": "C455B76E-4651-48A2-91C2-40431D507A7F",
    "DataProviderID": 1,
    "OperatorID": 32,
    "OperatorsReference": "22016",
    "UsageTypeID": 4,
    "UsageCost": "£0.108/kWh; for Polar Plus subscription members only",
    "AddressInfo": {
        "ID": 45318,
        "Title": "Campbell Park Pavilion",
        "AddressLine1": "1300 Silbury Boulevard",
        "Town": "Milton Keynes",
        "Postcode": "MK9 4AD",
        "CountryID": 1,
        "Latitude": 52.050317,
        "Longitude": -0.736593,
        "AccessComments": "Campbell Park Pavilion car park - Parks Trust",
        "RelatedURL": "http://www.chargemasterplc.com",
        "DistanceUnit": 0
    },
    "Connections": [
        {
            "ID": 55295,
            "ConnectionTypeID": 2,
            "StatusTypeID": 100,
            "LevelID": 3,
            "Amps": 125,
            "Voltage": 500,
            "PowerKW": 50,
            "CurrentTypeID": 30,
            "Quantity": 1
        },
        {
            "ID": 55815,
            "ConnectionTypeID": 33,
            "StatusTypeID": 50,
            "LevelID": 3,
            "PowerKW": 50,
            "CurrentTypeID": 30,
            "Quantity": 1
        },
        {
            "ID": 55816,
            "ConnectionTypeID": 1036,
            "StatusTypeID": 100,
            "LevelID": 3,
            "Voltage": 400,
            "PowerKW": 43,
            "CurrentTypeID": 20,
            "Quantity": 1
        }
    ],
    "NumberOfPoints": 1,
    "StatusTypeID": 75,
    "DateLastStatusUpdate": "2019-06-26T05:16:00Z",
    "MetadataValues": [
        {
            "ID": 1402,
            "MetadataFieldID": 4,
            "ItemValue": "Contains public sector information licensed under the Open Government Licence v2.0. http://www.nationalarchives.gov.uk/doc/open-government-licence/version/2/"
        }
    ],
    "DataQualityLevel": 3,
    "DateCreated": "2015-04-22T03:02:00Z",
    "SubmissionStatusTypeID": 200
}