{
    "IsRecentlyVerified": false,
    "ID": 106514,
    "UUID": "B194D44A-B669-412A-ACDE-9116FFDD25DF",
    "DataProviderID": 1,
    "OperatorID": 23,
    "OperatorsReference": "44427",
    "UsageTypeID": 4,
    "AddressInfo": {
        "ID": 106860,
        "Title": "Hotels Van Oranje",
        "AddressLine1": "Koningin Wilhelmina Boulevard 20",
        "Town": "Noordwijk aan Zee",
        "Postcode": "2202 GV",
        "CountryID": 159,
        "Latitude": 52.247115,
        "Longitude": 4.432682,
        "ContactTelephone1": "+31 71 36 86 869",
        "DistanceUnit": 0
    },
    "Connections": [
        {
            "ID": 149891,
            "ConnectionTypeID": 30,
            "StatusTypeID": 50,
            "LevelID": 2,
            "Amps": 16,
            "Voltage": 400,
            "PowerKW": 11,
            "CurrentTypeID": 20,
            "Quantity": 2
        }
    ],
    "NumberOfPoints": 2,
    "GeneralComments": "2 Tesla Connectors, up to 11kW.Available for customers. Please see valet.",
    "StatusTypeID": 50,
    "DateLastStatusUpdate": "2018-10-03T23:25:00Z",
    "DataQualityLevel": 1,
    "DateCreated": "2018-06-23T05:41:00Z",
    "SubmissionStatusTypeID": 200
}