{
    "IsRecentlyVerified": false,
    "ID": 110264,
    "UUID": "E52A035B-61B8-43EC-A43F-84F902765BFA",
    "DataProviderID": 2,
    "DataProvidersReference": "103777",
    "UsageTypeID": 2,
    "AddressInfo": {
        "ID": 110610,
        "Title": "LADWP - McCullough Switching Station",
        "AddressLine1": "701 Eldorado Valley Dr",
        "Town": "Boulder City",
        "StateOrProvince": "NV",
        "Postcode": "89005",
        "CountryID": 2,
        "Latitude": 35.788775,
        "Longitude": -114.992726,
        "ContactTelephone1": "",
        "AccessComments": "",
        "RelatedURL": "",
        "DistanceUnit": 0
    },
    "Connections": [
        {
            "ID": 155503,
            "ConnectionTypeID": 1,
            "LevelID": 2,
            "Amps": 16,
            "Voltage": 230,
            "PowerKW": 3,
            "CurrentTypeID": 10,
            "Quantity": 2
        }
    ],
    "DateLastStatusUpdate": "2019-04-06T04:02:00Z",
    "DataQualityLevel": 3,
    "DateCreated": "2018-10-18T23:36:00Z",
    "SubmissionStatusTypeID": 100
}