{
    "UserComments": [
        {
            "ID": 19404,
            "ChargePointID": 31321,
            "CommentTypeID": 10,
            "UserName": "Clive ",
            "Comment": "",
            "DateCreated": "2018-04-11T03:31:16.87Z",
            "User": {
                "ID": 9176,
                "Username": "Clive "
            },
            "CheckinStatusTypeID": 10
        },
        {
            "ID": 19382,
            "ChargePointID": 31321,
            "CommentTypeID": 10,
            "UserName": "Clive ",
            "Comment": "On motorway services with usual benefits. Charged with CHAdeMO.",
            "Rating": 4,
            "DateCreated": "2018-04-05T20:16:56.497Z",
            "User": {
                "ID": 9176,
                "Username": "Clive "
            },
            "CheckinStatusTypeID": 10
        },
        {
            "ID": 6732,
            "ChargePointID": 31321,
            "CommentTypeID": 10,
            "UserName": "Leo_N",
            "Comment": "The type 2 AC is working to max 22KW and not at 43KW  as it should.",
            "Rating": 4,
            "DateCreated": "2015-10-09T07:16:39.923Z",
            "User": {
                "ID": 6318,
                "Username": "Leo_N"
            },
            "CheckinStatusTypeID": 10
        },
        {
            "ID": 6409,
            "ChargePointID": 31321,
            "CommentTypeID": 10,
            "UserName": "Leo_N",
            "Comment": "",
            "Rating": 5,
            "DateCreated": "2015-09-04T15:01:56.89Z",
            "User": {
                "ID": 6318,
                "Username": "Leo_N"
            },
            "CheckinStatusTypeID": 10
        },
        {
            "ID": 6289,
            "ChargePointID": 31321,
            "CommentTypeID": 10,
            "UserName": "Fred",
            "Comment": "All good",
            "DateCreated": "2015-08-23T22:44:39.933Z",
            "User": {
                "ID": 6253,
                "Username": "Fred"
            },
            "CheckinStatusTypeID": 10
        },
        {
            "ID": 4563,
            "ChargePointID": 31321,
            "CommentTypeID": 10,
            "UserName": "chrisnsteffie",
            "Comment": "Chademo working well.",
            "Rating": 5,
            "DateCreated": "2015-05-26T10:37:32.897Z",
            "User": {
                "ID": 4593,
                "Username": "chrisnsteffie"
            },
            "CheckinStatusTypeID": 10
        },
        {
            "ID": 3834,
            "ChargePointID": 31321,
            "CommentTypeID": 10,
            "UserName": "",
            "Comment": "Two fast charge units here serving both North and South-bound, which makes it a good choice to call in at.",
            "Rating": 5,
            "DateCreated": "2015-02-21T14:14:28.397Z",
            "CheckinStatusTypeID": 10
        }
    ],
    "MediaItems": [
        {
            "ID": 15197,
            "ChargePointID": 31321,
            "ItemURL": "https://s3-ap-southeast-2.amazonaws.com/openchargemap/images/GB/OCM31321/OCM-31321.orig.2018032308342656.jpg",
            "ItemThumbnailURL": "https://s3-ap-southeast-2.amazonaws.com/openchargemap/images/GB/OCM31321/OCM-31321.thmb.2018032308342656.jpg",
            "Comment": "",
            "IsEnabled": true,
            "IsVideo": false,
            "IsFeaturedItem": false,
            "IsExternalResource": false,
            "User": {
                "ID": 11911,
                "Username": "Uncle Dave"
            },
            "DateCreated": "2018-03-23T08:35:00Z"
        },
        {
            "ID": 15198,
            "ChargePointID": 31321,
            "ItemURL": "https://s3-ap-southeast-2.amazonaws.com/openchargemap/images/GB/OCM31321/OCM-31321.orig.2018032308351543.jpg",
            "ItemThumbnailURL": "https://s3-ap-southeast-2.amazonaws.com/openchargemap/images/GB/OCM31321/OCM-31321.thmb.2018032308351543.jpg",
            "Comment": "",
            "IsEnabled": true,
            "IsVideo": false,
            "IsFeaturedItem": false,
            "IsExternalResource": false,
            "User": {
                "ID": 11911,
                "Username": "Uncle Dave"
            },
            "DateCreated": "2018-03-23T08:35:00Z"
        }
    ],
    "IsRecentlyVerified": false,
    "ID": 31321,
    "UUID": "9F26CB8C-45ED-4F32-A525-964BAD6C2BE9",
    "DataProviderID": 1,
    "OperatorID": 24,
    "OperatorsReference": "1024,1025",
    "UsageTypeID": 4,
    "UsageCost": "£0.30/kWh; £0.15/kWh for Ecotricity energy customers",
    "AddressInfo": {
        "ID": 31667,
        "Title": "Gordano Welcome Break M5 Services",
        "AddressLine1": "M5 J19",
        "AddressLine2": "Portbury",
        "Town": "Bristol",
        "Postcode": "BS20 7XG",
        "CountryID": 1,
        "Latitude": 51.477402,
        "Longitude": -2.706834,
        "DistanceUnit": 0
    },
    "Connections": [
        {
            "ID": 34710,
            "ConnectionTypeID": 2,
            "StatusTypeID": 75,
            "LevelID": 3,
            "Amps": 125,
            "Voltage": 400,
            "PowerKW": 50,
            "CurrentTypeID": 30,
            "Quantity": 2
        },
        {
            "ID": 34711,
            "ConnectionTypeID": 1036,
            "StatusTypeID": 50,
            "LevelID": 3,
            "Amps": 63,
            "Voltage": 400,
            "PowerKW": 43,
            "CurrentTypeID": 20,
            "Quantity": 1
        },
        {
            "ID": 34712,
            "ConnectionTypeID": 33,
            "StatusTypeID": 100,
            "LevelID": 3,
            "Amps": 125,
            "Voltage": 400,
            "PowerKW": 50,
            "CurrentTypeID": 30,
            "Quantity": 1
        }
    ],
    "NumberOfPoints": 2,
    "GeneralComments": "Access to rapid chargers via Ecotricity Electric Highway app only.",
    "StatusTypeID": 75,
    "DateLastStatusUpdate": "2021-03-26T06:13:00Z",
    "DataQualityLevel": 1,
    "DateCreated": "2015-01-03T07:56:00Z",
    "SubmissionStatusTypeID": 200
}