{
    "IsRecentlyVerified": false,
    "ID": 99284,
    "UUID": "EB15F17B-6E1D-4098-A133-5409A7F2D5E0",
    "DataProviderID": 1,
    "OperatorID": 3279,
    "OperatorsReference": "0108",
    "UsageTypeID": 4,
    "UsageCost": "€0/kWh",
    "AddressInfo": {
        "ID": 99630,
        "Title": "Aparcament 3 Valldemossa",
        "AddressLine1": "Aparcament 3 Valldemossa",
        "Town": "Valldemossa",
        "Postcode": "07170",
        "CountryID": 210,
        "Latitude": 39.711384,
        "Longitude": 2.621946,
        "DistanceUnit": 0
    },
    "Connections": [
        {
            "ID": 140272,
            "ConnectionTypeID": 25,
            "StatusTypeID": 50,
            "LevelID": 2,
            "Amps": 32,
            "Voltage": 400,
            "PowerKW": 22,
            "CurrentTypeID": 20,
            "Quantity": 1
        },
        {
            "ID": 140273,
            "ConnectionTypeID": 28,
            "StatusTypeID": 50,
            "LevelID": 1,
            "Voltage": 230,
            "PowerKW": 2.3,
            "CurrentTypeID": 10,
            "Quantity": 1
        }
    ],
    "NumberOfPoints": 1,
    "StatusTypeID": 50,
    "DateLastStatusUpdate": "2019-12-18T20:22:00Z",
    "DataQualityLevel": 1,
    "DateCreated": "2018-01-25T18:47:00Z",
    "SubmissionStatusTypeID": 200
}