{
    "UserComments": [
        {
            "ID": 22076,
            "ChargePointID": 114742,
            "CommentTypeID": 10,
            "UserName": "Someone_Just_",
            "Rating": 4,
            "DateCreated": "2020-01-25T20:27:30.977Z",
            "User": {
                "ID": 1107,
                "Username": "Someone_Just_"
            },
            "CheckinStatusTypeID": 140,
            "IsActionedByEditor": false
        }
    ],
    "MediaItems": [
        {
            "ID": 21086,
            "ChargePointID": 114742,
            "ItemURL": "https://s3-ap-southeast-2.amazonaws.com/openchargemap/images/BE/OCM114742/OCM-114742.orig.2020012520292472.jpg",
            "ItemThumbnailURL": "https://s3-ap-southeast-2.amazonaws.com/openchargemap/images/BE/OCM114742/OCM-114742.thmb.2020012520292472.jpg",
            "Comment": "",
            "IsEnabled": true,
            "IsVideo": false,
            "IsFeaturedItem": false,
            "IsExternalResource": false,
            "User": {
                "ID": 1107,
                "Username": "Someone_Just_"
            },
            "DateCreated": "2020-01-25T20:29:00Z"
        }
    ],
    "IsRecentlyVerified": false,
    "ID": 114742,
    "UUID": "B58DF05B-E202-4B1A-96E1-7BF41B561774",
    "DataProviderID": 1,
    "OperatorID": 103,
    "OperatorsReference": "BEALLEGO000960",
    "UsageTypeID": 1,
    "AddressInfo": {
        "ID": 115088,
        "Title": "Doornzelestraat 86",
        "AddressLine1": "Doornzelestraat 86",
        "Town": "GENT",
        "StateOrProvince": "Oost-Vlaanderen",
        "Postcode": "9000",
        "CountryID": 26,
        "Latitude": 51.0642243,
        "Longitude": 3.73332640000001,
        "AccessComments": "Eén van de laadpunten is voorbehouden voor klanten van Battmobiel.",
        "DistanceUnit": 0
    },
    "Connections": [
        {
            "ID": 161481,
            "ConnectionTypeID": 25,
            "StatusTypeID": 50,
            "LevelID": 2,
            "Amps": 16,
            "Voltage": 400,
            "PowerKW": 11,
            "CurrentTypeID": 20,
            "Quantity": 2
        }
    ],
    "NumberOfPoints": 2,
    "StatusTypeID": 50,
    "DateLastStatusUpdate": "2020-01-25T20:29:00Z",
    "DataQualityLevel": 1,
    "DateCreated": "2019-01-14T15:19:00Z",
    "SubmissionStatusTypeID": 200
}