{
    "IsRecentlyVerified": false,
    "ID": 84034,
    "UUID": "D85298BB-89B6-4C6D-8CCC-ACE3B4C74070",
    "DataProviderID": 1,
    "OperatorID": 23,
    "OperatorsReference": "24779",
    "UsageTypeID": 6,
    "AddressInfo": {
        "ID": 84380,
        "Title": "Hotel-Restaurant Mardaga",
        "AddressLine1": "Stationsstraat 121",
        "Town": "As",
        "Postcode": "3665",
        "CountryID": 26,
        "Latitude": 51.005927,
        "Longitude": 5.601757,
        "ContactTelephone1": "+32 89 65 62 65",
        "DistanceUnit": 0
    },
    "Connections": [
        {
            "ID": 119435,
            "ConnectionTypeID": 30,
            "StatusTypeID": 50,
            "LevelID": 2,
            "Amps": 16,
            "Voltage": 400,
            "PowerKW": 11,
            "CurrentTypeID": 20,
            "Quantity": 2
        }
    ],
    "NumberOfPoints": 2,
    "GeneralComments": "2 Tesla Connectors, up to 11kW.Available for patrons only. Please see front desk.",
    "StatusTypeID": 50,
    "DateLastStatusUpdate": "2018-10-03T14:19:00Z",
    "DataQualityLevel": 1,
    "DateCreated": "2017-02-16T10:43:00Z",
    "SubmissionStatusTypeID": 200
}