{
    "IsRecentlyVerified": false,
    "ID": 34652,
    "UUID": "A05109A9-EA07-47A1-81DF-0407A1B0A800",
    "DataProviderID": 1,
    "OperatorID": 105,
    "OperatorsReference": "Essent EM-DE-05554060-01-00001",
    "UsageTypeID": 4,
    "AddressInfo": {
        "ID": 34998,
        "Title": "Winterswyker Straße 1",
        "AddressLine1": "Winterswyker Straße 1",
        "Town": "Südlohn",
        "Postcode": "46354",
        "CountryID": 87,
        "Latitude": 51.934722,
        "Longitude": 6.809167,
        "DistanceUnit": 0
    },
    "Connections": [
        {
            "ID": 38163,
            "ConnectionTypeID": 25,
            "LevelID": 2,
            "PowerKW": 11
        },
        {
            "ID": 47429,
            "ConnectionTypeID": 25,
            "LevelID": 2,
            "PowerKW": 11
        }
    ],
    "NumberOfPoints": 1,
    "StatusTypeID": 50,
    "DateLastStatusUpdate": "2015-04-13T06:17:00Z",
    "DataQualityLevel": 3,
    "DateCreated": "2015-01-09T06:04:00Z",
    "SubmissionStatusTypeID": 200
}