{
    "IsRecentlyVerified": false,
    "ID": 159747,
    "UUID": "E6DC25CA-605B-40AF-9E03-D01C35F27E76",
    "DataProviderID": 2,
    "DataProvidersReference": "154368",
    "OperatorID": 5,
    "UsageTypeID": 1,
    "AddressInfo": {
        "ID": 160104,
        "Title": "MB OF NEWTON",
        "AddressLine1": "92 Hampton House Rd",
        "Town": "Newton",
        "StateOrProvince": "NJ",
        "Postcode": "07860",
        "CountryID": 2,
        "Latitude": 41.087894,
        "Longitude": -74.73008,
        "ContactTelephone1": "888-758-4389",
        "AccessComments": "24 hours daily",
        "RelatedURL": "http://www.chargepoint.com/",
        "DistanceUnit": 0
    },
    "Connections": [
        {
            "ID": 229960,
            "ConnectionTypeID": 1,
            "LevelID": 2,
            "Amps": 16,
            "Voltage": 230,
            "PowerKW": 3.7,
            "CurrentTypeID": 10,
            "Quantity": 4
        }
    ],
    "StatusTypeID": 50,
    "DateLastStatusUpdate": "2020-06-26T03:04:00Z",
    "DataQualityLevel": 3,
    "DateCreated": "2020-06-26T03:04:00Z",
    "SubmissionStatusTypeID": 100
}