{
    "IsRecentlyVerified": false,
    "ID": 106372,
    "UUID": "81CEF801-32C5-4347-BF93-1ECE6E382F51",
    "DataProviderID": 1,
    "OperatorID": 170,
    "UsageTypeID": 4,
    "AddressInfo": {
        "ID": 106718,
        "Title": "Walter Arno Platz",
        "AddressLine1": "Schulstraße 10",
        "Town": "Seeth-Ekholt",
        "StateOrProvince": "Elmshorn-Land",
        "Postcode": "25337",
        "CountryID": 87,
        "Latitude": 53.74161421610499,
        "Longitude": 9.729268746032744,
        "ContactTelephone1": "+49 41216450",
        "AccessComments": "24/7 nutzbar mit Ladekarte der Stadtwerke",
        "RelatedURL": "https://www.stadtwerke-elmshorn.de/eMobil",
        "DistanceUnit": 0
    },
    "Connections": [
        {
            "ID": 149738,
            "ConnectionTypeID": 25,
            "StatusTypeID": 50,
            "LevelID": 2,
            "Amps": 32,
            "Voltage": 400,
            "PowerKW": 22,
            "CurrentTypeID": 20,
            "Quantity": 2
        }
    ],
    "NumberOfPoints": 2,
    "StatusTypeID": 50,
    "DateLastStatusUpdate": "2018-06-21T07:57:00Z",
    "DataQualityLevel": 1,
    "DateCreated": "2018-06-21T07:57:00Z",
    "SubmissionStatusTypeID": 200
}