{
    "IsRecentlyVerified": false,
    "ID": 137110,
    "UUID": "37375FD6-A6FE-427C-8612-14F484339CD2",
    "DataProviderID": 1,
    "DataProvidersReference": "LSB-00091",
    "OperatorID": 21,
    "UsageTypeID": 4,
    "UsageCost": "Mobi.E compatible card",
    "AddressInfo": {
        "ID": 137456,
        "Title": "LSB-00091",
        "AddressLine1": "Avenida D. Carlos I",
        "Town": "Lisboa",
        "Postcode": "1200-650",
        "CountryID": 180,
        "Latitude": 38.709528,
        "Longitude": -9.153297,
        "RelatedURL": "http://www.mobie.pt",
        "DistanceUnit": 0
    },
    "Connections": [
        {
            "ID": 191967,
            "ConnectionTypeID": 25,
            "StatusTypeID": 50,
            "LevelID": 2,
            "Amps": 32,
            "Voltage": 400,
            "PowerKW": 22,
            "CurrentTypeID": 20,
            "Quantity": 2
        }
    ],
    "NumberOfPoints": 2,
    "StatusTypeID": 50,
    "DateLastStatusUpdate": "2020-08-16T09:53:00Z",
    "DataQualityLevel": 3,
    "DateCreated": "2019-12-24T08:08:00Z",
    "SubmissionStatusTypeID": 100
}