{
    "IsRecentlyVerified": false,
    "ID": 183853,
    "UUID": "903FB3F1-5BB5-42D9-843E-01FB26ECC9EA",
    "DataProviderID": 29,
    "DataProvidersReference": "11288",
    "OperatorID": 2241,
    "AddressInfo": {
        "ID": 184212,
        "Title": "Hambrücker Straße 52",
        "AddressLine1": "Hambrücker Straße 52",
        "Town": "Forst",
        "Postcode": "76694",
        "CountryID": 87,
        "Latitude": 49.153369,
        "Longitude": 8.579444,
        "DistanceUnit": 0
    },
    "Connections": [
        {
            "ID": 291348,
            "ConnectionTypeID": 28,
            "StatusTypeID": 50,
            "LevelID": 2,
            "PowerKW": 22,
            "CurrentTypeID": 20
        },
        {
            "ID": 291349,
            "ConnectionTypeID": 25,
            "StatusTypeID": 50,
            "LevelID": 2,
            "PowerKW": 22,
            "CurrentTypeID": 20
        },
        {
            "ID": 291350,
            "ConnectionTypeID": 28,
            "StatusTypeID": 50,
            "LevelID": 2,
            "PowerKW": 22,
            "CurrentTypeID": 20
        },
        {
            "ID": 291351,
            "ConnectionTypeID": 25,
            "StatusTypeID": 50,
            "LevelID": 2,
            "PowerKW": 22,
            "CurrentTypeID": 20
        }
    ],
    "StatusTypeID": 50,
    "DateLastStatusUpdate": "2021-07-12T02:42:00Z",
    "MetadataValues": [
        {
            "ID": 16146,
            "MetadataFieldID": 4,
            "ItemValue": "Data from the German chargepoint registry provided by Bundesnetzagentur.de under the CC-BY 4.0 license"
        }
    ],
    "DataQualityLevel": 3,
    "DateCreated": "2021-07-08T10:04:00Z",
    "SubmissionStatusTypeID": 100
}