{
    "UserComments": [
        {
            "ID": 17479,
            "ChargePointID": 53177,
            "CommentTypeID": 10,
            "UserName": "TheScotstounPele",
            "Comment": "Working well",
            "Rating": 5,
            "DateCreated": "2017-07-15T19:09:11.93Z",
            "User": {
                "ID": 6377,
                "Username": "TheScotstounPele"
            },
            "CheckinStatusTypeID": 10
        },
        {
            "ID": 16058,
            "ChargePointID": 53177,
            "CommentTypeID": 10,
            "UserName": "TheScotstounPele",
            "Comment": "Working well.",
            "DateCreated": "2017-03-14T20:46:01.58Z",
            "User": {
                "ID": 6377,
                "Username": "TheScotstounPele"
            },
            "CheckinStatusTypeID": 10
        },
        {
            "ID": 14579,
            "ChargePointID": 53177,
            "CommentTypeID": 10,
            "UserName": "jdsx",
            "Comment": "Chademo unit charged fine",
            "DateCreated": "2016-11-21T11:52:35.123Z",
            "User": {
                "ID": 6415,
                "Username": "jdsx"
            },
            "CheckinStatusTypeID": 10
        },
        {
            "ID": 14469,
            "ChargePointID": 53177,
            "CommentTypeID": 10,
            "UserName": "Anon74856763534",
            "Comment": "",
            "DateCreated": "2016-10-29T15:24:01.24Z",
            "User": {
                "ID": 1192,
                "Username": "Anon74856763534"
            },
            "CheckinStatusTypeID": 10
        },
        {
            "ID": 14307,
            "ChargePointID": 53177,
            "CommentTypeID": 10,
            "UserName": "TheScotstounPele",
            "Comment": "Successful chademo charge yesterday 24/9/16",
            "DateCreated": "2016-09-25T14:09:26.887Z",
            "User": {
                "ID": 6377,
                "Username": "TheScotstounPele"
            },
            "CheckinStatusTypeID": 10
        },
        {
            "ID": 14113,
            "ChargePointID": 53177,
            "CommentTypeID": 10,
            "UserName": "Anon74856763534",
            "Comment": "Successful CHAdeMO charge reported.",
            "DateCreated": "2016-08-19T18:17:20.857Z",
            "User": {
                "ID": 1192,
                "Username": "Anon74856763534"
            },
            "CheckinStatusTypeID": 10
        },
        {
            "ID": 11655,
            "ChargePointID": 53177,
            "CommentTypeID": 10,
            "UserName": "jivemonkey",
            "Comment": "AC tripped.",
            "DateCreated": "2016-06-18T10:25:36.347Z",
            "User": {
                "ID": 6337,
                "Username": "jivemonkey"
            },
            "CheckinStatusTypeID": 20
        },
        {
            "ID": 10486,
            "ChargePointID": 53177,
            "CommentTypeID": 10,
            "UserName": "Robert Malcolm Kay",
            "Comment": "Same error as Dalmellinton",
            "DateCreated": "2016-05-24T19:34:19.313Z",
            "User": {
                "ID": 4751,
                "Username": "Robert Malcolm Kay"
            },
            "CheckinStatusTypeID": 25
        },
        {
            "ID": 10250,
            "ChargePointID": 53177,
            "CommentTypeID": 10,
            "UserName": "TheScotstounPele",
            "Comment": "12kwh in 28 mins Chademo charge. Handle slightly tricky but nothing major. ",
            "DateCreated": "2016-04-27T13:06:18.847Z",
            "User": {
                "ID": 6377,
                "Username": "TheScotstounPele"
            },
            "CheckinStatusTypeID": 10
        },
        {
            "ID": 9924,
            "ChargePointID": 53177,
            "CommentTypeID": 10,
            "UserName": "TheScotstounPele",
            "Comment": "Successful Chademo charge. Nearby athletics arena has public toilet facility and cold drinks machine. Nearest cafe is apparently Burger King 5 mins walk away. ",
            "Rating": 4,
            "DateCreated": "2016-03-14T13:00:33.363Z",
            "User": {
                "ID": 6377,
                "Username": "TheScotstounPele"
            },
            "CheckinStatusTypeID": 10
        },
        {
            "ID": 6727,
            "ChargePointID": 53177,
            "CommentTypeID": 10,
            "UserName": "Anon74856763534",
            "Comment": "Successful DC charge reported.",
            "DateCreated": "2015-10-08T20:38:53.25Z",
            "User": {
                "ID": 1192,
                "Username": "Anon74856763534"
            },
            "CheckinStatusTypeID": 0
        }
    ],
    "MediaItems": [
        {
            "ID": 3360,
            "ChargePointID": 53177,
            "ItemURL": "https://s3-ap-southeast-2.amazonaws.com/openchargemap/images/GB/OCM53177/OCM-53177.orig.2015100820390490.jpeg",
            "ItemThumbnailURL": "https://s3-ap-southeast-2.amazonaws.com/openchargemap/images/GB/OCM53177/OCM-53177.thmb.2015100820390490.jpeg",
            "Comment": "",
            "IsEnabled": true,
            "IsVideo": false,
            "IsFeaturedItem": false,
            "IsExternalResource": false,
            "User": {
                "ID": 1192,
                "Username": "Anon74856763534"
            },
            "DateCreated": "2015-10-08T20:39:00Z"
        }
    ],
    "IsRecentlyVerified": false,
    "ID": 53177,
    "UUID": "AD8FEDD3-F610-42A0-88DD-8CAAC6374E48",
    "DataProviderID": 1,
    "OperatorID": 3315,
    "OperatorsReference": "50669,50820",
    "UsageTypeID": 4,
    "UsageCost": "Free",
    "AddressInfo": {
        "ID": 53523,
        "Title": "Kilmarnock Athletics Arena",
        "AddressLine1": "Queen's Drive",
        "Town": "Kilmarnock",
        "StateOrProvince": "Ayrshire",
        "Postcode": "KA1 3NG",
        "CountryID": 1,
        "Latitude": 55.59909,
        "Longitude": -4.48153000000002,
        "RelatedURL": "http://www.chargeyourcar.org.uk",
        "DistanceUnit": 0
    },
    "Connections": [
        {
            "ID": 66261,
            "ConnectionTypeID": 33,
            "StatusTypeID": 100,
            "LevelID": 3,
            "Amps": 125,
            "Voltage": 400,
            "PowerKW": 50,
            "CurrentTypeID": 30,
            "Quantity": 5
        },
        {
            "ID": 67956,
            "ConnectionTypeID": 2,
            "StatusTypeID": 50,
            "LevelID": 3,
            "Amps": 125,
            "Voltage": 400,
            "PowerKW": 50,
            "CurrentTypeID": 30,
            "Quantity": 5
        },
        {
            "ID": 68712,
            "ConnectionTypeID": 1036,
            "StatusTypeID": 50,
            "LevelID": 3,
            "Voltage": 400,
            "PowerKW": 43,
            "CurrentTypeID": 20,
            "Quantity": 5
        },
        {
            "ID": 124120,
            "ConnectionTypeID": 25,
            "StatusTypeID": 50,
            "LevelID": 2,
            "Amps": 32,
            "Voltage": 400,
            "PowerKW": 22,
            "CurrentTypeID": 20,
            "Quantity": 4
        }
    ],
    "NumberOfPoints": 5,
    "StatusTypeID": 50,
    "DateLastStatusUpdate": "2020-05-07T05:15:00Z",
    "MetadataValues": [
        {
            "ID": 1848,
            "MetadataFieldID": 4,
            "ItemValue": "Contains public sector information licensed under the Open Government Licence v2.0. http://www.nationalarchives.gov.uk/doc/open-government-licence/version/2/"
        }
    ],
    "DataQualityLevel": 3,
    "DateCreated": "2015-09-20T11:10:00Z",
    "SubmissionStatusTypeID": 200
}