{
    "IsRecentlyVerified": false,
    "ID": 148998,
    "UUID": "D125209E-BF97-4907-9573-CE6B387F3573",
    "DataProviderID": 1,
    "OperatorID": 20,
    "OperatorsReference": "CM11925",
    "UsageTypeID": 4,
    "UsageCost": "£0.30/kWh;min £1.50",
    "AddressInfo": {
        "ID": 149351,
        "Title": "The Common Car Park, Common Hill",
        "AddressLine1": "The Common Car Park, Common Hill",
        "Postcode": "CB11 4ER",
        "CountryID": 1,
        "Latitude": 52.02396,
        "Longitude": 0.2436,
        "DistanceUnit": 0
    },
    "Connections": [
        {
            "ID": 206916,
            "ConnectionTypeID": 25,
            "StatusTypeID": 50,
            "LevelID": 2,
            "Amps": 32,
            "Voltage": 400,
            "PowerKW": 22,
            "CurrentTypeID": 20,
            "Quantity": 2
        }
    ],
    "NumberOfPoints": 2,
    "StatusTypeID": 50,
    "DateLastStatusUpdate": "2020-02-15T06:16:00Z",
    "DataQualityLevel": 1,
    "DateCreated": "2020-02-15T06:16:00Z",
    "SubmissionStatusTypeID": 200
}