{
    "IsRecentlyVerified": false,
    "ID": 48738,
    "UUID": "47FF1660-CB27-4B48-8612-1A97C600AC14",
    "DataProviderID": 1,
    "OperatorID": 20,
    "OperatorsReference": "60088,60089",
    "UsageTypeID": 4,
    "UsageCost": "Free",
    "AddressInfo": {
        "ID": 49084,
        "Title": "Lacy Street",
        "AddressLine1": "Lacy Street",
        "AddressLine2": "Stretford",
        "Town": "Manchester",
        "Postcode": "M32 8LX",
        "CountryID": 1,
        "Latitude": 53.4441877,
        "Longitude": -2.3075327,
        "DistanceUnit": 0
    },
    "Connections": [
        {
            "ID": 60200,
            "ConnectionTypeID": 25,
            "StatusTypeID": 50,
            "LevelID": 2,
            "Amps": 32,
            "Voltage": 230,
            "PowerKW": 7,
            "CurrentTypeID": 10,
            "Quantity": 2
        }
    ],
    "NumberOfPoints": 2,
    "StatusTypeID": 50,
    "DateLastStatusUpdate": "2019-07-20T05:14:00Z",
    "DataQualityLevel": 1,
    "DateCreated": "2015-06-29T09:51:00Z",
    "SubmissionStatusTypeID": 100
}