{
    "IsRecentlyVerified": false,
    "ID": 175912,
    "UUID": "A1F2F814-612A-476F-9963-46A13887CBE5",
    "DataProviderID": 1,
    "OperatorID": 80,
    "UsageTypeID": 4,
    "UsageCost": "free",
    "AddressInfo": {
        "ID": 176271,
        "Title": "Las Condes - Mar de los sargazos - Apumanque",
        "AddressLine1": "Mar de los Sargazos 5815",
        "Town": "Las Condes",
        "StateOrProvince": "Región Metropolitana de Santiago",
        "Postcode": "7550000",
        "CountryID": 49,
        "Latitude": -33.410127243262174,
        "Longitude": -70.56922808580265,
        "RelatedURL": "https://www.enelx.com/cl/es",
        "DistanceUnit": 0
    },
    "Connections": [
        {
            "ID": 273192,
            "ConnectionTypeID": 25,
            "StatusTypeID": 50,
            "LevelID": 2,
            "PowerKW": 22,
            "Quantity": 1
        }
    ],
    "NumberOfPoints": 1,
    "StatusTypeID": 50,
    "DateLastStatusUpdate": "2021-06-18T19:45:00Z",
    "DataQualityLevel": 1,
    "DateCreated": "2021-06-18T19:45:00Z",
    "SubmissionStatusTypeID": 200
}