{
    "IsRecentlyVerified": false,
    "ID": 36051,
    "UUID": "264041B8-20E5-4F0C-A243-F02F207F2E1D",
    "DataProviderID": 26,
    "DataProvidersReference": "50589",
    "OperatorID": 180,
    "OperatorsReference": "Alfen GDH0311",
    "UsageCost": "0.00 jaarabonnement",
    "AddressInfo": {
        "ID": 36397,
        "Title": "Prins Mauritslaan 29",
        "AddressLine1": "Prins Mauritslaan 29",
        "Town": "Den Haag",
        "Postcode": "2582 LK",
        "CountryID": 159,
        "Latitude": 52.094775,
        "Longitude": 4.27878,
        "ContactTelephone1": "036 - 549 34 00",
        "RelatedURL": "http://www.icu-charging-stations.com/",
        "DistanceUnit": 0
    },
    "Connections": [
        {
            "ID": 39562,
            "ConnectionTypeID": 25,
            "LevelID": 2,
            "PowerKW": 11,
            "CurrentTypeID": 10
        },
        {
            "ID": 48215,
            "ConnectionTypeID": 25,
            "LevelID": 2,
            "PowerKW": 11,
            "CurrentTypeID": 10
        }
    ],
    "NumberOfPoints": 1,
    "StatusTypeID": 50,
    "DateLastStatusUpdate": "2016-06-04T02:50:00Z",
    "DataQualityLevel": 3,
    "DateCreated": "2015-01-09T06:05:00Z",
    "SubmissionStatusTypeID": 100
}