{
    "IsRecentlyVerified": false,
    "ID": 130599,
    "UUID": "7A1378C3-C69D-496B-B229-5AF6406BDD22",
    "DataProviderID": 1,
    "OperatorID": 3367,
    "UsageTypeID": 4,
    "AddressInfo": {
        "ID": 130945,
        "Title": "SHARZ - Energy Havsa Petrol",
        "AddressLine1": "D100",
        "Town": "Havsa",
        "StateOrProvince": "Havsa",
        "CountryID": 229,
        "Latitude": 41.5410724867743,
        "Longitude": 26.8315044489558,
        "DistanceUnit": 0
    },
    "Connections": [
        {
            "ID": 182831,
            "ConnectionTypeID": 25,
            "StatusTypeID": 50,
            "LevelID": 2,
            "Amps": 32,
            "Voltage": 400,
            "PowerKW": 22,
            "CurrentTypeID": 20,
            "Quantity": 1
        }
    ],
    "NumberOfPoints": 1,
    "GeneralComments": "www.sharz.net",
    "StatusTypeID": 50,
    "DateLastStatusUpdate": "2019-08-09T09:13:00Z",
    "DataQualityLevel": 1,
    "DateCreated": "2019-08-07T12:19:00Z",
    "SubmissionStatusTypeID": 200
}