{
    "IsRecentlyVerified": false,
    "ID": 173613,
    "UUID": "9233F05E-690F-4F93-874E-AE05F2160EBE",
    "DataProviderID": 18,
    "DataProvidersReference": "e4e658466b78e5a55605e78a3cff7768",
    "OperatorID": 3345,
    "UsageTypeID": 5,
    "AddressInfo": {
        "ID": 173972,
        "Title": "N10 2NH",
        "AddressLine1": "",
        "Town": "Haringey ",
        "Postcode": "N10 2NH",
        "CountryID": 1,
        "Latitude": 51.59754,
        "Longitude": -0.13868,
        "AccessComments": "",
        "RelatedURL": "https://char.gy",
        "DistanceUnit": 0
    },
    "Connections": [
        {
            "ID": 266699,
            "ConnectionTypeID": 25,
            "Reference": "23",
            "StatusTypeID": 50,
            "LevelID": 2,
            "Amps": 16,
            "Voltage": 230,
            "PowerKW": 3.7,
            "CurrentTypeID": 10
        }
    ],
    "StatusTypeID": 0,
    "DateLastStatusUpdate": "2021-03-03T11:25:00Z",
    "MetadataValues": [
        {
            "ID": 8535,
            "MetadataFieldID": 4,
            "ItemValue": "Contains public sector information licensed under the Open Government Licence v2.0. http://www.nationalarchives.gov.uk/doc/open-government-licence/version/2/"
        }
    ],
    "DataQualityLevel": 3,
    "DateCreated": "2021-03-03T11:25:00Z",
    "SubmissionStatusTypeID": 100
}