{
    "IsRecentlyVerified": false,
    "ID": 77234,
    "UUID": "C8373FA1-7042-4FC6-980B-3163C3332CAB",
    "DataProviderID": 1,
    "OperatorID": 1235,
    "OperatorsReference": "552ad589e4b0bb5dc6de57f9",
    "UsageTypeID": 4,
    "UsageCost": ">3kW: 0,70€/5min ; Autres tarifs disponibles",
    "AddressInfo": {
        "ID": 77580,
        "Title": "Grenoble - Achard",
        "AddressLine1": "Place Achard",
        "Town": "Grenoble",
        "StateOrProvince": "Isère",
        "Postcode": "38000",
        "CountryID": 80,
        "Latitude": 45.1893865003,
        "Longitude": 5.7293912641,
        "DistanceUnit": 0
    },
    "Connections": [
        {
            "ID": 111070,
            "ConnectionTypeID": 25,
            "StatusTypeID": 50,
            "LevelID": 2,
            "Amps": 32,
            "Voltage": 400,
            "PowerKW": 22,
            "CurrentTypeID": 20,
            "Quantity": 1
        },
        {
            "ID": 111071,
            "ConnectionTypeID": 23,
            "StatusTypeID": 50,
            "LevelID": 1,
            "Amps": 16,
            "Voltage": 230,
            "PowerKW": 2,
            "CurrentTypeID": 10,
            "Quantity": 1
        },
        {
            "ID": 111304,
            "ConnectionTypeID": 28,
            "StatusTypeID": 50,
            "LevelID": 2,
            "PowerKW": 4,
            "CurrentTypeID": 20,
            "Quantity": 1
        },
        {
            "ID": 112030,
            "ConnectionTypeID": 1036,
            "StatusTypeID": 50,
            "LevelID": 2,
            "PowerKW": 22,
            "CurrentTypeID": 20,
            "Quantity": 1
        },
        {
            "ID": 112031,
            "ConnectionTypeID": 33,
            "StatusTypeID": 150,
            "LevelID": 2,
            "PowerKW": 22,
            "CurrentTypeID": 20,
            "Quantity": 1
        },
        {
            "ID": 112032,
            "ConnectionTypeID": 2,
            "StatusTypeID": 150,
            "LevelID": 2,
            "PowerKW": 22,
            "CurrentTypeID": 20,
            "Quantity": 1
        }
    ],
    "NumberOfPoints": 4,
    "StatusTypeID": 50,
    "DateLastStatusUpdate": "2017-04-10T22:55:00Z",
    "DataQualityLevel": 1,
    "DateCreated": "2017-01-06T16:19:00Z",
    "SubmissionStatusTypeID": 200
}