{
    "IsRecentlyVerified": false,
    "ID": 139375,
    "UUID": "12C295C3-3654-4B17-984D-F3213B977E8D",
    "DataProviderID": 2,
    "DataProvidersReference": "148710",
    "OperatorID": 39,
    "UsageTypeID": 1,
    "AddressInfo": {
        "ID": 139727,
        "Title": "Newbergh ATL Apartments",
        "AddressLine1": "761 Morosgo Drive NE",
        "Town": "Atlanta",
        "StateOrProvince": "GA",
        "Postcode": "30324",
        "CountryID": 2,
        "Latitude": 33.8224719,
        "Longitude": -84.362502,
        "ContactTelephone1": "800-663-5633",
        "AccessComments": "MO: Not Specified; TU: Not Specified; WE: Not Specified; TH: Not Specified; FR: Not Specified; SA: Not Specified; SU: Not Specified",
        "RelatedURL": "http://www.semacharge.com/",
        "DistanceUnit": 0
    },
    "Connections": [
        {
            "ID": 194705,
            "ConnectionTypeID": 1,
            "LevelID": 2,
            "Amps": 16,
            "Voltage": 230,
            "PowerKW": 3.7,
            "CurrentTypeID": 10,
            "Quantity": 4
        }
    ],
    "StatusTypeID": 50,
    "DateLastStatusUpdate": "2020-06-26T02:56:00Z",
    "DataQualityLevel": 3,
    "DateCreated": "2019-12-24T09:10:00Z",
    "SubmissionStatusTypeID": 100
}