{
    "IsRecentlyVerified": false,
    "ID": 34296,
    "UUID": "6A93CD44-8B35-4DEE-B1F1-71111A7DF22C",
    "DataProviderID": 26,
    "DataProvidersReference": "48504",
    "OperatorID": 178,
    "OperatorsReference": "EVnetNL REE062",
    "UsageCost": "0.00 jaarabonnement",
    "AddressInfo": {
        "ID": 34642,
        "Title": "Paul Krugerstraat 113A",
        "AddressLine1": "Paul Krugerstraat 113A",
        "Town": "Rotterdam",
        "Postcode": "3072 GE",
        "CountryID": 159,
        "Latitude": 51.900435,
        "Longitude": 4.499062,
        "ContactTelephone1": "0800-3522365",
        "RelatedURL": "http://www.evnet.nl",
        "DistanceUnit": 0
    },
    "Connections": [
        {
            "ID": 37807,
            "ConnectionTypeID": 25,
            "LevelID": 2,
            "PowerKW": 11,
            "CurrentTypeID": 10
        }
    ],
    "NumberOfPoints": 2,
    "StatusTypeID": 50,
    "DateLastStatusUpdate": "2016-06-04T02:42:00Z",
    "DataQualityLevel": 3,
    "DateCreated": "2015-01-09T06:04:00Z",
    "SubmissionStatusTypeID": 100
}