{
    "IsRecentlyVerified": false,
    "ID": 104138,
    "UUID": "809496A1-63C8-4CE3-84EE-225FBF4EC652",
    "DataProviderID": 1,
    "OperatorID": 45,
    "UsageTypeID": 3,
    "AddressInfo": {
        "ID": 104484,
        "Title": "Obeta Elektrogroßhandel",
        "AddressLine1": "Gubener Straße 18",
        "Town": "Cottbus",
        "StateOrProvince": "Brandenburg",
        "Postcode": "03042",
        "CountryID": 87,
        "Latitude": 51.76314354245457,
        "Longitude": 14.366257061376928,
        "AccessComments": "Laden nur zu den Öffnungszeiten nach Anmeldung möglich",
        "RelatedURL": "https://obeta.de/standorte",
        "DistanceUnit": 0
    },
    "Connections": [
        {
            "ID": 147064,
            "ConnectionTypeID": 25,
            "StatusTypeID": 50,
            "LevelID": 2,
            "Amps": 32,
            "Voltage": 400,
            "PowerKW": 22,
            "CurrentTypeID": 20,
            "Quantity": 2
        }
    ],
    "NumberOfPoints": 2,
    "StatusTypeID": 50,
    "DateLastStatusUpdate": "2018-05-16T12:07:00Z",
    "DataQualityLevel": 1,
    "DateCreated": "2018-05-16T12:07:00Z",
    "SubmissionStatusTypeID": 200
}