{
    "IsRecentlyVerified": false,
    "ID": 29489,
    "UUID": "12F8A459-46C8-4FEF-8C76-39FA87DEBF87",
    "DataProviderID": 15,
    "DataProvidersReference": "27103",
    "OperatorID": 1,
    "UsageTypeID": 1,
    "AddressInfo": {
        "ID": 29835,
        "Title": "54 Halekauila St",
        "AddressLine1": "54 Halekauila St",
        "Town": "Hilo",
        "StateOrProvince": "HI",
        "Postcode": "96720",
        "CountryID": 2,
        "Latitude": 19.70422,
        "Longitude": -155.06117,
        "ContactTelephone1": "(808) 935-1171",
        "RelatedURL": "http://carstations.com/27103",
        "DistanceUnit": 0
    },
    "Connections": [
        {
            "ID": 32474,
            "ConnectionTypeID": 1,
            "Reference": "J1772",
            "LevelID": 2
        }
    ],
    "NumberOfPoints": 1,
    "StatusTypeID": 0,
    "DateLastStatusUpdate": "2017-11-04T14:03:00Z",
    "DataQualityLevel": 2,
    "DateCreated": "2014-11-29T05:39:00Z",
    "SubmissionStatusTypeID": 100
}