{
    "IsRecentlyVerified": false,
    "ID": 179712,
    "UUID": "E840CA48-E0A0-4EE6-BF56-EA6772A6F382",
    "DataProviderID": 29,
    "DataProvidersReference": "7822",
    "AddressInfo": {
        "ID": 180071,
        "Title": "Westlicher Stadtgraben 18",
        "AddressLine1": "Westlicher Stadtgraben 18",
        "Town": "Deggendorf",
        "Postcode": "94469",
        "CountryID": 87,
        "Latitude": 48.8338,
        "Longitude": 12.96557,
        "DistanceUnit": 0
    },
    "Connections": [
        {
            "ID": 281877,
            "ConnectionTypeID": 25,
            "StatusTypeID": 50,
            "LevelID": 2,
            "PowerKW": 22,
            "CurrentTypeID": 20
        },
        {
            "ID": 281878,
            "ConnectionTypeID": 25,
            "StatusTypeID": 50,
            "LevelID": 2,
            "PowerKW": 22,
            "CurrentTypeID": 20
        }
    ],
    "StatusTypeID": 50,
    "DateLastStatusUpdate": "2021-07-12T02:42:00Z",
    "MetadataValues": [
        {
            "ID": 12006,
            "MetadataFieldID": 4,
            "ItemValue": "Data from the German chargepoint registry provided by Bundesnetzagentur.de under the CC-BY 4.0 license"
        }
    ],
    "DataQualityLevel": 3,
    "DateCreated": "2021-07-08T09:59:00Z",
    "SubmissionStatusTypeID": 100
}