{
    "IsRecentlyVerified": false,
    "ID": 139155,
    "UUID": "EB1451B4-6BEB-4F52-B35B-15DA9D392FC5",
    "DataProviderID": 2,
    "DataProvidersReference": "93231",
    "OperatorID": 15,
    "UsageTypeID": 4,
    "AddressInfo": {
        "ID": 139507,
        "Title": "Arrowhead Towne Center",
        "AddressLine1": "7700 W Arrowhead Towne Ctr",
        "Town": "Glendale",
        "StateOrProvince": "AZ",
        "Postcode": "85308",
        "CountryID": 2,
        "Latitude": 33.641263,
        "Longitude": -112.225651,
        "ContactTelephone1": "877-455-3833",
        "AccessComments": "24 hours daily\r\nPublic - Card key at all times",
        "RelatedURL": "https://www.evgo.com/",
        "DistanceUnit": 0
    },
    "Connections": [
        {
            "ID": 194419,
            "ConnectionTypeID": 2,
            "LevelID": 3,
            "Amps": 100,
            "Voltage": 400,
            "PowerKW": 40,
            "CurrentTypeID": 30,
            "Quantity": 1
        },
        {
            "ID": 194420,
            "ConnectionTypeID": 32,
            "LevelID": 3,
            "Amps": 100,
            "Voltage": 400,
            "PowerKW": 40,
            "CurrentTypeID": 30,
            "Quantity": 1
        }
    ],
    "StatusTypeID": 50,
    "DateLastStatusUpdate": "2020-06-26T02:55:00Z",
    "DataQualityLevel": 3,
    "DateCreated": "2019-12-24T09:10:00Z",
    "SubmissionStatusTypeID": 100
}