{
    "IsRecentlyVerified": false,
    "ID": 91972,
    "UUID": "F71716CD-8692-4C2B-8E17-81C11FCD2820",
    "DataProviderID": 1,
    "OperatorID": 21,
    "UsageTypeID": 4,
    "UsageCost": "Mobi.E compatible card or App",
    "AddressInfo": {
        "ID": 92318,
        "Title": "STR-00012",
        "AddressLine1": "A1 km 85 (Sentido Sul/Norte - Northbound)",
        "Town": "Santarém",
        "Postcode": "2035-000",
        "CountryID": 180,
        "Latitude": 39.391966050893274,
        "Longitude": -8.637393021656976,
        "AccessComments": "Northbound",
        "RelatedURL": "http://www.mobie.pt",
        "DistanceUnit": 0
    },
    "Connections": [
        {
            "ID": 130400,
            "ConnectionTypeID": 2,
            "StatusTypeID": 50,
            "LevelID": 3,
            "Amps": 120,
            "Voltage": 500,
            "PowerKW": 50,
            "CurrentTypeID": 30,
            "Quantity": 1
        },
        {
            "ID": 153362,
            "ConnectionTypeID": 33,
            "StatusTypeID": 50,
            "LevelID": 3,
            "Amps": 125,
            "Voltage": 500,
            "PowerKW": 50,
            "CurrentTypeID": 30,
            "Quantity": 1
        },
        {
            "ID": 153363,
            "ConnectionTypeID": 1036,
            "StatusTypeID": 50,
            "LevelID": 3,
            "Amps": 64,
            "Voltage": 400,
            "PowerKW": 43,
            "CurrentTypeID": 20,
            "Quantity": 1
        }
    ],
    "NumberOfPoints": 2,
    "StatusTypeID": 50,
    "DateLastStatusUpdate": "2021-05-03T11:46:00Z",
    "DataQualityLevel": 3,
    "DateCreated": "2017-08-22T13:38:00Z",
    "SubmissionStatusTypeID": 100
}