{
    "IsRecentlyVerified": false,
    "ID": 34363,
    "UUID": "F41156C7-2F23-45C4-8E73-DA28D6DAA9D6",
    "DataProviderID": 1,
    "OperatorID": 105,
    "OperatorsReference": "Essent EM-DE-05754008-01-00001",
    "UsageTypeID": 4,
    "UsageCost": "0.00 jaarabonnement",
    "AddressInfo": {
        "ID": 34709,
        "Title": "AVIA Tankstelle",
        "AddressLine1": "Kaiserstraße 36",
        "AddressLine2": "",
        "Town": "Gütersloh",
        "StateOrProvince": "",
        "Postcode": "33330",
        "CountryID": 87,
        "Latitude": 51.90985129519176,
        "Longitude": 8.386162519454956,
        "ContactTelephone1": "",
        "ContactTelephone2": "",
        "ContactEmail": "",
        "AccessComments": "",
        "RelatedURL": "http://www.essent.nl",
        "DistanceUnit": 0
    },
    "Connections": [
        {
            "ID": 37874,
            "ConnectionTypeID": 25,
            "StatusTypeID": 50,
            "LevelID": 2,
            "PowerKW": 11,
            "CurrentTypeID": 20,
            "Quantity": 1
        },
        {
            "ID": 47210,
            "ConnectionTypeID": 25,
            "StatusTypeID": 50,
            "LevelID": 2,
            "PowerKW": 11,
            "CurrentTypeID": 20,
            "Quantity": 1
        }
    ],
    "NumberOfPoints": 2,
    "GeneralComments": "",
    "StatusTypeID": 50,
    "DateLastStatusUpdate": "2015-03-21T15:43:00Z",
    "DataQualityLevel": 3,
    "DateCreated": "2015-01-09T06:04:00Z",
    "SubmissionStatusTypeID": 100
}