{
    "IsRecentlyVerified": false,
    "ID": 143422,
    "UUID": "CBC3A617-92ED-4BDE-89BB-94154EC6E50C",
    "DataProviderID": 2,
    "DataProvidersReference": "147905",
    "OperatorID": 39,
    "UsageTypeID": 1,
    "AddressInfo": {
        "ID": 143774,
        "Title": "Comstock Avenue Garage Unit 1 & 2",
        "AddressLine1": "501 Comstock Avenue",
        "Town": "Syracuse",
        "StateOrProvince": "NY",
        "Postcode": "13244",
        "CountryID": 2,
        "Latitude": 43.0410322,
        "Longitude": -76.1302328,
        "ContactTelephone1": "800-663-5633",
        "AccessComments": "MO: Not Specified; TU: Not Specified; WE: Not Specified; TH: Not Specified; FR: Not Specified; SA: Not Specified; SU: Not Specified",
        "RelatedURL": "http://www.semacharge.com/",
        "DistanceUnit": 0
    },
    "Connections": [
        {
            "ID": 199738,
            "ConnectionTypeID": 1,
            "LevelID": 2,
            "Amps": 16,
            "Voltage": 230,
            "PowerKW": 3.7,
            "CurrentTypeID": 10,
            "Quantity": 2
        }
    ],
    "StatusTypeID": 50,
    "DateLastStatusUpdate": "2020-06-26T03:06:00Z",
    "DataQualityLevel": 3,
    "DateCreated": "2019-12-24T09:21:00Z",
    "SubmissionStatusTypeID": 100
}