{
    "IsRecentlyVerified": false,
    "ID": 141482,
    "UUID": "8848FEDA-7E36-4377-9B10-BF48454251DB",
    "DataProviderID": 2,
    "DataProvidersReference": "149164",
    "OperatorID": 39,
    "UsageTypeID": 2,
    "AddressInfo": {
        "ID": 141834,
        "Title": "Baltimore Gas & Electric - Annapolis",
        "AddressLine1": "112 West St",
        "Town": "Annapolis",
        "StateOrProvince": "MD",
        "Postcode": "21401",
        "CountryID": 2,
        "Latitude": 38.978183,
        "Longitude": -76.497368,
        "ContactTelephone1": "",
        "AccessComments": "",
        "RelatedURL": "http://www.semacharge.com/",
        "DistanceUnit": 0
    },
    "Connections": [
        {
            "ID": 197418,
            "ConnectionTypeID": 1,
            "LevelID": 2,
            "Amps": 16,
            "Voltage": 230,
            "PowerKW": 3.7,
            "CurrentTypeID": 10,
            "Quantity": 1
        }
    ],
    "StatusTypeID": 50,
    "DateLastStatusUpdate": "2020-06-26T03:01:00Z",
    "DataQualityLevel": 3,
    "DateCreated": "2019-12-24T09:15:00Z",
    "SubmissionStatusTypeID": 100
}