{
    "MediaItems": [
        {
            "ID": 24767,
            "ChargePointID": 117676,
            "ItemURL": "https://s3-ap-southeast-2.amazonaws.com/openchargemap/images/IT/OCM117676/OCM-117676.orig.2020092415433866.jpg",
            "ItemThumbnailURL": "https://s3-ap-southeast-2.amazonaws.com/openchargemap/images/IT/OCM117676/OCM-117676.thmb.2020092415433866.jpg",
            "Comment": "",
            "IsEnabled": true,
            "IsVideo": false,
            "IsFeaturedItem": false,
            "IsExternalResource": false,
            "User": {
                "ID": 1606,
                "Username": "polianto"
            },
            "DateCreated": "2020-09-24T15:44:00Z"
        },
        {
            "ID": 24768,
            "ChargePointID": 117676,
            "ItemURL": "https://s3-ap-southeast-2.amazonaws.com/openchargemap/images/IT/OCM117676/OCM-117676.orig.2020092415434745.jpg",
            "ItemThumbnailURL": "https://s3-ap-southeast-2.amazonaws.com/openchargemap/images/IT/OCM117676/OCM-117676.thmb.2020092415434745.jpg",
            "Comment": "",
            "IsEnabled": true,
            "IsVideo": false,
            "IsFeaturedItem": false,
            "IsExternalResource": false,
            "User": {
                "ID": 1606,
                "Username": "polianto"
            },
            "DateCreated": "2020-09-24T15:44:00Z"
        }
    ],
    "IsRecentlyVerified": false,
    "ID": 117676,
    "UUID": "80AE8005-67D5-4749-9F5C-E0760F3F87FE",
    "DataProviderID": 1,
    "OperatorID": 80,
    "UsageTypeID": 4,
    "AddressInfo": {
        "ID": 118022,
        "Title": "Sellero Via Nazionale | EnelX",
        "AddressLine1": "Via Nazionale",
        "AddressLine2": "angolo Via Valeriana",
        "Town": "Sellero",
        "StateOrProvince": "BS",
        "Postcode": "25050",
        "CountryID": 112,
        "Latitude": 46.053529298017395,
        "Longitude": 10.350363813230842,
        "ContactTelephone1": "800.069.850",
        "RelatedURL": "https://www.enelx.com/it/it/emobility",
        "DistanceUnit": 0
    },
    "Connections": [
        {
            "ID": 166466,
            "ConnectionTypeID": 25,
            "StatusTypeID": 50,
            "LevelID": 2,
            "Amps": 32,
            "Voltage": 400,
            "PowerKW": 22,
            "CurrentTypeID": 20,
            "Quantity": 2
        }
    ],
    "NumberOfPoints": 2,
    "StatusTypeID": 50,
    "DateLastStatusUpdate": "2020-09-24T15:44:00Z",
    "DataQualityLevel": 1,
    "DateCreated": "2019-02-22T11:32:00Z",
    "SubmissionStatusTypeID": 200
}