{
    "IsRecentlyVerified": false,
    "ID": 7693,
    "UUID": "0FF3E61D-BD97-456A-B30E-704627012BCB",
    "DataProviderID": 15,
    "DataProvidersReference": "7108",
    "OperatorID": 26,
    "AddressInfo": {
        "ID": 7590,
        "Title": "3975 Jackson Road",
        "AddressLine1": "3975 Jackson Road",
        "Town": "Ann Arbor",
        "StateOrProvince": "MI",
        "Postcode": "48106",
        "CountryID": 2,
        "Latitude": 42.28475,
        "Longitude": -83.80857,
        "ContactTelephone1": " (734) 663-7770",
        "RelatedURL": "http://carstations.com/7108",
        "DistanceUnit": 0
    },
    "Connections": [
        {
            "ID": 5125,
            "ConnectionTypeID": 1,
            "Reference": "J1772",
            "LevelID": 2
        }
    ],
    "StatusTypeID": 0,
    "DateLastStatusUpdate": "2017-11-04T14:04:00Z",
    "DataQualityLevel": 1,
    "DateCreated": "2011-11-11T12:04:00Z",
    "SubmissionStatusTypeID": 100
}