{
    "IsRecentlyVerified": false,
    "ID": 28788,
    "UUID": "18D63FEB-F060-4F88-B281-003F609A20CD",
    "DataProviderID": 2,
    "DataProvidersReference": "50467",
    "UsageTypeID": 7,
    "AddressInfo": {
        "ID": 29134,
        "Title": "Libertyville Mitsubishi",
        "AddressLine1": "1119 S Milwaukee Ave",
        "Town": "Libertyville",
        "StateOrProvince": "IL",
        "Postcode": "60048",
        "CountryID": 2,
        "Latitude": 42.26795,
        "Longitude": -87.950908,
        "ContactTelephone1": "847-816-6660",
        "AccessComments": "Dealership business hours; for customer use only\r\nPublic - Call ahead",
        "RelatedURL": "",
        "DistanceUnit": 0
    },
    "Connections": [
        {
            "ID": 31626,
            "ConnectionTypeID": 1,
            "LevelID": 2,
            "Amps": 16,
            "Voltage": 230,
            "PowerKW": 3.7,
            "CurrentTypeID": 10,
            "Quantity": 2
        }
    ],
    "DateLastStatusUpdate": "2020-06-26T03:05:00Z",
    "DataQualityLevel": 3,
    "DateCreated": "2014-11-28T03:38:00Z",
    "SubmissionStatusTypeID": 100
}