{
    "IsRecentlyVerified": false,
    "ID": 187214,
    "UUID": "18FC05C3-A555-4949-BB7D-686355B227C3",
    "DataProviderID": 29,
    "DataProvidersReference": "13037",
    "OperatorID": 220,
    "AddressInfo": {
        "ID": 187573,
        "Title": "Beethovenstraße 68",
        "AddressLine1": "Beethovenstraße 68",
        "Town": "Hamburg",
        "Postcode": "22083",
        "CountryID": 87,
        "Latitude": 53.579226,
        "Longitude": 10.031267,
        "DistanceUnit": 0
    },
    "Connections": [
        {
            "ID": 301821,
            "ConnectionTypeID": 28,
            "StatusTypeID": 50,
            "LevelID": 2,
            "PowerKW": 22,
            "CurrentTypeID": 20
        },
        {
            "ID": 301822,
            "ConnectionTypeID": 25,
            "StatusTypeID": 50,
            "LevelID": 2,
            "PowerKW": 22,
            "CurrentTypeID": 20
        },
        {
            "ID": 301823,
            "ConnectionTypeID": 28,
            "StatusTypeID": 50,
            "LevelID": 2,
            "PowerKW": 22,
            "CurrentTypeID": 20
        },
        {
            "ID": 301824,
            "ConnectionTypeID": 25,
            "StatusTypeID": 50,
            "LevelID": 2,
            "PowerKW": 22,
            "CurrentTypeID": 20
        }
    ],
    "StatusTypeID": 50,
    "DateLastStatusUpdate": "2021-07-12T02:51:00Z",
    "MetadataValues": [
        {
            "ID": 19454,
            "MetadataFieldID": 4,
            "ItemValue": "Data from the German chargepoint registry provided by Bundesnetzagentur.de under the CC-BY 4.0 license"
        }
    ],
    "DataQualityLevel": 3,
    "DateCreated": "2021-07-12T02:51:00Z",
    "SubmissionStatusTypeID": 100
}