{
    "IsRecentlyVerified": false,
    "ID": 107422,
    "UUID": "18772192-BAD6-4F32-A0A9-4508069E7E1B",
    "DataProviderID": 1,
    "OperatorID": 3319,
    "UsageTypeID": 1,
    "UsageCost": "free",
    "AddressInfo": {
        "ID": 107768,
        "Title": "Budapest, Kiskorona utca",
        "AddressLine1": "Kiskorona utca ",
        "Town": "Budapest",
        "StateOrProvince": "Budapest",
        "Postcode": "1036",
        "CountryID": 104,
        "Latitude": 47.5380197,
        "Longitude": 19.0423996,
        "ContactTelephone1": "+36 80 21-00-12",
        "ContactEmail": "kommunikacio@e-mobi.hu",
        "RelatedURL": "https://e-mobi.hu/",
        "DistanceUnit": 0
    },
    "Connections": [
        {
            "ID": 151569,
            "ConnectionTypeID": 25,
            "StatusTypeID": 50,
            "LevelID": 2,
            "Amps": 32,
            "Voltage": 400,
            "PowerKW": 22,
            "CurrentTypeID": 20,
            "Quantity": 2
        }
    ],
    "NumberOfPoints": 2,
    "StatusTypeID": 50,
    "DateLastStatusUpdate": "2018-07-31T14:13:00Z",
    "DataQualityLevel": 1,
    "DateCreated": "2018-07-29T12:43:00Z",
    "SubmissionStatusTypeID": 200
}