{
    "IsRecentlyVerified": false,
    "ID": 52745,
    "UUID": "8AF187C1-8FC3-450B-B316-DC535B4FD3BC",
    "DataProviderID": 1,
    "OperatorID": 32,
    "OperatorsReference": "1276,1286,1287,1290,1363,1364,1389,1397,1400,1409,3627,3628,3643..3646,3649,3801..3804,3873..3877",
    "UsageTypeID": 4,
    "UsageCost": "£0.108/kWh; for Polar Plus subscription members only. Parking fees apply.",
    "AddressInfo": {
        "ID": 53091,
        "Title": "Q-Park Park Lane, London",
        "AddressLine1": "Park Lane",
        "Town": "London",
        "Postcode": "W1K 7TY",
        "CountryID": 1,
        "Latitude": 51.5093,
        "Longitude": -0.156662,
        "AccessComments": "Underground car park, pay-on-foot.",
        "RelatedURL": "https://www.q-park.co.uk/en-gb/cities/london/park-lane/",
        "DistanceUnit": 0
    },
    "Connections": [
        {
            "ID": 65605,
            "ConnectionTypeID": 25,
            "StatusTypeID": 50,
            "LevelID": 2,
            "Amps": 32,
            "Voltage": 230,
            "PowerKW": 7,
            "CurrentTypeID": 10,
            "Quantity": 34
        },
        {
            "ID": 65606,
            "ConnectionTypeID": 3,
            "StatusTypeID": 50,
            "LevelID": 2,
            "Amps": 13,
            "Voltage": 230,
            "PowerKW": 3,
            "CurrentTypeID": 10,
            "Quantity": 18
        },
        {
            "ID": 119840,
            "ConnectionTypeID": 33,
            "StatusTypeID": 50,
            "LevelID": 3,
            "PowerKW": 50,
            "CurrentTypeID": 30,
            "Quantity": 1
        },
        {
            "ID": 119841,
            "ConnectionTypeID": 1036,
            "StatusTypeID": 50,
            "LevelID": 3,
            "PowerKW": 43,
            "CurrentTypeID": 20,
            "Quantity": 1
        },
        {
            "ID": 119842,
            "ConnectionTypeID": 2,
            "StatusTypeID": 50,
            "LevelID": 3,
            "PowerKW": 50,
            "CurrentTypeID": 30,
            "Quantity": 1
        }
    ],
    "NumberOfPoints": 34,
    "GeneralComments": "Chargemaster posts. No longer on Source London.",
    "StatusTypeID": 50,
    "DateLastStatusUpdate": "2020-08-19T06:16:00Z",
    "DataQualityLevel": 1,
    "DateCreated": "2015-09-09T21:56:00Z",
    "SubmissionStatusTypeID": 200
}