{
    "IsRecentlyVerified": false,
    "ID": 159728,
    "UUID": "62FD098D-80BE-44FC-9D84-A0C72E38B966",
    "DataProviderID": 2,
    "DataProvidersReference": "153856",
    "UsageTypeID": 2,
    "AddressInfo": {
        "ID": 160085,
        "Title": "Fordham University",
        "AddressLine1": "441 E Fordham Rd",
        "Town": "Bronx",
        "StateOrProvince": "NY",
        "Postcode": "10458",
        "CountryID": 2,
        "Latitude": 40.86095,
        "Longitude": -73.889379,
        "ContactTelephone1": "",
        "AccessComments": "24 hours daily",
        "RelatedURL": "",
        "DistanceUnit": 0
    },
    "Connections": [
        {
            "ID": 229936,
            "ConnectionTypeID": 1,
            "LevelID": 2,
            "Amps": 16,
            "Voltage": 230,
            "PowerKW": 3.7,
            "CurrentTypeID": 10,
            "Quantity": 8
        }
    ],
    "StatusTypeID": 50,
    "DateLastStatusUpdate": "2020-06-26T03:03:00Z",
    "DataQualityLevel": 3,
    "DateCreated": "2020-06-26T03:03:00Z",
    "SubmissionStatusTypeID": 100
}