{
    "IsRecentlyVerified": false,
    "ID": 67380,
    "UUID": "68F8DF5F-28BC-47EB-B9E4-B887755450DB",
    "DataProviderID": 1,
    "OperatorID": 23,
    "OperatorsReference": "9876",
    "UsageTypeID": 1,
    "UsageCost": "Free",
    "AddressInfo": {
        "ID": 67726,
        "Title": "Champion Parking - Tesla",
        "AddressLine1": "159 W 53rd St",
        "Town": "New York",
        "StateOrProvince": "NY",
        "Postcode": "10019",
        "CountryID": 2,
        "Latitude": 40.7629863,
        "Longitude": -73.9814456,
        "ContactTelephone1": "212-245-1299  877-798-3752",
        "AccessComments": "24 hours daily; for Tesla use only; see valet for access",
        "RelatedURL": "http://www.teslamotors.com/supercharger",
        "DistanceUnit": 0
    },
    "Connections": [
        {
            "ID": 92884,
            "ConnectionTypeID": 30,
            "StatusTypeID": 50,
            "LevelID": 2,
            "Amps": 16,
            "Voltage": 230,
            "PowerKW": 8,
            "CurrentTypeID": 10,
            "Quantity": 1
        }
    ],
    "NumberOfPoints": 1,
    "StatusTypeID": 50,
    "DateLastStatusUpdate": "2017-01-26T15:25:00Z",
    "DataQualityLevel": 3,
    "DateCreated": "2016-05-29T02:05:00Z",
    "SubmissionStatusTypeID": 100
}