{
    "IsRecentlyVerified": false,
    "ID": 125643,
    "UUID": "2FAFF086-0AE3-4A46-A24C-B1DB182728A4",
    "DataProviderID": 1,
    "OperatorID": 23,
    "OperatorsReference": "49974",
    "UsageTypeID": 4,
    "AddressInfo": {
        "ID": 125989,
        "Title": "Kumsheen Rafting Resort",
        "AddressLine1": "1345 Hwy 1",
        "Town": "Lytton",
        "StateOrProvince": "British Columbia",
        "Postcode": "V0K 1Z0",
        "CountryID": 44,
        "Latitude": 50.260333,
        "Longitude": -121.535777,
        "ContactTelephone1": "(250) 455-2296",
        "DistanceUnit": 0
    },
    "Connections": [
        {
            "ID": 176044,
            "ConnectionTypeID": 30,
            "StatusTypeID": 50,
            "LevelID": 2,
            "PowerKW": 16,
            "CurrentTypeID": 20,
            "Quantity": 3
        }
    ],
    "NumberOfPoints": 3,
    "GeneralComments": "3 Tesla Connectors, up to 16kW.Seasonal Availability Please call ahead.",
    "StatusTypeID": 50,
    "DateLastStatusUpdate": "2019-04-23T05:56:00Z",
    "DataQualityLevel": 1,
    "DateCreated": "2019-04-23T05:56:00Z",
    "SubmissionStatusTypeID": 200
}