{
    "IsRecentlyVerified": false,
    "ID": 55114,
    "UUID": "7FD7F5BD-A57D-4931-8113-A7A9FC26CC8B",
    "DataProviderID": 1,
    "OperatorID": 80,
    "UsageTypeID": 6,
    "UsageCost": "free",
    "AddressInfo": {
        "ID": 55460,
        "Title": "CONAD",
        "AddressLine1": "Via Sutera, 35",
        "Town": "Acireale",
        "StateOrProvince": "CT",
        "Postcode": "95024",
        "CountryID": 112,
        "Latitude": 37.62697323482011,
        "Longitude": 15.159566455303212,
        "RelatedURL": "http://www.conad.it/conad/home/puntivendita/dettaglio.html?idPdv=5805",
        "DistanceUnit": 0
    },
    "Connections": [
        {
            "ID": 69674,
            "ConnectionTypeID": 25,
            "StatusTypeID": 50,
            "LevelID": 2,
            "Amps": 32,
            "Voltage": 400,
            "PowerKW": 22,
            "CurrentTypeID": 20,
            "Quantity": 1
        }
    ],
    "NumberOfPoints": 2,
    "GeneralComments": "http://www.sibeg.it/\r\nhttp://www.sibeg.it/eventi-sponsorizzazioni/eventi-nazionali/sibeg-e-coca-cola-guidano-verde-per-una-sicilia-piu-sostenibile.html\r\nUtilizzabile con tessera messa a disposizione al banco informazioni. Colonnina Eneldrive ma NON funziona con tessera Eneldrive ",
    "StatusTypeID": 50,
    "DateLastStatusUpdate": "2015-10-15T14:45:00Z",
    "DataQualityLevel": 1,
    "DateCreated": "2015-10-15T14:45:00Z",
    "SubmissionStatusTypeID": 200
}