{
    "IsRecentlyVerified": false,
    "ID": 174670,
    "UUID": "1E40C9B2-3CD1-4428-8A08-AEC783777FFD",
    "DataProviderID": 1,
    "OperatorID": 3323,
    "UsageTypeID": 4,
    "AddressInfo": {
        "ID": 175029,
        "Title": "Zes - D Marin Göcek",
        "AddressLine1": "D-Marin Göcek",
        "Town": "Göcek",
        "StateOrProvince": "Muğla",
        "Postcode": "48310",
        "CountryID": 229,
        "Latitude": 36.74592830777635,
        "Longitude": 28.942931730652845,
        "DistanceUnit": 0
    },
    "Connections": [
        {
            "ID": 270646,
            "ConnectionTypeID": 25,
            "StatusTypeID": 50,
            "LevelID": 2,
            "PowerKW": 22,
            "CurrentTypeID": 20,
            "Quantity": 2
        }
    ],
    "NumberOfPoints": 1,
    "StatusTypeID": 50,
    "DateLastStatusUpdate": "2021-04-11T12:47:00Z",
    "DataQualityLevel": 1,
    "DateCreated": "2021-04-10T19:50:00Z",
    "SubmissionStatusTypeID": 200
}