{
    "IsRecentlyVerified": false,
    "ID": 89584,
    "UUID": "00F86994-54D3-49BB-872D-9EF802DC3243",
    "DataProviderID": 2,
    "DataProvidersReference": "82464",
    "UsageTypeID": 1,
    "AddressInfo": {
        "ID": 89930,
        "Title": "Centura Health - Golden Neighborhood Health Center",
        "AddressLine1": "750 Warner Dr",
        "Town": "Golden",
        "StateOrProvince": "CO",
        "Postcode": "80401",
        "CountryID": 2,
        "Latitude": 39.729753,
        "Longitude": -105.21053,
        "ContactTelephone1": "303-925-4340",
        "AccessComments": "24 hours daily; for guest and patient use only",
        "RelatedURL": "",
        "DistanceUnit": 0
    },
    "Connections": [
        {
            "ID": 127000,
            "ConnectionTypeID": 1,
            "LevelID": 2,
            "Amps": 16,
            "Voltage": 230,
            "PowerKW": 3.7,
            "CurrentTypeID": 10,
            "Quantity": 2
        }
    ],
    "DateLastStatusUpdate": "2020-06-26T03:02:00Z",
    "DataQualityLevel": 3,
    "DateCreated": "2017-06-22T08:16:00Z",
    "SubmissionStatusTypeID": 100
}