{
    "IsRecentlyVerified": false,
    "ID": 63417,
    "UUID": "299030B2-580C-4C64-8338-EA8B6A09E213",
    "DataProviderID": 26,
    "DataProvidersReference": "79902",
    "OperatorID": 180,
    "OperatorsReference": "Alfen RHL07042",
    "UsageCost": "0.00 jaarabonnement",
    "AddressInfo": {
        "ID": 63763,
        "Title": "Terras van Sion",
        "AddressLine1": "Terras van Sion",
        "Town": "Rijswijk",
        "Postcode": "2286 LW",
        "CountryID": 159,
        "Latitude": 52.017194,
        "Longitude": 4.328764,
        "ContactTelephone1": "036 - 549 34 00",
        "RelatedURL": "http://www.icu-charging-stations.com/",
        "DistanceUnit": 0
    },
    "Connections": [
        {
            "ID": 80859,
            "ConnectionTypeID": 25,
            "LevelID": 2,
            "PowerKW": 11,
            "CurrentTypeID": 10
        },
        {
            "ID": 80860,
            "ConnectionTypeID": 25,
            "LevelID": 2,
            "PowerKW": 11,
            "CurrentTypeID": 10
        }
    ],
    "NumberOfPoints": 1,
    "StatusTypeID": 50,
    "DateLastStatusUpdate": "2016-06-04T02:44:00Z",
    "DataQualityLevel": 3,
    "DateCreated": "2016-03-03T12:30:00Z",
    "SubmissionStatusTypeID": 100
}