{
    "IsRecentlyVerified": false,
    "ID": 111504,
    "UUID": "08E26BB4-253B-43AA-9B10-BD187EFB499B",
    "DataProviderID": 2,
    "DataProvidersReference": "92561",
    "OperatorID": 5,
    "UsageTypeID": 1,
    "AddressInfo": {
        "ID": 111850,
        "Title": "MITSUBISHI VICT",
        "AddressLine1": "399 Boulevard des Bois Francs N",
        "Town": "Victoriaville",
        "StateOrProvince": "QC",
        "Postcode": "G6P 1H2",
        "CountryID": 44,
        "Latitude": 46.0669335,
        "Longitude": -71.9651913,
        "ContactTelephone1": "888-758-4389",
        "AccessComments": "24 hours daily",
        "RelatedURL": "http://www.chargepoint.com/",
        "DistanceUnit": 0
    },
    "Connections": [
        {
            "ID": 156945,
            "ConnectionTypeID": 1,
            "LevelID": 2,
            "Amps": 16,
            "Voltage": 230,
            "PowerKW": 3,
            "CurrentTypeID": 10,
            "Quantity": 2
        }
    ],
    "DateLastStatusUpdate": "2019-12-24T09:24:00Z",
    "DataQualityLevel": 3,
    "DateCreated": "2018-10-18T23:37:00Z",
    "SubmissionStatusTypeID": 100
}