{
    "IsRecentlyVerified": false,
    "ID": 162597,
    "UUID": "9BA87080-4EA9-4AEB-B038-B2AEEC731059",
    "DataProviderID": 1,
    "OperatorID": 21,
    "UsageTypeID": 4,
    "UsageCost": "Mobi.E compatible card",
    "AddressInfo": {
        "ID": 162954,
        "Title": "MFR-00008",
        "AddressLine1": "Avenida 9 de Julho",
        "Town": "Venda do Pinheiro",
        "StateOrProvince": "Lisboa",
        "Postcode": "2665-527",
        "CountryID": 180,
        "Latitude": 38.91978601181867,
        "Longitude": -9.230390619161199,
        "DistanceUnit": 0
    },
    "Connections": [
        {
            "ID": 234022,
            "ConnectionTypeID": 2,
            "StatusTypeID": 50,
            "LevelID": 3,
            "Amps": 120,
            "Voltage": 500,
            "PowerKW": 50,
            "CurrentTypeID": 30,
            "Quantity": 1
        },
        {
            "ID": 234023,
            "ConnectionTypeID": 33,
            "StatusTypeID": 50,
            "LevelID": 3,
            "Amps": 125,
            "Voltage": 500,
            "PowerKW": 50,
            "CurrentTypeID": 30,
            "Quantity": 1
        },
        {
            "ID": 234024,
            "ConnectionTypeID": 1036,
            "StatusTypeID": 50,
            "LevelID": 3,
            "Amps": 64,
            "Voltage": 400,
            "PowerKW": 43,
            "CurrentTypeID": 20,
            "Quantity": 1
        }
    ],
    "NumberOfPoints": 2,
    "StatusTypeID": 50,
    "DateLastStatusUpdate": "2020-08-12T10:48:00Z",
    "DataQualityLevel": 1,
    "DateCreated": "2020-08-12T10:48:00Z",
    "SubmissionStatusTypeID": 200
}