{
    "IsRecentlyVerified": false,
    "ID": 142438,
    "UUID": "0240115C-2560-447D-AC34-09D1A1F935BC",
    "DataProviderID": 2,
    "DataProvidersReference": "95030",
    "OperatorID": 5,
    "UsageTypeID": 1,
    "AddressInfo": {
        "ID": 142790,
        "Title": "PUBLIC USE",
        "AddressLine1": "855 W California Ave Sorenson Multicultural Center",
        "Town": "Salt Lake City",
        "StateOrProvince": "UT",
        "Postcode": "84104",
        "CountryID": 2,
        "Latitude": 40.7407493,
        "Longitude": -111.914369,
        "ContactTelephone1": "888-758-4389",
        "AccessComments": "24 hours daily",
        "RelatedURL": "http://www.chargepoint.com/",
        "DistanceUnit": 0
    },
    "Connections": [
        {
            "ID": 198573,
            "ConnectionTypeID": 1,
            "LevelID": 2,
            "Amps": 16,
            "Voltage": 230,
            "PowerKW": 3.7,
            "CurrentTypeID": 10,
            "Quantity": 2
        }
    ],
    "StatusTypeID": 50,
    "DateLastStatusUpdate": "2020-06-26T03:03:00Z",
    "DataQualityLevel": 3,
    "DateCreated": "2019-12-24T09:17:00Z",
    "SubmissionStatusTypeID": 100
}