{
    "IsRecentlyVerified": false,
    "ID": 8670,
    "UUID": "5C0A6269-E0A2-4C48-B19A-C6D809341054",
    "DataProviderID": 15,
    "DataProvidersReference": "10734",
    "OperatorID": 5,
    "UsageTypeID": 2,
    "AddressInfo": {
        "ID": 8567,
        "Title": "2227 Capricorn Way",
        "AddressLine1": "2227 Capricorn Way",
        "Town": "Santa Rosa",
        "StateOrProvince": "California",
        "Postcode": "95407",
        "CountryID": 2,
        "Latitude": 38.42527771,
        "Longitude": -122.7500687,
        "ContactTelephone1": "",
        "RelatedURL": "http://carstations.com/10734",
        "DistanceUnit": 0
    },
    "Connections": [
        {
            "ID": 6091,
            "ConnectionTypeID": 1,
            "Reference": "J1772",
            "LevelID": 2
        },
        {
            "ID": 6628,
            "ConnectionTypeID": 9,
            "Reference": "NEMA5",
            "LevelID": 1,
            "Quantity": 1
        }
    ],
    "NumberOfPoints": 2,
    "StatusTypeID": 0,
    "DateLastStatusUpdate": "2017-11-04T14:04:00Z",
    "DataQualityLevel": 1,
    "DateCreated": "2011-11-11T12:07:00Z",
    "SubmissionStatusTypeID": 100
}