{
    "IsRecentlyVerified": false,
    "ID": 112754,
    "UUID": "BA59DD2A-07E7-479D-BF15-7D7EA971F995",
    "DataProviderID": 1,
    "OperatorID": 80,
    "UsageTypeID": 4,
    "AddressInfo": {
        "ID": 113100,
        "Title": "Bagno a Ripoli Moro | EnelX",
        "AddressLine1": "Via Aldo Moro",
        "Town": "Bagno a Ripoli",
        "StateOrProvince": "FI",
        "Postcode": "50126",
        "CountryID": 112,
        "Latitude": 43.737441614719074,
        "Longitude": 11.29549829860963,
        "ContactTelephone1": "800.069.850",
        "RelatedURL": "https://www.enelx.com/it/it/emobility",
        "DistanceUnit": 0
    },
    "Connections": [
        {
            "ID": 158773,
            "ConnectionTypeID": 25,
            "StatusTypeID": 50,
            "LevelID": 2,
            "Amps": 32,
            "Voltage": 400,
            "PowerKW": 22,
            "CurrentTypeID": 20,
            "Quantity": 1
        },
        {
            "ID": 158774,
            "ConnectionTypeID": 36,
            "StatusTypeID": 50,
            "LevelID": 2,
            "Amps": 16,
            "Voltage": 240,
            "PowerKW": 3.7,
            "CurrentTypeID": 20,
            "Quantity": 1
        }
    ],
    "NumberOfPoints": 2,
    "StatusTypeID": 50,
    "DateLastStatusUpdate": "2018-11-13T13:35:00Z",
    "DataQualityLevel": 1,
    "DateCreated": "2018-11-13T13:35:00Z",
    "SubmissionStatusTypeID": 200
}