{
    "IsRecentlyVerified": false,
    "ID": 54580,
    "UUID": "EFA14898-C421-43A1-979F-12431397B56F",
    "DataProviderID": 1,
    "DataProvidersReference": "3024",
    "AddressInfo": {
        "ID": 54926,
        "Title": "Kjeldåsgata, Sande",
        "AddressLine1": "Kjeldåsgata 6",
        "Town": "SANDE I VESTFOLD",
        "StateOrProvince": "Vestfold og Telemark",
        "Postcode": "3070",
        "CountryID": 168,
        "Latitude": 59.65123,
        "Longitude": 10.23688,
        "AccessComments": "Nedenfor Kjeldåsskole. Helt innerst på plassen.",
        "DistanceUnit": 0
    },
    "Connections": [
        {
            "ID": 68872,
            "ConnectionTypeID": 0,
            "Reference": "1",
            "LevelID": 2,
            "Amps": 16,
            "Voltage": 230,
            "PowerKW": 3.7,
            "Comments": "Mode 1"
        },
        {
            "ID": 88369,
            "ConnectionTypeID": 0,
            "Reference": "2",
            "LevelID": 2,
            "Amps": 16,
            "Voltage": 230,
            "PowerKW": 3.7,
            "Comments": "Mode 1"
        }
    ],
    "NumberOfPoints": 2,
    "DateLastStatusUpdate": "2020-05-26T08:23:00Z",
    "DataQualityLevel": 2,
    "DateCreated": "2015-10-09T05:51:00Z",
    "SubmissionStatusTypeID": 100
}