{
    "IsRecentlyVerified": false,
    "ID": 183659,
    "UUID": "AB0F8A45-18A6-41D3-BF14-032D163F61AA",
    "DataProviderID": 29,
    "DataProvidersReference": "15771,18911",
    "OperatorID": 86,
    "AddressInfo": {
        "ID": 184018,
        "Title": "Dreischkamp 46",
        "AddressLine1": "Dreischkamp 46",
        "Town": "Coesfeld",
        "Postcode": "48653",
        "CountryID": 87,
        "Latitude": 51.9247214,
        "Longitude": 7.1607536,
        "DistanceUnit": 0
    },
    "Connections": [
        {
            "ID": 290902,
            "ConnectionTypeID": 25,
            "StatusTypeID": 50,
            "LevelID": 2,
            "PowerKW": 22,
            "CurrentTypeID": 20
        },
        {
            "ID": 290903,
            "ConnectionTypeID": 25,
            "StatusTypeID": 50,
            "LevelID": 2,
            "PowerKW": 22,
            "CurrentTypeID": 20
        },
        {
            "ID": 290904,
            "ConnectionTypeID": 25,
            "StatusTypeID": 50,
            "LevelID": 2,
            "PowerKW": 22,
            "CurrentTypeID": 20
        },
        {
            "ID": 290905,
            "ConnectionTypeID": 25,
            "StatusTypeID": 50,
            "LevelID": 2,
            "PowerKW": 22,
            "CurrentTypeID": 20
        }
    ],
    "StatusTypeID": 50,
    "DateLastStatusUpdate": "2021-07-09T03:25:00Z",
    "MetadataValues": [
        {
            "ID": 15952,
            "MetadataFieldID": 4,
            "ItemValue": "Data from the German chargepoint registry provided by Bundesnetzagentur.de under the CC-BY 4.0 license"
        }
    ],
    "DataQualityLevel": 3,
    "DateCreated": "2021-07-08T10:04:00Z",
    "SubmissionStatusTypeID": 100
}