{
    "IsRecentlyVerified": false,
    "ID": 36642,
    "UUID": "DF962DF7-9A3A-4CB5-B287-9DAA72B52AC4",
    "DataProviderID": 26,
    "DataProvidersReference": "45978",
    "OperatorID": 73,
    "OperatorsReference": "EV-Box EVB-P1349183",
    "UsageCost": "0.00 jaarabonnement",
    "AddressInfo": {
        "ID": 36988,
        "Title": "Huygensstraat 30",
        "AddressLine1": "Huygensstraat 30",
        "Town": "Noordwijk",
        "Postcode": "2201 DK",
        "CountryID": 159,
        "Latitude": 52.21549,
        "Longitude": 4.42726,
        "RelatedURL": "http://www.ev-box.nl",
        "DistanceUnit": 0
    },
    "Connections": [
        {
            "ID": 40153,
            "ConnectionTypeID": 25,
            "LevelID": 2,
            "PowerKW": 11,
            "CurrentTypeID": 10
        },
        {
            "ID": 48429,
            "ConnectionTypeID": 25,
            "LevelID": 2,
            "PowerKW": 11,
            "CurrentTypeID": 10
        }
    ],
    "NumberOfPoints": 1,
    "StatusTypeID": 50,
    "DateLastStatusUpdate": "2016-06-04T02:51:00Z",
    "DataQualityLevel": 3,
    "DateCreated": "2015-01-09T06:05:00Z",
    "SubmissionStatusTypeID": 100
}