{
    "IsRecentlyVerified": false,
    "ID": 92253,
    "UUID": "FB957112-287D-4592-972D-C943C9B53B8B",
    "DataProviderID": 1,
    "OperatorID": 23,
    "OperatorsReference": "33300",
    "UsageTypeID": 4,
    "AddressInfo": {
        "ID": 92599,
        "Title": "Sanderling Resort",
        "AddressLine1": "1461 Duck RD",
        "Town": "Duck",
        "StateOrProvince": "North Carolina",
        "Postcode": "27949",
        "CountryID": 2,
        "Latitude": 36.223442,
        "Longitude": -75.770782,
        "ContactTelephone1": "(855) 412-7866",
        "DistanceUnit": 0
    },
    "Connections": [
        {
            "ID": 130796,
            "ConnectionTypeID": 30,
            "StatusTypeID": 50,
            "LevelID": 2,
            "PowerKW": 8,
            "CurrentTypeID": 10,
            "Quantity": 2
        }
    ],
    "NumberOfPoints": 2,
    "GeneralComments": "2 Tesla Connectors, up to 8kW.Available for customers. Please see front desk.",
    "StatusTypeID": 50,
    "DateLastStatusUpdate": "2017-09-01T05:33:00Z",
    "DataQualityLevel": 1,
    "DateCreated": "2017-09-01T05:33:00Z",
    "SubmissionStatusTypeID": 200
}