{
    "IsRecentlyVerified": false,
    "ID": 178504,
    "UUID": "0905FBDA-FE13-4E10-BB7E-E7324CC169A8",
    "DataProviderID": 29,
    "DataProvidersReference": "2193",
    "OperatorID": 45,
    "AddressInfo": {
        "ID": 178863,
        "Title": "Einbeckerstr. 59",
        "AddressLine1": "Einbeckerstr. 59",
        "Town": "Berlin",
        "Postcode": "10315",
        "CountryID": 87,
        "Latitude": 52.509074,
        "Longitude": 13.506379,
        "DistanceUnit": 0
    },
    "Connections": [
        {
            "ID": 279008,
            "ConnectionTypeID": 25,
            "StatusTypeID": 50,
            "LevelID": 2,
            "PowerKW": 22,
            "CurrentTypeID": 20
        },
        {
            "ID": 279009,
            "ConnectionTypeID": 25,
            "StatusTypeID": 50,
            "LevelID": 2,
            "PowerKW": 22,
            "CurrentTypeID": 20
        }
    ],
    "StatusTypeID": 0,
    "DateLastStatusUpdate": "2021-07-12T02:49:00Z",
    "MetadataValues": [
        {
            "ID": 10798,
            "MetadataFieldID": 4,
            "ItemValue": "Data from the German chargepoint registry provided by Bundesnetzagentur.de under the CC-BY 4.0 license"
        }
    ],
    "DataQualityLevel": 3,
    "DateCreated": "2021-07-08T09:50:00Z",
    "SubmissionStatusTypeID": 100
}