{
    "IsRecentlyVerified": false,
    "ID": 62336,
    "UUID": "9D2F50FA-7A94-46D8-98AA-272FAEF995DD",
    "DataProviderID": 2,
    "DataProvidersReference": "71649",
    "UsageTypeID": 1,
    "AddressInfo": {
        "ID": 62682,
        "Title": "Kwik Trip #295",
        "AddressLine1": "1157 Gateway Dr",
        "Town": "Milton",
        "StateOrProvince": "WI",
        "Postcode": "53563",
        "CountryID": 2,
        "Latitude": 42.770462,
        "Longitude": -88.93027,
        "ContactTelephone1": "608-868-2279",
        "AccessComments": "24 hours daily",
        "RelatedURL": "",
        "DistanceUnit": 0
    },
    "Connections": [
        {
            "ID": 79240,
            "ConnectionTypeID": 9,
            "LevelID": 1,
            "Amps": 16,
            "Voltage": 120,
            "PowerKW": 1.9,
            "CurrentTypeID": 10,
            "Quantity": 1
        }
    ],
    "DateLastStatusUpdate": "2020-06-26T03:06:00Z",
    "DataQualityLevel": 3,
    "DateCreated": "2016-03-03T11:39:00Z",
    "SubmissionStatusTypeID": 100
}