{
    "UserComments": [
        {
            "ID": 10253,
            "ChargePointID": 52094,
            "CommentTypeID": 10,
            "UserName": "Abraham Long",
            "Comment": "I go to school here and it is still active.",
            "DateCreated": "2016-04-27T18:42:41.227Z",
            "User": {
                "ID": 9299,
                "Username": "Abraham Long"
            },
            "CheckinStatusTypeID": 140
        }
    ],
    "IsRecentlyVerified": false,
    "ID": 52094,
    "UUID": "6C6492CE-BDED-4F44-ACD5-8C61A40302B5",
    "DataProviderID": 2,
    "DataProvidersReference": "69056",
    "OperatorID": 5,
    "UsageTypeID": 1,
    "AddressInfo": {
        "ID": 52440,
        "Title": "RIT EV CHARGING",
        "AddressLine1": "Clark Drive",
        "Town": "Rochester",
        "StateOrProvince": "NY",
        "Postcode": "14623",
        "CountryID": 2,
        "Latitude": 43.0860581,
        "Longitude": -77.673355,
        "ContactTelephone1": "888-758-4389",
        "AccessComments": "24 hours daily",
        "RelatedURL": "http://www.chargepoint.com/",
        "DistanceUnit": 0
    },
    "Connections": [
        {
            "ID": 64624,
            "ConnectionTypeID": 1,
            "LevelID": 2,
            "Amps": 16,
            "Voltage": 230,
            "PowerKW": 3,
            "CurrentTypeID": 10,
            "Quantity": 8
        }
    ],
    "DateLastStatusUpdate": "2019-12-24T09:21:00Z",
    "DataQualityLevel": 3,
    "DateCreated": "2015-08-19T08:34:00Z",
    "SubmissionStatusTypeID": 100
}