{
    "IsRecentlyVerified": false,
    "ID": 5023,
    "UUID": "E3AD0698-FD36-4993-80AB-32F365179B5E",
    "DataProviderID": 2,
    "DataProvidersReference": "40068",
    "UsageTypeID": 7,
    "AddressInfo": {
        "ID": 4963,
        "Title": "Vann Yorks High Point Nissan",
        "AddressLine1": "1810 S Main St",
        "Town": "High Point",
        "StateOrProvince": "NC",
        "Postcode": "27260",
        "CountryID": 2,
        "Latitude": 35.937981,
        "Longitude": -79.996012,
        "ContactTelephone1": "336-884-4122",
        "AccessComments": "Dealership business hours",
        "RelatedURL": "",
        "DistanceUnit": 0
    },
    "Connections": [
        {
            "ID": 16043,
            "ConnectionTypeID": 1,
            "LevelID": 2,
            "Amps": 16,
            "Voltage": 230,
            "PowerKW": 3,
            "CurrentTypeID": 10,
            "Quantity": 1
        },
        {
            "ID": 21029,
            "ConnectionTypeID": 1,
            "LevelID": 2,
            "Quantity": 1
        }
    ],
    "DateLastConfirmed": "2011-05-31T00:00:00Z",
    "StatusTypeID": 0,
    "DateLastStatusUpdate": "2019-04-06T04:02:00Z",
    "DataQualityLevel": 1,
    "DateCreated": "2011-07-04T18:02:00Z",
    "SubmissionStatusTypeID": 100
}