{
    "IsRecentlyVerified": false,
    "ID": 94297,
    "UUID": "27564044-DC10-4964-8660-DFCA097F955A",
    "DataProviderID": 2,
    "DataProvidersReference": "86698",
    "OperatorID": 5,
    "UsageTypeID": 1,
    "AddressInfo": {
        "ID": 94643,
        "Title": "MPCSD",
        "AddressLine1": "95 Edge Road",
        "Town": "Atherton",
        "StateOrProvince": "CA",
        "Postcode": "94027",
        "CountryID": 2,
        "Latitude": 37.4662058,
        "Longitude": -122.1708245,
        "ContactTelephone1": "888-758-4389",
        "AccessComments": "24 hours daily",
        "RelatedURL": "http://www.chargepoint.com/",
        "DistanceUnit": 0
    },
    "Connections": [
        {
            "ID": 133396,
            "ConnectionTypeID": 1,
            "LevelID": 2,
            "Amps": 16,
            "Voltage": 230,
            "PowerKW": 3,
            "CurrentTypeID": 10,
            "Quantity": 2
        }
    ],
    "DateLastStatusUpdate": "2019-04-06T04:02:00Z",
    "DataQualityLevel": 3,
    "DateCreated": "2017-10-19T02:06:00Z",
    "SubmissionStatusTypeID": 100
}