{
    "UserComments": [
        {
            "ID": 494,
            "ChargePointID": 9252,
            "CommentTypeID": 110,
            "UserName": "LG_Smit",
            "Comment": "There is no Quick charger  here",
            "DateCreated": "2013-10-17T09:31:27.323Z",
            "User": {
                "ID": 1256,
                "Username": "LG_Smit"
            },
            "CheckinStatusTypeID": 50
        },
        {
            "ID": 265,
            "ChargePointID": 9252,
            "CommentTypeID": 1000,
            "UserName": "JR",
            "Comment": "Attention : non encore raccordée 8 mars 2013.",
            "DateCreated": "2013-03-10T19:27:59.83Z"
        }
    ],
    "IsRecentlyVerified": false,
    "ID": 9252,
    "UUID": "A274B319-7096-4468-960F-97A5736F93C8",
    "DataProviderID": 1,
    "OperatorID": 1,
    "UsageTypeID": 2,
    "UsageCost": "Free",
    "AddressInfo": {
        "ID": 9149,
        "Title": "Nissan Konen Lemaire Liège",
        "AddressLine1": "Place Coronmeuse 41",
        "AddressLine2": "",
        "Town": "LIEGE",
        "StateOrProvince": "",
        "Postcode": "4000 ",
        "CountryID": 26,
        "Latitude": 50.6552178,
        "Longitude": 5.611849799999959,
        "ContactTelephone1": "+32(0)4/264.44.11 ",
        "ContactTelephone2": "",
        "ContactEmail": "info.liege@konen-lemaire.be",
        "AccessComments": "Du lundi au vendredi de 09h00 - 12h00 et de 13h00 - 18h00              et le Samedi de 10h00 - 12h00 et de 14h00 - 17h00",
        "RelatedURL": "http://www.konen-lemaire.be/konenlemairelieg/index.html",
        "DistanceUnit": 0
    },
    "Connections": [
        {
            "ID": 6963,
            "ConnectionTypeID": 2,
            "StatusTypeID": 0,
            "LevelID": 3,
            "Quantity": 1
        }
    ],
    "NumberOfPoints": 1,
    "GeneralComments": "",
    "StatusTypeID": 150,
    "DateLastStatusUpdate": "2013-10-11T19:11:00Z",
    "DataQualityLevel": 1,
    "DateCreated": "2012-01-29T12:34:00Z",
    "SubmissionStatusTypeID": 200
}