{
    "UserComments": [
        {
            "ID": 6484,
            "ChargePointID": 52694,
            "CommentTypeID": 10,
            "UserName": "Neil Appleby",
            "Comment": "Good location the charge is in and working but the bay's aren't marked so you may be iced out ",
            "Rating": 4,
            "DateCreated": "2015-09-14T07:32:00.743Z",
            "User": {
                "ID": 6231,
                "Username": "Neil Appleby"
            },
            "CheckinStatusTypeID": 140
        },
        {
            "ID": 6455,
            "ChargePointID": 52694,
            "CommentTypeID": 1000,
            "UserName": "Neil Appleby",
            "Comment": "Reported as out of service on the charge point genie web site",
            "DateCreated": "2015-09-10T07:43:06.873Z",
            "User": {
                "ID": 6231,
                "Username": "Neil Appleby"
            },
            "CheckinStatusTypeID": 0
        }
    ],
    "IsRecentlyVerified": false,
    "ID": 52694,
    "UUID": "B94EB0D8-D572-4724-8E13-C0420977F4B4",
    "DataProviderID": 1,
    "OperatorID": 150,
    "OperatorsReference": "Holmbush Inn - Cornwall",
    "UsageTypeID": 4,
    "UsageCost": "Â£1.00 + Â£0.30/kWh; Â£10.00 overstay after 90 mins",
    "AddressInfo": {
        "ID": 53040,
        "Title": "Holmbush Inn St. Austell",
        "AddressLine1": "Holmbush Road",
        "Town": "St. Austell",
        "StateOrProvince": "Cornwall",
        "Postcode": "PL25 3LL",
        "CountryID": 1,
        "Latitude": 50.3400238308148,
        "Longitude": -4.75755214691162,
        "ContactTelephone1": "+44 20 3598 4087",
        "ContactEmail": "GenieSupport@chargepointservices.com",
        "RelatedURL": "https://www.geniepoint.co.uk/ds",
        "DistanceUnit": 0
    },
    "Connections": [
        {
            "ID": 65501,
            "ConnectionTypeID": 33,
            "StatusTypeID": 50,
            "LevelID": 3,
            "Amps": 125,
            "Voltage": 400,
            "PowerKW": 50,
            "CurrentTypeID": 30,
            "Quantity": 1
        },
        {
            "ID": 65502,
            "ConnectionTypeID": 1036,
            "StatusTypeID": 50,
            "LevelID": 3,
            "Amps": 63,
            "Voltage": 400,
            "PowerKW": 43,
            "CurrentTypeID": 20,
            "Quantity": 1
        },
        {
            "ID": 65503,
            "ConnectionTypeID": 2,
            "StatusTypeID": 50,
            "LevelID": 3,
            "Amps": 125,
            "Voltage": 400,
            "PowerKW": 50,
            "CurrentTypeID": 30,
            "Quantity": 1
        }
    ],
    "NumberOfPoints": 1,
    "StatusTypeID": 50,
    "DateLastStatusUpdate": "2020-10-07T14:26:00Z",
    "DataQualityLevel": 1,
    "DateCreated": "2015-09-07T11:23:00Z",
    "SubmissionStatusTypeID": 200
}