{
    "IsRecentlyVerified": false,
    "ID": 7890,
    "UUID": "ADE016BA-E01E-4A0D-BA88-821E2E7B5961",
    "DataProviderID": 15,
    "DataProvidersReference": "6173",
    "OperatorID": 26,
    "AddressInfo": {
        "ID": 7787,
        "Title": "7900 Eastern Ave",
        "AddressLine1": "7900 Eastern Ave",
        "Town": "Baltimore",
        "StateOrProvince": "MD",
        "Postcode": "21224",
        "CountryID": 2,
        "Latitude": 39.29657,
        "Longitude": -76.50934,
        "ContactTelephone1": " (410) 288-2500",
        "RelatedURL": "http://carstations.com/6173",
        "DistanceUnit": 0
    },
    "Connections": [
        {
            "ID": 5319,
            "ConnectionTypeID": 1,
            "Reference": "J1772",
            "LevelID": 2
        }
    ],
    "StatusTypeID": 0,
    "DateLastStatusUpdate": "2017-11-04T14:04:00Z",
    "DataQualityLevel": 1,
    "DateCreated": "2011-11-11T12:05:00Z",
    "SubmissionStatusTypeID": 100
}