{
    "IsRecentlyVerified": false,
    "ID": 17846,
    "UUID": "03406727-58A8-40DD-9AE8-AF371514165C",
    "DataProviderID": 22,
    "DataProvidersReference": "65F675B3CF48B79D1D4FE970F1688C6B",
    "AddressInfo": {
        "ID": 18191,
        "Title": "松本城大手門駐車場北棟２Ｆ",
        "AddressLine1": "長野県松本市大手2-3-10",
        "CountryID": 114,
        "Latitude": 36.23532231,
        "Longitude": 137.9683922,
        "ContactTelephone1": "0263-33-1010",
        "DistanceUnit": 0
    },
    "Connections": [
        {
            "ID": 18087,
            "ConnectionTypeID": 2,
            "LevelID": 2,
            "Amps": 100,
            "Voltage": 480,
            "PowerKW": 48,
            "Quantity": 1
        }
    ],
    "DateLastStatusUpdate": "2013-06-29T09:04:00Z",
    "DataQualityLevel": 2,
    "DateCreated": "2013-06-29T09:04:00Z",
    "SubmissionStatusTypeID": 200
}