{
    "IsRecentlyVerified": false,
    "ID": 112827,
    "UUID": "50AB3811-43C6-436E-826A-E42CDBC5875E",
    "DataProviderID": 1,
    "OperatorID": 44,
    "UsageTypeID": 3,
    "UsageCost": "Free",
    "AddressInfo": {
        "ID": 113173,
        "Title": "Casa Gallina near Anacortes",
        "AddressLine1": "14362 Jura Ln",
        "Town": "Anacortes",
        "StateOrProvince": "Washington",
        "Postcode": "98221",
        "CountryID": 2,
        "Latitude": 48.4352786,
        "Longitude": -122.57973049999998,
        "ContactTelephone1": "360-299-9049",
        "ContactTelephone2": "206-359-0093 cell",
        "ContactEmail": "steven.purcer@gmail.com",
        "AccessComments": "Beside lower garage is a J1772 Level 2 charger that is available for 24/7 charging - prefer a text or call ahead though not required (have a second Level 2 charger in upper garage)",
        "RelatedURL": "https://www.airbnb.com/rooms/699372",
        "DistanceUnit": 0
    },
    "Connections": [
        {
            "ID": 158897,
            "ConnectionTypeID": 1,
            "StatusTypeID": 50,
            "LevelID": 2,
            "Amps": 30,
            "Voltage": 240,
            "PowerKW": 7.2,
            "CurrentTypeID": 10,
            "Quantity": 1
        }
    ],
    "NumberOfPoints": 1,
    "GeneralComments": "Location is 5 miles outside Anacortes (off Gibraltar Road), about 15 miles west of a DC fast charger at Burlington Outlet Mall (Aerovironment-charge applies), and about 45 miles north of a DC fast charger at Seattle Premium Outlets (EVgo-free to use).",
    "StatusTypeID": 50,
    "DateLastStatusUpdate": "2018-11-21T10:08:00Z",
    "DataQualityLevel": 1,
    "DateCreated": "2018-11-18T17:10:00Z",
    "SubmissionStatusTypeID": 200
}