{
    "IsRecentlyVerified": false,
    "ID": 143872,
    "UUID": "27DDA27D-8385-4DAC-B06D-6947253B2068",
    "DataProviderID": 1,
    "OperatorID": 89,
    "UsageTypeID": 1,
    "AddressInfo": {
        "ID": 144224,
        "Title": "Atlantic Superstore Digby Market",
        "AddressLine1": "490 Highway 303",
        "Town": "Digby",
        "StateOrProvince": "NS",
        "Postcode": "B0V 1A0",
        "CountryID": 44,
        "Latitude": 44.600061,
        "Longitude": -65.772568,
        "ContactTelephone1": "888-356-8911",
        "AccessComments": "24 hours daily",
        "RelatedURL": "https://flo.ca/",
        "DistanceUnit": 0
    },
    "Connections": [
        {
            "ID": 200282,
            "ConnectionTypeID": 1,
            "LevelID": 2,
            "Amps": 30,
            "Voltage": 240,
            "PowerKW": 7,
            "CurrentTypeID": 10,
            "Quantity": 2
        }
    ],
    "StatusTypeID": 50,
    "DateLastStatusUpdate": "2020-03-05T14:19:00Z",
    "DataQualityLevel": 3,
    "DateCreated": "2019-12-24T09:22:00Z",
    "SubmissionStatusTypeID": 100
}