{
    "IsRecentlyVerified": false,
    "ID": 85197,
    "UUID": "177AC626-AC36-44CC-9E30-253567451DAD",
    "DataProviderID": 1,
    "UsageTypeID": 1,
    "UsageCost": "free",
    "AddressInfo": {
        "ID": 85543,
        "Title": "Espace ESR & Vous",
        "AddressLine1": "Rue des Creusets, 8",
        "Town": "Sion",
        "Postcode": "1950",
        "CountryID": 217,
        "Latitude": 46.2307041329236,
        "Longitude": 7.36009491482661,
        "DistanceUnit": 0
    },
    "Connections": [
        {
            "ID": 120970,
            "ConnectionTypeID": 1036,
            "StatusTypeID": 50,
            "LevelID": 2,
            "Amps": 32,
            "Voltage": 400,
            "PowerKW": 22,
            "CurrentTypeID": 20,
            "Quantity": 2
        },
        {
            "ID": 120971,
            "ConnectionTypeID": 1,
            "StatusTypeID": 50,
            "LevelID": 2,
            "Amps": 32,
            "Voltage": 240,
            "PowerKW": 7,
            "CurrentTypeID": 10,
            "Quantity": 2
        }
    ],
    "NumberOfPoints": 2,
    "StatusTypeID": 50,
    "DateLastStatusUpdate": "2017-03-28T21:43:00Z",
    "DataQualityLevel": 1,
    "DateCreated": "2017-03-28T14:14:00Z",
    "SubmissionStatusTypeID": 200
}