{
    "IsRecentlyVerified": false,
    "ID": 184259,
    "UUID": "E61F152F-B23A-4959-928A-D72D9FF5325B",
    "DataProviderID": 29,
    "DataProvidersReference": "1104",
    "AddressInfo": {
        "ID": 184618,
        "Title": "Puschkin-Allee 5",
        "AddressLine1": "Puschkin-Allee 5",
        "Town": "Rüdersdorf bei Berlin",
        "Postcode": "15562",
        "CountryID": 87,
        "Latitude": 52.471293,
        "Longitude": 13.784527,
        "DistanceUnit": 0
    },
    "Connections": [
        {
            "ID": 292291,
            "ConnectionTypeID": 25,
            "StatusTypeID": 50,
            "LevelID": 2,
            "PowerKW": 22,
            "CurrentTypeID": 20
        },
        {
            "ID": 292292,
            "ConnectionTypeID": 25,
            "StatusTypeID": 50,
            "LevelID": 2,
            "PowerKW": 22,
            "CurrentTypeID": 20
        },
        {
            "ID": 292293,
            "ConnectionTypeID": 1036,
            "StatusTypeID": 50,
            "LevelID": 3,
            "PowerKW": 43,
            "CurrentTypeID": 20
        }
    ],
    "StatusTypeID": 50,
    "DateLastStatusUpdate": "2021-07-12T02:49:00Z",
    "MetadataValues": [
        {
            "ID": 16550,
            "MetadataFieldID": 4,
            "ItemValue": "Data from the German chargepoint registry provided by Bundesnetzagentur.de under the CC-BY 4.0 license"
        }
    ],
    "DataQualityLevel": 3,
    "DateCreated": "2021-07-08T10:05:00Z",
    "SubmissionStatusTypeID": 100
}