{
    "IsRecentlyVerified": false,
    "ID": 29963,
    "UUID": "80C62D20-90BA-4939-A6B3-1E907A28599A",
    "DataProviderID": 15,
    "DataProvidersReference": "36710",
    "OperatorID": 5,
    "AddressInfo": {
        "ID": 30309,
        "Title": "2001 West 8th",
        "AddressLine1": "2001 West 8th",
        "Town": "Seattle",
        "StateOrProvince": "Washington",
        "Postcode": "98121",
        "CountryID": 2,
        "Latitude": 47.6158690641514,
        "Longitude": -122.33719779259,
        "ContactTelephone1": "",
        "RelatedURL": "http://carstations.com/36710",
        "DistanceUnit": 0
    },
    "Connections": [
        {
            "ID": 32948,
            "ConnectionTypeID": 1,
            "Reference": "J1772",
            "LevelID": 2
        }
    ],
    "StatusTypeID": 0,
    "DateLastStatusUpdate": "2017-11-04T14:05:00Z",
    "DataQualityLevel": 2,
    "DateCreated": "2014-11-29T05:39:00Z",
    "SubmissionStatusTypeID": 100
}