{
    "IsRecentlyVerified": false,
    "ID": 91448,
    "UUID": "A86722C5-C6A1-451C-9A5F-DBA18C86A660",
    "DataProviderID": 2,
    "DataProvidersReference": "76741",
    "UsageTypeID": 1,
    "AddressInfo": {
        "ID": 91794,
        "Title": "Dorsett Nissan",
        "AddressLine1": "105 W Mayfair Dr",
        "Town": "Terre Haute",
        "StateOrProvince": "IN",
        "Postcode": "47802",
        "CountryID": 2,
        "Latitude": 39.41436,
        "Longitude": -87.41674,
        "ContactTelephone1": "812-514-7220",
        "AccessComments": "Dealership business hours",
        "RelatedURL": "",
        "DistanceUnit": 0
    },
    "Connections": [
        {
            "ID": 129615,
            "ConnectionTypeID": 1,
            "LevelID": 2,
            "Amps": 16,
            "Voltage": 230,
            "PowerKW": 3.7,
            "CurrentTypeID": 10,
            "Quantity": 1
        }
    ],
    "DateLastStatusUpdate": "2020-06-26T03:01:00Z",
    "DataQualityLevel": 3,
    "DateCreated": "2017-08-03T12:25:00Z",
    "SubmissionStatusTypeID": 100
}