{
    "IsRecentlyVerified": false,
    "ID": 141708,
    "UUID": "ACBF3A41-5AF9-423E-91CE-D555A6BE35C7",
    "DataProviderID": 2,
    "DataProvidersReference": "91986",
    "UsageTypeID": 1,
    "AddressInfo": {
        "ID": 142060,
        "Title": "Arena Garage - South Howard Street",
        "AddressLine1": "99 S Howard St",
        "Town": "Baltimore",
        "StateOrProvince": "MD",
        "Postcode": "21201",
        "CountryID": 2,
        "Latitude": 39.287914,
        "Longitude": -76.619205,
        "ContactTelephone1": "410-685-1109",
        "AccessComments": "24 hours daily",
        "RelatedURL": "",
        "DistanceUnit": 0
    },
    "Connections": [
        {
            "ID": 197701,
            "ConnectionTypeID": 1,
            "LevelID": 2,
            "Amps": 16,
            "Voltage": 230,
            "PowerKW": 3.7,
            "CurrentTypeID": 10,
            "Quantity": 4
        }
    ],
    "StatusTypeID": 50,
    "DateLastStatusUpdate": "2020-06-26T03:01:00Z",
    "DataQualityLevel": 3,
    "DateCreated": "2019-12-24T09:16:00Z",
    "SubmissionStatusTypeID": 100
}