{
    "MediaItems": [
        {
            "ID": 26714,
            "ChargePointID": 172400,
            "ItemURL": "https://s3-ap-southeast-2.amazonaws.com/openchargemap/images/PT/OCM172400/OCM-172400.orig.2021030116200599.jpg",
            "ItemThumbnailURL": "https://s3-ap-southeast-2.amazonaws.com/openchargemap/images/PT/OCM172400/OCM-172400.thmb.2021030116200599.jpg",
            "Comment": "",
            "IsEnabled": true,
            "IsVideo": false,
            "IsFeaturedItem": false,
            "IsExternalResource": false,
            "User": {
                "ID": 28510,
                "Username": "Filipe Esteves"
            },
            "DateCreated": "2021-03-01T16:20:00Z"
        }
    ],
    "IsRecentlyVerified": false,
    "ID": 172400,
    "UUID": "3470F4D3-1CC0-4D5D-AFF2-F7CD8208BF81",
    "DataProviderID": 1,
    "OperatorID": 3431,
    "UsageTypeID": 4,
    "UsageCost": "0.18€ / kWh",
    "AddressInfo": {
        "ID": 172759,
        "Title": "Continente Bom Dia Guarda",
        "AddressLine1": "Avenida de São Miguel",
        "Town": "Guarda",
        "StateOrProvince": "Guarda",
        "Postcode": "6300",
        "CountryID": 180,
        "Latitude": 40.55449334365292,
        "Longitude": -7.246458052053185,
        "AccessComments": "09:00>21:00",
        "RelatedURL": "https://plugcharge.continente.pt/",
        "DistanceUnit": 0
    },
    "Connections": [
        {
            "ID": 263595,
            "ConnectionTypeID": 25,
            "StatusTypeID": 50,
            "LevelID": 2,
            "Amps": 32,
            "Voltage": 400,
            "PowerKW": 22,
            "CurrentTypeID": 20,
            "Quantity": 4
        }
    ],
    "NumberOfPoints": 4,
    "GeneralComments": "Continente Plug&Charge App",
    "StatusTypeID": 50,
    "DateLastStatusUpdate": "2021-03-01T16:20:00Z",
    "DataQualityLevel": 1,
    "DateCreated": "2021-01-31T20:10:00Z",
    "SubmissionStatusTypeID": 200
}