{
    "IsRecentlyVerified": false,
    "ID": 102932,
    "UUID": "81DCE55A-80A1-4303-9698-F6F47B8FA8E8",
    "DataProviderID": 2,
    "DataProvidersReference": "92388",
    "OperatorID": 5,
    "UsageTypeID": 1,
    "AddressInfo": {
        "ID": 103278,
        "Title": "CHILDREN’S ONE",
        "AddressLine1": "1 Brookline Pl",
        "Town": "Brookline",
        "StateOrProvince": "MA",
        "Postcode": "02445",
        "CountryID": 2,
        "Latitude": 42.332752,
        "Longitude": -71.115383,
        "ContactTelephone1": "888-758-4389",
        "AccessComments": "24 hours daily",
        "RelatedURL": "http://www.chargepoint.com/",
        "DistanceUnit": 0
    },
    "Connections": [
        {
            "ID": 145079,
            "ConnectionTypeID": 1,
            "LevelID": 2,
            "Amps": 16,
            "Voltage": 230,
            "PowerKW": 3,
            "CurrentTypeID": 10,
            "Quantity": 14
        }
    ],
    "DateLastStatusUpdate": "2019-12-24T09:20:00Z",
    "DataQualityLevel": 3,
    "DateCreated": "2018-04-21T04:13:00Z",
    "SubmissionStatusTypeID": 100
}