{
    "IsRecentlyVerified": false,
    "ID": 180766,
    "UUID": "2175BD1E-B73B-49F8-98DF-3BCC0B0578A2",
    "DataProviderID": 29,
    "DataProvidersReference": "3981",
    "AddressInfo": {
        "ID": 181125,
        "Title": "Nordermarkt 5",
        "AddressLine1": "Nordermarkt 5",
        "Town": "Meldorf",
        "Postcode": "25704",
        "CountryID": 87,
        "Latitude": 54.090903,
        "Longitude": 9.072199,
        "DistanceUnit": 0
    },
    "Connections": [
        {
            "ID": 284253,
            "ConnectionTypeID": 25,
            "StatusTypeID": 50,
            "LevelID": 2,
            "PowerKW": 22,
            "CurrentTypeID": 20
        },
        {
            "ID": 284254,
            "ConnectionTypeID": 25,
            "StatusTypeID": 50,
            "LevelID": 2,
            "PowerKW": 22,
            "CurrentTypeID": 20
        },
        {
            "ID": 284255,
            "ConnectionTypeID": 25,
            "StatusTypeID": 50,
            "LevelID": 2,
            "PowerKW": 22,
            "CurrentTypeID": 20
        },
        {
            "ID": 284256,
            "ConnectionTypeID": 25,
            "StatusTypeID": 50,
            "LevelID": 2,
            "PowerKW": 22,
            "CurrentTypeID": 20
        }
    ],
    "StatusTypeID": 50,
    "DateLastStatusUpdate": "2021-07-12T02:52:00Z",
    "MetadataValues": [
        {
            "ID": 13060,
            "MetadataFieldID": 4,
            "ItemValue": "Data from the German chargepoint registry provided by Bundesnetzagentur.de under the CC-BY 4.0 license"
        }
    ],
    "DataQualityLevel": 3,
    "DateCreated": "2021-07-08T10:01:00Z",
    "SubmissionStatusTypeID": 100
}