{
    "IsRecentlyVerified": false,
    "ID": 157201,
    "UUID": "D5CB8DBA-F42D-4278-98C4-7C0EFB5C1773",
    "DataProviderID": 19,
    "DataProvidersReference": "6170",
    "AddressInfo": {
        "ID": 157555,
        "Title": "Västra skogen friluftsområde",
        "AddressLine1": "Västra skogen friluftsområde ",
        "Town": "SOLLEFTEÅ",
        "StateOrProvince": "VÄSTERNORRLAND",
        "Postcode": "88152",
        "CountryID": 216,
        "Latitude": 63.17714,
        "Longitude": 17.25834,
        "AccessComments": "Vid rasplatsen",
        "DistanceUnit": 0
    },
    "Connections": [
        {
            "ID": 225896,
            "ConnectionTypeID": 2,
            "Reference": "1",
            "LevelID": 3,
            "Amps": 100,
            "Voltage": 500,
            "PowerKW": 50,
            "CurrentTypeID": 30
        },
        {
            "ID": 225897,
            "ConnectionTypeID": 33,
            "Reference": "2",
            "LevelID": 3,
            "Amps": 100,
            "Voltage": 500,
            "PowerKW": 50,
            "CurrentTypeID": 30
        },
        {
            "ID": 225898,
            "ConnectionTypeID": 25,
            "Reference": "3",
            "LevelID": 3,
            "Amps": 32,
            "Voltage": 400,
            "PowerKW": 22,
            "CurrentTypeID": 30
        },
        {
            "ID": 225899,
            "ConnectionTypeID": 25,
            "Reference": "4",
            "LevelID": 3,
            "Amps": 32,
            "Voltage": 400,
            "PowerKW": 22,
            "CurrentTypeID": 30
        }
    ],
    "NumberOfPoints": 4,
    "StatusTypeID": 0,
    "DateLastStatusUpdate": "2021-03-24T05:12:00Z",
    "DataQualityLevel": 2,
    "DateCreated": "2020-05-26T08:25:00Z",
    "SubmissionStatusTypeID": 100
}