{
    "IsRecentlyVerified": false,
    "ID": 170270,
    "UUID": "485DDBF0-451C-4BE6-A18F-CB48F4C72CBF",
    "DataProviderID": 1,
    "OperatorID": 1,
    "UsageTypeID": 1,
    "AddressInfo": {
        "ID": 170629,
        "Title": "TWS Ladestation Bodnegg",
        "AddressLine1": "17 Dorfstraße",
        "Town": "Bodnegg",
        "StateOrProvince": "Baden-Württemberg",
        "Postcode": "88285",
        "CountryID": 87,
        "Latitude": 47.7112842698817,
        "Longitude": 9.6935612027047,
        "DistanceUnit": 0
    },
    "Connections": [
        {
            "ID": 259666,
            "ConnectionTypeID": 25,
            "StatusTypeID": 50,
            "LevelID": 2,
            "PowerKW": 22,
            "CurrentTypeID": 20,
            "Quantity": 2
        }
    ],
    "NumberOfPoints": 1,
    "StatusTypeID": 50,
    "DateLastStatusUpdate": "2021-02-24T14:17:00Z",
    "DataQualityLevel": 1,
    "DateCreated": "2020-11-22T19:14:00Z",
    "SubmissionStatusTypeID": 200
}