{
    "IsRecentlyVerified": false,
    "ID": 188205,
    "UUID": "C5EDEE99-7737-4B28-8FA8-DE3821DD52B5",
    "DataProviderID": 1,
    "OperatorID": 1,
    "UsageTypeID": 4,
    "AddressInfo": {
        "ID": 188564,
        "Title": "Ikuna Naturerlebnispark Natternbach",
        "AddressLine1": "Naturpfad 1",
        "Town": "Natternbach",
        "CountryID": 19,
        "Latitude": 48.40012609471614,
        "Longitude": 13.74629339387468,
        "DistanceUnit": 0
    },
    "Connections": [
        {
            "ID": 303758,
            "ConnectionTypeID": 1036,
            "StatusTypeID": 50,
            "LevelID": 2,
            "PowerKW": 11,
            "CurrentTypeID": 20,
            "Quantity": 8
        }
    ],
    "NumberOfPoints": 4,
    "StatusTypeID": 50,
    "DateLastStatusUpdate": "2021-07-17T07:53:00Z",
    "DataQualityLevel": 1,
    "DateCreated": "2021-07-14T07:47:00Z",
    "SubmissionStatusTypeID": 200
}