{
    "IsRecentlyVerified": false,
    "ID": 75505,
    "UUID": "48C77138-F5D1-43D5-BB75-08103175023B",
    "DataProviderID": 1,
    "OperatorID": 89,
    "OperatorsReference": "AAA-295",
    "UsageTypeID": 4,
    "UsageCost": "Free",
    "AddressInfo": {
        "ID": 75851,
        "Title": "District of Summerland Memorial Park",
        "AddressLine1": "Memorial Park",
        "Town": "Summerland",
        "StateOrProvince": "BC",
        "Postcode": "V0H 1Z0",
        "CountryID": 44,
        "Latitude": 49.599689,
        "Longitude": -119.680759,
        "DistanceUnit": 0
    },
    "Connections": [
        {
            "ID": 108835,
            "ConnectionTypeID": 1,
            "StatusTypeID": 50,
            "LevelID": 2,
            "Amps": 32,
            "Voltage": 230,
            "PowerKW": 7,
            "CurrentTypeID": 10,
            "Quantity": 1
        }
    ],
    "NumberOfPoints": 1,
    "StatusTypeID": 50,
    "DateLastStatusUpdate": "2016-12-15T15:35:00Z",
    "DataQualityLevel": 1,
    "DateCreated": "2016-12-15T15:35:00Z",
    "SubmissionStatusTypeID": 200
}