{
    "IsRecentlyVerified": false,
    "ID": 139193,
    "UUID": "98F1B538-C258-46A9-8431-D6D690B34D69",
    "DataProviderID": 2,
    "DataProvidersReference": "121683",
    "OperatorID": 5,
    "UsageTypeID": 1,
    "AddressInfo": {
        "ID": 139545,
        "Title": "IRVINE  CO  OFC",
        "AddressLine1": "201 Technology Dr",
        "Town": "Irvine",
        "StateOrProvince": "CA",
        "Postcode": "92618",
        "CountryID": 2,
        "Latitude": 33.666007,
        "Longitude": -117.748864,
        "ContactTelephone1": "888-758-4389",
        "AccessComments": "24 hours daily",
        "RelatedURL": "http://www.chargepoint.com/",
        "DistanceUnit": 0
    },
    "Connections": [
        {
            "ID": 194465,
            "ConnectionTypeID": 1,
            "LevelID": 2,
            "Amps": 16,
            "Voltage": 230,
            "PowerKW": 3,
            "CurrentTypeID": 10,
            "Quantity": 3
        }
    ],
    "StatusTypeID": 50,
    "DateLastStatusUpdate": "2019-12-24T09:10:00Z",
    "DataQualityLevel": 3,
    "DateCreated": "2019-12-24T09:10:00Z",
    "SubmissionStatusTypeID": 100
}