{
    "IsRecentlyVerified": false,
    "ID": 30867,
    "UUID": "8FA9B875-2E5D-4655-BDAA-B1AE1FF8B759",
    "DataProviderID": 1,
    "DataProvidersReference": "1467",
    "AddressInfo": {
        "ID": 31213,
        "Title": "Sentrumsbygget, Ulvik",
        "AddressLine1": "Skeiesvegen 11",
        "Town": "ULVIK",
        "StateOrProvince": "Vestland",
        "Postcode": "5730",
        "CountryID": 168,
        "Latitude": 60.56816,
        "Longitude": 6.91603,
        "AccessComments": "På baksiden av bygget. Skiltet frå hovedveg.",
        "DistanceUnit": 0
    },
    "Connections": [
        {
            "ID": 34096,
            "ConnectionTypeID": 0,
            "Reference": "1",
            "LevelID": 2,
            "Amps": 16,
            "Voltage": 230,
            "PowerKW": 3.7,
            "Comments": "Mode 1"
        },
        {
            "ID": 89082,
            "ConnectionTypeID": 0,
            "Reference": "2",
            "LevelID": 2,
            "Amps": 16,
            "Voltage": 230,
            "PowerKW": 3.7,
            "Comments": "Mode 1"
        }
    ],
    "NumberOfPoints": 2,
    "DateLastStatusUpdate": "2020-05-26T08:24:00Z",
    "DataQualityLevel": 2,
    "DateCreated": "2014-12-09T09:01:00Z",
    "SubmissionStatusTypeID": 100
}