{
    "IsRecentlyVerified": false,
    "ID": 70130,
    "UUID": "06F2BE0F-C543-4415-A88F-4BA913E4DA19",
    "DataProviderID": 1,
    "OperatorID": 3,
    "OperatorsReference": "PG-80449",
    "UsageTypeID": 6,
    "UsageCost": "Free",
    "AddressInfo": {
        "ID": 70476,
        "Title": "Ab Graphic International LTD",
        "AddressLine1": "Lancaster Road",
        "Town": "Carnaby",
        "StateOrProvince": "East Riding of Yorkshire",
        "Postcode": "YO15 3QY",
        "CountryID": 1,
        "Latitude": 54.064444,
        "Longitude": -0.243203,
        "DistanceUnit": 0
    },
    "Connections": [
        {
            "ID": 100057,
            "ConnectionTypeID": 25,
            "StatusTypeID": 50,
            "LevelID": 2,
            "Amps": 32,
            "Voltage": 400,
            "PowerKW": 22,
            "CurrentTypeID": 20,
            "Quantity": 2
        }
    ],
    "NumberOfPoints": 4,
    "StatusTypeID": 50,
    "DateLastStatusUpdate": "2017-12-20T11:52:00Z",
    "DataQualityLevel": 1,
    "DateCreated": "2016-07-08T21:37:00Z",
    "SubmissionStatusTypeID": 200
}