{
    "IsRecentlyVerified": false,
    "ID": 123799,
    "UUID": "CB87F93F-5526-4292-A667-192D188122A4",
    "DataProviderID": 2,
    "DataProvidersReference": "82667",
    "OperatorID": 5,
    "UsageTypeID": 1,
    "AddressInfo": {
        "ID": 124145,
        "Title": "@CENTRAL",
        "AddressLine1": "2858 De La Cruz Blvd",
        "Town": "Santa Clara",
        "StateOrProvince": "CA",
        "Postcode": "95050",
        "CountryID": 2,
        "Latitude": 37.372156,
        "Longitude": -121.943573,
        "ContactTelephone1": "888-758-4389",
        "AccessComments": "24 hours daily",
        "RelatedURL": "http://www.chargepoint.com/",
        "DistanceUnit": 0
    },
    "Connections": [
        {
            "ID": 173826,
            "ConnectionTypeID": 1,
            "LevelID": 2,
            "Amps": 16,
            "Voltage": 230,
            "PowerKW": 3.7,
            "CurrentTypeID": 10,
            "Quantity": 8
        }
    ],
    "DateLastStatusUpdate": "2020-06-26T02:59:00Z",
    "DataQualityLevel": 3,
    "DateCreated": "2019-04-06T05:03:00Z",
    "SubmissionStatusTypeID": 100
}