{
    "IsRecentlyVerified": false,
    "ID": 180219,
    "UUID": "BE83B482-F7D1-451F-A98F-C8E2A7711DDF",
    "DataProviderID": 29,
    "DataProvidersReference": "19141",
    "AddressInfo": {
        "ID": 180578,
        "Title": "Grünstr. 17",
        "AddressLine1": "Grünstr. 17",
        "Town": "Detmold",
        "Postcode": "32756",
        "CountryID": 87,
        "Latitude": 51.950154,
        "Longitude": 8.88423,
        "DistanceUnit": 0
    },
    "Connections": [
        {
            "ID": 283023,
            "ConnectionTypeID": 25,
            "StatusTypeID": 50,
            "LevelID": 2,
            "PowerKW": 22,
            "CurrentTypeID": 20
        },
        {
            "ID": 283024,
            "ConnectionTypeID": 25,
            "StatusTypeID": 50,
            "LevelID": 2,
            "PowerKW": 22,
            "CurrentTypeID": 20
        }
    ],
    "StatusTypeID": 50,
    "DateLastStatusUpdate": "2021-07-12T02:48:00Z",
    "MetadataValues": [
        {
            "ID": 12513,
            "MetadataFieldID": 4,
            "ItemValue": "Data from the German chargepoint registry provided by Bundesnetzagentur.de under the CC-BY 4.0 license"
        }
    ],
    "DataQualityLevel": 3,
    "DateCreated": "2021-07-08T10:00:00Z",
    "SubmissionStatusTypeID": 100
}