{
    "IsRecentlyVerified": false,
    "ID": 181654,
    "UUID": "26877622-E419-4111-AD52-D4C5D38386F8",
    "DataProviderID": 29,
    "DataProvidersReference": "16304",
    "OperatorID": 45,
    "AddressInfo": {
        "ID": 182013,
        "Title": "Ehinger Straße 5",
        "AddressLine1": "Ehinger Straße 5",
        "Town": "Erbach",
        "Postcode": "89155",
        "CountryID": 87,
        "Latitude": 48.327562,
        "Longitude": 9.895613,
        "DistanceUnit": 0
    },
    "Connections": [
        {
            "ID": 286278,
            "ConnectionTypeID": 25,
            "StatusTypeID": 50,
            "LevelID": 2,
            "PowerKW": 22,
            "CurrentTypeID": 20
        },
        {
            "ID": 286279,
            "ConnectionTypeID": 25,
            "StatusTypeID": 50,
            "LevelID": 2,
            "PowerKW": 22,
            "CurrentTypeID": 20
        }
    ],
    "StatusTypeID": 50,
    "DateLastStatusUpdate": "2021-07-12T02:40:00Z",
    "MetadataValues": [
        {
            "ID": 13948,
            "MetadataFieldID": 4,
            "ItemValue": "Data from the German chargepoint registry provided by Bundesnetzagentur.de under the CC-BY 4.0 license"
        }
    ],
    "DataQualityLevel": 3,
    "DateCreated": "2021-07-08T10:02:00Z",
    "SubmissionStatusTypeID": 100
}