{
    "MediaItems": [
        {
            "ID": 25241,
            "ChargePointID": 23099,
            "ItemURL": "https://s3-ap-southeast-2.amazonaws.com/openchargemap/images/IT/OCM23099/OCM-23099.orig.2020102611145057.jpg",
            "ItemThumbnailURL": "https://s3-ap-southeast-2.amazonaws.com/openchargemap/images/IT/OCM23099/OCM-23099.thmb.2020102611145057.jpg",
            "Comment": "",
            "IsEnabled": true,
            "IsVideo": false,
            "IsFeaturedItem": false,
            "IsExternalResource": false,
            "User": {
                "ID": 16290,
                "Username": "AndreaDFC"
            },
            "DateCreated": "2020-10-26T11:15:00Z"
        },
        {
            "ID": 25240,
            "ChargePointID": 23099,
            "ItemURL": "https://s3-ap-southeast-2.amazonaws.com/openchargemap/images/IT/OCM23099/OCM-23099.orig.2020102611123066.jpg",
            "ItemThumbnailURL": "https://s3-ap-southeast-2.amazonaws.com/openchargemap/images/IT/OCM23099/OCM-23099.thmb.2020102611123066.jpg",
            "Comment": "",
            "IsEnabled": true,
            "IsVideo": false,
            "IsFeaturedItem": false,
            "IsExternalResource": false,
            "User": {
                "ID": 16290,
                "Username": "AndreaDFC"
            },
            "DateCreated": "2020-10-26T11:13:00Z"
        },
        {
            "ID": 25239,
            "ChargePointID": 23099,
            "ItemURL": "https://s3-ap-southeast-2.amazonaws.com/openchargemap/images/IT/OCM23099/OCM-23099.orig.2020102610505885.jpg",
            "ItemThumbnailURL": "https://s3-ap-southeast-2.amazonaws.com/openchargemap/images/IT/OCM23099/OCM-23099.thmb.2020102610505885.jpg",
            "Comment": "",
            "IsEnabled": true,
            "IsVideo": false,
            "IsFeaturedItem": false,
            "IsExternalResource": false,
            "User": {
                "ID": 16290,
                "Username": "AndreaDFC"
            },
            "DateCreated": "2020-10-26T10:51:00Z"
        },
        {
            "ID": 25238,
            "ChargePointID": 23099,
            "ItemURL": "https://s3-ap-southeast-2.amazonaws.com/openchargemap/images/IT/OCM23099/OCM-23099.orig.2020102610490848.jpg",
            "ItemThumbnailURL": "https://s3-ap-southeast-2.amazonaws.com/openchargemap/images/IT/OCM23099/OCM-23099.thmb.2020102610490848.jpg",
            "Comment": "",
            "IsEnabled": true,
            "IsVideo": false,
            "IsFeaturedItem": false,
            "IsExternalResource": false,
            "User": {
                "ID": 16290,
                "Username": "AndreaDFC"
            },
            "DateCreated": "2020-10-26T10:49:00Z"
        },
        {
            "ID": 25237,
            "ChargePointID": 23099,
            "ItemURL": "https://s3-ap-southeast-2.amazonaws.com/openchargemap/images/IT/OCM23099/OCM-23099.orig.2020102610461656.jpg",
            "ItemThumbnailURL": "https://s3-ap-southeast-2.amazonaws.com/openchargemap/images/IT/OCM23099/OCM-23099.thmb.2020102610461656.jpg",
            "Comment": "",
            "IsEnabled": true,
            "IsVideo": false,
            "IsFeaturedItem": false,
            "IsExternalResource": false,
            "User": {
                "ID": 16290,
                "Username": "AndreaDFC"
            },
            "DateCreated": "2020-10-26T10:46:00Z"
        },
        {
            "ID": 3135,
            "ChargePointID": 23099,
            "ItemURL": "https://s3-ap-southeast-2.amazonaws.com/openchargemap/images/IT/OCM23099/OCM-23099.orig.2015083015184295.jpg",
            "ItemThumbnailURL": "https://s3-ap-southeast-2.amazonaws.com/openchargemap/images/IT/OCM23099/OCM-23099.thmb.2015083015184295.jpg",
            "Comment": "",
            "IsEnabled": true,
            "IsVideo": false,
            "IsFeaturedItem": false,
            "IsExternalResource": false,
            "User": {
                "ID": 1606,
                "Username": "polianto"
            },
            "DateCreated": "2015-08-30T15:19:00Z"
        },
        {
            "ID": 3136,
            "ChargePointID": 23099,
            "ItemURL": "https://s3-ap-southeast-2.amazonaws.com/openchargemap/images/IT/OCM23099/OCM-23099.orig.2015083015190756.jpg",
            "ItemThumbnailURL": "https://s3-ap-southeast-2.amazonaws.com/openchargemap/images/IT/OCM23099/OCM-23099.thmb.2015083015190756.jpg",
            "Comment": "",
            "IsEnabled": true,
            "IsVideo": false,
            "IsFeaturedItem": false,
            "IsExternalResource": false,
            "User": {
                "ID": 1606,
                "Username": "polianto"
            },
            "DateCreated": "2015-08-30T15:19:00Z"
        }
    ],
    "IsRecentlyVerified": false,
    "ID": 23099,
    "UUID": "8FBBDC8C-7450-46FC-AC31-85B0EA38A92A",
    "DataProviderID": 1,
    "UsageTypeID": 1,
    "UsageCost": "free",
    "AddressInfo": {
        "ID": 23444,
        "Title": "Parcheggio Cimitero",
        "AddressLine1": "Vai Lorenzo Lotto",
        "Town": "Recanati",
        "StateOrProvince": "MC",
        "Postcode": "62018",
        "CountryID": 112,
        "Latitude": 43.4026195684654,
        "Longitude": 13.5567975122743,
        "RelatedURL": "http://www.asteaenergia.it/",
        "DistanceUnit": 0
    },
    "Connections": [
        {
            "ID": 24807,
            "ConnectionTypeID": 36,
            "StatusTypeID": 50,
            "LevelID": 2,
            "Amps": 16,
            "Voltage": 240,
            "PowerKW": 3.4,
            "CurrentTypeID": 10,
            "Quantity": 2
        }
    ],
    "NumberOfPoints": 2,
    "GeneralComments": "Prese tipo SCAME 3A",
    "StatusTypeID": 50,
    "DateLastStatusUpdate": "2020-10-26T11:15:00Z",
    "DataQualityLevel": 1,
    "DateCreated": "2014-04-12T15:23:00Z",
    "SubmissionStatusTypeID": 200
}