{
    "IsRecentlyVerified": false,
    "ID": 91696,
    "UUID": "18E7D95A-99D7-4921-92B8-F05B820DF6CB",
    "DataProviderID": 1,
    "OperatorID": 45,
    "UsageTypeID": 6,
    "AddressInfo": {
        "ID": 92042,
        "Title": "Hotel Mövenpick",
        "AddressLine1": "Schöneberger Straße 3",
        "Town": "Berlin",
        "StateOrProvince": "Berlin",
        "Postcode": "10963",
        "CountryID": 87,
        "Latitude": 52.50383665131408,
        "Longitude": 13.38032539384835,
        "AccessComments": "24/7 nutzbare Mennekes Wallbox mit Typ2 Dose. Für Gäste nach Reservierung\r\n",
        "DistanceUnit": 0
    },
    "Connections": [
        {
            "ID": 130016,
            "ConnectionTypeID": 25,
            "StatusTypeID": 50,
            "LevelID": 2,
            "Amps": 32,
            "Voltage": 400,
            "PowerKW": 22,
            "CurrentTypeID": 20,
            "Quantity": 1
        }
    ],
    "NumberOfPoints": 1,
    "StatusTypeID": 50,
    "DateLastStatusUpdate": "2017-08-14T07:25:00Z",
    "DataQualityLevel": 1,
    "DateCreated": "2017-08-14T07:25:00Z",
    "SubmissionStatusTypeID": 200
}