{
    "IsRecentlyVerified": false,
    "ID": 154455,
    "UUID": "47E9E32B-2EE6-4D52-B2F9-8E965183AAD5",
    "DataProviderID": 28,
    "DataProvidersReference": "FR*SOD*S*NPDC*261*1*_*_",
    "UsageTypeID": 5,
    "AddressInfo": {
        "ID": 154808,
        "Title": "Sainghin en Mélantois - Eglise",
        "AddressLine1": "rue du Contour de l'église, Sainghin en Mélantois",
        "CountryID": 80,
        "Latitude": 50.58896,
        "Longitude": 3.167262,
        "AccessComments": "24/24 7/7 jours",
        "DistanceUnit": 0
    },
    "Connections": [
        {
            "ID": 217216,
            "ConnectionTypeID": 28,
            "StatusTypeID": 50,
            "LevelID": 2,
            "PowerKW": 22,
            "CurrentTypeID": 10
        },
        {
            "ID": 217217,
            "ConnectionTypeID": 1036,
            "StatusTypeID": 50,
            "LevelID": 2,
            "PowerKW": 22,
            "CurrentTypeID": 20
        },
        {
            "ID": 252310,
            "ConnectionTypeID": 28,
            "StatusTypeID": 50,
            "LevelID": 2,
            "PowerKW": 22,
            "CurrentTypeID": 10
        },
        {
            "ID": 252311,
            "ConnectionTypeID": 1036,
            "StatusTypeID": 50,
            "LevelID": 2,
            "PowerKW": 22,
            "CurrentTypeID": 20
        }
    ],
    "GeneralComments": "\"Type charge indiquée selon décret de 2017",
    "StatusTypeID": 50,
    "DateLastStatusUpdate": "2020-08-27T05:16:00Z",
    "DataQualityLevel": 2,
    "DateCreated": "2020-03-15T10:55:00Z",
    "SubmissionStatusTypeID": 100
}