{
    "IsRecentlyVerified": false,
    "ID": 33144,
    "UUID": "189E5518-5668-418B-AB95-E99B8984813D",
    "DataProviderID": 1,
    "OperatorID": 105,
    "OperatorsReference": "Essent EM-DE-05913000-01-00054",
    "UsageTypeID": 4,
    "AddressInfo": {
        "ID": 33490,
        "Title": "Sunderweg 100",
        "AddressLine1": "Sunderweg 100",
        "Town": "Dortmund",
        "Postcode": "44147",
        "CountryID": 87,
        "Latitude": 51.523084,
        "Longitude": 7.441987,
        "DistanceUnit": 0
    },
    "Connections": [
        {
            "ID": 36655,
            "ConnectionTypeID": 25,
            "LevelID": 2,
            "PowerKW": 11
        },
        {
            "ID": 46701,
            "ConnectionTypeID": 25,
            "LevelID": 2,
            "PowerKW": 11
        }
    ],
    "NumberOfPoints": 1,
    "StatusTypeID": 50,
    "DateLastStatusUpdate": "2015-04-13T05:22:00Z",
    "DataQualityLevel": 3,
    "DateCreated": "2015-01-09T06:04:00Z",
    "SubmissionStatusTypeID": 200
}