{
    "IsRecentlyVerified": false,
    "ID": 156752,
    "UUID": "2B93A07D-15FB-498C-A0E2-0C257BA81741",
    "DataProviderID": 19,
    "DataProvidersReference": "709",
    "AddressInfo": {
        "ID": 157106,
        "Title": "Grimstad kulturhuskjelleren",
        "AddressLine1": "Storgata 33",
        "Town": "GRIMSTAD",
        "StateOrProvince": "Agder",
        "Postcode": "4876",
        "CountryID": 168,
        "Latitude": 58.34291,
        "Longitude": 8.59049,
        "AccessComments": "Parkering på nederste plan, merket \"Kommunal parkering\".",
        "DistanceUnit": 0
    },
    "Connections": [
        {
            "ID": 221649,
            "ConnectionTypeID": 25,
            "Reference": "1",
            "LevelID": 2,
            "Amps": 16,
            "Voltage": 230,
            "PowerKW": 3.7,
            "CurrentTypeID": 10,
            "Comments": "Mode 3"
        },
        {
            "ID": 221650,
            "ConnectionTypeID": 25,
            "Reference": "2",
            "LevelID": 2,
            "Amps": 16,
            "Voltage": 230,
            "PowerKW": 3.7,
            "CurrentTypeID": 10,
            "Comments": "Mode 3"
        }
    ],
    "NumberOfPoints": 2,
    "StatusTypeID": 0,
    "DateLastStatusUpdate": "2021-03-24T05:11:00Z",
    "DataQualityLevel": 2,
    "DateCreated": "2020-05-26T08:22:00Z",
    "SubmissionStatusTypeID": 100
}