{
    "IsRecentlyVerified": false,
    "ID": 167717,
    "UUID": "08BEAC08-6A86-4AD5-B3D1-984325495867",
    "DataProviderID": 1,
    "OperatorID": 21,
    "UsageTypeID": 4,
    "UsageCost": "Mobi.E compatible card",
    "AddressInfo": {
        "ID": 168076,
        "Title": "PCV-00001",
        "AddressLine1": "Rua da Eirinha",
        "Town": "Penacova",
        "StateOrProvince": "Centro",
        "Postcode": "",
        "CountryID": 180,
        "Latitude": 40.2705253518983,
        "Longitude": -8.284793168858073,
        "DistanceUnit": 0
    },
    "Connections": [
        {
            "ID": 254662,
            "ConnectionTypeID": 25,
            "StatusTypeID": 50,
            "LevelID": 2,
            "Amps": 32,
            "Voltage": 400,
            "PowerKW": 22,
            "CurrentTypeID": 20,
            "Quantity": 2
        }
    ],
    "NumberOfPoints": 2,
    "StatusTypeID": 50,
    "DateLastStatusUpdate": "2021-01-21T12:19:00Z",
    "DataQualityLevel": 1,
    "DateCreated": "2020-09-11T09:35:00Z",
    "SubmissionStatusTypeID": 200
}