{
    "IsRecentlyVerified": false,
    "ID": 123744,
    "UUID": "C813B8DC-4086-4433-89B7-3858FC195D79",
    "DataProviderID": 2,
    "DataProvidersReference": "87890",
    "UsageTypeID": 1,
    "AddressInfo": {
        "ID": 124090,
        "Title": "London Properties",
        "AddressLine1": "67 W Alexander Ave",
        "Town": "Merced",
        "StateOrProvince": "CA",
        "Postcode": "95348",
        "CountryID": 2,
        "Latitude": 37.315073,
        "Longitude": -120.470566,
        "ContactTelephone1": "209-725-2100",
        "AccessComments": "9am-6pm daily",
        "RelatedURL": "",
        "DistanceUnit": 0
    },
    "Connections": [
        {
            "ID": 173767,
            "ConnectionTypeID": 1,
            "LevelID": 2,
            "Amps": 16,
            "Voltage": 230,
            "PowerKW": 3.7,
            "CurrentTypeID": 10,
            "Quantity": 2
        }
    ],
    "DateLastStatusUpdate": "2020-06-26T02:59:00Z",
    "DataQualityLevel": 3,
    "DateCreated": "2019-04-06T05:03:00Z",
    "SubmissionStatusTypeID": 100
}