{
    "IsRecentlyVerified": false,
    "ID": 32508,
    "UUID": "E54D9C64-BD9E-4627-81AD-0A85B1A1A365",
    "DataProviderID": 1,
    "OperatorID": 105,
    "OperatorsReference": "Essent EM-DE-05122000-01-00002",
    "UsageTypeID": 4,
    "AddressInfo": {
        "ID": 32854,
        "Title": "Beethovenstraße 210",
        "AddressLine1": "Beethovenstraße 210",
        "Town": "Solingen",
        "Postcode": "42655",
        "CountryID": 87,
        "Latitude": 51.175203,
        "Longitude": 7.052118,
        "DistanceUnit": 0
    },
    "Connections": [
        {
            "ID": 36019,
            "ConnectionTypeID": 25,
            "LevelID": 2,
            "PowerKW": 11
        },
        {
            "ID": 46407,
            "ConnectionTypeID": 25,
            "LevelID": 2,
            "PowerKW": 11
        }
    ],
    "NumberOfPoints": 1,
    "StatusTypeID": 50,
    "DateLastStatusUpdate": "2015-04-13T19:27:00Z",
    "DataQualityLevel": 3,
    "DateCreated": "2015-01-09T06:03:00Z",
    "SubmissionStatusTypeID": 200
}