{
    "IsRecentlyVerified": false,
    "ID": 184025,
    "UUID": "67A01B3E-9FC9-4FC3-A5E5-EA5DE240F639",
    "DataProviderID": 29,
    "DataProvidersReference": "16713",
    "AddressInfo": {
        "ID": 184384,
        "Title": "Talstr. 130",
        "AddressLine1": "Talstr. 130",
        "Town": "Grevenbroich",
        "Postcode": "41516",
        "CountryID": 87,
        "Latitude": 51.135082,
        "Longitude": 6.615325,
        "DistanceUnit": 0
    },
    "Connections": [
        {
            "ID": 291735,
            "ConnectionTypeID": 25,
            "StatusTypeID": 50,
            "LevelID": 2,
            "PowerKW": 22,
            "CurrentTypeID": 20
        },
        {
            "ID": 291736,
            "ConnectionTypeID": 25,
            "StatusTypeID": 50,
            "LevelID": 2,
            "PowerKW": 22,
            "CurrentTypeID": 20
        },
        {
            "ID": 298779,
            "ConnectionTypeID": 25,
            "StatusTypeID": 50,
            "LevelID": 2,
            "PowerKW": 22,
            "CurrentTypeID": 20
        },
        {
            "ID": 298780,
            "ConnectionTypeID": 25,
            "StatusTypeID": 50,
            "LevelID": 2,
            "PowerKW": 22,
            "CurrentTypeID": 20
        }
    ],
    "StatusTypeID": 50,
    "DateLastStatusUpdate": "2021-07-12T02:46:00Z",
    "MetadataValues": [
        {
            "ID": 16318,
            "MetadataFieldID": 4,
            "ItemValue": "Data from the German chargepoint registry provided by Bundesnetzagentur.de under the CC-BY 4.0 license"
        }
    ],
    "DataQualityLevel": 3,
    "DateCreated": "2021-07-08T10:04:00Z",
    "SubmissionStatusTypeID": 100
}