{
    "IsRecentlyVerified": false,
    "ID": 18735,
    "UUID": "A32D5D7C-7C1E-46A7-8D27-D2D2354FE4B3",
    "DataProviderID": 15,
    "DataProvidersReference": "30591",
    "OperatorID": 1,
    "UsageTypeID": 1,
    "AddressInfo": {
        "ID": 19080,
        "Title": "?????????????",
        "AddressLine1": "?????????????",
        "Town": "????",
        "StateOrProvince": "",
        "Postcode": "50030",
        "CountryID": 50,
        "Latitude": 38.01231,
        "Longitude": 114.575644,
        "ContactTelephone1": "",
        "RelatedURL": "http://carstations.com/30591",
        "DistanceUnit": 0
    },
    "Connections": [
        {
            "ID": 18968,
            "ConnectionTypeID": 1,
            "Reference": "J1772",
            "LevelID": 2,
            "Quantity": 1
        }
    ],
    "NumberOfPoints": 1,
    "StatusTypeID": 0,
    "DateLastStatusUpdate": "2014-03-22T04:39:00Z",
    "DataQualityLevel": 2,
    "DateCreated": "2013-08-25T03:31:00Z",
    "SubmissionStatusTypeID": 200
}