{
    "IsRecentlyVerified": false,
    "ID": 43043,
    "UUID": "D9A32FC3-CB06-4626-99C9-554CED6E1969",
    "DataProviderID": 26,
    "DataProvidersReference": "60201",
    "OperatorID": 157,
    "OperatorsReference": "NewMotion 01000739",
    "UsageCost": "0.00 jaarabonnement",
    "AddressInfo": {
        "ID": 43389,
        "Title": "Crunershof 1",
        "AddressLine1": "Crunershof 1",
        "Town": "Hattem",
        "Postcode": "8051 SX",
        "CountryID": 159,
        "Latitude": 52.4814987182617,
        "Longitude": 6.05917549133301,
        "ContactTelephone1": "088 0109500",
        "RelatedURL": "http://thenewmotion.nl/",
        "DistanceUnit": 0
    },
    "Connections": [
        {
            "ID": 52088,
            "ConnectionTypeID": 25,
            "LevelID": 2,
            "PowerKW": 3.7,
            "CurrentTypeID": 10
        }
    ],
    "NumberOfPoints": 1,
    "StatusTypeID": 50,
    "DateLastStatusUpdate": "2016-06-04T02:54:00Z",
    "DataQualityLevel": 3,
    "DateCreated": "2015-03-25T02:49:00Z",
    "SubmissionStatusTypeID": 100
}