{
    "IsRecentlyVerified": false,
    "ID": 5378,
    "UUID": "CFCC4455-E847-471A-BB87-F3A9230B3F46",
    "DataProviderID": 1,
    "DataProvidersReference": "EVR-00002",
    "OperatorID": 21,
    "UsageTypeID": 4,
    "UsageCost": "Mobi.E card",
    "AddressInfo": {
        "ID": 5317,
        "Title": "EVR-00002",
        "AddressLine1": "Praça Joaquim António de Aguiar 24",
        "Town": "Évora",
        "Postcode": "7000-510",
        "CountryID": 180,
        "Latitude": 38.573454102067075,
        "Longitude": -7.91254174479991,
        "RelatedURL": "http://www.mobie.pt",
        "DistanceUnit": 0
    },
    "Connections": [
        {
            "ID": 33195,
            "ConnectionTypeID": 25,
            "StatusTypeID": 50,
            "LevelID": 2,
            "Amps": 16,
            "Voltage": 230,
            "PowerKW": 3,
            "CurrentTypeID": 10,
            "Quantity": 2
        }
    ],
    "NumberOfPoints": 2,
    "StatusTypeID": 50,
    "DateLastStatusUpdate": "2020-07-24T15:40:00Z",
    "DataQualityLevel": 1,
    "DateCreated": "2011-08-25T12:48:00Z",
    "SubmissionStatusTypeID": 100
}