{
    "IsRecentlyVerified": false,
    "ID": 162186,
    "UUID": "E72934BF-6054-4DC1-833A-EBF95323E169",
    "DataProviderID": 1,
    "OperatorID": 3253,
    "UsageTypeID": 1,
    "UsageCost": "paid",
    "AddressInfo": {
        "ID": 162543,
        "Title": "Bahnhof Dornbin",
        "AddressLine1": "Dr.-Anton-Schneider-Straße",
        "AddressLine2": "Markt",
        "Town": "Stadt Dornbirn",
        "StateOrProvince": "Vorarlberg",
        "Postcode": "6850",
        "CountryID": 19,
        "Latitude": 47.417857886850385,
        "Longitude": 9.73982782967812,
        "RelatedURL": "https://oebb.smatrics.com/",
        "DistanceUnit": 0
    },
    "Connections": [
        {
            "ID": 233406,
            "ConnectionTypeID": 25,
            "StatusTypeID": 50,
            "LevelID": 2,
            "Amps": 13,
            "PowerKW": 3.7,
            "CurrentTypeID": 10,
            "Quantity": 1
        },
        {
            "ID": 233407,
            "ConnectionTypeID": 25,
            "StatusTypeID": 50,
            "LevelID": 2,
            "Amps": 16,
            "PowerKW": 11,
            "CurrentTypeID": 20,
            "Quantity": 1
        }
    ],
    "NumberOfPoints": 2,
    "GeneralComments": "Operator: ÖBB Infra (SMATRICS)",
    "StatusTypeID": 50,
    "DateLastStatusUpdate": "2020-08-04T09:33:00Z",
    "DataQualityLevel": 1,
    "DateCreated": "2020-08-02T11:17:00Z",
    "SubmissionStatusTypeID": 200
}