{
    "IsRecentlyVerified": false,
    "ID": 144768,
    "UUID": "937D9D49-F0F8-40FD-A78C-AB46D33FC465",
    "DataProviderID": 2,
    "DataProvidersReference": "147414",
    "OperatorID": 90,
    "UsageTypeID": 1,
    "AddressInfo": {
        "ID": 145120,
        "Title": "Parc Montréal-Est",
        "AddressLine1": "9839 rue Notre-Dame",
        "Town": "Montréal-Est",
        "StateOrProvince": "QC",
        "Postcode": "H1B 2W6",
        "CountryID": 44,
        "Latitude": 45.612501,
        "Longitude": -73.510362,
        "ContactTelephone1": "877-505-2674",
        "AccessComments": "24 hours daily",
        "RelatedURL": "https://lecircuitelectrique.com/",
        "DistanceUnit": 0
    },
    "Connections": [
        {
            "ID": 201296,
            "ConnectionTypeID": 1,
            "LevelID": 2,
            "Amps": 16,
            "Voltage": 230,
            "PowerKW": 3.7,
            "CurrentTypeID": 10,
            "Quantity": 2
        }
    ],
    "StatusTypeID": 50,
    "DateLastStatusUpdate": "2020-06-26T03:09:00Z",
    "DataQualityLevel": 3,
    "DateCreated": "2019-12-24T09:23:00Z",
    "SubmissionStatusTypeID": 100
}