{
    "IsRecentlyVerified": false,
    "ID": 95982,
    "UUID": "EA32D96E-36FC-4353-9DDB-F760BD2A32AC",
    "DataProviderID": 1,
    "OperatorID": 45,
    "UsageTypeID": 6,
    "AddressInfo": {
        "ID": 96328,
        "Title": "Volkswagen Werk Mosel",
        "AddressLine1": "Südstraße",
        "Town": "Zwickau",
        "StateOrProvince": "Landkreis Zwickau",
        "Postcode": "08058",
        "CountryID": 87,
        "Latitude": 50.7863700389528,
        "Longitude": 12.487890550540222,
        "AccessComments": "Auf dem Parkplatz Süd vor der Schranke links und ganz hinter. Einfach einstecken.",
        "DistanceUnit": 0
    },
    "Connections": [
        {
            "ID": 135965,
            "ConnectionTypeID": 25,
            "StatusTypeID": 50,
            "LevelID": 2,
            "Amps": 32,
            "Voltage": 400,
            "PowerKW": 22,
            "CurrentTypeID": 20,
            "Quantity": 16
        }
    ],
    "NumberOfPoints": 16,
    "StatusTypeID": 50,
    "DateLastStatusUpdate": "2017-12-04T11:26:00Z",
    "DataQualityLevel": 1,
    "DateCreated": "2017-12-04T11:26:00Z",
    "SubmissionStatusTypeID": 200
}