{
    "IsRecentlyVerified": false,
    "ID": 126138,
    "UUID": "6043D653-AA5E-436C-851E-993D374F83AD",
    "DataProviderID": 1,
    "OperatorID": 3,
    "OperatorsReference": "PG-90003",
    "UsageTypeID": 6,
    "UsageCost": "1",
    "AddressInfo": {
        "ID": 126484,
        "Title": "Bradstowe House-Basement Car Park",
        "AddressLine1": "Bradstowe House",
        "Postcode": "HA1 1EH",
        "CountryID": 1,
        "Latitude": 51.581189,
        "Longitude": -0.340634,
        "DistanceUnit": 0
    },
    "Connections": [
        {
            "ID": 176784,
            "ConnectionTypeID": 25,
            "StatusTypeID": 50,
            "LevelID": 2,
            "Amps": 32,
            "Voltage": 230,
            "PowerKW": 7,
            "CurrentTypeID": 10,
            "Quantity": 1
        }
    ],
    "NumberOfPoints": 1,
    "GeneralComments": "This is an open charge unit installed at the Bradstowe House building in Headstone Road, Harrow This unit is located in the Basement Level 1 car park",
    "StatusTypeID": 0,
    "DateLastStatusUpdate": "2020-01-18T06:32:00Z",
    "DataQualityLevel": 1,
    "DateCreated": "2019-05-13T12:05:00Z",
    "SubmissionStatusTypeID": 200
}