{
    "IsRecentlyVerified": false,
    "ID": 178933,
    "UUID": "1ACC758A-E649-4873-AA0B-AD527357EB8C",
    "DataProviderID": 29,
    "DataProvidersReference": "2519",
    "OperatorID": 220,
    "AddressInfo": {
        "ID": 179292,
        "Title": "Hermann-Balk-Straße 124",
        "AddressLine1": "Hermann-Balk-Straße 124",
        "Town": "Hamburg",
        "Postcode": "22043",
        "CountryID": 87,
        "Latitude": 53.62558,
        "Longitude": 10.14073,
        "DistanceUnit": 0
    },
    "Connections": [
        {
            "ID": 280006,
            "ConnectionTypeID": 28,
            "StatusTypeID": 50,
            "LevelID": 2,
            "PowerKW": 22,
            "CurrentTypeID": 20
        },
        {
            "ID": 280007,
            "ConnectionTypeID": 25,
            "StatusTypeID": 50,
            "LevelID": 2,
            "PowerKW": 22,
            "CurrentTypeID": 20
        },
        {
            "ID": 302049,
            "ConnectionTypeID": 28,
            "StatusTypeID": 50,
            "LevelID": 2,
            "PowerKW": 22,
            "CurrentTypeID": 20
        },
        {
            "ID": 302050,
            "ConnectionTypeID": 25,
            "StatusTypeID": 50,
            "LevelID": 2,
            "PowerKW": 22,
            "CurrentTypeID": 20
        }
    ],
    "StatusTypeID": 50,
    "DateLastStatusUpdate": "2021-07-12T02:51:00Z",
    "MetadataValues": [
        {
            "ID": 11227,
            "MetadataFieldID": 4,
            "ItemValue": "Data from the German chargepoint registry provided by Bundesnetzagentur.de under the CC-BY 4.0 license"
        }
    ],
    "DataQualityLevel": 3,
    "DateCreated": "2021-07-08T09:59:00Z",
    "SubmissionStatusTypeID": 100
}