{
    "IsRecentlyVerified": false,
    "ID": 174402,
    "UUID": "AB0494C4-4D3B-4D78-8F87-A719F521F877",
    "DataProviderID": 1,
    "OperatorID": 3327,
    "UsageTypeID": 1,
    "UsageCost": "0.42",
    "AddressInfo": {
        "ID": 174761,
        "Title": "Piazza La Piave Nervesa",
        "AddressLine1": "Piazza La Piave",
        "AddressLine2": "",
        "Town": "Nervesa della Battaglia",
        "StateOrProvince": "TV",
        "Postcode": "31040",
        "CountryID": 112,
        "Latitude": 45.82539934029117,
        "Longitude": 12.210139014144147,
        "ContactTelephone1": "02-87119402",
        "RelatedURL": "http://www.bec.energy",
        "DistanceUnit": 0
    },
    "Connections": [
        {
            "ID": 270146,
            "ConnectionTypeID": 25,
            "StatusTypeID": 50,
            "LevelID": 2,
            "PowerKW": 22
        }
    ],
    "NumberOfPoints": 2,
    "StatusTypeID": 50,
    "DateLastStatusUpdate": "2021-03-28T11:32:00Z",
    "DataQualityLevel": 1,
    "DateCreated": "2021-03-28T09:44:00Z",
    "SubmissionStatusTypeID": 200
}