{
    "IsRecentlyVerified": false,
    "ID": 144344,
    "UUID": "B680E3E8-4095-47D7-88E4-5FF600DB51BB",
    "DataProviderID": 2,
    "DataProvidersReference": "143861",
    "UsageTypeID": 1,
    "AddressInfo": {
        "ID": 144696,
        "Title": "Kohl's - Beaverton",
        "AddressLine1": "11055 SW Canyon Rd",
        "Town": "Beaverton",
        "StateOrProvince": "OR",
        "Postcode": "97005",
        "CountryID": 2,
        "Latitude": 45.492637,
        "Longitude": -122.789614,
        "ContactTelephone1": "503-350-0407",
        "AccessComments": "24 hours daily",
        "RelatedURL": "",
        "DistanceUnit": 0
    },
    "Connections": [
        {
            "ID": 200840,
            "ConnectionTypeID": 1,
            "LevelID": 2,
            "Amps": 16,
            "Voltage": 230,
            "PowerKW": 3.7,
            "CurrentTypeID": 10,
            "Quantity": 2
        }
    ],
    "StatusTypeID": 50,
    "DateLastStatusUpdate": "2020-06-26T03:09:00Z",
    "DataQualityLevel": 3,
    "DateCreated": "2019-12-24T09:23:00Z",
    "SubmissionStatusTypeID": 100
}