{
    "UserComments": [
        {
            "ID": 23721,
            "ChargePointID": 141091,
            "CommentTypeID": 50,
            "UserName": "Mark Shane",
            "Comment": "station not found",
            "Rating": 1,
            "DateCreated": "2021-01-02T00:41:15.817Z",
            "User": {
                "ID": 29024,
                "Username": "Mark Shane"
            },
            "CheckinStatusTypeID": 130,
            "IsActionedByEditor": false
        }
    ],
    "IsRecentlyVerified": false,
    "ID": 141091,
    "UUID": "853158CC-1849-4928-95A9-AB97B86FA3CF",
    "DataProviderID": 2,
    "DataProvidersReference": "148489",
    "OperatorID": 39,
    "UsageTypeID": 1,
    "AddressInfo": {
        "ID": 141443,
        "Title": "Perdue East",
        "AddressLine1": "1101 Camden Ave.",
        "Town": "Salisbury",
        "StateOrProvince": "MD",
        "Postcode": "21801",
        "CountryID": 2,
        "Latitude": 38.3444766,
        "Longitude": -75.6058571,
        "ContactTelephone1": "800-663-5633",
        "AccessComments": "MO: 12:00am-12:00am; TU: 12:00am-12:00am; WE: 12:00am-12:00am; TH: 12:00am-12:00am; FR: 12:00am-12:00am; SA: 12:00am-12:00am; SU: 12:00am-12:00am",
        "RelatedURL": "http://www.semacharge.com/",
        "DistanceUnit": 0
    },
    "Connections": [
        {
            "ID": 196916,
            "ConnectionTypeID": 1,
            "LevelID": 2,
            "Amps": 16,
            "Voltage": 230,
            "PowerKW": 3.7,
            "CurrentTypeID": 10,
            "Quantity": 2
        }
    ],
    "StatusTypeID": 50,
    "DateLastStatusUpdate": "2021-01-02T00:41:00Z",
    "DataQualityLevel": 3,
    "DateCreated": "2019-12-24T09:14:00Z",
    "SubmissionStatusTypeID": 100
}