{
    "IsRecentlyVerified": false,
    "ID": 137518,
    "UUID": "A94E4C91-D10A-41F1-8933-2F4005ADB0A7",
    "DataProviderID": 2,
    "DataProvidersReference": "63334",
    "OperatorID": 5,
    "UsageTypeID": 1,
    "AddressInfo": {
        "ID": 137864,
        "Title": "PIE AE",
        "AddressLine1": "5517 Manchaca Rd",
        "Town": "Austin",
        "StateOrProvince": "TX",
        "Postcode": "78745",
        "CountryID": 2,
        "Latitude": 30.215936,
        "Longitude": -97.796703,
        "ContactTelephone1": "888-758-4389",
        "AccessComments": "24 hours daily",
        "RelatedURL": "http://www.chargepoint.com/",
        "DistanceUnit": 0
    },
    "Connections": [
        {
            "ID": 192446,
            "ConnectionTypeID": 1,
            "LevelID": 2,
            "Amps": 16,
            "Voltage": 230,
            "PowerKW": 3,
            "CurrentTypeID": 10,
            "Quantity": 4
        }
    ],
    "StatusTypeID": 50,
    "DateLastStatusUpdate": "2019-12-24T09:05:00Z",
    "DataQualityLevel": 3,
    "DateCreated": "2019-12-24T09:05:00Z",
    "SubmissionStatusTypeID": 100
}