{
    "MediaItems": [
        {
            "ID": 15510,
            "ChargePointID": 33747,
            "ItemURL": "https://s3-ap-southeast-2.amazonaws.com/openchargemap/images/DE/OCM33747/OCM-33747.orig.2018051817571225.jpg",
            "ItemThumbnailURL": "https://s3-ap-southeast-2.amazonaws.com/openchargemap/images/DE/OCM33747/OCM-33747.thmb.2018051817571225.jpg",
            "Comment": "",
            "IsEnabled": true,
            "IsVideo": false,
            "IsFeaturedItem": false,
            "IsExternalResource": false,
            "User": {
                "ID": 18284,
                "Username": "Stromer"
            },
            "DateCreated": "2018-05-18T17:57:00Z"
        }
    ],
    "IsRecentlyVerified": false,
    "ID": 33747,
    "UUID": "F3BC4235-2492-479B-8E77-4C4B479291EA",
    "DataProviderID": 1,
    "OperatorID": 105,
    "OperatorsReference": "Essent EM-DE-05570008-01-00002",
    "UsageTypeID": 4,
    "AddressInfo": {
        "ID": 34093,
        "Title": "Sternstraße 22",
        "AddressLine1": "Sternstraße 22",
        "Town": "Beckum",
        "Postcode": "59269",
        "CountryID": 87,
        "Latitude": 51.756667,
        "Longitude": 8.044444,
        "DistanceUnit": 0
    },
    "Connections": [
        {
            "ID": 37258,
            "ConnectionTypeID": 25,
            "LevelID": 2,
            "PowerKW": 11
        },
        {
            "ID": 46911,
            "ConnectionTypeID": 25,
            "LevelID": 2,
            "PowerKW": 11
        }
    ],
    "NumberOfPoints": 1,
    "StatusTypeID": 50,
    "DateLastStatusUpdate": "2018-05-18T17:57:00Z",
    "DataQualityLevel": 3,
    "DateCreated": "2015-01-09T06:04:00Z",
    "SubmissionStatusTypeID": 200
}