{
    "IsRecentlyVerified": false,
    "ID": 101848,
    "UUID": "4AB10F8B-7CC0-4CCF-946F-DB2FA0CA6645",
    "DataProviderID": 1,
    "OperatorID": 32,
    "OperatorsReference": "10126",
    "UsageTypeID": 4,
    "UsageCost": "Inclusive; for Polar Plus subscription members only",
    "AddressInfo": {
        "ID": 102194,
        "Title": "Cargacoches-Calle Condesa de Venadito",
        "AddressLine1": "Cargacoches-Calle Condesa de Venadito 5A",
        "Town": "Madrid",
        "StateOrProvince": "MADRID",
        "Postcode": "28 027",
        "CountryID": 210,
        "Latitude": 40.444744,
        "Longitude": -3.653601,
        "DistanceUnit": 0
    },
    "Connections": [
        {
            "ID": 143771,
            "ConnectionTypeID": 25,
            "StatusTypeID": 50,
            "LevelID": 2,
            "Amps": 32,
            "Voltage": 230,
            "PowerKW": 7,
            "CurrentTypeID": 10,
            "Quantity": 2
        }
    ],
    "NumberOfPoints": 2,
    "GeneralComments": "To the right of main entrance",
    "StatusTypeID": 50,
    "DateLastStatusUpdate": "2019-12-18T19:13:00Z",
    "DataQualityLevel": 1,
    "DateCreated": "2018-04-12T05:14:00Z",
    "SubmissionStatusTypeID": 200
}