{
    "IsRecentlyVerified": false,
    "ID": 41984,
    "UUID": "D4DA6698-B175-4DCF-91F7-03F02264291B",
    "DataProviderID": 1,
    "OperatorID": 23,
    "OperatorsReference": "7645",
    "UsageTypeID": 1,
    "UsageCost": "$0.22/min >=60kW; $0.11/min <60kW; other tariffs for older cars",
    "AddressInfo": {
        "ID": 42330,
        "Title": "Tourist Information Center - Tesla",
        "AddressLine1": "140 Faith Assembly Church Rd",
        "Town": "London",
        "StateOrProvince": "KY",
        "Postcode": "40741",
        "CountryID": 2,
        "Latitude": 37.14916,
        "Longitude": -84.11385,
        "ContactTelephone1": "877-798-3752",
        "AccessComments": "24 hours daily; for Tesla use only",
        "RelatedURL": "http://www.teslamotors.com/supercharger",
        "DistanceUnit": 0
    },
    "Connections": [
        {
            "ID": 50354,
            "ConnectionTypeID": 27,
            "StatusTypeID": 50,
            "LevelID": 3,
            "Amps": 100,
            "Voltage": 400,
            "PowerKW": 120,
            "CurrentTypeID": 30,
            "Quantity": 6
        }
    ],
    "NumberOfPoints": 6,
    "StatusTypeID": 50,
    "DateLastStatusUpdate": "2018-03-13T08:37:00Z",
    "DataQualityLevel": 3,
    "DateCreated": "2015-02-23T02:09:00Z",
    "SubmissionStatusTypeID": 100
}