{
    "IsRecentlyVerified": false,
    "ID": 100578,
    "UUID": "F55DB5DF-DD6E-4F7A-B2EE-AA7F4B3BA788",
    "DataProviderID": 1,
    "OperatorID": 23,
    "OperatorsReference": "41110",
    "UsageTypeID": 4,
    "AddressInfo": {
        "ID": 100924,
        "Title": "Champion Parking 74 LLC",
        "AddressLine1": "2109 Broadway",
        "Town": "New York",
        "StateOrProvince": "New York",
        "Postcode": "10023",
        "CountryID": 2,
        "Latitude": 40.780027,
        "Longitude": -73.982823,
        "ContactTelephone1": "(212) 874-9315",
        "DistanceUnit": 0
    },
    "Connections": [
        {
            "ID": 142070,
            "ConnectionTypeID": 30,
            "StatusTypeID": 50,
            "LevelID": 2,
            "PowerKW": 13,
            "CurrentTypeID": 20,
            "Quantity": 2
        }
    ],
    "NumberOfPoints": 2,
    "GeneralComments": "2 Tesla Connectors, up to 13kW.Available to the public. Please see valet.",
    "StatusTypeID": 50,
    "DateLastStatusUpdate": "2018-03-02T06:51:00Z",
    "DataQualityLevel": 1,
    "DateCreated": "2018-03-02T06:51:00Z",
    "SubmissionStatusTypeID": 200
}