{
    "IsRecentlyVerified": false,
    "ID": 159261,
    "UUID": "D9F8387D-2980-4887-94EE-3978CC17DFC3",
    "DataProviderID": 2,
    "DataProvidersReference": "152875",
    "OperatorID": 3293,
    "UsageTypeID": 1,
    "AddressInfo": {
        "ID": 159618,
        "Title": "Century Rowland Plaza",
        "AddressLine1": "44 Rowland Way",
        "Town": "Novato",
        "StateOrProvince": "CA",
        "Postcode": "94945",
        "CountryID": 2,
        "Latitude": 38.09467,
        "Longitude": -122.556695,
        "ContactTelephone1": "888-264-2208",
        "AccessComments": "6am-12pm daily",
        "RelatedURL": "https://voltacharging.com/",
        "DistanceUnit": 0
    },
    "Connections": [
        {
            "ID": 229397,
            "ConnectionTypeID": 1,
            "LevelID": 2,
            "Amps": 16,
            "Voltage": 230,
            "PowerKW": 3.7,
            "CurrentTypeID": 10,
            "Quantity": 2
        }
    ],
    "StatusTypeID": 50,
    "DateLastStatusUpdate": "2020-06-26T02:59:00Z",
    "DataQualityLevel": 3,
    "DateCreated": "2020-06-26T02:59:00Z",
    "SubmissionStatusTypeID": 100
}