{
    "IsRecentlyVerified": false,
    "ID": 138504,
    "UUID": "FAE2EB53-F33B-4D53-AECE-8DD0BF887699",
    "DataProviderID": 2,
    "DataProvidersReference": "149448",
    "OperatorID": 5,
    "UsageTypeID": 1,
    "AddressInfo": {
        "ID": 138853,
        "Title": "CREEKSIDE",
        "AddressLine1": "5401 E Parmer Ln",
        "Town": "Austin",
        "StateOrProvince": "TX",
        "Postcode": "78653",
        "CountryID": 2,
        "Latitude": 30.369535,
        "Longitude": -97.61957,
        "ContactTelephone1": "888-758-4389",
        "AccessComments": "24 hours daily",
        "RelatedURL": "http://www.chargepoint.com/",
        "DistanceUnit": 0
    },
    "Connections": [
        {
            "ID": 193634,
            "ConnectionTypeID": 1,
            "LevelID": 2,
            "Amps": 16,
            "Voltage": 230,
            "PowerKW": 3.7,
            "CurrentTypeID": 10,
            "Quantity": 2
        }
    ],
    "StatusTypeID": 50,
    "DateLastStatusUpdate": "2020-06-26T02:54:00Z",
    "DataQualityLevel": 3,
    "DateCreated": "2019-12-24T09:09:00Z",
    "SubmissionStatusTypeID": 100
}