{
    "IsRecentlyVerified": false,
    "ID": 138922,
    "UUID": "CCF506EB-1A1B-43D3-AB86-553F821F31BF",
    "DataProviderID": 2,
    "DataProvidersReference": "95795",
    "OperatorID": 9,
    "UsageTypeID": 1,
    "AddressInfo": {
        "ID": 139274,
        "Title": "SKLZ Faraday",
        "AddressLine1": "2081 Faraday",
        "Town": "Carlsbad",
        "StateOrProvince": "CA",
        "Postcode": "92008",
        "CountryID": 2,
        "Latitude": 33.134628,
        "Longitude": -117.285867,
        "ContactTelephone1": "888-998-2546",
        "AccessComments": "MON: 24 hours | TUE: 24 hours | WED: 24 hours | THU: 24 hours | FRI: 24 hours | SAT: 24 hours | SUN: 24 hours",
        "RelatedURL": "http://www.blinkcharging.com/",
        "DistanceUnit": 0
    },
    "Connections": [
        {
            "ID": 194153,
            "ConnectionTypeID": 1,
            "LevelID": 2,
            "Amps": 16,
            "Voltage": 230,
            "PowerKW": 3.7,
            "CurrentTypeID": 10,
            "Quantity": 1
        }
    ],
    "StatusTypeID": 50,
    "DateLastStatusUpdate": "2020-06-26T02:55:00Z",
    "DataQualityLevel": 3,
    "DateCreated": "2019-12-24T09:09:00Z",
    "SubmissionStatusTypeID": 100
}