{
    "IsRecentlyVerified": false,
    "ID": 18022,
    "UUID": "DD90B66C-390F-41D0-BC84-4C65729D8813",
    "DataProviderID": 22,
    "DataProvidersReference": "FB6A4114C5D63FC0BE8286359AFF72CE",
    "AddressInfo": {
        "ID": 18367,
        "Title": "高知三菱高知本店・クリーンカー御座",
        "AddressLine1": "高知県高知市北御座4-6",
        "CountryID": 114,
        "Latitude": 33.56983599,
        "Longitude": 133.5613392,
        "ContactTelephone1": "088-882-9333",
        "DistanceUnit": 0
    },
    "Connections": [
        {
            "ID": 18263,
            "ConnectionTypeID": 2,
            "LevelID": 2,
            "Amps": 100,
            "Voltage": 480,
            "PowerKW": 48,
            "Quantity": 1
        }
    ],
    "DateLastStatusUpdate": "2013-06-29T09:06:00Z",
    "DataQualityLevel": 2,
    "DateCreated": "2013-06-29T09:06:00Z",
    "SubmissionStatusTypeID": 200
}