{
    "IsRecentlyVerified": false,
    "ID": 28097,
    "UUID": "36400E6F-1A10-4FCD-B376-6D9FEE860A01",
    "DataProviderID": 2,
    "DataProvidersReference": "60201",
    "UsageTypeID": 1,
    "AddressInfo": {
        "ID": 28443,
        "Title": "Reno Tahoe International Airport",
        "AddressLine1": "2001 E Plumb Ln",
        "Town": "Reno",
        "StateOrProvince": "NV",
        "Postcode": "89502",
        "CountryID": 2,
        "Latitude": 39.505896,
        "Longitude": -119.774704,
        "ContactTelephone1": "775-328-6400",
        "AccessComments": "24 hours daily; pay lot",
        "RelatedURL": "",
        "DistanceUnit": 0
    },
    "Connections": [
        {
            "ID": 30878,
            "ConnectionTypeID": 9,
            "LevelID": 1,
            "Amps": 16,
            "Voltage": 120,
            "PowerKW": 1,
            "CurrentTypeID": 10,
            "Quantity": 2
        }
    ],
    "DateLastStatusUpdate": "2019-04-06T04:03:00Z",
    "DataQualityLevel": 3,
    "DateCreated": "2014-11-28T03:38:00Z",
    "SubmissionStatusTypeID": 100
}