{
    "IsRecentlyVerified": false,
    "ID": 41131,
    "UUID": "84733655-E003-47BA-93D9-BFCD02F5549E",
    "DataProviderID": 2,
    "DataProvidersReference": "65361",
    "OperatorID": 5,
    "UsageTypeID": 1,
    "AddressInfo": {
        "ID": 41477,
        "Title": "ELK GROVE VW",
        "AddressLine1": "9776 W Stockton Blvd",
        "Town": "Elk Grove",
        "StateOrProvince": "CA",
        "Postcode": "95757",
        "CountryID": 2,
        "Latitude": 38.4044444,
        "Longitude": -121.3863889,
        "ContactTelephone1": "888-758-4389",
        "AccessComments": "24 hours daily",
        "RelatedURL": "http://www.chargepoint.com/",
        "DistanceUnit": 0
    },
    "Connections": [
        {
            "ID": 44908,
            "ConnectionTypeID": 1,
            "LevelID": 2,
            "Amps": 16,
            "Voltage": 230,
            "PowerKW": 3,
            "CurrentTypeID": 10,
            "Quantity": 2
        }
    ],
    "DateLastStatusUpdate": "2019-12-24T09:14:00Z",
    "DataQualityLevel": 3,
    "DateCreated": "2015-01-27T05:18:00Z",
    "SubmissionStatusTypeID": 100
}