{
    "IsRecentlyVerified": false,
    "ID": 32089,
    "UUID": "FF77711A-B2D7-4670-BA86-703B1A47A038",
    "DataProviderID": 1,
    "OperatorID": 105,
    "OperatorsReference": "Essent EM-DE-06436005-01-00001",
    "UsageTypeID": 4,
    "AddressInfo": {
        "ID": 32435,
        "Title": "Rathausstraße 3",
        "AddressLine1": "Rathausstraße 3",
        "Town": "Hattersheim am Main",
        "Postcode": "65795",
        "CountryID": 87,
        "Latitude": 50.068436,
        "Longitude": 8.486863,
        "DistanceUnit": 0
    },
    "Connections": [
        {
            "ID": 35600,
            "ConnectionTypeID": 25,
            "LevelID": 2,
            "PowerKW": 11
        },
        {
            "ID": 46190,
            "ConnectionTypeID": 25,
            "LevelID": 2,
            "PowerKW": 11
        }
    ],
    "NumberOfPoints": 1,
    "StatusTypeID": 50,
    "DateLastStatusUpdate": "2015-04-13T16:49:00Z",
    "DataQualityLevel": 3,
    "DateCreated": "2015-01-09T06:03:00Z",
    "SubmissionStatusTypeID": 200
}