{
    "IsRecentlyVerified": false,
    "ID": 159056,
    "UUID": "7D8FFF4C-ACA9-4AC3-BA60-07707129BEB0",
    "DataProviderID": 2,
    "DataProvidersReference": "154064",
    "OperatorID": 5,
    "UsageTypeID": 1,
    "AddressInfo": {
        "ID": 159413,
        "Title": "SPG",
        "AddressLine1": "9921 Horizon Overlook Rd",
        "Town": "Raleigh",
        "StateOrProvince": "NC",
        "Postcode": "27617",
        "CountryID": 2,
        "Latitude": 35.8964545,
        "Longitude": -78.8053182,
        "ContactTelephone1": "888-758-4389",
        "AccessComments": "24 hours daily",
        "RelatedURL": "http://www.chargepoint.com/",
        "DistanceUnit": 0
    },
    "Connections": [
        {
            "ID": 229129,
            "ConnectionTypeID": 1,
            "LevelID": 2,
            "Amps": 16,
            "Voltage": 230,
            "PowerKW": 3.7,
            "CurrentTypeID": 10,
            "Quantity": 2
        }
    ],
    "StatusTypeID": 50,
    "DateLastStatusUpdate": "2020-06-26T02:58:00Z",
    "DataQualityLevel": 3,
    "DateCreated": "2020-06-26T02:58:00Z",
    "SubmissionStatusTypeID": 100
}