{
    "IsRecentlyVerified": false,
    "ID": 113860,
    "UUID": "025C9935-5EC3-4084-B382-5B7F8645A96D",
    "DataProviderID": 1,
    "OperatorID": 23,
    "OperatorsReference": "47353",
    "UsageTypeID": 4,
    "AddressInfo": {
        "ID": 114206,
        "Title": "The Belfry Hotel & Resort",
        "AddressLine1": "Lichfield Road",
        "Town": "Sutton Coldfield",
        "Postcode": "B76 9PR",
        "CountryID": 1,
        "Latitude": 52.554266,
        "Longitude": -1.731653,
        "ContactTelephone1": " +44 167 523 8600",
        "DistanceUnit": 0
    },
    "Connections": [
        {
            "ID": 160430,
            "ConnectionTypeID": 30,
            "StatusTypeID": 50,
            "LevelID": 2,
            "Amps": 16,
            "Voltage": 400,
            "PowerKW": 11,
            "CurrentTypeID": 20,
            "Quantity": 2
        }
    ],
    "NumberOfPoints": 2,
    "GeneralComments": "2 Tesla Connectors, up to 11kW.Available to the public. Please see front desk.",
    "StatusTypeID": 50,
    "DateLastStatusUpdate": "2019-01-02T21:47:00Z",
    "DataQualityLevel": 1,
    "DateCreated": "2019-01-02T21:47:00Z",
    "SubmissionStatusTypeID": 200
}