{
    "IsRecentlyVerified": false,
    "ID": 155023,
    "UUID": "68C4B10E-D2EE-407B-85B3-195DE387BCF8",
    "DataProviderID": 1,
    "OperatorID": 3369,
    "UsageTypeID": 4,
    "UsageCost": "7,89€/session",
    "AddressInfo": {
        "ID": 155377,
        "Title": "Telekom am Telemax",
        "AddressLine1": "Neue-Land-Straße 6",
        "Town": "Hanover",
        "StateOrProvince": "Region Hannover",
        "Postcode": "30655",
        "CountryID": 87,
        "Latitude": 52.39326544074174,
        "Longitude": 9.801830179145782,
        "ContactTelephone1": "+49 800 6660044",
        "AccessComments": "24/7 nutzbare magentafarbene Ladesäulen auf dem Telekom Werksgelände. Freischaltung mit Get Charge, EinfachStromLaden, NewMotion oder EnBW. Parken kostenlos.",
        "RelatedURL": "http://www.comfortcharge.de/",
        "DistanceUnit": 0
    },
    "Connections": [
        {
            "ID": 218203,
            "ConnectionTypeID": 25,
            "StatusTypeID": 50,
            "LevelID": 2,
            "Amps": 16,
            "Voltage": 400,
            "PowerKW": 11,
            "CurrentTypeID": 20,
            "Quantity": 6
        }
    ],
    "NumberOfPoints": 3,
    "StatusTypeID": 50,
    "DateLastStatusUpdate": "2020-03-24T20:24:00Z",
    "DataQualityLevel": 1,
    "DateCreated": "2020-03-24T20:24:00Z",
    "SubmissionStatusTypeID": 200
}