{
    "IsRecentlyVerified": false,
    "ID": 88351,
    "UUID": "2C91CAA2-2098-4C61-A192-812B2E350A5E",
    "DataProviderID": 1,
    "OperatorID": 23,
    "OperatorsReference": "30036",
    "UsageTypeID": 6,
    "AddressInfo": {
        "ID": 88697,
        "Title": "Hôtel Acotel Logis",
        "AddressLine1": "218 Avenue de St Tronquet",
        "Town": "Le Pontet",
        "Postcode": "84130",
        "CountryID": 80,
        "Latitude": 43.979372,
        "Longitude": 4.87454,
        "ContactTelephone1": "+33 4 90 03 69 50",
        "DistanceUnit": 0
    },
    "Connections": [
        {
            "ID": 125319,
            "ConnectionTypeID": 30,
            "StatusTypeID": 50,
            "LevelID": 2,
            "Amps": 32,
            "Voltage": 230,
            "PowerKW": 14,
            "CurrentTypeID": 20,
            "Quantity": 2
        }
    ],
    "NumberOfPoints": 2,
    "GeneralComments": "2 Tesla Connectors, up to 14kW.Available for patrons only. Please see front desk.",
    "StatusTypeID": 50,
    "DateLastStatusUpdate": "2018-10-03T20:47:00Z",
    "DataQualityLevel": 1,
    "DateCreated": "2017-05-29T05:40:00Z",
    "SubmissionStatusTypeID": 200
}