{
    "IsRecentlyVerified": false,
    "ID": 162733,
    "UUID": "2F495155-26E9-435F-9941-8CA3EA06C87B",
    "DataProviderID": 1,
    "OperatorID": 3353,
    "UsageTypeID": 4,
    "UsageCost": "0,11€/kWh",
    "AddressInfo": {
        "ID": 163090,
        "Title": "Aalto-yliopisto Dipoli",
        "AddressLine1": "Otakaari 24",
        "Town": "Espoo",
        "StateOrProvince": "Southern Finland",
        "Postcode": "02150",
        "CountryID": 79,
        "Latitude": 60.184473069779386,
        "Longitude": 24.83231062674804,
        "RelatedURL": "http://www.plugitcloud.com",
        "DistanceUnit": 0
    },
    "Connections": [
        {
            "ID": 234244,
            "ConnectionTypeID": 25,
            "StatusTypeID": 50,
            "LevelID": 2,
            "Amps": 16,
            "Voltage": 400,
            "PowerKW": 11,
            "CurrentTypeID": 20,
            "Quantity": 4
        }
    ],
    "NumberOfPoints": 4,
    "StatusTypeID": 50,
    "DateLastStatusUpdate": "2020-08-15T09:57:00Z",
    "DataQualityLevel": 1,
    "DateCreated": "2020-08-15T07:09:00Z",
    "SubmissionStatusTypeID": 200
}