{
    "IsRecentlyVerified": false,
    "ID": 62457,
    "UUID": "06ED3020-31F5-4731-BA9E-0833A5417653",
    "DataProviderID": 1,
    "OperatorID": 23,
    "OperatorsReference": "13141",
    "UsageTypeID": 1,
    "UsageCost": "Free",
    "AddressInfo": {
        "ID": 62803,
        "Title": "Best Western - Tesla",
        "AddressLine1": "1400 8th Ave NW",
        "Town": "Aberdeen",
        "StateOrProvince": "SD",
        "Postcode": "57401",
        "CountryID": 2,
        "Latitude": 45.4748662,
        "Longitude": -98.5091811,
        "ContactTelephone1": "605-229-4040  877-798-3752",
        "AccessComments": "24 hours daily; for Tesla use only; see front desk for access",
        "RelatedURL": "http://www.teslamotors.com/supercharger",
        "DistanceUnit": 0
    },
    "Connections": [
        {
            "ID": 79363,
            "ConnectionTypeID": 30,
            "StatusTypeID": 50,
            "LevelID": 2,
            "Amps": 16,
            "Voltage": 230,
            "PowerKW": 16,
            "CurrentTypeID": 10,
            "Quantity": 2
        }
    ],
    "NumberOfPoints": 2,
    "StatusTypeID": 50,
    "DateLastStatusUpdate": "2017-01-31T19:51:00Z",
    "DataQualityLevel": 3,
    "DateCreated": "2016-03-03T11:39:00Z",
    "SubmissionStatusTypeID": 100
}