{
    "IsRecentlyVerified": false,
    "ID": 20999,
    "UUID": "CCD06733-B83F-4F63-BDF6-EF4ADCCFEB6B",
    "DataProviderID": 2,
    "DataProvidersReference": "57838",
    "OperatorID": 5,
    "UsageTypeID": 1,
    "AddressInfo": {
        "ID": 21344,
        "Title": "GARDNERVILLE",
        "AddressLine1": "1214-1238 Eddy St",
        "Town": "Gardnerville",
        "StateOrProvince": "NV",
        "Postcode": "89410",
        "CountryID": 2,
        "Latitude": 38.9410246,
        "Longitude": -119.7480801,
        "ContactTelephone1": "888-758-4389",
        "AccessComments": "24 hours daily",
        "RelatedURL": "http://www.chargepoint.com/",
        "DistanceUnit": 0
    },
    "Connections": [
        {
            "ID": 22864,
            "ConnectionTypeID": 1,
            "LevelID": 2,
            "Amps": 16,
            "Voltage": 230,
            "PowerKW": 3,
            "CurrentTypeID": 10,
            "Quantity": 2
        }
    ],
    "DateLastStatusUpdate": "2019-04-06T04:03:00Z",
    "DataQualityLevel": 3,
    "DateCreated": "2014-02-06T04:57:00Z",
    "SubmissionStatusTypeID": 100
}