{
    "IsRecentlyVerified": false,
    "ID": 90734,
    "UUID": "D1067EB6-4B6E-43DA-8A66-45440932A073",
    "DataProviderID": 1,
    "OperatorID": 23,
    "OperatorsReference": "32070",
    "UsageTypeID": 4,
    "AddressInfo": {
        "ID": 91080,
        "Title": "Best Western Plus Floresville",
        "AddressLine1": "1720 10th St",
        "Town": "Floresville",
        "StateOrProvince": "Texas",
        "Postcode": "78114",
        "CountryID": 2,
        "Latitude": 29.13582,
        "Longitude": -98.146748,
        "ContactTelephone1": "(830) 393-0443",
        "DistanceUnit": 0
    },
    "Connections": [
        {
            "ID": 128457,
            "ConnectionTypeID": 30,
            "StatusTypeID": 50,
            "LevelID": 2,
            "PowerKW": 16,
            "CurrentTypeID": 20,
            "Quantity": 2
        }
    ],
    "NumberOfPoints": 2,
    "GeneralComments": "2 Tesla Connectors, up to 16kW.Available for customers. Please see front desk.",
    "StatusTypeID": 50,
    "DateLastStatusUpdate": "2017-07-22T05:40:00Z",
    "DataQualityLevel": 1,
    "DateCreated": "2017-07-22T05:40:00Z",
    "SubmissionStatusTypeID": 200
}