{
    "UserComments": [
        {
            "ID": 16207,
            "ChargePointID": 40707,
            "CommentTypeID": 10,
            "UserName": "ribs99",
            "Rating": 5,
            "DateCreated": "2017-04-13T11:40:41.537Z",
            "User": {
                "ID": 13908,
                "Username": "ribs99"
            },
            "CheckinStatusTypeID": 10
        },
        {
            "ID": 14087,
            "ChargePointID": 40707,
            "CommentTypeID": 10,
            "UserName": "Torsten",
            "Comment": "",
            "Rating": 4,
            "DateCreated": "2016-08-16T15:11:25.697Z",
            "User": {
                "ID": 4992,
                "Username": "Torsten"
            },
            "CheckinStatusTypeID": 10
        },
        {
            "ID": 10209,
            "ChargePointID": 40707,
            "CommentTypeID": 10,
            "UserName": "Robert Sharpe",
            "Comment": "Charged ok",
            "Rating": 5,
            "DateCreated": "2016-04-18T14:23:48.157Z",
            "User": {
                "ID": 9254,
                "Username": "Robert Sharpe"
            },
            "CheckinStatusTypeID": 10
        },
        {
            "ID": 4297,
            "ChargePointID": 40707,
            "CommentTypeID": 10,
            "UserName": "zoe",
            "Comment": "Zoe only charged at 22kw, but still charged as if high speed.  Also pushed STOP at 14:55 but then got message to swipe card before pushing stop - got charged extra 25p !",
            "Rating": 4,
            "DateCreated": "2015-04-24T21:19:46.52Z",
            "User": {
                "ID": 4783,
                "Username": "zoe"
            },
            "CheckinStatusTypeID": 10
        },
        {
            "ID": 4023,
            "ChargePointID": 40707,
            "CommentTypeID": 10,
            "UserName": "deadboyfriend",
            "Comment": "Charged ok this morning, quick 10% to make sure I got to parent evening after work",
            "DateCreated": "2015-03-18T09:25:21.55Z",
            "User": {
                "ID": 4482,
                "Username": "deadboyfriend"
            },
            "CheckinStatusTypeID": 10
        },
        {
            "ID": 3951,
            "ChargePointID": 40707,
            "CommentTypeID": 10,
            "UserName": "snfosberry",
            "Comment": "Convinient but expensive. Charged for 16 mins from 30% SoC and added 7.06kWh to leaf 1 at a cost of £4.50. Over £0.60p per kWh. ",
            "Rating": 3,
            "DateCreated": "2015-03-08T15:19:49.56Z",
            "User": {
                "ID": 1059,
                "Username": "snfosberry"
            },
            "CheckinStatusTypeID": 10
        },
        {
            "ID": 3922,
            "ChargePointID": 40707,
            "CommentTypeID": 10,
            "UserName": "deadboyfriend",
            "Comment": "DC and AC sides of the charger both working now. Sat charging my leaf as I write this.\n",
            "Rating": 4,
            "DateCreated": "2015-03-04T18:17:25.777Z",
            "User": {
                "ID": 4482,
                "Username": "deadboyfriend"
            },
            "CheckinStatusTypeID": 10
        },
        {
            "ID": 3790,
            "ChargePointID": 40707,
            "CommentTypeID": 10,
            "UserName": "deadboyfriend",
            "Comment": "The AC side is working. DC side still shows error and has been like this for weeks now.",
            "Rating": 1,
            "DateCreated": "2015-02-16T18:52:50.267Z",
            "User": {
                "ID": 4482,
                "Username": "deadboyfriend"
            },
            "CheckinStatusTypeID": 20
        },
        {
            "ID": 3748,
            "ChargePointID": 40707,
            "CommentTypeID": 1000,
            "UserName": "snfosberry",
            "Comment": "Unit down with CCS error. Reported to chargepoint services.",
            "DateCreated": "2015-02-11T14:01:46.123Z",
            "User": {
                "ID": 1059,
                "Username": "snfosberry"
            },
            "CheckinStatusTypeID": 20
        },
        {
            "ID": 3618,
            "ChargePointID": 40707,
            "CommentTypeID": 10,
            "UserName": "deadboyfriend",
            "Comment": "Putting cost to one side. The location of this charger is very good and the charger itself is very easy to use, much easier than the ecotricity.\n\nNote to people using the app, some time you need to start the charge session twice from your phone. 1st time after a minute if it's not started (you'll hear the fans in the charger start if it does) then just do it again. If not, phone the tech support helpline and they'll remote start.",
            "Rating": 5,
            "DateCreated": "2015-01-20T09:35:58.44Z",
            "User": {
                "ID": 4482,
                "Username": "deadboyfriend"
            },
            "CheckinStatusTypeID": 10
        }
    ],
    "MediaItems": [
        {
            "ID": 1242,
            "ChargePointID": 40707,
            "ItemURL": "https://s3-ap-southeast-2.amazonaws.com/openchargemap/images/GB/OCM40707/OCM-40707.orig.2015042421161298.jpg",
            "ItemThumbnailURL": "https://s3-ap-southeast-2.amazonaws.com/openchargemap/images/GB/OCM40707/OCM-40707.thmb.2015042421161298.jpg",
            "Comment": "",
            "IsEnabled": true,
            "IsVideo": false,
            "IsFeaturedItem": false,
            "IsExternalResource": false,
            "User": {
                "ID": 4783,
                "Username": "zoe"
            },
            "DateCreated": "2015-04-24T21:16:00Z"
        },
        {
            "ID": 987,
            "ChargePointID": 40707,
            "ItemURL": "https://s3-ap-southeast-2.amazonaws.com/openchargemap/images/GB/OCM40707/OCM-40707.orig.2015021113570476.jpg",
            "ItemThumbnailURL": "https://s3-ap-southeast-2.amazonaws.com/openchargemap/images/GB/OCM40707/OCM-40707.thmb.2015021113570476.jpg",
            "Comment": "Unit is down with CCS error. Reported.",
            "IsEnabled": true,
            "IsVideo": false,
            "IsFeaturedItem": false,
            "IsExternalResource": false,
            "User": {
                "ID": 1059,
                "Username": "snfosberry"
            },
            "DateCreated": "2015-02-11T13:57:00Z"
        },
        {
            "ID": 933,
            "ChargePointID": 40707,
            "ItemURL": "https://s3-ap-southeast-2.amazonaws.com/openchargemap/images/GB/OCM40707/OCM-40707.orig.2015012020562896.jpg",
            "ItemThumbnailURL": "https://s3-ap-southeast-2.amazonaws.com/openchargemap/images/GB/OCM40707/OCM-40707.thmb.2015012020562896.jpg",
            "Comment": "",
            "IsEnabled": true,
            "IsVideo": false,
            "IsFeaturedItem": false,
            "IsExternalResource": false,
            "User": {
                "ID": 4482,
                "Username": "deadboyfriend"
            },
            "DateCreated": "2015-01-20T20:57:00Z"
        },
        {
            "ID": 928,
            "ChargePointID": 40707,
            "ItemURL": "https://s3-ap-southeast-2.amazonaws.com/openchargemap/images/GB/OCM40707/OCM-40707.orig.2015012009444054.jpg",
            "ItemThumbnailURL": "https://s3-ap-southeast-2.amazonaws.com/openchargemap/images/GB/OCM40707/OCM-40707.thmb.2015012009444054.jpg",
            "Comment": "",
            "IsEnabled": true,
            "IsVideo": false,
            "IsFeaturedItem": false,
            "IsExternalResource": false,
            "User": {
                "ID": 4482,
                "Username": "deadboyfriend"
            },
            "DateCreated": "2015-01-20T09:45:00Z"
        },
        {
            "ID": 927,
            "ChargePointID": 40707,
            "ItemURL": "https://s3-ap-southeast-2.amazonaws.com/openchargemap/images/GB/OCM40707/OCM-40707.orig.2015012009440153.jpg",
            "ItemThumbnailURL": "https://s3-ap-southeast-2.amazonaws.com/openchargemap/images/GB/OCM40707/OCM-40707.thmb.2015012009440153.jpg",
            "Comment": "",
            "IsEnabled": true,
            "IsVideo": false,
            "IsFeaturedItem": false,
            "IsExternalResource": false,
            "User": {
                "ID": 4482,
                "Username": "deadboyfriend"
            },
            "DateCreated": "2015-01-20T09:44:00Z"
        },
        {
            "ID": 925,
            "ChargePointID": 40707,
            "ItemURL": "https://s3-ap-southeast-2.amazonaws.com/openchargemap/images/GB/OCM40707/OCM-40707.orig.2015012009413500.jpg",
            "ItemThumbnailURL": "https://s3-ap-southeast-2.amazonaws.com/openchargemap/images/GB/OCM40707/OCM-40707.thmb.2015012009413500.jpg",
            "Comment": "",
            "IsEnabled": true,
            "IsVideo": false,
            "IsFeaturedItem": false,
            "IsExternalResource": false,
            "User": {
                "ID": 4482,
                "Username": "deadboyfriend"
            },
            "DateCreated": "2015-01-20T09:42:00Z"
        },
        {
            "ID": 926,
            "ChargePointID": 40707,
            "ItemURL": "https://s3-ap-southeast-2.amazonaws.com/openchargemap/images/GB/OCM40707/OCM-40707.orig.2015012009420075.jpg",
            "ItemThumbnailURL": "https://s3-ap-southeast-2.amazonaws.com/openchargemap/images/GB/OCM40707/OCM-40707.thmb.2015012009420075.jpg",
            "Comment": "",
            "IsEnabled": true,
            "IsVideo": false,
            "IsFeaturedItem": false,
            "IsExternalResource": false,
            "User": {
                "ID": 4482,
                "Username": "deadboyfriend"
            },
            "DateCreated": "2015-01-20T09:42:00Z"
        },
        {
            "ID": 924,
            "ChargePointID": 40707,
            "ItemURL": "https://s3-ap-southeast-2.amazonaws.com/openchargemap/images/GB/OCM40707/OCM-40707.orig.2015012009395982.jpg",
            "ItemThumbnailURL": "https://s3-ap-southeast-2.amazonaws.com/openchargemap/images/GB/OCM40707/OCM-40707.thmb.2015012009395982.jpg",
            "Comment": "",
            "IsEnabled": true,
            "IsVideo": false,
            "IsFeaturedItem": false,
            "IsExternalResource": false,
            "User": {
                "ID": 4482,
                "Username": "deadboyfriend"
            },
            "DateCreated": "2015-01-20T09:40:00Z"
        },
        {
            "ID": 923,
            "ChargePointID": 40707,
            "ItemURL": "https://s3-ap-southeast-2.amazonaws.com/openchargemap/images/GB/OCM40707/OCM-40707.orig.2015012009375375.jpg",
            "ItemThumbnailURL": "https://s3-ap-southeast-2.amazonaws.com/openchargemap/images/GB/OCM40707/OCM-40707.thmb.2015012009375375.jpg",
            "Comment": "",
            "IsEnabled": true,
            "IsVideo": false,
            "IsFeaturedItem": false,
            "IsExternalResource": false,
            "User": {
                "ID": 4482,
                "Username": "deadboyfriend"
            },
            "DateCreated": "2015-01-20T09:38:00Z"
        }
    ],
    "IsRecentlyVerified": false,
    "ID": 40707,
    "UUID": "D24AC591-D36D-4E11-97F2-23B7A3B1424C",
    "DataProviderID": 1,
    "OperatorID": 150,
    "OperatorsReference": "Fareham Council Car Park, Fareham - SSE,Fareham Council Car Park, Fareham - SSE",
    "UsageTypeID": 4,
    "UsageCost": "Â£1.00 + Â£0.30/kWh; Â£10.00 overstay after 65 mins",
    "AddressInfo": {
        "ID": 41053,
        "Title": "SSE Fareham Council Car Park",
        "AddressLine1": "Civic Way",
        "Town": "Fareham",
        "StateOrProvince": "Hampshire ",
        "Postcode": "PO16 7AZ",
        "CountryID": 1,
        "Latitude": 50.8548415634885,
        "Longitude": -1.17414583355595,
        "ContactTelephone1": "+44(0)20 3598 4087",
        "ContactEmail": "GenieSupport@chargepointservices.com",
        "AccessComments": "As you enter Civic Way, the charger is immediately on the right.",
        "RelatedURL": "https://www.geniepoint.co.uk/ds",
        "DistanceUnit": 0
    },
    "Connections": [
        {
            "ID": 44298,
            "ConnectionTypeID": 2,
            "StatusTypeID": 0,
            "LevelID": 3,
            "PowerKW": 50,
            "CurrentTypeID": 30,
            "Quantity": 1
        },
        {
            "ID": 44299,
            "ConnectionTypeID": 33,
            "StatusTypeID": 0,
            "LevelID": 3,
            "PowerKW": 50,
            "CurrentTypeID": 30,
            "Quantity": 1
        },
        {
            "ID": 44300,
            "ConnectionTypeID": 1036,
            "StatusTypeID": 0,
            "LevelID": 3,
            "Voltage": 400,
            "PowerKW": 43,
            "CurrentTypeID": 20,
            "Quantity": 1
        }
    ],
    "NumberOfPoints": 2,
    "GeneralComments": ".",
    "StatusTypeID": 50,
    "DateLastStatusUpdate": "2020-10-07T14:44:00Z",
    "DataQualityLevel": 1,
    "DateCreated": "2015-01-10T10:56:00Z",
    "SubmissionStatusTypeID": 200
}