{
    "IsRecentlyVerified": false,
    "ID": 38337,
    "UUID": "129A958B-A1FC-4786-9053-2EC71D9662D6",
    "DataProviderID": 26,
    "DataProvidersReference": "31615",
    "OperatorID": 157,
    "OperatorsReference": "NewMotion 02006496",
    "UsageCost": "0.00 jaarabonnement",
    "AddressInfo": {
        "ID": 38683,
        "Title": "Soldaatweg 6",
        "AddressLine1": "Soldaatweg 6",
        "Town": "Zaanstad",
        "Postcode": "1521 RL",
        "CountryID": 159,
        "Latitude": 52.5079040527344,
        "Longitude": 4.78256940841675,
        "ContactTelephone1": "088 0109500",
        "RelatedURL": "http://thenewmotion.nl/",
        "DistanceUnit": 0
    },
    "Connections": [
        {
            "ID": 41848,
            "ConnectionTypeID": 25,
            "LevelID": 2,
            "PowerKW": 3.7,
            "CurrentTypeID": 10
        },
        {
            "ID": 49592,
            "ConnectionTypeID": 25,
            "LevelID": 2,
            "PowerKW": 3.7,
            "CurrentTypeID": 10
        }
    ],
    "NumberOfPoints": 1,
    "StatusTypeID": 50,
    "DateLastStatusUpdate": "2016-06-04T02:54:00Z",
    "DataQualityLevel": 3,
    "DateCreated": "2015-01-09T06:07:00Z",
    "SubmissionStatusTypeID": 100
}