{
    "IsRecentlyVerified": false,
    "ID": 39239,
    "UUID": "778D7269-AA10-4E7E-B5FB-99F2873893BD",
    "DataProviderID": 1,
    "OperatorID": 156,
    "OperatorsReference": "NewMotion 02010151",
    "UsageTypeID": 4,
    "UsageCost": "",
    "AddressInfo": {
        "ID": 39585,
        "Title": "Autohaus Grimmen",
        "AddressLine1": "An der Bollenkoppel",
        "AddressLine2": "",
        "Town": "Grimmen",
        "StateOrProvince": "",
        "Postcode": "18507",
        "CountryID": 87,
        "Latitude": 54.1269950866699,
        "Longitude": 13.0418243408203,
        "ContactTelephone1": "+49 38326 6080",
        "ContactTelephone2": "",
        "ContactEmail": "",
        "AccessComments": "",
        "RelatedURL": "http://www.autohaus-grimmen.de/",
        "DistanceUnit": 0
    },
    "Connections": [
        {
            "ID": 42750,
            "ConnectionTypeID": 25,
            "StatusTypeID": 50,
            "LevelID": 2,
            "Amps": 16,
            "Voltage": 230,
            "PowerKW": 3.7,
            "CurrentTypeID": 10,
            "Quantity": 1
        }
    ],
    "NumberOfPoints": 1,
    "GeneralComments": "",
    "StatusTypeID": 50,
    "DateLastStatusUpdate": "2015-06-11T07:10:00Z",
    "DataQualityLevel": 3,
    "DateCreated": "2015-01-09T06:08:00Z",
    "SubmissionStatusTypeID": 200
}