{
    "IsRecentlyVerified": false,
    "ID": 100471,
    "UUID": "2FEF5654-B172-4225-8A74-5E41CB7C8EED",
    "DataProviderID": 1,
    "OperatorID": 214,
    "UsageTypeID": 4,
    "AddressInfo": {
        "ID": 100817,
        "Title": "Brauhausstraße",
        "AddressLine1": "Brauhausstraße 4",
        "Town": "Berlin",
        "StateOrProvince": "Berlin",
        "Postcode": "13086",
        "CountryID": 87,
        "Latitude": 52.5556464360826,
        "Longitude": 13.431903933868398,
        "DistanceUnit": 0
    },
    "Connections": [
        {
            "ID": 141921,
            "ConnectionTypeID": 25,
            "StatusTypeID": 50,
            "LevelID": 2,
            "Amps": 16,
            "Voltage": 400,
            "PowerKW": 11,
            "CurrentTypeID": 20,
            "Quantity": 2
        }
    ],
    "NumberOfPoints": 2,
    "GeneralComments": "24/7 nutzbar ",
    "StatusTypeID": 50,
    "DateLastStatusUpdate": "2018-02-26T08:12:00Z",
    "DataQualityLevel": 1,
    "DateCreated": "2018-02-26T08:12:00Z",
    "SubmissionStatusTypeID": 200
}