{
    "IsRecentlyVerified": false,
    "ID": 146391,
    "UUID": "BB700C0A-7A36-492C-8210-0A060D2D9FE7",
    "DataProviderID": 1,
    "OperatorID": 3315,
    "OperatorsReference": "52408",
    "UsageTypeID": 4,
    "UsageCost": "£0.25/kWh;min £2.00; overstay £5.00 after 60 minutes",
    "AddressInfo": {
        "ID": 146743,
        "Title": "Great Western Road Car Park Rapid (2)",
        "AddressLine1": "Great Western Road Car Park",
        "Town": "Kirkwall",
        "StateOrProvince": "Orkney",
        "Postcode": "KW15 1BX",
        "CountryID": 1,
        "Latitude": 58.98111,
        "Longitude": -2.965,
        "DistanceUnit": 0
    },
    "Connections": [
        {
            "ID": 203507,
            "ConnectionTypeID": 2,
            "StatusTypeID": 50,
            "LevelID": 3,
            "PowerKW": 50,
            "CurrentTypeID": 30,
            "Quantity": 1
        },
        {
            "ID": 203508,
            "ConnectionTypeID": 33,
            "StatusTypeID": 50,
            "LevelID": 3,
            "PowerKW": 50,
            "CurrentTypeID": 30,
            "Quantity": 1
        },
        {
            "ID": 203509,
            "ConnectionTypeID": 1036,
            "StatusTypeID": 50,
            "LevelID": 3,
            "PowerKW": 43,
            "CurrentTypeID": 20,
            "Quantity": 1
        }
    ],
    "NumberOfPoints": 1,
    "StatusTypeID": 50,
    "DateLastStatusUpdate": "2020-05-13T05:14:00Z",
    "DataQualityLevel": 1,
    "DateCreated": "2020-01-09T16:36:00Z",
    "SubmissionStatusTypeID": 200
}