{
    "IsRecentlyVerified": false,
    "ID": 186032,
    "UUID": "D4660E57-315F-468A-A656-9709A2EF9266",
    "DataProviderID": 29,
    "DataProvidersReference": "11436",
    "OperatorID": 86,
    "AddressInfo": {
        "ID": 186391,
        "Title": "Industriegebiet Süd A5 0",
        "AddressLine1": "Industriegebiet Süd A5 0",
        "Town": "Alzenau-Hörstein",
        "Postcode": "63755",
        "CountryID": 87,
        "Latitude": 50.04758,
        "Longitude": 9.047158,
        "DistanceUnit": 0
    },
    "Connections": [
        {
            "ID": 297525,
            "ConnectionTypeID": 33,
            "StatusTypeID": 50,
            "LevelID": 3,
            "PowerKW": 300,
            "CurrentTypeID": 30
        },
        {
            "ID": 297526,
            "ConnectionTypeID": 33,
            "StatusTypeID": 50,
            "LevelID": 3,
            "PowerKW": 300,
            "CurrentTypeID": 30
        },
        {
            "ID": 297527,
            "ConnectionTypeID": 2,
            "StatusTypeID": 50,
            "LevelID": 3,
            "PowerKW": 300,
            "CurrentTypeID": 30
        }
    ],
    "StatusTypeID": 50,
    "DateLastStatusUpdate": "2021-07-12T02:44:00Z",
    "MetadataValues": [
        {
            "ID": 18274,
            "MetadataFieldID": 4,
            "ItemValue": "Data from the German chargepoint registry provided by Bundesnetzagentur.de under the CC-BY 4.0 license"
        }
    ],
    "DataQualityLevel": 3,
    "DateCreated": "2021-07-12T02:44:00Z",
    "SubmissionStatusTypeID": 100
}