{
    "IsRecentlyVerified": false,
    "ID": 105811,
    "UUID": "0AF9328A-EC84-4DB0-81DF-94646D1018A6",
    "DataProviderID": 2,
    "DataProvidersReference": "98731",
    "OperatorID": 5,
    "UsageTypeID": 1,
    "AddressInfo": {
        "ID": 106157,
        "Title": "ITHACA VISITORS",
        "AddressLine1": "College Cir",
        "Town": "Ithaca",
        "StateOrProvince": "NY",
        "Postcode": "14850",
        "CountryID": 2,
        "Latitude": 42.411718,
        "Longitude": -76.5008374,
        "ContactTelephone1": "888-758-4389",
        "AccessComments": "24 hours daily",
        "RelatedURL": "http://www.chargepoint.com/",
        "DistanceUnit": 0
    },
    "Connections": [
        {
            "ID": 149019,
            "ConnectionTypeID": 1,
            "LevelID": 2,
            "Amps": 16,
            "Voltage": 230,
            "PowerKW": 3,
            "CurrentTypeID": 10,
            "Quantity": 2
        }
    ],
    "DateLastStatusUpdate": "2019-12-24T09:20:00Z",
    "DataQualityLevel": 3,
    "DateCreated": "2018-06-09T04:02:00Z",
    "SubmissionStatusTypeID": 100
}