{
    "IsRecentlyVerified": false,
    "ID": 79300,
    "UUID": "0EE93F97-B259-4FD1-9F2F-CBF9EDAAD776",
    "DataProviderID": 1,
    "OperatorID": 23,
    "OperatorsReference": "19710",
    "UsageTypeID": 7,
    "UsageCost": "Free",
    "AddressInfo": {
        "ID": 79646,
        "Title": "Herangtunet Boutique Hotel",
        "AddressLine1": "17 Vølbusvegen",
        "Town": "Heggenes",
        "Postcode": "2940",
        "CountryID": 168,
        "Latitude": 61.130316,
        "Longitude": 9.082111,
        "ContactTelephone1": "+47 97 63 33 10",
        "DistanceUnit": 0
    },
    "Connections": [
        {
            "ID": 113926,
            "ConnectionTypeID": 30,
            "StatusTypeID": 50,
            "LevelID": 2,
            "Amps": 16,
            "Voltage": 230,
            "PowerKW": 4,
            "CurrentTypeID": 10,
            "Quantity": 2
        }
    ],
    "NumberOfPoints": 2,
    "GeneralComments": "2 Tesla Connector, up to 4kW.Available by reservation only. Self park.",
    "StatusTypeID": 50,
    "DateLastStatusUpdate": "2020-08-24T06:12:00Z",
    "DataQualityLevel": 1,
    "DateCreated": "2017-01-27T08:01:00Z",
    "SubmissionStatusTypeID": 200
}