{
    "IsRecentlyVerified": false,
    "ID": 172942,
    "UUID": "ED23A0F3-9642-48DE-A32B-9296050B656C",
    "DataProviderID": 1,
    "OperatorID": 23,
    "OperatorsReference": "37188",
    "UsageTypeID": 4,
    "AddressInfo": {
        "ID": 173301,
        "Title": "Pupatella",
        "AddressLine1": "1 N Morris St",
        "Town": "Richmond",
        "StateOrProvince": "VA",
        "Postcode": "23220",
        "CountryID": 2,
        "Latitude": 37.546347,
        "Longitude": -77.456361,
        "ContactTelephone1": "(804) 355-3135",
        "DistanceUnit": 0
    },
    "Connections": [
        {
            "ID": 264576,
            "ConnectionTypeID": 30,
            "StatusTypeID": 50,
            "LevelID": 2,
            "PowerKW": 12,
            "CurrentTypeID": 20,
            "Quantity": 2
        }
    ],
    "NumberOfPoints": 2,
    "GeneralComments": "2 Tesla Connectors, up to 12kW.Available for customers. Self park.",
    "StatusTypeID": 50,
    "DateLastStatusUpdate": "2021-02-23T06:24:00Z",
    "DataQualityLevel": 1,
    "DateCreated": "2021-02-23T06:24:00Z",
    "SubmissionStatusTypeID": 200
}