{
    "IsRecentlyVerified": false,
    "ID": 103689,
    "UUID": "D70ADAA0-2C91-4331-9366-91EC0E5BA73E",
    "DataProviderID": 1,
    "OperatorID": 23,
    "OperatorsReference": "42486",
    "UsageTypeID": 4,
    "AddressInfo": {
        "ID": 104035,
        "Title": "Château de l'Hoste",
        "AddressLine1": "D 656",
        "Town": "Saint-Beauzeil",
        "Postcode": "82150",
        "CountryID": 80,
        "Latitude": 44.338187,
        "Longitude": 0.928082,
        "ContactTelephone1": "+33 5 63 95 25 61",
        "DistanceUnit": 0
    },
    "Connections": [
        {
            "ID": 146359,
            "ConnectionTypeID": 30,
            "StatusTypeID": 50,
            "LevelID": 2,
            "Amps": 16,
            "Voltage": 400,
            "PowerKW": 11,
            "CurrentTypeID": 20,
            "Quantity": 2
        }
    ],
    "NumberOfPoints": 2,
    "GeneralComments": "2 Tesla Connectors, up to 11kW.Available for customers. Please call ahead.",
    "StatusTypeID": 50,
    "DateLastStatusUpdate": "2018-10-03T16:56:00Z",
    "DataQualityLevel": 1,
    "DateCreated": "2018-05-05T05:54:00Z",
    "SubmissionStatusTypeID": 200
}