{
    "IsRecentlyVerified": false,
    "ID": 6639,
    "UUID": "378E0CF3-53D9-49F0-90BA-B669337E741D",
    "DataProviderID": 1,
    "UsageTypeID": 2,
    "UsageCost": "Free",
    "AddressInfo": {
        "ID": 6542,
        "Title": "Chrystie House Bed and Breakfast",
        "AddressLine1": "300 South Avenue Beacon",
        "AddressLine2": "",
        "Town": "Beacon",
        "StateOrProvince": "New York",
        "Postcode": "12508",
        "CountryID": 2,
        "Latitude": 41.4938174,
        "Longitude": -73.97715370000003,
        "ContactTelephone1": "+1 845 765 0251",
        "ContactTelephone2": "",
        "ContactEmail": "chrystiehouse@gmail.com",
        "AccessComments": "Located in the garage, parking for one car available outside.",
        "DistanceUnit": 0
    },
    "Connections": [
        {
            "ID": 3887,
            "ConnectionTypeID": 22,
            "StatusTypeID": 50,
            "LevelID": 1,
            "Amps": 12,
            "Voltage": 120,
            "PowerKW": 1.4,
            "Quantity": 1
        }
    ],
    "NumberOfPoints": 1,
    "GeneralComments": "Tested 2011/09/23. Note connection is NEMA 5-15R, Available to hotel guests. 16ft from power point to vehicle.",
    "DateLastConfirmed": "2011-09-30T12:32:00Z",
    "StatusTypeID": 50,
    "DateLastStatusUpdate": "2011-09-30T12:32:00Z",
    "DataQualityLevel": 1,
    "DateCreated": "2011-09-30T12:32:00Z",
    "SubmissionStatusTypeID": 200
}