{
    "IsRecentlyVerified": false,
    "ID": 124031,
    "UUID": "9BD25DAB-193C-4E55-B90F-1666B22445A4",
    "DataProviderID": 2,
    "DataProvidersReference": "117477",
    "OperatorID": 5,
    "UsageTypeID": 1,
    "AddressInfo": {
        "ID": 124377,
        "Title": "CCSF - SFO",
        "AddressLine1": "806 S Airport Blvd",
        "Town": "San Francisco",
        "StateOrProvince": "CA",
        "Postcode": "94130",
        "CountryID": 2,
        "Latitude": 37.6365787,
        "Longitude": -122.4006054,
        "ContactTelephone1": "888-758-4389",
        "AccessComments": "24 hours daily",
        "RelatedURL": "http://www.chargepoint.com/",
        "DistanceUnit": 0
    },
    "Connections": [
        {
            "ID": 174073,
            "ConnectionTypeID": 1,
            "LevelID": 2,
            "Amps": 16,
            "Voltage": 230,
            "PowerKW": 3,
            "CurrentTypeID": 10,
            "Quantity": 77
        }
    ],
    "DateLastStatusUpdate": "2019-04-06T05:03:00Z",
    "DataQualityLevel": 3,
    "DateCreated": "2019-04-06T05:03:00Z",
    "SubmissionStatusTypeID": 100
}