{
    "IsRecentlyVerified": false,
    "ID": 176439,
    "UUID": "D15DCBC5-7F9F-425B-9BF1-422C5C889A3A",
    "DataProviderID": 29,
    "DataProvidersReference": "7022",
    "AddressInfo": {
        "ID": 176798,
        "Title": "Sonnenhalde 55",
        "AddressLine1": "Sonnenhalde 55",
        "Town": "Lindenberg",
        "Postcode": "88161",
        "CountryID": 87,
        "Latitude": 47.596382,
        "Longitude": 9.874051,
        "DistanceUnit": 0
    },
    "Connections": [
        {
            "ID": 274360,
            "ConnectionTypeID": 25,
            "StatusTypeID": 50,
            "LevelID": 2,
            "PowerKW": 22,
            "CurrentTypeID": 20
        },
        {
            "ID": 274361,
            "ConnectionTypeID": 25,
            "StatusTypeID": 50,
            "LevelID": 2,
            "PowerKW": 22,
            "CurrentTypeID": 20
        }
    ],
    "StatusTypeID": 0,
    "DateLastStatusUpdate": "2021-07-09T03:10:00Z",
    "MetadataValues": [
        {
            "ID": 8734,
            "MetadataFieldID": 4,
            "ItemValue": "Data from the German chargepoint registry provided by Bundesnetzagentur.de under the CC-BY 4.0 license"
        }
    ],
    "DataQualityLevel": 3,
    "DateCreated": "2021-07-08T09:48:00Z",
    "SubmissionStatusTypeID": 100
}