{
    "MediaItems": [
        {
            "ID": 22322,
            "ChargePointID": 146719,
            "ItemURL": "https://s3-ap-southeast-2.amazonaws.com/openchargemap/images/PT/OCM146719/OCM-146719.orig.2020051419164182.jpg",
            "ItemThumbnailURL": "https://s3-ap-southeast-2.amazonaws.com/openchargemap/images/PT/OCM146719/OCM-146719.thmb.2020051419164182.jpg",
            "Comment": "",
            "IsEnabled": true,
            "IsVideo": false,
            "IsFeaturedItem": false,
            "IsExternalResource": false,
            "User": {
                "ID": 9177,
                "Username": "AlexMol"
            },
            "DateCreated": "2020-05-14T19:17:00Z"
        }
    ],
    "IsRecentlyVerified": false,
    "ID": 146719,
    "UUID": "AF23166C-F1E4-4148-B9A0-4341B00132A0",
    "DataProviderID": 1,
    "OperatorID": 21,
    "UsageTypeID": 4,
    "AddressInfo": {
        "ID": 147071,
        "Title": "LLE-00022",
        "AddressLine1": "Avenida José da Costa Mealha",
        "Town": "Loulé",
        "StateOrProvince": "Algarve",
        "Postcode": "8100-568",
        "CountryID": 180,
        "Latitude": 37.13813329740492,
        "Longitude": -8.02085100337922,
        "RelatedURL": "https://www.mobie.pt",
        "DistanceUnit": 0
    },
    "Connections": [
        {
            "ID": 204028,
            "ConnectionTypeID": 25,
            "StatusTypeID": 50,
            "LevelID": 2,
            "Amps": 32,
            "Voltage": 400,
            "PowerKW": 22,
            "CurrentTypeID": 20,
            "Quantity": 2
        }
    ],
    "NumberOfPoints": 2,
    "StatusTypeID": 50,
    "DateLastStatusUpdate": "2020-05-14T19:17:00Z",
    "DataQualityLevel": 1,
    "DateCreated": "2020-01-14T20:48:00Z",
    "SubmissionStatusTypeID": 200
}