{
    "IsRecentlyVerified": false,
    "ID": 186004,
    "UUID": "A516B0BB-0622-46C2-8933-A23014DC5498",
    "DataProviderID": 29,
    "DataProvidersReference": "16813",
    "OperatorID": 45,
    "AddressInfo": {
        "ID": 186363,
        "Title": "Lohrer Str. 2",
        "AddressLine1": "Lohrer Str. 2",
        "Town": "Rothenbuch",
        "Postcode": "63860",
        "CountryID": 87,
        "Latitude": 49.972756,
        "Longitude": 9.400356,
        "DistanceUnit": 0
    },
    "Connections": [
        {
            "ID": 297444,
            "ConnectionTypeID": 33,
            "StatusTypeID": 50,
            "LevelID": 3,
            "PowerKW": 22,
            "CurrentTypeID": 30
        },
        {
            "ID": 297445,
            "ConnectionTypeID": 25,
            "StatusTypeID": 50,
            "LevelID": 2,
            "PowerKW": 11,
            "CurrentTypeID": 20
        }
    ],
    "StatusTypeID": 50,
    "DateLastStatusUpdate": "2021-07-12T02:44:00Z",
    "MetadataValues": [
        {
            "ID": 18246,
            "MetadataFieldID": 4,
            "ItemValue": "Data from the German chargepoint registry provided by Bundesnetzagentur.de under the CC-BY 4.0 license"
        }
    ],
    "DataQualityLevel": 3,
    "DateCreated": "2021-07-12T02:44:00Z",
    "SubmissionStatusTypeID": 100
}