{
    "IsRecentlyVerified": false,
    "ID": 95067,
    "UUID": "B6CD0B33-96BA-4A80-BA16-9EEDF5ED7BA0",
    "DataProviderID": 1,
    "OperatorID": 89,
    "OperatorsReference": "CEA-10568",
    "UsageTypeID": 4,
    "UsageCost": "CAD 1.00/hour",
    "AddressInfo": {
        "ID": 95413,
        "Title": "Sur Rue-Ville-Marie-Rue Gauvin",
        "AddressLine1": "800 Rue du Square Victoria",
        "Town": "Montréal",
        "StateOrProvince": "QC",
        "Postcode": "H4Z 1A1",
        "CountryID": 44,
        "Latitude": 45.500852,
        "Longitude": -73.56134,
        "DistanceUnit": 0
    },
    "Connections": [
        {
            "ID": 134707,
            "ConnectionTypeID": 1,
            "StatusTypeID": 50,
            "LevelID": 2,
            "Amps": 32,
            "Voltage": 230,
            "PowerKW": 7,
            "CurrentTypeID": 10,
            "Quantity": 1
        }
    ],
    "NumberOfPoints": 1,
    "StatusTypeID": 50,
    "DateLastStatusUpdate": "2017-11-02T06:33:00Z",
    "DataQualityLevel": 1,
    "DateCreated": "2017-11-02T06:33:00Z",
    "SubmissionStatusTypeID": 200
}