{
    "IsRecentlyVerified": false,
    "ID": 87295,
    "UUID": "16506013-1436-44C9-A1E1-16A3B5022746",
    "DataProviderID": 1,
    "OperatorID": 23,
    "OperatorsReference": "29151",
    "UsageTypeID": 6,
    "AddressInfo": {
        "ID": 87641,
        "Title": "Château Talluy",
        "AddressLine1": "144 Rue du Pensionnat",
        "Town": "Taluyers",
        "Postcode": "69440",
        "CountryID": 80,
        "Latitude": 45.639641,
        "Longitude": 4.72231,
        "ContactTelephone1": "+33 4 78 19 19 00",
        "DistanceUnit": 0
    },
    "Connections": [
        {
            "ID": 123738,
            "ConnectionTypeID": 30,
            "StatusTypeID": 50,
            "LevelID": 2,
            "Amps": 32,
            "Voltage": 230,
            "PowerKW": 14,
            "CurrentTypeID": 20,
            "Quantity": 1
        }
    ],
    "NumberOfPoints": 1,
    "GeneralComments": "1 Tesla Connector, up to 14kW.Available for patrons only. Please see front desk.",
    "StatusTypeID": 50,
    "DateLastStatusUpdate": "2018-10-03T16:28:00Z",
    "DataQualityLevel": 1,
    "DateCreated": "2017-05-04T05:25:00Z",
    "SubmissionStatusTypeID": 200
}