{
    "IsRecentlyVerified": false,
    "ID": 173970,
    "UUID": "66115821-7A60-4291-923E-4D11912AAD7E",
    "DataProviderID": 1,
    "OperatorID": 73,
    "UsageTypeID": 1,
    "UsageCost": "€0.39/kWh",
    "AddressInfo": {
        "ID": 174329,
        "Title": "EVBox fastcharger",
        "AddressLine1": "Kallenbroekerweg",
        "Town": "Barneveld",
        "StateOrProvince": "Gelderland",
        "Postcode": "3771DC",
        "CountryID": 159,
        "Latitude": 52.14141141493823,
        "Longitude": 5.567445005043965,
        "DistanceUnit": 0
    },
    "Connections": [
        {
            "ID": 268064,
            "ConnectionTypeID": 33,
            "StatusTypeID": 50,
            "LevelID": 3,
            "PowerKW": 50,
            "CurrentTypeID": 30,
            "Quantity": 1
        },
        {
            "ID": 268065,
            "ConnectionTypeID": 2,
            "StatusTypeID": 50,
            "LevelID": 3,
            "PowerKW": 50,
            "CurrentTypeID": 30,
            "Quantity": 1
        },
        {
            "ID": 268066,
            "ConnectionTypeID": 25,
            "StatusTypeID": 50,
            "LevelID": 2,
            "PowerKW": 22,
            "CurrentTypeID": 20,
            "Quantity": 1
        }
    ],
    "NumberOfPoints": 2,
    "StatusTypeID": 50,
    "DateLastStatusUpdate": "2021-03-09T22:32:00Z",
    "DataQualityLevel": 1,
    "DateCreated": "2021-03-08T19:25:00Z",
    "SubmissionStatusTypeID": 200
}