{
    "IsRecentlyVerified": false,
    "ID": 93233,
    "UUID": "A2F258C1-31BD-4302-8B11-2CF9C4147095",
    "DataProviderID": 1,
    "OperatorID": 23,
    "OperatorsReference": "35715",
    "UsageTypeID": 6,
    "AddressInfo": {
        "ID": 93579,
        "Title": "The Cook Hotel & Conference Center At Lsu",
        "AddressLine1": "3848 W Lakeshore DR",
        "Town": "Baton Rouge",
        "StateOrProvince": "Louisiana",
        "Postcode": "70808",
        "CountryID": 2,
        "Latitude": 30.413533,
        "Longitude": -91.169866,
        "ContactTelephone1": "(225) 383-2665",
        "DistanceUnit": 0
    },
    "Connections": [
        {
            "ID": 132060,
            "ConnectionTypeID": 30,
            "StatusTypeID": 50,
            "LevelID": 2,
            "PowerKW": 10,
            "CurrentTypeID": 10,
            "Quantity": 1
        }
    ],
    "NumberOfPoints": 1,
    "GeneralComments": "1 Tesla Connector, up to 10kW.Available for patrons only. Self park.",
    "StatusTypeID": 50,
    "DateLastStatusUpdate": "2017-09-24T05:29:00Z",
    "DataQualityLevel": 1,
    "DateCreated": "2017-09-24T05:29:00Z",
    "SubmissionStatusTypeID": 200
}