{
    "IsRecentlyVerified": false,
    "ID": 136502,
    "UUID": "FBC274AF-AB02-46C3-BF11-222A9F90DF81",
    "DataProviderID": 1,
    "OperatorID": 2244,
    "UsageTypeID": 5,
    "AddressInfo": {
        "ID": 136848,
        "Title": "Odessa Road",
        "AddressLine1": "Odessa Road",
        "Town": "London",
        "Postcode": "E7 9DY",
        "CountryID": 1,
        "Latitude": 51.555065,
        "Longitude": 0.015125,
        "AccessComments": "",
        "RelatedURL": "https://www.ubitricity.com",
        "DistanceUnit": 0
    },
    "Connections": [
        {
            "ID": 190952,
            "ConnectionTypeID": 25,
            "Reference": "suby1100001352",
            "StatusTypeID": 50,
            "LevelID": 2,
            "Amps": 16,
            "Voltage": 230,
            "PowerKW": 3.7,
            "CurrentTypeID": 10,
            "Quantity": 1
        }
    ],
    "StatusTypeID": 50,
    "DateLastStatusUpdate": "2020-10-11T23:16:00Z",
    "MetadataValues": [
        {
            "ID": 6354,
            "MetadataFieldID": 4,
            "ItemValue": "Contains public sector information licensed under the Open Government Licence v2.0. http://www.nationalarchives.gov.uk/doc/open-government-licence/version/2/"
        }
    ],
    "DataQualityLevel": 3,
    "DateCreated": "2019-12-24T05:22:00Z",
    "SubmissionStatusTypeID": 100
}