{
    "IsRecentlyVerified": false,
    "ID": 73298,
    "UUID": "7D5BC4AC-C20E-465D-91F6-391F176E0384",
    "DataProviderID": 1,
    "OperatorID": 45,
    "UsageTypeID": 6,
    "AddressInfo": {
        "ID": 73644,
        "Title": "BEST WESTERN PLUS Hotel Modena Resort",
        "AddressLine1": "Via Giardini Nord, 438",
        "Town": "Formigine ",
        "StateOrProvince": "MO",
        "Postcode": "41043",
        "CountryID": 112,
        "Latitude": 44.59775576897373,
        "Longitude": 10.862318369764687,
        "ContactTelephone1": "+39 059 511151",
        "ContactEmail": "info@modenaresort.it",
        "RelatedURL": "http://www.modenaresort.it/",
        "DistanceUnit": 0
    },
    "Connections": [
        {
            "ID": 105470,
            "ConnectionTypeID": 1036,
            "StatusTypeID": 50,
            "LevelID": 2,
            "Amps": 32,
            "Voltage": 400,
            "PowerKW": 22,
            "CurrentTypeID": 20,
            "Quantity": 2
        }
    ],
    "NumberOfPoints": 2,
    "GeneralComments": "Tesla Destination Charager",
    "StatusTypeID": 50,
    "DateLastStatusUpdate": "2016-11-17T12:02:00Z",
    "DataQualityLevel": 1,
    "DateCreated": "2016-11-17T12:02:00Z",
    "SubmissionStatusTypeID": 200
}