{
    "UserComments": [
        {
            "ID": 17892,
            "ChargePointID": 65323,
            "CommentTypeID": 10,
            "UserName": "michaelb",
            "Comment": "Only used Chademo",
            "DateCreated": "2017-11-04T15:35:14.223Z",
            "User": {
                "ID": 16289,
                "Username": "michaelb"
            },
            "CheckinStatusTypeID": 10
        }
    ],
    "MediaItems": [
        {
            "ID": 6308,
            "ChargePointID": 65323,
            "ItemURL": "https://s3-ap-southeast-2.amazonaws.com/openchargemap/images/GB/OCM65323/OCM-65323.orig.2016042616401812.jpeg",
            "ItemThumbnailURL": "https://s3-ap-southeast-2.amazonaws.com/openchargemap/images/GB/OCM65323/OCM-65323.thmb.2016042616401812.jpeg",
            "Comment": "",
            "IsEnabled": true,
            "IsVideo": false,
            "IsFeaturedItem": false,
            "IsExternalResource": false,
            "User": {
                "ID": 1192,
                "Username": "Anon74856763534"
            },
            "DateCreated": "2016-04-26T16:40:00Z"
        }
    ],
    "IsRecentlyVerified": false,
    "ID": 65323,
    "UUID": "3FFF7E75-FD74-4BB8-8625-0E476F61252D",
    "DataProviderID": 1,
    "OperatorID": 3315,
    "OperatorsReference": "51249",
    "UsageTypeID": 4,
    "UsageCost": "Free",
    "AddressInfo": {
        "ID": 65669,
        "Title": "Atholl Street Car Park",
        "AddressLine1": "Atholl Street",
        "Town": "Dunkeld",
        "StateOrProvince": "Perthshire",
        "Postcode": "PH8 0AT",
        "CountryID": 1,
        "Latitude": 56.567251,
        "Longitude": -3.586423,
        "DistanceUnit": 0
    },
    "Connections": [
        {
            "ID": 89997,
            "ConnectionTypeID": 33,
            "StatusTypeID": 50,
            "LevelID": 3,
            "PowerKW": 50,
            "CurrentTypeID": 30,
            "Quantity": 1
        },
        {
            "ID": 89998,
            "ConnectionTypeID": 2,
            "StatusTypeID": 50,
            "LevelID": 3,
            "PowerKW": 50,
            "CurrentTypeID": 30,
            "Quantity": 1
        },
        {
            "ID": 89999,
            "ConnectionTypeID": 1036,
            "StatusTypeID": 50,
            "LevelID": 2,
            "PowerKW": 43,
            "CurrentTypeID": 10,
            "Quantity": 1
        }
    ],
    "NumberOfPoints": 2,
    "StatusTypeID": 50,
    "DateLastStatusUpdate": "2020-01-28T06:15:00Z",
    "DataQualityLevel": 1,
    "DateCreated": "2016-04-26T12:43:00Z",
    "SubmissionStatusTypeID": 200
}