{
    "IsRecentlyVerified": false,
    "ID": 183239,
    "UUID": "F52FC5A2-4934-4EFB-806C-A076452C36DB",
    "DataProviderID": 29,
    "DataProvidersReference": "16124",
    "OperatorID": 121,
    "AddressInfo": {
        "ID": 183598,
        "Title": "Alte Döhrener Straße 80A",
        "AddressLine1": "Alte Döhrener Straße 80A",
        "Town": "Hannover",
        "Postcode": "30173",
        "CountryID": 87,
        "Latitude": 52.35334,
        "Longitude": 9.75352,
        "DistanceUnit": 0
    },
    "Connections": [
        {
            "ID": 289981,
            "ConnectionTypeID": 25,
            "StatusTypeID": 50,
            "LevelID": 2,
            "PowerKW": 4.6,
            "CurrentTypeID": 10
        }
    ],
    "StatusTypeID": 50,
    "DateLastStatusUpdate": "2021-07-12T02:49:00Z",
    "MetadataValues": [
        {
            "ID": 15532,
            "MetadataFieldID": 4,
            "ItemValue": "Data from the German chargepoint registry provided by Bundesnetzagentur.de under the CC-BY 4.0 license"
        }
    ],
    "DataQualityLevel": 3,
    "DateCreated": "2021-07-08T10:03:00Z",
    "SubmissionStatusTypeID": 100
}