{
    "IsRecentlyVerified": false,
    "ID": 91680,
    "UUID": "70E6EED0-B9B6-4B25-BBDE-F614053B3F7B",
    "DataProviderID": 1,
    "OperatorID": 3330,
    "UsageTypeID": 6,
    "AddressInfo": {
        "ID": 92026,
        "Title": " Approdo Resort Thalasso Spa",
        "AddressLine1": "Via Porto, 49",
        "AddressLine2": "San Marco di Castellabate",
        "Town": "Castellabate",
        "StateOrProvince": "SA",
        "Postcode": "84048 ",
        "CountryID": 112,
        "Latitude": 40.267625919445,
        "Longitude": 14.9342244284817,
        "ContactTelephone1": "+39 0974 966001",
        "ContactEmail": "info@lapprodo.it",
        "RelatedURL": "https://www.approdothalassospa.com",
        "DistanceUnit": 0
    },
    "Connections": [
        {
            "ID": 129988,
            "ConnectionTypeID": 25,
            "StatusTypeID": 50,
            "LevelID": 2,
            "Amps": 32,
            "Voltage": 400,
            "PowerKW": 22,
            "CurrentTypeID": 20,
            "Quantity": 1
        },
        {
            "ID": 129989,
            "ConnectionTypeID": 36,
            "StatusTypeID": 50,
            "LevelID": 2,
            "Amps": 16,
            "Voltage": 240,
            "PowerKW": 3.7,
            "CurrentTypeID": 10,
            "Quantity": 1
        }
    ],
    "NumberOfPoints": 2,
    "GeneralComments": "https://energiachetiserve.repower.com/ricarica101/",
    "StatusTypeID": 50,
    "DateLastStatusUpdate": "2019-01-13T19:04:00Z",
    "DataQualityLevel": 1,
    "DateCreated": "2017-08-12T15:38:00Z",
    "SubmissionStatusTypeID": 200
}