{
    "UserComments": [
        {
            "ID": 22349,
            "ChargePointID": 121524,
            "CommentTypeID": 10,
            "UserName": "ForumElettrico.it",
            "Comment": "Nessun problema con Nissan Leaf 40 kWh su CHAdeMO. Leggi la recensione completa qui > https://www.forumelettrico.it/forum/fast-enel-palmi-contrada-rinazzo-sede-enel-t5241.html",
            "RelatedURL": "https://www.forumelettrico.it/forum/fast-enel-palmi-contrada-rinazzo-sede-enel-t5241.html",
            "DateCreated": "2020-03-27T10:57:56.36Z",
            "User": {
                "ID": 11749,
                "Username": "ForumElettrico.it"
            },
            "CheckinStatusTypeID": 10,
            "IsActionedByEditor": false
        }
    ],
    "MediaItems": [
        {
            "ID": 21729,
            "ChargePointID": 121524,
            "ItemURL": "https://s3-ap-southeast-2.amazonaws.com/openchargemap/images/IT/OCM121524/OCM-121524.orig.2020032710580777.jpg",
            "ItemThumbnailURL": "https://s3-ap-southeast-2.amazonaws.com/openchargemap/images/IT/OCM121524/OCM-121524.thmb.2020032710580777.jpg",
            "Comment": "",
            "IsEnabled": true,
            "IsVideo": false,
            "IsFeaturedItem": false,
            "IsExternalResource": false,
            "User": {
                "ID": 11749,
                "Username": "ForumElettrico.it"
            },
            "DateCreated": "2020-03-27T10:58:00Z"
        },
        {
            "ID": 21730,
            "ChargePointID": 121524,
            "ItemURL": "https://s3-ap-southeast-2.amazonaws.com/openchargemap/images/IT/OCM121524/OCM-121524.orig.2020032710581358.jpg",
            "ItemThumbnailURL": "https://s3-ap-southeast-2.amazonaws.com/openchargemap/images/IT/OCM121524/OCM-121524.thmb.2020032710581358.jpg",
            "Comment": "",
            "IsEnabled": true,
            "IsVideo": false,
            "IsFeaturedItem": false,
            "IsExternalResource": false,
            "User": {
                "ID": 11749,
                "Username": "ForumElettrico.it"
            },
            "DateCreated": "2020-03-27T10:58:00Z"
        }
    ],
    "IsRecentlyVerified": false,
    "ID": 121524,
    "UUID": "A907A078-8059-41C6-B076-9A1DB4DA63C2",
    "DataProviderID": 1,
    "OperatorID": 80,
    "UsageTypeID": 4,
    "UsageCost": "0,50 €/kWh",
    "AddressInfo": {
        "ID": 121870,
        "Title": "EnelX EVA+ Sede Enel Palmi",
        "AddressLine1": "Via Trodio",
        "AddressLine2": "Contrada Rinazzo",
        "Town": "Palmi",
        "StateOrProvince": "RC",
        "Postcode": "89015",
        "CountryID": 112,
        "Latitude": 38.36833881366681,
        "Longitude": 15.860076992279346,
        "RelatedURL": "https://www.enelx.com/it/it/emobility",
        "DistanceUnit": 0
    },
    "Connections": [
        {
            "ID": 171241,
            "ConnectionTypeID": 33,
            "StatusTypeID": 50,
            "LevelID": 3,
            "PowerKW": 50,
            "CurrentTypeID": 30,
            "Quantity": 1
        },
        {
            "ID": 171242,
            "ConnectionTypeID": 2,
            "StatusTypeID": 50,
            "LevelID": 3,
            "PowerKW": 50,
            "CurrentTypeID": 30,
            "Quantity": 1
        },
        {
            "ID": 171243,
            "ConnectionTypeID": 1036,
            "StatusTypeID": 50,
            "LevelID": 3,
            "Amps": 64,
            "Voltage": 400,
            "PowerKW": 43,
            "CurrentTypeID": 20,
            "Quantity": 1
        }
    ],
    "NumberOfPoints": 2,
    "StatusTypeID": 50,
    "DateLastStatusUpdate": "2020-03-27T10:58:00Z",
    "DataQualityLevel": 1,
    "DateCreated": "2019-04-04T20:02:00Z",
    "SubmissionStatusTypeID": 200
}