{
    "IsRecentlyVerified": false,
    "ID": 36805,
    "UUID": "DD25C39A-6C6D-4981-9AAF-9163F110F754",
    "DataProviderID": 26,
    "DataProvidersReference": "48028",
    "OperatorID": 178,
    "OperatorsReference": "EVnetNL DB0268",
    "UsageCost": "0.00 jaarabonnement",
    "AddressInfo": {
        "ID": 37151,
        "Title": "De Minnehof 48",
        "AddressLine1": "De Minnehof 48",
        "Town": "Eemnes",
        "Postcode": "3755 AK",
        "CountryID": 159,
        "Latitude": 52.253645,
        "Longitude": 5.263784,
        "ContactTelephone1": "0800-3522365",
        "RelatedURL": "http://www.evnet.nl",
        "DistanceUnit": 0
    },
    "Connections": [
        {
            "ID": 40316,
            "ConnectionTypeID": 25,
            "LevelID": 2,
            "PowerKW": 11,
            "CurrentTypeID": 10
        }
    ],
    "NumberOfPoints": 2,
    "StatusTypeID": 50,
    "DateLastStatusUpdate": "2016-06-04T02:52:00Z",
    "DataQualityLevel": 3,
    "DateCreated": "2015-01-09T06:07:00Z",
    "SubmissionStatusTypeID": 100
}