{
    "IsRecentlyVerified": false,
    "ID": 102067,
    "UUID": "33429DA6-8A97-4B5B-83DD-86E167CF8350",
    "DataProviderID": 1,
    "OperatorID": 23,
    "OperatorsReference": "42186",
    "UsageTypeID": 4,
    "AddressInfo": {
        "ID": 102413,
        "Title": "Hôtel Best Western Plus Metz Technopôle",
        "AddressLine1": "1 Rue Félix Savart",
        "Town": "Metz",
        "Postcode": "57070",
        "CountryID": 80,
        "Latitude": 49.100479,
        "Longitude": 6.225751,
        "ContactTelephone1": "+33 3 87 39 94 50",
        "DistanceUnit": 0
    },
    "Connections": [
        {
            "ID": 144050,
            "ConnectionTypeID": 30,
            "StatusTypeID": 50,
            "LevelID": 2,
            "Amps": 16,
            "Voltage": 400,
            "PowerKW": 11,
            "CurrentTypeID": 20,
            "Quantity": 2
        }
    ],
    "NumberOfPoints": 2,
    "GeneralComments": "2 Tesla Connectors, up to 11kW.Available for customers. Please see front desk.",
    "StatusTypeID": 50,
    "DateLastStatusUpdate": "2018-10-03T19:23:00Z",
    "DataQualityLevel": 1,
    "DateCreated": "2018-04-16T05:06:00Z",
    "SubmissionStatusTypeID": 200
}