{
    "IsRecentlyVerified": false,
    "ID": 35910,
    "UUID": "EB3D35D7-25A9-499F-93B7-A287535AC8FB",
    "DataProviderID": 26,
    "DataProvidersReference": "47543",
    "OperatorID": 178,
    "OperatorsReference": "EVnetNL AL695",
    "UsageCost": "0.00 jaarabonnement",
    "AddressInfo": {
        "ID": 36256,
        "Title": "Nieuwe Erf 9",
        "AddressLine1": "Nieuwe Erf 9",
        "Town": "Ede",
        "Postcode": "6741 AN",
        "CountryID": 159,
        "Latitude": 52.0866,
        "Longitude": 5.619439,
        "ContactTelephone1": "0800-3522365",
        "RelatedURL": "http://www.evnet.nl",
        "DistanceUnit": 0
    },
    "Connections": [
        {
            "ID": 39421,
            "ConnectionTypeID": 25,
            "LevelID": 2,
            "PowerKW": 11,
            "CurrentTypeID": 10
        }
    ],
    "NumberOfPoints": 2,
    "StatusTypeID": 50,
    "DateLastStatusUpdate": "2016-06-04T02:50:00Z",
    "DataQualityLevel": 3,
    "DateCreated": "2015-01-09T06:05:00Z",
    "SubmissionStatusTypeID": 100
}