{
    "IsRecentlyVerified": false,
    "ID": 77098,
    "UUID": "BAC62341-AB48-403B-AFFA-EE39EA697AE4",
    "DataProviderID": 1,
    "OperatorID": 45,
    "UsageTypeID": 1,
    "AddressInfo": {
        "ID": 77444,
        "Title": "Delbrückstraße",
        "AddressLine1": "Delbrückstraße",
        "AddressLine2": "Brunsbüttel",
        "Town": "Brunsbüttel",
        "StateOrProvince": "Kreis Dithmarschen",
        "Postcode": "25541",
        "CountryID": 87,
        "Latitude": 53.8991592,
        "Longitude": 9.145694000000049,
        "AccessComments": "Rund um die Uhr (24/7) nutzbar",
        "RelatedURL": "http://www.eksh.org/foerderung/ladesaeulen-programm/?no_cache=1",
        "DistanceUnit": 0
    },
    "Connections": [
        {
            "ID": 110753,
            "ConnectionTypeID": 25,
            "StatusTypeID": 50,
            "LevelID": 2,
            "Amps": 32,
            "Voltage": 400,
            "PowerKW": 22,
            "CurrentTypeID": 20,
            "Quantity": 2
        }
    ],
    "NumberOfPoints": 2,
    "StatusTypeID": 50,
    "DateLastStatusUpdate": "2016-12-30T22:30:00Z",
    "DataQualityLevel": 1,
    "DateCreated": "2016-12-30T22:30:00Z",
    "SubmissionStatusTypeID": 200
}