{
    "IsRecentlyVerified": false,
    "ID": 80316,
    "UUID": "B203D136-43E4-4F67-A766-BD4FA2C5F43C",
    "DataProviderID": 2,
    "DataProvidersReference": "80616",
    "UsageTypeID": 2,
    "AddressInfo": {
        "ID": 80662,
        "Title": "Charles Auto Family Chevrolet Buick",
        "AddressLine1": "10851 North St",
        "Town": "Garrettsville",
        "StateOrProvince": "OH",
        "Postcode": "44231",
        "CountryID": 2,
        "Latitude": 41.287531,
        "Longitude": -81.099218,
        "ContactTelephone1": "",
        "AccessComments": "Dealership business hours; service center use only",
        "RelatedURL": "",
        "DistanceUnit": 0
    },
    "Connections": [
        {
            "ID": 114990,
            "ConnectionTypeID": 1,
            "LevelID": 2,
            "Amps": 16,
            "Voltage": 230,
            "PowerKW": 3.7,
            "CurrentTypeID": 10,
            "Quantity": 1
        }
    ],
    "DateLastStatusUpdate": "2020-06-26T03:04:00Z",
    "DataQualityLevel": 3,
    "DateCreated": "2017-01-31T01:05:00Z",
    "SubmissionStatusTypeID": 100
}