{
    "IsRecentlyVerified": false,
    "ID": 10506,
    "UUID": "3D1CB6E5-7D80-4DD1-A068-F14257D65B85",
    "DataProviderID": 15,
    "DataProvidersReference": "18537",
    "OperatorID": 1,
    "UsageTypeID": 1,
    "AddressInfo": {
        "ID": 10403,
        "Title": "205 W McMillan St",
        "AddressLine1": "205 W McMillan St",
        "Town": "Cincinnati",
        "StateOrProvince": "OH",
        "Postcode": "45219",
        "CountryID": 2,
        "Latitude": 39.12747,
        "Longitude": -84.519771,
        "ContactTelephone1": "(513) 241-MACS",
        "RelatedURL": "http://carstations.com/18537",
        "DistanceUnit": 0
    },
    "Connections": [
        {
            "ID": 8492,
            "ConnectionTypeID": 1,
            "Reference": "J1772",
            "Quantity": 1
        },
        {
            "ID": 10747,
            "ConnectionTypeID": 9,
            "Reference": "NEMA5",
            "LevelID": 1
        }
    ],
    "StatusTypeID": 50,
    "DateLastStatusUpdate": "2017-11-04T14:04:00Z",
    "DataQualityLevel": 2,
    "DateCreated": "2012-05-31T09:45:00Z",
    "SubmissionStatusTypeID": 100
}