{
    "IsRecentlyVerified": false,
    "ID": 132286,
    "UUID": "8BC143A3-C457-4ADD-9B92-65F39D41DC2C",
    "DataProviderID": 1,
    "OperatorID": 3,
    "OperatorsReference": "PG-70085,PG-83773",
    "UsageTypeID": 4,
    "UsageCost": "Free",
    "AddressInfo": {
        "ID": 132632,
        "Title": "Tesco Superstore-Penarth",
        "AddressLine1": "Terra Nova Way",
        "Town": "Penarth",
        "Postcode": "CF64 1SA",
        "CountryID": 1,
        "Latitude": 51.445999,
        "Longitude": -3.186151,
        "DistanceUnit": 0
    },
    "Connections": [
        {
            "ID": 185153,
            "ConnectionTypeID": 25,
            "StatusTypeID": 50,
            "LevelID": 2,
            "Amps": 32,
            "Voltage": 230,
            "PowerKW": 7,
            "CurrentTypeID": 10,
            "Quantity": 4
        }
    ],
    "NumberOfPoints": 4,
    "GeneralComments": "This is an open charge unit installed at the Tesco superstore at Terra Nova Way, Penarth",
    "StatusTypeID": 50,
    "DateLastStatusUpdate": "2019-09-27T05:24:00Z",
    "DataQualityLevel": 1,
    "DateCreated": "2019-09-26T05:36:00Z",
    "SubmissionStatusTypeID": 200
}