{
    "IsRecentlyVerified": false,
    "ID": 157533,
    "UUID": "9F2E06E2-574D-48E3-8A5F-2FDDCA086969",
    "DataProviderID": 1,
    "OperatorID": 3396,
    "UsageTypeID": 1,
    "AddressInfo": {
        "ID": 157887,
        "Title": "PKN Orlen",
        "AddressLine1": "Lubelska 46",
        "Town": "Rzeszów",
        "Postcode": "35-233",
        "CountryID": 179,
        "Latitude": 50.062745073073955,
        "Longitude": 22.011331085203324,
        "RelatedURL": "https://orlencharge.orlen.pl/",
        "DistanceUnit": 0
    },
    "Connections": [
        {
            "ID": 226933,
            "ConnectionTypeID": 33,
            "StatusTypeID": 50,
            "LevelID": 3,
            "PowerKW": 50,
            "CurrentTypeID": 30,
            "Quantity": 1
        },
        {
            "ID": 226934,
            "ConnectionTypeID": 2,
            "StatusTypeID": 50,
            "LevelID": 3,
            "PowerKW": 50,
            "CurrentTypeID": 30,
            "Quantity": 1
        },
        {
            "ID": 226935,
            "ConnectionTypeID": 1036,
            "StatusTypeID": 50,
            "LevelID": 3,
            "Amps": 63,
            "Voltage": 400,
            "PowerKW": 43,
            "CurrentTypeID": 20,
            "Quantity": 1
        }
    ],
    "NumberOfPoints": 2,
    "StatusTypeID": 50,
    "DateLastStatusUpdate": "2020-06-15T17:59:00Z",
    "DataQualityLevel": 1,
    "DateCreated": "2020-06-14T08:33:00Z",
    "SubmissionStatusTypeID": 200
}