{
    "IsRecentlyVerified": false,
    "ID": 56305,
    "UUID": "36F1F0B1-E6F8-4EA6-A9CE-C08608B66F19",
    "DataProviderID": 1,
    "OperatorID": 1,
    "UsageTypeID": 6,
    "AddressInfo": {
        "ID": 56651,
        "Title": "Autohaus Gurrath",
        "AddressLine1": "Nürnberger Straße 1",
        "AddressLine2": "Külsheim",
        "Town": "Bad Windsheim",
        "StateOrProvince": "Neustadt an der Aisch-Bad Windsheim",
        "Postcode": "91438",
        "CountryID": 87,
        "Latitude": 49.5016505013064,
        "Longitude": 10.425079260852,
        "AccessComments": "Nur mit Charge&Fuel Karte. 24/7 nutzbar. Esso Tankstelle nebenan.",
        "DistanceUnit": 0
    },
    "Connections": [
        {
            "ID": 71013,
            "ConnectionTypeID": 25,
            "StatusTypeID": 50,
            "LevelID": 2,
            "Amps": 16,
            "Voltage": 230,
            "PowerKW": 3.7,
            "CurrentTypeID": 10,
            "Quantity": 1
        }
    ],
    "NumberOfPoints": 1,
    "StatusTypeID": 50,
    "DateLastStatusUpdate": "2015-10-30T07:18:00Z",
    "DataQualityLevel": 1,
    "DateCreated": "2015-10-28T14:30:00Z",
    "SubmissionStatusTypeID": 200
}