{
    "IsRecentlyVerified": false,
    "ID": 24229,
    "UUID": "47C16490-08E0-4D99-B591-7BCEDFE82003",
    "DataProviderID": 1,
    "OperatorID": 32,
    "OperatorsReference": "479",
    "UsageTypeID": 7,
    "UsageCost": "Inclusive; for Polar Plus subscription members only. Parking fees apply.",
    "AddressInfo": {
        "ID": 24574,
        "Title": "Mitchell Road Multi Storey Car Park",
        "AddressLine1": "Mitchell Road",
        "Town": "Eastleigh",
        "Postcode": "SO50 5RB",
        "CountryID": 1,
        "Latitude": 50.9677613,
        "Longitude": -1.3514262,
        "DistanceUnit": 0
    },
    "Connections": [
        {
            "ID": 26318,
            "ConnectionTypeID": 25,
            "StatusTypeID": 50,
            "LevelID": 2,
            "Amps": 32,
            "Voltage": 230,
            "PowerKW": 7,
            "CurrentTypeID": 10,
            "Quantity": 1
        },
        {
            "ID": 26319,
            "ConnectionTypeID": 3,
            "StatusTypeID": 50,
            "LevelID": 2,
            "Amps": 13,
            "Voltage": 230,
            "PowerKW": 3,
            "CurrentTypeID": 10,
            "Quantity": 1
        }
    ],
    "NumberOfPoints": 2,
    "GeneralComments": "Behind barrier. Pay for parking approx. £1.30ph. NOT 24hr, requires staff assistance available 6am-6pm only. ",
    "StatusTypeID": 50,
    "DateLastStatusUpdate": "2019-03-09T06:23:00Z",
    "MetadataValues": [
        {
            "ID": 1011,
            "MetadataFieldID": 4,
            "ItemValue": "Data © OpenStreetMap contributors, ODbL 1.0. http://www.openstreetmap.org/copyright"
        }
    ],
    "DataQualityLevel": 1,
    "DateCreated": "2014-07-24T01:27:00Z",
    "SubmissionStatusTypeID": 200
}