{
    "IsRecentlyVerified": false,
    "ID": 16491,
    "UUID": "A72BCA68-2DAC-49B5-A34D-5BFA397A58EE",
    "DataProviderID": 2,
    "DataProvidersReference": "51536",
    "UsageTypeID": 1,
    "AddressInfo": {
        "ID": 16836,
        "Title": "Metro Lighting",
        "AddressLine1": "17485 N Outer 40 Rd",
        "Town": "Chesterfield",
        "StateOrProvince": "MO",
        "Postcode": "63005",
        "CountryID": 2,
        "Latitude": 38.67599,
        "Longitude": -90.608208,
        "ContactTelephone1": "314-963-8330",
        "AccessComments": "24 hours daily",
        "RelatedURL": "",
        "DistanceUnit": 0
    },
    "Connections": [
        {
            "ID": 16971,
            "ConnectionTypeID": 1,
            "LevelID": 2,
            "Amps": 16,
            "Voltage": 230,
            "PowerKW": 3,
            "CurrentTypeID": 10,
            "Quantity": 1
        },
        {
            "ID": 22180,
            "ConnectionTypeID": 1,
            "LevelID": 2,
            "Quantity": 1
        }
    ],
    "DateLastStatusUpdate": "2019-04-06T04:03:00Z",
    "DataQualityLevel": 3,
    "DateCreated": "2013-04-29T04:56:00Z",
    "SubmissionStatusTypeID": 100
}