{
    "IsRecentlyVerified": false,
    "ID": 17449,
    "UUID": "79DE0619-7695-467D-BD12-25DCB8D4C9E3",
    "DataProviderID": 22,
    "DataProvidersReference": "F38575EE8AF23BA6D923C0D98EE767FC",
    "AddressInfo": {
        "ID": 17794,
        "Title": "福山日産自動車蔵王店",
        "AddressLine1": "広島県福山市南蔵王町2丁目26-39",
        "CountryID": 114,
        "Latitude": 34.50363048,
        "Longitude": 133.3977904,
        "ContactTelephone1": "084-925-5523",
        "DistanceUnit": 0
    },
    "Connections": [
        {
            "ID": 17690,
            "ConnectionTypeID": 2,
            "LevelID": 2,
            "Amps": 100,
            "Voltage": 480,
            "PowerKW": 48,
            "Quantity": 1
        }
    ],
    "DateLastStatusUpdate": "2013-06-29T08:58:00Z",
    "DataQualityLevel": 2,
    "DateCreated": "2013-06-29T08:58:00Z",
    "SubmissionStatusTypeID": 200
}