{
    "IsRecentlyVerified": false,
    "ID": 155760,
    "UUID": "4D20907F-097F-4C53-87F7-BBEB06B90DAD",
    "DataProviderID": 1,
    "OperatorID": 80,
    "UsageTypeID": 4,
    "AddressInfo": {
        "ID": 156114,
        "Title": "Villa Fontana Bersani | EnelX",
        "AddressLine1": "Piazza Gaetano Bersani",
        "AddressLine2": "Villa Fontana",
        "Town": "Medicina",
        "StateOrProvince": "BO",
        "Postcode": "40060",
        "CountryID": 112,
        "Latitude": 44.49577150381333,
        "Longitude": 11.610731331119496,
        "RelatedURL": "https://www.enelx.com/it/it/emobility",
        "DistanceUnit": 0
    },
    "Connections": [
        {
            "ID": 219324,
            "ConnectionTypeID": 25,
            "StatusTypeID": 50,
            "LevelID": 2,
            "Amps": 32,
            "Voltage": 400,
            "PowerKW": 22,
            "CurrentTypeID": 20,
            "Quantity": 2
        }
    ],
    "NumberOfPoints": 2,
    "StatusTypeID": 50,
    "DateLastStatusUpdate": "2020-04-23T15:24:00Z",
    "DataQualityLevel": 1,
    "DateCreated": "2020-04-23T15:24:00Z",
    "SubmissionStatusTypeID": 200
}