{
    "IsRecentlyVerified": false,
    "ID": 71646,
    "UUID": "8B1654B3-D85F-44B9-8692-446C50CFD980",
    "DataProviderID": 1,
    "DataProvidersReference": "3517",
    "AddressInfo": {
        "ID": 71992,
        "Title": "Sala Heby Energi Snabbladdning",
        "AddressLine1": "Kålgårdsgatan 3",
        "Town": "SALA",
        "StateOrProvince": "VÄSTMANLAND",
        "Postcode": "73331",
        "CountryID": 216,
        "Latitude": 59.91914,
        "Longitude": 16.61225,
        "AccessComments": "Vid befintlig parkeringsplats",
        "DistanceUnit": 0
    },
    "Connections": [
        {
            "ID": 102533,
            "ConnectionTypeID": 0,
            "Reference": "1",
            "LevelID": 2,
            "Amps": 100,
            "Voltage": 500,
            "PowerKW": 50,
            "Comments": "Mode 4"
        },
        {
            "ID": 102534,
            "ConnectionTypeID": 0,
            "Reference": "2",
            "LevelID": 2,
            "Amps": 100,
            "Voltage": 500,
            "PowerKW": 50,
            "Comments": "Mode 4"
        },
        {
            "ID": 102535,
            "ConnectionTypeID": 0,
            "Reference": "3",
            "LevelID": 2,
            "Amps": 63,
            "Voltage": 400,
            "PowerKW": 43,
            "Comments": "Mode 3"
        }
    ],
    "NumberOfPoints": 3,
    "DateLastStatusUpdate": "2020-05-26T08:23:00Z",
    "DataQualityLevel": 2,
    "DateCreated": "2016-09-02T11:12:00Z",
    "SubmissionStatusTypeID": 100
}