{
    "IsRecentlyVerified": false,
    "ID": 177916,
    "UUID": "ED6A55E6-8CE7-4D23-8735-70B61B6481E9",
    "DataProviderID": 29,
    "DataProvidersReference": "14156",
    "AddressInfo": {
        "ID": 178275,
        "Title": "Robert-Bosch-Str. 38",
        "AddressLine1": "Robert-Bosch-Str. 38",
        "Town": "Freudenstadt",
        "Postcode": "72250",
        "CountryID": 87,
        "Latitude": 48.463706,
        "Longitude": 8.434861,
        "DistanceUnit": 0
    },
    "Connections": [
        {
            "ID": 277660,
            "ConnectionTypeID": 25,
            "StatusTypeID": 50,
            "LevelID": 2,
            "PowerKW": 22,
            "CurrentTypeID": 20
        },
        {
            "ID": 277661,
            "ConnectionTypeID": 25,
            "StatusTypeID": 50,
            "LevelID": 2,
            "PowerKW": 22,
            "CurrentTypeID": 20
        }
    ],
    "StatusTypeID": 0,
    "DateLastStatusUpdate": "2021-07-09T03:12:00Z",
    "MetadataValues": [
        {
            "ID": 10210,
            "MetadataFieldID": 4,
            "ItemValue": "Data from the German chargepoint registry provided by Bundesnetzagentur.de under the CC-BY 4.0 license"
        }
    ],
    "DataQualityLevel": 3,
    "DateCreated": "2021-07-08T09:49:00Z",
    "SubmissionStatusTypeID": 100
}