{
    "IsRecentlyVerified": false,
    "ID": 158807,
    "UUID": "92E058C5-2D95-4EB0-8A06-58EEDECA3322",
    "DataProviderID": 2,
    "DataProvidersReference": "152841",
    "OperatorID": 3293,
    "UsageTypeID": 1,
    "AddressInfo": {
        "ID": 159164,
        "Title": "The Shops on Lake Avenue",
        "AddressLine1": "401 S Lake Ave",
        "Town": "Pasadena",
        "StateOrProvince": "CA",
        "Postcode": "91101",
        "CountryID": 2,
        "Latitude": 34.13935,
        "Longitude": -118.133612,
        "ContactTelephone1": "888-264-2208",
        "AccessComments": "6am-12pm daily",
        "RelatedURL": "https://voltacharging.com/",
        "DistanceUnit": 0
    },
    "Connections": [
        {
            "ID": 228841,
            "ConnectionTypeID": 1,
            "LevelID": 2,
            "Amps": 16,
            "Voltage": 230,
            "PowerKW": 3.7,
            "CurrentTypeID": 10,
            "Quantity": 2
        }
    ],
    "StatusTypeID": 50,
    "DateLastStatusUpdate": "2020-06-26T02:57:00Z",
    "DataQualityLevel": 3,
    "DateCreated": "2020-06-26T02:57:00Z",
    "SubmissionStatusTypeID": 100
}