{
    "IsRecentlyVerified": false,
    "ID": 184536,
    "UUID": "12907785-445B-405A-956F-431208698729",
    "DataProviderID": 29,
    "DataProvidersReference": "101",
    "OperatorID": 86,
    "AddressInfo": {
        "ID": 184895,
        "Title": "Kleinbanstr. 2",
        "AddressLine1": "Kleinbanstr. 2",
        "Town": "Salzwedel ",
        "Postcode": "29410",
        "CountryID": 87,
        "Latitude": 52.856866,
        "Longitude": 11.165122,
        "DistanceUnit": 0
    },
    "Connections": [
        {
            "ID": 292931,
            "ConnectionTypeID": 33,
            "StatusTypeID": 50,
            "LevelID": 3,
            "PowerKW": 150,
            "CurrentTypeID": 30
        },
        {
            "ID": 292932,
            "ConnectionTypeID": 33,
            "StatusTypeID": 50,
            "LevelID": 3,
            "PowerKW": 150,
            "CurrentTypeID": 30
        }
    ],
    "StatusTypeID": 50,
    "DateLastStatusUpdate": "2021-07-09T03:28:00Z",
    "MetadataValues": [
        {
            "ID": 16827,
            "MetadataFieldID": 4,
            "ItemValue": "Data from the German chargepoint registry provided by Bundesnetzagentur.de under the CC-BY 4.0 license"
        }
    ],
    "DataQualityLevel": 3,
    "DateCreated": "2021-07-08T10:05:00Z",
    "SubmissionStatusTypeID": 100
}