{
    "IsRecentlyVerified": false,
    "ID": 27790,
    "UUID": "9EA2DE61-53F9-4468-9166-4C1075C52C6F",
    "DataProviderID": 2,
    "DataProvidersReference": "46518",
    "OperatorID": 5,
    "UsageTypeID": 1,
    "AddressInfo": {
        "ID": 28136,
        "Title": "DGS MAIN",
        "AddressLine1": "707 3rd St",
        "Town": "West Sacramento",
        "StateOrProvince": "CA",
        "Postcode": "95605",
        "CountryID": 2,
        "Latitude": 38.583377,
        "Longitude": -121.510851,
        "ContactTelephone1": "888-758-4389",
        "AccessComments": "24 hours daily",
        "RelatedURL": "http://www.chargepoint.com/",
        "DistanceUnit": 0
    },
    "Connections": [
        {
            "ID": 30504,
            "ConnectionTypeID": 1,
            "LevelID": 2,
            "Amps": 16,
            "Voltage": 230,
            "PowerKW": 3,
            "CurrentTypeID": 10,
            "Quantity": 2
        }
    ],
    "DateLastStatusUpdate": "2019-04-06T04:03:00Z",
    "DataQualityLevel": 3,
    "DateCreated": "2014-11-28T03:38:00Z",
    "SubmissionStatusTypeID": 100
}