{
    "IsRecentlyVerified": false,
    "ID": 160256,
    "UUID": "2749B79F-94F3-43E1-B6F3-D90FB69264A6",
    "DataProviderID": 2,
    "DataProvidersReference": "154078",
    "OperatorID": 5,
    "UsageTypeID": 1,
    "AddressInfo": {
        "ID": 160613,
        "Title": "BHHD",
        "AddressLine1": "2820 Harley Dr",
        "Town": "Rapid City",
        "StateOrProvince": "SD",
        "Postcode": "57702",
        "CountryID": 2,
        "Latitude": 44.1140194,
        "Longitude": -103.2678366,
        "ContactTelephone1": "888-758-4389",
        "AccessComments": "24 hours daily",
        "RelatedURL": "http://www.chargepoint.com/",
        "DistanceUnit": 0
    },
    "Connections": [
        {
            "ID": 230570,
            "ConnectionTypeID": 32,
            "LevelID": 3,
            "Amps": 100,
            "Voltage": 400,
            "PowerKW": 40,
            "CurrentTypeID": 30,
            "Quantity": 1
        }
    ],
    "StatusTypeID": 50,
    "DateLastStatusUpdate": "2020-06-26T03:07:00Z",
    "DataQualityLevel": 3,
    "DateCreated": "2020-06-26T03:07:00Z",
    "SubmissionStatusTypeID": 100
}