{
    "IsRecentlyVerified": false,
    "ID": 145945,
    "UUID": "CF27FBA3-27EE-42CA-950F-9607D0256162",
    "DataProviderID": 1,
    "OperatorID": 3,
    "OperatorsReference": "PG-70162,PG-84074",
    "UsageTypeID": 4,
    "UsageCost": "Free",
    "AddressInfo": {
        "ID": 146297,
        "Title": "Tesco Superstore-Barnstaple",
        "AddressLine1": "Rose Lane",
        "Town": "Barnstaple",
        "Postcode": "EX32 8PG",
        "CountryID": 1,
        "Latitude": 51.073121,
        "Longitude": -4.037056,
        "DistanceUnit": 0
    },
    "Connections": [
        {
            "ID": 202824,
            "ConnectionTypeID": 25,
            "StatusTypeID": 50,
            "LevelID": 2,
            "Amps": 32,
            "Voltage": 230,
            "PowerKW": 7,
            "CurrentTypeID": 10,
            "Quantity": 4
        }
    ],
    "NumberOfPoints": 4,
    "GeneralComments": "This is an open charge unit installed at the Tesco Superstore at Rose Lane, Barnstaple",
    "StatusTypeID": 50,
    "DateLastStatusUpdate": "2019-12-30T16:29:00Z",
    "DataQualityLevel": 1,
    "DateCreated": "2019-12-30T15:35:00Z",
    "SubmissionStatusTypeID": 200
}