{
    "UserComments": [
        {
            "ID": 19214,
            "ChargePointID": 66715,
            "CommentTypeID": 10,
            "UserName": "ForumElettrico.it",
            "RelatedURL": "https://www.forumelettrico.it/forum/colonnina-iper-di-arese-t2221.html",
            "DateCreated": "2018-02-20T09:39:52.047Z",
            "User": {
                "ID": 11749,
                "Username": "ForumElettrico.it"
            },
            "CheckinStatusTypeID": 0
        },
        {
            "ID": 19213,
            "ChargePointID": 66715,
            "CommentTypeID": 10,
            "UserName": "ForumElettrico.it",
            "Comment": "https://www.forumelettrico.it/forum/colonnina-iper-di-arese-t2221.html\n",
            "DateCreated": "2018-02-20T09:39:44.447Z",
            "User": {
                "ID": 11749,
                "Username": "ForumElettrico.it"
            },
            "CheckinStatusTypeID": 10
        }
    ],
    "MediaItems": [
        {
            "ID": 15098,
            "ChargePointID": 66715,
            "ItemURL": "https://s3-ap-southeast-2.amazonaws.com/openchargemap/images/IT/OCM66715/OCM-66715.orig.2018022009400707.jpg",
            "ItemThumbnailURL": "https://s3-ap-southeast-2.amazonaws.com/openchargemap/images/IT/OCM66715/OCM-66715.thmb.2018022009400707.jpg",
            "Comment": "",
            "IsEnabled": true,
            "IsVideo": false,
            "IsFeaturedItem": false,
            "IsExternalResource": false,
            "User": {
                "ID": 11749,
                "Username": "ForumElettrico.it"
            },
            "DateCreated": "2018-02-20T09:40:00Z"
        }
    ],
    "IsRecentlyVerified": false,
    "ID": 66715,
    "UUID": "0D8648C7-2705-4780-8F71-6532445BCD92",
    "DataProviderID": 1,
    "OperatorID": 84,
    "UsageTypeID": 4,
    "UsageCost": "free",
    "AddressInfo": {
        "ID": 67061,
        "Title": "Centro Commeciale Il Centro - Stazione B",
        "AddressLine1": "Via Giuseppe Eugenio Luraghi, 11",
        "Town": "Arese",
        "StateOrProvince": "MI",
        "Postcode": "20020",
        "CountryID": 112,
        "Latitude": 45.5631240406899,
        "Longitude": 9.05188216423109,
        "ContactTelephone1": "02/27208182",
        "ContactTelephone2": "Fax: 02/25390451",
        "ContactEmail": "info@classonlus.it",
        "AccessComments": "B - Fila 34 Parcheggio Interrato Magenta",
        "RelatedURL": "http://greenlandmobility.it/",
        "DistanceUnit": 0
    },
    "Connections": [
        {
            "ID": 92196,
            "ConnectionTypeID": 25,
            "StatusTypeID": 50,
            "LevelID": 2,
            "Quantity": 4
        }
    ],
    "NumberOfPoints": 4,
    "StatusTypeID": 50,
    "DateLastStatusUpdate": "2018-02-20T09:40:00Z",
    "DataQualityLevel": 1,
    "DateCreated": "2016-05-27T15:57:00Z",
    "SubmissionStatusTypeID": 200
}