{
    "UserComments": [
        {
            "ID": 24612,
            "ChargePointID": 175599,
            "CommentTypeID": 10,
            "UserName": "Gandalf",
            "DateCreated": "2021-07-18T07:56:16.14Z",
            "User": {
                "ID": 31820,
                "Username": "Gandalf"
            },
            "CheckinStatusTypeID": 140,
            "IsActionedByEditor": false
        }
    ],
    "MediaItems": [
        {
            "ID": 28279,
            "ChargePointID": 175599,
            "ItemURL": "https://s3-ap-southeast-2.amazonaws.com/openchargemap/images/PL/OCM175599/OCM-175599.orig.2021062323120466.jpg",
            "ItemThumbnailURL": "https://s3-ap-southeast-2.amazonaws.com/openchargemap/images/PL/OCM175599/OCM-175599.thmb.2021062323120466.jpg",
            "Comment": "",
            "IsEnabled": true,
            "IsVideo": false,
            "IsFeaturedItem": false,
            "IsExternalResource": false,
            "User": {
                "ID": 31820,
                "Username": "Gandalf"
            },
            "DateCreated": "2021-06-23T23:12:00Z"
        }
    ],
    "IsRecentlyVerified": false,
    "ID": 175599,
    "UUID": "5F2878A9-6D92-4F94-ABFA-138493432328",
    "DataProviderID": 1,
    "OperatorID": 3453,
    "UsageTypeID": 1,
    "UsageCost": "1.19 PLN/kWh",
    "AddressInfo": {
        "ID": 175958,
        "Title": "Dworzec PKP Katowice Ligota",
        "AddressLine1": "Franciszkańska 1",
        "Town": "Katowice",
        "StateOrProvince": "Silesian Voivodeship",
        "Postcode": "40-706",
        "CountryID": 179,
        "Latitude": 50.226345,
        "Longitude": 18.977354,
        "DistanceUnit": 0
    },
    "Connections": [
        {
            "ID": 272632,
            "ConnectionTypeID": 25,
            "StatusTypeID": 50,
            "LevelID": 2,
            "Amps": 32,
            "Voltage": 230,
            "PowerKW": 22,
            "CurrentTypeID": 20,
            "Quantity": 2
        }
    ],
    "NumberOfPoints": 2,
    "GeneralComments": "1 PLN/kWh z kodem rabatowym Blikom. Od września 1.25 PLN/kWh",
    "StatusTypeID": 50,
    "DateLastStatusUpdate": "2021-07-18T07:56:00Z",
    "DataQualityLevel": 1,
    "DateCreated": "2021-05-30T17:34:00Z",
    "SubmissionStatusTypeID": 200
}