{
    "IsRecentlyVerified": false,
    "ID": 130074,
    "UUID": "328633EA-4A55-4458-B7BD-51B54AFA0EE5",
    "DataProviderID": 1,
    "OperatorID": 80,
    "UsageTypeID": 4,
    "AddressInfo": {
        "ID": 130420,
        "Title": "Sant'Andrea del Garigliano",
        "AddressLine1": "Via Bocca la Villa 1",
        "Town": "Sant'Andrea del Garigliano",
        "StateOrProvince": "FR",
        "Postcode": "03040",
        "CountryID": 112,
        "Latitude": 41.3562049992363,
        "Longitude": 13.862447237721199,
        "ContactTelephone1": "800.069.850",
        "AccessComments": "Posizione esatta da verificare",
        "RelatedURL": "https://www.enelx.com/it/it/emobility",
        "DistanceUnit": 0
    },
    "Connections": [
        {
            "ID": 182069,
            "ConnectionTypeID": 25,
            "StatusTypeID": 150,
            "LevelID": 2,
            "Amps": 32,
            "Voltage": 400,
            "PowerKW": 22,
            "CurrentTypeID": 20,
            "Quantity": 1
        },
        {
            "ID": 182070,
            "ConnectionTypeID": 36,
            "StatusTypeID": 150,
            "LevelID": 2,
            "Amps": 16,
            "Voltage": 240,
            "PowerKW": 3.7,
            "CurrentTypeID": 10,
            "Quantity": 1
        }
    ],
    "NumberOfPoints": 2,
    "StatusTypeID": 150,
    "DateLastStatusUpdate": "2019-07-30T15:33:00Z",
    "DataQualityLevel": 1,
    "DateCreated": "2019-07-30T15:33:00Z",
    "SubmissionStatusTypeID": 200
}