{
    "IsRecentlyVerified": false,
    "ID": 136426,
    "UUID": "15BADDBA-8929-44E5-9DF0-F5DD88E035AA",
    "DataProviderID": 18,
    "DataProvidersReference": "23b667dfda9004cb8af1cf7d82a082b2",
    "OperatorID": 2244,
    "UsageTypeID": 5,
    "AddressInfo": {
        "ID": 136772,
        "Title": "110 Barnsbury Road",
        "AddressLine1": "110 Barnsbury Road",
        "Town": "London",
        "Postcode": "N1 0ER",
        "CountryID": 1,
        "Latitude": 51.537043,
        "Longitude": -0.110754,
        "AccessComments": "",
        "RelatedURL": "https://www.ubitricity.com",
        "DistanceUnit": 0
    },
    "Connections": [
        {
            "ID": 190872,
            "ConnectionTypeID": 25,
            "Reference": "suby1100000419",
            "StatusTypeID": 50,
            "LevelID": 2,
            "Amps": 16,
            "Voltage": 230,
            "PowerKW": 3.7,
            "CurrentTypeID": 10
        }
    ],
    "StatusTypeID": 0,
    "DateLastStatusUpdate": "2021-04-25T05:46:00Z",
    "MetadataValues": [
        {
            "ID": 6278,
            "MetadataFieldID": 4,
            "ItemValue": "Contains public sector information licensed under the Open Government Licence v2.0. http://www.nationalarchives.gov.uk/doc/open-government-licence/version/2/"
        }
    ],
    "DataQualityLevel": 3,
    "DateCreated": "2019-12-24T05:22:00Z",
    "SubmissionStatusTypeID": 100
}