{
    "IsRecentlyVerified": false,
    "ID": 97540,
    "UUID": "E106BF19-C113-445F-8279-2488FA6DA44F",
    "DataProviderID": 1,
    "OperatorID": 23,
    "OperatorsReference": "38614",
    "UsageTypeID": 4,
    "AddressInfo": {
        "ID": 97886,
        "Title": "Outlet Center Wadgassen",
        "AddressLine1": "Saarstrasse 20",
        "Town": "Wadgassen",
        "Postcode": "66787",
        "CountryID": 87,
        "Latitude": 49.269966,
        "Longitude": 6.793246,
        "ContactTelephone1": "+49 6819 380450",
        "DistanceUnit": 0
    },
    "Connections": [
        {
            "ID": 138447,
            "ConnectionTypeID": 30,
            "StatusTypeID": 50,
            "LevelID": 2,
            "Amps": 16,
            "Voltage": 400,
            "PowerKW": 11,
            "CurrentTypeID": 20,
            "Quantity": 2
        }
    ],
    "NumberOfPoints": 2,
    "GeneralComments": "2 Tesla Connectors, up to 11kW.Available for customers. Self park.",
    "StatusTypeID": 50,
    "DateLastStatusUpdate": "2018-10-03T18:03:00Z",
    "DataQualityLevel": 1,
    "DateCreated": "2018-01-21T15:42:00Z",
    "SubmissionStatusTypeID": 200
}