{
    "IsRecentlyVerified": false,
    "ID": 159689,
    "UUID": "74BAC453-F89B-4C8D-8563-BD569FF6E88F",
    "DataProviderID": 2,
    "DataProvidersReference": "152349",
    "OperatorID": 5,
    "UsageTypeID": 1,
    "AddressInfo": {
        "ID": 160046,
        "Title": "BNE MASTER",
        "AddressLine1": "675 Monmouth St",
        "Town": "Jersey City",
        "StateOrProvince": "NJ",
        "Postcode": "07310",
        "CountryID": 2,
        "Latitude": 40.735438,
        "Longitude": -74.047445,
        "ContactTelephone1": "888-758-4389",
        "AccessComments": "24 hours daily",
        "RelatedURL": "http://www.chargepoint.com/",
        "DistanceUnit": 0
    },
    "Connections": [
        {
            "ID": 229894,
            "ConnectionTypeID": 1,
            "LevelID": 2,
            "Amps": 16,
            "Voltage": 230,
            "PowerKW": 3.7,
            "CurrentTypeID": 10,
            "Quantity": 4
        }
    ],
    "StatusTypeID": 50,
    "DateLastStatusUpdate": "2020-06-26T03:03:00Z",
    "DataQualityLevel": 3,
    "DateCreated": "2020-06-26T03:03:00Z",
    "SubmissionStatusTypeID": 100
}