{
    "IsRecentlyVerified": false,
    "ID": 139415,
    "UUID": "FE0F4A31-37D1-42D1-AF87-86901E088DDB",
    "DataProviderID": 2,
    "DataProvidersReference": "150356",
    "OperatorID": 15,
    "UsageTypeID": 1,
    "AddressInfo": {
        "ID": 139767,
        "Title": "Courtyard Anaheim Buena Park",
        "AddressLine1": "7621 Beach Blvd",
        "Town": "Buena Park",
        "StateOrProvince": "CA",
        "Postcode": "90620",
        "CountryID": 2,
        "Latitude": 33.852559,
        "Longitude": -117.999998,
        "ContactTelephone1": "877-455-3833",
        "AccessComments": "24 hours daily",
        "RelatedURL": "https://www.evgo.com/",
        "DistanceUnit": 0
    },
    "Connections": [
        {
            "ID": 194769,
            "ConnectionTypeID": 2,
            "LevelID": 3,
            "Amps": 100,
            "Voltage": 400,
            "PowerKW": 40,
            "CurrentTypeID": 30,
            "Quantity": 1
        },
        {
            "ID": 194770,
            "ConnectionTypeID": 32,
            "LevelID": 3,
            "Amps": 100,
            "Voltage": 400,
            "PowerKW": 40,
            "CurrentTypeID": 30,
            "Quantity": 1
        }
    ],
    "StatusTypeID": 50,
    "DateLastStatusUpdate": "2020-06-26T02:56:00Z",
    "DataQualityLevel": 3,
    "DateCreated": "2019-12-24T09:10:00Z",
    "SubmissionStatusTypeID": 100
}