{
    "IsRecentlyVerified": false,
    "ID": 144681,
    "UUID": "91BAB9FC-BE9A-4EA2-BE18-534C96E334A1",
    "DataProviderID": 2,
    "DataProvidersReference": "130758",
    "OperatorID": 90,
    "UsageTypeID": 1,
    "AddressInfo": {
        "ID": 145033,
        "Title": "Ville de St-Eustache",
        "AddressLine1": "220 boul. Arthur-Sauvé",
        "Town": "Saint-Eustache",
        "StateOrProvince": "QC",
        "Postcode": "J7R 2H9",
        "CountryID": 44,
        "Latitude": 45.560481,
        "Longitude": -73.89561,
        "ContactTelephone1": "877-505-2674",
        "AccessComments": "24 hours daily",
        "RelatedURL": "https://lecircuitelectrique.com/",
        "DistanceUnit": 0
    },
    "Connections": [
        {
            "ID": 201195,
            "ConnectionTypeID": 1,
            "LevelID": 2,
            "Amps": 16,
            "Voltage": 230,
            "PowerKW": 3.7,
            "CurrentTypeID": 10,
            "Quantity": 1
        }
    ],
    "StatusTypeID": 50,
    "DateLastStatusUpdate": "2020-06-26T03:09:00Z",
    "DataQualityLevel": 3,
    "DateCreated": "2019-12-24T09:23:00Z",
    "SubmissionStatusTypeID": 100
}