{
    "IsRecentlyVerified": false,
    "ID": 150520,
    "UUID": "0384ABD0-7E30-4CA2-B800-A4F623F8A604",
    "DataProviderID": 28,
    "DataProvidersReference": "FR*S83*P83063*A",
    "UsageTypeID": 5,
    "AddressInfo": {
        "ID": 150873,
        "Title": "LA GARDE FREINET_Rue De La Mairie",
        "AddressLine1": "Rue De La Mairie 83680 LA GARDE FREINET",
        "CountryID": 80,
        "Latitude": 43.317779,
        "Longitude": 6.46939,
        "AccessComments": "24/24 7/7 jours",
        "DistanceUnit": 0
    },
    "Connections": [
        {
            "ID": 209352,
            "ConnectionTypeID": 28,
            "StatusTypeID": 50,
            "LevelID": 2,
            "PowerKW": 22,
            "CurrentTypeID": 10
        },
        {
            "ID": 209353,
            "ConnectionTypeID": 1036,
            "StatusTypeID": 50,
            "LevelID": 2,
            "PowerKW": 22,
            "CurrentTypeID": 20
        },
        {
            "ID": 238404,
            "ConnectionTypeID": 28,
            "StatusTypeID": 50,
            "LevelID": 2,
            "PowerKW": 22,
            "CurrentTypeID": 10
        },
        {
            "ID": 238405,
            "ConnectionTypeID": 1036,
            "StatusTypeID": 50,
            "LevelID": 2,
            "PowerKW": 22,
            "CurrentTypeID": 20
        }
    ],
    "GeneralComments": "",
    "StatusTypeID": 50,
    "DateLastStatusUpdate": "2020-08-27T05:10:00Z",
    "DataQualityLevel": 2,
    "DateCreated": "2020-03-15T06:17:00Z",
    "SubmissionStatusTypeID": 100
}