{
    "IsRecentlyVerified": false,
    "ID": 53500,
    "UUID": "B1A8518C-06C9-4236-B098-FBE7F9728B32",
    "DataProviderID": 1,
    "DataProvidersReference": "2983",
    "AddressInfo": {
        "ID": 53846,
        "Title": "Visby Golfklubb",
        "AddressLine1": "Västergran Kronholmen 415",
        "Town": "GOTLANDS TOFTA",
        "StateOrProvince": "GOTLAND",
        "Postcode": "62230",
        "CountryID": 216,
        "Latitude": 57.44299,
        "Longitude": 18.13251,
        "AccessComments": "Till vänster på den inre parkeringsplatsen.",
        "DistanceUnit": 0
    },
    "Connections": [
        {
            "ID": 66621,
            "ConnectionTypeID": 0,
            "Reference": "1",
            "LevelID": 2,
            "Amps": 16,
            "Voltage": 230,
            "PowerKW": 3.7,
            "Comments": "Mode 3"
        },
        {
            "ID": 87838,
            "ConnectionTypeID": 0,
            "Reference": "2",
            "LevelID": 2,
            "Amps": 16,
            "Voltage": 230,
            "PowerKW": 3.7,
            "Comments": "Mode 1"
        }
    ],
    "NumberOfPoints": 2,
    "DateLastStatusUpdate": "2020-05-26T08:21:00Z",
    "DataQualityLevel": 2,
    "DateCreated": "2015-09-20T11:33:00Z",
    "SubmissionStatusTypeID": 100
}