{
    "IsRecentlyVerified": false,
    "ID": 185661,
    "UUID": "B2987E12-FDE8-4F2F-B0CB-48C22B6CAE9F",
    "DataProviderID": 29,
    "DataProvidersReference": "17071",
    "OperatorID": 45,
    "AddressInfo": {
        "ID": 186020,
        "Title": "Königsbergerstr. 22",
        "AddressLine1": "Königsbergerstr. 22",
        "Town": "Kehl",
        "Postcode": "77694",
        "CountryID": 87,
        "Latitude": 48.5772,
        "Longitude": 7.8154,
        "DistanceUnit": 0
    },
    "Connections": [
        {
            "ID": 295921,
            "ConnectionTypeID": 25,
            "StatusTypeID": 50,
            "LevelID": 2,
            "PowerKW": 11,
            "CurrentTypeID": 20
        },
        {
            "ID": 295922,
            "ConnectionTypeID": 1036,
            "StatusTypeID": 50,
            "LevelID": 2,
            "PowerKW": 11,
            "CurrentTypeID": 20
        },
        {
            "ID": 295923,
            "ConnectionTypeID": 1036,
            "StatusTypeID": 50,
            "LevelID": 3,
            "PowerKW": 45,
            "CurrentTypeID": 30
        },
        {
            "ID": 295924,
            "ConnectionTypeID": 33,
            "StatusTypeID": 50,
            "LevelID": 3,
            "PowerKW": 45,
            "CurrentTypeID": 30
        },
        {
            "ID": 295925,
            "ConnectionTypeID": 1036,
            "StatusTypeID": 50,
            "LevelID": 3,
            "PowerKW": 45,
            "CurrentTypeID": 30
        },
        {
            "ID": 295926,
            "ConnectionTypeID": 2,
            "StatusTypeID": 50,
            "LevelID": 3,
            "PowerKW": 45,
            "CurrentTypeID": 30
        }
    ],
    "StatusTypeID": 50,
    "DateLastStatusUpdate": "2021-07-12T02:41:00Z",
    "MetadataValues": [
        {
            "ID": 17905,
            "MetadataFieldID": 4,
            "ItemValue": "Data from the German chargepoint registry provided by Bundesnetzagentur.de under the CC-BY 4.0 license"
        }
    ],
    "DataQualityLevel": 3,
    "DateCreated": "2021-07-12T02:41:00Z",
    "SubmissionStatusTypeID": 100
}