{
    "IsRecentlyVerified": false,
    "ID": 85942,
    "UUID": "86BBED80-CCDA-42C5-B921-8223190F3324",
    "DataProviderID": 1,
    "OperatorID": 220,
    "OperatorsReference": "29004",
    "UsageTypeID": 4,
    "UsageCost": "€1.73 + €0.3213/kWh; Andere Tarife möglich",
    "AddressInfo": {
        "ID": 86288,
        "Title": "Uhlenkrog 32",
        "AddressLine1": "Uhlenkrog 32",
        "Town": "Hassee",
        "StateOrProvince": "Kiel",
        "Postcode": "24113",
        "CountryID": 87,
        "Latitude": 54.309755,
        "Longitude": 10.096843,
        "DistanceUnit": 0
    },
    "Connections": [],
    "NumberOfPoints": 2,
    "GeneralComments": "Parkplatz P5, über Tor 2 zu erreichen",
    "StatusTypeID": 50,
    "DateLastStatusUpdate": "2017-04-20T23:28:00Z",
    "DataQualityLevel": 1,
    "DateCreated": "2017-04-20T14:05:00Z",
    "SubmissionStatusTypeID": 200
}