{
    "IsRecentlyVerified": false,
    "ID": 40997,
    "UUID": "EE4A6B7B-2855-4ABC-876A-A81E17A6B1B2",
    "DataProviderID": 1,
    "OperatorID": 19,
    "UsageTypeID": 1,
    "UsageCost": "",
    "AddressInfo": {
        "ID": 41343,
        "Title": "Tayside Hotel ",
        "AddressLine1": "51 Mill Street ",
        "AddressLine2": "",
        "Town": "Stanley ",
        "StateOrProvince": "Perthshire ",
        "Postcode": "PH1 4NL",
        "CountryID": 1,
        "Latitude": 56.483485,
        "Longitude": -3.447802,
        "ContactTelephone1": "01738 828 249",
        "ContactTelephone2": "",
        "ContactEmail": "reception@taysidehotel.co.uk",
        "AccessComments": "",
        "RelatedURL": "http://www.taysidehotel.co.uk",
        "DistanceUnit": 0
    },
    "Connections": [
        {
            "ID": 44693,
            "ConnectionTypeID": 25,
            "StatusTypeID": 50,
            "LevelID": 2,
            "Amps": 32,
            "Voltage": 230,
            "PowerKW": 7,
            "CurrentTypeID": 10,
            "Quantity": 1
        }
    ],
    "NumberOfPoints": 1,
    "GeneralComments": "",
    "StatusTypeID": 50,
    "DateLastStatusUpdate": "2015-01-20T17:23:00Z",
    "DataQualityLevel": 1,
    "DateCreated": "2015-01-20T10:29:00Z",
    "SubmissionStatusTypeID": 200
}