{
    "IsRecentlyVerified": false,
    "ID": 149979,
    "UUID": "2B06E8B5-4857-4483-B505-9A08D938624F",
    "DataProviderID": 1,
    "OperatorID": 1,
    "UsageTypeID": 1,
    "UsageCost": "0",
    "AddressInfo": {
        "ID": 150332,
        "Title": "Station Winxo Imintanoute",
        "AddressLine1": "Autoroute A3",
        "Town": "Imintanoute",
        "CountryID": 153,
        "Latitude": 31.025242606493578,
        "Longitude": -9.025250418206952,
        "DistanceUnit": 0
    },
    "Connections": [
        {
            "ID": 208234,
            "ConnectionTypeID": 25,
            "StatusTypeID": 50,
            "LevelID": 2,
            "Amps": 32,
            "Voltage": 380,
            "PowerKW": 22,
            "CurrentTypeID": 20,
            "Quantity": 2
        }
    ],
    "NumberOfPoints": 2,
    "StatusTypeID": 50,
    "DateLastStatusUpdate": "2020-03-10T10:32:00Z",
    "DataQualityLevel": 1,
    "DateCreated": "2020-03-10T10:32:00Z",
    "SubmissionStatusTypeID": 200
}