{
    "UserComments": [
        {
            "ID": 9657,
            "ChargePointID": 41389,
            "CommentTypeID": 50,
            "UserName": "BleuMidnight1",
            "Comment": "They do not offer charging.\nExtremely rude about it.\nStaff is more interested in smoking cigarettes in parking deck than service of any kind.",
            "Rating": 1,
            "DateCreated": "2016-02-07T13:45:11.28Z",
            "User": {
                "ID": 7913,
                "Username": "BleuMidnight1"
            },
            "CheckinStatusTypeID": 200
        }
    ],
    "IsRecentlyVerified": false,
    "ID": 41389,
    "UUID": "E8871305-3135-4DCB-B958-B2BFBA7F119B",
    "DataProviderID": 2,
    "DataProvidersReference": "65401",
    "OperatorID": 5,
    "UsageTypeID": 1,
    "AddressInfo": {
        "ID": 41735,
        "Title": "MURRAY BMW 1",
        "AddressLine1": "4350 E Kentucky Ave",
        "Town": "Denver",
        "StateOrProvince": "CO",
        "Postcode": "80246",
        "CountryID": 2,
        "Latitude": 39.699252,
        "Longitude": -104.937643,
        "ContactTelephone1": "888-758-4389",
        "AccessComments": "24 hours daily",
        "RelatedURL": "http://www.chargepoint.com/",
        "DistanceUnit": 0
    },
    "Connections": [
        {
            "ID": 45237,
            "ConnectionTypeID": 1,
            "LevelID": 2,
            "Amps": 16,
            "Voltage": 230,
            "PowerKW": 3,
            "CurrentTypeID": 10,
            "Quantity": 2
        }
    ],
    "DateLastStatusUpdate": "2019-12-24T09:16:00Z",
    "DataQualityLevel": 3,
    "DateCreated": "2015-02-02T06:34:00Z",
    "SubmissionStatusTypeID": 100
}