{
    "IsRecentlyVerified": false,
    "ID": 181718,
    "UUID": "127D5C4C-B214-40A8-9F3C-B3F2AA0ED61D",
    "DataProviderID": 29,
    "DataProvidersReference": "7921",
    "AddressInfo": {
        "ID": 182077,
        "Title": "Rathausplatz 1",
        "AddressLine1": "Rathausplatz 1",
        "Town": "Bitterfeld-Wolfen",
        "Postcode": "06766",
        "CountryID": 87,
        "Latitude": 51.656262,
        "Longitude": 12.267845,
        "DistanceUnit": 0
    },
    "Connections": [
        {
            "ID": 286421,
            "ConnectionTypeID": 28,
            "StatusTypeID": 50,
            "LevelID": 2,
            "PowerKW": 22,
            "CurrentTypeID": 20
        },
        {
            "ID": 286422,
            "ConnectionTypeID": 25,
            "StatusTypeID": 50,
            "LevelID": 2,
            "PowerKW": 22,
            "CurrentTypeID": 20
        },
        {
            "ID": 299773,
            "ConnectionTypeID": 28,
            "StatusTypeID": 50,
            "LevelID": 2,
            "PowerKW": 22,
            "CurrentTypeID": 20
        },
        {
            "ID": 299774,
            "ConnectionTypeID": 25,
            "StatusTypeID": 50,
            "LevelID": 2,
            "PowerKW": 22,
            "CurrentTypeID": 20
        }
    ],
    "StatusTypeID": 50,
    "DateLastStatusUpdate": "2021-07-12T02:48:00Z",
    "MetadataValues": [
        {
            "ID": 14012,
            "MetadataFieldID": 4,
            "ItemValue": "Data from the German chargepoint registry provided by Bundesnetzagentur.de under the CC-BY 4.0 license"
        }
    ],
    "DataQualityLevel": 3,
    "DateCreated": "2021-07-08T10:02:00Z",
    "SubmissionStatusTypeID": 100
}