{
    "IsRecentlyVerified": false,
    "ID": 178734,
    "UUID": "39998F6F-0ABC-4D53-B447-49FE2692C0B3",
    "DataProviderID": 29,
    "DataProvidersReference": "7148",
    "OperatorID": 224,
    "AddressInfo": {
        "ID": 179093,
        "Title": "Schwarzwaldstr.3",
        "AddressLine1": "Schwarzwaldstr.3",
        "Town": "Todtnau",
        "Postcode": "79674",
        "CountryID": 87,
        "Latitude": 47.830386,
        "Longitude": 7.944097,
        "DistanceUnit": 0
    },
    "Connections": [
        {
            "ID": 279576,
            "ConnectionTypeID": 28,
            "StatusTypeID": 50,
            "LevelID": 2,
            "PowerKW": 22,
            "CurrentTypeID": 20
        },
        {
            "ID": 279577,
            "ConnectionTypeID": 25,
            "StatusTypeID": 50,
            "LevelID": 2,
            "PowerKW": 22,
            "CurrentTypeID": 20
        },
        {
            "ID": 295391,
            "ConnectionTypeID": 25,
            "StatusTypeID": 50,
            "LevelID": 2,
            "PowerKW": 22,
            "CurrentTypeID": 20
        }
    ],
    "StatusTypeID": 0,
    "DateLastStatusUpdate": "2021-07-12T02:39:00Z",
    "MetadataValues": [
        {
            "ID": 11028,
            "MetadataFieldID": 4,
            "ItemValue": "Data from the German chargepoint registry provided by Bundesnetzagentur.de under the CC-BY 4.0 license"
        }
    ],
    "DataQualityLevel": 3,
    "DateCreated": "2021-07-08T09:50:00Z",
    "SubmissionStatusTypeID": 100
}