{
    "IsRecentlyVerified": false,
    "ID": 8581,
    "UUID": "EAA89686-B3B3-40EE-A1EB-B062E02BC380",
    "DataProviderID": 15,
    "DataProvidersReference": "559",
    "OperatorID": 31,
    "AddressInfo": {
        "ID": 8478,
        "Title": "1 World Way Lot 6",
        "AddressLine1": "1 World Way Lot 6",
        "Town": "Los Angeles",
        "StateOrProvince": "California",
        "Postcode": "90045",
        "CountryID": 2,
        "Latitude": 33.94327,
        "Longitude": -118.40315,
        "ContactTelephone1": "(424) 646-7275",
        "RelatedURL": "http://carstations.com/559",
        "DistanceUnit": 0
    },
    "Connections": [
        {
            "ID": 6005,
            "ConnectionTypeID": 0,
            "Reference": "SPI"
        },
        {
            "ID": 6623,
            "ConnectionTypeID": 7,
            "Reference": "AVCON",
            "Quantity": 1
        },
        {
            "ID": 9276,
            "ConnectionTypeID": 1,
            "Reference": "J1772",
            "LevelID": 2,
            "Quantity": 1
        }
    ],
    "StatusTypeID": 0,
    "DateLastStatusUpdate": "2017-11-04T14:04:00Z",
    "DataQualityLevel": 1,
    "DateCreated": "2011-11-11T12:06:00Z",
    "SubmissionStatusTypeID": 100
}