{
    "IsRecentlyVerified": false,
    "ID": 176547,
    "UUID": "FCE16D29-5159-479E-B444-B54E812FCDEC",
    "DataProviderID": 29,
    "DataProvidersReference": "20733",
    "AddressInfo": {
        "ID": 176906,
        "Title": "Flößstraße 1",
        "AddressLine1": "Flößstraße 1",
        "Town": "Lechbruck",
        "Postcode": "86983",
        "CountryID": 87,
        "Latitude": 47.688295,
        "Longitude": 10.797179,
        "DistanceUnit": 0
    },
    "Connections": [
        {
            "ID": 274589,
            "ConnectionTypeID": 25,
            "StatusTypeID": 50,
            "LevelID": 2,
            "PowerKW": 22,
            "CurrentTypeID": 20
        },
        {
            "ID": 274590,
            "ConnectionTypeID": 25,
            "StatusTypeID": 50,
            "LevelID": 2,
            "PowerKW": 22,
            "CurrentTypeID": 20
        }
    ],
    "StatusTypeID": 0,
    "DateLastStatusUpdate": "2021-07-09T03:10:00Z",
    "MetadataValues": [
        {
            "ID": 8842,
            "MetadataFieldID": 4,
            "ItemValue": "Data from the German chargepoint registry provided by Bundesnetzagentur.de under the CC-BY 4.0 license"
        }
    ],
    "DataQualityLevel": 3,
    "DateCreated": "2021-07-08T09:48:00Z",
    "SubmissionStatusTypeID": 100
}