{
    "IsRecentlyVerified": false,
    "ID": 9574,
    "UUID": "BD4B8EA9-95F0-4643-B58C-D497418135BC",
    "DataProviderID": 15,
    "DataProvidersReference": "15157",
    "OperatorID": 5,
    "AddressInfo": {
        "ID": 9471,
        "Title": "2310 Andrew Zilker Rd",
        "AddressLine1": "2310 Andrew Zilker Rd",
        "Town": "Austin",
        "StateOrProvince": "Texas",
        "Postcode": "78746",
        "CountryID": 2,
        "Latitude": 30.266959,
        "Longitude": -97.774667,
        "ContactTelephone1": "",
        "RelatedURL": "http://carstations.com/15157",
        "DistanceUnit": 0
    },
    "Connections": [
        {
            "ID": 7282,
            "ConnectionTypeID": 1,
            "Reference": "J1772",
            "LevelID": 2
        },
        {
            "ID": 7619,
            "ConnectionTypeID": 9,
            "Reference": "NEMA5",
            "LevelID": 1,
            "Quantity": 1
        }
    ],
    "StatusTypeID": 0,
    "DateLastStatusUpdate": "2017-11-04T14:03:00Z",
    "DataQualityLevel": 2,
    "DateCreated": "2012-02-26T15:07:00Z",
    "SubmissionStatusTypeID": 100
}