{
    "IsRecentlyVerified": false,
    "ID": 19881,
    "UUID": "B5F59CA5-4CAD-4710-8489-DBAA6A489698",
    "DataProviderID": 1,
    "OperatorID": 1,
    "UsageTypeID": 0,
    "UsageCost": "",
    "AddressInfo": {
        "ID": 20226,
        "Title": "Renault - Étables-sur-Mer",
        "AddressLine1": "Rue de la République ZA Des Islandais ",
        "AddressLine2": "",
        "Town": "",
        "StateOrProvince": "ÉTABLES-SUR-MER FRANCE",
        "Postcode": "22680",
        "CountryID": 80,
        "Latitude": 48.62676,
        "Longitude": -2.83558,
        "ContactTelephone1": "+33 2 96 70 50 68",
        "ContactTelephone2": "",
        "ContactEmail": "",
        "AccessComments": "",
        "RelatedURL": "",
        "DistanceUnit": 0
    },
    "Connections": [],
    "GeneralComments": "",
    "StatusTypeID": 50,
    "DateLastStatusUpdate": "2013-10-21T12:02:00Z",
    "DataQualityLevel": 1,
    "DateCreated": "2013-10-21T03:53:00Z",
    "SubmissionStatusTypeID": 200
}