{
    "IsRecentlyVerified": false,
    "ID": 120896,
    "UUID": "5D35D03B-456F-4655-9F4D-8A015BCC7EE3",
    "DataProviderID": 2,
    "DataProvidersReference": "64045",
    "OperatorID": 5,
    "UsageTypeID": 1,
    "AddressInfo": {
        "ID": 121242,
        "Title": "VW GARDEN GROVE",
        "AddressLine1": "10800 Trask Ave",
        "Town": "Garden Grove",
        "StateOrProvince": "CA",
        "Postcode": "92843",
        "CountryID": 2,
        "Latitude": 33.7665915,
        "Longitude": -117.9407348,
        "ContactTelephone1": "888-758-4389",
        "AccessComments": "24 hours daily",
        "RelatedURL": "http://www.chargepoint.com/",
        "DistanceUnit": 0
    },
    "Connections": [
        {
            "ID": 170299,
            "ConnectionTypeID": 1,
            "LevelID": 2,
            "Amps": 16,
            "Voltage": 230,
            "PowerKW": 3,
            "CurrentTypeID": 10,
            "Quantity": 2
        }
    ],
    "DateLastStatusUpdate": "2019-12-24T09:10:00Z",
    "DataQualityLevel": 3,
    "DateCreated": "2019-04-01T04:59:00Z",
    "SubmissionStatusTypeID": 100
}