{
    "IsRecentlyVerified": false,
    "ID": 20372,
    "UUID": "F7AEB6C5-C612-4F8E-8BF0-B73FB3E2808B",
    "DataProviderID": 1,
    "OperatorID": 56,
    "UsageTypeID": 0,
    "AddressInfo": {
        "ID": 20717,
        "Title": "AutoBleue Victor Hugo",
        "AddressLine1": "53 Boulevard Victor Hugo",
        "Town": "Nice",
        "Postcode": "06000",
        "CountryID": 80,
        "Latitude": 43.69815,
        "Longitude": 7.25904,
        "AccessComments": "Réservé aux clients de l'établissement",
        "DistanceUnit": 0
    },
    "Connections": [],
    "StatusTypeID": 50,
    "DateLastStatusUpdate": "2017-01-08T19:05:00Z",
    "DataQualityLevel": 1,
    "DateCreated": "2013-11-13T11:36:00Z",
    "SubmissionStatusTypeID": 200
}