{
    "IsRecentlyVerified": false,
    "ID": 159324,
    "UUID": "29B4C1C0-EE67-43C7-A787-E425CCB5D6F6",
    "DataProviderID": 2,
    "DataProvidersReference": "153643",
    "OperatorID": 39,
    "UsageTypeID": 1,
    "AddressInfo": {
        "ID": 159681,
        "Title": "District Wharf Parking Garage - Public Access on P1",
        "AddressLine1": "1000 Maine",
        "Town": "Washington",
        "StateOrProvince": "DC",
        "Postcode": "20024",
        "CountryID": 2,
        "Latitude": 38.8807429,
        "Longitude": -77.0266704,
        "ContactTelephone1": "800-663-5633",
        "AccessComments": "MO: 12:00am-12:00am; TU: 12:00am-12:00am; WE: 12:00am-12:00am; TH: 12:00am-12:00am; FR: 12:00am-12:00am; SA: 12:00am-12:00am; SU: 12:00am-12:00am",
        "RelatedURL": "http://www.semacharge.com/",
        "DistanceUnit": 0
    },
    "Connections": [
        {
            "ID": 229472,
            "ConnectionTypeID": 1,
            "LevelID": 2,
            "Amps": 16,
            "Voltage": 230,
            "PowerKW": 3.7,
            "CurrentTypeID": 10,
            "Quantity": 11
        }
    ],
    "StatusTypeID": 50,
    "DateLastStatusUpdate": "2020-06-26T03:00:00Z",
    "DataQualityLevel": 3,
    "DateCreated": "2020-06-26T03:00:00Z",
    "SubmissionStatusTypeID": 100
}