{
    "IsRecentlyVerified": false,
    "ID": 153640,
    "UUID": "5DAB12AA-F23A-414E-818D-2CAE57412289",
    "DataProviderID": 28,
    "DataProvidersReference": "FR*S10*P10023A",
    "UsageTypeID": 5,
    "AddressInfo": {
        "ID": 153993,
        "Title": "AVON LA PEZE",
        "AddressLine1": "1 Rue de la Libération 10290 AVON LA PEZE",
        "CountryID": 80,
        "Latitude": 48.388611,
        "Longitude": 3.65457,
        "AccessComments": "",
        "DistanceUnit": 0
    },
    "Connections": [
        {
            "ID": 215658,
            "ConnectionTypeID": 28,
            "StatusTypeID": 50,
            "LevelID": 2,
            "PowerKW": 18,
            "CurrentTypeID": 10
        },
        {
            "ID": 215659,
            "ConnectionTypeID": 25,
            "StatusTypeID": 50,
            "LevelID": 2,
            "PowerKW": 18,
            "CurrentTypeID": 20
        },
        {
            "ID": 249255,
            "ConnectionTypeID": 28,
            "StatusTypeID": 50,
            "LevelID": 2,
            "PowerKW": 18,
            "CurrentTypeID": 10
        },
        {
            "ID": 249256,
            "ConnectionTypeID": 25,
            "StatusTypeID": 50,
            "LevelID": 2,
            "PowerKW": 18,
            "CurrentTypeID": 20
        }
    ],
    "GeneralComments": "\"Une unité = 6kWh de recharge. Utilisateur abonné : 1€/unité",
    "StatusTypeID": 50,
    "DateLastStatusUpdate": "2020-08-27T05:15:00Z",
    "DataQualityLevel": 2,
    "DateCreated": "2020-03-15T10:54:00Z",
    "SubmissionStatusTypeID": 100
}