{
    "IsRecentlyVerified": false,
    "ID": 64772,
    "UUID": "E37540FB-DAAF-43C7-AF5B-CE41F1287E5C",
    "DataProviderID": 1,
    "OperatorID": 45,
    "UsageTypeID": 4,
    "AddressInfo": {
        "ID": 65118,
        "Title": "Kreissparkasse",
        "AddressLine1": "Schiede 33",
        "Town": "Limburg",
        "StateOrProvince": "Landkreis Limburg-Weilburg",
        "Postcode": "65549",
        "CountryID": 87,
        "Latitude": 50.3877772981676,
        "Longitude": 8.05883239255559,
        "AccessComments": "Im Innenhof hinter der Parkschranke (Parkticket:1€) . Lokale RFID-Karte der Energieversorgung Limburg notwendig, erhältlich beim Arbeitsamt (gegenüber) für 15€ Erstellungsgebühr oder Stadtwerke Zentrale oder im Kundencenter.\r\nMit Ladekarte 24/7 nutzbar.",
        "DistanceUnit": 0
    },
    "Connections": [
        {
            "ID": 83272,
            "ConnectionTypeID": 25,
            "StatusTypeID": 50,
            "LevelID": 2,
            "Amps": 32,
            "Voltage": 400,
            "PowerKW": 22,
            "CurrentTypeID": 20,
            "Quantity": 2
        }
    ],
    "NumberOfPoints": 2,
    "StatusTypeID": 50,
    "DateLastStatusUpdate": "2016-03-18T07:28:00Z",
    "DataQualityLevel": 1,
    "DateCreated": "2016-03-18T07:18:00Z",
    "SubmissionStatusTypeID": 200
}