{
    "IsRecentlyVerified": false,
    "ID": 123808,
    "UUID": "32061199-99C7-4485-BC6F-E014769A46B4",
    "DataProviderID": 2,
    "DataProvidersReference": "51781",
    "UsageTypeID": 2,
    "AddressInfo": {
        "ID": 124154,
        "Title": "Mission Valley Ford",
        "AddressLine1": "780 E Brokaw Rd",
        "Town": "San Jose",
        "StateOrProvince": "CA",
        "Postcode": "95112",
        "CountryID": 2,
        "Latitude": 37.381081,
        "Longitude": -121.905304,
        "ContactTelephone1": "",
        "AccessComments": "Service center use only",
        "RelatedURL": "",
        "DistanceUnit": 0
    },
    "Connections": [
        {
            "ID": 173835,
            "ConnectionTypeID": 1,
            "LevelID": 2,
            "Amps": 16,
            "Voltage": 230,
            "PowerKW": 3.7,
            "CurrentTypeID": 10,
            "Quantity": 1
        }
    ],
    "DateLastStatusUpdate": "2020-06-26T02:59:00Z",
    "DataQualityLevel": 3,
    "DateCreated": "2019-04-06T05:03:00Z",
    "SubmissionStatusTypeID": 100
}