{
    "IsRecentlyVerified": false,
    "ID": 15523,
    "UUID": "A739B4A5-485B-4E85-8179-F9F67181900F",
    "DataProviderID": 1,
    "OperatorID": 1,
    "UsageTypeID": 1,
    "AddressInfo": {
        "ID": 15868,
        "Title": "Telford Plaza Phase 1",
        "AddressLine1": "Wai Yip St",
        "AddressLine2": "",
        "Town": "Kowloon Bay",
        "StateOrProvince": "Kowloon",
        "Postcode": "",
        "CountryID": 4,
        "Latitude": 22.323060989379883,
        "Longitude": 114.2132568359375,
        "ContactTelephone1": "",
        "ContactTelephone2": "",
        "ContactEmail": "",
        "AccessComments": "",
        "RelatedURL": "",
        "DistanceUnit": 0
    },
    "Connections": [
        {
            "ID": 13840,
            "ConnectionTypeID": 3,
            "Quantity": 1
        }
    ],
    "NumberOfPoints": 2,
    "DateLastConfirmed": "2011-05-21T00:00:00Z",
    "StatusTypeID": 50,
    "DateLastStatusUpdate": "2013-01-11T21:07:00Z",
    "DateCreated": "2013-01-11T21:53:00Z",
    "SubmissionStatusTypeID": 200
}