{
    "IsRecentlyVerified": false,
    "ID": 150888,
    "UUID": "869B668C-49D7-4FAF-AFF5-1DA92EF9ADC8",
    "DataProviderID": 28,
    "DataProvidersReference": "FR*A16*P*WIIZ*70*_*_*_",
    "UsageTypeID": 5,
    "AddressInfo": {
        "ID": 151241,
        "Title": "Biot Parking Village",
        "AddressLine1": "Chemin Neuf",
        "CountryID": 80,
        "Latitude": 43.627631,
        "Longitude": 7.09455,
        "AccessComments": "24h/24",
        "DistanceUnit": 0
    },
    "Connections": [
        {
            "ID": 210203,
            "ConnectionTypeID": 28,
            "StatusTypeID": 50,
            "LevelID": 2,
            "PowerKW": 22,
            "CurrentTypeID": 10
        },
        {
            "ID": 210204,
            "ConnectionTypeID": 1036,
            "StatusTypeID": 50,
            "LevelID": 2,
            "PowerKW": 22,
            "CurrentTypeID": 20
        },
        {
            "ID": 239940,
            "ConnectionTypeID": 28,
            "StatusTypeID": 50,
            "LevelID": 2,
            "PowerKW": 22,
            "CurrentTypeID": 10
        },
        {
            "ID": 239941,
            "ConnectionTypeID": 1036,
            "StatusTypeID": 50,
            "LevelID": 2,
            "PowerKW": 22,
            "CurrentTypeID": 20
        }
    ],
    "GeneralComments": "badge, appli et QR code",
    "StatusTypeID": 50,
    "DateLastStatusUpdate": "2020-08-27T05:10:00Z",
    "DataQualityLevel": 2,
    "DateCreated": "2020-03-15T06:17:00Z",
    "SubmissionStatusTypeID": 100
}