{
    "UserComments": [
        {
            "ID": 15913,
            "ChargePointID": 82443,
            "CommentTypeID": 10,
            "UserName": "Quiesy",
            "Comment": "super Ladestation, aber vermutlich nur während der Öffnungszeiten verfügbar.",
            "Rating": 5,
            "DateCreated": "2017-02-07T09:47:11.87Z",
            "User": {
                "ID": 12250,
                "Username": "Quiesy"
            },
            "CheckinStatusTypeID": 10
        }
    ],
    "MediaItems": [
        {
            "ID": 10419,
            "ChargePointID": 82443,
            "ItemURL": "https://s3-ap-southeast-2.amazonaws.com/openchargemap/images/DE/OCM82443/OCM-82443.orig.2017020709445257.png",
            "ItemThumbnailURL": "https://s3-ap-southeast-2.amazonaws.com/openchargemap/images/DE/OCM82443/OCM-82443.thmb.2017020709445257.png",
            "Comment": "",
            "IsEnabled": true,
            "IsVideo": false,
            "IsFeaturedItem": false,
            "IsExternalResource": false,
            "User": {
                "ID": 12250,
                "Username": "Quiesy"
            },
            "DateCreated": "2017-02-07T09:45:00Z"
        },
        {
            "ID": 10416,
            "ChargePointID": 82443,
            "ItemURL": "https://s3-ap-southeast-2.amazonaws.com/openchargemap/images/DE/OCM82443/OCM-82443.orig.2017020709403090.jpg",
            "ItemThumbnailURL": "https://s3-ap-southeast-2.amazonaws.com/openchargemap/images/DE/OCM82443/OCM-82443.thmb.2017020709403090.jpg",
            "Comment": "",
            "IsEnabled": true,
            "IsVideo": false,
            "IsFeaturedItem": false,
            "IsExternalResource": false,
            "User": {
                "ID": 12250,
                "Username": "Quiesy"
            },
            "DateCreated": "2017-02-07T09:41:00Z"
        },
        {
            "ID": 10417,
            "ChargePointID": 82443,
            "ItemURL": "https://s3-ap-southeast-2.amazonaws.com/openchargemap/images/DE/OCM82443/OCM-82443.orig.2017020709404051.jpg",
            "ItemThumbnailURL": "https://s3-ap-southeast-2.amazonaws.com/openchargemap/images/DE/OCM82443/OCM-82443.thmb.2017020709404051.jpg",
            "Comment": "",
            "IsEnabled": true,
            "IsVideo": false,
            "IsFeaturedItem": false,
            "IsExternalResource": false,
            "User": {
                "ID": 12250,
                "Username": "Quiesy"
            },
            "DateCreated": "2017-02-07T09:41:00Z"
        },
        {
            "ID": 10418,
            "ChargePointID": 82443,
            "ItemURL": "https://s3-ap-southeast-2.amazonaws.com/openchargemap/images/DE/OCM82443/OCM-82443.orig.2017020709405471.jpg",
            "ItemThumbnailURL": "https://s3-ap-southeast-2.amazonaws.com/openchargemap/images/DE/OCM82443/OCM-82443.thmb.2017020709405471.jpg",
            "Comment": "",
            "IsEnabled": true,
            "IsVideo": false,
            "IsFeaturedItem": false,
            "IsExternalResource": false,
            "User": {
                "ID": 12250,
                "Username": "Quiesy"
            },
            "DateCreated": "2017-02-07T09:41:00Z"
        },
        {
            "ID": 10415,
            "ChargePointID": 82443,
            "ItemURL": "https://s3-ap-southeast-2.amazonaws.com/openchargemap/images/DE/OCM82443/OCM-82443.orig.2017020709401706.jpg",
            "ItemThumbnailURL": "https://s3-ap-southeast-2.amazonaws.com/openchargemap/images/DE/OCM82443/OCM-82443.thmb.2017020709401706.jpg",
            "Comment": "",
            "IsEnabled": true,
            "IsVideo": false,
            "IsFeaturedItem": false,
            "IsExternalResource": false,
            "User": {
                "ID": 12250,
                "Username": "Quiesy"
            },
            "DateCreated": "2017-02-07T09:40:00Z"
        }
    ],
    "IsRecentlyVerified": false,
    "ID": 82443,
    "UUID": "C1761795-236A-4556-B91A-9E399217913C",
    "DataProviderID": 1,
    "OperatorID": 45,
    "UsageTypeID": 1,
    "UsageCost": "Free",
    "AddressInfo": {
        "ID": 82789,
        "Title": "TERRA.bike-Station Botanischer Garten ",
        "AddressLine1": "Albrechtstraße 29,",
        "Town": "Osnabrück",
        "StateOrProvince": "Deutschland",
        "Postcode": "49076",
        "CountryID": 87,
        "Latitude": 52.28217290619437,
        "Longitude": 8.026491701602936,
        "ContactTelephone1": "05419692739",
        "AccessComments": "Bei den Toiletten, (Geb. 62) westlicher Eingang",
        "DistanceUnit": 0
    },
    "Connections": [
        {
            "ID": 117235,
            "ConnectionTypeID": 28,
            "StatusTypeID": 50,
            "LevelID": 2,
            "Amps": 10,
            "Voltage": 230,
            "PowerKW": 3,
            "CurrentTypeID": 10,
            "Quantity": 6
        }
    ],
    "NumberOfPoints": 1,
    "GeneralComments": "Abschließbar wie ein Spind (1 oder 2 Euro Stück einwerfen und abschließen)",
    "StatusTypeID": 50,
    "DateLastStatusUpdate": "2017-02-07T20:58:00Z",
    "DataQualityLevel": 1,
    "DateCreated": "2017-02-05T13:08:00Z",
    "SubmissionStatusTypeID": 200
}