{
    "IsRecentlyVerified": false,
    "ID": 120091,
    "UUID": "38B70710-9784-4B61-84D2-E27AE9F61D29",
    "DataProviderID": 2,
    "DataProvidersReference": "52038",
    "OperatorID": 5,
    "UsageTypeID": 1,
    "AddressInfo": {
        "ID": 120437,
        "Title": "FASTPARK",
        "AddressLine1": "2300 Spirit of Texas Dr",
        "Town": "Austin",
        "StateOrProvince": "TX",
        "Postcode": "78617",
        "CountryID": 2,
        "Latitude": 30.218336,
        "Longitude": -97.662154,
        "ContactTelephone1": "888-758-4389",
        "AccessComments": "24 hours daily",
        "RelatedURL": "http://www.chargepoint.com/",
        "DistanceUnit": 0
    },
    "Connections": [
        {
            "ID": 169409,
            "ConnectionTypeID": 1,
            "LevelID": 2,
            "Amps": 16,
            "Voltage": 230,
            "PowerKW": 3,
            "CurrentTypeID": 10,
            "Quantity": 16
        }
    ],
    "DateLastStatusUpdate": "2019-12-24T09:08:00Z",
    "DataQualityLevel": 3,
    "DateCreated": "2019-04-01T04:59:00Z",
    "SubmissionStatusTypeID": 100
}