{
    "UserComments": [
        {
            "ID": 24956,
            "ChargePointID": 189613,
            "CommentTypeID": 10,
            "UserName": "ForumElettrico.it",
            "Comment": "Siamo abbastanza vicini al centro storico e lì vicino troviamo diversi bar e ristoranti. \r\nLeggi la recensione completa qui:  https://www.forumelettrico.it/forum/colonnine-be-charge-22-kw-sassuolo-mo-via-don-alfonso-ugolini-t20999.html",
            "RelatedURL": "https://www.forumelettrico.it/forum/colonnine-be-charge-22-kw-sassuolo-mo-via-don-alfonso-ugolini-t20999.html",
            "DateCreated": "2021-10-19T09:20:55.417Z",
            "User": {
                "ID": 11749,
                "Username": "ForumElettrico.it"
            },
            "CheckinStatusTypeID": 10,
            "IsActionedByEditor": false
        }
    ],
    "MediaItems": [
        {
            "ID": 29556,
            "ChargePointID": 189613,
            "ItemURL": "https://s3-ap-southeast-2.amazonaws.com/openchargemap/images/IT/OCM189613/OCM-189613.orig.2021101909210400.jpg",
            "ItemThumbnailURL": "https://s3-ap-southeast-2.amazonaws.com/openchargemap/images/IT/OCM189613/OCM-189613.thmb.2021101909210400.jpg",
            "Comment": "",
            "IsEnabled": true,
            "IsVideo": false,
            "IsFeaturedItem": false,
            "IsExternalResource": false,
            "User": {
                "ID": 11749,
                "Username": "ForumElettrico.it"
            },
            "DateCreated": "2021-10-19T09:21:00Z"
        },
        {
            "ID": 29557,
            "ChargePointID": 189613,
            "ItemURL": "https://s3-ap-southeast-2.amazonaws.com/openchargemap/images/IT/OCM189613/OCM-189613.orig.2021101909210957.jpg",
            "ItemThumbnailURL": "https://s3-ap-southeast-2.amazonaws.com/openchargemap/images/IT/OCM189613/OCM-189613.thmb.2021101909210957.jpg",
            "Comment": "",
            "IsEnabled": true,
            "IsVideo": false,
            "IsFeaturedItem": false,
            "IsExternalResource": false,
            "User": {
                "ID": 11749,
                "Username": "ForumElettrico.it"
            },
            "DateCreated": "2021-10-19T09:21:00Z"
        },
        {
            "ID": 29558,
            "ChargePointID": 189613,
            "ItemURL": "https://s3-ap-southeast-2.amazonaws.com/openchargemap/images/IT/OCM189613/OCM-189613.orig.2021101909211449.jpg",
            "ItemThumbnailURL": "https://s3-ap-southeast-2.amazonaws.com/openchargemap/images/IT/OCM189613/OCM-189613.thmb.2021101909211449.jpg",
            "Comment": "",
            "IsEnabled": true,
            "IsVideo": false,
            "IsFeaturedItem": false,
            "IsExternalResource": false,
            "User": {
                "ID": 11749,
                "Username": "ForumElettrico.it"
            },
            "DateCreated": "2021-10-19T09:21:00Z"
        },
        {
            "ID": 29559,
            "ChargePointID": 189613,
            "ItemURL": "https://s3-ap-southeast-2.amazonaws.com/openchargemap/images/IT/OCM189613/OCM-189613.orig.2021101909211955.jpg",
            "ItemThumbnailURL": "https://s3-ap-southeast-2.amazonaws.com/openchargemap/images/IT/OCM189613/OCM-189613.thmb.2021101909211955.jpg",
            "Comment": "",
            "IsEnabled": true,
            "IsVideo": false,
            "IsFeaturedItem": false,
            "IsExternalResource": false,
            "User": {
                "ID": 11749,
                "Username": "ForumElettrico.it"
            },
            "DateCreated": "2021-10-19T09:21:00Z"
        },
        {
            "ID": 29560,
            "ChargePointID": 189613,
            "ItemURL": "https://s3-ap-southeast-2.amazonaws.com/openchargemap/images/IT/OCM189613/OCM-189613.orig.2021101909212509.jpg",
            "ItemThumbnailURL": "https://s3-ap-southeast-2.amazonaws.com/openchargemap/images/IT/OCM189613/OCM-189613.thmb.2021101909212509.jpg",
            "Comment": "",
            "IsEnabled": true,
            "IsVideo": false,
            "IsFeaturedItem": false,
            "IsExternalResource": false,
            "User": {
                "ID": 11749,
                "Username": "ForumElettrico.it"
            },
            "DateCreated": "2021-10-19T09:21:00Z"
        }
    ],
    "IsRecentlyVerified": true,
    "DateLastVerified": "2021-10-19T09:18:00Z",
    "ID": 189613,
    "UUID": "0BD97BE8-B7D2-48AC-B3CE-9DCAB3BC97B7",
    "DataProviderID": 1,
    "OperatorID": 3327,
    "UsageTypeID": 1,
    "AddressInfo": {
        "ID": 189972,
        "Title": "Be Charge ",
        "AddressLine1": "Via Don Alfonso Ugolini",
        "Town": "Sassuolo",
        "StateOrProvince": "MO",
        "CountryID": 112,
        "Latitude": 44.547355,
        "Longitude": 10.785443,
        "RelatedURL": "https://www.forumelettrico.it/forum/colonnine-be-charge-22-kw-sassuolo-mo-via-don-alfonso-ugolini-t20999.html",
        "DistanceUnit": 0
    },
    "Connections": [
        {
            "ID": 306742,
            "ConnectionTypeID": 25,
            "LevelID": 2,
            "PowerKW": 22,
            "Quantity": 4
        }
    ],
    "NumberOfPoints": 2,
    "StatusTypeID": 50,
    "DateLastStatusUpdate": "2021-10-19T09:21:00Z",
    "DataQualityLevel": 1,
    "DateCreated": "2021-10-19T09:18:00Z",
    "SubmissionStatusTypeID": 200
}