{
    "IsRecentlyVerified": false,
    "ID": 47295,
    "UUID": "792C9358-22E2-482A-AE15-7628A217BD38",
    "DataProviderID": 1,
    "OperatorID": 150,
    "OperatorsReference": "GP10683",
    "UsageTypeID": 4,
    "UsageCost": "£1.00 + £0.30/kWh; Overstay £10.00 every 90 minutes after 90 minutes",
    "AddressInfo": {
        "ID": 47641,
        "Title": "Aztec West Business Park",
        "AddressLine1": "Park Avenue",
        "AddressLine2": "Almondsbury",
        "Town": "Bristol",
        "Postcode": "BS32 4TD",
        "CountryID": 1,
        "Latitude": 51.54267,
        "Longitude": -2.57218,
        "AccessComments": "Ownership transferred to ChargePoint Services/GeniePoint.",
        "DistanceUnit": 0
    },
    "Connections": [
        {
            "ID": 58309,
            "ConnectionTypeID": 2,
            "Reference": "GP10683-1",
            "StatusTypeID": 50,
            "LevelID": 3,
            "Amps": 125,
            "Voltage": 500,
            "PowerKW": 50,
            "CurrentTypeID": 30,
            "Quantity": 1
        },
        {
            "ID": 58336,
            "ConnectionTypeID": 33,
            "Reference": "GP10683-2",
            "StatusTypeID": 50,
            "LevelID": 3,
            "Amps": 125,
            "Voltage": 500,
            "PowerKW": 50,
            "CurrentTypeID": 30,
            "Quantity": 1
        },
        {
            "ID": 58337,
            "ConnectionTypeID": 1036,
            "Reference": "GP10683-3",
            "StatusTypeID": 50,
            "LevelID": 3,
            "Amps": 63,
            "Voltage": 400,
            "PowerKW": 43,
            "CurrentTypeID": 20,
            "Quantity": 1
        },
        {
            "ID": 306868,
            "ConnectionTypeID": 25,
            "Reference": "GP10641",
            "StatusTypeID": 50,
            "LevelID": 2,
            "Amps": 32,
            "Voltage": 400,
            "PowerKW": 22,
            "CurrentTypeID": 20,
            "Quantity": 2
        }
    ],
    "NumberOfPoints": 1,
    "StatusTypeID": 50,
    "DateLastStatusUpdate": "2021-10-25T13:48:00Z",
    "MetadataValues": [
        {
            "ID": 1415,
            "MetadataFieldID": 4,
            "ItemValue": "Contains public sector information licensed under the Open Government Licence v2.0. http://www.nationalarchives.gov.uk/doc/open-government-licence/version/2/"
        }
    ],
    "DataQualityLevel": 3,
    "DateCreated": "2015-05-24T11:49:00Z",
    "SubmissionStatusTypeID": 200
}