{
    "IsRecentlyVerified": false,
    "ID": 159033,
    "UUID": "CAD553B3-7937-4D82-9ACB-02BB95611AD2",
    "DataProviderID": 2,
    "DataProvidersReference": "154434",
    "OperatorID": 5,
    "UsageTypeID": 1,
    "AddressInfo": {
        "ID": 159390,
        "Title": "CENTRAL EMC HQ",
        "AddressLine1": "125 Wilson Rd",
        "Town": "Sanford",
        "StateOrProvince": "NC",
        "Postcode": "27332",
        "CountryID": 2,
        "Latitude": 35.4464229,
        "Longitude": -79.1343254,
        "ContactTelephone1": "888-758-4389",
        "AccessComments": "24 hours daily",
        "RelatedURL": "http://www.chargepoint.com/",
        "DistanceUnit": 0
    },
    "Connections": [
        {
            "ID": 229100,
            "ConnectionTypeID": 1,
            "LevelID": 2,
            "Amps": 16,
            "Voltage": 230,
            "PowerKW": 3.7,
            "CurrentTypeID": 10,
            "Quantity": 2
        }
    ],
    "StatusTypeID": 50,
    "DateLastStatusUpdate": "2020-06-26T02:58:00Z",
    "DataQualityLevel": 3,
    "DateCreated": "2020-06-26T02:58:00Z",
    "SubmissionStatusTypeID": 100
}