{
    "IsRecentlyVerified": false,
    "ID": 138501,
    "UUID": "EEAC2B72-C0C4-441B-9F28-9C8B2350FA3A",
    "DataProviderID": 2,
    "DataProvidersReference": "146712",
    "UsageTypeID": 1,
    "AddressInfo": {
        "ID": 138850,
        "Title": "North Point Center",
        "AddressLine1": "6836 Austin Center Blvd",
        "Town": "Austin",
        "StateOrProvince": "TX",
        "Postcode": "78731",
        "CountryID": 2,
        "Latitude": 30.351485,
        "Longitude": -97.752008,
        "ContactTelephone1": "",
        "AccessComments": "24 hours daily",
        "RelatedURL": "",
        "DistanceUnit": 0
    },
    "Connections": [
        {
            "ID": 193631,
            "ConnectionTypeID": 1,
            "LevelID": 2,
            "Amps": 16,
            "Voltage": 230,
            "PowerKW": 3,
            "CurrentTypeID": 10,
            "Quantity": 2
        }
    ],
    "StatusTypeID": 50,
    "DateLastStatusUpdate": "2019-12-24T09:09:00Z",
    "DataQualityLevel": 3,
    "DateCreated": "2019-12-24T09:09:00Z",
    "SubmissionStatusTypeID": 100
}