{
    "IsRecentlyVerified": false,
    "ID": 42956,
    "UUID": "DB937942-BB1E-4922-891A-FC2B9DA95E18",
    "DataProviderID": 26,
    "DataProvidersReference": "60332",
    "OperatorID": 180,
    "OperatorsReference": "Alfen GDH2901",
    "UsageCost": "0.00 jaarabonnement",
    "AddressInfo": {
        "ID": 43302,
        "Title": "Lulofsstraat",
        "AddressLine1": "Lulofsstraat",
        "Town": "Den Haag",
        "Postcode": "2521 AM",
        "CountryID": 159,
        "Latitude": 52.063707,
        "Longitude": 4.3171,
        "ContactTelephone1": "036 - 549 34 00",
        "RelatedURL": "http://www.icu-charging-stations.com/",
        "DistanceUnit": 0
    },
    "Connections": [
        {
            "ID": 51935,
            "ConnectionTypeID": 25,
            "LevelID": 2,
            "PowerKW": 11,
            "CurrentTypeID": 10
        },
        {
            "ID": 51936,
            "ConnectionTypeID": 25,
            "LevelID": 2,
            "PowerKW": 11,
            "CurrentTypeID": 10
        }
    ],
    "NumberOfPoints": 1,
    "StatusTypeID": 50,
    "DateLastStatusUpdate": "2016-06-04T02:45:00Z",
    "DataQualityLevel": 3,
    "DateCreated": "2015-03-25T02:49:00Z",
    "SubmissionStatusTypeID": 100
}