{
    "IsRecentlyVerified": false,
    "ID": 13702,
    "UUID": "4CC569EC-BBEF-48C4-8F98-606781307804",
    "DataProviderID": 15,
    "DataProvidersReference": "20928",
    "OperatorID": 1,
    "UsageTypeID": 1,
    "AddressInfo": {
        "ID": 13599,
        "Title": "1525 Bernice Street",
        "AddressLine1": "1525 Bernice Street",
        "Town": "Honolulu",
        "StateOrProvince": "HI",
        "Postcode": "96817",
        "CountryID": 2,
        "Latitude": 21.334109,
        "Longitude": -157.871304,
        "ContactTelephone1": "866-979-4824",
        "RelatedURL": "http://carstations.com/20928",
        "DistanceUnit": 0
    },
    "Connections": [
        {
            "ID": 11139,
            "ConnectionTypeID": 1,
            "Reference": "J1772",
            "LevelID": 2
        }
    ],
    "NumberOfPoints": 4,
    "StatusTypeID": 0,
    "DateLastStatusUpdate": "2017-11-04T14:03:00Z",
    "DataQualityLevel": 2,
    "DateCreated": "2012-11-29T04:33:00Z",
    "SubmissionStatusTypeID": 100
}