{
    "MediaItems": [
        {
            "ID": 25935,
            "ChargePointID": 168801,
            "ItemURL": "https://s3-ap-southeast-2.amazonaws.com/openchargemap/images/AU/OCM168801/OCM-168801.orig.2020122418395217.jpg",
            "ItemThumbnailURL": "https://s3-ap-southeast-2.amazonaws.com/openchargemap/images/AU/OCM168801/OCM-168801.thmb.2020122418395217.jpg",
            "Comment": "",
            "IsEnabled": true,
            "IsVideo": false,
            "IsFeaturedItem": false,
            "IsExternalResource": false,
            "User": {
                "ID": 24819,
                "Username": "Wild Rice"
            },
            "DateCreated": "2020-12-24T18:40:00Z"
        },
        {
            "ID": 24963,
            "ChargePointID": 168801,
            "ItemURL": "https://s3-ap-southeast-2.amazonaws.com/openchargemap/images/AU/OCM168801/OCM-168801.orig.2020100523235558.jpg",
            "ItemThumbnailURL": "https://s3-ap-southeast-2.amazonaws.com/openchargemap/images/AU/OCM168801/OCM-168801.thmb.2020100523235558.jpg",
            "Comment": "",
            "IsEnabled": true,
            "IsVideo": false,
            "IsFeaturedItem": false,
            "IsExternalResource": false,
            "User": {
                "ID": 1000,
                "Username": "Christopher Cook"
            },
            "DateCreated": "2020-10-05T23:24:00Z"
        }
    ],
    "IsRecentlyVerified": false,
    "ID": 168801,
    "UUID": "62750CF5-556C-42E5-816F-3B13034E7FE6",
    "DataProviderID": 1,
    "OperatorID": 45,
    "UsageTypeID": 5,
    "UsageCost": "$0.70 per kWh, minimum charge is $25.00",
    "AddressInfo": {
        "ID": 169160,
        "Title": "Caltex Jurien Bay",
        "AddressLine1": "131 Murray Street",
        "Town": "Jurien Bay",
        "StateOrProvince": "Western Australia",
        "Postcode": "6516",
        "CountryID": 18,
        "Latitude": -30.302575176621545,
        "Longitude": 115.04206929356678,
        "AccessComments": "Located at far left side parking, blue cover.",
        "DistanceUnit": 0
    },
    "Connections": [
        {
            "ID": 256587,
            "ConnectionTypeID": 33,
            "StatusTypeID": 50,
            "LevelID": 3,
            "PowerKW": 43,
            "CurrentTypeID": 30,
            "Quantity": 1
        }
    ],
    "NumberOfPoints": 1,
    "GeneralComments": "Ask at counter for cable, also requires generator to be started up.",
    "StatusTypeID": 50,
    "DateLastStatusUpdate": "2021-10-24T04:44:00Z",
    "DataQualityLevel": 1,
    "DateCreated": "2020-10-05T23:23:00Z",
    "SubmissionStatusTypeID": 200
}