{
    "MediaItems": [
        {
            "ID": 12126,
            "ChargePointID": 87740,
            "ItemURL": "https://s3-ap-southeast-2.amazonaws.com/openchargemap/images/NZ/OCM87740/OCM-87740.orig.2017051608402440.jpg",
            "ItemThumbnailURL": "https://s3-ap-southeast-2.amazonaws.com/openchargemap/images/NZ/OCM87740/OCM-87740.thmb.2017051608402440.jpg",
            "Comment": "",
            "IsEnabled": true,
            "IsVideo": false,
            "IsFeaturedItem": false,
            "IsExternalResource": false,
            "User": {
                "ID": 15365,
                "Username": "sliday"
            },
            "DateCreated": "2017-05-16T08:41:00Z"
        }
    ],
    "IsRecentlyVerified": false,
    "ID": 87740,
    "UUID": "F4314E7F-D20A-46D2-AF98-97F58C3F1387",
    "DataProviderID": 1,
    "UsageCost": "Cost unknown",
    "AddressInfo": {
        "ID": 88086,
        "Title": "The Bushmans Centre",
        "AddressLine1": "2113 Harihari Hwy",
        "Town": "Pukekura",
        "Postcode": "7885",
        "CountryID": 161,
        "Latitude": -43.01003861661791,
        "Longitude": 170.6716270118368,
        "ContactTelephone1": "(643) 755-4144",
        "DistanceUnit": 0
    },
    "Connections": [
        {
            "ID": 124364,
            "ConnectionTypeID": 4
        }
    ],
    "NumberOfPoints": 1,
    "GeneralComments": "Ask at the Bushman's centre for use of the blue commando socket at the now closed chalets.",
    "StatusTypeID": 50,
    "DateLastStatusUpdate": "2017-05-16T08:41:00Z",
    "DataQualityLevel": 1,
    "DateCreated": "2017-05-16T08:40:00Z",
    "SubmissionStatusTypeID": 200
}