{
    "IsRecentlyVerified": false,
    "ID": 167267,
    "UUID": "750F5590-780D-4F49-877E-9CDAA7C75C1D",
    "DataProviderID": 1,
    "OperatorID": 3323,
    "UsageTypeID": 1,
    "AddressInfo": {
        "ID": 167626,
        "Title": "İstanbul İzmir Otoyolu",
        "AddressLine1": "İstanbul İzmir Otoyolu",
        "Town": "Taşpınar",
        "StateOrProvince": "Karacabey",
        "CountryID": 229,
        "Latitude": 40.273781237916324,
        "Longitude": 28.600534638519207,
        "ContactTelephone1": "08503399937",
        "AccessComments": "Facility outdoor parking area, right side of exit direction. Available 7/24",
        "RelatedURL": "http://www.zes.net",
        "DistanceUnit": 0
    },
    "Connections": [
        {
            "ID": 253306,
            "ConnectionTypeID": 2,
            "StatusTypeID": 50,
            "LevelID": 3,
            "PowerKW": 60,
            "CurrentTypeID": 30,
            "Quantity": 1
        },
        {
            "ID": 253307,
            "ConnectionTypeID": 33,
            "StatusTypeID": 50,
            "LevelID": 3,
            "PowerKW": 120,
            "CurrentTypeID": 30,
            "Quantity": 1
        },
        {
            "ID": 253308,
            "ConnectionTypeID": 25,
            "StatusTypeID": 50,
            "LevelID": 2,
            "Amps": 32,
            "Voltage": 240,
            "PowerKW": 22,
            "CurrentTypeID": 20,
            "Quantity": 1
        },
        {
            "ID": 253309,
            "ConnectionTypeID": 1036,
            "StatusTypeID": 50,
            "LevelID": 3,
            "Amps": 63,
            "Voltage": 400,
            "PowerKW": 43,
            "CurrentTypeID": 20,
            "Quantity": 1
        }
    ],
    "NumberOfPoints": 2,
    "GeneralComments": "New, clean, fast energy of the Turkey roads. Download ZES Mobile App to apply and then you can easily find the nearest charging station and get their information.",
    "StatusTypeID": 50,
    "DateLastStatusUpdate": "2021-02-02T17:42:00Z",
    "DataQualityLevel": 1,
    "DateCreated": "2020-09-04T07:51:00Z",
    "SubmissionStatusTypeID": 200
}