{
    "IsRecentlyVerified": false,
    "ID": 186800,
    "UUID": "FCE41C6D-BA63-46D1-8870-7BF3A41C7283",
    "DataProviderID": 29,
    "DataProvidersReference": "21221",
    "OperatorID": 103,
    "AddressInfo": {
        "ID": 187159,
        "Title": "Buchholzer Str. 1",
        "AddressLine1": "Buchholzer Str. 1",
        "Town": "Teupitz",
        "Postcode": "15755",
        "CountryID": 87,
        "Latitude": 52.123445,
        "Longitude": 13.638079,
        "DistanceUnit": 0
    },
    "Connections": [
        {
            "ID": 300197,
            "ConnectionTypeID": 33,
            "StatusTypeID": 50,
            "LevelID": 3,
            "PowerKW": 50,
            "CurrentTypeID": 30
        },
        {
            "ID": 300198,
            "ConnectionTypeID": 2,
            "StatusTypeID": 50,
            "LevelID": 3,
            "PowerKW": 50,
            "CurrentTypeID": 30
        },
        {
            "ID": 300199,
            "ConnectionTypeID": 1036,
            "StatusTypeID": 50,
            "LevelID": 3,
            "PowerKW": 43,
            "CurrentTypeID": 20
        }
    ],
    "StatusTypeID": 50,
    "DateLastStatusUpdate": "2021-07-12T02:49:00Z",
    "MetadataValues": [
        {
            "ID": 19041,
            "MetadataFieldID": 4,
            "ItemValue": "Data from the German chargepoint registry provided by Bundesnetzagentur.de under the CC-BY 4.0 license"
        }
    ],
    "DataQualityLevel": 3,
    "DateCreated": "2021-07-12T02:49:00Z",
    "SubmissionStatusTypeID": 100
}