{
    "IsRecentlyVerified": false,
    "ID": 36651,
    "UUID": "3E54FD5A-B84A-4D55-AA41-743641A58A5E",
    "DataProviderID": 26,
    "DataProvidersReference": "51779",
    "OperatorID": 73,
    "OperatorsReference": "EV-Box EVB-P1402221",
    "UsageCost": "0.00 jaarabonnement",
    "AddressInfo": {
        "ID": 36997,
        "Title": "Pieter Nuytsstraat 16",
        "AddressLine1": "Pieter Nuytsstraat 16",
        "Town": "Enschede",
        "Postcode": "7532 CD",
        "CountryID": 159,
        "Latitude": 52.21665,
        "Longitude": 6.96377,
        "RelatedURL": "http://www.ev-box.nl",
        "DistanceUnit": 0
    },
    "Connections": [
        {
            "ID": 40162,
            "ConnectionTypeID": 25,
            "LevelID": 2,
            "PowerKW": 5,
            "CurrentTypeID": 10
        }
    ],
    "NumberOfPoints": 1,
    "StatusTypeID": 50,
    "DateLastStatusUpdate": "2016-06-04T02:51:00Z",
    "DataQualityLevel": 3,
    "DateCreated": "2015-01-09T06:06:00Z",
    "SubmissionStatusTypeID": 100
}