{
    "IsRecentlyVerified": false,
    "ID": 31740,
    "UUID": "6C9318C3-E4AF-4037-8584-075CBA9314B1",
    "DataProviderID": 1,
    "OperatorID": 86,
    "OperatorsReference": "EnWB Wasserstr.Betriebsverwaltung des E-Werk Mittelbaden ",
    "AddressInfo": {
        "ID": 32086,
        "Title": "Kundenparkplatz E-Werk Mittelbaden",
        "AddressLine1": "Freiburger Straße 23a",
        "Town": "Offenburg",
        "Postcode": "77652",
        "CountryID": 87,
        "Latitude": 48.47194,
        "Longitude": 7.93494,
        "AccessComments": "24/7 nutzbar",
        "RelatedURL": "http://www.enbw.com/",
        "DistanceUnit": 0
    },
    "Connections": [
        {
            "ID": 35251,
            "ConnectionTypeID": 25,
            "StatusTypeID": 50,
            "LevelID": 2,
            "Amps": 32,
            "Voltage": 400,
            "PowerKW": 22,
            "CurrentTypeID": 20,
            "Quantity": 2
        }
    ],
    "NumberOfPoints": 2,
    "StatusTypeID": 50,
    "DateLastStatusUpdate": "2018-01-26T13:27:00Z",
    "DataQualityLevel": 3,
    "DateCreated": "2015-01-09T06:03:00Z",
    "SubmissionStatusTypeID": 100
}