{
    "IsRecentlyVerified": false,
    "ID": 57601,
    "UUID": "0413F5FC-CA77-4328-9863-C59518D936AB",
    "DataProviderID": 1,
    "OperatorID": 214,
    "UsageTypeID": 4,
    "AddressInfo": {
        "ID": 57947,
        "Title": "Wrangelstraße",
        "AddressLine1": "Wrangelstraße",
        "AddressLine2": "Kreuzberg",
        "Town": "Berlin",
        "StateOrProvince": "Berlin",
        "Postcode": "10997",
        "CountryID": 87,
        "Latitude": 52.5005170182969,
        "Longitude": 13.4371169197636,
        "AccessComments": "Rund um die Uhr (24/7) nutzbar. Ladekarte von be eMobil oder Roamingpartnern The New Motion, LichtBlick Fahrstrom Chip oder ACE Ladekarte Power Me erforderlich. ",
        "DistanceUnit": 0
    },
    "Connections": [
        {
            "ID": 72829,
            "ConnectionTypeID": 25,
            "StatusTypeID": 50,
            "LevelID": 2,
            "Amps": 16,
            "Voltage": 400,
            "PowerKW": 11,
            "CurrentTypeID": 20,
            "Quantity": 2
        }
    ],
    "NumberOfPoints": 2,
    "StatusTypeID": 50,
    "DateLastStatusUpdate": "2019-07-15T07:37:00Z",
    "DataQualityLevel": 1,
    "DateCreated": "2015-12-08T08:13:00Z",
    "SubmissionStatusTypeID": 200
}