{
    "IsRecentlyVerified": false,
    "ID": 106628,
    "UUID": "F49CFC97-A35A-4994-95C8-C22054C7F0E5",
    "DataProviderID": 1,
    "OperatorID": 1,
    "UsageTypeID": 0,
    "AddressInfo": {
        "ID": 106974,
        "Title": "Lignano  Lungomare Trieste",
        "AddressLine1": "Via Lungomare Trieste",
        "Town": "Lignano Sabbiadoro",
        "StateOrProvince": "UD",
        "Postcode": "33054",
        "CountryID": 112,
        "Latitude": 45.68949071034381,
        "Longitude": 13.146010010551436,
        "DistanceUnit": 0
    },
    "Connections": [
        {
            "ID": 150043,
            "ConnectionTypeID": 25,
            "StatusTypeID": 150,
            "LevelID": 2,
            "Quantity": 6
        }
    ],
    "NumberOfPoints": 6,
    "StatusTypeID": 150,
    "DateLastStatusUpdate": "2018-06-26T14:52:00Z",
    "DataQualityLevel": 1,
    "DateCreated": "2018-06-26T14:52:00Z",
    "SubmissionStatusTypeID": 200
}