{
    "IsRecentlyVerified": false,
    "ID": 85840,
    "UUID": "F365C186-4F8E-4EAD-A8CC-1CA1E52E9C43",
    "DataProviderID": 1,
    "OperatorID": 3315,
    "OperatorsReference": "50716,51498",
    "UsageTypeID": 4,
    "UsageCost": "Free",
    "AddressInfo": {
        "ID": 86186,
        "Title": "Hampden Park and Ride",
        "AddressLine1": "Aikenhead Road",
        "Town": "Glasgow",
        "Postcode": "G42 0NT",
        "CountryID": 1,
        "Latitude": 55.82728,
        "Longitude": -4.248208,
        "DistanceUnit": 0
    },
    "Connections": [
        {
            "ID": 122011,
            "ConnectionTypeID": 33,
            "StatusTypeID": 50,
            "LevelID": 3,
            "PowerKW": 50,
            "CurrentTypeID": 30,
            "Quantity": 1
        },
        {
            "ID": 122012,
            "ConnectionTypeID": 2,
            "StatusTypeID": 50,
            "LevelID": 3,
            "PowerKW": 50,
            "CurrentTypeID": 30,
            "Quantity": 1
        },
        {
            "ID": 122013,
            "ConnectionTypeID": 1036,
            "StatusTypeID": 50,
            "LevelID": 3,
            "PowerKW": 43,
            "CurrentTypeID": 20,
            "Quantity": 1
        },
        {
            "ID": 122014,
            "ConnectionTypeID": 25,
            "StatusTypeID": 50,
            "LevelID": 2,
            "Amps": 32,
            "Voltage": 400,
            "PowerKW": 22,
            "CurrentTypeID": 20,
            "Quantity": 2
        }
    ],
    "NumberOfPoints": 4,
    "StatusTypeID": 50,
    "DateLastStatusUpdate": "2020-06-02T05:15:00Z",
    "DataQualityLevel": 1,
    "DateCreated": "2017-04-18T09:15:00Z",
    "SubmissionStatusTypeID": 200
}