{
    "IsRecentlyVerified": false,
    "ID": 73750,
    "UUID": "AD4AE67D-74B1-4D94-BB4B-4E7983431F6A",
    "DataProviderID": 1,
    "OperatorID": 89,
    "OperatorsReference": "CEA-10966",
    "UsageTypeID": 4,
    "UsageCost": "CAD 1.00/hour",
    "AddressInfo": {
        "ID": 74096,
        "Title": "St-Hubert-Sainte-Agathe",
        "AddressLine1": "950 rue Principale",
        "Town": "Sainte-Agathe-des-Monts",
        "StateOrProvince": "QC",
        "Postcode": "J8C 1L6",
        "CountryID": 44,
        "Latitude": 46.043527,
        "Longitude": -74.26613,
        "DistanceUnit": 0
    },
    "Connections": [
        {
            "ID": 106051,
            "ConnectionTypeID": 1,
            "StatusTypeID": 50,
            "LevelID": 2,
            "Amps": 32,
            "Voltage": 230,
            "PowerKW": 7,
            "CurrentTypeID": 10,
            "Quantity": 1
        }
    ],
    "NumberOfPoints": 1,
    "StatusTypeID": 50,
    "DateLastStatusUpdate": "2018-01-28T06:33:00Z",
    "DataQualityLevel": 1,
    "DateCreated": "2016-11-23T22:57:00Z",
    "SubmissionStatusTypeID": 200
}