{
    "IsRecentlyVerified": false,
    "ID": 3433,
    "UUID": "FE01DE0B-E5B6-47D3-A79D-81A153247913",
    "DataProviderID": 1,
    "OperatorID": 1,
    "AddressInfo": {
        "ID": 3434,
        "Title": "Hilton San Francisco Financial District",
        "AddressLine1": "750 Kearny St",
        "Town": "San Francisco",
        "StateOrProvince": "CA",
        "Postcode": "94115",
        "CountryID": 2,
        "Latitude": 37.795186,
        "Longitude": -122.404668,
        "ContactTelephone1": "415-433-6600       ",
        "AccessComments": "At Washington Street",
        "DistanceUnit": 0
    },
    "Connections": [],
    "NumberOfPoints": 2,
    "GeneralComments": "Cost To Charge: Unknown Access Hours: 24 Hr",
    "DateLastStatusUpdate": "2019-12-15T06:07:00Z",
    "DateCreated": "2010-02-28T00:00:00Z",
    "SubmissionStatusTypeID": 200
}