{
    "IsRecentlyVerified": false,
    "ID": 188554,
    "UUID": "790282A7-A0A5-4F8A-866B-FD39ECC1B634",
    "DataProviderID": 1,
    "OperatorID": 1,
    "UsageTypeID": 4,
    "AddressInfo": {
        "ID": 188913,
        "Title": "Universidad Huelva, Campus del Carmen Ed. José Isidoro Morales",
        "AddressLine1": "Universidad Huelva, Campus del Carmen Ed. José Isidoro Morales",
        "Town": "Huelva",
        "StateOrProvince": "Huelva",
        "Postcode": "21007",
        "CountryID": 210,
        "Latitude": 37.264344,
        "Longitude": -6.942405,
        "DistanceUnit": 0
    },
    "Connections": [
        {
            "ID": 304558,
            "ConnectionTypeID": 33,
            "StatusTypeID": 50,
            "LevelID": 2,
            "Amps": 48,
            "Voltage": 400,
            "PowerKW": 22,
            "CurrentTypeID": 20,
            "Quantity": 1,
            "Comments": "Cuenta con Toma tipo Schucko "
        }
    ],
    "NumberOfPoints": 1,
    "StatusTypeID": 50,
    "DateLastStatusUpdate": "2021-08-03T13:01:00Z",
    "DataQualityLevel": 1,
    "DateCreated": "2021-08-02T07:53:00Z",
    "SubmissionStatusTypeID": 200
}