{
    "IsRecentlyVerified": false,
    "ID": 37769,
    "UUID": "AF69F5EE-AE68-46EB-89E8-9EE749984BE8",
    "DataProviderID": 26,
    "DataProvidersReference": "25788",
    "OperatorID": 78,
    "OperatorsReference": "Essent EM-NL-00000363-01-00035",
    "UsageCost": "0.00 jaarabonnement",
    "AddressInfo": {
        "ID": 38115,
        "Title": "Windroosplein 61A",
        "AddressLine1": "Windroosplein 61A",
        "Town": "Amsterdam",
        "Postcode": "1018 ZZ",
        "CountryID": 159,
        "Latitude": 52.37324,
        "Longitude": 4.924141,
        "RelatedURL": "http://www.essent.nl",
        "DistanceUnit": 0
    },
    "Connections": [
        {
            "ID": 41280,
            "ConnectionTypeID": 25,
            "LevelID": 2,
            "PowerKW": 11,
            "CurrentTypeID": 10
        },
        {
            "ID": 49263,
            "ConnectionTypeID": 25,
            "LevelID": 2,
            "PowerKW": 11,
            "CurrentTypeID": 10
        }
    ],
    "NumberOfPoints": 1,
    "StatusTypeID": 50,
    "DateLastStatusUpdate": "2016-06-04T02:53:00Z",
    "DataQualityLevel": 3,
    "DateCreated": "2015-01-09T06:07:00Z",
    "SubmissionStatusTypeID": 100
}