{
    "IsRecentlyVerified": false,
    "ID": 182099,
    "UUID": "D8D9F25F-7F50-4883-B6C8-21082D976EBC",
    "DataProviderID": 29,
    "DataProvidersReference": "9200",
    "OperatorID": 3253,
    "AddressInfo": {
        "ID": 182458,
        "Title": "Hirschplanallee 2",
        "AddressLine1": "Hirschplanallee 2",
        "Town": "Oberschleißheim",
        "Postcode": "85764",
        "CountryID": 87,
        "Latitude": 48.2608,
        "Longitude": 11.556415,
        "DistanceUnit": 0
    },
    "Connections": [
        {
            "ID": 287417,
            "ConnectionTypeID": 25,
            "StatusTypeID": 50,
            "LevelID": 2,
            "PowerKW": 22,
            "CurrentTypeID": 20
        },
        {
            "ID": 287418,
            "ConnectionTypeID": 25,
            "StatusTypeID": 50,
            "LevelID": 2,
            "PowerKW": 22,
            "CurrentTypeID": 20
        }
    ],
    "StatusTypeID": 50,
    "DateLastStatusUpdate": "2021-07-12T02:40:00Z",
    "MetadataValues": [
        {
            "ID": 14393,
            "MetadataFieldID": 4,
            "ItemValue": "Data from the German chargepoint registry provided by Bundesnetzagentur.de under the CC-BY 4.0 license"
        }
    ],
    "DataQualityLevel": 3,
    "DateCreated": "2021-07-08T10:02:00Z",
    "SubmissionStatusTypeID": 100
}