{
    "IsRecentlyVerified": false,
    "ID": 85821,
    "UUID": "00018827-BD8D-4BBC-891B-FDB673474F2F",
    "DataProviderID": 1,
    "OperatorID": 3,
    "OperatorsReference": "PG-81042",
    "UsageTypeID": 6,
    "UsageCost": "Free",
    "AddressInfo": {
        "ID": 86167,
        "Title": "Everton Garage Limited-Hyundai",
        "AddressLine1": "Old Christchurch Road",
        "Town": "Lymington",
        "Postcode": "SO41 0JJ",
        "CountryID": 1,
        "Latitude": 50.745144,
        "Longitude": -1.587443,
        "DistanceUnit": 0
    },
    "Connections": [
        {
            "ID": 121974,
            "ConnectionTypeID": 25,
            "StatusTypeID": 50,
            "LevelID": 2,
            "Amps": 32,
            "Voltage": 230,
            "PowerKW": 7,
            "CurrentTypeID": 10,
            "Quantity": 2
        }
    ],
    "NumberOfPoints": 3,
    "GeneralComments": "This is an open charge unit installed at the Everton Garage Limited - Hyundai dealership in Everton, Lymington",
    "StatusTypeID": 50,
    "DateLastStatusUpdate": "2017-12-22T06:32:00Z",
    "DataQualityLevel": 1,
    "DateCreated": "2017-04-15T20:17:00Z",
    "SubmissionStatusTypeID": 200
}