{
    "IsRecentlyVerified": false,
    "ID": 38182,
    "UUID": "8121B379-23BA-49B8-A52C-20B50C6D4061",
    "DataProviderID": 26,
    "DataProvidersReference": "31424",
    "OperatorID": 157,
    "OperatorsReference": "NewMotion 02005767",
    "UsageCost": "0.00 jaarabonnement",
    "AddressInfo": {
        "ID": 38528,
        "Title": "Rondweg 74",
        "AddressLine1": "Rondweg 74",
        "Town": "Oldebroek",
        "Postcode": "8091 XK",
        "CountryID": 159,
        "Latitude": 52.4701957702637,
        "Longitude": 5.9947395324707,
        "ContactTelephone1": "088 0109500",
        "RelatedURL": "http://thenewmotion.nl/",
        "DistanceUnit": 0
    },
    "Connections": [
        {
            "ID": 41693,
            "ConnectionTypeID": 25,
            "LevelID": 2,
            "PowerKW": 3.7,
            "CurrentTypeID": 10
        }
    ],
    "NumberOfPoints": 1,
    "StatusTypeID": 50,
    "DateLastStatusUpdate": "2016-06-04T02:54:00Z",
    "DataQualityLevel": 3,
    "DateCreated": "2015-01-09T06:07:00Z",
    "SubmissionStatusTypeID": 100
}