{
    "IsRecentlyVerified": false,
    "ID": 53802,
    "UUID": "723D2F2E-E815-4E9B-AB15-15F7C1350806",
    "DataProviderID": 26,
    "DataProvidersReference": "69319",
    "OperatorID": 73,
    "OperatorsReference": "EV-Box EVB-P1420080",
    "UsageCost": "0.00 jaarabonnement",
    "AddressInfo": {
        "ID": 54148,
        "Title": "Machiel Vrijenhoeklaan",
        "AddressLine1": "Machiel Vrijenhoeklaan",
        "Town": "Den Haag",
        "Postcode": "2555 NW",
        "CountryID": 159,
        "Latitude": 52.05912,
        "Longitude": 4.21215,
        "RelatedURL": "http://www.ev-box.nl",
        "DistanceUnit": 0
    },
    "Connections": [
        {
            "ID": 67165,
            "ConnectionTypeID": 25,
            "LevelID": 2,
            "PowerKW": 11,
            "CurrentTypeID": 10
        },
        {
            "ID": 67166,
            "ConnectionTypeID": 25,
            "LevelID": 2,
            "PowerKW": 11,
            "CurrentTypeID": 10
        }
    ],
    "NumberOfPoints": 1,
    "StatusTypeID": 50,
    "DateLastStatusUpdate": "2016-06-04T02:45:00Z",
    "DataQualityLevel": 3,
    "DateCreated": "2015-09-20T11:50:00Z",
    "SubmissionStatusTypeID": 100
}