{
    "IsRecentlyVerified": false,
    "ID": 179070,
    "UUID": "7785759F-D5CE-45CD-B32A-FD69C5756728",
    "DataProviderID": 29,
    "DataProvidersReference": "15741",
    "OperatorID": 45,
    "AddressInfo": {
        "ID": 179429,
        "Title": "Hafnerhöhe 3",
        "AddressLine1": "Hafnerhöhe 3",
        "Town": "Viechtach",
        "Postcode": "94234",
        "CountryID": 87,
        "Latitude": 49.073135,
        "Longitude": 12.891014,
        "DistanceUnit": 0
    },
    "Connections": [
        {
            "ID": 280338,
            "ConnectionTypeID": 33,
            "StatusTypeID": 50,
            "LevelID": 3,
            "PowerKW": 22,
            "CurrentTypeID": 30
        },
        {
            "ID": 280339,
            "ConnectionTypeID": 25,
            "StatusTypeID": 50,
            "LevelID": 2,
            "PowerKW": 11,
            "CurrentTypeID": 20
        }
    ],
    "StatusTypeID": 50,
    "DateLastStatusUpdate": "2021-07-09T03:15:00Z",
    "MetadataValues": [
        {
            "ID": 11364,
            "MetadataFieldID": 4,
            "ItemValue": "Data from the German chargepoint registry provided by Bundesnetzagentur.de under the CC-BY 4.0 license"
        }
    ],
    "DataQualityLevel": 3,
    "DateCreated": "2021-07-08T09:59:00Z",
    "SubmissionStatusTypeID": 100
}