{
    "IsRecentlyVerified": false,
    "ID": 115684,
    "UUID": "1F4FCE99-1759-41E1-92D1-9983ACCC72F3",
    "DataProviderID": 2,
    "DataProvidersReference": "112858",
    "OperatorID": 23,
    "UsageTypeID": 1,
    "AddressInfo": {
        "ID": 116030,
        "Title": "Bear Valley Lodge - Tesla Destination",
        "AddressLine1": "3 Bear Valley Rd",
        "Town": "Bear Valley",
        "StateOrProvince": "CA",
        "Postcode": "95223",
        "CountryID": 2,
        "Latitude": 38.462499,
        "Longitude": -120.041769,
        "ContactTelephone1": "209-753-2327  877-798-3752",
        "AccessComments": "24 hours daily; for Tesla use only",
        "RelatedURL": "https://www.tesla.com/destination-charging",
        "DistanceUnit": 0
    },
    "Connections": [
        {
            "ID": 162717,
            "ConnectionTypeID": 0,
            "LevelID": 2,
            "Amps": 16,
            "Voltage": 230,
            "PowerKW": 3,
            "CurrentTypeID": 10,
            "Quantity": 2
        }
    ],
    "DateLastStatusUpdate": "2019-04-06T05:04:00Z",
    "DataQualityLevel": 3,
    "DateCreated": "2019-02-11T07:13:00Z",
    "SubmissionStatusTypeID": 100
}