{
    "UserComments": [
        {
            "ID": 3716,
            "ChargePointID": 40732,
            "CommentTypeID": 10,
            "UserName": "",
            "Comment": "Zentrale Lage in Langenhagen, Kino und Einkaufszentrum sind in der Nähe.",
            "Rating": 5,
            "DateCreated": "2015-02-08T16:01:11.137Z",
            "CheckinStatusTypeID": 10
        }
    ],
    "MediaItems": [
        {
            "ID": 5845,
            "ChargePointID": 40732,
            "ItemURL": "https://s3-ap-southeast-2.amazonaws.com/openchargemap/images/DE/OCM40732/OCM-40732.orig.2016020716323946.jpg",
            "ItemThumbnailURL": "https://s3-ap-southeast-2.amazonaws.com/openchargemap/images/DE/OCM40732/OCM-40732.thmb.2016020716323946.jpg",
            "Comment": "",
            "IsEnabled": true,
            "IsVideo": false,
            "IsFeaturedItem": false,
            "IsExternalResource": false,
            "User": {
                "ID": 4573,
                "Username": "Erna_Schleck"
            },
            "DateCreated": "2016-02-07T16:33:00Z"
        }
    ],
    "IsRecentlyVerified": false,
    "ID": 40732,
    "UUID": "9DED6274-DB65-4D09-B5F7-08BE0BE9B8FE",
    "DataProviderID": 1,
    "OperatorID": 156,
    "UsageTypeID": 4,
    "UsageCost": "3,50€ / h",
    "AddressInfo": {
        "ID": 41078,
        "Title": "Langenhagen Rathaus ",
        "AddressLine1": "Konrad-Adenauer-Straße 21",
        "AddressLine2": "",
        "Town": "Langenhagen",
        "StateOrProvince": "Region Hannover",
        "Postcode": "30853",
        "CountryID": 87,
        "Latitude": 52.4400921885336,
        "Longitude": 9.74171367591863,
        "ContactTelephone1": "",
        "ContactTelephone2": "",
        "ContactEmail": "",
        "AccessComments": "Ladestation 24/7 nutzbar an 2 reservierten Parkplätzen.",
        "RelatedURL": "http://www.enercity-contracting.de/alternative-antriebe/elektromobilitaet/ladesaeulen/index.html",
        "DistanceUnit": 0
    },
    "Connections": [
        {
            "ID": 44339,
            "ConnectionTypeID": 28,
            "StatusTypeID": 50,
            "LevelID": 2,
            "Amps": 16,
            "Voltage": 230,
            "PowerKW": 3.7,
            "CurrentTypeID": 10,
            "Quantity": 2
        },
        {
            "ID": 44340,
            "ConnectionTypeID": 25,
            "StatusTypeID": 50,
            "LevelID": 2,
            "Amps": 32,
            "Voltage": 400,
            "PowerKW": 22,
            "CurrentTypeID": 20,
            "Quantity": 2
        }
    ],
    "NumberOfPoints": 2,
    "GeneralComments": "",
    "StatusTypeID": 50,
    "DateLastStatusUpdate": "2016-05-03T20:04:00Z",
    "DataQualityLevel": 1,
    "DateCreated": "2015-01-12T09:06:00Z",
    "SubmissionStatusTypeID": 200
}