{
    "IsRecentlyVerified": false,
    "ID": 53502,
    "UUID": "9C6A68B8-7F41-4691-B324-3290321DCB2C",
    "DataProviderID": 1,
    "DataProvidersReference": "2985",
    "AddressInfo": {
        "ID": 53848,
        "Title": "Toftagården",
        "AddressLine1": "Spireavägen 14",
        "Town": "GOTLANDS TOFTA",
        "StateOrProvince": "GOTLAND",
        "Postcode": "62266",
        "CountryID": 216,
        "Latitude": 57.48608,
        "Longitude": 18.13991,
        "AccessComments": "Framför entrén till Toftagården.",
        "DistanceUnit": 0
    },
    "Connections": [
        {
            "ID": 66623,
            "ConnectionTypeID": 0,
            "Reference": "1",
            "LevelID": 2,
            "Amps": 16,
            "Voltage": 230,
            "PowerKW": 3.7,
            "Comments": "Mode 3"
        },
        {
            "ID": 87842,
            "ConnectionTypeID": 0,
            "Reference": "2",
            "LevelID": 2,
            "Amps": 16,
            "Voltage": 230,
            "PowerKW": 3.7,
            "Comments": "Mode 1"
        }
    ],
    "NumberOfPoints": 2,
    "DateLastStatusUpdate": "2020-05-26T08:21:00Z",
    "DataQualityLevel": 2,
    "DateCreated": "2015-09-20T11:33:00Z",
    "SubmissionStatusTypeID": 100
}