{
    "IsRecentlyVerified": false,
    "ID": 159549,
    "UUID": "B89C7A5B-F287-43A0-ABB3-5F2F3D427A27",
    "DataProviderID": 2,
    "DataProvidersReference": "156815",
    "OperatorID": 5,
    "UsageTypeID": 1,
    "AddressInfo": {
        "ID": 159906,
        "Title": "BREIT EV GROUP",
        "AddressLine1": "555 Lancaster Ave",
        "Town": "Radnor",
        "StateOrProvince": "PA",
        "Postcode": "19087",
        "CountryID": 2,
        "Latitude": 40.04162,
        "Longitude": -75.36861,
        "ContactTelephone1": "888-758-4389",
        "AccessComments": "24 hours daily",
        "RelatedURL": "http://www.chargepoint.com/",
        "DistanceUnit": 0
    },
    "Connections": [
        {
            "ID": 229742,
            "ConnectionTypeID": 1,
            "LevelID": 2,
            "Amps": 16,
            "Voltage": 230,
            "PowerKW": 3.7,
            "CurrentTypeID": 10,
            "Quantity": 2
        }
    ],
    "StatusTypeID": 50,
    "DateLastStatusUpdate": "2020-06-26T03:02:00Z",
    "DataQualityLevel": 3,
    "DateCreated": "2020-06-26T03:02:00Z",
    "SubmissionStatusTypeID": 100
}