{
    "IsRecentlyVerified": false,
    "ID": 91788,
    "UUID": "BDD89B1C-A4BE-4F1A-807F-CFAB37EC9886",
    "DataProviderID": 1,
    "OperatorID": 23,
    "OperatorsReference": "32829",
    "UsageTypeID": 6,
    "AddressInfo": {
        "ID": 92134,
        "Title": "Hilton Garden Inn Panama City",
        "AddressLine1": "1101 Us-231",
        "Town": "Panama City",
        "StateOrProvince": "Florida",
        "Postcode": "32405",
        "CountryID": 2,
        "Latitude": 30.188423,
        "Longitude": -85.643517,
        "ContactTelephone1": "(850) 392-1093",
        "DistanceUnit": 0
    },
    "Connections": [
        {
            "ID": 130137,
            "ConnectionTypeID": 30,
            "StatusTypeID": 50,
            "LevelID": 2,
            "PowerKW": 8,
            "CurrentTypeID": 10,
            "Quantity": 2
        }
    ],
    "NumberOfPoints": 2,
    "GeneralComments": "2 Tesla Connectors, up to 8kW.Available for patrons only. Please see front desk.",
    "StatusTypeID": 50,
    "DateLastStatusUpdate": "2017-08-18T07:36:00Z",
    "DataQualityLevel": 1,
    "DateCreated": "2017-08-18T07:36:00Z",
    "SubmissionStatusTypeID": 200
}