{
    "IsRecentlyVerified": false,
    "ID": 124516,
    "UUID": "A039A337-0C97-4022-BF15-6DF60C92456B",
    "DataProviderID": 2,
    "DataProvidersReference": "61023",
    "OperatorID": 5,
    "UsageTypeID": 1,
    "AddressInfo": {
        "ID": 124862,
        "Title": "EDWARDSVILLE",
        "AddressLine1": "101-199 E Park St",
        "Town": "Edwardsville",
        "StateOrProvince": "IL",
        "Postcode": "62025",
        "CountryID": 2,
        "Latitude": 38.8105902,
        "Longitude": -89.9547529,
        "ContactTelephone1": "888-758-4389",
        "AccessComments": "24 hours daily",
        "RelatedURL": "http://www.chargepoint.com/",
        "DistanceUnit": 0
    },
    "Connections": [
        {
            "ID": 174626,
            "ConnectionTypeID": 1,
            "LevelID": 2,
            "Amps": 16,
            "Voltage": 230,
            "PowerKW": 3,
            "CurrentTypeID": 10,
            "Quantity": 1
        }
    ],
    "DateLastStatusUpdate": "2019-12-24T09:15:00Z",
    "DataQualityLevel": 3,
    "DateCreated": "2019-04-06T05:03:00Z",
    "SubmissionStatusTypeID": 100
}