{
    "MediaItems": [
        {
            "ID": 25003,
            "ChargePointID": 105235,
            "ItemURL": "https://s3-ap-southeast-2.amazonaws.com/openchargemap/images/CZ/OCM105235/OCM-105235.orig.2020100815231516.jpg",
            "ItemThumbnailURL": "https://s3-ap-southeast-2.amazonaws.com/openchargemap/images/CZ/OCM105235/OCM-105235.thmb.2020100815231516.jpg",
            "Comment": "#pre #prazskaenergetika #kino #smichov #nonstop #hyundai",
            "IsEnabled": true,
            "IsVideo": false,
            "IsFeaturedItem": false,
            "IsExternalResource": false,
            "User": {
                "ID": 22495,
                "Username": "MAJKL_elektro🔋"
            },
            "DateCreated": "2020-10-08T15:23:00Z"
        },
        {
            "ID": 25002,
            "ChargePointID": 105235,
            "ItemURL": "https://s3-ap-southeast-2.amazonaws.com/openchargemap/images/CZ/OCM105235/OCM-105235.orig.2020100815214066.jpg",
            "ItemThumbnailURL": "https://s3-ap-southeast-2.amazonaws.com/openchargemap/images/CZ/OCM105235/OCM-105235.thmb.2020100815214066.jpg",
            "Comment": "#pre #prazskaenergetika #kino #smichov #nonstop #hyundai",
            "IsEnabled": true,
            "IsVideo": false,
            "IsFeaturedItem": false,
            "IsExternalResource": false,
            "User": {
                "ID": 22495,
                "Username": "MAJKL_elektro🔋"
            },
            "DateCreated": "2020-10-08T15:22:00Z"
        },
        {
            "ID": 25001,
            "ChargePointID": 105235,
            "ItemURL": "https://s3-ap-southeast-2.amazonaws.com/openchargemap/images/CZ/OCM105235/OCM-105235.orig.2020100815184320.jpg",
            "ItemThumbnailURL": "https://s3-ap-southeast-2.amazonaws.com/openchargemap/images/CZ/OCM105235/OCM-105235.thmb.2020100815184320.jpg",
            "Comment": "#pre #prazskaenergetika #kino #smichov #nonstop #hyundai",
            "IsEnabled": true,
            "IsVideo": false,
            "IsFeaturedItem": false,
            "IsExternalResource": false,
            "User": {
                "ID": 22495,
                "Username": "MAJKL_elektro🔋"
            },
            "DateCreated": "2020-10-08T15:19:00Z"
        },
        {
            "ID": 15591,
            "ChargePointID": 105235,
            "ItemURL": "https://s3-ap-southeast-2.amazonaws.com/openchargemap/images/CZ/OCM105235/OCM-105235.orig.2018060311252217.jpg",
            "ItemThumbnailURL": "https://s3-ap-southeast-2.amazonaws.com/openchargemap/images/CZ/OCM105235/OCM-105235.thmb.2018060311252217.jpg",
            "Comment": "",
            "IsEnabled": true,
            "IsVideo": false,
            "IsFeaturedItem": false,
            "IsExternalResource": false,
            "User": {
                "ID": 6224,
                "Username": "ozana"
            },
            "DateCreated": "2018-06-03T11:26:00Z"
        }
    ],
    "IsRecentlyVerified": false,
    "ID": 105235,
    "UUID": "964D97C8-E368-45D9-8A6D-375A8DFE9EFB",
    "DataProviderID": 1,
    "OperatorID": 190,
    "UsageTypeID": 1,
    "AddressInfo": {
        "ID": 105581,
        "Title": "PRE Cinestar Anděl",
        "AddressLine1": "Radlická 3179/1E",
        "AddressLine2": "Smíchov",
        "Town": "Praha",
        "StateOrProvince": "okres Hlavní město Praha",
        "Postcode": "150 00",
        "CountryID": 64,
        "Latitude": 50.0711592,
        "Longitude": 14.4015589000001,
        "AccessComments": "V podzemních garážích u vstupu do kina sítě CineStar.\r\nVjezd do podzemních garáží je možný z ulice Stroupežnického a Radlická.",
        "DistanceUnit": 0
    },
    "Connections": [
        {
            "ID": 148354,
            "ConnectionTypeID": 2,
            "StatusTypeID": 50,
            "LevelID": 3,
            "PowerKW": 50,
            "CurrentTypeID": 30,
            "Quantity": 1
        },
        {
            "ID": 148355,
            "ConnectionTypeID": 33,
            "StatusTypeID": 50,
            "LevelID": 3,
            "PowerKW": 50,
            "CurrentTypeID": 30,
            "Quantity": 1
        },
        {
            "ID": 148356,
            "ConnectionTypeID": 25,
            "StatusTypeID": 50,
            "LevelID": 2,
            "Amps": 32,
            "Voltage": 400,
            "PowerKW": 22,
            "CurrentTypeID": 20,
            "Quantity": 1
        }
    ],
    "NumberOfPoints": 1,
    "GeneralComments": "Je vyžadován RFID čip  od PRE.",
    "StatusTypeID": 50,
    "DateLastStatusUpdate": "2020-10-08T15:23:00Z",
    "DataQualityLevel": 1,
    "DateCreated": "2018-06-03T11:20:00Z",
    "SubmissionStatusTypeID": 200
}