{
    "IsRecentlyVerified": false,
    "ID": 100144,
    "UUID": "CDF12061-EF53-4F46-BA94-BE4B8F809F9A",
    "DataProviderID": 1,
    "OperatorID": 45,
    "UsageTypeID": 1,
    "AddressInfo": {
        "ID": 100490,
        "Title": "Parkplatz Kirchensteig",
        "AddressLine1": "Kirchensteig 3",
        "Town": "Kümmersbruck",
        "StateOrProvince": "Landkreis Amberg-Sulzbach",
        "Postcode": "92245",
        "CountryID": 87,
        "Latitude": 49.41916799227751,
        "Longitude": 11.87858859933624,
        "AccessComments": "24/7 kostenlos und ohne Ladekarte laden auf dem Parkplatz gegenüber Gasthof zur blauen Traube",
        "DistanceUnit": 0
    },
    "Connections": [
        {
            "ID": 141464,
            "ConnectionTypeID": 25,
            "StatusTypeID": 50,
            "LevelID": 2,
            "Amps": 16,
            "Voltage": 400,
            "PowerKW": 11,
            "CurrentTypeID": 20,
            "Quantity": 2
        }
    ],
    "NumberOfPoints": 2,
    "StatusTypeID": 50,
    "DateLastStatusUpdate": "2018-02-14T14:55:00Z",
    "DataQualityLevel": 1,
    "DateCreated": "2018-02-14T14:55:00Z",
    "SubmissionStatusTypeID": 200
}