{
    "IsRecentlyVerified": false,
    "ID": 93968,
    "UUID": "3E8F2089-BFCC-47DD-B065-8B2DFA9D3808",
    "DataProviderID": 1,
    "OperatorID": 23,
    "OperatorsReference": "36247",
    "UsageTypeID": 4,
    "AddressInfo": {
        "ID": 94314,
        "Title": "Hampton Inn Atlanta - Buckhead",
        "AddressLine1": "3398 Piedmont RD",
        "Town": "Atlanta",
        "StateOrProvince": "Georgia",
        "Postcode": "30305",
        "CountryID": 2,
        "Latitude": 33.847158,
        "Longitude": -84.373871,
        "ContactTelephone1": "(404) 233-5656",
        "DistanceUnit": 0
    },
    "Connections": [
        {
            "ID": 133022,
            "ConnectionTypeID": 30,
            "StatusTypeID": 50,
            "LevelID": 2,
            "PowerKW": 8,
            "CurrentTypeID": 10,
            "Quantity": 1
        }
    ],
    "NumberOfPoints": 1,
    "GeneralComments": "1 Tesla Connector, up to 8kW.Available for customers. Please see front desk.",
    "StatusTypeID": 50,
    "DateLastStatusUpdate": "2017-10-14T05:31:00Z",
    "DataQualityLevel": 1,
    "DateCreated": "2017-10-14T05:31:00Z",
    "SubmissionStatusTypeID": 200
}