{
    "IsRecentlyVerified": false,
    "ID": 120088,
    "UUID": "E3229DB1-7871-4447-8504-D2C4915D6A17",
    "DataProviderID": 2,
    "DataProvidersReference": "39968",
    "UsageTypeID": 7,
    "AddressInfo": {
        "ID": 120434,
        "Title": "Fuccillo Nissan",
        "AddressLine1": "7447 Blanding Blvd",
        "Town": "Jacksonville",
        "StateOrProvince": "FL",
        "Postcode": "32244",
        "CountryID": 2,
        "Latitude": 30.212415,
        "Longitude": -81.736209,
        "ContactTelephone1": "904-270-9954",
        "AccessComments": "Dealership business hours\r\nPublic - Call ahead",
        "RelatedURL": "",
        "DistanceUnit": 0
    },
    "Connections": [
        {
            "ID": 169405,
            "ConnectionTypeID": 1,
            "LevelID": 2,
            "Amps": 16,
            "Voltage": 230,
            "PowerKW": 3.7,
            "CurrentTypeID": 10,
            "Quantity": 1
        },
        {
            "ID": 169406,
            "ConnectionTypeID": 2,
            "LevelID": 3,
            "Amps": 100,
            "Voltage": 400,
            "PowerKW": 40,
            "CurrentTypeID": 30,
            "Quantity": 1
        }
    ],
    "DateLastStatusUpdate": "2020-06-26T02:54:00Z",
    "DataQualityLevel": 3,
    "DateCreated": "2019-04-01T04:59:00Z",
    "SubmissionStatusTypeID": 100
}