{
    "IsRecentlyVerified": false,
    "ID": 70108,
    "UUID": "12338644-C1A8-4546-9D3D-91AD60FD77B5",
    "DataProviderID": 1,
    "OperatorID": 156,
    "UsageTypeID": 4,
    "AddressInfo": {
        "ID": 70454,
        "Title": "Hauptstraße",
        "AddressLine1": "Hauptstraße 34",
        "Town": "Scheßlitz",
        "StateOrProvince": "Landkreis Bamberg",
        "Postcode": "96110",
        "CountryID": 87,
        "Latitude": 49.9761,
        "Longitude": 11.033620000000042,
        "AccessComments": "24/7 nutzbar mit The New Motion Ladekarte oder von Roamingpartnern. Laden ist kostenlos.",
        "DistanceUnit": 0
    },
    "Connections": [
        {
            "ID": 100022,
            "ConnectionTypeID": 25,
            "StatusTypeID": 50,
            "LevelID": 2,
            "Amps": 16,
            "Voltage": 400,
            "PowerKW": 11,
            "CurrentTypeID": 20,
            "Quantity": 2
        }
    ],
    "NumberOfPoints": 2,
    "StatusTypeID": 50,
    "DateLastStatusUpdate": "2016-07-07T15:20:00Z",
    "DataQualityLevel": 1,
    "DateCreated": "2016-07-07T15:20:00Z",
    "SubmissionStatusTypeID": 200
}