{
    "IsRecentlyVerified": false,
    "ID": 73888,
    "UUID": "A9050951-83D8-4322-B0B0-4C4EEC8E8FB5",
    "DataProviderID": 1,
    "OperatorID": 89,
    "OperatorsReference": "CEB-10029",
    "UsageTypeID": 4,
    "UsageCost": "CAD 1.00/hour",
    "AddressInfo": {
        "ID": 74234,
        "Title": "RONA-Québec",
        "AddressLine1": "1500 rue Bouvier",
        "Town": "Québec",
        "StateOrProvince": "QC",
        "Postcode": "G2K 1N8",
        "CountryID": 44,
        "Latitude": 46.827658,
        "Longitude": -71.293394,
        "DistanceUnit": 0
    },
    "Connections": [
        {
            "ID": 106199,
            "ConnectionTypeID": 1,
            "StatusTypeID": 50,
            "LevelID": 2,
            "Amps": 32,
            "Voltage": 230,
            "PowerKW": 7,
            "CurrentTypeID": 10,
            "Quantity": 1
        }
    ],
    "NumberOfPoints": 1,
    "StatusTypeID": 50,
    "DateLastStatusUpdate": "2017-02-09T21:10:00Z",
    "DataQualityLevel": 1,
    "DateCreated": "2016-11-23T23:28:00Z",
    "SubmissionStatusTypeID": 200
}