{
    "IsRecentlyVerified": false,
    "ID": 40956,
    "UUID": "5321FD8C-1982-4F68-9E78-C39EC9496A75",
    "DataProviderID": 1,
    "OperatorID": 125,
    "UsageTypeID": 5,
    "UsageCost": "",
    "AddressInfo": {
        "ID": 41302,
        "Title": "Parkhaus am Brill",
        "AddressLine1": "Ansgaritorstraße 16-10",
        "AddressLine2": "",
        "Town": "Bremen",
        "StateOrProvince": "Bremen",
        "Postcode": "28195",
        "CountryID": 87,
        "Latitude": 53.0792053,
        "Longitude": 8.80304839999997,
        "ContactTelephone1": " 0421 3590",
        "ContactTelephone2": "",
        "ContactEmail": "",
        "AccessComments": "Parkplätze im Erdgeschoss. Parkgebühren fallen an!",
        "RelatedURL": "https://www.swb-gruppe.de",
        "DistanceUnit": 0
    },
    "Connections": [
        {
            "ID": 44615,
            "ConnectionTypeID": 25,
            "StatusTypeID": 50,
            "LevelID": 2,
            "Amps": 32,
            "Voltage": 400,
            "PowerKW": 22,
            "CurrentTypeID": 20,
            "Quantity": 1
        },
        {
            "ID": 44616,
            "ConnectionTypeID": 17,
            "StatusTypeID": 50,
            "LevelID": 2,
            "Amps": 16,
            "Voltage": 400,
            "PowerKW": 11,
            "CurrentTypeID": 20,
            "Quantity": 1
        }
    ],
    "NumberOfPoints": 2,
    "GeneralComments": "Freischaltung mit EWE / SWB RFID Karte.",
    "StatusTypeID": 50,
    "DateLastStatusUpdate": "2015-04-25T15:32:00Z",
    "DataQualityLevel": 1,
    "DateCreated": "2015-01-17T17:28:00Z",
    "SubmissionStatusTypeID": 200
}