{
    "IsRecentlyVerified": false,
    "ID": 37061,
    "UUID": "C287228D-EFC8-4007-B068-CC900AD5ED4D",
    "DataProviderID": 26,
    "DataProvidersReference": "26000",
    "OperatorID": 78,
    "OperatorsReference": "Essent EM-NL-00000363-07-00008",
    "UsageCost": "0.00 jaarabonnement",
    "AddressInfo": {
        "ID": 37407,
        "Title": "Maldenhof 463",
        "AddressLine1": "Maldenhof 463",
        "Town": "Amsterdam Zuidoost",
        "Postcode": "1106 EN",
        "CountryID": 159,
        "Latitude": 52.303727,
        "Longitude": 4.969707,
        "RelatedURL": "http://www.essent.nl",
        "DistanceUnit": 0
    },
    "Connections": [
        {
            "ID": 40572,
            "ConnectionTypeID": 25,
            "LevelID": 2,
            "PowerKW": 11,
            "CurrentTypeID": 10
        },
        {
            "ID": 48613,
            "ConnectionTypeID": 25,
            "LevelID": 2,
            "PowerKW": 11,
            "CurrentTypeID": 10
        }
    ],
    "NumberOfPoints": 1,
    "StatusTypeID": 50,
    "DateLastStatusUpdate": "2016-06-04T02:52:00Z",
    "DataQualityLevel": 3,
    "DateCreated": "2015-01-09T06:07:00Z",
    "SubmissionStatusTypeID": 100
}