{
    "IsRecentlyVerified": false,
    "ID": 90038,
    "UUID": "FFCB605F-65DB-472A-826A-5DD498A713EC",
    "DataProviderID": 1,
    "OperatorID": 45,
    "UsageTypeID": 3,
    "AddressInfo": {
        "ID": 90384,
        "Title": "Geistliches Rüstzentrum Krelingen",
        "AddressLine1": "Krelingen 37",
        "Town": "Walsrode",
        "StateOrProvince": "Landkreis Heidekreis",
        "Postcode": "29664",
        "CountryID": 87,
        "Latitude": 52.80553741493044,
        "Longitude": 9.650298380950977,
        "ContactTelephone1": "+49 5167 970 0",
        "AccessComments": "Auf dem Gästeparkplatz am Haupteingang, Mo-Fr 8-18, Sa 8-14, So 9-14Uhr nutzbar. Ladekarte kann geliehen werden gegen 25€ Pfand, das Aufladen ist kostenfrei.",
        "RelatedURL": "https://www.grz-krelingen.de/",
        "DistanceUnit": 0
    },
    "Connections": [
        {
            "ID": 127636,
            "ConnectionTypeID": 25,
            "StatusTypeID": 50,
            "LevelID": 2,
            "PowerKW": 11,
            "CurrentTypeID": 20,
            "Quantity": 2
        }
    ],
    "NumberOfPoints": 2,
    "StatusTypeID": 50,
    "DateLastStatusUpdate": "2017-07-04T12:40:00Z",
    "DataQualityLevel": 1,
    "DateCreated": "2017-07-04T12:40:00Z",
    "SubmissionStatusTypeID": 200
}