{
    "IsRecentlyVerified": false,
    "ID": 36369,
    "UUID": "C11820C4-5D77-42C2-83B3-4B59BA22BC7C",
    "DataProviderID": 26,
    "DataProvidersReference": "48097",
    "OperatorID": 178,
    "OperatorsReference": "EVnetNL DB0339",
    "UsageCost": "0.00 jaarabonnement",
    "AddressInfo": {
        "ID": 36715,
        "Title": "Vijf Meilaan 12C",
        "AddressLine1": "Vijf Meilaan 12C",
        "Town": "Leiden",
        "Postcode": "2321 RL",
        "CountryID": 159,
        "Latitude": 52.147597,
        "Longitude": 4.478541,
        "ContactTelephone1": "0800-3522365",
        "RelatedURL": "http://www.evnet.nl",
        "DistanceUnit": 0
    },
    "Connections": [
        {
            "ID": 39880,
            "ConnectionTypeID": 25,
            "LevelID": 2,
            "PowerKW": 11,
            "CurrentTypeID": 10
        }
    ],
    "NumberOfPoints": 2,
    "StatusTypeID": 50,
    "DateLastStatusUpdate": "2016-06-04T02:50:00Z",
    "DataQualityLevel": 3,
    "DateCreated": "2015-01-09T06:05:00Z",
    "SubmissionStatusTypeID": 100
}