{
    "IsRecentlyVerified": false,
    "ID": 64127,
    "UUID": "3BAB487D-D386-4CAE-BB67-7994AA3147D3",
    "DataProviderID": 26,
    "DataProvidersReference": "33982",
    "OperatorID": 73,
    "OperatorsReference": "EV-Box EVB-P1239145",
    "UsageCost": "0.00 jaarabonnement",
    "AddressInfo": {
        "ID": 64473,
        "Title": "Floriadepark",
        "AddressLine1": "Floriadepark",
        "Town": "Haarlemmermeer",
        "Postcode": "2141 MX",
        "CountryID": 159,
        "Latitude": 52.06378,
        "Longitude": 4.91122,
        "RelatedURL": "http://www.ev-box.nl",
        "DistanceUnit": 0
    },
    "Connections": [
        {
            "ID": 82021,
            "ConnectionTypeID": 25,
            "LevelID": 2,
            "PowerKW": 5,
            "CurrentTypeID": 10
        }
    ],
    "NumberOfPoints": 1,
    "StatusTypeID": 50,
    "DateLastStatusUpdate": "2016-04-27T09:44:00Z",
    "DataQualityLevel": 3,
    "DateCreated": "2016-03-03T12:33:00Z",
    "SubmissionStatusTypeID": 100
}