{
    "IsRecentlyVerified": false,
    "ID": 185198,
    "UUID": "015DD72A-DB8E-4765-BE31-6C04C4674B11",
    "DataProviderID": 29,
    "DataProvidersReference": "11011",
    "OperatorID": 45,
    "AddressInfo": {
        "ID": 185557,
        "Title": "Mindener Str. 81",
        "AddressLine1": "Mindener Str. 81",
        "Town": "Uchte",
        "Postcode": "31600",
        "CountryID": 87,
        "Latitude": 52.491951,
        "Longitude": 8.893302,
        "DistanceUnit": 0
    },
    "Connections": [
        {
            "ID": 294363,
            "ConnectionTypeID": 33,
            "StatusTypeID": 50,
            "LevelID": 3,
            "PowerKW": 22,
            "CurrentTypeID": 30
        },
        {
            "ID": 294364,
            "ConnectionTypeID": 25,
            "StatusTypeID": 50,
            "LevelID": 2,
            "PowerKW": 11,
            "CurrentTypeID": 20
        }
    ],
    "StatusTypeID": 50,
    "DateLastStatusUpdate": "2021-07-12T02:49:00Z",
    "MetadataValues": [
        {
            "ID": 17489,
            "MetadataFieldID": 4,
            "ItemValue": "Data from the German chargepoint registry provided by Bundesnetzagentur.de under the CC-BY 4.0 license"
        }
    ],
    "DataQualityLevel": 3,
    "DateCreated": "2021-07-08T10:06:00Z",
    "SubmissionStatusTypeID": 100
}