{
    "IsRecentlyVerified": false,
    "ID": 172570,
    "UUID": "2B0597D8-AFDA-4FA7-89F5-D171FC726156",
    "DataProviderID": 1,
    "OperatorID": 3296,
    "UsageTypeID": 5,
    "UsageCost": "£0.40/kWh",
    "AddressInfo": {
        "ID": 172929,
        "Title": "McDonald's Glasshoughton",
        "AddressLine1": "Colorado Way",
        "AddressLine2": "Glasshoughton",
        "Town": "Castleford",
        "StateOrProvince": "England",
        "Postcode": "WF10 4TA",
        "CountryID": 1,
        "Latitude": 53.709185315140985,
        "Longitude": -1.3357017816892949,
        "ContactTelephone1": "0808 281 4444",
        "RelatedURL": "https://instavolt.co.uk/",
        "DistanceUnit": 0
    },
    "Connections": [
        {
            "ID": 263854,
            "ConnectionTypeID": 33,
            "StatusTypeID": 50,
            "LevelID": 3,
            "PowerKW": 50,
            "CurrentTypeID": 30,
            "Quantity": 2
        },
        {
            "ID": 263855,
            "ConnectionTypeID": 2,
            "StatusTypeID": 50,
            "LevelID": 3,
            "PowerKW": 50,
            "CurrentTypeID": 30,
            "Quantity": 2
        }
    ],
    "NumberOfPoints": 1,
    "StatusTypeID": 50,
    "DateLastStatusUpdate": "2021-05-26T09:52:00Z",
    "DataQualityLevel": 1,
    "DateCreated": "2021-02-09T05:12:00Z",
    "SubmissionStatusTypeID": 200
}