{
    "IsRecentlyVerified": false,
    "ID": 133710,
    "UUID": "5CB4D779-7577-45DF-9B1C-4D9E8C68718A",
    "DataProviderID": 1,
    "OperatorID": 105,
    "UsageTypeID": 4,
    "AddressInfo": {
        "ID": 134056,
        "Title": "Rüttenscheider Straße 70",
        "AddressLine1": "Rüttenscheider Straße 70",
        "Town": "Essen",
        "StateOrProvince": "NRW",
        "Postcode": "45130",
        "CountryID": 87,
        "Latitude": 51.4371071523854,
        "Longitude": 7.00538227638322,
        "DistanceUnit": 0
    },
    "Connections": [
        {
            "ID": 187131,
            "ConnectionTypeID": 25,
            "StatusTypeID": 50,
            "LevelID": 2,
            "Amps": 32,
            "Voltage": 400,
            "PowerKW": 22,
            "CurrentTypeID": 20,
            "Quantity": 2
        }
    ],
    "NumberOfPoints": 2,
    "StatusTypeID": 50,
    "DateLastStatusUpdate": "2019-10-25T19:16:00Z",
    "DataQualityLevel": 1,
    "DateCreated": "2019-10-24T12:06:00Z",
    "SubmissionStatusTypeID": 200
}