{
    "IsRecentlyVerified": false,
    "ID": 140532,
    "UUID": "CCF62746-CDF1-40E2-9486-70ACBB25B593",
    "DataProviderID": 2,
    "DataProvidersReference": "95531",
    "OperatorID": 9,
    "UsageTypeID": 1,
    "AddressInfo": {
        "ID": 140884,
        "Title": "City of Portland",
        "AddressLine1": "100 South Russell St",
        "Town": "Portland",
        "StateOrProvince": "TN",
        "Postcode": "37148",
        "CountryID": 2,
        "Latitude": 36.58077,
        "Longitude": -86.514096,
        "ContactTelephone1": "888-998-2546",
        "AccessComments": "MON: 24 hours | TUE: 24 hours | WED: 24 hours | THU: 24 hours | FRI: 24 hours | SAT: 24 hours | SUN: 24 hours",
        "RelatedURL": "http://www.blinkcharging.com/",
        "DistanceUnit": 0
    },
    "Connections": [
        {
            "ID": 196183,
            "ConnectionTypeID": 1,
            "LevelID": 2,
            "Amps": 16,
            "Voltage": 230,
            "PowerKW": 3.7,
            "CurrentTypeID": 10,
            "Quantity": 1
        }
    ],
    "StatusTypeID": 50,
    "DateLastStatusUpdate": "2020-06-26T02:58:00Z",
    "DataQualityLevel": 3,
    "DateCreated": "2019-12-24T09:13:00Z",
    "SubmissionStatusTypeID": 100
}