{
    "IsRecentlyVerified": false,
    "ID": 181684,
    "UUID": "77B5D6C1-9AE1-4340-8929-EA2A095434AF",
    "DataProviderID": 29,
    "DataProvidersReference": "9019",
    "AddressInfo": {
        "ID": 182043,
        "Title": "Straße des Friedens 120",
        "AddressLine1": "Straße des Friedens 120",
        "Town": "Gera",
        "Postcode": "07548",
        "CountryID": 87,
        "Latitude": 50.867001,
        "Longitude": 12.061321,
        "DistanceUnit": 0
    },
    "Connections": [
        {
            "ID": 286344,
            "ConnectionTypeID": 25,
            "StatusTypeID": 50,
            "LevelID": 2,
            "PowerKW": 22,
            "CurrentTypeID": 20
        },
        {
            "ID": 286345,
            "ConnectionTypeID": 25,
            "StatusTypeID": 50,
            "LevelID": 2,
            "PowerKW": 22,
            "CurrentTypeID": 20
        }
    ],
    "StatusTypeID": 50,
    "DateLastStatusUpdate": "2021-07-09T03:21:00Z",
    "MetadataValues": [
        {
            "ID": 13978,
            "MetadataFieldID": 4,
            "ItemValue": "Data from the German chargepoint registry provided by Bundesnetzagentur.de under the CC-BY 4.0 license"
        }
    ],
    "DataQualityLevel": 3,
    "DateCreated": "2021-07-08T10:02:00Z",
    "SubmissionStatusTypeID": 100
}