{
    "IsRecentlyVerified": false,
    "ID": 160200,
    "UUID": "FD0CF8BB-D2FC-4BB1-BA6D-A2393D2BB4C7",
    "DataProviderID": 2,
    "DataProvidersReference": "157872",
    "UsageTypeID": 2,
    "AddressInfo": {
        "ID": 160557,
        "Title": "Ontario Charging Network LP",
        "AddressLine1": "825 Caledonia Rd",
        "Town": "Toronto",
        "StateOrProvince": "ON",
        "Postcode": "M6B 3X8",
        "CountryID": 44,
        "Latitude": 43.70196,
        "Longitude": -79.46229,
        "ContactTelephone1": "",
        "AccessComments": "",
        "RelatedURL": "",
        "DistanceUnit": 0
    },
    "Connections": [
        {
            "ID": 230470,
            "ConnectionTypeID": 2,
            "LevelID": 3,
            "Amps": 100,
            "Voltage": 400,
            "PowerKW": 40,
            "CurrentTypeID": 30,
            "Quantity": 1
        },
        {
            "ID": 230471,
            "ConnectionTypeID": 32,
            "LevelID": 3,
            "Amps": 100,
            "Voltage": 400,
            "PowerKW": 40,
            "CurrentTypeID": 30,
            "Quantity": 1
        }
    ],
    "GeneralComments": "Planned for future date. Not Operational.",
    "DatePlanned": "2020-09-01T00:00:00Z",
    "StatusTypeID": 150,
    "DateLastStatusUpdate": "2020-06-26T03:07:00Z",
    "DataQualityLevel": 3,
    "DateCreated": "2020-06-26T03:07:00Z",
    "SubmissionStatusTypeID": 100
}