{
    "IsRecentlyVerified": false,
    "ID": 94628,
    "UUID": "C1550D4B-C754-43A6-B150-D0FC38B1EBBB",
    "DataProviderID": 1,
    "OperatorID": 23,
    "OperatorsReference": "36840",
    "UsageTypeID": 4,
    "AddressInfo": {
        "ID": 94974,
        "Title": "Sportshotel Vejen",
        "AddressLine1": "Jacob Gades Allé 1",
        "Town": "Vejen",
        "Postcode": "6600",
        "CountryID": 65,
        "Latitude": 55.472737,
        "Longitude": 9.124493,
        "ContactTelephone1": "+45 75 36 05 00",
        "DistanceUnit": 0
    },
    "Connections": [
        {
            "ID": 133781,
            "ConnectionTypeID": 30,
            "StatusTypeID": 50,
            "LevelID": 2,
            "Amps": 16,
            "Voltage": 400,
            "PowerKW": 11,
            "CurrentTypeID": 20,
            "Quantity": 1
        }
    ],
    "NumberOfPoints": 1,
    "GeneralComments": "1 Tesla Connector, up to 11kW.Available for customers. Self park.",
    "StatusTypeID": 50,
    "DateLastStatusUpdate": "2018-10-03T14:34:00Z",
    "DataQualityLevel": 1,
    "DateCreated": "2017-10-22T05:39:00Z",
    "SubmissionStatusTypeID": 200
}