{
    "IsRecentlyVerified": false,
    "ID": 17781,
    "UUID": "08D76EE3-3779-4508-B3DD-C443FB4FE43C",
    "DataProviderID": 22,
    "DataProvidersReference": "980017891FF67CF8A20F23AA810E7B5A",
    "AddressInfo": {
        "ID": 18126,
        "Title": "愛鶴愛甲営業所",
        "AddressLine1": "神奈川県伊勢原市石田1093-1",
        "CountryID": 114,
        "Latitude": 35.40646837,
        "Longitude": 139.3463381,
        "ContactTelephone1": "0463-95-9995",
        "DistanceUnit": 0
    },
    "Connections": [
        {
            "ID": 18022,
            "ConnectionTypeID": 2,
            "LevelID": 2,
            "Amps": 100,
            "Voltage": 480,
            "PowerKW": 48,
            "Quantity": 1
        }
    ],
    "DateLastStatusUpdate": "2013-06-29T09:03:00Z",
    "DataQualityLevel": 2,
    "DateCreated": "2013-06-29T09:03:00Z",
    "SubmissionStatusTypeID": 200
}