{
    "IsRecentlyVerified": false,
    "ID": 121915,
    "UUID": "730386C1-F424-4DE7-88A2-E85A723A73B1",
    "DataProviderID": 2,
    "DataProvidersReference": "100033",
    "OperatorID": 5,
    "UsageTypeID": 1,
    "AddressInfo": {
        "ID": 122261,
        "Title": "CHOA",
        "AddressLine1": "1400 Tullie Rd NE",
        "Town": "Atlanta",
        "StateOrProvince": "GA",
        "Postcode": "30329",
        "CountryID": 2,
        "Latitude": 33.831178,
        "Longitude": -84.332385,
        "ContactTelephone1": "888-758-4389",
        "AccessComments": "24 hours daily",
        "RelatedURL": "http://www.chargepoint.com/",
        "DistanceUnit": 0
    },
    "Connections": [
        {
            "ID": 171755,
            "ConnectionTypeID": 1,
            "LevelID": 2,
            "Amps": 16,
            "Voltage": 230,
            "PowerKW": 3.7,
            "CurrentTypeID": 10,
            "Quantity": 6
        }
    ],
    "DateLastStatusUpdate": "2020-06-26T02:56:00Z",
    "DataQualityLevel": 3,
    "DateCreated": "2019-04-06T05:02:00Z",
    "SubmissionStatusTypeID": 100
}