{
    "IsRecentlyVerified": false,
    "ID": 146462,
    "UUID": "179E099E-7545-44B6-A6D9-8FC1E691139D",
    "DataProviderID": 1,
    "OperatorID": 20,
    "OperatorsReference": "81001,81002",
    "UsageTypeID": 4,
    "UsageCost": "£0.20/kWh;min £1.00",
    "AddressInfo": {
        "ID": 146814,
        "Title": "Four Seasons Multi-Storey Car Park",
        "AddressLine1": "Four Seasons Multi-Storey Car Park",
        "Town": "Mansfield",
        "StateOrProvince": "Nottinghamshire",
        "Postcode": "NG18 1SU",
        "CountryID": 1,
        "Latitude": 53.1454055212323,
        "Longitude": -1.19884860118873,
        "DistanceUnit": 0
    },
    "Connections": [
        {
            "ID": 203633,
            "ConnectionTypeID": 25,
            "StatusTypeID": 50,
            "LevelID": 2,
            "Amps": 32,
            "Voltage": 230,
            "PowerKW": 7,
            "CurrentTypeID": 10,
            "Quantity": 4
        }
    ],
    "NumberOfPoints": 4,
    "StatusTypeID": 50,
    "DateLastStatusUpdate": "2020-01-11T19:16:00Z",
    "DataQualityLevel": 1,
    "DateCreated": "2020-01-10T09:56:00Z",
    "SubmissionStatusTypeID": 200
}