{
    "IsRecentlyVerified": false,
    "ID": 44687,
    "UUID": "EC8B2100-7B01-410B-8DDA-215C8EFBFD1F",
    "DataProviderID": 26,
    "DataProvidersReference": "60741",
    "OperatorID": 178,
    "OperatorsReference": "EVnetNL PNB-ENO046",
    "UsageCost": "0.00 jaarabonnement",
    "AddressInfo": {
        "ID": 45033,
        "Title": "Bostulp 54",
        "AddressLine1": "Bostulp 54",
        "Town": "Cuijk",
        "Postcode": "5432 HK",
        "CountryID": 159,
        "Latitude": 51.737513,
        "Longitude": 5.857554,
        "ContactTelephone1": "0800-3522365",
        "RelatedURL": "http://www.evnet.nl",
        "DistanceUnit": 0
    },
    "Connections": [
        {
            "ID": 54882,
            "ConnectionTypeID": 25,
            "LevelID": 2,
            "PowerKW": 11,
            "CurrentTypeID": 10
        }
    ],
    "NumberOfPoints": 2,
    "StatusTypeID": 50,
    "DateLastStatusUpdate": "2016-06-04T02:40:00Z",
    "DataQualityLevel": 3,
    "DateCreated": "2015-04-18T13:02:00Z",
    "SubmissionStatusTypeID": 100
}