{
    "UserComments": [
        {
            "ID": 23293,
            "ChargePointID": 125401,
            "CommentTypeID": 10,
            "UserName": "ccww",
            "Comment": "electricity is free after £1.20 connection fee and parking charge",
            "Rating": 5,
            "DateCreated": "2020-09-29T08:54:44.8Z",
            "User": {
                "ID": 27677,
                "Username": "ccww"
            },
            "CheckinStatusTypeID": 10,
            "IsActionedByEditor": false
        }
    ],
    "IsRecentlyVerified": false,
    "ID": 125401,
    "UUID": "CCA269AF-3899-4644-8D10-59F469241AF3",
    "DataProviderID": 1,
    "OperatorID": 32,
    "OperatorsReference": "11696",
    "UsageTypeID": 4,
    "UsageCost": "Inclusive; for Polar Plus subscription members only",
    "AddressInfo": {
        "ID": 125747,
        "Title": "Upper St Leonardgate",
        "AddressLine1": "Upper St Leonardgate",
        "Town": "Seymour Street",
        "StateOrProvince": "Lancaster",
        "Postcode": "LA1 1QN",
        "CountryID": 1,
        "Latitude": 54.050598,
        "Longitude": -2.7951,
        "DistanceUnit": 0
    },
    "Connections": [
        {
            "ID": 175721,
            "ConnectionTypeID": 25,
            "StatusTypeID": 50,
            "LevelID": 2,
            "Amps": 32,
            "Voltage": 400,
            "PowerKW": 22,
            "CurrentTypeID": 20,
            "Quantity": 2
        }
    ],
    "NumberOfPoints": 2,
    "GeneralComments": "Unit located in the main car park",
    "StatusTypeID": 50,
    "DateLastStatusUpdate": "2020-09-29T08:55:00Z",
    "DataQualityLevel": 1,
    "DateCreated": "2019-04-17T05:19:00Z",
    "SubmissionStatusTypeID": 200
}