{
    "MediaItems": [
        {
            "ID": 27259,
            "ChargePointID": 162509,
            "ItemURL": "https://s3-ap-southeast-2.amazonaws.com/openchargemap/images/HU/OCM162509/OCM-162509.orig.2021040917411123.jpg",
            "ItemThumbnailURL": "https://s3-ap-southeast-2.amazonaws.com/openchargemap/images/HU/OCM162509/OCM-162509.thmb.2021040917411123.jpg",
            "Comment": "",
            "IsEnabled": true,
            "IsVideo": false,
            "IsFeaturedItem": false,
            "IsExternalResource": false,
            "User": {
                "ID": 26825,
                "Username": "Ivett"
            },
            "DateCreated": "2021-04-09T17:41:00Z"
        }
    ],
    "IsRecentlyVerified": false,
    "ID": 162509,
    "UUID": "35FBA4C4-62C4-4BE3-ACE0-331C3D743588",
    "DataProviderID": 1,
    "OperatorID": 1,
    "UsageTypeID": 1,
    "UsageCost": "75 Huf/kWh + 1 Huf/min",
    "AddressInfo": {
        "ID": 162866,
        "Title": "TEA. Katica Tanya",
        "AddressLine1": "Katica Tanya",
        "Town": "Patca",
        "StateOrProvince": "",
        "Postcode": "7477",
        "CountryID": 104,
        "Latitude": 46.279373946644284,
        "Longitude": 17.716230453656976,
        "ContactTelephone1": "+36305509858",
        "RelatedURL": "http://www.teapont.hu",
        "DistanceUnit": 0
    },
    "Connections": [
        {
            "ID": 233898,
            "ConnectionTypeID": 25,
            "StatusTypeID": 50,
            "LevelID": 2,
            "Voltage": 240,
            "PowerKW": 22,
            "CurrentTypeID": 20,
            "Quantity": 2
        }
    ],
    "NumberOfPoints": 2,
    "GeneralComments": "Start charging with QR Code.  HELPDESK: help@teapont.hu +36305509858",
    "StatusTypeID": 50,
    "DateLastStatusUpdate": "2021-04-10T10:56:00Z",
    "DataQualityLevel": 1,
    "DateCreated": "2020-08-10T12:17:00Z",
    "SubmissionStatusTypeID": 200
}