{
    "UserComments": [
        {
            "ID": 22335,
            "ChargePointID": 125723,
            "CommentTypeID": 10,
            "UserName": "ForumElettrico.it",
            "Comment": "Si trova nella zona completamente opposta rispetto alla Basilica di San Francesco. Leggi la recensione completa qui > https://www.forumelettrico.it/forum/colonnina-enel-x-viale-vittorio-emanuele-ii-assisi-t6117.html",
            "RelatedURL": "https://www.forumelettrico.it/forum/colonnina-enel-x-viale-vittorio-emanuele-ii-assisi-t6117.html",
            "DateCreated": "2020-03-23T14:51:13.653Z",
            "User": {
                "ID": 11749,
                "Username": "ForumElettrico.it"
            },
            "CheckinStatusTypeID": 10,
            "IsActionedByEditor": false
        }
    ],
    "MediaItems": [
        {
            "ID": 21682,
            "ChargePointID": 125723,
            "ItemURL": "https://s3-ap-southeast-2.amazonaws.com/openchargemap/images/IT/OCM125723/OCM-125723.orig.2020032314513147.jpg",
            "ItemThumbnailURL": "https://s3-ap-southeast-2.amazonaws.com/openchargemap/images/IT/OCM125723/OCM-125723.thmb.2020032314513147.jpg",
            "Comment": "",
            "IsEnabled": true,
            "IsVideo": false,
            "IsFeaturedItem": false,
            "IsExternalResource": false,
            "User": {
                "ID": 11749,
                "Username": "ForumElettrico.it"
            },
            "DateCreated": "2020-03-23T14:52:00Z"
        },
        {
            "ID": 21683,
            "ChargePointID": 125723,
            "ItemURL": "https://s3-ap-southeast-2.amazonaws.com/openchargemap/images/IT/OCM125723/OCM-125723.orig.2020032314513737.jpg",
            "ItemThumbnailURL": "https://s3-ap-southeast-2.amazonaws.com/openchargemap/images/IT/OCM125723/OCM-125723.thmb.2020032314513737.jpg",
            "Comment": "",
            "IsEnabled": true,
            "IsVideo": false,
            "IsFeaturedItem": false,
            "IsExternalResource": false,
            "User": {
                "ID": 11749,
                "Username": "ForumElettrico.it"
            },
            "DateCreated": "2020-03-23T14:52:00Z"
        },
        {
            "ID": 21681,
            "ChargePointID": 125723,
            "ItemURL": "https://s3-ap-southeast-2.amazonaws.com/openchargemap/images/IT/OCM125723/OCM-125723.orig.2020032314512511.jpg",
            "ItemThumbnailURL": "https://s3-ap-southeast-2.amazonaws.com/openchargemap/images/IT/OCM125723/OCM-125723.thmb.2020032314512511.jpg",
            "Comment": "",
            "IsEnabled": true,
            "IsVideo": false,
            "IsFeaturedItem": false,
            "IsExternalResource": false,
            "User": {
                "ID": 11749,
                "Username": "ForumElettrico.it"
            },
            "DateCreated": "2020-03-23T14:51:00Z"
        }
    ],
    "IsRecentlyVerified": false,
    "ID": 125723,
    "UUID": "49B31A16-75CE-4C26-9FB4-0C777D159220",
    "DataProviderID": 1,
    "OperatorID": 80,
    "UsageTypeID": 4,
    "AddressInfo": {
        "ID": 126069,
        "Title": "Assisi Porta Nuova",
        "AddressLine1": "Viale Vittorio Emanuele II",
        "AddressLine2": "San Damiano",
        "Town": "Assisi",
        "StateOrProvince": "PG",
        "Postcode": "06081",
        "CountryID": 112,
        "Latitude": 43.066043186471,
        "Longitude": 12.6206766698904,
        "DistanceUnit": 0
    },
    "Connections": [
        {
            "ID": 176170,
            "ConnectionTypeID": 25,
            "StatusTypeID": 50,
            "LevelID": 2,
            "Amps": 32,
            "Voltage": 400,
            "PowerKW": 22,
            "CurrentTypeID": 20,
            "Quantity": 1
        },
        {
            "ID": 176171,
            "ConnectionTypeID": 36,
            "StatusTypeID": 50,
            "LevelID": 2,
            "Amps": 16,
            "Voltage": 240,
            "PowerKW": 3.7,
            "CurrentTypeID": 10,
            "Quantity": 1
        }
    ],
    "NumberOfPoints": 2,
    "StatusTypeID": 50,
    "DateLastStatusUpdate": "2020-03-23T14:52:00Z",
    "DataQualityLevel": 1,
    "DateCreated": "2019-04-24T13:55:00Z",
    "SubmissionStatusTypeID": 200
}