{
    "IsRecentlyVerified": false,
    "ID": 134941,
    "UUID": "4CC6269D-F7C7-4B66-BD9A-58EECAE0D842",
    "DataProviderID": 1,
    "OperatorID": 3345,
    "UsageTypeID": 5,
    "AddressInfo": {
        "ID": 135287,
        "Title": "Gove Park",
        "AddressLine1": "Gove Park",
        "Town": "London ",
        "Postcode": "SE5  8LE",
        "CountryID": 1,
        "Latitude": 51.467695,
        "Longitude": -0.078767,
        "RelatedURL": "https://char.gy",
        "DistanceUnit": 0
    },
    "Connections": [
        {
            "ID": 188869,
            "ConnectionTypeID": 25,
            "Reference": "00080",
            "StatusTypeID": 50,
            "LevelID": 2,
            "Amps": 16,
            "Voltage": 230,
            "PowerKW": 3.7,
            "CurrentTypeID": 10
        }
    ],
    "StatusTypeID": 0,
    "DateLastStatusUpdate": "2019-12-03T14:10:00Z",
    "MetadataValues": [
        {
            "ID": 5282,
            "MetadataFieldID": 4,
            "ItemValue": "Contains public sector information licensed under the Open Government Licence v2.0. http://www.nationalarchives.gov.uk/doc/open-government-licence/version/2/"
        }
    ],
    "DataQualityLevel": 3,
    "DateCreated": "2019-12-03T13:42:00Z",
    "SubmissionStatusTypeID": 100
}