{
    "UserComments": [
        {
            "ID": 22346,
            "ChargePointID": 129658,
            "CommentTypeID": 10,
            "UserName": "ForumElettrico.it",
            "Comment": "Dista circa 1 km dal mare, ma a qualche centinaio di metri c'è anche il Parco Pitagora. Leggi la recensione completa qui > https://www.forumelettrico.it/forum/colonnina-enel-x-44-kw-camaiore-lucca-via-f-lli-rosselli-lido-di-camaiore-t6189.html",
            "RelatedURL": "https://www.forumelettrico.it/forum/colonnina-enel-x-44-kw-camaiore-lucca-via-f-lli-rosselli-lido-di-camaiore-t6189.html",
            "DateCreated": "2020-03-26T14:49:40.95Z",
            "User": {
                "ID": 11749,
                "Username": "ForumElettrico.it"
            },
            "CheckinStatusTypeID": 10,
            "IsActionedByEditor": false
        }
    ],
    "MediaItems": [
        {
            "ID": 21720,
            "ChargePointID": 129658,
            "ItemURL": "https://s3-ap-southeast-2.amazonaws.com/openchargemap/images/IT/OCM129658/OCM-129658.orig.2020032614495172.jpg",
            "ItemThumbnailURL": "https://s3-ap-southeast-2.amazonaws.com/openchargemap/images/IT/OCM129658/OCM-129658.thmb.2020032614495172.jpg",
            "Comment": "",
            "IsEnabled": true,
            "IsVideo": false,
            "IsFeaturedItem": false,
            "IsExternalResource": false,
            "User": {
                "ID": 11749,
                "Username": "ForumElettrico.it"
            },
            "DateCreated": "2020-03-26T14:50:00Z"
        },
        {
            "ID": 21721,
            "ChargePointID": 129658,
            "ItemURL": "https://s3-ap-southeast-2.amazonaws.com/openchargemap/images/IT/OCM129658/OCM-129658.orig.2020032614495841.jpg",
            "ItemThumbnailURL": "https://s3-ap-southeast-2.amazonaws.com/openchargemap/images/IT/OCM129658/OCM-129658.thmb.2020032614495841.jpg",
            "Comment": "",
            "IsEnabled": true,
            "IsVideo": false,
            "IsFeaturedItem": false,
            "IsExternalResource": false,
            "User": {
                "ID": 11749,
                "Username": "ForumElettrico.it"
            },
            "DateCreated": "2020-03-26T14:50:00Z"
        },
        {
            "ID": 21722,
            "ChargePointID": 129658,
            "ItemURL": "https://s3-ap-southeast-2.amazonaws.com/openchargemap/images/IT/OCM129658/OCM-129658.orig.2020032614500755.jpg",
            "ItemThumbnailURL": "https://s3-ap-southeast-2.amazonaws.com/openchargemap/images/IT/OCM129658/OCM-129658.thmb.2020032614500755.jpg",
            "Comment": "",
            "IsEnabled": true,
            "IsVideo": false,
            "IsFeaturedItem": false,
            "IsExternalResource": false,
            "User": {
                "ID": 11749,
                "Username": "ForumElettrico.it"
            },
            "DateCreated": "2020-03-26T14:50:00Z"
        },
        {
            "ID": 21723,
            "ChargePointID": 129658,
            "ItemURL": "https://s3-ap-southeast-2.amazonaws.com/openchargemap/images/IT/OCM129658/OCM-129658.orig.2020032614501396.jpg",
            "ItemThumbnailURL": "https://s3-ap-southeast-2.amazonaws.com/openchargemap/images/IT/OCM129658/OCM-129658.thmb.2020032614501396.jpg",
            "Comment": "",
            "IsEnabled": true,
            "IsVideo": false,
            "IsFeaturedItem": false,
            "IsExternalResource": false,
            "User": {
                "ID": 11749,
                "Username": "ForumElettrico.it"
            },
            "DateCreated": "2020-03-26T14:50:00Z"
        }
    ],
    "IsRecentlyVerified": false,
    "ID": 129658,
    "UUID": "1B3CC87C-C268-4262-873B-7A591701B9FC",
    "DataProviderID": 1,
    "OperatorID": 80,
    "UsageTypeID": 4,
    "AddressInfo": {
        "ID": 130004,
        "Title": " Lido di Camaiore Rosselli | EnelX",
        "AddressLine1": "Via Fratelli Rosselli",
        "AddressLine2": " Lido di Camaiore",
        "Town": "Camaiore",
        "StateOrProvince": "LU",
        "Postcode": "55041",
        "CountryID": 112,
        "Latitude": 43.8985734873597,
        "Longitude": 10.2375324852436,
        "ContactTelephone1": "800.069.850",
        "RelatedURL": "https://www.enelx.com/it/it/emobility",
        "DistanceUnit": 0
    },
    "Connections": [
        {
            "ID": 181460,
            "ConnectionTypeID": 25,
            "StatusTypeID": 50,
            "LevelID": 2,
            "Amps": 32,
            "Voltage": 400,
            "PowerKW": 22,
            "CurrentTypeID": 20,
            "Quantity": 2
        }
    ],
    "NumberOfPoints": 2,
    "StatusTypeID": 50,
    "DateLastStatusUpdate": "2020-03-26T14:50:00Z",
    "DataQualityLevel": 1,
    "DateCreated": "2019-07-22T15:04:00Z",
    "SubmissionStatusTypeID": 200
}