{
    "IsRecentlyVerified": false,
    "ID": 81701,
    "UUID": "721CD9CA-D1DC-408C-AEB8-55B74164C246",
    "DataProviderID": 1,
    "OperatorID": 23,
    "OperatorsReference": "23639",
    "UsageTypeID": 6,
    "AddressInfo": {
        "ID": 82047,
        "Title": "Grand Isla Navidad Resort",
        "AddressLine1": "Grand Isla Navidad Resort",
        "Postcode": "28838",
        "CountryID": 146,
        "Latitude": 19.195017,
        "Longitude": -104.68417,
        "ContactTelephone1": "+52 314 331 0500",
        "DistanceUnit": 0
    },
    "Connections": [
        {
            "ID": 116459,
            "ConnectionTypeID": 30,
            "StatusTypeID": 50,
            "LevelID": 2,
            "PowerKW": 18,
            "CurrentTypeID": 20,
            "Quantity": 2
        }
    ],
    "NumberOfPoints": 2,
    "GeneralComments": "2 Tesla Connectors, up to 18kW.Available for patrons only. Self park.",
    "StatusTypeID": 50,
    "DateLastStatusUpdate": "2017-02-03T11:16:00Z",
    "DataQualityLevel": 1,
    "DateCreated": "2017-02-03T11:16:00Z",
    "SubmissionStatusTypeID": 200
}