{
    "UserComments": [
        {
            "ID": 20320,
            "ChargePointID": 43299,
            "CommentTypeID": 10,
            "UserName": "Simon Hewison",
            "Comment": "Charge point not powered",
            "Rating": 1,
            "DateCreated": "2018-10-18T16:01:25.357Z",
            "User": {
                "ID": 4575,
                "Username": "Simon Hewison"
            },
            "CheckinStatusTypeID": 20
        }
    ],
    "IsRecentlyVerified": false,
    "ID": 43299,
    "UUID": "C07E6479-C216-4BE5-B4BB-A34559ABB834",
    "DataProviderID": 1,
    "OperatorID": 3,
    "OperatorsReference": "PP-5112288",
    "UsageTypeID": 6,
    "UsageCost": "Free. Car parking charges apply",
    "AddressInfo": {
        "ID": 43645,
        "Title": "St. Albans City Railway Station",
        "AddressLine1": "Ridgmont Way",
        "AddressLine2": "Station Way",
        "Town": "St. Albans",
        "StateOrProvince": "Hertfordshire",
        "Postcode": "AL1 5HE",
        "CountryID": 1,
        "Latitude": 51.750029,
        "Longitude": -0.328241,
        "AccessComments": "in car park",
        "DistanceUnit": 0
    },
    "Connections": [
        {
            "ID": 52482,
            "ConnectionTypeID": 25,
            "StatusTypeID": 100,
            "LevelID": 2,
            "Amps": 32,
            "Voltage": 230,
            "PowerKW": 7,
            "CurrentTypeID": 10,
            "Quantity": 2
        }
    ],
    "NumberOfPoints": 2,
    "GeneralComments": "Pod Point PP-5112288",
    "StatusTypeID": 0,
    "DateLastStatusUpdate": "2019-05-01T05:36:00Z",
    "DataQualityLevel": 1,
    "DateCreated": "2015-03-21T00:15:00Z",
    "SubmissionStatusTypeID": 200
}