{
    "IsRecentlyVerified": false,
    "ID": 75880,
    "UUID": "92032A0D-9694-4572-8DCF-34CFC3207832",
    "DataProviderID": 2,
    "DataProvidersReference": "80195",
    "OperatorID": 5,
    "UsageTypeID": 1,
    "AddressInfo": {
        "ID": 76226,
        "Title": "GARAGESTATIONS",
        "AddressLine1": "921 L St",
        "Town": "Lincoln",
        "StateOrProvince": "NE",
        "Postcode": "68508",
        "CountryID": 2,
        "Latitude": 40.8093865,
        "Longitude": -96.7074676,
        "ContactTelephone1": "888-758-4389",
        "AccessComments": "24 hours daily",
        "RelatedURL": "http://www.chargepoint.com/",
        "DistanceUnit": 0
    },
    "Connections": [
        {
            "ID": 109391,
            "ConnectionTypeID": 1,
            "LevelID": 2,
            "Amps": 16,
            "Voltage": 230,
            "PowerKW": 3.7,
            "CurrentTypeID": 10,
            "Quantity": 2
        }
    ],
    "DateLastStatusUpdate": "2020-06-26T03:03:00Z",
    "DataQualityLevel": 3,
    "DateCreated": "2016-12-23T01:25:00Z",
    "SubmissionStatusTypeID": 100
}