{
    "IsRecentlyVerified": false,
    "ID": 85091,
    "UUID": "A29DE13B-714F-42AB-8507-D328BCE7A134",
    "DataProviderID": 1,
    "OperatorID": 23,
    "OperatorsReference": "26075",
    "UsageTypeID": 6,
    "AddressInfo": {
        "ID": 85437,
        "Title": "Hotel Walliserhof Leukerbad",
        "AddressLine1": "38 Rathausstrasse",
        "Town": "Leukerbad",
        "Postcode": "3954",
        "CountryID": 217,
        "Latitude": 46.376641,
        "Longitude": 7.626381,
        "ContactTelephone1": "+41 2747 27960",
        "DistanceUnit": 0
    },
    "Connections": [
        {
            "ID": 120849,
            "ConnectionTypeID": 30,
            "StatusTypeID": 50,
            "LevelID": 2,
            "Amps": 32,
            "Voltage": 400,
            "PowerKW": 22,
            "CurrentTypeID": 20,
            "Quantity": 2
        }
    ],
    "NumberOfPoints": 2,
    "GeneralComments": "2 Tesla Connectors, up to 22kW.Available for patrons only. Please see front desk.",
    "StatusTypeID": 50,
    "DateLastStatusUpdate": "2018-10-03T19:07:00Z",
    "DataQualityLevel": 1,
    "DateCreated": "2017-03-25T06:28:00Z",
    "SubmissionStatusTypeID": 200
}