{
    "IsRecentlyVerified": false,
    "ID": 124101,
    "UUID": "240C0EE7-C89A-4F3A-BEF6-CF84C499AD22",
    "DataProviderID": 2,
    "DataProvidersReference": "100472",
    "OperatorID": 5,
    "UsageTypeID": 1,
    "AddressInfo": {
        "ID": 124447,
        "Title": "BLVD",
        "AddressLine1": "5793 El Dorado Ln",
        "Town": "Dublin",
        "StateOrProvince": "CA",
        "Postcode": "94568",
        "CountryID": 2,
        "Latitude": 37.7071333,
        "Longitude": -121.9004079,
        "ContactTelephone1": "888-758-4389",
        "AccessComments": "24 hours daily",
        "RelatedURL": "http://www.chargepoint.com/",
        "DistanceUnit": 0
    },
    "Connections": [
        {
            "ID": 174156,
            "ConnectionTypeID": 1,
            "LevelID": 2,
            "Amps": 16,
            "Voltage": 230,
            "PowerKW": 3,
            "CurrentTypeID": 10,
            "Quantity": 2
        }
    ],
    "DateLastStatusUpdate": "2019-04-06T05:03:00Z",
    "DataQualityLevel": 3,
    "DateCreated": "2019-04-06T05:03:00Z",
    "SubmissionStatusTypeID": 100
}