{
    "IsRecentlyVerified": false,
    "ID": 126125,
    "UUID": "CC2B98AE-6FB7-456C-8736-E34FF37AF517",
    "DataProviderID": 1,
    "OperatorID": 3,
    "OperatorsReference": "PG-82515",
    "UsageTypeID": 4,
    "UsageCost": "£0.14/kWh",
    "AddressInfo": {
        "ID": 126471,
        "Title": "Bicester Avenue Garden Centre",
        "AddressLine1": "Bicester Avenue Garden Centre",
        "Town": "Oxford",
        "Postcode": "OX25 2NY",
        "CountryID": 1,
        "Latitude": 51.88767795,
        "Longitude": -1.16491859,
        "DistanceUnit": 0
    },
    "Connections": [
        {
            "ID": 176770,
            "ConnectionTypeID": 25,
            "StatusTypeID": 50,
            "LevelID": 2,
            "Amps": 32,
            "Voltage": 230,
            "PowerKW": 7,
            "CurrentTypeID": 10,
            "Quantity": 2
        }
    ],
    "NumberOfPoints": 2,
    "GeneralComments": "This is an open charge unit installed at the Bicester Avenue Garden Centre site at Avenue Garden Centre, Oxford",
    "StatusTypeID": 50,
    "DateLastStatusUpdate": "2019-10-02T09:47:00Z",
    "DataQualityLevel": 1,
    "DateCreated": "2019-05-13T11:44:00Z",
    "SubmissionStatusTypeID": 200
}