{
    "IsRecentlyVerified": false,
    "ID": 178277,
    "UUID": "6454A80D-EEE4-4B61-AA78-B8E8B42FD912",
    "DataProviderID": 29,
    "DataProvidersReference": "7447",
    "AddressInfo": {
        "ID": 178636,
        "Title": "Kotter Straße 8",
        "AddressLine1": "Kotter Straße 8",
        "Town": "Solingen",
        "Postcode": "42655",
        "CountryID": 87,
        "Latitude": 51.17194,
        "Longitude": 7.07667,
        "DistanceUnit": 0
    },
    "Connections": [
        {
            "ID": 278468,
            "ConnectionTypeID": 25,
            "StatusTypeID": 50,
            "LevelID": 2,
            "PowerKW": 22,
            "CurrentTypeID": 20
        },
        {
            "ID": 278469,
            "ConnectionTypeID": 25,
            "StatusTypeID": 50,
            "LevelID": 2,
            "PowerKW": 22,
            "CurrentTypeID": 20
        }
    ],
    "StatusTypeID": 0,
    "DateLastStatusUpdate": "2021-07-12T02:46:00Z",
    "MetadataValues": [
        {
            "ID": 10571,
            "MetadataFieldID": 4,
            "ItemValue": "Data from the German chargepoint registry provided by Bundesnetzagentur.de under the CC-BY 4.0 license"
        }
    ],
    "DataQualityLevel": 3,
    "DateCreated": "2021-07-08T09:49:00Z",
    "SubmissionStatusTypeID": 100
}