{
    "IsRecentlyVerified": false,
    "ID": 63628,
    "UUID": "289A1CD6-2B2F-4635-8436-D578D92BF7CC",
    "DataProviderID": 26,
    "DataProvidersReference": "72238",
    "OperatorID": 179,
    "OperatorsReference": "Ecotap 1601183",
    "UsageCost": "0.00 afhankelijk van pas",
    "AddressInfo": {
        "ID": 63974,
        "Title": "Rijksstraatweg",
        "AddressLine1": "Rijksstraatweg",
        "Town": "Wassenaar",
        "Postcode": "2243 CH",
        "CountryID": 159,
        "Latitude": 52.123755,
        "Longitude": 4.387282,
        "RelatedURL": "http://www.ecotap.nl",
        "DistanceUnit": 0
    },
    "Connections": [
        {
            "ID": 81202,
            "ConnectionTypeID": 25,
            "LevelID": 2,
            "PowerKW": 22,
            "CurrentTypeID": 10
        }
    ],
    "NumberOfPoints": 2,
    "StatusTypeID": 50,
    "DateLastStatusUpdate": "2016-06-04T02:50:00Z",
    "DataQualityLevel": 3,
    "DateCreated": "2016-03-03T12:31:00Z",
    "SubmissionStatusTypeID": 100
}