{
    "IsRecentlyVerified": false,
    "ID": 143527,
    "UUID": "3DEF5ED9-00CC-4E45-8D67-0E3D9E97AD81",
    "DataProviderID": 2,
    "DataProvidersReference": "129490",
    "OperatorID": 89,
    "UsageTypeID": 1,
    "AddressInfo": {
        "ID": 143879,
        "Title": "FLO - Canadian Tire - Hamilton Mountain",
        "AddressLine1": "777 Upper James St",
        "Town": "Hamilton",
        "StateOrProvince": "ON",
        "Postcode": "L9C 3A1",
        "CountryID": 44,
        "Latitude": 43.229497,
        "Longitude": -79.879922,
        "ContactTelephone1": "888-356-8911",
        "AccessComments": "24 hours daily",
        "RelatedURL": "https://flo.ca/",
        "DistanceUnit": 0
    },
    "Connections": [
        {
            "ID": 199864,
            "ConnectionTypeID": 1,
            "LevelID": 2,
            "Amps": 16,
            "Voltage": 230,
            "PowerKW": 3.7,
            "CurrentTypeID": 10,
            "Quantity": 2
        },
        {
            "ID": 199865,
            "ConnectionTypeID": 2,
            "LevelID": 3,
            "Amps": 100,
            "Voltage": 400,
            "PowerKW": 40,
            "CurrentTypeID": 30,
            "Quantity": 1
        },
        {
            "ID": 199866,
            "ConnectionTypeID": 32,
            "LevelID": 3,
            "Amps": 100,
            "Voltage": 400,
            "PowerKW": 40,
            "CurrentTypeID": 30,
            "Quantity": 1
        }
    ],
    "StatusTypeID": 50,
    "DateLastStatusUpdate": "2020-06-26T03:06:00Z",
    "DataQualityLevel": 3,
    "DateCreated": "2019-12-24T09:21:00Z",
    "SubmissionStatusTypeID": 100
}