{
    "MediaItems": [
        {
            "ID": 17879,
            "ChargePointID": 118573,
            "ItemURL": "https://s3-ap-southeast-2.amazonaws.com/openchargemap/images/UA/OCM118573/OCM-118573.orig.2019032516002962.jpg",
            "ItemThumbnailURL": "https://s3-ap-southeast-2.amazonaws.com/openchargemap/images/UA/OCM118573/OCM-118573.thmb.2019032516002962.jpg",
            "Comment": "",
            "IsEnabled": true,
            "IsVideo": false,
            "IsFeaturedItem": false,
            "IsExternalResource": false,
            "User": {
                "ID": 20255,
                "Username": "STRUM Charging"
            },
            "DateCreated": "2019-03-25T16:01:00Z"
        },
        {
            "ID": 17880,
            "ChargePointID": 118573,
            "ItemURL": "https://s3-ap-southeast-2.amazonaws.com/openchargemap/images/UA/OCM118573/OCM-118573.orig.2019032516005044.jpg",
            "ItemThumbnailURL": "https://s3-ap-southeast-2.amazonaws.com/openchargemap/images/UA/OCM118573/OCM-118573.thmb.2019032516005044.jpg",
            "Comment": "",
            "IsEnabled": true,
            "IsVideo": false,
            "IsFeaturedItem": false,
            "IsExternalResource": false,
            "User": {
                "ID": 20255,
                "Username": "STRUM Charging"
            },
            "DateCreated": "2019-03-25T16:01:00Z"
        },
        {
            "ID": 17881,
            "ChargePointID": 118573,
            "ItemURL": "https://s3-ap-southeast-2.amazonaws.com/openchargemap/images/UA/OCM118573/OCM-118573.orig.2019032516011784.jpg",
            "ItemThumbnailURL": "https://s3-ap-southeast-2.amazonaws.com/openchargemap/images/UA/OCM118573/OCM-118573.thmb.2019032516011784.jpg",
            "Comment": "",
            "IsEnabled": true,
            "IsVideo": false,
            "IsFeaturedItem": false,
            "IsExternalResource": false,
            "User": {
                "ID": 20255,
                "Username": "STRUM Charging"
            },
            "DateCreated": "2019-03-25T16:01:00Z"
        },
        {
            "ID": 17878,
            "ChargePointID": 118573,
            "ItemURL": "https://s3-ap-southeast-2.amazonaws.com/openchargemap/images/UA/OCM118573/OCM-118573.orig.2019032515595476.jpg",
            "ItemThumbnailURL": "https://s3-ap-southeast-2.amazonaws.com/openchargemap/images/UA/OCM118573/OCM-118573.thmb.2019032515595476.jpg",
            "Comment": "",
            "IsEnabled": true,
            "IsVideo": false,
            "IsFeaturedItem": false,
            "IsExternalResource": false,
            "User": {
                "ID": 20255,
                "Username": "STRUM Charging"
            },
            "DateCreated": "2019-03-25T16:00:00Z"
        },
        {
            "ID": 17876,
            "ChargePointID": 118573,
            "ItemURL": "https://s3-ap-southeast-2.amazonaws.com/openchargemap/images/UA/OCM118573/OCM-118573.orig.2019032515585041.jpg",
            "ItemThumbnailURL": "https://s3-ap-southeast-2.amazonaws.com/openchargemap/images/UA/OCM118573/OCM-118573.thmb.2019032515585041.jpg",
            "Comment": "",
            "IsEnabled": true,
            "IsVideo": false,
            "IsFeaturedItem": false,
            "IsExternalResource": false,
            "User": {
                "ID": 20255,
                "Username": "STRUM Charging"
            },
            "DateCreated": "2019-03-25T15:59:00Z"
        },
        {
            "ID": 17877,
            "ChargePointID": 118573,
            "ItemURL": "https://s3-ap-southeast-2.amazonaws.com/openchargemap/images/UA/OCM118573/OCM-118573.orig.2019032515591423.jpg",
            "ItemThumbnailURL": "https://s3-ap-southeast-2.amazonaws.com/openchargemap/images/UA/OCM118573/OCM-118573.thmb.2019032515591423.jpg",
            "Comment": "",
            "IsEnabled": true,
            "IsVideo": false,
            "IsFeaturedItem": false,
            "IsExternalResource": false,
            "User": {
                "ID": 20255,
                "Username": "STRUM Charging"
            },
            "DateCreated": "2019-03-25T15:59:00Z"
        },
        {
            "ID": 17874,
            "ChargePointID": 118573,
            "ItemURL": "https://s3-ap-southeast-2.amazonaws.com/openchargemap/images/UA/OCM118573/OCM-118573.orig.2019032515573643.jpg",
            "ItemThumbnailURL": "https://s3-ap-southeast-2.amazonaws.com/openchargemap/images/UA/OCM118573/OCM-118573.thmb.2019032515573643.jpg",
            "Comment": "",
            "IsEnabled": true,
            "IsVideo": false,
            "IsFeaturedItem": false,
            "IsExternalResource": false,
            "User": {
                "ID": 20255,
                "Username": "STRUM Charging"
            },
            "DateCreated": "2019-03-25T15:58:00Z"
        },
        {
            "ID": 17875,
            "ChargePointID": 118573,
            "ItemURL": "https://s3-ap-southeast-2.amazonaws.com/openchargemap/images/UA/OCM118573/OCM-118573.orig.2019032515575853.jpg",
            "ItemThumbnailURL": "https://s3-ap-southeast-2.amazonaws.com/openchargemap/images/UA/OCM118573/OCM-118573.thmb.2019032515575853.jpg",
            "Comment": "",
            "IsEnabled": true,
            "IsVideo": false,
            "IsFeaturedItem": false,
            "IsExternalResource": false,
            "User": {
                "ID": 20255,
                "Username": "STRUM Charging"
            },
            "DateCreated": "2019-03-25T15:58:00Z"
        }
    ],
    "IsRecentlyVerified": false,
    "ID": 118573,
    "UUID": "F6792BE8-B99C-4087-9E2B-4BFAF774E903",
    "DataProviderID": 1,
    "OperatorID": 3344,
    "UsageTypeID": 4,
    "UsageCost": "DC - 9 UAH/kWh (≈0.30 €/kWh), AC - 4.5 UAH/kWh (≈0.15 €/kWh). No fees for time or session.",
    "AddressInfo": {
        "ID": 118919,
        "Title": "STRUM 50 kW (Magelan)",
        "AddressLine1": "Akademika Glushkova Str., 13B",
        "Town": "Киев",
        "StateOrProvince": "Голосеевский район",
        "Postcode": "03006",
        "CountryID": 234,
        "Latitude": 50.3677033476614,
        "Longitude": 30.4591018074057,
        "ContactTelephone1": "0-800-212-333",
        "ContactEmail": "support.strum@dtek.com",
        "AccessComments": "24h access. Entrance from Velika Okruzhna Street or Glushkov Avenue. Open parking lot on the east side of the mall. Parking is temporary for free, however usually it's free for the first 15 minutes, then 10 UAH / hour, but not more than 70 UAH per day / night. Parking 1 hour for free with a AUCHAN receipt. STRUM card doesn't enable free parking at this location. ",
        "RelatedURL": "http://strum.dtek.com",
        "DistanceUnit": 0
    },
    "Connections": [
        {
            "ID": 167689,
            "ConnectionTypeID": 2,
            "StatusTypeID": 50,
            "LevelID": 3,
            "Amps": 125,
            "Voltage": 400,
            "PowerKW": 50,
            "CurrentTypeID": 30,
            "Quantity": 1
        },
        {
            "ID": 167690,
            "ConnectionTypeID": 33,
            "StatusTypeID": 50,
            "LevelID": 3,
            "Amps": 125,
            "Voltage": 400,
            "PowerKW": 50,
            "CurrentTypeID": 30,
            "Quantity": 1
        },
        {
            "ID": 167691,
            "ConnectionTypeID": 25,
            "StatusTypeID": 50,
            "LevelID": 2,
            "Amps": 32,
            "Voltage": 400,
            "PowerKW": 22,
            "CurrentTypeID": 20,
            "Quantity": 1
        }
    ],
    "NumberOfPoints": 3,
    "GeneralComments": "Registration, top-up & charging via 'STRUM Charging' mobile app (iOS/Android), at least 25.00 kWh must be available on the account at the start of each charging session. You can book your STRUM card only after registrartion & top-up by sending request to support.strum@dtek.com.\r\n\r\nYou pay only for kWh, no fees for time or session. Price during top-up is 9 UAH/KWH (≈ 0.3 €/KWH). While charging on CHAdeMO/CCS, 1 KWH is taken away for each 1 kWh of charging. While charging on Type2, 0.5 KWH is taken away for each 1 kWh of charging (half price). Actual prices at http://strum.dtek.com/en/prices/.\r\n\r\nAndroid App download - https://play.google.com/store/apps/details?id=com.beenergised.chargemobile.dtek&hl=en\r\niOS App download - https://itunes.apple.com/us/app/strum-charging/id1368596475?mt=8",
    "StatusTypeID": 50,
    "DateLastStatusUpdate": "2019-03-25T22:50:00Z",
    "DataQualityLevel": 1,
    "DateCreated": "2019-03-25T15:51:00Z",
    "SubmissionStatusTypeID": 200
}