{
    "IsRecentlyVerified": false,
    "ID": 56736,
    "UUID": "5F5345C0-16AF-4366-9EB2-59FBABB2A0E3",
    "DataProviderID": 1,
    "OperatorID": 157,
    "OperatorsReference": "NewMotion ICUEVE000640",
    "UsageCost": "0.00 jaarabonnement",
    "AddressInfo": {
        "ID": 57082,
        "Title": "Kronenstraße 24",
        "AddressLine1": "Kronenstraße 24",
        "Town": "Villingen-Schwenningen",
        "Postcode": "78054",
        "CountryID": 87,
        "Latitude": 48.0640368,
        "Longitude": 8.5350242,
        "ContactTelephone1": "088 0109500",
        "RelatedURL": "http://thenewmotion.nl/",
        "DistanceUnit": 0
    },
    "Connections": [
        {
            "ID": 71537,
            "ConnectionTypeID": 25,
            "LevelID": 2,
            "PowerKW": 11,
            "CurrentTypeID": 10
        }
    ],
    "NumberOfPoints": 2,
    "StatusTypeID": 50,
    "DateLastStatusUpdate": "2021-04-25T05:14:00Z",
    "DataQualityLevel": 3,
    "DateCreated": "2015-11-06T04:15:00Z",
    "SubmissionStatusTypeID": 200
}