{
    "IsRecentlyVerified": false,
    "ID": 61671,
    "UUID": "1DD04849-9E0C-42DA-8284-4E660EDFD4D0",
    "DataProviderID": 1,
    "OperatorID": 23,
    "OperatorsReference": "6818",
    "UsageTypeID": 1,
    "UsageCost": "Free",
    "AddressInfo": {
        "ID": 62017,
        "Title": "Ellington at Wachesaw East - Tesla",
        "AddressLine1": "911 Riverwood Dr",
        "Town": "Murrells Inlet",
        "StateOrProvince": "SC",
        "Postcode": "29576",
        "CountryID": 2,
        "Latitude": 33.5606826,
        "Longitude": -79.0466831,
        "ContactTelephone1": "843-357-5282  877-798-3752",
        "AccessComments": "24 hours daily; for Tesla use only; for guest use only; see front desk for access",
        "RelatedURL": "http://www.teslamotors.com/supercharger",
        "DistanceUnit": 0
    },
    "Connections": [
        {
            "ID": 78560,
            "ConnectionTypeID": 30,
            "StatusTypeID": 50,
            "LevelID": 2,
            "Amps": 16,
            "Voltage": 230,
            "PowerKW": 6,
            "CurrentTypeID": 10,
            "Quantity": 2
        }
    ],
    "NumberOfPoints": 2,
    "StatusTypeID": 50,
    "DateLastStatusUpdate": "2017-01-31T19:14:00Z",
    "DataQualityLevel": 3,
    "DateCreated": "2016-03-03T11:38:00Z",
    "SubmissionStatusTypeID": 100
}