{
    "IsRecentlyVerified": false,
    "ID": 65284,
    "UUID": "17BFD858-7101-409F-BC7F-C633D526EBD8",
    "DataProviderID": 1,
    "OperatorID": 45,
    "UsageTypeID": 6,
    "AddressInfo": {
        "ID": 65630,
        "Title": "Hotel Mont-Blanc",
        "AddressLine1": "Allée du Majestic 62",
        "Town": "Chamonix-Mont-Blanc",
        "StateOrProvince": "Bonneville",
        "Postcode": "74400",
        "CountryID": 80,
        "Latitude": 45.9231414103923,
        "Longitude": 6.86812829570089,
        "ContactTelephone1": "+33 4 50 53 05 64",
        "AccessComments": "Tesla Destination Charging location.",
        "RelatedURL": "http://www.hotelmontblancchamonix.com/",
        "DistanceUnit": 0
    },
    "Connections": [
        {
            "ID": 89900,
            "ConnectionTypeID": 25,
            "StatusTypeID": 50,
            "LevelID": 2,
            "Amps": 32,
            "Voltage": 400,
            "PowerKW": 22,
            "CurrentTypeID": 20,
            "Quantity": 1
        }
    ],
    "NumberOfPoints": 1,
    "StatusTypeID": 50,
    "DateLastStatusUpdate": "2016-04-26T16:27:00Z",
    "DataQualityLevel": 1,
    "DateCreated": "2016-04-26T08:26:00Z",
    "SubmissionStatusTypeID": 200
}