{
    "IsRecentlyVerified": false,
    "ID": 42773,
    "UUID": "B6CBC569-4D42-4F62-A688-3B5FF0E579AF",
    "DataProviderID": 1,
    "OperatorID": 45,
    "UsageTypeID": 5,
    "UsageCost": "1€/6h",
    "AddressInfo": {
        "ID": 43119,
        "Title": "Sportplatz Petershagen",
        "AddressLine1": "Hohoffstraße 15",
        "Town": "Petershagen",
        "StateOrProvince": "Kreis Minden-Lübbecke",
        "Postcode": "32469",
        "CountryID": 87,
        "Latitude": 52.3757612550735,
        "Longitude": 8.96837798411457,
        "AccessComments": "Den Ausschilderungen zum immer geöffneten Stellplatz folgen. Er ist auf dem Parkplatz am Sportplatz. Stromsäule mit 8 Anschlüssen und Münzeinwurf 1€/6h. Keine Parkgebühren.",
        "RelatedURL": "http://www.petershagen.de/",
        "DistanceUnit": 0
    },
    "Connections": [
        {
            "ID": 51621,
            "ConnectionTypeID": 16,
            "StatusTypeID": 50,
            "LevelID": 2,
            "Amps": 16,
            "Voltage": 230,
            "PowerKW": 3.7,
            "CurrentTypeID": 10,
            "Quantity": 8
        }
    ],
    "NumberOfPoints": 8,
    "StatusTypeID": 50,
    "DateLastStatusUpdate": "2015-06-29T06:32:00Z",
    "DataQualityLevel": 1,
    "DateCreated": "2015-03-23T18:11:00Z",
    "SubmissionStatusTypeID": 200
}