{
    "IsRecentlyVerified": false,
    "ID": 61247,
    "UUID": "98BE6CD2-5D8F-4234-859C-F78182B72732",
    "DataProviderID": 1,
    "OperatorID": 1,
    "UsageTypeID": 4,
    "UsageCost": "Free",
    "AddressInfo": {
        "ID": 61593,
        "Title": "Centro Comercial Parque Santiago 6",
        "AddressLine1": "Av. de Chayofita, 12",
        "Town": "Arona ",
        "StateOrProvince": "Santa Cruz de Tenerife",
        "Postcode": "38650",
        "CountryID": 210,
        "Latitude": 28.05808,
        "Longitude": -16.720939999999928,
        "ContactEmail": "info@canariasterecarga.com",
        "AccessComments": "Tarjeta Canarias Te Recarga",
        "RelatedURL": "http://www.canariasterecarga.com",
        "DistanceUnit": 0
    },
    "Connections": [
        {
            "ID": 77963,
            "ConnectionTypeID": 25,
            "StatusTypeID": 50,
            "LevelID": 2,
            "Amps": 32,
            "Voltage": 400,
            "PowerKW": 22,
            "Quantity": 1
        },
        {
            "ID": 77964,
            "ConnectionTypeID": 28,
            "StatusTypeID": 50,
            "LevelID": 2,
            "Amps": 16,
            "Voltage": 230,
            "PowerKW": 3.6,
            "Quantity": 1
        }
    ],
    "NumberOfPoints": 2,
    "StatusTypeID": 50,
    "DateLastStatusUpdate": "2016-02-17T16:22:00Z",
    "DataQualityLevel": 1,
    "DateCreated": "2016-02-17T16:22:00Z",
    "SubmissionStatusTypeID": 200
}