{
    "IsRecentlyVerified": false,
    "ID": 30913,
    "UUID": "ED4AC188-99F6-4D24-AAC7-92A4DC6DA402",
    "DataProviderID": 1,
    "DataProvidersReference": "1754",
    "AddressInfo": {
        "ID": 31259,
        "Title": "Bygdinvegen, Beitostølen",
        "AddressLine1": "Bygdinvegen ",
        "Town": "BEITOSTØLEN",
        "StateOrProvince": "Innlandet",
        "Postcode": "2953",
        "CountryID": 168,
        "Latitude": 61.24774,
        "Longitude": 8.90855,
        "AccessComments": "",
        "DistanceUnit": 0
    },
    "Connections": [
        {
            "ID": 34142,
            "ConnectionTypeID": 0,
            "Reference": "1",
            "LevelID": 2,
            "Amps": 32,
            "Voltage": 230,
            "PowerKW": 7.4,
            "Comments": "Mode 3"
        },
        {
            "ID": 89208,
            "ConnectionTypeID": 0,
            "Reference": "2",
            "LevelID": 2,
            "Amps": 32,
            "Voltage": 230,
            "PowerKW": 7.4,
            "Comments": "Mode 3"
        }
    ],
    "NumberOfPoints": 2,
    "DateLastStatusUpdate": "2020-05-26T08:24:00Z",
    "DataQualityLevel": 2,
    "DateCreated": "2014-12-09T09:01:00Z",
    "SubmissionStatusTypeID": 100
}