{
    "IsRecentlyVerified": false,
    "ID": 178628,
    "UUID": "4BF0F0E8-39B3-4E44-B1DA-D999F46FEECF",
    "DataProviderID": 29,
    "DataProvidersReference": "18893,8630",
    "OperatorID": 69,
    "AddressInfo": {
        "ID": 178987,
        "Title": "Hüttfeldstraße 7",
        "AddressLine1": "Hüttfeldstraße 7",
        "Town": "Aalen",
        "Postcode": "73430",
        "CountryID": 87,
        "Latitude": 48.83667,
        "Longitude": 10.083735,
        "DistanceUnit": 0
    },
    "Connections": [
        {
            "ID": 279295,
            "ConnectionTypeID": 25,
            "StatusTypeID": 50,
            "LevelID": 2,
            "PowerKW": 22,
            "CurrentTypeID": 20
        },
        {
            "ID": 279296,
            "ConnectionTypeID": 25,
            "StatusTypeID": 50,
            "LevelID": 2,
            "PowerKW": 22,
            "CurrentTypeID": 20
        },
        {
            "ID": 279297,
            "ConnectionTypeID": 25,
            "StatusTypeID": 50,
            "LevelID": 2,
            "PowerKW": 22,
            "CurrentTypeID": 20
        },
        {
            "ID": 279298,
            "ConnectionTypeID": 25,
            "StatusTypeID": 50,
            "LevelID": 2,
            "PowerKW": 22,
            "CurrentTypeID": 20
        }
    ],
    "StatusTypeID": 0,
    "DateLastStatusUpdate": "2021-07-09T03:13:00Z",
    "MetadataValues": [
        {
            "ID": 10922,
            "MetadataFieldID": 4,
            "ItemValue": "Data from the German chargepoint registry provided by Bundesnetzagentur.de under the CC-BY 4.0 license"
        }
    ],
    "DataQualityLevel": 3,
    "DateCreated": "2021-07-08T09:50:00Z",
    "SubmissionStatusTypeID": 100
}