{
    "UserComments": [
        {
            "ID": 6027,
            "ChargePointID": 40341,
            "CommentTypeID": 10,
            "UserName": "Doug Kaye",
            "Comment": "Located on the ground floor (covered section) of the free municipal parking garage.",
            "DateCreated": "2015-07-26T06:41:37.103Z",
            "User": {
                "ID": 6137,
                "Username": "Doug Kaye"
            },
            "CheckinStatusTypeID": 140
        }
    ],
    "IsRecentlyVerified": false,
    "ID": 40341,
    "UUID": "649094C2-65B6-493B-81F9-D0F6AEE0351D",
    "DataProviderID": 2,
    "DataProvidersReference": "48291",
    "OperatorID": 9,
    "UsageTypeID": 1,
    "AddressInfo": {
        "ID": 40687,
        "Title": "Ashland - 175 Hargadine",
        "AddressLine1": "175 Hargadine Street",
        "Town": "Ashland",
        "StateOrProvince": "OR",
        "Postcode": "97520",
        "CountryID": 2,
        "Latitude": 42.195631,
        "Longitude": -122.713895,
        "ContactTelephone1": "888-998-2546",
        "AccessComments": "MON: 24 hours | TUE: 24 hours | WED: 24 hours | THU: 24 hours | FRI: 24 hours | SAT: 24 hours | SUN: 24 hours",
        "RelatedURL": "http://www.blinknetwork.com/",
        "DistanceUnit": 0
    },
    "Connections": [
        {
            "ID": 43906,
            "ConnectionTypeID": 1,
            "LevelID": 2,
            "Amps": 16,
            "Voltage": 230,
            "PowerKW": 3,
            "CurrentTypeID": 10,
            "Quantity": 2
        }
    ],
    "DateLastStatusUpdate": "2018-01-04T06:20:00Z",
    "DataQualityLevel": 3,
    "DateCreated": "2015-01-10T01:01:00Z",
    "SubmissionStatusTypeID": 100
}