{
    "IsRecentlyVerified": false,
    "ID": 79945,
    "UUID": "21000075-5AFD-41C1-A37C-4E07EA1750F2",
    "DataProviderID": 1,
    "OperatorID": 23,
    "OperatorsReference": "10542",
    "UsageTypeID": 6,
    "UsageCost": "Free",
    "AddressInfo": {
        "ID": 80291,
        "Title": "Coast Coal Harbour Hotel",
        "AddressLine1": "1180 W Hastings St",
        "Town": "Vancouver",
        "StateOrProvince": "BC",
        "Postcode": "V6E 4R5",
        "CountryID": 44,
        "Latitude": 49.2884189,
        "Longitude": -123.1221991,
        "ContactTelephone1": "(604) 697-0202",
        "DistanceUnit": 0
    },
    "Connections": [
        {
            "ID": 114594,
            "ConnectionTypeID": 30,
            "StatusTypeID": 50,
            "LevelID": 2,
            "PowerKW": 13,
            "CurrentTypeID": 20,
            "Quantity": 1
        }
    ],
    "NumberOfPoints": 1,
    "GeneralComments": "1 Tesla Connector, up to 13kW.Available for patrons only. Please see valet.",
    "StatusTypeID": 50,
    "DateLastStatusUpdate": "2017-01-30T18:00:00Z",
    "DataQualityLevel": 1,
    "DateCreated": "2017-01-30T18:00:00Z",
    "SubmissionStatusTypeID": 200
}