{
    "MediaItems": [
        {
            "ID": 15116,
            "ChargePointID": 97281,
            "ItemURL": "https://s3-ap-southeast-2.amazonaws.com/openchargemap/images/GB/OCM97281/OCM-97281.orig.2018022510144371.png",
            "ItemThumbnailURL": "https://s3-ap-southeast-2.amazonaws.com/openchargemap/images/GB/OCM97281/OCM-97281.thmb.2018022510144371.png",
            "Comment": "",
            "IsEnabled": true,
            "IsVideo": false,
            "IsFeaturedItem": false,
            "IsExternalResource": false,
            "User": {
                "ID": 4575,
                "Username": "Simon Hewison"
            },
            "DateCreated": "2018-02-25T10:15:00Z"
        }
    ],
    "IsRecentlyVerified": false,
    "ID": 97281,
    "UUID": "9389D953-3C59-4241-B4F6-8FE21862497C",
    "DataProviderID": 1,
    "OperatorID": 3,
    "OperatorsReference": "PG-91715,PG-91716,PG-91720,PG-91732",
    "UsageTypeID": 4,
    "UsageCost": "Free. Parking fees apply.",
    "AddressInfo": {
        "ID": 97627,
        "Title": "The Royals Shopping Centre",
        "AddressLine1": "High Street",
        "Town": "Southend-on-Sea",
        "StateOrProvince": "Essex",
        "Postcode": "SS1 1DG",
        "CountryID": 1,
        "Latitude": 51.534132,
        "Longitude": 0.71607,
        "DistanceUnit": 0
    },
    "Connections": [
        {
            "ID": 138152,
            "ConnectionTypeID": 25,
            "StatusTypeID": 50,
            "LevelID": 2,
            "Amps": 32,
            "Voltage": 230,
            "PowerKW": 7,
            "CurrentTypeID": 10,
            "Quantity": 4
        }
    ],
    "NumberOfPoints": 4,
    "GeneralComments": "This is an open charge unit installed at The Royals Shopping Centre in High Street, Southend-on-Sea, Essex",
    "StatusTypeID": 50,
    "DateLastStatusUpdate": "2019-05-13T12:39:00Z",
    "DataQualityLevel": 1,
    "DateCreated": "2018-01-16T06:29:00Z",
    "SubmissionStatusTypeID": 200
}