{
    "IsRecentlyVerified": false,
    "ID": 90192,
    "UUID": "C84C7650-DD3A-4D7B-9F2D-0311EAD08314",
    "DataProviderID": 1,
    "OperatorID": 23,
    "OperatorsReference": "30620",
    "UsageTypeID": 6,
    "AddressInfo": {
        "ID": 90538,
        "Title": "Horseshoe Guesthouse",
        "AddressLine1": "Church Street",
        "Town": "Rhayader",
        "StateOrProvince": "Powys",
        "Postcode": "LD6 5AT",
        "CountryID": 1,
        "Latitude": 52.300341,
        "Longitude": -3.51307,
        "ContactTelephone1": "+44 1597 810982",
        "DistanceUnit": 0
    },
    "Connections": [
        {
            "ID": 127845,
            "ConnectionTypeID": 30,
            "StatusTypeID": 50,
            "LevelID": 2,
            "Amps": 32,
            "Voltage": 230,
            "PowerKW": 7,
            "CurrentTypeID": 10,
            "Quantity": 1
        }
    ],
    "NumberOfPoints": 1,
    "GeneralComments": "1 Tesla Connector, up to 7kW.Available for patrons only. Please see front desk.",
    "StatusTypeID": 50,
    "DateLastStatusUpdate": "2018-10-03T18:55:00Z",
    "DataQualityLevel": 1,
    "DateCreated": "2017-07-13T14:11:00Z",
    "SubmissionStatusTypeID": 200
}