{
    "IsRecentlyVerified": false,
    "ID": 77744,
    "UUID": "0363BBD8-9C6F-4CCF-9CDC-EFA4CF87C810",
    "DataProviderID": 1,
    "OperatorID": 3253,
    "OperatorsReference": "AT*SMA*EAT0601679*001AC,AT*SMA*EAT0601679*001DC,AT*SMA*EAT0601679*002DC",
    "UsageTypeID": 1,
    "UsageCost": "€0,45/min ; Andere Tarife möglich",
    "AddressInfo": {
        "ID": 78090,
        "Title": "Schnellladestation Mcdonald's Graz",
        "AddressLine1": "Conrad von Hötzendorf Straße 91",
        "Town": "Graz",
        "StateOrProvince": "Steiermark",
        "Postcode": "8010",
        "CountryID": 19,
        "Latitude": 47.055656,
        "Longitude": 15.447853,
        "DistanceUnit": 0
    },
    "Connections": [
        {
            "ID": 112305,
            "ConnectionTypeID": 1036,
            "StatusTypeID": 50,
            "LevelID": 3,
            "PowerKW": 43,
            "CurrentTypeID": 20,
            "Quantity": 1
        },
        {
            "ID": 112335,
            "ConnectionTypeID": 2,
            "StatusTypeID": 50,
            "LevelID": 3,
            "PowerKW": 50,
            "CurrentTypeID": 20,
            "Quantity": 1
        },
        {
            "ID": 112336,
            "ConnectionTypeID": 33,
            "StatusTypeID": 50,
            "LevelID": 3,
            "PowerKW": 50,
            "CurrentTypeID": 20,
            "Quantity": 1
        }
    ],
    "NumberOfPoints": 3,
    "StatusTypeID": 50,
    "DateLastStatusUpdate": "2017-01-23T16:39:00Z",
    "DataQualityLevel": 1,
    "DateCreated": "2017-01-23T14:10:00Z",
    "SubmissionStatusTypeID": 200
}