{
    "IsRecentlyVerified": false,
    "ID": 17936,
    "UUID": "C13D4E0F-14D7-4F5C-89E9-E967EEA1EA85",
    "DataProviderID": 22,
    "DataProvidersReference": "0059745D4A01D8CFDC42D82CBA64717F",
    "AddressInfo": {
        "ID": 18281,
        "Title": "日本海三菱鳥取五反田店・クリーンカー五反田",
        "AddressLine1": "鳥取県鳥取市五反田町3",
        "CountryID": 114,
        "Latitude": 35.50821206,
        "Longitude": 134.2010746,
        "ContactTelephone1": "0857-31-1340",
        "DistanceUnit": 0
    },
    "Connections": [
        {
            "ID": 18177,
            "ConnectionTypeID": 2,
            "LevelID": 2,
            "Amps": 100,
            "Voltage": 480,
            "PowerKW": 48,
            "Quantity": 1
        }
    ],
    "DateLastStatusUpdate": "2013-06-29T09:05:00Z",
    "DataQualityLevel": 2,
    "DateCreated": "2013-06-29T09:05:00Z",
    "SubmissionStatusTypeID": 200
}