{
    "IsRecentlyVerified": false,
    "ID": 77728,
    "UUID": "DF737BEB-07CA-4521-A905-E07AF1058517",
    "DataProviderID": 1,
    "OperatorID": 13,
    "OperatorsReference": "SI006E015*1",
    "UsageTypeID": 1,
    "AddressInfo": {
        "ID": 78074,
        "Title": "Cesta Krških Žrtev 51 (nasproti Pu Krško)",
        "AddressLine1": "Cesta krških žrtev 51",
        "Town": "Krško",
        "Postcode": "8270",
        "CountryID": 205,
        "Latitude": 45.963009,
        "Longitude": 15.486581,
        "DistanceUnit": 0
    },
    "Connections": [
        {
            "ID": 112289,
            "ConnectionTypeID": 25,
            "StatusTypeID": 50,
            "LevelID": 2,
            "CurrentTypeID": 20,
            "Quantity": 1
        }
    ],
    "NumberOfPoints": 2,
    "StatusTypeID": 50,
    "DateLastStatusUpdate": "2017-11-14T09:54:00Z",
    "DataQualityLevel": 1,
    "DateCreated": "2017-01-23T14:05:00Z",
    "SubmissionStatusTypeID": 200
}