{
    "IsRecentlyVerified": false,
    "ID": 115573,
    "UUID": "1648AB27-756F-4EF5-919A-0965AA49E5A3",
    "DataProviderID": 2,
    "DataProvidersReference": "113300",
    "OperatorID": 23,
    "UsageTypeID": 1,
    "AddressInfo": {
        "ID": 115919,
        "Title": "Pessagno Winery - Tesla Destination",
        "AddressLine1": "1645 River Rd",
        "Town": "Salinas",
        "StateOrProvince": "CA",
        "Postcode": "93908",
        "CountryID": 2,
        "Latitude": 36.482388,
        "Longitude": -121.486553,
        "ContactTelephone1": "831-675-9463  877-798-3752",
        "AccessComments": "24 hours daily; for Tesla use only",
        "RelatedURL": "https://www.tesla.com/destination-charging",
        "DistanceUnit": 0
    },
    "Connections": [
        {
            "ID": 162593,
            "ConnectionTypeID": 0,
            "LevelID": 2,
            "Amps": 16,
            "Voltage": 230,
            "PowerKW": 3,
            "CurrentTypeID": 10,
            "Quantity": 1
        }
    ],
    "DateLastStatusUpdate": "2019-04-06T04:02:00Z",
    "DataQualityLevel": 3,
    "DateCreated": "2019-02-11T07:13:00Z",
    "SubmissionStatusTypeID": 100
}