{
    "IsRecentlyVerified": false,
    "ID": 45144,
    "UUID": "560A104C-91A6-4BCB-95A8-6660B87F9166",
    "DataProviderID": 1,
    "OperatorID": 98,
    "UsageTypeID": 4,
    "AddressInfo": {
        "ID": 45490,
        "Title": "Bundesverband Solare Mobilität e.V.",
        "AddressLine1": "Wilhelmstraße 92",
        "Town": "Berlin",
        "Postcode": "10117",
        "CountryID": 87,
        "Latitude": 52.5124801231397,
        "Longitude": 13.3824776980182,
        "ContactTelephone1": "030-32662999",
        "AccessComments": "Gelbe P&C Box an der Hauswand, leider ohne Parkplatz. Fussweg sehr breit, daher für Zweiräder oder kleinere Fahrzeuge geeignet.",
        "RelatedURL": "http://www.bsm-ev.de/",
        "DistanceUnit": 0
    },
    "Connections": [
        {
            "ID": 55628,
            "ConnectionTypeID": 17,
            "StatusTypeID": 50,
            "LevelID": 2,
            "Amps": 32,
            "Voltage": 400,
            "PowerKW": 22,
            "CurrentTypeID": 20,
            "Quantity": 1
        },
        {
            "ID": 55629,
            "ConnectionTypeID": 16,
            "StatusTypeID": 50,
            "LevelID": 2,
            "Amps": 16,
            "Voltage": 230,
            "PowerKW": 3.7,
            "CurrentTypeID": 10,
            "Quantity": 1
        },
        {
            "ID": 55630,
            "ConnectionTypeID": 28,
            "StatusTypeID": 50,
            "LevelID": 2,
            "Amps": 16,
            "Voltage": 230,
            "PowerKW": 3.7,
            "CurrentTypeID": 10,
            "Quantity": 2
        }
    ],
    "NumberOfPoints": 4,
    "StatusTypeID": 50,
    "DateLastStatusUpdate": "2015-04-25T13:46:00Z",
    "DataQualityLevel": 1,
    "DateCreated": "2015-04-25T13:30:00Z",
    "SubmissionStatusTypeID": 200
}