{
    "IsRecentlyVerified": false,
    "ID": 179595,
    "UUID": "5C9FD1D3-9794-4D35-B6DF-21574844BB6F",
    "DataProviderID": 29,
    "DataProvidersReference": "15795",
    "AddressInfo": {
        "ID": 179954,
        "Title": "Klosterhof 1",
        "AddressLine1": "Klosterhof 1",
        "Town": "Bogen",
        "Postcode": "94327",
        "CountryID": 87,
        "Latitude": 48.9174,
        "Longitude": 12.66768,
        "DistanceUnit": 0
    },
    "Connections": [
        {
            "ID": 281620,
            "ConnectionTypeID": 25,
            "StatusTypeID": 50,
            "LevelID": 2,
            "PowerKW": 22,
            "CurrentTypeID": 20
        },
        {
            "ID": 281621,
            "ConnectionTypeID": 25,
            "StatusTypeID": 50,
            "LevelID": 2,
            "PowerKW": 22,
            "CurrentTypeID": 20
        },
        {
            "ID": 281622,
            "ConnectionTypeID": 25,
            "StatusTypeID": 50,
            "LevelID": 2,
            "PowerKW": 22,
            "CurrentTypeID": 20
        },
        {
            "ID": 281623,
            "ConnectionTypeID": 25,
            "StatusTypeID": 50,
            "LevelID": 2,
            "PowerKW": 22,
            "CurrentTypeID": 20
        }
    ],
    "StatusTypeID": 50,
    "DateLastStatusUpdate": "2021-07-12T02:42:00Z",
    "MetadataValues": [
        {
            "ID": 11889,
            "MetadataFieldID": 4,
            "ItemValue": "Data from the German chargepoint registry provided by Bundesnetzagentur.de under the CC-BY 4.0 license"
        }
    ],
    "DataQualityLevel": 3,
    "DateCreated": "2021-07-08T09:59:00Z",
    "SubmissionStatusTypeID": 100
}