{
    "IsRecentlyVerified": false,
    "ID": 121142,
    "UUID": "9A142F69-616A-4F0A-9557-B5BDF04D3194",
    "DataProviderID": 2,
    "DataProvidersReference": "117815",
    "OperatorID": 5,
    "UsageTypeID": 1,
    "AddressInfo": {
        "ID": 121488,
        "Title": "SBUSD",
        "AddressLine1": "720 Santa Barbara St",
        "Town": "Santa Barbara",
        "StateOrProvince": "CA",
        "Postcode": "93101",
        "CountryID": 2,
        "Latitude": 34.4216086,
        "Longitude": -119.6962364,
        "ContactTelephone1": "888-758-4389",
        "AccessComments": "24 hours daily",
        "RelatedURL": "http://www.chargepoint.com/",
        "DistanceUnit": 0
    },
    "Connections": [
        {
            "ID": 170576,
            "ConnectionTypeID": 1,
            "LevelID": 2,
            "Amps": 16,
            "Voltage": 230,
            "PowerKW": 3,
            "CurrentTypeID": 10,
            "Quantity": 2
        }
    ],
    "DateLastStatusUpdate": "2019-12-24T09:12:00Z",
    "DataQualityLevel": 3,
    "DateCreated": "2019-04-01T04:59:00Z",
    "SubmissionStatusTypeID": 100
}