{
    "IsRecentlyVerified": false,
    "ID": 108686,
    "UUID": "BE406EA2-AB92-40AB-B52B-AE1CBD034C35",
    "DataProviderID": 1,
    "OperatorID": 23,
    "OperatorsReference": "46168",
    "UsageTypeID": 4,
    "AddressInfo": {
        "ID": 109032,
        "Title": "Golf de la Prée la Rochelle",
        "AddressLine1": "Golf de la Prée",
        "Town": "Marsilly",
        "Postcode": "17137",
        "CountryID": 80,
        "Latitude": 46.223774,
        "Longitude": -1.15287,
        "ContactTelephone1": "+33 5 46 01 24 42",
        "DistanceUnit": 0
    },
    "Connections": [
        {
            "ID": 153801,
            "ConnectionTypeID": 30,
            "StatusTypeID": 50,
            "LevelID": 2,
            "PowerKW": 14,
            "CurrentTypeID": 20,
            "Quantity": 2
        }
    ],
    "NumberOfPoints": 2,
    "GeneralComments": "2 Tesla Connectors, up to 14kW.Available for customers. Please see front desk.",
    "StatusTypeID": 50,
    "DateLastStatusUpdate": "2018-10-11T12:23:00Z",
    "DataQualityLevel": 1,
    "DateCreated": "2018-10-11T12:23:00Z",
    "SubmissionStatusTypeID": 200
}