{
    "UserComments": [
        {
            "ID": 25005,
            "ChargePointID": 189461,
            "CommentTypeID": 10,
            "UserName": "ForumElettrico.it",
            "Comment": "Tutto ok card Enel X su CHAdeMO. Leggi la recensione completa qui:  https://www.forumelettrico.it/forum/post251841.html#p251841",
            "RelatedURL": "https://www.forumelettrico.it/forum/post251841.html#p251841",
            "DateCreated": "2021-11-03T15:32:58.8Z",
            "User": {
                "ID": 11749,
                "Username": "ForumElettrico.it"
            },
            "CheckinStatusTypeID": 10,
            "IsActionedByEditor": false
        },
        {
            "ID": 24922,
            "ChargePointID": 189461,
            "CommentTypeID": 10,
            "UserName": "ForumElettrico.it",
            "Comment": "Il parcheggio è quello del centro commerciale, ma attenzione agli orari. Leggi la recensione completa qui:  https://www.forumelettrico.it/forum/colonnina-be-charge-fast-euro-torri-parma-pr-via-bormioli-rocco-33-a-t20666.html",
            "RelatedURL": "https://www.forumelettrico.it/forum/colonnina-be-charge-fast-euro-torri-parma-pr-via-bormioli-rocco-33-a-t20666.html",
            "DateCreated": "2021-10-02T10:05:54.487Z",
            "User": {
                "ID": 11749,
                "Username": "ForumElettrico.it"
            },
            "CheckinStatusTypeID": 10,
            "IsActionedByEditor": false
        }
    ],
    "MediaItems": [
        {
            "ID": 29432,
            "ChargePointID": 189461,
            "ItemURL": "https://s3-ap-southeast-2.amazonaws.com/openchargemap/images/IT/OCM189461/OCM-189461.orig.2021100210063463.jpg",
            "ItemThumbnailURL": "https://s3-ap-southeast-2.amazonaws.com/openchargemap/images/IT/OCM189461/OCM-189461.thmb.2021100210063463.jpg",
            "Comment": "",
            "IsEnabled": true,
            "IsVideo": false,
            "IsFeaturedItem": false,
            "IsExternalResource": false,
            "User": {
                "ID": 11749,
                "Username": "ForumElettrico.it"
            },
            "DateCreated": "2021-10-02T10:07:00Z"
        },
        {
            "ID": 29433,
            "ChargePointID": 189461,
            "ItemURL": "https://s3-ap-southeast-2.amazonaws.com/openchargemap/images/IT/OCM189461/OCM-189461.orig.2021100210070871.jpg",
            "ItemThumbnailURL": "https://s3-ap-southeast-2.amazonaws.com/openchargemap/images/IT/OCM189461/OCM-189461.thmb.2021100210070871.jpg",
            "Comment": "",
            "IsEnabled": true,
            "IsVideo": false,
            "IsFeaturedItem": false,
            "IsExternalResource": false,
            "User": {
                "ID": 11749,
                "Username": "ForumElettrico.it"
            },
            "DateCreated": "2021-10-02T10:07:00Z"
        },
        {
            "ID": 29434,
            "ChargePointID": 189461,
            "ItemURL": "https://s3-ap-southeast-2.amazonaws.com/openchargemap/images/IT/OCM189461/OCM-189461.orig.2021100210071539.jpg",
            "ItemThumbnailURL": "https://s3-ap-southeast-2.amazonaws.com/openchargemap/images/IT/OCM189461/OCM-189461.thmb.2021100210071539.jpg",
            "Comment": "",
            "IsEnabled": true,
            "IsVideo": false,
            "IsFeaturedItem": false,
            "IsExternalResource": false,
            "User": {
                "ID": 11749,
                "Username": "ForumElettrico.it"
            },
            "DateCreated": "2021-10-02T10:07:00Z"
        },
        {
            "ID": 29435,
            "ChargePointID": 189461,
            "ItemURL": "https://s3-ap-southeast-2.amazonaws.com/openchargemap/images/IT/OCM189461/OCM-189461.orig.2021100210072397.jpg",
            "ItemThumbnailURL": "https://s3-ap-southeast-2.amazonaws.com/openchargemap/images/IT/OCM189461/OCM-189461.thmb.2021100210072397.jpg",
            "Comment": "",
            "IsEnabled": true,
            "IsVideo": false,
            "IsFeaturedItem": false,
            "IsExternalResource": false,
            "User": {
                "ID": 11749,
                "Username": "ForumElettrico.it"
            },
            "DateCreated": "2021-10-02T10:07:00Z"
        },
        {
            "ID": 29431,
            "ChargePointID": 189461,
            "ItemURL": "https://s3-ap-southeast-2.amazonaws.com/openchargemap/images/IT/OCM189461/OCM-189461.orig.2021100210061831.jpg",
            "ItemThumbnailURL": "https://s3-ap-southeast-2.amazonaws.com/openchargemap/images/IT/OCM189461/OCM-189461.thmb.2021100210061831.jpg",
            "Comment": "",
            "IsEnabled": true,
            "IsVideo": false,
            "IsFeaturedItem": false,
            "IsExternalResource": false,
            "User": {
                "ID": 11749,
                "Username": "ForumElettrico.it"
            },
            "DateCreated": "2021-10-02T10:06:00Z"
        }
    ],
    "IsRecentlyVerified": true,
    "DateLastVerified": "2021-10-02T09:59:00Z",
    "ID": 189461,
    "UUID": "76889FD1-8E40-43A3-A1D8-E50B177FC3DD",
    "DataProviderID": 1,
    "OperatorID": 3327,
    "UsageTypeID": 1,
    "AddressInfo": {
        "ID": 189820,
        "Title": "Be Charge Euro Torri",
        "AddressLine1": "Via Bormioli Rocco 33/A",
        "Town": "Parma",
        "StateOrProvince": "PR",
        "CountryID": 112,
        "Latitude": 44.81945,
        "Longitude": 10.33834,
        "RelatedURL": "https://www.forumelettrico.it/forum/colonnina-be-charge-fast-euro-torri-parma-pr-via-bormioli-rocco-33-a-t20666.html",
        "DistanceUnit": 0
    },
    "Connections": [
        {
            "ID": 306434,
            "ConnectionTypeID": 33,
            "LevelID": 2,
            "PowerKW": 75
        },
        {
            "ID": 306435,
            "ConnectionTypeID": 2,
            "LevelID": 2,
            "PowerKW": 63
        },
        {
            "ID": 306436,
            "ConnectionTypeID": 1036,
            "LevelID": 2,
            "PowerKW": 22
        }
    ],
    "NumberOfPoints": 1,
    "StatusTypeID": 50,
    "DateLastStatusUpdate": "2021-11-03T15:33:00Z",
    "DataQualityLevel": 1,
    "DateCreated": "2021-10-02T09:59:00Z",
    "SubmissionStatusTypeID": 200
}