{
    "IsRecentlyVerified": false,
    "ID": 174166,
    "UUID": "DAE5CE0A-A2C6-4EC4-A3D4-4C85DA7C88CD",
    "DataProviderID": 1,
    "OperatorID": 3377,
    "UsageTypeID": 1,
    "UsageCost": "Free",
    "AddressInfo": {
        "ID": 174525,
        "Title": "Ajuntament d'Aiguaviva",
        "AddressLine1": "Ajuntament d'Aiguaviva",
        "Town": "Aiguaviva",
        "StateOrProvince": "Catalonia",
        "Postcode": "17162",
        "CountryID": 210,
        "Latitude": 41.938406563708725,
        "Longitude": 2.761960891228796,
        "RelatedURL": "http://etecnic.es",
        "DistanceUnit": 0
    },
    "Connections": [
        {
            "ID": 269176,
            "ConnectionTypeID": 25,
            "StatusTypeID": 50,
            "LevelID": 2,
            "Amps": 16,
            "Voltage": 400,
            "PowerKW": 11.1,
            "CurrentTypeID": 20,
            "Quantity": 2
        }
    ],
    "NumberOfPoints": 2,
    "StatusTypeID": 50,
    "DateLastStatusUpdate": "2021-03-19T10:28:00Z",
    "DataQualityLevel": 1,
    "DateCreated": "2021-03-19T10:28:00Z",
    "SubmissionStatusTypeID": 200
}