{
    "IsRecentlyVerified": false,
    "ID": 183655,
    "UUID": "17E66F4B-429C-4EA2-A5D7-23E1A747F4CA",
    "DataProviderID": 29,
    "DataProvidersReference": "9642",
    "AddressInfo": {
        "ID": 184014,
        "Title": "Schlüterstraße",
        "AddressLine1": "Schlüterstraße",
        "Town": "Gütersloh",
        "Postcode": "33330",
        "CountryID": 87,
        "Latitude": 51.9161,
        "Longitude": 8.37132,
        "DistanceUnit": 0
    },
    "Connections": [
        {
            "ID": 290895,
            "ConnectionTypeID": 25,
            "StatusTypeID": 50,
            "LevelID": 2,
            "PowerKW": 22,
            "CurrentTypeID": 20
        },
        {
            "ID": 290896,
            "ConnectionTypeID": 25,
            "StatusTypeID": 50,
            "LevelID": 2,
            "PowerKW": 22,
            "CurrentTypeID": 20
        }
    ],
    "StatusTypeID": 50,
    "DateLastStatusUpdate": "2021-07-09T03:25:00Z",
    "MetadataValues": [
        {
            "ID": 15948,
            "MetadataFieldID": 4,
            "ItemValue": "Data from the German chargepoint registry provided by Bundesnetzagentur.de under the CC-BY 4.0 license"
        }
    ],
    "DataQualityLevel": 3,
    "DateCreated": "2021-07-08T10:04:00Z",
    "SubmissionStatusTypeID": 100
}