{
    "IsRecentlyVerified": false,
    "ID": 84830,
    "UUID": "85DC0F3D-9CB9-4856-803D-F51CB9A20C99",
    "DataProviderID": 1,
    "OperatorID": 45,
    "UsageTypeID": 6,
    "UsageCost": "1 kostenloser Parkplatz",
    "AddressInfo": {
        "ID": 85176,
        "Title": "Ferienwohnung Ottenwälder in Immenstaad",
        "AddressLine1": "Tobelweg 28",
        "Town": "Immenstaad",
        "StateOrProvince": "Baden-Württemberg",
        "Postcode": "88090",
        "CountryID": 87,
        "Latitude": 47.66734,
        "Longitude": 9.37608999999998,
        "ContactTelephone1": "+49 1522 2778195",
        "AccessComments": "Hubert Ottenwälder. Bodenseeufer 200 m Luftlinie entfernt (5 min zu Fuß).  Wandermöglichkeiten durch die Apfelbäume. Restaurants und Einkaufsmöglichkeiten alle zu Fuß erreichbar.",
        "DistanceUnit": 0
    },
    "Connections": [
        {
            "ID": 120515,
            "ConnectionTypeID": 28,
            "StatusTypeID": 50,
            "LevelID": 2,
            "Amps": 16,
            "Voltage": 230,
            "PowerKW": 3.7,
            "CurrentTypeID": 10,
            "Quantity": 1
        }
    ],
    "NumberOfPoints": 1,
    "GeneralComments": "Steckdose befindet sich in der Garage (verschlossen). ",
    "StatusTypeID": 50,
    "DateLastStatusUpdate": "2017-03-17T13:06:00Z",
    "DataQualityLevel": 1,
    "DateCreated": "2017-03-17T09:17:00Z",
    "SubmissionStatusTypeID": 200
}