{
    "IsRecentlyVerified": false,
    "ID": 74083,
    "UUID": "250C49BD-6046-4B24-88C7-2F478EC94EF9",
    "DataProviderID": 1,
    "OperatorID": 89,
    "OperatorsReference": "CEB-10183",
    "UsageTypeID": 4,
    "UsageCost": "CAD 1.00/hour",
    "AddressInfo": {
        "ID": 74429,
        "Title": "Chus-Hôpital Fleurimont",
        "AddressLine1": "3001 12e Avenue Nord",
        "Town": "Sherbrooke",
        "StateOrProvince": "QC",
        "Postcode": "J1H 5N4",
        "CountryID": 44,
        "Latitude": 45.4488296508789,
        "Longitude": -71.8681564331055,
        "DistanceUnit": 0
    },
    "Connections": [
        {
            "ID": 106407,
            "ConnectionTypeID": 1,
            "StatusTypeID": 50,
            "LevelID": 2,
            "Amps": 32,
            "Voltage": 230,
            "PowerKW": 7,
            "CurrentTypeID": 10,
            "Quantity": 1
        }
    ],
    "NumberOfPoints": 1,
    "StatusTypeID": 50,
    "DateLastStatusUpdate": "2017-12-10T06:53:00Z",
    "DataQualityLevel": 1,
    "DateCreated": "2016-11-24T00:13:00Z",
    "SubmissionStatusTypeID": 200
}