{
    "IsRecentlyVerified": false,
    "ID": 91170,
    "UUID": "790D768E-CA79-42F6-8029-AC8DD30C6B49",
    "DataProviderID": 1,
    "OperatorID": 45,
    "UsageTypeID": 1,
    "UsageCost": "Free",
    "AddressInfo": {
        "ID": 91516,
        "Title": "EV Charger Point ",
        "AddressLine1": "35D, Predslavynska, Kyiv, 03150, Ukraine",
        "Town": "Kyiv",
        "CountryID": 234,
        "Latitude": 50.42163,
        "Longitude": 30.523977,
        "ContactTelephone1": "+380442204575",
        "ContactEmail": "info@alfavito.com.ua",
        "AccessComments": "Ask for more information at ALFAVITO hotel reception",
        "RelatedURL": "http://alfavito.com.ua",
        "DistanceUnit": 0
    },
    "Connections": [
        {
            "ID": 129295,
            "ConnectionTypeID": 25,
            "StatusTypeID": 0,
            "CurrentTypeID": 20
        },
        {
            "ID": 129296,
            "ConnectionTypeID": 25,
            "StatusTypeID": 0
        }
    ],
    "NumberOfPoints": 2,
    "StatusTypeID": 50,
    "DateLastStatusUpdate": "2017-08-01T22:01:00Z",
    "DataQualityLevel": 1,
    "DateCreated": "2017-08-01T11:00:00Z",
    "SubmissionStatusTypeID": 200
}