{
    "IsRecentlyVerified": false,
    "ID": 144239,
    "UUID": "6A208C4C-DBFC-4F4D-83B4-1AD5B71329D1",
    "DataProviderID": 2,
    "DataProvidersReference": "130363",
    "OperatorID": 90,
    "UsageTypeID": 1,
    "AddressInfo": {
        "ID": 144591,
        "Title": "2385 du Parc Garneau",
        "AddressLine1": "2385 Rue du Parc Garneau",
        "Town": "Montréal",
        "StateOrProvince": "QC",
        "Postcode": "H4E 2C2",
        "CountryID": 44,
        "Latitude": 45.45598,
        "Longitude": -73.594697,
        "ContactTelephone1": "877-505-2674",
        "AccessComments": "24 hours daily",
        "RelatedURL": "https://lecircuitelectrique.com/",
        "DistanceUnit": 0
    },
    "Connections": [
        {
            "ID": 200728,
            "ConnectionTypeID": 1,
            "LevelID": 2,
            "Amps": 16,
            "Voltage": 230,
            "PowerKW": 3.7,
            "CurrentTypeID": 10,
            "Quantity": 2
        }
    ],
    "StatusTypeID": 50,
    "DateLastStatusUpdate": "2020-06-26T03:09:00Z",
    "DataQualityLevel": 3,
    "DateCreated": "2019-12-24T09:23:00Z",
    "SubmissionStatusTypeID": 100
}