{
    "IsRecentlyVerified": true,
    "DateLastVerified": "2021-10-07T20:15:00Z",
    "ID": 189515,
    "UUID": "31847067-A8B2-470E-B594-32B38EAE9B06",
    "DataProviderID": 1,
    "OperatorID": 2247,
    "UsageTypeID": 4,
    "UsageCost": "0,3€/kWh",
    "AddressInfo": {
        "ID": 189874,
        "Title": "Hotel Arrey Alella",
        "AddressLine1": "Carrer de Charles Rivel 6",
        "Town": "Alella",
        "StateOrProvince": "Catalonia",
        "Postcode": "08320",
        "CountryID": 210,
        "Latitude": 41.48859122357743,
        "Longitude": 2.2965209010545493,
        "DistanceUnit": 0
    },
    "Connections": [
        {
            "ID": 306550,
            "ConnectionTypeID": 33,
            "StatusTypeID": 50,
            "LevelID": 3,
            "Amps": 125,
            "Voltage": 499,
            "PowerKW": 50,
            "CurrentTypeID": 30,
            "Quantity": 1
        },
        {
            "ID": 306551,
            "ConnectionTypeID": 2,
            "StatusTypeID": 50,
            "LevelID": 3,
            "Amps": 125,
            "Voltage": 499,
            "PowerKW": 50,
            "CurrentTypeID": 30,
            "Quantity": 1
        },
        {
            "ID": 306552,
            "ConnectionTypeID": 1036,
            "StatusTypeID": 50,
            "LevelID": 3,
            "Amps": 63,
            "Voltage": 400,
            "PowerKW": 43,
            "CurrentTypeID": 20,
            "Quantity": 1
        }
    ],
    "NumberOfPoints": 1,
    "GeneralComments": "App. Movilidad Electrica",
    "StatusTypeID": 50,
    "DateLastStatusUpdate": "2021-10-09T21:18:00Z",
    "DataQualityLevel": 1,
    "DateCreated": "2021-10-07T20:15:00Z",
    "SubmissionStatusTypeID": 200
}