{
    "IsRecentlyVerified": false,
    "ID": 140937,
    "UUID": "DC1059AF-E7BA-48FC-9F12-D34D3B1ED661",
    "DataProviderID": 2,
    "DataProvidersReference": "61114",
    "OperatorID": 5,
    "UsageTypeID": 1,
    "AddressInfo": {
        "ID": 141289,
        "Title": "DUGONI",
        "AddressLine1": "155 5th Street",
        "Town": "San Francisco",
        "StateOrProvince": "CA",
        "Postcode": "94103",
        "CountryID": 2,
        "Latitude": 37.782329,
        "Longitude": -122.4049949,
        "ContactTelephone1": "888-758-4389",
        "AccessComments": "24 hours daily",
        "RelatedURL": "http://www.chargepoint.com/",
        "DistanceUnit": 0
    },
    "Connections": [
        {
            "ID": 196716,
            "ConnectionTypeID": 1,
            "LevelID": 2,
            "Amps": 16,
            "Voltage": 230,
            "PowerKW": 3,
            "CurrentTypeID": 10,
            "Quantity": 2
        }
    ],
    "StatusTypeID": 50,
    "DateLastStatusUpdate": "2019-12-24T09:14:00Z",
    "DataQualityLevel": 3,
    "DateCreated": "2019-12-24T09:14:00Z",
    "SubmissionStatusTypeID": 100
}