{
    "IsRecentlyVerified": false,
    "ID": 137758,
    "UUID": "8BA7E291-0307-4D74-A346-CCF98A4DC8FC",
    "DataProviderID": 2,
    "DataProvidersReference": "148807",
    "OperatorID": 39,
    "UsageTypeID": 1,
    "AddressInfo": {
        "ID": 138107,
        "Title": "Elan Midtown Apts",
        "AddressLine1": "441 Meeting Street",
        "Town": "Charleston",
        "StateOrProvince": "SC",
        "Postcode": "29403",
        "CountryID": 2,
        "Latitude": 32.7934539,
        "Longitude": -79.939577,
        "ContactTelephone1": "800-663-5633",
        "AccessComments": "MO: 12:00am-12:00am; TU: 12:00am-12:00am; WE: 12:00am-12:00am; TH: 12:00am-12:00am; FR: 12:00am-12:00am; SA: 12:00am-12:00am; SU: 12:00am-12:00am",
        "RelatedURL": "http://www.semacharge.com/",
        "DistanceUnit": 0
    },
    "Connections": [
        {
            "ID": 192748,
            "ConnectionTypeID": 1,
            "LevelID": 2,
            "Amps": 16,
            "Voltage": 230,
            "PowerKW": 3,
            "CurrentTypeID": 10,
            "Quantity": 1
        }
    ],
    "StatusTypeID": 50,
    "DateLastStatusUpdate": "2019-12-24T09:06:00Z",
    "DataQualityLevel": 3,
    "DateCreated": "2019-12-24T09:06:00Z",
    "SubmissionStatusTypeID": 100
}