{
    "UserComments": [
        {
            "ID": 19794,
            "ChargePointID": 77133,
            "CommentTypeID": 10,
            "UserName": "Erna_Schleck",
            "Comment": "Freischaltung nur mit eCharge App. Säule reagiert weder auf Tastendruck wie im Menü angezeigt noch auf Ladekarten, innogy Service-Hotline Sonntags nicht erreichbar!",
            "Rating": 2,
            "DateCreated": "2018-07-09T08:09:34.24Z",
            "User": {
                "ID": 4573,
                "Username": "Erna_Schleck"
            },
            "CheckinStatusTypeID": 10
        },
        {
            "ID": 15994,
            "ChargePointID": 77133,
            "CommentTypeID": 10,
            "UserName": "Haegar2004",
            "Comment": "",
            "Rating": 5,
            "DateCreated": "2017-03-04T15:12:14.457Z",
            "User": {
                "ID": 12201,
                "Username": "Haegar2004"
            },
            "CheckinStatusTypeID": 10
        }
    ],
    "MediaItems": [
        {
            "ID": 10578,
            "ChargePointID": 77133,
            "ItemURL": "https://s3-ap-southeast-2.amazonaws.com/openchargemap/images/DE/OCM77133/OCM-77133.orig.2017030415120220.jpg",
            "ItemThumbnailURL": "https://s3-ap-southeast-2.amazonaws.com/openchargemap/images/DE/OCM77133/OCM-77133.thmb.2017030415120220.jpg",
            "Comment": "",
            "IsEnabled": true,
            "IsVideo": false,
            "IsFeaturedItem": false,
            "IsExternalResource": false,
            "User": {
                "ID": 12201,
                "Username": "Haegar2004"
            },
            "DateCreated": "2017-03-04T15:12:00Z"
        }
    ],
    "IsRecentlyVerified": false,
    "ID": 77133,
    "UUID": "662642C4-D11E-486F-95DB-DFE32D3430BD",
    "DataProviderID": 1,
    "OperatorID": 105,
    "UsageTypeID": 4,
    "AddressInfo": {
        "ID": 77479,
        "Title": "Rasthof Rhynern Süd",
        "AddressLine1": "A2",
        "Town": "Hamm",
        "StateOrProvince": "Hamm",
        "Postcode": "59069",
        "CountryID": 87,
        "Latitude": 51.630314056176,
        "Longitude": 7.87333109382813,
        "AccessComments": "24/7 nutzbar. Zufahrt am Rasthaus rechts vorbei.",
        "RelatedURL": "http://tank.rast.de/emobility",
        "DistanceUnit": 0
    },
    "Connections": [
        {
            "ID": 110803,
            "ConnectionTypeID": 2,
            "StatusTypeID": 50,
            "LevelID": 3,
            "PowerKW": 50,
            "CurrentTypeID": 30,
            "Quantity": 1
        },
        {
            "ID": 110804,
            "ConnectionTypeID": 33,
            "StatusTypeID": 50,
            "LevelID": 3,
            "PowerKW": 50,
            "CurrentTypeID": 30,
            "Quantity": 1
        },
        {
            "ID": 110805,
            "ConnectionTypeID": 1036,
            "StatusTypeID": 50,
            "LevelID": 3,
            "Amps": 63,
            "Voltage": 400,
            "PowerKW": 43,
            "CurrentTypeID": 20,
            "Quantity": 1
        }
    ],
    "NumberOfPoints": 3,
    "StatusTypeID": 50,
    "DateLastStatusUpdate": "2018-07-09T08:10:00Z",
    "DataQualityLevel": 1,
    "DateCreated": "2017-01-03T07:25:00Z",
    "SubmissionStatusTypeID": 200
}