{
    "IsRecentlyVerified": false,
    "ID": 68724,
    "UUID": "3A477E9F-FFDF-4C58-94D4-D64571B3E507",
    "DataProviderID": 1,
    "OperatorID": 23,
    "OperatorsReference": "18520",
    "UsageTypeID": 6,
    "UsageCost": "Free",
    "AddressInfo": {
        "ID": 69070,
        "Title": "Seeport Hotel",
        "AddressLine1": "Via Rupi di Via XXIX Settembre, 12",
        "Town": "Ancona",
        "StateOrProvince": "AN",
        "Postcode": "60122 ",
        "CountryID": 112,
        "Latitude": 43.6160424802696,
        "Longitude": 13.5066854948309,
        "ContactTelephone1": "(+39) 0719715100",
        "ContactEmail": "info@seeporthotel.com",
        "RelatedURL": "http://www.seeporthotel.com/",
        "DistanceUnit": 0
    },
    "Connections": [
        {
            "ID": 96383,
            "ConnectionTypeID": 30,
            "StatusTypeID": 50,
            "LevelID": 2,
            "Amps": 32,
            "Voltage": 400,
            "PowerKW": 22,
            "CurrentTypeID": 20,
            "Quantity": 2
        }
    ],
    "NumberOfPoints": 2,
    "GeneralComments": "Tesla Destination Charging",
    "StatusTypeID": 50,
    "DateLastStatusUpdate": "2018-10-04T06:17:00Z",
    "DataQualityLevel": 1,
    "DateCreated": "2016-06-19T15:23:00Z",
    "SubmissionStatusTypeID": 200
}