{
    "IsRecentlyVerified": false,
    "ID": 123532,
    "UUID": "695CD274-F03D-499C-BF6C-9017C8D92EE4",
    "DataProviderID": 2,
    "DataProvidersReference": "67793",
    "OperatorID": 5,
    "UsageTypeID": 1,
    "AddressInfo": {
        "ID": 123878,
        "Title": "BRANSON",
        "AddressLine1": "300 Tanger Blvd",
        "Town": "Branson",
        "StateOrProvince": "MO",
        "Postcode": "65616",
        "CountryID": 2,
        "Latitude": 36.645859,
        "Longitude": -93.264442,
        "ContactTelephone1": "888-758-4389",
        "AccessComments": "24 hours daily",
        "RelatedURL": "http://www.chargepoint.com/",
        "DistanceUnit": 0
    },
    "Connections": [
        {
            "ID": 173528,
            "ConnectionTypeID": 1,
            "LevelID": 2,
            "Amps": 16,
            "Voltage": 230,
            "PowerKW": 3.7,
            "CurrentTypeID": 10,
            "Quantity": 4
        }
    ],
    "DateLastStatusUpdate": "2020-06-26T02:58:00Z",
    "DataQualityLevel": 3,
    "DateCreated": "2019-04-06T05:03:00Z",
    "SubmissionStatusTypeID": 100
}