{
    "UserComments": [
        {
            "ID": 19267,
            "ChargePointID": 96851,
            "CommentTypeID": 50,
            "UserName": "amesporting",
            "Comment": "Working pre-Xmas but now not working with any card- use to work with polar",
            "DateCreated": "2018-03-06T17:55:52.92Z",
            "User": {
                "ID": 13319,
                "Username": "amesporting"
            },
            "CheckinStatusTypeID": 40
        }
    ],
    "IsRecentlyVerified": false,
    "ID": 96851,
    "UUID": "110598A0-BBC1-4F9B-94CA-7E44E2F98131",
    "DataProviderID": 1,
    "OperatorID": 3357,
    "UsageTypeID": 6,
    "AddressInfo": {
        "ID": 97197,
        "Title": "Ruislip Gardens Underground Station - Taxi Charger",
        "AddressLine1": "West End Road",
        "AddressLine2": "Yeading",
        "Town": "London",
        "StateOrProvince": "England",
        "Postcode": "HA4 6NW",
        "CountryID": 1,
        "Latitude": 51.5605817008954,
        "Longitude": -0.410973030349742,
        "DistanceUnit": 0
    },
    "Connections": [
        {
            "ID": 137176,
            "ConnectionTypeID": 2,
            "StatusTypeID": 50,
            "LevelID": 3,
            "Amps": 125,
            "Voltage": 500,
            "PowerKW": 50,
            "CurrentTypeID": 30,
            "Quantity": 1
        },
        {
            "ID": 137177,
            "ConnectionTypeID": 33,
            "StatusTypeID": 50,
            "LevelID": 3,
            "Amps": 125,
            "Voltage": 500,
            "PowerKW": 50,
            "CurrentTypeID": 30,
            "Quantity": 1
        }
    ],
    "NumberOfPoints": 1,
    "StatusTypeID": 50,
    "DateLastStatusUpdate": "2019-06-03T08:07:00Z",
    "DataQualityLevel": 1,
    "DateCreated": "2018-01-01T21:05:00Z",
    "SubmissionStatusTypeID": 200
}