{
    "IsRecentlyVerified": false,
    "ID": 168634,
    "UUID": "B5F4FFC8-6113-4045-9205-AFAB0C9D9E72",
    "DataProviderID": 1,
    "OperatorID": 32,
    "UsageTypeID": 5,
    "UsageCost": "Polar Plus 15p/kWh Polar Instant 25p/kWh Contactless 30p/kWh",
    "AddressInfo": {
        "ID": 168993,
        "Title": "Toby Carvery Morley",
        "AddressLine1": "Bruntcliffe Rd",
        "AddressLine2": "Leeds",
        "Town": "Morley",
        "StateOrProvince": "England",
        "Postcode": "LS27 0LY",
        "CountryID": 1,
        "Latitude": 53.74500125131132,
        "Longitude": -1.6235112045505957,
        "ContactTelephone1": "0330 016 5126",
        "RelatedURL": "http://www.polar-network.com",
        "DistanceUnit": 0
    },
    "Connections": [
        {
            "ID": 256185,
            "ConnectionTypeID": 33,
            "StatusTypeID": 50,
            "LevelID": 3,
            "PowerKW": 50,
            "CurrentTypeID": 30,
            "Quantity": 1
        },
        {
            "ID": 256186,
            "ConnectionTypeID": 2,
            "StatusTypeID": 50,
            "LevelID": 3,
            "PowerKW": 50,
            "CurrentTypeID": 30,
            "Quantity": 1
        },
        {
            "ID": 256187,
            "ConnectionTypeID": 1036,
            "StatusTypeID": 50,
            "LevelID": 3,
            "PowerKW": 43,
            "CurrentTypeID": 20,
            "Quantity": 1
        }
    ],
    "NumberOfPoints": 1,
    "GeneralComments": "Please Note: £10 per hour overstay fee applies to this site after 90 minutes",
    "StatusTypeID": 50,
    "DateLastStatusUpdate": "2020-10-03T02:55:00Z",
    "DataQualityLevel": 1,
    "DateCreated": "2020-10-03T02:55:00Z",
    "SubmissionStatusTypeID": 200
}