{
    "IsRecentlyVerified": false,
    "ID": 77154,
    "UUID": "1DC1E3BB-6FD7-40DF-A7C0-C0E6D2F4D789",
    "DataProviderID": 1,
    "OperatorID": 44,
    "UsageTypeID": 1,
    "UsageCost": "Free",
    "AddressInfo": {
        "ID": 77500,
        "Title": "Möhlin Hofacker ",
        "AddressLine1": "Hofackerstrasse 19",
        "Town": "Moehlin ",
        "StateOrProvince": "Aargau ",
        "Postcode": "CH-4313 ",
        "CountryID": 217,
        "Latitude": 47.5514741,
        "Longitude": 7.8486158,
        "ContactTelephone1": "+41618514650",
        "ContactEmail": "ev@camenisch.cc",
        "AccessComments": "Familie Camenisch ",
        "DistanceUnit": 0
    },
    "Connections": [
        {
            "ID": 110848,
            "ConnectionTypeID": 29,
            "StatusTypeID": 50,
            "LevelID": 2,
            "Amps": 16,
            "Voltage": 230,
            "PowerKW": 3.7,
            "CurrentTypeID": 10,
            "Quantity": 1
        },
        {
            "ID": 110849,
            "ConnectionTypeID": 25,
            "StatusTypeID": 50,
            "LevelID": 2,
            "Amps": 16,
            "Voltage": 230,
            "PowerKW": 3.7,
            "CurrentTypeID": 10,
            "Quantity": 1
        },
        {
            "ID": 110850,
            "ConnectionTypeID": 16,
            "StatusTypeID": 50,
            "LevelID": 2,
            "Amps": 16,
            "Voltage": 230,
            "PowerKW": 3.7,
            "CurrentTypeID": 10,
            "Quantity": 1
        },
        {
            "ID": 110851,
            "ConnectionTypeID": 17,
            "StatusTypeID": 50,
            "LevelID": 2,
            "Amps": 16,
            "Voltage": 400,
            "PowerKW": 11,
            "CurrentTypeID": 20,
            "Quantity": 1
        }
    ],
    "NumberOfPoints": 1,
    "StatusTypeID": 50,
    "DateLastStatusUpdate": "2017-01-05T06:54:00Z",
    "DataQualityLevel": 1,
    "DateCreated": "2017-01-04T08:30:00Z",
    "SubmissionStatusTypeID": 200
}