{
    "IsRecentlyVerified": false,
    "ID": 23713,
    "UUID": "8B75B3EA-3D26-4304-A5E0-C54BC1656FBA",
    "DataProviderID": 1,
    "OperatorID": 76,
    "UsageTypeID": 1,
    "UsageCost": "5€/up to 60 min",
    "AddressInfo": {
        "ID": 24058,
        "Title": "Seidla ",
        "AddressLine1": "Seidla — Kaalepi road",
        "Town": "Albu vald",
        "StateOrProvince": "Järva maakond",
        "CountryID": 74,
        "Latitude": 59.095892319826405,
        "Longitude": 25.690830281536837,
        "ContactTelephone1": "+372 6511911",
        "ContactEmail": "tugi@elmo.ee",
        "AccessComments": "Next to Seidla old windmill.",
        "RelatedURL": "http://www.elmo.ee",
        "DistanceUnit": 0
    },
    "Connections": [
        {
            "ID": 25668,
            "ConnectionTypeID": 2,
            "StatusTypeID": 50,
            "LevelID": 3,
            "Amps": 120,
            "Voltage": 500,
            "PowerKW": 50,
            "CurrentTypeID": 30,
            "Quantity": 1
        },
        {
            "ID": 25669,
            "ConnectionTypeID": 25,
            "StatusTypeID": 50,
            "LevelID": 2,
            "Amps": 32,
            "Voltage": 400,
            "PowerKW": 22,
            "CurrentTypeID": 20,
            "Quantity": 1
        }
    ],
    "NumberOfPoints": 1,
    "GeneralComments": "Opened 24h (automatic). \r\nReal-time condition information (operational/not operational/free) - www.elmo.ee \r\nCan pay with client card, SMS or mobile application. \r\nCharger number 51080",
    "StatusTypeID": 50,
    "DateLastStatusUpdate": "2014-05-28T12:09:00Z",
    "DataQualityLevel": 1,
    "DateCreated": "2014-05-28T12:09:00Z",
    "SubmissionStatusTypeID": 200
}