{
    "IsRecentlyVerified": false,
    "ID": 34113,
    "UUID": "DB81DD78-6BBD-405E-8BF7-A5B87380A45A",
    "DataProviderID": 26,
    "DataProvidersReference": "52514",
    "OperatorsReference": "Dokter H. de Vriesplein",
    "UsageCost": "0.00 gratis",
    "AddressInfo": {
        "ID": 34459,
        "Title": "Dokter H. de Vriesplein 76",
        "AddressLine1": "Dokter H. de Vriesplein 76",
        "Town": "Giessenlanden",
        "Postcode": "4241 BW",
        "CountryID": 159,
        "Latitude": 51.863785225395,
        "Longitude": 4.9930822849274,
        "RelatedURL": "http://www.giessenlanden.nl",
        "DistanceUnit": 0
    },
    "Connections": [
        {
            "ID": 37624,
            "ConnectionTypeID": 25,
            "LevelID": 2,
            "PowerKW": 3.7,
            "CurrentTypeID": 10
        }
    ],
    "NumberOfPoints": 2,
    "StatusTypeID": 50,
    "DateLastStatusUpdate": "2016-06-04T02:41:00Z",
    "DataQualityLevel": 3,
    "DateCreated": "2015-01-09T06:04:00Z",
    "SubmissionStatusTypeID": 100
}