{
    "UserComments": [
        {
            "ID": 10489,
            "ChargePointID": 31385,
            "CommentTypeID": 10,
            "UserName": "Bss57",
            "Comment": "A great facility just plug in",
            "Rating": 5,
            "DateCreated": "2016-05-25T11:48:10.41Z",
            "User": {
                "ID": 6295,
                "Username": "Bss57"
            },
            "CheckinStatusTypeID": 10
        },
        {
            "ID": 8464,
            "ChargePointID": 31385,
            "CommentTypeID": 10,
            "UserName": "Bss57",
            "Comment": "Nice new facility works well",
            "DateCreated": "2016-01-08T10:50:46.387Z",
            "User": {
                "ID": 6295,
                "Username": "Bss57"
            },
            "CheckinStatusTypeID": 10
        }
    ],
    "MediaItems": [
        {
            "ID": 4746,
            "ChargePointID": 31385,
            "ItemURL": "https://s3-ap-southeast-2.amazonaws.com/openchargemap/images/GB/OCM31385/OCM-31385.orig.2016010810515299.jpg",
            "ItemThumbnailURL": "https://s3-ap-southeast-2.amazonaws.com/openchargemap/images/GB/OCM31385/OCM-31385.thmb.2016010810515299.jpg",
            "Comment": "Situated at the left end of the building",
            "IsEnabled": true,
            "IsVideo": false,
            "IsFeaturedItem": false,
            "IsExternalResource": false,
            "User": {
                "ID": 6295,
                "Username": "Bss57"
            },
            "DateCreated": "2016-01-08T10:52:00Z"
        }
    ],
    "IsRecentlyVerified": false,
    "ID": 31385,
    "UUID": "C00296B1-436A-48ED-A315-976D429E3EA4",
    "DataProviderID": 1,
    "OperatorID": 3,
    "OperatorsReference": "PG-80122,PG-80129,PG-80130",
    "UsageTypeID": 4,
    "UsageCost": "Free. Parking fees apply.",
    "AddressInfo": {
        "ID": 31731,
        "Title": "Bishop Centre",
        "AddressLine1": "Bath Road",
        "AddressLine2": "Taplow",
        "Town": "Maidenhead",
        "StateOrProvince": "Buckinghamshire",
        "Postcode": "SL6 0NX",
        "CountryID": 1,
        "Latitude": 51.5227487149889,
        "Longitude": -0.678304009096562,
        "AccessComments": "At left hand end of buildings, near Costa/wine merchants",
        "DistanceUnit": 0
    },
    "Connections": [
        {
            "ID": 34887,
            "ConnectionTypeID": 25,
            "StatusTypeID": 50,
            "LevelID": 2,
            "Amps": 32,
            "Voltage": 230,
            "PowerKW": 7,
            "CurrentTypeID": 10,
            "Quantity": 6
        }
    ],
    "NumberOfPoints": 6,
    "GeneralComments": "3 Pod-Point T7-S charge points. Open charge. No RFID needed.",
    "StatusTypeID": 50,
    "DateLastStatusUpdate": "2019-05-13T13:01:00Z",
    "DataQualityLevel": 1,
    "DateCreated": "2015-01-06T22:39:00Z",
    "SubmissionStatusTypeID": 200
}