{
    "UserComments": [
        {
            "ID": 23076,
            "ChargePointID": 162241,
            "CommentTypeID": 1000,
            "UserName": "Marco",
            "Comment": "La stazione é bellissima, immacolata. Peccato che sia completamente morta: schermo nero, impossibile da attivare. The station is nice, immaculate and as good as dead. Black screen, impossible to charge. ",
            "Rating": 1,
            "DateCreated": "2020-08-14T18:34:22.01Z",
            "User": {
                "ID": 27030,
                "Username": "Marco"
            },
            "CheckinStatusTypeID": 120,
            "IsActionedByEditor": false
        }
    ],
    "IsRecentlyVerified": false,
    "ID": 162241,
    "UUID": "AA7B6966-733D-4307-9744-37AEEE9115BE",
    "DataProviderID": 1,
    "OperatorID": 45,
    "UsageTypeID": 1,
    "UsageCost": "0,35",
    "AddressInfo": {
        "ID": 162598,
        "Title": "Stazione di Servizio CAMER Petroleum Europa",
        "AddressLine1": "Via Provinciale Gallipoli",
        "AddressLine2": "Rischiazzi",
        "Town": "Parabita",
        "StateOrProvince": "Lecce",
        "Postcode": "73052",
        "CountryID": 112,
        "Latitude": 40.05650487955893,
        "Longitude": 18.081237129669717,
        "RelatedURL": "https://www.camerpetroleum.it/mobilita-elettrica/",
        "DistanceUnit": 0
    },
    "Connections": [
        {
            "ID": 233494,
            "ConnectionTypeID": 32,
            "StatusTypeID": 0,
            "LevelID": 3,
            "CurrentTypeID": 30,
            "Quantity": 1
        },
        {
            "ID": 233495,
            "ConnectionTypeID": 2,
            "StatusTypeID": 0,
            "LevelID": 3,
            "CurrentTypeID": 30,
            "Quantity": 1
        },
        {
            "ID": 233496,
            "ConnectionTypeID": 1036,
            "StatusTypeID": 0,
            "LevelID": 3,
            "CurrentTypeID": 20,
            "Quantity": 1
        }
    ],
    "NumberOfPoints": 1,
    "StatusTypeID": 50,
    "DateLastStatusUpdate": "2020-08-14T18:34:00Z",
    "DataQualityLevel": 1,
    "DateCreated": "2020-08-03T11:06:00Z",
    "SubmissionStatusTypeID": 200
}