{
    "IsRecentlyVerified": false,
    "ID": 75806,
    "UUID": "A963B2B4-5F88-434C-A887-A3D0C60C82E8",
    "DataProviderID": 2,
    "DataProvidersReference": "80095",
    "UsageTypeID": 1,
    "AddressInfo": {
        "ID": 76152,
        "Title": "Central Arkansas Main Library - Parking Deck",
        "AddressLine1": "100 Rock St",
        "Town": "Little Rock",
        "StateOrProvince": "AR",
        "Postcode": "72201",
        "CountryID": 2,
        "Latitude": 34.746977,
        "Longitude": -92.267343,
        "ContactTelephone1": "501-918-3000",
        "AccessComments": "9am-8pm M-Th, 9am-6pm F-Sat, 1pm-5pm Sun; pay lot",
        "RelatedURL": "",
        "DistanceUnit": 0
    },
    "Connections": [
        {
            "ID": 109312,
            "ConnectionTypeID": 1,
            "LevelID": 2,
            "Amps": 16,
            "Voltage": 230,
            "PowerKW": 3,
            "CurrentTypeID": 10,
            "Quantity": 1
        }
    ],
    "DateLastStatusUpdate": "2019-04-06T04:02:00Z",
    "DataQualityLevel": 3,
    "DateCreated": "2016-12-23T01:25:00Z",
    "SubmissionStatusTypeID": 100
}