{
    "UserComments": [
        {
            "ID": 14598,
            "ChargePointID": 74204,
            "CommentTypeID": 10,
            "UserName": "Bert van Sas",
            "Comment": "Owner / provider is AgriSnelTank, part of a large dutch farmers cooperation, CZAV.  They have just started to roll out a large number of charging points, mainly in the south of the Netherlands, including fastchargers.",
            "Rating": 5,
            "RelatedURL": "http://www.czav.nl",
            "DateCreated": "2016-11-25T18:19:56.297Z",
            "User": {
                "ID": 11617,
                "Username": "Bert van Sas"
            },
            "CheckinStatusTypeID": 140
        }
    ],
    "MediaItems": [
        {
            "ID": 8652,
            "ChargePointID": 74204,
            "ItemURL": "https://s3-ap-southeast-2.amazonaws.com/openchargemap/images/NL/OCM74204/OCM-74204.orig.2016112518172088.jpg",
            "ItemThumbnailURL": "https://s3-ap-southeast-2.amazonaws.com/openchargemap/images/NL/OCM74204/OCM-74204.thmb.2016112518172088.jpg",
            "Comment": "",
            "IsEnabled": true,
            "IsVideo": false,
            "IsFeaturedItem": false,
            "IsExternalResource": false,
            "User": {
                "ID": 11617,
                "Username": "Bert van Sas"
            },
            "DateCreated": "2016-11-25T18:18:00Z"
        },
        {
            "ID": 8649,
            "ChargePointID": 74204,
            "ItemURL": "https://s3-ap-southeast-2.amazonaws.com/openchargemap/images/NL/OCM74204/OCM-74204.orig.2016112518161850.jpg",
            "ItemThumbnailURL": "https://s3-ap-southeast-2.amazonaws.com/openchargemap/images/NL/OCM74204/OCM-74204.thmb.2016112518161850.jpg",
            "Comment": "4 Mennekes, 22kW, charging points accessible to all.",
            "IsEnabled": true,
            "IsVideo": false,
            "IsFeaturedItem": false,
            "IsExternalResource": false,
            "User": {
                "ID": 11617,
                "Username": "Bert van Sas"
            },
            "DateCreated": "2016-11-25T18:17:00Z"
        },
        {
            "ID": 8650,
            "ChargePointID": 74204,
            "ItemURL": "https://s3-ap-southeast-2.amazonaws.com/openchargemap/images/NL/OCM74204/OCM-74204.orig.2016112518165361.jpg",
            "ItemThumbnailURL": "https://s3-ap-southeast-2.amazonaws.com/openchargemap/images/NL/OCM74204/OCM-74204.thmb.2016112518165361.jpg",
            "Comment": "Owner / provider is AgriSnelTank, part of a large dutch farmers cooperation.",
            "IsEnabled": true,
            "IsVideo": false,
            "IsFeaturedItem": false,
            "IsExternalResource": false,
            "User": {
                "ID": 11617,
                "Username": "Bert van Sas"
            },
            "DateCreated": "2016-11-25T18:17:00Z"
        },
        {
            "ID": 8651,
            "ChargePointID": 74204,
            "ItemURL": "https://s3-ap-southeast-2.amazonaws.com/openchargemap/images/NL/OCM74204/OCM-74204.orig.2016112518170808.jpg",
            "ItemThumbnailURL": "https://s3-ap-southeast-2.amazonaws.com/openchargemap/images/NL/OCM74204/OCM-74204.thmb.2016112518170808.jpg",
            "Comment": "",
            "IsEnabled": true,
            "IsVideo": false,
            "IsFeaturedItem": false,
            "IsExternalResource": false,
            "User": {
                "ID": 11617,
                "Username": "Bert van Sas"
            },
            "DateCreated": "2016-11-25T18:17:00Z"
        }
    ],
    "IsRecentlyVerified": false,
    "ID": 74204,
    "UUID": "03993237-E649-4A49-99F2-4DD212C492F3",
    "DataProviderID": 1,
    "OperatorID": 179,
    "UsageTypeID": 1,
    "UsageCost": "0.25 / kWh",
    "AddressInfo": {
        "ID": 74550,
        "Title": "CZAV Wemeldinge",
        "AddressLine1": "Oostelijke Kanaalweg 5",
        "Town": "Wemeldinge",
        "StateOrProvince": "Zeeland",
        "Postcode": "4424 NC",
        "CountryID": 159,
        "Latitude": 51.50949275917492,
        "Longitude": 4.005841500663809,
        "ContactTelephone1": "0031113629213",
        "ContactEmail": "r.augustijn@czav.nl",
        "AccessComments": "Carpark, freely accessible to all, in Wemeldinge at the specified address.",
        "RelatedURL": "http://www.czav.nl",
        "DistanceUnit": 0
    },
    "Connections": [
        {
            "ID": 106557,
            "ConnectionTypeID": 25,
            "StatusTypeID": 50,
            "LevelID": 2,
            "PowerKW": 22,
            "CurrentTypeID": 20,
            "Quantity": 4
        }
    ],
    "NumberOfPoints": 4,
    "StatusTypeID": 50,
    "DateLastStatusUpdate": "2016-11-25T18:20:00Z",
    "DataQualityLevel": 1,
    "DateCreated": "2016-11-25T18:15:00Z",
    "SubmissionStatusTypeID": 200
}