{
    "IsRecentlyVerified": false,
    "ID": 101706,
    "UUID": "3B0F8F9E-FD07-4AE7-90F6-9C28CDCA91FF",
    "DataProviderID": 1,
    "OperatorID": 45,
    "UsageTypeID": 1,
    "UsageCost": "Free",
    "AddressInfo": {
        "ID": 102052,
        "Title": "Parkplatz Stadtwerke",
        "AddressLine1": "Alleestraße 6",
        "Town": "Uslar",
        "StateOrProvince": "Landkreis Northeim",
        "Postcode": "37170",
        "CountryID": 87,
        "Latitude": 51.657141426965566,
        "Longitude": 9.63316359318469,
        "ContactTelephone1": "+49 5571 92590",
        "AccessComments": "Auf der Rückseite des Stadtwerke Gebäudes ist ein reservierter Parkplatz rechts vom blaugrünen Plakat der Stadtwerke Uslar. Laden und Parken kostenlos",
        "RelatedURL": "http://www.stadtwerke-uslar.de/",
        "DistanceUnit": 0
    },
    "Connections": [
        {
            "ID": 143568,
            "ConnectionTypeID": 25,
            "StatusTypeID": 50,
            "LevelID": 2,
            "Amps": 32,
            "Voltage": 400,
            "PowerKW": 22,
            "CurrentTypeID": 20,
            "Quantity": 1
        }
    ],
    "NumberOfPoints": 1,
    "StatusTypeID": 50,
    "DateLastStatusUpdate": "2018-04-05T06:49:00Z",
    "DataQualityLevel": 1,
    "DateCreated": "2018-04-05T06:49:00Z",
    "SubmissionStatusTypeID": 200
}