{
    "IsRecentlyVerified": false,
    "ID": 119650,
    "UUID": "B938B97F-491D-44E3-9854-9823405EE170",
    "DataProviderID": 2,
    "DataProvidersReference": "117836",
    "OperatorID": 5,
    "UsageTypeID": 1,
    "AddressInfo": {
        "ID": 119996,
        "Title": "VENETIAN",
        "AddressLine1": "4151 Winkler Ave 3745 Pizza Drive",
        "Town": "Fort Myers",
        "StateOrProvince": "FL",
        "Postcode": "33916",
        "CountryID": 2,
        "Latitude": 26.6111587,
        "Longitude": -81.8291887,
        "ContactTelephone1": "888-758-4389",
        "AccessComments": "24 hours daily",
        "RelatedURL": "http://www.chargepoint.com/",
        "DistanceUnit": 0
    },
    "Connections": [
        {
            "ID": 168930,
            "ConnectionTypeID": 1,
            "LevelID": 2,
            "Amps": 16,
            "Voltage": 230,
            "PowerKW": 3.7,
            "CurrentTypeID": 10,
            "Quantity": 2
        }
    ],
    "DateLastStatusUpdate": "2020-06-26T02:52:00Z",
    "DataQualityLevel": 3,
    "DateCreated": "2019-04-01T04:59:00Z",
    "SubmissionStatusTypeID": 100
}