{
    "IsRecentlyVerified": false,
    "ID": 29827,
    "UUID": "F6B51992-84B0-479F-9146-9F9F728B8DD1",
    "DataProviderID": 15,
    "DataProvidersReference": "36421",
    "OperatorID": 42,
    "UsageTypeID": 1,
    "AddressInfo": {
        "ID": 30173,
        "Title": "8457 Springboro Pike",
        "AddressLine1": "8457 Springboro Pike",
        "Town": "Miamisburg",
        "StateOrProvince": "OH",
        "Postcode": "45342",
        "CountryID": 2,
        "Latitude": 39.62702,
        "Longitude": -84.22667,
        "ContactTelephone1": "937-433-4950",
        "RelatedURL": "http://carstations.com/36421",
        "DistanceUnit": 0
    },
    "Connections": [
        {
            "ID": 32812,
            "ConnectionTypeID": 1,
            "Reference": "J1772",
            "LevelID": 2
        }
    ],
    "NumberOfPoints": 1,
    "StatusTypeID": 50,
    "DateLastStatusUpdate": "2017-11-04T14:04:00Z",
    "DataQualityLevel": 2,
    "DateCreated": "2014-11-29T05:39:00Z",
    "SubmissionStatusTypeID": 100
}