{
    "IsRecentlyVerified": false,
    "ID": 184248,
    "UUID": "EF60EAA2-F606-46C8-860F-5052E402AB60",
    "DataProviderID": 29,
    "DataProvidersReference": "1486",
    "OperatorID": 69,
    "AddressInfo": {
        "ID": 184607,
        "Title": "Bert-Brecht-Str. 1",
        "AddressLine1": "Bert-Brecht-Str. 1",
        "Town": "Aschaffenburg",
        "Postcode": "63741",
        "CountryID": 87,
        "Latitude": 49.981697,
        "Longitude": 9.145188,
        "DistanceUnit": 0
    },
    "Connections": [
        {
            "ID": 292265,
            "ConnectionTypeID": 25,
            "StatusTypeID": 50,
            "LevelID": 2,
            "PowerKW": 11,
            "CurrentTypeID": 20
        },
        {
            "ID": 292266,
            "ConnectionTypeID": 25,
            "StatusTypeID": 50,
            "LevelID": 2,
            "PowerKW": 11,
            "CurrentTypeID": 20
        },
        {
            "ID": 292267,
            "ConnectionTypeID": 1036,
            "StatusTypeID": 50,
            "LevelID": 3,
            "PowerKW": 43,
            "CurrentTypeID": 20
        }
    ],
    "StatusTypeID": 50,
    "DateLastStatusUpdate": "2021-07-12T02:44:00Z",
    "MetadataValues": [
        {
            "ID": 16539,
            "MetadataFieldID": 4,
            "ItemValue": "Data from the German chargepoint registry provided by Bundesnetzagentur.de under the CC-BY 4.0 license"
        }
    ],
    "DataQualityLevel": 3,
    "DateCreated": "2021-07-08T10:05:00Z",
    "SubmissionStatusTypeID": 100
}