{
    "IsRecentlyVerified": false,
    "ID": 88950,
    "UUID": "C1114145-E5E5-4BD2-BED1-4E24267532F4",
    "DataProviderID": 1,
    "OperatorID": 3,
    "OperatorsReference": "PG-80955",
    "UsageTypeID": 6,
    "UsageCost": "Free",
    "AddressInfo": {
        "ID": 89296,
        "Title": "Teknek LTD",
        "AddressLine1": "River Drive",
        "Town": "Renfrewshire",
        "Postcode": "PA4 9RT",
        "CountryID": 1,
        "Latitude": 55.880898,
        "Longitude": -4.439844,
        "DistanceUnit": 0
    },
    "Connections": [
        {
            "ID": 126233,
            "ConnectionTypeID": 25,
            "StatusTypeID": 50,
            "LevelID": 2,
            "Amps": 32,
            "Voltage": 230,
            "PowerKW": 7,
            "CurrentTypeID": 10,
            "Quantity": 2
        }
    ],
    "NumberOfPoints": 4,
    "GeneralComments": "This is an open charge unit installed at the Teknek Ltd site in River Drive, Inchinnan Business Park, Renfrewshire",
    "StatusTypeID": 50,
    "DateLastStatusUpdate": "2017-12-22T12:35:00Z",
    "DataQualityLevel": 1,
    "DateCreated": "2017-06-13T11:22:00Z",
    "SubmissionStatusTypeID": 200
}