{
    "MediaItems": [
        {
            "ID": 12209,
            "ChargePointID": 87931,
            "ItemURL": "https://s3-ap-southeast-2.amazonaws.com/openchargemap/images/NZ/OCM87931/OCM-87931.orig.2017051808072444.jpg",
            "ItemThumbnailURL": "https://s3-ap-southeast-2.amazonaws.com/openchargemap/images/NZ/OCM87931/OCM-87931.thmb.2017051808072444.jpg",
            "Comment": "",
            "IsEnabled": true,
            "IsVideo": false,
            "IsFeaturedItem": false,
            "IsExternalResource": false,
            "User": {
                "ID": 15365,
                "Username": "sliday"
            },
            "DateCreated": "2017-05-18T08:08:00Z"
        },
        {
            "ID": 12208,
            "ChargePointID": 87931,
            "ItemURL": "https://s3-ap-southeast-2.amazonaws.com/openchargemap/images/NZ/OCM87931/OCM-87931.orig.2017051808071252.jpg",
            "ItemThumbnailURL": "https://s3-ap-southeast-2.amazonaws.com/openchargemap/images/NZ/OCM87931/OCM-87931.thmb.2017051808071252.jpg",
            "Comment": "",
            "IsEnabled": true,
            "IsVideo": false,
            "IsFeaturedItem": false,
            "IsExternalResource": false,
            "User": {
                "ID": 15365,
                "Username": "sliday"
            },
            "DateCreated": "2017-05-18T08:07:00Z"
        }
    ],
    "IsRecentlyVerified": false,
    "ID": 87931,
    "UUID": "4FCBE3E2-C16B-4EC8-9B3C-4A0148FA4E2F",
    "DataProviderID": 1,
    "UsageCost": "$2",
    "AddressInfo": {
        "ID": 88277,
        "Title": "Eketahuna Motor Camp",
        "AddressLine1": "Stout St",
        "Town": "Eketahuna ",
        "Postcode": "4900",
        "CountryID": 161,
        "Latitude": -40.65167069744136,
        "Longitude": 175.70247322074977,
        "ContactTelephone1": "063758677",
        "DistanceUnit": 0
    },
    "Connections": [
        {
            "ID": 124742,
            "ConnectionTypeID": 4,
            "Amps": 16
        }
    ],
    "NumberOfPoints": 1,
    "GeneralComments": "Daytime: Pay cost of power (e.g. $2 for your stay). Overnight: Included if you pay as overnight guest.\r\nSixteen powered sites with 16A blue commando sockets. Large green area with riverside bush walk while you recharge. As a courtesy please ring ahead of time. Photos and info at http://www.eketahunacamp.com/",
    "StatusTypeID": 50,
    "DateLastStatusUpdate": "2017-05-18T08:08:00Z",
    "DataQualityLevel": 1,
    "DateCreated": "2017-05-18T08:07:00Z",
    "SubmissionStatusTypeID": 200
}