{
    "IsRecentlyVerified": false,
    "ID": 130279,
    "UUID": "248280BA-D7A6-49CB-80B4-4A66EB7590B9",
    "DataProviderID": 1,
    "OperatorID": 88,
    "UsageTypeID": 6,
    "AddressInfo": {
        "ID": 130625,
        "Title": "Greenway Polska Galeria Krakowska",
        "AddressLine1": "Pawia 5",
        "Town": "Kraków",
        "Postcode": "31-154",
        "CountryID": 179,
        "Latitude": 50.0675859,
        "Longitude": 19.9461405848802,
        "ContactTelephone1": "+48 58 325 10 77",
        "RelatedURL": "https://greenwaypolska.pl/",
        "DistanceUnit": 0
    },
    "Connections": [
        {
            "ID": 182360,
            "ConnectionTypeID": 1036,
            "StatusTypeID": 50,
            "LevelID": 2,
            "PowerKW": 22,
            "CurrentTypeID": 20
        }
    ],
    "NumberOfPoints": 1,
    "StatusTypeID": 50,
    "DateLastStatusUpdate": "2019-08-12T18:04:00Z",
    "DataQualityLevel": 1,
    "DateCreated": "2019-08-02T10:51:00Z",
    "SubmissionStatusTypeID": 200
}