{
    "IsRecentlyVerified": false,
    "ID": 172269,
    "UUID": "9431F925-8B10-4A94-9050-52B5F4C46407",
    "DataProviderID": 1,
    "OperatorID": 21,
    "UsageTypeID": 4,
    "UsageCost": "Mobi.E compatible card",
    "AddressInfo": {
        "ID": 172628,
        "Title": "ELV-00004 - Lidl",
        "AddressLine1": "Rossio do Meio",
        "Town": "Elvas",
        "StateOrProvince": "Évora",
        "Postcode": "3750-048",
        "CountryID": 180,
        "Latitude": 38.87529988722247,
        "Longitude": -7.158999479888507,
        "AccessComments": "Lidl",
        "DistanceUnit": 0
    },
    "Connections": [
        {
            "ID": 263385,
            "ConnectionTypeID": 2,
            "StatusTypeID": 50,
            "LevelID": 3,
            "Amps": 120,
            "Voltage": 500,
            "PowerKW": 50,
            "CurrentTypeID": 30,
            "Quantity": 1
        },
        {
            "ID": 263386,
            "ConnectionTypeID": 33,
            "StatusTypeID": 50,
            "LevelID": 3,
            "Amps": 120,
            "Voltage": 500,
            "PowerKW": 50,
            "CurrentTypeID": 30,
            "Quantity": 1
        },
        {
            "ID": 263387,
            "ConnectionTypeID": 1036,
            "StatusTypeID": 50,
            "LevelID": 3,
            "Amps": 63,
            "Voltage": 400,
            "PowerKW": 43,
            "CurrentTypeID": 20,
            "Quantity": 1
        }
    ],
    "NumberOfPoints": 2,
    "StatusTypeID": 50,
    "DateLastStatusUpdate": "2021-01-27T21:02:00Z",
    "DataQualityLevel": 1,
    "DateCreated": "2021-01-27T21:02:00Z",
    "SubmissionStatusTypeID": 200
}