{
    "IsRecentlyVerified": false,
    "ID": 122331,
    "UUID": "E47163D9-4E2A-480A-9F6A-4D7B79B281A4",
    "DataProviderID": 2,
    "DataProvidersReference": "33179",
    "UsageTypeID": 2,
    "AddressInfo": {
        "ID": 122677,
        "Title": "LADWP - Lincoln Heights District",
        "AddressLine1": "3101 Artesian St",
        "Town": "Los Angeles",
        "StateOrProvince": "CA",
        "Postcode": "90031",
        "CountryID": 2,
        "Latitude": 34.081998,
        "Longitude": -118.21713,
        "ContactTelephone1": "",
        "AccessComments": "Fleet use only",
        "RelatedURL": "",
        "DistanceUnit": 0
    },
    "Connections": [
        {
            "ID": 172215,
            "ConnectionTypeID": 1,
            "LevelID": 2,
            "Amps": 16,
            "Voltage": 230,
            "PowerKW": 3.7,
            "CurrentTypeID": 10,
            "Quantity": 23
        },
        {
            "ID": 172216,
            "ConnectionTypeID": 2,
            "LevelID": 3,
            "Amps": 100,
            "Voltage": 400,
            "PowerKW": 40,
            "CurrentTypeID": 30,
            "Quantity": 1
        }
    ],
    "DateLastStatusUpdate": "2020-06-26T02:57:00Z",
    "DataQualityLevel": 3,
    "DateCreated": "2019-04-06T05:03:00Z",
    "SubmissionStatusTypeID": 100
}