{
    "IsRecentlyVerified": false,
    "ID": 72882,
    "UUID": "C7AE3418-DB5F-4302-8B42-B0047A9E13E8",
    "DataProviderID": 2,
    "DataProvidersReference": "79212",
    "OperatorID": 5,
    "UsageTypeID": 1,
    "AddressInfo": {
        "ID": 73228,
        "Title": "RM",
        "AddressLine1": "100 Pitt St",
        "Town": "El Paso",
        "StateOrProvince": "TX",
        "Postcode": "79912",
        "CountryID": 2,
        "Latitude": 31.835182,
        "Longitude": -106.548382,
        "ContactTelephone1": "888-758-4389",
        "AccessComments": "24 hours daily",
        "RelatedURL": "http://www.chargepoint.com/",
        "DistanceUnit": 0
    },
    "Connections": [
        {
            "ID": 104547,
            "ConnectionTypeID": 1,
            "LevelID": 2,
            "Amps": 16,
            "Voltage": 230,
            "PowerKW": 3,
            "CurrentTypeID": 10,
            "Quantity": 4
        }
    ],
    "DateLastStatusUpdate": "2019-04-06T04:01:00Z",
    "DataQualityLevel": 3,
    "DateCreated": "2016-11-01T13:06:00Z",
    "SubmissionStatusTypeID": 100
}