{
    "IsRecentlyVerified": false,
    "ID": 32337,
    "UUID": "0EA17AF9-AB3C-4AEE-B485-00535E94ABAC",
    "DataProviderID": 1,
    "OperatorID": 105,
    "OperatorsReference": "Essent EM-DE-05334008-01-00001",
    "UsageTypeID": 4,
    "AddressInfo": {
        "ID": 32683,
        "Title": "Mariastraße 8",
        "AddressLine1": "Mariastraße 8",
        "Town": "Baesweiler",
        "Postcode": "52499",
        "CountryID": 87,
        "Latitude": 50.902221,
        "Longitude": 6.182642,
        "DistanceUnit": 0
    },
    "Connections": [
        {
            "ID": 35848,
            "ConnectionTypeID": 25,
            "LevelID": 2,
            "PowerKW": 11
        },
        {
            "ID": 46344,
            "ConnectionTypeID": 25,
            "LevelID": 2,
            "PowerKW": 11
        }
    ],
    "NumberOfPoints": 1,
    "StatusTypeID": 50,
    "DateLastStatusUpdate": "2015-04-13T18:18:00Z",
    "DataQualityLevel": 3,
    "DateCreated": "2015-01-09T06:03:00Z",
    "SubmissionStatusTypeID": 200
}