{
    "IsRecentlyVerified": false,
    "ID": 101473,
    "UUID": "6AC0839D-54C0-4B7E-82C8-11F816BA3FB1",
    "DataProviderID": 1,
    "OperatorID": 3257,
    "UsageTypeID": 1,
    "UsageCost": "1.50€/hr subscribers 3€/hr non subscribers 07:00-21:00",
    "AddressInfo": {
        "ID": 101819,
        "Title": "Aude region France",
        "AddressLine1": "Rue de Moulins",
        "Town": "Chalabre",
        "StateOrProvince": "Occitanie",
        "Postcode": "11230",
        "CountryID": 80,
        "Latitude": 42.9811,
        "Longitude": 2.0044,
        "ContactTelephone1": "0805021480",
        "AccessComments": "Parking lot",
        "RelatedURL": "http://www.reveocharge.com",
        "DistanceUnit": 0
    },
    "Connections": [
        {
            "ID": 143274,
            "ConnectionTypeID": 25,
            "StatusTypeID": 50,
            "LevelID": 2,
            "Amps": 26,
            "Voltage": 400,
            "PowerKW": 18,
            "CurrentTypeID": 20,
            "Quantity": 2
        },
        {
            "ID": 143275,
            "ConnectionTypeID": 26,
            "StatusTypeID": 50,
            "LevelID": 2,
            "Amps": 26,
            "Voltage": 400,
            "PowerKW": 18,
            "CurrentTypeID": 20,
            "Quantity": 2
        },
        {
            "ID": 143276,
            "ConnectionTypeID": 23,
            "StatusTypeID": 50,
            "LevelID": 2,
            "Amps": 16,
            "Voltage": 230,
            "PowerKW": 3.6,
            "CurrentTypeID": 10,
            "Quantity": 2
        }
    ],
    "NumberOfPoints": 2,
    "StatusTypeID": 50,
    "DateLastStatusUpdate": "2018-03-29T15:00:00Z",
    "DataQualityLevel": 1,
    "DateCreated": "2018-03-29T10:02:00Z",
    "SubmissionStatusTypeID": 200
}