{
    "IsRecentlyVerified": false,
    "ID": 18023,
    "UUID": "02BC71F5-806F-467E-BDFF-BC1E0645ADE5",
    "DataProviderID": 22,
    "DataProvidersReference": "980017891FF67CF8A20F23AA810E7B5A",
    "AddressInfo": {
        "ID": 18368,
        "Title": "高知三菱安芸店",
        "AddressLine1": "高知県安芸市染井町14-3",
        "CountryID": 114,
        "Latitude": 33.50389058,
        "Longitude": 133.8977449,
        "ContactTelephone1": "0887-35-3161",
        "DistanceUnit": 0
    },
    "Connections": [
        {
            "ID": 18264,
            "ConnectionTypeID": 2,
            "LevelID": 2,
            "Amps": 100,
            "Voltage": 480,
            "PowerKW": 48,
            "Quantity": 1
        }
    ],
    "DateLastStatusUpdate": "2013-06-29T09:06:00Z",
    "DataQualityLevel": 2,
    "DateCreated": "2013-06-29T09:06:00Z",
    "SubmissionStatusTypeID": 200
}