{
    "IsRecentlyVerified": false,
    "ID": 72459,
    "UUID": "9DFFC976-DBBF-4950-913C-7888B1165121",
    "DataProviderID": 1,
    "OperatorID": 1,
    "UsageTypeID": 1,
    "AddressInfo": {
        "ID": 72805,
        "Title": "Kardinal Höffner Platz",
        "AddressLine1": "Kardinal Höffner Platz",
        "AddressLine2": "Kirchstraße Ecke Rheinstraße",
        "Town": "Horhausen (Westerwald)",
        "StateOrProvince": "Flammersfeld",
        "Postcode": "56593",
        "CountryID": 87,
        "Latitude": 50.58954093408242,
        "Longitude": 7.530185509262082,
        "AccessComments": "Auf dem Parkplatz am Platz ist eine graue Ladesäule vom RWE Typ. Laden bis Ende 2016 kostenlos ohne Ladekarte 24/7. Betreiber ist die BHAG.",
        "DistanceUnit": 0
    },
    "Connections": [
        {
            "ID": 103839,
            "ConnectionTypeID": 25,
            "StatusTypeID": 50,
            "LevelID": 2,
            "Amps": 32,
            "Voltage": 400,
            "PowerKW": 22,
            "CurrentTypeID": 20,
            "Quantity": 2
        }
    ],
    "NumberOfPoints": 2,
    "StatusTypeID": 50,
    "DateLastStatusUpdate": "2016-10-17T07:02:00Z",
    "DataQualityLevel": 1,
    "DateCreated": "2016-10-17T07:02:00Z",
    "SubmissionStatusTypeID": 200
}