{
    "IsRecentlyVerified": false,
    "ID": 32744,
    "UUID": "6EAA68F9-C0E6-4F69-8267-ABA44C393C4E",
    "DataProviderID": 1,
    "OperatorID": 105,
    "OperatorsReference": "Essent EM-DE-05112000-08-00001",
    "UsageTypeID": 4,
    "AddressInfo": {
        "ID": 33090,
        "Title": "Wanheimer Straße 225",
        "AddressLine1": "Wanheimer Straße 225",
        "Town": "Duisburg",
        "Postcode": "47053",
        "CountryID": 87,
        "Latitude": 51.410081,
        "Longitude": 6.752608,
        "DistanceUnit": 0
    },
    "Connections": [
        {
            "ID": 36255,
            "ConnectionTypeID": 25,
            "LevelID": 2,
            "PowerKW": 11
        },
        {
            "ID": 46526,
            "ConnectionTypeID": 25,
            "LevelID": 2,
            "PowerKW": 11
        }
    ],
    "NumberOfPoints": 1,
    "StatusTypeID": 50,
    "DateLastStatusUpdate": "2015-04-13T19:47:00Z",
    "DataQualityLevel": 3,
    "DateCreated": "2015-01-09T06:03:00Z",
    "SubmissionStatusTypeID": 200
}