{
    "IsRecentlyVerified": false,
    "ID": 109095,
    "UUID": "648E3466-1160-4044-A121-2D078D54C1F3",
    "DataProviderID": 1,
    "OperatorID": 23,
    "OperatorsReference": "45252",
    "UsageTypeID": 4,
    "AddressInfo": {
        "ID": 109441,
        "Title": "Comfort Suites Mcdonough",
        "AddressLine1": "64 Hwy 81 W At Exit 218",
        "Town": "McDonough",
        "StateOrProvince": "Georgia",
        "Postcode": "30253",
        "CountryID": 2,
        "Latitude": 33.42794,
        "Longitude": -84.184666,
        "ContactTelephone1": "(678) 216-1900",
        "DistanceUnit": 0
    },
    "Connections": [
        {
            "ID": 154213,
            "ConnectionTypeID": 30,
            "StatusTypeID": 50,
            "LevelID": 2,
            "PowerKW": 8,
            "CurrentTypeID": 10,
            "Quantity": 1
        }
    ],
    "NumberOfPoints": 1,
    "GeneralComments": "1 Tesla Connector, up to 8kW.Available for customers. Please see front desk.",
    "StatusTypeID": 50,
    "DateLastStatusUpdate": "2018-10-11T13:36:00Z",
    "DataQualityLevel": 1,
    "DateCreated": "2018-10-11T13:36:00Z",
    "SubmissionStatusTypeID": 200
}