{
    "IsRecentlyVerified": false,
    "ID": 121226,
    "UUID": "8B4E35E8-3B3B-4012-B15F-57FEE16FFACA",
    "DataProviderID": 2,
    "DataProvidersReference": "118894",
    "OperatorID": 5,
    "UsageTypeID": 1,
    "AddressInfo": {
        "ID": 121572,
        "Title": "AVANT GARAGE",
        "AddressLine1": "12890 Old Meridian St",
        "Town": "Carmel",
        "StateOrProvince": "IN",
        "Postcode": "46032",
        "CountryID": 2,
        "Latitude": 39.9750379,
        "Longitude": -86.1495793,
        "ContactTelephone1": "888-758-4389",
        "AccessComments": "24 hours daily",
        "RelatedURL": "http://www.chargepoint.com/",
        "DistanceUnit": 0
    },
    "Connections": [
        {
            "ID": 170666,
            "ConnectionTypeID": 1,
            "LevelID": 2,
            "Amps": 16,
            "Voltage": 230,
            "PowerKW": 3.7,
            "CurrentTypeID": 10,
            "Quantity": 2
        }
    ],
    "DateLastStatusUpdate": "2020-06-26T03:02:00Z",
    "DataQualityLevel": 3,
    "DateCreated": "2019-04-01T05:00:00Z",
    "SubmissionStatusTypeID": 100
}