{
    "MediaItems": [
        {
            "ID": 1184,
            "ChargePointID": 39869,
            "ItemURL": "https://s3-ap-southeast-2.amazonaws.com/openchargemap/images/US/OCM39869/OCM-39869.orig.2015040719160356.jpeg",
            "ItemThumbnailURL": "https://s3-ap-southeast-2.amazonaws.com/openchargemap/images/US/OCM39869/OCM-39869.thmb.2015040719160356.jpeg",
            "Comment": "",
            "IsEnabled": true,
            "IsVideo": false,
            "IsFeaturedItem": false,
            "IsExternalResource": false,
            "User": {
                "ID": 4748,
                "Username": "mccaccess"
            },
            "DateCreated": "2015-04-07T19:16:00Z"
        }
    ],
    "IsRecentlyVerified": false,
    "ID": 39869,
    "UUID": "6EFAD63B-5236-4A59-B20F-DCF0DD891D92",
    "DataProviderID": 1,
    "OperatorID": 45,
    "UsageTypeID": 1,
    "UsageCost": "Free",
    "AddressInfo": {
        "ID": 40215,
        "Title": "Extra Space Storage",
        "AddressLine1": "2645 La Cienega Ave",
        "Town": "Los Angeles",
        "StateOrProvince": "CA",
        "Postcode": "90034",
        "CountryID": 2,
        "Latitude": 34.033635,
        "Longitude": -118.378848,
        "ContactTelephone1": "310-836-8358",
        "AccessComments": "24 hours daily",
        "RelatedURL": "http://www.extraspace.com/Storage/Facilities/US/California/Los_Angeles/900045/Facility.aspx",
        "DistanceUnit": 0
    },
    "Connections": [
        {
            "ID": 43400,
            "ConnectionTypeID": 1,
            "LevelID": 2,
            "Amps": 16,
            "Voltage": 230,
            "PowerKW": 3,
            "CurrentTypeID": 10,
            "Quantity": 1
        }
    ],
    "NumberOfPoints": 1,
    "StatusTypeID": 50,
    "DateLastStatusUpdate": "2015-04-07T19:49:00Z",
    "DataQualityLevel": 3,
    "DateCreated": "2015-01-10T01:01:00Z",
    "SubmissionStatusTypeID": 100
}