{
    "IsRecentlyVerified": false,
    "ID": 174135,
    "UUID": "66440CAD-F58D-47A6-846C-00C84708B8C1",
    "DataProviderID": 1,
    "OperatorID": 45,
    "UsageTypeID": 1,
    "UsageCost": "Free",
    "AddressInfo": {
        "ID": 174494,
        "Title": "Middle Georgia State University, Cochran campus",
        "AddressLine1": "1100 Second Street, S.E.",
        "Town": "Cochran",
        "StateOrProvince": "GA",
        "Postcode": "31014",
        "CountryID": 2,
        "Latitude": 32.380911104291314,
        "Longitude": -83.34580728884009,
        "ContactTelephone1": "+1-478-934-6221",
        "AccessComments": "Vehicles without MGA parking permits might be ticketed if unattended, particularly Monday-Thursday during fall and spring semesters.",
        "RelatedURL": "https://www.mga.edu/",
        "DistanceUnit": 0
    },
    "Connections": [
        {
            "ID": 269077,
            "ConnectionTypeID": 1,
            "StatusTypeID": 50,
            "LevelID": 2,
            "Amps": 32,
            "Voltage": 208,
            "PowerKW": 11.5,
            "CurrentTypeID": 20,
            "Quantity": 2
        }
    ],
    "NumberOfPoints": 2,
    "StatusTypeID": 50,
    "DateLastStatusUpdate": "2021-03-18T12:38:00Z",
    "DataQualityLevel": 1,
    "DateCreated": "2021-03-18T02:31:00Z",
    "SubmissionStatusTypeID": 200
}