{
    "IsRecentlyVerified": false,
    "ID": 102665,
    "UUID": "ACE0AD1B-CB31-448A-8D35-5A16F627DA68",
    "DataProviderID": 2,
    "DataProvidersReference": "94675",
    "UsageTypeID": 2,
    "AddressInfo": {
        "ID": 103011,
        "Title": "Rappahannock Electric Co-op - Fredericksburg Office",
        "AddressLine1": "247 Industrial Ct",
        "Town": "Fredericksburg",
        "StateOrProvince": "VA",
        "Postcode": "22408",
        "CountryID": 2,
        "Latitude": 38.2632720079081,
        "Longitude": -77.504005390213,
        "ContactTelephone1": "540-622-2078",
        "AccessComments": "For employee use only",
        "RelatedURL": "",
        "DistanceUnit": 0
    },
    "Connections": [
        {
            "ID": 144773,
            "ConnectionTypeID": 1,
            "LevelID": 2,
            "Amps": 16,
            "Voltage": 230,
            "PowerKW": 3,
            "CurrentTypeID": 10,
            "Quantity": 1
        }
    ],
    "DateLastStatusUpdate": "2019-04-06T04:02:00Z",
    "DataQualityLevel": 3,
    "DateCreated": "2018-04-21T04:13:00Z",
    "SubmissionStatusTypeID": 100
}