{
    "IsRecentlyVerified": false,
    "ID": 56800,
    "UUID": "69C27A32-CF15-4ADE-B472-6C3E2276F00D",
    "DataProviderID": 1,
    "OperatorID": 80,
    "UsageTypeID": 4,
    "UsageCost": "0,40 €/kW",
    "AddressInfo": {
        "ID": 57146,
        "Title": "Eneldrive  Azienda Ospedaliera Perugia",
        "AddressLine1": " Piazzale Giorgio Menghini",
        "AddressLine2": "Via Gerardo Dottori",
        "Town": "Perugia",
        "StateOrProvince": "PG",
        "Postcode": "06132",
        "CountryID": 112,
        "Latitude": 43.0804439410767,
        "Longitude": 12.3550831062869,
        "RelatedURL": "http://eneldrive.it",
        "DistanceUnit": 0
    },
    "Connections": [
        {
            "ID": 71658,
            "ConnectionTypeID": 25,
            "StatusTypeID": 50,
            "LevelID": 2,
            "Amps": 32,
            "Voltage": 400,
            "PowerKW": 22,
            "CurrentTypeID": 20,
            "Quantity": 1
        },
        {
            "ID": 71659,
            "ConnectionTypeID": 36,
            "StatusTypeID": 50,
            "LevelID": 2,
            "Amps": 16,
            "Voltage": 240,
            "PowerKW": 3.7,
            "CurrentTypeID": 10,
            "Quantity": 1
        }
    ],
    "NumberOfPoints": 1,
    "StatusTypeID": 50,
    "DateLastStatusUpdate": "2019-08-06T14:24:00Z",
    "DataQualityLevel": 1,
    "DateCreated": "2015-11-10T15:00:00Z",
    "SubmissionStatusTypeID": 200
}