{
    "IsRecentlyVerified": false,
    "ID": 166532,
    "UUID": "7EE9A226-5518-4D5B-92F3-383A73CF4E6B",
    "DataProviderID": 28,
    "DataProvidersReference": "FR*S61*P611038B",
    "UsageTypeID": 5,
    "AddressInfo": {
        "ID": 166891,
        "Title": "Bellême | Place du Général Leclerc",
        "AddressLine1": "Place du Général Leclerc 61130 Bellême",
        "CountryID": 80,
        "Latitude": 48.37678,
        "Longitude": 0.555585,
        "AccessComments": "24/24 7/7",
        "DistanceUnit": 0
    },
    "Connections": [
        {
            "ID": 249218,
            "ConnectionTypeID": 26,
            "StatusTypeID": 50,
            "LevelID": 2,
            "PowerKW": 18
        },
        {
            "ID": 249219,
            "ConnectionTypeID": 28,
            "StatusTypeID": 50,
            "LevelID": 2,
            "PowerKW": 18,
            "CurrentTypeID": 10
        },
        {
            "ID": 249220,
            "ConnectionTypeID": 25,
            "StatusTypeID": 50,
            "LevelID": 2,
            "PowerKW": 18,
            "CurrentTypeID": 20
        },
        {
            "ID": 249221,
            "ConnectionTypeID": 28,
            "StatusTypeID": 50,
            "LevelID": 2,
            "PowerKW": 18,
            "CurrentTypeID": 10
        }
    ],
    "GeneralComments": "",
    "StatusTypeID": 50,
    "DateLastStatusUpdate": "2020-08-27T05:15:00Z",
    "DataQualityLevel": 2,
    "DateCreated": "2020-08-27T05:15:00Z",
    "SubmissionStatusTypeID": 100
}