{
    "IsRecentlyVerified": false,
    "ID": 156007,
    "UUID": "2BCCF4F7-FC19-4384-907B-EFAD3FFB1465",
    "DataProviderID": 1,
    "OperatorID": 136,
    "UsageTypeID": 4,
    "UsageCost": "0,25€/kWh +parking fee after free period",
    "AddressInfo": {
        "ID": 156361,
        "Title": "Helen Helsingin Jäähalli",
        "AddressLine1": "Nordenskiöldinkatu 11-13",
        "AddressLine2": "South, 2nd area",
        "Town": "Helsinki",
        "StateOrProvince": "Southern Finland",
        "Postcode": "00260",
        "CountryID": 79,
        "Latitude": 60.18981386339274,
        "Longitude": 24.92496984773345,
        "RelatedURL": "http://www.virta.fi",
        "DistanceUnit": 0
    },
    "Connections": [
        {
            "ID": 219592,
            "ConnectionTypeID": 25,
            "StatusTypeID": 50,
            "LevelID": 2,
            "Amps": 32,
            "Voltage": 400,
            "PowerKW": 22,
            "CurrentTypeID": 20,
            "Quantity": 8,
            "Comments": "South area of parking"
        }
    ],
    "NumberOfPoints": 8,
    "StatusTypeID": 50,
    "DateLastStatusUpdate": "2020-05-02T07:45:00Z",
    "DataQualityLevel": 1,
    "DateCreated": "2020-05-02T06:13:00Z",
    "SubmissionStatusTypeID": 200
}