{
    "IsRecentlyVerified": false,
    "ID": 157765,
    "UUID": "CCFBBEE6-CD10-4F95-9E50-91741B7B11F6",
    "DataProviderID": 1,
    "OperatorID": 203,
    "UsageTypeID": 5,
    "UsageCost": "36p/kWh. Contactless, App or RFID",
    "AddressInfo": {
        "ID": 158119,
        "Title": "Barnfield Retail Park",
        "AddressLine1": "Barnfield Drive",
        "Town": "Chichester",
        "StateOrProvince": "England",
        "Postcode": "PO19 6UX",
        "CountryID": 1,
        "Latitude": 50.8466325803584,
        "Longitude": -0.7592525079398911,
        "RelatedURL": "https://ospreycharging.co.uk/ev-drivers/",
        "DistanceUnit": 0
    },
    "Connections": [
        {
            "ID": 227294,
            "ConnectionTypeID": 25,
            "Reference": "ENG00194-3",
            "StatusTypeID": 50,
            "LevelID": 2,
            "Amps": 32,
            "Voltage": 400,
            "PowerKW": 22,
            "CurrentTypeID": 20,
            "Quantity": 2
        },
        {
            "ID": 227295,
            "ConnectionTypeID": 2,
            "Reference": "ENG00194-2",
            "StatusTypeID": 50,
            "LevelID": 3,
            "Amps": 125,
            "Voltage": 400,
            "PowerKW": 50,
            "CurrentTypeID": 30,
            "Quantity": 2
        },
        {
            "ID": 227296,
            "ConnectionTypeID": 33,
            "Reference": "ENG00194-1",
            "StatusTypeID": 50,
            "LevelID": 3,
            "Amps": 125,
            "Voltage": 400,
            "PowerKW": 50,
            "CurrentTypeID": 30,
            "Quantity": 2
        }
    ],
    "GeneralComments": "Two Engenie rapid chargers. AC is 22kW socket.",
    "StatusTypeID": 50,
    "DateLastStatusUpdate": "2020-10-06T23:52:00Z",
    "MetadataValues": [
        {
            "ID": 7298,
            "MetadataFieldID": 4,
            "ItemValue": "Contains public sector information licensed under the Open Government Licence v2.0. http://www.nationalarchives.gov.uk/doc/open-government-licence/version/2/"
        }
    ],
    "DataQualityLevel": 3,
    "DateCreated": "2020-06-25T10:00:00Z",
    "SubmissionStatusTypeID": 100
}