{
    "IsRecentlyVerified": true,
    "DateLastVerified": "2021-11-03T02:58:00Z",
    "ID": 189787,
    "UUID": "414710A1-354F-4132-B041-F2E3A89FA501",
    "DataProviderID": 1,
    "OperatorID": 1,
    "UsageTypeID": 1,
    "AddressInfo": {
        "ID": 190146,
        "Title": "Historic Rum River Parking Ramp",
        "AddressLine1": "2110 2nd Ave.  ",
        "Town": "Anoka",
        "StateOrProvince": "MN",
        "Postcode": "55303",
        "CountryID": 2,
        "Latitude": 45.19951204736441,
        "Longitude": -93.38878618827879,
        "ContactTelephone1": "844-584-2329 ",
        "AccessComments": "Located on the top level of the ramp",
        "DistanceUnit": 0
    },
    "Connections": [
        {
            "ID": 307065,
            "ConnectionTypeID": 1,
            "StatusTypeID": 50,
            "LevelID": 2,
            "Amps": 40,
            "Voltage": 208,
            "PowerKW": 8.3,
            "CurrentTypeID": 10,
            "Quantity": 2
        }
    ],
    "NumberOfPoints": 2,
    "GeneralComments": "Parking ramp is free",
    "StatusTypeID": 50,
    "DateLastStatusUpdate": "2021-11-04T10:44:00Z",
    "DataQualityLevel": 1,
    "DateCreated": "2021-11-03T02:58:00Z",
    "SubmissionStatusTypeID": 200
}