{
    "IsRecentlyVerified": false,
    "ID": 17108,
    "UUID": "37CCCB1B-9A89-4311-A5DD-607557AA98F6",
    "DataProviderID": 22,
    "DataProvidersReference": "6AACD73D825E28970D6D9B8AC7F0D8D8",
    "AddressInfo": {
        "ID": 17453,
        "Title": "関東三菱世田谷店・クリーンカー世田谷",
        "AddressLine1": "東京都世田谷区上用賀6-5-2",
        "CountryID": 114,
        "Latitude": 35.63292956,
        "Longitude": 139.6246462,
        "ContactTelephone1": "03-3425-3311",
        "DistanceUnit": 0
    },
    "Connections": [
        {
            "ID": 17349,
            "ConnectionTypeID": 2,
            "LevelID": 2,
            "Amps": 100,
            "Voltage": 480,
            "PowerKW": 48,
            "Quantity": 1
        }
    ],
    "DateLastStatusUpdate": "2013-06-29T08:53:00Z",
    "DataQualityLevel": 2,
    "DateCreated": "2013-06-29T08:53:00Z",
    "SubmissionStatusTypeID": 200
}