{
    "IsRecentlyVerified": false,
    "ID": 185546,
    "UUID": "6F9E1C79-AB2F-450F-9A7A-0F77DA32C45D",
    "DataProviderID": 1,
    "OperatorID": 1,
    "UsageTypeID": 5,
    "UsageCost": "500 RUB",
    "AddressInfo": {
        "ID": 185905,
        "Title": "Валдай Эко Клуб",
        "AddressLine1": "Valday Eco Club",
        "Town": "Короцкое сельское поселение",
        "StateOrProvince": "Novgorod Oblast",
        "Postcode": "175419",
        "CountryID": 185,
        "Latitude": 57.926522499454165,
        "Longitude": 33.228319747972364,
        "ContactTelephone1": "+7 (964) 694 64 62 ",
        "ContactTelephone2": "+7 (921) 843 64 52",
        "RelatedURL": "https://valday-hotel.ru/",
        "DistanceUnit": 0
    },
    "Connections": [
        {
            "ID": 295161,
            "ConnectionTypeID": 1,
            "StatusTypeID": 50,
            "LevelID": 2,
            "Amps": 32,
            "Voltage": 230,
            "PowerKW": 7.4,
            "CurrentTypeID": 10,
            "Quantity": 1
        },
        {
            "ID": 295162,
            "ConnectionTypeID": 1036,
            "StatusTypeID": 50,
            "LevelID": 2,
            "Amps": 16,
            "Voltage": 400,
            "PowerKW": 11,
            "CurrentTypeID": 20,
            "Quantity": 1
        }
    ],
    "NumberOfPoints": 1,
    "GeneralComments": "2 зарядные станции со встроенными кабелями.  Работают круглосуточно. Запуск на территорию по предварительному согласованию с указанием марки и гос. номера авто. Стоимость услуги зарядки: 500 рублей.",
    "StatusTypeID": 50,
    "DateLastStatusUpdate": "2021-07-12T07:39:00Z",
    "DataQualityLevel": 1,
    "DateCreated": "2021-07-09T09:24:00Z",
    "SubmissionStatusTypeID": 200
}