{
    "IsRecentlyVerified": false,
    "ID": 51902,
    "UUID": "E5C754B1-AFAC-48B5-AF64-697A3B988655",
    "DataProviderID": 2,
    "DataProvidersReference": "68808",
    "OperatorID": 5,
    "UsageTypeID": 1,
    "AddressInfo": {
        "ID": 52248,
        "Title": "REHOBOTH",
        "AddressLine1": "19744-19798 DE-1",
        "Town": "Rehoboth Beach",
        "StateOrProvince": "DE",
        "Postcode": "19971",
        "CountryID": 2,
        "Latitude": 38.716495,
        "Longitude": -75.111191,
        "ContactTelephone1": "888-758-4389",
        "AccessComments": "24 hours daily",
        "RelatedURL": "http://www.chargepoint.com/",
        "DistanceUnit": 0
    },
    "Connections": [
        {
            "ID": 64384,
            "ConnectionTypeID": 1,
            "LevelID": 2,
            "Amps": 16,
            "Voltage": 230,
            "PowerKW": 3.7,
            "CurrentTypeID": 10,
            "Quantity": 4
        }
    ],
    "DateLastStatusUpdate": "2020-06-26T03:00:00Z",
    "DataQualityLevel": 3,
    "DateCreated": "2015-08-13T03:43:00Z",
    "SubmissionStatusTypeID": 100
}