{
    "IsRecentlyVerified": false,
    "ID": 102602,
    "UUID": "C9B199FF-DCE0-4C3F-A746-0FE5837DC781",
    "DataProviderID": 2,
    "DataProvidersReference": "91703",
    "UsageTypeID": 1,
    "AddressInfo": {
        "ID": 102948,
        "Title": "Yorktown Library",
        "AddressLine1": "8500 George Washington Memorial Hwy",
        "Town": "Yorktown",
        "StateOrProvince": "VA",
        "Postcode": "23692",
        "CountryID": 2,
        "Latitude": 37.194887,
        "Longitude": -76.490472,
        "ContactTelephone1": "757-890-3750",
        "AccessComments": "24 hours daily",
        "RelatedURL": "",
        "DistanceUnit": 0
    },
    "Connections": [
        {
            "ID": 144697,
            "ConnectionTypeID": 1,
            "LevelID": 2,
            "Amps": 16,
            "Voltage": 230,
            "PowerKW": 3,
            "CurrentTypeID": 10,
            "Quantity": 1
        }
    ],
    "DateLastStatusUpdate": "2019-04-06T04:02:00Z",
    "DataQualityLevel": 3,
    "DateCreated": "2018-04-21T04:13:00Z",
    "SubmissionStatusTypeID": 100
}