{
    "IsRecentlyVerified": false,
    "ID": 138908,
    "UUID": "F992F61F-F8DD-449C-A600-BD08B7A19C18",
    "DataProviderID": 2,
    "DataProvidersReference": "93638",
    "OperatorID": 15,
    "UsageTypeID": 4,
    "AddressInfo": {
        "ID": 139260,
        "Title": "7-Eleven",
        "AddressLine1": "901 Palomar Airport Rd",
        "Town": "Carlsbad",
        "StateOrProvince": "CA",
        "Postcode": "92011",
        "CountryID": 2,
        "Latitude": 33.121561,
        "Longitude": -117.318729,
        "ContactTelephone1": "877-455-3833",
        "AccessComments": "24 hours daily\r\nPublic - Card key at all times",
        "RelatedURL": "https://www.evgo.com/",
        "DistanceUnit": 0
    },
    "Connections": [
        {
            "ID": 194136,
            "ConnectionTypeID": 2,
            "LevelID": 3,
            "Amps": 100,
            "Voltage": 400,
            "PowerKW": 40,
            "CurrentTypeID": 30,
            "Quantity": 1
        }
    ],
    "StatusTypeID": 50,
    "DateLastStatusUpdate": "2020-06-26T02:55:00Z",
    "DataQualityLevel": 3,
    "DateCreated": "2019-12-24T09:09:00Z",
    "SubmissionStatusTypeID": 100
}