{
    "IsRecentlyVerified": false,
    "ID": 116818,
    "UUID": "6D440786-FD86-4A60-B687-B3DA6EC8C964",
    "DataProviderID": 1,
    "OperatorID": 23,
    "OperatorsReference": "48679",
    "UsageTypeID": 4,
    "AddressInfo": {
        "ID": 117164,
        "Title": "Fairfield Inn & Suites Gainesville",
        "AddressLine1": "3877 SW 37th BLVD",
        "Town": "Gainesville",
        "StateOrProvince": "Florida",
        "Postcode": "32608",
        "CountryID": 2,
        "Latitude": 29.617836,
        "Longitude": -82.377957,
        "ContactTelephone1": "(352) 745-7777",
        "DistanceUnit": 0
    },
    "Connections": [
        {
            "ID": 165376,
            "ConnectionTypeID": 30,
            "StatusTypeID": 50,
            "LevelID": 2,
            "PowerKW": 16,
            "CurrentTypeID": 20,
            "Quantity": 2
        }
    ],
    "NumberOfPoints": 2,
    "GeneralComments": "2 Tesla Connectors, up to 16kW.Available for customers. Self park.",
    "StatusTypeID": 50,
    "DateLastStatusUpdate": "2019-02-12T11:38:00Z",
    "DataQualityLevel": 1,
    "DateCreated": "2019-02-12T11:38:00Z",
    "SubmissionStatusTypeID": 200
}