{
    "IsRecentlyVerified": false,
    "ID": 141868,
    "UUID": "40763AB5-EFD2-4AE2-BDF7-858B5E30D28A",
    "DataProviderID": 2,
    "DataProvidersReference": "143878",
    "OperatorID": 5,
    "UsageTypeID": 1,
    "AddressInfo": {
        "ID": 142220,
        "Title": "LANCASTEROH",
        "AddressLine1": "135 W Chestnut St",
        "Town": "Lancaster",
        "StateOrProvince": "OH",
        "Postcode": "43130",
        "CountryID": 2,
        "Latitude": 39.7128777,
        "Longitude": -82.6034114,
        "ContactTelephone1": "888-758-4389",
        "AccessComments": "24 hours daily",
        "RelatedURL": "http://www.chargepoint.com/",
        "DistanceUnit": 0
    },
    "Connections": [
        {
            "ID": 197905,
            "ConnectionTypeID": 2,
            "LevelID": 3,
            "Amps": 100,
            "Voltage": 400,
            "PowerKW": 40,
            "CurrentTypeID": 30,
            "Quantity": 1
        },
        {
            "ID": 197906,
            "ConnectionTypeID": 32,
            "LevelID": 3,
            "Amps": 100,
            "Voltage": 400,
            "PowerKW": 40,
            "CurrentTypeID": 30,
            "Quantity": 1
        }
    ],
    "StatusTypeID": 50,
    "DateLastStatusUpdate": "2020-06-26T03:02:00Z",
    "DataQualityLevel": 3,
    "DateCreated": "2019-12-24T09:16:00Z",
    "SubmissionStatusTypeID": 100
}