{
    "IsRecentlyVerified": true,
    "DateLastVerified": "2021-10-18T13:11:00Z",
    "ID": 189611,
    "UUID": "F7E03E43-6227-4593-A0EC-55C75ACE688C",
    "DataProviderID": 1,
    "OperatorID": 3327,
    "UsageTypeID": 1,
    "AddressInfo": {
        "ID": 189970,
        "Title": "Via Circonvallazione",
        "AddressLine1": "Via Circonvallazione",
        "Town": "Casei Gerola",
        "StateOrProvince": "Lombardy",
        "CountryID": 112,
        "Latitude": 45.009360881999186,
        "Longitude": 8.925744346555234,
        "DistanceUnit": 0
    },
    "Connections": [
        {
            "ID": 306735,
            "ConnectionTypeID": 33,
            "StatusTypeID": 50,
            "LevelID": 3,
            "PowerKW": 75,
            "CurrentTypeID": 30
        },
        {
            "ID": 306736,
            "ConnectionTypeID": 2,
            "StatusTypeID": 50,
            "LevelID": 3,
            "PowerKW": 63,
            "CurrentTypeID": 30
        },
        {
            "ID": 306737,
            "ConnectionTypeID": 1036,
            "StatusTypeID": 50,
            "LevelID": 3,
            "Amps": 63,
            "Voltage": 400,
            "PowerKW": 43,
            "CurrentTypeID": 20,
            "Quantity": 1
        }
    ],
    "NumberOfPoints": 1,
    "StatusTypeID": 50,
    "DateLastStatusUpdate": "2021-10-18T16:59:00Z",
    "DataQualityLevel": 1,
    "DateCreated": "2021-10-18T13:11:00Z",
    "SubmissionStatusTypeID": 200
}