{
    "IsRecentlyVerified": false,
    "ID": 124811,
    "UUID": "A0154C7D-02BD-4556-B5FC-144DE6BDA45F",
    "DataProviderID": 2,
    "DataProvidersReference": "60922",
    "OperatorID": 5,
    "UsageTypeID": 1,
    "AddressInfo": {
        "ID": 125157,
        "Title": "CIRCLE BMW",
        "AddressLine1": "500 NJ-36 500 State Route 36",
        "Town": "Eatontown",
        "StateOrProvince": "NJ",
        "Postcode": "07724",
        "CountryID": 2,
        "Latitude": 40.2901386,
        "Longitude": -74.0413593,
        "ContactTelephone1": "888-758-4389",
        "AccessComments": "24 hours daily",
        "RelatedURL": "http://www.chargepoint.com/",
        "DistanceUnit": 0
    },
    "Connections": [
        {
            "ID": 174962,
            "ConnectionTypeID": 1,
            "LevelID": 2,
            "Amps": 16,
            "Voltage": 230,
            "PowerKW": 3.7,
            "CurrentTypeID": 10,
            "Quantity": 2
        }
    ],
    "DateLastStatusUpdate": "2020-06-26T03:02:00Z",
    "DataQualityLevel": 3,
    "DateCreated": "2019-04-06T05:04:00Z",
    "SubmissionStatusTypeID": 100
}