{
    "IsRecentlyVerified": false,
    "ID": 143230,
    "UUID": "5ABFC854-F9EC-46A7-82EF-AA0B9A31E7A4",
    "DataProviderID": 2,
    "DataProvidersReference": "123466",
    "OperatorID": 5,
    "UsageTypeID": 1,
    "AddressInfo": {
        "ID": 143582,
        "Title": "CITY LOWELL MA",
        "AddressLine1": "1365 Middlesex St",
        "Town": "Lowell",
        "StateOrProvince": "MA",
        "Postcode": "01851",
        "CountryID": 2,
        "Latitude": 42.6382008,
        "Longitude": -71.3410858,
        "ContactTelephone1": "888-758-4389",
        "AccessComments": "24 hours daily",
        "RelatedURL": "http://www.chargepoint.com/",
        "DistanceUnit": 0
    },
    "Connections": [
        {
            "ID": 199519,
            "ConnectionTypeID": 1,
            "LevelID": 2,
            "Amps": 16,
            "Voltage": 230,
            "PowerKW": 3.7,
            "CurrentTypeID": 10,
            "Quantity": 2
        }
    ],
    "StatusTypeID": 50,
    "DateLastStatusUpdate": "2020-06-26T03:06:00Z",
    "DataQualityLevel": 3,
    "DateCreated": "2019-12-24T09:20:00Z",
    "SubmissionStatusTypeID": 100
}