{
    "MediaItems": [
        {
            "ID": 3454,
            "ChargePointID": 42261,
            "ItemURL": "https://s3-ap-southeast-2.amazonaws.com/openchargemap/images/IT/OCM42261/OCM-42261.orig.2015102618320126.jpg",
            "ItemThumbnailURL": "https://s3-ap-southeast-2.amazonaws.com/openchargemap/images/IT/OCM42261/OCM-42261.thmb.2015102618320126.jpg",
            "Comment": "",
            "IsEnabled": true,
            "IsVideo": false,
            "IsFeaturedItem": false,
            "IsExternalResource": false,
            "User": {
                "ID": 1606,
                "Username": "polianto"
            },
            "DateCreated": "2015-10-26T18:32:00Z"
        },
        {
            "ID": 3452,
            "ChargePointID": 42261,
            "ItemURL": "https://s3-ap-southeast-2.amazonaws.com/openchargemap/images/IT/OCM42261/OCM-42261.orig.2015102618281534.jpg",
            "ItemThumbnailURL": "https://s3-ap-southeast-2.amazonaws.com/openchargemap/images/IT/OCM42261/OCM-42261.thmb.2015102618281534.jpg",
            "Comment": "",
            "IsEnabled": true,
            "IsVideo": false,
            "IsFeaturedItem": false,
            "IsExternalResource": false,
            "User": {
                "ID": 1606,
                "Username": "polianto"
            },
            "DateCreated": "2015-10-26T18:28:00Z"
        }
    ],
    "IsRecentlyVerified": false,
    "ID": 42261,
    "UUID": "45F1096C-FC69-4C76-AC5A-BFB4F889803D",
    "DataProviderID": 1,
    "OperatorID": 164,
    "UsageTypeID": 4,
    "AddressInfo": {
        "ID": 42607,
        "Title": "Municipio di Naturno | Neogy",
        "AddressLine1": "Via Principale, 35",
        "Town": "Naturno",
        "StateOrProvince": "BZ",
        "Postcode": "39025",
        "CountryID": 112,
        "Latitude": 46.6504476560297,
        "Longitude": 11.0059109249559,
        "DistanceUnit": 0
    },
    "Connections": [
        {
            "ID": 50809,
            "ConnectionTypeID": 25,
            "StatusTypeID": 50,
            "LevelID": 2,
            "Amps": 32,
            "Voltage": 400,
            "PowerKW": 22,
            "CurrentTypeID": 20,
            "Quantity": 2
        }
    ],
    "NumberOfPoints": 2,
    "StatusTypeID": 50,
    "DateLastStatusUpdate": "2019-07-14T17:26:00Z",
    "DataQualityLevel": 1,
    "DateCreated": "2015-03-04T20:38:00Z",
    "SubmissionStatusTypeID": 200
}