{
    "IsRecentlyVerified": false,
    "ID": 90034,
    "UUID": "50591287-688C-4FD6-BC3C-7772094B40AB",
    "DataProviderID": 1,
    "OperatorID": 45,
    "UsageTypeID": 6,
    "AddressInfo": {
        "ID": 90380,
        "Title": "ZOPF Sonnenstrom",
        "AddressLine1": "Lindenstraße 24",
        "Town": "Vehlow",
        "StateOrProvince": "Landkreis Prignitz",
        "Postcode": "16866",
        "CountryID": 87,
        "Latitude": 53.01162,
        "Longitude": 12.320400000000063,
        "ContactTelephone1": "+49 33976 50451",
        "AccessComments": "Laden möglich nach telefonischer Anmeldung; nur zu den Öffnungszeiten Mo-Fr 9-15Uhr möglich",
        "RelatedURL": "http://www.zopf-gmbh.de/",
        "DistanceUnit": 0
    },
    "Connections": [
        {
            "ID": 127631,
            "ConnectionTypeID": 25,
            "StatusTypeID": 50,
            "LevelID": 2,
            "Amps": 32,
            "Voltage": 400,
            "PowerKW": 22,
            "CurrentTypeID": 20,
            "Quantity": 1
        }
    ],
    "NumberOfPoints": 1,
    "StatusTypeID": 50,
    "DateLastStatusUpdate": "2017-07-04T12:30:00Z",
    "DataQualityLevel": 1,
    "DateCreated": "2017-07-04T12:30:00Z",
    "SubmissionStatusTypeID": 200
}