{
    "IsRecentlyVerified": true,
    "DateLastVerified": "2021-08-24T17:56:00Z",
    "ID": 188908,
    "UUID": "55D164E9-7FE8-476A-9C58-1AD175A48E0E",
    "DataProviderID": 1,
    "OperatorID": 1,
    "UsageTypeID": 4,
    "AddressInfo": {
        "ID": 189267,
        "Title": "Supermercado Zona Sul",
        "AddressLine1": "Supermercado Zona Sul",
        "Town": "Rio de Janeiro",
        "StateOrProvince": "Rio de Janeiro",
        "Postcode": "22775053",
        "CountryID": 36,
        "Latitude": -22.99967863988823,
        "Longitude": -43.399359025763886,
        "DistanceUnit": 0
    },
    "Connections": [
        {
            "ID": 305270,
            "ConnectionTypeID": 1036,
            "StatusTypeID": 50,
            "LevelID": 2,
            "PowerKW": 7.4,
            "Quantity": 1
        }
    ],
    "NumberOfPoints": 1,
    "StatusTypeID": 50,
    "DateLastStatusUpdate": "2021-08-24T19:45:00Z",
    "DataQualityLevel": 1,
    "DateCreated": "2021-08-24T17:56:00Z",
    "SubmissionStatusTypeID": 200
}