{
    "UserComments": [
        {
            "ID": 535,
            "ChargePointID": 16672,
            "CommentTypeID": 10,
            "UserName": "g4qber",
            "Comment": "Bollard has power ",
            "Rating": 5,
            "DateCreated": "2013-11-17T07:49:09.073Z",
            "User": {
                "ID": 1043,
                "Username": "g4qber"
            },
            "CheckinStatusTypeID": 10
        },
        {
            "ID": 498,
            "ChargePointID": 16672,
            "CommentTypeID": 50,
            "UserName": "g4qber",
            "Comment": "Sent email to Murdoch uni about power outage",
            "Rating": 4,
            "DateCreated": "2013-10-19T21:35:39.25Z",
            "User": {
                "ID": 1043,
                "Username": "g4qber"
            },
            "CheckinStatusTypeID": 20
        },
        {
            "ID": 482,
            "ChargePointID": 16672,
            "CommentTypeID": 10,
            "UserName": "g4qber",
            "Comment": "The quick brown fox jumps over the lazy dog and I can't see what I'm ruin g",
            "DateCreated": "2013-10-12T09:33:37.627Z",
            "User": {
                "ID": 1043,
                "Username": "g4qber"
            },
            "CheckinStatusTypeID": 10
        },
        {
            "ID": 481,
            "ChargePointID": 16672,
            "CommentTypeID": 1000,
            "UserName": "g4qber",
            "Comment": "Bollard dead on Thursday night and today Sat\nCharging with 10aml plug\n",
            "Rating": 5,
            "DateCreated": "2013-10-12T09:20:23.28Z",
            "User": {
                "ID": 1043,
                "Username": "g4qber"
            },
            "CheckinStatusTypeID": 20
        }
    ],
    "MediaItems": [
        {
            "ID": 155,
            "ChargePointID": 16672,
            "ItemURL": "https://s3-ap-southeast-2.amazonaws.com/openchargemap/images/AU/OCM16672/OCM-16672.orig.2013111707505019.jpg",
            "ItemThumbnailURL": "https://s3-ap-southeast-2.amazonaws.com/openchargemap/images/AU/OCM16672/OCM-16672.thmb.2013111707505019.jpg",
            "Comment": "Fence constructed on other Side of building ",
            "IsEnabled": true,
            "IsVideo": false,
            "IsFeaturedItem": false,
            "IsExternalResource": false,
            "User": {
                "ID": 1043,
                "Username": "g4qber"
            },
            "DateCreated": "2013-11-17T07:51:00Z"
        },
        {
            "ID": 154,
            "ChargePointID": 16672,
            "ItemURL": "https://s3-ap-southeast-2.amazonaws.com/openchargemap/images/AU/OCM16672/OCM-16672.orig.2013111707495669.jpg",
            "ItemThumbnailURL": "https://s3-ap-southeast-2.amazonaws.com/openchargemap/images/AU/OCM16672/OCM-16672.thmb.2013111707495669.jpg",
            "Comment": "Bollard now has power 2",
            "IsEnabled": true,
            "IsVideo": false,
            "IsFeaturedItem": false,
            "IsExternalResource": false,
            "User": {
                "ID": 1043,
                "Username": "g4qber"
            },
            "DateCreated": "2013-11-17T07:50:00Z"
        },
        {
            "ID": 153,
            "ChargePointID": 16672,
            "ItemURL": "https://s3-ap-southeast-2.amazonaws.com/openchargemap/images/AU/OCM16672/OCM-16672.orig.2013111707482743.jpg",
            "ItemThumbnailURL": "https://s3-ap-southeast-2.amazonaws.com/openchargemap/images/AU/OCM16672/OCM-16672.thmb.2013111707482743.jpg",
            "Comment": "Bollard now has power ",
            "IsEnabled": true,
            "IsVideo": false,
            "IsFeaturedItem": false,
            "IsExternalResource": false,
            "User": {
                "ID": 1043,
                "Username": "g4qber"
            },
            "DateCreated": "2013-11-17T07:49:00Z"
        },
        {
            "ID": 113,
            "ChargePointID": 16672,
            "ItemURL": "https://s3-ap-southeast-2.amazonaws.com/openchargemap/images/AU/OCM16672/OCM-16672.orig.2013101209360834.jpg",
            "ItemThumbnailURL": "https://s3-ap-southeast-2.amazonaws.com/openchargemap/images/AU/OCM16672/OCM-16672.thmb.2013101209360834.jpg",
            "Comment": "Dead bollard ",
            "IsEnabled": true,
            "IsVideo": false,
            "IsFeaturedItem": false,
            "IsExternalResource": false,
            "User": {
                "ID": 1043,
                "Username": "g4qber"
            },
            "DateCreated": "2013-10-12T09:36:00Z"
        }
    ],
    "IsRecentlyVerified": false,
    "ID": 16672,
    "UUID": "EE8D29F4-F1D1-4121-9A99-4061ED3DE7E4",
    "DataProviderID": 1,
    "OperatorID": 1,
    "UsageTypeID": 1,
    "UsageCost": "Free",
    "AddressInfo": {
        "ID": 17017,
        "Title": "Murdoch University",
        "AddressLine1": "Murdoch Drive",
        "AddressLine2": "",
        "Town": "Murdoch",
        "StateOrProvince": "WA",
        "Postcode": "6150",
        "CountryID": 18,
        "Latitude": -32.069294756142725,
        "Longitude": 115.84106574515033,
        "ContactTelephone1": "64881763",
        "ContactTelephone2": "",
        "ContactEmail": "rev@therevproject.com",
        "AccessComments": "",
        "RelatedURL": "http://therevproject.com/charging",
        "DistanceUnit": 0
    },
    "Connections": [
        {
            "ID": 15123,
            "ConnectionTypeID": 25,
            "StatusTypeID": 10,
            "LevelID": 2,
            "Amps": 32,
            "Voltage": 240,
            "PowerKW": 4.8,
            "CurrentTypeID": 10,
            "Quantity": 2
        }
    ],
    "NumberOfPoints": 2,
    "GeneralComments": " Requires free access tag available from The REV Project",
    "StatusTypeID": 50,
    "DateLastStatusUpdate": "2021-10-13T06:01:00Z",
    "DataQualityLevel": 1,
    "DateCreated": "2013-05-29T01:12:00Z",
    "SubmissionStatusTypeID": 200
}