{
    "IsRecentlyVerified": false,
    "ID": 133413,
    "UUID": "AC375047-EDB7-4CB4-AE7B-95A614C54024",
    "DataProviderID": 1,
    "OperatorID": 23,
    "OperatorsReference": "52153",
    "UsageTypeID": 4,
    "AddressInfo": {
        "ID": 133759,
        "Title": "La Serena Villas",
        "AddressLine1": "339 S Belardo RD",
        "Town": "Palm Springs",
        "StateOrProvince": "California",
        "Postcode": "92262",
        "CountryID": 2,
        "Latitude": 33.818865,
        "Longitude": -116.54812,
        "ContactTelephone1": "(844) 932-8044",
        "DistanceUnit": 0
    },
    "Connections": [
        {
            "ID": 186771,
            "ConnectionTypeID": 30,
            "StatusTypeID": 50,
            "LevelID": 2,
            "PowerKW": 8,
            "CurrentTypeID": 20,
            "Quantity": 2
        }
    ],
    "NumberOfPoints": 2,
    "GeneralComments": "2 Tesla Connectors, up to 8kW.Available for customers. Self park.",
    "StatusTypeID": 50,
    "DateLastStatusUpdate": "2019-10-18T05:51:00Z",
    "DataQualityLevel": 1,
    "DateCreated": "2019-10-18T05:51:00Z",
    "SubmissionStatusTypeID": 200
}