{
    "IsRecentlyVerified": false,
    "ID": 154153,
    "UUID": "71C72DF3-8A9B-4926-AE37-A2BB42739460",
    "DataProviderID": 28,
    "DataProvidersReference": "FR*S27*PSTPIERREFLEURS*INTER",
    "UsageTypeID": 5,
    "AddressInfo": {
        "ID": 154506,
        "Title": "900102",
        "AddressLine1": "Parking Intermarché St Pierre des Fleurs",
        "CountryID": 80,
        "Latitude": 49.248376,
        "Longitude": 0.962192,
        "AccessComments": "24/24 7/7 jours",
        "DistanceUnit": 0
    },
    "Connections": [
        {
            "ID": 216663,
            "ConnectionTypeID": 28,
            "StatusTypeID": 50,
            "LevelID": 2,
            "PowerKW": 22,
            "CurrentTypeID": 10
        },
        {
            "ID": 216664,
            "ConnectionTypeID": 1036,
            "StatusTypeID": 50,
            "LevelID": 2,
            "PowerKW": 22,
            "CurrentTypeID": 20
        },
        {
            "ID": 251020,
            "ConnectionTypeID": 28,
            "StatusTypeID": 50,
            "LevelID": 2,
            "PowerKW": 22,
            "CurrentTypeID": 10
        },
        {
            "ID": 251021,
            "ConnectionTypeID": 1036,
            "StatusTypeID": 50,
            "LevelID": 2,
            "PowerKW": 22,
            "CurrentTypeID": 20
        }
    ],
    "GeneralComments": "Borne en service",
    "StatusTypeID": 50,
    "DateLastStatusUpdate": "2020-08-27T05:16:00Z",
    "DataQualityLevel": 2,
    "DateCreated": "2020-03-15T10:54:00Z",
    "SubmissionStatusTypeID": 100
}