{
    "IsRecentlyVerified": false,
    "ID": 184915,
    "UUID": "78E096D2-1C81-47C3-ABA0-C1787478D7CD",
    "DataProviderID": 29,
    "DataProvidersReference": "4630",
    "AddressInfo": {
        "ID": 185274,
        "Title": "Möncheplatz",
        "AddressLine1": "Möncheplatz",
        "Town": "Einbeck",
        "Postcode": "37574",
        "CountryID": 87,
        "Latitude": 51.8181222,
        "Longitude": 9.8698222,
        "DistanceUnit": 0
    },
    "Connections": [
        {
            "ID": 293775,
            "ConnectionTypeID": 25,
            "StatusTypeID": 50,
            "LevelID": 2,
            "PowerKW": 22,
            "CurrentTypeID": 20
        },
        {
            "ID": 293776,
            "ConnectionTypeID": 25,
            "StatusTypeID": 50,
            "LevelID": 2,
            "PowerKW": 22,
            "CurrentTypeID": 20
        }
    ],
    "StatusTypeID": 50,
    "DateLastStatusUpdate": "2021-07-12T02:48:00Z",
    "MetadataValues": [
        {
            "ID": 17206,
            "MetadataFieldID": 4,
            "ItemValue": "Data from the German chargepoint registry provided by Bundesnetzagentur.de under the CC-BY 4.0 license"
        }
    ],
    "DataQualityLevel": 3,
    "DateCreated": "2021-07-08T10:06:00Z",
    "SubmissionStatusTypeID": 100
}