{
    "IsRecentlyVerified": false,
    "ID": 33763,
    "UUID": "E43153A5-55F4-441F-B4BE-83C1D4717709",
    "DataProviderID": 26,
    "DataProvidersReference": "49743",
    "OperatorID": 73,
    "OperatorsReference": "EV-Box EVB-P1402279",
    "UsageCost": "0.00 jaarabonnement",
    "AddressInfo": {
        "ID": 34109,
        "Title": "Provincialeweg Zuid 26",
        "AddressLine1": "Provincialeweg Zuid 26",
        "Town": "Woudrichem",
        "Postcode": "4286 LL",
        "CountryID": 159,
        "Latitude": 51.76542,
        "Longitude": 4.95604,
        "RelatedURL": "http://www.ev-box.nl",
        "DistanceUnit": 0
    },
    "Connections": [
        {
            "ID": 37274,
            "ConnectionTypeID": 25,
            "LevelID": 2,
            "PowerKW": 5,
            "CurrentTypeID": 10
        }
    ],
    "NumberOfPoints": 1,
    "StatusTypeID": 50,
    "DateLastStatusUpdate": "2016-06-04T02:40:00Z",
    "DataQualityLevel": 3,
    "DateCreated": "2015-01-09T06:04:00Z",
    "SubmissionStatusTypeID": 100
}