{
    "IsRecentlyVerified": false,
    "ID": 62512,
    "UUID": "E8B3D898-C39C-469F-85C1-969E6FD17007",
    "DataProviderID": 2,
    "DataProvidersReference": "73732",
    "UsageTypeID": 1,
    "AddressInfo": {
        "ID": 62858,
        "Title": "Bearskin Lodge",
        "AddressLine1": "124 E Bearskin Rd",
        "Town": "Grand Marais",
        "StateOrProvince": "MN",
        "Postcode": "55604",
        "CountryID": 2,
        "Latitude": 48.03553,
        "Longitude": -90.406713,
        "ContactTelephone1": "218-338-2292",
        "AccessComments": "24 hours daily; for guest use only; see front desk for access",
        "RelatedURL": "",
        "DistanceUnit": 0
    },
    "Connections": [
        {
            "ID": 79418,
            "ConnectionTypeID": 1,
            "LevelID": 2,
            "Amps": 16,
            "Voltage": 230,
            "PowerKW": 3,
            "CurrentTypeID": 10,
            "Quantity": 1
        }
    ],
    "DateLastStatusUpdate": "2019-04-06T05:07:00Z",
    "DataQualityLevel": 3,
    "DateCreated": "2016-03-03T11:39:00Z",
    "SubmissionStatusTypeID": 100
}