{
    "IsRecentlyVerified": false,
    "ID": 46871,
    "UUID": "2D236042-F48B-4240-AB39-3E939EBB3B02",
    "DataProviderID": 1,
    "OperatorID": 189,
    "UsageTypeID": 4,
    "AddressInfo": {
        "ID": 47217,
        "Title": "Haus zur Wildnis",
        "AddressLine1": "Bahnhofstraße 7",
        "Town": "Ludwigsthal",
        "Postcode": "94227",
        "CountryID": 87,
        "Latitude": 49.060180673063,
        "Longitude": 13.2363615436554,
        "AccessComments": "Auf dem beschrankten kostenpflichtigen Parkplatz, täglich von 9:30-17Uhr geöffnet, im Sommer (1.4-1.11) von 9-18Uhr.",
        "DistanceUnit": 0
    },
    "Connections": [
        {
            "ID": 57653,
            "ConnectionTypeID": 25,
            "StatusTypeID": 50,
            "LevelID": 2,
            "Amps": 32,
            "Voltage": 400,
            "PowerKW": 22,
            "CurrentTypeID": 20,
            "Quantity": 4
        },
        {
            "ID": 57654,
            "ConnectionTypeID": 28,
            "StatusTypeID": 50,
            "LevelID": 2,
            "Amps": 16,
            "Voltage": 230,
            "PowerKW": 3.7,
            "CurrentTypeID": 10,
            "Quantity": 4
        }
    ],
    "NumberOfPoints": 4,
    "StatusTypeID": 50,
    "DateLastStatusUpdate": "2015-05-08T21:43:00Z",
    "DataQualityLevel": 1,
    "DateCreated": "2015-05-08T20:55:00Z",
    "SubmissionStatusTypeID": 200
}