{
    "IsRecentlyVerified": false,
    "ID": 5929,
    "UUID": "CCCAA81D-E32F-448A-BE45-C29764BDDA99",
    "DataProviderID": 1,
    "OperatorID": 1,
    "UsageTypeID": 1,
    "AddressInfo": {
        "ID": 5851,
        "Title": "San Diega KOA",
        "AddressLine1": "111 N \"nd",
        "Town": "Chula Vista",
        "StateOrProvince": "California",
        "CountryID": 2,
        "Latitude": 32.6563582321296,
        "Longitude": -117.080698013305,
        "RelatedURL": "http://koa.com/campgrounds/san-diego/",
        "DistanceUnit": 0
    },
    "Connections": [
        {
            "ID": 676,
            "ConnectionTypeID": 11,
            "LevelID": 2,
            "Quantity": 1
        }
    ],
    "NumberOfPoints": 1,
    "StatusTypeID": 50,
    "DateLastStatusUpdate": "2011-04-19T00:00:00Z",
    "DateCreated": "2011-09-13T12:41:00Z",
    "SubmissionStatusTypeID": 200
}