{
    "IsRecentlyVerified": false,
    "ID": 173922,
    "UUID": "4AA4E558-466C-47A0-A30D-4C7CC2B8BD7F",
    "DataProviderID": 1,
    "OperatorID": 3,
    "OperatorsReference": "t54_hu1_4719_002",
    "UsageTypeID": 4,
    "UsageCost": "£0.25/kWh",
    "AddressInfo": {
        "ID": 174281,
        "Title": "Lidl-Enfield Wash",
        "AddressLine1": "654-658 Hertford Road",
        "Town": "Enfield",
        "Postcode": "EN3 6LZ",
        "CountryID": 1,
        "Latitude": 51.6717,
        "Longitude": -0.0404,
        "DistanceUnit": 0
    },
    "Connections": [
        {
            "ID": 267633,
            "ConnectionTypeID": 25,
            "StatusTypeID": 50,
            "LevelID": 2,
            "Amps": 32,
            "Voltage": 400,
            "PowerKW": 22,
            "CurrentTypeID": 20,
            "Quantity": 1
        },
        {
            "ID": 270000,
            "ConnectionTypeID": 33,
            "StatusTypeID": 50,
            "LevelID": 3,
            "PowerKW": 50,
            "CurrentTypeID": 30,
            "Quantity": 1
        },
        {
            "ID": 270023,
            "ConnectionTypeID": 2,
            "StatusTypeID": 50,
            "LevelID": 3,
            "PowerKW": 50,
            "CurrentTypeID": 30,
            "Quantity": 1
        }
    ],
    "NumberOfPoints": 2,
    "GeneralComments": "This is a Pod Point rapid charger installed at the Lidl super store at Hertford Road, Enfield",
    "StatusTypeID": 50,
    "DateLastStatusUpdate": "2021-03-25T15:50:00Z",
    "DataQualityLevel": 1,
    "DateCreated": "2021-03-07T06:22:00Z",
    "SubmissionStatusTypeID": 200
}