{
    "IsRecentlyVerified": false,
    "ID": 45115,
    "UUID": "0DDE1B62-746A-4598-B3EE-5933863221FD",
    "DataProviderID": 1,
    "OperatorID": 98,
    "UsageTypeID": 4,
    "AddressInfo": {
        "ID": 45461,
        "Title": "Turbinenhalle",
        "AddressLine1": "Schildescher Straße 16",
        "Town": "Bielefeld",
        "Postcode": "33611",
        "CountryID": 87,
        "Latitude": 52.0338627,
        "Longitude": 8.53861110000003,
        "ContactTelephone1": "+49521 5190",
        "AccessComments": "2 kostenlose Parkplätze auf dem Parkplatz der Turbinenhalle bei Tor 2.",
        "DistanceUnit": 0
    },
    "Connections": [
        {
            "ID": 55546,
            "ConnectionTypeID": 16,
            "StatusTypeID": 50,
            "LevelID": 2,
            "Amps": 16,
            "Voltage": 230,
            "PowerKW": 3.7,
            "CurrentTypeID": 10,
            "Quantity": 1
        },
        {
            "ID": 55547,
            "ConnectionTypeID": 17,
            "StatusTypeID": 50,
            "LevelID": 2,
            "Amps": 16,
            "Voltage": 400,
            "PowerKW": 11,
            "CurrentTypeID": 20,
            "Quantity": 1
        },
        {
            "ID": 55548,
            "ConnectionTypeID": 28,
            "StatusTypeID": 50,
            "LevelID": 2,
            "Amps": 16,
            "Voltage": 230,
            "PowerKW": 3.7,
            "CurrentTypeID": 10,
            "Quantity": 1
        }
    ],
    "NumberOfPoints": 3,
    "StatusTypeID": 50,
    "DateLastStatusUpdate": "2015-04-25T14:03:00Z",
    "DataQualityLevel": 1,
    "DateCreated": "2015-04-25T10:55:00Z",
    "SubmissionStatusTypeID": 200
}