{
    "IsRecentlyVerified": false,
    "ID": 130781,
    "UUID": "9E8CE35C-EB7F-4073-B796-B75A5A5D1A5C",
    "DataProviderID": 1,
    "OperatorID": 150,
    "OperatorsReference": "GP10808",
    "UsageTypeID": 4,
    "UsageCost": "£1.00+£0.30/kWh+£10.00 overstay fee every 95 mins",
    "AddressInfo": {
        "ID": 131127,
        "Title": "Sydney House Car Park",
        "AddressLine1": "South Street",
        "Town": "Torrington",
        "StateOrProvince": "Devon",
        "Postcode": "EX38 8AB",
        "CountryID": 1,
        "Latitude": 50.9507746034522,
        "Longitude": -4.144754099172474,
        "RelatedURL": "https://www.geniepoint.co.uk/ds",
        "DistanceUnit": 0
    },
    "Connections": [
        {
            "ID": 183107,
            "ConnectionTypeID": 2,
            "Reference": "1",
            "StatusTypeID": 50,
            "LevelID": 3,
            "PowerKW": 50,
            "CurrentTypeID": 30,
            "Quantity": 1
        },
        {
            "ID": 183154,
            "ConnectionTypeID": 1036,
            "StatusTypeID": 50,
            "LevelID": 3,
            "Amps": 63,
            "Voltage": 400,
            "PowerKW": 43,
            "CurrentTypeID": 20,
            "Quantity": 1
        },
        {
            "ID": 183155,
            "ConnectionTypeID": 33,
            "StatusTypeID": 50,
            "LevelID": 3,
            "PowerKW": 50,
            "CurrentTypeID": 30,
            "Quantity": 1
        }
    ],
    "GeneralComments": "Access via RFID or mobile phone app. Pre-Pay account required.",
    "StatusTypeID": 50,
    "DateLastStatusUpdate": "2020-10-07T14:14:00Z",
    "MetadataValues": [
        {
            "ID": 4870,
            "MetadataFieldID": 4,
            "ItemValue": "Contains public sector information licensed under the Open Government Licence v2.0. http://www.nationalarchives.gov.uk/doc/open-government-licence/version/2/"
        }
    ],
    "DataQualityLevel": 3,
    "DateCreated": "2019-08-16T17:25:00Z",
    "SubmissionStatusTypeID": 200
}