{
    "IsRecentlyVerified": false,
    "ID": 121086,
    "UUID": "B4888F1D-622D-495C-B858-FDF59573D90D",
    "DataProviderID": 2,
    "DataProvidersReference": "53719",
    "UsageTypeID": 7,
    "AddressInfo": {
        "ID": 121432,
        "Title": "Fairway Ford",
        "AddressLine1": "1350 E Yorba Linda Blvd",
        "Town": "Placentia",
        "StateOrProvince": "CA",
        "Postcode": "92870",
        "CountryID": 2,
        "Latitude": 33.887622,
        "Longitude": -117.838402,
        "ContactTelephone1": "714-524-1200",
        "AccessComments": "Dealership business hours; for customer use only\r\nPublic - Call ahead",
        "RelatedURL": "",
        "DistanceUnit": 0
    },
    "Connections": [
        {
            "ID": 170515,
            "ConnectionTypeID": 1,
            "LevelID": 2,
            "Amps": 16,
            "Voltage": 230,
            "PowerKW": 3.7,
            "CurrentTypeID": 10,
            "Quantity": 1
        }
    ],
    "DateLastStatusUpdate": "2020-06-26T02:56:00Z",
    "DataQualityLevel": 3,
    "DateCreated": "2019-04-01T04:59:00Z",
    "SubmissionStatusTypeID": 100
}