{
    "IsRecentlyVerified": false,
    "ID": 42000,
    "UUID": "77CF1B6B-EDCF-4D11-BA5A-8A5A2BC2AEDE",
    "DataProviderID": 2,
    "DataProvidersReference": "65654",
    "OperatorID": 5,
    "UsageTypeID": 1,
    "AddressInfo": {
        "ID": 42346,
        "Title": "MCDOT-PARKING",
        "AddressLine1": "7171 Woodmont Ave",
        "Town": "Bethesda",
        "StateOrProvince": "MD",
        "Postcode": "20815",
        "CountryID": 2,
        "Latitude": 38.980734,
        "Longitude": -77.094417,
        "ContactTelephone1": "888-758-4389",
        "AccessComments": "24 hours daily",
        "RelatedURL": "http://www.chargepoint.com/",
        "DistanceUnit": 0
    },
    "Connections": [
        {
            "ID": 50373,
            "ConnectionTypeID": 1,
            "LevelID": 2,
            "Amps": 16,
            "Voltage": 230,
            "PowerKW": 3.7,
            "CurrentTypeID": 10,
            "Quantity": 4
        }
    ],
    "DateLastStatusUpdate": "2020-06-26T03:01:00Z",
    "DataQualityLevel": 3,
    "DateCreated": "2015-02-23T02:09:00Z",
    "SubmissionStatusTypeID": 100
}