{
    "IsRecentlyVerified": false,
    "ID": 92871,
    "UUID": "14BFABB0-B88D-4180-BCEB-35D8C28A60CE",
    "DataProviderID": 1,
    "OperatorID": 3,
    "OperatorsReference": "PG-81288",
    "UsageTypeID": 6,
    "UsageCost": "Free",
    "AddressInfo": {
        "ID": 93217,
        "Title": "PCP Gratings LTD",
        "AddressLine1": "Enterprise Drive",
        "Town": "Wolverhampton",
        "Postcode": "WV10 7DF",
        "CountryID": 1,
        "Latitude": 52.673197,
        "Longitude": -2.11958,
        "DistanceUnit": 0
    },
    "Connections": [
        {
            "ID": 131545,
            "ConnectionTypeID": 25,
            "StatusTypeID": 50,
            "LevelID": 2,
            "Amps": 32,
            "Voltage": 230,
            "PowerKW": 7,
            "CurrentTypeID": 10,
            "Quantity": 2
        }
    ],
    "NumberOfPoints": 2,
    "GeneralComments": "This is an open charge unit installed at the PcP Gratings Ltd site in Enterprise Drive, Four Ashes, Wolverhampton",
    "StatusTypeID": 50,
    "DateLastStatusUpdate": "2017-09-13T05:29:00Z",
    "DataQualityLevel": 1,
    "DateCreated": "2017-09-13T05:29:00Z",
    "SubmissionStatusTypeID": 200
}