{
    "IsRecentlyVerified": false,
    "ID": 169347,
    "UUID": "7781340E-2BFC-406B-905A-40A5213211C5",
    "DataProviderID": 1,
    "OperatorID": 3,
    "OperatorsReference": "PG-70210,PG-84333",
    "UsageTypeID": 4,
    "UsageCost": "Free",
    "AddressInfo": {
        "ID": 169706,
        "Title": "Tesco Superstore-Guildford",
        "AddressLine1": "Ashenden Road",
        "Town": "Guildford",
        "Postcode": "GU2 7UN",
        "CountryID": 1,
        "Latitude": 51.241705,
        "Longitude": -0.604034,
        "DistanceUnit": 0
    },
    "Connections": [
        {
            "ID": 257665,
            "ConnectionTypeID": 25,
            "StatusTypeID": 50,
            "LevelID": 2,
            "Amps": 32,
            "Voltage": 230,
            "PowerKW": 7,
            "CurrentTypeID": 10,
            "Quantity": 4
        }
    ],
    "NumberOfPoints": 4,
    "GeneralComments": "This is an open charge unit installed at the Tesco super store at Ashenden Road, Guildford",
    "StatusTypeID": 50,
    "DateLastStatusUpdate": "2020-10-15T21:57:00Z",
    "DataQualityLevel": 1,
    "DateCreated": "2020-10-15T21:33:00Z",
    "SubmissionStatusTypeID": 200
}