{
    "IsRecentlyVerified": false,
    "ID": 93936,
    "UUID": "FA470748-F82D-4F1E-8210-AE3C74E1258F",
    "DataProviderID": 1,
    "OperatorID": 220,
    "OperatorsReference": "0251,0252,0253",
    "UsageTypeID": 1,
    "UsageCost": "€1.73 + €0.3213/kWh; Andere Tarife möglich",
    "AddressInfo": {
        "ID": 94282,
        "Title": "Zeughausmarkt 19",
        "AddressLine1": "Zeughausmarkt 19",
        "Town": "Mitte",
        "StateOrProvince": "Hamburg",
        "Postcode": "20459",
        "CountryID": 87,
        "Latitude": 53.54926,
        "Longitude": 9.97471,
        "DistanceUnit": 0
    },
    "Connections": [
        {
            "ID": 132972,
            "ConnectionTypeID": 33,
            "StatusTypeID": 50,
            "LevelID": 3,
            "PowerKW": 50,
            "CurrentTypeID": 30,
            "Quantity": 1
        },
        {
            "ID": 135829,
            "ConnectionTypeID": 2,
            "StatusTypeID": 50,
            "LevelID": 3,
            "PowerKW": 50,
            "CurrentTypeID": 30,
            "Quantity": 1
        },
        {
            "ID": 135830,
            "ConnectionTypeID": 25,
            "StatusTypeID": 50,
            "LevelID": 2,
            "Amps": 16,
            "Voltage": 400,
            "PowerKW": 11,
            "CurrentTypeID": 20,
            "Quantity": 1
        }
    ],
    "NumberOfPoints": 1,
    "StatusTypeID": 50,
    "DateLastStatusUpdate": "2017-12-25T06:34:00Z",
    "DataQualityLevel": 1,
    "DateCreated": "2017-10-13T05:47:00Z",
    "SubmissionStatusTypeID": 200
}