{
    "IsRecentlyVerified": false,
    "ID": 72231,
    "UUID": "3B4A9BF2-A699-47AA-84FD-54D7BB86A9B9",
    "DataProviderID": 2,
    "DataProvidersReference": "78310",
    "UsageTypeID": 1,
    "AddressInfo": {
        "ID": 72577,
        "Title": "Highland Green Building",
        "AddressLine1": "1401 Bardstown Rd",
        "Town": "Louisville",
        "StateOrProvince": "KY",
        "Postcode": "40204",
        "CountryID": 2,
        "Latitude": 38.233387,
        "Longitude": -85.711472,
        "ContactTelephone1": "502-454-4641",
        "AccessComments": "24 hours daily",
        "RelatedURL": "",
        "DistanceUnit": 0
    },
    "Connections": [
        {
            "ID": 103534,
            "ConnectionTypeID": 1,
            "LevelID": 2,
            "Amps": 16,
            "Voltage": 230,
            "PowerKW": 3,
            "CurrentTypeID": 10,
            "Quantity": 1
        }
    ],
    "DateLastStatusUpdate": "2019-04-06T04:02:00Z",
    "DataQualityLevel": 3,
    "DateCreated": "2016-10-09T02:45:00Z",
    "SubmissionStatusTypeID": 100
}