{
    "IsRecentlyVerified": false,
    "ID": 89641,
    "UUID": "7F6E7E72-0C2D-40C2-8F71-106A2DA6D9C1",
    "DataProviderID": 2,
    "DataProvidersReference": "82341",
    "UsageTypeID": 1,
    "AddressInfo": {
        "ID": 89987,
        "Title": "Thomas Edison National Historical Park",
        "AddressLine1": "200 Main St",
        "Town": "West Orange",
        "StateOrProvince": "NJ",
        "Postcode": "07052",
        "CountryID": 2,
        "Latitude": 40.784345,
        "Longitude": -74.233886,
        "ContactTelephone1": "973-736-0550 x11",
        "AccessComments": "24 hours daily",
        "RelatedURL": "",
        "DistanceUnit": 0
    },
    "Connections": [
        {
            "ID": 127062,
            "ConnectionTypeID": 1,
            "LevelID": 2,
            "Amps": 16,
            "Voltage": 230,
            "PowerKW": 3.7,
            "CurrentTypeID": 10,
            "Quantity": 4
        }
    ],
    "DateLastStatusUpdate": "2020-06-26T03:03:00Z",
    "DataQualityLevel": 3,
    "DateCreated": "2017-06-22T08:16:00Z",
    "SubmissionStatusTypeID": 100
}