{
    "IsRecentlyVerified": false,
    "ID": 125777,
    "UUID": "83AD385E-040E-4ECF-B302-FD66FEF17FBD",
    "DataProviderID": 1,
    "OperatorID": 72,
    "UsageTypeID": 1,
    "AddressInfo": {
        "ID": 126123,
        "Title": "Peter-Hausmann-Platz",
        "AddressLine1": "Peter-Hausmann-Platz 1",
        "Town": "Bornheim",
        "Postcode": "53332",
        "CountryID": 87,
        "Latitude": 50.76317065509,
        "Longitude": 6.9881968219031,
        "DistanceUnit": 0
    },
    "Connections": [
        {
            "ID": 176248,
            "ConnectionTypeID": 25,
            "StatusTypeID": 50,
            "LevelID": 2,
            "PowerKW": 22,
            "Quantity": 2
        }
    ],
    "NumberOfPoints": 2,
    "GeneralComments": "Direkt an der Einfahrt zum Parkplatz auf der linken Seite. TankE App oder Ad-Hoc. Zwei Stunden parken mit Parkscheibe.",
    "StatusTypeID": 50,
    "DateLastStatusUpdate": "2019-04-26T10:28:00Z",
    "DataQualityLevel": 1,
    "DateCreated": "2019-04-26T08:12:00Z",
    "SubmissionStatusTypeID": 200
}