{
    "IsRecentlyVerified": false,
    "ID": 126881,
    "UUID": "790D176B-3AE7-4725-B39C-9DE5C918A2EC",
    "DataProviderID": 1,
    "OperatorID": 23,
    "OperatorsReference": "50249",
    "UsageTypeID": 4,
    "AddressInfo": {
        "ID": 127227,
        "Title": "Station Service Avia Honiby",
        "AddressLine1": "4 Avenue Baudin",
        "Town": "Limoges",
        "StateOrProvince": "0",
        "Postcode": "87000",
        "CountryID": 80,
        "Latitude": 45.826962,
        "Longitude": 1.259027,
        "ContactTelephone1": "+33 8 00 94 10 29",
        "DistanceUnit": 0
    },
    "Connections": [
        {
            "ID": 177711,
            "ConnectionTypeID": 30,
            "StatusTypeID": 50,
            "LevelID": 2,
            "PowerKW": 11,
            "CurrentTypeID": 20,
            "Quantity": 1
        }
    ],
    "NumberOfPoints": 1,
    "GeneralComments": "1 Tesla Connector, up to 11kW.Available for customers. Self park.",
    "StatusTypeID": 50,
    "DateLastStatusUpdate": "2019-05-22T05:32:00Z",
    "DataQualityLevel": 1,
    "DateCreated": "2019-05-22T05:32:00Z",
    "SubmissionStatusTypeID": 200
}