{
    "IsRecentlyVerified": false,
    "ID": 160080,
    "UUID": "28C58CAA-EF6B-4693-A4B7-A0CFE4040DFD",
    "DataProviderID": 2,
    "DataProvidersReference": "156045",
    "OperatorID": 3372,
    "UsageTypeID": 1,
    "AddressInfo": {
        "ID": 160437,
        "Title": "Union College - Nott/Lennox Lot",
        "AddressLine1": "894 Nott St",
        "Town": "Schenectady",
        "StateOrProvince": "NY",
        "Postcode": "12308",
        "CountryID": 2,
        "Latitude": 42.819693,
        "Longitude": -73.924193,
        "ContactTelephone1": "866-816-7584",
        "AccessComments": "24 hours daily",
        "RelatedURL": "http://evconnect.com/",
        "DistanceUnit": 0
    },
    "Connections": [
        {
            "ID": 230316,
            "ConnectionTypeID": 1,
            "LevelID": 2,
            "Amps": 16,
            "Voltage": 230,
            "PowerKW": 3.7,
            "CurrentTypeID": 10,
            "Quantity": 4
        }
    ],
    "StatusTypeID": 50,
    "DateLastStatusUpdate": "2020-06-26T03:06:00Z",
    "DataQualityLevel": 3,
    "DateCreated": "2020-06-26T03:06:00Z",
    "SubmissionStatusTypeID": 100
}