{
    "IsRecentlyVerified": false,
    "ID": 139093,
    "UUID": "2D8F5F50-5F07-4050-8D06-A2A2333E1ED3",
    "DataProviderID": 2,
    "DataProvidersReference": "76939",
    "OperatorID": 5,
    "UsageTypeID": 1,
    "AddressInfo": {
        "ID": 139445,
        "Title": "PIMA 1B",
        "AddressLine1": "9150 E Del Camino Dr",
        "Town": "Scottsdale",
        "StateOrProvince": "AZ",
        "Postcode": "85258",
        "CountryID": 2,
        "Latitude": 33.5556743,
        "Longitude": -111.8862121,
        "ContactTelephone1": "888-758-4389",
        "AccessComments": "24 hours daily",
        "RelatedURL": "http://www.chargepoint.com/",
        "DistanceUnit": 0
    },
    "Connections": [
        {
            "ID": 194350,
            "ConnectionTypeID": 1,
            "LevelID": 2,
            "Amps": 16,
            "Voltage": 230,
            "PowerKW": 3.7,
            "CurrentTypeID": 10,
            "Quantity": 2
        }
    ],
    "StatusTypeID": 50,
    "DateLastStatusUpdate": "2020-06-26T02:55:00Z",
    "DataQualityLevel": 3,
    "DateCreated": "2019-12-24T09:10:00Z",
    "SubmissionStatusTypeID": 100
}