{
    "IsRecentlyVerified": false,
    "ID": 47426,
    "UUID": "08505208-71A1-49A6-8D26-EBA4398539F5",
    "DataProviderID": 2,
    "DataProvidersReference": "67158",
    "OperatorID": 5,
    "UsageTypeID": 1,
    "AddressInfo": {
        "ID": 47772,
        "Title": "SCCC",
        "AddressLine1": "701 County Rd 106",
        "Town": "Brentwood",
        "StateOrProvince": "NY",
        "Postcode": "11717",
        "CountryID": 2,
        "Latitude": 40.7964399,
        "Longitude": -73.2727933,
        "ContactTelephone1": "888-758-4389",
        "AccessComments": "24 hours daily",
        "RelatedURL": "http://www.chargepoint.com/",
        "DistanceUnit": 0
    },
    "Connections": [
        {
            "ID": 58465,
            "ConnectionTypeID": 1,
            "LevelID": 2,
            "Amps": 16,
            "Voltage": 230,
            "PowerKW": 3.7,
            "CurrentTypeID": 10,
            "Quantity": 4
        }
    ],
    "DateLastStatusUpdate": "2020-06-26T03:03:00Z",
    "DataQualityLevel": 3,
    "DateCreated": "2015-05-27T08:51:00Z",
    "SubmissionStatusTypeID": 100
}