{
    "IsRecentlyVerified": false,
    "ID": 35054,
    "UUID": "2C7A7469-7E0F-44C9-8CEA-C447D0C1F3C5",
    "DataProviderID": 26,
    "DataProvidersReference": "47272",
    "OperatorID": 178,
    "OperatorsReference": "EVnetNL AL428",
    "UsageCost": "0.00 jaarabonnement",
    "AddressInfo": {
        "ID": 35400,
        "Title": "Hagenweg",
        "AddressLine1": "Hagenweg",
        "Town": "Vianen",
        "Postcode": "4131 PN",
        "CountryID": 159,
        "Latitude": 51.989294,
        "Longitude": 5.109265,
        "ContactTelephone1": "0800-3522365",
        "RelatedURL": "http://www.evnet.nl",
        "DistanceUnit": 0
    },
    "Connections": [
        {
            "ID": 38565,
            "ConnectionTypeID": 25,
            "LevelID": 2,
            "PowerKW": 11,
            "CurrentTypeID": 10
        }
    ],
    "NumberOfPoints": 2,
    "StatusTypeID": 50,
    "DateLastStatusUpdate": "2016-06-04T02:43:00Z",
    "DataQualityLevel": 3,
    "DateCreated": "2015-01-09T06:04:00Z",
    "SubmissionStatusTypeID": 100
}