{
    "IsRecentlyVerified": false,
    "ID": 186688,
    "UUID": "21FCCE56-9695-4FD2-BFCF-40A77D95110B",
    "DataProviderID": 29,
    "DataProvidersReference": "4094",
    "AddressInfo": {
        "ID": 187047,
        "Title": "Bürener Straße 51",
        "AddressLine1": "Bürener Straße 51",
        "Town": "Drensteinfurt",
        "Postcode": "48317",
        "CountryID": 87,
        "Latitude": 51.7860401585041,
        "Longitude": 7.72999385803326,
        "DistanceUnit": 0
    },
    "Connections": [
        {
            "ID": 299888,
            "ConnectionTypeID": 25,
            "StatusTypeID": 50,
            "LevelID": 2,
            "PowerKW": 22,
            "CurrentTypeID": 20
        },
        {
            "ID": 299889,
            "ConnectionTypeID": 25,
            "StatusTypeID": 50,
            "LevelID": 2,
            "PowerKW": 22,
            "CurrentTypeID": 20
        }
    ],
    "StatusTypeID": 50,
    "DateLastStatusUpdate": "2021-07-12T02:48:00Z",
    "MetadataValues": [
        {
            "ID": 18929,
            "MetadataFieldID": 4,
            "ItemValue": "Data from the German chargepoint registry provided by Bundesnetzagentur.de under the CC-BY 4.0 license"
        }
    ],
    "DataQualityLevel": 3,
    "DateCreated": "2021-07-12T02:48:00Z",
    "SubmissionStatusTypeID": 100
}