{
    "IsRecentlyVerified": false,
    "ID": 52203,
    "UUID": "168D4214-22FF-4B50-9ADE-CC5E0B12A4BB",
    "DataProviderID": 1,
    "OperatorID": 156,
    "UsageTypeID": 4,
    "UsageCost": "0",
    "AddressInfo": {
        "ID": 52549,
        "Title": "The New Motion in Frankfurt am Main",
        "AddressLine1": "Camberger Straße 21",
        "Town": "Frankfurt am Main",
        "Postcode": "60327",
        "CountryID": 87,
        "Latitude": 50.1023801,
        "Longitude": 8.64559420000001,
        "DistanceUnit": 0
    },
    "Connections": [
        {
            "ID": 64815,
            "ConnectionTypeID": 25,
            "StatusTypeID": 50,
            "LevelID": 2,
            "Amps": 16,
            "Voltage": 230,
            "PowerKW": 3.7,
            "CurrentTypeID": 20,
            "Quantity": 1
        },
        {
            "ID": 64816,
            "ConnectionTypeID": 28,
            "StatusTypeID": 50,
            "LevelID": 2,
            "PowerKW": 3.7,
            "CurrentTypeID": 10,
            "Quantity": 0
        }
    ],
    "NumberOfPoints": 1,
    "StatusTypeID": 50,
    "DateLastStatusUpdate": "2015-08-23T21:01:00Z",
    "DataQualityLevel": 1,
    "DateCreated": "2015-08-23T11:24:00Z",
    "SubmissionStatusTypeID": 200
}