{
    "IsRecentlyVerified": false,
    "ID": 181574,
    "UUID": "6F19C41A-9310-4C4B-8178-A24ACCB1D562",
    "DataProviderID": 29,
    "DataProvidersReference": "18661",
    "OperatorID": 105,
    "AddressInfo": {
        "ID": 181933,
        "Title": "Ludewigstraße 68",
        "AddressLine1": "Ludewigstraße 68",
        "Town": "Wesseling",
        "Postcode": "50389",
        "CountryID": 87,
        "Latitude": 50.8157356,
        "Longitude": 6.9801703,
        "DistanceUnit": 0
    },
    "Connections": [
        {
            "ID": 286103,
            "ConnectionTypeID": 25,
            "StatusTypeID": 50,
            "LevelID": 2,
            "PowerKW": 22,
            "CurrentTypeID": 20
        },
        {
            "ID": 286104,
            "ConnectionTypeID": 25,
            "StatusTypeID": 50,
            "LevelID": 2,
            "PowerKW": 22,
            "CurrentTypeID": 20
        }
    ],
    "StatusTypeID": 50,
    "DateLastStatusUpdate": "2021-07-09T03:20:00Z",
    "MetadataValues": [
        {
            "ID": 13868,
            "MetadataFieldID": 4,
            "ItemValue": "Data from the German chargepoint registry provided by Bundesnetzagentur.de under the CC-BY 4.0 license"
        }
    ],
    "DataQualityLevel": 3,
    "DateCreated": "2021-07-08T10:02:00Z",
    "SubmissionStatusTypeID": 100
}