{
    "IsRecentlyVerified": false,
    "ID": 15448,
    "UUID": "34B097AB-46DF-4C59-9369-4039C7AE85F0",
    "DataProviderID": 1,
    "OperatorID": 51,
    "UsageTypeID": 0,
    "UsageCost": "Free",
    "AddressInfo": {
        "ID": 15794,
        "Title": "Kal Tire",
        "AddressLine1": "788 Mount Paul Way",
        "AddressLine2": "",
        "Town": "Kamloops",
        "StateOrProvince": "BC",
        "Postcode": "V2H 1B5",
        "CountryID": 44,
        "Latitude": 50.6925446,
        "Longitude": -120.32197020000001,
        "ContactTelephone1": "(250) 374-6258 ",
        "ContactTelephone2": "",
        "ContactEmail": "",
        "AccessComments": "charging only during business hours              Business Hours: Mon-Fri: 7:30am to 6:00pm Sat: 8:00am to 5:00pm",
        "RelatedURL": "http://www.kaltire.com/moduleinterface.php?page=location-finder&mact=Locations,m1_,detail,0,1&m1_loc_id=20#frommap",
        "DistanceUnit": 0
    },
    "Connections": [
        {
            "ID": 13757,
            "ConnectionTypeID": 1,
            "StatusTypeID": 0,
            "LevelID": 2,
            "Amps": 32,
            "Voltage": 240,
            "PowerKW": 7.7,
            "Quantity": 1
        }
    ],
    "NumberOfPoints": 1,
    "GeneralComments": "",
    "StatusTypeID": 50,
    "DateLastStatusUpdate": "2013-01-09T20:37:00Z",
    "DataQualityLevel": 1,
    "DateCreated": "2013-01-09T20:37:00Z",
    "SubmissionStatusTypeID": 200
}