{
    "IsRecentlyVerified": false,
    "ID": 65290,
    "UUID": "69D90C06-6E68-4294-994A-080FDCE2598C",
    "DataProviderID": 1,
    "OperatorID": 23,
    "OperatorsReference": "17057",
    "UsageTypeID": 6,
    "UsageCost": "Free",
    "AddressInfo": {
        "ID": 65636,
        "Title": "Hotel Manhattan Marriott",
        "AddressLine1": "Weena 686",
        "AddressLine2": "Rotterdam",
        "Town": "Rotterdam",
        "StateOrProvince": "MRDH",
        "Postcode": "3014 DB",
        "CountryID": 159,
        "Latitude": 51.9224229492324,
        "Longitude": 4.47158544940451,
        "ContactTelephone1": "+31 10 430 2000",
        "AccessComments": "Tesla Destination Charging.",
        "RelatedURL": "http://www.marriott.com/hotels/travel/rtmmn-the-manhattan-hotel-rotterdam",
        "DistanceUnit": 0
    },
    "Connections": [
        {
            "ID": 89907,
            "ConnectionTypeID": 30,
            "StatusTypeID": 50,
            "LevelID": 2,
            "Amps": 32,
            "Voltage": 400,
            "PowerKW": 22,
            "CurrentTypeID": 20,
            "Quantity": 2
        }
    ],
    "NumberOfPoints": 2,
    "StatusTypeID": 50,
    "DateLastStatusUpdate": "2018-10-03T23:46:00Z",
    "DataQualityLevel": 1,
    "DateCreated": "2016-04-26T09:08:00Z",
    "SubmissionStatusTypeID": 200
}