{
    "IsRecentlyVerified": false,
    "ID": 173440,
    "UUID": "519B165C-4427-4F17-9277-9D4A84FD224B",
    "DataProviderID": 18,
    "DataProvidersReference": "efb9833652b01e4834fd4226292f97b7",
    "OperatorID": 2244,
    "UsageTypeID": 1,
    "AddressInfo": {
        "ID": 173799,
        "Title": "33 Lawford Road",
        "AddressLine1": "33 Lawford Road",
        "Town": "London",
        "Postcode": "NW5 2LN",
        "CountryID": 1,
        "Latitude": -0.137781,
        "Longitude": 51.546512,
        "AccessComments": "",
        "RelatedURL": "https://www.ubitricity.com",
        "DistanceUnit": 0
    },
    "Connections": [
        {
            "ID": 266465,
            "ConnectionTypeID": 25,
            "Reference": "suby1100005038",
            "StatusTypeID": 50,
            "LevelID": 2,
            "Amps": 16,
            "Voltage": 230,
            "PowerKW": 3.7,
            "CurrentTypeID": 10
        }
    ],
    "StatusTypeID": 0,
    "DateLastStatusUpdate": "2021-07-12T03:38:00Z",
    "MetadataValues": [
        {
            "ID": 8362,
            "MetadataFieldID": 4,
            "ItemValue": "Contains public sector information licensed under the Open Government Licence v2.0. http://www.nationalarchives.gov.uk/doc/open-government-licence/version/2/"
        }
    ],
    "DataQualityLevel": 3,
    "DateCreated": "2021-03-03T11:25:00Z",
    "SubmissionStatusTypeID": 100
}