{
    "IsRecentlyVerified": false,
    "ID": 4280,
    "UUID": "8AEBE5A9-0FF1-4D47-A4DD-43AA92C8D26F",
    "DataProviderID": 2,
    "DataProvidersReference": "38931",
    "OperatorID": 5,
    "UsageTypeID": 1,
    "AddressInfo": {
        "ID": 4279,
        "Title": "ADOBE SAN JOSE",
        "AddressLine1": "321 Park Ave",
        "Town": "San Jose",
        "StateOrProvince": "CA",
        "Postcode": "95113",
        "CountryID": 2,
        "Latitude": 37.331291,
        "Longitude": -121.893395,
        "ContactTelephone1": "888-758-4389",
        "AccessComments": "24 hours daily",
        "RelatedURL": "http://www.chargepoint.com/",
        "DistanceUnit": 0
    },
    "Connections": [
        {
            "ID": 15661,
            "ConnectionTypeID": 1,
            "LevelID": 2,
            "Amps": 16,
            "Voltage": 230,
            "PowerKW": 3,
            "CurrentTypeID": 10,
            "Quantity": 39
        },
        {
            "ID": 15662,
            "ConnectionTypeID": 1,
            "LevelID": 2,
            "Amps": 16,
            "Voltage": 230,
            "PowerKW": 3,
            "CurrentTypeID": 10,
            "Quantity": 29
        },
        {
            "ID": 20620,
            "ConnectionTypeID": 1,
            "LevelID": 2,
            "Quantity": 26
        }
    ],
    "DateLastConfirmed": "2011-04-30T00:00:00Z",
    "StatusTypeID": 0,
    "DateLastStatusUpdate": "2019-12-24T09:13:00Z",
    "DataQualityLevel": 1,
    "DateCreated": "2011-05-09T14:58:00Z",
    "SubmissionStatusTypeID": 100
}