{
    "IsRecentlyVerified": false,
    "ID": 187466,
    "UUID": "B69E963C-03E9-46C2-B855-968C447A2B3F",
    "DataProviderID": 18,
    "DataProvidersReference": "707a5c2de322c63ded4bf2817d43beff",
    "OperatorID": 2244,
    "UsageTypeID": 5,
    "AddressInfo": {
        "ID": 187825,
        "Title": "46 Rosehill Road",
        "AddressLine1": "46 Rosehill Road",
        "Town": "London",
        "Postcode": "SW18 2NX",
        "CountryID": 1,
        "Latitude": -0.186754,
        "Longitude": 51.455114,
        "AccessComments": "",
        "RelatedURL": "https://www.ubitricity.com",
        "DistanceUnit": 0
    },
    "Connections": [
        {
            "ID": 302600,
            "ConnectionTypeID": 25,
            "Reference": "suby1100005389",
            "StatusTypeID": 50,
            "LevelID": 2,
            "Amps": 16,
            "Voltage": 230,
            "PowerKW": 3.7,
            "CurrentTypeID": 10
        }
    ],
    "StatusTypeID": 0,
    "DateLastStatusUpdate": "2021-07-12T03:38:00Z",
    "MetadataValues": [
        {
            "ID": 19706,
            "MetadataFieldID": 4,
            "ItemValue": "Contains public sector information licensed under the Open Government Licence v2.0. http://www.nationalarchives.gov.uk/doc/open-government-licence/version/2/"
        }
    ],
    "DataQualityLevel": 3,
    "DateCreated": "2021-07-12T03:38:00Z",
    "SubmissionStatusTypeID": 100
}