{
    "IsRecentlyVerified": false,
    "ID": 68299,
    "UUID": "D7DBB9B9-BA9E-4D6E-88E7-A6D2BB9BB93D",
    "DataProviderID": 26,
    "DataProvidersReference": "93299",
    "OperatorID": 157,
    "OperatorsReference": "NewMotion 03006911",
    "UsageCost": "0.00 jaarabonnement",
    "AddressInfo": {
        "ID": 68645,
        "Title": "Stuifweg",
        "AddressLine1": "Stuifweg",
        "Town": "Texel",
        "Postcode": "1794 HA",
        "CountryID": 159,
        "Latitude": 53.1149037,
        "Longitude": 4.8970803,
        "ContactTelephone1": "088 0109500",
        "RelatedURL": "http://thenewmotion.nl/",
        "DistanceUnit": 0
    },
    "Connections": [
        {
            "ID": 95217,
            "ConnectionTypeID": 25,
            "LevelID": 2,
            "PowerKW": 11,
            "CurrentTypeID": 10
        }
    ],
    "NumberOfPoints": 1,
    "StatusTypeID": 50,
    "DateLastStatusUpdate": "2016-06-04T02:37:00Z",
    "DataQualityLevel": 3,
    "DateCreated": "2016-06-04T02:37:00Z",
    "SubmissionStatusTypeID": 100
}