{
    "IsRecentlyVerified": false,
    "ID": 135436,
    "UUID": "4CDE5ACD-05E3-45A2-872C-6004AC52B79E",
    "DataProviderID": 1,
    "OperatorID": 1,
    "UsageTypeID": 1,
    "AddressInfo": {
        "ID": 135782,
        "Title": "Restaurante Tabaris, Esparza",
        "AddressLine1": "Avenida 13",
        "Town": "Esparza",
        "StateOrProvince": "Puntarenas",
        "Postcode": "60201",
        "CountryID": 58,
        "Latitude": 9.995322,
        "Longitude": -84.665048,
        "DistanceUnit": 0
    },
    "Connections": [
        {
            "ID": 189764,
            "ConnectionTypeID": 1,
            "StatusTypeID": 50,
            "LevelID": 2,
            "Amps": 32,
            "Voltage": 240,
            "PowerKW": 7.7,
            "CurrentTypeID": 10,
            "Quantity": 2
        }
    ],
    "NumberOfPoints": 2,
    "StatusTypeID": 50,
    "DateLastStatusUpdate": "2021-01-03T14:39:00Z",
    "DataQualityLevel": 1,
    "DateCreated": "2019-12-20T21:44:00Z",
    "SubmissionStatusTypeID": 200
}