{
    "IsRecentlyVerified": false,
    "ID": 94553,
    "UUID": "98194870-B378-46A8-98D6-133977413FC9",
    "DataProviderID": 1,
    "OperatorID": 23,
    "OperatorsReference": "36714",
    "UsageTypeID": 6,
    "AddressInfo": {
        "ID": 94899,
        "Title": "Hospedería Valle del Ambroz",
        "AddressLine1": "Plaza del Hospital",
        "Town": "s/n",
        "StateOrProvince": "Hervas",
        "Postcode": "10700",
        "CountryID": 210,
        "Latitude": 40.272757,
        "Longitude": -5.85582,
        "ContactTelephone1": "+34 927 474 828",
        "DistanceUnit": 0
    },
    "Connections": [
        {
            "ID": 133692,
            "ConnectionTypeID": 30,
            "StatusTypeID": 50,
            "LevelID": 2,
            "Amps": 32,
            "Voltage": 400,
            "PowerKW": 22,
            "CurrentTypeID": 20,
            "Quantity": 1
        }
    ],
    "NumberOfPoints": 1,
    "GeneralComments": "1 Tesla Connector, up to 22kW.Available for patrons only. Please call ahead.",
    "StatusTypeID": 50,
    "DateLastStatusUpdate": "2020-08-17T12:06:00Z",
    "DataQualityLevel": 1,
    "DateCreated": "2017-10-20T05:40:00Z",
    "SubmissionStatusTypeID": 200
}