{
    "IsRecentlyVerified": false,
    "ID": 2512,
    "UUID": "8736F2D8-D44B-4C6E-8B0F-5EACA87268E1",
    "DataProviderID": 2,
    "DataProvidersReference": "7286",
    "UsageTypeID": 1,
    "AddressInfo": {
        "ID": 2513,
        "Title": "Arden Fair Mall",
        "AddressLine1": "1689 Arden Way",
        "Town": "Sacramento",
        "StateOrProvince": "CA",
        "Postcode": "95815",
        "CountryID": 2,
        "Latitude": 38.599693,
        "Longitude": -121.427045,
        "ContactTelephone1": "916-920-1167",
        "AccessComments": "24 hours daily",
        "RelatedURL": "",
        "DistanceUnit": 0
    },
    "Connections": [
        {
            "ID": 12339,
            "ConnectionTypeID": 1,
            "LevelID": 2,
            "Amps": 16,
            "Voltage": 230,
            "PowerKW": 3,
            "CurrentTypeID": 10,
            "Quantity": 4
        },
        {
            "ID": 20148,
            "ConnectionTypeID": 1,
            "LevelID": 2,
            "Quantity": 3
        }
    ],
    "DateLastConfirmed": "2010-08-31T00:00:00Z",
    "StatusTypeID": 0,
    "DateLastStatusUpdate": "2019-04-06T04:03:00Z",
    "DataQualityLevel": 1,
    "DateCreated": "2010-08-31T00:00:00Z",
    "SubmissionStatusTypeID": 100
}