{
    "UserComments": [
        {
            "ID": 23291,
            "ChargePointID": 168492,
            "CommentTypeID": 10,
            "UserName": "Matteo",
            "Comment": "All right. Please do not charge over 10Amps.\r\nPhotovoltaic array installed on the roof.",
            "Rating": 4,
            "DateCreated": "2020-09-28T17:50:44.947Z",
            "User": {
                "ID": 19357,
                "Username": "Matteo"
            },
            "CheckinStatusTypeID": 10,
            "IsActionedByEditor": false
        }
    ],
    "MediaItems": [
        {
            "ID": 24816,
            "ChargePointID": 168492,
            "ItemURL": "https://s3-ap-southeast-2.amazonaws.com/openchargemap/images/IT/OCM168492/OCM-168492.orig.2020092817491062.jpg",
            "ItemThumbnailURL": "https://s3-ap-southeast-2.amazonaws.com/openchargemap/images/IT/OCM168492/OCM-168492.thmb.2020092817491062.jpg",
            "Comment": "",
            "IsEnabled": true,
            "IsVideo": false,
            "IsFeaturedItem": false,
            "IsExternalResource": false,
            "User": {
                "ID": 19357,
                "Username": "Matteo"
            },
            "DateCreated": "2020-09-28T17:49:00Z"
        },
        {
            "ID": 24815,
            "ChargePointID": 168492,
            "ItemURL": "https://s3-ap-southeast-2.amazonaws.com/openchargemap/images/IT/OCM168492/OCM-168492.orig.2020092817465556.jpg",
            "ItemThumbnailURL": "https://s3-ap-southeast-2.amazonaws.com/openchargemap/images/IT/OCM168492/OCM-168492.thmb.2020092817465556.jpg",
            "Comment": "",
            "IsEnabled": true,
            "IsVideo": false,
            "IsFeaturedItem": false,
            "IsExternalResource": false,
            "User": {
                "ID": 19357,
                "Username": "Matteo"
            },
            "DateCreated": "2020-09-28T17:47:00Z"
        }
    ],
    "IsRecentlyVerified": false,
    "ID": 168492,
    "UUID": "4D9F261C-DE7C-4BDB-9052-3A84964EC8FB",
    "DataProviderID": 1,
    "OperatorID": 1,
    "UsageTypeID": 6,
    "UsageCost": "0",
    "AddressInfo": {
        "ID": 168851,
        "Title": "Pesa di Nuvolato",
        "AddressLine1": "Via D. Semeghini, 88",
        "AddressLine2": "Nuvolato",
        "Town": "Quistello",
        "StateOrProvince": "MN",
        "Postcode": "46026",
        "CountryID": 112,
        "Latitude": 45.032738292474875,
        "Longitude": 11.00366125442531,
        "AccessComments": "Rest area along the road.\r\nArea di sosta sulla strada.",
        "RelatedURL": "http://www.comune.quistello.mn.it",
        "DistanceUnit": 0
    },
    "Connections": [
        {
            "ID": 255901,
            "ConnectionTypeID": 28,
            "StatusTypeID": 50,
            "LevelID": 1,
            "Amps": 10,
            "Voltage": 230,
            "PowerKW": 2.3,
            "CurrentTypeID": 10,
            "Quantity": 1
        }
    ],
    "NumberOfPoints": 1,
    "GeneralComments": "Schuko socket under the porch, behind the building. Max current 10A.",
    "StatusTypeID": 50,
    "DateLastStatusUpdate": "2020-09-28T17:51:00Z",
    "DataQualityLevel": 1,
    "DateCreated": "2020-09-28T15:13:00Z",
    "SubmissionStatusTypeID": 200
}