{
    "IsRecentlyVerified": false,
    "ID": 88783,
    "UUID": "C3FA57C6-2AE2-4497-9E54-89E06FD0D658",
    "DataProviderID": 1,
    "OperatorID": 23,
    "OperatorsReference": "30085",
    "UsageTypeID": 6,
    "AddressInfo": {
        "ID": 89129,
        "Title": "Akzent Hotel Moehringer Hof",
        "AddressLine1": "64-68 Hechingerstrasse",
        "Town": "Stuttgart-Moehringen",
        "Postcode": "70567",
        "CountryID": 87,
        "Latitude": 48.721367,
        "Longitude": 9.144882,
        "ContactTelephone1": "+49 711 719700",
        "DistanceUnit": 0
    },
    "Connections": [
        {
            "ID": 126031,
            "ConnectionTypeID": 30,
            "StatusTypeID": 50,
            "LevelID": 2,
            "Amps": 16,
            "Voltage": 400,
            "PowerKW": 11,
            "CurrentTypeID": 20,
            "Quantity": 2
        }
    ],
    "NumberOfPoints": 2,
    "GeneralComments": "2 Tesla Connectors, up to 11kW.Available for patrons only. Please see front desk.",
    "StatusTypeID": 50,
    "DateLastStatusUpdate": "2018-10-03T18:07:00Z",
    "DataQualityLevel": 1,
    "DateCreated": "2017-06-09T13:35:00Z",
    "SubmissionStatusTypeID": 200
}