{
    "IsRecentlyVerified": false,
    "ID": 169725,
    "UUID": "1F2B50F0-16F7-4B1E-B612-F82EA8508014",
    "DataProviderID": 1,
    "OperatorID": 150,
    "UsageTypeID": 4,
    "UsageCost": "£0.50 + £0.30 / kWh",
    "AddressInfo": {
        "ID": 170084,
        "Title": "Jordans & Co. Hull Workshop",
        "AddressLine1": "45-52 Witham",
        "Town": "Hull",
        "StateOrProvince": "England",
        "Postcode": "HU9 1BS",
        "CountryID": 1,
        "Latitude": 53.748843259192085,
        "Longitude": -0.32341451149829936,
        "ContactTelephone1": "+44 1482 824472",
        "RelatedURL": "https://www.geniepoint.co.uk/ds",
        "DistanceUnit": 0
    },
    "Connections": [
        {
            "ID": 258532,
            "ConnectionTypeID": 25,
            "StatusTypeID": 50,
            "LevelID": 2,
            "PowerKW": 22,
            "CurrentTypeID": 20,
            "Quantity": 2
        },
        {
            "ID": 258533,
            "ConnectionTypeID": 25,
            "StatusTypeID": 50,
            "LevelID": 2,
            "PowerKW": 22,
            "CurrentTypeID": 20,
            "Quantity": 2
        },
        {
            "ID": 258534,
            "ConnectionTypeID": 25,
            "StatusTypeID": 50,
            "LevelID": 2,
            "PowerKW": 22,
            "CurrentTypeID": 20,
            "Quantity": 1
        }
    ],
    "NumberOfPoints": 1,
    "StatusTypeID": 50,
    "DateLastStatusUpdate": "2020-11-04T19:57:00Z",
    "DataQualityLevel": 1,
    "DateCreated": "2020-11-04T19:57:00Z",
    "SubmissionStatusTypeID": 200
}