{
    "IsRecentlyVerified": false,
    "ID": 88952,
    "UUID": "FD5C35E5-B5D1-401C-A0D2-86A8CC815692",
    "DataProviderID": 1,
    "OperatorID": 3,
    "OperatorsReference": "PG-91378",
    "UsageTypeID": 6,
    "UsageCost": "Free",
    "AddressInfo": {
        "ID": 89298,
        "Title": "Bristol Accident Repair Centre LTD",
        "AddressLine1": "Environmental House Anthea Road",
        "Town": "Bristol",
        "Postcode": "BS5 7EX",
        "CountryID": 1,
        "Latitude": 51.458083,
        "Longitude": -2.563207,
        "DistanceUnit": 0
    },
    "Connections": [
        {
            "ID": 126236,
            "ConnectionTypeID": 25,
            "StatusTypeID": 50,
            "LevelID": 2,
            "Amps": 32,
            "Voltage": 230,
            "PowerKW": 7,
            "CurrentTypeID": 10,
            "Quantity": 1
        }
    ],
    "NumberOfPoints": 1,
    "GeneralComments": "This is an open charge unit installed at the Bristol Accident Repair Centre Ltd site in Anthea Road, Fishponds Trading Estate, Bristol",
    "StatusTypeID": 50,
    "DateLastStatusUpdate": "2017-06-13T11:23:00Z",
    "DataQualityLevel": 1,
    "DateCreated": "2017-06-13T11:23:00Z",
    "SubmissionStatusTypeID": 200
}