{
    "IsRecentlyVerified": false,
    "ID": 134095,
    "UUID": "70DF531E-E300-406A-9FF2-9189A30D5204",
    "DataProviderID": 1,
    "OperatorID": 3315,
    "OperatorsReference": "51960",
    "UsageTypeID": 4,
    "UsageCost": "Free",
    "AddressInfo": {
        "ID": 134441,
        "Title": "Balmacassie Recycling Centre, Ellon",
        "AddressLine1": "Balmacassie Brae",
        "Town": "Ellon",
        "Postcode": "AB41 9RY",
        "CountryID": 1,
        "Latitude": 57.3686,
        "Longitude": -2.04783,
        "DistanceUnit": 0
    },
    "Connections": [
        {
            "ID": 187634,
            "ConnectionTypeID": 25,
            "StatusTypeID": 50,
            "LevelID": 2,
            "Amps": 32,
            "Voltage": 400,
            "PowerKW": 22,
            "CurrentTypeID": 20,
            "Quantity": 2
        }
    ],
    "NumberOfPoints": 2,
    "StatusTypeID": 50,
    "DateLastStatusUpdate": "2019-11-03T06:19:00Z",
    "DataQualityLevel": 1,
    "DateCreated": "2019-11-03T06:19:00Z",
    "SubmissionStatusTypeID": 200
}