{
    "IsRecentlyVerified": false,
    "ID": 94759,
    "UUID": "E94986F1-184C-4581-A698-76FC5C9C6F5B",
    "DataProviderID": 1,
    "OperatorID": 45,
    "UsageTypeID": 1,
    "UsageCost": "Spende ~0,50€/kWh",
    "AddressInfo": {
        "ID": 95105,
        "Title": "Ladepunkt Weyhe",
        "AddressLine1": "Aachener Straße 51",
        "Town": "Weyhe",
        "StateOrProvince": "Landkreis Diepholz",
        "Postcode": "28844",
        "CountryID": 87,
        "Latitude": 52.98629182721838,
        "Longitude": 8.821787170617442,
        "ContactTelephone1": "+49 421 8097450",
        "AccessComments": "Wenn ein Fahrzeug auf dem Hof steht und Sie somit nicht an die Ladestation heran kommen können, bitte klingeln, Ich werde ihnen dann Platz machen. Aber bitte nicht nach 22 Uhr und nicht vor 8 Uhr! Die Ladestation befindet sich unterhalb der Haustreppe. Ladekabel Typ 2 ist 5m lang.\r\nIch stelle den Strom und die Infrastruktur zum Laden jedem zur Verfügung.  Für Investition und Reparatur bei möglichen Defekten verursacht durch Dritte, erbitte ich eine Spende. Richtschnur um die 0,50€ pro Kilowattstunde.",
        "DistanceUnit": 0
    },
    "Connections": [
        {
            "ID": 133944,
            "ConnectionTypeID": 25,
            "StatusTypeID": 50,
            "LevelID": 2,
            "Amps": 16,
            "Voltage": 400,
            "PowerKW": 11,
            "CurrentTypeID": 20,
            "Quantity": 1
        },
        {
            "ID": 133945,
            "ConnectionTypeID": 28,
            "StatusTypeID": 50,
            "LevelID": 1,
            "Amps": 10,
            "Voltage": 230,
            "PowerKW": 2.3,
            "CurrentTypeID": 10,
            "Quantity": 1
        }
    ],
    "NumberOfPoints": 2,
    "StatusTypeID": 50,
    "DateLastStatusUpdate": "2017-10-25T14:39:00Z",
    "DataQualityLevel": 1,
    "DateCreated": "2017-10-25T14:39:00Z",
    "SubmissionStatusTypeID": 200
}