{
    "IsRecentlyVerified": false,
    "ID": 139363,
    "UUID": "B21F9BED-6F30-4CC9-94FD-C512097642A0",
    "DataProviderID": 2,
    "DataProvidersReference": "118710",
    "OperatorID": 5,
    "UsageTypeID": 1,
    "AddressInfo": {
        "ID": 139715,
        "Title": "DLR",
        "AddressLine1": "1717 S Disneyland Drive",
        "Town": "Anaheim",
        "StateOrProvince": "CA",
        "Postcode": "92805",
        "CountryID": 2,
        "Latitude": 33.806146,
        "Longitude": -117.925031,
        "ContactTelephone1": "888-758-4389",
        "AccessComments": "24 hours daily",
        "RelatedURL": "http://www.chargepoint.com/",
        "DistanceUnit": 0
    },
    "Connections": [
        {
            "ID": 194688,
            "ConnectionTypeID": 1,
            "LevelID": 2,
            "Amps": 16,
            "Voltage": 230,
            "PowerKW": 3,
            "CurrentTypeID": 10,
            "Quantity": 4
        }
    ],
    "StatusTypeID": 50,
    "DateLastStatusUpdate": "2019-12-24T09:10:00Z",
    "DataQualityLevel": 3,
    "DateCreated": "2019-12-24T09:10:00Z",
    "SubmissionStatusTypeID": 100
}