{
    "IsRecentlyVerified": false,
    "ID": 136032,
    "UUID": "9C955B8A-D59F-4591-B9F6-8A13BFCE8A27",
    "DataProviderID": 18,
    "DataProvidersReference": "61cea591ead5535009b0263e32914472",
    "OperatorID": 2244,
    "UsageTypeID": 4,
    "AddressInfo": {
        "ID": 136378,
        "Title": "Compton Crescent",
        "AddressLine1": "Compton Crescent",
        "Town": "Chiswick, London",
        "Postcode": "W4 3JU",
        "CountryID": 1,
        "Latitude": 51.485482,
        "Longitude": -0.270502,
        "AccessComments": "",
        "RelatedURL": "https://www.ubitricity.com",
        "DistanceUnit": 0
    },
    "Connections": [
        {
            "ID": 190459,
            "ConnectionTypeID": 25,
            "Reference": "steob100000579",
            "StatusTypeID": 50,
            "LevelID": 2,
            "Amps": 16,
            "Voltage": 230,
            "PowerKW": 3.7,
            "CurrentTypeID": 10
        }
    ],
    "StatusTypeID": 0,
    "DateLastStatusUpdate": "2021-04-25T05:46:00Z",
    "MetadataValues": [
        {
            "ID": 5884,
            "MetadataFieldID": 4,
            "ItemValue": "Contains public sector information licensed under the Open Government Licence v2.0. http://www.nationalarchives.gov.uk/doc/open-government-licence/version/2/"
        }
    ],
    "DataQualityLevel": 3,
    "DateCreated": "2019-12-24T05:22:00Z",
    "SubmissionStatusTypeID": 100
}