{
    "IsRecentlyVerified": false,
    "ID": 88176,
    "UUID": "0B9E9352-C2A3-4CF4-B763-E6C344BC3AFF",
    "DataProviderID": 1,
    "OperatorID": 3,
    "OperatorsReference": "PG-91383",
    "UsageTypeID": 4,
    "UsageCost": "1",
    "AddressInfo": {
        "ID": 88522,
        "Title": "Big Yellow Self Storage-Oxford",
        "AddressLine1": "Unit A",
        "Town": "Taurus",
        "StateOrProvince": "Oxford",
        "Postcode": "OX4 2TZ",
        "CountryID": 1,
        "Latitude": 51.738078,
        "Longitude": -1.196438,
        "DistanceUnit": 0
    },
    "Connections": [
        {
            "ID": 125078,
            "ConnectionTypeID": 25,
            "StatusTypeID": 50,
            "LevelID": 2,
            "Amps": 32,
            "Voltage": 230,
            "PowerKW": 7,
            "CurrentTypeID": 10,
            "Quantity": 1
        }
    ],
    "NumberOfPoints": 1,
    "GeneralComments": "This is an open charge unit installed at the Big Yellow Self Storage site in Peterley Road, Horspath Estate, Oxford",
    "StatusTypeID": 0,
    "DateLastStatusUpdate": "2020-01-13T21:12:00Z",
    "DataQualityLevel": 1,
    "DateCreated": "2017-05-24T05:49:00Z",
    "SubmissionStatusTypeID": 200
}