{
    "IsRecentlyVerified": false,
    "ID": 68005,
    "UUID": "BD4D0308-A2D6-44D4-9BAE-53FDE7D26B9C",
    "DataProviderID": 26,
    "DataProvidersReference": "92856",
    "OperatorID": 103,
    "OperatorsReference": "Allego NLALLEGO0011411",
    "UsageCost": "0.00 jaarabonnement",
    "AddressInfo": {
        "ID": 68351,
        "Title": "Meester J.M. de Kempenaersingel 9",
        "AddressLine1": "Meester J.M. de Kempenaersingel 9",
        "Town": "Arnhem",
        "Postcode": "6836 MJ",
        "CountryID": 159,
        "Latitude": 51.940879,
        "Longitude": 5.8954861,
        "ContactTelephone1": "0800-3745337",
        "RelatedURL": "http://www.allego.eu/",
        "DistanceUnit": 0
    },
    "Connections": [
        {
            "ID": 94678,
            "ConnectionTypeID": 25,
            "LevelID": 2,
            "PowerKW": 11,
            "CurrentTypeID": 10
        },
        {
            "ID": 94679,
            "ConnectionTypeID": 25,
            "LevelID": 2,
            "PowerKW": 11,
            "CurrentTypeID": 10
        }
    ],
    "NumberOfPoints": 1,
    "StatusTypeID": 50,
    "DateLastStatusUpdate": "2016-06-04T02:37:00Z",
    "DataQualityLevel": 3,
    "DateCreated": "2016-06-04T02:37:00Z",
    "SubmissionStatusTypeID": 100
}