{
    "IsRecentlyVerified": false,
    "ID": 110383,
    "UUID": "00AE8A9D-6D8C-4551-BD01-BE9BC1AFC343",
    "DataProviderID": 2,
    "DataProvidersReference": "103850",
    "OperatorID": 5,
    "UsageTypeID": 1,
    "AddressInfo": {
        "ID": 110729,
        "Title": "PLACEHOLDER",
        "AddressLine1": "2920 Ramona Ave",
        "Town": "Sacramento",
        "StateOrProvince": "CA",
        "Postcode": "95826",
        "CountryID": 2,
        "Latitude": 38.5492203,
        "Longitude": -121.4189735,
        "ContactTelephone1": "888-758-4389",
        "AccessComments": "24 hours daily",
        "RelatedURL": "http://www.chargepoint.com/",
        "DistanceUnit": 0
    },
    "Connections": [
        {
            "ID": 155632,
            "ConnectionTypeID": 1,
            "LevelID": 2,
            "Amps": 16,
            "Voltage": 230,
            "PowerKW": 3,
            "CurrentTypeID": 10,
            "Quantity": 1
        }
    ],
    "DateLastStatusUpdate": "2019-12-24T09:14:00Z",
    "DataQualityLevel": 3,
    "DateCreated": "2018-10-18T23:36:00Z",
    "SubmissionStatusTypeID": 100
}