{
    "IsRecentlyVerified": false,
    "ID": 52721,
    "UUID": "7ECF9C88-54EF-476A-8688-AC7CAED7E031",
    "DataProviderID": 1,
    "OperatorID": 45,
    "UsageTypeID": 5,
    "UsageCost": "0,50€/kWh",
    "AddressInfo": {
        "ID": 53067,
        "Title": "Stellplatz Kristall Sauna-Wellnesspark",
        "AddressLine1": "Köstritzer Straße 16",
        "Town": "Bad Klosterlausnitz",
        "StateOrProvince": "Bad Klosterlausnitz",
        "Postcode": "07639",
        "CountryID": 87,
        "Latitude": 50.9121610335537,
        "Longitude": 11.8718218945122,
        "ContactTelephone1": "036601/598-0",
        "AccessComments": "Auf dem Wohnmobilstellplatz, der Teil des Parkplatzes ist, sind 6 CEE Anschlüsse mit Münzautomat (0,50€/kWh, 24/7 nutzbar). Wenn man auf den Parkplatz fährt, auf der linken Seite hinten.",
        "RelatedURL": "http://www.kristallbad-bad-klosterlausnitz.de/",
        "DistanceUnit": 0
    },
    "Connections": [
        {
            "ID": 65557,
            "ConnectionTypeID": 16,
            "StatusTypeID": 50,
            "LevelID": 2,
            "Amps": 16,
            "Voltage": 230,
            "PowerKW": 3.7,
            "CurrentTypeID": 10,
            "Quantity": 6
        }
    ],
    "NumberOfPoints": 6,
    "StatusTypeID": 50,
    "DateLastStatusUpdate": "2015-09-09T11:06:00Z",
    "DataQualityLevel": 1,
    "DateCreated": "2015-09-09T10:46:00Z",
    "SubmissionStatusTypeID": 200
}