{
    "IsRecentlyVerified": false,
    "ID": 158737,
    "UUID": "0F9C6D23-63A0-40B1-835E-6D279ED9B60D",
    "DataProviderID": 2,
    "DataProvidersReference": "163337",
    "OperatorID": 59,
    "UsageTypeID": 1,
    "AddressInfo": {
        "ID": 159094,
        "Title": "Greenlots - 12516A",
        "AddressLine1": "660 Bonnie Brae",
        "Town": "Los Angeles",
        "StateOrProvince": "CA",
        "Postcode": "90057",
        "CountryID": 2,
        "Latitude": 34.0567512512207,
        "Longitude": -118.273742675781,
        "ContactTelephone1": "855-900-7584",
        "AccessComments": "24 hours daily",
        "RelatedURL": "http://greenlots.com/",
        "DistanceUnit": 0
    },
    "Connections": [
        {
            "ID": 228762,
            "ConnectionTypeID": 1,
            "LevelID": 2,
            "Amps": 16,
            "Voltage": 230,
            "PowerKW": 3.7,
            "CurrentTypeID": 10,
            "Quantity": 1
        }
    ],
    "StatusTypeID": 50,
    "DateLastStatusUpdate": "2020-06-26T02:56:00Z",
    "DataQualityLevel": 3,
    "DateCreated": "2020-06-26T02:56:00Z",
    "SubmissionStatusTypeID": 100
}