{
    "IsRecentlyVerified": false,
    "ID": 85176,
    "UUID": "2362603E-9232-4C35-89CB-2E2EA416B9B2",
    "DataProviderID": 1,
    "OperatorID": 156,
    "UsageTypeID": 4,
    "AddressInfo": {
        "ID": 85522,
        "Title": "Rathaus Olfen",
        "AddressLine1": "Kirchstraße 5",
        "Town": "Olfen",
        "StateOrProvince": "Kreis Coesfeld",
        "Postcode": "59399",
        "CountryID": 87,
        "Latitude": 51.70719002101723,
        "Longitude": 7.3797532628433204,
        "ContactTelephone1": "+49 3021502848",
        "AccessComments": "24/7 open",
        "RelatedURL": "http://newmotion.com/de_DE",
        "DistanceUnit": 0
    },
    "Connections": [
        {
            "ID": 120939,
            "ConnectionTypeID": 25,
            "StatusTypeID": 50,
            "LevelID": 2,
            "Amps": 32,
            "Voltage": 400,
            "PowerKW": 22,
            "CurrentTypeID": 20,
            "Quantity": 2
        }
    ],
    "NumberOfPoints": 2,
    "StatusTypeID": 50,
    "DateLastStatusUpdate": "2017-03-27T07:03:00Z",
    "DataQualityLevel": 1,
    "DateCreated": "2017-03-27T07:03:00Z",
    "SubmissionStatusTypeID": 200
}