{
    "IsRecentlyVerified": false,
    "ID": 48293,
    "UUID": "79386D6D-F859-44D4-8804-1E1EF104A14F",
    "DataProviderID": 2,
    "DataProvidersReference": "67345",
    "UsageTypeID": 1,
    "AddressInfo": {
        "ID": 48639,
        "Title": "Boise State University - Lincoln Garage",
        "AddressLine1": "1 Belmont St",
        "Town": "Boise",
        "StateOrProvince": "ID",
        "Postcode": "83725",
        "CountryID": 2,
        "Latitude": 43.60022,
        "Longitude": -116.201568,
        "ContactTelephone1": "208-426-7275  208-426-4346",
        "AccessComments": "24 hours daily",
        "RelatedURL": "",
        "DistanceUnit": 0
    },
    "Connections": [
        {
            "ID": 59715,
            "ConnectionTypeID": 1,
            "LevelID": 2,
            "Amps": 16,
            "Voltage": 230,
            "PowerKW": 3.7,
            "CurrentTypeID": 10,
            "Quantity": 4
        }
    ],
    "DateLastStatusUpdate": "2020-06-26T03:07:00Z",
    "DataQualityLevel": 3,
    "DateCreated": "2015-06-24T11:44:00Z",
    "SubmissionStatusTypeID": 100
}