{
    "IsRecentlyVerified": false,
    "ID": 105259,
    "UUID": "F31104A3-FD4E-429B-B211-3F4E5BCA2411",
    "DataProviderID": 1,
    "OperatorID": 105,
    "UsageTypeID": 4,
    "AddressInfo": {
        "ID": 105605,
        "Title": "Goodrich Aerospace Systems",
        "AddressLine1": "Bertramstraße 8",
        "Town": "Lippstadt",
        "StateOrProvince": "Kreis Soest",
        "Postcode": "59557",
        "CountryID": 87,
        "Latitude": 51.65127449338647,
        "Longitude": 8.36231877724606,
        "AccessComments": "Beide durchgehend nutzbaren Ladesäulen sind auf dem Werksparkplatz.",
        "DistanceUnit": 0
    },
    "Connections": [
        {
            "ID": 148383,
            "ConnectionTypeID": 25,
            "StatusTypeID": 50,
            "LevelID": 2,
            "Amps": 32,
            "Voltage": 400,
            "PowerKW": 22,
            "CurrentTypeID": 20,
            "Quantity": 4
        }
    ],
    "NumberOfPoints": 4,
    "StatusTypeID": 50,
    "DateLastStatusUpdate": "2018-06-04T05:53:00Z",
    "DataQualityLevel": 1,
    "DateCreated": "2018-06-04T05:53:00Z",
    "SubmissionStatusTypeID": 200
}