{
    "IsRecentlyVerified": false,
    "ID": 66124,
    "UUID": "08AC8FE4-B2FF-4E6C-99DA-A79B3A22694F",
    "DataProviderID": 1,
    "OperatorID": 1240,
    "UsageTypeID": 1,
    "AddressInfo": {
        "ID": 66470,
        "Title": "E-Bike Station Haushaltsausstattung Ermer",
        "AddressLine1": "Am Rebengang 2",
        "Town": "Altdorf",
        "StateOrProvince": "Edenkoben",
        "Postcode": "67482",
        "CountryID": 87,
        "Latitude": 49.2879197,
        "Longitude": 8.224092499999983,
        "RelatedURL": "https://www.pfalzwerke.de/energieberatung/9244.php",
        "DistanceUnit": 0
    },
    "Connections": [
        {
            "ID": 91415,
            "ConnectionTypeID": 28,
            "StatusTypeID": 50,
            "LevelID": 1,
            "Amps": 10,
            "Voltage": 230,
            "PowerKW": 2.3,
            "CurrentTypeID": 10,
            "Quantity": 4
        }
    ],
    "NumberOfPoints": 4,
    "StatusTypeID": 50,
    "DateLastStatusUpdate": "2016-05-12T06:16:00Z",
    "DataQualityLevel": 1,
    "DateCreated": "2016-05-12T06:16:00Z",
    "SubmissionStatusTypeID": 200
}