{
    "IsRecentlyVerified": false,
    "ID": 94468,
    "UUID": "3DFAB885-5919-4D8D-9236-36FFCDDE161A",
    "DataProviderID": 2,
    "DataProvidersReference": "86913",
    "OperatorID": 5,
    "UsageTypeID": 1,
    "AddressInfo": {
        "ID": 94814,
        "Title": "L4A1B3 STATIONS",
        "AddressLine1": "25 Town Center Avenue",
        "Town": "Big Sky",
        "StateOrProvince": "MT",
        "Postcode": "59716",
        "CountryID": 2,
        "Latitude": 45.2609008,
        "Longitude": -111.307711,
        "ContactTelephone1": "888-758-4389",
        "AccessComments": "24 hours daily",
        "RelatedURL": "http://www.chargepoint.com/",
        "DistanceUnit": 0
    },
    "Connections": [
        {
            "ID": 133579,
            "ConnectionTypeID": 1,
            "LevelID": 2,
            "Amps": 16,
            "Voltage": 230,
            "PowerKW": 3.7,
            "CurrentTypeID": 10,
            "Quantity": 2
        }
    ],
    "DateLastStatusUpdate": "2020-06-26T03:08:00Z",
    "DataQualityLevel": 3,
    "DateCreated": "2017-10-19T02:06:00Z",
    "SubmissionStatusTypeID": 100
}