{
    "MediaItems": [
        {
            "ID": 8014,
            "ChargePointID": 65252,
            "ItemURL": "https://s3-ap-southeast-2.amazonaws.com/openchargemap/images/CZ/OCM65252/OCM-65252.orig.2016081118112991.jpg",
            "ItemThumbnailURL": "https://s3-ap-southeast-2.amazonaws.com/openchargemap/images/CZ/OCM65252/OCM-65252.thmb.2016081118112991.jpg",
            "Comment": "CEE 4pin 16A by entrance\r\n4 kolik 16A vedle vchodu",
            "IsEnabled": true,
            "IsVideo": false,
            "IsFeaturedItem": false,
            "IsExternalResource": false,
            "User": {
                "ID": 6224,
                "Username": "ozana"
            },
            "DateCreated": "2016-08-11T18:12:00Z"
        },
        {
            "ID": 8013,
            "ChargePointID": 65252,
            "ItemURL": "https://s3-ap-southeast-2.amazonaws.com/openchargemap/images/CZ/OCM65252/OCM-65252.orig.2016081118092160.jpg",
            "ItemThumbnailURL": "https://s3-ap-southeast-2.amazonaws.com/openchargemap/images/CZ/OCM65252/OCM-65252.thmb.2016081118092160.jpg",
            "Comment": "CEE 5pin 32A at the ramp \r\n5 kolik 32A u rampy",
            "IsEnabled": true,
            "IsVideo": false,
            "IsFeaturedItem": false,
            "IsExternalResource": false,
            "User": {
                "ID": 6224,
                "Username": "ozana"
            },
            "DateCreated": "2016-08-11T18:10:00Z"
        }
    ],
    "IsRecentlyVerified": false,
    "ID": 65252,
    "UUID": "BF5ED30E-23EF-4893-9F46-1506239872B5",
    "DataProviderID": 1,
    "OperatorID": 45,
    "UsageTypeID": 7,
    "UsageCost": "0",
    "AddressInfo": {
        "ID": 65598,
        "Title": "PROSOLAR s.r.o.",
        "AddressLine1": "areál Agro 528",
        "Town": "Mankovice",
        "Postcode": "74235",
        "CountryID": 64,
        "Latitude": 49.63654157523566,
        "Longitude": 17.904861609208087,
        "ContactTelephone1": "+420777636262",
        "ContactEmail": "marcalik@prosolar.net",
        "AccessComments": "Areál AGRO (EXIT 321 z D1) near(opposite) Mankovice 166\r\nCZ: Otevřeno 24/7/365. Zásuvky jsou na zdi budovy vzadu u rampy.\r\nEN: Open 24/7/365. Sockets are on the wall of the building back at the ramp.",
        "RelatedURL": "http://www.prosolar.net",
        "DistanceUnit": 0
    },
    "Connections": [
        {
            "ID": 89855,
            "ConnectionTypeID": 35,
            "StatusTypeID": 50,
            "LevelID": 2,
            "Amps": 32,
            "Voltage": 400,
            "PowerKW": 22,
            "CurrentTypeID": 20,
            "Quantity": 1
        }
    ],
    "NumberOfPoints": 1,
    "GeneralComments": "CZ: Dobrovolná platba 5Kč/kWh.\r\nEN: Optional payment of 5 CZK/kWh.",
    "StatusTypeID": 50,
    "DateLastStatusUpdate": "2016-10-15T19:16:00Z",
    "DataQualityLevel": 1,
    "DateCreated": "2016-04-24T20:00:00Z",
    "SubmissionStatusTypeID": 200
}