{
    "IsRecentlyVerified": false,
    "ID": 188308,
    "UUID": "F7FC5D98-8B57-4DD4-A05C-340A030A5CBE",
    "DataProviderID": 1,
    "OperatorID": 3460,
    "UsageTypeID": 4,
    "AddressInfo": {
        "ID": 188667,
        "Title": "PEA VOLTA BCP",
        "AddressLine1": "Phetkasem Road",
        "StateOrProvince": "Chumphon Province",
        "CountryID": 222,
        "Latitude": 10.594385788361222,
        "Longitude": 99.1242498266596,
        "RelatedURL": "https://apps.apple.com/my/app/pea-volta/id1503297093",
        "DistanceUnit": 0
    },
    "Connections": [
        {
            "ID": 304001,
            "ConnectionTypeID": 33,
            "StatusTypeID": 50,
            "LevelID": 3,
            "Amps": 125,
            "PowerKW": 50,
            "CurrentTypeID": 30,
            "Quantity": 2
        }
    ],
    "NumberOfPoints": 1,
    "StatusTypeID": 50,
    "DateLastStatusUpdate": "2021-07-18T14:13:00Z",
    "DataQualityLevel": 1,
    "DateCreated": "2021-07-18T02:39:00Z",
    "SubmissionStatusTypeID": 200
}