{
    "MediaItems": [
        {
            "ID": 24912,
            "ChargePointID": 161895,
            "ItemURL": "https://s3-ap-southeast-2.amazonaws.com/openchargemap/images/US/OCM161895/OCM-161895.orig.2020100321082576.jpg",
            "ItemThumbnailURL": "https://s3-ap-southeast-2.amazonaws.com/openchargemap/images/US/OCM161895/OCM-161895.thmb.2020100321082576.jpg",
            "Comment": "",
            "IsEnabled": true,
            "IsVideo": false,
            "IsFeaturedItem": false,
            "IsExternalResource": false,
            "User": {
                "ID": 26767,
                "Username": "Ben Anderson"
            },
            "DateCreated": "2020-10-03T21:09:00Z"
        },
        {
            "ID": 24913,
            "ChargePointID": 161895,
            "ItemURL": "https://s3-ap-southeast-2.amazonaws.com/openchargemap/images/US/OCM161895/OCM-161895.orig.2020100321084150.jpg",
            "ItemThumbnailURL": "https://s3-ap-southeast-2.amazonaws.com/openchargemap/images/US/OCM161895/OCM-161895.thmb.2020100321084150.jpg",
            "Comment": "",
            "IsEnabled": true,
            "IsVideo": false,
            "IsFeaturedItem": false,
            "IsExternalResource": false,
            "User": {
                "ID": 26767,
                "Username": "Ben Anderson"
            },
            "DateCreated": "2020-10-03T21:09:00Z"
        },
        {
            "ID": 24378,
            "ChargePointID": 161895,
            "ItemURL": "https://s3-ap-southeast-2.amazonaws.com/openchargemap/images/US/OCM161895/OCM-161895.orig.2020082019214552.jpg",
            "ItemThumbnailURL": "https://s3-ap-southeast-2.amazonaws.com/openchargemap/images/US/OCM161895/OCM-161895.thmb.2020082019214552.jpg",
            "Comment": "In the shade all day long with dining and shopping nearby! Available 24/7!",
            "IsEnabled": true,
            "IsVideo": false,
            "IsFeaturedItem": false,
            "IsExternalResource": false,
            "User": {
                "ID": 26767,
                "Username": "Ben Anderson"
            },
            "DateCreated": "2020-08-20T19:22:00Z"
        },
        {
            "ID": 23355,
            "ChargePointID": 161895,
            "ItemURL": "https://s3-ap-southeast-2.amazonaws.com/openchargemap/images/AU/OCM161895/OCM-161895.orig.2020073105213148.jpg",
            "ItemThumbnailURL": "https://s3-ap-southeast-2.amazonaws.com/openchargemap/images/AU/OCM161895/OCM-161895.thmb.2020073105213148.jpg",
            "Comment": "",
            "IsEnabled": true,
            "IsVideo": false,
            "IsFeaturedItem": false,
            "IsExternalResource": false,
            "User": {
                "ID": 26767,
                "Username": "Ben Anderson"
            },
            "DateCreated": "2020-07-31T05:22:00Z"
        }
    ],
    "IsRecentlyVerified": false,
    "ID": 161895,
    "UUID": "442C4433-5F8D-4861-BCF0-9E7D87756CCF",
    "DataProviderID": 1,
    "OperatorID": 45,
    "UsageTypeID": 1,
    "UsageCost": "Free",
    "AddressInfo": {
        "ID": 162252,
        "Title": "Spokane City Credit Union",
        "AddressLine1": "1930 N Monroe St",
        "Town": "Spokane",
        "StateOrProvince": "Washington",
        "Postcode": "99205",
        "CountryID": 2,
        "Latitude": 47.675709806846754,
        "Longitude": -117.42627111207219,
        "ContactTelephone1": "5093257228",
        "AccessComments": "",
        "RelatedURL": "https://sccu.net",
        "DistanceUnit": 0
    },
    "Connections": [
        {
            "ID": 232995,
            "ConnectionTypeID": 1,
            "StatusTypeID": 50,
            "LevelID": 2,
            "Amps": 40,
            "Voltage": 240,
            "PowerKW": 9.6,
            "CurrentTypeID": 10,
            "Quantity": 1,
            "Comments": "Single non-networked Clipper Creek charging station."
        }
    ],
    "NumberOfPoints": 1,
    "GeneralComments": "Station accessible 24/7. Branch open Mon-Fri 9 AM to 5 PM.",
    "StatusTypeID": 50,
    "DateLastStatusUpdate": "2020-10-03T21:09:00Z",
    "DataQualityLevel": 1,
    "DateCreated": "2020-07-28T03:19:00Z",
    "SubmissionStatusTypeID": 200
}