{
    "IsRecentlyVerified": false,
    "ID": 103516,
    "UUID": "CD2BFA05-6524-4147-8D78-0F1D30E20DC2",
    "DataProviderID": 1,
    "OperatorID": 23,
    "OperatorsReference": "42663",
    "UsageTypeID": 4,
    "AddressInfo": {
        "ID": 103862,
        "Title": "Hilton Garden Inn Toronto/Brampton",
        "AddressLine1": "2648 Steeles Ave",
        "Town": "Brampton",
        "StateOrProvince": "Ontario",
        "Postcode": "L6S 6J9",
        "CountryID": 44,
        "Latitude": 43.722857,
        "Longitude": -79.673007,
        "ContactTelephone1": "(905) 595-5151",
        "DistanceUnit": 0
    },
    "Connections": [
        {
            "ID": 146183,
            "ConnectionTypeID": 30,
            "StatusTypeID": 50,
            "LevelID": 2,
            "PowerKW": 16,
            "CurrentTypeID": 20,
            "Quantity": 8
        }
    ],
    "NumberOfPoints": 8,
    "GeneralComments": "8 Tesla Connectors, up to 16kW.Available for customers. Please see front desk.",
    "StatusTypeID": 50,
    "DateLastStatusUpdate": "2019-06-05T11:38:00Z",
    "DataQualityLevel": 1,
    "DateCreated": "2018-05-04T05:33:00Z",
    "SubmissionStatusTypeID": 200
}