{
    "IsRecentlyVerified": false,
    "ID": 122713,
    "UUID": "A1196B00-B36C-488F-A939-F10D66B3DE46",
    "DataProviderID": 2,
    "DataProvidersReference": "49149",
    "UsageTypeID": 1,
    "AddressInfo": {
        "ID": 123059,
        "Title": "Mojave Desert Air Quality Management District",
        "AddressLine1": "14306 Park Ave",
        "Town": "Victorville",
        "StateOrProvince": "CA",
        "Postcode": "92392",
        "CountryID": 2,
        "Latitude": 34.510833,
        "Longitude": -117.3256,
        "ContactTelephone1": "760-245-1661",
        "AccessComments": "24 hours daily; leave cell phone number visible on dashboard in case of emergency",
        "RelatedURL": "",
        "DistanceUnit": 0
    },
    "Connections": [
        {
            "ID": 172626,
            "ConnectionTypeID": 1,
            "LevelID": 2,
            "Amps": 16,
            "Voltage": 230,
            "PowerKW": 3.7,
            "CurrentTypeID": 10,
            "Quantity": 7
        }
    ],
    "DateLastStatusUpdate": "2020-06-26T02:57:00Z",
    "DataQualityLevel": 3,
    "DateCreated": "2019-04-06T05:03:00Z",
    "SubmissionStatusTypeID": 100
}