{
    "IsRecentlyVerified": false,
    "ID": 162346,
    "UUID": "5F4F1244-684A-4EF6-A527-CBDB6C36C6F0",
    "DataProviderID": 1,
    "OperatorID": 21,
    "UsageTypeID": 4,
    "UsageCost": "Mobi.E compatible card",
    "AddressInfo": {
        "ID": 162703,
        "Title": "SXL-00002",
        "AddressLine1": "Rua Casal do Marco",
        "Town": "Casal do Marco",
        "StateOrProvince": "Lisboa",
        "Postcode": "2840",
        "CountryID": 180,
        "Latitude": 38.60990261566698,
        "Longitude": -9.098784316271576,
        "DistanceUnit": 0
    },
    "Connections": [
        {
            "ID": 233669,
            "ConnectionTypeID": 2,
            "StatusTypeID": 50,
            "LevelID": 3,
            "Amps": 120,
            "Voltage": 500,
            "PowerKW": 50,
            "CurrentTypeID": 30,
            "Quantity": 1
        },
        {
            "ID": 233670,
            "ConnectionTypeID": 33,
            "StatusTypeID": 50,
            "LevelID": 3,
            "Amps": 125,
            "Voltage": 500,
            "PowerKW": 50,
            "CurrentTypeID": 30,
            "Quantity": 1
        },
        {
            "ID": 233671,
            "ConnectionTypeID": 1036,
            "StatusTypeID": 50,
            "LevelID": 3,
            "Amps": 63,
            "Voltage": 400,
            "PowerKW": 43,
            "CurrentTypeID": 20,
            "Quantity": 1
        }
    ],
    "NumberOfPoints": 2,
    "StatusTypeID": 50,
    "DateLastStatusUpdate": "2021-01-22T20:06:00Z",
    "DataQualityLevel": 1,
    "DateCreated": "2020-08-06T18:23:00Z",
    "SubmissionStatusTypeID": 200
}