{
    "IsRecentlyVerified": false,
    "ID": 45690,
    "UUID": "45B7D55D-7E4E-4B5D-B35D-1BE7746C901A",
    "DataProviderID": 1,
    "DataProvidersReference": "2005",
    "AddressInfo": {
        "ID": 46036,
        "Title": "Gumpens Auto Vest AS",
        "AddressLine1": "Setesdalsveien 90",
        "Town": "KRISTIANSAND S",
        "StateOrProvince": "Agder",
        "Postcode": "4617",
        "CountryID": 168,
        "Latitude": 58.1518,
        "Longitude": 7.96472,
        "AccessComments": "Gumpen Auto Vest AS",
        "DistanceUnit": 0
    },
    "Connections": [
        {
            "ID": 56353,
            "ConnectionTypeID": 0,
            "Reference": "1",
            "LevelID": 2,
            "Amps": 100,
            "Voltage": 500,
            "PowerKW": 50,
            "Comments": "Mode 4"
        },
        {
            "ID": 87923,
            "ConnectionTypeID": 0,
            "Reference": "2",
            "LevelID": 2,
            "Amps": 32,
            "Voltage": 400,
            "PowerKW": 22,
            "Comments": "Mode 3"
        }
    ],
    "NumberOfPoints": 2,
    "DateLastStatusUpdate": "2020-05-26T08:21:00Z",
    "DataQualityLevel": 2,
    "DateCreated": "2015-05-03T00:54:00Z",
    "SubmissionStatusTypeID": 100
}