{
    "IsRecentlyVerified": false,
    "ID": 186143,
    "UUID": "9E2FBFD5-578E-45A2-B8EF-3DCBFDD1FB68",
    "DataProviderID": 29,
    "DataProvidersReference": "21236",
    "AddressInfo": {
        "ID": 186502,
        "Title": "Kirchenlamitzer Straße 27-33",
        "AddressLine1": "Kirchenlamitzer Straße 27-33",
        "Town": "Weißenstadt",
        "Postcode": "95163",
        "CountryID": 87,
        "Latitude": 50.612463,
        "Longitude": 11.5311116,
        "DistanceUnit": 0
    },
    "Connections": [
        {
            "ID": 297950,
            "ConnectionTypeID": 25,
            "StatusTypeID": 50,
            "LevelID": 2,
            "PowerKW": 22,
            "CurrentTypeID": 20
        },
        {
            "ID": 297951,
            "ConnectionTypeID": 25,
            "StatusTypeID": 50,
            "LevelID": 2,
            "PowerKW": 22,
            "CurrentTypeID": 20
        }
    ],
    "StatusTypeID": 50,
    "DateLastStatusUpdate": "2021-07-12T02:45:00Z",
    "MetadataValues": [
        {
            "ID": 18385,
            "MetadataFieldID": 4,
            "ItemValue": "Data from the German chargepoint registry provided by Bundesnetzagentur.de under the CC-BY 4.0 license"
        }
    ],
    "DataQualityLevel": 3,
    "DateCreated": "2021-07-12T02:45:00Z",
    "SubmissionStatusTypeID": 100
}