{
    "IsRecentlyVerified": false,
    "ID": 46617,
    "UUID": "342A51A7-7D2A-4DA0-BF7F-1C25010F96C6",
    "DataProviderID": 1,
    "DataProvidersReference": "543",
    "AddressInfo": {
        "ID": 46963,
        "Title": "Havstein HVFS, Trondheim",
        "AddressLine1": "Stabells veg 4B",
        "Town": "TRONDHEIM",
        "StateOrProvince": "Trøndelag",
        "Postcode": "7021",
        "CountryID": 168,
        "Latitude": 63.40367,
        "Longitude": 10.36261,
        "AccessComments": "Rett foran hovedinngangen.",
        "DistanceUnit": 0
    },
    "Connections": [
        {
            "ID": 57280,
            "ConnectionTypeID": 0,
            "Reference": "1",
            "LevelID": 2,
            "Amps": 16,
            "Voltage": 230,
            "PowerKW": 3.7,
            "Comments": "Mode 1"
        }
    ],
    "NumberOfPoints": 1,
    "DateLastStatusUpdate": "2020-05-26T08:25:00Z",
    "DataQualityLevel": 2,
    "DateCreated": "2015-05-03T00:54:00Z",
    "SubmissionStatusTypeID": 100
}