{
    "IsRecentlyVerified": false,
    "ID": 121468,
    "UUID": "0097CCBD-77D9-404E-92B6-7E207DD3E603",
    "DataProviderID": 1,
    "OperatorID": 32,
    "OperatorsReference": "11149",
    "UsageTypeID": 4,
    "UsageCost": "Inclusive; for Polar Plus subscription members only",
    "AddressInfo": {
        "ID": 121814,
        "Title": "The Club House",
        "AddressLine1": "Warren Drive",
        "Town": "Pepperstock",
        "StateOrProvince": "Bedfordshire",
        "Postcode": "LU1 3TQ",
        "CountryID": 1,
        "Latitude": 51.85051,
        "Longitude": -0.397584,
        "DistanceUnit": 0
    },
    "Connections": [
        {
            "ID": 171152,
            "ConnectionTypeID": 25,
            "StatusTypeID": 50,
            "LevelID": 2,
            "Amps": 32,
            "Voltage": 230,
            "PowerKW": 7,
            "CurrentTypeID": 10,
            "Quantity": 2
        }
    ],
    "NumberOfPoints": 2,
    "GeneralComments": "WiFi, Restaurant, Café, Accommodation available.",
    "StatusTypeID": 50,
    "DateLastStatusUpdate": "2019-04-03T11:38:00Z",
    "DataQualityLevel": 1,
    "DateCreated": "2019-04-03T05:15:00Z",
    "SubmissionStatusTypeID": 200
}