{
    "IsRecentlyVerified": false,
    "ID": 24645,
    "UUID": "A724B2FC-7FB3-4878-97D5-6DB4F54FD5E8",
    "DataProviderID": 1,
    "OperatorID": 1,
    "UsageTypeID": 5,
    "UsageCost": "Free",
    "AddressInfo": {
        "ID": 24991,
        "Title": "P-Kluuvi / Europark Oy",
        "AddressLine1": "Puutarhakatu 1",
        "Town": "Helsinki",
        "StateOrProvince": "Uusimaa",
        "CountryID": 79,
        "Latitude": 60.173163,
        "Longitude": 24.9484846,
        "AccessComments": "Parking garage P Kluuvi",
        "RelatedURL": "http://www.sahkoinenliikenne.fi",
        "DistanceUnit": 0
    },
    "Connections": [
        {
            "ID": 26942,
            "ConnectionTypeID": 28,
            "StatusTypeID": 50,
            "LevelID": 2,
            "Amps": 16,
            "Voltage": 230,
            "PowerKW": 3,
            "CurrentTypeID": 10,
            "Quantity": 2
        }
    ],
    "NumberOfPoints": 2,
    "StatusTypeID": 50,
    "DateLastStatusUpdate": "2014-10-27T20:07:00Z",
    "MetadataValues": [
        {
            "ID": 1039,
            "MetadataFieldID": 4,
            "ItemValue": "Data © OpenStreetMap contributors, ODbL 1.0. http://www.openstreetmap.org/copyright"
        }
    ],
    "DataQualityLevel": 1,
    "DateCreated": "2014-10-26T02:00:00Z",
    "SubmissionStatusTypeID": 200
}