{
    "IsRecentlyVerified": false,
    "ID": 128197,
    "UUID": "AF6372C0-99A6-4FB7-A528-94D18736460C",
    "DataProviderID": 1,
    "OperatorID": 213,
    "UsageTypeID": 1,
    "AddressInfo": {
        "ID": 128543,
        "Title": "Aire de Villabe",
        "AddressLine1": "A6",
        "Town": "Villabe",
        "CountryID": 80,
        "Latitude": 48.59473742730842,
        "Longitude": 2.4435537073273963,
        "DistanceUnit": 0
    },
    "Connections": [
        {
            "ID": 179398,
            "ConnectionTypeID": 33,
            "LevelID": 3,
            "PowerKW": 50,
            "CurrentTypeID": 30
        },
        {
            "ID": 179399,
            "ConnectionTypeID": 2,
            "LevelID": 3,
            "PowerKW": 50,
            "CurrentTypeID": 30
        },
        {
            "ID": 179400,
            "ConnectionTypeID": 1036,
            "LevelID": 3,
            "PowerKW": 43,
            "CurrentTypeID": 20
        }
    ],
    "NumberOfPoints": 1,
    "StatusTypeID": 100,
    "DateLastStatusUpdate": "2020-03-17T08:41:00Z",
    "DataQualityLevel": 1,
    "DateCreated": "2019-06-17T19:36:00Z",
    "SubmissionStatusTypeID": 200
}