{
    "IsRecentlyVerified": false,
    "ID": 136098,
    "UUID": "B4C2997B-3BBB-4B5C-BA92-4C4B987A65F4",
    "DataProviderID": 18,
    "DataProvidersReference": "c870d17218706e94dc43a5a0db1104fb",
    "OperatorID": 2244,
    "UsageTypeID": 5,
    "AddressInfo": {
        "ID": 136444,
        "Title": "Denbigh Street",
        "AddressLine1": "Denbigh Street",
        "Town": "London",
        "Postcode": "SW1V 2DS",
        "CountryID": 1,
        "Latitude": 51.489538,
        "Longitude": -0.138934,
        "AccessComments": "",
        "RelatedURL": "https://www.ubitricity.com",
        "DistanceUnit": 0
    },
    "Connections": [
        {
            "ID": 190525,
            "ConnectionTypeID": 25,
            "Reference": "suby1100002584",
            "StatusTypeID": 50,
            "LevelID": 2,
            "Amps": 16,
            "Voltage": 230,
            "PowerKW": 3.7,
            "CurrentTypeID": 10
        }
    ],
    "StatusTypeID": 0,
    "DateLastStatusUpdate": "2021-04-25T05:46:00Z",
    "MetadataValues": [
        {
            "ID": 5950,
            "MetadataFieldID": 4,
            "ItemValue": "Contains public sector information licensed under the Open Government Licence v2.0. http://www.nationalarchives.gov.uk/doc/open-government-licence/version/2/"
        }
    ],
    "DataQualityLevel": 3,
    "DateCreated": "2019-12-24T05:22:00Z",
    "SubmissionStatusTypeID": 100
}