{
    "IsRecentlyVerified": false,
    "ID": 183206,
    "UUID": "97E7D713-FFC4-4686-8DBD-797FBA6FA0C2",
    "DataProviderID": 29,
    "DataProvidersReference": "12868,16324",
    "AddressInfo": {
        "ID": 183565,
        "Title": "Grafenstraße 9",
        "AddressLine1": "Grafenstraße 9",
        "Town": "Werl",
        "Postcode": "59457",
        "CountryID": 87,
        "Latitude": 51.55705,
        "Longitude": 7.914076,
        "DistanceUnit": 0
    },
    "Connections": [
        {
            "ID": 289903,
            "ConnectionTypeID": 25,
            "StatusTypeID": 50,
            "LevelID": 2,
            "PowerKW": 22,
            "CurrentTypeID": 20
        },
        {
            "ID": 289904,
            "ConnectionTypeID": 25,
            "StatusTypeID": 50,
            "LevelID": 2,
            "PowerKW": 22,
            "CurrentTypeID": 20
        },
        {
            "ID": 289905,
            "ConnectionTypeID": 25,
            "StatusTypeID": 50,
            "LevelID": 2,
            "PowerKW": 22,
            "CurrentTypeID": 20
        },
        {
            "ID": 289906,
            "ConnectionTypeID": 25,
            "StatusTypeID": 50,
            "LevelID": 2,
            "PowerKW": 22,
            "CurrentTypeID": 20
        }
    ],
    "StatusTypeID": 50,
    "DateLastStatusUpdate": "2021-07-09T03:24:00Z",
    "MetadataValues": [
        {
            "ID": 15499,
            "MetadataFieldID": 4,
            "ItemValue": "Data from the German chargepoint registry provided by Bundesnetzagentur.de under the CC-BY 4.0 license"
        }
    ],
    "DataQualityLevel": 3,
    "DateCreated": "2021-07-08T10:03:00Z",
    "SubmissionStatusTypeID": 100
}