{
    "IsRecentlyVerified": false,
    "ID": 46263,
    "UUID": "D19C6CB4-2052-4DCD-B2B6-CAB39B03DE4C",
    "DataProviderID": 1,
    "DataProvidersReference": "350",
    "AddressInfo": {
        "ID": 46609,
        "Title": "Drammensveien/H.Svartesgt, Oslo",
        "AddressLine1": "Drammensveien 116A",
        "Town": "OSLO",
        "StateOrProvince": "Oslo",
        "Postcode": "0273",
        "CountryID": 168,
        "Latitude": 59.92009,
        "Longitude": 10.69117,
        "AccessComments": "Kommer du fra Skøyen, så er det på høyre hånd av Drammensvn rett før lyskrysset ved H.Svartes gate.",
        "DistanceUnit": 0
    },
    "Connections": [
        {
            "ID": 56926,
            "ConnectionTypeID": 0,
            "Reference": "1",
            "LevelID": 2,
            "Amps": 16,
            "Voltage": 230,
            "PowerKW": 3.7,
            "Comments": "Mode 1"
        },
        {
            "ID": 88646,
            "ConnectionTypeID": 0,
            "Reference": "2",
            "LevelID": 2,
            "Amps": 16,
            "Voltage": 230,
            "PowerKW": 3.7,
            "Comments": "Mode 1"
        }
    ],
    "NumberOfPoints": 2,
    "DateLastStatusUpdate": "2020-05-26T08:23:00Z",
    "DataQualityLevel": 2,
    "DateCreated": "2015-05-03T00:54:00Z",
    "SubmissionStatusTypeID": 100
}