{
    "IsRecentlyVerified": false,
    "ID": 79369,
    "UUID": "6641BCE6-CB47-4EE9-AD19-AFC8D44376CD",
    "DataProviderID": 1,
    "OperatorID": 23,
    "OperatorsReference": "21437",
    "UsageTypeID": 1,
    "UsageCost": "Free",
    "AddressInfo": {
        "ID": 79715,
        "Title": "Parkeringshuset Lyckan",
        "AddressLine1": "Kristinagatan 44",
        "Town": "Norrköping",
        "StateOrProvince": "Östergötlands län",
        "Postcode": "602 25",
        "CountryID": 216,
        "Latitude": 58.5880096759611,
        "Longitude": 16.1923677314569,
        "DistanceUnit": 0
    },
    "Connections": [
        {
            "ID": 114001,
            "ConnectionTypeID": 30,
            "StatusTypeID": 50,
            "LevelID": 2,
            "Amps": 16,
            "Voltage": 400,
            "PowerKW": 11,
            "CurrentTypeID": 20,
            "Quantity": 1
        },
        {
            "ID": 207506,
            "ConnectionTypeID": 25,
            "StatusTypeID": 50,
            "LevelID": 2,
            "Amps": 32,
            "Voltage": 230,
            "PowerKW": 7,
            "CurrentTypeID": 10,
            "Quantity": 8,
            "Comments": "Free charging when parked; fee for parking"
        }
    ],
    "NumberOfPoints": 9,
    "GeneralComments": "1 Tesla Connector, up to 11kW.Available to the public. Self park. 8 type2 connectors, 4 on each level. Free charge with parking.",
    "StatusTypeID": 50,
    "DateLastStatusUpdate": "2020-02-27T06:52:00Z",
    "DataQualityLevel": 1,
    "DateCreated": "2017-01-28T13:42:00Z",
    "SubmissionStatusTypeID": 200
}