{
    "IsRecentlyVerified": false,
    "ID": 3546,
    "UUID": "79AAFB64-DA90-4C42-BE22-B3169BD03462",
    "DataProviderID": 1,
    "OperatorID": 6,
    "UsageTypeID": 1,
    "AddressInfo": {
        "ID": 3547,
        "Title": "Nissan of Clovis",
        "AddressLine1": "370 West Herndon Avenue",
        "Town": "Clovis",
        "StateOrProvince": "CA",
        "Postcode": "93612",
        "CountryID": 2,
        "Latitude": 36.8368,
        "Longitude": -119.716,
        "ContactTelephone1": "559-297-6919",
        "DistanceUnit": 0
    },
    "Connections": [
        {
            "ID": 61,
            "ConnectionTypeID": 1,
            "Quantity": 1
        }
    ],
    "NumberOfPoints": 2,
    "DateLastStatusUpdate": "2019-12-15T06:07:00Z",
    "DateCreated": "2010-02-28T00:00:00Z",
    "SubmissionStatusTypeID": 200
}