{
    "IsRecentlyVerified": false,
    "ID": 93444,
    "UUID": "EAB0721B-38D4-4953-8D1F-DB40F81ACAE6",
    "DataProviderID": 1,
    "OperatorID": 23,
    "OperatorsReference": "35836",
    "UsageTypeID": 6,
    "AddressInfo": {
        "ID": 93790,
        "Title": "El Corte Ingles Bahía Cadiz",
        "AddressLine1": "Av. Las Cortes de Cádiz 1",
        "Town": "Cádiz",
        "StateOrProvince": "Cadiz",
        "Postcode": "11012",
        "CountryID": 210,
        "Latitude": 36.520278,
        "Longitude": -6.2769444,
        "ContactTelephone1": "+34 956 297 100",
        "DistanceUnit": 0
    },
    "Connections": [
        {
            "ID": 132321,
            "ConnectionTypeID": 30,
            "StatusTypeID": 50,
            "LevelID": 2,
            "Amps": 16,
            "Voltage": 400,
            "PowerKW": 11,
            "CurrentTypeID": 20,
            "Quantity": 2
        }
    ],
    "NumberOfPoints": 2,
    "GeneralComments": "2 Tesla Connectors, up to 11kW.Available for patrons only. Self park.",
    "StatusTypeID": 50,
    "DateLastStatusUpdate": "2020-08-17T12:14:00Z",
    "DataQualityLevel": 1,
    "DateCreated": "2017-09-27T19:34:00Z",
    "SubmissionStatusTypeID": 200
}