{
    "IsRecentlyVerified": false,
    "ID": 138345,
    "UUID": "0C84099B-69D8-482F-B5D4-719FEE16E803",
    "DataProviderID": 2,
    "DataProvidersReference": "92436",
    "OperatorID": 5,
    "UsageTypeID": 1,
    "AddressInfo": {
        "ID": 138694,
        "Title": "WINTER PARK",
        "AddressLine1": "500 N Virginia Ave",
        "Town": "Winter Park",
        "StateOrProvince": "FL",
        "Postcode": "32789",
        "CountryID": 2,
        "Latitude": 28.6008287,
        "Longitude": -81.3547183,
        "ContactTelephone1": "888-758-4389",
        "AccessComments": "24 hours daily",
        "RelatedURL": "http://www.chargepoint.com/",
        "DistanceUnit": 0
    },
    "Connections": [
        {
            "ID": 193445,
            "ConnectionTypeID": 1,
            "LevelID": 2,
            "Amps": 16,
            "Voltage": 230,
            "PowerKW": 3.7,
            "CurrentTypeID": 10,
            "Quantity": 1
        }
    ],
    "StatusTypeID": 50,
    "DateLastStatusUpdate": "2020-06-26T02:52:00Z",
    "DataQualityLevel": 3,
    "DateCreated": "2019-12-24T09:08:00Z",
    "SubmissionStatusTypeID": 100
}