{
    "IsRecentlyVerified": false,
    "ID": 180247,
    "UUID": "E09F52F5-576B-4BB2-A629-40D97013E440",
    "DataProviderID": 29,
    "DataProvidersReference": "20820",
    "AddressInfo": {
        "ID": 180606,
        "Title": "Luckenpainterstr.",
        "AddressLine1": "Luckenpainterstr.",
        "Town": "Thalmassing",
        "Postcode": "93107",
        "CountryID": 87,
        "Latitude": 48.908515,
        "Longitude": 12.151766,
        "DistanceUnit": 0
    },
    "Connections": [
        {
            "ID": 283086,
            "ConnectionTypeID": 25,
            "StatusTypeID": 50,
            "LevelID": 2,
            "PowerKW": 22,
            "CurrentTypeID": 20
        },
        {
            "ID": 283087,
            "ConnectionTypeID": 25,
            "StatusTypeID": 50,
            "LevelID": 2,
            "PowerKW": 22,
            "CurrentTypeID": 20
        }
    ],
    "StatusTypeID": 50,
    "DateLastStatusUpdate": "2021-07-12T02:42:00Z",
    "MetadataValues": [
        {
            "ID": 12541,
            "MetadataFieldID": 4,
            "ItemValue": "Data from the German chargepoint registry provided by Bundesnetzagentur.de under the CC-BY 4.0 license"
        }
    ],
    "DataQualityLevel": 3,
    "DateCreated": "2021-07-08T10:00:00Z",
    "SubmissionStatusTypeID": 100
}