{
    "IsRecentlyVerified": false,
    "ID": 179999,
    "UUID": "ACE69536-169B-4355-ADAF-CB2107246229",
    "DataProviderID": 29,
    "DataProvidersReference": "8708",
    "OperatorID": 69,
    "AddressInfo": {
        "ID": 180358,
        "Title": "Lübecker Straße 6c",
        "AddressLine1": "Lübecker Straße 6c",
        "Town": "Krummesse",
        "Postcode": "23628",
        "CountryID": 87,
        "Latitude": 53.781707,
        "Longitude": 10.642045,
        "DistanceUnit": 0
    },
    "Connections": [
        {
            "ID": 282561,
            "ConnectionTypeID": 25,
            "StatusTypeID": 50,
            "LevelID": 2,
            "PowerKW": 22,
            "CurrentTypeID": 20
        },
        {
            "ID": 282562,
            "ConnectionTypeID": 25,
            "StatusTypeID": 50,
            "LevelID": 2,
            "PowerKW": 22,
            "CurrentTypeID": 20
        }
    ],
    "StatusTypeID": 50,
    "DateLastStatusUpdate": "2021-07-12T02:52:00Z",
    "MetadataValues": [
        {
            "ID": 12293,
            "MetadataFieldID": 4,
            "ItemValue": "Data from the German chargepoint registry provided by Bundesnetzagentur.de under the CC-BY 4.0 license"
        }
    ],
    "DataQualityLevel": 3,
    "DateCreated": "2021-07-08T10:00:00Z",
    "SubmissionStatusTypeID": 100
}