{
    "IsRecentlyVerified": false,
    "ID": 64073,
    "UUID": "5E3FD7BA-F813-4C45-8442-A6C1C9448563",
    "DataProviderID": 26,
    "DataProvidersReference": "74474",
    "OperatorID": 103,
    "OperatorsReference": "Allego NLALLEGO0004812",
    "UsageCost": "0.00 jaarabonnement",
    "AddressInfo": {
        "ID": 64419,
        "Title": "Sara de Bronóvoland 8",
        "AddressLine1": "Sara de Bronóvoland 8",
        "Town": "Heerhugowaard",
        "Postcode": "1705 MD",
        "CountryID": 159,
        "Latitude": 52.64910196,
        "Longitude": 4.81527008,
        "ContactTelephone1": "0800-3745337",
        "RelatedURL": "http://www.allego.eu/",
        "DistanceUnit": 0
    },
    "Connections": [
        {
            "ID": 81934,
            "ConnectionTypeID": 25,
            "LevelID": 2,
            "PowerKW": 11,
            "CurrentTypeID": 10
        },
        {
            "ID": 81935,
            "ConnectionTypeID": 25,
            "LevelID": 2,
            "PowerKW": 11,
            "CurrentTypeID": 10
        }
    ],
    "NumberOfPoints": 1,
    "StatusTypeID": 50,
    "DateLastStatusUpdate": "2016-06-04T02:55:00Z",
    "DataQualityLevel": 3,
    "DateCreated": "2016-03-03T12:33:00Z",
    "SubmissionStatusTypeID": 100
}