{
    "IsRecentlyVerified": false,
    "ID": 113554,
    "UUID": "F99E04AF-06D0-4469-92C1-EE727DAFDE99",
    "DataProviderID": 1,
    "OperatorID": 103,
    "UsageTypeID": 4,
    "UsageCost": "£0.25/kWh",
    "AddressInfo": {
        "ID": 113900,
        "Title": "Shell Fiveways",
        "AddressLine1": "Bath Row",
        "Town": "Birmingham",
        "Postcode": "B15 1LS",
        "CountryID": 1,
        "Latitude": 52.472706,
        "Longitude": -1.911813,
        "DistanceUnit": 0
    },
    "Connections": [
        {
            "ID": 160008,
            "ConnectionTypeID": 2,
            "StatusTypeID": 50,
            "LevelID": 3,
            "PowerKW": 50,
            "CurrentTypeID": 30,
            "Quantity": 1
        },
        {
            "ID": 160009,
            "ConnectionTypeID": 33,
            "StatusTypeID": 50,
            "LevelID": 3,
            "PowerKW": 50,
            "CurrentTypeID": 30,
            "Quantity": 1
        },
        {
            "ID": 160010,
            "ConnectionTypeID": 1036,
            "StatusTypeID": 50,
            "LevelID": 3,
            "PowerKW": 43,
            "CurrentTypeID": 20,
            "Quantity": 43
        }
    ],
    "NumberOfPoints": 1,
    "GeneralComments": "Shell Recharge",
    "StatusTypeID": 50,
    "DateLastStatusUpdate": "2018-12-19T22:35:00Z",
    "DataQualityLevel": 1,
    "DateCreated": "2018-12-19T22:35:00Z",
    "SubmissionStatusTypeID": 200
}