{
    "IsRecentlyVerified": false,
    "ID": 120752,
    "UUID": "2EBC9723-1C19-49D5-929E-C023895AD578",
    "DataProviderID": 2,
    "DataProvidersReference": "87905",
    "OperatorID": 5,
    "UsageTypeID": 1,
    "AddressInfo": {
        "ID": 121098,
        "Title": "HOAG HOSPITAL",
        "AddressLine1": "38 Hoag Rd S",
        "Town": "Newport Beach",
        "StateOrProvince": "CA",
        "Postcode": "92663",
        "CountryID": 2,
        "Latitude": 33.624289,
        "Longitude": -117.931232,
        "ContactTelephone1": "888-758-4389",
        "AccessComments": "24 hours daily",
        "RelatedURL": "http://www.chargepoint.com/",
        "DistanceUnit": 0
    },
    "Connections": [
        {
            "ID": 170134,
            "ConnectionTypeID": 1,
            "LevelID": 2,
            "Amps": 16,
            "Voltage": 230,
            "PowerKW": 3,
            "CurrentTypeID": 10,
            "Quantity": 4
        }
    ],
    "DateLastStatusUpdate": "2019-12-24T09:10:00Z",
    "DataQualityLevel": 3,
    "DateCreated": "2019-04-01T04:59:00Z",
    "SubmissionStatusTypeID": 100
}