{
    "IsRecentlyVerified": false,
    "ID": 68273,
    "UUID": "9E29EA7F-7568-4F05-9D37-3DBD293B27EA",
    "DataProviderID": 26,
    "DataProvidersReference": "90261",
    "OperatorID": 177,
    "OperatorsReference": "Nuon EVB-P1523045",
    "UsageCost": "0.00 jaarabonnement",
    "AddressInfo": {
        "ID": 68619,
        "Title": "Zeeweg 42",
        "AddressLine1": "Zeeweg 42",
        "Town": "Bergen (NH)",
        "Postcode": "1865 AC",
        "CountryID": 159,
        "Latitude": 52.660409,
        "Longitude": 4.630658,
        "RelatedURL": "http://www.nuon.nl/ev",
        "DistanceUnit": 0
    },
    "Connections": [
        {
            "ID": 95176,
            "ConnectionTypeID": 25,
            "LevelID": 2,
            "PowerKW": 11,
            "CurrentTypeID": 10
        },
        {
            "ID": 95177,
            "ConnectionTypeID": 25,
            "LevelID": 2,
            "PowerKW": 11,
            "CurrentTypeID": 10
        }
    ],
    "NumberOfPoints": 1,
    "StatusTypeID": 50,
    "DateLastStatusUpdate": "2016-06-04T02:37:00Z",
    "DataQualityLevel": 3,
    "DateCreated": "2016-06-04T02:37:00Z",
    "SubmissionStatusTypeID": 100
}