{
    "IsRecentlyVerified": false,
    "ID": 142141,
    "UUID": "E13797B9-5636-4127-87DB-AA957354C25C",
    "DataProviderID": 2,
    "DataProvidersReference": "122179",
    "OperatorID": 5,
    "UsageTypeID": 1,
    "AddressInfo": {
        "ID": 142493,
        "Title": "WHITEMARSH TWP",
        "AddressLine1": "2015 Joshua Rd",
        "Town": "Lafayette Hill",
        "StateOrProvince": "PA",
        "Postcode": "19444",
        "CountryID": 2,
        "Latitude": 40.0804079,
        "Longitude": -75.2798829,
        "ContactTelephone1": "888-758-4389",
        "AccessComments": "24 hours daily",
        "RelatedURL": "http://www.chargepoint.com/",
        "DistanceUnit": 0
    },
    "Connections": [
        {
            "ID": 198214,
            "ConnectionTypeID": 1,
            "LevelID": 2,
            "Amps": 16,
            "Voltage": 230,
            "PowerKW": 3.7,
            "CurrentTypeID": 10,
            "Quantity": 2
        }
    ],
    "StatusTypeID": 50,
    "DateLastStatusUpdate": "2020-06-26T03:02:00Z",
    "DataQualityLevel": 3,
    "DateCreated": "2019-12-24T09:17:00Z",
    "SubmissionStatusTypeID": 100
}