{
    "IsRecentlyVerified": false,
    "ID": 39181,
    "UUID": "E05C7B8E-1C60-4950-AA75-357377043368",
    "DataProviderID": 26,
    "DataProvidersReference": "30493",
    "OperatorID": 108,
    "OperatorsReference": "Vattenfall Hamburg Energie",
    "UsageCost": "0.00 afhankelijk van pas",
    "AddressInfo": {
        "ID": 39527,
        "Title": "Max-Brauer-Allee 54",
        "AddressLine1": "Max-Brauer-Allee 54",
        "Town": "Hamburg",
        "Postcode": "22765",
        "CountryID": 87,
        "Latitude": 53.5525892,
        "Longitude": 9.9377075,
        "ContactTelephone1": "+49(0)800-2 335 335",
        "ContactEmail": "emobility@vattenfall.de",
        "RelatedURL": "http://www.vattenfall.de/de/emobility/ladestationen-hamburg.htm",
        "DistanceUnit": 0
    },
    "Connections": [
        {
            "ID": 42692,
            "ConnectionTypeID": 25,
            "LevelID": 2,
            "PowerKW": 5,
            "CurrentTypeID": 10
        },
        {
            "ID": 49916,
            "ConnectionTypeID": 25,
            "LevelID": 2,
            "PowerKW": 5,
            "CurrentTypeID": 10
        },
        {
            "ID": 49917,
            "ConnectionTypeID": 25,
            "LevelID": 2,
            "PowerKW": 5,
            "CurrentTypeID": 10
        }
    ],
    "NumberOfPoints": 2,
    "StatusTypeID": 50,
    "DateLastStatusUpdate": "2015-02-09T03:30:00Z",
    "DataQualityLevel": 3,
    "DateCreated": "2015-01-09T06:08:00Z",
    "SubmissionStatusTypeID": 100
}