{
    "IsRecentlyVerified": false,
    "ID": 92531,
    "UUID": "B3E01310-72B5-403C-9AF7-CC4F96349FC3",
    "DataProviderID": 1,
    "OperatorID": 23,
    "OperatorsReference": "33674",
    "UsageTypeID": 4,
    "AddressInfo": {
        "ID": 92877,
        "Title": "The Pig At Combe",
        "AddressLine1": "The Pig At Combe",
        "Town": "Gittisham",
        "StateOrProvince": "Honiton",
        "Postcode": "EX14 3AD",
        "CountryID": 1,
        "Latitude": 50.773982,
        "Longitude": -3.21689,
        "ContactTelephone1": "+44 140 454 0400",
        "DistanceUnit": 0
    },
    "Connections": [
        {
            "ID": 131132,
            "ConnectionTypeID": 30,
            "StatusTypeID": 50,
            "LevelID": 2,
            "Amps": 32,
            "Voltage": 400,
            "PowerKW": 22,
            "CurrentTypeID": 20,
            "Quantity": 1
        }
    ],
    "NumberOfPoints": 1,
    "GeneralComments": "1 Tesla Connector, up to 22kW.Available to the public. Please see front desk.",
    "StatusTypeID": 50,
    "DateLastStatusUpdate": "2018-10-03T20:04:00Z",
    "DataQualityLevel": 1,
    "DateCreated": "2017-09-07T05:57:00Z",
    "SubmissionStatusTypeID": 200
}