{
    "IsRecentlyVerified": false,
    "ID": 100086,
    "UUID": "8A2B25B4-8729-468A-B5E3-4E6D1D745960",
    "DataProviderID": 1,
    "OperatorID": 23,
    "OperatorsReference": "28549",
    "UsageTypeID": 4,
    "UsageCost": "$0.22/min >=60kW; $0.11/min <60kW; other tariffs for older cars",
    "AddressInfo": {
        "ID": 100432,
        "Title": "Madison, Wi - E. Washington Ave. Supercharger",
        "AddressLine1": "3801 E. Washington Ave",
        "Town": "Madison",
        "StateOrProvince": "WI",
        "Postcode": "53704",
        "CountryID": 2,
        "Latitude": 43.119175,
        "Longitude": -89.319124,
        "DistanceUnit": 0
    },
    "Connections": [
        {
            "ID": 141389,
            "ConnectionTypeID": 27,
            "StatusTypeID": 50,
            "LevelID": 3,
            "PowerKW": 120,
            "CurrentTypeID": 30,
            "Quantity": 8
        }
    ],
    "NumberOfPoints": 8,
    "GeneralComments": "Charging8 Superchargers, available 24/7, up to 120kW",
    "StatusTypeID": 50,
    "DateLastStatusUpdate": "2018-03-13T08:48:00Z",
    "DataQualityLevel": 1,
    "DateCreated": "2018-02-12T06:44:00Z",
    "SubmissionStatusTypeID": 200
}