{
    "IsRecentlyVerified": false,
    "ID": 159018,
    "UUID": "5450CD51-C548-47F8-B01A-8BE9861F3873",
    "DataProviderID": 2,
    "DataProvidersReference": "156135",
    "OperatorID": 5,
    "UsageTypeID": 1,
    "AddressInfo": {
        "ID": 159375,
        "Title": "QUAGLINO PROP",
        "AddressLine1": "892 Aerovista Pl",
        "Town": "San Luis Obispo",
        "StateOrProvince": "CA",
        "Postcode": "93401",
        "CountryID": 2,
        "Latitude": 35.243218,
        "Longitude": -120.640961,
        "ContactTelephone1": "888-758-4389",
        "AccessComments": "24 hours daily",
        "RelatedURL": "http://www.chargepoint.com/",
        "DistanceUnit": 0
    },
    "Connections": [
        {
            "ID": 229082,
            "ConnectionTypeID": 1,
            "LevelID": 2,
            "Amps": 16,
            "Voltage": 230,
            "PowerKW": 3.7,
            "CurrentTypeID": 10,
            "Quantity": 4
        }
    ],
    "StatusTypeID": 50,
    "DateLastStatusUpdate": "2020-06-26T02:58:00Z",
    "DataQualityLevel": 3,
    "DateCreated": "2020-06-26T02:58:00Z",
    "SubmissionStatusTypeID": 100
}