{
    "IsRecentlyVerified": false,
    "ID": 136660,
    "UUID": "0B4FA165-04DB-48C1-9FC4-456718CE1C09",
    "DataProviderID": 18,
    "DataProvidersReference": "c7c9ff0f870462d9fb21b904e01cce9e",
    "OperatorID": 8,
    "UsageTypeID": 4,
    "AddressInfo": {
        "ID": 137006,
        "Title": "Dealership forecourt",
        "AddressLine1": "",
        "AddressLine2": "Bromyard",
        "Town": "Worcester",
        "Postcode": "WR2 5HW",
        "CountryID": 1,
        "Latitude": 52.187005,
        "Longitude": -2.247648,
        "AccessComments": "Dealership forecourt. Access for Nissan and Renault customers only. Please report to reception. Fitted under Midlands PiP",
        "RelatedURL": "https://www.bpchargemaster.com",
        "DistanceUnit": 0
    },
    "Connections": [
        {
            "ID": 191191,
            "ConnectionTypeID": 25,
            "Reference": "0",
            "StatusTypeID": 50,
            "LevelID": 2,
            "Amps": 32,
            "Voltage": 400,
            "PowerKW": 22,
            "CurrentTypeID": 20
        },
        {
            "ID": 191192,
            "ConnectionTypeID": 25,
            "Reference": "1",
            "StatusTypeID": 50,
            "LevelID": 2,
            "Amps": 32,
            "Voltage": 400,
            "PowerKW": 22,
            "CurrentTypeID": 20
        }
    ],
    "StatusTypeID": 0,
    "DateLastStatusUpdate": "2019-12-24T05:22:00Z",
    "MetadataValues": [
        {
            "ID": 6512,
            "MetadataFieldID": 4,
            "ItemValue": "Contains public sector information licensed under the Open Government Licence v2.0. http://www.nationalarchives.gov.uk/doc/open-government-licence/version/2/"
        }
    ],
    "DataQualityLevel": 3,
    "DateCreated": "2019-12-24T05:22:00Z",
    "SubmissionStatusTypeID": 100
}