{
    "IsRecentlyVerified": false,
    "ID": 145234,
    "UUID": "764F81C7-E84A-4E43-9B0F-0B208D57B515",
    "DataProviderID": 2,
    "DataProvidersReference": "145252",
    "OperatorID": 3293,
    "UsageTypeID": 1,
    "AddressInfo": {
        "ID": 145586,
        "Title": "Capital Mall - REI",
        "AddressLine1": "625 Black Lake Blvd",
        "Town": "Olympia",
        "StateOrProvince": "WA",
        "Postcode": "98502",
        "CountryID": 2,
        "Latitude": 47.042021,
        "Longitude": -122.938312,
        "ContactTelephone1": "888-264-2208",
        "AccessComments": "6am-12am daily",
        "RelatedURL": "https://voltacharging.com/",
        "DistanceUnit": 0
    },
    "Connections": [
        {
            "ID": 201855,
            "ConnectionTypeID": 1,
            "LevelID": 2,
            "Amps": 16,
            "Voltage": 230,
            "PowerKW": 3.7,
            "CurrentTypeID": 10,
            "Quantity": 2
        }
    ],
    "StatusTypeID": 50,
    "DateLastStatusUpdate": "2020-06-26T03:10:00Z",
    "DataQualityLevel": 3,
    "DateCreated": "2019-12-24T09:24:00Z",
    "SubmissionStatusTypeID": 100
}