{
    "IsRecentlyVerified": false,
    "ID": 122672,
    "UUID": "DBE17EE8-0E66-42D4-8B05-134ADAE85B47",
    "DataProviderID": 2,
    "DataProvidersReference": "103802",
    "UsageTypeID": 2,
    "AddressInfo": {
        "ID": 123018,
        "Title": "LADWP - Sylmar Converter Station",
        "AddressLine1": "13501 Central Ave",
        "Town": "Sylmar",
        "StateOrProvince": "CA",
        "Postcode": "91342",
        "CountryID": 2,
        "Latitude": 34.313095,
        "Longitude": -118.480525,
        "ContactTelephone1": "",
        "AccessComments": "Fleet use only",
        "RelatedURL": "",
        "DistanceUnit": 0
    },
    "Connections": [
        {
            "ID": 172581,
            "ConnectionTypeID": 1,
            "LevelID": 2,
            "Amps": 16,
            "Voltage": 230,
            "PowerKW": 3.7,
            "CurrentTypeID": 10,
            "Quantity": 2
        }
    ],
    "DateLastStatusUpdate": "2020-06-26T02:57:00Z",
    "DataQualityLevel": 3,
    "DateCreated": "2019-04-06T05:03:00Z",
    "SubmissionStatusTypeID": 100
}