{
    "IsRecentlyVerified": false,
    "ID": 143178,
    "UUID": "CE3C8CF8-F75B-4A4C-AE50-C9C8F87D535F",
    "DataProviderID": 2,
    "DataProvidersReference": "148090",
    "OperatorID": 39,
    "UsageTypeID": 1,
    "AddressInfo": {
        "ID": 143530,
        "Title": "135 south Road",
        "AddressLine1": "135 South Road",
        "Town": "Bedford",
        "StateOrProvince": "MA",
        "Postcode": "01730",
        "CountryID": 2,
        "Latitude": 42.4853855,
        "Longitude": -71.2778623,
        "ContactTelephone1": "800-663-5633",
        "AccessComments": "MO: Not Specified; TU: Not Specified; WE: Not Specified; TH: Not Specified; FR: Not Specified; SA: Not Specified; SU: Not Specified",
        "RelatedURL": "http://www.semacharge.com/",
        "DistanceUnit": 0
    },
    "Connections": [
        {
            "ID": 199456,
            "ConnectionTypeID": 1,
            "LevelID": 2,
            "Amps": 16,
            "Voltage": 230,
            "PowerKW": 3.7,
            "CurrentTypeID": 10,
            "Quantity": 3
        }
    ],
    "StatusTypeID": 50,
    "DateLastStatusUpdate": "2020-06-26T03:06:00Z",
    "DataQualityLevel": 3,
    "DateCreated": "2019-12-24T09:20:00Z",
    "SubmissionStatusTypeID": 100
}