{
    "IsRecentlyVerified": false,
    "ID": 9703,
    "UUID": "8AA92A13-81B6-4526-B84B-A1CF04DE930F",
    "DataProviderID": 15,
    "DataProvidersReference": "16985",
    "OperatorID": 5,
    "UsageTypeID": 2,
    "AddressInfo": {
        "ID": 9600,
        "Title": "170 Wood Ave S",
        "AddressLine1": "170 Wood Ave S",
        "Town": "Iselin",
        "StateOrProvince": "New Jersey",
        "Postcode": "8830",
        "CountryID": 2,
        "Latitude": 40.56165,
        "Longitude": -74.32923,
        "ContactTelephone1": "",
        "RelatedURL": "http://carstations.com/16985",
        "DistanceUnit": 0
    },
    "Connections": [
        {
            "ID": 7510,
            "ConnectionTypeID": 1,
            "Reference": "J1772",
            "LevelID": 2
        }
    ],
    "NumberOfPoints": 2,
    "StatusTypeID": 50,
    "DateLastStatusUpdate": "2017-11-04T14:04:00Z",
    "DataQualityLevel": 2,
    "DateCreated": "2012-04-16T15:46:00Z",
    "SubmissionStatusTypeID": 100
}