{
    "IsRecentlyVerified": false,
    "ID": 87436,
    "UUID": "F2F88132-0559-4651-A302-6D22F825B319",
    "DataProviderID": 1,
    "OperatorID": 3266,
    "UsageTypeID": 4,
    "AddressInfo": {
        "ID": 87782,
        "Title": "Stadtweg",
        "AddressLine1": "Stadtweg 52",
        "Town": "Borchen",
        "StateOrProvince": "Kreis Paderborn",
        "Postcode": "33178",
        "CountryID": 87,
        "Latitude": 51.666988085243645,
        "Longitude": 8.723687068617192,
        "AccessComments": "Türkisfarbene Ladesäule am Ende des Seitenstreifens hinter der Esso Tankstelle.",
        "DistanceUnit": 0
    },
    "Connections": [
        {
            "ID": 123948,
            "ConnectionTypeID": 25,
            "StatusTypeID": 50,
            "LevelID": 2,
            "Amps": 32,
            "Voltage": 400,
            "PowerKW": 22,
            "CurrentTypeID": 20,
            "Quantity": 2
        }
    ],
    "NumberOfPoints": 2,
    "StatusTypeID": 50,
    "DateLastStatusUpdate": "2017-05-08T07:12:00Z",
    "DataQualityLevel": 1,
    "DateCreated": "2017-05-08T07:12:00Z",
    "SubmissionStatusTypeID": 200
}