{
    "UserComments": [
        {
            "ID": 19664,
            "ChargePointID": 4390,
            "CommentTypeID": 10,
            "UserName": "Simon Hewison",
            "Comment": "Worked with older Source London card ",
            "Rating": 4,
            "DateCreated": "2018-06-16T09:01:11.333Z",
            "User": {
                "ID": 4575,
                "Username": "Simon Hewison"
            },
            "CheckinStatusTypeID": 10
        },
        {
            "ID": 741,
            "ChargePointID": 4390,
            "CommentTypeID": 10,
            "UserName": "bgraabek",
            "Comment": "",
            "Rating": 4,
            "DateCreated": "2014-04-17T22:18:36.983Z",
            "User": {
                "ID": 1776,
                "Username": "bgraabek"
            },
            "CheckinStatusTypeID": 10
        }
    ],
    "MediaItems": [
        {
            "ID": 15702,
            "ChargePointID": 4390,
            "ItemURL": "https://s3-ap-southeast-2.amazonaws.com/openchargemap/images/GB/OCM4390/OCM-4390.orig.2018061821142820.jpg",
            "ItemThumbnailURL": "https://s3-ap-southeast-2.amazonaws.com/openchargemap/images/GB/OCM4390/OCM-4390.thmb.2018061821142820.jpg",
            "Comment": "",
            "IsEnabled": true,
            "IsVideo": false,
            "IsFeaturedItem": false,
            "IsExternalResource": false,
            "User": {
                "ID": 4575,
                "Username": "Simon Hewison"
            },
            "DateCreated": "2018-06-18T21:15:00Z"
        }
    ],
    "IsRecentlyVerified": false,
    "ID": 4390,
    "UUID": "895E7506-918C-41E5-8384-CF4413B172A8",
    "DataProviderID": 1,
    "OperatorID": 3,
    "OperatorsReference": "PG-91553,PG-91623,PG-91683",
    "UsageTypeID": 4,
    "UsageCost": "Free",
    "AddressInfo": {
        "ID": 4377,
        "Title": "76 Upper Ground",
        "AddressLine1": "Waterloo",
        "AddressLine2": "Lambeth",
        "Town": "London",
        "Postcode": "SE1 9PP",
        "CountryID": 1,
        "Latitude": 51.5068393098305,
        "Longitude": -0.111933946609497,
        "AccessComments": "Outside IBM. Max stay 3 hours while charging",
        "DistanceUnit": 0
    },
    "Connections": [
        {
            "ID": 20002,
            "ConnectionTypeID": 3,
            "StatusTypeID": 50,
            "LevelID": 2,
            "Amps": 13,
            "Voltage": 230,
            "PowerKW": 3,
            "CurrentTypeID": 10,
            "Quantity": 1
        },
        {
            "ID": 176689,
            "ConnectionTypeID": 25,
            "StatusTypeID": 50,
            "LevelID": 2,
            "Amps": 32,
            "Voltage": 400,
            "PowerKW": 7,
            "CurrentTypeID": 20,
            "Quantity": 2
        },
        {
            "ID": 176880,
            "ConnectionTypeID": 25,
            "StatusTypeID": 50,
            "LevelID": 2,
            "Amps": 32,
            "Voltage": 400,
            "PowerKW": 22,
            "CurrentTypeID": 20,
            "Quantity": 1
        }
    ],
    "NumberOfPoints": 2,
    "GeneralComments": "Need to register with Source London.",
    "StatusTypeID": 50,
    "DateLastStatusUpdate": "2019-05-13T16:37:00Z",
    "DataQualityLevel": 1,
    "DateCreated": "2011-05-17T17:23:00Z",
    "SubmissionStatusTypeID": 200
}