{
    "IsRecentlyVerified": false,
    "ID": 144153,
    "UUID": "260904AB-2747-4A76-9580-CB90200BA1EF",
    "DataProviderID": 2,
    "DataProvidersReference": "129650",
    "OperatorID": 89,
    "UsageTypeID": 1,
    "AddressInfo": {
        "ID": 144505,
        "Title": "3050 Boul de Portland",
        "AddressLine1": "3050 Boul de Portland",
        "Town": "Sherbrooke",
        "StateOrProvince": "QC",
        "Postcode": "J1L 1K1",
        "CountryID": 44,
        "Latitude": 45.403183,
        "Longitude": -71.950331,
        "ContactTelephone1": "888-356-8911",
        "AccessComments": "24 hours daily",
        "RelatedURL": "https://flo.ca/",
        "DistanceUnit": 0
    },
    "Connections": [
        {
            "ID": 200634,
            "ConnectionTypeID": 1,
            "LevelID": 2,
            "Amps": 16,
            "Voltage": 230,
            "PowerKW": 3.7,
            "CurrentTypeID": 10,
            "Quantity": 4
        }
    ],
    "StatusTypeID": 50,
    "DateLastStatusUpdate": "2020-06-26T03:09:00Z",
    "DataQualityLevel": 3,
    "DateCreated": "2019-12-24T09:23:00Z",
    "SubmissionStatusTypeID": 100
}