{
    "IsRecentlyVerified": false,
    "ID": 5711,
    "UUID": "BE07F9C5-9D18-4DBF-A85C-F43936640784",
    "DataProviderID": 1,
    "OperatorID": 23,
    "UsageTypeID": 1,
    "UsageCost": "Free",
    "AddressInfo": {
        "ID": 5633,
        "Title": "アイアイイスズ",
        "AddressLine1": "多肥下町 1523-1",
        "Town": "高松市",
        "StateOrProvince": "香川県",
        "Postcode": "761-8071",
        "CountryID": 114,
        "Latitude": 34.3055248,
        "Longitude": 134.05958080000005,
        "ContactTelephone1": "087-864-5225",
        "AccessComments": "operating hours: 11 am - 8 pm",
        "DistanceUnit": 0
    },
    "Connections": [
        {
            "ID": 460,
            "ConnectionTypeID": 8,
            "StatusTypeID": 50,
            "LevelID": 2,
            "Amps": 70,
            "Voltage": 230,
            "PowerKW": 16.8,
            "CurrentTypeID": 10
        }
    ],
    "NumberOfPoints": 2,
    "StatusTypeID": 50,
    "DateLastStatusUpdate": "2015-10-14T13:37:00Z",
    "DataQualityLevel": 1,
    "DateCreated": "2011-09-09T11:40:00Z",
    "SubmissionStatusTypeID": 200
}