{
    "IsRecentlyVerified": false,
    "ID": 186187,
    "UUID": "F01C3959-00CA-44D1-98F5-DA2AC7369BFC",
    "DataProviderID": 29,
    "DataProvidersReference": "217",
    "AddressInfo": {
        "ID": 186546,
        "Title": "Geistinger Platz / Stoßdorfer Str. 2",
        "AddressLine1": "Geistinger Platz / Stoßdorfer Str. 2",
        "Town": "Hennef",
        "Postcode": "53773",
        "CountryID": 87,
        "Latitude": 50.772477,
        "Longitude": 7.26842,
        "DistanceUnit": 0
    },
    "Connections": [
        {
            "ID": 298139,
            "ConnectionTypeID": 25,
            "StatusTypeID": 50,
            "LevelID": 2,
            "PowerKW": 22,
            "CurrentTypeID": 20
        },
        {
            "ID": 298140,
            "ConnectionTypeID": 25,
            "StatusTypeID": 50,
            "LevelID": 2,
            "PowerKW": 22,
            "CurrentTypeID": 20
        }
    ],
    "StatusTypeID": 50,
    "DateLastStatusUpdate": "2021-07-12T02:45:00Z",
    "MetadataValues": [
        {
            "ID": 18429,
            "MetadataFieldID": 4,
            "ItemValue": "Data from the German chargepoint registry provided by Bundesnetzagentur.de under the CC-BY 4.0 license"
        }
    ],
    "DataQualityLevel": 3,
    "DateCreated": "2021-07-12T02:45:00Z",
    "SubmissionStatusTypeID": 100
}