{
    "IsRecentlyVerified": false,
    "ID": 84850,
    "UUID": "35EDFCCC-6ADE-4A4C-929E-6CA73639774E",
    "DataProviderID": 1,
    "OperatorID": 103,
    "UsageTypeID": 4,
    "AddressInfo": {
        "ID": 85196,
        "Title": "Media Markt",
        "AddressLine1": "Friedrich-Rätzer-Straße 3",
        "Town": "Schweinfurt",
        "StateOrProvince": "Schweinfurt",
        "Postcode": "97424",
        "CountryID": 87,
        "Latitude": 50.0280474,
        "Longitude": 10.237054400000034,
        "AccessComments": "Beschrankter Parkplatz, daher nur bei geöffneter Schranke Mo-Fr 10-20Uhr, Sa 09:30-18:00Uhr nutzbar. 2 kostenlose Parkplätze",
        "DistanceUnit": 0
    },
    "Connections": [
        {
            "ID": 120568,
            "ConnectionTypeID": 2,
            "StatusTypeID": 50,
            "LevelID": 3,
            "PowerKW": 50,
            "CurrentTypeID": 30,
            "Quantity": 1
        },
        {
            "ID": 120569,
            "ConnectionTypeID": 33,
            "StatusTypeID": 50,
            "LevelID": 3,
            "PowerKW": 50,
            "CurrentTypeID": 30,
            "Quantity": 1
        },
        {
            "ID": 120570,
            "ConnectionTypeID": 1036,
            "StatusTypeID": 50,
            "LevelID": 3,
            "Amps": 63,
            "Voltage": 400,
            "PowerKW": 43,
            "CurrentTypeID": 20,
            "Quantity": 1
        }
    ],
    "NumberOfPoints": 3,
    "StatusTypeID": 50,
    "DateLastStatusUpdate": "2017-03-20T06:55:00Z",
    "DataQualityLevel": 1,
    "DateCreated": "2017-03-20T06:55:00Z",
    "SubmissionStatusTypeID": 200
}