{
    "IsRecentlyVerified": false,
    "ID": 109040,
    "UUID": "0198F94B-7D32-4895-82FA-CD80ECA0118A",
    "DataProviderID": 1,
    "OperatorID": 23,
    "OperatorsReference": "45113",
    "UsageTypeID": 6,
    "AddressInfo": {
        "ID": 109386,
        "Title": "Naturarte - Boutique Hotel",
        "AddressLine1": "Naturarte",
        "Town": "São Luís",
        "Postcode": "7630-440",
        "CountryID": 180,
        "Latitude": 37.72144,
        "Longitude": -8.675107,
        "ContactTelephone1": "351913619939",
        "AccessComments": "Only for customers",
        "DistanceUnit": 0
    },
    "Connections": [
        {
            "ID": 154158,
            "ConnectionTypeID": 30,
            "StatusTypeID": 50,
            "LevelID": 2,
            "Amps": 16,
            "Voltage": 400,
            "PowerKW": 11,
            "CurrentTypeID": 20,
            "Quantity": 1
        }
    ],
    "NumberOfPoints": 1,
    "GeneralComments": "1 Tesla Connector, up to 11kW.Available by reservation only. Please call ahead.",
    "StatusTypeID": 50,
    "DateLastStatusUpdate": "2020-07-23T09:17:00Z",
    "DataQualityLevel": 1,
    "DateCreated": "2018-10-11T13:26:00Z",
    "SubmissionStatusTypeID": 200
}