{
    "IsRecentlyVerified": false,
    "ID": 20212,
    "UUID": "E1825A75-3E02-435F-A115-24A00AF88ADA",
    "DataProviderID": 1,
    "OperatorID": 1,
    "UsageTypeID": 0,
    "UsageCost": "",
    "AddressInfo": {
        "ID": 20557,
        "Title": "Automobiles Marmandaises et Compagnie",
        "AddressLine1": "Route de Bordeaux",
        "AddressLine2": "",
        "Town": "",
        "StateOrProvince": "Marmande",
        "Postcode": "47200",
        "CountryID": 80,
        "Latitude": 44.51683,
        "Longitude": 0.12377,
        "ContactTelephone1": "",
        "ContactTelephone2": "",
        "ContactEmail": "",
        "AccessComments": "Réservé aux clients de l'établissement",
        "RelatedURL": "",
        "DistanceUnit": 0
    },
    "Connections": [],
    "GeneralComments": "",
    "StatusTypeID": 50,
    "DateLastStatusUpdate": "2013-11-06T21:25:00Z",
    "DataQualityLevel": 1,
    "DateCreated": "2013-11-06T11:50:00Z",
    "SubmissionStatusTypeID": 200
}