{
    "IsRecentlyVerified": false,
    "ID": 154450,
    "UUID": "D036D489-D2CB-4BEE-A3E6-9C5EF95700AC",
    "DataProviderID": 28,
    "DataProvidersReference": "FR*SOD*S*NPDC*235*1*_*_",
    "UsageTypeID": 5,
    "AddressInfo": {
        "ID": 154803,
        "Title": "Templemars - salle des Fêtes",
        "AddressLine1": "Rue du Chevalier de la Barre, Templemars",
        "CountryID": 80,
        "Latitude": 50.571841,
        "Longitude": 3.054466,
        "AccessComments": "24/24 7/7 jours",
        "DistanceUnit": 0
    },
    "Connections": [
        {
            "ID": 217206,
            "ConnectionTypeID": 28,
            "StatusTypeID": 50,
            "LevelID": 2,
            "PowerKW": 22,
            "CurrentTypeID": 10
        },
        {
            "ID": 217207,
            "ConnectionTypeID": 1036,
            "StatusTypeID": 50,
            "LevelID": 2,
            "PowerKW": 22,
            "CurrentTypeID": 20
        }
    ],
    "GeneralComments": "\"Type charge indiquée selon décret de 2017",
    "StatusTypeID": 50,
    "DateLastStatusUpdate": "2020-08-27T05:16:00Z",
    "DataQualityLevel": 2,
    "DateCreated": "2020-03-15T10:55:00Z",
    "SubmissionStatusTypeID": 100
}