{
    "IsRecentlyVerified": false,
    "ID": 167544,
    "UUID": "B4C830BD-D705-4D31-9037-DAEB3DA1F5CB",
    "DataProviderID": 19,
    "DataProvidersReference": "6683",
    "AddressInfo": {
        "ID": 167903,
        "Title": "Otto Sogns vei",
        "AddressLine1": "Otto Sogns vei 5",
        "Town": "OSLO",
        "StateOrProvince": "Oslo",
        "Postcode": "0681",
        "CountryID": 168,
        "Latitude": 59.89923,
        "Longitude": 10.81796,
        "AccessComments": "",
        "DistanceUnit": 0
    },
    "Connections": [
        {
            "ID": 254178,
            "ConnectionTypeID": 25,
            "Reference": "1",
            "LevelID": 2,
            "Amps": 32,
            "Voltage": 230,
            "PowerKW": 7.4,
            "CurrentTypeID": 10,
            "Comments": "Mode 3"
        },
        {
            "ID": 254179,
            "ConnectionTypeID": 25,
            "Reference": "2",
            "LevelID": 2,
            "Amps": 32,
            "Voltage": 230,
            "PowerKW": 7.4,
            "CurrentTypeID": 10,
            "Comments": "Mode 3"
        },
        {
            "ID": 254180,
            "ConnectionTypeID": 25,
            "Reference": "3",
            "LevelID": 2,
            "Amps": 32,
            "Voltage": 230,
            "PowerKW": 7.4,
            "CurrentTypeID": 10,
            "Comments": "Mode 3"
        },
        {
            "ID": 254181,
            "ConnectionTypeID": 25,
            "Reference": "4",
            "LevelID": 2,
            "Amps": 32,
            "Voltage": 230,
            "PowerKW": 7.4,
            "CurrentTypeID": 10,
            "Comments": "Mode 3"
        },
        {
            "ID": 254182,
            "ConnectionTypeID": 25,
            "Reference": "5",
            "LevelID": 2,
            "Amps": 32,
            "Voltage": 230,
            "PowerKW": 7.4,
            "CurrentTypeID": 10,
            "Comments": "Mode 3"
        },
        {
            "ID": 254183,
            "ConnectionTypeID": 25,
            "Reference": "6",
            "LevelID": 2,
            "Amps": 32,
            "Voltage": 230,
            "PowerKW": 7.4,
            "CurrentTypeID": 10,
            "Comments": "Mode 3"
        }
    ],
    "NumberOfPoints": 6,
    "StatusTypeID": 0,
    "DateLastStatusUpdate": "2021-03-24T05:11:00Z",
    "DataQualityLevel": 2,
    "DateCreated": "2020-09-08T04:14:00Z",
    "SubmissionStatusTypeID": 100
}