{
    "IsRecentlyVerified": false,
    "ID": 154571,
    "UUID": "4707C489-DF33-4923-A537-2C45BAEE3010",
    "DataProviderID": 1,
    "OperatorID": 3,
    "OperatorsReference": "PG-80579",
    "UsageTypeID": 4,
    "UsageCost": "£0.31/kWh",
    "AddressInfo": {
        "ID": 154924,
        "Title": "Charlotte Street Car Park 2",
        "AddressLine1": "9 Charlotte Street",
        "Town": "Bath",
        "Postcode": "BA1 2NE",
        "CountryID": 1,
        "Latitude": 51.38362,
        "Longitude": -2.366961,
        "AccessComments": "There are two 7kw/7kw Podpoints at Charlotte Street Car Park.",
        "RelatedURL": "http://pod-point.com",
        "DistanceUnit": 0
    },
    "Connections": [
        {
            "ID": 217413,
            "ConnectionTypeID": 25,
            "Reference": "1",
            "StatusTypeID": 50,
            "LevelID": 2,
            "Amps": 32,
            "Voltage": 230,
            "PowerKW": 7,
            "CurrentTypeID": 10,
            "Quantity": 2
        }
    ],
    "NumberOfPoints": 3,
    "StatusTypeID": 50,
    "DateLastStatusUpdate": "2021-03-07T06:23:00Z",
    "MetadataValues": [
        {
            "ID": 7124,
            "MetadataFieldID": 4,
            "ItemValue": "Contains public sector information licensed under the Open Government Licence v2.0. http://www.nationalarchives.gov.uk/doc/open-government-licence/version/2/"
        }
    ],
    "DataQualityLevel": 3,
    "DateCreated": "2020-03-17T08:14:00Z",
    "SubmissionStatusTypeID": 100
}