{
    "IsRecentlyVerified": false,
    "ID": 111657,
    "UUID": "8053EBD2-30BF-41D7-A598-0B0F4962CEB8",
    "DataProviderID": 2,
    "DataProvidersReference": "83562",
    "UsageTypeID": 1,
    "AddressInfo": {
        "ID": 112003,
        "Title": "Edmundston Madawaska Tourism",
        "AddressLine1": "121 Victoria St",
        "Town": "Edmundston",
        "StateOrProvince": "NB",
        "Postcode": "E3V 2H5",
        "CountryID": 44,
        "Latitude": 47.367005,
        "Longitude": -68.321479,
        "ContactTelephone1": "866-737-6766",
        "AccessComments": "24 hours daily",
        "RelatedURL": "",
        "DistanceUnit": 0
    },
    "Connections": [
        {
            "ID": 157134,
            "ConnectionTypeID": 1,
            "LevelID": 2,
            "Amps": 16,
            "Voltage": 230,
            "PowerKW": 3.7,
            "CurrentTypeID": 10,
            "Quantity": 1
        }
    ],
    "DateLastStatusUpdate": "2020-06-26T03:10:00Z",
    "DataQualityLevel": 3,
    "DateCreated": "2018-10-18T23:37:00Z",
    "SubmissionStatusTypeID": 100
}