{
    "IsRecentlyVerified": false,
    "ID": 159377,
    "UUID": "72D16BD7-11C6-4D8C-8AB9-35D7DD2C8BBF",
    "DataProviderID": 2,
    "DataProvidersReference": "154691",
    "OperatorID": 59,
    "UsageTypeID": 2,
    "AddressInfo": {
        "ID": 159734,
        "Title": "Baltimore Gas & Electric - Thomas Farm Community Center",
        "AddressLine1": "700 Fallsgrove Dr",
        "Town": "Rockville",
        "StateOrProvince": "MD",
        "Postcode": "20850",
        "CountryID": 2,
        "Latitude": 39.098721,
        "Longitude": -77.186588,
        "ContactTelephone1": "240-314-8840",
        "AccessComments": "",
        "RelatedURL": "http://greenlots.com/",
        "DistanceUnit": 0
    },
    "Connections": [
        {
            "ID": 229536,
            "ConnectionTypeID": 1,
            "LevelID": 2,
            "Amps": 16,
            "Voltage": 230,
            "PowerKW": 3.7,
            "CurrentTypeID": 10,
            "Quantity": 2
        }
    ],
    "GeneralComments": "Planned for future date. Not Operational.",
    "DatePlanned": "2020-06-01T00:00:00Z",
    "StatusTypeID": 150,
    "DateLastStatusUpdate": "2020-06-26T03:01:00Z",
    "DataQualityLevel": 3,
    "DateCreated": "2020-06-26T03:01:00Z",
    "SubmissionStatusTypeID": 100
}