{
    "IsRecentlyVerified": false,
    "ID": 137470,
    "UUID": "0DCB4FBB-82A6-4B11-94D6-F56D1AF40F69",
    "DataProviderID": 2,
    "DataProvidersReference": "145132",
    "OperatorID": 9,
    "UsageTypeID": 1,
    "AddressInfo": {
        "ID": 137816,
        "Title": "Kroger Store #243",
        "AddressLine1": "3300 Montrose Blvd",
        "Town": "Houston",
        "StateOrProvince": "TX",
        "Postcode": "77006",
        "CountryID": 2,
        "Latitude": 29.7425,
        "Longitude": -95.3917,
        "ContactTelephone1": "888-998-2546",
        "AccessComments": "MON: 24 hours | TUE: 24 hours | WED: 24 hours | THU: 24 hours | FRI: 24 hours | SAT: 24 hours | SUN: 24 hours",
        "RelatedURL": "http://www.blinkcharging.com/",
        "DistanceUnit": 0
    },
    "Connections": [
        {
            "ID": 192388,
            "ConnectionTypeID": 1,
            "LevelID": 2,
            "Amps": 16,
            "Voltage": 230,
            "PowerKW": 3,
            "CurrentTypeID": 10,
            "Quantity": 1
        }
    ],
    "StatusTypeID": 50,
    "DateLastStatusUpdate": "2019-12-24T09:05:00Z",
    "DataQualityLevel": 3,
    "DateCreated": "2019-12-24T09:05:00Z",
    "SubmissionStatusTypeID": 100
}