{
    "IsRecentlyVerified": false,
    "ID": 38749,
    "UUID": "1717F8CD-A8DC-4862-96A2-1D34D57DDEBD",
    "DataProviderID": 26,
    "DataProvidersReference": "47264",
    "OperatorID": 178,
    "OperatorsReference": "EVnetNL AL420",
    "UsageCost": "0.00 jaarabonnement",
    "AddressInfo": {
        "ID": 39095,
        "Title": "Zuidwoldigerweg",
        "AddressLine1": "Zuidwoldigerweg",
        "Town": "Hoogeveen",
        "Postcode": "7907 EN",
        "CountryID": 159,
        "Latitude": 52.718801,
        "Longitude": 6.463072,
        "ContactTelephone1": "0800-3522365",
        "RelatedURL": "http://www.evnet.nl",
        "DistanceUnit": 0
    },
    "Connections": [
        {
            "ID": 42260,
            "ConnectionTypeID": 25,
            "LevelID": 2,
            "PowerKW": 11,
            "CurrentTypeID": 10
        }
    ],
    "NumberOfPoints": 2,
    "StatusTypeID": 50,
    "DateLastStatusUpdate": "2016-06-04T02:55:00Z",
    "DataQualityLevel": 3,
    "DateCreated": "2015-01-09T06:08:00Z",
    "SubmissionStatusTypeID": 100
}