{
    "IsRecentlyVerified": false,
    "ID": 45804,
    "UUID": "3B071032-46C8-4AA9-BE3F-5F16ACA81665",
    "DataProviderID": 1,
    "DataProvidersReference": "2647",
    "AddressInfo": {
        "ID": 46150,
        "Title": "Kiwi Heistad, Porsgrunn",
        "AddressLine1": "Bekkefaret 1",
        "Town": "PORSGRUNN",
        "StateOrProvince": "Vestfold og Telemark",
        "Postcode": "3941",
        "CountryID": 168,
        "Latitude": 59.07504,
        "Longitude": 9.68369,
        "AccessComments": "",
        "DistanceUnit": 0
    },
    "Connections": [
        {
            "ID": 56467,
            "ConnectionTypeID": 0,
            "Reference": "1",
            "LevelID": 2,
            "Amps": 100,
            "Voltage": 500,
            "PowerKW": 50,
            "Comments": "Mode 4"
        },
        {
            "ID": 84301,
            "ConnectionTypeID": 0,
            "Reference": "2",
            "LevelID": 2,
            "Amps": 100,
            "Voltage": 500,
            "PowerKW": 50,
            "Comments": "Mode 4"
        },
        {
            "ID": 88084,
            "ConnectionTypeID": 0,
            "Reference": "3",
            "LevelID": 2,
            "Amps": 32,
            "Voltage": 400,
            "PowerKW": 22,
            "Comments": "Mode 3"
        }
    ],
    "NumberOfPoints": 3,
    "DateLastStatusUpdate": "2020-05-26T08:22:00Z",
    "DataQualityLevel": 2,
    "DateCreated": "2015-05-03T00:54:00Z",
    "SubmissionStatusTypeID": 100
}