{
    "IsRecentlyVerified": false,
    "ID": 9276,
    "UUID": "A94359D6-4299-4AF5-AE98-62FF89851F5C",
    "DataProviderID": 15,
    "DataProvidersReference": "14292",
    "OperatorID": 31,
    "UsageTypeID": 1,
    "AddressInfo": {
        "ID": 9173,
        "Title": "39475 Woodward Ave",
        "AddressLine1": "39475 Woodward Ave",
        "Town": "Bloomfield Hills",
        "StateOrProvince": "MI",
        "Postcode": "48304",
        "CountryID": 2,
        "Latitude": 42.581468,
        "Longitude": -83.243748,
        "ContactTelephone1": "(248)631-2377",
        "RelatedURL": "http://carstations.com/14292",
        "DistanceUnit": 0
    },
    "Connections": [
        {
            "ID": 6990,
            "ConnectionTypeID": 1,
            "Reference": "J1772",
            "LevelID": 2
        }
    ],
    "NumberOfPoints": 1,
    "StatusTypeID": 0,
    "DateLastStatusUpdate": "2017-11-04T14:04:00Z",
    "DataQualityLevel": 2,
    "DateCreated": "2012-02-08T14:35:00Z",
    "SubmissionStatusTypeID": 100
}