{
    "IsRecentlyVerified": false,
    "ID": 123591,
    "UUID": "59E4C1A0-C29B-4379-B001-E3AF80EE346F",
    "DataProviderID": 2,
    "DataProvidersReference": "79972",
    "OperatorID": 5,
    "UsageTypeID": 1,
    "AddressInfo": {
        "ID": 123937,
        "Title": "VIRGINIA BEACH",
        "AddressLine1": "4505 Main Street",
        "Town": "Virginia Beach",
        "StateOrProvince": "VA",
        "Postcode": "23462",
        "CountryID": 2,
        "Latitude": 36.8410644,
        "Longitude": -76.1314646,
        "ContactTelephone1": "888-758-4389",
        "AccessComments": "24 hours daily",
        "RelatedURL": "http://www.chargepoint.com/",
        "DistanceUnit": 0
    },
    "Connections": [
        {
            "ID": 173598,
            "ConnectionTypeID": 1,
            "LevelID": 2,
            "Amps": 16,
            "Voltage": 230,
            "PowerKW": 3.7,
            "CurrentTypeID": 10,
            "Quantity": 2
        }
    ],
    "DateLastStatusUpdate": "2020-06-26T02:59:00Z",
    "DataQualityLevel": 3,
    "DateCreated": "2019-04-06T05:03:00Z",
    "SubmissionStatusTypeID": 100
}