{
    "IsRecentlyVerified": false,
    "ID": 121954,
    "UUID": "277CAC59-E8B6-452F-98D3-4583BB670CFB",
    "DataProviderID": 2,
    "DataProvidersReference": "45263",
    "OperatorID": 5,
    "UsageTypeID": 1,
    "AddressInfo": {
        "ID": 122300,
        "Title": "CITYOFRIVERSIDE",
        "AddressLine1": "8095 Lincoln Ave",
        "Town": "Riverside",
        "StateOrProvince": "CA",
        "Postcode": "92504",
        "CountryID": 2,
        "Latitude": 33.9235359,
        "Longitude": -117.4122253,
        "ContactTelephone1": "888-758-4389",
        "AccessComments": "24 hours daily",
        "RelatedURL": "http://www.chargepoint.com/",
        "DistanceUnit": 0
    },
    "Connections": [
        {
            "ID": 171800,
            "ConnectionTypeID": 1,
            "LevelID": 2,
            "Amps": 16,
            "Voltage": 230,
            "PowerKW": 3,
            "CurrentTypeID": 10,
            "Quantity": 2
        },
        {
            "ID": 171801,
            "ConnectionTypeID": 1,
            "LevelID": 2,
            "Amps": 16,
            "Voltage": 230,
            "PowerKW": 3,
            "CurrentTypeID": 10,
            "Quantity": 2
        }
    ],
    "DateLastStatusUpdate": "2019-12-24T09:11:00Z",
    "DataQualityLevel": 3,
    "DateCreated": "2019-04-06T05:02:00Z",
    "SubmissionStatusTypeID": 100
}