{
    "IsRecentlyVerified": false,
    "ID": 111225,
    "UUID": "C2E2A3ED-6920-4E78-AE81-62CEF6061F7A",
    "DataProviderID": 2,
    "DataProvidersReference": "84887",
    "UsageTypeID": 7,
    "AddressInfo": {
        "ID": 111571,
        "Title": "Steele Ford Lincoln",
        "AddressLine1": "3773 Windsor St",
        "Town": "Halifax",
        "StateOrProvince": "NS",
        "Postcode": "B3K 5M2",
        "CountryID": 44,
        "Latitude": 44.662242,
        "Longitude": -63.621267,
        "ContactTelephone1": "902-453-1130",
        "AccessComments": "24 hours daily\r\nPublic - Call ahead",
        "RelatedURL": "",
        "DistanceUnit": 0
    },
    "Connections": [
        {
            "ID": 156609,
            "ConnectionTypeID": 1,
            "LevelID": 2,
            "Amps": 16,
            "Voltage": 230,
            "PowerKW": 3.7,
            "CurrentTypeID": 10,
            "Quantity": 1
        }
    ],
    "DateLastStatusUpdate": "2020-06-26T03:08:00Z",
    "DataQualityLevel": 3,
    "DateCreated": "2018-10-18T23:36:00Z",
    "SubmissionStatusTypeID": 100
}