{
    "IsRecentlyVerified": false,
    "ID": 185921,
    "UUID": "DBBCB524-9F7C-47C0-BCFE-8139F82E3451",
    "DataProviderID": 29,
    "DataProvidersReference": "9878",
    "OperatorID": 1240,
    "AddressInfo": {
        "ID": 186280,
        "Title": "Freiherr von Stein-Straße",
        "AddressLine1": "Freiherr von Stein-Straße",
        "Town": "Göllheim",
        "Postcode": "67307",
        "CountryID": 87,
        "Latitude": 49.593861,
        "Longitude": 8.053389,
        "DistanceUnit": 0
    },
    "Connections": [
        {
            "ID": 297202,
            "ConnectionTypeID": 25,
            "StatusTypeID": 50,
            "LevelID": 2,
            "PowerKW": 22,
            "CurrentTypeID": 20
        },
        {
            "ID": 297203,
            "ConnectionTypeID": 25,
            "StatusTypeID": 50,
            "LevelID": 2,
            "PowerKW": 22,
            "CurrentTypeID": 20
        }
    ],
    "StatusTypeID": 50,
    "DateLastStatusUpdate": "2021-07-12T02:43:00Z",
    "MetadataValues": [
        {
            "ID": 18163,
            "MetadataFieldID": 4,
            "ItemValue": "Data from the German chargepoint registry provided by Bundesnetzagentur.de under the CC-BY 4.0 license"
        }
    ],
    "DataQualityLevel": 3,
    "DateCreated": "2021-07-12T02:43:00Z",
    "SubmissionStatusTypeID": 100
}