{
    "IsRecentlyVerified": false,
    "ID": 114986,
    "UUID": "E875A1E8-6EE9-4185-9163-236E9CE19149",
    "DataProviderID": 1,
    "OperatorID": 3333,
    "UsageTypeID": 5,
    "AddressInfo": {
        "ID": 115332,
        "Title": "AAE Naturstrom  (System www.enercharge.at)",
        "AddressLine1": "Tiroler Straße 17",
        "Town": "Lienz",
        "StateOrProvince": "Lienz",
        "Postcode": "9900",
        "CountryID": 19,
        "Latitude": 46.8294608937328,
        "Longitude": 12.7736178152274,
        "ContactTelephone1": "+43 4715 222",
        "ContactEmail": "info@aae.at",
        "AccessComments": "Operation 24/7\r\nPayment is made directly by credit card or bank card. A payment terminal is installed in the charging station so no charging card is necessary and everyone has access.  \r\n\r\nBetrieb 24/7\r\nZahlung erfolgt direkt mit Kreditkarte oder Bankkarte. In der Ladestation ist ein Zahlungsterminal eingebaut somit ist keine Ladekarte notwändig und jeder hat freien Zugang  \r\n\r\n",
        "RelatedURL": "https://www.e-charging.info/show_content.php?sid=269&s2id=0&ets_id=12",
        "DistanceUnit": 0
    },
    "Connections": [
        {
            "ID": 161786,
            "ConnectionTypeID": 25,
            "StatusTypeID": 50,
            "LevelID": 2,
            "Amps": 32,
            "Voltage": 400,
            "PowerKW": 22,
            "CurrentTypeID": 10,
            "Quantity": 2
        }
    ],
    "NumberOfPoints": 2,
    "StatusTypeID": 50,
    "DateLastStatusUpdate": "2019-01-24T16:10:00Z",
    "DataQualityLevel": 1,
    "DateCreated": "2019-01-21T10:46:00Z",
    "SubmissionStatusTypeID": 200
}