{
    "IsRecentlyVerified": false,
    "ID": 20232,
    "UUID": "27D600DC-82D7-4B8F-A143-23F5E0469848",
    "DataProviderID": 1,
    "OperatorID": 1,
    "UsageTypeID": 0,
    "UsageCost": "",
    "AddressInfo": {
        "ID": 20577,
        "Title": "Bio-Elements - Gratentour",
        "AddressLine1": "13 La Gravette",
        "AddressLine2": "",
        "Town": "",
        "StateOrProvince": "Gratentour",
        "Postcode": "31150",
        "CountryID": 80,
        "Latitude": 43.71596,
        "Longitude": 1.42148,
        "ContactTelephone1": "",
        "ContactTelephone2": "",
        "ContactEmail": "",
        "AccessComments": "Ouvert à tous",
        "RelatedURL": "",
        "DistanceUnit": 0
    },
    "Connections": [],
    "GeneralComments": "",
    "StatusTypeID": 50,
    "DateLastStatusUpdate": "2013-11-07T16:36:00Z",
    "DataQualityLevel": 1,
    "DateCreated": "2013-11-07T09:16:00Z",
    "SubmissionStatusTypeID": 200
}