{
    "IsRecentlyVerified": false,
    "ID": 181530,
    "UUID": "040803E4-180C-4F23-B782-3D6B982380A9",
    "DataProviderID": 29,
    "DataProvidersReference": "4729",
    "AddressInfo": {
        "ID": 181889,
        "Title": "Keldenicher Straße 1a",
        "AddressLine1": "Keldenicher Straße 1a",
        "Town": "Bornheim",
        "Postcode": "53332",
        "CountryID": 87,
        "Latitude": 50.798334,
        "Longitude": 6.958998,
        "DistanceUnit": 0
    },
    "Connections": [
        {
            "ID": 285991,
            "ConnectionTypeID": 25,
            "StatusTypeID": 50,
            "LevelID": 2,
            "PowerKW": 22,
            "CurrentTypeID": 20
        },
        {
            "ID": 285992,
            "ConnectionTypeID": 25,
            "StatusTypeID": 50,
            "LevelID": 2,
            "PowerKW": 22,
            "CurrentTypeID": 20
        }
    ],
    "StatusTypeID": 50,
    "DateLastStatusUpdate": "2021-07-09T03:20:00Z",
    "MetadataValues": [
        {
            "ID": 13824,
            "MetadataFieldID": 4,
            "ItemValue": "Data from the German chargepoint registry provided by Bundesnetzagentur.de under the CC-BY 4.0 license"
        }
    ],
    "DataQualityLevel": 3,
    "DateCreated": "2021-07-08T10:01:00Z",
    "SubmissionStatusTypeID": 100
}