{
    "IsRecentlyVerified": false,
    "ID": 29695,
    "UUID": "646D17B8-03F5-4421-BC9D-E512DDB116CF",
    "DataProviderID": 15,
    "DataProvidersReference": "29759",
    "OperatorID": 9,
    "AddressInfo": {
        "ID": 30041,
        "Title": "210 Franklin Rd",
        "AddressLine1": "210 Franklin Rd",
        "Town": "Brentwood",
        "StateOrProvince": "TN",
        "Postcode": "US",
        "CountryID": 2,
        "Latitude": 36.032111,
        "Longitude": -86.787826,
        "ContactTelephone1": "",
        "RelatedURL": "http://carstations.com/29759",
        "DistanceUnit": 0
    },
    "Connections": [
        {
            "ID": 32680,
            "ConnectionTypeID": 1,
            "Reference": "J1772",
            "LevelID": 2
        }
    ],
    "StatusTypeID": 0,
    "DateLastStatusUpdate": "2017-11-04T14:04:00Z",
    "DataQualityLevel": 2,
    "DateCreated": "2014-11-29T05:39:00Z",
    "SubmissionStatusTypeID": 100
}