{
    "IsRecentlyVerified": false,
    "ID": 121743,
    "UUID": "5E688836-468C-4AE6-9EFC-A8DF54F3EBA0",
    "DataProviderID": 2,
    "DataProvidersReference": "98685",
    "UsageTypeID": 2,
    "AddressInfo": {
        "ID": 122089,
        "Title": "Camp Pendleton Marine Corps Base - C St",
        "AddressLine1": "C St",
        "Town": "Camp Pendleton",
        "StateOrProvince": "CA",
        "Postcode": "92055",
        "CountryID": 2,
        "Latitude": 33.308726,
        "Longitude": -117.312352,
        "ContactTelephone1": "",
        "AccessComments": "Fleet use only",
        "RelatedURL": "",
        "DistanceUnit": 0
    },
    "Connections": [
        {
            "ID": 171560,
            "ConnectionTypeID": 1,
            "LevelID": 2,
            "Amps": 16,
            "Voltage": 230,
            "PowerKW": 3.7,
            "CurrentTypeID": 10,
            "Quantity": 1
        }
    ],
    "DateLastStatusUpdate": "2020-06-26T02:55:00Z",
    "DataQualityLevel": 3,
    "DateCreated": "2019-04-06T05:02:00Z",
    "SubmissionStatusTypeID": 100
}