{
    "IsRecentlyVerified": false,
    "ID": 72035,
    "UUID": "46B96987-B10C-4697-80E8-3D17B77B6D3C",
    "DataProviderID": 1,
    "OperatorID": 3,
    "OperatorsReference": "PG-80508",
    "UsageTypeID": 6,
    "UsageCost": "Free",
    "AddressInfo": {
        "ID": 72381,
        "Title": "Volvo-Brindley Wolverhampton",
        "AddressLine1": "141 Wolverhampton Road",
        "AddressLine2": "Perton",
        "Town": "Wolverhampton",
        "Postcode": "WV8 1HF",
        "CountryID": 1,
        "Latitude": 52.597737,
        "Longitude": -2.129778,
        "DistanceUnit": 0
    },
    "Connections": [
        {
            "ID": 103298,
            "ConnectionTypeID": 25,
            "StatusTypeID": 50,
            "LevelID": 2,
            "Amps": 32,
            "Voltage": 230,
            "PowerKW": 7,
            "CurrentTypeID": 10,
            "Quantity": 2
        }
    ],
    "NumberOfPoints": 2,
    "StatusTypeID": 50,
    "DateLastStatusUpdate": "2016-11-12T12:16:00Z",
    "DataQualityLevel": 1,
    "DateCreated": "2016-09-30T08:06:00Z",
    "SubmissionStatusTypeID": 200
}