{
    "IsRecentlyVerified": false,
    "ID": 65051,
    "UUID": "8A10B6AE-70DC-4698-ACD8-6C76B0588884",
    "DataProviderID": 1,
    "OperatorID": 2243,
    "UsageTypeID": 4,
    "UsageCost": "EUR 0,2626/kWh+EUR 0,0119/min. Auch Parkgebühren",
    "AddressInfo": {
        "ID": 65397,
        "Title": "Parkplatz Messe",
        "AddressLine1": "Messeplatz 1",
        "AddressLine2": "Kappel",
        "Town": "Chemnitz",
        "StateOrProvince": "Chemnitz",
        "Postcode": "09116",
        "CountryID": 87,
        "Latitude": 50.8181624981509,
        "Longitude": 12.8827715070236,
        "ContactTelephone1": "+49 371 525-5403",
        "AccessComments": "Rund um die Uhr (24/7) nutzbar, Ladestation rechts vor der Schrankenanlage an der Einfahrt zum Messeparkplatz. Ladekarte von eins notwendig oder per SMS-Aktivierung sind die Ladesäulen von eins einmalig (!) ohne vorherige Registrierung nutzbar. Anschließend ist eine Registrierung notwendig.",
        "RelatedURL": "http://www.eins.de/privatkunden/strom/elektromobilitaet",
        "DistanceUnit": 0
    },
    "Connections": [
        {
            "ID": 83730,
            "ConnectionTypeID": 25,
            "StatusTypeID": 50,
            "LevelID": 2,
            "Amps": 32,
            "Voltage": 400,
            "PowerKW": 22,
            "CurrentTypeID": 20,
            "Quantity": 2
        },
        {
            "ID": 83731,
            "ConnectionTypeID": 28,
            "StatusTypeID": 50,
            "LevelID": 2,
            "Amps": 16,
            "Voltage": 230,
            "PowerKW": 3.7,
            "CurrentTypeID": 10,
            "Quantity": 2
        }
    ],
    "NumberOfPoints": 2,
    "StatusTypeID": 50,
    "DateLastStatusUpdate": "2017-02-13T13:30:00Z",
    "DataQualityLevel": 1,
    "DateCreated": "2016-04-06T07:47:00Z",
    "SubmissionStatusTypeID": 200
}