{
    "IsRecentlyVerified": false,
    "ID": 121039,
    "UUID": "9F4EE246-3F84-432F-92BE-4BCE3D0909A0",
    "DataProviderID": 2,
    "DataProvidersReference": "72505",
    "OperatorID": 39,
    "UsageTypeID": 4,
    "AddressInfo": {
        "ID": 121385,
        "Title": "Kaiser Anaheim",
        "AddressLine1": "3400 East La Palma Avenue",
        "Town": "Anaheim",
        "StateOrProvince": "CA",
        "Postcode": "92806",
        "CountryID": 2,
        "Latitude": 33.8537367,
        "Longitude": -117.8467694,
        "ContactTelephone1": "800-663-5633",
        "AccessComments": "MO: Not Specified; TU: Not Specified; WE: Not Specified; TH: Not Specified; FR: Not Specified; SA: Not Specified; SU: Not Specified",
        "RelatedURL": "http://www.semacharge.com/",
        "DistanceUnit": 0
    },
    "Connections": [
        {
            "ID": 170458,
            "ConnectionTypeID": 1,
            "LevelID": 2,
            "Amps": 16,
            "Voltage": 230,
            "PowerKW": 3,
            "CurrentTypeID": 10,
            "Quantity": 10
        }
    ],
    "DateLastStatusUpdate": "2019-04-01T04:59:00Z",
    "DataQualityLevel": 3,
    "DateCreated": "2019-04-01T04:59:00Z",
    "SubmissionStatusTypeID": 100
}