{
    "IsRecentlyVerified": false,
    "ID": 30143,
    "UUID": "ACD825AC-0893-4D92-B7F7-13FD235CC10C",
    "DataProviderID": 1,
    "OperatorID": 21,
    "UsageTypeID": 4,
    "UsageCost": "Mobi.E compatible card",
    "AddressInfo": {
        "ID": 30489,
        "Title": "GRD-00003",
        "AddressLine1": "Avenida do Estádio Municipal 14",
        "Town": "Guarda",
        "Postcode": "6300-705",
        "CountryID": 180,
        "Latitude": 40.53757278198833,
        "Longitude": -7.277022217653666,
        "RelatedURL": "http://www.mobie.pt",
        "DistanceUnit": 0
    },
    "Connections": [
        {
            "ID": 33128,
            "ConnectionTypeID": 25,
            "StatusTypeID": 50,
            "LevelID": 2,
            "Amps": 16,
            "Voltage": 230,
            "PowerKW": 3,
            "CurrentTypeID": 10,
            "Quantity": 2
        }
    ],
    "NumberOfPoints": 2,
    "StatusTypeID": 100,
    "DateLastStatusUpdate": "2020-08-23T18:26:00Z",
    "DataQualityLevel": 3,
    "DateCreated": "2014-11-29T14:48:00Z",
    "SubmissionStatusTypeID": 100
}