{
    "IsRecentlyVerified": false,
    "ID": 155672,
    "UUID": "9997A20C-AAE6-4889-834A-15282E4CE180",
    "DataProviderID": 1,
    "OperatorID": 3389,
    "UsageTypeID": 1,
    "UsageCost": "$1.00/session+$0.21/minute",
    "AddressInfo": {
        "ID": 156026,
        "Title": "Crest Foods",
        "AddressLine1": "1315 N Eastern Ave",
        "Town": "Moore",
        "StateOrProvince": "OK",
        "Postcode": "73160",
        "CountryID": 2,
        "Latitude": 35.3504968881564,
        "Longitude": -97.47801167504986,
        "AccessComments": "Use EVGateway App to manage charging",
        "RelatedURL": "https://francis.energy/",
        "DistanceUnit": 0
    },
    "Connections": [
        {
            "ID": 219202,
            "ConnectionTypeID": 32,
            "StatusTypeID": 50,
            "LevelID": 3,
            "PowerKW": 50,
            "CurrentTypeID": 30,
            "Quantity": 2,
            "Comments": "BTCPower 50kW"
        },
        {
            "ID": 219203,
            "ConnectionTypeID": 2,
            "StatusTypeID": 50,
            "LevelID": 3,
            "PowerKW": 50,
            "CurrentTypeID": 30,
            "Quantity": 2,
            "Comments": "BTCPower 50kW"
        }
    ],
    "NumberOfPoints": 2,
    "GeneralComments": "50kW DC Fast Chargers Provided by Francis Energy",
    "StatusTypeID": 50,
    "DateLastStatusUpdate": "2020-04-21T17:43:00Z",
    "DataQualityLevel": 1,
    "DateCreated": "2020-04-21T03:44:00Z",
    "SubmissionStatusTypeID": 200
}