{
    "IsRecentlyVerified": false,
    "ID": 173029,
    "UUID": "41C06ECA-6D74-4950-85D6-0BC7D1ECDA17",
    "DataProviderID": 1,
    "OperatorID": 1,
    "UsageTypeID": 4,
    "UsageCost": "0,0728 €/min",
    "AddressInfo": {
        "ID": 173388,
        "Title": "Continente Bom Dia Sobreda",
        "AddressLine1": "Estrada Nacional 10-1",
        "Town": "Sobreda",
        "Postcode": "2815-894, Almada",
        "CountryID": 180,
        "Latitude": 38.67858480837705,
        "Longitude": -9.157697336655701,
        "DistanceUnit": 0
    },
    "Connections": [
        {
            "ID": 264742,
            "ConnectionTypeID": 25,
            "StatusTypeID": 50,
            "LevelID": 2,
            "PowerKW": 22,
            "CurrentTypeID": 20,
            "Quantity": 2
        }
    ],
    "NumberOfPoints": 2,
    "StatusTypeID": 50,
    "DateLastStatusUpdate": "2021-06-21T03:17:00Z",
    "DataQualityLevel": 1,
    "DateCreated": "2021-03-01T16:19:00Z",
    "SubmissionStatusTypeID": 200
}