{
    "IsRecentlyVerified": false,
    "ID": 160088,
    "UUID": "7BDD6218-7185-48EA-A8D6-0CD1C4C12355",
    "DataProviderID": 2,
    "DataProvidersReference": "154333",
    "OperatorID": 5,
    "UsageTypeID": 1,
    "AddressInfo": {
        "ID": 160445,
        "Title": "CITY OF DEWITT",
        "AddressLine1": "116 E Main St",
        "Town": "DeWitt",
        "StateOrProvince": "MI",
        "Postcode": "48820",
        "CountryID": 2,
        "Latitude": 42.8420085,
        "Longitude": -84.5692675,
        "ContactTelephone1": "888-758-4389",
        "AccessComments": "24 hours daily",
        "RelatedURL": "http://www.chargepoint.com/",
        "DistanceUnit": 0
    },
    "Connections": [
        {
            "ID": 230326,
            "ConnectionTypeID": 1,
            "LevelID": 2,
            "Amps": 16,
            "Voltage": 230,
            "PowerKW": 3.7,
            "CurrentTypeID": 10,
            "Quantity": 2
        }
    ],
    "StatusTypeID": 50,
    "DateLastStatusUpdate": "2020-06-26T03:06:00Z",
    "DataQualityLevel": 3,
    "DateCreated": "2020-06-26T03:06:00Z",
    "SubmissionStatusTypeID": 100
}