{
    "IsRecentlyVerified": false,
    "ID": 42408,
    "UUID": "A9BB6B68-A86A-463B-B350-43313E4ECA2A",
    "DataProviderID": 1,
    "OperatorID": 45,
    "UsageTypeID": 1,
    "UsageCost": "0",
    "AddressInfo": {
        "ID": 42754,
        "Title": "Märkisches Ausstellungs- und Freizeitzentrum",
        "AddressLine1": "Gartenstraße 1",
        "Town": "Schönwalde-Glien",
        "StateOrProvince": "Landkreis Havelland",
        "Postcode": "14621",
        "CountryID": 87,
        "Latitude": 52.649665090502204,
        "Longitude": 12.981428845890827,
        "ContactTelephone1": "0332 30740",
        "AccessComments": "Auf dem Gelände des Erlebnisparks. Geöffnet Mo-Fr 8-17, So/So/Feiertags 9-18Uhr.\r\nZufahrt über Tor 3. 150 Meter nach der Einfahrt an dem Verwaltungsgebäude links, neben dem grünen Aussenaufzug ist eine e.on Wallbox an der Gebäudeecke. Keine Ladekarte notwendig!",
        "RelatedURL": "http://www.brandenburghalle.de/",
        "DistanceUnit": 0
    },
    "Connections": [
        {
            "ID": 51026,
            "ConnectionTypeID": 25,
            "StatusTypeID": 50,
            "LevelID": 2,
            "Amps": 32,
            "Voltage": 400,
            "PowerKW": 22,
            "CurrentTypeID": 20,
            "Quantity": 1
        },
        {
            "ID": 51027,
            "ConnectionTypeID": 28,
            "StatusTypeID": 50,
            "LevelID": 2,
            "Amps": 16,
            "Voltage": 230,
            "PowerKW": 3.7,
            "CurrentTypeID": 10,
            "Quantity": 1
        }
    ],
    "NumberOfPoints": 2,
    "StatusTypeID": 50,
    "DateLastStatusUpdate": "2015-03-09T13:22:00Z",
    "DataQualityLevel": 1,
    "DateCreated": "2015-03-09T13:22:00Z",
    "SubmissionStatusTypeID": 200
}