{
    "IsRecentlyVerified": false,
    "ID": 57541,
    "UUID": "95BACC2C-EBFE-466B-9290-86E8E9FFC439",
    "DataProviderID": 1,
    "OperatorID": 80,
    "UsageTypeID": 4,
    "UsageCost": "0,40 €/kW",
    "AddressInfo": {
        "ID": 57887,
        "Title": "Eneldrive Parcheggio Corso della Repubblica",
        "AddressLine1": "Corso della Repubblica",
        "AddressLine2": "Ingresso del Parcheggio dalla rotonda con Via El Alamein",
        "Town": "Cisterna di Latina",
        "StateOrProvince": "LT",
        "Postcode": "04012",
        "CountryID": 112,
        "Latitude": 41.5960369539323,
        "Longitude": 12.8251898336657,
        "RelatedURL": "http://eneldrive.it",
        "DistanceUnit": 0
    },
    "Connections": [
        {
            "ID": 72723,
            "ConnectionTypeID": 25,
            "StatusTypeID": 50,
            "LevelID": 2,
            "Amps": 32,
            "Voltage": 400,
            "PowerKW": 22,
            "CurrentTypeID": 20,
            "Quantity": 2
        },
        {
            "ID": 72724,
            "ConnectionTypeID": 36,
            "StatusTypeID": 50,
            "LevelID": 2,
            "Amps": 16,
            "Voltage": 240,
            "PowerKW": 3.7,
            "CurrentTypeID": 10,
            "Quantity": 2
        }
    ],
    "NumberOfPoints": 2,
    "StatusTypeID": 50,
    "DateLastStatusUpdate": "2016-08-10T11:52:00Z",
    "DataQualityLevel": 1,
    "DateCreated": "2015-12-02T16:59:00Z",
    "SubmissionStatusTypeID": 200
}