{
    "IsRecentlyVerified": false,
    "ID": 131717,
    "UUID": "F65C7CB7-88C5-4A24-B909-D764F15FFBE2",
    "DataProviderID": 1,
    "OperatorID": 80,
    "UsageTypeID": 4,
    "AddressInfo": {
        "ID": 132063,
        "Title": "Lido di Noto Sabbia D'oro | EnelX",
        "AddressLine1": "Via Della Sabbia D'oro",
        "AddressLine2": "Lido di Noto",
        "Town": "Noto",
        "StateOrProvince": "SR",
        "Postcode": "96017",
        "CountryID": 112,
        "Latitude": 36.8547430152913,
        "Longitude": 15.1135783223272,
        "ContactTelephone1": "800.069.850",
        "RelatedURL": "https://www.enelx.com/it/it/emobility",
        "DistanceUnit": 0
    },
    "Connections": [
        {
            "ID": 184356,
            "ConnectionTypeID": 25,
            "StatusTypeID": 50,
            "LevelID": 2,
            "Amps": 32,
            "Voltage": 400,
            "PowerKW": 22,
            "CurrentTypeID": 20,
            "Quantity": 2
        }
    ],
    "NumberOfPoints": 2,
    "StatusTypeID": 50,
    "DateLastStatusUpdate": "2019-09-11T15:00:00Z",
    "DataQualityLevel": 1,
    "DateCreated": "2019-09-11T15:00:00Z",
    "SubmissionStatusTypeID": 200
}