{
    "IsRecentlyVerified": false,
    "ID": 18933,
    "UUID": "580F2C07-F796-4D84-ACF0-140647D6EA84",
    "DataProviderID": 1,
    "OperatorID": 22,
    "OperatorsReference": "C7D5J",
    "AddressInfo": {
        "ID": 19278,
        "Title": "Abbey Street",
        "AddressLine1": "Wexford",
        "Town": "Wexford",
        "StateOrProvince": "County Wexford",
        "CountryID": 3,
        "Latitude": 52.340105,
        "Longitude": -6.463952,
        "DistanceUnit": 0
    },
    "Connections": [
        {
            "ID": 19190,
            "ConnectionTypeID": 25,
            "StatusTypeID": 50,
            "LevelID": 2,
            "Amps": 32,
            "Voltage": 400,
            "PowerKW": 22,
            "CurrentTypeID": 20,
            "Quantity": 2
        }
    ],
    "NumberOfPoints": 2,
    "StatusTypeID": 50,
    "DateLastStatusUpdate": "2019-06-14T05:35:00Z",
    "DataQualityLevel": 2,
    "DateCreated": "2013-08-30T03:55:00Z",
    "SubmissionStatusTypeID": 200
}