{
    "IsRecentlyVerified": false,
    "ID": 23124,
    "UUID": "01C95EA4-EC8C-4E95-9DE5-E5116D09C15B",
    "DataProviderID": 1,
    "OperatorID": 62,
    "UsageTypeID": 4,
    "AddressInfo": {
        "ID": 23469,
        "Title": "Auchan SEMUR EN AUXOIS",
        "AddressLine1": "Route Auchan",
        "Town": "Semur-en-Auxois",
        "StateOrProvince": "Montbard",
        "Postcode": "21140",
        "CountryID": 80,
        "Latitude": 47.4823670827539,
        "Longitude": 4.35184265690418,
        "ContactTelephone1": "03 80 97 06 00 ",
        "RelatedURL": "http://www.auchan.fr/magasins/semur-en-auxois/5300/informations-pratiques/",
        "DistanceUnit": 0
    },
    "Connections": [
        {
            "ID": 24854,
            "ConnectionTypeID": 2,
            "LevelID": 3,
            "CurrentTypeID": 30,
            "Quantity": 1
        },
        {
            "ID": 24855,
            "ConnectionTypeID": 25,
            "LevelID": 3,
            "CurrentTypeID": 20,
            "Quantity": 1
        }
    ],
    "NumberOfPoints": 1,
    "StatusTypeID": 150,
    "DateLastStatusUpdate": "2014-09-25T13:05:00Z",
    "DataQualityLevel": 1,
    "DateCreated": "2014-04-15T14:21:00Z",
    "SubmissionStatusTypeID": 200
}