{
    "IsRecentlyVerified": false,
    "ID": 5885,
    "UUID": "07BA481C-949B-4E1F-AC6D-7B799A2D919D",
    "DataProviderID": 1,
    "OperatorID": 1,
    "UsageTypeID": 1,
    "AddressInfo": {
        "ID": 5807,
        "Title": "KOA-Kampground ",
        "Town": "Klamath Falls",
        "StateOrProvince": "Oregon",
        "CountryID": 2,
        "Latitude": 42.2142794163754,
        "Longitude": -121.74654006958,
        "DistanceUnit": 0
    },
    "Connections": [
        {
            "ID": 633,
            "ConnectionTypeID": 11,
            "LevelID": 2,
            "Quantity": 1
        }
    ],
    "NumberOfPoints": 1,
    "StatusTypeID": 50,
    "DateLastStatusUpdate": "2010-11-26T00:00:00Z",
    "DateCreated": "2011-09-13T12:41:00Z",
    "SubmissionStatusTypeID": 200
}