{
    "IsRecentlyVerified": false,
    "ID": 179514,
    "UUID": "E8FE9344-1874-49F4-869D-6FB90508951D",
    "DataProviderID": 29,
    "DataProvidersReference": "10126",
    "OperatorID": 45,
    "AddressInfo": {
        "ID": 179873,
        "Title": "Neukirchner Str. 55",
        "AddressLine1": "Neukirchner Str. 55",
        "Town": "Neunburg vorm Wald",
        "Postcode": "92431",
        "CountryID": 87,
        "Latitude": 49.338401,
        "Longitude": 12.391485,
        "DistanceUnit": 0
    },
    "Connections": [
        {
            "ID": 281431,
            "ConnectionTypeID": 33,
            "StatusTypeID": 50,
            "LevelID": 3,
            "PowerKW": 22,
            "CurrentTypeID": 30
        },
        {
            "ID": 281432,
            "ConnectionTypeID": 25,
            "StatusTypeID": 50,
            "LevelID": 2,
            "PowerKW": 11,
            "CurrentTypeID": 20
        }
    ],
    "StatusTypeID": 50,
    "DateLastStatusUpdate": "2021-07-09T03:16:00Z",
    "MetadataValues": [
        {
            "ID": 11808,
            "MetadataFieldID": 4,
            "ItemValue": "Data from the German chargepoint registry provided by Bundesnetzagentur.de under the CC-BY 4.0 license"
        }
    ],
    "DataQualityLevel": 3,
    "DateCreated": "2021-07-08T09:59:00Z",
    "SubmissionStatusTypeID": 100
}