{
    "IsRecentlyVerified": false,
    "ID": 172007,
    "UUID": "81FF7031-39F4-4737-8EB2-5979DCA4BD20",
    "DataProviderID": 1,
    "OperatorID": 1,
    "UsageTypeID": 4,
    "AddressInfo": {
        "ID": 172366,
        "Title": "ATU Werkstatt",
        "AddressLine1": "Lina-Bommer-Weg 1",
        "AddressLine2": "Gremberghoven",
        "Town": "Köln",
        "StateOrProvince": "Nordrhein-Westfalen",
        "Postcode": "51149",
        "CountryID": 87,
        "Latitude": 50.91763513466341,
        "Longitude": 7.049471839741273,
        "DistanceUnit": 0
    },
    "Connections": [
        {
            "ID": 262895,
            "ConnectionTypeID": 33,
            "StatusTypeID": 50,
            "LevelID": 3,
            "PowerKW": 50,
            "CurrentTypeID": 30,
            "Quantity": 1
        },
        {
            "ID": 262896,
            "ConnectionTypeID": 2,
            "StatusTypeID": 50,
            "LevelID": 3,
            "PowerKW": 50,
            "CurrentTypeID": 30,
            "Quantity": 1
        },
        {
            "ID": 262897,
            "ConnectionTypeID": 1036,
            "StatusTypeID": 50,
            "LevelID": 3,
            "PowerKW": 43,
            "CurrentTypeID": 20,
            "Quantity": 1
        }
    ],
    "NumberOfPoints": 2,
    "StatusTypeID": 50,
    "DateLastStatusUpdate": "2021-01-11T13:03:00Z",
    "DataQualityLevel": 1,
    "DateCreated": "2021-01-11T11:46:00Z",
    "SubmissionStatusTypeID": 200
}