{
    "IsRecentlyVerified": false,
    "ID": 143597,
    "UUID": "E9B67EA4-CDBC-4D54-BE56-DB47233C928B",
    "DataProviderID": 2,
    "DataProvidersReference": "121279",
    "OperatorID": 5,
    "UsageTypeID": 1,
    "AddressInfo": {
        "ID": 143949,
        "Title": "ERIN MILLS",
        "AddressLine1": "2550 Eglinton Ave W",
        "Town": "Mississauga",
        "StateOrProvince": "ON",
        "Postcode": "L5M 4N7",
        "CountryID": 44,
        "Latitude": 43.5578926,
        "Longitude": -79.7068346,
        "ContactTelephone1": "888-758-4389",
        "AccessComments": "24 hours daily",
        "RelatedURL": "http://www.chargepoint.com/",
        "DistanceUnit": 0
    },
    "Connections": [
        {
            "ID": 199953,
            "ConnectionTypeID": 1,
            "LevelID": 2,
            "Amps": 16,
            "Voltage": 230,
            "PowerKW": 3.7,
            "CurrentTypeID": 10,
            "Quantity": 2
        }
    ],
    "StatusTypeID": 50,
    "DateLastStatusUpdate": "2020-06-26T03:07:00Z",
    "DataQualityLevel": 3,
    "DateCreated": "2019-12-24T09:21:00Z",
    "SubmissionStatusTypeID": 100
}