{
    "IsRecentlyVerified": false,
    "ID": 173050,
    "UUID": "826C6733-7A11-4BB3-8E49-B9F83A3FDF14",
    "DataProviderID": 1,
    "OperatorID": 3,
    "OperatorsReference": "PG-70242,PG-84501",
    "UsageTypeID": 4,
    "UsageCost": "Free",
    "AddressInfo": {
        "ID": 173409,
        "Title": "Tesco Superstore-Norwich Stalham",
        "AddressLine1": "Old Market Road",
        "Town": "Stalham",
        "StateOrProvince": "Norwich",
        "Postcode": "NR12 9AE",
        "CountryID": 1,
        "Latitude": 52.770886,
        "Longitude": 1.515102,
        "DistanceUnit": 0
    },
    "Connections": [
        {
            "ID": 264778,
            "ConnectionTypeID": 25,
            "StatusTypeID": 50,
            "LevelID": 2,
            "Amps": 32,
            "Voltage": 230,
            "PowerKW": 7,
            "CurrentTypeID": 10,
            "Quantity": 4
        }
    ],
    "NumberOfPoints": 4,
    "GeneralComments": "This is an open charge unit installed at the Tesco super store at Old Market Road, Stalham, Norwich",
    "StatusTypeID": 50,
    "DateLastStatusUpdate": "2021-03-02T21:09:00Z",
    "DataQualityLevel": 1,
    "DateCreated": "2021-03-02T21:01:00Z",
    "SubmissionStatusTypeID": 200
}