{
    "IsRecentlyVerified": false,
    "ID": 67968,
    "UUID": "A6682961-0FF2-4F75-97F8-7DDD54BD7F22",
    "DataProviderID": 26,
    "DataProvidersReference": "91619",
    "OperatorID": 103,
    "OperatorsReference": "Allego NLALLEGO0009931",
    "UsageCost": "0.00 jaarabonnement",
    "AddressInfo": {
        "ID": 68314,
        "Title": "Margriethof 58",
        "AddressLine1": "Margriethof 58",
        "Town": "Papendrecht",
        "Postcode": "3355 EM",
        "CountryID": 159,
        "Latitude": 51.840481,
        "Longitude": 4.70026856,
        "ContactTelephone1": "0800-3745337",
        "RelatedURL": "http://www.allego.eu/",
        "DistanceUnit": 0
    },
    "Connections": [
        {
            "ID": 94612,
            "ConnectionTypeID": 25,
            "LevelID": 2,
            "PowerKW": 11,
            "CurrentTypeID": 10
        },
        {
            "ID": 94613,
            "ConnectionTypeID": 25,
            "LevelID": 2,
            "PowerKW": 11,
            "CurrentTypeID": 10
        }
    ],
    "NumberOfPoints": 1,
    "StatusTypeID": 50,
    "DateLastStatusUpdate": "2016-06-04T02:37:00Z",
    "DataQualityLevel": 3,
    "DateCreated": "2016-06-04T02:37:00Z",
    "SubmissionStatusTypeID": 100
}