{
    "IsRecentlyVerified": false,
    "ID": 90693,
    "UUID": "CC1F015A-6334-444D-A245-C20603A3475F",
    "DataProviderID": 1,
    "OperatorID": 23,
    "OperatorsReference": "32072",
    "UsageTypeID": 4,
    "AddressInfo": {
        "ID": 91039,
        "Title": "Otis Smith Park",
        "AddressLine1": "454 E Savannah RD",
        "Town": "Lewes",
        "StateOrProvince": "Delaware",
        "Postcode": "19958",
        "CountryID": 2,
        "Latitude": 38.778196,
        "Longitude": -75.135735,
        "ContactTelephone1": "(302) 645-7777",
        "DistanceUnit": 0
    },
    "Connections": [
        {
            "ID": 128416,
            "ConnectionTypeID": 30,
            "StatusTypeID": 50,
            "LevelID": 2,
            "PowerKW": 8,
            "CurrentTypeID": 10,
            "Quantity": 1
        }
    ],
    "NumberOfPoints": 1,
    "GeneralComments": "1 Tesla Connector, up to 8kW.Available to the public. Self park.",
    "StatusTypeID": 50,
    "DateLastStatusUpdate": "2017-07-22T05:34:00Z",
    "DataQualityLevel": 1,
    "DateCreated": "2017-07-22T05:34:00Z",
    "SubmissionStatusTypeID": 200
}