{
    "IsRecentlyVerified": false,
    "ID": 115974,
    "UUID": "9A95EB3F-213A-48FF-909F-74C4AF48D215",
    "DataProviderID": 2,
    "DataProvidersReference": "117267",
    "UsageTypeID": 2,
    "AddressInfo": {
        "ID": 116320,
        "Title": "CIC - Boston",
        "AddressLine1": "50 Milk St",
        "Town": "Boston",
        "StateOrProvince": "MA",
        "Postcode": "02110",
        "CountryID": 2,
        "Latitude": 42.357009,
        "Longitude": -71.057609,
        "ContactTelephone1": "",
        "AccessComments": "",
        "RelatedURL": "",
        "DistanceUnit": 0
    },
    "Connections": [
        {
            "ID": 163026,
            "ConnectionTypeID": 1,
            "LevelID": 2,
            "Amps": 16,
            "Voltage": 230,
            "PowerKW": 3.7,
            "CurrentTypeID": 10,
            "Quantity": 6
        }
    ],
    "DateLastStatusUpdate": "2020-06-26T03:05:00Z",
    "DataQualityLevel": 3,
    "DateCreated": "2019-02-11T07:13:00Z",
    "SubmissionStatusTypeID": 100
}