{
    "IsRecentlyVerified": false,
    "ID": 54848,
    "UUID": "74044109-6DC3-4370-B75A-182D6F0FD4B3",
    "DataProviderID": 1,
    "OperatorID": 23,
    "OperatorsReference": "10543",
    "UsageTypeID": 1,
    "UsageCost": "Free",
    "AddressInfo": {
        "ID": 55194,
        "Title": "Hilton - Los Angeles International Airport - Tesla",
        "AddressLine1": "5711 W Century Blvd",
        "Town": "Los Angeles",
        "StateOrProvince": "CA",
        "Postcode": "90045",
        "CountryID": 2,
        "Latitude": 33.946207,
        "Longitude": -118.3816,
        "ContactTelephone1": "310-410-4000  877-798-3752",
        "AccessComments": "24 hours daily; for Tesla use only; for guest use only; see valet for access",
        "RelatedURL": "http://www.teslamotors.com/supercharger",
        "DistanceUnit": 0
    },
    "Connections": [
        {
            "ID": 69322,
            "ConnectionTypeID": 30,
            "StatusTypeID": 50,
            "LevelID": 2,
            "Amps": 16,
            "Voltage": 230,
            "PowerKW": 6,
            "CurrentTypeID": 10,
            "Quantity": 2
        }
    ],
    "NumberOfPoints": 2,
    "GeneralComments": "1 LP Inductive",
    "StatusTypeID": 50,
    "DateLastStatusUpdate": "2017-01-31T22:09:00Z",
    "DataQualityLevel": 3,
    "DateCreated": "2015-10-09T07:24:00Z",
    "SubmissionStatusTypeID": 100
}