{
    "IsRecentlyVerified": false,
    "ID": 139203,
    "UUID": "6EFC30A6-A273-4E5D-8A6D-1BBCF215A31C",
    "DataProviderID": 2,
    "DataProvidersReference": "96680",
    "OperatorID": 9,
    "UsageTypeID": 1,
    "AddressInfo": {
        "ID": 139555,
        "Title": "Spectra on 7th Apartments",
        "AddressLine1": "20425 North 7th Street",
        "Town": "Phoenix",
        "StateOrProvince": "AZ",
        "Postcode": "85024",
        "CountryID": 2,
        "Latitude": 33.672417,
        "Longitude": -112.064444,
        "ContactTelephone1": "888-998-2546",
        "AccessComments": "MON: 24 hours | TUE: 24 hours | WED: 24 hours | THU: 24 hours | FRI: 24 hours | SAT: 24 hours | SUN: 24 hours",
        "RelatedURL": "http://www.blinkcharging.com/",
        "DistanceUnit": 0
    },
    "Connections": [
        {
            "ID": 194477,
            "ConnectionTypeID": 1,
            "LevelID": 2,
            "Amps": 16,
            "Voltage": 230,
            "PowerKW": 3.7,
            "CurrentTypeID": 10,
            "Quantity": 1
        },
        {
            "ID": 194478,
            "ConnectionTypeID": 2,
            "LevelID": 3,
            "Amps": 100,
            "Voltage": 400,
            "PowerKW": 40,
            "CurrentTypeID": 30,
            "Quantity": 2
        }
    ],
    "StatusTypeID": 50,
    "DateLastStatusUpdate": "2020-06-26T02:55:00Z",
    "DataQualityLevel": 3,
    "DateCreated": "2019-12-24T09:10:00Z",
    "SubmissionStatusTypeID": 100
}