{
    "MediaItems": [
        {
            "ID": 2887,
            "ChargePointID": 51580,
            "ItemURL": "https://s3-ap-southeast-2.amazonaws.com/openchargemap/images/US/OCM51580/OCM-51580.orig.2015073022564828.jpg",
            "ItemThumbnailURL": "https://s3-ap-southeast-2.amazonaws.com/openchargemap/images/US/OCM51580/OCM-51580.thmb.2015073022564828.jpg",
            "Comment": "Chargers are in front of this service center\r\n",
            "IsEnabled": true,
            "IsVideo": false,
            "IsFeaturedItem": false,
            "IsExternalResource": false,
            "User": {
                "ID": 4648,
                "Username": "dennis_p"
            },
            "DateCreated": "2015-07-30T22:57:00Z"
        }
    ],
    "IsRecentlyVerified": false,
    "ID": 51580,
    "UUID": "1435159C-B361-4DD3-A042-1646232CEC9F",
    "DataProviderID": 1,
    "OperatorID": 23,
    "UsageTypeID": 7,
    "UsageCost": "Free",
    "AddressInfo": {
        "ID": 51926,
        "Title": "Tesla Costa Mesa Service Center",
        "AddressLine1": "3020 Pullman Street",
        "Town": "Costa Mesa",
        "StateOrProvince": "CA",
        "CountryID": 2,
        "Latitude": 33.67398,
        "Longitude": -117.882377,
        "ContactTelephone1": "+1.714.545.1800",
        "DistanceUnit": 0
    },
    "Connections": [
        {
            "ID": 63957,
            "ConnectionTypeID": 30,
            "StatusTypeID": 50,
            "LevelID": 2,
            "Amps": 40,
            "Voltage": 203,
            "PowerKW": 8.12,
            "CurrentTypeID": 10,
            "Quantity": 4
        }
    ],
    "NumberOfPoints": 4,
    "GeneralComments": "Tesla Model S HPWC 203V/40A",
    "StatusTypeID": 50,
    "DateLastStatusUpdate": "2017-02-03T12:02:00Z",
    "DataQualityLevel": 1,
    "DateCreated": "2015-07-30T18:21:00Z",
    "SubmissionStatusTypeID": 200
}