{
    "IsRecentlyVerified": false,
    "ID": 37019,
    "UUID": "29203B18-A42E-4014-97D8-DBFA5618362B",
    "DataProviderID": 26,
    "DataProvidersReference": "56214",
    "OperatorID": 73,
    "OperatorsReference": "EV-Box EVB-P1430057",
    "UsageCost": "0.00 jaarabonnement",
    "AddressInfo": {
        "ID": 37365,
        "Title": "Binnenweg 12",
        "AddressLine1": "Binnenweg 12",
        "Town": "Haarlemmermeer",
        "Postcode": "2132 CT",
        "CountryID": 159,
        "Latitude": 52.29858,
        "Longitude": 4.6919,
        "RelatedURL": "http://www.ev-box.nl",
        "DistanceUnit": 0
    },
    "Connections": [
        {
            "ID": 40530,
            "ConnectionTypeID": 25,
            "LevelID": 2,
            "PowerKW": 11,
            "CurrentTypeID": 10
        },
        {
            "ID": 48579,
            "ConnectionTypeID": 25,
            "LevelID": 2,
            "PowerKW": 11,
            "CurrentTypeID": 10
        }
    ],
    "NumberOfPoints": 1,
    "StatusTypeID": 50,
    "DateLastStatusUpdate": "2016-06-04T02:52:00Z",
    "DataQualityLevel": 3,
    "DateCreated": "2015-01-09T06:07:00Z",
    "SubmissionStatusTypeID": 100
}