{
    "IsRecentlyVerified": false,
    "ID": 24432,
    "UUID": "C11B1031-7036-4A34-8DBF-C3C22A6E8356",
    "DataProviderID": 1,
    "OperatorID": 22,
    "OperatorsReference": "C7F3F",
    "UsageTypeID": 4,
    "UsageCost": "Free",
    "AddressInfo": {
        "ID": 24778,
        "Title": "Across from Glenties Day Care Centre",
        "AddressLine1": "N56",
        "Town": "Glenties",
        "StateOrProvince": "County Donegal",
        "CountryID": 3,
        "Latitude": 54.7979760172074,
        "Longitude": -8.28452811481929,
        "DistanceUnit": 0
    },
    "Connections": [
        {
            "ID": 26632,
            "ConnectionTypeID": 25,
            "StatusTypeID": 50,
            "LevelID": 2,
            "Amps": 32,
            "Voltage": 400,
            "PowerKW": 22,
            "CurrentTypeID": 20,
            "Quantity": 2
        }
    ],
    "NumberOfPoints": 2,
    "StatusTypeID": 50,
    "DateLastStatusUpdate": "2019-06-18T05:28:00Z",
    "DataQualityLevel": 1,
    "DateCreated": "2014-09-19T13:57:00Z",
    "SubmissionStatusTypeID": 200
}