{
    "IsRecentlyVerified": false,
    "ID": 87735,
    "UUID": "32D1BC1E-365D-45A5-8C7A-1CC0A6949B3C",
    "DataProviderID": 1,
    "UsageCost": "$2/h",
    "AddressInfo": {
        "ID": 88081,
        "Title": "Frankton Motor Camp",
        "AddressLine1": "17 Yewlett Crescent",
        "Town": "Frankton, Queenstown",
        "Postcode": "9300",
        "CountryID": 161,
        "Latitude": -45.01728006618657,
        "Longitude": 168.72557103305482,
        "ContactTelephone1": "(643) 442-2079",
        "DistanceUnit": 0
    },
    "Connections": [
        {
            "ID": 124359,
            "ConnectionTypeID": 4
        }
    ],
    "NumberOfPoints": 2,
    "GeneralComments": "$2/h or by negotiation with stay.\r\nNice spot on the waterfront, but will pay to phone.",
    "StatusTypeID": 50,
    "DateLastStatusUpdate": "2017-05-16T08:11:00Z",
    "DataQualityLevel": 1,
    "DateCreated": "2017-05-16T08:11:00Z",
    "SubmissionStatusTypeID": 200
}