{
    "IsRecentlyVerified": false,
    "ID": 115876,
    "UUID": "2D040215-BA37-419B-A259-85C73B4A81A7",
    "DataProviderID": 2,
    "DataProvidersReference": "115888",
    "OperatorID": 23,
    "UsageTypeID": 1,
    "AddressInfo": {
        "ID": 116222,
        "Title": "Promontory Club - Tesla Destination",
        "AddressLine1": "8758 N Promontory Ranch Rd",
        "Town": "Park City",
        "StateOrProvince": "UT",
        "Postcode": "84098",
        "CountryID": 2,
        "Latitude": 40.757064,
        "Longitude": -111.443063,
        "ContactTelephone1": "435-333-4600  877-798-3752",
        "AccessComments": "24 hours daily",
        "RelatedURL": "https://www.tesla.com/destination-charging",
        "DistanceUnit": 0
    },
    "Connections": [
        {
            "ID": 162918,
            "ConnectionTypeID": 30,
            "LevelID": 2,
            "Amps": 16,
            "Voltage": 230,
            "PowerKW": 3.7,
            "CurrentTypeID": 10,
            "Quantity": 4
        }
    ],
    "DateLastStatusUpdate": "2020-06-26T03:03:00Z",
    "DataQualityLevel": 3,
    "DateCreated": "2019-02-11T07:13:00Z",
    "SubmissionStatusTypeID": 100
}