{
    "IsRecentlyVerified": false,
    "ID": 28104,
    "UUID": "143C3457-8A1A-440C-9A82-AB319D49AAEA",
    "DataProviderID": 2,
    "DataProvidersReference": "58306",
    "OperatorID": 5,
    "UsageTypeID": 1,
    "AddressInfo": {
        "ID": 28450,
        "Title": "CIRCUSCIRCUSREN",
        "AddressLine1": "650 North Sierra Street",
        "Town": "Reno",
        "StateOrProvince": "NV",
        "Postcode": "89501",
        "CountryID": 2,
        "Latitude": 39.5330773,
        "Longitude": -119.8159442,
        "ContactTelephone1": "888-758-4389",
        "AccessComments": "24 hours daily",
        "RelatedURL": "http://www.chargepoint.com/",
        "DistanceUnit": 0
    },
    "Connections": [
        {
            "ID": 30887,
            "ConnectionTypeID": 1,
            "LevelID": 2,
            "Amps": 16,
            "Voltage": 230,
            "PowerKW": 3,
            "CurrentTypeID": 10,
            "Quantity": 2
        }
    ],
    "DateLastStatusUpdate": "2019-04-06T04:03:00Z",
    "DataQualityLevel": 3,
    "DateCreated": "2014-11-28T03:38:00Z",
    "SubmissionStatusTypeID": 100
}