{
    "IsRecentlyVerified": false,
    "ID": 75580,
    "UUID": "7E041AC4-1609-4081-82DF-7E24BFB751F3",
    "DataProviderID": 1,
    "OperatorID": 142,
    "OperatorsReference": "3345158",
    "UsageTypeID": 4,
    "AddressInfo": {
        "ID": 75926,
        "Title": "Spar Auhof",
        "AddressLine1": "Albert Schweitzergasse 2A",
        "Town": "Wien",
        "Postcode": "1140",
        "CountryID": 19,
        "Latitude": 48.2076335,
        "Longitude": 16.2225032,
        "DistanceUnit": 0
    },
    "Connections": [
        {
            "ID": 108959,
            "ConnectionTypeID": 25,
            "StatusTypeID": 50,
            "LevelID": 2,
            "Amps": 16,
            "Voltage": 400,
            "PowerKW": 11,
            "CurrentTypeID": 20,
            "Quantity": 1
        },
        {
            "ID": 108960,
            "ConnectionTypeID": 28,
            "StatusTypeID": 50,
            "LevelID": 2,
            "Amps": 16,
            "Voltage": 230,
            "PowerKW": 4,
            "CurrentTypeID": 10,
            "Quantity": 1
        }
    ],
    "NumberOfPoints": 1,
    "GeneralComments": "Wien Energie Tanke-Karte; WienMobil-Karte",
    "StatusTypeID": 50,
    "DateLastStatusUpdate": "2016-12-16T19:40:00Z",
    "DataQualityLevel": 1,
    "DateCreated": "2016-12-16T19:40:00Z",
    "SubmissionStatusTypeID": 200
}