{
    "IsRecentlyVerified": false,
    "ID": 182506,
    "UUID": "68518C77-FA13-4ADB-9017-000438186970",
    "DataProviderID": 29,
    "DataProvidersReference": "10441",
    "AddressInfo": {
        "ID": 182865,
        "Title": "Am Wirtseck 9",
        "AddressLine1": "Am Wirtseck 9",
        "Town": "Marktoberdorf",
        "Postcode": "87616",
        "CountryID": 87,
        "Latitude": 47.748057,
        "Longitude": 10.576077,
        "DistanceUnit": 0
    },
    "Connections": [
        {
            "ID": 288340,
            "ConnectionTypeID": 25,
            "StatusTypeID": 50,
            "LevelID": 2,
            "PowerKW": 22,
            "CurrentTypeID": 20
        },
        {
            "ID": 288341,
            "ConnectionTypeID": 25,
            "StatusTypeID": 50,
            "LevelID": 2,
            "PowerKW": 22,
            "CurrentTypeID": 20
        }
    ],
    "StatusTypeID": 50,
    "DateLastStatusUpdate": "2021-07-12T02:39:00Z",
    "MetadataValues": [
        {
            "ID": 14799,
            "MetadataFieldID": 4,
            "ItemValue": "Data from the German chargepoint registry provided by Bundesnetzagentur.de under the CC-BY 4.0 license"
        }
    ],
    "DataQualityLevel": 3,
    "DateCreated": "2021-07-08T10:03:00Z",
    "SubmissionStatusTypeID": 100
}