{
    "IsRecentlyVerified": true,
    "DateLastVerified": "2021-08-24T18:20:00Z",
    "ID": 188915,
    "UUID": "337F52F6-8BD2-41C2-9508-DB0DE2013442",
    "DataProviderID": 1,
    "OperatorID": 3445,
    "UsageTypeID": 4,
    "AddressInfo": {
        "ID": 189274,
        "Title": "Posto Guararema",
        "AddressLine1": "Rodovia Presidente Dutra",
        "Town": "Guararema",
        "StateOrProvince": "São Paulo",
        "Postcode": "",
        "CountryID": 36,
        "Latitude": -23.332743741350427,
        "Longitude": -46.13698663379819,
        "DistanceUnit": 0
    },
    "Connections": [
        {
            "ID": 305287,
            "ConnectionTypeID": 33,
            "StatusTypeID": 50,
            "LevelID": 2,
            "PowerKW": 50,
            "Quantity": 1
        },
        {
            "ID": 305288,
            "ConnectionTypeID": 2,
            "StatusTypeID": 50,
            "LevelID": 2,
            "PowerKW": 50,
            "Quantity": 1
        },
        {
            "ID": 305289,
            "ConnectionTypeID": 1036,
            "StatusTypeID": 50,
            "LevelID": 2,
            "PowerKW": 22,
            "Quantity": 1
        },
        {
            "ID": 305290,
            "ConnectionTypeID": 0,
            "StatusTypeID": 50,
            "Quantity": 1
        }
    ],
    "NumberOfPoints": 1,
    "StatusTypeID": 50,
    "DateLastStatusUpdate": "2021-08-24T19:44:00Z",
    "DataQualityLevel": 1,
    "DateCreated": "2021-08-24T18:20:00Z",
    "SubmissionStatusTypeID": 200
}