{
    "MediaItems": [
        {
            "ID": 8935,
            "ChargePointID": 39469,
            "ItemURL": "https://s3-ap-southeast-2.amazonaws.com/openchargemap/images/US/OCM39469/OCM-39469.orig.2017010105072397.jpg",
            "ItemThumbnailURL": "https://s3-ap-southeast-2.amazonaws.com/openchargemap/images/US/OCM39469/OCM-39469.thmb.2017010105072397.jpg",
            "Comment": "",
            "IsEnabled": true,
            "IsVideo": false,
            "IsFeaturedItem": false,
            "IsExternalResource": false,
            "User": {
                "ID": 12174,
                "Username": "Thombax"
            },
            "DateCreated": "2017-01-01T05:08:00Z"
        }
    ],
    "IsRecentlyVerified": false,
    "ID": 39469,
    "UUID": "8BB6B265-D938-4B89-B36F-097BCD12C441",
    "DataProviderID": 2,
    "DataProvidersReference": "55180",
    "OperatorID": 9,
    "UsageTypeID": 1,
    "AddressInfo": {
        "ID": 39815,
        "Title": "Paradise Point Resort",
        "AddressLine1": "1404 Vacation Road",
        "Town": "San Diego",
        "StateOrProvince": "CA",
        "Postcode": "92109",
        "CountryID": 2,
        "Latitude": 32.77485,
        "Longitude": -117.239356,
        "ContactTelephone1": "888-998-2546",
        "AccessComments": "MON: 24 hours | TUE: 24 hours | WED: 24 hours | THU: 24 hours | FRI: 24 hours | SAT: 24 hours | SUN: 24 hours",
        "RelatedURL": "http://www.blinknetwork.com/",
        "DistanceUnit": 0
    },
    "Connections": [
        {
            "ID": 42989,
            "ConnectionTypeID": 1,
            "LevelID": 2,
            "Amps": 16,
            "Voltage": 230,
            "PowerKW": 3,
            "CurrentTypeID": 10,
            "Quantity": 5
        }
    ],
    "DateLastStatusUpdate": "2018-01-04T06:16:00Z",
    "DataQualityLevel": 3,
    "DateCreated": "2015-01-10T01:00:00Z",
    "SubmissionStatusTypeID": 100
}