{
    "IsRecentlyVerified": false,
    "ID": 140789,
    "UUID": "BE73E61F-C23E-493E-8A1B-8E10FFF61AF3",
    "DataProviderID": 2,
    "DataProvidersReference": "148607",
    "OperatorID": 39,
    "UsageTypeID": 1,
    "AddressInfo": {
        "ID": 141141,
        "Title": "Kaiser - Redwood City |P2160",
        "AddressLine1": "1150 Veterans Boulevard",
        "Town": "Redwood City",
        "StateOrProvince": "CA",
        "Postcode": "94063",
        "CountryID": 2,
        "Latitude": 37.4893706,
        "Longitude": -122.223814,
        "ContactTelephone1": "800-663-5633",
        "AccessComments": "MO: Not Specified; TU: Not Specified; WE: Not Specified; TH: Not Specified; FR: Not Specified; SA: Not Specified; SU: Not Specified",
        "RelatedURL": "http://www.semacharge.com/",
        "DistanceUnit": 0
    },
    "Connections": [
        {
            "ID": 196519,
            "ConnectionTypeID": 1,
            "LevelID": 2,
            "Amps": 16,
            "Voltage": 230,
            "PowerKW": 3.7,
            "CurrentTypeID": 10,
            "Quantity": 13
        }
    ],
    "StatusTypeID": 50,
    "DateLastStatusUpdate": "2020-06-26T02:59:00Z",
    "DataQualityLevel": 3,
    "DateCreated": "2019-12-24T09:13:00Z",
    "SubmissionStatusTypeID": 100
}