{
    "IsRecentlyVerified": false,
    "ID": 159172,
    "UUID": "F4192FA7-2B39-4FBB-901D-14B6127BF7D9",
    "DataProviderID": 2,
    "DataProvidersReference": "152856",
    "OperatorID": 3293,
    "UsageTypeID": 1,
    "AddressInfo": {
        "ID": 159529,
        "Title": "NewPark Mall",
        "AddressLine1": "2086 Newpark Mall",
        "Town": "Newark",
        "StateOrProvince": "CA",
        "Postcode": "94560",
        "CountryID": 2,
        "Latitude": 37.52671,
        "Longitude": -122.000206,
        "ContactTelephone1": "888-264-2208",
        "AccessComments": "6am-12pm daily",
        "RelatedURL": "https://voltacharging.com/",
        "DistanceUnit": 0
    },
    "Connections": [
        {
            "ID": 229284,
            "ConnectionTypeID": 1,
            "LevelID": 2,
            "Amps": 16,
            "Voltage": 230,
            "PowerKW": 3.7,
            "CurrentTypeID": 10,
            "Quantity": 2
        }
    ],
    "StatusTypeID": 50,
    "DateLastStatusUpdate": "2020-06-26T02:59:00Z",
    "DataQualityLevel": 3,
    "DateCreated": "2020-06-26T02:59:00Z",
    "SubmissionStatusTypeID": 100
}