{
    "IsRecentlyVerified": false,
    "ID": 101658,
    "UUID": "C524A0FA-88F6-4BA7-95A0-C67D4F964D45",
    "DataProviderID": 1,
    "OperatorID": 45,
    "UsageTypeID": 2,
    "AddressInfo": {
        "ID": 102004,
        "Title": "Gemeindeverwaltung",
        "AddressLine1": "Linnpfad 30",
        "Town": "Heuchelheim",
        "StateOrProvince": "Landkreis Gießen",
        "Postcode": "35452",
        "CountryID": 87,
        "Latitude": 50.5845368,
        "Longitude": 8.618269899999973,
        "AccessComments": "Zugangskarte kann während der Öffnungszeiten (Mo-Fr 8-12Uhr, Do 14-18Uhr) ausgeliehen werden. ",
        "DistanceUnit": 0
    },
    "Connections": [
        {
            "ID": 143502,
            "ConnectionTypeID": 25,
            "StatusTypeID": 50,
            "LevelID": 2,
            "Amps": 16,
            "Voltage": 400,
            "PowerKW": 11,
            "CurrentTypeID": 20,
            "Quantity": 2
        }
    ],
    "NumberOfPoints": 2,
    "StatusTypeID": 50,
    "DateLastStatusUpdate": "2018-04-03T12:51:00Z",
    "DataQualityLevel": 1,
    "DateCreated": "2018-04-03T12:51:00Z",
    "SubmissionStatusTypeID": 200
}