{
    "IsRecentlyVerified": false,
    "ID": 152430,
    "UUID": "3BFFCD65-D2AA-453F-82A0-EE914DAD0BC4",
    "DataProviderID": 28,
    "DataProvidersReference": "FR*S86*PSORE*B052",
    "UsageTypeID": 5,
    "AddressInfo": {
        "ID": 152783,
        "Title": "B052",
        "AddressLine1": "Rue de demier - 86120 - Les Trois-Moutiers",
        "CountryID": 80,
        "Latitude": 47.0633,
        "Longitude": 0.0177,
        "AccessComments": "24/24 7/7 jours",
        "DistanceUnit": 0
    },
    "Connections": [
        {
            "ID": 213396,
            "ConnectionTypeID": 28,
            "StatusTypeID": 50,
            "LevelID": 2,
            "PowerKW": 18,
            "CurrentTypeID": 10
        },
        {
            "ID": 213397,
            "ConnectionTypeID": 25,
            "StatusTypeID": 50,
            "LevelID": 2,
            "PowerKW": 18,
            "CurrentTypeID": 20
        },
        {
            "ID": 246316,
            "ConnectionTypeID": 28,
            "StatusTypeID": 50,
            "LevelID": 2,
            "PowerKW": 18,
            "CurrentTypeID": 10
        },
        {
            "ID": 246317,
            "ConnectionTypeID": 25,
            "StatusTypeID": 50,
            "LevelID": 2,
            "PowerKW": 18,
            "CurrentTypeID": 20
        }
    ],
    "GeneralComments": "",
    "StatusTypeID": 50,
    "DateLastStatusUpdate": "2020-08-27T05:13:00Z",
    "DataQualityLevel": 2,
    "DateCreated": "2020-03-15T10:53:00Z",
    "SubmissionStatusTypeID": 100
}