{
    "IsRecentlyVerified": false,
    "ID": 3509,
    "UUID": "7FDB4675-B09B-46E1-8421-5F9FF351CE01",
    "DataProviderID": 1,
    "UsageTypeID": 1,
    "AddressInfo": {
        "ID": 3510,
        "Title": "Oregon Museum of Science and Industry",
        "AddressLine1": "1945 SE Water Ave",
        "Town": "Portland",
        "StateOrProvince": "OR",
        "Postcode": "97214",
        "CountryID": 2,
        "Latitude": 45.5084,
        "Longitude": -122.6647,
        "ContactTelephone1": "503-797-4661",
        "DistanceUnit": 0
    },
    "Connections": [
        {
            "ID": 25,
            "ConnectionTypeID": 1,
            "Quantity": 1
        }
    ],
    "NumberOfPoints": 1,
    "DateLastStatusUpdate": "2019-12-15T06:07:00Z",
    "DateCreated": "2010-02-28T00:00:00Z",
    "SubmissionStatusTypeID": 200
}