{
    "IsRecentlyVerified": false,
    "ID": 32751,
    "UUID": "3D76F2B4-9DE7-459C-85DC-423C1EFCD4C8",
    "DataProviderID": 26,
    "DataProvidersReference": "47478",
    "OperatorID": 178,
    "OperatorsReference": "EVnetNL AL634",
    "UsageCost": "0.00 jaarabonnement",
    "AddressInfo": {
        "ID": 33097,
        "Title": "Rensumaborg 16",
        "AddressLine1": "Rensumaborg 16",
        "Town": "Eindhoven",
        "Postcode": "5655 CK",
        "CountryID": 159,
        "Latitude": 51.413598,
        "Longitude": 5.441993,
        "ContactTelephone1": "0800-3522365",
        "RelatedURL": "http://www.evnet.nl",
        "DistanceUnit": 0
    },
    "Connections": [
        {
            "ID": 36262,
            "ConnectionTypeID": 25,
            "LevelID": 2,
            "PowerKW": 11,
            "CurrentTypeID": 10
        }
    ],
    "NumberOfPoints": 2,
    "StatusTypeID": 50,
    "DateLastStatusUpdate": "2016-06-04T02:38:00Z",
    "DataQualityLevel": 3,
    "DateCreated": "2015-01-09T06:03:00Z",
    "SubmissionStatusTypeID": 100
}