{
    "IsRecentlyVerified": false,
    "ID": 67374,
    "UUID": "2CA89FEC-83A4-4C8F-9BB6-D9E5C67E7A94",
    "DataProviderID": 1,
    "OperatorID": 23,
    "OperatorsReference": "16177",
    "UsageTypeID": 1,
    "UsageCost": "Free",
    "AddressInfo": {
        "ID": 67720,
        "Title": "Red Lion Hotel - Tesla",
        "AddressLine1": "161 W 600 S",
        "Town": "Salt Lake City",
        "StateOrProvince": "UT",
        "Postcode": "84101",
        "CountryID": 2,
        "Latitude": 40.7558948,
        "Longitude": -111.8951103,
        "ContactTelephone1": "801-521-7373  877-798-3752",
        "AccessComments": "24 hours daily; for Tesla use only",
        "RelatedURL": "http://www.teslamotors.com/supercharger",
        "DistanceUnit": 0
    },
    "Connections": [
        {
            "ID": 92878,
            "ConnectionTypeID": 30,
            "StatusTypeID": 50,
            "LevelID": 2,
            "Amps": 16,
            "Voltage": 230,
            "PowerKW": 8,
            "CurrentTypeID": 10,
            "Quantity": 2
        }
    ],
    "NumberOfPoints": 2,
    "StatusTypeID": 50,
    "DateLastStatusUpdate": "2017-01-31T18:25:00Z",
    "DataQualityLevel": 3,
    "DateCreated": "2016-05-29T02:05:00Z",
    "SubmissionStatusTypeID": 100
}