{
    "IsRecentlyVerified": false,
    "ID": 9752,
    "UUID": "FF944416-89C1-4232-B051-AA99420E52D3",
    "DataProviderID": 15,
    "DataProvidersReference": "16003",
    "OperatorID": 31,
    "UsageTypeID": 1,
    "AddressInfo": {
        "ID": 9649,
        "Title": "511 NE 15th Street",
        "AddressLine1": "511 NE 15th Street",
        "Town": "Miami",
        "StateOrProvince": "FL",
        "Postcode": "33132",
        "CountryID": 2,
        "Latitude": 25.789906,
        "Longitude": -80.186749,
        "ContactTelephone1": "305-536-9917",
        "RelatedURL": "http://carstations.com/16003",
        "DistanceUnit": 0
    },
    "Connections": [
        {
            "ID": 7559,
            "ConnectionTypeID": 1,
            "Reference": "J1772",
            "LevelID": 2,
            "Quantity": 1
        },
        {
            "ID": 8479,
            "ConnectionTypeID": 9,
            "Reference": "NEMA5",
            "LevelID": 1
        }
    ],
    "NumberOfPoints": 2,
    "StatusTypeID": 50,
    "DateLastStatusUpdate": "2017-11-04T14:03:00Z",
    "DataQualityLevel": 2,
    "DateCreated": "2012-04-16T15:46:00Z",
    "SubmissionStatusTypeID": 100
}