{
    "IsRecentlyVerified": false,
    "ID": 154679,
    "UUID": "99AC5727-DFD6-4862-A34A-B363FFB60880",
    "DataProviderID": 1,
    "OperatorID": 3315,
    "OperatorsReference": "50921,50921",
    "UsageTypeID": 1,
    "AddressInfo": {
        "ID": 155032,
        "Title": "4 Rouken Glen Road",
        "AddressLine1": "4 Rouken Glen Road",
        "Town": "Glasgow",
        "Postcode": "G46 7EG",
        "CountryID": 1,
        "Latitude": 55.80121,
        "Longitude": -4.320431,
        "RelatedURL": "http://www.chargeyourcar.org.uk",
        "DistanceUnit": 0
    },
    "Connections": [
        {
            "ID": 217621,
            "ConnectionTypeID": 1036,
            "Reference": "51095-3",
            "StatusTypeID": 50,
            "LevelID": 3,
            "Amps": 63,
            "Voltage": 400,
            "PowerKW": 43,
            "CurrentTypeID": 20,
            "Quantity": 1
        },
        {
            "ID": 217622,
            "ConnectionTypeID": 33,
            "Reference": "51095-2",
            "StatusTypeID": 50,
            "LevelID": 3,
            "Amps": 125,
            "Voltage": 400,
            "PowerKW": 50,
            "CurrentTypeID": 30,
            "Quantity": 1
        },
        {
            "ID": 217623,
            "ConnectionTypeID": 2,
            "Reference": "51095-1",
            "StatusTypeID": 50,
            "LevelID": 3,
            "Amps": 125,
            "Voltage": 400,
            "PowerKW": 50,
            "CurrentTypeID": 30,
            "Quantity": 1
        }
    ],
    "NumberOfPoints": 1,
    "StatusTypeID": 0,
    "DateLastStatusUpdate": "2020-03-26T06:16:00Z",
    "MetadataValues": [
        {
            "ID": 7231,
            "MetadataFieldID": 4,
            "ItemValue": "Contains public sector information licensed under the Open Government Licence v2.0. http://www.nationalarchives.gov.uk/doc/open-government-licence/version/2/"
        }
    ],
    "DataQualityLevel": 3,
    "DateCreated": "2020-03-17T08:15:00Z",
    "SubmissionStatusTypeID": 100
}