{
    "IsRecentlyVerified": false,
    "ID": 2997,
    "UUID": "48E7840C-7AD7-4455-A95E-E6A4075297A8",
    "DataProviderID": 2,
    "DataProvidersReference": "36932",
    "UsageTypeID": 1,
    "AddressInfo": {
        "ID": 2998,
        "Title": "Park 'N Fly - Bradley International Airport",
        "AddressLine1": "1186 South St",
        "Town": "Suffield",
        "StateOrProvince": "CT",
        "Postcode": "06078",
        "CountryID": 2,
        "Latitude": 41.951328,
        "Longitude": -72.663078,
        "ContactTelephone1": "800-218-1297",
        "AccessComments": "24 hours daily; pay lot; see attendant for access",
        "RelatedURL": "",
        "DistanceUnit": 0
    },
    "Connections": [
        {
            "ID": 3408,
            "ConnectionTypeID": 1,
            "LevelID": 2,
            "Amps": 16,
            "Voltage": 230,
            "PowerKW": 3.7,
            "CurrentTypeID": 10,
            "Quantity": 2
        },
        {
            "ID": 20372,
            "ConnectionTypeID": 1,
            "LevelID": 2,
            "Quantity": 3
        }
    ],
    "DateLastConfirmed": "2011-06-30T00:00:00Z",
    "StatusTypeID": 100,
    "DateLastStatusUpdate": "2020-06-26T03:05:00Z",
    "DataQualityLevel": 1,
    "DateCreated": "2011-02-28T00:00:00Z",
    "SubmissionStatusTypeID": 100
}