{
    "IsRecentlyVerified": false,
    "ID": 151865,
    "UUID": "E2895BB6-0CAE-4A20-98E6-60284465D859",
    "DataProviderID": 28,
    "DataProvidersReference": "FRS42P42156A1",
    "UsageTypeID": 5,
    "AddressInfo": {
        "ID": 152218,
        "Title": "Parking ZA des Jacquins",
        "AddressLine1": "les jacquins",
        "CountryID": 80,
        "Latitude": 45.887058,
        "Longitude": 4.177878,
        "AccessComments": "24/24 - 7/7",
        "DistanceUnit": 0
    },
    "Connections": [
        {
            "ID": 212312,
            "ConnectionTypeID": 28,
            "StatusTypeID": 50,
            "LevelID": 2,
            "PowerKW": 22,
            "CurrentTypeID": 10
        },
        {
            "ID": 212313,
            "ConnectionTypeID": 1036,
            "StatusTypeID": 50,
            "LevelID": 2,
            "PowerKW": 22,
            "CurrentTypeID": 20
        }
    ],
    "GeneralComments": "En service",
    "StatusTypeID": 50,
    "DateLastStatusUpdate": "2020-08-27T05:12:00Z",
    "DataQualityLevel": 2,
    "DateCreated": "2020-03-15T10:53:00Z",
    "SubmissionStatusTypeID": 100
}