{
    "IsRecentlyVerified": false,
    "ID": 41499,
    "UUID": "394EB404-C17F-4532-9CAA-40E836672E27",
    "DataProviderID": 2,
    "DataProvidersReference": "65501",
    "OperatorID": 5,
    "UsageTypeID": 1,
    "AddressInfo": {
        "ID": 41845,
        "Title": "MARSH PARK",
        "AddressLine1": "2944 Gleneden St",
        "Town": "Los Angeles",
        "StateOrProvince": "CA",
        "Postcode": "90039",
        "CountryID": 2,
        "Latitude": 34.107531,
        "Longitude": -118.247756,
        "ContactTelephone1": "888-758-4389",
        "AccessComments": "24 hours daily",
        "RelatedURL": "http://www.chargepoint.com/",
        "DistanceUnit": 0
    },
    "Connections": [
        {
            "ID": 45389,
            "ConnectionTypeID": 1,
            "LevelID": 2,
            "Amps": 16,
            "Voltage": 230,
            "PowerKW": 3,
            "CurrentTypeID": 10,
            "Quantity": 3
        }
    ],
    "DateLastStatusUpdate": "2019-04-06T04:01:00Z",
    "DataQualityLevel": 3,
    "DateCreated": "2015-02-05T12:10:00Z",
    "SubmissionStatusTypeID": 100
}