{
    "IsRecentlyVerified": false,
    "ID": 79662,
    "UUID": "F748AAB8-AA23-45E8-AEC4-5D45485BAD3A",
    "DataProviderID": 1,
    "OperatorID": 23,
    "OperatorsReference": "17010",
    "UsageTypeID": 6,
    "UsageCost": "Free",
    "AddressInfo": {
        "ID": 80008,
        "Title": "Esplanade Zagreb Hotel",
        "AddressLine1": "1 Mihanovieva",
        "Town": "Zagreb",
        "Postcode": "10000",
        "CountryID": 60,
        "Latitude": 45.805469,
        "Longitude": 15.975906,
        "ContactTelephone1": "+385 1 4566 666",
        "DistanceUnit": 0
    },
    "Connections": [
        {
            "ID": 114302,
            "ConnectionTypeID": 30,
            "StatusTypeID": 50,
            "LevelID": 2,
            "Amps": 32,
            "Voltage": 400,
            "PowerKW": 22,
            "CurrentTypeID": 20,
            "Quantity": 1
        }
    ],
    "NumberOfPoints": 1,
    "GeneralComments": "1 Tesla Connector, up to 22kW.Available for patrons only. Please see front desk.",
    "StatusTypeID": 50,
    "DateLastStatusUpdate": "2018-10-03T16:25:00Z",
    "DataQualityLevel": 1,
    "DateCreated": "2017-01-29T18:20:00Z",
    "SubmissionStatusTypeID": 200
}