{
    "IsRecentlyVerified": false,
    "ID": 184315,
    "UUID": "D6391965-FEDB-4CEA-AD2A-8C248102403A",
    "DataProviderID": 29,
    "DataProvidersReference": "8592",
    "OperatorID": 103,
    "AddressInfo": {
        "ID": 184674,
        "Title": "Friedenstr. 68",
        "AddressLine1": "Friedenstr. 68",
        "Town": "Berlin",
        "Postcode": "10249",
        "CountryID": 87,
        "Latitude": 52.518612,
        "Longitude": 13.440238,
        "DistanceUnit": 0
    },
    "Connections": [
        {
            "ID": 292429,
            "ConnectionTypeID": 25,
            "StatusTypeID": 50,
            "LevelID": 2,
            "PowerKW": 11,
            "CurrentTypeID": 20
        },
        {
            "ID": 292430,
            "ConnectionTypeID": 25,
            "StatusTypeID": 50,
            "LevelID": 2,
            "PowerKW": 11,
            "CurrentTypeID": 20
        }
    ],
    "StatusTypeID": 50,
    "DateLastStatusUpdate": "2021-07-09T03:27:00Z",
    "MetadataValues": [
        {
            "ID": 16606,
            "MetadataFieldID": 4,
            "ItemValue": "Data from the German chargepoint registry provided by Bundesnetzagentur.de under the CC-BY 4.0 license"
        }
    ],
    "DataQualityLevel": 3,
    "DateCreated": "2021-07-08T10:05:00Z",
    "SubmissionStatusTypeID": 100
}