{
    "IsRecentlyVerified": false,
    "ID": 180550,
    "UUID": "F1AE5F48-41DC-4A55-A3C5-07E0929CF7BD",
    "DataProviderID": 29,
    "DataProvidersReference": "5430",
    "AddressInfo": {
        "ID": 180909,
        "Title": "Weilerstraße 80",
        "AddressLine1": "Weilerstraße 80",
        "Town": "Sulz a.N.",
        "Postcode": "72172",
        "CountryID": 87,
        "Latitude": 48.35663,
        "Longitude": 8.6186,
        "DistanceUnit": 0
    },
    "Connections": [
        {
            "ID": 283758,
            "ConnectionTypeID": 25,
            "StatusTypeID": 50,
            "LevelID": 2,
            "PowerKW": 22,
            "CurrentTypeID": 20
        },
        {
            "ID": 283759,
            "ConnectionTypeID": 25,
            "StatusTypeID": 50,
            "LevelID": 2,
            "PowerKW": 22,
            "CurrentTypeID": 20
        }
    ],
    "StatusTypeID": 50,
    "DateLastStatusUpdate": "2021-07-12T02:41:00Z",
    "MetadataValues": [
        {
            "ID": 12844,
            "MetadataFieldID": 4,
            "ItemValue": "Data from the German chargepoint registry provided by Bundesnetzagentur.de under the CC-BY 4.0 license"
        }
    ],
    "DataQualityLevel": 3,
    "DateCreated": "2021-07-08T10:00:00Z",
    "SubmissionStatusTypeID": 100
}