{
    "IsRecentlyVerified": false,
    "ID": 37349,
    "UUID": "E9F59696-1BCD-4861-AFA7-A1417EE00EAD",
    "DataProviderID": 26,
    "DataProvidersReference": "47425",
    "OperatorID": 178,
    "OperatorsReference": "EVnetNL AL580",
    "UsageCost": "0.00 jaarabonnement",
    "AddressInfo": {
        "ID": 37695,
        "Title": "Raadhuisplein",
        "AddressLine1": "Raadhuisplein",
        "Town": "Heemstede",
        "Postcode": "2101 HB",
        "CountryID": 159,
        "Latitude": 52.34657,
        "Longitude": 4.620124,
        "ContactTelephone1": "0800-3522365",
        "RelatedURL": "http://www.evnet.nl",
        "DistanceUnit": 0
    },
    "Connections": [
        {
            "ID": 40860,
            "ConnectionTypeID": 25,
            "LevelID": 1,
            "PowerKW": 2.3,
            "CurrentTypeID": 10
        }
    ],
    "NumberOfPoints": 2,
    "StatusTypeID": 50,
    "DateLastStatusUpdate": "2016-06-04T02:53:00Z",
    "DataQualityLevel": 3,
    "DateCreated": "2015-01-09T06:07:00Z",
    "SubmissionStatusTypeID": 100
}