{
    "IsRecentlyVerified": false,
    "ID": 86067,
    "UUID": "950F9F74-C329-4C2E-A168-C0DC2183300C",
    "DataProviderID": 1,
    "OperatorID": 234,
    "UsageTypeID": 4,
    "AddressInfo": {
        "ID": 86413,
        "Title": "Stadtwerke Forchheim NErgie",
        "AddressLine1": "Haidfeldstraße 8",
        "Town": "Forchheim",
        "StateOrProvince": "Landkreis Forchheim",
        "Postcode": "91301",
        "CountryID": 87,
        "Latitude": 49.72103202539682,
        "Longitude": 11.06641667724602,
        "AccessComments": "24/7 nutzbar mit N-Ergie Ladekarte (Ladeverbund Franken +) freischaltbar oder per SMS. Bei SMS je nach Ladeleistung Zeittarif von 1,20€/h bis 8€/h.",
        "DistanceUnit": 0
    },
    "Connections": [
        {
            "ID": 122408,
            "ConnectionTypeID": 25,
            "StatusTypeID": 50,
            "LevelID": 2,
            "Amps": 32,
            "Voltage": 400,
            "PowerKW": 22,
            "CurrentTypeID": 20,
            "Quantity": 2
        }
    ],
    "NumberOfPoints": 2,
    "StatusTypeID": 50,
    "DateLastStatusUpdate": "2017-04-25T06:05:00Z",
    "DataQualityLevel": 1,
    "DateCreated": "2017-04-25T06:05:00Z",
    "SubmissionStatusTypeID": 200
}