{
    "IsRecentlyVerified": false,
    "ID": 39068,
    "UUID": "0F427831-B32E-49E4-8012-F1167359EF71",
    "DataProviderID": 26,
    "DataProvidersReference": "46972",
    "OperatorID": 178,
    "OperatorsReference": "EVnetNL AL102",
    "UsageCost": "0.00 jaarabonnement",
    "AddressInfo": {
        "ID": 39414,
        "Title": "Spanjaardslaan 99a",
        "AddressLine1": "Spanjaardslaan 99a",
        "Town": "Leeuwarden",
        "Postcode": "8917 AN",
        "CountryID": 159,
        "Latitude": 53.20722,
        "Longitude": 5.78914,
        "ContactTelephone1": "0800-3522365",
        "RelatedURL": "http://www.evnet.nl",
        "DistanceUnit": 0
    },
    "Connections": [
        {
            "ID": 42579,
            "ConnectionTypeID": 25,
            "LevelID": 2,
            "PowerKW": 11,
            "CurrentTypeID": 10
        }
    ],
    "NumberOfPoints": 1,
    "StatusTypeID": 50,
    "DateLastStatusUpdate": "2016-06-04T02:56:00Z",
    "DataQualityLevel": 3,
    "DateCreated": "2015-01-09T06:08:00Z",
    "SubmissionStatusTypeID": 100
}