{
    "IsRecentlyVerified": false,
    "ID": 121129,
    "UUID": "370A3941-C8EE-4B99-B59C-AA64CE518417",
    "DataProviderID": 2,
    "DataProvidersReference": "118700",
    "OperatorID": 39,
    "UsageTypeID": 4,
    "AddressInfo": {
        "ID": 121475,
        "Title": "Kaiser Irwindale Surgical Specialty MOB",
        "AddressLine1": "12761 Schabarum Ave",
        "Town": "Irwindale",
        "StateOrProvince": "CA",
        "Postcode": "91706",
        "CountryID": 2,
        "Latitude": 34.0813822,
        "Longitude": -117.9964629,
        "ContactTelephone1": "800-663-5633",
        "AccessComments": "MO: 12:00am-12:00am; TU: 12:00am-12:00am; WE: 12:00am-12:00am; TH: 12:00am-12:00am; FR: 12:00am-12:00am; SA: 12:00am-12:00am; SU: 12:00am-12:00am",
        "RelatedURL": "http://www.semacharge.com/",
        "DistanceUnit": 0
    },
    "Connections": [
        {
            "ID": 170560,
            "ConnectionTypeID": 1,
            "LevelID": 2,
            "Amps": 16,
            "Voltage": 230,
            "PowerKW": 3,
            "CurrentTypeID": 10,
            "Quantity": 13
        }
    ],
    "DateLastStatusUpdate": "2019-04-01T04:59:00Z",
    "DataQualityLevel": 3,
    "DateCreated": "2019-04-01T04:59:00Z",
    "SubmissionStatusTypeID": 100
}