{
    "UserComments": [
        {
            "ID": 24466,
            "ChargePointID": 175733,
            "CommentTypeID": 10,
            "UserName": "ForumElettrico.it",
            "Comment": "A neanche 10 minuti a piedi del centro storico e dove si trova di tutto per passare il tempo necessario alla ricarica. Leggi la recensione completa qui >  https://www.forumelettrico.it/forum/colonnine-be-charge-22-kw-ads-ego-fabbrico-re-via-angelo-ferretti-42-t18388.html",
            "RelatedURL": "https://www.forumelettrico.it/forum/colonnine-be-charge-22-kw-ads-ego-fabbrico-re-via-angelo-ferretti-42-t18388.html",
            "DateCreated": "2021-06-10T09:05:24.063Z",
            "User": {
                "ID": 11749,
                "Username": "ForumElettrico.it"
            },
            "CheckinStatusTypeID": 10,
            "IsActionedByEditor": false
        }
    ],
    "MediaItems": [
        {
            "ID": 28088,
            "ChargePointID": 175733,
            "ItemURL": "https://s3-ap-southeast-2.amazonaws.com/openchargemap/images/IT/OCM175733/OCM-175733.orig.2021061009053545.jpg",
            "ItemThumbnailURL": "https://s3-ap-southeast-2.amazonaws.com/openchargemap/images/IT/OCM175733/OCM-175733.thmb.2021061009053545.jpg",
            "Comment": "",
            "IsEnabled": true,
            "IsVideo": false,
            "IsFeaturedItem": false,
            "IsExternalResource": false,
            "User": {
                "ID": 11749,
                "Username": "ForumElettrico.it"
            },
            "DateCreated": "2021-06-10T09:06:00Z"
        },
        {
            "ID": 28089,
            "ChargePointID": 175733,
            "ItemURL": "https://s3-ap-southeast-2.amazonaws.com/openchargemap/images/IT/OCM175733/OCM-175733.orig.2021061009054294.jpg",
            "ItemThumbnailURL": "https://s3-ap-southeast-2.amazonaws.com/openchargemap/images/IT/OCM175733/OCM-175733.thmb.2021061009054294.jpg",
            "Comment": "",
            "IsEnabled": true,
            "IsVideo": false,
            "IsFeaturedItem": false,
            "IsExternalResource": false,
            "User": {
                "ID": 11749,
                "Username": "ForumElettrico.it"
            },
            "DateCreated": "2021-06-10T09:06:00Z"
        },
        {
            "ID": 28090,
            "ChargePointID": 175733,
            "ItemURL": "https://s3-ap-southeast-2.amazonaws.com/openchargemap/images/IT/OCM175733/OCM-175733.orig.2021061009054965.jpg",
            "ItemThumbnailURL": "https://s3-ap-southeast-2.amazonaws.com/openchargemap/images/IT/OCM175733/OCM-175733.thmb.2021061009054965.jpg",
            "Comment": "",
            "IsEnabled": true,
            "IsVideo": false,
            "IsFeaturedItem": false,
            "IsExternalResource": false,
            "User": {
                "ID": 11749,
                "Username": "ForumElettrico.it"
            },
            "DateCreated": "2021-06-10T09:06:00Z"
        },
        {
            "ID": 28091,
            "ChargePointID": 175733,
            "ItemURL": "https://s3-ap-southeast-2.amazonaws.com/openchargemap/images/IT/OCM175733/OCM-175733.orig.2021061009055565.jpg",
            "ItemThumbnailURL": "https://s3-ap-southeast-2.amazonaws.com/openchargemap/images/IT/OCM175733/OCM-175733.thmb.2021061009055565.jpg",
            "Comment": "",
            "IsEnabled": true,
            "IsVideo": false,
            "IsFeaturedItem": false,
            "IsExternalResource": false,
            "User": {
                "ID": 11749,
                "Username": "ForumElettrico.it"
            },
            "DateCreated": "2021-06-10T09:06:00Z"
        },
        {
            "ID": 28092,
            "ChargePointID": 175733,
            "ItemURL": "https://s3-ap-southeast-2.amazonaws.com/openchargemap/images/IT/OCM175733/OCM-175733.orig.2021061009060344.jpg",
            "ItemThumbnailURL": "https://s3-ap-southeast-2.amazonaws.com/openchargemap/images/IT/OCM175733/OCM-175733.thmb.2021061009060344.jpg",
            "Comment": "",
            "IsEnabled": true,
            "IsVideo": false,
            "IsFeaturedItem": false,
            "IsExternalResource": false,
            "User": {
                "ID": 11749,
                "Username": "ForumElettrico.it"
            },
            "DateCreated": "2021-06-10T09:06:00Z"
        }
    ],
    "IsRecentlyVerified": false,
    "ID": 175733,
    "UUID": "6A2ABC85-8CDC-422B-B72F-CB7D645355B3",
    "DataProviderID": 1,
    "OperatorID": 3327,
    "UsageTypeID": 1,
    "AddressInfo": {
        "ID": 176092,
        "Title": "Be Charge AdS Ego",
        "AddressLine1": "Via Angelo Ferretti 42",
        "Town": "Fabbrico",
        "StateOrProvince": "RE",
        "CountryID": 112,
        "Latitude": 44.872604,
        "Longitude": 8.032022,
        "RelatedURL": "https://www.forumelettrico.it/forum/colonnine-be-charge-22-kw-ads-ego-fabbrico-re-via-angelo-ferretti-42-t18388.html",
        "DistanceUnit": 0
    },
    "Connections": [
        {
            "ID": 272897,
            "ConnectionTypeID": 25,
            "LevelID": 2,
            "PowerKW": 22,
            "Quantity": 2
        }
    ],
    "NumberOfPoints": 2,
    "StatusTypeID": 50,
    "DateLastStatusUpdate": "2021-07-04T07:06:00Z",
    "DataQualityLevel": 1,
    "DateCreated": "2021-06-10T09:05:00Z",
    "SubmissionStatusTypeID": 200
}