{
    "IsRecentlyVerified": false,
    "ID": 157034,
    "UUID": "FC3ECD06-F09E-40D5-A2AF-572DFBD77D45",
    "DataProviderID": 19,
    "DataProvidersReference": "6123",
    "AddressInfo": {
        "ID": 157388,
        "Title": "Meny Åråsen",
        "AddressLine1": "C.J. Hansens vei 16-18",
        "Town": "KJELLER",
        "StateOrProvince": "Viken",
        "Postcode": "2007",
        "CountryID": 168,
        "Latitude": 59.96329,
        "Longitude": 11.06117,
        "AccessComments": "",
        "DistanceUnit": 0
    },
    "Connections": [
        {
            "ID": 224268,
            "ConnectionTypeID": 33,
            "Reference": "1",
            "LevelID": 3,
            "Amps": 100,
            "Voltage": 500,
            "PowerKW": 50,
            "CurrentTypeID": 30,
            "Comments": "Mode 4"
        },
        {
            "ID": 224269,
            "ConnectionTypeID": 2,
            "Reference": "2",
            "LevelID": 3,
            "Amps": 100,
            "Voltage": 500,
            "PowerKW": 50,
            "CurrentTypeID": 30,
            "Comments": "Mode 4"
        },
        {
            "ID": 224270,
            "ConnectionTypeID": 33,
            "Reference": "3",
            "LevelID": 3,
            "Amps": 100,
            "Voltage": 500,
            "PowerKW": 50,
            "CurrentTypeID": 30,
            "Comments": "Mode 4"
        },
        {
            "ID": 224271,
            "ConnectionTypeID": 2,
            "Reference": "4",
            "LevelID": 3,
            "Amps": 100,
            "Voltage": 500,
            "PowerKW": 50,
            "CurrentTypeID": 30,
            "Comments": "Mode 4"
        },
        {
            "ID": 224272,
            "ConnectionTypeID": 33,
            "Reference": "5",
            "LevelID": 3,
            "Amps": 100,
            "Voltage": 500,
            "PowerKW": 50,
            "CurrentTypeID": 30,
            "Comments": "Mode 4"
        },
        {
            "ID": 224273,
            "ConnectionTypeID": 2,
            "Reference": "6",
            "LevelID": 3,
            "Amps": 100,
            "Voltage": 500,
            "PowerKW": 50,
            "CurrentTypeID": 30,
            "Comments": "Mode 4"
        },
        {
            "ID": 224274,
            "ConnectionTypeID": 33,
            "Reference": "7",
            "LevelID": 3,
            "Amps": 100,
            "Voltage": 500,
            "PowerKW": 50,
            "CurrentTypeID": 30,
            "Comments": "Mode 4"
        },
        {
            "ID": 224275,
            "ConnectionTypeID": 2,
            "Reference": "8",
            "LevelID": 3,
            "Amps": 100,
            "Voltage": 500,
            "PowerKW": 50,
            "CurrentTypeID": 30,
            "Comments": "Mode 4"
        },
        {
            "ID": 224276,
            "ConnectionTypeID": 33,
            "Reference": "9",
            "LevelID": 3,
            "Amps": 100,
            "Voltage": 500,
            "PowerKW": 50,
            "CurrentTypeID": 30,
            "Comments": "Mode 4"
        },
        {
            "ID": 224277,
            "ConnectionTypeID": 2,
            "Reference": "10",
            "LevelID": 3,
            "Amps": 100,
            "Voltage": 500,
            "PowerKW": 50,
            "CurrentTypeID": 30,
            "Comments": "Mode 4"
        }
    ],
    "NumberOfPoints": 10,
    "StatusTypeID": 0,
    "DateLastStatusUpdate": "2021-03-24T05:12:00Z",
    "DataQualityLevel": 2,
    "DateCreated": "2020-05-26T08:23:00Z",
    "SubmissionStatusTypeID": 100
}