{
    "IsRecentlyVerified": false,
    "ID": 153860,
    "UUID": "9B171779-D30C-4653-9260-FD2CC8EA5CEB",
    "DataProviderID": 28,
    "DataProvidersReference": "FR*S77*P77135A",
    "OperatorID": 3413,
    "UsageTypeID": 5,
    "AddressInfo": {
        "ID": 154213,
        "Title": "Courpalay",
        "AddressLine1": "place de l'église",
        "CountryID": 80,
        "Latitude": 48.6477477,
        "Longitude": 2.9606648,
        "AccessComments": "",
        "DistanceUnit": 0
    },
    "Connections": [
        {
            "ID": 216099,
            "ConnectionTypeID": 28,
            "StatusTypeID": 50,
            "LevelID": 2,
            "PowerKW": 18,
            "CurrentTypeID": 10
        },
        {
            "ID": 216100,
            "ConnectionTypeID": 25,
            "StatusTypeID": 50,
            "LevelID": 2,
            "PowerKW": 18,
            "CurrentTypeID": 20
        }
    ],
    "GeneralComments": "badge, appli et QR code",
    "StatusTypeID": 50,
    "DateLastStatusUpdate": "2020-08-27T05:15:00Z",
    "DataQualityLevel": 2,
    "DateCreated": "2020-03-15T10:54:00Z",
    "SubmissionStatusTypeID": 100
}