{
    "IsRecentlyVerified": false,
    "ID": 38926,
    "UUID": "280D6DA7-2CE2-4800-B548-E1047C8A656E",
    "DataProviderID": 26,
    "DataProvidersReference": "48686",
    "OperatorID": 178,
    "OperatorsReference": "EVnetNL REE565",
    "UsageCost": "0.00 jaarabonnement",
    "AddressInfo": {
        "ID": 39272,
        "Title": "Duitslandlaan 5",
        "AddressLine1": "Duitslandlaan 5",
        "Town": "Assen",
        "Postcode": "9403 DL",
        "CountryID": 159,
        "Latitude": 53.02675,
        "Longitude": 6.577111,
        "ContactTelephone1": "0800-3522365",
        "RelatedURL": "http://www.evnet.nl",
        "DistanceUnit": 0
    },
    "Connections": [
        {
            "ID": 42437,
            "ConnectionTypeID": 25,
            "LevelID": 1,
            "PowerKW": 2.3,
            "CurrentTypeID": 10
        }
    ],
    "NumberOfPoints": 1,
    "StatusTypeID": 50,
    "DateLastStatusUpdate": "2016-06-04T02:56:00Z",
    "DataQualityLevel": 3,
    "DateCreated": "2015-01-09T06:08:00Z",
    "SubmissionStatusTypeID": 100
}