{
    "IsRecentlyVerified": false,
    "ID": 75568,
    "UUID": "775C3E42-DF86-4B98-9516-EF871DC48EAA",
    "DataProviderID": 1,
    "OperatorID": 142,
    "OperatorsReference": "3345155",
    "UsageTypeID": 4,
    "AddressInfo": {
        "ID": 75914,
        "Title": "Wipark Garage Wienerberg Ph C+D",
        "AddressLine1": "Clemens-Holzmeister-Straße 2-4",
        "Town": "Wien",
        "Postcode": "1100",
        "CountryID": 19,
        "Latitude": 48.1689145,
        "Longitude": 16.3474112,
        "AccessComments": "Details zum Elektrotankstellenort:  Tiefgarage, Einfahrt PH C+D, Auffahrt in die Ebene -1",
        "DistanceUnit": 0
    },
    "Connections": [
        {
            "ID": 108937,
            "ConnectionTypeID": 25,
            "StatusTypeID": 50,
            "LevelID": 2,
            "Amps": 16,
            "Voltage": 400,
            "PowerKW": 11,
            "CurrentTypeID": 20,
            "Quantity": 5
        },
        {
            "ID": 108938,
            "ConnectionTypeID": 28,
            "StatusTypeID": 50,
            "LevelID": 2,
            "Amps": 16,
            "Voltage": 230,
            "PowerKW": 4,
            "CurrentTypeID": 10,
            "Quantity": 3
        }
    ],
    "NumberOfPoints": 5,
    "GeneralComments": "Wien Energie Tanke-Karte; WienMobil-Karte; EVN Tanke-Karte; BMW i-ChargeNow-Karte; intercharge-App",
    "StatusTypeID": 50,
    "DateLastStatusUpdate": "2018-05-31T14:37:00Z",
    "DataQualityLevel": 1,
    "DateCreated": "2016-12-16T19:23:00Z",
    "SubmissionStatusTypeID": 200
}