{
    "IsRecentlyVerified": false,
    "ID": 157720,
    "UUID": "E8C3F756-961D-462B-A4F0-EE9C6713E5A9",
    "DataProviderID": 1,
    "OperatorID": 21,
    "UsageTypeID": 4,
    "UsageCost": "Mobi.E compatible card",
    "AddressInfo": {
        "ID": 158074,
        "Title": "LOU-00001",
        "AddressLine1": "Av. Amílcar Neto",
        "Town": "Lousada",
        "StateOrProvince": "Porto",
        "Postcode": "4620-687",
        "CountryID": 180,
        "Latitude": 41.276806,
        "Longitude": -8.277751,
        "RelatedURL": "https://www.mobie.pt",
        "DistanceUnit": 0
    },
    "Connections": [
        {
            "ID": 227234,
            "ConnectionTypeID": 25,
            "StatusTypeID": 50,
            "LevelID": 2,
            "Amps": 32,
            "Voltage": 400,
            "PowerKW": 22,
            "CurrentTypeID": 20,
            "Quantity": 2
        }
    ],
    "NumberOfPoints": 2,
    "StatusTypeID": 50,
    "DateLastStatusUpdate": "2020-10-02T09:45:00Z",
    "DataQualityLevel": 3,
    "DateCreated": "2020-06-25T05:42:00Z",
    "SubmissionStatusTypeID": 100
}