{
    "IsRecentlyVerified": false,
    "ID": 79956,
    "UUID": "8FD248BF-3CD5-4D70-9D2D-EF4B19BF2B74",
    "DataProviderID": 1,
    "OperatorID": 23,
    "OperatorsReference": "9053",
    "UsageTypeID": 4,
    "UsageCost": "HKD 2.90/kWh; /other tariffs for older cars",
    "AddressInfo": {
        "ID": 80302,
        "Title": "Panda Place Supercharger",
        "AddressLine1": "3 Tsuen Wah Street (kwan Mun Hau Street Entrance)",
        "Town": "Tsuen Wan",
        "StateOrProvince": "Hong Kong",
        "CountryID": 4,
        "Latitude": 22.368929,
        "Longitude": 114.120542,
        "DistanceUnit": 0
    },
    "Connections": [
        {
            "ID": 114605,
            "ConnectionTypeID": 27,
            "StatusTypeID": 50,
            "LevelID": 3,
            "PowerKW": 120,
            "CurrentTypeID": 30,
            "Quantity": 2
        }
    ],
    "NumberOfPoints": 2,
    "GeneralComments": "2 Superchargers on 4/f, 2 Superchargers on 7/f, available 24/7",
    "StatusTypeID": 50,
    "DateLastStatusUpdate": "2019-03-23T07:51:00Z",
    "DataQualityLevel": 1,
    "DateCreated": "2017-01-30T18:03:00Z",
    "SubmissionStatusTypeID": 200
}