{
    "IsRecentlyVerified": false,
    "ID": 84836,
    "UUID": "F128A062-61A2-49ED-B7DD-639B13E1296B",
    "DataProviderID": 1,
    "OperatorID": 1,
    "UsageTypeID": 4,
    "AddressInfo": {
        "ID": 85182,
        "Title": "Parkhaus Im Werkes",
        "AddressLine1": "Im Werkes",
        "Town": "Diez",
        "StateOrProvince": "Rhein-Lahn-Kreis",
        "Postcode": "65582",
        "CountryID": 87,
        "Latitude": 50.37123077725454,
        "Longitude": 8.009367511079759,
        "AccessComments": "Säule direkt hinter der Einfahrt im Parkhaus rechts. 24/7 nutzbar mit Ladekarte der EVL Limburg. ",
        "DistanceUnit": 0
    },
    "Connections": [
        {
            "ID": 120523,
            "ConnectionTypeID": 25,
            "StatusTypeID": 50,
            "LevelID": 2,
            "Amps": 16,
            "Voltage": 400,
            "PowerKW": 11,
            "CurrentTypeID": 20,
            "Quantity": 2
        }
    ],
    "NumberOfPoints": 2,
    "GeneralComments": "Betreiber sind die Stadtwerke Limburg. Kosten für die Karte einmalig 15€",
    "StatusTypeID": 50,
    "DateLastStatusUpdate": "2017-03-17T12:37:00Z",
    "DataQualityLevel": 1,
    "DateCreated": "2017-03-17T12:37:00Z",
    "SubmissionStatusTypeID": 200
}