{
    "IsRecentlyVerified": false,
    "ID": 111524,
    "UUID": "BFB3D6A6-9041-46BF-B601-4C5A3C90AAA1",
    "DataProviderID": 2,
    "DataProvidersReference": "82976",
    "UsageTypeID": 1,
    "AddressInfo": {
        "ID": 111870,
        "Title": "Hotel Montfort Nicolet",
        "AddressLine1": "1141 rue Saint-Jean-Baptiste",
        "Town": "Nicolet",
        "StateOrProvince": "QC",
        "Postcode": "J3T 1W4",
        "CountryID": 44,
        "Latitude": 46.234117,
        "Longitude": -72.633154,
        "ContactTelephone1": "819-293-6262",
        "AccessComments": "24 hours daily; for guest use only",
        "RelatedURL": "",
        "DistanceUnit": 0
    },
    "Connections": [
        {
            "ID": 156975,
            "ConnectionTypeID": 1,
            "LevelID": 2,
            "Amps": 16,
            "Voltage": 230,
            "PowerKW": 3.7,
            "CurrentTypeID": 10,
            "Quantity": 1
        }
    ],
    "DateLastStatusUpdate": "2020-06-26T03:10:00Z",
    "DataQualityLevel": 3,
    "DateCreated": "2018-10-18T23:37:00Z",
    "SubmissionStatusTypeID": 100
}