{
    "IsRecentlyVerified": false,
    "ID": 93316,
    "UUID": "ECADA95F-D352-4AB2-80C6-196DC493E9DE",
    "DataProviderID": 1,
    "OperatorID": 45,
    "UsageTypeID": 6,
    "AddressInfo": {
        "ID": 93662,
        "Title": "Autohaus Bolzmacher ",
        "AddressLine1": "Erich-Hoepner-Ring ",
        "AddressLine2": "Gemarkung Ronsdorf",
        "Town": "Wuppertal",
        "StateOrProvince": "Wuppertal",
        "Postcode": "42369",
        "CountryID": 87,
        "Latitude": 47.93681,
        "Longitude": 11.348979999999983,
        "ContactTelephone1": "+49 8151 50597",
        "AccessComments": "Wallbox an der Werkstatt, Zugang bitte erfragen.",
        "RelatedURL": "http://www.bolzmacher.de/",
        "DistanceUnit": 0
    },
    "Connections": [
        {
            "ID": 132179,
            "ConnectionTypeID": 25,
            "StatusTypeID": 50,
            "LevelID": 2,
            "Amps": 16,
            "Voltage": 400,
            "PowerKW": 11,
            "CurrentTypeID": 20,
            "Quantity": 1
        }
    ],
    "NumberOfPoints": 1,
    "StatusTypeID": 50,
    "DateLastStatusUpdate": "2017-09-26T13:36:00Z",
    "DataQualityLevel": 1,
    "DateCreated": "2017-09-26T13:36:00Z",
    "SubmissionStatusTypeID": 200
}