{
    "IsRecentlyVerified": false,
    "ID": 80175,
    "UUID": "C02257FB-1703-4065-AA96-6E6E1964454E",
    "DataProviderID": 2,
    "DataProvidersReference": "80767",
    "UsageTypeID": 2,
    "AddressInfo": {
        "ID": 80521,
        "Title": "City of Gainesville - Main Street Parking Lot",
        "AddressLine1": "355 Main St SW",
        "Town": "Gainesville",
        "StateOrProvince": "GA",
        "Postcode": "30501",
        "CountryID": 2,
        "Latitude": 34.297497,
        "Longitude": -83.826184,
        "ContactTelephone1": "770-535-6882",
        "AccessComments": "24 hours daily",
        "RelatedURL": "",
        "DistanceUnit": 0
    },
    "Connections": [
        {
            "ID": 114841,
            "ConnectionTypeID": 1,
            "LevelID": 2,
            "Amps": 16,
            "Voltage": 230,
            "PowerKW": 3,
            "CurrentTypeID": 10,
            "Quantity": 2
        }
    ],
    "DateLastStatusUpdate": "2019-04-06T04:02:00Z",
    "DataQualityLevel": 3,
    "DateCreated": "2017-01-31T01:05:00Z",
    "SubmissionStatusTypeID": 100
}