{
    "IsRecentlyVerified": false,
    "ID": 185172,
    "UUID": "64035D94-6305-434D-939A-516CEF816584",
    "DataProviderID": 29,
    "DataProvidersReference": "1235",
    "AddressInfo": {
        "ID": 185531,
        "Title": "Schloßstraße 21",
        "AddressLine1": "Schloßstraße 21",
        "Town": "Herten",
        "Postcode": "45701",
        "CountryID": 87,
        "Latitude": 51.599695,
        "Longitude": 7.090758,
        "DistanceUnit": 0
    },
    "Connections": [
        {
            "ID": 294302,
            "ConnectionTypeID": 25,
            "StatusTypeID": 50,
            "LevelID": 2,
            "PowerKW": 22,
            "CurrentTypeID": 20
        },
        {
            "ID": 294303,
            "ConnectionTypeID": 25,
            "StatusTypeID": 50,
            "LevelID": 2,
            "PowerKW": 22,
            "CurrentTypeID": 20
        }
    ],
    "StatusTypeID": 50,
    "DateLastStatusUpdate": "2021-07-12T02:48:00Z",
    "MetadataValues": [
        {
            "ID": 17463,
            "MetadataFieldID": 4,
            "ItemValue": "Data from the German chargepoint registry provided by Bundesnetzagentur.de under the CC-BY 4.0 license"
        }
    ],
    "DataQualityLevel": 3,
    "DateCreated": "2021-07-08T10:06:00Z",
    "SubmissionStatusTypeID": 100
}