{
    "IsRecentlyVerified": false,
    "ID": 12937,
    "UUID": "4E25E4D3-F435-4443-8E5F-F80E885C60F2",
    "DataProviderID": 15,
    "DataProvidersReference": "16830",
    "OperatorID": 5,
    "UsageTypeID": 1,
    "AddressInfo": {
        "ID": 12834,
        "Title": "1428 South Boulevard",
        "AddressLine1": "1428 South Boulevard",
        "Town": "Charlotte",
        "StateOrProvince": "NC",
        "Postcode": "28203",
        "CountryID": 2,
        "Latitude": 35.215238,
        "Longitude": -80.853695,
        "ContactTelephone1": "(704) 336-7433",
        "RelatedURL": "http://carstations.com/16830",
        "DistanceUnit": 0
    },
    "Connections": [
        {
            "ID": 10370,
            "ConnectionTypeID": 1,
            "Reference": "J1772",
            "LevelID": 2
        }
    ],
    "NumberOfPoints": 2,
    "StatusTypeID": 50,
    "DateLastStatusUpdate": "2017-11-04T14:04:00Z",
    "DataQualityLevel": 2,
    "DateCreated": "2012-09-07T19:25:00Z",
    "SubmissionStatusTypeID": 100
}