{
    "IsRecentlyVerified": false,
    "ID": 35543,
    "UUID": "14554921-F7DA-4E2B-AEB5-B5DDA3A44CF7",
    "DataProviderID": 26,
    "DataProvidersReference": "50659",
    "OperatorID": 180,
    "OperatorsReference": "Alfen GDH0141",
    "UsageCost": "0.00 jaarabonnement",
    "AddressInfo": {
        "ID": 35889,
        "Title": "Allard Piersonlaan 139C",
        "AddressLine1": "Allard Piersonlaan 139C",
        "Town": "Den Haag",
        "Postcode": "2522 MJ",
        "CountryID": 159,
        "Latitude": 52.059396,
        "Longitude": 4.324893,
        "ContactTelephone1": "036 - 549 34 00",
        "RelatedURL": "http://www.icu-charging-stations.com/",
        "DistanceUnit": 0
    },
    "Connections": [
        {
            "ID": 39054,
            "ConnectionTypeID": 25,
            "LevelID": 2,
            "PowerKW": 11,
            "CurrentTypeID": 10
        },
        {
            "ID": 47925,
            "ConnectionTypeID": 25,
            "LevelID": 2,
            "PowerKW": 11,
            "CurrentTypeID": 10
        }
    ],
    "NumberOfPoints": 1,
    "StatusTypeID": 50,
    "DateLastStatusUpdate": "2016-06-04T02:45:00Z",
    "DataQualityLevel": 3,
    "DateCreated": "2015-01-09T06:05:00Z",
    "SubmissionStatusTypeID": 100
}