{
    "IsRecentlyVerified": false,
    "ID": 115941,
    "UUID": "3AA8A256-9EC1-42C5-B8E1-214310A7A62D",
    "DataProviderID": 2,
    "DataProvidersReference": "105196",
    "UsageTypeID": 7,
    "AddressInfo": {
        "ID": 116287,
        "Title": "Carter Chevrolet",
        "AddressLine1": "175 Hartford Turnpike",
        "Town": "Vernon",
        "StateOrProvince": "CT",
        "Postcode": "06040",
        "CountryID": 2,
        "Latitude": 41.8218766595564,
        "Longitude": -72.5009065449829,
        "ContactTelephone1": "860-646-6464",
        "AccessComments": "Dealership business hours\r\nPublic - Call ahead",
        "RelatedURL": "",
        "DistanceUnit": 0
    },
    "Connections": [
        {
            "ID": 162990,
            "ConnectionTypeID": 1,
            "LevelID": 2,
            "Amps": 16,
            "Voltage": 230,
            "PowerKW": 3.7,
            "CurrentTypeID": 10,
            "Quantity": 2
        },
        {
            "ID": 162991,
            "ConnectionTypeID": 32,
            "LevelID": 3,
            "Amps": 100,
            "Voltage": 400,
            "PowerKW": 40,
            "CurrentTypeID": 30,
            "Quantity": 1
        }
    ],
    "DateLastStatusUpdate": "2020-06-26T03:05:00Z",
    "DataQualityLevel": 3,
    "DateCreated": "2019-02-11T07:13:00Z",
    "SubmissionStatusTypeID": 100
}