{
    "IsRecentlyVerified": false,
    "ID": 44845,
    "UUID": "E85DEB84-672F-4D2C-A1D4-C359D57519F3",
    "DataProviderID": 1,
    "DataProvidersReference": "2712",
    "AddressInfo": {
        "ID": 45191,
        "Title": "Sjøgata, Ulsteinvik",
        "AddressLine1": "Sjøgata 10",
        "Town": "ULSTEINVIK",
        "StateOrProvince": "Møre og Romsdal",
        "Postcode": "6065",
        "CountryID": 168,
        "Latitude": 62.34067,
        "Longitude": 5.85019,
        "AccessComments": "Ved Sjøborg Kulturhus / Quality Hotel Ulstein",
        "DistanceUnit": 0
    },
    "Connections": [
        {
            "ID": 55140,
            "ConnectionTypeID": 0,
            "Reference": "1",
            "LevelID": 2,
            "Amps": 16,
            "Voltage": 230,
            "PowerKW": 3.7,
            "Comments": "Mode 3"
        },
        {
            "ID": 87228,
            "ConnectionTypeID": 0,
            "Reference": "2",
            "LevelID": 2,
            "Amps": 16,
            "Voltage": 230,
            "PowerKW": 3.7,
            "Comments": "Mode 3"
        },
        {
            "ID": 87229,
            "ConnectionTypeID": 0,
            "Reference": "3",
            "LevelID": 2,
            "Amps": 16,
            "Voltage": 230,
            "PowerKW": 3.7,
            "Comments": "Mode 3"
        },
        {
            "ID": 89276,
            "ConnectionTypeID": 0,
            "Reference": "4",
            "LevelID": 2,
            "Amps": 16,
            "Voltage": 230,
            "PowerKW": 3.7,
            "Comments": "Mode 3"
        }
    ],
    "NumberOfPoints": 4,
    "DateLastStatusUpdate": "2020-05-26T08:25:00Z",
    "DataQualityLevel": 2,
    "DateCreated": "2015-04-19T05:51:00Z",
    "SubmissionStatusTypeID": 100
}