{
    "IsRecentlyVerified": false,
    "ID": 90653,
    "UUID": "D02F4577-DED6-4A76-B33D-EF80804B2594",
    "DataProviderID": 1,
    "OperatorID": 46,
    "UsageTypeID": 4,
    "AddressInfo": {
        "ID": 90999,
        "Title": "Schwimmbad Aquaföhr",
        "AddressLine1": "Stockmannsweg 1",
        "Town": "Wyk auf Föhr",
        "StateOrProvince": "Föhr-Amrum",
        "Postcode": "25938",
        "CountryID": 87,
        "Latitude": 54.68315311698933,
        "Longitude": 8.566773815344284,
        "AccessComments": "Wallbox am Pfahl; Freischaltung vermutlich mit E.ON Ladekarte (oder Roamingpartner). Leistung nicht bekannt",
        "DistanceUnit": 0
    },
    "Connections": [
        {
            "ID": 128364,
            "ConnectionTypeID": 25,
            "StatusTypeID": 50,
            "LevelID": 2,
            "Amps": 16,
            "Voltage": 230,
            "PowerKW": 3.7,
            "CurrentTypeID": 10,
            "Quantity": 1
        }
    ],
    "NumberOfPoints": 1,
    "StatusTypeID": 50,
    "DateLastStatusUpdate": "2017-07-21T11:35:00Z",
    "DataQualityLevel": 1,
    "DateCreated": "2017-07-21T11:35:00Z",
    "SubmissionStatusTypeID": 200
}