{
    "IsRecentlyVerified": false,
    "ID": 48020,
    "UUID": "C98D7CAE-7D4B-4CBC-9B77-3599C5835AAD",
    "DataProviderID": 1,
    "OperatorID": 45,
    "UsageTypeID": 1,
    "UsageCost": "0",
    "AddressInfo": {
        "ID": 48366,
        "Title": "Supermarkt Aldi (+E-Bike Ladestation)",
        "AddressLine1": "Düsseldorfer Straße 3",
        "Town": "Waiblingen",
        "Postcode": "71332",
        "CountryID": 87,
        "Latitude": 48.81966,
        "Longitude": 9.29819999999995,
        "AccessComments": "Kostenloses Laden und Parken (max. 1 Stunde) während der Öffnungszeiten Mo-Sa 8-21Uhr. Es kann nur an einem der Anschlüsse geladen werden. Zusätzlich sind (für Fahrräder) 3 Schukodosen vorhanden.",
        "RelatedURL": "http://www.aldi-sued.de/de/aldi-sued-a-bis-z/aldi-sued-a-bis-z/e/elektrotankstellen",
        "DistanceUnit": 0
    },
    "Connections": [
        {
            "ID": 59274,
            "ConnectionTypeID": 2,
            "LevelID": 3,
            "PowerKW": 20,
            "CurrentTypeID": 30,
            "Quantity": 1
        },
        {
            "ID": 59275,
            "ConnectionTypeID": 33,
            "LevelID": 3,
            "PowerKW": 20,
            "CurrentTypeID": 30,
            "Quantity": 1
        },
        {
            "ID": 59276,
            "ConnectionTypeID": 25,
            "StatusTypeID": 50,
            "LevelID": 2,
            "Amps": 32,
            "Voltage": 400,
            "PowerKW": 22,
            "CurrentTypeID": 20,
            "Quantity": 1
        },
        {
            "ID": 59277,
            "ConnectionTypeID": 28,
            "StatusTypeID": 50,
            "LevelID": 2,
            "Amps": 16,
            "Voltage": 230,
            "PowerKW": 3.7,
            "CurrentTypeID": 10,
            "Quantity": 3
        }
    ],
    "NumberOfPoints": 4,
    "StatusTypeID": 50,
    "DateLastStatusUpdate": "2015-06-23T08:50:00Z",
    "DataQualityLevel": 1,
    "DateCreated": "2015-06-23T06:45:00Z",
    "SubmissionStatusTypeID": 200
}