{
    "IsRecentlyVerified": false,
    "ID": 116202,
    "UUID": "0E6122B9-BA4F-439F-A35D-9CB43AEDADE1",
    "DataProviderID": 2,
    "DataProvidersReference": "116316",
    "OperatorID": 23,
    "UsageTypeID": 2,
    "AddressInfo": {
        "ID": 116548,
        "Title": "Airbnb - Kelowna - Tesla Destination",
        "AddressLine1": "1852 Lequime St",
        "Town": "Kelowna",
        "StateOrProvince": "BC",
        "Postcode": "V1Y 3C4",
        "CountryID": 44,
        "Latitude": 49.880627,
        "Longitude": -119.478822,
        "ContactTelephone1": "",
        "AccessComments": "For Tesla use only; reservation required ",
        "RelatedURL": "https://www.tesla.com/destination-charging",
        "DistanceUnit": 0
    },
    "Connections": [
        {
            "ID": 163279,
            "ConnectionTypeID": 0,
            "LevelID": 2,
            "Amps": 16,
            "Voltage": 230,
            "PowerKW": 3,
            "CurrentTypeID": 10,
            "Quantity": 1
        }
    ],
    "DateLastStatusUpdate": "2019-04-06T05:07:00Z",
    "DataQualityLevel": 3,
    "DateCreated": "2019-02-11T07:13:00Z",
    "SubmissionStatusTypeID": 100
}