{
    "IsRecentlyVerified": false,
    "ID": 114751,
    "UUID": "F17016DD-C1EC-42D5-B4EF-46B5153ED386",
    "DataProviderID": 1,
    "OperatorID": 103,
    "OperatorsReference": "BEALLEGO000752",
    "UsageTypeID": 1,
    "AddressInfo": {
        "ID": 115097,
        "Title": "Battmobiel Krommewal",
        "AddressLine1": "Krommewal 92",
        "Town": "GENT",
        "StateOrProvince": "Oost-Vlaanderen",
        "Postcode": "9000",
        "CountryID": 26,
        "Latitude": 51.059193,
        "Longitude": 3.72695479999993,
        "AccessComments": "Eén van de laadpunten is voorbehouden voor klanten van Battmobiel.",
        "DistanceUnit": 0
    },
    "Connections": [
        {
            "ID": 161490,
            "ConnectionTypeID": 25,
            "StatusTypeID": 50,
            "LevelID": 2,
            "Amps": 16,
            "Voltage": 400,
            "PowerKW": 11,
            "CurrentTypeID": 20,
            "Quantity": 2
        }
    ],
    "NumberOfPoints": 2,
    "StatusTypeID": 50,
    "DateLastStatusUpdate": "2019-01-15T13:39:00Z",
    "DataQualityLevel": 1,
    "DateCreated": "2019-01-14T15:57:00Z",
    "SubmissionStatusTypeID": 200
}