{
    "IsRecentlyVerified": false,
    "ID": 62791,
    "UUID": "7C51821D-15EE-4F88-9E84-869CC5CAC933",
    "DataProviderID": 26,
    "DataProvidersReference": "78099",
    "OperatorID": 157,
    "OperatorsReference": "NewMotion 03002610",
    "UsageCost": "0.00 jaarabonnement",
    "AddressInfo": {
        "ID": 63137,
        "Title": "Am Graben 12",
        "AddressLine1": "Am Graben 12",
        "Town": "Flörsheim",
        "Postcode": "65439",
        "CountryID": 87,
        "Latitude": 50.0291931,
        "Longitude": 8.40409909999994,
        "ContactTelephone1": "088 0109500",
        "RelatedURL": "http://thenewmotion.nl/",
        "DistanceUnit": 0
    },
    "Connections": [
        {
            "ID": 79739,
            "ConnectionTypeID": 25,
            "LevelID": 2,
            "PowerKW": 22,
            "CurrentTypeID": 10
        }
    ],
    "NumberOfPoints": 1,
    "StatusTypeID": 50,
    "DateLastStatusUpdate": "2016-06-04T02:38:00Z",
    "DataQualityLevel": 3,
    "DateCreated": "2016-03-03T12:29:00Z",
    "SubmissionStatusTypeID": 100
}