{
    "IsRecentlyVerified": false,
    "ID": 137112,
    "UUID": "4A65E16B-2E70-4E77-AC5B-3B6B88F4ED70",
    "DataProviderID": 1,
    "DataProvidersReference": "LSB-00004",
    "OperatorID": 21,
    "UsageTypeID": 4,
    "UsageCost": "Mobi.E compatible card",
    "AddressInfo": {
        "ID": 137458,
        "Title": "LSB-00004",
        "AddressLine1": "Rua Gregório Lopes",
        "Town": "Lisboa",
        "Postcode": "1400-195",
        "CountryID": 180,
        "Latitude": 38.711153,
        "Longitude": -9.213672,
        "RelatedURL": "http://www.mobie.pt",
        "DistanceUnit": 0
    },
    "Connections": [
        {
            "ID": 191969,
            "ConnectionTypeID": 25,
            "StatusTypeID": 50,
            "LevelID": 2,
            "Amps": 32,
            "Voltage": 400,
            "PowerKW": 22,
            "CurrentTypeID": 20,
            "Quantity": 2
        }
    ],
    "NumberOfPoints": 2,
    "StatusTypeID": 50,
    "DateLastStatusUpdate": "2020-08-14T18:30:00Z",
    "DataQualityLevel": 3,
    "DateCreated": "2019-12-24T08:08:00Z",
    "SubmissionStatusTypeID": 100
}