{
    "IsRecentlyVerified": false,
    "ID": 21268,
    "UUID": "224C43DC-80CD-488C-8E95-A3F8BFB05D03",
    "DataProviderID": 1,
    "OperatorID": 82,
    "UsageTypeID": 4,
    "UsageCost": "15€ for 3months",
    "AddressInfo": {
        "ID": 21613,
        "Title": "A2A Torricella",
        "AddressLine1": "Via Torricella 2D1 (angolo Via Chiusure)",
        "AddressLine2": "Circoscrizione Brescia Ovest",
        "Town": "Brescia",
        "StateOrProvince": "Brescia",
        "Postcode": "25127",
        "CountryID": 112,
        "Latitude": 45.557242788319485,
        "Longitude": 10.1952649566523,
        "ContactTelephone1": "800035151",
        "RelatedURL": "http://www.e-moving.it/",
        "DistanceUnit": 0
    },
    "Connections": [
        {
            "ID": 23122,
            "ConnectionTypeID": 25,
            "StatusTypeID": 50,
            "LevelID": 2,
            "PowerKW": 3,
            "CurrentTypeID": 10,
            "Quantity": 2
        }
    ],
    "NumberOfPoints": 2,
    "StatusTypeID": 50,
    "DateLastStatusUpdate": "2014-03-17T18:53:00Z",
    "DataQualityLevel": 1,
    "DateCreated": "2014-03-17T18:53:00Z",
    "SubmissionStatusTypeID": 200
}