{
    "IsRecentlyVerified": false,
    "ID": 32741,
    "UUID": "30A01B66-F22F-4587-ACBA-C3E5A7027E6E",
    "DataProviderID": 26,
    "DataProvidersReference": "48634",
    "OperatorID": 178,
    "OperatorsReference": "EVnetNL REE509",
    "UsageCost": "0.00 jaarabonnement",
    "AddressInfo": {
        "ID": 33087,
        "Title": "Zwembadweg",
        "AddressLine1": "Zwembadweg",
        "Town": "Geldrop-Mierlo",
        "Postcode": "5661",
        "CountryID": 159,
        "Latitude": 51.408822,
        "Longitude": 5.55151,
        "ContactTelephone1": "0800-3522365",
        "RelatedURL": "http://www.evnet.nl",
        "DistanceUnit": 0
    },
    "Connections": [
        {
            "ID": 36252,
            "ConnectionTypeID": 25,
            "LevelID": 1,
            "PowerKW": 2.3,
            "CurrentTypeID": 10
        }
    ],
    "NumberOfPoints": 1,
    "StatusTypeID": 50,
    "DateLastStatusUpdate": "2016-06-04T02:38:00Z",
    "DataQualityLevel": 3,
    "DateCreated": "2015-01-09T06:03:00Z",
    "SubmissionStatusTypeID": 100
}