{
    "IsRecentlyVerified": false,
    "ID": 100919,
    "UUID": "1EA57245-2D65-4085-B39C-A0C9E32A5034",
    "DataProviderID": 1,
    "OperatorID": 105,
    "UsageTypeID": 4,
    "AddressInfo": {
        "ID": 101265,
        "Title": "An der Kirche",
        "AddressLine1": "An der Kirche 3",
        "Town": "Trierweiler",
        "StateOrProvince": "Trier-Land",
        "Postcode": "54311",
        "CountryID": 87,
        "Latitude": 49.76269235454843,
        "Longitude": 6.5600237840267255,
        "AccessComments": "An der Position gibt es einen neuen Parkplatz, der in der Karte noch nicht verzeichnet ist. Die 24/7 nutzbare Säule selbst ist darauf sehr einfach zu finden.",
        "DistanceUnit": 0
    },
    "Connections": [
        {
            "ID": 142508,
            "ConnectionTypeID": 25,
            "StatusTypeID": 50,
            "LevelID": 2,
            "Amps": 16,
            "Voltage": 400,
            "PowerKW": 11,
            "CurrentTypeID": 20,
            "Quantity": 2
        }
    ],
    "NumberOfPoints": 2,
    "StatusTypeID": 50,
    "DateLastStatusUpdate": "2018-03-12T09:32:00Z",
    "DataQualityLevel": 1,
    "DateCreated": "2018-03-12T09:32:00Z",
    "SubmissionStatusTypeID": 200
}