{
    "IsRecentlyVerified": false,
    "ID": 180468,
    "UUID": "29A661AB-EC49-4FB8-A87B-728A40E30B52",
    "DataProviderID": 29,
    "DataProvidersReference": "20889",
    "OperatorID": 69,
    "AddressInfo": {
        "ID": 180827,
        "Title": "Löherstr. 21",
        "AddressLine1": "Löherstr. 21",
        "Town": "Aschaffenburg",
        "Postcode": "63739",
        "CountryID": 87,
        "Latitude": 49.9687366,
        "Longitude": 8.1382333,
        "DistanceUnit": 0
    },
    "Connections": [
        {
            "ID": 283578,
            "ConnectionTypeID": 25,
            "StatusTypeID": 50,
            "LevelID": 2,
            "PowerKW": 11,
            "CurrentTypeID": 20
        },
        {
            "ID": 283579,
            "ConnectionTypeID": 25,
            "StatusTypeID": 50,
            "LevelID": 2,
            "PowerKW": 11,
            "CurrentTypeID": 20
        }
    ],
    "StatusTypeID": 50,
    "DateLastStatusUpdate": "2021-07-09T03:18:00Z",
    "MetadataValues": [
        {
            "ID": 12762,
            "MetadataFieldID": 4,
            "ItemValue": "Data from the German chargepoint registry provided by Bundesnetzagentur.de under the CC-BY 4.0 license"
        }
    ],
    "DataQualityLevel": 3,
    "DateCreated": "2021-07-08T10:00:00Z",
    "SubmissionStatusTypeID": 100
}