{
    "IsRecentlyVerified": false,
    "ID": 81793,
    "UUID": "B0D0B10E-2EAC-4AF0-952C-FEB40EEBAC62",
    "DataProviderID": 1,
    "OperatorID": 23,
    "OperatorsReference": "22182",
    "UsageTypeID": 4,
    "AddressInfo": {
        "ID": 82139,
        "Title": "Delta Hotels By Marriott Waterloo",
        "AddressLine1": "110 Erb St W",
        "Town": "Waterloo",
        "StateOrProvince": "Ontario",
        "Postcode": "N2L 0C6",
        "CountryID": 44,
        "Latitude": 43.463396,
        "Longitude": -80.528903,
        "ContactTelephone1": "(519) 514-0404",
        "DistanceUnit": 0
    },
    "Connections": [
        {
            "ID": 116551,
            "ConnectionTypeID": 30,
            "StatusTypeID": 50,
            "LevelID": 2,
            "PowerKW": 13,
            "CurrentTypeID": 20,
            "Quantity": 2
        }
    ],
    "NumberOfPoints": 2,
    "GeneralComments": "2 Tesla Connectors, up to 13kW.Available to the public. Please see front desk.",
    "StatusTypeID": 50,
    "DateLastStatusUpdate": "2017-02-03T12:19:00Z",
    "DataQualityLevel": 1,
    "DateCreated": "2017-02-03T12:19:00Z",
    "SubmissionStatusTypeID": 200
}