{
    "IsRecentlyVerified": false,
    "ID": 183440,
    "UUID": "619588CC-5821-49C5-BC46-6C91D0F68EEE",
    "DataProviderID": 29,
    "DataProvidersReference": "7325",
    "OperatorID": 224,
    "AddressInfo": {
        "ID": 183799,
        "Title": "Charles-Eames-Straße2",
        "AddressLine1": "Charles-Eames-Straße2",
        "Town": "Weil am Rhein",
        "Postcode": "79576",
        "CountryID": 87,
        "Latitude": 47.60254,
        "Longitude": 7.61675,
        "DistanceUnit": 0
    },
    "Connections": [
        {
            "ID": 290431,
            "ConnectionTypeID": 28,
            "StatusTypeID": 50,
            "LevelID": 2,
            "PowerKW": 22,
            "CurrentTypeID": 20
        },
        {
            "ID": 290432,
            "ConnectionTypeID": 25,
            "StatusTypeID": 50,
            "LevelID": 2,
            "PowerKW": 22,
            "CurrentTypeID": 20
        },
        {
            "ID": 295250,
            "ConnectionTypeID": 25,
            "StatusTypeID": 50,
            "LevelID": 2,
            "PowerKW": 22,
            "CurrentTypeID": 20
        }
    ],
    "StatusTypeID": 50,
    "DateLastStatusUpdate": "2021-07-12T02:39:00Z",
    "MetadataValues": [
        {
            "ID": 15733,
            "MetadataFieldID": 4,
            "ItemValue": "Data from the German chargepoint registry provided by Bundesnetzagentur.de under the CC-BY 4.0 license"
        }
    ],
    "DataQualityLevel": 3,
    "DateCreated": "2021-07-08T10:04:00Z",
    "SubmissionStatusTypeID": 100
}