{
    "IsRecentlyVerified": false,
    "ID": 179720,
    "UUID": "63742C8E-5CCF-4795-AFBB-726B5CB08804",
    "DataProviderID": 29,
    "DataProvidersReference": "9949",
    "AddressInfo": {
        "ID": 180079,
        "Title": "Kaiserslauterer Str 6",
        "AddressLine1": "Kaiserslauterer Str 6",
        "Town": "Stuttgart",
        "Postcode": "70499",
        "CountryID": 87,
        "Latitude": 48.812845,
        "Longitude": 9.119118,
        "DistanceUnit": 0
    },
    "Connections": [
        {
            "ID": 281896,
            "ConnectionTypeID": 25,
            "StatusTypeID": 50,
            "LevelID": 2,
            "PowerKW": 22,
            "CurrentTypeID": 20
        },
        {
            "ID": 281897,
            "ConnectionTypeID": 25,
            "StatusTypeID": 50,
            "LevelID": 2,
            "PowerKW": 22,
            "CurrentTypeID": 20
        }
    ],
    "StatusTypeID": 50,
    "DateLastStatusUpdate": "2021-07-12T02:42:00Z",
    "MetadataValues": [
        {
            "ID": 12014,
            "MetadataFieldID": 4,
            "ItemValue": "Data from the German chargepoint registry provided by Bundesnetzagentur.de under the CC-BY 4.0 license"
        }
    ],
    "DataQualityLevel": 3,
    "DateCreated": "2021-07-08T09:59:00Z",
    "SubmissionStatusTypeID": 100
}