{
    "IsRecentlyVerified": false,
    "ID": 152379,
    "UUID": "DAEA8A18-49F7-421F-BE1E-9C38EA71E348",
    "DataProviderID": 28,
    "DataProvidersReference": "FRS1818001",
    "UsageTypeID": 5,
    "AddressInfo": {
        "ID": 152732,
        "Title": "Plaimpied Givaudins",
        "AddressLine1": "Rue des Gobbiers - 18340 PLAIMPIED GIVAUDINS",
        "CountryID": 80,
        "Latitude": 46.9980069,
        "Longitude": 2.4522788,
        "AccessComments": "24h/24h",
        "DistanceUnit": 0
    },
    "Connections": [
        {
            "ID": 213305,
            "ConnectionTypeID": 25,
            "StatusTypeID": 50,
            "LevelID": 2,
            "PowerKW": 18,
            "CurrentTypeID": 20
        },
        {
            "ID": 246188,
            "ConnectionTypeID": 25,
            "StatusTypeID": 50,
            "LevelID": 2,
            "PowerKW": 18,
            "CurrentTypeID": 20
        }
    ],
    "GeneralComments": "Borne en service",
    "StatusTypeID": 50,
    "DateLastStatusUpdate": "2020-08-27T05:13:00Z",
    "DataQualityLevel": 2,
    "DateCreated": "2020-03-15T10:53:00Z",
    "SubmissionStatusTypeID": 100
}