{
    "IsRecentlyVerified": false,
    "ID": 128599,
    "UUID": "943F64AA-C249-4A2A-B023-5964F7ECDBAE",
    "DataProviderID": 1,
    "OperatorID": 2244,
    "UsageTypeID": 4,
    "AddressInfo": {
        "ID": 128945,
        "Title": "Asset No. 3",
        "AddressLine1": "Burnbury Road",
        "Town": "London",
        "Postcode": "SW12 0EJ",
        "CountryID": 1,
        "Latitude": 51.443341,
        "Longitude": -0.139827,
        "RelatedURL": "https://www.ubitricity.com",
        "DistanceUnit": 0
    },
    "Connections": [
        {
            "ID": 179992,
            "ConnectionTypeID": 25,
            "Reference": "suby1100000883",
            "StatusTypeID": 50,
            "LevelID": 2,
            "Amps": 16,
            "Voltage": 230,
            "PowerKW": 3.7,
            "CurrentTypeID": 10,
            "Quantity": 1
        }
    ],
    "NumberOfPoints": 1,
    "StatusTypeID": 50,
    "DateLastStatusUpdate": "2019-06-26T17:27:00Z",
    "MetadataValues": [
        {
            "ID": 4546,
            "MetadataFieldID": 4,
            "ItemValue": "Contains public sector information licensed under the Open Government Licence v2.0. http://www.nationalarchives.gov.uk/doc/open-government-licence/version/2/"
        }
    ],
    "DataQualityLevel": 3,
    "DateCreated": "2019-06-26T17:26:00Z",
    "SubmissionStatusTypeID": 100
}