{
    "IsRecentlyVerified": false,
    "ID": 60956,
    "UUID": "9AD44E3D-FE30-4C23-B314-1D77BE23588B",
    "DataProviderID": 27,
    "DataProvidersReference": "46",
    "UsageTypeID": 1,
    "AddressInfo": {
        "ID": 61302,
        "Title": "Playa Muchavista",
        "AddressLine1": "Avinguda Jaume i el Conqueridor, 65",
        "Town": "El Campello",
        "StateOrProvince": "Alicante",
        "Postcode": "03560",
        "CountryID": 210,
        "Latitude": 38.39858,
        "Longitude": -0.406603,
        "DistanceUnit": 0
    },
    "Connections": [
        {
            "ID": 77371,
            "ConnectionTypeID": 28,
            "LevelID": 2,
            "Amps": 16,
            "Voltage": 230,
            "PowerKW": 3.7
        },
        {
            "ID": 77372,
            "ConnectionTypeID": 28,
            "LevelID": 2,
            "Amps": 16,
            "Voltage": 230,
            "PowerKW": 3.7
        }
    ],
    "StatusTypeID": 100,
    "DateLastStatusUpdate": "2016-02-13T00:23:00Z",
    "DataQualityLevel": 3,
    "DateCreated": "2016-02-13T00:23:00Z",
    "SubmissionStatusTypeID": 200
}