{
    "MediaItems": [
        {
            "ID": 21136,
            "ChargePointID": 148515,
            "ItemURL": "https://s3-ap-southeast-2.amazonaws.com/openchargemap/images/GR/OCM148515/OCM-148515.orig.2020020319571697.png",
            "ItemThumbnailURL": "https://s3-ap-southeast-2.amazonaws.com/openchargemap/images/GR/OCM148515/OCM-148515.thmb.2020020319571697.png",
            "Comment": "",
            "IsEnabled": true,
            "IsVideo": false,
            "IsFeaturedItem": false,
            "IsExternalResource": false,
            "User": {
                "ID": 24879,
                "Username": "Villa Carlos"
            },
            "DateCreated": "2020-02-03T19:57:00Z"
        }
    ],
    "IsRecentlyVerified": false,
    "ID": 148515,
    "UUID": "FD4AC220-CCF0-4191-BFB2-C1B439415655",
    "DataProviderID": 1,
    "OperatorID": 45,
    "UsageTypeID": 6,
    "AddressInfo": {
        "ID": 148867,
        "Title": "Villa Carlos Hotel",
        "AddressLine1": "AMERIKIS 36",
        "AddressLine2": "Agios Basilios",
        "Town": "Patras",
        "StateOrProvince": "Achaia",
        "Postcode": "26504",
        "CountryID": 90,
        "Latitude": 38.31454104178283,
        "Longitude": 21.811394998011338,
        "ContactTelephone1": "+306972267583",
        "ContactTelephone2": "+306945587345",
        "ContactEmail": "contact@villacarlos.gr",
        "RelatedURL": "https://villacarlos.gr",
        "DistanceUnit": 0
    },
    "Connections": [
        {
            "ID": 206223,
            "ConnectionTypeID": 1036,
            "StatusTypeID": 50,
            "LevelID": 2,
            "Amps": 32,
            "Voltage": 400,
            "PowerKW": 22,
            "CurrentTypeID": 20,
            "Quantity": 1
        }
    ],
    "NumberOfPoints": 1,
    "GeneralComments": "For charging contact the Villa Carlos Hotel manager. Charger for hotel guests",
    "StatusTypeID": 50,
    "DateLastStatusUpdate": "2020-02-04T01:18:00Z",
    "DataQualityLevel": 1,
    "DateCreated": "2020-02-03T19:53:00Z",
    "SubmissionStatusTypeID": 200
}