{
    "IsRecentlyVerified": false,
    "ID": 56512,
    "UUID": "C58940A8-CD05-4DF6-BB47-449D57B3FB80",
    "DataProviderID": 2,
    "DataProvidersReference": "70871",
    "UsageTypeID": 1,
    "AddressInfo": {
        "ID": 56858,
        "Title": "Hamilton Landing Parking",
        "AddressLine1": "3 Hamilton Landing",
        "Town": "Novato",
        "StateOrProvince": "CA",
        "Postcode": "94949",
        "CountryID": 2,
        "Latitude": 38.057367,
        "Longitude": -122.514066,
        "ContactTelephone1": "415-884-9977",
        "AccessComments": "24 hours daily",
        "RelatedURL": "",
        "DistanceUnit": 0
    },
    "Connections": [
        {
            "ID": 71270,
            "ConnectionTypeID": 1,
            "LevelID": 2,
            "Amps": 16,
            "Voltage": 230,
            "PowerKW": 3,
            "CurrentTypeID": 10,
            "Quantity": 2
        }
    ],
    "DateLastStatusUpdate": "2019-04-06T04:02:00Z",
    "DataQualityLevel": 3,
    "DateCreated": "2015-11-04T08:42:00Z",
    "SubmissionStatusTypeID": 100
}