{
    "IsRecentlyVerified": false,
    "ID": 135858,
    "UUID": "CBFE6238-5A75-4483-A4B6-CBCD0D923D48",
    "DataProviderID": 18,
    "DataProvidersReference": "118f120e664e30d7394651a361a902f2",
    "OperatorID": 2244,
    "UsageTypeID": 5,
    "AddressInfo": {
        "ID": 136204,
        "Title": "Clarendon Drive",
        "AddressLine1": "Clarendon Drive",
        "Town": "London",
        "Postcode": "SW15 1AE",
        "CountryID": 1,
        "Latitude": 51.464359,
        "Longitude": -0.225102,
        "AccessComments": "",
        "RelatedURL": "https://www.ubitricity.com",
        "DistanceUnit": 0
    },
    "Connections": [
        {
            "ID": 190279,
            "ConnectionTypeID": 25,
            "Reference": "suby1100002327",
            "StatusTypeID": 50,
            "LevelID": 2,
            "Amps": 16,
            "Voltage": 230,
            "PowerKW": 3.7,
            "CurrentTypeID": 10
        }
    ],
    "StatusTypeID": 0,
    "DateLastStatusUpdate": "2021-04-25T05:46:00Z",
    "MetadataValues": [
        {
            "ID": 5710,
            "MetadataFieldID": 4,
            "ItemValue": "Contains public sector information licensed under the Open Government Licence v2.0. http://www.nationalarchives.gov.uk/doc/open-government-licence/version/2/"
        }
    ],
    "DataQualityLevel": 3,
    "DateCreated": "2019-12-24T05:22:00Z",
    "SubmissionStatusTypeID": 100
}