{
    "IsRecentlyVerified": false,
    "ID": 177037,
    "UUID": "799B35A0-CCA8-41FB-995D-1CE057140F92",
    "DataProviderID": 29,
    "DataProvidersReference": "6980",
    "OperatorID": 69,
    "AddressInfo": {
        "ID": 177396,
        "Title": "Seestr. 20",
        "AddressLine1": "Seestr. 20",
        "Town": "Wörthsee",
        "Postcode": "82237",
        "CountryID": 87,
        "Latitude": 48.06864,
        "Longitude": 11.20132,
        "DistanceUnit": 0
    },
    "Connections": [
        {
            "ID": 275706,
            "ConnectionTypeID": 25,
            "StatusTypeID": 50,
            "LevelID": 2,
            "PowerKW": 22,
            "CurrentTypeID": 20
        },
        {
            "ID": 275707,
            "ConnectionTypeID": 25,
            "StatusTypeID": 50,
            "LevelID": 2,
            "PowerKW": 22,
            "CurrentTypeID": 20
        }
    ],
    "StatusTypeID": 0,
    "DateLastStatusUpdate": "2021-07-09T03:11:00Z",
    "MetadataValues": [
        {
            "ID": 9331,
            "MetadataFieldID": 4,
            "ItemValue": "Data from the German chargepoint registry provided by Bundesnetzagentur.de under the CC-BY 4.0 license"
        }
    ],
    "DataQualityLevel": 3,
    "DateCreated": "2021-07-08T09:48:00Z",
    "SubmissionStatusTypeID": 100
}