{
    "IsRecentlyVerified": false,
    "ID": 183783,
    "UUID": "B468E2DC-32A9-4AF5-93F7-D61801CFD505",
    "DataProviderID": 29,
    "DataProvidersReference": "7864",
    "AddressInfo": {
        "ID": 184142,
        "Title": "Hans-Böge-Straße 1",
        "AddressLine1": "Hans-Böge-Straße 1",
        "Town": "Betzigau",
        "Postcode": "87488",
        "CountryID": 87,
        "Latitude": 47.737565,
        "Longitude": 10.382802,
        "DistanceUnit": 0
    },
    "Connections": [
        {
            "ID": 291200,
            "ConnectionTypeID": 25,
            "StatusTypeID": 50,
            "LevelID": 2,
            "PowerKW": 22,
            "CurrentTypeID": 20
        },
        {
            "ID": 291201,
            "ConnectionTypeID": 25,
            "StatusTypeID": 50,
            "LevelID": 2,
            "PowerKW": 22,
            "CurrentTypeID": 20
        }
    ],
    "StatusTypeID": 50,
    "DateLastStatusUpdate": "2021-07-12T02:39:00Z",
    "MetadataValues": [
        {
            "ID": 16076,
            "MetadataFieldID": 4,
            "ItemValue": "Data from the German chargepoint registry provided by Bundesnetzagentur.de under the CC-BY 4.0 license"
        }
    ],
    "DataQualityLevel": 3,
    "DateCreated": "2021-07-08T10:04:00Z",
    "SubmissionStatusTypeID": 100
}