{
    "IsRecentlyVerified": false,
    "ID": 71662,
    "UUID": "8CCCD5DC-E674-4B04-B8CF-14FEF9D15EB1",
    "DataProviderID": 1,
    "OperatorID": 202,
    "UsageTypeID": 5,
    "AddressInfo": {
        "ID": 72008,
        "Title": "Fortum hurtigladestasjon Rena Torggata 14",
        "AddressLine1": "Torggata 14",
        "Town": "RENA",
        "StateOrProvince": "Hedmark",
        "Postcode": "2450",
        "CountryID": 168,
        "Latitude": 61.13244,
        "Longitude": 11.36918,
        "DistanceUnit": 0
    },
    "Connections": [
        {
            "ID": 102601,
            "ConnectionTypeID": 2,
            "Reference": "1",
            "StatusTypeID": 50,
            "LevelID": 3,
            "Amps": 125,
            "Voltage": 400,
            "PowerKW": 50,
            "CurrentTypeID": 30,
            "Quantity": 2,
            "Comments": "Mode 4"
        },
        {
            "ID": 102602,
            "ConnectionTypeID": 33,
            "Reference": "2",
            "StatusTypeID": 50,
            "LevelID": 3,
            "Amps": 125,
            "Voltage": 400,
            "PowerKW": 50,
            "CurrentTypeID": 30,
            "Quantity": 2,
            "Comments": "Mode 4"
        },
        {
            "ID": 102603,
            "ConnectionTypeID": 25,
            "Reference": "3",
            "StatusTypeID": 50,
            "LevelID": 2,
            "Amps": 32,
            "Voltage": 400,
            "PowerKW": 12,
            "CurrentTypeID": 30,
            "Quantity": 2,
            "Comments": "Mode 4"
        }
    ],
    "NumberOfPoints": 6,
    "StatusTypeID": 50,
    "DateLastStatusUpdate": "2016-10-19T16:36:00Z",
    "DataQualityLevel": 2,
    "DateCreated": "2016-09-02T11:12:00Z",
    "SubmissionStatusTypeID": 200
}