{
    "IsRecentlyVerified": false,
    "ID": 148888,
    "UUID": "B656806C-CC81-43FB-8493-A0DC60B3CC7F",
    "DataProviderID": 1,
    "OperatorID": 80,
    "UsageTypeID": 4,
    "AddressInfo": {
        "ID": 149241,
        "Title": "Scortichino Passardi | EnelX",
        "AddressLine1": "Viale Albano Passardi",
        "Town": "Bondeno",
        "StateOrProvince": "FE",
        "Postcode": "44012 ",
        "CountryID": 112,
        "Latitude": 44.87789224761187,
        "Longitude": 11.326263486669973,
        "ContactTelephone1": "800.069.850",
        "RelatedURL": "https://www.enelx.com/it/it/emobility",
        "DistanceUnit": 0
    },
    "Connections": [
        {
            "ID": 206757,
            "ConnectionTypeID": 25,
            "StatusTypeID": 50,
            "LevelID": 2,
            "Amps": 32,
            "Voltage": 400,
            "PowerKW": 22,
            "CurrentTypeID": 20,
            "Quantity": 1
        },
        {
            "ID": 206758,
            "ConnectionTypeID": 36,
            "StatusTypeID": 50,
            "LevelID": 2,
            "Amps": 16,
            "Voltage": 240,
            "PowerKW": 3.7,
            "CurrentTypeID": 20,
            "Quantity": 1
        }
    ],
    "NumberOfPoints": 2,
    "StatusTypeID": 50,
    "DateLastStatusUpdate": "2020-02-12T16:55:00Z",
    "DataQualityLevel": 1,
    "DateCreated": "2020-02-12T16:55:00Z",
    "SubmissionStatusTypeID": 200
}