{
    "IsRecentlyVerified": false,
    "ID": 82321,
    "UUID": "558B2792-5BE5-4BC0-8CA5-BC44518743C9",
    "DataProviderID": 1,
    "OperatorID": 23,
    "OperatorsReference": "9293",
    "UsageTypeID": 6,
    "AddressInfo": {
        "ID": 82667,
        "Title": "Luxe Sunset BLVD Hotel",
        "AddressLine1": "11461 Sunset BLVD",
        "Town": "Los Angeles",
        "StateOrProvince": "CA",
        "Postcode": "90049",
        "CountryID": 2,
        "Latitude": 34.068876,
        "Longitude": -118.402376,
        "ContactTelephone1": "(310) 691-7513",
        "DistanceUnit": 0
    },
    "Connections": [
        {
            "ID": 117087,
            "ConnectionTypeID": 30,
            "StatusTypeID": 50,
            "LevelID": 2,
            "PowerKW": 16,
            "CurrentTypeID": 20,
            "Quantity": 2
        }
    ],
    "NumberOfPoints": 2,
    "GeneralComments": "2 Tesla Connectors, up to 16kW.Available for patrons only. Please see valet.",
    "StatusTypeID": 50,
    "DateLastStatusUpdate": "2017-02-03T15:34:00Z",
    "DataQualityLevel": 1,
    "DateCreated": "2017-02-03T15:34:00Z",
    "SubmissionStatusTypeID": 200
}