{
    "IsRecentlyVerified": false,
    "ID": 181448,
    "UUID": "90C357F1-3168-4FE0-A145-E597478F795D",
    "DataProviderID": 29,
    "DataProvidersReference": "370",
    "OperatorID": 45,
    "AddressInfo": {
        "ID": 181807,
        "Title": "Frankenäcker 6",
        "AddressLine1": "Frankenäcker 6",
        "Town": "Rauenberg",
        "Postcode": "69231",
        "CountryID": 87,
        "Latitude": 49.27256,
        "Longitude": 8.695698,
        "DistanceUnit": 0
    },
    "Connections": [
        {
            "ID": 285779,
            "ConnectionTypeID": 33,
            "StatusTypeID": 50,
            "LevelID": 3,
            "PowerKW": 75,
            "CurrentTypeID": 30
        },
        {
            "ID": 285780,
            "ConnectionTypeID": 33,
            "StatusTypeID": 50,
            "LevelID": 3,
            "PowerKW": 75,
            "CurrentTypeID": 30
        },
        {
            "ID": 296831,
            "ConnectionTypeID": 25,
            "StatusTypeID": 50,
            "LevelID": 2,
            "PowerKW": 22,
            "CurrentTypeID": 20
        }
    ],
    "StatusTypeID": 50,
    "DateLastStatusUpdate": "2021-07-12T02:43:00Z",
    "MetadataValues": [
        {
            "ID": 13742,
            "MetadataFieldID": 4,
            "ItemValue": "Data from the German chargepoint registry provided by Bundesnetzagentur.de under the CC-BY 4.0 license"
        }
    ],
    "DataQualityLevel": 3,
    "DateCreated": "2021-07-08T10:01:00Z",
    "SubmissionStatusTypeID": 100
}