{
    "IsRecentlyVerified": false,
    "ID": 124738,
    "UUID": "82146582-7F73-48FA-A333-B497F0757FB9",
    "DataProviderID": 2,
    "DataProvidersReference": "61996",
    "OperatorID": 5,
    "UsageTypeID": 1,
    "AddressInfo": {
        "ID": 125084,
        "Title": "ASTRAZENECA WIL",
        "AddressLine1": "1800 Concord Pike",
        "Town": "Wilmington",
        "StateOrProvince": "DE",
        "Postcode": "19803",
        "CountryID": 2,
        "Latitude": 39.7856079,
        "Longitude": -75.5503662,
        "ContactTelephone1": "888-758-4389",
        "AccessComments": "24 hours daily",
        "RelatedURL": "http://www.chargepoint.com/",
        "DistanceUnit": 0
    },
    "Connections": [
        {
            "ID": 174876,
            "ConnectionTypeID": 1,
            "LevelID": 2,
            "Amps": 16,
            "Voltage": 230,
            "PowerKW": 3,
            "CurrentTypeID": 10,
            "Quantity": 2
        }
    ],
    "DateLastStatusUpdate": "2019-12-24T09:16:00Z",
    "DataQualityLevel": 3,
    "DateCreated": "2019-04-06T05:04:00Z",
    "SubmissionStatusTypeID": 100
}