{
    "IsRecentlyVerified": false,
    "ID": 42761,
    "UUID": "7B2CE099-CEC2-40CC-B393-3B7A6CCF8A24",
    "DataProviderID": 1,
    "OperatorID": 45,
    "UsageTypeID": 1,
    "UsageCost": "0",
    "AddressInfo": {
        "ID": 43107,
        "Title": "Jung Solar",
        "AddressLine1": "Kurze Baunastraße 23",
        "Town": "Schauenburg",
        "StateOrProvince": "Landkreis Kassel",
        "Postcode": "34270",
        "CountryID": 87,
        "Latitude": 51.2753703099019,
        "Longitude": 9.37123104681972,
        "ContactTelephone1": "+49 5601 9617240",
        "AccessComments": "Kostenlose immer nutzbare Ladesäule mit 9kW voreingestellter Ladeleistung.",
        "RelatedURL": "http://www.jungsolar.de/",
        "DistanceUnit": 0
    },
    "Connections": [
        {
            "ID": 51607,
            "ConnectionTypeID": 25,
            "StatusTypeID": 50,
            "LevelID": 2,
            "Amps": 13,
            "Voltage": 400,
            "PowerKW": 9,
            "CurrentTypeID": 20,
            "Quantity": 1
        },
        {
            "ID": 51608,
            "ConnectionTypeID": 28,
            "StatusTypeID": 50,
            "LevelID": 2,
            "Amps": 16,
            "Voltage": 230,
            "PowerKW": 3.7,
            "CurrentTypeID": 10,
            "Quantity": 1
        }
    ],
    "NumberOfPoints": 2,
    "StatusTypeID": 50,
    "DateLastStatusUpdate": "2015-03-23T12:20:00Z",
    "DataQualityLevel": 1,
    "DateCreated": "2015-03-23T12:08:00Z",
    "SubmissionStatusTypeID": 200
}