{
    "IsRecentlyVerified": false,
    "ID": 186672,
    "UUID": "89D1685D-69EB-48C2-B21F-3D9E772975EA",
    "DataProviderID": 29,
    "DataProvidersReference": "16269",
    "AddressInfo": {
        "ID": 187031,
        "Title": "Hullerner Str. 45-49",
        "AddressLine1": "Hullerner Str. 45-49",
        "Town": "Haltern am See",
        "Postcode": "45721",
        "CountryID": 87,
        "Latitude": 51.7416383,
        "Longitude": 7.1985115,
        "DistanceUnit": 0
    },
    "Connections": [
        {
            "ID": 299847,
            "ConnectionTypeID": 25,
            "StatusTypeID": 50,
            "LevelID": 2,
            "PowerKW": 22,
            "CurrentTypeID": 20
        },
        {
            "ID": 299848,
            "ConnectionTypeID": 25,
            "StatusTypeID": 50,
            "LevelID": 2,
            "PowerKW": 22,
            "CurrentTypeID": 20
        }
    ],
    "StatusTypeID": 50,
    "DateLastStatusUpdate": "2021-07-12T02:48:00Z",
    "MetadataValues": [
        {
            "ID": 18913,
            "MetadataFieldID": 4,
            "ItemValue": "Data from the German chargepoint registry provided by Bundesnetzagentur.de under the CC-BY 4.0 license"
        }
    ],
    "DataQualityLevel": 3,
    "DateCreated": "2021-07-12T02:48:00Z",
    "SubmissionStatusTypeID": 100
}