{
    "IsRecentlyVerified": false,
    "ID": 137502,
    "UUID": "040B62B8-810C-4D1E-93D3-83E03E19F63D",
    "DataProviderID": 2,
    "DataProvidersReference": "60346",
    "OperatorID": 5,
    "UsageTypeID": 1,
    "AddressInfo": {
        "ID": 137848,
        "Title": "WHOLE FOODS MKT",
        "AddressLine1": "300 n broad st",
        "Town": "New Orleans",
        "StateOrProvince": "LA",
        "Postcode": "70119",
        "CountryID": 2,
        "Latitude": 29.967179,
        "Longitude": -90.084792,
        "ContactTelephone1": "888-758-4389",
        "AccessComments": "24 hours daily",
        "RelatedURL": "http://www.chargepoint.com/",
        "DistanceUnit": 0
    },
    "Connections": [
        {
            "ID": 192425,
            "ConnectionTypeID": 9,
            "LevelID": 1,
            "Amps": 16,
            "Voltage": 120,
            "PowerKW": 1,
            "CurrentTypeID": 10,
            "Quantity": 2
        },
        {
            "ID": 192426,
            "ConnectionTypeID": 1,
            "LevelID": 2,
            "Amps": 16,
            "Voltage": 230,
            "PowerKW": 3,
            "CurrentTypeID": 10,
            "Quantity": 2
        }
    ],
    "StatusTypeID": 50,
    "DateLastStatusUpdate": "2019-12-24T09:05:00Z",
    "DataQualityLevel": 3,
    "DateCreated": "2019-12-24T09:05:00Z",
    "SubmissionStatusTypeID": 100
}