{
    "IsRecentlyVerified": false,
    "ID": 85944,
    "UUID": "1E566C93-E1E3-4BC9-9858-C741F464DDBC",
    "DataProviderID": 1,
    "OperatorID": 220,
    "OperatorsReference": "0172",
    "UsageTypeID": 4,
    "UsageCost": "€1.73 + €0.3213/kWh; Andere Tarife möglich",
    "AddressInfo": {
        "ID": 86290,
        "Title": "Große Bergstraße 262",
        "AddressLine1": "Große Bergstraße 262",
        "Town": "Altona",
        "StateOrProvince": "Hamburg",
        "Postcode": "22767",
        "CountryID": 87,
        "Latitude": 53.5521,
        "Longitude": 9.93864,
        "DistanceUnit": 0
    },
    "Connections": [],
    "NumberOfPoints": 1,
    "StatusTypeID": 50,
    "DateLastStatusUpdate": "2017-04-20T22:49:00Z",
    "DataQualityLevel": 1,
    "DateCreated": "2017-04-20T14:05:00Z",
    "SubmissionStatusTypeID": 200
}