{
    "IsRecentlyVerified": false,
    "ID": 138503,
    "UUID": "5D52BBA0-17D1-41C6-A8E3-3E9E25E16DE7",
    "DataProviderID": 2,
    "DataProvidersReference": "114605",
    "OperatorID": 23,
    "UsageTypeID": 1,
    "AddressInfo": {
        "ID": 138852,
        "Title": "Island View Casino Resort South Garage (Third Floor) - Tesla Destination",
        "AddressLine1": "3305 W Beach Blvd",
        "Town": "Gulfport",
        "StateOrProvince": "MS",
        "Postcode": "39501",
        "CountryID": 2,
        "Latitude": 30.361885,
        "Longitude": -89.102741,
        "ContactTelephone1": "228-314-2100  877-798-3752",
        "AccessComments": "24 hours daily; for customer use only",
        "RelatedURL": "https://www.tesla.com/destination-charging",
        "DistanceUnit": 0
    },
    "Connections": [
        {
            "ID": 193633,
            "ConnectionTypeID": 30,
            "LevelID": 2,
            "Amps": 16,
            "Voltage": 230,
            "PowerKW": 3.7,
            "CurrentTypeID": 10,
            "Quantity": 4
        }
    ],
    "StatusTypeID": 50,
    "DateLastStatusUpdate": "2020-06-26T02:54:00Z",
    "DataQualityLevel": 3,
    "DateCreated": "2019-12-24T09:09:00Z",
    "SubmissionStatusTypeID": 100
}