{
    "IsRecentlyVerified": false,
    "ID": 180017,
    "UUID": "57D0BA1B-6D5D-4F61-9558-0BD38BDB0683",
    "DataProviderID": 29,
    "DataProvidersReference": "67",
    "AddressInfo": {
        "ID": 180376,
        "Title": "Goethestraße 40",
        "AddressLine1": "Goethestraße 40",
        "Town": "Mainz",
        "Postcode": "55118",
        "CountryID": 87,
        "Latitude": 50.011824,
        "Longitude": 8.255242,
        "DistanceUnit": 0
    },
    "Connections": [
        {
            "ID": 282602,
            "ConnectionTypeID": 25,
            "StatusTypeID": 50,
            "LevelID": 2,
            "PowerKW": 22,
            "CurrentTypeID": 20
        },
        {
            "ID": 282603,
            "ConnectionTypeID": 25,
            "StatusTypeID": 50,
            "LevelID": 2,
            "PowerKW": 22,
            "CurrentTypeID": 20
        },
        {
            "ID": 282604,
            "ConnectionTypeID": 25,
            "StatusTypeID": 50,
            "LevelID": 2,
            "PowerKW": 22,
            "CurrentTypeID": 20
        }
    ],
    "StatusTypeID": 50,
    "DateLastStatusUpdate": "2021-07-12T02:44:00Z",
    "MetadataValues": [
        {
            "ID": 12311,
            "MetadataFieldID": 4,
            "ItemValue": "Data from the German chargepoint registry provided by Bundesnetzagentur.de under the CC-BY 4.0 license"
        }
    ],
    "DataQualityLevel": 3,
    "DateCreated": "2021-07-08T10:00:00Z",
    "SubmissionStatusTypeID": 100
}