{
    "IsRecentlyVerified": false,
    "ID": 33856,
    "UUID": "E7456CA9-0E80-4E12-86C1-548791148254",
    "DataProviderID": 26,
    "DataProvidersReference": "48671",
    "OperatorID": 178,
    "OperatorsReference": "EVnetNL REE549",
    "UsageCost": "0.00 jaarabonnement",
    "AddressInfo": {
        "ID": 34202,
        "Title": "Beersteeg",
        "AddressLine1": "Beersteeg",
        "Town": "Zaltbommel",
        "Postcode": "5301 HR",
        "CountryID": 159,
        "Latitude": 51.810339,
        "Longitude": 5.241347,
        "ContactTelephone1": "0800-3522365",
        "RelatedURL": "http://www.evnet.nl",
        "DistanceUnit": 0
    },
    "Connections": [
        {
            "ID": 37367,
            "ConnectionTypeID": 25,
            "LevelID": 1,
            "PowerKW": 2.3,
            "CurrentTypeID": 10
        }
    ],
    "NumberOfPoints": 1,
    "StatusTypeID": 50,
    "DateLastStatusUpdate": "2016-06-04T02:40:00Z",
    "DataQualityLevel": 3,
    "DateCreated": "2015-01-09T06:04:00Z",
    "SubmissionStatusTypeID": 100
}