{
    "IsRecentlyVerified": false,
    "ID": 90890,
    "UUID": "69A82CF0-BFD0-4BAD-A9A7-1BCF3EF2B77E",
    "DataProviderID": 1,
    "OperatorID": 220,
    "OperatorsReference": "0141",
    "UsageTypeID": 1,
    "UsageCost": "€1.73 + €0.3213/kWh; Andere Tarife möglich",
    "AddressInfo": {
        "ID": 91236,
        "Title": "Alter Fischmarkt 11",
        "AddressLine1": "Alter Fischmarkt 11",
        "Town": "HH-Mitte",
        "StateOrProvince": "Hamburg",
        "Postcode": "20457",
        "CountryID": 87,
        "Latitude": 53.54865,
        "Longitude": 9.99697,
        "DistanceUnit": 0
    },
    "Connections": [
        {
            "ID": 128932,
            "ConnectionTypeID": 33,
            "StatusTypeID": 50,
            "LevelID": 3,
            "PowerKW": 50,
            "CurrentTypeID": 30,
            "Quantity": 1
        },
        {
            "ID": 128950,
            "ConnectionTypeID": 2,
            "StatusTypeID": 50,
            "LevelID": 3,
            "PowerKW": 50,
            "CurrentTypeID": 30,
            "Quantity": 1
        },
        {
            "ID": 128951,
            "ConnectionTypeID": 25,
            "StatusTypeID": 50,
            "LevelID": 2,
            "Amps": 16,
            "Voltage": 400,
            "PowerKW": 11,
            "CurrentTypeID": 20,
            "Quantity": 1
        }
    ],
    "NumberOfPoints": 1,
    "StatusTypeID": 50,
    "DateLastStatusUpdate": "2017-07-28T05:50:00Z",
    "DataQualityLevel": 1,
    "DateCreated": "2017-07-26T05:55:00Z",
    "SubmissionStatusTypeID": 200
}