{
    "IsRecentlyVerified": false,
    "ID": 75349,
    "UUID": "75286564-C8CB-45A5-ADBE-9D2680788D89",
    "DataProviderID": 1,
    "OperatorID": 23,
    "OperatorsReference": "17037",
    "UsageTypeID": 6,
    "UsageCost": "Free",
    "AddressInfo": {
        "ID": 75695,
        "Title": "Relais & Châteaux Georges Blanc Parc & Spa",
        "AddressLine1": "Place du Marché",
        "Town": "Vonnas",
        "Postcode": "1540",
        "CountryID": 80,
        "Latitude": 46.220095,
        "Longitude": 4.989771,
        "ContactTelephone1": "+33 4 74 50 90 90",
        "DistanceUnit": 0
    },
    "Connections": [
        {
            "ID": 108654,
            "ConnectionTypeID": 30,
            "StatusTypeID": 50,
            "LevelID": 2,
            "Amps": 32,
            "Voltage": 400,
            "PowerKW": 22,
            "CurrentTypeID": 20,
            "Quantity": 2
        }
    ],
    "NumberOfPoints": 2,
    "GeneralComments": "2 Tesla Connector, up to 22kW.Available for patrons only. Please see valet.",
    "StatusTypeID": 50,
    "DateLastStatusUpdate": "2018-10-03T19:19:00Z",
    "DataQualityLevel": 1,
    "DateCreated": "2016-12-14T17:37:00Z",
    "SubmissionStatusTypeID": 200
}