{
    "UserComments": [
        {
            "ID": 17791,
            "ChargePointID": 66674,
            "CommentTypeID": 10,
            "UserName": "ForumElettrico.it",
            "Comment": "http://www.forumelettrico.it/forum/colonnina-aeroporto-fast-wien-energie-pressburger-strasze-1300-schwechat-t1640.html\n",
            "DateCreated": "2017-10-10T10:56:24.013Z",
            "User": {
                "ID": 11749,
                "Username": "ForumElettrico.it"
            },
            "CheckinStatusTypeID": 10
        }
    ],
    "MediaItems": [
        {
            "ID": 13481,
            "ChargePointID": 66674,
            "ItemURL": "https://s3-ap-southeast-2.amazonaws.com/openchargemap/images/AT/OCM66674/OCM-66674.orig.2017101010582179.jpg",
            "ItemThumbnailURL": "https://s3-ap-southeast-2.amazonaws.com/openchargemap/images/AT/OCM66674/OCM-66674.thmb.2017101010582179.jpg",
            "Comment": "",
            "IsEnabled": true,
            "IsVideo": false,
            "IsFeaturedItem": false,
            "IsExternalResource": false,
            "User": {
                "ID": 11749,
                "Username": "ForumElettrico.it"
            },
            "DateCreated": "2017-10-10T10:59:00Z"
        },
        {
            "ID": 6507,
            "ChargePointID": 66674,
            "ItemURL": "https://s3-ap-southeast-2.amazonaws.com/openchargemap/images/AT/OCM66674/OCM-66674.orig.2016052507455306.jpg",
            "ItemThumbnailURL": "https://s3-ap-southeast-2.amazonaws.com/openchargemap/images/AT/OCM66674/OCM-66674.thmb.2016052507455306.jpg",
            "Comment": "Source: Teslaclub.sk",
            "IsEnabled": true,
            "IsVideo": false,
            "IsFeaturedItem": false,
            "IsExternalResource": false,
            "User": {
                "ID": 6224,
                "Username": "ozana"
            },
            "DateCreated": "2016-05-25T07:46:00Z"
        },
        {
            "ID": 6506,
            "ChargePointID": 66674,
            "ItemURL": "https://s3-ap-southeast-2.amazonaws.com/openchargemap/images/AT/OCM66674/OCM-66674.orig.2016052507443631.jpg",
            "ItemThumbnailURL": "https://s3-ap-southeast-2.amazonaws.com/openchargemap/images/AT/OCM66674/OCM-66674.thmb.2016052507443631.jpg",
            "Comment": "Source: teslaclub.sk",
            "IsEnabled": true,
            "IsVideo": false,
            "IsFeaturedItem": false,
            "IsExternalResource": false,
            "User": {
                "ID": 6224,
                "Username": "ozana"
            },
            "DateCreated": "2016-05-25T07:45:00Z"
        }
    ],
    "IsRecentlyVerified": false,
    "ID": 66674,
    "UUID": "9421BD33-D2C6-43ED-89FF-A28424568767",
    "DataProviderID": 1,
    "OperatorID": 142,
    "OperatorsReference": "3345177",
    "UsageTypeID": 1,
    "AddressInfo": {
        "ID": 67020,
        "Title": "Airport Wiena",
        "AddressLine1": "Abflugstraße",
        "Town": "Wien-Umgebung",
        "StateOrProvince": "Wien-Umgebung",
        "Postcode": "2320",
        "CountryID": 19,
        "Latitude": 48.126168,
        "Longitude": 16.565254,
        "AccessComments": "Wien Energie card needed.",
        "DistanceUnit": 0
    },
    "Connections": [
        {
            "ID": 92114,
            "ConnectionTypeID": 2,
            "StatusTypeID": 50,
            "LevelID": 3,
            "PowerKW": 50,
            "CurrentTypeID": 30,
            "Quantity": 1
        },
        {
            "ID": 92115,
            "ConnectionTypeID": 33,
            "StatusTypeID": 50,
            "LevelID": 3,
            "PowerKW": 50,
            "CurrentTypeID": 30,
            "Quantity": 1
        },
        {
            "ID": 92116,
            "ConnectionTypeID": 25,
            "StatusTypeID": 50,
            "LevelID": 2,
            "Amps": 32,
            "Voltage": 400,
            "PowerKW": 22,
            "CurrentTypeID": 10,
            "Quantity": 1
        },
        {
            "ID": 92117,
            "ConnectionTypeID": 23,
            "StatusTypeID": 50,
            "LevelID": 2,
            "Amps": 16,
            "Voltage": 230,
            "PowerKW": 3.5,
            "CurrentTypeID": 10,
            "Quantity": 6
        }
    ],
    "NumberOfPoints": 4,
    "GeneralComments": "Only Type2 is for free!",
    "StatusTypeID": 50,
    "DateLastStatusUpdate": "2017-10-10T10:59:00Z",
    "DataQualityLevel": 1,
    "DateCreated": "2016-05-25T07:42:00Z",
    "SubmissionStatusTypeID": 200
}