{
    "IsRecentlyVerified": false,
    "ID": 122718,
    "UUID": "5E83F966-4924-4B77-BC71-ACE46AE94B67",
    "DataProviderID": 2,
    "DataProvidersReference": "65840",
    "OperatorID": 5,
    "UsageTypeID": 1,
    "AddressInfo": {
        "ID": 123064,
        "Title": "CHOICE ST",
        "AddressLine1": "159 Choice Avenue",
        "Town": "Dahlonega",
        "StateOrProvince": "GA",
        "Postcode": "30533",
        "CountryID": 2,
        "Latitude": 34.5325722,
        "Longitude": -83.983281,
        "ContactTelephone1": "888-758-4389",
        "AccessComments": "24 hours daily",
        "RelatedURL": "http://www.chargepoint.com/",
        "DistanceUnit": 0
    },
    "Connections": [
        {
            "ID": 172631,
            "ConnectionTypeID": 1,
            "LevelID": 2,
            "Amps": 16,
            "Voltage": 230,
            "PowerKW": 3,
            "CurrentTypeID": 10,
            "Quantity": 2
        }
    ],
    "DateLastStatusUpdate": "2019-12-24T09:12:00Z",
    "DataQualityLevel": 3,
    "DateCreated": "2019-04-06T05:03:00Z",
    "SubmissionStatusTypeID": 100
}