{
    "IsRecentlyVerified": false,
    "ID": 91867,
    "UUID": "A7A3BDDD-1EA4-46EE-BFB3-0E6C2EE314DF",
    "DataProviderID": 1,
    "OperatorID": 23,
    "OperatorsReference": "32870",
    "UsageTypeID": 6,
    "AddressInfo": {
        "ID": 92213,
        "Title": "Douro Royal Valley Hotel & Spa",
        "AddressLine1": "Lugar de Portela Do Rio",
        "Town": "Ribadouro",
        "StateOrProvince": "Baiao",
        "Postcode": "4640-400",
        "CountryID": 180,
        "Latitude": 41.103279,
        "Longitude": -8.095273,
        "ContactTelephone1": "+352 255 070 900",
        "AccessComments": "Only for customers",
        "DistanceUnit": 0
    },
    "Connections": [
        {
            "ID": 130216,
            "ConnectionTypeID": 30,
            "StatusTypeID": 50,
            "LevelID": 2,
            "Amps": 32,
            "Voltage": 400,
            "PowerKW": 22,
            "CurrentTypeID": 20,
            "Quantity": 1
        }
    ],
    "NumberOfPoints": 1,
    "GeneralComments": "1 Tesla Connector, up to 22kW.Available for customers. Please call ahead.",
    "StatusTypeID": 50,
    "DateLastStatusUpdate": "2020-09-11T11:13:00Z",
    "DataQualityLevel": 1,
    "DateCreated": "2017-08-18T07:50:00Z",
    "SubmissionStatusTypeID": 200
}