{
    "IsRecentlyVerified": false,
    "ID": 72149,
    "UUID": "B53875CA-6581-401E-A15E-9A1C10521BEE",
    "DataProviderID": 1,
    "OperatorID": 23,
    "OperatorsReference": "19897",
    "UsageTypeID": 1,
    "UsageCost": "$0.20/min >=60kW; $0.10/min <60kW; other tariffs for older cars",
    "AddressInfo": {
        "ID": 72495,
        "Title": "Cisco Travel Plaza - Tesla",
        "AddressLine1": "16851 IH 20",
        "Town": "Cisco",
        "StateOrProvince": "TX",
        "Postcode": "76437",
        "CountryID": 2,
        "Latitude": 32.3738933,
        "Longitude": -99.0072197,
        "ContactTelephone1": "877-798-3752",
        "AccessComments": "24 hours daily; for Tesla use only",
        "RelatedURL": "http://www.teslamotors.com/supercharger",
        "DistanceUnit": 0
    },
    "Connections": [
        {
            "ID": 103448,
            "ConnectionTypeID": 27,
            "StatusTypeID": 50,
            "LevelID": 3,
            "Amps": 100,
            "Voltage": 400,
            "PowerKW": 120,
            "CurrentTypeID": 30,
            "Quantity": 8
        }
    ],
    "NumberOfPoints": 8,
    "StatusTypeID": 50,
    "DateLastStatusUpdate": "2018-03-13T13:38:00Z",
    "DataQualityLevel": 3,
    "DateCreated": "2016-10-09T02:44:00Z",
    "SubmissionStatusTypeID": 100
}