{
    "IsRecentlyVerified": false,
    "ID": 144883,
    "UUID": "EAD835E9-6E9E-4532-8779-238B5E6480F5",
    "DataProviderID": 2,
    "DataProvidersReference": "144374",
    "UsageTypeID": 1,
    "AddressInfo": {
        "ID": 145235,
        "Title": "Yellowstone Harley-Davidson",
        "AddressLine1": "540 Alaska Frontage Rd",
        "Town": "Belgrade",
        "StateOrProvince": "MT",
        "Postcode": "59714",
        "CountryID": 2,
        "Latitude": 45.763694,
        "Longitude": -111.175404,
        "ContactTelephone1": "406-388-7684",
        "AccessComments": "9am-6pm daily",
        "RelatedURL": "",
        "DistanceUnit": 0
    },
    "Connections": [
        {
            "ID": 201431,
            "ConnectionTypeID": 1,
            "LevelID": 2,
            "Amps": 16,
            "Voltage": 230,
            "PowerKW": 3.7,
            "CurrentTypeID": 10,
            "Quantity": 1
        },
        {
            "ID": 201432,
            "ConnectionTypeID": 2,
            "LevelID": 3,
            "Amps": 100,
            "Voltage": 400,
            "PowerKW": 40,
            "CurrentTypeID": 30,
            "Quantity": 1
        }
    ],
    "StatusTypeID": 50,
    "DateLastStatusUpdate": "2020-06-26T03:09:00Z",
    "DataQualityLevel": 3,
    "DateCreated": "2019-12-24T09:23:00Z",
    "SubmissionStatusTypeID": 100
}