{
    "IsRecentlyVerified": false,
    "ID": 181750,
    "UUID": "0C7F3F9B-DEA5-4E4F-824F-6EFB792E37BB",
    "DataProviderID": 29,
    "DataProvidersReference": "9267",
    "AddressInfo": {
        "ID": 182109,
        "Title": "Ahornweg 2",
        "AddressLine1": "Ahornweg 2",
        "Town": "Hettstedt",
        "Postcode": "06333",
        "CountryID": 87,
        "Latitude": 51.6589,
        "Longitude": 11.49857,
        "DistanceUnit": 0
    },
    "Connections": [
        {
            "ID": 286499,
            "ConnectionTypeID": 25,
            "StatusTypeID": 50,
            "LevelID": 2,
            "PowerKW": 22,
            "CurrentTypeID": 20
        },
        {
            "ID": 286500,
            "ConnectionTypeID": 25,
            "StatusTypeID": 50,
            "LevelID": 2,
            "PowerKW": 22,
            "CurrentTypeID": 20
        }
    ],
    "StatusTypeID": 50,
    "DateLastStatusUpdate": "2021-07-12T02:48:00Z",
    "MetadataValues": [
        {
            "ID": 14044,
            "MetadataFieldID": 4,
            "ItemValue": "Data from the German chargepoint registry provided by Bundesnetzagentur.de under the CC-BY 4.0 license"
        }
    ],
    "DataQualityLevel": 3,
    "DateCreated": "2021-07-08T10:02:00Z",
    "SubmissionStatusTypeID": 100
}