{
    "IsRecentlyVerified": false,
    "ID": 70483,
    "UUID": "1DE240BF-CB2E-49EF-BEF0-CC0BDB17E62F",
    "DataProviderID": 1,
    "OperatorID": 69,
    "UsageTypeID": 1,
    "AddressInfo": {
        "ID": 70829,
        "Title": "Parkhaus Mathematikon",
        "AddressLine1": "Im Neuenheimer Feld 205",
        "Town": "Heidelberg",
        "StateOrProvince": "Heidelberg",
        "Postcode": "69120",
        "CountryID": 87,
        "Latitude": 49.4172982,
        "Longitude": 8.67542400000002,
        "AccessComments": "Reservierte Parkplätze im 1. Untergeschoß. 24/7 kostenlos nutzbar mit Karten vom Verbund Ladenetz, The New Motion, EWE, Vattenfall u.a.",
        "RelatedURL": "http://www.swhd.de/de/Dienstleistungen/Energiespar-Angebote/Elektromobilitaet/Ladestationen-fuer-E-Mobile-i",
        "DistanceUnit": 0
    },
    "Connections": [
        {
            "ID": 100814,
            "ConnectionTypeID": 25,
            "StatusTypeID": 50,
            "LevelID": 2,
            "Amps": 32,
            "Voltage": 400,
            "PowerKW": 22,
            "CurrentTypeID": 20,
            "Quantity": 2
        },
        {
            "ID": 100815,
            "ConnectionTypeID": 28,
            "StatusTypeID": 50,
            "LevelID": 2,
            "Amps": 16,
            "Voltage": 230,
            "PowerKW": 3.7,
            "CurrentTypeID": 10,
            "Quantity": 2
        }
    ],
    "NumberOfPoints": 2,
    "StatusTypeID": 50,
    "DateLastStatusUpdate": "2016-07-19T05:50:00Z",
    "DataQualityLevel": 1,
    "DateCreated": "2016-07-19T05:50:00Z",
    "SubmissionStatusTypeID": 200
}