{
    "IsRecentlyVerified": false,
    "ID": 41004,
    "UUID": "801DE146-A0F3-4C1D-AFDB-E51A47965ED6",
    "DataProviderID": 1,
    "OperatorID": 128,
    "UsageTypeID": 1,
    "UsageCost": "0",
    "AddressInfo": {
        "ID": 41350,
        "Title": "Rathaus",
        "AddressLine1": "Hauptstraße 1",
        "AddressLine2": "",
        "Town": "Meinersen",
        "StateOrProvince": "Samtgemeinde Meinersen",
        "Postcode": "38536",
        "CountryID": 87,
        "Latitude": 52.47647,
        "Longitude": 10.34604,
        "ContactTelephone1": "Hr. Weichsler: 05372 89312",
        "ContactTelephone2": "",
        "ContactEmail": "mobilitaet@lsw.de",
        "AccessComments": "Ladesäule in unmittelbarer Nähe des Eingangs des Rathauses der Samtgemeinde Meinersen, Parken kostenlos. Freier Zugang zur Ladesäule mit 1Typ2/1Schuko.",
        "RelatedURL": "https://www.lsw.de/service/e-mobilitaet/",
        "DistanceUnit": 0
    },
    "Connections": [
        {
            "ID": 44704,
            "ConnectionTypeID": 28,
            "StatusTypeID": 50,
            "LevelID": 2,
            "Amps": 16,
            "Voltage": 230,
            "PowerKW": 3.7,
            "CurrentTypeID": 10,
            "Quantity": 1
        },
        {
            "ID": 44705,
            "ConnectionTypeID": 25,
            "StatusTypeID": 50,
            "LevelID": 2,
            "Amps": 16,
            "Voltage": 400,
            "PowerKW": 11,
            "CurrentTypeID": 20,
            "Quantity": 1
        }
    ],
    "NumberOfPoints": 2,
    "GeneralComments": "Die E Bike Ladestation wurde in 2016 abgebaut.",
    "StatusTypeID": 50,
    "DateLastStatusUpdate": "2017-02-02T08:50:00Z",
    "DataQualityLevel": 1,
    "DateCreated": "2015-01-21T08:45:00Z",
    "SubmissionStatusTypeID": 200
}