{
    "IsRecentlyVerified": false,
    "ID": 146167,
    "UUID": "7D251751-E8B2-4FA6-AAC2-3268C5F074B4",
    "DataProviderID": 1,
    "OperatorID": 20,
    "OperatorsReference": "80433",
    "UsageTypeID": 4,
    "UsageCost": "£1.00/charge admin fee",
    "AddressInfo": {
        "ID": 146519,
        "Title": "Aldi, High Street, Newcastle",
        "AddressLine1": "Aldi, High Street, Newcastle",
        "Postcode": "NE9 7JR",
        "CountryID": 1,
        "Latitude": 54.92485,
        "Longitude": -1.57595,
        "DistanceUnit": 0
    },
    "Connections": [
        {
            "ID": 203100,
            "ConnectionTypeID": 25,
            "StatusTypeID": 100,
            "LevelID": 2,
            "Amps": 32,
            "Voltage": 230,
            "PowerKW": 7,
            "CurrentTypeID": 10,
            "Quantity": 2
        }
    ],
    "NumberOfPoints": 2,
    "StatusTypeID": 100,
    "DateLastStatusUpdate": "2020-01-31T06:13:00Z",
    "DataQualityLevel": 1,
    "DateCreated": "2020-01-02T08:21:00Z",
    "SubmissionStatusTypeID": 200
}