{
    "IsRecentlyVerified": false,
    "ID": 180194,
    "UUID": "8D09BE39-D426-4260-AF2D-CEF47BA9E6AB",
    "DataProviderID": 29,
    "DataProvidersReference": "5527",
    "OperatorID": 105,
    "AddressInfo": {
        "ID": 180553,
        "Title": "Fontainestr. 2",
        "AddressLine1": "Fontainestr. 2",
        "Town": "Rheda-Wiedenbrück",
        "Postcode": "33378",
        "CountryID": 87,
        "Latitude": 51.853811,
        "Longitude": 8.288796,
        "DistanceUnit": 0
    },
    "Connections": [
        {
            "ID": 282968,
            "ConnectionTypeID": 25,
            "StatusTypeID": 50,
            "LevelID": 2,
            "PowerKW": 22,
            "CurrentTypeID": 20
        },
        {
            "ID": 282969,
            "ConnectionTypeID": 25,
            "StatusTypeID": 50,
            "LevelID": 2,
            "PowerKW": 22,
            "CurrentTypeID": 20
        }
    ],
    "StatusTypeID": 50,
    "DateLastStatusUpdate": "2021-07-12T02:48:00Z",
    "MetadataValues": [
        {
            "ID": 12488,
            "MetadataFieldID": 4,
            "ItemValue": "Data from the German chargepoint registry provided by Bundesnetzagentur.de under the CC-BY 4.0 license"
        }
    ],
    "DataQualityLevel": 3,
    "DateCreated": "2021-07-08T10:00:00Z",
    "SubmissionStatusTypeID": 100
}