{
    "IsRecentlyVerified": false,
    "ID": 131289,
    "UUID": "AB0FA537-90DF-4F2F-A26C-4349735EB5C5",
    "DataProviderID": 1,
    "OperatorID": 23,
    "OperatorsReference": "43238",
    "UsageTypeID": 4,
    "AddressInfo": {
        "ID": 131635,
        "Title": "Herberg de Klomp",
        "AddressLine1": "Vilsterseweg 10",
        "Town": "Vilsteren",
        "Postcode": "7734PD",
        "CountryID": 159,
        "Latitude": 52.5110807,
        "Longitude": 6.3540541,
        "ContactTelephone1": " +31 52 94 59 000",
        "DistanceUnit": 0
    },
    "Connections": [
        {
            "ID": 183824,
            "ConnectionTypeID": 30,
            "StatusTypeID": 50,
            "LevelID": 2,
            "PowerKW": 22,
            "CurrentTypeID": 20,
            "Quantity": 1
        }
    ],
    "NumberOfPoints": 1,
    "GeneralComments": "1 Tesla Connector, up to 22kW.Available for customers. Please see front desk.",
    "StatusTypeID": 50,
    "DateLastStatusUpdate": "2019-09-02T05:32:00Z",
    "DataQualityLevel": 1,
    "DateCreated": "2019-09-02T05:32:00Z",
    "SubmissionStatusTypeID": 200
}