{
    "UserComments": [
        {
            "ID": 22911,
            "ChargePointID": 9410,
            "CommentTypeID": 10,
            "UserName": "AlexMol",
            "Comment": "216V 30A",
            "Rating": 4,
            "DateCreated": "2020-07-15T11:51:40.957Z",
            "User": {
                "ID": 9177,
                "Username": "AlexMol"
            },
            "CheckinStatusTypeID": 10,
            "IsActionedByEditor": false
        }
    ],
    "MediaItems": [
        {
            "ID": 23083,
            "ChargePointID": 9410,
            "ItemURL": "https://s3-ap-southeast-2.amazonaws.com/openchargemap/images/PT/OCM9410/OCM-9410.orig.2020071511523720.jpg",
            "ItemThumbnailURL": "https://s3-ap-southeast-2.amazonaws.com/openchargemap/images/PT/OCM9410/OCM-9410.thmb.2020071511523720.jpg",
            "Comment": "",
            "IsEnabled": true,
            "IsVideo": false,
            "IsFeaturedItem": false,
            "IsExternalResource": false,
            "User": {
                "ID": 9177,
                "Username": "AlexMol"
            },
            "DateCreated": "2020-07-15T11:53:00Z"
        }
    ],
    "IsRecentlyVerified": false,
    "ID": 9410,
    "UUID": "25B2B117-B6D4-4DCE-AFCF-61010FDB865C",
    "DataProviderID": 1,
    "DataProvidersReference": "BJA-00004",
    "OperatorID": 21,
    "UsageTypeID": 4,
    "UsageCost": "Mobi.E card",
    "AddressInfo": {
        "ID": 9307,
        "Title": "BJA-00004",
        "AddressLine1": "Rua 1º de Maio",
        "Town": "Beja",
        "Postcode": "7800-510",
        "CountryID": 180,
        "Latitude": 38.01099551444915,
        "Longitude": -7.874725004809534,
        "RelatedURL": "http://www.mobie.pt",
        "DistanceUnit": 0
    },
    "Connections": [
        {
            "ID": 33180,
            "ConnectionTypeID": 25,
            "StatusTypeID": 50,
            "LevelID": 2,
            "Amps": 30,
            "Voltage": 230,
            "PowerKW": 7,
            "CurrentTypeID": 10,
            "Quantity": 2
        }
    ],
    "NumberOfPoints": 2,
    "StatusTypeID": 50,
    "DateLastStatusUpdate": "2020-07-15T11:53:00Z",
    "DataQualityLevel": 3,
    "DateCreated": "2012-02-08T15:15:00Z",
    "SubmissionStatusTypeID": 100
}