{
    "IsRecentlyVerified": false,
    "ID": 184768,
    "UUID": "576C8BEB-84EA-45E8-9E3B-64747D49CB1A",
    "DataProviderID": 29,
    "DataProvidersReference": "15792",
    "AddressInfo": {
        "ID": 185127,
        "Title": "Gausekampweg 4",
        "AddressLine1": "Gausekampweg 4",
        "Town": "Halle",
        "Postcode": "33790",
        "CountryID": 87,
        "Latitude": 52.063357,
        "Longitude": 8.353787,
        "DistanceUnit": 0
    },
    "Connections": [
        {
            "ID": 293431,
            "ConnectionTypeID": 25,
            "StatusTypeID": 50,
            "LevelID": 2,
            "PowerKW": 22,
            "CurrentTypeID": 20
        },
        {
            "ID": 293432,
            "ConnectionTypeID": 25,
            "StatusTypeID": 50,
            "LevelID": 2,
            "PowerKW": 22,
            "CurrentTypeID": 20
        }
    ],
    "StatusTypeID": 50,
    "DateLastStatusUpdate": "2021-07-12T02:48:00Z",
    "MetadataValues": [
        {
            "ID": 17059,
            "MetadataFieldID": 4,
            "ItemValue": "Data from the German chargepoint registry provided by Bundesnetzagentur.de under the CC-BY 4.0 license"
        }
    ],
    "DataQualityLevel": 3,
    "DateCreated": "2021-07-08T10:05:00Z",
    "SubmissionStatusTypeID": 100
}