{
    "IsRecentlyVerified": false,
    "ID": 157545,
    "UUID": "73340491-13C9-47A2-86D6-8312CC0512FF",
    "DataProviderID": 1,
    "OperatorID": 45,
    "UsageTypeID": 1,
    "AddressInfo": {
        "ID": 157899,
        "Title": "QUT Gardens Point",
        "AddressLine1": "Lamington Dr",
        "Town": "Brisbane",
        "StateOrProvince": "Queensland",
        "Postcode": "4000",
        "CountryID": 18,
        "Latitude": -27.47690542761223,
        "Longitude": 153.02690553568516,
        "DistanceUnit": 0
    },
    "Connections": [
        {
            "ID": 226965,
            "ConnectionTypeID": 2,
            "StatusTypeID": 50,
            "LevelID": 3,
            "PowerKW": 50,
            "CurrentTypeID": 30,
            "Quantity": 1
        },
        {
            "ID": 226966,
            "ConnectionTypeID": 33,
            "StatusTypeID": 50,
            "LevelID": 3,
            "PowerKW": 50,
            "CurrentTypeID": 30,
            "Quantity": 1
        }
    ],
    "NumberOfPoints": 1,
    "StatusTypeID": 50,
    "DateLastStatusUpdate": "2020-06-15T16:41:00Z",
    "DataQualityLevel": 1,
    "DateCreated": "2020-06-14T09:56:00Z",
    "SubmissionStatusTypeID": 200
}