{
    "IsRecentlyVerified": false,
    "ID": 125549,
    "UUID": "97FF958B-33C1-43A9-A0F9-39BB3285D5A9",
    "DataProviderID": 1,
    "OperatorID": 38,
    "UsageTypeID": 1,
    "AddressInfo": {
        "ID": 125895,
        "Title": "Lidl, 4310 Mauthausen",
        "AddressLine1": "Linzer Straße 71",
        "Town": "Mauthausen",
        "Postcode": "4310",
        "CountryID": 87,
        "Latitude": 53.374016,
        "Longitude": 10.547171,
        "DistanceUnit": 0
    },
    "Connections": [
        {
            "ID": 175924,
            "ConnectionTypeID": 2,
            "StatusTypeID": 50,
            "LevelID": 3,
            "PowerKW": 50,
            "CurrentTypeID": 30,
            "Quantity": 1
        },
        {
            "ID": 175925,
            "ConnectionTypeID": 33,
            "StatusTypeID": 50,
            "LevelID": 3,
            "PowerKW": 50,
            "CurrentTypeID": 30,
            "Quantity": 1
        },
        {
            "ID": 175926,
            "ConnectionTypeID": 1036,
            "StatusTypeID": 50,
            "LevelID": 2,
            "Amps": 32,
            "Voltage": 400,
            "PowerKW": 22,
            "CurrentTypeID": 20,
            "Quantity": 1
        }
    ],
    "NumberOfPoints": 1,
    "StatusTypeID": 50,
    "DateLastStatusUpdate": "2019-04-20T09:14:00Z",
    "DataQualityLevel": 1,
    "DateCreated": "2019-04-20T09:14:00Z",
    "SubmissionStatusTypeID": 200
}