{
    "IsRecentlyVerified": false,
    "ID": 73266,
    "UUID": "DA9CAA3C-359D-4BC0-81B3-29171F19D704",
    "DataProviderID": 1,
    "OperatorID": 45,
    "UsageTypeID": 1,
    "AddressInfo": {
        "ID": 73612,
        "Title": "Baumarkt",
        "AddressLine1": "Micheletalweg 1",
        "Town": "Marktoberdorf",
        "StateOrProvince": "Landkreis Ostallgäu",
        "Postcode": "87616",
        "CountryID": 87,
        "Latitude": 47.78017,
        "Longitude": 10.61307,
        "DistanceUnit": 0
    },
    "Connections": [
        {
            "ID": 105426,
            "ConnectionTypeID": 28,
            "StatusTypeID": 50,
            "LevelID": 2,
            "Amps": 16,
            "Voltage": 230,
            "PowerKW": 3.7,
            "CurrentTypeID": 10,
            "Quantity": 1
        }
    ],
    "NumberOfPoints": 1,
    "StatusTypeID": 50,
    "DateLastStatusUpdate": "2016-11-17T08:07:00Z",
    "DataQualityLevel": 1,
    "DateCreated": "2016-11-17T08:07:00Z",
    "SubmissionStatusTypeID": 200
}