{
    "IsRecentlyVerified": false,
    "ID": 82332,
    "UUID": "4EDD2E49-C2F7-4732-91EC-73997E8898B8",
    "DataProviderID": 1,
    "OperatorID": 23,
    "OperatorsReference": "8295",
    "UsageTypeID": 6,
    "AddressInfo": {
        "ID": 82678,
        "Title": "Courtyard Philadelphia City Avenue",
        "AddressLine1": "4100 Presidential BLVD",
        "Town": "Philadelphia",
        "StateOrProvince": "PA",
        "Postcode": "19131",
        "CountryID": 2,
        "Latitude": 40.006896,
        "Longitude": -75.210763,
        "ContactTelephone1": "(215) 458-2123",
        "DistanceUnit": 0
    },
    "Connections": [
        {
            "ID": 117098,
            "ConnectionTypeID": 30,
            "StatusTypeID": 50,
            "LevelID": 2,
            "PowerKW": 16,
            "CurrentTypeID": 20,
            "Quantity": 2
        }
    ],
    "NumberOfPoints": 2,
    "GeneralComments": "2 Tesla Connectors, up to 16kW.Available for patrons only. Self park.",
    "StatusTypeID": 50,
    "DateLastStatusUpdate": "2017-02-03T15:36:00Z",
    "DataQualityLevel": 1,
    "DateCreated": "2017-02-03T15:36:00Z",
    "SubmissionStatusTypeID": 200
}