{
    "IsRecentlyVerified": false,
    "ID": 126005,
    "UUID": "0597AC84-C611-4DF1-BA1B-A4FEA52F7A1D",
    "DataProviderID": 1,
    "OperatorID": 80,
    "UsageTypeID": 4,
    "UsageCost": "0.45€/KWh",
    "AddressInfo": {
        "ID": 126351,
        "Title": "Roma America | EnelX",
        "AddressLine1": "Viale America",
        "AddressLine2": "Municipio Roma IX",
        "Town": "Roma",
        "StateOrProvince": "RM",
        "Postcode": "00144",
        "CountryID": 112,
        "Latitude": 41.83054580389367,
        "Longitude": 12.465002620746532,
        "RelatedURL": "https://www.enelx.com/it/it/emobility",
        "DistanceUnit": 0
    },
    "Connections": [
        {
            "ID": 176604,
            "ConnectionTypeID": 25,
            "StatusTypeID": 50,
            "LevelID": 2,
            "Amps": 32,
            "Voltage": 400,
            "PowerKW": 22,
            "CurrentTypeID": 20,
            "Quantity": 2
        },
        {
            "ID": 176605,
            "ConnectionTypeID": 36,
            "StatusTypeID": 50,
            "LevelID": 2,
            "Amps": 16,
            "Voltage": 240,
            "PowerKW": 3.7,
            "CurrentTypeID": 10,
            "Quantity": 2
        }
    ],
    "NumberOfPoints": 4,
    "StatusTypeID": 50,
    "DateLastStatusUpdate": "2019-05-10T14:32:00Z",
    "DataQualityLevel": 1,
    "DateCreated": "2019-05-10T14:32:00Z",
    "SubmissionStatusTypeID": 200
}