{
    "IsRecentlyVerified": false,
    "ID": 43383,
    "UUID": "942D73B4-2827-41E6-B6D7-4FE79C0BED8A",
    "DataProviderID": 1,
    "OperatorID": 45,
    "UsageTypeID": 5,
    "UsageCost": "1€/2h",
    "AddressInfo": {
        "ID": 43729,
        "Title": "Stellplatz Zur Windleite (P7 )",
        "AddressLine1": "Hospitalstraße",
        "Town": " Sondershausen",
        "Postcode": "99706",
        "CountryID": 87,
        "Latitude": 51.3782449941903,
        "Longitude": 10.862274419417,
        "AccessComments": "Gebührenfreier 24/7 nutzbarer öffentlicher Parkplatz mit Stromanschluss (1€/2h).  Zur Anfahrt einfach den Schildern des Parkleitsystems folgen. Supermarkt mit Bäcker/Fleischer in 100m Entfernung, Stadtzentrum ca. 1km.",
        "RelatedURL": "http://www.sondershausen.de/de/wohnmobilstellplatz.html",
        "DistanceUnit": 0
    },
    "Connections": [
        {
            "ID": 52578,
            "ConnectionTypeID": 16,
            "StatusTypeID": 50,
            "LevelID": 2,
            "Amps": 16,
            "Voltage": 230,
            "PowerKW": 3.7,
            "CurrentTypeID": 10,
            "Quantity": 4
        }
    ],
    "NumberOfPoints": 1,
    "StatusTypeID": 50,
    "DateLastStatusUpdate": "2015-03-29T13:54:00Z",
    "DataQualityLevel": 1,
    "DateCreated": "2015-03-29T12:06:00Z",
    "SubmissionStatusTypeID": 200
}