{
    "IsRecentlyVerified": false,
    "ID": 120712,
    "UUID": "1899A584-80E1-4668-84A3-E68E7FED92EF",
    "DataProviderID": 2,
    "DataProvidersReference": "47233",
    "UsageTypeID": 1,
    "AddressInfo": {
        "ID": 121058,
        "Title": "Aiken Electric Co-op",
        "AddressLine1": "2790 Wagener Rd",
        "Town": "Aiken",
        "StateOrProvince": "SC",
        "Postcode": "29801",
        "CountryID": 2,
        "Latitude": 33.547058,
        "Longitude": -81.6535,
        "ContactTelephone1": "803-649-6245",
        "AccessComments": "8am-6pm M-F",
        "RelatedURL": "",
        "DistanceUnit": 0
    },
    "Connections": [
        {
            "ID": 170087,
            "ConnectionTypeID": 1,
            "LevelID": 2,
            "Amps": 16,
            "Voltage": 230,
            "PowerKW": 3.7,
            "CurrentTypeID": 10,
            "Quantity": 1
        }
    ],
    "DateLastStatusUpdate": "2020-06-26T02:55:00Z",
    "DataQualityLevel": 3,
    "DateCreated": "2019-04-01T04:59:00Z",
    "SubmissionStatusTypeID": 100
}