{
    "IsRecentlyVerified": false,
    "ID": 139223,
    "UUID": "2181D5BA-1D31-4DCB-A489-46B267F5783B",
    "DataProviderID": 2,
    "DataProvidersReference": "123931",
    "UsageTypeID": 1,
    "AddressInfo": {
        "ID": 139575,
        "Title": "Archibald's",
        "AddressLine1": "28881 Newport Rd",
        "Town": "Menifee",
        "StateOrProvince": "CA",
        "Postcode": "92584",
        "CountryID": 2,
        "Latitude": 33.684529,
        "Longitude": -117.155248,
        "ContactTelephone1": "951-679-7655",
        "AccessComments": "24 hours daily",
        "RelatedURL": "",
        "DistanceUnit": 0
    },
    "Connections": [
        {
            "ID": 194505,
            "ConnectionTypeID": 1,
            "LevelID": 2,
            "Amps": 16,
            "Voltage": 230,
            "PowerKW": 3.7,
            "CurrentTypeID": 10,
            "Quantity": 1
        }
    ],
    "StatusTypeID": 50,
    "DateLastStatusUpdate": "2020-06-26T02:55:00Z",
    "DataQualityLevel": 3,
    "DateCreated": "2019-12-24T09:10:00Z",
    "SubmissionStatusTypeID": 100
}