{
    "IsRecentlyVerified": false,
    "ID": 74047,
    "UUID": "D4B2ABE7-D06B-4092-9525-DBECE9B4571C",
    "DataProviderID": 1,
    "OperatorID": 89,
    "OperatorsReference": "CEC-00015",
    "UsageTypeID": 4,
    "UsageCost": "CAD 10.00/hour",
    "AddressInfo": {
        "ID": 74393,
        "Title": "BRCC-Ville de Montebello",
        "AddressLine1": "502 rue Notre-Dame",
        "Town": "Montebello",
        "StateOrProvince": "QC",
        "Postcode": "J0V 1L0",
        "CountryID": 44,
        "Latitude": 45.64985,
        "Longitude": -74.94192,
        "DistanceUnit": 0
    },
    "Connections": [
        {
            "ID": 106366,
            "ConnectionTypeID": 2,
            "StatusTypeID": 50,
            "LevelID": 3,
            "PowerKW": 50,
            "CurrentTypeID": 20,
            "Quantity": 1
        },
        {
            "ID": 106367,
            "ConnectionTypeID": 32,
            "StatusTypeID": 50,
            "LevelID": 3,
            "PowerKW": 50,
            "CurrentTypeID": 20,
            "Quantity": 1
        }
    ],
    "NumberOfPoints": 1,
    "StatusTypeID": 50,
    "DateLastStatusUpdate": "2016-11-27T16:40:00Z",
    "DataQualityLevel": 1,
    "DateCreated": "2016-11-24T00:05:00Z",
    "SubmissionStatusTypeID": 200
}