{
    "IsRecentlyVerified": false,
    "ID": 134949,
    "UUID": "D3516CC6-F1DA-4019-8E21-77C822C91A55",
    "DataProviderID": 1,
    "OperatorID": 3345,
    "UsageTypeID": 5,
    "AddressInfo": {
        "ID": 135295,
        "Title": "Collett Road",
        "AddressLine1": "Collett Road",
        "Town": "London ",
        "Postcode": "SE16 4DD",
        "CountryID": 1,
        "Latitude": 51.496296,
        "Longitude": -0.06411,
        "RelatedURL": "https://char.gy",
        "DistanceUnit": 0
    },
    "Connections": [
        {
            "ID": 188877,
            "ConnectionTypeID": 25,
            "Reference": "00074",
            "StatusTypeID": 50,
            "LevelID": 2,
            "Amps": 16,
            "Voltage": 230,
            "PowerKW": 3.7,
            "CurrentTypeID": 10
        }
    ],
    "StatusTypeID": 0,
    "DateLastStatusUpdate": "2019-12-03T23:38:00Z",
    "MetadataValues": [
        {
            "ID": 5290,
            "MetadataFieldID": 4,
            "ItemValue": "Contains public sector information licensed under the Open Government Licence v2.0. http://www.nationalarchives.gov.uk/doc/open-government-licence/version/2/"
        }
    ],
    "DataQualityLevel": 3,
    "DateCreated": "2019-12-03T13:42:00Z",
    "SubmissionStatusTypeID": 100
}