{
    "IsRecentlyVerified": false,
    "ID": 72382,
    "UUID": "C7696A86-3C58-4D6E-A1F1-64916B639BCA",
    "DataProviderID": 1,
    "OperatorID": 45,
    "UsageTypeID": 6,
    "AddressInfo": {
        "ID": 72728,
        "Title": "Billa Břeclav",
        "AddressLine1": "Třída 1. máje 3086/2",
        "Town": "Břeclav",
        "StateOrProvince": "okres Břeclav",
        "Postcode": "69002",
        "CountryID": 64,
        "Latitude": 48.758681,
        "Longitude": 16.8782236,
        "AccessComments": "Zdarma. Spuštění nabíjení přes portál EVmapa.cz\r\n",
        "RelatedURL": "https://www.evmapa.cz/billa-breclav",
        "DistanceUnit": 0
    },
    "Connections": [
        {
            "ID": 103700,
            "ConnectionTypeID": 25,
            "StatusTypeID": 50,
            "LevelID": 2,
            "Amps": 32,
            "Voltage": 400,
            "PowerKW": 22,
            "CurrentTypeID": 20,
            "Quantity": 1
        },
        {
            "ID": 103701,
            "ConnectionTypeID": 25,
            "StatusTypeID": 50,
            "LevelID": 2,
            "Amps": 32,
            "Voltage": 400,
            "PowerKW": 22,
            "CurrentTypeID": 20,
            "Quantity": 1
        }
    ],
    "NumberOfPoints": 1,
    "StatusTypeID": 50,
    "DateLastStatusUpdate": "2018-08-16T18:45:00Z",
    "DataQualityLevel": 1,
    "DateCreated": "2016-10-11T05:27:00Z",
    "SubmissionStatusTypeID": 200
}