{
    "IsRecentlyVerified": false,
    "ID": 145422,
    "UUID": "8C872EB4-DDF5-4683-975A-DAD90874A76E",
    "DataProviderID": 2,
    "DataProvidersReference": "96500",
    "OperatorID": 9,
    "UsageTypeID": 2,
    "AddressInfo": {
        "ID": 145774,
        "Title": "KCHA - The Village at Overlake",
        "AddressLine1": "2580 152nd Avenue NE",
        "Town": "Redmond",
        "StateOrProvince": "WA",
        "Postcode": "98052",
        "CountryID": 2,
        "Latitude": 47.633041,
        "Longitude": -122.136031,
        "ContactTelephone1": "888-998-2546",
        "AccessComments": "MON: 24 hours | TUE: 24 hours | WED: 24 hours | THU: 24 hours | FRI: 24 hours | SAT: 24 hours | SUN: 24 hours",
        "RelatedURL": "http://www.blinkcharging.com/",
        "DistanceUnit": 0
    },
    "Connections": [
        {
            "ID": 202090,
            "ConnectionTypeID": 1,
            "LevelID": 2,
            "Amps": 16,
            "Voltage": 230,
            "PowerKW": 3,
            "CurrentTypeID": 10,
            "Quantity": 2
        }
    ],
    "StatusTypeID": 50,
    "DateLastStatusUpdate": "2019-12-24T09:24:00Z",
    "DataQualityLevel": 3,
    "DateCreated": "2019-12-24T09:24:00Z",
    "SubmissionStatusTypeID": 100
}