{
    "IsRecentlyVerified": false,
    "ID": 115491,
    "UUID": "3A48EC3F-1092-4011-B53A-13CDF1A13E35",
    "DataProviderID": 2,
    "DataProvidersReference": "105351",
    "OperatorID": 5,
    "UsageTypeID": 1,
    "AddressInfo": {
        "ID": 115837,
        "Title": "KROGER MARKET",
        "AddressLine1": "127 Main Street Market Place",
        "Town": "Cartersville",
        "StateOrProvince": "GA",
        "Postcode": "30121",
        "CountryID": 2,
        "Latitude": 34.1732869,
        "Longitude": -84.7769942,
        "ContactTelephone1": "888-758-4389",
        "AccessComments": "24 hours daily",
        "RelatedURL": "http://www.chargepoint.com/",
        "DistanceUnit": 0
    },
    "Connections": [
        {
            "ID": 162505,
            "ConnectionTypeID": 1,
            "LevelID": 2,
            "Amps": 16,
            "Voltage": 230,
            "PowerKW": 3,
            "CurrentTypeID": 10,
            "Quantity": 2
        }
    ],
    "DateLastStatusUpdate": "2019-04-06T04:01:00Z",
    "DataQualityLevel": 3,
    "DateCreated": "2019-02-11T07:13:00Z",
    "SubmissionStatusTypeID": 100
}