{
    "IsRecentlyVerified": false,
    "ID": 108907,
    "UUID": "4636AEB9-23C8-41F6-844B-E76BD7E0AB28",
    "DataProviderID": 1,
    "OperatorID": 23,
    "OperatorsReference": "46187",
    "UsageTypeID": 6,
    "AddressInfo": {
        "ID": 109253,
        "Title": "Hotel A Restaurant Na Farme",
        "AddressLine1": "Chotovice 13",
        "Town": "Zehun",
        "Postcode": "289 05",
        "CountryID": 64,
        "Latitude": 50.140647,
        "Longitude": 15.326887,
        "ContactTelephone1": "+42 0606 060856",
        "DistanceUnit": 0
    },
    "Connections": [
        {
            "ID": 154024,
            "ConnectionTypeID": 30,
            "StatusTypeID": 50,
            "LevelID": 2,
            "PowerKW": 14,
            "CurrentTypeID": 20,
            "Quantity": 2
        }
    ],
    "NumberOfPoints": 2,
    "GeneralComments": "2 Tesla Connectors, up to 14kW.Available for patrons only. Self park.",
    "StatusTypeID": 50,
    "DateLastStatusUpdate": "2018-10-11T13:02:00Z",
    "DataQualityLevel": 1,
    "DateCreated": "2018-10-11T13:02:00Z",
    "SubmissionStatusTypeID": 200
}