{
    "IsRecentlyVerified": false,
    "ID": 135581,
    "UUID": "57CD1129-DDB7-44F5-9EB6-F0D62CE63BBD",
    "DataProviderID": 18,
    "DataProvidersReference": "eb7db4b873452633f39c70e78c2d133d",
    "OperatorID": 20,
    "UsageTypeID": 1,
    "AddressInfo": {
        "ID": 135927,
        "Title": "Broad Street",
        "AddressLine1": "Broad Street",
        "Town": "Wokingham",
        "Postcode": "RG40 1WL",
        "CountryID": 1,
        "Latitude": 51.410738,
        "Longitude": -0.835078,
        "AccessComments": "",
        "RelatedURL": "http://www.chargeyourcar.org.uk",
        "DistanceUnit": 0
    },
    "Connections": [
        {
            "ID": 189983,
            "ConnectionTypeID": 2,
            "Reference": "1",
            "StatusTypeID": 50,
            "LevelID": 3,
            "Amps": 125,
            "Voltage": 400,
            "PowerKW": 50,
            "CurrentTypeID": 30
        },
        {
            "ID": 189984,
            "ConnectionTypeID": 1036,
            "Reference": "2",
            "StatusTypeID": 50,
            "LevelID": 3,
            "Amps": 125,
            "Voltage": 400,
            "PowerKW": 50,
            "CurrentTypeID": 30
        },
        {
            "ID": 189985,
            "ConnectionTypeID": 1036,
            "Reference": "3",
            "StatusTypeID": 50,
            "LevelID": 3,
            "Amps": 63,
            "Voltage": 400,
            "PowerKW": 43,
            "CurrentTypeID": 20
        }
    ],
    "StatusTypeID": 0,
    "DateLastStatusUpdate": "2021-07-12T03:38:00Z",
    "MetadataValues": [
        {
            "ID": 5433,
            "MetadataFieldID": 4,
            "ItemValue": "Contains public sector information licensed under the Open Government Licence v2.0. http://www.nationalarchives.gov.uk/doc/open-government-licence/version/2/"
        }
    ],
    "DataQualityLevel": 3,
    "DateCreated": "2019-12-24T05:22:00Z",
    "SubmissionStatusTypeID": 100
}