{
    "IsRecentlyVerified": false,
    "ID": 143262,
    "UUID": "C92B3B0D-0824-44DB-9795-ECD09CFD3B32",
    "DataProviderID": 2,
    "DataProvidersReference": "123301",
    "OperatorID": 3372,
    "UsageTypeID": 1,
    "AddressInfo": {
        "ID": 143614,
        "Title": "University at Albany - Building 25 Parking Lot",
        "AddressLine1": "1400 Washington Ave",
        "Town": "Albany",
        "StateOrProvince": "NY",
        "Postcode": "12222",
        "CountryID": 2,
        "Latitude": 42.688926,
        "Longitude": -73.828718,
        "ContactTelephone1": "",
        "AccessComments": "24 hours daily",
        "RelatedURL": "http://evconnect.com/",
        "DistanceUnit": 0
    },
    "Connections": [
        {
            "ID": 199555,
            "ConnectionTypeID": 1,
            "LevelID": 2,
            "Amps": 16,
            "Voltage": 230,
            "PowerKW": 3.7,
            "CurrentTypeID": 10,
            "Quantity": 2
        }
    ],
    "StatusTypeID": 50,
    "DateLastStatusUpdate": "2020-06-26T03:06:00Z",
    "DataQualityLevel": 3,
    "DateCreated": "2019-12-24T09:20:00Z",
    "SubmissionStatusTypeID": 100
}