{
    "IsRecentlyVerified": false,
    "ID": 8550,
    "UUID": "B8DB7D0A-83B8-491E-BD30-39ECDE95AEB5",
    "DataProviderID": 15,
    "DataProvidersReference": "10648",
    "OperatorID": 5,
    "UsageTypeID": 1,
    "AddressInfo": {
        "ID": 8447,
        "Title": "945 W 8th St",
        "AddressLine1": "945 W 8th St",
        "Town": "Los Angeles",
        "StateOrProvince": "California",
        "Postcode": "90017",
        "CountryID": 2,
        "Latitude": 34.04945374,
        "Longitude": -118.262207,
        "ContactTelephone1": "",
        "RelatedURL": "http://carstations.com/10648",
        "DistanceUnit": 0
    },
    "Connections": [
        {
            "ID": 5974,
            "ConnectionTypeID": 1,
            "Reference": "J1772",
            "LevelID": 2
        },
        {
            "ID": 6940,
            "ConnectionTypeID": 9,
            "Reference": "NEMA5",
            "Quantity": 1
        }
    ],
    "NumberOfPoints": 3,
    "StatusTypeID": 0,
    "DateLastStatusUpdate": "2017-11-04T14:04:00Z",
    "DataQualityLevel": 1,
    "DateCreated": "2011-11-11T12:06:00Z",
    "SubmissionStatusTypeID": 100
}