{
    "IsRecentlyVerified": false,
    "ID": 63034,
    "UUID": "EC5097B4-6CCB-44F7-B8F9-5231E1C7F7AE",
    "DataProviderID": 26,
    "DataProvidersReference": "82622",
    "OperatorID": 157,
    "OperatorsReference": "NewMotion ICUEVE000547",
    "UsageCost": "0.00 jaarabonnement",
    "AddressInfo": {
        "ID": 63380,
        "Title": "Tuinstraat",
        "AddressLine1": "Tuinstraat",
        "Town": "'s-Hertogenbosch",
        "Postcode": "5241 AA",
        "CountryID": 159,
        "Latitude": 51.7110762,
        "Longitude": 5.35306689999993,
        "ContactTelephone1": "088 0109500",
        "RelatedURL": "http://thenewmotion.nl/",
        "DistanceUnit": 0
    },
    "Connections": [
        {
            "ID": 80145,
            "ConnectionTypeID": 25,
            "LevelID": 2,
            "PowerKW": 22,
            "CurrentTypeID": 10
        }
    ],
    "NumberOfPoints": 2,
    "StatusTypeID": 50,
    "DateLastStatusUpdate": "2016-06-04T02:40:00Z",
    "DataQualityLevel": 3,
    "DateCreated": "2016-03-03T12:29:00Z",
    "SubmissionStatusTypeID": 100
}