{
    "IsRecentlyVerified": false,
    "ID": 93976,
    "UUID": "D10E22FC-1A1E-433A-A3D5-80F29EE6A682",
    "DataProviderID": 1,
    "OperatorID": 23,
    "OperatorsReference": "36246",
    "UsageTypeID": 4,
    "AddressInfo": {
        "ID": 94322,
        "Title": "Brasserie Dunham",
        "AddressLine1": "3809 Rue Principale",
        "Town": "Dunham",
        "StateOrProvince": "Québec",
        "Postcode": "J0E 1M0",
        "CountryID": 44,
        "Latitude": 45.130539,
        "Longitude": -72.800473,
        "ContactTelephone1": "(450) 295-1500",
        "DistanceUnit": 0
    },
    "Connections": [
        {
            "ID": 133030,
            "ConnectionTypeID": 30,
            "StatusTypeID": 50,
            "LevelID": 2,
            "PowerKW": 16,
            "CurrentTypeID": 20,
            "Quantity": 1
        }
    ],
    "NumberOfPoints": 1,
    "GeneralComments": "1 Tesla Connector, up to 16kW.Available for customers. Please see front desk.",
    "StatusTypeID": 50,
    "DateLastStatusUpdate": "2017-10-14T05:32:00Z",
    "DataQualityLevel": 1,
    "DateCreated": "2017-10-14T05:32:00Z",
    "SubmissionStatusTypeID": 200
}