{
    "IsRecentlyVerified": false,
    "ID": 182381,
    "UUID": "3BF46B36-51AC-41EE-9AC0-7C620B68E63F",
    "DataProviderID": 29,
    "DataProvidersReference": "14210,9330",
    "OperatorID": 235,
    "AddressInfo": {
        "ID": 182740,
        "Title": "Höherweg 200",
        "AddressLine1": "Höherweg 200",
        "Town": "Düsseldorf",
        "Postcode": "40233",
        "CountryID": 87,
        "Latitude": 51.222505,
        "Longitude": 6.818261,
        "DistanceUnit": 0
    },
    "Connections": [
        {
            "ID": 288040,
            "ConnectionTypeID": 25,
            "StatusTypeID": 50,
            "LevelID": 2,
            "PowerKW": 22,
            "CurrentTypeID": 20
        },
        {
            "ID": 288041,
            "ConnectionTypeID": 25,
            "StatusTypeID": 50,
            "LevelID": 2,
            "PowerKW": 22,
            "CurrentTypeID": 20
        },
        {
            "ID": 288042,
            "ConnectionTypeID": 25,
            "StatusTypeID": 50,
            "LevelID": 2,
            "PowerKW": 22,
            "CurrentTypeID": 20
        },
        {
            "ID": 288043,
            "ConnectionTypeID": 25,
            "StatusTypeID": 50,
            "LevelID": 2,
            "PowerKW": 22,
            "CurrentTypeID": 20
        }
    ],
    "StatusTypeID": 50,
    "DateLastStatusUpdate": "2021-07-09T03:22:00Z",
    "MetadataValues": [
        {
            "ID": 14675,
            "MetadataFieldID": 4,
            "ItemValue": "Data from the German chargepoint registry provided by Bundesnetzagentur.de under the CC-BY 4.0 license"
        }
    ],
    "DataQualityLevel": 3,
    "DateCreated": "2021-07-08T10:02:00Z",
    "SubmissionStatusTypeID": 100
}