{
    "IsRecentlyVerified": false,
    "ID": 179778,
    "UUID": "37447016-0A3F-4956-B372-806F80D78A36",
    "DataProviderID": 29,
    "DataProvidersReference": "17803",
    "OperatorID": 45,
    "AddressInfo": {
        "ID": 180137,
        "Title": "Treidlerstraße 1",
        "AddressLine1": "Treidlerstraße 1",
        "Town": "Edingen-Neckarhausen",
        "Postcode": "68535",
        "CountryID": 87,
        "Latitude": 49.456296,
        "Longitude": 8.595477,
        "DistanceUnit": 0
    },
    "Connections": [
        {
            "ID": 282041,
            "ConnectionTypeID": 25,
            "StatusTypeID": 50,
            "LevelID": 2,
            "PowerKW": 22,
            "CurrentTypeID": 20
        },
        {
            "ID": 282042,
            "ConnectionTypeID": 25,
            "StatusTypeID": 50,
            "LevelID": 2,
            "PowerKW": 22,
            "CurrentTypeID": 20
        }
    ],
    "StatusTypeID": 50,
    "DateLastStatusUpdate": "2021-07-09T03:17:00Z",
    "MetadataValues": [
        {
            "ID": 12072,
            "MetadataFieldID": 4,
            "ItemValue": "Data from the German chargepoint registry provided by Bundesnetzagentur.de under the CC-BY 4.0 license"
        }
    ],
    "DataQualityLevel": 3,
    "DateCreated": "2021-07-08T09:59:00Z",
    "SubmissionStatusTypeID": 100
}