{
    "UserComments": [
        {
            "ID": 23101,
            "ChargePointID": 130101,
            "CommentTypeID": 10,
            "UserName": "algi",
            "Comment": "Sorry, was suppose to say in last post that car park will be closed for 9 months from 17 Aug 2020",
            "Rating": 1,
            "DateCreated": "2020-08-17T18:48:42.25Z",
            "User": {
                "ID": 19806,
                "Username": "algi"
            },
            "CheckinStatusTypeID": 120,
            "IsActionedByEditor": false
        },
        {
            "ID": 23100,
            "ChargePointID": 130101,
            "CommentTypeID": 1000,
            "UserName": "algi",
            "Comment": "Charge point 50750 in Harbour Road Car Park, Eyemouth is no longer available as car park has been closed for major engineering works for installation of storm drains. A new replacement charge point is suppose to be installed in Manse Road, Eyemouth but when this will happen is anyones guess.",
            "Rating": 1,
            "DateCreated": "2020-08-17T18:46:09.877Z",
            "User": {
                "ID": 19806,
                "Username": "algi"
            },
            "CheckinStatusTypeID": 120,
            "IsActionedByEditor": false
        }
    ],
    "IsRecentlyVerified": false,
    "ID": 130101,
    "UUID": "12AE3104-0B75-4327-836A-BC433E650FE2",
    "DataProviderID": 1,
    "OperatorID": 3315,
    "OperatorsReference": "50750",
    "UsageTypeID": 4,
    "UsageCost": "Free",
    "AddressInfo": {
        "ID": 130447,
        "Title": "Harbour Road Car Park, Eyemouth",
        "AddressLine1": "Harbour Road Car Park",
        "Town": "Eyemouth",
        "StateOrProvince": "Scottish Borders",
        "Postcode": "TD14 5JB",
        "CountryID": 1,
        "Latitude": 55.870047,
        "Longitude": -2.089961,
        "DistanceUnit": 0
    },
    "Connections": [
        {
            "ID": 182108,
            "ConnectionTypeID": 2,
            "StatusTypeID": 50,
            "LevelID": 3,
            "PowerKW": 50,
            "CurrentTypeID": 30,
            "Quantity": 1
        },
        {
            "ID": 182109,
            "ConnectionTypeID": 33,
            "StatusTypeID": 50,
            "LevelID": 3,
            "PowerKW": 50,
            "CurrentTypeID": 30,
            "Quantity": 1
        },
        {
            "ID": 182110,
            "ConnectionTypeID": 1036,
            "StatusTypeID": 50,
            "LevelID": 3,
            "PowerKW": 43,
            "CurrentTypeID": 20,
            "Quantity": 1
        }
    ],
    "NumberOfPoints": 1,
    "StatusTypeID": 50,
    "DateLastStatusUpdate": "2020-08-17T18:49:00Z",
    "DataQualityLevel": 1,
    "DateCreated": "2019-08-01T05:15:00Z",
    "SubmissionStatusTypeID": 200
}