{
    "IsRecentlyVerified": false,
    "ID": 20129,
    "UUID": "3D2CB8CD-9B18-47D8-8039-620972576FED",
    "DataProviderID": 1,
    "OperatorID": 1,
    "UsageTypeID": 0,
    "UsageCost": "",
    "AddressInfo": {
        "ID": 20474,
        "Title": "Nissan - Estancarbon",
        "AddressLine1": "rue du Pic du midi",
        "AddressLine2": "",
        "Town": "",
        "StateOrProvince": "ESTANCARBON",
        "Postcode": "31800",
        "CountryID": 80,
        "Latitude": 43.11388,
        "Longitude": 0.75951,
        "ContactTelephone1": "",
        "ContactTelephone2": "",
        "ContactEmail": "",
        "AccessComments": "Ouvert à tous",
        "RelatedURL": "",
        "DistanceUnit": 0
    },
    "Connections": [],
    "GeneralComments": "",
    "StatusTypeID": 50,
    "DateLastStatusUpdate": "2013-11-04T12:40:00Z",
    "DataQualityLevel": 1,
    "DateCreated": "2013-11-04T00:02:00Z",
    "SubmissionStatusTypeID": 200
}