{
    "IsRecentlyVerified": false,
    "ID": 23237,
    "UUID": "D041FEA6-B56F-45D1-9AAD-37A74649B988",
    "DataProviderID": 1,
    "OperatorID": 76,
    "UsageTypeID": 1,
    "UsageCost": "5€/up to 60min",
    "AddressInfo": {
        "ID": 23582,
        "Title": "Ahja",
        "AddressLine1": "Tartu road",
        "Town": "Ahja vald",
        "StateOrProvince": "Põlva maakond",
        "Postcode": "63710",
        "CountryID": 74,
        "Latitude": 58.20896772142922,
        "Longitude": 27.07475382430085,
        "ContactTelephone1": "+372 6511911",
        "ContactEmail": "tugi@elmo.ee",
        "RelatedURL": "http://www.elmo.ee/en",
        "DistanceUnit": 0
    },
    "Connections": [
        {
            "ID": 25059,
            "ConnectionTypeID": 2,
            "StatusTypeID": 50,
            "LevelID": 3,
            "Amps": 120,
            "Voltage": 500,
            "PowerKW": 50,
            "CurrentTypeID": 30,
            "Quantity": 1
        },
        {
            "ID": 25060,
            "ConnectionTypeID": 25,
            "StatusTypeID": 50,
            "LevelID": 2,
            "Amps": 32,
            "Voltage": 400,
            "PowerKW": 22,
            "CurrentTypeID": 20,
            "Quantity": 1
        }
    ],
    "NumberOfPoints": 1,
    "GeneralComments": "Opened 24h (automatic). \r\nReal-time condition information (operational/not operational/free) - www.elmo.ee \r\nCan pay with client card, SMS or mobile application. \r\nCharger number 65104.",
    "StatusTypeID": 50,
    "DateLastStatusUpdate": "2014-05-05T16:37:00Z",
    "DataQualityLevel": 1,
    "DateCreated": "2014-05-05T16:37:00Z",
    "SubmissionStatusTypeID": 200
}