{
    "UserComments": [
        {
            "ID": 24838,
            "ChargePointID": 189178,
            "CommentTypeID": 10,
            "UserName": "ForumElettrico.it",
            "Comment": "Nelle vicinanze non c'è molto, nell'area di servizio c'è solo un distributore automatico. Leggi la recensione completa qui:  https://www.forumelettrico.it/forum/be-charge-fast-tamoil-pesaro-via-sandro-pertini-2502-dir-est-t16590.html",
            "RelatedURL": "https://www.forumelettrico.it/forum/be-charge-fast-tamoil-pesaro-via-sandro-pertini-2502-dir-est-t16590.html",
            "DateCreated": "2021-09-12T06:07:45.697Z",
            "User": {
                "ID": 11749,
                "Username": "ForumElettrico.it"
            },
            "CheckinStatusTypeID": 10,
            "IsActionedByEditor": false
        }
    ],
    "MediaItems": [
        {
            "ID": 29234,
            "ChargePointID": 189178,
            "ItemURL": "https://s3-ap-southeast-2.amazonaws.com/openchargemap/images/IT/OCM189178/OCM-189178.orig.2021091206075517.jpg",
            "ItemThumbnailURL": "https://s3-ap-southeast-2.amazonaws.com/openchargemap/images/IT/OCM189178/OCM-189178.thmb.2021091206075517.jpg",
            "Comment": "",
            "IsEnabled": true,
            "IsVideo": false,
            "IsFeaturedItem": false,
            "IsExternalResource": false,
            "User": {
                "ID": 11749,
                "Username": "ForumElettrico.it"
            },
            "DateCreated": "2021-09-12T06:08:00Z"
        },
        {
            "ID": 29235,
            "ChargePointID": 189178,
            "ItemURL": "https://s3-ap-southeast-2.amazonaws.com/openchargemap/images/IT/OCM189178/OCM-189178.orig.2021091206080127.jpg",
            "ItemThumbnailURL": "https://s3-ap-southeast-2.amazonaws.com/openchargemap/images/IT/OCM189178/OCM-189178.thmb.2021091206080127.jpg",
            "Comment": "",
            "IsEnabled": true,
            "IsVideo": false,
            "IsFeaturedItem": false,
            "IsExternalResource": false,
            "User": {
                "ID": 11749,
                "Username": "ForumElettrico.it"
            },
            "DateCreated": "2021-09-12T06:08:00Z"
        },
        {
            "ID": 29236,
            "ChargePointID": 189178,
            "ItemURL": "https://s3-ap-southeast-2.amazonaws.com/openchargemap/images/IT/OCM189178/OCM-189178.orig.2021091206080719.jpg",
            "ItemThumbnailURL": "https://s3-ap-southeast-2.amazonaws.com/openchargemap/images/IT/OCM189178/OCM-189178.thmb.2021091206080719.jpg",
            "Comment": "",
            "IsEnabled": true,
            "IsVideo": false,
            "IsFeaturedItem": false,
            "IsExternalResource": false,
            "User": {
                "ID": 11749,
                "Username": "ForumElettrico.it"
            },
            "DateCreated": "2021-09-12T06:08:00Z"
        },
        {
            "ID": 29237,
            "ChargePointID": 189178,
            "ItemURL": "https://s3-ap-southeast-2.amazonaws.com/openchargemap/images/IT/OCM189178/OCM-189178.orig.2021091206081268.jpg",
            "ItemThumbnailURL": "https://s3-ap-southeast-2.amazonaws.com/openchargemap/images/IT/OCM189178/OCM-189178.thmb.2021091206081268.jpg",
            "Comment": "",
            "IsEnabled": true,
            "IsVideo": false,
            "IsFeaturedItem": false,
            "IsExternalResource": false,
            "User": {
                "ID": 11749,
                "Username": "ForumElettrico.it"
            },
            "DateCreated": "2021-09-12T06:08:00Z"
        },
        {
            "ID": 29238,
            "ChargePointID": 189178,
            "ItemURL": "https://s3-ap-southeast-2.amazonaws.com/openchargemap/images/IT/OCM189178/OCM-189178.orig.2021091206081884.jpg",
            "ItemThumbnailURL": "https://s3-ap-southeast-2.amazonaws.com/openchargemap/images/IT/OCM189178/OCM-189178.thmb.2021091206081884.jpg",
            "Comment": "",
            "IsEnabled": true,
            "IsVideo": false,
            "IsFeaturedItem": false,
            "IsExternalResource": false,
            "User": {
                "ID": 11749,
                "Username": "ForumElettrico.it"
            },
            "DateCreated": "2021-09-12T06:08:00Z"
        }
    ],
    "IsRecentlyVerified": true,
    "DateLastVerified": "2021-09-12T06:03:00Z",
    "ID": 189178,
    "UUID": "95225691-B08D-46FD-97C5-CA4CD3F1C7F9",
    "DataProviderID": 1,
    "OperatorID": 3327,
    "UsageTypeID": 1,
    "AddressInfo": {
        "ID": 189537,
        "Title": "Be Charge AdS Tamoil",
        "AddressLine1": "Via Sandro Pertini 2502 (verso est)",
        "Town": "Pesaro",
        "StateOrProvince": "PU",
        "CountryID": 112,
        "Latitude": 43.890896,
        "Longitude": 12.891125,
        "RelatedURL": "https://www.forumelettrico.it/forum/be-charge-fast-tamoil-pesaro-via-sandro-pertini-2502-dir-est-t16590.html",
        "DistanceUnit": 0
    },
    "Connections": [
        {
            "ID": 305846,
            "ConnectionTypeID": 33,
            "LevelID": 2,
            "PowerKW": 75
        },
        {
            "ID": 305847,
            "ConnectionTypeID": 2,
            "LevelID": 2,
            "PowerKW": 63
        },
        {
            "ID": 305848,
            "ConnectionTypeID": 1036,
            "LevelID": 2,
            "PowerKW": 22
        }
    ],
    "NumberOfPoints": 1,
    "StatusTypeID": 50,
    "DateLastStatusUpdate": "2021-09-12T06:08:00Z",
    "DataQualityLevel": 1,
    "DateCreated": "2021-09-12T06:03:00Z",
    "SubmissionStatusTypeID": 200
}