{
    "IsRecentlyVerified": false,
    "ID": 109346,
    "UUID": "A926B448-D5F5-4509-B741-BAADEF787A11",
    "DataProviderID": 1,
    "OperatorID": 23,
    "OperatorsReference": "44966",
    "UsageTypeID": 4,
    "AddressInfo": {
        "ID": 109692,
        "Title": "Mains of Newhall",
        "AddressLine1": "Mains of Newhall",
        "StateOrProvince": "Dingwall",
        "Postcode": "IV7 8LQ",
        "CountryID": 1,
        "Latitude": 57.657867,
        "Longitude": -4.175886,
        "ContactTelephone1": " +44 138 161 0213",
        "DistanceUnit": 0
    },
    "Connections": [
        {
            "ID": 154464,
            "ConnectionTypeID": 30,
            "StatusTypeID": 50,
            "LevelID": 2,
            "Amps": 32,
            "Voltage": 400,
            "PowerKW": 22,
            "CurrentTypeID": 20,
            "Quantity": 2
        }
    ],
    "NumberOfPoints": 2,
    "GeneralComments": "2 Tesla Connectors, up to 22kW.Available for customers. Self park.",
    "StatusTypeID": 50,
    "DateLastStatusUpdate": "2018-10-11T14:30:00Z",
    "DataQualityLevel": 1,
    "DateCreated": "2018-10-11T14:30:00Z",
    "SubmissionStatusTypeID": 200
}