{
    "IsRecentlyVerified": false,
    "ID": 33090,
    "UUID": "C8372755-11BE-47E8-B8D7-4B52D5325707",
    "DataProviderID": 1,
    "OperatorID": 105,
    "OperatorsReference": "Essent EM-DE-05913000-01-00024",
    "UsageTypeID": 4,
    "AddressInfo": {
        "ID": 33436,
        "Title": "Dudenstraße",
        "AddressLine1": "Dudenstraße",
        "Town": "Dortmund",
        "Postcode": "44137",
        "CountryID": 87,
        "Latitude": 51.508797,
        "Longitude": 7.458129,
        "DistanceUnit": 0
    },
    "Connections": [
        {
            "ID": 36601,
            "ConnectionTypeID": 25,
            "LevelID": 2,
            "PowerKW": 11
        },
        {
            "ID": 46666,
            "ConnectionTypeID": 25,
            "LevelID": 2,
            "PowerKW": 11
        }
    ],
    "NumberOfPoints": 1,
    "StatusTypeID": 50,
    "DateLastStatusUpdate": "2015-04-13T15:00:00Z",
    "DataQualityLevel": 3,
    "DateCreated": "2015-01-09T06:04:00Z",
    "SubmissionStatusTypeID": 200
}