{
    "IsRecentlyVerified": false,
    "ID": 50558,
    "UUID": "2E307EEA-E56A-41A7-B8A0-5E1E80A37057",
    "DataProviderID": 26,
    "DataProvidersReference": "63499",
    "OperatorID": 73,
    "OperatorsReference": "EV-Box EVB-P1445011",
    "UsageCost": "0.00 jaarabonnement",
    "AddressInfo": {
        "ID": 50904,
        "Title": "Metternicher Straße 4",
        "AddressLine1": "Metternicher Straße 4",
        "Town": "Weilerswist",
        "Postcode": "53919",
        "CountryID": 87,
        "Latitude": 50.75283,
        "Longitude": 6.85308,
        "RelatedURL": "http://www.ev-box.nl",
        "DistanceUnit": 0
    },
    "Connections": [
        {
            "ID": 62303,
            "ConnectionTypeID": 25,
            "LevelID": 2,
            "PowerKW": 11,
            "CurrentTypeID": 10
        },
        {
            "ID": 62304,
            "ConnectionTypeID": 25,
            "LevelID": 2,
            "PowerKW": 11,
            "CurrentTypeID": 10
        },
        {
            "ID": 62305,
            "ConnectionTypeID": 25,
            "LevelID": 2,
            "PowerKW": 11,
            "CurrentTypeID": 10
        }
    ],
    "NumberOfPoints": 1,
    "StatusTypeID": 50,
    "DateLastStatusUpdate": "2016-06-04T02:38:00Z",
    "DataQualityLevel": 3,
    "DateCreated": "2015-07-22T09:53:00Z",
    "SubmissionStatusTypeID": 100
}