{
    "IsRecentlyVerified": false,
    "ID": 166997,
    "UUID": "952CD8CA-3FC4-4D42-BE07-4E49C31394E7",
    "DataProviderID": 18,
    "DataProvidersReference": "bebf4e0937d36653f44f9c7eb4e715ea",
    "OperatorID": 25,
    "UsageTypeID": 4,
    "AddressInfo": {
        "ID": 167356,
        "Title": "3 Yew Tree Bottom Road",
        "AddressLine1": "3 Yew Tree Bottom Road",
        "Town": "Epsom",
        "Postcode": "KT18 5UX",
        "CountryID": 1,
        "Latitude": 51.315568,
        "Longitude": -0.231359,
        "AccessComments": "",
        "RelatedURL": "https://www.sourcelondon.net",
        "DistanceUnit": 0
    },
    "Connections": [
        {
            "ID": 252824,
            "ConnectionTypeID": 25,
            "Reference": "1",
            "StatusTypeID": 50,
            "LevelID": 2,
            "Amps": 32,
            "Voltage": 230,
            "PowerKW": 7,
            "CurrentTypeID": 10
        },
        {
            "ID": 252825,
            "ConnectionTypeID": 25,
            "Reference": "2",
            "StatusTypeID": 50,
            "LevelID": 2,
            "Amps": 32,
            "Voltage": 230,
            "PowerKW": 7,
            "CurrentTypeID": 10
        }
    ],
    "StatusTypeID": 0,
    "DateLastStatusUpdate": "2020-08-27T08:10:00Z",
    "MetadataValues": [
        {
            "ID": 7754,
            "MetadataFieldID": 4,
            "ItemValue": "Contains public sector information licensed under the Open Government Licence v2.0. http://www.nationalarchives.gov.uk/doc/open-government-licence/version/2/"
        }
    ],
    "DataQualityLevel": 3,
    "DateCreated": "2020-08-27T08:10:00Z",
    "SubmissionStatusTypeID": 100
}