{
    "IsRecentlyVerified": false,
    "ID": 136437,
    "UUID": "D37C6015-FF1B-4DA0-AE50-94AB10E6455E",
    "DataProviderID": 18,
    "DataProvidersReference": "3ee9103dcaab55d5ff8d5a1bcc25b8d8",
    "OperatorID": 2244,
    "UsageTypeID": 5,
    "AddressInfo": {
        "ID": 136783,
        "Title": "11 Priory Road",
        "AddressLine1": "11 Priory Road",
        "Town": "London",
        "Postcode": "NW6 4NN",
        "CountryID": 1,
        "Latitude": 51.539121,
        "Longitude": -0.190679,
        "AccessComments": "",
        "RelatedURL": "https://www.ubitricity.com",
        "DistanceUnit": 0
    },
    "Connections": [
        {
            "ID": 190885,
            "ConnectionTypeID": 25,
            "Reference": "suby1100001894",
            "StatusTypeID": 50,
            "LevelID": 2,
            "Amps": 16,
            "Voltage": 230,
            "PowerKW": 3.7,
            "CurrentTypeID": 10
        }
    ],
    "StatusTypeID": 0,
    "DateLastStatusUpdate": "2021-04-25T05:46:00Z",
    "MetadataValues": [
        {
            "ID": 6289,
            "MetadataFieldID": 4,
            "ItemValue": "Contains public sector information licensed under the Open Government Licence v2.0. http://www.nationalarchives.gov.uk/doc/open-government-licence/version/2/"
        }
    ],
    "DataQualityLevel": 3,
    "DateCreated": "2019-12-24T05:22:00Z",
    "SubmissionStatusTypeID": 100
}