{
    "IsRecentlyVerified": false,
    "ID": 97057,
    "UUID": "B4696011-EA0A-47B6-BCF3-C68D4679FAAB",
    "DataProviderID": 1,
    "DataProvidersReference": "4432",
    "AddressInfo": {
        "ID": 97403,
        "Title": "Kirkegata 41",
        "AddressLine1": "Kirkegata 41",
        "Town": "LILLEHAMMER",
        "StateOrProvince": "Innlandet",
        "Postcode": "2626",
        "CountryID": 168,
        "Latitude": 61.11285,
        "Longitude": 10.4657,
        "AccessComments": "Kulturhuset Bank parkeringsplass",
        "DistanceUnit": 0
    },
    "Connections": [
        {
            "ID": 137717,
            "ConnectionTypeID": 0,
            "Reference": "1",
            "LevelID": 2,
            "Amps": 16,
            "Voltage": 230,
            "PowerKW": 3.7,
            "Comments": "Mode 3"
        },
        {
            "ID": 137718,
            "ConnectionTypeID": 0,
            "Reference": "2",
            "LevelID": 2,
            "Amps": 16,
            "Voltage": 230,
            "PowerKW": 3.7,
            "Comments": "Mode 3"
        },
        {
            "ID": 137719,
            "ConnectionTypeID": 0,
            "Reference": "3",
            "LevelID": 2,
            "Amps": 16,
            "Voltage": 230,
            "PowerKW": 3.7,
            "Comments": "Mode 3"
        },
        {
            "ID": 137720,
            "ConnectionTypeID": 0,
            "Reference": "4",
            "LevelID": 2,
            "Amps": 16,
            "Voltage": 230,
            "PowerKW": 3.7,
            "Comments": "Mode 3"
        }
    ],
    "NumberOfPoints": 4,
    "DateLastStatusUpdate": "2020-05-26T08:24:00Z",
    "DataQualityLevel": 2,
    "DateCreated": "2018-01-04T08:28:00Z",
    "SubmissionStatusTypeID": 100
}