{
    "IsRecentlyVerified": false,
    "ID": 186509,
    "UUID": "8BBB1B65-3E06-41A7-8EC8-6166CC5D1ACE",
    "DataProviderID": 29,
    "DataProvidersReference": "10484",
    "OperatorID": 159,
    "AddressInfo": {
        "ID": 186868,
        "Title": "Meesmannstr. 47",
        "AddressLine1": "Meesmannstr. 47",
        "Town": "Witten",
        "Postcode": "58456",
        "CountryID": 87,
        "Latitude": 51.4225,
        "Longitude": 7.281421,
        "DistanceUnit": 0
    },
    "Connections": [
        {
            "ID": 299337,
            "ConnectionTypeID": 25,
            "StatusTypeID": 50,
            "LevelID": 2,
            "PowerKW": 22,
            "CurrentTypeID": 20
        },
        {
            "ID": 299338,
            "ConnectionTypeID": 25,
            "StatusTypeID": 50,
            "LevelID": 2,
            "PowerKW": 22,
            "CurrentTypeID": 20
        }
    ],
    "StatusTypeID": 50,
    "DateLastStatusUpdate": "2021-07-12T02:47:00Z",
    "MetadataValues": [
        {
            "ID": 18750,
            "MetadataFieldID": 4,
            "ItemValue": "Data from the German chargepoint registry provided by Bundesnetzagentur.de under the CC-BY 4.0 license"
        }
    ],
    "DataQualityLevel": 3,
    "DateCreated": "2021-07-12T02:47:00Z",
    "SubmissionStatusTypeID": 100
}