{
    "IsRecentlyVerified": false,
    "ID": 36016,
    "UUID": "7CF04AD3-3037-4DDF-94C1-4C21EE492AD4",
    "DataProviderID": 26,
    "DataProvidersReference": "52756",
    "OperatorID": 180,
    "OperatorsReference": "Alfen GDH2331",
    "UsageCost": "0.00 jaarabonnement",
    "AddressInfo": {
        "ID": 36362,
        "Title": "Zeezwaluwstraat 70",
        "AddressLine1": "Zeezwaluwstraat 70",
        "Town": "Den Haag",
        "Postcode": "2583 RV",
        "CountryID": 159,
        "Latitude": 52.092352,
        "Longitude": 4.261207,
        "ContactTelephone1": "036 - 549 34 00",
        "RelatedURL": "http://www.icu-charging-stations.com/",
        "DistanceUnit": 0
    },
    "Connections": [
        {
            "ID": 39527,
            "ConnectionTypeID": 25,
            "LevelID": 2,
            "PowerKW": 11,
            "CurrentTypeID": 10
        },
        {
            "ID": 48180,
            "ConnectionTypeID": 25,
            "LevelID": 2,
            "PowerKW": 11,
            "CurrentTypeID": 10
        }
    ],
    "NumberOfPoints": 1,
    "StatusTypeID": 50,
    "DateLastStatusUpdate": "2016-06-04T02:50:00Z",
    "DataQualityLevel": 3,
    "DateCreated": "2015-01-09T06:05:00Z",
    "SubmissionStatusTypeID": 100
}