{
    "IsRecentlyVerified": false,
    "ID": 63840,
    "UUID": "67896ADC-39BD-4AD0-8512-C95E92FDEB06",
    "DataProviderID": 26,
    "DataProvidersReference": "77856",
    "OperatorID": 103,
    "OperatorsReference": "Allego NLALLEGO0006451",
    "UsageCost": "0.00 jaarabonnement",
    "AddressInfo": {
        "ID": 64186,
        "Title": "Spinner 20",
        "AddressLine1": "Spinner 20",
        "Town": "Haarlemmermeer",
        "Postcode": "2152 AX",
        "CountryID": 159,
        "Latitude": 52.271974,
        "Longitude": 4.636151,
        "ContactTelephone1": "0800-3745337",
        "RelatedURL": "http://www.allego.eu/",
        "DistanceUnit": 0
    },
    "Connections": [
        {
            "ID": 81562,
            "ConnectionTypeID": 25,
            "LevelID": 2,
            "PowerKW": 11,
            "CurrentTypeID": 10
        },
        {
            "ID": 81563,
            "ConnectionTypeID": 25,
            "LevelID": 2,
            "PowerKW": 11,
            "CurrentTypeID": 10
        }
    ],
    "NumberOfPoints": 1,
    "StatusTypeID": 50,
    "DateLastStatusUpdate": "2016-06-04T02:52:00Z",
    "DataQualityLevel": 3,
    "DateCreated": "2016-03-03T12:32:00Z",
    "SubmissionStatusTypeID": 100
}