{
    "IsRecentlyVerified": false,
    "ID": 185966,
    "UUID": "6BE60760-8787-416F-8567-7BFBB64AB7AB",
    "DataProviderID": 29,
    "DataProvidersReference": "2886",
    "AddressInfo": {
        "ID": 186325,
        "Title": "Schimsheimer Straße 36",
        "AddressLine1": "Schimsheimer Straße 36",
        "Town": "Wallertheim",
        "Postcode": "55578",
        "CountryID": 87,
        "Latitude": 49.83163,
        "Longitude": 8.05418,
        "DistanceUnit": 0
    },
    "Connections": [
        {
            "ID": 297339,
            "ConnectionTypeID": 25,
            "StatusTypeID": 50,
            "LevelID": 2,
            "PowerKW": 22,
            "CurrentTypeID": 20
        }
    ],
    "StatusTypeID": 50,
    "DateLastStatusUpdate": "2021-07-12T02:44:00Z",
    "MetadataValues": [
        {
            "ID": 18208,
            "MetadataFieldID": 4,
            "ItemValue": "Data from the German chargepoint registry provided by Bundesnetzagentur.de under the CC-BY 4.0 license"
        }
    ],
    "DataQualityLevel": 3,
    "DateCreated": "2021-07-12T02:44:00Z",
    "SubmissionStatusTypeID": 100
}