{
    "IsRecentlyVerified": false,
    "ID": 112964,
    "UUID": "A20F953D-0164-49B5-929F-4A2EB09E1BB2",
    "DataProviderID": 1,
    "OperatorID": 80,
    "UsageTypeID": 4,
    "AddressInfo": {
        "ID": 113310,
        "Title": " Garage Sant'Orsola | EnelX",
        "AddressLine1": "Via Sant'Orsola, 2R",
        "Town": "Firenze",
        "StateOrProvince": "FI",
        "Postcode": "50123 ",
        "CountryID": 112,
        "Latitude": 43.7770835162961,
        "Longitude": 11.2551710393836,
        "ContactTelephone1": "055 281893",
        "ContactEmail": "info@autoservizi.firenze.it",
        "RelatedURL": "http://www.autoservizi.firenze.it/garage-santorsola/",
        "DistanceUnit": 0
    },
    "Connections": [
        {
            "ID": 159108,
            "ConnectionTypeID": 25,
            "StatusTypeID": 50,
            "LevelID": 2,
            "Amps": 32,
            "Voltage": 400,
            "PowerKW": 22,
            "CurrentTypeID": 20,
            "Quantity": 4
        }
    ],
    "NumberOfPoints": 4,
    "GeneralComments": "Garage a pagamento  Lun-Dom 7:00-12:00 / 14.00 -19.00",
    "StatusTypeID": 50,
    "DateLastStatusUpdate": "2019-07-25T15:01:00Z",
    "DataQualityLevel": 1,
    "DateCreated": "2018-11-27T16:41:00Z",
    "SubmissionStatusTypeID": 200
}