{
    "IsRecentlyVerified": false,
    "ID": 180935,
    "UUID": "6DF0AF86-482F-4024-8575-B56632CD4670",
    "DataProviderID": 29,
    "DataProvidersReference": "11318",
    "AddressInfo": {
        "ID": 181294,
        "Title": "Am Spitzacker 1",
        "AddressLine1": "Am Spitzacker 1",
        "Town": "Karben",
        "Postcode": "61184",
        "CountryID": 87,
        "Latitude": 50.24299,
        "Longitude": 8.74872,
        "DistanceUnit": 0
    },
    "Connections": [
        {
            "ID": 284638,
            "ConnectionTypeID": 25,
            "StatusTypeID": 50,
            "LevelID": 2,
            "PowerKW": 22,
            "CurrentTypeID": 20
        },
        {
            "ID": 284639,
            "ConnectionTypeID": 25,
            "StatusTypeID": 50,
            "LevelID": 2,
            "PowerKW": 22,
            "CurrentTypeID": 20
        }
    ],
    "StatusTypeID": 50,
    "DateLastStatusUpdate": "2021-07-09T03:19:00Z",
    "MetadataValues": [
        {
            "ID": 13229,
            "MetadataFieldID": 4,
            "ItemValue": "Data from the German chargepoint registry provided by Bundesnetzagentur.de under the CC-BY 4.0 license"
        }
    ],
    "DataQualityLevel": 3,
    "DateCreated": "2021-07-08T10:01:00Z",
    "SubmissionStatusTypeID": 100
}