{
    "IsRecentlyVerified": false,
    "ID": 132455,
    "UUID": "E77DE39B-D441-4293-95C5-1BF4B9E506B5",
    "DataProviderID": 1,
    "OperatorID": 3341,
    "OperatorsReference": "SEC20003",
    "UsageTypeID": 5,
    "UsageCost": "£0.31/kWh",
    "AddressInfo": {
        "ID": 132801,
        "Title": "Severn Road Car Park ",
        "AddressLine1": "Severn Road",
        "Town": "Cardiff",
        "Postcode": "CF11 9DX",
        "CountryID": 1,
        "Latitude": 51.48201,
        "Longitude": -3.19883,
        "RelatedURL": "http://www.aptcontrols.co.uk",
        "DistanceUnit": 0
    },
    "Connections": [
        {
            "ID": 185453,
            "ConnectionTypeID": 25,
            "Reference": "1",
            "StatusTypeID": 50,
            "LevelID": 2,
            "Amps": 32,
            "Voltage": 230,
            "PowerKW": 7,
            "CurrentTypeID": 10,
            "Quantity": 2
        }
    ],
    "NumberOfPoints": 2,
    "StatusTypeID": 50,
    "DateLastStatusUpdate": "2019-10-02T08:31:00Z",
    "MetadataValues": [
        {
            "ID": 4955,
            "MetadataFieldID": 4,
            "ItemValue": "Contains public sector information licensed under the Open Government Licence v2.0. http://www.nationalarchives.gov.uk/doc/open-government-licence/version/2/"
        }
    ],
    "DataQualityLevel": 3,
    "DateCreated": "2019-09-30T18:20:00Z",
    "SubmissionStatusTypeID": 200
}