{
    "IsRecentlyVerified": false,
    "ID": 43508,
    "UUID": "0A634ECE-9F0C-4B3C-89F4-FE326F1E4C34",
    "DataProviderID": 1,
    "OperatorID": 69,
    "UsageTypeID": 4,
    "AddressInfo": {
        "ID": 43854,
        "Title": "Stadthaus",
        "AddressLine1": "Natruper-Tor-Wall 2",
        "Town": "Osnabrück",
        "StateOrProvince": "Osnabrück",
        "Postcode": "49076",
        "CountryID": 87,
        "Latitude": 52.2782934174458,
        "Longitude": 8.03720123133941,
        "ContactTelephone1": "+49 541 20022002",
        "AccessComments": "Auf dem Parkstreifen vor dem Haupteingang. 24/7 nutzbar, 4 kostenlose Parkplätze. Karte von ladenetz oder Roamingpartnern EWE, TNM, ChargeNow, SUN, Vattenfall  etc. nötig",
        "RelatedURL": "http://www.stadtwerke-osnabrueck.de/",
        "DistanceUnit": 0
    },
    "Connections": [
        {
            "ID": 52757,
            "ConnectionTypeID": 25,
            "StatusTypeID": 50,
            "LevelID": 2,
            "Amps": 16,
            "Voltage": 400,
            "PowerKW": 11,
            "CurrentTypeID": 20,
            "Quantity": 6
        },
        {
            "ID": 52758,
            "ConnectionTypeID": 28,
            "StatusTypeID": 50,
            "LevelID": 2,
            "Amps": 16,
            "Voltage": 230,
            "PowerKW": 3.7,
            "CurrentTypeID": 10,
            "Quantity": 6
        }
    ],
    "NumberOfPoints": 4,
    "StatusTypeID": 50,
    "DateLastStatusUpdate": "2015-04-02T09:42:00Z",
    "DataQualityLevel": 1,
    "DateCreated": "2015-04-02T08:59:00Z",
    "SubmissionStatusTypeID": 200
}