{
    "IsRecentlyVerified": false,
    "ID": 144073,
    "UUID": "E172C617-A116-4613-9DD5-10BC3760C6A7",
    "DataProviderID": 2,
    "DataProvidersReference": "95334",
    "OperatorID": 9,
    "UsageTypeID": 1,
    "AddressInfo": {
        "ID": 144425,
        "Title": "PGE - Wilsonville Line Center",
        "AddressLine1": "9480 SW Boeckman Road",
        "Town": "Wilsonville",
        "StateOrProvince": "OR",
        "Postcode": "97070",
        "CountryID": 2,
        "Latitude": 45.316975,
        "Longitude": -122.774526,
        "ContactTelephone1": "888-998-2546",
        "AccessComments": "MON: 24 hours | TUE: 24 hours | WED: 24 hours | THU: 24 hours | FRI: 24 hours | SAT: 24 hours | SUN: 24 hours",
        "RelatedURL": "http://www.blinkcharging.com/",
        "DistanceUnit": 0
    },
    "Connections": [
        {
            "ID": 200540,
            "ConnectionTypeID": 1,
            "LevelID": 2,
            "Amps": 16,
            "Voltage": 230,
            "PowerKW": 3,
            "CurrentTypeID": 10,
            "Quantity": 1
        }
    ],
    "StatusTypeID": 50,
    "DateLastStatusUpdate": "2019-12-24T09:22:00Z",
    "DataQualityLevel": 3,
    "DateCreated": "2019-12-24T09:22:00Z",
    "SubmissionStatusTypeID": 100
}