{
    "IsRecentlyVerified": false,
    "ID": 186803,
    "UUID": "B24352D6-1BC8-45FD-ACB6-F1BB3FE1C20F",
    "DataProviderID": 29,
    "DataProvidersReference": "9067",
    "OperatorID": 86,
    "AddressInfo": {
        "ID": 187162,
        "Title": "Füllenbruchstr. 50",
        "AddressLine1": "Füllenbruchstr. 50",
        "Town": "Herford",
        "Postcode": "32051",
        "CountryID": 87,
        "Latitude": 52.131444,
        "Longitude": 8.658378,
        "DistanceUnit": 0
    },
    "Connections": [
        {
            "ID": 300206,
            "ConnectionTypeID": 33,
            "StatusTypeID": 50,
            "LevelID": 3,
            "PowerKW": 75,
            "CurrentTypeID": 30
        },
        {
            "ID": 300207,
            "ConnectionTypeID": 33,
            "StatusTypeID": 50,
            "LevelID": 3,
            "PowerKW": 75,
            "CurrentTypeID": 30
        }
    ],
    "StatusTypeID": 50,
    "DateLastStatusUpdate": "2021-07-12T02:49:00Z",
    "MetadataValues": [
        {
            "ID": 19044,
            "MetadataFieldID": 4,
            "ItemValue": "Data from the German chargepoint registry provided by Bundesnetzagentur.de under the CC-BY 4.0 license"
        }
    ],
    "DataQualityLevel": 3,
    "DateCreated": "2021-07-12T02:49:00Z",
    "SubmissionStatusTypeID": 100
}