{
    "IsRecentlyVerified": false,
    "ID": 68971,
    "UUID": "1B79E010-A7F4-430E-BD1B-079447021E5D",
    "DataProviderID": 1,
    "DataProvidersReference": "3412",
    "AddressInfo": {
        "ID": 69317,
        "Title": "Serlachius-museo Gösta",
        "AddressLine1": "Joenniementie 38",
        "Town": "Mänttä Keskus",
        "StateOrProvince": "Pirkanmaa",
        "Postcode": "35800",
        "CountryID": 79,
        "Latitude": 62.0279,
        "Longitude": 24.57577,
        "AccessComments": "Museon parkkipaikka",
        "DistanceUnit": 0
    },
    "Connections": [
        {
            "ID": 96760,
            "ConnectionTypeID": 0,
            "Reference": "1",
            "LevelID": 2,
            "Amps": 32,
            "Voltage": 230,
            "PowerKW": 7.4,
            "Comments": "Mode 3"
        },
        {
            "ID": 96761,
            "ConnectionTypeID": 0,
            "Reference": "2",
            "LevelID": 2,
            "Amps": 32,
            "Voltage": 230,
            "PowerKW": 7.4,
            "Comments": "Mode 3"
        }
    ],
    "NumberOfPoints": 2,
    "DateLastStatusUpdate": "2020-05-26T08:25:00Z",
    "DataQualityLevel": 2,
    "DateCreated": "2016-06-25T03:52:00Z",
    "SubmissionStatusTypeID": 100
}