{
    "IsRecentlyVerified": false,
    "ID": 184920,
    "UUID": "3FB4E7E8-93A0-4124-B041-5AAF839062F2",
    "DataProviderID": 29,
    "DataProvidersReference": "8490",
    "OperatorID": 234,
    "AddressInfo": {
        "ID": 185279,
        "Title": "Markgrafenallee 5",
        "AddressLine1": "Markgrafenallee 5",
        "Town": "Bayreuth",
        "Postcode": "95448",
        "CountryID": 87,
        "Latitude": 49.95072,
        "Longitude": 11.5826,
        "DistanceUnit": 0
    },
    "Connections": [
        {
            "ID": 293785,
            "ConnectionTypeID": 25,
            "StatusTypeID": 50,
            "LevelID": 2,
            "PowerKW": 22,
            "CurrentTypeID": 20
        },
        {
            "ID": 293786,
            "ConnectionTypeID": 25,
            "StatusTypeID": 50,
            "LevelID": 2,
            "PowerKW": 22,
            "CurrentTypeID": 20
        }
    ],
    "StatusTypeID": 50,
    "DateLastStatusUpdate": "2021-07-12T02:44:00Z",
    "MetadataValues": [
        {
            "ID": 17211,
            "MetadataFieldID": 4,
            "ItemValue": "Data from the German chargepoint registry provided by Bundesnetzagentur.de under the CC-BY 4.0 license"
        }
    ],
    "DataQualityLevel": 3,
    "DateCreated": "2021-07-08T10:06:00Z",
    "SubmissionStatusTypeID": 100
}