{
    "IsRecentlyVerified": false,
    "ID": 142129,
    "UUID": "625E7CF9-7496-4743-A641-59339E4620B2",
    "DataProviderID": 2,
    "DataProvidersReference": "116998",
    "OperatorID": 5,
    "UsageTypeID": 1,
    "AddressInfo": {
        "ID": 142481,
        "Title": "BREIT EV GROUP",
        "AddressLine1": "400 Berwyn Park Rd 899 Cassatt Road",
        "Town": "Berwyn",
        "StateOrProvince": "PA",
        "Postcode": "19312",
        "CountryID": 2,
        "Latitude": 40.0630462,
        "Longitude": -75.4599273,
        "ContactTelephone1": "888-758-4389",
        "AccessComments": "24 hours daily",
        "RelatedURL": "http://www.chargepoint.com/",
        "DistanceUnit": 0
    },
    "Connections": [
        {
            "ID": 198201,
            "ConnectionTypeID": 1,
            "LevelID": 2,
            "Amps": 16,
            "Voltage": 230,
            "PowerKW": 3.7,
            "CurrentTypeID": 10,
            "Quantity": 2
        }
    ],
    "StatusTypeID": 50,
    "DateLastStatusUpdate": "2020-06-26T03:02:00Z",
    "DataQualityLevel": 3,
    "DateCreated": "2019-12-24T09:17:00Z",
    "SubmissionStatusTypeID": 100
}