{
    "IsRecentlyVerified": false,
    "ID": 136487,
    "UUID": "42B273E4-A280-4E2D-BCB4-4B77A94332B5",
    "DataProviderID": 18,
    "DataProvidersReference": "b530923c9e70171ce4655527465392a0",
    "OperatorID": 2244,
    "UsageTypeID": 5,
    "AddressInfo": {
        "ID": 136833,
        "Title": "Thurlow Road",
        "AddressLine1": "Thurlow Road",
        "Town": "London",
        "Postcode": "NW3 5QA",
        "CountryID": 1,
        "Latitude": 51.552837,
        "Longitude": -0.174739,
        "AccessComments": "",
        "RelatedURL": "https://www.ubitricity.com",
        "DistanceUnit": 0
    },
    "Connections": [
        {
            "ID": 190937,
            "ConnectionTypeID": 25,
            "Reference": "suby1100001902",
            "StatusTypeID": 50,
            "LevelID": 2,
            "Amps": 16,
            "Voltage": 230,
            "PowerKW": 3.7,
            "CurrentTypeID": 10
        }
    ],
    "StatusTypeID": 0,
    "DateLastStatusUpdate": "2021-07-12T03:38:00Z",
    "MetadataValues": [
        {
            "ID": 6339,
            "MetadataFieldID": 4,
            "ItemValue": "Contains public sector information licensed under the Open Government Licence v2.0. http://www.nationalarchives.gov.uk/doc/open-government-licence/version/2/"
        }
    ],
    "DataQualityLevel": 3,
    "DateCreated": "2019-12-24T05:22:00Z",
    "SubmissionStatusTypeID": 100
}