{
    "IsRecentlyVerified": false,
    "ID": 70917,
    "UUID": "13753F4E-554F-4CDE-B4AE-FC0FDA887430",
    "DataProviderID": 1,
    "OperatorID": 156,
    "UsageTypeID": 4,
    "AddressInfo": {
        "ID": 71263,
        "Title": "Parkhaus N2",
        "AddressLine1": "N2 14",
        "Town": "Mannheim",
        "StateOrProvince": "Mannheim",
        "Postcode": "68161",
        "CountryID": 87,
        "Latitude": 49.4857501,
        "Longitude": 8.466091699999993,
        "AccessComments": "Parkhaus zwischen M2 und N2, 24/7 geöffnet.\r\n",
        "RelatedURL": "http://www.mvv-energie.de/",
        "DistanceUnit": 0
    },
    "Connections": [
        {
            "ID": 101597,
            "ConnectionTypeID": 25,
            "StatusTypeID": 50,
            "LevelID": 2,
            "PowerKW": 11,
            "CurrentTypeID": 20,
            "Quantity": 2
        }
    ],
    "NumberOfPoints": 2,
    "StatusTypeID": 50,
    "DateLastStatusUpdate": "2016-08-17T09:37:00Z",
    "DataQualityLevel": 1,
    "DateCreated": "2016-08-17T09:37:00Z",
    "SubmissionStatusTypeID": 200
}