{
    "IsRecentlyVerified": false,
    "ID": 145217,
    "UUID": "ED534A61-5F4F-4EE1-B33D-F68BAA795652",
    "DataProviderID": 2,
    "DataProvidersReference": "95313",
    "OperatorID": 9,
    "UsageTypeID": 1,
    "AddressInfo": {
        "ID": 145569,
        "Title": "WA Department of Licensing",
        "AddressLine1": "8005 River Dr.",
        "Town": "Olympia",
        "StateOrProvince": "WA",
        "Postcode": "98501",
        "CountryID": 2,
        "Latitude": 46.971813,
        "Longitude": -122.888172,
        "ContactTelephone1": "888-998-2546",
        "AccessComments": "MON: 24 hours | TUE: 24 hours | WED: 24 hours | THU: 24 hours | FRI: 24 hours | SAT: 24 hours | SUN: 24 hours",
        "RelatedURL": "http://www.blinkcharging.com/",
        "DistanceUnit": 0
    },
    "Connections": [
        {
            "ID": 201834,
            "ConnectionTypeID": 1,
            "LevelID": 2,
            "Amps": 16,
            "Voltage": 230,
            "PowerKW": 3.7,
            "CurrentTypeID": 10,
            "Quantity": 1
        }
    ],
    "StatusTypeID": 50,
    "DateLastStatusUpdate": "2020-06-26T03:10:00Z",
    "DataQualityLevel": 3,
    "DateCreated": "2019-12-24T09:24:00Z",
    "SubmissionStatusTypeID": 100
}