{
    "IsRecentlyVerified": false,
    "ID": 97477,
    "UUID": "2CE43F2D-E8FB-450D-9E47-B32709D90EE0",
    "DataProviderID": 1,
    "OperatorID": 23,
    "OperatorsReference": "38493",
    "UsageTypeID": 4,
    "AddressInfo": {
        "ID": 97823,
        "Title": "Home2 Suites By Hilton Prattville",
        "AddressLine1": "2505 Legends DR",
        "Town": "Prattville",
        "StateOrProvince": "AL",
        "Postcode": "36066",
        "CountryID": 2,
        "Latitude": 32.456134,
        "Longitude": -86.401488,
        "ContactTelephone1": "(334) 551-2900",
        "DistanceUnit": 0
    },
    "Connections": [
        {
            "ID": 138384,
            "ConnectionTypeID": 30,
            "StatusTypeID": 50,
            "LevelID": 2,
            "PowerKW": 16,
            "CurrentTypeID": 20,
            "Quantity": 2
        }
    ],
    "NumberOfPoints": 2,
    "GeneralComments": "2 Tesla Connectors, up to 16kW.Available for customers. Please see front desk.",
    "StatusTypeID": 50,
    "DateLastStatusUpdate": "2018-01-21T15:32:00Z",
    "DataQualityLevel": 1,
    "DateCreated": "2018-01-21T15:32:00Z",
    "SubmissionStatusTypeID": 200
}