{
    "IsRecentlyVerified": false,
    "ID": 53499,
    "UUID": "63E66E37-5F02-4ECE-89F2-32C86E028D93",
    "DataProviderID": 1,
    "DataProvidersReference": "2984",
    "AddressInfo": {
        "ID": 53845,
        "Title": "Hamnkrogen Herrvik",
        "AddressLine1": "Östergarn Herrviks hamn 173",
        "Town": "KATTHAMMARSVIK",
        "StateOrProvince": "GOTLAND",
        "Postcode": "62368",
        "CountryID": 216,
        "Latitude": 57.42215,
        "Longitude": 18.91666,
        "AccessComments": "På hamnplan i anslutning till Hamnkrogen",
        "DistanceUnit": 0
    },
    "Connections": [
        {
            "ID": 66620,
            "ConnectionTypeID": 0,
            "Reference": "1",
            "LevelID": 2,
            "Amps": 16,
            "Voltage": 230,
            "PowerKW": 3.7,
            "Comments": "Mode 3"
        },
        {
            "ID": 87837,
            "ConnectionTypeID": 0,
            "Reference": "2",
            "LevelID": 2,
            "Amps": 16,
            "Voltage": 230,
            "PowerKW": 3.7,
            "Comments": "Mode 1"
        }
    ],
    "NumberOfPoints": 2,
    "DateLastStatusUpdate": "2020-05-26T08:21:00Z",
    "DataQualityLevel": 2,
    "DateCreated": "2015-09-20T11:33:00Z",
    "SubmissionStatusTypeID": 100
}