{
    "IsRecentlyVerified": false,
    "ID": 42670,
    "UUID": "D393B938-BC82-4B0E-9A7C-81BE0C581154",
    "DataProviderID": 1,
    "OperatorID": 45,
    "UsageTypeID": 5,
    "UsageCost": "1€ / 2 h",
    "AddressInfo": {
        "ID": 43016,
        "Title": "Autohof Bockel",
        "AddressLine1": "An der Autobahn 8",
        "Town": "Bockel",
        "StateOrProvince": "Samtgemeinde Zeven",
        "Postcode": "27404",
        "CountryID": 87,
        "Latitude": 53.1939443171511,
        "Longitude": 9.28762234623923,
        "AccessComments": "Im hinteren Bereich des Tankstellen-Parkplatzes. Restaurant, Mc Donalds, Geldautomat vorhanden...",
        "RelatedURL": "http://www.autohof-bockel.de/",
        "DistanceUnit": 0
    },
    "Connections": [
        {
            "ID": 51455,
            "ConnectionTypeID": 16,
            "StatusTypeID": 50,
            "LevelID": 1,
            "Amps": 10,
            "Voltage": 230,
            "PowerKW": 2.3,
            "CurrentTypeID": 10,
            "Quantity": 6
        }
    ],
    "NumberOfPoints": 6,
    "GeneralComments": "Absicherung mit zugänglichen 10A FI Schaltern!",
    "StatusTypeID": 50,
    "DateLastStatusUpdate": "2015-03-20T10:01:00Z",
    "DataQualityLevel": 1,
    "DateCreated": "2015-03-19T16:49:00Z",
    "SubmissionStatusTypeID": 200
}