{
    "IsRecentlyVerified": false,
    "ID": 39174,
    "UUID": "95110E64-EBEC-4546-B423-21CF830B60E3",
    "DataProviderID": 1,
    "OperatorID": 220,
    "OperatorsReference": "2074,2074,2075",
    "UsageTypeID": 1,
    "UsageCost": "€1.73 + €0.3213/kWh; Andere Tarife möglich",
    "AddressInfo": {
        "ID": 39520,
        "Title": "Burchard Hof",
        "AddressLine1": "Kattrepel 20",
        "Town": "Hamburg",
        "Postcode": "20095",
        "CountryID": 87,
        "Latitude": 53.549711,
        "Longitude": 9.999172,
        "DistanceUnit": 0
    },
    "Connections": [
        {
            "ID": 42685,
            "ConnectionTypeID": 25,
            "StatusTypeID": 50,
            "LevelID": 2,
            "Amps": 32,
            "Voltage": 400,
            "PowerKW": 11,
            "CurrentTypeID": 20,
            "Quantity": 2
        },
        {
            "ID": 83438,
            "ConnectionTypeID": 28,
            "StatusTypeID": 50,
            "LevelID": 2,
            "Amps": 16,
            "Voltage": 230,
            "PowerKW": 3.7,
            "CurrentTypeID": 10,
            "Quantity": 2
        }
    ],
    "NumberOfPoints": 4,
    "StatusTypeID": 50,
    "DateLastStatusUpdate": "2017-04-22T09:00:00Z",
    "DataQualityLevel": 3,
    "DateCreated": "2015-01-09T06:08:00Z",
    "SubmissionStatusTypeID": 200
}