{
    "IsRecentlyVerified": false,
    "ID": 99972,
    "UUID": "942E84FD-EFD0-482D-8C92-B9A64B7707AC",
    "DataProviderID": 1,
    "OperatorID": 23,
    "OperatorsReference": "40572",
    "UsageTypeID": 4,
    "AddressInfo": {
        "ID": 100318,
        "Title": "Delmonaco Winery & Vineyards",
        "AddressLine1": "600 Lance DR",
        "Town": "Baxter",
        "StateOrProvince": "Tennesse",
        "Postcode": "38544",
        "CountryID": 2,
        "Latitude": 36.163439,
        "Longitude": -85.615665,
        "ContactTelephone1": "(931) 858-1177",
        "DistanceUnit": 0
    },
    "Connections": [
        {
            "ID": 141224,
            "ConnectionTypeID": 30,
            "StatusTypeID": 50,
            "LevelID": 2,
            "PowerKW": 16,
            "CurrentTypeID": 20,
            "Quantity": 3
        }
    ],
    "NumberOfPoints": 3,
    "GeneralComments": "3 Tesla Connectors, up to 16kW.Available for customers. Self park.",
    "StatusTypeID": 50,
    "DateLastStatusUpdate": "2018-02-09T06:47:00Z",
    "DataQualityLevel": 1,
    "DateCreated": "2018-02-09T06:47:00Z",
    "SubmissionStatusTypeID": 200
}