{
    "UserComments": [
        {
            "ID": 22255,
            "ChargePointID": 57683,
            "CommentTypeID": 10,
            "UserName": "fakk",
            "Comment": "only ac worked",
            "Rating": 2,
            "DateCreated": "2020-03-07T22:05:50.097Z",
            "User": {
                "ID": 25406,
                "Username": "fakk"
            },
            "CheckinStatusTypeID": 50,
            "IsActionedByEditor": false
        }
    ],
    "IsRecentlyVerified": false,
    "ID": 57683,
    "UUID": "96884512-7AC2-43C6-BAEB-2C78CA10DA4D",
    "DataProviderID": 1,
    "OperatorID": 125,
    "UsageTypeID": 4,
    "AddressInfo": {
        "ID": 58029,
        "Title": "Bahnhofsplatz",
        "AddressLine1": "Bahnhofsplatz",
        "Town": "Emden",
        "StateOrProvince": "Emden",
        "Postcode": "26721",
        "CountryID": 87,
        "Latitude": 53.3684704542984,
        "Longitude": 7.19602769682002,
        "AccessComments": "Auf dem Parkplatz nahe der Denkmallok.",
        "RelatedURL": "https://www.emderzeitung.de/emden/~/emden-schnelles-tanken-an-der-steckdose-ab-jetzt-moeglich-258368/",
        "DistanceUnit": 0
    },
    "Connections": [
        {
            "ID": 72972,
            "ConnectionTypeID": 2,
            "StatusTypeID": 50,
            "LevelID": 3,
            "PowerKW": 50,
            "CurrentTypeID": 30,
            "Quantity": 1
        },
        {
            "ID": 72973,
            "ConnectionTypeID": 33,
            "StatusTypeID": 50,
            "LevelID": 3,
            "PowerKW": 50,
            "CurrentTypeID": 30,
            "Quantity": 1
        },
        {
            "ID": 72974,
            "ConnectionTypeID": 25,
            "StatusTypeID": 50,
            "LevelID": 3,
            "PowerKW": 43,
            "CurrentTypeID": 20,
            "Quantity": 1
        }
    ],
    "NumberOfPoints": 2,
    "StatusTypeID": 50,
    "DateLastStatusUpdate": "2020-03-07T22:06:00Z",
    "DataQualityLevel": 1,
    "DateCreated": "2015-12-16T08:17:00Z",
    "SubmissionStatusTypeID": 200
}