{
    "IsRecentlyVerified": false,
    "ID": 124411,
    "UUID": "EBA434A1-63DD-476E-9327-CB2BA103AEA3",
    "DataProviderID": 2,
    "DataProvidersReference": "39914",
    "UsageTypeID": 7,
    "AddressInfo": {
        "ID": 124757,
        "Title": "Napa Nissan",
        "AddressLine1": "510 Soscol Ave",
        "Town": "Napa",
        "StateOrProvince": "CA",
        "Postcode": "94559",
        "CountryID": 2,
        "Latitude": 38.292706,
        "Longitude": -122.277767,
        "ContactTelephone1": "707-253-1551",
        "AccessComments": "Dealership business hours\r\nPublic - Call ahead",
        "RelatedURL": "",
        "DistanceUnit": 0
    },
    "Connections": [
        {
            "ID": 174503,
            "ConnectionTypeID": 1,
            "LevelID": 2,
            "Amps": 16,
            "Voltage": 230,
            "PowerKW": 3.7,
            "CurrentTypeID": 10,
            "Quantity": 1
        }
    ],
    "DateLastStatusUpdate": "2020-06-26T02:59:00Z",
    "DataQualityLevel": 3,
    "DateCreated": "2019-04-06T05:03:00Z",
    "SubmissionStatusTypeID": 100
}