{
    "IsRecentlyVerified": false,
    "ID": 136844,
    "UUID": "991B8471-73E5-4ED4-BD07-2FA23B9FCA86",
    "DataProviderID": 18,
    "DataProvidersReference": "33c5f5bff65aa05a8cd3e5d2597f44ae",
    "UsageTypeID": 1,
    "AddressInfo": {
        "ID": 137190,
        "Title": "36 Main Street",
        "AddressLine1": "36 Main Street",
        "Town": "Enniskillen",
        "Postcode": "BT94 4RZ",
        "CountryID": 1,
        "Latitude": 54.4171,
        "Longitude": -7.1484,
        "AccessComments": "DRD Carpark, Maguiresbridge, Fermanagh",
        "RelatedURL": "https://www.esb.ie/ecars",
        "DistanceUnit": 0
    },
    "Connections": [
        {
            "ID": 191492,
            "ConnectionTypeID": 25,
            "Reference": "1",
            "StatusTypeID": 50,
            "LevelID": 2,
            "Amps": 32,
            "Voltage": 400,
            "PowerKW": 22,
            "CurrentTypeID": 20
        },
        {
            "ID": 191493,
            "ConnectionTypeID": 25,
            "Reference": "2",
            "StatusTypeID": 50,
            "LevelID": 2,
            "Amps": 32,
            "Voltage": 400,
            "PowerKW": 22,
            "CurrentTypeID": 20
        }
    ],
    "StatusTypeID": 0,
    "DateLastStatusUpdate": "2021-07-12T03:39:00Z",
    "MetadataValues": [
        {
            "ID": 6696,
            "MetadataFieldID": 4,
            "ItemValue": "Contains public sector information licensed under the Open Government Licence v2.0. http://www.nationalarchives.gov.uk/doc/open-government-licence/version/2/"
        }
    ],
    "DataQualityLevel": 3,
    "DateCreated": "2019-12-24T05:23:00Z",
    "SubmissionStatusTypeID": 100
}