{
    "IsRecentlyVerified": false,
    "ID": 124194,
    "UUID": "1470A573-73E7-4BC0-80C8-3B1004C7E9CF",
    "DataProviderID": 2,
    "DataProvidersReference": "87920",
    "UsageTypeID": 1,
    "AddressInfo": {
        "ID": 124540,
        "Title": "Swope Mitsubishi",
        "AddressLine1": "253 S Dixie Blvd",
        "Town": "Radcliff",
        "StateOrProvince": "KY",
        "Postcode": "40160",
        "CountryID": 2,
        "Latitude": 37.837414,
        "Longitude": -85.936814,
        "ContactTelephone1": "270-351-2181",
        "AccessComments": "24 hours daily",
        "RelatedURL": "",
        "DistanceUnit": 0
    },
    "Connections": [
        {
            "ID": 174265,
            "ConnectionTypeID": 1,
            "LevelID": 2,
            "Amps": 16,
            "Voltage": 230,
            "PowerKW": 3.7,
            "CurrentTypeID": 10,
            "Quantity": 1
        }
    ],
    "DateLastStatusUpdate": "2020-06-26T02:59:00Z",
    "DataQualityLevel": 3,
    "DateCreated": "2019-04-06T05:03:00Z",
    "SubmissionStatusTypeID": 100
}