{
    "IsRecentlyVerified": true,
    "DateLastVerified": "2021-09-28T09:32:00Z",
    "ID": 189426,
    "UUID": "F9B886A8-9403-4288-B406-DFECE34A616A",
    "DataProviderID": 1,
    "OperatorID": 3471,
    "UsageTypeID": 5,
    "UsageCost": "£0.39/kWh",
    "AddressInfo": {
        "ID": 189785,
        "Title": "MFG EV Power Putney",
        "AddressLine1": "West Hill",
        "AddressLine2": "Putney",
        "Town": "London",
        "StateOrProvince": "England",
        "Postcode": "SW15 2UE",
        "CountryID": 1,
        "Latitude": 51.45410253580869,
        "Longitude": -0.21110858490385453,
        "DistanceUnit": 0
    },
    "Connections": [
        {
            "ID": 306368,
            "ConnectionTypeID": 2,
            "StatusTypeID": 50,
            "LevelID": 3,
            "PowerKW": 80,
            "CurrentTypeID": 30,
            "Quantity": 8
        },
        {
            "ID": 306369,
            "ConnectionTypeID": 33,
            "StatusTypeID": 50,
            "LevelID": 3,
            "Voltage": 920,
            "PowerKW": 150,
            "CurrentTypeID": 30,
            "Quantity": 8
        }
    ],
    "NumberOfPoints": 8,
    "StatusTypeID": 50,
    "DateLastStatusUpdate": "2021-09-28T09:33:00Z",
    "DataQualityLevel": 1,
    "DateCreated": "2021-09-28T09:32:00Z",
    "SubmissionStatusTypeID": 200
}