{
    "IsRecentlyVerified": false,
    "ID": 38118,
    "UUID": "292022A2-88A7-4774-B34C-B921DB2E1E66",
    "DataProviderID": 26,
    "DataProvidersReference": "48528",
    "OperatorID": 178,
    "OperatorsReference": "EVnetNL REE089",
    "UsageCost": "0.00 jaarabonnement",
    "AddressInfo": {
        "ID": 38464,
        "Title": "van Sytzamalaan 4",
        "AddressLine1": "van Sytzamalaan 4",
        "Town": "Oldebroek",
        "Postcode": "8096 AS",
        "CountryID": 159,
        "Latitude": 52.445783,
        "Longitude": 5.898907,
        "ContactTelephone1": "0800-3522365",
        "RelatedURL": "http://www.evnet.nl",
        "DistanceUnit": 0
    },
    "Connections": [
        {
            "ID": 41629,
            "ConnectionTypeID": 25,
            "LevelID": 1,
            "PowerKW": 2.3,
            "CurrentTypeID": 10
        }
    ],
    "NumberOfPoints": 2,
    "StatusTypeID": 50,
    "DateLastStatusUpdate": "2016-06-04T02:54:00Z",
    "DataQualityLevel": 3,
    "DateCreated": "2015-01-09T06:07:00Z",
    "SubmissionStatusTypeID": 100
}