{
    "IsRecentlyVerified": false,
    "ID": 79010,
    "UUID": "861A30BA-7D76-4757-BBDF-B7CDC817B1C7",
    "DataProviderID": 1,
    "OperatorID": 23,
    "OperatorsReference": "6594",
    "UsageTypeID": 6,
    "UsageCost": "Free",
    "AddressInfo": {
        "ID": 79356,
        "Title": "Four Seasons Hotel Seattle",
        "AddressLine1": "99 Union St",
        "Town": "Seattle",
        "StateOrProvince": "WA",
        "Postcode": "98101",
        "CountryID": 2,
        "Latitude": 47.607651,
        "Longitude": -122.339418,
        "ContactTelephone1": "(206) 749-7000",
        "DistanceUnit": 0
    },
    "Connections": [
        {
            "ID": 113629,
            "ConnectionTypeID": 30,
            "StatusTypeID": 50,
            "LevelID": 2,
            "Amps": 32,
            "Voltage": 230,
            "PowerKW": 16,
            "CurrentTypeID": 20,
            "Quantity": 2
        }
    ],
    "NumberOfPoints": 2,
    "GeneralComments": "1 Tesla Connector, up to 13kW.Available for patrons only. Please see valet.",
    "StatusTypeID": 50,
    "DateLastStatusUpdate": "2017-06-09T13:15:00Z",
    "DataQualityLevel": 1,
    "DateCreated": "2017-01-26T19:02:00Z",
    "SubmissionStatusTypeID": 200
}