{
    "IsRecentlyVerified": false,
    "ID": 27019,
    "UUID": "CAA83A6C-B924-412D-A54E-F40AFA68FBCC",
    "DataProviderID": 2,
    "DataProvidersReference": "53677",
    "UsageTypeID": 1,
    "AddressInfo": {
        "ID": 27365,
        "Title": "City of Pasadena - Marriott Garage",
        "AddressLine1": "171 N Raymond Ave",
        "Town": "Pasadena",
        "StateOrProvince": "CA",
        "Postcode": "91103",
        "CountryID": 2,
        "Latitude": 34.148874,
        "Longitude": -118.148914,
        "ContactTelephone1": "626-577-8963  626-744-7655",
        "AccessComments": "24 hours daily; pay lot",
        "RelatedURL": "",
        "DistanceUnit": 0
    },
    "Connections": [
        {
            "ID": 29582,
            "ConnectionTypeID": 1,
            "LevelID": 2,
            "Amps": 16,
            "Voltage": 230,
            "PowerKW": 3,
            "CurrentTypeID": 10,
            "Quantity": 3
        }
    ],
    "DateLastStatusUpdate": "2019-04-06T04:01:00Z",
    "DataQualityLevel": 3,
    "DateCreated": "2014-11-28T03:37:00Z",
    "SubmissionStatusTypeID": 100
}