{
    "IsRecentlyVerified": false,
    "ID": 178460,
    "UUID": "9B1A66E0-3820-48A1-ACC0-82C41ADF6A16",
    "DataProviderID": 29,
    "DataProvidersReference": "4469",
    "OperatorID": 45,
    "AddressInfo": {
        "ID": 178819,
        "Title": "Rotweg 21",
        "AddressLine1": "Rotweg 21",
        "Town": "Stuttgart",
        "Postcode": "70437",
        "CountryID": 87,
        "Latitude": 48.833943,
        "Longitude": 9.180837,
        "DistanceUnit": 0
    },
    "Connections": [
        {
            "ID": 278895,
            "ConnectionTypeID": 33,
            "StatusTypeID": 50,
            "LevelID": 3,
            "PowerKW": 22,
            "CurrentTypeID": 30
        },
        {
            "ID": 278896,
            "ConnectionTypeID": 25,
            "StatusTypeID": 50,
            "LevelID": 2,
            "PowerKW": 11,
            "CurrentTypeID": 20
        }
    ],
    "StatusTypeID": 0,
    "DateLastStatusUpdate": "2021-07-12T02:42:00Z",
    "MetadataValues": [
        {
            "ID": 10754,
            "MetadataFieldID": 4,
            "ItemValue": "Data from the German chargepoint registry provided by Bundesnetzagentur.de under the CC-BY 4.0 license"
        }
    ],
    "DataQualityLevel": 3,
    "DateCreated": "2021-07-08T09:50:00Z",
    "SubmissionStatusTypeID": 100
}