{
    "IsRecentlyVerified": false,
    "ID": 111575,
    "UUID": "F42BC4B6-72F2-4CD4-8C7A-90F1AE1CA09E",
    "DataProviderID": 2,
    "DataProvidersReference": "83277",
    "UsageTypeID": 1,
    "AddressInfo": {
        "ID": 111921,
        "Title": "Science North",
        "AddressLine1": "100 Ramsey Lake Rd",
        "Town": "Sudbury",
        "StateOrProvince": "ON",
        "Postcode": "P3E 5S9",
        "CountryID": 44,
        "Latitude": 46.4707,
        "Longitude": -80.9962,
        "ContactTelephone1": "705-522-3701",
        "AccessComments": "10am-4pm daily",
        "RelatedURL": "",
        "DistanceUnit": 0
    },
    "Connections": [
        {
            "ID": 157033,
            "ConnectionTypeID": 1,
            "LevelID": 2,
            "Amps": 16,
            "Voltage": 230,
            "PowerKW": 3.7,
            "CurrentTypeID": 10,
            "Quantity": 2
        }
    ],
    "DateLastStatusUpdate": "2020-06-26T03:10:00Z",
    "DataQualityLevel": 3,
    "DateCreated": "2018-10-18T23:37:00Z",
    "SubmissionStatusTypeID": 100
}