{
    "IsRecentlyVerified": false,
    "ID": 114191,
    "UUID": "9EBB73D3-08BB-4B2D-A946-F6039B234FC4",
    "DataProviderID": 1,
    "OperatorID": 23,
    "OperatorsReference": "47470",
    "UsageTypeID": 7,
    "AddressInfo": {
        "ID": 114537,
        "Title": "Hotel Spa Vilavella",
        "AddressLine1": "Hotel Spa Vilavella",
        "Town": "A Vilavella",
        "StateOrProvince": "Orense",
        "Postcode": "32549",
        "CountryID": 210,
        "Latitude": 42.038277,
        "Longitude": -7.016485,
        "ContactTelephone1": "+34 988 59 42 42",
        "DistanceUnit": 0
    },
    "Connections": [
        {
            "ID": 160761,
            "ConnectionTypeID": 30,
            "StatusTypeID": 50,
            "LevelID": 2,
            "Amps": 32,
            "Voltage": 400,
            "PowerKW": 22,
            "CurrentTypeID": 20,
            "Quantity": 1
        }
    ],
    "NumberOfPoints": 1,
    "GeneralComments": "1 Tesla Connector, up to 22kW.Available by reservation only. Please see front desk.",
    "StatusTypeID": 50,
    "DateLastStatusUpdate": "2020-08-17T12:16:00Z",
    "DataQualityLevel": 1,
    "DateCreated": "2019-01-03T08:10:00Z",
    "SubmissionStatusTypeID": 200
}