{
    "IsRecentlyVerified": false,
    "ID": 144080,
    "UUID": "7164FBA6-4B22-4E30-A716-AB1A3FC2D950",
    "DataProviderID": 2,
    "DataProvidersReference": "149218",
    "OperatorID": 89,
    "UsageTypeID": 1,
    "AddressInfo": {
        "ID": 144432,
        "Title": "St-Jean-Richelieu",
        "AddressLine1": "855 boul. Industriel",
        "Town": "Saint-Jean-sur-Richelieu",
        "StateOrProvince": "QC",
        "Postcode": "J3B 7Y7",
        "CountryID": 44,
        "Latitude": 45.330095,
        "Longitude": -73.289542,
        "ContactTelephone1": "888-356-8911",
        "AccessComments": "24 hours daily",
        "RelatedURL": "https://flo.ca/",
        "DistanceUnit": 0
    },
    "Connections": [
        {
            "ID": 200547,
            "ConnectionTypeID": 1,
            "LevelID": 2,
            "Amps": 16,
            "Voltage": 230,
            "PowerKW": 3.7,
            "CurrentTypeID": 10,
            "Quantity": 1
        }
    ],
    "StatusTypeID": 50,
    "DateLastStatusUpdate": "2020-06-26T03:08:00Z",
    "DataQualityLevel": 3,
    "DateCreated": "2019-12-24T09:22:00Z",
    "SubmissionStatusTypeID": 100
}