{
    "IsRecentlyVerified": false,
    "ID": 34842,
    "UUID": "55E19140-02D9-44CF-A9AF-D844E7D4A165",
    "DataProviderID": 26,
    "DataProvidersReference": "47259",
    "OperatorID": 178,
    "OperatorsReference": "EVnetNL AL415",
    "UsageCost": "0.00 jaarabonnement",
    "AddressInfo": {
        "ID": 35188,
        "Title": "Groeneweg 73",
        "AddressLine1": "Groeneweg 73",
        "Town": "Rhenen",
        "Postcode": "3911 PE",
        "CountryID": 159,
        "Latitude": 51.961536,
        "Longitude": 5.565712,
        "ContactTelephone1": "0800-3522365",
        "RelatedURL": "http://www.evnet.nl",
        "DistanceUnit": 0
    },
    "Connections": [
        {
            "ID": 38353,
            "ConnectionTypeID": 25,
            "LevelID": 2,
            "PowerKW": 11,
            "CurrentTypeID": 10
        }
    ],
    "NumberOfPoints": 2,
    "StatusTypeID": 50,
    "DateLastStatusUpdate": "2016-06-04T02:43:00Z",
    "DataQualityLevel": 3,
    "DateCreated": "2015-01-09T06:04:00Z",
    "SubmissionStatusTypeID": 100
}