{
    "IsRecentlyVerified": false,
    "ID": 157894,
    "UUID": "0FE3E052-8BCB-4C01-B868-69E3AFD9C823",
    "DataProviderID": 1,
    "OperatorID": 8,
    "UsageTypeID": 2,
    "UsageCost": "E-TAXIS ONLY!",
    "AddressInfo": {
        "ID": 158248,
        "Title": "76 Southwark Street E-TAXIS ONLY!",
        "AddressLine1": "76 Southwark Street",
        "Town": "London",
        "Postcode": "SE1 0TP",
        "CountryID": 1,
        "Latitude": 51.505177,
        "Longitude": -0.096991,
        "AccessComments": "",
        "RelatedURL": "https://www.bpchargemaster.com",
        "DistanceUnit": 0
    },
    "Connections": [
        {
            "ID": 227539,
            "ConnectionTypeID": 2,
            "Reference": "1",
            "StatusTypeID": 50,
            "LevelID": 3,
            "Amps": 125,
            "Voltage": 400,
            "PowerKW": 50,
            "CurrentTypeID": 30,
            "Quantity": 1
        },
        {
            "ID": 227540,
            "ConnectionTypeID": 33,
            "Reference": "2",
            "StatusTypeID": 50,
            "LevelID": 3,
            "Amps": 125,
            "Voltage": 400,
            "PowerKW": 50,
            "CurrentTypeID": 30,
            "Quantity": 1
        },
        {
            "ID": 261975,
            "ConnectionTypeID": 1036,
            "StatusTypeID": 50,
            "LevelID": 3,
            "PowerKW": 43,
            "CurrentTypeID": 20,
            "Quantity": 1
        }
    ],
    "GeneralComments": "E-TAXIS ONLY!",
    "StatusTypeID": 50,
    "DateLastStatusUpdate": "2020-12-30T21:21:00Z",
    "MetadataValues": [
        {
            "ID": 7427,
            "MetadataFieldID": 4,
            "ItemValue": "Contains public sector information licensed under the Open Government Licence v2.0. http://www.nationalarchives.gov.uk/doc/open-government-licence/version/2/"
        }
    ],
    "DataQualityLevel": 3,
    "DateCreated": "2020-06-25T10:00:00Z",
    "SubmissionStatusTypeID": 100
}