{
    "IsRecentlyVerified": false,
    "ID": 7027,
    "UUID": "B781A590-C652-4977-8037-1E119820442B",
    "DataProviderID": 1,
    "UsageTypeID": 1,
    "UsageCost": "Free",
    "AddressInfo": {
        "ID": 6928,
        "Title": "Parking Ecole de Médecine",
        "AddressLine1": "21 rue de l'école de Médecine",
        "AddressLine2": "",
        "Town": "Paris",
        "StateOrProvince": "",
        "Postcode": "75006",
        "CountryID": 80,
        "Latitude": 48.8512146,
        "Longitude": 2.3403983000000608,
        "ContactTelephone1": "+33 (0)1 43 29 61 38",
        "ContactTelephone2": "",
        "ContactEmail": "ecole-de-medecine@saemes.fr",
        "AccessComments": "",
        "DistanceUnit": 0
    },
    "Connections": [],
    "NumberOfPoints": 2,
    "GeneralComments": "",
    "DateLastConfirmed": "2011-10-18T09:36:00Z",
    "StatusTypeID": 0,
    "DateLastStatusUpdate": "2011-10-18T09:36:00Z",
    "DataQualityLevel": 1,
    "DateCreated": "2011-10-18T09:36:00Z",
    "SubmissionStatusTypeID": 200
}