{
    "IsRecentlyVerified": false,
    "ID": 129527,
    "UUID": "E214C27C-DD44-418C-8963-BE2F13003DB1",
    "DataProviderID": 2,
    "DataProvidersReference": "121238",
    "OperatorID": 5,
    "UsageTypeID": 1,
    "AddressInfo": {
        "ID": 129873,
        "Title": "COQUINA COVE",
        "AddressLine1": "3902 SW Coquina Cove Way",
        "Town": "Palm City",
        "StateOrProvince": "FL",
        "Postcode": "34990",
        "CountryID": 2,
        "Latitude": 27.1662441,
        "Longitude": -80.3049933,
        "ContactTelephone1": "888-758-4389",
        "AccessComments": "24 hours daily",
        "RelatedURL": "http://www.chargepoint.com/",
        "DistanceUnit": 0
    },
    "Connections": [
        {
            "ID": 181264,
            "ConnectionTypeID": 1,
            "LevelID": 2,
            "Amps": 16,
            "Voltage": 230,
            "PowerKW": 3.7,
            "CurrentTypeID": 10,
            "Quantity": 2
        }
    ],
    "DateLastStatusUpdate": "2020-06-26T02:52:00Z",
    "DataQualityLevel": 3,
    "DateCreated": "2019-07-21T11:43:00Z",
    "SubmissionStatusTypeID": 100
}