{
    "IsRecentlyVerified": false,
    "ID": 173088,
    "UUID": "FC7A5133-553C-4C3B-AA59-B9C961A0212A",
    "DataProviderID": 19,
    "DataProvidersReference": "7232",
    "AddressInfo": {
        "ID": 173447,
        "Title": "P-hus Svane",
        "AddressLine1": "Gasverksgatan 12",
        "Town": "LUND",
        "StateOrProvince": "SKÅNE",
        "Postcode": "22220",
        "CountryID": 216,
        "Latitude": 55.70255,
        "Longitude": 13.18549,
        "AccessComments": "I parkeringshuset Svane, högst upp på plan 5.",
        "DistanceUnit": 0
    },
    "Connections": [
        {
            "ID": 264884,
            "ConnectionTypeID": 25,
            "Reference": "1",
            "LevelID": 2,
            "Amps": 16,
            "Voltage": 400,
            "PowerKW": 11,
            "CurrentTypeID": 20
        },
        {
            "ID": 264885,
            "ConnectionTypeID": 25,
            "Reference": "33",
            "LevelID": 2,
            "Amps": 16,
            "Voltage": 400,
            "PowerKW": 11,
            "CurrentTypeID": 20
        },
        {
            "ID": 264886,
            "ConnectionTypeID": 25,
            "Reference": "34",
            "LevelID": 2,
            "Amps": 16,
            "Voltage": 400,
            "PowerKW": 11,
            "CurrentTypeID": 20
        },
        {
            "ID": 264887,
            "ConnectionTypeID": 25,
            "Reference": "35",
            "LevelID": 2,
            "Amps": 16,
            "Voltage": 400,
            "PowerKW": 11,
            "CurrentTypeID": 20
        },
        {
            "ID": 264888,
            "ConnectionTypeID": 25,
            "Reference": "36",
            "LevelID": 2,
            "Amps": 16,
            "Voltage": 400,
            "PowerKW": 11,
            "CurrentTypeID": 20
        },
        {
            "ID": 264889,
            "ConnectionTypeID": 25,
            "Reference": "37",
            "LevelID": 2,
            "Amps": 16,
            "Voltage": 400,
            "PowerKW": 11,
            "CurrentTypeID": 20
        },
        {
            "ID": 264890,
            "ConnectionTypeID": 25,
            "Reference": "38",
            "LevelID": 2,
            "Amps": 16,
            "Voltage": 400,
            "PowerKW": 11,
            "CurrentTypeID": 20
        },
        {
            "ID": 264891,
            "ConnectionTypeID": 25,
            "Reference": "39",
            "LevelID": 2,
            "Amps": 16,
            "Voltage": 400,
            "PowerKW": 11,
            "CurrentTypeID": 20
        },
        {
            "ID": 264892,
            "ConnectionTypeID": 25,
            "Reference": "40",
            "LevelID": 2,
            "Amps": 16,
            "Voltage": 400,
            "PowerKW": 11,
            "CurrentTypeID": 20
        },
        {
            "ID": 264893,
            "ConnectionTypeID": 25,
            "Reference": "41",
            "LevelID": 2,
            "Amps": 16,
            "Voltage": 400,
            "PowerKW": 11,
            "CurrentTypeID": 20
        },
        {
            "ID": 264894,
            "ConnectionTypeID": 25,
            "Reference": "42",
            "LevelID": 2,
            "Amps": 16,
            "Voltage": 400,
            "PowerKW": 11,
            "CurrentTypeID": 20
        },
        {
            "ID": 264895,
            "ConnectionTypeID": 25,
            "Reference": "43",
            "LevelID": 2,
            "Amps": 16,
            "Voltage": 400,
            "PowerKW": 11,
            "CurrentTypeID": 20
        },
        {
            "ID": 264896,
            "ConnectionTypeID": 25,
            "Reference": "44",
            "LevelID": 2,
            "Amps": 16,
            "Voltage": 400,
            "PowerKW": 11,
            "CurrentTypeID": 20
        },
        {
            "ID": 264897,
            "ConnectionTypeID": 25,
            "Reference": "32",
            "LevelID": 2,
            "Amps": 16,
            "Voltage": 400,
            "PowerKW": 11,
            "CurrentTypeID": 20
        },
        {
            "ID": 264898,
            "ConnectionTypeID": 25,
            "Reference": "45",
            "LevelID": 2,
            "Amps": 16,
            "Voltage": 400,
            "PowerKW": 11,
            "CurrentTypeID": 20
        },
        {
            "ID": 264899,
            "ConnectionTypeID": 25,
            "Reference": "47",
            "LevelID": 2,
            "Amps": 16,
            "Voltage": 400,
            "PowerKW": 11,
            "CurrentTypeID": 20
        },
        {
            "ID": 264900,
            "ConnectionTypeID": 25,
            "Reference": "48",
            "LevelID": 2,
            "Amps": 16,
            "Voltage": 400,
            "PowerKW": 11,
            "CurrentTypeID": 20
        },
        {
            "ID": 264901,
            "ConnectionTypeID": 25,
            "Reference": "49",
            "LevelID": 2,
            "Amps": 16,
            "Voltage": 400,
            "PowerKW": 11,
            "CurrentTypeID": 20
        },
        {
            "ID": 264902,
            "ConnectionTypeID": 25,
            "Reference": "50",
            "LevelID": 2,
            "Amps": 16,
            "Voltage": 400,
            "PowerKW": 11,
            "CurrentTypeID": 20
        },
        {
            "ID": 264903,
            "ConnectionTypeID": 25,
            "Reference": "51",
            "LevelID": 2,
            "Amps": 16,
            "Voltage": 400,
            "PowerKW": 11,
            "CurrentTypeID": 20
        },
        {
            "ID": 264904,
            "ConnectionTypeID": 25,
            "Reference": "52",
            "LevelID": 2,
            "Amps": 16,
            "Voltage": 400,
            "PowerKW": 11,
            "CurrentTypeID": 20
        },
        {
            "ID": 264905,
            "ConnectionTypeID": 25,
            "Reference": "53",
            "LevelID": 2,
            "Amps": 16,
            "Voltage": 400,
            "PowerKW": 11,
            "CurrentTypeID": 20
        },
        {
            "ID": 264906,
            "ConnectionTypeID": 25,
            "Reference": "54",
            "LevelID": 2,
            "Amps": 16,
            "Voltage": 400,
            "PowerKW": 11,
            "CurrentTypeID": 20
        },
        {
            "ID": 264907,
            "ConnectionTypeID": 25,
            "Reference": "55",
            "LevelID": 2,
            "Amps": 16,
            "Voltage": 400,
            "PowerKW": 11,
            "CurrentTypeID": 20
        },
        {
            "ID": 264908,
            "ConnectionTypeID": 25,
            "Reference": "56",
            "LevelID": 2,
            "Amps": 16,
            "Voltage": 400,
            "PowerKW": 11,
            "CurrentTypeID": 20
        },
        {
            "ID": 264909,
            "ConnectionTypeID": 25,
            "Reference": "57",
            "LevelID": 2,
            "Amps": 16,
            "Voltage": 400,
            "PowerKW": 11,
            "CurrentTypeID": 20
        },
        {
            "ID": 264910,
            "ConnectionTypeID": 25,
            "Reference": "58",
            "LevelID": 2,
            "Amps": 16,
            "Voltage": 400,
            "PowerKW": 11,
            "CurrentTypeID": 20
        },
        {
            "ID": 264911,
            "ConnectionTypeID": 25,
            "Reference": "46",
            "LevelID": 2,
            "Amps": 16,
            "Voltage": 400,
            "PowerKW": 11,
            "CurrentTypeID": 20
        },
        {
            "ID": 264912,
            "ConnectionTypeID": 25,
            "Reference": "31",
            "LevelID": 2,
            "Amps": 16,
            "Voltage": 400,
            "PowerKW": 11,
            "CurrentTypeID": 20
        },
        {
            "ID": 264913,
            "ConnectionTypeID": 25,
            "Reference": "30",
            "LevelID": 2,
            "Amps": 16,
            "Voltage": 400,
            "PowerKW": 11,
            "CurrentTypeID": 20
        },
        {
            "ID": 264914,
            "ConnectionTypeID": 25,
            "Reference": "29",
            "LevelID": 2,
            "Amps": 16,
            "Voltage": 400,
            "PowerKW": 11,
            "CurrentTypeID": 20
        },
        {
            "ID": 264915,
            "ConnectionTypeID": 25,
            "Reference": "2",
            "LevelID": 2,
            "Amps": 16,
            "Voltage": 400,
            "PowerKW": 11,
            "CurrentTypeID": 20
        },
        {
            "ID": 264916,
            "ConnectionTypeID": 25,
            "Reference": "3",
            "LevelID": 2,
            "Amps": 16,
            "Voltage": 400,
            "PowerKW": 11,
            "CurrentTypeID": 20
        },
        {
            "ID": 264917,
            "ConnectionTypeID": 25,
            "Reference": "4",
            "LevelID": 2,
            "Amps": 16,
            "Voltage": 400,
            "PowerKW": 11,
            "CurrentTypeID": 20
        },
        {
            "ID": 264918,
            "ConnectionTypeID": 25,
            "Reference": "5",
            "LevelID": 2,
            "Amps": 16,
            "Voltage": 400,
            "PowerKW": 11,
            "CurrentTypeID": 20
        },
        {
            "ID": 264919,
            "ConnectionTypeID": 25,
            "Reference": "6",
            "LevelID": 2,
            "Amps": 16,
            "Voltage": 400,
            "PowerKW": 11,
            "CurrentTypeID": 20
        },
        {
            "ID": 264920,
            "ConnectionTypeID": 25,
            "Reference": "7",
            "LevelID": 2,
            "Amps": 16,
            "Voltage": 400,
            "PowerKW": 11,
            "CurrentTypeID": 20
        },
        {
            "ID": 264921,
            "ConnectionTypeID": 25,
            "Reference": "8",
            "LevelID": 2,
            "Amps": 16,
            "Voltage": 400,
            "PowerKW": 11,
            "CurrentTypeID": 20
        },
        {
            "ID": 264922,
            "ConnectionTypeID": 25,
            "Reference": "9",
            "LevelID": 2,
            "Amps": 16,
            "Voltage": 400,
            "PowerKW": 11,
            "CurrentTypeID": 20
        },
        {
            "ID": 264923,
            "ConnectionTypeID": 25,
            "Reference": "10",
            "LevelID": 2,
            "Amps": 16,
            "Voltage": 400,
            "PowerKW": 11,
            "CurrentTypeID": 20
        },
        {
            "ID": 264924,
            "ConnectionTypeID": 25,
            "Reference": "11",
            "LevelID": 2,
            "Amps": 16,
            "Voltage": 400,
            "PowerKW": 11,
            "CurrentTypeID": 20
        },
        {
            "ID": 264925,
            "ConnectionTypeID": 25,
            "Reference": "12",
            "LevelID": 2,
            "Amps": 16,
            "Voltage": 400,
            "PowerKW": 11,
            "CurrentTypeID": 20
        },
        {
            "ID": 264926,
            "ConnectionTypeID": 25,
            "Reference": "13",
            "LevelID": 2,
            "Amps": 16,
            "Voltage": 400,
            "PowerKW": 11,
            "CurrentTypeID": 20
        },
        {
            "ID": 264927,
            "ConnectionTypeID": 25,
            "Reference": "14",
            "LevelID": 2,
            "Amps": 16,
            "Voltage": 400,
            "PowerKW": 11,
            "CurrentTypeID": 20
        },
        {
            "ID": 264928,
            "ConnectionTypeID": 25,
            "Reference": "15",
            "LevelID": 2,
            "Amps": 16,
            "Voltage": 400,
            "PowerKW": 11,
            "CurrentTypeID": 20
        },
        {
            "ID": 264929,
            "ConnectionTypeID": 25,
            "Reference": "16",
            "LevelID": 2,
            "Amps": 16,
            "Voltage": 400,
            "PowerKW": 11,
            "CurrentTypeID": 20
        },
        {
            "ID": 264930,
            "ConnectionTypeID": 25,
            "Reference": "17",
            "LevelID": 2,
            "Amps": 16,
            "Voltage": 400,
            "PowerKW": 11,
            "CurrentTypeID": 20
        },
        {
            "ID": 264931,
            "ConnectionTypeID": 25,
            "Reference": "18",
            "LevelID": 2,
            "Amps": 16,
            "Voltage": 400,
            "PowerKW": 11,
            "CurrentTypeID": 20
        },
        {
            "ID": 264932,
            "ConnectionTypeID": 25,
            "Reference": "19",
            "LevelID": 2,
            "Amps": 16,
            "Voltage": 400,
            "PowerKW": 11,
            "CurrentTypeID": 20
        },
        {
            "ID": 264933,
            "ConnectionTypeID": 25,
            "Reference": "20",
            "LevelID": 2,
            "Amps": 16,
            "Voltage": 400,
            "PowerKW": 11,
            "CurrentTypeID": 20
        },
        {
            "ID": 264934,
            "ConnectionTypeID": 25,
            "Reference": "21",
            "LevelID": 2,
            "Amps": 16,
            "Voltage": 400,
            "PowerKW": 11,
            "CurrentTypeID": 20
        },
        {
            "ID": 264935,
            "ConnectionTypeID": 25,
            "Reference": "22",
            "LevelID": 2,
            "Amps": 16,
            "Voltage": 400,
            "PowerKW": 11,
            "CurrentTypeID": 20
        },
        {
            "ID": 264936,
            "ConnectionTypeID": 25,
            "Reference": "23",
            "LevelID": 2,
            "Amps": 16,
            "Voltage": 400,
            "PowerKW": 11,
            "CurrentTypeID": 20
        },
        {
            "ID": 264937,
            "ConnectionTypeID": 25,
            "Reference": "24",
            "LevelID": 2,
            "Amps": 16,
            "Voltage": 400,
            "PowerKW": 11,
            "CurrentTypeID": 20
        },
        {
            "ID": 264938,
            "ConnectionTypeID": 25,
            "Reference": "25",
            "LevelID": 2,
            "Amps": 16,
            "Voltage": 400,
            "PowerKW": 11,
            "CurrentTypeID": 20
        },
        {
            "ID": 264939,
            "ConnectionTypeID": 25,
            "Reference": "26",
            "LevelID": 2,
            "Amps": 16,
            "Voltage": 400,
            "PowerKW": 11,
            "CurrentTypeID": 20
        },
        {
            "ID": 264940,
            "ConnectionTypeID": 25,
            "Reference": "27",
            "LevelID": 2,
            "Amps": 16,
            "Voltage": 400,
            "PowerKW": 11,
            "CurrentTypeID": 20
        },
        {
            "ID": 264941,
            "ConnectionTypeID": 25,
            "Reference": "28",
            "LevelID": 2,
            "Amps": 16,
            "Voltage": 400,
            "PowerKW": 11,
            "CurrentTypeID": 20
        },
        {
            "ID": 264942,
            "ConnectionTypeID": 25,
            "Reference": "59",
            "LevelID": 2,
            "Amps": 16,
            "Voltage": 400,
            "PowerKW": 11,
            "CurrentTypeID": 20
        },
        {
            "ID": 264943,
            "ConnectionTypeID": 25,
            "Reference": "60",
            "LevelID": 2,
            "Amps": 16,
            "Voltage": 400,
            "PowerKW": 11,
            "CurrentTypeID": 20
        }
    ],
    "NumberOfPoints": 60,
    "StatusTypeID": 0,
    "DateLastStatusUpdate": "2021-03-24T05:10:00Z",
    "DataQualityLevel": 2,
    "DateCreated": "2021-03-03T09:01:00Z",
    "SubmissionStatusTypeID": 100
}