{
    "IsRecentlyVerified": false,
    "ID": 30090,
    "UUID": "06743013-309A-4D3E-AD8E-36E3C79EF5A6",
    "DataProviderID": 1,
    "DataProvidersReference": "SNT-00025",
    "OperatorID": 21,
    "UsageTypeID": 4,
    "UsageCost": "Mobi.E compatible card",
    "AddressInfo": {
        "ID": 30436,
        "Title": "SNT-00025",
        "AddressLine1": "Parque do Palácio da Pena",
        "Town": "Sintra",
        "Postcode": "2710-609",
        "CountryID": 180,
        "Latitude": 38.7881611,
        "Longitude": -9.38763889,
        "AccessComments": "Paid parking",
        "RelatedURL": "http://www.mobie.pt",
        "DistanceUnit": 0
    },
    "Connections": [
        {
            "ID": 33075,
            "ConnectionTypeID": 25,
            "StatusTypeID": 50,
            "LevelID": 2,
            "Amps": 16,
            "Voltage": 230,
            "PowerKW": 3.7,
            "CurrentTypeID": 10,
            "Quantity": 2
        }
    ],
    "NumberOfPoints": 2,
    "StatusTypeID": 50,
    "DateLastStatusUpdate": "2020-08-13T18:31:00Z",
    "DataQualityLevel": 3,
    "DateCreated": "2014-11-29T14:48:00Z",
    "SubmissionStatusTypeID": 100
}