{
    "IsRecentlyVerified": false,
    "ID": 63438,
    "UUID": "2AD63498-431E-4893-AAFA-F3A4510E9F32",
    "DataProviderID": 26,
    "DataProvidersReference": "74167",
    "OperatorID": 73,
    "OperatorsReference": "EV-Box EVB-P1421223",
    "UsageCost": "0.00 jaarabonnement",
    "AddressInfo": {
        "ID": 63784,
        "Title": "Vuilcop",
        "AddressLine1": "Vuilcop",
        "Town": "Nieuwegein",
        "Postcode": "3439 JJ",
        "CountryID": 159,
        "Latitude": 52.02404,
        "Longitude": 5.1254,
        "RelatedURL": "http://www.ev-box.nl",
        "DistanceUnit": 0
    },
    "Connections": [
        {
            "ID": 80898,
            "ConnectionTypeID": 25,
            "LevelID": 2,
            "PowerKW": 11,
            "CurrentTypeID": 10
        }
    ],
    "NumberOfPoints": 1,
    "StatusTypeID": 50,
    "DateLastStatusUpdate": "2016-06-04T02:44:00Z",
    "DataQualityLevel": 3,
    "DateCreated": "2016-03-03T12:30:00Z",
    "SubmissionStatusTypeID": 100
}