{
    "IsRecentlyVerified": false,
    "ID": 176873,
    "UUID": "EF99915C-CE92-4275-8F46-47973C77D6FF",
    "DataProviderID": 29,
    "DataProvidersReference": "12560",
    "OperatorID": 224,
    "AddressInfo": {
        "ID": 177232,
        "Title": "Kirchstrasse 16",
        "AddressLine1": "Kirchstrasse 16",
        "Town": "Schallstadt",
        "Postcode": "79227",
        "CountryID": 87,
        "Latitude": 47.96117,
        "Longitude": 7.7646,
        "DistanceUnit": 0
    },
    "Connections": [
        {
            "ID": 275316,
            "ConnectionTypeID": 28,
            "StatusTypeID": 50,
            "LevelID": 2,
            "PowerKW": 22,
            "CurrentTypeID": 10
        },
        {
            "ID": 275317,
            "ConnectionTypeID": 25,
            "StatusTypeID": 50,
            "LevelID": 2,
            "PowerKW": 22,
            "CurrentTypeID": 20
        }
    ],
    "StatusTypeID": 0,
    "DateLastStatusUpdate": "2021-07-09T03:11:00Z",
    "MetadataValues": [
        {
            "ID": 9168,
            "MetadataFieldID": 4,
            "ItemValue": "Data from the German chargepoint registry provided by Bundesnetzagentur.de under the CC-BY 4.0 license"
        }
    ],
    "DataQualityLevel": 3,
    "DateCreated": "2021-07-08T09:48:00Z",
    "SubmissionStatusTypeID": 100
}