{
    "IsRecentlyVerified": true,
    "DateLastVerified": "2021-09-19T10:36:00Z",
    "ID": 189284,
    "UUID": "67352319-35A7-444D-91F1-B72CDE12597A",
    "DataProviderID": 1,
    "OperatorID": 21,
    "UsageTypeID": 4,
    "UsageCost": "Mobi.E compatible card or App",
    "AddressInfo": {
        "ID": 189643,
        "Title": "PLM-00006/7 - Intermarché",
        "AddressLine1": "Intermarché",
        "Town": "Pinhal Novo",
        "StateOrProvince": "Setúbal",
        "Postcode": "",
        "CountryID": 180,
        "Latitude": 38.63584870503479,
        "Longitude": -8.899063740311703,
        "DistanceUnit": 0
    },
    "Connections": [
        {
            "ID": 306073,
            "ConnectionTypeID": 2,
            "StatusTypeID": 50,
            "LevelID": 3,
            "Amps": 120,
            "Voltage": 500,
            "PowerKW": 50,
            "CurrentTypeID": 30,
            "Quantity": 1
        },
        {
            "ID": 306074,
            "ConnectionTypeID": 33,
            "StatusTypeID": 50,
            "LevelID": 3,
            "Amps": 125,
            "Voltage": 500,
            "PowerKW": 50,
            "CurrentTypeID": 30,
            "Quantity": 1
        },
        {
            "ID": 306075,
            "ConnectionTypeID": 1036,
            "StatusTypeID": 50,
            "LevelID": 3,
            "Amps": 64,
            "Voltage": 400,
            "PowerKW": 43,
            "CurrentTypeID": 20,
            "Quantity": 1
        },
        {
            "ID": 306076,
            "ConnectionTypeID": 25,
            "StatusTypeID": 50,
            "LevelID": 2,
            "Amps": 32,
            "Voltage": 400,
            "PowerKW": 22,
            "CurrentTypeID": 20,
            "Quantity": 2
        }
    ],
    "NumberOfPoints": 4,
    "StatusTypeID": 50,
    "DateLastStatusUpdate": "2021-09-19T10:36:00Z",
    "DataQualityLevel": 1,
    "DateCreated": "2021-09-19T10:36:00Z",
    "SubmissionStatusTypeID": 200
}