{
    "IsRecentlyVerified": false,
    "ID": 123561,
    "UUID": "E02B2590-1FBF-4660-B0AD-3E73196ED31D",
    "DataProviderID": 2,
    "DataProvidersReference": "79873",
    "UsageTypeID": 7,
    "AddressInfo": {
        "ID": 123907,
        "Title": "Duke Chevrolet",
        "AddressLine1": "2016 N Main St",
        "Town": "Suffolk",
        "StateOrProvince": "VA",
        "Postcode": "23434",
        "CountryID": 2,
        "Latitude": 36.75832,
        "Longitude": -76.585905,
        "ContactTelephone1": "757-337-4409",
        "AccessComments": "24 hours daily\r\nPublic - Call ahead",
        "RelatedURL": "",
        "DistanceUnit": 0
    },
    "Connections": [
        {
            "ID": 173564,
            "ConnectionTypeID": 1,
            "LevelID": 2,
            "Amps": 16,
            "Voltage": 230,
            "PowerKW": 3.7,
            "CurrentTypeID": 10,
            "Quantity": 1
        }
    ],
    "DateLastStatusUpdate": "2020-06-26T02:58:00Z",
    "DataQualityLevel": 3,
    "DateCreated": "2019-04-06T05:03:00Z",
    "SubmissionStatusTypeID": 100
}