{
    "IsRecentlyVerified": false,
    "ID": 173979,
    "UUID": "8E40DDA0-0463-46CE-8DE8-35BEE0856747",
    "DataProviderID": 1,
    "OperatorID": 21,
    "UsageTypeID": 4,
    "UsageCost": "Mobi.E compatible card or App",
    "AddressInfo": {
        "ID": 174338,
        "Title": "AGN-00002 - Lidl",
        "AddressLine1": "",
        "Town": "Arganil",
        "StateOrProvince": "Coimbra",
        "Postcode": "",
        "CountryID": 180,
        "Latitude": 40.224091053071504,
        "Longitude": -8.057222439995599,
        "DistanceUnit": 0
    },
    "Connections": [
        {
            "ID": 268118,
            "ConnectionTypeID": 2,
            "StatusTypeID": 50,
            "LevelID": 3,
            "Amps": 125,
            "Voltage": 400,
            "PowerKW": 50,
            "CurrentTypeID": 30,
            "Quantity": 1
        },
        {
            "ID": 268119,
            "ConnectionTypeID": 33,
            "StatusTypeID": 50,
            "LevelID": 3,
            "Amps": 125,
            "Voltage": 400,
            "PowerKW": 50,
            "CurrentTypeID": 30,
            "Quantity": 1
        },
        {
            "ID": 268120,
            "ConnectionTypeID": 1036,
            "StatusTypeID": 50,
            "LevelID": 3,
            "PowerKW": 43,
            "CurrentTypeID": 20,
            "Quantity": 1
        }
    ],
    "NumberOfPoints": 2,
    "StatusTypeID": 50,
    "DateLastStatusUpdate": "2021-03-08T23:04:00Z",
    "DataQualityLevel": 1,
    "DateCreated": "2021-03-08T23:04:00Z",
    "SubmissionStatusTypeID": 200
}