{
    "IsRecentlyVerified": false,
    "ID": 29597,
    "UUID": "D9010063-988A-4B3D-9BC3-17673594E466",
    "DataProviderID": 15,
    "DataProvidersReference": "22296",
    "OperatorID": 31,
    "AddressInfo": {
        "ID": 29943,
        "Title": "1786 Merriam Way",
        "AddressLine1": "1786 Merriam Way",
        "Town": "Long Beach",
        "StateOrProvince": "California",
        "Postcode": "90815",
        "CountryID": 2,
        "Latitude": 33.786149,
        "Longitude": -118.11552,
        "ContactTelephone1": "",
        "RelatedURL": "http://carstations.com/22296",
        "DistanceUnit": 0
    },
    "Connections": [
        {
            "ID": 32582,
            "ConnectionTypeID": 1,
            "Reference": "J1772",
            "LevelID": 2
        }
    ],
    "StatusTypeID": 50,
    "DateLastStatusUpdate": "2017-11-04T14:04:00Z",
    "DataQualityLevel": 2,
    "DateCreated": "2014-11-29T05:39:00Z",
    "SubmissionStatusTypeID": 100
}