{
    "UserComments": [
        {
            "ID": 14508,
            "ChargePointID": 46716,
            "CommentTypeID": 1000,
            "UserName": "rettenet",
            "Comment": "Nem működik. ",
            "DateCreated": "2016-11-05T14:23:36.403Z",
            "User": {
                "ID": 11671,
                "Username": "rettenet"
            },
            "CheckinStatusTypeID": 20
        },
        {
            "ID": 4456,
            "ChargePointID": 46716,
            "CommentTypeID": 10,
            "UserName": "tibor.antaloczy",
            "Comment": "",
            "Rating": 5,
            "DateCreated": "2015-05-15T16:28:23.397Z",
            "User": {
                "ID": 4438,
                "Username": "tibor.antaloczy"
            },
            "CheckinStatusTypeID": 10
        },
        {
            "ID": 4347,
            "ChargePointID": 46716,
            "CommentTypeID": 10,
            "UserName": "tibor.antaloczy",
            "Rating": 5,
            "DateCreated": "2015-05-03T21:34:04.78Z",
            "User": {
                "ID": 4438,
                "Username": "tibor.antaloczy"
            },
            "CheckinStatusTypeID": 10
        }
    ],
    "MediaItems": [
        {
            "ID": 1413,
            "ChargePointID": 46716,
            "ItemURL": "https://s3-ap-southeast-2.amazonaws.com/openchargemap/images/HU/OCM46716/OCM-46716.orig.2015051516291123.jpg",
            "ItemThumbnailURL": "https://s3-ap-southeast-2.amazonaws.com/openchargemap/images/HU/OCM46716/OCM-46716.thmb.2015051516291123.jpg",
            "Comment": "",
            "IsEnabled": true,
            "IsVideo": false,
            "IsFeaturedItem": false,
            "IsExternalResource": false,
            "User": {
                "ID": 4438,
                "Username": "tibor.antaloczy"
            },
            "DateCreated": "2015-05-15T16:29:00Z"
        },
        {
            "ID": 1277,
            "ChargePointID": 46716,
            "ItemURL": "https://s3-ap-southeast-2.amazonaws.com/openchargemap/images/HU/OCM46716/OCM-46716.orig.2015050321322056.jpg",
            "ItemThumbnailURL": "https://s3-ap-southeast-2.amazonaws.com/openchargemap/images/HU/OCM46716/OCM-46716.thmb.2015050321322056.jpg",
            "Comment": "",
            "IsEnabled": true,
            "IsVideo": false,
            "IsFeaturedItem": false,
            "IsExternalResource": false,
            "User": {
                "ID": 4438,
                "Username": "tibor.antaloczy"
            },
            "DateCreated": "2015-05-03T21:33:00Z"
        },
        {
            "ID": 1278,
            "ChargePointID": 46716,
            "ItemURL": "https://s3-ap-southeast-2.amazonaws.com/openchargemap/images/HU/OCM46716/OCM-46716.orig.2015050321325465.jpg",
            "ItemThumbnailURL": "https://s3-ap-southeast-2.amazonaws.com/openchargemap/images/HU/OCM46716/OCM-46716.thmb.2015050321325465.jpg",
            "Comment": "",
            "IsEnabled": true,
            "IsVideo": false,
            "IsFeaturedItem": false,
            "IsExternalResource": false,
            "User": {
                "ID": 4438,
                "Username": "tibor.antaloczy"
            },
            "DateCreated": "2015-05-03T21:33:00Z"
        },
        {
            "ID": 1276,
            "ChargePointID": 46716,
            "ItemURL": "https://s3-ap-southeast-2.amazonaws.com/openchargemap/images/HU/OCM46716/OCM-46716.orig.2015050321320010.jpg",
            "ItemThumbnailURL": "https://s3-ap-southeast-2.amazonaws.com/openchargemap/images/HU/OCM46716/OCM-46716.thmb.2015050321320010.jpg",
            "Comment": "",
            "IsEnabled": true,
            "IsVideo": false,
            "IsFeaturedItem": false,
            "IsExternalResource": false,
            "User": {
                "ID": 4438,
                "Username": "tibor.antaloczy"
            },
            "DateCreated": "2015-05-03T21:32:00Z"
        }
    ],
    "IsRecentlyVerified": false,
    "ID": 46716,
    "UUID": "3262D796-C678-4D3A-9CB3-79060F09B8B5",
    "DataProviderID": 1,
    "OperatorID": 45,
    "UsageTypeID": 1,
    "UsageCost": "free",
    "AddressInfo": {
        "ID": 47062,
        "Title": "Budaörs, Nissan Gablini",
        "AddressLine1": "Malomkő u. 2.",
        "Town": "Budaörs",
        "StateOrProvince": "Pest megye",
        "Postcode": "2040",
        "CountryID": 104,
        "Latitude": 47.4516799857838,
        "Longitude": 18.9700418026246,
        "AccessComments": "Charger is behind the gates, Nissan owners can use it 24/7, others are limited to business hours (9am-6pm).",
        "DistanceUnit": 0
    },
    "Connections": [
        {
            "ID": 57389,
            "ConnectionTypeID": 2,
            "StatusTypeID": 100,
            "LevelID": 3,
            "Amps": 110,
            "Voltage": 400,
            "PowerKW": 44,
            "CurrentTypeID": 30,
            "Quantity": 1
        }
    ],
    "NumberOfPoints": 1,
    "GeneralComments": "Csak Nissan villanyautók töltéséhez. / Only for charging Nissan EVs.",
    "StatusTypeID": 50,
    "DateLastStatusUpdate": "2019-02-07T06:59:00Z",
    "DataQualityLevel": 1,
    "DateCreated": "2015-05-03T21:31:00Z",
    "SubmissionStatusTypeID": 200
}