{
    "IsRecentlyVerified": false,
    "ID": 186061,
    "UUID": "1A84FC08-8C87-4833-B4D9-296C2EBB6D29",
    "DataProviderID": 29,
    "DataProvidersReference": "21048",
    "OperatorID": 3403,
    "AddressInfo": {
        "ID": 186420,
        "Title": "Albert-Schweizer-Str. bei 10",
        "AddressLine1": "Albert-Schweizer-Str. bei 10",
        "Town": "Kulmbach",
        "Postcode": "95326",
        "CountryID": 87,
        "Latitude": 50.18814,
        "Longitude": 11.64828,
        "DistanceUnit": 0
    },
    "Connections": [
        {
            "ID": 297619,
            "ConnectionTypeID": 25,
            "StatusTypeID": 50,
            "LevelID": 2,
            "PowerKW": 11,
            "CurrentTypeID": 20
        },
        {
            "ID": 297620,
            "ConnectionTypeID": 25,
            "StatusTypeID": 50,
            "LevelID": 2,
            "PowerKW": 22,
            "CurrentTypeID": 20
        }
    ],
    "StatusTypeID": 50,
    "DateLastStatusUpdate": "2021-07-12T02:44:00Z",
    "MetadataValues": [
        {
            "ID": 18303,
            "MetadataFieldID": 4,
            "ItemValue": "Data from the German chargepoint registry provided by Bundesnetzagentur.de under the CC-BY 4.0 license"
        }
    ],
    "DataQualityLevel": 3,
    "DateCreated": "2021-07-12T02:44:00Z",
    "SubmissionStatusTypeID": 100
}