{
    "IsRecentlyVerified": false,
    "ID": 121936,
    "UUID": "CD7932D8-39A4-4C5B-AB5A-73854513E729",
    "DataProviderID": 2,
    "DataProvidersReference": "76695",
    "UsageTypeID": 1,
    "AddressInfo": {
        "ID": 122282,
        "Title": "California State University - Fullerton",
        "AddressLine1": "800 N State College Blvd",
        "Town": "Fullerton",
        "StateOrProvince": "CA",
        "Postcode": "92831",
        "CountryID": 2,
        "Latitude": 33.879858,
        "Longitude": -117.889677,
        "ContactTelephone1": "657-278-3082",
        "AccessComments": "24 hours daily",
        "RelatedURL": "",
        "DistanceUnit": 0
    },
    "Connections": [
        {
            "ID": 171780,
            "ConnectionTypeID": 2,
            "LevelID": 3,
            "Amps": 100,
            "Voltage": 400,
            "PowerKW": 40,
            "CurrentTypeID": 30,
            "Quantity": 2
        }
    ],
    "DateLastStatusUpdate": "2020-06-26T02:56:00Z",
    "DataQualityLevel": 3,
    "DateCreated": "2019-04-06T05:02:00Z",
    "SubmissionStatusTypeID": 100
}