{
    "IsRecentlyVerified": false,
    "ID": 15126,
    "UUID": "9D383C49-761E-4997-A6FA-8231D34E3DB1",
    "DataProviderID": 1,
    "OperatorID": 45,
    "OperatorsReference": "Brooklodge Hotel",
    "UsageTypeID": 7,
    "UsageCost": "Free",
    "AddressInfo": {
        "ID": 15472,
        "Title": "Brooklodge Hotel",
        "AddressLine1": "Macreddin Village",
        "AddressLine2": "Nr Aughrim",
        "Town": "Wicklow",
        "StateOrProvince": "County Wicklow",
        "CountryID": 3,
        "Latitude": 52.880319,
        "Longitude": -6.330914,
        "DistanceUnit": 0
    },
    "Connections": [
        {
            "ID": 28122,
            "ConnectionTypeID": 25,
            "StatusTypeID": 50,
            "LevelID": 2,
            "Amps": 32,
            "Voltage": 230,
            "PowerKW": 3.7,
            "CurrentTypeID": 10,
            "Quantity": 1
        }
    ],
    "NumberOfPoints": 2,
    "StatusTypeID": 50,
    "DateLastStatusUpdate": "2016-06-01T11:33:00Z",
    "DataQualityLevel": 2,
    "DateCreated": "2012-12-11T15:08:00Z",
    "SubmissionStatusTypeID": 100
}