{
    "MediaItems": [
        {
            "ID": 7675,
            "ChargePointID": 69993,
            "ItemURL": "https://s3-ap-southeast-2.amazonaws.com/openchargemap/images/US/OCM69993/OCM-69993.orig.2016062820331542.jpg",
            "ItemThumbnailURL": "https://s3-ap-southeast-2.amazonaws.com/openchargemap/images/US/OCM69993/OCM-69993.thmb.2016062820331542.jpg",
            "Comment": "Kingston charging station, Chapel Hill, NC",
            "IsEnabled": true,
            "IsVideo": false,
            "IsFeaturedItem": false,
            "IsExternalResource": false,
            "User": {
                "ID": 11551,
                "Username": "dfdf"
            },
            "DateCreated": "2016-06-28T20:34:00Z"
        }
    ],
    "IsRecentlyVerified": false,
    "ID": 69993,
    "UUID": "C0E5C233-12DD-4799-A64C-E85685568CB8",
    "DataProviderID": 1,
    "OperatorID": 1242,
    "UsageTypeID": 5,
    "UsageCost": "$1 per hour",
    "AddressInfo": {
        "ID": 70339,
        "Title": "Kingston",
        "AddressLine1": "125 Kingston Drive",
        "Town": "Chapel Hill",
        "StateOrProvince": "NC",
        "Postcode": "27514",
        "CountryID": 2,
        "Latitude": 35.961406,
        "Longitude": -79.0494768,
        "ContactTelephone1": "9198832151",
        "ContactTelephone2": "6302409095",
        "ContactEmail": "dan@taxlien.com",
        "AccessComments": "Pay with Plugshare",
        "DistanceUnit": 0
    },
    "Connections": [
        {
            "ID": 97856,
            "ConnectionTypeID": 1,
            "StatusTypeID": 50,
            "LevelID": 2,
            "Amps": 50,
            "Voltage": 240,
            "PowerKW": 12,
            "CurrentTypeID": 10
        }
    ],
    "NumberOfPoints": 1,
    "GeneralComments": "Available 24/7/365. Large shopping center nearby with restaurants, cinema, shopping. Very convenient to Interstate 40.",
    "StatusTypeID": 50,
    "DateLastStatusUpdate": "2016-06-30T07:47:00Z",
    "DataQualityLevel": 1,
    "DateCreated": "2016-06-28T20:31:00Z",
    "SubmissionStatusTypeID": 200
}