{
    "IsRecentlyVerified": false,
    "ID": 177566,
    "UUID": "69A41A98-F7CF-4BA7-B919-53918D23B2FF",
    "DataProviderID": 29,
    "DataProvidersReference": "12729",
    "AddressInfo": {
        "ID": 177925,
        "Title": "Neuhausen 2",
        "AddressLine1": "Neuhausen 2",
        "Town": "Heldenstein",
        "Postcode": "84431",
        "CountryID": 87,
        "Latitude": 48.225,
        "Longitude": 12.304,
        "DistanceUnit": 0
    },
    "Connections": [
        {
            "ID": 276858,
            "ConnectionTypeID": 28,
            "StatusTypeID": 50,
            "LevelID": 2,
            "PowerKW": 22,
            "CurrentTypeID": 10
        }
    ],
    "StatusTypeID": 0,
    "DateLastStatusUpdate": "2021-07-09T03:12:00Z",
    "MetadataValues": [
        {
            "ID": 9860,
            "MetadataFieldID": 4,
            "ItemValue": "Data from the German chargepoint registry provided by Bundesnetzagentur.de under the CC-BY 4.0 license"
        }
    ],
    "DataQualityLevel": 3,
    "DateCreated": "2021-07-08T09:49:00Z",
    "SubmissionStatusTypeID": 100
}