{
    "IsRecentlyVerified": false,
    "ID": 132661,
    "UUID": "5D158369-1A2A-4CB1-9D6D-5A70C2E7B1B9",
    "DataProviderID": 1,
    "OperatorID": 23,
    "OperatorsReference": "43279",
    "UsageTypeID": 4,
    "UsageCost": "$0.24/min >=60kW; $0.12/min <60kW; other tariffs for older cars",
    "AddressInfo": {
        "ID": 133007,
        "Title": "Incline Village, NV Supercharger",
        "AddressLine1": "930 Tahoe Boulevard",
        "Town": "Incline Village",
        "StateOrProvince": "NV",
        "Postcode": "89451",
        "CountryID": 2,
        "Latitude": 39.250792,
        "Longitude": -119.948953,
        "DistanceUnit": 0
    },
    "Connections": [
        {
            "ID": 185725,
            "ConnectionTypeID": 27,
            "StatusTypeID": 50,
            "LevelID": 3,
            "PowerKW": 120,
            "CurrentTypeID": 30,
            "Quantity": 10
        }
    ],
    "NumberOfPoints": 10,
    "GeneralComments": "Charging10 Superchargers, available 24/7, up to 120kW",
    "StatusTypeID": 50,
    "DateLastStatusUpdate": "2019-10-05T05:41:00Z",
    "DataQualityLevel": 1,
    "DateCreated": "2019-10-05T05:41:00Z",
    "SubmissionStatusTypeID": 200
}