{
    "IsRecentlyVerified": false,
    "ID": 134391,
    "UUID": "5DBD64E9-807F-4B94-BA01-E72862F0B8D3",
    "DataProviderID": 1,
    "OperatorID": 45,
    "UsageTypeID": 6,
    "AddressInfo": {
        "ID": 134737,
        "Title": "Bjerkeløkkja",
        "AddressLine1": "SPÆLAVEGEN 347",
        "Town": "Oppdal",
        "StateOrProvince": "Trøndelag",
        "Postcode": "7340 ",
        "CountryID": 168,
        "Latitude": 62.5934712,
        "Longitude": 9.5586819,
        "AccessComments": "The contacts are on the back side of Hovedhuset",
        "DistanceUnit": 0
    },
    "Connections": [
        {
            "ID": 188104,
            "ConnectionTypeID": 28,
            "Amps": 10,
            "Quantity": 2
        }
    ],
    "NumberOfPoints": 2,
    "StatusTypeID": 50,
    "DateLastStatusUpdate": "2019-11-14T08:19:00Z",
    "DataQualityLevel": 1,
    "DateCreated": "2019-11-11T09:46:00Z",
    "SubmissionStatusTypeID": 200
}