{
    "IsRecentlyVerified": false,
    "ID": 10151,
    "UUID": "EDF981DF-DB4C-45E1-B471-BACC4EC1F74B",
    "DataProviderID": 1,
    "DataProvidersReference": "1149",
    "AddressInfo": {
        "ID": 10048,
        "Title": "Elverum rådhus",
        "AddressLine1": "Storgata 18",
        "Town": "ELVERUM",
        "StateOrProvince": "Innlandet",
        "Postcode": "2407",
        "CountryID": 168,
        "Latitude": 60.8815,
        "Longitude": 11.5633,
        "AccessComments": "På parkeringsplass på baksiden av Rådhuset.",
        "DistanceUnit": 0
    },
    "Connections": [
        {
            "ID": 8067,
            "ConnectionTypeID": 0,
            "Reference": "1",
            "LevelID": 2,
            "Amps": 16,
            "Voltage": 230,
            "PowerKW": 3.7,
            "Comments": "Mode 1"
        }
    ],
    "NumberOfPoints": 1,
    "StatusTypeID": 0,
    "DateLastStatusUpdate": "2020-05-26T08:24:00Z",
    "DataQualityLevel": 2,
    "DateCreated": "2012-05-10T15:02:00Z",
    "SubmissionStatusTypeID": 100
}