{
    "IsRecentlyVerified": false,
    "ID": 124889,
    "UUID": "DABBB8D3-C8BC-4884-86DC-59560A189C13",
    "DataProviderID": 2,
    "DataProvidersReference": "121160",
    "OperatorID": 3318,
    "UsageTypeID": 1,
    "AddressInfo": {
        "ID": 125235,
        "Title": "Waukee Kum & Go 540",
        "AddressLine1": "3105 Grand Prairie Parkway",
        "Town": "Waukee",
        "StateOrProvince": "IA",
        "Postcode": "50263",
        "CountryID": 2,
        "Latitude": 41.573999,
        "Longitude": -93.852648,
        "ContactTelephone1": "833-632-2778",
        "AccessComments": "24 hours daily",
        "RelatedURL": "https://www.electrifyamerica.com/",
        "DistanceUnit": 0
    },
    "Connections": [
        {
            "ID": 175049,
            "ConnectionTypeID": 2,
            "LevelID": 2,
            "Amps": 100,
            "Voltage": 400,
            "PowerKW": 40,
            "CurrentTypeID": 10,
            "Quantity": 1
        },
        {
            "ID": 175050,
            "ConnectionTypeID": 32,
            "LevelID": 2,
            "Amps": 100,
            "Voltage": 400,
            "PowerKW": 40,
            "CurrentTypeID": 10,
            "Quantity": 1
        }
    ],
    "DateLastStatusUpdate": "2019-04-06T05:04:00Z",
    "DataQualityLevel": 3,
    "DateCreated": "2019-04-06T05:04:00Z",
    "SubmissionStatusTypeID": 100
}