{
    "IsRecentlyVerified": false,
    "ID": 177347,
    "UUID": "5F5C01ED-7582-4BA7-A528-43592F3C29DE",
    "DataProviderID": 29,
    "DataProvidersReference": "98",
    "AddressInfo": {
        "ID": 177706,
        "Title": "Spelbergs Feld 1-5",
        "AddressLine1": "Spelbergs Feld 1-5",
        "Town": "Bochum",
        "Postcode": "44869",
        "CountryID": 87,
        "Latitude": 51.459017,
        "Longitude": 7.154792,
        "DistanceUnit": 0
    },
    "Connections": [
        {
            "ID": 276392,
            "ConnectionTypeID": 25,
            "StatusTypeID": 50,
            "LevelID": 2,
            "PowerKW": 22,
            "CurrentTypeID": 20
        },
        {
            "ID": 276393,
            "ConnectionTypeID": 25,
            "StatusTypeID": 50,
            "LevelID": 2,
            "PowerKW": 22,
            "CurrentTypeID": 20
        }
    ],
    "StatusTypeID": 0,
    "DateLastStatusUpdate": "2021-07-12T02:47:00Z",
    "MetadataValues": [
        {
            "ID": 9641,
            "MetadataFieldID": 4,
            "ItemValue": "Data from the German chargepoint registry provided by Bundesnetzagentur.de under the CC-BY 4.0 license"
        }
    ],
    "DataQualityLevel": 3,
    "DateCreated": "2021-07-08T09:48:00Z",
    "SubmissionStatusTypeID": 100
}