{
    "IsRecentlyVerified": false,
    "ID": 32273,
    "UUID": "0E800926-6827-4049-9562-399571AAF0D1",
    "DataProviderID": 1,
    "OperatorID": 36,
    "OperatorsReference": "ENO-EVA-A071_2",
    "UsageTypeID": 4,
    "UsageCost": "0.00 afhankelijk van pas",
    "AddressInfo": {
        "ID": 32619,
        "Title": "EVA Oudenaarde I",
        "AddressLine1": "Tussenmuren 17",
        "Town": "Oudenaarde",
        "Postcode": "9700",
        "CountryID": 26,
        "Latitude": 50.838882794185366,
        "Longitude": 3.605158318367092,
        "ContactTelephone1": "+32 (0)78 48 10 77",
        "RelatedURL": "http://www.bluecorner.be",
        "DistanceUnit": 0
    },
    "Connections": [
        {
            "ID": 35784,
            "ConnectionTypeID": 25,
            "StatusTypeID": 50,
            "LevelID": 2,
            "Amps": 32,
            "Voltage": 400,
            "PowerKW": 22,
            "CurrentTypeID": 20,
            "Quantity": 1
        },
        {
            "ID": 42791,
            "ConnectionTypeID": 23,
            "StatusTypeID": 50,
            "LevelID": 2,
            "Amps": 16,
            "Voltage": 230,
            "PowerKW": 3.7,
            "CurrentTypeID": 10,
            "Quantity": 7
        }
    ],
    "NumberOfPoints": 2,
    "StatusTypeID": 50,
    "DateLastStatusUpdate": "2015-01-09T21:28:00Z",
    "DataQualityLevel": 3,
    "DateCreated": "2015-01-09T06:03:00Z",
    "SubmissionStatusTypeID": 200
}