{
    "IsRecentlyVerified": false,
    "ID": 39033,
    "UUID": "E1067073-CDF2-4E07-956A-D5DEEC8FE032",
    "DataProviderID": 26,
    "DataProvidersReference": "46906",
    "OperatorID": 157,
    "OperatorsReference": "NewMotion 02009330",
    "UsageCost": "0.00 jaarabonnement",
    "AddressInfo": {
        "ID": 39379,
        "Title": "Hissemar 22",
        "AddressLine1": "Hissemar 22",
        "Town": "Leeuwarden",
        "Postcode": "8939 CK",
        "CountryID": 159,
        "Latitude": 53.1861228942871,
        "Longitude": 5.83882761001587,
        "ContactTelephone1": "088 0109500",
        "RelatedURL": "http://thenewmotion.nl/",
        "DistanceUnit": 0
    },
    "Connections": [
        {
            "ID": 42544,
            "ConnectionTypeID": 25,
            "LevelID": 2,
            "PowerKW": 3.7,
            "CurrentTypeID": 10
        }
    ],
    "NumberOfPoints": 1,
    "StatusTypeID": 50,
    "DateLastStatusUpdate": "2016-06-04T02:56:00Z",
    "DataQualityLevel": 3,
    "DateCreated": "2015-01-09T06:08:00Z",
    "SubmissionStatusTypeID": 100
}