{
    "UserComments": [
        {
            "ID": 19121,
            "ChargePointID": 54205,
            "CommentTypeID": 10,
            "UserName": "PatrykS",
            "Comment": "Successfully Charged Opel Ampera",
            "Rating": 4,
            "DateCreated": "2018-01-23T08:45:27.77Z",
            "User": {
                "ID": 6418,
                "Username": "PatrykS"
            },
            "CheckinStatusTypeID": 10
        },
        {
            "ID": 14680,
            "ChargePointID": 54205,
            "CommentTypeID": 10,
            "UserName": "PatrykS",
            "Comment": "2016-12-06 22:40 Successfully charged Opel Ampera and Mitsubishi i-MiEV using Type 2 socket.",
            "Rating": 4,
            "DateCreated": "2016-12-10T17:09:50.75Z",
            "User": {
                "ID": 6418,
                "Username": "PatrykS"
            },
            "CheckinStatusTypeID": 10
        },
        {
            "ID": 14679,
            "ChargePointID": 54205,
            "CommentTypeID": 10,
            "UserName": "PatrykS",
            "Comment": "2016-12-04 9:30 Successfully charged Opel Ampera using Type 2 socket",
            "Rating": 4,
            "DateCreated": "2016-12-10T14:48:16.637Z",
            "User": {
                "ID": 6418,
                "Username": "PatrykS"
            },
            "CheckinStatusTypeID": 10
        },
        {
            "ID": 14356,
            "ChargePointID": 54205,
            "CommentTypeID": 10,
            "UserName": "PatrykS",
            "Comment": "2016-10-07 09:00 Successfully charged Opel Ampera using Type 2 / Mennekes socket.",
            "Rating": 4,
            "DateCreated": "2016-10-07T08:48:08.847Z",
            "User": {
                "ID": 6418,
                "Username": "PatrykS"
            },
            "CheckinStatusTypeID": 10
        },
        {
            "ID": 13912,
            "ChargePointID": 54205,
            "CommentTypeID": 10,
            "UserName": "PatrykS",
            "Comment": "2016-07-21 22:00 Successfully charged Opel Ampera using Type 2 / Mennekes socket.",
            "DateCreated": "2016-07-28T23:04:08.207Z",
            "User": {
                "ID": 6418,
                "Username": "PatrykS"
            },
            "CheckinStatusTypeID": 10
        },
        {
            "ID": 8235,
            "ChargePointID": 54205,
            "CommentTypeID": 10,
            "UserName": "PatrykS",
            "Comment": "2015-12-16 02:00 Successfully charged Opel Ampera using one of the Schuko sockets.",
            "Rating": 4,
            "DateCreated": "2015-12-16T13:59:31.203Z",
            "User": {
                "ID": 6418,
                "Username": "PatrykS"
            },
            "CheckinStatusTypeID": 10
        }
    ],
    "MediaItems": [
        {
            "ID": 8778,
            "ChargePointID": 54205,
            "ItemURL": "https://s3-ap-southeast-2.amazonaws.com/openchargemap/images/PL/OCM54205/OCM-54205.orig.2016121017080643.jpg",
            "ItemThumbnailURL": "https://s3-ap-southeast-2.amazonaws.com/openchargemap/images/PL/OCM54205/OCM-54205.thmb.2016121017080643.jpg",
            "Comment": "Both bays occupied :-)",
            "IsEnabled": true,
            "IsVideo": false,
            "IsFeaturedItem": false,
            "IsExternalResource": false,
            "User": {
                "ID": 6418,
                "Username": "PatrykS"
            },
            "DateCreated": "2016-12-10T17:08:00Z"
        },
        {
            "ID": 8777,
            "ChargePointID": 54205,
            "ItemURL": "https://s3-ap-southeast-2.amazonaws.com/openchargemap/images/PL/OCM54205/OCM-54205.orig.2016121017042488.jpg",
            "ItemThumbnailURL": "https://s3-ap-southeast-2.amazonaws.com/openchargemap/images/PL/OCM54205/OCM-54205.thmb.2016121017042488.jpg",
            "Comment": "Both bays occupied :-)",
            "IsEnabled": true,
            "IsVideo": false,
            "IsFeaturedItem": false,
            "IsExternalResource": false,
            "User": {
                "ID": 6418,
                "Username": "PatrykS"
            },
            "DateCreated": "2016-12-10T17:05:00Z"
        },
        {
            "ID": 8391,
            "ChargePointID": 54205,
            "ItemURL": "https://s3-ap-southeast-2.amazonaws.com/openchargemap/images/PL/OCM54205/OCM-54205.orig.2016100708491970.jpg",
            "ItemThumbnailURL": "https://s3-ap-southeast-2.amazonaws.com/openchargemap/images/PL/OCM54205/OCM-54205.thmb.2016100708491970.jpg",
            "Comment": "Charging Opel Ampera using Type 2 / Mennekes socket and own cable.",
            "IsEnabled": true,
            "IsVideo": false,
            "IsFeaturedItem": false,
            "IsExternalResource": false,
            "User": {
                "ID": 6418,
                "Username": "PatrykS"
            },
            "DateCreated": "2016-10-07T08:50:00Z"
        },
        {
            "ID": 3624,
            "ChargePointID": 54205,
            "ItemURL": "https://s3-ap-southeast-2.amazonaws.com/openchargemap/images/PL/OCM54205/OCM-54205.orig.2015121617231842.jpg",
            "ItemThumbnailURL": "https://s3-ap-southeast-2.amazonaws.com/openchargemap/images/PL/OCM54205/OCM-54205.thmb.2015121617231842.jpg",
            "Comment": "Screen of the charging station",
            "IsEnabled": true,
            "IsVideo": false,
            "IsFeaturedItem": false,
            "IsExternalResource": false,
            "User": {
                "ID": 6418,
                "Username": "PatrykS"
            },
            "DateCreated": "2015-12-16T17:24:00Z"
        },
        {
            "ID": 3625,
            "ChargePointID": 54205,
            "ItemURL": "https://s3-ap-southeast-2.amazonaws.com/openchargemap/images/PL/OCM54205/OCM-54205.orig.2015121617233940.jpg",
            "ItemThumbnailURL": "https://s3-ap-southeast-2.amazonaws.com/openchargemap/images/PL/OCM54205/OCM-54205.thmb.2015121617233940.jpg",
            "Comment": "Screen of the charging station",
            "IsEnabled": true,
            "IsVideo": false,
            "IsFeaturedItem": false,
            "IsExternalResource": false,
            "User": {
                "ID": 6418,
                "Username": "PatrykS"
            },
            "DateCreated": "2015-12-16T17:24:00Z"
        },
        {
            "ID": 3626,
            "ChargePointID": 54205,
            "ItemURL": "https://s3-ap-southeast-2.amazonaws.com/openchargemap/images/PL/OCM54205/OCM-54205.orig.2015121617240121.jpg",
            "ItemThumbnailURL": "https://s3-ap-southeast-2.amazonaws.com/openchargemap/images/PL/OCM54205/OCM-54205.thmb.2015121617240121.jpg",
            "Comment": "Charging station",
            "IsEnabled": true,
            "IsVideo": false,
            "IsFeaturedItem": false,
            "IsExternalResource": false,
            "User": {
                "ID": 6418,
                "Username": "PatrykS"
            },
            "DateCreated": "2015-12-16T17:24:00Z"
        }
    ],
    "IsRecentlyVerified": false,
    "ID": 54205,
    "UUID": "4CDA86DC-A8BC-420B-87D1-5FFAC5C1380D",
    "DataProviderID": 1,
    "OperatorID": 218,
    "UsageTypeID": 4,
    "UsageCost": "0",
    "AddressInfo": {
        "ID": 54551,
        "Title": "Zarząd Dróg i Zieleni w Gdańsku, Partyzantów 36",
        "AddressLine1": "Partyzantów 36",
        "AddressLine2": "Wrzeszcz",
        "Town": "Gdańsk",
        "StateOrProvince": "pomorskie",
        "Postcode": "80-254",
        "CountryID": 179,
        "Latitude": 54.3783686433182,
        "Longitude": 18.6008453550703,
        "ContactTelephone1": "+58 52 44 500",
        "ContactTelephone2": "+48 68 328 20 89",
        "ContactEmail": "kontakt@galactico.pl",
        "AccessComments": "Without cables, just sockets.",
        "RelatedURL": "http://galactico.pl",
        "DistanceUnit": 0
    },
    "Connections": [
        {
            "ID": 68187,
            "ConnectionTypeID": 28,
            "StatusTypeID": 50,
            "LevelID": 2,
            "Amps": 16,
            "Voltage": 230,
            "PowerKW": 3.6,
            "CurrentTypeID": 10,
            "Quantity": 2
        },
        {
            "ID": 68188,
            "ConnectionTypeID": 25,
            "StatusTypeID": 50,
            "LevelID": 2,
            "Amps": 32,
            "Voltage": 400,
            "PowerKW": 22,
            "CurrentTypeID": 20,
            "Quantity": 1
        }
    ],
    "NumberOfPoints": 2,
    "StatusTypeID": 50,
    "DateLastStatusUpdate": "2018-01-23T08:45:00Z",
    "DataQualityLevel": 1,
    "DateCreated": "2015-09-24T22:58:00Z",
    "SubmissionStatusTypeID": 200
}