{
    "IsRecentlyVerified": false,
    "ID": 177766,
    "UUID": "A6AD11E7-C617-4EC1-8FE4-B67F8EAAAFA6",
    "DataProviderID": 29,
    "DataProvidersReference": "858",
    "AddressInfo": {
        "ID": 178125,
        "Title": "Am Schlossgarten 7",
        "AddressLine1": "Am Schlossgarten 7",
        "Town": "Braunschweig",
        "Postcode": "38100",
        "CountryID": 87,
        "Latitude": 52.264949,
        "Longitude": 10.52972,
        "DistanceUnit": 0
    },
    "Connections": [
        {
            "ID": 277319,
            "ConnectionTypeID": 33,
            "StatusTypeID": 50,
            "LevelID": 3,
            "PowerKW": 50,
            "CurrentTypeID": 30
        },
        {
            "ID": 300343,
            "ConnectionTypeID": 2,
            "StatusTypeID": 50,
            "LevelID": 3,
            "PowerKW": 50,
            "CurrentTypeID": 30
        },
        {
            "ID": 300344,
            "ConnectionTypeID": 1036,
            "StatusTypeID": 50,
            "LevelID": 2,
            "PowerKW": 22,
            "CurrentTypeID": 20
        }
    ],
    "StatusTypeID": 0,
    "DateLastStatusUpdate": "2021-07-12T02:49:00Z",
    "MetadataValues": [
        {
            "ID": 10060,
            "MetadataFieldID": 4,
            "ItemValue": "Data from the German chargepoint registry provided by Bundesnetzagentur.de under the CC-BY 4.0 license"
        }
    ],
    "DataQualityLevel": 3,
    "DateCreated": "2021-07-08T09:49:00Z",
    "SubmissionStatusTypeID": 100
}