{
    "IsRecentlyVerified": false,
    "ID": 152117,
    "UUID": "1D707571-C5FF-4675-ACBB-A29B196A7EE9",
    "DataProviderID": 28,
    "DataProvidersReference": "FR*S86*PSORE*B134",
    "UsageTypeID": 5,
    "AddressInfo": {
        "ID": 152470,
        "Title": "B134",
        "AddressLine1": "Parking de la mairie - 86500 - Pindray",
        "CountryID": 80,
        "Latitude": 46.4907,
        "Longitude": 0.81045,
        "AccessComments": "24/24 7/7 jours",
        "DistanceUnit": 0
    },
    "Connections": [
        {
            "ID": 212813,
            "ConnectionTypeID": 28,
            "StatusTypeID": 50,
            "LevelID": 2,
            "PowerKW": 18,
            "CurrentTypeID": 10
        },
        {
            "ID": 212814,
            "ConnectionTypeID": 25,
            "StatusTypeID": 50,
            "LevelID": 2,
            "PowerKW": 18,
            "CurrentTypeID": 20
        },
        {
            "ID": 245670,
            "ConnectionTypeID": 28,
            "StatusTypeID": 50,
            "LevelID": 2,
            "PowerKW": 18,
            "CurrentTypeID": 10
        },
        {
            "ID": 245671,
            "ConnectionTypeID": 25,
            "StatusTypeID": 50,
            "LevelID": 2,
            "PowerKW": 18,
            "CurrentTypeID": 20
        }
    ],
    "GeneralComments": "",
    "StatusTypeID": 50,
    "DateLastStatusUpdate": "2020-08-27T05:12:00Z",
    "DataQualityLevel": 2,
    "DateCreated": "2020-03-15T10:53:00Z",
    "SubmissionStatusTypeID": 100
}