{
    "IsRecentlyVerified": false,
    "ID": 158494,
    "UUID": "9F594256-9A8E-4F76-A5E2-5D3F8B4888CC",
    "DataProviderID": 1,
    "OperatorID": 5,
    "UsageTypeID": 1,
    "AddressInfo": {
        "ID": 158851,
        "Title": "WILD WEST HD",
        "AddressLine1": "5702 58th St",
        "Town": "Lubbock",
        "StateOrProvince": "TX",
        "Postcode": "79424",
        "CountryID": 2,
        "Latitude": 33.5416663,
        "Longitude": -101.9378276,
        "ContactTelephone1": "888-758-4389",
        "AccessComments": "24 hours daily",
        "RelatedURL": "http://www.chargepoint.com/",
        "DistanceUnit": 0
    },
    "Connections": [
        {
            "ID": 228482,
            "ConnectionTypeID": 32,
            "StatusTypeID": 50,
            "LevelID": 3,
            "Amps": 100,
            "Voltage": 400,
            "PowerKW": 24,
            "CurrentTypeID": 30,
            "Quantity": 1
        }
    ],
    "StatusTypeID": 50,
    "DateLastStatusUpdate": "2021-02-24T14:16:00Z",
    "DataQualityLevel": 3,
    "DateCreated": "2020-06-26T02:55:00Z",
    "SubmissionStatusTypeID": 100
}