{
    "IsRecentlyVerified": false,
    "ID": 33860,
    "UUID": "C8B5416E-40E9-447F-B72E-20604F0A13EE",
    "DataProviderID": 1,
    "OperatorID": 105,
    "OperatorsReference": "Essent EM-DE-05570028-01-00001",
    "UsageTypeID": 4,
    "AddressInfo": {
        "ID": 34206,
        "Title": "In der Geist 110",
        "AddressLine1": "In der Geist 110",
        "Town": "Oelde",
        "Postcode": "59302",
        "CountryID": 87,
        "Latitude": 51.811653,
        "Longitude": 8.133767,
        "DistanceUnit": 0
    },
    "Connections": [
        {
            "ID": 37371,
            "ConnectionTypeID": 25,
            "LevelID": 2,
            "PowerKW": 11
        },
        {
            "ID": 46945,
            "ConnectionTypeID": 25,
            "LevelID": 2,
            "PowerKW": 11
        }
    ],
    "NumberOfPoints": 1,
    "StatusTypeID": 50,
    "DateLastStatusUpdate": "2015-04-13T04:49:00Z",
    "DataQualityLevel": 3,
    "DateCreated": "2015-01-09T06:04:00Z",
    "SubmissionStatusTypeID": 200
}