{
    "IsRecentlyVerified": false,
    "ID": 51388,
    "UUID": "74820F02-C89C-496A-8630-1C1E91B0CC07",
    "DataProviderID": 1,
    "OperatorID": 20,
    "OperatorsReference": "70823",
    "UsageTypeID": 6,
    "UsageCost": "Free",
    "AddressInfo": {
        "ID": 51734,
        "Title": "Broadgreen Hospital",
        "AddressLine1": "Thomas Drive",
        "AddressLine2": "Broad Green",
        "Town": "Liverpool",
        "StateOrProvince": "England",
        "Postcode": "L14 3LB",
        "CountryID": 1,
        "Latitude": 53.4111511,
        "Longitude": -2.89798930000006,
        "AccessComments": "Charge point is located within staff parking area.",
        "DistanceUnit": 0
    },
    "Connections": [
        {
            "ID": 63635,
            "ConnectionTypeID": 25,
            "StatusTypeID": 50,
            "LevelID": 2,
            "Amps": 32,
            "Voltage": 230,
            "PowerKW": 7,
            "CurrentTypeID": 10,
            "Quantity": 2
        }
    ],
    "NumberOfPoints": 2,
    "StatusTypeID": 50,
    "DateLastStatusUpdate": "2017-05-02T12:47:00Z",
    "DataQualityLevel": 1,
    "DateCreated": "2015-07-24T17:47:00Z",
    "SubmissionStatusTypeID": 200
}