{
    "IsRecentlyVerified": false,
    "ID": 23317,
    "UUID": "2D24AE07-1F8D-4DD6-99BB-229DCEEBE8C3",
    "DataProviderID": 1,
    "OperatorID": 1,
    "UsageTypeID": 1,
    "AddressInfo": {
        "ID": 23662,
        "Title": "Second Avenue",
        "AddressLine1": "Second Avenue",
        "AddressLine2": "Hospital Hill",
        "Town": "Squamish",
        "StateOrProvince": "Squamish-Lillooet Regional District",
        "Postcode": "V8B0B7",
        "CountryID": 44,
        "Latitude": 49.6981137219414,
        "Longitude": -123.155385465553,
        "AccessComments": "Just beside the kids park",
        "DistanceUnit": 0
    },
    "Connections": [
        {
            "ID": 25194,
            "ConnectionTypeID": 2,
            "Quantity": 1
        }
    ],
    "NumberOfPoints": 1,
    "StatusTypeID": 50,
    "DateLastStatusUpdate": "2014-05-19T19:14:00Z",
    "DataQualityLevel": 1,
    "DateCreated": "2014-05-18T19:59:00Z",
    "SubmissionStatusTypeID": 200
}