{
    "IsRecentlyVerified": false,
    "ID": 59140,
    "UUID": "4568C916-CE7A-4EAC-A25B-8CB57434F1CB",
    "DataProviderID": 1,
    "OperatorID": 1,
    "UsageTypeID": 6,
    "AddressInfo": {
        "ID": 59486,
        "Title": " Editoriale Domus - Quattroruote",
        "AddressLine1": "Via Gianni Mazzocchi, 1/3",
        "Town": "Rozzano",
        "StateOrProvince": "MI",
        "Postcode": "20089",
        "CountryID": 112,
        "Latitude": 45.382858516199065,
        "Longitude": 9.173221358105467,
        "ContactTelephone1": "+39.02.82472.1",
        "ContactEmail": "editorialedomus@edidomus.it",
        "RelatedURL": "http://www.edidomus.it/",
        "DistanceUnit": 0
    },
    "Connections": [
        {
            "ID": 75058,
            "ConnectionTypeID": 25,
            "StatusTypeID": 50,
            "LevelID": 2,
            "Quantity": 1
        },
        {
            "ID": 75059,
            "ConnectionTypeID": 36,
            "StatusTypeID": 50,
            "LevelID": 2,
            "CurrentTypeID": 10,
            "Quantity": 1
        }
    ],
    "NumberOfPoints": 2,
    "StatusTypeID": 50,
    "DateLastStatusUpdate": "2016-01-08T10:55:00Z",
    "DataQualityLevel": 1,
    "DateCreated": "2016-01-08T10:55:00Z",
    "SubmissionStatusTypeID": 200
}