{
    "IsRecentlyVerified": false,
    "ID": 115454,
    "UUID": "A5DC2B44-55DC-4397-B284-303452148FCF",
    "DataProviderID": 2,
    "DataProvidersReference": "113209",
    "OperatorID": 23,
    "UsageTypeID": 2,
    "AddressInfo": {
        "ID": 115800,
        "Title": "Airbnb - Via Monte - Tesla Destination",
        "AddressLine1": "2429 Via Monte Vista",
        "Town": "Palm Springs",
        "StateOrProvince": "CA",
        "Postcode": "92262",
        "CountryID": 2,
        "Latitude": 33.851636,
        "Longitude": -116.554538,
        "ContactTelephone1": "",
        "AccessComments": "Available for Airbnb patrons only; for Tesla use only",
        "RelatedURL": "https://www.tesla.com/destination-charging",
        "DistanceUnit": 0
    },
    "Connections": [
        {
            "ID": 162465,
            "ConnectionTypeID": 0,
            "LevelID": 2,
            "Amps": 16,
            "Voltage": 230,
            "PowerKW": 3,
            "CurrentTypeID": 10,
            "Quantity": 1
        }
    ],
    "DateLastStatusUpdate": "2019-04-06T04:01:00Z",
    "DataQualityLevel": 3,
    "DateCreated": "2019-02-11T07:13:00Z",
    "SubmissionStatusTypeID": 100
}