{
    "IsRecentlyVerified": false,
    "ID": 170951,
    "UUID": "E1B039F7-3ED1-4598-97C7-76F63A3CBC8D",
    "DataProviderID": 1,
    "OperatorID": 3299,
    "UsageTypeID": 4,
    "UsageCost": "0,79 €/min",
    "AddressInfo": {
        "ID": 171310,
        "Title": "A10 Blois Villerbon",
        "AddressLine1": "Aire de Blois-Villerbon",
        "Town": "Blois",
        "Postcode": "41000",
        "CountryID": 80,
        "Latitude": 47.66606243873787,
        "Longitude": 1.387593496280033,
        "DistanceUnit": 0
    },
    "Connections": [
        {
            "ID": 261187,
            "ConnectionTypeID": 33,
            "Reference": "Ionity ",
            "StatusTypeID": 50,
            "LevelID": 3,
            "PowerKW": 175,
            "CurrentTypeID": 30,
            "Quantity": 4
        },
        {
            "ID": 261188,
            "ConnectionTypeID": 2,
            "Reference": "Ionity ",
            "StatusTypeID": 50,
            "LevelID": 3,
            "PowerKW": 50,
            "CurrentTypeID": 30,
            "Quantity": 1,
            "Comments": "Combo"
        },
        {
            "ID": 261193,
            "ConnectionTypeID": 1036,
            "StatusTypeID": 50,
            "LevelID": 3,
            "Amps": 63,
            "Voltage": 400,
            "PowerKW": 43,
            "CurrentTypeID": 20,
            "Quantity": 1
        }
    ],
    "NumberOfPoints": 5,
    "StatusTypeID": 50,
    "DateLastStatusUpdate": "2020-12-14T16:30:00Z",
    "DataQualityLevel": 1,
    "DateCreated": "2020-12-14T14:32:00Z",
    "SubmissionStatusTypeID": 200
}