{
    "IsRecentlyVerified": false,
    "ID": 18775,
    "UUID": "58DF2615-D22F-46EE-86D7-8E2807FA6A87",
    "DataProviderID": 15,
    "DataProvidersReference": "30197",
    "OperatorID": 1,
    "UsageTypeID": 1,
    "AddressInfo": {
        "ID": 19120,
        "Title": "?????????",
        "AddressLine1": "?????????",
        "Town": "??",
        "StateOrProvince": "",
        "Postcode": "213300",
        "CountryID": 50,
        "Latitude": 31.416911,
        "Longitude": 119.484211,
        "ContactTelephone1": "",
        "RelatedURL": "http://carstations.com/30197",
        "DistanceUnit": 0
    },
    "Connections": [
        {
            "ID": 19008,
            "ConnectionTypeID": 1,
            "Reference": "J1772",
            "LevelID": 2,
            "Quantity": 1
        }
    ],
    "NumberOfPoints": 1,
    "StatusTypeID": 0,
    "DateLastStatusUpdate": "2014-03-22T04:39:00Z",
    "DataQualityLevel": 2,
    "DateCreated": "2013-08-25T03:31:00Z",
    "SubmissionStatusTypeID": 200
}