{
    "IsRecentlyVerified": false,
    "ID": 31894,
    "UUID": "68030822-59FB-49D1-AC61-145C68333491",
    "DataProviderID": 26,
    "DataProvidersReference": "30354",
    "OperatorID": 86,
    "OperatorsReference": "EnWB König-Karl-Straße",
    "UsageCost": "0.00 afhankelijk van pas",
    "AddressInfo": {
        "ID": 32240,
        "Title": "König-Karl-Straße 43",
        "AddressLine1": "König-Karl-Straße 43",
        "Town": "Stuttgart",
        "Postcode": "70372",
        "CountryID": 87,
        "Latitude": 48.8044,
        "Longitude": 9.2182,
        "ContactTelephone1": "0800 3629-000",
        "ContactEmail": "-",
        "RelatedURL": "http://www.enbw.com/",
        "DistanceUnit": 0
    },
    "Connections": [
        {
            "ID": 35405,
            "ConnectionTypeID": 25,
            "LevelID": 2,
            "PowerKW": 5,
            "CurrentTypeID": 10
        }
    ],
    "NumberOfPoints": 2,
    "StatusTypeID": 50,
    "DateLastStatusUpdate": "2015-01-09T06:03:00Z",
    "DataQualityLevel": 3,
    "DateCreated": "2015-01-09T06:03:00Z",
    "SubmissionStatusTypeID": 100
}