{
    "IsRecentlyVerified": false,
    "ID": 136790,
    "UUID": "6489FEDD-2F61-404A-80E3-A1CB88719360",
    "DataProviderID": 18,
    "DataProvidersReference": "0e2422ec4ab2b4444960d01c89cbb2d5",
    "OperatorID": 2244,
    "UsageTypeID": 5,
    "AddressInfo": {
        "ID": 137136,
        "Title": "Gidlow Road South",
        "AddressLine1": "Gidlow Road South",
        "Town": "Liverpool",
        "Postcode": "L13 2AH",
        "CountryID": 1,
        "Latitude": 53.412763,
        "Longitude": -2.922327,
        "AccessComments": "",
        "RelatedURL": "https://www.ubitricity.com",
        "DistanceUnit": 0
    },
    "Connections": [
        {
            "ID": 191387,
            "ConnectionTypeID": 25,
            "Reference": "suby1100002954",
            "StatusTypeID": 50,
            "LevelID": 2,
            "Amps": 16,
            "Voltage": 230,
            "PowerKW": 3.7,
            "CurrentTypeID": 10
        }
    ],
    "StatusTypeID": 0,
    "DateLastStatusUpdate": "2021-04-25T05:46:00Z",
    "MetadataValues": [
        {
            "ID": 6642,
            "MetadataFieldID": 4,
            "ItemValue": "Contains public sector information licensed under the Open Government Licence v2.0. http://www.nationalarchives.gov.uk/doc/open-government-licence/version/2/"
        }
    ],
    "DataQualityLevel": 3,
    "DateCreated": "2019-12-24T05:23:00Z",
    "SubmissionStatusTypeID": 100
}