{
    "IsRecentlyVerified": false,
    "ID": 182922,
    "UUID": "FAAF97F5-406B-4380-BF76-A374A5860787",
    "DataProviderID": 29,
    "DataProvidersReference": "20454",
    "OperatorID": 189,
    "AddressInfo": {
        "ID": 183281,
        "Title": "Heidenfelder Straße 9",
        "AddressLine1": "Heidenfelder Straße 9",
        "Town": "Schwebheim",
        "Postcode": "97525",
        "CountryID": 87,
        "Latitude": 49.985319,
        "Longitude": 10.24451,
        "DistanceUnit": 0
    },
    "Connections": [
        {
            "ID": 289265,
            "ConnectionTypeID": 33,
            "StatusTypeID": 50,
            "LevelID": 3,
            "PowerKW": 50,
            "CurrentTypeID": 30
        },
        {
            "ID": 289266,
            "ConnectionTypeID": 33,
            "StatusTypeID": 50,
            "LevelID": 3,
            "PowerKW": 50,
            "CurrentTypeID": 30
        },
        {
            "ID": 297464,
            "ConnectionTypeID": 25,
            "StatusTypeID": 50,
            "LevelID": 2,
            "PowerKW": 22,
            "CurrentTypeID": 20
        }
    ],
    "StatusTypeID": 50,
    "DateLastStatusUpdate": "2021-07-12T02:44:00Z",
    "MetadataValues": [
        {
            "ID": 15215,
            "MetadataFieldID": 4,
            "ItemValue": "Data from the German chargepoint registry provided by Bundesnetzagentur.de under the CC-BY 4.0 license"
        }
    ],
    "DataQualityLevel": 3,
    "DateCreated": "2021-07-08T10:03:00Z",
    "SubmissionStatusTypeID": 100
}