{
    "IsRecentlyVerified": false,
    "ID": 16912,
    "UUID": "8B1139DE-26EE-4DFB-B046-80CA2AD3BB25",
    "DataProviderID": 22,
    "DataProvidersReference": "B91D12ADF38B1A2C446579B64E7C5A7C",
    "AddressInfo": {
        "ID": 17257,
        "Title": "岩手日産自動車日産ギャラリー",
        "AddressLine1": "岩手県盛岡市大沢川原1丁目4-20",
        "CountryID": 114,
        "Latitude": 39.70011556,
        "Longitude": 141.1464659,
        "ContactTelephone1": "019-624-2323",
        "DistanceUnit": 0
    },
    "Connections": [
        {
            "ID": 17153,
            "ConnectionTypeID": 2,
            "LevelID": 2,
            "Amps": 100,
            "Voltage": 480,
            "PowerKW": 48,
            "Quantity": 1
        }
    ],
    "DateLastStatusUpdate": "2013-06-29T08:51:00Z",
    "DataQualityLevel": 2,
    "DateCreated": "2013-06-29T08:51:00Z",
    "SubmissionStatusTypeID": 200
}