{
    "IsRecentlyVerified": false,
    "ID": 181926,
    "UUID": "99A4D249-EEE3-437D-B83F-1350B87FFBE6",
    "DataProviderID": 29,
    "DataProvidersReference": "17378",
    "AddressInfo": {
        "ID": 182285,
        "Title": "Heider Str. 22",
        "AddressLine1": "Heider Str. 22",
        "Town": "Tellingstedt",
        "Postcode": "25782",
        "CountryID": 87,
        "Latitude": 54.218614,
        "Longitude": 9.274603,
        "DistanceUnit": 0
    },
    "Connections": [
        {
            "ID": 286969,
            "ConnectionTypeID": 25,
            "StatusTypeID": 50,
            "LevelID": 2,
            "PowerKW": 22,
            "CurrentTypeID": 20
        },
        {
            "ID": 286970,
            "ConnectionTypeID": 25,
            "StatusTypeID": 50,
            "LevelID": 2,
            "PowerKW": 22,
            "CurrentTypeID": 20
        }
    ],
    "StatusTypeID": 50,
    "DateLastStatusUpdate": "2021-07-12T02:52:00Z",
    "MetadataValues": [
        {
            "ID": 14220,
            "MetadataFieldID": 4,
            "ItemValue": "Data from the German chargepoint registry provided by Bundesnetzagentur.de under the CC-BY 4.0 license"
        }
    ],
    "DataQualityLevel": 3,
    "DateCreated": "2021-07-08T10:02:00Z",
    "SubmissionStatusTypeID": 100
}