{
    "IsRecentlyVerified": false,
    "ID": 186238,
    "UUID": "C3C5BA7F-8626-4C1F-A7B2-CAF29A310EBB",
    "DataProviderID": 29,
    "DataProvidersReference": "17732",
    "AddressInfo": {
        "ID": 186597,
        "Title": "Rudolstädter Strasse 93",
        "AddressLine1": "Rudolstädter Strasse 93",
        "Town": "Jena",
        "Postcode": "07745",
        "CountryID": 87,
        "Latitude": 50.885397,
        "Longitude": 11.588641,
        "DistanceUnit": 0
    },
    "Connections": [
        {
            "ID": 298385,
            "ConnectionTypeID": 28,
            "StatusTypeID": 50,
            "LevelID": 2,
            "PowerKW": 11,
            "CurrentTypeID": 20
        },
        {
            "ID": 298386,
            "ConnectionTypeID": 17,
            "StatusTypeID": 50,
            "LevelID": 2,
            "PowerKW": 11,
            "CurrentTypeID": 20
        },
        {
            "ID": 298387,
            "ConnectionTypeID": 25,
            "StatusTypeID": 50,
            "LevelID": 2,
            "PowerKW": 11,
            "CurrentTypeID": 20
        }
    ],
    "StatusTypeID": 50,
    "DateLastStatusUpdate": "2021-07-12T02:45:00Z",
    "MetadataValues": [
        {
            "ID": 18479,
            "MetadataFieldID": 4,
            "ItemValue": "Data from the German chargepoint registry provided by Bundesnetzagentur.de under the CC-BY 4.0 license"
        }
    ],
    "DataQualityLevel": 3,
    "DateCreated": "2021-07-12T02:45:00Z",
    "SubmissionStatusTypeID": 100
}