{
    "IsRecentlyVerified": false,
    "ID": 73822,
    "UUID": "DF1320AD-D4FE-436B-8556-B6A97F20ADC0",
    "DataProviderID": 1,
    "OperatorID": 90,
    "OperatorsReference": "CEC-00042",
    "UsageTypeID": 4,
    "UsageCost": "CAD 11.50/hour",
    "AddressInfo": {
        "ID": 74168,
        "Title": "BRCC-la Belle Québécoise-Daveluyville",
        "AddressLine1": "1100 rue Principale",
        "Town": "Daveluyville",
        "StateOrProvince": "QC",
        "Postcode": "G0Z 1C0",
        "CountryID": 44,
        "Latitude": 46.171793,
        "Longitude": -72.137503,
        "DistanceUnit": 0
    },
    "Connections": [
        {
            "ID": 106128,
            "ConnectionTypeID": 2,
            "StatusTypeID": 50,
            "LevelID": 3,
            "Amps": 125,
            "Voltage": 400,
            "PowerKW": 50,
            "CurrentTypeID": 20,
            "Quantity": 2
        },
        {
            "ID": 106129,
            "ConnectionTypeID": 32,
            "StatusTypeID": 50,
            "LevelID": 3,
            "Amps": 125,
            "Voltage": 400,
            "PowerKW": 50,
            "CurrentTypeID": 20,
            "Quantity": 2
        }
    ],
    "NumberOfPoints": 2,
    "StatusTypeID": 50,
    "DateLastStatusUpdate": "2019-12-24T15:53:00Z",
    "DataQualityLevel": 1,
    "DateCreated": "2016-11-23T23:13:00Z",
    "SubmissionStatusTypeID": 200
}