{
    "IsRecentlyVerified": false,
    "ID": 24058,
    "UUID": "C8F5A88B-25FF-4A9E-AD12-E7350302CB7C",
    "DataProviderID": 1,
    "OperatorID": 1,
    "UsageTypeID": 1,
    "UsageCost": "Free",
    "AddressInfo": {
        "ID": 24403,
        "Title": "Dolder Grand Hotel",
        "AddressLine1": "Kurhausstrasse 65",
        "Town": "Zurich",
        "StateOrProvince": "Zurich",
        "Postcode": "8032",
        "CountryID": 217,
        "Latitude": 47.3729350883347,
        "Longitude": 8.57379182428279,
        "AccessComments": "Parking Level 2, Parking Fee: CHF 1/h",
        "RelatedURL": "http://www.thedoldergrand.com/",
        "DistanceUnit": 0
    },
    "Connections": [
        {
            "ID": 26061,
            "ConnectionTypeID": 8,
            "StatusTypeID": 50,
            "LevelID": 2,
            "Amps": 63,
            "Voltage": 230,
            "PowerKW": 14.5,
            "CurrentTypeID": 10,
            "Quantity": 1
        },
        {
            "ID": 26062,
            "ConnectionTypeID": 17,
            "StatusTypeID": 50,
            "LevelID": 2,
            "Amps": 32,
            "Voltage": 230,
            "PowerKW": 12.7,
            "CurrentTypeID": 20,
            "Quantity": 1
        }
    ],
    "NumberOfPoints": 1,
    "StatusTypeID": 50,
    "DateLastStatusUpdate": "2014-06-12T20:37:00Z",
    "DataQualityLevel": 1,
    "DateCreated": "2014-06-09T23:02:00Z",
    "SubmissionStatusTypeID": 200
}