{
    "IsRecentlyVerified": false,
    "ID": 169659,
    "UUID": "926FBD2F-4FC4-4C40-BB0D-BE35AC40AB00",
    "DataProviderID": 1,
    "OperatorID": 1,
    "UsageTypeID": 4,
    "AddressInfo": {
        "ID": 170018,
        "Title": "Caseys Service Station",
        "AddressLine1": "Athlone Road",
        "Town": "Roscommon",
        "StateOrProvince": "Roscommon",
        "CountryID": 3,
        "Latitude": 53.628918163895975,
        "Longitude": -8.185709635842386,
        "DistanceUnit": 0
    },
    "Connections": [
        {
            "ID": 258319,
            "ConnectionTypeID": 33,
            "StatusTypeID": 50,
            "LevelID": 3,
            "PowerKW": 50,
            "CurrentTypeID": 30,
            "Quantity": 1
        },
        {
            "ID": 258320,
            "ConnectionTypeID": 2,
            "StatusTypeID": 50,
            "LevelID": 3,
            "PowerKW": 50,
            "CurrentTypeID": 30,
            "Quantity": 1
        }
    ],
    "NumberOfPoints": 1,
    "StatusTypeID": 50,
    "DateLastStatusUpdate": "2020-10-29T07:15:00Z",
    "DataQualityLevel": 1,
    "DateCreated": "2020-10-29T07:09:00Z",
    "SubmissionStatusTypeID": 200
}