{
    "IsRecentlyVerified": false,
    "ID": 113658,
    "UUID": "9C22471D-E7E2-4F34-9227-7F6195E9E577",
    "DataProviderID": 1,
    "OperatorID": 3315,
    "OperatorsReference": "51593,51593",
    "UsageTypeID": 4,
    "UsageCost": "Free",
    "AddressInfo": {
        "ID": 114004,
        "Title": "Queen Street Charging Hub",
        "AddressLine1": "Queen Street Car Park",
        "Town": "285 Queen Street",
        "StateOrProvince": "Dundee",
        "Postcode": "DD5 2HD",
        "CountryID": 1,
        "Latitude": 56.46783,
        "Longitude": -2.87466,
        "DistanceUnit": 0
    },
    "Connections": [
        {
            "ID": 160184,
            "ConnectionTypeID": 33,
            "StatusTypeID": 50,
            "LevelID": 3,
            "PowerKW": 50,
            "CurrentTypeID": 30,
            "Quantity": 5
        },
        {
            "ID": 160185,
            "ConnectionTypeID": 2,
            "StatusTypeID": 50,
            "LevelID": 3,
            "PowerKW": 50,
            "CurrentTypeID": 30,
            "Quantity": 5
        },
        {
            "ID": 160186,
            "ConnectionTypeID": 1036,
            "StatusTypeID": 50,
            "LevelID": 3,
            "PowerKW": 43,
            "CurrentTypeID": 20,
            "Quantity": 5
        },
        {
            "ID": 160187,
            "ConnectionTypeID": 25,
            "StatusTypeID": 50,
            "LevelID": 2,
            "Amps": 32,
            "Voltage": 400,
            "PowerKW": 22,
            "CurrentTypeID": 20,
            "Quantity": 4
        }
    ],
    "NumberOfPoints": 6,
    "StatusTypeID": 50,
    "DateLastStatusUpdate": "2019-01-27T06:14:00Z",
    "DataQualityLevel": 1,
    "DateCreated": "2018-12-28T12:04:00Z",
    "SubmissionStatusTypeID": 200
}