{
    "UserComments": [
        {
            "ID": 20045,
            "ChargePointID": 104072,
            "CommentTypeID": 10,
            "UserName": "ForumElettrico.it",
            "RelatedURL": "https://www.forumelettrico.it/forum/colonnina-outlet-valmontone-t3071.html",
            "DateCreated": "2018-08-20T18:52:26.833Z",
            "User": {
                "ID": 11749,
                "Username": "ForumElettrico.it"
            },
            "CheckinStatusTypeID": 10
        },
        {
            "ID": 19918,
            "ChargePointID": 104072,
            "CommentTypeID": 10,
            "UserName": "PowerCruiseControl",
            "Comment": " Good GPS positioning",
            "Rating": 5,
            "DateCreated": "2018-07-26T14:30:27.637Z",
            "User": {
                "ID": 18504,
                "Username": "PowerCruiseControl"
            },
            "CheckinStatusTypeID": 10
        }
    ],
    "MediaItems": [
        {
            "ID": 16336,
            "ChargePointID": 104072,
            "ItemURL": "https://s3-ap-southeast-2.amazonaws.com/openchargemap/images/IT/OCM104072/OCM-104072.orig.2018082018523912.jpg",
            "ItemThumbnailURL": "https://s3-ap-southeast-2.amazonaws.com/openchargemap/images/IT/OCM104072/OCM-104072.thmb.2018082018523912.jpg",
            "Comment": "",
            "IsEnabled": true,
            "IsVideo": false,
            "IsFeaturedItem": false,
            "IsExternalResource": false,
            "User": {
                "ID": 11749,
                "Username": "ForumElettrico.it"
            },
            "DateCreated": "2018-08-20T18:53:00Z"
        },
        {
            "ID": 16337,
            "ChargePointID": 104072,
            "ItemURL": "https://s3-ap-southeast-2.amazonaws.com/openchargemap/images/IT/OCM104072/OCM-104072.orig.2018082018524505.jpg",
            "ItemThumbnailURL": "https://s3-ap-southeast-2.amazonaws.com/openchargemap/images/IT/OCM104072/OCM-104072.thmb.2018082018524505.jpg",
            "Comment": "",
            "IsEnabled": true,
            "IsVideo": false,
            "IsFeaturedItem": false,
            "IsExternalResource": false,
            "User": {
                "ID": 11749,
                "Username": "ForumElettrico.it"
            },
            "DateCreated": "2018-08-20T18:53:00Z"
        },
        {
            "ID": 16046,
            "ChargePointID": 104072,
            "ItemURL": "https://s3-ap-southeast-2.amazonaws.com/openchargemap/images/IT/OCM104072/OCM-104072.orig.2018072614463201.jpg",
            "ItemThumbnailURL": "https://s3-ap-southeast-2.amazonaws.com/openchargemap/images/IT/OCM104072/OCM-104072.thmb.2018072614463201.jpg",
            "Comment": "Direction to parking B",
            "IsEnabled": true,
            "IsVideo": false,
            "IsFeaturedItem": false,
            "IsExternalResource": false,
            "User": {
                "ID": 18504,
                "Username": "PowerCruiseControl"
            },
            "DateCreated": "2018-07-26T14:47:00Z"
        }
    ],
    "IsRecentlyVerified": false,
    "ID": 104072,
    "UUID": "A0D9D9A7-BABB-4F6A-AB0F-B032BC8C4B82",
    "DataProviderID": 1,
    "OperatorID": 80,
    "UsageTypeID": 4,
    "AddressInfo": {
        "ID": 104418,
        "Title": "EnelX EVA+ Valmontone Outlet",
        "AddressLine1": "Via della Pace",
        "Town": "Valmontone ",
        "StateOrProvince": "RM",
        "Postcode": "00038",
        "CountryID": 112,
        "Latitude": 41.7621460241731,
        "Longitude": 12.9589151388234,
        "RelatedURL": "https://www.enelx.com/it/it/emobility",
        "DistanceUnit": 0
    },
    "Connections": [
        {
            "ID": 146913,
            "ConnectionTypeID": 33,
            "StatusTypeID": 50,
            "LevelID": 3,
            "Amps": 100,
            "Voltage": 500,
            "PowerKW": 50,
            "CurrentTypeID": 30,
            "Quantity": 1
        },
        {
            "ID": 146914,
            "ConnectionTypeID": 2,
            "StatusTypeID": 50,
            "LevelID": 3,
            "Amps": 100,
            "Voltage": 500,
            "PowerKW": 50,
            "CurrentTypeID": 30,
            "Quantity": 1
        },
        {
            "ID": 146915,
            "ConnectionTypeID": 1036,
            "StatusTypeID": 50,
            "LevelID": 3,
            "Amps": 64,
            "Voltage": 400,
            "PowerKW": 43,
            "CurrentTypeID": 20,
            "Quantity": 1
        }
    ],
    "NumberOfPoints": 2,
    "StatusTypeID": 50,
    "DateLastStatusUpdate": "2018-08-20T18:53:00Z",
    "DataQualityLevel": 1,
    "DateCreated": "2018-05-15T15:07:00Z",
    "SubmissionStatusTypeID": 200
}