{
    "IsRecentlyVerified": false,
    "ID": 184869,
    "UUID": "0A7A8419-8AE0-4854-BEBF-4BD97DDB8FE5",
    "DataProviderID": 29,
    "DataProvidersReference": "11689",
    "OperatorID": 45,
    "AddressInfo": {
        "ID": 185228,
        "Title": "Ernst-Thälmann-Straße 8",
        "AddressLine1": "Ernst-Thälmann-Straße 8",
        "Town": "Woldegk",
        "Postcode": "17348",
        "CountryID": 87,
        "Latitude": 53.459677,
        "Longitude": 13.583082,
        "DistanceUnit": 0
    },
    "Connections": [
        {
            "ID": 293674,
            "ConnectionTypeID": 33,
            "StatusTypeID": 50,
            "LevelID": 3,
            "PowerKW": 20,
            "CurrentTypeID": 30
        },
        {
            "ID": 293675,
            "ConnectionTypeID": 25,
            "StatusTypeID": 50,
            "LevelID": 2,
            "PowerKW": 22,
            "CurrentTypeID": 20
        }
    ],
    "StatusTypeID": 50,
    "DateLastStatusUpdate": "2021-07-09T03:29:00Z",
    "MetadataValues": [
        {
            "ID": 17160,
            "MetadataFieldID": 4,
            "ItemValue": "Data from the German chargepoint registry provided by Bundesnetzagentur.de under the CC-BY 4.0 license"
        }
    ],
    "DataQualityLevel": 3,
    "DateCreated": "2021-07-08T10:06:00Z",
    "SubmissionStatusTypeID": 100
}