{
    "IsRecentlyVerified": false,
    "ID": 159065,
    "UUID": "1FE199C2-6619-4185-AECC-C3507ED06DAB",
    "DataProviderID": 2,
    "DataProvidersReference": "156319",
    "OperatorID": 5,
    "UsageTypeID": 1,
    "AddressInfo": {
        "ID": 159422,
        "Title": "DURHAM COUNTY",
        "AddressLine1": "510 S Dillard St",
        "Town": "Durham",
        "StateOrProvince": "NC",
        "Postcode": "27701",
        "CountryID": 2,
        "Latitude": 35.991396,
        "Longitude": -78.900382,
        "ContactTelephone1": "888-758-4389",
        "AccessComments": "24 hours daily",
        "RelatedURL": "http://www.chargepoint.com/",
        "DistanceUnit": 0
    },
    "Connections": [
        {
            "ID": 229139,
            "ConnectionTypeID": 1,
            "LevelID": 2,
            "Amps": 16,
            "Voltage": 230,
            "PowerKW": 3.7,
            "CurrentTypeID": 10,
            "Quantity": 8
        }
    ],
    "StatusTypeID": 50,
    "DateLastStatusUpdate": "2020-06-26T02:58:00Z",
    "DataQualityLevel": 3,
    "DateCreated": "2020-06-26T02:58:00Z",
    "SubmissionStatusTypeID": 100
}