{
    "IsRecentlyVerified": false,
    "ID": 147842,
    "UUID": "620BD937-2F53-46F7-8604-093519406BF6",
    "DataProviderID": 1,
    "OperatorID": 3385,
    "UsageTypeID": 1,
    "UsageCost": "Free",
    "AddressInfo": {
        "ID": 148194,
        "Title": "BC Hydro - Hixon Tempo Gas Bar",
        "AddressLine1": "39126 HWY 97 S,",
        "Town": "Hixon",
        "StateOrProvince": "BC",
        "Postcode": "V0K 1S0",
        "CountryID": 44,
        "Latitude": 53.41968795253672,
        "Longitude": -122.58467831297963,
        "ContactTelephone1": "1 866 338 3369",
        "AccessComments": "BC1-00215\r\nhttp://maps.google.com/maps?daddr=53.41974+-122.584595",
        "RelatedURL": "https://www.bchydro.com/powersmart/electric-vehicles/charging/bc-hydro-ev-network/ev-stations-map.html",
        "DistanceUnit": 0
    },
    "Connections": [
        {
            "ID": 205230,
            "ConnectionTypeID": 2,
            "StatusTypeID": 50,
            "LevelID": 3,
            "PowerKW": 50,
            "CurrentTypeID": 30,
            "Quantity": 1
        },
        {
            "ID": 205231,
            "ConnectionTypeID": 32,
            "StatusTypeID": 50,
            "LevelID": 3,
            "PowerKW": 50,
            "CurrentTypeID": 30,
            "Quantity": 1
        }
    ],
    "NumberOfPoints": 1,
    "StatusTypeID": 50,
    "DateLastStatusUpdate": "2021-01-11T09:38:00Z",
    "DataQualityLevel": 1,
    "DateCreated": "2020-01-17T18:17:00Z",
    "SubmissionStatusTypeID": 200
}