{
    "IsRecentlyVerified": false,
    "ID": 160704,
    "UUID": "72B90A96-E5DC-4B9C-9D84-260BC367293F",
    "DataProviderID": 2,
    "DataProvidersReference": "157718",
    "UsageTypeID": 2,
    "AddressInfo": {
        "ID": 161061,
        "Title": "2587265 Ontario Inc",
        "AddressLine1": "Highway 11",
        "Town": "Fauquier-Strickland",
        "StateOrProvince": "ON",
        "Postcode": "P0L 1G0",
        "CountryID": 44,
        "Latitude": 49.302748,
        "Longitude": -81.988335,
        "ContactTelephone1": "",
        "AccessComments": "",
        "RelatedURL": "",
        "DistanceUnit": 0
    },
    "Connections": [
        {
            "ID": 231252,
            "ConnectionTypeID": 2,
            "LevelID": 3,
            "Amps": 100,
            "Voltage": 400,
            "PowerKW": 40,
            "CurrentTypeID": 30,
            "Quantity": 1
        },
        {
            "ID": 231253,
            "ConnectionTypeID": 32,
            "LevelID": 3,
            "Amps": 100,
            "Voltage": 400,
            "PowerKW": 40,
            "CurrentTypeID": 30,
            "Quantity": 1
        }
    ],
    "GeneralComments": "Planned for future date. Not Operational.",
    "DatePlanned": "2020-09-01T00:00:00Z",
    "StatusTypeID": 150,
    "DateLastStatusUpdate": "2020-06-26T03:12:00Z",
    "DataQualityLevel": 3,
    "DateCreated": "2020-06-26T03:12:00Z",
    "SubmissionStatusTypeID": 100
}