{
    "IsRecentlyVerified": false,
    "ID": 157598,
    "UUID": "32050A3E-3A4A-4148-B301-809F8E385518",
    "DataProviderID": 1,
    "OperatorID": 3339,
    "UsageTypeID": 1,
    "UsageCost": "Free - but please support the store who is providing it!",
    "AddressInfo": {
        "ID": 157952,
        "Title": "Adventure Bay General Store",
        "AddressLine1": "Adventure Bay Rd",
        "Town": "Adventure Bay",
        "StateOrProvince": "Tasmania",
        "Postcode": "7150",
        "CountryID": 18,
        "Latitude": -43.3610159990095,
        "Longitude": 147.32856473930008,
        "DistanceUnit": 0
    },
    "Connections": [
        {
            "ID": 227048,
            "ConnectionTypeID": 1,
            "StatusTypeID": 50,
            "LevelID": 2,
            "PowerKW": 7,
            "CurrentTypeID": 10,
            "Quantity": 1
        }
    ],
    "NumberOfPoints": 1,
    "StatusTypeID": 50,
    "DateLastStatusUpdate": "2020-06-19T10:47:00Z",
    "DataQualityLevel": 1,
    "DateCreated": "2020-06-19T05:13:00Z",
    "SubmissionStatusTypeID": 200
}