{
    "IsRecentlyVerified": false,
    "ID": 173220,
    "UUID": "80C3849C-2055-43E3-872A-C369DD820ED2",
    "DataProviderID": 19,
    "DataProvidersReference": "7300",
    "AddressInfo": {
        "ID": 173579,
        "Title": "Storsätra Fjällhotell",
        "AddressLine1": "Grövelsjöfjällen ",
        "Town": "IDRE",
        "StateOrProvince": "DALARNA",
        "Postcode": "79091",
        "CountryID": 216,
        "Latitude": 62.06962469643313,
        "Longitude": 12.311065397860595,
        "AccessComments": "Parkering bakom Hotellet Finns infoskylt, cacharge APP",
        "DistanceUnit": 0
    },
    "Connections": [
        {
            "ID": 265944,
            "ConnectionTypeID": 25,
            "Reference": "1",
            "LevelID": 2,
            "Amps": 16,
            "Voltage": 400,
            "PowerKW": 11,
            "CurrentTypeID": 20
        },
        {
            "ID": 265945,
            "ConnectionTypeID": 25,
            "Reference": "2",
            "LevelID": 2,
            "Amps": 16,
            "Voltage": 400,
            "PowerKW": 11,
            "CurrentTypeID": 20
        }
    ],
    "NumberOfPoints": 2,
    "StatusTypeID": 0,
    "DateLastStatusUpdate": "2021-03-24T05:12:00Z",
    "DataQualityLevel": 2,
    "DateCreated": "2021-03-03T09:02:00Z",
    "SubmissionStatusTypeID": 100
}