{
    "IsRecentlyVerified": false,
    "ID": 179640,
    "UUID": "8D9A94A0-7526-4EAB-95A5-B42CDF241AF9",
    "DataProviderID": 29,
    "DataProvidersReference": "663",
    "OperatorID": 105,
    "AddressInfo": {
        "ID": 179999,
        "Title": "Industriestr. 3y",
        "AddressLine1": "Industriestr. 3y",
        "Town": "Borgholzhausen",
        "Postcode": "33829",
        "CountryID": 87,
        "Latitude": 52.085246,
        "Longitude": 8.267184,
        "DistanceUnit": 0
    },
    "Connections": [
        {
            "ID": 281720,
            "ConnectionTypeID": 25,
            "StatusTypeID": 50,
            "LevelID": 2,
            "PowerKW": 22,
            "CurrentTypeID": 20
        },
        {
            "ID": 281721,
            "ConnectionTypeID": 25,
            "StatusTypeID": 50,
            "LevelID": 2,
            "PowerKW": 22,
            "CurrentTypeID": 20
        }
    ],
    "StatusTypeID": 50,
    "DateLastStatusUpdate": "2021-07-12T02:48:00Z",
    "MetadataValues": [
        {
            "ID": 11934,
            "MetadataFieldID": 4,
            "ItemValue": "Data from the German chargepoint registry provided by Bundesnetzagentur.de under the CC-BY 4.0 license"
        }
    ],
    "DataQualityLevel": 3,
    "DateCreated": "2021-07-08T09:59:00Z",
    "SubmissionStatusTypeID": 100
}