{
    "IsRecentlyVerified": false,
    "ID": 94347,
    "UUID": "DC7FA1B1-57C5-422F-8FE1-429D4073F909",
    "DataProviderID": 2,
    "DataProvidersReference": "87455",
    "OperatorID": 5,
    "UsageTypeID": 1,
    "AddressInfo": {
        "ID": 94693,
        "Title": "ADCO1",
        "AddressLine1": "11860 N Pecos St",
        "Town": "Westminster",
        "StateOrProvince": "CO",
        "Postcode": "80234",
        "CountryID": 2,
        "Latitude": 39.912118,
        "Longitude": -105.005865,
        "ContactTelephone1": "888-758-4389",
        "AccessComments": "24 hours daily",
        "RelatedURL": "http://www.chargepoint.com/",
        "DistanceUnit": 0
    },
    "Connections": [
        {
            "ID": 133449,
            "ConnectionTypeID": 1,
            "LevelID": 2,
            "Amps": 16,
            "Voltage": 230,
            "PowerKW": 3,
            "CurrentTypeID": 10,
            "Quantity": 4
        }
    ],
    "DateLastStatusUpdate": "2019-04-06T05:04:00Z",
    "DataQualityLevel": 3,
    "DateCreated": "2017-10-19T02:06:00Z",
    "SubmissionStatusTypeID": 100
}