{
    "IsRecentlyVerified": false,
    "ID": 167935,
    "UUID": "3522BC1B-BCD2-4C15-92A4-1DAEF6541597",
    "DataProviderID": 18,
    "DataProvidersReference": "3fdf98cc154a7d13a08e643848cf925d",
    "OperatorID": 3391,
    "UsageTypeID": 1,
    "AddressInfo": {
        "ID": 168294,
        "Title": "Bloomsbury Place",
        "AddressLine1": "Bloomsbury Place",
        "Town": "Brighton",
        "Postcode": "BN2 1DB",
        "CountryID": 1,
        "Latitude": 50.818734,
        "Longitude": -0.122851,
        "AccessComments": "",
        "RelatedURL": "https://www.electricblueuk.com/",
        "DistanceUnit": 0
    },
    "Connections": [
        {
            "ID": 254963,
            "ConnectionTypeID": 25,
            "Reference": "62196-2 (SINGLE PHASE)",
            "StatusTypeID": 50,
            "LevelID": 2,
            "Amps": 16,
            "Voltage": 230,
            "PowerKW": 3.7,
            "CurrentTypeID": 10
        }
    ],
    "StatusTypeID": 0,
    "DateLastStatusUpdate": "2020-09-17T21:03:00Z",
    "MetadataValues": [
        {
            "ID": 7979,
            "MetadataFieldID": 4,
            "ItemValue": "Contains public sector information licensed under the Open Government Licence v2.0. http://www.nationalarchives.gov.uk/doc/open-government-licence/version/2/"
        }
    ],
    "DataQualityLevel": 3,
    "DateCreated": "2020-09-17T21:03:00Z",
    "SubmissionStatusTypeID": 100
}