{
    "IsRecentlyVerified": false,
    "ID": 173807,
    "UUID": "B3A14B1F-0BEF-498B-A548-5D424E96EAB1",
    "DataProviderID": 19,
    "DataProvidersReference": "6961",
    "AddressInfo": {
        "ID": 174166,
        "Title": "Hvolsvöllur (N1)",
        "AddressLine1": "Hvolsvöllur(N1), Austurvegur 3",
        "Town": "Hvolsvelli",
        "StateOrProvince": "Suðurland",
        "Postcode": "860",
        "CountryID": 105,
        "Latitude": 63.749783,
        "Longitude": -20.235218,
        "AccessComments": "",
        "DistanceUnit": 0
    },
    "Connections": [
        {
            "ID": 267227,
            "ConnectionTypeID": 25,
            "Reference": "1",
            "LevelID": 3,
            "Amps": 32,
            "Voltage": 400,
            "PowerKW": 22,
            "CurrentTypeID": 30,
            "Comments": "Mode 3"
        },
        {
            "ID": 267228,
            "ConnectionTypeID": 2,
            "Reference": "2",
            "LevelID": 3,
            "Amps": 100,
            "Voltage": 500,
            "PowerKW": 50,
            "CurrentTypeID": 30,
            "Comments": "Mode 4"
        },
        {
            "ID": 267229,
            "ConnectionTypeID": 33,
            "Reference": "3",
            "LevelID": 3,
            "Amps": 100,
            "Voltage": 500,
            "PowerKW": 50,
            "CurrentTypeID": 30,
            "Comments": "Mode 4"
        }
    ],
    "NumberOfPoints": 3,
    "StatusTypeID": 0,
    "DateLastStatusUpdate": "2021-03-04T05:39:00Z",
    "DataQualityLevel": 2,
    "DateCreated": "2021-03-04T05:39:00Z",
    "SubmissionStatusTypeID": 100
}