{
    "IsRecentlyVerified": false,
    "ID": 177443,
    "UUID": "FDCEFA1A-0E30-4D22-A17F-26FF6204DFB2",
    "DataProviderID": 29,
    "DataProvidersReference": "4257",
    "OperatorID": 127,
    "AddressInfo": {
        "ID": 177802,
        "Title": "Ammerlandallee 4",
        "AddressLine1": "Ammerlandallee 4",
        "Town": "Leer",
        "Postcode": "26789",
        "CountryID": 87,
        "Latitude": 53.258474504384,
        "Longitude": 7.937654256821,
        "DistanceUnit": 0
    },
    "Connections": [
        {
            "ID": 276587,
            "ConnectionTypeID": 25,
            "StatusTypeID": 50,
            "LevelID": 2,
            "PowerKW": 22,
            "CurrentTypeID": 20
        },
        {
            "ID": 276588,
            "ConnectionTypeID": 25,
            "StatusTypeID": 50,
            "LevelID": 2,
            "PowerKW": 22,
            "CurrentTypeID": 20
        }
    ],
    "StatusTypeID": 0,
    "DateLastStatusUpdate": "2021-07-12T02:50:00Z",
    "MetadataValues": [
        {
            "ID": 9737,
            "MetadataFieldID": 4,
            "ItemValue": "Data from the German chargepoint registry provided by Bundesnetzagentur.de under the CC-BY 4.0 license"
        }
    ],
    "DataQualityLevel": 3,
    "DateCreated": "2021-07-08T09:49:00Z",
    "SubmissionStatusTypeID": 100
}