{
    "IsRecentlyVerified": false,
    "ID": 128316,
    "UUID": "0AA55DE3-CEAE-42B0-8B68-6509574B39A7",
    "DataProviderID": 1,
    "OperatorID": 20,
    "OperatorsReference": "80723",
    "UsageTypeID": 4,
    "UsageCost": "07:00-23:59 £0.21/kWh min £2.00;00:00-06:59 £0.11/kWh min £2.00. 00:00 to 06:59 = 11p per kWh. Minimum charge of £2",
    "AddressInfo": {
        "ID": 128662,
        "Title": "Evolve 2 At Pier Road Car Park",
        "AddressLine1": "Pier Road Multistorey Car Park",
        "Town": "St Helier",
        "StateOrProvince": "The Channel Isles",
        "Postcode": "JE2 4XW",
        "CountryID": 115,
        "Latitude": 49.18029,
        "Longitude": -2.10767,
        "DistanceUnit": 0
    },
    "Connections": [
        {
            "ID": 179614,
            "ConnectionTypeID": 25,
            "StatusTypeID": 50,
            "LevelID": 2,
            "Amps": 32,
            "Voltage": 230,
            "PowerKW": 7,
            "CurrentTypeID": 10,
            "Quantity": 2
        }
    ],
    "NumberOfPoints": 2,
    "StatusTypeID": 50,
    "DateLastStatusUpdate": "2019-10-22T15:46:00Z",
    "DataQualityLevel": 1,
    "DateCreated": "2019-06-22T05:15:00Z",
    "SubmissionStatusTypeID": 200
}