{
    "IsRecentlyVerified": false,
    "ID": 80334,
    "UUID": "87AF8E5E-2AC3-49BB-87AA-68087B6A6C22",
    "DataProviderID": 2,
    "DataProvidersReference": "80621",
    "UsageTypeID": 7,
    "AddressInfo": {
        "ID": 80680,
        "Title": "Classic Ford Lincoln",
        "AddressLine1": "8540 Tyler Blvd",
        "Town": "Mentor",
        "StateOrProvince": "OH",
        "Postcode": "44060",
        "CountryID": 2,
        "Latitude": 41.685236,
        "Longitude": -81.333686,
        "ContactTelephone1": "440-266-3000",
        "AccessComments": "24 hours daily\r\nPublic - Call ahead",
        "RelatedURL": "",
        "DistanceUnit": 0
    },
    "Connections": [
        {
            "ID": 115009,
            "ConnectionTypeID": 1,
            "LevelID": 2,
            "Amps": 16,
            "Voltage": 230,
            "PowerKW": 3.7,
            "CurrentTypeID": 10,
            "Quantity": 2
        }
    ],
    "DateLastStatusUpdate": "2020-06-26T03:04:00Z",
    "DataQualityLevel": 3,
    "DateCreated": "2017-01-31T01:05:00Z",
    "SubmissionStatusTypeID": 100
}