{
    "IsRecentlyVerified": false,
    "ID": 99698,
    "UUID": "D8E55ECA-C518-4C47-85C6-483DA65C895E",
    "DataProviderID": 1,
    "OperatorID": 45,
    "UsageTypeID": 1,
    "UsageCost": "free",
    "AddressInfo": {
        "ID": 100044,
        "Title": "Eger, Penny Market, Mátyás király út",
        "AddressLine1": "Mátyás király út 139.",
        "Town": "Eger",
        "StateOrProvince": "Heves",
        "Postcode": "3300",
        "CountryID": 104,
        "Latitude": 47.874856403280944,
        "Longitude": 20.382771438412423,
        "DistanceUnit": 0
    },
    "Connections": [
        {
            "ID": 140851,
            "ConnectionTypeID": 25,
            "StatusTypeID": 50,
            "LevelID": 2,
            "Amps": 32,
            "Voltage": 400,
            "PowerKW": 22,
            "CurrentTypeID": 20,
            "Quantity": 2
        }
    ],
    "NumberOfPoints": 2,
    "StatusTypeID": 50,
    "DateLastStatusUpdate": "2018-02-01T17:10:00Z",
    "DataQualityLevel": 1,
    "DateCreated": "2018-02-01T17:10:00Z",
    "SubmissionStatusTypeID": 200
}