{
    "UserComments": [
        {
            "ID": 3551,
            "ChargePointID": 15958,
            "CommentTypeID": 50,
            "UserName": "filip.vanrickstal",
            "Comment": "Charging point is only accessible for staff and visitors.",
            "DateCreated": "2015-01-10T10:41:15.813Z",
            "User": {
                "ID": 1761,
                "Username": "filip.vanrickstal"
            },
            "CheckinStatusTypeID": 200
        }
    ],
    "MediaItems": [
        {
            "ID": 896,
            "ChargePointID": 15958,
            "ItemURL": "https://s3-ap-southeast-2.amazonaws.com/openchargemap/images/BE/OCM15958/OCM-15958.orig.2015011010393643.jpg",
            "ItemThumbnailURL": "https://s3-ap-southeast-2.amazonaws.com/openchargemap/images/BE/OCM15958/OCM-15958.thmb.2015011010393643.jpg",
            "Comment": "",
            "IsEnabled": true,
            "IsVideo": false,
            "IsFeaturedItem": false,
            "IsExternalResource": false,
            "User": {
                "ID": 1761,
                "Username": "filip.vanrickstal"
            },
            "DateCreated": "2015-01-10T10:40:00Z"
        },
        {
            "ID": 897,
            "ChargePointID": 15958,
            "ItemURL": "https://s3-ap-southeast-2.amazonaws.com/openchargemap/images/BE/OCM15958/OCM-15958.orig.2015011010400059.jpg",
            "ItemThumbnailURL": "https://s3-ap-southeast-2.amazonaws.com/openchargemap/images/BE/OCM15958/OCM-15958.thmb.2015011010400059.jpg",
            "Comment": "",
            "IsEnabled": true,
            "IsVideo": false,
            "IsFeaturedItem": false,
            "IsExternalResource": false,
            "User": {
                "ID": 1761,
                "Username": "filip.vanrickstal"
            },
            "DateCreated": "2015-01-10T10:40:00Z"
        },
        {
            "ID": 895,
            "ChargePointID": 15958,
            "ItemURL": "https://s3-ap-southeast-2.amazonaws.com/openchargemap/images/BE/OCM15958/OCM-15958.orig.2015011010385579.jpg",
            "ItemThumbnailURL": "https://s3-ap-southeast-2.amazonaws.com/openchargemap/images/BE/OCM15958/OCM-15958.thmb.2015011010385579.jpg",
            "Comment": "",
            "IsEnabled": true,
            "IsVideo": false,
            "IsFeaturedItem": false,
            "IsExternalResource": false,
            "User": {
                "ID": 1761,
                "Username": "filip.vanrickstal"
            },
            "DateCreated": "2015-01-10T10:39:00Z"
        }
    ],
    "IsRecentlyVerified": false,
    "ID": 15958,
    "UUID": "49C33736-ED09-4E0B-9514-823605F22DBB",
    "DataProviderID": 1,
    "OperatorID": 94,
    "UsageTypeID": 6,
    "AddressInfo": {
        "ID": 16303,
        "Title": "KUL",
        "AddressLine1": "Arenberg Kasteelpark 10 ",
        "Town": "Leuven ",
        "Postcode": "3001 ",
        "CountryID": 26,
        "Latitude": 50.8620895,
        "Longitude": 4.68589229999998,
        "DistanceUnit": 0
    },
    "Connections": [
        {
            "ID": 44302,
            "ConnectionTypeID": 25,
            "StatusTypeID": 50,
            "LevelID": 2,
            "Quantity": 1
        }
    ],
    "NumberOfPoints": 1,
    "StatusTypeID": 50,
    "DateLastStatusUpdate": "2015-01-10T14:50:00Z",
    "DataQualityLevel": 1,
    "DateCreated": "2013-02-15T19:10:00Z",
    "SubmissionStatusTypeID": 200
}