{
    "IsRecentlyVerified": false,
    "ID": 63497,
    "UUID": "9F2B81A5-F600-4F68-9912-FEDFA1C917AB",
    "DataProviderID": 26,
    "DataProvidersReference": "75849",
    "OperatorID": 180,
    "OperatorsReference": "Alfen GDH4162",
    "UsageCost": "0.00 jaarabonnement",
    "AddressInfo": {
        "ID": 63843,
        "Title": "Architect van Lieflandstraat 11",
        "AddressLine1": "Architect van Lieflandstraat 11",
        "Town": "Den Haag",
        "Postcode": "2552 ZB",
        "CountryID": 159,
        "Latitude": 52.056028,
        "Longitude": 4.255057,
        "ContactTelephone1": "036 - 549 34 00",
        "RelatedURL": "http://www.icu-charging-stations.com/",
        "DistanceUnit": 0
    },
    "Connections": [
        {
            "ID": 81002,
            "ConnectionTypeID": 25,
            "LevelID": 2,
            "PowerKW": 11,
            "CurrentTypeID": 10
        },
        {
            "ID": 81003,
            "ConnectionTypeID": 25,
            "LevelID": 2,
            "PowerKW": 11,
            "CurrentTypeID": 10
        }
    ],
    "NumberOfPoints": 1,
    "StatusTypeID": 50,
    "DateLastStatusUpdate": "2016-06-04T02:45:00Z",
    "DataQualityLevel": 3,
    "DateCreated": "2016-03-03T12:31:00Z",
    "SubmissionStatusTypeID": 100
}