{
    "IsRecentlyVerified": false,
    "ID": 73441,
    "UUID": "1241B3BB-2B39-4AA6-9EF3-1B28FA9C2BC3",
    "DataProviderID": 1,
    "OperatorID": 45,
    "UsageTypeID": 1,
    "AddressInfo": {
        "ID": 73787,
        "Title": "E-Bike Station Supermarkt Real",
        "AddressLine1": "Berliner Straße 90",
        "Town": "Oberhausen",
        "StateOrProvince": "Oberhausen",
        "Postcode": "46049",
        "CountryID": 87,
        "Latitude": 51.480186,
        "Longitude": 6.811019299999998,
        "RelatedURL": "http://www.bike-energy.com/",
        "DistanceUnit": 0
    },
    "Connections": [
        {
            "ID": 105650,
            "ConnectionTypeID": 28,
            "StatusTypeID": 50,
            "LevelID": 1,
            "Amps": 10,
            "Voltage": 230,
            "PowerKW": 2.3,
            "CurrentTypeID": 10,
            "Quantity": 2
        }
    ],
    "NumberOfPoints": 2,
    "GeneralComments": "Bike energy Ladestation Tower T2B freistehend mit Pfahl mit 2 Anschlüssen für e-Bikes. Genaue Position nicht bekannt! Anschluss unklar ob Schuko oder Spezialladesystem bike energy.",
    "StatusTypeID": 50,
    "DateLastStatusUpdate": "2016-11-22T10:40:00Z",
    "DataQualityLevel": 1,
    "DateCreated": "2016-11-22T10:40:00Z",
    "SubmissionStatusTypeID": 200
}