{
    "UserComments": [
        {
            "ID": 24696,
            "ChargePointID": 188623,
            "CommentTypeID": 10,
            "UserName": "ForumElettrico.it",
            "Comment": "Immediatamente prima dell'uscita Deruta Sud in direzione Terni-Orte. Leggi la recensione completa qui > https://www.forumelettrico.it/forum/colonnina-be-charge-fast-ads-q8-l-anfora-deruta-pg-strada-statale-e45-km-57-290-t19502.html",
            "RelatedURL": "https://www.forumelettrico.it/forum/colonnina-be-charge-fast-ads-q8-l-anfora-deruta-pg-strada-statale-e45-km-57-290-t19502.html",
            "DateCreated": "2021-08-06T06:14:40.323Z",
            "User": {
                "ID": 11749,
                "Username": "ForumElettrico.it"
            },
            "CheckinStatusTypeID": 10,
            "IsActionedByEditor": false
        }
    ],
    "MediaItems": [
        {
            "ID": 28905,
            "ChargePointID": 188623,
            "ItemURL": "https://s3-ap-southeast-2.amazonaws.com/openchargemap/images/IT/OCM188623/OCM-188623.orig.2021080606145101.jpg",
            "ItemThumbnailURL": "https://s3-ap-southeast-2.amazonaws.com/openchargemap/images/IT/OCM188623/OCM-188623.thmb.2021080606145101.jpg",
            "Comment": "",
            "IsEnabled": true,
            "IsVideo": false,
            "IsFeaturedItem": false,
            "IsExternalResource": false,
            "User": {
                "ID": 11749,
                "Username": "ForumElettrico.it"
            },
            "DateCreated": "2021-08-06T06:15:00Z"
        },
        {
            "ID": 28906,
            "ChargePointID": 188623,
            "ItemURL": "https://s3-ap-southeast-2.amazonaws.com/openchargemap/images/IT/OCM188623/OCM-188623.orig.2021080606145730.jpg",
            "ItemThumbnailURL": "https://s3-ap-southeast-2.amazonaws.com/openchargemap/images/IT/OCM188623/OCM-188623.thmb.2021080606145730.jpg",
            "Comment": "",
            "IsEnabled": true,
            "IsVideo": false,
            "IsFeaturedItem": false,
            "IsExternalResource": false,
            "User": {
                "ID": 11749,
                "Username": "ForumElettrico.it"
            },
            "DateCreated": "2021-08-06T06:15:00Z"
        },
        {
            "ID": 28907,
            "ChargePointID": 188623,
            "ItemURL": "https://s3-ap-southeast-2.amazonaws.com/openchargemap/images/IT/OCM188623/OCM-188623.orig.2021080606150366.jpg",
            "ItemThumbnailURL": "https://s3-ap-southeast-2.amazonaws.com/openchargemap/images/IT/OCM188623/OCM-188623.thmb.2021080606150366.jpg",
            "Comment": "",
            "IsEnabled": true,
            "IsVideo": false,
            "IsFeaturedItem": false,
            "IsExternalResource": false,
            "User": {
                "ID": 11749,
                "Username": "ForumElettrico.it"
            },
            "DateCreated": "2021-08-06T06:15:00Z"
        }
    ],
    "IsRecentlyVerified": true,
    "DateLastVerified": "2021-08-06T06:14:00Z",
    "ID": 188623,
    "UUID": "A17BF38A-98CF-4205-9338-A6E5DEB8093F",
    "DataProviderID": 1,
    "OperatorID": 3327,
    "UsageTypeID": 1,
    "AddressInfo": {
        "ID": 188982,
        "Title": "Be Charge Hotel l'Anfora",
        "AddressLine1": "E45 km 57,290",
        "Town": "Deruta",
        "StateOrProvince": "PG",
        "CountryID": 112,
        "Latitude": 42.987915,
        "Longitude": 12.418184,
        "RelatedURL": "https://www.forumelettrico.it/forum/colonnina-be-charge-fast-ads-q8-l-anfora-deruta-pg-strada-statale-e45-km-57-290-t19502.html",
        "DistanceUnit": 0
    },
    "Connections": [
        {
            "ID": 304686,
            "ConnectionTypeID": 33,
            "LevelID": 2,
            "PowerKW": 75,
            "Quantity": 1
        },
        {
            "ID": 304687,
            "ConnectionTypeID": 2,
            "LevelID": 2,
            "PowerKW": 63
        },
        {
            "ID": 304688,
            "ConnectionTypeID": 1036,
            "LevelID": 2,
            "PowerKW": 22
        }
    ],
    "NumberOfPoints": 1,
    "StatusTypeID": 50,
    "DateLastStatusUpdate": "2021-08-06T06:15:00Z",
    "DataQualityLevel": 1,
    "DateCreated": "2021-08-06T06:14:00Z",
    "SubmissionStatusTypeID": 200
}