{
    "IsRecentlyVerified": false,
    "ID": 159327,
    "UUID": "DEFAA026-313B-41FE-8938-B86708F25599",
    "DataProviderID": 2,
    "DataProvidersReference": "154430",
    "OperatorID": 5,
    "UsageTypeID": 1,
    "AddressInfo": {
        "ID": 159684,
        "Title": "KENNEDY CENTER",
        "AddressLine1": "2700 F St NW",
        "Town": "Washington",
        "StateOrProvince": "DC",
        "Postcode": "20566",
        "CountryID": 2,
        "Latitude": 38.896064,
        "Longitude": -77.055283,
        "ContactTelephone1": "888-758-4389",
        "AccessComments": "24 hours daily",
        "RelatedURL": "http://www.chargepoint.com/",
        "DistanceUnit": 0
    },
    "Connections": [
        {
            "ID": 229475,
            "ConnectionTypeID": 1,
            "LevelID": 2,
            "Amps": 16,
            "Voltage": 230,
            "PowerKW": 3.7,
            "CurrentTypeID": 10,
            "Quantity": 6
        }
    ],
    "StatusTypeID": 50,
    "DateLastStatusUpdate": "2020-06-26T03:00:00Z",
    "DataQualityLevel": 3,
    "DateCreated": "2020-06-26T03:00:00Z",
    "SubmissionStatusTypeID": 100
}