{
    "IsRecentlyVerified": false,
    "ID": 123182,
    "UUID": "C4B6CF6D-6E0B-4999-B721-40ACB5D23EE5",
    "DataProviderID": 2,
    "DataProvidersReference": "73254",
    "OperatorID": 5,
    "UsageTypeID": 1,
    "AddressInfo": {
        "ID": 123528,
        "Title": "HIGHWOODS",
        "AddressLine1": "3200 Beechleaf Ct",
        "Town": "Raleigh",
        "StateOrProvince": "NC",
        "Postcode": "27604",
        "CountryID": 2,
        "Latitude": 35.820943,
        "Longitude": -78.608704,
        "ContactTelephone1": "888-758-4389",
        "AccessComments": "24 hours daily",
        "RelatedURL": "http://www.chargepoint.com/",
        "DistanceUnit": 0
    },
    "Connections": [
        {
            "ID": 173131,
            "ConnectionTypeID": 1,
            "LevelID": 2,
            "Amps": 16,
            "Voltage": 230,
            "PowerKW": 3,
            "CurrentTypeID": 10,
            "Quantity": 4
        }
    ],
    "DateLastStatusUpdate": "2019-12-24T09:12:00Z",
    "DataQualityLevel": 3,
    "DateCreated": "2019-04-06T05:03:00Z",
    "SubmissionStatusTypeID": 100
}