{
    "IsRecentlyVerified": false,
    "ID": 89457,
    "UUID": "AA018717-6403-48F2-8F50-492344B72F79",
    "DataProviderID": 2,
    "DataProvidersReference": "82065",
    "OperatorID": 5,
    "UsageTypeID": 1,
    "AddressInfo": {
        "ID": 89803,
        "Title": "RICHMOND",
        "AddressLine1": "551-599 S 45th St",
        "Town": "Richmond",
        "StateOrProvince": "CA",
        "Postcode": "94804",
        "CountryID": 2,
        "Latitude": 37.9244245,
        "Longitude": -122.327548,
        "ContactTelephone1": "888-758-4389",
        "AccessComments": "24 hours daily",
        "RelatedURL": "http://www.chargepoint.com/",
        "DistanceUnit": 0
    },
    "Connections": [
        {
            "ID": 126854,
            "ConnectionTypeID": 2,
            "LevelID": 2,
            "Amps": 100,
            "Voltage": 400,
            "PowerKW": 40,
            "CurrentTypeID": 10,
            "Quantity": 1
        },
        {
            "ID": 126855,
            "ConnectionTypeID": 32,
            "LevelID": 2,
            "Amps": 100,
            "Voltage": 400,
            "PowerKW": 40,
            "CurrentTypeID": 10,
            "Quantity": 1
        }
    ],
    "DateLastStatusUpdate": "2019-04-06T04:02:00Z",
    "DataQualityLevel": 3,
    "DateCreated": "2017-06-22T08:16:00Z",
    "SubmissionStatusTypeID": 100
}