{
    "IsRecentlyVerified": false,
    "ID": 143701,
    "UUID": "3198E274-12E2-4DF6-A8F3-849687535FEE",
    "DataProviderID": 2,
    "DataProvidersReference": "129567",
    "OperatorID": 89,
    "UsageTypeID": 1,
    "AddressInfo": {
        "ID": 144053,
        "Title": "Orangeville Hydro",
        "AddressLine1": "400 C-Line",
        "Town": "Orangeville",
        "StateOrProvince": "ON",
        "Postcode": "L9W 3Z8",
        "CountryID": 44,
        "Latitude": 43.90243,
        "Longitude": -80.112416,
        "ContactTelephone1": "888-356-8911",
        "AccessComments": "24 hours daily",
        "RelatedURL": "https://flo.ca/",
        "DistanceUnit": 0
    },
    "Connections": [
        {
            "ID": 200086,
            "ConnectionTypeID": 1,
            "LevelID": 2,
            "Amps": 16,
            "Voltage": 230,
            "PowerKW": 3.7,
            "CurrentTypeID": 10,
            "Quantity": 2
        }
    ],
    "StatusTypeID": 50,
    "DateLastStatusUpdate": "2020-06-26T03:07:00Z",
    "DataQualityLevel": 3,
    "DateCreated": "2019-12-24T09:22:00Z",
    "SubmissionStatusTypeID": 100
}