{
    "IsRecentlyVerified": false,
    "ID": 122710,
    "UUID": "342EBEEB-BB42-4A9F-A3DB-7BEBCCE8188F",
    "DataProviderID": 2,
    "DataProvidersReference": "63043",
    "UsageTypeID": 2,
    "AddressInfo": {
        "ID": 123056,
        "Title": "Los Angeles County Sheriff - Pitchess Detention Center",
        "AddressLine1": "29320 Wayside Rd",
        "Town": "Castaic",
        "StateOrProvince": "CA",
        "Postcode": "91384",
        "CountryID": 2,
        "Latitude": 34.465239,
        "Longitude": -118.586761,
        "ContactTelephone1": "",
        "AccessComments": "Employee use only",
        "RelatedURL": "",
        "DistanceUnit": 0
    },
    "Connections": [
        {
            "ID": 172623,
            "ConnectionTypeID": 1,
            "LevelID": 2,
            "Amps": 16,
            "Voltage": 230,
            "PowerKW": 3.7,
            "CurrentTypeID": 10,
            "Quantity": 2
        }
    ],
    "DateLastStatusUpdate": "2020-06-26T02:57:00Z",
    "DataQualityLevel": 3,
    "DateCreated": "2019-04-06T05:03:00Z",
    "SubmissionStatusTypeID": 100
}