{
    "IsRecentlyVerified": false,
    "ID": 3568,
    "UUID": "44903BB1-8E56-46D0-B114-988359B2DAF2",
    "DataProviderID": 1,
    "UsageTypeID": 1,
    "AddressInfo": {
        "ID": 3569,
        "Title": "Los Angeles Convention Center",
        "AddressLine1": "1201 S Figueroa St",
        "Town": "Los Angeles",
        "StateOrProvince": "CA",
        "Postcode": "90015",
        "CountryID": 2,
        "Latitude": 34.040463,
        "Longitude": -118.268681,
        "DistanceUnit": 0
    },
    "Connections": [
        {
            "ID": 83,
            "ConnectionTypeID": 1,
            "Quantity": 1
        }
    ],
    "NumberOfPoints": 2,
    "DateLastStatusUpdate": "2019-12-15T06:07:00Z",
    "DateCreated": "2010-02-28T00:00:00Z",
    "SubmissionStatusTypeID": 200
}