{
    "IsRecentlyVerified": false,
    "ID": 175146,
    "UUID": "9597CA60-C9FD-4141-BCCF-71BF5F7A0D80",
    "DataProviderID": 1,
    "OperatorID": 3296,
    "UsageTypeID": 5,
    "UsageCost": "£0.40/kWh",
    "AddressInfo": {
        "ID": 175505,
        "Title": "75 London Road",
        "AddressLine1": "75 London Road",
        "StateOrProvince": "England",
        "Postcode": "NG31 6HS",
        "CountryID": 1,
        "Latitude": 52.90516549044057,
        "Longitude": -0.6370354806268779,
        "DistanceUnit": 0
    },
    "Connections": [
        {
            "ID": 271494,
            "ConnectionTypeID": 2,
            "StatusTypeID": 50,
            "LevelID": 3,
            "PowerKW": 50,
            "CurrentTypeID": 30,
            "Quantity": 2
        },
        {
            "ID": 271495,
            "ConnectionTypeID": 33,
            "StatusTypeID": 50,
            "LevelID": 3,
            "PowerKW": 50,
            "CurrentTypeID": 30,
            "Quantity": 2
        }
    ],
    "NumberOfPoints": 2,
    "StatusTypeID": 50,
    "DateLastStatusUpdate": "2021-05-26T08:05:00Z",
    "DataQualityLevel": 1,
    "DateCreated": "2021-04-28T15:19:00Z",
    "SubmissionStatusTypeID": 200
}