{
    "IsRecentlyVerified": false,
    "ID": 15328,
    "UUID": "A395ACA9-B79A-4EEB-9290-B36685234DDA",
    "DataProviderID": 1,
    "OperatorID": 35,
    "UsageTypeID": 0,
    "UsageCost": "",
    "AddressInfo": {
        "ID": 15674,
        "Title": "Opel - Ets BOUNAMEAUX SA",
        "AddressLine1": "Quai Vercour 106",
        "AddressLine2": "",
        "Town": "Liège",
        "StateOrProvince": "",
        "Postcode": "4000",
        "CountryID": 26,
        "Latitude": 50.6080816,
        "Longitude": 5.5498963,
        "ContactTelephone1": " 04/252.71.30",
        "ContactTelephone2": "",
        "ContactEmail": "info@opel-bounameaux.be",
        "AccessComments": "",
        "RelatedURL": "http://www.opel-bounameaux.be/",
        "DistanceUnit": 0
    },
    "Connections": [],
    "NumberOfPoints": 1,
    "GeneralComments": "",
    "StatusTypeID": 50,
    "DateLastStatusUpdate": "2013-01-07T17:19:00Z",
    "DataQualityLevel": 1,
    "DateCreated": "2013-01-07T17:19:00Z",
    "SubmissionStatusTypeID": 200
}