{
    "IsRecentlyVerified": false,
    "ID": 120196,
    "UUID": "7A24B488-86F6-4062-B5F9-90F6A9C3F41E",
    "DataProviderID": 2,
    "DataProvidersReference": "92395",
    "OperatorID": 5,
    "UsageTypeID": 1,
    "AddressInfo": {
        "ID": 120542,
        "Title": "8611 MOPAC LLC",
        "AddressLine1": "8611 Mopac Service Rd",
        "Town": "Austin",
        "StateOrProvince": "TX",
        "Postcode": "78759",
        "CountryID": 2,
        "Latitude": 30.3732957,
        "Longitude": -97.7399417,
        "ContactTelephone1": "888-758-4389",
        "AccessComments": "24 hours daily",
        "RelatedURL": "http://www.chargepoint.com/",
        "DistanceUnit": 0
    },
    "Connections": [
        {
            "ID": 169522,
            "ConnectionTypeID": 1,
            "LevelID": 2,
            "Amps": 16,
            "Voltage": 230,
            "PowerKW": 3,
            "CurrentTypeID": 10,
            "Quantity": 2
        }
    ],
    "DateLastStatusUpdate": "2019-12-24T09:09:00Z",
    "DataQualityLevel": 3,
    "DateCreated": "2019-04-01T04:59:00Z",
    "SubmissionStatusTypeID": 100
}