{
    "IsRecentlyVerified": false,
    "ID": 150982,
    "UUID": "0BD4B023-FA4F-4A8F-B94D-BB93FFD7DA1B",
    "DataProviderID": 28,
    "DataProvidersReference": "FR*M13*P13099*001",
    "UsageTypeID": 5,
    "AddressInfo": {
        "ID": 151335,
        "Title": "SAINT-PAUL-LEZ-DURANCE - D11",
        "AddressLine1": "D11 13115 SAINT-PAUL-LEZ-DURANCE",
        "CountryID": 80,
        "Latitude": 43.686469,
        "Longitude": 5.710252,
        "AccessComments": "24h/24 7j/7",
        "DistanceUnit": 0
    },
    "Connections": [
        {
            "ID": 210422,
            "ConnectionTypeID": 28,
            "StatusTypeID": 50,
            "LevelID": 2,
            "PowerKW": 22,
            "CurrentTypeID": 10
        },
        {
            "ID": 210423,
            "ConnectionTypeID": 1036,
            "StatusTypeID": 50,
            "LevelID": 2,
            "PowerKW": 22,
            "CurrentTypeID": 20
        },
        {
            "ID": 240252,
            "ConnectionTypeID": 28,
            "StatusTypeID": 50,
            "LevelID": 2,
            "PowerKW": 22,
            "CurrentTypeID": 10
        },
        {
            "ID": 240253,
            "ConnectionTypeID": 1036,
            "StatusTypeID": 50,
            "LevelID": 2,
            "PowerKW": 22,
            "CurrentTypeID": 20
        }
    ],
    "GeneralComments": "Recharge par badge et avec une application smartphone",
    "StatusTypeID": 50,
    "DateLastStatusUpdate": "2020-08-27T05:11:00Z",
    "DataQualityLevel": 2,
    "DateCreated": "2020-03-15T06:18:00Z",
    "SubmissionStatusTypeID": 100
}