{
    "IsRecentlyVerified": false,
    "ID": 184584,
    "UUID": "7C3F5E99-CEB7-448F-AD51-8547B87A3EB4",
    "DataProviderID": 29,
    "DataProvidersReference": "10006",
    "OperatorID": 2241,
    "AddressInfo": {
        "ID": 184943,
        "Title": "Badener Straße (FlSt 638/1)",
        "AddressLine1": "Badener Straße (FlSt 638/1)",
        "Town": "Bruchsal-Heidelsheim",
        "Postcode": "76646",
        "CountryID": 87,
        "Latitude": 49.100332,
        "Longitude": 8.644936,
        "DistanceUnit": 0
    },
    "Connections": [
        {
            "ID": 293027,
            "ConnectionTypeID": 28,
            "StatusTypeID": 50,
            "LevelID": 2,
            "PowerKW": 22,
            "CurrentTypeID": 20
        },
        {
            "ID": 293028,
            "ConnectionTypeID": 25,
            "StatusTypeID": 50,
            "LevelID": 2,
            "PowerKW": 22,
            "CurrentTypeID": 20
        },
        {
            "ID": 296592,
            "ConnectionTypeID": 28,
            "StatusTypeID": 50,
            "LevelID": 2,
            "PowerKW": 22,
            "CurrentTypeID": 20
        },
        {
            "ID": 296593,
            "ConnectionTypeID": 25,
            "StatusTypeID": 50,
            "LevelID": 2,
            "PowerKW": 22,
            "CurrentTypeID": 20
        }
    ],
    "StatusTypeID": 50,
    "DateLastStatusUpdate": "2021-07-12T02:42:00Z",
    "MetadataValues": [
        {
            "ID": 16875,
            "MetadataFieldID": 4,
            "ItemValue": "Data from the German chargepoint registry provided by Bundesnetzagentur.de under the CC-BY 4.0 license"
        }
    ],
    "DataQualityLevel": 3,
    "DateCreated": "2021-07-08T10:05:00Z",
    "SubmissionStatusTypeID": 100
}