{
    "IsRecentlyVerified": false,
    "ID": 130770,
    "UUID": "C5B529CB-7FE1-467D-A437-1BB1DB7A08E7",
    "DataProviderID": 1,
    "OperatorID": 3,
    "OperatorsReference": "PG-70021,PG-83520",
    "UsageTypeID": 4,
    "UsageCost": "Free",
    "AddressInfo": {
        "ID": 131116,
        "Title": "Tesco Extra",
        "AddressLine1": "St Stephen Shopping Centre",
        "AddressLine2": "5 Park Street",
        "Town": "Hull",
        "StateOrProvince": "Humberside",
        "Postcode": "HU2 8LN",
        "CountryID": 1,
        "Latitude": 53.746029,
        "Longitude": -0.351329,
        "DistanceUnit": 0
    },
    "Connections": [
        {
            "ID": 183088,
            "ConnectionTypeID": 25,
            "StatusTypeID": 50,
            "LevelID": 2,
            "Amps": 32,
            "Voltage": 230,
            "PowerKW": 7,
            "CurrentTypeID": 10,
            "Quantity": 4
        }
    ],
    "NumberOfPoints": 4,
    "StatusTypeID": 50,
    "DateLastStatusUpdate": "2020-02-09T22:24:00Z",
    "DataQualityLevel": 1,
    "DateCreated": "2019-08-14T12:44:00Z",
    "SubmissionStatusTypeID": 200
}