{
    "IsRecentlyVerified": false,
    "ID": 145895,
    "UUID": "88273ED2-4BCC-425B-84AE-60ED4589443F",
    "DataProviderID": 1,
    "OperatorID": 1,
    "UsageTypeID": 5,
    "UsageCost": "0.45BGN/kWh",
    "AddressInfo": {
        "ID": 146247,
        "Title": "FINES Mladost-1 ",
        "AddressLine1": "ulitsa Dimitar Mollov 5",
        "Town": "Sofia",
        "StateOrProvince": "Sofia City",
        "Postcode": "1750",
        "CountryID": 39,
        "Latitude": 42.66140113555713,
        "Longitude": 23.372084085467122,
        "DistanceUnit": 0
    },
    "Connections": [
        {
            "ID": 202741,
            "ConnectionTypeID": 33,
            "StatusTypeID": 50,
            "LevelID": 3,
            "PowerKW": 120,
            "CurrentTypeID": 30,
            "Quantity": 1
        },
        {
            "ID": 202742,
            "ConnectionTypeID": 2,
            "StatusTypeID": 50,
            "LevelID": 3,
            "PowerKW": 120,
            "CurrentTypeID": 30,
            "Quantity": 1
        }
    ],
    "NumberOfPoints": 1,
    "GeneralComments": "Activate with debit or credit card!",
    "StatusTypeID": 50,
    "DateLastStatusUpdate": "2021-06-12T08:48:00Z",
    "DataQualityLevel": 1,
    "DateCreated": "2019-12-24T20:55:00Z",
    "SubmissionStatusTypeID": 200
}