{
    "IsRecentlyVerified": false,
    "ID": 79226,
    "UUID": "4A0B86AF-CFB7-4A1C-8EDA-C4340148AE14",
    "DataProviderID": 1,
    "OperatorID": 23,
    "OperatorsReference": "20667",
    "UsageTypeID": 4,
    "UsageCost": "$0.44/min >=60kW; $0.22/min <60kW; other tariffs for older cars",
    "AddressInfo": {
        "ID": 79572,
        "Title": "Huntsville, on Supercharger",
        "AddressLine1": "70 King William Street",
        "Town": "Huntsville",
        "Postcode": "P1H 2A5",
        "CountryID": 44,
        "Latitude": 45.333611,
        "Longitude": -79.206703,
        "DistanceUnit": 0
    },
    "Connections": [
        {
            "ID": 113845,
            "ConnectionTypeID": 27,
            "StatusTypeID": 50,
            "LevelID": 3,
            "PowerKW": 120,
            "CurrentTypeID": 30,
            "Quantity": 8
        }
    ],
    "NumberOfPoints": 9,
    "GeneralComments": "Charging9 Superchargers, available 24/7",
    "StatusTypeID": 50,
    "DateLastStatusUpdate": "2021-01-04T13:32:00Z",
    "DataQualityLevel": 1,
    "DateCreated": "2017-01-26T21:12:00Z",
    "SubmissionStatusTypeID": 200
}