{
    "IsRecentlyVerified": false,
    "ID": 143605,
    "UUID": "6D15074D-3AE6-4842-883E-91DA853192BA",
    "DataProviderID": 2,
    "DataProvidersReference": "121249",
    "OperatorID": 5,
    "UsageTypeID": 1,
    "AddressInfo": {
        "ID": 143957,
        "Title": "MORGUARD",
        "AddressLine1": "201 City Centre Dr",
        "Town": "Mississauga",
        "StateOrProvince": "ON",
        "Postcode": "L5B 4E4",
        "CountryID": 44,
        "Latitude": 43.58943,
        "Longitude": -79.6415867,
        "ContactTelephone1": "888-758-4389",
        "AccessComments": "24 hours daily",
        "RelatedURL": "http://www.chargepoint.com/",
        "DistanceUnit": 0
    },
    "Connections": [
        {
            "ID": 199963,
            "ConnectionTypeID": 1,
            "LevelID": 2,
            "Amps": 16,
            "Voltage": 230,
            "PowerKW": 3.7,
            "CurrentTypeID": 10,
            "Quantity": 1
        }
    ],
    "StatusTypeID": 50,
    "DateLastStatusUpdate": "2020-06-26T03:07:00Z",
    "DataQualityLevel": 3,
    "DateCreated": "2019-12-24T09:21:00Z",
    "SubmissionStatusTypeID": 100
}