{
    "IsRecentlyVerified": false,
    "ID": 123163,
    "UUID": "7C1DA0A4-4855-4815-A746-62B7E680D794",
    "DataProviderID": 2,
    "DataProvidersReference": "60264",
    "UsageTypeID": 1,
    "AddressInfo": {
        "ID": 123509,
        "Title": "Stone's Education Superstore",
        "AddressLine1": "210 Hampton Woods Ln",
        "Town": "Raleigh",
        "StateOrProvince": "NC",
        "Postcode": "27607",
        "CountryID": 2,
        "Latitude": 35.793985,
        "Longitude": -78.750329,
        "ContactTelephone1": "919-821-7210",
        "AccessComments": "Store business hours; see front desk for access",
        "RelatedURL": "",
        "DistanceUnit": 0
    },
    "Connections": [
        {
            "ID": 173112,
            "ConnectionTypeID": 1,
            "LevelID": 2,
            "Amps": 16,
            "Voltage": 230,
            "PowerKW": 3.7,
            "CurrentTypeID": 10,
            "Quantity": 1
        }
    ],
    "DateLastStatusUpdate": "2020-06-26T02:58:00Z",
    "DataQualityLevel": 3,
    "DateCreated": "2019-04-06T05:03:00Z",
    "SubmissionStatusTypeID": 100
}