{
    "IsRecentlyVerified": false,
    "ID": 52327,
    "UUID": "6D4A414C-8861-4634-9204-928E60D7F831",
    "DataProviderID": 1,
    "OperatorID": 105,
    "UsageTypeID": 1,
    "AddressInfo": {
        "ID": 52673,
        "Title": "E-Bike Station Altes Rathaus",
        "AddressLine1": "Bahnstraße 22",
        "Town": "Traben-Trarbach",
        "StateOrProvince": "Traben-Trarbach",
        "Postcode": "56841",
        "CountryID": 87,
        "Latitude": 49.9512711,
        "Longitude": 7.11599590000003,
        "ContactTelephone1": "0800 99 44 009",
        "RelatedURL": "http://www.rwe.com/web/cms/de/494436/e-bikes-on-tour/ladestationen/",
        "DistanceUnit": 0
    },
    "Connections": [
        {
            "ID": 64978,
            "ConnectionTypeID": 28,
            "StatusTypeID": 50,
            "LevelID": 1,
            "Amps": 10,
            "Voltage": 230,
            "PowerKW": 2.3,
            "CurrentTypeID": 10,
            "Quantity": 3
        }
    ],
    "NumberOfPoints": 3,
    "StatusTypeID": 50,
    "DateLastStatusUpdate": "2015-08-28T09:12:00Z",
    "DataQualityLevel": 1,
    "DateCreated": "2015-08-28T08:02:00Z",
    "SubmissionStatusTypeID": 200
}