{
    "IsRecentlyVerified": false,
    "ID": 31972,
    "UUID": "FD95C560-EC53-4AEF-A666-67778F6D0077",
    "DataProviderID": 26,
    "DataProvidersReference": "30412",
    "OperatorID": 86,
    "OperatorsReference": "EnWB Yorckstraße",
    "UsageCost": "0.00 afhankelijk van pas",
    "AddressInfo": {
        "ID": 32318,
        "Title": "Yorckstraße 19",
        "AddressLine1": "Yorckstraße 19",
        "Town": "Karlsruhe",
        "Postcode": "76185",
        "CountryID": 87,
        "Latitude": 49.009448,
        "Longitude": 8.374104,
        "ContactTelephone1": "0800 3629-000",
        "ContactEmail": "-",
        "RelatedURL": "http://www.enbw.com/",
        "DistanceUnit": 0
    },
    "Connections": [
        {
            "ID": 35483,
            "ConnectionTypeID": 25,
            "LevelID": 2,
            "PowerKW": 5,
            "CurrentTypeID": 10
        }
    ],
    "NumberOfPoints": 2,
    "StatusTypeID": 50,
    "DateLastStatusUpdate": "2016-03-03T12:34:00Z",
    "DataQualityLevel": 3,
    "DateCreated": "2015-01-09T06:03:00Z",
    "SubmissionStatusTypeID": 100
}