{
    "IsRecentlyVerified": false,
    "ID": 57242,
    "UUID": "023BD213-E2CC-4924-8E5B-43FF751CEB0C",
    "DataProviderID": 2,
    "DataProvidersReference": "71067",
    "OperatorID": 5,
    "UsageTypeID": 1,
    "AddressInfo": {
        "ID": 57588,
        "Title": "MOUNTAIN GROVE",
        "AddressLine1": "27651 San Bernardino Ave",
        "Town": "Redlands",
        "StateOrProvince": "CA",
        "Postcode": "92374",
        "CountryID": 2,
        "Latitude": 34.074305,
        "Longitude": -117.203204,
        "ContactTelephone1": "888-758-4389",
        "AccessComments": "24 hours daily",
        "RelatedURL": "http://www.chargepoint.com/",
        "DistanceUnit": 0
    },
    "Connections": [
        {
            "ID": 72339,
            "ConnectionTypeID": 1,
            "LevelID": 2,
            "Amps": 16,
            "Voltage": 230,
            "PowerKW": 3,
            "CurrentTypeID": 10,
            "Quantity": 8
        }
    ],
    "DateLastStatusUpdate": "2019-04-06T04:01:00Z",
    "DataQualityLevel": 3,
    "DateCreated": "2015-11-30T11:50:00Z",
    "SubmissionStatusTypeID": 100
}