{
    "IsRecentlyVerified": false,
    "ID": 158633,
    "UUID": "C1F5D963-F1FA-44E8-8451-B4B1FB5B7555",
    "DataProviderID": 2,
    "DataProvidersReference": "152975",
    "OperatorID": 89,
    "UsageTypeID": 1,
    "AddressInfo": {
        "ID": 158990,
        "Title": "840 Imperial Hwy",
        "AddressLine1": "840 Imperial hwy",
        "Town": "Los Angeles",
        "StateOrProvince": "CA",
        "Postcode": "90044",
        "CountryID": 2,
        "Latitude": 33.930891,
        "Longitude": -118.290849,
        "ContactTelephone1": "888-356-8911",
        "AccessComments": "24 hours daily",
        "RelatedURL": "https://flo.ca/",
        "DistanceUnit": 0
    },
    "Connections": [
        {
            "ID": 228647,
            "ConnectionTypeID": 1,
            "LevelID": 2,
            "Amps": 16,
            "Voltage": 230,
            "PowerKW": 3.7,
            "CurrentTypeID": 10,
            "Quantity": 1
        }
    ],
    "StatusTypeID": 50,
    "DateLastStatusUpdate": "2020-06-26T02:56:00Z",
    "DataQualityLevel": 3,
    "DateCreated": "2020-06-26T02:56:00Z",
    "SubmissionStatusTypeID": 100
}