{
    "IsRecentlyVerified": false,
    "ID": 159406,
    "UUID": "E4624826-8C7B-4160-92FF-ABB80463F421",
    "DataProviderID": 2,
    "DataProvidersReference": "153851",
    "UsageTypeID": 1,
    "AddressInfo": {
        "ID": 159763,
        "Title": "UMBC - Lot 9",
        "AddressLine1": "1000 Hilltop Cr",
        "Town": "Baltimore",
        "StateOrProvince": "MD",
        "Postcode": "21250",
        "CountryID": 2,
        "Latitude": 39.25459,
        "Longitude": -76.715174,
        "ContactTelephone1": "410-685-1109",
        "AccessComments": "24 hours daily",
        "RelatedURL": "",
        "DistanceUnit": 0
    },
    "Connections": [
        {
            "ID": 229575,
            "ConnectionTypeID": 1,
            "LevelID": 2,
            "Amps": 16,
            "Voltage": 230,
            "PowerKW": 3.7,
            "CurrentTypeID": 10,
            "Quantity": 7
        }
    ],
    "StatusTypeID": 50,
    "DateLastStatusUpdate": "2020-06-26T03:01:00Z",
    "DataQualityLevel": 3,
    "DateCreated": "2020-06-26T03:01:00Z",
    "SubmissionStatusTypeID": 100
}