{
    "IsRecentlyVerified": false,
    "ID": 17630,
    "UUID": "DB55925C-D9E4-42F4-90B6-C1B95B22AF92",
    "DataProviderID": 22,
    "DataProvidersReference": "EEF87E2FABA9E4BC03A10CDBB383798B",
    "AddressInfo": {
        "ID": 17975,
        "Title": "湯の郷湯西川観光センター（道の駅湯西川）",
        "AddressLine1": "栃木県日光市西川478-1",
        "CountryID": 114,
        "Latitude": 36.92943366,
        "Longitude": 139.6879424,
        "ContactTelephone1": "0288-78-1222",
        "DistanceUnit": 0
    },
    "Connections": [
        {
            "ID": 17871,
            "ConnectionTypeID": 2,
            "LevelID": 2,
            "Amps": 100,
            "Voltage": 480,
            "PowerKW": 48,
            "Quantity": 1
        }
    ],
    "DateLastStatusUpdate": "2013-06-29T09:01:00Z",
    "DataQualityLevel": 2,
    "DateCreated": "2013-06-29T09:01:00Z",
    "SubmissionStatusTypeID": 200
}