{
    "IsRecentlyVerified": false,
    "ID": 85442,
    "UUID": "CBA129EB-9B06-44C8-BA3F-B4B6344C040B",
    "DataProviderID": 1,
    "OperatorID": 3278,
    "UsageTypeID": 4,
    "UsageCost": "Free",
    "AddressInfo": {
        "ID": 85788,
        "Title": "Benahavis, Avenida de Andalucía, 11",
        "AddressLine1": "Av. de Andalucia, 11",
        "Town": "Benahavís",
        "StateOrProvince": "Málaga",
        "Postcode": "29679",
        "CountryID": 210,
        "Latitude": 36.5233032,
        "Longitude": -5.04580299999998,
        "RelatedURL": "https://www.urbener.com/",
        "DistanceUnit": 0
    },
    "Connections": [
        {
            "ID": 121513,
            "ConnectionTypeID": 25,
            "StatusTypeID": 50,
            "LevelID": 2,
            "PowerKW": 22,
            "CurrentTypeID": 10,
            "Quantity": 2
        }
    ],
    "NumberOfPoints": 2,
    "GeneralComments": "Tarjeta RFID",
    "StatusTypeID": 50,
    "DateLastStatusUpdate": "2017-04-04T14:31:00Z",
    "DataQualityLevel": 1,
    "DateCreated": "2017-04-04T14:06:00Z",
    "SubmissionStatusTypeID": 200
}