{
    "IsRecentlyVerified": false,
    "ID": 118253,
    "UUID": "F0789DFF-8873-4FEF-95DF-C15113D390F8",
    "DataProviderID": 1,
    "OperatorID": 80,
    "UsageTypeID": 4,
    "AddressInfo": {
        "ID": 118599,
        "Title": "Viverone Area Mercatale | EnelX",
        "AddressLine1": "Area Mercatale",
        "Town": "Viverone",
        "StateOrProvince": "BI",
        "Postcode": "13886",
        "CountryID": 112,
        "Latitude": 45.4200182800448,
        "Longitude": 8.05832992695673,
        "RelatedURL": "https://www.enelx.com/it/it/emobility",
        "DistanceUnit": 0
    },
    "Connections": [
        {
            "ID": 167316,
            "ConnectionTypeID": 25,
            "StatusTypeID": 50,
            "LevelID": 2,
            "Amps": 32,
            "Voltage": 400,
            "PowerKW": 22,
            "CurrentTypeID": 20,
            "Quantity": 2
        }
    ],
    "NumberOfPoints": 2,
    "StatusTypeID": 50,
    "DateLastStatusUpdate": "2019-03-19T17:35:00Z",
    "DataQualityLevel": 1,
    "DateCreated": "2019-03-19T17:17:00Z",
    "SubmissionStatusTypeID": 200
}