{
    "IsRecentlyVerified": false,
    "ID": 63361,
    "UUID": "B0C5336B-991A-4FD3-969D-8244DF54B70E",
    "DataProviderID": 26,
    "DataProvidersReference": "79084",
    "OperatorID": 73,
    "OperatorsReference": "EV-Box EVB-P1548056",
    "UsageCost": "0.00 jaarabonnement",
    "AddressInfo": {
        "ID": 63707,
        "Title": "Voltaweg 11",
        "AddressLine1": "Voltaweg 11",
        "Town": "Delft",
        "Postcode": "2627 BD",
        "CountryID": 159,
        "Latitude": 51.9827,
        "Longitude": 4.37608,
        "RelatedURL": "http://www.ev-box.nl",
        "DistanceUnit": 0
    },
    "Connections": [
        {
            "ID": 80766,
            "ConnectionTypeID": 25,
            "LevelID": 2,
            "PowerKW": 11,
            "CurrentTypeID": 10
        },
        {
            "ID": 80767,
            "ConnectionTypeID": 25,
            "LevelID": 2,
            "PowerKW": 11,
            "CurrentTypeID": 10
        }
    ],
    "NumberOfPoints": 1,
    "StatusTypeID": 50,
    "DateLastStatusUpdate": "2016-06-04T02:43:00Z",
    "DataQualityLevel": 3,
    "DateCreated": "2016-03-03T12:30:00Z",
    "SubmissionStatusTypeID": 100
}