{
    "IsRecentlyVerified": false,
    "ID": 159285,
    "UUID": "5ADF10D5-7E3B-43A2-A781-CDD96D2D60F5",
    "DataProviderID": 2,
    "DataProvidersReference": "160528",
    "OperatorID": 5,
    "UsageTypeID": 1,
    "AddressInfo": {
        "ID": 159642,
        "Title": "WINDPLAY",
        "AddressLine1": "4944 Windplay Dr",
        "Town": "El Dorado Hills",
        "StateOrProvince": "CA",
        "Postcode": "95762",
        "CountryID": 2,
        "Latitude": 38.637669,
        "Longitude": -121.070366,
        "ContactTelephone1": "888-758-4389",
        "AccessComments": "24 hours daily",
        "RelatedURL": "http://www.chargepoint.com/",
        "DistanceUnit": 0
    },
    "Connections": [
        {
            "ID": 229422,
            "ConnectionTypeID": 1,
            "LevelID": 2,
            "Amps": 16,
            "Voltage": 230,
            "PowerKW": 3.7,
            "CurrentTypeID": 10,
            "Quantity": 6
        }
    ],
    "StatusTypeID": 50,
    "DateLastStatusUpdate": "2020-06-26T03:00:00Z",
    "DataQualityLevel": 3,
    "DateCreated": "2020-06-26T03:00:00Z",
    "SubmissionStatusTypeID": 100
}