{
    "IsRecentlyVerified": false,
    "ID": 188082,
    "UUID": "FEC4381F-6E0A-4B12-81B2-5D72DB70F129",
    "DataProviderID": 1,
    "OperatorID": 1,
    "UsageTypeID": 1,
    "UsageCost": "25p per kW App or RFID card",
    "AddressInfo": {
        "ID": 188441,
        "Title": "Ryedale Council Offices",
        "AddressLine1": "Ryedale Council Offices",
        "Town": "Ryedale",
        "StateOrProvince": "England",
        "Postcode": "YO17 7HH",
        "CountryID": 1,
        "Latitude": 54.13944,
        "Longitude": -0.789851,
        "AccessComments": "Download App information on charger",
        "RelatedURL": "https://www.connectedkerb.com",
        "DistanceUnit": 0
    },
    "Connections": [
        {
            "ID": 303522,
            "ConnectionTypeID": 25,
            "Reference": "5220",
            "StatusTypeID": 50,
            "LevelID": 2,
            "Amps": 32,
            "Voltage": 400,
            "PowerKW": 22,
            "CurrentTypeID": 20,
            "Quantity": 4
        }
    ],
    "GeneralComments": "Parking is Free",
    "StatusTypeID": 50,
    "DateLastStatusUpdate": "2021-08-28T11:43:00Z",
    "MetadataValues": [
        {
            "ID": 20322,
            "MetadataFieldID": 4,
            "ItemValue": "Contains public sector information licensed under the Open Government Licence v2.0. http://www.nationalarchives.gov.uk/doc/open-government-licence/version/2/"
        }
    ],
    "DataQualityLevel": 3,
    "DateCreated": "2021-07-12T03:39:00Z",
    "SubmissionStatusTypeID": 100
}