{
    "IsRecentlyVerified": false,
    "ID": 7821,
    "UUID": "3E234A57-EDDD-4BB2-81D6-541A0A5ED0E1",
    "DataProviderID": 15,
    "DataProvidersReference": "10505",
    "OperatorID": 5,
    "UsageTypeID": 1,
    "AddressInfo": {
        "ID": 7718,
        "Title": "7428 Terrace Ave",
        "AddressLine1": "7428 Terrace Ave",
        "Town": "Middleton",
        "StateOrProvince": "WI",
        "Postcode": "53562",
        "CountryID": 2,
        "Latitude": 43.09463,
        "Longitude": -89.50966,
        "ContactTelephone1": "888-758-4389",
        "RelatedURL": "http://carstations.com/10505",
        "DistanceUnit": 0
    },
    "Connections": [
        {
            "ID": 5251,
            "ConnectionTypeID": 1,
            "Reference": "J1772",
            "LevelID": 2
        },
        {
            "ID": 7224,
            "ConnectionTypeID": 9,
            "Reference": "NEMA5",
            "LevelID": 1,
            "Quantity": 1
        }
    ],
    "NumberOfPoints": 2,
    "StatusTypeID": 0,
    "DateLastStatusUpdate": "2017-11-04T14:04:00Z",
    "DataQualityLevel": 1,
    "DateCreated": "2011-11-11T12:05:00Z",
    "SubmissionStatusTypeID": 100
}