{
    "IsRecentlyVerified": false,
    "ID": 140904,
    "UUID": "343052F3-4189-4957-8753-440C8F1745E1",
    "DataProviderID": 2,
    "DataProvidersReference": "47204",
    "UsageTypeID": 2,
    "AddressInfo": {
        "ID": 141256,
        "Title": "Nissan of Marian",
        "AddressLine1": "3209 Banterra Dr",
        "Town": "Marion",
        "StateOrProvince": "IL",
        "Postcode": "62959",
        "CountryID": 2,
        "Latitude": 37.74626,
        "Longitude": -88.985731,
        "ContactTelephone1": "618-993-5000",
        "AccessComments": "",
        "RelatedURL": "",
        "DistanceUnit": 0
    },
    "Connections": [
        {
            "ID": 196672,
            "ConnectionTypeID": 1,
            "LevelID": 2,
            "Amps": 16,
            "Voltage": 230,
            "PowerKW": 3.7,
            "CurrentTypeID": 10,
            "Quantity": 1
        }
    ],
    "StatusTypeID": 50,
    "DateLastStatusUpdate": "2020-06-26T02:59:00Z",
    "DataQualityLevel": 3,
    "DateCreated": "2019-12-24T09:14:00Z",
    "SubmissionStatusTypeID": 100
}