{
    "IsRecentlyVerified": false,
    "ID": 11843,
    "UUID": "7A36485B-69DF-4C17-8115-CD2991A1592E",
    "DataProviderID": 1,
    "OperatorID": 76,
    "UsageTypeID": 1,
    "UsageCost": "5€/up to 60min",
    "AddressInfo": {
        "ID": 11740,
        "Title": "Viru Shopping centre parking lot quickcharger",
        "AddressLine1": "Viru väljak 4",
        "Town": "Tallinn",
        "StateOrProvince": "Harju maakond",
        "CountryID": 74,
        "Latitude": 59.4368346,
        "Longitude": 24.7539243,
        "ContactTelephone1": "+372 6511911",
        "ContactEmail": "tugi@elmo.ee",
        "AccessComments": "On 4. floor",
        "RelatedURL": "http://www.elmo.ee",
        "DistanceUnit": 0
    },
    "Connections": [
        {
            "ID": 9253,
            "ConnectionTypeID": 2,
            "StatusTypeID": 50,
            "LevelID": 3,
            "Amps": 120,
            "Voltage": 500,
            "PowerKW": 50,
            "CurrentTypeID": 30,
            "Quantity": 1
        },
        {
            "ID": 25812,
            "ConnectionTypeID": 25,
            "StatusTypeID": 50,
            "LevelID": 2,
            "Amps": 32,
            "Voltage": 400,
            "PowerKW": 22,
            "CurrentTypeID": 20,
            "Quantity": 1
        }
    ],
    "NumberOfPoints": 1,
    "GeneralComments": "Charger number 37028.",
    "StatusTypeID": 50,
    "DateLastStatusUpdate": "2014-05-29T04:55:00Z",
    "DataQualityLevel": 1,
    "DateCreated": "2012-08-03T13:09:00Z",
    "SubmissionStatusTypeID": 200
}