{
    "IsRecentlyVerified": false,
    "ID": 62055,
    "UUID": "DCB9885D-5F00-46B3-938A-2AFFC8C7D6D9",
    "DataProviderID": 2,
    "DataProvidersReference": "72553",
    "OperatorID": 5,
    "UsageTypeID": 1,
    "AddressInfo": {
        "ID": 62401,
        "Title": "EVERGY",
        "AddressLine1": "5830 NW Barry Rd @ Saint Luke's North Hospital-Barry Rd.",
        "Town": "Kansas City",
        "StateOrProvince": "MO",
        "Postcode": "64154",
        "CountryID": 2,
        "Latitude": 39.2492822,
        "Longitude": -94.649415,
        "ContactTelephone1": "888-758-4389",
        "AccessComments": "24 hours daily",
        "RelatedURL": "http://www.chargepoint.com/",
        "DistanceUnit": 0
    },
    "Connections": [
        {
            "ID": 78958,
            "ConnectionTypeID": 1,
            "LevelID": 2,
            "Amps": 16,
            "Voltage": 230,
            "PowerKW": 3.7,
            "CurrentTypeID": 10,
            "Quantity": 16
        }
    ],
    "DateLastStatusUpdate": "2020-06-26T03:01:00Z",
    "DataQualityLevel": 3,
    "DateCreated": "2016-03-03T11:38:00Z",
    "SubmissionStatusTypeID": 100
}