{
    "IsRecentlyVerified": false,
    "ID": 157834,
    "UUID": "B81B5DEE-944F-4153-AD71-EBE36088DED9",
    "DataProviderID": 1,
    "OperatorID": 8,
    "UsageTypeID": 4,
    "AddressInfo": {
        "ID": 158188,
        "Title": "Bethany Waye Car Park",
        "AddressLine1": "East Bedfont",
        "Town": "Feltham",
        "Postcode": "TW14 8BU",
        "CountryID": 1,
        "Latitude": 51.4538,
        "Longitude": -0.428724,
        "AccessComments": "",
        "RelatedURL": "https://www.bpchargemaster.com",
        "DistanceUnit": 0
    },
    "Connections": [
        {
            "ID": 227424,
            "ConnectionTypeID": 2,
            "Reference": "1",
            "StatusTypeID": 50,
            "LevelID": 3,
            "Amps": 125,
            "Voltage": 400,
            "PowerKW": 50,
            "CurrentTypeID": 30,
            "Quantity": 1
        },
        {
            "ID": 227425,
            "ConnectionTypeID": 2,
            "Reference": "2",
            "StatusTypeID": 50,
            "LevelID": 3,
            "Amps": 125,
            "Voltage": 400,
            "PowerKW": 50,
            "CurrentTypeID": 30,
            "Quantity": 1
        },
        {
            "ID": 261958,
            "ConnectionTypeID": 1036,
            "StatusTypeID": 50,
            "LevelID": 3,
            "PowerKW": 43,
            "CurrentTypeID": 20,
            "Quantity": 1
        }
    ],
    "GeneralComments": "Charge point operated by Chargemaster. Available on the POLAR network. Visit www.polar-network.com to apply.",
    "StatusTypeID": 50,
    "DateLastStatusUpdate": "2020-12-30T21:01:00Z",
    "MetadataValues": [
        {
            "ID": 7367,
            "MetadataFieldID": 4,
            "ItemValue": "Contains public sector information licensed under the Open Government Licence v2.0. http://www.nationalarchives.gov.uk/doc/open-government-licence/version/2/"
        }
    ],
    "DataQualityLevel": 3,
    "DateCreated": "2020-06-25T10:00:00Z",
    "SubmissionStatusTypeID": 100
}