{
    "IsRecentlyVerified": false,
    "ID": 48619,
    "UUID": "1564A396-26C6-46CA-8726-1C3B36179AC8",
    "DataProviderID": 1,
    "OperatorID": 93,
    "OperatorsReference": "SC81",
    "UsageTypeID": 4,
    "UsageCost": "Free",
    "AddressInfo": {
        "ID": 48965,
        "Title": "Union Place Car Park",
        "AddressLine1": "Union Place",
        "Town": "County Tyrone",
        "StateOrProvince": "County Tyrone",
        "Postcode": "BT80 8NP",
        "CountryID": 1,
        "Latitude": 54.6475077976652,
        "Longitude": -6.7429854332047,
        "DistanceUnit": 0
    },
    "Connections": [
        {
            "ID": 60074,
            "ConnectionTypeID": 25,
            "Reference": "1",
            "StatusTypeID": 50,
            "LevelID": 2,
            "Amps": 32,
            "Voltage": 400,
            "PowerKW": 22,
            "CurrentTypeID": 20,
            "Quantity": 2
        }
    ],
    "NumberOfPoints": 2,
    "StatusTypeID": 50,
    "DateLastStatusUpdate": "2019-06-04T06:01:00Z",
    "MetadataValues": [
        {
            "ID": 1626,
            "MetadataFieldID": 4,
            "ItemValue": "Contains public sector information licensed under the Open Government Licence v2.0. http://www.nationalarchives.gov.uk/doc/open-government-licence/version/2/"
        }
    ],
    "DataQualityLevel": 3,
    "DateCreated": "2015-06-27T07:22:00Z",
    "SubmissionStatusTypeID": 100
}