{
    "IsRecentlyVerified": false,
    "ID": 31859,
    "UUID": "8D63F39C-F699-46E4-92F4-08CA47B5ED91",
    "DataProviderID": 26,
    "DataProvidersReference": "30301",
    "OperatorID": 86,
    "OperatorsReference": "EnWB Haußmannstraße",
    "UsageCost": "0.00 afhankelijk van pas",
    "AddressInfo": {
        "ID": 32205,
        "Title": "Haußmannstraße 28",
        "AddressLine1": "Haußmannstraße 28",
        "Town": "Stuttgart",
        "Postcode": "70188",
        "CountryID": 87,
        "Latitude": 48.7805,
        "Longitude": 9.19181,
        "ContactTelephone1": "0800 3629-000",
        "ContactEmail": "-",
        "RelatedURL": "http://www.enbw.com/",
        "DistanceUnit": 0
    },
    "Connections": [
        {
            "ID": 35370,
            "ConnectionTypeID": 25,
            "LevelID": 2,
            "PowerKW": 5,
            "CurrentTypeID": 10
        }
    ],
    "NumberOfPoints": 2,
    "StatusTypeID": 50,
    "DateLastStatusUpdate": "2015-01-09T06:03:00Z",
    "DataQualityLevel": 3,
    "DateCreated": "2015-01-09T06:03:00Z",
    "SubmissionStatusTypeID": 100
}