{
    "IsRecentlyVerified": false,
    "ID": 154395,
    "UUID": "EDCF5F49-C451-470F-B8E3-6F251D84520C",
    "DataProviderID": 28,
    "DataProvidersReference": "FR*S02*P0250428",
    "UsageTypeID": 5,
    "AddressInfo": {
        "ID": 154748,
        "Title": "0028 - Avenue de la Victoire",
        "AddressLine1": "Avenue de la Victoire 02440 MONTESCOURT LIZEROLLES",
        "CountryID": 80,
        "Latitude": 49.73335854,
        "Longitude": 3.245405801,
        "AccessComments": "accessible 24h/24 - 7j/7",
        "DistanceUnit": 0
    },
    "Connections": [
        {
            "ID": 217096,
            "ConnectionTypeID": 28,
            "StatusTypeID": 50,
            "LevelID": 2,
            "PowerKW": 22,
            "CurrentTypeID": 10
        },
        {
            "ID": 217097,
            "ConnectionTypeID": 1036,
            "StatusTypeID": 50,
            "LevelID": 2,
            "PowerKW": 22,
            "CurrentTypeID": 20
        }
    ],
    "GeneralComments": "recharge normale et accélérée accessible par application smartphone/internet et badge - informations site web useda.fr -facturation en fonction de la puissance et du temps de charge",
    "StatusTypeID": 50,
    "DateLastStatusUpdate": "2020-08-27T05:16:00Z",
    "DataQualityLevel": 2,
    "DateCreated": "2020-03-15T10:55:00Z",
    "SubmissionStatusTypeID": 100
}