{
    "IsRecentlyVerified": false,
    "ID": 161090,
    "UUID": "703D6DE0-0243-4EBC-AEFF-1A692B19AB05",
    "DataProviderID": 1,
    "OperatorID": 3305,
    "UsageTypeID": 4,
    "UsageCost": "Free",
    "AddressInfo": {
        "ID": 161447,
        "Title": "PDR polinya",
        "AddressLine1": "Carretera de Mollet a Sentmenat",
        "Town": "Polinyà",
        "StateOrProvince": "Barcelona",
        "Postcode": "08213",
        "CountryID": 210,
        "Latitude": 41.554794401275785,
        "Longitude": 2.158692976628913,
        "DistanceUnit": 0
    },
    "Connections": [
        {
            "ID": 231774,
            "ConnectionTypeID": 25,
            "StatusTypeID": 50,
            "LevelID": 2,
            "PowerKW": 22,
            "CurrentTypeID": 20,
            "Quantity": 2
        }
    ],
    "NumberOfPoints": 2,
    "GeneralComments": "Se activa con llavero electromaps o tarjeta amb",
    "StatusTypeID": 50,
    "DateLastStatusUpdate": "2020-07-03T07:41:00Z",
    "DataQualityLevel": 1,
    "DateCreated": "2020-07-02T20:53:00Z",
    "SubmissionStatusTypeID": 200
}