{
    "IsRecentlyVerified": false,
    "ID": 16400,
    "UUID": "9E66D929-7EA0-45D7-8DA0-14FD4D8171CB",
    "DataProviderID": 1,
    "OperatorID": 45,
    "OperatorsReference": "EM-DE-06412000-01-00007",
    "UsageTypeID": 4,
    "UsageCost": "",
    "AddressInfo": {
        "ID": 16745,
        "Title": "DB-Energie Demonstration",
        "AddressLine1": "Im Galluspark 23",
        "AddressLine2": "",
        "Town": "Frankfurt",
        "StateOrProvince": "",
        "Postcode": "60326",
        "CountryID": 87,
        "Latitude": 50.098725,
        "Longitude": 8.634122,
        "ContactTelephone1": "",
        "ContactTelephone2": "",
        "ContactEmail": "",
        "AccessComments": "",
        "RelatedURL": "",
        "DistanceUnit": 0
    },
    "Connections": [
        {
            "ID": 26372,
            "ConnectionTypeID": 25,
            "StatusTypeID": 50,
            "LevelID": 2,
            "Amps": 16,
            "Voltage": 400,
            "PowerKW": 11,
            "CurrentTypeID": 20,
            "Quantity": 1
        },
        {
            "ID": 26373,
            "ConnectionTypeID": 25,
            "StatusTypeID": 50,
            "LevelID": 2,
            "Amps": 32,
            "Voltage": 400,
            "PowerKW": 22,
            "CurrentTypeID": 20,
            "Quantity": 1
        }
    ],
    "NumberOfPoints": 1,
    "GeneralComments": "",
    "StatusTypeID": 50,
    "DateLastStatusUpdate": "2014-08-02T01:01:00Z",
    "DataQualityLevel": 2,
    "DateCreated": "2013-04-20T04:44:00Z",
    "SubmissionStatusTypeID": 100
}