{
    "IsRecentlyVerified": false,
    "ID": 148629,
    "UUID": "24C5A146-FD03-464D-8D6A-13A30FCBCBB8",
    "DataProviderID": 1,
    "UsageTypeID": 1,
    "UsageCost": "35c/min",
    "AddressInfo": {
        "ID": 148981,
        "Title": "VÄRE Kuopion Portti HPC F696",
        "AddressLine1": "Puutarhakatu",
        "AddressLine2": "Multimäki",
        "Town": "Kuopio",
        "StateOrProvince": "Kuopio sub-region",
        "Postcode": "70300",
        "CountryID": 79,
        "Latitude": 62.89814042863108,
        "Longitude": 27.68222762371056,
        "AccessComments": "Kuopion Portti",
        "DistanceUnit": 0
    },
    "Connections": [
        {
            "ID": 206377,
            "ConnectionTypeID": 33,
            "StatusTypeID": 50,
            "LevelID": 3,
            "PowerKW": 150,
            "CurrentTypeID": 30,
            "Quantity": 2
        },
        {
            "ID": 206378,
            "ConnectionTypeID": 2,
            "StatusTypeID": 50,
            "LevelID": 3,
            "PowerKW": 62,
            "CurrentTypeID": 30
        }
    ],
    "NumberOfPoints": 2,
    "StatusTypeID": 50,
    "DateLastStatusUpdate": "2020-02-09T18:10:00Z",
    "DataQualityLevel": 1,
    "DateCreated": "2020-02-07T14:39:00Z",
    "SubmissionStatusTypeID": 200
}