{
    "IsRecentlyVerified": false,
    "ID": 7979,
    "UUID": "796F05CF-F2C5-485A-ACEE-A512E9B0EBD3",
    "DataProviderID": 15,
    "DataProvidersReference": "9095",
    "OperatorID": 1,
    "AddressInfo": {
        "ID": 7876,
        "Title": "3050 Medical Center Drive",
        "AddressLine1": "3050 Medical Center Drive",
        "Town": "Murfreesboro",
        "StateOrProvince": "TN",
        "Postcode": "37129",
        "CountryID": 2,
        "Latitude": 35.86673,
        "Longitude": -86.44916,
        "ContactTelephone1": "(615) 893-6565",
        "RelatedURL": "http://carstations.com/9095",
        "DistanceUnit": 0
    },
    "Connections": [
        {
            "ID": 5408,
            "ConnectionTypeID": 1,
            "Reference": "J1772",
            "LevelID": 2
        }
    ],
    "StatusTypeID": 0,
    "DateLastStatusUpdate": "2017-11-04T14:04:00Z",
    "DataQualityLevel": 1,
    "DateCreated": "2011-11-11T12:05:00Z",
    "SubmissionStatusTypeID": 100
}