{
    "IsRecentlyVerified": false,
    "ID": 64042,
    "UUID": "08A6FA81-F50D-4D54-ABC4-C0D0710C59DA",
    "DataProviderID": 26,
    "DataProvidersReference": "79452",
    "OperatorID": 103,
    "OperatorsReference": "Allego NLALLEGO0004862",
    "UsageCost": "0.00 jaarabonnement",
    "AddressInfo": {
        "ID": 64388,
        "Title": "Sleutelbloem 25",
        "AddressLine1": "Sleutelbloem 25",
        "Town": "Castricum",
        "Postcode": "1902 GD",
        "CountryID": 159,
        "Latitude": 52.553772,
        "Longitude": 4.67800576,
        "ContactTelephone1": "0800-3745337",
        "RelatedURL": "http://www.allego.eu/",
        "DistanceUnit": 0
    },
    "Connections": [
        {
            "ID": 81888,
            "ConnectionTypeID": 25,
            "LevelID": 2,
            "PowerKW": 11,
            "CurrentTypeID": 10
        },
        {
            "ID": 81889,
            "ConnectionTypeID": 25,
            "LevelID": 2,
            "PowerKW": 11,
            "CurrentTypeID": 10
        }
    ],
    "NumberOfPoints": 1,
    "StatusTypeID": 50,
    "DateLastStatusUpdate": "2016-06-04T02:55:00Z",
    "DataQualityLevel": 3,
    "DateCreated": "2016-03-03T12:32:00Z",
    "SubmissionStatusTypeID": 100
}