{
    "IsRecentlyVerified": false,
    "ID": 112619,
    "UUID": "7DC628A3-B025-4468-91F0-AD279F9A398D",
    "DataProviderID": 1,
    "OperatorID": 80,
    "UsageTypeID": 4,
    "AddressInfo": {
        "ID": 112965,
        "Title": "Magnago Milani | EnelX",
        "AddressLine1": "Via Don Lorenzo Milani",
        "Town": "Magnago",
        "StateOrProvince": "MI",
        "Postcode": "20020 ",
        "CountryID": 112,
        "Latitude": 45.5760887131945,
        "Longitude": 8.81068160589916,
        "ContactTelephone1": "800.069.850",
        "RelatedURL": "https://www.enelx.com/it/it/emobility",
        "DistanceUnit": 0
    },
    "Connections": [
        {
            "ID": 158460,
            "ConnectionTypeID": 25,
            "StatusTypeID": 50,
            "LevelID": 2,
            "Amps": 32,
            "Voltage": 400,
            "PowerKW": 22,
            "CurrentTypeID": 20,
            "Quantity": 1
        },
        {
            "ID": 158461,
            "ConnectionTypeID": 36,
            "StatusTypeID": 50,
            "LevelID": 2,
            "Amps": 16,
            "Voltage": 240,
            "PowerKW": 3.7,
            "CurrentTypeID": 10,
            "Quantity": 1
        }
    ],
    "NumberOfPoints": 2,
    "StatusTypeID": 50,
    "DateLastStatusUpdate": "2019-05-20T17:38:00Z",
    "DataQualityLevel": 1,
    "DateCreated": "2018-11-09T13:55:00Z",
    "SubmissionStatusTypeID": 200
}