{
    "IsRecentlyVerified": false,
    "ID": 63460,
    "UUID": "DFEAD145-26FB-484C-A1E8-AABB4E66ECDE",
    "DataProviderID": 26,
    "DataProvidersReference": "78426",
    "OperatorID": 73,
    "OperatorsReference": "EV-Box EVB-P1430427",
    "UsageCost": "0.00 jaarabonnement",
    "AddressInfo": {
        "ID": 63806,
        "Title": "Boylestraat 46",
        "AddressLine1": "Boylestraat 46",
        "Town": "Ede",
        "Postcode": "6718 XM",
        "CountryID": 159,
        "Latitude": 52.03215,
        "Longitude": 5.6014,
        "RelatedURL": "http://www.ev-box.nl",
        "DistanceUnit": 0
    },
    "Connections": [
        {
            "ID": 80936,
            "ConnectionTypeID": 25,
            "LevelID": 2,
            "PowerKW": 5,
            "CurrentTypeID": 10
        },
        {
            "ID": 80937,
            "ConnectionTypeID": 25,
            "LevelID": 2,
            "PowerKW": 5,
            "CurrentTypeID": 10
        }
    ],
    "NumberOfPoints": 1,
    "StatusTypeID": 50,
    "DateLastStatusUpdate": "2016-06-04T02:44:00Z",
    "DataQualityLevel": 3,
    "DateCreated": "2016-03-03T12:30:00Z",
    "SubmissionStatusTypeID": 100
}