{
    "IsRecentlyVerified": false,
    "ID": 113733,
    "UUID": "6F263A9F-4722-4917-B64A-0A4BB7D578DE",
    "DataProviderID": 1,
    "OperatorID": 23,
    "OperatorsReference": "46897",
    "UsageTypeID": 4,
    "AddressInfo": {
        "ID": 114079,
        "Title": "Ristorante Pizzeria Hemerkuv Statek",
        "AddressLine1": "Ouvalova 390/5",
        "Town": "Slany",
        "Postcode": "27401",
        "CountryID": 64,
        "Latitude": 50.227905,
        "Longitude": 14.089723,
        "ContactTelephone1": "+42 0577 004100",
        "DistanceUnit": 0
    },
    "Connections": [
        {
            "ID": 160303,
            "ConnectionTypeID": 30,
            "StatusTypeID": 50,
            "LevelID": 2,
            "PowerKW": 17,
            "CurrentTypeID": 20,
            "Quantity": 1
        }
    ],
    "NumberOfPoints": 1,
    "GeneralComments": "1 Tesla Connector, up to 17kW.Available for customers. Self park.",
    "StatusTypeID": 50,
    "DateLastStatusUpdate": "2019-01-02T21:26:00Z",
    "DataQualityLevel": 1,
    "DateCreated": "2019-01-02T21:26:00Z",
    "SubmissionStatusTypeID": 200
}