{
    "IsRecentlyVerified": false,
    "ID": 136402,
    "UUID": "51813A36-D4EB-42F1-89BC-5400FB15AEA5",
    "DataProviderID": 18,
    "DataProvidersReference": "13e2d1e935fde5d1e38bd68af16e1b3f",
    "OperatorID": 2244,
    "UsageTypeID": 5,
    "AddressInfo": {
        "ID": 136748,
        "Title": "Beethoven Street",
        "AddressLine1": "Beethoven Street",
        "Town": "London",
        "Postcode": "W10 4LQ",
        "CountryID": 1,
        "Latitude": 51.530986,
        "Longitude": -0.207436,
        "AccessComments": "",
        "RelatedURL": "https://www.ubitricity.com",
        "DistanceUnit": 0
    },
    "Connections": [
        {
            "ID": 190846,
            "ConnectionTypeID": 25,
            "Reference": "suby1100002373",
            "StatusTypeID": 50,
            "LevelID": 2,
            "Amps": 16,
            "Voltage": 230,
            "PowerKW": 3.7,
            "CurrentTypeID": 10
        }
    ],
    "StatusTypeID": 0,
    "DateLastStatusUpdate": "2021-04-25T05:46:00Z",
    "MetadataValues": [
        {
            "ID": 6254,
            "MetadataFieldID": 4,
            "ItemValue": "Contains public sector information licensed under the Open Government Licence v2.0. http://www.nationalarchives.gov.uk/doc/open-government-licence/version/2/"
        }
    ],
    "DataQualityLevel": 3,
    "DateCreated": "2019-12-24T05:22:00Z",
    "SubmissionStatusTypeID": 100
}