{
    "UserComments": [
        {
            "ID": 19461,
            "ChargePointID": 101610,
            "CommentTypeID": 10,
            "UserName": "ForumElettrico.it",
            "RelatedURL": "https://www.forumelettrico.it/forum/colonnina-tigros-canegrate-t2667.html",
            "DateCreated": "2018-04-23T17:14:21.657Z",
            "User": {
                "ID": 11749,
                "Username": "ForumElettrico.it"
            },
            "CheckinStatusTypeID": 0
        },
        {
            "ID": 19460,
            "ChargePointID": 101610,
            "CommentTypeID": 10,
            "UserName": "ForumElettrico.it",
            "Comment": "https://www.forumelettrico.it/forum/colonnina-tigros-canegrate-t2667.html\n",
            "DateCreated": "2018-04-23T17:14:09.023Z",
            "User": {
                "ID": 11749,
                "Username": "ForumElettrico.it"
            },
            "CheckinStatusTypeID": 140
        }
    ],
    "MediaItems": [
        {
            "ID": 15331,
            "ChargePointID": 101610,
            "ItemURL": "https://s3-ap-southeast-2.amazonaws.com/openchargemap/images/IT/OCM101610/OCM-101610.orig.2018042317143498.jpg",
            "ItemThumbnailURL": "https://s3-ap-southeast-2.amazonaws.com/openchargemap/images/IT/OCM101610/OCM-101610.thmb.2018042317143498.jpg",
            "Comment": "",
            "IsEnabled": true,
            "IsVideo": false,
            "IsFeaturedItem": false,
            "IsExternalResource": false,
            "User": {
                "ID": 11749,
                "Username": "ForumElettrico.it"
            },
            "DateCreated": "2018-04-23T17:15:00Z"
        },
        {
            "ID": 15332,
            "ChargePointID": 101610,
            "ItemURL": "https://s3-ap-southeast-2.amazonaws.com/openchargemap/images/IT/OCM101610/OCM-101610.orig.2018042317144172.jpg",
            "ItemThumbnailURL": "https://s3-ap-southeast-2.amazonaws.com/openchargemap/images/IT/OCM101610/OCM-101610.thmb.2018042317144172.jpg",
            "Comment": "",
            "IsEnabled": true,
            "IsVideo": false,
            "IsFeaturedItem": false,
            "IsExternalResource": false,
            "User": {
                "ID": 11749,
                "Username": "ForumElettrico.it"
            },
            "DateCreated": "2018-04-23T17:15:00Z"
        },
        {
            "ID": 15333,
            "ChargePointID": 101610,
            "ItemURL": "https://s3-ap-southeast-2.amazonaws.com/openchargemap/images/IT/OCM101610/OCM-101610.orig.2018042317144798.jpg",
            "ItemThumbnailURL": "https://s3-ap-southeast-2.amazonaws.com/openchargemap/images/IT/OCM101610/OCM-101610.thmb.2018042317144798.jpg",
            "Comment": "",
            "IsEnabled": true,
            "IsVideo": false,
            "IsFeaturedItem": false,
            "IsExternalResource": false,
            "User": {
                "ID": 11749,
                "Username": "ForumElettrico.it"
            },
            "DateCreated": "2018-04-23T17:15:00Z"
        },
        {
            "ID": 15334,
            "ChargePointID": 101610,
            "ItemURL": "https://s3-ap-southeast-2.amazonaws.com/openchargemap/images/IT/OCM101610/OCM-101610.orig.2018042317145465.jpg",
            "ItemThumbnailURL": "https://s3-ap-southeast-2.amazonaws.com/openchargemap/images/IT/OCM101610/OCM-101610.thmb.2018042317145465.jpg",
            "Comment": "",
            "IsEnabled": true,
            "IsVideo": false,
            "IsFeaturedItem": false,
            "IsExternalResource": false,
            "User": {
                "ID": 11749,
                "Username": "ForumElettrico.it"
            },
            "DateCreated": "2018-04-23T17:15:00Z"
        },
        {
            "ID": 15335,
            "ChargePointID": 101610,
            "ItemURL": "https://s3-ap-southeast-2.amazonaws.com/openchargemap/images/IT/OCM101610/OCM-101610.orig.2018042317150157.jpg",
            "ItemThumbnailURL": "https://s3-ap-southeast-2.amazonaws.com/openchargemap/images/IT/OCM101610/OCM-101610.thmb.2018042317150157.jpg",
            "Comment": "",
            "IsEnabled": true,
            "IsVideo": false,
            "IsFeaturedItem": false,
            "IsExternalResource": false,
            "User": {
                "ID": 11749,
                "Username": "ForumElettrico.it"
            },
            "DateCreated": "2018-04-23T17:15:00Z"
        }
    ],
    "IsRecentlyVerified": false,
    "ID": 101610,
    "UUID": "449893E8-2835-45D5-B673-1E831F128081",
    "DataProviderID": 1,
    "OperatorID": 45,
    "UsageTypeID": 1,
    "UsageCost": "free",
    "AddressInfo": {
        "ID": 101956,
        "Title": "Tigros  Canegrate ",
        "AddressLine1": "Via Alessandro Manzoni, 88",
        "Town": "Canegrate",
        "StateOrProvince": "MI",
        "Postcode": "20010",
        "CountryID": 112,
        "Latitude": 45.57568920926301,
        "Longitude": 8.925623524119146,
        "ContactTelephone1": "031550157",
        "RelatedURL": "https://www.tigros.it/p/punti-vendita/canegrate/",
        "DistanceUnit": 0
    },
    "Connections": [
        {
            "ID": 143441,
            "ConnectionTypeID": 25,
            "StatusTypeID": 50,
            "LevelID": 2,
            "CurrentTypeID": 10,
            "Quantity": 2
        }
    ],
    "NumberOfPoints": 4,
    "GeneralComments": "Accessibile soltanto durante gli orari di apertura del supermercato.",
    "StatusTypeID": 50,
    "DateLastStatusUpdate": "2018-04-23T17:15:00Z",
    "DataQualityLevel": 1,
    "DateCreated": "2018-04-02T17:35:00Z",
    "SubmissionStatusTypeID": 200
}