{
    "IsRecentlyVerified": false,
    "ID": 124518,
    "UUID": "A8BFC9E8-0C61-4C80-B88C-595D61C8252C",
    "DataProviderID": 2,
    "DataProvidersReference": "52762",
    "UsageTypeID": 1,
    "AddressInfo": {
        "ID": 124864,
        "Title": "City Administration Building - Parking Garage",
        "AddressLine1": "130 S Nevada Ave",
        "Town": "Colorado Springs",
        "StateOrProvince": "CO",
        "Postcode": "80903",
        "CountryID": 2,
        "Latitude": 38.831571,
        "Longitude": -104.822417,
        "ContactTelephone1": "719-385-5625",
        "AccessComments": "24 hours daily; pay lot",
        "RelatedURL": "",
        "DistanceUnit": 0
    },
    "Connections": [
        {
            "ID": 174628,
            "ConnectionTypeID": 1,
            "LevelID": 2,
            "Amps": 16,
            "Voltage": 230,
            "PowerKW": 3.7,
            "CurrentTypeID": 10,
            "Quantity": 2
        }
    ],
    "DateLastStatusUpdate": "2020-06-26T03:00:00Z",
    "DataQualityLevel": 3,
    "DateCreated": "2019-04-06T05:03:00Z",
    "SubmissionStatusTypeID": 100
}