{
    "IsRecentlyVerified": false,
    "ID": 17216,
    "UUID": "FBE2553F-5922-4662-8CDE-0CAB66A1E385",
    "DataProviderID": 22,
    "DataProvidersReference": "FB6A4114C5D63FC0BE8286359AFF72CE",
    "AddressInfo": {
        "ID": 17561,
        "Title": "日産プリンス山梨販売美術館通り本店",
        "AddressLine1": "山梨県甲府市富竹2-1-29",
        "CountryID": 114,
        "Latitude": 35.6600328,
        "Longitude": 138.5445236,
        "ContactTelephone1": "055-222-0272",
        "DistanceUnit": 0
    },
    "Connections": [
        {
            "ID": 17457,
            "ConnectionTypeID": 2,
            "LevelID": 2,
            "Amps": 100,
            "Voltage": 480,
            "PowerKW": 48,
            "Quantity": 1
        }
    ],
    "DateLastStatusUpdate": "2013-06-29T08:55:00Z",
    "DataQualityLevel": 2,
    "DateCreated": "2013-06-29T08:55:00Z",
    "SubmissionStatusTypeID": 200
}