{
    "IsRecentlyVerified": false,
    "ID": 98049,
    "UUID": "6974C20E-15AB-4214-878A-37E7A9BB945B",
    "DataProviderID": 1,
    "OperatorID": 23,
    "OperatorsReference": "38095",
    "UsageTypeID": 4,
    "AddressInfo": {
        "ID": 98395,
        "Title": "La Quinta Houston East Channelview",
        "AddressLine1": "16311 East Fwy",
        "Town": "Channelview",
        "StateOrProvince": "Texas",
        "Postcode": "77530",
        "CountryID": 2,
        "Latitude": 29.784542,
        "Longitude": -95.110201,
        "ContactTelephone1": "(281) 864-7457",
        "DistanceUnit": 0
    },
    "Connections": [
        {
            "ID": 138957,
            "ConnectionTypeID": 30,
            "StatusTypeID": 50,
            "LevelID": 2,
            "PowerKW": 16,
            "CurrentTypeID": 20,
            "Quantity": 3
        }
    ],
    "NumberOfPoints": 3,
    "GeneralComments": "3 Tesla Connectors, up to 16kW.Available for customers. Self park.",
    "StatusTypeID": 50,
    "DateLastStatusUpdate": "2018-01-21T17:40:00Z",
    "DataQualityLevel": 1,
    "DateCreated": "2018-01-21T17:40:00Z",
    "SubmissionStatusTypeID": 200
}