{
    "IsRecentlyVerified": false,
    "ID": 170432,
    "UUID": "5D7C4FC1-0290-416D-A4C4-5CBF5B6A633E",
    "DataProviderID": 1,
    "OperatorID": 1,
    "UsageTypeID": 5,
    "UsageCost": "£2.00/Hour",
    "AddressInfo": {
        "ID": 170791,
        "Title": "Avro Park",
        "AddressLine1": "Doncaster Sheffield Airport",
        "AddressLine2": "First Avenue",
        "Town": "Doncaster",
        "StateOrProvince": "England",
        "Postcode": "DN9 3RH",
        "CountryID": 1,
        "Latitude": 53.484316983143316,
        "Longitude": -1.0134810618005758,
        "ContactTelephone1": "01636 640504",
        "RelatedURL": "http://app.vendelectric.com",
        "DistanceUnit": 0
    },
    "Connections": [
        {
            "ID": 260024,
            "ConnectionTypeID": 25,
            "StatusTypeID": 50,
            "LevelID": 2,
            "Amps": 32,
            "Voltage": 400,
            "PowerKW": 7,
            "CurrentTypeID": 10,
            "Quantity": 2
        },
        {
            "ID": 260025,
            "ConnectionTypeID": 25,
            "StatusTypeID": 50,
            "LevelID": 2,
            "Amps": 32,
            "Voltage": 400,
            "PowerKW": 7,
            "CurrentTypeID": 10,
            "Quantity": 2
        }
    ],
    "NumberOfPoints": 1,
    "GeneralComments": "VendElectric 7kW AC chargers http://app.vendelectric.com",
    "StatusTypeID": 50,
    "DateLastStatusUpdate": "2020-11-27T04:34:00Z",
    "DataQualityLevel": 1,
    "DateCreated": "2020-11-27T04:34:00Z",
    "SubmissionStatusTypeID": 200
}