{
    "IsRecentlyVerified": false,
    "ID": 146037,
    "UUID": "0D9753E8-2F2A-4FB8-82AE-5B167F5A26D4",
    "DataProviderID": 1,
    "OperatorID": 23,
    "OperatorsReference": "52503",
    "UsageTypeID": 4,
    "AddressInfo": {
        "ID": 146389,
        "Title": "Delta Hotels By Marriott Thunder Bay",
        "AddressLine1": "2240 Sleeping Giant Pkwy",
        "Town": "Thunder Bay",
        "StateOrProvince": "Ontario",
        "Postcode": "P7A 0E7",
        "CountryID": 44,
        "Latitude": 48.432949,
        "Longitude": -89.218734,
        "ContactTelephone1": "(807) 344-0777",
        "DistanceUnit": 0
    },
    "Connections": [
        {
            "ID": 202925,
            "ConnectionTypeID": 30,
            "StatusTypeID": 50,
            "LevelID": 2,
            "PowerKW": 16,
            "CurrentTypeID": 20,
            "Quantity": 2
        }
    ],
    "NumberOfPoints": 2,
    "GeneralComments": "2 Tesla Connectors, up to 16kW.Available for customers. Please see Valet",
    "StatusTypeID": 50,
    "DateLastStatusUpdate": "2019-12-30T21:28:00Z",
    "DataQualityLevel": 1,
    "DateCreated": "2019-12-30T21:28:00Z",
    "SubmissionStatusTypeID": 200
}