{
    "IsRecentlyVerified": false,
    "ID": 33819,
    "UUID": "E0794FB6-D81B-4611-8942-4CFAD61397DD",
    "DataProviderID": 26,
    "DataProvidersReference": "47677",
    "OperatorID": 178,
    "OperatorsReference": "EVnetNL AL828",
    "UsageCost": "0.00 jaarabonnement",
    "AddressInfo": {
        "ID": 34165,
        "Title": "Lodewijk van Praetstraat 25",
        "AddressLine1": "Lodewijk van Praetstraat 25",
        "Town": "Binnenmaas",
        "Postcode": "3271 AG",
        "CountryID": 159,
        "Latitude": 51.794522,
        "Longitude": 4.486196,
        "ContactTelephone1": "0800-3522365",
        "RelatedURL": "http://www.evnet.nl",
        "DistanceUnit": 0
    },
    "Connections": [
        {
            "ID": 37330,
            "ConnectionTypeID": 25,
            "LevelID": 2,
            "PowerKW": 11,
            "CurrentTypeID": 10
        }
    ],
    "NumberOfPoints": 2,
    "StatusTypeID": 50,
    "DateLastStatusUpdate": "2016-06-04T02:40:00Z",
    "DataQualityLevel": 3,
    "DateCreated": "2015-01-09T06:04:00Z",
    "SubmissionStatusTypeID": 100
}