{
    "IsRecentlyVerified": false,
    "ID": 183802,
    "UUID": "73DF19CD-58A7-4D6D-B78C-6A113EBB291F",
    "DataProviderID": 29,
    "DataProvidersReference": "1468,20238",
    "AddressInfo": {
        "ID": 184161,
        "Title": "Margaretenweg 27",
        "AddressLine1": "Margaretenweg 27",
        "Town": "Bielefeld",
        "Postcode": "33611",
        "CountryID": 87,
        "Latitude": 52.054075,
        "Longitude": 8.546325,
        "DistanceUnit": 0
    },
    "Connections": [
        {
            "ID": 291239,
            "ConnectionTypeID": 25,
            "StatusTypeID": 50,
            "LevelID": 2,
            "PowerKW": 22,
            "CurrentTypeID": 20
        },
        {
            "ID": 291240,
            "ConnectionTypeID": 25,
            "StatusTypeID": 50,
            "LevelID": 2,
            "PowerKW": 22,
            "CurrentTypeID": 20
        },
        {
            "ID": 291241,
            "ConnectionTypeID": 25,
            "StatusTypeID": 50,
            "LevelID": 2,
            "PowerKW": 22,
            "CurrentTypeID": 20
        },
        {
            "ID": 291242,
            "ConnectionTypeID": 25,
            "StatusTypeID": 50,
            "LevelID": 2,
            "PowerKW": 22,
            "CurrentTypeID": 20
        }
    ],
    "StatusTypeID": 50,
    "DateLastStatusUpdate": "2021-07-09T03:25:00Z",
    "MetadataValues": [
        {
            "ID": 16095,
            "MetadataFieldID": 4,
            "ItemValue": "Data from the German chargepoint registry provided by Bundesnetzagentur.de under the CC-BY 4.0 license"
        }
    ],
    "DataQualityLevel": 3,
    "DateCreated": "2021-07-08T10:04:00Z",
    "SubmissionStatusTypeID": 100
}