{
    "IsRecentlyVerified": false,
    "ID": 180146,
    "UUID": "39658C6D-040E-4365-A934-E5F142B5E564",
    "DataProviderID": 29,
    "DataProvidersReference": "20236",
    "OperatorID": 103,
    "AddressInfo": {
        "ID": 180505,
        "Title": "Romy-Schneider-Str. 11a",
        "AddressLine1": "Romy-Schneider-Str. 11a",
        "Town": "Berlin",
        "Postcode": "13599",
        "CountryID": 87,
        "Latitude": 52.546022,
        "Longitude": 13.225299,
        "DistanceUnit": 0
    },
    "Connections": [
        {
            "ID": 282869,
            "ConnectionTypeID": 25,
            "StatusTypeID": 50,
            "LevelID": 2,
            "PowerKW": 11,
            "CurrentTypeID": 20
        },
        {
            "ID": 282870,
            "ConnectionTypeID": 25,
            "StatusTypeID": 50,
            "LevelID": 2,
            "PowerKW": 11,
            "CurrentTypeID": 20
        }
    ],
    "StatusTypeID": 50,
    "DateLastStatusUpdate": "2021-07-12T02:50:00Z",
    "MetadataValues": [
        {
            "ID": 12440,
            "MetadataFieldID": 4,
            "ItemValue": "Data from the German chargepoint registry provided by Bundesnetzagentur.de under the CC-BY 4.0 license"
        }
    ],
    "DataQualityLevel": 3,
    "DateCreated": "2021-07-08T10:00:00Z",
    "SubmissionStatusTypeID": 100
}