{
    "UserComments": [
        {
            "ID": 21519,
            "ChargePointID": 55128,
            "CommentTypeID": 10,
            "UserName": "ForumElettrico.it",
            "RelatedURL": "https://www.forumelettrico.it/forum/fast-evad-genova-via-perini-t5387.html",
            "DateCreated": "2019-09-16T17:47:06.687Z",
            "User": {
                "ID": 11749,
                "Username": "ForumElettrico.it"
            },
            "CheckinStatusTypeID": 10
        }
    ],
    "MediaItems": [
        {
            "ID": 19590,
            "ChargePointID": 55128,
            "ItemURL": "https://s3-ap-southeast-2.amazonaws.com/openchargemap/images/IT/OCM55128/OCM-55128.orig.2019091617471826.jpg",
            "ItemThumbnailURL": "https://s3-ap-southeast-2.amazonaws.com/openchargemap/images/IT/OCM55128/OCM-55128.thmb.2019091617471826.jpg",
            "Comment": "",
            "IsEnabled": true,
            "IsVideo": false,
            "IsFeaturedItem": false,
            "IsExternalResource": false,
            "User": {
                "ID": 11749,
                "Username": "ForumElettrico.it"
            },
            "DateCreated": "2019-09-16T17:48:00Z"
        },
        {
            "ID": 19591,
            "ChargePointID": 55128,
            "ItemURL": "https://s3-ap-southeast-2.amazonaws.com/openchargemap/images/IT/OCM55128/OCM-55128.orig.2019091617472397.jpg",
            "ItemThumbnailURL": "https://s3-ap-southeast-2.amazonaws.com/openchargemap/images/IT/OCM55128/OCM-55128.thmb.2019091617472397.jpg",
            "Comment": "",
            "IsEnabled": true,
            "IsVideo": false,
            "IsFeaturedItem": false,
            "IsExternalResource": false,
            "User": {
                "ID": 11749,
                "Username": "ForumElettrico.it"
            },
            "DateCreated": "2019-09-16T17:48:00Z"
        },
        {
            "ID": 19592,
            "ChargePointID": 55128,
            "ItemURL": "https://s3-ap-southeast-2.amazonaws.com/openchargemap/images/IT/OCM55128/OCM-55128.orig.2019091617473095.jpg",
            "ItemThumbnailURL": "https://s3-ap-southeast-2.amazonaws.com/openchargemap/images/IT/OCM55128/OCM-55128.thmb.2019091617473095.jpg",
            "Comment": "",
            "IsEnabled": true,
            "IsVideo": false,
            "IsFeaturedItem": false,
            "IsExternalResource": false,
            "User": {
                "ID": 11749,
                "Username": "ForumElettrico.it"
            },
            "DateCreated": "2019-09-16T17:48:00Z"
        },
        {
            "ID": 19593,
            "ChargePointID": 55128,
            "ItemURL": "https://s3-ap-southeast-2.amazonaws.com/openchargemap/images/IT/OCM55128/OCM-55128.orig.2019091617473682.jpg",
            "ItemThumbnailURL": "https://s3-ap-southeast-2.amazonaws.com/openchargemap/images/IT/OCM55128/OCM-55128.thmb.2019091617473682.jpg",
            "Comment": "",
            "IsEnabled": true,
            "IsVideo": false,
            "IsFeaturedItem": false,
            "IsExternalResource": false,
            "User": {
                "ID": 11749,
                "Username": "ForumElettrico.it"
            },
            "DateCreated": "2019-09-16T17:48:00Z"
        },
        {
            "ID": 19594,
            "ChargePointID": 55128,
            "ItemURL": "https://s3-ap-southeast-2.amazonaws.com/openchargemap/images/IT/OCM55128/OCM-55128.orig.2019091617474309.jpg",
            "ItemThumbnailURL": "https://s3-ap-southeast-2.amazonaws.com/openchargemap/images/IT/OCM55128/OCM-55128.thmb.2019091617474309.jpg",
            "Comment": "",
            "IsEnabled": true,
            "IsVideo": false,
            "IsFeaturedItem": false,
            "IsExternalResource": false,
            "User": {
                "ID": 11749,
                "Username": "ForumElettrico.it"
            },
            "DateCreated": "2019-09-16T17:48:00Z"
        }
    ],
    "IsRecentlyVerified": false,
    "ID": 55128,
    "UUID": "5529841F-4B0D-4BE6-8A67-30EEA3EAA2CE",
    "DataProviderID": 1,
    "OperatorID": 80,
    "UsageTypeID": 4,
    "UsageCost": "0,45€/kW - 0,50€/kW",
    "AddressInfo": {
        "ID": 55474,
        "Title": "EnelX Fast IKEA Genova",
        "AddressLine1": "Via Luigi Perini, 5",
        "AddressLine2": "Municipio VI Medio Ponente",
        "Town": "Genova",
        "StateOrProvince": "GE",
        "Postcode": "16152",
        "CountryID": 112,
        "Latitude": 44.422830370415,
        "Longitude": 8.88419094033703,
        "RelatedURL": "https://www.enelx.com/it/it/mobilita-elettrica",
        "DistanceUnit": 0
    },
    "Connections": [
        {
            "ID": 69698,
            "ConnectionTypeID": 25,
            "StatusTypeID": 50,
            "LevelID": 2,
            "Amps": 32,
            "Voltage": 400,
            "PowerKW": 22,
            "CurrentTypeID": 20,
            "Quantity": 2
        },
        {
            "ID": 69699,
            "ConnectionTypeID": 36,
            "StatusTypeID": 50,
            "LevelID": 2,
            "Amps": 16,
            "Voltage": 240,
            "PowerKW": 3.7,
            "CurrentTypeID": 10,
            "Quantity": 2
        },
        {
            "ID": 176090,
            "ConnectionTypeID": 33,
            "StatusTypeID": 50,
            "LevelID": 3,
            "Amps": 120,
            "Voltage": 500,
            "PowerKW": 50,
            "CurrentTypeID": 30,
            "Quantity": 1
        },
        {
            "ID": 176091,
            "ConnectionTypeID": 2,
            "StatusTypeID": 50,
            "LevelID": 3,
            "Amps": 120,
            "Voltage": 500,
            "PowerKW": 50,
            "CurrentTypeID": 30,
            "Quantity": 1
        },
        {
            "ID": 176092,
            "ConnectionTypeID": 1036,
            "StatusTypeID": 50,
            "LevelID": 3,
            "Amps": 64,
            "Voltage": 400,
            "PowerKW": 43,
            "CurrentTypeID": 20,
            "Quantity": 1
        }
    ],
    "NumberOfPoints": 4,
    "GeneralComments": "Accessibile solo durante gli orari di apertura dello store.",
    "StatusTypeID": 50,
    "DateLastStatusUpdate": "2019-09-16T17:48:00Z",
    "DataQualityLevel": 1,
    "DateCreated": "2015-10-16T10:37:00Z",
    "SubmissionStatusTypeID": 200
}