{
    "IsRecentlyVerified": false,
    "ID": 179588,
    "UUID": "A380ABB2-2D24-47BE-9D37-A891C19FCEFD",
    "DataProviderID": 29,
    "DataProvidersReference": "9382",
    "AddressInfo": {
        "ID": 179947,
        "Title": "Montgeronplatz",
        "AddressLine1": "Montgeronplatz",
        "Town": "Eschborn",
        "Postcode": "65760",
        "CountryID": 87,
        "Latitude": 50.159175,
        "Longitude": 8.551444,
        "DistanceUnit": 0
    },
    "Connections": [
        {
            "ID": 281604,
            "ConnectionTypeID": 25,
            "StatusTypeID": 50,
            "LevelID": 2,
            "PowerKW": 22,
            "CurrentTypeID": 20
        },
        {
            "ID": 281605,
            "ConnectionTypeID": 25,
            "StatusTypeID": 50,
            "LevelID": 2,
            "PowerKW": 22,
            "CurrentTypeID": 20
        }
    ],
    "StatusTypeID": 50,
    "DateLastStatusUpdate": "2021-07-12T02:44:00Z",
    "MetadataValues": [
        {
            "ID": 11882,
            "MetadataFieldID": 4,
            "ItemValue": "Data from the German chargepoint registry provided by Bundesnetzagentur.de under the CC-BY 4.0 license"
        }
    ],
    "DataQualityLevel": 3,
    "DateCreated": "2021-07-08T09:59:00Z",
    "SubmissionStatusTypeID": 100
}