{
    "IsRecentlyVerified": false,
    "ID": 5460,
    "UUID": "EA9F316D-C742-4218-A58B-D2C16060C8E5",
    "DataProviderID": 1,
    "OperatorID": 3,
    "OperatorsReference": "PP-5112267",
    "UsageTypeID": 6,
    "UsageCost": "1",
    "AddressInfo": {
        "ID": 5398,
        "Title": "Ford Motor Company",
        "AddressLine1": "Eagle Way",
        "Town": "Brentwood",
        "StateOrProvince": "Essex",
        "Postcode": "CM13 3BW",
        "CountryID": 1,
        "Latitude": 51.599254,
        "Longitude": 0.298927,
        "ContactTelephone1": "01277 253474",
        "AccessComments": "Located in pool Car Park. \r\nPrivately Owned, Phone Ahead",
        "DistanceUnit": 0
    },
    "Connections": [
        {
            "ID": 105500,
            "ConnectionTypeID": 25,
            "StatusTypeID": 50,
            "LevelID": 2,
            "Amps": 32,
            "Voltage": 230,
            "PowerKW": 7,
            "CurrentTypeID": 10,
            "Quantity": 2
        }
    ],
    "NumberOfPoints": 4,
    "GeneralComments": "Employee workplace charging only",
    "StatusTypeID": 0,
    "DateLastStatusUpdate": "2019-05-02T19:38:00Z",
    "DataQualityLevel": 1,
    "DateCreated": "2011-08-29T11:42:00Z",
    "SubmissionStatusTypeID": 200
}