{
    "IsRecentlyVerified": false,
    "ID": 182293,
    "UUID": "45873DFB-D574-453A-BDD3-6BB058EF468B",
    "DataProviderID": 29,
    "DataProvidersReference": "1627",
    "OperatorID": 86,
    "AddressInfo": {
        "ID": 182652,
        "Title": "Kirchweg 14",
        "AddressLine1": "Kirchweg 14",
        "Town": "Soest",
        "Postcode": "59494",
        "CountryID": 87,
        "Latitude": 51.547166,
        "Longitude": 8.133465,
        "DistanceUnit": 0
    },
    "Connections": [
        {
            "ID": 287854,
            "ConnectionTypeID": 33,
            "StatusTypeID": 50,
            "LevelID": 3,
            "PowerKW": 300,
            "CurrentTypeID": 30
        },
        {
            "ID": 287855,
            "ConnectionTypeID": 33,
            "StatusTypeID": 50,
            "LevelID": 3,
            "PowerKW": 300,
            "CurrentTypeID": 30
        },
        {
            "ID": 299633,
            "ConnectionTypeID": 2,
            "StatusTypeID": 50,
            "LevelID": 3,
            "PowerKW": 300,
            "CurrentTypeID": 30
        }
    ],
    "StatusTypeID": 50,
    "DateLastStatusUpdate": "2021-07-12T02:48:00Z",
    "MetadataValues": [
        {
            "ID": 14587,
            "MetadataFieldID": 4,
            "ItemValue": "Data from the German chargepoint registry provided by Bundesnetzagentur.de under the CC-BY 4.0 license"
        }
    ],
    "DataQualityLevel": 3,
    "DateCreated": "2021-07-08T10:02:00Z",
    "SubmissionStatusTypeID": 100
}