{
    "UserComments": [
        {
            "ID": 21292,
            "ChargePointID": 110718,
            "CommentTypeID": 10,
            "UserName": "Graham",
            "Comment": "25kw.  not 40kw",
            "Rating": 3,
            "DateCreated": "2019-08-03T22:32:42.55Z",
            "User": {
                "ID": 21800,
                "Username": "Graham"
            }
        }
    ],
    "IsRecentlyVerified": false,
    "ID": 110718,
    "UUID": "7E91689B-B2B1-41DF-96D8-61BEB0928158",
    "DataProviderID": 2,
    "DataProvidersReference": "88072",
    "UsageTypeID": 5,
    "AddressInfo": {
        "ID": 111064,
        "Title": "Scotiabank",
        "AddressLine1": "541 James St",
        "Town": "Wallaceburg",
        "StateOrProvince": "ON",
        "Postcode": "N8A 2P1",
        "CountryID": 44,
        "Latitude": 42.5936,
        "Longitude": -82.384908,
        "ContactTelephone1": "519-627-2268",
        "AccessComments": "24 hours daily\r\nPublic - Credit card at all times",
        "RelatedURL": "",
        "DistanceUnit": 0
    },
    "Connections": [
        {
            "ID": 155997,
            "ConnectionTypeID": 2,
            "LevelID": 3,
            "Amps": 100,
            "Voltage": 400,
            "PowerKW": 40,
            "CurrentTypeID": 30,
            "Quantity": 1
        },
        {
            "ID": 155998,
            "ConnectionTypeID": 32,
            "LevelID": 3,
            "Amps": 100,
            "Voltage": 400,
            "PowerKW": 40,
            "CurrentTypeID": 30,
            "Quantity": 1
        }
    ],
    "StatusTypeID": 0,
    "DateLastStatusUpdate": "2020-06-26T03:06:00Z",
    "DataQualityLevel": 3,
    "DateCreated": "2018-10-18T23:36:00Z",
    "SubmissionStatusTypeID": 100
}