{
    "IsRecentlyVerified": false,
    "ID": 123677,
    "UUID": "F1058CA0-FCDD-47AC-A11D-7FFFCC8C3155",
    "DataProviderID": 2,
    "DataProvidersReference": "70542",
    "OperatorID": 5,
    "UsageTypeID": 1,
    "AddressInfo": {
        "ID": 124023,
        "Title": "RELIABLE BMW",
        "AddressLine1": "3551-3621 State Hwy D",
        "Town": "Springfield",
        "StateOrProvince": "MO",
        "Postcode": "65809",
        "CountryID": 2,
        "Latitude": 37.1809135,
        "Longitude": -93.2219049,
        "ContactTelephone1": "888-758-4389",
        "AccessComments": "24 hours daily",
        "RelatedURL": "http://www.chargepoint.com/",
        "DistanceUnit": 0
    },
    "Connections": [
        {
            "ID": 173696,
            "ConnectionTypeID": 1,
            "LevelID": 2,
            "Amps": 16,
            "Voltage": 230,
            "PowerKW": 3,
            "CurrentTypeID": 10,
            "Quantity": 2
        }
    ],
    "DateLastStatusUpdate": "2019-12-24T09:13:00Z",
    "DataQualityLevel": 3,
    "DateCreated": "2019-04-06T05:03:00Z",
    "SubmissionStatusTypeID": 100
}