{
    "IsRecentlyVerified": false,
    "ID": 94718,
    "UUID": "F9808534-1BBD-4CC9-AA5B-64471137B06E",
    "DataProviderID": 1,
    "OperatorID": 69,
    "UsageTypeID": 4,
    "AddressInfo": {
        "ID": 95064,
        "Title": "Rathaus",
        "AddressLine1": "Willy-Brandt-Platz 1",
        "Town": "Kaiserslautern",
        "StateOrProvince": "Kaiserslautern",
        "Postcode": "67657",
        "CountryID": 87,
        "Latitude": 49.44661825236555,
        "Longitude": 7.768775011253424,
        "AccessComments": "Vor dem Rathausgebäude auf den beiden vordersten Parkplätzen. Einkaufszentrum \"K\" ist nebenan.",
        "RelatedURL": "https://www.swk-kl.de/",
        "DistanceUnit": 0
    },
    "Connections": [
        {
            "ID": 133887,
            "ConnectionTypeID": 25,
            "StatusTypeID": 50,
            "LevelID": 2,
            "Amps": 32,
            "Voltage": 400,
            "PowerKW": 22,
            "CurrentTypeID": 20,
            "Quantity": 2
        }
    ],
    "NumberOfPoints": 2,
    "StatusTypeID": 50,
    "DateLastStatusUpdate": "2017-10-23T11:18:00Z",
    "DataQualityLevel": 1,
    "DateCreated": "2017-10-23T11:18:00Z",
    "SubmissionStatusTypeID": 200
}