{
    "IsRecentlyVerified": false,
    "ID": 65334,
    "UUID": "B1FCA691-4F5C-4DE2-A75F-D1DC919C25E9",
    "DataProviderID": 26,
    "DataProvidersReference": "86754",
    "OperatorID": 157,
    "OperatorsReference": "NewMotion 02014771",
    "UsageCost": "0.00 jaarabonnement",
    "AddressInfo": {
        "ID": 65680,
        "Title": "Lebuhraya Damansara-Puchong",
        "AddressLine1": "Lebuhraya Damansara-Puchong",
        "Town": "Petaling Jaya",
        "Postcode": "47301",
        "CountryID": 137,
        "Latitude": 3.10508084393876,
        "Longitude": 101.596059009926,
        "ContactTelephone1": "088 0109500",
        "RelatedURL": "http://thenewmotion.nl/",
        "DistanceUnit": 0
    },
    "Connections": [
        {
            "ID": 90014,
            "ConnectionTypeID": 25,
            "LevelID": 2,
            "PowerKW": 3.7,
            "CurrentTypeID": 10
        },
        {
            "ID": 90015,
            "ConnectionTypeID": 25,
            "LevelID": 2,
            "PowerKW": 37,
            "CurrentTypeID": 10
        }
    ],
    "NumberOfPoints": 1,
    "StatusTypeID": 50,
    "DateLastStatusUpdate": "2016-06-04T02:37:00Z",
    "DataQualityLevel": 3,
    "DateCreated": "2016-04-27T09:41:00Z",
    "SubmissionStatusTypeID": 100
}