{
    "IsRecentlyVerified": false,
    "ID": 50589,
    "UUID": "85493281-D174-4744-9E89-479161E5A0FB",
    "DataProviderID": 26,
    "DataProvidersReference": "66425",
    "OperatorID": 73,
    "OperatorsReference": "EV-Box EVB-P1419046",
    "UsageCost": "0.00 jaarabonnement",
    "AddressInfo": {
        "ID": 50935,
        "Title": "Ninnesweg 52",
        "AddressLine1": "Ninnesweg 52",
        "Town": "Peel en Maas",
        "Postcode": "5981 PC",
        "CountryID": 159,
        "Latitude": 51.33571,
        "Longitude": 5.97533,
        "RelatedURL": "http://www.ev-box.nl",
        "DistanceUnit": 0
    },
    "Connections": [
        {
            "ID": 62357,
            "ConnectionTypeID": 25,
            "LevelID": 2,
            "PowerKW": 11,
            "CurrentTypeID": 10
        }
    ],
    "NumberOfPoints": 1,
    "StatusTypeID": 50,
    "DateLastStatusUpdate": "2016-06-04T02:38:00Z",
    "DataQualityLevel": 3,
    "DateCreated": "2015-07-22T09:53:00Z",
    "SubmissionStatusTypeID": 100
}