{
    "IsRecentlyVerified": false,
    "ID": 181507,
    "UUID": "E9AD61CE-6A99-455C-BE50-DFDE3B807042",
    "DataProviderID": 29,
    "DataProvidersReference": "11913",
    "AddressInfo": {
        "ID": 181866,
        "Title": "Am Schwindgraben 1",
        "AddressLine1": "Am Schwindgraben 1",
        "Town": "Obertraubling",
        "Postcode": "93083",
        "CountryID": 87,
        "Latitude": 48.971572,
        "Longitude": 12.173522,
        "DistanceUnit": 0
    },
    "Connections": [
        {
            "ID": 285916,
            "ConnectionTypeID": 33,
            "StatusTypeID": 50,
            "LevelID": 3,
            "PowerKW": 60,
            "CurrentTypeID": 30
        },
        {
            "ID": 285917,
            "ConnectionTypeID": 2,
            "StatusTypeID": 50,
            "LevelID": 3,
            "PowerKW": 60,
            "CurrentTypeID": 30
        },
        {
            "ID": 296465,
            "ConnectionTypeID": 1036,
            "StatusTypeID": 50,
            "LevelID": 3,
            "PowerKW": 43,
            "CurrentTypeID": 30
        },
        {
            "ID": 296466,
            "ConnectionTypeID": 2,
            "StatusTypeID": 50,
            "LevelID": 3,
            "PowerKW": 43,
            "CurrentTypeID": 30
        },
        {
            "ID": 296467,
            "ConnectionTypeID": 25,
            "StatusTypeID": 50,
            "LevelID": 2,
            "PowerKW": 22,
            "CurrentTypeID": 20
        }
    ],
    "StatusTypeID": 50,
    "DateLastStatusUpdate": "2021-07-12T02:42:00Z",
    "MetadataValues": [
        {
            "ID": 13801,
            "MetadataFieldID": 4,
            "ItemValue": "Data from the German chargepoint registry provided by Bundesnetzagentur.de under the CC-BY 4.0 license"
        }
    ],
    "DataQualityLevel": 3,
    "DateCreated": "2021-07-08T10:01:00Z",
    "SubmissionStatusTypeID": 100
}