{
    "IsRecentlyVerified": false,
    "ID": 157976,
    "UUID": "98825493-3351-47E1-BC64-68B737F9DBC8",
    "DataProviderID": 1,
    "OperatorID": 32,
    "UsageTypeID": 4,
    "UsageCost": "£0.25/kWh; other tariffs available",
    "AddressInfo": {
        "ID": 158330,
        "Title": "Nikon Optical Limited",
        "AddressLine1": "Blacklands",
        "Town": "Milton Keyenes",
        "Postcode": "MK14 5BU",
        "CountryID": 1,
        "Latitude": 52.077702,
        "Longitude": -0.7463,
        "DistanceUnit": 0
    },
    "Connections": [
        {
            "ID": 227701,
            "ConnectionTypeID": 25,
            "Reference": "1",
            "StatusTypeID": 50,
            "LevelID": 2,
            "Amps": 32,
            "Voltage": 230,
            "PowerKW": 7,
            "CurrentTypeID": 10,
            "Quantity": 2
        }
    ],
    "NumberOfPoints": 2,
    "StatusTypeID": 50,
    "DateLastStatusUpdate": "2021-04-11T19:46:00Z",
    "MetadataValues": [
        {
            "ID": 7509,
            "MetadataFieldID": 4,
            "ItemValue": "Contains public sector information licensed under the Open Government Licence v2.0. http://www.nationalarchives.gov.uk/doc/open-government-licence/version/2/"
        }
    ],
    "DataQualityLevel": 3,
    "DateCreated": "2020-06-25T10:00:00Z",
    "SubmissionStatusTypeID": 200
}