{
    "IsRecentlyVerified": false,
    "ID": 141282,
    "UUID": "1F82225A-593B-43A7-B5F9-1D4788FF62FD",
    "DataProviderID": 2,
    "DataProvidersReference": "93521",
    "OperatorID": 15,
    "UsageTypeID": 4,
    "AddressInfo": {
        "ID": 141634,
        "Title": "Commerce Bank",
        "AddressLine1": "2913 Highway K",
        "Town": "O Fallon",
        "StateOrProvince": "MO",
        "Postcode": "63368",
        "CountryID": 2,
        "Latitude": 38.75955,
        "Longitude": -90.700665,
        "ContactTelephone1": "877-455-3833",
        "AccessComments": "24 hours daily\r\nPublic - Card key at all times",
        "RelatedURL": "https://www.evgo.com/",
        "DistanceUnit": 0
    },
    "Connections": [
        {
            "ID": 197175,
            "ConnectionTypeID": 2,
            "LevelID": 3,
            "Amps": 100,
            "Voltage": 400,
            "PowerKW": 40,
            "CurrentTypeID": 30,
            "Quantity": 1
        },
        {
            "ID": 197176,
            "ConnectionTypeID": 32,
            "LevelID": 3,
            "Amps": 100,
            "Voltage": 400,
            "PowerKW": 40,
            "CurrentTypeID": 30,
            "Quantity": 1
        }
    ],
    "StatusTypeID": 50,
    "DateLastStatusUpdate": "2020-06-26T03:00:00Z",
    "DataQualityLevel": 3,
    "DateCreated": "2019-12-24T09:15:00Z",
    "SubmissionStatusTypeID": 100
}