{
    "IsRecentlyVerified": false,
    "ID": 96122,
    "UUID": "29D9F785-1C1E-4090-8A86-BCB2B3A9A5E7",
    "DataProviderID": 1,
    "OperatorID": 1,
    "UsageTypeID": 4,
    "AddressInfo": {
        "ID": 96468,
        "Title": "Autohaus Scherhag (Hyundai)",
        "AddressLine1": "Schlachthofstraße 66",
        "Town": "Koblenz",
        "StateOrProvince": "Koblenz",
        "Postcode": "56073",
        "CountryID": 87,
        "Latitude": 50.363226686639784,
        "Longitude": 7.574247688221711,
        "AccessComments": "Durchgehend nutzbare Ladesäule in der Zufahrt zum Autohaus.",
        "RelatedURL": "http://evm.de/",
        "DistanceUnit": 0
    },
    "Connections": [
        {
            "ID": 136195,
            "ConnectionTypeID": 25,
            "StatusTypeID": 50,
            "LevelID": 2,
            "Amps": 32,
            "Voltage": 400,
            "PowerKW": 22,
            "CurrentTypeID": 20,
            "Quantity": 2
        }
    ],
    "NumberOfPoints": 2,
    "StatusTypeID": 50,
    "DateLastStatusUpdate": "2017-12-11T07:33:00Z",
    "DataQualityLevel": 1,
    "DateCreated": "2017-12-11T07:33:00Z",
    "SubmissionStatusTypeID": 200
}