{
    "IsRecentlyVerified": false,
    "ID": 186969,
    "UUID": "4ECCFC31-0A6A-4840-96C4-E4B263B0CF33",
    "DataProviderID": 29,
    "DataProvidersReference": "834",
    "OperatorID": 103,
    "AddressInfo": {
        "ID": 187328,
        "Title": "Hallandstr. 59",
        "AddressLine1": "Hallandstr. 59",
        "Town": "Berlin",
        "Postcode": "13189",
        "CountryID": 87,
        "Latitude": 52.55747,
        "Longitude": 13.421816,
        "DistanceUnit": 0
    },
    "Connections": [
        {
            "ID": 300815,
            "ConnectionTypeID": 25,
            "StatusTypeID": 50,
            "LevelID": 2,
            "PowerKW": 3.7,
            "CurrentTypeID": 10
        }
    ],
    "StatusTypeID": 50,
    "DateLastStatusUpdate": "2021-07-12T02:50:00Z",
    "MetadataValues": [
        {
            "ID": 19209,
            "MetadataFieldID": 4,
            "ItemValue": "Data from the German chargepoint registry provided by Bundesnetzagentur.de under the CC-BY 4.0 license"
        }
    ],
    "DataQualityLevel": 3,
    "DateCreated": "2021-07-12T02:50:00Z",
    "SubmissionStatusTypeID": 100
}