{
    "IsRecentlyVerified": false,
    "ID": 50657,
    "UUID": "A82E78B6-CAB9-49C5-BB01-32E1E2C91C4C",
    "DataProviderID": 26,
    "DataProvidersReference": "62331",
    "OperatorID": 157,
    "OperatorsReference": "NewMotion ICUCOMPACT002355",
    "UsageCost": "0.00 jaarabonnement",
    "AddressInfo": {
        "ID": 51003,
        "Title": "Pettelaarpark",
        "AddressLine1": "Pettelaarpark",
        "Town": "'s-Hertogenbosch",
        "Postcode": "5216 PV",
        "CountryID": 159,
        "Latitude": 51.677003,
        "Longitude": 5.33246410000004,
        "ContactTelephone1": "088 0109500",
        "RelatedURL": "http://thenewmotion.nl/",
        "DistanceUnit": 0
    },
    "Connections": [
        {
            "ID": 62440,
            "ConnectionTypeID": 25,
            "LevelID": 2,
            "PowerKW": 11,
            "CurrentTypeID": 10
        }
    ],
    "NumberOfPoints": 1,
    "StatusTypeID": 50,
    "DateLastStatusUpdate": "2016-06-04T02:40:00Z",
    "DataQualityLevel": 3,
    "DateCreated": "2015-07-22T09:53:00Z",
    "SubmissionStatusTypeID": 100
}