{
    "UserComments": [
        {
            "ID": 14085,
            "ChargePointID": 32481,
            "CommentTypeID": 10,
            "UserName": "Erna_Schleck",
            "Comment": "Mit zwei Säulen gut ausgestattet, in der Parallelstraße (Einbahnstraße zurück gehen, nach 100m rechts herunter) sind Geschäfte wie Bäcker, Drogieriemarkt und Eiscafe.",
            "Rating": 5,
            "DateCreated": "2016-08-16T11:45:13.45Z",
            "User": {
                "ID": 4573,
                "Username": "Erna_Schleck"
            },
            "CheckinStatusTypeID": 10
        }
    ],
    "IsRecentlyVerified": false,
    "ID": 32481,
    "UUID": "FC54AA31-EE97-432C-8738-39315C591EF9",
    "DataProviderID": 1,
    "OperatorID": 105,
    "OperatorsReference": "Essent EM-DE-05374052-01-00002",
    "UsageTypeID": 4,
    "UsageCost": "",
    "AddressInfo": {
        "ID": 32827,
        "Title": "Hochstrasse 7",
        "AddressLine1": "Hochstrasse 7",
        "AddressLine2": "",
        "Town": "Wipperfürth",
        "StateOrProvince": "",
        "Postcode": "51688",
        "CountryID": 87,
        "Latitude": 51.11666356961443,
        "Longitude": 7.397650480270386,
        "ContactTelephone1": "",
        "ContactTelephone2": "",
        "ContactEmail": "",
        "AccessComments": "2 reservierte Parkplätze rechts in Fahrtrichtung der Einbahnstraße. Gegenüber auf dem Hof ist noch eine ohne Ladekarte freischaltbare Säule der Verwaltung.",
        "RelatedURL": "",
        "DistanceUnit": 0
    },
    "Connections": [
        {
            "ID": 35992,
            "ConnectionTypeID": 25,
            "StatusTypeID": 50,
            "LevelID": 2,
            "Amps": 32,
            "Voltage": 400,
            "PowerKW": 22,
            "CurrentTypeID": 20,
            "Quantity": 2
        },
        {
            "ID": 46390,
            "ConnectionTypeID": 25,
            "StatusTypeID": 50,
            "LevelID": 2,
            "Amps": 32,
            "Voltage": 400,
            "PowerKW": 22,
            "CurrentTypeID": 20,
            "Quantity": 1
        }
    ],
    "NumberOfPoints": 3,
    "GeneralComments": "",
    "StatusTypeID": 50,
    "DateLastStatusUpdate": "2016-08-16T11:45:00Z",
    "DataQualityLevel": 3,
    "DateCreated": "2015-01-09T06:03:00Z",
    "SubmissionStatusTypeID": 200
}