{
    "IsRecentlyVerified": false,
    "ID": 177183,
    "UUID": "825DE526-10AB-4C97-A6CC-4714F0B1A2A8",
    "DataProviderID": 29,
    "DataProvidersReference": "2168",
    "AddressInfo": {
        "ID": 177542,
        "Title": "Rathausstraße 9",
        "AddressLine1": "Rathausstraße 9",
        "Town": "Bad Pyrmont",
        "Postcode": "31812",
        "CountryID": 87,
        "Latitude": 51.98721515,
        "Longitude": 9.25879639,
        "DistanceUnit": 0
    },
    "Connections": [
        {
            "ID": 276025,
            "ConnectionTypeID": 25,
            "StatusTypeID": 50,
            "LevelID": 2,
            "PowerKW": 22,
            "CurrentTypeID": 20
        },
        {
            "ID": 276026,
            "ConnectionTypeID": 25,
            "StatusTypeID": 50,
            "LevelID": 2,
            "PowerKW": 22,
            "CurrentTypeID": 20
        }
    ],
    "StatusTypeID": 0,
    "DateLastStatusUpdate": "2021-07-12T02:48:00Z",
    "MetadataValues": [
        {
            "ID": 9477,
            "MetadataFieldID": 4,
            "ItemValue": "Data from the German chargepoint registry provided by Bundesnetzagentur.de under the CC-BY 4.0 license"
        }
    ],
    "DataQualityLevel": 3,
    "DateCreated": "2021-07-08T09:48:00Z",
    "SubmissionStatusTypeID": 100
}