{
    "IsRecentlyVerified": false,
    "ID": 129614,
    "UUID": "87E34913-1F91-44C1-88B8-656E2886B56C",
    "DataProviderID": 2,
    "DataProvidersReference": "122061",
    "UsageTypeID": 2,
    "AddressInfo": {
        "ID": 129960,
        "Title": "Naval Facilities Engineering Command - San Diego - Building 77",
        "AddressLine1": "2525 Callagan Hwy",
        "Town": "San Diego",
        "StateOrProvince": "CA",
        "Postcode": "92136",
        "CountryID": 2,
        "Latitude": 32.6813,
        "Longitude": -117.1256,
        "ContactTelephone1": "",
        "AccessComments": "Fleet use only",
        "RelatedURL": "",
        "DistanceUnit": 0
    },
    "Connections": [
        {
            "ID": 181378,
            "ConnectionTypeID": 1,
            "LevelID": 2,
            "Amps": 16,
            "Voltage": 230,
            "PowerKW": 3.7,
            "CurrentTypeID": 10,
            "Quantity": 2
        }
    ],
    "DateLastStatusUpdate": "2020-06-26T02:55:00Z",
    "DataQualityLevel": 3,
    "DateCreated": "2019-07-21T11:43:00Z",
    "SubmissionStatusTypeID": 100
}