{
    "IsRecentlyVerified": false,
    "ID": 99439,
    "UUID": "540886CF-B4E0-42B0-9F44-C0AA20ED440E",
    "DataProviderID": 1,
    "OperatorID": 23,
    "OperatorsReference": "40037",
    "UsageTypeID": 4,
    "AddressInfo": {
        "ID": 99785,
        "Title": "The Red Lion",
        "AddressLine1": "81 Ramsbottom Road",
        "Town": "Hawkshaw",
        "StateOrProvince": "Bury",
        "Postcode": "BL8 4JS",
        "CountryID": 1,
        "Latitude": 53.631076,
        "Longitude": -2.370914,
        "ContactTelephone1": "+44 120 485 6600",
        "DistanceUnit": 0
    },
    "Connections": [
        {
            "ID": 140528,
            "ConnectionTypeID": 30,
            "StatusTypeID": 50,
            "LevelID": 2,
            "Amps": 32,
            "Voltage": 400,
            "PowerKW": 22,
            "CurrentTypeID": 20,
            "Quantity": 2
        }
    ],
    "NumberOfPoints": 2,
    "GeneralComments": "2 Tesla Connectors, up to 22kW.Available for customers. Please call ahead.",
    "StatusTypeID": 50,
    "DateLastStatusUpdate": "2018-10-03T22:32:00Z",
    "DataQualityLevel": 1,
    "DateCreated": "2018-01-26T06:49:00Z",
    "SubmissionStatusTypeID": 200
}