{
    "IsRecentlyVerified": false,
    "ID": 182782,
    "UUID": "77685363-62BD-4F0E-A4A4-F762B4B64FA7",
    "DataProviderID": 29,
    "DataProvidersReference": "3973",
    "AddressInfo": {
        "ID": 183141,
        "Title": "Markt 2",
        "AddressLine1": "Markt 2",
        "Town": "Kamenz",
        "Postcode": "01917",
        "CountryID": 87,
        "Latitude": 51.269848,
        "Longitude": 14.095198,
        "DistanceUnit": 0
    },
    "Connections": [
        {
            "ID": 288939,
            "ConnectionTypeID": 25,
            "StatusTypeID": 50,
            "LevelID": 2,
            "PowerKW": 22,
            "CurrentTypeID": 20
        },
        {
            "ID": 288940,
            "ConnectionTypeID": 25,
            "StatusTypeID": 50,
            "LevelID": 2,
            "PowerKW": 22,
            "CurrentTypeID": 20
        }
    ],
    "StatusTypeID": 50,
    "DateLastStatusUpdate": "2021-07-12T02:47:00Z",
    "MetadataValues": [
        {
            "ID": 15075,
            "MetadataFieldID": 4,
            "ItemValue": "Data from the German chargepoint registry provided by Bundesnetzagentur.de under the CC-BY 4.0 license"
        }
    ],
    "DataQualityLevel": 3,
    "DateCreated": "2021-07-08T10:03:00Z",
    "SubmissionStatusTypeID": 100
}