{
    "IsRecentlyVerified": false,
    "ID": 90030,
    "UUID": "E177FA40-B070-405C-90A6-3861481AB0B0",
    "DataProviderID": 1,
    "OperatorID": 45,
    "UsageTypeID": 1,
    "AddressInfo": {
        "ID": 90376,
        "Title": "Evangelisches Krankenhaus",
        "AddressLine1": "Wiescherstraße 24",
        "Town": "Herne",
        "StateOrProvince": "Herne",
        "Postcode": "44623",
        "CountryID": 87,
        "Latitude": 51.53435589999999,
        "Longitude": 7.23063460000003,
        "AccessComments": "24/7 open",
        "DistanceUnit": 0
    },
    "Connections": [
        {
            "ID": 127627,
            "ConnectionTypeID": 25,
            "StatusTypeID": 50,
            "LevelID": 2,
            "Amps": 32,
            "Voltage": 400,
            "PowerKW": 22,
            "CurrentTypeID": 20,
            "Quantity": 2
        }
    ],
    "NumberOfPoints": 2,
    "StatusTypeID": 50,
    "DateLastStatusUpdate": "2017-07-04T11:28:00Z",
    "DataQualityLevel": 1,
    "DateCreated": "2017-07-04T11:28:00Z",
    "SubmissionStatusTypeID": 200
}