{
    "IsRecentlyVerified": false,
    "ID": 173829,
    "UUID": "5DAC6DBA-A15E-4223-B12A-58D16A2D411D",
    "DataProviderID": 19,
    "DataProvidersReference": "6950",
    "AddressInfo": {
        "ID": 174188,
        "Title": "Sævarhöfði (BU+0026L)",
        "AddressLine1": "Sævarhöfða 2",
        "Town": "Reykjavík",
        "StateOrProvince": "Höfuðborgarsvæði",
        "Postcode": "110",
        "CountryID": 105,
        "Latitude": 64.12542,
        "Longitude": -21.838593,
        "AccessComments": "",
        "DistanceUnit": 0
    },
    "Connections": [
        {
            "ID": 267306,
            "ConnectionTypeID": 2,
            "Reference": "1",
            "LevelID": 3,
            "Amps": 100,
            "Voltage": 500,
            "PowerKW": 50,
            "CurrentTypeID": 30,
            "Comments": "Mode 4"
        },
        {
            "ID": 267307,
            "ConnectionTypeID": 33,
            "Reference": "2",
            "LevelID": 3,
            "Amps": 100,
            "Voltage": 500,
            "PowerKW": 50,
            "CurrentTypeID": 30,
            "Comments": "Mode 4"
        },
        {
            "ID": 267308,
            "ConnectionTypeID": 25,
            "Reference": "3",
            "LevelID": 3,
            "Amps": 32,
            "Voltage": 400,
            "PowerKW": 22,
            "CurrentTypeID": 30,
            "Comments": "Mode 3"
        }
    ],
    "NumberOfPoints": 3,
    "StatusTypeID": 0,
    "DateLastStatusUpdate": "2021-03-04T05:39:00Z",
    "DataQualityLevel": 2,
    "DateCreated": "2021-03-04T05:39:00Z",
    "SubmissionStatusTypeID": 100
}