{
    "IsRecentlyVerified": false,
    "ID": 143703,
    "UUID": "2A1F7553-BE0C-45FA-A7F2-86F122F858D8",
    "DataProviderID": 2,
    "DataProvidersReference": "145202",
    "OperatorID": 5,
    "UsageTypeID": 1,
    "AddressInfo": {
        "ID": 144055,
        "Title": "PARKER MITS",
        "AddressLine1": "9 ON-9",
        "Town": "Caledon",
        "StateOrProvince": "ON",
        "Postcode": "L7K 0G7",
        "CountryID": 44,
        "Latitude": 43.926594,
        "Longitude": -80.06159,
        "ContactTelephone1": "888-758-4389",
        "AccessComments": "24 hours daily",
        "RelatedURL": "http://www.chargepoint.com/",
        "DistanceUnit": 0
    },
    "Connections": [
        {
            "ID": 200088,
            "ConnectionTypeID": 1,
            "LevelID": 2,
            "Amps": 16,
            "Voltage": 230,
            "PowerKW": 3.7,
            "CurrentTypeID": 10,
            "Quantity": 1
        }
    ],
    "StatusTypeID": 50,
    "DateLastStatusUpdate": "2020-06-26T03:07:00Z",
    "DataQualityLevel": 3,
    "DateCreated": "2019-12-24T09:22:00Z",
    "SubmissionStatusTypeID": 100
}