{
    "IsRecentlyVerified": false,
    "ID": 173623,
    "UUID": "822840D1-C910-4AC0-A4EB-97034B5618EE",
    "DataProviderID": 18,
    "DataProvidersReference": "0b78ca7d696a4dff9aa4ae9d1b21e362",
    "OperatorID": 2244,
    "UsageTypeID": 5,
    "AddressInfo": {
        "ID": 173982,
        "Title": "null",
        "AddressLine1": "null",
        "Town": "London",
        "Postcode": "E4 6JJ",
        "CountryID": 1,
        "Latitude": 51.621952,
        "Longitude": 0.007284,
        "AccessComments": "",
        "RelatedURL": "https://www.ubitricity.com",
        "DistanceUnit": 0
    },
    "Connections": [
        {
            "ID": 266714,
            "ConnectionTypeID": 25,
            "Reference": "suby1100001334",
            "StatusTypeID": 50,
            "LevelID": 2,
            "Amps": 16,
            "Voltage": 230,
            "PowerKW": 3.7,
            "CurrentTypeID": 10
        }
    ],
    "StatusTypeID": 0,
    "DateLastStatusUpdate": "2021-04-25T05:46:00Z",
    "MetadataValues": [
        {
            "ID": 8545,
            "MetadataFieldID": 4,
            "ItemValue": "Contains public sector information licensed under the Open Government Licence v2.0. http://www.nationalarchives.gov.uk/doc/open-government-licence/version/2/"
        }
    ],
    "DataQualityLevel": 3,
    "DateCreated": "2021-03-03T11:25:00Z",
    "SubmissionStatusTypeID": 100
}