{
    "UserComments": [
        {
            "ID": 24561,
            "ChargePointID": 77235,
            "CommentTypeID": 10,
            "UserName": "Redkona",
            "Rating": 5,
            "DateCreated": "2021-07-04T16:16:17.82Z",
            "User": {
                "ID": 30536,
                "Username": "Redkona"
            },
            "CheckinStatusTypeID": 10,
            "IsActionedByEditor": false
        },
        {
            "ID": 24200,
            "ChargePointID": 77235,
            "CommentTypeID": 10,
            "UserName": "ForumElettrico.it",
            "Comment": "Vicino vi è, oltre al supermercato, un McDonald's e un parchetto tenuto bene. Leggi la recensione completa qui >  https://www.forumelettrico.it/forum/colonnina-fast-lidl-catania-ct-via-giovanni-segantini-t17136.html",
            "RelatedURL": "https://www.forumelettrico.it/forum/colonnina-fast-lidl-catania-ct-via-giovanni-segantini-t17136.html",
            "DateCreated": "2021-04-17T13:32:26.13Z",
            "User": {
                "ID": 11749,
                "Username": "ForumElettrico.it"
            },
            "CheckinStatusTypeID": 10,
            "IsActionedByEditor": false
        },
        {
            "ID": 24087,
            "ChargePointID": 77235,
            "CommentTypeID": 50,
            "UserName": "Redkona",
            "Comment": "Il connettore tipo 2 in AC non funziona (è stato distrutto), mentre funzionano normalmente le due fast CCS e ChadeMo.",
            "Rating": 5,
            "DateCreated": "2021-03-29T19:39:05.077Z",
            "User": {
                "ID": 30536,
                "Username": "Redkona"
            },
            "CheckinStatusTypeID": 10,
            "IsActionedByEditor": false
        },
        {
            "ID": 23210,
            "ChargePointID": 77235,
            "CommentTypeID": 10,
            "UserName": "iomagico",
            "Comment": "This is a great idea and I aleays spend my time shopping inside the lidl mall",
            "Rating": 5,
            "DateCreated": "2020-09-14T16:57:02.443Z",
            "User": {
                "ID": 27231,
                "Username": "iomagico"
            },
            "CheckinStatusTypeID": 10,
            "IsActionedByEditor": false
        }
    ],
    "MediaItems": [
        {
            "ID": 27304,
            "ChargePointID": 77235,
            "ItemURL": "https://s3-ap-southeast-2.amazonaws.com/openchargemap/images/IT/OCM77235/OCM-77235.orig.2021041713323774.jpg",
            "ItemThumbnailURL": "https://s3-ap-southeast-2.amazonaws.com/openchargemap/images/IT/OCM77235/OCM-77235.thmb.2021041713323774.jpg",
            "Comment": "",
            "IsEnabled": true,
            "IsVideo": false,
            "IsFeaturedItem": false,
            "IsExternalResource": false,
            "User": {
                "ID": 11749,
                "Username": "ForumElettrico.it"
            },
            "DateCreated": "2021-04-17T13:33:00Z"
        },
        {
            "ID": 27305,
            "ChargePointID": 77235,
            "ItemURL": "https://s3-ap-southeast-2.amazonaws.com/openchargemap/images/IT/OCM77235/OCM-77235.orig.2021041713324574.jpg",
            "ItemThumbnailURL": "https://s3-ap-southeast-2.amazonaws.com/openchargemap/images/IT/OCM77235/OCM-77235.thmb.2021041713324574.jpg",
            "Comment": "",
            "IsEnabled": true,
            "IsVideo": false,
            "IsFeaturedItem": false,
            "IsExternalResource": false,
            "User": {
                "ID": 11749,
                "Username": "ForumElettrico.it"
            },
            "DateCreated": "2021-04-17T13:33:00Z"
        },
        {
            "ID": 27306,
            "ChargePointID": 77235,
            "ItemURL": "https://s3-ap-southeast-2.amazonaws.com/openchargemap/images/IT/OCM77235/OCM-77235.orig.2021041713325163.jpg",
            "ItemThumbnailURL": "https://s3-ap-southeast-2.amazonaws.com/openchargemap/images/IT/OCM77235/OCM-77235.thmb.2021041713325163.jpg",
            "Comment": "",
            "IsEnabled": true,
            "IsVideo": false,
            "IsFeaturedItem": false,
            "IsExternalResource": false,
            "User": {
                "ID": 11749,
                "Username": "ForumElettrico.it"
            },
            "DateCreated": "2021-04-17T13:33:00Z"
        },
        {
            "ID": 26470,
            "ChargePointID": 77235,
            "ItemURL": "https://s3-ap-southeast-2.amazonaws.com/openchargemap/images/IT/OCM77235/OCM-77235.orig.2021020907560473.jpg",
            "ItemThumbnailURL": "https://s3-ap-southeast-2.amazonaws.com/openchargemap/images/IT/OCM77235/OCM-77235.thmb.2021020907560473.jpg",
            "Comment": "My favorite charger place",
            "IsEnabled": true,
            "IsVideo": false,
            "IsFeaturedItem": false,
            "IsExternalResource": false,
            "User": {
                "ID": 30536,
                "Username": "Redkona"
            },
            "DateCreated": "2021-02-09T07:56:00Z"
        },
        {
            "ID": 8979,
            "ChargePointID": 77235,
            "ItemURL": "https://s3-ap-southeast-2.amazonaws.com/openchargemap/images/IT/OCM77235/OCM-77235.orig.2017010818054586.jpg",
            "ItemThumbnailURL": "https://s3-ap-southeast-2.amazonaws.com/openchargemap/images/IT/OCM77235/OCM-77235.thmb.2017010818054586.jpg",
            "Comment": "",
            "IsEnabled": true,
            "IsVideo": false,
            "IsFeaturedItem": false,
            "IsExternalResource": false,
            "User": {
                "ID": 12207,
                "Username": "aldodal"
            },
            "DateCreated": "2017-01-08T18:06:00Z"
        },
        {
            "ID": 8978,
            "ChargePointID": 77235,
            "ItemURL": "https://s3-ap-southeast-2.amazonaws.com/openchargemap/images/IT/OCM77235/OCM-77235.orig.2017010818032957.jpg",
            "ItemThumbnailURL": "https://s3-ap-southeast-2.amazonaws.com/openchargemap/images/IT/OCM77235/OCM-77235.thmb.2017010818032957.jpg",
            "Comment": "",
            "IsEnabled": true,
            "IsVideo": false,
            "IsFeaturedItem": false,
            "IsExternalResource": false,
            "User": {
                "ID": 12207,
                "Username": "aldodal"
            },
            "DateCreated": "2017-01-08T18:04:00Z"
        }
    ],
    "IsRecentlyVerified": false,
    "ID": 77235,
    "UUID": "2505C88A-AE88-41D6-AA2B-33818603112A",
    "DataProviderID": 1,
    "OperatorID": 38,
    "UsageTypeID": 1,
    "AddressInfo": {
        "ID": 77581,
        "Title": " Lidl Catania Segantini",
        "AddressLine1": "Via Giovanni Segantini",
        "Town": "Catania",
        "StateOrProvince": "CT",
        "Postcode": "95125",
        "CountryID": 112,
        "Latitude": 37.5360917491414,
        "Longitude": 15.0757321092704,
        "RelatedURL": "http://www.lidl.it/",
        "DistanceUnit": 0
    },
    "Connections": [
        {
            "ID": 111074,
            "ConnectionTypeID": 25,
            "StatusTypeID": 100,
            "LevelID": 2,
            "CurrentTypeID": 20,
            "Quantity": 1,
            "Comments": "Connettore rotto"
        },
        {
            "ID": 111075,
            "ConnectionTypeID": 33,
            "StatusTypeID": 50,
            "LevelID": 3,
            "CurrentTypeID": 30,
            "Quantity": 1
        },
        {
            "ID": 111076,
            "ConnectionTypeID": 2,
            "StatusTypeID": 50,
            "LevelID": 3,
            "CurrentTypeID": 30,
            "Quantity": 1
        }
    ],
    "NumberOfPoints": 2,
    "StatusTypeID": 50,
    "DateLastStatusUpdate": "2021-07-04T16:16:00Z",
    "DataQualityLevel": 1,
    "DateCreated": "2017-01-06T18:07:00Z",
    "SubmissionStatusTypeID": 200
}