{
    "IsRecentlyVerified": false,
    "ID": 95963,
    "UUID": "D9E28625-D35A-4F78-8F3E-AC04359FA207",
    "DataProviderID": 1,
    "OperatorID": 3251,
    "UsageTypeID": 1,
    "UsageCost": "paid",
    "AddressInfo": {
        "ID": 96309,
        "Title": "Karlslunde Vest, Karlslunde Rasteplads",
        "AddressLine1": "Karlslunde Vest,",
        "AddressLine2": "Karlslunde Rasteplads",
        "Town": "Karlslunde Landsby",
        "StateOrProvince": "Greve Kommune",
        "Postcode": "2690",
        "CountryID": 65,
        "Latitude": 55.5609126879846,
        "Longitude": 12.2291769958619,
        "RelatedURL": "http://eon.dk",
        "DistanceUnit": 0
    },
    "Connections": [
        {
            "ID": 135942,
            "ConnectionTypeID": 2,
            "StatusTypeID": 50,
            "LevelID": 3,
            "PowerKW": 50,
            "CurrentTypeID": 30,
            "Quantity": 1
        },
        {
            "ID": 135943,
            "ConnectionTypeID": 33,
            "StatusTypeID": 50,
            "LevelID": 3,
            "PowerKW": 50,
            "CurrentTypeID": 30,
            "Quantity": 1
        },
        {
            "ID": 135944,
            "ConnectionTypeID": 1036,
            "StatusTypeID": 50,
            "LevelID": 3,
            "PowerKW": 43,
            "CurrentTypeID": 20,
            "Quantity": 1
        }
    ],
    "NumberOfPoints": 1,
    "StatusTypeID": 50,
    "DateLastStatusUpdate": "2017-12-04T19:43:00Z",
    "DataQualityLevel": 1,
    "DateCreated": "2017-12-02T23:30:00Z",
    "SubmissionStatusTypeID": 200
}