{
    "IsRecentlyVerified": false,
    "ID": 94559,
    "UUID": "97F3D0EC-F274-4DCA-81F0-36ECCEB3EFE8",
    "DataProviderID": 1,
    "OperatorID": 23,
    "OperatorsReference": "36717",
    "UsageTypeID": 6,
    "AddressInfo": {
        "ID": 94905,
        "Title": "Hospedería Conventual de Alcántara",
        "AddressLine1": "Carretera Poblado Iberdrola",
        "Town": "sn",
        "StateOrProvince": "Alcantára",
        "Postcode": "10980",
        "CountryID": 210,
        "Latitude": 39.720461,
        "Longitude": -6.879159,
        "ContactTelephone1": "+34 927 390 638",
        "DistanceUnit": 0
    },
    "Connections": [
        {
            "ID": 133698,
            "ConnectionTypeID": 30,
            "StatusTypeID": 50,
            "LevelID": 2,
            "Amps": 32,
            "Voltage": 400,
            "PowerKW": 22,
            "CurrentTypeID": 20,
            "Quantity": 1
        }
    ],
    "NumberOfPoints": 1,
    "GeneralComments": "1 Tesla Connector, up to 22kW.Available for patrons only. Please call ahead.",
    "StatusTypeID": 50,
    "DateLastStatusUpdate": "2020-08-17T12:09:00Z",
    "DataQualityLevel": 1,
    "DateCreated": "2017-10-20T05:40:00Z",
    "SubmissionStatusTypeID": 200
}