{
    "IsRecentlyVerified": false,
    "ID": 54039,
    "UUID": "33BE4F9A-FDC4-441C-9D55-6C4C76D2C352",
    "DataProviderID": 1,
    "OperatorID": 214,
    "UsageTypeID": 4,
    "AddressInfo": {
        "ID": 54385,
        "Title": "be emobil Ladesäule in Berlin",
        "AddressLine1": "Abram-Joffe-Straße 18",
        "Town": "Berlin",
        "Postcode": "12489",
        "CountryID": 87,
        "Latitude": 52.4343407,
        "Longitude": 13.5303832,
        "ContactTelephone1": "+49 800 8866200",
        "AccessComments": "Rund um die Uhr (24/7) nutzbar\r\nLadeweile: Subway und diverse andere Essensmöglichkeiten 5 Minuten zu fuß.\"\r\n",
        "RelatedURL": "http://www.www.be-emobil.de",
        "DistanceUnit": 0
    },
    "Connections": [
        {
            "ID": 67614,
            "ConnectionTypeID": 28,
            "StatusTypeID": 50,
            "LevelID": 2,
            "CurrentTypeID": 10
        },
        {
            "ID": 67615,
            "ConnectionTypeID": 25,
            "StatusTypeID": 50,
            "LevelID": 2,
            "PowerKW": 11,
            "CurrentTypeID": 20,
            "Quantity": 2
        },
        {
            "ID": 67616,
            "ConnectionTypeID": 16,
            "StatusTypeID": 50,
            "LevelID": 2,
            "CurrentTypeID": 10
        },
        {
            "ID": 67617,
            "ConnectionTypeID": 17,
            "StatusTypeID": 50,
            "LevelID": 2,
            "CurrentTypeID": 20
        },
        {
            "ID": 67618,
            "ConnectionTypeID": 2,
            "StatusTypeID": 50,
            "LevelID": 2,
            "CurrentTypeID": 30
        },
        {
            "ID": 67619,
            "ConnectionTypeID": 33,
            "StatusTypeID": 50,
            "LevelID": 2,
            "CurrentTypeID": 30
        }
    ],
    "NumberOfPoints": 2,
    "StatusTypeID": 50,
    "DateLastStatusUpdate": "2015-09-22T06:53:00Z",
    "DataQualityLevel": 1,
    "DateCreated": "2015-09-21T16:00:00Z",
    "SubmissionStatusTypeID": 200
}