{
    "IsRecentlyVerified": false,
    "ID": 176361,
    "UUID": "373E34C0-B9A7-41BB-8F47-AFC450D778D9",
    "DataProviderID": 1,
    "OperatorID": 1,
    "UsageTypeID": 2,
    "AddressInfo": {
        "ID": 176720,
        "Title": "Home",
        "AddressLine1": "Wintree Ln",
        "Town": "Collierville",
        "StateOrProvince": "TN",
        "Postcode": "38017",
        "CountryID": 2,
        "Latitude": 35.06498956816357,
        "Longitude": -89.67443087448112,
        "AccessComments": "Please remove is a private location (home)",
        "DistanceUnit": 0
    },
    "Connections": [
        {
            "ID": 274181,
            "ConnectionTypeID": 10,
            "StatusTypeID": 50,
            "LevelID": 2,
            "Amps": 24,
            "Voltage": 238,
            "PowerKW": 6,
            "CurrentTypeID": 10,
            "Quantity": 1
        }
    ],
    "NumberOfPoints": 1,
    "StatusTypeID": 50,
    "DateLastStatusUpdate": "2021-07-10T18:53:00Z",
    "DataQualityLevel": 1,
    "DateCreated": "2021-07-07T18:33:00Z",
    "SubmissionStatusTypeID": 200
}