{
    "IsRecentlyVerified": false,
    "ID": 64077,
    "UUID": "3E9701CA-F42C-446F-816F-EEECDCB4B7B0",
    "DataProviderID": 26,
    "DataProvidersReference": "74583",
    "OperatorID": 73,
    "OperatorsReference": "EV-Box EVB-P1427173",
    "UsageCost": "0.00 jaarabonnement",
    "AddressInfo": {
        "ID": 64423,
        "Title": "Schulpengat 12",
        "AddressLine1": "Schulpengat 12",
        "Town": "Urk",
        "Postcode": "8321 WC",
        "CountryID": 159,
        "Latitude": 52.65242,
        "Longitude": 5.61494,
        "RelatedURL": "http://www.ev-box.nl",
        "DistanceUnit": 0
    },
    "Connections": [
        {
            "ID": 81942,
            "ConnectionTypeID": 25,
            "LevelID": 2,
            "PowerKW": 5,
            "CurrentTypeID": 10
        },
        {
            "ID": 81943,
            "ConnectionTypeID": 25,
            "LevelID": 2,
            "PowerKW": 5,
            "CurrentTypeID": 10
        },
        {
            "ID": 81944,
            "ConnectionTypeID": 25,
            "LevelID": 2,
            "PowerKW": 5,
            "CurrentTypeID": 10
        }
    ],
    "NumberOfPoints": 1,
    "StatusTypeID": 50,
    "DateLastStatusUpdate": "2016-06-04T02:55:00Z",
    "DataQualityLevel": 3,
    "DateCreated": "2016-03-03T12:33:00Z",
    "SubmissionStatusTypeID": 100
}