{
    "IsRecentlyVerified": false,
    "ID": 129559,
    "UUID": "749B19B7-6EE1-4291-BEB8-24E09EA6F262",
    "DataProviderID": 2,
    "DataProvidersReference": "122589",
    "OperatorID": 5,
    "UsageTypeID": 1,
    "AddressInfo": {
        "ID": 129905,
        "Title": "GVEC",
        "AddressLine1": "927 TX-46",
        "Town": "Seguin",
        "StateOrProvince": "TX",
        "Postcode": "78155",
        "CountryID": 2,
        "Latitude": 29.5770711,
        "Longitude": -97.9899134,
        "ContactTelephone1": "888-758-4389",
        "AccessComments": "24 hours daily",
        "RelatedURL": "http://www.chargepoint.com/",
        "DistanceUnit": 0
    },
    "Connections": [
        {
            "ID": 181303,
            "ConnectionTypeID": 2,
            "LevelID": 3,
            "Amps": 100,
            "Voltage": 400,
            "PowerKW": 40,
            "CurrentTypeID": 30,
            "Quantity": 1
        },
        {
            "ID": 181304,
            "ConnectionTypeID": 32,
            "LevelID": 3,
            "Amps": 100,
            "Voltage": 400,
            "PowerKW": 40,
            "CurrentTypeID": 30,
            "Quantity": 1
        }
    ],
    "DateLastStatusUpdate": "2020-06-26T02:53:00Z",
    "DataQualityLevel": 3,
    "DateCreated": "2019-07-21T11:43:00Z",
    "SubmissionStatusTypeID": 100
}