{
    "UserComments": [
        {
            "ID": 6128,
            "ChargePointID": 51594,
            "CommentTypeID": 50,
            "UserName": "Matthijs Van der Bogt",
            "DateCreated": "2015-08-05T21:16:09.227Z",
            "User": {
                "ID": 5002,
                "Username": "Matthijs Van der Bogt"
            },
            "CheckinStatusTypeID": 140
        }
    ],
    "MediaItems": [
        {
            "ID": 2924,
            "ChargePointID": 51594,
            "ItemURL": "https://s3-ap-southeast-2.amazonaws.com/openchargemap/images/NL/OCM51594/OCM-51594.orig.2015080222184230.jpg",
            "ItemThumbnailURL": "https://s3-ap-southeast-2.amazonaws.com/openchargemap/images/NL/OCM51594/OCM-51594.thmb.2015080222184230.jpg",
            "Comment": "",
            "IsEnabled": true,
            "IsVideo": false,
            "IsFeaturedItem": false,
            "IsExternalResource": false,
            "User": {
                "ID": 5002,
                "Username": "Matthijs Van der Bogt"
            },
            "DateCreated": "2015-08-02T22:19:00Z"
        },
        {
            "ID": 2925,
            "ChargePointID": 51594,
            "ItemURL": "https://s3-ap-southeast-2.amazonaws.com/openchargemap/images/NL/OCM51594/OCM-51594.orig.2015080222191001.jpg",
            "ItemThumbnailURL": "https://s3-ap-southeast-2.amazonaws.com/openchargemap/images/NL/OCM51594/OCM-51594.thmb.2015080222191001.jpg",
            "Comment": "",
            "IsEnabled": true,
            "IsVideo": false,
            "IsFeaturedItem": false,
            "IsExternalResource": false,
            "User": {
                "ID": 5002,
                "Username": "Matthijs Van der Bogt"
            },
            "DateCreated": "2015-08-02T22:19:00Z"
        },
        {
            "ID": 2921,
            "ChargePointID": 51594,
            "ItemURL": "https://s3-ap-southeast-2.amazonaws.com/openchargemap/images/NL/OCM51594/OCM-51594.orig.2015080222172260.jpg",
            "ItemThumbnailURL": "https://s3-ap-southeast-2.amazonaws.com/openchargemap/images/NL/OCM51594/OCM-51594.thmb.2015080222172260.jpg",
            "Comment": "",
            "IsEnabled": true,
            "IsVideo": false,
            "IsFeaturedItem": false,
            "IsExternalResource": false,
            "User": {
                "ID": 5002,
                "Username": "Matthijs Van der Bogt"
            },
            "DateCreated": "2015-08-02T22:18:00Z"
        },
        {
            "ID": 2922,
            "ChargePointID": 51594,
            "ItemURL": "https://s3-ap-southeast-2.amazonaws.com/openchargemap/images/NL/OCM51594/OCM-51594.orig.2015080222174899.jpg",
            "ItemThumbnailURL": "https://s3-ap-southeast-2.amazonaws.com/openchargemap/images/NL/OCM51594/OCM-51594.thmb.2015080222174899.jpg",
            "Comment": "",
            "IsEnabled": true,
            "IsVideo": false,
            "IsFeaturedItem": false,
            "IsExternalResource": false,
            "User": {
                "ID": 5002,
                "Username": "Matthijs Van der Bogt"
            },
            "DateCreated": "2015-08-02T22:18:00Z"
        },
        {
            "ID": 2923,
            "ChargePointID": 51594,
            "ItemURL": "https://s3-ap-southeast-2.amazonaws.com/openchargemap/images/NL/OCM51594/OCM-51594.orig.2015080222181238.jpg",
            "ItemThumbnailURL": "https://s3-ap-southeast-2.amazonaws.com/openchargemap/images/NL/OCM51594/OCM-51594.thmb.2015080222181238.jpg",
            "Comment": "",
            "IsEnabled": true,
            "IsVideo": false,
            "IsFeaturedItem": false,
            "IsExternalResource": false,
            "User": {
                "ID": 5002,
                "Username": "Matthijs Van der Bogt"
            },
            "DateCreated": "2015-08-02T22:18:00Z"
        }
    ],
    "IsRecentlyVerified": false,
    "ID": 51594,
    "UUID": "53EDACED-1620-448C-B27B-55EE65495D80",
    "DataProviderID": 1,
    "OperatorID": 73,
    "UsageTypeID": 6,
    "UsageCost": "0.00",
    "AddressInfo": {
        "ID": 51940,
        "Title": "Van Houten Industriepark",
        "AddressLine1": "Van Houten Industriepark",
        "Town": "Weesp",
        "StateOrProvince": "Noord Holland",
        "Postcode": "1381CP",
        "CountryID": 159,
        "Latitude": 52.3037651024158,
        "Longitude": 5.0306917089843495,
        "AccessComments": "Closed off after business hours. Free charging. No card or membership required. Operated by push button.",
        "RelatedURL": "http://www.ev-box.nl",
        "DistanceUnit": 0
    },
    "Connections": [
        {
            "ID": 63980,
            "ConnectionTypeID": 25,
            "StatusTypeID": 50,
            "LevelID": 2,
            "PowerKW": 3.7,
            "CurrentTypeID": 20,
            "Quantity": 1
        }
    ],
    "NumberOfPoints": 1,
    "StatusTypeID": 50,
    "DateLastStatusUpdate": "2015-08-05T21:16:00Z",
    "DataQualityLevel": 1,
    "DateCreated": "2015-08-02T22:16:00Z",
    "SubmissionStatusTypeID": 200
}