{
    "IsRecentlyVerified": false,
    "ID": 33126,
    "UUID": "50129DF9-F548-49FB-9CD2-2F7362A6C8AE",
    "DataProviderID": 1,
    "OperatorID": 105,
    "OperatorsReference": "Essent EM-DE-05913000-01-00067",
    "UsageTypeID": 4,
    "AddressInfo": {
        "ID": 33472,
        "Title": "Königswall 15",
        "AddressLine1": "Königswall 15",
        "Town": "Dortmund",
        "StateOrProvince": "NRW",
        "Postcode": "44137",
        "CountryID": 87,
        "Latitude": 51.516612,
        "Longitude": 7.457295,
        "DistanceUnit": 0
    },
    "Connections": [
        {
            "ID": 36637,
            "ConnectionTypeID": 25,
            "StatusTypeID": 50,
            "LevelID": 2,
            "PowerKW": 22,
            "CurrentTypeID": 20
        },
        {
            "ID": 46691,
            "ConnectionTypeID": 2,
            "StatusTypeID": 50,
            "LevelID": 3,
            "PowerKW": 50,
            "CurrentTypeID": 30
        },
        {
            "ID": 187415,
            "ConnectionTypeID": 33,
            "StatusTypeID": 50,
            "LevelID": 3,
            "PowerKW": 50,
            "CurrentTypeID": 30,
            "Quantity": 1
        }
    ],
    "NumberOfPoints": 1,
    "StatusTypeID": 50,
    "DateLastStatusUpdate": "2019-10-30T16:52:00Z",
    "DataQualityLevel": 3,
    "DateCreated": "2015-01-09T06:04:00Z",
    "SubmissionStatusTypeID": 200
}