{
    "IsRecentlyVerified": false,
    "ID": 85805,
    "UUID": "15B503E5-DB22-4852-9332-6D9B296D4506",
    "DataProviderID": 1,
    "OperatorID": 3,
    "OperatorsReference": "PG-81035",
    "UsageTypeID": 6,
    "UsageCost": "1",
    "AddressInfo": {
        "ID": 86151,
        "Title": "Read Lincoln-Hyundai",
        "AddressLine1": "Black Horse Drive",
        "Town": "Lincoln",
        "Postcode": "LN6 9UJ",
        "CountryID": 1,
        "Latitude": 53.177802,
        "Longitude": -0.619567,
        "DistanceUnit": 0
    },
    "Connections": [
        {
            "ID": 121958,
            "ConnectionTypeID": 25,
            "StatusTypeID": 50,
            "LevelID": 2,
            "Amps": 32,
            "Voltage": 230,
            "PowerKW": 7,
            "CurrentTypeID": 10,
            "Quantity": 2
        }
    ],
    "NumberOfPoints": 3,
    "GeneralComments": "This is an open charge unit installed at the Read Lincoln - Hyundai dealership in Black Horse Drive, Lincoln",
    "StatusTypeID": 0,
    "DateLastStatusUpdate": "2020-01-22T06:28:00Z",
    "DataQualityLevel": 1,
    "DateCreated": "2017-04-15T10:22:00Z",
    "SubmissionStatusTypeID": 200
}