{
    "IsRecentlyVerified": false,
    "ID": 121844,
    "UUID": "0C70AE9B-E006-4C98-B6A5-0FB55885765D",
    "DataProviderID": 2,
    "DataProvidersReference": "100465",
    "OperatorID": 5,
    "UsageTypeID": 1,
    "AddressInfo": {
        "ID": 122190,
        "Title": "BEACON",
        "AddressLine1": "1035 Grant St SE",
        "Town": "Atlanta",
        "StateOrProvince": "GA",
        "Postcode": "30315",
        "CountryID": 2,
        "Latitude": 33.726245,
        "Longitude": -84.377305,
        "ContactTelephone1": "888-758-4389",
        "AccessComments": "24 hours daily",
        "RelatedURL": "http://www.chargepoint.com/",
        "DistanceUnit": 0
    },
    "Connections": [
        {
            "ID": 171675,
            "ConnectionTypeID": 1,
            "LevelID": 2,
            "Amps": 16,
            "Voltage": 230,
            "PowerKW": 3.7,
            "CurrentTypeID": 10,
            "Quantity": 4
        }
    ],
    "DateLastStatusUpdate": "2020-06-26T02:55:00Z",
    "DataQualityLevel": 3,
    "DateCreated": "2019-04-06T05:02:00Z",
    "SubmissionStatusTypeID": 100
}