{
    "IsRecentlyVerified": false,
    "ID": 4508,
    "UUID": "5EF5895F-4973-4DA8-BADC-8EBAC45B574E",
    "DataProviderID": 1,
    "OperatorID": 1,
    "UsageTypeID": 1,
    "AddressInfo": {
        "ID": 4453,
        "Title": "Cityplaza",
        "AddressLine1": "Car Park 308 B3",
        "AddressLine2": "Cityplaza, 18 Taikoo Shing Rd",
        "Town": "Taikoo Shing",
        "StateOrProvince": "Hong Kong",
        "Postcode": "",
        "CountryID": 4,
        "Latitude": 22.28658676147461,
        "Longitude": 114.2181167602539,
        "ContactTelephone1": "",
        "ContactTelephone2": "",
        "ContactEmail": "",
        "AccessComments": "24 hours",
        "RelatedURL": "",
        "DistanceUnit": 0
    },
    "Connections": [
        {
            "ID": 170,
            "ConnectionTypeID": 3,
            "LevelID": 2,
            "Quantity": 1
        }
    ],
    "NumberOfPoints": 1,
    "DateLastConfirmed": "2011-05-21T00:00:00Z",
    "StatusTypeID": 50,
    "DateLastStatusUpdate": "2013-01-11T21:07:00Z",
    "DateCreated": "2011-05-25T11:01:00Z",
    "SubmissionStatusTypeID": 200
}