{
    "MediaItems": [
        {
            "ID": 549,
            "ChargePointID": 24235,
            "ItemURL": "https://s3-ap-southeast-2.amazonaws.com/openchargemap/images/FI/OCM24235/OCM-24235.orig.2014072521075234.jpg",
            "ItemThumbnailURL": "https://s3-ap-southeast-2.amazonaws.com/openchargemap/images/FI/OCM24235/OCM-24235.thmb.2014072521075234.jpg",
            "Comment": "",
            "IsEnabled": true,
            "IsVideo": false,
            "IsFeaturedItem": false,
            "IsExternalResource": false,
            "User": {
                "ID": 2045,
                "Username": "Ryp"
            },
            "DateCreated": "2014-07-25T21:08:00Z"
        },
        {
            "ID": 548,
            "ChargePointID": 24235,
            "ItemURL": "https://s3-ap-southeast-2.amazonaws.com/openchargemap/images/FI/OCM24235/OCM-24235.orig.2014072521071204.jpg",
            "ItemThumbnailURL": "https://s3-ap-southeast-2.amazonaws.com/openchargemap/images/FI/OCM24235/OCM-24235.thmb.2014072521071204.jpg",
            "Comment": "",
            "IsEnabled": true,
            "IsVideo": false,
            "IsFeaturedItem": false,
            "IsExternalResource": false,
            "User": {
                "ID": 2045,
                "Username": "Ryp"
            },
            "DateCreated": "2014-07-25T21:07:00Z"
        }
    ],
    "IsRecentlyVerified": false,
    "ID": 24235,
    "UUID": "F5677FFC-16E0-4013-A7E9-D7D946C39B38",
    "DataProviderID": 1,
    "OperatorID": 45,
    "UsageTypeID": 5,
    "UsageCost": "Parkki maksu. - Parking fee.",
    "AddressInfo": {
        "ID": 24580,
        "Title": "P-Hämppi",
        "AddressLine1": "Ratapihankatu 39",
        "AddressLine2": "",
        "Town": "Tampere",
        "StateOrProvince": "Pirkanmaa",
        "Postcode": "33100",
        "CountryID": 79,
        "Latitude": 61.4981737709077,
        "Longitude": 23.774891495704647,
        "ContactTelephone1": "",
        "ContactTelephone2": "",
        "ContactEmail": "",
        "AccessComments": "Hämpin parkkihalli avoinna 24/7 - Hämppi parking open 24/7",
        "RelatedURL": "http://www.finnpark.fi",
        "DistanceUnit": 0
    },
    "Connections": [
        {
            "ID": 26328,
            "ConnectionTypeID": 28,
            "StatusTypeID": 50,
            "LevelID": 2,
            "Amps": 13,
            "Voltage": 240,
            "PowerKW": 3,
            "CurrentTypeID": 10,
            "Quantity": 4
        },
        {
            "ID": 26329,
            "ConnectionTypeID": 25,
            "StatusTypeID": 75,
            "CurrentTypeID": 10
        }
    ],
    "NumberOfPoints": 4,
    "GeneralComments": "Schuko toimii. Schuko works. Kolmivaihelaturi ei toimi Mennekes pistokkeesta. Vain yksivaihe kytketty? 3-phase charger did not work from Mennekes connector. Only 1-phase connected?",
    "StatusTypeID": 50,
    "DateLastStatusUpdate": "2014-07-28T11:22:00Z",
    "DataQualityLevel": 1,
    "DateCreated": "2014-07-25T21:00:00Z",
    "SubmissionStatusTypeID": 200
}