{
    "IsRecentlyVerified": false,
    "ID": 145574,
    "UUID": "022BD6EC-9B70-4102-A935-CB391350E2B2",
    "DataProviderID": 2,
    "DataProvidersReference": "143976",
    "OperatorID": 90,
    "UsageTypeID": 1,
    "AddressInfo": {
        "ID": 145926,
        "Title": "Desjardins - Centre-sud Gaspésien",
        "AddressLine1": "70, boul. René-Lévesque Est",
        "Town": "Chandler",
        "StateOrProvince": "QC",
        "Postcode": "G0C 1K0",
        "CountryID": 44,
        "Latitude": 48.3509,
        "Longitude": -64.6742,
        "ContactTelephone1": "877-505-2674",
        "AccessComments": "24 hours daily",
        "RelatedURL": "https://lecircuitelectrique.com/",
        "DistanceUnit": 0
    },
    "Connections": [
        {
            "ID": 202285,
            "ConnectionTypeID": 1,
            "LevelID": 2,
            "Amps": 16,
            "Voltage": 230,
            "PowerKW": 3.7,
            "CurrentTypeID": 10,
            "Quantity": 1
        }
    ],
    "StatusTypeID": 50,
    "DateLastStatusUpdate": "2020-06-26T03:11:00Z",
    "DataQualityLevel": 3,
    "DateCreated": "2019-12-24T09:25:00Z",
    "SubmissionStatusTypeID": 100
}