{
    "IsRecentlyVerified": false,
    "ID": 23736,
    "UUID": "1A2E9C7F-19E4-49AA-901B-2DE38A2F167E",
    "DataProviderID": 1,
    "OperatorID": 76,
    "UsageTypeID": 1,
    "UsageCost": "5€/up to 60min",
    "AddressInfo": {
        "ID": 24081,
        "Title": "Tartu-2",
        "AddressLine1": "Rebase",
        "Town": "Tartu",
        "StateOrProvince": "Tartu maakond",
        "Postcode": "50103",
        "CountryID": 74,
        "Latitude": 58.368075400313955,
        "Longitude": 26.737814727850044,
        "ContactTelephone1": "+372 6511911",
        "ContactEmail": "tugi@elmo.ee",
        "RelatedURL": "http://www.elmo.ee",
        "DistanceUnit": 0
    },
    "Connections": [
        {
            "ID": 25714,
            "ConnectionTypeID": 2,
            "StatusTypeID": 50,
            "LevelID": 3,
            "Amps": 120,
            "Voltage": 500,
            "PowerKW": 50,
            "CurrentTypeID": 30,
            "Quantity": 1
        },
        {
            "ID": 25715,
            "ConnectionTypeID": 25,
            "StatusTypeID": 50,
            "LevelID": 2,
            "Amps": 32,
            "Voltage": 400,
            "PowerKW": 22,
            "CurrentTypeID": 20,
            "Quantity": 1
        }
    ],
    "NumberOfPoints": 1,
    "GeneralComments": "Opened 24h (automatic). \r\nReal-time condition information (operational/not operational/free) - www.elmo.ee \r\nCan pay with client card, SMS or mobile application. \r\nCharger number 78146",
    "StatusTypeID": 50,
    "DateLastStatusUpdate": "2014-05-28T18:44:00Z",
    "DataQualityLevel": 1,
    "DateCreated": "2014-05-28T18:44:00Z",
    "SubmissionStatusTypeID": 200
}