{
    "IsRecentlyVerified": false,
    "ID": 128159,
    "UUID": "42634628-4CC5-4942-AA2E-FAEEAA19A205",
    "DataProviderID": 1,
    "OperatorID": 3341,
    "UsageTypeID": 5,
    "AddressInfo": {
        "ID": 128505,
        "Title": "Saint John's Business Park",
        "AddressLine1": "Shuttleworth Lane",
        "Town": "Lutterworth",
        "StateOrProvince": "Leicestershire",
        "Postcode": "LE17 4HB",
        "CountryID": 1,
        "Latitude": 52.540766,
        "Longitude": -1.197502,
        "RelatedURL": "http://www.aptcontrols.co.uk",
        "DistanceUnit": 0
    },
    "Connections": [
        {
            "ID": 179340,
            "ConnectionTypeID": 25,
            "Reference": "ENG0102-3",
            "StatusTypeID": 50,
            "LevelID": 2,
            "Amps": 32,
            "Voltage": 400,
            "PowerKW": 22,
            "CurrentTypeID": 20,
            "Quantity": 2
        },
        {
            "ID": 179371,
            "ConnectionTypeID": 2,
            "StatusTypeID": 50,
            "LevelID": 3,
            "PowerKW": 50,
            "CurrentTypeID": 30,
            "Quantity": 1
        },
        {
            "ID": 179372,
            "ConnectionTypeID": 33,
            "StatusTypeID": 50,
            "LevelID": 3,
            "PowerKW": 50,
            "CurrentTypeID": 30,
            "Quantity": 1
        }
    ],
    "NumberOfPoints": 2,
    "StatusTypeID": 50,
    "DateLastStatusUpdate": "2019-06-17T13:00:00Z",
    "MetadataValues": [
        {
            "ID": 4503,
            "MetadataFieldID": 4,
            "ItemValue": "Contains public sector information licensed under the Open Government Licence v2.0. http://www.nationalarchives.gov.uk/doc/open-government-licence/version/2/"
        }
    ],
    "DataQualityLevel": 3,
    "DateCreated": "2019-06-17T06:40:00Z",
    "SubmissionStatusTypeID": 200
}