{
    "IsRecentlyVerified": false,
    "ID": 112914,
    "UUID": "C7839BF4-3E40-4500-958E-B14F4CB90221",
    "DataProviderID": 1,
    "OperatorID": 80,
    "UsageTypeID": 4,
    "AddressInfo": {
        "ID": 113260,
        "Title": "Potenza Gallitello | EnelX",
        "AddressLine1": "Via del Gallitello",
        "Town": "Potenza",
        "StateOrProvince": "PZ",
        "Postcode": "85100",
        "CountryID": 112,
        "Latitude": 40.6360404423603,
        "Longitude": 15.7853935745808,
        "ContactTelephone1": "800.069.850",
        "RelatedURL": "https://www.enelx.com/it/it/emobility",
        "DistanceUnit": 0
    },
    "Connections": [
        {
            "ID": 159038,
            "ConnectionTypeID": 25,
            "StatusTypeID": 50,
            "LevelID": 2,
            "Amps": 32,
            "Voltage": 400,
            "PowerKW": 22,
            "CurrentTypeID": 20,
            "Quantity": 2
        }
    ],
    "NumberOfPoints": 2,
    "StatusTypeID": 50,
    "DateLastStatusUpdate": "2018-12-18T15:54:00Z",
    "DataQualityLevel": 1,
    "DateCreated": "2018-11-23T16:22:00Z",
    "SubmissionStatusTypeID": 200
}