{
    "IsRecentlyVerified": false,
    "ID": 112464,
    "UUID": "04343070-0049-45D4-90E3-C90AF16529EB",
    "DataProviderID": 1,
    "OperatorID": 32,
    "OperatorsReference": "156057",
    "UsageTypeID": 4,
    "UsageCost": "Inclusive; for Polar Plus subscription members only",
    "AddressInfo": {
        "ID": 112810,
        "Title": "The Close Hotel",
        "AddressLine1": "The Close Hotel",
        "Town": "Long Street",
        "StateOrProvince": "Tetbury",
        "Postcode": "GL8 8AQ",
        "CountryID": 1,
        "Latitude": 51.636776,
        "Longitude": -2.160472,
        "DistanceUnit": 0
    },
    "Connections": [
        {
            "ID": 158196,
            "ConnectionTypeID": 25,
            "StatusTypeID": 50,
            "LevelID": 2,
            "Amps": 32,
            "Voltage": 230,
            "PowerKW": 6.9,
            "CurrentTypeID": 10,
            "Quantity": 1
        }
    ],
    "NumberOfPoints": 1,
    "StatusTypeID": 50,
    "DateLastStatusUpdate": "2018-11-01T06:14:00Z",
    "DataQualityLevel": 1,
    "DateCreated": "2018-10-31T06:16:00Z",
    "SubmissionStatusTypeID": 200
}