{
    "IsRecentlyVerified": false,
    "ID": 67483,
    "UUID": "99C80C64-3AE6-4A24-AB58-0F8CF845DBCA",
    "DataProviderID": 2,
    "DataProvidersReference": "74350",
    "UsageTypeID": 1,
    "AddressInfo": {
        "ID": 67829,
        "Title": "Swedish American Hospital",
        "AddressLine1": "1418 E State St",
        "Town": "Rockford",
        "StateOrProvince": "IL",
        "Postcode": "61104",
        "CountryID": 2,
        "Latitude": 42.266938,
        "Longitude": -89.07255,
        "ContactTelephone1": "815-968-4400",
        "AccessComments": "24 hours daily",
        "RelatedURL": "",
        "DistanceUnit": 0
    },
    "Connections": [
        {
            "ID": 92988,
            "ConnectionTypeID": 1,
            "LevelID": 2,
            "Amps": 16,
            "Voltage": 230,
            "PowerKW": 3.7,
            "CurrentTypeID": 10,
            "Quantity": 2
        }
    ],
    "DateLastStatusUpdate": "2020-06-26T03:05:00Z",
    "DataQualityLevel": 3,
    "DateCreated": "2016-05-29T02:05:00Z",
    "SubmissionStatusTypeID": 100
}