{
    "IsRecentlyVerified": false,
    "ID": 154283,
    "UUID": "79462E09-ED74-4E91-B849-D489B90EE57E",
    "DataProviderID": 28,
    "DataProvidersReference": "FR*S60*PVENETTE",
    "OperatorID": 3379,
    "UsageTypeID": 5,
    "AddressInfo": {
        "ID": 154636,
        "Title": "Venette",
        "AddressLine1": "23 rue de Compiègne 60280 Venette",
        "CountryID": 80,
        "Latitude": 49.4154,
        "Longitude": 2.80243,
        "AccessComments": "24h/24 7j/7",
        "DistanceUnit": 0
    },
    "Connections": [
        {
            "ID": 216892,
            "ConnectionTypeID": 1036,
            "StatusTypeID": 50,
            "LevelID": 2,
            "PowerKW": 22,
            "CurrentTypeID": 20
        },
        {
            "ID": 251265,
            "ConnectionTypeID": 1036,
            "StatusTypeID": 50,
            "LevelID": 2,
            "PowerKW": 22,
            "CurrentTypeID": 20
        }
    ],
    "GeneralComments": "",
    "StatusTypeID": 50,
    "DateLastStatusUpdate": "2020-08-27T05:16:00Z",
    "DataQualityLevel": 2,
    "DateCreated": "2020-03-15T10:55:00Z",
    "SubmissionStatusTypeID": 100
}