{
    "IsRecentlyVerified": false,
    "ID": 101977,
    "UUID": "4DC4A9DA-695F-4EB5-8ACC-40B29C12115B",
    "DataProviderID": 1,
    "OperatorID": 23,
    "OperatorsReference": "42229",
    "UsageTypeID": 4,
    "AddressInfo": {
        "ID": 102323,
        "Title": "Vigilius Mountain Resort",
        "AddressLine1": "Pavicolo",
        "Town": "43",
        "StateOrProvince": "Lana",
        "Postcode": "39011",
        "CountryID": 112,
        "Latitude": 46.620572,
        "Longitude": 11.139933,
        "ContactTelephone1": "+39 0473 556 600",
        "DistanceUnit": 0
    },
    "Connections": [
        {
            "ID": 143960,
            "ConnectionTypeID": 30,
            "StatusTypeID": 50,
            "LevelID": 2,
            "Amps": 32,
            "Voltage": 230,
            "PowerKW": 14,
            "CurrentTypeID": 20,
            "Quantity": 2
        }
    ],
    "NumberOfPoints": 2,
    "GeneralComments": "2 Tesla Connectors, up to 14kW.Available for customers. Please call ahead.",
    "StatusTypeID": 50,
    "DateLastStatusUpdate": "2018-10-04T06:19:00Z",
    "DataQualityLevel": 1,
    "DateCreated": "2018-04-16T04:47:00Z",
    "SubmissionStatusTypeID": 200
}