{
    "IsRecentlyVerified": false,
    "ID": 88099,
    "UUID": "82ADE886-1DB4-4958-AF12-8FBDBE070B80",
    "DataProviderID": 1,
    "OperatorID": 1,
    "UsageTypeID": 4,
    "UsageCost": "0,30€/kWh",
    "AddressInfo": {
        "ID": 88445,
        "Title": "Parkplatz Rathaus",
        "AddressLine1": "Herbert-Kneitz-Straße 15",
        "Town": "Wirsberg",
        "StateOrProvince": "Landkreis Kulmbach",
        "Postcode": "95339",
        "CountryID": 87,
        "Latitude": 50.10558443661208,
        "Longitude": 11.605054430723175,
        "AccessComments": "24/7 nutzbar auf dem Parkplatz.",
        "DistanceUnit": 0
    },
    "Connections": [
        {
            "ID": 124975,
            "ConnectionTypeID": 25,
            "StatusTypeID": 50,
            "LevelID": 2,
            "Amps": 32,
            "Voltage": 400,
            "PowerKW": 22,
            "CurrentTypeID": 20,
            "Quantity": 2
        }
    ],
    "NumberOfPoints": 2,
    "GeneralComments": "Betreiber ist ChargeIT Mobility; freischaltbar mit PlugSurfing Keyhanger / App, New Motion, Charge & Fuel u.a. Nach Leistung gestaffelte Zeittarife im 15 Minuten Takt von 0,50€ bei 3.7kW bis 1,25€ bei 22kW Ladeleistung.",
    "StatusTypeID": 50,
    "DateLastStatusUpdate": "2017-05-22T07:58:00Z",
    "DataQualityLevel": 1,
    "DateCreated": "2017-05-22T07:58:00Z",
    "SubmissionStatusTypeID": 200
}