{
    "IsRecentlyVerified": false,
    "ID": 163916,
    "UUID": "77263553-2C64-4102-A5F3-066D85995873",
    "DataProviderID": 1,
    "OperatorID": 23,
    "OperatorsReference": "40889",
    "UsageTypeID": 4,
    "AddressInfo": {
        "ID": 164275,
        "Title": "B&B Hotel Granollers",
        "AddressLine1": "Calle Valldoriof",
        "Town": "1",
        "StateOrProvince": "Can Franqueses",
        "Postcode": "8520",
        "CountryID": 210,
        "Latitude": 41.614222,
        "Longitude": 2.304058,
        "ContactTelephone1": "+34 938 407 132",
        "DistanceUnit": 0
    },
    "Connections": [
        {
            "ID": 235514,
            "ConnectionTypeID": 30,
            "StatusTypeID": 50,
            "LevelID": 2,
            "PowerKW": 11,
            "CurrentTypeID": 20,
            "Quantity": 1
        }
    ],
    "NumberOfPoints": 1,
    "GeneralComments": "1 Tesla Connector, up to 11kW.Available for customers. Please see front desk.",
    "StatusTypeID": 50,
    "DateLastStatusUpdate": "2020-08-24T23:21:00Z",
    "DataQualityLevel": 1,
    "DateCreated": "2020-08-24T23:21:00Z",
    "SubmissionStatusTypeID": 200
}