{
    "IsRecentlyVerified": false,
    "ID": 66798,
    "UUID": "877F2271-1681-44A6-940A-F4DA428C2AD0",
    "DataProviderID": 1,
    "OperatorID": 23,
    "OperatorsReference": "14684",
    "UsageTypeID": 1,
    "UsageCost": "Free",
    "AddressInfo": {
        "ID": 67144,
        "Title": "Comfort Inn and Suites - Tesla",
        "AddressLine1": "3838 US Highway 77",
        "Town": "Corpus Christi",
        "StateOrProvince": "TX",
        "Postcode": "78410",
        "CountryID": 2,
        "Latitude": 27.8538373,
        "Longitude": -97.6296108,
        "ContactTelephone1": "361-241-6363  877-798-3752",
        "AccessComments": "24 hours daily; for Tesla use only; for guest use only",
        "RelatedURL": "http://www.teslamotors.com/supercharger",
        "DistanceUnit": 0
    },
    "Connections": [
        {
            "ID": 92284,
            "ConnectionTypeID": 30,
            "StatusTypeID": 50,
            "LevelID": 2,
            "Amps": 16,
            "Voltage": 230,
            "PowerKW": 16,
            "CurrentTypeID": 10,
            "Quantity": 1
        }
    ],
    "NumberOfPoints": 1,
    "StatusTypeID": 50,
    "DateLastStatusUpdate": "2017-01-26T01:24:00Z",
    "DataQualityLevel": 3,
    "DateCreated": "2016-05-29T02:04:00Z",
    "SubmissionStatusTypeID": 100
}