{
    "IsRecentlyVerified": false,
    "ID": 70739,
    "UUID": "5B87197A-2FB2-43FB-AE5D-EE078DD81395",
    "DataProviderID": 1,
    "OperatorID": 220,
    "OperatorsReference": "3094,3094,3095",
    "UsageTypeID": 4,
    "UsageCost": "€1.73 + €0.3213/kWh; Andere Tarife möglich",
    "AddressInfo": {
        "ID": 71085,
        "Title": "Schulterblatt",
        "AddressLine1": "Schulterblatt 112",
        "AddressLine2": "OT Eimsbüttel",
        "Town": "Hamburg",
        "StateOrProvince": "Hamburg",
        "Postcode": "20357",
        "CountryID": 87,
        "Latitude": 53.5643545,
        "Longitude": 9.960192199999938,
        "DistanceUnit": 0
    },
    "Connections": [
        {
            "ID": 101331,
            "ConnectionTypeID": 25,
            "StatusTypeID": 50,
            "LevelID": 2,
            "Amps": 32,
            "Voltage": 400,
            "PowerKW": 22,
            "CurrentTypeID": 20,
            "Quantity": 2
        },
        {
            "ID": 101332,
            "ConnectionTypeID": 28,
            "StatusTypeID": 50,
            "LevelID": 2,
            "Amps": 16,
            "Voltage": 230,
            "PowerKW": 3.7,
            "CurrentTypeID": 10,
            "Quantity": 2
        }
    ],
    "NumberOfPoints": 2,
    "StatusTypeID": 50,
    "DateLastStatusUpdate": "2017-04-20T23:16:00Z",
    "DataQualityLevel": 1,
    "DateCreated": "2016-08-08T06:53:00Z",
    "SubmissionStatusTypeID": 200
}