{
    "IsRecentlyVerified": false,
    "ID": 146264,
    "UUID": "72DCCFC2-9035-47F5-BFBD-08D8E76C6A70",
    "DataProviderID": 1,
    "OperatorID": 45,
    "UsageTypeID": 4,
    "UsageCost": "Free for customers",
    "AddressInfo": {
        "ID": 146616,
        "Title": "Mrs Green's Market",
        "AddressLine1": "Lexington Avenue",
        "Town": "Mount Kisco",
        "StateOrProvince": "NY",
        "Postcode": "10549",
        "CountryID": 2,
        "Latitude": 41.18859681873238,
        "Longitude": -73.7315638859518,
        "DistanceUnit": 0
    },
    "Connections": [
        {
            "ID": 203254,
            "ConnectionTypeID": 1,
            "StatusTypeID": 50,
            "Quantity": 2,
            "Comments": "2 Dedicated EV parking spots, 2 charging outlets"
        }
    ],
    "NumberOfPoints": 2,
    "StatusTypeID": 50,
    "DateLastStatusUpdate": "2020-01-10T12:16:00Z",
    "DataQualityLevel": 1,
    "DateCreated": "2020-01-05T19:38:00Z",
    "SubmissionStatusTypeID": 200
}