{
    "IsRecentlyVerified": false,
    "ID": 174186,
    "UUID": "3453309D-E6FB-4248-A42A-DE61A61924FF",
    "DataProviderID": 1,
    "OperatorID": 21,
    "UsageTypeID": 4,
    "UsageCost": "Mobi.E compatible card or App",
    "AddressInfo": {
        "ID": 174545,
        "Title": "PVZ-00007/10 - Pingo Doce",
        "AddressLine1": "Rua Sacra Família",
        "Town": "Póvoa de Varzim",
        "StateOrProvince": "Porto",
        "Postcode": "",
        "CountryID": 180,
        "Latitude": 41.37889389445883,
        "Longitude": -8.739405219674836,
        "AccessComments": "08:00>19:00",
        "DistanceUnit": 0
    },
    "Connections": [
        {
            "ID": 269268,
            "ConnectionTypeID": 2,
            "StatusTypeID": 50,
            "LevelID": 3,
            "Amps": 120,
            "Voltage": 500,
            "PowerKW": 50,
            "CurrentTypeID": 30,
            "Quantity": 1
        },
        {
            "ID": 269269,
            "ConnectionTypeID": 33,
            "StatusTypeID": 50,
            "LevelID": 3,
            "Amps": 125,
            "Voltage": 500,
            "PowerKW": 50,
            "CurrentTypeID": 30,
            "Quantity": 1
        },
        {
            "ID": 269270,
            "ConnectionTypeID": 1036,
            "StatusTypeID": 50,
            "LevelID": 3,
            "Amps": 63,
            "Voltage": 400,
            "PowerKW": 43,
            "CurrentTypeID": 20,
            "Quantity": 1
        },
        {
            "ID": 269271,
            "ConnectionTypeID": 25,
            "StatusTypeID": 50,
            "LevelID": 2,
            "Amps": 32,
            "Voltage": 400,
            "PowerKW": 22,
            "CurrentTypeID": 20,
            "Quantity": 2
        }
    ],
    "NumberOfPoints": 4,
    "StatusTypeID": 50,
    "DateLastStatusUpdate": "2021-03-21T10:14:00Z",
    "DataQualityLevel": 1,
    "DateCreated": "2021-03-21T09:56:00Z",
    "SubmissionStatusTypeID": 200
}