{
    "IsRecentlyVerified": false,
    "ID": 169645,
    "UUID": "99E83C3D-3EDC-4536-9886-0FD12AB0D544",
    "DataProviderID": 1,
    "OperatorID": 1,
    "UsageTypeID": 1,
    "UsageCost": "Free",
    "AddressInfo": {
        "ID": 170004,
        "Title": "Virginia International Raceway",
        "AddressLine1": "Halifax Count",
        "StateOrProvince": "Virginia",
        "Postcode": "27305",
        "CountryID": 2,
        "Latitude": 36.5540539,
        "Longitude": -79.1976912,
        "DistanceUnit": 0
    },
    "Connections": [
        {
            "ID": 258260,
            "ConnectionTypeID": 32,
            "StatusTypeID": 50,
            "LevelID": 3,
            "CurrentTypeID": 30,
            "Quantity": 1
        },
        {
            "ID": 258261,
            "ConnectionTypeID": 2,
            "StatusTypeID": 50,
            "LevelID": 3,
            "CurrentTypeID": 30,
            "Quantity": 1
        }
    ],
    "NumberOfPoints": 1,
    "StatusTypeID": 50,
    "DateLastStatusUpdate": "2021-07-28T06:53:00Z",
    "DataQualityLevel": 1,
    "DateCreated": "2020-10-27T01:02:00Z",
    "SubmissionStatusTypeID": 200
}