{
    "MediaItems": [
        {
            "ID": 26729,
            "ChargePointID": 172401,
            "ItemURL": "https://s3-ap-southeast-2.amazonaws.com/openchargemap/images/PT/OCM172401/OCM-172401.orig.2021030116545221.jpg",
            "ItemThumbnailURL": "https://s3-ap-southeast-2.amazonaws.com/openchargemap/images/PT/OCM172401/OCM-172401.thmb.2021030116545221.jpg",
            "Comment": "",
            "IsEnabled": true,
            "IsVideo": false,
            "IsFeaturedItem": false,
            "IsExternalResource": false,
            "User": {
                "ID": 28510,
                "Username": "Filipe Esteves"
            },
            "DateCreated": "2021-03-01T16:55:00Z"
        }
    ],
    "IsRecentlyVerified": false,
    "ID": 172401,
    "UUID": "A5DF35B3-359A-4D6F-BE48-6AFF725736C3",
    "DataProviderID": 1,
    "OperatorID": 3431,
    "UsageTypeID": 4,
    "UsageCost": "0.18€ / kWh",
    "AddressInfo": {
        "ID": 172760,
        "Title": "Continente São João da Madeira",
        "AddressLine1": "Continente",
        "Town": "São João da Madeira",
        "StateOrProvince": "Aveiro",
        "Postcode": "3700-193",
        "CountryID": 180,
        "Latitude": 40.88972341483861,
        "Longitude": -8.4912190178635,
        "AccessComments": "09:00>21:00",
        "RelatedURL": "https://plugcharge.continente.pt/",
        "DistanceUnit": 0
    },
    "Connections": [
        {
            "ID": 263596,
            "ConnectionTypeID": 25,
            "StatusTypeID": 50,
            "LevelID": 2,
            "Amps": 32,
            "Voltage": 400,
            "PowerKW": 22,
            "CurrentTypeID": 20,
            "Quantity": 4
        },
        {
            "ID": 263597,
            "ConnectionTypeID": 2,
            "StatusTypeID": 50,
            "LevelID": 3,
            "Amps": 120,
            "Voltage": 500,
            "PowerKW": 50,
            "CurrentTypeID": 30,
            "Quantity": 1
        },
        {
            "ID": 263598,
            "ConnectionTypeID": 33,
            "StatusTypeID": 50,
            "LevelID": 3,
            "Amps": 125,
            "Voltage": 500,
            "PowerKW": 50,
            "CurrentTypeID": 30,
            "Quantity": 1
        }
    ],
    "NumberOfPoints": 5,
    "GeneralComments": "Continente Plug&Charge App",
    "StatusTypeID": 50,
    "DateLastStatusUpdate": "2021-03-01T16:55:00Z",
    "DataQualityLevel": 1,
    "DateCreated": "2021-01-31T20:19:00Z",
    "SubmissionStatusTypeID": 200
}