{
    "IsRecentlyVerified": false,
    "ID": 178819,
    "UUID": "43C6EDEE-5BB0-4C4B-8291-1D70D7427A7A",
    "DataProviderID": 29,
    "DataProvidersReference": "13290",
    "OperatorID": 45,
    "AddressInfo": {
        "ID": 179178,
        "Title": "Kelheimwinzerstraße 125",
        "AddressLine1": "Kelheimwinzerstraße 125",
        "Town": "Kelheim",
        "Postcode": "93309",
        "CountryID": 87,
        "Latitude": 48.918554,
        "Longitude": 11.891116,
        "DistanceUnit": 0
    },
    "Connections": [
        {
            "ID": 279758,
            "ConnectionTypeID": 25,
            "StatusTypeID": 50,
            "LevelID": 2,
            "PowerKW": 22,
            "CurrentTypeID": 20
        },
        {
            "ID": 279759,
            "ConnectionTypeID": 25,
            "StatusTypeID": 50,
            "LevelID": 2,
            "PowerKW": 22,
            "CurrentTypeID": 20
        }
    ],
    "StatusTypeID": 0,
    "DateLastStatusUpdate": "2021-07-09T03:14:00Z",
    "MetadataValues": [
        {
            "ID": 11113,
            "MetadataFieldID": 4,
            "ItemValue": "Data from the German chargepoint registry provided by Bundesnetzagentur.de under the CC-BY 4.0 license"
        }
    ],
    "DataQualityLevel": 3,
    "DateCreated": "2021-07-08T09:50:00Z",
    "SubmissionStatusTypeID": 100
}