{
    "MediaItems": [
        {
            "ID": 18298,
            "ChargePointID": 16320,
            "ItemURL": "https://s3-ap-southeast-2.amazonaws.com/openchargemap/images/GB/OCM16320/OCM-16320.orig.2019050911430905.jpg",
            "ItemThumbnailURL": "https://s3-ap-southeast-2.amazonaws.com/openchargemap/images/GB/OCM16320/OCM-16320.thmb.2019050911430905.jpg",
            "Comment": "",
            "IsEnabled": true,
            "IsVideo": false,
            "IsFeaturedItem": false,
            "IsExternalResource": false,
            "User": {
                "ID": 15366,
                "Username": "ZCWCara"
            },
            "DateCreated": "2019-05-09T11:43:00Z"
        }
    ],
    "IsRecentlyVerified": false,
    "ID": 16320,
    "UUID": "A365973A-70B9-4561-B7F1-A538E2F65765",
    "DataProviderID": 1,
    "OperatorID": 19,
    "UsageTypeID": 1,
    "AddressInfo": {
        "ID": 16665,
        "Title": "Gaunts Ltd",
        "AddressLine1": "Springfield Commercial Centre",
        "AddressLine2": "Bagley Lane",
        "Town": "Farsley",
        "StateOrProvince": "Yorkshire",
        "Postcode": "LS28 5LY",
        "CountryID": 1,
        "Latitude": 53.8174625,
        "Longitude": -1.6648668999999927,
        "ContactTelephone1": "0113 236 3555",
        "ContactEmail": "enquiries@gauntsproperty.co.uk",
        "RelatedURL": "http://www.gauntsproperty.co.uk",
        "DistanceUnit": 0
    },
    "Connections": [
        {
            "ID": 14784,
            "ConnectionTypeID": 25,
            "StatusTypeID": 50,
            "LevelID": 2,
            "Amps": 32,
            "Voltage": 230,
            "PowerKW": 7,
            "CurrentTypeID": 20,
            "Quantity": 1
        }
    ],
    "NumberOfPoints": 1,
    "StatusTypeID": 50,
    "DateLastStatusUpdate": "2019-05-09T11:43:00Z",
    "DataQualityLevel": 1,
    "DateCreated": "2013-04-09T10:47:00Z",
    "SubmissionStatusTypeID": 200
}