{
    "IsRecentlyVerified": false,
    "ID": 104029,
    "UUID": "08125977-8AD4-4382-8548-1D9A2641DE59",
    "DataProviderID": 1,
    "OperatorID": 45,
    "UsageTypeID": 6,
    "AddressInfo": {
        "ID": 104375,
        "Title": "Deutsche Welle - Tiefgarage",
        "AddressLine1": "Charles-de-Gaulles-Straße 20",
        "Town": "Bonn",
        "StateOrProvince": "Bonn",
        "Postcode": "53113",
        "CountryID": 87,
        "Latitude": 50.7155965,
        "Longitude": 7.129353100000003,
        "ContactTelephone1": "+49 228 429-0",
        "AccessComments": "Für Gäste nach Voranmeldung; Ladeboxen bei der blau markierten Wand",
        "RelatedURL": "http://www.dw.com/de/anfahrt-dw/a-40038185",
        "DistanceUnit": 0
    },
    "Connections": [
        {
            "ID": 146838,
            "ConnectionTypeID": 25,
            "StatusTypeID": 50,
            "LevelID": 2,
            "Amps": 32,
            "Voltage": 400,
            "PowerKW": 22,
            "CurrentTypeID": 20,
            "Quantity": 3
        }
    ],
    "NumberOfPoints": 3,
    "StatusTypeID": 50,
    "DateLastStatusUpdate": "2018-05-15T06:05:00Z",
    "DataQualityLevel": 1,
    "DateCreated": "2018-05-15T06:05:00Z",
    "SubmissionStatusTypeID": 200
}