{
    "IsRecentlyVerified": false,
    "ID": 66491,
    "UUID": "85EF0710-D10E-4215-897E-8070DFBBF6CC",
    "DataProviderID": 1,
    "OperatorID": 22,
    "OperatorsReference": "C67YW",
    "UsageTypeID": 4,
    "AddressInfo": {
        "ID": 66837,
        "Title": "County Hall Car Park",
        "AddressLine1": "John Street Lower",
        "Town": "Kilkenny",
        "StateOrProvince": "County Kilkenny",
        "CountryID": 3,
        "Latitude": 52.652859,
        "Longitude": -7.248367,
        "DistanceUnit": 0
    },
    "Connections": [
        {
            "ID": 91879,
            "ConnectionTypeID": 25,
            "StatusTypeID": 50,
            "LevelID": 2,
            "Amps": 32,
            "Voltage": 400,
            "PowerKW": 22,
            "CurrentTypeID": 20,
            "Quantity": 2
        }
    ],
    "NumberOfPoints": 2,
    "StatusTypeID": 50,
    "DateLastStatusUpdate": "2019-06-03T15:08:00Z",
    "DataQualityLevel": 1,
    "DateCreated": "2016-05-22T10:03:00Z",
    "SubmissionStatusTypeID": 100
}