{
    "IsRecentlyVerified": false,
    "ID": 97119,
    "UUID": "FA3C3EDC-6051-4E33-8EFF-42577D1840A6",
    "DataProviderID": 1,
    "OperatorID": 3,
    "OperatorsReference": "PG-80965",
    "UsageTypeID": 4,
    "UsageCost": "£2.50 fixed rate",
    "AddressInfo": {
        "ID": 97465,
        "Title": "University of Lincoln-Charlotte Scott",
        "AddressLine1": "Brayford Pool",
        "Town": "Lincoln",
        "Postcode": "LN6 7FL",
        "CountryID": 1,
        "Latitude": 53.228914,
        "Longitude": -0.55626,
        "DistanceUnit": 0
    },
    "Connections": [
        {
            "ID": 137887,
            "ConnectionTypeID": 25,
            "StatusTypeID": 50,
            "LevelID": 2,
            "Amps": 32,
            "Voltage": 230,
            "PowerKW": 7,
            "CurrentTypeID": 10,
            "Quantity": 2
        }
    ],
    "NumberOfPoints": 2,
    "GeneralComments": "This is an open charge unit installed at the University of Lincoln - Charlotte Scott building car park in Brayford Pool, Lincoln",
    "StatusTypeID": 50,
    "DateLastStatusUpdate": "2019-12-20T09:09:00Z",
    "DataQualityLevel": 1,
    "DateCreated": "2018-01-05T13:47:00Z",
    "SubmissionStatusTypeID": 200
}