{
    "IsRecentlyVerified": false,
    "ID": 187493,
    "UUID": "7CBFF740-EE7A-4FC5-8E78-7572759D2053",
    "DataProviderID": 18,
    "DataProvidersReference": "a914d7f3b67b810c363bf6be185381ac",
    "OperatorID": 2244,
    "UsageTypeID": 5,
    "AddressInfo": {
        "ID": 187852,
        "Title": "15 Stormont Road",
        "AddressLine1": "15 Stormont Road",
        "Town": "London",
        "Postcode": "SW11 5EQ",
        "CountryID": 1,
        "Latitude": -0.156223,
        "Longitude": 51.46478,
        "AccessComments": "",
        "RelatedURL": "https://www.ubitricity.com",
        "DistanceUnit": 0
    },
    "Connections": [
        {
            "ID": 302627,
            "ConnectionTypeID": 25,
            "Reference": "suby1100005231",
            "StatusTypeID": 50,
            "LevelID": 2,
            "Amps": 16,
            "Voltage": 230,
            "PowerKW": 3.7,
            "CurrentTypeID": 10
        }
    ],
    "StatusTypeID": 0,
    "DateLastStatusUpdate": "2021-07-12T03:38:00Z",
    "MetadataValues": [
        {
            "ID": 19733,
            "MetadataFieldID": 4,
            "ItemValue": "Contains public sector information licensed under the Open Government Licence v2.0. http://www.nationalarchives.gov.uk/doc/open-government-licence/version/2/"
        }
    ],
    "DataQualityLevel": 3,
    "DateCreated": "2021-07-12T03:38:00Z",
    "SubmissionStatusTypeID": 100
}