{
    "IsRecentlyVerified": false,
    "ID": 128233,
    "UUID": "F1C2D9FB-3BC1-4973-9437-58A19DB0F6CE",
    "DataProviderID": 1,
    "OperatorID": 3272,
    "UsageTypeID": 1,
    "AddressInfo": {
        "ID": 128579,
        "Title": "Services Techniques de Saint-Imier (STSI)",
        "AddressLine1": "Rue du Collège 5",
        "Town": "Saint-Imier",
        "Postcode": "2610",
        "CountryID": 217,
        "Latitude": 47.1532780307571,
        "Longitude": 6.99897822005494,
        "DistanceUnit": 0
    },
    "Connections": [
        {
            "ID": 179488,
            "ConnectionTypeID": 1036,
            "StatusTypeID": 50,
            "LevelID": 2,
            "Amps": 32,
            "Voltage": 400,
            "PowerKW": 22,
            "CurrentTypeID": 20,
            "Quantity": 2
        },
        {
            "ID": 179489,
            "ConnectionTypeID": 1,
            "StatusTypeID": 50,
            "LevelID": 2,
            "Amps": 32,
            "Voltage": 230,
            "PowerKW": 7,
            "CurrentTypeID": 10,
            "Quantity": 2
        }
    ],
    "NumberOfPoints": 2,
    "StatusTypeID": 50,
    "DateLastStatusUpdate": "2019-06-19T08:27:00Z",
    "DataQualityLevel": 1,
    "DateCreated": "2019-06-18T20:51:00Z",
    "SubmissionStatusTypeID": 200
}