{
    "IsRecentlyVerified": false,
    "ID": 137238,
    "UUID": "E0E5B21E-F20E-465A-950A-EBD3C543E425",
    "DataProviderID": 2,
    "DataProvidersReference": "135494",
    "OperatorID": 9,
    "UsageTypeID": 1,
    "AddressInfo": {
        "ID": 137584,
        "Title": "Bay Harbor Islands Municipal Parking",
        "AddressLine1": "1165 95th St",
        "Town": "Bay Harbor Islands",
        "StateOrProvince": "FL",
        "Postcode": "33154",
        "CountryID": 2,
        "Latitude": 25.885801,
        "Longitude": -80.131956,
        "ContactTelephone1": "888-998-2546",
        "AccessComments": "unknown",
        "RelatedURL": "http://www.blinkcharging.com/",
        "DistanceUnit": 0
    },
    "Connections": [
        {
            "ID": 192106,
            "ConnectionTypeID": 1,
            "LevelID": 2,
            "Amps": 16,
            "Voltage": 230,
            "PowerKW": 3,
            "CurrentTypeID": 10,
            "Quantity": 1
        }
    ],
    "StatusTypeID": 50,
    "DateLastStatusUpdate": "2019-12-24T09:04:00Z",
    "DataQualityLevel": 3,
    "DateCreated": "2019-12-24T09:04:00Z",
    "SubmissionStatusTypeID": 100
}