{
    "IsRecentlyVerified": false,
    "ID": 89597,
    "UUID": "521734DC-F1FD-4C8A-B744-49A4EF7F26D7",
    "DataProviderID": 2,
    "DataProvidersReference": "85604",
    "OperatorID": 5,
    "UsageTypeID": 1,
    "AddressInfo": {
        "ID": 89943,
        "Title": "PUB SAFETY CTR",
        "AddressLine1": "5301 W 88th Ave",
        "Town": "Westminster",
        "StateOrProvince": "CO",
        "Postcode": "80031",
        "CountryID": 2,
        "Latitude": 39.858898,
        "Longitude": -105.058479,
        "ContactTelephone1": "888-758-4389",
        "AccessComments": "24 hours daily",
        "RelatedURL": "http://www.chargepoint.com/",
        "DistanceUnit": 0
    },
    "Connections": [
        {
            "ID": 127015,
            "ConnectionTypeID": 1,
            "LevelID": 2,
            "Amps": 16,
            "Voltage": 230,
            "PowerKW": 3,
            "CurrentTypeID": 10,
            "Quantity": 8
        }
    ],
    "DateLastStatusUpdate": "2019-04-06T05:04:00Z",
    "DataQualityLevel": 3,
    "DateCreated": "2017-06-22T08:16:00Z",
    "SubmissionStatusTypeID": 100
}