{
    "IsRecentlyVerified": false,
    "ID": 158350,
    "UUID": "6168CA13-217B-43B4-A18C-D56CEC8C6BC2",
    "DataProviderID": 2,
    "DataProvidersReference": "154180",
    "OperatorID": 5,
    "UsageTypeID": 1,
    "AddressInfo": {
        "ID": 158704,
        "Title": "CITY CEDAR PARK",
        "AddressLine1": "500 Cypress Creek Road",
        "Town": "Cedar Park",
        "StateOrProvince": "TX",
        "Postcode": "78613",
        "CountryID": 2,
        "Latitude": 30.4957796,
        "Longitude": -97.8219629,
        "ContactTelephone1": "888-758-4389",
        "AccessComments": "24 hours daily",
        "RelatedURL": "http://www.chargepoint.com/",
        "DistanceUnit": 0
    },
    "Connections": [
        {
            "ID": 228318,
            "ConnectionTypeID": 1,
            "LevelID": 2,
            "Amps": 16,
            "Voltage": 230,
            "PowerKW": 3.7,
            "CurrentTypeID": 10,
            "Quantity": 2
        }
    ],
    "StatusTypeID": 50,
    "DateLastStatusUpdate": "2020-06-26T02:54:00Z",
    "DataQualityLevel": 3,
    "DateCreated": "2020-06-26T02:54:00Z",
    "SubmissionStatusTypeID": 100
}