{
    "IsRecentlyVerified": false,
    "ID": 179252,
    "UUID": "29C256BB-840E-44BD-9E38-0FFE781F42BA",
    "DataProviderID": 29,
    "DataProvidersReference": "3723",
    "AddressInfo": {
        "ID": 179611,
        "Title": "Kehrlesgasse 7",
        "AddressLine1": "Kehrlesgasse 7",
        "Town": "Neuses an den Eichen",
        "Postcode": "96269",
        "CountryID": 87,
        "Latitude": 50.178852,
        "Longitude": 10.907926,
        "DistanceUnit": 0
    },
    "Connections": [
        {
            "ID": 280804,
            "ConnectionTypeID": 33,
            "StatusTypeID": 50,
            "LevelID": 3,
            "PowerKW": 150,
            "CurrentTypeID": 30
        },
        {
            "ID": 280805,
            "ConnectionTypeID": 33,
            "StatusTypeID": 50,
            "LevelID": 3,
            "PowerKW": 150,
            "CurrentTypeID": 30
        },
        {
            "ID": 297618,
            "ConnectionTypeID": 25,
            "StatusTypeID": 50,
            "LevelID": 2,
            "PowerKW": 22,
            "CurrentTypeID": 20
        }
    ],
    "StatusTypeID": 50,
    "DateLastStatusUpdate": "2021-07-12T02:44:00Z",
    "MetadataValues": [
        {
            "ID": 11546,
            "MetadataFieldID": 4,
            "ItemValue": "Data from the German chargepoint registry provided by Bundesnetzagentur.de under the CC-BY 4.0 license"
        }
    ],
    "DataQualityLevel": 3,
    "DateCreated": "2021-07-08T09:59:00Z",
    "SubmissionStatusTypeID": 100
}