{
    "IsRecentlyVerified": false,
    "ID": 62017,
    "UUID": "6CB1A230-B6DD-4AD5-B2FC-8E3A8829D8C9",
    "DataProviderID": 1,
    "OperatorID": 23,
    "OperatorsReference": "13878",
    "UsageTypeID": 1,
    "UsageCost": "Free",
    "AddressInfo": {
        "ID": 62363,
        "Title": "The Carlyle DuPont Circle - Tesla",
        "AddressLine1": "1731 New Hampshire Ave NW",
        "Town": "Washington",
        "StateOrProvince": "DC",
        "Postcode": "20009",
        "CountryID": 2,
        "Latitude": 38.9133407,
        "Longitude": -77.0394593,
        "ContactTelephone1": "202-234-3200  877-798-3752",
        "AccessComments": "24 hours daily; for Tesla use only; for guest use only; see valet for access",
        "RelatedURL": "http://www.teslamotors.com/supercharger",
        "DistanceUnit": 0
    },
    "Connections": [
        {
            "ID": 78919,
            "ConnectionTypeID": 30,
            "StatusTypeID": 50,
            "LevelID": 2,
            "Amps": 16,
            "Voltage": 230,
            "PowerKW": 8,
            "CurrentTypeID": 10,
            "Quantity": 1
        }
    ],
    "NumberOfPoints": 1,
    "StatusTypeID": 50,
    "DateLastStatusUpdate": "2017-01-26T16:35:00Z",
    "DataQualityLevel": 3,
    "DateCreated": "2016-03-03T11:38:00Z",
    "SubmissionStatusTypeID": 100
}