{
    "IsRecentlyVerified": false,
    "ID": 175287,
    "UUID": "B7923300-10EC-41B9-A371-C2552BB3221B",
    "DataProviderID": 1,
    "OperatorID": 3253,
    "UsageTypeID": 4,
    "AddressInfo": {
        "ID": 175646,
        "Title": "A1 Anschlussstelle -Vorchdorf",
        "AddressLine1": "Asamerstraße 1",
        "Town": "Vorchdorf",
        "StateOrProvince": "Upper Austria",
        "Postcode": "4655",
        "CountryID": 19,
        "Latitude": 48.01098,
        "Longitude": 13.92345,
        "DistanceUnit": 0
    },
    "Connections": [
        {
            "ID": 271845,
            "ConnectionTypeID": 2,
            "StatusTypeID": 50,
            "LevelID": 3,
            "PowerKW": 50,
            "CurrentTypeID": 30,
            "Quantity": 1
        },
        {
            "ID": 271846,
            "ConnectionTypeID": 33,
            "StatusTypeID": 50,
            "LevelID": 3,
            "PowerKW": 50,
            "CurrentTypeID": 30,
            "Quantity": 1
        },
        {
            "ID": 271847,
            "ConnectionTypeID": 1036,
            "StatusTypeID": 50,
            "LevelID": 3,
            "PowerKW": 43,
            "CurrentTypeID": 20,
            "Quantity": 1
        }
    ],
    "NumberOfPoints": 2,
    "StatusTypeID": 50,
    "DateLastStatusUpdate": "2021-05-07T07:29:00Z",
    "DataQualityLevel": 1,
    "DateCreated": "2021-05-06T11:07:00Z",
    "SubmissionStatusTypeID": 200
}