{
    "IsRecentlyVerified": false,
    "ID": 51087,
    "UUID": "F7395F53-8E1F-4573-A059-4EF1A624AE71",
    "DataProviderID": 26,
    "DataProvidersReference": "65943",
    "OperatorID": 63,
    "OperatorsReference": "Dorpsstraat 54",
    "UsageCost": "0.00 onbekend",
    "AddressInfo": {
        "ID": 51433,
        "Title": "Dorpsstraat 47",
        "AddressLine1": "Dorpsstraat 47",
        "Town": "Terschelling",
        "Postcode": "8896 JC",
        "CountryID": 159,
        "Latitude": 53.396937513583,
        "Longitude": 5.343132019043,
        "RelatedURL": "http://www.greenflux.nl",
        "DistanceUnit": 0
    },
    "Connections": [
        {
            "ID": 63157,
            "ConnectionTypeID": 25,
            "LevelID": 2,
            "PowerKW": 3.7,
            "CurrentTypeID": 10
        }
    ],
    "NumberOfPoints": 4,
    "StatusTypeID": 50,
    "DateLastStatusUpdate": "2016-06-04T02:56:00Z",
    "DataQualityLevel": 3,
    "DateCreated": "2015-07-22T09:54:00Z",
    "SubmissionStatusTypeID": 100
}