{
    "IsRecentlyVerified": false,
    "ID": 184865,
    "UUID": "CA2BE3F7-44D4-41F7-9184-A314555AFE7F",
    "DataProviderID": 29,
    "DataProvidersReference": "12336",
    "OperatorID": 220,
    "AddressInfo": {
        "ID": 185224,
        "Title": "Geradestraße 22",
        "AddressLine1": "Geradestraße 22",
        "Town": "Hamburg",
        "Postcode": "21073",
        "CountryID": 87,
        "Latitude": 53.45288,
        "Longitude": 9.98207,
        "DistanceUnit": 0
    },
    "Connections": [
        {
            "ID": 293656,
            "ConnectionTypeID": 28,
            "StatusTypeID": 50,
            "LevelID": 2,
            "PowerKW": 22,
            "CurrentTypeID": 10
        },
        {
            "ID": 293657,
            "ConnectionTypeID": 28,
            "StatusTypeID": 50,
            "LevelID": 2,
            "PowerKW": 22,
            "CurrentTypeID": 10
        }
    ],
    "StatusTypeID": 50,
    "DateLastStatusUpdate": "2021-07-09T03:29:00Z",
    "MetadataValues": [
        {
            "ID": 17156,
            "MetadataFieldID": 4,
            "ItemValue": "Data from the German chargepoint registry provided by Bundesnetzagentur.de under the CC-BY 4.0 license"
        }
    ],
    "DataQualityLevel": 3,
    "DateCreated": "2021-07-08T10:06:00Z",
    "SubmissionStatusTypeID": 100
}