{
    "IsRecentlyVerified": false,
    "ID": 93764,
    "UUID": "B9B70D3A-0F19-414F-BB48-DC8686FC39C9",
    "DataProviderID": 1,
    "OperatorID": 23,
    "OperatorsReference": "36134",
    "UsageTypeID": 4,
    "AddressInfo": {
        "ID": 94110,
        "Title": "Wilcom's Inn",
        "AddressLine1": "11234 Fingerboard RD",
        "Town": "Monrovia",
        "StateOrProvince": "Maryland",
        "Postcode": "21770",
        "CountryID": 2,
        "Latitude": 39.346653,
        "Longitude": -77.270838,
        "ContactTelephone1": "(301) 798-8686",
        "DistanceUnit": 0
    },
    "Connections": [
        {
            "ID": 132746,
            "ConnectionTypeID": 30,
            "StatusTypeID": 50,
            "LevelID": 2,
            "PowerKW": 16,
            "CurrentTypeID": 20,
            "Quantity": 3
        }
    ],
    "NumberOfPoints": 3,
    "GeneralComments": "3 Tesla Connectors, up to 16kW.Available for customers. Self park.",
    "StatusTypeID": 50,
    "DateLastStatusUpdate": "2017-10-08T05:32:00Z",
    "DataQualityLevel": 1,
    "DateCreated": "2017-10-08T05:32:00Z",
    "SubmissionStatusTypeID": 200
}