{
    "IsRecentlyVerified": false,
    "ID": 102444,
    "UUID": "6F919100-9543-4614-8001-A9191BD83A04",
    "DataProviderID": 2,
    "DataProvidersReference": "94814",
    "UsageTypeID": 1,
    "AddressInfo": {
        "ID": 102790,
        "Title": "ADP - Atlanta",
        "AddressLine1": "5680 New Northside Dr NW",
        "Town": "Atlanta",
        "StateOrProvince": "GA",
        "Postcode": "30328",
        "CountryID": 2,
        "Latitude": 33.910268,
        "Longitude": -84.42923,
        "ContactTelephone1": "866-816-7584",
        "AccessComments": "Office business hours; for employee and guest use only",
        "RelatedURL": "http://evconnect.com/",
        "DistanceUnit": 0
    },
    "Connections": [
        {
            "ID": 144523,
            "ConnectionTypeID": 1,
            "LevelID": 2,
            "Amps": 16,
            "Voltage": 230,
            "PowerKW": 3,
            "CurrentTypeID": 10,
            "Quantity": 4
        }
    ],
    "DateLastStatusUpdate": "2019-04-06T04:01:00Z",
    "DataQualityLevel": 3,
    "DateCreated": "2018-04-21T04:13:00Z",
    "SubmissionStatusTypeID": 100
}