{
    "IsRecentlyVerified": false,
    "ID": 109264,
    "UUID": "50D95558-F920-43CA-B4DD-6232C9D9A9D6",
    "DataProviderID": 1,
    "OperatorID": 23,
    "OperatorsReference": "46368",
    "UsageTypeID": 4,
    "AddressInfo": {
        "ID": 109610,
        "Title": "Marina Punta Gabbiani",
        "AddressLine1": "Viale Aprilia Marittima",
        "Town": "Aprilia Marittima",
        "Postcode": "33050",
        "CountryID": 112,
        "Latitude": 45.69446,
        "Longitude": 13.073939,
        "ContactTelephone1": "+39 335 664 0378",
        "DistanceUnit": 0
    },
    "Connections": [
        {
            "ID": 154382,
            "ConnectionTypeID": 30,
            "StatusTypeID": 50,
            "LevelID": 2,
            "Amps": 32,
            "Voltage": 400,
            "PowerKW": 22,
            "CurrentTypeID": 20,
            "Quantity": 2
        }
    ],
    "NumberOfPoints": 2,
    "GeneralComments": "2 Tesla Connectors, up to 22kW.Available for customers. Please call ahead.",
    "StatusTypeID": 50,
    "DateLastStatusUpdate": "2018-10-11T14:07:00Z",
    "DataQualityLevel": 1,
    "DateCreated": "2018-10-11T14:07:00Z",
    "SubmissionStatusTypeID": 200
}