{
    "MediaItems": [
        {
            "ID": 17040,
            "ChargePointID": 112918,
            "ItemURL": "https://s3-ap-southeast-2.amazonaws.com/openchargemap/images/DE/OCM112918/OCM-112918.orig.2018112317050625.jpg",
            "ItemThumbnailURL": "https://s3-ap-southeast-2.amazonaws.com/openchargemap/images/DE/OCM112918/OCM-112918.thmb.2018112317050625.jpg",
            "Comment": "",
            "IsEnabled": true,
            "IsVideo": false,
            "IsFeaturedItem": false,
            "IsExternalResource": false,
            "User": {
                "ID": 19398,
                "Username": "EWP"
            },
            "DateCreated": "2018-11-23T17:05:00Z"
        }
    ],
    "IsRecentlyVerified": false,
    "ID": 112918,
    "UUID": "3CA8F22B-5D33-44AF-BC42-339BCBDE2CC7",
    "DataProviderID": 1,
    "OperatorID": 3325,
    "UsageTypeID": 1,
    "AddressInfo": {
        "ID": 113264,
        "Title": "Energie und Wasser Potsdam GmbH (ENSO ID 7215)",
        "AddressLine1": "Steinstraße 101",
        "AddressLine2": "Am Stern",
        "Town": "Potsdam",
        "StateOrProvince": "Brandenburg",
        "Postcode": "14480",
        "CountryID": 87,
        "Latitude": 52.39089202728968,
        "Longitude": 13.121704947261378,
        "RelatedURL": "https://www.swp-potsdam.de/de/energie/elektromobilität/",
        "DistanceUnit": 0
    },
    "Connections": [
        {
            "ID": 159043,
            "ConnectionTypeID": 25,
            "StatusTypeID": 50,
            "LevelID": 2,
            "Amps": 32,
            "Voltage": 400,
            "PowerKW": 22,
            "CurrentTypeID": 20,
            "Quantity": 2
        }
    ],
    "NumberOfPoints": 2,
    "GeneralComments": "Ladepunkte: 2 x 22 kW, Typ 2, zwei Parkplätze Zugangs-/Bezahlmodus: E-Charging via App und e-Roaming via RFID-Karte oder spezieller App (z.B. Plugsurfing, The New Motion, BMW, VW)Betreiber: Energie und Wasser PotsdamKontakt im Störungsfall: 0800 0320020",
    "StatusTypeID": 50,
    "DateLastStatusUpdate": "2021-08-09T07:08:00Z",
    "DataQualityLevel": 1,
    "DateCreated": "2018-11-23T17:04:00Z",
    "SubmissionStatusTypeID": 200
}