{
    "IsRecentlyVerified": false,
    "ID": 74706,
    "UUID": "B935C521-692E-41B3-B89E-7EB4B67FFDEE",
    "DataProviderID": 1,
    "DataProvidersReference": "3638",
    "AddressInfo": {
        "ID": 75052,
        "Title": "Stangeland borettslag",
        "AddressLine1": "Guletjødnvegen 91-97",
        "Town": "KOPERVIK",
        "StateOrProvince": "Rogaland",
        "Postcode": "4250",
        "CountryID": 168,
        "Latitude": 59.27501,
        "Longitude": 5.31701,
        "AccessComments": "På parkeringsplassen.",
        "DistanceUnit": 0
    },
    "Connections": [
        {
            "ID": 107436,
            "ConnectionTypeID": 0,
            "Reference": "1",
            "LevelID": 2,
            "Amps": 16,
            "Voltage": 230,
            "PowerKW": 3.7,
            "Comments": "Mode 1"
        },
        {
            "ID": 107437,
            "ConnectionTypeID": 0,
            "Reference": "2",
            "LevelID": 2,
            "Amps": 16,
            "Voltage": 230,
            "PowerKW": 3.7,
            "Comments": "Mode 1"
        },
        {
            "ID": 107438,
            "ConnectionTypeID": 0,
            "Reference": "3",
            "LevelID": 2,
            "Amps": 16,
            "Voltage": 230,
            "PowerKW": 3.7,
            "Comments": "Mode 1"
        },
        {
            "ID": 107439,
            "ConnectionTypeID": 0,
            "Reference": "4",
            "LevelID": 2,
            "Amps": 16,
            "Voltage": 230,
            "PowerKW": 3.7,
            "Comments": "Mode 1"
        },
        {
            "ID": 128897,
            "ConnectionTypeID": 0,
            "Reference": "5",
            "LevelID": 2,
            "Amps": 16,
            "Voltage": 230,
            "PowerKW": 3.7,
            "Comments": "Mode 1"
        },
        {
            "ID": 128898,
            "ConnectionTypeID": 0,
            "Reference": "6",
            "LevelID": 2,
            "Amps": 16,
            "Voltage": 230,
            "PowerKW": 3.7,
            "Comments": "Mode 1"
        }
    ],
    "NumberOfPoints": 6,
    "DateLastStatusUpdate": "2020-05-26T08:22:00Z",
    "DataQualityLevel": 2,
    "DateCreated": "2016-12-03T02:36:00Z",
    "SubmissionStatusTypeID": 100
}