{
    "IsRecentlyVerified": false,
    "ID": 181010,
    "UUID": "4E4BD237-CDFA-4A14-B875-283ACDA826E4",
    "DataProviderID": 29,
    "DataProvidersReference": "9536,4982",
    "OperatorID": 86,
    "AddressInfo": {
        "ID": 181369,
        "Title": "Industriestraße 10",
        "AddressLine1": "Industriestraße 10",
        "Town": "Bad Neustadt",
        "Postcode": "97616",
        "CountryID": 87,
        "Latitude": 50.33328,
        "Longitude": 10.22251,
        "DistanceUnit": 0
    },
    "Connections": [
        {
            "ID": 284794,
            "ConnectionTypeID": 25,
            "StatusTypeID": 50,
            "LevelID": 2,
            "PowerKW": 22,
            "CurrentTypeID": 20
        },
        {
            "ID": 284795,
            "ConnectionTypeID": 25,
            "StatusTypeID": 50,
            "LevelID": 2,
            "PowerKW": 22,
            "CurrentTypeID": 20
        }
    ],
    "StatusTypeID": 50,
    "DateLastStatusUpdate": "2021-07-09T03:19:00Z",
    "MetadataValues": [
        {
            "ID": 13304,
            "MetadataFieldID": 4,
            "ItemValue": "Data from the German chargepoint registry provided by Bundesnetzagentur.de under the CC-BY 4.0 license"
        }
    ],
    "DataQualityLevel": 3,
    "DateCreated": "2021-07-08T10:01:00Z",
    "SubmissionStatusTypeID": 100
}