{
    "IsRecentlyVerified": false,
    "ID": 37150,
    "UUID": "7BA00004-F211-4DBB-80AC-D9AE5EFEF76A",
    "DataProviderID": 1,
    "OperatorID": 105,
    "OperatorsReference": "Essent EM-DE-05770020-01-00001",
    "UsageTypeID": 4,
    "AddressInfo": {
        "ID": 37496,
        "Title": "Am Dornbusch 2",
        "AddressLine1": "Am Dornbusch 2",
        "Town": "Lübbecke",
        "Postcode": "32312",
        "CountryID": 87,
        "Latitude": 52.316667,
        "Longitude": 8.626389,
        "DistanceUnit": 0
    },
    "Connections": [
        {
            "ID": 40661,
            "ConnectionTypeID": 25,
            "LevelID": 2,
            "PowerKW": 11
        },
        {
            "ID": 48685,
            "ConnectionTypeID": 25,
            "LevelID": 2,
            "PowerKW": 11
        }
    ],
    "NumberOfPoints": 1,
    "StatusTypeID": 50,
    "DateLastStatusUpdate": "2015-04-12T21:37:00Z",
    "DataQualityLevel": 3,
    "DateCreated": "2015-01-09T06:07:00Z",
    "SubmissionStatusTypeID": 200
}