{
    "IsRecentlyVerified": false,
    "ID": 51286,
    "UUID": "0062807E-EA59-41F5-9C7B-F97B495826F6",
    "DataProviderID": 26,
    "DataProvidersReference": "66692",
    "OperatorID": 103,
    "OperatorsReference": "Allego NLALLEGO0000871",
    "UsageCost": "0.00 jaarabonnement",
    "AddressInfo": {
        "ID": 51632,
        "Title": "Kerkhofstraat 15",
        "AddressLine1": "Kerkhofstraat 15",
        "Town": "Valkenswaard",
        "Postcode": "5554 HG",
        "CountryID": 159,
        "Latitude": 51.3526283,
        "Longitude": 5.4544389,
        "ContactTelephone1": "0800-3745337",
        "RelatedURL": "http://www.allego.eu/",
        "DistanceUnit": 0
    },
    "Connections": [
        {
            "ID": 63452,
            "ConnectionTypeID": 25,
            "LevelID": 2,
            "PowerKW": 22,
            "CurrentTypeID": 10
        },
        {
            "ID": 63453,
            "ConnectionTypeID": 25,
            "LevelID": 2,
            "PowerKW": 22,
            "CurrentTypeID": 10
        }
    ],
    "NumberOfPoints": 1,
    "StatusTypeID": 50,
    "DateLastStatusUpdate": "2016-06-04T02:38:00Z",
    "DataQualityLevel": 3,
    "DateCreated": "2015-07-24T06:28:00Z",
    "SubmissionStatusTypeID": 100
}