{
    "IsRecentlyVerified": false,
    "ID": 70759,
    "UUID": "37991F2E-C8FB-41A2-9AB2-8A16B29924C9",
    "DataProviderID": 1,
    "OperatorID": 25,
    "OperatorsReference": "hammersmithandfulham-11lalorstreet",
    "UsageTypeID": 4,
    "UsageCost": "£0.059/minute; min £1.18; other tariffs available",
    "AddressInfo": {
        "ID": 71105,
        "Title": "11 Lalor Street",
        "AddressLine1": "11 Lalor Street",
        "AddressLine2": "Hammersmith and Fulham",
        "Town": "London",
        "StateOrProvince": "England",
        "Postcode": "SW6 5SR",
        "CountryID": 1,
        "Latitude": 51.4739302,
        "Longitude": -0.2117961,
        "DistanceUnit": 0
    },
    "Connections": [
        {
            "ID": 101365,
            "ConnectionTypeID": 25,
            "StatusTypeID": 50,
            "LevelID": 2,
            "Amps": 32,
            "Voltage": 230,
            "PowerKW": 7,
            "CurrentTypeID": 10,
            "Quantity": 2
        },
        {
            "ID": 101366,
            "ConnectionTypeID": 1,
            "StatusTypeID": 50,
            "LevelID": 2,
            "Amps": 16,
            "Voltage": 230,
            "PowerKW": 4,
            "CurrentTypeID": 10,
            "Quantity": 2
        }
    ],
    "NumberOfPoints": 2,
    "StatusTypeID": 50,
    "DateLastStatusUpdate": "2017-12-12T06:35:00Z",
    "DataQualityLevel": 1,
    "DateCreated": "2016-08-09T15:36:00Z",
    "SubmissionStatusTypeID": 200
}