{
    "IsRecentlyVerified": false,
    "ID": 141751,
    "UUID": "02949BCF-C692-4DC0-BB43-D8C2B72B2097",
    "DataProviderID": 2,
    "DataProvidersReference": "149158",
    "OperatorID": 39,
    "UsageTypeID": 2,
    "AddressInfo": {
        "ID": 142103,
        "Title": "Baltimore Gas & Electric - EOB",
        "AddressLine1": "7309 Windsor Mill Rd",
        "Town": "Baltimore",
        "StateOrProvince": "MD",
        "Postcode": "21244",
        "CountryID": 2,
        "Latitude": 39.338695,
        "Longitude": -76.756847,
        "ContactTelephone1": "",
        "AccessComments": "",
        "RelatedURL": "http://www.semacharge.com/",
        "DistanceUnit": 0
    },
    "Connections": [
        {
            "ID": 197752,
            "ConnectionTypeID": 1,
            "LevelID": 2,
            "Amps": 16,
            "Voltage": 230,
            "PowerKW": 3.7,
            "CurrentTypeID": 10,
            "Quantity": 4
        }
    ],
    "StatusTypeID": 50,
    "DateLastStatusUpdate": "2020-06-26T03:01:00Z",
    "DataQualityLevel": 3,
    "DateCreated": "2019-12-24T09:16:00Z",
    "SubmissionStatusTypeID": 100
}