{
    "IsRecentlyVerified": false,
    "ID": 154138,
    "UUID": "EC43B9A1-46A8-4DB0-BCDE-23EB6FA29482",
    "DataProviderID": 28,
    "DataProvidersReference": "FR*S27*PSTPIERREVAUVRAY*BOURG",
    "AddressInfo": {
        "ID": 154491,
        "Title": "900096",
        "AddressLine1": "Centre Bourg Saint Pierre de Vauvray",
        "CountryID": 80,
        "Latitude": 49.231282,
        "Longitude": 1.22331,
        "AccessComments": "24/24 7/7 jours",
        "DistanceUnit": 0
    },
    "Connections": [
        {
            "ID": 216627,
            "ConnectionTypeID": 28,
            "StatusTypeID": 50,
            "LevelID": 2,
            "PowerKW": 22,
            "CurrentTypeID": 10
        },
        {
            "ID": 216628,
            "ConnectionTypeID": 1036,
            "StatusTypeID": 50,
            "LevelID": 2,
            "PowerKW": 22,
            "CurrentTypeID": 20
        },
        {
            "ID": 251000,
            "ConnectionTypeID": 28,
            "StatusTypeID": 50,
            "LevelID": 2,
            "PowerKW": 22,
            "CurrentTypeID": 10
        },
        {
            "ID": 251001,
            "ConnectionTypeID": 1036,
            "StatusTypeID": 50,
            "LevelID": 2,
            "PowerKW": 22,
            "CurrentTypeID": 20
        }
    ],
    "GeneralComments": "Borne hors service",
    "StatusTypeID": 50,
    "DateLastStatusUpdate": "2020-08-27T05:16:00Z",
    "DataQualityLevel": 2,
    "DateCreated": "2020-03-15T10:54:00Z",
    "SubmissionStatusTypeID": 100
}