{
    "IsRecentlyVerified": false,
    "ID": 121594,
    "UUID": "71978B0D-F34A-43D9-AC37-D5DB8E47F6ED",
    "DataProviderID": 2,
    "DataProvidersReference": "121106",
    "OperatorID": 5,
    "UsageTypeID": 1,
    "AddressInfo": {
        "ID": 121940,
        "Title": "SEVICE CHARGER",
        "AddressLine1": "242 Underwood Rd",
        "Town": "Fletcher",
        "StateOrProvince": "NC",
        "Postcode": "28732",
        "CountryID": 2,
        "Latitude": 35.4409068,
        "Longitude": -82.5338528,
        "ContactTelephone1": "888-758-4389",
        "AccessComments": "24 hours daily",
        "RelatedURL": "http://www.chargepoint.com/",
        "DistanceUnit": 0
    },
    "Connections": [
        {
            "ID": 171344,
            "ConnectionTypeID": 1,
            "LevelID": 2,
            "Amps": 16,
            "Voltage": 230,
            "PowerKW": 3,
            "CurrentTypeID": 10,
            "Quantity": 1
        }
    ],
    "DateLastStatusUpdate": "2019-04-06T04:01:00Z",
    "DataQualityLevel": 3,
    "DateCreated": "2019-04-06T04:01:00Z",
    "SubmissionStatusTypeID": 100
}