{
    "IsRecentlyVerified": false,
    "ID": 183008,
    "UUID": "1952BD56-B658-4077-8C20-DE093B16703E",
    "DataProviderID": 29,
    "DataProvidersReference": "19787",
    "OperatorID": 69,
    "AddressInfo": {
        "ID": 183367,
        "Title": "Kathi-Kobus-Str. 3",
        "AddressLine1": "Kathi-Kobus-Str. 3",
        "Town": "München",
        "Postcode": "80797",
        "CountryID": 87,
        "Latitude": 48.159448,
        "Longitude": 11.556839,
        "DistanceUnit": 0
    },
    "Connections": [
        {
            "ID": 289449,
            "ConnectionTypeID": 25,
            "StatusTypeID": 50,
            "LevelID": 2,
            "PowerKW": 22,
            "CurrentTypeID": 20
        },
        {
            "ID": 289450,
            "ConnectionTypeID": 25,
            "StatusTypeID": 50,
            "LevelID": 2,
            "PowerKW": 22,
            "CurrentTypeID": 20
        }
    ],
    "StatusTypeID": 50,
    "DateLastStatusUpdate": "2021-07-12T02:40:00Z",
    "MetadataValues": [
        {
            "ID": 15301,
            "MetadataFieldID": 4,
            "ItemValue": "Data from the German chargepoint registry provided by Bundesnetzagentur.de under the CC-BY 4.0 license"
        }
    ],
    "DataQualityLevel": 3,
    "DateCreated": "2021-07-08T10:03:00Z",
    "SubmissionStatusTypeID": 100
}