{
    "IsRecentlyVerified": false,
    "ID": 67173,
    "UUID": "3FB25D34-E4A3-4469-AC23-181E9D53447B",
    "DataProviderID": 2,
    "DataProvidersReference": "74302",
    "UsageTypeID": 1,
    "AddressInfo": {
        "ID": 67519,
        "Title": "Town of Ocean City - 300 St. Louis Ave Street Parking",
        "AddressLine1": "300 St. Louis Ave",
        "Town": "Ocean City",
        "StateOrProvince": "MD",
        "Postcode": "21842",
        "CountryID": 2,
        "Latitude": 38.335516,
        "Longitude": -75.087156,
        "ContactTelephone1": "410-685-1109",
        "AccessComments": "24 hours daily",
        "RelatedURL": "",
        "DistanceUnit": 0
    },
    "Connections": [
        {
            "ID": 92669,
            "ConnectionTypeID": 1,
            "LevelID": 2,
            "Amps": 16,
            "Voltage": 230,
            "PowerKW": 3.7,
            "CurrentTypeID": 10,
            "Quantity": 2
        }
    ],
    "DateLastStatusUpdate": "2020-06-26T02:59:00Z",
    "DataQualityLevel": 3,
    "DateCreated": "2016-05-29T02:04:00Z",
    "SubmissionStatusTypeID": 100
}