{
    "IsRecentlyVerified": false,
    "ID": 80003,
    "UUID": "AE8D772C-C262-4F8F-8835-0072508116B0",
    "DataProviderID": 1,
    "OperatorID": 23,
    "OperatorsReference": "9043",
    "UsageTypeID": 4,
    "UsageCost": "$0.20/min >=60kW; $0.10/min <60kW; other tariffs for older cars",
    "AddressInfo": {
        "ID": 80349,
        "Title": "Mobile Supercharger",
        "AddressLine1": "3201 Airport BLVD",
        "Town": "Mobile",
        "StateOrProvince": "AL",
        "Postcode": "36606",
        "CountryID": 2,
        "Latitude": 30.671556,
        "Longitude": -88.118644,
        "DistanceUnit": 0
    },
    "Connections": [
        {
            "ID": 114652,
            "ConnectionTypeID": 27,
            "StatusTypeID": 50,
            "LevelID": 3,
            "PowerKW": 120,
            "CurrentTypeID": 30,
            "Quantity": 8
        }
    ],
    "NumberOfPoints": 8,
    "GeneralComments": "8 Superchargers, available 24/7",
    "StatusTypeID": 50,
    "DateLastStatusUpdate": "2018-03-13T08:43:00Z",
    "DataQualityLevel": 1,
    "DateCreated": "2017-01-30T18:14:00Z",
    "SubmissionStatusTypeID": 200
}