{
    "IsRecentlyVerified": false,
    "ID": 73279,
    "UUID": "9AD9CD25-84DD-4895-BC98-5ABA2833DB04",
    "DataProviderID": 1,
    "OperatorID": 45,
    "UsageTypeID": 4,
    "AddressInfo": {
        "ID": 73625,
        "Title": "Elektro Bock",
        "AddressLine1": "Thomaweg 3",
        "AddressLine2": "Enterfels",
        "Town": "Kreuth",
        "StateOrProvince": "Landkreis Miesbach",
        "Postcode": "83708",
        "CountryID": 87,
        "Latitude": 47.64126921665131,
        "Longitude": 11.742890298811298,
        "AccessComments": "24/7 freischaltbar mit The New Motion oder PlugSurfing Ladekarte.",
        "RelatedURL": "https://beenergised.com/",
        "DistanceUnit": 0
    },
    "Connections": [
        {
            "ID": 105444,
            "ConnectionTypeID": 25,
            "StatusTypeID": 50,
            "LevelID": 2,
            "Amps": 32,
            "Voltage": 400,
            "PowerKW": 22,
            "CurrentTypeID": 20,
            "Quantity": 1
        }
    ],
    "NumberOfPoints": 1,
    "GeneralComments": "Betreiber ist die Firma Elektro Bock mit dem Produkt von has.to.be.",
    "StatusTypeID": 50,
    "DateLastStatusUpdate": "2016-11-17T09:13:00Z",
    "DataQualityLevel": 1,
    "DateCreated": "2016-11-17T09:13:00Z",
    "SubmissionStatusTypeID": 200
}