{
    "IsRecentlyVerified": false,
    "ID": 186936,
    "UUID": "C16E592C-951C-487A-B124-495DDE33441D",
    "DataProviderID": 29,
    "DataProvidersReference": "7206",
    "OperatorID": 103,
    "AddressInfo": {
        "ID": 187295,
        "Title": "Düsseldorfer Str. ggü. 17",
        "AddressLine1": "Düsseldorfer Str. ggü. 17",
        "Town": "Berlin",
        "Postcode": "10719",
        "CountryID": 87,
        "Latitude": 52.496013,
        "Longitude": 13.319607,
        "DistanceUnit": 0
    },
    "Connections": [
        {
            "ID": 300683,
            "ConnectionTypeID": 25,
            "StatusTypeID": 50,
            "LevelID": 2,
            "PowerKW": 11,
            "CurrentTypeID": 20
        },
        {
            "ID": 300684,
            "ConnectionTypeID": 25,
            "StatusTypeID": 50,
            "LevelID": 2,
            "PowerKW": 11,
            "CurrentTypeID": 20
        }
    ],
    "StatusTypeID": 50,
    "DateLastStatusUpdate": "2021-07-12T02:49:00Z",
    "MetadataValues": [
        {
            "ID": 19176,
            "MetadataFieldID": 4,
            "ItemValue": "Data from the German chargepoint registry provided by Bundesnetzagentur.de under the CC-BY 4.0 license"
        }
    ],
    "DataQualityLevel": 3,
    "DateCreated": "2021-07-12T02:49:00Z",
    "SubmissionStatusTypeID": 100
}