{
    "IsRecentlyVerified": false,
    "ID": 181662,
    "UUID": "E8EE91A0-0B52-48A8-8C57-715305CE8E0A",
    "DataProviderID": 29,
    "DataProvidersReference": "6938",
    "AddressInfo": {
        "ID": 182021,
        "Title": "Am Greinberg 29",
        "AddressLine1": "Am Greinberg 29",
        "Town": "Ochsenfurt",
        "Postcode": "97199",
        "CountryID": 87,
        "Latitude": 49.6595,
        "Longitude": 10.0886,
        "DistanceUnit": 0
    },
    "Connections": [
        {
            "ID": 286294,
            "ConnectionTypeID": 25,
            "StatusTypeID": 50,
            "LevelID": 2,
            "PowerKW": 22,
            "CurrentTypeID": 20
        },
        {
            "ID": 286295,
            "ConnectionTypeID": 25,
            "StatusTypeID": 50,
            "LevelID": 2,
            "PowerKW": 22,
            "CurrentTypeID": 20
        }
    ],
    "StatusTypeID": 50,
    "DateLastStatusUpdate": "2021-07-12T02:43:00Z",
    "MetadataValues": [
        {
            "ID": 13956,
            "MetadataFieldID": 4,
            "ItemValue": "Data from the German chargepoint registry provided by Bundesnetzagentur.de under the CC-BY 4.0 license"
        }
    ],
    "DataQualityLevel": 3,
    "DateCreated": "2021-07-08T10:02:00Z",
    "SubmissionStatusTypeID": 100
}