{
    "IsRecentlyVerified": false,
    "ID": 67330,
    "UUID": "C7EB5C35-5866-4DCD-94B5-3BDD30E7DCDE",
    "DataProviderID": 1,
    "OperatorID": 23,
    "OperatorsReference": "10253",
    "UsageTypeID": 1,
    "UsageCost": "Free",
    "AddressInfo": {
        "ID": 67676,
        "Title": "Inn at Westwynd Farm - Tesla",
        "AddressLine1": "1620 Sand Beach Rd",
        "Town": "Hummelstown",
        "StateOrProvince": "PA",
        "Postcode": "17036",
        "CountryID": 2,
        "Latitude": 40.335223,
        "Longitude": -76.6683154,
        "ContactTelephone1": "717-533-6764  877-798-3752",
        "AccessComments": "24 hours daily; for Tesla use only; for guest use only",
        "RelatedURL": "http://www.teslamotors.com/supercharger",
        "DistanceUnit": 0
    },
    "Connections": [
        {
            "ID": 92834,
            "ConnectionTypeID": 30,
            "StatusTypeID": 50,
            "LevelID": 2,
            "Amps": 16,
            "Voltage": 230,
            "PowerKW": 13,
            "CurrentTypeID": 10,
            "Quantity": 1
        }
    ],
    "NumberOfPoints": 1,
    "StatusTypeID": 50,
    "DateLastStatusUpdate": "2017-01-26T03:56:00Z",
    "DataQualityLevel": 3,
    "DateCreated": "2016-05-29T02:05:00Z",
    "SubmissionStatusTypeID": 100
}