{
    "IsRecentlyVerified": false,
    "ID": 115943,
    "UUID": "D5102CEF-5EA7-4748-9F46-5061DF94EF99",
    "DataProviderID": 2,
    "DataProvidersReference": "114879",
    "OperatorID": 23,
    "UsageTypeID": 1,
    "AddressInfo": {
        "ID": 116289,
        "Title": "Troutbeck - Tesla Destination",
        "AddressLine1": "515 Leedsville Rd",
        "Town": "Amenia",
        "StateOrProvince": "NY",
        "Postcode": "12501",
        "CountryID": 2,
        "Latitude": 41.855019,
        "Longitude": -73.515167,
        "ContactTelephone1": "845-789-1555  877-798-3752",
        "AccessComments": "24 hours daily; for customer use only; see front desk for access",
        "RelatedURL": "https://www.tesla.com/destination-charging",
        "DistanceUnit": 0
    },
    "Connections": [
        {
            "ID": 162993,
            "ConnectionTypeID": 30,
            "LevelID": 2,
            "Amps": 16,
            "Voltage": 230,
            "PowerKW": 3.7,
            "CurrentTypeID": 10,
            "Quantity": 2
        }
    ],
    "DateLastStatusUpdate": "2020-06-26T03:05:00Z",
    "DataQualityLevel": 3,
    "DateCreated": "2019-02-11T07:13:00Z",
    "SubmissionStatusTypeID": 100
}