{
    "IsRecentlyVerified": false,
    "ID": 38821,
    "UUID": "9E995E62-2556-49F8-8B9B-42F57FF2C136",
    "DataProviderID": 26,
    "DataProvidersReference": "37499",
    "OperatorsReference": "ICUEVE000049",
    "UsageCost": "0.00 jaarabonnement",
    "AddressInfo": {
        "ID": 39167,
        "Title": "Ossebroeken 26",
        "AddressLine1": "Ossebroeken 26",
        "Town": "Midden-Drenthe",
        "Postcode": "9411 VR",
        "CountryID": 159,
        "Latitude": 52.862895003357,
        "Longitude": 6.4938995987177,
        "RelatedURL": "http://www.invent.nl",
        "DistanceUnit": 0
    },
    "Connections": [
        {
            "ID": 42332,
            "ConnectionTypeID": 25,
            "LevelID": 2,
            "PowerKW": 22,
            "CurrentTypeID": 10
        }
    ],
    "NumberOfPoints": 2,
    "StatusTypeID": 50,
    "DateLastStatusUpdate": "2016-06-04T02:55:00Z",
    "DataQualityLevel": 3,
    "DateCreated": "2015-01-09T06:08:00Z",
    "SubmissionStatusTypeID": 100
}