{
    "IsRecentlyVerified": false,
    "ID": 97820,
    "UUID": "FC583C11-C357-4CD0-A2DB-0CFDB7DAB7C8",
    "DataProviderID": 1,
    "OperatorID": 23,
    "OperatorsReference": "39282",
    "UsageTypeID": 4,
    "AddressInfo": {
        "ID": 98166,
        "Title": "The Creek Club At Reynolds Lake Oconee",
        "AddressLine1": "1100 Creek Club DR",
        "Town": "Greensboro",
        "StateOrProvince": "Georgia",
        "Postcode": "30642",
        "CountryID": 2,
        "Latitude": 33.449986,
        "Longitude": -83.224391,
        "ContactTelephone1": "(706) 467-1680",
        "DistanceUnit": 0
    },
    "Connections": [
        {
            "ID": 138728,
            "ConnectionTypeID": 30,
            "StatusTypeID": 50,
            "LevelID": 2,
            "PowerKW": 16,
            "CurrentTypeID": 20,
            "Quantity": 1
        }
    ],
    "NumberOfPoints": 1,
    "GeneralComments": "1 Tesla Connector, up to 16kW.Available for members only. Self park.",
    "StatusTypeID": 50,
    "DateLastStatusUpdate": "2018-01-21T16:44:00Z",
    "DataQualityLevel": 1,
    "DateCreated": "2018-01-21T16:44:00Z",
    "SubmissionStatusTypeID": 200
}