{
    "IsRecentlyVerified": false,
    "ID": 134885,
    "UUID": "CC00F9FD-2DD0-44C9-A211-07A30D1053ED",
    "DataProviderID": 1,
    "OperatorID": 80,
    "UsageTypeID": 4,
    "AddressInfo": {
        "ID": 135231,
        "Title": "Coop Supermercati Mangone | EnelX",
        "AddressLine1": "SP241 Via Zona Industriale",
        "AddressLine2": " Piano Lago",
        "Town": "Mangone",
        "StateOrProvince": "CS",
        "Postcode": "87050",
        "CountryID": 112,
        "Latitude": 39.21498786933185,
        "Longitude": 16.30809994186984,
        "ContactTelephone1": "800.069.850",
        "RelatedURL": "https://www.enelx.com/it/it/emobility",
        "DistanceUnit": 0
    },
    "Connections": [
        {
            "ID": 188718,
            "ConnectionTypeID": 25,
            "StatusTypeID": 50,
            "LevelID": 2,
            "Amps": 32,
            "Voltage": 400,
            "PowerKW": 22,
            "CurrentTypeID": 20,
            "Quantity": 1
        },
        {
            "ID": 188719,
            "ConnectionTypeID": 36,
            "StatusTypeID": 50,
            "LevelID": 2,
            "Amps": 16,
            "Voltage": 240,
            "PowerKW": 3.7,
            "CurrentTypeID": 10,
            "Quantity": 1
        }
    ],
    "NumberOfPoints": 2,
    "GeneralComments": "LUN -SAB 08:30 /20:00; DOM 09:00 /13:00",
    "StatusTypeID": 50,
    "DateLastStatusUpdate": "2019-11-28T11:57:00Z",
    "DataQualityLevel": 1,
    "DateCreated": "2019-11-28T11:57:00Z",
    "SubmissionStatusTypeID": 200
}