{
    "IsRecentlyVerified": false,
    "ID": 177650,
    "UUID": "72CEA414-5F84-4902-B771-9B9A72E99DD0",
    "DataProviderID": 29,
    "DataProvidersReference": "3980",
    "OperatorID": 105,
    "AddressInfo": {
        "ID": 178009,
        "Title": "Paul-Kosmalla-Straße 3",
        "AddressLine1": "Paul-Kosmalla-Straße 3",
        "Town": "Mülheim an der Ruhr",
        "Postcode": "45472",
        "CountryID": 87,
        "Latitude": 51.433056,
        "Longitude": 6.925,
        "DistanceUnit": 0
    },
    "Connections": [
        {
            "ID": 277052,
            "ConnectionTypeID": 25,
            "StatusTypeID": 50,
            "LevelID": 2,
            "PowerKW": 22,
            "CurrentTypeID": 20
        },
        {
            "ID": 277053,
            "ConnectionTypeID": 25,
            "StatusTypeID": 50,
            "LevelID": 2,
            "PowerKW": 22,
            "CurrentTypeID": 20
        }
    ],
    "StatusTypeID": 0,
    "DateLastStatusUpdate": "2021-07-12T02:47:00Z",
    "MetadataValues": [
        {
            "ID": 9944,
            "MetadataFieldID": 4,
            "ItemValue": "Data from the German chargepoint registry provided by Bundesnetzagentur.de under the CC-BY 4.0 license"
        }
    ],
    "DataQualityLevel": 3,
    "DateCreated": "2021-07-08T09:49:00Z",
    "SubmissionStatusTypeID": 100
}