{
    "IsRecentlyVerified": false,
    "ID": 157101,
    "UUID": "95FD8219-BCE3-4917-A5BB-41787DA0FD76",
    "DataProviderID": 19,
    "DataProvidersReference": "796",
    "AddressInfo": {
        "ID": 157455,
        "Title": "Bjørgvin videregående skole, Bergen",
        "AddressLine1": "Strandgaten 195",
        "Town": "BERGEN",
        "StateOrProvince": "Vestland",
        "Postcode": "5004",
        "CountryID": 168,
        "Latitude": 60.39659,
        "Longitude": 5.31519,
        "AccessComments": "",
        "DistanceUnit": 0
    },
    "Connections": [
        {
            "ID": 225347,
            "ConnectionTypeID": 28,
            "Reference": "1",
            "LevelID": 2,
            "Amps": 16,
            "Voltage": 230,
            "PowerKW": 3.7,
            "CurrentTypeID": 10,
            "Comments": "Mode 1"
        },
        {
            "ID": 225348,
            "ConnectionTypeID": 28,
            "Reference": "2",
            "LevelID": 2,
            "Amps": 16,
            "Voltage": 230,
            "PowerKW": 3.7,
            "CurrentTypeID": 10,
            "Comments": "Mode 1"
        }
    ],
    "NumberOfPoints": 2,
    "StatusTypeID": 0,
    "DateLastStatusUpdate": "2021-03-24T05:12:00Z",
    "DataQualityLevel": 2,
    "DateCreated": "2020-05-26T08:24:00Z",
    "SubmissionStatusTypeID": 100
}