{
    "IsRecentlyVerified": false,
    "ID": 120688,
    "UUID": "49136A5C-AFA2-4EA8-81C2-B77C7075DB76",
    "DataProviderID": 2,
    "DataProvidersReference": "118730",
    "OperatorID": 5,
    "UsageTypeID": 1,
    "AddressInfo": {
        "ID": 121034,
        "Title": "PB BELL",
        "AddressLine1": "4333 n 6th ave",
        "Town": "Phoenix",
        "StateOrProvince": "AZ",
        "Postcode": "85013",
        "CountryID": 2,
        "Latitude": 33.4988924,
        "Longitude": -112.0816005,
        "ContactTelephone1": "888-758-4389",
        "AccessComments": "24 hours daily",
        "RelatedURL": "http://www.chargepoint.com/",
        "DistanceUnit": 0
    },
    "Connections": [
        {
            "ID": 170059,
            "ConnectionTypeID": 1,
            "LevelID": 2,
            "Amps": 16,
            "Voltage": 230,
            "PowerKW": 3.7,
            "CurrentTypeID": 10,
            "Quantity": 2
        }
    ],
    "DateLastStatusUpdate": "2020-06-26T02:55:00Z",
    "DataQualityLevel": 3,
    "DateCreated": "2019-04-01T04:59:00Z",
    "SubmissionStatusTypeID": 100
}