{
    "IsRecentlyVerified": false,
    "ID": 46055,
    "UUID": "E1C2CF62-D3ED-4A81-B8D4-68F0BA9DF06A",
    "DataProviderID": 1,
    "DataProvidersReference": "545",
    "AddressInfo": {
        "ID": 46401,
        "Title": "Eltek Valere, Drammen",
        "AddressLine1": "Gråterudveien 8",
        "Town": "DRAMMEN",
        "StateOrProvince": "Viken",
        "Postcode": "3036",
        "CountryID": 168,
        "Latitude": 59.69718,
        "Longitude": 10.25042,
        "AccessComments": "Ligger til venstre for hovedinngangen.",
        "DistanceUnit": 0
    },
    "Connections": [
        {
            "ID": 56718,
            "ConnectionTypeID": 0,
            "Reference": "1",
            "LevelID": 2,
            "Amps": 16,
            "Voltage": 230,
            "PowerKW": 3.7,
            "Comments": "Mode 1"
        },
        {
            "ID": 84981,
            "ConnectionTypeID": 0,
            "Reference": "2",
            "LevelID": 2,
            "Amps": 16,
            "Voltage": 230,
            "PowerKW": 3.7,
            "Comments": "Mode 1"
        },
        {
            "ID": 84982,
            "ConnectionTypeID": 0,
            "Reference": "3",
            "LevelID": 2,
            "Amps": 16,
            "Voltage": 230,
            "PowerKW": 3.7,
            "Comments": "Mode 1"
        },
        {
            "ID": 88399,
            "ConnectionTypeID": 0,
            "Reference": "4",
            "LevelID": 2,
            "Amps": 16,
            "Voltage": 230,
            "PowerKW": 3.7,
            "Comments": "Mode 1"
        }
    ],
    "NumberOfPoints": 4,
    "DateLastStatusUpdate": "2020-05-26T08:23:00Z",
    "DataQualityLevel": 2,
    "DateCreated": "2015-05-03T00:54:00Z",
    "SubmissionStatusTypeID": 100
}