{
    "IsRecentlyVerified": false,
    "ID": 67926,
    "UUID": "4B414C26-8FDA-48A3-96E0-973F8FEF9EB9",
    "DataProviderID": 26,
    "DataProvidersReference": "92947",
    "OperatorID": 103,
    "OperatorsReference": "Allego NLALLEGO0012802",
    "UsageCost": "0.00 jaarabonnement",
    "AddressInfo": {
        "ID": 68272,
        "Title": "Loopschansstraat 9",
        "AddressLine1": "Loopschansstraat 9",
        "Town": "Breda",
        "Postcode": "4817 KR",
        "CountryID": 159,
        "Latitude": 51.5936207,
        "Longitude": 4.79127877,
        "ContactTelephone1": "0800-3745337",
        "RelatedURL": "http://www.allego.eu/",
        "DistanceUnit": 0
    },
    "Connections": [
        {
            "ID": 94536,
            "ConnectionTypeID": 25,
            "LevelID": 2,
            "PowerKW": 11,
            "CurrentTypeID": 10
        },
        {
            "ID": 94537,
            "ConnectionTypeID": 25,
            "LevelID": 2,
            "PowerKW": 11,
            "CurrentTypeID": 10
        }
    ],
    "NumberOfPoints": 1,
    "StatusTypeID": 50,
    "DateLastStatusUpdate": "2016-06-04T02:37:00Z",
    "DataQualityLevel": 3,
    "DateCreated": "2016-06-04T02:37:00Z",
    "SubmissionStatusTypeID": 100
}