{
    "IsRecentlyVerified": false,
    "ID": 103027,
    "UUID": "9D601B9C-3E13-48F0-84E8-0FF44FE08BF8",
    "DataProviderID": 2,
    "DataProvidersReference": "91866",
    "UsageTypeID": 1,
    "AddressInfo": {
        "ID": 103373,
        "Title": "Minnkota Power Co-op",
        "AddressLine1": "5301 32nd Ave S",
        "Town": "Grand Forks",
        "StateOrProvince": "ND",
        "Postcode": "58201",
        "CountryID": 2,
        "Latitude": 47.889455,
        "Longitude": -97.109812,
        "ContactTelephone1": "",
        "AccessComments": "8am-5pm M-F",
        "RelatedURL": "",
        "DistanceUnit": 0
    },
    "Connections": [
        {
            "ID": 145186,
            "ConnectionTypeID": 1,
            "LevelID": 2,
            "Amps": 16,
            "Voltage": 230,
            "PowerKW": 3.7,
            "CurrentTypeID": 10,
            "Quantity": 2
        }
    ],
    "DateLastStatusUpdate": "2020-06-26T03:11:00Z",
    "DataQualityLevel": 3,
    "DateCreated": "2018-04-21T04:13:00Z",
    "SubmissionStatusTypeID": 100
}