{
    "IsRecentlyVerified": false,
    "ID": 126762,
    "UUID": "D179CAD6-525A-4DB8-AD36-87DA66CF22C7",
    "DataProviderID": 1,
    "OperatorID": 23,
    "OperatorsReference": "50205",
    "UsageTypeID": 4,
    "UsageCost": "$0.24/min >=60kW; $0.12/min <60kW; other tariffs for older cars",
    "AddressInfo": {
        "ID": 127108,
        "Title": "Marlton, NJ Supercharger",
        "AddressLine1": "500 NJ-73",
        "Town": "Marlton",
        "StateOrProvince": "NJ",
        "Postcode": "08053",
        "CountryID": 2,
        "Latitude": 39.877502,
        "Longitude": -74.918512,
        "DistanceUnit": 0
    },
    "Connections": [
        {
            "ID": 177557,
            "ConnectionTypeID": 27,
            "StatusTypeID": 50,
            "LevelID": 3,
            "PowerKW": 120,
            "CurrentTypeID": 30,
            "Quantity": 12
        }
    ],
    "NumberOfPoints": 12,
    "GeneralComments": "Charging12 Superchargers, available 24/7, up to 120kW",
    "StatusTypeID": 50,
    "DateLastStatusUpdate": "2019-05-19T05:34:00Z",
    "DataQualityLevel": 1,
    "DateCreated": "2019-05-19T05:34:00Z",
    "SubmissionStatusTypeID": 200
}