{
    "IsRecentlyVerified": false,
    "ID": 93866,
    "UUID": "5F122F11-9FA9-48EE-B9C7-C77CAE38E454",
    "DataProviderID": 1,
    "OperatorID": 3248,
    "UsageTypeID": 1,
    "AddressInfo": {
        "ID": 94212,
        "Title": "Rasthof Hamburg-Stillhorn Ost",
        "AddressLine1": "A1",
        "Town": "Hamburg",
        "StateOrProvince": "Hamburg",
        "Postcode": "21109",
        "CountryID": 87,
        "Latitude": 53.48379100516042,
        "Longitude": 10.026684604349144,
        "AccessComments": "24/7 nutzbar",
        "DistanceUnit": 0
    },
    "Connections": [
        {
            "ID": 132874,
            "ConnectionTypeID": 1036,
            "StatusTypeID": 50,
            "LevelID": 3,
            "Amps": 63,
            "Voltage": 400,
            "PowerKW": 43,
            "CurrentTypeID": 20,
            "Quantity": 1
        },
        {
            "ID": 132875,
            "ConnectionTypeID": 2,
            "StatusTypeID": 50,
            "LevelID": 3,
            "PowerKW": 50,
            "CurrentTypeID": 30,
            "Quantity": 1
        },
        {
            "ID": 132876,
            "ConnectionTypeID": 33,
            "StatusTypeID": 50,
            "LevelID": 3,
            "PowerKW": 50,
            "CurrentTypeID": 30,
            "Quantity": 1
        }
    ],
    "NumberOfPoints": 2,
    "GeneralComments": "Am 10.10.2017 noch nicht aktiv!",
    "StatusTypeID": 50,
    "DateLastStatusUpdate": "2017-10-11T06:14:00Z",
    "DataQualityLevel": 1,
    "DateCreated": "2017-10-11T06:14:00Z",
    "SubmissionStatusTypeID": 100
}