{
    "IsRecentlyVerified": false,
    "ID": 97794,
    "UUID": "89A252C1-FB97-4BDD-B315-9A349F9CD738",
    "DataProviderID": 1,
    "OperatorID": 23,
    "OperatorsReference": "38815",
    "UsageTypeID": 4,
    "AddressInfo": {
        "ID": 98140,
        "Title": "Zeitwohnhaus Suite-Hotel & Serviced Apartments",
        "AddressLine1": "Luitpoldstrasse 10",
        "Town": "Erlangen",
        "Postcode": "91054",
        "CountryID": 87,
        "Latitude": 49.596859,
        "Longitude": 11.014815,
        "ContactTelephone1": "+49 9131 5303940",
        "DistanceUnit": 0
    },
    "Connections": [
        {
            "ID": 138702,
            "ConnectionTypeID": 30,
            "StatusTypeID": 50,
            "LevelID": 2,
            "Amps": 32,
            "Voltage": 400,
            "PowerKW": 22,
            "CurrentTypeID": 20,
            "Quantity": 2
        }
    ],
    "NumberOfPoints": 2,
    "GeneralComments": "2 Tesla Connectors, up to 22kW.Available for customers. Please see front desk.",
    "StatusTypeID": 50,
    "DateLastStatusUpdate": "2018-10-03T19:50:00Z",
    "DataQualityLevel": 1,
    "DateCreated": "2018-01-21T16:40:00Z",
    "SubmissionStatusTypeID": 200
}