{
    "IsRecentlyVerified": false,
    "ID": 5887,
    "UUID": "74972DC5-CB18-4383-9B60-33639FD7C58C",
    "DataProviderID": 1,
    "OperatorID": 1,
    "UsageTypeID": 1,
    "AddressInfo": {
        "ID": 5809,
        "Title": "Pioneer RV Park",
        "Town": "Quincy",
        "StateOrProvince": "California",
        "CountryID": 2,
        "Latitude": 39.9369873116008,
        "Longitude": -120.911922454833,
        "DistanceUnit": 0
    },
    "Connections": [
        {
            "ID": 635,
            "ConnectionTypeID": 8,
            "LevelID": 2,
            "Amps": 70,
            "Voltage": 230,
            "PowerKW": 16.8,
            "CurrentTypeID": 10,
            "Quantity": 1
        }
    ],
    "NumberOfPoints": 1,
    "StatusTypeID": 50,
    "DateLastStatusUpdate": "2011-06-24T00:00:00Z",
    "DateCreated": "2011-09-13T12:41:00Z",
    "SubmissionStatusTypeID": 200
}