{
    "IsRecentlyVerified": false,
    "ID": 106588,
    "UUID": "36F19CE9-9149-442C-9863-C181CD97A0FB",
    "DataProviderID": 1,
    "OperatorID": 45,
    "UsageTypeID": 1,
    "AddressInfo": {
        "ID": 106934,
        "Title": "Parkplatz Haaksbergener Straße",
        "AddressLine1": "Haaksbergener Straße 22",
        "Town": "Ahaus-Alstätte",
        "StateOrProvince": "Kreis Borken",
        "Postcode": "48683",
        "CountryID": 87,
        "Latitude": 52.12710560601678,
        "Longitude": 6.911345942206822,
        "AccessComments": "24/7 kostenlos nutzbar",
        "RelatedURL": "http://www.stadtwerke-ahaus.de/",
        "DistanceUnit": 0
    },
    "Connections": [
        {
            "ID": 149990,
            "ConnectionTypeID": 25,
            "StatusTypeID": 50,
            "LevelID": 2,
            "Amps": 32,
            "Voltage": 400,
            "PowerKW": 22,
            "CurrentTypeID": 20,
            "Quantity": 2
        }
    ],
    "NumberOfPoints": 2,
    "StatusTypeID": 50,
    "DateLastStatusUpdate": "2018-06-25T06:28:00Z",
    "DataQualityLevel": 1,
    "DateCreated": "2018-06-25T06:26:00Z",
    "SubmissionStatusTypeID": 200
}