{
    "UserComments": [
        {
            "ID": 21876,
            "ChargePointID": 96441,
            "CommentTypeID": 10,
            "UserName": "Someone_Just_",
            "Rating": 5,
            "DateCreated": "2019-12-08T21:03:02.783Z",
            "User": {
                "ID": 1107,
                "Username": "Someone_Just_"
            },
            "CheckinStatusTypeID": 10,
            "IsActionedByEditor": false
        },
        {
            "ID": 18059,
            "ChargePointID": 96441,
            "CommentTypeID": 10,
            "UserName": "Someone_Just_",
            "DateCreated": "2017-12-28T20:20:45.19Z",
            "User": {
                "ID": 1107,
                "Username": "Someone_Just_"
            },
            "CheckinStatusTypeID": 140
        }
    ],
    "MediaItems": [
        {
            "ID": 13852,
            "ChargePointID": 96441,
            "ItemURL": "https://s3-ap-southeast-2.amazonaws.com/openchargemap/images/BE/OCM96441/OCM-96441.orig.2017122820200962.jpg",
            "ItemThumbnailURL": "https://s3-ap-southeast-2.amazonaws.com/openchargemap/images/BE/OCM96441/OCM-96441.thmb.2017122820200962.jpg",
            "Comment": "6 lockers for bicycle battery's in the back of the parking",
            "IsEnabled": true,
            "IsVideo": false,
            "IsFeaturedItem": false,
            "IsExternalResource": false,
            "User": {
                "ID": 1107,
                "Username": "Someone_Just_"
            },
            "DateCreated": "2017-12-28T20:20:00Z"
        },
        {
            "ID": 13851,
            "ChargePointID": 96441,
            "ItemURL": "https://s3-ap-southeast-2.amazonaws.com/openchargemap/images/BE/OCM96441/OCM-96441.orig.2017122820171467.jpg",
            "ItemThumbnailURL": "https://s3-ap-southeast-2.amazonaws.com/openchargemap/images/BE/OCM96441/OCM-96441.thmb.2017122820171467.jpg",
            "Comment": "are 2 places for cars.",
            "IsEnabled": true,
            "IsVideo": false,
            "IsFeaturedItem": false,
            "IsExternalResource": false,
            "User": {
                "ID": 1107,
                "Username": "Someone_Just_"
            },
            "DateCreated": "2017-12-28T20:17:00Z"
        },
        {
            "ID": 13850,
            "ChargePointID": 96441,
            "ItemURL": "https://s3-ap-southeast-2.amazonaws.com/openchargemap/images/BE/OCM96441/OCM-96441.orig.2017122820151768.jpg",
            "ItemThumbnailURL": "https://s3-ap-southeast-2.amazonaws.com/openchargemap/images/BE/OCM96441/OCM-96441.thmb.2017122820151768.jpg",
            "Comment": "Just behind the gate ...",
            "IsEnabled": true,
            "IsVideo": false,
            "IsFeaturedItem": false,
            "IsExternalResource": false,
            "User": {
                "ID": 1107,
                "Username": "Someone_Just_"
            },
            "DateCreated": "2017-12-28T20:15:00Z"
        }
    ],
    "IsRecentlyVerified": false,
    "ID": 96441,
    "UUID": "FEA4572D-BE52-4746-983F-E038469EBE0A",
    "DataProviderID": 1,
    "OperatorID": 38,
    "UsageTypeID": 1,
    "UsageCost": "Free",
    "AddressInfo": {
        "ID": 96787,
        "Title": "Lidl Schoten",
        "AddressLine1": "Paalstraat 327",
        "Town": "Schoten",
        "Postcode": "2900",
        "CountryID": 26,
        "Latitude": 51.26114816079701,
        "Longitude": 4.50716433194656,
        "DistanceUnit": 0
    },
    "Connections": [
        {
            "ID": 136696,
            "ConnectionTypeID": 2,
            "StatusTypeID": 50,
            "LevelID": 3,
            "Amps": 120,
            "Voltage": 500,
            "PowerKW": 50,
            "CurrentTypeID": 30,
            "Quantity": 1
        },
        {
            "ID": 136697,
            "ConnectionTypeID": 1036,
            "StatusTypeID": 50,
            "LevelID": 2,
            "Amps": 32,
            "Voltage": 400,
            "PowerKW": 22,
            "CurrentTypeID": 20,
            "Quantity": 1
        },
        {
            "ID": 136698,
            "ConnectionTypeID": 33,
            "StatusTypeID": 50,
            "LevelID": 3,
            "Amps": 125,
            "Voltage": 500,
            "PowerKW": 50,
            "CurrentTypeID": 30,
            "Quantity": 1
        },
        {
            "ID": 254804,
            "ConnectionTypeID": 23,
            "StatusTypeID": 50,
            "LevelID": 1,
            "Amps": 16,
            "Voltage": 230,
            "PowerKW": 2.3,
            "CurrentTypeID": 10,
            "Quantity": 6,
            "Comments": "For bikes"
        }
    ],
    "NumberOfPoints": 2,
    "StatusTypeID": 50,
    "DateLastStatusUpdate": "2020-09-14T07:23:00Z",
    "DataQualityLevel": 1,
    "DateCreated": "2017-12-27T22:25:00Z",
    "SubmissionStatusTypeID": 200
}