{
    "IsRecentlyVerified": false,
    "ID": 112889,
    "UUID": "3AAB8A03-9DB6-4259-8B4C-9BEB44CAB0F3",
    "DataProviderID": 1,
    "OperatorID": 80,
    "UsageTypeID": 4,
    "AddressInfo": {
        "ID": 113235,
        "Title": "Roseto Matteotti | EnelX",
        "AddressLine1": "Via Matteotti",
        "Town": "Roseto Capo Spulico",
        "StateOrProvince": "CS",
        "Postcode": "87070 ",
        "CountryID": 112,
        "Latitude": 39.98696528953309,
        "Longitude": 16.602562760842936,
        "ContactTelephone1": "800.069.850",
        "RelatedURL": "https://www.enelx.com/it/it/emobility",
        "DistanceUnit": 0
    },
    "Connections": [
        {
            "ID": 159002,
            "ConnectionTypeID": 25,
            "StatusTypeID": 150,
            "LevelID": 2,
            "Amps": 32,
            "Voltage": 400,
            "PowerKW": 22,
            "CurrentTypeID": 20,
            "Quantity": 1
        },
        {
            "ID": 159003,
            "ConnectionTypeID": 36,
            "StatusTypeID": 150,
            "LevelID": 2,
            "Amps": 16,
            "Voltage": 240,
            "PowerKW": 3.7,
            "CurrentTypeID": 10,
            "Quantity": 1
        }
    ],
    "NumberOfPoints": 2,
    "StatusTypeID": 150,
    "DateLastStatusUpdate": "2018-11-22T15:52:00Z",
    "DataQualityLevel": 1,
    "DateCreated": "2018-11-22T15:52:00Z",
    "SubmissionStatusTypeID": 200
}