{
    "IsRecentlyVerified": false,
    "ID": 46632,
    "UUID": "3C245435-9D28-48EF-8AF5-D6678D672F23",
    "DataProviderID": 1,
    "DataProvidersReference": "413",
    "AddressInfo": {
        "ID": 46978,
        "Title": "St. Olavs hospital, Kvinne-barn senter , Trondheim",
        "AddressLine1": "Edvard Griegs gate ",
        "Town": "TRONDHEIM",
        "StateOrProvince": "Trøndelag",
        "Postcode": "7030",
        "CountryID": 168,
        "Latitude": 63.4204,
        "Longitude": 10.39142,
        "AccessComments": "P-plass langs vestsiden av gata.",
        "DistanceUnit": 0
    },
    "Connections": [
        {
            "ID": 57295,
            "ConnectionTypeID": 0,
            "Reference": "1",
            "LevelID": 2,
            "Amps": 16,
            "Voltage": 230,
            "PowerKW": 3.7,
            "Comments": "Mode 1"
        },
        {
            "ID": 89427,
            "ConnectionTypeID": 0,
            "Reference": "2",
            "LevelID": 2,
            "Amps": 16,
            "Voltage": 230,
            "PowerKW": 3.7,
            "Comments": "Mode 1"
        }
    ],
    "NumberOfPoints": 2,
    "DateLastStatusUpdate": "2020-05-26T08:25:00Z",
    "DataQualityLevel": 2,
    "DateCreated": "2015-05-03T00:54:00Z",
    "SubmissionStatusTypeID": 100
}