{
    "IsRecentlyVerified": false,
    "ID": 174286,
    "UUID": "F7038B59-A544-4718-B969-672A686ECF8D",
    "DataProviderID": 19,
    "DataProvidersReference": "6965",
    "AddressInfo": {
        "ID": 174645,
        "Title": "Þorlákshöfn (Orkan)",
        "AddressLine1": "Óseyrarbraut 15",
        "Town": "Þorlákshöfn",
        "StateOrProvince": "Suðurland",
        "Postcode": "815",
        "CountryID": 105,
        "Latitude": 63.85772,
        "Longitude": -21.376621,
        "AccessComments": "",
        "DistanceUnit": 0
    },
    "Connections": [
        {
            "ID": 269730,
            "ConnectionTypeID": 2,
            "Reference": "1",
            "LevelID": 3,
            "Amps": 100,
            "Voltage": 500,
            "PowerKW": 50,
            "CurrentTypeID": 30,
            "Comments": "Mode 4"
        },
        {
            "ID": 269731,
            "ConnectionTypeID": 33,
            "Reference": "2",
            "LevelID": 3,
            "Amps": 100,
            "Voltage": 500,
            "PowerKW": 50,
            "CurrentTypeID": 30,
            "Comments": "Mode 4"
        }
    ],
    "NumberOfPoints": 2,
    "StatusTypeID": 0,
    "DateLastStatusUpdate": "2021-03-24T05:12:00Z",
    "DataQualityLevel": 2,
    "DateCreated": "2021-03-24T05:12:00Z",
    "SubmissionStatusTypeID": 100
}