{
    "IsRecentlyVerified": false,
    "ID": 35238,
    "UUID": "D7A90424-0345-4B83-881D-4CC529B41410",
    "DataProviderID": 26,
    "DataProvidersReference": "47598",
    "OperatorID": 178,
    "OperatorsReference": "EVnetNL AL75",
    "UsageCost": "0.00 jaarabonnement",
    "AddressInfo": {
        "ID": 35584,
        "Title": "de Bleek",
        "AddressLine1": "de Bleek",
        "Town": "Doesburg",
        "Postcode": "6981 BA",
        "CountryID": 159,
        "Latitude": 52.016444,
        "Longitude": 6.131323,
        "ContactTelephone1": "0800-3522365",
        "RelatedURL": "http://www.evnet.nl",
        "DistanceUnit": 0
    },
    "Connections": [
        {
            "ID": 38749,
            "ConnectionTypeID": 25,
            "LevelID": 2,
            "PowerKW": 11,
            "CurrentTypeID": 10
        }
    ],
    "NumberOfPoints": 1,
    "StatusTypeID": 50,
    "DateLastStatusUpdate": "2016-06-04T02:44:00Z",
    "DataQualityLevel": 3,
    "DateCreated": "2015-01-09T06:04:00Z",
    "SubmissionStatusTypeID": 100
}