{
    "IsRecentlyVerified": false,
    "ID": 151357,
    "UUID": "F7F7E03A-88F0-452F-81F2-6D9463972D0C",
    "DataProviderID": 28,
    "DataProvidersReference": "FR*S46*P46148*001",
    "OperatorID": 3257,
    "UsageTypeID": 5,
    "AddressInfo": {
        "ID": 151710,
        "Title": "LALBENQUE - Place de la Foun Priundo",
        "AddressLine1": "Place de la Foun Priundo 46230 LALBENQUE",
        "CountryID": 80,
        "Latitude": 44.336149,
        "Longitude": 1.548159,
        "AccessComments": "24h/24 7j/7",
        "DistanceUnit": 0
    },
    "Connections": [
        {
            "ID": 211347,
            "ConnectionTypeID": 2,
            "StatusTypeID": 50,
            "LevelID": 3,
            "PowerKW": 36,
            "CurrentTypeID": 30
        },
        {
            "ID": 241718,
            "ConnectionTypeID": 33,
            "StatusTypeID": 50,
            "LevelID": 3,
            "PowerKW": 36,
            "CurrentTypeID": 30
        },
        {
            "ID": 241719,
            "ConnectionTypeID": 33,
            "StatusTypeID": 50,
            "LevelID": 3,
            "PowerKW": 36,
            "CurrentTypeID": 30
        },
        {
            "ID": 241720,
            "ConnectionTypeID": 1036,
            "StatusTypeID": 50,
            "LevelID": 2,
            "PowerKW": 36,
            "CurrentTypeID": 20
        },
        {
            "ID": 241721,
            "ConnectionTypeID": 28,
            "StatusTypeID": 50,
            "LevelID": 2,
            "PowerKW": 4,
            "CurrentTypeID": 10
        },
        {
            "ID": 241722,
            "ConnectionTypeID": 28,
            "StatusTypeID": 50,
            "LevelID": 2,
            "PowerKW": 4,
            "CurrentTypeID": 10
        },
        {
            "ID": 241723,
            "ConnectionTypeID": 2,
            "StatusTypeID": 50,
            "LevelID": 3,
            "PowerKW": 36,
            "CurrentTypeID": 30
        },
        {
            "ID": 241724,
            "ConnectionTypeID": 2,
            "StatusTypeID": 50,
            "LevelID": 3,
            "PowerKW": 36,
            "CurrentTypeID": 30
        }
    ],
    "GeneralComments": "Recharge par badge et avec une application smartphone",
    "StatusTypeID": 50,
    "DateLastStatusUpdate": "2020-08-27T05:11:00Z",
    "DataQualityLevel": 2,
    "DateCreated": "2020-03-15T10:53:00Z",
    "SubmissionStatusTypeID": 100
}