{
    "IsRecentlyVerified": false,
    "ID": 139246,
    "UUID": "C28F9A98-21F7-4D81-A39E-96F1DF0E0A14",
    "DataProviderID": 2,
    "DataProvidersReference": "95957",
    "OperatorID": 9,
    "UsageTypeID": 1,
    "AddressInfo": {
        "ID": 139598,
        "Title": "Shell Station 35408 - 24805 N Lake Pleasant Pkwy",
        "AddressLine1": "24805 N Lake Pleasant Pkwy",
        "Town": "Peoria",
        "StateOrProvince": "AZ",
        "Postcode": "85383",
        "CountryID": 2,
        "Latitude": 33.709291,
        "Longitude": -112.271641,
        "ContactTelephone1": "888-998-2546",
        "AccessComments": "MON: 12:00am-11:58pm | TUE: 12:00am-11:58pm | WED: 12:00am-11:58pm | THU: 12:00am-11:58pm | FRI: 12:00am-11:58pm | SAT: 12:00am-11:58pm | SUN: 12:00am-11:58pm",
        "RelatedURL": "http://www.blinkcharging.com/",
        "DistanceUnit": 0
    },
    "Connections": [
        {
            "ID": 194536,
            "ConnectionTypeID": 1,
            "LevelID": 2,
            "Amps": 16,
            "Voltage": 230,
            "PowerKW": 3,
            "CurrentTypeID": 10,
            "Quantity": 2
        },
        {
            "ID": 194537,
            "ConnectionTypeID": 2,
            "LevelID": 3,
            "Amps": 100,
            "Voltage": 400,
            "PowerKW": 40,
            "CurrentTypeID": 30,
            "Quantity": 2
        }
    ],
    "StatusTypeID": 50,
    "DateLastStatusUpdate": "2019-12-24T09:10:00Z",
    "DataQualityLevel": 3,
    "DateCreated": "2019-12-24T09:10:00Z",
    "SubmissionStatusTypeID": 100
}