{
    "IsRecentlyVerified": false,
    "ID": 102393,
    "UUID": "A59902E9-0884-4B24-B101-FB1FE46FA59C",
    "DataProviderID": 2,
    "DataProvidersReference": "94756",
    "UsageTypeID": 1,
    "AddressInfo": {
        "ID": 102739,
        "Title": "Office Building",
        "AddressLine1": "15285 Alton Pkwy",
        "Town": "Irvine",
        "StateOrProvince": "CA",
        "Postcode": "92618",
        "CountryID": 2,
        "Latitude": 33.651367,
        "Longitude": -117.735106,
        "ContactTelephone1": "866-816-7584",
        "AccessComments": "Office business hours; for employee and guest use only",
        "RelatedURL": "http://evconnect.com/",
        "DistanceUnit": 0
    },
    "Connections": [
        {
            "ID": 144464,
            "ConnectionTypeID": 1,
            "LevelID": 2,
            "Amps": 16,
            "Voltage": 230,
            "PowerKW": 3,
            "CurrentTypeID": 10,
            "Quantity": 2
        }
    ],
    "DateLastStatusUpdate": "2019-04-06T04:01:00Z",
    "DataQualityLevel": 3,
    "DateCreated": "2018-04-21T04:13:00Z",
    "SubmissionStatusTypeID": 100
}