{
    "IsRecentlyVerified": false,
    "ID": 57731,
    "UUID": "DD1C2535-A8C6-4946-99A4-7B01EC4A24CB",
    "DataProviderID": 1,
    "OperatorID": 176,
    "UsageTypeID": 6,
    "AddressInfo": {
        "ID": 58077,
        "Title": "ZEAG / Autohaus Weilbacher",
        "AddressLine1": "Wimpfener Straße 122",
        "AddressLine2": "Neckargartach",
        "Town": "Heilbronn",
        "StateOrProvince": "Heilbronn",
        "Postcode": "74078",
        "CountryID": 87,
        "Latitude": 49.184439747239864,
        "Longitude": 9.19955521957399,
        "AccessComments": "Grüne Ladesäule direkt neben der anderen Ladesäule. Laden und Parken kostenlos",
        "RelatedURL": "http://zeag-energie.de/",
        "DistanceUnit": 0
    },
    "Connections": [
        {
            "ID": 73069,
            "ConnectionTypeID": 16,
            "StatusTypeID": 50,
            "LevelID": 2,
            "Amps": 16,
            "Voltage": 230,
            "PowerKW": 3.7,
            "CurrentTypeID": 10,
            "Quantity": 1
        },
        {
            "ID": 73070,
            "ConnectionTypeID": 28,
            "StatusTypeID": 50,
            "LevelID": 2,
            "Amps": 16,
            "Voltage": 230,
            "PowerKW": 3.7,
            "CurrentTypeID": 10,
            "Quantity": 1
        }
    ],
    "NumberOfPoints": 1,
    "StatusTypeID": 50,
    "DateLastStatusUpdate": "2015-12-18T22:01:00Z",
    "DataQualityLevel": 1,
    "DateCreated": "2015-12-18T22:01:00Z",
    "SubmissionStatusTypeID": 200
}