{
    "IsRecentlyVerified": false,
    "ID": 161278,
    "UUID": "9875D051-D3B6-474E-811D-D3D1A6403069",
    "DataProviderID": 1,
    "OperatorID": 3378,
    "UsageTypeID": 5,
    "AddressInfo": {
        "ID": 161635,
        "Title": "Nagykanizsa Garay MOL",
        "AddressLine1": "Gábor Áron utca",
        "AddressLine2": "Garay út 17.",
        "Town": "Nagykanizsa",
        "StateOrProvince": "Zala megye",
        "Postcode": "8800",
        "CountryID": 104,
        "Latitude": 46.466973805511856,
        "Longitude": 16.994574982694303,
        "RelatedURL": "https://molplugee.hu/hu/toltoink",
        "DistanceUnit": 0
    },
    "Connections": [
        {
            "ID": 232056,
            "ConnectionTypeID": 33,
            "StatusTypeID": 50,
            "LevelID": 3,
            "PowerKW": 40,
            "CurrentTypeID": 30,
            "Quantity": 1
        },
        {
            "ID": 232057,
            "ConnectionTypeID": 2,
            "StatusTypeID": 50,
            "LevelID": 3,
            "PowerKW": 40,
            "CurrentTypeID": 30,
            "Quantity": 1
        },
        {
            "ID": 232058,
            "ConnectionTypeID": 1036,
            "StatusTypeID": 50,
            "LevelID": 2,
            "PowerKW": 11,
            "CurrentTypeID": 20,
            "Quantity": 1
        }
    ],
    "NumberOfPoints": 1,
    "GeneralComments": "EFACEC QC45",
    "StatusTypeID": 50,
    "DateLastStatusUpdate": "2020-07-16T16:28:00Z",
    "DataQualityLevel": 1,
    "DateCreated": "2020-07-08T07:50:00Z",
    "SubmissionStatusTypeID": 200
}