{
    "IsRecentlyVerified": false,
    "ID": 18822,
    "UUID": "F74FE4A5-AD4B-4D03-9044-92B720BA173E",
    "DataProviderID": 15,
    "DataProvidersReference": "30507",
    "OperatorID": 1,
    "UsageTypeID": 1,
    "AddressInfo": {
        "ID": 19167,
        "Title": "?????????????9?",
        "AddressLine1": "?????????????9?",
        "Town": "??",
        "StateOrProvince": "",
        "Postcode": "518057",
        "CountryID": 50,
        "Latitude": 22.535926,
        "Longitude": 113.952245,
        "ContactTelephone1": "",
        "RelatedURL": "http://carstations.com/30507",
        "DistanceUnit": 0
    },
    "Connections": [
        {
            "ID": 19055,
            "ConnectionTypeID": 1,
            "Reference": "J1772",
            "LevelID": 2,
            "Quantity": 1
        }
    ],
    "NumberOfPoints": 1,
    "StatusTypeID": 0,
    "DateLastStatusUpdate": "2014-03-22T04:39:00Z",
    "DataQualityLevel": 2,
    "DateCreated": "2013-08-25T03:32:00Z",
    "SubmissionStatusTypeID": 200
}