{
    "IsRecentlyVerified": false,
    "ID": 103423,
    "UUID": "DAD8ED6D-A8DF-4489-9A0B-AC836F28A245",
    "DataProviderID": 1,
    "OperatorID": 3,
    "OperatorsReference": "PG-81861",
    "UsageTypeID": 6,
    "UsageCost": "Free",
    "AddressInfo": {
        "ID": 103769,
        "Title": "CR Morrow-Hyundai",
        "AddressLine1": "109 Millvale Road",
        "Town": "Co Down",
        "Postcode": "BT35 7NB",
        "CountryID": 1,
        "Latitude": 54.198817,
        "Longitude": -6.384142,
        "DistanceUnit": 0
    },
    "Connections": [
        {
            "ID": 146086,
            "ConnectionTypeID": 25,
            "StatusTypeID": 50,
            "LevelID": 2,
            "Amps": 32,
            "Voltage": 230,
            "PowerKW": 7,
            "CurrentTypeID": 10,
            "Quantity": 2
        }
    ],
    "NumberOfPoints": 2,
    "GeneralComments": "This is an open charge unit installed at the CR Morrow - Hyundai dealership in Millvale Road, Bessbrook, Newry",
    "StatusTypeID": 50,
    "DateLastStatusUpdate": "2018-05-02T05:41:00Z",
    "DataQualityLevel": 1,
    "DateCreated": "2018-05-02T05:41:00Z",
    "SubmissionStatusTypeID": 200
}