{
    "IsRecentlyVerified": false,
    "ID": 88815,
    "UUID": "AF3C1E3F-D693-47C8-A85A-A1B495D2547C",
    "DataProviderID": 1,
    "OperatorID": 23,
    "OperatorsReference": "30378",
    "UsageTypeID": 4,
    "AddressInfo": {
        "ID": 89161,
        "Title": "Hilton Garden Inn Queretaro",
        "AddressLine1": "Ignacio Zaragoza 99 Centro",
        "Town": "Queretaro",
        "StateOrProvince": "Queretaro",
        "Postcode": "76180",
        "CountryID": 146,
        "Latitude": 20.575464,
        "Longitude": -100.415176,
        "ContactTelephone1": "+52 442 256 3636",
        "DistanceUnit": 0
    },
    "Connections": [
        {
            "ID": 126063,
            "ConnectionTypeID": 30,
            "StatusTypeID": 50,
            "LevelID": 2,
            "PowerKW": 18,
            "CurrentTypeID": 20,
            "Quantity": 2
        }
    ],
    "NumberOfPoints": 2,
    "GeneralComments": "2 Tesla Connectors, up to 18kW.Available for customers. Please see front desk.",
    "StatusTypeID": 50,
    "DateLastStatusUpdate": "2017-06-09T14:07:00Z",
    "DataQualityLevel": 1,
    "DateCreated": "2017-06-09T14:07:00Z",
    "SubmissionStatusTypeID": 200
}