{
    "UserComments": [
        {
            "ID": 1137,
            "ChargePointID": 16814,
            "CommentTypeID": 50,
            "UserName": "jenkins.andrew",
            "Comment": "Is left unpowered by default and needs a member of staff to turn it on. \n\nWorked fine once this was done.",
            "Rating": 4,
            "DateCreated": "2014-08-23T17:36:21.5Z",
            "User": {
                "ID": 2257,
                "Username": "jenkins.andrew"
            },
            "CheckinStatusTypeID": 10
        }
    ],
    "MediaItems": [
        {
            "ID": 18351,
            "ChargePointID": 16814,
            "ItemURL": "https://s3-ap-southeast-2.amazonaws.com/openchargemap/images/GB/OCM16814/OCM-16814.orig.2019051312220101.jpg",
            "ItemThumbnailURL": "https://s3-ap-southeast-2.amazonaws.com/openchargemap/images/GB/OCM16814/OCM-16814.thmb.2019051312220101.jpg",
            "Comment": "",
            "IsEnabled": true,
            "IsVideo": false,
            "IsFeaturedItem": false,
            "IsExternalResource": false,
            "User": {
                "ID": 15366,
                "Username": "ZCWCara"
            },
            "DateCreated": "2019-05-13T12:22:00Z"
        }
    ],
    "IsRecentlyVerified": false,
    "ID": 16814,
    "UUID": "FA6B37F5-0B70-4331-9FEC-4A457700A665",
    "DataProviderID": 1,
    "OperatorID": 19,
    "UsageTypeID": 1,
    "UsageCost": "",
    "AddressInfo": {
        "ID": 17159,
        "Title": "Best Western Heronston Hotel & Leisure Club",
        "AddressLine1": "Ewenny Road",
        "AddressLine2": "",
        "Town": "Bridgend",
        "StateOrProvince": "Mid Glamorgan ",
        "Postcode": "CF35 5AW",
        "CountryID": 1,
        "Latitude": 51.492119,
        "Longitude": -3.576447,
        "ContactTelephone1": "01656 668811",
        "ContactTelephone2": "",
        "ContactEmail": "reception@bestwesternheronstonhotel.co.uk",
        "AccessComments": "",
        "RelatedURL": "http://www.bw-heronstonhotel.co.uk",
        "DistanceUnit": 0
    },
    "Connections": [
        {
            "ID": 17043,
            "ConnectionTypeID": 25,
            "StatusTypeID": 50,
            "LevelID": 2,
            "Amps": 32,
            "Voltage": 230,
            "PowerKW": 7,
            "CurrentTypeID": 10,
            "Quantity": 1
        }
    ],
    "NumberOfPoints": 1,
    "GeneralComments": "",
    "StatusTypeID": 50,
    "DateLastStatusUpdate": "2019-05-13T12:22:00Z",
    "DataQualityLevel": 1,
    "DateCreated": "2013-06-17T10:02:00Z",
    "SubmissionStatusTypeID": 200
}