{
    "IsRecentlyVerified": false,
    "ID": 48391,
    "UUID": "5B742197-8426-4EE3-AB8B-5548744CAE60",
    "DataProviderID": 1,
    "OperatorID": 20,
    "OperatorsReference": "80566",
    "UsageTypeID": 4,
    "UsageCost": "Free",
    "AddressInfo": {
        "ID": 48737,
        "Title": "Middleton Arena Car Park",
        "AddressLine1": "Corporation Street",
        "Town": "Manchester",
        "Postcode": "M24 1AG",
        "CountryID": 1,
        "Latitude": 53.550412,
        "Longitude": -2.19622,
        "DistanceUnit": 0
    },
    "Connections": [
        {
            "ID": 59832,
            "ConnectionTypeID": 25,
            "StatusTypeID": 50,
            "LevelID": 2,
            "Amps": 32,
            "Voltage": 230,
            "PowerKW": 7,
            "CurrentTypeID": 10,
            "Quantity": 2
        }
    ],
    "NumberOfPoints": 4,
    "StatusTypeID": 50,
    "DateLastStatusUpdate": "2019-04-27T05:16:00Z",
    "DataQualityLevel": 1,
    "DateCreated": "2015-06-25T11:36:00Z",
    "SubmissionStatusTypeID": 200
}