{
    "IsRecentlyVerified": false,
    "ID": 135218,
    "UUID": "F9BB4B3E-9FB5-4253-9318-3EB943389573",
    "DataProviderID": 1,
    "OperatorID": 3327,
    "UsageTypeID": 4,
    "AddressInfo": {
        "ID": 135564,
        "Title": "BeCharge Gambettola Kennedy",
        "AddressLine1": "Via John Fitzgerald Kennedy",
        "Town": "Gambettola",
        "StateOrProvince": "FC",
        "Postcode": "47035",
        "CountryID": 112,
        "Latitude": 44.11943818139386,
        "Longitude": 12.34265871832281,
        "ContactTelephone1": "02-49527730",
        "ContactEmail": "emobility@buildingenergy.it",
        "RelatedURL": "https://www.bec.energy/",
        "DistanceUnit": 0
    },
    "Connections": [
        {
            "ID": 189319,
            "ConnectionTypeID": 25,
            "StatusTypeID": 50,
            "LevelID": 2,
            "Amps": 32,
            "Voltage": 400,
            "PowerKW": 22,
            "CurrentTypeID": 20,
            "Quantity": 2
        }
    ],
    "NumberOfPoints": 2,
    "StatusTypeID": 50,
    "DateLastStatusUpdate": "2019-12-11T14:47:00Z",
    "DataQualityLevel": 1,
    "DateCreated": "2019-12-11T14:47:00Z",
    "SubmissionStatusTypeID": 200
}