{
    "IsRecentlyVerified": false,
    "ID": 52373,
    "UUID": "005826CA-AA0D-4DFA-AFC7-091F4C980E64",
    "DataProviderID": 1,
    "OperatorID": 105,
    "UsageTypeID": 1,
    "UsageCost": "0",
    "AddressInfo": {
        "ID": 52719,
        "Title": "E-Bike Station Parkplatz der Gemeindeverwaltung",
        "AddressLine1": "Gartenstiege",
        "Town": "Altenberge",
        "Postcode": "48341",
        "CountryID": 87,
        "Latitude": 52.046965900000004,
        "Longitude": 7.46779820000006,
        "RelatedURL": "http://www.rwe.com/web/cms/de/494436/e-bikes-on-tour/ladestationen/",
        "DistanceUnit": 0
    },
    "Connections": [
        {
            "ID": 65026,
            "ConnectionTypeID": 28,
            "StatusTypeID": 50,
            "LevelID": 1,
            "Amps": 10,
            "Voltage": 230,
            "PowerKW": 2.3,
            "CurrentTypeID": 10,
            "Quantity": 3
        }
    ],
    "NumberOfPoints": 3,
    "StatusTypeID": 50,
    "DateLastStatusUpdate": "2015-08-29T07:48:00Z",
    "DataQualityLevel": 1,
    "DateCreated": "2015-08-28T21:02:00Z",
    "SubmissionStatusTypeID": 200
}