{
    "IsRecentlyVerified": false,
    "ID": 175066,
    "UUID": "3E3FB6C2-2227-4420-8C7D-0A8F67352C18",
    "DataProviderID": 1,
    "OperatorID": 192,
    "UsageTypeID": 1,
    "AddressInfo": {
        "ID": 175425,
        "Title": "E.ON ČS MOL Praha Chlumecká",
        "AddressLine1": "Chlumecká: PHM MOL",
        "AddressLine2": "Černý Most",
        "StateOrProvince": "Praha",
        "Postcode": "19707",
        "CountryID": 64,
        "Latitude": 50.11071526972958,
        "Longitude": 14.57674184542907,
        "AccessComments": "Zaplatit můžete přes QR kód nebo na adrese nabijeni.eon-drive.cz. Na webu zadejte číslo dobíjecího bodu, svůj e-mail a číslo svojí platební karty. Pak už jen potvrďte konektor a dobíjíte. ",
        "RelatedURL": "http://nabijeni.e-on-drive.cz",
        "DistanceUnit": 0
    },
    "Connections": [
        {
            "ID": 271317,
            "ConnectionTypeID": 2,
            "StatusTypeID": 50,
            "LevelID": 3,
            "PowerKW": 50,
            "CurrentTypeID": 30,
            "Quantity": 1
        },
        {
            "ID": 271318,
            "ConnectionTypeID": 33,
            "StatusTypeID": 50,
            "LevelID": 3,
            "PowerKW": 50,
            "CurrentTypeID": 30,
            "Quantity": 1
        },
        {
            "ID": 271319,
            "ConnectionTypeID": 25,
            "StatusTypeID": 50,
            "LevelID": 3,
            "Amps": 64,
            "Voltage": 400,
            "PowerKW": 43,
            "CurrentTypeID": 20,
            "Quantity": 1
        }
    ],
    "NumberOfPoints": 1,
    "StatusTypeID": 50,
    "DateLastStatusUpdate": "2021-04-28T08:45:00Z",
    "DataQualityLevel": 1,
    "DateCreated": "2021-04-25T16:08:00Z",
    "SubmissionStatusTypeID": 200
}