{
    "IsRecentlyVerified": false,
    "ID": 64866,
    "UUID": "6A486767-1117-47EB-B871-629454340A1E",
    "DataProviderID": 1,
    "OperatorID": 45,
    "UsageTypeID": 3,
    "AddressInfo": {
        "ID": 65212,
        "Title": "Ferienhaus Reilingen",
        "AddressLine1": "Hauptstraße 162",
        "Town": "Reilingen",
        "StateOrProvince": "Rhein-Neckar-Kreis",
        "Postcode": "68799",
        "CountryID": 87,
        "Latitude": 49.2909,
        "Longitude": 8.564910000000054,
        "ContactTelephone1": "+49 6205 102193",
        "AccessComments": "Täglich nutzbar von 8-20Uhr nach telefonischer Anmeldung. Stromkosten nach Vereinbarung.",
        "RelatedURL": "http://www.ferienhaus-reilingen.de/",
        "DistanceUnit": 0
    },
    "Connections": [
        {
            "ID": 83414,
            "ConnectionTypeID": 25,
            "StatusTypeID": 50,
            "LevelID": 2,
            "Amps": 32,
            "Voltage": 400,
            "PowerKW": 22,
            "CurrentTypeID": 20,
            "Quantity": 1
        },
        {
            "ID": 83415,
            "ConnectionTypeID": 28,
            "StatusTypeID": 50,
            "LevelID": 2,
            "Amps": 16,
            "Voltage": 230,
            "PowerKW": 3.7,
            "CurrentTypeID": 10,
            "Quantity": 1
        }
    ],
    "NumberOfPoints": 1,
    "StatusTypeID": 50,
    "DateLastStatusUpdate": "2016-03-30T08:34:00Z",
    "DataQualityLevel": 1,
    "DateCreated": "2016-03-30T08:34:00Z",
    "SubmissionStatusTypeID": 200
}