{
    "IsRecentlyVerified": false,
    "ID": 167230,
    "UUID": "FC40B7ED-1585-4321-A4A9-BC4AF53935DB",
    "DataProviderID": 1,
    "OperatorID": 164,
    "UsageTypeID": 4,
    "AddressInfo": {
        "ID": 167589,
        "Title": "Neogy 100kw San Cassiano",
        "AddressLine1": "48 Strada Micurá de Rü",
        "Town": "San Cassiano",
        "StateOrProvince": "BZ",
        "Postcode": "39036",
        "CountryID": 112,
        "Latitude": 46.570196335333634,
        "Longitude": 11.933338593198869,
        "DistanceUnit": 0
    },
    "Connections": [
        {
            "ID": 253255,
            "ConnectionTypeID": 33,
            "StatusTypeID": 50,
            "LevelID": 3,
            "PowerKW": 100,
            "CurrentTypeID": 30,
            "Quantity": 1
        },
        {
            "ID": 253256,
            "ConnectionTypeID": 2,
            "StatusTypeID": 50,
            "LevelID": 3,
            "PowerKW": 85,
            "CurrentTypeID": 30,
            "Quantity": 1
        }
    ],
    "NumberOfPoints": 2,
    "StatusTypeID": 50,
    "DateLastStatusUpdate": "2020-09-01T14:54:00Z",
    "DataQualityLevel": 1,
    "DateCreated": "2020-08-31T18:19:00Z",
    "SubmissionStatusTypeID": 200
}