{
    "IsRecentlyVerified": false,
    "ID": 120317,
    "UUID": "D6FE33AA-9516-491D-BE52-DDC9AFA80976",
    "DataProviderID": 2,
    "DataProvidersReference": "68133",
    "UsageTypeID": 2,
    "AddressInfo": {
        "ID": 120663,
        "Title": "Alabama Power - Thomasville",
        "AddressLine1": "32020 Highway 43 S",
        "Town": "Thomasville",
        "StateOrProvince": "AL",
        "Postcode": "36784",
        "CountryID": 2,
        "Latitude": 31.907396,
        "Longitude": -87.74143,
        "ContactTelephone1": "",
        "AccessComments": "",
        "RelatedURL": "",
        "DistanceUnit": 0
    },
    "Connections": [
        {
            "ID": 169651,
            "ConnectionTypeID": 1,
            "LevelID": 2,
            "Amps": 16,
            "Voltage": 230,
            "PowerKW": 3.7,
            "CurrentTypeID": 10,
            "Quantity": 1
        }
    ],
    "DateLastStatusUpdate": "2020-06-26T02:54:00Z",
    "DataQualityLevel": 3,
    "DateCreated": "2019-04-01T04:59:00Z",
    "SubmissionStatusTypeID": 100
}