{
    "IsRecentlyVerified": false,
    "ID": 138118,
    "UUID": "E32826E2-5925-4A67-90DF-68327946D595",
    "DataProviderID": 2,
    "DataProvidersReference": "117688",
    "OperatorID": 5,
    "UsageTypeID": 1,
    "AddressInfo": {
        "ID": 138467,
        "Title": "KEAUHOUPLACE",
        "AddressLine1": "601-617 Halekauwila St",
        "Town": "Honolulu",
        "StateOrProvince": "HI",
        "Postcode": "96813",
        "CountryID": 2,
        "Latitude": 21.3015909,
        "Longitude": -157.8598219,
        "ContactTelephone1": "888-758-4389",
        "AccessComments": "24 hours daily",
        "RelatedURL": "http://www.chargepoint.com/",
        "DistanceUnit": 0
    },
    "Connections": [
        {
            "ID": 193175,
            "ConnectionTypeID": 1,
            "LevelID": 2,
            "Amps": 16,
            "Voltage": 230,
            "PowerKW": 3.7,
            "CurrentTypeID": 10,
            "Quantity": 1
        }
    ],
    "StatusTypeID": 50,
    "DateLastStatusUpdate": "2020-06-26T02:52:00Z",
    "DataQualityLevel": 3,
    "DateCreated": "2019-12-24T09:08:00Z",
    "SubmissionStatusTypeID": 100
}