{
    "IsRecentlyVerified": false,
    "ID": 187654,
    "UUID": "FBCAF9CB-9857-4A1E-94EF-9F69303BF881",
    "DataProviderID": 18,
    "DataProvidersReference": "9eb2f9dd63ee1a6e874af5249d76599e",
    "OperatorID": 2244,
    "UsageTypeID": 5,
    "AddressInfo": {
        "ID": 188013,
        "Title": "16 Daisy Lane",
        "AddressLine1": "16 Daisy Lane",
        "Town": "London",
        "Postcode": "SW6 3DD",
        "CountryID": 1,
        "Latitude": 51.468134,
        "Longitude": -0.197259,
        "AccessComments": "",
        "RelatedURL": "https://www.ubitricity.com",
        "DistanceUnit": 0
    },
    "Connections": [
        {
            "ID": 302882,
            "ConnectionTypeID": 25,
            "Reference": "suby1100004809",
            "StatusTypeID": 50,
            "LevelID": 2,
            "Amps": 16,
            "Voltage": 230,
            "PowerKW": 3.7,
            "CurrentTypeID": 10
        }
    ],
    "StatusTypeID": 0,
    "DateLastStatusUpdate": "2021-07-12T03:38:00Z",
    "MetadataValues": [
        {
            "ID": 19894,
            "MetadataFieldID": 4,
            "ItemValue": "Contains public sector information licensed under the Open Government Licence v2.0. http://www.nationalarchives.gov.uk/doc/open-government-licence/version/2/"
        }
    ],
    "DataQualityLevel": 3,
    "DateCreated": "2021-07-12T03:38:00Z",
    "SubmissionStatusTypeID": 100
}