{
    "IsRecentlyVerified": false,
    "ID": 116458,
    "UUID": "01000DFF-A50D-47E9-976D-8E8D250B7675",
    "DataProviderID": 1,
    "DataProvidersReference": "1800",
    "AddressInfo": {
        "ID": 116804,
        "Title": "KCA Deutag Drilling",
        "AddressLine1": "Espehaugen 37",
        "Town": "BLOMSTERDALEN",
        "StateOrProvince": "Vestland",
        "Postcode": "5258",
        "CountryID": 168,
        "Latitude": 60.27702,
        "Longitude": 5.23276,
        "AccessComments": "For besøkende og ansatte i p-kjeller.",
        "DistanceUnit": 0
    },
    "Connections": [
        {
            "ID": 164562,
            "ConnectionTypeID": 0,
            "Reference": "1",
            "LevelID": 2,
            "Amps": 16,
            "Voltage": 230,
            "PowerKW": 3.7,
            "Comments": "Mode 1"
        },
        {
            "ID": 164563,
            "ConnectionTypeID": 0,
            "Reference": "2",
            "LevelID": 2,
            "Amps": 16,
            "Voltage": 230,
            "PowerKW": 3.7,
            "Comments": "Mode 1"
        },
        {
            "ID": 164564,
            "ConnectionTypeID": 0,
            "Reference": "3",
            "LevelID": 2,
            "Amps": 16,
            "Voltage": 230,
            "PowerKW": 3.7,
            "Comments": "Mode 1"
        },
        {
            "ID": 164565,
            "ConnectionTypeID": 0,
            "Reference": "4",
            "LevelID": 2,
            "Amps": 16,
            "Voltage": 230,
            "PowerKW": 3.7,
            "Comments": "Mode 1"
        },
        {
            "ID": 164566,
            "ConnectionTypeID": 0,
            "Reference": "5",
            "LevelID": 2,
            "Amps": 16,
            "Voltage": 230,
            "PowerKW": 3.7,
            "Comments": "Mode 1"
        }
    ],
    "NumberOfPoints": 5,
    "DateLastStatusUpdate": "2020-05-26T08:24:00Z",
    "DataQualityLevel": 2,
    "DateCreated": "2019-02-11T09:16:00Z",
    "SubmissionStatusTypeID": 100
}