{
    "UserComments": [
        {
            "ID": 17997,
            "ChargePointID": 94633,
            "CommentTypeID": 10,
            "UserName": "CharGirl",
            "Comment": "Nice people at the hotel.  The rooms are clean and so are the beds.  I would stop again on my way back!",
            "Rating": 5,
            "DateCreated": "2017-12-03T16:23:45.837Z",
            "User": {
                "ID": 16604,
                "Username": "CharGirl"
            },
            "CheckinStatusTypeID": 10
        }
    ],
    "MediaItems": [
        {
            "ID": 13763,
            "ChargePointID": 94633,
            "ItemURL": "https://s3-ap-southeast-2.amazonaws.com/openchargemap/images/US/OCM94633/OCM-94633.orig.2017120316220451.jpg",
            "ItemThumbnailURL": "https://s3-ap-southeast-2.amazonaws.com/openchargemap/images/US/OCM94633/OCM-94633.thmb.2017120316220451.jpg",
            "Comment": "",
            "IsEnabled": true,
            "IsVideo": false,
            "IsFeaturedItem": false,
            "IsExternalResource": false,
            "User": {
                "ID": 16604,
                "Username": "CharGirl"
            },
            "DateCreated": "2017-12-03T16:22:00Z"
        },
        {
            "ID": 13762,
            "ChargePointID": 94633,
            "ItemURL": "https://s3-ap-southeast-2.amazonaws.com/openchargemap/images/US/OCM94633/OCM-94633.orig.2017120316211757.jpg",
            "ItemThumbnailURL": "https://s3-ap-southeast-2.amazonaws.com/openchargemap/images/US/OCM94633/OCM-94633.thmb.2017120316211757.jpg",
            "Comment": "They work and you can get the WiFi at your car.  Very nice and clean rooms.  If you need a clean room and clean bed and not much else then this is the place to stop",
            "IsEnabled": true,
            "IsVideo": false,
            "IsFeaturedItem": false,
            "IsExternalResource": false,
            "User": {
                "ID": 16604,
                "Username": "CharGirl"
            },
            "DateCreated": "2017-12-03T16:21:00Z"
        }
    ],
    "IsRecentlyVerified": false,
    "ID": 94633,
    "UUID": "3D9D2C19-AC38-4BFD-9B58-EB5B8E28BE1F",
    "DataProviderID": 1,
    "OperatorID": 23,
    "OperatorsReference": "36828",
    "UsageTypeID": 1,
    "AddressInfo": {
        "ID": 94979,
        "Title": "Motel 6 Sandusky-Milan",
        "AddressLine1": "11406 U.s. 250 N",
        "Town": "Milan",
        "StateOrProvince": "Ohio",
        "Postcode": "44846",
        "CountryID": 2,
        "Latitude": 41.3291153,
        "Longitude": -82.6206529,
        "ContactTelephone1": "(419) 499-8001",
        "AccessComments": "Located directly off of the Ohio Turnpike 80/90",
        "DistanceUnit": 0
    },
    "Connections": [
        {
            "ID": 133786,
            "ConnectionTypeID": 30,
            "StatusTypeID": 50,
            "LevelID": 2,
            "PowerKW": 16,
            "CurrentTypeID": 20,
            "Quantity": 4
        },
        {
            "ID": 136003,
            "ConnectionTypeID": 9,
            "StatusTypeID": 50,
            "LevelID": 2,
            "CurrentTypeID": 10,
            "Quantity": 4
        }
    ],
    "NumberOfPoints": 4,
    "GeneralComments": "4 Tesla Connectors, up to 16kW.Available for customers. Please see front desk.",
    "StatusTypeID": 50,
    "DateLastStatusUpdate": "2018-01-21T15:57:00Z",
    "DataQualityLevel": 1,
    "DateCreated": "2017-10-22T05:40:00Z",
    "SubmissionStatusTypeID": 200
}