{
    "IsRecentlyVerified": false,
    "ID": 135480,
    "UUID": "35505956-5B39-4348-BC5B-48CC5C68AA9E",
    "DataProviderID": 1,
    "OperatorID": 3367,
    "UsageTypeID": 4,
    "AddressInfo": {
        "ID": 135826,
        "Title": "SHARZ - Tekirdağ Tekpark",
        "AddressLine1": "Mimar Sinan Caddesi, 20",
        "Town": "Tekirdağ",
        "StateOrProvince": "Tekirdağ",
        "Postcode": "59000",
        "CountryID": 229,
        "Latitude": 40.978343902931755,
        "Longitude": 27.515527748778368,
        "DistanceUnit": 0
    },
    "Connections": [
        {
            "ID": 189818,
            "ConnectionTypeID": 25,
            "StatusTypeID": 50,
            "LevelID": 2,
            "Amps": 32,
            "Voltage": 400,
            "PowerKW": 22,
            "CurrentTypeID": 20,
            "Quantity": 2
        }
    ],
    "NumberOfPoints": 1,
    "GeneralComments": "www.sharz.net",
    "StatusTypeID": 50,
    "DateLastStatusUpdate": "2019-12-22T18:21:00Z",
    "DataQualityLevel": 1,
    "DateCreated": "2019-12-22T18:21:00Z",
    "SubmissionStatusTypeID": 200
}