{
    "IsRecentlyVerified": false,
    "ID": 184271,
    "UUID": "F7B866BE-9640-4743-962E-80C7A947E2A5",
    "DataProviderID": 29,
    "DataProvidersReference": "13582",
    "AddressInfo": {
        "ID": 184630,
        "Title": "Wendenstraße 196",
        "AddressLine1": "Wendenstraße 196",
        "Town": "Hamburg",
        "Postcode": "20537",
        "CountryID": 87,
        "Latitude": 53.5479457,
        "Longitude": 10.0383059,
        "DistanceUnit": 0
    },
    "Connections": [
        {
            "ID": 292318,
            "ConnectionTypeID": 25,
            "StatusTypeID": 50,
            "LevelID": 2,
            "PowerKW": 22,
            "CurrentTypeID": 20
        },
        {
            "ID": 292319,
            "ConnectionTypeID": 25,
            "StatusTypeID": 50,
            "LevelID": 2,
            "PowerKW": 22,
            "CurrentTypeID": 20
        }
    ],
    "StatusTypeID": 50,
    "DateLastStatusUpdate": "2021-07-12T02:51:00Z",
    "MetadataValues": [
        {
            "ID": 16562,
            "MetadataFieldID": 4,
            "ItemValue": "Data from the German chargepoint registry provided by Bundesnetzagentur.de under the CC-BY 4.0 license"
        }
    ],
    "DataQualityLevel": 3,
    "DateCreated": "2021-07-08T10:05:00Z",
    "SubmissionStatusTypeID": 100
}