{
    "IsRecentlyVerified": false,
    "ID": 133474,
    "UUID": "ED2A4721-2784-4BFB-896A-209601F2510E",
    "DataProviderID": 1,
    "OperatorID": 80,
    "UsageTypeID": 4,
    "AddressInfo": {
        "ID": 133820,
        "Title": "Cerano Bricco | EnelX",
        "AddressLine1": "Via Fratelli Bricco, 15",
        "Town": "Cerano",
        "StateOrProvince": "NO",
        "Postcode": "28065",
        "CountryID": 112,
        "Latitude": 45.4115235855793,
        "Longitude": 8.78376211476234,
        "ContactTelephone1": "800.069.850",
        "RelatedURL": "https://www.enelx.com/it/it/emobility",
        "DistanceUnit": 0
    },
    "Connections": [
        {
            "ID": 186835,
            "ConnectionTypeID": 25,
            "StatusTypeID": 50,
            "LevelID": 2,
            "Amps": 32,
            "Voltage": 400,
            "PowerKW": 22,
            "CurrentTypeID": 20,
            "Quantity": 2
        }
    ],
    "NumberOfPoints": 2,
    "StatusTypeID": 50,
    "DateLastStatusUpdate": "2019-10-18T15:35:00Z",
    "DataQualityLevel": 1,
    "DateCreated": "2019-10-18T15:35:00Z",
    "SubmissionStatusTypeID": 200
}