{
    "IsRecentlyVerified": false,
    "ID": 170092,
    "UUID": "1E82F554-4035-4A6A-AA22-4CBEB0DB4F53",
    "DataProviderID": 1,
    "OperatorID": 23,
    "OperatorsReference": "34562",
    "UsageTypeID": 4,
    "UsageCost": "€0.28/kWh; andere tarieven voor oudere auto's/Autres tarifs pour les voitures anciennes",
    "AddressInfo": {
        "ID": 170451,
        "Title": "Namur Supercharger",
        "AddressLine1": "2 Avenue d'Ecolys",
        "Town": "Suarlée",
        "Postcode": "5020",
        "CountryID": 26,
        "Latitude": 50.486021,
        "Longitude": 4.797235,
        "DistanceUnit": 0
    },
    "Connections": [
        {
            "ID": 259309,
            "ConnectionTypeID": 27,
            "StatusTypeID": 50,
            "LevelID": 3,
            "PowerKW": 120,
            "CurrentTypeID": 30,
            "Quantity": 15
        }
    ],
    "NumberOfPoints": 15,
    "GeneralComments": "Charging11 superchargers, available 24/7, up to 250kW",
    "StatusTypeID": 50,
    "DateLastStatusUpdate": "2020-12-24T06:35:00Z",
    "DataQualityLevel": 1,
    "DateCreated": "2020-11-18T06:48:00Z",
    "SubmissionStatusTypeID": 200
}