{
    "IsRecentlyVerified": false,
    "ID": 35424,
    "UUID": "C26D9823-1474-432C-B4D6-51EA1D371B77",
    "DataProviderID": 26,
    "DataProvidersReference": "48731",
    "OperatorID": 178,
    "OperatorsReference": "EVnetNL REE617",
    "UsageCost": "0.00 jaarabonnement",
    "AddressInfo": {
        "ID": 35770,
        "Title": "Kerkweg-Oost",
        "AddressLine1": "Kerkweg-Oost",
        "Town": "Waddinxveen",
        "Postcode": "2741 HE",
        "CountryID": 159,
        "Latitude": 52.04336,
        "Longitude": 4.65794,
        "ContactTelephone1": "0800-3522365",
        "RelatedURL": "http://www.evnet.nl",
        "DistanceUnit": 0
    },
    "Connections": [
        {
            "ID": 38935,
            "ConnectionTypeID": 25,
            "LevelID": 1,
            "PowerKW": 2.3,
            "CurrentTypeID": 10
        }
    ],
    "NumberOfPoints": 1,
    "StatusTypeID": 50,
    "DateLastStatusUpdate": "2016-06-04T02:44:00Z",
    "DataQualityLevel": 3,
    "DateCreated": "2015-01-09T06:04:00Z",
    "SubmissionStatusTypeID": 100
}