{
    "IsRecentlyVerified": false,
    "ID": 114129,
    "UUID": "5CF034CA-17C6-4720-80F8-4DEBC8C61730",
    "DataProviderID": 1,
    "OperatorID": 23,
    "OperatorsReference": "47916",
    "UsageTypeID": 4,
    "AddressInfo": {
        "ID": 114475,
        "Title": "Villa del Palmar At the Islands of Loreto",
        "AddressLine1": "M. 84 Calle Carretera Transpeninsular Ensenada Blanca",
        "Town": "Loreto",
        "StateOrProvince": "Baja California Sur",
        "Postcode": "23880",
        "CountryID": 146,
        "Latitude": 25.717947,
        "Longitude": -111.233261,
        "ContactTelephone1": "+52 613 134 1010",
        "DistanceUnit": 0
    },
    "Connections": [
        {
            "ID": 160699,
            "ConnectionTypeID": 30,
            "StatusTypeID": 50,
            "LevelID": 2,
            "PowerKW": 18,
            "CurrentTypeID": 20,
            "Quantity": 2
        }
    ],
    "NumberOfPoints": 2,
    "GeneralComments": "2 Tesla Connectors, up to 18kW.Available for customers. Self park.",
    "StatusTypeID": 50,
    "DateLastStatusUpdate": "2019-01-03T07:58:00Z",
    "DataQualityLevel": 1,
    "DateCreated": "2019-01-03T07:58:00Z",
    "SubmissionStatusTypeID": 200
}