{
    "IsRecentlyVerified": false,
    "ID": 32402,
    "UUID": "28D9F08D-EFDB-454F-8165-FA0112A2DAE0",
    "DataProviderID": 26,
    "DataProvidersReference": "47063",
    "OperatorID": 178,
    "OperatorsReference": "EVnetNL AL205",
    "UsageCost": "0.00 jaarabonnement",
    "AddressInfo": {
        "ID": 32748,
        "Title": "Stadhouderslaan",
        "AddressLine1": "Stadhouderslaan",
        "Town": "Stein",
        "Postcode": "6171 ZZ",
        "CountryID": 159,
        "Latitude": 50.967828,
        "Longitude": 5.7683,
        "ContactTelephone1": "0800-3522365",
        "RelatedURL": "http://www.evnet.nl",
        "DistanceUnit": 0
    },
    "Connections": [
        {
            "ID": 35913,
            "ConnectionTypeID": 25,
            "LevelID": 2,
            "PowerKW": 11,
            "CurrentTypeID": 10
        },
        {
            "ID": 95381,
            "ConnectionTypeID": 25,
            "LevelID": 2,
            "PowerKW": 11,
            "CurrentTypeID": 10
        }
    ],
    "NumberOfPoints": 1,
    "StatusTypeID": 50,
    "DateLastStatusUpdate": "2016-06-04T02:38:00Z",
    "DataQualityLevel": 3,
    "DateCreated": "2015-01-09T06:03:00Z",
    "SubmissionStatusTypeID": 100
}