{
    "IsRecentlyVerified": false,
    "ID": 159326,
    "UUID": "26E38A0D-DB29-4F10-B489-7429453BF6E8",
    "DataProviderID": 2,
    "DataProvidersReference": "152528",
    "OperatorID": 5,
    "UsageTypeID": 1,
    "AddressInfo": {
        "ID": 159683,
        "Title": "GP14",
        "AddressLine1": "1351 N Rolfe St",
        "Town": "Arlington",
        "StateOrProvince": "VA",
        "Postcode": "22209",
        "CountryID": 2,
        "Latitude": 38.889959,
        "Longitude": -77.07967,
        "ContactTelephone1": "888-758-4389",
        "AccessComments": "24 hours daily",
        "RelatedURL": "http://www.chargepoint.com/",
        "DistanceUnit": 0
    },
    "Connections": [
        {
            "ID": 229474,
            "ConnectionTypeID": 1,
            "LevelID": 2,
            "Amps": 16,
            "Voltage": 230,
            "PowerKW": 3.7,
            "CurrentTypeID": 10,
            "Quantity": 4
        }
    ],
    "StatusTypeID": 50,
    "DateLastStatusUpdate": "2020-06-26T03:00:00Z",
    "DataQualityLevel": 3,
    "DateCreated": "2020-06-26T03:00:00Z",
    "SubmissionStatusTypeID": 100
}