{
    "IsRecentlyVerified": false,
    "ID": 178963,
    "UUID": "C5FD94E5-6D7F-4D76-B1F4-CB6E6F7FC281",
    "DataProviderID": 29,
    "DataProvidersReference": "1387",
    "AddressInfo": {
        "ID": 179322,
        "Title": "Deggedorfer Straße 39",
        "AddressLine1": "Deggedorfer Straße 39",
        "Town": "Hengersberg",
        "Postcode": "94469",
        "CountryID": 87,
        "Latitude": 48.777609,
        "Longitude": 13.051009,
        "DistanceUnit": 0
    },
    "Connections": [
        {
            "ID": 280102,
            "ConnectionTypeID": 25,
            "StatusTypeID": 50,
            "LevelID": 2,
            "PowerKW": 22,
            "CurrentTypeID": 20
        },
        {
            "ID": 280103,
            "ConnectionTypeID": 25,
            "StatusTypeID": 50,
            "LevelID": 2,
            "PowerKW": 22,
            "CurrentTypeID": 20
        },
        {
            "ID": 296166,
            "ConnectionTypeID": 25,
            "StatusTypeID": 50,
            "LevelID": 2,
            "PowerKW": 22,
            "CurrentTypeID": 20
        },
        {
            "ID": 296167,
            "ConnectionTypeID": 25,
            "StatusTypeID": 50,
            "LevelID": 2,
            "PowerKW": 22,
            "CurrentTypeID": 20
        }
    ],
    "StatusTypeID": 50,
    "DateLastStatusUpdate": "2021-07-12T02:41:00Z",
    "MetadataValues": [
        {
            "ID": 11257,
            "MetadataFieldID": 4,
            "ItemValue": "Data from the German chargepoint registry provided by Bundesnetzagentur.de under the CC-BY 4.0 license"
        }
    ],
    "DataQualityLevel": 3,
    "DateCreated": "2021-07-08T09:59:00Z",
    "SubmissionStatusTypeID": 100
}