{
    "IsRecentlyVerified": false,
    "ID": 71445,
    "UUID": "BDC0F770-CFF0-451A-BFE1-3E95C44668E4",
    "DataProviderID": 2,
    "DataProvidersReference": "77373",
    "OperatorID": 5,
    "UsageTypeID": 1,
    "AddressInfo": {
        "ID": 71791,
        "Title": "COUNTY SONOMA",
        "AddressLine1": "205 W 1st St",
        "Town": "Cloverdale",
        "StateOrProvince": "CA",
        "Postcode": "95425",
        "CountryID": 2,
        "Latitude": 38.804293,
        "Longitude": -123.017978,
        "ContactTelephone1": "888-758-4389",
        "AccessComments": "24 hours daily",
        "RelatedURL": "http://www.chargepoint.com/",
        "DistanceUnit": 0
    },
    "Connections": [
        {
            "ID": 102263,
            "ConnectionTypeID": 9,
            "LevelID": 1,
            "Amps": 16,
            "Voltage": 120,
            "PowerKW": 1,
            "CurrentTypeID": 10,
            "Quantity": 2
        },
        {
            "ID": 102264,
            "ConnectionTypeID": 1,
            "LevelID": 2,
            "Amps": 16,
            "Voltage": 230,
            "PowerKW": 3,
            "CurrentTypeID": 10,
            "Quantity": 2
        }
    ],
    "DateLastStatusUpdate": "2019-12-24T09:15:00Z",
    "DataQualityLevel": 3,
    "DateCreated": "2016-09-02T10:15:00Z",
    "SubmissionStatusTypeID": 100
}