{
    "IsRecentlyVerified": false,
    "ID": 88367,
    "UUID": "6A113B30-4972-4C99-94D5-314B965D402B",
    "DataProviderID": 1,
    "OperatorID": 69,
    "UsageTypeID": 4,
    "AddressInfo": {
        "ID": 88713,
        "Title": "Theresienstraße",
        "AddressLine1": "Theresienstraße 53",
        "AddressLine2": "Maxvorstadt",
        "Town": "München",
        "StateOrProvince": "Bayern",
        "Postcode": "80333",
        "CountryID": 87,
        "Latitude": 48.15073169999999,
        "Longitude": 11.565213099999937,
        "RelatedURL": "http://www.swm.de/privatkunden/unternehmen/innovation/elektromobilitaet.html",
        "DistanceUnit": 0
    },
    "Connections": [
        {
            "ID": 125342,
            "ConnectionTypeID": 25,
            "StatusTypeID": 50,
            "LevelID": 2,
            "Amps": 32,
            "Voltage": 400,
            "PowerKW": 22,
            "CurrentTypeID": 20,
            "Quantity": 2
        }
    ],
    "NumberOfPoints": 2,
    "GeneralComments": "24/7 nutzbare Ladesäule der Stadtwerke München (SWM) im Verbund Ladenetz.",
    "StatusTypeID": 50,
    "DateLastStatusUpdate": "2017-05-29T06:00:00Z",
    "DataQualityLevel": 1,
    "DateCreated": "2017-05-29T06:00:00Z",
    "SubmissionStatusTypeID": 200
}