{
    "IsRecentlyVerified": false,
    "ID": 181630,
    "UUID": "3DD1537C-8193-4408-BE4E-EC8D8B97095E",
    "DataProviderID": 29,
    "DataProvidersReference": "17207",
    "AddressInfo": {
        "ID": 181989,
        "Title": "Roggenweg 18",
        "AddressLine1": "Roggenweg 18",
        "Town": "Markgröningen",
        "Postcode": "71706",
        "CountryID": 87,
        "Latitude": 48.896968,
        "Longitude": 9.096253,
        "DistanceUnit": 0
    },
    "Connections": [
        {
            "ID": 286223,
            "ConnectionTypeID": 25,
            "StatusTypeID": 50,
            "LevelID": 2,
            "PowerKW": 22,
            "CurrentTypeID": 20
        },
        {
            "ID": 286224,
            "ConnectionTypeID": 25,
            "StatusTypeID": 50,
            "LevelID": 2,
            "PowerKW": 22,
            "CurrentTypeID": 20
        }
    ],
    "StatusTypeID": 50,
    "DateLastStatusUpdate": "2021-07-12T02:42:00Z",
    "MetadataValues": [
        {
            "ID": 13924,
            "MetadataFieldID": 4,
            "ItemValue": "Data from the German chargepoint registry provided by Bundesnetzagentur.de under the CC-BY 4.0 license"
        }
    ],
    "DataQualityLevel": 3,
    "DateCreated": "2021-07-08T10:02:00Z",
    "SubmissionStatusTypeID": 100
}