{
    "UserComments": [
        {
            "ID": 8187,
            "ChargePointID": 19395,
            "CommentTypeID": 10,
            "UserName": "Christopher Richards",
            "Comment": "Spaces are a little short and charging was a little slow. Free juice was still available though. ",
            "Rating": 3,
            "DateCreated": "2015-12-10T00:00:37.46Z",
            "User": {
                "ID": 6687,
                "Username": "Christopher Richards"
            },
            "CheckinStatusTypeID": 10
        },
        {
            "ID": 4003,
            "ChargePointID": 19395,
            "CommentTypeID": 10,
            "UserName": "Simon Hewison",
            "Comment": "",
            "Rating": 4,
            "DateCreated": "2015-03-15T14:54:03.197Z",
            "User": {
                "ID": 4575,
                "Username": "Simon Hewison"
            },
            "CheckinStatusTypeID": 10
        }
    ],
    "MediaItems": [
        {
            "ID": 1111,
            "ChargePointID": 19395,
            "ItemURL": "https://s3-ap-southeast-2.amazonaws.com/openchargemap/images/GB/OCM19395/OCM-19395.orig.2015031617355606.jpg",
            "ItemThumbnailURL": "https://s3-ap-southeast-2.amazonaws.com/openchargemap/images/GB/OCM19395/OCM-19395.thmb.2015031617355606.jpg",
            "Comment": "",
            "IsEnabled": true,
            "IsVideo": false,
            "IsFeaturedItem": false,
            "IsExternalResource": false,
            "User": {
                "ID": 4575,
                "Username": "Simon Hewison"
            },
            "DateCreated": "2015-03-16T17:36:00Z"
        }
    ],
    "IsRecentlyVerified": false,
    "ID": 19395,
    "UUID": "5A3895EC-DE24-46D6-B8CD-BC2CDA18D59F",
    "DataProviderID": 1,
    "OperatorID": 32,
    "OperatorsReference": "1769",
    "UsageTypeID": 4,
    "UsageCost": "Inclusive; for Polar Plus subscription members only",
    "AddressInfo": {
        "ID": 19740,
        "Title": "Waitrose Esher",
        "AddressLine1": "105 High Street",
        "AddressLine2": " Esher",
        "Town": "Elmbridge",
        "StateOrProvince": "London",
        "Postcode": "KT10 9QE",
        "CountryID": 1,
        "Latitude": 51.3680362472028,
        "Longitude": -0.366464853286743,
        "AccessComments": "Charges may apply - refer to the owner of the parking bay for details. Waitrose shopping hours only.",
        "RelatedURL": "http://www.waitrose.com/content/waitrose/en/bf_home/bf/121.html",
        "DistanceUnit": 0
    },
    "Connections": [
        {
            "ID": 19698,
            "ConnectionTypeID": 25,
            "StatusTypeID": 50,
            "LevelID": 2,
            "Amps": 32,
            "Voltage": 230,
            "PowerKW": 7,
            "CurrentTypeID": 10,
            "Quantity": 2
        }
    ],
    "NumberOfPoints": 2,
    "GeneralComments": "short bays.  not suitable for an outlander or similar\r\nChargemaster post. Polar Network cards and App accepted, but no longer accepts Source London",
    "StatusTypeID": 50,
    "DateLastStatusUpdate": "2019-03-07T06:31:00Z",
    "MetadataValues": [
        {
            "ID": 42,
            "MetadataFieldID": 4,
            "ItemValue": "Data © OpenStreetMap contributors, ODbL 1.0. http://www.openstreetmap.org/copyright"
        }
    ],
    "DataQualityLevel": 1,
    "DateCreated": "2013-09-25T13:51:00Z",
    "SubmissionStatusTypeID": 200
}