{
    "UserComments": [
        {
            "ID": 20245,
            "ChargePointID": 19869,
            "CommentTypeID": 10,
            "UserName": "Robert Seemueller",
            "Rating": 5,
            "DateCreated": "2018-09-29T04:37:50.64Z",
            "User": {
                "ID": 19108,
                "Username": "Robert Seemueller"
            },
            "CheckinStatusTypeID": 140
        }
    ],
    "MediaItems": [
        {
            "ID": 16631,
            "ChargePointID": 19869,
            "ItemURL": "https://s3-ap-southeast-2.amazonaws.com/openchargemap/images/US/OCM19869/OCM-19869.orig.2018092508165643.png",
            "ItemThumbnailURL": "https://s3-ap-southeast-2.amazonaws.com/openchargemap/images/US/OCM19869/OCM-19869.thmb.2018092508165643.png",
            "Comment": "",
            "IsEnabled": true,
            "IsVideo": false,
            "IsFeaturedItem": false,
            "IsExternalResource": false,
            "User": {
                "ID": 19108,
                "Username": "Robert Seemueller"
            },
            "DateCreated": "2018-09-25T08:17:00Z"
        }
    ],
    "IsRecentlyVerified": false,
    "ID": 19869,
    "UUID": "F10A6E8C-1DD2-4B39-BD56-ECF94E45C784",
    "DataProviderID": 1,
    "OperatorID": 5,
    "UsageTypeID": 1,
    "UsageCost": "free",
    "AddressInfo": {
        "ID": 20214,
        "Title": "National Grid Kohl's Buffalo",
        "AddressLine1": "2232 Delaware Ave",
        "Town": "Buffalo",
        "StateOrProvince": "NY",
        "Postcode": "14216",
        "CountryID": 2,
        "Latitude": 42.94473376377302,
        "Longitude": -78.87038170188708,
        "ContactTelephone1": "888-758-4389",
        "AccessComments": "24 hours daily",
        "RelatedURL": "http://www.chargepoint.com/",
        "DistanceUnit": 0
    },
    "Connections": [
        {
            "ID": 19955,
            "ConnectionTypeID": 1,
            "StatusTypeID": 50,
            "LevelID": 2,
            "Amps": 16,
            "Voltage": 230,
            "PowerKW": 3,
            "CurrentTypeID": 10,
            "Quantity": 2
        }
    ],
    "NumberOfPoints": 2,
    "StatusTypeID": 50,
    "DateLastStatusUpdate": "2018-09-30T19:46:00Z",
    "DataQualityLevel": 3,
    "DateCreated": "2013-10-19T03:48:00Z",
    "SubmissionStatusTypeID": 100
}