{
    "IsRecentlyVerified": false,
    "ID": 161096,
    "UUID": "3FD51FF3-A849-4DF4-BA95-822451A3DCBC",
    "DataProviderID": 1,
    "OperatorID": 1241,
    "UsageTypeID": 4,
    "AddressInfo": {
        "ID": 161453,
        "Title": "Lidl Arklow",
        "AddressLine1": "Arklow Road",
        "Town": "Gorey",
        "CountryID": 3,
        "Latitude": 52.67830053084978,
        "Longitude": -6.288059981282913,
        "DistanceUnit": 0
    },
    "Connections": [
        {
            "ID": 231791,
            "ConnectionTypeID": 25,
            "StatusTypeID": 50,
            "LevelID": 2,
            "Amps": 32,
            "Voltage": 400,
            "PowerKW": 22,
            "CurrentTypeID": 20,
            "Quantity": 2
        }
    ],
    "NumberOfPoints": 1,
    "StatusTypeID": 50,
    "DateLastStatusUpdate": "2020-07-05T09:44:00Z",
    "DataQualityLevel": 1,
    "DateCreated": "2020-07-03T10:23:00Z",
    "SubmissionStatusTypeID": 200
}