{
    "IsRecentlyVerified": false,
    "ID": 101981,
    "UUID": "367F194F-9D37-47C4-9857-56C12EC97F72",
    "DataProviderID": 1,
    "OperatorID": 23,
    "OperatorsReference": "42183",
    "UsageTypeID": 4,
    "AddressInfo": {
        "ID": 102327,
        "Title": "Inter-Hotel Albi le Cantepau",
        "AddressLine1": "9 Rue Cantepau",
        "Town": "Albi",
        "Postcode": "81000",
        "CountryID": 80,
        "Latitude": 43.934927,
        "Longitude": 2.147289,
        "ContactTelephone1": "+33 5 63 60 75 80",
        "DistanceUnit": 0
    },
    "Connections": [
        {
            "ID": 143964,
            "ConnectionTypeID": 30,
            "StatusTypeID": 50,
            "LevelID": 2,
            "Amps": 32,
            "Voltage": 230,
            "PowerKW": 17,
            "CurrentTypeID": 20,
            "Quantity": 1
        }
    ],
    "NumberOfPoints": 1,
    "GeneralComments": "1 Tesla Connector, up to 17kW.Available for customers. Self park.",
    "StatusTypeID": 50,
    "DateLastStatusUpdate": "2018-10-03T21:54:00Z",
    "DataQualityLevel": 1,
    "DateCreated": "2018-04-16T04:48:00Z",
    "SubmissionStatusTypeID": 200
}