{
    "IsRecentlyVerified": false,
    "ID": 10796,
    "UUID": "36530A12-48F1-4015-83F8-42E2D418E340",
    "DataProviderID": 1,
    "DataProvidersReference": "1037",
    "AddressInfo": {
        "ID": 10693,
        "Title": "Luravika hurtigladestasjon",
        "AddressLine1": "Gamleveien 2",
        "Town": "SANDNES",
        "StateOrProvince": "Rogaland",
        "Postcode": "4315",
        "CountryID": 168,
        "Latitude": 58.87127,
        "Longitude": 5.74074,
        "AccessComments": "Tett ved rundkjøringen rett nedenfor Sandnes Motorhotel.",
        "DistanceUnit": 0
    },
    "Connections": [
        {
            "ID": 34337,
            "ConnectionTypeID": 0,
            "Reference": "2",
            "LevelID": 2,
            "Amps": 100,
            "Voltage": 500,
            "PowerKW": 50,
            "Comments": "Mode 4"
        },
        {
            "ID": 84129,
            "ConnectionTypeID": 0,
            "Reference": "6",
            "LevelID": 2,
            "Amps": 100,
            "Voltage": 500,
            "PowerKW": 50,
            "Comments": "Mode 4"
        },
        {
            "ID": 84130,
            "ConnectionTypeID": 0,
            "Reference": "3",
            "LevelID": 2,
            "Amps": 100,
            "Voltage": 500,
            "PowerKW": 50,
            "Comments": "Mode 4"
        },
        {
            "ID": 84131,
            "ConnectionTypeID": 0,
            "Reference": "4",
            "LevelID": 2,
            "Amps": 32,
            "Voltage": 400,
            "PowerKW": 22,
            "Comments": "Mode 3"
        },
        {
            "ID": 88022,
            "ConnectionTypeID": 0,
            "Reference": "5",
            "LevelID": 2,
            "Amps": 100,
            "Voltage": 500,
            "PowerKW": 50,
            "Comments": "Mode 4"
        }
    ],
    "NumberOfPoints": 6,
    "StatusTypeID": 0,
    "DateLastStatusUpdate": "2020-05-26T08:22:00Z",
    "DataQualityLevel": 2,
    "DateCreated": "2012-06-02T11:56:00Z",
    "SubmissionStatusTypeID": 100
}