{
    "IsRecentlyVerified": false,
    "ID": 19942,
    "UUID": "110446B4-DAF9-49AE-A3C9-F51D2DA7837F",
    "DataProviderID": 1,
    "OperatorID": 213,
    "OperatorsReference": "5a94bb86e4b00aa993636523,5a94bb86e4b00aa993636523",
    "UsageTypeID": 0,
    "AddressInfo": {
        "ID": 20287,
        "Title": "Parking Gare SNCF Nord",
        "AddressLine1": "Boulevard Solférino",
        "StateOrProvince": "Rennes",
        "Postcode": "35000",
        "CountryID": 80,
        "Latitude": 48.10451,
        "Longitude": -1.66844,
        "AccessComments": "Réservé aux clients de l'établissement",
        "DistanceUnit": 0
    },
    "Connections": [],
    "NumberOfPoints": 1,
    "StatusTypeID": 150,
    "DateLastStatusUpdate": "2020-01-05T20:27:00Z",
    "DataQualityLevel": 1,
    "DateCreated": "2013-10-22T08:06:00Z",
    "SubmissionStatusTypeID": 200
}