{
    "IsRecentlyVerified": false,
    "ID": 47570,
    "UUID": "EE453CDE-9694-4A8D-A896-3937C2A63B97",
    "DataProviderID": 1,
    "OperatorID": 3247,
    "UsageTypeID": 5,
    "AddressInfo": {
        "ID": 47916,
        "Title": "Grønn Kontakt hurtigladestasjon, Kristiansand",
        "AddressLine1": "Setesdalsveien 207",
        "Town": "KRISTIANSAND S",
        "StateOrProvince": "Vest-Agder",
        "Postcode": "4618",
        "CountryID": 168,
        "Latitude": 58.180847,
        "Longitude": 7.932224,
        "DistanceUnit": 0
    },
    "Connections": [
        {
            "ID": 58650,
            "ConnectionTypeID": 2,
            "Reference": "1",
            "StatusTypeID": 0,
            "LevelID": 3,
            "Amps": 200,
            "Voltage": 500,
            "PowerKW": 100,
            "CurrentTypeID": 30,
            "Comments": "Mode 4"
        },
        {
            "ID": 60478,
            "ConnectionTypeID": 25,
            "StatusTypeID": 0,
            "LevelID": 2,
            "Quantity": 2
        }
    ],
    "NumberOfPoints": 4,
    "StatusTypeID": 50,
    "DateLastStatusUpdate": "2016-07-14T16:39:00Z",
    "DataQualityLevel": 2,
    "DateCreated": "2015-06-01T10:34:00Z",
    "SubmissionStatusTypeID": 100
}