{
    "UserComments": [
        {
            "ID": 16095,
            "ChargePointID": 53601,
            "CommentTypeID": 10,
            "UserName": "Florian Uhlemann",
            "Comment": "I have successfully charged at this location a couple of times. Type 2 22kW works very well. Thanks to ALDI for such an amazing spot. It's free for one hour during your shopping at ALDI.",
            "Rating": 5,
            "DateCreated": "2017-03-23T17:03:37.037Z",
            "User": {
                "ID": 13506,
                "Username": "Florian Uhlemann"
            },
            "CheckinStatusTypeID": 10
        }
    ],
    "IsRecentlyVerified": false,
    "ID": 53601,
    "UUID": "92653F12-AD27-470C-9C14-82C631EBCD8B",
    "DataProviderID": 1,
    "OperatorID": 105,
    "OperatorsReference": "Essent EM-DE-09179123-01-00001",
    "UsageTypeID": 4,
    "AddressInfo": {
        "ID": 53947,
        "Title": "Industriestraße 24",
        "AddressLine1": "Industriestraße 24",
        "Town": "Germering",
        "Postcode": "82110",
        "CountryID": 87,
        "Latitude": 48.13192,
        "Longitude": 11.37964,
        "AccessComments": "Kostenloses Laden für maximal eine Stunde während der Öffnungszeiten Mo-Sa 8-20Uhr. Außerhalb der Öffnungszeiten ist die Ladesäule ausgeschaltet. Gleichzeitiges Laden mehrerer Fahrzeuge ist nicht möglich, max. Ladedauer 1 Stunde.",
        "RelatedURL": "http://www.aldi-sued.de/de/aldi-sued-a-bis-z/aldi-sued-a-bis-z/e/elektrotankstellen",
        "DistanceUnit": 0
    },
    "Connections": [
        {
            "ID": 66758,
            "ConnectionTypeID": 2,
            "StatusTypeID": 50,
            "LevelID": 3,
            "PowerKW": 20,
            "CurrentTypeID": 30,
            "Quantity": 1
        },
        {
            "ID": 72736,
            "ConnectionTypeID": 33,
            "StatusTypeID": 50,
            "LevelID": 3,
            "PowerKW": 20,
            "CurrentTypeID": 30,
            "Quantity": 1
        },
        {
            "ID": 72737,
            "ConnectionTypeID": 25,
            "StatusTypeID": 50,
            "LevelID": 2,
            "Amps": 32,
            "Voltage": 400,
            "PowerKW": 22,
            "CurrentTypeID": 20,
            "Quantity": 1
        }
    ],
    "NumberOfPoints": 2,
    "StatusTypeID": 50,
    "DateLastStatusUpdate": "2017-03-23T20:59:00Z",
    "DataQualityLevel": 3,
    "DateCreated": "2015-09-20T11:50:00Z",
    "SubmissionStatusTypeID": 200
}