{
    "IsRecentlyVerified": false,
    "ID": 121372,
    "UUID": "B87B687F-D5A6-4E1A-B227-DD468A71BEB5",
    "DataProviderID": 1,
    "OperatorID": 3318,
    "UsageTypeID": 4,
    "UsageCost": "$.43/kWh; $.40/min idle fee after 10 minute grace period",
    "AddressInfo": {
        "ID": 121718,
        "Title": "Walmart 2539 Spokane Valley",
        "AddressLine1": "15727 E Broadway Ave",
        "Town": "Spokane Valley",
        "StateOrProvince": "WA",
        "Postcode": "99307",
        "CountryID": 2,
        "Latitude": 47.66559600000005,
        "Longitude": -117.19012300000031,
        "ContactTelephone1": "833-632-2778",
        "AccessComments": "24 hours daily",
        "RelatedURL": "https://www.electrifyamerica.com/",
        "DistanceUnit": 0
    },
    "Connections": [
        {
            "ID": 170827,
            "ConnectionTypeID": 2,
            "StatusTypeID": 50,
            "LevelID": 2,
            "Amps": 125,
            "Voltage": 400,
            "PowerKW": 50,
            "CurrentTypeID": 10,
            "Quantity": 1
        },
        {
            "ID": 170828,
            "ConnectionTypeID": 32,
            "StatusTypeID": 50,
            "LevelID": 2,
            "Amps": 375,
            "Voltage": 400,
            "PowerKW": 150,
            "CurrentTypeID": 10,
            "Quantity": 15
        }
    ],
    "StatusTypeID": 50,
    "DateLastStatusUpdate": "2020-09-24T12:28:00Z",
    "DataQualityLevel": 3,
    "DateCreated": "2019-04-01T05:00:00Z",
    "SubmissionStatusTypeID": 100
}