{
    "IsRecentlyVerified": false,
    "ID": 112660,
    "UUID": "073A79DF-545F-4F5F-92DF-6EE18822051A",
    "DataProviderID": 1,
    "OperatorID": 3319,
    "UsageTypeID": 5,
    "UsageCost": "0.15€/min",
    "AddressInfo": {
        "ID": 113006,
        "Title": "e-mobi - Nīcgales muiža",
        "AddressLine1": "Nīcgales muiža",
        "Town": "Nīcgale",
        "Postcode": "LV-5463",
        "CountryID": 125,
        "Latitude": 56.145006895399995,
        "Longitude": 26.344666367016316,
        "ContactTelephone1": "+371 22001859",
        "RelatedURL": "https://portal.e-mobi.lv",
        "DistanceUnit": 0
    },
    "Connections": [
        {
            "ID": 158569,
            "ConnectionTypeID": 2,
            "StatusTypeID": 50,
            "LevelID": 3,
            "PowerKW": 50,
            "CurrentTypeID": 30,
            "Quantity": 1
        },
        {
            "ID": 158570,
            "ConnectionTypeID": 33,
            "StatusTypeID": 50,
            "LevelID": 3,
            "PowerKW": 50,
            "CurrentTypeID": 30,
            "Quantity": 1
        },
        {
            "ID": 158571,
            "ConnectionTypeID": 25,
            "StatusTypeID": 50,
            "LevelID": 3,
            "PowerKW": 43,
            "CurrentTypeID": 20
        }
    ],
    "NumberOfPoints": 2,
    "StatusTypeID": 50,
    "DateLastStatusUpdate": "2018-11-10T09:18:00Z",
    "DataQualityLevel": 1,
    "DateCreated": "2018-11-09T21:08:00Z",
    "SubmissionStatusTypeID": 200
}