{
    "IsRecentlyVerified": false,
    "ID": 89201,
    "UUID": "0B3584CE-582E-4DF5-B66B-CED87D570377",
    "DataProviderID": 2,
    "DataProvidersReference": "82481",
    "OperatorID": 5,
    "UsageTypeID": 1,
    "AddressInfo": {
        "ID": 89547,
        "Title": "IRVINE  CO  OFC",
        "AddressLine1": "6410 Oak Canyon",
        "Town": "Irvine",
        "StateOrProvince": "CA",
        "Postcode": "92618",
        "CountryID": 2,
        "Latitude": 33.676461,
        "Longitude": -117.768284,
        "ContactTelephone1": "888-758-4389",
        "AccessComments": "24 hours daily",
        "RelatedURL": "http://www.chargepoint.com/",
        "DistanceUnit": 0
    },
    "Connections": [
        {
            "ID": 126567,
            "ConnectionTypeID": 1,
            "LevelID": 2,
            "Amps": 16,
            "Voltage": 230,
            "PowerKW": 3,
            "CurrentTypeID": 10,
            "Quantity": 3
        }
    ],
    "DateLastStatusUpdate": "2019-12-24T09:10:00Z",
    "DataQualityLevel": 3,
    "DateCreated": "2017-06-22T08:16:00Z",
    "SubmissionStatusTypeID": 100
}