{
    "IsRecentlyVerified": false,
    "ID": 103911,
    "UUID": "86A40771-1174-474F-BE22-67FF0A2616CC",
    "DataProviderID": 1,
    "OperatorID": 3267,
    "UsageTypeID": 4,
    "UsageCost": "0,488€/kW",
    "AddressInfo": {
        "ID": 104257,
        "Title": "Duferco Ne",
        "AddressLine1": "Via al Campo Sportivo",
        "Town": "Ne",
        "StateOrProvince": "GE",
        "Postcode": "16040 ",
        "CountryID": 112,
        "Latitude": 44.34552628873425,
        "Longitude": 9.401241409289696,
        "ContactTelephone1": " +39 010 27 56 01",
        "ContactTelephone2": "Numero verde: 800 92 22 00",
        "ContactEmail": "mobility@dufercoenergia.com",
        "RelatedURL": "https://mobility.dufercoenergia.com/",
        "DistanceUnit": 0
    },
    "Connections": [
        {
            "ID": 146683,
            "ConnectionTypeID": 25,
            "StatusTypeID": 50,
            "LevelID": 2,
            "Amps": 32,
            "Voltage": 400,
            "PowerKW": 22,
            "CurrentTypeID": 20,
            "Quantity": 1
        },
        {
            "ID": 146684,
            "ConnectionTypeID": 36,
            "StatusTypeID": 50,
            "LevelID": 2,
            "Amps": 16,
            "Voltage": 240,
            "PowerKW": 3.5,
            "CurrentTypeID": 10,
            "Quantity": 1
        }
    ],
    "NumberOfPoints": 2,
    "StatusTypeID": 50,
    "DateLastStatusUpdate": "2018-05-11T14:52:00Z",
    "DataQualityLevel": 1,
    "DateCreated": "2018-05-11T14:52:00Z",
    "SubmissionStatusTypeID": 200
}