{
    "IsRecentlyVerified": false,
    "ID": 136219,
    "UUID": "3696B92F-4DE8-4935-8E68-58B6E02E0F33",
    "DataProviderID": 18,
    "DataProvidersReference": "298ed20c5b54cebf3c72eafd80b257c0",
    "OperatorID": 2244,
    "UsageTypeID": 5,
    "AddressInfo": {
        "ID": 136565,
        "Title": "Featherstone Road",
        "AddressLine1": "Featherstone Road",
        "Town": "Southall",
        "Postcode": "UB2 5AQ",
        "CountryID": 1,
        "Latitude": 51.501249,
        "Longitude": -0.386654,
        "AccessComments": "",
        "RelatedURL": "https://www.ubitricity.com",
        "DistanceUnit": 0
    },
    "Connections": [
        {
            "ID": 190655,
            "ConnectionTypeID": 25,
            "Reference": "suby1100003185",
            "StatusTypeID": 50,
            "LevelID": 2,
            "Amps": 16,
            "Voltage": 230,
            "PowerKW": 3.7,
            "CurrentTypeID": 10
        }
    ],
    "StatusTypeID": 0,
    "DateLastStatusUpdate": "2021-04-25T05:46:00Z",
    "MetadataValues": [
        {
            "ID": 6071,
            "MetadataFieldID": 4,
            "ItemValue": "Contains public sector information licensed under the Open Government Licence v2.0. http://www.nationalarchives.gov.uk/doc/open-government-licence/version/2/"
        }
    ],
    "DataQualityLevel": 3,
    "DateCreated": "2019-12-24T05:22:00Z",
    "SubmissionStatusTypeID": 100
}