{
    "IsRecentlyVerified": false,
    "ID": 119450,
    "UUID": "DAFE4F1B-4887-40BF-B25D-06C1E19528B5",
    "DataProviderID": 2,
    "DataProvidersReference": "85490",
    "OperatorID": 5,
    "UsageTypeID": 1,
    "AddressInfo": {
        "ID": 119796,
        "Title": "KAPOLEILOFTS",
        "AddressLine1": "761 Wakea St Block 4",
        "Town": "Kapolei",
        "StateOrProvince": "HI",
        "Postcode": "96707",
        "CountryID": 2,
        "Latitude": 21.3293599,
        "Longitude": -158.077385,
        "ContactTelephone1": "888-758-4389",
        "AccessComments": "24 hours daily",
        "RelatedURL": "http://www.chargepoint.com/",
        "DistanceUnit": 0
    },
    "Connections": [
        {
            "ID": 168713,
            "ConnectionTypeID": 1,
            "LevelID": 2,
            "Amps": 16,
            "Voltage": 230,
            "PowerKW": 3,
            "CurrentTypeID": 10,
            "Quantity": 2
        }
    ],
    "DateLastStatusUpdate": "2019-04-01T04:59:00Z",
    "DataQualityLevel": 3,
    "DateCreated": "2019-04-01T04:59:00Z",
    "SubmissionStatusTypeID": 100
}