{
    "IsRecentlyVerified": false,
    "ID": 61495,
    "UUID": "1A1EDE83-4CC2-4D7D-9F53-B895FD4ABC46",
    "DataProviderID": 1,
    "OperatorID": 98,
    "UsageTypeID": 4,
    "AddressInfo": {
        "ID": 61841,
        "Title": "Juwi Research & Development GmbH",
        "AddressLine1": "Schornsheimer Chaussee 1",
        "Town": "Wörrstadt",
        "StateOrProvince": "Wörrstadt",
        "Postcode": "55286",
        "CountryID": 87,
        "Latitude": 49.84046009999999,
        "Longitude": 8.128648300000009,
        "ContactTelephone1": "06732 9657 0",
        "ContactEmail": "info@juwi.de",
        "AccessComments": "Die Ladebox F-196 liegt unter einer Stahltreppe (Verlängerungskabel notwendig). 2 Parkplätze",
        "RelatedURL": "http://www.juwi.de",
        "DistanceUnit": 0
    },
    "Connections": [
        {
            "ID": 78353,
            "ConnectionTypeID": 17,
            "StatusTypeID": 50,
            "LevelID": 2,
            "Amps": 16,
            "Voltage": 400,
            "PowerKW": 11,
            "CurrentTypeID": 20,
            "Quantity": 1
        },
        {
            "ID": 78354,
            "ConnectionTypeID": 28,
            "StatusTypeID": 50,
            "LevelID": 2,
            "Amps": 16,
            "Voltage": 230,
            "PowerKW": 3.7,
            "CurrentTypeID": 10,
            "Quantity": 3
        },
        {
            "ID": 78355,
            "ConnectionTypeID": 17,
            "StatusTypeID": 50,
            "LevelID": 2,
            "Amps": 32,
            "Voltage": 400,
            "PowerKW": 22,
            "CurrentTypeID": 20,
            "Quantity": 1
        }
    ],
    "NumberOfPoints": 2,
    "StatusTypeID": 50,
    "DateLastStatusUpdate": "2016-03-02T07:23:00Z",
    "DataQualityLevel": 1,
    "DateCreated": "2016-03-02T07:23:00Z",
    "SubmissionStatusTypeID": 200
}