{
    "IsRecentlyVerified": false,
    "ID": 135755,
    "UUID": "35C25FCB-EB9F-4E93-8C16-1EEEE25699F3",
    "DataProviderID": 18,
    "DataProvidersReference": "a0ad3c5a5be5fb82bcbd1f81999c8e44",
    "OperatorID": 2244,
    "UsageTypeID": 5,
    "AddressInfo": {
        "ID": 136101,
        "Title": "Cortis Road",
        "AddressLine1": "Cortis Road",
        "Town": "London",
        "Postcode": "SW15 3AJ",
        "CountryID": 1,
        "Latitude": 51.455253,
        "Longitude": -0.233059,
        "AccessComments": "",
        "RelatedURL": "https://www.ubitricity.com",
        "DistanceUnit": 0
    },
    "Connections": [
        {
            "ID": 190175,
            "ConnectionTypeID": 25,
            "Reference": "suby1100002783",
            "StatusTypeID": 50,
            "LevelID": 2,
            "Amps": 16,
            "Voltage": 230,
            "PowerKW": 3.7,
            "CurrentTypeID": 10
        }
    ],
    "StatusTypeID": 0,
    "DateLastStatusUpdate": "2021-04-25T05:46:00Z",
    "MetadataValues": [
        {
            "ID": 5607,
            "MetadataFieldID": 4,
            "ItemValue": "Contains public sector information licensed under the Open Government Licence v2.0. http://www.nationalarchives.gov.uk/doc/open-government-licence/version/2/"
        }
    ],
    "DataQualityLevel": 3,
    "DateCreated": "2019-12-24T05:22:00Z",
    "SubmissionStatusTypeID": 100
}