{
    "IsRecentlyVerified": false,
    "ID": 47984,
    "UUID": "D774D00A-0B44-4E8D-9013-617ED19DBB83",
    "DataProviderID": 1,
    "OperatorID": 190,
    "UsageTypeID": 4,
    "AddressInfo": {
        "ID": 48330,
        "Title": "Sídlo PRE",
        "AddressLine1": "Na Hroudě 1492/4",
        "AddressLine2": "Vršovice",
        "Town": "Praha 10",
        "Postcode": "100 00",
        "CountryID": 64,
        "Latitude": 50.069256,
        "Longitude": 14.4816299362979,
        "ContactTelephone1": "+420733143143",
        "ContactTelephone2": "+420734234832",
        "ContactEmail": "premobilita@pre.cz",
        "AccessComments": "Chytrá lampa PREpoint pro nabíjení elektrokol a elektroskutrů, AC 1x16A SCHUKO. Služby Wiffi FREE, SOS tlačítko na 112, Karta k nabíjení je umístěná na recepci PRE.",
        "RelatedURL": "http://www.premobilita.cz",
        "DistanceUnit": 0
    },
    "Connections": [
        {
            "ID": 59215,
            "ConnectionTypeID": 23,
            "StatusTypeID": 50,
            "LevelID": 2,
            "Amps": 16,
            "Voltage": 230,
            "PowerKW": 3.5,
            "CurrentTypeID": 10,
            "Quantity": 1
        }
    ],
    "NumberOfPoints": 1,
    "StatusTypeID": 50,
    "DateLastStatusUpdate": "2016-12-14T20:44:00Z",
    "DataQualityLevel": 1,
    "DateCreated": "2015-06-20T10:04:00Z",
    "SubmissionStatusTypeID": 200
}