{
    "IsRecentlyVerified": false,
    "ID": 29755,
    "UUID": "2346D484-A023-4115-A09F-1D0DBE98C364",
    "DataProviderID": 15,
    "DataProvidersReference": "13001",
    "OperatorID": 5,
    "UsageTypeID": 2,
    "AddressInfo": {
        "ID": 30101,
        "Title": "2366 Stanwell Cir",
        "AddressLine1": "2366 Stanwell Cir",
        "Town": "Concord",
        "StateOrProvince": "California",
        "Postcode": "94520",
        "CountryID": 2,
        "Latitude": 37.98306,
        "Longitude": -122.04821,
        "ContactTelephone1": "",
        "RelatedURL": "http://carstations.com/13001",
        "DistanceUnit": 0
    },
    "Connections": [
        {
            "ID": 32740,
            "ConnectionTypeID": 1,
            "Reference": "J1772",
            "LevelID": 2
        }
    ],
    "NumberOfPoints": 1,
    "StatusTypeID": 0,
    "DateLastStatusUpdate": "2017-11-04T14:04:00Z",
    "DataQualityLevel": 2,
    "DateCreated": "2014-11-29T05:39:00Z",
    "SubmissionStatusTypeID": 100
}