{
    "IsRecentlyVerified": false,
    "ID": 184484,
    "UUID": "BA621751-D849-4C5C-B3B7-3E8C6B4AC652",
    "DataProviderID": 29,
    "DataProvidersReference": "5610",
    "AddressInfo": {
        "ID": 184843,
        "Title": "Hauptstr. 120",
        "AddressLine1": "Hauptstr. 120",
        "Town": "Rheda-Wiedenbrück",
        "Postcode": "33378",
        "CountryID": 87,
        "Latitude": 51.841667,
        "Longitude": 8.29867,
        "DistanceUnit": 0
    },
    "Connections": [
        {
            "ID": 292828,
            "ConnectionTypeID": 25,
            "StatusTypeID": 50,
            "LevelID": 2,
            "PowerKW": 22,
            "CurrentTypeID": 20
        },
        {
            "ID": 292829,
            "ConnectionTypeID": 25,
            "StatusTypeID": 50,
            "LevelID": 2,
            "PowerKW": 22,
            "CurrentTypeID": 20
        }
    ],
    "StatusTypeID": 50,
    "DateLastStatusUpdate": "2021-07-12T02:48:00Z",
    "MetadataValues": [
        {
            "ID": 16775,
            "MetadataFieldID": 4,
            "ItemValue": "Data from the German chargepoint registry provided by Bundesnetzagentur.de under the CC-BY 4.0 license"
        }
    ],
    "DataQualityLevel": 3,
    "DateCreated": "2021-07-08T10:05:00Z",
    "SubmissionStatusTypeID": 100
}