{
    "IsRecentlyVerified": false,
    "ID": 130985,
    "UUID": "1CD089FC-D61C-4291-8B08-7A65CB2ED895",
    "DataProviderID": 1,
    "OperatorID": 23,
    "OperatorsReference": "51409",
    "UsageTypeID": 4,
    "AddressInfo": {
        "ID": 131331,
        "Title": "The Omni Homestead Resort",
        "AddressLine1": "7696 Sam Snead Hwy",
        "Town": "Hot Springs",
        "StateOrProvince": "Virginia",
        "Postcode": "24445",
        "CountryID": 2,
        "Latitude": 37.997323,
        "Longitude": -79.830561,
        "ContactTelephone1": "(540) 839-1766",
        "DistanceUnit": 0
    },
    "Connections": [
        {
            "ID": 183480,
            "ConnectionTypeID": 30,
            "StatusTypeID": 50,
            "LevelID": 2,
            "PowerKW": 16,
            "CurrentTypeID": 20,
            "Quantity": 3
        }
    ],
    "NumberOfPoints": 3,
    "GeneralComments": "3 Tesla Connectors, up to 16kW.Parking fees will apply. Self park.",
    "StatusTypeID": 50,
    "DateLastStatusUpdate": "2019-08-28T19:52:00Z",
    "DataQualityLevel": 1,
    "DateCreated": "2019-08-28T19:52:00Z",
    "SubmissionStatusTypeID": 200
}