{
    "IsRecentlyVerified": false,
    "ID": 124262,
    "UUID": "7D651E3A-9A8E-4CC0-89CF-B3F3441E883C",
    "DataProviderID": 2,
    "DataProvidersReference": "64942",
    "OperatorID": 5,
    "UsageTypeID": 1,
    "AddressInfo": {
        "ID": 124608,
        "Title": "CITYOFSANRAFAEL",
        "AddressLine1": "950 5th Ave",
        "Town": "San Rafael",
        "StateOrProvince": "CA",
        "Postcode": "94901",
        "CountryID": 2,
        "Latitude": 37.9739059,
        "Longitude": -122.5260462,
        "ContactTelephone1": "888-758-4389",
        "AccessComments": "24 hours daily",
        "RelatedURL": "http://www.chargepoint.com/",
        "DistanceUnit": 0
    },
    "Connections": [
        {
            "ID": 174340,
            "ConnectionTypeID": 1,
            "LevelID": 2,
            "Amps": 16,
            "Voltage": 230,
            "PowerKW": 3,
            "CurrentTypeID": 10,
            "Quantity": 2
        }
    ],
    "DateLastStatusUpdate": "2019-12-24T09:14:00Z",
    "DataQualityLevel": 3,
    "DateCreated": "2019-04-06T05:03:00Z",
    "SubmissionStatusTypeID": 100
}