{
    "IsRecentlyVerified": false,
    "ID": 99798,
    "UUID": "65F646EB-598C-435E-B633-8D1E23B9B2C3",
    "DataProviderID": 1,
    "OperatorID": 86,
    "UsageTypeID": 4,
    "AddressInfo": {
        "ID": 100144,
        "Title": "Pfungstadt West",
        "AddressLine1": "A67",
        "Town": "Pfungstadt",
        "StateOrProvince": "Landkreis Darmstadt-Dieburg",
        "Postcode": "64319",
        "CountryID": 87,
        "Latitude": 49.81247921981634,
        "Longitude": 8.576944779826361,
        "AccessComments": "24/7 nutzbar",
        "DistanceUnit": 0
    },
    "Connections": [
        {
            "ID": 141003,
            "ConnectionTypeID": 1036,
            "StatusTypeID": 50,
            "LevelID": 2,
            "Amps": 32,
            "Voltage": 400,
            "PowerKW": 22,
            "CurrentTypeID": 20,
            "Quantity": 1
        },
        {
            "ID": 141004,
            "ConnectionTypeID": 2,
            "StatusTypeID": 50,
            "LevelID": 3,
            "PowerKW": 50,
            "CurrentTypeID": 30,
            "Quantity": 1
        },
        {
            "ID": 141005,
            "ConnectionTypeID": 33,
            "StatusTypeID": 50,
            "LevelID": 3,
            "PowerKW": 50,
            "CurrentTypeID": 30,
            "Quantity": 1
        }
    ],
    "NumberOfPoints": 3,
    "StatusTypeID": 50,
    "DateLastStatusUpdate": "2018-02-05T15:18:00Z",
    "DataQualityLevel": 1,
    "DateCreated": "2018-02-05T15:18:00Z",
    "SubmissionStatusTypeID": 200
}