{
    "IsRecentlyVerified": false,
    "ID": 127582,
    "UUID": "BD0AEC9B-7F2E-4346-AD0D-EC8AA2540DB4",
    "DataProviderID": 1,
    "OperatorID": 23,
    "OperatorsReference": "50500",
    "UsageTypeID": 4,
    "AddressInfo": {
        "ID": 127928,
        "Title": "Industry Rino Station",
        "AddressLine1": "3858 Walnut St",
        "Town": "Denver",
        "StateOrProvince": "Colorado",
        "Postcode": "80205",
        "CountryID": 2,
        "Latitude": 39.770729,
        "Longitude": -104.970505,
        "ContactTelephone1": "(720) 500-4001",
        "DistanceUnit": 0
    },
    "Connections": [
        {
            "ID": 178587,
            "ConnectionTypeID": 30,
            "StatusTypeID": 50,
            "LevelID": 2,
            "PowerKW": 10,
            "CurrentTypeID": 20,
            "Quantity": 1
        }
    ],
    "NumberOfPoints": 1,
    "GeneralComments": "1 Tesla Connector, up to 10kW.Available to the public. Self park.",
    "StatusTypeID": 50,
    "DateLastStatusUpdate": "2019-06-05T11:52:00Z",
    "DataQualityLevel": 1,
    "DateCreated": "2019-06-05T11:52:00Z",
    "SubmissionStatusTypeID": 200
}