{
    "IsRecentlyVerified": false,
    "ID": 64565,
    "UUID": "B1D6780A-AEBA-4834-850C-FFA60357878C",
    "DataProviderID": 1,
    "OperatorID": 45,
    "UsageTypeID": 1,
    "AddressInfo": {
        "ID": 64911,
        "Title": "Raichle GmbH",
        "AddressLine1": "Hauptstraße 2",
        "Town": "Dürmentingen",
        "StateOrProvince": "Gemeindeverwaltungsverband Riedlingen",
        "Postcode": "88525",
        "CountryID": 87,
        "Latitude": 48.11332,
        "Longitude": 9.53375000000005,
        "ContactTelephone1": "+497371950980",
        "AccessComments": "24/7 verfügbar.",
        "RelatedURL": "http://www.raichle-gmbh.de/",
        "DistanceUnit": 0
    },
    "Connections": [
        {
            "ID": 82948,
            "ConnectionTypeID": 25,
            "StatusTypeID": 50,
            "LevelID": 2,
            "Amps": 16,
            "Voltage": 230,
            "PowerKW": 3.7,
            "CurrentTypeID": 10,
            "Quantity": 1
        }
    ],
    "NumberOfPoints": 1,
    "StatusTypeID": 50,
    "DateLastStatusUpdate": "2016-03-11T11:09:00Z",
    "DataQualityLevel": 1,
    "DateCreated": "2016-03-11T10:40:00Z",
    "SubmissionStatusTypeID": 200
}