{
    "IsRecentlyVerified": false,
    "ID": 181770,
    "UUID": "875DBC8E-6BD1-445F-BF7B-B2EBF2FF29CB",
    "DataProviderID": 29,
    "DataProvidersReference": "7033",
    "OperatorID": 69,
    "AddressInfo": {
        "ID": 182129,
        "Title": "Hans-Fischer-Str.10",
        "AddressLine1": "Hans-Fischer-Str.10",
        "Town": "München",
        "Postcode": "80339",
        "CountryID": 87,
        "Latitude": 48.127934,
        "Longitude": 11.544142,
        "DistanceUnit": 0
    },
    "Connections": [
        {
            "ID": 286555,
            "ConnectionTypeID": 25,
            "StatusTypeID": 50,
            "LevelID": 2,
            "PowerKW": 22,
            "CurrentTypeID": 20
        },
        {
            "ID": 286556,
            "ConnectionTypeID": 25,
            "StatusTypeID": 50,
            "LevelID": 2,
            "PowerKW": 22,
            "CurrentTypeID": 20
        }
    ],
    "StatusTypeID": 50,
    "DateLastStatusUpdate": "2021-07-12T02:40:00Z",
    "MetadataValues": [
        {
            "ID": 14064,
            "MetadataFieldID": 4,
            "ItemValue": "Data from the German chargepoint registry provided by Bundesnetzagentur.de under the CC-BY 4.0 license"
        }
    ],
    "DataQualityLevel": 3,
    "DateCreated": "2021-07-08T10:02:00Z",
    "SubmissionStatusTypeID": 100
}