{
    "IsRecentlyVerified": true,
    "DateLastVerified": "2021-10-28T08:20:00Z",
    "ID": 189705,
    "UUID": "0B00CAEB-1CC4-43B5-849C-7EB579C460F4",
    "DataProviderID": 1,
    "OperatorID": 80,
    "UsageTypeID": 4,
    "AddressInfo": {
        "ID": 190064,
        "Title": "CC Parco Da Vinci - Fiumicino - Enel X",
        "AddressLine1": "Via della Corona Boreale",
        "Town": "Fiumicino",
        "StateOrProvince": "Roma",
        "Postcode": "00119",
        "CountryID": 112,
        "Latitude": 41.80723150332659,
        "Longitude": 12.294378115361837,
        "ContactTelephone1": "800.069.850",
        "RelatedURL": "https://www.enelx.com/it/it/emobility",
        "DistanceUnit": 0
    },
    "Connections": [
        {
            "ID": 306903,
            "ConnectionTypeID": 25,
            "StatusTypeID": 50,
            "LevelID": 2,
            "Amps": 32,
            "Voltage": 400,
            "PowerKW": 22,
            "CurrentTypeID": 20,
            "Quantity": 1
        },
        {
            "ID": 306904,
            "ConnectionTypeID": 36,
            "StatusTypeID": 50,
            "LevelID": 2,
            "Amps": 16,
            "Voltage": 240,
            "PowerKW": 3.7,
            "CurrentTypeID": 10,
            "Quantity": 1
        }
    ],
    "NumberOfPoints": 5,
    "StatusTypeID": 50,
    "DateLastStatusUpdate": "2021-10-28T19:58:00Z",
    "DataQualityLevel": 1,
    "DateCreated": "2021-10-28T08:20:00Z",
    "SubmissionStatusTypeID": 200
}