{
    "IsRecentlyVerified": false,
    "ID": 29644,
    "UUID": "3AB35AD7-47FD-43CA-884D-9B4FE9003C1F",
    "DataProviderID": 15,
    "DataProvidersReference": "29993",
    "OperatorID": 9,
    "AddressInfo": {
        "ID": 29990,
        "Title": "13097 Highway 9 North",
        "AddressLine1": "13097 Highway 9 North",
        "Town": "Milton",
        "StateOrProvince": "GA",
        "Postcode": "30004",
        "CountryID": 2,
        "Latitude": 34.104698,
        "Longitude": -84.268827,
        "ContactTelephone1": "(678) 624-0164",
        "RelatedURL": "http://carstations.com/29993",
        "DistanceUnit": 0
    },
    "Connections": [
        {
            "ID": 32629,
            "ConnectionTypeID": 1,
            "Reference": "J1772",
            "LevelID": 2
        }
    ],
    "StatusTypeID": 0,
    "DateLastStatusUpdate": "2017-11-04T14:04:00Z",
    "DataQualityLevel": 2,
    "DateCreated": "2014-11-29T05:39:00Z",
    "SubmissionStatusTypeID": 100
}