{
    "IsRecentlyVerified": false,
    "ID": 184345,
    "UUID": "817BE4FD-A3C5-4F9D-B072-DA266497F663",
    "DataProviderID": 29,
    "DataProvidersReference": "4723",
    "AddressInfo": {
        "ID": 184704,
        "Title": "Raiffeisenstraße 33",
        "AddressLine1": "Raiffeisenstraße 33",
        "Town": "Bad Lippspring",
        "Postcode": "33175",
        "CountryID": 87,
        "Latitude": 51.779789,
        "Longitude": 8.799848,
        "DistanceUnit": 0
    },
    "Connections": [
        {
            "ID": 292504,
            "ConnectionTypeID": 25,
            "StatusTypeID": 50,
            "LevelID": 2,
            "PowerKW": 22,
            "CurrentTypeID": 20
        },
        {
            "ID": 292505,
            "ConnectionTypeID": 25,
            "StatusTypeID": 50,
            "LevelID": 2,
            "PowerKW": 22,
            "CurrentTypeID": 20
        }
    ],
    "StatusTypeID": 50,
    "DateLastStatusUpdate": "2021-07-12T02:48:00Z",
    "MetadataValues": [
        {
            "ID": 16636,
            "MetadataFieldID": 4,
            "ItemValue": "Data from the German chargepoint registry provided by Bundesnetzagentur.de under the CC-BY 4.0 license"
        }
    ],
    "DataQualityLevel": 3,
    "DateCreated": "2021-07-08T10:05:00Z",
    "SubmissionStatusTypeID": 100
}