{
    "IsRecentlyVerified": false,
    "ID": 79239,
    "UUID": "9BA38907-E4A7-4282-973A-C5EB9E8FEFD9",
    "DataProviderID": 1,
    "OperatorID": 23,
    "OperatorsReference": "14622",
    "UsageTypeID": 6,
    "UsageCost": "Free",
    "AddressInfo": {
        "ID": 79585,
        "Title": "Sawridge Inn and Conference Centre Edmonton",
        "AddressLine1": "4235 Gateway BLVD N",
        "Town": "Edmonton",
        "StateOrProvince": "AB",
        "Postcode": "T6J 5H2",
        "CountryID": 44,
        "Latitude": 52.889442,
        "Longitude": -118.077288,
        "ContactTelephone1": "(780) 438-1222",
        "DistanceUnit": 0
    },
    "Connections": [
        {
            "ID": 113858,
            "ConnectionTypeID": 30,
            "StatusTypeID": 50,
            "LevelID": 2,
            "PowerKW": 8,
            "CurrentTypeID": 10,
            "Quantity": 1
        }
    ],
    "NumberOfPoints": 1,
    "GeneralComments": "1 Tesla Connector, up to 8kW.Available for patrons only. Self park.",
    "StatusTypeID": 50,
    "DateLastStatusUpdate": "2017-07-13T14:42:00Z",
    "DataQualityLevel": 1,
    "DateCreated": "2017-01-26T21:16:00Z",
    "SubmissionStatusTypeID": 200
}