{
    "IsRecentlyVerified": false,
    "ID": 94658,
    "UUID": "14A60675-F33C-42D6-B5C9-C779CA60E304",
    "DataProviderID": 1,
    "OperatorID": 23,
    "OperatorsReference": "36837",
    "UsageTypeID": 4,
    "AddressInfo": {
        "ID": 95004,
        "Title": "Vejen Idrætscenter",
        "AddressLine1": "Petersmindevej 1",
        "Town": "Vejen",
        "Postcode": "6600",
        "CountryID": 65,
        "Latitude": 55.474771,
        "Longitude": 9.120926,
        "ContactTelephone1": "+45 75 36 05 00",
        "DistanceUnit": 0
    },
    "Connections": [
        {
            "ID": 133811,
            "ConnectionTypeID": 30,
            "StatusTypeID": 50,
            "LevelID": 2,
            "Amps": 16,
            "Voltage": 400,
            "PowerKW": 11,
            "CurrentTypeID": 20,
            "Quantity": 1
        }
    ],
    "NumberOfPoints": 1,
    "GeneralComments": "1 Tesla Connector, up to 11kW.Available for customers. Self park.",
    "StatusTypeID": 50,
    "DateLastStatusUpdate": "2018-10-03T15:50:00Z",
    "DataQualityLevel": 1,
    "DateCreated": "2017-10-22T05:44:00Z",
    "SubmissionStatusTypeID": 200
}