{
    "IsRecentlyVerified": false,
    "ID": 170810,
    "UUID": "F1FDEEA5-91E8-4D3B-8D87-C0DAC5AA8702",
    "DataProviderID": 1,
    "OperatorID": 3327,
    "UsageTypeID": 4,
    "AddressInfo": {
        "ID": 171169,
        "Title": "BeCharge Stazione di Colli del Tronto",
        "AddressLine1": "Via Gabriele D'Annunzio, 13",
        "AddressLine2": "Villa San Giuseppe ",
        "Town": "Colli del Tronto",
        "StateOrProvince": "AP",
        "Postcode": "63079",
        "CountryID": 112,
        "Latitude": 42.867217700614475,
        "Longitude": 13.748325476306036,
        "ContactTelephone1": "02-49527730",
        "ContactEmail": "emobility@buildingenergy.it",
        "RelatedURL": "https://www.bec.energy/",
        "DistanceUnit": 0
    },
    "Connections": [
        {
            "ID": 260974,
            "ConnectionTypeID": 25,
            "StatusTypeID": 50,
            "LevelID": 2,
            "Amps": 32,
            "Voltage": 400,
            "PowerKW": 22,
            "CurrentTypeID": 20,
            "Quantity": 4
        }
    ],
    "NumberOfPoints": 4,
    "StatusTypeID": 50,
    "DateLastStatusUpdate": "2020-12-09T16:32:00Z",
    "DataQualityLevel": 1,
    "DateCreated": "2020-12-09T16:32:00Z",
    "SubmissionStatusTypeID": 200
}