{
    "IsRecentlyVerified": false,
    "ID": 159041,
    "UUID": "D6C605E0-CF84-428E-A6AC-A514B2A66908",
    "DataProviderID": 2,
    "DataProvidersReference": "163534",
    "OperatorID": 9,
    "UsageTypeID": 1,
    "AddressInfo": {
        "ID": 159398,
        "Title": "Verde Vista",
        "AddressLine1": "4110 Verde Vista Cir",
        "Town": "Ashville",
        "StateOrProvince": "NC",
        "Postcode": "28803",
        "CountryID": 2,
        "Latitude": 35.571988,
        "Longitude": -82.509256,
        "ContactTelephone1": "888-998-2546",
        "AccessComments": "MON: 24 hours | TUE: 24 hours | WED: 24 hours | THU: 24 hours | FRI: 24 hours | SAT: 24 hours | SUN: 24 hours",
        "RelatedURL": "http://www.blinkcharging.com/",
        "DistanceUnit": 0
    },
    "Connections": [
        {
            "ID": 229109,
            "ConnectionTypeID": 1,
            "LevelID": 2,
            "Amps": 16,
            "Voltage": 230,
            "PowerKW": 3.7,
            "CurrentTypeID": 10,
            "Quantity": 1
        }
    ],
    "StatusTypeID": 50,
    "DateLastStatusUpdate": "2020-06-26T02:58:00Z",
    "DataQualityLevel": 3,
    "DateCreated": "2020-06-26T02:58:00Z",
    "SubmissionStatusTypeID": 100
}