{
    "MediaItems": [
        {
            "ID": 17514,
            "ChargePointID": 113463,
            "ItemURL": "https://s3-ap-southeast-2.amazonaws.com/openchargemap/images/CZ/OCM113463/OCM-113463.orig.2019012811462623.jpg",
            "ItemThumbnailURL": "https://s3-ap-southeast-2.amazonaws.com/openchargemap/images/CZ/OCM113463/OCM-113463.thmb.2019012811462623.jpg",
            "Comment": "2019-01-26",
            "IsEnabled": true,
            "IsVideo": false,
            "IsFeaturedItem": false,
            "IsExternalResource": false,
            "User": {
                "ID": 19523,
                "Username": "Martin1713"
            },
            "DateCreated": "2019-01-28T11:47:00Z"
        },
        {
            "ID": 17515,
            "ChargePointID": 113463,
            "ItemURL": "https://s3-ap-southeast-2.amazonaws.com/openchargemap/images/CZ/OCM113463/OCM-113463.orig.2019012811471691.jpg",
            "ItemThumbnailURL": "https://s3-ap-southeast-2.amazonaws.com/openchargemap/images/CZ/OCM113463/OCM-113463.thmb.2019012811471691.jpg",
            "Comment": "I wasn't able to check functionality.",
            "IsEnabled": true,
            "IsVideo": false,
            "IsFeaturedItem": false,
            "IsExternalResource": false,
            "User": {
                "ID": 19523,
                "Username": "Martin1713"
            },
            "DateCreated": "2019-01-28T11:47:00Z"
        },
        {
            "ID": 17513,
            "ChargePointID": 113463,
            "ItemURL": "https://s3-ap-southeast-2.amazonaws.com/openchargemap/images/CZ/OCM113463/OCM-113463.orig.2019012811380405.png",
            "ItemThumbnailURL": "https://s3-ap-southeast-2.amazonaws.com/openchargemap/images/CZ/OCM113463/OCM-113463.thmb.2019012811380405.png",
            "Comment": "I wasn't able to find out if it works",
            "IsEnabled": true,
            "IsVideo": false,
            "IsFeaturedItem": false,
            "IsExternalResource": false,
            "User": {
                "ID": 19523,
                "Username": "Martin1713"
            },
            "DateCreated": "2019-01-28T11:38:00Z"
        },
        {
            "ID": 17512,
            "ChargePointID": 113463,
            "ItemURL": "https://s3-ap-southeast-2.amazonaws.com/openchargemap/images/CZ/OCM113463/OCM-113463.orig.2019012811245784.png",
            "ItemThumbnailURL": "https://s3-ap-southeast-2.amazonaws.com/openchargemap/images/CZ/OCM113463/OCM-113463.thmb.2019012811245784.png",
            "Comment": "",
            "IsEnabled": true,
            "IsVideo": false,
            "IsFeaturedItem": false,
            "IsExternalResource": false,
            "User": {
                "ID": 19523,
                "Username": "Martin1713"
            },
            "DateCreated": "2019-01-28T11:25:00Z"
        },
        {
            "ID": 17511,
            "ChargePointID": 113463,
            "ItemURL": "https://s3-ap-southeast-2.amazonaws.com/openchargemap/images/CZ/OCM113463/OCM-113463.orig.2019012811224363.png",
            "ItemThumbnailURL": "https://s3-ap-southeast-2.amazonaws.com/openchargemap/images/CZ/OCM113463/OCM-113463.thmb.2019012811224363.png",
            "Comment": "26. 1. 2019",
            "IsEnabled": true,
            "IsVideo": false,
            "IsFeaturedItem": false,
            "IsExternalResource": false,
            "User": {
                "ID": 19523,
                "Username": "Martin1713"
            },
            "DateCreated": "2019-01-28T11:23:00Z"
        }
    ],
    "IsRecentlyVerified": false,
    "ID": 113463,
    "UUID": "89045EE0-3A54-44D8-A9CF-8CCE86D71CDF",
    "DataProviderID": 1,
    "OperatorID": 45,
    "UsageTypeID": 2,
    "UsageCost": "N/A",
    "AddressInfo": {
        "ID": 113809,
        "Title": "inChaNet Poříčany - D11 Exit 25",
        "AddressLine1": "Tovární",
        "AddressLine2": "Poříčany",
        "Town": "Poříčany",
        "StateOrProvince": "okres Kolín",
        "Postcode": "28914",
        "CountryID": 64,
        "Latitude": 50.1168307713273,
        "Longitude": 14.9371484288002,
        "ContactTelephone1": "+420776333155",
        "AccessComments": "D11 Exit 25 (direction Č. Brod)\r\nV areálu firmy BENEŠ a LÁT, a.s.\r\nIn the industrial zone BENES a LAT, a. s. near Police station",
        "DistanceUnit": 0
    },
    "Connections": [
        {
            "ID": 159858,
            "ConnectionTypeID": 1036,
            "StatusTypeID": 0,
            "LevelID": 3,
            "Voltage": 400,
            "Quantity": 1
        },
        {
            "ID": 159859,
            "ConnectionTypeID": 2,
            "StatusTypeID": 50,
            "LevelID": 3,
            "Amps": 120,
            "Voltage": 500,
            "PowerKW": 50,
            "CurrentTypeID": 30,
            "Quantity": 2
        },
        {
            "ID": 161925,
            "ConnectionTypeID": 33,
            "LevelID": 3,
            "Quantity": 1
        },
        {
            "ID": 161926,
            "ConnectionTypeID": 2,
            "LevelID": 3,
            "Quantity": 1
        }
    ],
    "NumberOfPoints": 5,
    "StatusTypeID": 50,
    "DateLastStatusUpdate": "2019-01-28T15:42:00Z",
    "DataQualityLevel": 1,
    "DateCreated": "2018-12-13T13:04:00Z",
    "SubmissionStatusTypeID": 200
}