{
    "UserComments": [
        {
            "ID": 23064,
            "ChargePointID": 162553,
            "CommentTypeID": 10,
            "UserName": "interssl.com",
            "Comment": "Stunning view!",
            "Rating": 5,
            "RelatedURL": "https://www.grossglockner.at/gg/en/index",
            "DateCreated": "2020-08-12T11:30:52.653Z",
            "User": {
                "ID": 26760,
                "Username": "interssl.com"
            },
            "CheckinStatusTypeID": 10,
            "IsActionedByEditor": false
        }
    ],
    "MediaItems": [
        {
            "ID": 24117,
            "ChargePointID": 162553,
            "ItemURL": "https://s3-ap-southeast-2.amazonaws.com/openchargemap/images/AT/OCM162553/OCM-162553.orig.2020081117200760.jpg",
            "ItemThumbnailURL": "https://s3-ap-southeast-2.amazonaws.com/openchargemap/images/AT/OCM162553/OCM-162553.thmb.2020081117200760.jpg",
            "Comment": "",
            "IsEnabled": true,
            "IsVideo": false,
            "IsFeaturedItem": false,
            "IsExternalResource": false,
            "User": {
                "ID": 26760,
                "Username": "interssl.com"
            },
            "DateCreated": "2020-08-11T17:20:00Z"
        },
        {
            "ID": 24118,
            "ChargePointID": 162553,
            "ItemURL": "https://s3-ap-southeast-2.amazonaws.com/openchargemap/images/AT/OCM162553/OCM-162553.orig.2020081117202029.jpg",
            "ItemThumbnailURL": "https://s3-ap-southeast-2.amazonaws.com/openchargemap/images/AT/OCM162553/OCM-162553.thmb.2020081117202029.jpg",
            "Comment": "",
            "IsEnabled": true,
            "IsVideo": false,
            "IsFeaturedItem": false,
            "IsExternalResource": false,
            "User": {
                "ID": 26760,
                "Username": "interssl.com"
            },
            "DateCreated": "2020-08-11T17:20:00Z"
        },
        {
            "ID": 24113,
            "ChargePointID": 162553,
            "ItemURL": "https://s3-ap-southeast-2.amazonaws.com/openchargemap/images/AT/OCM162553/OCM-162553.orig.2020081117190091.jpg",
            "ItemThumbnailURL": "https://s3-ap-southeast-2.amazonaws.com/openchargemap/images/AT/OCM162553/OCM-162553.thmb.2020081117190091.jpg",
            "Comment": "",
            "IsEnabled": true,
            "IsVideo": false,
            "IsFeaturedItem": false,
            "IsExternalResource": false,
            "User": {
                "ID": 26760,
                "Username": "interssl.com"
            },
            "DateCreated": "2020-08-11T17:19:00Z"
        },
        {
            "ID": 24114,
            "ChargePointID": 162553,
            "ItemURL": "https://s3-ap-southeast-2.amazonaws.com/openchargemap/images/AT/OCM162553/OCM-162553.orig.2020081117191514.jpg",
            "ItemThumbnailURL": "https://s3-ap-southeast-2.amazonaws.com/openchargemap/images/AT/OCM162553/OCM-162553.thmb.2020081117191514.jpg",
            "Comment": "",
            "IsEnabled": true,
            "IsVideo": false,
            "IsFeaturedItem": false,
            "IsExternalResource": false,
            "User": {
                "ID": 26760,
                "Username": "interssl.com"
            },
            "DateCreated": "2020-08-11T17:19:00Z"
        },
        {
            "ID": 24116,
            "ChargePointID": 162553,
            "ItemURL": "https://s3-ap-southeast-2.amazonaws.com/openchargemap/images/AT/OCM162553/OCM-162553.orig.2020081117192699.jpg",
            "ItemThumbnailURL": "https://s3-ap-southeast-2.amazonaws.com/openchargemap/images/AT/OCM162553/OCM-162553.thmb.2020081117192699.jpg",
            "Comment": "",
            "IsEnabled": true,
            "IsVideo": false,
            "IsFeaturedItem": false,
            "IsExternalResource": false,
            "User": {
                "ID": 26760,
                "Username": "interssl.com"
            },
            "DateCreated": "2020-08-11T17:19:00Z"
        }
    ],
    "IsRecentlyVerified": false,
    "ID": 162553,
    "UUID": "61EEB854-A586-4F32-9625-F72AF990948B",
    "DataProviderID": 1,
    "UsageTypeID": 6,
    "UsageCost": "free",
    "AddressInfo": {
        "ID": 162910,
        "Title": "Hochtor Großglockner Hochalpenstraße",
        "AddressLine1": "Großglockner Hochalpenstraße",
        "AddressLine2": "Hof",
        "Town": "Heiligenblut am Großglockner",
        "StateOrProvince": "Bezirk Spittal an der Drau",
        "Postcode": "9844",
        "CountryID": 19,
        "Latitude": 47.08097825480007,
        "Longitude": 12.842802559022175,
        "RelatedURL": "https://www.freiesolarroute.at/solarroute/",
        "DistanceUnit": 0
    },
    "Connections": [
        {
            "ID": 233953,
            "ConnectionTypeID": 25,
            "StatusTypeID": 50,
            "LevelID": 2,
            "Amps": 16,
            "PowerKW": 11,
            "CurrentTypeID": 20,
            "Quantity": 2
        }
    ],
    "NumberOfPoints": 2,
    "StatusTypeID": 50,
    "DateLastStatusUpdate": "2020-08-12T17:12:00Z",
    "DataQualityLevel": 1,
    "DateCreated": "2020-08-11T17:18:00Z",
    "SubmissionStatusTypeID": 200
}