{
    "IsRecentlyVerified": false,
    "ID": 95787,
    "UUID": "8B82C110-52D4-4145-B24C-8C8F556E0091",
    "DataProviderID": 1,
    "OperatorID": 3,
    "OperatorsReference": "PG-80770,PG-80784",
    "UsageTypeID": 4,
    "UsageCost": "Free",
    "AddressInfo": {
        "ID": 96133,
        "Title": "Heathrow Airport T3",
        "AddressLine1": "London Heathrow Airport",
        "Town": "Middlesex",
        "Postcode": "TW6 1AP",
        "CountryID": 1,
        "Latitude": 51.471584,
        "Longitude": -0.456263,
        "DistanceUnit": 0
    },
    "Connections": [
        {
            "ID": 135687,
            "ConnectionTypeID": 25,
            "StatusTypeID": 50,
            "LevelID": 2,
            "Amps": 32,
            "Voltage": 230,
            "PowerKW": 7,
            "CurrentTypeID": 10,
            "Quantity": 4
        }
    ],
    "NumberOfPoints": 4,
    "GeneralComments": "This unit is located in the Level 3 car park at Heathrow Terminal 3",
    "StatusTypeID": 50,
    "DateLastStatusUpdate": "2020-06-02T09:10:00Z",
    "DataQualityLevel": 1,
    "DateCreated": "2017-11-24T13:17:00Z",
    "SubmissionStatusTypeID": 200
}