{
    "IsRecentlyVerified": false,
    "ID": 75464,
    "UUID": "7A3E14F9-4524-4AEB-8645-BB27967ABEB0",
    "DataProviderID": 1,
    "OperatorID": 234,
    "UsageTypeID": 4,
    "AddressInfo": {
        "ID": 75810,
        "Title": "Autobahnkirche St. Christophorus",
        "AddressLine1": "Bernecker Straße 27",
        "Town": "Himmelkron",
        "StateOrProvince": "Landkreis Kulmbach",
        "Postcode": "95502",
        "CountryID": 87,
        "Latitude": 50.05907,
        "Longitude": 11.606120000000033,
        "AccessComments": "24/7 nutzbar mit Ladekarte E-Mobilität des Ladeverbundes Franken+.",
        "RelatedURL": "http://www.ladeverbund-frankenplus.de/",
        "DistanceUnit": 0
    },
    "Connections": [
        {
            "ID": 108779,
            "ConnectionTypeID": 25,
            "StatusTypeID": 50,
            "LevelID": 2,
            "Amps": 32,
            "Voltage": 400,
            "PowerKW": 22,
            "CurrentTypeID": 20,
            "Quantity": 2
        }
    ],
    "NumberOfPoints": 2,
    "StatusTypeID": 50,
    "DateLastStatusUpdate": "2016-12-15T07:10:00Z",
    "DataQualityLevel": 1,
    "DateCreated": "2016-12-15T07:10:00Z",
    "SubmissionStatusTypeID": 200
}