{
    "IsRecentlyVerified": false,
    "ID": 183800,
    "UUID": "83B71340-DC63-40E3-A97B-ED973F46009C",
    "DataProviderID": 29,
    "DataProvidersReference": "18174",
    "AddressInfo": {
        "ID": 184159,
        "Title": "Dültgenstaler Str. 61",
        "AddressLine1": "Dültgenstaler Str. 61",
        "Town": "Solingen",
        "Postcode": "42719",
        "CountryID": 87,
        "Latitude": 51.183379,
        "Longitude": 7.05158,
        "DistanceUnit": 0
    },
    "Connections": [
        {
            "ID": 291235,
            "ConnectionTypeID": 25,
            "StatusTypeID": 50,
            "LevelID": 2,
            "PowerKW": 22,
            "CurrentTypeID": 20
        },
        {
            "ID": 291236,
            "ConnectionTypeID": 25,
            "StatusTypeID": 50,
            "LevelID": 2,
            "PowerKW": 22,
            "CurrentTypeID": 20
        }
    ],
    "StatusTypeID": 50,
    "DateLastStatusUpdate": "2021-07-12T02:46:00Z",
    "MetadataValues": [
        {
            "ID": 16093,
            "MetadataFieldID": 4,
            "ItemValue": "Data from the German chargepoint registry provided by Bundesnetzagentur.de under the CC-BY 4.0 license"
        }
    ],
    "DataQualityLevel": 3,
    "DateCreated": "2021-07-08T10:04:00Z",
    "SubmissionStatusTypeID": 100
}