{
    "IsRecentlyVerified": false,
    "ID": 141504,
    "UUID": "AF5B3CCE-76AA-4BE1-93C3-6FF6856DF385",
    "DataProviderID": 2,
    "DataProvidersReference": "149445",
    "OperatorID": 5,
    "UsageTypeID": 1,
    "AddressInfo": {
        "ID": 141856,
        "Title": "KCPP SHELTER",
        "AddressLine1": "7000 Elmwood Ave",
        "Town": "Kansas City",
        "StateOrProvince": "MO",
        "Postcode": "64132",
        "CountryID": 2,
        "Latitude": 38.9974454,
        "Longitude": -94.5332949,
        "ContactTelephone1": "888-758-4389",
        "AccessComments": "24 hours daily",
        "RelatedURL": "http://www.chargepoint.com/",
        "DistanceUnit": 0
    },
    "Connections": [
        {
            "ID": 197444,
            "ConnectionTypeID": 1,
            "LevelID": 2,
            "Amps": 16,
            "Voltage": 230,
            "PowerKW": 3.7,
            "CurrentTypeID": 10,
            "Quantity": 2
        }
    ],
    "StatusTypeID": 50,
    "DateLastStatusUpdate": "2020-06-26T03:01:00Z",
    "DataQualityLevel": 3,
    "DateCreated": "2019-12-24T09:15:00Z",
    "SubmissionStatusTypeID": 100
}