{
    "IsRecentlyVerified": false,
    "ID": 9567,
    "UUID": "D655239D-D68F-4201-AF52-FA84F6BEC92D",
    "DataProviderID": 15,
    "DataProvidersReference": "15200",
    "OperatorID": 94,
    "UsageTypeID": 1,
    "AddressInfo": {
        "ID": 9464,
        "Title": "501 N. Mckenzie St",
        "AddressLine1": "501 N. Mckenzie St",
        "Town": "Foley",
        "StateOrProvince": "AL",
        "Postcode": "36535",
        "CountryID": 2,
        "Latitude": 30.41087,
        "Longitude": -87.68394,
        "ContactTelephone1": "251-943-5096",
        "RelatedURL": "http://carstations.com/15200",
        "DistanceUnit": 0
    },
    "Connections": [
        {
            "ID": 7275,
            "ConnectionTypeID": 1,
            "Reference": "J1772",
            "LevelID": 2
        }
    ],
    "NumberOfPoints": 2,
    "StatusTypeID": 50,
    "DateLastStatusUpdate": "2017-11-04T14:03:00Z",
    "DataQualityLevel": 2,
    "DateCreated": "2012-02-26T15:07:00Z",
    "SubmissionStatusTypeID": 100
}