{
    "IsRecentlyVerified": false,
    "ID": 179536,
    "UUID": "E5334623-F9B5-4C98-ACE6-B3922B03838A",
    "DataProviderID": 29,
    "DataProvidersReference": "14123",
    "OperatorID": 69,
    "AddressInfo": {
        "ID": 179895,
        "Title": "Bahnhofplatz",
        "AddressLine1": "Bahnhofplatz",
        "Town": "Mosbach",
        "Postcode": "74821",
        "CountryID": 87,
        "Latitude": 49.3493,
        "Longitude": 9.11187,
        "DistanceUnit": 0
    },
    "Connections": [
        {
            "ID": 281485,
            "ConnectionTypeID": 25,
            "StatusTypeID": 50,
            "LevelID": 2,
            "PowerKW": 22,
            "CurrentTypeID": 20
        },
        {
            "ID": 281486,
            "ConnectionTypeID": 25,
            "StatusTypeID": 50,
            "LevelID": 2,
            "PowerKW": 22,
            "CurrentTypeID": 20
        }
    ],
    "StatusTypeID": 50,
    "DateLastStatusUpdate": "2021-07-09T03:16:00Z",
    "MetadataValues": [
        {
            "ID": 11830,
            "MetadataFieldID": 4,
            "ItemValue": "Data from the German chargepoint registry provided by Bundesnetzagentur.de under the CC-BY 4.0 license"
        }
    ],
    "DataQualityLevel": 3,
    "DateCreated": "2021-07-08T09:59:00Z",
    "SubmissionStatusTypeID": 100
}