{
    "UserComments": [
        {
            "ID": 4411,
            "ChargePointID": 39619,
            "CommentTypeID": 10,
            "UserName": "",
            "Comment": "Almost always blocked by Non-EV vehicles .",
            "Rating": 2,
            "DateCreated": "2015-05-11T18:38:08.733Z",
            "CheckinStatusTypeID": 110
        }
    ],
    "IsRecentlyVerified": false,
    "ID": 39619,
    "UUID": "460F47FB-F62B-442B-A3E2-A26D5606860A",
    "DataProviderID": 2,
    "DataProvidersReference": "60481",
    "OperatorID": 9,
    "UsageTypeID": 1,
    "AddressInfo": {
        "ID": 39965,
        "Title": "McDonald's - Teel at Main - Frisco TX",
        "AddressLine1": "8888 Teel Parkway",
        "Town": "Frisco",
        "StateOrProvince": "TX",
        "Postcode": "75034",
        "CountryID": 2,
        "Latitude": 33.152129,
        "Longitude": -96.863573,
        "ContactTelephone1": "888-998-2546",
        "AccessComments": "MON: 24 hours | TUE: 24 hours | WED: 24 hours | THU: 24 hours | FRI: 24 hours | SAT: 24 hours | SUN: 24 hours",
        "RelatedURL": "http://www.blinknetwork.com/",
        "DistanceUnit": 0
    },
    "Connections": [
        {
            "ID": 43143,
            "ConnectionTypeID": 1,
            "LevelID": 2,
            "Amps": 16,
            "Voltage": 230,
            "PowerKW": 3,
            "CurrentTypeID": 10,
            "Quantity": 2
        }
    ],
    "DateLastStatusUpdate": "2018-01-04T06:16:00Z",
    "DataQualityLevel": 3,
    "DateCreated": "2015-01-10T01:00:00Z",
    "SubmissionStatusTypeID": 100
}