{
    "IsRecentlyVerified": false,
    "ID": 75888,
    "UUID": "F67E19C5-0DB0-40D7-A296-5D4A93923F87",
    "DataProviderID": 1,
    "OperatorID": 23,
    "OperatorsReference": "22308",
    "UsageTypeID": 1,
    "UsageCost": "Free",
    "AddressInfo": {
        "ID": 76234,
        "Title": "Gurney's Montauk Resort and Spa - Tesla",
        "AddressLine1": "290 Old Montauk Hwy",
        "Town": "Montauk",
        "StateOrProvince": "NY",
        "Postcode": "11954",
        "CountryID": 2,
        "Latitude": 41.0155291,
        "Longitude": -71.9918238,
        "ContactTelephone1": "631-668-2345  877-798-3752",
        "AccessComments": "24 hours daily; for Tesla use only; see valet for access",
        "RelatedURL": "http://www.teslamotors.com/supercharger",
        "DistanceUnit": 0
    },
    "Connections": [
        {
            "ID": 109399,
            "ConnectionTypeID": 30,
            "StatusTypeID": 50,
            "LevelID": 2,
            "Amps": 16,
            "Voltage": 230,
            "PowerKW": 16,
            "CurrentTypeID": 10,
            "Quantity": 2
        }
    ],
    "NumberOfPoints": 2,
    "StatusTypeID": 50,
    "DateLastStatusUpdate": "2017-01-31T19:20:00Z",
    "DataQualityLevel": 3,
    "DateCreated": "2016-12-23T01:25:00Z",
    "SubmissionStatusTypeID": 100
}