{
    "IsRecentlyVerified": false,
    "ID": 179657,
    "UUID": "EC62A0FA-0D14-4015-BD9B-9E299BBA5F60",
    "DataProviderID": 29,
    "DataProvidersReference": "11903",
    "OperatorID": 234,
    "AddressInfo": {
        "ID": 180016,
        "Title": "Oppelner Str. 21",
        "AddressLine1": "Oppelner Str. 21",
        "Town": "Nürnberg",
        "Postcode": "90473",
        "CountryID": 87,
        "Latitude": 49.402966,
        "Longitude": 11.13647,
        "DistanceUnit": 0
    },
    "Connections": [
        {
            "ID": 281752,
            "ConnectionTypeID": 25,
            "StatusTypeID": 50,
            "LevelID": 2,
            "PowerKW": 22,
            "CurrentTypeID": 20
        },
        {
            "ID": 281753,
            "ConnectionTypeID": 25,
            "StatusTypeID": 50,
            "LevelID": 2,
            "PowerKW": 22,
            "CurrentTypeID": 20
        }
    ],
    "StatusTypeID": 50,
    "DateLastStatusUpdate": "2021-07-09T03:16:00Z",
    "MetadataValues": [
        {
            "ID": 11951,
            "MetadataFieldID": 4,
            "ItemValue": "Data from the German chargepoint registry provided by Bundesnetzagentur.de under the CC-BY 4.0 license"
        }
    ],
    "DataQualityLevel": 3,
    "DateCreated": "2021-07-08T09:59:00Z",
    "SubmissionStatusTypeID": 100
}