{
    "IsRecentlyVerified": false,
    "ID": 121235,
    "UUID": "DA2245D8-C9A8-4CF1-AEDA-2D7D44FC598A",
    "DataProviderID": 2,
    "DataProvidersReference": "118043",
    "OperatorID": 5,
    "UsageTypeID": 1,
    "AddressInfo": {
        "ID": 121581,
        "Title": "HUNTINGTON",
        "AddressLine1": "3931 Morse Crossing",
        "Town": "Columbus",
        "StateOrProvince": "OH",
        "Postcode": "43219",
        "CountryID": 2,
        "Latitude": 40.0491942,
        "Longitude": -82.9208276,
        "ContactTelephone1": "888-758-4389",
        "AccessComments": "24 hours daily",
        "RelatedURL": "http://www.chargepoint.com/",
        "DistanceUnit": 0
    },
    "Connections": [
        {
            "ID": 170675,
            "ConnectionTypeID": 1,
            "LevelID": 2,
            "Amps": 16,
            "Voltage": 230,
            "PowerKW": 3.7,
            "CurrentTypeID": 10,
            "Quantity": 1
        }
    ],
    "DateLastStatusUpdate": "2020-06-26T03:02:00Z",
    "DataQualityLevel": 3,
    "DateCreated": "2019-04-01T05:00:00Z",
    "SubmissionStatusTypeID": 100
}