{
    "IsRecentlyVerified": false,
    "ID": 74114,
    "UUID": "6BE44864-F537-4A09-907E-4FFD6BB81694",
    "DataProviderID": 1,
    "OperatorID": 89,
    "OperatorsReference": "CEB-10116",
    "UsageTypeID": 4,
    "UsageCost": "CAD 1.00/hour",
    "AddressInfo": {
        "ID": 74460,
        "Title": "St-Hubert-Pierrefonds",
        "AddressLine1": "4700 boul. St-Jean",
        "Town": "Pierrefonds",
        "StateOrProvince": "QC",
        "Postcode": "H9H 4B2",
        "CountryID": 44,
        "Latitude": 45.4876518249512,
        "Longitude": -73.8497161865234,
        "DistanceUnit": 0
    },
    "Connections": [
        {
            "ID": 106439,
            "ConnectionTypeID": 1,
            "StatusTypeID": 50,
            "LevelID": 2,
            "Amps": 32,
            "Voltage": 230,
            "PowerKW": 7,
            "CurrentTypeID": 10,
            "Quantity": 1
        }
    ],
    "NumberOfPoints": 1,
    "StatusTypeID": 50,
    "DateLastStatusUpdate": "2017-11-12T06:40:00Z",
    "DataQualityLevel": 1,
    "DateCreated": "2016-11-24T00:21:00Z",
    "SubmissionStatusTypeID": 200
}