{
    "IsRecentlyVerified": false,
    "ID": 185386,
    "UUID": "B089AF18-C4A8-4FE7-9B32-CBDB17079A21",
    "DataProviderID": 29,
    "DataProvidersReference": "5420",
    "AddressInfo": {
        "ID": 185745,
        "Title": "Krummbogen 80",
        "AddressLine1": "Krummbogen 80",
        "Town": "Kiel",
        "Postcode": "24113",
        "CountryID": 87,
        "Latitude": 54.295565,
        "Longitude": 10.116125,
        "DistanceUnit": 0
    },
    "Connections": [
        {
            "ID": 294826,
            "ConnectionTypeID": 28,
            "StatusTypeID": 50,
            "LevelID": 2,
            "PowerKW": 22,
            "CurrentTypeID": 10
        },
        {
            "ID": 294827,
            "ConnectionTypeID": 28,
            "StatusTypeID": 50,
            "LevelID": 2,
            "PowerKW": 22,
            "CurrentTypeID": 10
        }
    ],
    "StatusTypeID": 50,
    "DateLastStatusUpdate": "2021-07-09T03:30:00Z",
    "MetadataValues": [
        {
            "ID": 17677,
            "MetadataFieldID": 4,
            "ItemValue": "Data from the German chargepoint registry provided by Bundesnetzagentur.de under the CC-BY 4.0 license"
        }
    ],
    "DataQualityLevel": 3,
    "DateCreated": "2021-07-08T10:06:00Z",
    "SubmissionStatusTypeID": 100
}