{
    "IsRecentlyVerified": false,
    "ID": 136794,
    "UUID": "199BC653-357C-47C4-951A-410DDFA440B6",
    "DataProviderID": 18,
    "DataProvidersReference": "18e8fd13b330e44b53cbbfd4fd6ea87d",
    "OperatorID": 2244,
    "UsageTypeID": 5,
    "AddressInfo": {
        "ID": 137140,
        "Title": "Fitzgerald Road",
        "AddressLine1": "Fitzgerald Road",
        "Town": "Liverpool",
        "Postcode": "L13 5XJ",
        "CountryID": 1,
        "Latitude": 53.415607,
        "Longitude": -2.912645,
        "AccessComments": "",
        "RelatedURL": "https://www.ubitricity.com",
        "DistanceUnit": 0
    },
    "Connections": [
        {
            "ID": 191391,
            "ConnectionTypeID": 25,
            "Reference": "suby1100002960",
            "StatusTypeID": 50,
            "LevelID": 2,
            "Amps": 16,
            "Voltage": 230,
            "PowerKW": 3.7,
            "CurrentTypeID": 10
        }
    ],
    "StatusTypeID": 0,
    "DateLastStatusUpdate": "2021-04-25T05:46:00Z",
    "MetadataValues": [
        {
            "ID": 6646,
            "MetadataFieldID": 4,
            "ItemValue": "Contains public sector information licensed under the Open Government Licence v2.0. http://www.nationalarchives.gov.uk/doc/open-government-licence/version/2/"
        }
    ],
    "DataQualityLevel": 3,
    "DateCreated": "2019-12-24T05:23:00Z",
    "SubmissionStatusTypeID": 100
}