{
    "IsRecentlyVerified": false,
    "ID": 108698,
    "UUID": "C74454E9-900E-4173-A119-EE6CAE70BC36",
    "DataProviderID": 1,
    "OperatorID": 23,
    "OperatorsReference": "44791",
    "UsageTypeID": 4,
    "AddressInfo": {
        "ID": 109044,
        "Title": "Hampton Inn & Suites Jekyll Island",
        "AddressLine1": "220 S Beachview DR",
        "Town": "Jekyll Island",
        "StateOrProvince": "Georgia",
        "Postcode": "31527",
        "CountryID": 2,
        "Latitude": 31.0336251,
        "Longitude": -81.4163031,
        "ContactTelephone1": "(912) 635-3733",
        "DistanceUnit": 0
    },
    "Connections": [
        {
            "ID": 153813,
            "ConnectionTypeID": 30,
            "StatusTypeID": 50,
            "LevelID": 2,
            "PowerKW": 16,
            "CurrentTypeID": 20,
            "Quantity": 5
        }
    ],
    "NumberOfPoints": 5,
    "GeneralComments": "5 Tesla Connectors, up to 16kW.Available for customers. Please see front desk.",
    "StatusTypeID": 50,
    "DateLastStatusUpdate": "2018-10-11T12:25:00Z",
    "DataQualityLevel": 1,
    "DateCreated": "2018-10-11T12:25:00Z",
    "SubmissionStatusTypeID": 200
}