{
    "IsRecentlyVerified": false,
    "ID": 138067,
    "UUID": "51FF1EE6-56D2-44A9-B6E4-38A01661E543",
    "DataProviderID": 2,
    "DataProvidersReference": "121828",
    "OperatorID": 3318,
    "UsageTypeID": 1,
    "AddressInfo": {
        "ID": 138416,
        "Title": "Walmart 3407 - Buckeye,AZ",
        "AddressLine1": "1060 S. S. Watson",
        "Town": "Buckeye",
        "StateOrProvince": "AZ",
        "Postcode": "85326",
        "CountryID": 2,
        "Latitude": 33.436027,
        "Longitude": -112.55893,
        "ContactTelephone1": "833-632-2778",
        "AccessComments": "24 hours daily",
        "RelatedURL": "https://www.electrifyamerica.com/",
        "DistanceUnit": 0
    },
    "Connections": [
        {
            "ID": 193116,
            "ConnectionTypeID": 2,
            "LevelID": 3,
            "Amps": 100,
            "Voltage": 400,
            "PowerKW": 40,
            "CurrentTypeID": 30,
            "Quantity": 1
        },
        {
            "ID": 193117,
            "ConnectionTypeID": 32,
            "LevelID": 3,
            "Amps": 100,
            "Voltage": 400,
            "PowerKW": 40,
            "CurrentTypeID": 30,
            "Quantity": 1
        }
    ],
    "StatusTypeID": 50,
    "DateLastStatusUpdate": "2019-12-24T09:06:00Z",
    "DataQualityLevel": 3,
    "DateCreated": "2019-12-24T09:06:00Z",
    "SubmissionStatusTypeID": 100
}