{
    "UserComments": [
        {
            "ID": 23657,
            "ChargePointID": 112893,
            "CommentTypeID": 10,
            "UserName": "ForumElettrico.it",
            "Comment": "Tutto ok con card Hera su presa di sinistra, ma il display è illeggibile e bruciato dal sole. Leggi la recensione completa qui > https://www.forumelettrico.it/forum/post161182.html#p161182",
            "RelatedURL": "https://www.forumelettrico.it/forum/post161182.html#p161182",
            "DateCreated": "2020-12-17T09:43:27.033Z",
            "User": {
                "ID": 11749,
                "Username": "ForumElettrico.it"
            },
            "CheckinStatusTypeID": 10,
            "IsActionedByEditor": false
        },
        {
            "ID": 21534,
            "ChargePointID": 112893,
            "CommentTypeID": 10,
            "UserName": "ForumElettrico.it",
            "Rating": 5,
            "DateCreated": "2019-09-20T14:42:46.527Z",
            "User": {
                "ID": 11749,
                "Username": "ForumElettrico.it"
            },
            "CheckinStatusTypeID": 10
        },
        {
            "ID": 20639,
            "ChargePointID": 112893,
            "CommentTypeID": 10,
            "UserName": "ForumElettrico.it",
            "RelatedURL": "https://www.forumelettrico.it/forum/colonnina-enel-x-22-kw-farmacia-comunale-san-martino-in-rio-re-via-stiolo-per-rubiera-1-a-t4567.html",
            "DateCreated": "2019-01-15T16:31:56.983Z",
            "User": {
                "ID": 11749,
                "Username": "ForumElettrico.it"
            },
            "CheckinStatusTypeID": 140
        }
    ],
    "MediaItems": [
        {
            "ID": 25836,
            "ChargePointID": 112893,
            "ItemURL": "https://s3-ap-southeast-2.amazonaws.com/openchargemap/images/IT/OCM112893/OCM-112893.orig.2020121709433673.jpg",
            "ItemThumbnailURL": "https://s3-ap-southeast-2.amazonaws.com/openchargemap/images/IT/OCM112893/OCM-112893.thmb.2020121709433673.jpg",
            "Comment": "",
            "IsEnabled": true,
            "IsVideo": false,
            "IsFeaturedItem": false,
            "IsExternalResource": false,
            "User": {
                "ID": 11749,
                "Username": "ForumElettrico.it"
            },
            "DateCreated": "2020-12-17T09:44:00Z"
        },
        {
            "ID": 25837,
            "ChargePointID": 112893,
            "ItemURL": "https://s3-ap-southeast-2.amazonaws.com/openchargemap/images/IT/OCM112893/OCM-112893.orig.2020121709434307.jpg",
            "ItemThumbnailURL": "https://s3-ap-southeast-2.amazonaws.com/openchargemap/images/IT/OCM112893/OCM-112893.thmb.2020121709434307.jpg",
            "Comment": "",
            "IsEnabled": true,
            "IsVideo": false,
            "IsFeaturedItem": false,
            "IsExternalResource": false,
            "User": {
                "ID": 11749,
                "Username": "ForumElettrico.it"
            },
            "DateCreated": "2020-12-17T09:44:00Z"
        },
        {
            "ID": 19637,
            "ChargePointID": 112893,
            "ItemURL": "https://s3-ap-southeast-2.amazonaws.com/openchargemap/images/IT/OCM112893/OCM-112893.orig.2019092014422869.jpg",
            "ItemThumbnailURL": "https://s3-ap-southeast-2.amazonaws.com/openchargemap/images/IT/OCM112893/OCM-112893.thmb.2019092014422869.jpg",
            "Comment": "",
            "IsEnabled": true,
            "IsVideo": false,
            "IsFeaturedItem": false,
            "IsExternalResource": false,
            "User": {
                "ID": 11749,
                "Username": "ForumElettrico.it"
            },
            "DateCreated": "2019-09-20T14:43:00Z"
        },
        {
            "ID": 19638,
            "ChargePointID": 112893,
            "ItemURL": "https://s3-ap-southeast-2.amazonaws.com/openchargemap/images/IT/OCM112893/OCM-112893.orig.2019092014423510.jpg",
            "ItemThumbnailURL": "https://s3-ap-southeast-2.amazonaws.com/openchargemap/images/IT/OCM112893/OCM-112893.thmb.2019092014423510.jpg",
            "Comment": "",
            "IsEnabled": true,
            "IsVideo": false,
            "IsFeaturedItem": false,
            "IsExternalResource": false,
            "User": {
                "ID": 11749,
                "Username": "ForumElettrico.it"
            },
            "DateCreated": "2019-09-20T14:43:00Z"
        },
        {
            "ID": 17443,
            "ChargePointID": 112893,
            "ItemURL": "https://s3-ap-southeast-2.amazonaws.com/openchargemap/images/IT/OCM112893/OCM-112893.orig.2019011516322591.jpg",
            "ItemThumbnailURL": "https://s3-ap-southeast-2.amazonaws.com/openchargemap/images/IT/OCM112893/OCM-112893.thmb.2019011516322591.jpg",
            "Comment": "",
            "IsEnabled": true,
            "IsVideo": false,
            "IsFeaturedItem": false,
            "IsExternalResource": false,
            "User": {
                "ID": 11749,
                "Username": "ForumElettrico.it"
            },
            "DateCreated": "2019-01-15T16:33:00Z"
        },
        {
            "ID": 17444,
            "ChargePointID": 112893,
            "ItemURL": "https://s3-ap-southeast-2.amazonaws.com/openchargemap/images/IT/OCM112893/OCM-112893.orig.2019011516323529.jpg",
            "ItemThumbnailURL": "https://s3-ap-southeast-2.amazonaws.com/openchargemap/images/IT/OCM112893/OCM-112893.thmb.2019011516323529.jpg",
            "Comment": "",
            "IsEnabled": true,
            "IsVideo": false,
            "IsFeaturedItem": false,
            "IsExternalResource": false,
            "User": {
                "ID": 11749,
                "Username": "ForumElettrico.it"
            },
            "DateCreated": "2019-01-15T16:33:00Z"
        },
        {
            "ID": 17442,
            "ChargePointID": 112893,
            "ItemURL": "https://s3-ap-southeast-2.amazonaws.com/openchargemap/images/IT/OCM112893/OCM-112893.orig.2019011516321477.jpg",
            "ItemThumbnailURL": "https://s3-ap-southeast-2.amazonaws.com/openchargemap/images/IT/OCM112893/OCM-112893.thmb.2019011516321477.jpg",
            "Comment": "",
            "IsEnabled": true,
            "IsVideo": false,
            "IsFeaturedItem": false,
            "IsExternalResource": false,
            "User": {
                "ID": 11749,
                "Username": "ForumElettrico.it"
            },
            "DateCreated": "2019-01-15T16:32:00Z"
        }
    ],
    "IsRecentlyVerified": false,
    "ID": 112893,
    "UUID": "51020D36-BFF1-4673-AEBC-E36F57EC5A20",
    "DataProviderID": 1,
    "OperatorID": 80,
    "UsageTypeID": 4,
    "AddressInfo": {
        "ID": 113239,
        "Title": "San Martino Via Roma | EnelX",
        "AddressLine1": "Via Roma",
        "Town": "San Martino in Rio",
        "StateOrProvince": "RE",
        "Postcode": "42018",
        "CountryID": 112,
        "Latitude": 44.7323590281354,
        "Longitude": 10.78762129399042,
        "ContactTelephone1": "800.069.850",
        "RelatedURL": "https://www.enelx.com/it/it/emobility",
        "DistanceUnit": 0
    },
    "Connections": [
        {
            "ID": 159009,
            "ConnectionTypeID": 25,
            "StatusTypeID": 150,
            "LevelID": 2,
            "Amps": 32,
            "Voltage": 400,
            "PowerKW": 22,
            "CurrentTypeID": 20,
            "Quantity": 2
        }
    ],
    "NumberOfPoints": 2,
    "StatusTypeID": 150,
    "DateLastStatusUpdate": "2020-12-17T09:44:00Z",
    "DataQualityLevel": 1,
    "DateCreated": "2018-11-22T16:01:00Z",
    "SubmissionStatusTypeID": 200
}