{
    "IsRecentlyVerified": false,
    "ID": 187256,
    "UUID": "A7E92B32-1063-4DFC-8AFC-6D68FDDE3CD1",
    "DataProviderID": 29,
    "DataProvidersReference": "18525",
    "AddressInfo": {
        "ID": 187615,
        "Title": "Steinreye 6B",
        "AddressLine1": "Steinreye 6B",
        "Town": "Hamburg",
        "Postcode": "22395",
        "CountryID": 87,
        "Latitude": 53.671226,
        "Longitude": 10.149456,
        "DistanceUnit": 0
    },
    "Connections": [
        {
            "ID": 302089,
            "ConnectionTypeID": 25,
            "StatusTypeID": 50,
            "LevelID": 2,
            "PowerKW": 22,
            "CurrentTypeID": 20
        },
        {
            "ID": 302090,
            "ConnectionTypeID": 25,
            "StatusTypeID": 50,
            "LevelID": 2,
            "PowerKW": 22,
            "CurrentTypeID": 20
        },
        {
            "ID": 302091,
            "ConnectionTypeID": 25,
            "StatusTypeID": 50,
            "LevelID": 2,
            "PowerKW": 22,
            "CurrentTypeID": 20
        }
    ],
    "StatusTypeID": 50,
    "DateLastStatusUpdate": "2021-07-12T02:52:00Z",
    "MetadataValues": [
        {
            "ID": 19496,
            "MetadataFieldID": 4,
            "ItemValue": "Data from the German chargepoint registry provided by Bundesnetzagentur.de under the CC-BY 4.0 license"
        }
    ],
    "DataQualityLevel": 3,
    "DateCreated": "2021-07-12T02:52:00Z",
    "SubmissionStatusTypeID": 100
}