{
    "IsRecentlyVerified": false,
    "ID": 144107,
    "UUID": "E9C982B7-D6CD-4CD7-82E6-6DC2DE0A21B2",
    "DataProviderID": 2,
    "DataProvidersReference": "95576",
    "OperatorID": 9,
    "UsageTypeID": 1,
    "AddressInfo": {
        "ID": 144459,
        "Title": "Shari's Restaurant & Pies - Sherwood",
        "AddressLine1": "16280 SW Langer Dr",
        "Town": "Sherwood",
        "StateOrProvince": "OR",
        "Postcode": "97140",
        "CountryID": 2,
        "Latitude": 45.367027,
        "Longitude": -122.846401,
        "ContactTelephone1": "888-998-2546",
        "AccessComments": "MON: 24 hours | TUE: 24 hours | WED: 24 hours | THU: 24 hours | FRI: 24 hours | SAT: 24 hours | SUN: 24 hours",
        "RelatedURL": "http://www.blinkcharging.com/",
        "DistanceUnit": 0
    },
    "Connections": [
        {
            "ID": 200582,
            "ConnectionTypeID": 1,
            "LevelID": 2,
            "Amps": 16,
            "Voltage": 230,
            "PowerKW": 3.7,
            "CurrentTypeID": 10,
            "Quantity": 1
        },
        {
            "ID": 200583,
            "ConnectionTypeID": 2,
            "LevelID": 3,
            "Amps": 100,
            "Voltage": 400,
            "PowerKW": 40,
            "CurrentTypeID": 30,
            "Quantity": 2
        }
    ],
    "StatusTypeID": 50,
    "DateLastStatusUpdate": "2020-06-26T03:08:00Z",
    "DataQualityLevel": 3,
    "DateCreated": "2019-12-24T09:23:00Z",
    "SubmissionStatusTypeID": 100
}