{
    "IsRecentlyVerified": false,
    "ID": 39010,
    "UUID": "4F82A489-9E6D-40AF-B7A4-309E46CC53E8",
    "DataProviderID": 26,
    "DataProvidersReference": "33539",
    "OperatorID": 157,
    "OperatorsReference": "NewMotion 02008724",
    "UsageCost": "0.00 jaarabonnement",
    "AddressInfo": {
        "ID": 39356,
        "Title": "Schimmelpennincklaan 12",
        "AddressLine1": "Schimmelpennincklaan 12",
        "Town": "Hoogezand-Sappemeer",
        "Postcode": "9601 AP",
        "CountryID": 159,
        "Latitude": 53.1610527038574,
        "Longitude": 6.76233196258545,
        "ContactTelephone1": "088 0109500",
        "RelatedURL": "http://thenewmotion.nl/",
        "DistanceUnit": 0
    },
    "Connections": [
        {
            "ID": 42521,
            "ConnectionTypeID": 25,
            "LevelID": 2,
            "PowerKW": 3.7,
            "CurrentTypeID": 10
        }
    ],
    "NumberOfPoints": 1,
    "StatusTypeID": 50,
    "DateLastStatusUpdate": "2016-06-04T02:56:00Z",
    "DataQualityLevel": 3,
    "DateCreated": "2015-01-09T06:08:00Z",
    "SubmissionStatusTypeID": 100
}