{
    "UserComments": [
        {
            "ID": 24088,
            "ChargePointID": 129399,
            "CommentTypeID": 10,
            "UserName": "ForumElettrico.it",
            "Comment": "Da lì si accede subito ai giardini di Campo Marzo e successivamente al centro storico di Vicenza. Leggi la recensione completa qui >  https://www.forumelettrico.it/forum/colonnine-enelx-vicenza-parcheggio-stazione-t10551.html",
            "RelatedURL": "https://www.forumelettrico.it/forum/colonnine-enelx-vicenza-parcheggio-stazione-t10551.html",
            "DateCreated": "2021-03-30T05:22:57.95Z",
            "User": {
                "ID": 11749,
                "Username": "ForumElettrico.it"
            },
            "CheckinStatusTypeID": 10,
            "IsActionedByEditor": false
        }
    ],
    "MediaItems": [
        {
            "ID": 27081,
            "ChargePointID": 129399,
            "ItemURL": "https://s3-ap-southeast-2.amazonaws.com/openchargemap/images/IT/OCM129399/OCM-129399.orig.2021033005230904.jpg",
            "ItemThumbnailURL": "https://s3-ap-southeast-2.amazonaws.com/openchargemap/images/IT/OCM129399/OCM-129399.thmb.2021033005230904.jpg",
            "Comment": "",
            "IsEnabled": true,
            "IsVideo": false,
            "IsFeaturedItem": false,
            "IsExternalResource": false,
            "User": {
                "ID": 11749,
                "Username": "ForumElettrico.it"
            },
            "DateCreated": "2021-03-30T05:23:00Z"
        },
        {
            "ID": 27082,
            "ChargePointID": 129399,
            "ItemURL": "https://s3-ap-southeast-2.amazonaws.com/openchargemap/images/IT/OCM129399/OCM-129399.orig.2021033005231665.jpg",
            "ItemThumbnailURL": "https://s3-ap-southeast-2.amazonaws.com/openchargemap/images/IT/OCM129399/OCM-129399.thmb.2021033005231665.jpg",
            "Comment": "",
            "IsEnabled": true,
            "IsVideo": false,
            "IsFeaturedItem": false,
            "IsExternalResource": false,
            "User": {
                "ID": 11749,
                "Username": "ForumElettrico.it"
            },
            "DateCreated": "2021-03-30T05:23:00Z"
        }
    ],
    "IsRecentlyVerified": false,
    "ID": 129399,
    "UUID": "A060078A-6A29-4EF1-AF33-AE6827192CB0",
    "DataProviderID": 1,
    "OperatorID": 80,
    "UsageTypeID": 4,
    "AddressInfo": {
        "ID": 129745,
        "Title": "Parcheggio Stazione di Vicenza | EnelX",
        "AddressLine1": "Piazzale Della Stazione, 31",
        "AddressLine2": "ingresso da Viale Milano",
        "Town": "Vicenza",
        "StateOrProvince": "VI",
        "Postcode": "36100",
        "CountryID": 112,
        "Latitude": 45.5416615383546,
        "Longitude": 11.539698166103,
        "RelatedURL": "https://www.enelx.com/it/it/emobility",
        "DistanceUnit": 0
    },
    "Connections": [
        {
            "ID": 181096,
            "ConnectionTypeID": 25,
            "StatusTypeID": 50,
            "LevelID": 2,
            "Amps": 32,
            "Voltage": 400,
            "PowerKW": 22,
            "CurrentTypeID": 20,
            "Quantity": 3
        },
        {
            "ID": 181097,
            "ConnectionTypeID": 36,
            "StatusTypeID": 50,
            "LevelID": 2,
            "Amps": 16,
            "Voltage": 240,
            "PowerKW": 3.7,
            "CurrentTypeID": 10,
            "Quantity": 1
        }
    ],
    "NumberOfPoints": 4,
    "GeneralComments": "Parcheggio pubblico a pagamanto\r\nhttp://www.metropark.it/content/metropark/it/parcheggi/parcheggi-per-regione/veneto/parcheggio-di-vicenza.html",
    "StatusTypeID": 50,
    "DateLastStatusUpdate": "2021-03-30T05:23:00Z",
    "DataQualityLevel": 1,
    "DateCreated": "2019-07-19T10:15:00Z",
    "SubmissionStatusTypeID": 200
}