{
    "UserComments": [
        {
            "ID": 8311,
            "ChargePointID": 34213,
            "CommentTypeID": 10,
            "UserName": "MarkB",
            "Comment": "",
            "Rating": 4,
            "DateCreated": "2015-12-26T11:06:23.977Z",
            "User": {
                "ID": 6685,
                "Username": "MarkB"
            },
            "CheckinStatusTypeID": 10
        }
    ],
    "IsRecentlyVerified": false,
    "ID": 34213,
    "UUID": "EE873C90-06F7-4872-98E0-5DB7CCC5CB2F",
    "DataProviderID": 26,
    "DataProvidersReference": "54126",
    "OperatorID": 73,
    "OperatorsReference": "EV-Box EVB-P1427240",
    "UsageCost": "0.00 jaarabonnement",
    "AddressInfo": {
        "ID": 34559,
        "Title": "Henegouwsestraat 10",
        "AddressLine1": "Henegouwsestraat 10",
        "Town": "Ridderkerk",
        "Postcode": "2983 TC",
        "CountryID": 159,
        "Latitude": 51.88578,
        "Longitude": 4.60735,
        "RelatedURL": "http://www.ev-box.nl",
        "DistanceUnit": 0
    },
    "Connections": [
        {
            "ID": 37724,
            "ConnectionTypeID": 25,
            "LevelID": 2,
            "PowerKW": 11,
            "CurrentTypeID": 10
        },
        {
            "ID": 47114,
            "ConnectionTypeID": 25,
            "LevelID": 2,
            "PowerKW": 11,
            "CurrentTypeID": 10
        }
    ],
    "NumberOfPoints": 1,
    "StatusTypeID": 50,
    "DateLastStatusUpdate": "2016-06-04T02:41:00Z",
    "DataQualityLevel": 3,
    "DateCreated": "2015-01-09T06:04:00Z",
    "SubmissionStatusTypeID": 100
}