{
    "IsRecentlyVerified": false,
    "ID": 75567,
    "UUID": "76C7DD3B-0D96-4B61-9B2F-26B30A0ABF09",
    "DataProviderID": 1,
    "OperatorID": 142,
    "OperatorsReference": "724225",
    "UsageTypeID": 4,
    "AddressInfo": {
        "ID": 75913,
        "Title": "Bad Vöslau Schloss Vöslau",
        "AddressLine1": "Schlossplatz 1",
        "Town": "Bad Vöslau",
        "Postcode": "2540",
        "CountryID": 19,
        "Latitude": 47.9653761,
        "Longitude": 16.2153475,
        "DistanceUnit": 0
    },
    "Connections": [
        {
            "ID": 108935,
            "ConnectionTypeID": 25,
            "StatusTypeID": 50,
            "LevelID": 2,
            "Amps": 16,
            "Voltage": 400,
            "PowerKW": 11,
            "CurrentTypeID": 20,
            "Quantity": 1
        },
        {
            "ID": 108936,
            "ConnectionTypeID": 28,
            "StatusTypeID": 50,
            "LevelID": 2,
            "Amps": 16,
            "Voltage": 230,
            "PowerKW": 4,
            "CurrentTypeID": 10,
            "Quantity": 1
        }
    ],
    "NumberOfPoints": 1,
    "GeneralComments": "Wien Energie Tanke-Karte; WienMobil-Karte",
    "StatusTypeID": 50,
    "DateLastStatusUpdate": "2016-12-16T19:23:00Z",
    "DataQualityLevel": 1,
    "DateCreated": "2016-12-16T19:23:00Z",
    "SubmissionStatusTypeID": 200
}