{
    "IsRecentlyVerified": false,
    "ID": 175863,
    "UUID": "745F8D34-3C32-4CEF-96BA-BD366344DE8C",
    "DataProviderID": 1,
    "OperatorID": 3390,
    "UsageTypeID": 4,
    "UsageCost": "4,99 UAH / kWh",
    "AddressInfo": {
        "ID": 176222,
        "Title": "EcoFactor #337",
        "AddressLine1": "16в Heroiv Stalinhrada Avenue",
        "Town": "Kyiv",
        "StateOrProvince": "",
        "Postcode": "04210",
        "CountryID": 234,
        "Latitude": 50.507586876113095,
        "Longitude": 30.509124411617904,
        "DistanceUnit": 0
    },
    "Connections": [
        {
            "ID": 273095,
            "ConnectionTypeID": 25,
            "StatusTypeID": 50,
            "LevelID": 2,
            "PowerKW": 22,
            "CurrentTypeID": 20,
            "Quantity": 1
        },
        {
            "ID": 273096,
            "ConnectionTypeID": 1,
            "StatusTypeID": 50,
            "LevelID": 2,
            "PowerKW": 7,
            "CurrentTypeID": 10,
            "Quantity": 2
        }
    ],
    "NumberOfPoints": 1,
    "StatusTypeID": 50,
    "DateLastStatusUpdate": "2021-06-19T19:23:00Z",
    "DataQualityLevel": 1,
    "DateCreated": "2021-06-16T19:18:00Z",
    "SubmissionStatusTypeID": 200
}