{
    "IsRecentlyVerified": false,
    "ID": 17553,
    "UUID": "F3FF5E6E-E03D-4D3C-9667-D08BB4E08B8F",
    "DataProviderID": 22,
    "DataProvidersReference": "B91D12ADF38B1A2C446579B64E7C5A7C",
    "AddressInfo": {
        "ID": 17898,
        "Title": "名神高速道路多賀ＳＡ（下り）",
        "AddressLine1": "滋賀県犬上郡多賀町大字敏満寺",
        "CountryID": 114,
        "Latitude": 35.21999318,
        "Longitude": 136.2850093,
        "ContactTelephone1": "0570-06-4551",
        "DistanceUnit": 0
    },
    "Connections": [
        {
            "ID": 17794,
            "ConnectionTypeID": 2,
            "LevelID": 2,
            "Amps": 100,
            "Voltage": 480,
            "PowerKW": 48,
            "Quantity": 1
        }
    ],
    "DateLastStatusUpdate": "2013-06-29T09:00:00Z",
    "DataQualityLevel": 2,
    "DateCreated": "2013-06-29T09:00:00Z",
    "SubmissionStatusTypeID": 200
}