{
    "UserComments": [
        {
            "ID": 22936,
            "ChargePointID": 102742,
            "CommentTypeID": 10,
            "UserName": "Samuel L",
            "Comment": "~44kw on my Kona",
            "DateCreated": "2020-07-24T00:35:56.333Z",
            "User": {
                "ID": 25929,
                "Username": "Samuel L"
            },
            "CheckinStatusTypeID": 10,
            "IsActionedByEditor": false
        }
    ],
    "IsRecentlyVerified": false,
    "ID": 102742,
    "UUID": "B8B93C6B-E964-45F7-B591-C31D8CF0252E",
    "DataProviderID": 1,
    "OperatorID": 15,
    "UsageTypeID": 4,
    "AddressInfo": {
        "ID": 103088,
        "Title": "Dutch Flat 76 Station",
        "AddressLine1": "25 Canyon Creek Rd",
        "Town": "Dutch Flat",
        "StateOrProvince": "CA",
        "Postcode": "95714",
        "CountryID": 2,
        "Latitude": 39.187141,
        "Longitude": -120.832537,
        "ContactTelephone1": "877-455-3833",
        "AccessComments": "24 hours daily\r\nPublic - Card key at all times",
        "RelatedURL": "https://www.evgo.com/",
        "DistanceUnit": 0
    },
    "Connections": [
        {
            "ID": 144862,
            "ConnectionTypeID": 2,
            "LevelID": 3,
            "Amps": 100,
            "Voltage": 500,
            "PowerKW": 50,
            "CurrentTypeID": 30,
            "Quantity": 1
        },
        {
            "ID": 144863,
            "ConnectionTypeID": 32,
            "LevelID": 3,
            "Amps": 100,
            "Voltage": 500,
            "PowerKW": 50,
            "CurrentTypeID": 30,
            "Quantity": 1
        }
    ],
    "StatusTypeID": 0,
    "DateLastStatusUpdate": "2020-07-24T06:04:00Z",
    "DataQualityLevel": 3,
    "DateCreated": "2018-04-21T04:13:00Z",
    "SubmissionStatusTypeID": 100
}