{
    "IsRecentlyVerified": false,
    "ID": 174221,
    "UUID": "EE8AC9EB-5055-4ED7-8969-1F74BFD6B695",
    "DataProviderID": 1,
    "OperatorID": 3,
    "OperatorsReference": "PG-70267,PG-84515",
    "UsageTypeID": 4,
    "UsageCost": "Free",
    "AddressInfo": {
        "ID": 174580,
        "Title": "Tesco Superstore-Fakenham",
        "AddressLine1": "Oak Street",
        "Town": "Fakenham",
        "Postcode": "NR21 9DX",
        "CountryID": 1,
        "Latitude": 52.831087,
        "Longitude": 0.84473,
        "DistanceUnit": 0
    },
    "Connections": [
        {
            "ID": 269410,
            "ConnectionTypeID": 25,
            "StatusTypeID": 50,
            "LevelID": 2,
            "Amps": 32,
            "Voltage": 230,
            "PowerKW": 7,
            "CurrentTypeID": 10,
            "Quantity": 4
        }
    ],
    "NumberOfPoints": 4,
    "GeneralComments": "This is an open charge unit installed at the Tesco super store at Oak Street, Fakenham",
    "StatusTypeID": 50,
    "DateLastStatusUpdate": "2021-03-23T14:27:00Z",
    "DataQualityLevel": 1,
    "DateCreated": "2021-03-23T06:19:00Z",
    "SubmissionStatusTypeID": 200
}