{
    "IsRecentlyVerified": false,
    "ID": 184255,
    "UUID": "0FEF8F6D-F9BF-44EF-8F68-37A700D538C2",
    "DataProviderID": 29,
    "DataProvidersReference": "17444",
    "OperatorID": 3403,
    "AddressInfo": {
        "ID": 184614,
        "Title": "Maria-Ward-Straße 9",
        "AddressLine1": "Maria-Ward-Straße 9",
        "Town": "Altötting",
        "Postcode": "84503",
        "CountryID": 87,
        "Latitude": 48.2254,
        "Longitude": 12.6808,
        "DistanceUnit": 0
    },
    "Connections": [
        {
            "ID": 292281,
            "ConnectionTypeID": 25,
            "StatusTypeID": 50,
            "LevelID": 2,
            "PowerKW": 22,
            "CurrentTypeID": 20
        },
        {
            "ID": 292282,
            "ConnectionTypeID": 25,
            "StatusTypeID": 50,
            "LevelID": 2,
            "PowerKW": 11,
            "CurrentTypeID": 20
        }
    ],
    "StatusTypeID": 50,
    "DateLastStatusUpdate": "2021-07-12T02:40:00Z",
    "MetadataValues": [
        {
            "ID": 16546,
            "MetadataFieldID": 4,
            "ItemValue": "Data from the German chargepoint registry provided by Bundesnetzagentur.de under the CC-BY 4.0 license"
        }
    ],
    "DataQualityLevel": 3,
    "DateCreated": "2021-07-08T10:05:00Z",
    "SubmissionStatusTypeID": 100
}