{
    "IsRecentlyVerified": false,
    "ID": 41024,
    "UUID": "B1E259A8-0D61-4B6A-9E76-D2C83BDA3E62",
    "DataProviderID": 1,
    "OperatorID": 134,
    "UsageTypeID": 1,
    "UsageCost": "0",
    "AddressInfo": {
        "ID": 41370,
        "Title": "Stadtwerke Verden am Facharztzentrum ",
        "AddressLine1": "Eitzer Straße 18",
        "Town": "Verden (Aller)",
        "StateOrProvince": "Landkreis Verden",
        "Postcode": "27283",
        "CountryID": 87,
        "Latitude": 52.9145770229578,
        "Longitude": 9.23179085819697,
        "ContactTelephone1": "04231 915112",
        "AccessComments": "Kostenpflichtiger Parkplatz. RFID Karte der Stadtwerke Verden zum Ladestart notwendig oder Ausleihen am Empfang. ",
        "RelatedURL": "http://www.stadtwerke-verden.de",
        "DistanceUnit": 0
    },
    "Connections": [
        {
            "ID": 44743,
            "ConnectionTypeID": 25,
            "StatusTypeID": 50,
            "LevelID": 2,
            "Amps": 32,
            "Voltage": 400,
            "PowerKW": 22,
            "CurrentTypeID": 20,
            "Quantity": 4
        }
    ],
    "NumberOfPoints": 4,
    "StatusTypeID": 50,
    "DateLastStatusUpdate": "2015-01-27T12:50:00Z",
    "DataQualityLevel": 1,
    "DateCreated": "2015-01-22T10:53:00Z",
    "SubmissionStatusTypeID": 200
}