{
    "IsRecentlyVerified": false,
    "ID": 134804,
    "UUID": "EB6FF161-2117-4756-9849-0E9E6EC54349",
    "DataProviderID": 1,
    "OperatorID": 1,
    "UsageTypeID": 1,
    "AddressInfo": {
        "ID": 135150,
        "Title": "ELEN Fužine",
        "AddressLine1": "Vrelska 1",
        "Town": "Fužine",
        "StateOrProvince": "Primorje-Gorski Kotar County",
        "Postcode": "51322",
        "CountryID": 60,
        "Latitude": 45.30564062123244,
        "Longitude": 14.71397517794253,
        "AccessComments": "https://www.plugshare.com/location/187303",
        "RelatedURL": "https://elen.hep.hr/",
        "DistanceUnit": 0
    },
    "Connections": [
        {
            "ID": 188838,
            "ConnectionTypeID": 33,
            "StatusTypeID": 50,
            "LevelID": 3,
            "PowerKW": 50,
            "CurrentTypeID": 30,
            "Quantity": 1
        },
        {
            "ID": 188839,
            "ConnectionTypeID": 2,
            "StatusTypeID": 50,
            "LevelID": 3,
            "PowerKW": 50,
            "CurrentTypeID": 30,
            "Quantity": 1
        },
        {
            "ID": 188840,
            "ConnectionTypeID": 1036,
            "StatusTypeID": 50,
            "LevelID": 3,
            "Amps": 63,
            "Voltage": 400,
            "PowerKW": 43,
            "CurrentTypeID": 20,
            "Quantity": 1
        }
    ],
    "NumberOfPoints": 2,
    "GeneralComments": "Open 24/7  - 0-24\r\n1x50kW CHAdeMO\r\n1x50kW CCS\r\n1x43kW Type2\r\nRFID Elen\r\nGPS: 45.30559, 14.713769",
    "StatusTypeID": 50,
    "DateLastStatusUpdate": "2019-12-03T11:32:00Z",
    "DataQualityLevel": 1,
    "DateCreated": "2019-11-24T16:18:00Z",
    "SubmissionStatusTypeID": 200
}