{
    "IsRecentlyVerified": false,
    "ID": 59129,
    "UUID": "C3F80604-E9F5-481F-9BD3-E2F070E0A2C0",
    "DataProviderID": 1,
    "OperatorID": 1,
    "UsageTypeID": 6,
    "UsageCost": "Free",
    "AddressInfo": {
        "ID": 59475,
        "Title": "Novotel Hamilton Tainui",
        "AddressLine1": "7 Alma St",
        "AddressLine2": "",
        "Town": "Hamilton",
        "StateOrProvince": "",
        "Postcode": "3204",
        "CountryID": 161,
        "Latitude": -37.78613,
        "Longitude": 175.2827511,
        "ContactTelephone1": "07 838 1366",
        "ContactTelephone2": "",
        "ContactEmail": "h2159@accor.com",
        "AccessComments": "Hotel guests only",
        "RelatedURL": "http://www.novotel.com/gb/hotel-2159-novotel-hamilton-tainui/index.shtml",
        "DistanceUnit": 0
    },
    "Connections": [
        {
            "ID": 75034,
            "ConnectionTypeID": 1,
            "StatusTypeID": 0,
            "LevelID": 2
        }
    ],
    "NumberOfPoints": 1,
    "GeneralComments": "",
    "StatusTypeID": 50,
    "DateLastStatusUpdate": "2016-01-13T07:42:00Z",
    "DataQualityLevel": 1,
    "DateCreated": "2016-01-07T14:52:00Z",
    "SubmissionStatusTypeID": 200
}