{
    "IsRecentlyVerified": false,
    "ID": 93477,
    "UUID": "597B047D-28FB-4456-9DBC-4320EF85B896",
    "DataProviderID": 1,
    "OperatorID": 86,
    "UsageTypeID": 4,
    "AddressInfo": {
        "ID": 93823,
        "Title": "Rasthof Göttingen West",
        "AddressLine1": "A7",
        "Town": "Rosdorf",
        "StateOrProvince": "Landkreis Göttingen",
        "Postcode": "37124",
        "CountryID": 87,
        "Latitude": 51.49481922154046,
        "Longitude": 9.876295831555124,
        "AccessComments": "24/7 nutzbar zwischen Tankstelle und Rasthaus rechts auf den Parkplatz hinter der Tankstelle.",
        "DistanceUnit": 0
    },
    "Connections": [
        {
            "ID": 132360,
            "ConnectionTypeID": 2,
            "StatusTypeID": 50,
            "LevelID": 3,
            "PowerKW": 50,
            "CurrentTypeID": 30,
            "Quantity": 1
        },
        {
            "ID": 132361,
            "ConnectionTypeID": 33,
            "StatusTypeID": 50,
            "LevelID": 3,
            "PowerKW": 50,
            "CurrentTypeID": 30,
            "Quantity": 1
        },
        {
            "ID": 132362,
            "ConnectionTypeID": 1036,
            "StatusTypeID": 50,
            "LevelID": 3,
            "Amps": 63,
            "Voltage": 400,
            "PowerKW": 43,
            "CurrentTypeID": 20,
            "Quantity": 1
        }
    ],
    "NumberOfPoints": 3,
    "GeneralComments": "26.9.17: Eingeschaltet aber noch nicht freischaltbar.",
    "StatusTypeID": 50,
    "DateLastStatusUpdate": "2017-09-28T08:45:00Z",
    "DataQualityLevel": 1,
    "DateCreated": "2017-09-28T08:45:00Z",
    "SubmissionStatusTypeID": 200
}