{
    "IsRecentlyVerified": false,
    "ID": 157750,
    "UUID": "8C105E88-4651-43E4-859C-9E2EB77555A0",
    "DataProviderID": 18,
    "DataProvidersReference": "19619aa36c96960f16b045c5469e11c1",
    "OperatorID": 3391,
    "UsageTypeID": 1,
    "AddressInfo": {
        "ID": 158104,
        "Title": "Langdale Gardens",
        "AddressLine1": "Langdale Gardens",
        "Town": "Brighton",
        "Postcode": "BN3 4HG",
        "CountryID": 1,
        "Latitude": 50.826759,
        "Longitude": -0.190539,
        "AccessComments": "",
        "RelatedURL": "https://www.electricblueuk.com/",
        "DistanceUnit": 0
    },
    "Connections": [
        {
            "ID": 227278,
            "ConnectionTypeID": 25,
            "Reference": "62196-2 (SINGLE PHASE)",
            "StatusTypeID": 50,
            "LevelID": 2,
            "Amps": 16,
            "Voltage": 230,
            "PowerKW": 3.7,
            "CurrentTypeID": 10
        }
    ],
    "StatusTypeID": 0,
    "DateLastStatusUpdate": "2020-06-25T10:00:00Z",
    "MetadataValues": [
        {
            "ID": 7283,
            "MetadataFieldID": 4,
            "ItemValue": "Contains public sector information licensed under the Open Government Licence v2.0. http://www.nationalarchives.gov.uk/doc/open-government-licence/version/2/"
        }
    ],
    "DataQualityLevel": 3,
    "DateCreated": "2020-06-25T10:00:00Z",
    "SubmissionStatusTypeID": 100
}