{
    "IsRecentlyVerified": false,
    "ID": 9650,
    "UUID": "7F61C00C-5FAB-45AC-A5B0-B85A45855938",
    "DataProviderID": 15,
    "DataProvidersReference": "15745",
    "OperatorID": 1,
    "AddressInfo": {
        "ID": 9547,
        "Title": "226 Reservation Rd",
        "AddressLine1": "226 Reservation Rd",
        "Town": "Marina",
        "StateOrProvince": "CA",
        "Postcode": "93933",
        "CountryID": 2,
        "Latitude": 36.6863865,
        "Longitude": -121.797497,
        "ContactTelephone1": "(831) 384-4700",
        "RelatedURL": "http://carstations.com/15745",
        "DistanceUnit": 0
    },
    "Connections": [
        {
            "ID": 7410,
            "ConnectionTypeID": 1,
            "Reference": "J1772",
            "LevelID": 2
        }
    ],
    "StatusTypeID": 0,
    "DateLastStatusUpdate": "2017-11-04T14:04:00Z",
    "DataQualityLevel": 2,
    "DateCreated": "2012-03-20T12:43:00Z",
    "SubmissionStatusTypeID": 100
}