{
    "IsRecentlyVerified": false,
    "ID": 27130,
    "UUID": "9E87F4AE-3A80-4A6C-AE9B-A90C60FE5273",
    "DataProviderID": 2,
    "DataProvidersReference": "64441",
    "OperatorID": 5,
    "UsageTypeID": 1,
    "AddressInfo": {
        "ID": 27476,
        "Title": "BMW FACILITIES",
        "AddressLine1": "Oak Ct",
        "Town": "Greer",
        "StateOrProvince": "SC",
        "Postcode": "29651",
        "CountryID": 2,
        "Latitude": 34.8961493,
        "Longitude": -82.1818053,
        "ContactTelephone1": "888-758-4389",
        "AccessComments": "24 hours daily",
        "RelatedURL": "http://www.chargepoint.com/",
        "DistanceUnit": 0
    },
    "Connections": [
        {
            "ID": 29714,
            "ConnectionTypeID": 1,
            "LevelID": 2,
            "Amps": 16,
            "Voltage": 230,
            "PowerKW": 3,
            "CurrentTypeID": 10,
            "Quantity": 2
        }
    ],
    "DateLastStatusUpdate": "2019-04-06T04:02:00Z",
    "DataQualityLevel": 3,
    "DateCreated": "2014-11-28T03:37:00Z",
    "SubmissionStatusTypeID": 100
}