{
    "IsRecentlyVerified": false,
    "ID": 90492,
    "UUID": "A2B5FC66-FA9D-421F-B508-02700C446055",
    "DataProviderID": 1,
    "OperatorID": 45,
    "UsageTypeID": 6,
    "AddressInfo": {
        "ID": 90838,
        "Title": "Terrassencafe Schrüfer",
        "AddressLine1": "Hauptstraße 27a",
        "Town": "Pinzberg",
        "StateOrProvince": "Gosberg (VGem)",
        "Postcode": "91361",
        "CountryID": 87,
        "Latitude": 49.69205601511807,
        "Longitude": 11.104098687171916,
        "ContactTelephone1": "+49 9191 729760",
        "AccessComments": "Für Café-Gäste kostenlos",
        "RelatedURL": "http://terrassencafe-schruefer.de/",
        "DistanceUnit": 0
    },
    "Connections": [
        {
            "ID": 128149,
            "ConnectionTypeID": 25,
            "StatusTypeID": 50,
            "LevelID": 2,
            "Amps": 16,
            "Voltage": 400,
            "PowerKW": 11,
            "CurrentTypeID": 20,
            "Quantity": 1
        }
    ],
    "NumberOfPoints": 1,
    "StatusTypeID": 50,
    "DateLastStatusUpdate": "2017-07-14T06:31:00Z",
    "DataQualityLevel": 1,
    "DateCreated": "2017-07-14T06:31:00Z",
    "SubmissionStatusTypeID": 200
}