{
    "IsRecentlyVerified": false,
    "ID": 71952,
    "UUID": "751E5C45-C76E-498A-A35D-E498252A7E92",
    "DataProviderID": 1,
    "OperatorID": 1,
    "UsageTypeID": 1,
    "UsageCost": "Free",
    "AddressInfo": {
        "ID": 72298,
        "Title": "BMW Händler in Luzern",
        "AddressLine1": "Fluhmühle 9",
        "Town": "Luzern",
        "StateOrProvince": "Switzerland",
        "Postcode": "6015",
        "CountryID": 217,
        "Latitude": 47.0575715,
        "Longitude": 8.2851888,
        "ContactTelephone1": "+41 41 248 70 30",
        "RelatedURL": "http://www.goingelectric.de/stromtankstellen/Schweiz/Luzern/BMW-Haendler-Fluhmuehle-9/4605/",
        "DistanceUnit": 0
    },
    "Connections": [
        {
            "ID": 103142,
            "ConnectionTypeID": 33,
            "StatusTypeID": 50,
            "LevelID": 3,
            "PowerKW": 50,
            "CurrentTypeID": 30,
            "Quantity": 1
        },
        {
            "ID": 103143,
            "ConnectionTypeID": 25,
            "StatusTypeID": 50,
            "LevelID": 2,
            "PowerKW": 22,
            "CurrentTypeID": 20,
            "Quantity": 1
        }
    ],
    "NumberOfPoints": 2,
    "StatusTypeID": 50,
    "DateLastStatusUpdate": "2016-09-26T17:01:00Z",
    "DataQualityLevel": 1,
    "DateCreated": "2016-09-26T02:45:00Z",
    "SubmissionStatusTypeID": 200
}