{
    "IsRecentlyVerified": false,
    "ID": 66785,
    "UUID": "FC66B60C-7C27-4F90-8041-428514E27EAE",
    "DataProviderID": 1,
    "OperatorID": 23,
    "OperatorsReference": "17204",
    "UsageTypeID": 1,
    "UsageCost": "Free",
    "AddressInfo": {
        "ID": 67131,
        "Title": "Hampton Inn and Suites - Tesla",
        "AddressLine1": "4350 Executive Cir",
        "Town": "Fort Myers",
        "StateOrProvince": "FL",
        "Postcode": "33916",
        "CountryID": 2,
        "Latitude": 26.5991287,
        "Longitude": -81.8444466,
        "ContactTelephone1": "239-931-5300  877-798-3752",
        "AccessComments": "24 hours daily; for Tesla use only; for guest use only; see front desk for access",
        "RelatedURL": "http://www.teslamotors.com/supercharger",
        "DistanceUnit": 0
    },
    "Connections": [
        {
            "ID": 92271,
            "ConnectionTypeID": 30,
            "StatusTypeID": 50,
            "LevelID": 2,
            "Amps": 16,
            "Voltage": 230,
            "PowerKW": 8,
            "CurrentTypeID": 10,
            "Quantity": 1
        }
    ],
    "NumberOfPoints": 1,
    "StatusTypeID": 50,
    "DateLastStatusUpdate": "2017-01-26T03:32:00Z",
    "DataQualityLevel": 3,
    "DateCreated": "2016-05-29T02:04:00Z",
    "SubmissionStatusTypeID": 100
}