{
    "IsRecentlyVerified": false,
    "ID": 186290,
    "UUID": "83338982-63BD-457F-9F92-F43713409BC5",
    "DataProviderID": 29,
    "DataProvidersReference": "15872",
    "AddressInfo": {
        "ID": 186649,
        "Title": "Pirnaer Landstraße 0A",
        "AddressLine1": "Pirnaer Landstraße 0A",
        "Town": "Dresden",
        "Postcode": "01257",
        "CountryID": 87,
        "Latitude": 51.01194,
        "Longitude": 13.826626,
        "DistanceUnit": 0
    },
    "Connections": [
        {
            "ID": 298590,
            "ConnectionTypeID": 33,
            "StatusTypeID": 50,
            "LevelID": 3,
            "PowerKW": 150,
            "CurrentTypeID": 30
        },
        {
            "ID": 298591,
            "ConnectionTypeID": 2,
            "StatusTypeID": 50,
            "LevelID": 3,
            "PowerKW": 150,
            "CurrentTypeID": 30
        },
        {
            "ID": 298592,
            "ConnectionTypeID": 25,
            "StatusTypeID": 50,
            "LevelID": 2,
            "PowerKW": 22,
            "CurrentTypeID": 20
        }
    ],
    "StatusTypeID": 50,
    "DateLastStatusUpdate": "2021-07-12T02:46:00Z",
    "MetadataValues": [
        {
            "ID": 18531,
            "MetadataFieldID": 4,
            "ItemValue": "Data from the German chargepoint registry provided by Bundesnetzagentur.de under the CC-BY 4.0 license"
        }
    ],
    "DataQualityLevel": 3,
    "DateCreated": "2021-07-12T02:46:00Z",
    "SubmissionStatusTypeID": 100
}