{
    "IsRecentlyVerified": false,
    "ID": 44874,
    "UUID": "F5E866A4-710D-4B4E-8755-06B21F6E7732",
    "DataProviderID": 1,
    "OperatorID": 45,
    "UsageTypeID": 3,
    "AddressInfo": {
        "ID": 45220,
        "Title": "Autohaus Rüschkamp",
        "AddressLine1": "Viktoriastraße 73",
        "AddressLine2": "Gahmen",
        "Town": "Lünen",
        "StateOrProvince": "Kreis Unna",
        "Postcode": "44532",
        "CountryID": 87,
        "Latitude": 51.60931,
        "Longitude": 7.50711000000001,
        "ContactTelephone1": " +49 2306 202030",
        "AccessComments": "2 kostenlose Parkplätze am Opel /Peugeot / Suzuki / Chevrolet Autohaus. Alles kostenlos. Nutzbar während der Öffnungszeiten nach Freischaltung durch Mitarbeiter Mo-Fr 7-18:30, Sa 9-13Uhr.",
        "RelatedURL": "http://www.autohaus-rueschkamp.de/standorte/luenen.html",
        "DistanceUnit": 0
    },
    "Connections": [
        {
            "ID": 55173,
            "ConnectionTypeID": 25,
            "StatusTypeID": 50,
            "LevelID": 2,
            "Amps": 16,
            "Voltage": 400,
            "PowerKW": 11,
            "CurrentTypeID": 20,
            "Quantity": 1
        },
        {
            "ID": 55174,
            "ConnectionTypeID": 28,
            "StatusTypeID": 50,
            "LevelID": 2,
            "Amps": 16,
            "Voltage": 230,
            "PowerKW": 3.7,
            "CurrentTypeID": 10,
            "Quantity": 1
        }
    ],
    "NumberOfPoints": 2,
    "StatusTypeID": 50,
    "DateLastStatusUpdate": "2015-04-21T09:11:00Z",
    "DataQualityLevel": 1,
    "DateCreated": "2015-04-21T06:43:00Z",
    "SubmissionStatusTypeID": 200
}