{
    "IsRecentlyVerified": false,
    "ID": 167768,
    "UUID": "E335E969-E271-4D76-A732-2EA5BB13F150",
    "DataProviderID": 1,
    "OperatorID": 21,
    "UsageTypeID": 4,
    "UsageCost": "Mobi.E compatible card",
    "AddressInfo": {
        "ID": 168127,
        "Title": "VIS-00051",
        "AddressLine1": "Museu do Quartzo",
        "Town": "Vila Nova do Campo",
        "StateOrProvince": "Viseu",
        "Postcode": "",
        "CountryID": 180,
        "Latitude": 40.696465052557045,
        "Longitude": -7.921265776094174,
        "DistanceUnit": 0
    },
    "Connections": [
        {
            "ID": 254722,
            "ConnectionTypeID": 25,
            "StatusTypeID": 50,
            "LevelID": 2,
            "Amps": 16,
            "Voltage": 230,
            "PowerKW": 3.7,
            "CurrentTypeID": 10,
            "Quantity": 2
        }
    ],
    "NumberOfPoints": 2,
    "StatusTypeID": 100,
    "DateLastStatusUpdate": "2020-09-12T11:23:00Z",
    "DataQualityLevel": 1,
    "DateCreated": "2020-09-12T11:23:00Z",
    "SubmissionStatusTypeID": 200
}