{
    "IsRecentlyVerified": false,
    "ID": 148847,
    "UUID": "6C54747C-BFD3-4D38-A05D-DBCF00E694D6",
    "DataProviderID": 1,
    "OperatorID": 80,
    "UsageTypeID": 4,
    "AddressInfo": {
        "ID": 149199,
        "Title": "Genova Belvedere Don Ga | EnelX",
        "AddressLine1": "Corso Firenze",
        "Town": "Genova",
        "StateOrProvince": "GE",
        "Postcode": "16136",
        "CountryID": 112,
        "Latitude": 44.41844236261514,
        "Longitude": 8.927870167310289,
        "RelatedURL": "https://www.enelx.com/it/it/emobility",
        "DistanceUnit": 0
    },
    "Connections": [
        {
            "ID": 206690,
            "ConnectionTypeID": 25,
            "StatusTypeID": 50,
            "LevelID": 2,
            "Amps": 32,
            "Voltage": 400,
            "PowerKW": 22,
            "CurrentTypeID": 20,
            "Quantity": 1
        },
        {
            "ID": 206691,
            "ConnectionTypeID": 36,
            "StatusTypeID": 50,
            "LevelID": 2,
            "Amps": 16,
            "Voltage": 240,
            "PowerKW": 3.7,
            "CurrentTypeID": 10,
            "Quantity": 1
        }
    ],
    "NumberOfPoints": 2,
    "StatusTypeID": 50,
    "DateLastStatusUpdate": "2020-02-11T11:41:00Z",
    "DataQualityLevel": 1,
    "DateCreated": "2020-02-11T11:41:00Z",
    "SubmissionStatusTypeID": 200
}