{
    "IsRecentlyVerified": false,
    "ID": 8305,
    "UUID": "A4DB1F55-24E7-4FC4-8D64-D09BA3B0732B",
    "DataProviderID": 15,
    "DataProvidersReference": "5891",
    "OperatorID": 26,
    "AddressInfo": {
        "ID": 8202,
        "Title": "1880 Westland Rd",
        "AddressLine1": "1880 Westland Rd",
        "Town": "Cheyenne",
        "StateOrProvince": "WY",
        "Postcode": "82001",
        "CountryID": 2,
        "Latitude": 41.12927,
        "Longitude": -104.84011,
        "ContactTelephone1": "(307) 634-1511",
        "RelatedURL": "http://carstations.com/5891",
        "DistanceUnit": 0
    },
    "Connections": [
        {
            "ID": 5734,
            "ConnectionTypeID": 1,
            "Reference": "J1772",
            "LevelID": 2
        }
    ],
    "StatusTypeID": 0,
    "DateLastStatusUpdate": "2017-11-04T14:04:00Z",
    "DataQualityLevel": 1,
    "DateCreated": "2011-11-11T12:06:00Z",
    "SubmissionStatusTypeID": 100
}