{
    "IsRecentlyVerified": false,
    "ID": 8281,
    "UUID": "89D929D8-942D-40F6-8AC5-6E024A0C393F",
    "DataProviderID": 15,
    "DataProvidersReference": "3870",
    "OperatorID": 5,
    "AddressInfo": {
        "ID": 8178,
        "Title": "13650 Heritage Pkwy",
        "AddressLine1": "13650 Heritage Pkwy",
        "Town": "Fort Worth",
        "StateOrProvince": "TX",
        "Postcode": "76177",
        "CountryID": 2,
        "Latitude": 32.97752,
        "Longitude": -97.31076,
        "ContactTelephone1": "888-758-4389 ",
        "RelatedURL": "http://carstations.com/3870",
        "DistanceUnit": 0
    },
    "Connections": [
        {
            "ID": 5710,
            "ConnectionTypeID": 1,
            "Reference": "J1772",
            "LevelID": 2
        },
        {
            "ID": 6641,
            "ConnectionTypeID": 9,
            "Reference": "NEMA5",
            "LevelID": 1,
            "Quantity": 1
        }
    ],
    "StatusTypeID": 0,
    "DateLastStatusUpdate": "2017-11-04T14:04:00Z",
    "DataQualityLevel": 1,
    "DateCreated": "2011-11-11T12:06:00Z",
    "SubmissionStatusTypeID": 100
}