{
    "IsRecentlyVerified": false,
    "ID": 68743,
    "UUID": "48A8C1CF-ACF0-481B-9BFA-ED6D6269303B",
    "DataProviderID": 1,
    "OperatorID": 105,
    "UsageTypeID": 4,
    "AddressInfo": {
        "ID": 69089,
        "Title": "Bahnhof",
        "AddressLine1": "Bahnhofstraße 5",
        "Town": "Memmingen",
        "StateOrProvince": "Memmingen",
        "Postcode": "87700",
        "CountryID": 87,
        "Latitude": 47.984637493094304,
        "Longitude": 10.186141984655697,
        "AccessComments": "2 Ladesäulen neben Parkbuchten  unmittelbar vor dem Parkhaus Bahnhofstraße. ",
        "DistanceUnit": 0
    },
    "Connections": [
        {
            "ID": 96409,
            "ConnectionTypeID": 25,
            "StatusTypeID": 50,
            "LevelID": 2,
            "Amps": 32,
            "Voltage": 400,
            "PowerKW": 22,
            "CurrentTypeID": 20,
            "Quantity": 4
        }
    ],
    "NumberOfPoints": 4,
    "StatusTypeID": 50,
    "DateLastStatusUpdate": "2016-06-20T12:32:00Z",
    "DataQualityLevel": 1,
    "DateCreated": "2016-06-20T12:32:00Z",
    "SubmissionStatusTypeID": 200
}