{
    "IsRecentlyVerified": false,
    "ID": 27629,
    "UUID": "EBD0671E-EBB0-4A3B-B79E-7AAEE6044524",
    "DataProviderID": 2,
    "DataProvidersReference": "51223",
    "OperatorID": 5,
    "UsageTypeID": 1,
    "AddressInfo": {
        "ID": 27975,
        "Title": "ALAMEDA",
        "AddressLine1": "551-599 7th St",
        "Town": "Oakland",
        "StateOrProvince": "CA",
        "Postcode": "94607",
        "CountryID": 2,
        "Latitude": 37.800267,
        "Longitude": -122.276678,
        "ContactTelephone1": "888-758-4389",
        "AccessComments": "24 hours daily",
        "RelatedURL": "http://www.chargepoint.com/",
        "DistanceUnit": 0
    },
    "Connections": [
        {
            "ID": 30296,
            "ConnectionTypeID": 9,
            "LevelID": 1,
            "Amps": 16,
            "Voltage": 120,
            "PowerKW": 1,
            "CurrentTypeID": 10,
            "Quantity": 9
        },
        {
            "ID": 30297,
            "ConnectionTypeID": 1,
            "LevelID": 2,
            "Amps": 16,
            "Voltage": 230,
            "PowerKW": 3,
            "CurrentTypeID": 10,
            "Quantity": 21
        }
    ],
    "DateLastStatusUpdate": "2019-04-06T04:02:00Z",
    "DataQualityLevel": 3,
    "DateCreated": "2014-11-28T03:38:00Z",
    "SubmissionStatusTypeID": 100
}