{
    "IsRecentlyVerified": false,
    "ID": 122787,
    "UUID": "36BBB9C6-20B8-4515-B50D-F4B808A98243",
    "DataProviderID": 2,
    "DataProvidersReference": "85959",
    "UsageTypeID": 7,
    "AddressInfo": {
        "ID": 123133,
        "Title": "Mountain View Nissan",
        "AddressLine1": "1706 E Walnut Ave",
        "Town": "Dalton",
        "StateOrProvince": "GA",
        "Postcode": "30721",
        "CountryID": 2,
        "Latitude": 34.761066,
        "Longitude": -84.93958,
        "ContactTelephone1": "706-459-3600",
        "AccessComments": "Dealership business hours\r\nPublic - Call ahead",
        "RelatedURL": "",
        "DistanceUnit": 0
    },
    "Connections": [
        {
            "ID": 172707,
            "ConnectionTypeID": 1,
            "LevelID": 2,
            "Amps": 16,
            "Voltage": 230,
            "PowerKW": 3.7,
            "CurrentTypeID": 10,
            "Quantity": 2
        }
    ],
    "DateLastStatusUpdate": "2020-06-26T02:57:00Z",
    "DataQualityLevel": 3,
    "DateCreated": "2019-04-06T05:03:00Z",
    "SubmissionStatusTypeID": 100
}