{
    "IsRecentlyVerified": false,
    "ID": 95486,
    "UUID": "B8438638-4D8B-43B1-B249-36AD6106F081",
    "DataProviderID": 1,
    "OperatorID": 23,
    "OperatorsReference": "37685",
    "UsageTypeID": 4,
    "AddressInfo": {
        "ID": 95832,
        "Title": "200 Main",
        "AddressLine1": "200 Main St",
        "Town": "Highlands",
        "StateOrProvince": "NC",
        "Postcode": "28741",
        "CountryID": 2,
        "Latitude": 35.054647,
        "Longitude": -83.201175,
        "ContactTelephone1": "(855) 271-2809",
        "DistanceUnit": 0
    },
    "Connections": [
        {
            "ID": 135269,
            "ConnectionTypeID": 30,
            "StatusTypeID": 50,
            "LevelID": 2,
            "PowerKW": 16,
            "CurrentTypeID": 20,
            "Quantity": 1
        }
    ],
    "NumberOfPoints": 1,
    "GeneralComments": "1 Tesla Connector, up to 16kW.Available for customers. Self park.",
    "StatusTypeID": 50,
    "DateLastStatusUpdate": "2017-11-12T06:50:00Z",
    "DataQualityLevel": 1,
    "DateCreated": "2017-11-12T06:50:00Z",
    "SubmissionStatusTypeID": 200
}