{
    "IsRecentlyVerified": false,
    "ID": 161297,
    "UUID": "FCD89460-CCA8-4ADE-9CDC-DE2447E54ECA",
    "DataProviderID": 1,
    "OperatorID": 3378,
    "UsageTypeID": 5,
    "AddressInfo": {
        "ID": 161654,
        "Title": "BP Szentendrei 255 MOL",
        "AddressLine1": "Szentendrei út 255.",
        "AddressLine2": "Csillaghegy",
        "Town": "Budapest",
        "StateOrProvince": "Budapest",
        "Postcode": "1039",
        "CountryID": 104,
        "Latitude": 47.58136144849502,
        "Longitude": 19.048808526339826,
        "RelatedURL": "https://molplugee.hu/hu/toltoink",
        "DistanceUnit": 0
    },
    "Connections": [
        {
            "ID": 232111,
            "ConnectionTypeID": 33,
            "StatusTypeID": 50,
            "LevelID": 3,
            "PowerKW": 50,
            "CurrentTypeID": 30,
            "Quantity": 1
        },
        {
            "ID": 232112,
            "ConnectionTypeID": 2,
            "StatusTypeID": 50,
            "LevelID": 3,
            "PowerKW": 50,
            "CurrentTypeID": 30,
            "Quantity": 1
        },
        {
            "ID": 232113,
            "ConnectionTypeID": 1036,
            "StatusTypeID": 50,
            "LevelID": 3,
            "PowerKW": 43,
            "CurrentTypeID": 20,
            "Quantity": 1
        }
    ],
    "NumberOfPoints": 1,
    "GeneralComments": "EFACEC QC45",
    "StatusTypeID": 50,
    "DateLastStatusUpdate": "2020-07-16T09:51:00Z",
    "DataQualityLevel": 1,
    "DateCreated": "2020-07-08T10:38:00Z",
    "SubmissionStatusTypeID": 200
}