{
    "IsRecentlyVerified": false,
    "ID": 131333,
    "UUID": "22842255-4708-44E1-9B67-076386FDCD15",
    "DataProviderID": 1,
    "OperatorID": 38,
    "UsageTypeID": 1,
    "UsageCost": "free",
    "AddressInfo": {
        "ID": 131679,
        "Title": "LIDL Giugliano in Campania",
        "AddressLine1": "Via Pigna, 1",
        "Town": "Giugliano in Campania",
        "StateOrProvince": "NA",
        "Postcode": "80014",
        "CountryID": 112,
        "Latitude": 40.93258480792943,
        "Longitude": 14.174370640005918,
        "RelatedURL": "https://www.lidl.it",
        "DistanceUnit": 0
    },
    "Connections": [
        {
            "ID": 183875,
            "ConnectionTypeID": 25,
            "StatusTypeID": 50,
            "LevelID": 2,
            "Amps": 32,
            "Voltage": 400,
            "PowerKW": 22,
            "CurrentTypeID": 20,
            "Quantity": 2
        }
    ],
    "NumberOfPoints": 2,
    "StatusTypeID": 50,
    "DateLastStatusUpdate": "2019-09-03T09:17:00Z",
    "DataQualityLevel": 1,
    "DateCreated": "2019-09-03T09:17:00Z",
    "SubmissionStatusTypeID": 200
}