{
    "IsRecentlyVerified": false,
    "ID": 73110,
    "UUID": "E9B817BE-291C-45FB-A90C-91D5CB17BA72",
    "DataProviderID": 1,
    "OperatorID": 110,
    "UsageTypeID": 1,
    "UsageCost": "Free",
    "AddressInfo": {
        "ID": 73456,
        "Title": "Parkplatz Raiffeisenbank in St. Margrethen",
        "AddressLine1": "Grenzstrasse 3",
        "Town": "St. Margrethen",
        "StateOrProvince": "Switzerland",
        "Postcode": "9430",
        "CountryID": 217,
        "Latitude": 47.4526215795041,
        "Longitude": 9.63451623916626,
        "DistanceUnit": 0
    },
    "Connections": [
        {
            "ID": 105118,
            "ConnectionTypeID": 33,
            "StatusTypeID": 50,
            "LevelID": 3,
            "PowerKW": 50,
            "CurrentTypeID": 30,
            "Quantity": 1
        },
        {
            "ID": 105119,
            "ConnectionTypeID": 2,
            "StatusTypeID": 50,
            "LevelID": 3,
            "PowerKW": 50,
            "CurrentTypeID": 30,
            "Quantity": 1
        },
        {
            "ID": 105120,
            "ConnectionTypeID": 25,
            "StatusTypeID": 50,
            "LevelID": 2,
            "Amps": 32,
            "Voltage": 400,
            "PowerKW": 22,
            "CurrentTypeID": 20,
            "Quantity": 1
        }
    ],
    "NumberOfPoints": 3,
    "GeneralComments": "2 free parking",
    "StatusTypeID": 50,
    "DateLastStatusUpdate": "2016-11-08T09:31:00Z",
    "DataQualityLevel": 1,
    "DateCreated": "2016-11-07T05:15:00Z",
    "SubmissionStatusTypeID": 200
}