{
    "IsRecentlyVerified": false,
    "ID": 51486,
    "UUID": "CC372C9B-6B0F-4421-ACBB-2FD37983B89A",
    "DataProviderID": 1,
    "OperatorID": 45,
    "UsageTypeID": 4,
    "AddressInfo": {
        "ID": 51832,
        "Title": "Knorrstraße",
        "AddressLine1": "Knorrstraße 70",
        "Town": "München",
        "StateOrProvince": "Bayern",
        "Postcode": "80809",
        "CountryID": 87,
        "Latitude": 48.1855401,
        "Longitude": 11.57304,
        "ContactTelephone1": "+49 89 23612030",
        "AccessComments": " Laden auf 2 kostenlosen Parkplätzen. 24/7 geöffnet.",
        "RelatedURL": "http://www.swm.de/privatkunden/m-strom/autofahren.html",
        "DistanceUnit": 0
    },
    "Connections": [
        {
            "ID": 63785,
            "ConnectionTypeID": 25,
            "StatusTypeID": 50,
            "LevelID": 2,
            "Amps": 32,
            "Voltage": 400,
            "PowerKW": 22,
            "CurrentTypeID": 20,
            "Quantity": 2
        }
    ],
    "NumberOfPoints": 2,
    "StatusTypeID": 50,
    "DateLastStatusUpdate": "2021-01-04T22:15:00Z",
    "DataQualityLevel": 1,
    "DateCreated": "2015-07-27T08:29:00Z",
    "SubmissionStatusTypeID": 200
}