{
    "IsRecentlyVerified": false,
    "ID": 96179,
    "UUID": "306CABEC-C92A-4219-8962-F703663970DF",
    "DataProviderID": 1,
    "OperatorID": 3315,
    "OperatorsReference": "52535",
    "UsageTypeID": 4,
    "UsageCost": "Free",
    "AddressInfo": {
        "ID": 96525,
        "Title": "Musselburgh Train Station",
        "AddressLine1": "Denholm Way",
        "Town": "Musselburgh",
        "Postcode": "EH21 6TT",
        "CountryID": 1,
        "Latitude": 55.93309,
        "Longitude": -3.07186,
        "DistanceUnit": 0
    },
    "Connections": [
        {
            "ID": 136271,
            "ConnectionTypeID": 25,
            "StatusTypeID": 50,
            "LevelID": 2,
            "Amps": 32,
            "Voltage": 230,
            "PowerKW": 3.6,
            "CurrentTypeID": 10,
            "Quantity": 2
        }
    ],
    "NumberOfPoints": 2,
    "StatusTypeID": 50,
    "DateLastStatusUpdate": "2020-01-02T08:29:00Z",
    "DataQualityLevel": 1,
    "DateCreated": "2017-12-14T06:15:00Z",
    "SubmissionStatusTypeID": 200
}