{
    "IsRecentlyVerified": false,
    "ID": 77654,
    "UUID": "5A0A2FB1-91F8-4816-A3A1-8BBF562F6599",
    "DataProviderID": 1,
    "OperatorID": 3,
    "OperatorsReference": "PG-90945",
    "UsageTypeID": 6,
    "UsageCost": "1",
    "AddressInfo": {
        "ID": 78000,
        "Title": "Dornan Engineering",
        "AddressLine1": "Multiplex Construction Office",
        "Town": " London",
        "Postcode": "SW1E 5DU",
        "CountryID": 1,
        "Latitude": 51.498136,
        "Longitude": -0.142448,
        "DistanceUnit": 0
    },
    "Connections": [
        {
            "ID": 112181,
            "ConnectionTypeID": 25,
            "StatusTypeID": 50,
            "LevelID": 2,
            "Amps": 32,
            "Voltage": 230,
            "PowerKW": 7,
            "CurrentTypeID": 10,
            "Quantity": 1
        }
    ],
    "NumberOfPoints": 2,
    "GeneralComments": "This is an open charge unit installed at the Dornan Engineering office site in Bressenden Place, Westminster, London",
    "StatusTypeID": 0,
    "DateLastStatusUpdate": "2020-01-13T21:10:00Z",
    "DataQualityLevel": 1,
    "DateCreated": "2017-01-22T08:53:00Z",
    "SubmissionStatusTypeID": 200
}