{
    "IsRecentlyVerified": false,
    "ID": 94656,
    "UUID": "4EBD73EA-2EEB-4814-96F3-7A707D71AF79",
    "DataProviderID": 1,
    "OperatorID": 23,
    "OperatorsReference": "36822",
    "UsageTypeID": 4,
    "AddressInfo": {
        "ID": 95002,
        "Title": "Holiday Inn Columbus - Hilliard",
        "AddressLine1": "5495 Maxwell PL",
        "Town": "Columbus",
        "StateOrProvince": "Ohio",
        "Postcode": "43228",
        "CountryID": 2,
        "Latitude": 39.978948,
        "Longitude": -83.145259,
        "ContactTelephone1": "(614) 335-1150",
        "DistanceUnit": 0
    },
    "Connections": [
        {
            "ID": 133809,
            "ConnectionTypeID": 30,
            "StatusTypeID": 50,
            "LevelID": 2,
            "PowerKW": 16,
            "CurrentTypeID": 20,
            "Quantity": 3
        }
    ],
    "NumberOfPoints": 3,
    "GeneralComments": "3 Tesla Connectors, up to 16kW.Available for customers. Please see front desk.",
    "StatusTypeID": 50,
    "DateLastStatusUpdate": "2017-10-22T05:44:00Z",
    "DataQualityLevel": 1,
    "DateCreated": "2017-10-22T05:44:00Z",
    "SubmissionStatusTypeID": 200
}