{
    "IsRecentlyVerified": false,
    "ID": 72244,
    "UUID": "BE4F55BD-18CB-48CA-BF56-4376A479CD3C",
    "DataProviderID": 2,
    "DataProvidersReference": "78600",
    "OperatorID": 5,
    "UsageTypeID": 1,
    "AddressInfo": {
        "ID": 72590,
        "Title": "CITY OF INDEP 1",
        "AddressLine1": "17221 East 23rd St S Central Utility Bldg",
        "Town": "Independence",
        "StateOrProvince": "MO",
        "Postcode": "64057",
        "CountryID": 2,
        "Latitude": 39.077496,
        "Longitude": -94.374547,
        "ContactTelephone1": "888-758-4389",
        "AccessComments": "24 hours daily",
        "RelatedURL": "http://www.chargepoint.com/",
        "DistanceUnit": 0
    },
    "Connections": [
        {
            "ID": 103548,
            "ConnectionTypeID": 1,
            "LevelID": 2,
            "Amps": 16,
            "Voltage": 230,
            "PowerKW": 3.7,
            "CurrentTypeID": 10,
            "Quantity": 4
        }
    ],
    "DateLastStatusUpdate": "2020-06-26T03:01:00Z",
    "DataQualityLevel": 3,
    "DateCreated": "2016-10-09T02:45:00Z",
    "SubmissionStatusTypeID": 100
}