{
    "IsRecentlyVerified": false,
    "ID": 74088,
    "UUID": "5335F3D2-0CEC-4826-8EB7-BDDAA37D713A",
    "DataProviderID": 1,
    "OperatorID": 89,
    "OperatorsReference": "CEB-10074,CEB-10087",
    "UsageTypeID": 4,
    "UsageCost": "CAD 2.50",
    "AddressInfo": {
        "ID": 74434,
        "Title": "Amt-Gare Saint-Jérôme",
        "AddressLine1": "455 boul. Jean-Baptiste-Rolland",
        "Town": "St-Jérôme",
        "StateOrProvince": "QC",
        "Postcode": "J7Z 2H5",
        "CountryID": 44,
        "Latitude": 45.7734413146973,
        "Longitude": -73.9995727539063,
        "DistanceUnit": 0
    },
    "Connections": [
        {
            "ID": 106412,
            "ConnectionTypeID": 1,
            "StatusTypeID": 50,
            "LevelID": 2,
            "Amps": 32,
            "Voltage": 230,
            "PowerKW": 7,
            "CurrentTypeID": 10,
            "Quantity": 2
        }
    ],
    "NumberOfPoints": 2,
    "StatusTypeID": 50,
    "DateLastStatusUpdate": "2017-08-31T05:46:00Z",
    "DataQualityLevel": 1,
    "DateCreated": "2016-11-24T00:15:00Z",
    "SubmissionStatusTypeID": 200
}