{
    "IsRecentlyVerified": false,
    "ID": 74597,
    "UUID": "7834E341-8FE0-49CC-AC7E-38636117D27C",
    "DataProviderID": 2,
    "DataProvidersReference": "79631",
    "UsageTypeID": 1,
    "AddressInfo": {
        "ID": 74943,
        "Title": "Z Airport Parking",
        "AddressLine1": "3 International Dr",
        "Town": "East Granby",
        "StateOrProvince": "CT",
        "Postcode": "06026",
        "CountryID": 2,
        "Latitude": 41.928233,
        "Longitude": -72.709138,
        "ContactTelephone1": "860-653-7667",
        "AccessComments": "24 hours daily",
        "RelatedURL": "",
        "DistanceUnit": 0
    },
    "Connections": [
        {
            "ID": 107203,
            "ConnectionTypeID": 1,
            "LevelID": 2,
            "Amps": 16,
            "Voltage": 230,
            "PowerKW": 3.7,
            "CurrentTypeID": 10,
            "Quantity": 1
        }
    ],
    "DateLastStatusUpdate": "2020-06-26T03:05:00Z",
    "DataQualityLevel": 3,
    "DateCreated": "2016-12-03T00:13:00Z",
    "SubmissionStatusTypeID": 100
}