{
    "IsRecentlyVerified": false,
    "ID": 185680,
    "UUID": "1CF0C1D0-1AAD-4DA3-8074-6DEC87D0F640",
    "DataProviderID": 29,
    "DataProvidersReference": "20397,8625,15154",
    "AddressInfo": {
        "ID": 186039,
        "Title": "Waldenbucher Str. 34",
        "AddressLine1": "Waldenbucher Str. 34",
        "Town": "Sindelfingen",
        "Postcode": "71065",
        "CountryID": 87,
        "Latitude": 48.695536,
        "Longitude": 9.013158,
        "DistanceUnit": 0
    },
    "Connections": [
        {
            "ID": 296016,
            "ConnectionTypeID": 25,
            "StatusTypeID": 50,
            "LevelID": 2,
            "PowerKW": 22,
            "CurrentTypeID": 20
        },
        {
            "ID": 296017,
            "ConnectionTypeID": 25,
            "StatusTypeID": 50,
            "LevelID": 2,
            "PowerKW": 22,
            "CurrentTypeID": 20
        },
        {
            "ID": 296018,
            "ConnectionTypeID": 25,
            "StatusTypeID": 50,
            "LevelID": 2,
            "PowerKW": 22,
            "CurrentTypeID": 20
        },
        {
            "ID": 296019,
            "ConnectionTypeID": 25,
            "StatusTypeID": 50,
            "LevelID": 2,
            "PowerKW": 22,
            "CurrentTypeID": 20
        },
        {
            "ID": 296020,
            "ConnectionTypeID": 25,
            "StatusTypeID": 50,
            "LevelID": 2,
            "PowerKW": 22,
            "CurrentTypeID": 20
        },
        {
            "ID": 296021,
            "ConnectionTypeID": 25,
            "StatusTypeID": 50,
            "LevelID": 2,
            "PowerKW": 22,
            "CurrentTypeID": 20
        }
    ],
    "StatusTypeID": 50,
    "DateLastStatusUpdate": "2021-07-12T02:41:00Z",
    "MetadataValues": [
        {
            "ID": 17924,
            "MetadataFieldID": 4,
            "ItemValue": "Data from the German chargepoint registry provided by Bundesnetzagentur.de under the CC-BY 4.0 license"
        }
    ],
    "DataQualityLevel": 3,
    "DateCreated": "2021-07-12T02:41:00Z",
    "SubmissionStatusTypeID": 100
}