{
    "IsRecentlyVerified": false,
    "ID": 28004,
    "UUID": "3E72B9C1-527D-4F79-90B7-405AB3ADDF84",
    "DataProviderID": 2,
    "DataProvidersReference": "50399",
    "UsageTypeID": 2,
    "AddressInfo": {
        "ID": 28350,
        "Title": "Melink",
        "AddressLine1": "5140 River Valley Rd",
        "Town": "Milford",
        "StateOrProvince": "OH",
        "Postcode": "45150",
        "CountryID": 2,
        "Latitude": 39.144528,
        "Longitude": -84.248677,
        "ContactTelephone1": "",
        "AccessComments": "Employee and visitor use only",
        "RelatedURL": "",
        "DistanceUnit": 0
    },
    "Connections": [
        {
            "ID": 30763,
            "ConnectionTypeID": 0,
            "LevelID": 1,
            "Amps": 16,
            "Voltage": 120,
            "PowerKW": 1,
            "CurrentTypeID": 10,
            "Quantity": 15
        },
        {
            "ID": 50923,
            "ConnectionTypeID": 1,
            "LevelID": 2,
            "Amps": 16,
            "Voltage": 230,
            "PowerKW": 3,
            "CurrentTypeID": 10,
            "Quantity": 9
        }
    ],
    "DateLastStatusUpdate": "2019-04-06T04:03:00Z",
    "DataQualityLevel": 3,
    "DateCreated": "2014-11-28T03:38:00Z",
    "SubmissionStatusTypeID": 100
}