{
    "IsRecentlyVerified": false,
    "ID": 135149,
    "UUID": "53A4018D-806B-47C5-94A9-5E2E9ED05180",
    "DataProviderID": 1,
    "OperatorID": 3359,
    "UsageTypeID": 1,
    "AddressInfo": {
        "ID": 135495,
        "Title": "Székesfehérvár ALDI, Szent Flórián krt",
        "AddressLine1": "Szent Flórián krt 11",
        "Town": "Székesfehérvár",
        "CountryID": 104,
        "Latitude": 47.21338,
        "Longitude": 18.418128,
        "DistanceUnit": 0
    },
    "Connections": [
        {
            "ID": 189188,
            "ConnectionTypeID": 25,
            "StatusTypeID": 50,
            "LevelID": 2,
            "Amps": 32,
            "Voltage": 400,
            "PowerKW": 22,
            "CurrentTypeID": 20,
            "Quantity": 4
        }
    ],
    "NumberOfPoints": 4,
    "StatusTypeID": 50,
    "DateLastStatusUpdate": "2019-12-09T09:20:00Z",
    "DataQualityLevel": 1,
    "DateCreated": "2019-12-09T08:37:00Z",
    "SubmissionStatusTypeID": 200
}