{
    "IsRecentlyVerified": false,
    "ID": 122405,
    "UUID": "B2E2C63D-AED6-4B26-A4ED-AB6569DDAE27",
    "DataProviderID": 2,
    "DataProvidersReference": "96780",
    "UsageTypeID": 1,
    "AddressInfo": {
        "ID": 122751,
        "Title": "Elbert County Courthouse",
        "AddressLine1": "12 S Oliver St",
        "Town": "Elberton",
        "StateOrProvince": "GA",
        "Postcode": "30635",
        "CountryID": 2,
        "Latitude": 34.109726,
        "Longitude": -82.868747,
        "ContactTelephone1": "706-988-0963",
        "AccessComments": "24 hours daily",
        "RelatedURL": "",
        "DistanceUnit": 0
    },
    "Connections": [
        {
            "ID": 172293,
            "ConnectionTypeID": 1,
            "LevelID": 2,
            "Amps": 16,
            "Voltage": 230,
            "PowerKW": 3.7,
            "CurrentTypeID": 10,
            "Quantity": 2
        }
    ],
    "DateLastStatusUpdate": "2020-06-26T02:57:00Z",
    "DataQualityLevel": 3,
    "DateCreated": "2019-04-06T05:03:00Z",
    "SubmissionStatusTypeID": 100
}