{
    "IsRecentlyVerified": false,
    "ID": 130544,
    "UUID": "AA1136AC-F2DF-454A-A6EC-72F14DB0CD97",
    "DataProviderID": 1,
    "OperatorID": 80,
    "UsageTypeID": 4,
    "AddressInfo": {
        "ID": 130890,
        "Title": "Palena Campo Sportivo | EnelX",
        "AddressLine1": "Strada Statale 84 Frentana",
        "Town": "Palena",
        "StateOrProvince": "CH",
        "Postcode": "66017",
        "CountryID": 112,
        "Latitude": 41.9751406365872,
        "Longitude": 14.1319996537036,
        "ContactTelephone1": "800.069.850",
        "RelatedURL": "https://www.enelx.com/it/it/emobility",
        "DistanceUnit": 0
    },
    "Connections": [
        {
            "ID": 182749,
            "ConnectionTypeID": 25,
            "StatusTypeID": 50,
            "LevelID": 2,
            "Amps": 32,
            "Voltage": 400,
            "PowerKW": 22,
            "CurrentTypeID": 20,
            "Quantity": 2
        },
        {
            "ID": 182750,
            "ConnectionTypeID": 36,
            "StatusTypeID": 50,
            "LevelID": 2,
            "Amps": 16,
            "Voltage": 240,
            "PowerKW": 3.7,
            "CurrentTypeID": 10,
            "Quantity": 2
        }
    ],
    "NumberOfPoints": 4,
    "StatusTypeID": 50,
    "DateLastStatusUpdate": "2019-08-06T13:39:00Z",
    "DataQualityLevel": 1,
    "DateCreated": "2019-08-06T13:39:00Z",
    "SubmissionStatusTypeID": 200
}