{
    "IsRecentlyVerified": false,
    "ID": 121067,
    "UUID": "50BB4151-2FA6-453D-917B-649B1DD4898F",
    "DataProviderID": 2,
    "DataProvidersReference": "67099",
    "UsageTypeID": 7,
    "AddressInfo": {
        "ID": 121413,
        "Title": "DeKalb Peachtree Airport",
        "AddressLine1": "2000 Airport Rd",
        "Town": "Atlanta",
        "StateOrProvince": "GA",
        "Postcode": "30341",
        "CountryID": 2,
        "Latitude": 33.874961,
        "Longitude": -84.301305,
        "ContactTelephone1": "770-936-5440",
        "AccessComments": "24 hours daily; call ahead to obtain code to use the charger\r\nPublic - Call ahead",
        "RelatedURL": "",
        "DistanceUnit": 0
    },
    "Connections": [
        {
            "ID": 170491,
            "ConnectionTypeID": 1,
            "LevelID": 2,
            "Amps": 16,
            "Voltage": 230,
            "PowerKW": 3.7,
            "CurrentTypeID": 10,
            "Quantity": 2
        }
    ],
    "DateLastStatusUpdate": "2020-06-26T02:56:00Z",
    "DataQualityLevel": 3,
    "DateCreated": "2019-04-01T04:59:00Z",
    "SubmissionStatusTypeID": 100
}