{
    "IsRecentlyVerified": false,
    "ID": 17745,
    "UUID": "974726EC-9D28-44B4-8CD5-4916BF629363",
    "DataProviderID": 22,
    "DataProvidersReference": "5C46DFDE90D27CF400999DED4049F356",
    "AddressInfo": {
        "ID": 18090,
        "Title": "日本サントスキャブ",
        "AddressLine1": "神奈川県横浜市港南区港南台7丁目53-14",
        "CountryID": 114,
        "Latitude": 35.37638972,
        "Longitude": 139.5892471,
        "ContactTelephone1": "045-833-1261",
        "DistanceUnit": 0
    },
    "Connections": [
        {
            "ID": 17986,
            "ConnectionTypeID": 2,
            "LevelID": 2,
            "Amps": 100,
            "Voltage": 480,
            "PowerKW": 48,
            "Quantity": 1
        }
    ],
    "DateLastStatusUpdate": "2013-06-29T09:02:00Z",
    "DataQualityLevel": 2,
    "DateCreated": "2013-06-29T09:02:00Z",
    "SubmissionStatusTypeID": 200
}