{
    "IsRecentlyVerified": false,
    "ID": 81544,
    "UUID": "4AB12EE7-F92D-41EC-9581-9EAEB3BC8187",
    "DataProviderID": 1,
    "OperatorID": 23,
    "OperatorsReference": "21253",
    "UsageTypeID": 6,
    "AddressInfo": {
        "ID": 81890,
        "Title": "Banyan Tree Acapulco",
        "AddressLine1": "Boulevard Cabo Marques Lte. 1 Punta Diamante",
        "Town": "Acapulco",
        "StateOrProvince": "Guerrero",
        "Postcode": "39907",
        "CountryID": 146,
        "Latitude": 16.794313,
        "Longitude": -99.856011,
        "ContactTelephone1": "+52 744 434 0100",
        "DistanceUnit": 0
    },
    "Connections": [
        {
            "ID": 116285,
            "ConnectionTypeID": 30,
            "StatusTypeID": 50,
            "LevelID": 2,
            "PowerKW": 16,
            "CurrentTypeID": 20,
            "Quantity": 2
        }
    ],
    "NumberOfPoints": 2,
    "GeneralComments": "2 Tesla Connectors, up to 16kW.Available for patrons only. Please see front desk.",
    "StatusTypeID": 50,
    "DateLastStatusUpdate": "2017-02-02T22:40:00Z",
    "DataQualityLevel": 1,
    "DateCreated": "2017-02-02T22:40:00Z",
    "SubmissionStatusTypeID": 200
}