{
    "IsRecentlyVerified": false,
    "ID": 183671,
    "UUID": "E12B21ED-F7E8-4F1D-ADCA-957B93A11E06",
    "DataProviderID": 29,
    "DataProvidersReference": "2882",
    "OperatorID": 2241,
    "AddressInfo": {
        "ID": 184030,
        "Title": "Hebelstraße",
        "AddressLine1": "Hebelstraße",
        "Town": "Niefern-Öschelbronn",
        "Postcode": "75223",
        "CountryID": 87,
        "Latitude": 48.916772,
        "Longitude": 8.78486,
        "DistanceUnit": 0
    },
    "Connections": [
        {
            "ID": 290936,
            "ConnectionTypeID": 25,
            "StatusTypeID": 50,
            "LevelID": 2,
            "PowerKW": 22,
            "CurrentTypeID": 20
        },
        {
            "ID": 290937,
            "ConnectionTypeID": 25,
            "StatusTypeID": 50,
            "LevelID": 2,
            "PowerKW": 22,
            "CurrentTypeID": 20
        }
    ],
    "StatusTypeID": 50,
    "DateLastStatusUpdate": "2021-07-12T02:42:00Z",
    "MetadataValues": [
        {
            "ID": 15964,
            "MetadataFieldID": 4,
            "ItemValue": "Data from the German chargepoint registry provided by Bundesnetzagentur.de under the CC-BY 4.0 license"
        }
    ],
    "DataQualityLevel": 3,
    "DateCreated": "2021-07-08T10:04:00Z",
    "SubmissionStatusTypeID": 100
}