{
    "IsRecentlyVerified": false,
    "ID": 51545,
    "UUID": "C27C903D-23EA-46A8-B63B-521DE2652868",
    "DataProviderID": 1,
    "OperatorID": 201,
    "UsageTypeID": 4,
    "AddressInfo": {
        "ID": 51891,
        "Title": "Park and Ride Parkhaus Sauerlach",
        "AddressLine1": "Münchener Straße 12",
        "Town": "Sauerlach",
        "StateOrProvince": "Landkreis München",
        "Postcode": "82054 ",
        "CountryID": 87,
        "Latitude": 47.9746420266775,
        "Longitude": 11.6539685613769,
        "AccessComments": "Zwei reservierte Parkplätze nach der Einfahrt auf der linken Seite, 24/7 nutzbar. \"München Umland\" oder \"KommEnergie\" Ladekarte erforderlich.",
        "DistanceUnit": 0
    },
    "Connections": [
        {
            "ID": 63886,
            "ConnectionTypeID": 25,
            "StatusTypeID": 50,
            "LevelID": 2,
            "Amps": 16,
            "Voltage": 400,
            "PowerKW": 11,
            "CurrentTypeID": 20,
            "Quantity": 2
        },
        {
            "ID": 63887,
            "ConnectionTypeID": 28,
            "StatusTypeID": 50,
            "LevelID": 2,
            "Amps": 16,
            "Voltage": 230,
            "PowerKW": 3.7,
            "CurrentTypeID": 10,
            "Quantity": 2
        }
    ],
    "NumberOfPoints": 2,
    "StatusTypeID": 50,
    "DateLastStatusUpdate": "2015-07-28T13:18:00Z",
    "DataQualityLevel": 1,
    "DateCreated": "2015-07-28T12:43:00Z",
    "SubmissionStatusTypeID": 200
}