{
    "IsRecentlyVerified": false,
    "ID": 57591,
    "UUID": "7F47451A-D608-469E-8B92-4745CDD7E291",
    "DataProviderID": 1,
    "OperatorID": 45,
    "UsageTypeID": 5,
    "AddressInfo": {
        "ID": 57937,
        "Title": "Tiefgarage Albertsplatz",
        "AddressLine1": "Albertsplatz",
        "AddressLine2": "Cortendorf",
        "Town": "Coburg",
        "StateOrProvince": "Coburg",
        "Postcode": "96450",
        "CountryID": 87,
        "Latitude": 50.2565904,
        "Longitude": 10.963705600000026,
        "AccessComments": "Rund um die Uhr (24/7) nutzbar ab 12.12.2015.  Details unbekannt, bitte ergänzen.\r\n",
        "DistanceUnit": 0
    },
    "Connections": [
        {
            "ID": 72809,
            "ConnectionTypeID": 25,
            "StatusTypeID": 50,
            "LevelID": 2,
            "Amps": 16,
            "Voltage": 400,
            "PowerKW": 11,
            "CurrentTypeID": 20,
            "Quantity": 1
        }
    ],
    "NumberOfPoints": 1,
    "StatusTypeID": 50,
    "DateLastStatusUpdate": "2015-12-07T08:40:00Z",
    "DataQualityLevel": 1,
    "DateCreated": "2015-12-07T08:40:00Z",
    "SubmissionStatusTypeID": 200
}