{
    "IsRecentlyVerified": false,
    "ID": 165231,
    "UUID": "D26FD943-193D-4934-B1DF-6E984A7296DD",
    "DataProviderID": 1,
    "DataProvidersReference": "TR-IST-077",
    "OperatorID": 70,
    "UsageTypeID": 1,
    "AddressInfo": {
        "ID": 165590,
        "Title": "Eşarj - Tekfen Tower, 4. Levent",
        "AddressLine1": "Esentepe Mah. Büyükdere Caddesi No:209 4.Levent, Şişli",
        "Town": "İstanbul",
        "StateOrProvince": "İstanbul",
        "Postcode": "34394",
        "CountryID": 229,
        "Latitude": 41.081924,
        "Longitude": 29.009033,
        "ContactTelephone1": "+90 (850) 433 72 75",
        "ContactEmail": "destek@esarj.com",
        "RelatedURL": "https://esarj.com/en/map?s=TR-IST-077",
        "DistanceUnit": 0
    },
    "Connections": [
        {
            "ID": 236894,
            "ConnectionTypeID": 25,
            "LevelID": 2,
            "Amps": 32,
            "Voltage": 380,
            "PowerKW": 22,
            "Quantity": 1
        }
    ],
    "GeneralComments": "Eşarj Charging Systems",
    "StatusTypeID": 50,
    "DateLastStatusUpdate": "2020-08-26T08:19:00Z",
    "DataQualityLevel": 3,
    "DateCreated": "2020-08-26T08:19:00Z",
    "SubmissionStatusTypeID": 200
}