{
    "IsRecentlyVerified": false,
    "ID": 109330,
    "UUID": "E0EF17A6-B843-41B3-A1F1-B4E90E041613",
    "DataProviderID": 1,
    "OperatorID": 23,
    "OperatorsReference": "45834",
    "UsageTypeID": 4,
    "AddressInfo": {
        "ID": 109676,
        "Title": "Home2 Suites By Hilton Oklahoma City Airport",
        "AddressLine1": "4311 SW 15th St",
        "Town": "Oklahoma City",
        "StateOrProvince": "Oklahoma",
        "Postcode": "73108",
        "CountryID": 2,
        "Latitude": 35.447737,
        "Longitude": -97.596021,
        "ContactTelephone1": "(405) 604-5439",
        "DistanceUnit": 0
    },
    "Connections": [
        {
            "ID": 154448,
            "ConnectionTypeID": 30,
            "StatusTypeID": 50,
            "LevelID": 2,
            "PowerKW": 16,
            "CurrentTypeID": 20,
            "Quantity": 2
        }
    ],
    "NumberOfPoints": 2,
    "GeneralComments": "2 Tesla Connectors, up to 16kW.Available for customers. Please see front desk.",
    "StatusTypeID": 50,
    "DateLastStatusUpdate": "2018-10-11T14:25:00Z",
    "DataQualityLevel": 1,
    "DateCreated": "2018-10-11T14:25:00Z",
    "SubmissionStatusTypeID": 200
}