{
    "IsRecentlyVerified": false,
    "ID": 94891,
    "UUID": "42218B78-996C-4D67-9B2B-FA1841D154B3",
    "DataProviderID": 1,
    "DataProvidersReference": "4309",
    "AddressInfo": {
        "ID": 95237,
        "Title": "Marknadsplatsen",
        "AddressLine1": "Boråsvägen 6",
        "Town": "ULRICEHAMN",
        "StateOrProvince": "VÄSTRA GÖTALAND",
        "Postcode": "52336",
        "CountryID": 216,
        "Latitude": 57.79584,
        "Longitude": 13.41451,
        "AccessComments": "Parkeringen vid Sparbanken, utanför sibylla och radiocentralen.",
        "DistanceUnit": 0
    },
    "Connections": [
        {
            "ID": 134178,
            "ConnectionTypeID": 0,
            "Reference": "1",
            "LevelID": 2,
            "Amps": 32,
            "Voltage": 400,
            "PowerKW": 22,
            "Comments": "Mode 3"
        },
        {
            "ID": 134179,
            "ConnectionTypeID": 0,
            "Reference": "2",
            "LevelID": 2,
            "Amps": 32,
            "Voltage": 230,
            "PowerKW": 7.4,
            "Comments": "Mode 3"
        }
    ],
    "NumberOfPoints": 2,
    "DateLastStatusUpdate": "2020-05-26T08:21:00Z",
    "DataQualityLevel": 2,
    "DateCreated": "2017-10-28T13:36:00Z",
    "SubmissionStatusTypeID": 100
}