{
    "IsRecentlyVerified": false,
    "ID": 60600,
    "UUID": "36661F83-7FED-4437-A126-F76FB22B907F",
    "DataProviderID": 1,
    "OperatorID": 45,
    "UsageTypeID": 6,
    "AddressInfo": {
        "ID": 60946,
        "Title": "Elektro Helfrich",
        "AddressLine1": "Wallstadter Straße 4",
        "Town": "Viernheim",
        "StateOrProvince": "Kreis Bergstraße",
        "Postcode": "68519",
        "CountryID": 87,
        "Latitude": 49.53511,
        "Longitude": 8.584699999999998,
        "ContactTelephone1": "+49 6204 9655-0",
        "RelatedURL": "http://www.helfrich.de/",
        "DistanceUnit": 0
    },
    "Connections": [
        {
            "ID": 76802,
            "ConnectionTypeID": 25,
            "StatusTypeID": 50,
            "LevelID": 2,
            "Amps": 32,
            "Voltage": 400,
            "PowerKW": 22,
            "CurrentTypeID": 20,
            "Quantity": 1
        }
    ],
    "NumberOfPoints": 1,
    "StatusTypeID": 50,
    "DateLastStatusUpdate": "2016-02-04T07:06:00Z",
    "DataQualityLevel": 1,
    "DateCreated": "2016-02-04T07:06:00Z",
    "SubmissionStatusTypeID": 200
}