{
    "IsRecentlyVerified": false,
    "ID": 75146,
    "UUID": "4E825F41-1465-457D-BD16-3AC3054EA5CB",
    "DataProviderID": 1,
    "OperatorID": 220,
    "OperatorsReference": "3544,3544,3545",
    "UsageTypeID": 4,
    "UsageCost": "€1.73 + €0.3213/kWh; Andere Tarife möglich",
    "AddressInfo": {
        "ID": 75492,
        "Title": "Cafe Nuestro",
        "AddressLine1": "Heinrich-Barth-Straße 18",
        "Town": "Hamburg",
        "StateOrProvince": "Hamburg",
        "Postcode": "20146",
        "CountryID": 87,
        "Latitude": 53.57150995588676,
        "Longitude": 9.981282974204987,
        "AccessComments": "24/7 nutzbar in einer Einbahnstraße; ein Haus hinter dem Cafe Nuestro.",
        "DistanceUnit": 0
    },
    "Connections": [
        {
            "ID": 108379,
            "ConnectionTypeID": 25,
            "StatusTypeID": 50,
            "LevelID": 2,
            "Amps": 32,
            "Voltage": 400,
            "PowerKW": 22,
            "CurrentTypeID": 20,
            "Quantity": 2
        },
        {
            "ID": 108380,
            "ConnectionTypeID": 28,
            "StatusTypeID": 50,
            "LevelID": 2,
            "Amps": 16,
            "Voltage": 230,
            "PowerKW": 3.7,
            "CurrentTypeID": 10,
            "Quantity": 2
        }
    ],
    "NumberOfPoints": 2,
    "StatusTypeID": 50,
    "DateLastStatusUpdate": "2017-04-20T23:24:00Z",
    "DataQualityLevel": 1,
    "DateCreated": "2016-12-12T11:36:00Z",
    "SubmissionStatusTypeID": 200
}