{
    "IsRecentlyVerified": false,
    "ID": 113139,
    "UUID": "51361F91-51CD-4364-97AE-04EC5E0521C0",
    "DataProviderID": 2,
    "DataProvidersReference": "104244",
    "UsageTypeID": 2,
    "AddressInfo": {
        "ID": 113485,
        "Title": "Summit City Chevrolet",
        "AddressLine1": "5000 Illinois Rd",
        "Town": "Fort Wayne",
        "StateOrProvince": "IN",
        "Postcode": "46804",
        "CountryID": 2,
        "Latitude": 41.075696,
        "Longitude": -85.209291,
        "ContactTelephone1": "260-255-6915",
        "AccessComments": "Dealership business hours",
        "RelatedURL": "",
        "DistanceUnit": 0
    },
    "Connections": [
        {
            "ID": 159313,
            "ConnectionTypeID": 1,
            "LevelID": 2,
            "Amps": 16,
            "Voltage": 230,
            "PowerKW": 3.7,
            "CurrentTypeID": 10,
            "Quantity": 1
        }
    ],
    "DateLastStatusUpdate": "2020-06-26T03:04:00Z",
    "DataQualityLevel": 3,
    "DateCreated": "2018-11-28T02:04:00Z",
    "SubmissionStatusTypeID": 100
}