{
    "IsRecentlyVerified": false,
    "ID": 75270,
    "UUID": "42B538D6-0978-423C-B4E0-68BC95C69386",
    "DataProviderID": 1,
    "OperatorID": 23,
    "OperatorsReference": "8258",
    "UsageTypeID": 4,
    "UsageCost": "€0.25/kWh; aner Tariffer fir al Autoen",
    "AddressInfo": {
        "ID": 75616,
        "Title": "Mënsbech Supercharger",
        "AddressLine1": "11 Rue Gabriel Lippmann",
        "Town": "Mënsbech",
        "Postcode": "5365",
        "CountryID": 132,
        "Latitude": 49.640815,
        "Longitude": 6.270681,
        "DistanceUnit": 0
    },
    "Connections": [
        {
            "ID": 108575,
            "ConnectionTypeID": 27,
            "StatusTypeID": 50,
            "LevelID": 3,
            "PowerKW": 120,
            "CurrentTypeID": 30,
            "Quantity": 4
        }
    ],
    "NumberOfPoints": 4,
    "GeneralComments": "4 Superchargers, available 24/7",
    "StatusTypeID": 50,
    "DateLastStatusUpdate": "2019-03-22T20:56:00Z",
    "DataQualityLevel": 1,
    "DateCreated": "2016-12-14T16:39:00Z",
    "SubmissionStatusTypeID": 200
}