{
    "IsRecentlyVerified": false,
    "ID": 179744,
    "UUID": "E93F4E46-819A-4786-9F9C-132BF7ABB69A",
    "DataProviderID": 29,
    "DataProvidersReference": "20885",
    "AddressInfo": {
        "ID": 180103,
        "Title": "Bertha von Suttner Platz 8",
        "AddressLine1": "Bertha von Suttner Platz 8",
        "Town": "Bonn",
        "Postcode": "53111",
        "CountryID": 87,
        "Latitude": 50.737311,
        "Longitude": 7.102781,
        "DistanceUnit": 0
    },
    "Connections": [
        {
            "ID": 281954,
            "ConnectionTypeID": 28,
            "StatusTypeID": 50,
            "LevelID": 2,
            "PowerKW": 22,
            "CurrentTypeID": 20
        },
        {
            "ID": 281955,
            "ConnectionTypeID": 25,
            "StatusTypeID": 50,
            "LevelID": 2,
            "PowerKW": 22,
            "CurrentTypeID": 20
        },
        {
            "ID": 281956,
            "ConnectionTypeID": 28,
            "StatusTypeID": 50,
            "LevelID": 2,
            "PowerKW": 22,
            "CurrentTypeID": 20
        },
        {
            "ID": 298078,
            "ConnectionTypeID": 25,
            "StatusTypeID": 50,
            "LevelID": 2,
            "PowerKW": 22,
            "CurrentTypeID": 20
        }
    ],
    "StatusTypeID": 50,
    "DateLastStatusUpdate": "2021-07-12T02:45:00Z",
    "MetadataValues": [
        {
            "ID": 12038,
            "MetadataFieldID": 4,
            "ItemValue": "Data from the German chargepoint registry provided by Bundesnetzagentur.de under the CC-BY 4.0 license"
        }
    ],
    "DataQualityLevel": 3,
    "DateCreated": "2021-07-08T09:59:00Z",
    "SubmissionStatusTypeID": 100
}