{
    "IsRecentlyVerified": false,
    "ID": 103628,
    "UUID": "3A5D44F0-1240-4861-8889-62EDF2231193",
    "DataProviderID": 1,
    "OperatorID": 23,
    "OperatorsReference": "42782",
    "UsageTypeID": 4,
    "AddressInfo": {
        "ID": 103974,
        "Title": "Northcote Hotel",
        "AddressLine1": "Northcote Road",
        "Town": "Langho",
        "Postcode": "BB6 8BE",
        "CountryID": 1,
        "Latitude": 53.809178,
        "Longitude": -2.447541,
        "ContactTelephone1": "+44 125 424 4500",
        "DistanceUnit": 0
    },
    "Connections": [
        {
            "ID": 146298,
            "ConnectionTypeID": 30,
            "StatusTypeID": 50,
            "LevelID": 2,
            "Amps": 32,
            "Voltage": 230,
            "PowerKW": 13,
            "CurrentTypeID": 20,
            "Quantity": 1
        }
    ],
    "NumberOfPoints": 1,
    "GeneralComments": "1 Tesla Connector, up to 13kW.Available for customers. Please call ahead.",
    "StatusTypeID": 50,
    "DateLastStatusUpdate": "2018-10-03T17:00:00Z",
    "DataQualityLevel": 1,
    "DateCreated": "2018-05-05T05:44:00Z",
    "SubmissionStatusTypeID": 200
}