{
    "IsRecentlyVerified": false,
    "ID": 158730,
    "UUID": "6E11EA76-9372-4F4C-B5DE-83D68256200C",
    "DataProviderID": 2,
    "DataProvidersReference": "152940",
    "OperatorID": 89,
    "UsageTypeID": 1,
    "AddressInfo": {
        "ID": 159087,
        "Title": "11677 San Vicente Blvd",
        "AddressLine1": "11677 San Vicente Blvd",
        "Town": "Santa Monica",
        "StateOrProvince": "CA",
        "Postcode": "90402",
        "CountryID": 2,
        "Latitude": 34.053909,
        "Longitude": -118.465171,
        "ContactTelephone1": "888-356-8911",
        "AccessComments": "24 hours daily",
        "RelatedURL": "https://flo.ca/",
        "DistanceUnit": 0
    },
    "Connections": [
        {
            "ID": 228755,
            "ConnectionTypeID": 1,
            "LevelID": 2,
            "Amps": 16,
            "Voltage": 230,
            "PowerKW": 3.7,
            "CurrentTypeID": 10,
            "Quantity": 1
        }
    ],
    "StatusTypeID": 50,
    "DateLastStatusUpdate": "2020-06-26T02:56:00Z",
    "DataQualityLevel": 3,
    "DateCreated": "2020-06-26T02:56:00Z",
    "SubmissionStatusTypeID": 100
}