{
    "IsRecentlyVerified": false,
    "ID": 73580,
    "UUID": "E3A0AB6B-613F-4C83-A3BE-FB49AA741C2A",
    "DataProviderID": 1,
    "OperatorID": 89,
    "OperatorsReference": "AAA-363",
    "UsageTypeID": 4,
    "UsageCost": "CAD 1.00/hour",
    "AddressInfo": {
        "ID": 73926,
        "Title": "Centre Commercial Rivière-du-Loup",
        "AddressLine1": "298 Boulevard Armand-Thériault",
        "Town": "Rivière-du-Loup",
        "StateOrProvince": "QC",
        "Postcode": "G5R 4C2",
        "CountryID": 44,
        "Latitude": 47.825851,
        "Longitude": -69.54944,
        "DistanceUnit": 0
    },
    "Connections": [
        {
            "ID": 105869,
            "ConnectionTypeID": 1,
            "StatusTypeID": 50,
            "LevelID": 2,
            "Amps": 32,
            "Voltage": 230,
            "PowerKW": 7,
            "CurrentTypeID": 10,
            "Quantity": 1
        }
    ],
    "NumberOfPoints": 1,
    "StatusTypeID": 50,
    "DateLastStatusUpdate": "2017-01-22T19:17:00Z",
    "DataQualityLevel": 1,
    "DateCreated": "2016-11-23T22:18:00Z",
    "SubmissionStatusTypeID": 200
}