{
    "IsRecentlyVerified": false,
    "ID": 99830,
    "UUID": "60193935-6BD2-4C40-90BB-F854EAE4C975",
    "DataProviderID": 1,
    "OperatorID": 23,
    "OperatorsReference": "40396",
    "UsageTypeID": 4,
    "AddressInfo": {
        "ID": 100176,
        "Title": "Festsaal Bergen",
        "AddressLine1": "Weissachener Strasse 21",
        "Town": "Bergen",
        "Postcode": "83346",
        "CountryID": 87,
        "Latitude": 47.806801,
        "Longitude": 12.585609,
        "ContactTelephone1": "+49 8662 48850",
        "DistanceUnit": 0
    },
    "Connections": [
        {
            "ID": 141047,
            "ConnectionTypeID": 30,
            "StatusTypeID": 50,
            "LevelID": 2,
            "Amps": 32,
            "Voltage": 400,
            "PowerKW": 22,
            "CurrentTypeID": 20,
            "Quantity": 1
        }
    ],
    "NumberOfPoints": 1,
    "GeneralComments": "1 Tesla Connector, up to 22kW.Available to the public. Self park.",
    "StatusTypeID": 50,
    "DateLastStatusUpdate": "2018-10-03T18:09:00Z",
    "DataQualityLevel": 1,
    "DateCreated": "2018-02-06T06:42:00Z",
    "SubmissionStatusTypeID": 200
}