{
    "MediaItems": [
        {
            "ID": 18073,
            "ChargePointID": 125374,
            "ItemURL": "https://s3-ap-southeast-2.amazonaws.com/openchargemap/images/IT/OCM125374/OCM-125374.orig.2019041516100962.jpg",
            "ItemThumbnailURL": "https://s3-ap-southeast-2.amazonaws.com/openchargemap/images/IT/OCM125374/OCM-125374.thmb.2019041516100962.jpg",
            "Comment": "",
            "IsEnabled": true,
            "IsVideo": false,
            "IsFeaturedItem": false,
            "IsExternalResource": false,
            "User": {
                "ID": 20547,
                "Username": "HoteLLadurner"
            },
            "DateCreated": "2019-04-15T16:10:00Z"
        }
    ],
    "IsRecentlyVerified": false,
    "ID": 125374,
    "UUID": "9032E3B5-B26D-4CF2-8907-C7DE58AE4016",
    "DataProviderID": 1,
    "OperatorID": 164,
    "UsageTypeID": 6,
    "AddressInfo": {
        "ID": 125720,
        "Title": "Hotel Ladurner",
        "AddressLine1": "Orazio Gaigher 13",
        "Town": "Meran",
        "StateOrProvince": "Südtirol",
        "Postcode": "39012",
        "CountryID": 112,
        "Latitude": 46.66282914836137,
        "Longitude": 11.179537440594231,
        "ContactTelephone1": "+390473237214",
        "ContactEmail": "info@hotel-ladurner.com",
        "RelatedURL": "https://www.hotel-ladurner.com/",
        "DistanceUnit": 0
    },
    "Connections": [
        {
            "ID": 175685,
            "ConnectionTypeID": 25,
            "StatusTypeID": 50
        }
    ],
    "NumberOfPoints": 2,
    "StatusTypeID": 50,
    "DateLastStatusUpdate": "2019-04-15T16:21:00Z",
    "DataQualityLevel": 1,
    "DateCreated": "2019-04-15T16:10:00Z",
    "SubmissionStatusTypeID": 200
}