{
    "IsRecentlyVerified": false,
    "ID": 100777,
    "UUID": "440A7B6E-D18E-444C-95AE-4403017F30D9",
    "DataProviderID": 1,
    "OperatorID": 23,
    "OperatorsReference": "41351",
    "UsageTypeID": 6,
    "AddressInfo": {
        "ID": 101123,
        "Title": "Senator Cadiz Spa Hotel",
        "AddressLine1": "Calle Rubio Y Diaz",
        "Town": "Cadiz",
        "Postcode": "11004",
        "CountryID": 210,
        "Latitude": 36.532559,
        "Longitude": -6.293808,
        "ContactTelephone1": "+34 956 200 202",
        "DistanceUnit": 0
    },
    "Connections": [
        {
            "ID": 142357,
            "ConnectionTypeID": 30,
            "StatusTypeID": 50,
            "LevelID": 2,
            "Amps": 32,
            "Voltage": 230,
            "PowerKW": 17,
            "CurrentTypeID": 20,
            "Quantity": 1
        }
    ],
    "NumberOfPoints": 1,
    "GeneralComments": "1 Tesla Connector, up to 17kW.Available for customers. Please see front desk.",
    "StatusTypeID": 50,
    "DateLastStatusUpdate": "2020-08-17T12:03:00Z",
    "DataQualityLevel": 1,
    "DateCreated": "2018-03-10T06:47:00Z",
    "SubmissionStatusTypeID": 200
}