{
    "IsRecentlyVerified": false,
    "ID": 68450,
    "UUID": "454FF067-D5F5-45EB-89F5-39E494E6C976",
    "DataProviderID": 1,
    "OperatorID": 44,
    "UsageTypeID": 3,
    "AddressInfo": {
        "ID": 68796,
        "Title": "Ladepunkt Merzig",
        "AddressLine1": "Im Reichertsgrund 12",
        "AddressLine2": "Besseringen",
        "Town": "Merzig",
        "StateOrProvince": "Landkreis Merzig-Wadern",
        "Postcode": "66663",
        "CountryID": 87,
        "Latitude": 49.4789413,
        "Longitude": 6.6086881999999605,
        "ContactTelephone1": "+491793954742",
        "AccessComments": "Rund um die Uhr (24/7) nutzbar. Private BMW Wallbox am Haus, einphasig Laden mit 4.6kW. Bitte vorher anrufen oder auf gut Glueck klingeln.\r\n",
        "DistanceUnit": 0
    },
    "Connections": [
        {
            "ID": 95735,
            "ConnectionTypeID": 25,
            "StatusTypeID": 50,
            "LevelID": 2,
            "Amps": 20,
            "Voltage": 230,
            "PowerKW": 4.6,
            "CurrentTypeID": 10,
            "Quantity": 1
        }
    ],
    "NumberOfPoints": 1,
    "StatusTypeID": 50,
    "DateLastStatusUpdate": "2016-06-07T07:58:00Z",
    "DataQualityLevel": 1,
    "DateCreated": "2016-06-07T07:58:00Z",
    "SubmissionStatusTypeID": 200
}