{
    "UserComments": [
        {
            "ID": 6519,
            "ChargePointID": 31329,
            "CommentTypeID": 10,
            "UserName": "TheScotstounPele",
            "Comment": "Charged successfully with CHAdeMO on 22nd Aug 2015",
            "DateCreated": "2015-09-19T09:39:48.73Z",
            "User": {
                "ID": 6377,
                "Username": "TheScotstounPele"
            },
            "CheckinStatusTypeID": 10
        }
    ],
    "IsRecentlyVerified": false,
    "ID": 31329,
    "UUID": "64CB877F-AFF4-4CE8-B17D-E06862C0ED54",
    "DataProviderID": 1,
    "OperatorID": 24,
    "UsageTypeID": 5,
    "UsageCost": "£0.30/kWh",
    "AddressInfo": {
        "ID": 31675,
        "Title": "Todhills Moto M6 (N) Services",
        "AddressLine1": "M6 J44/45",
        "AddressLine2": "Blackford",
        "Town": "Carlisle",
        "StateOrProvince": "Cumbria",
        "Postcode": "CA6 4HA",
        "CountryID": 1,
        "Latitude": 54.949937,
        "Longitude": -2.979631,
        "DistanceUnit": 0
    },
    "Connections": [
        {
            "ID": 34748,
            "ConnectionTypeID": 2,
            "Reference": "GB*GFX*EGS10385*2",
            "StatusTypeID": 50,
            "LevelID": 3,
            "Amps": 200,
            "Voltage": 500,
            "PowerKW": 60,
            "CurrentTypeID": 30,
            "Quantity": 1
        },
        {
            "ID": 34749,
            "ConnectionTypeID": 33,
            "Reference": "GB*GFX*EGS10385*1",
            "StatusTypeID": 50,
            "LevelID": 3,
            "Amps": 200,
            "Voltage": 920,
            "PowerKW": 60,
            "CurrentTypeID": 30,
            "Quantity": 1
        }
    ],
    "NumberOfPoints": 2,
    "StatusTypeID": 50,
    "DateLastStatusUpdate": "2021-09-27T09:17:00Z",
    "DataQualityLevel": 1,
    "DateCreated": "2015-01-03T15:21:00Z",
    "SubmissionStatusTypeID": 200
}