{
    "MediaItems": [
        {
            "ID": 18685,
            "ChargePointID": 128254,
            "ItemURL": "https://s3-ap-southeast-2.amazonaws.com/openchargemap/images/GR/OCM128254/OCM-128254.orig.2019062014160731.jpg",
            "ItemThumbnailURL": "https://s3-ap-southeast-2.amazonaws.com/openchargemap/images/GR/OCM128254/OCM-128254.thmb.2019062014160731.jpg",
            "Comment": "",
            "IsEnabled": true,
            "IsVideo": false,
            "IsFeaturedItem": false,
            "IsExternalResource": false,
            "User": {
                "ID": 21274,
                "Username": "PAP Hotels"
            },
            "DateCreated": "2019-06-20T14:16:00Z"
        }
    ],
    "IsRecentlyVerified": false,
    "ID": 128254,
    "UUID": "C220243F-FEF6-419A-8F82-E954DB483ADC",
    "DataProviderID": 1,
    "OperatorID": 45,
    "UsageTypeID": 1,
    "AddressInfo": {
        "ID": 128600,
        "Title": "Alexander the Great beach hotel",
        "AddressLine1": "Περιμετρική Οδός Κασσάνδρας",
        "AddressLine2": "Κρυοπηγή, Κασσάνδρα",
        "Town": "Δήμος Κασσάνδρας",
        "StateOrProvince": "Δήμος Κασσάνδρας",
        "Postcode": "63077",
        "CountryID": 90,
        "Latitude": 40.05547843020065,
        "Longitude": 23.464549820776597,
        "ContactTelephone1": "2374020210",
        "ContactEmail": "alexander@papcorp.gr",
        "AccessComments": "Inside the Alexander the Great beach hotel, you will be able to find a euro-charger available 24/7. You can charge your vehicle while enjoying the facilities of the property.",
        "RelatedURL": "https://www.papcorp.com/",
        "DistanceUnit": 0
    },
    "Connections": [
        {
            "ID": 179528,
            "ConnectionTypeID": 13,
            "StatusTypeID": 50,
            "LevelID": 2
        }
    ],
    "NumberOfPoints": 1,
    "StatusTypeID": 50,
    "DateLastStatusUpdate": "2019-06-20T23:36:00Z",
    "DataQualityLevel": 1,
    "DateCreated": "2019-06-20T08:13:00Z",
    "SubmissionStatusTypeID": 200
}