{
    "IsRecentlyVerified": false,
    "ID": 186525,
    "UUID": "EBB246C7-F859-497F-B988-CFE94C78A42C",
    "DataProviderID": 29,
    "DataProvidersReference": "2325",
    "OperatorID": 105,
    "AddressInfo": {
        "ID": 186884,
        "Title": "Brigittastraße 41",
        "AddressLine1": "Brigittastraße 41",
        "Town": "Essen",
        "Postcode": "45130",
        "CountryID": 87,
        "Latitude": 51.438816,
        "Longitude": 7.011044,
        "DistanceUnit": 0
    },
    "Connections": [
        {
            "ID": 299380,
            "ConnectionTypeID": 25,
            "StatusTypeID": 50,
            "LevelID": 2,
            "PowerKW": 22,
            "CurrentTypeID": 20
        },
        {
            "ID": 299381,
            "ConnectionTypeID": 25,
            "StatusTypeID": 50,
            "LevelID": 2,
            "PowerKW": 22,
            "CurrentTypeID": 20
        }
    ],
    "StatusTypeID": 50,
    "DateLastStatusUpdate": "2021-07-12T02:47:00Z",
    "MetadataValues": [
        {
            "ID": 18766,
            "MetadataFieldID": 4,
            "ItemValue": "Data from the German chargepoint registry provided by Bundesnetzagentur.de under the CC-BY 4.0 license"
        }
    ],
    "DataQualityLevel": 3,
    "DateCreated": "2021-07-12T02:47:00Z",
    "SubmissionStatusTypeID": 100
}