{
    "IsRecentlyVerified": false,
    "ID": 124803,
    "UUID": "C136D8E7-B503-4937-8563-BB753A5BD762",
    "DataProviderID": 2,
    "DataProvidersReference": "49370",
    "OperatorID": 5,
    "UsageTypeID": 1,
    "AddressInfo": {
        "ID": 125149,
        "Title": "NEPTUNE TWP BOE",
        "AddressLine1": "1 Summerfied Ln",
        "Town": "Neptune City",
        "StateOrProvince": "NJ",
        "Postcode": "07753",
        "CountryID": 2,
        "Latitude": 40.2108421,
        "Longitude": -74.0651627,
        "ContactTelephone1": "888-758-4389",
        "AccessComments": "24 hours daily",
        "RelatedURL": "http://www.chargepoint.com/",
        "DistanceUnit": 0
    },
    "Connections": [
        {
            "ID": 174954,
            "ConnectionTypeID": 1,
            "LevelID": 2,
            "Amps": 16,
            "Voltage": 230,
            "PowerKW": 3,
            "CurrentTypeID": 10,
            "Quantity": 2
        }
    ],
    "DateLastStatusUpdate": "2019-04-06T05:04:00Z",
    "DataQualityLevel": 3,
    "DateCreated": "2019-04-06T05:04:00Z",
    "SubmissionStatusTypeID": 100
}