{
    "IsRecentlyVerified": false,
    "ID": 170525,
    "UUID": "86907AB9-84A2-4772-AE91-4F697698D4C2",
    "DataProviderID": 1,
    "OperatorID": 3327,
    "UsageTypeID": 4,
    "AddressInfo": {
        "ID": 170884,
        "Title": "BeCharge Castello di Godego Fermi",
        "AddressLine1": "Via Enrico Fermi, 2",
        "Town": "Castello di Godego",
        "StateOrProvince": "TV",
        "Postcode": "31030",
        "CountryID": 112,
        "Latitude": 45.690769258875406,
        "Longitude": 11.878433178530713,
        "ContactTelephone1": "02-49527730",
        "ContactEmail": "emobility@buildingenergy.it",
        "RelatedURL": "https://www.bec.energy/",
        "DistanceUnit": 0
    },
    "Connections": [
        {
            "ID": 260289,
            "ConnectionTypeID": 25,
            "StatusTypeID": 50,
            "LevelID": 2,
            "Amps": 32,
            "Voltage": 400,
            "PowerKW": 22,
            "CurrentTypeID": 20,
            "Quantity": 2
        }
    ],
    "NumberOfPoints": 2,
    "StatusTypeID": 50,
    "DateLastStatusUpdate": "2020-11-30T16:02:00Z",
    "DataQualityLevel": 1,
    "DateCreated": "2020-11-30T16:02:00Z",
    "SubmissionStatusTypeID": 200
}