{
    "IsRecentlyVerified": false,
    "ID": 68957,
    "UUID": "3EC7C0C3-B1CB-4BD2-A1A2-F0D9AA943D13",
    "DataProviderID": 1,
    "DataProvidersReference": "3387",
    "AddressInfo": {
        "ID": 69303,
        "Title": "Bee Enköping / Dinners",
        "AddressLine1": "Grusgatan 2",
        "Town": "ENKÖPING",
        "StateOrProvince": "UPPSALA",
        "Postcode": "74539",
        "CountryID": 216,
        "Latitude": 59.65809,
        "Longitude": 17.07717,
        "AccessComments": "Vid Dinners, Enköping.",
        "DistanceUnit": 0
    },
    "Connections": [
        {
            "ID": 96720,
            "ConnectionTypeID": 0,
            "Reference": "1",
            "LevelID": 2,
            "Amps": 100,
            "Voltage": 500,
            "PowerKW": 50,
            "Comments": "Mode 4"
        },
        {
            "ID": 96721,
            "ConnectionTypeID": 0,
            "Reference": "2",
            "LevelID": 2,
            "Amps": 100,
            "Voltage": 500,
            "PowerKW": 50,
            "Comments": "Mode 4"
        },
        {
            "ID": 96722,
            "ConnectionTypeID": 0,
            "Reference": "3",
            "LevelID": 2,
            "Amps": 63,
            "Voltage": 400,
            "PowerKW": 43,
            "Comments": "Mode 3"
        }
    ],
    "NumberOfPoints": 3,
    "DateLastStatusUpdate": "2020-05-26T08:23:00Z",
    "DataQualityLevel": 2,
    "DateCreated": "2016-06-25T03:52:00Z",
    "SubmissionStatusTypeID": 100
}