{
    "IsRecentlyVerified": false,
    "ID": 113043,
    "UUID": "DD7F0E37-1354-4538-B3CE-9F6C1B52EDB2",
    "DataProviderID": 2,
    "DataProvidersReference": "104308",
    "UsageTypeID": 1,
    "AddressInfo": {
        "ID": 113389,
        "Title": "Town of Elkin - Recreation Center",
        "AddressLine1": "399 NC Highway 268 W",
        "Town": "Elkin",
        "StateOrProvince": "NC",
        "Postcode": "28621",
        "CountryID": 2,
        "Latitude": 36.247855,
        "Longitude": -80.855906,
        "ContactTelephone1": "336-258-8917",
        "AccessComments": "7am-10pm daily",
        "RelatedURL": "",
        "DistanceUnit": 0
    },
    "Connections": [
        {
            "ID": 159202,
            "ConnectionTypeID": 1,
            "LevelID": 2,
            "Amps": 16,
            "Voltage": 230,
            "PowerKW": 3,
            "CurrentTypeID": 10,
            "Quantity": 2
        }
    ],
    "DateLastStatusUpdate": "2019-04-06T04:02:00Z",
    "DataQualityLevel": 3,
    "DateCreated": "2018-11-28T02:04:00Z",
    "SubmissionStatusTypeID": 100
}