{
    "IsRecentlyVerified": false,
    "ID": 70075,
    "UUID": "995E5BB9-B109-4E29-8BC1-253A2FAD70EF",
    "DataProviderID": 1,
    "OperatorID": 1,
    "UsageTypeID": 1,
    "UsageCost": "Pay via SMS",
    "AddressInfo": {
        "ID": 70421,
        "Title": "Esso",
        "AddressLine1": "Postboks 37",
        "Town": "Kinsarvik",
        "Postcode": "5782",
        "CountryID": 168,
        "Latitude": 55.378051,
        "Longitude": -3.435973,
        "AccessComments": "Located at the back of the gas station.",
        "DistanceUnit": 0
    },
    "Connections": [
        {
            "ID": 99970,
            "ConnectionTypeID": 25,
            "StatusTypeID": 50,
            "LevelID": 2,
            "Amps": 32,
            "PowerKW": 22,
            "CurrentTypeID": 20,
            "Quantity": 2
        }
    ],
    "NumberOfPoints": 2,
    "StatusTypeID": 50,
    "DateLastStatusUpdate": "2016-07-06T20:48:00Z",
    "DataQualityLevel": 1,
    "DateCreated": "2016-07-06T12:52:00Z",
    "SubmissionStatusTypeID": 200
}