{
    "IsRecentlyVerified": false,
    "ID": 137621,
    "UUID": "60D3AB2D-E097-4083-AA17-9113F513F032",
    "DataProviderID": 1,
    "OperatorID": 1,
    "UsageTypeID": 1,
    "AddressInfo": {
        "ID": 137967,
        "Title": "Nima Arabia Co. Ltd. – Show Room",
        "AddressLine1": "Abu Alabbas Elkettani",
        "Town": "Amman",
        "Postcode": "11181",
        "CountryID": 116,
        "Latitude": 31.986574,
        "Longitude": 35.960562,
        "AccessComments": "24 hours daily",
        "DistanceUnit": 0
    },
    "Connections": [
        {
            "ID": 192568,
            "ConnectionTypeID": 1,
            "LevelID": 2,
            "Amps": 16,
            "Voltage": 230,
            "PowerKW": 3,
            "CurrentTypeID": 10,
            "Quantity": 1
        }
    ],
    "StatusTypeID": 50,
    "DateLastStatusUpdate": "2020-02-02T13:10:00Z",
    "DataQualityLevel": 3,
    "DateCreated": "2019-12-24T09:06:00Z",
    "SubmissionStatusTypeID": 100
}