{
    "UserComments": [
        {
            "ID": 16268,
            "ChargePointID": 84840,
            "CommentTypeID": 10,
            "UserName": "Torsten",
            "Comment": "CCS ok",
            "DateCreated": "2017-04-29T16:12:30.723Z",
            "User": {
                "ID": 4992,
                "Username": "Torsten"
            },
            "CheckinStatusTypeID": 10
        }
    ],
    "IsRecentlyVerified": false,
    "ID": 84840,
    "UUID": "E2A26C9E-F994-435C-A257-0B8C005BB88C",
    "DataProviderID": 1,
    "OperatorID": 32,
    "OperatorsReference": "24010",
    "UsageTypeID": 6,
    "UsageCost": "£0.108/kWh; for Polar Plus subscription members only",
    "AddressInfo": {
        "ID": 85186,
        "Title": "The Runnymede Hotel",
        "AddressLine1": "The First",
        "Town": "Runnymede",
        "StateOrProvince": "Surrey",
        "Postcode": "TW20 0AG",
        "CountryID": 1,
        "Latitude": 51.437183,
        "Longitude": -0.536808,
        "ContactTelephone1": "01235 535003",
        "AccessComments": "In hotel car park behind barrier. Guests only ",
        "DistanceUnit": 0
    },
    "Connections": [
        {
            "ID": 120552,
            "ConnectionTypeID": 2,
            "StatusTypeID": 50,
            "LevelID": 3,
            "Amps": 125,
            "Voltage": 400,
            "PowerKW": 50,
            "CurrentTypeID": 30,
            "Quantity": 1
        },
        {
            "ID": 120553,
            "ConnectionTypeID": 1036,
            "StatusTypeID": 50,
            "LevelID": 3,
            "Amps": 63,
            "Voltage": 400,
            "PowerKW": 43,
            "CurrentTypeID": 20,
            "Quantity": 1
        },
        {
            "ID": 120554,
            "ConnectionTypeID": 33,
            "StatusTypeID": 50,
            "LevelID": 3,
            "Amps": 125,
            "Voltage": 400,
            "PowerKW": 50,
            "CurrentTypeID": 30,
            "Quantity": 1
        }
    ],
    "NumberOfPoints": 1,
    "StatusTypeID": 50,
    "DateLastStatusUpdate": "2019-06-20T05:23:00Z",
    "DataQualityLevel": 1,
    "DateCreated": "2017-03-17T16:11:00Z",
    "SubmissionStatusTypeID": 200
}