{
    "MediaItems": [
        {
            "ID": 23609,
            "ChargePointID": 162153,
            "ItemURL": "https://s3-ap-southeast-2.amazonaws.com/openchargemap/images/AT/OCM162153/OCM-162153.orig.2020080207172954.jpg",
            "ItemThumbnailURL": "https://s3-ap-southeast-2.amazonaws.com/openchargemap/images/AT/OCM162153/OCM-162153.thmb.2020080207172954.jpg",
            "Comment": "",
            "IsEnabled": true,
            "IsVideo": false,
            "IsFeaturedItem": false,
            "IsExternalResource": false,
            "User": {
                "ID": 26760,
                "Username": "interssl.com"
            },
            "DateCreated": "2020-08-02T07:18:00Z"
        },
        {
            "ID": 23610,
            "ChargePointID": 162153,
            "ItemURL": "https://s3-ap-southeast-2.amazonaws.com/openchargemap/images/AT/OCM162153/OCM-162153.orig.2020080207173844.jpg",
            "ItemThumbnailURL": "https://s3-ap-southeast-2.amazonaws.com/openchargemap/images/AT/OCM162153/OCM-162153.thmb.2020080207173844.jpg",
            "Comment": "",
            "IsEnabled": true,
            "IsVideo": false,
            "IsFeaturedItem": false,
            "IsExternalResource": false,
            "User": {
                "ID": 26760,
                "Username": "interssl.com"
            },
            "DateCreated": "2020-08-02T07:18:00Z"
        },
        {
            "ID": 23611,
            "ChargePointID": 162153,
            "ItemURL": "https://s3-ap-southeast-2.amazonaws.com/openchargemap/images/AT/OCM162153/OCM-162153.orig.2020080207175043.jpg",
            "ItemThumbnailURL": "https://s3-ap-southeast-2.amazonaws.com/openchargemap/images/AT/OCM162153/OCM-162153.thmb.2020080207175043.jpg",
            "Comment": "",
            "IsEnabled": true,
            "IsVideo": false,
            "IsFeaturedItem": false,
            "IsExternalResource": false,
            "User": {
                "ID": 26760,
                "Username": "interssl.com"
            },
            "DateCreated": "2020-08-02T07:18:00Z"
        }
    ],
    "IsRecentlyVerified": false,
    "ID": 162153,
    "UUID": "E81FB2F3-34BC-4BA1-AB4C-BD0FB72CB11C",
    "DataProviderID": 1,
    "OperatorID": 3261,
    "UsageTypeID": 1,
    "UsageCost": "paid",
    "AddressInfo": {
        "ID": 162510,
        "Title": "Gemeinde Kramsach",
        "AddressLine1": "Zentrum",
        "AddressLine2": "Wittberg",
        "Town": "Gemeinde Kramsach",
        "StateOrProvince": "Tirol",
        "Postcode": "6233",
        "CountryID": 19,
        "Latitude": 47.448272253879594,
        "Longitude": 11.883231796731025,
        "RelatedURL": "https://www.stww.at/",
        "DistanceUnit": 0
    },
    "Connections": [
        {
            "ID": 233364,
            "ConnectionTypeID": 25,
            "StatusTypeID": 50,
            "LevelID": 2,
            "Amps": 32,
            "PowerKW": 22,
            "CurrentTypeID": 20,
            "Quantity": 2
        }
    ],
    "NumberOfPoints": 2,
    "StatusTypeID": 50,
    "DateLastStatusUpdate": "2020-08-04T09:47:00Z",
    "DataQualityLevel": 1,
    "DateCreated": "2020-08-02T07:17:00Z",
    "SubmissionStatusTypeID": 200
}