{
    "IsRecentlyVerified": false,
    "ID": 18405,
    "UUID": "FC9BEB33-09B2-47B8-8D96-FE0113EB57E2",
    "DataProviderID": 1,
    "OperatorID": 20,
    "OperatorsReference": "60144,60145",
    "UsageTypeID": 4,
    "UsageCost": "Free",
    "AddressInfo": {
        "ID": 18750,
        "Title": "Walkden Gateway",
        "AddressLine1": "2 Smith Street",
        "Town": "Salford",
        "Postcode": "M28 3EZ",
        "CountryID": 1,
        "Latitude": 53.5248904,
        "Longitude": -2.3986003,
        "DistanceUnit": 0
    },
    "Connections": [
        {
            "ID": 18627,
            "ConnectionTypeID": 25,
            "StatusTypeID": 50,
            "LevelID": 2,
            "Amps": 32,
            "Voltage": 230,
            "PowerKW": 7,
            "CurrentTypeID": 10,
            "Quantity": 2
        }
    ],
    "NumberOfPoints": 2,
    "StatusTypeID": 50,
    "DateLastStatusUpdate": "2017-05-02T12:47:00Z",
    "DataQualityLevel": 3,
    "DateCreated": "2013-07-19T08:10:00Z",
    "SubmissionStatusTypeID": 200
}