{
    "IsRecentlyVerified": false,
    "ID": 33066,
    "UUID": "4B4B999B-4CE4-4236-B107-B3E279A86C8D",
    "DataProviderID": 1,
    "OperatorID": 105,
    "OperatorsReference": "Essent EM-DE-05913000-11-00004",
    "UsageTypeID": 4,
    "AddressInfo": {
        "ID": 33412,
        "Title": "Volksgartenstraße 19",
        "AddressLine1": "Volksgartenstraße 19",
        "Town": "Dortmund",
        "Postcode": "44388",
        "CountryID": 87,
        "Latitude": 51.502654,
        "Longitude": 7.333715,
        "DistanceUnit": 0
    },
    "Connections": [
        {
            "ID": 36577,
            "ConnectionTypeID": 25,
            "LevelID": 2,
            "PowerKW": 11
        },
        {
            "ID": 46655,
            "ConnectionTypeID": 25,
            "LevelID": 2,
            "PowerKW": 11
        }
    ],
    "NumberOfPoints": 1,
    "StatusTypeID": 50,
    "DateLastStatusUpdate": "2015-04-13T14:48:00Z",
    "DataQualityLevel": 3,
    "DateCreated": "2015-01-09T06:04:00Z",
    "SubmissionStatusTypeID": 200
}