{
    "IsRecentlyVerified": false,
    "ID": 71055,
    "UUID": "0F93DDB5-89BA-481F-86F9-B43A79CC00CE",
    "DataProviderID": 1,
    "OperatorID": 220,
    "OperatorsReference": "3014,3014,3015",
    "UsageTypeID": 4,
    "UsageCost": "€1.73 + €0.3213/kWh; Andere Tarife möglich",
    "AddressInfo": {
        "ID": 71401,
        "Title": "Waldweg",
        "AddressLine1": "Waldweg 4",
        "Town": "Hamburg",
        "StateOrProvince": "Hamburg",
        "Postcode": "22393",
        "CountryID": 87,
        "Latitude": 53.6534359,
        "Longitude": 10.11414769999999,
        "AccessComments": "24/7 nutzbar mit Ladekarten von Hamburg Energie, Vattenfall, SUN, The New Motion, Charge&Fuel, PlugSurfing u.a. sowie SMS Direct Pay.",
        "DistanceUnit": 0
    },
    "Connections": [
        {
            "ID": 101815,
            "ConnectionTypeID": 25,
            "StatusTypeID": 50,
            "LevelID": 2,
            "Amps": 32,
            "Voltage": 400,
            "PowerKW": 22,
            "CurrentTypeID": 20,
            "Quantity": 2
        },
        {
            "ID": 101816,
            "ConnectionTypeID": 28,
            "StatusTypeID": 50,
            "LevelID": 2,
            "Amps": 16,
            "Voltage": 230,
            "PowerKW": 3.7,
            "CurrentTypeID": 10,
            "Quantity": 2
        }
    ],
    "NumberOfPoints": 2,
    "StatusTypeID": 50,
    "DateLastStatusUpdate": "2017-04-20T23:17:00Z",
    "DataQualityLevel": 1,
    "DateCreated": "2016-08-24T07:15:00Z",
    "SubmissionStatusTypeID": 200
}