{
    "IsRecentlyVerified": false,
    "ID": 115851,
    "UUID": "7879E2E3-C444-4861-BA6C-9C8EC47594D6",
    "DataProviderID": 2,
    "DataProvidersReference": "115322",
    "OperatorID": 23,
    "UsageTypeID": 1,
    "AddressInfo": {
        "ID": 116197,
        "Title": "Unusual Junction - Tesla Destination",
        "AddressLine1": "56310 US 36",
        "Town": "West Lafayette",
        "StateOrProvince": "OH",
        "Postcode": "43845",
        "CountryID": 2,
        "Latitude": 40.287966,
        "Longitude": -81.703106,
        "ContactTelephone1": "740-545-9772  877-798-3752",
        "AccessComments": "24 hours daily; for customer use only",
        "RelatedURL": "https://www.tesla.com/destination-charging",
        "DistanceUnit": 0
    },
    "Connections": [
        {
            "ID": 162893,
            "ConnectionTypeID": 30,
            "LevelID": 2,
            "Amps": 16,
            "Voltage": 230,
            "PowerKW": 3.7,
            "CurrentTypeID": 10,
            "Quantity": 3
        }
    ],
    "DateLastStatusUpdate": "2020-06-26T03:02:00Z",
    "DataQualityLevel": 3,
    "DateCreated": "2019-02-11T07:13:00Z",
    "SubmissionStatusTypeID": 100
}