{
    "IsRecentlyVerified": false,
    "ID": 33294,
    "UUID": "21C1A997-B72A-4963-B2E6-6FCED42EEB9B",
    "DataProviderID": 26,
    "DataProvidersReference": "48440",
    "OperatorID": 178,
    "OperatorsReference": "EVnetNL PNB-REE0087",
    "UsageCost": "0.00 jaarabonnement",
    "AddressInfo": {
        "ID": 33640,
        "Title": "Wijboschstraat 124",
        "AddressLine1": "Wijboschstraat 124",
        "Town": "Tilburg",
        "Postcode": "5036 BC",
        "CountryID": 159,
        "Latitude": 51.57199,
        "Longitude": 4.998371,
        "ContactTelephone1": "0800-3522365",
        "RelatedURL": "http://www.evnet.nl",
        "DistanceUnit": 0
    },
    "Connections": [
        {
            "ID": 36805,
            "ConnectionTypeID": 25,
            "LevelID": 1,
            "PowerKW": 2.3,
            "CurrentTypeID": 10
        }
    ],
    "NumberOfPoints": 1,
    "StatusTypeID": 50,
    "DateLastStatusUpdate": "2016-06-04T02:39:00Z",
    "DataQualityLevel": 3,
    "DateCreated": "2015-01-09T06:04:00Z",
    "SubmissionStatusTypeID": 100
}