{
    "IsRecentlyVerified": false,
    "ID": 110734,
    "UUID": "AB287E55-4E3E-4089-931A-520E332961D5",
    "DataProviderID": 2,
    "DataProvidersReference": "98847",
    "OperatorID": 5,
    "UsageTypeID": 1,
    "AddressInfo": {
        "ID": 111080,
        "Title": "OUTSIDE",
        "AddressLine1": "175 Freemans Bridge Rd",
        "Town": "Schenectady",
        "StateOrProvince": "NY",
        "Postcode": "12302",
        "CountryID": 2,
        "Latitude": 42.846224,
        "Longitude": -73.943511,
        "ContactTelephone1": "888-758-4389",
        "AccessComments": "24 hours daily",
        "RelatedURL": "http://www.chargepoint.com/",
        "DistanceUnit": 0
    },
    "Connections": [
        {
            "ID": 156016,
            "ConnectionTypeID": 1,
            "LevelID": 2,
            "Amps": 16,
            "Voltage": 230,
            "PowerKW": 3,
            "CurrentTypeID": 10,
            "Quantity": 2
        }
    ],
    "DateLastStatusUpdate": "2019-12-24T09:20:00Z",
    "DataQualityLevel": 3,
    "DateCreated": "2018-10-18T23:36:00Z",
    "SubmissionStatusTypeID": 100
}