{
    "IsRecentlyVerified": false,
    "ID": 44993,
    "UUID": "3D61E389-06B0-4397-9028-467041B3CBAF",
    "DataProviderID": 1,
    "OperatorID": 41,
    "AddressInfo": {
        "ID": 45339,
        "Title": "Lake View Terrace Branch LA Library",
        "AddressLine1": "12002 Osborne Ave",
        "Town": "Sylmar",
        "StateOrProvince": "California",
        "Postcode": "91342",
        "CountryID": 2,
        "Latitude": 34.27272,
        "Longitude": -118.39417,
        "RelatedURL": "http://carstations.com/423",
        "DistanceUnit": 0
    },
    "Connections": [
        {
            "ID": 55316,
            "ConnectionTypeID": 1,
            "Reference": "SPI",
            "LevelID": 1,
            "Voltage": 110,
            "CurrentTypeID": 10,
            "Quantity": 1
        }
    ],
    "NumberOfPoints": 2,
    "StatusTypeID": 0,
    "DateLastStatusUpdate": "2016-03-23T21:35:00Z",
    "DataQualityLevel": 2,
    "DateCreated": "2015-04-22T03:24:00Z",
    "SubmissionStatusTypeID": 100
}