{
    "IsRecentlyVerified": false,
    "ID": 92785,
    "UUID": "361E265B-34E8-48EB-86D5-2B83FBDBF4A1",
    "DataProviderID": 1,
    "OperatorID": 220,
    "OperatorsReference": "4574",
    "UsageTypeID": 1,
    "UsageCost": "€1.73 + €0.3213/kWh; Andere Tarife möglich",
    "AddressInfo": {
        "ID": 93131,
        "Title": "Goldtschmidtstraße 5",
        "AddressLine1": "Goldtschmidtstraße 5",
        "Town": "Harburg",
        "StateOrProvince": "Hamburg",
        "Postcode": "21073",
        "CountryID": 87,
        "Latitude": 53.45915,
        "Longitude": 9.98539,
        "DistanceUnit": 0
    },
    "Connections": [
        {
            "ID": 131410,
            "ConnectionTypeID": 25,
            "StatusTypeID": 50,
            "LevelID": 2,
            "Amps": 32,
            "Voltage": 400,
            "PowerKW": 22,
            "CurrentTypeID": 20,
            "Quantity": 2
        }
    ],
    "NumberOfPoints": 2,
    "StatusTypeID": 50,
    "DateLastStatusUpdate": "2017-09-10T14:18:00Z",
    "DataQualityLevel": 1,
    "DateCreated": "2017-09-10T14:17:00Z",
    "SubmissionStatusTypeID": 200
}