{
    "IsRecentlyVerified": false,
    "ID": 124231,
    "UUID": "CF95B48E-B029-45B8-888F-F55D11DCC930",
    "DataProviderID": 2,
    "DataProvidersReference": "82763",
    "OperatorID": 5,
    "UsageTypeID": 1,
    "AddressInfo": {
        "ID": 124577,
        "Title": "BRENTWOOD TSC",
        "AddressLine1": "8800 Brentwood Blvd",
        "Town": "Brentwood",
        "StateOrProvince": "CA",
        "Postcode": "94531",
        "CountryID": 2,
        "Latitude": 37.9239484,
        "Longitude": -121.6884994,
        "ContactTelephone1": "888-758-4389",
        "AccessComments": "24 hours daily",
        "RelatedURL": "http://www.chargepoint.com/",
        "DistanceUnit": 0
    },
    "Connections": [
        {
            "ID": 174306,
            "ConnectionTypeID": 1,
            "LevelID": 2,
            "Amps": 16,
            "Voltage": 230,
            "PowerKW": 3,
            "CurrentTypeID": 10,
            "Quantity": 2
        }
    ],
    "DateLastStatusUpdate": "2019-12-24T09:14:00Z",
    "DataQualityLevel": 3,
    "DateCreated": "2019-04-06T05:03:00Z",
    "SubmissionStatusTypeID": 100
}