{
    "IsRecentlyVerified": false,
    "ID": 85162,
    "UUID": "2C2F5352-5D3F-4BD3-93D3-8D27401BFCBB",
    "DataProviderID": 1,
    "OperatorID": 23,
    "OperatorsReference": "26052",
    "UsageTypeID": 6,
    "AddressInfo": {
        "ID": 85508,
        "Title": "Hotel Moselebauer",
        "AddressLine1": "30 Kliening",
        "Town": "Bad Sankt Leonhard",
        "Postcode": "9462",
        "CountryID": 19,
        "Latitude": 46.955563,
        "Longitude": 14.779286,
        "ContactTelephone1": "+43 4350 2333",
        "DistanceUnit": 0
    },
    "Connections": [
        {
            "ID": 120924,
            "ConnectionTypeID": 30,
            "StatusTypeID": 50,
            "LevelID": 2,
            "Amps": 16,
            "Voltage": 400,
            "PowerKW": 11,
            "CurrentTypeID": 20,
            "Quantity": 2
        }
    ],
    "NumberOfPoints": 2,
    "GeneralComments": "2 Tesla Connectors, up to 11kW.Available for patrons only. Please see front desk.",
    "StatusTypeID": 50,
    "DateLastStatusUpdate": "2018-10-03T22:11:00Z",
    "DataQualityLevel": 1,
    "DateCreated": "2017-03-27T05:25:00Z",
    "SubmissionStatusTypeID": 200
}