{
    "IsRecentlyVerified": false,
    "ID": 142931,
    "UUID": "24336EB3-A0CE-4C44-9B31-9CF72B72BAC9",
    "DataProviderID": 2,
    "DataProvidersReference": "150474",
    "OperatorID": 59,
    "UsageTypeID": 1,
    "AddressInfo": {
        "ID": 143283,
        "Title": "Greenlots - 53219",
        "AddressLine1": "195 US-95",
        "Town": "McDermitt",
        "StateOrProvince": "NV",
        "Postcode": "89421",
        "CountryID": 2,
        "Latitude": 41.9950904846191,
        "Longitude": -117.718254089355,
        "ContactTelephone1": "855-900-7584",
        "AccessComments": "24 hours daily",
        "RelatedURL": "http://greenlots.com/",
        "DistanceUnit": 0
    },
    "Connections": [
        {
            "ID": 199164,
            "ConnectionTypeID": 2,
            "LevelID": 3,
            "Amps": 100,
            "Voltage": 400,
            "PowerKW": 40,
            "CurrentTypeID": 30,
            "Quantity": 1
        },
        {
            "ID": 199165,
            "ConnectionTypeID": 32,
            "LevelID": 3,
            "Amps": 100,
            "Voltage": 400,
            "PowerKW": 40,
            "CurrentTypeID": 30,
            "Quantity": 1
        }
    ],
    "StatusTypeID": 50,
    "DateLastStatusUpdate": "2019-12-24T09:19:00Z",
    "DataQualityLevel": 3,
    "DateCreated": "2019-12-24T09:19:00Z",
    "SubmissionStatusTypeID": 100
}