{
    "IsRecentlyVerified": false,
    "ID": 111625,
    "UUID": "EAADCBBB-A2D9-48DD-8DB5-FE22731BF623",
    "DataProviderID": 2,
    "DataProvidersReference": "104137",
    "UsageTypeID": 1,
    "AddressInfo": {
        "ID": 111971,
        "Title": "Roosevelt Place Hotel",
        "AddressLine1": "1405 Skyline Blvd",
        "Town": "Bismarck",
        "StateOrProvince": "ND",
        "Postcode": "58503",
        "CountryID": 2,
        "Latitude": 46.854194,
        "Longitude": -100.769854,
        "ContactTelephone1": "701-751-2550",
        "AccessComments": "24 hours daily; for guest and visitor use only",
        "RelatedURL": "",
        "DistanceUnit": 0
    },
    "Connections": [
        {
            "ID": 157095,
            "ConnectionTypeID": 1,
            "LevelID": 2,
            "Amps": 16,
            "Voltage": 230,
            "PowerKW": 3.7,
            "CurrentTypeID": 10,
            "Quantity": 2
        }
    ],
    "DateLastStatusUpdate": "2020-06-26T03:10:00Z",
    "DataQualityLevel": 3,
    "DateCreated": "2018-10-18T23:37:00Z",
    "SubmissionStatusTypeID": 100
}