{
    "MediaItems": [
        {
            "ID": 17954,
            "ChargePointID": 121464,
            "ItemURL": "https://s3-ap-southeast-2.amazonaws.com/openchargemap/images/IT/OCM121464/OCM-121464.orig.2019040217333305.jpg",
            "ItemThumbnailURL": "https://s3-ap-southeast-2.amazonaws.com/openchargemap/images/IT/OCM121464/OCM-121464.thmb.2019040217333305.jpg",
            "Comment": "",
            "IsEnabled": true,
            "IsVideo": false,
            "IsFeaturedItem": false,
            "IsExternalResource": false,
            "User": {
                "ID": 19496,
                "Username": "ECOGY"
            },
            "DateCreated": "2019-04-02T17:34:00Z"
        }
    ],
    "IsRecentlyVerified": false,
    "ID": 121464,
    "UUID": "9638578D-8C6D-4138-92C0-B960D8BE1820",
    "DataProviderID": 1,
    "OperatorID": 45,
    "UsageTypeID": 4,
    "UsageCost": "0,30 Euro/ kWh",
    "AddressInfo": {
        "ID": 121810,
        "Title": "Hotel Funggashof ****",
        "AddressLine1": "Am Graben 1",
        "Town": "Naturns",
        "StateOrProvince": "BZ",
        "Postcode": "39025 ",
        "CountryID": 112,
        "Latitude": 46.6529074,
        "Longitude": 10.9983441567875,
        "ContactTelephone1": "+39 0473 667161",
        "ContactEmail": "info@funggashof.it",
        "AccessComments": "Für Hotelkunden mittels RFID Karte",
        "RelatedURL": "https://www.funggashof.it/",
        "DistanceUnit": 0
    },
    "Connections": [
        {
            "ID": 171145,
            "ConnectionTypeID": 1036,
            "StatusTypeID": 50,
            "LevelID": 2,
            "Amps": 16,
            "Voltage": 400,
            "PowerKW": 11,
            "CurrentTypeID": 20,
            "Quantity": 1
        },
        {
            "ID": 171146,
            "ConnectionTypeID": 25,
            "StatusTypeID": 50,
            "LevelID": 2,
            "Amps": 16,
            "Voltage": 400,
            "PowerKW": 11,
            "CurrentTypeID": 20,
            "Quantity": 1
        }
    ],
    "NumberOfPoints": 2,
    "GeneralComments": "Die Ladestation befindet sich auf dem Kundenparkplatz",
    "StatusTypeID": 50,
    "DateLastStatusUpdate": "2019-04-03T12:14:00Z",
    "DataQualityLevel": 1,
    "DateCreated": "2019-04-02T17:33:00Z",
    "SubmissionStatusTypeID": 200
}