{
    "IsRecentlyVerified": false,
    "ID": 31488,
    "UUID": "A5F57AA9-1E0A-459A-8AAC-7BF93613BE3C",
    "DataProviderID": 26,
    "DataProvidersReference": "58366",
    "OperatorID": 78,
    "OperatorsReference": "Essent EM-AT-00020201-04-00002",
    "UsageCost": "0.00 jaarabonnement",
    "AddressInfo": {
        "ID": 31834,
        "Title": "Bruno-Kreisky-Straße",
        "AddressLine1": "Bruno-Kreisky-Straße",
        "Town": "Villach",
        "Postcode": "9506",
        "CountryID": 19,
        "Latitude": 46.603284,
        "Longitude": 13.870447,
        "RelatedURL": "http://www.essent.nl",
        "DistanceUnit": 0
    },
    "Connections": [
        {
            "ID": 34999,
            "ConnectionTypeID": 25,
            "LevelID": 2,
            "PowerKW": 5,
            "CurrentTypeID": 10
        },
        {
            "ID": 45903,
            "ConnectionTypeID": 25,
            "LevelID": 2,
            "PowerKW": 5,
            "CurrentTypeID": 10
        },
        {
            "ID": 45904,
            "ConnectionTypeID": 25,
            "LevelID": 2,
            "PowerKW": 5,
            "CurrentTypeID": 10
        },
        {
            "ID": 45905,
            "ConnectionTypeID": 25,
            "LevelID": 2,
            "PowerKW": 5,
            "CurrentTypeID": 10
        },
        {
            "ID": 67583,
            "ConnectionTypeID": 25,
            "LevelID": 2,
            "PowerKW": 5,
            "CurrentTypeID": 10
        },
        {
            "ID": 67584,
            "ConnectionTypeID": 25,
            "LevelID": 2,
            "PowerKW": 5,
            "CurrentTypeID": 10
        }
    ],
    "NumberOfPoints": 1,
    "StatusTypeID": 50,
    "DateLastStatusUpdate": "2016-03-03T12:33:00Z",
    "DataQualityLevel": 3,
    "DateCreated": "2015-01-09T06:03:00Z",
    "SubmissionStatusTypeID": 100
}