{
    "IsRecentlyVerified": false,
    "ID": 158469,
    "UUID": "204B956E-5C36-4E37-88A9-C220DDC00B28",
    "DataProviderID": 2,
    "DataProvidersReference": "156474",
    "OperatorID": 5,
    "UsageTypeID": 1,
    "AddressInfo": {
        "ID": 158826,
        "Title": "SALESFORCE AZ",
        "AddressLine1": "2305 S Ellis St",
        "Town": "Chandler",
        "StateOrProvince": "AZ",
        "Postcode": "85286",
        "CountryID": 2,
        "Latitude": 33.27169,
        "Longitude": -111.88423,
        "ContactTelephone1": "888-758-4389",
        "AccessComments": "24 hours daily",
        "RelatedURL": "http://www.chargepoint.com/",
        "DistanceUnit": 0
    },
    "Connections": [
        {
            "ID": 228455,
            "ConnectionTypeID": 1,
            "LevelID": 2,
            "Amps": 16,
            "Voltage": 230,
            "PowerKW": 3.7,
            "CurrentTypeID": 10,
            "Quantity": 1
        }
    ],
    "StatusTypeID": 50,
    "DateLastStatusUpdate": "2020-06-26T02:55:00Z",
    "DataQualityLevel": 3,
    "DateCreated": "2020-06-26T02:55:00Z",
    "SubmissionStatusTypeID": 100
}