{
    "UserComments": [
        {
            "ID": 22307,
            "ChargePointID": 85283,
            "CommentTypeID": 10,
            "UserName": "ForumElettrico.it",
            "Comment": "Numerosi negozi nel centro commerciale ed a 15 minuti a piedi dal centro storico di Arco. Leggi la recensione completa qui > https://www.forumelettrico.it/forum/colonnina-dolomiti-energia-alperia-22kw-arco-tn-via-santa-caterina-78-t5742.html\r\n",
            "RelatedURL": "https://www.forumelettrico.it/forum/colonnina-dolomiti-energia-alperia-22kw-arco-tn-via-santa-caterina-78-t5742.html",
            "DateCreated": "2020-03-18T14:05:54.19Z",
            "User": {
                "ID": 11749,
                "Username": "ForumElettrico.it"
            },
            "CheckinStatusTypeID": 10,
            "IsActionedByEditor": false
        }
    ],
    "MediaItems": [
        {
            "ID": 21619,
            "ChargePointID": 85283,
            "ItemURL": "https://s3-ap-southeast-2.amazonaws.com/openchargemap/images/IT/OCM85283/OCM-85283.orig.2020031814061219.jpg",
            "ItemThumbnailURL": "https://s3-ap-southeast-2.amazonaws.com/openchargemap/images/IT/OCM85283/OCM-85283.thmb.2020031814061219.jpg",
            "Comment": "",
            "IsEnabled": true,
            "IsVideo": false,
            "IsFeaturedItem": false,
            "IsExternalResource": false,
            "User": {
                "ID": 11749,
                "Username": "ForumElettrico.it"
            },
            "DateCreated": "2020-03-18T14:06:00Z"
        },
        {
            "ID": 21620,
            "ChargePointID": 85283,
            "ItemURL": "https://s3-ap-southeast-2.amazonaws.com/openchargemap/images/IT/OCM85283/OCM-85283.orig.2020031814061974.jpg",
            "ItemThumbnailURL": "https://s3-ap-southeast-2.amazonaws.com/openchargemap/images/IT/OCM85283/OCM-85283.thmb.2020031814061974.jpg",
            "Comment": "",
            "IsEnabled": true,
            "IsVideo": false,
            "IsFeaturedItem": false,
            "IsExternalResource": false,
            "User": {
                "ID": 11749,
                "Username": "ForumElettrico.it"
            },
            "DateCreated": "2020-03-18T14:06:00Z"
        }
    ],
    "IsRecentlyVerified": false,
    "ID": 85283,
    "UUID": "D8FA5A2A-F784-4CF9-93BF-982D28C9BF56",
    "DataProviderID": 1,
    "OperatorID": 164,
    "UsageTypeID": 4,
    "AddressInfo": {
        "ID": 85629,
        "Title": "Supermercati Poli Arco | Neogy",
        "AddressLine1": "Via Santa Caterina, 78",
        "Town": "Arco",
        "StateOrProvince": "TN",
        "Postcode": "38062",
        "CountryID": 112,
        "Latitude": 45.9101686250772,
        "Longitude": 10.870827711751,
        "DistanceUnit": 0
    },
    "Connections": [
        {
            "ID": 121103,
            "ConnectionTypeID": 25,
            "StatusTypeID": 50,
            "LevelID": 2,
            "Amps": 32,
            "Voltage": 400,
            "PowerKW": 22,
            "CurrentTypeID": 20,
            "Quantity": 1
        },
        {
            "ID": 121104,
            "ConnectionTypeID": 36,
            "StatusTypeID": 50,
            "LevelID": 2,
            "Amps": 16,
            "Voltage": 240,
            "PowerKW": 3.3,
            "CurrentTypeID": 10,
            "Quantity": 1
        }
    ],
    "NumberOfPoints": 2,
    "GeneralComments": "\r\n",
    "StatusTypeID": 50,
    "DateLastStatusUpdate": "2020-03-18T14:06:00Z",
    "DataQualityLevel": 1,
    "DateCreated": "2017-03-31T11:00:00Z",
    "SubmissionStatusTypeID": 200
}