{
    "IsRecentlyVerified": false,
    "ID": 87562,
    "UUID": "5C791336-ED71-4512-9DA2-03B6023BBB18",
    "DataProviderID": 1,
    "OperatorID": 3,
    "OperatorsReference": "PG-81065",
    "UsageTypeID": 6,
    "UsageCost": "Free",
    "AddressInfo": {
        "ID": 87908,
        "Title": "Charles Hurst Dundonald-Hyundai",
        "AddressLine1": "Quarry Corner",
        "Town": "788 Upper Newtownards Road",
        "StateOrProvince": "County Antrim",
        "Postcode": "BT16 1UD",
        "CountryID": 1,
        "Latitude": 54.594796,
        "Longitude": -5.777648,
        "DistanceUnit": 0
    },
    "Connections": [
        {
            "ID": 124128,
            "ConnectionTypeID": 25,
            "StatusTypeID": 50,
            "LevelID": 2,
            "Amps": 32,
            "Voltage": 230,
            "PowerKW": 7,
            "CurrentTypeID": 10,
            "Quantity": 2
        }
    ],
    "NumberOfPoints": 3,
    "GeneralComments": "This is an open charge unit installed at the Charles Hurst Dundonald - Hyundai dealership in Upper Newtownards Road, Dundonald, County Antrim",
    "StatusTypeID": 50,
    "DateLastStatusUpdate": "2017-12-22T12:38:00Z",
    "DataQualityLevel": 1,
    "DateCreated": "2017-05-13T05:20:00Z",
    "SubmissionStatusTypeID": 200
}