{
    "IsRecentlyVerified": false,
    "ID": 88075,
    "UUID": "4C54A713-8454-4822-9843-DD816F6F8766",
    "DataProviderID": 1,
    "OperatorID": 23,
    "OperatorsReference": "29902",
    "UsageTypeID": 6,
    "AddressInfo": {
        "ID": 88421,
        "Title": "Cambria Hotel & Suites Columbus - Polaris",
        "AddressLine1": "9100 Lyra DR",
        "Town": "Columbus",
        "StateOrProvince": "Ohio",
        "Postcode": "43240",
        "CountryID": 2,
        "Latitude": 40.150777,
        "Longitude": -82.973907,
        "ContactTelephone1": "(330) 841-9100",
        "DistanceUnit": 0
    },
    "Connections": [
        {
            "ID": 124938,
            "ConnectionTypeID": 30,
            "StatusTypeID": 50,
            "LevelID": 2,
            "PowerKW": 13,
            "CurrentTypeID": 20,
            "Quantity": 2
        }
    ],
    "NumberOfPoints": 2,
    "GeneralComments": "2 Tesla Connectors, up to 13kW.Available for patrons only. Self park.",
    "StatusTypeID": 50,
    "DateLastStatusUpdate": "2017-05-21T05:29:00Z",
    "DataQualityLevel": 1,
    "DateCreated": "2017-05-21T05:29:00Z",
    "SubmissionStatusTypeID": 200
}