{
    "IsRecentlyVerified": false,
    "ID": 14717,
    "UUID": "532336DA-861F-4A63-99E5-B4DF1096C4C2",
    "DataProviderID": 2,
    "DataProvidersReference": "49825",
    "UsageTypeID": 1,
    "AddressInfo": {
        "ID": 14614,
        "Title": "Lee Nissan - Topsham",
        "AddressLine1": "107 Main St",
        "Town": "Topsham",
        "StateOrProvince": "ME",
        "Postcode": "04086",
        "CountryID": 2,
        "Latitude": 43.936587,
        "Longitude": -69.96565,
        "ContactTelephone1": "207-837-6512",
        "AccessComments": "Dealership business hours",
        "RelatedURL": "",
        "DistanceUnit": 0
    },
    "Connections": [
        {
            "ID": 16796,
            "ConnectionTypeID": 1,
            "LevelID": 2,
            "Amps": 16,
            "Voltage": 230,
            "PowerKW": 3.7,
            "CurrentTypeID": 10,
            "Quantity": 1
        },
        {
            "ID": 21971,
            "ConnectionTypeID": 2,
            "LevelID": 3,
            "Amps": 100,
            "Voltage": 400,
            "PowerKW": 40,
            "CurrentTypeID": 30,
            "Quantity": 1
        }
    ],
    "DateLastStatusUpdate": "2020-06-26T03:07:00Z",
    "DataQualityLevel": 3,
    "DateCreated": "2012-12-06T16:50:00Z",
    "SubmissionStatusTypeID": 100
}