{
    "UserComments": [
        {
            "ID": 13789,
            "ChargePointID": 42256,
            "CommentTypeID": 50,
            "UserName": "Hupi",
            "Comment": "Freischaltung per App nicht möglich \"Es ist ein Fehler aufgetreten\". Anruf bei Betreiber: \"Diese Telefonnummer ist uns nicht bekannt\". Zum Glück war ein Mitarbeiter der Firma vor Ort. Er schaltete uns die Säule manuell frei.",
            "Rating": 2,
            "DateCreated": "2016-07-10T10:17:42.97Z",
            "User": {
                "ID": 9510,
                "Username": "Hupi"
            },
            "CheckinStatusTypeID": 10
        }
    ],
    "MediaItems": [
        {
            "ID": 7734,
            "ChargePointID": 42256,
            "ItemURL": "https://s3-ap-southeast-2.amazonaws.com/openchargemap/images/DE/OCM42256/OCM-42256.orig.2016071010114968.jpg",
            "ItemThumbnailURL": "https://s3-ap-southeast-2.amazonaws.com/openchargemap/images/DE/OCM42256/OCM-42256.thmb.2016071010114968.jpg",
            "Comment": "",
            "IsEnabled": true,
            "IsVideo": false,
            "IsFeaturedItem": false,
            "IsExternalResource": false,
            "User": {
                "ID": 9510,
                "Username": "Hupi"
            },
            "DateCreated": "2016-07-10T10:12:00Z"
        }
    ],
    "IsRecentlyVerified": false,
    "ID": 42256,
    "UUID": "D0B53AF6-C42C-483E-AE72-5006B9B98EA4",
    "DataProviderID": 1,
    "OperatorID": 45,
    "UsageTypeID": 1,
    "AddressInfo": {
        "ID": 42602,
        "Title": "Heldele GmbH",
        "AddressLine1": "An der Helme 28",
        "AddressLine2": "Sundhausen",
        "Town": "Nordhausen",
        "StateOrProvince": "Landkreis Nordhausen",
        "Postcode": "99734",
        "CountryID": 87,
        "Latitude": 51.4746124353494,
        "Longitude": 10.8075934606354,
        "ContactTelephone1": "03631 6200",
        "ContactEmail": "info@heldele-nordhausen.de",
        "AccessComments": "Freier Zugang, PlugSurfing Keyhanger nötig.",
        "RelatedURL": "http://www.heldele-nordhausen.de",
        "DistanceUnit": 0
    },
    "Connections": [
        {
            "ID": 50801,
            "ConnectionTypeID": 25,
            "StatusTypeID": 50,
            "LevelID": 2,
            "Amps": 16,
            "Voltage": 230,
            "PowerKW": 3.7,
            "CurrentTypeID": 10,
            "Quantity": 2
        }
    ],
    "NumberOfPoints": 2,
    "StatusTypeID": 50,
    "DateLastStatusUpdate": "2016-07-10T10:18:00Z",
    "DataQualityLevel": 1,
    "DateCreated": "2015-03-04T07:21:00Z",
    "SubmissionStatusTypeID": 200
}