{
    "IsRecentlyVerified": false,
    "ID": 174335,
    "UUID": "13DE5A9B-C202-4D26-BD25-BC3D50ADF981",
    "DataProviderID": 19,
    "DataProvidersReference": "6983",
    "AddressInfo": {
        "ID": 174694,
        "Title": "Ísafjörður (N1)",
        "AddressLine1": "Hafnarstræti 21",
        "Town": "Ísafirði",
        "StateOrProvince": "Vestfirðir",
        "Postcode": "400",
        "CountryID": 105,
        "Latitude": 66.074654,
        "Longitude": -23.124407,
        "AccessComments": "",
        "DistanceUnit": 0
    },
    "Connections": [
        {
            "ID": 269882,
            "ConnectionTypeID": 25,
            "Reference": "1",
            "LevelID": 3,
            "Amps": 32,
            "Voltage": 400,
            "PowerKW": 22,
            "CurrentTypeID": 30,
            "Comments": "Mode 3"
        },
        {
            "ID": 269883,
            "ConnectionTypeID": 2,
            "Reference": "2",
            "LevelID": 3,
            "Amps": 100,
            "Voltage": 500,
            "PowerKW": 50,
            "CurrentTypeID": 30,
            "Comments": "Mode 4"
        },
        {
            "ID": 269884,
            "ConnectionTypeID": 33,
            "Reference": "3",
            "LevelID": 3,
            "Amps": 100,
            "Voltage": 500,
            "PowerKW": 50,
            "CurrentTypeID": 30,
            "Comments": "Mode 4"
        }
    ],
    "NumberOfPoints": 3,
    "StatusTypeID": 0,
    "DateLastStatusUpdate": "2021-03-24T05:12:00Z",
    "DataQualityLevel": 2,
    "DateCreated": "2021-03-24T05:12:00Z",
    "SubmissionStatusTypeID": 100
}