{
    "IsRecentlyVerified": false,
    "ID": 144316,
    "UUID": "9BB118F1-8318-455D-B565-59C04E271C96",
    "DataProviderID": 2,
    "DataProvidersReference": "129683",
    "OperatorID": 89,
    "UsageTypeID": 1,
    "AddressInfo": {
        "ID": 144668,
        "Title": "Cegep Gérald - Godin",
        "AddressLine1": "15615 boulevard Gouin Ouest",
        "Town": "Sainte-Geneviève",
        "StateOrProvince": "QC",
        "Postcode": "H9H 5K8",
        "CountryID": 44,
        "Latitude": 45.483386,
        "Longitude": -73.869282,
        "ContactTelephone1": "888-356-8911",
        "AccessComments": "24 hours daily",
        "RelatedURL": "https://flo.ca/",
        "DistanceUnit": 0
    },
    "Connections": [
        {
            "ID": 200812,
            "ConnectionTypeID": 1,
            "LevelID": 2,
            "Amps": 16,
            "Voltage": 230,
            "PowerKW": 3.7,
            "CurrentTypeID": 10,
            "Quantity": 4
        }
    ],
    "StatusTypeID": 50,
    "DateLastStatusUpdate": "2020-06-26T03:09:00Z",
    "DataQualityLevel": 3,
    "DateCreated": "2019-12-24T09:23:00Z",
    "SubmissionStatusTypeID": 100
}