{
    "IsRecentlyVerified": false,
    "ID": 148309,
    "UUID": "916C8DC4-E732-4CB7-A775-245B214DF380",
    "DataProviderID": 1,
    "OperatorID": 38,
    "UsageTypeID": 4,
    "AddressInfo": {
        "ID": 148661,
        "Title": "Lidl Kaivoksela",
        "AddressLine1": "Lidl Kaivoksela",
        "Town": "Vantaa",
        "StateOrProvince": "Southern Finland",
        "Postcode": "01610",
        "CountryID": 79,
        "Latitude": 60.261567306522124,
        "Longitude": 24.872438436575976,
        "AccessComments": "Start charging with any RFID tag",
        "DistanceUnit": 0
    },
    "Connections": [
        {
            "ID": 205903,
            "ConnectionTypeID": 33,
            "StatusTypeID": 50,
            "LevelID": 3,
            "PowerKW": 50,
            "CurrentTypeID": 30,
            "Quantity": 1
        },
        {
            "ID": 205904,
            "ConnectionTypeID": 2,
            "StatusTypeID": 50,
            "LevelID": 3,
            "PowerKW": 50,
            "CurrentTypeID": 30,
            "Quantity": 1
        },
        {
            "ID": 205905,
            "ConnectionTypeID": 1036,
            "StatusTypeID": 50,
            "LevelID": 3,
            "Amps": 64,
            "Voltage": 400,
            "PowerKW": 43,
            "CurrentTypeID": 20,
            "Quantity": 1
        }
    ],
    "NumberOfPoints": 1,
    "GeneralComments": "Open as Lind is open",
    "StatusTypeID": 50,
    "DateLastStatusUpdate": "2020-01-31T16:39:00Z",
    "DataQualityLevel": 1,
    "DateCreated": "2020-01-30T06:54:00Z",
    "SubmissionStatusTypeID": 200
}