{
    "IsRecentlyVerified": false,
    "ID": 154466,
    "UUID": "B8E82BD6-FBD0-455C-BFA1-EB5F554E78D9",
    "DataProviderID": 28,
    "DataProvidersReference": "FR*SOD*S*NPDC*250*1*_*_",
    "UsageTypeID": 5,
    "AddressInfo": {
        "ID": 154819,
        "Title": "Tressin - Mairie",
        "AddressLine1": "Rue du Stade, Tressin",
        "CountryID": 80,
        "Latitude": 50.61681,
        "Longitude": 3.193225,
        "AccessComments": "24/24 7/7 jours",
        "DistanceUnit": 0
    },
    "Connections": [
        {
            "ID": 217238,
            "ConnectionTypeID": 28,
            "StatusTypeID": 50,
            "LevelID": 2,
            "PowerKW": 22,
            "CurrentTypeID": 10
        },
        {
            "ID": 217239,
            "ConnectionTypeID": 1036,
            "StatusTypeID": 50,
            "LevelID": 2,
            "PowerKW": 22,
            "CurrentTypeID": 20
        },
        {
            "ID": 252336,
            "ConnectionTypeID": 28,
            "StatusTypeID": 50,
            "LevelID": 2,
            "PowerKW": 22,
            "CurrentTypeID": 10
        },
        {
            "ID": 252337,
            "ConnectionTypeID": 1036,
            "StatusTypeID": 50,
            "LevelID": 2,
            "PowerKW": 22,
            "CurrentTypeID": 20
        }
    ],
    "GeneralComments": "\"Type charge indiquée selon décret de 2017",
    "StatusTypeID": 50,
    "DateLastStatusUpdate": "2020-08-27T05:16:00Z",
    "DataQualityLevel": 2,
    "DateCreated": "2020-03-15T10:55:00Z",
    "SubmissionStatusTypeID": 100
}