{
    "IsRecentlyVerified": false,
    "ID": 112157,
    "UUID": "A562BA59-BD08-408A-8963-B7E4A849C805",
    "DataProviderID": 2,
    "DataProvidersReference": "83987",
    "UsageTypeID": 1,
    "AddressInfo": {
        "ID": 112503,
        "Title": "Rosebud Country Inn",
        "AddressLine1": "111 2nd Ave E",
        "Town": "Rosebud",
        "StateOrProvince": "AB",
        "Postcode": "T0J 2T0",
        "CountryID": 44,
        "Latitude": 51.30036,
        "Longitude": -112.953493,
        "ContactTelephone1": "866-677-2211  403-677-2211",
        "AccessComments": "24 hours daily",
        "RelatedURL": "",
        "DistanceUnit": 0
    },
    "Connections": [
        {
            "ID": 157708,
            "ConnectionTypeID": 1,
            "LevelID": 2,
            "Amps": 16,
            "Voltage": 230,
            "PowerKW": 3.7,
            "CurrentTypeID": 10,
            "Quantity": 1
        }
    ],
    "DateLastStatusUpdate": "2020-06-26T03:12:00Z",
    "DataQualityLevel": 3,
    "DateCreated": "2018-10-18T23:37:00Z",
    "SubmissionStatusTypeID": 100
}