{
    "IsRecentlyVerified": false,
    "ID": 177136,
    "UUID": "CA5E0F1A-D360-404B-9A37-FC44BBAF029F",
    "DataProviderID": 29,
    "DataProvidersReference": "10005",
    "OperatorID": 105,
    "AddressInfo": {
        "ID": 177495,
        "Title": "Behrensstraße 28",
        "AddressLine1": "Behrensstraße 28",
        "Town": "Berlin",
        "Postcode": "10117",
        "CountryID": 87,
        "Latitude": 52.515846,
        "Longitude": 13.389922,
        "DistanceUnit": 0
    },
    "Connections": [
        {
            "ID": 275918,
            "ConnectionTypeID": 25,
            "StatusTypeID": 50,
            "LevelID": 2,
            "PowerKW": 22,
            "CurrentTypeID": 20
        },
        {
            "ID": 275919,
            "ConnectionTypeID": 25,
            "StatusTypeID": 50,
            "LevelID": 2,
            "PowerKW": 22,
            "CurrentTypeID": 20
        }
    ],
    "StatusTypeID": 0,
    "DateLastStatusUpdate": "2021-07-12T02:49:00Z",
    "MetadataValues": [
        {
            "ID": 9430,
            "MetadataFieldID": 4,
            "ItemValue": "Data from the German chargepoint registry provided by Bundesnetzagentur.de under the CC-BY 4.0 license"
        }
    ],
    "DataQualityLevel": 3,
    "DateCreated": "2021-07-08T09:48:00Z",
    "SubmissionStatusTypeID": 100
}