{
    "UserComments": [
        {
            "ID": 22260,
            "ChargePointID": 148934,
            "CommentTypeID": 50,
            "UserName": "fakk",
            "Comment": "Still under construction! ",
            "DateCreated": "2020-03-08T14:08:57.907Z",
            "User": {
                "ID": 25406,
                "Username": "fakk"
            },
            "CheckinStatusTypeID": 120,
            "IsActionedByEditor": false
        }
    ],
    "IsRecentlyVerified": false,
    "ID": 148934,
    "UUID": "8E2BFE93-09E0-426D-AF62-60AF0C9CD781",
    "DataProviderID": 1,
    "OperatorID": 3299,
    "UsageTypeID": 4,
    "AddressInfo": {
        "ID": 149287,
        "Title": "Rasthof Lehrter See Süd (Ionity)",
        "AddressLine1": "A2",
        "Town": "Lehrte",
        "StateOrProvince": "Region Hannover",
        "Postcode": "31275",
        "CountryID": 87,
        "Latitude": 52.38692295265403,
        "Longitude": 9.99837445767206,
        "AccessComments": "4 Schnellladesäulen vom Typ Veefil Tritium an der Autobahn A2.",
        "DistanceUnit": 0
    },
    "Connections": [
        {
            "ID": 206817,
            "ConnectionTypeID": 33,
            "StatusTypeID": 50,
            "LevelID": 3,
            "Amps": 500,
            "Voltage": 920,
            "PowerKW": 350,
            "CurrentTypeID": 30,
            "Quantity": 4
        }
    ],
    "NumberOfPoints": 4,
    "StatusTypeID": 50,
    "DateLastStatusUpdate": "2020-03-08T14:09:00Z",
    "DataQualityLevel": 1,
    "DateCreated": "2020-02-13T08:01:00Z",
    "SubmissionStatusTypeID": 200
}