{
    "IsRecentlyVerified": false,
    "ID": 71928,
    "UUID": "6A6C36F8-B5A3-4F83-A4D4-BF6D9E83D9A2",
    "DataProviderID": 1,
    "OperatorID": 45,
    "UsageTypeID": 1,
    "AddressInfo": {
        "ID": 72274,
        "Title": "E Bike Station Landhaus Fernblick",
        "AddressLine1": "Auf dem Rodfeld 1",
        "Town": "Freigericht",
        "StateOrProvince": "Main-Kinzig-Kreis",
        "Postcode": "63579",
        "CountryID": 87,
        "Latitude": 50.120523,
        "Longitude": 9.152813000000037,
        "AccessComments": "Geöffnet von Di-So 12-24Uhr, Laden ist kostenlos.",
        "RelatedURL": "http://www.kreiswerke-main-kinzig.de/E-Mobilitaet.1928.0.html",
        "DistanceUnit": 0
    },
    "Connections": [
        {
            "ID": 103089,
            "ConnectionTypeID": 28,
            "StatusTypeID": 50,
            "LevelID": 1,
            "Amps": 10,
            "Voltage": 230,
            "PowerKW": 2.3,
            "CurrentTypeID": 10,
            "Quantity": 4
        }
    ],
    "NumberOfPoints": 4,
    "StatusTypeID": 50,
    "DateLastStatusUpdate": "2016-09-23T11:40:00Z",
    "DataQualityLevel": 1,
    "DateCreated": "2016-09-23T11:40:00Z",
    "SubmissionStatusTypeID": 200
}