{
    "IsRecentlyVerified": false,
    "ID": 153264,
    "UUID": "7703BF5F-394E-48B7-93B8-0AC132D7096C",
    "DataProviderID": 28,
    "DataProvidersReference": "FR*S89*P89086*A",
    "UsageTypeID": 5,
    "AddressInfo": {
        "ID": 153617,
        "Title": "CHARNY OREE DE PUISAYE_40 Grande Rue",
        "AddressLine1": "40 Grande Rue 89120 CHARNY OREE DE PUISAYE",
        "CountryID": 80,
        "Latitude": 47.886972,
        "Longitude": 3.09528,
        "AccessComments": "24/24 7/7 jours",
        "DistanceUnit": 0
    },
    "Connections": [
        {
            "ID": 214925,
            "ConnectionTypeID": 28,
            "StatusTypeID": 50,
            "LevelID": 2,
            "PowerKW": 22,
            "CurrentTypeID": 10
        },
        {
            "ID": 214926,
            "ConnectionTypeID": 1036,
            "StatusTypeID": 50,
            "LevelID": 2,
            "PowerKW": 22,
            "CurrentTypeID": 20
        },
        {
            "ID": 248301,
            "ConnectionTypeID": 28,
            "StatusTypeID": 50,
            "LevelID": 2,
            "PowerKW": 22,
            "CurrentTypeID": 10
        },
        {
            "ID": 248302,
            "ConnectionTypeID": 1036,
            "StatusTypeID": 50,
            "LevelID": 2,
            "PowerKW": 22,
            "CurrentTypeID": 20
        }
    ],
    "GeneralComments": "",
    "StatusTypeID": 50,
    "DateLastStatusUpdate": "2020-08-27T05:14:00Z",
    "DataQualityLevel": 2,
    "DateCreated": "2020-03-15T10:54:00Z",
    "SubmissionStatusTypeID": 100
}