{
    "IsRecentlyVerified": false,
    "ID": 105262,
    "UUID": "F896CC54-CEAA-401E-8ABE-18AC56D62957",
    "DataProviderID": 1,
    "OperatorID": 45,
    "UsageTypeID": 6,
    "AddressInfo": {
        "ID": 105608,
        "Title": "Thormählenhof Ferienwohnungen",
        "AddressLine1": "Alterkoogchaussee 6",
        "Town": "Nordstrand",
        "StateOrProvince": "Nordsee-Treene",
        "Postcode": "25845",
        "CountryID": 87,
        "Latitude": 54.49854,
        "Longitude": 8.84321,
        "AccessComments": "Ein Ladeplatz für Gäste ist vorhanden",
        "RelatedURL": "http://www.thormaehlen-nordstrand.de/",
        "DistanceUnit": 0
    },
    "Connections": [
        {
            "ID": 148386,
            "ConnectionTypeID": 1036,
            "StatusTypeID": 50,
            "LevelID": 2,
            "Amps": 32,
            "Voltage": 400,
            "PowerKW": 22,
            "CurrentTypeID": 20,
            "Quantity": 1
        }
    ],
    "NumberOfPoints": 1,
    "StatusTypeID": 50,
    "DateLastStatusUpdate": "2018-06-04T06:00:00Z",
    "DataQualityLevel": 1,
    "DateCreated": "2018-06-04T06:00:00Z",
    "SubmissionStatusTypeID": 200
}