{
    "IsRecentlyVerified": false,
    "ID": 153238,
    "UUID": "7895A6AC-7D2F-4A08-8E46-94C7872EBAB2",
    "DataProviderID": 28,
    "DataProvidersReference": "FRS29PSDE29BXAX",
    "OperatorID": 3379,
    "UsageTypeID": 5,
    "AddressInfo": {
        "ID": 153591,
        "Title": "Concarneau - Place du 8 Mai 1945",
        "AddressLine1": "Place du 8 Mai 1945 - 29039 Concarneau",
        "CountryID": 80,
        "Latitude": 47.8704,
        "Longitude": -3.917199,
        "AccessComments": "24/24_7/7",
        "DistanceUnit": 0
    },
    "Connections": [
        {
            "ID": 214877,
            "ConnectionTypeID": 1036,
            "StatusTypeID": 50,
            "LevelID": 2,
            "PowerKW": 22,
            "CurrentTypeID": 20
        },
        {
            "ID": 214878,
            "ConnectionTypeID": 28,
            "StatusTypeID": 50,
            "LevelID": 2,
            "PowerKW": 22,
            "CurrentTypeID": 10
        },
        {
            "ID": 248252,
            "ConnectionTypeID": 1036,
            "StatusTypeID": 50,
            "LevelID": 2,
            "PowerKW": 22,
            "CurrentTypeID": 20
        },
        {
            "ID": 248253,
            "ConnectionTypeID": 28,
            "StatusTypeID": 50,
            "LevelID": 2,
            "PowerKW": 22,
            "CurrentTypeID": 10
        }
    ],
    "GeneralComments": "",
    "StatusTypeID": 50,
    "DateLastStatusUpdate": "2020-08-27T05:14:00Z",
    "DataQualityLevel": 2,
    "DateCreated": "2020-03-15T10:54:00Z",
    "SubmissionStatusTypeID": 100
}