{
    "IsRecentlyVerified": false,
    "ID": 114814,
    "UUID": "93E1B0EF-9488-43B7-A487-83BDB8A12A77",
    "DataProviderID": 1,
    "OperatorID": 80,
    "UsageTypeID": 4,
    "AddressInfo": {
        "ID": 115160,
        "Title": "Bitonto Piscina Comunale | EnelX",
        "AddressLine1": "Via Nicola Piacente",
        "Town": "Bitonto",
        "StateOrProvince": "BA",
        "Postcode": "70032",
        "CountryID": 112,
        "Latitude": 41.10069737238196,
        "Longitude": 16.693328283920454,
        "ContactTelephone1": "800.069.850",
        "RelatedURL": "https://www.enelx.com/it/it/emobility",
        "DistanceUnit": 0
    },
    "Connections": [
        {
            "ID": 161571,
            "ConnectionTypeID": 25,
            "StatusTypeID": 50,
            "LevelID": 2,
            "Amps": 32,
            "Voltage": 400,
            "PowerKW": 22,
            "CurrentTypeID": 20,
            "Quantity": 2
        }
    ],
    "NumberOfPoints": 2,
    "StatusTypeID": 50,
    "DateLastStatusUpdate": "2019-01-16T10:54:00Z",
    "DataQualityLevel": 1,
    "DateCreated": "2019-01-16T10:54:00Z",
    "SubmissionStatusTypeID": 200
}