{
    "IsRecentlyVerified": false,
    "ID": 116376,
    "UUID": "8EB190A0-6A44-436D-A0B9-E9EE20765461",
    "DataProviderID": 1,
    "DataProvidersReference": "5296",
    "OperatorID": 1,
    "UsageTypeID": 5,
    "AddressInfo": {
        "ID": 116722,
        "Title": "Glemmen VGS, Lisleby",
        "AddressLine1": "Tomteveien 26",
        "Town": "FREDRIKSTAD",
        "StateOrProvince": "Viken",
        "Postcode": "1618",
        "CountryID": 168,
        "Latitude": 59.23425,
        "Longitude": 10.98796,
        "AccessComments": "",
        "DistanceUnit": 0
    },
    "Connections": [
        {
            "ID": 164041,
            "ConnectionTypeID": 25,
            "Reference": "1",
            "StatusTypeID": 50,
            "LevelID": 2,
            "Amps": 32,
            "Voltage": 230,
            "PowerKW": 7.4,
            "CurrentTypeID": 10,
            "Comments": "Mode 3"
        },
        {
            "ID": 164042,
            "ConnectionTypeID": 25,
            "Reference": "2",
            "StatusTypeID": 50,
            "LevelID": 2,
            "Amps": 32,
            "Voltage": 230,
            "PowerKW": 7.4,
            "CurrentTypeID": 10,
            "Comments": "Mode 3"
        }
    ],
    "NumberOfPoints": 2,
    "GeneralComments": "IT-net (not old Zoe compatible) ",
    "StatusTypeID": 50,
    "DateLastStatusUpdate": "2020-08-06T11:35:00Z",
    "DataQualityLevel": 2,
    "DateCreated": "2019-02-11T09:16:00Z",
    "SubmissionStatusTypeID": 100
}