{
    "IsRecentlyVerified": false,
    "ID": 105815,
    "UUID": "CA5EFD6D-F1DB-4303-9269-5DB1E479E5BC",
    "DataProviderID": 2,
    "DataProvidersReference": "98523",
    "OperatorID": 5,
    "UsageTypeID": 1,
    "AddressInfo": {
        "ID": 106161,
        "Title": "COJ",
        "AddressLine1": "13 N Parker Dr",
        "Town": "Janesville",
        "StateOrProvince": "WI",
        "Postcode": "53545",
        "CountryID": 2,
        "Latitude": 42.68373,
        "Longitude": -89.022482,
        "ContactTelephone1": "888-758-4389",
        "AccessComments": "24 hours daily",
        "RelatedURL": "http://www.chargepoint.com/",
        "DistanceUnit": 0
    },
    "Connections": [
        {
            "ID": 149023,
            "ConnectionTypeID": 1,
            "LevelID": 2,
            "Amps": 16,
            "Voltage": 230,
            "PowerKW": 3.7,
            "CurrentTypeID": 10,
            "Quantity": 4
        }
    ],
    "DateLastStatusUpdate": "2020-06-26T03:06:00Z",
    "DataQualityLevel": 3,
    "DateCreated": "2018-06-09T04:02:00Z",
    "SubmissionStatusTypeID": 100
}