{
    "UserComments": [
        {
            "ID": 19316,
            "ChargePointID": 101210,
            "CommentTypeID": 10,
            "UserName": "xester",
            "Rating": 5,
            "DateCreated": "2018-03-20T19:29:49.693Z",
            "User": {
                "ID": 6169,
                "Username": "xester"
            },
            "CheckinStatusTypeID": 10
        }
    ],
    "IsRecentlyVerified": false,
    "ID": 101210,
    "UUID": "DB89510B-2845-478A-828B-EBC8CDE4A884",
    "DataProviderID": 1,
    "OperatorID": 1,
    "UsageTypeID": 4,
    "UsageCost": "Free / Gratis",
    "AddressInfo": {
        "ID": 101556,
        "Title": "Camp del Cellerot",
        "AddressLine1": "Camp del Cellerot",
        "Town": "Vilafranca del Penedès",
        "StateOrProvince": "Tarragona",
        "Postcode": "43001",
        "CountryID": 210,
        "Latitude": 41.341532,
        "Longitude": 1.701114,
        "ContactTelephone1": "93 892 03 58",
        "RelatedURL": "https://www.vilafranca.cat/jsp/tramits/detall.jsp?id=2748&idtema=0",
        "DistanceUnit": 0
    },
    "Connections": [
        {
            "ID": 142885,
            "ConnectionTypeID": 2,
            "StatusTypeID": 50,
            "LevelID": 3,
            "Amps": 62,
            "Voltage": 400,
            "PowerKW": 25,
            "CurrentTypeID": 30,
            "Quantity": 1
        },
        {
            "ID": 142886,
            "ConnectionTypeID": 33,
            "StatusTypeID": 50,
            "LevelID": 3,
            "Amps": 62,
            "Voltage": 400,
            "PowerKW": 25,
            "CurrentTypeID": 30,
            "Quantity": 1
        },
        {
            "ID": 142887,
            "ConnectionTypeID": 25,
            "StatusTypeID": 100,
            "LevelID": 2,
            "Amps": 32,
            "Voltage": 400,
            "PowerKW": 22,
            "CurrentTypeID": 20,
            "Quantity": 1
        }
    ],
    "NumberOfPoints": 2,
    "StatusTypeID": 50,
    "DateLastStatusUpdate": "2019-01-09T10:12:00Z",
    "DataQualityLevel": 1,
    "DateCreated": "2018-03-20T19:30:00Z",
    "SubmissionStatusTypeID": 200
}