{
    "IsRecentlyVerified": false,
    "ID": 127647,
    "UUID": "90157BD9-EFCA-4E50-BE42-EA3A3FD82235",
    "DataProviderID": 1,
    "OperatorID": 25,
    "OperatorsReference": "camden-lindfieldsgardens",
    "UsageTypeID": 4,
    "UsageCost": "£0.073/minute; min £1.38; other tariffs available",
    "AddressInfo": {
        "ID": 127993,
        "Title": "Lindfields Gardens",
        "AddressLine1": "8a Lindfields Gardens",
        "Town": "London",
        "Postcode": "NW3 6PU",
        "CountryID": 1,
        "Latitude": 51.552158,
        "Longitude": -0.182906,
        "DistanceUnit": 0
    },
    "Connections": [
        {
            "ID": 178694,
            "ConnectionTypeID": 25,
            "StatusTypeID": 50,
            "LevelID": 2,
            "Amps": 32,
            "Voltage": 230,
            "PowerKW": 7,
            "CurrentTypeID": 10,
            "Quantity": 1
        },
        {
            "ID": 178695,
            "ConnectionTypeID": 1,
            "StatusTypeID": 50,
            "LevelID": 2,
            "Voltage": 230,
            "PowerKW": 4,
            "CurrentTypeID": 10,
            "Quantity": 1
        }
    ],
    "NumberOfPoints": 1,
    "StatusTypeID": 50,
    "DateLastStatusUpdate": "2019-06-07T05:39:00Z",
    "DataQualityLevel": 1,
    "DateCreated": "2019-06-07T05:39:00Z",
    "SubmissionStatusTypeID": 200
}