{
    "IsRecentlyVerified": false,
    "ID": 113392,
    "UUID": "542FBDC5-71AD-49AB-BDFC-E177A1E07650",
    "DataProviderID": 1,
    "OperatorID": 229,
    "UsageTypeID": 4,
    "UsageCost": "$0.25/kWh + $0.25/min",
    "AddressInfo": {
        "ID": 113738,
        "Title": "New World Westport",
        "AddressLine1": "244 Palmerston Street",
        "Town": "Westport",
        "Postcode": "7825",
        "CountryID": 161,
        "Latitude": -41.757859,
        "Longitude": 171.598674,
        "DistanceUnit": 0
    },
    "Connections": [
        {
            "ID": 159717,
            "ConnectionTypeID": 33,
            "StatusTypeID": 50,
            "LevelID": 3,
            "PowerKW": 50,
            "CurrentTypeID": 30,
            "Quantity": 1
        },
        {
            "ID": 159718,
            "ConnectionTypeID": 2,
            "StatusTypeID": 50,
            "LevelID": 3,
            "PowerKW": 50,
            "CurrentTypeID": 30,
            "Quantity": 1
        }
    ],
    "NumberOfPoints": 1,
    "StatusTypeID": 50,
    "DateLastStatusUpdate": "2018-12-07T07:39:00Z",
    "DataQualityLevel": 1,
    "DateCreated": "2018-12-07T07:39:00Z",
    "SubmissionStatusTypeID": 200
}