{
    "IsRecentlyVerified": false,
    "ID": 137647,
    "UUID": "59CB61DC-9662-4B87-9862-B36663EDAAB6",
    "DataProviderID": 2,
    "DataProvidersReference": "95826",
    "OperatorID": 9,
    "UsageTypeID": 1,
    "AddressInfo": {
        "ID": 137993,
        "Title": "Baker-Herder Building - Table Talk",
        "AddressLine1": "6842 East Tanque Verde Road",
        "Town": "Tucson",
        "StateOrProvince": "AZ",
        "Postcode": "85715",
        "CountryID": 2,
        "Latitude": 32.249684,
        "Longitude": -110.845892,
        "ContactTelephone1": "888-998-2546",
        "AccessComments": "MON: 24 hours | TUE: 24 hours | WED: 24 hours | THU: 24 hours | FRI: 24 hours | SAT: 24 hours | SUN: 24 hours",
        "RelatedURL": "http://www.blinkcharging.com/",
        "DistanceUnit": 0
    },
    "Connections": [
        {
            "ID": 192596,
            "ConnectionTypeID": 1,
            "LevelID": 2,
            "Amps": 16,
            "Voltage": 230,
            "PowerKW": 3,
            "CurrentTypeID": 10,
            "Quantity": 2
        }
    ],
    "StatusTypeID": 50,
    "DateLastStatusUpdate": "2019-12-24T09:06:00Z",
    "DataQualityLevel": 3,
    "DateCreated": "2019-12-24T09:06:00Z",
    "SubmissionStatusTypeID": 100
}