{
    "IsRecentlyVerified": false,
    "ID": 43661,
    "UUID": "96CF821C-D260-411F-BFDA-F5A6E4572A6C",
    "DataProviderID": 1,
    "OperatorID": 45,
    "UsageTypeID": 5,
    "UsageCost": "0,50€/kWh",
    "AddressInfo": {
        "ID": 44007,
        "Title": "Parkplatz / Stellplatz Neumarktplatz",
        "AddressLine1": "Unterwallweg",
        "Town": "Bückeburg",
        "StateOrProvince": "Landkreis Schaumburg",
        "Postcode": "31675",
        "CountryID": 87,
        "Latitude": 52.2642647893476,
        "Longitude": 9.05081365040131,
        "AccessComments": "Auf dem durchgehend nutzbaren Parkplatz für alle Fahrzeuge ist eine blaue Münzstromsäule mit 6 CEE Anschlüssen am Außenrand des Parkplatzes. ",
        "RelatedURL": "https://www.bueckeburg.de/de/Leben-in-B%C3%BCckeburg/Adressen-A-Z?view=publish&item=location&id=193-0",
        "DistanceUnit": 0
    },
    "Connections": [
        {
            "ID": 52967,
            "ConnectionTypeID": 16,
            "StatusTypeID": 50,
            "LevelID": 2,
            "Amps": 16,
            "Voltage": 230,
            "PowerKW": 3.7,
            "CurrentTypeID": 10,
            "Quantity": 6
        }
    ],
    "NumberOfPoints": 6,
    "StatusTypeID": 50,
    "DateLastStatusUpdate": "2015-04-10T12:04:00Z",
    "DataQualityLevel": 1,
    "DateCreated": "2015-04-10T06:21:00Z",
    "SubmissionStatusTypeID": 200
}