{
    "IsRecentlyVerified": false,
    "ID": 178168,
    "UUID": "337D7AA8-21E3-4AD5-8DF2-8E679B146CE6",
    "DataProviderID": 29,
    "DataProvidersReference": "18771,16723",
    "AddressInfo": {
        "ID": 178527,
        "Title": "Kirchplatz 4",
        "AddressLine1": "Kirchplatz 4",
        "Town": "Dingolfing",
        "Postcode": "84130",
        "CountryID": 87,
        "Latitude": 48.621794,
        "Longitude": 12.459091,
        "DistanceUnit": 0
    },
    "Connections": [
        {
            "ID": 278234,
            "ConnectionTypeID": 25,
            "StatusTypeID": 50,
            "LevelID": 2,
            "PowerKW": 11,
            "CurrentTypeID": 20
        },
        {
            "ID": 278235,
            "ConnectionTypeID": 25,
            "StatusTypeID": 50,
            "LevelID": 2,
            "PowerKW": 11,
            "CurrentTypeID": 20
        },
        {
            "ID": 278236,
            "ConnectionTypeID": 25,
            "StatusTypeID": 50,
            "LevelID": 2,
            "PowerKW": 22,
            "CurrentTypeID": 20
        },
        {
            "ID": 278237,
            "ConnectionTypeID": 25,
            "StatusTypeID": 50,
            "LevelID": 2,
            "PowerKW": 22,
            "CurrentTypeID": 20
        }
    ],
    "StatusTypeID": 0,
    "DateLastStatusUpdate": "2021-07-09T03:13:00Z",
    "MetadataValues": [
        {
            "ID": 10462,
            "MetadataFieldID": 4,
            "ItemValue": "Data from the German chargepoint registry provided by Bundesnetzagentur.de under the CC-BY 4.0 license"
        }
    ],
    "DataQualityLevel": 3,
    "DateCreated": "2021-07-08T09:49:00Z",
    "SubmissionStatusTypeID": 100
}