{
    "IsRecentlyVerified": false,
    "ID": 146402,
    "UUID": "BE677BAC-290F-4C17-97A3-D801B7ADA2A4",
    "DataProviderID": 1,
    "OperatorID": 80,
    "UsageTypeID": 4,
    "AddressInfo": {
        "ID": 146754,
        "Title": "Municipio di Bernate Ticino | EnelX",
        "AddressLine1": "Piazza Della Pace",
        "Town": "Bernate Ticino",
        "StateOrProvince": "MI",
        "Postcode": "20010",
        "CountryID": 112,
        "Latitude": 45.47936214634467,
        "Longitude": 8.818182577002403,
        "ContactTelephone1": "800.069.850",
        "RelatedURL": "https://www.enelx.com/it/it/emobility",
        "DistanceUnit": 0
    },
    "Connections": [
        {
            "ID": 203530,
            "ConnectionTypeID": 25,
            "StatusTypeID": 50,
            "LevelID": 2,
            "Amps": 32,
            "Voltage": 400,
            "PowerKW": 22,
            "CurrentTypeID": 20,
            "Quantity": 2
        }
    ],
    "NumberOfPoints": 2,
    "StatusTypeID": 50,
    "DateLastStatusUpdate": "2020-01-09T16:54:00Z",
    "DataQualityLevel": 1,
    "DateCreated": "2020-01-09T16:53:00Z",
    "SubmissionStatusTypeID": 200
}