{
    "IsRecentlyVerified": false,
    "ID": 21270,
    "UUID": "96D9A0B1-027E-4724-AE10-5AC27202F42B",
    "DataProviderID": 1,
    "OperatorID": 82,
    "UsageTypeID": 4,
    "UsageCost": "15€ for 3months",
    "AddressInfo": {
        "ID": 21615,
        "Title": "A2A Piazza della Vittoria",
        "AddressLine1": "Via IV Novembre 2D1",
        "AddressLine2": "Circoscrizione Brescia Centro",
        "Town": "Brescia",
        "StateOrProvince": "Brescia",
        "Postcode": "25122",
        "CountryID": 112,
        "Latitude": 45.53776338641134,
        "Longitude": 10.219438910222726,
        "ContactTelephone1": "800035151",
        "RelatedURL": "http://www.e-moving.it/",
        "DistanceUnit": 0
    },
    "Connections": [
        {
            "ID": 23124,
            "ConnectionTypeID": 25,
            "StatusTypeID": 50,
            "LevelID": 2,
            "PowerKW": 3,
            "CurrentTypeID": 10,
            "Quantity": 2
        }
    ],
    "NumberOfPoints": 2,
    "StatusTypeID": 50,
    "DateLastStatusUpdate": "2014-03-17T19:00:00Z",
    "DataQualityLevel": 1,
    "DateCreated": "2014-03-17T19:00:00Z",
    "SubmissionStatusTypeID": 200
}