{
    "IsRecentlyVerified": false,
    "ID": 168495,
    "UUID": "C7BE32A4-FA92-4EF1-8515-20D3E18FAD37",
    "DataProviderID": 1,
    "OperatorID": 21,
    "UsageTypeID": 4,
    "UsageCost": "Mobi.E compatible card",
    "AddressInfo": {
        "ID": 168854,
        "Title": "GMR-00008",
        "AddressLine1": "Rua Eduardo Leite Faria Machado",
        "Town": "Caldelas",
        "StateOrProvince": "Braga",
        "Postcode": "4805-133",
        "CountryID": 180,
        "Latitude": 41.49100232444064,
        "Longitude": -8.341112162954573,
        "DistanceUnit": 0
    },
    "Connections": [
        {
            "ID": 255908,
            "ConnectionTypeID": 25,
            "StatusTypeID": 50,
            "LevelID": 2,
            "Amps": 32,
            "Voltage": 230,
            "PowerKW": 7.4,
            "CurrentTypeID": 10,
            "Quantity": 1
        }
    ],
    "NumberOfPoints": 1,
    "StatusTypeID": 50,
    "DateLastStatusUpdate": "2020-09-28T19:22:00Z",
    "DataQualityLevel": 1,
    "DateCreated": "2020-09-28T19:22:00Z",
    "SubmissionStatusTypeID": 200
}