{
    "UserComments": [
        {
            "ID": 14837,
            "ChargePointID": 71784,
            "CommentTypeID": 10,
            "UserName": "Christian Paas",
            "Comment": "Authorisierung hat zwar funktioniert, aber Laden per Chademo klappte nicht",
            "Rating": 1,
            "DateCreated": "2017-01-18T20:27:12.847Z",
            "User": {
                "ID": 12218,
                "Username": "Christian Paas"
            },
            "CheckinStatusTypeID": 25
        }
    ],
    "IsRecentlyVerified": false,
    "ID": 71784,
    "UUID": "B380DDD1-726A-4DFA-A1B8-DEF265B8BBA7",
    "DataProviderID": 1,
    "OperatorID": 103,
    "UsageTypeID": 4,
    "UsageCost": "",
    "AddressInfo": {
        "ID": 72130,
        "Title": "Gewerbepark",
        "AddressLine1": "Westerwaldstraße 10",
        "AddressLine2": "",
        "Town": "Oberhonnefeld-Gierend",
        "StateOrProvince": "Rengsdorf",
        "Postcode": "56587",
        "CountryID": 87,
        "Latitude": 50.5625044870308,
        "Longitude": 7.525590699722313,
        "ContactTelephone1": "",
        "ContactTelephone2": "",
        "ContactEmail": "",
        "AccessComments": "24/7 nutzbar mit The New Motion Ladekarte, Plugsurfing Keyhanger oder App, ChargeNow, Heldele EMis oder Intercharge Direct App. ",
        "RelatedURL": "",
        "DistanceUnit": 0
    },
    "Connections": [
        {
            "ID": 102818,
            "ConnectionTypeID": 2,
            "StatusTypeID": 50,
            "LevelID": 3,
            "PowerKW": 50,
            "CurrentTypeID": 30,
            "Quantity": 1
        },
        {
            "ID": 102819,
            "ConnectionTypeID": 1036,
            "StatusTypeID": 50,
            "LevelID": 3,
            "Amps": 63,
            "Voltage": 400,
            "PowerKW": 43,
            "CurrentTypeID": 20,
            "Quantity": 4
        },
        {
            "ID": 102820,
            "ConnectionTypeID": 33,
            "StatusTypeID": 50,
            "LevelID": 3,
            "PowerKW": 50,
            "CurrentTypeID": 30,
            "Quantity": 4
        }
    ],
    "NumberOfPoints": 4,
    "GeneralComments": "",
    "StatusTypeID": 50,
    "DateLastStatusUpdate": "2017-01-21T00:24:00Z",
    "DataQualityLevel": 1,
    "DateCreated": "2016-09-08T06:04:00Z",
    "SubmissionStatusTypeID": 200
}