{
    "IsRecentlyVerified": false,
    "ID": 93639,
    "UUID": "E51B6948-F020-4591-A074-AF4719F4786B",
    "DataProviderID": 1,
    "OperatorID": 69,
    "UsageTypeID": 4,
    "AddressInfo": {
        "ID": 93985,
        "Title": "Bahnhof",
        "AddressLine1": "Bahnhofstraße 4",
        "Town": "Heilbad Heiligenstadt",
        "StateOrProvince": "Landkreis Eichsfeld",
        "Postcode": "37308",
        "CountryID": 87,
        "Latitude": 51.37607021728325,
        "Longitude": 10.12363592526206,
        "DistanceUnit": 0
    },
    "Connections": [
        {
            "ID": 132601,
            "ConnectionTypeID": 25,
            "StatusTypeID": 50,
            "LevelID": 2,
            "Amps": 32,
            "Voltage": 400,
            "PowerKW": 22,
            "CurrentTypeID": 20,
            "Quantity": 2
        }
    ],
    "NumberOfPoints": 2,
    "StatusTypeID": 50,
    "DateLastStatusUpdate": "2017-10-04T10:02:00Z",
    "DataQualityLevel": 1,
    "DateCreated": "2017-10-04T10:02:00Z",
    "SubmissionStatusTypeID": 200
}