{
    "IsRecentlyVerified": false,
    "ID": 178706,
    "UUID": "1819925E-1554-47F5-9890-2C32088D0D13",
    "DataProviderID": 29,
    "DataProvidersReference": "17142",
    "OperatorID": 152,
    "AddressInfo": {
        "ID": 179065,
        "Title": "Halberstädter Straße 137",
        "AddressLine1": "Halberstädter Straße 137",
        "Town": "Magdeburg",
        "Postcode": "39112",
        "CountryID": 87,
        "Latitude": 52.109507,
        "Longitude": 11.599164,
        "DistanceUnit": 0
    },
    "Connections": [
        {
            "ID": 279477,
            "ConnectionTypeID": 25,
            "StatusTypeID": 50,
            "LevelID": 2,
            "PowerKW": 22,
            "CurrentTypeID": 20
        },
        {
            "ID": 279478,
            "ConnectionTypeID": 25,
            "StatusTypeID": 50,
            "LevelID": 2,
            "PowerKW": 22,
            "CurrentTypeID": 20
        },
        {
            "ID": 279479,
            "ConnectionTypeID": 1036,
            "StatusTypeID": 50,
            "LevelID": 2,
            "PowerKW": 36,
            "CurrentTypeID": 20
        }
    ],
    "StatusTypeID": 0,
    "DateLastStatusUpdate": "2021-07-12T02:49:00Z",
    "MetadataValues": [
        {
            "ID": 11000,
            "MetadataFieldID": 4,
            "ItemValue": "Data from the German chargepoint registry provided by Bundesnetzagentur.de under the CC-BY 4.0 license"
        }
    ],
    "DataQualityLevel": 3,
    "DateCreated": "2021-07-08T09:50:00Z",
    "SubmissionStatusTypeID": 100
}