{
    "IsRecentlyVerified": false,
    "ID": 122689,
    "UUID": "B2D995F2-FBB7-4534-B3C8-9CAD28969247",
    "DataProviderID": 2,
    "DataProvidersReference": "53405",
    "OperatorID": 5,
    "UsageTypeID": 1,
    "AddressInfo": {
        "ID": 123035,
        "Title": "SB MTD",
        "AddressLine1": "550 Olive St",
        "Town": "Santa Barbara",
        "StateOrProvince": "CA",
        "Postcode": "93101",
        "CountryID": 2,
        "Latitude": 34.4226904,
        "Longitude": -119.6902418,
        "ContactTelephone1": "888-758-4389",
        "AccessComments": "24 hours daily",
        "RelatedURL": "http://www.chargepoint.com/",
        "DistanceUnit": 0
    },
    "Connections": [
        {
            "ID": 172600,
            "ConnectionTypeID": 1,
            "LevelID": 2,
            "Amps": 16,
            "Voltage": 230,
            "PowerKW": 3,
            "CurrentTypeID": 10,
            "Quantity": 1
        }
    ],
    "DateLastStatusUpdate": "2019-12-24T09:12:00Z",
    "DataQualityLevel": 3,
    "DateCreated": "2019-04-06T05:03:00Z",
    "SubmissionStatusTypeID": 100
}