{
    "IsRecentlyVerified": false,
    "ID": 176891,
    "UUID": "293B76A9-19DF-4031-B580-DCEE54149A09",
    "DataProviderID": 29,
    "DataProvidersReference": "13329",
    "AddressInfo": {
        "ID": 177250,
        "Title": "Bürgermeister-Klingler-Str.23a",
        "AddressLine1": "Bürgermeister-Klingler-Str.23a",
        "Town": "Mörfelden-Walldorf",
        "Postcode": "64546",
        "CountryID": 87,
        "Latitude": 49.9762,
        "Longitude": 8.55877,
        "DistanceUnit": 0
    },
    "Connections": [
        {
            "ID": 275359,
            "ConnectionTypeID": 25,
            "StatusTypeID": 50,
            "LevelID": 2,
            "PowerKW": 22,
            "CurrentTypeID": 20
        },
        {
            "ID": 275360,
            "ConnectionTypeID": 25,
            "StatusTypeID": 50,
            "LevelID": 2,
            "PowerKW": 22,
            "CurrentTypeID": 20
        }
    ],
    "StatusTypeID": 0,
    "DateLastStatusUpdate": "2021-07-12T02:44:00Z",
    "MetadataValues": [
        {
            "ID": 9186,
            "MetadataFieldID": 4,
            "ItemValue": "Data from the German chargepoint registry provided by Bundesnetzagentur.de under the CC-BY 4.0 license"
        }
    ],
    "DataQualityLevel": 3,
    "DateCreated": "2021-07-08T09:48:00Z",
    "SubmissionStatusTypeID": 100
}