{
    "IsRecentlyVerified": false,
    "ID": 149213,
    "UUID": "92A72D5B-371D-4E56-882B-3AC88FFFDD7D",
    "DataProviderID": 1,
    "OperatorID": 3382,
    "UsageTypeID": 4,
    "UsageCost": "0,43 €/kWh",
    "AddressInfo": {
        "ID": 149566,
        "Title": "Sotto il Monte Fornace  | RESSOLAR",
        "AddressLine1": "Via Fornace",
        "Town": "Sotto il Monte Giovanni XXIII",
        "StateOrProvince": "BG",
        "Postcode": "24039",
        "CountryID": 112,
        "Latitude": 45.70395443264243,
        "Longitude": 9.502734876774412,
        "DistanceUnit": 0
    },
    "Connections": [
        {
            "ID": 207196,
            "ConnectionTypeID": 25,
            "StatusTypeID": 50,
            "LevelID": 2,
            "Amps": 32,
            "Voltage": 400,
            "PowerKW": 22,
            "CurrentTypeID": 20,
            "Quantity": 1
        },
        {
            "ID": 207197,
            "ConnectionTypeID": 25,
            "StatusTypeID": 50,
            "LevelID": 2,
            "Amps": 32,
            "Voltage": 400,
            "PowerKW": 22,
            "CurrentTypeID": 20,
            "Quantity": 1
        }
    ],
    "NumberOfPoints": 2,
    "GeneralComments": "Operatore Wroom, scaricare la app",
    "StatusTypeID": 50,
    "DateLastStatusUpdate": "2020-02-20T16:44:00Z",
    "DataQualityLevel": 1,
    "DateCreated": "2020-02-20T16:44:00Z",
    "SubmissionStatusTypeID": 200
}