{
    "IsRecentlyVerified": false,
    "ID": 133042,
    "UUID": "7CA1DD22-F5B5-4245-AF16-20AB82585FFE",
    "DataProviderID": 1,
    "OperatorID": 23,
    "OperatorsReference": "52082",
    "UsageTypeID": 6,
    "AddressInfo": {
        "ID": 133388,
        "Title": "Troia Design Hotel",
        "AddressLine1": "Marina de Troia - Peninsula de Troia S/N",
        "Town": "Carvalhal",
        "StateOrProvince": "Grandula",
        "Postcode": "7570-789",
        "CountryID": 180,
        "Latitude": 38.493105,
        "Longitude": -8.902994,
        "ContactTelephone1": "+351 265 498 000",
        "AccessComments": "Only for customers",
        "DistanceUnit": 0
    },
    "Connections": [
        {
            "ID": 186323,
            "ConnectionTypeID": 30,
            "StatusTypeID": 50,
            "LevelID": 2,
            "PowerKW": 22,
            "CurrentTypeID": 20,
            "Quantity": 1
        }
    ],
    "NumberOfPoints": 1,
    "GeneralComments": "1 Tesla Connector, up to 22kW.Available for customers. Please see front desk.",
    "StatusTypeID": 50,
    "DateLastStatusUpdate": "2020-07-31T17:57:00Z",
    "DataQualityLevel": 1,
    "DateCreated": "2019-10-12T05:45:00Z",
    "SubmissionStatusTypeID": 200
}