{
    "IsRecentlyVerified": false,
    "ID": 121045,
    "UUID": "F59AA835-DE25-46C1-862B-DE0A30DA9C68",
    "DataProviderID": 2,
    "DataProvidersReference": "55878",
    "OperatorID": 5,
    "UsageTypeID": 1,
    "AddressInfo": {
        "ID": 121391,
        "Title": "EVSP WALGREENS",
        "AddressLine1": "5829 Lakewood Blvd",
        "Town": "Lakewood",
        "StateOrProvince": "CA",
        "Postcode": "90712",
        "CountryID": 2,
        "Latitude": 33.8610783,
        "Longitude": -118.1433081,
        "ContactTelephone1": "888-758-4389",
        "AccessComments": "24 hours daily",
        "RelatedURL": "http://www.chargepoint.com/",
        "DistanceUnit": 0
    },
    "Connections": [
        {
            "ID": 170467,
            "ConnectionTypeID": 1,
            "LevelID": 2,
            "Amps": 16,
            "Voltage": 230,
            "PowerKW": 3,
            "CurrentTypeID": 10,
            "Quantity": 1
        }
    ],
    "DateLastStatusUpdate": "2019-12-24T09:10:00Z",
    "DataQualityLevel": 3,
    "DateCreated": "2019-04-01T04:59:00Z",
    "SubmissionStatusTypeID": 100
}