{
    "IsRecentlyVerified": false,
    "ID": 171113,
    "UUID": "1D3EDED7-820E-404F-AAA4-597A6549C87B",
    "DataProviderID": 1,
    "OperatorID": 150,
    "UsageTypeID": 4,
    "UsageCost": "Free to use until October 2021",
    "AddressInfo": {
        "ID": 171472,
        "Title": "Burley Road Car Park",
        "AddressLine1": "Burley Road",
        "Town": "Leeds",
        "StateOrProvince": "England",
        "Postcode": "LS3 1JP",
        "CountryID": 1,
        "Latitude": 53.80222250852907,
        "Longitude": -1.5655479731497053,
        "RelatedURL": "https://ev.engie.co.uk/",
        "DistanceUnit": 0
    },
    "Connections": [
        {
            "ID": 261465,
            "ConnectionTypeID": 2,
            "StatusTypeID": 50,
            "LevelID": 3,
            "PowerKW": 50,
            "CurrentTypeID": 30,
            "Quantity": 1
        },
        {
            "ID": 261466,
            "ConnectionTypeID": 33,
            "StatusTypeID": 50,
            "LevelID": 3,
            "PowerKW": 50,
            "CurrentTypeID": 30,
            "Quantity": 1
        },
        {
            "ID": 261467,
            "ConnectionTypeID": 25,
            "StatusTypeID": 50,
            "LevelID": 2,
            "Amps": 32,
            "Voltage": 400,
            "PowerKW": 22,
            "CurrentTypeID": 20,
            "Quantity": 1
        }
    ],
    "NumberOfPoints": 1,
    "GeneralComments": "Engie rapid charger, 50kW DC, AC is a 22kw Socket. One bay for general use, one bay for taxis. Both Free to charge. Please register at  ev.engie.co.uk ",
    "StatusTypeID": 50,
    "DateLastStatusUpdate": "2021-07-28T15:55:00Z",
    "DataQualityLevel": 1,
    "DateCreated": "2020-12-21T05:23:00Z",
    "SubmissionStatusTypeID": 200
}