{
    "IsRecentlyVerified": false,
    "ID": 19287,
    "UUID": "402EADA0-9B67-4F93-84C8-6122A02A49F6",
    "DataProviderID": 1,
    "OperatorID": 20,
    "OperatorsReference": "60138,60139",
    "UsageTypeID": 1,
    "UsageCost": "Free",
    "AddressInfo": {
        "ID": 19632,
        "Title": "Allerton Car Park",
        "AddressLine1": "Allerton Car Park",
        "AddressLine2": "University of Salford, Frederick Road Campus",
        "Town": "Manchester",
        "Postcode": "M6 6PU",
        "CountryID": 1,
        "Latitude": 53.4883499,
        "Longitude": -2.27857900000004,
        "DistanceUnit": 0
    },
    "Connections": [
        {
            "ID": 19568,
            "ConnectionTypeID": 25,
            "StatusTypeID": 50,
            "LevelID": 2,
            "Amps": 32,
            "Voltage": 230,
            "PowerKW": 7,
            "CurrentTypeID": 10,
            "Quantity": 2
        }
    ],
    "NumberOfPoints": 2,
    "StatusTypeID": 50,
    "DateLastStatusUpdate": "2018-10-16T05:18:00Z",
    "DataQualityLevel": 1,
    "DateCreated": "2013-09-17T16:58:00Z",
    "SubmissionStatusTypeID": 200
}