{
    "IsRecentlyVerified": false,
    "ID": 159513,
    "UUID": "EAE83662-4B1F-46B7-8BF2-07FE652F4121",
    "DataProviderID": 2,
    "DataProvidersReference": "155533",
    "OperatorID": 5,
    "UsageTypeID": 1,
    "AddressInfo": {
        "ID": 159870,
        "Title": "STATE OF UTAH",
        "AddressLine1": "17845 US-6",
        "Town": "Spanish Fork",
        "StateOrProvince": "UT",
        "Postcode": "84660",
        "CountryID": 2,
        "Latitude": 39.950356,
        "Longitude": -111.21706,
        "ContactTelephone1": "888-758-4389",
        "AccessComments": "24 hours daily",
        "RelatedURL": "http://www.chargepoint.com/",
        "DistanceUnit": 0
    },
    "Connections": [
        {
            "ID": 229703,
            "ConnectionTypeID": 1,
            "LevelID": 2,
            "Amps": 16,
            "Voltage": 230,
            "PowerKW": 3.7,
            "CurrentTypeID": 10,
            "Quantity": 4
        }
    ],
    "StatusTypeID": 50,
    "DateLastStatusUpdate": "2020-06-26T03:02:00Z",
    "DataQualityLevel": 3,
    "DateCreated": "2020-06-26T03:02:00Z",
    "SubmissionStatusTypeID": 100
}