{
    "UserComments": [
        {
            "ID": 23812,
            "ChargePointID": 172245,
            "CommentTypeID": 10,
            "UserName": "ForumElettrico.it",
            "Comment": "Alle spalle di un centro commerciale con supermercato, negozi di abbigliamento e farmacia. Leggi la recensione completa qui >   https://www.forumelettrico.it/forum/colonnina-umbria-energy-asm-fast-50-kw-dc-40-kw-ac-terni-tr-str-di-fontana-di-polo-t15300.html",
            "RelatedURL": "https://www.forumelettrico.it/forum/colonnina-umbria-energy-asm-fast-50-kw-dc-40-kw-ac-terni-tr-str-di-fontana-di-polo-t15300.html",
            "DateCreated": "2021-01-25T08:08:12.067Z",
            "User": {
                "ID": 11749,
                "Username": "ForumElettrico.it"
            },
            "CheckinStatusTypeID": 140,
            "IsActionedByEditor": false
        }
    ],
    "MediaItems": [
        {
            "ID": 26290,
            "ChargePointID": 172245,
            "ItemURL": "https://s3-ap-southeast-2.amazonaws.com/openchargemap/images/IT/OCM172245/OCM-172245.orig.2021012508082965.jpg",
            "ItemThumbnailURL": "https://s3-ap-southeast-2.amazonaws.com/openchargemap/images/IT/OCM172245/OCM-172245.thmb.2021012508082965.jpg",
            "Comment": "",
            "IsEnabled": true,
            "IsVideo": false,
            "IsFeaturedItem": false,
            "IsExternalResource": false,
            "User": {
                "ID": 11749,
                "Username": "ForumElettrico.it"
            },
            "DateCreated": "2021-01-25T08:09:00Z"
        },
        {
            "ID": 26291,
            "ChargePointID": 172245,
            "ItemURL": "https://s3-ap-southeast-2.amazonaws.com/openchargemap/images/IT/OCM172245/OCM-172245.orig.2021012508083695.jpg",
            "ItemThumbnailURL": "https://s3-ap-southeast-2.amazonaws.com/openchargemap/images/IT/OCM172245/OCM-172245.thmb.2021012508083695.jpg",
            "Comment": "",
            "IsEnabled": true,
            "IsVideo": false,
            "IsFeaturedItem": false,
            "IsExternalResource": false,
            "User": {
                "ID": 11749,
                "Username": "ForumElettrico.it"
            },
            "DateCreated": "2021-01-25T08:09:00Z"
        },
        {
            "ID": 26292,
            "ChargePointID": 172245,
            "ItemURL": "https://s3-ap-southeast-2.amazonaws.com/openchargemap/images/IT/OCM172245/OCM-172245.orig.2021012508084214.jpg",
            "ItemThumbnailURL": "https://s3-ap-southeast-2.amazonaws.com/openchargemap/images/IT/OCM172245/OCM-172245.thmb.2021012508084214.jpg",
            "Comment": "",
            "IsEnabled": true,
            "IsVideo": false,
            "IsFeaturedItem": false,
            "IsExternalResource": false,
            "User": {
                "ID": 11749,
                "Username": "ForumElettrico.it"
            },
            "DateCreated": "2021-01-25T08:09:00Z"
        },
        {
            "ID": 26289,
            "ChargePointID": 172245,
            "ItemURL": "https://s3-ap-southeast-2.amazonaws.com/openchargemap/images/IT/OCM172245/OCM-172245.orig.2021012508082362.jpg",
            "ItemThumbnailURL": "https://s3-ap-southeast-2.amazonaws.com/openchargemap/images/IT/OCM172245/OCM-172245.thmb.2021012508082362.jpg",
            "Comment": "",
            "IsEnabled": true,
            "IsVideo": false,
            "IsFeaturedItem": false,
            "IsExternalResource": false,
            "User": {
                "ID": 11749,
                "Username": "ForumElettrico.it"
            },
            "DateCreated": "2021-01-25T08:08:00Z"
        }
    ],
    "IsRecentlyVerified": false,
    "ID": 172245,
    "UUID": "E7FF6FEA-3E72-425D-BFB1-8BE41CF5368D",
    "DataProviderID": 1,
    "UsageTypeID": 1,
    "AddressInfo": {
        "ID": 172604,
        "Title": "Umbria Energy Coop",
        "AddressLine1": "Via Gabelletta 12",
        "Town": "Terni",
        "StateOrProvince": "TR",
        "CountryID": 112,
        "Latitude": 42.588055,
        "Longitude": 12.601995,
        "RelatedURL": "https://www.forumelettrico.it/forum/colonnina-umbria-energy-asm-fast-50-kw-dc-40-kw-ac-terni-tr-str-di-fontana-di-polo-t15300.html",
        "DistanceUnit": 0
    },
    "Connections": [
        {
            "ID": 263333,
            "ConnectionTypeID": 33,
            "LevelID": 2,
            "PowerKW": 50
        },
        {
            "ID": 263334,
            "ConnectionTypeID": 2,
            "LevelID": 2,
            "PowerKW": 50
        },
        {
            "ID": 263335,
            "ConnectionTypeID": 1036,
            "LevelID": 2,
            "PowerKW": 43
        }
    ],
    "NumberOfPoints": 1,
    "StatusTypeID": 30,
    "DateLastStatusUpdate": "2021-01-25T08:09:00Z",
    "DataQualityLevel": 1,
    "DateCreated": "2021-01-25T08:08:00Z",
    "SubmissionStatusTypeID": 200
}