{
    "IsRecentlyVerified": false,
    "ID": 108778,
    "UUID": "07E54C71-F567-4826-9ECA-78C9A6BA1A06",
    "DataProviderID": 1,
    "OperatorID": 23,
    "OperatorsReference": "45493",
    "UsageTypeID": 4,
    "AddressInfo": {
        "ID": 109124,
        "Title": "Holiday Inn Express Hotel & Suites Oakland-Airport",
        "AddressLine1": "66 Airport Access RD",
        "Town": "Oakland",
        "StateOrProvince": "California",
        "Postcode": "94603",
        "CountryID": 2,
        "Latitude": 37.725841,
        "Longitude": -122.198335,
        "ContactTelephone1": "(510) 569-4400",
        "DistanceUnit": 0
    },
    "Connections": [
        {
            "ID": 153893,
            "ConnectionTypeID": 30,
            "StatusTypeID": 50,
            "LevelID": 2,
            "PowerKW": 16,
            "CurrentTypeID": 20,
            "Quantity": 2
        }
    ],
    "NumberOfPoints": 2,
    "GeneralComments": "2 Tesla Connectors, up to 16kW.Available for customers. Please see front desk.",
    "StatusTypeID": 50,
    "DateLastStatusUpdate": "2018-10-11T12:39:00Z",
    "DataQualityLevel": 1,
    "DateCreated": "2018-10-11T12:39:00Z",
    "SubmissionStatusTypeID": 200
}