{
    "IsRecentlyVerified": false,
    "ID": 119709,
    "UUID": "CE72C1D0-1A61-44CC-8B76-7BE61DC4D3B2",
    "DataProviderID": 2,
    "DataProvidersReference": "39736",
    "UsageTypeID": 7,
    "AddressInfo": {
        "ID": 120055,
        "Title": "Family Nissan of Laredo",
        "AddressLine1": "3701 E Saunders St",
        "Town": "Laredo",
        "StateOrProvince": "TX",
        "Postcode": "78041",
        "CountryID": 2,
        "Latitude": 27.528418,
        "Longitude": -99.458211,
        "ContactTelephone1": "956-523-8888",
        "AccessComments": "Dealership business hours\r\nPublic - Call ahead",
        "RelatedURL": "",
        "DistanceUnit": 0
    },
    "Connections": [
        {
            "ID": 168990,
            "ConnectionTypeID": 1,
            "LevelID": 2,
            "Amps": 16,
            "Voltage": 230,
            "PowerKW": 3.7,
            "CurrentTypeID": 10,
            "Quantity": 1
        }
    ],
    "DateLastStatusUpdate": "2020-06-26T02:52:00Z",
    "DataQualityLevel": 3,
    "DateCreated": "2019-04-01T04:59:00Z",
    "SubmissionStatusTypeID": 100
}