{
    "IsRecentlyVerified": false,
    "ID": 56498,
    "UUID": "FDA6B157-9244-4DCA-8A5D-6651CED4BC5F",
    "DataProviderID": 1,
    "OperatorID": 23,
    "OperatorsReference": "10420",
    "UsageTypeID": 1,
    "UsageCost": "Free",
    "AddressInfo": {
        "ID": 56844,
        "Title": "Seal Cove Inn - Tesla",
        "AddressLine1": "221 Cypress Ave",
        "Town": "Moss Beach",
        "StateOrProvince": "CA",
        "Postcode": "94038",
        "CountryID": 2,
        "Latitude": 37.5220717,
        "Longitude": -122.5135405,
        "ContactTelephone1": "650-728-4114  877-798-3752",
        "AccessComments": "24 hours daily; for Tesla use only; for guest use only; see front desk for access",
        "RelatedURL": "http://www.teslamotors.com/supercharger",
        "DistanceUnit": 0
    },
    "Connections": [
        {
            "ID": 71256,
            "ConnectionTypeID": 30,
            "StatusTypeID": 50,
            "LevelID": 2,
            "Amps": 16,
            "Voltage": 230,
            "PowerKW": 8,
            "CurrentTypeID": 10,
            "Quantity": 1
        }
    ],
    "NumberOfPoints": 1,
    "StatusTypeID": 50,
    "DateLastStatusUpdate": "2017-01-26T16:51:00Z",
    "DataQualityLevel": 3,
    "DateCreated": "2015-11-04T08:42:00Z",
    "SubmissionStatusTypeID": 100
}