{
    "IsRecentlyVerified": false,
    "ID": 126224,
    "UUID": "ED99F98E-A7DA-4D01-8E22-6924A66D4F70",
    "DataProviderID": 1,
    "OperatorID": 3,
    "OperatorsReference": "PG-94222,PG-94253",
    "UsageTypeID": 4,
    "UsageCost": "£0.15/kWh",
    "AddressInfo": {
        "ID": 126570,
        "Title": "Royal Orthopaedic Hospital",
        "AddressLine1": "The Woodlands",
        "Town": "Bristol Road South",
        "StateOrProvince": "Birmingham",
        "Postcode": "B31 2AP",
        "CountryID": 1,
        "Latitude": 52.419858,
        "Longitude": -1.961975,
        "DistanceUnit": 0
    },
    "Connections": [
        {
            "ID": 176906,
            "ConnectionTypeID": 25,
            "StatusTypeID": 50,
            "LevelID": 2,
            "Amps": 32,
            "Voltage": 230,
            "PowerKW": 7,
            "CurrentTypeID": 10,
            "Quantity": 2
        }
    ],
    "NumberOfPoints": 2,
    "GeneralComments": "This is an open charge unit installed at the Royal Orthopaedic Hospital site at The Woodlands, Bristol Road South, Birmingham",
    "StatusTypeID": 50,
    "DateLastStatusUpdate": "2019-05-13T16:37:00Z",
    "DataQualityLevel": 1,
    "DateCreated": "2019-05-13T14:54:00Z",
    "SubmissionStatusTypeID": 200
}