{
    "IsRecentlyVerified": false,
    "ID": 124216,
    "UUID": "1CAC48E1-FFCC-4F1B-AD3E-2608CD6F4C9E",
    "DataProviderID": 2,
    "DataProvidersReference": "63221",
    "OperatorID": 5,
    "UsageTypeID": 1,
    "AddressInfo": {
        "ID": 124562,
        "Title": "BMW FACILITIES",
        "AddressLine1": "1101 Runway Dr",
        "Town": "Stockton",
        "StateOrProvince": "CA",
        "Postcode": "95206",
        "CountryID": 2,
        "Latitude": 37.8960208,
        "Longitude": -121.2680144,
        "ContactTelephone1": "888-758-4389",
        "AccessComments": "24 hours daily",
        "RelatedURL": "http://www.chargepoint.com/",
        "DistanceUnit": 0
    },
    "Connections": [
        {
            "ID": 174288,
            "ConnectionTypeID": 1,
            "LevelID": 2,
            "Amps": 16,
            "Voltage": 230,
            "PowerKW": 3,
            "CurrentTypeID": 10,
            "Quantity": 2
        }
    ],
    "DateLastStatusUpdate": "2019-12-24T09:14:00Z",
    "DataQualityLevel": 3,
    "DateCreated": "2019-04-06T05:03:00Z",
    "SubmissionStatusTypeID": 100
}