{
    "IsRecentlyVerified": false,
    "ID": 141878,
    "UUID": "677E465E-E799-489E-B8E9-9601DCB9D72A",
    "DataProviderID": 2,
    "DataProvidersReference": "145081",
    "OperatorID": 5,
    "UsageTypeID": 1,
    "AddressInfo": {
        "ID": 142230,
        "Title": "JEFFCO",
        "AddressLine1": "100 Jefferson County Parkway",
        "Town": "Golden",
        "StateOrProvince": "CO",
        "Postcode": "80401",
        "CountryID": 2,
        "Latitude": 39.729129,
        "Longitude": -105.200386,
        "ContactTelephone1": "888-758-4389",
        "AccessComments": "24 hours daily",
        "RelatedURL": "http://www.chargepoint.com/",
        "DistanceUnit": 0
    },
    "Connections": [
        {
            "ID": 197916,
            "ConnectionTypeID": 1,
            "LevelID": 2,
            "Amps": 16,
            "Voltage": 230,
            "PowerKW": 3.7,
            "CurrentTypeID": 10,
            "Quantity": 4
        }
    ],
    "StatusTypeID": 50,
    "DateLastStatusUpdate": "2020-06-26T03:02:00Z",
    "DataQualityLevel": 3,
    "DateCreated": "2019-12-24T09:16:00Z",
    "SubmissionStatusTypeID": 100
}