{
    "IsRecentlyVerified": false,
    "ID": 35698,
    "UUID": "96293609-DC67-49F2-865B-B9B54B759CEB",
    "DataProviderID": 26,
    "DataProvidersReference": "34050",
    "OperatorID": 73,
    "OperatorsReference": "EV-Box EVB-P1243076",
    "UsageCost": "0.00 jaarabonnement",
    "AddressInfo": {
        "ID": 36044,
        "Title": "Lomanlaan",
        "AddressLine1": "Lomanlaan",
        "Town": "Utrecht",
        "Postcode": "3526 XB",
        "CountryID": 159,
        "Latitude": 52.07443,
        "Longitude": 5.10088,
        "RelatedURL": "http://www.ev-box.nl",
        "DistanceUnit": 0
    },
    "Connections": [
        {
            "ID": 39209,
            "ConnectionTypeID": 25,
            "LevelID": 2,
            "PowerKW": 5,
            "CurrentTypeID": 10
        }
    ],
    "NumberOfPoints": 1,
    "StatusTypeID": 50,
    "DateLastStatusUpdate": "2016-03-03T12:38:00Z",
    "DataQualityLevel": 3,
    "DateCreated": "2015-01-09T06:05:00Z",
    "SubmissionStatusTypeID": 100
}