{
    "IsRecentlyVerified": false,
    "ID": 109375,
    "UUID": "96EDBAF6-63CB-40CF-AE61-A91E9BDB91AA",
    "DataProviderID": 1,
    "OperatorID": 23,
    "OperatorsReference": "46034",
    "UsageTypeID": 4,
    "AddressInfo": {
        "ID": 109721,
        "Title": "Morrison-Clark Historic Inn & Restaurant",
        "AddressLine1": "1011 L St NW",
        "Town": "Washington",
        "StateOrProvince": "DC",
        "Postcode": "20001",
        "CountryID": 2,
        "Latitude": 38.9043681,
        "Longitude": -77.0267268,
        "ContactTelephone1": "(202) 898-1200",
        "DistanceUnit": 0
    },
    "Connections": [
        {
            "ID": 154493,
            "ConnectionTypeID": 30,
            "StatusTypeID": 50,
            "LevelID": 2,
            "PowerKW": 16,
            "CurrentTypeID": 20,
            "Quantity": 3
        }
    ],
    "NumberOfPoints": 3,
    "GeneralComments": "3 Tesla Connectors, up to 16kW.Available for customers. Please see front desk.",
    "StatusTypeID": 50,
    "DateLastStatusUpdate": "2018-10-11T14:46:00Z",
    "DataQualityLevel": 1,
    "DateCreated": "2018-10-11T14:46:00Z",
    "SubmissionStatusTypeID": 200
}