{
    "IsRecentlyVerified": false,
    "ID": 77643,
    "UUID": "92C88A76-2E45-45F2-B066-7298238B1220",
    "DataProviderID": 1,
    "OperatorID": 45,
    "UsageTypeID": 6,
    "AddressInfo": {
        "ID": 77989,
        "Title": " Hotel Post Tolderhof",
        "AddressLine1": "Vicolo della Chiesa, 6",
        "AddressLine2": "Valdaora di Sopra",
        "Town": "Valdaora",
        "StateOrProvince": "BZ",
        "Postcode": "39030 ",
        "CountryID": 112,
        "Latitude": 46.75781422397794,
        "Longitude": 12.039930357510244,
        "ContactTelephone1": "+39 0474 496127 ",
        "ContactEmail": "info@hotelpost-tolderhof.com",
        "RelatedURL": "http://www.hotelpost-tolderhof.com/",
        "DistanceUnit": 0
    },
    "Connections": [
        {
            "ID": 112163,
            "ConnectionTypeID": 1036,
            "StatusTypeID": 50,
            "LevelID": 2,
            "Amps": 16,
            "Voltage": 400,
            "PowerKW": 11,
            "CurrentTypeID": 20,
            "Quantity": 1
        }
    ],
    "NumberOfPoints": 1,
    "GeneralComments": "Tesla Destination Charging\r\n",
    "StatusTypeID": 50,
    "DateLastStatusUpdate": "2017-01-20T17:00:00Z",
    "DataQualityLevel": 1,
    "DateCreated": "2017-01-20T17:00:00Z",
    "SubmissionStatusTypeID": 200
}