{
    "IsRecentlyVerified": false,
    "ID": 45586,
    "UUID": "33F5DC04-298A-4A8C-9C79-8A78CEFA190C",
    "DataProviderID": 1,
    "DataProvidersReference": "2535",
    "AddressInfo": {
        "ID": 45932,
        "Title": "Västra varvsgatan",
        "AddressLine1": "Västra varvsgatan ",
        "Town": "MALMÖ",
        "StateOrProvince": "SKÅNE",
        "Postcode": "21116",
        "CountryID": 216,
        "Latitude": 55.61544,
        "Longitude": 12.98439,
        "AccessComments": "Badplatsparkeringen, Scaniaplatsen",
        "DistanceUnit": 0
    },
    "Connections": [
        {
            "ID": 56249,
            "ConnectionTypeID": 0,
            "Reference": "1",
            "LevelID": 2,
            "Amps": 16,
            "Voltage": 230,
            "PowerKW": 3.7,
            "Comments": "Mode 3"
        },
        {
            "ID": 87747,
            "ConnectionTypeID": 0,
            "Reference": "2",
            "LevelID": 2,
            "Amps": 16,
            "Voltage": 230,
            "PowerKW": 3.7,
            "Comments": "Mode 3"
        }
    ],
    "NumberOfPoints": 2,
    "DateLastStatusUpdate": "2020-05-26T08:21:00Z",
    "DataQualityLevel": 2,
    "DateCreated": "2015-05-03T00:54:00Z",
    "SubmissionStatusTypeID": 100
}