{
    "IsRecentlyVerified": false,
    "ID": 57257,
    "UUID": "251255BE-F678-49EA-8292-906E1F28D925",
    "DataProviderID": 2,
    "DataProvidersReference": "71287",
    "OperatorID": 5,
    "UsageTypeID": 1,
    "AddressInfo": {
        "ID": 57603,
        "Title": "FARMERS MARKET",
        "AddressLine1": "23 W Salisbury St",
        "Town": "Denton",
        "StateOrProvince": "NC",
        "Postcode": "27239",
        "CountryID": 2,
        "Latitude": 35.6333797,
        "Longitude": -80.1138796,
        "ContactTelephone1": "888-758-4389",
        "AccessComments": "24 hours daily",
        "RelatedURL": "http://www.chargepoint.com/",
        "DistanceUnit": 0
    },
    "Connections": [
        {
            "ID": 72354,
            "ConnectionTypeID": 1,
            "LevelID": 2,
            "Amps": 16,
            "Voltage": 230,
            "PowerKW": 3,
            "CurrentTypeID": 10,
            "Quantity": 1
        }
    ],
    "DateLastStatusUpdate": "2019-04-06T04:02:00Z",
    "DataQualityLevel": 3,
    "DateCreated": "2015-11-30T11:50:00Z",
    "SubmissionStatusTypeID": 100
}