{
    "IsRecentlyVerified": false,
    "ID": 86051,
    "UUID": "C3D8D5D1-CA62-426F-949E-320C687D2BC5",
    "DataProviderID": 1,
    "OperatorID": 45,
    "UsageTypeID": 1,
    "AddressInfo": {
        "ID": 86397,
        "Title": "Kirchplatz",
        "AddressLine1": "Eutiner Straße 8",
        "Town": "Lensahn",
        "StateOrProvince": "Lensahn",
        "Postcode": "23738",
        "CountryID": 87,
        "Latitude": 54.22000226864231,
        "Longitude": 10.884625654106124,
        "AccessComments": "24/7 nutzbar",
        "RelatedURL": "http://www.eksh.org/",
        "DistanceUnit": 0
    },
    "Connections": [
        {
            "ID": 122383,
            "ConnectionTypeID": 25,
            "StatusTypeID": 50,
            "LevelID": 2,
            "Amps": 32,
            "Voltage": 400,
            "PowerKW": 22,
            "CurrentTypeID": 20,
            "Quantity": 2
        }
    ],
    "NumberOfPoints": 2,
    "StatusTypeID": 50,
    "DateLastStatusUpdate": "2017-04-24T07:06:00Z",
    "DataQualityLevel": 1,
    "DateCreated": "2017-04-24T07:06:00Z",
    "SubmissionStatusTypeID": 200
}