{
    "IsRecentlyVerified": false,
    "ID": 160052,
    "UUID": "9B621B76-AB69-40BE-859E-2999210842CA",
    "DataProviderID": 2,
    "DataProvidersReference": "163605",
    "OperatorID": 5,
    "UsageTypeID": 1,
    "AddressInfo": {
        "ID": 160409,
        "Title": "GR. LAWRENCE",
        "AddressLine1": "57 River Rd",
        "Town": "Andover",
        "StateOrProvince": "MA",
        "Postcode": "01810",
        "CountryID": 2,
        "Latitude": 42.690506,
        "Longitude": -71.197218,
        "ContactTelephone1": "888-758-4389",
        "AccessComments": "24 hours daily",
        "RelatedURL": "http://www.chargepoint.com/",
        "DistanceUnit": 0
    },
    "Connections": [
        {
            "ID": 230287,
            "ConnectionTypeID": 1,
            "LevelID": 2,
            "Amps": 16,
            "Voltage": 230,
            "PowerKW": 3.7,
            "CurrentTypeID": 10,
            "Quantity": 10
        }
    ],
    "StatusTypeID": 50,
    "DateLastStatusUpdate": "2020-06-26T03:06:00Z",
    "DataQualityLevel": 3,
    "DateCreated": "2020-06-26T03:06:00Z",
    "SubmissionStatusTypeID": 100
}