{
    "IsRecentlyVerified": false,
    "ID": 39124,
    "UUID": "AB649768-89D2-46B1-8431-22A5669B8BC0",
    "DataProviderID": 26,
    "DataProvidersReference": "46999",
    "OperatorID": 178,
    "OperatorsReference": "EVnetNL AL136",
    "UsageCost": "0.00 jaarabonnement",
    "AddressInfo": {
        "ID": 39470,
        "Title": "Boereglop 4",
        "AddressLine1": "Boereglop 4",
        "Town": "Vlieland",
        "Postcode": "8899 CA",
        "CountryID": 159,
        "Latitude": 53.296696,
        "Longitude": 5.069965,
        "ContactTelephone1": "0800-3522365",
        "RelatedURL": "http://www.evnet.nl",
        "DistanceUnit": 0
    },
    "Connections": [
        {
            "ID": 42635,
            "ConnectionTypeID": 25,
            "LevelID": 2,
            "PowerKW": 11,
            "CurrentTypeID": 10
        }
    ],
    "NumberOfPoints": 1,
    "StatusTypeID": 50,
    "DateLastStatusUpdate": "2016-06-04T02:56:00Z",
    "DataQualityLevel": 3,
    "DateCreated": "2015-01-09T06:08:00Z",
    "SubmissionStatusTypeID": 100
}