{
    "IsRecentlyVerified": false,
    "ID": 129781,
    "UUID": "E350921D-459C-4FDA-9CDE-912B8BFAB32C",
    "DataProviderID": 1,
    "OperatorID": 80,
    "UsageTypeID": 4,
    "AddressInfo": {
        "ID": 130127,
        "Title": "Gaeta Monte Tortone | EnelX",
        "AddressLine1": "Via di Monte Tortone",
        "Town": "Gaeta",
        "StateOrProvince": "LT",
        "Postcode": "04024",
        "CountryID": 112,
        "Latitude": 41.2314301065025,
        "Longitude": 13.5542452089419,
        "ContactTelephone1": "800.069.850",
        "RelatedURL": "https://www.enelx.com/it/it/emobility",
        "DistanceUnit": 0
    },
    "Connections": [
        {
            "ID": 181672,
            "ConnectionTypeID": 25,
            "StatusTypeID": 50,
            "LevelID": 2,
            "Amps": 32,
            "Voltage": 400,
            "PowerKW": 22,
            "CurrentTypeID": 20,
            "Quantity": 1
        },
        {
            "ID": 181673,
            "ConnectionTypeID": 36,
            "StatusTypeID": 50,
            "LevelID": 2,
            "Amps": 16,
            "Voltage": 240,
            "PowerKW": 3.7,
            "CurrentTypeID": 10,
            "Quantity": 1
        }
    ],
    "NumberOfPoints": 2,
    "StatusTypeID": 50,
    "DateLastStatusUpdate": "2019-07-26T07:31:00Z",
    "DataQualityLevel": 1,
    "DateCreated": "2019-07-26T07:31:00Z",
    "SubmissionStatusTypeID": 200
}