{
    "IsRecentlyVerified": false,
    "ID": 41361,
    "UUID": "B1E666E8-08C8-4FAA-A31C-D960A7BC8172",
    "DataProviderID": 2,
    "DataProvidersReference": "51515",
    "UsageTypeID": 1,
    "AddressInfo": {
        "ID": 41707,
        "Title": "City of Morro Bay - Chamber of Commerce",
        "AddressLine1": "695 Harbor St",
        "Town": "Morro Bay",
        "StateOrProvince": "CA",
        "Postcode": "93442",
        "CountryID": 2,
        "Latitude": 35.366911,
        "Longitude": -120.845475,
        "ContactTelephone1": "805-772-4467",
        "AccessComments": "24 hours daily; Also accepts MobileNOW! Phone application",
        "RelatedURL": "",
        "DistanceUnit": 0
    },
    "Connections": [
        {
            "ID": 45201,
            "ConnectionTypeID": 1,
            "LevelID": 2,
            "Amps": 16,
            "Voltage": 230,
            "PowerKW": 3.7,
            "CurrentTypeID": 10,
            "Quantity": 1
        }
    ],
    "DateLastStatusUpdate": "2020-06-26T02:58:00Z",
    "DataQualityLevel": 3,
    "DateCreated": "2015-02-02T06:34:00Z",
    "SubmissionStatusTypeID": 100
}