{
    "IsRecentlyVerified": false,
    "ID": 12942,
    "UUID": "09F4F396-B0C1-48C4-B3C6-FB98563642B8",
    "DataProviderID": 15,
    "DataProvidersReference": "22225",
    "OperatorID": 5,
    "UsageTypeID": 2,
    "AddressInfo": {
        "ID": 12839,
        "Title": "50 LINCOLN COURT AVENUE",
        "AddressLine1": "50 LINCOLN COURT AVENUE",
        "Town": "ATLANTA",
        "StateOrProvince": "GA",
        "Postcode": "30329",
        "CountryID": 2,
        "Latitude": 33.8373,
        "Longitude": -84.33769,
        "ContactTelephone1": "(404) 633-4232",
        "RelatedURL": "http://carstations.com/22225",
        "DistanceUnit": 0
    },
    "Connections": [
        {
            "ID": 10375,
            "ConnectionTypeID": 1,
            "Reference": "J1772",
            "LevelID": 2
        }
    ],
    "NumberOfPoints": 1,
    "StatusTypeID": 0,
    "DateLastStatusUpdate": "2017-11-04T14:04:00Z",
    "DataQualityLevel": 2,
    "DateCreated": "2012-09-07T19:25:00Z",
    "SubmissionStatusTypeID": 100
}