{
    "IsRecentlyVerified": false,
    "ID": 140546,
    "UUID": "69CF132E-685F-4B5A-BD29-B6DA9F752D4C",
    "DataProviderID": 2,
    "DataProvidersReference": "93047",
    "OperatorID": 15,
    "UsageTypeID": 4,
    "AddressInfo": {
        "ID": 140898,
        "Title": "Nob Hill Foods",
        "AddressLine1": "1320 S Main St",
        "Town": "Salinas",
        "StateOrProvince": "CA",
        "Postcode": "93901",
        "CountryID": 2,
        "Latitude": 36.655845,
        "Longitude": -121.661384,
        "ContactTelephone1": "877-455-3833",
        "AccessComments": "24 hours daily\r\nPublic - Card key at all times",
        "RelatedURL": "https://www.evgo.com/",
        "DistanceUnit": 0
    },
    "Connections": [
        {
            "ID": 196199,
            "ConnectionTypeID": 2,
            "LevelID": 3,
            "Amps": 100,
            "Voltage": 400,
            "PowerKW": 40,
            "CurrentTypeID": 30,
            "Quantity": 1
        },
        {
            "ID": 196200,
            "ConnectionTypeID": 32,
            "LevelID": 3,
            "Amps": 100,
            "Voltage": 400,
            "PowerKW": 40,
            "CurrentTypeID": 30,
            "Quantity": 1
        }
    ],
    "StatusTypeID": 50,
    "DateLastStatusUpdate": "2020-06-26T02:58:00Z",
    "DataQualityLevel": 3,
    "DateCreated": "2019-12-24T09:13:00Z",
    "SubmissionStatusTypeID": 100
}