{
    "IsRecentlyVerified": false,
    "ID": 14240,
    "UUID": "2B717985-1E5D-445D-BE52-3D0D0EE437E0",
    "DataProviderID": 2,
    "DataProvidersReference": "46486",
    "UsageTypeID": 7,
    "AddressInfo": {
        "ID": 14137,
        "Title": "Vaden Nissan of Statesboro",
        "AddressLine1": "686 Brannen St",
        "Town": "Statesboro",
        "StateOrProvince": "GA",
        "Postcode": "30458",
        "CountryID": 2,
        "Latitude": 32.423702,
        "Longitude": -81.791801,
        "ContactTelephone1": "912-681-4700",
        "AccessComments": "Dealership business hours\r\nPublic - Call ahead",
        "RelatedURL": "",
        "DistanceUnit": 0
    },
    "Connections": [
        {
            "ID": 16512,
            "ConnectionTypeID": 1,
            "LevelID": 2,
            "Amps": 16,
            "Voltage": 230,
            "PowerKW": 3.7,
            "CurrentTypeID": 10,
            "Quantity": 1
        },
        {
            "ID": 21613,
            "ConnectionTypeID": 1,
            "LevelID": 2,
            "Quantity": 1
        }
    ],
    "DateLastStatusUpdate": "2020-06-26T02:54:00Z",
    "DataQualityLevel": 3,
    "DateCreated": "2012-12-06T16:49:00Z",
    "SubmissionStatusTypeID": 100
}