{
    "IsRecentlyVerified": false,
    "ID": 65401,
    "UUID": "ACC0BF81-621D-4D61-A9CD-E07B88B7D293",
    "DataProviderID": 26,
    "DataProvidersReference": "85358",
    "OperatorID": 157,
    "OperatorsReference": "NewMotion 03005879",
    "UsageCost": "0.00 jaarabonnement",
    "AddressInfo": {
        "ID": 65747,
        "Title": "Kruiwagenstraat 20",
        "AddressLine1": "Kruiwagenstraat 20",
        "Town": "Mol",
        "Postcode": "2400",
        "CountryID": 26,
        "Latitude": 51.2090618,
        "Longitude": 5.19921399999998,
        "ContactTelephone1": "088 0109500",
        "RelatedURL": "http://thenewmotion.nl/",
        "DistanceUnit": 0
    },
    "Connections": [
        {
            "ID": 90113,
            "ConnectionTypeID": 25,
            "LevelID": 2,
            "PowerKW": 22,
            "CurrentTypeID": 10
        }
    ],
    "NumberOfPoints": 1,
    "StatusTypeID": 50,
    "DateLastStatusUpdate": "2016-06-04T02:38:00Z",
    "DataQualityLevel": 3,
    "DateCreated": "2016-04-27T09:41:00Z",
    "SubmissionStatusTypeID": 100
}