{
    "IsRecentlyVerified": false,
    "ID": 29044,
    "UUID": "C7B5BBE9-57A8-4147-AFE4-89C9F1A7EBEB",
    "DataProviderID": 2,
    "DataProvidersReference": "63774",
    "OperatorID": 5,
    "UsageTypeID": 1,
    "AddressInfo": {
        "ID": 29390,
        "Title": "PUBLIC STATIONS",
        "AddressLine1": "318 W. Mifflin Street",
        "Town": "Madison",
        "StateOrProvince": "WI",
        "Postcode": "53703",
        "CountryID": 2,
        "Latitude": 43.073352,
        "Longitude": -89.389284,
        "ContactTelephone1": "888-758-4389",
        "AccessComments": "24 hours daily",
        "RelatedURL": "http://www.chargepoint.com/",
        "DistanceUnit": 0
    },
    "Connections": [
        {
            "ID": 31916,
            "ConnectionTypeID": 1,
            "LevelID": 2,
            "Amps": 16,
            "Voltage": 230,
            "PowerKW": 3.7,
            "CurrentTypeID": 10,
            "Quantity": 3
        },
        {
            "ID": 31917,
            "ConnectionTypeID": 1,
            "LevelID": 2,
            "Amps": 16,
            "Voltage": 230,
            "PowerKW": 3,
            "CurrentTypeID": 10,
            "Quantity": 3
        }
    ],
    "DateLastStatusUpdate": "2020-06-26T03:06:00Z",
    "DataQualityLevel": 3,
    "DateCreated": "2014-11-28T03:38:00Z",
    "SubmissionStatusTypeID": 100
}