{
    "IsRecentlyVerified": false,
    "ID": 118367,
    "UUID": "AA7AB66E-FEC6-477C-AEE2-0A389844A96B",
    "DataProviderID": 1,
    "OperatorID": 3341,
    "OperatorsReference": "UK*SEC*ESEC10076",
    "UsageTypeID": 4,
    "UsageCost": "£0.30/kWh. Overstay of £10 after charging finishes",
    "AddressInfo": {
        "ID": 118713,
        "Title": "Northwick Park Hospital",
        "AddressLine1": "Watford Road",
        "Town": "Harrow",
        "StateOrProvince": "England",
        "Postcode": "HA1 3UJ",
        "CountryID": 1,
        "Latitude": 51.574984,
        "Longitude": -0.319111,
        "DistanceUnit": 0
    },
    "Connections": [
        {
            "ID": 167451,
            "ConnectionTypeID": 25,
            "StatusTypeID": 50,
            "LevelID": 2,
            "Amps": 32,
            "Voltage": 230,
            "PowerKW": 7,
            "CurrentTypeID": 10,
            "Quantity": 2
        }
    ],
    "NumberOfPoints": 2,
    "StatusTypeID": 50,
    "DateLastStatusUpdate": "2019-03-22T14:05:00Z",
    "DataQualityLevel": 1,
    "DateCreated": "2019-03-22T14:04:00Z",
    "SubmissionStatusTypeID": 200
}