{
    "MediaItems": [
        {
            "ID": 19474,
            "ChargePointID": 117829,
            "ItemURL": "https://s3-ap-southeast-2.amazonaws.com/openchargemap/images/CA/OCM117829/OCM-117829.orig.2019090500530472.png",
            "ItemThumbnailURL": "https://s3-ap-southeast-2.amazonaws.com/openchargemap/images/CA/OCM117829/OCM-117829.thmb.2019090500530472.png",
            "Comment": "",
            "IsEnabled": true,
            "IsVideo": false,
            "IsFeaturedItem": false,
            "IsExternalResource": false,
            "User": {
                "ID": 22160,
                "Username": "NCAMIRE"
            },
            "DateCreated": "2019-09-05T00:53:00Z"
        }
    ],
    "IsRecentlyVerified": false,
    "ID": 117829,
    "UUID": "EA2E9CCD-7632-49CB-88C0-ED11F7281B2E",
    "DataProviderID": 1,
    "OperatorID": 90,
    "UsageTypeID": 4,
    "UsageCost": "11.50$/h",
    "AddressInfo": {
        "ID": 118175,
        "Title": "BRCC - Val-d'Or - Dépanneur Voisin Beauséjour",
        "AddressLine1": "315 QC-117",
        "Town": "Val d'Or",
        "StateOrProvince": "Quebec",
        "Postcode": "J0P7C4",
        "CountryID": 44,
        "Latitude": 48.0725346612798,
        "Longitude": -77.3829121740763,
        "DistanceUnit": 0
    },
    "Connections": [
        {
            "ID": 166742,
            "ConnectionTypeID": 2,
            "StatusTypeID": 50,
            "LevelID": 3,
            "Amps": 125,
            "Voltage": 400,
            "PowerKW": 50,
            "CurrentTypeID": 30,
            "Quantity": 1
        },
        {
            "ID": 166743,
            "ConnectionTypeID": 32,
            "StatusTypeID": 50,
            "LevelID": 3,
            "Amps": 125,
            "Voltage": 400,
            "PowerKW": 50,
            "CurrentTypeID": 30,
            "Quantity": 1
        }
    ],
    "NumberOfPoints": 1,
    "GeneralComments": "Dans le stationnement du Dépanneur Voisin Beauséjour/ Station de service Ultramar",
    "StatusTypeID": 50,
    "DateLastStatusUpdate": "2019-09-06T12:31:00Z",
    "DataQualityLevel": 1,
    "DateCreated": "2019-03-04T00:05:00Z",
    "SubmissionStatusTypeID": 200
}