{
    "IsRecentlyVerified": false,
    "ID": 17908,
    "UUID": "AD6AE764-3D09-44E8-9626-356A215852D6",
    "DataProviderID": 22,
    "DataProvidersReference": "980017891FF67CF8A20F23AA810E7B5A",
    "AddressInfo": {
        "ID": 18253,
        "Title": "農匠の郷やくの",
        "AddressLine1": "京都府福知山市夜久野町平野2150",
        "CountryID": 114,
        "Latitude": 35.33830408,
        "Longitude": 134.9305858,
        "ContactTelephone1": "0773-38-0001",
        "DistanceUnit": 0
    },
    "Connections": [
        {
            "ID": 18149,
            "ConnectionTypeID": 2,
            "LevelID": 2,
            "Amps": 100,
            "Voltage": 480,
            "PowerKW": 48,
            "Quantity": 1
        }
    ],
    "DateLastStatusUpdate": "2013-06-29T09:04:00Z",
    "DataQualityLevel": 2,
    "DateCreated": "2013-06-29T09:04:00Z",
    "SubmissionStatusTypeID": 200
}