{
    "IsRecentlyVerified": false,
    "ID": 62491,
    "UUID": "3324FD56-95D6-495F-9072-DEC3165B7439",
    "DataProviderID": 1,
    "OperatorID": 23,
    "OperatorsReference": "9135",
    "UsageTypeID": 7,
    "UsageCost": "Free",
    "AddressInfo": {
        "ID": 62837,
        "Title": "Warm Springs Inn and Winery - Tesla",
        "AddressLine1": "1611 Love Ln",
        "Town": "Wenatchee",
        "StateOrProvince": "WA",
        "Postcode": "98801",
        "CountryID": 2,
        "Latitude": 47.47487,
        "Longitude": -120.376005,
        "ContactTelephone1": "509-662-5683  877-798-3752",
        "AccessComments": "24 hours daily; for Tesla use only; for guest use only",
        "RelatedURL": "http://www.teslamotors.com/supercharger",
        "DistanceUnit": 0
    },
    "Connections": [
        {
            "ID": 79397,
            "ConnectionTypeID": 30,
            "StatusTypeID": 50,
            "LevelID": 2,
            "Amps": 16,
            "Voltage": 230,
            "PowerKW": 8,
            "CurrentTypeID": 10,
            "Quantity": 1
        }
    ],
    "NumberOfPoints": 1,
    "StatusTypeID": 50,
    "DateLastStatusUpdate": "2017-01-26T20:20:00Z",
    "DataQualityLevel": 3,
    "DateCreated": "2016-03-03T11:39:00Z",
    "SubmissionStatusTypeID": 100
}