{
    "IsRecentlyVerified": false,
    "ID": 37324,
    "UUID": "4A4BBA5A-F091-4760-8D3B-E04D1AA49D8D",
    "DataProviderID": 26,
    "DataProvidersReference": "47691",
    "OperatorID": 178,
    "OperatorsReference": "EVnetNL AL841",
    "UsageCost": "0.00 jaarabonnement",
    "AddressInfo": {
        "ID": 37670,
        "Title": "Amstellaan 10",
        "AddressLine1": "Amstellaan 10",
        "Town": "Heemstede",
        "Postcode": "2105 VE",
        "CountryID": 159,
        "Latitude": 52.344846,
        "Longitude": 4.602713,
        "ContactTelephone1": "0800-3522365",
        "RelatedURL": "http://www.evnet.nl",
        "DistanceUnit": 0
    },
    "Connections": [
        {
            "ID": 40835,
            "ConnectionTypeID": 25,
            "LevelID": 2,
            "PowerKW": 11,
            "CurrentTypeID": 10
        }
    ],
    "NumberOfPoints": 2,
    "StatusTypeID": 50,
    "DateLastStatusUpdate": "2016-06-04T02:53:00Z",
    "DataQualityLevel": 3,
    "DateCreated": "2015-01-09T06:07:00Z",
    "SubmissionStatusTypeID": 100
}