{
    "IsRecentlyVerified": false,
    "ID": 38405,
    "UUID": "B71B60FF-5506-49EA-989B-5A16D5D4D0C4",
    "DataProviderID": 1,
    "OperatorID": 105,
    "OperatorsReference": "Essent EM-DE-11000000-04-00029",
    "UsageTypeID": 4,
    "AddressInfo": {
        "ID": 38751,
        "Title": "Spandauer Damm 148",
        "AddressLine1": "Spandauer Damm 148",
        "Town": "Berlin",
        "Postcode": "14050",
        "CountryID": 87,
        "Latitude": 52.519446,
        "Longitude": 13.272981,
        "DistanceUnit": 0
    },
    "Connections": [
        {
            "ID": 41916,
            "ConnectionTypeID": 25,
            "LevelID": 2,
            "PowerKW": 11
        }
    ],
    "NumberOfPoints": 1,
    "StatusTypeID": 50,
    "DateLastStatusUpdate": "2015-04-12T19:33:00Z",
    "DataQualityLevel": 3,
    "DateCreated": "2015-01-09T06:07:00Z",
    "SubmissionStatusTypeID": 200
}