{
    "IsRecentlyVerified": false,
    "ID": 142824,
    "UUID": "F5080DFB-1472-408B-A175-D91B8EC75451",
    "DataProviderID": 2,
    "DataProvidersReference": "150347",
    "OperatorID": 5,
    "UsageTypeID": 1,
    "AddressInfo": {
        "ID": 143176,
        "Title": "SAKR SPA",
        "AddressLine1": "1589 Fall River Ave",
        "Town": "Seekonk",
        "StateOrProvince": "MA",
        "Postcode": "02771",
        "CountryID": 2,
        "Latitude": 41.784629,
        "Longitude": -71.31177,
        "ContactTelephone1": "888-758-4389",
        "AccessComments": "24 hours daily",
        "RelatedURL": "http://www.chargepoint.com/",
        "DistanceUnit": 0
    },
    "Connections": [
        {
            "ID": 199048,
            "ConnectionTypeID": 1,
            "LevelID": 2,
            "Amps": 16,
            "Voltage": 230,
            "PowerKW": 3.7,
            "CurrentTypeID": 10,
            "Quantity": 4
        }
    ],
    "StatusTypeID": 50,
    "DateLastStatusUpdate": "2020-06-26T03:05:00Z",
    "DataQualityLevel": 3,
    "DateCreated": "2019-12-24T09:19:00Z",
    "SubmissionStatusTypeID": 100
}