{
    "IsRecentlyVerified": false,
    "ID": 48316,
    "UUID": "60E8DDE6-3F11-4D56-ADC1-D61AF2CB1BD2",
    "DataProviderID": 2,
    "DataProvidersReference": "62286",
    "UsageTypeID": 1,
    "AddressInfo": {
        "ID": 48662,
        "Title": "Semiahmoo Resort",
        "AddressLine1": "9565 Semiahmoo Pkwy",
        "Town": "Blaine",
        "StateOrProvince": "WA",
        "Postcode": "98230",
        "CountryID": 2,
        "Latitude": 48.989751,
        "Longitude": -122.773271,
        "ContactTelephone1": "360-318-2000",
        "AccessComments": "24 hours daily; for guest use only",
        "RelatedURL": "",
        "DistanceUnit": 0
    },
    "Connections": [
        {
            "ID": 59742,
            "ConnectionTypeID": 1,
            "LevelID": 2,
            "Amps": 16,
            "Voltage": 230,
            "PowerKW": 3.7,
            "CurrentTypeID": 10,
            "Quantity": 1
        }
    ],
    "DateLastStatusUpdate": "2020-06-26T03:11:00Z",
    "DataQualityLevel": 3,
    "DateCreated": "2015-06-24T11:44:00Z",
    "SubmissionStatusTypeID": 100
}