{
    "IsRecentlyVerified": false,
    "ID": 19982,
    "UUID": "1F0B2614-B965-4A56-952D-037BE7202712",
    "DataProviderID": 1,
    "OperatorID": 1,
    "UsageTypeID": 0,
    "UsageCost": "",
    "AddressInfo": {
        "ID": 20327,
        "Title": "Quai de la Touques - Deauville",
        "AddressLine1": "Quai de la Touques",
        "AddressLine2": "",
        "Town": "",
        "StateOrProvince": "Deauville",
        "Postcode": "14800",
        "CountryID": 80,
        "Latitude": 49.36225,
        "Longitude": 0.08351,
        "ContactTelephone1": "",
        "ContactTelephone2": "",
        "ContactEmail": "",
        "AccessComments": "Ouvert à tous",
        "RelatedURL": "",
        "DistanceUnit": 0
    },
    "Connections": [],
    "GeneralComments": "",
    "StatusTypeID": 50,
    "DateLastStatusUpdate": "2013-10-23T14:29:00Z",
    "DataQualityLevel": 1,
    "DateCreated": "2013-10-23T07:43:00Z",
    "SubmissionStatusTypeID": 200
}