{
    "IsRecentlyVerified": false,
    "ID": 185792,
    "UUID": "89E23DE4-7FEC-4111-A7EC-0604D50C67A1",
    "DataProviderID": 29,
    "DataProvidersReference": "3923,8535",
    "OperatorID": 45,
    "AddressInfo": {
        "ID": 186151,
        "Title": "Texas Avenue 10",
        "AddressLine1": "Texas Avenue 10",
        "Town": "Pirmasens",
        "Postcode": "66953",
        "CountryID": 87,
        "Latitude": 49.214844,
        "Longitude": 7.607091,
        "DistanceUnit": 0
    },
    "Connections": [
        {
            "ID": 296734,
            "ConnectionTypeID": 25,
            "StatusTypeID": 50,
            "LevelID": 2,
            "PowerKW": 11,
            "CurrentTypeID": 20
        },
        {
            "ID": 296735,
            "ConnectionTypeID": 25,
            "StatusTypeID": 50,
            "LevelID": 2,
            "PowerKW": 11,
            "CurrentTypeID": 20
        }
    ],
    "StatusTypeID": 50,
    "DateLastStatusUpdate": "2021-07-12T02:42:00Z",
    "MetadataValues": [
        {
            "ID": 18034,
            "MetadataFieldID": 4,
            "ItemValue": "Data from the German chargepoint registry provided by Bundesnetzagentur.de under the CC-BY 4.0 license"
        }
    ],
    "DataQualityLevel": 3,
    "DateCreated": "2021-07-12T02:42:00Z",
    "SubmissionStatusTypeID": 100
}