{
    "IsRecentlyVerified": false,
    "ID": 106969,
    "UUID": "F2C15DF0-5B7C-40BC-8E59-2800154AD8C3",
    "DataProviderID": 1,
    "OperatorID": 45,
    "UsageTypeID": 6,
    "AddressInfo": {
        "ID": 107315,
        "Title": "Supermarkt Metro",
        "AddressLine1": "Am Tönniesberg 16",
        "AddressLine2": "Stadtteil Bornum",
        "Town": "Hannover",
        "StateOrProvince": "Region Hannover",
        "Postcode": "30453",
        "CountryID": 87,
        "Latitude": 52.35033091666602,
        "Longitude": 9.699852511083918,
        "AccessComments": "In der Parkhalle zu den Öffnungszeiten kostenlos nutzbar Mo-Fr 06-21Uhr, Sa 06-20Uhr.",
        "DistanceUnit": 0
    },
    "Connections": [
        {
            "ID": 150800,
            "ConnectionTypeID": 25,
            "StatusTypeID": 50,
            "LevelID": 2,
            "Amps": 32,
            "Voltage": 400,
            "PowerKW": 22,
            "CurrentTypeID": 20,
            "Quantity": 1
        }
    ],
    "NumberOfPoints": 1,
    "StatusTypeID": 50,
    "DateLastStatusUpdate": "2018-07-11T06:41:00Z",
    "DataQualityLevel": 1,
    "DateCreated": "2018-07-11T06:41:00Z",
    "SubmissionStatusTypeID": 200
}