{
    "IsRecentlyVerified": false,
    "ID": 144440,
    "UUID": "ECC0E3CE-792B-44E9-B26F-07C7EE5512B1",
    "DataProviderID": 2,
    "DataProvidersReference": "130567",
    "OperatorID": 90,
    "UsageTypeID": 1,
    "AddressInfo": {
        "ID": 144792,
        "Title": "123 Querbes",
        "AddressLine1": "123 Avenue Querbes",
        "Town": "Montréal",
        "StateOrProvince": "QC",
        "Postcode": "H3T 1Z1",
        "CountryID": 44,
        "Latitude": 45.517794,
        "Longitude": -73.598015,
        "ContactTelephone1": "877-505-2674",
        "AccessComments": "24 hours daily",
        "RelatedURL": "https://lecircuitelectrique.com/",
        "DistanceUnit": 0
    },
    "Connections": [
        {
            "ID": 200945,
            "ConnectionTypeID": 1,
            "LevelID": 2,
            "Amps": 16,
            "Voltage": 230,
            "PowerKW": 3.7,
            "CurrentTypeID": 10,
            "Quantity": 2
        }
    ],
    "StatusTypeID": 50,
    "DateLastStatusUpdate": "2020-06-26T03:09:00Z",
    "DataQualityLevel": 3,
    "DateCreated": "2019-12-24T09:23:00Z",
    "SubmissionStatusTypeID": 100
}