{
    "IsRecentlyVerified": false,
    "ID": 150766,
    "UUID": "84982921-FC7F-4F94-A385-F0B13027322A",
    "DataProviderID": 28,
    "DataProvidersReference": "FR*S81*P81065*009",
    "OperatorID": 3257,
    "UsageTypeID": 5,
    "AddressInfo": {
        "ID": 151119,
        "Title": "CASTRES - HOSPITAL - Centre Hospitalier - Parking",
        "AddressLine1": "Centre Hospitalier - Parking 81100 CASTRES - HOSPITAL",
        "CountryID": 80,
        "Latitude": 43.56672,
        "Longitude": 2.262799,
        "AccessComments": "24h/24 7j/7",
        "DistanceUnit": 0
    },
    "Connections": [
        {
            "ID": 209923,
            "ConnectionTypeID": 2,
            "StatusTypeID": 50,
            "LevelID": 3,
            "PowerKW": 36,
            "CurrentTypeID": 30
        },
        {
            "ID": 239554,
            "ConnectionTypeID": 1036,
            "StatusTypeID": 50,
            "LevelID": 2,
            "PowerKW": 36,
            "CurrentTypeID": 20
        },
        {
            "ID": 239555,
            "ConnectionTypeID": 28,
            "StatusTypeID": 50,
            "LevelID": 2,
            "PowerKW": 4,
            "CurrentTypeID": 10
        },
        {
            "ID": 239556,
            "ConnectionTypeID": 2,
            "StatusTypeID": 50,
            "LevelID": 3,
            "PowerKW": 36,
            "CurrentTypeID": 30
        }
    ],
    "GeneralComments": "Recharge par badge et avec une application smartphone",
    "StatusTypeID": 50,
    "DateLastStatusUpdate": "2020-08-27T05:10:00Z",
    "DataQualityLevel": 2,
    "DateCreated": "2020-03-15T06:17:00Z",
    "SubmissionStatusTypeID": 100
}