{
    "IsRecentlyVerified": false,
    "ID": 34108,
    "UUID": "C9C9914E-63CF-4305-8048-7D6CE4717467",
    "DataProviderID": 26,
    "DataProvidersReference": "48709",
    "OperatorID": 178,
    "OperatorsReference": "EVnetNL REE588",
    "UsageCost": "0.00 jaarabonnement",
    "AddressInfo": {
        "ID": 34454,
        "Title": "Jan van Kleefstraat 27",
        "AddressLine1": "Jan van Kleefstraat 27",
        "Town": "Rijnwaarden",
        "Postcode": "6915 XT",
        "CountryID": 159,
        "Latitude": 51.86299,
        "Longitude": 6.11977,
        "ContactTelephone1": "0800-3522365",
        "RelatedURL": "http://www.evnet.nl",
        "DistanceUnit": 0
    },
    "Connections": [
        {
            "ID": 37619,
            "ConnectionTypeID": 25,
            "LevelID": 1,
            "PowerKW": 2.3,
            "CurrentTypeID": 10
        }
    ],
    "NumberOfPoints": 1,
    "StatusTypeID": 50,
    "DateLastStatusUpdate": "2016-06-04T02:41:00Z",
    "DataQualityLevel": 3,
    "DateCreated": "2015-01-09T06:04:00Z",
    "SubmissionStatusTypeID": 100
}