{
    "IsRecentlyVerified": false,
    "ID": 84198,
    "UUID": "13F5F856-E627-447B-B6AD-7CC816BA562F",
    "DataProviderID": 1,
    "OperatorID": 23,
    "OperatorsReference": "24621",
    "UsageTypeID": 4,
    "AddressInfo": {
        "ID": 84544,
        "Title": "Standard Parking 20 W 13th Street",
        "AddressLine1": "20 W 13th St",
        "Town": "New York",
        "StateOrProvince": "New York",
        "Postcode": "10011",
        "CountryID": 2,
        "Latitude": 40.735706,
        "Longitude": -73.995058,
        "ContactTelephone1": "(800) 836-6666",
        "DistanceUnit": 0
    },
    "Connections": [
        {
            "ID": 119599,
            "ConnectionTypeID": 30,
            "StatusTypeID": 50,
            "LevelID": 2,
            "PowerKW": 16,
            "CurrentTypeID": 20,
            "Quantity": 1
        }
    ],
    "NumberOfPoints": 1,
    "GeneralComments": "1 Tesla Connector, up to 16kW.Available to the public. Please see valet.",
    "StatusTypeID": 50,
    "DateLastStatusUpdate": "2017-02-16T17:13:00Z",
    "DataQualityLevel": 1,
    "DateCreated": "2017-02-16T17:13:00Z",
    "SubmissionStatusTypeID": 200
}