{
    "IsRecentlyVerified": false,
    "ID": 121563,
    "UUID": "F1056F3E-A4E4-4EA1-963F-608C8C14746D",
    "DataProviderID": 1,
    "OperatorID": 198,
    "UsageTypeID": 1,
    "UsageCost": "0,04€/min",
    "AddressInfo": {
        "ID": 121909,
        "Title": "Oittaan ulkoilualue",
        "AddressLine1": "Oittaantie 2",
        "AddressLine2": "Oittaa",
        "Town": "Espoo",
        "StateOrProvince": "Helsingin seutukunta",
        "Postcode": "02740",
        "CountryID": 79,
        "Latitude": 60.23910479459141,
        "Longitude": 24.65684798262248,
        "RelatedURL": "https://www.fortum.com/products-and-services/vehicle-charging/charging-locations",
        "DistanceUnit": 0
    },
    "Connections": [
        {
            "ID": 171290,
            "ConnectionTypeID": 25,
            "StatusTypeID": 50,
            "LevelID": 2,
            "Amps": 32,
            "Voltage": 400,
            "PowerKW": 22,
            "Quantity": 4
        }
    ],
    "NumberOfPoints": 4,
    "GeneralComments": "Fortum charge and drive: Espoon kaupunki Oittaa F366 & F367\r\n2x 400V 32A A - Type 2\r\n2x 400V 32A B - Type 2",
    "StatusTypeID": 50,
    "DateLastStatusUpdate": "2019-04-06T06:11:00Z",
    "DataQualityLevel": 1,
    "DateCreated": "2019-04-05T20:33:00Z",
    "SubmissionStatusTypeID": 200
}