{
    "IsRecentlyVerified": false,
    "ID": 30108,
    "UUID": "3FC2F9B0-B3C6-4F48-AF11-4DB728E1B6E6",
    "DataProviderID": 1,
    "DataProvidersReference": "LRS-00008",
    "OperatorID": 21,
    "UsageTypeID": 4,
    "UsageCost": "Mobi.E compatible card",
    "AddressInfo": {
        "ID": 30454,
        "Title": "LRS-00008",
        "AddressLine1": "Rua Olivença",
        "Town": "Loures",
        "Postcode": "2670-430",
        "CountryID": 180,
        "Latitude": 38.829018,
        "Longitude": -9.16715,
        "RelatedURL": "http://www.mobie.pt",
        "DistanceUnit": 0
    },
    "Connections": [
        {
            "ID": 33093,
            "ConnectionTypeID": 25,
            "StatusTypeID": 50,
            "LevelID": 2,
            "Amps": 16,
            "Voltage": 230,
            "PowerKW": 3.7,
            "CurrentTypeID": 10,
            "Quantity": 4
        }
    ],
    "NumberOfPoints": 4,
    "StatusTypeID": 50,
    "DateLastStatusUpdate": "2020-08-10T22:10:00Z",
    "DataQualityLevel": 3,
    "DateCreated": "2014-11-29T14:48:00Z",
    "SubmissionStatusTypeID": 100
}