{
    "UserComments": [
        {
            "ID": 11624,
            "ChargePointID": 59089,
            "CommentTypeID": 10,
            "UserName": "shosoloza",
            "Comment": "",
            "DateCreated": "2016-06-12T12:57:25.857Z",
            "User": {
                "ID": 6511,
                "Username": "shosoloza"
            },
            "CheckinStatusTypeID": 10
        },
        {
            "ID": 9583,
            "ChargePointID": 59089,
            "CommentTypeID": 10,
            "UserName": "shosoloza",
            "Comment": "4 bays",
            "Rating": 5,
            "DateCreated": "2016-01-28T06:54:20.613Z",
            "User": {
                "ID": 6511,
                "Username": "shosoloza"
            },
            "CheckinStatusTypeID": 10
        }
    ],
    "MediaItems": [
        {
            "ID": 4814,
            "ChargePointID": 59089,
            "ItemURL": "https://s3-ap-southeast-2.amazonaws.com/openchargemap/images/GB/OCM59089/OCM-59089.orig.2016012806535402.jpg",
            "ItemThumbnailURL": "https://s3-ap-southeast-2.amazonaws.com/openchargemap/images/GB/OCM59089/OCM-59089.thmb.2016012806535402.jpg",
            "Comment": "",
            "IsEnabled": true,
            "IsVideo": false,
            "IsFeaturedItem": false,
            "IsExternalResource": false,
            "User": {
                "ID": 6511,
                "Username": "shosoloza"
            },
            "DateCreated": "2016-01-28T06:54:00Z"
        }
    ],
    "IsRecentlyVerified": false,
    "ID": 59089,
    "UUID": "7113D8C8-4589-4817-A9C1-090F797305BB",
    "DataProviderID": 1,
    "OperatorID": 23,
    "OperatorsReference": "12353",
    "UsageTypeID": 4,
    "UsageCost": "£0.24/kWh;other tariffs for older cars",
    "AddressInfo": {
        "ID": 59435,
        "Title": "Keele Southbound Supercharger",
        "AddressLine1": "Keele Welcome Break M6 (S) Services",
        "Town": "Keele",
        "StateOrProvince": "Staffordshire",
        "Postcode": "ST5 5HG",
        "CountryID": 1,
        "Latitude": 52.994202,
        "Longitude": -2.290657,
        "AccessComments": "4 Supercharger stalls, available 24/7",
        "DistanceUnit": 0
    },
    "Connections": [
        {
            "ID": 74981,
            "ConnectionTypeID": 27,
            "StatusTypeID": 50,
            "LevelID": 3,
            "PowerKW": 150,
            "CurrentTypeID": 30,
            "Quantity": 4
        }
    ],
    "NumberOfPoints": 4,
    "StatusTypeID": 50,
    "DateLastStatusUpdate": "2020-05-20T07:42:00Z",
    "DataQualityLevel": 1,
    "DateCreated": "2016-01-07T10:14:00Z",
    "SubmissionStatusTypeID": 200
}