{
    "IsRecentlyVerified": false,
    "ID": 46766,
    "UUID": "70200DC8-7707-4184-A267-3849323EF69B",
    "DataProviderID": 1,
    "OperatorID": 188,
    "UsageTypeID": 4,
    "UsageCost": "0",
    "AddressInfo": {
        "ID": 47112,
        "Title": "Gemeindeverwaltung",
        "AddressLine1": "Marburger Straße 81",
        "Town": "Münchhausen",
        "Postcode": "35117",
        "CountryID": 87,
        "Latitude": 50.9620055,
        "Longitude": 8.71699009999998,
        "ContactTelephone1": "+49 6421 205-505",
        "AccessComments": "2 immer nutzbare Parkplätze. Ladekarte der Stadtwerke Marburg oder der ovag Energie nötig. Die Ladekarte kann auch während der Öffnungszeiten bei der Gemeindeverwaltung ausgeliehen werden.\r\n",
        "RelatedURL": "http://www.stadtwerke-marburg.de/elektrotankstellen.html",
        "DistanceUnit": 0
    },
    "Connections": [
        {
            "ID": 57462,
            "ConnectionTypeID": 25,
            "StatusTypeID": 50,
            "LevelID": 2,
            "Amps": 16,
            "Voltage": 400,
            "PowerKW": 11,
            "CurrentTypeID": 20,
            "Quantity": 2
        },
        {
            "ID": 57463,
            "ConnectionTypeID": 28,
            "StatusTypeID": 50,
            "LevelID": 2,
            "Amps": 16,
            "Voltage": 230,
            "PowerKW": 3.7,
            "CurrentTypeID": 10,
            "Quantity": 2
        }
    ],
    "NumberOfPoints": 2,
    "StatusTypeID": 50,
    "DateLastStatusUpdate": "2015-05-07T15:24:00Z",
    "DataQualityLevel": 1,
    "DateCreated": "2015-05-06T08:50:00Z",
    "SubmissionStatusTypeID": 200
}