{
    "IsRecentlyVerified": false,
    "ID": 28959,
    "UUID": "CD763353-A334-4A0D-92A4-5174D44708FD",
    "DataProviderID": 2,
    "DataProvidersReference": "50837",
    "UsageTypeID": 1,
    "AddressInfo": {
        "ID": 29305,
        "Title": "Delta Township Library",
        "AddressLine1": "5130 Davenport Dr",
        "Town": "Lansing",
        "StateOrProvince": "MI",
        "Postcode": "48917",
        "CountryID": 2,
        "Latitude": 42.745881,
        "Longitude": -84.62145,
        "ContactTelephone1": "517-321-4014",
        "AccessComments": "24 hours daily",
        "RelatedURL": "",
        "DistanceUnit": 0
    },
    "Connections": [
        {
            "ID": 31819,
            "ConnectionTypeID": 1,
            "LevelID": 2,
            "Amps": 16,
            "Voltage": 230,
            "PowerKW": 3.7,
            "CurrentTypeID": 10,
            "Quantity": 1
        }
    ],
    "DateLastStatusUpdate": "2020-06-26T03:06:00Z",
    "DataQualityLevel": 3,
    "DateCreated": "2014-11-28T03:38:00Z",
    "SubmissionStatusTypeID": 100
}