{
    "IsRecentlyVerified": false,
    "ID": 68245,
    "UUID": "7D7C7F30-A5D1-4B60-B17C-8C67D0EDFB1B",
    "DataProviderID": 26,
    "DataProvidersReference": "91914",
    "OperatorID": 73,
    "OperatorsReference": "EV-Box EVB-P1551100",
    "UsageCost": "0.00 jaarabonnement",
    "AddressInfo": {
        "ID": 68591,
        "Title": "Galwin",
        "AddressLine1": "Galwin",
        "Town": "Amsterdam",
        "Postcode": "1046 AW",
        "CountryID": 159,
        "Latitude": 52.39684,
        "Longitude": 4.79959,
        "RelatedURL": "http://www.ev-box.nl",
        "DistanceUnit": 0
    },
    "Connections": [
        {
            "ID": 95128,
            "ConnectionTypeID": 25,
            "LevelID": 2,
            "PowerKW": 11,
            "CurrentTypeID": 10
        },
        {
            "ID": 95129,
            "ConnectionTypeID": 25,
            "LevelID": 2,
            "PowerKW": 11,
            "CurrentTypeID": 10
        },
        {
            "ID": 95130,
            "ConnectionTypeID": 25,
            "LevelID": 2,
            "PowerKW": 11,
            "CurrentTypeID": 10
        },
        {
            "ID": 95131,
            "ConnectionTypeID": 25,
            "LevelID": 2,
            "PowerKW": 11,
            "CurrentTypeID": 10
        }
    ],
    "NumberOfPoints": 1,
    "StatusTypeID": 50,
    "DateLastStatusUpdate": "2016-06-04T02:37:00Z",
    "DataQualityLevel": 3,
    "DateCreated": "2016-06-04T02:37:00Z",
    "SubmissionStatusTypeID": 100
}