{
    "IsRecentlyVerified": false,
    "ID": 89557,
    "UUID": "0AC861CA-1AFD-4BC6-835E-3D5BACD8BE38",
    "DataProviderID": 2,
    "DataProvidersReference": "81609",
    "UsageTypeID": 1,
    "AddressInfo": {
        "ID": 89903,
        "Title": "City of Aspen",
        "AddressLine1": "Brush Creek Rd & Highway 82",
        "Town": "Aspen",
        "StateOrProvince": "CO",
        "Postcode": "81611",
        "CountryID": 2,
        "Latitude": 39.250348,
        "Longitude": -106.882854,
        "ContactTelephone1": "970-925-5104",
        "AccessComments": "24 hours daily",
        "RelatedURL": "",
        "DistanceUnit": 0
    },
    "Connections": [
        {
            "ID": 126967,
            "ConnectionTypeID": 1,
            "LevelID": 2,
            "Amps": 16,
            "Voltage": 230,
            "PowerKW": 3.7,
            "CurrentTypeID": 10,
            "Quantity": 2
        }
    ],
    "DateLastStatusUpdate": "2020-06-26T03:01:00Z",
    "DataQualityLevel": 3,
    "DateCreated": "2017-06-22T08:16:00Z",
    "SubmissionStatusTypeID": 100
}