{
    "IsRecentlyVerified": false,
    "ID": 180367,
    "UUID": "5AAC0D52-9D15-46E5-946D-53FFBC5C7271",
    "DataProviderID": 29,
    "DataProvidersReference": "8668",
    "OperatorID": 69,
    "AddressInfo": {
        "ID": 180726,
        "Title": "Rommelsbacher Straße 140",
        "AddressLine1": "Rommelsbacher Straße 140",
        "Town": "Reutlingen",
        "Postcode": "72760",
        "CountryID": 87,
        "Latitude": 48.51162,
        "Longitude": 9.20444,
        "DistanceUnit": 0
    },
    "Connections": [
        {
            "ID": 283359,
            "ConnectionTypeID": 25,
            "StatusTypeID": 50,
            "LevelID": 2,
            "PowerKW": 22,
            "CurrentTypeID": 20
        },
        {
            "ID": 283360,
            "ConnectionTypeID": 25,
            "StatusTypeID": 50,
            "LevelID": 2,
            "PowerKW": 22,
            "CurrentTypeID": 20
        }
    ],
    "StatusTypeID": 50,
    "DateLastStatusUpdate": "2021-07-12T02:41:00Z",
    "MetadataValues": [
        {
            "ID": 12661,
            "MetadataFieldID": 4,
            "ItemValue": "Data from the German chargepoint registry provided by Bundesnetzagentur.de under the CC-BY 4.0 license"
        }
    ],
    "DataQualityLevel": 3,
    "DateCreated": "2021-07-08T10:00:00Z",
    "SubmissionStatusTypeID": 100
}