{
    "IsRecentlyVerified": false,
    "ID": 151765,
    "UUID": "E52F61A1-99AF-4001-9F59-318BABBDD4DB",
    "DataProviderID": 28,
    "DataProvidersReference": "FRS42P42279B1",
    "UsageTypeID": 5,
    "AddressInfo": {
        "ID": 152118,
        "Title": "Parking Jean Monnet",
        "AddressLine1": "6 boulevard du poyet",
        "CountryID": 80,
        "Latitude": 45.500546,
        "Longitude": 4.240178,
        "AccessComments": "24/24 - 7/7",
        "DistanceUnit": 0
    },
    "Connections": [
        {
            "ID": 212112,
            "ConnectionTypeID": 28,
            "StatusTypeID": 50,
            "LevelID": 2,
            "PowerKW": 22,
            "CurrentTypeID": 10
        },
        {
            "ID": 212113,
            "ConnectionTypeID": 1036,
            "StatusTypeID": 50,
            "LevelID": 2,
            "PowerKW": 22,
            "CurrentTypeID": 20
        },
        {
            "ID": 244520,
            "ConnectionTypeID": 28,
            "StatusTypeID": 50,
            "LevelID": 2,
            "PowerKW": 22,
            "CurrentTypeID": 10
        },
        {
            "ID": 244521,
            "ConnectionTypeID": 1036,
            "StatusTypeID": 50,
            "LevelID": 2,
            "PowerKW": 22,
            "CurrentTypeID": 20
        }
    ],
    "GeneralComments": "En service",
    "StatusTypeID": 50,
    "DateLastStatusUpdate": "2020-08-27T05:12:00Z",
    "DataQualityLevel": 2,
    "DateCreated": "2020-03-15T10:53:00Z",
    "SubmissionStatusTypeID": 100
}