{
    "IsRecentlyVerified": false,
    "ID": 64085,
    "UUID": "91421F48-CC26-4917-B00A-F1D8407C16A0",
    "DataProviderID": 26,
    "DataProvidersReference": "75612",
    "OperatorID": 103,
    "OperatorsReference": "Allego NLALLEGO0004752",
    "UsageCost": "0.00 jaarabonnement",
    "AddressInfo": {
        "ID": 64431,
        "Title": "Hulstlaan 2",
        "AddressLine1": "Hulstlaan 2",
        "Town": "Heerhugowaard",
        "Postcode": "1702 VL",
        "CountryID": 159,
        "Latitude": 52.66298726,
        "Longitude": 4.83620139,
        "ContactTelephone1": "0800-3745337",
        "RelatedURL": "http://www.allego.eu/",
        "DistanceUnit": 0
    },
    "Connections": [
        {
            "ID": 81957,
            "ConnectionTypeID": 25,
            "LevelID": 2,
            "PowerKW": 11,
            "CurrentTypeID": 10
        },
        {
            "ID": 81958,
            "ConnectionTypeID": 25,
            "LevelID": 2,
            "PowerKW": 11,
            "CurrentTypeID": 10
        }
    ],
    "NumberOfPoints": 1,
    "StatusTypeID": 50,
    "DateLastStatusUpdate": "2016-06-04T02:55:00Z",
    "DataQualityLevel": 3,
    "DateCreated": "2016-03-03T12:33:00Z",
    "SubmissionStatusTypeID": 100
}