{
    "IsRecentlyVerified": false,
    "ID": 68103,
    "UUID": "19A41465-FB4A-464E-A7D8-5C1A19572869",
    "DataProviderID": 26,
    "DataProvidersReference": "91517",
    "OperatorID": 73,
    "OperatorsReference": "EV-Box EVB-P1551072",
    "UsageCost": "0.00 jaarabonnement",
    "AddressInfo": {
        "ID": 68449,
        "Title": "Harselaarseweg 59",
        "AddressLine1": "Harselaarseweg 59",
        "Town": "Barneveld",
        "Postcode": "3771 MA",
        "CountryID": 159,
        "Latitude": 52.16289,
        "Longitude": 5.58762,
        "RelatedURL": "http://www.ev-box.nl",
        "DistanceUnit": 0
    },
    "Connections": [
        {
            "ID": 94853,
            "ConnectionTypeID": 25,
            "LevelID": 2,
            "PowerKW": 11,
            "CurrentTypeID": 10
        },
        {
            "ID": 94854,
            "ConnectionTypeID": 25,
            "LevelID": 2,
            "PowerKW": 11,
            "CurrentTypeID": 10
        }
    ],
    "NumberOfPoints": 1,
    "StatusTypeID": 50,
    "DateLastStatusUpdate": "2016-06-04T02:37:00Z",
    "DataQualityLevel": 3,
    "DateCreated": "2016-06-04T02:37:00Z",
    "SubmissionStatusTypeID": 100
}