{
    "IsRecentlyVerified": false,
    "ID": 57931,
    "UUID": "F1ED913A-7A37-480A-A706-8355F737A8D8",
    "DataProviderID": 1,
    "OperatorID": 234,
    "UsageTypeID": 4,
    "UsageCost": "0",
    "AddressInfo": {
        "ID": 58277,
        "Title": "Stromtankstelle",
        "AddressLine1": "Marloffsteiner Straße 4",
        "Town": "Uttenreuth",
        "Postcode": "91080",
        "CountryID": 87,
        "Latitude": 49.59729129999999,
        "Longitude": 11.074640899999963,
        "AccessComments": "Rund um die Uhr (24/7) nutzbar Belegung kann in der RWE e-kWh App geprüft werden\r\n",
        "DistanceUnit": 0
    },
    "Connections": [
        {
            "ID": 73575,
            "ConnectionTypeID": 28,
            "StatusTypeID": 50,
            "LevelID": 2,
            "Amps": 16,
            "Voltage": 230,
            "PowerKW": 3.7,
            "CurrentTypeID": 10,
            "Quantity": 0
        },
        {
            "ID": 73576,
            "ConnectionTypeID": 25,
            "StatusTypeID": 50,
            "LevelID": 2,
            "PowerKW": 22,
            "CurrentTypeID": 20,
            "Quantity": 2
        },
        {
            "ID": 73577,
            "ConnectionTypeID": 16,
            "StatusTypeID": 50,
            "LevelID": 2,
            "Amps": 16,
            "Voltage": 230,
            "PowerKW": 3.7,
            "CurrentTypeID": 10,
            "Quantity": 0
        },
        {
            "ID": 73578,
            "ConnectionTypeID": 17,
            "StatusTypeID": 50,
            "LevelID": 2,
            "PowerKW": 0,
            "CurrentTypeID": 20,
            "Quantity": 0
        },
        {
            "ID": 73579,
            "ConnectionTypeID": 2,
            "StatusTypeID": 50,
            "LevelID": 2,
            "PowerKW": 0,
            "CurrentTypeID": 30,
            "Quantity": 0
        },
        {
            "ID": 73580,
            "ConnectionTypeID": 33,
            "StatusTypeID": 50,
            "LevelID": 2,
            "PowerKW": 0,
            "CurrentTypeID": 30,
            "Quantity": 0
        }
    ],
    "NumberOfPoints": 2,
    "StatusTypeID": 50,
    "DateLastStatusUpdate": "2015-12-29T12:02:00Z",
    "DataQualityLevel": 1,
    "DateCreated": "2015-12-29T12:02:00Z",
    "SubmissionStatusTypeID": 200
}