{
    "IsRecentlyVerified": false,
    "ID": 44567,
    "UUID": "4FC19D74-1D7A-470A-9D59-2E2A98A11A9D",
    "DataProviderID": 2,
    "DataProvidersReference": "66573",
    "OperatorID": 5,
    "UsageTypeID": 1,
    "AddressInfo": {
        "ID": 44913,
        "Title": "CITY OF COTATI",
        "AddressLine1": "960 E Cotati Ave",
        "Town": "Cotati",
        "StateOrProvince": "CA",
        "Postcode": "94931",
        "CountryID": 2,
        "Latitude": 38.3316178,
        "Longitude": -122.6915704,
        "ContactTelephone1": "888-758-4389",
        "AccessComments": "24 hours daily",
        "RelatedURL": "http://www.chargepoint.com/",
        "DistanceUnit": 0
    },
    "Connections": [
        {
            "ID": 54747,
            "ConnectionTypeID": 1,
            "LevelID": 2,
            "Amps": 16,
            "Voltage": 230,
            "PowerKW": 3,
            "CurrentTypeID": 10,
            "Quantity": 2
        }
    ],
    "DateLastStatusUpdate": "2019-12-24T09:14:00Z",
    "DataQualityLevel": 3,
    "DateCreated": "2015-04-17T12:30:00Z",
    "SubmissionStatusTypeID": 100
}