{
    "IsRecentlyVerified": false,
    "ID": 159100,
    "UUID": "F1697048-4B5E-4E6F-BEF1-C2F2A53399DE",
    "DataProviderID": 2,
    "DataProvidersReference": "152300",
    "OperatorID": 59,
    "UsageTypeID": 1,
    "AddressInfo": {
        "ID": 159457,
        "Title": "Greenlots - 42043",
        "AddressLine1": "US 95 & SR 373 Death Valley Junction",
        "Town": "Amargosa Valley",
        "StateOrProvince": "NV",
        "Postcode": "89020",
        "CountryID": 2,
        "Latitude": 36.6429672241211,
        "Longitude": -116.399124145508,
        "ContactTelephone1": "855-900-7584",
        "AccessComments": "24 hours daily",
        "RelatedURL": "http://greenlots.com/",
        "DistanceUnit": 0
    },
    "Connections": [
        {
            "ID": 229181,
            "ConnectionTypeID": 1,
            "LevelID": 2,
            "Amps": 16,
            "Voltage": 230,
            "PowerKW": 3.7,
            "CurrentTypeID": 10,
            "Quantity": 2
        },
        {
            "ID": 229182,
            "ConnectionTypeID": 2,
            "LevelID": 3,
            "Amps": 100,
            "Voltage": 400,
            "PowerKW": 40,
            "CurrentTypeID": 30,
            "Quantity": 1
        },
        {
            "ID": 229183,
            "ConnectionTypeID": 32,
            "LevelID": 3,
            "Amps": 100,
            "Voltage": 400,
            "PowerKW": 40,
            "CurrentTypeID": 30,
            "Quantity": 1
        }
    ],
    "StatusTypeID": 50,
    "DateLastStatusUpdate": "2020-06-26T02:58:00Z",
    "DataQualityLevel": 3,
    "DateCreated": "2020-06-26T02:58:00Z",
    "SubmissionStatusTypeID": 100
}