{
    "MediaItems": [
        {
            "ID": 8711,
            "ChargePointID": 71053,
            "ItemURL": "https://s3-ap-southeast-2.amazonaws.com/openchargemap/images/DE/OCM71053/OCM-71053.orig.2016120313020926.jpg",
            "ItemThumbnailURL": "https://s3-ap-southeast-2.amazonaws.com/openchargemap/images/DE/OCM71053/OCM-71053.thmb.2016120313020926.jpg",
            "Comment": "Top!!!",
            "IsEnabled": true,
            "IsVideo": false,
            "IsFeaturedItem": false,
            "IsExternalResource": false,
            "User": {
                "ID": 12064,
                "Username": "Thomas Schlenstedt"
            },
            "DateCreated": "2016-12-03T13:02:00Z"
        }
    ],
    "IsRecentlyVerified": false,
    "ID": 71053,
    "UUID": "30495ECD-DD0F-443F-88B6-46F3E74E2879",
    "DataProviderID": 1,
    "OperatorID": 214,
    "UsageTypeID": 4,
    "AddressInfo": {
        "ID": 71399,
        "Title": "Aral Tankstelle",
        "AddressLine1": "Reichsstraße 13",
        "AddressLine2": "Stadtteil Westend",
        "Town": "Berlin",
        "StateOrProvince": "Berlin",
        "Postcode": "14052",
        "CountryID": 87,
        "Latitude": 52.51351,
        "Longitude": 13.26631999999995,
        "AccessComments": "24/7 nutzbar mit The New Motion Ladekarte oder von Roamingpartnern. ",
        "DistanceUnit": 0
    },
    "Connections": [
        {
            "ID": 101812,
            "ConnectionTypeID": 25,
            "StatusTypeID": 50,
            "LevelID": 2,
            "Amps": 16,
            "Voltage": 400,
            "PowerKW": 11,
            "CurrentTypeID": 20,
            "Quantity": 2
        }
    ],
    "NumberOfPoints": 2,
    "StatusTypeID": 50,
    "DateLastStatusUpdate": "2016-12-03T13:02:00Z",
    "DataQualityLevel": 1,
    "DateCreated": "2016-08-24T07:12:00Z",
    "SubmissionStatusTypeID": 200
}