{
    "IsRecentlyVerified": false,
    "ID": 34402,
    "UUID": "A088307E-A020-4B01-A1FC-BB36830AFA55",
    "DataProviderID": 26,
    "DataProvidersReference": "57513",
    "OperatorID": 180,
    "OperatorsReference": "Alfen BRS_1022",
    "UsageCost": "0.00 jaarabonnement",
    "AddressInfo": {
        "ID": 34748,
        "Title": "Museumpark",
        "AddressLine1": "Museumpark",
        "Town": "Rotterdam",
        "Postcode": "3015 CX",
        "CountryID": 159,
        "Latitude": 51.91373,
        "Longitude": 4.471004,
        "ContactTelephone1": "036 - 549 34 00",
        "RelatedURL": "http://www.icu-charging-stations.com/",
        "DistanceUnit": 0
    },
    "Connections": [
        {
            "ID": 37913,
            "ConnectionTypeID": 25,
            "LevelID": 2,
            "PowerKW": 11,
            "CurrentTypeID": 10
        },
        {
            "ID": 47229,
            "ConnectionTypeID": 25,
            "LevelID": 2,
            "PowerKW": 11,
            "CurrentTypeID": 10
        },
        {
            "ID": 82255,
            "ConnectionTypeID": 25,
            "LevelID": 2,
            "PowerKW": 11,
            "CurrentTypeID": 10
        },
        {
            "ID": 82256,
            "ConnectionTypeID": 25,
            "LevelID": 2,
            "PowerKW": 11,
            "CurrentTypeID": 10
        }
    ],
    "NumberOfPoints": 1,
    "StatusTypeID": 50,
    "DateLastStatusUpdate": "2016-06-04T02:42:00Z",
    "DataQualityLevel": 3,
    "DateCreated": "2015-01-09T06:04:00Z",
    "SubmissionStatusTypeID": 100
}