{
    "IsRecentlyVerified": false,
    "ID": 29530,
    "UUID": "401C2289-6868-47ED-A161-5280D62657B5",
    "DataProviderID": 15,
    "DataProvidersReference": "21346",
    "OperatorID": 26,
    "UsageTypeID": 1,
    "AddressInfo": {
        "ID": 29876,
        "Title": "750 NE Loop 410",
        "AddressLine1": "750 NE Loop 410",
        "Town": "San Antonio",
        "StateOrProvince": "TX",
        "Postcode": "78209",
        "CountryID": 2,
        "Latitude": 29.516294,
        "Longitude": -98.466895,
        "ContactTelephone1": "(888) 768-5020",
        "RelatedURL": "http://carstations.com/21346",
        "DistanceUnit": 0
    },
    "Connections": [
        {
            "ID": 32515,
            "ConnectionTypeID": 1,
            "Reference": "J1772",
            "LevelID": 2
        }
    ],
    "NumberOfPoints": 3,
    "StatusTypeID": 0,
    "DateLastStatusUpdate": "2017-11-04T14:03:00Z",
    "DataQualityLevel": 2,
    "DateCreated": "2014-11-29T05:39:00Z",
    "SubmissionStatusTypeID": 100
}