{
    "UserComments": [
        {
            "ID": 23037,
            "ChargePointID": 149890,
            "CommentTypeID": 10,
            "UserName": "ForumElettrico.it",
            "Comment": "2 colonnine da 350 kW con già la predisposizione per la 500 kW. Leggi la recensione completa qui > https://www.forumelettrico.it/forum/ionity-palermo-t7608.html",
            "RelatedURL": "https://www.forumelettrico.it/forum/ionity-palermo-t7608.html",
            "DateCreated": "2020-08-06T15:42:14.85Z",
            "User": {
                "ID": 11749,
                "Username": "ForumElettrico.it"
            },
            "CheckinStatusTypeID": 10,
            "IsActionedByEditor": false
        }
    ],
    "MediaItems": [
        {
            "ID": 27795,
            "ChargePointID": 149890,
            "ItemURL": "https://s3-ap-southeast-2.amazonaws.com/openchargemap/images/IT/OCM149890/OCM-149890.orig.2021052111134147.jpg",
            "ItemThumbnailURL": "https://s3-ap-southeast-2.amazonaws.com/openchargemap/images/IT/OCM149890/OCM-149890.thmb.2021052111134147.jpg",
            "Comment": "",
            "IsEnabled": true,
            "IsVideo": false,
            "IsFeaturedItem": false,
            "IsExternalResource": false,
            "User": {
                "ID": 21871,
                "Username": "elialitem"
            },
            "DateCreated": "2021-05-21T11:14:00Z"
        },
        {
            "ID": 23914,
            "ChargePointID": 149890,
            "ItemURL": "https://s3-ap-southeast-2.amazonaws.com/openchargemap/images/IT/OCM149890/OCM-149890.orig.2020080615423437.jpg",
            "ItemThumbnailURL": "https://s3-ap-southeast-2.amazonaws.com/openchargemap/images/IT/OCM149890/OCM-149890.thmb.2020080615423437.jpg",
            "Comment": "",
            "IsEnabled": true,
            "IsVideo": false,
            "IsFeaturedItem": false,
            "IsExternalResource": false,
            "User": {
                "ID": 11749,
                "Username": "ForumElettrico.it"
            },
            "DateCreated": "2020-08-06T15:43:00Z"
        },
        {
            "ID": 23913,
            "ChargePointID": 149890,
            "ItemURL": "https://s3-ap-southeast-2.amazonaws.com/openchargemap/images/IT/OCM149890/OCM-149890.orig.2020080615422620.jpg",
            "ItemThumbnailURL": "https://s3-ap-southeast-2.amazonaws.com/openchargemap/images/IT/OCM149890/OCM-149890.thmb.2020080615422620.jpg",
            "Comment": "",
            "IsEnabled": true,
            "IsVideo": false,
            "IsFeaturedItem": false,
            "IsExternalResource": false,
            "User": {
                "ID": 11749,
                "Username": "ForumElettrico.it"
            },
            "DateCreated": "2020-08-06T15:42:00Z"
        },
        {
            "ID": 22740,
            "ChargePointID": 149890,
            "ItemURL": "https://s3-ap-southeast-2.amazonaws.com/openchargemap/images/IT/OCM149890/OCM-149890.orig.2020061912175316.jpg",
            "ItemThumbnailURL": "https://s3-ap-southeast-2.amazonaws.com/openchargemap/images/IT/OCM149890/OCM-149890.thmb.2020061912175316.jpg",
            "Comment": "Work in progress (June 19th, 2020)",
            "IsEnabled": true,
            "IsVideo": false,
            "IsFeaturedItem": false,
            "IsExternalResource": false,
            "User": {
                "ID": 21871,
                "Username": "elialitem"
            },
            "DateCreated": "2020-06-19T12:18:00Z"
        },
        {
            "ID": 22662,
            "ChargePointID": 149890,
            "ItemURL": "https://s3-ap-southeast-2.amazonaws.com/openchargemap/images/IT/OCM149890/OCM-149890.orig.2020061217373629.jpg",
            "ItemThumbnailURL": "https://s3-ap-southeast-2.amazonaws.com/openchargemap/images/IT/OCM149890/OCM-149890.thmb.2020061217373629.jpg",
            "Comment": "Work in progress - June 11th, 2020 ",
            "IsEnabled": true,
            "IsVideo": false,
            "IsFeaturedItem": false,
            "IsExternalResource": false,
            "User": {
                "ID": 21871,
                "Username": "elialitem"
            },
            "DateCreated": "2020-06-12T17:38:00Z"
        }
    ],
    "IsRecentlyVerified": false,
    "ID": 149890,
    "UUID": "DEC40DD2-788C-4600-A631-8BFE2594BB2B",
    "DataProviderID": 1,
    "DataProvidersReference": "169",
    "OperatorID": 3299,
    "UsageTypeID": 1,
    "AddressInfo": {
        "ID": 150243,
        "Title": "IONITY Basile Palermo",
        "AddressLine1": "Via Ernesto Basile",
        "Town": "Palermo PA",
        "Postcode": "90100",
        "CountryID": 112,
        "Latitude": 38.099851,
        "Longitude": 13.346183,
        "DistanceUnit": 0
    },
    "Connections": [
        {
            "ID": 208119,
            "ConnectionTypeID": 33,
            "StatusTypeID": 50,
            "LevelID": 3,
            "PowerKW": 350,
            "CurrentTypeID": 30,
            "Quantity": 2
        }
    ],
    "NumberOfPoints": 2,
    "StatusTypeID": 50,
    "DateLastStatusUpdate": "2021-05-21T11:14:00Z",
    "DataQualityLevel": 3,
    "DateCreated": "2020-03-09T06:29:00Z",
    "SubmissionStatusTypeID": 200
}