{
    "IsRecentlyVerified": false,
    "ID": 157221,
    "UUID": "1A730549-7001-4AB0-A2D2-0731E19818BB",
    "DataProviderID": 19,
    "DataProvidersReference": "5885",
    "AddressInfo": {
        "ID": 157575,
        "Title": "AGLO Ladeplasser på Gymbygg",
        "AddressLine1": "Fløanvegen 89",
        "Town": "SKATVAL",
        "StateOrProvince": "Trøndelag",
        "Postcode": "7510",
        "CountryID": 168,
        "Latitude": 63.53361,
        "Longitude": 10.82334,
        "AccessComments": "",
        "DistanceUnit": 0
    },
    "Connections": [
        {
            "ID": 226100,
            "ConnectionTypeID": 25,
            "Reference": "1",
            "LevelID": 2,
            "Amps": 32,
            "Voltage": 230,
            "PowerKW": 7.4,
            "CurrentTypeID": 10,
            "Comments": "Mode 3"
        },
        {
            "ID": 226101,
            "ConnectionTypeID": 25,
            "Reference": "2",
            "LevelID": 2,
            "Amps": 32,
            "Voltage": 230,
            "PowerKW": 7.4,
            "CurrentTypeID": 10,
            "Comments": "Mode 3"
        }
    ],
    "NumberOfPoints": 2,
    "StatusTypeID": 0,
    "DateLastStatusUpdate": "2021-03-24T05:12:00Z",
    "DataQualityLevel": 2,
    "DateCreated": "2020-05-26T08:25:00Z",
    "SubmissionStatusTypeID": 100
}