{
    "IsRecentlyVerified": false,
    "ID": 144330,
    "UUID": "16C3EE44-5E8A-4BF0-BDF9-ADCF951868A1",
    "DataProviderID": 2,
    "DataProvidersReference": "114546",
    "OperatorID": 23,
    "UsageTypeID": 1,
    "AddressInfo": {
        "ID": 144682,
        "Title": "Wild Mountain Ski & Snow Board Area - Tesla Destination",
        "AddressLine1": "37200 Wild Mountain Rd",
        "Town": "Taylors Falls",
        "StateOrProvince": "MN",
        "Postcode": "55084",
        "CountryID": 2,
        "Latitude": 45.487354,
        "Longitude": -92.703221,
        "ContactTelephone1": "651-465-6365  877-798-3752",
        "AccessComments": "24 hours daily",
        "RelatedURL": "https://www.tesla.com/destination-charging",
        "DistanceUnit": 0
    },
    "Connections": [
        {
            "ID": 200826,
            "ConnectionTypeID": 30,
            "LevelID": 2,
            "Amps": 16,
            "Voltage": 230,
            "PowerKW": 3.7,
            "CurrentTypeID": 10,
            "Quantity": 2
        }
    ],
    "StatusTypeID": 50,
    "DateLastStatusUpdate": "2020-06-26T03:09:00Z",
    "DataQualityLevel": 3,
    "DateCreated": "2019-12-24T09:23:00Z",
    "SubmissionStatusTypeID": 100
}