{
    "IsRecentlyVerified": false,
    "ID": 117744,
    "UUID": "F0FB8DE6-E402-49FD-9424-007AE0EC8D40",
    "DataProviderID": 1,
    "OperatorID": 45,
    "UsageTypeID": 5,
    "AddressInfo": {
        "ID": 118090,
        "Title": "Prisma Kaleva",
        "AddressLine1": "Sammonkatu 75",
        "Town": "Tampere",
        "StateOrProvince": "Pirkanmaa",
        "Postcode": "33540",
        "CountryID": 79,
        "Latitude": 61.49114025,
        "Longitude": 23.8217521399146,
        "DistanceUnit": 0
    },
    "Connections": [
        {
            "ID": 166584,
            "ConnectionTypeID": 25,
            "StatusTypeID": 50,
            "LevelID": 2,
            "Amps": 16,
            "Voltage": 230,
            "PowerKW": 3.6,
            "CurrentTypeID": 10,
            "Quantity": 2
        }
    ],
    "NumberOfPoints": 2,
    "StatusTypeID": 50,
    "DateLastStatusUpdate": "2019-02-28T09:09:00Z",
    "DataQualityLevel": 1,
    "DateCreated": "2019-02-27T16:01:00Z",
    "SubmissionStatusTypeID": 200
}