{
    "IsRecentlyVerified": false,
    "ID": 77394,
    "UUID": "A2AC602A-B6D4-43A4-8DE7-249DF8D13F26",
    "DataProviderID": 1,
    "OperatorID": 1,
    "UsageTypeID": 4,
    "UsageCost": "0.45chf/kwh max 4 h after 2chf/H",
    "AddressInfo": {
        "ID": 77740,
        "Title": "Parking Vedia",
        "AddressLine1": "Voie-creise",
        "Town": "Geneve",
        "Postcode": "1202",
        "CountryID": 217,
        "Latitude": 46.2188427927164,
        "Longitude": 6.14381432533264,
        "DistanceUnit": 0
    },
    "Connections": [
        {
            "ID": 111527,
            "ConnectionTypeID": 25,
            "StatusTypeID": 0,
            "Quantity": 1
        }
    ],
    "NumberOfPoints": 1,
    "StatusTypeID": 50,
    "DateLastStatusUpdate": "2017-01-15T00:01:00Z",
    "DataQualityLevel": 1,
    "DateCreated": "2017-01-14T22:30:00Z",
    "SubmissionStatusTypeID": 200
}