{
    "IsRecentlyVerified": false,
    "ID": 144931,
    "UUID": "36E0D32A-0B42-458E-A471-D259D85C98A3",
    "DataProviderID": 2,
    "DataProvidersReference": "130989",
    "OperatorID": 90,
    "UsageTypeID": 1,
    "AddressInfo": {
        "ID": 145283,
        "Title": "Ville de Piedmont",
        "AddressLine1": "670 Principale",
        "Town": "Piedmont",
        "StateOrProvince": "QC",
        "Postcode": "J0R 1K0",
        "CountryID": 44,
        "Latitude": 45.8989,
        "Longitude": -74.1318,
        "ContactTelephone1": "877-505-2674",
        "AccessComments": "24 hours daily",
        "RelatedURL": "https://lecircuitelectrique.com/",
        "DistanceUnit": 0
    },
    "Connections": [
        {
            "ID": 201488,
            "ConnectionTypeID": 1,
            "LevelID": 2,
            "Amps": 16,
            "Voltage": 230,
            "PowerKW": 3.7,
            "CurrentTypeID": 10,
            "Quantity": 1
        }
    ],
    "StatusTypeID": 50,
    "DateLastStatusUpdate": "2020-06-26T03:10:00Z",
    "DataQualityLevel": 3,
    "DateCreated": "2019-12-24T09:24:00Z",
    "SubmissionStatusTypeID": 100
}