{
    "IsRecentlyVerified": false,
    "ID": 145188,
    "UUID": "A8DF4B0C-BB1D-4051-AD3D-08A4B388044C",
    "DataProviderID": 2,
    "DataProvidersReference": "83869",
    "UsageTypeID": 2,
    "AddressInfo": {
        "ID": 145540,
        "Title": "Centre de gestion de l'équipement roulant (CGER) Quebec",
        "AddressLine1": "5833 boul. Pierre-Bertrand",
        "Town": "Quebec City",
        "StateOrProvince": "QC",
        "Postcode": "G2K 1K7",
        "CountryID": 44,
        "Latitude": 46.837998,
        "Longitude": -71.285664,
        "ContactTelephone1": "",
        "AccessComments": "Fleet vehicles only",
        "RelatedURL": "",
        "DistanceUnit": 0
    },
    "Connections": [
        {
            "ID": 201802,
            "ConnectionTypeID": 1,
            "LevelID": 2,
            "Amps": 16,
            "Voltage": 230,
            "PowerKW": 3.7,
            "CurrentTypeID": 10,
            "Quantity": 8
        }
    ],
    "StatusTypeID": 50,
    "DateLastStatusUpdate": "2020-06-26T03:10:00Z",
    "DataQualityLevel": 3,
    "DateCreated": "2019-12-24T09:24:00Z",
    "SubmissionStatusTypeID": 100
}