{
    "IsRecentlyVerified": false,
    "ID": 187213,
    "UUID": "E5D72297-BD8B-4A37-823C-BFEAE1154279",
    "DataProviderID": 29,
    "DataProvidersReference": "7632",
    "OperatorID": 220,
    "AddressInfo": {
        "ID": 187572,
        "Title": "Erika-Mann-Bogen ggü. 18",
        "AddressLine1": "Erika-Mann-Bogen ggü. 18",
        "Town": "Hamburg",
        "Postcode": "22081",
        "CountryID": 87,
        "Latitude": 53.57658,
        "Longitude": 10.04962,
        "DistanceUnit": 0
    },
    "Connections": [
        {
            "ID": 301799,
            "ConnectionTypeID": 28,
            "StatusTypeID": 50,
            "LevelID": 2,
            "PowerKW": 22,
            "CurrentTypeID": 20
        },
        {
            "ID": 301800,
            "ConnectionTypeID": 25,
            "StatusTypeID": 50,
            "LevelID": 2,
            "PowerKW": 22,
            "CurrentTypeID": 20
        },
        {
            "ID": 301801,
            "ConnectionTypeID": 28,
            "StatusTypeID": 50,
            "LevelID": 2,
            "PowerKW": 22,
            "CurrentTypeID": 20
        },
        {
            "ID": 301802,
            "ConnectionTypeID": 25,
            "StatusTypeID": 50,
            "LevelID": 2,
            "PowerKW": 22,
            "CurrentTypeID": 20
        }
    ],
    "StatusTypeID": 50,
    "DateLastStatusUpdate": "2021-07-12T02:51:00Z",
    "MetadataValues": [
        {
            "ID": 19453,
            "MetadataFieldID": 4,
            "ItemValue": "Data from the German chargepoint registry provided by Bundesnetzagentur.de under the CC-BY 4.0 license"
        }
    ],
    "DataQualityLevel": 3,
    "DateCreated": "2021-07-12T02:51:00Z",
    "SubmissionStatusTypeID": 100
}