{
    "IsRecentlyVerified": false,
    "ID": 176829,
    "UUID": "8C849034-3CA6-4732-AC3E-7DB6146EB3C8",
    "DataProviderID": 29,
    "DataProvidersReference": "14554",
    "AddressInfo": {
        "ID": 177188,
        "Title": "Johann-Hittorf-Straße 8",
        "AddressLine1": "Johann-Hittorf-Straße 8",
        "Town": "Berlin",
        "Postcode": "12489",
        "CountryID": 87,
        "Latitude": 52.431378,
        "Longitude": 13.522796,
        "DistanceUnit": 0
    },
    "Connections": [
        {
            "ID": 275216,
            "ConnectionTypeID": 25,
            "StatusTypeID": 50,
            "LevelID": 2,
            "PowerKW": 11,
            "CurrentTypeID": 20
        },
        {
            "ID": 275217,
            "ConnectionTypeID": 25,
            "StatusTypeID": 50,
            "LevelID": 2,
            "PowerKW": 11,
            "CurrentTypeID": 20
        }
    ],
    "StatusTypeID": 0,
    "DateLastStatusUpdate": "2021-07-12T02:49:00Z",
    "MetadataValues": [
        {
            "ID": 9124,
            "MetadataFieldID": 4,
            "ItemValue": "Data from the German chargepoint registry provided by Bundesnetzagentur.de under the CC-BY 4.0 license"
        }
    ],
    "DataQualityLevel": 3,
    "DateCreated": "2021-07-08T09:48:00Z",
    "SubmissionStatusTypeID": 100
}