{
    "IsRecentlyVerified": false,
    "ID": 141840,
    "UUID": "AC2B4564-30E9-4641-A61C-A1A97C9C67A9",
    "DataProviderID": 2,
    "DataProvidersReference": "143150",
    "OperatorID": 5,
    "UsageTypeID": 1,
    "AddressInfo": {
        "ID": 142192,
        "Title": "LOT 2",
        "AddressLine1": "109 Conrad Harcourt Way",
        "Town": "Rushville",
        "StateOrProvince": "IN",
        "Postcode": "46173",
        "CountryID": 2,
        "Latitude": 39.6227347,
        "Longitude": -85.4439096,
        "ContactTelephone1": "888-758-4389",
        "AccessComments": "24 hours daily",
        "RelatedURL": "http://www.chargepoint.com/",
        "DistanceUnit": 0
    },
    "Connections": [
        {
            "ID": 197870,
            "ConnectionTypeID": 1,
            "LevelID": 2,
            "Amps": 16,
            "Voltage": 230,
            "PowerKW": 3.7,
            "CurrentTypeID": 10,
            "Quantity": 2
        }
    ],
    "StatusTypeID": 50,
    "DateLastStatusUpdate": "2020-06-26T03:02:00Z",
    "DataQualityLevel": 3,
    "DateCreated": "2019-12-24T09:16:00Z",
    "SubmissionStatusTypeID": 100
}