{
    "IsRecentlyVerified": false,
    "ID": 71830,
    "UUID": "1D5D5E11-0D81-4751-A53F-AD8AEEB4C7AE",
    "DataProviderID": 1,
    "OperatorID": 3,
    "OperatorsReference": "PG-81490,PG-90827",
    "UsageTypeID": 6,
    "UsageCost": "Free",
    "AddressInfo": {
        "ID": 72176,
        "Title": "Midcounties Co-Operative-Warwick",
        "AddressLine1": "Warwick Technology Park",
        "Town": "Warwick",
        "StateOrProvince": "Warwickshire",
        "Postcode": "CV34 6DA",
        "CountryID": 1,
        "Latitude": 52.276773,
        "Longitude": -1.567819,
        "AccessComments": "At the Midcounties Co-operative office (not store)",
        "DistanceUnit": 0
    },
    "Connections": [
        {
            "ID": 102919,
            "ConnectionTypeID": 25,
            "StatusTypeID": 50,
            "LevelID": 2,
            "Amps": 32,
            "Voltage": 400,
            "PowerKW": 22,
            "CurrentTypeID": 20,
            "Quantity": 2
        },
        {
            "ID": 108894,
            "ConnectionTypeID": 25,
            "StatusTypeID": 50,
            "LevelID": 2,
            "Amps": 32,
            "Voltage": 230,
            "PowerKW": 7,
            "CurrentTypeID": 10,
            "Quantity": 1
        }
    ],
    "NumberOfPoints": 4,
    "StatusTypeID": 50,
    "DateLastStatusUpdate": "2017-12-22T06:30:00Z",
    "DataQualityLevel": 1,
    "DateCreated": "2016-09-14T18:43:00Z",
    "SubmissionStatusTypeID": 200
}