{
    "MediaItems": [
        {
            "ID": 28720,
            "ChargePointID": 188384,
            "ItemURL": "https://s3-ap-southeast-2.amazonaws.com/openchargemap/images/TH/OCM188384/OCM-188384.orig.2021072208100555.jpg",
            "ItemThumbnailURL": "https://s3-ap-southeast-2.amazonaws.com/openchargemap/images/TH/OCM188384/OCM-188384.thmb.2021072208100555.jpg",
            "Comment": "",
            "IsEnabled": true,
            "IsVideo": false,
            "IsFeaturedItem": false,
            "IsExternalResource": false,
            "User": {
                "ID": 33459,
                "Username": "Johnny Carlsen"
            },
            "DateCreated": "2021-07-22T08:10:00Z"
        },
        {
            "ID": 28719,
            "ChargePointID": 188384,
            "ItemURL": "https://s3-ap-southeast-2.amazonaws.com/openchargemap/images/TH/OCM188384/OCM-188384.orig.2021072208092211.jpg",
            "ItemThumbnailURL": "https://s3-ap-southeast-2.amazonaws.com/openchargemap/images/TH/OCM188384/OCM-188384.thmb.2021072208092211.jpg",
            "Comment": "",
            "IsEnabled": true,
            "IsVideo": false,
            "IsFeaturedItem": false,
            "IsExternalResource": false,
            "User": {
                "ID": 33459,
                "Username": "Johnny Carlsen"
            },
            "DateCreated": "2021-07-22T08:09:00Z"
        }
    ],
    "IsRecentlyVerified": false,
    "ID": 188384,
    "UUID": "086ADDF9-7921-4ACC-859A-1F509E996925",
    "DataProviderID": 1,
    "OperatorID": 3460,
    "UsageTypeID": 4,
    "UsageCost": "6.5",
    "AddressInfo": {
        "ID": 188743,
        "Title": "Energy Research and Development Institute of Nakornping",
        "AddressLine1": "155 M.2",
        "AddressLine2": "Mae Hia",
        "Town": "Mueang Chiang Mai",
        "StateOrProvince": "Chiang Mai",
        "Postcode": "50100",
        "CountryID": 222,
        "Latitude": 18.75736475032383,
        "Longitude": 98.93994418628051,
        "DistanceUnit": 0
    },
    "Connections": [
        {
            "ID": 304160,
            "ConnectionTypeID": 25,
            "StatusTypeID": 50,
            "LevelID": 2,
            "PowerKW": 22,
            "CurrentTypeID": 20,
            "Quantity": 1
        },
        {
            "ID": 304161,
            "ConnectionTypeID": 33,
            "StatusTypeID": 50,
            "LevelID": 3,
            "PowerKW": 50,
            "CurrentTypeID": 30,
            "Quantity": 1,
            "Comments": ""
        },
        {
            "ID": 304162,
            "ConnectionTypeID": 0,
            "StatusTypeID": 50,
            "LevelID": 3,
            "PowerKW": 50,
            "CurrentTypeID": 30,
            "Quantity": 1,
            "Comments": "CHAdeMO"
        }
    ],
    "NumberOfPoints": 2,
    "GeneralComments": "EleXA",
    "StatusTypeID": 50,
    "DateLastStatusUpdate": "2021-10-11T11:46:00Z",
    "DataQualityLevel": 1,
    "DateCreated": "2021-07-20T12:44:00Z",
    "SubmissionStatusTypeID": 200
}