{
    "IsRecentlyVerified": false,
    "ID": 8022,
    "UUID": "016F2516-1B27-41EA-AA9B-36E04577FFA4",
    "DataProviderID": 15,
    "DataProvidersReference": "5229",
    "OperatorID": 26,
    "AddressInfo": {
        "ID": 7919,
        "Title": "316 N Franklin St",
        "AddressLine1": "316 N Franklin St",
        "Town": "Hempstead",
        "StateOrProvince": "NY",
        "Postcode": "11550",
        "CountryID": 2,
        "Latitude": 40.71674,
        "Longitude": -73.63047,
        "ContactTelephone1": " (516) 483-4400 ",
        "RelatedURL": "http://carstations.com/5229",
        "DistanceUnit": 0
    },
    "Connections": [
        {
            "ID": 5451,
            "ConnectionTypeID": 1,
            "Reference": "J1772",
            "LevelID": 2
        }
    ],
    "StatusTypeID": 0,
    "DateLastStatusUpdate": "2017-11-04T14:04:00Z",
    "DataQualityLevel": 1,
    "DateCreated": "2011-11-11T12:05:00Z",
    "SubmissionStatusTypeID": 100
}