{
    "IsRecentlyVerified": true,
    "DateLastVerified": "2021-08-22T10:53:00Z",
    "ID": 188872,
    "UUID": "75D5F2C3-C2EB-4130-B1F3-615E2D3570DA",
    "DataProviderID": 1,
    "OperatorID": 21,
    "UsageTypeID": 4,
    "UsageCost": "Mobi.E compatible card or App",
    "AddressInfo": {
        "ID": 189231,
        "Title": "OER-00074 - Estação CP Paço de Arcos",
        "AddressLine1": "Rua Luciano Cordeiro",
        "Town": "Paço de Arcos",
        "StateOrProvince": "Lisboa",
        "Postcode": "2770-106",
        "CountryID": 180,
        "Latitude": 38.696823228539984,
        "Longitude": -9.293393143511594,
        "DistanceUnit": 0
    },
    "Connections": [
        {
            "ID": 305196,
            "ConnectionTypeID": 2,
            "StatusTypeID": 50,
            "LevelID": 3,
            "Amps": 120,
            "Voltage": 500,
            "PowerKW": 50,
            "CurrentTypeID": 30,
            "Quantity": 1
        },
        {
            "ID": 305197,
            "ConnectionTypeID": 33,
            "StatusTypeID": 50,
            "LevelID": 3,
            "Amps": 125,
            "Voltage": 500,
            "PowerKW": 50,
            "CurrentTypeID": 30,
            "Quantity": 1
        },
        {
            "ID": 305198,
            "ConnectionTypeID": 1036,
            "StatusTypeID": 50,
            "LevelID": 3,
            "Amps": 64,
            "Voltage": 400,
            "PowerKW": 43,
            "CurrentTypeID": 20,
            "Quantity": 1
        }
    ],
    "NumberOfPoints": 2,
    "StatusTypeID": 50,
    "DateLastStatusUpdate": "2021-08-22T10:53:00Z",
    "DataQualityLevel": 1,
    "DateCreated": "2021-08-22T10:53:00Z",
    "SubmissionStatusTypeID": 200
}