{
    "IsRecentlyVerified": false,
    "ID": 156690,
    "UUID": "309CE8AD-5FDA-4273-A745-AC5764F05A30",
    "DataProviderID": 19,
    "DataProvidersReference": "6254",
    "AddressInfo": {
        "ID": 157044,
        "Title": "Elladdning Parkering Centralen",
        "AddressLine1": "Gullbergsvassgatan ",
        "Town": "GÖTEBORG",
        "StateOrProvince": "VÄSTRA GÖTALAND",
        "Postcode": "41104",
        "CountryID": 216,
        "Latitude": 57.71472,
        "Longitude": 11.9854,
        "AccessComments": "57.71253,11.97810",
        "DistanceUnit": 0
    },
    "Connections": [
        {
            "ID": 221271,
            "ConnectionTypeID": 25,
            "Reference": "1",
            "LevelID": 2,
            "Amps": 16,
            "Voltage": 230,
            "PowerKW": 3.7,
            "CurrentTypeID": 10
        },
        {
            "ID": 221272,
            "ConnectionTypeID": 25,
            "Reference": "2",
            "LevelID": 2,
            "Amps": 16,
            "Voltage": 230,
            "PowerKW": 3.7,
            "CurrentTypeID": 10
        },
        {
            "ID": 221273,
            "ConnectionTypeID": 25,
            "Reference": "3",
            "LevelID": 2,
            "Amps": 16,
            "Voltage": 230,
            "PowerKW": 3.7,
            "CurrentTypeID": 10
        },
        {
            "ID": 221274,
            "ConnectionTypeID": 25,
            "Reference": "4",
            "LevelID": 2,
            "Amps": 16,
            "Voltage": 230,
            "PowerKW": 3.7,
            "CurrentTypeID": 10
        }
    ],
    "NumberOfPoints": 4,
    "StatusTypeID": 0,
    "DateLastStatusUpdate": "2021-03-24T05:11:00Z",
    "DataQualityLevel": 2,
    "DateCreated": "2020-05-26T08:21:00Z",
    "SubmissionStatusTypeID": 100
}