{
    "IsRecentlyVerified": false,
    "ID": 71580,
    "UUID": "AA720C53-63FD-4380-A0B2-D9BAC81A6D00",
    "DataProviderID": 1,
    "OperatorID": 23,
    "OperatorsReference": "19922",
    "UsageTypeID": 1,
    "UsageCost": "Free",
    "AddressInfo": {
        "ID": 71926,
        "Title": "Hilton Garden Inn - Tesla",
        "AddressLine1": "1150 N Poplar St",
        "Town": "Casper",
        "StateOrProvince": "WY",
        "Postcode": "82601",
        "CountryID": 2,
        "Latitude": 42.8627863,
        "Longitude": -106.3340034,
        "ContactTelephone1": "307-266-1300  877-798-3752",
        "AccessComments": "24 hours daily; for Tesla use only; for guest use only; see front desk for access",
        "RelatedURL": "http://www.teslamotors.com/supercharger",
        "DistanceUnit": 0
    },
    "Connections": [
        {
            "ID": 102405,
            "ConnectionTypeID": 30,
            "StatusTypeID": 50,
            "LevelID": 2,
            "Amps": 16,
            "Voltage": 230,
            "PowerKW": 8,
            "CurrentTypeID": 10,
            "Quantity": 2
        }
    ],
    "NumberOfPoints": 2,
    "StatusTypeID": 50,
    "DateLastStatusUpdate": "2017-01-31T18:59:00Z",
    "DataQualityLevel": 3,
    "DateCreated": "2016-09-02T10:15:00Z",
    "SubmissionStatusTypeID": 100
}