{
    "IsRecentlyVerified": false,
    "ID": 152558,
    "UUID": "2B436317-3C53-4CF0-87BF-E7983CBC7E02",
    "DataProviderID": 28,
    "DataProvidersReference": "FR*S70*P0702793",
    "UsageTypeID": 5,
    "AddressInfo": {
        "ID": 152911,
        "Title": "Rue du Mar?chal Leclerc",
        "AddressLine1": "Rue du mar?chal Leclerc - Gray",
        "CountryID": 80,
        "Latitude": 47.26022,
        "Longitude": 5.35317,
        "AccessComments": "accessible 24h/24 - 7j/7",
        "DistanceUnit": 0
    },
    "Connections": [
        {
            "ID": 213613,
            "ConnectionTypeID": 1036,
            "StatusTypeID": 50,
            "LevelID": 2,
            "PowerKW": 22,
            "CurrentTypeID": 20
        },
        {
            "ID": 246655,
            "ConnectionTypeID": 1036,
            "StatusTypeID": 50,
            "LevelID": 2,
            "PowerKW": 22,
            "CurrentTypeID": 20
        }
    ],
    "GeneralComments": "recharge normale et acceleree accessible par application smartphone/internet et badge - informations site web freshmile.fr",
    "StatusTypeID": 50,
    "DateLastStatusUpdate": "2020-08-27T05:13:00Z",
    "DataQualityLevel": 2,
    "DateCreated": "2020-03-15T10:53:00Z",
    "SubmissionStatusTypeID": 100
}