{
    "IsRecentlyVerified": false,
    "ID": 85005,
    "UUID": "D236B9C2-87E3-4DF1-97D5-5A404F88C8F6",
    "DataProviderID": 1,
    "OperatorID": 23,
    "OperatorsReference": "26043",
    "UsageTypeID": 4,
    "AddressInfo": {
        "ID": 85351,
        "Title": "Hotel Schloss Durnstein",
        "AddressLine1": "2 Durnstein",
        "Town": "Durnstein",
        "Postcode": "3601",
        "CountryID": 19,
        "Latitude": 48.396349,
        "Longitude": 15.519063,
        "ContactTelephone1": "+43 2711 212",
        "DistanceUnit": 0
    },
    "Connections": [
        {
            "ID": 120754,
            "ConnectionTypeID": 30,
            "StatusTypeID": 50,
            "LevelID": 2,
            "Amps": 16,
            "Voltage": 230,
            "PowerKW": 22,
            "CurrentTypeID": 10,
            "Quantity": 2
        }
    ],
    "NumberOfPoints": 2,
    "GeneralComments": "2 Tesla Connectors, up to 4kW.Available for customers. Self park.",
    "StatusTypeID": 50,
    "DateLastStatusUpdate": "2018-10-03T17:31:00Z",
    "DataQualityLevel": 1,
    "DateCreated": "2017-03-23T06:30:00Z",
    "SubmissionStatusTypeID": 200
}