{
    "IsRecentlyVerified": false,
    "ID": 66171,
    "UUID": "62138FCE-E3CF-4422-AE46-812BBE4EF44C",
    "DataProviderID": 1,
    "OperatorID": 214,
    "UsageTypeID": 4,
    "AddressInfo": {
        "ID": 66517,
        "Title": "Werbellinstraße",
        "AddressLine1": "Werbellinstraße 8",
        "AddressLine2": "Neukölln",
        "Town": "Berlin",
        "StateOrProvince": "Berlin",
        "Postcode": "12053",
        "CountryID": 87,
        "Latitude": 52.4789798,
        "Longitude": 13.436440800000014,
        "AccessComments": "Graue 24/7 nutzbare Ladesäule vor dem Pflegedienst am Straßenrand mit Ladekarte The New Motion, Lichtblick oder ACE. ",
        "DistanceUnit": 0
    },
    "Connections": [
        {
            "ID": 91463,
            "ConnectionTypeID": 25,
            "StatusTypeID": 50,
            "LevelID": 2,
            "Amps": 16,
            "Voltage": 400,
            "PowerKW": 11,
            "CurrentTypeID": 20,
            "Quantity": 2
        }
    ],
    "NumberOfPoints": 2,
    "StatusTypeID": 50,
    "DateLastStatusUpdate": "2016-05-12T08:24:00Z",
    "DataQualityLevel": 1,
    "DateCreated": "2016-05-12T08:24:00Z",
    "SubmissionStatusTypeID": 200
}