{
    "UserComments": [
        {
            "ID": 22576,
            "ChargePointID": 156215,
            "CommentTypeID": 10,
            "UserName": "ForumElettrico.it",
            "Comment": "Si trova in una zona residenziale, tra Bonisiolo e Casale Sul Sile, in via Altinia. Leggi la recensione completa qui > \r\nhttps://www.forumelettrico.it/forum/enel-x-a-mogliano-veneto-t8153.html",
            "RelatedURL": "https://www.forumelettrico.it/forum/enel-x-a-mogliano-veneto-t8153.html",
            "DateCreated": "2020-05-11T07:06:21.96Z",
            "User": {
                "ID": 11749,
                "Username": "ForumElettrico.it"
            },
            "CheckinStatusTypeID": 140,
            "IsActionedByEditor": false
        }
    ],
    "MediaItems": [
        {
            "ID": 22269,
            "ChargePointID": 156215,
            "ItemURL": "https://s3-ap-southeast-2.amazonaws.com/openchargemap/images/IT/OCM156215/OCM-156215.orig.2020051107063232.jpg",
            "ItemThumbnailURL": "https://s3-ap-southeast-2.amazonaws.com/openchargemap/images/IT/OCM156215/OCM-156215.thmb.2020051107063232.jpg",
            "Comment": "",
            "IsEnabled": true,
            "IsVideo": false,
            "IsFeaturedItem": false,
            "IsExternalResource": false,
            "User": {
                "ID": 11749,
                "Username": "ForumElettrico.it"
            },
            "DateCreated": "2020-05-11T07:07:00Z"
        },
        {
            "ID": 22270,
            "ChargePointID": 156215,
            "ItemURL": "https://s3-ap-southeast-2.amazonaws.com/openchargemap/images/IT/OCM156215/OCM-156215.orig.2020051107063923.jpg",
            "ItemThumbnailURL": "https://s3-ap-southeast-2.amazonaws.com/openchargemap/images/IT/OCM156215/OCM-156215.thmb.2020051107063923.jpg",
            "Comment": "",
            "IsEnabled": true,
            "IsVideo": false,
            "IsFeaturedItem": false,
            "IsExternalResource": false,
            "User": {
                "ID": 11749,
                "Username": "ForumElettrico.it"
            },
            "DateCreated": "2020-05-11T07:07:00Z"
        }
    ],
    "IsRecentlyVerified": false,
    "ID": 156215,
    "UUID": "C6680B45-563A-498C-AD94-F51F19F3B4CC",
    "DataProviderID": 1,
    "OperatorID": 80,
    "UsageTypeID": 1,
    "AddressInfo": {
        "ID": 156569,
        "Title": "Enel X  Bonisiolo",
        "AddressLine1": "Via Altinia 123",
        "Town": "Mogliano Veneto",
        "StateOrProvince": "TV",
        "CountryID": 112,
        "Latitude": 45.583067,
        "Longitude": 12.321898,
        "RelatedURL": "https://www.forumelettrico.it/forum/enel-x-a-mogliano-veneto-t8153.html",
        "DistanceUnit": 0
    },
    "Connections": [
        {
            "ID": 219844,
            "ConnectionTypeID": 25,
            "LevelID": 2,
            "PowerKW": 22,
            "Quantity": 2
        }
    ],
    "NumberOfPoints": 1,
    "StatusTypeID": 50,
    "DateLastStatusUpdate": "2020-05-11T07:07:00Z",
    "DataQualityLevel": 1,
    "DateCreated": "2020-05-11T07:06:00Z",
    "SubmissionStatusTypeID": 200
}