{
    "IsRecentlyVerified": false,
    "ID": 40955,
    "UUID": "81CC8FD4-D0FD-43BC-9D8E-10F60BB7EB37",
    "DataProviderID": 1,
    "OperatorID": 125,
    "UsageTypeID": 1,
    "UsageCost": "0",
    "AddressInfo": {
        "ID": 41301,
        "Title": "Bauraum Bremen e.V.",
        "AddressLine1": "Friedrich-Karl-Straße 96",
        "Town": "Bremen",
        "StateOrProvince": "Bremen",
        "Postcode": "28205",
        "CountryID": 87,
        "Latitude": 53.0766400361485,
        "Longitude": 8.84464491220374,
        "ContactTelephone1": " 0421 3590",
        "AccessComments": "Auf dem Parkplatz",
        "RelatedURL": "https://www.swb-gruppe.de",
        "DistanceUnit": 0
    },
    "Connections": [
        {
            "ID": 44613,
            "ConnectionTypeID": 25,
            "StatusTypeID": 50,
            "LevelID": 2,
            "Amps": 32,
            "Voltage": 400,
            "PowerKW": 22,
            "CurrentTypeID": 20,
            "Quantity": 1
        },
        {
            "ID": 44614,
            "ConnectionTypeID": 17,
            "StatusTypeID": 50,
            "LevelID": 2,
            "Amps": 16,
            "Voltage": 400,
            "PowerKW": 11,
            "CurrentTypeID": 20,
            "Quantity": 1
        }
    ],
    "NumberOfPoints": 2,
    "StatusTypeID": 50,
    "DateLastStatusUpdate": "2015-05-02T15:44:00Z",
    "DataQualityLevel": 1,
    "DateCreated": "2015-01-17T17:23:00Z",
    "SubmissionStatusTypeID": 200
}