{
    "IsRecentlyVerified": false,
    "ID": 20444,
    "UUID": "00302AFF-34AB-48C5-89DC-EF0066B45E13",
    "DataProviderID": 1,
    "OperatorID": 1,
    "UsageTypeID": 0,
    "UsageCost": "",
    "AddressInfo": {
        "ID": 20789,
        "Title": "Parking Confluence",
        "AddressLine1": "7 Rue Paul Montrochet",
        "AddressLine2": "",
        "Town": "Lyon",
        "StateOrProvince": "",
        "Postcode": "69002",
        "CountryID": 80,
        "Latitude": 45.74044,
        "Longitude": 4.81659,
        "ContactTelephone1": "",
        "ContactTelephone2": "",
        "ContactEmail": "",
        "AccessComments": "Ouvert à tous",
        "RelatedURL": "",
        "DistanceUnit": 0
    },
    "Connections": [],
    "GeneralComments": "",
    "StatusTypeID": 50,
    "DateLastStatusUpdate": "2013-11-14T21:19:00Z",
    "DataQualityLevel": 1,
    "DateCreated": "2013-11-14T20:06:00Z",
    "SubmissionStatusTypeID": 200
}