{
    "IsRecentlyVerified": false,
    "ID": 29367,
    "UUID": "83E9C335-2652-4D96-8CFB-A58C07EE6604",
    "DataProviderID": 2,
    "DataProvidersReference": "44169",
    "OperatorID": 5,
    "UsageTypeID": 1,
    "AddressInfo": {
        "ID": 29713,
        "Title": "SWWA JATC",
        "AddressLine1": "3001 S 36th St",
        "Town": "Tacoma",
        "StateOrProvince": "WA",
        "Postcode": "98409",
        "CountryID": 2,
        "Latitude": 47.2269249,
        "Longitude": -122.4752808,
        "ContactTelephone1": "888-758-4389",
        "AccessComments": "24 hours daily",
        "RelatedURL": "http://www.chargepoint.com/",
        "DistanceUnit": 0
    },
    "Connections": [
        {
            "ID": 32293,
            "ConnectionTypeID": 9,
            "LevelID": 1,
            "Amps": 16,
            "Voltage": 120,
            "PowerKW": 1,
            "CurrentTypeID": 10,
            "Quantity": 1
        },
        {
            "ID": 32294,
            "ConnectionTypeID": 1,
            "LevelID": 2,
            "Amps": 16,
            "Voltage": 230,
            "PowerKW": 3,
            "CurrentTypeID": 10,
            "Quantity": 1
        }
    ],
    "DateLastStatusUpdate": "2019-12-24T09:24:00Z",
    "DataQualityLevel": 3,
    "DateCreated": "2014-11-28T03:39:00Z",
    "SubmissionStatusTypeID": 100
}