{
    "IsRecentlyVerified": false,
    "ID": 111642,
    "UUID": "93288581-E9AC-4871-93F8-6FC70D92A448",
    "DataProviderID": 2,
    "DataProvidersReference": "83578",
    "UsageTypeID": 1,
    "AddressInfo": {
        "ID": 111988,
        "Title": "Miramichi City Hall",
        "AddressLine1": "141 Henry St",
        "Town": "Miramichi",
        "StateOrProvince": "NB",
        "Postcode": "E1V 2N5",
        "CountryID": 44,
        "Latitude": 47.001077,
        "Longitude": -65.566121,
        "ContactTelephone1": "506-623-2200",
        "AccessComments": "24 hours daily",
        "RelatedURL": "",
        "DistanceUnit": 0
    },
    "Connections": [
        {
            "ID": 157113,
            "ConnectionTypeID": 1,
            "LevelID": 2,
            "Amps": 16,
            "Voltage": 230,
            "PowerKW": 3.7,
            "CurrentTypeID": 10,
            "Quantity": 1
        }
    ],
    "DateLastStatusUpdate": "2020-06-26T03:10:00Z",
    "DataQualityLevel": 3,
    "DateCreated": "2018-10-18T23:37:00Z",
    "SubmissionStatusTypeID": 100
}