{
    "IsRecentlyVerified": false,
    "ID": 125080,
    "UUID": "6059CBC4-5EB5-44B1-8796-B15830E9F7D4",
    "DataProviderID": 1,
    "OperatorID": 221,
    "UsageTypeID": 1,
    "UsageCost": "0.3euro/kwh",
    "AddressInfo": {
        "ID": 125426,
        "Title": "DS-Car, Audi",
        "AddressLine1": "Ulica Istvána Gyurcsóa 7200/38A",
        "Town": "DUNAJSKÁ STREDA",
        "Postcode": "929 01 ",
        "CountryID": 204,
        "Latitude": 47.9972393736782,
        "Longitude": 17.6271848415797,
        "DistanceUnit": 0
    },
    "Connections": [
        {
            "ID": 175308,
            "ConnectionTypeID": 33,
            "StatusTypeID": 50,
            "LevelID": 3,
            "PowerKW": 50,
            "CurrentTypeID": 30
        },
        {
            "ID": 175309,
            "ConnectionTypeID": 1036,
            "StatusTypeID": 50,
            "LevelID": 2,
            "Amps": 32,
            "Voltage": 400,
            "PowerKW": 22,
            "CurrentTypeID": 20,
            "Quantity": 1
        }
    ],
    "NumberOfPoints": 1,
    "StatusTypeID": 50,
    "DateLastStatusUpdate": "2019-04-10T10:19:00Z",
    "DataQualityLevel": 1,
    "DateCreated": "2019-04-09T15:21:00Z",
    "SubmissionStatusTypeID": 200
}