{
    "IsRecentlyVerified": false,
    "ID": 159393,
    "UUID": "3A034A10-9A1A-467E-9E31-648E4C8AB13E",
    "DataProviderID": 2,
    "DataProvidersReference": "150811",
    "OperatorID": 5,
    "UsageTypeID": 1,
    "AddressInfo": {
        "ID": 159750,
        "Title": "FH_CONDOMINIUM",
        "AddressLine1": "18701 Club Plaza Drive Parking area below pool house",
        "Town": "Germantown",
        "StateOrProvince": "MD",
        "Postcode": "20874",
        "CountryID": 2,
        "Latitude": 39.163002,
        "Longitude": -77.27701,
        "ContactTelephone1": "888-758-4389",
        "AccessComments": "24 hours daily",
        "RelatedURL": "http://www.chargepoint.com/",
        "DistanceUnit": 0
    },
    "Connections": [
        {
            "ID": 229557,
            "ConnectionTypeID": 1,
            "LevelID": 2,
            "Amps": 16,
            "Voltage": 230,
            "PowerKW": 3.7,
            "CurrentTypeID": 10,
            "Quantity": 2
        }
    ],
    "StatusTypeID": 50,
    "DateLastStatusUpdate": "2020-06-26T03:01:00Z",
    "DataQualityLevel": 3,
    "DateCreated": "2020-06-26T03:01:00Z",
    "SubmissionStatusTypeID": 100
}