{
    "IsRecentlyVerified": false,
    "ID": 101547,
    "UUID": "8E439C6F-C6FC-44A8-AB67-93F4B6B97BF6",
    "DataProviderID": 1,
    "OperatorID": 23,
    "OperatorsReference": "41788",
    "UsageTypeID": 7,
    "AddressInfo": {
        "ID": 101893,
        "Title": "Bluesun Hotel Kaj",
        "AddressLine1": "Zagrebacka B.B.",
        "Town": "Marija Bistrica",
        "Postcode": "49246",
        "CountryID": 60,
        "Latitude": 46.002916,
        "Longitude": 16.11757,
        "ContactTelephone1": "+38 549 326 600",
        "DistanceUnit": 0
    },
    "Connections": [
        {
            "ID": 143356,
            "ConnectionTypeID": 30,
            "StatusTypeID": 50,
            "LevelID": 2,
            "Amps": 32,
            "Voltage": 230,
            "PowerKW": 17,
            "CurrentTypeID": 20,
            "Quantity": 1
        }
    ],
    "NumberOfPoints": 1,
    "GeneralComments": "1 Tesla Connector, up to 17kW.Available by reservation only. Please call ahead.",
    "StatusTypeID": 50,
    "DateLastStatusUpdate": "2018-10-04T00:00:00Z",
    "DataQualityLevel": 1,
    "DateCreated": "2018-03-30T05:52:00Z",
    "SubmissionStatusTypeID": 200
}