{
    "IsRecentlyVerified": false,
    "ID": 118060,
    "UUID": "E19A4D49-B2DC-4DE5-8F85-6A185039C959",
    "DataProviderID": 1,
    "OperatorID": 23,
    "OperatorsReference": "49139",
    "UsageTypeID": 4,
    "AddressInfo": {
        "ID": 118406,
        "Title": "De Vere Tortworth Court",
        "AddressLine1": "Tourtworth Road",
        "Town": "Wooten-under-Edge",
        "Postcode": "GL12 8HH",
        "CountryID": 1,
        "Latitude": 51.630529,
        "Longitude": -2.443997,
        "ContactTelephone1": "+44 145 426 3000",
        "DistanceUnit": 0
    },
    "Connections": [
        {
            "ID": 167079,
            "ConnectionTypeID": 30,
            "StatusTypeID": 50,
            "LevelID": 2,
            "Amps": 32,
            "Voltage": 230,
            "PowerKW": 7,
            "CurrentTypeID": 10,
            "Quantity": 2
        }
    ],
    "NumberOfPoints": 2,
    "GeneralComments": "2 Tesla Connectors, up to 7kW.Available for customers. Please see front desk.",
    "StatusTypeID": 50,
    "DateLastStatusUpdate": "2019-03-14T23:23:00Z",
    "DataQualityLevel": 1,
    "DateCreated": "2019-03-14T23:23:00Z",
    "SubmissionStatusTypeID": 200
}