{
    "IsRecentlyVerified": false,
    "ID": 146271,
    "UUID": "691A22D0-7092-490E-B89E-3FB204656817",
    "DataProviderID": 1,
    "OperatorID": 213,
    "OperatorsReference": "5e0363bee4b0b5fe47f1415a,5e0363c0e4b0b5fe47f14177",
    "UsageTypeID": 1,
    "UsageCost": "0.00€",
    "AddressInfo": {
        "ID": 146623,
        "Title": "Rue des Bellangeres 36",
        "AddressLine1": "Rue des Bellangeres 36",
        "Town": "Le Coudray",
        "StateOrProvince": "Eure-et-Loir",
        "Postcode": "28630",
        "CountryID": 80,
        "Latitude": 48.416672,
        "Longitude": 1.49085,
        "DistanceUnit": 0
    },
    "Connections": [
        {
            "ID": 203267,
            "ConnectionTypeID": 23,
            "StatusTypeID": 50,
            "LevelID": 1,
            "PowerKW": 2,
            "CurrentTypeID": 20,
            "Quantity": 1
        },
        {
            "ID": 203268,
            "ConnectionTypeID": 1036,
            "StatusTypeID": 50,
            "LevelID": 2,
            "Amps": 32,
            "Voltage": 400,
            "PowerKW": 22,
            "CurrentTypeID": 20,
            "Quantity": 1
        }
    ],
    "NumberOfPoints": 1,
    "StatusTypeID": 50,
    "DateLastStatusUpdate": "2020-01-05T20:22:00Z",
    "DataQualityLevel": 1,
    "DateCreated": "2020-01-05T20:22:00Z",
    "SubmissionStatusTypeID": 200
}