{
    "UserComments": [
        {
            "ID": 21931,
            "ChargePointID": 132452,
            "CommentTypeID": 10,
            "UserName": "charles",
            "Comment": "90 minute charge with CCS2 at 50k\r\ngenie is easy  to use",
            "Rating": 5,
            "DateCreated": "2019-12-22T23:46:10.933Z",
            "User": {
                "ID": 23357,
                "Username": "charles"
            },
            "CheckinStatusTypeID": 10,
            "IsActionedByEditor": false
        }
    ],
    "IsRecentlyVerified": false,
    "ID": 132452,
    "UUID": "DA4343F4-0803-4878-8A24-13B983857633",
    "DataProviderID": 1,
    "OperatorID": 150,
    "UsageTypeID": 4,
    "UsageCost": "£1.00 + £0.30 / kWh. £10.00 overstay fee after 95 mins, then £10.00 every subsequent 95 mins ",
    "AddressInfo": {
        "ID": 132798,
        "Title": "Morrisons Totnes Coronation Road",
        "AddressLine1": "Coronation Road",
        "Town": "Totnes",
        "Postcode": "TQ9 5DF",
        "CountryID": 1,
        "Latitude": 50.43165,
        "Longitude": -3.68274,
        "RelatedURL": "http://www.chargepointservices.com/",
        "DistanceUnit": 0
    },
    "Connections": [
        {
            "ID": 185450,
            "ConnectionTypeID": 1036,
            "Reference": "1",
            "StatusTypeID": 50,
            "LevelID": 3,
            "Amps": 63,
            "Voltage": 400,
            "PowerKW": 43,
            "CurrentTypeID": 20,
            "Quantity": 1
        },
        {
            "ID": 185466,
            "ConnectionTypeID": 2,
            "StatusTypeID": 50,
            "LevelID": 3,
            "PowerKW": 50,
            "CurrentTypeID": 30,
            "Quantity": 1
        },
        {
            "ID": 185467,
            "ConnectionTypeID": 33,
            "StatusTypeID": 50,
            "LevelID": 3,
            "PowerKW": 50,
            "CurrentTypeID": 30,
            "Quantity": 1
        }
    ],
    "NumberOfPoints": 1,
    "StatusTypeID": 50,
    "DateLastStatusUpdate": "2019-12-22T23:46:00Z",
    "MetadataValues": [
        {
            "ID": 4952,
            "MetadataFieldID": 4,
            "ItemValue": "Contains public sector information licensed under the Open Government Licence v2.0. http://www.nationalarchives.gov.uk/doc/open-government-licence/version/2/"
        }
    ],
    "DataQualityLevel": 3,
    "DateCreated": "2019-09-30T18:20:00Z",
    "SubmissionStatusTypeID": 200
}