{
    "IsRecentlyVerified": false,
    "ID": 94142,
    "UUID": "C491E386-6BA2-44CE-8561-60C7C7E57EBE",
    "DataProviderID": 1,
    "OperatorID": 234,
    "UsageTypeID": 4,
    "AddressInfo": {
        "ID": 94488,
        "Title": "Georg-Benda-Straße",
        "AddressLine1": "Georg-Benda-Straße 1",
        "Town": "Fürth",
        "StateOrProvince": "Fürth",
        "Postcode": "90763",
        "CountryID": 87,
        "Latitude": 49.44590045279267,
        "Longitude": 10.99245437301636,
        "AccessComments": "24/7 nutzbar, 2 kostenlsoe Parkplätze",
        "DistanceUnit": 0
    },
    "Connections": [
        {
            "ID": 133233,
            "ConnectionTypeID": 25,
            "StatusTypeID": 50,
            "LevelID": 2,
            "Amps": 32,
            "Voltage": 400,
            "PowerKW": 22,
            "CurrentTypeID": 20,
            "Quantity": 2
        }
    ],
    "NumberOfPoints": 2,
    "StatusTypeID": 50,
    "DateLastStatusUpdate": "2017-10-18T07:33:00Z",
    "DataQualityLevel": 1,
    "DateCreated": "2017-10-18T07:33:00Z",
    "SubmissionStatusTypeID": 200
}