{
    "IsRecentlyVerified": false,
    "ID": 94020,
    "UUID": "B00D7A53-FEA5-4CEE-9379-139C1D5A7E6A",
    "DataProviderID": 1,
    "OperatorID": 23,
    "OperatorsReference": "36283",
    "UsageTypeID": 6,
    "AddressInfo": {
        "ID": 94366,
        "Title": "Sorelle Ramonda",
        "AddressLine1": "Via Roma",
        "Town": "182",
        "StateOrProvince": "Castrette di Villorba",
        "Postcode": "31020",
        "CountryID": 112,
        "Latitude": 45.736457,
        "Longitude": 12.2504,
        "ContactTelephone1": "+39 0422 910 104",
        "DistanceUnit": 0
    },
    "Connections": [
        {
            "ID": 133074,
            "ConnectionTypeID": 30,
            "StatusTypeID": 50,
            "LevelID": 2,
            "Amps": 32,
            "Voltage": 400,
            "PowerKW": 22,
            "CurrentTypeID": 20,
            "Quantity": 1
        }
    ],
    "NumberOfPoints": 1,
    "GeneralComments": "1 Tesla Connector, up to 22kW.Available for patrons only. Self park.",
    "StatusTypeID": 50,
    "DateLastStatusUpdate": "2018-10-03T23:08:00Z",
    "DataQualityLevel": 1,
    "DateCreated": "2017-10-14T05:38:00Z",
    "SubmissionStatusTypeID": 200
}