{
    "IsRecentlyVerified": false,
    "ID": 62494,
    "UUID": "051827B0-781C-4AD7-8424-F3F4F504C31B",
    "DataProviderID": 2,
    "DataProvidersReference": "71918",
    "OperatorID": 5,
    "UsageTypeID": 1,
    "AddressInfo": {
        "ID": 62840,
        "Title": "ESSEX",
        "AddressLine1": "16160 SE Eastgate Way",
        "Town": "Bellevue",
        "StateOrProvince": "WA",
        "Postcode": "98008",
        "CountryID": 2,
        "Latitude": 47.577051,
        "Longitude": -122.1251642,
        "ContactTelephone1": "888-758-4389",
        "AccessComments": "24 hours daily",
        "RelatedURL": "http://www.chargepoint.com/",
        "DistanceUnit": 0
    },
    "Connections": [
        {
            "ID": 79400,
            "ConnectionTypeID": 1,
            "LevelID": 2,
            "Amps": 16,
            "Voltage": 230,
            "PowerKW": 3.7,
            "CurrentTypeID": 10,
            "Quantity": 2
        }
    ],
    "DateLastStatusUpdate": "2020-06-26T03:11:00Z",
    "DataQualityLevel": 3,
    "DateCreated": "2016-03-03T11:39:00Z",
    "SubmissionStatusTypeID": 100
}