{
    "IsRecentlyVerified": false,
    "ID": 53345,
    "UUID": "206A7201-C303-478E-AFEA-1A2D2BEA182D",
    "DataProviderID": 2,
    "DataProvidersReference": "69734",
    "UsageTypeID": 7,
    "AddressInfo": {
        "ID": 53691,
        "Title": "Redding Kia",
        "AddressLine1": "418 E Cypress Ave",
        "Town": "Redding",
        "StateOrProvince": "CA",
        "Postcode": "96002",
        "CountryID": 2,
        "Latitude": 40.571392,
        "Longitude": -122.364311,
        "ContactTelephone1": "530-226-0418",
        "AccessComments": "Dealership business hours\r\nPublic - Call ahead",
        "RelatedURL": "",
        "DistanceUnit": 0
    },
    "Connections": [
        {
            "ID": 66460,
            "ConnectionTypeID": 1,
            "LevelID": 2,
            "Amps": 16,
            "Voltage": 230,
            "PowerKW": 3.7,
            "CurrentTypeID": 10,
            "Quantity": 1
        }
    ],
    "DateLastStatusUpdate": "2020-06-26T03:03:00Z",
    "DataQualityLevel": 3,
    "DateCreated": "2015-09-20T11:18:00Z",
    "SubmissionStatusTypeID": 100
}