{
    "IsRecentlyVerified": false,
    "ID": 115527,
    "UUID": "76BD0654-1B73-406C-BED5-E15B27C9842D",
    "DataProviderID": 2,
    "DataProvidersReference": "113352",
    "OperatorID": 23,
    "UsageTypeID": 2,
    "AddressInfo": {
        "ID": 115873,
        "Title": "Airbnb - Cal Poly - Tesla Destination",
        "AddressLine1": "2060 McCollum St",
        "Town": "San Luis Obispo",
        "StateOrProvince": "CA",
        "Postcode": "93401",
        "CountryID": 2,
        "Latitude": 35.294502,
        "Longitude": -120.649796,
        "ContactTelephone1": "",
        "AccessComments": "Available for Airbnb patrons only; for Tesla use only",
        "RelatedURL": "https://www.tesla.com/destination-charging",
        "DistanceUnit": 0
    },
    "Connections": [
        {
            "ID": 162544,
            "ConnectionTypeID": 0,
            "LevelID": 2,
            "Amps": 16,
            "Voltage": 230,
            "PowerKW": 3,
            "CurrentTypeID": 10,
            "Quantity": 1
        }
    ],
    "DateLastStatusUpdate": "2019-04-06T04:02:00Z",
    "DataQualityLevel": 3,
    "DateCreated": "2019-02-11T07:13:00Z",
    "SubmissionStatusTypeID": 100
}