{
    "IsRecentlyVerified": false,
    "ID": 32659,
    "UUID": "A18562FB-F5C8-49F8-AEA1-7DFEDA169CCD",
    "DataProviderID": 1,
    "OperatorID": 105,
    "OperatorsReference": "Essent EM-DE-05114000-03-00002",
    "UsageTypeID": 4,
    "AddressInfo": {
        "ID": 33005,
        "Title": "Uerdinger Straße 593",
        "AddressLine1": "Uerdinger Straße 593",
        "Town": "Krefeld",
        "Postcode": "47800",
        "CountryID": 87,
        "Latitude": 51.346013,
        "Longitude": 6.619668,
        "DistanceUnit": 0
    },
    "Connections": [
        {
            "ID": 36170,
            "ConnectionTypeID": 25,
            "LevelID": 2,
            "PowerKW": 11
        },
        {
            "ID": 46468,
            "ConnectionTypeID": 25,
            "LevelID": 2,
            "PowerKW": 11
        }
    ],
    "NumberOfPoints": 1,
    "StatusTypeID": 50,
    "DateLastStatusUpdate": "2015-04-13T23:18:00Z",
    "DataQualityLevel": 3,
    "DateCreated": "2015-01-09T06:03:00Z",
    "SubmissionStatusTypeID": 200
}