{
    "IsRecentlyVerified": false,
    "ID": 42664,
    "UUID": "5D351505-F08E-478E-89DE-4D244E10CF3C",
    "DataProviderID": 1,
    "OperatorID": 173,
    "UsageTypeID": 4,
    "AddressInfo": {
        "ID": 43010,
        "Title": "Emsteker Straße",
        "AddressLine1": "Emsteker Straße 135",
        "Town": "Cloppenburg",
        "StateOrProvince": "Landkreis Cloppenburg",
        "Postcode": "49661",
        "CountryID": 87,
        "Latitude": 52.8352068630588,
        "Longitude": 8.09684577751239,
        "ContactTelephone1": " 04471 85020",
        "AccessComments": "2 kostenlose Parkplätze an Ladesäule, nutzbar mit ChargeNow Karte während der Öffnungszeiten des BMW Autohauses Mo-Fr 8-18:30, Sa 9-14, So 11-17Uhr",
        "RelatedURL": "http://www.walkenhorst-gruppe.de/",
        "DistanceUnit": 0
    },
    "Connections": [
        {
            "ID": 51442,
            "ConnectionTypeID": 25,
            "StatusTypeID": 50,
            "LevelID": 2,
            "Amps": 32,
            "Voltage": 400,
            "PowerKW": 22,
            "CurrentTypeID": 20,
            "Quantity": 2
        }
    ],
    "NumberOfPoints": 2,
    "StatusTypeID": 50,
    "DateLastStatusUpdate": "2015-03-20T10:03:00Z",
    "DataQualityLevel": 1,
    "DateCreated": "2015-03-19T16:08:00Z",
    "SubmissionStatusTypeID": 200
}