{
    "IsRecentlyVerified": false,
    "ID": 90214,
    "UUID": "A19EADF7-FEB8-489C-B457-11ECB101B83A",
    "DataProviderID": 1,
    "OperatorID": 23,
    "OperatorsReference": "30825",
    "UsageTypeID": 6,
    "AddressInfo": {
        "ID": 90560,
        "Title": "Grand Hotel Molveno",
        "AddressLine1": "18 Via Bettega",
        "Town": "Molveno",
        "Postcode": "38018",
        "CountryID": 112,
        "Latitude": 46.133306,
        "Longitude": 10.968499,
        "ContactTelephone1": "+39 0461 586 934",
        "DistanceUnit": 0
    },
    "Connections": [
        {
            "ID": 127867,
            "ConnectionTypeID": 30,
            "StatusTypeID": 50,
            "LevelID": 2,
            "Amps": 32,
            "Voltage": 400,
            "PowerKW": 22,
            "CurrentTypeID": 20,
            "Quantity": 1
        }
    ],
    "NumberOfPoints": 1,
    "GeneralComments": "1 Tesla Connector, up to 22kW.Available for patrons only. Please call ahead.Seasonal availability. Please call ahead.",
    "StatusTypeID": 50,
    "DateLastStatusUpdate": "2018-10-03T15:49:00Z",
    "DataQualityLevel": 1,
    "DateCreated": "2017-07-13T14:17:00Z",
    "SubmissionStatusTypeID": 200
}