{
    "IsRecentlyVerified": false,
    "ID": 143001,
    "UUID": "30DECF2D-6D22-4448-9E6C-475281253A0E",
    "DataProviderID": 2,
    "DataProvidersReference": "99751",
    "OperatorID": 5,
    "UsageTypeID": 1,
    "AddressInfo": {
        "ID": 143353,
        "Title": "NATIONAL GRID",
        "AddressLine1": "791 MA-12",
        "Town": "Auburn",
        "StateOrProvince": "MA",
        "Postcode": "01501",
        "CountryID": 2,
        "Latitude": 42.1810281,
        "Longitude": -71.8683786,
        "ContactTelephone1": "888-758-4389",
        "AccessComments": "24 hours daily",
        "RelatedURL": "http://www.chargepoint.com/",
        "DistanceUnit": 0
    },
    "Connections": [
        {
            "ID": 199253,
            "ConnectionTypeID": 1,
            "LevelID": 2,
            "Amps": 16,
            "Voltage": 230,
            "PowerKW": 3.7,
            "CurrentTypeID": 10,
            "Quantity": 2
        }
    ],
    "StatusTypeID": 50,
    "DateLastStatusUpdate": "2020-06-26T03:05:00Z",
    "DataQualityLevel": 3,
    "DateCreated": "2019-12-24T09:19:00Z",
    "SubmissionStatusTypeID": 100
}