{
    "IsRecentlyVerified": false,
    "ID": 77298,
    "UUID": "490F1E95-CC6C-4753-8897-D18DA9711280",
    "DataProviderID": 1,
    "OperatorID": 45,
    "UsageTypeID": 1,
    "AddressInfo": {
        "ID": 77644,
        "Title": "Berufsbildungszentrum",
        "AddressLine1": "Johann-Josef-Heinrich-Straße 2",
        "Town": "St. Ingbert",
        "StateOrProvince": "Saarpfalz-Kreis",
        "Postcode": "66386",
        "CountryID": 87,
        "Latitude": 49.2700988,
        "Longitude": 7.105337299999974,
        "AccessComments": "Alle Infos siehe Zeitungsartikel. Wahrscheinlich freier 24/7 Zugang ohne Ladekarte.",
        "RelatedURL": "http://www.saarbruecker-zeitung.de/saarland/homburg/sanktingbert/sanktingbert/St-Ingbert-Buergermeister-und-Oberbuergermeister-E-Bikes-Elektroauto-Landraete-Motoren-Unternehmen-Firmen-und-Firmengruppen;art446871,6348084",
        "DistanceUnit": 0
    },
    "Connections": [
        {
            "ID": 111374,
            "ConnectionTypeID": 25,
            "StatusTypeID": 50,
            "LevelID": 2,
            "Amps": 32,
            "Voltage": 400,
            "PowerKW": 22,
            "CurrentTypeID": 20,
            "Quantity": 2
        },
        {
            "ID": 111375,
            "ConnectionTypeID": 28,
            "StatusTypeID": 50,
            "LevelID": 2,
            "Amps": 16,
            "Voltage": 230,
            "PowerKW": 3.7,
            "CurrentTypeID": 10,
            "Quantity": 2
        }
    ],
    "NumberOfPoints": 2,
    "StatusTypeID": 50,
    "DateLastStatusUpdate": "2017-01-09T08:27:00Z",
    "DataQualityLevel": 1,
    "DateCreated": "2017-01-09T08:27:00Z",
    "SubmissionStatusTypeID": 200
}