{
    "IsRecentlyVerified": false,
    "ID": 159643,
    "UUID": "29DF4C66-0BF8-4F47-84EF-0FE7D2F75867",
    "DataProviderID": 2,
    "DataProvidersReference": "152310",
    "OperatorID": 9,
    "UsageTypeID": 2,
    "AddressInfo": {
        "ID": 160000,
        "Title": "Johnson & Johnson",
        "AddressLine1": "501 George Street",
        "Town": "New Brunswick",
        "StateOrProvince": "NJ",
        "Postcode": "08933",
        "CountryID": 2,
        "Latitude": 40.499499,
        "Longitude": -74.443769,
        "ContactTelephone1": "888-998-2546",
        "AccessComments": "MON: 24 hours | TUE: 24 hours | WED: 24 hours | THU: 24 hours | FRI: 24 hours | SAT: 24 hours | SUN: 24 hours",
        "RelatedURL": "http://www.blinkcharging.com/",
        "DistanceUnit": 0
    },
    "Connections": [
        {
            "ID": 229844,
            "ConnectionTypeID": 1,
            "LevelID": 2,
            "Amps": 16,
            "Voltage": 230,
            "PowerKW": 3.7,
            "CurrentTypeID": 10,
            "Quantity": 2
        }
    ],
    "StatusTypeID": 50,
    "DateLastStatusUpdate": "2020-06-26T03:03:00Z",
    "DataQualityLevel": 3,
    "DateCreated": "2020-06-26T03:03:00Z",
    "SubmissionStatusTypeID": 100
}