{
    "IsRecentlyVerified": false,
    "ID": 122521,
    "UUID": "75FF3B71-560C-4DCB-BAFB-5A510D7F0D42",
    "DataProviderID": 2,
    "DataProvidersReference": "113041",
    "OperatorID": 23,
    "UsageTypeID": 2,
    "AddressInfo": {
        "ID": 122867,
        "Title": "Airbnb - Joshua Tree - Tesla Destination",
        "AddressLine1": "65122 Broadway",
        "Town": "Joshua Tree",
        "StateOrProvince": "CA",
        "Postcode": "92252",
        "CountryID": 2,
        "Latitude": 34.164703,
        "Longitude": -116.242397,
        "ContactTelephone1": "",
        "AccessComments": "Available for Airbnb patrons only; for Tesla use only",
        "RelatedURL": "https://www.tesla.com/destination-charging",
        "DistanceUnit": 0
    },
    "Connections": [
        {
            "ID": 172417,
            "ConnectionTypeID": 0,
            "LevelID": 2,
            "Amps": 16,
            "Voltage": 230,
            "PowerKW": 3,
            "CurrentTypeID": 10,
            "Quantity": 1
        }
    ],
    "DateLastStatusUpdate": "2019-04-06T05:03:00Z",
    "DataQualityLevel": 3,
    "DateCreated": "2019-04-06T05:03:00Z",
    "SubmissionStatusTypeID": 100
}