{
    "IsRecentlyVerified": false,
    "ID": 158805,
    "UUID": "711C901E-4B17-4224-8B4F-5A5A39D7B7E0",
    "DataProviderID": 2,
    "DataProvidersReference": "152842",
    "OperatorID": 3293,
    "UsageTypeID": 1,
    "AddressInfo": {
        "ID": 159162,
        "Title": "Whole Foods Market Pasadena",
        "AddressLine1": "465 S Arroyo Pkwy",
        "Town": "Pasadena",
        "StateOrProvince": "CA",
        "Postcode": "91105",
        "CountryID": 2,
        "Latitude": 34.138258,
        "Longitude": -118.147991,
        "ContactTelephone1": "888-264-2208",
        "AccessComments": "6am-12pm daily",
        "RelatedURL": "https://voltacharging.com/",
        "DistanceUnit": 0
    },
    "Connections": [
        {
            "ID": 228839,
            "ConnectionTypeID": 1,
            "LevelID": 2,
            "Amps": 16,
            "Voltage": 230,
            "PowerKW": 3.7,
            "CurrentTypeID": 10,
            "Quantity": 4
        }
    ],
    "StatusTypeID": 50,
    "DateLastStatusUpdate": "2020-06-26T02:57:00Z",
    "DataQualityLevel": 3,
    "DateCreated": "2020-06-26T02:57:00Z",
    "SubmissionStatusTypeID": 100
}