{
    "UserComments": [
        {
            "ID": 6545,
            "ChargePointID": 13467,
            "CommentTypeID": 10,
            "UserName": "Richard Butler ",
            "Comment": "Polar card worked for me. Both bays we empty today. Not sure if Wednesday and Saturday parking restrictions apply to EV on charge. I was there from 11 to 2. I didn't get a parking ticket ",
            "DateCreated": "2015-09-23T15:02:47.01Z",
            "User": {
                "ID": 4938,
                "Username": "Richard Butler "
            },
            "CheckinStatusTypeID": 10,
            "IsActionedByEditor": true
        },
        {
            "ID": 4656,
            "ChargePointID": 13467,
            "CommentTypeID": 10,
            "UserName": "Simon Hewison",
            "Comment": "One bay was ICEd. Charged with Polar network card. No fees charged.",
            "Rating": 3,
            "DateCreated": "2015-06-07T21:49:14.463Z",
            "User": {
                "ID": 4575,
                "Username": "Simon Hewison"
            },
            "CheckinStatusTypeID": 10
        },
        {
            "ID": 4312,
            "ChargePointID": 13467,
            "CommentTypeID": 10,
            "UserName": "Simon Hewison",
            "Comment": "Like most Chargemaster posts on Source East,  this one doesn't know about the Source London / Source East roaming agreement. Luckily,  I keep a Polar Network card in the car. Bays still appear to be marked for an apparently defunct car club.",
            "Rating": 2,
            "DateCreated": "2015-04-26T20:38:44.16Z",
            "User": {
                "ID": 4575,
                "Username": "Simon Hewison"
            },
            "CheckinStatusTypeID": 10
        },
        {
            "ID": 3923,
            "ChargePointID": 13467,
            "CommentTypeID": 100,
            "UserName": "MarshallBuckley",
            "Comment": "Point is actually 2 x mennekes type 2, not 13amp/3-pin",
            "Rating": 4,
            "DateCreated": "2015-03-04T22:03:38.307Z",
            "User": {
                "ID": 4461,
                "Username": "MarshallBuckley"
            },
            "CheckinStatusTypeID": 10
        },
        {
            "ID": 3549,
            "ChargePointID": 13467,
            "CommentTypeID": 10,
            "UserName": "Huw Watkins",
            "Comment": "Charging unit in place and operational, must have been replaced.",
            "DateCreated": "2015-01-09T23:02:14.203Z",
            "User": {
                "ID": 4513,
                "Username": "Huw Watkins"
            },
            "CheckinStatusTypeID": 140
        },
        {
            "ID": 861,
            "ChargePointID": 13467,
            "CommentTypeID": 100,
            "UserName": "bdo21",
            "Comment": "Charging point (assuming there was one there before)  has been replaced by a cone with a \"lice wire\"  notice",
            "DateCreated": "2014-05-31T19:06:25.953Z",
            "User": {
                "ID": 1958,
                "Username": "bdo21"
            },
            "CheckinStatusTypeID": 160
        }
    ],
    "MediaItems": [
        {
            "ID": 3238,
            "ChargePointID": 13467,
            "ItemURL": "https://s3-ap-southeast-2.amazonaws.com/openchargemap/images/GB/OCM13467/OCM-13467.orig.2015092315042451.jpg",
            "ItemThumbnailURL": "https://s3-ap-southeast-2.amazonaws.com/openchargemap/images/GB/OCM13467/OCM-13467.thmb.2015092315042451.jpg",
            "Comment": "Paint on the road is fading with age. I am unsure if the parking restrictions apply to the 2 EV bays. ",
            "IsEnabled": true,
            "IsVideo": false,
            "IsFeaturedItem": false,
            "IsExternalResource": false,
            "User": {
                "ID": 4938,
                "Username": "Richard Butler "
            },
            "DateCreated": "2015-09-23T15:05:00Z"
        }
    ],
    "IsRecentlyVerified": false,
    "ID": 13467,
    "UUID": "97B091A2-10F5-43B1-A5FB-FB8242FAD265",
    "DataProviderID": 1,
    "OperatorID": 32,
    "OperatorsReference": "1710",
    "UsageTypeID": 4,
    "UsageCost": "£0.108/kWh; for Polar Plus subscription members only",
    "AddressInfo": {
        "ID": 13364,
        "Title": "Upper Dagnall Street",
        "AddressLine1": "Upper Dagnall Street",
        "Town": "St Albans",
        "StateOrProvince": "Hertfordshire",
        "Postcode": "AL3 5ED",
        "CountryID": 1,
        "Latitude": 51.75234,
        "Longitude": -0.340132,
        "AccessComments": "Two car club bays with a Chargemaster post on them.",
        "DistanceUnit": 0
    },
    "Connections": [
        {
            "ID": 10911,
            "ConnectionTypeID": 25,
            "StatusTypeID": 50,
            "LevelID": 2,
            "Amps": 32,
            "Voltage": 230,
            "PowerKW": 7,
            "CurrentTypeID": 10,
            "Quantity": 2
        }
    ],
    "NumberOfPoints": 2,
    "GeneralComments": "Chargemaster post 1710. Formerly on Source East",
    "StatusTypeID": 50,
    "DateLastStatusUpdate": "2019-03-05T06:16:00Z",
    "DataQualityLevel": 3,
    "DateCreated": "2012-10-13T04:36:00Z",
    "SubmissionStatusTypeID": 200
}