{
    "IsRecentlyVerified": false,
    "ID": 143774,
    "UUID": "E386915D-9093-4E86-BA11-0E261FB43B59",
    "DataProviderID": 2,
    "DataProvidersReference": "129578",
    "OperatorID": 89,
    "UsageTypeID": 1,
    "AddressInfo": {
        "ID": 144126,
        "Title": "Kingston - Emily Street",
        "AddressLine1": "34-2 Emily St.",
        "Town": "Kingston",
        "StateOrProvince": "ON",
        "Postcode": "K7L 2W2",
        "CountryID": 44,
        "Latitude": 44.222238,
        "Longitude": -76.48852,
        "ContactTelephone1": "888-356-8911",
        "AccessComments": "24 hours daily",
        "RelatedURL": "https://flo.ca/",
        "DistanceUnit": 0
    },
    "Connections": [
        {
            "ID": 200169,
            "ConnectionTypeID": 1,
            "LevelID": 2,
            "Amps": 16,
            "Voltage": 230,
            "PowerKW": 3.7,
            "CurrentTypeID": 10,
            "Quantity": 2
        }
    ],
    "StatusTypeID": 50,
    "DateLastStatusUpdate": "2020-06-26T03:07:00Z",
    "DataQualityLevel": 3,
    "DateCreated": "2019-12-24T09:22:00Z",
    "SubmissionStatusTypeID": 100
}