{
    "IsRecentlyVerified": false,
    "ID": 158556,
    "UUID": "EF132AF4-5C08-4A89-9AB2-0D962B829B76",
    "DataProviderID": 2,
    "DataProvidersReference": "155234",
    "OperatorID": 9,
    "UsageTypeID": 1,
    "AddressInfo": {
        "ID": 158913,
        "Title": "Twinsteps Architecture",
        "AddressLine1": "4223 E Anaheim St",
        "Town": "Long Beach",
        "StateOrProvince": "CA",
        "Postcode": "90804",
        "CountryID": 2,
        "Latitude": 33.783351,
        "Longitude": -118.143129,
        "ContactTelephone1": "888-998-2546",
        "AccessComments": "MON: 24 hours | TUE: 24 hours | WED: 24 hours | THU: 24 hours | FRI: 24 hours | SAT: 24 hours | SUN: 24 hours",
        "RelatedURL": "http://www.blinkcharging.com/",
        "DistanceUnit": 0
    },
    "Connections": [
        {
            "ID": 228562,
            "ConnectionTypeID": 1,
            "LevelID": 2,
            "Amps": 16,
            "Voltage": 230,
            "PowerKW": 3.7,
            "CurrentTypeID": 10,
            "Quantity": 4
        }
    ],
    "StatusTypeID": 50,
    "DateLastStatusUpdate": "2020-06-26T02:56:00Z",
    "DataQualityLevel": 3,
    "DateCreated": "2020-06-26T02:56:00Z",
    "SubmissionStatusTypeID": 100
}