{
    "IsRecentlyVerified": false,
    "ID": 52274,
    "UUID": "889A888E-D8F1-414E-9B70-D7ABD697119E",
    "DataProviderID": 1,
    "OperatorID": 45,
    "UsageTypeID": 1,
    "UsageCost": "0",
    "AddressInfo": {
        "ID": 52620,
        "Title": "E-Bike-Station SportSchloss",
        "AddressLine1": "Schloßplatz 1",
        "Town": "Velen",
        "StateOrProvince": "Kreis Borken",
        "Postcode": "46342",
        "CountryID": 87,
        "Latitude": 51.8935559118481,
        "Longitude": 6.98388133624577,
        "ContactTelephone1": "+49 2863 203-0",
        "AccessComments": "Kostenloses 24/7 Laden nur für kleine Fahrzeuge und e-Bikes, da Zufahrt durch Poller beschränkt wird.",
        "RelatedURL": "http://www.sportschlossvelen.de/",
        "DistanceUnit": 0
    },
    "Connections": [
        {
            "ID": 64922,
            "ConnectionTypeID": 28,
            "StatusTypeID": 50,
            "LevelID": 1,
            "Amps": 10,
            "Voltage": 230,
            "PowerKW": 2.3,
            "CurrentTypeID": 10,
            "Quantity": 6
        }
    ],
    "NumberOfPoints": 6,
    "StatusTypeID": 50,
    "DateLastStatusUpdate": "2015-08-27T15:23:00Z",
    "DataQualityLevel": 1,
    "DateCreated": "2015-08-27T13:21:00Z",
    "SubmissionStatusTypeID": 200
}