{
    "IsRecentlyVerified": false,
    "ID": 36000,
    "UUID": "151F04EE-6771-44CA-8BEA-CF81559516E9",
    "DataProviderID": 26,
    "DataProvidersReference": "21615",
    "OperatorID": 157,
    "OperatorsReference": "NewMotion 02001056",
    "UsageCost": "0.00 afhankelijk van pas",
    "AddressInfo": {
        "ID": 36346,
        "Title": "Gildenkwartier",
        "AddressLine1": "Gildenkwartier",
        "Town": "Utrecht",
        "Postcode": "3511 DA",
        "CountryID": 159,
        "Latitude": 52.0913848876953,
        "Longitude": 5.11165237426758,
        "ContactTelephone1": "088 0109500",
        "RelatedURL": "http://thenewmotion.nl/",
        "DistanceUnit": 0
    },
    "Connections": [
        {
            "ID": 39511,
            "ConnectionTypeID": 25,
            "LevelID": 2,
            "PowerKW": 3.7,
            "CurrentTypeID": 10
        },
        {
            "ID": 48173,
            "ConnectionTypeID": 25,
            "LevelID": 2,
            "PowerKW": 3.7,
            "CurrentTypeID": 10
        }
    ],
    "NumberOfPoints": 1,
    "StatusTypeID": 50,
    "DateLastStatusUpdate": "2016-06-04T02:50:00Z",
    "DataQualityLevel": 3,
    "DateCreated": "2015-01-09T06:05:00Z",
    "SubmissionStatusTypeID": 100
}