{
    "IsRecentlyVerified": false,
    "ID": 139455,
    "UUID": "D32CDA93-0468-4D97-A38E-C2E6277F98C9",
    "DataProviderID": 2,
    "DataProvidersReference": "148697",
    "OperatorID": 39,
    "UsageTypeID": 1,
    "AddressInfo": {
        "ID": 139807,
        "Title": "Walgreens - Lilburn, GA #5898",
        "AddressLine1": "5455 Lawrenceville Highway NW",
        "Town": "Lilburn",
        "StateOrProvince": "GA",
        "Postcode": "30047",
        "CountryID": 2,
        "Latitude": 33.883764,
        "Longitude": -84.161823,
        "ContactTelephone1": "800-663-5633",
        "AccessComments": "MO: Not Specified; TU: Not Specified; WE: Not Specified; TH: Not Specified; FR: Not Specified; SA: Not Specified; SU: Not Specified",
        "RelatedURL": "http://www.semacharge.com/",
        "DistanceUnit": 0
    },
    "Connections": [
        {
            "ID": 194826,
            "ConnectionTypeID": 1,
            "LevelID": 2,
            "Amps": 16,
            "Voltage": 230,
            "PowerKW": 3,
            "CurrentTypeID": 10,
            "Quantity": 1
        }
    ],
    "StatusTypeID": 50,
    "DateLastStatusUpdate": "2019-12-24T09:10:00Z",
    "DataQualityLevel": 3,
    "DateCreated": "2019-12-24T09:10:00Z",
    "SubmissionStatusTypeID": 100
}