{
    "IsRecentlyVerified": false,
    "ID": 17711,
    "UUID": "8E088849-DFC8-468C-BC30-0E8B42EFA3D7",
    "DataProviderID": 22,
    "DataProvidersReference": "DF64DC2EB4A0B85091DD31EB4923EAAC",
    "AddressInfo": {
        "ID": 18056,
        "Title": "六本木駐車場",
        "AddressLine1": "東京都港区六本木3-1",
        "CountryID": 114,
        "Latitude": 35.66561139,
        "Longitude": 139.7388491,
        "ContactTelephone1": "03-5638-3760",
        "DistanceUnit": 0
    },
    "Connections": [
        {
            "ID": 17952,
            "ConnectionTypeID": 2,
            "LevelID": 2,
            "Amps": 100,
            "Voltage": 480,
            "PowerKW": 48,
            "Quantity": 1
        }
    ],
    "DateLastStatusUpdate": "2013-06-29T09:02:00Z",
    "DataQualityLevel": 2,
    "DateCreated": "2013-06-29T09:02:00Z",
    "SubmissionStatusTypeID": 200
}