{
    "UserComments": [
        {
            "ID": 14004,
            "ChargePointID": 27892,
            "CommentTypeID": 50,
            "UserName": "Zipdab",
            "Comment": "Work in progress in area that includes the chargers.  No access to chargers.",
            "DateCreated": "2016-08-08T16:37:27.547Z",
            "User": {
                "ID": 11696,
                "Username": "Zipdab"
            },
            "CheckinStatusTypeID": 120
        }
    ],
    "IsRecentlyVerified": false,
    "ID": 27892,
    "UUID": "6051F52C-3D3A-4550-A116-4B71C7D21E12",
    "DataProviderID": 2,
    "DataProvidersReference": "53995",
    "UsageTypeID": 1,
    "AddressInfo": {
        "ID": 28238,
        "Title": "Harris Teeter",
        "AddressLine1": "2425 N Harrison St",
        "Town": "Arlington",
        "StateOrProvince": "VA",
        "Postcode": "22207",
        "CountryID": 2,
        "Latitude": 38.89714,
        "Longitude": -77.138326,
        "ContactTelephone1": "703-532-8663",
        "AccessComments": "24 hours daily",
        "RelatedURL": "",
        "DistanceUnit": 0
    },
    "Connections": [
        {
            "ID": 30631,
            "ConnectionTypeID": 1,
            "LevelID": 2,
            "Amps": 16,
            "Voltage": 230,
            "PowerKW": 3,
            "CurrentTypeID": 10,
            "Quantity": 2
        }
    ],
    "DateLastStatusUpdate": "2019-04-06T04:03:00Z",
    "DataQualityLevel": 3,
    "DateCreated": "2014-11-28T03:38:00Z",
    "SubmissionStatusTypeID": 100
}