{
    "IsRecentlyVerified": false,
    "ID": 120762,
    "UUID": "32138FFF-3701-4108-9627-43AA27C37471",
    "DataProviderID": 2,
    "DataProvidersReference": "78137",
    "OperatorID": 5,
    "UsageTypeID": 1,
    "AddressInfo": {
        "ID": 121108,
        "Title": "DELTA AIR LINES",
        "AddressLine1": "1775 M H Jackson Service Rd",
        "Town": "Atlanta",
        "StateOrProvince": "GA",
        "Postcode": "30354",
        "CountryID": 2,
        "Latitude": 33.642571,
        "Longitude": -84.414116,
        "ContactTelephone1": "888-758-4389",
        "AccessComments": "24 hours daily",
        "RelatedURL": "http://www.chargepoint.com/",
        "DistanceUnit": 0
    },
    "Connections": [
        {
            "ID": 170147,
            "ConnectionTypeID": 1,
            "LevelID": 2,
            "Amps": 16,
            "Voltage": 230,
            "PowerKW": 3.7,
            "CurrentTypeID": 10,
            "Quantity": 10
        }
    ],
    "DateLastStatusUpdate": "2020-06-26T02:55:00Z",
    "DataQualityLevel": 3,
    "DateCreated": "2019-04-01T04:59:00Z",
    "SubmissionStatusTypeID": 100
}