{
    "MediaItems": [
        {
            "ID": 15164,
            "ChargePointID": 101021,
            "ItemURL": "https://s3-ap-southeast-2.amazonaws.com/openchargemap/images/HU/OCM101021/OCM-101021.orig.2018031410404014.jpg",
            "ItemThumbnailURL": "https://s3-ap-southeast-2.amazonaws.com/openchargemap/images/HU/OCM101021/OCM-101021.thmb.2018031410404014.jpg",
            "Comment": "",
            "IsEnabled": true,
            "IsVideo": false,
            "IsFeaturedItem": false,
            "IsExternalResource": false,
            "User": {
                "ID": 4438,
                "Username": "tibor.antaloczy"
            },
            "DateCreated": "2018-03-14T10:41:00Z"
        }
    ],
    "IsRecentlyVerified": false,
    "ID": 101021,
    "UUID": "838D9BA1-D35A-4BBC-BA2C-2AE970917B2F",
    "DataProviderID": 1,
    "OperatorID": 45,
    "UsageTypeID": 6,
    "UsageCost": "free",
    "AddressInfo": {
        "ID": 101367,
        "Title": "Budapest, Hungexpo - VIP charger",
        "AddressLine1": "Albertirsai út",
        "Town": "Budapest",
        "StateOrProvince": "Budapest",
        "Postcode": "1106",
        "CountryID": 104,
        "Latitude": 47.4930848928829,
        "Longitude": 19.12165760602113,
        "AccessComments": "Located near P3 parking lot.",
        "DistanceUnit": 0
    },
    "Connections": [
        {
            "ID": 142637,
            "ConnectionTypeID": 25,
            "StatusTypeID": 50,
            "LevelID": 2,
            "Amps": 32,
            "Voltage": 400,
            "PowerKW": 22,
            "CurrentTypeID": 20,
            "Quantity": 2
        }
    ],
    "NumberOfPoints": 2,
    "GeneralComments": "Only available for visitors of the exhibition ground. The equipment has a 22 kW input. Output is shared between the two Type 2 connectors, but if only one car is connected, it can get 22 kW",
    "StatusTypeID": 50,
    "DateLastStatusUpdate": "2018-03-14T10:41:00Z",
    "DataQualityLevel": 1,
    "DateCreated": "2018-03-14T10:29:00Z",
    "SubmissionStatusTypeID": 200
}