{
    "IsRecentlyVerified": false,
    "ID": 33970,
    "UUID": "19ACF1DB-3192-4F31-9AAB-8917BD039C52",
    "DataProviderID": 26,
    "DataProvidersReference": "47963",
    "OperatorID": 178,
    "OperatorsReference": "EVnetNL DB0202",
    "UsageCost": "0.00 jaarabonnement",
    "AddressInfo": {
        "ID": 34316,
        "Title": "zalm 222",
        "AddressLine1": "zalm 222",
        "Town": "Hendrik-Ido-Ambacht",
        "Postcode": "3344 HD",
        "CountryID": 159,
        "Latitude": 51.835288,
        "Longitude": 4.648603,
        "ContactTelephone1": "0800-3522365",
        "RelatedURL": "http://www.evnet.nl",
        "DistanceUnit": 0
    },
    "Connections": [
        {
            "ID": 37481,
            "ConnectionTypeID": 25,
            "LevelID": 2,
            "PowerKW": 11,
            "CurrentTypeID": 10
        }
    ],
    "NumberOfPoints": 2,
    "StatusTypeID": 50,
    "DateLastStatusUpdate": "2016-06-04T02:41:00Z",
    "DataQualityLevel": 3,
    "DateCreated": "2015-01-09T06:04:00Z",
    "SubmissionStatusTypeID": 100
}