{
    "IsRecentlyVerified": false,
    "ID": 139506,
    "UUID": "96F1E995-3294-42B4-9A83-9CE557AD2ED1",
    "DataProviderID": 2,
    "DataProvidersReference": "93263",
    "OperatorID": 15,
    "UsageTypeID": 4,
    "AddressInfo": {
        "ID": 139858,
        "Title": "Downey Promenade",
        "AddressLine1": "8830 Apollo Way",
        "Town": "Downey",
        "StateOrProvince": "CA",
        "Postcode": "90242",
        "CountryID": 2,
        "Latitude": 33.921939,
        "Longitude": -118.132406,
        "ContactTelephone1": "877-455-3833",
        "AccessComments": "24 hours daily\r\nPublic - Card key at all times",
        "RelatedURL": "https://www.evgo.com/",
        "DistanceUnit": 0
    },
    "Connections": [
        {
            "ID": 194894,
            "ConnectionTypeID": 2,
            "LevelID": 3,
            "Amps": 100,
            "Voltage": 400,
            "PowerKW": 40,
            "CurrentTypeID": 30,
            "Quantity": 1
        },
        {
            "ID": 194895,
            "ConnectionTypeID": 32,
            "LevelID": 3,
            "Amps": 100,
            "Voltage": 400,
            "PowerKW": 40,
            "CurrentTypeID": 30,
            "Quantity": 1
        }
    ],
    "StatusTypeID": 50,
    "DateLastStatusUpdate": "2020-06-26T02:56:00Z",
    "DataQualityLevel": 3,
    "DateCreated": "2019-12-24T09:11:00Z",
    "SubmissionStatusTypeID": 100
}