{
    "IsRecentlyVerified": false,
    "ID": 120899,
    "UUID": "B2BEFCB7-D301-4116-9071-60A4884EF224",
    "DataProviderID": 2,
    "DataProvidersReference": "1552",
    "UsageTypeID": 2,
    "AddressInfo": {
        "ID": 121245,
        "Title": "LADWP - Harbor Generating Station",
        "AddressLine1": "161 N Island Ave",
        "Town": "Wilmington",
        "StateOrProvince": "CA",
        "Postcode": "90744",
        "CountryID": 2,
        "Latitude": 33.770508,
        "Longitude": -118.265628,
        "ContactTelephone1": "",
        "AccessComments": "Fleet use only",
        "RelatedURL": "",
        "DistanceUnit": 0
    },
    "Connections": [
        {
            "ID": 170302,
            "ConnectionTypeID": 1,
            "LevelID": 2,
            "Amps": 16,
            "Voltage": 230,
            "PowerKW": 3.7,
            "CurrentTypeID": 10,
            "Quantity": 10
        }
    ],
    "DateLastStatusUpdate": "2020-06-26T02:56:00Z",
    "DataQualityLevel": 3,
    "DateCreated": "2019-04-01T04:59:00Z",
    "SubmissionStatusTypeID": 100
}