{
    "IsRecentlyVerified": false,
    "ID": 160698,
    "UUID": "8671A734-D9BF-47EA-8931-4E889FFBA027",
    "DataProviderID": 2,
    "DataProvidersReference": "156688",
    "UsageTypeID": 2,
    "AddressInfo": {
        "ID": 161055,
        "Title": "British Columbia Hydro and Power Authority",
        "AddressLine1": "77 Lougheed Hwy",
        "Town": "Seabird Island",
        "StateOrProvince": "BC",
        "Postcode": "V0M 1A0",
        "CountryID": 44,
        "Latitude": 49.274056,
        "Longitude": -121.709349,
        "ContactTelephone1": "",
        "AccessComments": "",
        "RelatedURL": "",
        "DistanceUnit": 0
    },
    "Connections": [
        {
            "ID": 231243,
            "ConnectionTypeID": 2,
            "LevelID": 3,
            "Amps": 100,
            "Voltage": 400,
            "PowerKW": 40,
            "CurrentTypeID": 30,
            "Quantity": 1
        },
        {
            "ID": 231244,
            "ConnectionTypeID": 32,
            "LevelID": 3,
            "Amps": 100,
            "Voltage": 400,
            "PowerKW": 40,
            "CurrentTypeID": 30,
            "Quantity": 1
        }
    ],
    "GeneralComments": "Planned for future date. Not Operational.",
    "DatePlanned": "2020-09-01T00:00:00Z",
    "StatusTypeID": 150,
    "DateLastStatusUpdate": "2020-06-26T03:12:00Z",
    "DataQualityLevel": 3,
    "DateCreated": "2020-06-26T03:12:00Z",
    "SubmissionStatusTypeID": 100
}