{
    "IsRecentlyVerified": false,
    "ID": 61986,
    "UUID": "379AD873-5065-401B-9A73-C01128927438",
    "DataProviderID": 2,
    "DataProvidersReference": "71588",
    "OperatorID": 5,
    "UsageTypeID": 1,
    "AddressInfo": {
        "ID": 62332,
        "Title": "FOLSOM LAKE VW",
        "AddressLine1": "12543 Auto Mall Cir",
        "Town": "Folsom",
        "StateOrProvince": "CA",
        "Postcode": "95630",
        "CountryID": 2,
        "Latitude": 38.6352257,
        "Longitude": -121.2074368,
        "ContactTelephone1": "888-758-4389",
        "AccessComments": "24 hours daily",
        "RelatedURL": "http://www.chargepoint.com/",
        "DistanceUnit": 0
    },
    "Connections": [
        {
            "ID": 78885,
            "ConnectionTypeID": 1,
            "LevelID": 2,
            "Amps": 16,
            "Voltage": 230,
            "PowerKW": 3,
            "CurrentTypeID": 10,
            "Quantity": 2
        }
    ],
    "DateLastStatusUpdate": "2019-12-24T09:15:00Z",
    "DataQualityLevel": 3,
    "DateCreated": "2016-03-03T11:38:00Z",
    "SubmissionStatusTypeID": 100
}