{
    "IsRecentlyVerified": false,
    "ID": 118125,
    "UUID": "A04164F6-C8A2-47B9-B75D-3861E89A3327",
    "DataProviderID": 1,
    "OperatorID": 80,
    "UsageTypeID": 4,
    "AddressInfo": {
        "ID": 118471,
        "Title": "Iperal Carlazzo | EnelX",
        "AddressLine1": "Strada statale 340 Regina",
        "AddressLine2": "angolo Via Alpini",
        "Town": "Carlazzo",
        "StateOrProvince": "CO",
        "Postcode": "22018",
        "CountryID": 112,
        "Latitude": 46.0414498556344,
        "Longitude": 9.15019274422662,
        "ContactTelephone1": "800.069.850",
        "RelatedURL": "https://www.enelx.com/it/it/emobility",
        "DistanceUnit": 0
    },
    "Connections": [
        {
            "ID": 167159,
            "ConnectionTypeID": 25,
            "StatusTypeID": 50,
            "LevelID": 2,
            "Amps": 32,
            "Voltage": 400,
            "PowerKW": 22,
            "CurrentTypeID": 20,
            "Quantity": 3
        },
        {
            "ID": 167160,
            "ConnectionTypeID": 36,
            "StatusTypeID": 50,
            "LevelID": 2,
            "Amps": 16,
            "Voltage": 240,
            "PowerKW": 3.7,
            "CurrentTypeID": 10,
            "Quantity": 1
        }
    ],
    "NumberOfPoints": 4,
    "GeneralComments": "Posizione esatta della colonnina da verificare",
    "StatusTypeID": 50,
    "DateLastStatusUpdate": "2019-03-15T16:30:00Z",
    "DataQualityLevel": 1,
    "DateCreated": "2019-03-15T16:30:00Z",
    "SubmissionStatusTypeID": 200
}