{
    "IsRecentlyVerified": false,
    "ID": 115445,
    "UUID": "BB34110A-61CB-4FA9-AC17-7773C9B11B2F",
    "DataProviderID": 2,
    "DataProvidersReference": "113281",
    "OperatorID": 23,
    "UsageTypeID": 1,
    "AddressInfo": {
        "ID": 115791,
        "Title": "The Westin - Mission Hills Golf Resort & Spa - Tesla Destination",
        "AddressLine1": "71333 Dinah Shore Dr",
        "Town": "Rancho Mirage",
        "StateOrProvince": "CA",
        "Postcode": "92270",
        "CountryID": 2,
        "Latitude": 33.801057,
        "Longitude": -116.41903,
        "ContactTelephone1": "760-328-5955  877-798-3752",
        "AccessComments": "24 hours daily; for Tesla use only; for guest use only; see front desk for access",
        "RelatedURL": "https://www.tesla.com/destination-charging",
        "DistanceUnit": 0
    },
    "Connections": [
        {
            "ID": 162456,
            "ConnectionTypeID": 0,
            "LevelID": 2,
            "Amps": 16,
            "Voltage": 230,
            "PowerKW": 3,
            "CurrentTypeID": 10,
            "Quantity": 4
        }
    ],
    "DateLastStatusUpdate": "2019-04-06T04:01:00Z",
    "DataQualityLevel": 3,
    "DateCreated": "2019-02-11T07:13:00Z",
    "SubmissionStatusTypeID": 100
}