{
    "UserComments": [
        {
            "ID": 20517,
            "ChargePointID": 68465,
            "CommentTypeID": 10,
            "UserName": "ForumElettrico.it",
            "RelatedURL": "https://www.forumelettrico.it/forum/colonnina-enel-energia-22kw-parcheggio-largo-alpini-d-italia-novara-no-via-ettore-perroni-16-t2476.html",
            "DateCreated": "2018-12-15T09:36:41.367Z",
            "User": {
                "ID": 11749,
                "Username": "ForumElettrico.it"
            },
            "CheckinStatusTypeID": 140
        }
    ],
    "MediaItems": [
        {
            "ID": 17213,
            "ChargePointID": 68465,
            "ItemURL": "https://s3-ap-southeast-2.amazonaws.com/openchargemap/images/IT/OCM68465/OCM-68465.orig.2018121509371071.jpg",
            "ItemThumbnailURL": "https://s3-ap-southeast-2.amazonaws.com/openchargemap/images/IT/OCM68465/OCM-68465.thmb.2018121509371071.jpg",
            "Comment": "",
            "IsEnabled": true,
            "IsVideo": false,
            "IsFeaturedItem": false,
            "IsExternalResource": false,
            "User": {
                "ID": 11749,
                "Username": "ForumElettrico.it"
            },
            "DateCreated": "2018-12-15T09:37:00Z"
        },
        {
            "ID": 10726,
            "ChargePointID": 68465,
            "ItemURL": "https://s3-ap-southeast-2.amazonaws.com/openchargemap/images/IT/OCM68465/OCM-68465.orig.2017040119215911.jpg",
            "ItemThumbnailURL": "https://s3-ap-southeast-2.amazonaws.com/openchargemap/images/IT/OCM68465/OCM-68465.thmb.2017040119215911.jpg",
            "Comment": "",
            "IsEnabled": true,
            "IsVideo": false,
            "IsFeaturedItem": false,
            "IsExternalResource": false,
            "User": {
                "ID": 1606,
                "Username": "polianto"
            },
            "DateCreated": "2017-04-01T19:22:00Z"
        }
    ],
    "IsRecentlyVerified": false,
    "ID": 68465,
    "UUID": "99AF32F9-211B-454D-A589-4A9BEE2FD2EE",
    "DataProviderID": 1,
    "OperatorID": 80,
    "UsageTypeID": 4,
    "UsageCost": "0,40 €/kW",
    "AddressInfo": {
        "ID": 68811,
        "Title": "Novara Largo Alpini d'Italia | EnelX",
        "AddressLine1": "Via Ettore Perrone",
        "Town": "Novara",
        "StateOrProvince": "NO",
        "Postcode": "28100",
        "CountryID": 112,
        "Latitude": 45.4441834693844,
        "Longitude": 8.62491564173342,
        "RelatedURL": "https://www.enelx.com/it/it/emobility",
        "DistanceUnit": 0
    },
    "Connections": [
        {
            "ID": 95756,
            "ConnectionTypeID": 25,
            "StatusTypeID": 50,
            "LevelID": 2,
            "Amps": 32,
            "Voltage": 400,
            "PowerKW": 22,
            "CurrentTypeID": 20,
            "Quantity": 2
        }
    ],
    "NumberOfPoints": 2,
    "GeneralComments": "Parcheggio a pagamento: http://www.musanovara.it/it/1316-mappa.htm",
    "StatusTypeID": 50,
    "DateLastStatusUpdate": "2019-05-29T14:34:00Z",
    "DataQualityLevel": 1,
    "DateCreated": "2016-06-08T13:06:00Z",
    "SubmissionStatusTypeID": 200
}