{
    "IsRecentlyVerified": false,
    "ID": 167411,
    "UUID": "059BF9DC-67E3-415A-95D5-F7F3F86A11F6",
    "DataProviderID": 18,
    "DataProvidersReference": "c72e170305110b5aae06cea5a4aa62cd",
    "OperatorID": 25,
    "UsageTypeID": 4,
    "AddressInfo": {
        "ID": 167770,
        "Title": "Hicks Street",
        "AddressLine1": "Hicks Street",
        "Town": "Lewisham",
        "Postcode": "SE8 5AG",
        "CountryID": 1,
        "Latitude": 51.488037,
        "Longitude": -0.040206,
        "AccessComments": "",
        "RelatedURL": "https://www.sourcelondon.net",
        "DistanceUnit": 0
    },
    "Connections": [
        {
            "ID": 253564,
            "ConnectionTypeID": 25,
            "Reference": "1",
            "StatusTypeID": 50,
            "LevelID": 2,
            "Amps": 32,
            "Voltage": 230,
            "PowerKW": 7,
            "CurrentTypeID": 10
        },
        {
            "ID": 253565,
            "ConnectionTypeID": 1,
            "Reference": "2",
            "StatusTypeID": 50,
            "LevelID": 2,
            "Amps": 13,
            "Voltage": 230,
            "PowerKW": 3,
            "CurrentTypeID": 10
        }
    ],
    "StatusTypeID": 0,
    "DateLastStatusUpdate": "2020-09-08T02:47:00Z",
    "MetadataValues": [
        {
            "ID": 7952,
            "MetadataFieldID": 4,
            "ItemValue": "Contains public sector information licensed under the Open Government Licence v2.0. http://www.nationalarchives.gov.uk/doc/open-government-licence/version/2/"
        }
    ],
    "DataQualityLevel": 3,
    "DateCreated": "2020-09-08T02:47:00Z",
    "SubmissionStatusTypeID": 100
}