{
    "IsRecentlyVerified": false,
    "ID": 99803,
    "UUID": "89CD687B-7D48-47DA-B2CB-9F86A4B942CD",
    "DataProviderID": 1,
    "OperatorID": 3315,
    "OperatorsReference": "50998",
    "UsageTypeID": 4,
    "UsageCost": "Free",
    "AddressInfo": {
        "ID": 100149,
        "Title": "Fife College, Levenmouth Campus, Buckhaven",
        "AddressLine1": "Fife College, Levenmouth Campus, Buckhaven",
        "Postcode": "KY8 1EA",
        "CountryID": 1,
        "Latitude": 56.18117,
        "Longitude": -3.03531,
        "DistanceUnit": 0
    },
    "Connections": [
        {
            "ID": 141012,
            "ConnectionTypeID": 25,
            "StatusTypeID": 50,
            "LevelID": 2,
            "Amps": 16,
            "Voltage": 400,
            "PowerKW": 11,
            "CurrentTypeID": 20,
            "Quantity": 2
        }
    ],
    "NumberOfPoints": 2,
    "StatusTypeID": 50,
    "DateLastStatusUpdate": "2018-04-09T16:00:00Z",
    "DataQualityLevel": 1,
    "DateCreated": "2018-02-05T19:03:00Z",
    "SubmissionStatusTypeID": 200
}