{
    "UserComments": [
        {
            "ID": 24635,
            "ChargePointID": 188428,
            "CommentTypeID": 10,
            "UserName": "ForumElettrico.it",
            "Comment": "Accanto abbiamo un bar, ma in 3 minuti a piedi si arriva sulla via Emilia dove abbiamo anche diversi ristoranti ed esercizi commerciali. Leggi la recensione completa qui >  https://www.forumelettrico.it/forum/colonnine-be-charge-22-kw-agenzia-delle-entrate-parma-pr-strada-quarta-482-t19312.html",
            "RelatedURL": "https://www.forumelettrico.it/forum/colonnine-be-charge-22-kw-agenzia-delle-entrate-parma-pr-strada-quarta-482-t19312.html",
            "DateCreated": "2021-07-24T08:44:13.27Z",
            "User": {
                "ID": 11749,
                "Username": "ForumElettrico.it"
            },
            "CheckinStatusTypeID": 10,
            "IsActionedByEditor": false
        }
    ],
    "MediaItems": [
        {
            "ID": 28743,
            "ChargePointID": 188428,
            "ItemURL": "https://s3-ap-southeast-2.amazonaws.com/openchargemap/images/IT/OCM188428/OCM-188428.orig.2021072408442926.jpg",
            "ItemThumbnailURL": "https://s3-ap-southeast-2.amazonaws.com/openchargemap/images/IT/OCM188428/OCM-188428.thmb.2021072408442926.jpg",
            "Comment": "",
            "IsEnabled": true,
            "IsVideo": false,
            "IsFeaturedItem": false,
            "IsExternalResource": false,
            "User": {
                "ID": 11749,
                "Username": "ForumElettrico.it"
            },
            "DateCreated": "2021-07-24T08:45:00Z"
        },
        {
            "ID": 28744,
            "ChargePointID": 188428,
            "ItemURL": "https://s3-ap-southeast-2.amazonaws.com/openchargemap/images/IT/OCM188428/OCM-188428.orig.2021072408443461.jpg",
            "ItemThumbnailURL": "https://s3-ap-southeast-2.amazonaws.com/openchargemap/images/IT/OCM188428/OCM-188428.thmb.2021072408443461.jpg",
            "Comment": "",
            "IsEnabled": true,
            "IsVideo": false,
            "IsFeaturedItem": false,
            "IsExternalResource": false,
            "User": {
                "ID": 11749,
                "Username": "ForumElettrico.it"
            },
            "DateCreated": "2021-07-24T08:45:00Z"
        },
        {
            "ID": 28745,
            "ChargePointID": 188428,
            "ItemURL": "https://s3-ap-southeast-2.amazonaws.com/openchargemap/images/IT/OCM188428/OCM-188428.orig.2021072408443999.jpg",
            "ItemThumbnailURL": "https://s3-ap-southeast-2.amazonaws.com/openchargemap/images/IT/OCM188428/OCM-188428.thmb.2021072408443999.jpg",
            "Comment": "",
            "IsEnabled": true,
            "IsVideo": false,
            "IsFeaturedItem": false,
            "IsExternalResource": false,
            "User": {
                "ID": 11749,
                "Username": "ForumElettrico.it"
            },
            "DateCreated": "2021-07-24T08:45:00Z"
        },
        {
            "ID": 28746,
            "ChargePointID": 188428,
            "ItemURL": "https://s3-ap-southeast-2.amazonaws.com/openchargemap/images/IT/OCM188428/OCM-188428.orig.2021072408444593.jpg",
            "ItemThumbnailURL": "https://s3-ap-southeast-2.amazonaws.com/openchargemap/images/IT/OCM188428/OCM-188428.thmb.2021072408444593.jpg",
            "Comment": "",
            "IsEnabled": true,
            "IsVideo": false,
            "IsFeaturedItem": false,
            "IsExternalResource": false,
            "User": {
                "ID": 11749,
                "Username": "ForumElettrico.it"
            },
            "DateCreated": "2021-07-24T08:45:00Z"
        },
        {
            "ID": 28742,
            "ChargePointID": 188428,
            "ItemURL": "https://s3-ap-southeast-2.amazonaws.com/openchargemap/images/IT/OCM188428/OCM-188428.orig.2021072408442271.jpg",
            "ItemThumbnailURL": "https://s3-ap-southeast-2.amazonaws.com/openchargemap/images/IT/OCM188428/OCM-188428.thmb.2021072408442271.jpg",
            "Comment": "",
            "IsEnabled": true,
            "IsVideo": false,
            "IsFeaturedItem": false,
            "IsExternalResource": false,
            "User": {
                "ID": 11749,
                "Username": "ForumElettrico.it"
            },
            "DateCreated": "2021-07-24T08:44:00Z"
        }
    ],
    "IsRecentlyVerified": false,
    "ID": 188428,
    "UUID": "02EDB7D6-7A8F-481D-8400-1F1887F2D66B",
    "DataProviderID": 1,
    "OperatorID": 3327,
    "UsageTypeID": 1,
    "AddressInfo": {
        "ID": 188787,
        "Title": "Be Charge Agenzia delle Entrate",
        "AddressLine1": "Strada Quarta 482",
        "Town": "Parma",
        "StateOrProvince": "PR",
        "CountryID": 112,
        "Latitude": 44.79431,
        "Longitude": 10.358813,
        "RelatedURL": "https://www.forumelettrico.it/forum/colonnine-be-charge-22-kw-agenzia-delle-entrate-parma-pr-strada-quarta-482-t19312.html",
        "DistanceUnit": 0
    },
    "Connections": [
        {
            "ID": 304256,
            "ConnectionTypeID": 25,
            "LevelID": 2,
            "PowerKW": 22,
            "Quantity": 4
        }
    ],
    "NumberOfPoints": 1,
    "StatusTypeID": 50,
    "DateLastStatusUpdate": "2021-07-24T08:45:00Z",
    "DataQualityLevel": 1,
    "DateCreated": "2021-07-24T08:43:00Z",
    "SubmissionStatusTypeID": 200
}