{
    "IsRecentlyVerified": false,
    "ID": 139896,
    "UUID": "4C563E52-8346-4D1A-B94E-CB9168F65FB5",
    "DataProviderID": 2,
    "DataProvidersReference": "123206",
    "OperatorID": 3372,
    "UsageTypeID": 2,
    "AddressInfo": {
        "ID": 140248,
        "Title": "Zebra Technologies Corp",
        "AddressLine1": "30601 Agoura Hills Rd",
        "Town": "Agoura Hills",
        "StateOrProvince": "CA",
        "Postcode": "91301",
        "CountryID": 2,
        "Latitude": 34.1455405,
        "Longitude": -118.7881052,
        "ContactTelephone1": "",
        "AccessComments": "",
        "RelatedURL": "http://evconnect.com/",
        "DistanceUnit": 0
    },
    "Connections": [
        {
            "ID": 195389,
            "ConnectionTypeID": 1,
            "LevelID": 2,
            "Amps": 16,
            "Voltage": 230,
            "PowerKW": 3.7,
            "CurrentTypeID": 10,
            "Quantity": 4
        }
    ],
    "StatusTypeID": 50,
    "DateLastStatusUpdate": "2020-06-26T02:57:00Z",
    "DataQualityLevel": 3,
    "DateCreated": "2019-12-24T09:11:00Z",
    "SubmissionStatusTypeID": 100
}