{
    "IsRecentlyVerified": false,
    "ID": 88098,
    "UUID": "E8B3AEE1-1C91-438A-8BCA-60085B000B9A",
    "DataProviderID": 1,
    "OperatorID": 1,
    "UsageTypeID": 4,
    "UsageCost": "0,30€/kWh",
    "AddressInfo": {
        "ID": 88444,
        "Title": "Marktplatz",
        "AddressLine1": "Fahrmannstraße",
        "Town": "Zell a. Main",
        "StateOrProvince": "Landkreis Würzburg",
        "Postcode": "97299",
        "CountryID": 87,
        "Latitude": 49.813502982650746,
        "Longitude": 9.871181166339849,
        "AccessComments": "24/7 nutzbar. Fahrmannstraße bis ganz unten durchfahren, dann links an der Einfahrt vom Wertstoffhof. Edeka Supermarkt und 2 Cafés in unmittelbarer Umgebung.",
        "DistanceUnit": 0
    },
    "Connections": [
        {
            "ID": 124974,
            "ConnectionTypeID": 25,
            "StatusTypeID": 50,
            "LevelID": 2,
            "Amps": 32,
            "Voltage": 400,
            "PowerKW": 22,
            "CurrentTypeID": 20,
            "Quantity": 2
        }
    ],
    "NumberOfPoints": 2,
    "GeneralComments": "Betreiber ist ChargeIT Mobility; freischaltbar mit PlugSurfing Keyhanger / App, New Motion, Charge & Fuel u.a. Nach Leistung gestaffelte Zeittarife im 15 Minuten Takt von 0,50€ bei 3.7kW bis 1,25€ bei 22kW Ladeleistung.",
    "StatusTypeID": 50,
    "DateLastStatusUpdate": "2017-05-22T07:57:00Z",
    "DataQualityLevel": 1,
    "DateCreated": "2017-05-22T07:57:00Z",
    "SubmissionStatusTypeID": 200
}