{
    "IsRecentlyVerified": false,
    "ID": 124439,
    "UUID": "0712FA0B-31F1-4837-BD4F-2C05BDDA6CF0",
    "DataProviderID": 2,
    "DataProvidersReference": "62391",
    "UsageTypeID": 1,
    "AddressInfo": {
        "ID": 124785,
        "Title": "City of Montrose - Centennial Plaza",
        "AddressLine1": "501 S 1st St",
        "Town": "Montrose",
        "StateOrProvince": "CO",
        "Postcode": "81401",
        "CountryID": 2,
        "Latitude": 38.479653,
        "Longitude": -107.874886,
        "ContactTelephone1": "970-240-1400",
        "AccessComments": "24 hours daily",
        "RelatedURL": "",
        "DistanceUnit": 0
    },
    "Connections": [
        {
            "ID": 174537,
            "ConnectionTypeID": 1,
            "LevelID": 2,
            "Amps": 16,
            "Voltage": 230,
            "PowerKW": 3.7,
            "CurrentTypeID": 10,
            "Quantity": 2
        }
    ],
    "DateLastStatusUpdate": "2020-06-26T03:00:00Z",
    "DataQualityLevel": 3,
    "DateCreated": "2019-04-06T05:03:00Z",
    "SubmissionStatusTypeID": 100
}