{
    "IsRecentlyVerified": false,
    "ID": 67295,
    "UUID": "AFDC30E6-FF1E-4B56-B68D-22563055B9F5",
    "DataProviderID": 1,
    "OperatorID": 23,
    "OperatorsReference": "13893",
    "UsageTypeID": 1,
    "UsageCost": "Free",
    "AddressInfo": {
        "ID": 67641,
        "Title": "The Ritz-Carlton - Tesla",
        "AddressLine1": "130 Daybreak Ridge",
        "Town": "Avon",
        "StateOrProvince": "CO",
        "Postcode": "81620",
        "CountryID": 2,
        "Latitude": 39.6238394,
        "Longitude": -106.5410861,
        "ContactTelephone1": "970-748-6200  877-798-3752",
        "AccessComments": "24 hours daily; for Tesla use only; for guest use only; see valet for access",
        "RelatedURL": "http://www.teslamotors.com/supercharger",
        "DistanceUnit": 0
    },
    "Connections": [
        {
            "ID": 92797,
            "ConnectionTypeID": 30,
            "StatusTypeID": 50,
            "LevelID": 2,
            "Amps": 16,
            "Voltage": 230,
            "PowerKW": 8,
            "CurrentTypeID": 10,
            "Quantity": 2
        }
    ],
    "NumberOfPoints": 2,
    "StatusTypeID": 50,
    "DateLastStatusUpdate": "2017-01-31T19:18:00Z",
    "DataQualityLevel": 3,
    "DateCreated": "2016-05-29T02:05:00Z",
    "SubmissionStatusTypeID": 100
}