{
    "IsRecentlyVerified": false,
    "ID": 180045,
    "UUID": "1070D0CA-0FA5-491D-B395-65F9554A3A59",
    "DataProviderID": 29,
    "DataProvidersReference": "9626",
    "OperatorID": 3369,
    "AddressInfo": {
        "ID": 180404,
        "Title": "Schutterwälder Str.4-6",
        "AddressLine1": "Schutterwälder Str.4-6",
        "Town": "Offenburg",
        "Postcode": "77656",
        "CountryID": 87,
        "Latitude": 48.46356,
        "Longitude": 7.9298,
        "DistanceUnit": 0
    },
    "Connections": [
        {
            "ID": 282663,
            "ConnectionTypeID": 33,
            "StatusTypeID": 50,
            "LevelID": 3,
            "PowerKW": 150,
            "CurrentTypeID": 30
        },
        {
            "ID": 282664,
            "ConnectionTypeID": 33,
            "StatusTypeID": 50,
            "LevelID": 3,
            "PowerKW": 50,
            "CurrentTypeID": 30
        },
        {
            "ID": 295825,
            "ConnectionTypeID": 1036,
            "StatusTypeID": 50,
            "LevelID": 2,
            "PowerKW": 22,
            "CurrentTypeID": 20
        },
        {
            "ID": 295826,
            "ConnectionTypeID": 25,
            "StatusTypeID": 50,
            "LevelID": 2,
            "PowerKW": 22,
            "CurrentTypeID": 20
        }
    ],
    "StatusTypeID": 50,
    "DateLastStatusUpdate": "2021-07-12T02:41:00Z",
    "MetadataValues": [
        {
            "ID": 12339,
            "MetadataFieldID": 4,
            "ItemValue": "Data from the German chargepoint registry provided by Bundesnetzagentur.de under the CC-BY 4.0 license"
        }
    ],
    "DataQualityLevel": 3,
    "DateCreated": "2021-07-08T10:00:00Z",
    "SubmissionStatusTypeID": 100
}