{
    "IsRecentlyVerified": false,
    "ID": 24589,
    "UUID": "277CECAC-446C-4B63-8BB6-019E295FEBE2",
    "DataProviderID": 1,
    "OperatorID": 91,
    "UsageTypeID": 4,
    "AddressInfo": {
        "ID": 24935,
        "Title": "Estación Servicio Palencia",
        "AddressLine1": "Avda. de Asturias, 38",
        "Town": "Palencia",
        "CountryID": 210,
        "Latitude": 42.025748,
        "Longitude": -4.548834,
        "DistanceUnit": 0
    },
    "Connections": [
        {
            "ID": 26866,
            "ConnectionTypeID": 2,
            "LevelID": 3,
            "CurrentTypeID": 30
        }
    ],
    "NumberOfPoints": 1,
    "StatusTypeID": 50,
    "DateLastStatusUpdate": "2014-10-21T10:15:00Z",
    "DataQualityLevel": 1,
    "DateCreated": "2014-10-21T10:15:00Z",
    "SubmissionStatusTypeID": 200
}