{
    "IsRecentlyVerified": false,
    "ID": 136476,
    "UUID": "41E158C0-4C12-449E-B29D-F44D9B0CE6B6",
    "DataProviderID": 18,
    "DataProvidersReference": "afa1f9dbc9a0503cc85066dd33d3d076",
    "OperatorID": 2244,
    "UsageTypeID": 5,
    "AddressInfo": {
        "ID": 136822,
        "Title": "Belsize Park Gardens",
        "AddressLine1": "Belsize Park Gardens",
        "Town": "London",
        "Postcode": "NW3 4LD",
        "CountryID": 1,
        "Latitude": 51.54811,
        "Longitude": -0.168876,
        "AccessComments": "",
        "RelatedURL": "https://www.ubitricity.com",
        "DistanceUnit": 0
    },
    "Connections": [
        {
            "ID": 190925,
            "ConnectionTypeID": 25,
            "Reference": "suby1100001960",
            "StatusTypeID": 50,
            "LevelID": 2,
            "Amps": 16,
            "Voltage": 230,
            "PowerKW": 3.7,
            "CurrentTypeID": 10
        }
    ],
    "StatusTypeID": 0,
    "DateLastStatusUpdate": "2021-04-25T05:46:00Z",
    "MetadataValues": [
        {
            "ID": 6328,
            "MetadataFieldID": 4,
            "ItemValue": "Contains public sector information licensed under the Open Government Licence v2.0. http://www.nationalarchives.gov.uk/doc/open-government-licence/version/2/"
        }
    ],
    "DataQualityLevel": 3,
    "DateCreated": "2019-12-24T05:22:00Z",
    "SubmissionStatusTypeID": 100
}