{
    "IsRecentlyVerified": false,
    "ID": 27536,
    "UUID": "4FD9F94B-3354-4829-8034-01C09D05D119",
    "DataProviderID": 2,
    "DataProvidersReference": "61589",
    "OperatorID": 5,
    "UsageTypeID": 1,
    "AddressInfo": {
        "ID": 27882,
        "Title": "C. RICHMOND BMW",
        "AddressLine1": "8704-8716 US-250",
        "Town": "Henrico",
        "StateOrProvince": "VA",
        "Postcode": "23294",
        "CountryID": 2,
        "Latitude": 37.6335169,
        "Longitude": -77.5412319,
        "ContactTelephone1": "888-758-4389",
        "AccessComments": "24 hours daily",
        "RelatedURL": "http://www.chargepoint.com/",
        "DistanceUnit": 0
    },
    "Connections": [
        {
            "ID": 30187,
            "ConnectionTypeID": 1,
            "LevelID": 2,
            "Amps": 16,
            "Voltage": 230,
            "PowerKW": 3,
            "CurrentTypeID": 10,
            "Quantity": 2
        }
    ],
    "DateLastStatusUpdate": "2019-04-06T04:02:00Z",
    "DataQualityLevel": 3,
    "DateCreated": "2014-11-28T03:38:00Z",
    "SubmissionStatusTypeID": 100
}