{
    "IsRecentlyVerified": false,
    "ID": 29532,
    "UUID": "210D8AEC-753F-41EB-9408-6D1838F33C5B",
    "DataProviderID": 15,
    "DataProvidersReference": "18464",
    "OperatorID": 94,
    "AddressInfo": {
        "ID": 29878,
        "Title": "109 Laurel Dr.",
        "AddressLine1": "109 Laurel Dr.",
        "Town": "Friendswood",
        "StateOrProvince": "TX",
        "Postcode": "77546",
        "CountryID": 2,
        "Latitude": 29.530295,
        "Longitude": -95.204853,
        "ContactTelephone1": "281-221-1024",
        "RelatedURL": "http://carstations.com/18464",
        "DistanceUnit": 0
    },
    "Connections": [
        {
            "ID": 32517,
            "ConnectionTypeID": 1,
            "Reference": "J1772",
            "LevelID": 2
        }
    ],
    "StatusTypeID": 0,
    "DateLastStatusUpdate": "2017-11-04T14:03:00Z",
    "DataQualityLevel": 2,
    "DateCreated": "2014-11-29T05:39:00Z",
    "SubmissionStatusTypeID": 100
}