{
    "IsRecentlyVerified": false,
    "ID": 23670,
    "UUID": "2C827B38-B08F-492D-8693-46475549F4C2",
    "DataProviderID": 1,
    "OperatorID": 62,
    "UsageTypeID": 4,
    "AddressInfo": {
        "ID": 24015,
        "Title": "Auchan MAUREPAS",
        "AddressLine1": "Avenue Gutenberg",
        "Town": "Rambouillet",
        "StateOrProvince": "Rambouillet",
        "Postcode": "78310",
        "CountryID": 80,
        "Latitude": 48.7619020627087,
        "Longitude": 1.91795456085209,
        "ContactTelephone1": "01.30.16.30.00 ",
        "RelatedURL": "http://www.auchan.fr/magasins/maurepas/65/informations-pratiques/",
        "DistanceUnit": 0
    },
    "Connections": [
        {
            "ID": 25584,
            "ConnectionTypeID": 2,
            "LevelID": 3,
            "CurrentTypeID": 30,
            "Quantity": 1
        },
        {
            "ID": 25585,
            "ConnectionTypeID": 25,
            "LevelID": 3,
            "CurrentTypeID": 20,
            "Quantity": 1
        }
    ],
    "NumberOfPoints": 1,
    "StatusTypeID": 150,
    "DateLastStatusUpdate": "2014-09-25T13:05:00Z",
    "DataQualityLevel": 1,
    "DateCreated": "2014-05-27T13:27:00Z",
    "SubmissionStatusTypeID": 200
}