{
    "IsRecentlyVerified": false,
    "ID": 26862,
    "UUID": "27413F85-4F81-4663-B4C6-04130E1392E6",
    "DataProviderID": 2,
    "DataProvidersReference": "53071",
    "OperatorID": 5,
    "UsageTypeID": 1,
    "AddressInfo": {
        "ID": 27208,
        "Title": "UCR",
        "AddressLine1": "900 University Ave",
        "Town": "Riverside",
        "StateOrProvince": "CA",
        "Postcode": "92507",
        "CountryID": 2,
        "Latitude": 33.975213,
        "Longitude": -117.332551,
        "ContactTelephone1": "888-758-4389",
        "AccessComments": "24 hours daily",
        "RelatedURL": "http://www.chargepoint.com/",
        "DistanceUnit": 0
    },
    "Connections": [
        {
            "ID": 29414,
            "ConnectionTypeID": 1,
            "LevelID": 2,
            "Amps": 16,
            "Voltage": 230,
            "PowerKW": 3,
            "CurrentTypeID": 10,
            "Quantity": 6
        }
    ],
    "DateLastStatusUpdate": "2019-04-06T04:01:00Z",
    "DataQualityLevel": 3,
    "DateCreated": "2014-11-28T03:37:00Z",
    "SubmissionStatusTypeID": 100
}