{
    "IsRecentlyVerified": false,
    "ID": 3595,
    "UUID": "8EDD4450-AC05-4249-93C3-0DF76F5D619C",
    "DataProviderID": 1,
    "OperatorID": 5,
    "UsageTypeID": 1,
    "AddressInfo": {
        "ID": 3596,
        "Title": "MG&E - Hy-Vee",
        "AddressLine1": "3801 E Washington Ave",
        "Town": "Madison",
        "StateOrProvince": "WI",
        "Postcode": "53714",
        "CountryID": 2,
        "Latitude": 43.118321,
        "Longitude": -89.319067,
        "ContactTelephone1": "888-758-4389",
        "DistanceUnit": 0
    },
    "Connections": [
        {
            "ID": 110,
            "ConnectionTypeID": 1,
            "Quantity": 1
        }
    ],
    "NumberOfPoints": 1,
    "DateLastStatusUpdate": "2019-12-15T06:07:00Z",
    "DateCreated": "2010-02-28T00:00:00Z",
    "SubmissionStatusTypeID": 200
}