{
    "IsRecentlyVerified": false,
    "ID": 68148,
    "UUID": "F2E3B628-89F9-48D1-9032-E767A54B123F",
    "DataProviderID": 26,
    "DataProvidersReference": "93013",
    "OperatorID": 103,
    "OperatorsReference": "Allego NLALLEGO0010022",
    "UsageCost": "0.00 jaarabonnement",
    "AddressInfo": {
        "ID": 68494,
        "Title": "Klaproos 39",
        "AddressLine1": "Klaproos 39",
        "Town": "Ouder-Amstel",
        "Postcode": "1191 TP",
        "CountryID": 159,
        "Latitude": 52.29290141,
        "Longitude": 4.90485987,
        "ContactTelephone1": "0800-3745337",
        "RelatedURL": "http://www.allego.eu/",
        "DistanceUnit": 0
    },
    "Connections": [
        {
            "ID": 94941,
            "ConnectionTypeID": 25,
            "LevelID": 2,
            "PowerKW": 11,
            "CurrentTypeID": 10
        },
        {
            "ID": 94942,
            "ConnectionTypeID": 25,
            "LevelID": 2,
            "PowerKW": 11,
            "CurrentTypeID": 10
        }
    ],
    "NumberOfPoints": 1,
    "StatusTypeID": 50,
    "DateLastStatusUpdate": "2016-06-04T02:37:00Z",
    "DataQualityLevel": 3,
    "DateCreated": "2016-06-04T02:37:00Z",
    "SubmissionStatusTypeID": 100
}