{
    "IsRecentlyVerified": false,
    "ID": 88046,
    "UUID": "8B9B11EF-D433-4F96-ABDB-480A90350513",
    "DataProviderID": 1,
    "OperatorID": 23,
    "OperatorsReference": "29643",
    "UsageTypeID": 6,
    "AddressInfo": {
        "ID": 88392,
        "Title": "Hotel Select Suites & Spa",
        "AddressLine1": "89 Viale Antonio Gramsci",
        "Town": "Riccione",
        "Postcode": "47838",
        "CountryID": 112,
        "Latitude": 43.998143,
        "Longitude": 12.666971,
        "ContactTelephone1": "+39 0541 600 613",
        "DistanceUnit": 0
    },
    "Connections": [
        {
            "ID": 124899,
            "ConnectionTypeID": 30,
            "StatusTypeID": 50,
            "LevelID": 2,
            "Amps": 32,
            "Voltage": 400,
            "PowerKW": 22,
            "CurrentTypeID": 20,
            "Quantity": 2
        }
    ],
    "NumberOfPoints": 2,
    "GeneralComments": "2 Tesla Connectors, up to 22kW.Available for patrons only. Please call ahead.",
    "StatusTypeID": 50,
    "DateLastStatusUpdate": "2018-10-03T23:09:00Z",
    "DataQualityLevel": 1,
    "DateCreated": "2017-05-20T05:35:00Z",
    "SubmissionStatusTypeID": 200
}