{
    "IsRecentlyVerified": false,
    "ID": 67966,
    "UUID": "F503E90C-1225-442E-91B7-AC3D6C78D53D",
    "DataProviderID": 26,
    "DataProvidersReference": "92943",
    "OperatorID": 103,
    "OperatorsReference": "Allego NLALLEGO0012961",
    "UsageCost": "0.00 jaarabonnement",
    "AddressInfo": {
        "ID": 68312,
        "Title": "Beethovenstraat 1",
        "AddressLine1": "Beethovenstraat 1",
        "Town": "Sliedrecht",
        "Postcode": "3363 LK",
        "CountryID": 159,
        "Latitude": 51.82892617,
        "Longitude": 4.73849216,
        "ContactTelephone1": "0800-3745337",
        "RelatedURL": "http://www.allego.eu/",
        "DistanceUnit": 0
    },
    "Connections": [
        {
            "ID": 94608,
            "ConnectionTypeID": 25,
            "LevelID": 2,
            "PowerKW": 11,
            "CurrentTypeID": 10
        },
        {
            "ID": 94609,
            "ConnectionTypeID": 25,
            "LevelID": 2,
            "PowerKW": 11,
            "CurrentTypeID": 10
        }
    ],
    "NumberOfPoints": 1,
    "StatusTypeID": 50,
    "DateLastStatusUpdate": "2016-06-04T02:37:00Z",
    "DataQualityLevel": 3,
    "DateCreated": "2016-06-04T02:37:00Z",
    "SubmissionStatusTypeID": 100
}