{
    "IsRecentlyVerified": false,
    "ID": 50900,
    "UUID": "8FF2DE80-DA18-4865-97C8-78252B1F4CC8",
    "DataProviderID": 26,
    "DataProvidersReference": "65456",
    "OperatorID": 73,
    "OperatorsReference": "EV-Box EVB-P1414177",
    "UsageCost": "0.00 jaarabonnement",
    "AddressInfo": {
        "ID": 51246,
        "Title": "Meubelplein 8",
        "AddressLine1": "Meubelplein 8",
        "Town": "Leiderdorp",
        "Postcode": "2353 EX",
        "CountryID": 159,
        "Latitude": 52.15881,
        "Longitude": 4.54636,
        "RelatedURL": "http://www.ev-box.nl",
        "DistanceUnit": 0
    },
    "Connections": [
        {
            "ID": 62854,
            "ConnectionTypeID": 25,
            "LevelID": 2,
            "PowerKW": 11,
            "CurrentTypeID": 10
        },
        {
            "ID": 62855,
            "ConnectionTypeID": 25,
            "LevelID": 2,
            "PowerKW": 11,
            "CurrentTypeID": 10
        }
    ],
    "NumberOfPoints": 1,
    "StatusTypeID": 50,
    "DateLastStatusUpdate": "2016-06-04T02:51:00Z",
    "DataQualityLevel": 3,
    "DateCreated": "2015-07-22T09:54:00Z",
    "SubmissionStatusTypeID": 100
}