{
    "IsRecentlyVerified": false,
    "ID": 133468,
    "UUID": "61A51363-F132-4D29-978C-74D9AB749C70",
    "DataProviderID": 1,
    "OperatorID": 80,
    "UsageTypeID": 4,
    "AddressInfo": {
        "ID": 133814,
        "Title": "Castello di Casalbeltrame | EnelX",
        "AddressLine1": "Via Cavour, 4",
        "Town": "Casalbeltrame",
        "StateOrProvince": "NO",
        "Postcode": "28060",
        "CountryID": 112,
        "Latitude": 45.4374820917141,
        "Longitude": 8.46854375848841,
        "ContactTelephone1": "800.069.850",
        "RelatedURL": "https://www.enelx.com/it/it/emobility",
        "DistanceUnit": 0
    },
    "Connections": [
        {
            "ID": 186827,
            "ConnectionTypeID": 25,
            "StatusTypeID": 50,
            "LevelID": 2,
            "Amps": 32,
            "Voltage": 400,
            "PowerKW": 22,
            "CurrentTypeID": 20,
            "Quantity": 2
        }
    ],
    "NumberOfPoints": 2,
    "StatusTypeID": 50,
    "DateLastStatusUpdate": "2019-10-18T15:07:00Z",
    "DataQualityLevel": 1,
    "DateCreated": "2019-10-18T15:07:00Z",
    "SubmissionStatusTypeID": 200
}