{
    "IsRecentlyVerified": false,
    "ID": 30830,
    "UUID": "51498DD1-1343-425B-9C08-1CAC8D3F5D27",
    "DataProviderID": 1,
    "DataProvidersReference": "1494",
    "AddressInfo": {
        "ID": 31176,
        "Title": "Gran stasjon",
        "AddressLine1": "Jernbanegata 1",
        "Town": "GRAN",
        "StateOrProvince": "Innlandet",
        "Postcode": "2750",
        "CountryID": 168,
        "Latitude": 60.35902,
        "Longitude": 10.56992,
        "AccessComments": "",
        "DistanceUnit": 0
    },
    "Connections": [
        {
            "ID": 34059,
            "ConnectionTypeID": 0,
            "Reference": "1",
            "LevelID": 2,
            "Amps": 16,
            "Voltage": 230,
            "PowerKW": 3.7,
            "Comments": "Mode 1"
        },
        {
            "ID": 88988,
            "ConnectionTypeID": 0,
            "Reference": "2",
            "LevelID": 2,
            "Amps": 16,
            "Voltage": 230,
            "PowerKW": 3.7,
            "Comments": "Mode 1"
        }
    ],
    "NumberOfPoints": 2,
    "DateLastStatusUpdate": "2020-05-26T08:24:00Z",
    "DataQualityLevel": 2,
    "DateCreated": "2014-12-09T09:01:00Z",
    "SubmissionStatusTypeID": 100
}