{
    "IsRecentlyVerified": false,
    "ID": 110359,
    "UUID": "D9D6349F-7815-46FA-BC0E-D65D4E528C58",
    "DataProviderID": 2,
    "DataProvidersReference": "100508",
    "OperatorID": 39,
    "UsageTypeID": 4,
    "AddressInfo": {
        "ID": 110705,
        "Title": "Desco Plaza 3",
        "AddressLine1": "3675 Mt. Diablo Road",
        "Town": "Lafayette",
        "StateOrProvince": "CA",
        "Postcode": "94549",
        "CountryID": 2,
        "Latitude": 37.8893419,
        "Longitude": -122.1289896,
        "ContactTelephone1": "800-663-5633",
        "AccessComments": "MO: Not Specified; TU: Not Specified; WE: Not Specified; TH: Not Specified; FR: Not Specified; SA: Not Specified; SU: Not Specified",
        "RelatedURL": "http://www.semacharge.com/",
        "DistanceUnit": 0
    },
    "Connections": [
        {
            "ID": 155604,
            "ConnectionTypeID": 1,
            "LevelID": 2,
            "Amps": 16,
            "Voltage": 230,
            "PowerKW": 3,
            "CurrentTypeID": 10,
            "Quantity": 1
        }
    ],
    "DateLastStatusUpdate": "2019-04-06T04:02:00Z",
    "DataQualityLevel": 3,
    "DateCreated": "2018-10-18T23:36:00Z",
    "SubmissionStatusTypeID": 100
}