{
    "IsRecentlyVerified": false,
    "ID": 50330,
    "UUID": "09CEDA98-A587-4585-8A5D-E62DDC8A04EC",
    "DataProviderID": 1,
    "OperatorID": 20,
    "OperatorsReference": "21126 (REM)",
    "UsageTypeID": 4,
    "UsageCost": "Free",
    "AddressInfo": {
        "ID": 50676,
        "Title": "Lancaster Toyota Wearside",
        "AddressLine1": "Newcastle Road",
        "Town": "Sunderland",
        "StateOrProvince": "Tyne and Wear",
        "Postcode": "SR5 1JE",
        "CountryID": 1,
        "Latitude": 54.919283,
        "Longitude": -1.383822,
        "DistanceUnit": 0
    },
    "Connections": [
        {
            "ID": 61994,
            "ConnectionTypeID": 25,
            "StatusTypeID": 0,
            "LevelID": 2,
            "Amps": 32,
            "Voltage": 230,
            "PowerKW": 7,
            "CurrentTypeID": 10,
            "Quantity": 2
        }
    ],
    "NumberOfPoints": 2,
    "StatusTypeID": 0,
    "DateLastStatusUpdate": "2017-05-02T12:33:00Z",
    "DataQualityLevel": 1,
    "DateCreated": "2015-07-21T12:56:00Z",
    "SubmissionStatusTypeID": 200
}