{
    "IsRecentlyVerified": false,
    "ID": 104330,
    "UUID": "D285AC8C-DE62-4E8E-86DF-BA8D1B96A1C5",
    "DataProviderID": 1,
    "OperatorID": 69,
    "UsageTypeID": 4,
    "AddressInfo": {
        "ID": 104676,
        "Title": "Parkplatz Forststraße",
        "AddressLine1": "Forststraße 11",
        "AddressLine2": "Eck Inselstraße",
        "Town": "Wurmlingen",
        "StateOrProvince": "Verwaltungsgemeinschaft Tuttlingen",
        "Postcode": "78573",
        "CountryID": 87,
        "Latitude": 48.0050079257084,
        "Longitude": 8.78047370237732,
        "AccessComments": "24/7 nutzbare Ladesäule auf dem Parkplatz, Zufahrt über Schloßstraße.",
        "DistanceUnit": 0
    },
    "Connections": [
        {
            "ID": 147304,
            "ConnectionTypeID": 25,
            "StatusTypeID": 50,
            "LevelID": 2,
            "Amps": 32,
            "Voltage": 400,
            "PowerKW": 22,
            "CurrentTypeID": 20,
            "Quantity": 2
        },
        {
            "ID": 147305,
            "ConnectionTypeID": 28,
            "StatusTypeID": 50,
            "LevelID": 2,
            "Amps": 16,
            "Voltage": 230,
            "PowerKW": 3.7,
            "CurrentTypeID": 10,
            "Quantity": 2
        }
    ],
    "NumberOfPoints": 2,
    "StatusTypeID": 50,
    "DateLastStatusUpdate": "2018-05-18T09:56:00Z",
    "DataQualityLevel": 1,
    "DateCreated": "2018-05-18T09:52:00Z",
    "SubmissionStatusTypeID": 200
}