{
    "IsRecentlyVerified": false,
    "ID": 135616,
    "UUID": "C4DF211B-1E49-4A38-B469-54C926B692DB",
    "DataProviderID": 18,
    "DataProvidersReference": "d5bbb0d819183ff56b09858f0acda9d2",
    "OperatorID": 2244,
    "UsageTypeID": 5,
    "AddressInfo": {
        "ID": 135962,
        "Title": "Fernwood Avenue",
        "AddressLine1": "Fernwood Avenue",
        "Town": "London",
        "Postcode": "SW16 1RD",
        "CountryID": 1,
        "Latitude": 51.429694,
        "Longitude": -0.133664,
        "AccessComments": "",
        "RelatedURL": "https://www.ubitricity.com",
        "DistanceUnit": 0
    },
    "Connections": [
        {
            "ID": 190024,
            "ConnectionTypeID": 25,
            "Reference": "suby1100000680",
            "StatusTypeID": 50,
            "LevelID": 2,
            "Amps": 16,
            "Voltage": 230,
            "PowerKW": 3.7,
            "CurrentTypeID": 10
        }
    ],
    "StatusTypeID": 0,
    "DateLastStatusUpdate": "2021-04-25T05:46:00Z",
    "MetadataValues": [
        {
            "ID": 5468,
            "MetadataFieldID": 4,
            "ItemValue": "Contains public sector information licensed under the Open Government Licence v2.0. http://www.nationalarchives.gov.uk/doc/open-government-licence/version/2/"
        }
    ],
    "DataQualityLevel": 3,
    "DateCreated": "2019-12-24T05:22:00Z",
    "SubmissionStatusTypeID": 100
}