{
    "IsRecentlyVerified": false,
    "ID": 5922,
    "UUID": "11127EC5-F1AF-4C94-BDAF-D3190B71AE5F",
    "DataProviderID": 1,
    "OperatorID": 1,
    "UsageTypeID": 1,
    "AddressInfo": {
        "ID": 5844,
        "Title": "Hi-Way Haven RV Park",
        "Town": "Sutherlin",
        "StateOrProvince": "Oregon",
        "CountryID": 2,
        "Latitude": 43.3878344534639,
        "Longitude": -123.353805541992,
        "RelatedURL": "http://www.hiwayhaven.com/",
        "DistanceUnit": 0
    },
    "Connections": [
        {
            "ID": 669,
            "ConnectionTypeID": 11,
            "LevelID": 2,
            "Quantity": 1
        }
    ],
    "NumberOfPoints": 1,
    "StatusTypeID": 50,
    "DateLastStatusUpdate": "2011-04-19T00:00:00Z",
    "DateCreated": "2011-09-13T12:41:00Z",
    "SubmissionStatusTypeID": 200
}