{
    "IsRecentlyVerified": false,
    "ID": 134375,
    "UUID": "37AC01BB-5F82-4C81-A230-9655144BCFCE",
    "DataProviderID": 1,
    "OperatorID": 25,
    "OperatorsReference": "westminster-sixthavenue",
    "UsageTypeID": 4,
    "UsageCost": "£0.073/minute; min £1.38; other tariffs available",
    "AddressInfo": {
        "ID": 134721,
        "Title": "Sixth Avenue",
        "AddressLine1": "151 Sixth Avenue",
        "Town": "London",
        "Postcode": "W10 4HJ",
        "CountryID": 1,
        "Latitude": 51.531537,
        "Longitude": -0.213284,
        "DistanceUnit": 0
    },
    "Connections": [
        {
            "ID": 188064,
            "ConnectionTypeID": 1,
            "StatusTypeID": 50,
            "LevelID": 2,
            "Voltage": 230,
            "PowerKW": 4,
            "CurrentTypeID": 10,
            "Quantity": 2
        },
        {
            "ID": 188065,
            "ConnectionTypeID": 25,
            "StatusTypeID": 50,
            "LevelID": 2,
            "Amps": 32,
            "Voltage": 230,
            "PowerKW": 7,
            "CurrentTypeID": 10,
            "Quantity": 2
        },
        {
            "ID": 188066,
            "ConnectionTypeID": 1,
            "StatusTypeID": 50,
            "LevelID": 2,
            "Voltage": 230,
            "PowerKW": 4,
            "CurrentTypeID": 10,
            "Quantity": 2
        },
        {
            "ID": 188067,
            "ConnectionTypeID": 25,
            "StatusTypeID": 50,
            "LevelID": 2,
            "Amps": 32,
            "Voltage": 230,
            "PowerKW": 7,
            "CurrentTypeID": 10,
            "Quantity": 2
        },
        {
            "ID": 188068,
            "ConnectionTypeID": 25,
            "StatusTypeID": 50,
            "LevelID": 2,
            "Amps": 32,
            "Voltage": 400,
            "PowerKW": 22,
            "CurrentTypeID": 20,
            "Quantity": 1
        }
    ],
    "NumberOfPoints": 2,
    "StatusTypeID": 50,
    "DateLastStatusUpdate": "2020-01-10T09:44:00Z",
    "DataQualityLevel": 1,
    "DateCreated": "2019-11-11T06:53:00Z",
    "SubmissionStatusTypeID": 200
}