{
    "IsRecentlyVerified": false,
    "ID": 66316,
    "UUID": "BBFEC685-E9D9-4A69-91AE-0B1BE0D9C064",
    "DataProviderID": 1,
    "OperatorID": 45,
    "UsageTypeID": 1,
    "AddressInfo": {
        "ID": 66662,
        "Title": "E-Bike Station Glasmuseum",
        "AddressLine1": "Am Bahnhof 3",
        "Town": "Immenhausen",
        "StateOrProvince": "Landkreis Kassel",
        "Postcode": "34376",
        "CountryID": 87,
        "Latitude": 51.42738000000001,
        "Longitude": 9.465599999999995,
        "ContactTelephone1": "+49 5673 2060",
        "ContactEmail": "glasmuseum@immenhausen.de",
        "AccessComments": "Geöffnet Di-Do 10-17Uhr, Fr-So 13-17Uhr, Feiertage auf Anfrage",
        "RelatedURL": "http://www.nordhessen.de/de/e-bikes",
        "DistanceUnit": 0
    },
    "Connections": [
        {
            "ID": 91685,
            "ConnectionTypeID": 28,
            "StatusTypeID": 50,
            "LevelID": 1,
            "Amps": 10,
            "Voltage": 230,
            "PowerKW": 2.3,
            "CurrentTypeID": 10,
            "Quantity": 3
        }
    ],
    "NumberOfPoints": 3,
    "StatusTypeID": 50,
    "DateLastStatusUpdate": "2016-05-18T07:29:00Z",
    "DataQualityLevel": 1,
    "DateCreated": "2016-05-18T07:29:00Z",
    "SubmissionStatusTypeID": 200
}