{
    "IsRecentlyVerified": false,
    "ID": 140567,
    "UUID": "09626218-779B-4561-A199-E0E4490EB728",
    "DataProviderID": 2,
    "DataProvidersReference": "86711",
    "UsageTypeID": 5,
    "AddressInfo": {
        "ID": 140919,
        "Title": "Boardwalk at Palm Bluffs",
        "AddressLine1": "7872 N Palm Ave",
        "Town": "Fresno",
        "StateOrProvince": "CA",
        "Postcode": "93650",
        "CountryID": 2,
        "Latitude": 36.850303,
        "Longitude": -119.80309,
        "ContactTelephone1": "559-446-2001",
        "AccessComments": "24 hours daily\r\nPublic - Credit card at all times",
        "RelatedURL": "",
        "DistanceUnit": 0
    },
    "Connections": [
        {
            "ID": 196233,
            "ConnectionTypeID": 1,
            "LevelID": 2,
            "Amps": 16,
            "Voltage": 230,
            "PowerKW": 3.7,
            "CurrentTypeID": 10,
            "Quantity": 2
        }
    ],
    "StatusTypeID": 50,
    "DateLastStatusUpdate": "2020-06-26T02:59:00Z",
    "DataQualityLevel": 3,
    "DateCreated": "2019-12-24T09:13:00Z",
    "SubmissionStatusTypeID": 100
}