{
    "IsRecentlyVerified": false,
    "ID": 64610,
    "UUID": "94730C62-6D21-4984-BECC-5518713D453E",
    "DataProviderID": 1,
    "OperatorID": 45,
    "UsageTypeID": 6,
    "AddressInfo": {
        "ID": 64956,
        "Title": "Hotel Ritz Carlton",
        "AddressLine1": "Parkstraße 1",
        "AddressLine2": "Schillerteich",
        "Town": "Wolfsburg",
        "StateOrProvince": "Wolfsburg",
        "Postcode": "38440",
        "CountryID": 87,
        "Latitude": 52.4332538,
        "Longitude": 10.7898592,
        "ContactTelephone1": "+495361607000",
        "AccessComments": "Für Hotelgäste zu einem Preis von 18€/Tag inkl. Parken.",
        "DistanceUnit": 0
    },
    "Connections": [
        {
            "ID": 83040,
            "ConnectionTypeID": 25,
            "StatusTypeID": 50,
            "LevelID": 2,
            "Amps": 16,
            "Voltage": 400,
            "PowerKW": 11,
            "CurrentTypeID": 20,
            "Quantity": 4
        }
    ],
    "NumberOfPoints": 4,
    "StatusTypeID": 50,
    "DateLastStatusUpdate": "2016-03-15T08:51:00Z",
    "DataQualityLevel": 1,
    "DateCreated": "2016-03-15T08:44:00Z",
    "SubmissionStatusTypeID": 200
}