{
    "IsRecentlyVerified": false,
    "ID": 34209,
    "UUID": "70ACD57D-3A28-4520-AE2B-2E2B6989AD70",
    "DataProviderID": 26,
    "DataProvidersReference": "46690",
    "OperatorID": 73,
    "OperatorsReference": "EV-Box EVB-P1409201",
    "UsageCost": "0.00 jaarabonnement",
    "AddressInfo": {
        "ID": 34555,
        "Title": "Kampsedijk 16",
        "AddressLine1": "Kampsedijk 16",
        "Town": "Geldermalsen",
        "Postcode": "4157 GL",
        "CountryID": 159,
        "Latitude": 51.88564,
        "Longitude": 5.21175,
        "RelatedURL": "http://www.ev-box.nl",
        "DistanceUnit": 0
    },
    "Connections": [
        {
            "ID": 37720,
            "ConnectionTypeID": 25,
            "LevelID": 2,
            "PowerKW": 5,
            "CurrentTypeID": 10
        }
    ],
    "NumberOfPoints": 1,
    "StatusTypeID": 50,
    "DateLastStatusUpdate": "2016-03-03T12:37:00Z",
    "DataQualityLevel": 3,
    "DateCreated": "2015-01-09T06:04:00Z",
    "SubmissionStatusTypeID": 100
}