{
    "UserComments": [
        {
            "ID": 21440,
            "ChargePointID": 75728,
            "CommentTypeID": 10,
            "UserName": "My_Leaf",
            "Comment": "",
            "Rating": 5,
            "DateCreated": "2019-08-31T13:03:18.603Z",
            "User": {
                "ID": 4511,
                "Username": "My_Leaf"
            },
            "CheckinStatusTypeID": 10
        }
    ],
    "IsRecentlyVerified": false,
    "ID": 75728,
    "UUID": "B54AEC7F-BA4D-4569-A52D-AAF7F9B20263",
    "DataProviderID": 1,
    "OperatorID": 86,
    "UsageTypeID": 4,
    "AddressInfo": {
        "ID": 76074,
        "Title": "Rasthof Lonetal Ost",
        "AddressLine1": "A7",
        "Town": "Giengen an der Brenz",
        "StateOrProvince": "Verwaltungsgemeinschaft Giengen an der Brenz",
        "Postcode": "89537",
        "CountryID": 87,
        "Latitude": 48.5831913931258,
        "Longitude": 10.177711216430673,
        "AccessComments": "24/7 nutzbar mit The New Motion, SUN, Charge&Pay, Z.E. Pass und anderen Ladekarten.",
        "DistanceUnit": 0
    },
    "Connections": [
        {
            "ID": 109213,
            "ConnectionTypeID": 2,
            "StatusTypeID": 50,
            "LevelID": 3,
            "PowerKW": 50,
            "CurrentTypeID": 30,
            "Quantity": 1
        },
        {
            "ID": 109214,
            "ConnectionTypeID": 33,
            "StatusTypeID": 50,
            "LevelID": 3,
            "PowerKW": 50,
            "CurrentTypeID": 30,
            "Quantity": 2
        },
        {
            "ID": 109215,
            "ConnectionTypeID": 1036,
            "StatusTypeID": 50,
            "LevelID": 3,
            "Amps": 63,
            "Voltage": 400,
            "PowerKW": 43,
            "CurrentTypeID": 20,
            "Quantity": 2
        }
    ],
    "NumberOfPoints": 5,
    "StatusTypeID": 50,
    "DateLastStatusUpdate": "2019-08-31T13:03:00Z",
    "DataQualityLevel": 1,
    "DateCreated": "2016-12-21T14:09:00Z",
    "SubmissionStatusTypeID": 200
}