{
    "IsRecentlyVerified": false,
    "ID": 158838,
    "UUID": "EC74DA10-8E7C-45B9-9478-FAA3E2F367A3",
    "DataProviderID": 2,
    "DataProvidersReference": "156622",
    "OperatorID": 59,
    "UsageTypeID": 1,
    "AddressInfo": {
        "ID": 159195,
        "Title": "Greenlots - 12525A",
        "AddressLine1": "5032 Lankershim Blvd",
        "Town": "North Hollywood",
        "StateOrProvince": "CA",
        "Postcode": "91601",
        "CountryID": 2,
        "Latitude": 34.1619720458984,
        "Longitude": -118.372337341309,
        "ContactTelephone1": "855-900-7584",
        "AccessComments": "24 hours daily",
        "RelatedURL": "http://greenlots.com/",
        "DistanceUnit": 0
    },
    "Connections": [
        {
            "ID": 228872,
            "ConnectionTypeID": 1,
            "LevelID": 2,
            "Amps": 16,
            "Voltage": 230,
            "PowerKW": 3.7,
            "CurrentTypeID": 10,
            "Quantity": 1
        }
    ],
    "StatusTypeID": 50,
    "DateLastStatusUpdate": "2020-06-26T02:57:00Z",
    "DataQualityLevel": 3,
    "DateCreated": "2020-06-26T02:57:00Z",
    "SubmissionStatusTypeID": 100
}