{
    "IsRecentlyVerified": false,
    "ID": 177420,
    "UUID": "C164A9EA-D06F-4250-B8B5-4B5B0DC15B81",
    "DataProviderID": 29,
    "DataProvidersReference": "15680",
    "AddressInfo": {
        "ID": 177779,
        "Title": "Eisenerzstraße 78",
        "AddressLine1": "Eisenerzstraße 78",
        "Town": "Salzgitter",
        "Postcode": "38229",
        "CountryID": 87,
        "Latitude": 52.114921,
        "Longitude": 10.3483,
        "DistanceUnit": 0
    },
    "Connections": [
        {
            "ID": 276540,
            "ConnectionTypeID": 25,
            "StatusTypeID": 50,
            "LevelID": 2,
            "PowerKW": 22,
            "CurrentTypeID": 20
        },
        {
            "ID": 276541,
            "ConnectionTypeID": 25,
            "StatusTypeID": 50,
            "LevelID": 2,
            "PowerKW": 22,
            "CurrentTypeID": 20
        }
    ],
    "StatusTypeID": 0,
    "DateLastStatusUpdate": "2021-07-12T02:49:00Z",
    "MetadataValues": [
        {
            "ID": 9714,
            "MetadataFieldID": 4,
            "ItemValue": "Data from the German chargepoint registry provided by Bundesnetzagentur.de under the CC-BY 4.0 license"
        }
    ],
    "DataQualityLevel": 3,
    "DateCreated": "2021-07-08T09:49:00Z",
    "SubmissionStatusTypeID": 100
}