{
    "IsRecentlyVerified": false,
    "ID": 131021,
    "UUID": "CCC6CD83-ED11-4560-93C2-6843EC378594",
    "DataProviderID": 1,
    "OperatorID": 23,
    "OperatorsReference": "51492",
    "UsageTypeID": 4,
    "AddressInfo": {
        "ID": 131367,
        "Title": "Long Story Short - Hostel & Café",
        "AddressLine1": "Kozeluzsk· 945/31",
        "Town": "Olomouc",
        "Postcode": "779 00",
        "CountryID": 64,
        "Latitude": 49.59769,
        "Longitude": 17.258521000000002,
        "ContactTelephone1": "+420 588 008 278",
        "DistanceUnit": 0
    },
    "Connections": [
        {
            "ID": 183516,
            "ConnectionTypeID": 30,
            "StatusTypeID": 50,
            "LevelID": 2,
            "PowerKW": 22,
            "CurrentTypeID": 20,
            "Quantity": 2
        }
    ],
    "NumberOfPoints": 2,
    "GeneralComments": "2 Tesla Connectors, up to 22kW.Available for customers. Self park.",
    "StatusTypeID": 50,
    "DateLastStatusUpdate": "2019-08-28T19:58:00Z",
    "DataQualityLevel": 1,
    "DateCreated": "2019-08-28T19:58:00Z",
    "SubmissionStatusTypeID": 200
}