{
    "IsRecentlyVerified": false,
    "ID": 65297,
    "UUID": "DD540C86-620C-4595-9D99-58DD46B2666E",
    "DataProviderID": 1,
    "OperatorID": 45,
    "UsageTypeID": 1,
    "AddressInfo": {
        "ID": 65643,
        "Title": "Görvälns Slott Boutique Hotel",
        "AddressLine1": "Dikartorpsvägen",
        "AddressLine2": "Kallhäll",
        "Town": "Järfälla",
        "StateOrProvince": "Järfälla",
        "Postcode": "17671",
        "CountryID": 216,
        "Latitude": 59.43463874775292,
        "Longitude": 17.78614550542784,
        "ContactTelephone1": "+46812000200",
        "AccessComments": "Bara för gästa sedan reservation i samtal. Tesla destination charging location.",
        "RelatedURL": "http://www.gorvalnsslott.se/",
        "DistanceUnit": 0
    },
    "Connections": [
        {
            "ID": 89914,
            "ConnectionTypeID": 25,
            "StatusTypeID": 50,
            "LevelID": 2,
            "Amps": 16,
            "Voltage": 400,
            "PowerKW": 11,
            "CurrentTypeID": 20,
            "Quantity": 2
        }
    ],
    "NumberOfPoints": 2,
    "StatusTypeID": 50,
    "DateLastStatusUpdate": "2016-04-26T09:21:00Z",
    "DataQualityLevel": 1,
    "DateCreated": "2016-04-26T09:21:00Z",
    "SubmissionStatusTypeID": 200
}