{
    "IsRecentlyVerified": false,
    "ID": 128545,
    "UUID": "08C5A39B-49C5-42CC-AFE0-322B8F08AADA",
    "DataProviderID": 24,
    "DataProvidersReference": "AAB-13642",
    "OperatorID": 89,
    "UsageTypeID": 1,
    "AddressInfo": {
        "ID": 128891,
        "Title": "Government House",
        "AddressLine1": "1401 Rockland Avenue",
        "Town": "Victoria",
        "StateOrProvince": "BC",
        "Postcode": "V8S 1V9",
        "CountryID": 44,
        "Latitude": 48.418821,
        "Longitude": -123.342121,
        "DistanceUnit": 0
    },
    "Connections": [
        {
            "ID": 179929,
            "ConnectionTypeID": 1,
            "LevelID": 2,
            "Amps": 30,
            "Voltage": 240,
            "PowerKW": 7.2
        }
    ],
    "NumberOfPoints": 1,
    "StatusTypeID": 50,
    "DateLastStatusUpdate": "2019-06-26T08:59:00Z",
    "DataQualityLevel": 4,
    "DateCreated": "2019-06-26T08:59:00Z",
    "SubmissionStatusTypeID": 100
}