{
    "IsRecentlyVerified": false,
    "ID": 50825,
    "UUID": "94012313-516B-4F83-92CE-6D665BCC183E",
    "DataProviderID": 26,
    "DataProvidersReference": "62787",
    "OperatorID": 180,
    "OperatorsReference": "Alfen RHL02242",
    "UsageCost": "0.00 jaarabonnement",
    "AddressInfo": {
        "ID": 51171,
        "Title": "Herenstraat",
        "AddressLine1": "Herenstraat",
        "Town": "Westland",
        "Postcode": "2291 BE",
        "CountryID": 159,
        "Latitude": 52.025502,
        "Longitude": 4.281268,
        "ContactTelephone1": "036 - 549 34 00",
        "RelatedURL": "http://www.icu-charging-stations.com/",
        "DistanceUnit": 0
    },
    "Connections": [
        {
            "ID": 62724,
            "ConnectionTypeID": 25,
            "LevelID": 2,
            "PowerKW": 11,
            "CurrentTypeID": 10
        },
        {
            "ID": 62725,
            "ConnectionTypeID": 25,
            "LevelID": 2,
            "PowerKW": 11,
            "CurrentTypeID": 10
        }
    ],
    "NumberOfPoints": 1,
    "StatusTypeID": 50,
    "DateLastStatusUpdate": "2016-06-04T02:44:00Z",
    "DataQualityLevel": 3,
    "DateCreated": "2015-07-22T09:54:00Z",
    "SubmissionStatusTypeID": 100
}