{
    "IsRecentlyVerified": false,
    "ID": 11722,
    "UUID": "31A7DE01-8A0E-42BC-B519-4FB3AD9FD1D5",
    "DataProviderID": 15,
    "DataProvidersReference": "19524",
    "OperatorID": 5,
    "AddressInfo": {
        "ID": 11619,
        "Title": "311 East Michigan Ave",
        "AddressLine1": "311 East Michigan Ave",
        "Town": "Battle Creek",
        "StateOrProvince": "Michigan",
        "Postcode": "49014",
        "CountryID": 2,
        "Latitude": 43.01895905,
        "Longitude": -83.64761353,
        "ContactTelephone1": "",
        "RelatedURL": "http://carstations.com/19524",
        "DistanceUnit": 0
    },
    "Connections": [
        {
            "ID": 9072,
            "ConnectionTypeID": 9,
            "Reference": "NEMA5",
            "LevelID": 1
        },
        {
            "ID": 10457,
            "ConnectionTypeID": 1,
            "Reference": "J1772",
            "LevelID": 2,
            "Quantity": 1
        }
    ],
    "StatusTypeID": 0,
    "DateLastStatusUpdate": "2017-11-04T14:04:00Z",
    "DataQualityLevel": 2,
    "DateCreated": "2012-06-21T14:52:00Z",
    "SubmissionStatusTypeID": 100
}