{
    "MediaItems": [
        {
            "ID": 19685,
            "ChargePointID": 108073,
            "ItemURL": "https://s3-ap-southeast-2.amazonaws.com/openchargemap/images/CZ/OCM108073/OCM-108073.orig.2019092223411317.png",
            "ItemThumbnailURL": "https://s3-ap-southeast-2.amazonaws.com/openchargemap/images/CZ/OCM108073/OCM-108073.thmb.2019092223411317.png",
            "Comment": "#loket #cez #nonstop #mista4 ",
            "IsEnabled": true,
            "IsVideo": false,
            "IsFeaturedItem": false,
            "IsExternalResource": false,
            "User": {
                "ID": 22495,
                "Username": "MAJKL_elektro🔋"
            },
            "DateCreated": "2019-09-22T23:42:00Z"
        },
        {
            "ID": 19686,
            "ChargePointID": 108073,
            "ItemURL": "https://s3-ap-southeast-2.amazonaws.com/openchargemap/images/CZ/OCM108073/OCM-108073.orig.2019092223415655.png",
            "ItemThumbnailURL": "https://s3-ap-southeast-2.amazonaws.com/openchargemap/images/CZ/OCM108073/OCM-108073.thmb.2019092223415655.png",
            "Comment": "#loket #cez #nonstop #mista4 ",
            "IsEnabled": true,
            "IsVideo": false,
            "IsFeaturedItem": false,
            "IsExternalResource": false,
            "User": {
                "ID": 22495,
                "Username": "MAJKL_elektro🔋"
            },
            "DateCreated": "2019-09-22T23:42:00Z"
        },
        {
            "ID": 19684,
            "ChargePointID": 108073,
            "ItemURL": "https://s3-ap-southeast-2.amazonaws.com/openchargemap/images/CZ/OCM108073/OCM-108073.orig.2019092223404012.png",
            "ItemThumbnailURL": "https://s3-ap-southeast-2.amazonaws.com/openchargemap/images/CZ/OCM108073/OCM-108073.thmb.2019092223404012.png",
            "Comment": "#loket #cez #nonstop #mista4 ",
            "IsEnabled": true,
            "IsVideo": false,
            "IsFeaturedItem": false,
            "IsExternalResource": false,
            "User": {
                "ID": 22495,
                "Username": "MAJKL_elektro🔋"
            },
            "DateCreated": "2019-09-22T23:41:00Z"
        },
        {
            "ID": 16384,
            "ChargePointID": 108073,
            "ItemURL": "https://s3-ap-southeast-2.amazonaws.com/openchargemap/images/CZ/OCM108073/OCM-108073.orig.2018083006322503.jpg",
            "ItemThumbnailURL": "https://s3-ap-southeast-2.amazonaws.com/openchargemap/images/CZ/OCM108073/OCM-108073.thmb.2018083006322503.jpg",
            "Comment": "",
            "IsEnabled": true,
            "IsVideo": false,
            "IsFeaturedItem": false,
            "IsExternalResource": false,
            "User": {
                "ID": 6224,
                "Username": "ozana"
            },
            "DateCreated": "2018-08-30T06:33:00Z"
        }
    ],
    "IsRecentlyVerified": false,
    "ID": 108073,
    "UUID": "43EB606E-94B1-416C-8129-F8144E6CDFDE",
    "DataProviderID": 1,
    "OperatorID": 115,
    "UsageTypeID": 4,
    "AddressInfo": {
        "ID": 108419,
        "Title": "ČEZ McDonalds Loket",
        "AddressLine1": "Čechtice 63",
        "Town": "Jeníkov",
        "StateOrProvince": "okres Benešov",
        "Postcode": "25765",
        "CountryID": 64,
        "Latitude": 49.6585,
        "Longitude": 15.1183,
        "RelatedURL": "http://www.elektromobilita.cz",
        "DistanceUnit": 0
    },
    "Connections": [
        {
            "ID": 152651,
            "ConnectionTypeID": 2,
            "StatusTypeID": 50,
            "LevelID": 3,
            "PowerKW": 50,
            "CurrentTypeID": 30,
            "Quantity": 2
        },
        {
            "ID": 152652,
            "ConnectionTypeID": 33,
            "StatusTypeID": 50,
            "LevelID": 3,
            "PowerKW": 50,
            "CurrentTypeID": 30,
            "Quantity": 2
        },
        {
            "ID": 152653,
            "ConnectionTypeID": 25,
            "StatusTypeID": 50,
            "LevelID": 2,
            "Amps": 32,
            "Voltage": 400,
            "PowerKW": 22,
            "CurrentTypeID": 20,
            "Quantity": 1
        }
    ],
    "NumberOfPoints": 1,
    "StatusTypeID": 50,
    "DateLastStatusUpdate": "2019-09-22T23:42:00Z",
    "DataQualityLevel": 1,
    "DateCreated": "2018-08-30T06:26:00Z",
    "SubmissionStatusTypeID": 200
}