{
    "IsRecentlyVerified": false,
    "ID": 100700,
    "UUID": "90AF0527-DDCD-46FE-9B34-AEF8BD459FB8",
    "DataProviderID": 1,
    "OperatorID": 45,
    "UsageTypeID": 6,
    "AddressInfo": {
        "ID": 101046,
        "Title": "Hotel Sonneck",
        "AddressLine1": "Zu den Einzelnen Bäumen 13",
        "Town": "Knüllwald",
        "StateOrProvince": "Schwalm-Eder-Kreis",
        "Postcode": "34593",
        "CountryID": 87,
        "Latitude": 51.0079965,
        "Longitude": 9.53996230000007,
        "ContactTelephone1": "+49 5685 99957",
        "AccessComments": "24/7 nutzbar für Gäste",
        "RelatedURL": "http://www.hotel-sonneck.com/",
        "DistanceUnit": 0
    },
    "Connections": [
        {
            "ID": 142235,
            "ConnectionTypeID": 25,
            "StatusTypeID": 50,
            "LevelID": 2,
            "Amps": 32,
            "Voltage": 230,
            "PowerKW": 7.4,
            "CurrentTypeID": 10,
            "Quantity": 2
        },
        {
            "ID": 142236,
            "ConnectionTypeID": 25,
            "StatusTypeID": 50,
            "LevelID": 2,
            "Amps": 16,
            "Voltage": 400,
            "PowerKW": 11,
            "CurrentTypeID": 20,
            "Quantity": 1
        }
    ],
    "NumberOfPoints": 3,
    "StatusTypeID": 50,
    "DateLastStatusUpdate": "2018-03-07T09:48:00Z",
    "DataQualityLevel": 1,
    "DateCreated": "2018-03-07T09:48:00Z",
    "SubmissionStatusTypeID": 200
}