{
    "IsRecentlyVerified": false,
    "ID": 174776,
    "UUID": "11D5B28D-A0EC-4CDB-8970-E26F9DCC30ED",
    "DataProviderID": 1,
    "OperatorID": 21,
    "UsageTypeID": 4,
    "UsageCost": "Mobi.E compatible card or App",
    "AddressInfo": {
        "ID": 175135,
        "Title": "CSC-00060",
        "AddressLine1": "Norauto",
        "Town": "Alcoitão",
        "StateOrProvince": "Lisboa",
        "Postcode": "2645",
        "CountryID": 180,
        "Latitude": 38.73165910817801,
        "Longitude": -9.397137123303764,
        "DistanceUnit": 0
    },
    "Connections": [
        {
            "ID": 270813,
            "ConnectionTypeID": 2,
            "StatusTypeID": 50,
            "LevelID": 3,
            "Amps": 120,
            "Voltage": 500,
            "PowerKW": 50,
            "CurrentTypeID": 30,
            "Quantity": 1
        },
        {
            "ID": 270814,
            "ConnectionTypeID": 33,
            "StatusTypeID": 50,
            "LevelID": 3,
            "Amps": 125,
            "Voltage": 500,
            "PowerKW": 50,
            "CurrentTypeID": 30,
            "Quantity": 1
        },
        {
            "ID": 270815,
            "ConnectionTypeID": 1036,
            "StatusTypeID": 50,
            "LevelID": 3,
            "Amps": 63,
            "Voltage": 400,
            "PowerKW": 43,
            "CurrentTypeID": 20,
            "Quantity": 1
        }
    ],
    "NumberOfPoints": 2,
    "StatusTypeID": 50,
    "DateLastStatusUpdate": "2021-04-11T21:57:00Z",
    "DataQualityLevel": 1,
    "DateCreated": "2021-04-11T21:57:00Z",
    "SubmissionStatusTypeID": 200
}