{
    "UserComments": [
        {
            "ID": 22491,
            "ChargePointID": 117641,
            "CommentTypeID": 10,
            "UserName": "ForumElettrico.it",
            "Comment": "L'app CanZe indica che abbia capacità di 20 kW (30 Ampere): resistenza di terra 66 ohm. Leggi la recensione completa qui > https://www.forumelettrico.it/forum/colonnina-enel-x-22-3-kw-custoza-vr-via-xxiv-maggio-di-fronte-alla-chiesa-t7624.html",
            "RelatedURL": "https://www.forumelettrico.it/forum/colonnina-enel-x-22-3-kw-custoza-vr-via-xxiv-maggio-di-fronte-alla-chiesa-t7624.html",
            "DateCreated": "2020-04-24T13:38:23.75Z",
            "User": {
                "ID": 11749,
                "Username": "ForumElettrico.it"
            },
            "CheckinStatusTypeID": 10,
            "IsActionedByEditor": false
        }
    ],
    "MediaItems": [
        {
            "ID": 22104,
            "ChargePointID": 117641,
            "ItemURL": "https://s3-ap-southeast-2.amazonaws.com/openchargemap/images/IT/OCM117641/OCM-117641.orig.2020042413384795.jpg",
            "ItemThumbnailURL": "https://s3-ap-southeast-2.amazonaws.com/openchargemap/images/IT/OCM117641/OCM-117641.thmb.2020042413384795.jpg",
            "Comment": "",
            "IsEnabled": true,
            "IsVideo": false,
            "IsFeaturedItem": false,
            "IsExternalResource": false,
            "User": {
                "ID": 11749,
                "Username": "ForumElettrico.it"
            },
            "DateCreated": "2020-04-24T13:39:00Z"
        },
        {
            "ID": 22105,
            "ChargePointID": 117641,
            "ItemURL": "https://s3-ap-southeast-2.amazonaws.com/openchargemap/images/IT/OCM117641/OCM-117641.orig.2020042413385582.jpg",
            "ItemThumbnailURL": "https://s3-ap-southeast-2.amazonaws.com/openchargemap/images/IT/OCM117641/OCM-117641.thmb.2020042413385582.jpg",
            "Comment": "",
            "IsEnabled": true,
            "IsVideo": false,
            "IsFeaturedItem": false,
            "IsExternalResource": false,
            "User": {
                "ID": 11749,
                "Username": "ForumElettrico.it"
            },
            "DateCreated": "2020-04-24T13:39:00Z"
        }
    ],
    "IsRecentlyVerified": false,
    "ID": 117641,
    "UUID": "10BD08D4-210D-495E-A069-25EEE5E28AFE",
    "DataProviderID": 1,
    "OperatorID": 80,
    "UsageTypeID": 4,
    "AddressInfo": {
        "ID": 117987,
        "Title": "Custoza XXIV Maggio | EnelX",
        "AddressLine1": "Via XXIV Maggio",
        "AddressLine2": "Custoza",
        "Town": "Sommacampagna",
        "StateOrProvince": "VR",
        "Postcode": "37066",
        "CountryID": 112,
        "Latitude": 45.37576264382139,
        "Longitude": 10.795498669482186,
        "ContactTelephone1": "800.069.850",
        "RelatedURL": "https://www.enelx.com/it/it/emobility",
        "DistanceUnit": 0
    },
    "Connections": [
        {
            "ID": 166423,
            "ConnectionTypeID": 25,
            "StatusTypeID": 50,
            "LevelID": 2,
            "Amps": 32,
            "Voltage": 400,
            "PowerKW": 22,
            "CurrentTypeID": 20,
            "Quantity": 1
        },
        {
            "ID": 166424,
            "ConnectionTypeID": 36,
            "StatusTypeID": 50,
            "LevelID": 2,
            "Amps": 16,
            "Voltage": 240,
            "PowerKW": 3.7,
            "CurrentTypeID": 10,
            "Quantity": 1
        }
    ],
    "NumberOfPoints": 2,
    "StatusTypeID": 50,
    "DateLastStatusUpdate": "2020-04-24T13:39:00Z",
    "DataQualityLevel": 1,
    "DateCreated": "2019-02-20T17:19:00Z",
    "SubmissionStatusTypeID": 200
}