{
    "IsRecentlyVerified": false,
    "ID": 37638,
    "UUID": "4600F206-335A-4D3A-9CF3-FB899AA34211",
    "DataProviderID": 26,
    "DataProvidersReference": "39107",
    "OperatorID": 73,
    "OperatorsReference": "EV-Box EVB-P1339064",
    "UsageCost": "0.00 jaarabonnement",
    "AddressInfo": {
        "ID": 37984,
        "Title": "Beekweg 55",
        "AddressLine1": "Beekweg 55",
        "Town": "Nunspeet",
        "Postcode": "8077 SH",
        "CountryID": 159,
        "Latitude": 52.36455,
        "Longitude": 5.70526,
        "RelatedURL": "http://www.ev-box.nl",
        "DistanceUnit": 0
    },
    "Connections": [
        {
            "ID": 41149,
            "ConnectionTypeID": 25,
            "LevelID": 2,
            "PowerKW": 5,
            "CurrentTypeID": 10
        }
    ],
    "NumberOfPoints": 1,
    "StatusTypeID": 50,
    "DateLastStatusUpdate": "2016-06-04T02:53:00Z",
    "DataQualityLevel": 3,
    "DateCreated": "2015-01-09T06:07:00Z",
    "SubmissionStatusTypeID": 100
}