{
    "IsRecentlyVerified": false,
    "ID": 106443,
    "UUID": "B48F1D58-9873-420B-B0D5-FF8D9D6694CA",
    "DataProviderID": 1,
    "OperatorID": 23,
    "OperatorsReference": "44464",
    "UsageTypeID": 4,
    "AddressInfo": {
        "ID": 106789,
        "Title": "Aci Marina Korcula",
        "AddressLine1": "Setaliste Frana Krsinica",
        "Town": "Korcula",
        "Postcode": "20260",
        "CountryID": 60,
        "Latitude": 42.958976,
        "Longitude": 17.135738,
        "ContactTelephone1": "+385 (0)20 711 661",
        "DistanceUnit": 0
    },
    "Connections": [
        {
            "ID": 149820,
            "ConnectionTypeID": 30,
            "StatusTypeID": 50,
            "LevelID": 2,
            "Amps": 32,
            "Voltage": 400,
            "PowerKW": 22,
            "CurrentTypeID": 20,
            "Quantity": 2
        }
    ],
    "NumberOfPoints": 2,
    "GeneralComments": "2 Tesla Connectors, up to 22kW.Available for customers. Please call ahead.",
    "StatusTypeID": 50,
    "DateLastStatusUpdate": "2018-10-03T22:23:00Z",
    "DataQualityLevel": 1,
    "DateCreated": "2018-06-23T05:29:00Z",
    "SubmissionStatusTypeID": 200
}