{
    "IsRecentlyVerified": false,
    "ID": 173169,
    "UUID": "338FDD3E-530E-47D9-8181-BD8DE6EC9058",
    "DataProviderID": 19,
    "DataProvidersReference": "6890",
    "AddressInfo": {
        "ID": 173528,
        "Title": "Selga Uppsala",
        "AddressLine1": "Björkgatan 59 ",
        "Town": "UPPSALA",
        "StateOrProvince": "UPPSALA",
        "Postcode": "75323",
        "CountryID": 216,
        "Latitude": 59.85706,
        "Longitude": 17.66455,
        "AccessComments": "",
        "DistanceUnit": 0
    },
    "Connections": [
        {
            "ID": 265581,
            "ConnectionTypeID": 25,
            "Reference": "1",
            "LevelID": 2,
            "Amps": 16,
            "Voltage": 230,
            "PowerKW": 3.7,
            "CurrentTypeID": 10
        },
        {
            "ID": 265582,
            "ConnectionTypeID": 25,
            "Reference": "2",
            "LevelID": 2,
            "Amps": 16,
            "Voltage": 230,
            "PowerKW": 3.7,
            "CurrentTypeID": 10
        }
    ],
    "NumberOfPoints": 2,
    "StatusTypeID": 0,
    "DateLastStatusUpdate": "2021-03-03T09:02:00Z",
    "DataQualityLevel": 2,
    "DateCreated": "2021-03-03T09:02:00Z",
    "SubmissionStatusTypeID": 100
}