{
    "IsRecentlyVerified": false,
    "ID": 72634,
    "UUID": "001CD073-2E01-4D3C-A9C2-DEDB4C8E05E3",
    "DataProviderID": 1,
    "OperatorID": 3,
    "OperatorsReference": "PG-90896",
    "UsageTypeID": 6,
    "UsageCost": "1",
    "AddressInfo": {
        "ID": 72980,
        "Title": "Arnold Clark Glasgow-Hyundai",
        "AddressLine1": "345 Alexandra Parade",
        "AddressLine2": "Dennistoun",
        "Town": "Glasgow",
        "StateOrProvince": "Scotland",
        "Postcode": "G31 3AD",
        "CountryID": 1,
        "Latitude": 55.864867,
        "Longitude": -4.223626,
        "DistanceUnit": 0
    },
    "Connections": [
        {
            "ID": 104132,
            "ConnectionTypeID": 25,
            "StatusTypeID": 50,
            "LevelID": 2,
            "Amps": 32,
            "Voltage": 230,
            "PowerKW": 7,
            "CurrentTypeID": 10,
            "Quantity": 1
        }
    ],
    "NumberOfPoints": 3,
    "StatusTypeID": 0,
    "DateLastStatusUpdate": "2020-01-23T06:41:00Z",
    "DataQualityLevel": 1,
    "DateCreated": "2016-10-27T15:58:00Z",
    "SubmissionStatusTypeID": 200
}