{
    "IsRecentlyVerified": false,
    "ID": 116367,
    "UUID": "934EC5FC-34B9-4987-8F9C-17671FCFDCCD",
    "DataProviderID": 1,
    "DataProvidersReference": "5166",
    "AddressInfo": {
        "ID": 116713,
        "Title": "Fredriksvern verft",
        "AddressLine1": "Fredriksvern verft ",
        "Town": "STAVERN",
        "StateOrProvince": "Vestfold og Telemark",
        "Postcode": "3290",
        "CountryID": 168,
        "Latitude": 58.9957,
        "Longitude": 10.03359,
        "AccessComments": "",
        "DistanceUnit": 0
    },
    "Connections": [
        {
            "ID": 163995,
            "ConnectionTypeID": 0,
            "Reference": "1",
            "LevelID": 2,
            "Amps": 16,
            "Voltage": 230,
            "PowerKW": 3.7,
            "Comments": "Mode 3"
        },
        {
            "ID": 163996,
            "ConnectionTypeID": 0,
            "Reference": "2",
            "LevelID": 2,
            "Amps": 16,
            "Voltage": 230,
            "PowerKW": 3.7,
            "Comments": "Mode 3"
        }
    ],
    "NumberOfPoints": 2,
    "DateLastStatusUpdate": "2020-05-26T08:22:00Z",
    "DataQualityLevel": 2,
    "DateCreated": "2019-02-11T09:16:00Z",
    "SubmissionStatusTypeID": 100
}