{
    "IsRecentlyVerified": false,
    "ID": 158413,
    "UUID": "1DFD4FAC-6F86-44C2-B449-167669965D22",
    "DataProviderID": 2,
    "DataProvidersReference": "151238",
    "OperatorID": 3293,
    "UsageTypeID": 1,
    "AddressInfo": {
        "ID": 158770,
        "Title": "Balboa Mesa Shopping Center - Vons",
        "AddressLine1": "5555 Balboa Ave",
        "Town": "San Diego",
        "StateOrProvince": "CA",
        "Postcode": "92111",
        "CountryID": 2,
        "Latitude": 32.818697,
        "Longitude": -117.179338,
        "ContactTelephone1": "888-264-2208",
        "AccessComments": "6am-12am daily",
        "RelatedURL": "https://voltacharging.com/",
        "DistanceUnit": 0
    },
    "Connections": [
        {
            "ID": 228391,
            "ConnectionTypeID": 1,
            "LevelID": 2,
            "Amps": 16,
            "Voltage": 230,
            "PowerKW": 3.7,
            "CurrentTypeID": 10,
            "Quantity": 2
        }
    ],
    "StatusTypeID": 50,
    "DateLastStatusUpdate": "2020-06-26T02:55:00Z",
    "DataQualityLevel": 3,
    "DateCreated": "2020-06-26T02:55:00Z",
    "SubmissionStatusTypeID": 100
}