{
    "IsRecentlyVerified": false,
    "ID": 159788,
    "UUID": "3B00FA3D-E568-446C-8B84-3FFB19FD9196",
    "DataProviderID": 2,
    "DataProvidersReference": "154183",
    "OperatorID": 5,
    "UsageTypeID": 1,
    "AddressInfo": {
        "ID": 160145,
        "Title": "STATEOFUTDAS",
        "AddressLine1": "138 W 990 S",
        "Town": "Brigham City",
        "StateOrProvince": "UT",
        "Postcode": "84302",
        "CountryID": 2,
        "Latitude": 41.490481,
        "Longitude": -112.017975,
        "ContactTelephone1": "888-758-4389",
        "AccessComments": "24 hours daily",
        "RelatedURL": "http://www.chargepoint.com/",
        "DistanceUnit": 0
    },
    "Connections": [
        {
            "ID": 230004,
            "ConnectionTypeID": 1,
            "LevelID": 2,
            "Amps": 16,
            "Voltage": 230,
            "PowerKW": 3.7,
            "CurrentTypeID": 10,
            "Quantity": 4
        }
    ],
    "StatusTypeID": 50,
    "DateLastStatusUpdate": "2020-06-26T03:04:00Z",
    "DataQualityLevel": 3,
    "DateCreated": "2020-06-26T03:04:00Z",
    "SubmissionStatusTypeID": 100
}