{
    "UserComments": [
        {
            "ID": 403,
            "ChargePointID": 16415,
            "CommentTypeID": 50,
            "UserName": "Someone_Just_",
            "Comment": "You need to ask a card or key to activate the chargepoints.",
            "Rating": 3,
            "RelatedURL": "http://www.eoluz.be",
            "DateCreated": "2013-08-21T20:47:38.077Z",
            "User": {
                "ID": 1107,
                "Username": "Someone_Just_"
            },
            "CheckinStatusTypeID": 210
        }
    ],
    "MediaItems": [
        {
            "ID": 48,
            "ChargePointID": 16415,
            "ItemURL": "https://s3-ap-southeast-2.amazonaws.com/openchargemap/images/BE/OCM16415/OCM-16415.orig.2013082120324478.jpg",
            "ItemThumbnailURL": "https://s3-ap-southeast-2.amazonaws.com/openchargemap/images/BE/OCM16415/OCM-16415.thmb.2013082120324478.jpg",
            "Comment": "2 mennekes connections in front of the building, 1 at the side.",
            "IsEnabled": true,
            "IsVideo": false,
            "IsFeaturedItem": false,
            "IsExternalResource": false,
            "User": {
                "ID": 1107,
                "Username": "Someone_Just_"
            },
            "DateCreated": "2013-08-21T20:33:00Z"
        }
    ],
    "IsRecentlyVerified": false,
    "ID": 16415,
    "UUID": "9B1D86C3-3309-4466-BE77-80C2B2F19C13",
    "DataProviderID": 1,
    "OperatorID": 1,
    "OperatorsReference": "EM-BE-00000002-01-00001",
    "UsageTypeID": 4,
    "UsageCost": "",
    "AddressInfo": {
        "ID": 16760,
        "Title": "Eoluz",
        "AddressLine1": "Starrenhoflaan 44/003",
        "AddressLine2": "",
        "Town": "Kapellen",
        "StateOrProvince": "",
        "Postcode": "2950",
        "CountryID": 26,
        "Latitude": 51.33045541625917,
        "Longitude": 4.410441671302806,
        "ContactTelephone1": "",
        "ContactTelephone2": "",
        "ContactEmail": "",
        "AccessComments": "",
        "RelatedURL": "http://www.eoluz.be",
        "DistanceUnit": 0
    },
    "Connections": [
        {
            "ID": 22546,
            "ConnectionTypeID": 25,
            "StatusTypeID": 0,
            "LevelID": 2,
            "PowerKW": 22,
            "CurrentTypeID": 20,
            "Quantity": 2
        }
    ],
    "NumberOfPoints": 3,
    "GeneralComments": "",
    "StatusTypeID": 50,
    "DateLastStatusUpdate": "2013-12-29T15:48:00Z",
    "DataQualityLevel": 2,
    "DateCreated": "2013-04-20T04:44:00Z",
    "SubmissionStatusTypeID": 200
}