{
    "IsRecentlyVerified": false,
    "ID": 139224,
    "UUID": "F49223F6-2A58-4EBC-93F1-AABB02AF0A1B",
    "DataProviderID": 2,
    "DataProvidersReference": "69067",
    "OperatorID": 5,
    "UsageTypeID": 1,
    "AddressInfo": {
        "ID": 139576,
        "Title": "IRVINE  CO  OFC",
        "AddressLine1": "34 Executive Park",
        "Town": "Irvine",
        "StateOrProvince": "CA",
        "Postcode": "92614",
        "CountryID": 2,
        "Latitude": 33.6859689,
        "Longitude": -117.8597274,
        "ContactTelephone1": "888-758-4389",
        "AccessComments": "24 hours daily",
        "RelatedURL": "http://www.chargepoint.com/",
        "DistanceUnit": 0
    },
    "Connections": [
        {
            "ID": 194506,
            "ConnectionTypeID": 1,
            "LevelID": 2,
            "Amps": 16,
            "Voltage": 230,
            "PowerKW": 3,
            "CurrentTypeID": 10,
            "Quantity": 2
        }
    ],
    "StatusTypeID": 50,
    "DateLastStatusUpdate": "2019-12-24T09:10:00Z",
    "DataQualityLevel": 3,
    "DateCreated": "2019-12-24T09:10:00Z",
    "SubmissionStatusTypeID": 100
}