{
    "IsRecentlyVerified": false,
    "ID": 90059,
    "UUID": "476D7AAD-C04E-4E62-BFD7-700865823190",
    "DataProviderID": 1,
    "OperatorID": 156,
    "UsageTypeID": 4,
    "AddressInfo": {
        "ID": 90405,
        "Title": "Robert Bosch",
        "AddressLine1": "Theodor-Heuss-Straße 12",
        "Town": "Braunschweig",
        "StateOrProvince": "Braunschweig",
        "Postcode": "38122",
        "CountryID": 87,
        "Latitude": 52.24848,
        "Longitude": 10.516529999999989,
        "AccessComments": "Genaue Position und Zugangsbedingungen sind nicht bekannt.",
        "RelatedURL": "http://www.bosch.de/de/de/our_company_1/locations_1/locations-detail_3392.html",
        "DistanceUnit": 0
    },
    "Connections": [
        {
            "ID": 127663,
            "ConnectionTypeID": 25,
            "StatusTypeID": 50,
            "LevelID": 2,
            "Amps": 32,
            "Voltage": 400,
            "PowerKW": 22,
            "CurrentTypeID": 20,
            "Quantity": 2
        }
    ],
    "NumberOfPoints": 2,
    "StatusTypeID": 50,
    "DateLastStatusUpdate": "2017-07-05T07:44:00Z",
    "DataQualityLevel": 1,
    "DateCreated": "2017-07-05T07:44:00Z",
    "SubmissionStatusTypeID": 200
}