{
    "IsRecentlyVerified": false,
    "ID": 106095,
    "UUID": "FE9D777A-44A9-4837-B958-421E17B66E75",
    "DataProviderID": 1,
    "OperatorID": 3261,
    "UsageTypeID": 4,
    "UsageCost": "0",
    "AddressInfo": {
        "ID": 106441,
        "Title": "Parkhaus Park One im Nove",
        "AddressLine1": "Lilli-Palmer-Straße 2",
        "Town": "München",
        "StateOrProvince": "Bayern",
        "Postcode": "80636",
        "CountryID": 87,
        "Latitude": 48.14430196991198,
        "Longitude": 11.537643180356554,
        "AccessComments": "Im durchgehend geöffneten Parkhaus sind 12 Ladepunkte vorhanden",
        "RelatedURL": "https://www.park-one.com/standorte/muenchen/nove/",
        "DistanceUnit": 0
    },
    "Connections": [
        {
            "ID": 149416,
            "ConnectionTypeID": 25,
            "StatusTypeID": 50,
            "LevelID": 2,
            "Amps": 32,
            "Voltage": 400,
            "PowerKW": 22,
            "CurrentTypeID": 20,
            "Quantity": 12
        }
    ],
    "NumberOfPoints": 12,
    "StatusTypeID": 50,
    "DateLastStatusUpdate": "2018-06-15T07:00:00Z",
    "DataQualityLevel": 1,
    "DateCreated": "2018-06-15T07:00:00Z",
    "SubmissionStatusTypeID": 200
}