{
    "IsRecentlyVerified": false,
    "ID": 138028,
    "UUID": "A423D759-2889-47E3-B092-5F1027B0D9AE",
    "DataProviderID": 2,
    "DataProvidersReference": "96390",
    "OperatorID": 9,
    "UsageTypeID": 1,
    "AddressInfo": {
        "ID": 138377,
        "Title": "Little Sunshine's Playhouse - Gilbert",
        "AddressLine1": "1059 N Val Vista Dr.",
        "Town": "Gilbert",
        "StateOrProvince": "AZ",
        "Postcode": "85234",
        "CountryID": 2,
        "Latitude": 33.36931,
        "Longitude": -111.75568,
        "ContactTelephone1": "888-998-2546",
        "AccessComments": "MON: 24 hours | TUE: 24 hours | WED: 24 hours | THU: 24 hours | FRI: 24 hours | SAT: 24 hours | SUN: 24 hours",
        "RelatedURL": "http://www.blinkcharging.com/",
        "DistanceUnit": 0
    },
    "Connections": [
        {
            "ID": 193072,
            "ConnectionTypeID": 1,
            "LevelID": 2,
            "Amps": 16,
            "Voltage": 230,
            "PowerKW": 3,
            "CurrentTypeID": 10,
            "Quantity": 1
        }
    ],
    "StatusTypeID": 50,
    "DateLastStatusUpdate": "2019-12-24T09:06:00Z",
    "DataQualityLevel": 3,
    "DateCreated": "2019-12-24T09:06:00Z",
    "SubmissionStatusTypeID": 100
}