{
    "IsRecentlyVerified": false,
    "ID": 129809,
    "UUID": "32E3C3F4-87C7-4D1A-8DDF-C3A2432C41AD",
    "DataProviderID": 1,
    "OperatorID": 1,
    "UsageTypeID": 1,
    "AddressInfo": {
        "ID": 130155,
        "Title": "AUBERGE DE LA MAISON",
        "AddressLine1": "VIA PASSERIN D ENTREVES 16/A ",
        "Town": "COURMAYEUR",
        "Postcode": "11013",
        "CountryID": 112,
        "Latitude": 45.8147058577281,
        "Longitude": 6.96183864804016,
        "ContactTelephone1": "0165869811",
        "ContactEmail": "info@aubergemaison.it",
        "DistanceUnit": 0
    },
    "Connections": [
        {
            "ID": 181714,
            "ConnectionTypeID": 25,
            "StatusTypeID": 50,
            "LevelID": 2,
            "Amps": 16,
            "Voltage": 400,
            "PowerKW": 11,
            "CurrentTypeID": 20,
            "Quantity": 1
        }
    ],
    "NumberOfPoints": 1,
    "StatusTypeID": 50,
    "DateLastStatusUpdate": "2019-07-26T15:33:00Z",
    "DataQualityLevel": 1,
    "DateCreated": "2019-07-26T14:07:00Z",
    "SubmissionStatusTypeID": 200
}