{
    "IsRecentlyVerified": false,
    "ID": 43304,
    "UUID": "0D4EC9F9-C3DD-4F1E-A667-E371763D49D0",
    "DataProviderID": 1,
    "OperatorID": 19,
    "UsageTypeID": 1,
    "UsageCost": "",
    "AddressInfo": {
        "ID": 43650,
        "Title": "Squirrel Hill Holiday Cottages ",
        "AddressLine1": "Squirrel Hill Farm ",
        "AddressLine2": "",
        "Town": "Bradford ",
        "StateOrProvince": "West Yorkshire ",
        "Postcode": "BD13 3SR",
        "CountryID": 1,
        "Latitude": 53.783422,
        "Longitude": -1.873785,
        "ContactTelephone1": "01274 831871",
        "ContactTelephone2": "07976 928827",
        "ContactEmail": "squirreldesign@aol.com",
        "AccessComments": "",
        "RelatedURL": "http://www.holidaycottageswestyorkshire.co.uk/",
        "DistanceUnit": 0
    },
    "Connections": [
        {
            "ID": 52488,
            "ConnectionTypeID": 25,
            "StatusTypeID": 50,
            "LevelID": 2,
            "Amps": 32,
            "Voltage": 230,
            "PowerKW": 7,
            "CurrentTypeID": 10,
            "Quantity": 1
        }
    ],
    "NumberOfPoints": 1,
    "GeneralComments": "",
    "StatusTypeID": 50,
    "DateLastStatusUpdate": "2015-03-26T13:46:00Z",
    "DataQualityLevel": 1,
    "DateCreated": "2015-03-26T08:45:00Z",
    "SubmissionStatusTypeID": 200
}