{
    "IsRecentlyVerified": false,
    "ID": 80238,
    "UUID": "C6701A86-1B0D-4E3B-93A4-B8E480FA7597",
    "DataProviderID": 2,
    "DataProvidersReference": "80554",
    "UsageTypeID": 1,
    "AddressInfo": {
        "ID": 80584,
        "Title": "Main Street Bank",
        "AddressLine1": "10089 Fairfax Blvd",
        "Town": "Fairfax",
        "StateOrProvince": "VA",
        "Postcode": "22030",
        "CountryID": 2,
        "Latitude": 38.861765,
        "Longitude": -77.292692,
        "ContactTelephone1": "703-481-4567",
        "AccessComments": "24 hours daily; for customer use only",
        "RelatedURL": "",
        "DistanceUnit": 0
    },
    "Connections": [
        {
            "ID": 114908,
            "ConnectionTypeID": 1,
            "LevelID": 2,
            "Amps": 16,
            "Voltage": 230,
            "PowerKW": 3.7,
            "CurrentTypeID": 10,
            "Quantity": 2
        }
    ],
    "DateLastStatusUpdate": "2020-06-26T03:00:00Z",
    "DataQualityLevel": 3,
    "DateCreated": "2017-01-31T01:05:00Z",
    "SubmissionStatusTypeID": 100
}