{
    "IsRecentlyVerified": false,
    "ID": 141885,
    "UUID": "29DE3E7A-A745-4749-9FEF-B3D15749CC15",
    "DataProviderID": 2,
    "DataProvidersReference": "89048",
    "OperatorID": 5,
    "UsageTypeID": 1,
    "AddressInfo": {
        "ID": 142237,
        "Title": "PUBLIC STATIONS",
        "AddressLine1": "201-249 W 14th Ave",
        "Town": "Denver",
        "StateOrProvince": "CO",
        "Postcode": "80202",
        "CountryID": 2,
        "Latitude": 39.7385267,
        "Longitude": -104.9905864,
        "ContactTelephone1": "888-758-4389",
        "AccessComments": "24 hours daily",
        "RelatedURL": "http://www.chargepoint.com/",
        "DistanceUnit": 0
    },
    "Connections": [
        {
            "ID": 197923,
            "ConnectionTypeID": 1,
            "LevelID": 2,
            "Amps": 16,
            "Voltage": 230,
            "PowerKW": 3.7,
            "CurrentTypeID": 10,
            "Quantity": 2
        }
    ],
    "StatusTypeID": 50,
    "DateLastStatusUpdate": "2020-06-26T03:02:00Z",
    "DataQualityLevel": 3,
    "DateCreated": "2019-12-24T09:16:00Z",
    "SubmissionStatusTypeID": 100
}