{
    "IsRecentlyVerified": false,
    "ID": 123497,
    "UUID": "CFF09C6B-CB6C-4D2D-BB5D-9E4E98B8799B",
    "DataProviderID": 2,
    "DataProvidersReference": "39812",
    "UsageTypeID": 7,
    "AddressInfo": {
        "ID": 123843,
        "Title": "Wallace Nissan Oldsmobile",
        "AddressLine1": "2733 E Stone Dr",
        "Town": "Kingsport",
        "StateOrProvince": "TN",
        "Postcode": "37660",
        "CountryID": 2,
        "Latitude": 36.551835,
        "Longitude": -82.487841,
        "ContactTelephone1": "423-288-5500",
        "AccessComments": "Dealership business hours\r\nPublic - Call ahead",
        "RelatedURL": "",
        "DistanceUnit": 0
    },
    "Connections": [
        {
            "ID": 173481,
            "ConnectionTypeID": 1,
            "LevelID": 2,
            "Amps": 16,
            "Voltage": 230,
            "PowerKW": 3.7,
            "CurrentTypeID": 10,
            "Quantity": 1
        }
    ],
    "DateLastStatusUpdate": "2020-06-26T02:58:00Z",
    "DataQualityLevel": 3,
    "DateCreated": "2019-04-06T05:03:00Z",
    "SubmissionStatusTypeID": 100
}