{
    "IsRecentlyVerified": false,
    "ID": 140521,
    "UUID": "59E7C1C6-7D13-458C-8FA2-95283A3C98BB",
    "DataProviderID": 2,
    "DataProvidersReference": "147172",
    "OperatorID": 9,
    "UsageTypeID": 1,
    "AddressInfo": {
        "ID": 140873,
        "Title": "Paris Landing State Park Inn",
        "AddressLine1": "16055 Hwy 79 N",
        "Town": "Buchanan",
        "StateOrProvince": "TN",
        "Postcode": "38222",
        "CountryID": 2,
        "Latitude": 36.438936,
        "Longitude": -88.083499,
        "ContactTelephone1": "888-998-2546",
        "AccessComments": "MON: 24 hours | TUE: 24 hours | WED: 24 hours | THU: 24 hours | FRI: 24 hours | SAT: 24 hours | SUN: 24 hours",
        "RelatedURL": "http://www.blinkcharging.com/",
        "DistanceUnit": 0
    },
    "Connections": [
        {
            "ID": 196169,
            "ConnectionTypeID": 1,
            "LevelID": 2,
            "Amps": 16,
            "Voltage": 230,
            "PowerKW": 3,
            "CurrentTypeID": 10,
            "Quantity": 1
        }
    ],
    "StatusTypeID": 50,
    "DateLastStatusUpdate": "2019-12-24T09:13:00Z",
    "DataQualityLevel": 3,
    "DateCreated": "2019-12-24T09:13:00Z",
    "SubmissionStatusTypeID": 100
}