{
    "IsRecentlyVerified": false,
    "ID": 17713,
    "UUID": "83C780CA-C302-4FCF-8A86-7A7136D170CB",
    "DataProviderID": 22,
    "DataProvidersReference": "57574E4F5E30961F96C7E320BF15A5DD",
    "AddressInfo": {
        "ID": 18058,
        "Title": "千代田区本庁舎地下駐車場",
        "AddressLine1": "東京都千代田区九段南1-2-1",
        "CountryID": 114,
        "Latitude": 35.69397529,
        "Longitude": 139.7536522,
        "ContactTelephone1": "03-3264-2111",
        "DistanceUnit": 0
    },
    "Connections": [
        {
            "ID": 17954,
            "ConnectionTypeID": 2,
            "LevelID": 2,
            "Amps": 100,
            "Voltage": 480,
            "PowerKW": 48,
            "Quantity": 1
        }
    ],
    "DateLastStatusUpdate": "2013-06-29T09:02:00Z",
    "DataQualityLevel": 2,
    "DateCreated": "2013-06-29T09:02:00Z",
    "SubmissionStatusTypeID": 200
}