{
    "IsRecentlyVerified": false,
    "ID": 29546,
    "UUID": "4566D3BD-C473-4A7A-9E82-ABE9909343A0",
    "DataProviderID": 15,
    "DataProvidersReference": "7298",
    "OperatorID": 26,
    "AddressInfo": {
        "ID": 29892,
        "Title": "3480 Hwy 96 Bypass",
        "AddressLine1": "3480 Hwy 96 Bypass",
        "Town": "Silsbee",
        "StateOrProvince": "TX",
        "Postcode": "77656",
        "CountryID": 2,
        "Latitude": 30.32249,
        "Longitude": -94.17223,
        "ContactTelephone1": " (409) 299-3221",
        "RelatedURL": "http://carstations.com/7298",
        "DistanceUnit": 0
    },
    "Connections": [
        {
            "ID": 32531,
            "ConnectionTypeID": 1,
            "Reference": "J1772",
            "LevelID": 2
        }
    ],
    "StatusTypeID": 0,
    "DateLastStatusUpdate": "2017-11-04T14:03:00Z",
    "DataQualityLevel": 2,
    "DateCreated": "2014-11-29T05:39:00Z",
    "SubmissionStatusTypeID": 100
}