{
    "IsRecentlyVerified": false,
    "ID": 138000,
    "UUID": "2F49C5E1-58AC-4B03-B6A2-3CD76F26C817",
    "DataProviderID": 2,
    "DataProvidersReference": "146576",
    "OperatorID": 15,
    "UsageTypeID": 1,
    "AddressInfo": {
        "ID": 138349,
        "Title": "Walgreens",
        "AddressLine1": "26731 US Highway 380 E",
        "Town": "Aubrey",
        "StateOrProvince": "TX",
        "Postcode": "76227",
        "CountryID": 2,
        "Latitude": 33.22174,
        "Longitude": -96.93698,
        "ContactTelephone1": "877-455-3833",
        "AccessComments": "24 hours daily",
        "RelatedURL": "https://www.evgo.com/",
        "DistanceUnit": 0
    },
    "Connections": [
        {
            "ID": 193039,
            "ConnectionTypeID": 1,
            "LevelID": 2,
            "Amps": 16,
            "Voltage": 230,
            "PowerKW": 3,
            "CurrentTypeID": 10,
            "Quantity": 1
        },
        {
            "ID": 193040,
            "ConnectionTypeID": 2,
            "LevelID": 3,
            "Amps": 100,
            "Voltage": 400,
            "PowerKW": 40,
            "CurrentTypeID": 30,
            "Quantity": 1
        },
        {
            "ID": 193041,
            "ConnectionTypeID": 32,
            "LevelID": 3,
            "Amps": 100,
            "Voltage": 400,
            "PowerKW": 40,
            "CurrentTypeID": 30,
            "Quantity": 1
        }
    ],
    "StatusTypeID": 50,
    "DateLastStatusUpdate": "2019-12-24T09:06:00Z",
    "DataQualityLevel": 3,
    "DateCreated": "2019-12-24T09:06:00Z",
    "SubmissionStatusTypeID": 100
}