{
    "IsRecentlyVerified": false,
    "ID": 107817,
    "UUID": "509DECB1-722E-4D22-9A1A-4CB51B223A4A",
    "DataProviderID": 1,
    "OperatorID": 45,
    "UsageTypeID": 1,
    "AddressInfo": {
        "ID": 108163,
        "Title": "ON Húsavík",
        "AddressLine1": "Héðinsbraut ",
        "Town": "Húsavík",
        "StateOrProvince": "Húsavík",
        "Postcode": "640",
        "CountryID": 105,
        "Latitude": 66.048433,
        "Longitude": -17.344426,
        "DistanceUnit": 0
    },
    "Connections": [
        {
            "ID": 152240,
            "ConnectionTypeID": 2,
            "StatusTypeID": 50,
            "LevelID": 3,
            "Voltage": 400,
            "PowerKW": 50,
            "CurrentTypeID": 30,
            "Quantity": 1
        },
        {
            "ID": 152241,
            "ConnectionTypeID": 33,
            "StatusTypeID": 50,
            "LevelID": 3,
            "Voltage": 400,
            "PowerKW": 50,
            "CurrentTypeID": 30,
            "Quantity": 1
        },
        {
            "ID": 152242,
            "ConnectionTypeID": 25,
            "StatusTypeID": 50,
            "LevelID": 3,
            "Amps": 64,
            "Voltage": 400,
            "PowerKW": 44,
            "CurrentTypeID": 20,
            "Quantity": 1
        }
    ],
    "NumberOfPoints": 1,
    "StatusTypeID": 50,
    "DateLastStatusUpdate": "2018-08-10T16:13:00Z",
    "DataQualityLevel": 1,
    "DateCreated": "2018-08-10T16:13:00Z",
    "SubmissionStatusTypeID": 200
}