{
    "IsRecentlyVerified": false,
    "ID": 109104,
    "UUID": "46A34791-5CFA-47F2-82FA-0F62B75E5BAB",
    "DataProviderID": 1,
    "OperatorID": 23,
    "OperatorsReference": "46031",
    "UsageTypeID": 4,
    "AddressInfo": {
        "ID": 109450,
        "Title": "Johnny's Italian Steakhouse Omaha",
        "AddressLine1": "305 N 170th St",
        "Town": "Omaha",
        "StateOrProvince": "Nebraska",
        "Postcode": "68118",
        "CountryID": 2,
        "Latitude": 41.261001,
        "Longitude": -96.181076,
        "ContactTelephone1": "(402) 289-9210",
        "DistanceUnit": 0
    },
    "Connections": [
        {
            "ID": 154222,
            "ConnectionTypeID": 30,
            "StatusTypeID": 50,
            "LevelID": 2,
            "PowerKW": 13,
            "CurrentTypeID": 20,
            "Quantity": 3
        }
    ],
    "NumberOfPoints": 3,
    "GeneralComments": "3 Tesla Connectors, up to 13kW.Available for customers. Self park.",
    "StatusTypeID": 50,
    "DateLastStatusUpdate": "2018-10-11T13:37:00Z",
    "DataQualityLevel": 1,
    "DateCreated": "2018-10-11T13:37:00Z",
    "SubmissionStatusTypeID": 200
}