{
    "IsRecentlyVerified": false,
    "ID": 5915,
    "UUID": "25F9CDF1-C0EA-4BDC-A72D-46D88BB55D81",
    "DataProviderID": 1,
    "OperatorID": 1,
    "UsageTypeID": 1,
    "AddressInfo": {
        "ID": 5837,
        "Title": "Coeur d'Alene Resort",
        "Town": "Coeur d'Alene",
        "StateOrProvince": "Idaho",
        "CountryID": 2,
        "Latitude": 47.6726700850893,
        "Longitude": -116.784152984619,
        "RelatedURL": "http://www.cdaresort.com/",
        "DistanceUnit": 0
    },
    "Connections": [
        {
            "ID": 662,
            "ConnectionTypeID": 11,
            "LevelID": 2,
            "Quantity": 1
        }
    ],
    "NumberOfPoints": 1,
    "StatusTypeID": 50,
    "DateLastStatusUpdate": "2011-04-19T00:00:00Z",
    "DateCreated": "2011-09-13T12:41:00Z",
    "SubmissionStatusTypeID": 200
}