{
    "IsRecentlyVerified": false,
    "ID": 8381,
    "UUID": "7F20CC67-8CC7-4F7F-98EE-1600A41CA885",
    "DataProviderID": 15,
    "DataProvidersReference": "4499",
    "OperatorID": 26,
    "AddressInfo": {
        "ID": 8278,
        "Title": "4960 E Market Place Dr",
        "AddressLine1": "4960 E Market Place Dr",
        "Town": "Flagstaff",
        "StateOrProvince": "AZ",
        "Postcode": "86004",
        "CountryID": 2,
        "Latitude": 35.22481,
        "Longitude": -111.57884,
        "ContactTelephone1": " (928) 774-9163 ",
        "RelatedURL": "http://carstations.com/4499",
        "DistanceUnit": 0
    },
    "Connections": [
        {
            "ID": 5809,
            "ConnectionTypeID": 1,
            "Reference": "J1772",
            "LevelID": 2
        }
    ],
    "StatusTypeID": 0,
    "DateLastStatusUpdate": "2017-11-04T14:04:00Z",
    "DataQualityLevel": 1,
    "DateCreated": "2011-11-11T12:06:00Z",
    "SubmissionStatusTypeID": 100
}