{
    "IsRecentlyVerified": false,
    "ID": 28617,
    "UUID": "73D70199-F6A8-4210-8284-DE4545CB7EE7",
    "DataProviderID": 2,
    "DataProvidersReference": "62239",
    "OperatorID": 5,
    "UsageTypeID": 1,
    "AddressInfo": {
        "ID": 28963,
        "Title": "HAMMOND PORT",
        "AddressLine1": "911 Casino Center Dr",
        "Town": "Hammond",
        "StateOrProvince": "IN",
        "Postcode": "46320",
        "CountryID": 2,
        "Latitude": 41.6967329,
        "Longitude": -87.511353,
        "ContactTelephone1": "888-758-4389",
        "AccessComments": "24 hours daily",
        "RelatedURL": "http://www.chargepoint.com/",
        "DistanceUnit": 0
    },
    "Connections": [
        {
            "ID": 31440,
            "ConnectionTypeID": 1,
            "LevelID": 2,
            "Amps": 16,
            "Voltage": 230,
            "PowerKW": 3.7,
            "CurrentTypeID": 10,
            "Quantity": 2
        }
    ],
    "DateLastStatusUpdate": "2020-06-26T03:04:00Z",
    "DataQualityLevel": 3,
    "DateCreated": "2014-11-28T03:38:00Z",
    "SubmissionStatusTypeID": 100
}