{
    "IsRecentlyVerified": false,
    "ID": 140681,
    "UUID": "5F1500A0-B445-4453-B0EF-5FB4F6090A9D",
    "DataProviderID": 2,
    "DataProvidersReference": "148613",
    "OperatorID": 39,
    "UsageTypeID": 1,
    "AddressInfo": {
        "ID": 141033,
        "Title": "Kaiser Permenente - Skyport MOB: EV Services |P6835",
        "AddressLine1": "1721 Skyport Drive",
        "Town": "San Jose",
        "StateOrProvince": "CA",
        "Postcode": "95110",
        "CountryID": 2,
        "Latitude": 37.366273,
        "Longitude": -121.913478,
        "ContactTelephone1": "800-663-5633",
        "AccessComments": "MO: Not Specified; TU: Not Specified; WE: Not Specified; TH: Not Specified; FR: Not Specified; SA: Not Specified; SU: Not Specified",
        "RelatedURL": "http://www.semacharge.com/",
        "DistanceUnit": 0
    },
    "Connections": [
        {
            "ID": 196383,
            "ConnectionTypeID": 1,
            "LevelID": 2,
            "Amps": 16,
            "Voltage": 230,
            "PowerKW": 3.7,
            "CurrentTypeID": 10,
            "Quantity": 6
        }
    ],
    "StatusTypeID": 50,
    "DateLastStatusUpdate": "2020-06-26T02:59:00Z",
    "DataQualityLevel": 3,
    "DateCreated": "2019-12-24T09:13:00Z",
    "SubmissionStatusTypeID": 100
}