{
    "IsRecentlyVerified": false,
    "ID": 120383,
    "UUID": "A1D2F386-DDA0-46A9-990F-E5E2A34EEC32",
    "DataProviderID": 2,
    "DataProvidersReference": "75472",
    "UsageTypeID": 2,
    "AddressInfo": {
        "ID": 120729,
        "Title": "Penske Ford Kia",
        "AddressLine1": "560 Auto Park Dr",
        "Town": "Chula Vista",
        "StateOrProvince": "CA",
        "Postcode": "91911",
        "CountryID": 2,
        "Latitude": 32.593786,
        "Longitude": -117.030544,
        "ContactTelephone1": "619-656-2500",
        "AccessComments": "Service center use only",
        "RelatedURL": "",
        "DistanceUnit": 0
    },
    "Connections": [
        {
            "ID": 169726,
            "ConnectionTypeID": 2,
            "LevelID": 3,
            "Amps": 100,
            "Voltage": 400,
            "PowerKW": 40,
            "CurrentTypeID": 30,
            "Quantity": 1
        }
    ],
    "DateLastStatusUpdate": "2020-06-26T02:54:00Z",
    "DataQualityLevel": 3,
    "DateCreated": "2019-04-01T04:59:00Z",
    "SubmissionStatusTypeID": 100
}