{
    "IsRecentlyVerified": false,
    "ID": 107513,
    "UUID": "E54C4BE3-AF10-4FE6-AB7C-23FC2D9AF3E5",
    "DataProviderID": 1,
    "OperatorID": 3319,
    "UsageTypeID": 1,
    "UsageCost": "bruttó 80 Ft/kWh",
    "AddressInfo": {
        "ID": 107859,
        "Title": "Veszprém, Völgyhíd alatti parkoló",
        "AddressLine1": "Kittenberger Kálmán utca 11.",
        "Town": "Veszprém",
        "StateOrProvince": "Veszprém megye",
        "Postcode": "8200",
        "CountryID": 104,
        "Latitude": 47.096807,
        "Longitude": 17.895452,
        "ContactTelephone1": "+36 80 21-00-12",
        "ContactEmail": "kommunikacio@e-mobi.hu",
        "RelatedURL": "https://e-mobi.hu",
        "DistanceUnit": 0
    },
    "Connections": [
        {
            "ID": 151689,
            "ConnectionTypeID": 25,
            "StatusTypeID": 50,
            "LevelID": 2,
            "Amps": 32,
            "Voltage": 400,
            "PowerKW": 22,
            "CurrentTypeID": 20,
            "Quantity": 2
        }
    ],
    "NumberOfPoints": 2,
    "GeneralComments": "",
    "StatusTypeID": 50,
    "DateLastStatusUpdate": "2020-05-09T09:03:00Z",
    "DataQualityLevel": 1,
    "DateCreated": "2018-07-31T13:54:00Z",
    "SubmissionStatusTypeID": 200
}