{
    "IsRecentlyVerified": false,
    "ID": 4827,
    "UUID": "12C80371-7FEF-426A-8505-376D1937F342",
    "DataProviderID": 2,
    "DataProvidersReference": "39870",
    "UsageTypeID": 7,
    "AddressInfo": {
        "ID": 4770,
        "Title": "Antioch Nissan",
        "AddressLine1": "1831 Auto Center Dr",
        "Town": "Antioch",
        "StateOrProvince": "CA",
        "Postcode": "94509",
        "CountryID": 2,
        "Latitude": 38.007799,
        "Longitude": -121.832042,
        "ContactTelephone1": "925-755-2600",
        "AccessComments": "Dealership business hours",
        "RelatedURL": "",
        "DistanceUnit": 0
    },
    "Connections": [
        {
            "ID": 15881,
            "ConnectionTypeID": 1,
            "LevelID": 2,
            "Amps": 16,
            "Voltage": 230,
            "PowerKW": 3,
            "CurrentTypeID": 10,
            "Quantity": 1
        },
        {
            "ID": 20854,
            "ConnectionTypeID": 1,
            "LevelID": 2,
            "Quantity": 1
        }
    ],
    "DateLastConfirmed": "2011-05-31T00:00:00Z",
    "StatusTypeID": 0,
    "DateLastStatusUpdate": "2019-04-06T04:02:00Z",
    "DataQualityLevel": 1,
    "DateCreated": "2011-07-04T18:02:00Z",
    "SubmissionStatusTypeID": 100
}