{
    "IsRecentlyVerified": false,
    "ID": 33781,
    "UUID": "8A5ADA96-027A-4F5B-890D-67EB9AE1A9A0",
    "DataProviderID": 26,
    "DataProvidersReference": "30047",
    "OperatorsReference": "ICU Twin",
    "UsageCost": "0.00 jaarabonnement",
    "AddressInfo": {
        "ID": 34127,
        "Title": "Parallelweg",
        "AddressLine1": "Parallelweg",
        "Town": "Zaltbommel",
        "Postcode": "5314 LJ",
        "CountryID": 159,
        "Latitude": 51.775604154191,
        "Longitude": 5.2574568986893,
        "RelatedURL": "http://www.delucht.nl/",
        "DistanceUnit": 0
    },
    "Connections": [
        {
            "ID": 37292,
            "ConnectionTypeID": 25,
            "LevelID": 2,
            "PowerKW": 22,
            "CurrentTypeID": 10
        }
    ],
    "NumberOfPoints": 2,
    "StatusTypeID": 50,
    "DateLastStatusUpdate": "2016-06-04T02:40:00Z",
    "DataQualityLevel": 3,
    "DateCreated": "2015-01-09T06:04:00Z",
    "SubmissionStatusTypeID": 100
}