{
    "IsRecentlyVerified": false,
    "ID": 174012,
    "UUID": "2634EDEF-9E2E-4325-8074-B443240C9B18",
    "DataProviderID": 1,
    "OperatorID": 3299,
    "UsageTypeID": 4,
    "AddressInfo": {
        "ID": 174371,
        "Title": "Ionity Aires de repos de Poitiers Ouest",
        "AddressLine1": "Aire de Poitiers Jaunay-Clan",
        "Town": "Jaunay-Marigny",
        "StateOrProvince": "Vienne",
        "Postcode": "86130",
        "CountryID": 80,
        "Latitude": 46.701692324158955,
        "Longitude": 0.3668269751617572,
        "DistanceUnit": 0
    },
    "Connections": [
        {
            "ID": 268284,
            "ConnectionTypeID": 33,
            "StatusTypeID": 50,
            "LevelID": 3,
            "PowerKW": 350,
            "CurrentTypeID": 30,
            "Quantity": 4
        },
        {
            "ID": 268285,
            "ConnectionTypeID": 2,
            "StatusTypeID": 50,
            "LevelID": 3,
            "PowerKW": 50,
            "CurrentTypeID": 20,
            "Quantity": 1
        },
        {
            "ID": 268286,
            "ConnectionTypeID": 33,
            "StatusTypeID": 50,
            "LevelID": 3,
            "PowerKW": 50,
            "CurrentTypeID": 30,
            "Quantity": 1
        },
        {
            "ID": 268287,
            "ConnectionTypeID": 1036,
            "StatusTypeID": 50,
            "LevelID": 3,
            "PowerKW": 43,
            "CurrentTypeID": 20,
            "Quantity": 1
        }
    ],
    "NumberOfPoints": 1,
    "StatusTypeID": 50,
    "DateLastStatusUpdate": "2021-08-19T21:45:00Z",
    "DataQualityLevel": 1,
    "DateCreated": "2021-03-10T13:31:00Z",
    "SubmissionStatusTypeID": 200
}