{
    "IsRecentlyVerified": false,
    "ID": 120137,
    "UUID": "A933B9AC-C8D8-4790-8A53-B43BA40201F1",
    "DataProviderID": 2,
    "DataProvidersReference": "45127",
    "OperatorID": 5,
    "UsageTypeID": 1,
    "AddressInfo": {
        "ID": 120483,
        "Title": "PIE AE",
        "AddressLine1": "3401 Webberville Rd",
        "Town": "Austin",
        "StateOrProvince": "TX",
        "Postcode": "78702",
        "CountryID": 2,
        "Latitude": 30.26824,
        "Longitude": -97.70695,
        "ContactTelephone1": "888-758-4389",
        "AccessComments": "24 hours daily",
        "RelatedURL": "http://www.chargepoint.com/",
        "DistanceUnit": 0
    },
    "Connections": [
        {
            "ID": 169460,
            "ConnectionTypeID": 1,
            "LevelID": 2,
            "Amps": 16,
            "Voltage": 230,
            "PowerKW": 3,
            "CurrentTypeID": 10,
            "Quantity": 4
        }
    ],
    "DateLastStatusUpdate": "2019-12-24T09:08:00Z",
    "DataQualityLevel": 3,
    "DateCreated": "2019-04-01T04:59:00Z",
    "SubmissionStatusTypeID": 100
}