{
    "IsRecentlyVerified": false,
    "ID": 136918,
    "UUID": "8BC2302D-6B57-48EB-A5FB-2EDD60774C75",
    "DataProviderID": 18,
    "DataProvidersReference": "a0164cbfe882aa11e433a6b503cb62db",
    "OperatorID": 20,
    "UsageTypeID": 4,
    "AddressInfo": {
        "ID": 137264,
        "Title": "Hexham",
        "AddressLine1": "Beaufront Park",
        "Town": "Hexham",
        "Postcode": "NE46 4TY",
        "CountryID": 1,
        "Latitude": 54.980117,
        "Longitude": -2.082049,
        "AccessComments": "Border House",
        "RelatedURL": "http://www.chargeyourcar.org.uk",
        "DistanceUnit": 0
    },
    "Connections": [
        {
            "ID": 191614,
            "ConnectionTypeID": 3,
            "Reference": "0",
            "StatusTypeID": 50,
            "LevelID": 2,
            "Amps": 13,
            "Voltage": 230,
            "PowerKW": 3,
            "CurrentTypeID": 10
        }
    ],
    "StatusTypeID": 0,
    "DateLastStatusUpdate": "2019-12-24T05:23:00Z",
    "MetadataValues": [
        {
            "ID": 6770,
            "MetadataFieldID": 4,
            "ItemValue": "Contains public sector information licensed under the Open Government Licence v2.0. http://www.nationalarchives.gov.uk/doc/open-government-licence/version/2/"
        }
    ],
    "DataQualityLevel": 3,
    "DateCreated": "2019-12-24T05:23:00Z",
    "SubmissionStatusTypeID": 100
}