{
    "IsRecentlyVerified": false,
    "ID": 67466,
    "UUID": "7CB96027-D552-490D-9653-DEAE159E08E1",
    "DataProviderID": 1,
    "OperatorID": 23,
    "OperatorsReference": "13091",
    "UsageTypeID": 1,
    "UsageCost": "Free",
    "AddressInfo": {
        "ID": 67812,
        "Title": "Hyatt Regency - Tesla",
        "AddressLine1": "9300 Bryn Mawr Ave",
        "Town": "Rosemont",
        "StateOrProvince": "IL",
        "Postcode": "60018",
        "CountryID": 2,
        "Latitude": 41.9815386,
        "Longitude": -87.8594107,
        "ContactTelephone1": "847-696-1234  877-798-3752",
        "AccessComments": "24 hours daily; for Tesla use only; for guest use only; see valet for access",
        "RelatedURL": "http://www.teslamotors.com/supercharger",
        "DistanceUnit": 0
    },
    "Connections": [
        {
            "ID": 92970,
            "ConnectionTypeID": 30,
            "StatusTypeID": 50,
            "LevelID": 2,
            "Amps": 16,
            "Voltage": 230,
            "PowerKW": 8,
            "CurrentTypeID": 10,
            "Quantity": 2
        }
    ],
    "NumberOfPoints": 2,
    "StatusTypeID": 50,
    "DateLastStatusUpdate": "2017-01-31T18:05:00Z",
    "DataQualityLevel": 3,
    "DateCreated": "2016-05-29T02:05:00Z",
    "SubmissionStatusTypeID": 100
}