{
    "IsRecentlyVerified": false,
    "ID": 27344,
    "UUID": "05847DE6-ECF4-4F37-9FDA-923743E6D5AC",
    "DataProviderID": 2,
    "DataProvidersReference": "51711",
    "OperatorID": 5,
    "UsageTypeID": 1,
    "AddressInfo": {
        "ID": 27690,
        "Title": "MBUAPCD",
        "AddressLine1": "24580 Silver Cloud Ct",
        "Town": "Monterey",
        "StateOrProvince": "CA",
        "Postcode": "93940",
        "CountryID": 2,
        "Latitude": 36.5730299,
        "Longitude": -121.804901,
        "ContactTelephone1": "888-758-4389",
        "AccessComments": "24 hours daily",
        "RelatedURL": "http://www.chargepoint.com/",
        "DistanceUnit": 0
    },
    "Connections": [
        {
            "ID": 29955,
            "ConnectionTypeID": 1,
            "LevelID": 2,
            "Amps": 16,
            "Voltage": 230,
            "PowerKW": 3,
            "CurrentTypeID": 10,
            "Quantity": 2
        },
        {
            "ID": 29956,
            "ConnectionTypeID": 1,
            "LevelID": 2,
            "Amps": 16,
            "Voltage": 230,
            "PowerKW": 3,
            "CurrentTypeID": 10,
            "Quantity": 1
        }
    ],
    "DateLastStatusUpdate": "2019-04-06T04:02:00Z",
    "DataQualityLevel": 3,
    "DateCreated": "2014-11-28T03:37:00Z",
    "SubmissionStatusTypeID": 100
}