{
    "IsRecentlyVerified": false,
    "ID": 187257,
    "UUID": "550B9923-E020-4C9F-9CE9-1E08D2265D04",
    "DataProviderID": 29,
    "DataProvidersReference": "7454",
    "AddressInfo": {
        "ID": 187616,
        "Title": "Hagener Allee 22",
        "AddressLine1": "Hagener Allee 22",
        "Town": "Ahrensburg",
        "Postcode": "22926",
        "CountryID": 87,
        "Latitude": 53.671347,
        "Longitude": 10.238664,
        "DistanceUnit": 0
    },
    "Connections": [
        {
            "ID": 302093,
            "ConnectionTypeID": 25,
            "StatusTypeID": 50,
            "LevelID": 2,
            "PowerKW": 22,
            "CurrentTypeID": 20
        },
        {
            "ID": 302094,
            "ConnectionTypeID": 25,
            "StatusTypeID": 50,
            "LevelID": 2,
            "PowerKW": 22,
            "CurrentTypeID": 20
        }
    ],
    "StatusTypeID": 50,
    "DateLastStatusUpdate": "2021-07-12T02:52:00Z",
    "MetadataValues": [
        {
            "ID": 19497,
            "MetadataFieldID": 4,
            "ItemValue": "Data from the German chargepoint registry provided by Bundesnetzagentur.de under the CC-BY 4.0 license"
        }
    ],
    "DataQualityLevel": 3,
    "DateCreated": "2021-07-12T02:52:00Z",
    "SubmissionStatusTypeID": 100
}