{
    "IsRecentlyVerified": false,
    "ID": 140281,
    "UUID": "C39F48C2-4BAC-4C30-AAE6-81E44CDC012C",
    "DataProviderID": 2,
    "DataProvidersReference": "96609",
    "OperatorID": 9,
    "UsageTypeID": 1,
    "AddressInfo": {
        "ID": 140633,
        "Title": "Bennett's Bar-B-Que",
        "AddressLine1": "714 River Road",
        "Town": "Gatlinburg",
        "StateOrProvince": "TN",
        "Postcode": "37738",
        "CountryID": 2,
        "Latitude": 35.7089,
        "Longitude": -83.522497,
        "ContactTelephone1": "888-998-2546",
        "AccessComments": "MON: 24 hours | TUE: 24 hours | WED: 24 hours | THU: 24 hours | FRI: 24 hours | SAT: 24 hours | SUN: 24 hours",
        "RelatedURL": "http://www.blinkcharging.com/",
        "DistanceUnit": 0
    },
    "Connections": [
        {
            "ID": 195880,
            "ConnectionTypeID": 1,
            "LevelID": 2,
            "Amps": 16,
            "Voltage": 230,
            "PowerKW": 3.7,
            "CurrentTypeID": 10,
            "Quantity": 2
        }
    ],
    "StatusTypeID": 50,
    "DateLastStatusUpdate": "2020-06-26T02:58:00Z",
    "DataQualityLevel": 3,
    "DateCreated": "2019-12-24T09:12:00Z",
    "SubmissionStatusTypeID": 100
}