{
    "IsRecentlyVerified": false,
    "ID": 167380,
    "UUID": "6ED388EE-0FF1-441E-BAB5-EC31D1EAC46F",
    "DataProviderID": 18,
    "DataProvidersReference": "45369390df76f18317cba08340e5d684",
    "OperatorID": 3345,
    "UsageTypeID": 5,
    "AddressInfo": {
        "ID": 167739,
        "Title": "10 Malfort Road",
        "AddressLine1": "10 Malfort Road",
        "Town": "London",
        "Postcode": "SE58DQ",
        "CountryID": 1,
        "Latitude": 51.465872,
        "Longitude": -0.08024,
        "AccessComments": "",
        "RelatedURL": "https://char.gy",
        "DistanceUnit": 0
    },
    "Connections": [
        {
            "ID": 253498,
            "ConnectionTypeID": 25,
            "Reference": "410",
            "StatusTypeID": 50,
            "LevelID": 2,
            "Amps": 16,
            "Voltage": 230,
            "PowerKW": 3.7,
            "CurrentTypeID": 10
        }
    ],
    "StatusTypeID": 0,
    "DateLastStatusUpdate": "2020-09-08T02:47:00Z",
    "MetadataValues": [
        {
            "ID": 7921,
            "MetadataFieldID": 4,
            "ItemValue": "Contains public sector information licensed under the Open Government Licence v2.0. http://www.nationalarchives.gov.uk/doc/open-government-licence/version/2/"
        }
    ],
    "DataQualityLevel": 3,
    "DateCreated": "2020-09-08T02:47:00Z",
    "SubmissionStatusTypeID": 100
}