{
    "UserComments": [
        {
            "ID": 20915,
            "ChargePointID": 124896,
            "CommentTypeID": 10,
            "UserName": "TimG",
            "Rating": 5,
            "DateCreated": "2019-04-22T04:17:31.38Z",
            "User": {
                "ID": 19550,
                "Username": "TimG"
            },
            "CheckinStatusTypeID": 10
        }
    ],
    "MediaItems": [
        {
            "ID": 18122,
            "ChargePointID": 124896,
            "ItemURL": "https://s3-ap-southeast-2.amazonaws.com/openchargemap/images/US/OCM124896/OCM-124896.orig.2019042204185094.jpeg",
            "ItemThumbnailURL": "https://s3-ap-southeast-2.amazonaws.com/openchargemap/images/US/OCM124896/OCM-124896.thmb.2019042204185094.jpeg",
            "Comment": "Now working for both CCS and ChaDAmo",
            "IsEnabled": true,
            "IsVideo": false,
            "IsFeaturedItem": false,
            "IsExternalResource": false,
            "User": {
                "ID": 19550,
                "Username": "TimG"
            },
            "DateCreated": "2019-04-22T04:19:00Z"
        }
    ],
    "IsRecentlyVerified": false,
    "ID": 124896,
    "UUID": "EA93B1CD-9ED1-483D-9C2D-02B4C96A3516",
    "DataProviderID": 1,
    "OperatorID": 3318,
    "UsageTypeID": 5,
    "UsageCost": "$1 connection fee, $0.30 per minute",
    "AddressInfo": {
        "ID": 125242,
        "Title": "Sams Club 6661 - Portage, MI",
        "AddressLine1": "7021 S Westnedge Ave",
        "Town": "Portage",
        "StateOrProvince": "MI",
        "Postcode": "49002",
        "CountryID": 2,
        "Latitude": 42.21405,
        "Longitude": -85.588068,
        "ContactTelephone1": "833-632-2778",
        "AccessComments": "24 hours daily",
        "RelatedURL": "https://www.electrifyamerica.com/",
        "DistanceUnit": 0
    },
    "Connections": [
        {
            "ID": 175061,
            "ConnectionTypeID": 2,
            "StatusTypeID": 50,
            "LevelID": 3,
            "Amps": 125,
            "Voltage": 400,
            "PowerKW": 50,
            "CurrentTypeID": 30,
            "Quantity": 1
        },
        {
            "ID": 175062,
            "ConnectionTypeID": 32,
            "StatusTypeID": 50,
            "LevelID": 3,
            "Amps": 250,
            "Voltage": 400,
            "PowerKW": 350,
            "CurrentTypeID": 30,
            "Quantity": 6
        }
    ],
    "NumberOfPoints": 6,
    "StatusTypeID": 50,
    "DateLastStatusUpdate": "2021-09-22T23:34:00Z",
    "DataQualityLevel": 3,
    "DateCreated": "2019-04-06T05:04:00Z",
    "SubmissionStatusTypeID": 100
}