{
    "UserComments": [
        {
            "ID": 16076,
            "ChargePointID": 19396,
            "CommentTypeID": 10,
            "UserName": "Simon Hewison",
            "Comment": "Now no longer part of Source London. Source London cards don't work with them. Polar Network cards still do. Source London signage removed, expect ICEing.",
            "DateCreated": "2017-03-19T20:06:36.653Z",
            "User": {
                "ID": 4575,
                "Username": "Simon Hewison"
            },
            "CheckinStatusTypeID": 0
        },
        {
            "ID": 4538,
            "ChargePointID": 19396,
            "CommentTypeID": 10,
            "UserName": "cgiAlexis",
            "Comment": "Prefect charging solution for the normal usage of the park! Segregated area for EV only.",
            "Rating": 5,
            "DateCreated": "2015-05-24T16:25:11.76Z",
            "User": {
                "ID": 4558,
                "Username": "cgiAlexis"
            },
            "CheckinStatusTypeID": 10
        }
    ],
    "MediaItems": [
        {
            "ID": 1476,
            "ChargePointID": 19396,
            "ItemURL": "https://s3-ap-southeast-2.amazonaws.com/openchargemap/images/GB/OCM19396/OCM-19396.orig.2015052416324404.jpg",
            "ItemThumbnailURL": "https://s3-ap-southeast-2.amazonaws.com/openchargemap/images/GB/OCM19396/OCM-19396.thmb.2015052416324404.jpg",
            "Comment": "There's plenty of space in the bay, enough to fit a couple of ICE cars in along with four EV.",
            "IsEnabled": true,
            "IsVideo": false,
            "IsFeaturedItem": false,
            "IsExternalResource": false,
            "User": {
                "ID": 4558,
                "Username": "cgiAlexis"
            },
            "DateCreated": "2015-05-24T16:33:00Z"
        },
        {
            "ID": 1475,
            "ChargePointID": 19396,
            "ItemURL": "https://s3-ap-southeast-2.amazonaws.com/openchargemap/images/GB/OCM19396/OCM-19396.orig.2015052416282432.jpg",
            "ItemThumbnailURL": "https://s3-ap-southeast-2.amazonaws.com/openchargemap/images/GB/OCM19396/OCM-19396.thmb.2015052416282432.jpg",
            "Comment": "Located at the front of the car park just before you arrive at the park gates.",
            "IsEnabled": true,
            "IsVideo": false,
            "IsFeaturedItem": false,
            "IsExternalResource": false,
            "User": {
                "ID": 4558,
                "Username": "cgiAlexis"
            },
            "DateCreated": "2015-05-24T16:29:00Z"
        }
    ],
    "IsRecentlyVerified": false,
    "ID": 19396,
    "UUID": "9DD3972C-D4F0-42E0-9462-5C15FD20A92A",
    "DataProviderID": 1,
    "OperatorID": 32,
    "OperatorsReference": "1841,1863",
    "UsageTypeID": 4,
    "UsageCost": "£0.108/kWh; for Polar Plus subscription members only. Parking fees apply",
    "AddressInfo": {
        "ID": 19741,
        "Title": "Thorpe Park",
        "AddressLine1": "Staines Road",
        "AddressLine2": "Chertsey",
        "Town": "Chertsey",
        "StateOrProvince": "London",
        "Postcode": "KT16 8PN",
        "CountryID": 1,
        "Latitude": 51.4051907121277,
        "Longitude": -0.510202873265371,
        "ContactTelephone1": "0845 850 0653",
        "AccessComments": "£5 fee to use the car park.",
        "RelatedURL": "http://www.thorpepark.com/plan-your-visit/how-to-get-here.aspx",
        "DistanceUnit": 0
    },
    "Connections": [
        {
            "ID": 19699,
            "ConnectionTypeID": 25,
            "StatusTypeID": 50,
            "LevelID": 2,
            "Amps": 16,
            "Voltage": 230,
            "PowerKW": 4,
            "CurrentTypeID": 10,
            "Quantity": 4
        },
        {
            "ID": 75101,
            "ConnectionTypeID": 25,
            "StatusTypeID": 50,
            "LevelID": 2,
            "Amps": 32,
            "Voltage": 230,
            "PowerKW": 7,
            "CurrentTypeID": 10,
            "Quantity": 4
        }
    ],
    "NumberOfPoints": 4,
    "StatusTypeID": 50,
    "DateLastStatusUpdate": "2019-03-08T06:42:00Z",
    "MetadataValues": [
        {
            "ID": 43,
            "MetadataFieldID": 4,
            "ItemValue": "Data © OpenStreetMap contributors, ODbL 1.0. http://www.openstreetmap.org/copyright"
        }
    ],
    "DataQualityLevel": 1,
    "DateCreated": "2013-09-25T14:09:00Z",
    "SubmissionStatusTypeID": 200
}