{
    "IsRecentlyVerified": false,
    "ID": 33022,
    "UUID": "440EA660-ABD0-4458-97D5-13B4F25A410F",
    "DataProviderID": 26,
    "DataProvidersReference": "46171",
    "OperatorID": 73,
    "OperatorsReference": "EV-Box EVB-P1351171",
    "UsageCost": "0.00 jaarabonnement",
    "AddressInfo": {
        "ID": 33368,
        "Title": "Buddy Boldenlaan 39",
        "AddressLine1": "Buddy Boldenlaan 39",
        "Town": "Eindhoven",
        "Postcode": "5629 RD",
        "CountryID": 159,
        "Latitude": 51.49269,
        "Longitude": 5.46881,
        "RelatedURL": "http://www.ev-box.nl",
        "DistanceUnit": 0
    },
    "Connections": [
        {
            "ID": 36533,
            "ConnectionTypeID": 25,
            "LevelID": 2,
            "PowerKW": 5,
            "CurrentTypeID": 10
        }
    ],
    "NumberOfPoints": 1,
    "StatusTypeID": 50,
    "DateLastStatusUpdate": "2016-06-04T02:39:00Z",
    "DataQualityLevel": 3,
    "DateCreated": "2015-01-09T06:03:00Z",
    "SubmissionStatusTypeID": 100
}