{
    "IsRecentlyVerified": false,
    "ID": 145380,
    "UUID": "C66D3421-1717-41CB-9F70-0F229FE983AE",
    "DataProviderID": 2,
    "DataProvidersReference": "116685",
    "OperatorID": 23,
    "UsageTypeID": 1,
    "AddressInfo": {
        "ID": 145732,
        "Title": "Station Blu Spa - Tesla Destination",
        "AddressLine1": "593 QC-138",
        "Town": "Saint-Tite-des-Caps",
        "StateOrProvince": "QC",
        "Postcode": "G0A 4J0",
        "CountryID": 44,
        "Latitude": 47.60227,
        "Longitude": -70.34836,
        "ContactTelephone1": "855-901-0707  877-798-3752",
        "AccessComments": "24 hours daily",
        "RelatedURL": "https://www.tesla.com/destination-charging",
        "DistanceUnit": 0
    },
    "Connections": [
        {
            "ID": 202044,
            "ConnectionTypeID": 30,
            "LevelID": 2,
            "Amps": 16,
            "Voltage": 230,
            "PowerKW": 3.7,
            "CurrentTypeID": 10,
            "Quantity": 2
        }
    ],
    "StatusTypeID": 50,
    "DateLastStatusUpdate": "2020-06-26T03:11:00Z",
    "DataQualityLevel": 3,
    "DateCreated": "2019-12-24T09:24:00Z",
    "SubmissionStatusTypeID": 100
}