{
    "IsRecentlyVerified": false,
    "ID": 70319,
    "UUID": "D3014018-7F61-496F-8F15-6A6D97CF2A00",
    "DataProviderID": 2,
    "DataProvidersReference": "76694",
    "UsageTypeID": 1,
    "AddressInfo": {
        "ID": 70665,
        "Title": "GMR Marketing",
        "AddressLine1": "5000 S Towne Dr",
        "Town": "New Berlin",
        "StateOrProvince": "WI",
        "Postcode": "53151",
        "CountryID": 2,
        "Latitude": 42.954261,
        "Longitude": -88.113009,
        "ContactTelephone1": "262-786-5600",
        "AccessComments": "24 hours daily",
        "RelatedURL": "",
        "DistanceUnit": 0
    },
    "Connections": [
        {
            "ID": 100362,
            "ConnectionTypeID": 2,
            "LevelID": 3,
            "Amps": 100,
            "Voltage": 400,
            "PowerKW": 40,
            "CurrentTypeID": 30,
            "Quantity": 1
        }
    ],
    "DateLastStatusUpdate": "2020-06-26T03:06:00Z",
    "DataQualityLevel": 3,
    "DateCreated": "2016-07-14T00:53:00Z",
    "SubmissionStatusTypeID": 100
}