{
    "IsRecentlyVerified": false,
    "ID": 32764,
    "UUID": "BAF0D3AD-B479-44BE-9786-9383CE41E42C",
    "DataProviderID": 26,
    "DataProvidersReference": "48191",
    "OperatorID": 178,
    "OperatorsReference": "EVnetNL EV0074",
    "UsageCost": "0.00 jaarabonnement",
    "AddressInfo": {
        "ID": 33110,
        "Title": "Kloosterstraat 31",
        "AddressLine1": "Kloosterstraat 31",
        "Town": "Horst aan de Maas",
        "Postcode": "5971 BB",
        "CountryID": 159,
        "Latitude": 51.420784,
        "Longitude": 6.144176,
        "ContactTelephone1": "0800-3522365",
        "RelatedURL": "http://www.evnet.nl",
        "DistanceUnit": 0
    },
    "Connections": [
        {
            "ID": 36275,
            "ConnectionTypeID": 25,
            "LevelID": 2,
            "PowerKW": 11,
            "CurrentTypeID": 10
        }
    ],
    "NumberOfPoints": 1,
    "StatusTypeID": 50,
    "DateLastStatusUpdate": "2016-06-04T02:38:00Z",
    "DataQualityLevel": 3,
    "DateCreated": "2015-01-09T06:03:00Z",
    "SubmissionStatusTypeID": 100
}