{
    "IsRecentlyVerified": false,
    "ID": 182856,
    "UUID": "6038E7BD-FDBB-41FF-B44B-A40F1DCC0597",
    "DataProviderID": 29,
    "DataProvidersReference": "16484",
    "OperatorID": 105,
    "AddressInfo": {
        "ID": 183215,
        "Title": "Lionweg 6",
        "AddressLine1": "Lionweg 6",
        "Town": "Essen",
        "Postcode": "45136",
        "CountryID": 87,
        "Latitude": 51.433,
        "Longitude": 7.05101,
        "DistanceUnit": 0
    },
    "Connections": [
        {
            "ID": 289112,
            "ConnectionTypeID": 25,
            "StatusTypeID": 50,
            "LevelID": 2,
            "PowerKW": 22,
            "CurrentTypeID": 20
        },
        {
            "ID": 289113,
            "ConnectionTypeID": 25,
            "StatusTypeID": 50,
            "LevelID": 2,
            "PowerKW": 22,
            "CurrentTypeID": 20
        }
    ],
    "StatusTypeID": 50,
    "DateLastStatusUpdate": "2021-07-09T03:23:00Z",
    "MetadataValues": [
        {
            "ID": 15149,
            "MetadataFieldID": 4,
            "ItemValue": "Data from the German chargepoint registry provided by Bundesnetzagentur.de under the CC-BY 4.0 license"
        }
    ],
    "DataQualityLevel": 3,
    "DateCreated": "2021-07-08T10:03:00Z",
    "SubmissionStatusTypeID": 100
}