{
    "IsRecentlyVerified": false,
    "ID": 19400,
    "UUID": "8D013400-0ED2-455F-AE8A-D4FD4B82C5DF",
    "DataProviderID": 1,
    "OperatorID": 25,
    "OperatorsReference": "hounslow-treatyshoppingcentrecarparklevel1b",
    "UsageTypeID": 4,
    "UsageCost": "Free. Parking fees apply",
    "AddressInfo": {
        "ID": 19745,
        "Title": "Treaty Shopping Centre Car Park Level 1b",
        "AddressLine1": "High Street",
        "AddressLine2": "Hounslow",
        "Town": "London",
        "Postcode": "TW3 1ES",
        "CountryID": 1,
        "Latitude": 51.4686132,
        "Longitude": -0.3613471,
        "ContactTelephone1": "0845 850 0653",
        "AccessComments": "Charges apply - refer to the owner of the parking bay for details. Hours accessible: 09:30-18:00 Mon-Wed & Fri, 09:30-19:00 Thurs, 09:00-18:00 Sat, 11:00-17:00 Sun",
        "RelatedURL": "http://www.treatyshoppingcentre.co.uk/parking/",
        "DistanceUnit": 0
    },
    "Connections": [
        {
            "ID": 19703,
            "ConnectionTypeID": 3,
            "StatusTypeID": 50,
            "LevelID": 2,
            "Amps": 13,
            "Voltage": 230,
            "PowerKW": 3,
            "CurrentTypeID": 10,
            "Quantity": 2
        }
    ],
    "NumberOfPoints": 2,
    "StatusTypeID": 0,
    "DateLastStatusUpdate": "2016-11-16T11:11:00Z",
    "MetadataValues": [
        {
            "ID": 47,
            "MetadataFieldID": 4,
            "ItemValue": "Data © OpenStreetMap contributors, ODbL 1.0. http://www.openstreetmap.org/copyright"
        }
    ],
    "DataQualityLevel": 1,
    "DateCreated": "2013-09-25T14:29:00Z",
    "SubmissionStatusTypeID": 200
}