{
    "UserComments": [
        {
            "ID": 11558,
            "ChargePointID": 51334,
            "CommentTypeID": 10,
            "UserName": "Maciej Rozalski",
            "Comment": "Opel Ampera",
            "Rating": 5,
            "DateCreated": "2016-06-04T20:00:24.62Z",
            "User": {
                "ID": 9457,
                "Username": "Maciej Rozalski"
            },
            "CheckinStatusTypeID": 10
        },
        {
            "ID": 9945,
            "ChargePointID": 51334,
            "CommentTypeID": 10,
            "UserName": " EVszosio",
            "Comment": "",
            "DateCreated": "2016-03-17T23:25:23.457Z",
            "User": {
                "ID": 9109,
                "Username": " EVszosio"
            },
            "CheckinStatusTypeID": 10
        }
    ],
    "IsRecentlyVerified": false,
    "ID": 51334,
    "UUID": "9406F213-1291-4948-B780-D5522DFF9C40",
    "DataProviderID": 26,
    "DataProvidersReference": "26095",
    "OperatorID": 78,
    "OperatorsReference": "Essent EM-PL-00000001-01-00013",
    "UsageCost": "0.00 jaarabonnement",
    "AddressInfo": {
        "ID": 51680,
        "Title": "Rotmistrza Witolda Pileckiego",
        "AddressLine1": "Rotmistrza Witolda Pileckiego",
        "Town": "Warszawa",
        "Postcode": "02-775",
        "CountryID": 179,
        "Latitude": 52.142925,
        "Longitude": 21.038556,
        "RelatedURL": "http://www.essent.nl",
        "DistanceUnit": 0
    },
    "Connections": [
        {
            "ID": 63537,
            "ConnectionTypeID": 25,
            "LevelID": 2,
            "PowerKW": 11,
            "CurrentTypeID": 10
        },
        {
            "ID": 63538,
            "ConnectionTypeID": 25,
            "LevelID": 2,
            "PowerKW": 11,
            "CurrentTypeID": 10
        }
    ],
    "NumberOfPoints": 1,
    "StatusTypeID": 50,
    "DateLastStatusUpdate": "2016-06-04T20:00:00Z",
    "DataQualityLevel": 3,
    "DateCreated": "2015-07-24T06:28:00Z",
    "SubmissionStatusTypeID": 100
}