{
    "IsRecentlyVerified": false,
    "ID": 9806,
    "UUID": "D2BE4F17-6C87-4B2D-A4AD-51E92F8A4C62",
    "DataProviderID": 1,
    "OperatorID": 19,
    "UsageTypeID": 1,
    "AddressInfo": {
        "ID": 9703,
        "Title": "The Heights Hotel",
        "AddressLine1": "Yeates Corner",
        "Town": "Portland",
        "StateOrProvince": "Dorset",
        "Postcode": "DT5 2EN",
        "CountryID": 1,
        "Latitude": 50.555309,
        "Longitude": -2.441053,
        "ContactTelephone1": "01305 821361",
        "ContactEmail": "reception@heightshotel.com",
        "RelatedURL": "http://www.heightshotel.com",
        "DistanceUnit": 0
    },
    "Connections": [
        {
            "ID": 7647,
            "ConnectionTypeID": 3,
            "StatusTypeID": 50,
            "LevelID": 2,
            "Amps": 13,
            "Voltage": 230,
            "PowerKW": 3,
            "CurrentTypeID": 10,
            "Quantity": 1
        },
        {
            "ID": 7648,
            "ConnectionTypeID": 4,
            "StatusTypeID": 50,
            "LevelID": 2,
            "Amps": 32,
            "Voltage": 230,
            "PowerKW": 7,
            "CurrentTypeID": 20,
            "Quantity": 1
        }
    ],
    "NumberOfPoints": 2,
    "StatusTypeID": 50,
    "DateLastStatusUpdate": "2017-04-21T17:21:00Z",
    "DataQualityLevel": 1,
    "DateCreated": "2012-04-26T09:32:00Z",
    "SubmissionStatusTypeID": 200
}