{
    "IsRecentlyVerified": false,
    "ID": 96996,
    "UUID": "56A9F448-5310-4F9B-AEFD-94A605024406",
    "DataProviderID": 1,
    "DataProvidersReference": "4471",
    "AddressInfo": {
        "ID": 97342,
        "Title": "Vidhögehallen",
        "AddressLine1": "Skolgatan 12",
        "Town": "VEDDIGE",
        "StateOrProvince": "HALLAND",
        "Postcode": "43267",
        "CountryID": 216,
        "Latitude": 57.26449,
        "Longitude": 12.32493,
        "AccessComments": "Vid Vidhögehallen, längst till höger på parkeringen.",
        "DistanceUnit": 0
    },
    "Connections": [
        {
            "ID": 137415,
            "ConnectionTypeID": 0,
            "Reference": "1",
            "LevelID": 2,
            "Amps": 32,
            "Voltage": 400,
            "PowerKW": 22,
            "Comments": "Mode 3"
        },
        {
            "ID": 137416,
            "ConnectionTypeID": 0,
            "Reference": "2",
            "LevelID": 2,
            "Amps": 32,
            "Voltage": 400,
            "PowerKW": 22,
            "Comments": "Mode 3"
        }
    ],
    "NumberOfPoints": 2,
    "DateLastStatusUpdate": "2020-05-26T08:21:00Z",
    "DataQualityLevel": 2,
    "DateCreated": "2018-01-04T08:28:00Z",
    "SubmissionStatusTypeID": 100
}