{
    "IsRecentlyVerified": false,
    "ID": 168410,
    "UUID": "87F67F70-FC41-43A4-9E62-92E0010A02CB",
    "DataProviderID": 1,
    "OperatorID": 80,
    "UsageTypeID": 4,
    "AddressInfo": {
        "ID": 168769,
        "Title": "ROVIGO Porta Adige | ENELX",
        "AddressLine1": "Viale Porta Adige",
        "Town": "Rovigo",
        "StateOrProvince": "RO",
        "Postcode": "45100",
        "CountryID": 112,
        "Latitude": 45.08713369524838,
        "Longitude": 11.785021065266392,
        "ContactTelephone1": "800.069.850",
        "RelatedURL": "https://www.enelx.com/it/it/emobility",
        "DistanceUnit": 0
    },
    "Connections": [
        {
            "ID": 255771,
            "ConnectionTypeID": 25,
            "StatusTypeID": 50,
            "LevelID": 2,
            "Amps": 32,
            "Voltage": 400,
            "PowerKW": 22,
            "CurrentTypeID": 20,
            "Quantity": 2
        }
    ],
    "NumberOfPoints": 2,
    "StatusTypeID": 50,
    "DateLastStatusUpdate": "2020-09-25T07:39:00Z",
    "DataQualityLevel": 1,
    "DateCreated": "2020-09-25T07:39:00Z",
    "SubmissionStatusTypeID": 200
}