{
    "IsRecentlyVerified": false,
    "ID": 122699,
    "UUID": "DFF4E0D7-2EF0-4303-9D77-EA73650E9B68",
    "DataProviderID": 2,
    "DataProvidersReference": "72354",
    "OperatorID": 3372,
    "UsageTypeID": 1,
    "AddressInfo": {
        "ID": 123045,
        "Title": "Castilian Technical Center - AppFolio",
        "AddressLine1": "50 Castilian Dr",
        "Town": "Goleta",
        "StateOrProvince": "CA",
        "Postcode": "93117",
        "CountryID": 2,
        "Latitude": 34.434273,
        "Longitude": -119.863807,
        "ContactTelephone1": "805-964-7200  866-816-7584",
        "AccessComments": "24 hours daily",
        "RelatedURL": "http://evconnect.com/",
        "DistanceUnit": 0
    },
    "Connections": [
        {
            "ID": 172611,
            "ConnectionTypeID": 1,
            "LevelID": 2,
            "Amps": 16,
            "Voltage": 230,
            "PowerKW": 3.7,
            "CurrentTypeID": 10,
            "Quantity": 4
        }
    ],
    "DateLastStatusUpdate": "2020-06-26T02:57:00Z",
    "DataQualityLevel": 3,
    "DateCreated": "2019-04-06T05:03:00Z",
    "SubmissionStatusTypeID": 100
}