{
    "UserComments": [
        {
            "ID": 14181,
            "ChargePointID": 57615,
            "CommentTypeID": 10,
            "UserName": "PatrykS",
            "Comment": "2016-08-27 10:00 Successfully charged Opel Ampera - actually three of them :-)",
            "Rating": 4,
            "DateCreated": "2016-08-29T08:04:40.22Z",
            "User": {
                "ID": 6418,
                "Username": "PatrykS"
            },
            "CheckinStatusTypeID": 10
        },
        {
            "ID": 14073,
            "ChargePointID": 57615,
            "CommentTypeID": 10,
            "UserName": "PatrykS",
            "Comment": "2016-08-08 19:00 Successfully charged Opel Ampera using CEE 5 pin 32A socket and own wall charging station (made it portable).",
            "Rating": 4,
            "DateCreated": "2016-08-14T23:45:51.29Z",
            "User": {
                "ID": 6418,
                "Username": "PatrykS"
            },
            "CheckinStatusTypeID": 10
        },
        {
            "ID": 8183,
            "ChargePointID": 57615,
            "CommentTypeID": 10,
            "UserName": "PatrykS",
            "Comment": "2015-12-09 19:00 Successfully charged Opel Ampera using one of the CEE 7/5 sockets.",
            "Rating": 4,
            "DateCreated": "2015-12-09T23:05:04.483Z",
            "User": {
                "ID": 6418,
                "Username": "PatrykS"
            },
            "CheckinStatusTypeID": 10
        }
    ],
    "MediaItems": [
        {
            "ID": 8200,
            "ChargePointID": 57615,
            "ItemURL": "https://s3-ap-southeast-2.amazonaws.com/openchargemap/images/PL/OCM57615/OCM-57615.orig.2016082908062965.jpg",
            "ItemThumbnailURL": "https://s3-ap-southeast-2.amazonaws.com/openchargemap/images/PL/OCM57615/OCM-57615.thmb.2016082908062965.jpg",
            "Comment": "Meeting of three Amperas :-)",
            "IsEnabled": true,
            "IsVideo": false,
            "IsFeaturedItem": false,
            "IsExternalResource": false,
            "User": {
                "ID": 6418,
                "Username": "PatrykS"
            },
            "DateCreated": "2016-08-29T08:07:00Z"
        },
        {
            "ID": 8078,
            "ChargePointID": 57615,
            "ItemURL": "https://s3-ap-southeast-2.amazonaws.com/openchargemap/images/PL/OCM57615/OCM-57615.orig.2016081423414050.jpg",
            "ItemThumbnailURL": "https://s3-ap-southeast-2.amazonaws.com/openchargemap/images/PL/OCM57615/OCM-57615.thmb.2016081423414050.jpg",
            "Comment": "Charging Opel Ampera using CEE 5 pin 32A socket and own wall charging station (made it portable).",
            "IsEnabled": true,
            "IsVideo": false,
            "IsFeaturedItem": false,
            "IsExternalResource": false,
            "User": {
                "ID": 6418,
                "Username": "PatrykS"
            },
            "DateCreated": "2016-08-14T23:42:00Z"
        },
        {
            "ID": 6340,
            "ChargePointID": 57615,
            "ItemURL": "https://s3-ap-southeast-2.amazonaws.com/openchargemap/images/PL/OCM57615/OCM-57615.orig.2016050220323803.jpg",
            "ItemThumbnailURL": "https://s3-ap-southeast-2.amazonaws.com/openchargemap/images/PL/OCM57615/OCM-57615.thmb.2016050220323803.jpg",
            "Comment": "CEE 5 Pin sockets - 32A (left) and 16A (right)",
            "IsEnabled": true,
            "IsVideo": false,
            "IsFeaturedItem": false,
            "IsExternalResource": false,
            "User": {
                "ID": 6418,
                "Username": "PatrykS"
            },
            "DateCreated": "2016-05-02T20:33:00Z"
        },
        {
            "ID": 6339,
            "ChargePointID": 57615,
            "ItemURL": "https://s3-ap-southeast-2.amazonaws.com/openchargemap/images/PL/OCM57615/OCM-57615.orig.2016050220313465.jpg",
            "ItemThumbnailURL": "https://s3-ap-southeast-2.amazonaws.com/openchargemap/images/PL/OCM57615/OCM-57615.thmb.2016050220313465.jpg",
            "Comment": "CEE 7/5 socket",
            "IsEnabled": true,
            "IsVideo": false,
            "IsFeaturedItem": false,
            "IsExternalResource": false,
            "User": {
                "ID": 6418,
                "Username": "PatrykS"
            },
            "DateCreated": "2016-05-02T20:32:00Z"
        },
        {
            "ID": 6338,
            "ChargePointID": 57615,
            "ItemURL": "https://s3-ap-southeast-2.amazonaws.com/openchargemap/images/PL/OCM57615/OCM-57615.orig.2016050220302126.jpg",
            "ItemThumbnailURL": "https://s3-ap-southeast-2.amazonaws.com/openchargemap/images/PL/OCM57615/OCM-57615.thmb.2016050220302126.jpg",
            "Comment": "Box of sockets",
            "IsEnabled": true,
            "IsVideo": false,
            "IsFeaturedItem": false,
            "IsExternalResource": false,
            "User": {
                "ID": 6418,
                "Username": "PatrykS"
            },
            "DateCreated": "2016-05-02T20:31:00Z"
        },
        {
            "ID": 6337,
            "ChargePointID": 57615,
            "ItemURL": "https://s3-ap-southeast-2.amazonaws.com/openchargemap/images/PL/OCM57615/OCM-57615.orig.2016050220294279.jpg",
            "ItemThumbnailURL": "https://s3-ap-southeast-2.amazonaws.com/openchargemap/images/PL/OCM57615/OCM-57615.thmb.2016050220294279.jpg",
            "Comment": "CEE 7/5 socket",
            "IsEnabled": true,
            "IsVideo": false,
            "IsFeaturedItem": false,
            "IsExternalResource": false,
            "User": {
                "ID": 6418,
                "Username": "PatrykS"
            },
            "DateCreated": "2016-05-02T20:30:00Z"
        },
        {
            "ID": 3574,
            "ChargePointID": 57615,
            "ItemURL": "https://s3-ap-southeast-2.amazonaws.com/openchargemap/images/PL/OCM57615/OCM-57615.orig.2015120923032284.jpg",
            "ItemThumbnailURL": "https://s3-ap-southeast-2.amazonaws.com/openchargemap/images/PL/OCM57615/OCM-57615.thmb.2015120923032284.jpg",
            "Comment": "Set of 12 bays.",
            "IsEnabled": true,
            "IsVideo": false,
            "IsFeaturedItem": false,
            "IsExternalResource": false,
            "User": {
                "ID": 6418,
                "Username": "PatrykS"
            },
            "DateCreated": "2015-12-09T23:04:00Z"
        },
        {
            "ID": 3573,
            "ChargePointID": 57615,
            "ItemURL": "https://s3-ap-southeast-2.amazonaws.com/openchargemap/images/PL/OCM57615/OCM-57615.orig.2015120923022003.jpg",
            "ItemThumbnailURL": "https://s3-ap-southeast-2.amazonaws.com/openchargemap/images/PL/OCM57615/OCM-57615.thmb.2015120923022003.jpg",
            "Comment": "Additional set of 1-phase and 3-phase sockets.",
            "IsEnabled": true,
            "IsVideo": false,
            "IsFeaturedItem": false,
            "IsExternalResource": false,
            "User": {
                "ID": 6418,
                "Username": "PatrykS"
            },
            "DateCreated": "2015-12-09T23:03:00Z"
        },
        {
            "ID": 3572,
            "ChargePointID": 57615,
            "ItemURL": "https://s3-ap-southeast-2.amazonaws.com/openchargemap/images/PL/OCM57615/OCM-57615.orig.2015120923004598.jpg",
            "ItemThumbnailURL": "https://s3-ap-southeast-2.amazonaws.com/openchargemap/images/PL/OCM57615/OCM-57615.thmb.2015120923004598.jpg",
            "Comment": "Charging Opel Ampera using CEE 7/5 socket.",
            "IsEnabled": true,
            "IsVideo": false,
            "IsFeaturedItem": false,
            "IsExternalResource": false,
            "User": {
                "ID": 6418,
                "Username": "PatrykS"
            },
            "DateCreated": "2015-12-09T23:01:00Z"
        }
    ],
    "IsRecentlyVerified": false,
    "ID": 57615,
    "UUID": "DDBB2178-934B-4E5C-995D-FFA07C6C4013",
    "DataProviderID": 1,
    "OperatorID": 45,
    "UsageTypeID": 1,
    "UsageCost": "0",
    "AddressInfo": {
        "ID": 57961,
        "Title": "Centrum Riviera - północ",
        "AddressLine1": "Kazimierza Górskiego 2",
        "Town": "Gdynia",
        "StateOrProvince": "pomorskie",
        "Postcode": "81-304",
        "CountryID": 179,
        "Latitude": 54.5065072208741,
        "Longitude": 18.5331925449555,
        "ContactTelephone1": "+48 58 779 07 10",
        "ContactEmail": "biuro@centrumriviera.pl",
        "RelatedURL": "http://www.centrumriviera.pl/",
        "DistanceUnit": 0
    },
    "Connections": [
        {
            "ID": 72850,
            "ConnectionTypeID": 23,
            "StatusTypeID": 50,
            "LevelID": 2,
            "Amps": 16,
            "Voltage": 230,
            "PowerKW": 3.6,
            "CurrentTypeID": 10,
            "Quantity": 15
        },
        {
            "ID": 72851,
            "ConnectionTypeID": 17,
            "StatusTypeID": 50,
            "LevelID": 2,
            "Amps": 16,
            "Voltage": 400,
            "PowerKW": 11,
            "CurrentTypeID": 20,
            "Quantity": 1
        },
        {
            "ID": 91046,
            "ConnectionTypeID": 17,
            "StatusTypeID": 50,
            "LevelID": 2,
            "Amps": 32,
            "Voltage": 400,
            "PowerKW": 22,
            "CurrentTypeID": 20,
            "Quantity": 1
        }
    ],
    "NumberOfPoints": 12,
    "GeneralComments": "Station is located on parking level -1, in the corner of the building next to Kielecka/Górskiego crossing. Row of 12 bays, each with it's own CEE 7/5 socket. Additionally there is a set of three CEE 7/5 sockets and two CEE 5 pin sockets (one 16A and one 32A) on the wall at the end of the row of bays.",
    "StatusTypeID": 50,
    "DateLastStatusUpdate": "2016-08-29T08:07:00Z",
    "DataQualityLevel": 1,
    "DateCreated": "2015-12-09T23:00:00Z",
    "SubmissionStatusTypeID": 200
}