{
    "IsRecentlyVerified": false,
    "ID": 158953,
    "UUID": "A391B206-1E6B-4297-A026-C8F999D604F9",
    "DataProviderID": 2,
    "DataProvidersReference": "152910",
    "OperatorID": 89,
    "UsageTypeID": 1,
    "AddressInfo": {
        "ID": 159310,
        "Title": "17729 Chatsworth Ave",
        "AddressLine1": "17729 Chatsworth Ave",
        "Town": "Granada Hills",
        "StateOrProvince": "CA",
        "Postcode": "91344",
        "CountryID": 2,
        "Latitude": 34.264939,
        "Longitude": -118.520876,
        "ContactTelephone1": "888-356-8911",
        "AccessComments": "24 hours daily",
        "RelatedURL": "https://flo.ca/",
        "DistanceUnit": 0
    },
    "Connections": [
        {
            "ID": 228990,
            "ConnectionTypeID": 1,
            "LevelID": 2,
            "Amps": 16,
            "Voltage": 230,
            "PowerKW": 3.7,
            "CurrentTypeID": 10,
            "Quantity": 1
        }
    ],
    "StatusTypeID": 50,
    "DateLastStatusUpdate": "2020-06-26T02:57:00Z",
    "DataQualityLevel": 3,
    "DateCreated": "2020-06-26T02:57:00Z",
    "SubmissionStatusTypeID": 100
}