{
    "IsRecentlyVerified": false,
    "ID": 101449,
    "UUID": "7CD4C583-3A4D-4E4E-B966-B981988B8FC7",
    "DataProviderID": 1,
    "OperatorID": 156,
    "UsageTypeID": 4,
    "AddressInfo": {
        "ID": 101795,
        "Title": "Tiefgarage D5 Reiss-Museum",
        "AddressLine1": "D5",
        "Town": "Mannheim",
        "StateOrProvince": "Mannheim",
        "Postcode": "68159",
        "CountryID": 87,
        "Latitude": 49.48849810003622,
        "Longitude": 8.461967905049164,
        "AccessComments": "24/7 open",
        "RelatedURL": "https://www.parken-mannheim.de/parken/tiefgarage-collini-center",
        "DistanceUnit": 0
    },
    "Connections": [
        {
            "ID": 143240,
            "ConnectionTypeID": 25,
            "StatusTypeID": 50,
            "LevelID": 2,
            "Amps": 16,
            "Voltage": 400,
            "PowerKW": 11,
            "CurrentTypeID": 20,
            "Quantity": 2
        }
    ],
    "NumberOfPoints": 2,
    "StatusTypeID": 50,
    "DateLastStatusUpdate": "2018-03-28T12:04:00Z",
    "DataQualityLevel": 1,
    "DateCreated": "2018-03-28T12:04:00Z",
    "SubmissionStatusTypeID": 200
}