{
    "IsRecentlyVerified": false,
    "ID": 138598,
    "UUID": "FEF90B9C-0EAE-47A1-8CE4-7E2DA71001ED",
    "DataProviderID": 2,
    "DataProvidersReference": "80987",
    "OperatorID": 5,
    "UsageTypeID": 1,
    "AddressInfo": {
        "ID": 138947,
        "Title": "MARTIN ACH",
        "AddressLine1": "Martin Loop",
        "Town": "Fort Benning",
        "StateOrProvince": "GA",
        "Postcode": "31905",
        "CountryID": 2,
        "Latitude": 32.3715717,
        "Longitude": -84.9280391,
        "ContactTelephone1": "888-758-4389",
        "AccessComments": "24 hours daily",
        "RelatedURL": "http://www.chargepoint.com/",
        "DistanceUnit": 0
    },
    "Connections": [
        {
            "ID": 193743,
            "ConnectionTypeID": 1,
            "LevelID": 2,
            "Amps": 16,
            "Voltage": 230,
            "PowerKW": 3,
            "CurrentTypeID": 10,
            "Quantity": 2
        }
    ],
    "StatusTypeID": 50,
    "DateLastStatusUpdate": "2019-12-24T09:09:00Z",
    "DataQualityLevel": 3,
    "DateCreated": "2019-12-24T09:09:00Z",
    "SubmissionStatusTypeID": 100
}