{
    "UserComments": [
        {
            "ID": 8178,
            "ChargePointID": 38904,
            "CommentTypeID": 10,
            "UserName": "MarkB",
            "Comment": "Somewhere in a parking garage of that name",
            "DateCreated": "2015-12-09T18:15:36.443Z",
            "User": {
                "ID": 6685,
                "Username": "MarkB"
            },
            "CheckinStatusTypeID": 130
        }
    ],
    "IsRecentlyVerified": false,
    "ID": 38904,
    "UUID": "AAB04686-1497-41E0-8B69-E282060176CA",
    "DataProviderID": 26,
    "DataProvidersReference": "47737",
    "OperatorID": 178,
    "OperatorsReference": "EVnetNL AL883",
    "UsageCost": "0.00 jaarabonnement",
    "AddressInfo": {
        "ID": 39250,
        "Title": "Apollopad 72",
        "AddressLine1": "Apollopad 72",
        "Town": "Assen",
        "Postcode": "9401 ZA",
        "CountryID": 159,
        "Latitude": 52.997848,
        "Longitude": 6.559302,
        "ContactTelephone1": "0800-3522365",
        "RelatedURL": "http://www.evnet.nl",
        "DistanceUnit": 0
    },
    "Connections": [
        {
            "ID": 42415,
            "ConnectionTypeID": 25,
            "LevelID": 2,
            "PowerKW": 11,
            "CurrentTypeID": 10
        }
    ],
    "NumberOfPoints": 2,
    "StatusTypeID": 50,
    "DateLastStatusUpdate": "2016-06-04T02:55:00Z",
    "DataQualityLevel": 3,
    "DateCreated": "2015-01-09T06:08:00Z",
    "SubmissionStatusTypeID": 100
}