{
    "IsRecentlyVerified": false,
    "ID": 46869,
    "UUID": "7A398DEA-7A8B-4CCC-9C72-6CEC5FE86A9E",
    "DataProviderID": 1,
    "OperatorID": 189,
    "UsageTypeID": 4,
    "AddressInfo": {
        "ID": 47215,
        "Title": "ITC GmbH in Deggendorf",
        "AddressLine1": "Ulrichsberger Str. 17",
        "Town": "Deggendorf",
        "Postcode": "94469",
        "CountryID": 87,
        "Latitude": 48.8472719317172,
        "Longitude": 12.9640631946793,
        "AccessComments": "Wallbox an überdachten Stellplätzen.",
        "RelatedURL": "http://www.e-wald.eu/",
        "DistanceUnit": 0
    },
    "Connections": [
        {
            "ID": 57649,
            "ConnectionTypeID": 25,
            "StatusTypeID": 50,
            "LevelID": 2,
            "Amps": 32,
            "Voltage": 400,
            "PowerKW": 22,
            "CurrentTypeID": 20,
            "Quantity": 1
        },
        {
            "ID": 57650,
            "ConnectionTypeID": 28,
            "StatusTypeID": 50,
            "LevelID": 2,
            "Amps": 16,
            "Voltage": 230,
            "PowerKW": 3.7,
            "CurrentTypeID": 10,
            "Quantity": 1
        }
    ],
    "NumberOfPoints": 2,
    "StatusTypeID": 50,
    "DateLastStatusUpdate": "2015-05-08T21:45:00Z",
    "DataQualityLevel": 1,
    "DateCreated": "2015-05-08T20:52:00Z",
    "SubmissionStatusTypeID": 200
}