{
    "IsRecentlyVerified": false,
    "ID": 23834,
    "UUID": "A1014432-F4A8-4251-A5FA-CAAF47B831D7",
    "DataProviderID": 1,
    "OperatorID": 206,
    "UsageTypeID": 4,
    "UsageCost": "Free",
    "AddressInfo": {
        "ID": 24179,
        "Title": "B:SM 53 - Londres",
        "AddressLine1": "Carrer de Londres, 55",
        "Town": "BARCELONA",
        "StateOrProvince": "Barcelona",
        "Postcode": "08036",
        "CountryID": 210,
        "Latitude": 41.391087,
        "Longitude": 2.147544,
        "AccessComments": "Aparcament públic - Targeta BCN Live / Public parking - BCN Live card",
        "DistanceUnit": 0
    },
    "Connections": [
        {
            "ID": 25901,
            "ConnectionTypeID": 28,
            "StatusTypeID": 50,
            "LevelID": 2,
            "Amps": 16,
            "Quantity": 1
        }
    ],
    "NumberOfPoints": 1,
    "StatusTypeID": 50,
    "DateLastStatusUpdate": "2015-09-05T17:54:00Z",
    "DataQualityLevel": 1,
    "DateCreated": "2014-06-03T05:18:00Z",
    "SubmissionStatusTypeID": 200
}