{
    "MediaItems": [
        {
            "ID": 23545,
            "ChargePointID": 162135,
            "ItemURL": "https://s3-ap-southeast-2.amazonaws.com/openchargemap/images/AT/OCM162135/OCM-162135.orig.2020080205575172.jpg",
            "ItemThumbnailURL": "https://s3-ap-southeast-2.amazonaws.com/openchargemap/images/AT/OCM162135/OCM-162135.thmb.2020080205575172.jpg",
            "Comment": "",
            "IsEnabled": true,
            "IsVideo": false,
            "IsFeaturedItem": false,
            "IsExternalResource": false,
            "User": {
                "ID": 26760,
                "Username": "interssl.com"
            },
            "DateCreated": "2020-08-02T05:58:00Z"
        },
        {
            "ID": 23546,
            "ChargePointID": 162135,
            "ItemURL": "https://s3-ap-southeast-2.amazonaws.com/openchargemap/images/AT/OCM162135/OCM-162135.orig.2020080205580409.jpg",
            "ItemThumbnailURL": "https://s3-ap-southeast-2.amazonaws.com/openchargemap/images/AT/OCM162135/OCM-162135.thmb.2020080205580409.jpg",
            "Comment": "",
            "IsEnabled": true,
            "IsVideo": false,
            "IsFeaturedItem": false,
            "IsExternalResource": false,
            "User": {
                "ID": 26760,
                "Username": "interssl.com"
            },
            "DateCreated": "2020-08-02T05:58:00Z"
        },
        {
            "ID": 23547,
            "ChargePointID": 162135,
            "ItemURL": "https://s3-ap-southeast-2.amazonaws.com/openchargemap/images/AT/OCM162135/OCM-162135.orig.2020080205581659.jpg",
            "ItemThumbnailURL": "https://s3-ap-southeast-2.amazonaws.com/openchargemap/images/AT/OCM162135/OCM-162135.thmb.2020080205581659.jpg",
            "Comment": "",
            "IsEnabled": true,
            "IsVideo": false,
            "IsFeaturedItem": false,
            "IsExternalResource": false,
            "User": {
                "ID": 26760,
                "Username": "interssl.com"
            },
            "DateCreated": "2020-08-02T05:58:00Z"
        }
    ],
    "IsRecentlyVerified": false,
    "ID": 162135,
    "UUID": "E634935B-5DB6-4C95-8A07-B914401F0494",
    "DataProviderID": 1,
    "OperatorID": 45,
    "UsageTypeID": 6,
    "UsageCost": "free",
    "AddressInfo": {
        "ID": 162492,
        "Title": "Nassereinerhof",
        "AddressLine1": "Nassereinerstraße",
        "AddressLine2": "Nasserein",
        "Town": "Gemeinde Sankt Anton am Arlberg",
        "StateOrProvince": "Bezirk Landeck",
        "Postcode": "6580",
        "CountryID": 19,
        "Latitude": 47.135604180962105,
        "Longitude": 10.274846051662166,
        "RelatedURL": "https://www.nassereinerhof.at/",
        "DistanceUnit": 0
    },
    "Connections": [
        {
            "ID": 233345,
            "ConnectionTypeID": 1036,
            "StatusTypeID": 50,
            "LevelID": 2,
            "Amps": 32,
            "PowerKW": 22,
            "CurrentTypeID": 20,
            "Quantity": 1
        },
        {
            "ID": 233346,
            "ConnectionTypeID": 25,
            "StatusTypeID": 50,
            "LevelID": 2,
            "Amps": 32,
            "PowerKW": 22,
            "CurrentTypeID": 20,
            "Quantity": 1
        }
    ],
    "NumberOfPoints": 2,
    "StatusTypeID": 50,
    "DateLastStatusUpdate": "2020-08-04T09:51:00Z",
    "DataQualityLevel": 1,
    "DateCreated": "2020-08-02T05:57:00Z",
    "SubmissionStatusTypeID": 200
}