{
    "IsRecentlyVerified": false,
    "ID": 183017,
    "UUID": "B1D9A52F-FC77-41C1-9DBC-F22ACBBAD49D",
    "DataProviderID": 29,
    "DataProvidersReference": "17414",
    "OperatorID": 127,
    "AddressInfo": {
        "ID": 183376,
        "Title": "Bahnhofstraße 12",
        "AddressLine1": "Bahnhofstraße 12",
        "Town": "Bösel",
        "Postcode": "26215",
        "CountryID": 87,
        "Latitude": 53.0030542,
        "Longitude": 7.95312590000003,
        "DistanceUnit": 0
    },
    "Connections": [
        {
            "ID": 289469,
            "ConnectionTypeID": 25,
            "StatusTypeID": 50,
            "LevelID": 2,
            "PowerKW": 22,
            "CurrentTypeID": 20
        },
        {
            "ID": 289470,
            "ConnectionTypeID": 25,
            "StatusTypeID": 50,
            "LevelID": 2,
            "PowerKW": 22,
            "CurrentTypeID": 20
        }
    ],
    "StatusTypeID": 50,
    "DateLastStatusUpdate": "2021-07-12T02:50:00Z",
    "MetadataValues": [
        {
            "ID": 15310,
            "MetadataFieldID": 4,
            "ItemValue": "Data from the German chargepoint registry provided by Bundesnetzagentur.de under the CC-BY 4.0 license"
        }
    ],
    "DataQualityLevel": 3,
    "DateCreated": "2021-07-08T10:03:00Z",
    "SubmissionStatusTypeID": 100
}