{
    "IsRecentlyVerified": false,
    "ID": 155346,
    "UUID": "129BCDE1-F15C-454F-80B5-C8E10CFD6B03",
    "DataProviderID": 1,
    "OperatorID": 32,
    "UsageTypeID": 5,
    "UsageCost": "£0.35/kWh (Contactless Payment); £0.23/kWh (bpPulse subscription); £0.29/kWh (bpPulse app)",
    "AddressInfo": {
        "ID": 155700,
        "Title": "The Rose and Crown",
        "AddressLine1": "High Street",
        "AddressLine2": "Kings Langley",
        "Town": "Dacorum",
        "StateOrProvince": "Hertfordshire",
        "Postcode": "WD4 9HT",
        "CountryID": 1,
        "Latitude": 51.710922,
        "Longitude": -0.44933,
        "DistanceUnit": 0
    },
    "Connections": [
        {
            "ID": 218708,
            "ConnectionTypeID": 33,
            "StatusTypeID": 50,
            "LevelID": 3,
            "PowerKW": 50,
            "CurrentTypeID": 30,
            "Quantity": 1
        },
        {
            "ID": 218709,
            "ConnectionTypeID": 2,
            "StatusTypeID": 50,
            "LevelID": 3,
            "PowerKW": 50,
            "CurrentTypeID": 30,
            "Quantity": 1
        },
        {
            "ID": 218710,
            "ConnectionTypeID": 1036,
            "StatusTypeID": 50,
            "LevelID": 3,
            "Amps": 63,
            "Voltage": 400,
            "PowerKW": 43,
            "CurrentTypeID": 20,
            "Quantity": 1
        }
    ],
    "NumberOfPoints": 1,
    "StatusTypeID": 50,
    "DateLastStatusUpdate": "2021-08-24T19:49:00Z",
    "DataQualityLevel": 1,
    "DateCreated": "2020-04-07T09:37:00Z",
    "SubmissionStatusTypeID": 200
}