{
    "IsRecentlyVerified": false,
    "ID": 110303,
    "UUID": "916320BE-56B2-47BD-82BB-80CF44F46119",
    "DataProviderID": 2,
    "DataProvidersReference": "102042",
    "OperatorID": 23,
    "UsageTypeID": 1,
    "AddressInfo": {
        "ID": 110649,
        "Title": "Del Monte Shopping Center - Tesla Supercharger",
        "AddressLine1": "1410 Del Monte Center",
        "Town": "Monterey",
        "StateOrProvince": "CA",
        "Postcode": "93940",
        "CountryID": 2,
        "Latitude": 36.58344,
        "Longitude": -121.894909,
        "ContactTelephone1": "877-798-3752",
        "AccessComments": "24 hours daily; for Tesla use only",
        "RelatedURL": "http://www.teslamotors.com/supercharger",
        "DistanceUnit": 0
    },
    "Connections": [
        {
            "ID": 155544,
            "ConnectionTypeID": 27,
            "LevelID": 2,
            "Amps": 100,
            "Voltage": 400,
            "PowerKW": 40,
            "CurrentTypeID": 10,
            "Quantity": 10
        }
    ],
    "DateLastStatusUpdate": "2019-04-06T04:02:00Z",
    "DataQualityLevel": 3,
    "DateCreated": "2018-10-18T23:36:00Z",
    "SubmissionStatusTypeID": 100
}