{
    "IsRecentlyVerified": false,
    "ID": 141289,
    "UUID": "A2DB670D-D83C-482C-933E-4F4EF411F577",
    "DataProviderID": 2,
    "DataProvidersReference": "98444",
    "UsageTypeID": 2,
    "AddressInfo": {
        "ID": 141641,
        "Title": "Metro Park",
        "AddressLine1": "6363 Walker Ln",
        "Town": "Alexandria",
        "StateOrProvince": "VA",
        "Postcode": "22310",
        "CountryID": 2,
        "Latitude": 38.7687738,
        "Longitude": -77.1570897,
        "ContactTelephone1": "",
        "AccessComments": "",
        "RelatedURL": "",
        "DistanceUnit": 0
    },
    "Connections": [
        {
            "ID": 197187,
            "ConnectionTypeID": 1,
            "LevelID": 2,
            "Amps": 16,
            "Voltage": 230,
            "PowerKW": 3.7,
            "CurrentTypeID": 10,
            "Quantity": 4
        }
    ],
    "StatusTypeID": 50,
    "DateLastStatusUpdate": "2020-06-26T03:00:00Z",
    "DataQualityLevel": 3,
    "DateCreated": "2019-12-24T09:15:00Z",
    "SubmissionStatusTypeID": 100
}