{
    "IsRecentlyVerified": false,
    "ID": 8007,
    "UUID": "2D73D964-8177-440C-9B8F-C9E58E3DF1D3",
    "DataProviderID": 15,
    "DataProvidersReference": "5217",
    "OperatorID": 26,
    "AddressInfo": {
        "ID": 7904,
        "Title": "93-25 Rockaway Blvd",
        "AddressLine1": "93-25 Rockaway Blvd",
        "Town": "Ozone Park",
        "StateOrProvince": "NY",
        "Postcode": "11416",
        "CountryID": 2,
        "Latitude": 40.68067,
        "Longitude": -73.84591,
        "ContactTelephone1": " (718) 835-8300 ",
        "RelatedURL": "http://carstations.com/5217",
        "DistanceUnit": 0
    },
    "Connections": [
        {
            "ID": 5436,
            "ConnectionTypeID": 1,
            "Reference": "J1772",
            "LevelID": 2
        }
    ],
    "StatusTypeID": 0,
    "DateLastStatusUpdate": "2017-11-04T14:04:00Z",
    "DataQualityLevel": 1,
    "DateCreated": "2011-11-11T12:05:00Z",
    "SubmissionStatusTypeID": 100
}