{
    "IsRecentlyVerified": false,
    "ID": 160381,
    "UUID": "4D3019D0-6442-4453-81EE-1901C88DFD7E",
    "DataProviderID": 2,
    "DataProvidersReference": "156604",
    "OperatorID": 9,
    "UsageTypeID": 1,
    "AddressInfo": {
        "ID": 160738,
        "Title": "Murray Business Center",
        "AddressLine1": "3601 Murray Blvd",
        "Town": "Beaverton",
        "StateOrProvince": "OR",
        "Postcode": "97005",
        "CountryID": 2,
        "Latitude": 45.494872,
        "Longitude": -122.82906,
        "ContactTelephone1": "888-998-2546",
        "AccessComments": "MON: 24 hours | TUE: 24 hours | WED: 24 hours | THU: 24 hours | FRI: 24 hours | SAT: 24 hours | SUN: 24 hours",
        "RelatedURL": "http://www.blinkcharging.com/",
        "DistanceUnit": 0
    },
    "Connections": [
        {
            "ID": 230763,
            "ConnectionTypeID": 1,
            "LevelID": 2,
            "Amps": 16,
            "Voltage": 230,
            "PowerKW": 3.7,
            "CurrentTypeID": 10,
            "Quantity": 2
        }
    ],
    "StatusTypeID": 50,
    "DateLastStatusUpdate": "2020-06-26T03:09:00Z",
    "DataQualityLevel": 3,
    "DateCreated": "2020-06-26T03:09:00Z",
    "SubmissionStatusTypeID": 100
}