{
    "UserComments": [
        {
            "ID": 21940,
            "ChargePointID": 112891,
            "CommentTypeID": 10,
            "UserName": "ForumElettrico.it",
            "DateCreated": "2019-12-25T10:56:24.54Z",
            "User": {
                "ID": 11749,
                "Username": "ForumElettrico.it"
            },
            "CheckinStatusTypeID": 10,
            "IsActionedByEditor": false
        },
        {
            "ID": 20667,
            "ChargePointID": 112891,
            "CommentTypeID": 10,
            "UserName": "ForumElettrico.it",
            "RelatedURL": "https://www.forumelettrico.it/forum/colonnina-enel-x-22-kw-impianti-sportivi-rubiera-re-via-maria-melato-9-t4662.html",
            "DateCreated": "2019-01-28T08:16:29.643Z",
            "User": {
                "ID": 11749,
                "Username": "ForumElettrico.it"
            },
            "CheckinStatusTypeID": 140
        }
    ],
    "MediaItems": [
        {
            "ID": 20720,
            "ChargePointID": 112891,
            "ItemURL": "https://s3-ap-southeast-2.amazonaws.com/openchargemap/images/IT/OCM112891/OCM-112891.orig.2019122510571713.jpg",
            "ItemThumbnailURL": "https://s3-ap-southeast-2.amazonaws.com/openchargemap/images/IT/OCM112891/OCM-112891.thmb.2019122510571713.jpg",
            "Comment": "",
            "IsEnabled": true,
            "IsVideo": false,
            "IsFeaturedItem": false,
            "IsExternalResource": false,
            "User": {
                "ID": 11749,
                "Username": "ForumElettrico.it"
            },
            "DateCreated": "2019-12-25T10:57:00Z"
        },
        {
            "ID": 17502,
            "ChargePointID": 112891,
            "ItemURL": "https://s3-ap-southeast-2.amazonaws.com/openchargemap/images/IT/OCM112891/OCM-112891.orig.2019012808164737.jpg",
            "ItemThumbnailURL": "https://s3-ap-southeast-2.amazonaws.com/openchargemap/images/IT/OCM112891/OCM-112891.thmb.2019012808164737.jpg",
            "Comment": "",
            "IsEnabled": true,
            "IsVideo": false,
            "IsFeaturedItem": false,
            "IsExternalResource": false,
            "User": {
                "ID": 11749,
                "Username": "ForumElettrico.it"
            },
            "DateCreated": "2019-01-28T08:17:00Z"
        },
        {
            "ID": 17503,
            "ChargePointID": 112891,
            "ItemURL": "https://s3-ap-southeast-2.amazonaws.com/openchargemap/images/IT/OCM112891/OCM-112891.orig.2019012808165423.jpg",
            "ItemThumbnailURL": "https://s3-ap-southeast-2.amazonaws.com/openchargemap/images/IT/OCM112891/OCM-112891.thmb.2019012808165423.jpg",
            "Comment": "",
            "IsEnabled": true,
            "IsVideo": false,
            "IsFeaturedItem": false,
            "IsExternalResource": false,
            "User": {
                "ID": 11749,
                "Username": "ForumElettrico.it"
            },
            "DateCreated": "2019-01-28T08:17:00Z"
        },
        {
            "ID": 17504,
            "ChargePointID": 112891,
            "ItemURL": "https://s3-ap-southeast-2.amazonaws.com/openchargemap/images/IT/OCM112891/OCM-112891.orig.2019012808170051.jpg",
            "ItemThumbnailURL": "https://s3-ap-southeast-2.amazonaws.com/openchargemap/images/IT/OCM112891/OCM-112891.thmb.2019012808170051.jpg",
            "Comment": "",
            "IsEnabled": true,
            "IsVideo": false,
            "IsFeaturedItem": false,
            "IsExternalResource": false,
            "User": {
                "ID": 11749,
                "Username": "ForumElettrico.it"
            },
            "DateCreated": "2019-01-28T08:17:00Z"
        },
        {
            "ID": 17505,
            "ChargePointID": 112891,
            "ItemURL": "https://s3-ap-southeast-2.amazonaws.com/openchargemap/images/IT/OCM112891/OCM-112891.orig.2019012808170804.jpg",
            "ItemThumbnailURL": "https://s3-ap-southeast-2.amazonaws.com/openchargemap/images/IT/OCM112891/OCM-112891.thmb.2019012808170804.jpg",
            "Comment": "",
            "IsEnabled": true,
            "IsVideo": false,
            "IsFeaturedItem": false,
            "IsExternalResource": false,
            "User": {
                "ID": 11749,
                "Username": "ForumElettrico.it"
            },
            "DateCreated": "2019-01-28T08:17:00Z"
        }
    ],
    "IsRecentlyVerified": false,
    "ID": 112891,
    "UUID": "6CFA7083-9E3E-48AC-8304-1486A2C1926C",
    "DataProviderID": 1,
    "OperatorID": 80,
    "UsageTypeID": 4,
    "AddressInfo": {
        "ID": 113237,
        "Title": "Rubiera Melato | EnelX",
        "AddressLine1": "Via Maria Melato",
        "Town": "Rubiera",
        "StateOrProvince": "RE",
        "Postcode": "42048",
        "CountryID": 112,
        "Latitude": 44.64979179846379,
        "Longitude": 10.786965662806635,
        "ContactTelephone1": "800.069.850",
        "RelatedURL": "https://www.enelx.com/it/it/emobility",
        "DistanceUnit": 0
    },
    "Connections": [
        {
            "ID": 159006,
            "ConnectionTypeID": 25,
            "StatusTypeID": 50,
            "LevelID": 2,
            "Amps": 32,
            "Voltage": 400,
            "PowerKW": 22,
            "CurrentTypeID": 20,
            "Quantity": 1
        },
        {
            "ID": 159007,
            "ConnectionTypeID": 36,
            "StatusTypeID": 50,
            "LevelID": 2,
            "Amps": 16,
            "Voltage": 240,
            "PowerKW": 3.7,
            "CurrentTypeID": 10,
            "Quantity": 1
        }
    ],
    "NumberOfPoints": 2,
    "StatusTypeID": 50,
    "DateLastStatusUpdate": "2019-12-25T10:57:00Z",
    "DataQualityLevel": 1,
    "DateCreated": "2018-11-22T15:56:00Z",
    "SubmissionStatusTypeID": 200
}