{
    "IsRecentlyVerified": false,
    "ID": 138774,
    "UUID": "9754F41B-413B-4D19-B9F0-3F2B4688563D",
    "DataProviderID": 2,
    "DataProvidersReference": "143376",
    "OperatorID": 5,
    "UsageTypeID": 1,
    "AddressInfo": {
        "ID": 139126,
        "Title": "IRVINE  CO  OFC",
        "AddressLine1": "4820 Eastgate Mall",
        "Town": "San Diego",
        "StateOrProvince": "CA",
        "Postcode": "92121",
        "CountryID": 2,
        "Latitude": 32.883439,
        "Longitude": -117.206783,
        "ContactTelephone1": "888-758-4389",
        "AccessComments": "24 hours daily",
        "RelatedURL": "http://www.chargepoint.com/",
        "DistanceUnit": 0
    },
    "Connections": [
        {
            "ID": 193981,
            "ConnectionTypeID": 1,
            "LevelID": 2,
            "Amps": 16,
            "Voltage": 230,
            "PowerKW": 3,
            "CurrentTypeID": 10,
            "Quantity": 4
        }
    ],
    "StatusTypeID": 50,
    "DateLastStatusUpdate": "2019-12-24T09:09:00Z",
    "DataQualityLevel": 3,
    "DateCreated": "2019-12-24T09:09:00Z",
    "SubmissionStatusTypeID": 100
}