{
    "IsRecentlyVerified": false,
    "ID": 144247,
    "UUID": "28C43514-8C5B-4692-BAAA-F11E1F4CA04F",
    "DataProviderID": 2,
    "DataProvidersReference": "130376",
    "OperatorID": 90,
    "UsageTypeID": 1,
    "AddressInfo": {
        "ID": 144599,
        "Title": "4401 Lasalle",
        "AddressLine1": "4401 Lasalle",
        "Town": "Verdun",
        "StateOrProvince": "QC",
        "Postcode": "H4G 2S5",
        "CountryID": 44,
        "Latitude": 45.459904,
        "Longitude": -73.563449,
        "ContactTelephone1": "877-505-2674",
        "AccessComments": "24 hours daily",
        "RelatedURL": "https://lecircuitelectrique.com/",
        "DistanceUnit": 0
    },
    "Connections": [
        {
            "ID": 200736,
            "ConnectionTypeID": 1,
            "LevelID": 2,
            "Amps": 16,
            "Voltage": 230,
            "PowerKW": 3.7,
            "CurrentTypeID": 10,
            "Quantity": 2
        }
    ],
    "StatusTypeID": 50,
    "DateLastStatusUpdate": "2020-06-26T03:09:00Z",
    "DataQualityLevel": 3,
    "DateCreated": "2019-12-24T09:23:00Z",
    "SubmissionStatusTypeID": 100
}