{
    "IsRecentlyVerified": false,
    "ID": 161983,
    "UUID": "D4C61DE7-B52D-4E77-BB7D-20CFC03743A8",
    "DataProviderID": 1,
    "OperatorID": 45,
    "UsageTypeID": 6,
    "AddressInfo": {
        "ID": 162340,
        "Title": "44 Viale Regina Margherita",
        "AddressLine1": "44 Viale Regina Margherita",
        "Town": "Casteddu/Cagliari",
        "StateOrProvince": "Sardinia",
        "Postcode": "09121-09131, 09134",
        "CountryID": 112,
        "Latitude": 39.214124557121494,
        "Longitude": 9.11639758707065,
        "ContactTelephone1": "070670342",
        "DistanceUnit": 0
    },
    "Connections": [
        {
            "ID": 233135,
            "ConnectionTypeID": 1036,
            "StatusTypeID": 50,
            "LevelID": 2,
            "Amps": 32,
            "Voltage": 400,
            "PowerKW": 22,
            "CurrentTypeID": 20,
            "Quantity": 1
        }
    ],
    "NumberOfPoints": 1,
    "StatusTypeID": 50,
    "DateLastStatusUpdate": "2020-07-31T15:15:00Z",
    "DataQualityLevel": 1,
    "DateCreated": "2020-07-30T09:10:00Z",
    "SubmissionStatusTypeID": 200
}