{
    "IsRecentlyVerified": false,
    "ID": 67617,
    "UUID": "B9BA7492-2355-4B3A-80BC-41B56051F859",
    "DataProviderID": 1,
    "DataProvidersReference": "3375",
    "AddressInfo": {
        "ID": 67963,
        "Title": "Värmdö kommunhus",
        "AddressLine1": "Skogsbovägen 11",
        "Town": "GUSTAVSBERG",
        "StateOrProvince": "STOCKHOLM",
        "Postcode": "13430",
        "CountryID": 216,
        "Latitude": 59.32291,
        "Longitude": 18.40047,
        "AccessComments": "Intill kommunhuset",
        "DistanceUnit": 0
    },
    "Connections": [
        {
            "ID": 93171,
            "ConnectionTypeID": 0,
            "Reference": "1",
            "LevelID": 2,
            "Amps": 16,
            "Voltage": 230,
            "PowerKW": 3.7,
            "Comments": "Mode 1"
        },
        {
            "ID": 93172,
            "ConnectionTypeID": 0,
            "Reference": "2",
            "LevelID": 2,
            "Amps": 16,
            "Voltage": 230,
            "PowerKW": 3.7,
            "Comments": "Mode 1"
        },
        {
            "ID": 93173,
            "ConnectionTypeID": 0,
            "Reference": "3",
            "LevelID": 2,
            "Amps": 16,
            "Voltage": 230,
            "PowerKW": 3.7,
            "Comments": "Mode 1"
        },
        {
            "ID": 93174,
            "ConnectionTypeID": 0,
            "Reference": "4",
            "LevelID": 2,
            "Amps": 16,
            "Voltage": 230,
            "PowerKW": 3.7,
            "Comments": "Mode 1"
        },
        {
            "ID": 93175,
            "ConnectionTypeID": 0,
            "Reference": "5",
            "LevelID": 2,
            "Amps": 16,
            "Voltage": 230,
            "PowerKW": 3.7,
            "Comments": "Mode 1"
        },
        {
            "ID": 93176,
            "ConnectionTypeID": 0,
            "Reference": "6",
            "LevelID": 2,
            "Amps": 16,
            "Voltage": 230,
            "PowerKW": 3.7,
            "Comments": "Mode 1"
        },
        {
            "ID": 93177,
            "ConnectionTypeID": 0,
            "Reference": "7",
            "LevelID": 2,
            "Amps": 16,
            "Voltage": 230,
            "PowerKW": 3.7,
            "Comments": "Mode 1"
        }
    ],
    "NumberOfPoints": 7,
    "DateLastStatusUpdate": "2020-05-26T08:22:00Z",
    "DataQualityLevel": 2,
    "DateCreated": "2016-05-29T06:25:00Z",
    "SubmissionStatusTypeID": 100
}