{
    "IsRecentlyVerified": false,
    "ID": 62267,
    "UUID": "9D8B2E33-5BCE-4AEF-A7D9-212991240DAA",
    "DataProviderID": 2,
    "DataProvidersReference": "73101",
    "OperatorID": 1242,
    "UsageTypeID": 2,
    "AddressInfo": {
        "ID": 62613,
        "Title": "RIC 4 (QR 0001043)",
        "AddressLine1": "2101 Village Rd",
        "Town": "Dearborn",
        "StateOrProvince": "MI",
        "Postcode": "48124",
        "CountryID": 2,
        "Latitude": 42.2935172626,
        "Longitude": -83.2389180094,
        "ContactTelephone1": "855-443-3873",
        "AccessComments": "",
        "RelatedURL": "https://www.gewattstation.com",
        "DistanceUnit": 0
    },
    "Connections": [
        {
            "ID": 79170,
            "ConnectionTypeID": 1,
            "LevelID": 2,
            "Amps": 16,
            "Voltage": 230,
            "PowerKW": 3.7,
            "CurrentTypeID": 10,
            "Quantity": 1
        }
    ],
    "DateLastStatusUpdate": "2020-06-26T03:05:00Z",
    "DataQualityLevel": 3,
    "DateCreated": "2016-03-03T11:38:00Z",
    "SubmissionStatusTypeID": 100
}