{
    "UserComments": [
        {
            "ID": 6492,
            "ChargePointID": 49200,
            "CommentTypeID": 10,
            "UserName": "Steve Clarke",
            "Comment": "Both bays initially ICE'd. Both charge points working.",
            "DateCreated": "2015-09-15T19:04:24.21Z",
            "User": {
                "ID": 6303,
                "Username": "Steve Clarke"
            },
            "CheckinStatusTypeID": 10
        },
        {
            "ID": 6377,
            "ChargePointID": 49200,
            "CommentTypeID": 10,
            "UserName": "Steve Clarke",
            "Comment": "Despite there being a big 'EV ONLY' sign on the tarmac in front of the two EV charging bays I often come across one of the spaces which has been ICE'd, quite often it is an ICE owner with a baby seat in the car as there is a sign in one of the EV bays, (just to add confusion), which states 'parent and child parking only'. This is obviously directed to an EV owner with a child in situ, as opposed to an ICE owner. I have had several 'moan' sessions with the folk in the Sports Centre but to no avail. Only once have had to wait due to both slots being occupied, (ICE plus Leaf).",
            "Rating": 5,
            "DateCreated": "2015-08-31T21:56:50.333Z",
            "User": {
                "ID": 6303,
                "Username": "Steve Clarke"
            },
            "CheckinStatusTypeID": 10
        },
        {
            "ID": 5992,
            "ChargePointID": 49200,
            "CommentTypeID": 10,
            "UserName": "Stevie",
            "Comment": "",
            "Rating": 5,
            "DateCreated": "2015-07-22T16:47:21.03Z",
            "User": {
                "ID": 5050,
                "Username": "Stevie"
            },
            "CheckinStatusTypeID": 10
        },
        {
            "ID": 4940,
            "ChargePointID": 49200,
            "CommentTypeID": 10,
            "UserName": "paul123",
            "Comment": "25/7 access, charged Zoe pretty quickly (not rapid but still pretty good). You need to have your own cable. Only type2 sockets. ",
            "Rating": 5,
            "DateCreated": "2015-07-14T18:16:23.303Z",
            "User": {
                "ID": 5039,
                "Username": "paul123"
            },
            "CheckinStatusTypeID": 10
        }
    ],
    "IsRecentlyVerified": false,
    "ID": 49200,
    "UUID": "172199CF-C3BE-482B-93CC-06C777AC4D9D",
    "DataProviderID": 1,
    "OperatorID": 3315,
    "OperatorsReference": "50578",
    "UsageTypeID": 1,
    "UsageCost": "Free",
    "AddressInfo": {
        "ID": 49546,
        "Title": "Montrose Sports Complex",
        "AddressLine1": "Marine Avenue",
        "Town": "Montrose",
        "StateOrProvince": "Montrose",
        "Postcode": "DD10 8TR",
        "CountryID": 1,
        "Latitude": 56.7091640552556,
        "Longitude": -2.46011137962341,
        "DistanceUnit": 0
    },
    "Connections": [
        {
            "ID": 60805,
            "ConnectionTypeID": 25,
            "StatusTypeID": 50,
            "LevelID": 2,
            "Amps": 32,
            "Voltage": 400,
            "PowerKW": 22,
            "CurrentTypeID": 20,
            "Quantity": 2
        }
    ],
    "NumberOfPoints": 4,
    "GeneralComments": "24/7 Access",
    "StatusTypeID": 50,
    "DateLastStatusUpdate": "2018-04-09T15:49:00Z",
    "DataQualityLevel": 1,
    "DateCreated": "2015-07-13T18:30:00Z",
    "SubmissionStatusTypeID": 200
}