{
    "IsRecentlyVerified": false,
    "ID": 124087,
    "UUID": "F3178BAB-942D-455A-9BBF-96AD1E9F678B",
    "DataProviderID": 2,
    "DataProvidersReference": "73144",
    "OperatorID": 5,
    "UsageTypeID": 1,
    "AddressInfo": {
        "ID": 124433,
        "Title": "EV 1-",
        "AddressLine1": "20103 Lake Chabot Rd",
        "Town": "Castro Valley",
        "StateOrProvince": "CA",
        "Postcode": "94546",
        "CountryID": 2,
        "Latitude": 37.6980005,
        "Longitude": -122.0887463,
        "ContactTelephone1": "888-758-4389",
        "AccessComments": "24 hours daily",
        "RelatedURL": "http://www.chargepoint.com/",
        "DistanceUnit": 0
    },
    "Connections": [
        {
            "ID": 174137,
            "ConnectionTypeID": 1,
            "LevelID": 2,
            "Amps": 16,
            "Voltage": 230,
            "PowerKW": 3,
            "CurrentTypeID": 10,
            "Quantity": 6
        }
    ],
    "DateLastStatusUpdate": "2019-12-24T09:14:00Z",
    "DataQualityLevel": 3,
    "DateCreated": "2019-04-06T05:03:00Z",
    "SubmissionStatusTypeID": 100
}