{
    "IsRecentlyVerified": false,
    "ID": 46181,
    "UUID": "45BDE3F4-2D9C-4970-A003-71549C24F2BA",
    "DataProviderID": 1,
    "DataProvidersReference": "1281",
    "AddressInfo": {
        "ID": 46527,
        "Title": "Etterstad Vest Borettslag, Oslo",
        "AddressLine1": "Etterstadsletta 97",
        "Town": "OSLO",
        "StateOrProvince": "Oslo",
        "Postcode": "0659",
        "CountryID": 168,
        "Latitude": 59.9073,
        "Longitude": 10.79751,
        "AccessComments": "",
        "DistanceUnit": 0
    },
    "Connections": [
        {
            "ID": 56844,
            "ConnectionTypeID": 0,
            "Reference": "1",
            "LevelID": 2,
            "Amps": 16,
            "Voltage": 230,
            "PowerKW": 3.7,
            "Comments": "Mode 1"
        },
        {
            "ID": 85483,
            "ConnectionTypeID": 0,
            "Reference": "2",
            "LevelID": 2,
            "Amps": 16,
            "Voltage": 230,
            "PowerKW": 3.7,
            "Comments": "Mode 1"
        },
        {
            "ID": 85484,
            "ConnectionTypeID": 0,
            "Reference": "3",
            "LevelID": 2,
            "Amps": 16,
            "Voltage": 230,
            "PowerKW": 3.7,
            "Comments": "Mode 1"
        },
        {
            "ID": 88551,
            "ConnectionTypeID": 0,
            "Reference": "4",
            "LevelID": 2,
            "Amps": 16,
            "Voltage": 230,
            "PowerKW": 3.7,
            "Comments": "Mode 1"
        }
    ],
    "NumberOfPoints": 4,
    "DateLastStatusUpdate": "2020-05-26T08:23:00Z",
    "DataQualityLevel": 2,
    "DateCreated": "2015-05-03T00:54:00Z",
    "SubmissionStatusTypeID": 100
}