{
    "IsRecentlyVerified": false,
    "ID": 121620,
    "UUID": "BF2FC959-0396-474B-8B04-0B601245FCF0",
    "DataProviderID": 2,
    "DataProvidersReference": "121221",
    "OperatorID": 5,
    "UsageTypeID": 1,
    "AddressInfo": {
        "ID": 121966,
        "Title": "THE COLORADAN",
        "AddressLine1": "1750 Wewatta St Dual Station",
        "Town": "Denver",
        "StateOrProvince": "CO",
        "Postcode": "80202",
        "CountryID": 2,
        "Latitude": 39.7542124,
        "Longitude": -105.0007959,
        "ContactTelephone1": "888-758-4389",
        "AccessComments": "24 hours daily",
        "RelatedURL": "http://www.chargepoint.com/",
        "DistanceUnit": 0
    },
    "Connections": [
        {
            "ID": 171391,
            "ConnectionTypeID": 1,
            "LevelID": 2,
            "Amps": 16,
            "Voltage": 230,
            "PowerKW": 3,
            "CurrentTypeID": 10,
            "Quantity": 2
        }
    ],
    "DateLastStatusUpdate": "2019-04-06T04:01:00Z",
    "DataQualityLevel": 3,
    "DateCreated": "2019-04-06T04:01:00Z",
    "SubmissionStatusTypeID": 100
}