{
    "IsRecentlyVerified": false,
    "ID": 16246,
    "UUID": "7A970CC9-F08C-4081-BE8B-5E18D3F1DB09",
    "DataProviderID": 2,
    "DataProvidersReference": "51076",
    "UsageTypeID": 1,
    "AddressInfo": {
        "ID": 16591,
        "Title": "Shottenkirk Chevrolet",
        "AddressLine1": "755 Hickman Rd",
        "Town": "Waukee",
        "StateOrProvince": "IA",
        "Postcode": "50263",
        "CountryID": 2,
        "Latitude": 41.615062,
        "Longitude": -93.858593,
        "ContactTelephone1": "515-987-8575",
        "AccessComments": "24 hours daily",
        "RelatedURL": "",
        "DistanceUnit": 0
    },
    "Connections": [
        {
            "ID": 16928,
            "ConnectionTypeID": 1,
            "LevelID": 2,
            "Amps": 16,
            "Voltage": 230,
            "PowerKW": 3.7,
            "CurrentTypeID": 10,
            "Quantity": 1
        },
        {
            "ID": 22137,
            "ConnectionTypeID": 1,
            "LevelID": 2,
            "Quantity": 1
        }
    ],
    "DateLastStatusUpdate": "2020-06-26T03:04:00Z",
    "DataQualityLevel": 3,
    "DateCreated": "2013-03-21T04:48:00Z",
    "SubmissionStatusTypeID": 100
}