{
    "IsRecentlyVerified": false,
    "ID": 99208,
    "UUID": "9B6AE7F2-9071-4378-9C69-77185E516AA2",
    "DataProviderID": 1,
    "OperatorID": 25,
    "OperatorsReference": "barkinganddagenham-becontreeavenue692",
    "UsageTypeID": 4,
    "UsageCost": "£0.059/minute; min £1.18; other tariffs available",
    "AddressInfo": {
        "ID": 99554,
        "Title": "Becontree Avenue 692",
        "AddressLine1": "692 Becontree Avenue (wood Lane)",
        "Town": "ROMFORD",
        "Postcode": "RM8 1BD",
        "CountryID": 1,
        "Latitude": 51.5605291074,
        "Longitude": 0.147652060745,
        "DistanceUnit": 0
    },
    "Connections": [
        {
            "ID": 140152,
            "ConnectionTypeID": 25,
            "StatusTypeID": 50,
            "LevelID": 2,
            "Amps": 32,
            "Voltage": 230,
            "PowerKW": 7,
            "CurrentTypeID": 10,
            "Quantity": 3
        },
        {
            "ID": 140153,
            "ConnectionTypeID": 1,
            "StatusTypeID": 50,
            "LevelID": 2,
            "Amps": 16,
            "Voltage": 230,
            "PowerKW": 4,
            "CurrentTypeID": 10,
            "Quantity": 3
        }
    ],
    "NumberOfPoints": 3,
    "StatusTypeID": 50,
    "DateLastStatusUpdate": "2018-07-23T15:37:00Z",
    "DataQualityLevel": 1,
    "DateCreated": "2018-01-24T06:31:00Z",
    "SubmissionStatusTypeID": 200
}