{
    "IsRecentlyVerified": false,
    "ID": 56704,
    "UUID": "8B086FB7-F820-4FC9-A74C-335C11CAC11C",
    "DataProviderID": 1,
    "DataProvidersReference": "3091",
    "AddressInfo": {
        "ID": 57050,
        "Title": "Electric Arena, Kirkkonummi (1092)",
        "AddressLine1": "Eteläinen Salmitie 1",
        "Town": "Masala",
        "StateOrProvince": "Uusimaa",
        "Postcode": "02430",
        "CountryID": 79,
        "Latitude": 60.152573,
        "Longitude": 24.536096,
        "AccessComments": "Electric Arenan yhteydessä",
        "DistanceUnit": 0
    },
    "Connections": [
        {
            "ID": 71503,
            "ConnectionTypeID": 0,
            "LevelID": 2,
            "Amps": 16,
            "Voltage": 230,
            "PowerKW": 3.68
        },
        {
            "ID": 224386,
            "ConnectionTypeID": 0,
            "Reference": "1",
            "LevelID": 2,
            "Amps": 32,
            "Voltage": 400,
            "PowerKW": 22,
            "Comments": "Mode 3"
        }
    ],
    "NumberOfPoints": 1,
    "DateLastStatusUpdate": "2020-05-26T08:23:00Z",
    "DataQualityLevel": 2,
    "DateCreated": "2015-11-06T03:39:00Z",
    "SubmissionStatusTypeID": 100
}