{
    "UserComments": [
        {
            "ID": 20720,
            "ChargePointID": 14923,
            "CommentTypeID": 1000,
            "UserName": "Guillaume",
            "Comment": "This unit has been offline for a number of months, since the extensive works in the car park. ",
            "DateCreated": "2019-02-15T16:17:23.573Z",
            "User": {
                "ID": 19946,
                "Username": "Guillaume"
            },
            "CheckinStatusTypeID": 25
        }
    ],
    "MediaItems": [
        {
            "ID": 17588,
            "ChargePointID": 14923,
            "ItemURL": "https://s3-ap-southeast-2.amazonaws.com/openchargemap/images/IE/OCM14923/OCM-14923.orig.2019021516181625.jpg",
            "ItemThumbnailURL": "https://s3-ap-southeast-2.amazonaws.com/openchargemap/images/IE/OCM14923/OCM-14923.thmb.2019021516181625.jpg",
            "Comment": "",
            "IsEnabled": true,
            "IsVideo": false,
            "IsFeaturedItem": false,
            "IsExternalResource": false,
            "User": {
                "ID": 19946,
                "Username": "Guillaume"
            },
            "DateCreated": "2019-02-15T16:18:00Z"
        }
    ],
    "IsRecentlyVerified": false,
    "ID": 14923,
    "UUID": "7C6BB1FD-6761-4BBF-888C-F01FF26C7CB5",
    "DataProviderID": 1,
    "OperatorID": 22,
    "OperatorsReference": "C64RL",
    "AddressInfo": {
        "ID": 15269,
        "Title": "Strand Road Car Park",
        "AddressLine1": "Monkstown",
        "Town": "Cork",
        "StateOrProvince": "County Cork",
        "CountryID": 3,
        "Latitude": 51.849032,
        "Longitude": -8.331938,
        "DistanceUnit": 0
    },
    "Connections": [
        {
            "ID": 13486,
            "ConnectionTypeID": 25,
            "StatusTypeID": 100,
            "LevelID": 2,
            "Amps": 32,
            "Voltage": 400,
            "PowerKW": 22,
            "CurrentTypeID": 20,
            "Quantity": 2
        }
    ],
    "NumberOfPoints": 2,
    "StatusTypeID": 100,
    "DateLastStatusUpdate": "2019-06-03T09:41:00Z",
    "DataQualityLevel": 2,
    "DateCreated": "2012-12-11T15:08:00Z",
    "SubmissionStatusTypeID": 100
}