{
    "IsRecentlyVerified": false,
    "ID": 3411,
    "UUID": "0B3BB104-2C18-4119-8C16-ACC529D68A1C",
    "DataProviderID": 1,
    "OperatorID": 6,
    "UsageTypeID": 6,
    "AddressInfo": {
        "ID": 3412,
        "Title": "Pacific Nissan",
        "AddressLine1": "4433 Mission Bay Dr",
        "Town": "Pacific Beach",
        "StateOrProvince": "CA",
        "Postcode": "92109",
        "CountryID": 2,
        "Latitude": 32.802,
        "Longitude": -117.2157,
        "ContactTelephone1": "858-581-3200",
        "DistanceUnit": 0
    },
    "Connections": [],
    "NumberOfPoints": 2,
    "GeneralComments": "Cost To Charge: Free Access Hours: Verify",
    "DateLastStatusUpdate": "2019-12-15T06:07:00Z",
    "DateCreated": "2010-02-28T00:00:00Z",
    "SubmissionStatusTypeID": 200
}