{
    "IsRecentlyVerified": false,
    "ID": 7828,
    "UUID": "9D2A08C9-2C2E-42F4-8035-0AC6916464A8",
    "DataProviderID": 15,
    "DataProvidersReference": "6748",
    "OperatorID": 26,
    "AddressInfo": {
        "ID": 7725,
        "Title": "100 Appalachian Dr",
        "AddressLine1": "100 Appalachian Dr",
        "Town": "Beckley",
        "StateOrProvince": "WV",
        "Postcode": "25801",
        "CountryID": 2,
        "Latitude": 37.81572,
        "Longitude": -81.18435,
        "ContactTelephone1": "(304) 253-2755",
        "RelatedURL": "http://carstations.com/6748",
        "DistanceUnit": 0
    },
    "Connections": [
        {
            "ID": 5258,
            "ConnectionTypeID": 1,
            "Reference": "J1772",
            "LevelID": 2
        }
    ],
    "StatusTypeID": 0,
    "DateLastStatusUpdate": "2017-11-04T14:04:00Z",
    "DataQualityLevel": 1,
    "DateCreated": "2011-11-11T12:05:00Z",
    "SubmissionStatusTypeID": 100
}