{
    "IsRecentlyVerified": false,
    "ID": 56618,
    "UUID": "A0E85102-F5D0-4F02-9816-3EE2076FBC7C",
    "DataProviderID": 2,
    "DataProvidersReference": "70715",
    "OperatorID": 5,
    "UsageTypeID": 1,
    "AddressInfo": {
        "ID": 56964,
        "Title": "ANDERSON BMW",
        "AddressLine1": "360 S Illinois Rte 31",
        "Town": "Crystal Lake",
        "StateOrProvince": "IL",
        "Postcode": "60012",
        "CountryID": 2,
        "Latitude": 42.2512928,
        "Longitude": -88.287511,
        "ContactTelephone1": "888-758-4389",
        "AccessComments": "24 hours daily",
        "RelatedURL": "http://www.chargepoint.com/",
        "DistanceUnit": 0
    },
    "Connections": [
        {
            "ID": 71378,
            "ConnectionTypeID": 1,
            "LevelID": 2,
            "Amps": 16,
            "Voltage": 230,
            "PowerKW": 3.7,
            "CurrentTypeID": 10,
            "Quantity": 1
        }
    ],
    "DateLastStatusUpdate": "2020-06-26T03:05:00Z",
    "DataQualityLevel": 3,
    "DateCreated": "2015-11-04T08:42:00Z",
    "SubmissionStatusTypeID": 100
}