{
    "MediaItems": [
        {
            "ID": 7872,
            "ChargePointID": 56248,
            "ItemURL": "https://s3-ap-southeast-2.amazonaws.com/openchargemap/images/DE/OCM56248/OCM-56248.orig.2016080117463336.jpeg",
            "ItemThumbnailURL": "https://s3-ap-southeast-2.amazonaws.com/openchargemap/images/DE/OCM56248/OCM-56248.thmb.2016080117463336.jpeg",
            "Comment": "22kw AC and 20kw CCS. No CHAdeMO. ",
            "IsEnabled": true,
            "IsVideo": false,
            "IsFeaturedItem": false,
            "IsExternalResource": false,
            "User": {
                "ID": 11618,
                "Username": "William Hennum"
            },
            "DateCreated": "2016-08-01T17:47:00Z"
        }
    ],
    "IsRecentlyVerified": false,
    "ID": 56248,
    "UUID": "1D09B212-82D8-4A09-8D05-65707B041B10",
    "DataProviderID": 1,
    "OperatorID": 45,
    "UsageTypeID": 1,
    "UsageCost": "0",
    "AddressInfo": {
        "ID": 56594,
        "Title": "Otto-Wels-Platz",
        "AddressLine1": "Otto-Wels-Platz",
        "Town": "Wolfsburg",
        "StateOrProvince": "Wolfsburg",
        "Postcode": "38440",
        "CountryID": 87,
        "Latitude": 52.4237645,
        "Longitude": 10.791528500000027,
        "AccessComments": "Kostenloses Laden durchgängig ohne Ladekarte. Fest angeschlossenes Kabel für CCS und Typ2 Dose.",
        "RelatedURL": "http://www.metropolregion.de/pages/organisation___themen/themen/verkehr-___elektromobilitaet/schaufenster_elektromobilitaet/subpages/ct_20220/index.php?ACTION=MENUEPUNKT&ID=2912&displayText=22624",
        "DistanceUnit": 0
    },
    "Connections": [
        {
            "ID": 70917,
            "ConnectionTypeID": 25,
            "StatusTypeID": 50,
            "LevelID": 2,
            "Amps": 32,
            "Voltage": 400,
            "PowerKW": 22,
            "CurrentTypeID": 20,
            "Quantity": 1
        },
        {
            "ID": 70918,
            "ConnectionTypeID": 2,
            "StatusTypeID": 50,
            "LevelID": 3,
            "PowerKW": 20,
            "CurrentTypeID": 30,
            "Quantity": 0
        },
        {
            "ID": 70919,
            "ConnectionTypeID": 33,
            "StatusTypeID": 50,
            "LevelID": 3,
            "PowerKW": 20,
            "CurrentTypeID": 30,
            "Quantity": 1
        }
    ],
    "NumberOfPoints": 2,
    "StatusTypeID": 50,
    "DateLastStatusUpdate": "2016-08-01T17:47:00Z",
    "DataQualityLevel": 1,
    "DateCreated": "2015-10-23T06:37:00Z",
    "SubmissionStatusTypeID": 200
}