{
    "IsRecentlyVerified": false,
    "ID": 187013,
    "UUID": "77F1C7C3-8676-4137-BBE9-2801AA4A0568",
    "DataProviderID": 29,
    "DataProvidersReference": "20297",
    "AddressInfo": {
        "ID": 187372,
        "Title": "Finower Straße 2",
        "AddressLine1": "Finower Straße 2",
        "Town": "Melchow",
        "Postcode": "16230",
        "CountryID": 87,
        "Latitude": 52.776172,
        "Longitude": 13.702498,
        "DistanceUnit": 0
    },
    "Connections": [
        {
            "ID": 300950,
            "ConnectionTypeID": 25,
            "StatusTypeID": 50,
            "LevelID": 2,
            "PowerKW": 22,
            "CurrentTypeID": 20
        }
    ],
    "StatusTypeID": 50,
    "DateLastStatusUpdate": "2021-07-12T02:50:00Z",
    "MetadataValues": [
        {
            "ID": 19253,
            "MetadataFieldID": 4,
            "ItemValue": "Data from the German chargepoint registry provided by Bundesnetzagentur.de under the CC-BY 4.0 license"
        }
    ],
    "DataQualityLevel": 3,
    "DateCreated": "2021-07-12T02:50:00Z",
    "SubmissionStatusTypeID": 100
}