{
    "IsRecentlyVerified": false,
    "ID": 167273,
    "UUID": "78C1C2D1-768D-4D4D-84E6-890DB949C42A",
    "DataProviderID": 1,
    "OperatorID": 80,
    "UsageTypeID": 4,
    "AddressInfo": {
        "ID": 167632,
        "Title": "Roma Silone | EnelX",
        "AddressLine1": "Via Ingazio Silone",
        "Town": "Roma",
        "StateOrProvince": "RM",
        "Postcode": "00143",
        "CountryID": 112,
        "Latitude": 41.81361292365381,
        "Longitude": 12.483052497286621,
        "RelatedURL": "https://www.enelx.com/it/it/emobility",
        "DistanceUnit": 0
    },
    "Connections": [
        {
            "ID": 253318,
            "ConnectionTypeID": 25,
            "StatusTypeID": 50,
            "LevelID": 2,
            "Amps": 32,
            "Voltage": 400,
            "PowerKW": 22,
            "CurrentTypeID": 20,
            "Quantity": 1
        },
        {
            "ID": 254601,
            "ConnectionTypeID": 36,
            "StatusTypeID": 50,
            "LevelID": 2,
            "Amps": 16,
            "Voltage": 240,
            "PowerKW": 3.7,
            "CurrentTypeID": 10,
            "Quantity": 1
        }
    ],
    "NumberOfPoints": 2,
    "StatusTypeID": 50,
    "DateLastStatusUpdate": "2020-09-09T15:18:00Z",
    "DataQualityLevel": 1,
    "DateCreated": "2020-09-04T20:02:00Z",
    "SubmissionStatusTypeID": 200
}