{
    "IsRecentlyVerified": false,
    "ID": 175948,
    "UUID": "4CE82D34-4009-4E8D-8CAF-9D9FE63B1941",
    "DataProviderID": 1,
    "OperatorID": 101,
    "UsageTypeID": 4,
    "UsageCost": "0,35€/kWh bei Spontanladung",
    "AddressInfo": {
        "ID": 176307,
        "Title": "Energiewerkstatt",
        "AddressLine1": " Fössestraße 97a",
        "Town": "Hanover",
        "StateOrProvince": "Lower Saxony",
        "Postcode": "30453",
        "CountryID": 87,
        "Latitude": 52.36841925877897,
        "Longitude": 9.701393596858907,
        "DistanceUnit": 0
    },
    "Connections": [
        {
            "ID": 273258,
            "ConnectionTypeID": 25,
            "StatusTypeID": 50,
            "LevelID": 2,
            "Amps": 32,
            "Voltage": 400,
            "PowerKW": 22,
            "CurrentTypeID": 20,
            "Quantity": 1
        }
    ],
    "NumberOfPoints": 1,
    "GeneralComments": "Keba Ladestation auf dem Parkplatz der Energiewerkstatt. Mit EnBW, ADAC, PlugSurfing, EinfachStromLaden u. A. Ladekarten freischaltbar. ",
    "StatusTypeID": 50,
    "DateLastStatusUpdate": "2021-06-20T09:50:00Z",
    "DataQualityLevel": 1,
    "DateCreated": "2021-06-20T09:50:00Z",
    "SubmissionStatusTypeID": 200
}