{
    "IsRecentlyVerified": false,
    "ID": 28545,
    "UUID": "9BB76AE7-FEE5-4D5D-9BAE-5BEA576146E0",
    "DataProviderID": 2,
    "DataProvidersReference": "63175",
    "UsageTypeID": 1,
    "AddressInfo": {
        "ID": 28891,
        "Title": "Big Y",
        "AddressLine1": "22 Spencer Plain Rd",
        "Town": "Old Saybrook",
        "StateOrProvince": "CT",
        "Postcode": "06475",
        "CountryID": 2,
        "Latitude": 41.286482,
        "Longitude": -72.416634,
        "ContactTelephone1": "413-504-4720",
        "AccessComments": "24 hours daily",
        "RelatedURL": "",
        "DistanceUnit": 0
    },
    "Connections": [
        {
            "ID": 31366,
            "ConnectionTypeID": 1,
            "LevelID": 2,
            "Amps": 16,
            "Voltage": 230,
            "PowerKW": 3.7,
            "CurrentTypeID": 10,
            "Quantity": 1
        }
    ],
    "DateLastStatusUpdate": "2020-06-26T03:04:00Z",
    "DataQualityLevel": 3,
    "DateCreated": "2014-11-28T03:38:00Z",
    "SubmissionStatusTypeID": 100
}