{
    "IsRecentlyVerified": false,
    "ID": 121306,
    "UUID": "B2092372-09B5-4420-9D92-EEA6B3E9A1FF",
    "DataProviderID": 2,
    "DataProvidersReference": "121050",
    "OperatorID": 5,
    "UsageTypeID": 1,
    "AddressInfo": {
        "ID": 121652,
        "Title": "CITY HAVERHILL",
        "AddressLine1": "4 Summer St",
        "Town": "Haverhill",
        "StateOrProvince": "MA",
        "Postcode": "01830",
        "CountryID": 2,
        "Latitude": 42.7779371,
        "Longitude": -71.0762709,
        "ContactTelephone1": "888-758-4389",
        "AccessComments": "24 hours daily",
        "RelatedURL": "http://www.chargepoint.com/",
        "DistanceUnit": 0
    },
    "Connections": [
        {
            "ID": 170748,
            "ConnectionTypeID": 1,
            "LevelID": 2,
            "Amps": 16,
            "Voltage": 230,
            "PowerKW": 3.7,
            "CurrentTypeID": 10,
            "Quantity": 2
        }
    ],
    "DateLastStatusUpdate": "2020-06-26T03:06:00Z",
    "DataQualityLevel": 3,
    "DateCreated": "2019-04-01T05:00:00Z",
    "SubmissionStatusTypeID": 100
}