{
    "UserComments": [
        {
            "ID": 21947,
            "ChargePointID": 132700,
            "CommentTypeID": 10,
            "UserName": "polianto",
            "Comment": "https://www.forumelettrico.it/forum/colonnina-fast-50kw-nissan-charge-conc-arricar-verdellino-strada-statale-francesca-12-t8450.html",
            "Rating": 4,
            "RelatedURL": "https://www.forumelettrico.it/forum/colonnina-fast-50kw-nissan-charge-conc-arricar-verdellino-strada-statale-francesca-12-t8450.html",
            "DateCreated": "2019-12-26T16:21:39.38Z",
            "User": {
                "ID": 1606,
                "Username": "polianto"
            },
            "CheckinStatusTypeID": 10,
            "IsActionedByEditor": false
        }
    ],
    "MediaItems": [
        {
            "ID": 20761,
            "ChargePointID": 132700,
            "ItemURL": "https://s3-ap-southeast-2.amazonaws.com/openchargemap/images/IT/OCM132700/OCM-132700.orig.2019122807241405.jpg",
            "ItemThumbnailURL": "https://s3-ap-southeast-2.amazonaws.com/openchargemap/images/IT/OCM132700/OCM-132700.thmb.2019122807241405.jpg",
            "Comment": "",
            "IsEnabled": true,
            "IsVideo": false,
            "IsFeaturedItem": false,
            "IsExternalResource": false,
            "User": {
                "ID": 11749,
                "Username": "ForumElettrico.it"
            },
            "DateCreated": "2019-12-28T07:24:00Z"
        },
        {
            "ID": 20762,
            "ChargePointID": 132700,
            "ItemURL": "https://s3-ap-southeast-2.amazonaws.com/openchargemap/images/IT/OCM132700/OCM-132700.orig.2019122807241963.jpg",
            "ItemThumbnailURL": "https://s3-ap-southeast-2.amazonaws.com/openchargemap/images/IT/OCM132700/OCM-132700.thmb.2019122807241963.jpg",
            "Comment": "",
            "IsEnabled": true,
            "IsVideo": false,
            "IsFeaturedItem": false,
            "IsExternalResource": false,
            "User": {
                "ID": 11749,
                "Username": "ForumElettrico.it"
            },
            "DateCreated": "2019-12-28T07:24:00Z"
        },
        {
            "ID": 20740,
            "ChargePointID": 132700,
            "ItemURL": "https://s3-ap-southeast-2.amazonaws.com/openchargemap/images/IT/OCM132700/OCM-132700.orig.2019122615415437.jpg",
            "ItemThumbnailURL": "https://s3-ap-southeast-2.amazonaws.com/openchargemap/images/IT/OCM132700/OCM-132700.thmb.2019122615415437.jpg",
            "Comment": "",
            "IsEnabled": true,
            "IsVideo": false,
            "IsFeaturedItem": false,
            "IsExternalResource": false,
            "User": {
                "ID": 1606,
                "Username": "polianto"
            },
            "DateCreated": "2019-12-26T15:42:00Z"
        },
        {
            "ID": 20741,
            "ChargePointID": 132700,
            "ItemURL": "https://s3-ap-southeast-2.amazonaws.com/openchargemap/images/IT/OCM132700/OCM-132700.orig.2019122615421117.jpg",
            "ItemThumbnailURL": "https://s3-ap-southeast-2.amazonaws.com/openchargemap/images/IT/OCM132700/OCM-132700.thmb.2019122615421117.jpg",
            "Comment": "",
            "IsEnabled": true,
            "IsVideo": false,
            "IsFeaturedItem": false,
            "IsExternalResource": false,
            "User": {
                "ID": 1606,
                "Username": "polianto"
            },
            "DateCreated": "2019-12-26T15:42:00Z"
        },
        {
            "ID": 20739,
            "ChargePointID": 132700,
            "ItemURL": "https://s3-ap-southeast-2.amazonaws.com/openchargemap/images/IT/OCM132700/OCM-132700.orig.2019122615411610.jpg",
            "ItemThumbnailURL": "https://s3-ap-southeast-2.amazonaws.com/openchargemap/images/IT/OCM132700/OCM-132700.thmb.2019122615411610.jpg",
            "Comment": "",
            "IsEnabled": true,
            "IsVideo": false,
            "IsFeaturedItem": false,
            "IsExternalResource": false,
            "User": {
                "ID": 1606,
                "Username": "polianto"
            },
            "DateCreated": "2019-12-26T15:41:00Z"
        }
    ],
    "IsRecentlyVerified": false,
    "ID": 132700,
    "UUID": "83A77B36-AD83-4BA9-8E9D-C2BD68E388D6",
    "DataProviderID": 1,
    "OperatorID": 3266,
    "UsageTypeID": 4,
    "AddressInfo": {
        "ID": 133046,
        "Title": "Concessionario Nissan Arricar Srl",
        "AddressLine1": "Strada Statale Francesca, 12",
        "Town": "Verdellino",
        "StateOrProvince": "BG",
        "Postcode": "24040",
        "CountryID": 112,
        "Latitude": 45.59007779743996,
        "Longitude": 9.617104176751127,
        "RelatedURL": "https://www.arricar.it/",
        "DistanceUnit": 0
    },
    "Connections": [
        {
            "ID": 185784,
            "ConnectionTypeID": 2,
            "StatusTypeID": 50,
            "LevelID": 3,
            "Amps": 120,
            "Voltage": 500,
            "PowerKW": 50,
            "CurrentTypeID": 30,
            "Quantity": 1
        },
        {
            "ID": 185785,
            "ConnectionTypeID": 33,
            "StatusTypeID": 50,
            "LevelID": 3,
            "Amps": 120,
            "Voltage": 500,
            "PowerKW": 50,
            "CurrentTypeID": 30,
            "Quantity": 1
        },
        {
            "ID": 185786,
            "ConnectionTypeID": 1036,
            "StatusTypeID": 50,
            "LevelID": 3,
            "Amps": 64,
            "Voltage": 400,
            "PowerKW": 43,
            "CurrentTypeID": 20,
            "Quantity": 1
        }
    ],
    "NumberOfPoints": 1,
    "StatusTypeID": 50,
    "DateLastStatusUpdate": "2019-12-28T07:24:00Z",
    "DataQualityLevel": 1,
    "DateCreated": "2019-10-05T14:59:00Z",
    "SubmissionStatusTypeID": 200
}