{
    "IsRecentlyVerified": false,
    "ID": 32920,
    "UUID": "FDF6B30D-683E-496A-BB66-EB030AF4071D",
    "DataProviderID": 1,
    "OperatorID": 105,
    "OperatorsReference": "Essent EM-DE-05113000-08-00004",
    "UsageTypeID": 4,
    "AddressInfo": {
        "ID": 33266,
        "Title": "Segerothstraße 97",
        "AddressLine1": "Segerothstraße 97",
        "Town": "Essen",
        "Postcode": "45141",
        "CountryID": 87,
        "Latitude": 51.464465,
        "Longitude": 7.001866,
        "DistanceUnit": 0
    },
    "Connections": [
        {
            "ID": 36431,
            "ConnectionTypeID": 25,
            "LevelID": 2,
            "PowerKW": 11
        },
        {
            "ID": 46599,
            "ConnectionTypeID": 25,
            "LevelID": 2,
            "PowerKW": 11
        }
    ],
    "NumberOfPoints": 1,
    "StatusTypeID": 50,
    "DateLastStatusUpdate": "2015-04-13T19:50:00Z",
    "DataQualityLevel": 3,
    "DateCreated": "2015-01-09T06:03:00Z",
    "SubmissionStatusTypeID": 200
}