{
    "IsRecentlyVerified": false,
    "ID": 48922,
    "UUID": "25F0B009-28C4-4EBA-BC6D-9C2995DC9529",
    "DataProviderID": 2,
    "DataProvidersReference": "68157",
    "OperatorID": 39,
    "UsageTypeID": 1,
    "AddressInfo": {
        "ID": 49268,
        "Title": "White River Property, LLC.",
        "AddressLine1": "4111 \"A\" Street SE",
        "Town": "Auburn",
        "StateOrProvince": "WA",
        "Postcode": "98002",
        "CountryID": 2,
        "Latitude": 47.2768641,
        "Longitude": -122.2134697,
        "ContactTelephone1": "800-663-5633",
        "AccessComments": "MO: 05:00am-12:00am; TU: 05:00am-12:00am; WE: 05:00am-12:00am; TH: 05:00am-12:00am; FR: 05:00am-12:00am; SA: 05:00am-12:00am; SU: 05:00am-12:00am",
        "RelatedURL": "http://www.semacharge.com/",
        "DistanceUnit": 0
    },
    "Connections": [
        {
            "ID": 60441,
            "ConnectionTypeID": 1,
            "LevelID": 2,
            "Amps": 16,
            "Voltage": 230,
            "PowerKW": 3,
            "CurrentTypeID": 10,
            "Quantity": 1
        }
    ],
    "DateLastStatusUpdate": "2019-04-06T05:07:00Z",
    "DataQualityLevel": 3,
    "DateCreated": "2015-07-04T08:27:00Z",
    "SubmissionStatusTypeID": 100
}