{
    "IsRecentlyVerified": false,
    "ID": 182754,
    "UUID": "4E4812EF-4A4F-4F58-A039-CA1F19D6D737",
    "DataProviderID": 29,
    "DataProvidersReference": "10477",
    "AddressInfo": {
        "ID": 183113,
        "Title": "Ahornstr. 22",
        "AddressLine1": "Ahornstr. 22",
        "Town": "Bad Lauchstädt",
        "Postcode": "06246",
        "CountryID": 87,
        "Latitude": 51.385176,
        "Longitude": 11.883146,
        "DistanceUnit": 0
    },
    "Connections": [
        {
            "ID": 288884,
            "ConnectionTypeID": 33,
            "StatusTypeID": 50,
            "LevelID": 3,
            "PowerKW": 50,
            "CurrentTypeID": 30
        },
        {
            "ID": 288885,
            "ConnectionTypeID": 25,
            "StatusTypeID": 50,
            "LevelID": 2,
            "PowerKW": 22,
            "CurrentTypeID": 20
        }
    ],
    "StatusTypeID": 50,
    "DateLastStatusUpdate": "2021-07-09T03:23:00Z",
    "MetadataValues": [
        {
            "ID": 15047,
            "MetadataFieldID": 4,
            "ItemValue": "Data from the German chargepoint registry provided by Bundesnetzagentur.de under the CC-BY 4.0 license"
        }
    ],
    "DataQualityLevel": 3,
    "DateCreated": "2021-07-08T10:03:00Z",
    "SubmissionStatusTypeID": 100
}