{
    "IsRecentlyVerified": false,
    "ID": 156652,
    "UUID": "43E1C122-702C-42D3-80A9-CF4F1D643926",
    "DataProviderID": 19,
    "DataProvidersReference": "5743",
    "AddressInfo": {
        "ID": 157006,
        "Title": "Kungsbacka Västanvindsgatan",
        "AddressLine1": "Västanvindsgatan 1",
        "Town": "KUNGSBACKA",
        "StateOrProvince": "HALLAND",
        "Postcode": "43434",
        "CountryID": 216,
        "Latitude": 57.49608,
        "Longitude": 12.06512,
        "AccessComments": "Kungsbacka Västanvindsgatan",
        "DistanceUnit": 0
    },
    "Connections": [
        {
            "ID": 220900,
            "ConnectionTypeID": 25,
            "Reference": "1",
            "LevelID": 3,
            "Amps": 32,
            "Voltage": 400,
            "PowerKW": 22,
            "CurrentTypeID": 30
        },
        {
            "ID": 220901,
            "ConnectionTypeID": 25,
            "Reference": "2",
            "LevelID": 3,
            "Amps": 32,
            "Voltage": 400,
            "PowerKW": 22,
            "CurrentTypeID": 30
        },
        {
            "ID": 220902,
            "ConnectionTypeID": 25,
            "Reference": "3",
            "LevelID": 3,
            "Amps": 32,
            "Voltage": 400,
            "PowerKW": 22,
            "CurrentTypeID": 30
        },
        {
            "ID": 220903,
            "ConnectionTypeID": 25,
            "Reference": "4",
            "LevelID": 3,
            "Amps": 32,
            "Voltage": 400,
            "PowerKW": 22,
            "CurrentTypeID": 30
        }
    ],
    "NumberOfPoints": 4,
    "StatusTypeID": 0,
    "DateLastStatusUpdate": "2021-03-24T05:11:00Z",
    "DataQualityLevel": 2,
    "DateCreated": "2020-05-26T08:21:00Z",
    "SubmissionStatusTypeID": 100
}