{
    "UserComments": [
        {
            "ID": 4392,
            "ChargePointID": 37890,
            "CommentTypeID": 10,
            "UserName": "Chillout",
            "Comment": "It's all right.",
            "Rating": 3,
            "DateCreated": "2015-05-07T07:37:04.713Z",
            "User": {
                "ID": 4819,
                "Username": "Chillout"
            },
            "CheckinStatusTypeID": 10
        }
    ],
    "IsRecentlyVerified": false,
    "ID": 37890,
    "UUID": "D1536395-2CDD-49E2-B174-0D3BAD198B98",
    "DataProviderID": 26,
    "DataProvidersReference": "48135",
    "OperatorID": 178,
    "OperatorsReference": "EVnetNL EV0016",
    "UsageCost": "0.00 jaarabonnement",
    "AddressInfo": {
        "ID": 38236,
        "Title": "Spuihof 36",
        "AddressLine1": "Spuihof 36",
        "Town": "Almere",
        "Postcode": "1316 EH",
        "CountryID": 159,
        "Latitude": 52.382543,
        "Longitude": 5.219933,
        "ContactTelephone1": "0800-3522365",
        "RelatedURL": "http://www.evnet.nl",
        "DistanceUnit": 0
    },
    "Connections": [
        {
            "ID": 41401,
            "ConnectionTypeID": 25,
            "LevelID": 2,
            "PowerKW": 11,
            "CurrentTypeID": 10
        }
    ],
    "NumberOfPoints": 1,
    "StatusTypeID": 50,
    "DateLastStatusUpdate": "2016-06-04T02:54:00Z",
    "DataQualityLevel": 3,
    "DateCreated": "2015-01-09T06:07:00Z",
    "SubmissionStatusTypeID": 100
}