{
    "IsRecentlyVerified": false,
    "ID": 51740,
    "UUID": "3DFFEEF8-97C4-492B-9259-9F9CA7CE7309",
    "DataProviderID": 1,
    "OperatorID": 23,
    "OperatorsReference": "7694",
    "UsageTypeID": 7,
    "UsageCost": "Free",
    "AddressInfo": {
        "ID": 52086,
        "Title": "Comfort Suites",
        "AddressLine1": "505 Live Oak St",
        "Town": "San Antonio",
        "StateOrProvince": "TX",
        "Postcode": "78202",
        "CountryID": 2,
        "Latitude": 29.426655,
        "Longitude": -98.481024,
        "ContactTelephone1": "210-227-5200  877-798-3752",
        "AccessComments": "24 hours daily; for guest use by reservation only; see front desk for access",
        "RelatedURL": "http://www.teslamotors.com/supercharger",
        "DistanceUnit": 0
    },
    "Connections": [
        {
            "ID": 64215,
            "ConnectionTypeID": 30,
            "StatusTypeID": 50,
            "LevelID": 2,
            "Amps": 16,
            "Voltage": 230,
            "PowerKW": 16,
            "CurrentTypeID": 10,
            "Quantity": 2
        }
    ],
    "NumberOfPoints": 2,
    "StatusTypeID": 50,
    "DateLastStatusUpdate": "2017-02-01T09:57:00Z",
    "DataQualityLevel": 3,
    "DateCreated": "2015-08-13T03:43:00Z",
    "SubmissionStatusTypeID": 100
}