{
    "IsRecentlyVerified": false,
    "ID": 141217,
    "UUID": "879E23CF-0425-42D8-9E3D-7C8512B57A25",
    "DataProviderID": 2,
    "DataProvidersReference": "93230",
    "OperatorID": 15,
    "UsageTypeID": 4,
    "AddressInfo": {
        "ID": 141569,
        "Title": "St. Charles Towne Center",
        "AddressLine1": "11110 Mall Cir",
        "Town": "Waldorf",
        "StateOrProvince": "MD",
        "Postcode": "20603",
        "CountryID": 2,
        "Latitude": 38.61743,
        "Longitude": -76.92423,
        "ContactTelephone1": "877-455-3833",
        "AccessComments": "24 hours daily\r\nPublic - Card key at all times",
        "RelatedURL": "https://www.evgo.com/",
        "DistanceUnit": 0
    },
    "Connections": [
        {
            "ID": 197085,
            "ConnectionTypeID": 2,
            "LevelID": 3,
            "Amps": 100,
            "Voltage": 400,
            "PowerKW": 40,
            "CurrentTypeID": 30,
            "Quantity": 1
        },
        {
            "ID": 197086,
            "ConnectionTypeID": 32,
            "LevelID": 3,
            "Amps": 100,
            "Voltage": 400,
            "PowerKW": 40,
            "CurrentTypeID": 30,
            "Quantity": 1
        }
    ],
    "StatusTypeID": 50,
    "DateLastStatusUpdate": "2020-06-26T03:00:00Z",
    "DataQualityLevel": 3,
    "DateCreated": "2019-12-24T09:15:00Z",
    "SubmissionStatusTypeID": 100
}