{
    "IsRecentlyVerified": false,
    "ID": 102609,
    "UUID": "53BA5788-9568-43FE-A5C3-31644AB89B9A",
    "DataProviderID": 1,
    "OperatorID": 15,
    "UsageTypeID": 4,
    "UsageCost": "$0.30/min",
    "AddressInfo": {
        "ID": 102955,
        "Title": "Lucky",
        "AddressLine1": "565 W Capitol Expy",
        "Town": "San Jose",
        "StateOrProvince": "CA",
        "Postcode": "95136",
        "CountryID": 2,
        "Latitude": 37.2756471947817,
        "Longitude": -121.854567487639,
        "ContactTelephone1": "877-455-3833",
        "AccessComments": "24 hours daily; EVgo network subscription and key fob required",
        "RelatedURL": "https://www.evgo.com/",
        "DistanceUnit": 0
    },
    "Connections": [
        {
            "ID": 144705,
            "ConnectionTypeID": 2,
            "StatusTypeID": 50,
            "LevelID": 2,
            "Amps": 100,
            "Voltage": 400,
            "PowerKW": 50,
            "CurrentTypeID": 10,
            "Quantity": 1
        },
        {
            "ID": 144706,
            "ConnectionTypeID": 32,
            "StatusTypeID": 50,
            "LevelID": 2,
            "Amps": 100,
            "Voltage": 400,
            "PowerKW": 50,
            "CurrentTypeID": 10,
            "Quantity": 1
        }
    ],
    "NumberOfPoints": 2,
    "StatusTypeID": 50,
    "DateLastStatusUpdate": "2019-04-03T18:29:00Z",
    "DataQualityLevel": 3,
    "DateCreated": "2018-04-21T04:13:00Z",
    "SubmissionStatusTypeID": 100
}