{
    "IsRecentlyVerified": false,
    "ID": 87279,
    "UUID": "727863EA-499D-4158-8E17-705B7EAE5747",
    "DataProviderID": 1,
    "OperatorID": 23,
    "OperatorsReference": "29178",
    "UsageTypeID": 7,
    "AddressInfo": {
        "ID": 87625,
        "Title": "Reiterhof Berggut Gaicht",
        "AddressLine1": "17 Berggut Gaicht",
        "Town": "Nesselwaengle",
        "Postcode": "6672",
        "CountryID": 19,
        "Latitude": 47.462465,
        "Longitude": 10.620057,
        "ContactTelephone1": "+43 676 7805045",
        "DistanceUnit": 0
    },
    "Connections": [
        {
            "ID": 123715,
            "ConnectionTypeID": 30,
            "StatusTypeID": 50,
            "LevelID": 2,
            "Amps": 32,
            "Voltage": 400,
            "PowerKW": 22,
            "CurrentTypeID": 20,
            "Quantity": 2
        }
    ],
    "NumberOfPoints": 2,
    "GeneralComments": "2 Tesla Connectors, up to 22kW.Available by reservation only. Please call ahead.",
    "StatusTypeID": 50,
    "DateLastStatusUpdate": "2018-10-03T19:06:00Z",
    "DataQualityLevel": 1,
    "DateCreated": "2017-05-03T05:30:00Z",
    "SubmissionStatusTypeID": 200
}