{
    "IsRecentlyVerified": false,
    "ID": 129925,
    "UUID": "34002F5C-7106-4F42-8DD8-B300E908A8C1",
    "DataProviderID": 1,
    "OperatorID": 23,
    "OperatorsReference": "51265",
    "UsageTypeID": 4,
    "AddressInfo": {
        "ID": 130271,
        "Title": "The Bevy Hotel Boerne, A Doubletree By Hilton",
        "AddressLine1": "101 Herff RD",
        "Town": "Boerne",
        "StateOrProvince": "Texas",
        "Postcode": "78006",
        "CountryID": 2,
        "Latitude": 29.774923,
        "Longitude": -98.727062,
        "ContactTelephone1": "(830) 816-5606",
        "DistanceUnit": 0
    },
    "Connections": [
        {
            "ID": 181915,
            "ConnectionTypeID": 30,
            "StatusTypeID": 50,
            "LevelID": 2,
            "PowerKW": 8,
            "CurrentTypeID": 20,
            "Quantity": 3
        }
    ],
    "NumberOfPoints": 3,
    "GeneralComments": "3 Tesla Connectors, up to 8kW.Available for customers. Please see front desk.",
    "StatusTypeID": 50,
    "DateLastStatusUpdate": "2019-07-30T09:21:00Z",
    "DataQualityLevel": 1,
    "DateCreated": "2019-07-30T09:21:00Z",
    "SubmissionStatusTypeID": 200
}