{
    "IsRecentlyVerified": false,
    "ID": 87517,
    "UUID": "5D08E729-6652-4535-8D0D-29C44CC75038",
    "DataProviderID": 1,
    "OperatorID": 45,
    "UsageTypeID": 0,
    "AddressInfo": {
        "ID": 87863,
        "Title": " ODStore",
        "AddressLine1": "Via Varese, 177B",
        "Town": "Solaro",
        "StateOrProvince": "MI",
        "Postcode": "21042",
        "CountryID": 112,
        "Latitude": 45.61643346707996,
        "Longitude": 9.064339031963291,
        "DistanceUnit": 0
    },
    "Connections": [
        {
            "ID": 124062,
            "ConnectionTypeID": 25,
            "StatusTypeID": 150,
            "LevelID": 2,
            "Quantity": 2
        }
    ],
    "NumberOfPoints": 2,
    "StatusTypeID": 150,
    "DateLastStatusUpdate": "2017-05-11T16:34:00Z",
    "DataQualityLevel": 1,
    "DateCreated": "2017-05-11T16:34:00Z",
    "SubmissionStatusTypeID": 200
}