{
    "IsRecentlyVerified": false,
    "ID": 18377,
    "UUID": "0B728ED6-8EBB-4865-BDD7-8447EA755AFD",
    "DataProviderID": 1,
    "OperatorID": 20,
    "OperatorsReference": "60156,60157",
    "UsageTypeID": 4,
    "UsageCost": "Free",
    "AddressInfo": {
        "ID": 18722,
        "Title": "Hollinwood Park and Ride",
        "AddressLine1": "Railway Road",
        "Town": "Hollinwood",
        "Postcode": "OL9 7LG",
        "CountryID": 1,
        "Latitude": 53.519267,
        "Longitude": -2.147945,
        "DistanceUnit": 0
    },
    "Connections": [
        {
            "ID": 18599,
            "ConnectionTypeID": 25,
            "StatusTypeID": 50,
            "LevelID": 2,
            "Amps": 32,
            "Voltage": 230,
            "PowerKW": 7,
            "CurrentTypeID": 10,
            "Quantity": 2
        }
    ],
    "NumberOfPoints": 2,
    "StatusTypeID": 50,
    "DateLastStatusUpdate": "2017-12-14T06:16:00Z",
    "DataQualityLevel": 3,
    "DateCreated": "2013-07-19T08:10:00Z",
    "SubmissionStatusTypeID": 100
}