{
    "MediaItems": [
        {
            "ID": 20998,
            "ChargePointID": 118596,
            "ItemURL": "https://s3-ap-southeast-2.amazonaws.com/openchargemap/images/PL/OCM118596/OCM-118596.orig.2020011523351826.jpg",
            "ItemThumbnailURL": "https://s3-ap-southeast-2.amazonaws.com/openchargemap/images/PL/OCM118596/OCM-118596.thmb.2020011523351826.jpg",
            "Comment": "",
            "IsEnabled": true,
            "IsVideo": false,
            "IsFeaturedItem": false,
            "IsExternalResource": false,
            "User": {
                "ID": 20265,
                "Username": "Wolf"
            },
            "DateCreated": "2020-01-15T23:35:00Z"
        },
        {
            "ID": 20997,
            "ChargePointID": 118596,
            "ItemURL": "https://s3-ap-southeast-2.amazonaws.com/openchargemap/images/PL/OCM118596/OCM-118596.orig.2020011523201860.jpg",
            "ItemThumbnailURL": "https://s3-ap-southeast-2.amazonaws.com/openchargemap/images/PL/OCM118596/OCM-118596.thmb.2020011523201860.jpg",
            "Comment": "",
            "IsEnabled": true,
            "IsVideo": false,
            "IsFeaturedItem": false,
            "IsExternalResource": false,
            "User": {
                "ID": 20265,
                "Username": "Wolf"
            },
            "DateCreated": "2020-01-15T23:20:00Z"
        },
        {
            "ID": 20996,
            "ChargePointID": 118596,
            "ItemURL": "https://s3-ap-southeast-2.amazonaws.com/openchargemap/images/PL/OCM118596/OCM-118596.orig.2020011523032654.jpg",
            "ItemThumbnailURL": "https://s3-ap-southeast-2.amazonaws.com/openchargemap/images/PL/OCM118596/OCM-118596.thmb.2020011523032654.jpg",
            "Comment": "",
            "IsEnabled": true,
            "IsVideo": false,
            "IsFeaturedItem": false,
            "IsExternalResource": false,
            "User": {
                "ID": 20265,
                "Username": "Wolf"
            },
            "DateCreated": "2020-01-15T23:04:00Z"
        },
        {
            "ID": 20995,
            "ChargePointID": 118596,
            "ItemURL": "https://s3-ap-southeast-2.amazonaws.com/openchargemap/images/PL/OCM118596/OCM-118596.orig.2020011522563860.jpg",
            "ItemThumbnailURL": "https://s3-ap-southeast-2.amazonaws.com/openchargemap/images/PL/OCM118596/OCM-118596.thmb.2020011522563860.jpg",
            "Comment": "",
            "IsEnabled": true,
            "IsVideo": false,
            "IsFeaturedItem": false,
            "IsExternalResource": false,
            "User": {
                "ID": 20265,
                "Username": "Wolf"
            },
            "DateCreated": "2020-01-15T22:57:00Z"
        }
    ],
    "IsRecentlyVerified": false,
    "ID": 118596,
    "UUID": "9D7401EC-4A01-4F7E-8782-0EDC9241C4E6",
    "DataProviderID": 1,
    "OperatorID": 45,
    "UsageTypeID": 6,
    "UsageCost": "Free for our clients",
    "AddressInfo": {
        "ID": 118942,
        "Title": "Serwis Samochodów Elektrycznych Electro AutoBodo",
        "AddressLine1": "Eugeniusza Bodo 27",
        "Town": "Łódź",
        "Postcode": "92-340",
        "CountryID": 179,
        "Latitude": 51.750608345269,
        "Longitude": 19.535067731968752,
        "RelatedURL": "http://electro.autobodo.pl",
        "DistanceUnit": 0
    },
    "Connections": [
        {
            "ID": 167734,
            "ConnectionTypeID": 17,
            "StatusTypeID": 50,
            "LevelID": 2,
            "Amps": 16,
            "Voltage": 400,
            "PowerKW": 9,
            "CurrentTypeID": 20,
            "Quantity": 1
        },
        {
            "ID": 167735,
            "ConnectionTypeID": 13,
            "StatusTypeID": 50,
            "LevelID": 2,
            "Amps": 16,
            "Voltage": 230,
            "PowerKW": 3,
            "CurrentTypeID": 10,
            "Quantity": 1
        }
    ],
    "NumberOfPoints": 1,
    "GeneralComments": "Electric Car Service charging station",
    "StatusTypeID": 50,
    "DateLastStatusUpdate": "2020-01-16T19:39:00Z",
    "DataQualityLevel": 1,
    "DateCreated": "2019-03-27T00:08:00Z",
    "SubmissionStatusTypeID": 200
}