{
    "IsRecentlyVerified": false,
    "ID": 180555,
    "UUID": "74F70197-CDC9-4376-8B7D-C2E98626712D",
    "DataProviderID": 29,
    "DataProvidersReference": "14658",
    "OperatorID": 45,
    "AddressInfo": {
        "ID": 180914,
        "Title": "Am-Graf-de-Chardonnet-Platz 4",
        "AddressLine1": "Am-Graf-de-Chardonnet-Platz 4",
        "Town": "Kelsterbach",
        "Postcode": "65451",
        "CountryID": 87,
        "Latitude": 50.0589379,
        "Longitude": 8.52075730000001,
        "DistanceUnit": 0
    },
    "Connections": [
        {
            "ID": 283768,
            "ConnectionTypeID": 25,
            "StatusTypeID": 50,
            "LevelID": 3,
            "PowerKW": 20,
            "CurrentTypeID": 30
        },
        {
            "ID": 283769,
            "ConnectionTypeID": 33,
            "StatusTypeID": 50,
            "LevelID": 3,
            "PowerKW": 20,
            "CurrentTypeID": 30
        },
        {
            "ID": 297537,
            "ConnectionTypeID": 2,
            "StatusTypeID": 50,
            "LevelID": 3,
            "PowerKW": 20,
            "CurrentTypeID": 30
        }
    ],
    "StatusTypeID": 50,
    "DateLastStatusUpdate": "2021-07-12T02:44:00Z",
    "MetadataValues": [
        {
            "ID": 12849,
            "MetadataFieldID": 4,
            "ItemValue": "Data from the German chargepoint registry provided by Bundesnetzagentur.de under the CC-BY 4.0 license"
        }
    ],
    "DataQualityLevel": 3,
    "DateCreated": "2021-07-08T10:00:00Z",
    "SubmissionStatusTypeID": 100
}