{
    "IsRecentlyVerified": false,
    "ID": 64940,
    "UUID": "506245D5-68DC-4BB2-A1FC-E230DEC33C53",
    "DataProviderID": 1,
    "OperatorID": 1,
    "UsageTypeID": 1,
    "AddressInfo": {
        "ID": 65286,
        "Title": "E-Mobil Saar Ladepunkt",
        "AddressLine1": "Heinrich-Barth-Straße 18",
        "AddressLine2": "Burbach",
        "Town": "Saarbrücken",
        "StateOrProvince": "Regionalverband Saarbrücken",
        "Postcode": "66115",
        "CountryID": 87,
        "Latitude": 49.2390882165686,
        "Longitude": 6.95527708465578,
        "AccessComments": "2 kostenlose reservierte durchgehend verfügbare Parkplätze vor der Ladesäule. Betreiber ist e-mobil Saar; Zugang mit EC oder Kreditkarte (kostenlos, keine Abrechnung).",
        "RelatedURL": "http://www.saarland.de/dokumente/thema_elektromobilitaet/e-Mobil_Saar-Zugang_Ladesaeulen.pdf",
        "DistanceUnit": 0
    },
    "Connections": [
        {
            "ID": 83582,
            "ConnectionTypeID": 25,
            "StatusTypeID": 50,
            "LevelID": 2,
            "Amps": 16,
            "Voltage": 400,
            "PowerKW": 11,
            "CurrentTypeID": 20,
            "Quantity": 2
        },
        {
            "ID": 83583,
            "ConnectionTypeID": 28,
            "StatusTypeID": 50,
            "LevelID": 2,
            "Amps": 16,
            "Voltage": 230,
            "PowerKW": 3.7,
            "CurrentTypeID": 10,
            "Quantity": 2
        }
    ],
    "NumberOfPoints": 2,
    "StatusTypeID": 50,
    "DateLastStatusUpdate": "2016-04-01T07:08:00Z",
    "DataQualityLevel": 1,
    "DateCreated": "2016-04-01T07:08:00Z",
    "SubmissionStatusTypeID": 200
}