{
    "IsRecentlyVerified": false,
    "ID": 83951,
    "UUID": "F91CA169-DF9C-4A84-B4A2-21A869AB6460",
    "DataProviderID": 1,
    "DataProvidersReference": "3753",
    "AddressInfo": {
        "ID": 84297,
        "Title": "IKEA Kuopio",
        "AddressLine1": "Ratarinteenkatu 2",
        "Town": "Pitkälahti",
        "StateOrProvince": "Pohjois-Savo",
        "Postcode": "70800",
        "CountryID": 79,
        "Latitude": 62.82395,
        "Longitude": 27.60195,
        "AccessComments": "Ostoskeskuksen/tavaratalon parkkialueella tai -hallissa, IKEA Kuopio parkkialue",
        "DistanceUnit": 0
    },
    "Connections": [
        {
            "ID": 119249,
            "ConnectionTypeID": 0,
            "Reference": "1",
            "LevelID": 2,
            "Amps": 16,
            "Voltage": 230,
            "PowerKW": 3.7,
            "Comments": "Mode 2"
        },
        {
            "ID": 119250,
            "ConnectionTypeID": 0,
            "Reference": "2",
            "LevelID": 2,
            "Amps": 16,
            "Voltage": 230,
            "PowerKW": 3.7,
            "Comments": "Mode 2"
        }
    ],
    "NumberOfPoints": 2,
    "DateLastStatusUpdate": "2020-05-26T08:25:00Z",
    "DataQualityLevel": 2,
    "DateCreated": "2017-02-11T22:03:00Z",
    "SubmissionStatusTypeID": 100
}