{
    "IsRecentlyVerified": false,
    "ID": 159121,
    "UUID": "48C6D66F-8CE3-4612-BA47-18C2868B5F98",
    "DataProviderID": 2,
    "DataProvidersReference": "152481",
    "OperatorID": 39,
    "UsageTypeID": 1,
    "AddressInfo": {
        "ID": 159478,
        "Title": "Corbin Pacific, Inc.",
        "AddressLine1": "2360 Technology Parkway",
        "Town": "Hollister",
        "StateOrProvince": "CA",
        "Postcode": "95023",
        "CountryID": 2,
        "Latitude": 36.893851,
        "Longitude": -121.4004137,
        "ContactTelephone1": "800-663-5633",
        "AccessComments": "MO: Not Specified; TU: Not Specified; WE: Not Specified; TH: Not Specified; FR: Not Specified; SA: Not Specified; SU: Not Specified",
        "RelatedURL": "http://www.semacharge.com/",
        "DistanceUnit": 0
    },
    "Connections": [
        {
            "ID": 229211,
            "ConnectionTypeID": 1,
            "LevelID": 2,
            "Amps": 16,
            "Voltage": 230,
            "PowerKW": 3.7,
            "CurrentTypeID": 10,
            "Quantity": 1
        }
    ],
    "StatusTypeID": 50,
    "DateLastStatusUpdate": "2020-06-26T02:59:00Z",
    "DataQualityLevel": 3,
    "DateCreated": "2020-06-26T02:59:00Z",
    "SubmissionStatusTypeID": 100
}