{
    "IsRecentlyVerified": false,
    "ID": 63595,
    "UUID": "2528E5DF-AF18-4679-938B-DC8602FD8EC8",
    "DataProviderID": 26,
    "DataProvidersReference": "77493",
    "OperatorID": 181,
    "OperatorsReference": "ENO136875",
    "UsageCost": "0.00 afhankelijk van pas",
    "AddressInfo": {
        "ID": 63941,
        "Title": "Paddenstoelenlaan 1",
        "AddressLine1": "Paddenstoelenlaan 1",
        "Town": "Utrecht",
        "Postcode": "3451 PZ",
        "CountryID": 159,
        "Latitude": 52.10253,
        "Longitude": 5.004977,
        "DistanceUnit": 0
    },
    "Connections": [
        {
            "ID": 81158,
            "ConnectionTypeID": 25,
            "LevelID": 2,
            "PowerKW": 5,
            "CurrentTypeID": 10
        }
    ],
    "NumberOfPoints": 2,
    "StatusTypeID": 50,
    "DateLastStatusUpdate": "2016-06-04T02:50:00Z",
    "DataQualityLevel": 3,
    "DateCreated": "2016-03-03T12:31:00Z",
    "SubmissionStatusTypeID": 100
}