{
    "IsRecentlyVerified": false,
    "ID": 112676,
    "UUID": "F837684C-0BD8-4BBA-8676-6A6384C47FF6",
    "DataProviderID": 1,
    "OperatorID": 3319,
    "UsageTypeID": 5,
    "UsageCost": "0.15€/min",
    "AddressInfo": {
        "ID": 113022,
        "Title": "e-mobi - Salacgrīva",
        "AddressLine1": "Vidzemes iela 2  ",
        "Town": "Salacgrīva",
        "Postcode": "LV-4033",
        "CountryID": 125,
        "Latitude": 57.75181962352448,
        "Longitude": 24.357628505245543,
        "ContactTelephone1": "+371 22001859",
        "RelatedURL": "https://portal.e-mobi.lv",
        "DistanceUnit": 0
    },
    "Connections": [
        {
            "ID": 158617,
            "ConnectionTypeID": 2,
            "StatusTypeID": 50,
            "LevelID": 3,
            "PowerKW": 50,
            "CurrentTypeID": 30,
            "Quantity": 1
        },
        {
            "ID": 158618,
            "ConnectionTypeID": 33,
            "StatusTypeID": 50,
            "LevelID": 3,
            "PowerKW": 50,
            "CurrentTypeID": 30,
            "Quantity": 1
        },
        {
            "ID": 158619,
            "ConnectionTypeID": 25,
            "StatusTypeID": 50,
            "LevelID": 3,
            "PowerKW": 43,
            "CurrentTypeID": 20
        }
    ],
    "NumberOfPoints": 2,
    "StatusTypeID": 50,
    "DateLastStatusUpdate": "2019-12-08T11:44:00Z",
    "DataQualityLevel": 1,
    "DateCreated": "2018-11-09T21:37:00Z",
    "SubmissionStatusTypeID": 200
}