{
    "IsRecentlyVerified": false,
    "ID": 154672,
    "UUID": "EFBCE58E-F053-4F00-9366-E23EEF79C071",
    "DataProviderID": 1,
    "OperatorID": 20,
    "UsageTypeID": 4,
    "UsageCost": "£0.35/kWh",
    "AddressInfo": {
        "ID": 155025,
        "Title": "Stanley Terrace",
        "AddressLine1": "Stanley Terrace",
        "Town": "Morpeth",
        "Postcode": "NE61 1PA",
        "CountryID": 1,
        "Latitude": 55.168136,
        "Longitude": -1.686938,
        "AccessComments": "Public car park",
        "RelatedURL": "http://www.chargeyourcar.org.uk",
        "DistanceUnit": 0
    },
    "Connections": [
        {
            "ID": 217609,
            "ConnectionTypeID": 1036,
            "Reference": "C",
            "StatusTypeID": 50,
            "LevelID": 3,
            "Amps": 63,
            "Voltage": 400,
            "PowerKW": 43,
            "CurrentTypeID": 20,
            "Quantity": 1
        },
        {
            "ID": 217610,
            "ConnectionTypeID": 2,
            "Reference": "J",
            "StatusTypeID": 50,
            "LevelID": 3,
            "Amps": 125,
            "Voltage": 400,
            "PowerKW": 50,
            "CurrentTypeID": 30,
            "Quantity": 1
        },
        {
            "ID": 217611,
            "ConnectionTypeID": 33,
            "Reference": "G",
            "StatusTypeID": 50,
            "LevelID": 3,
            "Amps": 125,
            "Voltage": 400,
            "PowerKW": 50,
            "CurrentTypeID": 30,
            "Quantity": 1
        }
    ],
    "GeneralComments": "Charge point operated by Northumberland County Council. Parking disk is required, £1 from machines or shops. \"bus station newsagents\"",
    "StatusTypeID": 50,
    "DateLastStatusUpdate": "2021-04-04T18:21:00Z",
    "MetadataValues": [
        {
            "ID": 7224,
            "MetadataFieldID": 4,
            "ItemValue": "Contains public sector information licensed under the Open Government Licence v2.0. http://www.nationalarchives.gov.uk/doc/open-government-licence/version/2/"
        }
    ],
    "DataQualityLevel": 3,
    "DateCreated": "2020-03-17T08:15:00Z",
    "SubmissionStatusTypeID": 100
}