{
    "IsRecentlyVerified": false,
    "ID": 94508,
    "UUID": "75E4CAE9-5E8F-450D-ACC3-51FC94F938C2",
    "DataProviderID": 1,
    "OperatorID": 3253,
    "OperatorsReference": "AT*SMA*EAT0300001*001AC,AT*SMA*EAT0300001*002AC",
    "UsageTypeID": 1,
    "UsageCost": "€0,15/min ; Andere Tarife möglich",
    "AddressInfo": {
        "ID": 94854,
        "Title": "Ladestation Asfinag",
        "AddressLine1": "Hürmer Straße",
        "Town": "Loosdorf",
        "StateOrProvince": "Niederösterreich",
        "Postcode": "3382",
        "CountryID": 19,
        "Latitude": 48.186323,
        "Longitude": 15.411892,
        "DistanceUnit": 0
    },
    "Connections": [
        {
            "ID": 133636,
            "ConnectionTypeID": 25,
            "StatusTypeID": 50,
            "LevelID": 2,
            "Amps": 32,
            "Voltage": 400,
            "PowerKW": 22,
            "CurrentTypeID": 20,
            "Quantity": 2
        }
    ],
    "NumberOfPoints": 2,
    "StatusTypeID": 50,
    "DateLastStatusUpdate": "2017-10-19T10:27:00Z",
    "DataQualityLevel": 1,
    "DateCreated": "2017-10-19T08:07:00Z",
    "SubmissionStatusTypeID": 200
}