{
    "IsRecentlyVerified": false,
    "ID": 120095,
    "UUID": "4E5EB2CA-F822-48CF-85C0-9AA887E1A173",
    "DataProviderID": 2,
    "DataProvidersReference": "62661",
    "OperatorID": 5,
    "UsageTypeID": 1,
    "AddressInfo": {
        "ID": 120441,
        "Title": "BMW ORANGE PARK",
        "AddressLine1": "6914 Blanding Blvd",
        "Town": "Jacksonville",
        "StateOrProvince": "FL",
        "Postcode": "32244",
        "CountryID": 2,
        "Latitude": 30.2246141,
        "Longitude": -81.7390224,
        "ContactTelephone1": "888-758-4389",
        "AccessComments": "24 hours daily",
        "RelatedURL": "http://www.chargepoint.com/",
        "DistanceUnit": 0
    },
    "Connections": [
        {
            "ID": 169414,
            "ConnectionTypeID": 1,
            "LevelID": 2,
            "Amps": 16,
            "Voltage": 230,
            "PowerKW": 3,
            "CurrentTypeID": 10,
            "Quantity": 2
        }
    ],
    "DateLastStatusUpdate": "2019-12-24T09:08:00Z",
    "DataQualityLevel": 3,
    "DateCreated": "2019-04-01T04:59:00Z",
    "SubmissionStatusTypeID": 100
}