{
    "IsRecentlyVerified": false,
    "ID": 33536,
    "UUID": "19732F80-A51D-4A2A-A4FB-27BDD140607F",
    "DataProviderID": 26,
    "DataProvidersReference": "34609",
    "OperatorID": 73,
    "OperatorsReference": "EV-Box EVB-P1313014",
    "UsageCost": "0.00 jaarabonnement",
    "AddressInfo": {
        "ID": 33882,
        "Title": "Watertorenstraat 4",
        "AddressLine1": "Watertorenstraat 4",
        "Town": "Drimmelen",
        "Postcode": "4921 XG",
        "CountryID": 159,
        "Latitude": 51.67457,
        "Longitude": 4.77512,
        "RelatedURL": "http://www.ev-box.nl",
        "DistanceUnit": 0
    },
    "Connections": [
        {
            "ID": 37047,
            "ConnectionTypeID": 25,
            "LevelID": 2,
            "PowerKW": 5,
            "CurrentTypeID": 10
        }
    ],
    "NumberOfPoints": 1,
    "StatusTypeID": 50,
    "DateLastStatusUpdate": "2016-06-04T02:40:00Z",
    "DataQualityLevel": 3,
    "DateCreated": "2015-01-09T06:04:00Z",
    "SubmissionStatusTypeID": 100
}