{
    "IsRecentlyVerified": false,
    "ID": 12981,
    "UUID": "9EB180A8-6DA3-49F2-B84D-D26AFC316161",
    "DataProviderID": 15,
    "DataProvidersReference": "21383",
    "OperatorID": 5,
    "UsageTypeID": 1,
    "AddressInfo": {
        "ID": 12878,
        "Title": "201-251 S 20th Ave",
        "AddressLine1": "201-251 S 20th Ave",
        "Town": "Hollywood",
        "StateOrProvince": "Florida",
        "Postcode": "33020",
        "CountryID": 2,
        "Latitude": 26.00981,
        "Longitude": -80.14667,
        "ContactTelephone1": "(954) 921-3535",
        "RelatedURL": "http://carstations.com/21383",
        "DistanceUnit": 0
    },
    "Connections": [
        {
            "ID": 10414,
            "ConnectionTypeID": 1,
            "Reference": "J1772",
            "LevelID": 2
        }
    ],
    "NumberOfPoints": 1,
    "StatusTypeID": 0,
    "DateLastStatusUpdate": "2017-11-04T14:03:00Z",
    "DataQualityLevel": 2,
    "DateCreated": "2012-09-07T19:25:00Z",
    "SubmissionStatusTypeID": 100
}