{
    "IsRecentlyVerified": false,
    "ID": 97956,
    "UUID": "6BB016A3-AA20-4062-9B0E-071FCD760D08",
    "DataProviderID": 1,
    "OperatorID": 23,
    "OperatorsReference": "38144",
    "UsageTypeID": 4,
    "AddressInfo": {
        "ID": 98302,
        "Title": "Innside By Melia Düsseldorf Seestern",
        "AddressLine1": "Niederkasseler Lohweg 18a",
        "Town": "Düsseldorf",
        "Postcode": "40547",
        "CountryID": 87,
        "Latitude": 51.24248,
        "Longitude": 6.735284,
        "ContactTelephone1": "+49 2115 22990",
        "DistanceUnit": 0
    },
    "Connections": [
        {
            "ID": 138864,
            "ConnectionTypeID": 30,
            "StatusTypeID": 50,
            "LevelID": 2,
            "Amps": 32,
            "Voltage": 400,
            "PowerKW": 22,
            "CurrentTypeID": 20,
            "Quantity": 2
        }
    ],
    "NumberOfPoints": 2,
    "GeneralComments": "2 Tesla Connectors, up to 22kW.Available for customers. Self park.",
    "StatusTypeID": 50,
    "DateLastStatusUpdate": "2018-10-03T15:40:00Z",
    "DataQualityLevel": 1,
    "DateCreated": "2018-01-21T17:24:00Z",
    "SubmissionStatusTypeID": 200
}