{
    "IsRecentlyVerified": false,
    "ID": 151921,
    "UUID": "43AD272F-7548-4A4A-BA93-447775F1580D",
    "DataProviderID": 28,
    "DataProvidersReference": "FRS42P42187A1",
    "UsageTypeID": 5,
    "AddressInfo": {
        "ID": 152274,
        "Title": "Rue Alexandre Raffin",
        "AddressLine1": "14 rue alexandre raffin",
        "CountryID": 80,
        "Latitude": 46.033009,
        "Longitude": 4.067195,
        "AccessComments": "24/24 - 7/7",
        "DistanceUnit": 0
    },
    "Connections": [
        {
            "ID": 212421,
            "ConnectionTypeID": 28,
            "StatusTypeID": 50,
            "LevelID": 2,
            "PowerKW": 22,
            "CurrentTypeID": 10
        },
        {
            "ID": 212422,
            "ConnectionTypeID": 1036,
            "StatusTypeID": 50,
            "LevelID": 2,
            "PowerKW": 22,
            "CurrentTypeID": 20
        },
        {
            "ID": 245254,
            "ConnectionTypeID": 28,
            "StatusTypeID": 50,
            "LevelID": 2,
            "PowerKW": 22,
            "CurrentTypeID": 10
        },
        {
            "ID": 245255,
            "ConnectionTypeID": 1036,
            "StatusTypeID": 50,
            "LevelID": 2,
            "PowerKW": 22,
            "CurrentTypeID": 20
        }
    ],
    "GeneralComments": "En service",
    "StatusTypeID": 50,
    "DateLastStatusUpdate": "2020-08-27T05:12:00Z",
    "DataQualityLevel": 2,
    "DateCreated": "2020-03-15T10:53:00Z",
    "SubmissionStatusTypeID": 100
}