{
    "IsRecentlyVerified": false,
    "ID": 185105,
    "UUID": "F399E4D6-45A9-4A1E-A510-418BAEA372EA",
    "DataProviderID": 29,
    "DataProvidersReference": "20183",
    "AddressInfo": {
        "ID": 185464,
        "Title": "Altonaer Chaussee 49",
        "AddressLine1": "Altonaer Chaussee 49",
        "Town": "Schenefeld",
        "Postcode": "22869",
        "CountryID": 87,
        "Latitude": 53.598551,
        "Longitude": 9.847903,
        "DistanceUnit": 0
    },
    "Connections": [
        {
            "ID": 294166,
            "ConnectionTypeID": 33,
            "StatusTypeID": 50,
            "LevelID": 3,
            "PowerKW": 22,
            "CurrentTypeID": 30
        },
        {
            "ID": 294167,
            "ConnectionTypeID": 25,
            "StatusTypeID": 50,
            "LevelID": 2,
            "PowerKW": 11,
            "CurrentTypeID": 20
        }
    ],
    "StatusTypeID": 50,
    "DateLastStatusUpdate": "2021-07-09T03:30:00Z",
    "MetadataValues": [
        {
            "ID": 17396,
            "MetadataFieldID": 4,
            "ItemValue": "Data from the German chargepoint registry provided by Bundesnetzagentur.de under the CC-BY 4.0 license"
        }
    ],
    "DataQualityLevel": 3,
    "DateCreated": "2021-07-08T10:06:00Z",
    "SubmissionStatusTypeID": 100
}