{
    "IsRecentlyVerified": false,
    "ID": 65485,
    "UUID": "E61334F7-98C5-4E81-953E-0A7811402960",
    "DataProviderID": 26,
    "DataProvidersReference": "86547",
    "OperatorID": 73,
    "OperatorsReference": "EV-Box EVB-P1548075",
    "UsageCost": "0.00 jaarabonnement",
    "AddressInfo": {
        "ID": 65831,
        "Title": "Zesweg 140",
        "AddressLine1": "Zesweg 140",
        "Town": "Wijchen",
        "Postcode": "6604 BP",
        "CountryID": 159,
        "Latitude": 51.81724,
        "Longitude": 5.7457,
        "RelatedURL": "http://www.ev-box.nl",
        "DistanceUnit": 0
    },
    "Connections": [
        {
            "ID": 90249,
            "ConnectionTypeID": 25,
            "LevelID": 2,
            "PowerKW": 5,
            "CurrentTypeID": 10
        }
    ],
    "NumberOfPoints": 1,
    "StatusTypeID": 50,
    "DateLastStatusUpdate": "2016-06-04T02:40:00Z",
    "DataQualityLevel": 3,
    "DateCreated": "2016-04-27T09:41:00Z",
    "SubmissionStatusTypeID": 100
}