{
    "IsRecentlyVerified": false,
    "ID": 129598,
    "UUID": "54CFB60C-2DA8-4F29-8B0D-102FF83A8E36",
    "DataProviderID": 2,
    "DataProvidersReference": "122241",
    "OperatorID": 3318,
    "UsageTypeID": 1,
    "AddressInfo": {
        "ID": 129944,
        "Title": "Walmart 1254 - Bellmead, TX",
        "AddressLine1": "1521 N Interstate 35 Frontage Rd",
        "Town": "Bellmead",
        "StateOrProvince": "TX",
        "Postcode": "76705",
        "CountryID": 2,
        "Latitude": 31.60057,
        "Longitude": -97.105852,
        "ContactTelephone1": "833-632-2778",
        "AccessComments": "24 hours daily",
        "RelatedURL": "https://www.electrifyamerica.com/",
        "DistanceUnit": 0
    },
    "Connections": [
        {
            "ID": 181352,
            "ConnectionTypeID": 2,
            "LevelID": 3,
            "Amps": 100,
            "Voltage": 400,
            "PowerKW": 40,
            "CurrentTypeID": 30,
            "Quantity": 1
        },
        {
            "ID": 181353,
            "ConnectionTypeID": 32,
            "LevelID": 3,
            "Amps": 100,
            "Voltage": 400,
            "PowerKW": 40,
            "CurrentTypeID": 30,
            "Quantity": 1
        }
    ],
    "DateLastStatusUpdate": "2020-06-26T02:54:00Z",
    "DataQualityLevel": 3,
    "DateCreated": "2019-07-21T11:43:00Z",
    "SubmissionStatusTypeID": 100
}