{
    "IsRecentlyVerified": false,
    "ID": 142348,
    "UUID": "E2645F2C-74CB-492E-A93B-5CC348408766",
    "DataProviderID": 2,
    "DataProvidersReference": "93461",
    "OperatorID": 15,
    "UsageTypeID": 4,
    "AddressInfo": {
        "ID": 142700,
        "Title": "Dunkin' Donuts",
        "AddressLine1": "2658 Brodhead Rd",
        "Town": "Aliquippa",
        "StateOrProvince": "PA",
        "Postcode": "15001",
        "CountryID": 2,
        "Latitude": 40.604581,
        "Longitude": -80.280226,
        "ContactTelephone1": "877-455-3833",
        "AccessComments": "24 hours daily\r\nPublic - Card key at all times",
        "RelatedURL": "https://www.evgo.com/",
        "DistanceUnit": 0
    },
    "Connections": [
        {
            "ID": 198468,
            "ConnectionTypeID": 2,
            "LevelID": 3,
            "Amps": 100,
            "Voltage": 400,
            "PowerKW": 40,
            "CurrentTypeID": 30,
            "Quantity": 1
        },
        {
            "ID": 198469,
            "ConnectionTypeID": 32,
            "LevelID": 3,
            "Amps": 100,
            "Voltage": 400,
            "PowerKW": 40,
            "CurrentTypeID": 30,
            "Quantity": 1
        }
    ],
    "StatusTypeID": 50,
    "DateLastStatusUpdate": "2020-06-26T03:03:00Z",
    "DataQualityLevel": 3,
    "DateCreated": "2019-12-24T09:17:00Z",
    "SubmissionStatusTypeID": 100
}