{
    "IsRecentlyVerified": false,
    "ID": 138170,
    "UUID": "BCE2AC2F-26D2-4324-B2FD-DEF7EBC2EEDB",
    "DataProviderID": 2,
    "DataProvidersReference": "149021",
    "OperatorID": 39,
    "UsageTypeID": 1,
    "AddressInfo": {
        "ID": 138519,
        "Title": "Midtown 29",
        "AddressLine1": "180 NE 29th St",
        "Town": "Miami",
        "StateOrProvince": "FL",
        "Postcode": "33137",
        "CountryID": 2,
        "Latitude": 25.8036849,
        "Longitude": -80.1918219,
        "ContactTelephone1": "800-663-5633",
        "AccessComments": "MO: 12:00am-12:00am; TU: 12:00am-12:00am; WE: 12:00am-12:00am; TH: 12:00am-12:00am; FR: 12:00am-12:00am; SA: 12:00am-12:00am; SU: 12:00am-12:00am",
        "RelatedURL": "http://www.semacharge.com/",
        "DistanceUnit": 0
    },
    "Connections": [
        {
            "ID": 193232,
            "ConnectionTypeID": 1,
            "LevelID": 2,
            "Amps": 16,
            "Voltage": 230,
            "PowerKW": 3.7,
            "CurrentTypeID": 10,
            "Quantity": 1
        }
    ],
    "StatusTypeID": 50,
    "DateLastStatusUpdate": "2020-06-26T02:52:00Z",
    "DataQualityLevel": 3,
    "DateCreated": "2019-12-24T09:08:00Z",
    "SubmissionStatusTypeID": 100
}