{
    "IsRecentlyVerified": false,
    "ID": 71836,
    "UUID": "CDF93B6F-6E71-470A-9C12-277A6679FA2C",
    "DataProviderID": 1,
    "OperatorID": 3,
    "OperatorsReference": "PG-80551,PG-90565",
    "UsageTypeID": 6,
    "UsageCost": "Free",
    "AddressInfo": {
        "ID": 72182,
        "Title": "Hyundai-Motorfair Birmingham",
        "AddressLine1": "220 The Radleys",
        "Town": "Birmingham",
        "StateOrProvince": "England",
        "Postcode": "B33 0QR",
        "CountryID": 1,
        "Latitude": 52.468823,
        "Longitude": -1.768051,
        "DistanceUnit": 0
    },
    "Connections": [
        {
            "ID": 102928,
            "ConnectionTypeID": 25,
            "StatusTypeID": 50,
            "LevelID": 2,
            "Amps": 32,
            "Voltage": 230,
            "PowerKW": 7,
            "CurrentTypeID": 10,
            "Quantity": 3
        }
    ],
    "NumberOfPoints": 3,
    "StatusTypeID": 50,
    "DateLastStatusUpdate": "2017-10-10T18:22:00Z",
    "DataQualityLevel": 1,
    "DateCreated": "2016-09-15T06:20:00Z",
    "SubmissionStatusTypeID": 200
}