{
    "IsRecentlyVerified": false,
    "ID": 35549,
    "UUID": "ED1A36E0-1C52-4133-9827-A16BF9BFE183",
    "DataProviderID": 26,
    "DataProvidersReference": "57912",
    "OperatorID": 180,
    "OperatorsReference": "Alfen RHL07031",
    "UsageCost": "0.00 jaarabonnement",
    "AddressInfo": {
        "ID": 35895,
        "Title": "Broekslootkade 35",
        "AddressLine1": "Broekslootkade 35",
        "Town": "Rijswijk",
        "Postcode": "2281 TB",
        "CountryID": 159,
        "Latitude": 52.060127,
        "Longitude": 4.336972,
        "ContactTelephone1": "036 - 549 34 00",
        "RelatedURL": "http://www.icu-charging-stations.com/",
        "DistanceUnit": 0
    },
    "Connections": [
        {
            "ID": 39060,
            "ConnectionTypeID": 25,
            "LevelID": 2,
            "PowerKW": 11,
            "CurrentTypeID": 10
        },
        {
            "ID": 47928,
            "ConnectionTypeID": 25,
            "LevelID": 2,
            "PowerKW": 11,
            "CurrentTypeID": 10
        }
    ],
    "NumberOfPoints": 1,
    "StatusTypeID": 50,
    "DateLastStatusUpdate": "2016-06-04T02:45:00Z",
    "DataQualityLevel": 3,
    "DateCreated": "2015-01-09T06:05:00Z",
    "SubmissionStatusTypeID": 100
}