{
    "IsRecentlyVerified": false,
    "ID": 116743,
    "UUID": "AE2EE3FE-1383-468D-B789-4C80B0187BB3",
    "DataProviderID": 1,
    "OperatorID": 82,
    "UsageTypeID": 4,
    "AddressInfo": {
        "ID": 117089,
        "Title": "A2A BG Fast Dunant",
        "AddressLine1": "Via Enrico Dunant",
        "AddressLine2": "angolo Via Broseta ",
        "Town": "Bergamo",
        "StateOrProvince": "BG",
        "Postcode": "24128",
        "CountryID": 112,
        "Latitude": 45.69303867145516,
        "Longitude": 9.644319424774153,
        "ContactTelephone1": "800035151",
        "RelatedURL": "http://www.e-moving.it/",
        "DistanceUnit": 0
    },
    "Connections": [
        {
            "ID": 165271,
            "ConnectionTypeID": 33,
            "StatusTypeID": 150,
            "LevelID": 3,
            "PowerKW": 50,
            "CurrentTypeID": 30,
            "Quantity": 1
        },
        {
            "ID": 165272,
            "ConnectionTypeID": 2,
            "StatusTypeID": 150,
            "LevelID": 3,
            "PowerKW": 50,
            "CurrentTypeID": 30,
            "Quantity": 1
        },
        {
            "ID": 165273,
            "ConnectionTypeID": 25,
            "StatusTypeID": 150,
            "LevelID": 2,
            "Amps": 32,
            "Voltage": 400,
            "PowerKW": 22,
            "CurrentTypeID": 20,
            "Quantity": 1
        }
    ],
    "NumberOfPoints": 2,
    "StatusTypeID": 150,
    "DateLastStatusUpdate": "2019-02-11T16:31:00Z",
    "DataQualityLevel": 1,
    "DateCreated": "2019-02-11T16:31:00Z",
    "SubmissionStatusTypeID": 200
}