{
    "IsRecentlyVerified": false,
    "ID": 154614,
    "UUID": "BC1A39BD-7F37-4E37-A331-D9BC509DF1F6",
    "DataProviderID": 18,
    "DataProvidersReference": "fd7d8e1d9691a087a12a2eb5afcfe8a0",
    "OperatorID": 3392,
    "UsageTypeID": 1,
    "AddressInfo": {
        "ID": 154967,
        "Title": "Chapel Cross Roads",
        "AddressLine1": "Chapel Cross Roads",
        "Town": "London",
        "Postcode": "N8 8JN",
        "CountryID": 1,
        "Latitude": 51.582274,
        "Longitude": -0.12804,
        "AccessComments": "",
        "RelatedURL": "http://www.shell.co.uk/motorist/welcome-to-shell-recharge.html",
        "DistanceUnit": 0
    },
    "Connections": [
        {
            "ID": 217490,
            "ConnectionTypeID": 1036,
            "Reference": "1",
            "StatusTypeID": 50,
            "LevelID": 3,
            "Amps": 63,
            "Voltage": 400,
            "PowerKW": 43,
            "CurrentTypeID": 20
        },
        {
            "ID": 217491,
            "ConnectionTypeID": 33,
            "Reference": "2",
            "StatusTypeID": 50,
            "LevelID": 3,
            "Amps": 125,
            "Voltage": 400,
            "PowerKW": 50,
            "CurrentTypeID": 30
        },
        {
            "ID": 217492,
            "ConnectionTypeID": 2,
            "Reference": "3",
            "StatusTypeID": 50,
            "LevelID": 3,
            "Amps": 125,
            "Voltage": 400,
            "PowerKW": 50,
            "CurrentTypeID": 30
        }
    ],
    "StatusTypeID": 0,
    "DateLastStatusUpdate": "2020-03-17T08:54:00Z",
    "MetadataValues": [
        {
            "ID": 7166,
            "MetadataFieldID": 4,
            "ItemValue": "Contains public sector information licensed under the Open Government Licence v2.0. http://www.nationalarchives.gov.uk/doc/open-government-licence/version/2/"
        }
    ],
    "DataQualityLevel": 3,
    "DateCreated": "2020-03-17T08:15:00Z",
    "SubmissionStatusTypeID": 100
}