{
    "IsRecentlyVerified": false,
    "ID": 46243,
    "UUID": "1DADCBC2-FC95-4FFB-A74A-635FDBE182DF",
    "DataProviderID": 1,
    "DataProvidersReference": "1291",
    "AddressInfo": {
        "ID": 46589,
        "Title": "Fredensborgveien 4, Oslo",
        "AddressLine1": "Fredensborgveien 4",
        "Town": "OSLO",
        "StateOrProvince": "Oslo",
        "Postcode": "0177",
        "CountryID": 168,
        "Latitude": 59.91763,
        "Longitude": 10.74605,
        "AccessComments": "I bakgården.",
        "DistanceUnit": 0
    },
    "Connections": [
        {
            "ID": 56906,
            "ConnectionTypeID": 0,
            "Reference": "1",
            "LevelID": 2,
            "Amps": 16,
            "Voltage": 230,
            "PowerKW": 3.7,
            "Comments": "Mode 1"
        },
        {
            "ID": 88622,
            "ConnectionTypeID": 0,
            "Reference": "2",
            "LevelID": 2,
            "Amps": 16,
            "Voltage": 230,
            "PowerKW": 3.7,
            "Comments": "Mode 1"
        }
    ],
    "NumberOfPoints": 2,
    "DateLastStatusUpdate": "2020-05-26T08:23:00Z",
    "DataQualityLevel": 2,
    "DateCreated": "2015-05-03T00:54:00Z",
    "SubmissionStatusTypeID": 100
}