{
    "IsRecentlyVerified": false,
    "ID": 89738,
    "UUID": "778A8FFD-DEA0-43A7-9FDB-223380372C9A",
    "DataProviderID": 2,
    "DataProvidersReference": "82173",
    "UsageTypeID": 1,
    "AddressInfo": {
        "ID": 90084,
        "Title": "Breadboard - Riverton",
        "AddressLine1": "124 E Washington Ave",
        "Town": "Riverton",
        "StateOrProvince": "WY",
        "Postcode": "82501",
        "CountryID": 2,
        "Latitude": 43.023734,
        "Longitude": -108.390441,
        "ContactTelephone1": "307-840-9190",
        "AccessComments": "24 hours daily",
        "RelatedURL": "",
        "DistanceUnit": 0
    },
    "Connections": [
        {
            "ID": 127174,
            "ConnectionTypeID": 1,
            "LevelID": 2,
            "Amps": 16,
            "Voltage": 230,
            "PowerKW": 3.7,
            "CurrentTypeID": 10,
            "Quantity": 2
        }
    ],
    "DateLastStatusUpdate": "2020-06-26T03:06:00Z",
    "DataQualityLevel": 3,
    "DateCreated": "2017-06-22T08:16:00Z",
    "SubmissionStatusTypeID": 100
}