{
    "IsRecentlyVerified": false,
    "ID": 157677,
    "UUID": "148C8694-91D3-4941-92E5-78949763D568",
    "DataProviderID": 1,
    "OperatorID": 21,
    "UsageTypeID": 4,
    "UsageCost": "Mobi.E card",
    "AddressInfo": {
        "ID": 158031,
        "Title": "MRA-00001",
        "AddressLine1": "Praça Sacadura Cabral",
        "Town": "Moura",
        "Postcode": "1600-233",
        "CountryID": 180,
        "Latitude": 38.143167,
        "Longitude": -7.450222,
        "RelatedURL": "https://www.mobie.pt",
        "DistanceUnit": 0
    },
    "Connections": [
        {
            "ID": 227191,
            "ConnectionTypeID": 25,
            "StatusTypeID": 50,
            "LevelID": 2,
            "Amps": 32,
            "Voltage": 400,
            "PowerKW": 22,
            "CurrentTypeID": 20,
            "Quantity": -2
        }
    ],
    "NumberOfPoints": 2,
    "StatusTypeID": 50,
    "DateLastStatusUpdate": "2020-07-18T10:35:00Z",
    "DataQualityLevel": 3,
    "DateCreated": "2020-06-25T05:42:00Z",
    "SubmissionStatusTypeID": 100
}