{
    "IsRecentlyVerified": false,
    "ID": 150606,
    "UUID": "31D40E65-C662-4D42-AFC8-F0FAC2927371",
    "DataProviderID": 28,
    "DataProvidersReference": "FR*M13*P13054*002",
    "UsageTypeID": 5,
    "AddressInfo": {
        "ID": 150959,
        "Title": "MARIGNANE - Place Alderic Chave",
        "AddressLine1": "Place Alderic Chave 13700 MARIGNANE",
        "CountryID": 80,
        "Latitude": 43.417033,
        "Longitude": 5.213539,
        "AccessComments": "24h/24 7j/7",
        "DistanceUnit": 0
    },
    "Connections": [
        {
            "ID": 209553,
            "ConnectionTypeID": 28,
            "StatusTypeID": 50,
            "LevelID": 2,
            "PowerKW": 22,
            "CurrentTypeID": 10
        },
        {
            "ID": 209554,
            "ConnectionTypeID": 1036,
            "StatusTypeID": 50,
            "LevelID": 2,
            "PowerKW": 22,
            "CurrentTypeID": 20
        },
        {
            "ID": 238865,
            "ConnectionTypeID": 28,
            "StatusTypeID": 50,
            "LevelID": 2,
            "PowerKW": 22,
            "CurrentTypeID": 10
        },
        {
            "ID": 238866,
            "ConnectionTypeID": 1036,
            "StatusTypeID": 50,
            "LevelID": 2,
            "PowerKW": 22,
            "CurrentTypeID": 20
        }
    ],
    "GeneralComments": "Recharge par badge et avec une application smartphone",
    "StatusTypeID": 50,
    "DateLastStatusUpdate": "2020-08-27T05:10:00Z",
    "DataQualityLevel": 2,
    "DateCreated": "2020-03-15T06:17:00Z",
    "SubmissionStatusTypeID": 100
}