{
    "IsRecentlyVerified": false,
    "ID": 146286,
    "UUID": "A6F9E8C9-DE56-4D42-A0CF-248633251C51",
    "DataProviderID": 1,
    "OperatorID": 213,
    "OperatorsReference": "5a90cfe0e4b0bfa7cf6f3676",
    "UsageTypeID": 1,
    "UsageCost": "0.00€",
    "AddressInfo": {
        "ID": 146638,
        "Title": "Place de la Poterne",
        "AddressLine1": "Place de la Poterne",
        "Town": "Saumur",
        "StateOrProvince": "Maine-et-Loire",
        "Postcode": "49400",
        "CountryID": 80,
        "Latitude": 47.264232,
        "Longitude": -0.100163,
        "DistanceUnit": 0
    },
    "Connections": [
        {
            "ID": 203303,
            "ConnectionTypeID": 1036,
            "StatusTypeID": 50,
            "LevelID": 2,
            "PowerKW": 18,
            "CurrentTypeID": 20,
            "Quantity": 1
        },
        {
            "ID": 203304,
            "ConnectionTypeID": 23,
            "StatusTypeID": 50,
            "LevelID": 2,
            "PowerKW": 6,
            "CurrentTypeID": 20,
            "Quantity": 1
        }
    ],
    "NumberOfPoints": 1,
    "StatusTypeID": 50,
    "DateLastStatusUpdate": "2020-01-05T20:23:00Z",
    "DataQualityLevel": 1,
    "DateCreated": "2020-01-05T20:23:00Z",
    "SubmissionStatusTypeID": 200
}