{
    "IsRecentlyVerified": false,
    "ID": 138350,
    "UUID": "2EF1566B-3AD0-4626-9DD3-5277BCBF8EF0",
    "DataProviderID": 2,
    "DataProvidersReference": "146941",
    "OperatorID": 59,
    "UsageTypeID": 1,
    "AddressInfo": {
        "ID": 138699,
        "Title": "Greenlots - 162133",
        "AddressLine1": "9301 Summit Centre Way",
        "Town": "Orlando",
        "StateOrProvince": "FL",
        "Postcode": "32810",
        "CountryID": 2,
        "Latitude": 28.639442,
        "Longitude": -81.410909,
        "ContactTelephone1": "855-900-7584",
        "AccessComments": "24 hours daily",
        "RelatedURL": "http://greenlots.com/",
        "DistanceUnit": 0
    },
    "Connections": [
        {
            "ID": 193452,
            "ConnectionTypeID": 1,
            "LevelID": 2,
            "Amps": 16,
            "Voltage": 230,
            "PowerKW": 3.7,
            "CurrentTypeID": 10,
            "Quantity": 4
        }
    ],
    "StatusTypeID": 50,
    "DateLastStatusUpdate": "2020-06-26T02:52:00Z",
    "DataQualityLevel": 3,
    "DateCreated": "2019-12-24T09:08:00Z",
    "SubmissionStatusTypeID": 100
}