{
    "IsRecentlyVerified": false,
    "ID": 173533,
    "UUID": "FA4A4B79-DAB6-469C-B680-88C142035244",
    "DataProviderID": 18,
    "DataProvidersReference": "7ff28c3e328f69fd2c3d672e38ff69e7",
    "OperatorID": 2244,
    "UsageTypeID": 5,
    "AddressInfo": {
        "ID": 173892,
        "Title": "12 Cleveland Terrace",
        "AddressLine1": "12 Cleveland Terrace",
        "Town": "London",
        "Postcode": "W2 6QH",
        "CountryID": 1,
        "Latitude": 51.51677,
        "Longitude": -0.180927,
        "AccessComments": "",
        "RelatedURL": "https://www.ubitricity.com",
        "DistanceUnit": 0
    },
    "Connections": [
        {
            "ID": 266595,
            "ConnectionTypeID": 25,
            "Reference": "suby1100005954",
            "StatusTypeID": 50,
            "LevelID": 2,
            "Amps": 16,
            "Voltage": 230,
            "PowerKW": 3.7,
            "CurrentTypeID": 10
        }
    ],
    "StatusTypeID": 0,
    "DateLastStatusUpdate": "2021-04-25T05:46:00Z",
    "MetadataValues": [
        {
            "ID": 8455,
            "MetadataFieldID": 4,
            "ItemValue": "Contains public sector information licensed under the Open Government Licence v2.0. http://www.nationalarchives.gov.uk/doc/open-government-licence/version/2/"
        }
    ],
    "DataQualityLevel": 3,
    "DateCreated": "2021-03-03T11:25:00Z",
    "SubmissionStatusTypeID": 100
}