{
    "IsRecentlyVerified": false,
    "ID": 141341,
    "UUID": "8457F9B4-2835-4E40-824A-FBC6FB6EFC85",
    "DataProviderID": 2,
    "DataProvidersReference": "148080",
    "OperatorID": 39,
    "UsageTypeID": 1,
    "AddressInfo": {
        "ID": 141693,
        "Title": "Crested Butte EV",
        "AddressLine1": "602 Elk Avenue",
        "Town": "Crested Butte",
        "StateOrProvince": "CO",
        "Postcode": "81224",
        "CountryID": 2,
        "Latitude": 38.86961114868,
        "Longitude": -106.98088711003,
        "ContactTelephone1": "800-663-5633",
        "AccessComments": "MO: 12:00am-12:00am; TU: 12:00am-12:00am; WE: 12:00am-12:00am; TH: 12:00am-12:00am; FR: 12:00am-12:00am; SA: 12:00am-12:00am; SU: 12:00am-12:00am",
        "RelatedURL": "http://www.semacharge.com/",
        "DistanceUnit": 0
    },
    "Connections": [
        {
            "ID": 197256,
            "ConnectionTypeID": 1,
            "LevelID": 2,
            "Amps": 16,
            "Voltage": 230,
            "PowerKW": 3.7,
            "CurrentTypeID": 10,
            "Quantity": 1
        }
    ],
    "StatusTypeID": 50,
    "DateLastStatusUpdate": "2020-06-26T03:00:00Z",
    "DataQualityLevel": 3,
    "DateCreated": "2019-12-24T09:15:00Z",
    "SubmissionStatusTypeID": 100
}