{
    "IsRecentlyVerified": false,
    "ID": 152367,
    "UUID": "D2ECF3B5-8A76-4EEF-9E3F-72F2DCF6EE43",
    "DataProviderID": 28,
    "DataProvidersReference": "FR*S58*P58194*B",
    "UsageTypeID": 5,
    "AddressInfo": {
        "ID": 152720,
        "Title": "NEVERS_Impasse de la Grippe",
        "AddressLine1": "Impasse de la Grippe 58000 NEVERS",
        "CountryID": 80,
        "Latitude": 46.98639327,
        "Longitude": 3.15137699,
        "AccessComments": "24/24 7/7 jours",
        "DistanceUnit": 0
    },
    "Connections": [
        {
            "ID": 213285,
            "ConnectionTypeID": 28,
            "StatusTypeID": 50,
            "LevelID": 2,
            "PowerKW": 22,
            "CurrentTypeID": 10
        },
        {
            "ID": 213286,
            "ConnectionTypeID": 1036,
            "StatusTypeID": 50,
            "LevelID": 2,
            "PowerKW": 22,
            "CurrentTypeID": 20
        },
        {
            "ID": 246161,
            "ConnectionTypeID": 28,
            "StatusTypeID": 50,
            "LevelID": 2,
            "PowerKW": 22,
            "CurrentTypeID": 10
        },
        {
            "ID": 246162,
            "ConnectionTypeID": 1036,
            "StatusTypeID": 50,
            "LevelID": 2,
            "PowerKW": 22,
            "CurrentTypeID": 20
        }
    ],
    "GeneralComments": "",
    "StatusTypeID": 50,
    "DateLastStatusUpdate": "2020-08-27T05:13:00Z",
    "DataQualityLevel": 2,
    "DateCreated": "2020-03-15T10:53:00Z",
    "SubmissionStatusTypeID": 100
}