{
    "IsRecentlyVerified": false,
    "ID": 104483,
    "UUID": "E5302283-A6C9-4F9D-97BA-3D1253A66CBA",
    "DataProviderID": 1,
    "OperatorID": 23,
    "OperatorsReference": "43181",
    "UsageTypeID": 4,
    "AddressInfo": {
        "ID": 104829,
        "Title": "Hotel Skivehus",
        "AddressLine1": "Sdr.boulevard 1",
        "Town": "Skive",
        "Postcode": "7800",
        "CountryID": 65,
        "Latitude": 56.564766,
        "Longitude": 9.0309,
        "ContactTelephone1": "+45 97521144",
        "DistanceUnit": 0
    },
    "Connections": [
        {
            "ID": 147478,
            "ConnectionTypeID": 30,
            "StatusTypeID": 50,
            "LevelID": 2,
            "Amps": 32,
            "Voltage": 400,
            "PowerKW": 22,
            "CurrentTypeID": 20,
            "Quantity": 2
        }
    ],
    "NumberOfPoints": 2,
    "GeneralComments": "2 Tesla Connectors, up to 22kW.Available to the public. Please see front desk.",
    "StatusTypeID": 50,
    "DateLastStatusUpdate": "2018-10-03T20:17:00Z",
    "DataQualityLevel": 1,
    "DateCreated": "2018-05-20T05:43:00Z",
    "SubmissionStatusTypeID": 200
}