{
    "UserComments": [
        {
            "ID": 20590,
            "ChargePointID": 113696,
            "CommentTypeID": 10,
            "UserName": "ForumElettrico.it",
            "RelatedURL": "https://www.forumelettrico.it/forum/colonnina-duferco-22kw-ac-arenzano-ge-piazza-allende-t4465.html",
            "DateCreated": "2019-01-03T18:38:53.11Z",
            "User": {
                "ID": 11749,
                "Username": "ForumElettrico.it"
            },
            "CheckinStatusTypeID": 140
        }
    ],
    "MediaItems": [
        {
            "ID": 17341,
            "ChargePointID": 113696,
            "ItemURL": "https://s3-ap-southeast-2.amazonaws.com/openchargemap/images/IT/OCM113696/OCM-113696.orig.2019010318390800.jpg",
            "ItemThumbnailURL": "https://s3-ap-southeast-2.amazonaws.com/openchargemap/images/IT/OCM113696/OCM-113696.thmb.2019010318390800.jpg",
            "Comment": "",
            "IsEnabled": true,
            "IsVideo": false,
            "IsFeaturedItem": false,
            "IsExternalResource": false,
            "User": {
                "ID": 11749,
                "Username": "ForumElettrico.it"
            },
            "DateCreated": "2019-01-03T18:39:00Z"
        },
        {
            "ID": 17342,
            "ChargePointID": 113696,
            "ItemURL": "https://s3-ap-southeast-2.amazonaws.com/openchargemap/images/IT/OCM113696/OCM-113696.orig.2019010318391601.jpg",
            "ItemThumbnailURL": "https://s3-ap-southeast-2.amazonaws.com/openchargemap/images/IT/OCM113696/OCM-113696.thmb.2019010318391601.jpg",
            "Comment": "",
            "IsEnabled": true,
            "IsVideo": false,
            "IsFeaturedItem": false,
            "IsExternalResource": false,
            "User": {
                "ID": 11749,
                "Username": "ForumElettrico.it"
            },
            "DateCreated": "2019-01-03T18:39:00Z"
        }
    ],
    "IsRecentlyVerified": false,
    "ID": 113696,
    "UUID": "056A1DCA-A91B-4174-B27E-2C2B8855F763",
    "DataProviderID": 1,
    "OperatorID": 3267,
    "UsageTypeID": 4,
    "UsageCost": "0,488 €/Kw",
    "AddressInfo": {
        "ID": 114042,
        "Title": "Arenzano Ex Ferrovia | Duferco",
        "AddressLine1": "Piazza Salvador Allende / Piazza della Vecchia Ferrovia",
        "Town": "Arenzano ",
        "StateOrProvince": "GE",
        "Postcode": "16011",
        "CountryID": 112,
        "Latitude": 44.40220845116256,
        "Longitude": 8.684533637724424,
        "ContactTelephone1": "800.92.22.00",
        "ContactEmail": "clienti@dufercoenergia.com",
        "RelatedURL": "https://dufercoenergia.com/e-mobility/",
        "DistanceUnit": 0
    },
    "Connections": [
        {
            "ID": 160248,
            "ConnectionTypeID": 25,
            "StatusTypeID": 50,
            "LevelID": 2,
            "Amps": 32,
            "Voltage": 400,
            "PowerKW": 22,
            "CurrentTypeID": 20,
            "Quantity": 2
        },
        {
            "ID": 160249,
            "ConnectionTypeID": 36,
            "StatusTypeID": 50,
            "LevelID": 2,
            "Amps": 16,
            "Voltage": 240,
            "PowerKW": 3.7,
            "CurrentTypeID": 10,
            "Quantity": 2
        }
    ],
    "NumberOfPoints": 4,
    "StatusTypeID": 50,
    "DateLastStatusUpdate": "2021-09-07T08:06:00Z",
    "DataQualityLevel": 1,
    "DateCreated": "2018-12-30T16:26:00Z",
    "SubmissionStatusTypeID": 200
}