{
    "IsRecentlyVerified": false,
    "ID": 173222,
    "UUID": "71FC3E05-B15F-41E6-BCB1-4345128023D1",
    "DataProviderID": 19,
    "DataProvidersReference": "4581",
    "AddressInfo": {
        "ID": 173581,
        "Title": "Hede snabbladdstation",
        "AddressLine1": "Storgatan 7",
        "Town": "HEDE",
        "StateOrProvince": "JÄMTLAND",
        "Postcode": "84093",
        "CountryID": 216,
        "Latitude": 62.41876,
        "Longitude": 13.51069,
        "AccessComments": "Finns vid Distriktsveterinärerna Hede",
        "DistanceUnit": 0
    },
    "Connections": [
        {
            "ID": 265950,
            "ConnectionTypeID": 2,
            "Reference": "1",
            "LevelID": 3,
            "Amps": 100,
            "Voltage": 500,
            "PowerKW": 50,
            "CurrentTypeID": 30,
            "Comments": "Mode 4"
        },
        {
            "ID": 265951,
            "ConnectionTypeID": 33,
            "Reference": "2",
            "LevelID": 3,
            "Amps": 100,
            "Voltage": 500,
            "PowerKW": 50,
            "CurrentTypeID": 30,
            "Comments": "Mode 4"
        },
        {
            "ID": 265952,
            "ConnectionTypeID": 25,
            "Reference": "3",
            "LevelID": 3,
            "Amps": 32,
            "Voltage": 400,
            "PowerKW": 22,
            "CurrentTypeID": 30,
            "Comments": "Mode 3"
        },
        {
            "ID": 265953,
            "ConnectionTypeID": 1,
            "Reference": "4",
            "LevelID": 2,
            "Amps": 32,
            "Voltage": 230,
            "PowerKW": 7.4,
            "CurrentTypeID": 10,
            "Comments": "Mode 3"
        }
    ],
    "NumberOfPoints": 4,
    "StatusTypeID": 0,
    "DateLastStatusUpdate": "2021-03-24T05:12:00Z",
    "DataQualityLevel": 2,
    "DateCreated": "2021-03-03T09:02:00Z",
    "SubmissionStatusTypeID": 100
}