{
    "IsRecentlyVerified": false,
    "ID": 47915,
    "UUID": "CBACEFAB-4D30-4B6A-A3EF-194FFCF98D32",
    "DataProviderID": 1,
    "OperatorID": 32,
    "OperatorsReference": "1647,1658",
    "UsageTypeID": 4,
    "UsageCost": "£0.108/kWh; for Polar Plus subscription members only. Parking fees apply. Polar Network users charged £1.70/hour connected",
    "AddressInfo": {
        "ID": 48261,
        "Title": "Lewisham Centre multi-storey car park",
        "AddressLine1": "Molesworth Street",
        "AddressLine2": "Lewisham",
        "Town": "London",
        "StateOrProvince": "England",
        "Postcode": "SE13 7HB",
        "CountryID": 1,
        "Latitude": 51.461899,
        "Longitude": -0.012621,
        "AccessComments": "inside pay-on-foot car park. Parking charges apply",
        "DistanceUnit": 0
    },
    "Connections": [
        {
            "ID": 59097,
            "ConnectionTypeID": 25,
            "StatusTypeID": 50,
            "LevelID": 2,
            "Amps": 32,
            "Voltage": 230,
            "PowerKW": 7,
            "CurrentTypeID": 10,
            "Quantity": 4
        }
    ],
    "NumberOfPoints": 4,
    "StatusTypeID": 50,
    "DateLastStatusUpdate": "2019-03-05T06:13:00Z",
    "DataQualityLevel": 1,
    "DateCreated": "2015-06-15T13:36:00Z",
    "SubmissionStatusTypeID": 200
}