{
    "IsRecentlyVerified": false,
    "ID": 102357,
    "UUID": "AB7D3430-5DB5-4E12-A21F-F9ED753428FD",
    "DataProviderID": 2,
    "DataProvidersReference": "92301",
    "OperatorID": 5,
    "UsageTypeID": 1,
    "AddressInfo": {
        "ID": 102703,
        "Title": "NATIONAL UNIV",
        "AddressLine1": "9980 Carroll Canyon Rd",
        "Town": "San Diego",
        "StateOrProvince": "CA",
        "Postcode": "92131",
        "CountryID": 2,
        "Latitude": 32.9044889,
        "Longitude": -117.1123784,
        "ContactTelephone1": "888-758-4389",
        "AccessComments": "24 hours daily",
        "RelatedURL": "http://www.chargepoint.com/",
        "DistanceUnit": 0
    },
    "Connections": [
        {
            "ID": 144422,
            "ConnectionTypeID": 1,
            "LevelID": 2,
            "Amps": 16,
            "Voltage": 230,
            "PowerKW": 3,
            "CurrentTypeID": 10,
            "Quantity": 1
        }
    ],
    "DateLastStatusUpdate": "2019-04-06T04:01:00Z",
    "DataQualityLevel": 3,
    "DateCreated": "2018-04-21T04:13:00Z",
    "SubmissionStatusTypeID": 100
}