{
    "IsRecentlyVerified": false,
    "ID": 36473,
    "UUID": "325616DB-3B0E-4EF4-83DA-EAEB1F855757",
    "DataProviderID": 26,
    "DataProvidersReference": "56228",
    "OperatorID": 73,
    "OperatorsReference": "EV-Box EVB-P1416106",
    "UsageCost": "0.00 jaarabonnement",
    "AddressInfo": {
        "ID": 36819,
        "Title": "Herenweg 13a",
        "AddressLine1": "Herenweg 13a",
        "Town": "Wijdemeren",
        "Postcode": "3625 AA",
        "CountryID": 159,
        "Latitude": 52.17223,
        "Longitude": 5.06943,
        "RelatedURL": "http://www.ev-box.nl",
        "DistanceUnit": 0
    },
    "Connections": [
        {
            "ID": 39984,
            "ConnectionTypeID": 25,
            "LevelID": 2,
            "PowerKW": 11,
            "CurrentTypeID": 10
        }
    ],
    "NumberOfPoints": 1,
    "StatusTypeID": 50,
    "DateLastStatusUpdate": "2016-06-04T02:51:00Z",
    "DataQualityLevel": 3,
    "DateCreated": "2015-01-09T06:05:00Z",
    "SubmissionStatusTypeID": 100
}