{
    "IsRecentlyVerified": false,
    "ID": 90430,
    "UUID": "0F2AF7FA-3441-4F72-8A22-C98F3AEFF958",
    "DataProviderID": 1,
    "OperatorID": 23,
    "OperatorsReference": "31123",
    "UsageTypeID": 4,
    "AddressInfo": {
        "ID": 90776,
        "Title": "MPG 923 5th Ave",
        "AddressLine1": "923 5th Ave",
        "Town": "New York",
        "StateOrProvince": "New York",
        "Postcode": "10021",
        "CountryID": 2,
        "Latitude": 40.773004,
        "Longitude": -73.966152,
        "ContactTelephone1": "(212) 249-1947",
        "DistanceUnit": 0
    },
    "Connections": [
        {
            "ID": 128083,
            "ConnectionTypeID": 30,
            "StatusTypeID": 50,
            "LevelID": 2,
            "PowerKW": 16,
            "CurrentTypeID": 20,
            "Quantity": 2
        }
    ],
    "NumberOfPoints": 2,
    "GeneralComments": "2 Tesla Connectors, up to 16kW.Available to the public. Please see valet.",
    "StatusTypeID": 50,
    "DateLastStatusUpdate": "2017-07-13T15:19:00Z",
    "DataQualityLevel": 1,
    "DateCreated": "2017-07-13T15:19:00Z",
    "SubmissionStatusTypeID": 200
}