{
    "IsRecentlyVerified": false,
    "ID": 176717,
    "UUID": "2DD0EB80-AFF4-48CE-B043-822E46203493",
    "DataProviderID": 29,
    "DataProvidersReference": "11897",
    "OperatorID": 128,
    "AddressInfo": {
        "ID": 177076,
        "Title": "Eichenweg 1",
        "AddressLine1": "Eichenweg 1",
        "Town": "Weyhausen",
        "Postcode": "38554",
        "CountryID": 87,
        "Latitude": 52.466114,
        "Longitude": 10.715755,
        "DistanceUnit": 0
    },
    "Connections": [
        {
            "ID": 274953,
            "ConnectionTypeID": 25,
            "StatusTypeID": 50,
            "LevelID": 2,
            "PowerKW": 22,
            "CurrentTypeID": 20
        },
        {
            "ID": 274954,
            "ConnectionTypeID": 25,
            "StatusTypeID": 50,
            "LevelID": 2,
            "PowerKW": 22,
            "CurrentTypeID": 20
        }
    ],
    "StatusTypeID": 0,
    "DateLastStatusUpdate": "2021-07-12T02:49:00Z",
    "MetadataValues": [
        {
            "ID": 9012,
            "MetadataFieldID": 4,
            "ItemValue": "Data from the German chargepoint registry provided by Bundesnetzagentur.de under the CC-BY 4.0 license"
        }
    ],
    "DataQualityLevel": 3,
    "DateCreated": "2021-07-08T09:48:00Z",
    "SubmissionStatusTypeID": 100
}