{
    "IsRecentlyVerified": false,
    "ID": 34892,
    "UUID": "76446D77-4534-450E-A644-DA0E9BF119E3",
    "DataProviderID": 26,
    "DataProvidersReference": "46978",
    "OperatorID": 178,
    "OperatorsReference": "EVnetNL AL111",
    "UsageCost": "0.00 jaarabonnement",
    "AddressInfo": {
        "ID": 35238,
        "Title": "Dingstraat",
        "AddressLine1": "Dingstraat",
        "Town": "Winterswijk",
        "Postcode": "7101 NJ",
        "CountryID": 159,
        "Latitude": 51.968268,
        "Longitude": 6.721175,
        "ContactTelephone1": "0800-3522365",
        "RelatedURL": "http://www.evnet.nl",
        "DistanceUnit": 0
    },
    "Connections": [
        {
            "ID": 38403,
            "ConnectionTypeID": 25,
            "LevelID": 2,
            "PowerKW": 11,
            "CurrentTypeID": 10
        }
    ],
    "NumberOfPoints": 1,
    "StatusTypeID": 50,
    "DateLastStatusUpdate": "2016-06-04T02:43:00Z",
    "DataQualityLevel": 3,
    "DateCreated": "2015-01-09T06:04:00Z",
    "SubmissionStatusTypeID": 100
}