{
    "IsRecentlyVerified": false,
    "ID": 70077,
    "UUID": "352B832B-5B6C-45FB-8A04-4AA0D50BA88D",
    "DataProviderID": 1,
    "OperatorID": 45,
    "UsageTypeID": 3,
    "AddressInfo": {
        "ID": 70423,
        "Title": "W&P Automobile",
        "AddressLine1": "Hauptstraße 12",
        "Town": "Hainburg",
        "StateOrProvince": "Landkreis Offenbach",
        "Postcode": "63512",
        "CountryID": 87,
        "Latitude": 50.08544,
        "Longitude": 8.940119999999979,
        "ContactTelephone1": "+496182-84350-0",
        "AccessComments": "Rund um die Uhr (24/7) nutzbar\r\n",
        "DistanceUnit": 0
    },
    "Connections": [
        {
            "ID": 99972,
            "ConnectionTypeID": 25,
            "StatusTypeID": 50,
            "LevelID": 2,
            "Amps": 16,
            "Voltage": 400,
            "PowerKW": 11,
            "CurrentTypeID": 20,
            "Quantity": 1
        }
    ],
    "NumberOfPoints": 1,
    "StatusTypeID": 50,
    "DateLastStatusUpdate": "2016-07-06T21:16:00Z",
    "DataQualityLevel": 1,
    "DateCreated": "2016-07-06T21:16:00Z",
    "SubmissionStatusTypeID": 200
}