{
    "IsRecentlyVerified": false,
    "ID": 136202,
    "UUID": "F76962D3-DEA4-4AA7-95C1-E9A703CD0D4D",
    "DataProviderID": 18,
    "DataProvidersReference": "bc54cb4a4a51322747ecd21d29947b1a",
    "OperatorID": 2244,
    "UsageTypeID": 5,
    "AddressInfo": {
        "ID": 136548,
        "Title": "Greenham Close",
        "AddressLine1": "Greenham Close",
        "Town": "London",
        "Postcode": "SE1 7RF",
        "CountryID": 1,
        "Latitude": 51.499947,
        "Longitude": -0.110097,
        "AccessComments": "",
        "RelatedURL": "https://www.ubitricity.com",
        "DistanceUnit": 0
    },
    "Connections": [
        {
            "ID": 190631,
            "ConnectionTypeID": 25,
            "Reference": "suby1100000824",
            "StatusTypeID": 50,
            "LevelID": 2,
            "Amps": 16,
            "Voltage": 230,
            "PowerKW": 3.7,
            "CurrentTypeID": 10
        }
    ],
    "StatusTypeID": 0,
    "DateLastStatusUpdate": "2021-04-25T05:46:00Z",
    "MetadataValues": [
        {
            "ID": 6054,
            "MetadataFieldID": 4,
            "ItemValue": "Contains public sector information licensed under the Open Government Licence v2.0. http://www.nationalarchives.gov.uk/doc/open-government-licence/version/2/"
        }
    ],
    "DataQualityLevel": 3,
    "DateCreated": "2019-12-24T05:22:00Z",
    "SubmissionStatusTypeID": 100
}