{
    "IsRecentlyVerified": true,
    "DateLastVerified": "2021-09-07T16:47:00Z",
    "ID": 189100,
    "UUID": "CB3BAAE5-2502-4658-B1ED-F0079DDA566F",
    "DataProviderID": 1,
    "OperatorID": 3371,
    "UsageTypeID": 4,
    "UsageCost": "",
    "AddressInfo": {
        "ID": 189459,
        "Title": "Gasóleos Ceao",
        "AddressLine1": "Avenida de Benigno Rivera",
        "Town": "Lugo",
        "StateOrProvince": "Galicia",
        "Postcode": "27003",
        "CountryID": 210,
        "Latitude": 43.05253759254501,
        "Longitude": -7.5643324529181655,
        "RelatedURL": "http://wenea.com",
        "DistanceUnit": 0
    },
    "Connections": [
        {
            "ID": 305693,
            "ConnectionTypeID": 33,
            "StatusTypeID": 50,
            "LevelID": 3,
            "Amps": 400,
            "Voltage": 920,
            "PowerKW": 100,
            "CurrentTypeID": 30,
            "Quantity": 2
        },
        {
            "ID": 305694,
            "ConnectionTypeID": 2,
            "StatusTypeID": 50,
            "LevelID": 3,
            "Amps": 125,
            "Voltage": 500,
            "PowerKW": 50,
            "CurrentTypeID": 30,
            "Quantity": 1
        },
        {
            "ID": 305695,
            "ConnectionTypeID": 25,
            "StatusTypeID": 50,
            "LevelID": 2,
            "Amps": 32,
            "Voltage": 400,
            "PowerKW": 22,
            "CurrentTypeID": 20,
            "Quantity": 1
        }
    ],
    "NumberOfPoints": 2,
    "StatusTypeID": 50,
    "DateLastStatusUpdate": "2021-09-07T16:53:00Z",
    "DataQualityLevel": 1,
    "DateCreated": "2021-09-07T16:47:00Z",
    "SubmissionStatusTypeID": 200
}