{
    "IsRecentlyVerified": false,
    "ID": 77708,
    "UUID": "73E90E2F-42BA-4B90-B1B5-2707A5F41C8E",
    "DataProviderID": 1,
    "OperatorID": 45,
    "UsageTypeID": 6,
    "AddressInfo": {
        "ID": 78054,
        "Title": "Hotel Vier Jahreszeiten",
        "AddressLine1": "Ostseeallee 10-12",
        "Town": "Kühlungsborn",
        "StateOrProvince": "Landkreis Rostock",
        "Postcode": "18225",
        "CountryID": 87,
        "Latitude": 54.15317407961327,
        "Longitude": 11.754716385250065,
        "ContactTelephone1": "+49 38293 81000",
        "AccessComments": "Das Laden für Gäste nach Reservierung auf dem Gästeparkplatz über Schuko ist in den Parkgebühren für Gäste (10€ am Tag) inbegriffen.",
        "RelatedURL": "http://www.4jahreszeiten-kuehlungsborn.de/",
        "DistanceUnit": 0
    },
    "Connections": [
        {
            "ID": 112267,
            "ConnectionTypeID": 28,
            "StatusTypeID": 50,
            "LevelID": 2,
            "Amps": 16,
            "Voltage": 230,
            "PowerKW": 3.7,
            "CurrentTypeID": 10,
            "Quantity": 1
        }
    ],
    "NumberOfPoints": 1,
    "StatusTypeID": 50,
    "DateLastStatusUpdate": "2017-01-23T07:24:00Z",
    "DataQualityLevel": 1,
    "DateCreated": "2017-01-23T07:24:00Z",
    "SubmissionStatusTypeID": 200
}