{
    "IsRecentlyVerified": false,
    "ID": 144309,
    "UUID": "C3341B57-1133-4DEE-9331-E055804F60EF",
    "DataProviderID": 2,
    "DataProvidersReference": "130434",
    "OperatorID": 90,
    "UsageTypeID": 1,
    "AddressInfo": {
        "ID": 144661,
        "Title": "15795 Gouin Ouest",
        "AddressLine1": "15795 Gouin Ouest",
        "Town": "Sainte-Geneviève",
        "StateOrProvince": "QC",
        "Postcode": "H9H 1C5",
        "CountryID": 44,
        "Latitude": 45.482117,
        "Longitude": -73.869858,
        "ContactTelephone1": "877-505-2674",
        "AccessComments": "24 hours daily",
        "RelatedURL": "https://lecircuitelectrique.com/",
        "DistanceUnit": 0
    },
    "Connections": [
        {
            "ID": 200805,
            "ConnectionTypeID": 1,
            "LevelID": 2,
            "Amps": 16,
            "Voltage": 230,
            "PowerKW": 3.7,
            "CurrentTypeID": 10,
            "Quantity": 2
        }
    ],
    "StatusTypeID": 50,
    "DateLastStatusUpdate": "2020-06-26T03:09:00Z",
    "DataQualityLevel": 3,
    "DateCreated": "2019-12-24T09:23:00Z",
    "SubmissionStatusTypeID": 100
}