{
    "IsRecentlyVerified": false,
    "ID": 66454,
    "UUID": "0806BB25-B4A0-4217-B20D-BDFBD687920D",
    "DataProviderID": 1,
    "OperatorID": 1,
    "UsageTypeID": 1,
    "AddressInfo": {
        "ID": 66800,
        "Title": "E-Bike Station Skaterhalle",
        "AddressLine1": "Langobardenstraße 65",
        "Town": "Wuppertal",
        "StateOrProvince": "Wuppertal",
        "Postcode": "42277",
        "CountryID": 87,
        "Latitude": 51.27935142187554,
        "Longitude": 7.224272133729515,
        "AccessComments": "3 Ladefächer nutzbar täglich von 7-22Uhr, Betreiber sind die Wuppertaler Stadtwerke WSW. ",
        "RelatedURL": "http://www.wsw-online.de/wsw-energie-wasser/privatkunden/nachhaltigkeit/emobilitaet/pedelec-akku-stationen/",
        "DistanceUnit": 0
    },
    "Connections": [
        {
            "ID": 91831,
            "ConnectionTypeID": 28,
            "StatusTypeID": 50,
            "LevelID": 1,
            "Amps": 10,
            "Voltage": 230,
            "PowerKW": 2.3,
            "CurrentTypeID": 10,
            "Quantity": 3
        }
    ],
    "NumberOfPoints": 3,
    "StatusTypeID": 50,
    "DateLastStatusUpdate": "2016-05-20T11:30:00Z",
    "DataQualityLevel": 1,
    "DateCreated": "2016-05-20T11:30:00Z",
    "SubmissionStatusTypeID": 200
}