{
    "IsRecentlyVerified": false,
    "ID": 18710,
    "UUID": "450B643D-78F2-4AAA-9E39-B7E2A46282E3",
    "DataProviderID": 15,
    "DataProvidersReference": "30206",
    "OperatorID": 1,
    "UsageTypeID": 1,
    "AddressInfo": {
        "ID": 19055,
        "Title": "??????????",
        "AddressLine1": "??????????",
        "Town": "???",
        "StateOrProvince": "",
        "Postcode": "116000",
        "CountryID": 50,
        "Latitude": 38.957273,
        "Longitude": 121.524239,
        "ContactTelephone1": "",
        "RelatedURL": "http://carstations.com/30206",
        "DistanceUnit": 0
    },
    "Connections": [
        {
            "ID": 18943,
            "ConnectionTypeID": 1,
            "Reference": "J1772",
            "LevelID": 2,
            "Quantity": 1
        }
    ],
    "NumberOfPoints": 1,
    "StatusTypeID": 0,
    "DateLastStatusUpdate": "2014-03-22T04:39:00Z",
    "DataQualityLevel": 2,
    "DateCreated": "2013-08-25T03:30:00Z",
    "SubmissionStatusTypeID": 200
}