{
    "IsRecentlyVerified": false,
    "ID": 170112,
    "UUID": "53D3653F-9226-452E-9345-4AC031029125",
    "DataProviderID": 1,
    "OperatorID": 3327,
    "UsageTypeID": 4,
    "AddressInfo": {
        "ID": 170471,
        "Title": "BECHARGE Bosaro Falcone",
        "AddressLine1": "Via Falcone",
        "Town": "Bosaro",
        "StateOrProvince": "RO",
        "Postcode": "45033",
        "CountryID": 112,
        "Latitude": 45.00207437333577,
        "Longitude": 11.768943981553434,
        "ContactTelephone1": "02-49527730",
        "ContactEmail": "emobility@buildingenergy.it",
        "RelatedURL": "https://www.bec.energy/",
        "DistanceUnit": 0
    },
    "Connections": [
        {
            "ID": 259335,
            "ConnectionTypeID": 25,
            "StatusTypeID": 50,
            "LevelID": 2,
            "Amps": 32,
            "Voltage": 400,
            "PowerKW": 22,
            "CurrentTypeID": 20,
            "Quantity": 4
        }
    ],
    "NumberOfPoints": 4,
    "StatusTypeID": 50,
    "DateLastStatusUpdate": "2020-11-18T13:58:00Z",
    "DataQualityLevel": 1,
    "DateCreated": "2020-11-18T13:58:00Z",
    "SubmissionStatusTypeID": 200
}