{
    "IsRecentlyVerified": false,
    "ID": 120161,
    "UUID": "F3B23647-4162-40B5-9C12-A705F9D581A0",
    "DataProviderID": 2,
    "DataProvidersReference": "65325",
    "OperatorID": 5,
    "UsageTypeID": 1,
    "AddressInfo": {
        "ID": 120507,
        "Title": "PIE-CAPRIDGE",
        "AddressLine1": "115 Wild Basin Rd",
        "Town": "Austin",
        "StateOrProvince": "TX",
        "Postcode": "78746",
        "CountryID": 2,
        "Latitude": 30.3041819,
        "Longitude": -97.8281612,
        "ContactTelephone1": "888-758-4389",
        "AccessComments": "24 hours daily",
        "RelatedURL": "http://www.chargepoint.com/",
        "DistanceUnit": 0
    },
    "Connections": [
        {
            "ID": 169486,
            "ConnectionTypeID": 1,
            "LevelID": 2,
            "Amps": 16,
            "Voltage": 230,
            "PowerKW": 3,
            "CurrentTypeID": 10,
            "Quantity": 2
        }
    ],
    "DateLastStatusUpdate": "2019-12-24T09:08:00Z",
    "DataQualityLevel": 3,
    "DateCreated": "2019-04-01T04:59:00Z",
    "SubmissionStatusTypeID": 100
}