{
    "IsRecentlyVerified": false,
    "ID": 182711,
    "UUID": "6CE548B4-2D95-4D3D-98DE-12AF09DF2631",
    "DataProviderID": 29,
    "DataProvidersReference": "8660",
    "AddressInfo": {
        "ID": 183070,
        "Title": "Gerichtsweg 8",
        "AddressLine1": "Gerichtsweg 8",
        "Town": "Burgau",
        "Postcode": "89331",
        "CountryID": 87,
        "Latitude": 48.432533,
        "Longitude": 10.404427,
        "DistanceUnit": 0
    },
    "Connections": [
        {
            "ID": 288786,
            "ConnectionTypeID": 25,
            "StatusTypeID": 50,
            "LevelID": 2,
            "PowerKW": 22,
            "CurrentTypeID": 20
        },
        {
            "ID": 288787,
            "ConnectionTypeID": 25,
            "StatusTypeID": 50,
            "LevelID": 2,
            "PowerKW": 22,
            "CurrentTypeID": 20
        }
    ],
    "StatusTypeID": 50,
    "DateLastStatusUpdate": "2021-07-12T02:41:00Z",
    "MetadataValues": [
        {
            "ID": 15004,
            "MetadataFieldID": 4,
            "ItemValue": "Data from the German chargepoint registry provided by Bundesnetzagentur.de under the CC-BY 4.0 license"
        }
    ],
    "DataQualityLevel": 3,
    "DateCreated": "2021-07-08T10:03:00Z",
    "SubmissionStatusTypeID": 100
}