{
    "IsRecentlyVerified": false,
    "ID": 64568,
    "UUID": "DD1955C8-8507-4D9F-9445-E7918178C00E",
    "DataProviderID": 1,
    "OperatorID": 214,
    "UsageTypeID": 4,
    "AddressInfo": {
        "ID": 64914,
        "Title": "Leberstraße",
        "AddressLine1": "Leberstraße 6",
        "AddressLine2": "Schöneberg",
        "Town": "Berlin",
        "StateOrProvince": "Berlin",
        "Postcode": "10829",
        "CountryID": 87,
        "Latitude": 52.4854971,
        "Longitude": 13.361213799999973,
        "AccessComments": "Rund um die Uhr (24/7) nutzbar. Ladekarte von be eMobil oder Roamingpartnern The New Motion, LichtBlick Fahrstrom Chip oder ACE Ladekarte Power Me erforderlich. ",
        "DistanceUnit": 0
    },
    "Connections": [
        {
            "ID": 82952,
            "ConnectionTypeID": 25,
            "StatusTypeID": 50,
            "LevelID": 2,
            "Amps": 16,
            "Voltage": 400,
            "PowerKW": 11,
            "CurrentTypeID": 20,
            "Quantity": 2
        }
    ],
    "NumberOfPoints": 2,
    "StatusTypeID": 50,
    "DateLastStatusUpdate": "2016-03-11T10:46:00Z",
    "DataQualityLevel": 1,
    "DateCreated": "2016-03-11T10:46:00Z",
    "SubmissionStatusTypeID": 200
}