{
    "IsRecentlyVerified": false,
    "ID": 116981,
    "UUID": "EC804BA4-C994-4B37-8D01-B60073377DAC",
    "DataProviderID": 1,
    "OperatorID": 80,
    "UsageTypeID": 4,
    "AddressInfo": {
        "ID": 117327,
        "Title": "Gualdo Tadino Giardini Pubblici | EnelX",
        "AddressLine1": "Piazzale de Giardini Pubblici",
        "Town": "Gualdo Tadino",
        "StateOrProvince": "PG",
        "Postcode": "06023",
        "CountryID": 112,
        "Latitude": 43.23158450219219,
        "Longitude": 12.78869357598137,
        "RelatedURL": "https://www.enelx.com/it/it/emobility",
        "DistanceUnit": 0
    },
    "Connections": [
        {
            "ID": 165591,
            "ConnectionTypeID": 25,
            "StatusTypeID": 50,
            "LevelID": 2,
            "Amps": 32,
            "Voltage": 400,
            "PowerKW": 22,
            "CurrentTypeID": 20,
            "Quantity": 1
        },
        {
            "ID": 165592,
            "ConnectionTypeID": 36,
            "StatusTypeID": 50,
            "LevelID": 2,
            "Amps": 16,
            "Voltage": 240,
            "PowerKW": 3.7,
            "CurrentTypeID": 10,
            "Quantity": 1
        }
    ],
    "NumberOfPoints": 2,
    "StatusTypeID": 50,
    "DateLastStatusUpdate": "2019-02-15T16:46:00Z",
    "DataQualityLevel": 1,
    "DateCreated": "2019-02-15T16:46:00Z",
    "SubmissionStatusTypeID": 200
}