{
    "IsRecentlyVerified": false,
    "ID": 34631,
    "UUID": "686F9987-504F-4E6B-BEE4-174A2E4EE9EC",
    "DataProviderID": 1,
    "OperatorID": 105,
    "OperatorsReference": "Essent EM-DE-05711000-02-00001",
    "UsageTypeID": 4,
    "AddressInfo": {
        "ID": 34977,
        "Title": "Paderborner Str. 319",
        "AddressLine1": "Paderborner Str. 319",
        "Town": "Bielefeld",
        "Postcode": "33689",
        "CountryID": 87,
        "Latitude": 51.932117,
        "Longitude": 8.608656,
        "DistanceUnit": 0
    },
    "Connections": [
        {
            "ID": 38142,
            "ConnectionTypeID": 25,
            "LevelID": 2,
            "PowerKW": 11
        },
        {
            "ID": 47416,
            "ConnectionTypeID": 25,
            "LevelID": 2,
            "PowerKW": 11
        }
    ],
    "NumberOfPoints": 1,
    "StatusTypeID": 50,
    "DateLastStatusUpdate": "2015-04-12T22:07:00Z",
    "DataQualityLevel": 3,
    "DateCreated": "2015-01-09T06:04:00Z",
    "SubmissionStatusTypeID": 200
}