{
    "IsRecentlyVerified": false,
    "ID": 36973,
    "UUID": "7215382E-1B03-40AA-80B6-45C5436BE4D0",
    "DataProviderID": 26,
    "DataProvidersReference": "48177",
    "OperatorID": 178,
    "OperatorsReference": "EVnetNL EV0059",
    "UsageCost": "0.00 jaarabonnement",
    "AddressInfo": {
        "ID": 37319,
        "Title": "Opaallaan 15",
        "AddressLine1": "Opaallaan 15",
        "Town": "Haarlemmermeer",
        "Postcode": "2132 XV",
        "CountryID": 159,
        "Latitude": 52.292098,
        "Longitude": 4.68139,
        "ContactTelephone1": "0800-3522365",
        "RelatedURL": "http://www.evnet.nl",
        "DistanceUnit": 0
    },
    "Connections": [
        {
            "ID": 40484,
            "ConnectionTypeID": 25,
            "LevelID": 2,
            "PowerKW": 11,
            "CurrentTypeID": 10
        }
    ],
    "NumberOfPoints": 1,
    "StatusTypeID": 50,
    "DateLastStatusUpdate": "2016-06-04T02:52:00Z",
    "DataQualityLevel": 3,
    "DateCreated": "2015-01-09T06:07:00Z",
    "SubmissionStatusTypeID": 100
}