{
    "IsRecentlyVerified": false,
    "ID": 136058,
    "UUID": "01E4FA29-E789-4452-813C-BCA965ACE82A",
    "DataProviderID": 18,
    "DataProvidersReference": "2ffa4f0ce849ecc17cddde7b441c8037",
    "OperatorID": 2244,
    "UsageTypeID": 5,
    "AddressInfo": {
        "ID": 136404,
        "Title": "Claxton Grove",
        "AddressLine1": "Claxton Grove",
        "Town": "London",
        "Postcode": "W6 8HD",
        "CountryID": 1,
        "Latitude": 51.487328,
        "Longitude": -0.216255,
        "AccessComments": "",
        "RelatedURL": "https://www.ubitricity.com",
        "DistanceUnit": 0
    },
    "Connections": [
        {
            "ID": 190485,
            "ConnectionTypeID": 25,
            "Reference": "suby1100001437",
            "StatusTypeID": 50,
            "LevelID": 2,
            "Amps": 16,
            "Voltage": 230,
            "PowerKW": 3.7,
            "CurrentTypeID": 10
        }
    ],
    "StatusTypeID": 0,
    "DateLastStatusUpdate": "2021-04-25T05:46:00Z",
    "MetadataValues": [
        {
            "ID": 5910,
            "MetadataFieldID": 4,
            "ItemValue": "Contains public sector information licensed under the Open Government Licence v2.0. http://www.nationalarchives.gov.uk/doc/open-government-licence/version/2/"
        }
    ],
    "DataQualityLevel": 3,
    "DateCreated": "2019-12-24T05:22:00Z",
    "SubmissionStatusTypeID": 100
}