{
    "IsRecentlyVerified": false,
    "ID": 158672,
    "UUID": "CBCFC021-CD2C-4618-BB6F-FCC4D958BE34",
    "DataProviderID": 2,
    "DataProvidersReference": "159988",
    "OperatorID": 5,
    "UsageTypeID": 1,
    "AddressInfo": {
        "ID": 159029,
        "Title": "BARNARD WAY HOA",
        "AddressLine1": "10 Ocean Park Blvd",
        "Town": "Santa Monica",
        "StateOrProvince": "CA",
        "Postcode": "90405",
        "CountryID": 2,
        "Latitude": 34.000888,
        "Longitude": -118.484663,
        "ContactTelephone1": "888-758-4389",
        "AccessComments": "24 hours daily",
        "RelatedURL": "http://www.chargepoint.com/",
        "DistanceUnit": 0
    },
    "Connections": [
        {
            "ID": 228691,
            "ConnectionTypeID": 1,
            "LevelID": 2,
            "Amps": 16,
            "Voltage": 230,
            "PowerKW": 3.7,
            "CurrentTypeID": 10,
            "Quantity": 9
        }
    ],
    "StatusTypeID": 50,
    "DateLastStatusUpdate": "2020-06-26T02:56:00Z",
    "DataQualityLevel": 3,
    "DateCreated": "2020-06-26T02:56:00Z",
    "SubmissionStatusTypeID": 100
}