{
    "IsRecentlyVerified": false,
    "ID": 14606,
    "UUID": "23E58F2D-3A8D-45FD-BB00-21A62751EC01",
    "DataProviderID": 2,
    "DataProvidersReference": "49199",
    "UsageTypeID": 2,
    "AddressInfo": {
        "ID": 14503,
        "Title": "Giant Eagle - Alpha Drive",
        "AddressLine1": "651 Alpha Dr",
        "Town": "Pittsburgh",
        "StateOrProvince": "PA",
        "Postcode": "15238",
        "CountryID": 2,
        "Latitude": 40.503726,
        "Longitude": -79.870581,
        "ContactTelephone1": "",
        "AccessComments": "",
        "RelatedURL": "",
        "DistanceUnit": 0
    },
    "Connections": [
        {
            "ID": 16720,
            "ConnectionTypeID": 1,
            "LevelID": 2,
            "Amps": 16,
            "Voltage": 230,
            "PowerKW": 3,
            "CurrentTypeID": 10,
            "Quantity": 1
        },
        {
            "ID": 21883,
            "ConnectionTypeID": 1,
            "LevelID": 2,
            "Quantity": 1
        }
    ],
    "DateLastStatusUpdate": "2019-04-06T04:03:00Z",
    "DataQualityLevel": 3,
    "DateCreated": "2012-12-06T16:50:00Z",
    "SubmissionStatusTypeID": 100
}