{
    "IsRecentlyVerified": false,
    "ID": 72640,
    "UUID": "BCF8384D-EB6B-43A8-B2BD-9423BA79E2FD",
    "DataProviderID": 1,
    "OperatorID": 2241,
    "UsageTypeID": 4,
    "AddressInfo": {
        "ID": 72986,
        "Title": "Parkplatz am Bahnhof",
        "AddressLine1": "Berthold-Bott-Straße 62",
        "Town": "Kraichtal",
        "StateOrProvince": "Landkreis Karlsruhe",
        "Postcode": "76703",
        "CountryID": 87,
        "Latitude": 49.10928803672468,
        "Longitude": 8.743436678573623,
        "AccessComments": "24/7 nutzbar. 2 Parkplätze vor der weißgrünen Ladesäule, einer davon für Carsharing reserviert.",
        "DistanceUnit": 0
    },
    "Connections": [
        {
            "ID": 104141,
            "ConnectionTypeID": 25,
            "StatusTypeID": 50,
            "LevelID": 2,
            "PowerKW": 22,
            "CurrentTypeID": 20,
            "Quantity": 2
        },
        {
            "ID": 104142,
            "ConnectionTypeID": 28,
            "StatusTypeID": 50,
            "LevelID": 2,
            "Amps": 16,
            "Voltage": 230,
            "PowerKW": 3.7,
            "CurrentTypeID": 10,
            "Quantity": 2
        }
    ],
    "NumberOfPoints": 2,
    "StatusTypeID": 50,
    "DateLastStatusUpdate": "2016-10-28T05:24:00Z",
    "DataQualityLevel": 1,
    "DateCreated": "2016-10-28T05:24:00Z",
    "SubmissionStatusTypeID": 200
}