{
    "IsRecentlyVerified": false,
    "ID": 136417,
    "UUID": "9938F62F-E3B1-4D91-AF6E-EC0B719FC845",
    "DataProviderID": 18,
    "DataProvidersReference": "85d5f233371c9a0511187c1e3538dc06",
    "OperatorID": 2244,
    "UsageTypeID": 5,
    "AddressInfo": {
        "ID": 136763,
        "Title": "Ordnance Hill",
        "AddressLine1": "Ordnance Hill",
        "Town": "London",
        "Postcode": "NW8 6PR",
        "CountryID": 1,
        "Latitude": 51.535072,
        "Longitude": -0.170359,
        "AccessComments": "",
        "RelatedURL": "https://www.ubitricity.com",
        "DistanceUnit": 0
    },
    "Connections": [
        {
            "ID": 190861,
            "ConnectionTypeID": 25,
            "Reference": "suby1100002436",
            "StatusTypeID": 50,
            "LevelID": 2,
            "Amps": 16,
            "Voltage": 230,
            "PowerKW": 3.7,
            "CurrentTypeID": 10
        }
    ],
    "StatusTypeID": 0,
    "DateLastStatusUpdate": "2021-04-25T05:46:00Z",
    "MetadataValues": [
        {
            "ID": 6269,
            "MetadataFieldID": 4,
            "ItemValue": "Contains public sector information licensed under the Open Government Licence v2.0. http://www.nationalarchives.gov.uk/doc/open-government-licence/version/2/"
        }
    ],
    "DataQualityLevel": 3,
    "DateCreated": "2019-12-24T05:22:00Z",
    "SubmissionStatusTypeID": 100
}