{
    "IsRecentlyVerified": false,
    "ID": 108591,
    "UUID": "32131A83-E3C8-43B1-A19D-96F3C629430D",
    "DataProviderID": 1,
    "OperatorID": 3,
    "OperatorsReference": "PG-81979",
    "UsageTypeID": 2,
    "UsageCost": "£0.20/kWh",
    "AddressInfo": {
        "ID": 108937,
        "Title": "Tadley Town Council",
        "AddressLine1": "2 Franklin Avenue",
        "Town": "Tadley",
        "StateOrProvince": "Hampshire",
        "Postcode": "RG26 4ET",
        "CountryID": 1,
        "Latitude": 51.356895,
        "Longitude": -1.144295,
        "RelatedURL": "http://pod-point.com",
        "DistanceUnit": 0
    },
    "Connections": [
        {
            "ID": 153650,
            "ConnectionTypeID": 25,
            "Reference": "1",
            "StatusTypeID": 50,
            "LevelID": 2,
            "Amps": 32,
            "Voltage": 400,
            "PowerKW": 22,
            "CurrentTypeID": 20,
            "Quantity": 2
        }
    ],
    "NumberOfPoints": 2,
    "StatusTypeID": 50,
    "DateLastStatusUpdate": "2019-05-13T11:47:00Z",
    "MetadataValues": [
        {
            "ID": 4122,
            "MetadataFieldID": 4,
            "ItemValue": "Contains public sector information licensed under the Open Government Licence v2.0. http://www.nationalarchives.gov.uk/doc/open-government-licence/version/2/"
        }
    ],
    "DataQualityLevel": 3,
    "DateCreated": "2018-10-05T14:14:00Z",
    "SubmissionStatusTypeID": 200
}