{
    "IsRecentlyVerified": false,
    "ID": 67980,
    "UUID": "3852F9D1-495F-4622-9B21-686798A63E68",
    "DataProviderID": 26,
    "DataProvidersReference": "93174",
    "OperatorID": 73,
    "OperatorsReference": "EV-Box EVB-P1552478",
    "UsageCost": "0.00 jaarabonnement",
    "AddressInfo": {
        "ID": 68326,
        "Title": "Jupiterlaan 13",
        "AddressLine1": "Jupiterlaan 13",
        "Town": "Westvoorne",
        "Postcode": "3235 TA",
        "CountryID": 159,
        "Latitude": 51.87118,
        "Longitude": 4.07374,
        "RelatedURL": "http://www.ev-box.nl",
        "DistanceUnit": 0
    },
    "Connections": [
        {
            "ID": 94634,
            "ConnectionTypeID": 25,
            "LevelID": 2,
            "PowerKW": 11,
            "CurrentTypeID": 10
        },
        {
            "ID": 94635,
            "ConnectionTypeID": 25,
            "LevelID": 2,
            "PowerKW": 11,
            "CurrentTypeID": 10
        }
    ],
    "NumberOfPoints": 1,
    "StatusTypeID": 50,
    "DateLastStatusUpdate": "2016-06-04T02:37:00Z",
    "DataQualityLevel": 3,
    "DateCreated": "2016-06-04T02:37:00Z",
    "SubmissionStatusTypeID": 100
}