{
    "UserComments": [
        {
            "ID": 23710,
            "ChargePointID": 15918,
            "CommentTypeID": 50,
            "UserName": "jpscou",
            "Comment": "charge point closed (dismantled)",
            "Rating": 1,
            "DateCreated": "2020-12-31T07:39:34.4Z",
            "User": {
                "ID": 29006,
                "Username": "jpscou"
            },
            "CheckinStatusTypeID": 120,
            "IsActionedByEditor": false
        },
        {
            "ID": 4380,
            "ChargePointID": 15918,
            "CommentTypeID": 10,
            "UserName": "tpgreenwood",
            "Comment": "The charge point is outside an estate agents office and they had parked both of their cars in the EV spaces.",
            "DateCreated": "2015-05-05T21:18:35.507Z",
            "User": {
                "ID": 4813,
                "Username": "tpgreenwood"
            },
            "CheckinStatusTypeID": 110
        },
        {
            "ID": 3487,
            "ChargePointID": 15918,
            "CommentTypeID": 10,
            "UserName": "",
            "Comment": "Easy access, close to shops and coffee, perfect for Tesla.",
            "Rating": 5,
            "DateCreated": "2014-12-28T08:12:18.627Z",
            "CheckinStatusTypeID": 10
        }
    ],
    "MediaItems": [
        {
            "ID": 26030,
            "ChargePointID": 15918,
            "ItemURL": "https://s3-ap-southeast-2.amazonaws.com/openchargemap/images/BE/OCM15918/OCM-15918.orig.2020123107432459.jpg",
            "ItemThumbnailURL": "https://s3-ap-southeast-2.amazonaws.com/openchargemap/images/BE/OCM15918/OCM-15918.thmb.2020123107432459.jpg",
            "Comment": "that is how the EV networks grows in Belgium 😉",
            "IsEnabled": true,
            "IsVideo": false,
            "IsFeaturedItem": false,
            "IsExternalResource": false,
            "User": {
                "ID": 29006,
                "Username": "jpscou"
            },
            "DateCreated": "2020-12-31T07:43:00Z"
        },
        {
            "ID": 1329,
            "ChargePointID": 15918,
            "ItemURL": "https://s3-ap-southeast-2.amazonaws.com/openchargemap/images/BE/OCM15918/OCM-15918.orig.2015050521171863.jpg",
            "ItemThumbnailURL": "https://s3-ap-southeast-2.amazonaws.com/openchargemap/images/BE/OCM15918/OCM-15918.thmb.2015050521171863.jpg",
            "Comment": "Both charging soaces taken by the local estate agents ICE vehicles. Not cool!",
            "IsEnabled": true,
            "IsVideo": false,
            "IsFeaturedItem": false,
            "IsExternalResource": false,
            "User": {
                "ID": 4813,
                "Username": "tpgreenwood"
            },
            "DateCreated": "2015-05-05T21:18:00Z"
        },
        {
            "ID": 822,
            "ChargePointID": 15918,
            "ItemURL": "https://s3-ap-southeast-2.amazonaws.com/openchargemap/images/BE/OCM15918/OCM-15918.orig.2015010415545882.jpg",
            "ItemThumbnailURL": "https://s3-ap-southeast-2.amazonaws.com/openchargemap/images/BE/OCM15918/OCM-15918.thmb.2015010415545882.jpg",
            "Comment": "",
            "IsEnabled": true,
            "IsVideo": false,
            "IsFeaturedItem": false,
            "IsExternalResource": false,
            "User": {
                "ID": 1761,
                "Username": "filip.vanrickstal"
            },
            "DateCreated": "2015-01-04T15:55:00Z"
        },
        {
            "ID": 821,
            "ChargePointID": 15918,
            "ItemURL": "https://s3-ap-southeast-2.amazonaws.com/openchargemap/images/BE/OCM15918/OCM-15918.orig.2015010415542026.jpg",
            "ItemThumbnailURL": "https://s3-ap-southeast-2.amazonaws.com/openchargemap/images/BE/OCM15918/OCM-15918.thmb.2015010415542026.jpg",
            "Comment": "",
            "IsEnabled": true,
            "IsVideo": false,
            "IsFeaturedItem": false,
            "IsExternalResource": false,
            "User": {
                "ID": 1761,
                "Username": "filip.vanrickstal"
            },
            "DateCreated": "2015-01-04T15:54:00Z"
        }
    ],
    "IsRecentlyVerified": false,
    "ID": 15918,
    "UUID": "2B60D789-055E-40C5-ACD9-F44AFAE91021",
    "DataProviderID": 1,
    "OperatorID": 36,
    "OperatorsReference": "ENO-EVA-F021_1,ENO-EVA-A021_2,ENO-EVA-F021_1..ENO-EVA-F021_6",
    "UsageTypeID": 4,
    "AddressInfo": {
        "ID": 16263,
        "Title": "EVA Koksijde",
        "AddressLine1": "Guido Gezelleplein 6",
        "Town": "Koksijde ",
        "Postcode": "8670 ",
        "CountryID": 26,
        "Latitude": 51.1194494744432,
        "Longitude": 2.6354396344267,
        "DistanceUnit": 0
    },
    "Connections": [
        {
            "ID": 14289,
            "ConnectionTypeID": 23,
            "StatusTypeID": 50,
            "LevelID": 2,
            "Amps": 16,
            "Voltage": 230,
            "PowerKW": 3.7,
            "CurrentTypeID": 10,
            "Quantity": 7
        },
        {
            "ID": 14290,
            "ConnectionTypeID": 25,
            "StatusTypeID": 50,
            "LevelID": 2,
            "Amps": 32,
            "Voltage": 400,
            "PowerKW": 22,
            "CurrentTypeID": 20,
            "Quantity": 1
        }
    ],
    "NumberOfPoints": 2,
    "GeneralComments": "2 places for cars 6 for 2-wheelers",
    "StatusTypeID": 50,
    "DateLastStatusUpdate": "2020-12-31T07:43:00Z",
    "DataQualityLevel": 1,
    "DateCreated": "2013-02-15T12:24:00Z",
    "SubmissionStatusTypeID": 200
}