{
    "IsRecentlyVerified": false,
    "ID": 178255,
    "UUID": "CB21F886-B48D-4499-8349-77FBDEA82060",
    "DataProviderID": 29,
    "DataProvidersReference": "19990",
    "OperatorID": 69,
    "AddressInfo": {
        "ID": 178614,
        "Title": "Haslacher Straße 57",
        "AddressLine1": "Haslacher Straße 57",
        "Town": "Freiburg",
        "Postcode": "79115",
        "CountryID": 87,
        "Latitude": 47.993347,
        "Longitude": 7.830781,
        "DistanceUnit": 0
    },
    "Connections": [
        {
            "ID": 278420,
            "ConnectionTypeID": 25,
            "StatusTypeID": 50,
            "LevelID": 2,
            "PowerKW": 22,
            "CurrentTypeID": 20
        },
        {
            "ID": 278421,
            "ConnectionTypeID": 25,
            "StatusTypeID": 50,
            "LevelID": 2,
            "PowerKW": 22,
            "CurrentTypeID": 20
        }
    ],
    "StatusTypeID": 0,
    "DateLastStatusUpdate": "2021-07-12T02:40:00Z",
    "MetadataValues": [
        {
            "ID": 10549,
            "MetadataFieldID": 4,
            "ItemValue": "Data from the German chargepoint registry provided by Bundesnetzagentur.de under the CC-BY 4.0 license"
        }
    ],
    "DataQualityLevel": 3,
    "DateCreated": "2021-07-08T09:49:00Z",
    "SubmissionStatusTypeID": 100
}