{
    "UserComments": [
        {
            "ID": 11658,
            "ChargePointID": 54401,
            "CommentTypeID": 10,
            "UserName": "Anon74856763534",
            "Comment": "CHAdeMO charge.",
            "DateCreated": "2016-06-18T18:02:57.827Z",
            "User": {
                "ID": 1192,
                "Username": "Anon74856763534"
            },
            "CheckinStatusTypeID": 10
        },
        {
            "ID": 9582,
            "ChargePointID": 54401,
            "CommentTypeID": 50,
            "UserName": "Sandy Ritchie",
            "Comment": "This Siemens charger can charge DC and AC at the same time. But today I tried AC while a Leaf was plugged but not charging (I presume charge ended automatically) and the AC side was very slow, like 7kw slow.",
            "Rating": 4,
            "DateCreated": "2016-01-28T01:01:56.103Z",
            "User": {
                "ID": 4778,
                "Username": "Sandy Ritchie"
            },
            "CheckinStatusTypeID": 10
        },
        {
            "ID": 6653,
            "ChargePointID": 54401,
            "CommentTypeID": 10,
            "UserName": "Anon74856763534",
            "Comment": "Successful CCS charge today.",
            "DateCreated": "2015-09-30T17:13:07.11Z",
            "User": {
                "ID": 1192,
                "Username": "Anon74856763534"
            },
            "CheckinStatusTypeID": 0
        }
    ],
    "MediaItems": [
        {
            "ID": 4813,
            "ChargePointID": 54401,
            "ItemURL": "https://s3-ap-southeast-2.amazonaws.com/openchargemap/images/GB/OCM54401/OCM-54401.orig.2016012801000134.jpg",
            "ItemThumbnailURL": "https://s3-ap-southeast-2.amazonaws.com/openchargemap/images/GB/OCM54401/OCM-54401.thmb.2016012801000134.jpg",
            "Comment": "ICE'd is bad, EV'd is worse, cheers Leaf.",
            "IsEnabled": true,
            "IsVideo": false,
            "IsFeaturedItem": false,
            "IsExternalResource": false,
            "User": {
                "ID": 4778,
                "Username": "Sandy Ritchie"
            },
            "DateCreated": "2016-01-28T01:00:00Z"
        },
        {
            "ID": 3391,
            "ChargePointID": 54401,
            "ItemURL": "https://s3-ap-southeast-2.amazonaws.com/openchargemap/images/GB/OCM54401/OCM-54401.orig.2015101123154893.jpg",
            "ItemThumbnailURL": "https://s3-ap-southeast-2.amazonaws.com/openchargemap/images/GB/OCM54401/OCM-54401.thmb.2015101123154893.jpg",
            "Comment": "Ice'd",
            "IsEnabled": true,
            "IsVideo": false,
            "IsFeaturedItem": false,
            "IsExternalResource": false,
            "User": {
                "ID": 6480,
                "Username": "Wilfrid71"
            },
            "DateCreated": "2015-10-11T23:16:00Z"
        },
        {
            "ID": 3390,
            "ChargePointID": 54401,
            "ItemURL": "https://s3-ap-southeast-2.amazonaws.com/openchargemap/images/GB/OCM54401/OCM-54401.orig.2015101123144064.jpg",
            "ItemThumbnailURL": "https://s3-ap-southeast-2.amazonaws.com/openchargemap/images/GB/OCM54401/OCM-54401.thmb.2015101123144064.jpg",
            "Comment": "",
            "IsEnabled": true,
            "IsVideo": false,
            "IsFeaturedItem": false,
            "IsExternalResource": false,
            "User": {
                "ID": 6480,
                "Username": "Wilfrid71"
            },
            "DateCreated": "2015-10-11T23:15:00Z"
        },
        {
            "ID": 3346,
            "ChargePointID": 54401,
            "ItemURL": "https://s3-ap-southeast-2.amazonaws.com/openchargemap/images/GB/OCM54401/OCM-54401.orig.2015100516525106.jpg",
            "ItemThumbnailURL": "https://s3-ap-southeast-2.amazonaws.com/openchargemap/images/GB/OCM54401/OCM-54401.thmb.2015100516525106.jpg",
            "Comment": "very nice installation.",
            "IsEnabled": true,
            "IsVideo": false,
            "IsFeaturedItem": false,
            "IsExternalResource": false,
            "User": {
                "ID": 4778,
                "Username": "Sandy Ritchie"
            },
            "DateCreated": "2015-10-05T16:53:00Z"
        },
        {
            "ID": 3311,
            "ChargePointID": 54401,
            "ItemURL": "https://s3-ap-southeast-2.amazonaws.com/openchargemap/images/GB/OCM54401/OCM-54401.orig.2015093017125477.jpeg",
            "ItemThumbnailURL": "https://s3-ap-southeast-2.amazonaws.com/openchargemap/images/GB/OCM54401/OCM-54401.thmb.2015093017125477.jpeg",
            "Comment": "",
            "IsEnabled": true,
            "IsVideo": false,
            "IsFeaturedItem": false,
            "IsExternalResource": false,
            "User": {
                "ID": 1192,
                "Username": "Anon74856763534"
            },
            "DateCreated": "2015-09-30T17:13:00Z"
        }
    ],
    "IsRecentlyVerified": false,
    "ID": 54401,
    "UUID": "EF0DEB40-8B4C-45C4-940D-FEAC3C144EF1",
    "DataProviderID": 1,
    "OperatorID": 3315,
    "OperatorsReference": "50967",
    "UsageTypeID": 4,
    "UsageCost": "Free",
    "AddressInfo": {
        "ID": 54747,
        "Title": "Bankhead Central",
        "AddressLine1": "Bankhead Park",
        "Town": "Glenrothes",
        "StateOrProvince": "Fife",
        "Postcode": "KY7 6GH",
        "CountryID": 1,
        "Latitude": 56.182497,
        "Longitude": -3.144181,
        "DistanceUnit": 0
    },
    "Connections": [
        {
            "ID": 68575,
            "ConnectionTypeID": 33,
            "StatusTypeID": 50,
            "LevelID": 3,
            "Amps": 125,
            "Voltage": 400,
            "PowerKW": 50,
            "CurrentTypeID": 30,
            "Quantity": 2
        },
        {
            "ID": 68576,
            "ConnectionTypeID": 2,
            "StatusTypeID": 50,
            "LevelID": 3,
            "Amps": 125,
            "Voltage": 400,
            "PowerKW": 50,
            "CurrentTypeID": 30,
            "Quantity": 2
        },
        {
            "ID": 68577,
            "ConnectionTypeID": 1036,
            "StatusTypeID": 50,
            "LevelID": 3,
            "Amps": 63,
            "Voltage": 400,
            "PowerKW": 43,
            "CurrentTypeID": 20,
            "Quantity": 2
        }
    ],
    "NumberOfPoints": 4,
    "StatusTypeID": 50,
    "DateLastStatusUpdate": "2020-06-02T14:21:00Z",
    "DataQualityLevel": 1,
    "DateCreated": "2015-09-30T15:01:00Z",
    "SubmissionStatusTypeID": 200
}