{
    "IsRecentlyVerified": false,
    "ID": 178152,
    "UUID": "79188D52-7B50-4BC9-ABAE-63F2A1D7C8AB",
    "DataProviderID": 29,
    "DataProvidersReference": "19655",
    "OperatorID": 86,
    "AddressInfo": {
        "ID": 178511,
        "Title": "Rathausstr. 5",
        "AddressLine1": "Rathausstr. 5",
        "Town": "Ebhausen",
        "Postcode": "72224",
        "CountryID": 87,
        "Latitude": 48.605376,
        "Longitude": 8.662075,
        "DistanceUnit": 0
    },
    "Connections": [
        {
            "ID": 278199,
            "ConnectionTypeID": 25,
            "StatusTypeID": 50,
            "LevelID": 2,
            "PowerKW": 22,
            "CurrentTypeID": 20
        },
        {
            "ID": 278200,
            "ConnectionTypeID": 25,
            "StatusTypeID": 50,
            "LevelID": 2,
            "PowerKW": 22,
            "CurrentTypeID": 20
        }
    ],
    "StatusTypeID": 0,
    "DateLastStatusUpdate": "2021-07-09T03:13:00Z",
    "MetadataValues": [
        {
            "ID": 10446,
            "MetadataFieldID": 4,
            "ItemValue": "Data from the German chargepoint registry provided by Bundesnetzagentur.de under the CC-BY 4.0 license"
        }
    ],
    "DataQualityLevel": 3,
    "DateCreated": "2021-07-08T09:49:00Z",
    "SubmissionStatusTypeID": 100
}