{
    "IsRecentlyVerified": false,
    "ID": 57409,
    "UUID": "B3CF1021-D593-4E61-93E5-FAC6CC36B3E5",
    "DataProviderID": 1,
    "OperatorID": 23,
    "OperatorsReference": "10634",
    "UsageTypeID": 1,
    "UsageCost": "Free",
    "AddressInfo": {
        "ID": 57755,
        "Title": "The Audubon Inn and NOLA North Grille",
        "AddressLine1": "45 N Main St",
        "Town": "Mayville",
        "StateOrProvince": "WI",
        "Postcode": "53050",
        "CountryID": 2,
        "Latitude": 43.496558,
        "Longitude": -88.544893,
        "ContactTelephone1": "920-387-5858  877-798-3752",
        "AccessComments": "24 hours daily; see front desk for access",
        "RelatedURL": "http://www.teslamotors.com/supercharger",
        "DistanceUnit": 0
    },
    "Connections": [
        {
            "ID": 72515,
            "ConnectionTypeID": 30,
            "StatusTypeID": 50,
            "LevelID": 2,
            "Amps": 16,
            "Voltage": 230,
            "PowerKW": 16,
            "CurrentTypeID": 10,
            "Quantity": 2
        }
    ],
    "NumberOfPoints": 2,
    "StatusTypeID": 50,
    "DateLastStatusUpdate": "2017-02-02T17:33:00Z",
    "DataQualityLevel": 3,
    "DateCreated": "2015-11-30T11:50:00Z",
    "SubmissionStatusTypeID": 100
}