{
    "IsRecentlyVerified": false,
    "ID": 129713,
    "UUID": "8D1F964F-34ED-4DB3-8C46-2DC2EF4520E4",
    "DataProviderID": 1,
    "OperatorID": 3364,
    "UsageTypeID": 1,
    "UsageCost": "230clp/kWh",
    "AddressInfo": {
        "ID": 130059,
        "Title": "Copec",
        "AddressLine1": "Camino Panamerica sur km 341",
        "Town": "Parral",
        "StateOrProvince": "Provincia de Linares",
        "Postcode": "3630000",
        "CountryID": 49,
        "Latitude": -36.1326495535374,
        "Longitude": -71.80760715953,
        "DistanceUnit": 0
    },
    "Connections": [
        {
            "ID": 181551,
            "ConnectionTypeID": 2,
            "StatusTypeID": 50,
            "LevelID": 3,
            "Amps": 125,
            "Voltage": 500,
            "PowerKW": 50,
            "CurrentTypeID": 30,
            "Quantity": 1
        },
        {
            "ID": 181552,
            "ConnectionTypeID": 1036,
            "StatusTypeID": 50,
            "LevelID": 3,
            "Amps": 63,
            "Voltage": 400,
            "PowerKW": 43,
            "CurrentTypeID": 20,
            "Quantity": 1
        },
        {
            "ID": 181553,
            "ConnectionTypeID": 33,
            "StatusTypeID": 50,
            "LevelID": 3,
            "Amps": 125,
            "Voltage": 500,
            "PowerKW": 50,
            "CurrentTypeID": 30,
            "Quantity": 1
        }
    ],
    "NumberOfPoints": 1,
    "GeneralComments": "Copec/Voltex\r\nMight need app",
    "StatusTypeID": 50,
    "DateLastStatusUpdate": "2019-07-24T12:22:00Z",
    "DataQualityLevel": 1,
    "DateCreated": "2019-07-24T12:22:00Z",
    "SubmissionStatusTypeID": 200
}