{
    "IsRecentlyVerified": false,
    "ID": 185045,
    "UUID": "3EF4F084-D4D2-4374-8086-A4F82659C79F",
    "DataProviderID": 29,
    "DataProvidersReference": "18550",
    "OperatorID": 220,
    "AddressInfo": {
        "ID": 185404,
        "Title": "Faberstraße 23",
        "AddressLine1": "Faberstraße 23",
        "Town": "Hamburg",
        "Postcode": "20257",
        "CountryID": 87,
        "Latitude": 53.57527,
        "Longitude": 9.94432,
        "DistanceUnit": 0
    },
    "Connections": [
        {
            "ID": 294040,
            "ConnectionTypeID": 28,
            "StatusTypeID": 50,
            "LevelID": 2,
            "PowerKW": 22,
            "CurrentTypeID": 10
        },
        {
            "ID": 294041,
            "ConnectionTypeID": 28,
            "StatusTypeID": 50,
            "LevelID": 2,
            "PowerKW": 22,
            "CurrentTypeID": 10
        }
    ],
    "StatusTypeID": 50,
    "DateLastStatusUpdate": "2021-07-09T03:30:00Z",
    "MetadataValues": [
        {
            "ID": 17336,
            "MetadataFieldID": 4,
            "ItemValue": "Data from the German chargepoint registry provided by Bundesnetzagentur.de under the CC-BY 4.0 license"
        }
    ],
    "DataQualityLevel": 3,
    "DateCreated": "2021-07-08T10:06:00Z",
    "SubmissionStatusTypeID": 100
}