{
    "IsRecentlyVerified": false,
    "ID": 88898,
    "UUID": "0D7193C8-9303-4509-8B17-E917435638AE",
    "DataProviderID": 1,
    "OperatorID": 3261,
    "UsageTypeID": 4,
    "AddressInfo": {
        "ID": 89244,
        "Title": "GP Joule",
        "AddressLine1": "Adlerstraße 2",
        "Town": "Geislingen an der Steige",
        "StateOrProvince": "Vereinbarte Verwaltungsgemeinschaft der Stadt Geislingen an der Steige",
        "Postcode": "73312",
        "CountryID": 87,
        "Latitude": 48.61274,
        "Longitude": 9.843629999999962,
        "ContactTelephone1": "+49 4671 6074-0",
        "AccessComments": "24/7 nutzbar mit New Motion oder PlugSurfing oder direkte Freischaltung auf der emobility community Webseite",
        "RelatedURL": "http://www.gp-joule.de/",
        "DistanceUnit": 0
    },
    "Connections": [
        {
            "ID": 126156,
            "ConnectionTypeID": 25,
            "StatusTypeID": 50,
            "LevelID": 2,
            "Amps": 32,
            "Voltage": 400,
            "PowerKW": 22,
            "CurrentTypeID": 20,
            "Quantity": 1
        }
    ],
    "NumberOfPoints": 1,
    "StatusTypeID": 50,
    "DateLastStatusUpdate": "2017-06-12T05:07:00Z",
    "DataQualityLevel": 1,
    "DateCreated": "2017-06-12T05:07:00Z",
    "SubmissionStatusTypeID": 200
}