{
    "UserComments": [
        {
            "ID": 19585,
            "ChargePointID": 101765,
            "CommentTypeID": 10,
            "UserName": "ForumElettrico.it",
            "RelatedURL": "https://www.forumelettrico.it/forum/colonnina-e-distribuzione-22kw-bologna-bo-piazza-di-porta-mascarella-7-t2581.html",
            "DateCreated": "2018-05-27T16:10:51.267Z",
            "User": {
                "ID": 11749,
                "Username": "ForumElettrico.it"
            },
            "CheckinStatusTypeID": 0
        },
        {
            "ID": 19584,
            "ChargePointID": 101765,
            "CommentTypeID": 10,
            "UserName": "ForumElettrico.it",
            "Comment": "https://www.forumelettrico.it/forum/colonnina-e-distribuzione-22kw-bologna-bo-piazza-di-porta-mascarella-7-t2581.html",
            "DateCreated": "2018-05-27T16:10:26.46Z",
            "User": {
                "ID": 11749,
                "Username": "ForumElettrico.it"
            },
            "CheckinStatusTypeID": 10
        }
    ],
    "MediaItems": [
        {
            "ID": 15540,
            "ChargePointID": 101765,
            "ItemURL": "https://s3-ap-southeast-2.amazonaws.com/openchargemap/images/IT/OCM101765/OCM-101765.orig.2018052716112459.jpg",
            "ItemThumbnailURL": "https://s3-ap-southeast-2.amazonaws.com/openchargemap/images/IT/OCM101765/OCM-101765.thmb.2018052716112459.jpg",
            "Comment": "",
            "IsEnabled": true,
            "IsVideo": false,
            "IsFeaturedItem": false,
            "IsExternalResource": false,
            "User": {
                "ID": 11749,
                "Username": "ForumElettrico.it"
            },
            "DateCreated": "2018-05-27T16:12:00Z"
        },
        {
            "ID": 15541,
            "ChargePointID": 101765,
            "ItemURL": "https://s3-ap-southeast-2.amazonaws.com/openchargemap/images/IT/OCM101765/OCM-101765.orig.2018052716113158.jpg",
            "ItemThumbnailURL": "https://s3-ap-southeast-2.amazonaws.com/openchargemap/images/IT/OCM101765/OCM-101765.thmb.2018052716113158.jpg",
            "Comment": "",
            "IsEnabled": true,
            "IsVideo": false,
            "IsFeaturedItem": false,
            "IsExternalResource": false,
            "User": {
                "ID": 11749,
                "Username": "ForumElettrico.it"
            },
            "DateCreated": "2018-05-27T16:12:00Z"
        },
        {
            "ID": 15537,
            "ChargePointID": 101765,
            "ItemURL": "https://s3-ap-southeast-2.amazonaws.com/openchargemap/images/IT/OCM101765/OCM-101765.orig.2018052716110615.jpg",
            "ItemThumbnailURL": "https://s3-ap-southeast-2.amazonaws.com/openchargemap/images/IT/OCM101765/OCM-101765.thmb.2018052716110615.jpg",
            "Comment": "",
            "IsEnabled": true,
            "IsVideo": false,
            "IsFeaturedItem": false,
            "IsExternalResource": false,
            "User": {
                "ID": 11749,
                "Username": "ForumElettrico.it"
            },
            "DateCreated": "2018-05-27T16:11:00Z"
        },
        {
            "ID": 15538,
            "ChargePointID": 101765,
            "ItemURL": "https://s3-ap-southeast-2.amazonaws.com/openchargemap/images/IT/OCM101765/OCM-101765.orig.2018052716110971.jpg",
            "ItemThumbnailURL": "https://s3-ap-southeast-2.amazonaws.com/openchargemap/images/IT/OCM101765/OCM-101765.thmb.2018052716110971.jpg",
            "Comment": "",
            "IsEnabled": true,
            "IsVideo": false,
            "IsFeaturedItem": false,
            "IsExternalResource": false,
            "User": {
                "ID": 11749,
                "Username": "ForumElettrico.it"
            },
            "DateCreated": "2018-05-27T16:11:00Z"
        },
        {
            "ID": 15539,
            "ChargePointID": 101765,
            "ItemURL": "https://s3-ap-southeast-2.amazonaws.com/openchargemap/images/IT/OCM101765/OCM-101765.orig.2018052716111778.jpg",
            "ItemThumbnailURL": "https://s3-ap-southeast-2.amazonaws.com/openchargemap/images/IT/OCM101765/OCM-101765.thmb.2018052716111778.jpg",
            "Comment": "",
            "IsEnabled": true,
            "IsVideo": false,
            "IsFeaturedItem": false,
            "IsExternalResource": false,
            "User": {
                "ID": 11749,
                "Username": "ForumElettrico.it"
            },
            "DateCreated": "2018-05-27T16:11:00Z"
        }
    ],
    "IsRecentlyVerified": false,
    "ID": 101765,
    "UUID": "ADCC84F4-94C0-4934-AD91-8AEBD9D53069",
    "DataProviderID": 1,
    "OperatorID": 80,
    "UsageTypeID": 4,
    "AddressInfo": {
        "ID": 102111,
        "Title": "Bologna Mascarella | EnelX",
        "AddressLine1": "Piazza di Porta Mascarella 7",
        "Town": "Bologna",
        "StateOrProvince": "BO",
        "Postcode": "40126",
        "CountryID": 112,
        "Latitude": 44.501857,
        "Longitude": 11.353016,
        "RelatedURL": "https://www.forumelettrico.it/forum/colonnina-e-distribuzione-22kw-bologna-bo-piazza-di-porta-mascarella-7-t2581.html",
        "DistanceUnit": 0
    },
    "Connections": [
        {
            "ID": 143650,
            "ConnectionTypeID": 25,
            "StatusTypeID": 50,
            "LevelID": 2,
            "Amps": 32,
            "Voltage": 400,
            "PowerKW": 22,
            "CurrentTypeID": 20,
            "Quantity": 1
        },
        {
            "ID": 143651,
            "ConnectionTypeID": 36,
            "StatusTypeID": 50,
            "LevelID": 2,
            "Amps": 16,
            "Voltage": 230,
            "PowerKW": 3.6,
            "CurrentTypeID": 10,
            "Quantity": 1
        }
    ],
    "NumberOfPoints": 1,
    "StatusTypeID": 50,
    "DateLastStatusUpdate": "2019-08-08T15:21:00Z",
    "DataQualityLevel": 1,
    "DateCreated": "2018-04-08T11:49:00Z",
    "SubmissionStatusTypeID": 200
}