{
    "IsRecentlyVerified": false,
    "ID": 100803,
    "UUID": "45A8CD05-AC3D-41D6-8584-56720A1BDABB",
    "DataProviderID": 1,
    "OperatorID": 23,
    "OperatorsReference": "41301",
    "UsageTypeID": 4,
    "AddressInfo": {
        "ID": 101149,
        "Title": "Pannenkoekenrestaurant den Tol - Velp",
        "AddressLine1": "Bosschebaan 8",
        "Town": "Velp",
        "Postcode": "5363SX",
        "CountryID": 159,
        "Latitude": 51.74507,
        "Longitude": 5.716071,
        "ContactTelephone1": "+31 486 472 114",
        "DistanceUnit": 0
    },
    "Connections": [
        {
            "ID": 142383,
            "ConnectionTypeID": 30,
            "StatusTypeID": 50,
            "LevelID": 2,
            "Amps": 16,
            "Voltage": 400,
            "PowerKW": 11,
            "CurrentTypeID": 20,
            "Quantity": 1
        }
    ],
    "NumberOfPoints": 1,
    "GeneralComments": "1 Tesla Connector, up to 11kW.Available for customers. Please see front desk.",
    "StatusTypeID": 50,
    "DateLastStatusUpdate": "2018-10-03T16:03:00Z",
    "DataQualityLevel": 1,
    "DateCreated": "2018-03-10T06:51:00Z",
    "SubmissionStatusTypeID": 200
}