{
    "IsRecentlyVerified": false,
    "ID": 41566,
    "UUID": "CFC26A6A-1AE4-468A-96A9-590BAA709015",
    "DataProviderID": 26,
    "DataProvidersReference": "59182",
    "OperatorID": 35,
    "OperatorsReference": "ThePluginCompany 1420129",
    "UsageCost": "0.00 afhankelijk van pas",
    "AddressInfo": {
        "ID": 41912,
        "Title": "Chaussée de Charleroi",
        "AddressLine1": "Chaussée de Charleroi",
        "Town": "Waterloo",
        "Postcode": "1410",
        "CountryID": 26,
        "Latitude": 50.686998,
        "Longitude": 4.407977,
        "RelatedURL": "http://www.theplugincompany.com",
        "DistanceUnit": 0
    },
    "Connections": [
        {
            "ID": 45492,
            "ConnectionTypeID": 25,
            "LevelID": 2,
            "PowerKW": 22,
            "CurrentTypeID": 10
        }
    ],
    "NumberOfPoints": 2,
    "StatusTypeID": 50,
    "DateLastStatusUpdate": "2016-06-04T02:38:00Z",
    "DataQualityLevel": 3,
    "DateCreated": "2015-02-09T03:25:00Z",
    "SubmissionStatusTypeID": 100
}