{
    "IsRecentlyVerified": false,
    "ID": 156325,
    "UUID": "E95662C2-0FB6-45BA-9392-CFD03510EC5D",
    "DataProviderID": 1,
    "OperatorID": 1,
    "UsageTypeID": 1,
    "UsageCost": "for free",
    "AddressInfo": {
        "ID": 156679,
        "Title": "Lidl",
        "AddressLine1": "Elter Straße 234",
        "Town": "Rheine",
        "StateOrProvince": "Nordrhein-Westfalen",
        "Postcode": "48432",
        "CountryID": 87,
        "Latitude": 52.26710724405865,
        "Longitude": 7.462512057441245,
        "RelatedURL": "https://www.lidl.de/filialen/rheine/elter-strasse-234.html",
        "DistanceUnit": 0
    },
    "Connections": [
        {
            "ID": 219984,
            "ConnectionTypeID": 33,
            "StatusTypeID": 50,
            "CurrentTypeID": 30
        },
        {
            "ID": 219985,
            "ConnectionTypeID": 2,
            "StatusTypeID": 50,
            "CurrentTypeID": 30
        },
        {
            "ID": 219986,
            "ConnectionTypeID": 1036,
            "StatusTypeID": 50,
            "CurrentTypeID": 20
        }
    ],
    "NumberOfPoints": 1,
    "StatusTypeID": 50,
    "DateLastStatusUpdate": "2020-05-19T11:53:00Z",
    "DataQualityLevel": 1,
    "DateCreated": "2020-05-16T09:00:00Z",
    "SubmissionStatusTypeID": 200
}