{
    "IsRecentlyVerified": false,
    "ID": 157696,
    "UUID": "609E7A22-7223-4FE7-BDF4-B89068953C61",
    "DataProviderID": 1,
    "OperatorID": 21,
    "UsageTypeID": 4,
    "UsageCost": "Mobi.E compatible card",
    "AddressInfo": {
        "ID": 158050,
        "Title": "CHM-00001",
        "AddressLine1": "R. Gen. Humberto Delgado",
        "Town": "Chamusca",
        "Postcode": "2140-406",
        "CountryID": 180,
        "Latitude": 39.358722,
        "Longitude": -8.48075,
        "RelatedURL": "https://www.mobie.pt",
        "DistanceUnit": 0
    },
    "Connections": [
        {
            "ID": 227210,
            "ConnectionTypeID": 25,
            "StatusTypeID": 50,
            "LevelID": 2,
            "Amps": 32,
            "Voltage": 400,
            "PowerKW": 22,
            "CurrentTypeID": 20,
            "Quantity": 2
        }
    ],
    "NumberOfPoints": 2,
    "StatusTypeID": 50,
    "DateLastStatusUpdate": "2020-08-08T10:23:00Z",
    "DataQualityLevel": 3,
    "DateCreated": "2020-06-25T05:42:00Z",
    "SubmissionStatusTypeID": 100
}