{
    "IsRecentlyVerified": false,
    "ID": 44833,
    "UUID": "F0DC08AE-A37E-43C0-90BA-B2A213B51D1B",
    "DataProviderID": 1,
    "DataProvidersReference": "2734",
    "AddressInfo": {
        "ID": 45179,
        "Title": "Meny Revetal, Re",
        "AddressLine1": "Kåpeveien 5",
        "Town": "REVETAL",
        "StateOrProvince": "Vestfold og Telemark",
        "Postcode": "3174",
        "CountryID": 168,
        "Latitude": 59.37225,
        "Longitude": 10.26368,
        "AccessComments": "Ladepunkt i 2. etg. i parkeringshuset.",
        "DistanceUnit": 0
    },
    "Connections": [
        {
            "ID": 55128,
            "ConnectionTypeID": 0,
            "Reference": "1",
            "LevelID": 2,
            "Amps": 32,
            "Voltage": 400,
            "PowerKW": 22,
            "Comments": "Mode 3"
        }
    ],
    "NumberOfPoints": 1,
    "DateLastStatusUpdate": "2020-05-26T08:22:00Z",
    "DataQualityLevel": 2,
    "DateCreated": "2015-04-19T05:51:00Z",
    "SubmissionStatusTypeID": 100
}