{
    "IsRecentlyVerified": false,
    "ID": 15598,
    "UUID": "02AC517A-1094-4D05-8EF4-10D0B9E65673",
    "DataProviderID": 1,
    "OperatorID": 45,
    "UsageTypeID": 5,
    "UsageCost": "5€ for a full charge",
    "AddressInfo": {
        "ID": 15943,
        "Title": "Station BP SCEAUX LA CHAPONNE",
        "AddressLine1": "A6 AIRE DE LA CHAPONNE",
        "Town": "MAISON-DIEU",
        "Postcode": "89420 ",
        "CountryID": 80,
        "Latitude": 47.503287,
        "Longitude": 4.035387,
        "ContactTelephone1": "03.86.32.13.45",
        "RelatedURL": "http://www.avem.fr/actualite-dbt-installe-la-premiere-borne-de-charge-rapide-universelle-a-la-station-bp-de-chaponne-3322.html",
        "DistanceUnit": 0
    },
    "Connections": [
        {
            "ID": 13918,
            "ConnectionTypeID": 1036,
            "StatusTypeID": 0,
            "LevelID": 3,
            "Amps": 63,
            "Voltage": 400,
            "PowerKW": 43,
            "CurrentTypeID": 20,
            "Quantity": 1
        },
        {
            "ID": 13919,
            "ConnectionTypeID": 2,
            "StatusTypeID": 0,
            "LevelID": 2,
            "Amps": 125,
            "Voltage": 500,
            "PowerKW": 50,
            "Quantity": 1
        }
    ],
    "NumberOfPoints": 1,
    "StatusTypeID": 50,
    "DateLastStatusUpdate": "2017-01-08T16:03:00Z",
    "DataQualityLevel": 1,
    "DateCreated": "2013-01-14T13:29:00Z",
    "SubmissionStatusTypeID": 200
}