{
    "UserComments": [
        {
            "ID": 16011,
            "ChargePointID": 75537,
            "CommentTypeID": 10,
            "UserName": "Quiesy",
            "Comment": "",
            "Rating": 5,
            "DateCreated": "2017-03-06T07:20:40.193Z",
            "User": {
                "ID": 12250,
                "Username": "Quiesy"
            },
            "CheckinStatusTypeID": 140
        }
    ],
    "MediaItems": [
        {
            "ID": 10588,
            "ChargePointID": 75537,
            "ItemURL": "https://s3-ap-southeast-2.amazonaws.com/openchargemap/images/DE/OCM75537/OCM-75537.orig.2017030607230147.jpg",
            "ItemThumbnailURL": "https://s3-ap-southeast-2.amazonaws.com/openchargemap/images/DE/OCM75537/OCM-75537.thmb.2017030607230147.jpg",
            "Comment": "",
            "IsEnabled": true,
            "IsVideo": false,
            "IsFeaturedItem": false,
            "IsExternalResource": false,
            "User": {
                "ID": 12250,
                "Username": "Quiesy"
            },
            "DateCreated": "2017-03-06T07:23:00Z"
        }
    ],
    "IsRecentlyVerified": false,
    "ID": 75537,
    "UUID": "079F1220-09BE-4B5F-9F55-E69F423736C1",
    "DataProviderID": 1,
    "OperatorID": 105,
    "UsageTypeID": 4,
    "AddressInfo": {
        "ID": 75883,
        "Title": "Marktring",
        "AddressLine1": "Marktring 1",
        "Town": "Belm",
        "StateOrProvince": "Landkreis Osnabrück",
        "Postcode": "49191",
        "CountryID": 87,
        "Latitude": 52.30338,
        "Longitude": 8.126629999999977,
        "AccessComments": "24/7 nutzbare grüne Innogy (RWE) Säule.",
        "DistanceUnit": 0
    },
    "Connections": [
        {
            "ID": 108879,
            "ConnectionTypeID": 25,
            "StatusTypeID": 50,
            "LevelID": 2,
            "Amps": 32,
            "Voltage": 400,
            "PowerKW": 22,
            "CurrentTypeID": 20,
            "Quantity": 2
        }
    ],
    "NumberOfPoints": 2,
    "StatusTypeID": 50,
    "DateLastStatusUpdate": "2017-03-06T07:23:00Z",
    "DataQualityLevel": 1,
    "DateCreated": "2016-12-16T06:27:00Z",
    "SubmissionStatusTypeID": 200
}