{
    "MediaItems": [
        {
            "ID": 9114,
            "ChargePointID": 72391,
            "ItemURL": "https://s3-ap-southeast-2.amazonaws.com/openchargemap/images/IT/OCM72391/OCM-72391.orig.2017011512042754.jpg",
            "ItemThumbnailURL": "https://s3-ap-southeast-2.amazonaws.com/openchargemap/images/IT/OCM72391/OCM-72391.thmb.2017011512042754.jpg",
            "Comment": "",
            "IsEnabled": true,
            "IsVideo": false,
            "IsFeaturedItem": false,
            "IsExternalResource": false,
            "User": {
                "ID": 12207,
                "Username": "aldodal"
            },
            "DateCreated": "2017-01-15T12:05:00Z"
        },
        {
            "ID": 9112,
            "ChargePointID": 72391,
            "ItemURL": "https://s3-ap-southeast-2.amazonaws.com/openchargemap/images/IT/OCM72391/OCM-72391.orig.2017011512040315.jpg",
            "ItemThumbnailURL": "https://s3-ap-southeast-2.amazonaws.com/openchargemap/images/IT/OCM72391/OCM-72391.thmb.2017011512040315.jpg",
            "Comment": "",
            "IsEnabled": true,
            "IsVideo": false,
            "IsFeaturedItem": false,
            "IsExternalResource": false,
            "User": {
                "ID": 12207,
                "Username": "aldodal"
            },
            "DateCreated": "2017-01-15T12:04:00Z"
        },
        {
            "ID": 9113,
            "ChargePointID": 72391,
            "ItemURL": "https://s3-ap-southeast-2.amazonaws.com/openchargemap/images/IT/OCM72391/OCM-72391.orig.2017011512041422.jpg",
            "ItemThumbnailURL": "https://s3-ap-southeast-2.amazonaws.com/openchargemap/images/IT/OCM72391/OCM-72391.thmb.2017011512041422.jpg",
            "Comment": "",
            "IsEnabled": true,
            "IsVideo": false,
            "IsFeaturedItem": false,
            "IsExternalResource": false,
            "User": {
                "ID": 12207,
                "Username": "aldodal"
            },
            "DateCreated": "2017-01-15T12:04:00Z"
        }
    ],
    "IsRecentlyVerified": false,
    "ID": 72391,
    "UUID": "623BED60-E5CD-484B-8D01-908343650A24",
    "DataProviderID": 1,
    "OperatorID": 45,
    "UsageTypeID": 6,
    "AddressInfo": {
        "ID": 72737,
        "Title": " Farmacia Strigno Dr. Borsato Luigi",
        "AddressLine1": "Via Roma, 29",
        "Town": "Strigno ",
        "StateOrProvince": "TN",
        "Postcode": "38059",
        "CountryID": 112,
        "Latitude": 46.063897867872974,
        "Longitude": 11.524353010936679,
        "ContactTelephone1": "0461 762101",
        "DistanceUnit": 0
    },
    "Connections": [
        {
            "ID": 103716,
            "ConnectionTypeID": 25,
            "StatusTypeID": 50,
            "LevelID": 2,
            "Amps": 16,
            "Voltage": 240,
            "PowerKW": 3.3,
            "CurrentTypeID": 10,
            "Quantity": 1
        }
    ],
    "NumberOfPoints": 1,
    "GeneralComments": "Utilizzabile soltanto durante gli orari di apertura della Farmacia",
    "StatusTypeID": 50,
    "DateLastStatusUpdate": "2017-01-15T12:05:00Z",
    "DataQualityLevel": 1,
    "DateCreated": "2016-10-11T13:54:00Z",
    "SubmissionStatusTypeID": 200
}