{
    "IsRecentlyVerified": false,
    "ID": 111345,
    "UUID": "48946E5A-7CC3-4A98-B1C0-9760B7A4CF5C",
    "DataProviderID": 2,
    "DataProvidersReference": "84975",
    "UsageTypeID": 7,
    "AddressInfo": {
        "ID": 111691,
        "Title": "417 Nissan",
        "AddressLine1": "1599 Star Top Rd",
        "Town": "Ottawa",
        "StateOrProvince": "ON",
        "Postcode": "K1B 5P5",
        "CountryID": 44,
        "Latitude": 45.413895,
        "Longitude": -75.613702,
        "ContactTelephone1": "613-749-9417",
        "AccessComments": "9am-9pm M-Th, 9am-6pm F, 9am-5pm Sat\r\nPublic - Call ahead",
        "RelatedURL": "",
        "DistanceUnit": 0
    },
    "Connections": [
        {
            "ID": 156751,
            "ConnectionTypeID": 1,
            "LevelID": 2,
            "Amps": 16,
            "Voltage": 230,
            "PowerKW": 3.7,
            "CurrentTypeID": 10,
            "Quantity": 1
        }
    ],
    "DateLastStatusUpdate": "2020-06-26T03:09:00Z",
    "DataQualityLevel": 3,
    "DateCreated": "2018-10-18T23:37:00Z",
    "SubmissionStatusTypeID": 100
}