{
    "IsRecentlyVerified": false,
    "ID": 153328,
    "UUID": "81F7C6B3-36F9-462E-9557-7270D9B21422",
    "DataProviderID": 28,
    "DataProvidersReference": "FR*S53*P53077*001",
    "UsageTypeID": 5,
    "AddressInfo": {
        "ID": 153681,
        "Title": "COSSE LE VIVIEN - Place Du Champ De Foire",
        "AddressLine1": "Place Du Champ De Foire 53230 COsSE LE VIVIEN",
        "CountryID": 80,
        "Latitude": 47.94467,
        "Longitude": -0.912477,
        "AccessComments": "24h/24 7j/7",
        "DistanceUnit": 0
    },
    "Connections": [
        {
            "ID": 215049,
            "ConnectionTypeID": 25,
            "StatusTypeID": 50,
            "LevelID": 2,
            "PowerKW": 18,
            "CurrentTypeID": 20
        },
        {
            "ID": 215050,
            "ConnectionTypeID": 28,
            "StatusTypeID": 50,
            "LevelID": 2,
            "PowerKW": 18,
            "CurrentTypeID": 10
        },
        {
            "ID": 248438,
            "ConnectionTypeID": 25,
            "StatusTypeID": 50,
            "LevelID": 2,
            "PowerKW": 18,
            "CurrentTypeID": 20
        },
        {
            "ID": 248439,
            "ConnectionTypeID": 28,
            "StatusTypeID": 50,
            "LevelID": 2,
            "PowerKW": 18,
            "CurrentTypeID": 10
        }
    ],
    "GeneralComments": "Recharge par badge et avec une application smartphone",
    "StatusTypeID": 50,
    "DateLastStatusUpdate": "2020-08-27T05:14:00Z",
    "DataQualityLevel": 2,
    "DateCreated": "2020-03-15T10:54:00Z",
    "SubmissionStatusTypeID": 100
}