{
    "IsRecentlyVerified": false,
    "ID": 185779,
    "UUID": "11ABA2AB-46D1-4D0E-9314-339ED5165048",
    "DataProviderID": 29,
    "DataProvidersReference": "10189",
    "AddressInfo": {
        "ID": 186138,
        "Title": "Käppelesäcker 10 ",
        "AddressLine1": "Käppelesäcker 10 ",
        "Town": "Erlenbach",
        "Postcode": "74235",
        "CountryID": 87,
        "Latitude": 49.168127,
        "Longitude": 9.261854,
        "DistanceUnit": 0
    },
    "Connections": [
        {
            "ID": 296650,
            "ConnectionTypeID": 25,
            "StatusTypeID": 50,
            "LevelID": 2,
            "PowerKW": 22,
            "CurrentTypeID": 20
        },
        {
            "ID": 296651,
            "ConnectionTypeID": 25,
            "StatusTypeID": 50,
            "LevelID": 2,
            "PowerKW": 22,
            "CurrentTypeID": 20
        }
    ],
    "StatusTypeID": 50,
    "DateLastStatusUpdate": "2021-07-12T02:42:00Z",
    "MetadataValues": [
        {
            "ID": 18023,
            "MetadataFieldID": 4,
            "ItemValue": "Data from the German chargepoint registry provided by Bundesnetzagentur.de under the CC-BY 4.0 license"
        }
    ],
    "DataQualityLevel": 3,
    "DateCreated": "2021-07-12T02:42:00Z",
    "SubmissionStatusTypeID": 100
}