{
    "IsRecentlyVerified": false,
    "ID": 15443,
    "UUID": "2685C90D-5F7A-4C57-9CA1-3CAB957CB5A4",
    "DataProviderID": 1,
    "OperatorID": 51,
    "UsageTypeID": 0,
    "UsageCost": "Free",
    "AddressInfo": {
        "ID": 15789,
        "Title": "Golden Home Hardware and Bldg Supplies",
        "AddressLine1": "912 15 Street South",
        "AddressLine2": "",
        "Town": "Golden",
        "StateOrProvince": "BC",
        "Postcode": "",
        "CountryID": 44,
        "Latitude": 51.2904786,
        "Longitude": -116.96301790000001,
        "ContactTelephone1": "+1 250-344-2964",
        "ContactTelephone2": "",
        "ContactEmail": "",
        "AccessComments": "",
        "RelatedURL": "http://www.homehardware.ca/",
        "DistanceUnit": 0
    },
    "Connections": [
        {
            "ID": 13752,
            "ConnectionTypeID": 1,
            "StatusTypeID": 0,
            "LevelID": 2,
            "Amps": 72,
            "Voltage": 240,
            "PowerKW": 17.3,
            "Quantity": 1
        }
    ],
    "NumberOfPoints": 1,
    "GeneralComments": "",
    "StatusTypeID": 50,
    "DateLastStatusUpdate": "2013-01-09T19:57:00Z",
    "DataQualityLevel": 1,
    "DateCreated": "2013-01-09T19:57:00Z",
    "SubmissionStatusTypeID": 200
}