{
    "IsRecentlyVerified": false,
    "ID": 104466,
    "UUID": "AA35BDCB-8343-4FDD-A663-FF0E7C067C8F",
    "DataProviderID": 1,
    "OperatorID": 23,
    "OperatorsReference": "43176",
    "UsageTypeID": 4,
    "AddressInfo": {
        "ID": 104812,
        "Title": "Evenementenhal Gorinchem",
        "AddressLine1": "Franklinweg 2",
        "Town": "Gorinchem",
        "Postcode": "4207 HZ",
        "CountryID": 159,
        "Latitude": 51.839649,
        "Longitude": 5.009054,
        "ContactTelephone1": "+31 18 36 80 680",
        "DistanceUnit": 0
    },
    "Connections": [
        {
            "ID": 147461,
            "ConnectionTypeID": 30,
            "StatusTypeID": 50,
            "LevelID": 2,
            "Amps": 32,
            "Voltage": 400,
            "PowerKW": 22,
            "CurrentTypeID": 20,
            "Quantity": 3
        }
    ],
    "NumberOfPoints": 3,
    "GeneralComments": "3 Tesla Connectors, up to 22kW.Available for customers. Self park.",
    "StatusTypeID": 50,
    "DateLastStatusUpdate": "2018-10-03T23:24:00Z",
    "DataQualityLevel": 1,
    "DateCreated": "2018-05-20T05:41:00Z",
    "SubmissionStatusTypeID": 200
}