{
    "IsRecentlyVerified": false,
    "ID": 103458,
    "UUID": "F7B21FAB-046A-4849-9C1B-00751AF50D97",
    "DataProviderID": 1,
    "OperatorID": 23,
    "OperatorsReference": "42495",
    "UsageTypeID": 4,
    "AddressInfo": {
        "ID": 103804,
        "Title": "Hotel Schlosskrone",
        "AddressLine1": "Prinzregentenplatz 2",
        "Town": "Fuessen",
        "Postcode": "87629",
        "CountryID": 87,
        "Latitude": 47.569904,
        "Longitude": 10.700115,
        "ContactTelephone1": "+49 8362 930180",
        "DistanceUnit": 0
    },
    "Connections": [
        {
            "ID": 146122,
            "ConnectionTypeID": 30,
            "StatusTypeID": 50,
            "LevelID": 2,
            "Amps": 32,
            "Voltage": 400,
            "PowerKW": 22,
            "CurrentTypeID": 20,
            "Quantity": 2
        }
    ],
    "NumberOfPoints": 2,
    "GeneralComments": "2 Tesla Connectors, up to 22kW.Available for customers. Please see front desk.",
    "StatusTypeID": 50,
    "DateLastStatusUpdate": "2018-10-03T18:23:00Z",
    "DataQualityLevel": 1,
    "DateCreated": "2018-05-03T06:14:00Z",
    "SubmissionStatusTypeID": 200
}