{
    "IsRecentlyVerified": false,
    "ID": 113661,
    "UUID": "180FF701-5B59-4F64-A2F2-BDE220DA6885",
    "DataProviderID": 1,
    "OperatorID": 80,
    "UsageTypeID": 4,
    "AddressInfo": {
        "ID": 114007,
        "Title": "Potenza don Bosco | EnelX",
        "AddressLine1": "Piazza don Bosco",
        "Town": "Potenza",
        "StateOrProvince": "PZ",
        "Postcode": "85100 ",
        "CountryID": 112,
        "Latitude": 40.64698056868657,
        "Longitude": 15.796885581624638,
        "ContactTelephone1": "800.069.850",
        "RelatedURL": "https://www.enelx.com/it/it/emobility",
        "DistanceUnit": 0
    },
    "Connections": [
        {
            "ID": 160191,
            "ConnectionTypeID": 25,
            "StatusTypeID": 50,
            "LevelID": 2,
            "Amps": 32,
            "Voltage": 400,
            "PowerKW": 22,
            "CurrentTypeID": 20,
            "Quantity": 1
        },
        {
            "ID": 160192,
            "ConnectionTypeID": 36,
            "StatusTypeID": 50,
            "LevelID": 2,
            "Amps": 16,
            "Voltage": 240,
            "PowerKW": 3.7,
            "CurrentTypeID": 10,
            "Quantity": 1
        }
    ],
    "NumberOfPoints": 2,
    "StatusTypeID": 50,
    "DateLastStatusUpdate": "2018-12-28T17:40:00Z",
    "DataQualityLevel": 1,
    "DateCreated": "2018-12-28T17:40:00Z",
    "SubmissionStatusTypeID": 200
}