{
    "IsRecentlyVerified": false,
    "ID": 177110,
    "UUID": "24B60CDF-F731-44F7-8C0E-0A5EF540A5A1",
    "DataProviderID": 29,
    "DataProvidersReference": "16040",
    "OperatorID": 3403,
    "AddressInfo": {
        "ID": 177469,
        "Title": "Kurt-Fischer-Straße 52",
        "AddressLine1": "Kurt-Fischer-Straße 52",
        "Town": "Ahrensburg",
        "Postcode": "22926",
        "CountryID": 87,
        "Latitude": 53.69126,
        "Longitude": 10.260891,
        "DistanceUnit": 0
    },
    "Connections": [
        {
            "ID": 275863,
            "ConnectionTypeID": 25,
            "StatusTypeID": 50,
            "LevelID": 2,
            "PowerKW": 22,
            "CurrentTypeID": 20
        },
        {
            "ID": 275864,
            "ConnectionTypeID": 25,
            "StatusTypeID": 50,
            "LevelID": 2,
            "PowerKW": 22,
            "CurrentTypeID": 20
        },
        {
            "ID": 275865,
            "ConnectionTypeID": 25,
            "StatusTypeID": 50,
            "LevelID": 2,
            "PowerKW": 22,
            "CurrentTypeID": 20
        },
        {
            "ID": 275866,
            "ConnectionTypeID": 25,
            "StatusTypeID": 50,
            "LevelID": 2,
            "PowerKW": 22,
            "CurrentTypeID": 20
        }
    ],
    "StatusTypeID": 0,
    "DateLastStatusUpdate": "2021-07-12T02:52:00Z",
    "MetadataValues": [
        {
            "ID": 9404,
            "MetadataFieldID": 4,
            "ItemValue": "Data from the German chargepoint registry provided by Bundesnetzagentur.de under the CC-BY 4.0 license"
        }
    ],
    "DataQualityLevel": 3,
    "DateCreated": "2021-07-08T09:48:00Z",
    "SubmissionStatusTypeID": 100
}