{
    "UserComments": [
        {
            "ID": 14649,
            "ChargePointID": 24713,
            "CommentTypeID": 10,
            "UserName": "ozana",
            "Comment": "Neměl jsem tu správnou koncovku kabelu.",
            "Rating": 3,
            "DateCreated": "2016-12-06T06:38:37.733Z",
            "User": {
                "ID": 6224,
                "Username": "ozana"
            },
            "CheckinStatusTypeID": 30
        }
    ],
    "MediaItems": [
        {
            "ID": 1489,
            "ChargePointID": 24713,
            "ItemURL": "https://s3-ap-southeast-2.amazonaws.com/openchargemap/images/CZ/OCM24713/OCM-24713.orig.2015052616441925.jpg",
            "ItemThumbnailURL": "https://s3-ap-southeast-2.amazonaws.com/openchargemap/images/CZ/OCM24713/OCM-24713.thmb.2015052616441925.jpg",
            "Comment": "CEE 5 pin connection detail.",
            "IsEnabled": true,
            "IsVideo": false,
            "IsFeaturedItem": false,
            "IsExternalResource": false,
            "User": {
                "ID": 2310,
                "Username": "Peter K."
            },
            "DateCreated": "2015-05-26T16:45:00Z"
        },
        {
            "ID": 1488,
            "ChargePointID": 24713,
            "ItemURL": "https://s3-ap-southeast-2.amazonaws.com/openchargemap/images/CZ/OCM24713/OCM-24713.orig.2015052616431145.jpg",
            "ItemThumbnailURL": "https://s3-ap-southeast-2.amazonaws.com/openchargemap/images/CZ/OCM24713/OCM-24713.thmb.2015052616431145.jpg",
            "Comment": "Available connections.",
            "IsEnabled": true,
            "IsVideo": false,
            "IsFeaturedItem": false,
            "IsExternalResource": false,
            "User": {
                "ID": 2310,
                "Username": "Peter K."
            },
            "DateCreated": "2015-05-26T16:43:00Z"
        },
        {
            "ID": 1487,
            "ChargePointID": 24713,
            "ItemURL": "https://s3-ap-southeast-2.amazonaws.com/openchargemap/images/CZ/OCM24713/OCM-24713.orig.2015052616373758.jpg",
            "ItemThumbnailURL": "https://s3-ap-southeast-2.amazonaws.com/openchargemap/images/CZ/OCM24713/OCM-24713.thmb.2015052616373758.jpg",
            "Comment": "The connections are located behind the first pillar.",
            "IsEnabled": true,
            "IsVideo": false,
            "IsFeaturedItem": false,
            "IsExternalResource": false,
            "User": {
                "ID": 2310,
                "Username": "Peter K."
            },
            "DateCreated": "2015-05-26T16:38:00Z"
        }
    ],
    "IsRecentlyVerified": false,
    "ID": 24713,
    "UUID": "D6A71178-97B0-4F21-B48C-ADA1BEACB24A",
    "DataProviderID": 1,
    "OperatorID": 192,
    "UsageTypeID": 1,
    "UsageCost": "Parking cost only (Jen cena parkování)",
    "AddressInfo": {
        "ID": 25059,
        "Title": "Galerie Vaňkovka",
        "AddressLine1": "Ve Vaňkovce 1",
        "Town": "Brno",
        "StateOrProvince": "okres Brno-město",
        "Postcode": "602 00",
        "CountryID": 64,
        "Latitude": 49.1881169033673,
        "Longitude": 16.6147003490002,
        "AccessComments": "CZ: 1. patro krytého parkoviště sektor A, poblíž vchodu do nákupní galerie. Otevírací doba parkoviště: denně 7.00 - 23.00. Parkovné 1. hodina zdarma, 2. a 3. hodina 20 Kč, každá další po 25 Kč.\r\nEN: 1st floor of the rooftop parking on the Galerie Vankovka shopping centre, sector A, close to the entrance to the shopping gallery. The location is accessible every day from 7:00 to 23:00.  1st hour of parking is free, 2nd and 3rd is for 20 CZK, every hour afterwards for 25 CZK. ",
        "RelatedURL": "http://www.galerie-vankovka.cz/en/parking",
        "DistanceUnit": 0
    },
    "Connections": [
        {
            "ID": 27035,
            "ConnectionTypeID": 17,
            "StatusTypeID": 50,
            "LevelID": 2,
            "Amps": 32,
            "Voltage": 400,
            "PowerKW": 22,
            "CurrentTypeID": 20,
            "Quantity": 1
        },
        {
            "ID": 27036,
            "ConnectionTypeID": 23,
            "StatusTypeID": 50,
            "LevelID": 2,
            "Amps": 16,
            "Voltage": 230,
            "PowerKW": 3.68,
            "CurrentTypeID": 10,
            "Quantity": 2
        },
        {
            "ID": 108004,
            "ConnectionTypeID": 25,
            "StatusTypeID": 150,
            "LevelID": 2,
            "Amps": 32,
            "Voltage": 400,
            "PowerKW": 22,
            "CurrentTypeID": 20,
            "Quantity": 1
        }
    ],
    "NumberOfPoints": 1,
    "StatusTypeID": 50,
    "DateLastStatusUpdate": "2016-12-06T06:39:00Z",
    "DataQualityLevel": 1,
    "DateCreated": "2014-11-09T09:55:00Z",
    "SubmissionStatusTypeID": 200
}