{
    "IsRecentlyVerified": false,
    "ID": 178848,
    "UUID": "DC69F0A1-2630-4205-84AF-57AAA39132CB",
    "DataProviderID": 29,
    "DataProvidersReference": "2045",
    "OperatorID": 45,
    "AddressInfo": {
        "ID": 179207,
        "Title": "Industriestraße 34",
        "AddressLine1": "Industriestraße 34",
        "Town": "Backnang",
        "Postcode": "71522",
        "CountryID": 87,
        "Latitude": 48.9363357,
        "Longitude": 9.44490229999996,
        "DistanceUnit": 0
    },
    "Connections": [
        {
            "ID": 279816,
            "ConnectionTypeID": 1036,
            "StatusTypeID": 50,
            "LevelID": 3,
            "PowerKW": 43,
            "CurrentTypeID": 20
        },
        {
            "ID": 279817,
            "ConnectionTypeID": 33,
            "StatusTypeID": 50,
            "LevelID": 3,
            "PowerKW": 50,
            "CurrentTypeID": 30
        }
    ],
    "StatusTypeID": 0,
    "DateLastStatusUpdate": "2021-07-09T03:14:00Z",
    "MetadataValues": [
        {
            "ID": 11142,
            "MetadataFieldID": 4,
            "ItemValue": "Data from the German chargepoint registry provided by Bundesnetzagentur.de under the CC-BY 4.0 license"
        }
    ],
    "DataQualityLevel": 3,
    "DateCreated": "2021-07-08T09:50:00Z",
    "SubmissionStatusTypeID": 100
}