{
    "IsRecentlyVerified": false,
    "ID": 31707,
    "UUID": "9DE889B0-763E-40BB-BD74-8F5A0523DCE2",
    "DataProviderID": 1,
    "OperatorID": 105,
    "OperatorsReference": "Essent EM-DE-09263000-01-00001",
    "UsageTypeID": 4,
    "AddressInfo": {
        "ID": 32053,
        "Title": "Chamer Str. 37",
        "AddressLine1": "Chamer Str. 37",
        "Town": "Straubing",
        "Postcode": "94315",
        "CountryID": 87,
        "Latitude": 48.265759,
        "Longitude": 10.445592,
        "DistanceUnit": 0
    },
    "Connections": [
        {
            "ID": 35218,
            "ConnectionTypeID": 25,
            "LevelID": 2,
            "PowerKW": 11
        },
        {
            "ID": 46071,
            "ConnectionTypeID": 25,
            "LevelID": 2,
            "PowerKW": 11
        }
    ],
    "NumberOfPoints": 1,
    "StatusTypeID": 50,
    "DateLastStatusUpdate": "2015-04-13T23:23:00Z",
    "DataQualityLevel": 3,
    "DateCreated": "2015-01-09T06:03:00Z",
    "SubmissionStatusTypeID": 200
}