{
    "IsRecentlyVerified": false,
    "ID": 170113,
    "UUID": "70394308-FB7E-4350-A47D-DCBF84FE4990",
    "DataProviderID": 1,
    "OperatorID": 3369,
    "UsageTypeID": 4,
    "AddressInfo": {
        "ID": 170472,
        "Title": "Telekom",
        "AddressLine1": "Philipp-Reis-Straße 4",
        "Town": "Springe",
        "StateOrProvince": "Region Hannover",
        "Postcode": "31382",
        "CountryID": 87,
        "Latitude": 52.217996329837234,
        "Longitude": 9.567105878162124,
        "ContactTelephone1": "+49 800 6660044",
        "AccessComments": "24/7 verfügbare Ladesäule auf dem Gelände der Telekom. Freischaltbar auch mit EinfachStromLaden, Shell Recharge oder PlugSurfing App oder Karte.",
        "RelatedURL": "http://www.comfortcharge.de/",
        "DistanceUnit": 0
    },
    "Connections": [
        {
            "ID": 259336,
            "ConnectionTypeID": 33,
            "StatusTypeID": 50,
            "LevelID": 3,
            "Amps": 150,
            "Voltage": 920,
            "PowerKW": 55,
            "CurrentTypeID": 30,
            "Quantity": 1
        },
        {
            "ID": 259337,
            "ConnectionTypeID": 2,
            "StatusTypeID": 50,
            "LevelID": 3,
            "Amps": 125,
            "Voltage": 500,
            "PowerKW": 50,
            "CurrentTypeID": 30,
            "Quantity": 1
        }
    ],
    "NumberOfPoints": 2,
    "StatusTypeID": 50,
    "DateLastStatusUpdate": "2020-11-18T14:00:00Z",
    "DataQualityLevel": 1,
    "DateCreated": "2020-11-18T14:00:00Z",
    "SubmissionStatusTypeID": 200
}