{
    "IsRecentlyVerified": false,
    "ID": 113787,
    "UUID": "8F09BE5D-B28F-4EB8-BD3E-72C5919678B0",
    "DataProviderID": 1,
    "OperatorID": 23,
    "OperatorsReference": "47387",
    "UsageTypeID": 4,
    "AddressInfo": {
        "ID": 114133,
        "Title": "Saalbach Apartments Landhaus Bernkogel",
        "AddressLine1": "Eberhartweg 380",
        "Town": "Saalbach",
        "Postcode": "5753",
        "CountryID": 19,
        "Latitude": 47.393809,
        "Longitude": 12.632126,
        "ContactTelephone1": " +43 6541 21105",
        "DistanceUnit": 0
    },
    "Connections": [
        {
            "ID": 160357,
            "ConnectionTypeID": 30,
            "StatusTypeID": 50,
            "LevelID": 2,
            "Amps": 16,
            "Voltage": 400,
            "PowerKW": 11,
            "CurrentTypeID": 20,
            "Quantity": 2
        }
    ],
    "NumberOfPoints": 2,
    "GeneralComments": "2 Tesla Connectors, up to 11kW.Available for customers. Please call ahead.",
    "StatusTypeID": 50,
    "DateLastStatusUpdate": "2019-01-02T21:35:00Z",
    "DataQualityLevel": 1,
    "DateCreated": "2019-01-02T21:35:00Z",
    "SubmissionStatusTypeID": 200
}