{
    "IsRecentlyVerified": false,
    "ID": 159557,
    "UUID": "C9437FF6-F109-47E4-B287-6D7F4538B375",
    "DataProviderID": 2,
    "DataProvidersReference": "154175",
    "OperatorID": 5,
    "UsageTypeID": 1,
    "AddressInfo": {
        "ID": 159914,
        "Title": "NEWARK OHIO",
        "AddressLine1": "51 E Church St",
        "Town": "Newark",
        "StateOrProvince": "OH",
        "Postcode": "43055",
        "CountryID": 2,
        "Latitude": 40.059422,
        "Longitude": -82.400843,
        "ContactTelephone1": "888-758-4389",
        "AccessComments": "24 hours daily",
        "RelatedURL": "http://www.chargepoint.com/",
        "DistanceUnit": 0
    },
    "Connections": [
        {
            "ID": 229750,
            "ConnectionTypeID": 2,
            "LevelID": 3,
            "Amps": 100,
            "Voltage": 400,
            "PowerKW": 40,
            "CurrentTypeID": 30,
            "Quantity": 1
        },
        {
            "ID": 229751,
            "ConnectionTypeID": 32,
            "LevelID": 3,
            "Amps": 100,
            "Voltage": 400,
            "PowerKW": 40,
            "CurrentTypeID": 30,
            "Quantity": 1
        }
    ],
    "StatusTypeID": 50,
    "DateLastStatusUpdate": "2020-06-26T03:02:00Z",
    "DataQualityLevel": 3,
    "DateCreated": "2020-06-26T03:02:00Z",
    "SubmissionStatusTypeID": 100
}