{
    "IsRecentlyVerified": false,
    "ID": 142509,
    "UUID": "95CD3AF1-4279-4048-8BDB-13BF807EFAA0",
    "DataProviderID": 2,
    "DataProvidersReference": "146800",
    "OperatorID": 5,
    "UsageTypeID": 1,
    "AddressInfo": {
        "ID": 142861,
        "Title": "VERONA TOWNSHIP",
        "AddressLine1": "Bloomfield Ave at Lakeside Ave",
        "Town": "Verona",
        "StateOrProvince": "NJ",
        "Postcode": "07044",
        "CountryID": 2,
        "Latitude": 40.832207,
        "Longitude": -74.246124,
        "ContactTelephone1": "888-758-4389",
        "AccessComments": "24 hours daily",
        "RelatedURL": "http://www.chargepoint.com/",
        "DistanceUnit": 0
    },
    "Connections": [
        {
            "ID": 198660,
            "ConnectionTypeID": 1,
            "LevelID": 2,
            "Amps": 16,
            "Voltage": 230,
            "PowerKW": 3.7,
            "CurrentTypeID": 10,
            "Quantity": 2
        }
    ],
    "StatusTypeID": 50,
    "DateLastStatusUpdate": "2020-06-26T03:03:00Z",
    "DataQualityLevel": 3,
    "DateCreated": "2019-12-24T09:18:00Z",
    "SubmissionStatusTypeID": 100
}