{
    "IsRecentlyVerified": false,
    "ID": 29356,
    "UUID": "16FD72DE-A45B-4006-BA67-56C9C43AC07E",
    "DataProviderID": 2,
    "DataProvidersReference": "60463",
    "OperatorID": 5,
    "UsageTypeID": 1,
    "AddressInfo": {
        "ID": 29702,
        "Title": "OLY CITY HALL",
        "AddressLine1": "900 Plum St SE",
        "Town": "Olympia",
        "StateOrProvince": "WA",
        "Postcode": "98501",
        "CountryID": 2,
        "Latitude": 47.0408639,
        "Longitude": -122.8915832,
        "ContactTelephone1": "888-758-4389",
        "AccessComments": "24 hours daily",
        "RelatedURL": "http://www.chargepoint.com/",
        "DistanceUnit": 0
    },
    "Connections": [
        {
            "ID": 32280,
            "ConnectionTypeID": 1,
            "LevelID": 2,
            "Amps": 16,
            "Voltage": 230,
            "PowerKW": 3.7,
            "CurrentTypeID": 10,
            "Quantity": 2
        }
    ],
    "DateLastStatusUpdate": "2020-06-26T03:10:00Z",
    "DataQualityLevel": 3,
    "DateCreated": "2014-11-28T03:39:00Z",
    "SubmissionStatusTypeID": 100
}