{
    "IsRecentlyVerified": false,
    "ID": 62673,
    "UUID": "DF00E636-835A-4D10-A598-EDFE12E5D902",
    "DataProviderID": 26,
    "DataProvidersReference": "22365",
    "OperatorID": 162,
    "OperatorsReference": "茨城日産自動車㈱日立多賀店",
    "UsageCost": "0.00 onbekend",
    "AddressInfo": {
        "ID": 63019,
        "Title": "陸前浜街道",
        "AddressLine1": "陸前浜街道",
        "Town": "日立市",
        "Postcode": "",
        "CountryID": 114,
        "Latitude": 36.555122,
        "Longitude": 140.625687,
        "DistanceUnit": 0
    },
    "Connections": [
        {
            "ID": 79596,
            "ConnectionTypeID": 2,
            "LevelID": 3,
            "PowerKW": 50,
            "CurrentTypeID": 30
        }
    ],
    "NumberOfPoints": 1,
    "StatusTypeID": 50,
    "DateLastStatusUpdate": "2016-03-03T12:29:00Z",
    "DataQualityLevel": 3,
    "DateCreated": "2016-03-03T12:29:00Z",
    "SubmissionStatusTypeID": 100
}