{
    "IsRecentlyVerified": false,
    "ID": 159613,
    "UUID": "AA10FAAB-45C1-4F76-851F-CCBF8B73A4A9",
    "DataProviderID": 2,
    "DataProvidersReference": "155491",
    "OperatorID": 5,
    "UsageTypeID": 1,
    "AddressInfo": {
        "ID": 159970,
        "Title": "IMPERIALHOUSE",
        "AddressLine1": "787 Ocean Ave",
        "Town": "Long Branch",
        "StateOrProvince": "NJ",
        "Postcode": "07740",
        "CountryID": 2,
        "Latitude": 40.277546,
        "Longitude": -73.98467,
        "ContactTelephone1": "888-758-4389",
        "AccessComments": "24 hours daily",
        "RelatedURL": "http://www.chargepoint.com/",
        "DistanceUnit": 0
    },
    "Connections": [
        {
            "ID": 229813,
            "ConnectionTypeID": 1,
            "LevelID": 2,
            "Amps": 16,
            "Voltage": 230,
            "PowerKW": 3.7,
            "CurrentTypeID": 10,
            "Quantity": 2
        }
    ],
    "StatusTypeID": 50,
    "DateLastStatusUpdate": "2020-06-26T03:02:00Z",
    "DataQualityLevel": 3,
    "DateCreated": "2020-06-26T03:02:00Z",
    "SubmissionStatusTypeID": 100
}