{
    "IsRecentlyVerified": false,
    "ID": 139157,
    "UUID": "C1D0228A-263F-4C0A-B19B-4CA573157C46",
    "DataProviderID": 2,
    "DataProvidersReference": "124983",
    "OperatorID": 9,
    "UsageTypeID": 1,
    "AddressInfo": {
        "ID": 139509,
        "Title": "Fry's Store #54 Scottsdale",
        "AddressLine1": "4842 E. Bell Rd.",
        "Town": "Scottsdale",
        "StateOrProvince": "AZ",
        "Postcode": "85254",
        "CountryID": 2,
        "Latitude": 33.642454,
        "Longitude": -111.976452,
        "ContactTelephone1": "888-998-2546",
        "AccessComments": "MON: 24 hours | TUE: 24 hours | WED: 24 hours | THU: 24 hours | FRI: 24 hours | SAT: 24 hours | SUN: 24 hours",
        "RelatedURL": "http://www.blinkcharging.com/",
        "DistanceUnit": 0
    },
    "Connections": [
        {
            "ID": 194422,
            "ConnectionTypeID": 1,
            "LevelID": 2,
            "Amps": 16,
            "Voltage": 230,
            "PowerKW": 3.7,
            "CurrentTypeID": 10,
            "Quantity": 2
        }
    ],
    "StatusTypeID": 50,
    "DateLastStatusUpdate": "2020-06-26T02:55:00Z",
    "DataQualityLevel": 3,
    "DateCreated": "2019-12-24T09:10:00Z",
    "SubmissionStatusTypeID": 100
}