{
    "IsRecentlyVerified": false,
    "ID": 176031,
    "UUID": "D67E6F4D-1B6C-451E-9019-64DF1BC7212B",
    "DataProviderID": 1,
    "OperatorID": 80,
    "UsageTypeID": 4,
    "UsageCost": "free",
    "AddressInfo": {
        "ID": 176390,
        "Title": "Torremayor Ricardo Lyon 322 n°2",
        "AddressLine1": "Ricardo Lyon 322",
        "Town": "Providencia",
        "StateOrProvince": "Región Metropolitana de Santiago",
        "Postcode": "7500000",
        "CountryID": 49,
        "Latitude": -33.424593504973295,
        "Longitude": -70.60871810186092,
        "RelatedURL": "https://www.enelx.com/cl/es",
        "DistanceUnit": 0
    },
    "Connections": [
        {
            "ID": 273461,
            "ConnectionTypeID": 25,
            "StatusTypeID": 50,
            "LevelID": 2,
            "PowerKW": 7.4,
            "Quantity": 1
        }
    ],
    "NumberOfPoints": 1,
    "StatusTypeID": 50,
    "DateLastStatusUpdate": "2021-06-24T04:35:00Z",
    "DataQualityLevel": 1,
    "DateCreated": "2021-06-24T04:35:00Z",
    "SubmissionStatusTypeID": 200
}