{
    "IsRecentlyVerified": false,
    "ID": 67178,
    "UUID": "C73FBDED-9DA9-4B27-8850-23F7DC742B16",
    "DataProviderID": 2,
    "DataProvidersReference": "74303",
    "UsageTypeID": 1,
    "AddressInfo": {
        "ID": 67524,
        "Title": "Town of Ocean City - Municipal Parking",
        "AddressLine1": "10007 Coastal Hwy",
        "Town": "Ocean City",
        "StateOrProvince": "MD",
        "Postcode": "21842",
        "CountryID": 2,
        "Latitude": 38.414273,
        "Longitude": -75.058153,
        "ContactTelephone1": "410-685-1109",
        "AccessComments": "24 hours daily",
        "RelatedURL": "",
        "DistanceUnit": 0
    },
    "Connections": [
        {
            "ID": 92676,
            "ConnectionTypeID": 1,
            "LevelID": 2,
            "Amps": 16,
            "Voltage": 230,
            "PowerKW": 3.7,
            "CurrentTypeID": 10,
            "Quantity": 2
        }
    ],
    "DateLastStatusUpdate": "2020-06-26T03:00:00Z",
    "DataQualityLevel": 3,
    "DateCreated": "2016-05-29T02:04:00Z",
    "SubmissionStatusTypeID": 100
}