{
    "IsRecentlyVerified": false,
    "ID": 91700,
    "UUID": "C5687BE3-6DDB-4E85-AA38-B1802FDC14B4",
    "DataProviderID": 1,
    "OperatorID": 45,
    "UsageTypeID": 1,
    "UsageCost": "Frei",
    "AddressInfo": {
        "ID": 92046,
        "Title": "KITA Wiesenkinder",
        "AddressLine1": "An der Quöbbe 35",
        "AddressLine2": "Rhedewiesen",
        "Town": "Boizenburg/Elbe",
        "StateOrProvince": "Landkreis Ludwigslust-Parchim",
        "Postcode": "19258",
        "CountryID": 87,
        "Latitude": 53.3747355,
        "Longitude": 10.727407299999982,
        "ContactTelephone1": "+49 800 6648919",
        "AccessComments": "24/7 nutzbare weiße Ladesäule vor einer Parkbucht, mit beliebiger Ladekarte freischaltbar. Keine markierten Parkplätze!\r\n",
        "RelatedURL": "http://www.versorgungsbetriebe-elbe.de/",
        "DistanceUnit": 0
    },
    "Connections": [
        {
            "ID": 130022,
            "ConnectionTypeID": 25,
            "StatusTypeID": 50,
            "LevelID": 2,
            "Amps": 32,
            "Voltage": 400,
            "PowerKW": 22,
            "CurrentTypeID": 20,
            "Quantity": 2
        },
        {
            "ID": 130023,
            "ConnectionTypeID": 28,
            "StatusTypeID": 50,
            "LevelID": 2,
            "Amps": 16,
            "Voltage": 230,
            "PowerKW": 3.7,
            "CurrentTypeID": 10,
            "Quantity": 2
        }
    ],
    "NumberOfPoints": 4,
    "GeneralComments": "Betreiber sind die Versorgungsbetriebe Elbe GmbH.",
    "StatusTypeID": 50,
    "DateLastStatusUpdate": "2017-08-14T07:41:00Z",
    "DataQualityLevel": 1,
    "DateCreated": "2017-08-14T07:41:00Z",
    "SubmissionStatusTypeID": 200
}