{
    "IsRecentlyVerified": false,
    "ID": 66154,
    "UUID": "CF79C48A-663E-4B6E-B6DD-9580DA1E4173",
    "DataProviderID": 1,
    "OperatorID": 1240,
    "UsageTypeID": 1,
    "AddressInfo": {
        "ID": 66500,
        "Title": "E-Bike Station Winzerhof Rehg",
        "AddressLine1": "Am Marktplatz",
        "Town": "Freinsheim",
        "StateOrProvince": "Freinsheim",
        "Postcode": "67251",
        "CountryID": 87,
        "Latitude": 49.50623954483394,
        "Longitude": 8.211005236805343,
        "RelatedURL": "https://www.pfalzwerke.de/energieberatung/9244.php",
        "DistanceUnit": 0
    },
    "Connections": [
        {
            "ID": 91445,
            "ConnectionTypeID": 28,
            "StatusTypeID": 50,
            "LevelID": 1,
            "Amps": 10,
            "Voltage": 230,
            "PowerKW": 2.3,
            "CurrentTypeID": 10,
            "Quantity": 4
        }
    ],
    "NumberOfPoints": 4,
    "StatusTypeID": 50,
    "DateLastStatusUpdate": "2016-05-12T07:34:00Z",
    "DataQualityLevel": 1,
    "DateCreated": "2016-05-12T07:33:00Z",
    "SubmissionStatusTypeID": 200
}