{
    "IsRecentlyVerified": false,
    "ID": 104061,
    "UUID": "4FB4DE71-BEAE-48EC-829B-C80762754D0E",
    "DataProviderID": 1,
    "OperatorID": 105,
    "UsageTypeID": 4,
    "AddressInfo": {
        "ID": 104407,
        "Title": "Hotel Brunnenhof",
        "AddressLine1": "Burgwedeler Straße 1",
        "Town": "Wedemark",
        "StateOrProvince": "Region Hannover",
        "Postcode": "30900",
        "CountryID": 87,
        "Latitude": 52.52364,
        "Longitude": 9.757380000000012,
        "AccessComments": "Durchgehend verfügbare Ladesäule auf dem Hotelparkplatz (Betreiber ist NEW im innogy-Verbund).",
        "DistanceUnit": 0
    },
    "Connections": [
        {
            "ID": 146887,
            "ConnectionTypeID": 25,
            "StatusTypeID": 50,
            "LevelID": 2,
            "Amps": 32,
            "Voltage": 400,
            "PowerKW": 22,
            "CurrentTypeID": 20,
            "Quantity": 2
        }
    ],
    "NumberOfPoints": 2,
    "StatusTypeID": 50,
    "DateLastStatusUpdate": "2018-05-15T12:13:00Z",
    "DataQualityLevel": 1,
    "DateCreated": "2018-05-15T12:13:00Z",
    "SubmissionStatusTypeID": 200
}