{
    "UserComments": [
        {
            "ID": 22814,
            "ChargePointID": 127052,
            "CommentTypeID": 10,
            "UserName": "Rik",
            "Comment": "#PartagoStandplaats",
            "Rating": 4,
            "DateCreated": "2020-06-23T13:29:35.98Z",
            "User": {
                "ID": 26250,
                "Username": "Rik"
            },
            "CheckinStatusTypeID": 10,
            "IsActionedByEditor": false
        },
        {
            "ID": 21054,
            "ChargePointID": 127052,
            "CommentTypeID": 10,
            "UserName": "Someone_Just_",
            "Rating": 4,
            "DateCreated": "2019-05-26T18:52:59.613Z",
            "User": {
                "ID": 1107,
                "Username": "Someone_Just_"
            },
            "CheckinStatusTypeID": 140
        }
    ],
    "MediaItems": [
        {
            "ID": 18515,
            "ChargePointID": 127052,
            "ItemURL": "https://s3-ap-southeast-2.amazonaws.com/openchargemap/images/BE/OCM127052/OCM-127052.orig.2019052618545975.jpg",
            "ItemThumbnailURL": "https://s3-ap-southeast-2.amazonaws.com/openchargemap/images/BE/OCM127052/OCM-127052.thmb.2019052618545975.jpg",
            "Comment": "1 place reserved for Partago",
            "IsEnabled": true,
            "IsVideo": false,
            "IsFeaturedItem": false,
            "IsExternalResource": false,
            "User": {
                "ID": 1107,
                "Username": "Someone_Just_"
            },
            "DateCreated": "2019-05-26T18:55:00Z"
        },
        {
            "ID": 18514,
            "ChargePointID": 127052,
            "ItemURL": "https://s3-ap-southeast-2.amazonaws.com/openchargemap/images/BE/OCM127052/OCM-127052.orig.2019052618535237.jpg",
            "ItemThumbnailURL": "https://s3-ap-southeast-2.amazonaws.com/openchargemap/images/BE/OCM127052/OCM-127052.thmb.2019052618535237.jpg",
            "Comment": "",
            "IsEnabled": true,
            "IsVideo": false,
            "IsFeaturedItem": false,
            "IsExternalResource": false,
            "User": {
                "ID": 1107,
                "Username": "Someone_Just_"
            },
            "DateCreated": "2019-05-26T18:54:00Z"
        }
    ],
    "IsRecentlyVerified": false,
    "ID": 127052,
    "UUID": "E25DBBE3-7486-4175-A423-2F6CB10FDFE7",
    "DataProviderID": 1,
    "OperatorID": 103,
    "UsageTypeID": 1,
    "AddressInfo": {
        "ID": 127398,
        "Title": "  Sint Jan Baptistestraat 1 Gent",
        "AddressLine1": "  Sint Jan Baptistestraat 1",
        "Town": "gent",
        "Postcode": "9000",
        "CountryID": 26,
        "Latitude": 51.059184913866,
        "Longitude": 3.70394217912622,
        "DistanceUnit": 0
    },
    "Connections": [
        {
            "ID": 177924,
            "ConnectionTypeID": 25,
            "StatusTypeID": 50,
            "LevelID": 2,
            "PowerKW": 11,
            "CurrentTypeID": 20,
            "Quantity": 2
        }
    ],
    "NumberOfPoints": 2,
    "GeneralComments": "2 places for cars (one reserved for Partago)",
    "StatusTypeID": 50,
    "DateLastStatusUpdate": "2020-06-23T13:30:00Z",
    "DataQualityLevel": 1,
    "DateCreated": "2019-05-26T18:52:00Z",
    "SubmissionStatusTypeID": 200
}