{
    "IsRecentlyVerified": false,
    "ID": 72221,
    "UUID": "9C6BFEAC-F401-42FC-857A-C95DB799F718",
    "DataProviderID": 2,
    "DataProvidersReference": "78838",
    "OperatorID": 39,
    "UsageTypeID": 4,
    "AddressInfo": {
        "ID": 72567,
        "Title": "Milpitas City Hall",
        "AddressLine1": "455 E. Calaveras Blvd.",
        "Town": "Milpitas",
        "StateOrProvince": "CA",
        "Postcode": "95035",
        "CountryID": 2,
        "Latitude": 37.4329175,
        "Longitude": -121.8990844,
        "ContactTelephone1": "800-663-5633",
        "AccessComments": "MO: Not Specified; TU: Not Specified; WE: Not Specified; TH: Not Specified; FR: Not Specified; SA: Not Specified; SU: Not Specified",
        "RelatedURL": "http://www.semacharge.com/",
        "DistanceUnit": 0
    },
    "Connections": [
        {
            "ID": 103524,
            "ConnectionTypeID": 1,
            "LevelID": 2,
            "Amps": 16,
            "Voltage": 230,
            "PowerKW": 3,
            "CurrentTypeID": 10,
            "Quantity": 2
        }
    ],
    "DateLastStatusUpdate": "2019-04-06T04:02:00Z",
    "DataQualityLevel": 3,
    "DateCreated": "2016-10-09T02:45:00Z",
    "SubmissionStatusTypeID": 100
}