{
    "IsRecentlyVerified": false,
    "ID": 30058,
    "UUID": "0EFF64FE-AEE3-43E0-89FE-BBA17717CDAD",
    "DataProviderID": 1,
    "DataProvidersReference": "LSB-00047",
    "OperatorID": 21,
    "UsageTypeID": 4,
    "UsageCost": "Mobi.E compatible card",
    "AddressInfo": {
        "ID": 30404,
        "Title": "LSB-00047",
        "AddressLine1": "Caminho das Pedreiras",
        "Town": "Lisboa",
        "Postcode": "1500-000",
        "CountryID": 180,
        "Latitude": 38.734772,
        "Longitude": -9.179733,
        "RelatedURL": "http://www.mobie.pt",
        "DistanceUnit": 0
    },
    "Connections": [
        {
            "ID": 33043,
            "ConnectionTypeID": 25,
            "StatusTypeID": 50,
            "LevelID": 2,
            "Amps": 16,
            "Voltage": 230,
            "PowerKW": 3.7,
            "CurrentTypeID": 10,
            "Quantity": 2
        }
    ],
    "NumberOfPoints": 2,
    "StatusTypeID": 50,
    "DateLastStatusUpdate": "2020-08-15T11:49:00Z",
    "DataQualityLevel": 3,
    "DateCreated": "2014-11-29T14:48:00Z",
    "SubmissionStatusTypeID": 100
}