{
    "IsRecentlyVerified": false,
    "ID": 96117,
    "UUID": "68493736-07CA-427B-9D3A-A47788C8F9AD",
    "DataProviderID": 1,
    "OperatorID": 105,
    "UsageTypeID": 4,
    "AddressInfo": {
        "ID": 96463,
        "Title": "Rathaus",
        "AddressLine1": "Markt 1",
        "AddressLine2": "Cunsdorf",
        "Town": "Reichenbach im Vogtland",
        "StateOrProvince": "Reichenbach im Vogtland",
        "Postcode": "08468",
        "CountryID": 87,
        "Latitude": 50.6210760554657,
        "Longitude": 12.3035871140862,
        "AccessComments": "24// nutzbar",
        "DistanceUnit": 0
    },
    "Connections": [
        {
            "ID": 136190,
            "ConnectionTypeID": 25,
            "StatusTypeID": 50,
            "LevelID": 2,
            "Amps": 32,
            "Voltage": 400,
            "PowerKW": 22,
            "CurrentTypeID": 20,
            "Quantity": 2
        }
    ],
    "NumberOfPoints": 2,
    "StatusTypeID": 50,
    "DateLastStatusUpdate": "2017-12-11T07:25:00Z",
    "DataQualityLevel": 1,
    "DateCreated": "2017-12-11T07:22:00Z",
    "SubmissionStatusTypeID": 200
}