{
    "IsRecentlyVerified": false,
    "ID": 122696,
    "UUID": "27DE65D2-3F1E-4B38-ACD1-28199E4D9875",
    "DataProviderID": 2,
    "DataProvidersReference": "60407",
    "OperatorID": 5,
    "UsageTypeID": 1,
    "AddressInfo": {
        "ID": 123042,
        "Title": "NISSAN-SANTA BA",
        "AddressLine1": "495 S Kellogg Ave",
        "Town": "Goleta",
        "StateOrProvince": "CA",
        "Postcode": "93117",
        "CountryID": 2,
        "Latitude": 34.4337922,
        "Longitude": -119.8210544,
        "ContactTelephone1": "888-758-4389",
        "AccessComments": "24 hours daily",
        "RelatedURL": "http://www.chargepoint.com/",
        "DistanceUnit": 0
    },
    "Connections": [
        {
            "ID": 172608,
            "ConnectionTypeID": 2,
            "LevelID": 3,
            "Amps": 100,
            "Voltage": 400,
            "PowerKW": 40,
            "CurrentTypeID": 30,
            "Quantity": 1
        }
    ],
    "DateLastStatusUpdate": "2019-12-24T09:12:00Z",
    "DataQualityLevel": 3,
    "DateCreated": "2019-04-06T05:03:00Z",
    "SubmissionStatusTypeID": 100
}