{
    "IsRecentlyVerified": false,
    "ID": 60816,
    "UUID": "BA4192B7-288E-4D15-AF5F-73EE2D64E8D9",
    "DataProviderID": 1,
    "OperatorID": 1,
    "UsageTypeID": 6,
    "UsageCost": "Free",
    "AddressInfo": {
        "ID": 61162,
        "Title": "VCA West Los Angeles Animal Hospital",
        "AddressLine1": "1900 S Sepulveda Blvd.",
        "Town": "Los Angeles",
        "StateOrProvince": "CA",
        "Postcode": "90025",
        "CountryID": 2,
        "Latitude": 34.0443104120552,
        "Longitude": -118.441061834526,
        "ContactTelephone1": "310-473-2951",
        "AccessComments": "Inside the parking structure that services VCA WLA Animal Hospital",
        "RelatedURL": "http://www.vcaspecialtyvets.com/west-los-angeles",
        "DistanceUnit": 0
    },
    "Connections": [
        {
            "ID": 77101,
            "ConnectionTypeID": 0,
            "StatusTypeID": 50
        }
    ],
    "NumberOfPoints": 3,
    "StatusTypeID": 50,
    "DateLastStatusUpdate": "2016-02-09T12:44:00Z",
    "DataQualityLevel": 1,
    "DateCreated": "2016-02-09T00:38:00Z",
    "SubmissionStatusTypeID": 200
}