{
    "IsRecentlyVerified": false,
    "ID": 72509,
    "UUID": "157AF99C-7C37-4CE2-9F1A-82B299A35B33",
    "DataProviderID": 1,
    "OperatorID": 25,
    "OperatorsReference": "hackney-stamfordroad",
    "UsageTypeID": 4,
    "UsageCost": "£0.059/minute; min £1.18; other tariffs available",
    "AddressInfo": {
        "ID": 72855,
        "Title": "Stamford Road",
        "AddressLine1": "24 Stamford Road",
        "AddressLine2": "Kingsland",
        "Town": "London",
        "StateOrProvince": "England",
        "Postcode": "N1 4JL",
        "CountryID": 1,
        "Latitude": 51.5443069,
        "Longitude": -0.0769735,
        "DistanceUnit": 0
    },
    "Connections": [
        {
            "ID": 103922,
            "ConnectionTypeID": 25,
            "StatusTypeID": 50,
            "LevelID": 2,
            "Amps": 32,
            "Voltage": 230,
            "PowerKW": 7,
            "CurrentTypeID": 10,
            "Quantity": 2
        },
        {
            "ID": 103923,
            "ConnectionTypeID": 1,
            "StatusTypeID": 50,
            "LevelID": 2,
            "Amps": 16,
            "Voltage": 230,
            "PowerKW": 4,
            "CurrentTypeID": 10,
            "Quantity": 2
        }
    ],
    "NumberOfPoints": 2,
    "StatusTypeID": 50,
    "DateLastStatusUpdate": "2018-02-24T06:32:00Z",
    "DataQualityLevel": 1,
    "DateCreated": "2016-10-18T10:19:00Z",
    "SubmissionStatusTypeID": 200
}