{
    "IsRecentlyVerified": false,
    "ID": 31513,
    "UUID": "DCC5CC38-5C14-4865-96C6-525B86B74CE8",
    "DataProviderID": 26,
    "DataProvidersReference": "24171",
    "OperatorID": 78,
    "OperatorsReference": "Essent EM-CH-00002122-01-00001",
    "UsageCost": "0.00 jaarabonnement",
    "AddressInfo": {
        "ID": 31859,
        "Title": "Restoroute de la Gruyère",
        "AddressLine1": "Restoroute de la Gruyère",
        "Town": "Pont-en-Ogoz",
        "Postcode": "1648",
        "CountryID": 217,
        "Latitude": 46.683012,
        "Longitude": 7.087818,
        "RelatedURL": "http://www.essent.nl",
        "DistanceUnit": 0
    },
    "Connections": [
        {
            "ID": 35024,
            "ConnectionTypeID": 25,
            "LevelID": 2,
            "PowerKW": 11,
            "CurrentTypeID": 10
        },
        {
            "ID": 45930,
            "ConnectionTypeID": 25,
            "LevelID": 2,
            "PowerKW": 11,
            "CurrentTypeID": 10
        }
    ],
    "NumberOfPoints": 1,
    "StatusTypeID": 50,
    "DateLastStatusUpdate": "2016-06-04T02:37:00Z",
    "DataQualityLevel": 3,
    "DateCreated": "2015-01-09T06:03:00Z",
    "SubmissionStatusTypeID": 100
}