{
    "IsRecentlyVerified": false,
    "ID": 34235,
    "UUID": "B3D28972-8EB1-4DC9-A8ED-10117B793E91",
    "DataProviderID": 26,
    "DataProvidersReference": "36225",
    "OperatorID": 157,
    "OperatorsReference": "NewMotion 02008023",
    "UsageCost": "0.00 jaarabonnement",
    "AddressInfo": {
        "ID": 34581,
        "Title": "Lingedijk 10",
        "AddressLine1": "Lingedijk 10",
        "Town": "Tiel",
        "Postcode": "4001 XJ",
        "CountryID": 159,
        "Latitude": 51.890251159668,
        "Longitude": 5.42816686630249,
        "ContactTelephone1": "088 0109500",
        "RelatedURL": "http://thenewmotion.nl/",
        "DistanceUnit": 0
    },
    "Connections": [
        {
            "ID": 37746,
            "ConnectionTypeID": 25,
            "LevelID": 2,
            "PowerKW": 3.7,
            "CurrentTypeID": 10
        }
    ],
    "NumberOfPoints": 1,
    "StatusTypeID": 50,
    "DateLastStatusUpdate": "2016-06-04T02:41:00Z",
    "DataQualityLevel": 3,
    "DateCreated": "2015-01-09T06:04:00Z",
    "SubmissionStatusTypeID": 100
}