{
    "IsRecentlyVerified": false,
    "ID": 135503,
    "UUID": "8D1F5E51-A594-46AE-8C04-01737EA1E9F9",
    "DataProviderID": 1,
    "OperatorID": 85,
    "UsageTypeID": 1,
    "UsageCost": "Various rates apply depending on the type of contract",
    "AddressInfo": {
        "ID": 135849,
        "Title": "Apollon Parking",
        "AddressLine1": "Grigoriou E, 9-11",
        "AddressLine2": "Splantzia",
        "Town": "Chania",
        "StateOrProvince": "Chania Municipality",
        "Postcode": "73135",
        "CountryID": 90,
        "Latitude": 35.510984597624855,
        "Longitude": 24.021323912978005,
        "ContactTelephone1": "+30 2821 086066",
        "ContactEmail": "fortizo@fortisis.eu",
        "RelatedURL": "https://user.fortizo.gr",
        "DistanceUnit": 0
    },
    "Connections": [
        {
            "ID": 189846,
            "ConnectionTypeID": 25,
            "StatusTypeID": 50,
            "LevelID": 2,
            "Amps": 32,
            "Voltage": 400,
            "PowerKW": 22,
            "CurrentTypeID": 20,
            "Quantity": 1
        }
    ],
    "NumberOfPoints": 1,
    "StatusTypeID": 50,
    "DateLastStatusUpdate": "2019-12-24T12:15:00Z",
    "DataQualityLevel": 1,
    "DateCreated": "2019-12-23T19:50:00Z",
    "SubmissionStatusTypeID": 200
}