{
    "IsRecentlyVerified": false,
    "ID": 129775,
    "UUID": "377FAF6C-D280-4A4C-B310-CB02807AE8EC",
    "DataProviderID": 2,
    "DataProvidersReference": "133327",
    "OperatorID": 3318,
    "UsageTypeID": 1,
    "AddressInfo": {
        "ID": 130121,
        "Title": "Walmart 286 - Ennis, TX",
        "AddressLine1": "700 E Ennis Avenue",
        "Town": "Ennis",
        "StateOrProvince": "TX",
        "Postcode": "75119",
        "CountryID": 2,
        "Latitude": 32.332069,
        "Longitude": -96.620116,
        "ContactTelephone1": "833-632-2778",
        "AccessComments": "24 hours daily",
        "RelatedURL": "https://www.electrifyamerica.com/",
        "DistanceUnit": 0
    },
    "Connections": [
        {
            "ID": 181664,
            "ConnectionTypeID": 2,
            "LevelID": 3,
            "Amps": 100,
            "Voltage": 400,
            "PowerKW": 40,
            "CurrentTypeID": 30,
            "Quantity": 1
        },
        {
            "ID": 181665,
            "ConnectionTypeID": 32,
            "LevelID": 3,
            "Amps": 100,
            "Voltage": 400,
            "PowerKW": 40,
            "CurrentTypeID": 30,
            "Quantity": 1
        }
    ],
    "DateLastStatusUpdate": "2020-06-26T02:54:00Z",
    "DataQualityLevel": 3,
    "DateCreated": "2019-07-26T03:25:00Z",
    "SubmissionStatusTypeID": 100
}