{
    "IsRecentlyVerified": false,
    "ID": 88866,
    "UUID": "BC673299-015E-4544-8B4A-7D875C95DD4A",
    "DataProviderID": 1,
    "OperatorID": 23,
    "OperatorsReference": "29890",
    "UsageTypeID": 4,
    "AddressInfo": {
        "ID": 89212,
        "Title": "Cortona Inn and Suites Anaheim Resort",
        "AddressLine1": "2029 S Harbor BLVD",
        "Town": "Anaheim",
        "StateOrProvince": "California",
        "Postcode": "92802",
        "CountryID": 2,
        "Latitude": 33.798591,
        "Longitude": -117.916153,
        "ContactTelephone1": "(800) 416-7350",
        "DistanceUnit": 0
    },
    "Connections": [
        {
            "ID": 126114,
            "ConnectionTypeID": 30,
            "StatusTypeID": 50,
            "LevelID": 2,
            "PowerKW": 16,
            "CurrentTypeID": 20,
            "Quantity": 2
        }
    ],
    "NumberOfPoints": 2,
    "GeneralComments": "2 Tesla Connectors, up to 16kW.Available for customers. Please see front desk.",
    "StatusTypeID": 50,
    "DateLastStatusUpdate": "2017-06-09T15:05:00Z",
    "DataQualityLevel": 1,
    "DateCreated": "2017-06-09T15:05:00Z",
    "SubmissionStatusTypeID": 200
}