{
    "IsRecentlyVerified": false,
    "ID": 29975,
    "UUID": "17822A76-B598-4B2B-B31F-7E4A5A2C2D15",
    "DataProviderID": 15,
    "DataProvidersReference": "37561",
    "OperatorID": 5,
    "AddressInfo": {
        "ID": 30321,
        "Title": "361 Trans-Canada Highway 1",
        "AddressLine1": "361 Trans-Canada Highway 1",
        "Town": "Duncan",
        "StateOrProvince": "British Columbia",
        "Postcode": "V9L 3R7",
        "CountryID": 44,
        "Latitude": 48.7776210348989,
        "Longitude": -123.699037456877,
        "ContactTelephone1": "",
        "RelatedURL": "http://carstations.com/37561",
        "DistanceUnit": 0
    },
    "Connections": [
        {
            "ID": 32960,
            "ConnectionTypeID": 1,
            "Reference": "J1772",
            "LevelID": 2
        }
    ],
    "StatusTypeID": 0,
    "DateLastStatusUpdate": "2017-11-04T14:05:00Z",
    "DataQualityLevel": 2,
    "DateCreated": "2014-11-29T05:39:00Z",
    "SubmissionStatusTypeID": 100
}