{
    "IsRecentlyVerified": false,
    "ID": 159823,
    "UUID": "D5A8E70E-3B74-48FC-8D8E-9EEFDC9C840C",
    "DataProviderID": 2,
    "DataProvidersReference": "147210",
    "UsageTypeID": 1,
    "AddressInfo": {
        "ID": 160180,
        "Title": "Central Connecticut State University- Welte Garage",
        "AddressLine1": "39 Ella Grasso Blvd",
        "Town": "New Britain",
        "StateOrProvince": "CT",
        "Postcode": "06053",
        "CountryID": 2,
        "Latitude": 41.692299,
        "Longitude": -72.769268,
        "ContactTelephone1": "860-832-3068",
        "AccessComments": "24 hours daily",
        "RelatedURL": "",
        "DistanceUnit": 0
    },
    "Connections": [
        {
            "ID": 230042,
            "ConnectionTypeID": 1,
            "LevelID": 2,
            "Amps": 16,
            "Voltage": 230,
            "PowerKW": 3.7,
            "CurrentTypeID": 10,
            "Quantity": 3
        }
    ],
    "StatusTypeID": 50,
    "DateLastStatusUpdate": "2020-06-26T03:04:00Z",
    "DataQualityLevel": 3,
    "DateCreated": "2020-06-26T03:04:00Z",
    "SubmissionStatusTypeID": 100
}