{
    "IsRecentlyVerified": false,
    "ID": 61736,
    "UUID": "DCBCCD96-0D45-45E1-8947-65FF9B1BCB03",
    "DataProviderID": 2,
    "DataProvidersReference": "72493",
    "OperatorID": 5,
    "UsageTypeID": 1,
    "AddressInfo": {
        "ID": 62082,
        "Title": "WOOD BRIDGE 1",
        "AddressLine1": "680 Park Bridge Pkwy",
        "Town": "Alpharetta",
        "StateOrProvince": "GA",
        "Postcode": "30005",
        "CountryID": 2,
        "Latitude": 34.0644514,
        "Longitude": -84.2406983,
        "ContactTelephone1": "888-758-4389",
        "AccessComments": "24 hours daily",
        "RelatedURL": "http://www.chargepoint.com/",
        "DistanceUnit": 0
    },
    "Connections": [
        {
            "ID": 78625,
            "ConnectionTypeID": 1,
            "LevelID": 2,
            "Amps": 16,
            "Voltage": 230,
            "PowerKW": 3,
            "CurrentTypeID": 10,
            "Quantity": 2
        }
    ],
    "DateLastStatusUpdate": "2019-04-06T04:01:00Z",
    "DataQualityLevel": 3,
    "DateCreated": "2016-03-03T11:38:00Z",
    "SubmissionStatusTypeID": 100
}