{
    "UserComments": [
        {
            "ID": 17717,
            "ChargePointID": 51620,
            "CommentTypeID": 10,
            "UserName": "Nero",
            "Comment": "None iced. But couple with red LEDs - faulty",
            "Rating": 5,
            "DateCreated": "2017-09-18T00:15:45.813Z",
            "User": {
                "ID": 11655,
                "Username": "Nero"
            },
            "CheckinStatusTypeID": 10
        },
        {
            "ID": 6121,
            "ChargePointID": 51620,
            "CommentTypeID": 10,
            "UserName": "Lincsat",
            "Rating": 4,
            "DateCreated": "2015-08-04T23:17:20.883Z",
            "User": {
                "ID": 6187,
                "Username": "Lincsat"
            },
            "CheckinStatusTypeID": 10
        }
    ],
    "MediaItems": [
        {
            "ID": 2967,
            "ChargePointID": 51620,
            "ItemURL": "https://s3-ap-southeast-2.amazonaws.com/openchargemap/images/GB/OCM51620/OCM-51620.orig.2015080423053141.jpg",
            "ItemThumbnailURL": "https://s3-ap-southeast-2.amazonaws.com/openchargemap/images/GB/OCM51620/OCM-51620.thmb.2015080423053141.jpg",
            "Comment": "",
            "IsEnabled": true,
            "IsVideo": false,
            "IsFeaturedItem": false,
            "IsExternalResource": false,
            "User": {
                "ID": 6187,
                "Username": "Lincsat"
            },
            "DateCreated": "2015-08-04T23:06:00Z"
        }
    ],
    "IsRecentlyVerified": false,
    "ID": 51620,
    "UUID": "443B5B45-A44E-433E-AFA1-2FEDAF67CD00",
    "DataProviderID": 1,
    "OperatorID": 3,
    "OperatorsReference": "PG-70022,PG-80466",
    "UsageTypeID": 4,
    "UsageCost": "Free",
    "AddressInfo": {
        "ID": 51966,
        "Title": "Tesco Extra, Lincoln",
        "AddressLine1": "Wragby Road ",
        "Town": "Lincoln",
        "Postcode": "LN2 4QQ",
        "CountryID": 1,
        "Latitude": 53.2399075926642,
        "Longitude": -0.516856527567375,
        "ContactTelephone1": "0345 6102918",
        "RelatedURL": "http://www.tesco.com/store-locator/uk/?bID=4362",
        "DistanceUnit": 0
    },
    "Connections": [
        {
            "ID": 64010,
            "ConnectionTypeID": 25,
            "StatusTypeID": 50,
            "LevelID": 2,
            "Amps": 32,
            "Voltage": 230,
            "PowerKW": 7,
            "CurrentTypeID": 10,
            "Quantity": 4
        }
    ],
    "NumberOfPoints": 4,
    "GeneralComments": "2 posts each with 2x 7KW sockets. Open charge. Accepts any RFID.",
    "StatusTypeID": 50,
    "DateLastStatusUpdate": "2020-06-02T09:14:00Z",
    "DataQualityLevel": 1,
    "DateCreated": "2015-08-04T21:45:00Z",
    "SubmissionStatusTypeID": 200
}