{
    "IsRecentlyVerified": false,
    "ID": 61317,
    "UUID": "EFEFD4BD-DB65-4299-9592-B41DA2BCFF19",
    "DataProviderID": 1,
    "OperatorID": 45,
    "UsageTypeID": 1,
    "AddressInfo": {
        "ID": 61663,
        "Title": "Arbeitskreis Elektromobile Uni Bremen e.V.",
        "AddressLine1": "Hochschulring",
        "AddressLine2": "Horn-Lehe",
        "Town": "Bremen",
        "StateOrProvince": "Bremen",
        "Postcode": "28359",
        "CountryID": 87,
        "Latitude": 53.11097467645812,
        "Longitude": 8.854546583667018,
        "ContactTelephone1": "0421 218-64609",
        "AccessComments": "2 kostenlose Parkplätze 24/7 nutzbar ohne Ladekarte.",
        "RelatedURL": "http://www.aeb-ev.de/",
        "DistanceUnit": 0
    },
    "Connections": [
        {
            "ID": 78091,
            "ConnectionTypeID": 28,
            "StatusTypeID": 50,
            "LevelID": 2,
            "Amps": 16,
            "Voltage": 230,
            "PowerKW": 3.7,
            "CurrentTypeID": 10,
            "Quantity": 2
        }
    ],
    "NumberOfPoints": 2,
    "GeneralComments": "Die älteste Ladesäule in Bremen wird über eine Photovoltaikanlage auf dem Dach der Universität Bremen gespeist.",
    "StatusTypeID": 50,
    "DateLastStatusUpdate": "2016-02-24T08:35:00Z",
    "DataQualityLevel": 1,
    "DateCreated": "2016-02-24T08:35:00Z",
    "SubmissionStatusTypeID": 200
}