{
    "IsRecentlyVerified": false,
    "ID": 179837,
    "UUID": "627143E6-94F2-4AF9-8495-70883D449882",
    "DataProviderID": 29,
    "DataProvidersReference": "2311",
    "OperatorID": 155,
    "AddressInfo": {
        "ID": 180196,
        "Title": "Am Sportforum 2",
        "AddressLine1": "Am Sportforum 2",
        "Town": "Leipzig",
        "Postcode": "04105",
        "CountryID": 87,
        "Latitude": 51.34213,
        "Longitude": 12.353327,
        "DistanceUnit": 0
    },
    "Connections": [
        {
            "ID": 282187,
            "ConnectionTypeID": 28,
            "StatusTypeID": 50,
            "LevelID": 2,
            "PowerKW": 3.7,
            "CurrentTypeID": 10
        },
        {
            "ID": 282188,
            "ConnectionTypeID": 25,
            "StatusTypeID": 50,
            "LevelID": 2,
            "PowerKW": 22,
            "CurrentTypeID": 20
        },
        {
            "ID": 299177,
            "ConnectionTypeID": 28,
            "StatusTypeID": 50,
            "LevelID": 2,
            "PowerKW": 3.7,
            "CurrentTypeID": 10
        },
        {
            "ID": 299178,
            "ConnectionTypeID": 25,
            "StatusTypeID": 50,
            "LevelID": 2,
            "PowerKW": 22,
            "CurrentTypeID": 20
        }
    ],
    "StatusTypeID": 50,
    "DateLastStatusUpdate": "2021-07-12T02:47:00Z",
    "MetadataValues": [
        {
            "ID": 12131,
            "MetadataFieldID": 4,
            "ItemValue": "Data from the German chargepoint registry provided by Bundesnetzagentur.de under the CC-BY 4.0 license"
        }
    ],
    "DataQualityLevel": 3,
    "DateCreated": "2021-07-08T10:00:00Z",
    "SubmissionStatusTypeID": 100
}