{
    "IsRecentlyVerified": false,
    "ID": 119642,
    "UUID": "97465C29-D6FF-4355-8E61-2FC3459FBF5D",
    "DataProviderID": 2,
    "DataProvidersReference": "77844",
    "UsageTypeID": 2,
    "AddressInfo": {
        "ID": 119988,
        "Title": "Florida Power & Light - Gladiolus Service Center",
        "AddressLine1": "15834 Winkler Rd",
        "Town": "Fort Myers",
        "StateOrProvince": "FL",
        "Postcode": "33908",
        "CountryID": 2,
        "Latitude": 26.511358,
        "Longitude": -81.899028,
        "ContactTelephone1": "",
        "AccessComments": "Fleet use only",
        "RelatedURL": "",
        "DistanceUnit": 0
    },
    "Connections": [
        {
            "ID": 168922,
            "ConnectionTypeID": 9,
            "LevelID": 1,
            "Amps": 16,
            "Voltage": 120,
            "PowerKW": 1.9,
            "CurrentTypeID": 10,
            "Quantity": 2
        }
    ],
    "DateLastStatusUpdate": "2020-06-26T02:52:00Z",
    "DataQualityLevel": 3,
    "DateCreated": "2019-04-01T04:59:00Z",
    "SubmissionStatusTypeID": 100
}