{
    "IsRecentlyVerified": false,
    "ID": 136708,
    "UUID": "077AEDAB-F241-4697-88A3-33097E519AA8",
    "DataProviderID": 18,
    "DataProvidersReference": "d479a55e9a53f37226fbe56833e142c2",
    "OperatorID": 3345,
    "UsageTypeID": 5,
    "AddressInfo": {
        "ID": 137054,
        "Title": "64 Chelveston Road",
        "AddressLine1": "64 Chelveston Road",
        "Town": "Coventry",
        "Postcode": "CV6 1FL",
        "CountryID": 1,
        "Latitude": 52.419987,
        "Longitude": -1.544575,
        "AccessComments": "",
        "RelatedURL": "https://char.gy",
        "DistanceUnit": 0
    },
    "Connections": [
        {
            "ID": 191249,
            "ConnectionTypeID": 25,
            "Reference": "00302",
            "StatusTypeID": 50,
            "LevelID": 2,
            "Amps": 16,
            "Voltage": 230,
            "PowerKW": 3.7,
            "CurrentTypeID": 10
        }
    ],
    "StatusTypeID": 0,
    "DateLastStatusUpdate": "2019-12-24T05:23:00Z",
    "MetadataValues": [
        {
            "ID": 6560,
            "MetadataFieldID": 4,
            "ItemValue": "Contains public sector information licensed under the Open Government Licence v2.0. http://www.nationalarchives.gov.uk/doc/open-government-licence/version/2/"
        }
    ],
    "DataQualityLevel": 3,
    "DateCreated": "2019-12-24T05:23:00Z",
    "SubmissionStatusTypeID": 100
}