{
    "MediaItems": [
        {
            "ID": 18548,
            "ChargePointID": 68205,
            "ItemURL": "https://s3-ap-southeast-2.amazonaws.com/openchargemap/images/NL/OCM68205/OCM-68205.orig.2019053014374800.png",
            "ItemThumbnailURL": "https://s3-ap-southeast-2.amazonaws.com/openchargemap/images/NL/OCM68205/OCM-68205.thmb.2019053014374800.png",
            "Comment": "",
            "IsEnabled": true,
            "IsVideo": false,
            "IsFeaturedItem": false,
            "IsExternalResource": false,
            "User": {
                "ID": 21051,
                "Username": "slijkhuis"
            },
            "DateCreated": "2019-05-30T14:38:00Z"
        }
    ],
    "IsRecentlyVerified": false,
    "ID": 68205,
    "UUID": "11B28A90-B6D3-4B0C-947A-4E154EBEB037",
    "DataProviderID": 26,
    "DataProvidersReference": "90038",
    "OperatorID": 177,
    "OperatorsReference": "Nuon EVB-P1521037",
    "UsageCost": "0.00 jaarabonnement",
    "AddressInfo": {
        "ID": 68551,
        "Title": "Lumièrestraat 93",
        "AddressLine1": "Lumièrestraat 93",
        "Town": "Amsterdam",
        "Postcode": "1087 JA",
        "CountryID": 159,
        "Latitude": 52.354814,
        "Longitude": 5.002253,
        "RelatedURL": "http://www.nuon.nl/ev",
        "DistanceUnit": 0
    },
    "Connections": [
        {
            "ID": 95051,
            "ConnectionTypeID": 25,
            "LevelID": 2,
            "PowerKW": 11,
            "CurrentTypeID": 10
        },
        {
            "ID": 95052,
            "ConnectionTypeID": 25,
            "LevelID": 2,
            "PowerKW": 11,
            "CurrentTypeID": 10
        }
    ],
    "NumberOfPoints": 1,
    "StatusTypeID": 50,
    "DateLastStatusUpdate": "2019-05-30T14:38:00Z",
    "DataQualityLevel": 3,
    "DateCreated": "2016-06-04T02:37:00Z",
    "SubmissionStatusTypeID": 100
}