{
    "IsRecentlyVerified": false,
    "ID": 33830,
    "UUID": "20CEED24-1176-45EB-826E-0CD3A92F3D88",
    "DataProviderID": 26,
    "DataProvidersReference": "48758",
    "OperatorID": 178,
    "OperatorsReference": "EVnetNL REE649",
    "UsageCost": "0.00 jaarabonnement",
    "AddressInfo": {
        "ID": 34176,
        "Title": "Johanna Naber-erf 434",
        "AddressLine1": "Johanna Naber-erf 434",
        "Town": "Dordrecht",
        "Postcode": "3315 HM",
        "CountryID": 159,
        "Latitude": 51.801102,
        "Longitude": 4.732677,
        "ContactTelephone1": "0800-3522365",
        "RelatedURL": "http://www.evnet.nl",
        "DistanceUnit": 0
    },
    "Connections": [
        {
            "ID": 37341,
            "ConnectionTypeID": 25,
            "LevelID": 1,
            "PowerKW": 2.3,
            "CurrentTypeID": 10
        }
    ],
    "NumberOfPoints": 1,
    "StatusTypeID": 50,
    "DateLastStatusUpdate": "2016-06-04T02:40:00Z",
    "DataQualityLevel": 3,
    "DateCreated": "2015-01-09T06:04:00Z",
    "SubmissionStatusTypeID": 100
}