{
    "IsRecentlyVerified": false,
    "ID": 145145,
    "UUID": "7AA888BD-1D3F-49C1-A79D-B4CA229DFC6B",
    "DataProviderID": 2,
    "DataProvidersReference": "84554",
    "UsageTypeID": 2,
    "AddressInfo": {
        "ID": 145497,
        "Title": "Industrielle Alliance",
        "AddressLine1": "1080 Grande-Allee Ouest",
        "Town": "Quebec",
        "StateOrProvince": "QC",
        "Postcode": "G1S 1C7",
        "CountryID": 44,
        "Latitude": 46.7923568576317,
        "Longitude": -71.243575883606,
        "ContactTelephone1": "",
        "AccessComments": "24 hours daily; for employee use only",
        "RelatedURL": "",
        "DistanceUnit": 0
    },
    "Connections": [
        {
            "ID": 201753,
            "ConnectionTypeID": 1,
            "LevelID": 2,
            "Amps": 16,
            "Voltage": 230,
            "PowerKW": 3.7,
            "CurrentTypeID": 10,
            "Quantity": 3
        },
        {
            "ID": 201754,
            "ConnectionTypeID": 1,
            "LevelID": 2,
            "Amps": 16,
            "Voltage": 230,
            "PowerKW": 3,
            "CurrentTypeID": 10,
            "Quantity": 2
        }
    ],
    "StatusTypeID": 50,
    "DateLastStatusUpdate": "2020-06-26T03:10:00Z",
    "DataQualityLevel": 3,
    "DateCreated": "2019-12-24T09:24:00Z",
    "SubmissionStatusTypeID": 100
}