{
    "IsRecentlyVerified": false,
    "ID": 51470,
    "UUID": "FB887631-C3AD-46D2-AD85-CE671BDEAEAD",
    "DataProviderID": 1,
    "OperatorID": 45,
    "UsageTypeID": 3,
    "AddressInfo": {
        "ID": 51816,
        "Title": "Volkswagenzentrum Landshut",
        "AddressLine1": "Liebigstraße 3",
        "Town": "Landshut",
        "StateOrProvince": "Landshut",
        "Postcode": "84030",
        "CountryID": 87,
        "Latitude": 48.5504303433635,
        "Longitude": 12.1494442235566,
        "ContactTelephone1": "+49 871 709200",
        "AccessComments": "Kostenloses Laden beim Volkswagen Autohaus. Ladesäulentyp unbekannt, bei Volkswagen oft eine Wallbox mit festem Kabel mit Stecker.",
        "DistanceUnit": 0
    },
    "Connections": [
        {
            "ID": 63756,
            "ConnectionTypeID": 25,
            "StatusTypeID": 50,
            "LevelID": 2,
            "Amps": 16,
            "Voltage": 230,
            "PowerKW": 3.7,
            "CurrentTypeID": 10,
            "Quantity": 1
        }
    ],
    "NumberOfPoints": 1,
    "StatusTypeID": 50,
    "DateLastStatusUpdate": "2015-07-27T07:10:00Z",
    "DataQualityLevel": 1,
    "DateCreated": "2015-07-27T06:30:00Z",
    "SubmissionStatusTypeID": 200
}