{
    "IsRecentlyVerified": false,
    "ID": 103232,
    "UUID": "2D8030A9-DE20-41D2-9A0B-8057FD0D76A2",
    "DataProviderID": 1,
    "OperatorID": 3,
    "OperatorsReference": "PG-81856",
    "UsageTypeID": 6,
    "UsageCost": "Free",
    "AddressInfo": {
        "ID": 103578,
        "Title": "Monaghan Bros-Hyundai",
        "AddressLine1": "18 Main Street",
        "Town": "Lisnaskea",
        "Postcode": "BT92 0JB",
        "CountryID": 1,
        "Latitude": 54.256948,
        "Longitude": -7.448797,
        "DistanceUnit": 0
    },
    "Connections": [
        {
            "ID": 145847,
            "ConnectionTypeID": 25,
            "StatusTypeID": 50,
            "LevelID": 2,
            "Amps": 32,
            "Voltage": 230,
            "PowerKW": 7,
            "CurrentTypeID": 10,
            "Quantity": 2
        }
    ],
    "NumberOfPoints": 2,
    "GeneralComments": "This is an open charge unit installed at the Monaghan Bros - Hyundai dealership in Main Street, Lisnaskea",
    "StatusTypeID": 50,
    "DateLastStatusUpdate": "2018-04-25T05:34:00Z",
    "DataQualityLevel": 1,
    "DateCreated": "2018-04-25T05:34:00Z",
    "SubmissionStatusTypeID": 200
}