{
    "IsRecentlyVerified": false,
    "ID": 127411,
    "UUID": "6BC04B30-02DD-4004-9410-213597D4BA70",
    "DataProviderID": 1,
    "OperatorID": 22,
    "OperatorsReference": "C58MN",
    "UsageTypeID": 4,
    "AddressInfo": {
        "ID": 127757,
        "Title": "Public Car Park",
        "AddressLine1": "The Green",
        "Town": "Midleton",
        "StateOrProvince": "County Cork",
        "CountryID": 3,
        "Latitude": 51.917189,
        "Longitude": -8.174142,
        "DistanceUnit": 0
    },
    "Connections": [
        {
            "ID": 178382,
            "ConnectionTypeID": 25,
            "StatusTypeID": 50,
            "LevelID": 2,
            "Amps": 32,
            "Voltage": 400,
            "PowerKW": 22,
            "CurrentTypeID": 20,
            "Quantity": 2
        }
    ],
    "NumberOfPoints": 2,
    "StatusTypeID": 50,
    "DateLastStatusUpdate": "2019-06-26T05:30:00Z",
    "DataQualityLevel": 1,
    "DateCreated": "2019-06-03T09:45:00Z",
    "SubmissionStatusTypeID": 200
}