{
    "IsRecentlyVerified": false,
    "ID": 18034,
    "UUID": "F8BB8284-8514-496E-8C89-F7771B4CA38C",
    "DataProviderID": 22,
    "DataProvidersReference": "4177C98DD1E8E9E27BC125670D1200DB",
    "AddressInfo": {
        "ID": 18379,
        "Title": "九州三菱久留米支店・クリーンカー久留米",
        "AddressLine1": "福岡県久留米市藤山町1754-1",
        "CountryID": 114,
        "Latitude": 33.27021801,
        "Longitude": 130.5386013,
        "ContactTelephone1": "0942-22-0361",
        "DistanceUnit": 0
    },
    "Connections": [
        {
            "ID": 18275,
            "ConnectionTypeID": 2,
            "LevelID": 2,
            "Amps": 100,
            "Voltage": 480,
            "PowerKW": 48,
            "Quantity": 1
        }
    ],
    "DateLastStatusUpdate": "2013-06-29T09:06:00Z",
    "DataQualityLevel": 2,
    "DateCreated": "2013-06-29T09:06:00Z",
    "SubmissionStatusTypeID": 200
}