{
    "IsRecentlyVerified": false,
    "ID": 114349,
    "UUID": "4C8B0483-5A08-485A-8B7B-7C7BE97900F7",
    "DataProviderID": 1,
    "OperatorID": 3259,
    "UsageTypeID": 1,
    "AddressInfo": {
        "ID": 114695,
        "Title": "ZSE Max Trenčín",
        "AddressLine1": "Max Trenčín",
        "Town": " Trenčín",
        "Postcode": "91164",
        "CountryID": 204,
        "Latitude": 48.8903676230977,
        "Longitude": 18.0574173665162,
        "DistanceUnit": 0
    },
    "Connections": [
        {
            "ID": 160960,
            "ConnectionTypeID": 2,
            "StatusTypeID": 50,
            "LevelID": 3,
            "PowerKW": 50,
            "CurrentTypeID": 30,
            "Quantity": 1
        },
        {
            "ID": 160961,
            "ConnectionTypeID": 33,
            "StatusTypeID": 50,
            "LevelID": 3,
            "PowerKW": 50,
            "CurrentTypeID": 30,
            "Quantity": 1
        },
        {
            "ID": 160962,
            "ConnectionTypeID": 1036,
            "StatusTypeID": 50,
            "LevelID": 3,
            "Amps": 63,
            "Voltage": 400,
            "PowerKW": 43,
            "CurrentTypeID": 20,
            "Quantity": 1
        }
    ],
    "NumberOfPoints": 1,
    "GeneralComments": "Description/Popis DC: 1xCHAdeMO, 1xCombo 50 kW , AC: 1xTyp-2 43 kW",
    "StatusTypeID": 50,
    "DateLastStatusUpdate": "2019-01-06T11:00:00Z",
    "DataQualityLevel": 1,
    "DateCreated": "2019-01-06T09:37:00Z",
    "SubmissionStatusTypeID": 200
}