{
    "IsRecentlyVerified": false,
    "ID": 122914,
    "UUID": "DCBACBBB-5704-4E08-B865-95F9708033CA",
    "DataProviderID": 2,
    "DataProvidersReference": "86173",
    "UsageTypeID": 2,
    "AddressInfo": {
        "ID": 123260,
        "Title": "Duke Energy",
        "AddressLine1": "1423 McNeill Way",
        "Town": "Aberdeen",
        "StateOrProvince": "NC",
        "Postcode": "28315",
        "CountryID": 2,
        "Latitude": 35.142517,
        "Longitude": -79.45406,
        "ContactTelephone1": "",
        "AccessComments": "Fleet vehicles only",
        "RelatedURL": "",
        "DistanceUnit": 0
    },
    "Connections": [
        {
            "ID": 172842,
            "ConnectionTypeID": 1,
            "LevelID": 2,
            "Amps": 16,
            "Voltage": 230,
            "PowerKW": 3.7,
            "CurrentTypeID": 10,
            "Quantity": 4
        }
    ],
    "DateLastStatusUpdate": "2020-06-26T02:57:00Z",
    "DataQualityLevel": 3,
    "DateCreated": "2019-04-06T05:03:00Z",
    "SubmissionStatusTypeID": 100
}