{
    "IsRecentlyVerified": false,
    "ID": 90400,
    "UUID": "B40234B6-1792-4DF7-A949-EA775AA6AD9F",
    "DataProviderID": 1,
    "OperatorID": 23,
    "OperatorsReference": "31275",
    "UsageTypeID": 4,
    "AddressInfo": {
        "ID": 90746,
        "Title": "Country Inn & Suites By Carlson, Roanoke, Va",
        "AddressLine1": "7860 Plantation RD",
        "Town": "Roanoke",
        "StateOrProvince": "Virginia",
        "Postcode": "24019",
        "CountryID": 2,
        "Latitude": 37.354562,
        "Longitude": -79.956722,
        "ContactTelephone1": "(540) 366-5678",
        "DistanceUnit": 0
    },
    "Connections": [
        {
            "ID": 128053,
            "ConnectionTypeID": 30,
            "StatusTypeID": 50,
            "LevelID": 2,
            "PowerKW": 13,
            "CurrentTypeID": 20,
            "Quantity": 4
        }
    ],
    "NumberOfPoints": 4,
    "GeneralComments": "4 Tesla Connectors, up to 13kW.Available for customers. Please see front desk.",
    "StatusTypeID": 50,
    "DateLastStatusUpdate": "2017-07-13T15:09:00Z",
    "DataQualityLevel": 1,
    "DateCreated": "2017-07-13T15:09:00Z",
    "SubmissionStatusTypeID": 200
}