{
    "IsRecentlyVerified": false,
    "ID": 30995,
    "UUID": "A83B8EF6-A5C4-4B51-BF72-D7D85100C2D1",
    "DataProviderID": 1,
    "DataProvidersReference": "2076",
    "OperatorID": 1,
    "AddressInfo": {
        "ID": 31341,
        "Title": "Amfi Surnadal",
        "AddressLine1": "Øravegen 4",
        "Town": "SURNADAL",
        "StateOrProvince": "Møre og Romsdal",
        "Postcode": "6650",
        "CountryID": 168,
        "Latitude": 62.97002,
        "Longitude": 8.71288,
        "AccessComments": "Bak Amfi Surnadal",
        "DistanceUnit": 0
    },
    "Connections": [
        {
            "ID": 34224,
            "ConnectionTypeID": 33,
            "Reference": "1",
            "StatusTypeID": 50,
            "LevelID": 3,
            "Amps": 100,
            "Voltage": 500,
            "PowerKW": 50,
            "CurrentTypeID": 30,
            "Comments": "Mode 4"
        },
        {
            "ID": 89346,
            "ConnectionTypeID": 2,
            "Reference": "2",
            "StatusTypeID": 50,
            "LevelID": 2,
            "Amps": 100,
            "Voltage": 500,
            "PowerKW": 50,
            "Comments": "Mode 4"
        },
        {
            "ID": 102665,
            "ConnectionTypeID": 25,
            "Reference": "3",
            "StatusTypeID": 50,
            "LevelID": 2,
            "Amps": 32,
            "Voltage": 400,
            "PowerKW": 22,
            "CurrentTypeID": 20,
            "Quantity": 2,
            "Comments": "Mode 3"
        }
    ],
    "NumberOfPoints": 4,
    "DateLastStatusUpdate": "2020-08-27T18:49:00Z",
    "DataQualityLevel": 2,
    "DateCreated": "2014-12-09T09:01:00Z",
    "SubmissionStatusTypeID": 100
}