{
    "IsRecentlyVerified": false,
    "ID": 118271,
    "UUID": "2E78E3B3-6D8A-4FA7-9FBB-DBC69A833591",
    "DataProviderID": 1,
    "OperatorID": 80,
    "UsageTypeID": 4,
    "AddressInfo": {
        "ID": 118617,
        "Title": "Castel San Giovanni Maestri del Lavoro | EnelX",
        "AddressLine1": "Via Maestri del Lavoro",
        "Town": "Castel San Giovanni",
        "StateOrProvince": "PC",
        "Postcode": "29015",
        "CountryID": 112,
        "Latitude": 45.07101674807507,
        "Longitude": 9.446272820810464,
        "ContactTelephone1": "800.069.850",
        "RelatedURL": "https://www.enelx.com/it/it/emobility",
        "DistanceUnit": 0
    },
    "Connections": [
        {
            "ID": 167346,
            "ConnectionTypeID": 25,
            "StatusTypeID": 50,
            "LevelID": 2,
            "Amps": 32,
            "Voltage": 400,
            "PowerKW": 22,
            "CurrentTypeID": 20,
            "Quantity": 2
        }
    ],
    "NumberOfPoints": 2,
    "StatusTypeID": 50,
    "DateLastStatusUpdate": "2019-03-20T17:12:00Z",
    "DataQualityLevel": 1,
    "DateCreated": "2019-03-20T17:12:00Z",
    "SubmissionStatusTypeID": 200
}