{
    "MediaItems": [
        {
            "ID": 12220,
            "ChargePointID": 87942,
            "ItemURL": "https://s3-ap-southeast-2.amazonaws.com/openchargemap/images/NZ/OCM87942/OCM-87942.orig.2017051809251960.jpg",
            "ItemThumbnailURL": "https://s3-ap-southeast-2.amazonaws.com/openchargemap/images/NZ/OCM87942/OCM-87942.thmb.2017051809251960.jpg",
            "Comment": "",
            "IsEnabled": true,
            "IsVideo": false,
            "IsFeaturedItem": false,
            "IsExternalResource": false,
            "User": {
                "ID": 15365,
                "Username": "sliday"
            },
            "DateCreated": "2017-05-18T09:26:00Z"
        },
        {
            "ID": 12219,
            "ChargePointID": 87942,
            "ItemURL": "https://s3-ap-southeast-2.amazonaws.com/openchargemap/images/NZ/OCM87942/OCM-87942.orig.2017051809250803.jpg",
            "ItemThumbnailURL": "https://s3-ap-southeast-2.amazonaws.com/openchargemap/images/NZ/OCM87942/OCM-87942.thmb.2017051809250803.jpg",
            "Comment": "",
            "IsEnabled": true,
            "IsVideo": false,
            "IsFeaturedItem": false,
            "IsExternalResource": false,
            "User": {
                "ID": 15365,
                "Username": "sliday"
            },
            "DateCreated": "2017-05-18T09:25:00Z"
        }
    ],
    "IsRecentlyVerified": false,
    "ID": 87942,
    "UUID": "F804510E-D2F5-4130-A5D7-E842EAF6824E",
    "DataProviderID": 1,
    "UsageCost": "$2/hr",
    "AddressInfo": {
        "ID": 88288,
        "Title": "Whakapapa Holiday Park",
        "AddressLine1": "State Highway 48",
        "Town": "Whakapapa Village ",
        "Postcode": "4691",
        "CountryID": 161,
        "Latitude": -39.20506797834158,
        "Longitude": 175.54137245116056,
        "ContactTelephone1": "078923897",
        "DistanceUnit": 0
    },
    "Connections": [
        {
            "ID": 124757,
            "ConnectionTypeID": 4
        }
    ],
    "NumberOfPoints": 1,
    "GeneralComments": "$2/hr daytime, or $21 per 24 hours\r\nSites available 24/7 but reception open 8am-6pm\r\nRecharge at one of our 40+ powered sites, while you walk, ski or snowboard, visit the café, or sleep overnight in one of our cabins or nearby at the Chateau or Skotel. We can also arrange your Tongariro Alpine Crossing trips! Visit http://whakapapa.net.nz and contact Terry on whakapapaholpark@xtra.co.nz",
    "StatusTypeID": 50,
    "DateLastStatusUpdate": "2017-05-18T09:26:00Z",
    "DataQualityLevel": 1,
    "DateCreated": "2017-05-18T09:25:00Z",
    "SubmissionStatusTypeID": 200
}