{
    "IsRecentlyVerified": false,
    "ID": 2913,
    "UUID": "680D1A6B-2010-4053-9DD6-116B69BA47F4",
    "DataProviderID": 2,
    "DataProvidersReference": "35841",
    "UsageTypeID": 1,
    "AddressInfo": {
        "ID": 2914,
        "Title": "Kum & Go #570",
        "AddressLine1": "5800 Northglenn Dr",
        "Town": "Johnston",
        "StateOrProvince": "IA",
        "Postcode": "50131",
        "CountryID": 2,
        "Latitude": 41.682385,
        "Longitude": -93.698315,
        "ContactTelephone1": "515-276-1730",
        "AccessComments": "24 hours daily",
        "RelatedURL": "",
        "DistanceUnit": 0
    },
    "Connections": [
        {
            "ID": 15333,
            "ConnectionTypeID": 1,
            "LevelID": 2,
            "Amps": 16,
            "Voltage": 230,
            "PowerKW": 3.7,
            "CurrentTypeID": 10,
            "Quantity": 1
        },
        {
            "ID": 20311,
            "ConnectionTypeID": 1,
            "LevelID": 2,
            "Quantity": 1
        }
    ],
    "DateLastConfirmed": "2011-09-25T00:00:00Z",
    "StatusTypeID": 0,
    "DateLastStatusUpdate": "2020-06-26T03:04:00Z",
    "DataQualityLevel": 1,
    "DateCreated": "2011-02-28T00:00:00Z",
    "SubmissionStatusTypeID": 100
}