{
    "IsRecentlyVerified": false,
    "ID": 163025,
    "UUID": "D836EC5F-8082-4391-ADBF-66212AC49E06",
    "DataProviderID": 1,
    "OperatorID": 21,
    "UsageTypeID": 4,
    "UsageCost": "Mobi.E compatible card",
    "AddressInfo": {
        "ID": 163382,
        "Title": "LSB-01539",
        "AddressLine1": "Avenida Professor Egas Moniz",
        "Town": "Lisbon",
        "StateOrProvince": "Lisboa",
        "Postcode": "1600",
        "CountryID": 180,
        "Latitude": 38.750381248672426,
        "Longitude": -9.159552828332721,
        "AccessComments": "Paid parking",
        "DistanceUnit": 0
    },
    "Connections": [
        {
            "ID": 234577,
            "ConnectionTypeID": 25,
            "StatusTypeID": 50,
            "LevelID": 2,
            "Amps": 16,
            "Voltage": 230,
            "PowerKW": 3.7,
            "CurrentTypeID": 10,
            "Quantity": 2
        }
    ],
    "NumberOfPoints": 2,
    "StatusTypeID": 50,
    "DateLastStatusUpdate": "2020-08-19T12:18:00Z",
    "DataQualityLevel": 1,
    "DateCreated": "2020-08-19T12:17:00Z",
    "SubmissionStatusTypeID": 200
}