{
    "IsRecentlyVerified": false,
    "ID": 56797,
    "UUID": "E371E33C-4089-4E1C-B4D2-4C55E21F6BF9",
    "DataProviderID": 1,
    "OperatorID": 45,
    "UsageTypeID": 1,
    "UsageCost": "0",
    "AddressInfo": {
        "ID": 57143,
        "Title": "Westpark Einkaufszentrum",
        "AddressLine1": "Am Westpark 8",
        "Town": "Ingolstadt",
        "StateOrProvince": "Ingolstadt",
        "Postcode": "85057",
        "CountryID": 87,
        "Latitude": 48.775956251972,
        "Longitude": 11.389095187835645,
        "AccessComments": "Auf dem oberen Parkdeck hinter dem McDonalds. Geöffnet von Mo-Sa 9:30-20Uhr, danach verschlossen.",
        "DistanceUnit": 0
    },
    "Connections": [
        {
            "ID": 71653,
            "ConnectionTypeID": 25,
            "StatusTypeID": 50,
            "LevelID": 2,
            "Amps": 16,
            "Voltage": 400,
            "PowerKW": 11,
            "CurrentTypeID": 20,
            "Quantity": 6
        }
    ],
    "NumberOfPoints": 6,
    "StatusTypeID": 50,
    "DateLastStatusUpdate": "2015-11-10T08:10:00Z",
    "DataQualityLevel": 1,
    "DateCreated": "2015-11-10T08:10:00Z",
    "SubmissionStatusTypeID": 200
}