{
    "UserComments": [
        {
            "ID": 21101,
            "ChargePointID": 106527,
            "CommentTypeID": 10,
            "UserName": "ForumElettrico.it",
            "RelatedURL": "https://www.forumelettrico.it/forum/colonnine-enel-quick-a-san-fior-t3449.html",
            "DateCreated": "2019-06-11T15:58:58.807Z",
            "User": {
                "ID": 11749,
                "Username": "ForumElettrico.it"
            },
            "CheckinStatusTypeID": 10
        }
    ],
    "MediaItems": [
        {
            "ID": 18629,
            "ChargePointID": 106527,
            "ItemURL": "https://s3-ap-southeast-2.amazonaws.com/openchargemap/images/IT/OCM106527/OCM-106527.orig.2019061115591072.jpg",
            "ItemThumbnailURL": "https://s3-ap-southeast-2.amazonaws.com/openchargemap/images/IT/OCM106527/OCM-106527.thmb.2019061115591072.jpg",
            "Comment": "",
            "IsEnabled": true,
            "IsVideo": false,
            "IsFeaturedItem": false,
            "IsExternalResource": false,
            "User": {
                "ID": 11749,
                "Username": "ForumElettrico.it"
            },
            "DateCreated": "2019-06-11T15:59:00Z"
        },
        {
            "ID": 18630,
            "ChargePointID": 106527,
            "ItemURL": "https://s3-ap-southeast-2.amazonaws.com/openchargemap/images/IT/OCM106527/OCM-106527.orig.2019061115591769.jpg",
            "ItemThumbnailURL": "https://s3-ap-southeast-2.amazonaws.com/openchargemap/images/IT/OCM106527/OCM-106527.thmb.2019061115591769.jpg",
            "Comment": "",
            "IsEnabled": true,
            "IsVideo": false,
            "IsFeaturedItem": false,
            "IsExternalResource": false,
            "User": {
                "ID": 11749,
                "Username": "ForumElettrico.it"
            },
            "DateCreated": "2019-06-11T15:59:00Z"
        }
    ],
    "IsRecentlyVerified": false,
    "ID": 106527,
    "UUID": "C3BA50D3-31D6-4ECA-B4DE-C36076EFFB77",
    "DataProviderID": 1,
    "OperatorID": 80,
    "UsageTypeID": 1,
    "AddressInfo": {
        "ID": 106873,
        "Title": "EnelX San Fior",
        "AddressLine1": "Via Nazionale",
        "Town": "San Fior",
        "StateOrProvince": "TV",
        "Postcode": "31020 ",
        "CountryID": 112,
        "Latitude": 45.90275108614266,
        "Longitude": 12.334083080568917,
        "RelatedURL": "https://www.enelx.com/it/it/emobility",
        "DistanceUnit": 0
    },
    "Connections": [
        {
            "ID": 149906,
            "ConnectionTypeID": 25,
            "StatusTypeID": 50,
            "LevelID": 2,
            "Amps": 32,
            "Voltage": 400,
            "PowerKW": 22,
            "CurrentTypeID": 20,
            "Quantity": 5
        },
        {
            "ID": 149907,
            "ConnectionTypeID": 36,
            "StatusTypeID": 50,
            "LevelID": 2,
            "Amps": 16,
            "Voltage": 240,
            "PowerKW": 3,
            "CurrentTypeID": 10,
            "Quantity": 5
        }
    ],
    "NumberOfPoints": 10,
    "StatusTypeID": 50,
    "DateLastStatusUpdate": "2019-06-11T15:59:00Z",
    "DataQualityLevel": 1,
    "DateCreated": "2018-06-23T16:06:00Z",
    "SubmissionStatusTypeID": 200
}