{
    "IsRecentlyVerified": false,
    "ID": 57287,
    "UUID": "B6C03E53-E6C8-43A7-B60E-74B848B12F05",
    "DataProviderID": 1,
    "OperatorID": 23,
    "OperatorsReference": "9282",
    "UsageTypeID": 1,
    "UsageCost": "Free",
    "AddressInfo": {
        "ID": 57633,
        "Title": "The Inn at Onancock - Tesla",
        "AddressLine1": "30 North St",
        "Town": "Onancock",
        "StateOrProvince": "VA",
        "Postcode": "23417",
        "CountryID": 2,
        "Latitude": 37.7138577,
        "Longitude": -75.7473399,
        "ContactTelephone1": "757-789-7711  877-798-3752",
        "AccessComments": "24 hours daily; for Tesla use only; for guest use only; see front desk for access",
        "RelatedURL": "http://www.teslamotors.com/supercharger",
        "DistanceUnit": 0
    },
    "Connections": [
        {
            "ID": 72386,
            "ConnectionTypeID": 30,
            "StatusTypeID": 50,
            "LevelID": 2,
            "Amps": 16,
            "Voltage": 230,
            "PowerKW": 16,
            "CurrentTypeID": 10,
            "Quantity": 1
        }
    ],
    "NumberOfPoints": 1,
    "StatusTypeID": 50,
    "DateLastStatusUpdate": "2017-01-26T14:40:00Z",
    "DataQualityLevel": 3,
    "DateCreated": "2015-11-30T11:50:00Z",
    "SubmissionStatusTypeID": 100
}