{
    "MediaItems": [
        {
            "ID": 12312,
            "ChargePointID": 88117,
            "ItemURL": "https://s3-ap-southeast-2.amazonaws.com/openchargemap/images/NZ/OCM88117/OCM-88117.orig.2017052209394574.jpg",
            "ItemThumbnailURL": "https://s3-ap-southeast-2.amazonaws.com/openchargemap/images/NZ/OCM88117/OCM-88117.thmb.2017052209394574.jpg",
            "Comment": "",
            "IsEnabled": true,
            "IsVideo": false,
            "IsFeaturedItem": false,
            "IsExternalResource": false,
            "User": {
                "ID": 15365,
                "Username": "sliday"
            },
            "DateCreated": "2017-05-22T09:40:00Z"
        }
    ],
    "IsRecentlyVerified": false,
    "ID": 88117,
    "UUID": "CE890B85-9CBE-4360-8C19-08C87A77161B",
    "DataProviderID": 1,
    "AddressInfo": {
        "ID": 88463,
        "Title": "Espresso Rescue",
        "AddressLine1": "399 Hutt Road",
        "Town": "Wellington, Alicetown‎",
        "Postcode": "5012",
        "CountryID": 161,
        "Latitude": -41.2171863758751,
        "Longitude": 174.882229492031,
        "ContactTelephone1": "(021) 247-0321",
        "DistanceUnit": 0
    },
    "Connections": [
        {
            "ID": 124998,
            "ConnectionTypeID": 29,
            "StatusTypeID": 50,
            "LevelID": 1,
            "Amps": 10,
            "Voltage": 230,
            "PowerKW": 2.3,
            "CurrentTypeID": 10,
            "Quantity": 1
        }
    ],
    "NumberOfPoints": 1,
    "GeneralComments": "Mon-Fri 7am-noon\r\nGrab a coffee and give your car a sip of juice at the same time. Thanks to owner, Conrad.",
    "StatusTypeID": 50,
    "DateLastStatusUpdate": "2017-05-22T11:18:00Z",
    "DataQualityLevel": 1,
    "DateCreated": "2017-05-22T09:40:00Z",
    "SubmissionStatusTypeID": 200
}