{
    "IsRecentlyVerified": false,
    "ID": 75616,
    "UUID": "14ACD303-E674-4D89-A6EB-F52E85897F0A",
    "DataProviderID": 1,
    "OperatorID": 142,
    "OperatorsReference": "3345159",
    "UsageTypeID": 4,
    "AddressInfo": {
        "ID": 75962,
        "Title": "Spar Siemensstraße",
        "AddressLine1": "Siemensstraße 105",
        "Town": "Wien",
        "Postcode": "1210",
        "CountryID": 19,
        "Latitude": 48.2669894,
        "Longitude": 16.4288486,
        "DistanceUnit": 0
    },
    "Connections": [
        {
            "ID": 109029,
            "ConnectionTypeID": 25,
            "StatusTypeID": 50,
            "LevelID": 2,
            "Amps": 16,
            "Voltage": 400,
            "PowerKW": 11,
            "CurrentTypeID": 20,
            "Quantity": 2
        },
        {
            "ID": 109030,
            "ConnectionTypeID": 28,
            "StatusTypeID": 50,
            "LevelID": 2,
            "Amps": 16,
            "Voltage": 230,
            "PowerKW": 4,
            "CurrentTypeID": 10,
            "Quantity": 2
        }
    ],
    "NumberOfPoints": 2,
    "GeneralComments": "Wien Energie Tanke-Karte; WienMobil-Karte",
    "StatusTypeID": 50,
    "DateLastStatusUpdate": "2016-12-16T20:01:00Z",
    "DataQualityLevel": 1,
    "DateCreated": "2016-12-16T20:01:00Z",
    "SubmissionStatusTypeID": 200
}