{
    "IsRecentlyVerified": false,
    "ID": 104430,
    "UUID": "C047CC65-FCB7-46DE-8552-D47C2A7127BE",
    "DataProviderID": 1,
    "OperatorID": 23,
    "OperatorsReference": "43203",
    "UsageTypeID": 4,
    "AddressInfo": {
        "ID": 104776,
        "Title": "Hotel Krallerhof",
        "AddressLine1": "Rain 6",
        "Town": "Leogang",
        "Postcode": "5771",
        "CountryID": 19,
        "Latitude": 47.438042,
        "Longitude": 12.735936,
        "ContactTelephone1": "+43 6583 8246",
        "DistanceUnit": 0
    },
    "Connections": [
        {
            "ID": 147425,
            "ConnectionTypeID": 30,
            "StatusTypeID": 50,
            "LevelID": 2,
            "Amps": 32,
            "Voltage": 400,
            "PowerKW": 22,
            "CurrentTypeID": 20,
            "Quantity": 2
        }
    ],
    "NumberOfPoints": 2,
    "GeneralComments": "2 Tesla Connectors, up to 22kW.Available for customers. Please see front desk.",
    "StatusTypeID": 50,
    "DateLastStatusUpdate": "2018-10-03T20:31:00Z",
    "DataQualityLevel": 1,
    "DateCreated": "2018-05-20T05:35:00Z",
    "SubmissionStatusTypeID": 200
}