{
    "IsRecentlyVerified": false,
    "ID": 105725,
    "UUID": "30DD0893-90B4-41E4-933F-57D279EB5E01",
    "DataProviderID": 2,
    "DataProvidersReference": "98598",
    "OperatorID": 5,
    "UsageTypeID": 1,
    "AddressInfo": {
        "ID": 106071,
        "Title": "ROSEVILLE",
        "AddressLine1": "1545 Pleasant Grove Blvd",
        "Town": "Roseville",
        "StateOrProvince": "CA",
        "Postcode": "95747",
        "CountryID": 2,
        "Latitude": 38.7679735,
        "Longitude": -121.3315015,
        "ContactTelephone1": "888-758-4389",
        "AccessComments": "24 hours daily",
        "RelatedURL": "http://www.chargepoint.com/",
        "DistanceUnit": 0
    },
    "Connections": [
        {
            "ID": 148920,
            "ConnectionTypeID": 1,
            "LevelID": 2,
            "Amps": 16,
            "Voltage": 230,
            "PowerKW": 3,
            "CurrentTypeID": 10,
            "Quantity": 2
        }
    ],
    "DateLastStatusUpdate": "2019-12-24T09:15:00Z",
    "DataQualityLevel": 3,
    "DateCreated": "2018-06-09T04:01:00Z",
    "SubmissionStatusTypeID": 100
}