{
    "UserComments": [
        {
            "ID": 13986,
            "ChargePointID": 46717,
            "CommentTypeID": 10,
            "UserName": "Csernátony Csaba",
            "Comment": "Príma töltő. 32 perc alatt több mint 8,9 Kwh  32 perc alatt 2016. 08. 06. Nissan e-NV200.",
            "Rating": 5,
            "DateCreated": "2016-08-06T11:01:55.31Z",
            "User": {
                "ID": 11688,
                "Username": "Csernátony Csaba"
            },
            "CheckinStatusTypeID": 10
        },
        {
            "ID": 4585,
            "ChargePointID": 46717,
            "CommentTypeID": 10,
            "UserName": "tibor.antaloczy",
            "Comment": "",
            "DateCreated": "2015-05-29T16:53:32.32Z",
            "User": {
                "ID": 4438,
                "Username": "tibor.antaloczy"
            },
            "CheckinStatusTypeID": 10
        },
        {
            "ID": 4348,
            "ChargePointID": 46717,
            "CommentTypeID": 10,
            "UserName": "tibor.antaloczy",
            "Rating": 5,
            "DateCreated": "2015-05-03T21:40:00.89Z",
            "User": {
                "ID": 4438,
                "Username": "tibor.antaloczy"
            },
            "CheckinStatusTypeID": 10
        }
    ],
    "MediaItems": [
        {
            "ID": 1280,
            "ChargePointID": 46717,
            "ItemURL": "https://s3-ap-southeast-2.amazonaws.com/openchargemap/images/HU/OCM46717/OCM-46717.orig.2015050321393595.jpg",
            "ItemThumbnailURL": "https://s3-ap-southeast-2.amazonaws.com/openchargemap/images/HU/OCM46717/OCM-46717.thmb.2015050321393595.jpg",
            "Comment": "",
            "IsEnabled": true,
            "IsVideo": false,
            "IsFeaturedItem": false,
            "IsExternalResource": false,
            "User": {
                "ID": 4438,
                "Username": "tibor.antaloczy"
            },
            "DateCreated": "2015-05-03T21:40:00Z"
        },
        {
            "ID": 1279,
            "ChargePointID": 46717,
            "ItemURL": "https://s3-ap-southeast-2.amazonaws.com/openchargemap/images/HU/OCM46717/OCM-46717.orig.2015050321390751.jpg",
            "ItemThumbnailURL": "https://s3-ap-southeast-2.amazonaws.com/openchargemap/images/HU/OCM46717/OCM-46717.thmb.2015050321390751.jpg",
            "Comment": "",
            "IsEnabled": true,
            "IsVideo": false,
            "IsFeaturedItem": false,
            "IsExternalResource": false,
            "User": {
                "ID": 4438,
                "Username": "tibor.antaloczy"
            },
            "DateCreated": "2015-05-03T21:39:00Z"
        }
    ],
    "IsRecentlyVerified": false,
    "ID": 46717,
    "UUID": "1757BED4-D551-4D53-9F9C-D2DCB2488DF3",
    "DataProviderID": 1,
    "OperatorID": 45,
    "UsageTypeID": 1,
    "UsageCost": "free",
    "AddressInfo": {
        "ID": 47063,
        "Title": "Mogyoród, Hungaroring, Tanpálya",
        "AddressLine1": "Hungaroring út 10.",
        "Town": "Mogyoród",
        "StateOrProvince": "Pest megye",
        "Postcode": "2146",
        "CountryID": 104,
        "Latitude": 47.5860735981356,
        "Longitude": 19.2517943857708,
        "AccessComments": "A töltőoszlop a Hungaroringen a versenypályán belül lévő tanpálya parkolójában áll, ahova normál esetben a nap 24 órájában be lehet jutni, de versenyek és egyéb zárt rendezvények alatt a hozzáférést korlátozhatják. / Charging station is located inside the race track. It is normally available 24/7, but access is restricted during races and other closed events.",
        "DistanceUnit": 0
    },
    "Connections": [
        {
            "ID": 57390,
            "ConnectionTypeID": 2,
            "StatusTypeID": 50,
            "LevelID": 3,
            "Amps": 110,
            "Voltage": 400,
            "PowerKW": 44,
            "CurrentTypeID": 30,
            "Quantity": 1
        }
    ],
    "NumberOfPoints": 1,
    "GeneralComments": "DBT (Nissan) töltő",
    "StatusTypeID": 50,
    "DateLastStatusUpdate": "2016-12-31T09:30:00Z",
    "DataQualityLevel": 1,
    "DateCreated": "2015-05-03T21:38:00Z",
    "SubmissionStatusTypeID": 200
}