{
    "IsRecentlyVerified": false,
    "ID": 118701,
    "UUID": "4F81C4B6-9906-4A8A-A480-153A5DB08679",
    "DataProviderID": 1,
    "OperatorID": 164,
    "UsageTypeID": 4,
    "AddressInfo": {
        "ID": 119047,
        "Title": "Marlengo Fast  | Neogy",
        "AddressLine1": "Via Franz Innerhofer, 2",
        "Town": "Marlengo",
        "StateOrProvince": "BZ",
        "Postcode": "39020",
        "CountryID": 112,
        "Latitude": 46.6556168185238,
        "Longitude": 11.1409078101874,
        "DistanceUnit": 0
    },
    "Connections": [
        {
            "ID": 167892,
            "ConnectionTypeID": 2,
            "StatusTypeID": 50,
            "LevelID": 3,
            "PowerKW": 50,
            "CurrentTypeID": 30,
            "Quantity": 1
        },
        {
            "ID": 167893,
            "ConnectionTypeID": 33,
            "StatusTypeID": 50,
            "LevelID": 3,
            "PowerKW": 50,
            "CurrentTypeID": 30,
            "Quantity": 1
        },
        {
            "ID": 167894,
            "ConnectionTypeID": 1036,
            "StatusTypeID": 50,
            "LevelID": 3,
            "Amps": 64,
            "Voltage": 400,
            "PowerKW": 43,
            "CurrentTypeID": 20,
            "Quantity": 1
        }
    ],
    "NumberOfPoints": 2,
    "StatusTypeID": 50,
    "DateLastStatusUpdate": "2019-07-14T16:54:00Z",
    "DataQualityLevel": 1,
    "DateCreated": "2019-03-29T17:31:00Z",
    "SubmissionStatusTypeID": 200
}