{
    "IsRecentlyVerified": false,
    "ID": 105541,
    "UUID": "1B6CA0CC-7451-47A5-A4E1-CE1188679698",
    "DataProviderID": 1,
    "OperatorID": 23,
    "OperatorsReference": "44139",
    "UsageTypeID": 6,
    "AddressInfo": {
        "ID": 105887,
        "Title": "Hotel Eurosol Alcanena",
        "AddressLine1": "Rua José Afonso",
        "Town": "Hotel Eurosol Alcanena",
        "StateOrProvince": "Alcanena",
        "Postcode": "2380-092",
        "CountryID": 180,
        "Latitude": 39.456609,
        "Longitude": -8.667788,
        "ContactTelephone1": "+351 249 887 300",
        "AccessComments": "Only for customers",
        "DistanceUnit": 0
    },
    "Connections": [
        {
            "ID": 148723,
            "ConnectionTypeID": 30,
            "StatusTypeID": 50,
            "LevelID": 2,
            "Amps": 16,
            "Voltage": 400,
            "PowerKW": 11,
            "CurrentTypeID": 20,
            "Quantity": 1
        }
    ],
    "NumberOfPoints": 1,
    "GeneralComments": "1 Tesla Connector, up to 11kW.Available for customers. Please see front desk.",
    "StatusTypeID": 50,
    "DateLastStatusUpdate": "2020-08-08T09:23:00Z",
    "DataQualityLevel": 1,
    "DateCreated": "2018-06-08T05:36:00Z",
    "SubmissionStatusTypeID": 200
}