{
    "IsRecentlyVerified": false,
    "ID": 157953,
    "UUID": "EDB52A36-AF51-48FA-9A61-205D72C7A863",
    "DataProviderID": 18,
    "DataProvidersReference": "4e8acd45ddb9c8bcfb76033868032d16",
    "UsageTypeID": 1,
    "AddressInfo": {
        "ID": 158307,
        "Title": "Stockmore Street",
        "AddressLine1": "Stockmore Street",
        "Town": "Oxford",
        "Postcode": "OX4 1JT",
        "CountryID": 1,
        "Latitude": 51.747504,
        "Longitude": -1.241394,
        "AccessComments": "",
        "RelatedURL": "http://www.newmotion.com/",
        "DistanceUnit": 0
    },
    "Connections": [
        {
            "ID": 227657,
            "ConnectionTypeID": 25,
            "Reference": "OCCAPT011",
            "StatusTypeID": 50,
            "LevelID": 2,
            "Amps": 16,
            "Voltage": 400,
            "PowerKW": 11,
            "CurrentTypeID": 20
        }
    ],
    "StatusTypeID": 0,
    "DateLastStatusUpdate": "2020-06-25T10:00:00Z",
    "MetadataValues": [
        {
            "ID": 7486,
            "MetadataFieldID": 4,
            "ItemValue": "Contains public sector information licensed under the Open Government Licence v2.0. http://www.nationalarchives.gov.uk/doc/open-government-licence/version/2/"
        }
    ],
    "DataQualityLevel": 3,
    "DateCreated": "2020-06-25T10:00:00Z",
    "SubmissionStatusTypeID": 100
}