{
    "IsRecentlyVerified": false,
    "ID": 183202,
    "UUID": "E2E758EB-141C-4E7B-A42E-AEC890DE81E0",
    "DataProviderID": 29,
    "DataProvidersReference": "14042",
    "AddressInfo": {
        "ID": 183561,
        "Title": "Grunewaldstr.1-3",
        "AddressLine1": "Grunewaldstr.1-3",
        "Town": "Berlin",
        "Postcode": "12154",
        "CountryID": 87,
        "Latitude": 52.4906821999999,
        "Longitude": 13.3589564999999,
        "DistanceUnit": 0
    },
    "Connections": [
        {
            "ID": 289893,
            "ConnectionTypeID": 25,
            "StatusTypeID": 50,
            "LevelID": 2,
            "PowerKW": 11,
            "CurrentTypeID": 20
        },
        {
            "ID": 289894,
            "ConnectionTypeID": 25,
            "StatusTypeID": 50,
            "LevelID": 2,
            "PowerKW": 11,
            "CurrentTypeID": 20
        }
    ],
    "StatusTypeID": 50,
    "DateLastStatusUpdate": "2021-07-12T02:49:00Z",
    "MetadataValues": [
        {
            "ID": 15495,
            "MetadataFieldID": 4,
            "ItemValue": "Data from the German chargepoint registry provided by Bundesnetzagentur.de under the CC-BY 4.0 license"
        }
    ],
    "DataQualityLevel": 3,
    "DateCreated": "2021-07-08T10:03:00Z",
    "SubmissionStatusTypeID": 100
}