{
    "IsRecentlyVerified": false,
    "ID": 142894,
    "UUID": "4B05AFA8-7150-40C2-8B91-DE71CC933A45",
    "DataProviderID": 2,
    "DataProvidersReference": "147039",
    "OperatorID": 5,
    "UsageTypeID": 1,
    "AddressInfo": {
        "ID": 143246,
        "Title": "WINDY CITY H-D",
        "AddressLine1": "135 Randall Rd",
        "Town": "St. Charles",
        "StateOrProvince": "IL",
        "Postcode": "60174",
        "CountryID": 2,
        "Latitude": 41.9103646,
        "Longitude": -88.3426034,
        "ContactTelephone1": "888-758-4389",
        "AccessComments": "24 hours daily",
        "RelatedURL": "http://www.chargepoint.com/",
        "DistanceUnit": 0
    },
    "Connections": [
        {
            "ID": 199123,
            "ConnectionTypeID": 32,
            "LevelID": 3,
            "Amps": 100,
            "Voltage": 400,
            "PowerKW": 40,
            "CurrentTypeID": 30,
            "Quantity": 1
        }
    ],
    "StatusTypeID": 50,
    "DateLastStatusUpdate": "2020-06-26T03:05:00Z",
    "DataQualityLevel": 3,
    "DateCreated": "2019-12-24T09:19:00Z",
    "SubmissionStatusTypeID": 100
}