{
    "IsRecentlyVerified": false,
    "ID": 115690,
    "UUID": "4EDB8BD8-2B8B-4046-BD54-97D97315CC97",
    "DataProviderID": 2,
    "DataProvidersReference": "113452",
    "OperatorID": 23,
    "UsageTypeID": 7,
    "AddressInfo": {
        "ID": 116036,
        "Title": "Anderson's Conn Valley Vineyards - Tesla Destination",
        "AddressLine1": "680 Rossi Rd",
        "Town": "St. Helena",
        "StateOrProvince": "CA",
        "Postcode": "94574",
        "CountryID": 2,
        "Latitude": 38.513669,
        "Longitude": -122.411303,
        "ContactTelephone1": "707-963-8600  877-798-3752",
        "AccessComments": "24 hours daily; for customer use only\r\nPublic - Call ahead",
        "RelatedURL": "https://www.tesla.com/destination-charging",
        "DistanceUnit": 0
    },
    "Connections": [
        {
            "ID": 162723,
            "ConnectionTypeID": 30,
            "LevelID": 2,
            "Amps": 16,
            "Voltage": 230,
            "PowerKW": 3.7,
            "CurrentTypeID": 10,
            "Quantity": 2
        }
    ],
    "DateLastStatusUpdate": "2020-06-26T03:00:00Z",
    "DataQualityLevel": 3,
    "DateCreated": "2019-02-11T07:13:00Z",
    "SubmissionStatusTypeID": 100
}