{
    "IsRecentlyVerified": false,
    "ID": 173449,
    "UUID": "BFD9CFA2-CDF7-4551-9B21-C53142B2C1D2",
    "DataProviderID": 18,
    "DataProvidersReference": "5cffc7404687e6f11a109ae3ca621104",
    "OperatorID": 2244,
    "UsageTypeID": 1,
    "AddressInfo": {
        "ID": 173808,
        "Title": "8 Camden Square",
        "AddressLine1": "8 Camden Square",
        "Town": "London",
        "Postcode": "NW1 9UP",
        "CountryID": 1,
        "Latitude": -0.13278,
        "Longitude": 51.54462,
        "AccessComments": "",
        "RelatedURL": "https://www.ubitricity.com",
        "DistanceUnit": 0
    },
    "Connections": [
        {
            "ID": 266474,
            "ConnectionTypeID": 25,
            "Reference": "suby1100005332",
            "StatusTypeID": 50,
            "LevelID": 2,
            "Amps": 16,
            "Voltage": 230,
            "PowerKW": 3.7,
            "CurrentTypeID": 10
        }
    ],
    "StatusTypeID": 0,
    "DateLastStatusUpdate": "2021-07-12T03:38:00Z",
    "MetadataValues": [
        {
            "ID": 8371,
            "MetadataFieldID": 4,
            "ItemValue": "Contains public sector information licensed under the Open Government Licence v2.0. http://www.nationalarchives.gov.uk/doc/open-government-licence/version/2/"
        }
    ],
    "DataQualityLevel": 3,
    "DateCreated": "2021-03-03T11:25:00Z",
    "SubmissionStatusTypeID": 100
}