{
    "IsRecentlyVerified": false,
    "ID": 138905,
    "UUID": "AA0DD9BE-1146-4DE2-AD02-F1C4D614A1AE",
    "DataProviderID": 2,
    "DataProvidersReference": "98937",
    "OperatorID": 59,
    "UsageTypeID": 1,
    "AddressInfo": {
        "ID": 139257,
        "Title": "Greenlots - 33057",
        "AddressLine1": "1501 Auto Park Way S",
        "Town": "Escondido",
        "StateOrProvince": "CA",
        "Postcode": "92029",
        "CountryID": 2,
        "Latitude": 33.1138534545898,
        "Longitude": -117.106094360352,
        "ContactTelephone1": "855-900-7584",
        "AccessComments": "24 hours daily",
        "RelatedURL": "http://greenlots.com/",
        "DistanceUnit": 0
    },
    "Connections": [
        {
            "ID": 194132,
            "ConnectionTypeID": 2,
            "LevelID": 3,
            "Amps": 100,
            "Voltage": 400,
            "PowerKW": 40,
            "CurrentTypeID": 30,
            "Quantity": 1
        },
        {
            "ID": 194133,
            "ConnectionTypeID": 32,
            "LevelID": 3,
            "Amps": 100,
            "Voltage": 400,
            "PowerKW": 40,
            "CurrentTypeID": 30,
            "Quantity": 1
        }
    ],
    "StatusTypeID": 50,
    "DateLastStatusUpdate": "2019-12-24T09:09:00Z",
    "DataQualityLevel": 3,
    "DateCreated": "2019-12-24T09:09:00Z",
    "SubmissionStatusTypeID": 100
}