{
    "IsRecentlyVerified": false,
    "ID": 73812,
    "UUID": "1FBEB9E9-F514-456A-9774-A7EABDCDB57B",
    "DataProviderID": 1,
    "OperatorID": 89,
    "OperatorsReference": "CEA-10089",
    "UsageTypeID": 4,
    "UsageCost": "CAD 1.00/hour",
    "AddressInfo": {
        "ID": 74158,
        "Title": "St-Hubert-Joliette",
        "AddressLine1": "111 Rue de la Visitation",
        "Town": "Joliette",
        "StateOrProvince": "QC",
        "Postcode": "J6E 4N4",
        "CountryID": 44,
        "Latitude": 46.0405088182952,
        "Longitude": -73.4477368220902,
        "DistanceUnit": 0
    },
    "Connections": [
        {
            "ID": 106118,
            "ConnectionTypeID": 1,
            "StatusTypeID": 50,
            "LevelID": 2,
            "Amps": 32,
            "Voltage": 230,
            "PowerKW": 7,
            "CurrentTypeID": 10,
            "Quantity": 1
        }
    ],
    "NumberOfPoints": 1,
    "StatusTypeID": 50,
    "DateLastStatusUpdate": "2016-11-27T19:58:00Z",
    "DataQualityLevel": 1,
    "DateCreated": "2016-11-23T23:11:00Z",
    "SubmissionStatusTypeID": 200
}