{
    "IsRecentlyVerified": false,
    "ID": 113677,
    "UUID": "47B9C44F-4023-4B24-B001-AB3E39A56E52",
    "DataProviderID": 1,
    "OperatorID": 3295,
    "UsageTypeID": 1,
    "UsageCost": "Free",
    "AddressInfo": {
        "ID": 114023,
        "Title": "Chapel Lane",
        "AddressLine1": "Chapel Lane",
        "Town": "Swords",
        "StateOrProvince": "Dublin",
        "CountryID": 3,
        "Latitude": 53.458454,
        "Longitude": -6.218514,
        "RelatedURL": "https://evcharge.online",
        "DistanceUnit": 0
    },
    "Connections": [
        {
            "ID": 160216,
            "ConnectionTypeID": 25,
            "StatusTypeID": 50,
            "LevelID": 2,
            "Amps": 32,
            "PowerKW": 7.2,
            "CurrentTypeID": 10,
            "Quantity": 1
        }
    ],
    "NumberOfPoints": 1,
    "GeneralComments": "Rolec StreetCharge Light",
    "StatusTypeID": 50,
    "DateLastStatusUpdate": "2019-06-04T07:04:00Z",
    "DataQualityLevel": 1,
    "DateCreated": "2018-12-29T21:58:00Z",
    "SubmissionStatusTypeID": 200
}