{
    "UserComments": [
        {
            "ID": 437,
            "ChargePointID": 13629,
            "CommentTypeID": 10,
            "UserName": "BarnyDaley",
            "Comment": "Post showing two red stripes. Did to test - charged at adjacent post.",
            "DateCreated": "2013-09-21T16:24:22.167Z",
            "User": {
                "ID": 1158,
                "Username": "BarnyDaley"
            },
            "CheckinStatusTypeID": 25
        }
    ],
    "MediaItems": [
        {
            "ID": 101,
            "ChargePointID": 13629,
            "ItemURL": "https://s3-ap-southeast-2.amazonaws.com/openchargemap/images/GB/OCM13629/OCM-13629.orig.2013092116305705.jpg",
            "ItemThumbnailURL": "https://s3-ap-southeast-2.amazonaws.com/openchargemap/images/GB/OCM13629/OCM-13629.thmb.2013092116305705.jpg",
            "Comment": "",
            "IsEnabled": true,
            "IsVideo": false,
            "IsFeaturedItem": false,
            "IsExternalResource": false,
            "User": {
                "ID": 1158,
                "Username": "BarnyDaley"
            },
            "DateCreated": "2013-09-21T16:31:00Z"
        }
    ],
    "IsRecentlyVerified": false,
    "ID": 13629,
    "UUID": "3AD0FEA7-F336-44A0-9D49-FB09629F4C46",
    "DataProviderID": 1,
    "OperatorID": 32,
    "OperatorsReference": "267,274",
    "UsageTypeID": 4,
    "UsageCost": "£0.108/kWh; for Polar Plus subscription members only",
    "AddressInfo": {
        "ID": 13526,
        "Title": "Milton Keynes Civic Offices",
        "AddressLine1": "501 Silbury Boulevard",
        "Town": "Milton Keynes",
        "Postcode": "MK9 2AD",
        "CountryID": 1,
        "Latitude": 52.042831,
        "Longitude": -0.760908,
        "RelatedURL": "http://www.chargemasterplc.com",
        "DistanceUnit": 0
    },
    "Connections": [
        {
            "ID": 11095,
            "ConnectionTypeID": 3,
            "StatusTypeID": 50,
            "LevelID": 2,
            "Amps": 13,
            "Voltage": 230,
            "PowerKW": 3,
            "CurrentTypeID": 10,
            "Quantity": 2
        },
        {
            "ID": 92125,
            "ConnectionTypeID": 25,
            "StatusTypeID": 50,
            "LevelID": 2,
            "Amps": 32,
            "Voltage": 230,
            "PowerKW": 7,
            "CurrentTypeID": 10,
            "Quantity": 4
        }
    ],
    "NumberOfPoints": 4,
    "StatusTypeID": 50,
    "DateLastStatusUpdate": "2019-03-08T06:14:00Z",
    "DataQualityLevel": 3,
    "DateCreated": "2012-11-22T04:40:00Z",
    "SubmissionStatusTypeID": 200
}