{
    "IsRecentlyVerified": false,
    "ID": 136035,
    "UUID": "97363259-8350-4DFC-AF92-E5B2A51586A4",
    "DataProviderID": 18,
    "DataProvidersReference": "ad3d97e42de5e90c96c65be40700347b",
    "OperatorID": 2244,
    "UsageTypeID": 4,
    "AddressInfo": {
        "ID": 136381,
        "Title": "Burnaby Crescent",
        "AddressLine1": "Burnaby Crescent",
        "Town": "London",
        "Postcode": "W4 3JD",
        "CountryID": 1,
        "Latitude": 51.485794,
        "Longitude": -0.271665,
        "AccessComments": "",
        "RelatedURL": "https://www.ubitricity.com",
        "DistanceUnit": 0
    },
    "Connections": [
        {
            "ID": 190462,
            "ConnectionTypeID": 25,
            "Reference": "steob100000600",
            "StatusTypeID": 50,
            "LevelID": 2,
            "Amps": 16,
            "Voltage": 230,
            "PowerKW": 3.7,
            "CurrentTypeID": 10
        }
    ],
    "StatusTypeID": 0,
    "DateLastStatusUpdate": "2021-04-25T05:46:00Z",
    "MetadataValues": [
        {
            "ID": 5887,
            "MetadataFieldID": 4,
            "ItemValue": "Contains public sector information licensed under the Open Government Licence v2.0. http://www.nationalarchives.gov.uk/doc/open-government-licence/version/2/"
        }
    ],
    "DataQualityLevel": 3,
    "DateCreated": "2019-12-24T05:22:00Z",
    "SubmissionStatusTypeID": 100
}