{
    "IsRecentlyVerified": false,
    "ID": 183742,
    "UUID": "DD89F6A0-1174-48FE-9C05-17CA5081042D",
    "DataProviderID": 29,
    "DataProvidersReference": "4724",
    "OperatorID": 44,
    "AddressInfo": {
        "ID": 184101,
        "Title": "Hoffnungthaler Str. 23",
        "AddressLine1": "Hoffnungthaler Str. 23",
        "Town": "Rösrath",
        "Postcode": "51503",
        "CountryID": 87,
        "Latitude": 50.92491,
        "Longitude": 7.18036,
        "DistanceUnit": 0
    },
    "Connections": [
        {
            "ID": 291100,
            "ConnectionTypeID": 25,
            "StatusTypeID": 50,
            "LevelID": 2,
            "PowerKW": 22,
            "CurrentTypeID": 20
        },
        {
            "ID": 291101,
            "ConnectionTypeID": 25,
            "StatusTypeID": 50,
            "LevelID": 2,
            "PowerKW": 11,
            "CurrentTypeID": 20
        }
    ],
    "StatusTypeID": 50,
    "DateLastStatusUpdate": "2021-07-12T02:46:00Z",
    "MetadataValues": [
        {
            "ID": 16035,
            "MetadataFieldID": 4,
            "ItemValue": "Data from the German chargepoint registry provided by Bundesnetzagentur.de under the CC-BY 4.0 license"
        }
    ],
    "DataQualityLevel": 3,
    "DateCreated": "2021-07-08T10:04:00Z",
    "SubmissionStatusTypeID": 100
}