{
    "IsRecentlyVerified": true,
    "DateLastVerified": "2021-09-01T18:29:00Z",
    "ID": 189019,
    "UUID": "9BC1E77F-78E6-46BE-8901-03218F277EF9",
    "DataProviderID": 1,
    "OperatorID": 3471,
    "UsageTypeID": 5,
    "UsageCost": "£0.39/kWh",
    "AddressInfo": {
        "ID": 189378,
        "Title": "MFG Great Cambridge Road",
        "AddressLine1": "Great Cambridge Road",
        "Town": "London",
        "StateOrProvince": "England",
        "Postcode": "EN1 1JD",
        "CountryID": 1,
        "Latitude": 51.64257087497859,
        "Longitude": -0.06124559995339496,
        "DistanceUnit": 0
    },
    "Connections": [
        {
            "ID": 305518,
            "ConnectionTypeID": 33,
            "StatusTypeID": 50,
            "LevelID": 3,
            "PowerKW": 150,
            "CurrentTypeID": 30,
            "Quantity": 4
        },
        {
            "ID": 305519,
            "ConnectionTypeID": 2,
            "StatusTypeID": 50,
            "LevelID": 3,
            "PowerKW": 100,
            "CurrentTypeID": 30,
            "Quantity": 4
        }
    ],
    "NumberOfPoints": 4,
    "StatusTypeID": 50,
    "DateLastStatusUpdate": "2021-09-01T18:29:00Z",
    "DataQualityLevel": 1,
    "DateCreated": "2021-09-01T18:29:00Z",
    "SubmissionStatusTypeID": 200
}