{
    "IsRecentlyVerified": false,
    "ID": 163823,
    "UUID": "36A37A47-0110-4629-8DDD-F7BCFE6FE644",
    "DataProviderID": 1,
    "OperatorID": 23,
    "OperatorsReference": "26247",
    "UsageTypeID": 4,
    "UsageCost": "€0.29/kWh; Otras tarifas posibles para los coches antiguos",
    "AddressInfo": {
        "ID": 164181,
        "Title": "Albacete Supercharger",
        "AddressLine1": "KM 52 la Gineta",
        "Town": "Albacete",
        "Postcode": "2110",
        "CountryID": 210,
        "Latitude": 39.134675,
        "Longitude": -2.039013,
        "DistanceUnit": 0
    },
    "Connections": [
        {
            "ID": 235420,
            "ConnectionTypeID": 27,
            "StatusTypeID": 50,
            "LevelID": 3,
            "PowerKW": 120,
            "CurrentTypeID": 30,
            "Quantity": 8
        }
    ],
    "NumberOfPoints": 8,
    "GeneralComments": "Charging8 superchargers, available 24/7, up to 150kW",
    "StatusTypeID": 50,
    "DateLastStatusUpdate": "2020-08-24T19:15:00Z",
    "DataQualityLevel": 1,
    "DateCreated": "2020-08-24T19:13:00Z",
    "SubmissionStatusTypeID": 200
}