{
    "IsRecentlyVerified": false,
    "ID": 160776,
    "UUID": "5B8FFD97-C97B-4EA5-8C2F-7AFFF559449B",
    "DataProviderID": 2,
    "DataProvidersReference": "157703",
    "UsageTypeID": 2,
    "AddressInfo": {
        "ID": 161133,
        "Title": "Canadian Tire Corporation",
        "AddressLine1": "1731 Preston Ave N",
        "Town": "Saskatoon",
        "StateOrProvince": "SK",
        "Postcode": "S7N 4V2",
        "CountryID": 44,
        "Latitude": 52.1473142,
        "Longitude": -106.618422,
        "ContactTelephone1": "",
        "AccessComments": "",
        "RelatedURL": "",
        "DistanceUnit": 0
    },
    "Connections": [
        {
            "ID": 231386,
            "ConnectionTypeID": 2,
            "LevelID": 3,
            "Amps": 100,
            "Voltage": 400,
            "PowerKW": 40,
            "CurrentTypeID": 30,
            "Quantity": 1
        },
        {
            "ID": 231387,
            "ConnectionTypeID": 32,
            "LevelID": 3,
            "Amps": 100,
            "Voltage": 400,
            "PowerKW": 40,
            "CurrentTypeID": 30,
            "Quantity": 1
        }
    ],
    "GeneralComments": "Planned for future date. Not Operational.",
    "DatePlanned": "2020-09-01T00:00:00Z",
    "StatusTypeID": 150,
    "DateLastStatusUpdate": "2020-06-26T03:12:00Z",
    "DataQualityLevel": 3,
    "DateCreated": "2020-06-26T03:12:00Z",
    "SubmissionStatusTypeID": 100
}