{
    "IsRecentlyVerified": false,
    "ID": 120633,
    "UUID": "7445BBFA-866C-4411-BB08-7A919781152B",
    "DataProviderID": 2,
    "DataProvidersReference": "50423",
    "OperatorID": 5,
    "UsageTypeID": 1,
    "AddressInfo": {
        "ID": 120979,
        "Title": "IPA PARTNERS",
        "AddressLine1": "3250 S. Arizona Ave",
        "Town": "Chandler",
        "StateOrProvince": "AZ",
        "Postcode": "85248",
        "CountryID": 2,
        "Latitude": 33.258568,
        "Longitude": -111.843316,
        "ContactTelephone1": "888-758-4389",
        "AccessComments": "24 hours daily",
        "RelatedURL": "http://www.chargepoint.com/",
        "DistanceUnit": 0
    },
    "Connections": [
        {
            "ID": 169994,
            "ConnectionTypeID": 9,
            "LevelID": 1,
            "Amps": 16,
            "Voltage": 120,
            "PowerKW": 1.9,
            "CurrentTypeID": 10,
            "Quantity": 2
        },
        {
            "ID": 169995,
            "ConnectionTypeID": 1,
            "LevelID": 2,
            "Amps": 16,
            "Voltage": 230,
            "PowerKW": 3.7,
            "CurrentTypeID": 10,
            "Quantity": 2
        }
    ],
    "DateLastStatusUpdate": "2020-06-26T02:55:00Z",
    "DataQualityLevel": 3,
    "DateCreated": "2019-04-01T04:59:00Z",
    "SubmissionStatusTypeID": 100
}