{
    "IsRecentlyVerified": false,
    "ID": 135160,
    "UUID": "912486AC-589F-4B6C-8B8D-6663F9742ED3",
    "DataProviderID": 1,
    "OperatorID": 80,
    "UsageTypeID": 4,
    "AddressInfo": {
        "ID": 135506,
        "Title": "Morano Calabro Nazionale | EnelX",
        "AddressLine1": "Via Nazionale",
        "Town": "Morano Calabro",
        "StateOrProvince": "CS",
        "Postcode": "87016",
        "CountryID": 112,
        "Latitude": 39.842068920813546,
        "Longitude": 16.139656336036865,
        "ContactTelephone1": "800.069.850",
        "RelatedURL": "https://www.enelx.com/it/it/emobility",
        "DistanceUnit": 0
    },
    "Connections": [
        {
            "ID": 189202,
            "ConnectionTypeID": 25,
            "StatusTypeID": 50,
            "LevelID": 2,
            "Amps": 32,
            "Voltage": 400,
            "PowerKW": 22,
            "CurrentTypeID": 20,
            "Quantity": 2
        }
    ],
    "NumberOfPoints": 2,
    "StatusTypeID": 50,
    "DateLastStatusUpdate": "2019-12-09T14:44:00Z",
    "DataQualityLevel": 1,
    "DateCreated": "2019-12-09T14:44:00Z",
    "SubmissionStatusTypeID": 200
}