{
    "IsRecentlyVerified": false,
    "ID": 49225,
    "UUID": "7A586046-B987-4E1F-854D-1CC60571356A",
    "DataProviderID": 1,
    "OperatorID": 45,
    "UsageTypeID": 1,
    "AddressInfo": {
        "ID": 49571,
        "Title": "Petring Energietechnik",
        "AddressLine1": "Paderborner Straße 76",
        "Town": "Kreis Lippe",
        "StateOrProvince": "Kreis Lippe",
        "Postcode": "33189",
        "CountryID": 87,
        "Latitude": 51.80107,
        "Longitude": 8.837120000000027,
        "ContactTelephone1": "+49 5252 7213",
        "AccessComments": "Grüner Schrank im schwarten Metallständerwerk. Nutzbar während der Öffnungszeiten Mo-Do 9-17, Fr 9-15 Uhr. ",
        "RelatedURL": "http://www.wallb-e.de/",
        "DistanceUnit": 0
    },
    "Connections": [
        {
            "ID": 60847,
            "ConnectionTypeID": 25,
            "StatusTypeID": 50,
            "LevelID": 2,
            "Amps": 32,
            "Voltage": 400,
            "PowerKW": 22,
            "CurrentTypeID": 20,
            "Quantity": 2
        }
    ],
    "NumberOfPoints": 2,
    "StatusTypeID": 50,
    "DateLastStatusUpdate": "2015-07-14T07:45:00Z",
    "DataQualityLevel": 1,
    "DateCreated": "2015-07-14T07:45:00Z",
    "SubmissionStatusTypeID": 200
}