{
    "IsRecentlyVerified": false,
    "ID": 72412,
    "UUID": "C21B2660-804F-4AFE-B5F0-BD6865181D80",
    "DataProviderID": 1,
    "OperatorID": 156,
    "UsageTypeID": 4,
    "AddressInfo": {
        "ID": 72758,
        "Title": "Burg Vischering",
        "AddressLine1": "Klosterstraße",
        "Town": "Lüdinghausen",
        "StateOrProvince": "Kreis Coesfeld",
        "Postcode": "59348",
        "CountryID": 87,
        "Latitude": 51.77700331901057,
        "Longitude": 7.440424800806791,
        "AccessComments": "24/7 nutzbare Ladesäule auf dem Parkplatz vor der Burg.",
        "DistanceUnit": 0
    },
    "Connections": [
        {
            "ID": 103775,
            "ConnectionTypeID": 25,
            "StatusTypeID": 50,
            "LevelID": 2,
            "Amps": 32,
            "Voltage": 400,
            "PowerKW": 22,
            "CurrentTypeID": 20,
            "Quantity": 2
        }
    ],
    "NumberOfPoints": 2,
    "StatusTypeID": 50,
    "DateLastStatusUpdate": "2016-10-13T05:34:00Z",
    "DataQualityLevel": 1,
    "DateCreated": "2016-10-13T05:34:00Z",
    "SubmissionStatusTypeID": 200
}