{
    "IsRecentlyVerified": false,
    "ID": 10401,
    "UUID": "C070836B-8611-4477-B219-C948E15922D0",
    "DataProviderID": 15,
    "DataProvidersReference": "18004",
    "OperatorID": 1,
    "UsageTypeID": 1,
    "AddressInfo": {
        "ID": 10298,
        "Title": "8376 Cerrillos Road",
        "AddressLine1": "8376 Cerrillos Road",
        "Town": "Santa Fe",
        "StateOrProvince": "NM",
        "Postcode": "87507",
        "CountryID": 2,
        "Latitude": 35.61229,
        "Longitude": -106.0323,
        "ContactTelephone1": "505 474-9500",
        "RelatedURL": "http://carstations.com/18004",
        "DistanceUnit": 0
    },
    "Connections": [
        {
            "ID": 8316,
            "ConnectionTypeID": 9,
            "Reference": "NEMA5",
            "LevelID": 1
        }
    ],
    "NumberOfPoints": 4,
    "StatusTypeID": 50,
    "DateLastStatusUpdate": "2017-11-04T14:04:00Z",
    "DataQualityLevel": 2,
    "DateCreated": "2012-05-15T14:21:00Z",
    "SubmissionStatusTypeID": 100
}