{
    "IsRecentlyVerified": false,
    "ID": 17983,
    "UUID": "79693BD7-446F-4E9A-ACAB-258E19E2124C",
    "DataProviderID": 22,
    "DataProvidersReference": "980017891FF67CF8A20F23AA810E7B5A",
    "AddressInfo": {
        "ID": 18328,
        "Title": "道の駅たけはら",
        "AddressLine1": "広島県竹原市本町1-1-1",
        "CountryID": 114,
        "Latitude": 34.34394463,
        "Longitude": 132.9121742,
        "ContactTelephone1": "0846-23-5100",
        "DistanceUnit": 0
    },
    "Connections": [
        {
            "ID": 18224,
            "ConnectionTypeID": 2,
            "LevelID": 2,
            "Amps": 100,
            "Voltage": 480,
            "PowerKW": 48,
            "Quantity": 1
        }
    ],
    "DateLastStatusUpdate": "2013-06-29T09:05:00Z",
    "DataQualityLevel": 2,
    "DateCreated": "2013-06-29T09:05:00Z",
    "SubmissionStatusTypeID": 200
}