{
    "IsRecentlyVerified": false,
    "ID": 144751,
    "UUID": "070F2CC9-368A-4277-A38D-027B74B4E490",
    "DataProviderID": 2,
    "DataProvidersReference": "129764",
    "OperatorID": 89,
    "UsageTypeID": 1,
    "AddressInfo": {
        "ID": 145103,
        "Title": "FLO - Clinique Vétérinaire Douville inc.",
        "AddressLine1": "5975 boul Laurier ouest",
        "Town": "Saint-Hyacinthe",
        "StateOrProvince": "QC",
        "Postcode": "J2S 3W1",
        "CountryID": 44,
        "Latitude": 45.601875,
        "Longitude": -72.985118,
        "ContactTelephone1": "888-356-8911",
        "AccessComments": "24 hours daily",
        "RelatedURL": "https://flo.ca/",
        "DistanceUnit": 0
    },
    "Connections": [
        {
            "ID": 201275,
            "ConnectionTypeID": 1,
            "LevelID": 2,
            "Amps": 16,
            "Voltage": 230,
            "PowerKW": 3.7,
            "CurrentTypeID": 10,
            "Quantity": 1
        }
    ],
    "StatusTypeID": 50,
    "DateLastStatusUpdate": "2020-06-26T03:09:00Z",
    "DataQualityLevel": 3,
    "DateCreated": "2019-12-24T09:23:00Z",
    "SubmissionStatusTypeID": 100
}