{
    "IsRecentlyVerified": false,
    "ID": 162628,
    "UUID": "9ACFD74E-5172-4AE8-A425-41E7A9AFDC2E",
    "DataProviderID": 1,
    "OperatorID": 21,
    "UsageTypeID": 4,
    "UsageCost": "Mobi.E compatible card",
    "AddressInfo": {
        "ID": 162985,
        "Title": "SNT-00001",
        "AddressLine1": "Rua João de Deus",
        "Town": "Sintra",
        "StateOrProvince": "Lisboa",
        "Postcode": "2710-529",
        "CountryID": 180,
        "Latitude": 38.79854093244623,
        "Longitude": -9.386624322810007,
        "AccessComments": "Paid parking",
        "DistanceUnit": 0
    },
    "Connections": [
        {
            "ID": 234073,
            "ConnectionTypeID": 25,
            "StatusTypeID": 50,
            "LevelID": 2,
            "Amps": 32,
            "Voltage": 230,
            "PowerKW": 7.4,
            "CurrentTypeID": 10,
            "Quantity": 2
        }
    ],
    "NumberOfPoints": 2,
    "StatusTypeID": 100,
    "DateLastStatusUpdate": "2020-08-12T19:26:00Z",
    "DataQualityLevel": 1,
    "DateCreated": "2020-08-12T19:11:00Z",
    "SubmissionStatusTypeID": 200
}