{
    "IsRecentlyVerified": false,
    "ID": 63866,
    "UUID": "905EFA9D-30AE-4974-B31A-E7E701F2E52B",
    "DataProviderID": 26,
    "DataProvidersReference": "82434",
    "OperatorID": 73,
    "OperatorsReference": "EV-Box EVB-P1552002",
    "UsageCost": "0.00 jaarabonnement",
    "AddressInfo": {
        "ID": 64212,
        "Title": "Dirk Storklaan 76",
        "AddressLine1": "Dirk Storklaan 76",
        "Town": "Haarlemmermeer",
        "Postcode": "2132 PX",
        "CountryID": 159,
        "Latitude": 52.28979,
        "Longitude": 4.6739,
        "RelatedURL": "http://www.ev-box.nl",
        "DistanceUnit": 0
    },
    "Connections": [
        {
            "ID": 81605,
            "ConnectionTypeID": 25,
            "LevelID": 2,
            "PowerKW": 11,
            "CurrentTypeID": 10
        },
        {
            "ID": 81606,
            "ConnectionTypeID": 25,
            "LevelID": 2,
            "PowerKW": 11,
            "CurrentTypeID": 10
        }
    ],
    "NumberOfPoints": 1,
    "StatusTypeID": 50,
    "DateLastStatusUpdate": "2016-06-04T02:52:00Z",
    "DataQualityLevel": 3,
    "DateCreated": "2016-03-03T12:32:00Z",
    "SubmissionStatusTypeID": 100
}