{
    "IsRecentlyVerified": false,
    "ID": 79249,
    "UUID": "21CBBA50-E67C-40CC-830D-C2763A8924AA",
    "DataProviderID": 1,
    "OperatorID": 23,
    "OperatorsReference": "9818",
    "UsageTypeID": 4,
    "UsageCost": "$0.24/min >=60kW; $0.12/min <60kW; other tariffs for older cars",
    "AddressInfo": {
        "ID": 79595,
        "Title": "Grand Rapids Supercharger",
        "AddressLine1": "5531 28th Street Se",
        "Town": "Grand Rapids",
        "StateOrProvince": "MI",
        "Postcode": "49512",
        "CountryID": 2,
        "Latitude": 42.914231,
        "Longitude": -85.533057,
        "DistanceUnit": 0
    },
    "Connections": [
        {
            "ID": 113868,
            "ConnectionTypeID": 27,
            "StatusTypeID": 50,
            "LevelID": 3,
            "PowerKW": 120,
            "CurrentTypeID": 30,
            "Quantity": 8
        }
    ],
    "NumberOfPoints": 8,
    "GeneralComments": "8 Superchargers, available 24/7",
    "StatusTypeID": 50,
    "DateLastStatusUpdate": "2018-03-13T13:18:00Z",
    "DataQualityLevel": 1,
    "DateCreated": "2017-01-26T21:18:00Z",
    "SubmissionStatusTypeID": 200
}