{
    "IsRecentlyVerified": false,
    "ID": 84665,
    "UUID": "E1C00B6C-4B4C-4FBF-A023-90B5DB0E69B1",
    "DataProviderID": 1,
    "OperatorID": 185,
    "UsageTypeID": 4,
    "AddressInfo": {
        "ID": 85011,
        "Title": "Supermarkt famila",
        "AddressLine1": "Gablonzer Straße 1-2",
        "Town": "Trappenkamp",
        "Postcode": "24610",
        "CountryID": 87,
        "Latitude": 54.04336,
        "Longitude": 10.215469999999982,
        "ContactTelephone1": "+45 8616 8888",
        "RelatedURL": "http://de.clever.dk/",
        "DistanceUnit": 0
    },
    "Connections": [
        {
            "ID": 120263,
            "ConnectionTypeID": 1036,
            "StatusTypeID": 50,
            "LevelID": 3,
            "Amps": 63,
            "Voltage": 400,
            "PowerKW": 43,
            "CurrentTypeID": 20,
            "Quantity": 2
        },
        {
            "ID": 120264,
            "ConnectionTypeID": 2,
            "StatusTypeID": 50,
            "LevelID": 3,
            "PowerKW": 50,
            "CurrentTypeID": 30,
            "Quantity": 1
        },
        {
            "ID": 120265,
            "ConnectionTypeID": 33,
            "StatusTypeID": 50,
            "LevelID": 3,
            "PowerKW": 50,
            "CurrentTypeID": 30,
            "Quantity": 1
        }
    ],
    "NumberOfPoints": 1,
    "StatusTypeID": 50,
    "DateLastStatusUpdate": "2017-03-08T09:28:00Z",
    "DataQualityLevel": 1,
    "DateCreated": "2017-03-08T09:28:00Z",
    "SubmissionStatusTypeID": 200
}