{
    "IsRecentlyVerified": false,
    "ID": 165399,
    "UUID": "2EFFE685-EFD2-47DA-A1FD-0B6848DAD95C",
    "DataProviderID": 28,
    "DataProvidersReference": "FR*M13*P13214*002",
    "UsageTypeID": 5,
    "AddressInfo": {
        "ID": 165758,
        "Title": "MARSEILLE-14E - 42 Boulevard Charles Moretti",
        "AddressLine1": "Allée des Coudercs - Parking aire de jeu 0 MARSEILLE-14E",
        "CountryID": 80,
        "Latitude": 43.32494,
        "Longitude": 5.382365,
        "AccessComments": "24h/24 7j/7",
        "DistanceUnit": 0
    },
    "Connections": [
        {
            "ID": 238447,
            "ConnectionTypeID": 28,
            "StatusTypeID": 50,
            "LevelID": 2,
            "PowerKW": 22,
            "CurrentTypeID": 10
        },
        {
            "ID": 238448,
            "ConnectionTypeID": 1036,
            "StatusTypeID": 50,
            "LevelID": 2,
            "PowerKW": 22,
            "CurrentTypeID": 20
        }
    ],
    "GeneralComments": "Recharge par badge et avec une application smartphone",
    "StatusTypeID": 50,
    "DateLastStatusUpdate": "2020-08-27T05:10:00Z",
    "DataQualityLevel": 2,
    "DateCreated": "2020-08-27T05:10:00Z",
    "SubmissionStatusTypeID": 100
}