{
    "IsRecentlyVerified": false,
    "ID": 7835,
    "UUID": "DE8EFC4C-3314-42D9-9A0F-C786D60BBD3C",
    "DataProviderID": 15,
    "DataProvidersReference": "6912",
    "OperatorID": 26,
    "AddressInfo": {
        "ID": 7732,
        "Title": "165 W Pershing Rd",
        "AddressLine1": "165 W Pershing Rd",
        "Town": "Decatur",
        "StateOrProvince": "IL",
        "Postcode": "62526",
        "CountryID": 2,
        "Latitude": 39.87647,
        "Longitude": -88.95795,
        "ContactTelephone1": " (217) 877-4440",
        "RelatedURL": "http://carstations.com/6912",
        "DistanceUnit": 0
    },
    "Connections": [
        {
            "ID": 5265,
            "ConnectionTypeID": 1,
            "Reference": "J1772",
            "LevelID": 2
        }
    ],
    "StatusTypeID": 0,
    "DateLastStatusUpdate": "2017-11-04T14:04:00Z",
    "DataQualityLevel": 1,
    "DateCreated": "2011-11-11T12:05:00Z",
    "SubmissionStatusTypeID": 100
}