{
    "UserComments": [
        {
            "ID": 21592,
            "ChargePointID": 75393,
            "CommentTypeID": 10,
            "UserName": "et42",
            "Comment": "Charged successfully with a Hyundai Ioniq.",
            "Rating": 5,
            "DateCreated": "2019-10-03T10:47:18.367Z",
            "User": {
                "ID": 21695,
                "Username": "et42"
            },
            "CheckinStatusTypeID": 10
        }
    ],
    "MediaItems": [
        {
            "ID": 19806,
            "ChargePointID": 75393,
            "ItemURL": "https://s3-ap-southeast-2.amazonaws.com/openchargemap/images/CH/OCM75393/OCM-75393.orig.2019100310414959.png",
            "ItemThumbnailURL": "https://s3-ap-southeast-2.amazonaws.com/openchargemap/images/CH/OCM75393/OCM-75393.thmb.2019100310414959.png",
            "Comment": "",
            "IsEnabled": true,
            "IsVideo": false,
            "IsFeaturedItem": false,
            "IsExternalResource": false,
            "User": {
                "ID": 21695,
                "Username": "et42"
            },
            "DateCreated": "2019-10-03T10:42:00Z"
        }
    ],
    "IsRecentlyVerified": false,
    "ID": 75393,
    "UUID": "DF72DE6C-C69D-46EC-BDD7-9D0ED327E987",
    "DataProviderID": 1,
    "OperatorID": 23,
    "OperatorsReference": "17055",
    "UsageTypeID": 6,
    "UsageCost": "Free",
    "AddressInfo": {
        "ID": 75739,
        "Title": "Panoramahotel Brünig Kulm",
        "AddressLine1": "Passhohe",
        "Town": "Brünig",
        "Postcode": "3860",
        "CountryID": 217,
        "Latitude": 46.757323,
        "Longitude": 8.134835,
        "ContactTelephone1": "+41 33 971 00 40",
        "DistanceUnit": 0
    },
    "Connections": [
        {
            "ID": 108698,
            "ConnectionTypeID": 30,
            "StatusTypeID": 50,
            "LevelID": 2,
            "Amps": 32,
            "Voltage": 400,
            "PowerKW": 22,
            "CurrentTypeID": 20,
            "Quantity": 2
        },
        {
            "ID": 185645,
            "ConnectionTypeID": 1036,
            "StatusTypeID": 50,
            "LevelID": 2,
            "Amps": 32,
            "Voltage": 400,
            "PowerKW": 22,
            "CurrentTypeID": 20,
            "Quantity": 1
        }
    ],
    "NumberOfPoints": 3,
    "GeneralComments": "2 Tesla Connector, 1 common type 2, up to 22kW.Available for patrons only. Self park.",
    "StatusTypeID": 50,
    "DateLastStatusUpdate": "2019-10-03T14:42:00Z",
    "DataQualityLevel": 1,
    "DateCreated": "2016-12-14T19:49:00Z",
    "SubmissionStatusTypeID": 200
}