{
    "IsRecentlyVerified": false,
    "ID": 110706,
    "UUID": "2948AA58-9257-4EFD-9BEC-9B29220795E7",
    "DataProviderID": 2,
    "DataProvidersReference": "85127",
    "UsageTypeID": 1,
    "AddressInfo": {
        "ID": 111052,
        "Title": "Tim Horton's",
        "AddressLine1": "33 3rd St",
        "Town": "Chatham",
        "StateOrProvince": "ON",
        "Postcode": "N7M 2M4",
        "CountryID": 44,
        "Latitude": 42.40411,
        "Longitude": -82.189163,
        "ContactTelephone1": "519-358-1049",
        "AccessComments": "24 hours daily",
        "RelatedURL": "",
        "DistanceUnit": 0
    },
    "Connections": [
        {
            "ID": 155983,
            "ConnectionTypeID": 2,
            "LevelID": 3,
            "Amps": 100,
            "Voltage": 400,
            "PowerKW": 40,
            "CurrentTypeID": 30,
            "Quantity": 1
        },
        {
            "ID": 155984,
            "ConnectionTypeID": 32,
            "LevelID": 3,
            "Amps": 100,
            "Voltage": 400,
            "PowerKW": 40,
            "CurrentTypeID": 30,
            "Quantity": 1
        }
    ],
    "DateLastStatusUpdate": "2020-06-26T03:06:00Z",
    "DataQualityLevel": 3,
    "DateCreated": "2018-10-18T23:36:00Z",
    "SubmissionStatusTypeID": 100
}