{
    "IsRecentlyVerified": false,
    "ID": 184238,
    "UUID": "55589818-50A9-46E6-B1E1-9B3FFDE26CD4",
    "DataProviderID": 29,
    "DataProvidersReference": "15685",
    "AddressInfo": {
        "ID": 184597,
        "Title": "Lohstraße 26",
        "AddressLine1": "Lohstraße 26",
        "Town": "Schwaig",
        "Postcode": "85445",
        "CountryID": 87,
        "Latitude": 48.35462,
        "Longitude": 11.82885,
        "DistanceUnit": 0
    },
    "Connections": [
        {
            "ID": 292245,
            "ConnectionTypeID": 25,
            "StatusTypeID": 50,
            "LevelID": 2,
            "PowerKW": 22,
            "CurrentTypeID": 20
        },
        {
            "ID": 292246,
            "ConnectionTypeID": 25,
            "StatusTypeID": 50,
            "LevelID": 2,
            "PowerKW": 22,
            "CurrentTypeID": 20
        },
        {
            "ID": 292247,
            "ConnectionTypeID": 1036,
            "StatusTypeID": 50,
            "LevelID": 3,
            "PowerKW": 50,
            "CurrentTypeID": 20
        }
    ],
    "StatusTypeID": 50,
    "DateLastStatusUpdate": "2021-07-12T02:41:00Z",
    "MetadataValues": [
        {
            "ID": 16529,
            "MetadataFieldID": 4,
            "ItemValue": "Data from the German chargepoint registry provided by Bundesnetzagentur.de under the CC-BY 4.0 license"
        }
    ],
    "DataQualityLevel": 3,
    "DateCreated": "2021-07-08T10:05:00Z",
    "SubmissionStatusTypeID": 100
}