{
    "IsRecentlyVerified": false,
    "ID": 74818,
    "UUID": "69B1F5AA-7EED-4693-8530-F12BD3D90F42",
    "DataProviderID": 1,
    "OperatorID": 23,
    "OperatorsReference": "18407",
    "UsageTypeID": 7,
    "UsageCost": "Free",
    "AddressInfo": {
        "ID": 75164,
        "Title": "Le Mas Candille, Relais & Châteaux",
        "AddressLine1": "172 Boulevard Clément Rebuffel",
        "Town": "Mougins",
        "StateOrProvince": "Provence-Alpes-Côte d'Azur",
        "Postcode": "6250",
        "CountryID": 80,
        "Latitude": 43.599471,
        "Longitude": 6.991351,
        "DistanceUnit": 0
    },
    "Connections": [
        {
            "ID": 107939,
            "ConnectionTypeID": 30,
            "StatusTypeID": 50,
            "LevelID": 2,
            "Amps": 32,
            "Voltage": 400,
            "PowerKW": 22,
            "CurrentTypeID": 20,
            "Quantity": 1
        }
    ],
    "NumberOfPoints": 4,
    "GeneralComments": "1 Tesla Connector, up to 22kW.Available by reservation only. Please see valet.",
    "StatusTypeID": 50,
    "DateLastStatusUpdate": "2018-10-03T21:18:00Z",
    "DataQualityLevel": 1,
    "DateCreated": "2016-12-04T11:00:00Z",
    "SubmissionStatusTypeID": 200
}