{
    "IsRecentlyVerified": false,
    "ID": 120666,
    "UUID": "91C0A074-DC0D-42AE-979F-2844F3242747",
    "DataProviderID": 2,
    "DataProvidersReference": "76246",
    "OperatorID": 5,
    "UsageTypeID": 1,
    "AddressInfo": {
        "ID": 121012,
        "Title": "AVNET, INC",
        "AddressLine1": "2211 S. 47th Street",
        "Town": "Phoenix",
        "StateOrProvince": "AZ",
        "Postcode": "85034",
        "CountryID": 2,
        "Latitude": 33.4278812,
        "Longitude": -111.979992,
        "ContactTelephone1": "888-758-4389",
        "AccessComments": "24 hours daily",
        "RelatedURL": "http://www.chargepoint.com/",
        "DistanceUnit": 0
    },
    "Connections": [
        {
            "ID": 170033,
            "ConnectionTypeID": 1,
            "LevelID": 2,
            "Amps": 16,
            "Voltage": 230,
            "PowerKW": 3.7,
            "CurrentTypeID": 10,
            "Quantity": 2
        }
    ],
    "DateLastStatusUpdate": "2020-06-26T02:55:00Z",
    "DataQualityLevel": 3,
    "DateCreated": "2019-04-01T04:59:00Z",
    "SubmissionStatusTypeID": 100
}