{
    "UserComments": [
        {
            "ID": 369,
            "ChargePointID": 16484,
            "CommentTypeID": 100,
            "UserName": "timpootle",
            "Comment": "Located in Trafford Town Hall car park, but before the barrier so free access. Marker needs moving across the road from present location. https://maps.google.com/maps/ms?ll=53.459513,-2.287003&spn=0.000527,0.00142&t=h&z=20&vpsrc=6&iwloc=0004e0db16fcb78e299fa&msa=0&msid=216118552057636665904.0004e0db110cab4b161b9",
            "DateCreated": "2013-07-06T17:31:13.72Z",
            "User": {
                "ID": 1075,
                "Username": "timpootle"
            },
            "CheckinStatusTypeID": 210,
            "IsActionedByEditor": false
        }
    ],
    "IsRecentlyVerified": false,
    "ID": 16484,
    "UUID": "5637814D-9C22-4A1C-86B9-356BCE927992",
    "DataProviderID": 1,
    "OperatorID": 20,
    "OperatorsReference": "60023,60024",
    "UsageTypeID": 4,
    "UsageCost": "Free",
    "AddressInfo": {
        "ID": 16829,
        "Title": "Trafford Town Hall",
        "AddressLine1": "Warwick Road",
        "Town": "Trafford",
        "Postcode": "M32 0RP",
        "CountryID": 1,
        "Latitude": 53.4606,
        "Longitude": -2.287148,
        "AccessComments": "Free EV parking is available, with no time limit is imposed while vehicle is charging. Details subject to change, Driver should confirm details  with the carpark operator",
        "RelatedURL": "http://www.chargeyourcar.org.uk/",
        "DistanceUnit": 0
    },
    "Connections": [
        {
            "ID": 14908,
            "ConnectionTypeID": 25,
            "StatusTypeID": 50,
            "LevelID": 2,
            "Amps": 32,
            "Voltage": 230,
            "PowerKW": 7,
            "CurrentTypeID": 10,
            "Quantity": 2
        }
    ],
    "NumberOfPoints": 2,
    "GeneralComments": "CYC post 60023,60024. Powershare could result in a limited 16A charge",
    "StatusTypeID": 50,
    "DateLastStatusUpdate": "2017-05-02T12:49:00Z",
    "DataQualityLevel": 3,
    "DateCreated": "2013-04-27T04:45:00Z",
    "SubmissionStatusTypeID": 100
}