{
    "IsRecentlyVerified": false,
    "ID": 65384,
    "UUID": "C8F3A907-DD73-4A60-9992-21473CCCB244",
    "DataProviderID": 26,
    "DataProvidersReference": "84691",
    "OperatorID": 73,
    "OperatorsReference": "EV-Box EVB-P1536179",
    "UsageCost": "0.00 jaarabonnement",
    "AddressInfo": {
        "ID": 65730,
        "Title": "Chromiumweg 12",
        "AddressLine1": "Chromiumweg 12",
        "Town": "Amersfoort",
        "Postcode": "3812 NL",
        "CountryID": 159,
        "Latitude": 50.87739,
        "Longitude": 5.9708,
        "RelatedURL": "http://www.ev-box.nl",
        "DistanceUnit": 0
    },
    "Connections": [
        {
            "ID": 90092,
            "ConnectionTypeID": 25,
            "LevelID": 2,
            "PowerKW": 5,
            "CurrentTypeID": 10
        }
    ],
    "NumberOfPoints": 1,
    "StatusTypeID": 50,
    "DateLastStatusUpdate": "2016-06-04T02:38:00Z",
    "DataQualityLevel": 3,
    "DateCreated": "2016-04-27T09:41:00Z",
    "SubmissionStatusTypeID": 100
}