{
    "IsRecentlyVerified": false,
    "ID": 49284,
    "UUID": "87D1E5C8-DDC3-4896-92E2-FC3A3B90E04E",
    "DataProviderID": 1,
    "OperatorID": 20,
    "OperatorsReference": "60249,60250",
    "UsageTypeID": 4,
    "UsageCost": "Free",
    "AddressInfo": {
        "ID": 49630,
        "Title": "Trinity Bridge House",
        "AddressLine1": "Trinity Bridge House",
        "Town": "Bury",
        "Postcode": "BL9 0BT",
        "CountryID": 1,
        "Latitude": 53.5899065486705,
        "Longitude": -2.29463324019775,
        "DistanceUnit": 0
    },
    "Connections": [
        {
            "ID": 60925,
            "ConnectionTypeID": 25,
            "StatusTypeID": 75,
            "LevelID": 2,
            "Amps": 32,
            "Voltage": 230,
            "PowerKW": 7,
            "CurrentTypeID": 10,
            "Quantity": 2
        }
    ],
    "NumberOfPoints": 2,
    "StatusTypeID": 75,
    "DateLastStatusUpdate": "2020-05-09T05:14:00Z",
    "DataQualityLevel": 1,
    "DateCreated": "2015-07-16T15:24:00Z",
    "SubmissionStatusTypeID": 200
}