{
    "IsRecentlyVerified": false,
    "ID": 165272,
    "UUID": "C8B04CD0-3862-40A0-944A-F3E25689C973",
    "DataProviderID": 1,
    "DataProvidersReference": "TR-MER-001",
    "OperatorID": 70,
    "UsageTypeID": 1,
    "AddressInfo": {
        "ID": 165631,
        "Title": "Eşarj - Mersin Marina",
        "AddressLine1": "Eğriçam, Eğriçam Mah., Adnan Menderes Bulvarı, 33AG, Yenişehir",
        "Town": "Mersin",
        "StateOrProvince": "Mersin",
        "Postcode": "33160",
        "CountryID": 229,
        "Latitude": 36.771904,
        "Longitude": 34.570961,
        "ContactTelephone1": "+90 (850) 433 72 75",
        "ContactEmail": "destek@esarj.com",
        "RelatedURL": "https://esarj.com/en/map?s=TR-MER-001",
        "DistanceUnit": 0
    },
    "Connections": [
        {
            "ID": 236958,
            "ConnectionTypeID": 25,
            "LevelID": 2,
            "Amps": 32,
            "Voltage": 380,
            "PowerKW": 22,
            "Quantity": 2
        }
    ],
    "GeneralComments": "Eşarj Charging Systems",
    "StatusTypeID": 50,
    "DateLastStatusUpdate": "2020-08-26T08:19:00Z",
    "DataQualityLevel": 3,
    "DateCreated": "2020-08-26T08:19:00Z",
    "SubmissionStatusTypeID": 200
}