{
    "IsRecentlyVerified": false,
    "ID": 32268,
    "UUID": "C0840852-917A-463C-A219-66BB5F25590B",
    "DataProviderID": 26,
    "DataProvidersReference": "48118",
    "OperatorID": 178,
    "OperatorsReference": "EVnetNL DB0362",
    "UsageCost": "0.00 jaarabonnement",
    "AddressInfo": {
        "ID": 32614,
        "Title": "Limburgerstraat 9",
        "AddressLine1": "Limburgerstraat 9",
        "Town": "Eijsden-Margraten",
        "Postcode": "6267 CA",
        "CountryID": 159,
        "Latitude": 50.829127,
        "Longitude": 5.761243,
        "ContactTelephone1": "0800-3522365",
        "RelatedURL": "http://www.evnet.nl",
        "DistanceUnit": 0
    },
    "Connections": [
        {
            "ID": 35779,
            "ConnectionTypeID": 25,
            "LevelID": 2,
            "PowerKW": 11,
            "CurrentTypeID": 10
        }
    ],
    "NumberOfPoints": 1,
    "StatusTypeID": 50,
    "DateLastStatusUpdate": "2016-06-04T02:38:00Z",
    "DataQualityLevel": 3,
    "DateCreated": "2015-01-09T06:03:00Z",
    "SubmissionStatusTypeID": 100
}