{
    "MediaItems": [
        {
            "ID": 23366,
            "ChargePointID": 162032,
            "ItemURL": "https://s3-ap-southeast-2.amazonaws.com/openchargemap/images/AT/OCM162032/OCM-162032.orig.2020073109004430.jpg",
            "ItemThumbnailURL": "https://s3-ap-southeast-2.amazonaws.com/openchargemap/images/AT/OCM162032/OCM-162032.thmb.2020073109004430.jpg",
            "Comment": "",
            "IsEnabled": true,
            "IsVideo": false,
            "IsFeaturedItem": false,
            "IsExternalResource": false,
            "User": {
                "ID": 26760,
                "Username": "interssl.com"
            },
            "DateCreated": "2020-07-31T09:01:00Z"
        },
        {
            "ID": 23367,
            "ChargePointID": 162032,
            "ItemURL": "https://s3-ap-southeast-2.amazonaws.com/openchargemap/images/AT/OCM162032/OCM-162032.orig.2020073109010659.jpg",
            "ItemThumbnailURL": "https://s3-ap-southeast-2.amazonaws.com/openchargemap/images/AT/OCM162032/OCM-162032.thmb.2020073109010659.jpg",
            "Comment": "",
            "IsEnabled": true,
            "IsVideo": false,
            "IsFeaturedItem": false,
            "IsExternalResource": false,
            "User": {
                "ID": 26760,
                "Username": "interssl.com"
            },
            "DateCreated": "2020-07-31T09:01:00Z"
        },
        {
            "ID": 23365,
            "ChargePointID": 162032,
            "ItemURL": "https://s3-ap-southeast-2.amazonaws.com/openchargemap/images/AT/OCM162032/OCM-162032.orig.2020073109002430.jpg",
            "ItemThumbnailURL": "https://s3-ap-southeast-2.amazonaws.com/openchargemap/images/AT/OCM162032/OCM-162032.thmb.2020073109002430.jpg",
            "Comment": "",
            "IsEnabled": true,
            "IsVideo": false,
            "IsFeaturedItem": false,
            "IsExternalResource": false,
            "User": {
                "ID": 26760,
                "Username": "interssl.com"
            },
            "DateCreated": "2020-07-31T09:00:00Z"
        }
    ],
    "IsRecentlyVerified": false,
    "ID": 162032,
    "UUID": "BF6665E2-71F9-45B4-A2BA-DF8E79C26AC3",
    "DataProviderID": 1,
    "OperatorID": 1,
    "UsageTypeID": 1,
    "UsageCost": "free",
    "AddressInfo": {
        "ID": 162389,
        "Title": "Feuerwehr- und Vereinshaus Stams",
        "AddressLine1": "Thomas-Riss-Weg",
        "Town": "Gemeinde Stams",
        "StateOrProvince": "Bezirk Imst",
        "Postcode": "6422",
        "CountryID": 19,
        "Latitude": 47.27608514096258,
        "Longitude": 10.984415298399654,
        "RelatedURL": "https://www.stams.co.at/",
        "DistanceUnit": 0
    },
    "Connections": [
        {
            "ID": 233192,
            "ConnectionTypeID": 17,
            "StatusTypeID": 50,
            "LevelID": 2,
            "Amps": 16,
            "PowerKW": 11,
            "CurrentTypeID": 20,
            "Quantity": 1
        },
        {
            "ID": 233193,
            "ConnectionTypeID": 25,
            "StatusTypeID": 50,
            "LevelID": 2,
            "Amps": 16,
            "PowerKW": 11,
            "CurrentTypeID": 20,
            "Quantity": 1
        },
        {
            "ID": 233194,
            "ConnectionTypeID": 13,
            "StatusTypeID": 50,
            "LevelID": 2,
            "Amps": 13,
            "Voltage": 240,
            "PowerKW": 3.7,
            "CurrentTypeID": 10,
            "Quantity": 1
        }
    ],
    "NumberOfPoints": 1,
    "StatusTypeID": 50,
    "DateLastStatusUpdate": "2020-07-31T15:16:00Z",
    "DataQualityLevel": 1,
    "DateCreated": "2020-07-31T08:58:00Z",
    "SubmissionStatusTypeID": 200
}