{
    "IsRecentlyVerified": false,
    "ID": 62403,
    "UUID": "0432A76D-6B24-462C-9E01-C5F327734121",
    "DataProviderID": 1,
    "OperatorID": 23,
    "OperatorsReference": "13881",
    "UsageTypeID": 1,
    "UsageCost": "Free",
    "AddressInfo": {
        "ID": 62749,
        "Title": "The Wentworth Inn",
        "AddressLine1": "1 Carter Notch Rd",
        "Town": "Jackson",
        "StateOrProvince": "NH",
        "Postcode": "03846",
        "CountryID": 2,
        "Latitude": 44.1470977,
        "Longitude": -71.1819945,
        "ContactTelephone1": "603-383-9700  877-798-3752",
        "AccessComments": "24 hours daily; see front desk for access",
        "RelatedURL": "http://www.teslamotors.com/supercharger",
        "DistanceUnit": 0
    },
    "Connections": [
        {
            "ID": 79308,
            "ConnectionTypeID": 30,
            "StatusTypeID": 50,
            "LevelID": 2,
            "Amps": 16,
            "Voltage": 230,
            "PowerKW": 16,
            "CurrentTypeID": 10,
            "Quantity": 1
        }
    ],
    "NumberOfPoints": 1,
    "StatusTypeID": 50,
    "DateLastStatusUpdate": "2017-02-16T11:00:00Z",
    "DataQualityLevel": 3,
    "DateCreated": "2016-03-03T11:39:00Z",
    "SubmissionStatusTypeID": 100
}