{
    "IsRecentlyVerified": false,
    "ID": 159851,
    "UUID": "B225510B-C9B0-4266-9148-04BA78357347",
    "DataProviderID": 2,
    "DataProvidersReference": "163321",
    "OperatorID": 39,
    "UsageTypeID": 1,
    "AddressInfo": {
        "ID": 160208,
        "Title": "The Parkville Market",
        "AddressLine1": "1400 Park Street",
        "Town": "Hartford",
        "StateOrProvince": "CT",
        "Postcode": "06106",
        "CountryID": 2,
        "Latitude": 41.7587374,
        "Longitude": -72.7018156,
        "ContactTelephone1": "800-663-5633",
        "AccessComments": "MO: Not Specified; TU: Not Specified; WE: Not Specified; TH: Not Specified; FR: Not Specified; SA: Not Specified; SU: Not Specified",
        "RelatedURL": "http://www.semacharge.com/",
        "DistanceUnit": 0
    },
    "Connections": [
        {
            "ID": 230072,
            "ConnectionTypeID": 1,
            "LevelID": 2,
            "Amps": 16,
            "Voltage": 230,
            "PowerKW": 3.7,
            "CurrentTypeID": 10,
            "Quantity": 5
        }
    ],
    "StatusTypeID": 50,
    "DateLastStatusUpdate": "2020-06-26T03:05:00Z",
    "DataQualityLevel": 3,
    "DateCreated": "2020-06-26T03:05:00Z",
    "SubmissionStatusTypeID": 100
}