{
    "IsRecentlyVerified": false,
    "ID": 175405,
    "UUID": "4D97E861-C692-4FA7-978D-A75B2E606C2E",
    "DataProviderID": 1,
    "OperatorID": 3315,
    "UsageTypeID": 4,
    "UsageCost": "Free",
    "AddressInfo": {
        "ID": 175764,
        "Title": "Park Mains High School",
        "AddressLine1": "Park Mains High School",
        "Town": "Erskine",
        "StateOrProvince": "Scotland",
        "Postcode": "PA8 6EY",
        "CountryID": 1,
        "Latitude": 55.902776,
        "Longitude": -4.457299,
        "AccessComments": "Located in the middle row of the car park on the Leisure Centre side.",
        "DistanceUnit": 0
    },
    "Connections": [
        {
            "ID": 272136,
            "ConnectionTypeID": 25,
            "Reference": "53089",
            "StatusTypeID": 50,
            "LevelID": 2,
            "Amps": 32,
            "Voltage": 230,
            "PowerKW": 7,
            "CurrentTypeID": 10,
            "Quantity": 2
        },
        {
            "ID": 272154,
            "ConnectionTypeID": 25,
            "Reference": "53090",
            "StatusTypeID": 50,
            "LevelID": 2,
            "Amps": 32,
            "PowerKW": 7,
            "CurrentTypeID": 10,
            "Quantity": 2
        }
    ],
    "NumberOfPoints": 4,
    "StatusTypeID": 50,
    "DateLastStatusUpdate": "2021-05-18T08:13:00Z",
    "DataQualityLevel": 1,
    "DateCreated": "2021-05-17T16:39:00Z",
    "SubmissionStatusTypeID": 200
}