{
    "IsRecentlyVerified": false,
    "ID": 64747,
    "UUID": "5A57688C-9335-42FB-9BA9-265A4394D97A",
    "DataProviderID": 1,
    "OperatorID": 1,
    "UsageTypeID": 6,
    "AddressInfo": {
        "ID": 65093,
        "Title": "Istituto Professionale di Stato per l’Industria e l’Artigianato RENZO F R A U",
        "AddressLine1": "Via Aldo Moro, 3",
        "Town": "Sarnano",
        "StateOrProvince": "MC",
        "Postcode": "62028",
        "CountryID": 112,
        "Latitude": 43.033259828356954,
        "Longitude": 13.300991306954204,
        "ContactTelephone1": "0733.657794",
        "ContactEmail": "mcri040004@istruzione.it",
        "RelatedURL": "http://www.ipsiarenzofrau.gov.it/",
        "DistanceUnit": 0
    },
    "Connections": [
        {
            "ID": 83238,
            "ConnectionTypeID": 25,
            "StatusTypeID": 0,
            "LevelID": 2,
            "CurrentTypeID": 10,
            "Quantity": 1
        },
        {
            "ID": 83239,
            "ConnectionTypeID": 36,
            "StatusTypeID": 0,
            "LevelID": 2,
            "CurrentTypeID": 10,
            "Quantity": 1
        }
    ],
    "NumberOfPoints": 2,
    "StatusTypeID": 50,
    "DateLastStatusUpdate": "2016-03-16T14:50:00Z",
    "DataQualityLevel": 1,
    "DateCreated": "2016-03-16T14:50:00Z",
    "SubmissionStatusTypeID": 200
}