{
    "IsRecentlyVerified": false,
    "ID": 12964,
    "UUID": "46974E06-9A86-4081-A460-9C27C3D5BE9C",
    "DataProviderID": 15,
    "DataProvidersReference": "20612",
    "OperatorID": 42,
    "AddressInfo": {
        "ID": 12861,
        "Title": "4950 North State Rd 7",
        "AddressLine1": "4950 North State Rd 7",
        "Town": "Coconut Creek",
        "StateOrProvince": "FL",
        "Postcode": "33073",
        "CountryID": 2,
        "Latitude": 26.29158261,
        "Longitude": -80.20125747,
        "ContactTelephone1": "888-308-0524",
        "RelatedURL": "http://carstations.com/20612",
        "DistanceUnit": 0
    },
    "Connections": [
        {
            "ID": 10397,
            "ConnectionTypeID": 1,
            "Reference": "J1772",
            "LevelID": 2
        }
    ],
    "StatusTypeID": 0,
    "DateLastStatusUpdate": "2017-11-04T14:03:00Z",
    "DataQualityLevel": 2,
    "DateCreated": "2012-09-07T19:25:00Z",
    "SubmissionStatusTypeID": 100
}