{
    "IsRecentlyVerified": false,
    "ID": 186040,
    "UUID": "E120ABDF-320B-497E-BF06-6E775EB338EB",
    "DataProviderID": 29,
    "DataProvidersReference": "10809",
    "OperatorID": 45,
    "AddressInfo": {
        "ID": 186399,
        "Title": "Kapellenstr. 51",
        "AddressLine1": "Kapellenstr. 51",
        "Town": "Kriftel",
        "Postcode": "65830",
        "CountryID": 87,
        "Latitude": 50.081456,
        "Longitude": 8.455347,
        "DistanceUnit": 0
    },
    "Connections": [
        {
            "ID": 297548,
            "ConnectionTypeID": 25,
            "StatusTypeID": 50,
            "PowerKW": 17,
            "CurrentTypeID": 30
        },
        {
            "ID": 297549,
            "ConnectionTypeID": 33,
            "StatusTypeID": 50,
            "PowerKW": 17,
            "CurrentTypeID": 30
        },
        {
            "ID": 297550,
            "ConnectionTypeID": 25,
            "StatusTypeID": 50,
            "PowerKW": 17,
            "CurrentTypeID": 30
        },
        {
            "ID": 297551,
            "ConnectionTypeID": 33,
            "StatusTypeID": 50,
            "PowerKW": 17,
            "CurrentTypeID": 30
        }
    ],
    "StatusTypeID": 50,
    "DateLastStatusUpdate": "2021-07-12T02:44:00Z",
    "MetadataValues": [
        {
            "ID": 18282,
            "MetadataFieldID": 4,
            "ItemValue": "Data from the German chargepoint registry provided by Bundesnetzagentur.de under the CC-BY 4.0 license"
        }
    ],
    "DataQualityLevel": 3,
    "DateCreated": "2021-07-12T02:44:00Z",
    "SubmissionStatusTypeID": 100
}