{
    "IsRecentlyVerified": false,
    "ID": 173895,
    "UUID": "A5DFAD79-4CFA-4BDC-A2CB-22E874229D8B",
    "DataProviderID": 1,
    "OperatorID": 3377,
    "UsageTypeID": 6,
    "AddressInfo": {
        "ID": 174254,
        "Title": "Febrer Gasolineras. E.E.S.S.",
        "AddressLine1": "Camí de Son Rapinya, 30",
        "Town": "Palma",
        "StateOrProvince": "Balearic Islands",
        "Postcode": "07013",
        "CountryID": 210,
        "Latitude": 39.58504854884876,
        "Longitude": 2.6189574276334042,
        "RelatedURL": "http://etecnic.es",
        "DistanceUnit": 0
    },
    "Connections": [
        {
            "ID": 267513,
            "ConnectionTypeID": 2,
            "Reference": "INGETEAM EdRR 1",
            "StatusTypeID": 50,
            "LevelID": 3,
            "Amps": 72,
            "Voltage": 400,
            "PowerKW": 50,
            "CurrentTypeID": 20,
            "Quantity": 1
        },
        {
            "ID": 267514,
            "ConnectionTypeID": 33,
            "Reference": "INGETEAM EdRR 1",
            "StatusTypeID": 50,
            "LevelID": 3,
            "Amps": 72,
            "Voltage": 400,
            "PowerKW": 50,
            "CurrentTypeID": 20,
            "Quantity": 1
        },
        {
            "ID": 267515,
            "ConnectionTypeID": 1036,
            "Reference": "INGETEAM EdRR 1",
            "StatusTypeID": 50,
            "LevelID": 2,
            "Amps": 32,
            "Voltage": 400,
            "PowerKW": 22,
            "CurrentTypeID": 20,
            "Quantity": 1
        }
    ],
    "NumberOfPoints": 1,
    "StatusTypeID": 50,
    "DateLastStatusUpdate": "2021-03-05T10:31:00Z",
    "DataQualityLevel": 1,
    "DateCreated": "2021-03-05T10:31:00Z",
    "SubmissionStatusTypeID": 200
}