{
    "IsRecentlyVerified": false,
    "ID": 112784,
    "UUID": "0BDB4CD3-E1CB-469B-8BBC-5D14C10A59C5",
    "DataProviderID": 1,
    "OperatorID": 23,
    "OperatorsReference": "47389",
    "UsageTypeID": 1,
    "AddressInfo": {
        "ID": 113130,
        "Title": "NH Bratislava Gate One",
        "AddressLine1": "Ambrusova 7",
        "Town": "Bratislava",
        "StateOrProvince": "Slovakia",
        "Postcode": "82104",
        "CountryID": 204,
        "Latitude": 48.166271,
        "Longitude": 17.177402,
        "ContactTelephone1": "+421232770110",
        "ContactEmail": "nhgateone@nh-hotels.com",
        "AccessComments": "Garage -1 floor",
        "RelatedURL": "https://www.nh-hotels.com/hotel/nh-bratislava-gate-one",
        "DistanceUnit": 0
    },
    "Connections": [
        {
            "ID": 158820,
            "ConnectionTypeID": 30,
            "StatusTypeID": 50,
            "LevelID": 2,
            "Amps": 32,
            "Voltage": 230,
            "PowerKW": 17,
            "CurrentTypeID": 30,
            "Quantity": 2
        }
    ],
    "NumberOfPoints": 3,
    "GeneralComments": "Charging free, garage parking paid",
    "StatusTypeID": 50,
    "DateLastStatusUpdate": "2019-01-04T06:39:00Z",
    "DataQualityLevel": 1,
    "DateCreated": "2018-11-14T10:36:00Z",
    "SubmissionStatusTypeID": 200
}