{
    "IsRecentlyVerified": false,
    "ID": 158761,
    "UUID": "D0F2FA3F-4154-461B-923F-ED93A7B87555",
    "DataProviderID": 2,
    "DataProvidersReference": "155554",
    "OperatorID": 59,
    "UsageTypeID": 1,
    "AddressInfo": {
        "ID": 159118,
        "Title": "Greenlots - 12523A",
        "AddressLine1": "7952 W 3rd St",
        "Town": "Los Angeles",
        "StateOrProvince": "CA",
        "Postcode": "90048",
        "CountryID": 2,
        "Latitude": 34.0716781616211,
        "Longitude": -118.363182067871,
        "ContactTelephone1": "855-900-7584",
        "AccessComments": "24 hours daily",
        "RelatedURL": "http://greenlots.com/",
        "DistanceUnit": 0
    },
    "Connections": [
        {
            "ID": 228787,
            "ConnectionTypeID": 1,
            "LevelID": 2,
            "Amps": 16,
            "Voltage": 230,
            "PowerKW": 3.7,
            "CurrentTypeID": 10,
            "Quantity": 1
        }
    ],
    "StatusTypeID": 50,
    "DateLastStatusUpdate": "2020-06-26T02:56:00Z",
    "DataQualityLevel": 3,
    "DateCreated": "2020-06-26T02:56:00Z",
    "SubmissionStatusTypeID": 100
}