{
    "IsRecentlyVerified": false,
    "ID": 188377,
    "UUID": "C3EBD2C0-8425-4CDD-8DD0-0F002AAB473C",
    "DataProviderID": 1,
    "OperatorID": 80,
    "UsageTypeID": 4,
    "AddressInfo": {
        "ID": 188736,
        "Title": "Via Martiri 16 Marzo",
        "AddressLine1": "Via Martiri 16 Marzo",
        "Town": "Scalea",
        "StateOrProvince": "Calabria",
        "Postcode": "87029",
        "CountryID": 112,
        "Latitude": 39.81063432612865,
        "Longitude": 15.790574839737815,
        "DistanceUnit": 0
    },
    "Connections": [
        {
            "ID": 304147,
            "ConnectionTypeID": 25,
            "StatusTypeID": 50,
            "LevelID": 2,
            "PowerKW": 22,
            "CurrentTypeID": 10,
            "Quantity": 1
        }
    ],
    "NumberOfPoints": 1,
    "StatusTypeID": 50,
    "DateLastStatusUpdate": "2021-07-22T20:53:00Z",
    "DataQualityLevel": 1,
    "DateCreated": "2021-07-19T20:48:00Z",
    "SubmissionStatusTypeID": 200
}