{
    "IsRecentlyVerified": false,
    "ID": 116195,
    "UUID": "00BD3C98-6C7A-4418-997C-FCEDEBE1B2B6",
    "DataProviderID": 2,
    "DataProvidersReference": "105288",
    "OperatorID": 5,
    "UsageTypeID": 1,
    "AddressInfo": {
        "ID": 116541,
        "Title": "TRIOVEST",
        "AddressLine1": "4370 Still Creek Dr",
        "Town": "Burnaby",
        "StateOrProvince": "BC",
        "Postcode": "V5C",
        "CountryID": 44,
        "Latitude": 49.2591459,
        "Longitude": -123.0074793,
        "ContactTelephone1": "888-758-4389",
        "AccessComments": "24 hours daily",
        "RelatedURL": "http://www.chargepoint.com/",
        "DistanceUnit": 0
    },
    "Connections": [
        {
            "ID": 163272,
            "ConnectionTypeID": 1,
            "LevelID": 2,
            "Amps": 16,
            "Voltage": 230,
            "PowerKW": 3,
            "CurrentTypeID": 10,
            "Quantity": 2
        }
    ],
    "DateLastStatusUpdate": "2019-12-24T09:25:00Z",
    "DataQualityLevel": 3,
    "DateCreated": "2019-02-11T07:13:00Z",
    "SubmissionStatusTypeID": 100
}