{
    "IsRecentlyVerified": false,
    "ID": 64585,
    "UUID": "9F43D088-CD04-406C-BE73-36D16BD1F176",
    "DataProviderID": 1,
    "OperatorID": 45,
    "UsageTypeID": 6,
    "AddressInfo": {
        "ID": 64931,
        "Title": "Hotel Eckert",
        "AddressLine1": "Basler Straße",
        "Town": "Grenzach",
        "StateOrProvince": "Landkreis Lörrach",
        "Postcode": "79639",
        "CountryID": 87,
        "Latitude": 47.55334,
        "Longitude": 7.658329999999978,
        "ContactTelephone1": "+49 7624 91720",
        "AccessComments": "Für Hotelgäste. Das Hotel nimmt am \"Tesla Destination Charging Program\" teil.",
        "RelatedURL": "http://www.hotel-eckert.de/",
        "DistanceUnit": 0
    },
    "Connections": [
        {
            "ID": 82994,
            "ConnectionTypeID": 30,
            "StatusTypeID": 50,
            "LevelID": 2,
            "PowerKW": 11,
            "Quantity": 2
        },
        {
            "ID": 82995,
            "ConnectionTypeID": 25,
            "StatusTypeID": 50,
            "LevelID": 2,
            "Amps": 16,
            "Voltage": 400,
            "PowerKW": 11,
            "CurrentTypeID": 20,
            "Quantity": 1
        }
    ],
    "NumberOfPoints": 3,
    "StatusTypeID": 50,
    "DateLastStatusUpdate": "2016-03-11T12:45:00Z",
    "DataQualityLevel": 1,
    "DateCreated": "2016-03-11T12:45:00Z",
    "SubmissionStatusTypeID": 200
}