{
    "IsRecentlyVerified": false,
    "ID": 136200,
    "UUID": "B6B6B53A-43AF-4393-9E43-275110C55A81",
    "DataProviderID": 18,
    "DataProvidersReference": "c5194e3607ca860e4118b1ef63533c95",
    "OperatorID": 2244,
    "UsageTypeID": 4,
    "AddressInfo": {
        "ID": 136546,
        "Title": "186 Queen's Gate",
        "AddressLine1": "186 Queen's Gate",
        "Town": "London",
        "Postcode": "SW7 5HL",
        "CountryID": 1,
        "Latitude": 51.499715,
        "Longitude": -0.179487,
        "AccessComments": "",
        "RelatedURL": "https://www.ubitricity.com",
        "DistanceUnit": 0
    },
    "Connections": [
        {
            "ID": 190629,
            "ConnectionTypeID": 25,
            "Reference": "suby1100000244",
            "StatusTypeID": 50,
            "LevelID": 2,
            "Amps": 16,
            "Voltage": 230,
            "PowerKW": 3.7,
            "CurrentTypeID": 10
        }
    ],
    "StatusTypeID": 0,
    "DateLastStatusUpdate": "2021-04-25T05:46:00Z",
    "MetadataValues": [
        {
            "ID": 6052,
            "MetadataFieldID": 4,
            "ItemValue": "Contains public sector information licensed under the Open Government Licence v2.0. http://www.nationalarchives.gov.uk/doc/open-government-licence/version/2/"
        }
    ],
    "DataQualityLevel": 3,
    "DateCreated": "2019-12-24T05:22:00Z",
    "SubmissionStatusTypeID": 100
}