{
    "UserComments": [
        {
            "ID": 19825,
            "ChargePointID": 68970,
            "CommentTypeID": 10,
            "UserName": "Sven-svall",
            "Comment": "Gratis 22KWh laddning till min Zoe",
            "Rating": 4,
            "DateCreated": "2018-07-20T19:07:41.343Z",
            "User": {
                "ID": 16865,
                "Username": "Sven-svall"
            },
            "CheckinStatusTypeID": 10
        }
    ],
    "MediaItems": [
        {
            "ID": 15948,
            "ChargePointID": 68970,
            "ItemURL": "https://s3-ap-southeast-2.amazonaws.com/openchargemap/images/SE/OCM68970/OCM-68970.orig.2018072019091973.jpg",
            "ItemThumbnailURL": "https://s3-ap-southeast-2.amazonaws.com/openchargemap/images/SE/OCM68970/OCM-68970.thmb.2018072019091973.jpg",
            "Comment": "",
            "IsEnabled": true,
            "IsVideo": false,
            "IsFeaturedItem": false,
            "IsExternalResource": false,
            "User": {
                "ID": 16865,
                "Username": "Sven-svall"
            },
            "DateCreated": "2018-07-20T19:10:00Z"
        }
    ],
    "IsRecentlyVerified": false,
    "ID": 68970,
    "UUID": "A3B32602-08B2-4245-98A0-2BFA6B0D4D3B",
    "DataProviderID": 1,
    "DataProvidersReference": "3435",
    "AddressInfo": {
        "ID": 69316,
        "Title": "Laddstation Öje / Centrala Edsbyn",
        "AddressLine1": "Långgatan 22",
        "Town": "EDSBYN",
        "StateOrProvince": "GÄVLEBORG",
        "Postcode": "82832",
        "CountryID": 216,
        "Latitude": 61.37644,
        "Longitude": 15.81835,
        "AccessComments": "Första till höger när man kör in på parkeringen.",
        "DistanceUnit": 0
    },
    "Connections": [
        {
            "ID": 96758,
            "ConnectionTypeID": 0,
            "Reference": "1",
            "LevelID": 2,
            "Amps": 32,
            "Voltage": 400,
            "PowerKW": 22,
            "Comments": "Mode 3"
        },
        {
            "ID": 96759,
            "ConnectionTypeID": 0,
            "Reference": "2",
            "LevelID": 2,
            "Amps": 32,
            "Voltage": 400,
            "PowerKW": 22,
            "Comments": "Mode 3"
        }
    ],
    "NumberOfPoints": 2,
    "DateLastStatusUpdate": "2020-05-26T08:24:00Z",
    "DataQualityLevel": 2,
    "DateCreated": "2016-06-25T03:52:00Z",
    "SubmissionStatusTypeID": 100
}