{
    "IsRecentlyVerified": false,
    "ID": 110709,
    "UUID": "678067EB-38B7-419A-B127-BAF0427FA93B",
    "DataProviderID": 2,
    "DataProvidersReference": "99520",
    "OperatorID": 5,
    "UsageTypeID": 1,
    "AddressInfo": {
        "ID": 111055,
        "Title": "MEIJER STORES",
        "AddressLine1": "13355 E 10 Mile Rd",
        "Town": "Warren",
        "StateOrProvince": "MI",
        "Postcode": "48089",
        "CountryID": 2,
        "Latitude": 42.4798406,
        "Longitude": -82.989701,
        "ContactTelephone1": "888-758-4389",
        "AccessComments": "24 hours daily",
        "RelatedURL": "http://www.chargepoint.com/",
        "DistanceUnit": 0
    },
    "Connections": [
        {
            "ID": 155987,
            "ConnectionTypeID": 1,
            "LevelID": 2,
            "Amps": 16,
            "Voltage": 230,
            "PowerKW": 3.7,
            "CurrentTypeID": 10,
            "Quantity": 2
        }
    ],
    "DateLastStatusUpdate": "2020-06-26T03:06:00Z",
    "DataQualityLevel": 3,
    "DateCreated": "2018-10-18T23:36:00Z",
    "SubmissionStatusTypeID": 100
}