{
    "IsRecentlyVerified": false,
    "ID": 51053,
    "UUID": "ED91DD8C-245A-4279-B6D1-7212B249273E",
    "DataProviderID": 26,
    "DataProvidersReference": "64670",
    "OperatorID": 73,
    "OperatorsReference": "EV-Box EVB-P1413082",
    "UsageCost": "0.00 jaarabonnement",
    "AddressInfo": {
        "ID": 51399,
        "Title": "Eikenlaan 43",
        "AddressLine1": "Eikenlaan 43",
        "Town": "Weststellingwerf",
        "Postcode": "8471 KD",
        "CountryID": 159,
        "Latitude": 52.88142,
        "Longitude": 6.01308,
        "RelatedURL": "http://www.ev-box.nl",
        "DistanceUnit": 0
    },
    "Connections": [
        {
            "ID": 63109,
            "ConnectionTypeID": 25,
            "LevelID": 2,
            "PowerKW": 5,
            "CurrentTypeID": 10
        }
    ],
    "NumberOfPoints": 1,
    "StatusTypeID": 50,
    "DateLastStatusUpdate": "2016-06-04T02:55:00Z",
    "DataQualityLevel": 3,
    "DateCreated": "2015-07-22T09:54:00Z",
    "SubmissionStatusTypeID": 100
}