{
    "IsRecentlyVerified": false,
    "ID": 54089,
    "UUID": "9B21B563-79C2-4D0C-84FC-DE17ED902065",
    "DataProviderID": 1,
    "OperatorID": 101,
    "UsageTypeID": 4,
    "AddressInfo": {
        "ID": 54435,
        "Title": "Parkplatz Triamare",
        "AddressLine1": "Mühlbacher Straße 2",
        "Town": "Bad Neustadt",
        "Postcode": "97616",
        "CountryID": 87,
        "Latitude": 50.3203,
        "Longitude": 10.21588,
        "ContactTelephone1": "+49 (0)9771 62200",
        "AccessComments": "Rund um die Uhr (24/7) nutzbar. Umgebung:Innenstadt Bad Neustadt 5 min zu Fuß\r\n",
        "RelatedURL": "http://www.stw-badnes.de",
        "DistanceUnit": 0
    },
    "Connections": [
        {
            "ID": 67778,
            "ConnectionTypeID": 28,
            "StatusTypeID": 50,
            "LevelID": 2,
            "PowerKW": 3.7,
            "CurrentTypeID": 10,
            "Quantity": 1
        },
        {
            "ID": 67779,
            "ConnectionTypeID": 25,
            "StatusTypeID": 50,
            "LevelID": 2,
            "PowerKW": 11,
            "CurrentTypeID": 20,
            "Quantity": 1
        },
        {
            "ID": 67780,
            "ConnectionTypeID": 16,
            "StatusTypeID": 50,
            "LevelID": 2,
            "PowerKW": 3.7,
            "CurrentTypeID": 10,
            "Quantity": 0
        },
        {
            "ID": 67781,
            "ConnectionTypeID": 17,
            "StatusTypeID": 50,
            "LevelID": 2,
            "PowerKW": 0,
            "CurrentTypeID": 20,
            "Quantity": 0
        },
        {
            "ID": 67782,
            "ConnectionTypeID": 2,
            "StatusTypeID": 50,
            "LevelID": 2,
            "PowerKW": 0,
            "CurrentTypeID": 30,
            "Quantity": 0
        },
        {
            "ID": 67783,
            "ConnectionTypeID": 33,
            "StatusTypeID": 50,
            "LevelID": 2,
            "PowerKW": 0,
            "CurrentTypeID": 30,
            "Quantity": 0
        }
    ],
    "NumberOfPoints": 2,
    "StatusTypeID": 50,
    "DateLastStatusUpdate": "2015-09-23T19:12:00Z",
    "DataQualityLevel": 1,
    "DateCreated": "2015-09-22T20:52:00Z",
    "SubmissionStatusTypeID": 200
}