{
    "IsRecentlyVerified": false,
    "ID": 30748,
    "UUID": "6C89A1C0-58B6-4634-A2A0-72A0D2F5973D",
    "DataProviderID": 1,
    "DataProvidersReference": "1052",
    "AddressInfo": {
        "ID": 31094,
        "Title": "ByHaven P-hus, Lillestrøm",
        "AddressLine1": "Voldgata 7-9",
        "Town": "LILLESTRØM",
        "StateOrProvince": "Viken",
        "Postcode": "2000",
        "CountryID": 168,
        "Latitude": 59.95522,
        "Longitude": 11.04685,
        "AccessComments": "I p-huset plan 2 underetasje.",
        "DistanceUnit": 0
    },
    "Connections": [
        {
            "ID": 33977,
            "ConnectionTypeID": 0,
            "Reference": "1",
            "LevelID": 2,
            "Amps": 16,
            "Voltage": 230,
            "PowerKW": 3.7,
            "Comments": "Mode 1"
        },
        {
            "ID": 88805,
            "ConnectionTypeID": 0,
            "Reference": "2",
            "LevelID": 2,
            "Amps": 16,
            "Voltage": 230,
            "PowerKW": 3.7,
            "Comments": "Mode 1"
        }
    ],
    "NumberOfPoints": 2,
    "DateLastStatusUpdate": "2020-05-26T08:23:00Z",
    "DataQualityLevel": 2,
    "DateCreated": "2014-12-09T09:00:00Z",
    "SubmissionStatusTypeID": 100
}