{
    "IsRecentlyVerified": false,
    "ID": 87382,
    "UUID": "0E52BC91-BDD4-435A-BB65-B50BA5BF6615",
    "DataProviderID": 1,
    "OperatorID": 3,
    "OperatorsReference": "PG-80880",
    "UsageTypeID": 6,
    "UsageCost": "Free",
    "AddressInfo": {
        "ID": 87728,
        "Title": "Ocsl",
        "AddressLine1": "21 Blackstone Road",
        "Town": "Huntingdon",
        "Postcode": "PE29 6EF",
        "CountryID": 1,
        "Latitude": 52.345718,
        "Longitude": -0.189524,
        "DistanceUnit": 0
    },
    "Connections": [
        {
            "ID": 123877,
            "ConnectionTypeID": 25,
            "StatusTypeID": 50,
            "LevelID": 2,
            "Amps": 32,
            "Voltage": 400,
            "PowerKW": 22,
            "CurrentTypeID": 20,
            "Quantity": 2
        }
    ],
    "NumberOfPoints": 4,
    "GeneralComments": "This is an open charge unit installed at the OCSL management services site in Marketing House, Blackstone Road, Huntingdon, Cambridgeshire",
    "StatusTypeID": 50,
    "DateLastStatusUpdate": "2017-12-22T06:28:00Z",
    "DataQualityLevel": 1,
    "DateCreated": "2017-05-06T05:18:00Z",
    "SubmissionStatusTypeID": 200
}