{
    "IsRecentlyVerified": false,
    "ID": 178089,
    "UUID": "7E9ED973-C2E1-430E-9860-2613D686B475",
    "DataProviderID": 29,
    "DataProvidersReference": "16348",
    "AddressInfo": {
        "ID": 178448,
        "Title": "Kapellenstraße 6",
        "AddressLine1": "Kapellenstraße 6",
        "Town": "Schmallenberg",
        "Postcode": "57392",
        "CountryID": 87,
        "Latitude": 51.129941,
        "Longitude": 8.265852,
        "DistanceUnit": 0
    },
    "Connections": [
        {
            "ID": 278049,
            "ConnectionTypeID": 25,
            "StatusTypeID": 50,
            "LevelID": 2,
            "PowerKW": 22,
            "CurrentTypeID": 20
        },
        {
            "ID": 278050,
            "ConnectionTypeID": 25,
            "StatusTypeID": 50,
            "LevelID": 2,
            "PowerKW": 22,
            "CurrentTypeID": 20
        }
    ],
    "StatusTypeID": 0,
    "DateLastStatusUpdate": "2021-07-12T02:46:00Z",
    "MetadataValues": [
        {
            "ID": 10383,
            "MetadataFieldID": 4,
            "ItemValue": "Data from the German chargepoint registry provided by Bundesnetzagentur.de under the CC-BY 4.0 license"
        }
    ],
    "DataQualityLevel": 3,
    "DateCreated": "2021-07-08T09:49:00Z",
    "SubmissionStatusTypeID": 100
}