{
    "IsRecentlyVerified": false,
    "ID": 181963,
    "UUID": "F323A677-FED9-450D-803A-8CD1601B92A1",
    "DataProviderID": 29,
    "DataProvidersReference": "14139",
    "OperatorID": 103,
    "AddressInfo": {
        "ID": 182322,
        "Title": "Zunftstraße 12",
        "AddressLine1": "Zunftstraße 12",
        "Town": "Dessau-Roßlau",
        "Postcode": "06847",
        "CountryID": 87,
        "Latitude": 51.817284,
        "Longitude": 12.218428,
        "DistanceUnit": 0
    },
    "Connections": [
        {
            "ID": 287061,
            "ConnectionTypeID": 33,
            "StatusTypeID": 50,
            "LevelID": 3,
            "PowerKW": 50,
            "CurrentTypeID": 30
        },
        {
            "ID": 287062,
            "ConnectionTypeID": 2,
            "StatusTypeID": 50,
            "LevelID": 3,
            "PowerKW": 50,
            "CurrentTypeID": 30
        },
        {
            "ID": 299917,
            "ConnectionTypeID": 1036,
            "StatusTypeID": 50,
            "LevelID": 3,
            "PowerKW": 43,
            "CurrentTypeID": 20
        }
    ],
    "StatusTypeID": 50,
    "DateLastStatusUpdate": "2021-07-12T02:48:00Z",
    "MetadataValues": [
        {
            "ID": 14257,
            "MetadataFieldID": 4,
            "ItemValue": "Data from the German chargepoint registry provided by Bundesnetzagentur.de under the CC-BY 4.0 license"
        }
    ],
    "DataQualityLevel": 3,
    "DateCreated": "2021-07-08T10:02:00Z",
    "SubmissionStatusTypeID": 100
}