{
    "UserComments": [
        {
            "ID": 22855,
            "ChargePointID": 32134,
            "CommentTypeID": 1000,
            "UserName": "Lode Nolf",
            "Comment": "Hors service",
            "Rating": 1,
            "DateCreated": "2020-07-04T10:29:05.37Z",
            "User": {
                "ID": 26396,
                "Username": "Lode Nolf"
            },
            "CheckinStatusTypeID": 20,
            "IsActionedByEditor": false
        }
    ],
    "MediaItems": [
        {
            "ID": 878,
            "ChargePointID": 32134,
            "ItemURL": "https://s3-ap-southeast-2.amazonaws.com/openchargemap/images/BE/OCM32134/OCM-32134.orig.2015010908343514.jpg",
            "ItemThumbnailURL": "https://s3-ap-southeast-2.amazonaws.com/openchargemap/images/BE/OCM32134/OCM-32134.thmb.2015010908343514.jpg",
            "Comment": "",
            "IsEnabled": true,
            "IsVideo": false,
            "IsFeaturedItem": false,
            "IsExternalResource": false,
            "User": {
                "ID": 1761,
                "Username": "filip.vanrickstal"
            },
            "DateCreated": "2015-01-09T08:35:00Z"
        },
        {
            "ID": 879,
            "ChargePointID": 32134,
            "ItemURL": "https://s3-ap-southeast-2.amazonaws.com/openchargemap/images/BE/OCM32134/OCM-32134.orig.2015010908345525.jpg",
            "ItemThumbnailURL": "https://s3-ap-southeast-2.amazonaws.com/openchargemap/images/BE/OCM32134/OCM-32134.thmb.2015010908345525.jpg",
            "Comment": "",
            "IsEnabled": true,
            "IsVideo": false,
            "IsFeaturedItem": false,
            "IsExternalResource": false,
            "User": {
                "ID": 1761,
                "Username": "filip.vanrickstal"
            },
            "DateCreated": "2015-01-09T08:35:00Z"
        },
        {
            "ID": 880,
            "ChargePointID": 32134,
            "ItemURL": "https://s3-ap-southeast-2.amazonaws.com/openchargemap/images/BE/OCM32134/OCM-32134.orig.2015010908351962.jpg",
            "ItemThumbnailURL": "https://s3-ap-southeast-2.amazonaws.com/openchargemap/images/BE/OCM32134/OCM-32134.thmb.2015010908351962.jpg",
            "Comment": "",
            "IsEnabled": true,
            "IsVideo": false,
            "IsFeaturedItem": false,
            "IsExternalResource": false,
            "User": {
                "ID": 1761,
                "Username": "filip.vanrickstal"
            },
            "DateCreated": "2015-01-09T08:35:00Z"
        },
        {
            "ID": 877,
            "ChargePointID": 32134,
            "ItemURL": "https://s3-ap-southeast-2.amazonaws.com/openchargemap/images/BE/OCM32134/OCM-32134.orig.2015010908335697.jpg",
            "ItemThumbnailURL": "https://s3-ap-southeast-2.amazonaws.com/openchargemap/images/BE/OCM32134/OCM-32134.thmb.2015010908335697.jpg",
            "Comment": "",
            "IsEnabled": true,
            "IsVideo": false,
            "IsFeaturedItem": false,
            "IsExternalResource": false,
            "User": {
                "ID": 1761,
                "Username": "filip.vanrickstal"
            },
            "DateCreated": "2015-01-09T08:34:00Z"
        }
    ],
    "IsRecentlyVerified": false,
    "ID": 32134,
    "UUID": "2ABEAAC3-4D98-464D-9126-C3C4229BF40E",
    "DataProviderID": 26,
    "DataProvidersReference": "49607",
    "OperatorID": 54,
    "OperatorsReference": "Mettet",
    "UsageCost": "0.00 jaarabonnement",
    "AddressInfo": {
        "ID": 32480,
        "Title": "Place Joseph Meunier",
        "AddressLine1": "Place Joseph Meunier",
        "Town": "Mettet",
        "Postcode": "5640;5641;56",
        "CountryID": 26,
        "Latitude": 50.32062099493,
        "Longitude": 4.6576867997646,
        "RelatedURL": "http://www.ze-mo.be/",
        "DistanceUnit": 0
    },
    "Connections": [
        {
            "ID": 35645,
            "ConnectionTypeID": 25,
            "LevelID": 2,
            "PowerKW": 22,
            "CurrentTypeID": 10
        }
    ],
    "NumberOfPoints": 1,
    "StatusTypeID": 50,
    "DateLastStatusUpdate": "2020-07-04T10:29:00Z",
    "DataQualityLevel": 3,
    "DateCreated": "2015-01-09T06:03:00Z",
    "SubmissionStatusTypeID": 100
}