{
    "IsRecentlyVerified": false,
    "ID": 128256,
    "UUID": "0F652120-48D3-4F8A-A95F-3C195B0835C9",
    "DataProviderID": 1,
    "OperatorID": 80,
    "UsageTypeID": 4,
    "AddressInfo": {
        "ID": 128602,
        "Title": "Briga Novarese Via Roma | EnelX",
        "AddressLine1": "Via Roma",
        "Town": "Briga Novarese",
        "StateOrProvince": "NO",
        "Postcode": "28010",
        "CountryID": 112,
        "Latitude": 45.7301553118556,
        "Longitude": 8.4471302864888,
        "RelatedURL": "https://www.enelx.com/it/it/emobility",
        "DistanceUnit": 0
    },
    "Connections": [
        {
            "ID": 179530,
            "ConnectionTypeID": 25,
            "StatusTypeID": 50,
            "LevelID": 2,
            "Amps": 32,
            "Voltage": 400,
            "PowerKW": 22,
            "CurrentTypeID": 20,
            "Quantity": 2
        }
    ],
    "NumberOfPoints": 2,
    "StatusTypeID": 50,
    "DateLastStatusUpdate": "2019-06-20T10:25:00Z",
    "DataQualityLevel": 1,
    "DateCreated": "2019-06-20T10:25:00Z",
    "SubmissionStatusTypeID": 200
}