{
    "IsRecentlyVerified": false,
    "ID": 108712,
    "UUID": "B58D51D1-8186-4AF9-89BA-77F98AFA0DE2",
    "DataProviderID": 1,
    "OperatorID": 23,
    "OperatorsReference": "46391",
    "UsageTypeID": 4,
    "AddressInfo": {
        "ID": 109058,
        "Title": "Parking Bodin",
        "AddressLine1": "5 Rue des Pins",
        "Town": "La Barre-de-Monts",
        "Postcode": "85550",
        "CountryID": 80,
        "Latitude": 46.89071,
        "Longitude": -2.139738,
        "ContactTelephone1": "+33 2 51 68 50 63",
        "DistanceUnit": 0
    },
    "Connections": [
        {
            "ID": 153827,
            "ConnectionTypeID": 30,
            "StatusTypeID": 50,
            "LevelID": 2,
            "Amps": 16,
            "Voltage": 400,
            "PowerKW": 11,
            "CurrentTypeID": 20,
            "Quantity": 2
        }
    ],
    "NumberOfPoints": 2,
    "GeneralComments": "2 Tesla Connectors, up to 11kW.Available for customers. Please see front desk.",
    "StatusTypeID": 50,
    "DateLastStatusUpdate": "2018-10-11T12:27:00Z",
    "DataQualityLevel": 1,
    "DateCreated": "2018-10-11T12:27:00Z",
    "SubmissionStatusTypeID": 200
}