{
    "IsRecentlyVerified": false,
    "ID": 182398,
    "UUID": "44BA298F-C71E-4A07-BDD5-1B504E563766",
    "DataProviderID": 29,
    "DataProvidersReference": "9820",
    "OperatorID": 3403,
    "AddressInfo": {
        "ID": 182757,
        "Title": "Ernst-Scheel-Straße 27",
        "AddressLine1": "Ernst-Scheel-Straße 27",
        "Town": "Wismar",
        "Postcode": "23968",
        "CountryID": 87,
        "Latitude": 53.91122,
        "Longitude": 11.42924,
        "DistanceUnit": 0
    },
    "Connections": [
        {
            "ID": 288075,
            "ConnectionTypeID": 25,
            "StatusTypeID": 50,
            "LevelID": 2,
            "PowerKW": 22,
            "CurrentTypeID": 20
        },
        {
            "ID": 288076,
            "ConnectionTypeID": 1036,
            "StatusTypeID": 50,
            "LevelID": 3,
            "PowerKW": 43,
            "CurrentTypeID": 20
        },
        {
            "ID": 288077,
            "ConnectionTypeID": 33,
            "StatusTypeID": 50,
            "LevelID": 3,
            "PowerKW": 43,
            "CurrentTypeID": 30
        }
    ],
    "StatusTypeID": 50,
    "DateLastStatusUpdate": "2021-07-12T02:52:00Z",
    "MetadataValues": [
        {
            "ID": 14692,
            "MetadataFieldID": 4,
            "ItemValue": "Data from the German chargepoint registry provided by Bundesnetzagentur.de under the CC-BY 4.0 license"
        }
    ],
    "DataQualityLevel": 3,
    "DateCreated": "2021-07-08T10:03:00Z",
    "SubmissionStatusTypeID": 100
}