{
    "IsRecentlyVerified": false,
    "ID": 138840,
    "UUID": "7CD88C5A-9CA1-4061-9E4A-74FFF5A559AA",
    "DataProviderID": 2,
    "DataProvidersReference": "143175",
    "OperatorID": 5,
    "UsageTypeID": 1,
    "AddressInfo": {
        "ID": 139192,
        "Title": "TOLLWAY CENTER",
        "AddressLine1": "14675 Dallas Pkwy",
        "Town": "Dallas",
        "StateOrProvince": "TX",
        "Postcode": "75254",
        "CountryID": 2,
        "Latitude": 32.94605,
        "Longitude": -96.82465,
        "ContactTelephone1": "888-758-4389",
        "AccessComments": "24 hours daily",
        "RelatedURL": "http://www.chargepoint.com/",
        "DistanceUnit": 0
    },
    "Connections": [
        {
            "ID": 194057,
            "ConnectionTypeID": 1,
            "LevelID": 2,
            "Amps": 16,
            "Voltage": 230,
            "PowerKW": 3.7,
            "CurrentTypeID": 10,
            "Quantity": 2
        }
    ],
    "StatusTypeID": 50,
    "DateLastStatusUpdate": "2020-06-26T02:55:00Z",
    "DataQualityLevel": 3,
    "DateCreated": "2019-12-24T09:09:00Z",
    "SubmissionStatusTypeID": 100
}