{
    "IsRecentlyVerified": false,
    "ID": 174869,
    "UUID": "3CEF9BD5-3D6C-4221-8749-F95FBB3A8C82",
    "DataProviderID": 1,
    "OperatorID": 3377,
    "UsageTypeID": 1,
    "AddressInfo": {
        "ID": 175228,
        "Title": "SELBA EdRSR - Etecnic",
        "AddressLine1": "Casal de joves",
        "Town": "Xerta",
        "StateOrProvince": "Catalonia",
        "Postcode": "",
        "CountryID": 210,
        "Latitude": 40.90997785269511,
        "Longitude": 0.48960472001294875,
        "DistanceUnit": 0
    },
    "Connections": [
        {
            "ID": 270970,
            "ConnectionTypeID": 25,
            "Reference": "SELBA",
            "StatusTypeID": 50,
            "LevelID": 2,
            "Amps": 32,
            "Voltage": 400,
            "PowerKW": 22.2,
            "CurrentTypeID": 20,
            "Quantity": 2
        }
    ],
    "NumberOfPoints": 2,
    "StatusTypeID": 50,
    "DateLastStatusUpdate": "2021-04-16T09:12:00Z",
    "DataQualityLevel": 1,
    "DateCreated": "2021-04-16T09:12:00Z",
    "SubmissionStatusTypeID": 200
}