{
    "IsRecentlyVerified": false,
    "ID": 163966,
    "UUID": "7AA81355-FE81-4BDB-9C87-46E02DE65AC9",
    "DataProviderID": 1,
    "OperatorID": 23,
    "OperatorsReference": "53079",
    "UsageTypeID": 4,
    "AddressInfo": {
        "ID": 164325,
        "Title": "Augsburg Hotel Sonnenhof",
        "AddressLine1": "Henleinstraße 31 Gersthofen",
        "Town": "Gersthofen",
        "Postcode": "86368",
        "CountryID": 87,
        "Latitude": 48.44338,
        "Longitude": 10.874681,
        "ContactTelephone1": "+49 821 2071210",
        "DistanceUnit": 0
    },
    "Connections": [
        {
            "ID": 235564,
            "ConnectionTypeID": 30,
            "StatusTypeID": 50,
            "LevelID": 2,
            "PowerKW": 11,
            "CurrentTypeID": 20,
            "Quantity": 2
        }
    ],
    "NumberOfPoints": 2,
    "GeneralComments": "2 Tesla Connectors, up to 11kW.Available for customers. Present parking ticket to gate attendant for validation.",
    "StatusTypeID": 50,
    "DateLastStatusUpdate": "2020-08-24T23:41:00Z",
    "DataQualityLevel": 1,
    "DateCreated": "2020-08-24T23:41:00Z",
    "SubmissionStatusTypeID": 200
}