{
    "IsRecentlyVerified": true,
    "DateLastVerified": "2021-08-11T04:05:00Z",
    "ID": 188686,
    "UUID": "0E284334-AA23-49BD-B6A6-188399A34701",
    "DataProviderID": 1,
    "OperatorID": 3364,
    "UsageTypeID": 4,
    "UsageCost": "35 CLP/min",
    "AddressInfo": {
        "ID": 189045,
        "Title": "Talagante Oriente",
        "AddressLine1": "Ruta 78, Km 31 1/2, Oriente, Talagante",
        "Town": "Talagante",
        "StateOrProvince": "Región Metropolitana de Santiago",
        "Postcode": "",
        "CountryID": 49,
        "Latitude": -33.63513467345058,
        "Longitude": -70.86905793122548,
        "RelatedURL": "https://copecvoltex.cl/",
        "DistanceUnit": 0
    },
    "Connections": [
        {
            "ID": 304825,
            "ConnectionTypeID": 25,
            "StatusTypeID": 50,
            "LevelID": 2,
            "PowerKW": 43,
            "Quantity": 1
        },
        {
            "ID": 304826,
            "ConnectionTypeID": 2,
            "StatusTypeID": 50,
            "LevelID": 2,
            "PowerKW": 50,
            "Quantity": 1
        },
        {
            "ID": 304827,
            "ConnectionTypeID": 33,
            "StatusTypeID": 50,
            "LevelID": 2,
            "PowerKW": 50,
            "Quantity": 1
        }
    ],
    "NumberOfPoints": 1,
    "StatusTypeID": 50,
    "DateLastStatusUpdate": "2021-08-11T04:05:00Z",
    "DataQualityLevel": 1,
    "DateCreated": "2021-08-11T04:05:00Z",
    "SubmissionStatusTypeID": 200
}