{
    "IsRecentlyVerified": false,
    "ID": 33109,
    "UUID": "D1004A20-5C02-4868-9DC9-319F0A32A3CF",
    "DataProviderID": 26,
    "DataProvidersReference": "47014",
    "OperatorID": 178,
    "OperatorsReference": "EVnetNL AL151",
    "UsageCost": "0.00 jaarabonnement",
    "AddressInfo": {
        "ID": 33455,
        "Title": "Hoofdstraat",
        "AddressLine1": "Hoofdstraat",
        "Town": "Best",
        "Postcode": "5683 AL",
        "CountryID": 159,
        "Latitude": 51.512463,
        "Longitude": 5.395655,
        "ContactTelephone1": "0800-3522365",
        "RelatedURL": "http://www.evnet.nl",
        "DistanceUnit": 0
    },
    "Connections": [
        {
            "ID": 36620,
            "ConnectionTypeID": 25,
            "LevelID": 2,
            "PowerKW": 11,
            "CurrentTypeID": 10
        }
    ],
    "NumberOfPoints": 1,
    "StatusTypeID": 50,
    "DateLastStatusUpdate": "2016-06-04T02:39:00Z",
    "DataQualityLevel": 3,
    "DateCreated": "2015-01-09T06:04:00Z",
    "SubmissionStatusTypeID": 100
}