{
    "IsRecentlyVerified": false,
    "ID": 71755,
    "UUID": "6F874EA1-372C-42AC-9D60-4D5F1CEB366C",
    "DataProviderID": 1,
    "OperatorID": 45,
    "UsageTypeID": 1,
    "AddressInfo": {
        "ID": 72101,
        "Title": "E-Bike Station Freizeitbad",
        "AddressLine1": "Bürgerweide 5",
        "Town": "Winsen (Luhe)",
        "StateOrProvince": "Landkreis Harburg",
        "Postcode": "21423",
        "CountryID": 87,
        "Latitude": 53.36383,
        "Longitude": 10.219619999999964,
        "RelatedURL": "https://www.google.de/url?sa=t&rct=j&q=&esrc=s&source=web&cd=1&cad=rja&uact=8&ved=0ahUKEwi5-ITo5frOAhUBVBQKHbuGDJAQFggxMAA&url=https%3A%2F%2Fwww.winsen.de%2Fdownloads%2Fdatei%2FOTEzMDAxNDM4Oy07L3Vzci9sb2NhbC9odHRwZC92aHRkb2NzL2Ntcy93aW5zZW4vbWVkaWVuL2Rva3VtZW50ZS9rYXJ0ZV9lbGVrdHJvX3RhbmtzdGVsbGVuWzFdLnBkZg%253D%253D%2Fkarte_elektro_tankstellen%5B1%5D.pdf&usg=AFQjCNGUamhpHWpZJ0mOqKiG2uFYLc5SdA",
        "DistanceUnit": 0
    },
    "Connections": [
        {
            "ID": 102784,
            "ConnectionTypeID": 28,
            "StatusTypeID": 50,
            "LevelID": 1,
            "Amps": 10,
            "Voltage": 230,
            "PowerKW": 2.3,
            "CurrentTypeID": 10,
            "Quantity": 2
        }
    ],
    "NumberOfPoints": 2,
    "StatusTypeID": 50,
    "DateLastStatusUpdate": "2016-09-06T13:03:00Z",
    "DataQualityLevel": 1,
    "DateCreated": "2016-09-06T13:03:00Z",
    "SubmissionStatusTypeID": 200
}