{
    "IsRecentlyVerified": false,
    "ID": 123746,
    "UUID": "5591703B-EA4A-4B32-811D-09457B4726DC",
    "DataProviderID": 2,
    "DataProvidersReference": "89626",
    "UsageTypeID": 1,
    "AddressInfo": {
        "ID": 124092,
        "Title": "Elements Apartments",
        "AddressLine1": "1201 Parkmoor Ave",
        "Town": "San Jose",
        "StateOrProvince": "CA",
        "Postcode": "95126",
        "CountryID": 2,
        "Latitude": 37.317246,
        "Longitude": -121.909487,
        "ContactTelephone1": "408-271-2600",
        "AccessComments": "24 hours daily",
        "RelatedURL": "",
        "DistanceUnit": 0
    },
    "Connections": [
        {
            "ID": 173769,
            "ConnectionTypeID": 1,
            "LevelID": 2,
            "Amps": 16,
            "Voltage": 230,
            "PowerKW": 3.7,
            "CurrentTypeID": 10,
            "Quantity": 1
        }
    ],
    "DateLastStatusUpdate": "2020-06-26T02:59:00Z",
    "DataQualityLevel": 3,
    "DateCreated": "2019-04-06T05:03:00Z",
    "SubmissionStatusTypeID": 100
}