{
    "IsRecentlyVerified": false,
    "ID": 58022,
    "UUID": "B6125174-D7FD-4405-903B-9659D446713D",
    "DataProviderID": 1,
    "OperatorID": 45,
    "UsageTypeID": 3,
    "AddressInfo": {
        "ID": 58368,
        "Title": "Weber Heizung & Lüftung",
        "AddressLine1": "Mauermattenstraße 18",
        "AddressLine2": "Übenhof",
        "Town": "Waldkirch",
        "Postcode": "79183",
        "CountryID": 87,
        "Latitude": 48.08591,
        "Longitude": 7.942610000000059,
        "ContactTelephone1": "+ 49 7681 47446-0",
        "AccessComments": "Verfügbar von Mo-Fr 8:30-16:30Uhr, zur Freischaltung im Büro anmelden.",
        "RelatedURL": "http://www.heizungsweber.de/",
        "DistanceUnit": 0
    },
    "Connections": [
        {
            "ID": 73859,
            "ConnectionTypeID": 25,
            "StatusTypeID": 50,
            "LevelID": 2,
            "Amps": 16,
            "Voltage": 400,
            "PowerKW": 11,
            "CurrentTypeID": 20,
            "Quantity": 2
        },
        {
            "ID": 73860,
            "ConnectionTypeID": 28,
            "StatusTypeID": 50,
            "LevelID": 2,
            "Amps": 16,
            "Voltage": 230,
            "PowerKW": 3.7,
            "CurrentTypeID": 10,
            "Quantity": 6
        }
    ],
    "NumberOfPoints": 8,
    "StatusTypeID": 50,
    "DateLastStatusUpdate": "2016-01-04T14:55:00Z",
    "DataQualityLevel": 1,
    "DateCreated": "2016-01-04T14:55:00Z",
    "SubmissionStatusTypeID": 200
}