{
    "IsRecentlyVerified": false,
    "ID": 122073,
    "UUID": "AB7142FA-4D8D-44AB-97A3-CF6EBC7BD19B",
    "DataProviderID": 2,
    "DataProvidersReference": "76874",
    "OperatorID": 5,
    "UsageTypeID": 1,
    "AddressInfo": {
        "ID": 122419,
        "Title": "CITY OF LA",
        "AddressLine1": "3016 Washington Blvd",
        "Town": "Marina del Rey",
        "StateOrProvince": "CA",
        "Postcode": "90292",
        "CountryID": 2,
        "Latitude": 33.9892952,
        "Longitude": -118.4503652,
        "ContactTelephone1": "888-758-4389",
        "AccessComments": "24 hours daily",
        "RelatedURL": "http://www.chargepoint.com/",
        "DistanceUnit": 0
    },
    "Connections": [
        {
            "ID": 171926,
            "ConnectionTypeID": 1,
            "LevelID": 2,
            "Amps": 16,
            "Voltage": 230,
            "PowerKW": 3,
            "CurrentTypeID": 10,
            "Quantity": 1
        }
    ],
    "DateLastStatusUpdate": "2019-12-24T09:11:00Z",
    "DataQualityLevel": 3,
    "DateCreated": "2019-04-06T05:02:00Z",
    "SubmissionStatusTypeID": 100
}