{
    "IsRecentlyVerified": false,
    "ID": 163402,
    "UUID": "24F163EB-8979-49DE-A2EB-1FD939CEAA39",
    "DataProviderID": 1,
    "OperatorID": 21,
    "UsageTypeID": 4,
    "UsageCost": "Mobi.E compatible card",
    "AddressInfo": {
        "ID": 163759,
        "Title": "CLB-00007",
        "AddressLine1": "Quinta dos Cedros",
        "AddressLine2": "Supemercado Muito Menos",
        "Town": "Celorico",
        "StateOrProvince": "Centro",
        "Postcode": "",
        "CountryID": 180,
        "Latitude": 40.625631797611334,
        "Longitude": -7.402092653715613,
        "AccessComments": "Supermarket park",
        "DistanceUnit": 0
    },
    "Connections": [
        {
            "ID": 234979,
            "ConnectionTypeID": 2,
            "StatusTypeID": 50,
            "LevelID": 3,
            "Amps": 120,
            "Voltage": 500,
            "PowerKW": 50,
            "CurrentTypeID": 30,
            "Quantity": 1
        },
        {
            "ID": 234980,
            "ConnectionTypeID": 33,
            "StatusTypeID": 50,
            "LevelID": 3,
            "Amps": 125,
            "Voltage": 500,
            "PowerKW": 50,
            "CurrentTypeID": 30,
            "Quantity": 1
        }
    ],
    "NumberOfPoints": 2,
    "GeneralComments": "During supermarket opening hours",
    "StatusTypeID": 50,
    "DateLastStatusUpdate": "2020-08-23T16:30:00Z",
    "DataQualityLevel": 1,
    "DateCreated": "2020-08-23T16:30:00Z",
    "SubmissionStatusTypeID": 200
}