{
    "MediaItems": [
        {
            "ID": 25204,
            "ChargePointID": 96342,
            "ItemURL": "https://s3-ap-southeast-2.amazonaws.com/openchargemap/images/DE/OCM96342/OCM-96342.orig.2020102417403097.jpg",
            "ItemThumbnailURL": "https://s3-ap-southeast-2.amazonaws.com/openchargemap/images/DE/OCM96342/OCM-96342.thmb.2020102417403097.jpg",
            "Comment": "",
            "IsEnabled": true,
            "IsVideo": false,
            "IsFeaturedItem": false,
            "IsExternalResource": false,
            "User": {
                "ID": 27940,
                "Username": "5R-MFT "
            },
            "DateCreated": "2020-10-24T17:41:00Z"
        },
        {
            "ID": 25203,
            "ChargePointID": 96342,
            "ItemURL": "https://s3-ap-southeast-2.amazonaws.com/openchargemap/images/DE/OCM96342/OCM-96342.orig.2020102417393524.jpg",
            "ItemThumbnailURL": "https://s3-ap-southeast-2.amazonaws.com/openchargemap/images/DE/OCM96342/OCM-96342.thmb.2020102417393524.jpg",
            "Comment": "",
            "IsEnabled": true,
            "IsVideo": false,
            "IsFeaturedItem": false,
            "IsExternalResource": false,
            "User": {
                "ID": 27940,
                "Username": "5R-MFT "
            },
            "DateCreated": "2020-10-24T17:40:00Z"
        }
    ],
    "IsRecentlyVerified": false,
    "ID": 96342,
    "UUID": "D3EACE6F-829C-4607-9CD8-968025F9A778",
    "DataProviderID": 1,
    "OperatorID": 45,
    "UsageTypeID": 1,
    "AddressInfo": {
        "ID": 96688,
        "Title": "Stuttgart Airport P7",
        "AddressLine1": "Flughafenstraße 43",
        "Town": "Leinfelden-Echterdingen",
        "StateOrProvince": "Landkreis Esslingen",
        "Postcode": "70629",
        "CountryID": 87,
        "Latitude": 48.69059587985461,
        "Longitude": 9.192048282090912,
        "AccessComments": "Mehrere blau markierte Parkplätze auf dem Kurzzeitparkplatz P7.  Laden kostenlos, Parken ab 2€",
        "RelatedURL": "http://www.stuttgart-airport.com/",
        "DistanceUnit": 0
    },
    "Connections": [
        {
            "ID": 136509,
            "ConnectionTypeID": 1036,
            "StatusTypeID": 50,
            "LevelID": 3,
            "Amps": 63,
            "Voltage": 400,
            "PowerKW": 43,
            "CurrentTypeID": 20,
            "Quantity": 1
        },
        {
            "ID": 136510,
            "ConnectionTypeID": 2,
            "StatusTypeID": 50,
            "LevelID": 3,
            "PowerKW": 62,
            "CurrentTypeID": 30,
            "Quantity": 1
        },
        {
            "ID": 136511,
            "ConnectionTypeID": 33,
            "StatusTypeID": 50,
            "LevelID": 3,
            "PowerKW": 100,
            "CurrentTypeID": 30,
            "Quantity": 1
        }
    ],
    "NumberOfPoints": 3,
    "StatusTypeID": 50,
    "DateLastStatusUpdate": "2020-10-24T17:41:00Z",
    "DataQualityLevel": 1,
    "DateCreated": "2017-12-21T09:20:00Z",
    "SubmissionStatusTypeID": 200
}