{
    "IsRecentlyVerified": false,
    "ID": 137493,
    "UUID": "F99E0AB7-FBE0-4C54-B576-415945D03C05",
    "DataProviderID": 2,
    "DataProvidersReference": "95042",
    "OperatorID": 9,
    "UsageTypeID": 1,
    "AddressInfo": {
        "ID": 137839,
        "Title": "Houston Heights Library",
        "AddressLine1": "1302 Heights Boulevard",
        "Town": "Houston",
        "StateOrProvince": "TX",
        "Postcode": "77008",
        "CountryID": 2,
        "Latitude": 29.794697,
        "Longitude": -95.397294,
        "ContactTelephone1": "888-998-2546",
        "AccessComments": "MON: 24 hours | TUE: 24 hours | WED: 24 hours | THU: 24 hours | FRI: 24 hours | SAT: 24 hours | SUN: 24 hours",
        "RelatedURL": "http://www.blinkcharging.com/",
        "DistanceUnit": 0
    },
    "Connections": [
        {
            "ID": 192414,
            "ConnectionTypeID": 1,
            "LevelID": 2,
            "Amps": 16,
            "Voltage": 230,
            "PowerKW": 3,
            "CurrentTypeID": 10,
            "Quantity": 2
        }
    ],
    "StatusTypeID": 50,
    "DateLastStatusUpdate": "2019-12-24T09:05:00Z",
    "DataQualityLevel": 3,
    "DateCreated": "2019-12-24T09:05:00Z",
    "SubmissionStatusTypeID": 100
}