{
    "IsRecentlyVerified": false,
    "ID": 91013,
    "UUID": "C3646284-015B-40D1-846B-7B0FCB839147",
    "DataProviderID": 1,
    "OperatorID": 23,
    "OperatorsReference": "32312",
    "UsageTypeID": 6,
    "AddressInfo": {
        "ID": 91359,
        "Title": "La Source du Mont",
        "AddressLine1": "9 Rue du Foirail",
        "Town": "Saint-Martin-Valmeroux",
        "Postcode": "15140",
        "CountryID": 80,
        "Latitude": 45.114999,
        "Longitude": 2.427668,
        "ContactTelephone1": "+33 4 71 69 28 55",
        "DistanceUnit": 0
    },
    "Connections": [
        {
            "ID": 129068,
            "ConnectionTypeID": 30,
            "StatusTypeID": 50,
            "LevelID": 2,
            "Amps": 32,
            "Voltage": 230,
            "PowerKW": 11,
            "CurrentTypeID": 10,
            "Quantity": 1
        }
    ],
    "NumberOfPoints": 1,
    "GeneralComments": "1 Tesla Connector, up to 6kW.Available for patrons only. Please see front desk.",
    "StatusTypeID": 50,
    "DateLastStatusUpdate": "2018-10-03T14:14:00Z",
    "DataQualityLevel": 1,
    "DateCreated": "2017-07-28T05:39:00Z",
    "SubmissionStatusTypeID": 200
}