{
    "IsRecentlyVerified": false,
    "ID": 113221,
    "UUID": "1189E897-DE7C-43BD-B20D-5E5B4CEEDEF8",
    "DataProviderID": 2,
    "DataProvidersReference": "104844",
    "OperatorID": 5,
    "UsageTypeID": 1,
    "AddressInfo": {
        "ID": 113567,
        "Title": "KRP PROPERTIES",
        "AddressLine1": "340 March Rd",
        "Town": "Ottawa",
        "StateOrProvince": "ON",
        "Postcode": "K2K 2E2",
        "CountryID": 44,
        "Latitude": 45.335101,
        "Longitude": -75.906529,
        "ContactTelephone1": "888-758-4389",
        "AccessComments": "24 hours daily",
        "RelatedURL": "http://www.chargepoint.com/",
        "DistanceUnit": 0
    },
    "Connections": [
        {
            "ID": 159411,
            "ConnectionTypeID": 1,
            "LevelID": 2,
            "Amps": 16,
            "Voltage": 230,
            "PowerKW": 3.7,
            "CurrentTypeID": 10,
            "Quantity": 4
        }
    ],
    "DateLastStatusUpdate": "2020-06-26T03:08:00Z",
    "DataQualityLevel": 3,
    "DateCreated": "2018-11-28T02:04:00Z",
    "SubmissionStatusTypeID": 100
}