{
    "IsRecentlyVerified": false,
    "ID": 57261,
    "UUID": "88F38D36-D596-49A6-AB79-499EB7FDBF84",
    "DataProviderID": 2,
    "DataProvidersReference": "70958",
    "OperatorID": 5,
    "UsageTypeID": 1,
    "AddressInfo": {
        "ID": 57607,
        "Title": "THE OGDEN",
        "AddressLine1": "150 N Las Vegas Blvd",
        "Town": "Las Vegas",
        "StateOrProvince": "NV",
        "Postcode": "89101",
        "CountryID": 2,
        "Latitude": 36.1700878,
        "Longitude": -115.1396153,
        "ContactTelephone1": "888-758-4389",
        "AccessComments": "24 hours daily",
        "RelatedURL": "http://www.chargepoint.com/",
        "DistanceUnit": 0
    },
    "Connections": [
        {
            "ID": 72358,
            "ConnectionTypeID": 1,
            "LevelID": 2,
            "Amps": 16,
            "Voltage": 230,
            "PowerKW": 3,
            "CurrentTypeID": 10,
            "Quantity": 2
        }
    ],
    "DateLastStatusUpdate": "2019-04-06T04:02:00Z",
    "DataQualityLevel": 3,
    "DateCreated": "2015-11-30T11:50:00Z",
    "SubmissionStatusTypeID": 100
}