{
    "IsRecentlyVerified": false,
    "ID": 136673,
    "UUID": "1EFB6E10-FC19-41FB-ACE5-ECD4FA5BDD29",
    "DataProviderID": 18,
    "DataProvidersReference": "b1e126b47ff7c8388b3fc84370cb5601",
    "OperatorID": 3345,
    "UsageTypeID": 5,
    "AddressInfo": {
        "ID": 137019,
        "Title": "33 Earlsdon Ave South",
        "AddressLine1": "33 Earlsdon Ave South",
        "Town": "Coventry",
        "Postcode": "CV5 6DR",
        "CountryID": 1,
        "Latitude": 52.397528,
        "Longitude": -1.527934,
        "AccessComments": "",
        "RelatedURL": "https://char.gy",
        "DistanceUnit": 0
    },
    "Connections": [
        {
            "ID": 191211,
            "ConnectionTypeID": 25,
            "Reference": "00318",
            "StatusTypeID": 50,
            "LevelID": 2,
            "Amps": 32,
            "Voltage": 400,
            "PowerKW": 22,
            "CurrentTypeID": 20
        }
    ],
    "StatusTypeID": 0,
    "DateLastStatusUpdate": "2019-12-24T05:22:00Z",
    "MetadataValues": [
        {
            "ID": 6525,
            "MetadataFieldID": 4,
            "ItemValue": "Contains public sector information licensed under the Open Government Licence v2.0. http://www.nationalarchives.gov.uk/doc/open-government-licence/version/2/"
        }
    ],
    "DataQualityLevel": 3,
    "DateCreated": "2019-12-24T05:22:00Z",
    "SubmissionStatusTypeID": 100
}