{
    "UserComments": [
        {
            "ID": 20324,
            "ChargePointID": 5548,
            "CommentTypeID": 10,
            "UserName": "GDW",
            "Comment": "Charged using 3 pin",
            "DateCreated": "2018-10-19T07:48:45.193Z",
            "User": {
                "ID": 18860,
                "Username": "GDW"
            },
            "CheckinStatusTypeID": 10
        },
        {
            "ID": 20323,
            "ChargePointID": 5548,
            "CommentTypeID": 10,
            "UserName": "GDW",
            "Comment": "",
            "DateCreated": "2018-10-19T07:46:13.09Z",
            "User": {
                "ID": 18860,
                "Username": "GDW"
            },
            "CheckinStatusTypeID": 10
        }
    ],
    "MediaItems": [
        {
            "ID": 1100,
            "ChargePointID": 5548,
            "ItemURL": "https://s3-ap-southeast-2.amazonaws.com/openchargemap/images/GB/OCM5548/OCM-5548.orig.2015031512431557.jpg",
            "ItemThumbnailURL": "https://s3-ap-southeast-2.amazonaws.com/openchargemap/images/GB/OCM5548/OCM-5548.thmb.2015031512431557.jpg",
            "Comment": "Positioned at the very rear of the hotel its a shame to see blue commando, but 3pin works fine. Good tea and coffee for just over £2",
            "IsEnabled": true,
            "IsVideo": false,
            "IsFeaturedItem": false,
            "IsExternalResource": false,
            "User": {
                "ID": 4669,
                "Username": "Ian Ha"
            },
            "DateCreated": "2015-03-15T12:43:00Z"
        }
    ],
    "IsRecentlyVerified": false,
    "ID": 5548,
    "UUID": "0797BA62-D2AB-448C-A0B5-2C9FEC207D90",
    "DataProviderID": 1,
    "OperatorID": 19,
    "UsageTypeID": 1,
    "AddressInfo": {
        "ID": 5486,
        "Title": "Arden Hotel",
        "AddressLine1": "Coventry Road",
        "AddressLine2": "Bickenhill",
        "Town": "Solihull",
        "StateOrProvince": "West Midlands",
        "Postcode": "B92 0EH",
        "CountryID": 1,
        "Latitude": 52.4453823,
        "Longitude": -1.7211528,
        "ContactTelephone1": "01675 443221",
        "ContactEmail": "enquiries@ardenhotel.co.uk",
        "RelatedURL": "http://www.ardenhotel.co.uk",
        "DistanceUnit": 0
    },
    "Connections": [
        {
            "ID": 433,
            "ConnectionTypeID": 3,
            "StatusTypeID": 50,
            "LevelID": 2,
            "Amps": 13,
            "Voltage": 230,
            "PowerKW": 3,
            "CurrentTypeID": 10,
            "Quantity": 1
        },
        {
            "ID": 435,
            "ConnectionTypeID": 4,
            "StatusTypeID": 50,
            "LevelID": 2,
            "Amps": 32,
            "Voltage": 230,
            "PowerKW": 7,
            "CurrentTypeID": 20,
            "Quantity": 1
        },
        {
            "ID": 6779,
            "ConnectionTypeID": 4,
            "StatusTypeID": 50,
            "LevelID": 2,
            "Amps": 16,
            "Voltage": 230,
            "PowerKW": 4,
            "CurrentTypeID": 20,
            "Quantity": 1
        }
    ],
    "NumberOfPoints": 3,
    "DateLastConfirmed": "2011-08-29T16:59:00Z",
    "StatusTypeID": 50,
    "DateLastStatusUpdate": "2018-10-19T07:49:00Z",
    "DataQualityLevel": 1,
    "DateCreated": "2011-08-29T16:59:00Z",
    "SubmissionStatusTypeID": 200
}