{
    "IsRecentlyVerified": false,
    "ID": 93686,
    "UUID": "4FE3C124-4637-4ECD-8FE5-39DEEDF28849",
    "DataProviderID": 1,
    "OperatorID": 23,
    "OperatorsReference": "28922",
    "UsageTypeID": 4,
    "UsageCost": "£0.24/kWh;other tariffs for older cars",
    "AddressInfo": {
        "ID": 94032,
        "Title": "Penrith, UK - Tebay Southbound Supercharger",
        "AddressLine1": "M6 Junction 38/39",
        "Town": "Orton",
        "Postcode": "CA10 3SB",
        "CountryID": 1,
        "Latitude": 54.453346,
        "Longitude": -2.605861,
        "DistanceUnit": 0
    },
    "Connections": [
        {
            "ID": 132644,
            "ConnectionTypeID": 27,
            "StatusTypeID": 50,
            "LevelID": 3,
            "PowerKW": 120,
            "CurrentTypeID": 30,
            "Quantity": 8
        }
    ],
    "NumberOfPoints": 8,
    "GeneralComments": "Charging8 Superchargers, available 24/7, up to 120kW",
    "StatusTypeID": 50,
    "DateLastStatusUpdate": "2019-03-22T19:12:00Z",
    "DataQualityLevel": 1,
    "DateCreated": "2017-10-05T05:35:00Z",
    "SubmissionStatusTypeID": 200
}