{
    "IsRecentlyVerified": false,
    "ID": 176345,
    "UUID": "39E8615B-6AC5-4D6B-8EA1-CCA9D0478623",
    "DataProviderID": 1,
    "OperatorID": 1,
    "UsageTypeID": 5,
    "AddressInfo": {
        "ID": 176704,
        "Title": "Hunters Friend Resort ",
        "AddressLine1": "118 Myrtle Lane",
        "Town": "Branson",
        "StateOrProvince": "MO",
        "Postcode": "65616",
        "CountryID": 2,
        "Latitude": 36.6272349,
        "Longitude": -93.3448655,
        "ContactTelephone1": "4173382849",
        "ContactTelephone2": "4172300717",
        "AccessComments": "Free for our guests. Travelers staying elsewhere $5/hour",
        "RelatedURL": "https://huntersfriendresort.com/free-ev-chargers-in-branson-missouri/",
        "DistanceUnit": 0
    },
    "Connections": [
        {
            "ID": 274113,
            "ConnectionTypeID": 1,
            "StatusTypeID": 50,
            "LevelID": 2,
            "Amps": 50,
            "Voltage": 240,
            "PowerKW": 9.6,
            "CurrentTypeID": 10,
            "Quantity": 4
        }
    ],
    "NumberOfPoints": 4,
    "GeneralComments": "4 high power destination chargers ",
    "StatusTypeID": 50,
    "DateLastStatusUpdate": "2021-07-10T11:38:00Z",
    "DataQualityLevel": 1,
    "DateCreated": "2021-07-07T11:33:00Z",
    "SubmissionStatusTypeID": 200
}