{
    "IsRecentlyVerified": false,
    "ID": 186618,
    "UUID": "D4720CD6-3CED-427B-81C6-4CD06240A396",
    "DataProviderID": 29,
    "DataProvidersReference": "11619",
    "OperatorID": 86,
    "AddressInfo": {
        "ID": 186977,
        "Title": "Jakob - Koenen - Straße 2",
        "AddressLine1": "Jakob - Koenen - Straße 2",
        "Town": "Kamen",
        "Postcode": "59174",
        "CountryID": 87,
        "Latitude": 51.572152,
        "Longitude": 7.61455,
        "DistanceUnit": 0
    },
    "Connections": [
        {
            "ID": 299672,
            "ConnectionTypeID": 28,
            "StatusTypeID": 50,
            "LevelID": 2,
            "PowerKW": 22,
            "CurrentTypeID": 20
        },
        {
            "ID": 299673,
            "ConnectionTypeID": 25,
            "StatusTypeID": 50,
            "LevelID": 2,
            "PowerKW": 22,
            "CurrentTypeID": 20
        },
        {
            "ID": 299674,
            "ConnectionTypeID": 28,
            "StatusTypeID": 50,
            "LevelID": 2,
            "PowerKW": 22,
            "CurrentTypeID": 20
        },
        {
            "ID": 299675,
            "ConnectionTypeID": 25,
            "StatusTypeID": 50,
            "LevelID": 2,
            "PowerKW": 22,
            "CurrentTypeID": 20
        }
    ],
    "StatusTypeID": 50,
    "DateLastStatusUpdate": "2021-07-12T02:48:00Z",
    "MetadataValues": [
        {
            "ID": 18859,
            "MetadataFieldID": 4,
            "ItemValue": "Data from the German chargepoint registry provided by Bundesnetzagentur.de under the CC-BY 4.0 license"
        }
    ],
    "DataQualityLevel": 3,
    "DateCreated": "2021-07-12T02:48:00Z",
    "SubmissionStatusTypeID": 100
}