{
    "IsRecentlyVerified": false,
    "ID": 130395,
    "UUID": "09187BD6-C23E-4716-9231-2CFFC74D4F35",
    "DataProviderID": 1,
    "OperatorID": 21,
    "UsageTypeID": 4,
    "UsageCost": "Mobi.E compatible card",
    "AddressInfo": {
        "ID": 130741,
        "Title": "AMT-00001",
        "AddressLine1": "Avenida General Silveira",
        "Town": "Amarante",
        "StateOrProvince": "Porto",
        "Postcode": "4600-017",
        "CountryID": 180,
        "Latitude": 41.26772422376081,
        "Longitude": -8.078822549560527,
        "DistanceUnit": 0
    },
    "Connections": [
        {
            "ID": 182562,
            "ConnectionTypeID": 25,
            "StatusTypeID": 50,
            "LevelID": 2,
            "Amps": 32,
            "Voltage": 400,
            "PowerKW": 22,
            "CurrentTypeID": 20,
            "Quantity": 2
        }
    ],
    "NumberOfPoints": 2,
    "StatusTypeID": 50,
    "DateLastStatusUpdate": "2020-10-01T18:38:00Z",
    "DataQualityLevel": 1,
    "DateCreated": "2019-08-04T12:54:00Z",
    "SubmissionStatusTypeID": 200
}