{
    "IsRecentlyVerified": false,
    "ID": 35693,
    "UUID": "77F3B655-F79C-4202-A0EA-1E20BB5ADB8A",
    "DataProviderID": 26,
    "DataProvidersReference": "47428",
    "OperatorID": 178,
    "OperatorsReference": "EVnetNL AL583",
    "UsageCost": "0.00 jaarabonnement",
    "AddressInfo": {
        "ID": 36039,
        "Title": "Nijborg 2",
        "AddressLine1": "Nijborg 2",
        "Town": "Renswoude",
        "Postcode": "3927 DA",
        "CountryID": 159,
        "Latitude": 52.073786,
        "Longitude": 5.530457,
        "ContactTelephone1": "0800-3522365",
        "RelatedURL": "http://www.evnet.nl",
        "DistanceUnit": 0
    },
    "Connections": [
        {
            "ID": 39204,
            "ConnectionTypeID": 25,
            "LevelID": 2,
            "PowerKW": 11,
            "CurrentTypeID": 10
        }
    ],
    "NumberOfPoints": 2,
    "StatusTypeID": 50,
    "DateLastStatusUpdate": "2016-06-04T02:47:00Z",
    "DataQualityLevel": 3,
    "DateCreated": "2015-01-09T06:05:00Z",
    "SubmissionStatusTypeID": 100
}