{
    "UserComments": [
        {
            "ID": 8479,
            "ChargePointID": 57985,
            "CommentTypeID": 50,
            "UserName": "Adam Steadman",
            "Comment": "Although there are 4 charge bays they are only setup for private use by the site owners. I am told that they should be active for public use by Feb 2016",
            "DateCreated": "2016-01-09T19:02:43.313Z",
            "User": {
                "ID": 6816,
                "Username": "Adam Steadman"
            },
            "CheckinStatusTypeID": 22
        }
    ],
    "IsRecentlyVerified": false,
    "ID": 57985,
    "UUID": "523E8724-8BEF-45AB-BC61-70C0E107BD12",
    "DataProviderID": 1,
    "OperatorID": 45,
    "UsageTypeID": 0,
    "AddressInfo": {
        "ID": 58331,
        "Title": "Elliott's Field Retail Park",
        "AddressLine1": "Leicester Road",
        "AddressLine2": "Brownsover",
        "Town": "Warwickshire",
        "StateOrProvince": "Warwickshire",
        "Postcode": "CV21 1SR",
        "CountryID": 1,
        "Latitude": 52.3880980239914,
        "Longitude": -1.25761170849,
        "AccessComments": "There are 3 points, just to the side of the Nero coffee shop. On the right as you drive in. No parking fees.\r\nRetail Park open 09:00-18:00\r\nGo to the site management suite by the Cafe Nero and they will have the access card. Normal Polar network cards will not work.",
        "RelatedURL": "http://www.elliottsfield.co.uk/visitor-info/",
        "DistanceUnit": 0
    },
    "Connections": [
        {
            "ID": 73788,
            "ConnectionTypeID": 25,
            "StatusTypeID": 0,
            "LevelID": 2,
            "Voltage": 230,
            "CurrentTypeID": 10,
            "Quantity": 3
        }
    ],
    "NumberOfPoints": 3,
    "GeneralComments": "Chargemaster-manufactured posts, but not apparently on their Polar public charging network.",
    "StatusTypeID": 50,
    "DateLastStatusUpdate": "2016-01-17T19:18:00Z",
    "DataQualityLevel": 1,
    "DateCreated": "2015-12-31T11:22:00Z",
    "SubmissionStatusTypeID": 200
}