{
    "IsRecentlyVerified": false,
    "ID": 43186,
    "UUID": "CD818036-C12B-4B76-812B-7ECE8D1D1AC7",
    "DataProviderID": 1,
    "DataProvidersReference": "2678",
    "OperatorID": 1,
    "AddressInfo": {
        "ID": 43532,
        "Title": "Rättviks torg",
        "AddressLine1": "HSB-gatan 1",
        "Town": "RÄTTVIK",
        "StateOrProvince": "DALARNA",
        "Postcode": "79530",
        "CountryID": 216,
        "Latitude": 60.885754329165735,
        "Longitude": 15.11568718429578,
        "AccessComments": "Laddstationen finns på parkeringen mitt emot Fricks Bageri.",
        "DistanceUnit": 0
    },
    "Connections": [
        {
            "ID": 52354,
            "ConnectionTypeID": 13,
            "Reference": "1",
            "LevelID": 2,
            "Amps": 16,
            "Voltage": 230,
            "PowerKW": 3.7,
            "CurrentTypeID": 10,
            "Comments": ""
        },
        {
            "ID": 89162,
            "ConnectionTypeID": 13,
            "Reference": "2",
            "LevelID": 2,
            "Amps": 16,
            "Voltage": 230,
            "PowerKW": 3.7,
            "Comments": ""
        }
    ],
    "NumberOfPoints": 2,
    "DateLastStatusUpdate": "2021-07-28T06:37:00Z",
    "DataQualityLevel": 2,
    "DateCreated": "2015-03-25T04:33:00Z",
    "SubmissionStatusTypeID": 100
}