{
    "IsRecentlyVerified": false,
    "ID": 56287,
    "UUID": "14CE686A-09E5-412F-9DD2-35204741145A",
    "DataProviderID": 1,
    "OperatorID": 80,
    "UsageTypeID": 4,
    "UsageCost": "0,45 €/kW",
    "AddressInfo": {
        "ID": 56633,
        "Title": "Questura Di Pisa | EnelX",
        "AddressLine1": "Via Mario Lalli",
        "Town": "Pisa",
        "StateOrProvince": "PI",
        "Postcode": "56127",
        "CountryID": 112,
        "Latitude": 43.7175782916238,
        "Longitude": 10.4091116627533,
        "RelatedURL": "https://www.enelx.com/it/en/electric-mobility",
        "DistanceUnit": 0
    },
    "Connections": [
        {
            "ID": 70982,
            "ConnectionTypeID": 25,
            "StatusTypeID": 50,
            "LevelID": 2,
            "Amps": 32,
            "Voltage": 400,
            "PowerKW": 22,
            "CurrentTypeID": 20,
            "Quantity": 1
        },
        {
            "ID": 70983,
            "ConnectionTypeID": 36,
            "StatusTypeID": 50,
            "LevelID": 2,
            "Amps": 16,
            "Voltage": 240,
            "PowerKW": 3.7,
            "CurrentTypeID": 10,
            "Quantity": 1
        }
    ],
    "NumberOfPoints": 1,
    "StatusTypeID": 50,
    "DateLastStatusUpdate": "2019-03-28T21:02:00Z",
    "DataQualityLevel": 1,
    "DateCreated": "2015-10-27T15:52:00Z",
    "SubmissionStatusTypeID": 200
}