{
    "IsRecentlyVerified": false,
    "ID": 64494,
    "UUID": "70B90A8C-7F5C-460A-8CE6-EAE3B2EE7158",
    "DataProviderID": 1,
    "OperatorID": 98,
    "UsageTypeID": 4,
    "AddressInfo": {
        "ID": 64840,
        "Title": "Gasthaus Brennereistuben",
        "AddressLine1": "Bergstraße 21",
        "Town": "Wilhelmsdorf",
        "StateOrProvince": "Hagenbüchach-Wilhelmsdorf (VGem)",
        "Postcode": "91489",
        "CountryID": 87,
        "Latitude": 49.5629976,
        "Longitude": 10.735218199999963,
        "ContactTelephone1": "+49-9104 82629-0",
        "AccessComments": "Box ist an der Hauswand am unteren Parkplatz angebracht. Wenn man am oberen Parkplatz steht, ist ein etwas längeres Kabel (mind. 5m) erforderlich.",
        "DistanceUnit": 0
    },
    "Connections": [
        {
            "ID": 82784,
            "ConnectionTypeID": 17,
            "StatusTypeID": 50,
            "LevelID": 2,
            "Amps": 16,
            "Voltage": 400,
            "PowerKW": 11,
            "CurrentTypeID": 20,
            "Quantity": 1
        },
        {
            "ID": 82785,
            "ConnectionTypeID": 16,
            "StatusTypeID": 50,
            "LevelID": 2,
            "Amps": 16,
            "Voltage": 230,
            "PowerKW": 3.7,
            "CurrentTypeID": 10,
            "Quantity": 1
        },
        {
            "ID": 82786,
            "ConnectionTypeID": 28,
            "StatusTypeID": 50,
            "LevelID": 2,
            "Amps": 16,
            "Voltage": 230,
            "PowerKW": 3.7,
            "CurrentTypeID": 10,
            "Quantity": 1
        }
    ],
    "NumberOfPoints": 2,
    "StatusTypeID": 50,
    "DateLastStatusUpdate": "2016-03-08T13:45:00Z",
    "DataQualityLevel": 1,
    "DateCreated": "2016-03-08T13:45:00Z",
    "SubmissionStatusTypeID": 200
}