{
    "IsRecentlyVerified": false,
    "ID": 91261,
    "UUID": "C3DC35DF-786E-4F8D-A94A-661106D8C8AC",
    "DataProviderID": 1,
    "OperatorID": 220,
    "OperatorsReference": "3974",
    "UsageTypeID": 1,
    "UsageCost": "€1.73 + €0.3213/kWh; Andere Tarife möglich",
    "AddressInfo": {
        "ID": 91607,
        "Title": "Holstenstraße 156",
        "AddressLine1": "Holstenstraße 156",
        "Town": "Altona",
        "StateOrProvince": "Hamburg",
        "Postcode": "20535",
        "CountryID": 87,
        "Latitude": 53.559071,
        "Longitude": 9.94859,
        "DistanceUnit": 0
    },
    "Connections": [
        {
            "ID": 129392,
            "ConnectionTypeID": 25,
            "StatusTypeID": 50,
            "LevelID": 2,
            "Amps": 32,
            "Voltage": 400,
            "PowerKW": 22,
            "CurrentTypeID": 20,
            "Quantity": 2
        },
        {
            "ID": 129410,
            "ConnectionTypeID": 28,
            "StatusTypeID": 50,
            "LevelID": 2,
            "Amps": 16,
            "Voltage": 230,
            "PowerKW": 3.7,
            "CurrentTypeID": 10,
            "Quantity": 2
        }
    ],
    "NumberOfPoints": 2,
    "StatusTypeID": 50,
    "DateLastStatusUpdate": "2017-08-04T05:38:00Z",
    "DataQualityLevel": 1,
    "DateCreated": "2017-08-02T05:44:00Z",
    "SubmissionStatusTypeID": 200
}