{
    "IsRecentlyVerified": false,
    "ID": 90662,
    "UUID": "BED9B735-6994-42C8-A8D8-DF929A429742",
    "DataProviderID": 1,
    "OperatorID": 3,
    "OperatorsReference": "PSL-100835",
    "UsageTypeID": 6,
    "UsageCost": "Free",
    "AddressInfo": {
        "ID": 91008,
        "Title": "Johnsons Sutton Coldfield-Hyundai",
        "AddressLine1": "8 Kings Road",
        "Town": "West Midlands",
        "Postcode": "B73 5AF",
        "CountryID": 1,
        "Latitude": 52.548912,
        "Longitude": -1.861102,
        "DistanceUnit": 0
    },
    "Connections": [
        {
            "ID": 128379,
            "ConnectionTypeID": 25,
            "StatusTypeID": 50,
            "LevelID": 2,
            "Amps": 32,
            "Voltage": 230,
            "PowerKW": 7,
            "CurrentTypeID": 10,
            "Quantity": 1
        }
    ],
    "NumberOfPoints": 3,
    "GeneralComments": "This is a POD Point unit installed at the Johnsons Sutton Coldfield - Hyundai dealership in Kings Road, Sutton Coldfield, West Midlands",
    "StatusTypeID": 50,
    "DateLastStatusUpdate": "2017-12-20T11:09:00Z",
    "DataQualityLevel": 1,
    "DateCreated": "2017-07-21T14:06:00Z",
    "SubmissionStatusTypeID": 200
}