{
    "IsRecentlyVerified": false,
    "ID": 73585,
    "UUID": "1D62C894-ABAA-4EB9-A69F-017967CDB226",
    "DataProviderID": 1,
    "OperatorID": 89,
    "OperatorsReference": "AAA-430",
    "UsageTypeID": 4,
    "UsageCost": "CAD 1.00/hour",
    "AddressInfo": {
        "ID": 73931,
        "Title": "Oxford-Constitution Square Tower Ii",
        "AddressLine1": "350 Albert Street",
        "Town": "Ottawa",
        "StateOrProvince": "ON",
        "Postcode": "K1R 1A4",
        "CountryID": 44,
        "Latitude": 45.4182507422887,
        "Longitude": -75.7031361372195,
        "DistanceUnit": 0
    },
    "Connections": [
        {
            "ID": 105874,
            "ConnectionTypeID": 1,
            "StatusTypeID": 50,
            "LevelID": 2,
            "Amps": 32,
            "Voltage": 230,
            "PowerKW": 7,
            "CurrentTypeID": 10,
            "Quantity": 1
        }
    ],
    "NumberOfPoints": 1,
    "StatusTypeID": 50,
    "DateLastStatusUpdate": "2017-01-22T19:14:00Z",
    "DataQualityLevel": 1,
    "DateCreated": "2016-11-23T22:19:00Z",
    "SubmissionStatusTypeID": 200
}