{
    "UserComments": [
        {
            "ID": 22043,
            "ChargePointID": 146690,
            "CommentTypeID": 10,
            "UserName": "Dylan_Hudson",
            "DateCreated": "2020-01-13T21:02:41.947Z",
            "User": {
                "ID": 23370,
                "Username": "Dylan_Hudson"
            },
            "CheckinStatusTypeID": 140,
            "IsActionedByEditor": false
        }
    ],
    "IsRecentlyVerified": false,
    "ID": 146690,
    "UUID": "BBB5E1E8-573B-4371-935F-A6B0E57F3B25",
    "DataProviderID": 1,
    "OperatorID": 150,
    "UsageTypeID": 1,
    "UsageCost": "Free",
    "AddressInfo": {
        "ID": 147042,
        "Title": "West Street Car Park",
        "AddressLine1": "West Street",
        "AddressLine2": "Clough Head",
        "Town": "Calderdale",
        "StateOrProvince": "England",
        "Postcode": "HX6 3AN",
        "CountryID": 1,
        "Latitude": 53.70676794691917,
        "Longitude": -1.9137910055478642,
        "ContactTelephone1": "+44 333 666 0059",
        "RelatedURL": "https://ev.engie.co.uk",
        "DistanceUnit": 0
    },
    "Connections": [
        {
            "ID": 203977,
            "ConnectionTypeID": 2,
            "StatusTypeID": 50,
            "LevelID": 3,
            "PowerKW": 50,
            "CurrentTypeID": 30,
            "Quantity": 1
        },
        {
            "ID": 203978,
            "ConnectionTypeID": 33,
            "StatusTypeID": 50,
            "LevelID": 3,
            "PowerKW": 50,
            "CurrentTypeID": 30,
            "Quantity": 1
        },
        {
            "ID": 203979,
            "ConnectionTypeID": 25,
            "StatusTypeID": 50,
            "LevelID": 2,
            "PowerKW": 22,
            "CurrentTypeID": 20,
            "Quantity": 1
        }
    ],
    "NumberOfPoints": 1,
    "GeneralComments": "Engie rapid charger, 50kW DC, AC is a 22 Kw Socket. One bay for general use, one bay for taxis. Both Free to charge. ev.engie.co.uk  £10 overstay fee after 75 mins, then £10 every subsequent 75 mins. completely free to use until 29th October 2021.",
    "StatusTypeID": 50,
    "DateLastStatusUpdate": "2020-01-13T21:03:00Z",
    "DataQualityLevel": 1,
    "DateCreated": "2020-01-13T21:03:00Z",
    "SubmissionStatusTypeID": 200
}