{
    "IsRecentlyVerified": false,
    "ID": 81811,
    "UUID": "311D02AC-D15A-45A5-AC9A-D72F6818EAEF",
    "DataProviderID": 1,
    "OperatorID": 23,
    "OperatorsReference": "21430",
    "UsageTypeID": 6,
    "AddressInfo": {
        "ID": 82157,
        "Title": "Hotel Splendide Royal",
        "AddressLine1": "7 Riva Antonio Caccia",
        "Town": "Lugano",
        "Postcode": "6900",
        "CountryID": 217,
        "Latitude": 45.994637,
        "Longitude": 8.945937,
        "ContactTelephone1": "+41 91 985 77 11",
        "DistanceUnit": 0
    },
    "Connections": [
        {
            "ID": 116569,
            "ConnectionTypeID": 30,
            "StatusTypeID": 50,
            "LevelID": 2,
            "Amps": 32,
            "Voltage": 400,
            "PowerKW": 22,
            "CurrentTypeID": 20,
            "Quantity": 2
        }
    ],
    "NumberOfPoints": 2,
    "GeneralComments": "2 Tesla Connectors, up to 22kW.Available for patrons only. Please see valet.",
    "StatusTypeID": 50,
    "DateLastStatusUpdate": "2018-10-03T16:21:00Z",
    "DataQualityLevel": 1,
    "DateCreated": "2017-02-03T12:22:00Z",
    "SubmissionStatusTypeID": 200
}