{
    "IsRecentlyVerified": false,
    "ID": 8419,
    "UUID": "4735CBDC-0C34-4CB5-911D-405670958E87",
    "DataProviderID": 15,
    "DataProvidersReference": "11177",
    "OperatorID": 5,
    "AddressInfo": {
        "ID": 8316,
        "Title": "787 6th Street South",
        "AddressLine1": "787 6th Street South",
        "Town": "Kirkland",
        "StateOrProvince": "Washington",
        "Postcode": "98033",
        "CountryID": 2,
        "Latitude": 47.66917801,
        "Longitude": -122.1977921,
        "ContactTelephone1": "",
        "RelatedURL": "http://carstations.com/11177",
        "DistanceUnit": 0
    },
    "Connections": [
        {
            "ID": 5846,
            "ConnectionTypeID": 1,
            "Reference": "J1772",
            "LevelID": 2
        },
        {
            "ID": 6317,
            "ConnectionTypeID": 9,
            "Reference": "NEMA5",
            "LevelID": 1,
            "Quantity": 1
        }
    ],
    "StatusTypeID": 0,
    "DateLastStatusUpdate": "2017-11-04T14:05:00Z",
    "DataQualityLevel": 1,
    "DateCreated": "2011-11-11T12:06:00Z",
    "SubmissionStatusTypeID": 100
}