{
    "IsRecentlyVerified": false,
    "ID": 77655,
    "UUID": "FCE40535-136E-4EEE-BEA8-D2BDA9D9BC05",
    "DataProviderID": 1,
    "OperatorID": 3,
    "OperatorsReference": "PG-90597",
    "UsageTypeID": 6,
    "UsageCost": "1",
    "AddressInfo": {
        "ID": 78001,
        "Title": "Evolution Enabling-Greenwich",
        "AddressLine1": "Peartree Way",
        "Town": " London",
        "Postcode": "SE10 0BW",
        "CountryID": 1,
        "Latitude": 51.493314,
        "Longitude": 0.018861,
        "DistanceUnit": 0
    },
    "Connections": [
        {
            "ID": 112182,
            "ConnectionTypeID": 25,
            "StatusTypeID": 50,
            "LevelID": 2,
            "Amps": 32,
            "Voltage": 230,
            "PowerKW": 7,
            "CurrentTypeID": 10,
            "Quantity": 1
        }
    ],
    "NumberOfPoints": 1,
    "StatusTypeID": 0,
    "DateLastStatusUpdate": "2020-01-13T09:09:00Z",
    "DataQualityLevel": 1,
    "DateCreated": "2017-01-22T08:53:00Z",
    "SubmissionStatusTypeID": 200
}