{
    "IsRecentlyVerified": false,
    "ID": 173684,
    "UUID": "FA48B207-E128-4ABB-A26D-A623C7D57BB3",
    "DataProviderID": 18,
    "DataProvidersReference": "e2ccb62d7f1f4030ac9a4cacdfbe7ec4",
    "UsageTypeID": 1,
    "AddressInfo": {
        "ID": 174043,
        "Title": "LE16 7HA",
        "AddressLine1": "",
        "Town": "Market Harborough",
        "Postcode": "LE16 7HA",
        "CountryID": 1,
        "Latitude": 52.494068,
        "Longitude": 0.91771,
        "AccessComments": "",
        "RelatedURL": "http://www.plug-n-go.com/",
        "DistanceUnit": 0
    },
    "Connections": [
        {
            "ID": 266827,
            "ConnectionTypeID": 25,
            "Reference": "EO-2468",
            "StatusTypeID": 50,
            "LevelID": 2,
            "Amps": 32,
            "Voltage": 230,
            "PowerKW": 7,
            "CurrentTypeID": 10
        },
        {
            "ID": 266828,
            "ConnectionTypeID": 25,
            "Reference": "EO-03040",
            "StatusTypeID": 50,
            "LevelID": 2,
            "Amps": 32,
            "Voltage": 230,
            "PowerKW": 7,
            "CurrentTypeID": 10
        }
    ],
    "StatusTypeID": 0,
    "DateLastStatusUpdate": "2021-03-03T11:25:00Z",
    "MetadataValues": [
        {
            "ID": 8606,
            "MetadataFieldID": 4,
            "ItemValue": "Contains public sector information licensed under the Open Government Licence v2.0. http://www.nationalarchives.gov.uk/doc/open-government-licence/version/2/"
        }
    ],
    "DataQualityLevel": 3,
    "DateCreated": "2021-03-03T11:25:00Z",
    "SubmissionStatusTypeID": 100
}