{
    "IsRecentlyVerified": false,
    "ID": 65327,
    "UUID": "C9A45C19-7C30-4F21-BAEA-B17153509761",
    "DataProviderID": 1,
    "OperatorID": 32,
    "OperatorsReference": "106545",
    "UsageTypeID": 4,
    "UsageCost": "Inclusive; for Polar Plus subscription members only",
    "AddressInfo": {
        "ID": 65673,
        "Title": "Novotel Birmingham City Centre",
        "AddressLine1": "Broad Street",
        "AddressLine2": "Ladywood",
        "Town": "Birmingham",
        "StateOrProvince": "England",
        "Postcode": "B1 2HT",
        "CountryID": 1,
        "Latitude": 52.476475,
        "Longitude": -1.91361919999997,
        "RelatedURL": "http://www.accorhotels.com/gb/hotel-1077-novotel-birmingham-centre/index.shtml",
        "DistanceUnit": 0
    },
    "Connections": [
        {
            "ID": 90003,
            "ConnectionTypeID": 25,
            "StatusTypeID": 50,
            "LevelID": 2,
            "Amps": 16,
            "Voltage": 230,
            "PowerKW": 4,
            "CurrentTypeID": 10,
            "Quantity": 1
        }
    ],
    "NumberOfPoints": 2,
    "StatusTypeID": 50,
    "DateLastStatusUpdate": "2019-03-07T06:17:00Z",
    "DataQualityLevel": 1,
    "DateCreated": "2016-04-26T18:20:00Z",
    "SubmissionStatusTypeID": 200
}