{
    "IsRecentlyVerified": false,
    "ID": 120266,
    "UUID": "86632489-9783-4EDC-A9B4-242D1A1EC5F3",
    "DataProviderID": 2,
    "DataProvidersReference": "116850",
    "OperatorID": 5,
    "UsageTypeID": 1,
    "AddressInfo": {
        "ID": 120612,
        "Title": "HONDABELAIRMALL",
        "AddressLine1": "1175 East Interstate 65 Service Rd S",
        "Town": "Mobile",
        "StateOrProvince": "AL",
        "Postcode": "36606",
        "CountryID": 2,
        "Latitude": 30.66518,
        "Longitude": -88.125241,
        "ContactTelephone1": "888-758-4389",
        "AccessComments": "24 hours daily",
        "RelatedURL": "http://www.chargepoint.com/",
        "DistanceUnit": 0
    },
    "Connections": [
        {
            "ID": 169597,
            "ConnectionTypeID": 1,
            "LevelID": 2,
            "Amps": 16,
            "Voltage": 230,
            "PowerKW": 3.7,
            "CurrentTypeID": 10,
            "Quantity": 2
        }
    ],
    "DateLastStatusUpdate": "2020-06-26T02:54:00Z",
    "DataQualityLevel": 3,
    "DateCreated": "2019-04-01T04:59:00Z",
    "SubmissionStatusTypeID": 100
}