{
    "IsRecentlyVerified": false,
    "ID": 144827,
    "UUID": "89674360-DDF9-490E-925B-65BB9971D7A1",
    "DataProviderID": 2,
    "DataProvidersReference": "129776",
    "OperatorID": 89,
    "UsageTypeID": 1,
    "AddressInfo": {
        "ID": 145179,
        "Title": "Benny & Co. - Blainville",
        "AddressLine1": "70 Boul. De la Seigneurie Ouest",
        "Town": "BLAINVILLE",
        "StateOrProvince": "QC",
        "Postcode": "J7C 5M3",
        "CountryID": 44,
        "Latitude": 45.666695,
        "Longitude": -73.871299,
        "ContactTelephone1": "888-356-8911",
        "AccessComments": "24 hours daily",
        "RelatedURL": "https://flo.ca/",
        "DistanceUnit": 0
    },
    "Connections": [
        {
            "ID": 201365,
            "ConnectionTypeID": 1,
            "LevelID": 2,
            "Amps": 16,
            "Voltage": 230,
            "PowerKW": 3.7,
            "CurrentTypeID": 10,
            "Quantity": 1
        }
    ],
    "StatusTypeID": 50,
    "DateLastStatusUpdate": "2020-06-26T03:09:00Z",
    "DataQualityLevel": 3,
    "DateCreated": "2019-12-24T09:23:00Z",
    "SubmissionStatusTypeID": 100
}