{
    "IsRecentlyVerified": false,
    "ID": 28894,
    "UUID": "708053DD-740B-48DF-8305-C8BB9E1DCD3C",
    "DataProviderID": 2,
    "DataProvidersReference": "51089",
    "UsageTypeID": 2,
    "AddressInfo": {
        "ID": 29240,
        "Title": "Hamilton Chevrolet",
        "AddressLine1": "5800 14 Mile Rd",
        "Town": "Warren",
        "StateOrProvince": "MI",
        "Postcode": "48092",
        "CountryID": 2,
        "Latitude": 42.5352135105283,
        "Longitude": -83.0492083055573,
        "ContactTelephone1": "",
        "AccessComments": "Service center use only",
        "RelatedURL": "",
        "DistanceUnit": 0
    },
    "Connections": [
        {
            "ID": 31752,
            "ConnectionTypeID": 1,
            "LevelID": 2,
            "Amps": 16,
            "Voltage": 230,
            "PowerKW": 3.7,
            "CurrentTypeID": 10,
            "Quantity": 2
        }
    ],
    "DateLastStatusUpdate": "2020-06-26T03:06:00Z",
    "DataQualityLevel": 3,
    "DateCreated": "2014-11-28T03:38:00Z",
    "SubmissionStatusTypeID": 100
}