{
    "IsRecentlyVerified": false,
    "ID": 68190,
    "UUID": "A2C585A7-391D-4A21-AA3E-6E569AD3CD65",
    "DataProviderID": 26,
    "DataProvidersReference": "90433",
    "OperatorID": 177,
    "OperatorsReference": "Nuon EVB-P1539155",
    "UsageCost": "0.00 jaarabonnement",
    "AddressInfo": {
        "ID": 68536,
        "Title": "Holy 2",
        "AddressLine1": "Holy 2",
        "Town": "Amsterdam",
        "Postcode": "1083 JK",
        "CountryID": 159,
        "Latitude": 52.332832,
        "Longitude": 4.882153,
        "RelatedURL": "http://www.nuon.nl/ev",
        "DistanceUnit": 0
    },
    "Connections": [
        {
            "ID": 95021,
            "ConnectionTypeID": 25,
            "LevelID": 2,
            "PowerKW": 11,
            "CurrentTypeID": 10
        },
        {
            "ID": 95022,
            "ConnectionTypeID": 25,
            "LevelID": 2,
            "PowerKW": 11,
            "CurrentTypeID": 10
        }
    ],
    "NumberOfPoints": 1,
    "StatusTypeID": 50,
    "DateLastStatusUpdate": "2016-06-04T02:37:00Z",
    "DataQualityLevel": 3,
    "DateCreated": "2016-06-04T02:37:00Z",
    "SubmissionStatusTypeID": 100
}