{
    "IsRecentlyVerified": false,
    "ID": 46139,
    "UUID": "782615D0-623F-4964-BCCA-3169AC5ED22C",
    "DataProviderID": 1,
    "DataProvidersReference": "838",
    "AddressInfo": {
        "ID": 46485,
        "Title": "Truckstasjon Svadde, Rjukan",
        "AddressLine1": "Svadde industriområde ",
        "Town": "RJUKAN",
        "StateOrProvince": "Vestfold og Telemark",
        "Postcode": "3661",
        "CountryID": 168,
        "Latitude": 59.88012,
        "Longitude": 8.66088,
        "AccessComments": "Nærmeste nabo er Cirkle K Rjukan Truck tank punkt.",
        "DistanceUnit": 0
    },
    "Connections": [
        {
            "ID": 56802,
            "ConnectionTypeID": 0,
            "Reference": "1",
            "LevelID": 2,
            "Amps": 16,
            "Voltage": 230,
            "PowerKW": 3.7,
            "Comments": "Mode 1"
        }
    ],
    "NumberOfPoints": 1,
    "DateLastStatusUpdate": "2020-05-26T08:23:00Z",
    "DataQualityLevel": 2,
    "DateCreated": "2015-05-03T00:54:00Z",
    "SubmissionStatusTypeID": 100
}