{
    "IsRecentlyVerified": false,
    "ID": 62866,
    "UUID": "D33BF2D6-438C-4650-8C0E-C39A1A400E95",
    "DataProviderID": 26,
    "DataProvidersReference": "72390",
    "OperatorID": 157,
    "OperatorsReference": "NewMotion 02013090",
    "UsageCost": "0.00 jaarabonnement",
    "AddressInfo": {
        "ID": 63212,
        "Title": "Keramiekstraat 11",
        "AddressLine1": "Keramiekstraat 11",
        "Town": "Venlo",
        "Postcode": "5935 TE",
        "CountryID": 159,
        "Latitude": 51.3334416,
        "Longitude": 6.1294031,
        "ContactTelephone1": "088 0109500",
        "RelatedURL": "http://thenewmotion.nl/",
        "DistanceUnit": 0
    },
    "Connections": [
        {
            "ID": 79855,
            "ConnectionTypeID": 25,
            "LevelID": 2,
            "PowerKW": 3.7,
            "CurrentTypeID": 10
        }
    ],
    "NumberOfPoints": 1,
    "StatusTypeID": 50,
    "DateLastStatusUpdate": "2016-06-04T02:38:00Z",
    "DataQualityLevel": 3,
    "DateCreated": "2016-03-03T12:29:00Z",
    "SubmissionStatusTypeID": 100
}