{
    "IsRecentlyVerified": false,
    "ID": 144189,
    "UUID": "3230231D-C6B0-4CA3-9819-E5099E9AD055",
    "DataProviderID": 2,
    "DataProvidersReference": "145245",
    "OperatorID": 3293,
    "UsageTypeID": 1,
    "AddressInfo": {
        "ID": 144541,
        "Title": "Albertsons",
        "AddressLine1": "14300 SW Barrows Rd",
        "Town": "Tigard",
        "StateOrProvince": "OR",
        "Postcode": "97223",
        "CountryID": 2,
        "Latitude": 45.431671,
        "Longitude": -122.823849,
        "ContactTelephone1": "888-264-2208",
        "AccessComments": "6am-12am daily",
        "RelatedURL": "https://voltacharging.com/",
        "DistanceUnit": 0
    },
    "Connections": [
        {
            "ID": 200673,
            "ConnectionTypeID": 1,
            "LevelID": 2,
            "Amps": 16,
            "Voltage": 230,
            "PowerKW": 3.7,
            "CurrentTypeID": 10,
            "Quantity": 2
        }
    ],
    "StatusTypeID": 50,
    "DateLastStatusUpdate": "2020-06-26T03:09:00Z",
    "DataQualityLevel": 3,
    "DateCreated": "2019-12-24T09:23:00Z",
    "SubmissionStatusTypeID": 100
}