{
    "IsRecentlyVerified": false,
    "ID": 175430,
    "UUID": "32E40D44-9F15-4854-BE70-22004DA4A4A2",
    "DataProviderID": 1,
    "OperatorID": 3447,
    "UsageTypeID": 1,
    "AddressInfo": {
        "ID": 175789,
        "Title": "Total - Relais Ploumagoar",
        "AddressLine1": "Route de Saint Brieuc",
        "Town": "Ploumagoar",
        "Postcode": "22970",
        "CountryID": 80,
        "Latitude": 48.55041813183715,
        "Longitude": -3.112635156629608,
        "RelatedURL": "https://apps.total-ev-charge.com/charge-points/TOTAL-NF050462-001",
        "DistanceUnit": 0
    },
    "Connections": [
        {
            "ID": 272198,
            "ConnectionTypeID": 33,
            "StatusTypeID": 50,
            "LevelID": 3,
            "PowerKW": 175,
            "CurrentTypeID": 30,
            "Quantity": 1
        },
        {
            "ID": 272199,
            "ConnectionTypeID": 2,
            "StatusTypeID": 50,
            "LevelID": 3,
            "PowerKW": 100,
            "CurrentTypeID": 30,
            "Quantity": 1
        },
        {
            "ID": 272200,
            "ConnectionTypeID": 33,
            "StatusTypeID": 50,
            "LevelID": 3,
            "PowerKW": 50,
            "CurrentTypeID": 30,
            "Quantity": 1
        },
        {
            "ID": 272201,
            "ConnectionTypeID": 2,
            "StatusTypeID": 50,
            "LevelID": 3,
            "PowerKW": 50,
            "CurrentTypeID": 30,
            "Quantity": 1
        },
        {
            "ID": 272202,
            "ConnectionTypeID": 1036,
            "StatusTypeID": 50,
            "LevelID": 3,
            "PowerKW": 43,
            "CurrentTypeID": 20,
            "Quantity": 1
        },
        {
            "ID": 272203,
            "ConnectionTypeID": 28,
            "StatusTypeID": 50,
            "CurrentTypeID": 10,
            "Quantity": 1
        }
    ],
    "NumberOfPoints": 2,
    "StatusTypeID": 50,
    "DateLastStatusUpdate": "2021-05-19T19:55:00Z",
    "DataQualityLevel": 1,
    "DateCreated": "2021-05-19T13:16:00Z",
    "SubmissionStatusTypeID": 200
}