{
    "IsRecentlyVerified": false,
    "ID": 153029,
    "UUID": "FAD9314B-3537-4216-A0E7-AD0BEE30D8FB",
    "DataProviderID": 28,
    "DataProvidersReference": "",
    "UsageTypeID": 5,
    "AddressInfo": {
        "ID": 153382,
        "Title": "CHEMILLE SUR DEME 1224",
        "AddressLine1": "Rue de L'Averne - Parking derrière la Mairie - 37370 CHEMILLE SUR DEME",
        "CountryID": 80,
        "Latitude": 47.659527,
        "Longitude": 0.649559,
        "AccessComments": "24/24 7/7",
        "DistanceUnit": 0
    },
    "Connections": [
        {
            "ID": 214490,
            "ConnectionTypeID": 28,
            "StatusTypeID": 50,
            "LevelID": 2,
            "PowerKW": 18,
            "CurrentTypeID": 10
        },
        {
            "ID": 214491,
            "ConnectionTypeID": 25,
            "StatusTypeID": 50,
            "LevelID": 2,
            "PowerKW": 18,
            "CurrentTypeID": 10
        }
    ],
    "GeneralComments": "www.virtaev.fr",
    "StatusTypeID": 50,
    "DateLastStatusUpdate": "2020-03-15T10:54:00Z",
    "DataQualityLevel": 2,
    "DateCreated": "2020-03-15T10:54:00Z",
    "SubmissionStatusTypeID": 100
}