{
    "IsRecentlyVerified": false,
    "ID": 34405,
    "UUID": "5F54E2F7-C0B5-48ED-8C91-4B3E70835508",
    "DataProviderID": 26,
    "DataProvidersReference": "49274",
    "OperatorID": 157,
    "OperatorsReference": "NewMotion ICUEVE000331",
    "UsageCost": "0.00 jaarabonnement",
    "AddressInfo": {
        "ID": 34751,
        "Title": "Abram van Rijckevorselweg",
        "AddressLine1": "Abram van Rijckevorselweg",
        "Town": "Capelle aan den IJssel",
        "Postcode": "2909 LK",
        "CountryID": 159,
        "Latitude": 51.9138031005859,
        "Longitude": 4.54650211334229,
        "ContactTelephone1": "088 0109500",
        "RelatedURL": "http://thenewmotion.nl/",
        "DistanceUnit": 0
    },
    "Connections": [
        {
            "ID": 37916,
            "ConnectionTypeID": 25,
            "LevelID": 2,
            "PowerKW": 22,
            "CurrentTypeID": 10
        },
        {
            "ID": 47232,
            "ConnectionTypeID": 25,
            "LevelID": 2,
            "PowerKW": 22,
            "CurrentTypeID": 10
        },
        {
            "ID": 47233,
            "ConnectionTypeID": 25,
            "LevelID": 2,
            "PowerKW": 22,
            "CurrentTypeID": 10
        }
    ],
    "NumberOfPoints": 2,
    "StatusTypeID": 50,
    "DateLastStatusUpdate": "2016-06-04T02:42:00Z",
    "DataQualityLevel": 3,
    "DateCreated": "2015-01-09T06:04:00Z",
    "SubmissionStatusTypeID": 100
}