{
    "UserComments": [
        {
            "ID": 24006,
            "ChargePointID": 23310,
            "CommentTypeID": 10,
            "UserName": "ForumElettrico.it",
            "Comment": "Vicinissime al nuovo centro City Life ed un po' più lontane dalla vecchia fiera. Leggi la recensione completa qui >  https://www.forumelettrico.it/forum/a2a-2-quick-2x22kw-2tipo3a-via-berengario-6-milano-t9607.html",
            "RelatedURL": "https://www.forumelettrico.it/forum/a2a-2-quick-2x22kw-2tipo3a-via-berengario-6-milano-t9607.html",
            "DateCreated": "2021-03-13T15:02:22.923Z",
            "User": {
                "ID": 11749,
                "Username": "ForumElettrico.it"
            },
            "CheckinStatusTypeID": 10,
            "IsActionedByEditor": false
        },
        {
            "ID": 17843,
            "ChargePointID": 23310,
            "CommentTypeID": 10,
            "UserName": "polianto",
            "Comment": "Ok con tessera A2A. Attenzione alle rampe di accesso al parcheggio, sono molto ripide e si rischia di toccare sotto.",
            "Rating": 3,
            "DateCreated": "2017-10-22T12:13:51.487Z",
            "User": {
                "ID": 1606,
                "Username": "polianto"
            },
            "CheckinStatusTypeID": 15
        }
    ],
    "MediaItems": [
        {
            "ID": 26875,
            "ChargePointID": 23310,
            "ItemURL": "https://s3-ap-southeast-2.amazonaws.com/openchargemap/images/IT/OCM23310/OCM-23310.orig.2021031315023408.jpg",
            "ItemThumbnailURL": "https://s3-ap-southeast-2.amazonaws.com/openchargemap/images/IT/OCM23310/OCM-23310.thmb.2021031315023408.jpg",
            "Comment": "",
            "IsEnabled": true,
            "IsVideo": false,
            "IsFeaturedItem": false,
            "IsExternalResource": false,
            "User": {
                "ID": 11749,
                "Username": "ForumElettrico.it"
            },
            "DateCreated": "2021-03-13T15:03:00Z"
        },
        {
            "ID": 26876,
            "ChargePointID": 23310,
            "ItemURL": "https://s3-ap-southeast-2.amazonaws.com/openchargemap/images/IT/OCM23310/OCM-23310.orig.2021031315024096.jpg",
            "ItemThumbnailURL": "https://s3-ap-southeast-2.amazonaws.com/openchargemap/images/IT/OCM23310/OCM-23310.thmb.2021031315024096.jpg",
            "Comment": "",
            "IsEnabled": true,
            "IsVideo": false,
            "IsFeaturedItem": false,
            "IsExternalResource": false,
            "User": {
                "ID": 11749,
                "Username": "ForumElettrico.it"
            },
            "DateCreated": "2021-03-13T15:03:00Z"
        },
        {
            "ID": 26877,
            "ChargePointID": 23310,
            "ItemURL": "https://s3-ap-southeast-2.amazonaws.com/openchargemap/images/IT/OCM23310/OCM-23310.orig.2021031315025272.jpg",
            "ItemThumbnailURL": "https://s3-ap-southeast-2.amazonaws.com/openchargemap/images/IT/OCM23310/OCM-23310.thmb.2021031315025272.jpg",
            "Comment": "",
            "IsEnabled": true,
            "IsVideo": false,
            "IsFeaturedItem": false,
            "IsExternalResource": false,
            "User": {
                "ID": 11749,
                "Username": "ForumElettrico.it"
            },
            "DateCreated": "2021-03-13T15:03:00Z"
        },
        {
            "ID": 26878,
            "ChargePointID": 23310,
            "ItemURL": "https://s3-ap-southeast-2.amazonaws.com/openchargemap/images/IT/OCM23310/OCM-23310.orig.2021031315025960.jpg",
            "ItemThumbnailURL": "https://s3-ap-southeast-2.amazonaws.com/openchargemap/images/IT/OCM23310/OCM-23310.thmb.2021031315025960.jpg",
            "Comment": "",
            "IsEnabled": true,
            "IsVideo": false,
            "IsFeaturedItem": false,
            "IsExternalResource": false,
            "User": {
                "ID": 11749,
                "Username": "ForumElettrico.it"
            },
            "DateCreated": "2021-03-13T15:03:00Z"
        },
        {
            "ID": 26879,
            "ChargePointID": 23310,
            "ItemURL": "https://s3-ap-southeast-2.amazonaws.com/openchargemap/images/IT/OCM23310/OCM-23310.orig.2021031315030654.jpg",
            "ItemThumbnailURL": "https://s3-ap-southeast-2.amazonaws.com/openchargemap/images/IT/OCM23310/OCM-23310.thmb.2021031315030654.jpg",
            "Comment": "",
            "IsEnabled": true,
            "IsVideo": false,
            "IsFeaturedItem": false,
            "IsExternalResource": false,
            "User": {
                "ID": 11749,
                "Username": "ForumElettrico.it"
            },
            "DateCreated": "2021-03-13T15:03:00Z"
        },
        {
            "ID": 13561,
            "ChargePointID": 23310,
            "ItemURL": "https://s3-ap-southeast-2.amazonaws.com/openchargemap/images/IT/OCM23310/OCM-23310.orig.2017102212115054.jpg",
            "ItemThumbnailURL": "https://s3-ap-southeast-2.amazonaws.com/openchargemap/images/IT/OCM23310/OCM-23310.thmb.2017102212115054.jpg",
            "Comment": "",
            "IsEnabled": true,
            "IsVideo": false,
            "IsFeaturedItem": false,
            "IsExternalResource": false,
            "User": {
                "ID": 1606,
                "Username": "polianto"
            },
            "DateCreated": "2017-10-22T12:12:00Z"
        },
        {
            "ID": 376,
            "ChargePointID": 23310,
            "ItemURL": "https://s3-ap-southeast-2.amazonaws.com/openchargemap/images/IT/OCM23310/OCM-23310.orig.2014051817331242.jpg",
            "ItemThumbnailURL": "https://s3-ap-southeast-2.amazonaws.com/openchargemap/images/IT/OCM23310/OCM-23310.thmb.2014051817331242.jpg",
            "Comment": "",
            "IsEnabled": true,
            "IsVideo": false,
            "IsFeaturedItem": false,
            "IsExternalResource": false,
            "User": {
                "ID": 1606,
                "Username": "polianto"
            },
            "DateCreated": "2014-05-18T17:33:00Z"
        }
    ],
    "IsRecentlyVerified": false,
    "ID": 23310,
    "UUID": "E882F705-6761-419D-8E3C-FD1011447603",
    "DataProviderID": 1,
    "OperatorID": 82,
    "UsageTypeID": 4,
    "UsageCost": "15€ for 3months",
    "AddressInfo": {
        "ID": 23655,
        "Title": "A2A AmendolaFiera",
        "AddressLine1": "Piazza Amendola 8",
        "Town": "Milano",
        "StateOrProvince": "Milano",
        "Postcode": "20145",
        "CountryID": 112,
        "Latitude": 45.4748748901884,
        "Longitude": 9.1515399728663,
        "ContactTelephone1": "800035151",
        "RelatedURL": "http://www.e-moving.it/",
        "DistanceUnit": 0
    },
    "Connections": [
        {
            "ID": 25187,
            "ConnectionTypeID": 25,
            "StatusTypeID": 50,
            "LevelID": 2,
            "Amps": 32,
            "Voltage": 400,
            "PowerKW": 22,
            "CurrentTypeID": 20,
            "Quantity": 4
        },
        {
            "ID": 92192,
            "ConnectionTypeID": 36,
            "StatusTypeID": 50,
            "LevelID": 2,
            "Amps": 16,
            "Voltage": 240,
            "PowerKW": 3.7,
            "CurrentTypeID": 10,
            "Quantity": 4
        }
    ],
    "NumberOfPoints": 4,
    "StatusTypeID": 50,
    "DateLastStatusUpdate": "2021-03-13T15:03:00Z",
    "DataQualityLevel": 1,
    "DateCreated": "2014-05-18T17:01:00Z",
    "SubmissionStatusTypeID": 200
}