{
    "IsRecentlyVerified": false,
    "ID": 92424,
    "UUID": "C1759A61-F639-401B-B67C-F1B4E96EC686",
    "DataProviderID": 1,
    "OperatorID": 156,
    "UsageTypeID": 4,
    "AddressInfo": {
        "ID": 92770,
        "Title": "Elektro Diekhoff",
        "AddressLine1": "Schönerlinder Straße 51",
        "Town": "Berlin",
        "StateOrProvince": "Berlin",
        "Postcode": "13127",
        "CountryID": 87,
        "Latitude": 52.6150544,
        "Longitude": 13.432045799999969,
        "ContactTelephone1": "+49 30 4742022",
        "AccessComments": "24/7 nuutzbare New Motion lolo Wallbox links an der Wand neben dem Metallzaun.",
        "RelatedURL": "http://www.elektro-diekhoff.de/",
        "DistanceUnit": 0
    },
    "Connections": [
        {
            "ID": 131012,
            "ConnectionTypeID": 25,
            "StatusTypeID": 50,
            "LevelID": 2,
            "Amps": 32,
            "Voltage": 400,
            "PowerKW": 22,
            "CurrentTypeID": 20,
            "Quantity": 1
        }
    ],
    "NumberOfPoints": 1,
    "StatusTypeID": 50,
    "DateLastStatusUpdate": "2017-09-06T05:41:00Z",
    "DataQualityLevel": 1,
    "DateCreated": "2017-09-06T05:41:00Z",
    "SubmissionStatusTypeID": 200
}