{
    "IsRecentlyVerified": false,
    "ID": 187503,
    "UUID": "8D4DDF0B-02D8-4F3A-B8F7-5FB9B2C094A1",
    "DataProviderID": 18,
    "DataProvidersReference": "349319c989f70ac97c3824689547bf5d",
    "OperatorID": 2244,
    "UsageTypeID": 5,
    "AddressInfo": {
        "ID": 187862,
        "Title": "22 Nansen Road",
        "AddressLine1": "22 Nansen Road",
        "Town": "London",
        "Postcode": "SW11 5NT",
        "CountryID": 1,
        "Latitude": -0.15366,
        "Longitude": 51.464143,
        "AccessComments": "",
        "RelatedURL": "https://www.ubitricity.com",
        "DistanceUnit": 0
    },
    "Connections": [
        {
            "ID": 302637,
            "ConnectionTypeID": 25,
            "Reference": "suby1100005341",
            "StatusTypeID": 50,
            "LevelID": 2,
            "Amps": 16,
            "Voltage": 230,
            "PowerKW": 3.7,
            "CurrentTypeID": 10
        }
    ],
    "StatusTypeID": 0,
    "DateLastStatusUpdate": "2021-07-12T03:38:00Z",
    "MetadataValues": [
        {
            "ID": 19743,
            "MetadataFieldID": 4,
            "ItemValue": "Contains public sector information licensed under the Open Government Licence v2.0. http://www.nationalarchives.gov.uk/doc/open-government-licence/version/2/"
        }
    ],
    "DataQualityLevel": 3,
    "DateCreated": "2021-07-12T03:38:00Z",
    "SubmissionStatusTypeID": 100
}