{
    "IsRecentlyVerified": false,
    "ID": 143213,
    "UUID": "A1A31BF7-4085-4E81-9CCA-08A77F7BA555",
    "DataProviderID": 2,
    "DataProvidersReference": "148088",
    "OperatorID": 39,
    "UsageTypeID": 1,
    "AddressInfo": {
        "ID": 143565,
        "Title": "Princeton Westford Appartments",
        "AddressLine1": "Princeton Way",
        "Town": "Westford",
        "StateOrProvince": "MA",
        "Postcode": "01886",
        "CountryID": 2,
        "Latitude": 42.5744079,
        "Longitude": -71.3971022,
        "ContactTelephone1": "800-663-5633",
        "AccessComments": "MO: Not Specified; TU: Not Specified; WE: Not Specified; TH: Not Specified; FR: Not Specified; SA: Not Specified; SU: Not Specified",
        "RelatedURL": "http://www.semacharge.com/",
        "DistanceUnit": 0
    },
    "Connections": [
        {
            "ID": 199500,
            "ConnectionTypeID": 1,
            "LevelID": 2,
            "Amps": 16,
            "Voltage": 230,
            "PowerKW": 3.7,
            "CurrentTypeID": 10,
            "Quantity": 2
        }
    ],
    "StatusTypeID": 50,
    "DateLastStatusUpdate": "2020-06-26T03:06:00Z",
    "DataQualityLevel": 3,
    "DateCreated": "2019-12-24T09:20:00Z",
    "SubmissionStatusTypeID": 100
}