{
    "IsRecentlyVerified": false,
    "ID": 43642,
    "UUID": "404E5B6F-717D-47EB-8135-CFA07C7AAE9F",
    "DataProviderID": 1,
    "OperatorID": 3,
    "OperatorsReference": "PP-5112074",
    "UsageTypeID": 6,
    "UsageCost": "Free",
    "AddressInfo": {
        "ID": 43988,
        "Title": "Putteridge Bury Campus",
        "AddressLine1": "Hitchin Road",
        "Town": "Luton",
        "StateOrProvince": "Bedfordshire",
        "Postcode": "LU2 8LE",
        "CountryID": 1,
        "Latitude": 51.910731,
        "Longitude": -0.374136,
        "DistanceUnit": 0
    },
    "Connections": [
        {
            "ID": 121048,
            "ConnectionTypeID": 25,
            "StatusTypeID": 50,
            "LevelID": 2,
            "Amps": 32,
            "Voltage": 230,
            "PowerKW": 7,
            "CurrentTypeID": 10,
            "Quantity": 2
        }
    ],
    "NumberOfPoints": 2,
    "GeneralComments": "Pod Point PP-5112074",
    "StatusTypeID": 0,
    "DateLastStatusUpdate": "2019-05-02T05:35:00Z",
    "DataQualityLevel": 1,
    "DateCreated": "2015-04-08T23:05:00Z",
    "SubmissionStatusTypeID": 200
}