{
    "IsRecentlyVerified": false,
    "ID": 90201,
    "UUID": "B010D20E-5D80-456E-8589-C9BCEAF52903",
    "DataProviderID": 1,
    "OperatorID": 23,
    "OperatorsReference": "28544",
    "UsageTypeID": 4,
    "UsageCost": "$0.24/min >=60kW; $0.12/min <60kW; other tariffs for older cars",
    "AddressInfo": {
        "ID": 90547,
        "Title": "Ludington Supercharger",
        "AddressLine1": "3900 W Us Hwy 10",
        "Town": "Ludington",
        "Postcode": "49431-7612",
        "CountryID": 2,
        "Latitude": 43.957103,
        "Longitude": -86.376093,
        "DistanceUnit": 0
    },
    "Connections": [
        {
            "ID": 127854,
            "ConnectionTypeID": 27,
            "StatusTypeID": 50,
            "LevelID": 3,
            "PowerKW": 120,
            "CurrentTypeID": 30,
            "Quantity": 8
        }
    ],
    "NumberOfPoints": 8,
    "GeneralComments": "Charging8 Superchargers, available 24/7",
    "StatusTypeID": 50,
    "DateLastStatusUpdate": "2018-03-13T16:27:00Z",
    "DataQualityLevel": 1,
    "DateCreated": "2017-07-13T14:13:00Z",
    "SubmissionStatusTypeID": 200
}