{
    "UserComments": [
        {
            "ID": 23071,
            "ChargePointID": 162660,
            "CommentTypeID": 10,
            "UserName": "interssl.com",
            "Comment": "Seems like one of the two charging spots is used for their own car. When i drove by today, both slots were in use.",
            "Rating": 3,
            "DateCreated": "2020-08-13T17:12:06.757Z",
            "User": {
                "ID": 26760,
                "Username": "interssl.com"
            },
            "CheckinStatusTypeID": 140,
            "IsActionedByEditor": false
        }
    ],
    "IsRecentlyVerified": false,
    "ID": 162660,
    "UUID": "A9C93747-8280-4F7C-A1E2-1AD593CAB495",
    "DataProviderID": 1,
    "OperatorID": 45,
    "UsageTypeID": 6,
    "UsageCost": "free parking, free charging",
    "AddressInfo": {
        "ID": 163017,
        "Title": "Raiffeisen Kundenparkplatz",
        "AddressLine1": "Brennerstraße",
        "AddressLine2": "Salfaun",
        "Town": "Marktgemeinde Steinach am Brenner",
        "StateOrProvince": "Bezirk Innsbruck-Land",
        "Postcode": "6150",
        "CountryID": 19,
        "Latitude": 47.09108131744057,
        "Longitude": 11.466647877072774,
        "DistanceUnit": 0
    },
    "Connections": [
        {
            "ID": 234108,
            "ConnectionTypeID": 25,
            "StatusTypeID": 50,
            "LevelID": 2,
            "Amps": 16,
            "PowerKW": 11,
            "CurrentTypeID": 20,
            "Quantity": 2
        }
    ],
    "NumberOfPoints": 2,
    "StatusTypeID": 50,
    "DateLastStatusUpdate": "2020-08-14T12:57:00Z",
    "DataQualityLevel": 1,
    "DateCreated": "2020-08-13T17:11:00Z",
    "SubmissionStatusTypeID": 200
}