{
    "IsRecentlyVerified": false,
    "ID": 31561,
    "UUID": "76064D9B-C70B-4A92-AD09-785D0C574555",
    "DataProviderID": 26,
    "DataProvidersReference": "56374",
    "OperatorID": 78,
    "OperatorsReference": "Essent EM-CH-00001631-01-00001",
    "UsageCost": "0.00 jaarabonnement",
    "AddressInfo": {
        "ID": 31907,
        "Title": "Hauptstrasse",
        "AddressLine1": "Hauptstrasse",
        "Town": "Glarus Süd",
        "Postcode": "8773",
        "CountryID": 217,
        "Latitude": 46.993342,
        "Longitude": 9.0729,
        "RelatedURL": "http://www.essent.nl",
        "DistanceUnit": 0
    },
    "Connections": [
        {
            "ID": 35072,
            "ConnectionTypeID": 25,
            "LevelID": 2,
            "PowerKW": 11,
            "CurrentTypeID": 10
        },
        {
            "ID": 45974,
            "ConnectionTypeID": 25,
            "LevelID": 2,
            "PowerKW": 11
        }
    ],
    "NumberOfPoints": 1,
    "StatusTypeID": 50,
    "DateLastStatusUpdate": "2016-06-04T02:37:00Z",
    "DataQualityLevel": 3,
    "DateCreated": "2015-01-09T06:03:00Z",
    "SubmissionStatusTypeID": 100
}