{
    "IsRecentlyVerified": false,
    "ID": 161382,
    "UUID": "C1CA6CCD-7E8B-4FEF-B261-98CE2E4896CA",
    "DataProviderID": 1,
    "OperatorID": 1,
    "UsageTypeID": 1,
    "AddressInfo": {
        "ID": 161739,
        "Title": "Hvervenmoveien 2",
        "AddressLine1": "Hvervenmoveien 2",
        "Town": "Hønefoss",
        "StateOrProvince": "Ringerike",
        "Postcode": "3511",
        "CountryID": 168,
        "Latitude": 60.14316150743727,
        "Longitude": 10.32556915173268,
        "ContactTelephone1": "32110011",
        "ContactEmail": "support@kople.no",
        "RelatedURL": "https://www.kople.no/",
        "DistanceUnit": 0
    },
    "Connections": [
        {
            "ID": 232251,
            "ConnectionTypeID": 33,
            "StatusTypeID": 50,
            "LevelID": 3,
            "PowerKW": 150,
            "CurrentTypeID": 30,
            "Quantity": 2
        },
        {
            "ID": 232252,
            "ConnectionTypeID": 33,
            "StatusTypeID": 50,
            "LevelID": 3,
            "PowerKW": 150,
            "CurrentTypeID": 30,
            "Quantity": 2
        },
        {
            "ID": 232253,
            "ConnectionTypeID": 33,
            "StatusTypeID": 50,
            "LevelID": 3,
            "PowerKW": 150,
            "CurrentTypeID": 30,
            "Quantity": 2
        },
        {
            "ID": 232254,
            "ConnectionTypeID": 33,
            "StatusTypeID": 50,
            "LevelID": 3,
            "PowerKW": 150,
            "CurrentTypeID": 30,
            "Quantity": 2
        },
        {
            "ID": 232255,
            "ConnectionTypeID": 33,
            "StatusTypeID": 50,
            "LevelID": 3,
            "PowerKW": 62.5,
            "CurrentTypeID": 30,
            "Quantity": 4
        },
        {
            "ID": 232256,
            "ConnectionTypeID": 33,
            "StatusTypeID": 50,
            "LevelID": 3,
            "PowerKW": 62.5,
            "CurrentTypeID": 30,
            "Quantity": 4
        }
    ],
    "NumberOfPoints": 12,
    "StatusTypeID": 50,
    "DateLastStatusUpdate": "2021-03-31T07:30:00Z",
    "DataQualityLevel": 1,
    "DateCreated": "2020-07-10T08:44:00Z",
    "SubmissionStatusTypeID": 200
}