{
    "IsRecentlyVerified": false,
    "ID": 140833,
    "UUID": "312A4763-7A65-4BA8-A04C-F96124B3B6AB",
    "DataProviderID": 2,
    "DataProvidersReference": "96192",
    "OperatorID": 9,
    "UsageTypeID": 1,
    "AddressInfo": {
        "ID": 141185,
        "Title": "Britannia Pointe Grand Business Park",
        "AddressLine1": "280 E Grand Avenue",
        "Town": "South San Francisco",
        "StateOrProvince": "CA",
        "Postcode": "94080",
        "CountryID": 2,
        "Latitude": 37.65216,
        "Longitude": -122.39512,
        "ContactTelephone1": "888-998-2546",
        "AccessComments": "MON: 5:00am-8:00pm | TUE: 5:00am-8:00pm | WED: 5:00am-8:00pm | THU: 5:00am-8:00pm | FRI: 5:00am-8:00pm | SAT: 6:00am-6:00pm | SUN: 6:00am-6:00pm",
        "RelatedURL": "http://www.blinkcharging.com/",
        "DistanceUnit": 0
    },
    "Connections": [
        {
            "ID": 196576,
            "ConnectionTypeID": 2,
            "LevelID": 3,
            "Amps": 100,
            "Voltage": 400,
            "PowerKW": 40,
            "CurrentTypeID": 30,
            "Quantity": 2
        }
    ],
    "StatusTypeID": 50,
    "DateLastStatusUpdate": "2019-12-24T09:14:00Z",
    "DataQualityLevel": 3,
    "DateCreated": "2019-12-24T09:14:00Z",
    "SubmissionStatusTypeID": 100
}