{
    "IsRecentlyVerified": false,
    "ID": 16872,
    "UUID": "1FD2B489-75EB-4959-8878-FE86D967B3A4",
    "DataProviderID": 22,
    "DataProvidersReference": "106D6A60386B448F80D401758C203F54",
    "AddressInfo": {
        "ID": 17217,
        "Title": "北海道日産自動車室蘭店",
        "AddressLine1": "北海道室蘭市日の出町3-7-10",
        "CountryID": 114,
        "Latitude": 42.35180791,
        "Longitude": 141.0431691,
        "ContactTelephone1": "0143-44-2101",
        "DistanceUnit": 0
    },
    "Connections": [
        {
            "ID": 17113,
            "ConnectionTypeID": 2,
            "LevelID": 2,
            "Amps": 100,
            "Voltage": 480,
            "PowerKW": 48,
            "Quantity": 1
        }
    ],
    "DateLastStatusUpdate": "2013-06-29T08:50:00Z",
    "DataQualityLevel": 2,
    "DateCreated": "2013-06-29T08:50:00Z",
    "SubmissionStatusTypeID": 200
}