{
    "IsRecentlyVerified": false,
    "ID": 128369,
    "UUID": "F1D0F4C9-2E37-44BB-9CCF-A2313169A1A7",
    "DataProviderID": 1,
    "OperatorID": 3,
    "OperatorsReference": "PG-83142",
    "UsageTypeID": 4,
    "UsageCost": "£0.25/kWh",
    "AddressInfo": {
        "ID": 128715,
        "Title": "Glenridding Car Park",
        "AddressLine1": "Glenridding",
        "Town": "Ullswater",
        "Postcode": "CA11 0PD",
        "CountryID": 1,
        "Latitude": 54.544312,
        "Longitude": -2.950479,
        "DistanceUnit": 0
    },
    "Connections": [
        {
            "ID": 179683,
            "ConnectionTypeID": 25,
            "StatusTypeID": 50,
            "LevelID": 2,
            "Amps": 32,
            "Voltage": 230,
            "PowerKW": 7,
            "CurrentTypeID": 10,
            "Quantity": 2
        }
    ],
    "NumberOfPoints": 2,
    "GeneralComments": "This is an open charge unit installed at the Lake District National Park site at Glenridding, Ullswater",
    "StatusTypeID": 50,
    "DateLastStatusUpdate": "2019-07-16T08:20:00Z",
    "DataQualityLevel": 1,
    "DateCreated": "2019-06-23T05:30:00Z",
    "SubmissionStatusTypeID": 200
}