{
    "IsRecentlyVerified": false,
    "ID": 122314,
    "UUID": "B441E00E-1214-40D6-8CAD-15944E41B3B5",
    "DataProviderID": 2,
    "DataProvidersReference": "87859",
    "OperatorID": 5,
    "UsageTypeID": 1,
    "AddressInfo": {
        "ID": 122660,
        "Title": "EAST LOT",
        "AddressLine1": "3546 Concours",
        "Town": "Ontario",
        "StateOrProvince": "CA",
        "Postcode": "91764",
        "CountryID": 2,
        "Latitude": 34.0730661,
        "Longitude": -117.5716912,
        "ContactTelephone1": "888-758-4389",
        "AccessComments": "24 hours daily",
        "RelatedURL": "http://www.chargepoint.com/",
        "DistanceUnit": 0
    },
    "Connections": [
        {
            "ID": 172195,
            "ConnectionTypeID": 1,
            "LevelID": 2,
            "Amps": 16,
            "Voltage": 230,
            "PowerKW": 3,
            "CurrentTypeID": 10,
            "Quantity": 2
        }
    ],
    "DateLastStatusUpdate": "2019-12-24T09:11:00Z",
    "DataQualityLevel": 3,
    "DateCreated": "2019-04-06T05:02:00Z",
    "SubmissionStatusTypeID": 100
}