{
    "IsRecentlyVerified": false,
    "ID": 142062,
    "UUID": "7F4D2849-9FD3-4828-A688-2698450ECCFE",
    "DataProviderID": 2,
    "DataProvidersReference": "88442",
    "OperatorID": 5,
    "UsageTypeID": 1,
    "AddressInfo": {
        "ID": 142414,
        "Title": "BMW D&R",
        "AddressLine1": "14598 Clay Terrace Blvd",
        "Town": "Carmel",
        "StateOrProvince": "IN",
        "Postcode": "46032",
        "CountryID": 2,
        "Latitude": 39.9985687,
        "Longitude": -86.1314997,
        "ContactTelephone1": "888-758-4389",
        "AccessComments": "24 hours daily",
        "RelatedURL": "http://www.chargepoint.com/",
        "DistanceUnit": 0
    },
    "Connections": [
        {
            "ID": 198127,
            "ConnectionTypeID": 1,
            "LevelID": 2,
            "Amps": 16,
            "Voltage": 230,
            "PowerKW": 3.7,
            "CurrentTypeID": 10,
            "Quantity": 1
        }
    ],
    "StatusTypeID": 50,
    "DateLastStatusUpdate": "2020-06-26T03:02:00Z",
    "DataQualityLevel": 3,
    "DateCreated": "2019-12-24T09:17:00Z",
    "SubmissionStatusTypeID": 100
}