{
    "IsRecentlyVerified": false,
    "ID": 120132,
    "UUID": "03C10879-735F-4EFB-BA46-C8BE7FFFC282",
    "DataProviderID": 2,
    "DataProvidersReference": "71671",
    "OperatorID": 5,
    "UsageTypeID": 1,
    "AddressInfo": {
        "ID": 120478,
        "Title": "LARRYS SUBS",
        "AddressLine1": "4479 Deerwood Lake Pkwy",
        "Town": "Jacksonville",
        "StateOrProvince": "FL",
        "Postcode": "32216",
        "CountryID": 2,
        "Latitude": 30.2646208,
        "Longitude": -81.5586728,
        "ContactTelephone1": "888-758-4389",
        "AccessComments": "24 hours daily",
        "RelatedURL": "http://www.chargepoint.com/",
        "DistanceUnit": 0
    },
    "Connections": [
        {
            "ID": 169454,
            "ConnectionTypeID": 1,
            "LevelID": 2,
            "Amps": 16,
            "Voltage": 230,
            "PowerKW": 3,
            "CurrentTypeID": 10,
            "Quantity": 2
        }
    ],
    "DateLastStatusUpdate": "2019-12-24T09:08:00Z",
    "DataQualityLevel": 3,
    "DateCreated": "2019-04-01T04:59:00Z",
    "SubmissionStatusTypeID": 100
}