{
    "IsRecentlyVerified": false,
    "ID": 182671,
    "UUID": "BADA8128-9475-4AD7-B2D1-E6914C120CA4",
    "DataProviderID": 29,
    "DataProvidersReference": "11008",
    "OperatorID": 45,
    "AddressInfo": {
        "ID": 183030,
        "Title": "Empeler Str. 49",
        "AddressLine1": "Empeler Str. 49",
        "Town": "Rees",
        "Postcode": "46459",
        "CountryID": 87,
        "Latitude": 51.768492,
        "Longitude": 6.400279,
        "DistanceUnit": 0
    },
    "Connections": [
        {
            "ID": 288701,
            "ConnectionTypeID": 33,
            "StatusTypeID": 50,
            "LevelID": 3,
            "PowerKW": 22,
            "CurrentTypeID": 30
        },
        {
            "ID": 288702,
            "ConnectionTypeID": 25,
            "StatusTypeID": 50,
            "LevelID": 2,
            "PowerKW": 11,
            "CurrentTypeID": 20
        }
    ],
    "StatusTypeID": 50,
    "DateLastStatusUpdate": "2021-07-12T02:48:00Z",
    "MetadataValues": [
        {
            "ID": 14964,
            "MetadataFieldID": 4,
            "ItemValue": "Data from the German chargepoint registry provided by Bundesnetzagentur.de under the CC-BY 4.0 license"
        }
    ],
    "DataQualityLevel": 3,
    "DateCreated": "2021-07-08T10:03:00Z",
    "SubmissionStatusTypeID": 100
}