{
    "IsRecentlyVerified": false,
    "ID": 120430,
    "UUID": "F865E99D-1E0D-44A0-A6DE-69619C51546D",
    "DataProviderID": 2,
    "DataProvidersReference": "49594",
    "UsageTypeID": 2,
    "AddressInfo": {
        "ID": 120776,
        "Title": "Oncor Electric",
        "AddressLine1": "308 E 6th St",
        "Town": "Fort Worth",
        "StateOrProvince": "TX",
        "Postcode": "76102",
        "CountryID": 2,
        "Latitude": 32.7542038,
        "Longitude": -97.3284,
        "ContactTelephone1": "",
        "AccessComments": "Employee and visitor use only",
        "RelatedURL": "",
        "DistanceUnit": 0
    },
    "Connections": [
        {
            "ID": 169780,
            "ConnectionTypeID": 1,
            "LevelID": 2,
            "Amps": 16,
            "Voltage": 230,
            "PowerKW": 3.7,
            "CurrentTypeID": 10,
            "Quantity": 1
        }
    ],
    "DateLastStatusUpdate": "2020-06-26T02:55:00Z",
    "DataQualityLevel": 3,
    "DateCreated": "2019-04-01T04:59:00Z",
    "SubmissionStatusTypeID": 100
}