{
    "IsRecentlyVerified": false,
    "ID": 123463,
    "UUID": "CB70DEF1-B213-4288-A70B-BFC4CAC1ADFE",
    "DataProviderID": 2,
    "DataProvidersReference": "116917",
    "OperatorID": 3318,
    "UsageTypeID": 1,
    "AddressInfo": {
        "ID": 123809,
        "Title": "Walmart 2256 Henderson",
        "AddressLine1": "200 N Cooper Drive",
        "Town": "Henderson",
        "StateOrProvince": "NC",
        "Postcode": "27536",
        "CountryID": 2,
        "Latitude": 36.334674,
        "Longitude": -78.442161,
        "ContactTelephone1": "833-632-2778",
        "AccessComments": "24 hours daily",
        "RelatedURL": "https://www.electrifyamerica.com/",
        "DistanceUnit": 0
    },
    "Connections": [
        {
            "ID": 173444,
            "ConnectionTypeID": 2,
            "LevelID": 2,
            "Amps": 100,
            "Voltage": 400,
            "PowerKW": 40,
            "CurrentTypeID": 10,
            "Quantity": 1
        },
        {
            "ID": 173445,
            "ConnectionTypeID": 32,
            "LevelID": 2,
            "Amps": 100,
            "Voltage": 400,
            "PowerKW": 40,
            "CurrentTypeID": 10,
            "Quantity": 1
        }
    ],
    "DateLastStatusUpdate": "2019-04-06T05:03:00Z",
    "DataQualityLevel": 3,
    "DateCreated": "2019-04-06T05:03:00Z",
    "SubmissionStatusTypeID": 100
}