{
    "IsRecentlyVerified": false,
    "ID": 123673,
    "UUID": "09FFE287-3FAB-4FEB-9AF2-AFF80364F483",
    "DataProviderID": 2,
    "DataProvidersReference": "82268",
    "OperatorID": 5,
    "UsageTypeID": 1,
    "AddressInfo": {
        "ID": 124019,
        "Title": "HY VEE",
        "AddressLine1": "1720 W Battlefield St",
        "Town": "Springfield",
        "StateOrProvince": "MO",
        "Postcode": "65807",
        "CountryID": 2,
        "Latitude": 37.159057,
        "Longitude": -93.315041,
        "ContactTelephone1": "888-758-4389",
        "AccessComments": "24 hours daily",
        "RelatedURL": "http://www.chargepoint.com/",
        "DistanceUnit": 0
    },
    "Connections": [
        {
            "ID": 173692,
            "ConnectionTypeID": 1,
            "LevelID": 2,
            "Amps": 16,
            "Voltage": 230,
            "PowerKW": 3.7,
            "CurrentTypeID": 10,
            "Quantity": 4
        }
    ],
    "DateLastStatusUpdate": "2020-06-26T02:59:00Z",
    "DataQualityLevel": 3,
    "DateCreated": "2019-04-06T05:03:00Z",
    "SubmissionStatusTypeID": 100
}