{
    "IsRecentlyVerified": false,
    "ID": 8408,
    "UUID": "C0A580CB-8860-4BD4-A51A-6AFBAB4CEEFC",
    "DataProviderID": 15,
    "DataProvidersReference": "2763",
    "OperatorID": 26,
    "AddressInfo": {
        "ID": 8305,
        "Title": "2361 Hwy 86",
        "AddressLine1": "2361 Hwy 86",
        "Town": "Imperial",
        "StateOrProvince": "CA",
        "Postcode": "92251",
        "CountryID": 2,
        "Latitude": 32.82358,
        "Longitude": -115.57108,
        "ContactTelephone1": "(760) 352-2900",
        "RelatedURL": "http://carstations.com/2763",
        "DistanceUnit": 0
    },
    "Connections": [
        {
            "ID": 5836,
            "ConnectionTypeID": 1,
            "Reference": "J1772",
            "LevelID": 2
        }
    ],
    "StatusTypeID": 0,
    "DateLastStatusUpdate": "2017-11-04T14:04:00Z",
    "DataQualityLevel": 1,
    "DateCreated": "2011-11-11T12:06:00Z",
    "SubmissionStatusTypeID": 100
}