{
    "IsRecentlyVerified": false,
    "ID": 56544,
    "UUID": "DC15632D-0108-4EA2-AA00-83CFFA21E2DE",
    "DataProviderID": 2,
    "DataProvidersReference": "70790",
    "OperatorID": 5,
    "UsageTypeID": 1,
    "AddressInfo": {
        "ID": 56890,
        "Title": "EVERGY",
        "AddressLine1": "18555 W 151st St @ Walmart #4198",
        "Town": "Olathe",
        "StateOrProvince": "KS",
        "Postcode": "66062",
        "CountryID": 2,
        "Latitude": 38.85434,
        "Longitude": -94.799403,
        "ContactTelephone1": "888-758-4389",
        "AccessComments": "24 hours daily",
        "RelatedURL": "http://www.chargepoint.com/",
        "DistanceUnit": 0
    },
    "Connections": [
        {
            "ID": 71302,
            "ConnectionTypeID": 1,
            "LevelID": 2,
            "Amps": 16,
            "Voltage": 230,
            "PowerKW": 3.7,
            "CurrentTypeID": 10,
            "Quantity": 6
        }
    ],
    "DateLastStatusUpdate": "2020-06-26T03:00:00Z",
    "DataQualityLevel": 3,
    "DateCreated": "2015-11-04T08:42:00Z",
    "SubmissionStatusTypeID": 100
}