{
    "IsRecentlyVerified": false,
    "ID": 170803,
    "UUID": "4B397F61-5E19-4BCA-B99A-96B984F74E87",
    "DataProviderID": 1,
    "OperatorID": 80,
    "UsageTypeID": 4,
    "AddressInfo": {
        "ID": 171162,
        "Title": "Celle di San Vito | ENELX",
        "AddressLine1": "Piazza Magrone",
        "AddressLine2": "Via Roma ",
        "Town": "Celle di San Vito",
        "StateOrProvince": "FG",
        "Postcode": "71020",
        "CountryID": 112,
        "Latitude": 41.32380857671913,
        "Longitude": 15.181364993091393,
        "ContactTelephone1": "800.069.850",
        "RelatedURL": "https://www.enelx.com/it/it/emobility",
        "DistanceUnit": 0
    },
    "Connections": [
        {
            "ID": 260965,
            "ConnectionTypeID": 25,
            "StatusTypeID": 50,
            "LevelID": 2,
            "Amps": 32,
            "Voltage": 400,
            "PowerKW": 22,
            "CurrentTypeID": 20,
            "Quantity": 1
        },
        {
            "ID": 260966,
            "ConnectionTypeID": 36,
            "StatusTypeID": 50,
            "LevelID": 2,
            "Amps": 16,
            "Voltage": 240,
            "PowerKW": 3.7,
            "CurrentTypeID": 10,
            "Quantity": 1
        }
    ],
    "NumberOfPoints": 2,
    "StatusTypeID": 50,
    "DateLastStatusUpdate": "2020-12-09T13:43:00Z",
    "DataQualityLevel": 1,
    "DateCreated": "2020-12-09T13:43:00Z",
    "SubmissionStatusTypeID": 200
}