{
    "IsRecentlyVerified": false,
    "ID": 96214,
    "UUID": "522D3005-7C91-4C7D-A41D-8552E090B35C",
    "DataProviderID": 1,
    "OperatorID": 126,
    "UsageTypeID": 4,
    "AddressInfo": {
        "ID": 96560,
        "Title": "Volksbank",
        "AddressLine1": "Hauptstraße 8",
        "Town": "Wutöschingen",
        "StateOrProvince": "Verwaltungsgemeinschaft Wutöschingen",
        "Postcode": "79793",
        "CountryID": 87,
        "Latitude": 47.66076,
        "Longitude": 8.365751400000022,
        "ContactTelephone1": "+49 800 8787 500",
        "AccessComments": "24/7 nutzbarer Triplecharger auf der Parkfläche, sich gegenüber dem Bankgebäudes der Volksbank Klettgau-Wutöschingen eG befindet.",
        "RelatedURL": "http://www.schneller-strom-tanken.de/",
        "DistanceUnit": 0
    },
    "Connections": [
        {
            "ID": 136315,
            "ConnectionTypeID": 2,
            "StatusTypeID": 50,
            "LevelID": 3,
            "PowerKW": 50,
            "CurrentTypeID": 30,
            "Quantity": 1
        },
        {
            "ID": 136316,
            "ConnectionTypeID": 33,
            "StatusTypeID": 50,
            "LevelID": 3,
            "PowerKW": 50,
            "CurrentTypeID": 30,
            "Quantity": 1
        },
        {
            "ID": 136317,
            "ConnectionTypeID": 1036,
            "StatusTypeID": 50,
            "LevelID": 3,
            "Amps": 63,
            "Voltage": 400,
            "PowerKW": 43,
            "CurrentTypeID": 20,
            "Quantity": 1
        }
    ],
    "NumberOfPoints": 2,
    "StatusTypeID": 50,
    "DateLastStatusUpdate": "2017-12-15T06:49:00Z",
    "DataQualityLevel": 1,
    "DateCreated": "2017-12-15T06:49:00Z",
    "SubmissionStatusTypeID": 200
}