{
    "IsRecentlyVerified": false,
    "ID": 108844,
    "UUID": "83C74ED2-21D6-46F5-88D6-EE5F3A6250A9",
    "DataProviderID": 1,
    "OperatorID": 23,
    "OperatorsReference": "44566",
    "UsageTypeID": 4,
    "AddressInfo": {
        "ID": 109190,
        "Title": "Brundtland Golfcenter",
        "AddressLine1": "Brundtland Allé 3",
        "Town": "Toftlund",
        "Postcode": "6520",
        "CountryID": 65,
        "Latitude": 55.193999,
        "Longitude": 9.075816,
        "ContactTelephone1": "+45 73831600",
        "DistanceUnit": 0
    },
    "Connections": [
        {
            "ID": 153961,
            "ConnectionTypeID": 30,
            "StatusTypeID": 50,
            "LevelID": 2,
            "Amps": 16,
            "Voltage": 230,
            "PowerKW": 4,
            "CurrentTypeID": 10,
            "Quantity": 2
        }
    ],
    "NumberOfPoints": 2,
    "GeneralComments": "2 Tesla Connectors, up to 4kW.Available to the public. Self park.",
    "StatusTypeID": 50,
    "DateLastStatusUpdate": "2018-10-11T12:50:00Z",
    "DataQualityLevel": 1,
    "DateCreated": "2018-10-11T12:50:00Z",
    "SubmissionStatusTypeID": 200
}