{
    "IsRecentlyVerified": false,
    "ID": 9890,
    "UUID": "C4C1D09C-E94F-4F0F-8DBF-8278734808E6",
    "DataProviderID": 15,
    "DataProvidersReference": "17515",
    "OperatorID": 26,
    "UsageTypeID": 1,
    "AddressInfo": {
        "ID": 9787,
        "Title": "Music Concourse Dr",
        "AddressLine1": "Music Concourse Dr",
        "Town": "San Francisco",
        "StateOrProvince": "CA",
        "Postcode": "",
        "CountryID": 2,
        "Latitude": 37.76926,
        "Longitude": -122.46805,
        "ContactTelephone1": "",
        "RelatedURL": "http://carstations.com/17515",
        "DistanceUnit": 0
    },
    "Connections": [
        {
            "ID": 7742,
            "ConnectionTypeID": 9,
            "Reference": "NEMA5",
            "LevelID": 1,
            "Quantity": 1
        },
        {
            "ID": 8346,
            "ConnectionTypeID": 1,
            "Reference": "J1772",
            "LevelID": 2
        }
    ],
    "NumberOfPoints": 12,
    "StatusTypeID": 50,
    "DateLastStatusUpdate": "2017-11-04T14:04:00Z",
    "DataQualityLevel": 2,
    "DateCreated": "2012-05-01T20:38:00Z",
    "SubmissionStatusTypeID": 100
}