{
    "IsRecentlyVerified": false,
    "ID": 150629,
    "UUID": "DEAA1C2D-E409-4DAD-BF35-FD8F26B4C3F8",
    "DataProviderID": 28,
    "DataProvidersReference": "FR*S83*P83136*A",
    "UsageTypeID": 5,
    "AddressInfo": {
        "ID": 150982,
        "Title": "LE THORONET_208 Boulevard du 17 Aout 1944",
        "AddressLine1": "208 Boulevard du 17 Aout 1944 83340 LE THORONET",
        "CountryID": 80,
        "Latitude": 43.450901,
        "Longitude": 6.304044,
        "AccessComments": "24/24 7/7 jours",
        "DistanceUnit": 0
    },
    "Connections": [
        {
            "ID": 209613,
            "ConnectionTypeID": 28,
            "StatusTypeID": 50,
            "LevelID": 2,
            "PowerKW": 22,
            "CurrentTypeID": 10
        },
        {
            "ID": 209614,
            "ConnectionTypeID": 1036,
            "StatusTypeID": 50,
            "LevelID": 2,
            "PowerKW": 22,
            "CurrentTypeID": 20
        },
        {
            "ID": 238989,
            "ConnectionTypeID": 28,
            "StatusTypeID": 50,
            "LevelID": 2,
            "PowerKW": 22,
            "CurrentTypeID": 10
        },
        {
            "ID": 238990,
            "ConnectionTypeID": 1036,
            "StatusTypeID": 50,
            "LevelID": 2,
            "PowerKW": 22,
            "CurrentTypeID": 20
        }
    ],
    "GeneralComments": "",
    "StatusTypeID": 50,
    "DateLastStatusUpdate": "2020-08-27T05:10:00Z",
    "DataQualityLevel": 2,
    "DateCreated": "2020-03-15T06:17:00Z",
    "SubmissionStatusTypeID": 100
}