{
    "IsRecentlyVerified": false,
    "ID": 61587,
    "UUID": "0EB85F28-4940-44EC-B9C4-DDDC35DDB3C5",
    "DataProviderID": 1,
    "OperatorID": 23,
    "OperatorsReference": "13132",
    "UsageTypeID": 7,
    "UsageCost": "Free",
    "AddressInfo": {
        "ID": 61933,
        "Title": "The Kate Shepard House Bed and Breakfast",
        "AddressLine1": "1552 Monterey Pl",
        "Town": "Mobile",
        "StateOrProvince": "AL",
        "Postcode": "36604",
        "CountryID": 2,
        "Latitude": 30.684423,
        "Longitude": -88.0740409,
        "ContactTelephone1": "251-479-7048  877-798-3752",
        "AccessComments": "24 hours daily",
        "RelatedURL": "http://www.teslamotors.com/supercharger",
        "DistanceUnit": 0
    },
    "Connections": [
        {
            "ID": 78475,
            "ConnectionTypeID": 30,
            "StatusTypeID": 50,
            "LevelID": 2,
            "Amps": 16,
            "Voltage": 230,
            "PowerKW": 16,
            "CurrentTypeID": 10,
            "Quantity": 1
        }
    ],
    "NumberOfPoints": 1,
    "StatusTypeID": 50,
    "DateLastStatusUpdate": "2017-02-16T10:50:00Z",
    "DataQualityLevel": 3,
    "DateCreated": "2016-03-03T11:38:00Z",
    "SubmissionStatusTypeID": 100
}