{
    "IsRecentlyVerified": false,
    "ID": 186195,
    "UUID": "CC130CDF-76FD-4DCF-A0FF-F2758EA29001",
    "DataProviderID": 29,
    "DataProvidersReference": "372",
    "AddressInfo": {
        "ID": 186554,
        "Title": "Valencienner Strasse 122",
        "AddressLine1": "Valencienner Strasse 122",
        "Town": "Düren",
        "Postcode": "52355",
        "CountryID": 87,
        "Latitude": 50.797391,
        "Longitude": 6.458055,
        "DistanceUnit": 0
    },
    "Connections": [
        {
            "ID": 298204,
            "ConnectionTypeID": 25,
            "StatusTypeID": 50,
            "LevelID": 2,
            "PowerKW": 22,
            "CurrentTypeID": 20
        },
        {
            "ID": 298205,
            "ConnectionTypeID": 25,
            "StatusTypeID": 50,
            "LevelID": 2,
            "PowerKW": 22,
            "CurrentTypeID": 20
        },
        {
            "ID": 298206,
            "ConnectionTypeID": 25,
            "StatusTypeID": 50,
            "LevelID": 2,
            "PowerKW": 22,
            "CurrentTypeID": 20
        },
        {
            "ID": 298207,
            "ConnectionTypeID": 25,
            "StatusTypeID": 50,
            "LevelID": 2,
            "PowerKW": 22,
            "CurrentTypeID": 20
        }
    ],
    "StatusTypeID": 50,
    "DateLastStatusUpdate": "2021-07-12T02:45:00Z",
    "MetadataValues": [
        {
            "ID": 18436,
            "MetadataFieldID": 4,
            "ItemValue": "Data from the German chargepoint registry provided by Bundesnetzagentur.de under the CC-BY 4.0 license"
        }
    ],
    "DataQualityLevel": 3,
    "DateCreated": "2021-07-12T02:45:00Z",
    "SubmissionStatusTypeID": 100
}