{
    "IsRecentlyVerified": false,
    "ID": 8103,
    "UUID": "2EBF1BEC-4B83-4710-930B-18E7ABEE7599",
    "DataProviderID": 15,
    "DataProvidersReference": "6662",
    "OperatorID": 26,
    "AddressInfo": {
        "ID": 8000,
        "Title": "412 Southeast Blvd",
        "AddressLine1": "412 Southeast Blvd",
        "Town": "Clinton",
        "StateOrProvince": "NC",
        "Postcode": "28328",
        "CountryID": 2,
        "Latitude": 34.99949,
        "Longitude": -78.30776,
        "ContactTelephone1": " (910) 590-2005",
        "RelatedURL": "http://carstations.com/6662",
        "DistanceUnit": 0
    },
    "Connections": [
        {
            "ID": 5532,
            "ConnectionTypeID": 1,
            "Reference": "J1772",
            "LevelID": 2
        }
    ],
    "StatusTypeID": 0,
    "DateLastStatusUpdate": "2017-11-04T14:04:00Z",
    "DataQualityLevel": 1,
    "DateCreated": "2011-11-11T12:05:00Z",
    "SubmissionStatusTypeID": 100
}