{
    "IsRecentlyVerified": false,
    "ID": 107884,
    "UUID": "64866145-0BDF-4B31-8F85-2AE04693C48D",
    "DataProviderID": 1,
    "OperatorID": 3296,
    "UsageTypeID": 5,
    "UsageCost": "35p/kWh",
    "AddressInfo": {
        "ID": 108230,
        "Title": "Mauldeth Service Station",
        "AddressLine1": "Mauldeth Road West",
        "Town": "Manchester",
        "Postcode": "M21 7RF",
        "CountryID": 1,
        "Latitude": 53.439792,
        "Longitude": -2.25138,
        "DistanceUnit": 0
    },
    "Connections": [
        {
            "ID": 152355,
            "ConnectionTypeID": 2,
            "StatusTypeID": 50,
            "LevelID": 3,
            "PowerKW": 50,
            "CurrentTypeID": 30,
            "Quantity": 2
        },
        {
            "ID": 152356,
            "ConnectionTypeID": 33,
            "StatusTypeID": 50,
            "LevelID": 3,
            "PowerKW": 50,
            "CurrentTypeID": 30,
            "Quantity": 2
        }
    ],
    "NumberOfPoints": 2,
    "StatusTypeID": 50,
    "DateLastStatusUpdate": "2018-08-16T16:48:00Z",
    "DataQualityLevel": 1,
    "DateCreated": "2018-08-16T16:48:00Z",
    "SubmissionStatusTypeID": 200
}