{
    "IsRecentlyVerified": false,
    "ID": 139598,
    "UUID": "3E8ED5AE-7746-4980-87FD-69B6E173A99F",
    "DataProviderID": 2,
    "DataProvidersReference": "72479",
    "OperatorID": 5,
    "UsageTypeID": 1,
    "AddressInfo": {
        "ID": 139950,
        "Title": "TISHMAN SPEYER",
        "AddressLine1": "12015 W Bluff Creek Dr",
        "Town": "Los Angeles",
        "StateOrProvince": "CA",
        "Postcode": "90094",
        "CountryID": 2,
        "Latitude": 33.981591,
        "Longitude": -118.402767,
        "ContactTelephone1": "888-758-4389",
        "AccessComments": "24 hours daily",
        "RelatedURL": "http://www.chargepoint.com/",
        "DistanceUnit": 0
    },
    "Connections": [
        {
            "ID": 195008,
            "ConnectionTypeID": 1,
            "LevelID": 2,
            "Amps": 16,
            "Voltage": 230,
            "PowerKW": 3,
            "CurrentTypeID": 10,
            "Quantity": 10
        }
    ],
    "StatusTypeID": 50,
    "DateLastStatusUpdate": "2019-12-24T09:11:00Z",
    "DataQualityLevel": 3,
    "DateCreated": "2019-12-24T09:11:00Z",
    "SubmissionStatusTypeID": 100
}