{
    "IsRecentlyVerified": false,
    "ID": 13007,
    "UUID": "8770D67C-A59B-4792-A585-B4D4FF6C728A",
    "DataProviderID": 15,
    "DataProvidersReference": "20318",
    "OperatorID": 1,
    "AddressInfo": {
        "ID": 12904,
        "Title": "9714 NE Mill Plain Blvd",
        "AddressLine1": "9714 NE Mill Plain Blvd",
        "Town": "Vancouver",
        "StateOrProvince": "WA",
        "Postcode": "98664",
        "CountryID": 2,
        "Latitude": 45.621549,
        "Longitude": -122.572604,
        "ContactTelephone1": "",
        "RelatedURL": "http://carstations.com/20318",
        "DistanceUnit": 0
    },
    "Connections": [
        {
            "ID": 10440,
            "ConnectionTypeID": 1,
            "Reference": "J1772",
            "LevelID": 2
        }
    ],
    "StatusTypeID": 0,
    "DateLastStatusUpdate": "2017-11-04T14:05:00Z",
    "DataQualityLevel": 2,
    "DateCreated": "2012-09-07T19:26:00Z",
    "SubmissionStatusTypeID": 100
}