{
    "IsRecentlyVerified": false,
    "ID": 137091,
    "UUID": "01037F1A-F9A6-4D1C-B4FE-FC851462B1E1",
    "DataProviderID": 1,
    "DataProvidersReference": "CLT-00001",
    "AddressInfo": {
        "ID": 137437,
        "Title": "Avenida Dom Manuel I",
        "AddressLine1": "Avenida Dom Manuel I",
        "Town": "Calheta",
        "Postcode": "9370-135",
        "CountryID": 180,
        "Latitude": 32.721124,
        "Longitude": -17.178507,
        "RelatedURL": "http://www.mobie.pt",
        "DistanceUnit": 0
    },
    "Connections": [
        {
            "ID": 191948,
            "ConnectionTypeID": 0,
            "LevelID": 2,
            "Amps": 75,
            "Voltage": 400,
            "PowerKW": 30
        }
    ],
    "NumberOfPoints": 1,
    "StatusTypeID": 50,
    "DateLastStatusUpdate": "2020-02-22T15:42:00Z",
    "DataQualityLevel": 3,
    "DateCreated": "2019-12-24T08:08:00Z",
    "SubmissionStatusTypeID": 100
}