{
    "IsRecentlyVerified": false,
    "ID": 81407,
    "UUID": "213A6DFB-E7C4-4E11-B905-37C328FFAD29",
    "DataProviderID": 1,
    "OperatorID": 23,
    "OperatorsReference": "24100",
    "UsageTypeID": 6,
    "UsageCost": "Free",
    "AddressInfo": {
        "ID": 81753,
        "Title": "Hôtel Ampère",
        "AddressLine1": "102 Avenue de Villiers",
        "Town": "Paris",
        "Postcode": "75017",
        "CountryID": 80,
        "Latitude": 48.884752,
        "Longitude": 2.299767,
        "ContactTelephone1": "+33 1 44 29 17 17",
        "DistanceUnit": 0
    },
    "Connections": [
        {
            "ID": 116127,
            "ConnectionTypeID": 30,
            "StatusTypeID": 50,
            "LevelID": 2,
            "Amps": 32,
            "Voltage": 400,
            "PowerKW": 22,
            "CurrentTypeID": 20,
            "Quantity": 2
        }
    ],
    "NumberOfPoints": 2,
    "GeneralComments": "2 Tesla Connectors, up to 22kW.Available for patrons only. Please call ahead.",
    "StatusTypeID": 50,
    "DateLastStatusUpdate": "2018-10-03T22:15:00Z",
    "DataQualityLevel": 1,
    "DateCreated": "2017-02-01T13:42:00Z",
    "SubmissionStatusTypeID": 200
}