{
    "IsRecentlyVerified": false,
    "ID": 31524,
    "UUID": "0A9E83E4-E296-406D-ACE9-32F7559CDD3F",
    "DataProviderID": 26,
    "DataProvidersReference": "24091",
    "OperatorID": 78,
    "OperatorsReference": "Essent EM-AT-00021002-01-00001",
    "UsageCost": "0.00 jaarabonnement",
    "AddressInfo": {
        "ID": 31870,
        "Title": "Martin-Luther-Straße",
        "AddressLine1": "Martin-Luther-Straße",
        "Town": "Feldkirchen in Kärnten",
        "Postcode": "9560",
        "CountryID": 19,
        "Latitude": 46.732367,
        "Longitude": 14.085108,
        "RelatedURL": "http://www.essent.nl",
        "DistanceUnit": 0
    },
    "Connections": [
        {
            "ID": 35035,
            "ConnectionTypeID": 25,
            "LevelID": 2,
            "PowerKW": 11,
            "CurrentTypeID": 10
        },
        {
            "ID": 45940,
            "ConnectionTypeID": 25,
            "LevelID": 2,
            "PowerKW": 11,
            "CurrentTypeID": 10
        }
    ],
    "NumberOfPoints": 1,
    "StatusTypeID": 50,
    "DateLastStatusUpdate": "2016-06-04T02:37:00Z",
    "DataQualityLevel": 3,
    "DateCreated": "2015-01-09T06:03:00Z",
    "SubmissionStatusTypeID": 100
}