{
    "UserComments": [
        {
            "ID": 9903,
            "ChargePointID": 60437,
            "CommentTypeID": 10,
            "UserName": "Lucas Barthélemy",
            "Comment": "Située en plein coeur de la Ville de Nivelles, la borne de recharge semi-rapide se trouve à l'entrée du parking Arbalétriers.\r\nIl s'agit d'une borne de rechargement semi-rapide avec 2 prises de type 2 pouvant délivrer 22 kVA par prise (courant 32 A triphasé).\r\nLe paiement s'effectue par SMS via 4242. 1 € / 30 minutes.\r\nInscription préalable sur le site www.4242.be nécessaire. Bien respecter les consignes décrites sur la borne lors de la connexion et de la déconnexion. Charge stable.",
            "RelatedURL": "http://www.ores.net/pages/default.aspx",
            "DateCreated": "2016-03-09T09:25:35.573Z",
            "User": {
                "ID": 9018,
                "Username": "Lucas Barthélemy"
            },
            "CheckinStatusTypeID": 140
        }
    ],
    "MediaItems": [
        {
            "ID": 5949,
            "ChargePointID": 60437,
            "ItemURL": "https://s3-ap-southeast-2.amazonaws.com/openchargemap/images/BE/OCM60437/OCM-60437.orig.2016022612554600.jpg",
            "ItemThumbnailURL": "https://s3-ap-southeast-2.amazonaws.com/openchargemap/images/BE/OCM60437/OCM-60437.thmb.2016022612554600.jpg",
            "Comment": "",
            "IsEnabled": true,
            "IsVideo": false,
            "IsFeaturedItem": false,
            "IsExternalResource": false,
            "User": {
                "ID": 9018,
                "Username": "Lucas Barthélemy"
            },
            "DateCreated": "2016-02-26T12:56:00Z"
        },
        {
            "ID": 5950,
            "ChargePointID": 60437,
            "ItemURL": "https://s3-ap-southeast-2.amazonaws.com/openchargemap/images/BE/OCM60437/OCM-60437.orig.2016022612555359.jpg",
            "ItemThumbnailURL": "https://s3-ap-southeast-2.amazonaws.com/openchargemap/images/BE/OCM60437/OCM-60437.thmb.2016022612555359.jpg",
            "Comment": "",
            "IsEnabled": true,
            "IsVideo": false,
            "IsFeaturedItem": false,
            "IsExternalResource": false,
            "User": {
                "ID": 9018,
                "Username": "Lucas Barthélemy"
            },
            "DateCreated": "2016-02-26T12:56:00Z"
        }
    ],
    "IsRecentlyVerified": false,
    "ID": 60437,
    "UUID": "3BED5888-4CE3-4E49-89F1-6C7BC575F657",
    "DataProviderID": 1,
    "OperatorID": 1236,
    "UsageTypeID": 5,
    "UsageCost": "1€ / 30 min",
    "AddressInfo": {
        "ID": 60783,
        "Title": "Boulevard des Arbalétriers",
        "AddressLine1": "Boulevard des Arbalétriers 5",
        "Town": "Nijvel",
        "StateOrProvince": "Nijvel",
        "Postcode": "1400",
        "CountryID": 26,
        "Latitude": 50.598031,
        "Longitude": 4.3190664,
        "DistanceUnit": 0
    },
    "Connections": [
        {
            "ID": 76560,
            "ConnectionTypeID": 25,
            "LevelID": 2,
            "Amps": 32,
            "PowerKW": 22,
            "CurrentTypeID": 20,
            "Quantity": 2
        }
    ],
    "NumberOfPoints": 1,
    "GeneralComments": "sms",
    "StatusTypeID": 50,
    "DateLastStatusUpdate": "2016-04-26T20:28:00Z",
    "DataQualityLevel": 1,
    "DateCreated": "2016-01-25T15:47:00Z",
    "SubmissionStatusTypeID": 200
}