{
    "IsRecentlyVerified": false,
    "ID": 143691,
    "UUID": "862C6B0A-26B2-4B03-82EF-82250E2EE1EE",
    "DataProviderID": 2,
    "DataProvidersReference": "95394",
    "OperatorID": 9,
    "UsageTypeID": 1,
    "AddressInfo": {
        "ID": 144043,
        "Title": "King Estate Winery",
        "AddressLine1": "80854 Territorial Highway",
        "Town": "Eugene",
        "StateOrProvince": "OR",
        "Postcode": "97405",
        "CountryID": 2,
        "Latitude": 43.861815,
        "Longitude": -123.250702,
        "ContactTelephone1": "888-998-2546",
        "AccessComments": "MON: 24 hours | TUE: 24 hours | WED: 24 hours | THU: 24 hours | FRI: 24 hours | SAT: 24 hours | SUN: 24 hours",
        "RelatedURL": "http://www.blinkcharging.com/",
        "DistanceUnit": 0
    },
    "Connections": [
        {
            "ID": 200076,
            "ConnectionTypeID": 1,
            "LevelID": 2,
            "Amps": 16,
            "Voltage": 230,
            "PowerKW": 3.7,
            "CurrentTypeID": 10,
            "Quantity": 3
        }
    ],
    "StatusTypeID": 50,
    "DateLastStatusUpdate": "2020-06-26T03:07:00Z",
    "DataQualityLevel": 3,
    "DateCreated": "2019-12-24T09:22:00Z",
    "SubmissionStatusTypeID": 100
}