{
    "IsRecentlyVerified": false,
    "ID": 165177,
    "UUID": "B9955E29-1086-4A24-8638-825D42471290",
    "DataProviderID": 1,
    "DataProvidersReference": "TR-BUR-002",
    "OperatorID": 70,
    "UsageTypeID": 1,
    "AddressInfo": {
        "ID": 165536,
        "Title": "Eşarj - Teknik Oto, Osmangazi",
        "AddressLine1": "Ovaakça Çeşmebaşı Mahallesi, Yeni Yalova Yolu Cd. No:65, Osmangazi",
        "Town": "Bursa",
        "StateOrProvince": "Bursa",
        "Postcode": "16370",
        "CountryID": 229,
        "Latitude": 40.306919,
        "Longitude": 29.061878,
        "ContactTelephone1": "+90 (850) 433 72 75",
        "ContactEmail": "destek@esarj.com",
        "RelatedURL": "https://esarj.com/en/map?s=TR-BUR-002",
        "DistanceUnit": 0
    },
    "Connections": [
        {
            "ID": 236817,
            "ConnectionTypeID": 25,
            "LevelID": 2,
            "Amps": 32,
            "Voltage": 380,
            "PowerKW": 22,
            "Quantity": 2
        }
    ],
    "GeneralComments": "Eşarj Charging Systems",
    "StatusTypeID": 50,
    "DateLastStatusUpdate": "2020-08-26T08:19:00Z",
    "DataQualityLevel": 3,
    "DateCreated": "2020-08-26T08:19:00Z",
    "SubmissionStatusTypeID": 200
}