{
    "IsRecentlyVerified": false,
    "ID": 176544,
    "UUID": "2C9043ED-0E3E-472F-928B-1BEFDCEBFCD7",
    "DataProviderID": 29,
    "DataProvidersReference": "4517",
    "OperatorID": 45,
    "AddressInfo": {
        "ID": 176903,
        "Title": "Weilheimer Straße 18",
        "AddressLine1": "Weilheimer Straße 18",
        "Town": "Murnau am Staffelsee",
        "Postcode": "82418",
        "CountryID": 87,
        "Latitude": 47.684168,
        "Longitude": 11.204029,
        "DistanceUnit": 0
    },
    "Connections": [
        {
            "ID": 274583,
            "ConnectionTypeID": 33,
            "StatusTypeID": 50,
            "LevelID": 3,
            "PowerKW": 22,
            "CurrentTypeID": 30
        },
        {
            "ID": 274584,
            "ConnectionTypeID": 25,
            "StatusTypeID": 50,
            "LevelID": 2,
            "PowerKW": 11,
            "CurrentTypeID": 20
        }
    ],
    "StatusTypeID": 0,
    "DateLastStatusUpdate": "2021-07-09T03:10:00Z",
    "MetadataValues": [
        {
            "ID": 8839,
            "MetadataFieldID": 4,
            "ItemValue": "Data from the German chargepoint registry provided by Bundesnetzagentur.de under the CC-BY 4.0 license"
        }
    ],
    "DataQualityLevel": 3,
    "DateCreated": "2021-07-08T09:48:00Z",
    "SubmissionStatusTypeID": 100
}