{
    "IsRecentlyVerified": false,
    "ID": 157297,
    "UUID": "0657E29B-0516-4825-A420-261F7C7072EB",
    "DataProviderID": 19,
    "DataProvidersReference": "5961",
    "AddressInfo": {
        "ID": 157651,
        "Title": "Lakselv Lufthavn",
        "AddressLine1": "Lakselv Lufthavn ",
        "Town": "LAKSELV",
        "StateOrProvince": "Troms og Finnmark",
        "Postcode": "9700",
        "CountryID": 168,
        "Latitude": 70.06689,
        "Longitude": 24.98284,
        "AccessComments": "P1",
        "DistanceUnit": 0
    },
    "Connections": [
        {
            "ID": 226540,
            "ConnectionTypeID": 25,
            "Reference": "1",
            "LevelID": 3,
            "Amps": 32,
            "Voltage": 400,
            "PowerKW": 22,
            "CurrentTypeID": 30,
            "Comments": "Mode 3"
        },
        {
            "ID": 226541,
            "ConnectionTypeID": 25,
            "Reference": "2",
            "LevelID": 3,
            "Amps": 32,
            "Voltage": 400,
            "PowerKW": 22,
            "CurrentTypeID": 30,
            "Comments": "Mode 3"
        },
        {
            "ID": 226542,
            "ConnectionTypeID": 25,
            "Reference": "3",
            "LevelID": 3,
            "Amps": 32,
            "Voltage": 400,
            "PowerKW": 22,
            "CurrentTypeID": 30,
            "Comments": "Mode 3"
        },
        {
            "ID": 226543,
            "ConnectionTypeID": 25,
            "Reference": "4",
            "LevelID": 3,
            "Amps": 32,
            "Voltage": 400,
            "PowerKW": 22,
            "CurrentTypeID": 30,
            "Comments": "Mode 3"
        },
        {
            "ID": 226544,
            "ConnectionTypeID": 25,
            "Reference": "5",
            "LevelID": 3,
            "Amps": 32,
            "Voltage": 400,
            "PowerKW": 22,
            "CurrentTypeID": 30,
            "Comments": "Mode 3"
        },
        {
            "ID": 226545,
            "ConnectionTypeID": 25,
            "Reference": "6",
            "LevelID": 3,
            "Amps": 32,
            "Voltage": 400,
            "PowerKW": 22,
            "CurrentTypeID": 30,
            "Comments": "Mode 3"
        }
    ],
    "NumberOfPoints": 6,
    "StatusTypeID": 0,
    "DateLastStatusUpdate": "2021-03-24T05:12:00Z",
    "DataQualityLevel": 2,
    "DateCreated": "2020-05-26T08:25:00Z",
    "SubmissionStatusTypeID": 100
}