{
    "IsRecentlyVerified": false,
    "ID": 176456,
    "UUID": "57EFBDDF-0409-46AE-BD60-EBE5AC151BC2",
    "DataProviderID": 29,
    "DataProvidersReference": "14053",
    "AddressInfo": {
        "ID": 176815,
        "Title": "Dingolshäuser Straße 2",
        "AddressLine1": "Dingolshäuser Straße 2",
        "Town": "Gerolzhofen",
        "Postcode": "97447",
        "CountryID": 87,
        "Latitude": 49.899595,
        "Longitude": 10.355169,
        "DistanceUnit": 0
    },
    "Connections": [
        {
            "ID": 274395,
            "ConnectionTypeID": 28,
            "StatusTypeID": 50,
            "LevelID": 2,
            "PowerKW": 22,
            "CurrentTypeID": 20
        },
        {
            "ID": 274396,
            "ConnectionTypeID": 25,
            "StatusTypeID": 50,
            "LevelID": 2,
            "PowerKW": 22,
            "CurrentTypeID": 20
        },
        {
            "ID": 297389,
            "ConnectionTypeID": 28,
            "StatusTypeID": 50,
            "LevelID": 2,
            "PowerKW": 22,
            "CurrentTypeID": 20
        },
        {
            "ID": 297390,
            "ConnectionTypeID": 25,
            "StatusTypeID": 50,
            "LevelID": 2,
            "PowerKW": 22,
            "CurrentTypeID": 20
        }
    ],
    "StatusTypeID": 0,
    "DateLastStatusUpdate": "2021-07-12T02:44:00Z",
    "MetadataValues": [
        {
            "ID": 8751,
            "MetadataFieldID": 4,
            "ItemValue": "Data from the German chargepoint registry provided by Bundesnetzagentur.de under the CC-BY 4.0 license"
        }
    ],
    "DataQualityLevel": 3,
    "DateCreated": "2021-07-08T09:48:00Z",
    "SubmissionStatusTypeID": 100
}