{
    "IsRecentlyVerified": false,
    "ID": 46302,
    "UUID": "0F9E9DE2-6C39-4E88-8CC7-FEA1C9107502",
    "DataProviderID": 1,
    "DataProvidersReference": "948",
    "AddressInfo": {
        "ID": 46648,
        "Title": "Metro, Lørenskog",
        "AddressLine1": "Solheimveien 85",
        "Town": "LØRENSKOG",
        "StateOrProvince": "Viken",
        "Postcode": "1470",
        "CountryID": 168,
        "Latitude": 59.92689,
        "Longitude": 10.9586,
        "AccessComments": "Innkjøring fra rundkjøring i Solheimsveien. 4 ladepunkt rett ved rundkjøring inne i p-huset, nært østre inngangsparti i den nye delen av kjøpesenteret, Maxi-bygget og Lørenskog Hus.\r3 ladepunkt midt i p-hus. \r3 plasser øst i parkeringshus, nær kjellerinngangen til Metro Senter",
        "DistanceUnit": 0
    },
    "Connections": [
        {
            "ID": 56965,
            "ConnectionTypeID": 0,
            "Reference": "1",
            "LevelID": 2,
            "Amps": 16,
            "Voltage": 230,
            "PowerKW": 3.7,
            "Comments": "Mode 1"
        },
        {
            "ID": 86001,
            "ConnectionTypeID": 0,
            "Reference": "2",
            "LevelID": 2,
            "Amps": 16,
            "Voltage": 230,
            "PowerKW": 3.7,
            "Comments": "Mode 1"
        },
        {
            "ID": 86002,
            "ConnectionTypeID": 0,
            "Reference": "3",
            "LevelID": 2,
            "Amps": 16,
            "Voltage": 230,
            "PowerKW": 3.7,
            "Comments": "Mode 1"
        },
        {
            "ID": 86003,
            "ConnectionTypeID": 0,
            "Reference": "4",
            "LevelID": 2,
            "Amps": 16,
            "Voltage": 230,
            "PowerKW": 3.7,
            "Comments": "Mode 1"
        },
        {
            "ID": 86004,
            "ConnectionTypeID": 0,
            "Reference": "5",
            "LevelID": 2,
            "Amps": 16,
            "Voltage": 230,
            "PowerKW": 3.7,
            "Comments": "Mode 1"
        },
        {
            "ID": 86005,
            "ConnectionTypeID": 0,
            "Reference": "6",
            "LevelID": 2,
            "Amps": 16,
            "Voltage": 230,
            "PowerKW": 3.7,
            "Comments": "Mode 1"
        },
        {
            "ID": 86006,
            "ConnectionTypeID": 0,
            "Reference": "7",
            "LevelID": 2,
            "Amps": 16,
            "Voltage": 230,
            "PowerKW": 3.7,
            "Comments": "Mode 1"
        },
        {
            "ID": 86007,
            "ConnectionTypeID": 0,
            "Reference": "8",
            "LevelID": 2,
            "Amps": 16,
            "Voltage": 230,
            "PowerKW": 3.7,
            "Comments": "Mode 1"
        },
        {
            "ID": 86008,
            "ConnectionTypeID": 0,
            "Reference": "9",
            "LevelID": 2,
            "Amps": 16,
            "Voltage": 230,
            "PowerKW": 3.7,
            "Comments": "Mode 1"
        },
        {
            "ID": 88696,
            "ConnectionTypeID": 0,
            "Reference": "10",
            "LevelID": 2,
            "Amps": 16,
            "Voltage": 230,
            "PowerKW": 3.7,
            "Comments": "Mode 1"
        }
    ],
    "NumberOfPoints": 10,
    "DateLastStatusUpdate": "2020-05-26T08:23:00Z",
    "DataQualityLevel": 2,
    "DateCreated": "2015-05-03T00:54:00Z",
    "SubmissionStatusTypeID": 100
}