{
    "IsRecentlyVerified": false,
    "ID": 71493,
    "UUID": "509A77BB-A06E-4FD0-9CD8-E15FDBF9001B",
    "DataProviderID": 1,
    "OperatorID": 23,
    "OperatorsReference": "18846",
    "UsageTypeID": 1,
    "UsageCost": "Free",
    "AddressInfo": {
        "ID": 71839,
        "Title": "Homewood Suites - Tesla",
        "AddressLine1": "199 Inverness Dr",
        "Town": "Englewood",
        "StateOrProvince": "CO",
        "Postcode": "80112",
        "CountryID": 2,
        "Latitude": 39.56707,
        "Longitude": -104.867969,
        "ContactTelephone1": "303-706-0102  877-798-3788",
        "AccessComments": "24 hours daily; for Tesla use only; see front desk for access",
        "RelatedURL": "http://www.teslamotors.com/supercharger",
        "DistanceUnit": 0
    },
    "Connections": [
        {
            "ID": 102317,
            "ConnectionTypeID": 30,
            "StatusTypeID": 50,
            "LevelID": 2,
            "Amps": 16,
            "Voltage": 230,
            "PowerKW": 16,
            "CurrentTypeID": 10,
            "Quantity": 1
        }
    ],
    "NumberOfPoints": 1,
    "StatusTypeID": 50,
    "DateLastStatusUpdate": "2017-01-26T02:21:00Z",
    "DataQualityLevel": 3,
    "DateCreated": "2016-09-02T10:15:00Z",
    "SubmissionStatusTypeID": 100
}