{
    "IsRecentlyVerified": false,
    "ID": 184763,
    "UUID": "E707A0F8-F4B0-496F-8A9A-247B66BD87B9",
    "DataProviderID": 29,
    "DataProvidersReference": "5258",
    "OperatorID": 3403,
    "AddressInfo": {
        "ID": 185122,
        "Title": "Carl-Friedrich-Gördeler-Straße Parkplatz",
        "AddressLine1": "Carl-Friedrich-Gördeler-Straße Parkplatz",
        "Town": "Lüneburg",
        "Postcode": "21337",
        "CountryID": 87,
        "Latitude": 53.23848,
        "Longitude": 10.43385,
        "DistanceUnit": 0
    },
    "Connections": [
        {
            "ID": 293421,
            "ConnectionTypeID": 25,
            "StatusTypeID": 50,
            "LevelID": 2,
            "PowerKW": 22,
            "CurrentTypeID": 20
        },
        {
            "ID": 293422,
            "ConnectionTypeID": 25,
            "StatusTypeID": 50,
            "LevelID": 2,
            "PowerKW": 22,
            "CurrentTypeID": 20
        }
    ],
    "StatusTypeID": 50,
    "DateLastStatusUpdate": "2021-07-09T03:29:00Z",
    "MetadataValues": [
        {
            "ID": 17054,
            "MetadataFieldID": 4,
            "ItemValue": "Data from the German chargepoint registry provided by Bundesnetzagentur.de under the CC-BY 4.0 license"
        }
    ],
    "DataQualityLevel": 3,
    "DateCreated": "2021-07-08T10:05:00Z",
    "SubmissionStatusTypeID": 100
}