{
    "IsRecentlyVerified": false,
    "ID": 42528,
    "UUID": "0E6B311A-5AB1-4ADA-8CF0-C6549800D2CC",
    "DataProviderID": 1,
    "OperatorID": 167,
    "UsageTypeID": 3,
    "UsageCost": "0",
    "AddressInfo": {
        "ID": 42874,
        "Title": "Olympic Auto",
        "AddressLine1": "Kieler Straße 166-172",
        "Town": "Neumünster",
        "StateOrProvince": "Neumünster",
        "Postcode": "24536",
        "CountryID": 87,
        "Latitude": 54.0879624192849,
        "Longitude": 9.98650865244304,
        "ContactTelephone1": "04321 851670",
        "AccessComments": "Nissan Autohändler mit \"Freistrom für alle\"-Aktion von Nissan. Während der Öffnungszeiten Mo.-Fr 7:30 bis 18 Uhr, Sa. 9 bis 12 Uhr kostenlos nutzbar.",
        "RelatedURL": "http://www.olympic-auto.de/go.to/modix/now/standort-neumuenster.html",
        "DistanceUnit": 0
    },
    "Connections": [
        {
            "ID": 51216,
            "ConnectionTypeID": 28,
            "StatusTypeID": 50,
            "LevelID": 2,
            "Amps": 16,
            "Voltage": 230,
            "PowerKW": 3.7,
            "CurrentTypeID": 10,
            "Quantity": 1
        }
    ],
    "NumberOfPoints": 1,
    "GeneralComments": "\r\n",
    "StatusTypeID": 50,
    "DateLastStatusUpdate": "2015-03-19T14:26:00Z",
    "DataQualityLevel": 1,
    "DateCreated": "2015-03-14T10:38:00Z",
    "SubmissionStatusTypeID": 200
}