{
    "IsRecentlyVerified": false,
    "ID": 32535,
    "UUID": "A20A27C7-ABCB-4709-A58B-07CFAB7BAD5F",
    "DataProviderID": 1,
    "OperatorID": 156,
    "OperatorsReference": "NewMotion ICUEVE000276",
    "UsageTypeID": 4,
    "UsageCost": "",
    "AddressInfo": {
        "ID": 32881,
        "Title": "Langensalzaer Landstraße 52",
        "AddressLine1": "Langensalzaer Landstraße 52",
        "AddressLine2": "",
        "Town": "Mühlhausen",
        "StateOrProvince": "",
        "Postcode": "99974",
        "CountryID": 87,
        "Latitude": 51.2001037597656,
        "Longitude": 10.4761114120483,
        "ContactTelephone1": "",
        "ContactTelephone2": "",
        "ContactEmail": "",
        "AccessComments": "",
        "RelatedURL": "",
        "DistanceUnit": 0
    },
    "Connections": [
        {
            "ID": 36046,
            "ConnectionTypeID": 25,
            "StatusTypeID": 0,
            "LevelID": 2,
            "PowerKW": 11
        }
    ],
    "NumberOfPoints": 2,
    "GeneralComments": "",
    "StatusTypeID": 50,
    "DateLastStatusUpdate": "2015-06-12T21:34:00Z",
    "DataQualityLevel": 3,
    "DateCreated": "2015-01-09T06:03:00Z",
    "SubmissionStatusTypeID": 200
}