{
    "IsRecentlyVerified": false,
    "ID": 187216,
    "UUID": "ED07C156-41C8-4EFC-87C7-66DD12782A16",
    "DataProviderID": 29,
    "DataProvidersReference": "1092",
    "OperatorID": 220,
    "AddressInfo": {
        "ID": 187575,
        "Title": "Gertigstraße 64",
        "AddressLine1": "Gertigstraße 64",
        "Town": "Hamburg",
        "Postcode": "22303",
        "CountryID": 87,
        "Latitude": 53.582853,
        "Longitude": 10.018196,
        "DistanceUnit": 0
    },
    "Connections": [
        {
            "ID": 301848,
            "ConnectionTypeID": 28,
            "StatusTypeID": 50,
            "LevelID": 2,
            "PowerKW": 22,
            "CurrentTypeID": 20
        },
        {
            "ID": 301849,
            "ConnectionTypeID": 25,
            "StatusTypeID": 50,
            "LevelID": 2,
            "PowerKW": 22,
            "CurrentTypeID": 20
        },
        {
            "ID": 301850,
            "ConnectionTypeID": 28,
            "StatusTypeID": 50,
            "LevelID": 2,
            "PowerKW": 22,
            "CurrentTypeID": 20
        },
        {
            "ID": 301851,
            "ConnectionTypeID": 25,
            "StatusTypeID": 50,
            "LevelID": 2,
            "PowerKW": 22,
            "CurrentTypeID": 20
        }
    ],
    "StatusTypeID": 50,
    "DateLastStatusUpdate": "2021-07-12T02:51:00Z",
    "MetadataValues": [
        {
            "ID": 19456,
            "MetadataFieldID": 4,
            "ItemValue": "Data from the German chargepoint registry provided by Bundesnetzagentur.de under the CC-BY 4.0 license"
        }
    ],
    "DataQualityLevel": 3,
    "DateCreated": "2021-07-12T02:51:00Z",
    "SubmissionStatusTypeID": 100
}