{
    "IsRecentlyVerified": false,
    "ID": 170115,
    "UUID": "5D8848C1-AEC1-40EB-8E95-E69D8D57CFC9",
    "DataProviderID": 1,
    "OperatorID": 3327,
    "UsageTypeID": 4,
    "AddressInfo": {
        "ID": 170474,
        "Title": "BeCharge  Bressana  Martiri delle Foibe",
        "AddressLine1": "Via Martiri delle Foibe",
        "Town": "Bressana Bottarone",
        "StateOrProvince": "PV",
        "Postcode": "27042",
        "CountryID": 112,
        "Latitude": 45.07319460663916,
        "Longitude": 9.138444797993316,
        "ContactTelephone1": "02-49527730",
        "ContactEmail": "emobility@buildingenergy.it",
        "RelatedURL": "https://www.bec.energy/",
        "DistanceUnit": 0
    },
    "Connections": [
        {
            "ID": 259339,
            "ConnectionTypeID": 25,
            "StatusTypeID": 50,
            "LevelID": 2,
            "Amps": 32,
            "Voltage": 400,
            "PowerKW": 22,
            "CurrentTypeID": 20,
            "Quantity": 4
        }
    ],
    "NumberOfPoints": 4,
    "StatusTypeID": 50,
    "DateLastStatusUpdate": "2020-11-18T14:07:00Z",
    "DataQualityLevel": 1,
    "DateCreated": "2020-11-18T14:07:00Z",
    "SubmissionStatusTypeID": 200
}