{
    "MediaItems": [
        {
            "ID": 17894,
            "ChargePointID": 118589,
            "ItemURL": "https://s3-ap-southeast-2.amazonaws.com/openchargemap/images/UA/OCM118589/OCM-118589.orig.2019032608003760.jpg",
            "ItemThumbnailURL": "https://s3-ap-southeast-2.amazonaws.com/openchargemap/images/UA/OCM118589/OCM-118589.thmb.2019032608003760.jpg",
            "Comment": "",
            "IsEnabled": true,
            "IsVideo": false,
            "IsFeaturedItem": false,
            "IsExternalResource": false,
            "User": {
                "ID": 20255,
                "Username": "STRUM Charging"
            },
            "DateCreated": "2019-03-26T08:01:00Z"
        },
        {
            "ID": 17895,
            "ChargePointID": 118589,
            "ItemURL": "https://s3-ap-southeast-2.amazonaws.com/openchargemap/images/UA/OCM118589/OCM-118589.orig.2019032608010428.jpg",
            "ItemThumbnailURL": "https://s3-ap-southeast-2.amazonaws.com/openchargemap/images/UA/OCM118589/OCM-118589.thmb.2019032608010428.jpg",
            "Comment": "",
            "IsEnabled": true,
            "IsVideo": false,
            "IsFeaturedItem": false,
            "IsExternalResource": false,
            "User": {
                "ID": 20255,
                "Username": "STRUM Charging"
            },
            "DateCreated": "2019-03-26T08:01:00Z"
        },
        {
            "ID": 17892,
            "ChargePointID": 118589,
            "ItemURL": "https://s3-ap-southeast-2.amazonaws.com/openchargemap/images/UA/OCM118589/OCM-118589.orig.2019032607495322.jpg",
            "ItemThumbnailURL": "https://s3-ap-southeast-2.amazonaws.com/openchargemap/images/UA/OCM118589/OCM-118589.thmb.2019032607495322.jpg",
            "Comment": "",
            "IsEnabled": true,
            "IsVideo": false,
            "IsFeaturedItem": false,
            "IsExternalResource": false,
            "User": {
                "ID": 20255,
                "Username": "STRUM Charging"
            },
            "DateCreated": "2019-03-26T07:50:00Z"
        },
        {
            "ID": 17893,
            "ChargePointID": 118589,
            "ItemURL": "https://s3-ap-southeast-2.amazonaws.com/openchargemap/images/UA/OCM118589/OCM-118589.orig.2019032607501309.jpg",
            "ItemThumbnailURL": "https://s3-ap-southeast-2.amazonaws.com/openchargemap/images/UA/OCM118589/OCM-118589.thmb.2019032607501309.jpg",
            "Comment": "",
            "IsEnabled": true,
            "IsVideo": false,
            "IsFeaturedItem": false,
            "IsExternalResource": false,
            "User": {
                "ID": 20255,
                "Username": "STRUM Charging"
            },
            "DateCreated": "2019-03-26T07:50:00Z"
        }
    ],
    "IsRecentlyVerified": false,
    "ID": 118589,
    "UUID": "388728E6-B04E-4D1B-BE8A-D2DF86A445DB",
    "DataProviderID": 1,
    "OperatorID": 3344,
    "UsageTypeID": 4,
    "UsageCost": "DC - 9 UAH/kWh (≈0.30 €/kWh), AC - 4.5 UAH/kWh (≈0.15 €/kWh). No fees for time or session.",
    "AddressInfo": {
        "ID": 118935,
        "Title": "STRUM 50 kW (TSUM)",
        "AddressLine1": "Khreschatyk Str. 38",
        "Town": "Kyiv",
        "StateOrProvince": "Шевченковский район",
        "Postcode": "01054",
        "CountryID": 234,
        "Latitude": 50.4450619950971,
        "Longitude": 30.5202391237049,
        "ContactTelephone1": "0-800-212-333",
        "ContactEmail": "support.strum@dtek.com",
        "AccessComments": "Access Sunday-Thursday 10:00-22:00, Friday-Saturday 10:00-23:00. Entrance from B.Khmelnitsky Street. Floor P1 of underground parking (minus first floor), parking lots № 39-40, 57-58. The first 14 of parking minutes are free, then 50 UAH/h. If you do not pick up the car at night - a fine of 100 UAH/h. STRUM card doesn't enable free parking at this location.",
        "RelatedURL": "http://strum.dtek.com",
        "DistanceUnit": 0
    },
    "Connections": [
        {
            "ID": 167722,
            "ConnectionTypeID": 2,
            "StatusTypeID": 50,
            "LevelID": 3,
            "Amps": 125,
            "Voltage": 400,
            "PowerKW": 50,
            "CurrentTypeID": 30,
            "Quantity": 1
        },
        {
            "ID": 167723,
            "ConnectionTypeID": 33,
            "StatusTypeID": 50,
            "LevelID": 3,
            "Amps": 125,
            "Voltage": 400,
            "PowerKW": 50,
            "CurrentTypeID": 30,
            "Quantity": 1
        },
        {
            "ID": 167724,
            "ConnectionTypeID": 25,
            "StatusTypeID": 50,
            "LevelID": 2,
            "Amps": 32,
            "Voltage": 400,
            "PowerKW": 22,
            "CurrentTypeID": 20,
            "Quantity": 1
        }
    ],
    "NumberOfPoints": 3,
    "GeneralComments": "    Registration, top-up & charging via 'STRUM Charging' mobile app (iOS/Android), at least 25.00 kWh must be available on the account at the start of each charging session. You can book your STRUM card only after registrartion & top-up by sending request to support.strum@dtek.com. \r\n\r\n    You pay only for kWh, no fees for time or session. Price during top up is 9 UAH/KWH (≈ 0.3 €/KWH). While charging on CHAdeMO/CCS, 1 KWH is taken away for each 1 kWh of charging. While charging on Type2, 0.5 KWH is taken away for each 1 kWh of charging (half price). Actual prices at http://strum.dtek.com/en/prices/. \r\n\r\n    Android App download - https://play.google.com/store/apps/details?id=com.beenergised.chargemobile.dtek&hl=en\r\n    iOS App download - https://itunes.apple.com/us/app/strum-charging/id1368596475?mt=8",
    "StatusTypeID": 50,
    "DateLastStatusUpdate": "2019-03-26T08:01:00Z",
    "DataQualityLevel": 1,
    "DateCreated": "2019-03-26T07:48:00Z",
    "SubmissionStatusTypeID": 200
}