{
    "IsRecentlyVerified": false,
    "ID": 32895,
    "UUID": "F890050B-3641-41B2-B909-DD054DBE9D5D",
    "DataProviderID": 26,
    "DataProvidersReference": "47144",
    "OperatorID": 178,
    "OperatorsReference": "EVnetNL AL292",
    "UsageCost": "0.00 jaarabonnement",
    "AddressInfo": {
        "ID": 33241,
        "Title": "Beatrix de Rijkweg 7",
        "AddressLine1": "Beatrix de Rijkweg 7",
        "Town": "Eindhoven",
        "Postcode": "5657 EG",
        "CountryID": 159,
        "Latitude": 51.456706,
        "Longitude": 5.397581,
        "ContactTelephone1": "0800-3522365",
        "RelatedURL": "http://www.evnet.nl",
        "DistanceUnit": 0
    },
    "Connections": [
        {
            "ID": 36406,
            "ConnectionTypeID": 25,
            "LevelID": 2,
            "PowerKW": 11,
            "CurrentTypeID": 10
        }
    ],
    "NumberOfPoints": 2,
    "StatusTypeID": 50,
    "DateLastStatusUpdate": "2016-06-04T02:39:00Z",
    "DataQualityLevel": 3,
    "DateCreated": "2015-01-09T06:03:00Z",
    "SubmissionStatusTypeID": 100
}