{
    "IsRecentlyVerified": false,
    "ID": 56920,
    "UUID": "105A45B1-83CA-4AE2-BE5C-280EBB59D106",
    "DataProviderID": 1,
    "OperatorID": 45,
    "UsageTypeID": 3,
    "AddressInfo": {
        "ID": 57266,
        "Title": "GAT Solar",
        "AddressLine1": "Deisterstraße 10",
        "Town": "Braunschweig",
        "StateOrProvince": "Braunschweig",
        "Postcode": "38122",
        "CountryID": 87,
        "Latitude": 52.2372,
        "Longitude": 10.504000000000019,
        "ContactTelephone1": "+49 531 287001",
        "AccessComments": "Die Säule ist nutzbar von  Mo-Fr: von 08:00 bis 18:00 Uhr. Bitte anmelden, damit Säule freigeschaltet wird.\r\n",
        "RelatedURL": "http://www.www.gat-solar.de",
        "DistanceUnit": 0
    },
    "Connections": [
        {
            "ID": 71857,
            "ConnectionTypeID": 25,
            "StatusTypeID": 50,
            "LevelID": 2,
            "Amps": 32,
            "Voltage": 400,
            "PowerKW": 22,
            "CurrentTypeID": 20,
            "Quantity": 1
        }
    ],
    "NumberOfPoints": 1,
    "StatusTypeID": 50,
    "DateLastStatusUpdate": "2015-11-17T12:34:00Z",
    "DataQualityLevel": 1,
    "DateCreated": "2015-11-17T12:34:00Z",
    "SubmissionStatusTypeID": 200
}