{
    "IsRecentlyVerified": false,
    "ID": 106620,
    "UUID": "08013054-7241-4A0C-B137-A80B9E2828C4",
    "DataProviderID": 1,
    "OperatorID": 1,
    "UsageTypeID": 4,
    "UsageCost": "Kostenlos",
    "AddressInfo": {
        "ID": 106966,
        "Title": "Eutzinger Straße",
        "AddressLine1": "Eutzinger Straße 36",
        "Town": "Landau in der Pfalz",
        "StateOrProvince": "Landau in der Pfalz",
        "Postcode": "76829",
        "CountryID": 87,
        "Latitude": 49.18625217521982,
        "Longitude": 8.119180246557562,
        "ContactTelephone1": "+49 6341 2890",
        "AccessComments": "24/7 nutzbar im Philosophengarten. Betreiber ist die EnergieSüdwest AG",
        "RelatedURL": "http://www.energie-suedwest.de/",
        "DistanceUnit": 0
    },
    "Connections": [
        {
            "ID": 150032,
            "ConnectionTypeID": 25,
            "StatusTypeID": 50,
            "LevelID": 2,
            "Amps": 32,
            "Voltage": 400,
            "PowerKW": 22,
            "CurrentTypeID": 20,
            "Quantity": 2
        }
    ],
    "NumberOfPoints": 2,
    "StatusTypeID": 50,
    "DateLastStatusUpdate": "2018-06-26T06:46:00Z",
    "DataQualityLevel": 1,
    "DateCreated": "2018-06-26T06:46:00Z",
    "SubmissionStatusTypeID": 200
}