{
    "IsRecentlyVerified": false,
    "ID": 183112,
    "UUID": "FDEC8333-3EE1-4F8B-BF03-86ABDA954FD8",
    "DataProviderID": 29,
    "DataProvidersReference": "17856",
    "AddressInfo": {
        "ID": 183471,
        "Title": "Knappenstr. 2",
        "AddressLine1": "Knappenstr. 2",
        "Town": "Senftenberg",
        "Postcode": "01968",
        "CountryID": 87,
        "Latitude": 51.520517,
        "Longitude": 14,
        "DistanceUnit": 0
    },
    "Connections": [
        {
            "ID": 289696,
            "ConnectionTypeID": 25,
            "StatusTypeID": 50,
            "LevelID": 2,
            "PowerKW": 11,
            "CurrentTypeID": 20
        },
        {
            "ID": 289697,
            "ConnectionTypeID": 25,
            "StatusTypeID": 50,
            "LevelID": 2,
            "PowerKW": 22,
            "CurrentTypeID": 20
        }
    ],
    "StatusTypeID": 50,
    "DateLastStatusUpdate": "2021-07-09T03:24:00Z",
    "MetadataValues": [
        {
            "ID": 15405,
            "MetadataFieldID": 4,
            "ItemValue": "Data from the German chargepoint registry provided by Bundesnetzagentur.de under the CC-BY 4.0 license"
        }
    ],
    "DataQualityLevel": 3,
    "DateCreated": "2021-07-08T10:03:00Z",
    "SubmissionStatusTypeID": 100
}