{
    "IsRecentlyVerified": false,
    "ID": 97361,
    "UUID": "FFF9AAFB-C0A9-463F-AA70-F648936568EB",
    "DataProviderID": 1,
    "OperatorID": 23,
    "OperatorsReference": "39371",
    "UsageTypeID": 4,
    "AddressInfo": {
        "ID": 97707,
        "Title": "Inselhotel Arfsten Wyk auf Föhr",
        "AddressLine1": "Ohl Dörp 64",
        "Town": "Wyk",
        "Postcode": "25938",
        "CountryID": 87,
        "Latitude": 54.698808,
        "Longitude": 8.553351,
        "ContactTelephone1": "+49 4681 2331",
        "DistanceUnit": 0
    },
    "Connections": [
        {
            "ID": 138268,
            "ConnectionTypeID": 30,
            "StatusTypeID": 50,
            "LevelID": 2,
            "Amps": 16,
            "Voltage": 400,
            "PowerKW": 11,
            "CurrentTypeID": 20,
            "Quantity": 2
        }
    ],
    "NumberOfPoints": 2,
    "GeneralComments": "2 Tesla Connectors, up to 11kW.Available for customers. Please see front desk.",
    "StatusTypeID": 50,
    "DateLastStatusUpdate": "2018-10-03T17:15:00Z",
    "DataQualityLevel": 1,
    "DateCreated": "2018-01-21T15:14:00Z",
    "SubmissionStatusTypeID": 200
}