{
    "IsRecentlyVerified": false,
    "ID": 115793,
    "UUID": "662F106F-FDAC-4A0F-8407-70AA3CDBDA59",
    "DataProviderID": 2,
    "DataProvidersReference": "116216",
    "OperatorID": 23,
    "UsageTypeID": 1,
    "AddressInfo": {
        "ID": 116139,
        "Title": "Mountain View Solar - Tesla Destination",
        "AddressLine1": "11500 Valley Rd",
        "Town": "Berkeley Springs",
        "StateOrProvince": "WV",
        "Postcode": "25411",
        "CountryID": 2,
        "Latitude": 39.46744,
        "Longitude": -78.309589,
        "ContactTelephone1": "304-258-4733  877-798-3752",
        "AccessComments": "24 hours daily; for customer use only; see front desk for access",
        "RelatedURL": "https://www.tesla.com/destination-charging",
        "DistanceUnit": 0
    },
    "Connections": [
        {
            "ID": 162830,
            "ConnectionTypeID": 30,
            "LevelID": 2,
            "Amps": 16,
            "Voltage": 230,
            "PowerKW": 3.7,
            "CurrentTypeID": 10,
            "Quantity": 1
        }
    ],
    "DateLastStatusUpdate": "2020-06-26T03:01:00Z",
    "DataQualityLevel": 3,
    "DateCreated": "2019-02-11T07:13:00Z",
    "SubmissionStatusTypeID": 100
}