{
    "IsRecentlyVerified": false,
    "ID": 97859,
    "UUID": "7CF4CF8C-8FB5-4B0C-B83E-67B9FB1C5FC6",
    "DataProviderID": 1,
    "OperatorID": 23,
    "OperatorsReference": "39770",
    "UsageTypeID": 4,
    "AddressInfo": {
        "ID": 98205,
        "Title": "Das Naturjuwel",
        "AddressLine1": "Via Claudia Augusta 44",
        "Town": "Fiss",
        "Postcode": "6533",
        "CountryID": 19,
        "Latitude": 47.055528,
        "Longitude": 10.616628,
        "ContactTelephone1": "+43 5476 6611",
        "DistanceUnit": 0
    },
    "Connections": [
        {
            "ID": 138767,
            "ConnectionTypeID": 30,
            "StatusTypeID": 50,
            "LevelID": 2,
            "Amps": 16,
            "Voltage": 400,
            "PowerKW": 11,
            "CurrentTypeID": 20,
            "Quantity": 2
        }
    ],
    "NumberOfPoints": 2,
    "GeneralComments": "2 Tesla Connectors, up to 11kW.Available for customers. Please see front desk.",
    "StatusTypeID": 50,
    "DateLastStatusUpdate": "2018-10-03T20:27:00Z",
    "DataQualityLevel": 1,
    "DateCreated": "2018-01-21T16:50:00Z",
    "SubmissionStatusTypeID": 200
}