{
    "IsRecentlyVerified": false,
    "ID": 53606,
    "UUID": "B1336E1F-364C-4B69-8BB6-63C1D51282C5",
    "DataProviderID": 1,
    "OperatorID": 105,
    "OperatorsReference": "Essent EM-DE-09184119-01-00002",
    "UsageTypeID": 4,
    "AddressInfo": {
        "ID": 53952,
        "Title": "Parkring 5",
        "AddressLine1": "Parkring 5",
        "Town": "Garching",
        "Postcode": "85748",
        "CountryID": 87,
        "Latitude": 48.252363,
        "Longitude": 11.633154,
        "DistanceUnit": 0
    },
    "Connections": [
        {
            "ID": 66768,
            "ConnectionTypeID": 25,
            "StatusTypeID": 50,
            "LevelID": 2,
            "Amps": 32,
            "Voltage": 400,
            "PowerKW": 22,
            "CurrentTypeID": 20,
            "Quantity": 2
        }
    ],
    "NumberOfPoints": 2,
    "StatusTypeID": 50,
    "DateLastStatusUpdate": "2015-09-30T12:02:00Z",
    "DataQualityLevel": 3,
    "DateCreated": "2015-09-20T11:50:00Z",
    "SubmissionStatusTypeID": 200
}