{
    "IsRecentlyVerified": false,
    "ID": 160101,
    "UUID": "5FD6445D-0B79-4C3F-A00C-C8549A29C36D",
    "DataProviderID": 2,
    "DataProvidersReference": "154612",
    "OperatorID": 9,
    "UsageTypeID": 1,
    "AddressInfo": {
        "ID": 160458,
        "Title": "McDonald's - Brattleboro, VT",
        "AddressLine1": "1027 Putney Road",
        "Town": "Brattleboro",
        "StateOrProvince": "VT",
        "Postcode": "05301",
        "CountryID": 2,
        "Latitude": 42.8820799,
        "Longitude": -72.557679,
        "ContactTelephone1": "888-998-2546",
        "AccessComments": "MON: 24 hours | TUE: 24 hours | WED: 24 hours | THU: 24 hours | FRI: 24 hours | SAT: 24 hours | SUN: 24 hours",
        "RelatedURL": "http://www.blinkcharging.com/",
        "DistanceUnit": 0
    },
    "Connections": [
        {
            "ID": 230340,
            "ConnectionTypeID": 1,
            "LevelID": 2,
            "Amps": 16,
            "Voltage": 230,
            "PowerKW": 3.7,
            "CurrentTypeID": 10,
            "Quantity": 2
        }
    ],
    "StatusTypeID": 50,
    "DateLastStatusUpdate": "2020-06-26T03:06:00Z",
    "DataQualityLevel": 3,
    "DateCreated": "2020-06-26T03:06:00Z",
    "SubmissionStatusTypeID": 100
}