{
    "IsRecentlyVerified": false,
    "ID": 35696,
    "UUID": "C5B18B9F-19E9-454D-ADC0-80FCDE6D904C",
    "DataProviderID": 26,
    "DataProvidersReference": "57856",
    "OperatorID": 180,
    "OperatorsReference": "Alfen GDH2672",
    "UsageCost": "0.00 jaarabonnement",
    "AddressInfo": {
        "ID": 36042,
        "Title": "Groenewegje 158",
        "AddressLine1": "Groenewegje 158",
        "Town": "Den Haag",
        "Postcode": "2515 NC",
        "CountryID": 159,
        "Latitude": 52.074237,
        "Longitude": 4.318401,
        "ContactTelephone1": "036 - 549 34 00",
        "RelatedURL": "http://www.icu-charging-stations.com/",
        "DistanceUnit": 0
    },
    "Connections": [
        {
            "ID": 39207,
            "ConnectionTypeID": 25,
            "LevelID": 2,
            "PowerKW": 11,
            "CurrentTypeID": 10
        },
        {
            "ID": 48008,
            "ConnectionTypeID": 25,
            "LevelID": 2,
            "PowerKW": 11,
            "CurrentTypeID": 10
        }
    ],
    "NumberOfPoints": 1,
    "StatusTypeID": 50,
    "DateLastStatusUpdate": "2016-06-04T02:47:00Z",
    "DataQualityLevel": 3,
    "DateCreated": "2015-01-09T06:05:00Z",
    "SubmissionStatusTypeID": 100
}