{
    "IsRecentlyVerified": false,
    "ID": 38523,
    "UUID": "EE45CDD1-E13A-437A-BB5D-D0B886B668D9",
    "DataProviderID": 26,
    "DataProvidersReference": "45732",
    "OperatorID": 73,
    "OperatorsReference": "EV-Box EVB-P1347107",
    "UsageCost": "0.00 jaarabonnement",
    "AddressInfo": {
        "ID": 38869,
        "Title": "Tulpenveld 218c",
        "AddressLine1": "Tulpenveld 218c",
        "Town": "Castricum",
        "Postcode": "1901 LC",
        "CountryID": 159,
        "Latitude": 52.55844,
        "Longitude": 4.67651,
        "RelatedURL": "http://www.ev-box.nl",
        "DistanceUnit": 0
    },
    "Connections": [
        {
            "ID": 42034,
            "ConnectionTypeID": 25,
            "LevelID": 2,
            "PowerKW": 5,
            "CurrentTypeID": 10
        }
    ],
    "NumberOfPoints": 1,
    "StatusTypeID": 50,
    "DateLastStatusUpdate": "2016-03-03T12:40:00Z",
    "DataQualityLevel": 3,
    "DateCreated": "2015-01-09T06:07:00Z",
    "SubmissionStatusTypeID": 100
}