{
    "IsRecentlyVerified": false,
    "ID": 24427,
    "UUID": "52BA28E3-2D23-4535-80BA-663BD98AB172",
    "DataProviderID": 1,
    "OperatorID": 22,
    "OperatorsReference": "C64H6",
    "UsageTypeID": 4,
    "UsageCost": "Free",
    "AddressInfo": {
        "ID": 24773,
        "Title": "Ferris Lane",
        "AddressLine1": "Upper Main Street",
        "Town": "Buncrana",
        "StateOrProvince": "County Donegal",
        "CountryID": 3,
        "Latitude": 55.135935,
        "Longitude": -7.452539,
        "DistanceUnit": 0
    },
    "Connections": [
        {
            "ID": 26627,
            "ConnectionTypeID": 25,
            "StatusTypeID": 50,
            "LevelID": 2,
            "Amps": 32,
            "Voltage": 400,
            "PowerKW": 22,
            "CurrentTypeID": 20,
            "Quantity": 2
        }
    ],
    "NumberOfPoints": 2,
    "StatusTypeID": 50,
    "DateLastStatusUpdate": "2019-06-03T15:00:00Z",
    "DataQualityLevel": 1,
    "DateCreated": "2014-09-19T13:42:00Z",
    "SubmissionStatusTypeID": 200
}