{
    "IsRecentlyVerified": false,
    "ID": 137531,
    "UUID": "F34E0852-75A9-46FD-93F9-A9D248326831",
    "DataProviderID": 2,
    "DataProvidersReference": "145510",
    "OperatorID": 5,
    "UsageTypeID": 1,
    "AddressInfo": {
        "ID": 137877,
        "Title": "RCS",
        "AddressLine1": "Gate Pkwy",
        "Town": "Jacksonville",
        "StateOrProvince": "FL",
        "Postcode": "32256",
        "CountryID": 2,
        "Latitude": 30.247578,
        "Longitude": -81.52183,
        "ContactTelephone1": "888-758-4389",
        "AccessComments": "24 hours daily",
        "RelatedURL": "http://www.chargepoint.com/",
        "DistanceUnit": 0
    },
    "Connections": [
        {
            "ID": 192459,
            "ConnectionTypeID": 1,
            "LevelID": 2,
            "Amps": 16,
            "Voltage": 230,
            "PowerKW": 3,
            "CurrentTypeID": 10,
            "Quantity": 2
        }
    ],
    "StatusTypeID": 50,
    "DateLastStatusUpdate": "2019-12-24T09:05:00Z",
    "DataQualityLevel": 3,
    "DateCreated": "2019-12-24T09:05:00Z",
    "SubmissionStatusTypeID": 100
}