{
    "IsRecentlyVerified": false,
    "ID": 177379,
    "UUID": "2E5E5BBE-9F3D-45AD-94D5-24480DD46FBB",
    "DataProviderID": 29,
    "DataProvidersReference": "10764",
    "AddressInfo": {
        "ID": 177738,
        "Title": "Mirecourtstraße 12",
        "AddressLine1": "Mirecourtstraße 12",
        "Town": "Bonn",
        "Postcode": "53225",
        "CountryID": 87,
        "Latitude": 50.744671,
        "Longitude": 7.118414,
        "DistanceUnit": 0
    },
    "Connections": [
        {
            "ID": 276459,
            "ConnectionTypeID": 25,
            "StatusTypeID": 50,
            "LevelID": 2,
            "PowerKW": 22,
            "CurrentTypeID": 20
        },
        {
            "ID": 276460,
            "ConnectionTypeID": 25,
            "StatusTypeID": 50,
            "LevelID": 2,
            "PowerKW": 22,
            "CurrentTypeID": 20
        }
    ],
    "StatusTypeID": 0,
    "DateLastStatusUpdate": "2021-07-12T02:45:00Z",
    "MetadataValues": [
        {
            "ID": 9673,
            "MetadataFieldID": 4,
            "ItemValue": "Data from the German chargepoint registry provided by Bundesnetzagentur.de under the CC-BY 4.0 license"
        }
    ],
    "DataQualityLevel": 3,
    "DateCreated": "2021-07-08T09:49:00Z",
    "SubmissionStatusTypeID": 100
}