{
    "IsRecentlyVerified": false,
    "ID": 63759,
    "UUID": "0CB8854D-5669-4CB6-B7F5-A95714A31343",
    "DataProviderID": 26,
    "DataProvidersReference": "73437",
    "OperatorID": 73,
    "OperatorsReference": "EV-Box EVB-P1414071",
    "UsageCost": "0.00 jaarabonnement",
    "AddressInfo": {
        "ID": 64105,
        "Title": "Dorrewold 34",
        "AddressLine1": "Dorrewold 34",
        "Town": "Lochem",
        "Postcode": "7213 TG",
        "CountryID": 159,
        "Latitude": 52.20931,
        "Longitude": 6.20336,
        "RelatedURL": "http://www.ev-box.nl",
        "DistanceUnit": 0
    },
    "Connections": [
        {
            "ID": 81437,
            "ConnectionTypeID": 25,
            "LevelID": 2,
            "PowerKW": 5,
            "CurrentTypeID": 10
        }
    ],
    "NumberOfPoints": 1,
    "StatusTypeID": 50,
    "DateLastStatusUpdate": "2016-06-04T02:51:00Z",
    "DataQualityLevel": 3,
    "DateCreated": "2016-03-03T12:31:00Z",
    "SubmissionStatusTypeID": 100
}