{
    "IsRecentlyVerified": false,
    "ID": 160270,
    "UUID": "E5CCFF57-8B86-4039-A656-C946D357AACB",
    "DataProviderID": 2,
    "DataProvidersReference": "158062",
    "UsageTypeID": 2,
    "AddressInfo": {
        "ID": 160627,
        "Title": "Mr. Gas",
        "AddressLine1": "1141 County Rd 6",
        "Town": "Odessa",
        "StateOrProvince": "ON",
        "Postcode": "K0H 2H0",
        "CountryID": 44,
        "Latitude": 44.2799266,
        "Longitude": -76.7147294,
        "ContactTelephone1": "",
        "AccessComments": "",
        "RelatedURL": "",
        "DistanceUnit": 0
    },
    "Connections": [
        {
            "ID": 230592,
            "ConnectionTypeID": 2,
            "LevelID": 3,
            "Amps": 100,
            "Voltage": 400,
            "PowerKW": 40,
            "CurrentTypeID": 30,
            "Quantity": 1
        },
        {
            "ID": 230593,
            "ConnectionTypeID": 32,
            "LevelID": 3,
            "Amps": 100,
            "Voltage": 400,
            "PowerKW": 40,
            "CurrentTypeID": 30,
            "Quantity": 1
        }
    ],
    "GeneralComments": "Planned for future date. Not Operational.",
    "DatePlanned": "2020-09-01T00:00:00Z",
    "StatusTypeID": 150,
    "DateLastStatusUpdate": "2020-06-26T03:07:00Z",
    "DataQualityLevel": 3,
    "DateCreated": "2020-06-26T03:07:00Z",
    "SubmissionStatusTypeID": 100
}