{
    "UserComments": [
        {
            "ID": 19839,
            "ChargePointID": 51788,
            "CommentTypeID": 10,
            "UserName": "Hypermile",
            "Comment": "Hotel is fairly relaxed about casual charging -- which periodically happens during the day. Ask nicely of them, and they will (likely) help you out in a jam.",
            "DateCreated": "2018-07-22T17:23:35.173Z",
            "User": {
                "ID": 11824,
                "Username": "Hypermile"
            }
        },
        {
            "ID": 14281,
            "ChargePointID": 51788,
            "CommentTypeID": 10,
            "UserName": "Hypermile",
            "Comment": "From memory, last week, I charge my Tesla at ~24MPH.  ",
            "Rating": 5,
            "DateCreated": "2016-09-21T04:54:14.503Z",
            "User": {
                "ID": 11824,
                "Username": "Hypermile"
            },
            "CheckinStatusTypeID": 10
        }
    ],
    "MediaItems": [
        {
            "ID": 15966,
            "ChargePointID": 51788,
            "ItemURL": "https://s3-ap-southeast-2.amazonaws.com/openchargemap/images/US/OCM51788/OCM-51788.orig.2018072217210467.png",
            "ItemThumbnailURL": "https://s3-ap-southeast-2.amazonaws.com/openchargemap/images/US/OCM51788/OCM-51788.thmb.2018072217210467.png",
            "Comment": "",
            "IsEnabled": true,
            "IsVideo": false,
            "IsFeaturedItem": false,
            "IsExternalResource": false,
            "User": {
                "ID": 11824,
                "Username": "Hypermile"
            },
            "DateCreated": "2018-07-22T17:21:00Z"
        },
        {
            "ID": 8312,
            "ChargePointID": 51788,
            "ItemURL": "https://s3-ap-southeast-2.amazonaws.com/openchargemap/images/US/OCM51788/OCM-51788.orig.2016092105011734.jpg",
            "ItemThumbnailURL": "https://s3-ap-southeast-2.amazonaws.com/openchargemap/images/US/OCM51788/OCM-51788.thmb.2016092105011734.jpg",
            "Comment": "Watch for cable on sidewalk, especially at night.",
            "IsEnabled": true,
            "IsVideo": false,
            "IsFeaturedItem": false,
            "IsExternalResource": false,
            "User": {
                "ID": 11824,
                "Username": "Hypermile"
            },
            "DateCreated": "2016-09-21T05:01:00Z"
        }
    ],
    "IsRecentlyVerified": false,
    "ID": 51788,
    "UUID": "8CC17069-4BC6-4482-A605-AE4F308DD6EF",
    "DataProviderID": 1,
    "OperatorID": 23,
    "OperatorsReference": "6836",
    "UsageTypeID": 1,
    "UsageCost": "Free",
    "AddressInfo": {
        "ID": 52134,
        "Title": "NYLO Hotel - Irving",
        "AddressLine1": "1001 W Royal Ln",
        "Town": "Irving",
        "StateOrProvince": "TX",
        "Postcode": "75039",
        "CountryID": 2,
        "Latitude": 32.8961114223334,
        "Longitude": -96.9627449715332,
        "ContactTelephone1": "972-373-8900  877-798-3752",
        "AccessComments": "24 hours daily; for guest use only; see front desk for access",
        "RelatedURL": "http://www.teslamotors.com/supercharger",
        "DistanceUnit": 0
    },
    "Connections": [
        {
            "ID": 64264,
            "ConnectionTypeID": 1,
            "StatusTypeID": 50,
            "LevelID": 2,
            "Amps": 16,
            "Voltage": 230,
            "PowerKW": 3,
            "CurrentTypeID": 10,
            "Quantity": 3
        },
        {
            "ID": 102859,
            "ConnectionTypeID": 30,
            "StatusTypeID": 50,
            "LevelID": 2,
            "Amps": 40,
            "Voltage": 210,
            "PowerKW": 13,
            "CurrentTypeID": 20,
            "Quantity": 2
        }
    ],
    "NumberOfPoints": 3,
    "GeneralComments": "1 J1772; 2 Tesla HPWC",
    "StatusTypeID": 50,
    "DateLastStatusUpdate": "2018-07-22T17:24:00Z",
    "DataQualityLevel": 3,
    "DateCreated": "2015-08-13T03:43:00Z",
    "SubmissionStatusTypeID": 100
}