{
    "IsRecentlyVerified": false,
    "ID": 105833,
    "UUID": "2E17BB04-0B59-4BF9-9F14-B723229E187A",
    "DataProviderID": 2,
    "DataProvidersReference": "96950",
    "OperatorID": 5,
    "UsageTypeID": 1,
    "AddressInfo": {
        "ID": 106179,
        "Title": "EMBASSY CENTER",
        "AddressLine1": "9020 SW Washington Square Rd",
        "Town": "Tigard",
        "StateOrProvince": "OR",
        "Postcode": "97223",
        "CountryID": 2,
        "Latitude": 45.4545916,
        "Longitude": -122.7816795,
        "ContactTelephone1": "888-758-4389",
        "AccessComments": "24 hours daily",
        "RelatedURL": "http://www.chargepoint.com/",
        "DistanceUnit": 0
    },
    "Connections": [
        {
            "ID": 149041,
            "ConnectionTypeID": 1,
            "LevelID": 2,
            "Amps": 16,
            "Voltage": 230,
            "PowerKW": 3.7,
            "CurrentTypeID": 10,
            "Quantity": 2
        }
    ],
    "DateLastStatusUpdate": "2020-06-26T03:09:00Z",
    "DataQualityLevel": 3,
    "DateCreated": "2018-06-09T04:02:00Z",
    "SubmissionStatusTypeID": 100
}