{
    "IsRecentlyVerified": false,
    "ID": 173194,
    "UUID": "CED225DE-CC81-4B40-9352-DC2A5484D4DC",
    "DataProviderID": 19,
    "DataProvidersReference": "7291",
    "AddressInfo": {
        "ID": 173553,
        "Title": "Holmenkollbakken",
        "AddressLine1": "Kongeveien 40",
        "Town": "OSLO",
        "StateOrProvince": "Oslo",
        "Postcode": "0787",
        "CountryID": 168,
        "Latitude": 59.96459,
        "Longitude": 10.66651,
        "AccessComments": "",
        "DistanceUnit": 0
    },
    "Connections": [
        {
            "ID": 265794,
            "ConnectionTypeID": 25,
            "Reference": "1",
            "LevelID": 2,
            "Amps": 32,
            "Voltage": 230,
            "PowerKW": 7.4,
            "CurrentTypeID": 10,
            "Comments": "Mode 3"
        },
        {
            "ID": 265795,
            "ConnectionTypeID": 25,
            "Reference": "2",
            "LevelID": 2,
            "Amps": 32,
            "Voltage": 230,
            "PowerKW": 7.4,
            "CurrentTypeID": 10,
            "Comments": "Mode 3"
        },
        {
            "ID": 265796,
            "ConnectionTypeID": 25,
            "Reference": "3",
            "LevelID": 2,
            "Amps": 32,
            "Voltage": 230,
            "PowerKW": 7.4,
            "CurrentTypeID": 10,
            "Comments": "Mode 3"
        },
        {
            "ID": 265797,
            "ConnectionTypeID": 25,
            "Reference": "4",
            "LevelID": 2,
            "Amps": 32,
            "Voltage": 230,
            "PowerKW": 7.4,
            "CurrentTypeID": 10,
            "Comments": "Mode 3"
        },
        {
            "ID": 265798,
            "ConnectionTypeID": 25,
            "Reference": "5",
            "LevelID": 2,
            "Amps": 32,
            "Voltage": 230,
            "PowerKW": 7.4,
            "CurrentTypeID": 10,
            "Comments": "Mode 3"
        },
        {
            "ID": 265799,
            "ConnectionTypeID": 25,
            "Reference": "6",
            "LevelID": 2,
            "Amps": 32,
            "Voltage": 230,
            "PowerKW": 7.4,
            "CurrentTypeID": 10,
            "Comments": "Mode 3"
        },
        {
            "ID": 265800,
            "ConnectionTypeID": 25,
            "Reference": "7",
            "LevelID": 2,
            "Amps": 32,
            "Voltage": 230,
            "PowerKW": 7.4,
            "CurrentTypeID": 10,
            "Comments": "Mode 3"
        },
        {
            "ID": 265801,
            "ConnectionTypeID": 25,
            "Reference": "8",
            "LevelID": 2,
            "Amps": 32,
            "Voltage": 230,
            "PowerKW": 7.4,
            "CurrentTypeID": 10,
            "Comments": "Mode 3"
        },
        {
            "ID": 265802,
            "ConnectionTypeID": 25,
            "Reference": "9",
            "LevelID": 2,
            "Amps": 32,
            "Voltage": 230,
            "PowerKW": 7.4,
            "CurrentTypeID": 10,
            "Comments": "Mode 3"
        },
        {
            "ID": 265803,
            "ConnectionTypeID": 25,
            "Reference": "10",
            "LevelID": 2,
            "Amps": 32,
            "Voltage": 230,
            "PowerKW": 7.4,
            "CurrentTypeID": 10,
            "Comments": "Mode 3"
        }
    ],
    "NumberOfPoints": 10,
    "StatusTypeID": 0,
    "DateLastStatusUpdate": "2021-03-03T09:02:00Z",
    "DataQualityLevel": 2,
    "DateCreated": "2021-03-03T09:02:00Z",
    "SubmissionStatusTypeID": 100
}