{
    "IsRecentlyVerified": false,
    "ID": 88964,
    "UUID": "EE538314-106D-47C0-B042-57B16359E167",
    "DataProviderID": 1,
    "OperatorID": 3,
    "OperatorsReference": "PG-91227",
    "UsageTypeID": 6,
    "UsageCost": "Free",
    "AddressInfo": {
        "ID": 89310,
        "Title": "Pronto Accident Repair Centre-Spalding",
        "AddressLine1": "Cresswell Close",
        "Town": "Spalding",
        "Postcode": "PE11 3TY",
        "CountryID": 1,
        "Latitude": 52.807337,
        "Longitude": -0.140805,
        "DistanceUnit": 0
    },
    "Connections": [
        {
            "ID": 126253,
            "ConnectionTypeID": 25,
            "StatusTypeID": 50,
            "LevelID": 2,
            "Amps": 32,
            "Voltage": 230,
            "PowerKW": 7,
            "CurrentTypeID": 10,
            "Quantity": 1
        }
    ],
    "NumberOfPoints": 1,
    "GeneralComments": "This is an open charge unit installed at the Pronto Accident Repair Centre site in Cresswell Close, Pinchbeck, Spalding",
    "StatusTypeID": 50,
    "DateLastStatusUpdate": "2017-06-15T05:26:00Z",
    "DataQualityLevel": 1,
    "DateCreated": "2017-06-15T05:26:00Z",
    "SubmissionStatusTypeID": 200
}