{
    "IsRecentlyVerified": false,
    "ID": 168818,
    "UUID": "B025DFDA-E180-41F8-BBC3-3B95CA8EFFE4",
    "DataProviderID": 1,
    "OperatorID": 3379,
    "UsageTypeID": 6,
    "AddressInfo": {
        "ID": 169177,
        "Title": "Rue de la Mare Neuve",
        "AddressLine1": "Rue de la Mare Neuve",
        "Town": "Évry-Courcouronnes",
        "StateOrProvince": "Essonne",
        "Postcode": "91080",
        "CountryID": 80,
        "Latitude": 48.616731040523405,
        "Longitude": 2.423874028733394,
        "ContactTelephone1": "+33388688458",
        "ContactEmail": "support@freshmile.com",
        "AccessComments": "Novotel freshmile stations",
        "DistanceUnit": 0
    },
    "Connections": [
        {
            "ID": 256628,
            "ConnectionTypeID": 25
        },
        {
            "ID": 256629,
            "ConnectionTypeID": 25
        }
    ],
    "NumberOfPoints": 4,
    "StatusTypeID": 50,
    "DateLastStatusUpdate": "2020-10-09T14:53:00Z",
    "DataQualityLevel": 1,
    "DateCreated": "2020-10-06T14:51:00Z",
    "SubmissionStatusTypeID": 200
}