{
    "IsRecentlyVerified": false,
    "ID": 113220,
    "UUID": "2E3E109B-C571-4812-B28D-747AA4AE1140",
    "DataProviderID": 2,
    "DataProvidersReference": "104320",
    "OperatorID": 5,
    "UsageTypeID": 1,
    "AddressInfo": {
        "ID": 113566,
        "Title": "DORAN",
        "AddressLine1": "6729 Oak Grove Pkwy",
        "Town": "Brooklyn Park",
        "StateOrProvince": "MN",
        "Postcode": "55445",
        "CountryID": 2,
        "Latitude": 45.1312468,
        "Longitude": -93.3652027,
        "ContactTelephone1": "888-758-4389",
        "AccessComments": "24 hours daily",
        "RelatedURL": "http://www.chargepoint.com/",
        "DistanceUnit": 0
    },
    "Connections": [
        {
            "ID": 159410,
            "ConnectionTypeID": 1,
            "LevelID": 2,
            "Amps": 16,
            "Voltage": 230,
            "PowerKW": 3,
            "CurrentTypeID": 10,
            "Quantity": 2
        }
    ],
    "DateLastStatusUpdate": "2019-04-06T05:06:00Z",
    "DataQualityLevel": 3,
    "DateCreated": "2018-11-28T02:04:00Z",
    "SubmissionStatusTypeID": 100
}