{
    "IsRecentlyVerified": false,
    "ID": 28990,
    "UUID": "4A3899B6-6D60-4636-A352-1DFB53CB2439",
    "DataProviderID": 2,
    "DataProvidersReference": "42413",
    "UsageTypeID": 1,
    "AddressInfo": {
        "ID": 29336,
        "Title": "Kwik Trip #422",
        "AddressLine1": "9535 S 13th St",
        "Town": "Oak Creek",
        "StateOrProvince": "WI",
        "Postcode": "53154",
        "CountryID": 2,
        "Latitude": 42.87166,
        "Longitude": -87.933821,
        "ContactTelephone1": "414-762-2370",
        "AccessComments": "24 hours daily",
        "RelatedURL": "",
        "DistanceUnit": 0
    },
    "Connections": [
        {
            "ID": 31852,
            "ConnectionTypeID": 9,
            "LevelID": 1,
            "Amps": 16,
            "Voltage": 120,
            "PowerKW": 1.9,
            "CurrentTypeID": 10,
            "Quantity": 1
        }
    ],
    "DateLastStatusUpdate": "2020-06-26T03:06:00Z",
    "DataQualityLevel": 3,
    "DateCreated": "2014-11-28T03:38:00Z",
    "SubmissionStatusTypeID": 100
}