{
    "IsRecentlyVerified": false,
    "ID": 182817,
    "UUID": "59827525-2D1F-40B4-BEEB-401B3CEF97BD",
    "DataProviderID": 29,
    "DataProvidersReference": "15469",
    "AddressInfo": {
        "ID": 183176,
        "Title": "Sindelfingerstraße 4",
        "AddressLine1": "Sindelfingerstraße 4",
        "Town": "Tübingen",
        "Postcode": "72072",
        "CountryID": 87,
        "Latitude": 48.522045,
        "Longitude": 9.037593,
        "DistanceUnit": 0
    },
    "Connections": [
        {
            "ID": 289026,
            "ConnectionTypeID": 25,
            "StatusTypeID": 50,
            "LevelID": 2,
            "PowerKW": 22,
            "CurrentTypeID": 20
        },
        {
            "ID": 289027,
            "ConnectionTypeID": 25,
            "StatusTypeID": 50,
            "LevelID": 2,
            "PowerKW": 22,
            "CurrentTypeID": 20
        }
    ],
    "StatusTypeID": 50,
    "DateLastStatusUpdate": "2021-07-12T02:41:00Z",
    "MetadataValues": [
        {
            "ID": 15110,
            "MetadataFieldID": 4,
            "ItemValue": "Data from the German chargepoint registry provided by Bundesnetzagentur.de under the CC-BY 4.0 license"
        }
    ],
    "DataQualityLevel": 3,
    "DateCreated": "2021-07-08T10:03:00Z",
    "SubmissionStatusTypeID": 100
}