{
    "IsRecentlyVerified": false,
    "ID": 65430,
    "UUID": "1DC1DF90-376B-4631-8A66-39DDDF282500",
    "DataProviderID": 26,
    "DataProvidersReference": "83775",
    "OperatorID": 103,
    "OperatorsReference": "Allego NLALLEGO0010122",
    "UsageCost": "0.00 jaarabonnement",
    "AddressInfo": {
        "ID": 65776,
        "Title": "Watermolenwal",
        "AddressLine1": "Watermolenwal",
        "Town": "Helmond",
        "Postcode": "5707",
        "CountryID": 159,
        "Latitude": 51.48161278,
        "Longitude": 5.65517548,
        "ContactTelephone1": "0800-3745337",
        "RelatedURL": "http://www.allego.eu/",
        "DistanceUnit": 0
    },
    "Connections": [
        {
            "ID": 90160,
            "ConnectionTypeID": 25,
            "LevelID": 2,
            "PowerKW": 11,
            "CurrentTypeID": 10
        },
        {
            "ID": 90161,
            "ConnectionTypeID": 25,
            "LevelID": 2,
            "PowerKW": 11,
            "CurrentTypeID": 10
        }
    ],
    "NumberOfPoints": 1,
    "StatusTypeID": 50,
    "DateLastStatusUpdate": "2016-06-04T02:39:00Z",
    "DataQualityLevel": 3,
    "DateCreated": "2016-04-27T09:41:00Z",
    "SubmissionStatusTypeID": 100
}