{
    "IsRecentlyVerified": false,
    "ID": 173452,
    "UUID": "D3520AE2-EE6C-44C5-A286-E4A6611A2C90",
    "DataProviderID": 18,
    "DataProvidersReference": "019ebd17867972b004d6683fa4c64d50",
    "OperatorID": 2244,
    "UsageTypeID": 1,
    "AddressInfo": {
        "ID": 173811,
        "Title": "34 Camden Square",
        "AddressLine1": "34 Camden Square",
        "Town": "London",
        "Postcode": "NW1 9XA",
        "CountryID": 1,
        "Latitude": -0.131178,
        "Longitude": 51.544928,
        "AccessComments": "",
        "RelatedURL": "https://www.ubitricity.com",
        "DistanceUnit": 0
    },
    "Connections": [
        {
            "ID": 266477,
            "ConnectionTypeID": 25,
            "Reference": "suby1100005333",
            "StatusTypeID": 50,
            "LevelID": 2,
            "Amps": 16,
            "Voltage": 230,
            "PowerKW": 3.7,
            "CurrentTypeID": 10
        }
    ],
    "StatusTypeID": 0,
    "DateLastStatusUpdate": "2021-07-12T03:38:00Z",
    "MetadataValues": [
        {
            "ID": 8374,
            "MetadataFieldID": 4,
            "ItemValue": "Contains public sector information licensed under the Open Government Licence v2.0. http://www.nationalarchives.gov.uk/doc/open-government-licence/version/2/"
        }
    ],
    "DataQualityLevel": 3,
    "DateCreated": "2021-03-03T11:25:00Z",
    "SubmissionStatusTypeID": 100
}