{
    "IsRecentlyVerified": false,
    "ID": 182241,
    "UUID": "3DBED298-15CA-4CC1-8DC3-7D165AA8AD79",
    "DataProviderID": 29,
    "DataProvidersReference": "2167",
    "OperatorID": 3403,
    "AddressInfo": {
        "ID": 182600,
        "Title": "Jungfernstieg 13",
        "AddressLine1": "Jungfernstieg 13",
        "Town": "Meldorf",
        "Postcode": "25704",
        "CountryID": 87,
        "Latitude": 54.09002,
        "Longitude": 9.06916,
        "DistanceUnit": 0
    },
    "Connections": [
        {
            "ID": 287739,
            "ConnectionTypeID": 25,
            "StatusTypeID": 50,
            "LevelID": 2,
            "PowerKW": 22,
            "CurrentTypeID": 20
        },
        {
            "ID": 287740,
            "ConnectionTypeID": 25,
            "StatusTypeID": 50,
            "LevelID": 2,
            "PowerKW": 22,
            "CurrentTypeID": 20
        }
    ],
    "StatusTypeID": 50,
    "DateLastStatusUpdate": "2021-07-12T02:52:00Z",
    "MetadataValues": [
        {
            "ID": 14535,
            "MetadataFieldID": 4,
            "ItemValue": "Data from the German chargepoint registry provided by Bundesnetzagentur.de under the CC-BY 4.0 license"
        }
    ],
    "DataQualityLevel": 3,
    "DateCreated": "2021-07-08T10:02:00Z",
    "SubmissionStatusTypeID": 100
}