{
    "IsRecentlyVerified": false,
    "ID": 148532,
    "UUID": "8142E9ED-4771-4F23-8CBD-038D465AE622",
    "DataProviderID": 1,
    "OperatorID": 86,
    "UsageTypeID": 4,
    "AddressInfo": {
        "ID": 148884,
        "Title": "Elektromarkt Euronics XXL",
        "AddressLine1": "Marktstraße 2",
        "Town": "Söhlde / Hoheneggelsen",
        "StateOrProvince": "Landkreis Hildesheim",
        "Postcode": "31185",
        "CountryID": 87,
        "Latitude": 52.213069,
        "Longitude": 10.194399,
        "AccessComments": "24/7 nutzbarer Triplecharger auf dem Euronics Parkplatz.",
        "DistanceUnit": 0
    },
    "Connections": [
        {
            "ID": 206252,
            "ConnectionTypeID": 33,
            "StatusTypeID": 50,
            "LevelID": 3,
            "Amps": 125,
            "Voltage": 500,
            "PowerKW": 50,
            "CurrentTypeID": 30,
            "Quantity": 1
        },
        {
            "ID": 206253,
            "ConnectionTypeID": 2,
            "StatusTypeID": 50,
            "LevelID": 3,
            "Amps": 125,
            "Voltage": 500,
            "PowerKW": 50,
            "CurrentTypeID": 30,
            "Quantity": 1
        },
        {
            "ID": 206254,
            "ConnectionTypeID": 1036,
            "StatusTypeID": 50,
            "LevelID": 3,
            "Amps": 63,
            "Voltage": 400,
            "PowerKW": 43,
            "CurrentTypeID": 20,
            "Quantity": 1
        }
    ],
    "NumberOfPoints": 3,
    "StatusTypeID": 50,
    "DateLastStatusUpdate": "2020-02-05T00:29:00Z",
    "DataQualityLevel": 1,
    "DateCreated": "2020-02-04T12:07:00Z",
    "SubmissionStatusTypeID": 200
}