{
    "IsRecentlyVerified": false,
    "ID": 187189,
    "UUID": "A74F1DA8-BFD8-4282-AA73-15FB12F5C380",
    "DataProviderID": 29,
    "DataProvidersReference": "20477",
    "OperatorID": 220,
    "AddressInfo": {
        "ID": 187548,
        "Title": "Felicitas-Kuckuk-Straße 10",
        "AddressLine1": "Felicitas-Kuckuk-Straße 10",
        "Town": "Hamburg",
        "Postcode": "22765",
        "CountryID": 87,
        "Latitude": 53.559472,
        "Longitude": 9.93786,
        "DistanceUnit": 0
    },
    "Connections": [
        {
            "ID": 301648,
            "ConnectionTypeID": 33,
            "StatusTypeID": 50,
            "LevelID": 3,
            "PowerKW": 50,
            "CurrentTypeID": 30
        },
        {
            "ID": 301649,
            "ConnectionTypeID": 2,
            "StatusTypeID": 50,
            "LevelID": 3,
            "PowerKW": 50,
            "CurrentTypeID": 30
        },
        {
            "ID": 301650,
            "ConnectionTypeID": 25,
            "StatusTypeID": 50,
            "LevelID": 2,
            "PowerKW": 11,
            "CurrentTypeID": 20
        }
    ],
    "StatusTypeID": 50,
    "DateLastStatusUpdate": "2021-07-12T02:51:00Z",
    "MetadataValues": [
        {
            "ID": 19429,
            "MetadataFieldID": 4,
            "ItemValue": "Data from the German chargepoint registry provided by Bundesnetzagentur.de under the CC-BY 4.0 license"
        }
    ],
    "DataQualityLevel": 3,
    "DateCreated": "2021-07-12T02:51:00Z",
    "SubmissionStatusTypeID": 100
}