{
    "MediaItems": [
        {
            "ID": 18534,
            "ChargePointID": 127185,
            "ItemURL": "https://s3-ap-southeast-2.amazonaws.com/openchargemap/images/TR/OCM127185/OCM-127185.orig.2019052910432201.jpeg",
            "ItemThumbnailURL": "https://s3-ap-southeast-2.amazonaws.com/openchargemap/images/TR/OCM127185/OCM-127185.thmb.2019052910432201.jpeg",
            "Comment": "",
            "IsEnabled": true,
            "IsVideo": false,
            "IsFeaturedItem": false,
            "IsExternalResource": false,
            "User": {
                "ID": 18886,
                "Username": "melih"
            },
            "DateCreated": "2019-05-29T10:44:00Z"
        },
        {
            "ID": 18532,
            "ChargePointID": 127185,
            "ItemURL": "https://s3-ap-southeast-2.amazonaws.com/openchargemap/images/TR/OCM127185/OCM-127185.orig.2019052910423924.jpeg",
            "ItemThumbnailURL": "https://s3-ap-southeast-2.amazonaws.com/openchargemap/images/TR/OCM127185/OCM-127185.thmb.2019052910423924.jpeg",
            "Comment": "",
            "IsEnabled": true,
            "IsVideo": false,
            "IsFeaturedItem": false,
            "IsExternalResource": false,
            "User": {
                "ID": 18886,
                "Username": "melih"
            },
            "DateCreated": "2019-05-29T10:43:00Z"
        },
        {
            "ID": 18533,
            "ChargePointID": 127185,
            "ItemURL": "https://s3-ap-southeast-2.amazonaws.com/openchargemap/images/TR/OCM127185/OCM-127185.orig.2019052910430393.jpeg",
            "ItemThumbnailURL": "https://s3-ap-southeast-2.amazonaws.com/openchargemap/images/TR/OCM127185/OCM-127185.thmb.2019052910430393.jpeg",
            "Comment": "",
            "IsEnabled": true,
            "IsVideo": false,
            "IsFeaturedItem": false,
            "IsExternalResource": false,
            "User": {
                "ID": 18886,
                "Username": "melih"
            },
            "DateCreated": "2019-05-29T10:43:00Z"
        }
    ],
    "IsRecentlyVerified": false,
    "ID": 127185,
    "UUID": "D8C7D6F6-6307-4AFE-87D7-01CB3BF9C612",
    "DataProviderID": 1,
    "OperatorID": 70,
    "UsageTypeID": 4,
    "AddressInfo": {
        "ID": 127531,
        "Title": "EŞARJ - Total Tayakadın",
        "AddressLine1": "O6",
        "Town": "Istanbul",
        "CountryID": 229,
        "Latitude": 41.2447101936602,
        "Longitude": 28.7014606303087,
        "AccessComments": "Total Petrol Station",
        "DistanceUnit": 0
    },
    "Connections": [
        {
            "ID": 178082,
            "ConnectionTypeID": 2,
            "StatusTypeID": 50,
            "LevelID": 3,
            "PowerKW": 50,
            "CurrentTypeID": 30,
            "Quantity": 1
        },
        {
            "ID": 178083,
            "ConnectionTypeID": 33,
            "StatusTypeID": 50,
            "LevelID": 3,
            "PowerKW": 50,
            "CurrentTypeID": 30,
            "Quantity": 1
        },
        {
            "ID": 178084,
            "ConnectionTypeID": 25,
            "StatusTypeID": 50,
            "LevelID": 2,
            "PowerKW": 22,
            "CurrentTypeID": 20,
            "Quantity": 3
        }
    ],
    "NumberOfPoints": 2,
    "GeneralComments": "https://esarj.com/harita?s=TR-IST-087",
    "StatusTypeID": 50,
    "DateLastStatusUpdate": "2019-05-29T10:44:00Z",
    "DataQualityLevel": 1,
    "DateCreated": "2019-05-29T10:41:00Z",
    "SubmissionStatusTypeID": 200
}