{
    "IsRecentlyVerified": false,
    "ID": 62229,
    "UUID": "1A8B0850-9460-47BB-8EBB-B58247F25490",
    "DataProviderID": 2,
    "DataProvidersReference": "73386",
    "UsageTypeID": 2,
    "AddressInfo": {
        "ID": 62575,
        "Title": "ComEd",
        "AddressLine1": "901 S 9th Ave",
        "Town": "Maywood",
        "StateOrProvince": "IL",
        "Postcode": "60153",
        "CountryID": 2,
        "Latitude": 41.879329,
        "Longitude": -87.84316,
        "ContactTelephone1": "",
        "AccessComments": "ComEd fleet use only",
        "RelatedURL": "",
        "DistanceUnit": 0
    },
    "Connections": [
        {
            "ID": 79132,
            "ConnectionTypeID": 1,
            "LevelID": 2,
            "Amps": 16,
            "Voltage": 230,
            "PowerKW": 3.7,
            "CurrentTypeID": 10,
            "Quantity": 4
        }
    ],
    "DateLastStatusUpdate": "2020-06-26T03:05:00Z",
    "DataQualityLevel": 3,
    "DateCreated": "2016-03-03T11:38:00Z",
    "SubmissionStatusTypeID": 100
}