{
    "UserComments": [
        {
            "ID": 22052,
            "ChargePointID": 98011,
            "CommentTypeID": 10,
            "UserName": "eugeit",
            "Comment": "Applegreen own brand 2x 50kw fast chargers instslled here. CCS & CHADEMO only. free at moment",
            "DateCreated": "2020-01-13T23:23:35.653Z",
            "User": {
                "ID": 21959,
                "Username": "eugeit"
            },
            "CheckinStatusTypeID": 10,
            "IsActionedByEditor": false
        }
    ],
    "MediaItems": [
        {
            "ID": 21048,
            "ChargePointID": 98011,
            "ItemURL": "https://s3-ap-southeast-2.amazonaws.com/openchargemap/images/IE/OCM98011/OCM-98011.orig.2020011919124145.png",
            "ItemThumbnailURL": "https://s3-ap-southeast-2.amazonaws.com/openchargemap/images/IE/OCM98011/OCM-98011.thmb.2020011919124145.png",
            "Comment": "",
            "IsEnabled": true,
            "IsVideo": false,
            "IsFeaturedItem": false,
            "IsExternalResource": false,
            "User": {
                "ID": 21959,
                "Username": "eugeit"
            },
            "DateCreated": "2020-01-19T19:13:00Z"
        },
        {
            "ID": 21047,
            "ChargePointID": 98011,
            "ItemURL": "https://s3-ap-southeast-2.amazonaws.com/openchargemap/images/IE/OCM98011/OCM-98011.orig.2020011919111283.png",
            "ItemThumbnailURL": "https://s3-ap-southeast-2.amazonaws.com/openchargemap/images/IE/OCM98011/OCM-98011.thmb.2020011919111283.png",
            "Comment": "",
            "IsEnabled": true,
            "IsVideo": false,
            "IsFeaturedItem": false,
            "IsExternalResource": false,
            "User": {
                "ID": 21959,
                "Username": "eugeit"
            },
            "DateCreated": "2020-01-19T19:11:00Z"
        }
    ],
    "IsRecentlyVerified": false,
    "ID": 98011,
    "UUID": "98689713-3E01-444F-879C-32D9FC1BBDCB",
    "DataProviderID": 1,
    "OperatorID": 23,
    "OperatorsReference": "28776",
    "UsageTypeID": 4,
    "UsageCost": "€0.29/kWh; other tariffs possible",
    "AddressInfo": {
        "ID": 98357,
        "Title": "Birdhill Supercharger",
        "AddressLine1": "JTN 27 M7 Coolderry",
        "Town": "Birdhill Ireland Co. Tipperary",
        "StateOrProvince": "Coolderry",
        "CountryID": 3,
        "Latitude": 52.757822,
        "Longitude": -8.408856,
        "DistanceUnit": 0
    },
    "Connections": [
        {
            "ID": 138919,
            "ConnectionTypeID": 27,
            "StatusTypeID": 50,
            "LevelID": 3,
            "PowerKW": 120,
            "CurrentTypeID": 30,
            "Quantity": 8
        }
    ],
    "NumberOfPoints": 8,
    "GeneralComments": "Charging8 Superchargers, available 24/7, up to 120kW",
    "StatusTypeID": 50,
    "DateLastStatusUpdate": "2020-01-19T19:13:00Z",
    "DataQualityLevel": 1,
    "DateCreated": "2018-01-21T17:33:00Z",
    "SubmissionStatusTypeID": 200
}