{
    "IsRecentlyVerified": false,
    "ID": 33555,
    "UUID": "0EDCB8A0-BD0C-4B57-AFD3-8ADE9CA2B670",
    "DataProviderID": 26,
    "DataProvidersReference": "47990",
    "OperatorID": 178,
    "OperatorsReference": "EVnetNL DB0229",
    "UsageCost": "0.00 jaarabonnement",
    "AddressInfo": {
        "ID": 33901,
        "Title": "De Coubertinlaan 8",
        "AddressLine1": "De Coubertinlaan 8",
        "Town": "Waalwijk",
        "Postcode": "5143 AB",
        "CountryID": 159,
        "Latitude": 51.684257,
        "Longitude": 5.077263,
        "ContactTelephone1": "0800-3522365",
        "RelatedURL": "http://www.evnet.nl",
        "DistanceUnit": 0
    },
    "Connections": [
        {
            "ID": 37066,
            "ConnectionTypeID": 25,
            "LevelID": 2,
            "PowerKW": 11,
            "CurrentTypeID": 10
        }
    ],
    "NumberOfPoints": 2,
    "StatusTypeID": 50,
    "DateLastStatusUpdate": "2016-06-04T02:40:00Z",
    "DataQualityLevel": 3,
    "DateCreated": "2015-01-09T06:04:00Z",
    "SubmissionStatusTypeID": 100
}