{
    "IsRecentlyVerified": false,
    "ID": 52936,
    "UUID": "102DAFFE-3A7B-4686-B56E-89A61F94BEB9",
    "DataProviderID": 1,
    "OperatorID": 45,
    "UsageTypeID": 1,
    "AddressInfo": {
        "ID": 53282,
        "Title": "Supermarkt Marktkauf",
        "AddressLine1": "Werkstraße 26",
        "Town": "Büren",
        "StateOrProvince": "Kreis Paderborn",
        "Postcode": "33142",
        "CountryID": 87,
        "Latitude": 51.54809,
        "Longitude": 8.56291999999996,
        "AccessComments": "Auf dem Parkplatz neben der Solaranlage steht eine Ladesäule. Während der Marktöffnungszeiten nutzbar, von Mo-Sa 8-21Uhr",
        "DistanceUnit": 0
    },
    "Connections": [
        {
            "ID": 65902,
            "ConnectionTypeID": 25,
            "StatusTypeID": 50,
            "LevelID": 2,
            "Amps": 32,
            "Voltage": 400,
            "PowerKW": 22,
            "CurrentTypeID": 20,
            "Quantity": 1
        }
    ],
    "NumberOfPoints": 1,
    "StatusTypeID": 50,
    "DateLastStatusUpdate": "2015-09-15T06:32:00Z",
    "DataQualityLevel": 1,
    "DateCreated": "2015-09-15T06:05:00Z",
    "SubmissionStatusTypeID": 200
}