{
    "IsRecentlyVerified": false,
    "ID": 8273,
    "UUID": "EAECB946-D8C3-40D5-BDA6-D43061623178",
    "DataProviderID": 15,
    "DataProvidersReference": "5558",
    "OperatorID": 26,
    "AddressInfo": {
        "ID": 8170,
        "Title": "4401 State Road 33 N",
        "AddressLine1": "4401 State Road 33 N",
        "Town": "Lakeland",
        "StateOrProvince": "FL",
        "Postcode": "33805",
        "CountryID": 2,
        "Latitude": 28.09809,
        "Longitude": -81.94933,
        "ContactTelephone1": " (863) 686-2800",
        "RelatedURL": "http://carstations.com/5558",
        "DistanceUnit": 0
    },
    "Connections": [
        {
            "ID": 5702,
            "ConnectionTypeID": 1,
            "Reference": "J1772",
            "LevelID": 2
        }
    ],
    "StatusTypeID": 0,
    "DateLastStatusUpdate": "2017-11-04T14:03:00Z",
    "DataQualityLevel": 1,
    "DateCreated": "2011-11-11T12:06:00Z",
    "SubmissionStatusTypeID": 100
}