{
    "IsRecentlyVerified": false,
    "ID": 29151,
    "UUID": "AEBC3663-9385-454D-93F1-C09628041617",
    "DataProviderID": 2,
    "DataProvidersReference": "52564",
    "UsageTypeID": 1,
    "AddressInfo": {
        "ID": 29497,
        "Title": "Goodwill",
        "AddressLine1": "2024 Adams St",
        "Town": "Mankato",
        "StateOrProvince": "MN",
        "Postcode": "56001",
        "CountryID": 2,
        "Latitude": 44.173291,
        "Longitude": -93.945987,
        "ContactTelephone1": "507-344-0955",
        "AccessComments": "24 hours daily",
        "RelatedURL": "",
        "DistanceUnit": 0
    },
    "Connections": [
        {
            "ID": 32032,
            "ConnectionTypeID": 1,
            "LevelID": 2,
            "Amps": 16,
            "Voltage": 230,
            "PowerKW": 3.7,
            "CurrentTypeID": 10,
            "Quantity": 2
        }
    ],
    "DateLastStatusUpdate": "2020-06-26T03:07:00Z",
    "DataQualityLevel": 3,
    "DateCreated": "2014-11-28T03:39:00Z",
    "SubmissionStatusTypeID": 100
}