{
    "IsRecentlyVerified": false,
    "ID": 57833,
    "UUID": "4BDA70D0-4EEF-4CE4-9F77-5C45560C3595",
    "DataProviderID": 1,
    "DataProvidersReference": "3131",
    "AddressInfo": {
        "ID": 58179,
        "Title": "Hotell Marieberg",
        "AddressLine1": "Mariebergsvägen 2",
        "Town": "KRISTINEHAMN",
        "StateOrProvince": "VÄRMLAND",
        "Postcode": "68137",
        "CountryID": 216,
        "Latitude": 59.32303,
        "Longitude": 14.09209,
        "AccessComments": "På Hotell Mariebergs parkering vid receptionen.",
        "DistanceUnit": 0
    },
    "Connections": [
        {
            "ID": 73296,
            "ConnectionTypeID": 0,
            "Reference": "1",
            "LevelID": 2,
            "Amps": 16,
            "Voltage": 230,
            "PowerKW": 3.7,
            "Comments": "Mode 2"
        },
        {
            "ID": 88206,
            "ConnectionTypeID": 0,
            "Reference": "2",
            "LevelID": 2,
            "Amps": 16,
            "Voltage": 400,
            "PowerKW": 11,
            "Comments": "Mode 2"
        }
    ],
    "NumberOfPoints": 2,
    "DateLastStatusUpdate": "2020-05-26T08:22:00Z",
    "DataQualityLevel": 2,
    "DateCreated": "2015-12-26T11:12:00Z",
    "SubmissionStatusTypeID": 100
}