{
    "IsRecentlyVerified": false,
    "ID": 96145,
    "UUID": "9B90DCF6-FD7C-4EBF-BBDA-E189F0E19ECA",
    "DataProviderID": 1,
    "OperatorID": 3,
    "OperatorsReference": "PG-81564",
    "UsageTypeID": 6,
    "UsageCost": "Free",
    "AddressInfo": {
        "ID": 96491,
        "Title": "Robins & Day Peugeot-Chelmsford",
        "AddressLine1": "Waterhouse Lane",
        "Town": "Essex",
        "Postcode": "CM1 2UP",
        "CountryID": 1,
        "Latitude": 51.729634,
        "Longitude": 0.453659,
        "DistanceUnit": 0
    },
    "Connections": [
        {
            "ID": 136229,
            "ConnectionTypeID": 25,
            "StatusTypeID": 50,
            "LevelID": 2,
            "Amps": 32,
            "Voltage": 230,
            "PowerKW": 7,
            "CurrentTypeID": 10,
            "Quantity": 2
        }
    ],
    "NumberOfPoints": 2,
    "GeneralComments": "This is an open charge unit installed at the Robins & Day Peugeot dealership in Waterhouse Lane, Chelmsford, Essex",
    "StatusTypeID": 50,
    "DateLastStatusUpdate": "2017-12-12T06:31:00Z",
    "DataQualityLevel": 1,
    "DateCreated": "2017-12-12T06:31:00Z",
    "SubmissionStatusTypeID": 200
}