{
    "IsRecentlyVerified": false,
    "ID": 181816,
    "UUID": "EFF27664-BCFE-49C5-BE20-65E97B1CC074",
    "DataProviderID": 29,
    "DataProvidersReference": "19184,2969",
    "OperatorID": 72,
    "AddressInfo": {
        "ID": 182175,
        "Title": "Ludwigsstraße 1",
        "AddressLine1": "Ludwigsstraße 1",
        "Town": "Köln",
        "Postcode": "50667",
        "CountryID": 87,
        "Latitude": 50.937607,
        "Longitude": 6.955156,
        "DistanceUnit": 0
    },
    "Connections": [
        {
            "ID": 286667,
            "ConnectionTypeID": 25,
            "StatusTypeID": 50,
            "LevelID": 2,
            "PowerKW": 11,
            "CurrentTypeID": 20
        },
        {
            "ID": 286668,
            "ConnectionTypeID": 25,
            "StatusTypeID": 50,
            "LevelID": 2,
            "PowerKW": 11,
            "CurrentTypeID": 20
        }
    ],
    "StatusTypeID": 50,
    "DateLastStatusUpdate": "2021-07-09T03:21:00Z",
    "MetadataValues": [
        {
            "ID": 14110,
            "MetadataFieldID": 4,
            "ItemValue": "Data from the German chargepoint registry provided by Bundesnetzagentur.de under the CC-BY 4.0 license"
        }
    ],
    "DataQualityLevel": 3,
    "DateCreated": "2021-07-08T10:02:00Z",
    "SubmissionStatusTypeID": 100
}