{
    "IsRecentlyVerified": false,
    "ID": 102803,
    "UUID": "D80F5B20-CE4C-4CAF-BDE2-EFBCE55A34F9",
    "DataProviderID": 2,
    "DataProvidersReference": "94931",
    "OperatorID": 5,
    "UsageTypeID": 1,
    "AddressInfo": {
        "ID": 103149,
        "Title": "CDC",
        "AddressLine1": "1540-1698 Wallace Rd",
        "Town": "South Park Township",
        "StateOrProvince": "PA",
        "Postcode": "15129",
        "CountryID": 2,
        "Latitude": 40.3033981,
        "Longitude": -79.9818478,
        "ContactTelephone1": "888-758-4389",
        "AccessComments": "24 hours daily",
        "RelatedURL": "http://www.chargepoint.com/",
        "DistanceUnit": 0
    },
    "Connections": [
        {
            "ID": 144941,
            "ConnectionTypeID": 1,
            "LevelID": 2,
            "Amps": 16,
            "Voltage": 230,
            "PowerKW": 3,
            "CurrentTypeID": 10,
            "Quantity": 2
        }
    ],
    "DateLastStatusUpdate": "2019-04-06T05:04:00Z",
    "DataQualityLevel": 3,
    "DateCreated": "2018-04-21T04:13:00Z",
    "SubmissionStatusTypeID": 100
}