{
    "IsRecentlyVerified": false,
    "ID": 22844,
    "UUID": "F3216BD5-2179-4CBF-82EA-A79F406580F6",
    "DataProviderID": 1,
    "OperatorID": 20,
    "OperatorsReference": "60039,60040,60041,60042,60043,60044",
    "UsageTypeID": 4,
    "UsageCost": "Free",
    "AddressInfo": {
        "ID": 23189,
        "Title": "Topp Way Multi Storey Car Park",
        "AddressLine1": "Topp Way",
        "Town": "Bolton",
        "Postcode": "BL1 2DJ",
        "CountryID": 1,
        "Latitude": 53.5828358,
        "Longitude": -2.4311201,
        "DistanceUnit": 0
    },
    "Connections": [
        {
            "ID": 24525,
            "ConnectionTypeID": 25,
            "StatusTypeID": 50,
            "LevelID": 2,
            "Amps": 32,
            "Voltage": 230,
            "PowerKW": 7,
            "CurrentTypeID": 10,
            "Quantity": 6
        }
    ],
    "NumberOfPoints": 6,
    "GeneralComments": "Free EV parking is available, with no time limit is imposed while vehicle is charging. Details subject to change, Driver should confirm details with the carpark operator",
    "StatusTypeID": 50,
    "DateLastStatusUpdate": "2019-08-15T05:19:00Z",
    "MetadataValues": [
        {
            "ID": 831,
            "MetadataFieldID": 4,
            "ItemValue": "Contains public sector information licensed under the Open Government Licence v2.0. http://www.nationalarchives.gov.uk/doc/open-government-licence/version/2/"
        }
    ],
    "DataQualityLevel": 3,
    "DateCreated": "2014-03-22T08:42:00Z",
    "SubmissionStatusTypeID": 100
}