{
    "IsRecentlyVerified": false,
    "ID": 94813,
    "UUID": "91E09531-6D3D-4844-A6D9-495A02DC6F05",
    "DataProviderID": 1,
    "OperatorID": 3,
    "OperatorsReference": "t53_hu1_4016_028",
    "UsageTypeID": 4,
    "UsageCost": "£0.25/kWh",
    "AddressInfo": {
        "ID": 95159,
        "Title": "Lidl-Plymouth",
        "AddressLine1": "Plymouth Road",
        "AddressLine2": "Underwood",
        "Town": "Plymouth",
        "StateOrProvince": "Devon",
        "Postcode": "PL7 4NF",
        "CountryID": 1,
        "Latitude": 50.3897907223547,
        "Longitude": -4.07170486406245,
        "DistanceUnit": 0
    },
    "Connections": [
        {
            "ID": 134022,
            "ConnectionTypeID": 2,
            "StatusTypeID": 50,
            "LevelID": 3,
            "Amps": 125,
            "Voltage": 500,
            "PowerKW": 50,
            "CurrentTypeID": 30,
            "Quantity": 1
        },
        {
            "ID": 134023,
            "ConnectionTypeID": 1036,
            "StatusTypeID": 50,
            "LevelID": 3,
            "Amps": 63,
            "Voltage": 400,
            "PowerKW": 43,
            "CurrentTypeID": 20,
            "Quantity": 1
        },
        {
            "ID": 134024,
            "ConnectionTypeID": 33,
            "StatusTypeID": 50,
            "LevelID": 3,
            "Amps": 125,
            "Voltage": 500,
            "PowerKW": 50,
            "CurrentTypeID": 30,
            "Quantity": 1
        }
    ],
    "NumberOfPoints": 3,
    "StatusTypeID": 50,
    "DateLastStatusUpdate": "2021-03-22T19:37:00Z",
    "DataQualityLevel": 1,
    "DateCreated": "2017-10-27T12:25:00Z",
    "SubmissionStatusTypeID": 200
}