{
    "IsRecentlyVerified": false,
    "ID": 186938,
    "UUID": "B2C642C3-41A7-4E0D-8C20-B1A01B8714B2",
    "DataProviderID": 29,
    "DataProvidersReference": "13174",
    "OperatorID": 103,
    "AddressInfo": {
        "ID": 187297,
        "Title": "Wilhelmstr. 138",
        "AddressLine1": "Wilhelmstr. 138",
        "Town": "Berlin",
        "Postcode": "10963",
        "CountryID": 87,
        "Latitude": 52.501334,
        "Longitude": 13.388511,
        "DistanceUnit": 0
    },
    "Connections": [
        {
            "ID": 300697,
            "ConnectionTypeID": 25,
            "StatusTypeID": 50,
            "LevelID": 2,
            "PowerKW": 11,
            "CurrentTypeID": 20
        },
        {
            "ID": 300698,
            "ConnectionTypeID": 25,
            "StatusTypeID": 50,
            "LevelID": 2,
            "PowerKW": 11,
            "CurrentTypeID": 20
        }
    ],
    "StatusTypeID": 50,
    "DateLastStatusUpdate": "2021-07-12T02:49:00Z",
    "MetadataValues": [
        {
            "ID": 19178,
            "MetadataFieldID": 4,
            "ItemValue": "Data from the German chargepoint registry provided by Bundesnetzagentur.de under the CC-BY 4.0 license"
        }
    ],
    "DataQualityLevel": 3,
    "DateCreated": "2021-07-12T02:49:00Z",
    "SubmissionStatusTypeID": 100
}