{
    "IsRecentlyVerified": false,
    "ID": 9577,
    "UUID": "8E28E97B-C667-4251-BD8F-6AD6481ACBC8",
    "DataProviderID": 15,
    "DataProvidersReference": "15073",
    "OperatorID": 5,
    "AddressInfo": {
        "ID": 9474,
        "Title": "37423 70th St E",
        "AddressLine1": "37423 70th St E",
        "Town": "Palmdale",
        "StateOrProvince": "California",
        "Postcode": "93552",
        "CountryID": 2,
        "Latitude": 34.56362534,
        "Longitude": -118.006546,
        "ContactTelephone1": "(661) 533-9000",
        "RelatedURL": "http://carstations.com/15073",
        "DistanceUnit": 0
    },
    "Connections": [
        {
            "ID": 7285,
            "ConnectionTypeID": 1,
            "Reference": "J1772",
            "LevelID": 2
        },
        {
            "ID": 9048,
            "ConnectionTypeID": 9,
            "Reference": "NEMA5",
            "Quantity": 1
        }
    ],
    "StatusTypeID": 0,
    "DateLastStatusUpdate": "2017-11-04T14:04:00Z",
    "DataQualityLevel": 2,
    "DateCreated": "2012-02-26T15:07:00Z",
    "SubmissionStatusTypeID": 100
}