{
    "IsRecentlyVerified": false,
    "ID": 161806,
    "UUID": "DDD09520-1092-4C93-94F1-FC9ABBB47CC3",
    "DataProviderID": 1,
    "OperatorID": 21,
    "UsageTypeID": 4,
    "UsageCost": "Mobi.E compatible card or App",
    "AddressInfo": {
        "ID": 162163,
        "Title": "VNT-00001",
        "AddressLine1": "Zona Industrial",
        "Town": "Viana do Alentejo",
        "StateOrProvince": "Alentejo",
        "Postcode": "",
        "CountryID": 180,
        "Latitude": 38.330631472103704,
        "Longitude": -7.9958185703665094,
        "DistanceUnit": 0
    },
    "Connections": [
        {
            "ID": 232826,
            "ConnectionTypeID": 25,
            "StatusTypeID": 50,
            "LevelID": 2,
            "Amps": 32,
            "Voltage": 400,
            "PowerKW": 22,
            "CurrentTypeID": 20,
            "Quantity": 2
        }
    ],
    "NumberOfPoints": 2,
    "StatusTypeID": 50,
    "DateLastStatusUpdate": "2021-04-04T10:10:00Z",
    "DataQualityLevel": 1,
    "DateCreated": "2020-07-25T10:53:00Z",
    "SubmissionStatusTypeID": 200
}