{
    "IsRecentlyVerified": false,
    "ID": 130502,
    "UUID": "96E55CC6-165A-4ED9-B024-B23DCCD5D4F2",
    "DataProviderID": 1,
    "OperatorID": 80,
    "UsageTypeID": 4,
    "AddressInfo": {
        "ID": 130848,
        "Title": "Viareggio Tobino | EnelX",
        "AddressLine1": "Viale Mario Tobino",
        "Town": "Viareggio",
        "StateOrProvince": "LU",
        "Postcode": "55049",
        "CountryID": 112,
        "Latitude": 43.8709587497171,
        "Longitude": 10.2674883283462,
        "ContactTelephone1": "800.069.850",
        "RelatedURL": "https://www.enelx.com/it/it/emobility",
        "DistanceUnit": 0
    },
    "Connections": [
        {
            "ID": 182689,
            "ConnectionTypeID": 25,
            "StatusTypeID": 50,
            "LevelID": 2,
            "Amps": 32,
            "Voltage": 400,
            "PowerKW": 22,
            "CurrentTypeID": 20,
            "Quantity": 2
        }
    ],
    "NumberOfPoints": 2,
    "StatusTypeID": 50,
    "DateLastStatusUpdate": "2019-08-06T08:01:00Z",
    "DataQualityLevel": 1,
    "DateCreated": "2019-08-06T08:01:00Z",
    "SubmissionStatusTypeID": 200
}