{
    "UserComments": [
        {
            "ID": 21843,
            "ChargePointID": 134803,
            "CommentTypeID": 10,
            "UserName": "ForumElettrico.it",
            "RelatedURL": "https://www.forumelettrico.it/forum/colonnina-be-charge-22-kw-valsamoggia-bo-via-circonvallazione-nord-96-t8014.html",
            "DateCreated": "2019-11-24T16:11:24.86Z",
            "User": {
                "ID": 11749,
                "Username": "ForumElettrico.it"
            },
            "CheckinStatusTypeID": 10,
            "IsActionedByEditor": false
        }
    ],
    "MediaItems": [
        {
            "ID": 20436,
            "ChargePointID": 134803,
            "ItemURL": "https://s3-ap-southeast-2.amazonaws.com/openchargemap/images/IT/OCM134803/OCM-134803.orig.2019112416113545.jpg",
            "ItemThumbnailURL": "https://s3-ap-southeast-2.amazonaws.com/openchargemap/images/IT/OCM134803/OCM-134803.thmb.2019112416113545.jpg",
            "Comment": "",
            "IsEnabled": true,
            "IsVideo": false,
            "IsFeaturedItem": false,
            "IsExternalResource": false,
            "User": {
                "ID": 11749,
                "Username": "ForumElettrico.it"
            },
            "DateCreated": "2019-11-24T16:12:00Z"
        },
        {
            "ID": 20437,
            "ChargePointID": 134803,
            "ItemURL": "https://s3-ap-southeast-2.amazonaws.com/openchargemap/images/IT/OCM134803/OCM-134803.orig.2019112416114133.jpg",
            "ItemThumbnailURL": "https://s3-ap-southeast-2.amazonaws.com/openchargemap/images/IT/OCM134803/OCM-134803.thmb.2019112416114133.jpg",
            "Comment": "",
            "IsEnabled": true,
            "IsVideo": false,
            "IsFeaturedItem": false,
            "IsExternalResource": false,
            "User": {
                "ID": 11749,
                "Username": "ForumElettrico.it"
            },
            "DateCreated": "2019-11-24T16:12:00Z"
        },
        {
            "ID": 20438,
            "ChargePointID": 134803,
            "ItemURL": "https://s3-ap-southeast-2.amazonaws.com/openchargemap/images/IT/OCM134803/OCM-134803.orig.2019112416114692.jpg",
            "ItemThumbnailURL": "https://s3-ap-southeast-2.amazonaws.com/openchargemap/images/IT/OCM134803/OCM-134803.thmb.2019112416114692.jpg",
            "Comment": "",
            "IsEnabled": true,
            "IsVideo": false,
            "IsFeaturedItem": false,
            "IsExternalResource": false,
            "User": {
                "ID": 11749,
                "Username": "ForumElettrico.it"
            },
            "DateCreated": "2019-11-24T16:12:00Z"
        },
        {
            "ID": 20439,
            "ChargePointID": 134803,
            "ItemURL": "https://s3-ap-southeast-2.amazonaws.com/openchargemap/images/IT/OCM134803/OCM-134803.orig.2019112416115441.jpg",
            "ItemThumbnailURL": "https://s3-ap-southeast-2.amazonaws.com/openchargemap/images/IT/OCM134803/OCM-134803.thmb.2019112416115441.jpg",
            "Comment": "",
            "IsEnabled": true,
            "IsVideo": false,
            "IsFeaturedItem": false,
            "IsExternalResource": false,
            "User": {
                "ID": 11749,
                "Username": "ForumElettrico.it"
            },
            "DateCreated": "2019-11-24T16:12:00Z"
        }
    ],
    "IsRecentlyVerified": false,
    "ID": 134803,
    "UUID": "DF2ED2F3-1A40-40B6-98A4-0ADB0648C8CF",
    "DataProviderID": 1,
    "OperatorID": 3327,
    "UsageTypeID": 1,
    "AddressInfo": {
        "ID": 135149,
        "Title": "Be Charge  Valsamoggia Circonvallazione Nord",
        "AddressLine1": "Via Circonvallazione Nord 96",
        "Town": "Valsamoggia",
        "StateOrProvince": "BO",
        "Postcode": "40053",
        "CountryID": 112,
        "Latitude": 44.506348,
        "Longitude": 11.085109,
        "RelatedURL": "https://www.forumelettrico.it/forum/colonnina-be-charge-22-kw-valsamoggia-bo-via-circonvallazione-nord-96-t8014.html",
        "DistanceUnit": 0
    },
    "Connections": [
        {
            "ID": 188618,
            "ConnectionTypeID": 25,
            "StatusTypeID": 50,
            "LevelID": 2,
            "Amps": 32,
            "Voltage": 400,
            "PowerKW": 22,
            "CurrentTypeID": 20,
            "Quantity": 2
        }
    ],
    "NumberOfPoints": 2,
    "StatusTypeID": 50,
    "DateLastStatusUpdate": "2019-11-25T11:18:00Z",
    "DataQualityLevel": 1,
    "DateCreated": "2019-11-24T16:11:00Z",
    "SubmissionStatusTypeID": 200
}