{
    "IsRecentlyVerified": false,
    "ID": 7750,
    "UUID": "5938DAC8-8248-49BD-98BE-F215BF049F53",
    "DataProviderID": 15,
    "DataProvidersReference": "11080",
    "OperatorID": 5,
    "UsageTypeID": 1,
    "AddressInfo": {
        "ID": 7647,
        "Title": "1601 N Harlem Ave",
        "AddressLine1": "1601 N Harlem Ave",
        "Town": "Chicago",
        "StateOrProvince": "Illinois",
        "Postcode": "60619",
        "CountryID": 2,
        "Latitude": 41.75144958,
        "Longitude": -87.59133148,
        "ContactTelephone1": "",
        "RelatedURL": "http://carstations.com/11080",
        "DistanceUnit": 0
    },
    "Connections": [
        {
            "ID": 5181,
            "ConnectionTypeID": 1,
            "Reference": "J1772",
            "LevelID": 2
        },
        {
            "ID": 6632,
            "ConnectionTypeID": 9,
            "Reference": "NEMA5",
            "Quantity": 1
        }
    ],
    "NumberOfPoints": 1,
    "StatusTypeID": 0,
    "DateLastStatusUpdate": "2017-11-04T14:04:00Z",
    "DataQualityLevel": 1,
    "DateCreated": "2011-11-11T12:05:00Z",
    "SubmissionStatusTypeID": 100
}