{
    "IsRecentlyVerified": false,
    "ID": 122901,
    "UUID": "72937798-C232-40E4-AAF0-2CDF4C4E732E",
    "DataProviderID": 2,
    "DataProvidersReference": "48718",
    "UsageTypeID": 1,
    "AddressInfo": {
        "ID": 123247,
        "Title": "City of Grover Beach - City Hall",
        "AddressLine1": "154 8th St",
        "Town": "Grover Beach",
        "StateOrProvince": "CA",
        "Postcode": "93433",
        "CountryID": 2,
        "Latitude": 35.120895,
        "Longitude": -120.621507,
        "ContactTelephone1": "805-473-4520",
        "AccessComments": "8am-5pm M-F; maximum session time of two hours; see front desk for access",
        "RelatedURL": "",
        "DistanceUnit": 0
    },
    "Connections": [
        {
            "ID": 172829,
            "ConnectionTypeID": 1,
            "LevelID": 2,
            "Amps": 16,
            "Voltage": 230,
            "PowerKW": 3.7,
            "CurrentTypeID": 10,
            "Quantity": 1
        }
    ],
    "DateLastStatusUpdate": "2020-06-26T02:57:00Z",
    "DataQualityLevel": 3,
    "DateCreated": "2019-04-06T05:03:00Z",
    "SubmissionStatusTypeID": 100
}