{
    "IsRecentlyVerified": false,
    "ID": 64686,
    "UUID": "52E7F3F7-CC78-4DB6-AD81-FC6AFD0F720B",
    "DataProviderID": 2,
    "DataProvidersReference": "74040",
    "OperatorID": 39,
    "UsageTypeID": 1,
    "AddressInfo": {
        "ID": 65032,
        "Title": "Denver West Bldg 53",
        "AddressLine1": "13952 Denver West Parkway",
        "Town": "Lakewood",
        "StateOrProvince": "CO",
        "Postcode": "80401",
        "CountryID": 2,
        "Latitude": 39.744610564086,
        "Longitude": -105.15527066746,
        "ContactTelephone1": "800-663-5633",
        "AccessComments": "MO: Not Specified; TU: Not Specified; WE: Not Specified; TH: Not Specified; FR: Not Specified; SA: Not Specified; SU: Not Specified",
        "RelatedURL": "http://www.semacharge.com/",
        "DistanceUnit": 0
    },
    "Connections": [
        {
            "ID": 83131,
            "ConnectionTypeID": 1,
            "LevelID": 2,
            "Amps": 16,
            "Voltage": 230,
            "PowerKW": 3,
            "CurrentTypeID": 10,
            "Quantity": 1
        }
    ],
    "DateLastStatusUpdate": "2019-04-06T05:04:00Z",
    "DataQualityLevel": 3,
    "DateCreated": "2016-03-16T09:07:00Z",
    "SubmissionStatusTypeID": 100
}