{
    "IsRecentlyVerified": false,
    "ID": 125143,
    "UUID": "7F729550-EC11-4482-A7DE-008B39F91208",
    "DataProviderID": 1,
    "OperatorID": 32,
    "OperatorsReference": "4641,4642",
    "UsageTypeID": 4,
    "UsageCost": "£0.108/kWh; for Polar Plus subscription members only",
    "AddressInfo": {
        "ID": 125489,
        "Title": "Intu Lakeside",
        "AddressLine1": "Intu Lakeside",
        "Town": "West Thurrock Way",
        "StateOrProvince": "Essex",
        "Postcode": "RM20 2ZP",
        "CountryID": 1,
        "Latitude": 51.491402,
        "Longitude": 0.2823,
        "DistanceUnit": 0
    },
    "Connections": [
        {
            "ID": 175398,
            "ConnectionTypeID": 25,
            "StatusTypeID": 50,
            "LevelID": 2,
            "Amps": 32,
            "Voltage": 230,
            "PowerKW": 7,
            "CurrentTypeID": 10,
            "Quantity": 4
        }
    ],
    "NumberOfPoints": 4,
    "StatusTypeID": 50,
    "DateLastStatusUpdate": "2019-06-04T05:37:00Z",
    "DataQualityLevel": 1,
    "DateCreated": "2019-04-11T05:20:00Z",
    "SubmissionStatusTypeID": 200
}