{
    "UserComments": [
        {
            "ID": 19456,
            "ChargePointID": 101609,
            "CommentTypeID": 10,
            "UserName": "ForumElettrico.it",
            "RelatedURL": "https://www.forumelettrico.it/forum/colonnina-san-giorgio-su-legnano-t2666.html",
            "DateCreated": "2018-04-23T07:49:20.58Z",
            "User": {
                "ID": 11749,
                "Username": "ForumElettrico.it"
            },
            "CheckinStatusTypeID": 0
        },
        {
            "ID": 19455,
            "ChargePointID": 101609,
            "CommentTypeID": 10,
            "UserName": "ForumElettrico.it",
            "Comment": "https://www.forumelettrico.it/forum/colonnina-san-giorgio-su-legnano-t2666.html\n",
            "DateCreated": "2018-04-23T07:49:01.717Z",
            "User": {
                "ID": 11749,
                "Username": "ForumElettrico.it"
            },
            "CheckinStatusTypeID": 10
        }
    ],
    "MediaItems": [
        {
            "ID": 15328,
            "ChargePointID": 101609,
            "ItemURL": "https://s3-ap-southeast-2.amazonaws.com/openchargemap/images/IT/OCM101609/OCM-101609.orig.2018042307502283.jpg",
            "ItemThumbnailURL": "https://s3-ap-southeast-2.amazonaws.com/openchargemap/images/IT/OCM101609/OCM-101609.thmb.2018042307502283.jpg",
            "Comment": "",
            "IsEnabled": true,
            "IsVideo": false,
            "IsFeaturedItem": false,
            "IsExternalResource": false,
            "User": {
                "ID": 11749,
                "Username": "ForumElettrico.it"
            },
            "DateCreated": "2018-04-23T07:51:00Z"
        },
        {
            "ID": 15329,
            "ChargePointID": 101609,
            "ItemURL": "https://s3-ap-southeast-2.amazonaws.com/openchargemap/images/IT/OCM101609/OCM-101609.orig.2018042307503586.jpg",
            "ItemThumbnailURL": "https://s3-ap-southeast-2.amazonaws.com/openchargemap/images/IT/OCM101609/OCM-101609.thmb.2018042307503586.jpg",
            "Comment": "",
            "IsEnabled": true,
            "IsVideo": false,
            "IsFeaturedItem": false,
            "IsExternalResource": false,
            "User": {
                "ID": 11749,
                "Username": "ForumElettrico.it"
            },
            "DateCreated": "2018-04-23T07:51:00Z"
        },
        {
            "ID": 15330,
            "ChargePointID": 101609,
            "ItemURL": "https://s3-ap-southeast-2.amazonaws.com/openchargemap/images/IT/OCM101609/OCM-101609.orig.2018042307504421.jpg",
            "ItemThumbnailURL": "https://s3-ap-southeast-2.amazonaws.com/openchargemap/images/IT/OCM101609/OCM-101609.thmb.2018042307504421.jpg",
            "Comment": "",
            "IsEnabled": true,
            "IsVideo": false,
            "IsFeaturedItem": false,
            "IsExternalResource": false,
            "User": {
                "ID": 11749,
                "Username": "ForumElettrico.it"
            },
            "DateCreated": "2018-04-23T07:51:00Z"
        },
        {
            "ID": 15325,
            "ChargePointID": 101609,
            "ItemURL": "https://s3-ap-southeast-2.amazonaws.com/openchargemap/images/IT/OCM101609/OCM-101609.orig.2018042307493911.jpg",
            "ItemThumbnailURL": "https://s3-ap-southeast-2.amazonaws.com/openchargemap/images/IT/OCM101609/OCM-101609.thmb.2018042307493911.jpg",
            "Comment": "",
            "IsEnabled": true,
            "IsVideo": false,
            "IsFeaturedItem": false,
            "IsExternalResource": false,
            "User": {
                "ID": 11749,
                "Username": "ForumElettrico.it"
            },
            "DateCreated": "2018-04-23T07:50:00Z"
        },
        {
            "ID": 15326,
            "ChargePointID": 101609,
            "ItemURL": "https://s3-ap-southeast-2.amazonaws.com/openchargemap/images/IT/OCM101609/OCM-101609.orig.2018042307494949.jpg",
            "ItemThumbnailURL": "https://s3-ap-southeast-2.amazonaws.com/openchargemap/images/IT/OCM101609/OCM-101609.thmb.2018042307494949.jpg",
            "Comment": "",
            "IsEnabled": true,
            "IsVideo": false,
            "IsFeaturedItem": false,
            "IsExternalResource": false,
            "User": {
                "ID": 11749,
                "Username": "ForumElettrico.it"
            },
            "DateCreated": "2018-04-23T07:50:00Z"
        },
        {
            "ID": 15327,
            "ChargePointID": 101609,
            "ItemURL": "https://s3-ap-southeast-2.amazonaws.com/openchargemap/images/IT/OCM101609/OCM-101609.orig.2018042307500047.jpg",
            "ItemThumbnailURL": "https://s3-ap-southeast-2.amazonaws.com/openchargemap/images/IT/OCM101609/OCM-101609.thmb.2018042307500047.jpg",
            "Comment": "",
            "IsEnabled": true,
            "IsVideo": false,
            "IsFeaturedItem": false,
            "IsExternalResource": false,
            "User": {
                "ID": 11749,
                "Username": "ForumElettrico.it"
            },
            "DateCreated": "2018-04-23T07:50:00Z"
        }
    ],
    "IsRecentlyVerified": false,
    "ID": 101609,
    "UUID": "C81931F7-999B-4A87-92AA-C2167DAB21C1",
    "DataProviderID": 1,
    "UsageTypeID": 4,
    "AddressInfo": {
        "ID": 101955,
        "Title": "ZapGrid Aldo Moro",
        "AddressLine1": "Via Aldo Moro",
        "Town": "San Giorgio su Legnano",
        "StateOrProvince": "MI",
        "Postcode": "20010",
        "CountryID": 112,
        "Latitude": 45.57097466214838,
        "Longitude": 8.91668864755934,
        "DistanceUnit": 0
    },
    "Connections": [
        {
            "ID": 143440,
            "ConnectionTypeID": 25,
            "StatusTypeID": 50,
            "LevelID": 2,
            "Amps": 32,
            "Voltage": 240,
            "PowerKW": 7,
            "CurrentTypeID": 10,
            "Quantity": 2
        }
    ],
    "NumberOfPoints": 2,
    "GeneralComments": "Si attiva con App ZapGrid",
    "StatusTypeID": 50,
    "DateLastStatusUpdate": "2018-04-23T07:51:00Z",
    "DataQualityLevel": 1,
    "DateCreated": "2018-04-02T17:31:00Z",
    "SubmissionStatusTypeID": 200
}