{
    "IsRecentlyVerified": false,
    "ID": 169025,
    "UUID": "3B7100FE-7F10-453F-A538-8F4B06CDFF7C",
    "DataProviderID": 1,
    "OperatorID": 44,
    "UsageTypeID": 4,
    "UsageCost": "0.15€/kWh",
    "AddressInfo": {
        "ID": 169384,
        "Title": "Innopoli",
        "AddressLine1": "Tekniikantie 14",
        "Town": "Espoo",
        "StateOrProvince": "Southern Finland",
        "Postcode": "02110",
        "CountryID": 79,
        "Latitude": 60.185641193668516,
        "Longitude": 24.81274669046786,
        "DistanceUnit": 0
    },
    "Connections": [
        {
            "ID": 257109,
            "ConnectionTypeID": 25,
            "StatusTypeID": 50,
            "LevelID": 2,
            "Amps": 32,
            "Voltage": 400,
            "PowerKW": 22,
            "CurrentTypeID": 20,
            "Quantity": 8
        }
    ],
    "NumberOfPoints": 8,
    "StatusTypeID": 50,
    "DateLastStatusUpdate": "2020-10-11T20:46:00Z",
    "DataQualityLevel": 1,
    "DateCreated": "2020-10-09T17:45:00Z",
    "SubmissionStatusTypeID": 200
}