{
    "IsRecentlyVerified": false,
    "ID": 167122,
    "UUID": "1678BEAF-95A5-4C92-8F84-7D3AD687A20A",
    "DataProviderID": 1,
    "OperatorID": 1,
    "UsageTypeID": 5,
    "AddressInfo": {
        "ID": 167481,
        "Title": "Lockside Road, Riversway",
        "AddressLine1": "Lockside Road, Riversway",
        "Town": "Preston",
        "Postcode": "PR2 2YS",
        "CountryID": 1,
        "Latitude": 53.760723613821284,
        "Longitude": -2.746551038903931,
        "AccessComments": "",
        "RelatedURL": "http://www.carcharged.co.uk/",
        "DistanceUnit": 0
    },
    "Connections": [
        {
            "ID": 253073,
            "ConnectionTypeID": 25,
            "Reference": "30076",
            "StatusTypeID": 50,
            "LevelID": 2,
            "Amps": 32,
            "Voltage": 400,
            "PowerKW": 7,
            "CurrentTypeID": 10,
            "Quantity": 1
        },
        {
            "ID": 253074,
            "ConnectionTypeID": 25,
            "Reference": "30077",
            "StatusTypeID": 50,
            "LevelID": 2,
            "Amps": 32,
            "Voltage": 400,
            "PowerKW": 7,
            "CurrentTypeID": 10,
            "Quantity": 1
        }
    ],
    "StatusTypeID": 50,
    "DateLastStatusUpdate": "2020-10-10T20:54:00Z",
    "MetadataValues": [
        {
            "ID": 7879,
            "MetadataFieldID": 4,
            "ItemValue": "Contains public sector information licensed under the Open Government Licence v2.0. http://www.nationalarchives.gov.uk/doc/open-government-licence/version/2/"
        }
    ],
    "DataQualityLevel": 3,
    "DateCreated": "2020-08-27T08:10:00Z",
    "SubmissionStatusTypeID": 100
}