{
    "IsRecentlyVerified": false,
    "ID": 105467,
    "UUID": "77D7D23F-99D8-4CD2-B0AF-784BCC8794A4",
    "DataProviderID": 1,
    "OperatorID": 125,
    "UsageTypeID": 4,
    "AddressInfo": {
        "ID": 105813,
        "Title": "Niedersachsendamm",
        "AddressLine1": "Niedersachsendamm 78",
        "Town": "Bremen",
        "StateOrProvince": "Bremen",
        "Postcode": "28201",
        "CountryID": 87,
        "Latitude": 53.05525726023584,
        "Longitude": 8.823535144457992,
        "AccessComments": "24/7 nutzbar",
        "DistanceUnit": 0
    },
    "Connections": [
        {
            "ID": 148644,
            "ConnectionTypeID": 25,
            "StatusTypeID": 50,
            "LevelID": 2,
            "Amps": 32,
            "Voltage": 400,
            "PowerKW": 22,
            "CurrentTypeID": 20,
            "Quantity": 2
        }
    ],
    "NumberOfPoints": 2,
    "StatusTypeID": 50,
    "DateLastStatusUpdate": "2018-06-07T07:38:00Z",
    "DataQualityLevel": 1,
    "DateCreated": "2018-06-07T07:38:00Z",
    "SubmissionStatusTypeID": 200
}