{
    "IsRecentlyVerified": false,
    "ID": 34279,
    "UUID": "66CD1CF6-CDF0-4D1C-9F98-981058E69364",
    "DataProviderID": 26,
    "DataProvidersReference": "47369",
    "OperatorID": 178,
    "OperatorsReference": "EVnetNL AL527",
    "UsageCost": "0.00 jaarabonnement",
    "AddressInfo": {
        "ID": 34625,
        "Title": "Jan Tomstraat",
        "AddressLine1": "Jan Tomstraat",
        "Town": "Krimpenerwaard",
        "Postcode": "2941 CD",
        "CountryID": 159,
        "Latitude": 51.898173,
        "Longitude": 4.69238,
        "ContactTelephone1": "0800-3522365",
        "RelatedURL": "http://www.evnet.nl",
        "DistanceUnit": 0
    },
    "Connections": [
        {
            "ID": 37790,
            "ConnectionTypeID": 25,
            "LevelID": 2,
            "PowerKW": 11,
            "CurrentTypeID": 10
        }
    ],
    "NumberOfPoints": 2,
    "StatusTypeID": 50,
    "DateLastStatusUpdate": "2016-06-04T02:42:00Z",
    "DataQualityLevel": 3,
    "DateCreated": "2015-01-09T06:04:00Z",
    "SubmissionStatusTypeID": 100
}