{
    "IsRecentlyVerified": false,
    "ID": 145132,
    "UUID": "77A6DA02-35B6-41B8-84D0-8B415B970DAC",
    "DataProviderID": 2,
    "DataProvidersReference": "61948",
    "UsageTypeID": 2,
    "AddressInfo": {
        "ID": 145484,
        "Title": "Mount Rainier National Park",
        "AddressLine1": "55210 238th Ave E",
        "Town": "Ashford",
        "StateOrProvince": "WA",
        "Postcode": "98304",
        "CountryID": 2,
        "Latitude": 46.755816,
        "Longitude": -122.120894,
        "ContactTelephone1": "",
        "AccessComments": "",
        "RelatedURL": "",
        "DistanceUnit": 0
    },
    "Connections": [
        {
            "ID": 201739,
            "ConnectionTypeID": 1,
            "LevelID": 2,
            "Amps": 16,
            "Voltage": 230,
            "PowerKW": 3.7,
            "CurrentTypeID": 10,
            "Quantity": 1
        }
    ],
    "StatusTypeID": 50,
    "DateLastStatusUpdate": "2020-06-26T03:10:00Z",
    "DataQualityLevel": 3,
    "DateCreated": "2019-12-24T09:24:00Z",
    "SubmissionStatusTypeID": 100
}