{
    "IsRecentlyVerified": false,
    "ID": 130856,
    "UUID": "4E400A6D-071B-4895-924D-19DFF46C1E21",
    "DataProviderID": 1,
    "OperatorID": 74,
    "UsageTypeID": 1,
    "AddressInfo": {
        "ID": 131202,
        "Title": "Fastned Freiwalde-Bersteland",
        "AddressLine1": "Rickhausen ",
        "Town": "Bersteland",
        "StateOrProvince": "Unterspreewald",
        "Postcode": "15910",
        "CountryID": 87,
        "Latitude": 51.9489700854823,
        "Longitude": 13.7876539621157,
        "DistanceUnit": 0
    },
    "Connections": [
        {
            "ID": 183229,
            "ConnectionTypeID": 33,
            "StatusTypeID": 50,
            "LevelID": 3,
            "PowerKW": 175,
            "CurrentTypeID": 30,
            "Quantity": 1
        },
        {
            "ID": 183349,
            "ConnectionTypeID": 2,
            "StatusTypeID": 50,
            "LevelID": 3,
            "CurrentTypeID": 30,
            "Quantity": 1
        },
        {
            "ID": 183350,
            "ConnectionTypeID": 1036,
            "StatusTypeID": 50,
            "LevelID": 3,
            "Amps": 63,
            "Voltage": 400,
            "PowerKW": 43,
            "CurrentTypeID": 20,
            "Quantity": 1
        },
        {
            "ID": 183351,
            "ConnectionTypeID": 33,
            "StatusTypeID": 50,
            "LevelID": 3,
            "PowerKW": 50,
            "CurrentTypeID": 30,
            "Quantity": 1
        }
    ],
    "NumberOfPoints": 2,
    "StatusTypeID": 50,
    "DateLastStatusUpdate": "2019-09-30T15:26:00Z",
    "DataQualityLevel": 1,
    "DateCreated": "2019-08-21T22:48:00Z",
    "SubmissionStatusTypeID": 200
}