{
    "IsRecentlyVerified": false,
    "ID": 174349,
    "UUID": "7D35F3AF-F427-4948-B750-393F74DAC4FC",
    "DataProviderID": 1,
    "OperatorID": 1,
    "UsageTypeID": 6,
    "UsageCost": "Free",
    "AddressInfo": {
        "ID": 174708,
        "Title": "Auski Tourist Village",
        "AddressLine1": "Auski Tourist Village",
        "Town": "",
        "StateOrProvince": "Western Australia",
        "Postcode": "",
        "CountryID": 18,
        "Latitude": -22.376952822011987,
        "Longitude": 118.69077381915235,
        "ContactTelephone1": "+61 91766988",
        "AccessComments": "Requires 10 meter 3 phase extension cable to connect. ",
        "DistanceUnit": 0
    },
    "Connections": [
        {
            "ID": 269934,
            "ConnectionTypeID": 1041,
            "StatusTypeID": 50,
            "LevelID": 2,
            "PowerKW": 11,
            "CurrentTypeID": 20,
            "Quantity": 1,
            "Comments": "Requires 10 meter 3 phase extension cable to connect. "
        }
    ],
    "NumberOfPoints": 1,
    "StatusTypeID": 50,
    "DateLastStatusUpdate": "2021-03-24T17:53:00Z",
    "DataQualityLevel": 1,
    "DateCreated": "2021-03-24T15:35:00Z",
    "SubmissionStatusTypeID": 200
}