{
    "IsRecentlyVerified": false,
    "ID": 152907,
    "UUID": "9D66B7CB-DAF1-4D33-AB9E-8B1EFAE588EF",
    "DataProviderID": 28,
    "DataProvidersReference": "FR*S70*P07019831",
    "UsageTypeID": 5,
    "AddressInfo": {
        "ID": 153260,
        "Title": "Mairie",
        "AddressLine1": "\"1 Rue Georges Mongin 70180 Dampierre-sur-Salon\"",
        "CountryID": 80,
        "Latitude": 47.556874,
        "Longitude": 5.677711,
        "AccessComments": "accessible 24h/24 - 7j/7",
        "DistanceUnit": 0
    },
    "Connections": [
        {
            "ID": 214275,
            "ConnectionTypeID": 1036,
            "StatusTypeID": 50,
            "LevelID": 2,
            "PowerKW": 22,
            "CurrentTypeID": 20
        },
        {
            "ID": 247530,
            "ConnectionTypeID": 1036,
            "StatusTypeID": 50,
            "LevelID": 2,
            "PowerKW": 22,
            "CurrentTypeID": 20
        }
    ],
    "GeneralComments": "recharge normale et acceleree accessible par application smartphone/internet et badge - informations site web freshmile.fr",
    "StatusTypeID": 50,
    "DateLastStatusUpdate": "2020-08-27T05:13:00Z",
    "DataQualityLevel": 2,
    "DateCreated": "2020-03-15T10:54:00Z",
    "SubmissionStatusTypeID": 100
}