{
    "IsRecentlyVerified": false,
    "ID": 93757,
    "UUID": "7AAC2812-0924-462F-B4C8-6E716FD28D42",
    "DataProviderID": 1,
    "OperatorID": 23,
    "OperatorsReference": "36128",
    "UsageTypeID": 4,
    "AddressInfo": {
        "ID": 94103,
        "Title": "Holiday Inn Metairie New Orleans Airport",
        "AddressLine1": "2261 N Causeway BLVD",
        "Town": "Metairie",
        "StateOrProvince": "Louisana",
        "Postcode": "70001",
        "CountryID": 2,
        "Latitude": 29.9935545,
        "Longitude": -90.1545549,
        "ContactTelephone1": "(504) 373-5946",
        "DistanceUnit": 0
    },
    "Connections": [
        {
            "ID": 132739,
            "ConnectionTypeID": 30,
            "StatusTypeID": 50,
            "LevelID": 2,
            "PowerKW": 16,
            "CurrentTypeID": 20,
            "Quantity": 4
        }
    ],
    "NumberOfPoints": 4,
    "GeneralComments": "4 Tesla Connectors, up to 16kW.Available for customers. Please see front desk.",
    "StatusTypeID": 50,
    "DateLastStatusUpdate": "2017-10-08T05:31:00Z",
    "DataQualityLevel": 1,
    "DateCreated": "2017-10-08T05:31:00Z",
    "SubmissionStatusTypeID": 200
}