{
    "IsRecentlyVerified": false,
    "ID": 151968,
    "UUID": "7B11C398-4D3A-49CA-B326-5C6895119EDD",
    "DataProviderID": 28,
    "DataProvidersReference": "FR*S86*PSORE*B080",
    "UsageTypeID": 5,
    "AddressInfo": {
        "ID": 152321,
        "Title": "B080",
        "AddressLine1": "Place du champs de foire - 86460 - Pressac",
        "CountryID": 80,
        "Latitude": 46.11511,
        "Longitude": 0.57314,
        "AccessComments": "24/24 7/7 jours",
        "DistanceUnit": 0
    },
    "Connections": [
        {
            "ID": 212520,
            "ConnectionTypeID": 28,
            "StatusTypeID": 50,
            "LevelID": 2,
            "PowerKW": 18,
            "CurrentTypeID": 10
        },
        {
            "ID": 212521,
            "ConnectionTypeID": 25,
            "StatusTypeID": 50,
            "LevelID": 2,
            "PowerKW": 18,
            "CurrentTypeID": 20
        },
        {
            "ID": 245351,
            "ConnectionTypeID": 28,
            "StatusTypeID": 50,
            "LevelID": 2,
            "PowerKW": 18,
            "CurrentTypeID": 10
        },
        {
            "ID": 245352,
            "ConnectionTypeID": 25,
            "StatusTypeID": 50,
            "LevelID": 2,
            "PowerKW": 18,
            "CurrentTypeID": 20
        }
    ],
    "GeneralComments": "",
    "StatusTypeID": 50,
    "DateLastStatusUpdate": "2020-08-27T05:12:00Z",
    "DataQualityLevel": 2,
    "DateCreated": "2020-03-15T10:53:00Z",
    "SubmissionStatusTypeID": 100
}