{
    "IsRecentlyVerified": false,
    "ID": 160572,
    "UUID": "47C95ADD-F726-49CD-9450-4B516AAD21D0",
    "DataProviderID": 2,
    "DataProvidersReference": "152271",
    "OperatorID": 9,
    "UsageTypeID": 1,
    "AddressInfo": {
        "ID": 160929,
        "Title": "King County Housing Authority - Green Bridge",
        "AddressLine1": "9800 8th Avenue SW",
        "Town": "Seattle",
        "StateOrProvince": "WA",
        "Postcode": "98106",
        "CountryID": 2,
        "Latitude": 47.515629999,
        "Longitude": -122.34467,
        "ContactTelephone1": "888-998-2546",
        "AccessComments": "MON: 24 hours | TUE: 24 hours | WED: 24 hours | THU: 24 hours | FRI: 24 hours | SAT: 24 hours | SUN: 24 hours",
        "RelatedURL": "http://www.blinkcharging.com/",
        "DistanceUnit": 0
    },
    "Connections": [
        {
            "ID": 231045,
            "ConnectionTypeID": 1,
            "LevelID": 2,
            "Amps": 16,
            "Voltage": 230,
            "PowerKW": 3.7,
            "CurrentTypeID": 10,
            "Quantity": 1
        }
    ],
    "StatusTypeID": 50,
    "DateLastStatusUpdate": "2020-06-26T03:10:00Z",
    "DataQualityLevel": 3,
    "DateCreated": "2020-06-26T03:10:00Z",
    "SubmissionStatusTypeID": 100
}