{
    "IsRecentlyVerified": false,
    "ID": 75603,
    "UUID": "7B7768AF-CCF3-4CD3-A38B-D8BA99F4F64F",
    "DataProviderID": 1,
    "OperatorID": 142,
    "OperatorsReference": "3345176",
    "UsageTypeID": 4,
    "AddressInfo": {
        "ID": 75949,
        "Title": "Wipark Garage Hauptbahnhof Wien",
        "AddressLine1": "Gerhard-Bronner-Straße 2",
        "Town": "Wien",
        "Postcode": "1100",
        "CountryID": 19,
        "Latitude": 48.183895,
        "Longitude": 16.378735,
        "AccessComments": "Details zum Elektrotankstellenort: Abfahrt Tiefgarage",
        "DistanceUnit": 0
    },
    "Connections": [
        {
            "ID": 109003,
            "ConnectionTypeID": 25,
            "StatusTypeID": 50,
            "LevelID": 2,
            "Amps": 16,
            "Voltage": 400,
            "PowerKW": 11,
            "CurrentTypeID": 20,
            "Quantity": 8
        },
        {
            "ID": 109004,
            "ConnectionTypeID": 28,
            "StatusTypeID": 50,
            "LevelID": 2,
            "Amps": 16,
            "Voltage": 230,
            "PowerKW": 4,
            "CurrentTypeID": 10,
            "Quantity": 5
        }
    ],
    "NumberOfPoints": 8,
    "GeneralComments": "Wien Energie Tanke-Karte; WienMobil-Karte; BMW i-ChargeNow-Karte; intercharge-App",
    "StatusTypeID": 50,
    "DateLastStatusUpdate": "2016-12-16T19:58:00Z",
    "DataQualityLevel": 1,
    "DateCreated": "2016-12-16T19:58:00Z",
    "SubmissionStatusTypeID": 200
}