{
    "IsRecentlyVerified": false,
    "ID": 139954,
    "UUID": "6714EC2F-F1A8-44B7-876C-C72E995972B8",
    "DataProviderID": 2,
    "DataProvidersReference": "149508",
    "OperatorID": 5,
    "UsageTypeID": 1,
    "AddressInfo": {
        "ID": 140306,
        "Title": "BWP EV CHARGE",
        "AddressLine1": "520 N Glenoaks Blvd",
        "Town": "Burbank",
        "StateOrProvince": "CA",
        "Postcode": "91502",
        "CountryID": 2,
        "Latitude": 34.1864261,
        "Longitude": -118.310496,
        "ContactTelephone1": "888-758-4389",
        "AccessComments": "24 hours daily",
        "RelatedURL": "http://www.chargepoint.com/",
        "DistanceUnit": 0
    },
    "Connections": [
        {
            "ID": 195462,
            "ConnectionTypeID": 1,
            "LevelID": 2,
            "Amps": 16,
            "Voltage": 230,
            "PowerKW": 3,
            "CurrentTypeID": 10,
            "Quantity": 2
        }
    ],
    "StatusTypeID": 50,
    "DateLastStatusUpdate": "2019-12-24T09:11:00Z",
    "DataQualityLevel": 3,
    "DateCreated": "2019-12-24T09:11:00Z",
    "SubmissionStatusTypeID": 100
}