{
    "IsRecentlyVerified": false,
    "ID": 103277,
    "UUID": "234D0ADC-B6E4-4F6E-B835-1834E8AF08F4",
    "DataProviderID": 1,
    "OperatorID": 25,
    "OperatorsReference": "islington-gaskinstreet",
    "UsageTypeID": 4,
    "UsageCost": "£0.036/minute; min £0.72",
    "AddressInfo": {
        "ID": 103623,
        "Title": "Gaskin Street",
        "AddressLine1": "18 Gaskin Street",
        "Town": "London",
        "Postcode": "N1 2RY",
        "CountryID": 1,
        "Latitude": 51.537406,
        "Longitude": -0.101446,
        "DistanceUnit": 0
    },
    "Connections": [
        {
            "ID": 145913,
            "ConnectionTypeID": 25,
            "StatusTypeID": 150,
            "LevelID": 2,
            "Amps": 32,
            "Voltage": 230,
            "PowerKW": 7,
            "CurrentTypeID": 10,
            "Quantity": 1
        },
        {
            "ID": 145914,
            "ConnectionTypeID": 1,
            "StatusTypeID": 150,
            "LevelID": 2,
            "Amps": 16,
            "Voltage": 230,
            "PowerKW": 4,
            "CurrentTypeID": 10,
            "Quantity": 1
        }
    ],
    "NumberOfPoints": 1,
    "StatusTypeID": 150,
    "DateLastStatusUpdate": "2018-04-26T05:41:00Z",
    "DataQualityLevel": 1,
    "DateCreated": "2018-04-26T05:41:00Z",
    "SubmissionStatusTypeID": 200
}