{
    "IsRecentlyVerified": false,
    "ID": 153332,
    "UUID": "16C54693-9040-4375-AA00-35242F5FB14C",
    "DataProviderID": 28,
    "DataProvidersReference": "FR*S89*P89075*A",
    "UsageTypeID": 5,
    "AddressInfo": {
        "ID": 153685,
        "Title": "CHAMPLAY_50 Grande Rue",
        "AddressLine1": "50 Grande Rue 89300 CHAMPLAY",
        "CountryID": 80,
        "Latitude": 47.95138447,
        "Longitude": 3.43990356,
        "AccessComments": "24/24 7/7 jours",
        "DistanceUnit": 0
    },
    "Connections": [
        {
            "ID": 215057,
            "ConnectionTypeID": 28,
            "StatusTypeID": 50,
            "LevelID": 2,
            "PowerKW": 22,
            "CurrentTypeID": 10
        },
        {
            "ID": 215058,
            "ConnectionTypeID": 1036,
            "StatusTypeID": 50,
            "LevelID": 2,
            "PowerKW": 22,
            "CurrentTypeID": 20
        },
        {
            "ID": 248446,
            "ConnectionTypeID": 28,
            "StatusTypeID": 50,
            "LevelID": 2,
            "PowerKW": 22,
            "CurrentTypeID": 10
        },
        {
            "ID": 248447,
            "ConnectionTypeID": 1036,
            "StatusTypeID": 50,
            "LevelID": 2,
            "PowerKW": 22,
            "CurrentTypeID": 20
        }
    ],
    "GeneralComments": "",
    "StatusTypeID": 50,
    "DateLastStatusUpdate": "2020-08-27T05:14:00Z",
    "DataQualityLevel": 2,
    "DateCreated": "2020-03-15T10:54:00Z",
    "SubmissionStatusTypeID": 100
}