{
    "IsRecentlyVerified": false,
    "ID": 159387,
    "UUID": "B58541CA-23C5-45A7-9CED-8630AAEB5A68",
    "DataProviderID": 2,
    "DataProvidersReference": "154531",
    "OperatorID": 5,
    "UsageTypeID": 1,
    "AddressInfo": {
        "ID": 159744,
        "Title": "HIGHS",
        "AddressLine1": "2861 Jessup Rd",
        "Town": "Jessup",
        "StateOrProvince": "MD",
        "Postcode": "20794",
        "CountryID": 2,
        "Latitude": 39.142555,
        "Longitude": -76.762934,
        "ContactTelephone1": "888-758-4389",
        "AccessComments": "24 hours daily",
        "RelatedURL": "http://www.chargepoint.com/",
        "DistanceUnit": 0
    },
    "Connections": [
        {
            "ID": 229550,
            "ConnectionTypeID": 2,
            "LevelID": 3,
            "Amps": 100,
            "Voltage": 400,
            "PowerKW": 40,
            "CurrentTypeID": 30,
            "Quantity": 1
        },
        {
            "ID": 229551,
            "ConnectionTypeID": 32,
            "LevelID": 3,
            "Amps": 100,
            "Voltage": 400,
            "PowerKW": 40,
            "CurrentTypeID": 30,
            "Quantity": 1
        }
    ],
    "StatusTypeID": 50,
    "DateLastStatusUpdate": "2020-06-26T03:01:00Z",
    "DataQualityLevel": 3,
    "DateCreated": "2020-06-26T03:01:00Z",
    "SubmissionStatusTypeID": 100
}