{
    "MediaItems": [
        {
            "ID": 17944,
            "ChargePointID": 121454,
            "ItemURL": "https://s3-ap-southeast-2.amazonaws.com/openchargemap/images/IT/OCM121454/OCM-121454.orig.2019040215340955.jpg",
            "ItemThumbnailURL": "https://s3-ap-southeast-2.amazonaws.com/openchargemap/images/IT/OCM121454/OCM-121454.thmb.2019040215340955.jpg",
            "Comment": "",
            "IsEnabled": true,
            "IsVideo": false,
            "IsFeaturedItem": false,
            "IsExternalResource": false,
            "User": {
                "ID": 19496,
                "Username": "ECOGY"
            },
            "DateCreated": "2019-04-02T15:34:00Z"
        }
    ],
    "IsRecentlyVerified": false,
    "ID": 121454,
    "UUID": "49896547-918D-4A65-826B-65343A3C951F",
    "DataProviderID": 1,
    "OperatorID": 45,
    "UsageTypeID": 4,
    "UsageCost": "0,30 Euro / kWh",
    "AddressInfo": {
        "ID": 121800,
        "Title": "Appartmenthotel Matscher****",
        "AddressLine1": "Turmbachweg 33",
        "Town": "Eppan",
        "StateOrProvince": "BZ",
        "Postcode": "39057 ",
        "CountryID": 112,
        "Latitude": 46.45594665,
        "Longitude": 11.2420131743347,
        "ContactTelephone1": " +39 0471 664014",
        "ContactEmail": "info@ferien-suedtirol.com",
        "AccessComments": "Für Hotelkunden mittels RFID Karte",
        "RelatedURL": "https://www.ferien-suedtirol.com",
        "DistanceUnit": 0
    },
    "Connections": [
        {
            "ID": 171124,
            "ConnectionTypeID": 25,
            "StatusTypeID": 50,
            "LevelID": 2,
            "Amps": 10,
            "Voltage": 400,
            "PowerKW": 7,
            "CurrentTypeID": 20,
            "Quantity": 1
        }
    ],
    "NumberOfPoints": 1,
    "GeneralComments": "Die Ladestation befindet sich auf dem Kunden Parkplatz",
    "StatusTypeID": 50,
    "DateLastStatusUpdate": "2019-05-10T14:15:00Z",
    "DataQualityLevel": 1,
    "DateCreated": "2019-04-02T15:33:00Z",
    "SubmissionStatusTypeID": 200
}