{
    "IsRecentlyVerified": false,
    "ID": 29401,
    "UUID": "ECBFF208-8183-41F3-BAD3-6BCE96D41936",
    "DataProviderID": 2,
    "DataProvidersReference": "44161",
    "UsageTypeID": 2,
    "AddressInfo": {
        "ID": 29747,
        "Title": "City of Seattle - Seattle City Light South Service Center",
        "AddressLine1": "225 S Spokane St",
        "Town": "Seattle",
        "StateOrProvince": "WA",
        "Postcode": "98134",
        "CountryID": 2,
        "Latitude": 47.571399,
        "Longitude": -122.330911,
        "ContactTelephone1": "",
        "AccessComments": "",
        "RelatedURL": "",
        "DistanceUnit": 0
    },
    "Connections": [
        {
            "ID": 32333,
            "ConnectionTypeID": 1,
            "LevelID": 2,
            "Amps": 16,
            "Voltage": 230,
            "PowerKW": 3.7,
            "CurrentTypeID": 10,
            "Quantity": 4
        }
    ],
    "DateLastStatusUpdate": "2020-06-26T03:11:00Z",
    "DataQualityLevel": 3,
    "DateCreated": "2014-11-28T03:39:00Z",
    "SubmissionStatusTypeID": 100
}