{
    "IsRecentlyVerified": false,
    "ID": 52916,
    "UUID": "5F432BE9-AC8F-48A0-85A8-71A4BD2282DC",
    "DataProviderID": 1,
    "OperatorID": 32,
    "OperatorsReference": "778,742",
    "UsageTypeID": 4,
    "UsageCost": "£0.108/kWh; for Polar Plus subscription members only. £1.70 per hour for type 2. Parking fees apply",
    "AddressInfo": {
        "ID": 53262,
        "Title": "NCP Rupert Street",
        "AddressLine1": "Rupert Street",
        "Town": "Bristol",
        "Postcode": "BS1 2PY",
        "CountryID": 1,
        "Latitude": 51.456799,
        "Longitude": -2.59366,
        "DistanceUnit": 0
    },
    "Connections": [
        {
            "ID": 65867,
            "ConnectionTypeID": 3,
            "StatusTypeID": 50,
            "LevelID": 2,
            "Amps": 13,
            "Voltage": 230,
            "PowerKW": 3,
            "CurrentTypeID": 10,
            "Quantity": 2
        },
        {
            "ID": 65868,
            "ConnectionTypeID": 25,
            "StatusTypeID": 50,
            "LevelID": 2,
            "Amps": 32,
            "Voltage": 230,
            "PowerKW": 7,
            "CurrentTypeID": 10,
            "Quantity": 2
        }
    ],
    "NumberOfPoints": 4,
    "StatusTypeID": 50,
    "DateLastStatusUpdate": "2019-03-05T06:22:00Z",
    "DataQualityLevel": 1,
    "DateCreated": "2015-09-14T07:26:00Z",
    "SubmissionStatusTypeID": 200
}