{
    "IsRecentlyVerified": false,
    "ID": 182924,
    "UUID": "F3793A61-4570-4181-A2C0-0CF78D5B8329",
    "DataProviderID": 29,
    "DataProvidersReference": "18502",
    "OperatorID": 103,
    "AddressInfo": {
        "ID": 183283,
        "Title": "Dreiringplatz 1",
        "AddressLine1": "Dreiringplatz 1",
        "Town": "Essen",
        "Postcode": "45276",
        "CountryID": 87,
        "Latitude": 51.446936,
        "Longitude": 7.07988,
        "DistanceUnit": 0
    },
    "Connections": [
        {
            "ID": 289269,
            "ConnectionTypeID": 25,
            "StatusTypeID": 50,
            "LevelID": 2,
            "PowerKW": 22,
            "CurrentTypeID": 20
        },
        {
            "ID": 289270,
            "ConnectionTypeID": 25,
            "StatusTypeID": 50,
            "LevelID": 2,
            "PowerKW": 22,
            "CurrentTypeID": 20
        }
    ],
    "StatusTypeID": 50,
    "DateLastStatusUpdate": "2021-07-09T03:23:00Z",
    "MetadataValues": [
        {
            "ID": 15217,
            "MetadataFieldID": 4,
            "ItemValue": "Data from the German chargepoint registry provided by Bundesnetzagentur.de under the CC-BY 4.0 license"
        }
    ],
    "DataQualityLevel": 3,
    "DateCreated": "2021-07-08T10:03:00Z",
    "SubmissionStatusTypeID": 100
}