{
    "IsRecentlyVerified": false,
    "ID": 14924,
    "UUID": "ED4C4DEE-BD9E-4970-BB20-A587161F643D",
    "DataProviderID": 1,
    "OperatorID": 22,
    "OperatorsReference": "C9PQM",
    "UsageTypeID": 4,
    "UsageCost": "Free",
    "AddressInfo": {
        "ID": 15270,
        "Title": "Supervalu",
        "AddressLine1": "Courthouse Road",
        "AddressLine2": "Fermoy",
        "Town": "Cork",
        "StateOrProvince": "County Cork",
        "CountryID": 3,
        "Latitude": 52.13766,
        "Longitude": -8.266641,
        "DistanceUnit": 0
    },
    "Connections": [
        {
            "ID": 13324,
            "ConnectionTypeID": 25,
            "StatusTypeID": 50,
            "LevelID": 2,
            "Amps": 32,
            "Voltage": 400,
            "PowerKW": 22,
            "CurrentTypeID": 20,
            "Quantity": 2
        },
        {
            "ID": 26605,
            "ConnectionTypeID": 2,
            "StatusTypeID": 50,
            "LevelID": 3,
            "Amps": 120,
            "Voltage": 500,
            "PowerKW": 50,
            "CurrentTypeID": 30,
            "Quantity": 1
        },
        {
            "ID": 28102,
            "ConnectionTypeID": 33,
            "StatusTypeID": 50,
            "LevelID": 3,
            "Amps": 120,
            "Voltage": 500,
            "PowerKW": 50,
            "CurrentTypeID": 30,
            "Quantity": 1
        },
        {
            "ID": 28103,
            "ConnectionTypeID": 1036,
            "StatusTypeID": 50,
            "LevelID": 2,
            "Voltage": 230,
            "PowerKW": 43,
            "CurrentTypeID": 10,
            "Quantity": 1
        }
    ],
    "NumberOfPoints": 4,
    "GeneralComments": "efacec QC45",
    "StatusTypeID": 50,
    "DateLastStatusUpdate": "2019-06-03T09:38:00Z",
    "DataQualityLevel": 2,
    "DateCreated": "2012-12-11T15:08:00Z",
    "SubmissionStatusTypeID": 100
}