{
    "IsRecentlyVerified": false,
    "ID": 175864,
    "UUID": "7E6CCFA1-1110-4A26-977C-0BEA3206234A",
    "DataProviderID": 1,
    "OperatorID": 3390,
    "UsageTypeID": 4,
    "UsageCost": "6.49 UAH / kWh",
    "AddressInfo": {
        "ID": 176223,
        "Title": "Ionity #555",
        "AddressLine1": "Boryspilske Road",
        "Town": "Kyiv",
        "StateOrProvince": "",
        "Postcode": "02093",
        "CountryID": 234,
        "Latitude": 50.40164539164047,
        "Longitude": 30.69290644974194,
        "DistanceUnit": 0
    },
    "Connections": [
        {
            "ID": 273097,
            "ConnectionTypeID": 2,
            "StatusTypeID": 50,
            "Quantity": 1
        },
        {
            "ID": 273098,
            "ConnectionTypeID": 1036,
            "StatusTypeID": 50,
            "Quantity": 1
        },
        {
            "ID": 273099,
            "ConnectionTypeID": 1,
            "StatusTypeID": 50,
            "Quantity": 1
        }
    ],
    "NumberOfPoints": 1,
    "StatusTypeID": 50,
    "DateLastStatusUpdate": "2021-06-19T19:23:00Z",
    "DataQualityLevel": 1,
    "DateCreated": "2021-06-16T19:21:00Z",
    "SubmissionStatusTypeID": 200
}