{
    "MediaItems": [
        {
            "ID": 1781,
            "ChargePointID": 49235,
            "ItemURL": "https://s3-ap-southeast-2.amazonaws.com/openchargemap/images/NL/OCM49235/OCM-49235.orig.2015071419370512.jpg",
            "ItemThumbnailURL": "https://s3-ap-southeast-2.amazonaws.com/openchargemap/images/NL/OCM49235/OCM-49235.thmb.2015071419370512.jpg",
            "Comment": "",
            "IsEnabled": true,
            "IsVideo": false,
            "IsFeaturedItem": false,
            "IsExternalResource": false,
            "User": {
                "ID": 5002,
                "Username": "Matthijs Van der Bogt"
            },
            "DateCreated": "2015-07-14T19:37:00Z"
        },
        {
            "ID": 1779,
            "ChargePointID": 49235,
            "ItemURL": "https://s3-ap-southeast-2.amazonaws.com/openchargemap/images/NL/OCM49235/OCM-49235.orig.2015071419352952.jpg",
            "ItemThumbnailURL": "https://s3-ap-southeast-2.amazonaws.com/openchargemap/images/NL/OCM49235/OCM-49235.thmb.2015071419352952.jpg",
            "Comment": "",
            "IsEnabled": true,
            "IsVideo": false,
            "IsFeaturedItem": false,
            "IsExternalResource": false,
            "User": {
                "ID": 5002,
                "Username": "Matthijs Van der Bogt"
            },
            "DateCreated": "2015-07-14T19:36:00Z"
        },
        {
            "ID": 1780,
            "ChargePointID": 49235,
            "ItemURL": "https://s3-ap-southeast-2.amazonaws.com/openchargemap/images/NL/OCM49235/OCM-49235.orig.2015071419360570.jpg",
            "ItemThumbnailURL": "https://s3-ap-southeast-2.amazonaws.com/openchargemap/images/NL/OCM49235/OCM-49235.thmb.2015071419360570.jpg",
            "Comment": "",
            "IsEnabled": true,
            "IsVideo": false,
            "IsFeaturedItem": false,
            "IsExternalResource": false,
            "User": {
                "ID": 5002,
                "Username": "Matthijs Van der Bogt"
            },
            "DateCreated": "2015-07-14T19:36:00Z"
        },
        {
            "ID": 1778,
            "ChargePointID": 49235,
            "ItemURL": "https://s3-ap-southeast-2.amazonaws.com/openchargemap/images/NL/OCM49235/OCM-49235.orig.2015071419345891.jpg",
            "ItemThumbnailURL": "https://s3-ap-southeast-2.amazonaws.com/openchargemap/images/NL/OCM49235/OCM-49235.thmb.2015071419345891.jpg",
            "Comment": "",
            "IsEnabled": true,
            "IsVideo": false,
            "IsFeaturedItem": false,
            "IsExternalResource": false,
            "User": {
                "ID": 5002,
                "Username": "Matthijs Van der Bogt"
            },
            "DateCreated": "2015-07-14T19:35:00Z"
        }
    ],
    "IsRecentlyVerified": false,
    "ID": 49235,
    "UUID": "EF27F2C8-9BAC-4682-A806-8AE569A595C2",
    "DataProviderID": 1,
    "OperatorID": 73,
    "UsageTypeID": 6,
    "AddressInfo": {
        "ID": 49581,
        "Title": "Flevolaan 25",
        "AddressLine1": "Flevolaan 25",
        "Town": "Weesp",
        "StateOrProvince": "Noord Holland",
        "Postcode": "1382JX",
        "CountryID": 159,
        "Latitude": 52.3162783,
        "Longitude": 5.02098950000004,
        "AccessComments": "Available after business hours. Notice required.",
        "RelatedURL": "http://www.ev-box.com",
        "DistanceUnit": 0
    },
    "Connections": [
        {
            "ID": 60860,
            "ConnectionTypeID": 25,
            "StatusTypeID": 75,
            "LevelID": 2,
            "PowerKW": 11,
            "CurrentTypeID": 20,
            "Quantity": 2
        }
    ],
    "NumberOfPoints": 1,
    "StatusTypeID": 50,
    "DateLastStatusUpdate": "2015-07-15T18:01:00Z",
    "DataQualityLevel": 1,
    "DateCreated": "2015-07-14T19:33:00Z",
    "SubmissionStatusTypeID": 200
}