{
    "IsRecentlyVerified": false,
    "ID": 158414,
    "UUID": "F2B43ED3-20ED-40EB-9365-5BFA63818095",
    "DataProviderID": 2,
    "DataProvidersReference": "155040",
    "OperatorID": 3372,
    "UsageTypeID": 1,
    "AddressInfo": {
        "ID": 158771,
        "Title": "Dentt Development",
        "AddressLine1": "1830 N Marshall Ave",
        "Town": "El Cajon",
        "StateOrProvince": "CA",
        "Postcode": "92020",
        "CountryID": 2,
        "Latitude": 32.8192768,
        "Longitude": -116.9758753,
        "ContactTelephone1": "866-816-7584",
        "AccessComments": "24 hours daily; Also accepts Paypal",
        "RelatedURL": "http://evconnect.com/",
        "DistanceUnit": 0
    },
    "Connections": [
        {
            "ID": 228392,
            "ConnectionTypeID": 1,
            "LevelID": 2,
            "Amps": 16,
            "Voltage": 230,
            "PowerKW": 3.7,
            "CurrentTypeID": 10,
            "Quantity": 2
        }
    ],
    "StatusTypeID": 50,
    "DateLastStatusUpdate": "2020-06-26T02:55:00Z",
    "DataQualityLevel": 3,
    "DateCreated": "2020-06-26T02:55:00Z",
    "SubmissionStatusTypeID": 100
}