{
    "IsRecentlyVerified": false,
    "ID": 158712,
    "UUID": "F84797B6-7FD8-4AE2-8086-FB2FE83EFE2F",
    "DataProviderID": 2,
    "DataProvidersReference": "154112",
    "OperatorID": 89,
    "UsageTypeID": 1,
    "AddressInfo": {
        "ID": 159069,
        "Title": "5931 W 18th St",
        "AddressLine1": "5931 W 18th St",
        "Town": "Los Angeles",
        "StateOrProvince": "CA",
        "Postcode": "90035",
        "CountryID": 2,
        "Latitude": 34.044085,
        "Longitude": -118.371544,
        "ContactTelephone1": "888-356-8911",
        "AccessComments": "24 hours daily",
        "RelatedURL": "https://flo.ca/",
        "DistanceUnit": 0
    },
    "Connections": [
        {
            "ID": 228736,
            "ConnectionTypeID": 1,
            "LevelID": 2,
            "Amps": 16,
            "Voltage": 230,
            "PowerKW": 3.7,
            "CurrentTypeID": 10,
            "Quantity": 1
        }
    ],
    "StatusTypeID": 50,
    "DateLastStatusUpdate": "2020-06-26T02:56:00Z",
    "DataQualityLevel": 3,
    "DateCreated": "2020-06-26T02:56:00Z",
    "SubmissionStatusTypeID": 100
}