{
    "IsRecentlyVerified": false,
    "ID": 112229,
    "UUID": "CBF18DF6-3858-460F-A11F-87E7A40951FA",
    "DataProviderID": 2,
    "DataProvidersReference": "83934",
    "UsageTypeID": 1,
    "AddressInfo": {
        "ID": 112575,
        "Title": "Peavey Mart",
        "AddressLine1": "7700 99 Ave",
        "Town": "Peace River",
        "StateOrProvince": "AB",
        "Postcode": "T8S 2A2",
        "CountryID": 44,
        "Latitude": 56.23328996,
        "Longitude": -117.31552805,
        "ContactTelephone1": "780-624-1520",
        "AccessComments": "24 hours daily",
        "RelatedURL": "",
        "DistanceUnit": 0
    },
    "Connections": [
        {
            "ID": 157782,
            "ConnectionTypeID": 1,
            "LevelID": 2,
            "Amps": 16,
            "Voltage": 230,
            "PowerKW": 3.7,
            "CurrentTypeID": 10,
            "Quantity": 1
        }
    ],
    "DateLastStatusUpdate": "2020-06-26T03:12:00Z",
    "DataQualityLevel": 3,
    "DateCreated": "2018-10-18T23:37:00Z",
    "SubmissionStatusTypeID": 100
}