{
    "IsRecentlyVerified": false,
    "ID": 84356,
    "UUID": "B9E2710C-8B65-4BA0-8897-78C1DC19824B",
    "DataProviderID": 1,
    "OperatorID": 220,
    "OperatorsReference": "3794,3794,3795",
    "UsageTypeID": 4,
    "UsageCost": "€1.73 + €0.3213/kWh; Andere Tarife möglich",
    "AddressInfo": {
        "ID": 84702,
        "Title": "Einkaufszentrum Horn",
        "AddressLine1": "Meurerweg 5",
        "AddressLine2": "Stadtteil Horn",
        "Town": "Hamburg",
        "StateOrProvince": "Hamburg",
        "Postcode": "22111",
        "CountryID": 87,
        "Latitude": 53.55366536866195,
        "Longitude": 10.086775887241384,
        "AccessComments": "24/7 nutzbar",
        "DistanceUnit": 0
    },
    "Connections": [
        {
            "ID": 119784,
            "ConnectionTypeID": 28,
            "StatusTypeID": 50,
            "LevelID": 2,
            "Amps": 16,
            "Voltage": 230,
            "PowerKW": 3.7,
            "CurrentTypeID": 10,
            "Quantity": 2
        },
        {
            "ID": 119785,
            "ConnectionTypeID": 25,
            "StatusTypeID": 50,
            "LevelID": 2,
            "Amps": 32,
            "Voltage": 400,
            "PowerKW": 22,
            "CurrentTypeID": 20,
            "Quantity": 2
        }
    ],
    "NumberOfPoints": 4,
    "StatusTypeID": 50,
    "DateLastStatusUpdate": "2017-04-20T23:28:00Z",
    "DataQualityLevel": 1,
    "DateCreated": "2017-02-20T15:21:00Z",
    "SubmissionStatusTypeID": 200
}