{
    "IsRecentlyVerified": false,
    "ID": 27190,
    "UUID": "32614D08-6733-4BAA-BE8B-0F4CFF82A87A",
    "DataProviderID": 2,
    "DataProvidersReference": "63248",
    "UsageTypeID": 1,
    "AddressInfo": {
        "ID": 27536,
        "Title": "Whole Foods Market",
        "AddressLine1": "4 S Tunnel Rd",
        "Town": "Asheville",
        "StateOrProvince": "NC",
        "Postcode": "28805",
        "CountryID": 2,
        "Latitude": 35.584387,
        "Longitude": -82.524451,
        "ContactTelephone1": "828-239-9604",
        "AccessComments": "24 hours daily",
        "RelatedURL": "",
        "DistanceUnit": 0
    },
    "Connections": [
        {
            "ID": 29778,
            "ConnectionTypeID": 1,
            "LevelID": 2,
            "Amps": 16,
            "Voltage": 230,
            "PowerKW": 3,
            "CurrentTypeID": 10,
            "Quantity": 1
        }
    ],
    "DateLastStatusUpdate": "2019-04-06T04:02:00Z",
    "DataQualityLevel": 3,
    "DateCreated": "2014-11-28T03:37:00Z",
    "SubmissionStatusTypeID": 100
}