{
    "IsRecentlyVerified": false,
    "ID": 141935,
    "UUID": "CACE7689-9C7A-4870-AA6A-429765661E61",
    "DataProviderID": 2,
    "DataProvidersReference": "103552",
    "UsageTypeID": 1,
    "AddressInfo": {
        "ID": 142287,
        "Title": "Gettysburg National Military Park Museum & Visitor Center",
        "AddressLine1": "1195 Baltimore Pike",
        "Town": "Gettysburg",
        "StateOrProvince": "PA",
        "Postcode": "17325",
        "CountryID": 2,
        "Latitude": 39.812289,
        "Longitude": -77.221856,
        "ContactTelephone1": "717-334-1124",
        "AccessComments": "Park business hours",
        "RelatedURL": "",
        "DistanceUnit": 0
    },
    "Connections": [
        {
            "ID": 197975,
            "ConnectionTypeID": 2,
            "LevelID": 3,
            "Amps": 100,
            "Voltage": 400,
            "PowerKW": 40,
            "CurrentTypeID": 30,
            "Quantity": 1
        },
        {
            "ID": 197976,
            "ConnectionTypeID": 32,
            "LevelID": 3,
            "Amps": 100,
            "Voltage": 400,
            "PowerKW": 40,
            "CurrentTypeID": 30,
            "Quantity": 1
        }
    ],
    "StatusTypeID": 50,
    "DateLastStatusUpdate": "2020-06-26T03:02:00Z",
    "DataQualityLevel": 3,
    "DateCreated": "2019-12-24T09:16:00Z",
    "SubmissionStatusTypeID": 100
}