{
    "IsRecentlyVerified": false,
    "ID": 138865,
    "UUID": "F20B1A0F-9556-41C4-A9BC-5CFCE1EC4A62",
    "DataProviderID": 2,
    "DataProvidersReference": "93252",
    "OperatorID": 15,
    "UsageTypeID": 4,
    "AddressInfo": {
        "ID": 139217,
        "Title": "Walgreens",
        "AddressLine1": "313 N Denton Tap Rd",
        "Town": "Coppell",
        "StateOrProvince": "TX",
        "Postcode": "75019",
        "CountryID": 2,
        "Latitude": 32.97684,
        "Longitude": -96.99429,
        "ContactTelephone1": "877-455-3833",
        "AccessComments": "24 hours daily\r\nPublic - Card key at all times",
        "RelatedURL": "https://www.evgo.com/",
        "DistanceUnit": 0
    },
    "Connections": [
        {
            "ID": 194086,
            "ConnectionTypeID": 2,
            "LevelID": 3,
            "Amps": 100,
            "Voltage": 400,
            "PowerKW": 40,
            "CurrentTypeID": 30,
            "Quantity": 1
        },
        {
            "ID": 194087,
            "ConnectionTypeID": 32,
            "LevelID": 3,
            "Amps": 100,
            "Voltage": 400,
            "PowerKW": 40,
            "CurrentTypeID": 30,
            "Quantity": 1
        }
    ],
    "StatusTypeID": 50,
    "DateLastStatusUpdate": "2020-06-26T02:55:00Z",
    "DataQualityLevel": 3,
    "DateCreated": "2019-12-24T09:09:00Z",
    "SubmissionStatusTypeID": 100
}