{
    "IsRecentlyVerified": false,
    "ID": 74753,
    "UUID": "44340DD2-1B46-4F67-BDFF-1148C272B611",
    "DataProviderID": 1,
    "DataProvidersReference": "3692",
    "AddressInfo": {
        "ID": 75099,
        "Title": "Jari-Pekka Joroinen",
        "AddressLine1": "Joroistentie 5",
        "Town": "Joroinen Keskus",
        "StateOrProvince": "Etelä-Savo",
        "Postcode": "79600",
        "CountryID": 79,
        "Latitude": 62.17661,
        "Longitude": 27.84018,
        "AccessComments": "Huoltoaseman yhteydessä",
        "DistanceUnit": 0
    },
    "Connections": [
        {
            "ID": 107725,
            "ConnectionTypeID": 0,
            "Reference": "1",
            "LevelID": 2,
            "Amps": 63,
            "Voltage": 400,
            "PowerKW": 43,
            "Comments": "Mode 3"
        },
        {
            "ID": 107726,
            "ConnectionTypeID": 0,
            "Reference": "2",
            "LevelID": 2,
            "Amps": 100,
            "Voltage": 500,
            "PowerKW": 50,
            "Comments": "Mode 4"
        }
    ],
    "NumberOfPoints": 2,
    "DateLastStatusUpdate": "2020-05-26T08:25:00Z",
    "DataQualityLevel": 2,
    "DateCreated": "2016-12-03T02:36:00Z",
    "SubmissionStatusTypeID": 100
}