{
    "IsRecentlyVerified": false,
    "ID": 128195,
    "UUID": "07E5037B-8B92-46B7-9FC8-7477360EE1B4",
    "DataProviderID": 1,
    "OperatorID": 5,
    "UsageTypeID": 4,
    "AddressInfo": {
        "ID": 128541,
        "Title": "Civic Parade",
        "AddressLine1": "Civic Parade",
        "AddressLine2": "Dee Why",
        "Town": "Sydney",
        "StateOrProvince": "Northern Beaches Council",
        "Postcode": "2099",
        "CountryID": 18,
        "Latitude": -33.7496613873962,
        "Longitude": 151.28615012817,
        "DistanceUnit": 0
    },
    "Connections": [
        {
            "ID": 179395,
            "ConnectionTypeID": 1,
            "StatusTypeID": 50,
            "LevelID": 2,
            "CurrentTypeID": 10,
            "Quantity": 2
        },
        {
            "ID": 179396,
            "ConnectionTypeID": 30,
            "LevelID": 2,
            "Quantity": 1
        }
    ],
    "NumberOfPoints": 2,
    "StatusTypeID": 50,
    "DateLastStatusUpdate": "2019-06-19T17:03:00Z",
    "DataQualityLevel": 1,
    "DateCreated": "2019-06-17T16:38:00Z",
    "SubmissionStatusTypeID": 200
}