{
    "IsRecentlyVerified": false,
    "ID": 175628,
    "UUID": "A3BF9572-F1EA-4497-BC9E-2E0119882C13",
    "DataProviderID": 1,
    "OperatorID": 1241,
    "UsageTypeID": 4,
    "UsageCost": "",
    "AddressInfo": {
        "ID": 175987,
        "Title": "Lidl Youghal",
        "AddressLine1": "Mill Road",
        "AddressLine2": "",
        "Town": "Youghal",
        "StateOrProvince": "Cork",
        "CountryID": 3,
        "Latitude": 51.958893302586006,
        "Longitude": -7.856719573771443,
        "ContactTelephone1": "+353 1 254 4456",
        "RelatedURL": "https://easygo.ie",
        "DistanceUnit": 0
    },
    "Connections": [
        {
            "ID": 272694,
            "ConnectionTypeID": 25,
            "StatusTypeID": 50,
            "LevelID": 2,
            "PowerKW": 22,
            "CurrentTypeID": 20,
            "Quantity": 2
        }
    ],
    "NumberOfPoints": 2,
    "StatusTypeID": 50,
    "DateLastStatusUpdate": "2021-06-03T02:38:00Z",
    "DataQualityLevel": 1,
    "DateCreated": "2021-06-02T22:12:00Z",
    "SubmissionStatusTypeID": 200
}