{
    "IsRecentlyVerified": false,
    "ID": 173968,
    "UUID": "E94D86A1-0760-47F2-8CBF-1093C1412BAA",
    "DataProviderID": 1,
    "OperatorID": 1,
    "UsageTypeID": 4,
    "AddressInfo": {
        "ID": 174327,
        "Title": "Apsida Parking",
        "AddressLine1": "Ploutarchou 28",
        "Town": "Thessaloniki",
        "StateOrProvince": "Kalamaria",
        "Postcode": "55134",
        "CountryID": 90,
        "Latitude": 40.58771543806367,
        "Longitude": 22.96482521001394,
        "RelatedURL": "https://apsidaparking.wixsite.com/main",
        "DistanceUnit": 0
    },
    "Connections": [
        {
            "ID": 268058,
            "ConnectionTypeID": 25,
            "StatusTypeID": 50,
            "LevelID": 2,
            "PowerKW": 22,
            "CurrentTypeID": 20,
            "Quantity": 2
        }
    ],
    "NumberOfPoints": 3,
    "StatusTypeID": 50,
    "DateLastStatusUpdate": "2021-03-08T17:51:00Z",
    "DataQualityLevel": 1,
    "DateCreated": "2021-03-08T14:50:00Z",
    "SubmissionStatusTypeID": 200
}