{
    "IsRecentlyVerified": false,
    "ID": 92269,
    "UUID": "F728A26F-41B9-48B4-9225-2B8ECA374995",
    "DataProviderID": 1,
    "OperatorID": 23,
    "OperatorsReference": "33372",
    "UsageTypeID": 4,
    "AddressInfo": {
        "ID": 92615,
        "Title": "Belle Vue Barn",
        "AddressLine1": "Belle Vue Barn",
        "Postcode": "HD7 4NN",
        "CountryID": 1,
        "Latitude": 53.640852,
        "Longitude": -1.875987,
        "ContactTelephone1": "+44 779 664 6328",
        "DistanceUnit": 0
    },
    "Connections": [
        {
            "ID": 130812,
            "ConnectionTypeID": 30,
            "StatusTypeID": 50,
            "LevelID": 2,
            "Amps": 32,
            "Voltage": 230,
            "PowerKW": 7,
            "CurrentTypeID": 10,
            "Quantity": 2
        }
    ],
    "NumberOfPoints": 2,
    "GeneralComments": "2 Tesla Connectors, up to 7kW.Available for customers. Please call ahead.",
    "StatusTypeID": 50,
    "DateLastStatusUpdate": "2018-10-03T15:21:00Z",
    "DataQualityLevel": 1,
    "DateCreated": "2017-09-01T05:35:00Z",
    "SubmissionStatusTypeID": 200
}