{
    "IsRecentlyVerified": false,
    "ID": 170569,
    "UUID": "9313E327-F050-449B-A8A0-5FADB5BC370B",
    "DataProviderID": 1,
    "OperatorID": 1,
    "UsageTypeID": 2,
    "AddressInfo": {
        "ID": 170928,
        "Title": "Flitsmeister",
        "AddressLine1": "Landjuweel 24",
        "Town": "Veenendaal",
        "StateOrProvince": "Utrecht",
        "Postcode": "3905PE",
        "CountryID": 159,
        "Latitude": 52.039305597053925,
        "Longitude": 5.550275138520533,
        "AccessComments": "The charging pole on the left side when entering parking is restricted to employees only and will not operate on public charging cards.",
        "DistanceUnit": 0
    },
    "Connections": [
        {
            "ID": 260369,
            "ConnectionTypeID": 25,
            "StatusTypeID": 50,
            "LevelID": 2,
            "Amps": 16,
            "Voltage": 230,
            "PowerKW": 3.6,
            "CurrentTypeID": 10,
            "Quantity": 2
        }
    ],
    "NumberOfPoints": 2,
    "StatusTypeID": 50,
    "DateLastStatusUpdate": "2020-12-02T16:01:00Z",
    "DataQualityLevel": 1,
    "DateCreated": "2020-12-01T15:25:00Z",
    "SubmissionStatusTypeID": 200
}