{
    "IsRecentlyVerified": false,
    "ID": 4938,
    "UUID": "2D8E24CA-8407-417A-BAE3-99CC41AD03A8",
    "DataProviderID": 2,
    "DataProvidersReference": "39982",
    "UsageTypeID": 7,
    "AddressInfo": {
        "ID": 4878,
        "Title": "Hill Nissan",
        "AddressLine1": "6401 Cypress Gardens Blvd",
        "Town": "Winter Haven",
        "StateOrProvince": "FL",
        "Postcode": "33884",
        "CountryID": 2,
        "Latitude": 27.982961,
        "Longitude": -81.676059,
        "ContactTelephone1": "863-299-2161",
        "AccessComments": "Dealership business hours\r\nPublic - Call ahead",
        "RelatedURL": "",
        "DistanceUnit": 0
    },
    "Connections": [
        {
            "ID": 15984,
            "ConnectionTypeID": 1,
            "LevelID": 2,
            "Amps": 16,
            "Voltage": 230,
            "PowerKW": 3.7,
            "CurrentTypeID": 10,
            "Quantity": 1
        },
        {
            "ID": 20958,
            "ConnectionTypeID": 2,
            "LevelID": 3,
            "Amps": 100,
            "Voltage": 400,
            "PowerKW": 40,
            "CurrentTypeID": 30,
            "Quantity": 1
        }
    ],
    "DateLastConfirmed": "2011-05-31T00:00:00Z",
    "StatusTypeID": 0,
    "DateLastStatusUpdate": "2020-06-26T02:52:00Z",
    "DataQualityLevel": 1,
    "DateCreated": "2011-07-04T18:02:00Z",
    "SubmissionStatusTypeID": 100
}