{
    "IsRecentlyVerified": false,
    "ID": 95008,
    "UUID": "3BDCB20E-1288-4B56-B633-E48380EE37EE",
    "DataProviderID": 1,
    "OperatorID": 3295,
    "OperatorsReference": "UKEV0311,UKEV0312,UKEV0313,UKEV0314",
    "UsageTypeID": 5,
    "UsageCost": "£2.50/hour",
    "AddressInfo": {
        "ID": 95354,
        "Title": "Trentham Garden Centre",
        "AddressLine1": "Stone Road",
        "AddressLine2": "Stafford",
        "Town": "Stoke-on-Trent",
        "Postcode": "ST4 8AX",
        "CountryID": 1,
        "Latitude": 52.9614885499822,
        "Longitude": -2.19697203527381,
        "DistanceUnit": 0
    },
    "Connections": [
        {
            "ID": 134627,
            "ConnectionTypeID": 25,
            "StatusTypeID": 50,
            "LevelID": 2,
            "Amps": 32,
            "Voltage": 230,
            "PowerKW": 7.2,
            "CurrentTypeID": 10,
            "Quantity": 4
        }
    ],
    "NumberOfPoints": 4,
    "StatusTypeID": 50,
    "DateLastStatusUpdate": "2017-10-31T19:27:00Z",
    "DataQualityLevel": 1,
    "DateCreated": "2017-10-31T19:22:00Z",
    "SubmissionStatusTypeID": 200
}