{
    "IsRecentlyVerified": false,
    "ID": 142174,
    "UUID": "07A3E530-73A5-4CEE-871A-2951DEC53252",
    "DataProviderID": 2,
    "DataProvidersReference": "143405",
    "OperatorID": 5,
    "UsageTypeID": 1,
    "AddressInfo": {
        "ID": 142526,
        "Title": "TOLLES",
        "AddressLine1": "7877 US-42",
        "Town": "Plain City",
        "StateOrProvince": "OH",
        "Postcode": "43064",
        "CountryID": 2,
        "Latitude": 40.123583,
        "Longitude": -83.272182,
        "ContactTelephone1": "888-758-4389",
        "AccessComments": "24 hours daily",
        "RelatedURL": "http://www.chargepoint.com/",
        "DistanceUnit": 0
    },
    "Connections": [
        {
            "ID": 198253,
            "ConnectionTypeID": 1,
            "LevelID": 2,
            "Amps": 16,
            "Voltage": 230,
            "PowerKW": 3.7,
            "CurrentTypeID": 10,
            "Quantity": 4
        }
    ],
    "StatusTypeID": 50,
    "DateLastStatusUpdate": "2020-06-26T03:02:00Z",
    "DataQualityLevel": 3,
    "DateCreated": "2019-12-24T09:17:00Z",
    "SubmissionStatusTypeID": 100
}