{
    "IsRecentlyVerified": false,
    "ID": 17967,
    "UUID": "80480DD0-78F9-475A-BA9E-A59D0946B29B",
    "DataProviderID": 22,
    "DataProvidersReference": "65F675B3CF48B79D1D4FE970F1688C6B",
    "AddressInfo": {
        "ID": 18312,
        "Title": "ローソン岡山厚生町一丁目店",
        "AddressLine1": "岡山県岡山市北区厚生町1-8-10",
        "CountryID": 114,
        "Latitude": 34.65655927,
        "Longitude": 133.9150654,
        "ContactTelephone1": "086-226-8066",
        "DistanceUnit": 0
    },
    "Connections": [
        {
            "ID": 18208,
            "ConnectionTypeID": 2,
            "LevelID": 2,
            "Amps": 100,
            "Voltage": 480,
            "PowerKW": 48,
            "Quantity": 1
        }
    ],
    "DateLastStatusUpdate": "2013-06-29T09:05:00Z",
    "DataQualityLevel": 2,
    "DateCreated": "2013-06-29T09:05:00Z",
    "SubmissionStatusTypeID": 200
}