{
    "IsRecentlyVerified": false,
    "ID": 33612,
    "UUID": "C17975BF-2ECC-4D07-8280-BDE56CAF68AD",
    "DataProviderID": 26,
    "DataProvidersReference": "26048",
    "OperatorID": 78,
    "OperatorsReference": "Essent EM-NL-00000779-02-00001",
    "UsageCost": "0.00 jaarabonnement",
    "AddressInfo": {
        "ID": 33958,
        "Title": "Heereplein 12b",
        "AddressLine1": "Heereplein 12b",
        "Town": "Geertruidenberg",
        "Postcode": "4941 DD",
        "CountryID": 159,
        "Latitude": 51.695561,
        "Longitude": 4.872876,
        "RelatedURL": "http://www.essent.nl",
        "DistanceUnit": 0
    },
    "Connections": [
        {
            "ID": 37123,
            "ConnectionTypeID": 25,
            "LevelID": 2,
            "PowerKW": 11,
            "CurrentTypeID": 10
        },
        {
            "ID": 46863,
            "ConnectionTypeID": 25,
            "LevelID": 2,
            "PowerKW": 11,
            "CurrentTypeID": 10
        }
    ],
    "NumberOfPoints": 1,
    "StatusTypeID": 50,
    "DateLastStatusUpdate": "2016-06-04T02:40:00Z",
    "DataQualityLevel": 3,
    "DateCreated": "2015-01-09T06:04:00Z",
    "SubmissionStatusTypeID": 100
}