{
    "IsRecentlyVerified": false,
    "ID": 16766,
    "UUID": "B243BD9B-198A-4B9D-B946-4E1E974F3172",
    "DataProviderID": 2,
    "DataProvidersReference": "51904",
    "UsageTypeID": 2,
    "AddressInfo": {
        "ID": 17111,
        "Title": "Evergreen Ford",
        "AddressLine1": "1500 18th Ave NW",
        "Town": "Issaquah",
        "StateOrProvince": "WA",
        "Postcode": "98027",
        "CountryID": 2,
        "Latitude": 47.547047,
        "Longitude": -122.063633,
        "ContactTelephone1": "",
        "AccessComments": "Service center use only",
        "RelatedURL": "",
        "DistanceUnit": 0
    },
    "Connections": [
        {
            "ID": 16989,
            "ConnectionTypeID": 1,
            "LevelID": 2,
            "Amps": 16,
            "Voltage": 230,
            "PowerKW": 3.7,
            "CurrentTypeID": 10,
            "Quantity": 2
        },
        {
            "ID": 22214,
            "ConnectionTypeID": 1,
            "LevelID": 2,
            "Quantity": 1
        }
    ],
    "DateLastStatusUpdate": "2020-06-26T03:11:00Z",
    "DataQualityLevel": 3,
    "DateCreated": "2013-06-16T03:49:00Z",
    "SubmissionStatusTypeID": 200
}