{
    "IsRecentlyVerified": false,
    "ID": 95936,
    "UUID": "210AFDA4-A63E-4214-9E8D-DA3E8E5D95CD",
    "DataProviderID": 1,
    "OperatorID": 3296,
    "UsageTypeID": 5,
    "UsageCost": "£0.35/kWh",
    "AddressInfo": {
        "ID": 96282,
        "Title": "Bannatyne's Health Club - Chafford Hundred",
        "AddressLine1": "Howard Road",
        "AddressLine2": "Chafford Hundred",
        "Town": "Grays",
        "StateOrProvince": "Thurrock",
        "Postcode": "RM16 6YJ",
        "CountryID": 1,
        "Latitude": 51.490532,
        "Longitude": 0.291525,
        "ContactTelephone1": "",
        "ContactTelephone2": "",
        "ContactEmail": "",
        "AccessComments": "Station can be found within the car park of Bannatyne Gym. This station is available for all public use.",
        "RelatedURL": "https://www.bannatyne.co.uk/health-club/chafford-hundred",
        "DistanceUnit": 0
    },
    "Connections": [
        {
            "ID": 135903,
            "ConnectionTypeID": 2,
            "Reference": "CHA003-001-01",
            "StatusTypeID": 50,
            "LevelID": 3,
            "Amps": 125,
            "Voltage": 400,
            "PowerKW": 50,
            "CurrentTypeID": 30,
            "Quantity": 2
        },
        {
            "ID": 135906,
            "ConnectionTypeID": 33,
            "StatusTypeID": 50,
            "LevelID": 3,
            "Amps": 125,
            "Voltage": 500,
            "PowerKW": 50,
            "CurrentTypeID": 30,
            "Quantity": 2
        }
    ],
    "NumberOfPoints": 2,
    "GeneralComments": "",
    "StatusTypeID": 50,
    "DateLastStatusUpdate": "2018-05-20T14:37:00Z",
    "MetadataValues": [
        {
            "ID": 4069,
            "MetadataFieldID": 4,
            "ItemValue": "Contains public sector information licensed under the Open Government Licence v2.0. http://www.nationalarchives.gov.uk/doc/open-government-licence/version/2/"
        }
    ],
    "DataQualityLevel": 3,
    "DateCreated": "2017-12-02T13:37:00Z",
    "SubmissionStatusTypeID": 200
}