{
    "IsRecentlyVerified": false,
    "ID": 48620,
    "UUID": "2EBFEC9D-04B3-459C-9D78-C986FF9295D2",
    "DataProviderID": 1,
    "OperatorID": 20,
    "OperatorsReference": "20096",
    "UsageTypeID": 4,
    "UsageCost": "Free",
    "AddressInfo": {
        "ID": 48966,
        "Title": "Bishop Auckland College",
        "AddressLine1": "Woodmouse Lane",
        "Town": "Bishop Auckland",
        "StateOrProvince": "County Durham",
        "Postcode": "DL14 6JZ",
        "CountryID": 1,
        "Latitude": 54.651033,
        "Longitude": -1.696524,
        "AccessComments": "Bishop Auckland College",
        "RelatedURL": "http://www.elektromotive.com",
        "DistanceUnit": 0
    },
    "Connections": [
        {
            "ID": 60075,
            "ConnectionTypeID": 3,
            "StatusTypeID": 50,
            "LevelID": 2,
            "Amps": 32,
            "Voltage": 230,
            "PowerKW": 3,
            "CurrentTypeID": 10,
            "Quantity": 1
        }
    ],
    "NumberOfPoints": 1,
    "StatusTypeID": 50,
    "DateLastStatusUpdate": "2020-04-27T05:21:00Z",
    "MetadataValues": [
        {
            "ID": 1627,
            "MetadataFieldID": 4,
            "ItemValue": "Contains public sector information licensed under the Open Government Licence v2.0. http://www.nationalarchives.gov.uk/doc/open-government-licence/version/2/"
        }
    ],
    "DataQualityLevel": 3,
    "DateCreated": "2015-06-27T07:22:00Z",
    "SubmissionStatusTypeID": 100
}