{
    "IsRecentlyVerified": false,
    "ID": 175632,
    "UUID": "3E3CC0DF-BE39-4636-A985-F0CE5C09DF77",
    "DataProviderID": 1,
    "OperatorID": 22,
    "UsageTypeID": 4,
    "UsageCost": "€0.268/kWh (PAYG), €0.23/kWh (membership)",
    "AddressInfo": {
        "ID": 175991,
        "Title": "Tesco Finglas Clearwater Extra",
        "AddressLine1": "Clearwater Shopping Centre",
        "AddressLine2": "Finglas",
        "Town": "Dublin",
        "StateOrProvince": "Dublin",
        "CountryID": 3,
        "Latitude": 53.38310999186584,
        "Longitude": -6.296340806187004,
        "DistanceUnit": 0
    },
    "Connections": [
        {
            "ID": 272698,
            "ConnectionTypeID": 25,
            "StatusTypeID": 50,
            "LevelID": 2,
            "Amps": 32,
            "Voltage": 400,
            "PowerKW": 22,
            "CurrentTypeID": 20,
            "Quantity": 2
        }
    ],
    "NumberOfPoints": 2,
    "StatusTypeID": 50,
    "DateLastStatusUpdate": "2021-06-03T02:38:00Z",
    "DataQualityLevel": 1,
    "DateCreated": "2021-06-02T22:43:00Z",
    "SubmissionStatusTypeID": 200
}