{
    "IsRecentlyVerified": false,
    "ID": 179572,
    "UUID": "29D842CE-1C8D-4C39-81DF-4AFA452EB8D5",
    "DataProviderID": 29,
    "DataProvidersReference": "757",
    "AddressInfo": {
        "ID": 179931,
        "Title": "Schlossstraße",
        "AddressLine1": "Schlossstraße",
        "Town": "Pirmasens",
        "Postcode": "66953",
        "CountryID": 87,
        "Latitude": 49.199924,
        "Longitude": 7.606086,
        "DistanceUnit": 0
    },
    "Connections": [
        {
            "ID": 281567,
            "ConnectionTypeID": 25,
            "StatusTypeID": 50,
            "LevelID": 2,
            "PowerKW": 22,
            "CurrentTypeID": 20
        },
        {
            "ID": 281568,
            "ConnectionTypeID": 25,
            "StatusTypeID": 50,
            "LevelID": 2,
            "PowerKW": 22,
            "CurrentTypeID": 20
        }
    ],
    "StatusTypeID": 50,
    "DateLastStatusUpdate": "2021-07-12T02:42:00Z",
    "MetadataValues": [
        {
            "ID": 11866,
            "MetadataFieldID": 4,
            "ItemValue": "Data from the German chargepoint registry provided by Bundesnetzagentur.de under the CC-BY 4.0 license"
        }
    ],
    "DataQualityLevel": 3,
    "DateCreated": "2021-07-08T09:59:00Z",
    "SubmissionStatusTypeID": 100
}