{
    "IsRecentlyVerified": false,
    "ID": 111294,
    "UUID": "39B544C3-EB8C-4460-81B9-6DAA141EFC49",
    "DataProviderID": 2,
    "DataProvidersReference": "84978",
    "UsageTypeID": 7,
    "AddressInfo": {
        "ID": 111640,
        "Title": "Myers Kanata Chevy Buick GMC",
        "AddressLine1": "2500 Palladium Dr",
        "Town": "Stittsville",
        "StateOrProvince": "ON",
        "Postcode": "K2V 1E2",
        "CountryID": 44,
        "Latitude": 45.293796,
        "Longitude": -75.93008,
        "ContactTelephone1": "613-592-9221",
        "AccessComments": "24 hours daily\r\nPublic - Call ahead",
        "RelatedURL": "",
        "DistanceUnit": 0
    },
    "Connections": [
        {
            "ID": 156694,
            "ConnectionTypeID": 1,
            "LevelID": 2,
            "Amps": 16,
            "Voltage": 230,
            "PowerKW": 3.7,
            "CurrentTypeID": 10,
            "Quantity": 2
        }
    ],
    "DateLastStatusUpdate": "2020-06-26T03:08:00Z",
    "DataQualityLevel": 3,
    "DateCreated": "2018-10-18T23:37:00Z",
    "SubmissionStatusTypeID": 100
}