{
    "IsRecentlyVerified": false,
    "ID": 79524,
    "UUID": "0860C61A-DF92-4BF0-BB09-96806808108D",
    "DataProviderID": 1,
    "OperatorID": 23,
    "OperatorsReference": "6314",
    "UsageTypeID": 4,
    "UsageCost": "$0.22/min >=60kW; $0.11/min <60kW; other tariffs for older cars",
    "AddressInfo": {
        "ID": 79870,
        "Title": "Billings Supercharger",
        "AddressLine1": "1801 Majestic LN",
        "Town": "Billings",
        "StateOrProvince": "MT",
        "Postcode": "59102",
        "CountryID": 2,
        "Latitude": 45.734046,
        "Longitude": -108.604932,
        "DistanceUnit": 0
    },
    "Connections": [
        {
            "ID": 114163,
            "ConnectionTypeID": 27,
            "StatusTypeID": 50,
            "LevelID": 3,
            "PowerKW": 120,
            "CurrentTypeID": 30,
            "Quantity": 4
        }
    ],
    "NumberOfPoints": 4,
    "GeneralComments": "4 Superchargers, available 24/7",
    "StatusTypeID": 50,
    "DateLastStatusUpdate": "2018-03-13T13:53:00Z",
    "DataQualityLevel": 1,
    "DateCreated": "2017-01-29T17:37:00Z",
    "SubmissionStatusTypeID": 200
}