{
    "IsRecentlyVerified": false,
    "ID": 66931,
    "UUID": "E4903C9B-0671-4C34-ACCA-BA7F8A3E76B3",
    "DataProviderID": 1,
    "OperatorID": 23,
    "OperatorsReference": "14574",
    "UsageTypeID": 1,
    "UsageCost": "Free",
    "AddressInfo": {
        "ID": 67277,
        "Title": "St. Mark Executive Golf Course - Tesla",
        "AddressLine1": "1556 Camino Del Arroyo",
        "Town": "San Marcos",
        "StateOrProvince": "CA",
        "Postcode": "92708",
        "CountryID": 2,
        "Latitude": 33.1210309,
        "Longitude": -117.2160927,
        "ContactTelephone1": "760-744-9092  877-798-3752",
        "AccessComments": "24 hours daily; for Tesla use only; for guest use only",
        "RelatedURL": "http://www.teslamotors.com/supercharger",
        "DistanceUnit": 0
    },
    "Connections": [
        {
            "ID": 92419,
            "ConnectionTypeID": 30,
            "StatusTypeID": 50,
            "LevelID": 2,
            "Amps": 16,
            "Voltage": 230,
            "PowerKW": 8,
            "CurrentTypeID": 10,
            "Quantity": 1
        }
    ],
    "NumberOfPoints": 1,
    "StatusTypeID": 50,
    "DateLastStatusUpdate": "2017-01-26T04:19:00Z",
    "DataQualityLevel": 3,
    "DateCreated": "2016-05-29T02:04:00Z",
    "SubmissionStatusTypeID": 100
}