{
    "IsRecentlyVerified": false,
    "ID": 144566,
    "UUID": "7CA7A6BC-3743-4609-A799-915EA69D21F4",
    "DataProviderID": 2,
    "DataProvidersReference": "130643",
    "OperatorID": 90,
    "UsageTypeID": 1,
    "AddressInfo": {
        "ID": 144918,
        "Title": "253 Mozart",
        "AddressLine1": "253 rue Mozart E",
        "Town": "Montréal",
        "StateOrProvince": "QC",
        "Postcode": "H2S 1B5",
        "CountryID": 44,
        "Latitude": 45.535996,
        "Longitude": -73.613517,
        "ContactTelephone1": "877-505-2674",
        "AccessComments": "24 hours daily",
        "RelatedURL": "https://lecircuitelectrique.com/",
        "DistanceUnit": 0
    },
    "Connections": [
        {
            "ID": 201076,
            "ConnectionTypeID": 1,
            "LevelID": 2,
            "Amps": 16,
            "Voltage": 230,
            "PowerKW": 3.7,
            "CurrentTypeID": 10,
            "Quantity": 2
        }
    ],
    "StatusTypeID": 50,
    "DateLastStatusUpdate": "2020-06-26T03:09:00Z",
    "DataQualityLevel": 3,
    "DateCreated": "2019-12-24T09:23:00Z",
    "SubmissionStatusTypeID": 100
}