{
    "IsRecentlyVerified": false,
    "ID": 5412,
    "UUID": "5DBB54C2-18F9-4AA6-8A54-65D42D87A3C2",
    "DataProviderID": 1,
    "DataProvidersReference": "LSB-00037",
    "OperatorID": 21,
    "UsageTypeID": 4,
    "UsageCost": "Mobi.E compatible card",
    "AddressInfo": {
        "ID": 5350,
        "Title": "LSB-00037",
        "AddressLine1": "Alameda dos Oceanos",
        "Town": "Lisboa",
        "Postcode": "1990-173",
        "CountryID": 180,
        "Latitude": 38.775617,
        "Longitude": -9.095322,
        "RelatedURL": "http://www.mobie.pt",
        "DistanceUnit": 0
    },
    "Connections": [
        {
            "ID": 33310,
            "ConnectionTypeID": 25,
            "StatusTypeID": 50,
            "LevelID": 2,
            "Amps": 16,
            "Voltage": 230,
            "PowerKW": 3.7,
            "CurrentTypeID": 10,
            "Quantity": 2
        }
    ],
    "NumberOfPoints": 2,
    "StatusTypeID": 50,
    "DateLastStatusUpdate": "2020-08-15T11:04:00Z",
    "DataQualityLevel": 1,
    "DateCreated": "2011-08-25T12:48:00Z",
    "SubmissionStatusTypeID": 100
}