{
    "UserComments": [
        {
            "ID": 23328,
            "ChargePointID": 95023,
            "CommentTypeID": 10,
            "UserName": "Simon Hewison",
            "Comment": "parking was not lit.",
            "Rating": 2,
            "DateCreated": "2020-10-04T21:27:16.187Z",
            "User": {
                "ID": 4575,
                "Username": "Simon Hewison"
            },
            "CheckinStatusTypeID": 10,
            "IsActionedByEditor": false
        }
    ],
    "IsRecentlyVerified": false,
    "ID": 95023,
    "UUID": "DDECEAE9-9B4C-4239-97B7-56A024AD82AF",
    "DataProviderID": 1,
    "OperatorID": 24,
    "OperatorsReference": "1320",
    "UsageTypeID": 5,
    "UsageCost": "£0.30/kWh",
    "AddressInfo": {
        "ID": 95369,
        "Title": "Roadchef Sutton Scotney Services Northbound",
        "AddressLine1": "A34 Northbound",
        "AddressLine2": "Wonston",
        "Town": "Winchester",
        "StateOrProvince": "Hampshire",
        "Postcode": "SO21 3JY",
        "CountryID": 1,
        "Latitude": 51.1564625510961,
        "Longitude": -1.34637813757332,
        "DistanceUnit": 0
    },
    "Connections": [
        {
            "ID": 134642,
            "ConnectionTypeID": 2,
            "StatusTypeID": 50,
            "LevelID": 3,
            "Amps": 200,
            "Voltage": 500,
            "PowerKW": 100,
            "CurrentTypeID": 30,
            "Quantity": 1
        },
        {
            "ID": 134643,
            "ConnectionTypeID": 33,
            "StatusTypeID": 50,
            "LevelID": 3,
            "Amps": 200,
            "Voltage": 920,
            "PowerKW": 120,
            "CurrentTypeID": 30,
            "Quantity": 1
        },
        {
            "ID": 134644,
            "ConnectionTypeID": 33,
            "StatusTypeID": 50,
            "LevelID": 3,
            "Amps": 200,
            "Voltage": 920,
            "PowerKW": 120,
            "CurrentTypeID": 30,
            "Quantity": 1
        }
    ],
    "NumberOfPoints": 2,
    "StatusTypeID": 50,
    "DateLastStatusUpdate": "2021-07-08T09:33:00Z",
    "DataQualityLevel": 1,
    "DateCreated": "2017-11-01T09:10:00Z",
    "SubmissionStatusTypeID": 200
}