{
    "UserComments": [
        {
            "ID": 14373,
            "ChargePointID": 56890,
            "CommentTypeID": 10,
            "UserName": "John Riley",
            "Comment": "I would like to put higher score than average but I had to try 2 points before my Source East card was accepted. Then when I came back to my car the other 14 charging spaces were all ICE'D. Westfield Stratford need to take responsibility for local air pollution and stop this ICE'ING to encourage EV'S. ",
            "Rating": 3,
            "DateCreated": "2016-10-09T07:46:32.14Z",
            "User": {
                "ID": 3404,
                "Username": "John Riley"
            },
            "CheckinStatusTypeID": 10
        }
    ],
    "MediaItems": [
        {
            "ID": 8402,
            "ChargePointID": 56890,
            "ItemURL": "https://s3-ap-southeast-2.amazonaws.com/openchargemap/images/GB/OCM56890/OCM-56890.orig.2016100907503683.jpg",
            "ItemThumbnailURL": "https://s3-ap-southeast-2.amazonaws.com/openchargemap/images/GB/OCM56890/OCM-56890.thmb.2016100907503683.jpg",
            "Comment": "Sadly this is not the view if you arrive late. ",
            "IsEnabled": true,
            "IsVideo": false,
            "IsFeaturedItem": false,
            "IsExternalResource": false,
            "User": {
                "ID": 3404,
                "Username": "John Riley"
            },
            "DateCreated": "2016-10-09T07:51:00Z"
        }
    ],
    "IsRecentlyVerified": false,
    "ID": 56890,
    "UUID": "21F939F4-6845-4027-8A49-7F91E7E7C57B",
    "DataProviderID": 1,
    "OperatorID": 25,
    "OperatorsReference": "stratford-westfieldstratfordcitycarparka",
    "UsageTypeID": 4,
    "UsageCost": "Free. Parking fees apply.",
    "AddressInfo": {
        "ID": 57236,
        "Title": "Westfield Stratford City-Car Park A",
        "AddressLine1": "Warton Road",
        "AddressLine2": "Stratford",
        "Town": "London",
        "Postcode": "E15 2JU",
        "CountryID": 1,
        "Latitude": 51.542919,
        "Longitude": -0.008717,
        "DistanceUnit": 0
    },
    "Connections": [
        {
            "ID": 71820,
            "ConnectionTypeID": 25,
            "StatusTypeID": 50,
            "LevelID": 2,
            "Amps": 32,
            "Voltage": 230,
            "PowerKW": 7,
            "CurrentTypeID": 10,
            "Quantity": 15
        }
    ],
    "NumberOfPoints": 15,
    "StatusTypeID": 50,
    "DateLastStatusUpdate": "2016-11-11T10:59:00Z",
    "DataQualityLevel": 1,
    "DateCreated": "2015-11-15T16:56:00Z",
    "SubmissionStatusTypeID": 200
}