{
    "UserComments": [
        {
            "ID": 21765,
            "ChargePointID": 57635,
            "CommentTypeID": 10,
            "UserName": "TB303",
            "Comment": "5/5 would charge again",
            "Rating": 5,
            "DateCreated": "2019-11-05T10:53:47.627Z",
            "User": {
                "ID": 22671,
                "Username": "TB303"
            },
            "CheckinStatusTypeID": 10
        }
    ],
    "MediaItems": [
        {
            "ID": 20272,
            "ChargePointID": 57635,
            "ItemURL": "https://s3-ap-southeast-2.amazonaws.com/openchargemap/images/DE/OCM57635/OCM-57635.orig.2019110517333540.png",
            "ItemThumbnailURL": "https://s3-ap-southeast-2.amazonaws.com/openchargemap/images/DE/OCM57635/OCM-57635.thmb.2019110517333540.png",
            "Comment": "",
            "IsEnabled": true,
            "IsVideo": false,
            "IsFeaturedItem": false,
            "IsExternalResource": false,
            "User": {
                "ID": 22671,
                "Username": "TB303"
            },
            "DateCreated": "2019-11-05T17:34:00Z"
        },
        {
            "ID": 20271,
            "ChargePointID": 57635,
            "ItemURL": "https://s3-ap-southeast-2.amazonaws.com/openchargemap/images/DE/OCM57635/OCM-57635.orig.2019110517303243.png",
            "ItemThumbnailURL": "https://s3-ap-southeast-2.amazonaws.com/openchargemap/images/DE/OCM57635/OCM-57635.thmb.2019110517303243.png",
            "Comment": "",
            "IsEnabled": true,
            "IsVideo": false,
            "IsFeaturedItem": false,
            "IsExternalResource": false,
            "User": {
                "ID": 22671,
                "Username": "TB303"
            },
            "DateCreated": "2019-11-05T17:31:00Z"
        }
    ],
    "IsRecentlyVerified": false,
    "ID": 57635,
    "UUID": "51C27D8E-B89B-4D4C-BEF1-EF80B9B7AA50",
    "DataProviderID": 1,
    "OperatorID": 45,
    "UsageTypeID": 5,
    "AddressInfo": {
        "ID": 57981,
        "Title": "Parkhaus P12 Kornmarkt/Schloss",
        "AddressLine1": "Zwingerstraße 20",
        "Town": "Heidelberg",
        "StateOrProvince": "Heidelberg",
        "Postcode": "69117",
        "CountryID": 87,
        "Latitude": 49.41134599999999,
        "Longitude": 8.712031199999956,
        "ContactTelephone1": "+496221-6530986",
        "AccessComments": "2 mit Steckerpiktogrammen markierte Parkplätze an Wallboxen. Wird vom Pförtner mit spezieller Ladekarte freigeschaltet. Parkengebühren werden erhoben, Laden ist kostenlos. Durchgehend geöffnet.",
        "RelatedURL": "http://www.swhd.de/heidelbergGips/Gips?Anwendung=CMSWebpage&Methode=ShowHTMLAusgabe&RessourceID=456",
        "DistanceUnit": 0
    },
    "Connections": [
        {
            "ID": 72889,
            "ConnectionTypeID": 25,
            "StatusTypeID": 50,
            "LevelID": 2,
            "Amps": 32,
            "Voltage": 400,
            "PowerKW": 22,
            "CurrentTypeID": 20,
            "Quantity": 2
        },
        {
            "ID": 72890,
            "ConnectionTypeID": 28,
            "StatusTypeID": 50,
            "LevelID": 2,
            "Amps": 16,
            "Voltage": 230,
            "PowerKW": 3.7,
            "CurrentTypeID": 10,
            "Quantity": 2
        }
    ],
    "NumberOfPoints": 2,
    "StatusTypeID": 50,
    "DateLastStatusUpdate": "2019-11-05T17:34:00Z",
    "DataQualityLevel": 1,
    "DateCreated": "2015-12-11T08:13:00Z",
    "SubmissionStatusTypeID": 200
}