{
    "IsRecentlyVerified": false,
    "ID": 143415,
    "UUID": "E7799BA3-9224-495C-A02E-417221804C82",
    "DataProviderID": 2,
    "DataProvidersReference": "149178",
    "OperatorID": 5,
    "UsageTypeID": 1,
    "AddressInfo": {
        "ID": 143767,
        "Title": "WHEATLAND-CHILI",
        "AddressLine1": "940 N Rd",
        "Town": "Scottsville",
        "StateOrProvince": "NY",
        "Postcode": "14546",
        "CountryID": 2,
        "Latitude": 43.025602,
        "Longitude": -77.762202,
        "ContactTelephone1": "888-758-4389",
        "AccessComments": "24 hours daily",
        "RelatedURL": "http://www.chargepoint.com/",
        "DistanceUnit": 0
    },
    "Connections": [
        {
            "ID": 199726,
            "ConnectionTypeID": 1,
            "LevelID": 2,
            "Amps": 16,
            "Voltage": 230,
            "PowerKW": 3.7,
            "CurrentTypeID": 10,
            "Quantity": 2
        }
    ],
    "StatusTypeID": 50,
    "DateLastStatusUpdate": "2020-06-26T03:06:00Z",
    "DataQualityLevel": 3,
    "DateCreated": "2019-12-24T09:21:00Z",
    "SubmissionStatusTypeID": 100
}