{
    "IsRecentlyVerified": false,
    "ID": 114054,
    "UUID": "FB8BD8AE-9B16-4934-AA9B-27320E2472E5",
    "DataProviderID": 1,
    "OperatorID": 23,
    "OperatorsReference": "46716",
    "UsageTypeID": 4,
    "AddressInfo": {
        "ID": 114400,
        "Title": "Pierre et Vacances Premium Presqu'ile de la Touques",
        "AddressLine1": "Rue Thiers",
        "Town": "Deauville",
        "Postcode": "14800",
        "CountryID": 80,
        "Latitude": 49.362194,
        "Longitude": 0.083011,
        "ContactTelephone1": " +33 2 31 14 08 00",
        "DistanceUnit": 0
    },
    "Connections": [
        {
            "ID": 160624,
            "ConnectionTypeID": 30,
            "StatusTypeID": 50,
            "LevelID": 2,
            "PowerKW": 17,
            "CurrentTypeID": 20,
            "Quantity": 1
        }
    ],
    "NumberOfPoints": 1,
    "GeneralComments": "1 Tesla Connector, up to 17kW.Available for customers. Please call ahead.",
    "StatusTypeID": 50,
    "DateLastStatusUpdate": "2019-01-03T06:42:00Z",
    "DataQualityLevel": 1,
    "DateCreated": "2019-01-03T06:42:00Z",
    "SubmissionStatusTypeID": 200
}