{
    "IsRecentlyVerified": false,
    "ID": 29165,
    "UUID": "65F9B567-CABD-40B1-BDD6-F4CB2EDCFE83",
    "DataProviderID": 2,
    "DataProvidersReference": "51327",
    "UsageTypeID": 1,
    "AddressInfo": {
        "ID": 29511,
        "Title": "Kwik Trip #625",
        "AddressLine1": "226 W Fulton St",
        "Town": "Waupaca",
        "StateOrProvince": "WI",
        "Postcode": "54981",
        "CountryID": 2,
        "Latitude": 44.358233,
        "Longitude": -89.087157,
        "ContactTelephone1": "715-258-5227",
        "AccessComments": "24 hours daily",
        "RelatedURL": "",
        "DistanceUnit": 0
    },
    "Connections": [
        {
            "ID": 32049,
            "ConnectionTypeID": 9,
            "LevelID": 1,
            "Amps": 16,
            "Voltage": 120,
            "PowerKW": 1.9,
            "CurrentTypeID": 10,
            "Quantity": 1
        }
    ],
    "DateLastStatusUpdate": "2020-06-26T03:08:00Z",
    "DataQualityLevel": 3,
    "DateCreated": "2014-11-28T03:39:00Z",
    "SubmissionStatusTypeID": 100
}