{
    "IsRecentlyVerified": false,
    "ID": 188316,
    "UUID": "2BBA0C0F-DEFC-4709-94EC-301CE084F42F",
    "DataProviderID": 1,
    "OperatorID": 3456,
    "UsageTypeID": 5,
    "UsageCost": "1,5",
    "AddressInfo": {
        "ID": 188675,
        "Title": "Manaseer Yaduda 2",
        "AddressLine1": "Madaba St.",
        "Town": "Al Yaduda",
        "StateOrProvince": "Amman",
        "Postcode": "",
        "CountryID": 116,
        "Latitude": 31.86251889829903,
        "Longitude": 35.92702793288004,
        "DistanceUnit": 0
    },
    "Connections": [
        {
            "ID": 304017,
            "ConnectionTypeID": 2,
            "StatusTypeID": 50,
            "LevelID": 3,
            "PowerKW": 50,
            "CurrentTypeID": 30
        },
        {
            "ID": 304018,
            "ConnectionTypeID": 33,
            "StatusTypeID": 50,
            "LevelID": 3,
            "PowerKW": 50,
            "CurrentTypeID": 30
        }
    ],
    "NumberOfPoints": 3,
    "StatusTypeID": 50,
    "DateLastStatusUpdate": "2021-07-18T14:08:00Z",
    "DataQualityLevel": 1,
    "DateCreated": "2021-07-18T10:49:00Z",
    "SubmissionStatusTypeID": 200
}