{
    "IsRecentlyVerified": false,
    "ID": 124218,
    "UUID": "4A01A1A9-6658-4729-AFBB-B4FBAEC6A2A8",
    "DataProviderID": 2,
    "DataProvidersReference": "70603",
    "UsageTypeID": 1,
    "AddressInfo": {
        "ID": 124564,
        "Title": "Golden Gate National Recreation Area - Stinson Beach",
        "AddressLine1": "4900 Shoreline Highway 1",
        "Town": "Stinson Beach",
        "StateOrProvince": "CA",
        "Postcode": "94970",
        "CountryID": 2,
        "Latitude": 37.896506,
        "Longitude": -122.639414,
        "ContactTelephone1": "415-868-0734",
        "AccessComments": "Park hours; 4 hour limit",
        "RelatedURL": "",
        "DistanceUnit": 0
    },
    "Connections": [
        {
            "ID": 174290,
            "ConnectionTypeID": 1,
            "LevelID": 2,
            "Amps": 16,
            "Voltage": 230,
            "PowerKW": 3.7,
            "CurrentTypeID": 10,
            "Quantity": 4
        }
    ],
    "DateLastStatusUpdate": "2020-06-26T02:59:00Z",
    "DataQualityLevel": 3,
    "DateCreated": "2019-04-06T05:03:00Z",
    "SubmissionStatusTypeID": 100
}