{
    "IsRecentlyVerified": false,
    "ID": 178020,
    "UUID": "84296824-7DB6-4999-9A43-029ED74F3D8A",
    "DataProviderID": 29,
    "DataProvidersReference": "13621",
    "OperatorID": 220,
    "AddressInfo": {
        "ID": 178379,
        "Title": "Holstenhofweg 85",
        "AddressLine1": "Holstenhofweg 85",
        "Town": "Hamburg",
        "Postcode": "22043",
        "CountryID": 87,
        "Latitude": 53.56851,
        "Longitude": 10.10619,
        "DistanceUnit": 0
    },
    "Connections": [
        {
            "ID": 277900,
            "ConnectionTypeID": 28,
            "StatusTypeID": 50,
            "LevelID": 2,
            "PowerKW": 22,
            "CurrentTypeID": 20
        },
        {
            "ID": 277901,
            "ConnectionTypeID": 25,
            "StatusTypeID": 50,
            "LevelID": 2,
            "PowerKW": 22,
            "CurrentTypeID": 20
        },
        {
            "ID": 301737,
            "ConnectionTypeID": 28,
            "StatusTypeID": 50,
            "LevelID": 2,
            "PowerKW": 22,
            "CurrentTypeID": 20
        },
        {
            "ID": 301738,
            "ConnectionTypeID": 25,
            "StatusTypeID": 50,
            "LevelID": 2,
            "PowerKW": 22,
            "CurrentTypeID": 20
        }
    ],
    "StatusTypeID": 0,
    "DateLastStatusUpdate": "2021-07-12T02:51:00Z",
    "MetadataValues": [
        {
            "ID": 10314,
            "MetadataFieldID": 4,
            "ItemValue": "Data from the German chargepoint registry provided by Bundesnetzagentur.de under the CC-BY 4.0 license"
        }
    ],
    "DataQualityLevel": 3,
    "DateCreated": "2021-07-08T09:49:00Z",
    "SubmissionStatusTypeID": 100
}