{
    "IsRecentlyVerified": false,
    "ID": 139217,
    "UUID": "87F3BEE8-BB18-4C1B-A852-B87FCB23D306",
    "DataProviderID": 2,
    "DataProvidersReference": "145363",
    "OperatorID": 5,
    "UsageTypeID": 1,
    "AddressInfo": {
        "ID": 139569,
        "Title": "COACHELLA",
        "AddressLine1": "1515 6th St",
        "Town": "Coachella",
        "StateOrProvince": "CA",
        "Postcode": "92236",
        "CountryID": 2,
        "Latitude": 33.6790539,
        "Longitude": -116.1768854,
        "ContactTelephone1": "888-758-4389",
        "AccessComments": "24 hours daily",
        "RelatedURL": "http://www.chargepoint.com/",
        "DistanceUnit": 0
    },
    "Connections": [
        {
            "ID": 194495,
            "ConnectionTypeID": 1,
            "LevelID": 2,
            "Amps": 16,
            "Voltage": 230,
            "PowerKW": 3,
            "CurrentTypeID": 10,
            "Quantity": 2
        }
    ],
    "StatusTypeID": 50,
    "DateLastStatusUpdate": "2019-12-24T09:10:00Z",
    "DataQualityLevel": 3,
    "DateCreated": "2019-12-24T09:10:00Z",
    "SubmissionStatusTypeID": 100
}