{
    "IsRecentlyVerified": false,
    "ID": 29199,
    "UUID": "3FC79E6E-D0E6-4F59-9B83-F866B78FF539",
    "DataProviderID": 1,
    "OperatorID": 23,
    "OperatorsReference": "6358",
    "UsageTypeID": 1,
    "UsageCost": "$0.22/min >=60kW; $0.11/min <60kW; other tariffs for older cars",
    "AddressInfo": {
        "ID": 29545,
        "Title": "Shoppes at Oakwood - Tesla",
        "AddressLine1": "4601 Keystone Crossing",
        "Town": "Eau Claire",
        "StateOrProvince": "WI",
        "Postcode": "54701",
        "CountryID": 2,
        "Latitude": 44.7712031,
        "Longitude": -91.4384579,
        "ContactTelephone1": "877-798-3752",
        "AccessComments": "24 hours daily; for Tesla use only",
        "RelatedURL": "http://www.teslamotors.com/supercharger",
        "DistanceUnit": 0
    },
    "Connections": [
        {
            "ID": 32091,
            "ConnectionTypeID": 27,
            "StatusTypeID": 50,
            "LevelID": 3,
            "Amps": 100,
            "Voltage": 400,
            "PowerKW": 120,
            "CurrentTypeID": 30,
            "Quantity": 6
        }
    ],
    "NumberOfPoints": 6,
    "StatusTypeID": 50,
    "DateLastStatusUpdate": "2018-03-13T13:45:00Z",
    "DataQualityLevel": 3,
    "DateCreated": "2014-11-28T03:39:00Z",
    "SubmissionStatusTypeID": 100
}