{
    "IsRecentlyVerified": false,
    "ID": 145865,
    "UUID": "15479410-782D-4B9F-9E74-E5A9EF92D6CB",
    "DataProviderID": 1,
    "OperatorID": 150,
    "OperatorsReference": "GP11183",
    "UsageTypeID": 4,
    "UsageCost": "£1.00+£0.30/kWh; £10.00 overstay fee after 95 mins, then £10.00 every subsequent 95 mins",
    "AddressInfo": {
        "ID": 146217,
        "Title": "Morrisons Bridgwater the Broadway",
        "AddressLine1": "Wm Morrison Supermarkets PLC",
        "Town": "Bridgwater",
        "Postcode": "TA6 3LN",
        "CountryID": 1,
        "Latitude": 51.125683,
        "Longitude": -3.002631,
        "AccessComments": "Pre-payment account required",
        "RelatedURL": "http://www.chargepointservices.com/",
        "DistanceUnit": 0
    },
    "Connections": [
        {
            "ID": 202653,
            "ConnectionTypeID": 25,
            "Reference": "1",
            "StatusTypeID": 50,
            "LevelID": 2,
            "Amps": 32,
            "Voltage": 400,
            "PowerKW": 22,
            "CurrentTypeID": 20,
            "Quantity": 1
        },
        {
            "ID": 202654,
            "ConnectionTypeID": 2,
            "Reference": "2",
            "StatusTypeID": 50,
            "LevelID": 3,
            "Amps": 125,
            "Voltage": 400,
            "PowerKW": 50,
            "CurrentTypeID": 30,
            "Quantity": 1
        },
        {
            "ID": 202655,
            "ConnectionTypeID": 33,
            "Reference": "3",
            "StatusTypeID": 50,
            "LevelID": 3,
            "Amps": 125,
            "Voltage": 400,
            "PowerKW": 50,
            "CurrentTypeID": 30,
            "Quantity": 1
        }
    ],
    "NumberOfPoints": 1,
    "StatusTypeID": 50,
    "DateLastStatusUpdate": "2020-01-16T19:42:00Z",
    "MetadataValues": [
        {
            "ID": 6942,
            "MetadataFieldID": 4,
            "ItemValue": "Contains public sector information licensed under the Open Government Licence v2.0. http://www.nationalarchives.gov.uk/doc/open-government-licence/version/2/"
        }
    ],
    "DataQualityLevel": 3,
    "DateCreated": "2019-12-24T15:55:00Z",
    "SubmissionStatusTypeID": 100
}