{
    "IsRecentlyVerified": false,
    "ID": 187743,
    "UUID": "2399B079-DD4D-4485-BDC4-91DB722D660C",
    "DataProviderID": 18,
    "DataProvidersReference": "509aa950d53f1b70284fc7b3ed6549e9",
    "OperatorID": 2244,
    "UsageTypeID": 5,
    "AddressInfo": {
        "ID": 188102,
        "Title": "26 Shinfield Street",
        "AddressLine1": "26 Shinfield Street",
        "Town": "London",
        "Postcode": "W12 0HN",
        "CountryID": 1,
        "Latitude": 51.516973,
        "Longitude": -0.225514,
        "AccessComments": "",
        "RelatedURL": "https://www.ubitricity.com",
        "DistanceUnit": 0
    },
    "Connections": [
        {
            "ID": 302983,
            "ConnectionTypeID": 25,
            "Reference": "suby1100003592",
            "StatusTypeID": 50,
            "LevelID": 2,
            "Amps": 16,
            "Voltage": 230,
            "PowerKW": 3.7,
            "CurrentTypeID": 10
        }
    ],
    "StatusTypeID": 0,
    "DateLastStatusUpdate": "2021-07-12T03:38:00Z",
    "MetadataValues": [
        {
            "ID": 19983,
            "MetadataFieldID": 4,
            "ItemValue": "Contains public sector information licensed under the Open Government Licence v2.0. http://www.nationalarchives.gov.uk/doc/open-government-licence/version/2/"
        }
    ],
    "DataQualityLevel": 3,
    "DateCreated": "2021-07-12T03:38:00Z",
    "SubmissionStatusTypeID": 100
}