{
    "IsRecentlyVerified": false,
    "ID": 53647,
    "UUID": "D37377A5-A0D0-4AB9-BBFF-52E9F1B12F09",
    "DataProviderID": 26,
    "DataProvidersReference": "69432",
    "OperatorID": 73,
    "OperatorsReference": "EV-Box EVB-P1414174",
    "UsageCost": "0.00 jaarabonnement",
    "AddressInfo": {
        "ID": 53993,
        "Title": "Mechanicalaan",
        "AddressLine1": "Mechanicalaan",
        "Town": "Antwerpen",
        "Postcode": "2610",
        "CountryID": 26,
        "Latitude": 51.15777,
        "Longitude": 4.3662,
        "RelatedURL": "http://www.ev-box.nl",
        "DistanceUnit": 0
    },
    "Connections": [
        {
            "ID": 66850,
            "ConnectionTypeID": 25,
            "LevelID": 2,
            "PowerKW": 11,
            "CurrentTypeID": 10
        }
    ],
    "NumberOfPoints": 1,
    "StatusTypeID": 50,
    "DateLastStatusUpdate": "2016-06-04T02:38:00Z",
    "DataQualityLevel": 3,
    "DateCreated": "2015-09-20T11:50:00Z",
    "SubmissionStatusTypeID": 100
}