{
    "UserComments": [
        {
            "ID": 19393,
            "ChargePointID": 61284,
            "CommentTypeID": 10,
            "UserName": "Erna_Schleck",
            "Comment": "",
            "Rating": 5,
            "DateCreated": "2018-04-09T09:31:15.743Z",
            "User": {
                "ID": 4573,
                "Username": "Erna_Schleck"
            },
            "CheckinStatusTypeID": 10
        },
        {
            "ID": 16162,
            "ChargePointID": 61284,
            "CommentTypeID": 10,
            "UserName": "Erna_Schleck",
            "Comment": "Von Typ2/22kW über Chademo und CSS alles vorhanden - dazu überdacht und kostenlos - perfekt!",
            "Rating": 5,
            "DateCreated": "2017-04-01T16:12:27.077Z",
            "User": {
                "ID": 4573,
                "Username": "Erna_Schleck"
            },
            "CheckinStatusTypeID": 10
        }
    ],
    "MediaItems": [
        {
            "ID": 6178,
            "ChargePointID": 61284,
            "ItemURL": "https://s3-ap-southeast-2.amazonaws.com/openchargemap/images/DE/OCM61284/OCM-61284.orig.2016040718061668.jpg",
            "ItemThumbnailURL": "https://s3-ap-southeast-2.amazonaws.com/openchargemap/images/DE/OCM61284/OCM-61284.thmb.2016040718061668.jpg",
            "Comment": "Im Solarcarport. Die Box ganz links kann durchgehend ohne Freischaltung benutzt werden, die anderen nur mit der ADAC Ladekarte aus der Geschäftsstelle. Die Box ganz links hat Typ2 und Schuko, die Schukodose war jedoch ohne Funktion.",
            "IsEnabled": true,
            "IsVideo": false,
            "IsFeaturedItem": false,
            "IsExternalResource": false,
            "User": {
                "ID": 4573,
                "Username": "Erna_Schleck"
            },
            "DateCreated": "2016-04-07T18:06:00Z"
        },
        {
            "ID": 6177,
            "ChargePointID": 61284,
            "ItemURL": "https://s3-ap-southeast-2.amazonaws.com/openchargemap/images/DE/OCM61284/OCM-61284.orig.2016040718042994.jpg",
            "ItemThumbnailURL": "https://s3-ap-southeast-2.amazonaws.com/openchargemap/images/DE/OCM61284/OCM-61284.thmb.2016040718042994.jpg",
            "Comment": "Solarcarport mit allen Ladepunkten.",
            "IsEnabled": true,
            "IsVideo": false,
            "IsFeaturedItem": false,
            "IsExternalResource": false,
            "User": {
                "ID": 4573,
                "Username": "Erna_Schleck"
            },
            "DateCreated": "2016-04-07T18:05:00Z"
        },
        {
            "ID": 5919,
            "ChargePointID": 61284,
            "ItemURL": "https://s3-ap-southeast-2.amazonaws.com/openchargemap/images/DE/OCM61284/OCM-61284.orig.2016022211273029.jpg",
            "ItemThumbnailURL": "https://s3-ap-southeast-2.amazonaws.com/openchargemap/images/DE/OCM61284/OCM-61284.thmb.2016022211273029.jpg",
            "Comment": "Carport mit noch nicht ganz fertig gestellten Ladestationen.",
            "IsEnabled": true,
            "IsVideo": false,
            "IsFeaturedItem": false,
            "IsExternalResource": false,
            "User": {
                "ID": 4573,
                "Username": "Erna_Schleck"
            },
            "DateCreated": "2016-02-22T11:28:00Z"
        }
    ],
    "IsRecentlyVerified": false,
    "ID": 61284,
    "UUID": "9AF756E0-85CA-4E85-B97E-0076E618D910",
    "DataProviderID": 1,
    "OperatorID": 3266,
    "UsageTypeID": 1,
    "UsageCost": "0.29€/kWh AC, 0.39€/kWh DC",
    "AddressInfo": {
        "ID": 61630,
        "Title": "ADAC Servicecenter Laatzen",
        "AddressLine1": "Lübecker Straße 17",
        "AddressLine2": "Rethen",
        "Town": "Laatzen",
        "StateOrProvince": "Region Hannover",
        "Postcode": "30880",
        "CountryID": 87,
        "Latitude": 52.2977747205921,
        "Longitude": 9.82705071163948,
        "ContactTelephone1": "05102 90-0 ",
        "ContactTelephone2": "",
        "ContactEmail": "laatzen@nsa.adac.de",
        "AccessComments": "Überdachte Stellplatzreihe auf dem Parkplatz, nach der Einfahrt links halten. Während der Öffnungszeiten des ADAC (Mo.-Fr. 10:00-18:00 Uhr, Sa.10:00-14:00 Uhr kann an der Info die Ladekarte ausgeliehen werden. Außerhalb der Öffnungszeiten hängt die Karte/Chip links an der DC Ladesäule. Die Box ganz links ist immer ohne Karte nutzbar (Typ2+Schuko, Schuko nicht angeschlossen!). Alle anderen sind für ADAC Fahrzeuge reserviert.",
        "RelatedURL": "https://www.adac.de/adac_vor_ort/niedersachsen-sachsen-anhalt/kontakt/default.aspx?ComponentId=64245&SourcePageId=0",
        "DistanceUnit": 0
    },
    "Connections": [
        {
            "ID": 78036,
            "ConnectionTypeID": 25,
            "StatusTypeID": 50,
            "LevelID": 2,
            "Amps": 32,
            "Voltage": 400,
            "PowerKW": 22,
            "CurrentTypeID": 20,
            "Quantity": 3
        },
        {
            "ID": 78037,
            "ConnectionTypeID": 28,
            "StatusTypeID": 50,
            "LevelID": 2,
            "Amps": 16,
            "Voltage": 230,
            "PowerKW": 3.7,
            "CurrentTypeID": 10,
            "Quantity": 2
        },
        {
            "ID": 78038,
            "ConnectionTypeID": 2,
            "StatusTypeID": 50,
            "LevelID": 3,
            "PowerKW": 50,
            "CurrentTypeID": 30,
            "Quantity": 1
        },
        {
            "ID": 78039,
            "ConnectionTypeID": 33,
            "StatusTypeID": 50,
            "LevelID": 3,
            "PowerKW": 50,
            "CurrentTypeID": 30,
            "Quantity": 1
        },
        {
            "ID": 82821,
            "ConnectionTypeID": 25,
            "StatusTypeID": 50,
            "LevelID": 2,
            "PowerKW": 11,
            "CurrentTypeID": 20,
            "Quantity": 2
        }
    ],
    "NumberOfPoints": 9,
    "GeneralComments": "",
    "StatusTypeID": 50,
    "DateLastStatusUpdate": "2020-05-10T06:57:00Z",
    "DataQualityLevel": 1,
    "DateCreated": "2016-02-22T11:20:00Z",
    "SubmissionStatusTypeID": 200
}