{
    "IsRecentlyVerified": false,
    "ID": 137284,
    "UUID": "4662F92D-A417-42E2-BDD8-AD73CF0AB699",
    "DataProviderID": 2,
    "DataProvidersReference": "76959",
    "UsageTypeID": 1,
    "AddressInfo": {
        "ID": 137630,
        "Title": "City of Delray Beach - City Hall",
        "AddressLine1": "100 NW 1st St",
        "Town": "Delray Beach",
        "StateOrProvince": "FL",
        "Postcode": "33444",
        "CountryID": 2,
        "Latitude": 26.463485,
        "Longitude": -80.075842,
        "ContactTelephone1": "561-243-7000",
        "AccessComments": "24 hours daily",
        "RelatedURL": "",
        "DistanceUnit": 0
    },
    "Connections": [
        {
            "ID": 192159,
            "ConnectionTypeID": 1,
            "LevelID": 2,
            "Amps": 16,
            "Voltage": 230,
            "PowerKW": 3,
            "CurrentTypeID": 10,
            "Quantity": 4
        }
    ],
    "StatusTypeID": 50,
    "DateLastStatusUpdate": "2019-12-24T09:04:00Z",
    "DataQualityLevel": 3,
    "DateCreated": "2019-12-24T09:04:00Z",
    "SubmissionStatusTypeID": 100
}