{
    "IsRecentlyVerified": false,
    "ID": 3492,
    "UUID": "B2C20702-C8A4-41B5-A48F-87D9654C5253",
    "DataProviderID": 1,
    "OperatorID": 6,
    "UsageTypeID": 1,
    "UsageCost": "",
    "AddressInfo": {
        "ID": 3493,
        "Title": "Fontana Nissan",
        "AddressLine1": "16444 South Highland Ave.",
        "AddressLine2": "",
        "Town": "Fontana",
        "StateOrProvince": "CA",
        "Postcode": "92336",
        "CountryID": 2,
        "Latitude": 34.13485,
        "Longitude": -117.44500000000001,
        "ContactTelephone1": "800-428-1562",
        "ContactTelephone2": "",
        "ContactEmail": "",
        "AccessComments": "",
        "RelatedURL": "",
        "DistanceUnit": 0
    },
    "Connections": [
        {
            "ID": 8,
            "ConnectionTypeID": 1,
            "StatusTypeID": 0,
            "LevelID": 2,
            "Quantity": 2
        },
        {
            "ID": 122003,
            "ConnectionTypeID": 2,
            "StatusTypeID": 0,
            "LevelID": 3
        }
    ],
    "NumberOfPoints": 3,
    "GeneralComments": "Dealer hours: Mon. - Sat.: 8 a.m. - 10 p.m.; Sun.: 9 a.m. - 10 p.m.",
    "StatusTypeID": 50,
    "DateLastStatusUpdate": "2017-04-17T18:20:00Z",
    "DataQualityLevel": 1,
    "DateCreated": "2017-04-17T18:20:00Z",
    "SubmissionStatusTypeID": 200
}