{
    "IsRecentlyVerified": false,
    "ID": 74162,
    "UUID": "777ED8A1-B736-46F2-A6A5-887CA51C3447",
    "DataProviderID": 1,
    "OperatorID": 89,
    "OperatorsReference": "CEA-10166",
    "UsageTypeID": 4,
    "UsageCost": "CAD 1.00/hour",
    "AddressInfo": {
        "ID": 74508,
        "Title": "MRC Charlevoix-Isle-Aux-Coudres",
        "AddressLine1": "1026 chemin des Coudriers",
        "Town": "L'Isle-aux-Coudres",
        "StateOrProvince": "QC",
        "Postcode": "G0A 3J0",
        "CountryID": 44,
        "Latitude": 47.419875,
        "Longitude": -70.384552,
        "DistanceUnit": 0
    },
    "Connections": [
        {
            "ID": 106502,
            "ConnectionTypeID": 1,
            "StatusTypeID": 50,
            "LevelID": 2,
            "Amps": 32,
            "Voltage": 230,
            "PowerKW": 7,
            "CurrentTypeID": 10,
            "Quantity": 1
        }
    ],
    "NumberOfPoints": 1,
    "StatusTypeID": 50,
    "DateLastStatusUpdate": "2017-01-24T09:37:00Z",
    "DataQualityLevel": 1,
    "DateCreated": "2016-11-24T14:17:00Z",
    "SubmissionStatusTypeID": 200
}