{
    "IsRecentlyVerified": false,
    "ID": 125126,
    "UUID": "8F394697-62CC-46E1-A721-8AD28ED5B1DD",
    "DataProviderID": 1,
    "OperatorID": 36,
    "UsageTypeID": 1,
    "AddressInfo": {
        "ID": 125472,
        "Title": "WEBA/DECATHLON",
        "AddressLine1": "VLIEGTUIGLAAN 8-10",
        "AddressLine2": "KLANTENPARKING WEBA/DECATHLON",
        "Town": "GENT",
        "StateOrProvince": "OOST-VLAANDEREN",
        "Postcode": "9000",
        "CountryID": 26,
        "Latitude": 51.0733941893294,
        "Longitude": 3.74005103584932,
        "ContactTelephone1": "+32 (0)3 337 38 30 ",
        "ContactTelephone2": "+32 (0) 78 48 10 77",
        "ContactEmail": "info@bluecorner.be",
        "AccessComments": "parking 24/24 en 7/7 toegankelijk ",
        "RelatedURL": "https://www.bluecorner.be",
        "DistanceUnit": 0
    },
    "Connections": [
        {
            "ID": 175368,
            "ConnectionTypeID": 25,
            "StatusTypeID": 50,
            "LevelID": 2,
            "Amps": 63,
            "Voltage": 400,
            "PowerKW": 22,
            "CurrentTypeID": 20,
            "Quantity": 4
        }
    ],
    "NumberOfPoints": 2,
    "GeneralComments": "De laadpaal is interoperabel. De laadpaal laat ook authenticatiemiddelen toe van andere laadpaal providers en is bijgevolg breed toegankelijk voor derden aangesloten bij een andere laadpaalbeheerder",
    "StatusTypeID": 50,
    "DateLastStatusUpdate": "2019-04-10T18:38:00Z",
    "DataQualityLevel": 1,
    "DateCreated": "2019-04-10T15:00:00Z",
    "SubmissionStatusTypeID": 200
}