{
    "IsRecentlyVerified": false,
    "ID": 184009,
    "UUID": "7AA8EB69-7981-4620-BA38-2B36BECEDBA0",
    "DataProviderID": 29,
    "DataProvidersReference": "10666",
    "AddressInfo": {
        "ID": 184368,
        "Title": "Freibad 1",
        "AddressLine1": "Freibad 1",
        "Town": "Tübingen",
        "Postcode": "72072",
        "CountryID": 87,
        "Latitude": 48.511339,
        "Longitude": 9.041191,
        "DistanceUnit": 0
    },
    "Connections": [
        {
            "ID": 291699,
            "ConnectionTypeID": 25,
            "StatusTypeID": 50,
            "LevelID": 2,
            "PowerKW": 22,
            "CurrentTypeID": 20
        },
        {
            "ID": 291700,
            "ConnectionTypeID": 25,
            "StatusTypeID": 50,
            "LevelID": 2,
            "PowerKW": 22,
            "CurrentTypeID": 20
        }
    ],
    "StatusTypeID": 50,
    "DateLastStatusUpdate": "2021-07-12T02:41:00Z",
    "MetadataValues": [
        {
            "ID": 16302,
            "MetadataFieldID": 4,
            "ItemValue": "Data from the German chargepoint registry provided by Bundesnetzagentur.de under the CC-BY 4.0 license"
        }
    ],
    "DataQualityLevel": 3,
    "DateCreated": "2021-07-08T10:04:00Z",
    "SubmissionStatusTypeID": 100
}