{
    "IsRecentlyVerified": false,
    "ID": 170688,
    "UUID": "E00AA65D-A8A1-4536-8624-08E143A3A5BE",
    "DataProviderID": 1,
    "OperatorID": 3,
    "OperatorsReference": "PG-80085",
    "UsageTypeID": 4,
    "UsageCost": "Free",
    "AddressInfo": {
        "ID": 171047,
        "Title": "Orbis Energy Lowestoft",
        "AddressLine1": "Wilde Street",
        "Town": "Lowestoft",
        "StateOrProvince": "Suffolk",
        "Postcode": "NR32 1XH",
        "CountryID": 1,
        "Latitude": 52.479186,
        "Longitude": 1.76065,
        "DistanceUnit": 0
    },
    "Connections": [
        {
            "ID": 260674,
            "ConnectionTypeID": 25,
            "StatusTypeID": 50,
            "LevelID": 2,
            "Amps": 32,
            "Voltage": 230,
            "PowerKW": 7,
            "CurrentTypeID": 10,
            "Quantity": 2
        }
    ],
    "NumberOfPoints": 2,
    "GeneralComments": "This is an open charge unit installed at the Orbis Energy Lowestoft site in Wilde Street, Lowestoft, Suffolk",
    "StatusTypeID": 50,
    "DateLastStatusUpdate": "2020-12-05T10:34:00Z",
    "DataQualityLevel": 1,
    "DateCreated": "2020-12-05T10:34:00Z",
    "SubmissionStatusTypeID": 200
}