{
    "IsRecentlyVerified": false,
    "ID": 62253,
    "UUID": "AA32306D-9B9B-4173-807B-FD95F26EC31D",
    "DataProviderID": 2,
    "DataProvidersReference": "73748",
    "UsageTypeID": 1,
    "AddressInfo": {
        "ID": 62599,
        "Title": "Crater Lake National Park",
        "AddressLine1": "659 Mazama Dr",
        "Town": "Crater Lake",
        "StateOrProvince": "OR",
        "Postcode": "97604",
        "CountryID": 2,
        "Latitude": 42.8675074,
        "Longitude": -122.1686476,
        "ContactTelephone1": "541-594-2255  541-594-3002",
        "AccessComments": "24 hours daily",
        "RelatedURL": "",
        "DistanceUnit": 0
    },
    "Connections": [
        {
            "ID": 79156,
            "ConnectionTypeID": 1,
            "LevelID": 2,
            "Amps": 16,
            "Voltage": 230,
            "PowerKW": 3,
            "CurrentTypeID": 10,
            "Quantity": 1
        }
    ],
    "DateLastStatusUpdate": "2019-04-06T05:06:00Z",
    "DataQualityLevel": 3,
    "DateCreated": "2016-03-03T11:38:00Z",
    "SubmissionStatusTypeID": 100
}