{
    "IsRecentlyVerified": false,
    "ID": 152345,
    "UUID": "F3C71D26-98E9-4510-A9AB-BC44E846E80E",
    "DataProviderID": 28,
    "DataProvidersReference": "FRSEOPAB73067A",
    "OperatorID": 3383,
    "UsageTypeID": 5,
    "AddressInfo": {
        "ID": 152698,
        "Title": "Réseau AlterBase - Nueil les Aubiers -  Place Colun",
        "AddressLine1": "Place Colun - 79250 NUEIL LES AUBIERS",
        "CountryID": 80,
        "Latitude": 46.95686714,
        "Longitude": -0.58792319,
        "AccessComments": "24/24 7/7 jours",
        "DistanceUnit": 0
    },
    "Connections": [
        {
            "ID": 213243,
            "ConnectionTypeID": 28,
            "StatusTypeID": 50,
            "LevelID": 2,
            "PowerKW": 3.18,
            "CurrentTypeID": 10
        },
        {
            "ID": 213244,
            "ConnectionTypeID": 25,
            "StatusTypeID": 50,
            "LevelID": 2,
            "PowerKW": 3.18,
            "CurrentTypeID": 10
        },
        {
            "ID": 246121,
            "ConnectionTypeID": 28,
            "StatusTypeID": 50,
            "LevelID": 2,
            "PowerKW": 3.18,
            "CurrentTypeID": 10
        },
        {
            "ID": 246122,
            "ConnectionTypeID": 25,
            "StatusTypeID": 50,
            "LevelID": 2,
            "PowerKW": 3.18,
            "CurrentTypeID": 10
        }
    ],
    "GeneralComments": "www.alterbase.fr",
    "StatusTypeID": 50,
    "DateLastStatusUpdate": "2020-08-27T05:13:00Z",
    "DataQualityLevel": 2,
    "DateCreated": "2020-03-15T10:53:00Z",
    "SubmissionStatusTypeID": 100
}