{
    "IsRecentlyVerified": false,
    "ID": 166942,
    "UUID": "D2737CC0-0CAF-4274-B821-E58901A6C55D",
    "DataProviderID": 28,
    "DataProvidersReference": "FR*H01*P62618*001",
    "OperatorID": 3409,
    "UsageTypeID": 5,
    "AddressInfo": {
        "ID": 167301,
        "Title": "NORDAUSQUES - Rue de la mairie",
        "AddressLine1": "Rue de la mairie 62890 NORDAUSQUES",
        "CountryID": 80,
        "Latitude": 50.818188,
        "Longitude": 2.020328,
        "AccessComments": "24h/24 7j/7",
        "DistanceUnit": 0
    },
    "Connections": [
        {
            "ID": 252739,
            "ConnectionTypeID": 28,
            "StatusTypeID": 50,
            "LevelID": 2,
            "PowerKW": 22,
            "CurrentTypeID": 10
        },
        {
            "ID": 252740,
            "ConnectionTypeID": 1036,
            "StatusTypeID": 50,
            "LevelID": 2,
            "PowerKW": 22,
            "CurrentTypeID": 20
        },
        {
            "ID": 252741,
            "ConnectionTypeID": 28,
            "StatusTypeID": 50,
            "LevelID": 2,
            "PowerKW": 22,
            "CurrentTypeID": 10
        },
        {
            "ID": 252742,
            "ConnectionTypeID": 1036,
            "StatusTypeID": 50,
            "LevelID": 2,
            "PowerKW": 22,
            "CurrentTypeID": 20
        }
    ],
    "GeneralComments": "Recharge par badge et avec une application smartphone",
    "StatusTypeID": 50,
    "DateLastStatusUpdate": "2020-08-27T05:16:00Z",
    "DataQualityLevel": 2,
    "DateCreated": "2020-08-27T05:16:00Z",
    "SubmissionStatusTypeID": 100
}