{
    "IsRecentlyVerified": false,
    "ID": 123394,
    "UUID": "DEE39657-8287-4715-B132-13D8804456E0",
    "DataProviderID": 2,
    "DataProvidersReference": "46470",
    "UsageTypeID": 2,
    "AddressInfo": {
        "ID": 123740,
        "Title": "HCA Corporate Headquarters - Building 1",
        "AddressLine1": "One Park Plaza",
        "Town": "Nashville",
        "StateOrProvince": "TN",
        "Postcode": "37203",
        "CountryID": 2,
        "Latitude": 36.1542263,
        "Longitude": -86.812603,
        "ContactTelephone1": "",
        "AccessComments": "Employee use only",
        "RelatedURL": "",
        "DistanceUnit": 0
    },
    "Connections": [
        {
            "ID": 173365,
            "ConnectionTypeID": 1,
            "LevelID": 2,
            "Amps": 16,
            "Voltage": 230,
            "PowerKW": 3.7,
            "CurrentTypeID": 10,
            "Quantity": 4
        }
    ],
    "DateLastStatusUpdate": "2020-06-26T02:58:00Z",
    "DataQualityLevel": 3,
    "DateCreated": "2019-04-06T05:03:00Z",
    "SubmissionStatusTypeID": 100
}