{
    "IsRecentlyVerified": false,
    "ID": 95311,
    "UUID": "1567B074-9882-4A6E-A285-FE6E2A2B7CA4",
    "DataProviderID": 1,
    "OperatorID": 105,
    "UsageTypeID": 4,
    "AddressInfo": {
        "ID": 95657,
        "Title": "Wertkauf",
        "AddressLine1": "Am Viehweg",
        "Town": "Oppenheim",
        "StateOrProvince": "Rhein-Selz",
        "Postcode": "55276",
        "CountryID": 87,
        "Latitude": 49.846083858304446,
        "Longitude": 8.36143768042596,
        "AccessComments": "24/7 nutzbar",
        "DistanceUnit": 0
    },
    "Connections": [
        {
            "ID": 134995,
            "ConnectionTypeID": 25,
            "StatusTypeID": 50,
            "LevelID": 2,
            "Amps": 32,
            "Voltage": 400,
            "PowerKW": 22,
            "CurrentTypeID": 20,
            "Quantity": 1
        },
        {
            "ID": 134996,
            "ConnectionTypeID": 2,
            "StatusTypeID": 50,
            "LevelID": 3,
            "PowerKW": 50,
            "CurrentTypeID": 30,
            "Quantity": 1
        },
        {
            "ID": 134997,
            "ConnectionTypeID": 33,
            "StatusTypeID": 50,
            "LevelID": 3,
            "PowerKW": 50,
            "CurrentTypeID": 30,
            "Quantity": 1
        }
    ],
    "NumberOfPoints": 3,
    "StatusTypeID": 50,
    "DateLastStatusUpdate": "2017-11-06T09:02:00Z",
    "DataQualityLevel": 1,
    "DateCreated": "2017-11-06T09:02:00Z",
    "SubmissionStatusTypeID": 200
}