{
    "IsRecentlyVerified": false,
    "ID": 142897,
    "UUID": "1E4C6700-464F-420E-9FC6-71A6C9A80395",
    "DataProviderID": 2,
    "DataProvidersReference": "123398",
    "OperatorID": 5,
    "UsageTypeID": 1,
    "AddressInfo": {
        "ID": 143249,
        "Title": "WAREHOUSE",
        "AddressLine1": "1924 N Paulina St",
        "Town": "Chicago",
        "StateOrProvince": "IL",
        "Postcode": "60622",
        "CountryID": 2,
        "Latitude": 41.9168573,
        "Longitude": -87.6704504,
        "ContactTelephone1": "888-758-4389",
        "AccessComments": "24 hours daily",
        "RelatedURL": "http://www.chargepoint.com/",
        "DistanceUnit": 0
    },
    "Connections": [
        {
            "ID": 199126,
            "ConnectionTypeID": 1,
            "LevelID": 2,
            "Amps": 16,
            "Voltage": 230,
            "PowerKW": 3.7,
            "CurrentTypeID": 10,
            "Quantity": 1
        }
    ],
    "StatusTypeID": 50,
    "DateLastStatusUpdate": "2020-06-26T03:05:00Z",
    "DataQualityLevel": 3,
    "DateCreated": "2019-12-24T09:19:00Z",
    "SubmissionStatusTypeID": 100
}