{
    "IsRecentlyVerified": false,
    "ID": 11700,
    "UUID": "7FE7CC8E-F43B-4EB5-A61B-3E3C13AF4EB1",
    "DataProviderID": 1,
    "OperatorID": 1,
    "UsageTypeID": 1,
    "AddressInfo": {
        "ID": 11597,
        "Title": "2401 DUFFERIN STREET",
        "AddressLine1": "2401 DUFFERIN STREET",
        "Town": "TORONTO",
        "Postcode": "M6E 3S7",
        "CountryID": 44,
        "Latitude": 43.696979,
        "Longitude": -79.450738,
        "ContactTelephone1": "4167809888",
        "RelatedURL": "http://carstations.com/18801",
        "DistanceUnit": 0
    },
    "Connections": [
        {
            "ID": 9041,
            "ConnectionTypeID": 1,
            "Reference": "J1772",
            "LevelID": 2
        }
    ],
    "NumberOfPoints": 1,
    "StatusTypeID": 50,
    "DateLastStatusUpdate": "2020-11-23T12:36:00Z",
    "DataQualityLevel": 2,
    "DateCreated": "2012-06-14T21:30:00Z",
    "SubmissionStatusTypeID": 100
}