{
    "IsRecentlyVerified": false,
    "ID": 124982,
    "UUID": "29D4DC92-0DAA-4BBE-91B3-FBFA13D8212C",
    "DataProviderID": 1,
    "OperatorID": 80,
    "UsageTypeID": 4,
    "AddressInfo": {
        "ID": 125328,
        "Title": "Loazzolo Piazza Torino | EnelX",
        "AddressLine1": "Piazza Torino",
        "Town": "Loazzolo",
        "StateOrProvince": "AT",
        "Postcode": "14051",
        "CountryID": 112,
        "Latitude": 44.66829673347,
        "Longitude": 8.25943455147603,
        "ContactTelephone1": "800.069.850",
        "RelatedURL": "https://www.enelx.com/it/it/emobility",
        "DistanceUnit": 0
    },
    "Connections": [
        {
            "ID": 175184,
            "ConnectionTypeID": 25,
            "StatusTypeID": 50,
            "LevelID": 2,
            "Amps": 32,
            "Voltage": 400,
            "PowerKW": 22,
            "CurrentTypeID": 20,
            "Quantity": 2
        }
    ],
    "NumberOfPoints": 2,
    "StatusTypeID": 50,
    "DateLastStatusUpdate": "2019-04-07T10:46:00Z",
    "DataQualityLevel": 1,
    "DateCreated": "2019-04-07T10:46:00Z",
    "SubmissionStatusTypeID": 200
}