{
    "IsRecentlyVerified": false,
    "ID": 154531,
    "UUID": "18DF0A7E-73FA-4513-BCC4-D0A52A297A43",
    "DataProviderID": 1,
    "OperatorID": 80,
    "UsageTypeID": 4,
    "AddressInfo": {
        "ID": 154884,
        "Title": "Pezze di Greco  Bertani | EnelX",
        "AddressLine1": "Via Bertani",
        "AddressLine2": "Pezze di Greco ",
        "Town": "Fasano",
        "StateOrProvince": "BR",
        "Postcode": "72010",
        "CountryID": 112,
        "Latitude": 40.81144133215349,
        "Longitude": 17.41038855843601,
        "ContactTelephone1": "800.069.850",
        "RelatedURL": "https://www.enelx.com/it/it/emobility",
        "DistanceUnit": 0
    },
    "Connections": [
        {
            "ID": 217335,
            "ConnectionTypeID": 25,
            "StatusTypeID": 50,
            "LevelID": 2,
            "Amps": 32,
            "Voltage": 400,
            "PowerKW": 22,
            "CurrentTypeID": 20,
            "Quantity": 2
        }
    ],
    "NumberOfPoints": 2,
    "StatusTypeID": 50,
    "DateLastStatusUpdate": "2020-03-16T17:24:00Z",
    "DataQualityLevel": 1,
    "DateCreated": "2020-03-16T17:24:00Z",
    "SubmissionStatusTypeID": 200
}