{
    "IsRecentlyVerified": false,
    "ID": 41414,
    "UUID": "3C4E1DA6-292E-4650-9EBB-EA5393C920E0",
    "DataProviderID": 1,
    "OperatorID": 23,
    "OperatorsReference": "6439",
    "UsageTypeID": 1,
    "UsageCost": "$0.22/min >=60kW; $0.11/min <60kW; other tariffs for older cars",
    "AddressInfo": {
        "ID": 41760,
        "Title": "Culver's - Tesla",
        "AddressLine1": "640 McEvoy St",
        "Town": "Mauston",
        "StateOrProvince": "WI",
        "Postcode": "53948",
        "CountryID": 2,
        "Latitude": 43.7958765,
        "Longitude": -90.0595772,
        "ContactTelephone1": "877-798-3752",
        "AccessComments": "24 hours daily; for Tesla use only",
        "RelatedURL": "http://www.teslamotors.com/supercharger",
        "DistanceUnit": 0
    },
    "Connections": [
        {
            "ID": 45262,
            "ConnectionTypeID": 27,
            "StatusTypeID": 50,
            "LevelID": 3,
            "Amps": 100,
            "Voltage": 400,
            "PowerKW": 120,
            "CurrentTypeID": 30,
            "Quantity": 6
        }
    ],
    "NumberOfPoints": 6,
    "StatusTypeID": 50,
    "DateLastStatusUpdate": "2018-03-13T08:50:00Z",
    "DataQualityLevel": 3,
    "DateCreated": "2015-02-02T06:34:00Z",
    "SubmissionStatusTypeID": 100
}