{
    "IsRecentlyVerified": false,
    "ID": 180358,
    "UUID": "55D92291-96FF-434F-AF9C-79961B55C32C",
    "DataProviderID": 29,
    "DataProvidersReference": "7768",
    "OperatorID": 105,
    "AddressInfo": {
        "ID": 180717,
        "Title": "Naheweinstr. 80",
        "AddressLine1": "Naheweinstr. 80",
        "Town": "Langenlonsheim",
        "Postcode": "55450",
        "CountryID": 87,
        "Latitude": 49.894051,
        "Longitude": 7.900801,
        "DistanceUnit": 0
    },
    "Connections": [
        {
            "ID": 283345,
            "ConnectionTypeID": 25,
            "StatusTypeID": 50,
            "LevelID": 2,
            "PowerKW": 22,
            "CurrentTypeID": 20
        },
        {
            "ID": 283346,
            "ConnectionTypeID": 25,
            "StatusTypeID": 50,
            "LevelID": 2,
            "PowerKW": 22,
            "CurrentTypeID": 20
        }
    ],
    "StatusTypeID": 50,
    "DateLastStatusUpdate": "2021-07-09T03:18:00Z",
    "MetadataValues": [
        {
            "ID": 12652,
            "MetadataFieldID": 4,
            "ItemValue": "Data from the German chargepoint registry provided by Bundesnetzagentur.de under the CC-BY 4.0 license"
        }
    ],
    "DataQualityLevel": 3,
    "DateCreated": "2021-07-08T10:00:00Z",
    "SubmissionStatusTypeID": 100
}