{
    "IsRecentlyVerified": false,
    "ID": 78957,
    "UUID": "0D4515EA-A9F1-48DA-B769-868CC503DC28",
    "DataProviderID": 1,
    "OperatorID": 23,
    "OperatorsReference": "12226",
    "UsageTypeID": 4,
    "UsageCost": "Free",
    "AddressInfo": {
        "ID": 79303,
        "Title": "Creston Valley Chamber of Commerce",
        "AddressLine1": "121 Northwest BLVD",
        "Town": "Creston",
        "StateOrProvince": "BC",
        "Postcode": "V0B 1G0",
        "CountryID": 44,
        "Latitude": 49.095878,
        "Longitude": -116.514887,
        "ContactTelephone1": "(250) 428-2214",
        "DistanceUnit": 0
    },
    "Connections": [
        {
            "ID": 113576,
            "ConnectionTypeID": 30,
            "StatusTypeID": 50,
            "LevelID": 2,
            "PowerKW": 13,
            "CurrentTypeID": 20,
            "Quantity": 1
        }
    ],
    "NumberOfPoints": 1,
    "GeneralComments": "1 Tesla Connector, up to 13kW.Available to the public. Self park.",
    "StatusTypeID": 50,
    "DateLastStatusUpdate": "2017-01-26T17:09:00Z",
    "DataQualityLevel": 1,
    "DateCreated": "2017-01-26T17:09:00Z",
    "SubmissionStatusTypeID": 200
}