{
    "IsRecentlyVerified": false,
    "ID": 155786,
    "UUID": "3D190D0E-2C8F-4954-8588-0BD2B6FBA1CA",
    "DataProviderID": 1,
    "OperatorID": 80,
    "UsageTypeID": 4,
    "UsageCost": "0,45 €/kWh",
    "AddressInfo": {
        "ID": 156140,
        "Title": "Tivoli Viale Roma | EnelX ",
        "AddressLine1": "Viale Roma",
        "Town": "Tivoli",
        "StateOrProvince": "RM",
        "Postcode": "00019",
        "CountryID": 112,
        "Latitude": 41.96471989653719,
        "Longitude": 12.801607297784358,
        "ContactTelephone1": "800069850",
        "RelatedURL": "http://www.enelx.com",
        "DistanceUnit": 0
    },
    "Connections": [
        {
            "ID": 219349,
            "ConnectionTypeID": 25,
            "StatusTypeID": 50,
            "LevelID": 2,
            "Amps": 32,
            "Voltage": 400,
            "PowerKW": 22,
            "CurrentTypeID": 20,
            "Quantity": 2
        }
    ],
    "NumberOfPoints": 2,
    "StatusTypeID": 50,
    "DateLastStatusUpdate": "2020-08-07T08:42:00Z",
    "DataQualityLevel": 1,
    "DateCreated": "2020-04-24T11:37:00Z",
    "SubmissionStatusTypeID": 200
}