{
    "IsRecentlyVerified": false,
    "ID": 115919,
    "UUID": "FCFDDD69-41CE-4347-B0D2-7055B8A9DFAB",
    "DataProviderID": 2,
    "DataProvidersReference": "105119",
    "OperatorID": 5,
    "UsageTypeID": 1,
    "AddressInfo": {
        "ID": 116265,
        "Title": "JAGLRNH",
        "AddressLine1": "521 Washington Ave",
        "Town": "North Haven",
        "StateOrProvince": "CT",
        "Postcode": "06473",
        "CountryID": 2,
        "Latitude": 41.4168397,
        "Longitude": -72.8415278,
        "ContactTelephone1": "888-758-4389",
        "AccessComments": "24 hours daily",
        "RelatedURL": "http://www.chargepoint.com/",
        "DistanceUnit": 0
    },
    "Connections": [
        {
            "ID": 162966,
            "ConnectionTypeID": 1,
            "LevelID": 2,
            "Amps": 16,
            "Voltage": 230,
            "PowerKW": 3.7,
            "CurrentTypeID": 10,
            "Quantity": 2
        }
    ],
    "DateLastStatusUpdate": "2020-06-26T03:04:00Z",
    "DataQualityLevel": 3,
    "DateCreated": "2019-02-11T07:13:00Z",
    "SubmissionStatusTypeID": 100
}