{
    "IsRecentlyVerified": false,
    "ID": 113607,
    "UUID": "3945594D-17B0-4DDF-97D6-5624DF39C781",
    "DataProviderID": 1,
    "OperatorID": 3319,
    "UsageTypeID": 1,
    "UsageCost": "Free",
    "AddressInfo": {
        "ID": 113953,
        "Title": "Hoffher Albert utca e-Mobi",
        "AddressLine1": "Hoffherr Albert utca 107.",
        "AddressLine2": "",
        "Town": "Budapest",
        "StateOrProvince": "Budapest",
        "Postcode": "1194",
        "CountryID": 104,
        "Latitude": 47.43712972067478,
        "Longitude": 19.14506888453616,
        "ContactTelephone1": "",
        "ContactTelephone2": "",
        "ContactEmail": "",
        "AccessComments": "",
        "RelatedURL": "",
        "DistanceUnit": 0
    },
    "Connections": [
        {
            "ID": 160102,
            "ConnectionTypeID": 2,
            "StatusTypeID": 50,
            "LevelID": 3,
            "PowerKW": 22,
            "CurrentTypeID": 30
        },
        {
            "ID": 160103,
            "ConnectionTypeID": 33,
            "StatusTypeID": 50,
            "LevelID": 3,
            "PowerKW": 22,
            "CurrentTypeID": 30
        }
    ],
    "NumberOfPoints": 2,
    "GeneralComments": "",
    "StatusTypeID": 50,
    "DateLastStatusUpdate": "2018-12-23T16:22:00Z",
    "DataQualityLevel": 1,
    "DateCreated": "2018-12-23T09:00:00Z",
    "SubmissionStatusTypeID": 200
}