{
    "IsRecentlyVerified": false,
    "ID": 179161,
    "UUID": "0B61CEDA-65D8-44C3-A153-CB2F0DDC01CA",
    "DataProviderID": 29,
    "DataProvidersReference": "4562,2388",
    "OperatorID": 86,
    "AddressInfo": {
        "ID": 179520,
        "Title": "In den Kistenwiesen 2/1",
        "AddressLine1": "In den Kistenwiesen 2/1",
        "Town": "Crailsheim",
        "Postcode": "74564",
        "CountryID": 87,
        "Latitude": 49.14262,
        "Longitude": 10.07366,
        "DistanceUnit": 0
    },
    "Connections": [
        {
            "ID": 280579,
            "ConnectionTypeID": 28,
            "StatusTypeID": 50,
            "LevelID": 2,
            "PowerKW": 22,
            "CurrentTypeID": 10
        },
        {
            "ID": 280580,
            "ConnectionTypeID": 28,
            "StatusTypeID": 50,
            "LevelID": 2,
            "PowerKW": 22,
            "CurrentTypeID": 10
        },
        {
            "ID": 280581,
            "ConnectionTypeID": 25,
            "StatusTypeID": 50,
            "LevelID": 2,
            "PowerKW": 22,
            "CurrentTypeID": 20
        },
        {
            "ID": 280582,
            "ConnectionTypeID": 25,
            "StatusTypeID": 50,
            "LevelID": 2,
            "PowerKW": 22,
            "CurrentTypeID": 20
        }
    ],
    "StatusTypeID": 50,
    "DateLastStatusUpdate": "2021-07-09T03:15:00Z",
    "MetadataValues": [
        {
            "ID": 11455,
            "MetadataFieldID": 4,
            "ItemValue": "Data from the German chargepoint registry provided by Bundesnetzagentur.de under the CC-BY 4.0 license"
        }
    ],
    "DataQualityLevel": 3,
    "DateCreated": "2021-07-08T09:59:00Z",
    "SubmissionStatusTypeID": 100
}