{
    "IsRecentlyVerified": false,
    "ID": 73989,
    "UUID": "622EC2C8-1C01-428B-8F38-D8B94CDABC81",
    "DataProviderID": 1,
    "OperatorID": 89,
    "OperatorsReference": "CEA-253",
    "UsageTypeID": 4,
    "UsageCost": "CAD 2.50",
    "AddressInfo": {
        "ID": 74335,
        "Title": "Acton Vale-Gare d'Acton Vale",
        "AddressLine1": "960 rue Boulay",
        "Town": "Acton Vale",
        "StateOrProvince": "QC",
        "Postcode": "J0H 1A0",
        "CountryID": 44,
        "Latitude": 45.6486063750392,
        "Longitude": -72.5642828739813,
        "DistanceUnit": 0
    },
    "Connections": [
        {
            "ID": 106303,
            "ConnectionTypeID": 1,
            "StatusTypeID": 50,
            "LevelID": 2,
            "Amps": 32,
            "Voltage": 230,
            "PowerKW": 7,
            "CurrentTypeID": 10,
            "Quantity": 1
        }
    ],
    "NumberOfPoints": 1,
    "StatusTypeID": 50,
    "DateLastStatusUpdate": "2017-06-09T08:14:00Z",
    "DataQualityLevel": 1,
    "DateCreated": "2016-11-23T23:51:00Z",
    "SubmissionStatusTypeID": 200
}