{
    "IsRecentlyVerified": false,
    "ID": 137390,
    "UUID": "6DFD9F25-04C6-4AEC-91B0-A883FF6F81EE",
    "DataProviderID": 2,
    "DataProvidersReference": "98976",
    "OperatorID": 59,
    "UsageTypeID": 1,
    "AddressInfo": {
        "ID": 137736,
        "Title": "Greenlots - 63034",
        "AddressLine1": "3655 Cheney Highway",
        "Town": "Titusville",
        "StateOrProvince": "FL",
        "Postcode": "32780",
        "CountryID": 2,
        "Latitude": 28.5499954223633,
        "Longitude": -80.8529968261719,
        "ContactTelephone1": "855-900-7584",
        "AccessComments": "24 hours daily",
        "RelatedURL": "http://greenlots.com/",
        "DistanceUnit": 0
    },
    "Connections": [
        {
            "ID": 192293,
            "ConnectionTypeID": 2,
            "LevelID": 3,
            "Amps": 100,
            "Voltage": 400,
            "PowerKW": 40,
            "CurrentTypeID": 30,
            "Quantity": 1
        },
        {
            "ID": 192294,
            "ConnectionTypeID": 32,
            "LevelID": 3,
            "Amps": 100,
            "Voltage": 400,
            "PowerKW": 40,
            "CurrentTypeID": 30,
            "Quantity": 1
        }
    ],
    "StatusTypeID": 50,
    "DateLastStatusUpdate": "2019-12-24T09:05:00Z",
    "DataQualityLevel": 3,
    "DateCreated": "2019-12-24T09:05:00Z",
    "SubmissionStatusTypeID": 100
}