{
    "IsRecentlyVerified": false,
    "ID": 177203,
    "UUID": "98FEE7D5-EE83-4E88-B1DD-6BC00A815384",
    "DataProviderID": 29,
    "DataProvidersReference": "4442",
    "OperatorID": 69,
    "AddressInfo": {
        "ID": 177562,
        "Title": "Bayernwerkstraße 4",
        "AddressLine1": "Bayernwerkstraße 4",
        "Town": "Finsing",
        "Postcode": "85464",
        "CountryID": 87,
        "Latitude": 48.221052,
        "Longitude": 11.800489,
        "DistanceUnit": 0
    },
    "Connections": [
        {
            "ID": 276065,
            "ConnectionTypeID": 25,
            "StatusTypeID": 50,
            "LevelID": 2,
            "PowerKW": 22,
            "CurrentTypeID": 20
        },
        {
            "ID": 276066,
            "ConnectionTypeID": 25,
            "StatusTypeID": 50,
            "LevelID": 2,
            "PowerKW": 22,
            "CurrentTypeID": 20
        }
    ],
    "StatusTypeID": 0,
    "DateLastStatusUpdate": "2021-07-12T02:40:00Z",
    "MetadataValues": [
        {
            "ID": 9497,
            "MetadataFieldID": 4,
            "ItemValue": "Data from the German chargepoint registry provided by Bundesnetzagentur.de under the CC-BY 4.0 license"
        }
    ],
    "DataQualityLevel": 3,
    "DateCreated": "2021-07-08T09:48:00Z",
    "SubmissionStatusTypeID": 100
}