{
    "IsRecentlyVerified": false,
    "ID": 112548,
    "UUID": "0C000990-268D-46B3-94DC-FF5449C76EB4",
    "DataProviderID": 1,
    "OperatorID": 80,
    "UsageTypeID": 4,
    "AddressInfo": {
        "ID": 112894,
        "Title": "Perrero Pettinati | EnelX",
        "AddressLine1": "Via Colonnello Pettinati",
        "Town": "Perrero",
        "StateOrProvince": "TO",
        "Postcode": "10060 ",
        "CountryID": 112,
        "Latitude": 44.9386195480555,
        "Longitude": 7.11210591364863,
        "ContactTelephone1": "800.069.850",
        "RelatedURL": "https://www.enelx.com/it/it/emobility",
        "DistanceUnit": 0
    },
    "Connections": [
        {
            "ID": 158336,
            "ConnectionTypeID": 25,
            "StatusTypeID": 50,
            "LevelID": 2,
            "Amps": 32,
            "Voltage": 400,
            "PowerKW": 22,
            "CurrentTypeID": 20,
            "Quantity": 1
        },
        {
            "ID": 158337,
            "ConnectionTypeID": 26,
            "StatusTypeID": 50,
            "LevelID": 2,
            "Amps": 16,
            "Voltage": 240,
            "PowerKW": 3.7,
            "CurrentTypeID": 10,
            "Quantity": 1
        }
    ],
    "NumberOfPoints": 2,
    "StatusTypeID": 50,
    "DateLastStatusUpdate": "2019-03-06T11:31:00Z",
    "DataQualityLevel": 1,
    "DateCreated": "2018-11-06T11:02:00Z",
    "SubmissionStatusTypeID": 200
}