{
    "IsRecentlyVerified": false,
    "ID": 68664,
    "UUID": "746C815B-B52E-40D3-87FB-0F99ADBEFF61",
    "DataProviderID": 1,
    "OperatorID": 2244,
    "UsageTypeID": 4,
    "AddressInfo": {
        "ID": 69010,
        "Title": "Ubitricity Ladepunkt am Bundesverband Solare Mobilität",
        "AddressLine1": "An der Kolonnade 2",
        "AddressLine2": "Mitte",
        "Town": "Berlin",
        "StateOrProvince": "Berlin",
        "Postcode": "10117",
        "CountryID": 87,
        "Latitude": 52.51222941050119,
        "Longitude": 13.382537492065474,
        "AccessComments": "Spezielles Ladekabel mit Abrechnungseinheit von ubitricity notwendig.",
        "DistanceUnit": 0
    },
    "Connections": [
        {
            "ID": 96290,
            "ConnectionTypeID": 25,
            "StatusTypeID": 50,
            "LevelID": 2,
            "Amps": 16,
            "Voltage": 230,
            "PowerKW": 3.7,
            "CurrentTypeID": 10,
            "Quantity": 1
        }
    ],
    "NumberOfPoints": 1,
    "StatusTypeID": 50,
    "DateLastStatusUpdate": "2016-06-15T06:58:00Z",
    "DataQualityLevel": 1,
    "DateCreated": "2016-06-15T06:58:00Z",
    "SubmissionStatusTypeID": 200
}