{
    "IsRecentlyVerified": false,
    "ID": 64166,
    "UUID": "FCB67158-3D89-477D-BCBF-9FA70CD6A752",
    "DataProviderID": 26,
    "DataProvidersReference": "75655",
    "OperatorID": 157,
    "OperatorsReference": "NewMotion 02014872",
    "UsageCost": "0.00 jaarabonnement",
    "AddressInfo": {
        "ID": 64512,
        "Title": "Winschoterweg 17",
        "AddressLine1": "Winschoterweg 17",
        "Town": "Bellingwedde",
        "Postcode": "9697 XC",
        "CountryID": 159,
        "Latitude": 53.1133367,
        "Longitude": 7.0608064,
        "ContactTelephone1": "088 0109500",
        "RelatedURL": "http://thenewmotion.nl/",
        "DistanceUnit": 0
    },
    "Connections": [
        {
            "ID": 82075,
            "ConnectionTypeID": 25,
            "LevelID": 2,
            "PowerKW": 3.7,
            "CurrentTypeID": 10
        }
    ],
    "NumberOfPoints": 1,
    "StatusTypeID": 50,
    "DateLastStatusUpdate": "2016-06-04T02:56:00Z",
    "DataQualityLevel": 3,
    "DateCreated": "2016-03-03T12:33:00Z",
    "SubmissionStatusTypeID": 100
}