{
    "IsRecentlyVerified": false,
    "ID": 140950,
    "UUID": "E310CCC9-A47C-4CC7-AC58-DC481463D4BA",
    "DataProviderID": 2,
    "DataProvidersReference": "150477",
    "OperatorID": 3318,
    "UsageTypeID": 1,
    "AddressInfo": {
        "ID": 141302,
        "Title": "Target T2829 - Alameda, CA",
        "AddressLine1": "2700 5th Street",
        "Town": "Alameda",
        "StateOrProvince": "CA",
        "Postcode": "94501",
        "CountryID": 2,
        "Latitude": 37.788584,
        "Longitude": -122.279794,
        "ContactTelephone1": "833-632-2778",
        "AccessComments": "24 hours daily",
        "RelatedURL": "https://www.electrifyamerica.com/",
        "DistanceUnit": 0
    },
    "Connections": [
        {
            "ID": 196732,
            "ConnectionTypeID": 2,
            "LevelID": 3,
            "Amps": 100,
            "Voltage": 400,
            "PowerKW": 40,
            "CurrentTypeID": 30,
            "Quantity": 1
        },
        {
            "ID": 196733,
            "ConnectionTypeID": 32,
            "LevelID": 3,
            "Amps": 100,
            "Voltage": 400,
            "PowerKW": 40,
            "CurrentTypeID": 30,
            "Quantity": 1
        }
    ],
    "StatusTypeID": 50,
    "DateLastStatusUpdate": "2020-06-26T02:59:00Z",
    "DataQualityLevel": 3,
    "DateCreated": "2019-12-24T09:14:00Z",
    "SubmissionStatusTypeID": 100
}