{
    "IsRecentlyVerified": false,
    "ID": 6807,
    "UUID": "A73548F7-BC22-48E7-BEE8-80BDE5C9CACB",
    "DataProviderID": 2,
    "DataProvidersReference": "40806",
    "UsageTypeID": 2,
    "AddressInfo": {
        "ID": 6708,
        "Title": "Rivers Casino",
        "AddressLine1": "3000 S River Rd",
        "Town": "Des Plaines",
        "StateOrProvince": "IL",
        "Postcode": "60018",
        "CountryID": 2,
        "Latitude": 41.99774,
        "Longitude": -87.864217,
        "ContactTelephone1": "847-795-0777",
        "AccessComments": "Employee and customer use only",
        "RelatedURL": "",
        "DistanceUnit": 0
    },
    "Connections": [
        {
            "ID": 4240,
            "ConnectionTypeID": 1,
            "LevelID": 2,
            "Amps": 16,
            "Voltage": 230,
            "PowerKW": 3.7,
            "CurrentTypeID": 10,
            "Quantity": 2
        },
        {
            "ID": 4241,
            "ConnectionTypeID": 0,
            "Quantity": 4
        },
        {
            "ID": 21228,
            "ConnectionTypeID": 1,
            "LevelID": 2,
            "Quantity": 4
        }
    ],
    "DateLastConfirmed": "2011-08-25T00:00:00Z",
    "StatusTypeID": 0,
    "DateLastStatusUpdate": "2020-06-26T03:05:00Z",
    "DataQualityLevel": 1,
    "DateCreated": "2011-10-10T12:26:00Z",
    "SubmissionStatusTypeID": 100
}