{
    "IsRecentlyVerified": false,
    "ID": 184924,
    "UUID": "4391C4F6-EA0E-4DC2-809D-0BA8F12F89C8",
    "DataProviderID": 29,
    "DataProvidersReference": "2728",
    "OperatorID": 220,
    "AddressInfo": {
        "ID": 185283,
        "Title": "Holtenklinker Straße 137",
        "AddressLine1": "Holtenklinker Straße 137",
        "Town": "Hamburg",
        "Postcode": "21029",
        "CountryID": 87,
        "Latitude": 53.47933,
        "Longitude": 10.23287,
        "DistanceUnit": 0
    },
    "Connections": [
        {
            "ID": 293793,
            "ConnectionTypeID": 28,
            "StatusTypeID": 50,
            "LevelID": 2,
            "PowerKW": 22,
            "CurrentTypeID": 20
        },
        {
            "ID": 293794,
            "ConnectionTypeID": 25,
            "StatusTypeID": 50,
            "LevelID": 2,
            "PowerKW": 22,
            "CurrentTypeID": 20
        },
        {
            "ID": 301360,
            "ConnectionTypeID": 28,
            "StatusTypeID": 50,
            "LevelID": 2,
            "PowerKW": 22,
            "CurrentTypeID": 20
        },
        {
            "ID": 301361,
            "ConnectionTypeID": 25,
            "StatusTypeID": 50,
            "LevelID": 2,
            "PowerKW": 22,
            "CurrentTypeID": 20
        }
    ],
    "StatusTypeID": 50,
    "DateLastStatusUpdate": "2021-07-12T02:51:00Z",
    "MetadataValues": [
        {
            "ID": 17215,
            "MetadataFieldID": 4,
            "ItemValue": "Data from the German chargepoint registry provided by Bundesnetzagentur.de under the CC-BY 4.0 license"
        }
    ],
    "DataQualityLevel": 3,
    "DateCreated": "2021-07-08T10:06:00Z",
    "SubmissionStatusTypeID": 100
}