{
    "UserComments": [
        {
            "ID": 23852,
            "ChargePointID": 112855,
            "CommentTypeID": 10,
            "UserName": "ForumElettrico.it",
            "Comment": "Appena dietro l'edificio abbiamo un bar ed un tabacchino, ma in pochi minuti a piedi si arriva in centro dove si trova di tutto per passare il tempo della ricarica. Andando invece nella direzione opposta, abbiamo il parco della memoria dove fra l'altro abbiamo un'altra colonnina. Leggi la recensione completa qui > https://www.forumelettrico.it/forum/post174714.html#p174714 ",
            "RelatedURL": "https://www.forumelettrico.it/forum/post174714.html#p174714 ",
            "DateCreated": "2021-02-05T05:19:52.24Z",
            "User": {
                "ID": 11749,
                "Username": "ForumElettrico.it"
            },
            "CheckinStatusTypeID": 10,
            "IsActionedByEditor": false
        },
        {
            "ID": 21289,
            "ChargePointID": 112855,
            "CommentTypeID": 10,
            "UserName": "ForumElettrico.it",
            "RelatedURL": "https://www.forumelettrico.it/forum/colonnina-enel-x-22-kw-correggio-re-via-fratelli-cervi-6-t6538.html",
            "DateCreated": "2019-08-03T15:47:57.933Z",
            "User": {
                "ID": 11749,
                "Username": "ForumElettrico.it"
            },
            "CheckinStatusTypeID": 10
        }
    ],
    "MediaItems": [
        {
            "ID": 26392,
            "ChargePointID": 112855,
            "ItemURL": "https://s3-ap-southeast-2.amazonaws.com/openchargemap/images/IT/OCM112855/OCM-112855.orig.2021020505200981.jpg",
            "ItemThumbnailURL": "https://s3-ap-southeast-2.amazonaws.com/openchargemap/images/IT/OCM112855/OCM-112855.thmb.2021020505200981.jpg",
            "Comment": "",
            "IsEnabled": true,
            "IsVideo": false,
            "IsFeaturedItem": false,
            "IsExternalResource": false,
            "User": {
                "ID": 11749,
                "Username": "ForumElettrico.it"
            },
            "DateCreated": "2021-02-05T05:20:00Z"
        },
        {
            "ID": 26393,
            "ChargePointID": 112855,
            "ItemURL": "https://s3-ap-southeast-2.amazonaws.com/openchargemap/images/IT/OCM112855/OCM-112855.orig.2021020505201721.jpg",
            "ItemThumbnailURL": "https://s3-ap-southeast-2.amazonaws.com/openchargemap/images/IT/OCM112855/OCM-112855.thmb.2021020505201721.jpg",
            "Comment": "",
            "IsEnabled": true,
            "IsVideo": false,
            "IsFeaturedItem": false,
            "IsExternalResource": false,
            "User": {
                "ID": 11749,
                "Username": "ForumElettrico.it"
            },
            "DateCreated": "2021-02-05T05:20:00Z"
        },
        {
            "ID": 26394,
            "ChargePointID": 112855,
            "ItemURL": "https://s3-ap-southeast-2.amazonaws.com/openchargemap/images/IT/OCM112855/OCM-112855.orig.2021020505202379.jpg",
            "ItemThumbnailURL": "https://s3-ap-southeast-2.amazonaws.com/openchargemap/images/IT/OCM112855/OCM-112855.thmb.2021020505202379.jpg",
            "Comment": "",
            "IsEnabled": true,
            "IsVideo": false,
            "IsFeaturedItem": false,
            "IsExternalResource": false,
            "User": {
                "ID": 11749,
                "Username": "ForumElettrico.it"
            },
            "DateCreated": "2021-02-05T05:20:00Z"
        },
        {
            "ID": 19113,
            "ChargePointID": 112855,
            "ItemURL": "https://s3-ap-southeast-2.amazonaws.com/openchargemap/images/IT/OCM112855/OCM-112855.orig.2019080315482128.jpg",
            "ItemThumbnailURL": "https://s3-ap-southeast-2.amazonaws.com/openchargemap/images/IT/OCM112855/OCM-112855.thmb.2019080315482128.jpg",
            "Comment": "",
            "IsEnabled": true,
            "IsVideo": false,
            "IsFeaturedItem": false,
            "IsExternalResource": false,
            "User": {
                "ID": 11749,
                "Username": "ForumElettrico.it"
            },
            "DateCreated": "2019-08-03T15:49:00Z"
        },
        {
            "ID": 19114,
            "ChargePointID": 112855,
            "ItemURL": "https://s3-ap-southeast-2.amazonaws.com/openchargemap/images/IT/OCM112855/OCM-112855.orig.2019080315482653.jpg",
            "ItemThumbnailURL": "https://s3-ap-southeast-2.amazonaws.com/openchargemap/images/IT/OCM112855/OCM-112855.thmb.2019080315482653.jpg",
            "Comment": "",
            "IsEnabled": true,
            "IsVideo": false,
            "IsFeaturedItem": false,
            "IsExternalResource": false,
            "User": {
                "ID": 11749,
                "Username": "ForumElettrico.it"
            },
            "DateCreated": "2019-08-03T15:49:00Z"
        },
        {
            "ID": 19111,
            "ChargePointID": 112855,
            "ItemURL": "https://s3-ap-southeast-2.amazonaws.com/openchargemap/images/IT/OCM112855/OCM-112855.orig.2019080315480876.jpg",
            "ItemThumbnailURL": "https://s3-ap-southeast-2.amazonaws.com/openchargemap/images/IT/OCM112855/OCM-112855.thmb.2019080315480876.jpg",
            "Comment": "",
            "IsEnabled": true,
            "IsVideo": false,
            "IsFeaturedItem": false,
            "IsExternalResource": false,
            "User": {
                "ID": 11749,
                "Username": "ForumElettrico.it"
            },
            "DateCreated": "2019-08-03T15:48:00Z"
        },
        {
            "ID": 19112,
            "ChargePointID": 112855,
            "ItemURL": "https://s3-ap-southeast-2.amazonaws.com/openchargemap/images/IT/OCM112855/OCM-112855.orig.2019080315481505.jpg",
            "ItemThumbnailURL": "https://s3-ap-southeast-2.amazonaws.com/openchargemap/images/IT/OCM112855/OCM-112855.thmb.2019080315481505.jpg",
            "Comment": "",
            "IsEnabled": true,
            "IsVideo": false,
            "IsFeaturedItem": false,
            "IsExternalResource": false,
            "User": {
                "ID": 11749,
                "Username": "ForumElettrico.it"
            },
            "DateCreated": "2019-08-03T15:48:00Z"
        }
    ],
    "IsRecentlyVerified": false,
    "ID": 112855,
    "UUID": "D38CC19F-0DE7-4AAA-9BCB-4005FF86E017",
    "DataProviderID": 1,
    "OperatorID": 80,
    "UsageTypeID": 4,
    "AddressInfo": {
        "ID": 113201,
        "Title": "Correggio Fratelli Cervi | EnelX",
        "AddressLine1": "Viale Fratelli Cervi",
        "Town": "Correggio",
        "StateOrProvince": "RE",
        "Postcode": "42015 ",
        "CountryID": 112,
        "Latitude": 44.7685715525085,
        "Longitude": 10.777159818773,
        "ContactTelephone1": "800.069.850",
        "RelatedURL": "https://www.enelx.com/it/it/emobility",
        "DistanceUnit": 0
    },
    "Connections": [
        {
            "ID": 158946,
            "ConnectionTypeID": 25,
            "StatusTypeID": 150,
            "LevelID": 2,
            "Amps": 32,
            "Voltage": 400,
            "PowerKW": 22,
            "CurrentTypeID": 20,
            "Quantity": 2
        }
    ],
    "NumberOfPoints": 2,
    "StatusTypeID": 50,
    "DateLastStatusUpdate": "2021-02-05T05:20:00Z",
    "DataQualityLevel": 1,
    "DateCreated": "2018-11-21T10:47:00Z",
    "SubmissionStatusTypeID": 200
}