{
    "IsRecentlyVerified": false,
    "ID": 91291,
    "UUID": "F6438C23-4B58-41D6-9240-176894522D9F",
    "DataProviderID": 1,
    "OperatorID": 3297,
    "UsageTypeID": 4,
    "AddressInfo": {
        "ID": 91637,
        "Title": "Marktplatz",
        "AddressLine1": "Weschnitzer Straße 4",
        "Town": "Grasellenbach",
        "StateOrProvince": "Kreis Bergstraße",
        "Postcode": "64689",
        "CountryID": 87,
        "Latitude": 49.6360016861012,
        "Longitude": 8.83229793005945,
        "ContactTelephone1": "+49 800 4800 888",
        "AccessComments": "Neben Hammelbacher Döner- und Pizzahaus. 24/7 nutzbar mit Entega Flat, New Motion und komp. Ladekarten.",
        "RelatedURL": "http://www.entega.de/energie-sparen/ladestation-elektroauto",
        "DistanceUnit": 0
    },
    "Connections": [
        {
            "ID": 129440,
            "ConnectionTypeID": 25,
            "StatusTypeID": 50,
            "LevelID": 2,
            "Amps": 32,
            "Voltage": 400,
            "PowerKW": 22,
            "CurrentTypeID": 20,
            "Quantity": 2
        }
    ],
    "NumberOfPoints": 2,
    "GeneralComments": "Betreiber ist die Entega Energie GmbH",
    "StatusTypeID": 50,
    "DateLastStatusUpdate": "2017-09-27T08:11:00Z",
    "DataQualityLevel": 1,
    "DateCreated": "2017-08-03T11:14:00Z",
    "SubmissionStatusTypeID": 200
}