{
    "IsRecentlyVerified": false,
    "ID": 29781,
    "UUID": "BDAE395E-A2F9-4885-A70A-34C8BAD59729",
    "DataProviderID": 15,
    "DataProvidersReference": "32113",
    "OperatorID": 5,
    "AddressInfo": {
        "ID": 30127,
        "Title": "3050 Spruce St",
        "AddressLine1": "3050 Spruce St",
        "Town": "St. Louis",
        "StateOrProvince": "Missouri",
        "Postcode": "63103",
        "CountryID": 2,
        "Latitude": 38.62974705,
        "Longitude": -90.22688335,
        "ContactTelephone1": "(800) 521-8956",
        "RelatedURL": "http://carstations.com/32113",
        "DistanceUnit": 0
    },
    "Connections": [
        {
            "ID": 32766,
            "ConnectionTypeID": 1,
            "Reference": "J1772",
            "LevelID": 2
        }
    ],
    "StatusTypeID": 0,
    "DateLastStatusUpdate": "2017-11-04T14:04:00Z",
    "DataQualityLevel": 2,
    "DateCreated": "2014-11-29T05:39:00Z",
    "SubmissionStatusTypeID": 100
}