{
    "IsRecentlyVerified": false,
    "ID": 139310,
    "UUID": "C2F14348-913B-48BC-AA22-C1B92A12FD54",
    "DataProviderID": 2,
    "DataProvidersReference": "149131",
    "OperatorID": 39,
    "UsageTypeID": 1,
    "AddressInfo": {
        "ID": 139662,
        "Title": "725 Ponce",
        "AddressLine1": "725 Ponce De Leon Avenue Northeast",
        "Town": "Atlanta",
        "StateOrProvince": "GA",
        "Postcode": "30306",
        "CountryID": 2,
        "Latitude": 33.77169,
        "Longitude": -84.363355,
        "ContactTelephone1": "800-663-5633",
        "AccessComments": "MO: Not Specified; TU: Not Specified; WE: Not Specified; TH: Not Specified; FR: Not Specified; SA: Not Specified; SU: Not Specified",
        "RelatedURL": "http://www.semacharge.com/",
        "DistanceUnit": 0
    },
    "Connections": [
        {
            "ID": 194622,
            "ConnectionTypeID": 1,
            "LevelID": 2,
            "Amps": 16,
            "Voltage": 230,
            "PowerKW": 3.7,
            "CurrentTypeID": 10,
            "Quantity": 8
        }
    ],
    "StatusTypeID": 50,
    "DateLastStatusUpdate": "2020-06-26T02:56:00Z",
    "DataQualityLevel": 3,
    "DateCreated": "2019-12-24T09:10:00Z",
    "SubmissionStatusTypeID": 100
}