{
    "IsRecentlyVerified": false,
    "ID": 161526,
    "UUID": "8D2DE849-A77B-4AE5-B84B-D961D5C61C67",
    "DataProviderID": 1,
    "OperatorID": 3390,
    "UsageTypeID": 4,
    "AddressInfo": {
        "ID": 161883,
        "Title": "ElectroUA #0446",
        "AddressLine1": "Mykoly Zakrevskoho Street",
        "AddressLine2": "Troieschyna",
        "Town": "Kyiv",
        "Postcode": "02222",
        "CountryID": 234,
        "Latitude": 50.51069948041146,
        "Longitude": 30.623882782137116,
        "DistanceUnit": 0
    },
    "Connections": [
        {
            "ID": 232452,
            "ConnectionTypeID": 1,
            "StatusTypeID": 50,
            "LevelID": 2,
            "PowerKW": 7,
            "Quantity": 3
        }
    ],
    "NumberOfPoints": 1,
    "StatusTypeID": 50,
    "DateLastStatusUpdate": "2020-07-16T08:43:00Z",
    "DataQualityLevel": 1,
    "DateCreated": "2020-07-15T07:09:00Z",
    "SubmissionStatusTypeID": 200
}