{
    "IsRecentlyVerified": false,
    "ID": 74657,
    "UUID": "AC7F99A4-28E5-493E-BDA4-7C2DA86DDEE0",
    "DataProviderID": 1,
    "DataProvidersReference": "3586",
    "AddressInfo": {
        "ID": 75003,
        "Title": "Eslöv, Östergatan/Bastugatan",
        "AddressLine1": "Bastugatan 12",
        "Town": "ESLÖV",
        "StateOrProvince": "SKÅNE",
        "Postcode": "24133",
        "CountryID": 216,
        "Latitude": 55.83969,
        "Longitude": 13.30563,
        "AccessComments": "På parkeringen vid korsningen Östergatan/Bastugatan.",
        "DistanceUnit": 0
    },
    "Connections": [
        {
            "ID": 107281,
            "ConnectionTypeID": 0,
            "Reference": "1",
            "LevelID": 2,
            "Amps": 32,
            "Voltage": 400,
            "PowerKW": 22,
            "Comments": "Mode 3"
        },
        {
            "ID": 107282,
            "ConnectionTypeID": 0,
            "Reference": "2",
            "LevelID": 2,
            "Amps": 32,
            "Voltage": 400,
            "PowerKW": 22,
            "Comments": "Mode 3"
        }
    ],
    "NumberOfPoints": 2,
    "DateLastStatusUpdate": "2020-05-26T08:21:00Z",
    "DataQualityLevel": 2,
    "DateCreated": "2016-12-03T02:36:00Z",
    "SubmissionStatusTypeID": 100
}