{
    "IsRecentlyVerified": false,
    "ID": 90275,
    "UUID": "072641F4-FB6C-40B0-89EF-C38D297AA161",
    "DataProviderID": 1,
    "OperatorID": 23,
    "OperatorsReference": "30578",
    "UsageTypeID": 4,
    "AddressInfo": {
        "ID": 90621,
        "Title": "Cherry Tree Lodge",
        "AddressLine1": "Cherry Tree Lodge",
        "Town": "Saline",
        "StateOrProvince": "Dunfermline",
        "Postcode": "KY12 9TA",
        "CountryID": 1,
        "Latitude": 56.12934,
        "Longitude": -3.585835,
        "ContactTelephone1": "+44 794 042 1038",
        "DistanceUnit": 0
    },
    "Connections": [
        {
            "ID": 127928,
            "ConnectionTypeID": 30,
            "StatusTypeID": 50,
            "LevelID": 2,
            "Amps": 32,
            "Voltage": 230,
            "PowerKW": 13,
            "CurrentTypeID": 20,
            "Quantity": 1
        }
    ],
    "NumberOfPoints": 1,
    "GeneralComments": "1 Tesla Connector, up to 13kW.Available for customers. Please call ahead.",
    "StatusTypeID": 50,
    "DateLastStatusUpdate": "2018-10-03T17:26:00Z",
    "DataQualityLevel": 1,
    "DateCreated": "2017-07-13T14:36:00Z",
    "SubmissionStatusTypeID": 200
}