{
    "IsRecentlyVerified": false,
    "ID": 85644,
    "UUID": "4A375716-04BC-402B-8BCF-EA8057FB225F",
    "DataProviderID": 1,
    "OperatorID": 23,
    "OperatorsReference": "26413",
    "UsageTypeID": 6,
    "AddressInfo": {
        "ID": 85990,
        "Title": "Romantik Hotel Schweizerhof Grindelwald",
        "AddressLine1": "1 Swiss Alp Resort",
        "Town": "Grindelwald",
        "Postcode": "3818",
        "CountryID": 217,
        "Latitude": 46.625463,
        "Longitude": 8.031422,
        "ContactTelephone1": "+41 338 545858",
        "DistanceUnit": 0
    },
    "Connections": [
        {
            "ID": 121762,
            "ConnectionTypeID": 30,
            "StatusTypeID": 50,
            "LevelID": 2,
            "Amps": 32,
            "Voltage": 400,
            "PowerKW": 22,
            "CurrentTypeID": 20,
            "Quantity": 2
        }
    ],
    "NumberOfPoints": 2,
    "GeneralComments": "2 Tesla Connectors, up to 22kW.Available for patrons only. Please see front desk.",
    "StatusTypeID": 50,
    "DateLastStatusUpdate": "2018-10-03T15:26:00Z",
    "DataQualityLevel": 1,
    "DateCreated": "2017-04-10T05:38:00Z",
    "SubmissionStatusTypeID": 200
}