{
    "IsRecentlyVerified": false,
    "ID": 52900,
    "UUID": "D7034917-B474-4F23-8A20-0F6A2A39F9CA",
    "DataProviderID": 1,
    "OperatorID": 32,
    "OperatorsReference": "1686",
    "UsageTypeID": 6,
    "UsageCost": "Inclusive; for Polar Plus subscription members only",
    "AddressInfo": {
        "ID": 53246,
        "Title": "Westlands Toyota",
        "AddressLine1": "24 Buntsford Drive",
        "Town": "Bromsgrove",
        "Postcode": "B60 3AJ",
        "CountryID": 1,
        "Latitude": 52.314899,
        "Longitude": -2.06551,
        "AccessComments": "Left side of dealership",
        "DistanceUnit": 0
    },
    "Connections": [
        {
            "ID": 65843,
            "ConnectionTypeID": 25,
            "StatusTypeID": 50,
            "LevelID": 2,
            "Amps": 32,
            "Voltage": 230,
            "PowerKW": 7,
            "CurrentTypeID": 10,
            "Quantity": 2
        }
    ],
    "NumberOfPoints": 2,
    "StatusTypeID": 50,
    "DateLastStatusUpdate": "2019-03-05T06:14:00Z",
    "DataQualityLevel": 1,
    "DateCreated": "2015-09-13T21:35:00Z",
    "SubmissionStatusTypeID": 200
}