{
    "IsRecentlyVerified": false,
    "ID": 9809,
    "UUID": "479BF09C-7647-4510-8B84-EC2A91E2AF28",
    "DataProviderID": 1,
    "OperatorID": 19,
    "UsageTypeID": 1,
    "AddressInfo": {
        "ID": 9706,
        "Title": "The Barn at Brynich",
        "AddressLine1": "Brynich",
        "Town": "Brecon",
        "StateOrProvince": "Powys",
        "Postcode": "LD3 7SH",
        "CountryID": 1,
        "Latitude": 51.941737,
        "Longitude": -3.354432,
        "ContactTelephone1": "01874 623480",
        "ContactEmail": "admin@brynich.co.uk",
        "RelatedURL": "http://www.brynich.co.uk",
        "DistanceUnit": 0
    },
    "Connections": [
        {
            "ID": 7653,
            "ConnectionTypeID": 3,
            "StatusTypeID": 50,
            "LevelID": 2,
            "Amps": 13,
            "Voltage": 230,
            "PowerKW": 3,
            "CurrentTypeID": 10,
            "Quantity": 1
        },
        {
            "ID": 7654,
            "ConnectionTypeID": 4,
            "StatusTypeID": 50,
            "LevelID": 2,
            "Amps": 32,
            "Voltage": 230,
            "PowerKW": 7,
            "CurrentTypeID": 20,
            "Quantity": 1
        }
    ],
    "NumberOfPoints": 2,
    "StatusTypeID": 50,
    "DateLastStatusUpdate": "2017-04-21T17:20:00Z",
    "DataQualityLevel": 1,
    "DateCreated": "2012-04-27T08:04:00Z",
    "SubmissionStatusTypeID": 200
}