{
    "MediaItems": [
        {
            "ID": 4763,
            "ChargePointID": 59055,
            "ItemURL": "https://s3-ap-southeast-2.amazonaws.com/openchargemap/images/DE/OCM59055/OCM-59055.orig.2016011212363449.jpg",
            "ItemThumbnailURL": "https://s3-ap-southeast-2.amazonaws.com/openchargemap/images/DE/OCM59055/OCM-59055.thmb.2016011212363449.jpg",
            "Comment": "",
            "IsEnabled": true,
            "IsVideo": false,
            "IsFeaturedItem": false,
            "IsExternalResource": false,
            "User": {
                "ID": 6678,
                "Username": "Stadtwerke Duesseldorf"
            },
            "DateCreated": "2016-01-12T12:37:00Z"
        }
    ],
    "IsRecentlyVerified": false,
    "ID": 59055,
    "UUID": "FF9D9FB6-7E85-42B8-8271-837D90829469",
    "DataProviderID": 1,
    "OperatorID": 235,
    "UsageTypeID": 4,
    "UsageCost": "0",
    "AddressInfo": {
        "ID": 59401,
        "Title": "SWD Classic Remise Düsseldorf",
        "AddressLine1": "Harffstraße 110 a",
        "AddressLine2": "Oberbilk",
        "Town": "Düsseldorf",
        "Postcode": "40591",
        "CountryID": 87,
        "Latitude": 51.194987269,
        "Longitude": 6.822851086,
        "ContactTelephone1": "0211/821-8210",
        "ContactTelephone2": "0211/821-4093",
        "ContactEmail": "elektromobilitaet@swd-ag.de",
        "AccessComments": "Parkplatz\r\nÖffnungszeiten:\r\nMontags bis Samstags: 8.00 – 23.00 Uhr\r\n Sonn- und Feiertags: 10.00 – 20.00 Uhr ",
        "RelatedURL": "http://www.emobil-nrw.de",
        "DistanceUnit": 0
    },
    "Connections": [
        {
            "ID": 74928,
            "ConnectionTypeID": 25,
            "StatusTypeID": 50,
            "LevelID": 2,
            "Amps": 16,
            "Voltage": 400,
            "PowerKW": 11,
            "CurrentTypeID": 20,
            "Quantity": 1
        },
        {
            "ID": 74929,
            "ConnectionTypeID": 28,
            "StatusTypeID": 50,
            "LevelID": 2,
            "Amps": 16,
            "Voltage": 230,
            "PowerKW": 3.7,
            "CurrentTypeID": 10,
            "Quantity": 1
        }
    ],
    "NumberOfPoints": 2,
    "GeneralComments": "Nutzbar mit:\r\nElektronauten-Ladekarte (EnBW)\r\nLadekarte der Stadtwerke Hilden GmbH\r\nLadekarte der Stadtwerke Düsseldorf AG\r\nhttps://www.swd-ag.de/formulare/tankkarte/",
    "StatusTypeID": 50,
    "DateLastStatusUpdate": "2016-03-03T07:45:00Z",
    "DataQualityLevel": 1,
    "DateCreated": "2016-01-06T13:39:00Z",
    "SubmissionStatusTypeID": 200
}