{
    "IsRecentlyVerified": false,
    "ID": 122166,
    "UUID": "DAB13922-DF8C-4CE8-83C1-7A41C385CD15",
    "DataProviderID": 2,
    "DataProvidersReference": "103782",
    "UsageTypeID": 1,
    "AddressInfo": {
        "ID": 122512,
        "Title": "LADWP - Georgia Street",
        "AddressLine1": "1728 7/8 Georgia St",
        "Town": "Los Angeles",
        "StateOrProvince": "CA",
        "Postcode": "90015",
        "CountryID": 2,
        "Latitude": 34.036868,
        "Longitude": -118.272685,
        "ContactTelephone1": "800-342-5397",
        "AccessComments": "24 hours daily",
        "RelatedURL": "",
        "DistanceUnit": 0
    },
    "Connections": [
        {
            "ID": 172033,
            "ConnectionTypeID": 1,
            "LevelID": 2,
            "Amps": 16,
            "Voltage": 230,
            "PowerKW": 3.7,
            "CurrentTypeID": 10,
            "Quantity": 1
        }
    ],
    "DateLastStatusUpdate": "2020-06-26T02:56:00Z",
    "DataQualityLevel": 3,
    "DateCreated": "2019-04-06T05:02:00Z",
    "SubmissionStatusTypeID": 100
}