{
    "IsRecentlyVerified": false,
    "ID": 18768,
    "UUID": "21F359CD-12A0-4074-B06C-72C9774B3658",
    "DataProviderID": 15,
    "DataProvidersReference": "30907",
    "OperatorID": 1,
    "UsageTypeID": 1,
    "AddressInfo": {
        "ID": 19113,
        "Title": "????????????",
        "AddressLine1": "????????????",
        "Town": "??",
        "StateOrProvince": "",
        "Postcode": "200040",
        "CountryID": 50,
        "Latitude": 31.201643,
        "Longitude": 121.490936,
        "ContactTelephone1": "",
        "RelatedURL": "http://carstations.com/30907",
        "DistanceUnit": 0
    },
    "Connections": [
        {
            "ID": 19001,
            "ConnectionTypeID": 1,
            "Reference": "J1772",
            "LevelID": 2,
            "Quantity": 1
        }
    ],
    "NumberOfPoints": 1,
    "StatusTypeID": 0,
    "DateLastStatusUpdate": "2014-03-22T04:39:00Z",
    "DataQualityLevel": 2,
    "DateCreated": "2013-08-25T03:31:00Z",
    "SubmissionStatusTypeID": 200
}