{
    "IsRecentlyVerified": false,
    "ID": 174479,
    "UUID": "5EBB155C-80F2-4BBD-821E-111CCB43DCE2",
    "DataProviderID": 1,
    "OperatorID": 136,
    "UsageTypeID": 4,
    "UsageCost": "0.20€/kWh",
    "AddressInfo": {
        "ID": 174838,
        "Title": "Jokelan koulu",
        "AddressLine1": "Jyväkuja 13",
        "Town": "Tuusula",
        "StateOrProvince": "Southern Finland",
        "Postcode": "05400",
        "CountryID": 79,
        "Latitude": 60.548942241166145,
        "Longitude": 24.962506781508296,
        "RelatedURL": "http://www.virta.fi",
        "DistanceUnit": 0
    },
    "Connections": [
        {
            "ID": 270293,
            "ConnectionTypeID": 25,
            "StatusTypeID": 50,
            "LevelID": 2,
            "Amps": 32,
            "Voltage": 400,
            "PowerKW": 22,
            "CurrentTypeID": 20,
            "Quantity": 2
        }
    ],
    "NumberOfPoints": 2,
    "StatusTypeID": 50,
    "DateLastStatusUpdate": "2021-04-02T12:08:00Z",
    "DataQualityLevel": 1,
    "DateCreated": "2021-04-02T07:50:00Z",
    "SubmissionStatusTypeID": 200
}