{
    "IsRecentlyVerified": false,
    "ID": 15238,
    "UUID": "C5E966E2-5384-4F65-934A-A0A26F1B7E74",
    "DataProviderID": 1,
    "OperatorID": 3447,
    "UsageTypeID": 5,
    "UsageCost": "0,69€/kwH",
    "AddressInfo": {
        "ID": 15584,
        "Title": "Total - Ruisbroek Zuidwaarts",
        "AddressLine1": "E19 Parijs-Brussel",
        "AddressLine2": "",
        "Town": "Ruisbroek",
        "StateOrProvince": "",
        "Postcode": "1601",
        "CountryID": 26,
        "Latitude": 50.778969,
        "Longitude": 4.299853,
        "ContactTelephone1": "",
        "ContactTelephone2": "",
        "ContactEmail": "",
        "AccessComments": "De prijzen hangen af van de geselecteerde methode. Voor € 4,00 kunnen bestuurders hun batterijen opladen :      gedurende10 minuten (snel) ,     gedurende 20 minuten (matig snel) ,     gedurende 60 minuten (traag). ",
        "RelatedURL": "https://apps.total-ev-charge.com/charge-points/TOTAL-NB000915-001",
        "DistanceUnit": 0
    },
    "Connections": [
        {
            "ID": 13523,
            "ConnectionTypeID": 2,
            "StatusTypeID": 0,
            "LevelID": 2,
            "PowerKW": 100,
            "Quantity": 2
        },
        {
            "ID": 272280,
            "ConnectionTypeID": 33,
            "StatusTypeID": 50,
            "LevelID": 3,
            "PowerKW": 175,
            "CurrentTypeID": 30,
            "Quantity": 2
        }
    ],
    "NumberOfPoints": 2,
    "GeneralComments": "De prijzen hangen af van de geselecteerde methode. Voor € 4,00 kunnen bestuurders hun batterijen opladen :      gedurende10 minuten (snel) ,     gedurende 20 minuten (matig snel) ,     gedurende 60 minuten (traag).        Betalen is mogelijk met een prepaid PlugToDrive-kaart of aan de kassa van de Total Shop.",
    "StatusTypeID": 50,
    "DateLastStatusUpdate": "2021-05-21T20:47:00Z",
    "DataQualityLevel": 1,
    "DateCreated": "2012-12-27T19:19:00Z",
    "SubmissionStatusTypeID": 200
}