{
    "IsRecentlyVerified": false,
    "ID": 183385,
    "UUID": "1A82FB98-1921-4A2C-B093-C91A9D366B62",
    "DataProviderID": 29,
    "DataProvidersReference": "9876",
    "AddressInfo": {
        "ID": 183744,
        "Title": "Luckauer Straße / Schulstraße 4",
        "AddressLine1": "Luckauer Straße / Schulstraße 4",
        "Town": "Sonnewalde",
        "Postcode": "03249",
        "CountryID": 87,
        "Latitude": 51.696084,
        "Longitude": 13.649382,
        "DistanceUnit": 0
    },
    "Connections": [
        {
            "ID": 290311,
            "ConnectionTypeID": 25,
            "StatusTypeID": 50,
            "LevelID": 2,
            "PowerKW": 22,
            "CurrentTypeID": 20
        },
        {
            "ID": 290312,
            "ConnectionTypeID": 25,
            "StatusTypeID": 50,
            "LevelID": 2,
            "PowerKW": 22,
            "CurrentTypeID": 20
        }
    ],
    "StatusTypeID": 50,
    "DateLastStatusUpdate": "2021-07-09T03:24:00Z",
    "MetadataValues": [
        {
            "ID": 15678,
            "MetadataFieldID": 4,
            "ItemValue": "Data from the German chargepoint registry provided by Bundesnetzagentur.de under the CC-BY 4.0 license"
        }
    ],
    "DataQualityLevel": 3,
    "DateCreated": "2021-07-08T10:03:00Z",
    "SubmissionStatusTypeID": 100
}