{
    "IsRecentlyVerified": false,
    "ID": 63878,
    "UUID": "4BEA86AD-EF9D-4E52-8A0F-0A9EB6C1B95B",
    "DataProviderID": 26,
    "DataProvidersReference": "79130",
    "OperatorID": 73,
    "OperatorsReference": "EV-Box EVB-P1424080",
    "UsageCost": "0.00 jaarabonnement",
    "AddressInfo": {
        "ID": 64224,
        "Title": "Etta Palmstraat 153",
        "AddressLine1": "Etta Palmstraat 153",
        "Town": "Haarlemmermeer",
        "Postcode": "2135 LD",
        "CountryID": 159,
        "Latitude": 52.2961,
        "Longitude": 4.67723,
        "RelatedURL": "http://www.ev-box.nl",
        "DistanceUnit": 0
    },
    "Connections": [
        {
            "ID": 81621,
            "ConnectionTypeID": 25,
            "LevelID": 2,
            "PowerKW": 5,
            "CurrentTypeID": 10
        }
    ],
    "NumberOfPoints": 1,
    "StatusTypeID": 50,
    "DateLastStatusUpdate": "2016-06-04T02:52:00Z",
    "DataQualityLevel": 3,
    "DateCreated": "2016-03-03T12:32:00Z",
    "SubmissionStatusTypeID": 100
}