{
    "IsRecentlyVerified": false,
    "ID": 121803,
    "UUID": "4744920E-7371-44B0-98B0-C2635B4923FD",
    "DataProviderID": 2,
    "DataProvidersReference": "92422",
    "OperatorID": 5,
    "UsageTypeID": 1,
    "AddressInfo": {
        "ID": 122149,
        "Title": "UC IRVINE",
        "AddressLine1": "East Campus Parking Structure",
        "Town": "Irvine",
        "StateOrProvince": "CA",
        "Postcode": "92617",
        "CountryID": 2,
        "Latitude": 33.6447635,
        "Longitude": -117.8278153,
        "ContactTelephone1": "888-758-4389",
        "AccessComments": "24 hours daily",
        "RelatedURL": "http://www.chargepoint.com/",
        "DistanceUnit": 0
    },
    "Connections": [
        {
            "ID": 171632,
            "ConnectionTypeID": 1,
            "LevelID": 2,
            "Amps": 16,
            "Voltage": 230,
            "PowerKW": 3,
            "CurrentTypeID": 10,
            "Quantity": 7
        }
    ],
    "DateLastStatusUpdate": "2019-12-24T09:10:00Z",
    "DataQualityLevel": 3,
    "DateCreated": "2019-04-06T05:02:00Z",
    "SubmissionStatusTypeID": 100
}