{
    "IsRecentlyVerified": false,
    "ID": 88310,
    "UUID": "5316119C-5344-46B9-BC2F-8BA326BB0966",
    "DataProviderID": 1,
    "OperatorID": 23,
    "OperatorsReference": "30046",
    "UsageTypeID": 6,
    "AddressInfo": {
        "ID": 88656,
        "Title": "Explorer Hotel Oberstdorf",
        "AddressLine1": "3 An der Breitach",
        "Town": "Fischen",
        "Postcode": "87538",
        "CountryID": 87,
        "Latitude": 47.425775,
        "Longitude": 10.265785,
        "ContactTelephone1": "+49 8322 940790",
        "DistanceUnit": 0
    },
    "Connections": [
        {
            "ID": 125276,
            "ConnectionTypeID": 30,
            "StatusTypeID": 50,
            "LevelID": 2,
            "Amps": 32,
            "Voltage": 400,
            "PowerKW": 22,
            "CurrentTypeID": 20,
            "Quantity": 2
        }
    ],
    "NumberOfPoints": 2,
    "GeneralComments": "2 Tesla Connectors, up to 22kW.Available for patrons only. Please see front desk.",
    "StatusTypeID": 50,
    "DateLastStatusUpdate": "2018-10-03T18:11:00Z",
    "DataQualityLevel": 1,
    "DateCreated": "2017-05-27T05:53:00Z",
    "SubmissionStatusTypeID": 200
}