{
    "IsRecentlyVerified": false,
    "ID": 15222,
    "UUID": "83A985B4-08C6-4E2C-9D8E-E17A472CED35",
    "DataProviderID": 1,
    "OperatorID": 1,
    "UsageTypeID": 0,
    "UsageCost": "Free",
    "AddressInfo": {
        "ID": 15568,
        "Title": "Prestige Auto Nissan Nice",
        "AddressLine1": "79 Boulevard Gambetta",
        "AddressLine2": "",
        "Town": "Nice",
        "StateOrProvince": "",
        "Postcode": "06000",
        "CountryID": 80,
        "Latitude": 43.7032989,
        "Longitude": 7.25600350000002,
        "ContactTelephone1": "+33 4 92 15 82 15",
        "ContactTelephone2": "04 92 15 82 15",
        "ContactEmail": "",
        "AccessComments": "",
        "RelatedURL": "http://www.nissan-cotedazur.com",
        "DistanceUnit": 0
    },
    "Connections": [
        {
            "ID": 13512,
            "ConnectionTypeID": 2,
            "StatusTypeID": 0,
            "LevelID": 3,
            "Quantity": 1
        }
    ],
    "NumberOfPoints": 1,
    "GeneralComments": "",
    "StatusTypeID": 50,
    "DateLastStatusUpdate": "2012-12-25T19:19:00Z",
    "DataQualityLevel": 1,
    "DateCreated": "2012-12-25T19:19:00Z",
    "SubmissionStatusTypeID": 200
}