{
    "MediaItems": [
        {
            "ID": 21122,
            "ChargePointID": 148401,
            "ItemURL": "https://s3-ap-southeast-2.amazonaws.com/openchargemap/images/UA/OCM148401/OCM-148401.orig.2020020122463611.jpg",
            "ItemThumbnailURL": "https://s3-ap-southeast-2.amazonaws.com/openchargemap/images/UA/OCM148401/OCM-148401.thmb.2020020122463611.jpg",
            "Comment": "",
            "IsEnabled": true,
            "IsVideo": false,
            "IsFeaturedItem": false,
            "IsExternalResource": false,
            "User": {
                "ID": 24838,
                "Username": "StAlex"
            },
            "DateCreated": "2020-02-01T22:47:00Z"
        },
        {
            "ID": 21123,
            "ChargePointID": 148401,
            "ItemURL": "https://s3-ap-southeast-2.amazonaws.com/openchargemap/images/UA/OCM148401/OCM-148401.orig.2020020122464744.jpg",
            "ItemThumbnailURL": "https://s3-ap-southeast-2.amazonaws.com/openchargemap/images/UA/OCM148401/OCM-148401.thmb.2020020122464744.jpg",
            "Comment": "",
            "IsEnabled": true,
            "IsVideo": false,
            "IsFeaturedItem": false,
            "IsExternalResource": false,
            "User": {
                "ID": 24838,
                "Username": "StAlex"
            },
            "DateCreated": "2020-02-01T22:47:00Z"
        },
        {
            "ID": 21124,
            "ChargePointID": 148401,
            "ItemURL": "https://s3-ap-southeast-2.amazonaws.com/openchargemap/images/UA/OCM148401/OCM-148401.orig.2020020122470012.jpg",
            "ItemThumbnailURL": "https://s3-ap-southeast-2.amazonaws.com/openchargemap/images/UA/OCM148401/OCM-148401.thmb.2020020122470012.jpg",
            "Comment": "",
            "IsEnabled": true,
            "IsVideo": false,
            "IsFeaturedItem": false,
            "IsExternalResource": false,
            "User": {
                "ID": 24838,
                "Username": "StAlex"
            },
            "DateCreated": "2020-02-01T22:47:00Z"
        },
        {
            "ID": 21125,
            "ChargePointID": 148401,
            "ItemURL": "https://s3-ap-southeast-2.amazonaws.com/openchargemap/images/UA/OCM148401/OCM-148401.orig.2020020122471205.jpg",
            "ItemThumbnailURL": "https://s3-ap-southeast-2.amazonaws.com/openchargemap/images/UA/OCM148401/OCM-148401.thmb.2020020122471205.jpg",
            "Comment": "",
            "IsEnabled": true,
            "IsVideo": false,
            "IsFeaturedItem": false,
            "IsExternalResource": false,
            "User": {
                "ID": 24838,
                "Username": "StAlex"
            },
            "DateCreated": "2020-02-01T22:47:00Z"
        }
    ],
    "IsRecentlyVerified": false,
    "ID": 148401,
    "UUID": "CCF4C7F6-A824-4674-A978-DA4A38A907E2",
    "DataProviderID": 1,
    "OperatorID": 1,
    "UsageTypeID": 5,
    "AddressInfo": {
        "ID": 148753,
        "Title": "Ekopal",
        "AddressLine1": "вулиця Ринкова, 13",
        "Town": "Калуш",
        "StateOrProvince": "Івано-Франківська область",
        "Postcode": "77300",
        "CountryID": 234,
        "Latitude": 49.033797428057284,
        "Longitude": 24.35087004154809,
        "DistanceUnit": 0
    },
    "Connections": [
        {
            "ID": 206031,
            "ConnectionTypeID": 32,
            "LevelID": 3,
            "PowerKW": 50,
            "CurrentTypeID": 30
        },
        {
            "ID": 206032,
            "ConnectionTypeID": 2,
            "LevelID": 3,
            "PowerKW": 50,
            "CurrentTypeID": 30
        },
        {
            "ID": 206033,
            "ConnectionTypeID": 1036,
            "LevelID": 2,
            "Amps": 63,
            "Voltage": 400,
            "PowerKW": 43
        }
    ],
    "NumberOfPoints": 3,
    "StatusTypeID": 50,
    "DateLastStatusUpdate": "2020-02-16T09:14:00Z",
    "DataQualityLevel": 1,
    "DateCreated": "2020-02-01T22:46:00Z",
    "SubmissionStatusTypeID": 200
}