{
    "IsRecentlyVerified": false,
    "ID": 176450,
    "UUID": "660D18F4-2247-42B6-98AF-0DBF6801EA08",
    "DataProviderID": 29,
    "DataProvidersReference": "10269",
    "AddressInfo": {
        "ID": 176809,
        "Title": "Helfferichstr 5",
        "AddressLine1": "Helfferichstr 5",
        "Town": "Stuttgart",
        "Postcode": "70192",
        "CountryID": 87,
        "Latitude": 48.7901,
        "Longitude": 9.170601,
        "DistanceUnit": 0
    },
    "Connections": [
        {
            "ID": 274383,
            "ConnectionTypeID": 25,
            "StatusTypeID": 50,
            "LevelID": 2,
            "PowerKW": 22,
            "CurrentTypeID": 20
        },
        {
            "ID": 274384,
            "ConnectionTypeID": 25,
            "StatusTypeID": 50,
            "LevelID": 2,
            "PowerKW": 22,
            "CurrentTypeID": 20
        },
        {
            "ID": 274385,
            "ConnectionTypeID": 1036,
            "StatusTypeID": 50,
            "LevelID": 3,
            "PowerKW": 50,
            "CurrentTypeID": 20
        }
    ],
    "StatusTypeID": 0,
    "DateLastStatusUpdate": "2021-07-12T02:41:00Z",
    "MetadataValues": [
        {
            "ID": 8745,
            "MetadataFieldID": 4,
            "ItemValue": "Data from the German chargepoint registry provided by Bundesnetzagentur.de under the CC-BY 4.0 license"
        }
    ],
    "DataQualityLevel": 3,
    "DateCreated": "2021-07-08T09:48:00Z",
    "SubmissionStatusTypeID": 100
}