{
    "IsRecentlyVerified": false,
    "ID": 162673,
    "UUID": "5310DC77-D709-43A1-84D4-4065964688D7",
    "DataProviderID": 1,
    "OperatorID": 136,
    "UsageTypeID": 4,
    "UsageCost": "0,20€/kWh",
    "AddressInfo": {
        "ID": 163030,
        "Title": "Gate 8 park 1. outside",
        "AddressLine1": "Äyritie 8",
        "Town": "Vantaa",
        "StateOrProvince": "Southern Finland",
        "Postcode": "01510",
        "CountryID": 79,
        "Latitude": 60.29512402810826,
        "Longitude": 24.965996639039304,
        "RelatedURL": "http://www.virta.fi",
        "DistanceUnit": 0
    },
    "Connections": [
        {
            "ID": 234133,
            "ConnectionTypeID": 25,
            "StatusTypeID": 50,
            "LevelID": 2,
            "Amps": 16,
            "Voltage": 400,
            "PowerKW": 11,
            "CurrentTypeID": 20,
            "Quantity": 8
        }
    ],
    "NumberOfPoints": 8,
    "StatusTypeID": 50,
    "DateLastStatusUpdate": "2020-08-14T13:29:00Z",
    "DataQualityLevel": 1,
    "DateCreated": "2020-08-13T23:59:00Z",
    "SubmissionStatusTypeID": 200
}