{
    "IsRecentlyVerified": false,
    "ID": 151222,
    "UUID": "7AEF9783-52B6-4A83-9ABB-25B4E7BC9AF9",
    "DataProviderID": 28,
    "DataProvidersReference": "FR*S30*P30350*001",
    "OperatorID": 3257,
    "UsageTypeID": 5,
    "AddressInfo": {
        "ID": 151575,
        "Title": "LE VIGAN - Parking Mairie",
        "AddressLine1": "Parking Mairie 30120 LE VIGAN",
        "CountryID": 80,
        "Latitude": 43.993221,
        "Longitude": 3.606621,
        "AccessComments": "24h/24 7j/7",
        "DistanceUnit": 0
    },
    "Connections": [
        {
            "ID": 211014,
            "ConnectionTypeID": 28,
            "StatusTypeID": 50,
            "LevelID": 2,
            "PowerKW": 18,
            "CurrentTypeID": 10
        },
        {
            "ID": 211015,
            "ConnectionTypeID": 25,
            "StatusTypeID": 50,
            "LevelID": 2,
            "PowerKW": 18,
            "CurrentTypeID": 20
        },
        {
            "ID": 211016,
            "ConnectionTypeID": 26,
            "StatusTypeID": 50,
            "LevelID": 2,
            "PowerKW": 18
        },
        {
            "ID": 241068,
            "ConnectionTypeID": 28,
            "StatusTypeID": 50,
            "LevelID": 2,
            "PowerKW": 18,
            "CurrentTypeID": 10
        },
        {
            "ID": 241069,
            "ConnectionTypeID": 25,
            "StatusTypeID": 50,
            "LevelID": 2,
            "PowerKW": 18,
            "CurrentTypeID": 20
        },
        {
            "ID": 241070,
            "ConnectionTypeID": 26,
            "StatusTypeID": 50,
            "LevelID": 2,
            "PowerKW": 18
        }
    ],
    "GeneralComments": "Recharge par badge et avec une application smartphone",
    "StatusTypeID": 50,
    "DateLastStatusUpdate": "2020-08-27T05:11:00Z",
    "DataQualityLevel": 2,
    "DateCreated": "2020-03-15T10:53:00Z",
    "SubmissionStatusTypeID": 100
}