{
    "IsRecentlyVerified": false,
    "ID": 65118,
    "UUID": "B1D9DCBC-9B9F-4B91-BC34-DED8633529E5",
    "DataProviderID": 1,
    "OperatorID": 103,
    "UsageTypeID": 4,
    "AddressInfo": {
        "ID": 65464,
        "Title": "Rastpark Crailsheim-Satteldorf ",
        "AddressLine1": "Marco-Polo-Straße 1",
        "Town": "Satteldorf",
        "StateOrProvince": "Verwaltungsverband Crailsheim",
        "Postcode": "74589",
        "CountryID": 87,
        "Latitude": 49.18148221807903,
        "Longitude": 10.069436616117397,
        "ContactTelephone1": "+49 800 8866200",
        "AccessComments": "24/7 nutzbar. Allego Ladesäule nutzbar mit The New Motion Ladekarte, PlugSurfing Keyhanger, ChargeNow u.a. ",
        "RelatedURL": "http://allego.eu/",
        "DistanceUnit": 0
    },
    "Connections": [
        {
            "ID": 89627,
            "ConnectionTypeID": 2,
            "StatusTypeID": 50,
            "LevelID": 3,
            "PowerKW": 50,
            "CurrentTypeID": 30,
            "Quantity": 1
        },
        {
            "ID": 89628,
            "ConnectionTypeID": 33,
            "StatusTypeID": 50,
            "LevelID": 3,
            "PowerKW": 50,
            "CurrentTypeID": 30,
            "Quantity": 4
        },
        {
            "ID": 89629,
            "ConnectionTypeID": 25,
            "StatusTypeID": 50,
            "LevelID": 2,
            "Amps": 32,
            "Voltage": 400,
            "PowerKW": 22,
            "CurrentTypeID": 20,
            "Quantity": 3
        },
        {
            "ID": 89630,
            "ConnectionTypeID": 25,
            "StatusTypeID": 50,
            "LevelID": 3,
            "Amps": 63,
            "Voltage": 400,
            "PowerKW": 43,
            "CurrentTypeID": 20,
            "Quantity": 1
        }
    ],
    "NumberOfPoints": 5,
    "StatusTypeID": 150,
    "DateLastStatusUpdate": "2016-04-12T12:36:00Z",
    "DataQualityLevel": 1,
    "DateCreated": "2016-04-12T12:36:00Z",
    "SubmissionStatusTypeID": 200
}