{
    "IsRecentlyVerified": false,
    "ID": 177331,
    "UUID": "D7E66B81-A8AB-4857-B877-57958307032C",
    "DataProviderID": 29,
    "DataProvidersReference": "18259",
    "OperatorID": 127,
    "AddressInfo": {
        "ID": 177690,
        "Title": "Am Burggraben 2",
        "AddressLine1": "Am Burggraben 2",
        "Town": "Emden",
        "Postcode": "26721",
        "CountryID": 87,
        "Latitude": 53.367167056429,
        "Longitude": 7.201881408691,
        "DistanceUnit": 0
    },
    "Connections": [
        {
            "ID": 276360,
            "ConnectionTypeID": 25,
            "StatusTypeID": 50,
            "LevelID": 2,
            "PowerKW": 22,
            "CurrentTypeID": 20
        },
        {
            "ID": 276361,
            "ConnectionTypeID": 25,
            "StatusTypeID": 50,
            "LevelID": 2,
            "PowerKW": 22,
            "CurrentTypeID": 20
        }
    ],
    "StatusTypeID": 0,
    "DateLastStatusUpdate": "2021-07-12T02:51:00Z",
    "MetadataValues": [
        {
            "ID": 9625,
            "MetadataFieldID": 4,
            "ItemValue": "Data from the German chargepoint registry provided by Bundesnetzagentur.de under the CC-BY 4.0 license"
        }
    ],
    "DataQualityLevel": 3,
    "DateCreated": "2021-07-08T09:48:00Z",
    "SubmissionStatusTypeID": 100
}