{
    "IsRecentlyVerified": false,
    "ID": 79019,
    "UUID": "8DD55190-9BC9-4F02-9505-4B12A8C98F47",
    "DataProviderID": 1,
    "OperatorID": 23,
    "OperatorsReference": "19401",
    "UsageTypeID": 6,
    "UsageCost": "Free",
    "AddressInfo": {
        "ID": 79365,
        "Title": "Square Nine Hotel Belgrade",
        "AddressLine1": "Studentski TRG 9",
        "Town": "Beograd",
        "Postcode": "11000",
        "CountryID": 199,
        "Latitude": 44.819485,
        "Longitude": 20.456304,
        "ContactTelephone1": "+38 111 333 3500",
        "DistanceUnit": 0
    },
    "Connections": [
        {
            "ID": 113638,
            "ConnectionTypeID": 30,
            "StatusTypeID": 50,
            "LevelID": 2,
            "Amps": 32,
            "Voltage": 400,
            "PowerKW": 22,
            "CurrentTypeID": 20,
            "Quantity": 1
        }
    ],
    "NumberOfPoints": 1,
    "GeneralComments": "1 Tesla Connector, up to 22kW.Available for patrons only. Please see front desk.",
    "StatusTypeID": 50,
    "DateLastStatusUpdate": "2018-10-03T23:44:00Z",
    "DataQualityLevel": 1,
    "DateCreated": "2017-01-26T19:05:00Z",
    "SubmissionStatusTypeID": 200
}