{
    "IsRecentlyVerified": false,
    "ID": 131840,
    "UUID": "E538A615-0A71-4779-A02C-3260A161DFE2",
    "DataProviderID": 1,
    "OperatorID": 229,
    "UsageTypeID": 1,
    "AddressInfo": {
        "ID": 132186,
        "Title": "New World Paremata",
        "AddressLine1": "Dolly Varden Place",
        "AddressLine2": "Paremata",
        "Town": "Porirua",
        "StateOrProvince": "Porirua City",
        "Postcode": "5026",
        "CountryID": 161,
        "Latitude": -41.0948104234545,
        "Longitude": 174.868850068977,
        "DistanceUnit": 0
    },
    "Connections": [
        {
            "ID": 184504,
            "ConnectionTypeID": 2,
            "StatusTypeID": 50,
            "LevelID": 3,
            "PowerKW": 25,
            "CurrentTypeID": 30,
            "Quantity": 1
        },
        {
            "ID": 184505,
            "ConnectionTypeID": 33,
            "StatusTypeID": 50,
            "LevelID": 3,
            "PowerKW": 25,
            "CurrentTypeID": 30,
            "Quantity": 1
        }
    ],
    "NumberOfPoints": 1,
    "StatusTypeID": 50,
    "DateLastStatusUpdate": "2019-09-14T09:30:00Z",
    "DataQualityLevel": 1,
    "DateCreated": "2019-09-14T00:29:00Z",
    "SubmissionStatusTypeID": 200
}