{
    "UserComments": [
        {
            "ID": 13816,
            "ChargePointID": 40913,
            "CommentTypeID": 10,
            "UserName": "Robert Malcolm Kay",
            "Comment": "Stunning location, staff appear to be keeping clear from ICE, (green painted bays) and delivered a good charge on Chademo today.",
            "Rating": 4,
            "DateCreated": "2016-07-12T22:08:22.563Z",
            "User": {
                "ID": 4751,
                "Username": "Robert Malcolm Kay"
            },
            "CheckinStatusTypeID": 10
        },
        {
            "ID": 4562,
            "ChargePointID": 40913,
            "CommentTypeID": 50,
            "UserName": "",
            "Comment": "The E-volt equipment appears functional and is nicely protected under a shelter, but we could not try to charge because the two designated spaces (nicely marked in bright green) were occupied by ICE vehicles. When checking in for our ferry we asked about this and discovered that the person checking us in, and another member of staff, were using these spaces as staff parking.  Whilst the staff memberoffered to move her car, this clearly wasn't practical when there was a queue of passengers waiting to check in. Therefore, we advise anyone planning to charge here should arrive in plenty of time, in case the cars need to be moved. On our return journey, when we disembarked from the ferry we again saw ICE cars occupying these EV-charger spaces. Given that there is lots of parking space it shouldn't be a problem for the staff to move their cars...",
            "Rating": 5,
            "DateCreated": "2015-05-26T08:10:35.237Z",
            "CheckinStatusTypeID": 110
        }
    ],
    "MediaItems": [
        {
            "ID": 6025,
            "ChargePointID": 40913,
            "ItemURL": "https://s3-ap-southeast-2.amazonaws.com/openchargemap/images/GB/OCM40913/OCM-40913.orig.2016030522481350.jpeg",
            "ItemThumbnailURL": "https://s3-ap-southeast-2.amazonaws.com/openchargemap/images/GB/OCM40913/OCM-40913.thmb.2016030522481350.jpeg",
            "Comment": "",
            "IsEnabled": true,
            "IsVideo": false,
            "IsFeaturedItem": false,
            "IsExternalResource": false,
            "User": {
                "ID": 1192,
                "Username": "Anon74856763534"
            },
            "DateCreated": "2016-03-05T22:48:00Z"
        }
    ],
    "IsRecentlyVerified": false,
    "ID": 40913,
    "UUID": "3A19E267-51D5-41BC-BFEF-F47A8790153E",
    "DataProviderID": 1,
    "OperatorID": 3315,
    "OperatorsReference": "50526",
    "UsageTypeID": 4,
    "UsageCost": "Free",
    "AddressInfo": {
        "ID": 41259,
        "Title": "Kennacraig Ferry Terminal",
        "AddressLine1": "Whitehouse",
        "Town": "Kennacraig",
        "StateOrProvince": "Argyll",
        "Postcode": "PA29 6YF",
        "CountryID": 1,
        "Latitude": 55.8066954962559,
        "Longitude": -5.48303034385526,
        "AccessComments": "Access may be restricted outwith port opening hours.",
        "DistanceUnit": 0
    },
    "Connections": [
        {
            "ID": 44556,
            "ConnectionTypeID": 2,
            "StatusTypeID": 100,
            "LevelID": 3,
            "PowerKW": 50,
            "CurrentTypeID": 30,
            "Quantity": 1
        },
        {
            "ID": 44557,
            "ConnectionTypeID": 1036,
            "StatusTypeID": 100,
            "LevelID": 3,
            "Voltage": 400,
            "PowerKW": 43,
            "CurrentTypeID": 20,
            "Quantity": 1
        },
        {
            "ID": 44558,
            "ConnectionTypeID": 33,
            "StatusTypeID": 100,
            "LevelID": 3,
            "PowerKW": 50,
            "CurrentTypeID": 30,
            "Quantity": 1
        }
    ],
    "NumberOfPoints": 1,
    "StatusTypeID": 100,
    "DateLastStatusUpdate": "2020-03-06T06:13:00Z",
    "DataQualityLevel": 1,
    "DateCreated": "2015-01-16T15:41:00Z",
    "SubmissionStatusTypeID": 200
}