{
    "IsRecentlyVerified": false,
    "ID": 108719,
    "UUID": "5541BB8B-32A4-47DC-BD89-2E2FAE06A44C",
    "DataProviderID": 1,
    "OperatorID": 23,
    "OperatorsReference": "45846",
    "UsageTypeID": 4,
    "AddressInfo": {
        "ID": 109065,
        "Title": "Fistral Beach Hotel & Spa",
        "AddressLine1": "Esplanade Road",
        "Town": "Newquay",
        "StateOrProvince": "Cornwall",
        "Postcode": "TR7 1PT",
        "CountryID": 1,
        "Latitude": 50.412192,
        "Longitude": -5.106451,
        "ContactTelephone1": " +44 163 785 2221",
        "DistanceUnit": 0
    },
    "Connections": [
        {
            "ID": 153834,
            "ConnectionTypeID": 30,
            "StatusTypeID": 50,
            "LevelID": 2,
            "Amps": 16,
            "Voltage": 400,
            "PowerKW": 11,
            "CurrentTypeID": 20,
            "Quantity": 1
        }
    ],
    "NumberOfPoints": 1,
    "GeneralComments": "1 Tesla Connector, up to 11kW.Available to the public. Please see front desk.",
    "StatusTypeID": 50,
    "DateLastStatusUpdate": "2018-10-11T12:28:00Z",
    "DataQualityLevel": 1,
    "DateCreated": "2018-10-11T12:28:00Z",
    "SubmissionStatusTypeID": 200
}