{
    "IsRecentlyVerified": false,
    "ID": 172298,
    "UUID": "A247149D-6790-428A-94DF-7916BE68E86A",
    "DataProviderID": 1,
    "OperatorID": 21,
    "UsageTypeID": 4,
    "UsageCost": "Mobi.E compatible card or App",
    "AddressInfo": {
        "ID": 172657,
        "Title": "MOR-00001",
        "AddressLine1": "",
        "Town": "Mora",
        "StateOrProvince": "Évora",
        "Postcode": "",
        "CountryID": 180,
        "Latitude": 38.945962167496475,
        "Longitude": -8.163930350321039,
        "DistanceUnit": 0
    },
    "Connections": [
        {
            "ID": 263426,
            "ConnectionTypeID": 25,
            "StatusTypeID": 50,
            "LevelID": 2,
            "Amps": 32,
            "Voltage": 400,
            "PowerKW": 22,
            "CurrentTypeID": 20,
            "Quantity": 2
        }
    ],
    "NumberOfPoints": 2,
    "StatusTypeID": 50,
    "DateLastStatusUpdate": "2021-01-28T23:21:00Z",
    "DataQualityLevel": 1,
    "DateCreated": "2021-01-28T23:21:00Z",
    "SubmissionStatusTypeID": 200
}