{
    "IsRecentlyVerified": false,
    "ID": 38698,
    "UUID": "97ED2385-F94F-44FE-89B9-666D25701DB8",
    "DataProviderID": 26,
    "DataProvidersReference": "45729",
    "OperatorID": 73,
    "OperatorsReference": "EV-Box EVB-P1347098",
    "UsageCost": "0.00 jaarabonnement",
    "AddressInfo": {
        "ID": 39044,
        "Title": "Zuidlaan 15",
        "AddressLine1": "Zuidlaan 15",
        "Town": "Bergen (NH)",
        "Postcode": "1861 GS",
        "CountryID": 159,
        "Latitude": 52.67659,
        "Longitude": 4.69576,
        "RelatedURL": "http://www.ev-box.nl",
        "DistanceUnit": 0
    },
    "Connections": [
        {
            "ID": 42209,
            "ConnectionTypeID": 25,
            "LevelID": 2,
            "PowerKW": 5,
            "CurrentTypeID": 10
        }
    ],
    "NumberOfPoints": 1,
    "StatusTypeID": 50,
    "DateLastStatusUpdate": "2016-06-04T02:55:00Z",
    "DataQualityLevel": 3,
    "DateCreated": "2015-01-09T06:08:00Z",
    "SubmissionStatusTypeID": 100
}