{
    "IsRecentlyVerified": false,
    "ID": 187424,
    "UUID": "93F6C0D0-8332-494A-B878-C16F943CB61A",
    "DataProviderID": 18,
    "DataProvidersReference": "60090b323f4450a9a91af70ea24a056c",
    "OperatorID": 2244,
    "UsageTypeID": 5,
    "AddressInfo": {
        "ID": 187783,
        "Title": "27 Northcote Road",
        "AddressLine1": "27 Northcote Road",
        "Town": "London",
        "Postcode": "TW1 1PB",
        "CountryID": 1,
        "Latitude": -0.32595,
        "Longitude": 51.4603,
        "AccessComments": "",
        "RelatedURL": "https://www.ubitricity.com",
        "DistanceUnit": 0
    },
    "Connections": [
        {
            "ID": 302558,
            "ConnectionTypeID": 25,
            "Reference": "suby1100005336",
            "StatusTypeID": 50,
            "LevelID": 2,
            "Amps": 16,
            "Voltage": 230,
            "PowerKW": 3.7,
            "CurrentTypeID": 10
        }
    ],
    "StatusTypeID": 0,
    "DateLastStatusUpdate": "2021-07-12T03:38:00Z",
    "MetadataValues": [
        {
            "ID": 19664,
            "MetadataFieldID": 4,
            "ItemValue": "Contains public sector information licensed under the Open Government Licence v2.0. http://www.nationalarchives.gov.uk/doc/open-government-licence/version/2/"
        }
    ],
    "DataQualityLevel": 3,
    "DateCreated": "2021-07-12T03:38:00Z",
    "SubmissionStatusTypeID": 100
}