{
    "IsRecentlyVerified": false,
    "ID": 146168,
    "UUID": "BF8E0EE8-EC62-41D3-B31B-3E5FBAF0DEB0",
    "DataProviderID": 1,
    "OperatorID": 3315,
    "OperatorsReference": "52531",
    "UsageTypeID": 4,
    "UsageCost": "Free",
    "AddressInfo": {
        "ID": 146520,
        "Title": "Lenzie Railway Station, Lenzie",
        "AddressLine1": "Station Road",
        "Town": "Lenzie",
        "StateOrProvince": "Glasgow City",
        "Postcode": "G66 4UA",
        "CountryID": 1,
        "Latitude": 55.92127,
        "Longitude": -4.15442,
        "DistanceUnit": 0
    },
    "Connections": [
        {
            "ID": 203101,
            "ConnectionTypeID": 25,
            "StatusTypeID": 100,
            "LevelID": 2,
            "Amps": 32,
            "Voltage": 230,
            "PowerKW": 7,
            "CurrentTypeID": 10,
            "Quantity": 2
        }
    ],
    "NumberOfPoints": 2,
    "StatusTypeID": 100,
    "DateLastStatusUpdate": "2020-06-02T05:14:00Z",
    "DataQualityLevel": 1,
    "DateCreated": "2020-01-02T08:21:00Z",
    "SubmissionStatusTypeID": 200
}