{
    "MediaItems": [
        {
            "ID": 20949,
            "ChargePointID": 146631,
            "ItemURL": "https://s3-ap-southeast-2.amazonaws.com/openchargemap/images/DE/OCM146631/OCM-146631.orig.2020011221433922.png",
            "ItemThumbnailURL": "https://s3-ap-southeast-2.amazonaws.com/openchargemap/images/DE/OCM146631/OCM-146631.thmb.2020011221433922.png",
            "Comment": "",
            "IsEnabled": true,
            "IsVideo": false,
            "IsFeaturedItem": false,
            "IsExternalResource": false,
            "User": {
                "ID": 21695,
                "Username": "et42"
            },
            "DateCreated": "2020-01-12T21:44:00Z"
        },
        {
            "ID": 20950,
            "ChargePointID": 146631,
            "ItemURL": "https://s3-ap-southeast-2.amazonaws.com/openchargemap/images/DE/OCM146631/OCM-146631.orig.2020011221435241.png",
            "ItemThumbnailURL": "https://s3-ap-southeast-2.amazonaws.com/openchargemap/images/DE/OCM146631/OCM-146631.thmb.2020011221435241.png",
            "Comment": "",
            "IsEnabled": true,
            "IsVideo": false,
            "IsFeaturedItem": false,
            "IsExternalResource": false,
            "User": {
                "ID": 21695,
                "Username": "et42"
            },
            "DateCreated": "2020-01-12T21:44:00Z"
        },
        {
            "ID": 20948,
            "ChargePointID": 146631,
            "ItemURL": "https://s3-ap-southeast-2.amazonaws.com/openchargemap/images/DE/OCM146631/OCM-146631.orig.2020011221430759.png",
            "ItemThumbnailURL": "https://s3-ap-southeast-2.amazonaws.com/openchargemap/images/DE/OCM146631/OCM-146631.thmb.2020011221430759.png",
            "Comment": "",
            "IsEnabled": true,
            "IsVideo": false,
            "IsFeaturedItem": false,
            "IsExternalResource": false,
            "User": {
                "ID": 21695,
                "Username": "et42"
            },
            "DateCreated": "2020-01-12T21:43:00Z"
        }
    ],
    "IsRecentlyVerified": false,
    "ID": 146631,
    "UUID": "D6D7CB00-3ADB-4743-A449-D3DD52159CB0",
    "DataProviderID": 1,
    "OperatorID": 103,
    "UsageTypeID": 4,
    "AddressInfo": {
        "ID": 146983,
        "Title": "P+M Parkplatz GADA A8",
        "AddressLine1": "Kreuzackerstraße 1",
        "Town": "Bergkirchen",
        "Postcode": "85232",
        "CountryID": 87,
        "Latitude": 48.238650058087984,
        "Longitude": 11.353950056216718,
        "DistanceUnit": 0
    },
    "Connections": [
        {
            "ID": 203885,
            "ConnectionTypeID": 33,
            "StatusTypeID": 50,
            "LevelID": 3,
            "PowerKW": 350,
            "CurrentTypeID": 30,
            "Quantity": 4
        },
        {
            "ID": 203886,
            "ConnectionTypeID": 33,
            "StatusTypeID": 50,
            "LevelID": 2,
            "PowerKW": 50,
            "Quantity": 1
        },
        {
            "ID": 203887,
            "ConnectionTypeID": 2,
            "StatusTypeID": 50,
            "LevelID": 3,
            "PowerKW": 50,
            "CurrentTypeID": 30,
            "Quantity": 1
        },
        {
            "ID": 203888,
            "ConnectionTypeID": 1036,
            "StatusTypeID": 50,
            "LevelID": 3,
            "Amps": 63,
            "Voltage": 400,
            "PowerKW": 43,
            "CurrentTypeID": 20,
            "Quantity": 1
        }
    ],
    "NumberOfPoints": 6,
    "StatusTypeID": 50,
    "DateLastStatusUpdate": "2020-01-12T21:44:00Z",
    "DataQualityLevel": 1,
    "DateCreated": "2020-01-12T21:37:00Z",
    "SubmissionStatusTypeID": 200
}