{
    "IsRecentlyVerified": false,
    "ID": 173707,
    "UUID": "8BB92961-6A74-4521-969E-389400B051F4",
    "DataProviderID": 1,
    "OperatorID": 150,
    "UsageTypeID": 5,
    "AddressInfo": {
        "ID": 174066,
        "Title": "Henrietta Street",
        "AddressLine1": "Henrietta Street",
        "Town": "Batley",
        "Postcode": "WF17 5DN",
        "CountryID": 1,
        "Latitude": 53.715096,
        "Longitude": -1.634678,
        "AccessComments": "",
        "RelatedURL": "http://www.chargepointservices.com/",
        "DistanceUnit": 0
    },
    "Connections": [
        {
            "ID": 266878,
            "ConnectionTypeID": 25,
            "Reference": "1",
            "StatusTypeID": 50,
            "LevelID": 2,
            "Amps": 32,
            "Voltage": 400,
            "PowerKW": 22,
            "CurrentTypeID": 20,
            "Quantity": 1
        },
        {
            "ID": 266879,
            "ConnectionTypeID": 2,
            "Reference": "2",
            "StatusTypeID": 50,
            "LevelID": 3,
            "Amps": 125,
            "Voltage": 400,
            "PowerKW": 50,
            "CurrentTypeID": 30,
            "Quantity": 1
        },
        {
            "ID": 266880,
            "ConnectionTypeID": 33,
            "Reference": "3",
            "StatusTypeID": 50,
            "LevelID": 3,
            "Amps": 125,
            "Voltage": 400,
            "PowerKW": 50,
            "CurrentTypeID": 30,
            "Quantity": 1
        }
    ],
    "StatusTypeID": 50,
    "DateLastStatusUpdate": "2021-05-28T09:22:00Z",
    "MetadataValues": [
        {
            "ID": 8629,
            "MetadataFieldID": 4,
            "ItemValue": "Contains public sector information licensed under the Open Government Licence v2.0. http://www.nationalarchives.gov.uk/doc/open-government-licence/version/2/"
        }
    ],
    "DataQualityLevel": 3,
    "DateCreated": "2021-03-03T11:25:00Z",
    "SubmissionStatusTypeID": 100
}