{
    "IsRecentlyVerified": false,
    "ID": 159230,
    "UUID": "E6651837-9C97-4B00-84F0-D188DCD96AFA",
    "DataProviderID": 2,
    "DataProvidersReference": "158664",
    "OperatorID": 39,
    "UsageTypeID": 1,
    "AddressInfo": {
        "ID": 159587,
        "Title": "Fairfield Inn & Suites Bardstown",
        "AddressLine1": "1070 Morton Ave",
        "Town": "Bardstown",
        "StateOrProvince": "KY",
        "Postcode": "40004",
        "CountryID": 2,
        "Latitude": 37.8293829,
        "Longitude": -85.4761696,
        "ContactTelephone1": "800-663-5633",
        "AccessComments": "MO: Not Specified; TU: Not Specified; WE: Not Specified; TH: Not Specified; FR: Not Specified; SA: Not Specified; SU: Not Specified",
        "RelatedURL": "http://www.semacharge.com/",
        "DistanceUnit": 0
    },
    "Connections": [
        {
            "ID": 229359,
            "ConnectionTypeID": 1,
            "LevelID": 2,
            "Amps": 16,
            "Voltage": 230,
            "PowerKW": 3.7,
            "CurrentTypeID": 10,
            "Quantity": 2
        }
    ],
    "StatusTypeID": 50,
    "DateLastStatusUpdate": "2020-06-26T02:59:00Z",
    "DataQualityLevel": 3,
    "DateCreated": "2020-06-26T02:59:00Z",
    "SubmissionStatusTypeID": 100
}