{
    "IsRecentlyVerified": false,
    "ID": 84745,
    "UUID": "D7A75B92-9E83-414F-B5AE-A7766B06DA1D",
    "DataProviderID": 1,
    "OperatorID": 45,
    "UsageTypeID": 6,
    "AddressInfo": {
        "ID": 85091,
        "Title": "Seehotel Tauer",
        "AddressLine1": "Seestraße 20",
        "Town": "Tittling",
        "StateOrProvince": "Tittling (VGem)",
        "Postcode": "94104",
        "CountryID": 87,
        "Latitude": 48.7438885027288,
        "Longitude": 13.35434583068856,
        "ContactTelephone1": "+49 8504 760",
        "AccessComments": "Für Gäste, bitte vorher reservieren.",
        "RelatedURL": "http://www.seehof-tauer.de/",
        "DistanceUnit": 0
    },
    "Connections": [
        {
            "ID": 120394,
            "ConnectionTypeID": 17,
            "StatusTypeID": 50,
            "LevelID": 2,
            "Amps": 32,
            "Voltage": 400,
            "PowerKW": 22,
            "CurrentTypeID": 20,
            "Quantity": 1
        },
        {
            "ID": 120395,
            "ConnectionTypeID": 17,
            "StatusTypeID": 50,
            "LevelID": 2,
            "Amps": 16,
            "Voltage": 400,
            "PowerKW": 11,
            "CurrentTypeID": 20,
            "Quantity": 2
        }
    ],
    "NumberOfPoints": 3,
    "StatusTypeID": 50,
    "DateLastStatusUpdate": "2017-03-13T14:25:00Z",
    "DataQualityLevel": 1,
    "DateCreated": "2017-03-13T14:25:00Z",
    "SubmissionStatusTypeID": 200
}