{
    "IsRecentlyVerified": false,
    "ID": 129095,
    "UUID": "F53AA112-217E-480F-8689-58D30553F271",
    "DataProviderID": 1,
    "OperatorID": 80,
    "UsageTypeID": 4,
    "AddressInfo": {
        "ID": 129441,
        "Title": "Nurallao Via Roma | EnelX",
        "AddressLine1": "Via Roma, 105",
        "Town": "Nurallao",
        "StateOrProvince": "CA",
        "Postcode": "08030",
        "CountryID": 112,
        "Latitude": 39.791310201786786,
        "Longitude": 9.084269241815605,
        "RelatedURL": "https://www.enelx.com/it/it/emobility",
        "DistanceUnit": 0
    },
    "Connections": [
        {
            "ID": 180722,
            "ConnectionTypeID": 25,
            "StatusTypeID": 50,
            "LevelID": 2,
            "Amps": 32,
            "Voltage": 400,
            "PowerKW": 22,
            "CurrentTypeID": 20,
            "Quantity": 2
        }
    ],
    "NumberOfPoints": 2,
    "StatusTypeID": 50,
    "DateLastStatusUpdate": "2019-07-13T09:12:00Z",
    "DataQualityLevel": 1,
    "DateCreated": "2019-07-13T09:12:00Z",
    "SubmissionStatusTypeID": 200
}