{
    "IsRecentlyVerified": false,
    "ID": 80110,
    "UUID": "6F14034F-857B-47F3-B6BC-935D37E2FB2C",
    "DataProviderID": 2,
    "DataProvidersReference": "80824",
    "OperatorID": 5,
    "UsageTypeID": 1,
    "AddressInfo": {
        "ID": 80456,
        "Title": "ENDEAVOR REG",
        "AddressLine1": "Palm Way",
        "Town": "Austin",
        "StateOrProvince": "TX",
        "Postcode": "78758",
        "CountryID": 2,
        "Latitude": 30.4036314,
        "Longitude": -97.7199011,
        "ContactTelephone1": "888-758-4389",
        "AccessComments": "24 hours daily",
        "RelatedURL": "http://www.chargepoint.com/",
        "DistanceUnit": 0
    },
    "Connections": [
        {
            "ID": 114763,
            "ConnectionTypeID": 1,
            "LevelID": 2,
            "Amps": 16,
            "Voltage": 230,
            "PowerKW": 3,
            "CurrentTypeID": 10,
            "Quantity": 6
        }
    ],
    "DateLastStatusUpdate": "2019-12-24T09:09:00Z",
    "DataQualityLevel": 3,
    "DateCreated": "2017-01-31T01:05:00Z",
    "SubmissionStatusTypeID": 100
}