{
    "IsRecentlyVerified": false,
    "ID": 110375,
    "UUID": "BD2E2F63-2A4F-4CC1-AE58-2B9DAB521362",
    "DataProviderID": 2,
    "DataProvidersReference": "103808",
    "UsageTypeID": 2,
    "AddressInfo": {
        "ID": 110721,
        "Title": "Charleston Mitsubishi",
        "AddressLine1": "7010 MacCorkle Ave SW",
        "Town": "St. Albans",
        "StateOrProvince": "WV",
        "Postcode": "25177",
        "CountryID": 2,
        "Latitude": 38.377029,
        "Longitude": -81.785193,
        "ContactTelephone1": "304-721-8316",
        "AccessComments": "Service Center Use only",
        "RelatedURL": "",
        "DistanceUnit": 0
    },
    "Connections": [
        {
            "ID": 155624,
            "ConnectionTypeID": 1,
            "LevelID": 2,
            "Amps": 16,
            "Voltage": 230,
            "PowerKW": 3.7,
            "CurrentTypeID": 10,
            "Quantity": 1
        }
    ],
    "DateLastStatusUpdate": "2020-06-26T02:59:00Z",
    "DataQualityLevel": 3,
    "DateCreated": "2018-10-18T23:36:00Z",
    "SubmissionStatusTypeID": 100
}