{
    "IsRecentlyVerified": false,
    "ID": 56376,
    "UUID": "DE5E14A5-8B1B-45C8-AD7E-BF8E6A8F659D",
    "DataProviderID": 1,
    "OperatorID": 45,
    "UsageTypeID": 1,
    "AddressInfo": {
        "ID": 56722,
        "Title": "Bahnhof",
        "AddressLine1": "Rennsteig 3",
        "Town": "Schmiedefeld am Rennsteig",
        "StateOrProvince": "Rennsteig",
        "Postcode": "98711",
        "CountryID": 87,
        "Latitude": 50.61556296311024,
        "Longitude": 10.835588072585987,
        "ContactTelephone1": "+49 36704 7099-0",
        "AccessComments": "Mit Karte 24/7 nutzbar. Freischaltung über \"Thüringer Wald Card Plus\", im  Cafe des Rennsteigbahnhofs gleich gegenüber zu erwerben. Die Karte kostet 5 EUR. Vorerst ist das Laden kostenlos. Ab einer gewissen Lademenge muß man bezahlen (4,-€ pro Stunde).",
        "RelatedURL": "http://akkupunkttour.naturpark-thueringer-wald.eu/index.php?id=strom_tanken",
        "DistanceUnit": 0
    },
    "Connections": [
        {
            "ID": 71128,
            "ConnectionTypeID": 25,
            "StatusTypeID": 50,
            "LevelID": 2,
            "Amps": 16,
            "Voltage": 400,
            "PowerKW": 11,
            "CurrentTypeID": 20,
            "Quantity": 2
        },
        {
            "ID": 71129,
            "ConnectionTypeID": 28,
            "StatusTypeID": 50,
            "LevelID": 2,
            "Amps": 16,
            "Voltage": 230,
            "PowerKW": 3.7,
            "CurrentTypeID": 10,
            "Quantity": 2
        }
    ],
    "NumberOfPoints": 2,
    "StatusTypeID": 50,
    "DateLastStatusUpdate": "2015-11-03T13:19:00Z",
    "DataQualityLevel": 1,
    "DateCreated": "2015-11-03T13:19:00Z",
    "SubmissionStatusTypeID": 200
}