{
    "IsRecentlyVerified": false,
    "ID": 137764,
    "UUID": "6F3869A1-087C-410B-B461-66A88CA7EA8C",
    "DataProviderID": 2,
    "DataProvidersReference": "95770",
    "OperatorID": 9,
    "UsageTypeID": 2,
    "AddressInfo": {
        "ID": 138113,
        "Title": "Sharp-Birmingham",
        "AddressLine1": "7947 Birmingham Way",
        "Town": "San Diego",
        "StateOrProvince": "CA",
        "Postcode": "92123",
        "CountryID": 2,
        "Latitude": 32.797352,
        "Longitude": -117.153121,
        "ContactTelephone1": "888-998-2546",
        "AccessComments": "MON: 24 hours | TUE: 24 hours | WED: 24 hours | THU: 24 hours | FRI: 24 hours | SAT: 24 hours | SUN: 24 hours",
        "RelatedURL": "http://www.blinkcharging.com/",
        "DistanceUnit": 0
    },
    "Connections": [
        {
            "ID": 192755,
            "ConnectionTypeID": 1,
            "LevelID": 2,
            "Amps": 16,
            "Voltage": 230,
            "PowerKW": 3,
            "CurrentTypeID": 10,
            "Quantity": 5
        }
    ],
    "StatusTypeID": 50,
    "DateLastStatusUpdate": "2019-12-24T09:06:00Z",
    "DataQualityLevel": 3,
    "DateCreated": "2019-12-24T09:06:00Z",
    "SubmissionStatusTypeID": 100
}