{
    "IsRecentlyVerified": false,
    "ID": 120341,
    "UUID": "C47D40A9-DE97-4233-9E96-1488AA9470ED",
    "DataProviderID": 2,
    "DataProvidersReference": "39864",
    "UsageTypeID": 7,
    "AddressInfo": {
        "ID": 120687,
        "Title": "Jim Click Nissan",
        "AddressLine1": "800 W Auto Mall Dr",
        "Town": "Tucson",
        "StateOrProvince": "AZ",
        "Postcode": "85705",
        "CountryID": 2,
        "Latitude": 32.289823,
        "Longitude": -110.985646,
        "ContactTelephone1": "520-884-4100",
        "AccessComments": "Dealership business hours\r\nPublic - Call ahead",
        "RelatedURL": "",
        "DistanceUnit": 0
    },
    "Connections": [
        {
            "ID": 169677,
            "ConnectionTypeID": 1,
            "LevelID": 2,
            "Amps": 16,
            "Voltage": 230,
            "PowerKW": 3.7,
            "CurrentTypeID": 10,
            "Quantity": 2
        },
        {
            "ID": 169678,
            "ConnectionTypeID": 2,
            "LevelID": 3,
            "Amps": 100,
            "Voltage": 400,
            "PowerKW": 40,
            "CurrentTypeID": 30,
            "Quantity": 1
        }
    ],
    "DateLastStatusUpdate": "2020-06-26T02:54:00Z",
    "DataQualityLevel": 3,
    "DateCreated": "2019-04-01T04:59:00Z",
    "SubmissionStatusTypeID": 100
}