{
    "IsRecentlyVerified": false,
    "ID": 184941,
    "UUID": "60901A58-8CA6-4ECA-9D83-6FCE3E259005",
    "DataProviderID": 29,
    "DataProvidersReference": "2262",
    "OperatorID": 69,
    "AddressInfo": {
        "ID": 185300,
        "Title": "Buchenweg 5A",
        "AddressLine1": "Buchenweg 5A",
        "Town": "Glinde",
        "Postcode": "21509",
        "CountryID": 87,
        "Latitude": 53.534967,
        "Longitude": 10.21876,
        "DistanceUnit": 0
    },
    "Connections": [
        {
            "ID": 293826,
            "ConnectionTypeID": 25,
            "StatusTypeID": 50,
            "LevelID": 2,
            "PowerKW": 22,
            "CurrentTypeID": 20
        },
        {
            "ID": 293827,
            "ConnectionTypeID": 25,
            "StatusTypeID": 50,
            "LevelID": 2,
            "PowerKW": 22,
            "CurrentTypeID": 20
        }
    ],
    "StatusTypeID": 50,
    "DateLastStatusUpdate": "2021-07-09T03:29:00Z",
    "MetadataValues": [
        {
            "ID": 17232,
            "MetadataFieldID": 4,
            "ItemValue": "Data from the German chargepoint registry provided by Bundesnetzagentur.de under the CC-BY 4.0 license"
        }
    ],
    "DataQualityLevel": 3,
    "DateCreated": "2021-07-08T10:06:00Z",
    "SubmissionStatusTypeID": 100
}