{
    "IsRecentlyVerified": false,
    "ID": 130057,
    "UUID": "A9FE783C-7577-4992-B63E-5C86ABE1D648",
    "DataProviderID": 1,
    "OperatorID": 3299,
    "UsageTypeID": 5,
    "UsageCost": "€8,00/session",
    "AddressInfo": {
        "ID": 130403,
        "Title": "IONITY Neumarkt",
        "AddressLine1": "Autohof Neumarkt, Ludwig-Erhard-Ring 2, 92348 Berg bei Neumarkt in der Oberpfalz, Deutschland",
        "Town": "Berg bei Neumarkt in der Oberpfalz",
        "Postcode": "92348",
        "CountryID": 87,
        "Latitude": 49.312948,
        "Longitude": 11.474745,
        "DistanceUnit": 0
    },
    "Connections": [
        {
            "ID": 182048,
            "ConnectionTypeID": 33,
            "StatusTypeID": 50,
            "LevelID": 3,
            "PowerKW": 350,
            "CurrentTypeID": 30,
            "Quantity": 4
        }
    ],
    "NumberOfPoints": 4,
    "StatusTypeID": 50,
    "DateLastStatusUpdate": "2019-08-01T21:48:00Z",
    "DataQualityLevel": 1,
    "DateCreated": "2019-07-30T13:01:00Z",
    "SubmissionStatusTypeID": 200
}