{
    "IsRecentlyVerified": false,
    "ID": 67489,
    "UUID": "D68FD83A-A0D1-4A81-888F-BE8BAA8E7B39",
    "DataProviderID": 2,
    "DataProvidersReference": "74722",
    "OperatorID": 1242,
    "UsageTypeID": 2,
    "AddressInfo": {
        "ID": 67835,
        "Title": "FPN&S 2 (QR : 2000436)",
        "AddressLine1": "290 Town Center Drive",
        "Town": "Dearborn",
        "StateOrProvince": "MI",
        "Postcode": "48126",
        "CountryID": 2,
        "Latitude": 42.3206458,
        "Longitude": -83.2183927,
        "ContactTelephone1": "855-443-3873",
        "AccessComments": "",
        "RelatedURL": "https://www.gewattstation.com",
        "DistanceUnit": 0
    },
    "Connections": [
        {
            "ID": 92994,
            "ConnectionTypeID": 1,
            "LevelID": 2,
            "Amps": 16,
            "Voltage": 230,
            "PowerKW": 3.7,
            "CurrentTypeID": 10,
            "Quantity": 1
        }
    ],
    "DateLastStatusUpdate": "2020-06-26T03:05:00Z",
    "DataQualityLevel": 3,
    "DateCreated": "2016-05-29T02:05:00Z",
    "SubmissionStatusTypeID": 100
}