{
    "IsRecentlyVerified": false,
    "ID": 101827,
    "UUID": "C7794A7B-2520-4E16-975F-A4FD725863E0",
    "DataProviderID": 1,
    "OperatorID": 3,
    "OperatorsReference": "PG-81831,PG-92551",
    "UsageTypeID": 6,
    "UsageCost": "Free",
    "AddressInfo": {
        "ID": 102173,
        "Title": "JLR-Taylor's Service Centres",
        "AddressLine1": "Zone B",
        "Town": "Chelmsford Road Industrial Estate",
        "StateOrProvince": "Great Dunmow",
        "Postcode": "CM6 1HD",
        "CountryID": 1,
        "Latitude": 51.864489,
        "Longitude": 0.373064,
        "DistanceUnit": 0
    },
    "Connections": [
        {
            "ID": 143740,
            "ConnectionTypeID": 25,
            "StatusTypeID": 50,
            "LevelID": 2,
            "Amps": 32,
            "Voltage": 230,
            "PowerKW": 7,
            "CurrentTypeID": 10,
            "Quantity": 3
        }
    ],
    "NumberOfPoints": 3,
    "GeneralComments": "This is an open charge unit installed at the JLR - Taylor's Service Centres dealership in Chelmsford Road Industrial Estate, Chelmsford Road, Great Dunmow",
    "StatusTypeID": 50,
    "DateLastStatusUpdate": "2018-04-12T05:35:00Z",
    "DataQualityLevel": 1,
    "DateCreated": "2018-04-11T05:34:00Z",
    "SubmissionStatusTypeID": 200
}