{
    "MediaItems": [
        {
            "ID": 13378,
            "ChargePointID": 71829,
            "ItemURL": "https://s3-ap-southeast-2.amazonaws.com/openchargemap/images/IT/OCM71829/OCM-71829.orig.2017100120223199.jpg",
            "ItemThumbnailURL": "https://s3-ap-southeast-2.amazonaws.com/openchargemap/images/IT/OCM71829/OCM-71829.thmb.2017100120223199.jpg",
            "Comment": "Tester on 30set2017 with my Zoe Q210, plug&charge",
            "IsEnabled": true,
            "IsVideo": false,
            "IsFeaturedItem": false,
            "IsExternalResource": false,
            "User": {
                "ID": 13501,
                "Username": "Eros"
            },
            "DateCreated": "2017-10-01T20:23:00Z"
        },
        {
            "ID": 9008,
            "ChargePointID": 71829,
            "ItemURL": "https://s3-ap-southeast-2.amazonaws.com/openchargemap/images/IT/OCM71829/OCM-71829.orig.2017011410103425.jpg",
            "ItemThumbnailURL": "https://s3-ap-southeast-2.amazonaws.com/openchargemap/images/IT/OCM71829/OCM-71829.thmb.2017011410103425.jpg",
            "Comment": "",
            "IsEnabled": true,
            "IsVideo": false,
            "IsFeaturedItem": false,
            "IsExternalResource": false,
            "User": {
                "ID": 12207,
                "Username": "aldodal"
            },
            "DateCreated": "2017-01-14T10:11:00Z"
        },
        {
            "ID": 9009,
            "ChargePointID": 71829,
            "ItemURL": "https://s3-ap-southeast-2.amazonaws.com/openchargemap/images/IT/OCM71829/OCM-71829.orig.2017011410111601.jpg",
            "ItemThumbnailURL": "https://s3-ap-southeast-2.amazonaws.com/openchargemap/images/IT/OCM71829/OCM-71829.thmb.2017011410111601.jpg",
            "Comment": "",
            "IsEnabled": true,
            "IsVideo": false,
            "IsFeaturedItem": false,
            "IsExternalResource": false,
            "User": {
                "ID": 12207,
                "Username": "aldodal"
            },
            "DateCreated": "2017-01-14T10:11:00Z"
        }
    ],
    "IsRecentlyVerified": false,
    "ID": 71829,
    "UUID": "6F7194F4-AECC-412A-ACC9-CC5A2B98E8F2",
    "DataProviderID": 1,
    "OperatorID": 45,
    "UsageTypeID": 6,
    "AddressInfo": {
        "ID": 72175,
        "Title": "Volkswagen Grioni Domenico",
        "AddressLine1": "SP14 - via G. Di Vittorio, 20",
        "Town": "Rivolta d'Adda",
        "StateOrProvince": "CR",
        "Postcode": "26027",
        "CountryID": 112,
        "Latitude": 45.4755019173337,
        "Longitude": 9.5118678260435,
        "ContactTelephone1": "0363 370372",
        "ContactEmail": "info@grioni.volkswagengroup.it",
        "RelatedURL": "http://www.grioniauto.it/",
        "DistanceUnit": 0
    },
    "Connections": [
        {
            "ID": 102918,
            "ConnectionTypeID": 1036,
            "StatusTypeID": 50,
            "LevelID": 2,
            "Amps": 16,
            "Voltage": 400,
            "PowerKW": 11,
            "CurrentTypeID": 20,
            "Quantity": 1
        }
    ],
    "NumberOfPoints": 1,
    "GeneralComments": "Riservato a clienti gruppo VW\r\nhttp://www.grioniauto.it/news/e-mobility.html",
    "StatusTypeID": 50,
    "DateLastStatusUpdate": "2017-10-01T20:23:00Z",
    "DataQualityLevel": 1,
    "DateCreated": "2016-09-14T13:11:00Z",
    "SubmissionStatusTypeID": 200
}