{
    "IsRecentlyVerified": false,
    "ID": 95659,
    "UUID": "B994C9CB-221C-487E-B231-5C515D652105",
    "DataProviderID": 1,
    "OperatorID": 3,
    "OperatorsReference": "PG-91161,PG-91759",
    "UsageTypeID": 6,
    "UsageCost": "Free",
    "AddressInfo": {
        "ID": 96005,
        "Title": "Complete Interior Design",
        "AddressLine1": "Field House",
        "Town": "Harlow",
        "Postcode": "CM20 2FB",
        "CountryID": 1,
        "Latitude": 51.780648,
        "Longitude": 0.094502,
        "DistanceUnit": 0
    },
    "Connections": [
        {
            "ID": 135507,
            "ConnectionTypeID": 25,
            "StatusTypeID": 50,
            "LevelID": 2,
            "Amps": 32,
            "Voltage": 230,
            "PowerKW": 7,
            "CurrentTypeID": 10,
            "Quantity": 2
        }
    ],
    "NumberOfPoints": 2,
    "GeneralComments": "This is an open charge unit installed at the Complete Interior Design site in Field House, Station Approach, Harlow",
    "StatusTypeID": 50,
    "DateLastStatusUpdate": "2017-11-18T06:19:00Z",
    "DataQualityLevel": 1,
    "DateCreated": "2017-11-17T16:10:00Z",
    "SubmissionStatusTypeID": 200
}