{
    "IsRecentlyVerified": false,
    "ID": 169439,
    "UUID": "60AAA36C-7C80-44BD-B9B2-7E1FD34F4E6D",
    "DataProviderID": 1,
    "OperatorID": 38,
    "UsageTypeID": 4,
    "UsageCost": "0",
    "AddressInfo": {
        "ID": 169798,
        "Title": "Lidl",
        "AddressLine1": "8-10 Rue Ernest Sarron",
        "Town": "Claye-Souilly",
        "StateOrProvince": "Ile-de-France",
        "Postcode": "77410",
        "CountryID": 80,
        "Latitude": 48.95136551025175,
        "Longitude": 2.6678188886029375,
        "AccessComments": "Borne près de la sortie du parking, une demie heure gratuite. Il y a parfois de l'attente, soyez fairplay dans ce cas, limitez vous à une demie-heure. Partagez! D'un connecteur à l'autre, la bascule est automatique en fonction de la position d'arrivée.",
        "DistanceUnit": 0
    },
    "Connections": [
        {
            "ID": 257819,
            "ConnectionTypeID": 25,
            "StatusTypeID": 50,
            "LevelID": 2,
            "Amps": 32,
            "Voltage": 400,
            "PowerKW": 12,
            "CurrentTypeID": 20,
            "Quantity": 1
        },
        {
            "ID": 257820,
            "ConnectionTypeID": 28,
            "StatusTypeID": 50,
            "LevelID": 2,
            "Amps": 16,
            "Voltage": 230,
            "PowerKW": 3.6,
            "CurrentTypeID": 10,
            "Quantity": 1
        },
        {
            "ID": 257821,
            "ConnectionTypeID": 33,
            "StatusTypeID": 50,
            "LevelID": 3,
            "Amps": 62,
            "Voltage": 400,
            "PowerKW": 25,
            "CurrentTypeID": 30,
            "Quantity": 1
        },
        {
            "ID": 257822,
            "ConnectionTypeID": 2,
            "StatusTypeID": 50,
            "LevelID": 3,
            "Amps": 62,
            "Voltage": 400,
            "PowerKW": 25,
            "CurrentTypeID": 30,
            "Quantity": 1
        }
    ],
    "NumberOfPoints": 1,
    "GeneralComments": "Ouvert de 8:30 à 20:00 tous les jours",
    "StatusTypeID": 50,
    "DateLastStatusUpdate": "2020-10-18T07:41:00Z",
    "DataQualityLevel": 1,
    "DateCreated": "2020-10-17T12:45:00Z",
    "SubmissionStatusTypeID": 200
}