{
    "IsRecentlyVerified": false,
    "ID": 118695,
    "UUID": "637CAAFE-2AE3-427A-9663-74B6DC0E3497",
    "DataProviderID": 1,
    "OperatorID": 32,
    "OperatorsReference": "1214",
    "UsageTypeID": 4,
    "UsageCost": "£0.108/kWh; for Polar Plus subscription members only",
    "AddressInfo": {
        "ID": 119041,
        "Title": "115-127 Fifth Avenue",
        "AddressLine1": "115-127 Fifth Avenue",
        "AddressLine2": "Westminster",
        "Town": "London",
        "Postcode": "W10 4DS",
        "CountryID": 1,
        "Latitude": 51.530731,
        "Longitude": -0.211109,
        "DistanceUnit": 0
    },
    "Connections": [
        {
            "ID": 167878,
            "ConnectionTypeID": 3,
            "StatusTypeID": 50,
            "LevelID": 2,
            "Amps": 13,
            "Voltage": 230,
            "PowerKW": 3,
            "CurrentTypeID": 10,
            "Quantity": 1
        },
        {
            "ID": 167879,
            "ConnectionTypeID": 25,
            "StatusTypeID": 50,
            "LevelID": 2,
            "Amps": 16,
            "Voltage": 230,
            "PowerKW": 4,
            "CurrentTypeID": 10,
            "Quantity": 1
        }
    ],
    "NumberOfPoints": 1,
    "StatusTypeID": 50,
    "DateLastStatusUpdate": "2019-03-30T06:16:00Z",
    "DataQualityLevel": 1,
    "DateCreated": "2019-03-29T06:13:00Z",
    "SubmissionStatusTypeID": 200
}