{
    "IsRecentlyVerified": false,
    "ID": 150319,
    "UUID": "FD15D333-9421-4AA7-8375-FEB7FC249C1D",
    "DataProviderID": 28,
    "DataProvidersReference": "FR*S09*P09225*001",
    "OperatorID": 3257,
    "UsageTypeID": 5,
    "AddressInfo": {
        "ID": 150672,
        "Title": "PAMIERS - Place Sainte Helene",
        "AddressLine1": "Place Sainte Helene 9100 PAMIERS",
        "CountryID": 80,
        "Latitude": 43.115495,
        "Longitude": 1.614939,
        "AccessComments": "24h/24 7j/7",
        "DistanceUnit": 0
    },
    "Connections": [
        {
            "ID": 208902,
            "ConnectionTypeID": 1036,
            "StatusTypeID": 50,
            "LevelID": 2,
            "PowerKW": 22,
            "CurrentTypeID": 20
        },
        {
            "ID": 208903,
            "ConnectionTypeID": 28,
            "StatusTypeID": 50,
            "LevelID": 2,
            "PowerKW": 22,
            "CurrentTypeID": 10
        },
        {
            "ID": 237513,
            "ConnectionTypeID": 1036,
            "StatusTypeID": 50,
            "LevelID": 2,
            "PowerKW": 22,
            "CurrentTypeID": 20
        },
        {
            "ID": 237514,
            "ConnectionTypeID": 28,
            "StatusTypeID": 50,
            "LevelID": 2,
            "PowerKW": 22,
            "CurrentTypeID": 10
        }
    ],
    "GeneralComments": "Recharge par badge et avec une application smartphone",
    "StatusTypeID": 50,
    "DateLastStatusUpdate": "2020-08-27T05:10:00Z",
    "DataQualityLevel": 2,
    "DateCreated": "2020-03-15T06:17:00Z",
    "SubmissionStatusTypeID": 100
}