{
    "IsRecentlyVerified": false,
    "ID": 85378,
    "UUID": "646ABF88-0005-4DBA-89AC-92DFF79E521A",
    "DataProviderID": 1,
    "OperatorID": 220,
    "OperatorsReference": "3864",
    "UsageTypeID": 4,
    "UsageCost": "€1.73 + €0.3213/kWh; Andere Tarife möglich",
    "AddressInfo": {
        "ID": 85724,
        "Title": "Lokstedter Weg",
        "AddressLine1": "Lokstedter Weg 3",
        "AddressLine2": "Eppendorf",
        "Town": "Hamburg",
        "StateOrProvince": "Hamburg",
        "Postcode": "20251",
        "CountryID": 87,
        "Latitude": 53.59445671642949,
        "Longitude": 9.987551761640695,
        "ContactTelephone1": "+49 800-3006070",
        "AccessComments": "24/7 verfügbar auf der Ecke Erikastraße an der Taverna Symposium.",
        "RelatedURL": "http://emobility.stromnetz-hamburg.de/hamburg/index.html",
        "DistanceUnit": 0
    },
    "Connections": [
        {
            "ID": 121411,
            "ConnectionTypeID": 25,
            "StatusTypeID": 50,
            "LevelID": 2,
            "Amps": 32,
            "Voltage": 400,
            "PowerKW": 22,
            "CurrentTypeID": 20,
            "Quantity": 2
        },
        {
            "ID": 121412,
            "ConnectionTypeID": 28,
            "StatusTypeID": 50,
            "LevelID": 2,
            "Amps": 16,
            "Voltage": 230,
            "PowerKW": 3.7,
            "CurrentTypeID": 10,
            "Quantity": 2
        }
    ],
    "NumberOfPoints": 4,
    "StatusTypeID": 50,
    "DateLastStatusUpdate": "2017-04-20T23:16:00Z",
    "DataQualityLevel": 1,
    "DateCreated": "2017-04-03T07:27:00Z",
    "SubmissionStatusTypeID": 200
}