{
    "IsRecentlyVerified": false,
    "ID": 148405,
    "UUID": "B22EF2B6-E038-408F-9BD8-963349DABD83",
    "DataProviderID": 1,
    "OperatorID": 20,
    "OperatorsReference": "70461",
    "UsageTypeID": 4,
    "UsageCost": "£4.00/session",
    "AddressInfo": {
        "ID": 148757,
        "Title": "Old Market Way Car Park",
        "AddressLine1": "Old Market Way Car Park",
        "Postcode": "GL56 0JY",
        "CountryID": 1,
        "Latitude": 51.99075,
        "Longitude": -1.70075,
        "DistanceUnit": 0
    },
    "Connections": [
        {
            "ID": 206037,
            "ConnectionTypeID": 2,
            "StatusTypeID": 50,
            "LevelID": 3,
            "PowerKW": 50,
            "CurrentTypeID": 30,
            "Quantity": 1
        },
        {
            "ID": 206038,
            "ConnectionTypeID": 33,
            "StatusTypeID": 50,
            "LevelID": 3,
            "PowerKW": 50,
            "CurrentTypeID": 30,
            "Quantity": 1
        },
        {
            "ID": 206039,
            "ConnectionTypeID": 1036,
            "StatusTypeID": 50,
            "LevelID": 3,
            "PowerKW": 43,
            "CurrentTypeID": 20,
            "Quantity": 1
        }
    ],
    "NumberOfPoints": 1,
    "StatusTypeID": 50,
    "DateLastStatusUpdate": "2020-02-02T06:13:00Z",
    "DataQualityLevel": 1,
    "DateCreated": "2020-02-02T06:13:00Z",
    "SubmissionStatusTypeID": 200
}