{
    "IsRecentlyVerified": false,
    "ID": 184339,
    "UUID": "7B787CED-09BD-4D10-81EB-68B0DC3FE900",
    "DataProviderID": 29,
    "DataProvidersReference": "11682",
    "AddressInfo": {
        "ID": 184698,
        "Title": "Grüner Weg 100",
        "AddressLine1": "Grüner Weg 100",
        "Town": "Aachen",
        "Postcode": "52070",
        "CountryID": 87,
        "Latitude": 50.794399,
        "Longitude": 6.110414,
        "DistanceUnit": 0
    },
    "Connections": [
        {
            "ID": 292492,
            "ConnectionTypeID": 28,
            "StatusTypeID": 50,
            "LevelID": 2,
            "PowerKW": 22,
            "CurrentTypeID": 20
        },
        {
            "ID": 292493,
            "ConnectionTypeID": 25,
            "StatusTypeID": 50,
            "LevelID": 2,
            "PowerKW": 22,
            "CurrentTypeID": 20
        },
        {
            "ID": 298194,
            "ConnectionTypeID": 28,
            "StatusTypeID": 50,
            "LevelID": 2,
            "PowerKW": 22,
            "CurrentTypeID": 20
        },
        {
            "ID": 298195,
            "ConnectionTypeID": 25,
            "StatusTypeID": 50,
            "LevelID": 2,
            "PowerKW": 22,
            "CurrentTypeID": 20
        }
    ],
    "StatusTypeID": 50,
    "DateLastStatusUpdate": "2021-07-12T02:45:00Z",
    "MetadataValues": [
        {
            "ID": 16630,
            "MetadataFieldID": 4,
            "ItemValue": "Data from the German chargepoint registry provided by Bundesnetzagentur.de under the CC-BY 4.0 license"
        }
    ],
    "DataQualityLevel": 3,
    "DateCreated": "2021-07-08T10:05:00Z",
    "SubmissionStatusTypeID": 100
}