{
    "IsRecentlyVerified": false,
    "ID": 61878,
    "UUID": "16588EFC-08D3-4DFB-8175-936BC2302B59",
    "DataProviderID": 1,
    "OperatorID": 23,
    "OperatorsReference": "6582",
    "UsageTypeID": 1,
    "UsageCost": "Free",
    "AddressInfo": {
        "ID": 62224,
        "Title": "Casa Blanca Inn - Tesla",
        "AddressLine1": "505 E La Plata St",
        "Town": "Farmington",
        "StateOrProvince": "NM",
        "Postcode": "87401",
        "CountryID": 2,
        "Latitude": 36.7318018,
        "Longitude": -108.1996514,
        "ContactTelephone1": "800-550-6503  877-798-3752",
        "AccessComments": "24 hours daily; for Tesla use only; for guest use only; see front desk for access",
        "RelatedURL": "http://www.teslamotors.com/supercharger",
        "DistanceUnit": 0
    },
    "Connections": [
        {
            "ID": 78772,
            "ConnectionTypeID": 30,
            "StatusTypeID": 50,
            "LevelID": 2,
            "Amps": 16,
            "Voltage": 230,
            "PowerKW": 16,
            "CurrentTypeID": 10,
            "Quantity": 2
        }
    ],
    "NumberOfPoints": 2,
    "StatusTypeID": 50,
    "DateLastStatusUpdate": "2017-01-31T20:11:00Z",
    "DataQualityLevel": 3,
    "DateCreated": "2016-03-03T11:38:00Z",
    "SubmissionStatusTypeID": 100
}