{
    "IsRecentlyVerified": false,
    "ID": 161837,
    "UUID": "50FCD553-C0C6-4FC8-94F2-22A06028B1AF",
    "DataProviderID": 1,
    "UsageTypeID": 5,
    "AddressInfo": {
        "ID": 162194,
        "Title": "Decathlon Luminus",
        "AddressLine1": "Jules Bordetlaan",
        "AddressLine2": "Buda",
        "Town": "Haren",
        "StateOrProvince": "Brussels-Capital",
        "Postcode": "1140",
        "CountryID": 26,
        "Latitude": 50.877525934363746,
        "Longitude": 4.412303611900256,
        "DistanceUnit": 0
    },
    "Connections": [
        {
            "ID": 232873,
            "ConnectionTypeID": 1036,
            "StatusTypeID": 50,
            "LevelID": 3,
            "PowerKW": 43,
            "CurrentTypeID": 20
        },
        {
            "ID": 232874,
            "ConnectionTypeID": 33,
            "StatusTypeID": 50,
            "LevelID": 3,
            "PowerKW": 50,
            "CurrentTypeID": 30
        },
        {
            "ID": 232875,
            "ConnectionTypeID": 2,
            "StatusTypeID": 50,
            "LevelID": 3,
            "PowerKW": 50,
            "CurrentTypeID": 30
        }
    ],
    "NumberOfPoints": 2,
    "GeneralComments": "Luminus fast charger",
    "StatusTypeID": 50,
    "DateLastStatusUpdate": "2020-07-27T13:53:00Z",
    "DataQualityLevel": 1,
    "DateCreated": "2020-07-26T18:11:00Z",
    "SubmissionStatusTypeID": 200
}