{
    "IsRecentlyVerified": false,
    "ID": 150959,
    "UUID": "2D8653B3-E5B0-45FC-836B-27BC144C281A",
    "DataProviderID": 28,
    "DataProvidersReference": "FR*M31*P31056*001",
    "OperatorID": 3257,
    "UsageTypeID": 5,
    "AddressInfo": {
        "ID": 151312,
        "Title": "BEAUZELLE - Rue Des Pins",
        "AddressLine1": "Rue Des Pins 31700 BEAUZELLE",
        "CountryID": 80,
        "Latitude": 43.668414,
        "Longitude": 1.378404,
        "AccessComments": "24h/24 7j/7",
        "DistanceUnit": 0
    },
    "Connections": [
        {
            "ID": 210362,
            "ConnectionTypeID": 28,
            "StatusTypeID": 50,
            "LevelID": 2,
            "PowerKW": 22,
            "CurrentTypeID": 10
        },
        {
            "ID": 210363,
            "ConnectionTypeID": 1036,
            "StatusTypeID": 50,
            "LevelID": 2,
            "PowerKW": 22,
            "CurrentTypeID": 20
        },
        {
            "ID": 210364,
            "ConnectionTypeID": 26,
            "StatusTypeID": 50,
            "LevelID": 2,
            "PowerKW": 22
        },
        {
            "ID": 240186,
            "ConnectionTypeID": 28,
            "StatusTypeID": 50,
            "LevelID": 2,
            "PowerKW": 22,
            "CurrentTypeID": 10
        },
        {
            "ID": 240187,
            "ConnectionTypeID": 1036,
            "StatusTypeID": 50,
            "LevelID": 2,
            "PowerKW": 22,
            "CurrentTypeID": 20
        },
        {
            "ID": 240188,
            "ConnectionTypeID": 26,
            "StatusTypeID": 50,
            "LevelID": 2,
            "PowerKW": 22
        }
    ],
    "GeneralComments": "Recharge par badge et avec une application smartphone",
    "StatusTypeID": 50,
    "DateLastStatusUpdate": "2020-08-27T05:11:00Z",
    "DataQualityLevel": 2,
    "DateCreated": "2020-03-15T06:18:00Z",
    "SubmissionStatusTypeID": 100
}