{
    "IsRecentlyVerified": false,
    "ID": 95786,
    "UUID": "2AE61EE1-3B2F-43FA-9C10-74FA1C7B748D",
    "DataProviderID": 1,
    "OperatorID": 3,
    "OperatorsReference": "PG-81497,PG-81499,PG-81502",
    "UsageTypeID": 4,
    "UsageCost": "Free",
    "AddressInfo": {
        "ID": 96132,
        "Title": "East Grinstead Station",
        "AddressLine1": "Railway Approach",
        "Town": "West Sussex",
        "Postcode": "RH19 1EB",
        "CountryID": 1,
        "Latitude": 51.126696,
        "Longitude": -0.01812,
        "DistanceUnit": 0
    },
    "Connections": [
        {
            "ID": 135686,
            "ConnectionTypeID": 25,
            "StatusTypeID": 50,
            "LevelID": 2,
            "Amps": 32,
            "Voltage": 230,
            "PowerKW": 7,
            "CurrentTypeID": 10,
            "Quantity": 6
        }
    ],
    "NumberOfPoints": 6,
    "GeneralComments": "This is an open charge unit installed in the western car park of the East Grinstead Station in Railway Approach, East Grinstead, West Sussex",
    "StatusTypeID": 50,
    "DateLastStatusUpdate": "2019-05-23T05:30:00Z",
    "DataQualityLevel": 1,
    "DateCreated": "2017-11-24T13:16:00Z",
    "SubmissionStatusTypeID": 200
}