{
    "IsRecentlyVerified": false,
    "ID": 95941,
    "UUID": "2A0595B2-743E-4E71-8BF0-891A3200D3CF",
    "DataProviderID": 1,
    "OperatorID": 80,
    "UsageTypeID": 4,
    "UsageCost": "0,40 €/kWh",
    "AddressInfo": {
        "ID": 96287,
        "Title": "Eneldrive Mennea",
        "AddressLine1": "Lungomare Pietro Paolo Mennea",
        "Town": "Barletta",
        "StateOrProvince": "BT",
        "Postcode": "76121",
        "CountryID": 112,
        "Latitude": 41.3235746309869,
        "Longitude": 16.28305399395958,
        "RelatedURL": "http://eneldrive.it",
        "DistanceUnit": 0
    },
    "Connections": [
        {
            "ID": 135910,
            "ConnectionTypeID": 25,
            "StatusTypeID": 50,
            "LevelID": 2,
            "Amps": 32,
            "Voltage": 400,
            "PowerKW": 22,
            "CurrentTypeID": 20,
            "Quantity": 1
        },
        {
            "ID": 135911,
            "ConnectionTypeID": 36,
            "StatusTypeID": 50,
            "LevelID": 2,
            "Amps": 16,
            "Voltage": 240,
            "PowerKW": 3,
            "CurrentTypeID": 10,
            "Quantity": 1
        }
    ],
    "NumberOfPoints": 2,
    "StatusTypeID": 50,
    "DateLastStatusUpdate": "2017-12-02T17:22:00Z",
    "DataQualityLevel": 1,
    "DateCreated": "2017-12-02T17:22:00Z",
    "SubmissionStatusTypeID": 200
}