{
    "IsRecentlyVerified": false,
    "ID": 91424,
    "UUID": "4CB4F643-564D-4685-92B5-CFD81EC517E4",
    "DataProviderID": 2,
    "DataProvidersReference": "85826",
    "OperatorID": 5,
    "UsageTypeID": 1,
    "AddressInfo": {
        "ID": 91770,
        "Title": "PARKING SYSTEM",
        "AddressLine1": "127 E Kiowa St",
        "Town": "Colorado Springs",
        "StateOrProvince": "CO",
        "Postcode": "80903",
        "CountryID": 2,
        "Latitude": 38.8345986,
        "Longitude": -104.8222072,
        "ContactTelephone1": "888-758-4389",
        "AccessComments": "24 hours daily",
        "RelatedURL": "http://www.chargepoint.com/",
        "DistanceUnit": 0
    },
    "Connections": [
        {
            "ID": 129589,
            "ConnectionTypeID": 1,
            "LevelID": 2,
            "Amps": 16,
            "Voltage": 230,
            "PowerKW": 3.7,
            "CurrentTypeID": 10,
            "Quantity": 2
        }
    ],
    "DateLastStatusUpdate": "2020-06-26T03:00:00Z",
    "DataQualityLevel": 3,
    "DateCreated": "2017-08-03T12:25:00Z",
    "SubmissionStatusTypeID": 100
}