{
    "IsRecentlyVerified": false,
    "ID": 173823,
    "UUID": "D748507B-ED32-4ED7-ADB0-F9A746D328EC",
    "DataProviderID": 19,
    "DataProvidersReference": "6955",
    "AddressInfo": {
        "ID": 174182,
        "Title": "Suðurfell 4 (Orkan)",
        "AddressLine1": "Suðurfell 4",
        "Town": "Reykjavík",
        "StateOrProvince": "Höfuðborgarsvæði",
        "Postcode": "111",
        "CountryID": 105,
        "Latitude": 64.101494,
        "Longitude": -21.831221,
        "AccessComments": "",
        "DistanceUnit": 0
    },
    "Connections": [
        {
            "ID": 267278,
            "ConnectionTypeID": 25,
            "Reference": "3",
            "LevelID": 3,
            "Amps": 32,
            "Voltage": 400,
            "PowerKW": 22,
            "CurrentTypeID": 30,
            "Comments": "Mode 3"
        },
        {
            "ID": 267279,
            "ConnectionTypeID": 33,
            "Reference": "4",
            "Comments": "Mode 4"
        },
        {
            "ID": 267280,
            "ConnectionTypeID": 2,
            "Reference": "5",
            "LevelID": 3,
            "Amps": 100,
            "Voltage": 500,
            "PowerKW": 50,
            "CurrentTypeID": 30,
            "Comments": "Mode 4"
        },
        {
            "ID": 267281,
            "ConnectionTypeID": 33,
            "Reference": "6",
            "Comments": "Mode 4"
        }
    ],
    "NumberOfPoints": 4,
    "StatusTypeID": 0,
    "DateLastStatusUpdate": "2021-03-04T05:39:00Z",
    "DataQualityLevel": 2,
    "DateCreated": "2021-03-04T05:39:00Z",
    "SubmissionStatusTypeID": 100
}