{
    "IsRecentlyVerified": false,
    "ID": 42427,
    "UUID": "80B8A14E-3CBE-4907-8D37-B385179FE04A",
    "DataProviderID": 1,
    "OperatorID": 165,
    "UsageTypeID": 4,
    "UsageCost": "kostenpflicht",
    "AddressInfo": {
        "ID": 42773,
        "Title": "Kapuziner Platz",
        "AddressLine1": "Hauptstr.",
        "Town": "Königstein",
        "StateOrProvince": "Hesse",
        "Postcode": "61462",
        "CountryID": 87,
        "Latitude": 50.18239064317444,
        "Longitude": 8.467242281819836,
        "DistanceUnit": 0
    },
    "Connections": [
        {
            "ID": 51053,
            "ConnectionTypeID": 25,
            "StatusTypeID": 50,
            "LevelID": 2,
            "Amps": 32,
            "Voltage": 400,
            "PowerKW": 22,
            "CurrentTypeID": 20,
            "Quantity": 1
        },
        {
            "ID": 304093,
            "ConnectionTypeID": 25,
            "StatusTypeID": 50,
            "LevelID": 2,
            "Voltage": 400,
            "PowerKW": 22,
            "CurrentTypeID": 20,
            "Quantity": 1
        }
    ],
    "NumberOfPoints": 2,
    "StatusTypeID": 50,
    "DateLastStatusUpdate": "2021-07-18T19:52:00Z",
    "DataQualityLevel": 1,
    "DateCreated": "2015-03-10T08:48:00Z",
    "SubmissionStatusTypeID": 200
}