{
    "IsRecentlyVerified": false,
    "ID": 39182,
    "UUID": "CF529B2D-75BA-45EC-A0F4-E97D509E30DF",
    "DataProviderID": 1,
    "OperatorID": 220,
    "OperatorsReference": "2084,2084,2085",
    "UsageTypeID": 1,
    "UsageCost": "€1.73 + €0.3213/kWh; Andere Tarife möglich",
    "AddressInfo": {
        "ID": 39528,
        "Title": "Ohnsorg-Theater",
        "AddressLine1": "Heidi-Kabel-Platz 2",
        "Town": "Hamburg",
        "Postcode": "20099",
        "CountryID": 87,
        "Latitude": 53.554312,
        "Longitude": 10.007316,
        "AccessComments": "Ein kostenloser Parkplatz am Hansebäcker.",
        "DistanceUnit": 0
    },
    "Connections": [
        {
            "ID": 42693,
            "ConnectionTypeID": 25,
            "StatusTypeID": 50,
            "LevelID": 2,
            "Amps": 32,
            "Voltage": 400,
            "PowerKW": 11,
            "CurrentTypeID": 20,
            "Quantity": 1
        },
        {
            "ID": 49918,
            "ConnectionTypeID": 25,
            "StatusTypeID": 50,
            "LevelID": 2,
            "Amps": 32,
            "Voltage": 400,
            "PowerKW": 22,
            "CurrentTypeID": 20,
            "Quantity": 1
        },
        {
            "ID": 49919,
            "ConnectionTypeID": 28,
            "StatusTypeID": 50,
            "LevelID": 2,
            "Amps": 16,
            "Voltage": 230,
            "PowerKW": 3.7,
            "CurrentTypeID": 10,
            "Quantity": 2
        }
    ],
    "NumberOfPoints": 2,
    "StatusTypeID": 50,
    "DateLastStatusUpdate": "2017-07-25T05:37:00Z",
    "DataQualityLevel": 3,
    "DateCreated": "2015-01-09T06:08:00Z",
    "SubmissionStatusTypeID": 200
}