{
    "IsRecentlyVerified": false,
    "ID": 142157,
    "UUID": "83AD4078-4615-4855-B51F-69A463797C51",
    "DataProviderID": 2,
    "DataProvidersReference": "143195",
    "OperatorID": 5,
    "UsageTypeID": 1,
    "AddressInfo": {
        "ID": 142509,
        "Title": "DMH",
        "AddressLine1": "7450 Hospital Dr",
        "Town": "Dublin",
        "StateOrProvince": "OH",
        "Postcode": "43016",
        "CountryID": 2,
        "Latitude": 40.1004751,
        "Longitude": -83.1665895,
        "ContactTelephone1": "888-758-4389",
        "AccessComments": "24 hours daily",
        "RelatedURL": "http://www.chargepoint.com/",
        "DistanceUnit": 0
    },
    "Connections": [
        {
            "ID": 198233,
            "ConnectionTypeID": 1,
            "LevelID": 2,
            "Amps": 16,
            "Voltage": 230,
            "PowerKW": 3.7,
            "CurrentTypeID": 10,
            "Quantity": 2
        }
    ],
    "StatusTypeID": 50,
    "DateLastStatusUpdate": "2020-06-26T03:02:00Z",
    "DataQualityLevel": 3,
    "DateCreated": "2019-12-24T09:17:00Z",
    "SubmissionStatusTypeID": 100
}