{
    "IsRecentlyVerified": false,
    "ID": 160691,
    "UUID": "4FC8D745-E046-4DC5-9573-CBA59DBE3F24",
    "DataProviderID": 2,
    "DataProvidersReference": "158019",
    "UsageTypeID": 2,
    "AddressInfo": {
        "ID": 161048,
        "Title": "City of Vancouver",
        "AddressLine1": "2221 Main St",
        "Town": "Vancouver",
        "StateOrProvince": "BC",
        "Postcode": "V5T 1J5",
        "CountryID": 44,
        "Latitude": 49.2651584,
        "Longitude": -123.1034049,
        "ContactTelephone1": "",
        "AccessComments": "",
        "RelatedURL": "",
        "DistanceUnit": 0
    },
    "Connections": [
        {
            "ID": 231232,
            "ConnectionTypeID": 2,
            "LevelID": 3,
            "Amps": 100,
            "Voltage": 400,
            "PowerKW": 40,
            "CurrentTypeID": 30,
            "Quantity": 1
        },
        {
            "ID": 231233,
            "ConnectionTypeID": 32,
            "LevelID": 3,
            "Amps": 100,
            "Voltage": 400,
            "PowerKW": 40,
            "CurrentTypeID": 30,
            "Quantity": 1
        }
    ],
    "GeneralComments": "Planned for future date. Not Operational.",
    "DatePlanned": "2020-09-01T00:00:00Z",
    "StatusTypeID": 150,
    "DateLastStatusUpdate": "2020-06-26T03:12:00Z",
    "DataQualityLevel": 3,
    "DateCreated": "2020-06-26T03:12:00Z",
    "SubmissionStatusTypeID": 100
}