{
    "IsRecentlyVerified": false,
    "ID": 56948,
    "UUID": "097CEEE4-EBAC-4B69-A867-A70D1CA53DF3",
    "DataProviderID": 1,
    "OperatorID": 69,
    "UsageTypeID": 4,
    "AddressInfo": {
        "ID": 57294,
        "Title": "Bahnhof",
        "AddressLine1": "Bahnstraße",
        "AddressLine2": "Forensberg",
        "Town": "Herzogenrath-Kohlscheid",
        "StateOrProvince": "Städteregion Aachen",
        "Postcode": "52134",
        "CountryID": 87,
        "Latitude": 50.8323938,
        "Longitude": 6.075024999999982,
        "AccessComments": "Rund um die Uhr (24/7) nutzbar .\r\n",
        "RelatedURL": "http://www.enwor-vorort.de/de/Produkte/Strom-tanken/Strom-tanken.html",
        "DistanceUnit": 0
    },
    "Connections": [
        {
            "ID": 71898,
            "ConnectionTypeID": 25,
            "StatusTypeID": 50,
            "LevelID": 2,
            "Amps": 32,
            "Voltage": 400,
            "PowerKW": 22,
            "CurrentTypeID": 20,
            "Quantity": 2
        },
        {
            "ID": 71899,
            "ConnectionTypeID": 28,
            "StatusTypeID": 50,
            "LevelID": 2,
            "Amps": 16,
            "Voltage": 230,
            "PowerKW": 3.7,
            "CurrentTypeID": 10,
            "Quantity": 2
        }
    ],
    "NumberOfPoints": 2,
    "StatusTypeID": 50,
    "DateLastStatusUpdate": "2015-11-18T07:32:00Z",
    "DataQualityLevel": 1,
    "DateCreated": "2015-11-18T07:32:00Z",
    "SubmissionStatusTypeID": 200
}