{
    "IsRecentlyVerified": false,
    "ID": 121652,
    "UUID": "AD437F32-2CA8-4244-911C-7362BAD5270F",
    "DataProviderID": 2,
    "DataProvidersReference": "121137",
    "OperatorID": 5,
    "UsageTypeID": 1,
    "AddressInfo": {
        "ID": 121998,
        "Title": "UO-EMU",
        "AddressLine1": "1320 E 15th Ave",
        "Town": "Eugene",
        "StateOrProvince": "OR",
        "Postcode": "97403",
        "CountryID": 2,
        "Latitude": 44.0421559,
        "Longitude": -123.0732528,
        "ContactTelephone1": "888-758-4389",
        "AccessComments": "24 hours daily",
        "RelatedURL": "http://www.chargepoint.com/",
        "DistanceUnit": 0
    },
    "Connections": [
        {
            "ID": 171442,
            "ConnectionTypeID": 1,
            "LevelID": 2,
            "Amps": 16,
            "Voltage": 230,
            "PowerKW": 3,
            "CurrentTypeID": 10,
            "Quantity": 2
        }
    ],
    "DateLastStatusUpdate": "2019-04-06T04:01:00Z",
    "DataQualityLevel": 3,
    "DateCreated": "2019-04-06T04:01:00Z",
    "SubmissionStatusTypeID": 100
}