{
    "UserComments": [
        {
            "ID": 14595,
            "ChargePointID": 68773,
            "CommentTypeID": 10,
            "UserName": "Anon74856763534",
            "Comment": "",
            "DateCreated": "2016-11-25T12:31:21.607Z",
            "User": {
                "ID": 1192,
                "Username": "Anon74856763534"
            },
            "CheckinStatusTypeID": 10
        }
    ],
    "IsRecentlyVerified": false,
    "ID": 68773,
    "UUID": "A36A0610-49D3-4DED-B8E6-75545C364689",
    "DataProviderID": 1,
    "OperatorID": 3315,
    "OperatorsReference": "50932,51270",
    "UsageTypeID": 4,
    "UsageCost": "Free",
    "AddressInfo": {
        "ID": 69119,
        "Title": "Dalmuir Railway Station Car Park",
        "AddressLine1": "Swindon Street",
        "AddressLine2": "Drumry",
        "Town": "Duntocher",
        "StateOrProvince": "West Dunbartonshire",
        "Postcode": "G81 4HR",
        "CountryID": 1,
        "Latitude": 55.9114,
        "Longitude": -4.42799,
        "DistanceUnit": 0
    },
    "Connections": [
        {
            "ID": 96466,
            "ConnectionTypeID": 25,
            "StatusTypeID": 50,
            "LevelID": 2,
            "Amps": 32,
            "Voltage": 400,
            "PowerKW": 22,
            "CurrentTypeID": 20,
            "Quantity": 4
        }
    ],
    "NumberOfPoints": 4,
    "StatusTypeID": 50,
    "DateLastStatusUpdate": "2018-04-09T16:53:00Z",
    "DataQualityLevel": 1,
    "DateCreated": "2016-06-23T18:13:00Z",
    "SubmissionStatusTypeID": 200
}