{
    "IsRecentlyVerified": false,
    "ID": 115097,
    "UUID": "FFDB4B53-CAB0-4A75-B814-02FB8E696DC4",
    "DataProviderID": 1,
    "OperatorID": 80,
    "UsageTypeID": 4,
    "AddressInfo": {
        "ID": 115443,
        "Title": " Area Sosta Camper - Migliarino | EnelX",
        "AddressLine1": "Via A. Forti, 27",
        "Town": "Migliarino ",
        "StateOrProvince": "FE",
        "Postcode": "44027",
        "CountryID": 112,
        "Latitude": 44.77228027387931,
        "Longitude": 11.934468362512618,
        "RelatedURL": "https://www.enelx.com/it/it/emobility",
        "DistanceUnit": 0
    },
    "Connections": [
        {
            "ID": 161963,
            "ConnectionTypeID": 25,
            "StatusTypeID": 50,
            "LevelID": 2,
            "Amps": 32,
            "Voltage": 400,
            "PowerKW": 22,
            "CurrentTypeID": 20,
            "Quantity": 2
        }
    ],
    "NumberOfPoints": 2,
    "StatusTypeID": 50,
    "DateLastStatusUpdate": "2019-01-29T15:41:00Z",
    "DataQualityLevel": 1,
    "DateCreated": "2019-01-29T15:41:00Z",
    "SubmissionStatusTypeID": 200
}