{
    "IsRecentlyVerified": false,
    "ID": 40940,
    "UUID": "3DF59BC2-006F-47D6-BA62-553575B619FF",
    "DataProviderID": 1,
    "OperatorID": 127,
    "UsageTypeID": 1,
    "UsageCost": "0",
    "AddressInfo": {
        "ID": 41286,
        "Title": "Berufsbildende Schule Cadenberge",
        "AddressLine1": "Im Park 4",
        "Town": "Cadenberge",
        "StateOrProvince": "Samtgemeinde Am Dobrock",
        "Postcode": "21781",
        "CountryID": 87,
        "Latitude": 53.7737904792705,
        "Longitude": 9.06730868939805,
        "ContactTelephone1": "04418030",
        "ContactTelephone2": "08001014432",
        "AccessComments": "Auf Schulparkplatz, immer offen",
        "RelatedURL": "http://www.ewe.de/privatkunden/mobilitaet.php",
        "DistanceUnit": 0
    },
    "Connections": [
        {
            "ID": 44590,
            "ConnectionTypeID": 25,
            "StatusTypeID": 50,
            "Quantity": 1
        },
        {
            "ID": 44591,
            "ConnectionTypeID": 17,
            "Quantity": 1
        }
    ],
    "NumberOfPoints": 2,
    "GeneralComments": "Zugang mit EWE / SWB RFID Karte",
    "StatusTypeID": 50,
    "DateLastStatusUpdate": "2015-01-19T19:17:00Z",
    "DataQualityLevel": 1,
    "DateCreated": "2015-01-17T16:17:00Z",
    "SubmissionStatusTypeID": 200
}