{
    "IsRecentlyVerified": false,
    "ID": 120913,
    "UUID": "73D786BD-C202-4B7A-8FF7-33F839C8EF22",
    "DataProviderID": 2,
    "DataProvidersReference": "80183",
    "OperatorID": 5,
    "UsageTypeID": 1,
    "AddressInfo": {
        "ID": 121259,
        "Title": "OCS",
        "AddressLine1": "770 The City Dr S",
        "Town": "Orange",
        "StateOrProvince": "CA",
        "Postcode": "92868",
        "CountryID": 2,
        "Latitude": 33.7754771,
        "Longitude": -117.8929256,
        "ContactTelephone1": "888-758-4389",
        "AccessComments": "24 hours daily",
        "RelatedURL": "http://www.chargepoint.com/",
        "DistanceUnit": 0
    },
    "Connections": [
        {
            "ID": 170318,
            "ConnectionTypeID": 1,
            "LevelID": 2,
            "Amps": 16,
            "Voltage": 230,
            "PowerKW": 3,
            "CurrentTypeID": 10,
            "Quantity": 2
        }
    ],
    "DateLastStatusUpdate": "2019-12-24T09:10:00Z",
    "DataQualityLevel": 3,
    "DateCreated": "2019-04-01T04:59:00Z",
    "SubmissionStatusTypeID": 100
}