{
    "IsRecentlyVerified": false,
    "ID": 137645,
    "UUID": "A5134D09-29A6-49A0-9998-C0DC9F7DAF04",
    "DataProviderID": 2,
    "DataProvidersReference": "95039",
    "OperatorID": 9,
    "UsageTypeID": 1,
    "AddressInfo": {
        "ID": 137991,
        "Title": "Arizona Inn",
        "AddressLine1": "2200 E. Elm Street",
        "Town": "Tucson",
        "StateOrProvince": "AZ",
        "Postcode": "85719",
        "CountryID": 2,
        "Latitude": 32.242606,
        "Longitude": -110.939512,
        "ContactTelephone1": "888-998-2546",
        "AccessComments": "MON: 24 hours | TUE: 24 hours | WED: 24 hours | THU: 24 hours | FRI: 24 hours | SAT: 24 hours | SUN: 24 hours",
        "RelatedURL": "http://www.blinkcharging.com/",
        "DistanceUnit": 0
    },
    "Connections": [
        {
            "ID": 192594,
            "ConnectionTypeID": 1,
            "LevelID": 2,
            "Amps": 16,
            "Voltage": 230,
            "PowerKW": 3,
            "CurrentTypeID": 10,
            "Quantity": 4
        }
    ],
    "StatusTypeID": 50,
    "DateLastStatusUpdate": "2019-12-24T09:06:00Z",
    "DataQualityLevel": 3,
    "DateCreated": "2019-12-24T09:06:00Z",
    "SubmissionStatusTypeID": 100
}