{
    "IsRecentlyVerified": false,
    "ID": 129170,
    "UUID": "F6130C99-DF9E-450D-839D-4B86ED85B703",
    "DataProviderID": 1,
    "OperatorID": 23,
    "OperatorsReference": "50959",
    "UsageTypeID": 4,
    "AddressInfo": {
        "ID": 129516,
        "Title": "Hyatt House San Jose/Cupertino",
        "AddressLine1": "10380 Perimeter RD",
        "Town": "Cupertino",
        "StateOrProvince": "California",
        "Postcode": "95014",
        "CountryID": 2,
        "Latitude": 37.328737,
        "Longitude": -122.013545,
        "ContactTelephone1": "(669) 220-3800",
        "DistanceUnit": 0
    },
    "Connections": [
        {
            "ID": 180818,
            "ConnectionTypeID": 30,
            "StatusTypeID": 50,
            "LevelID": 2,
            "PowerKW": 6,
            "CurrentTypeID": 20,
            "Quantity": 8
        }
    ],
    "NumberOfPoints": 8,
    "GeneralComments": "8 Tesla Connectors, up to 6kW.Available to the public. Self park.",
    "StatusTypeID": 50,
    "DateLastStatusUpdate": "2019-07-15T16:10:00Z",
    "DataQualityLevel": 1,
    "DateCreated": "2019-07-15T16:10:00Z",
    "SubmissionStatusTypeID": 200
}