{
    "UserComments": [
        {
            "ID": 24982,
            "ChargePointID": 186620,
            "CommentTypeID": 50,
            "UserName": "KaLu",
            "Comment": "Die Adresse ist falsch! In Brenken gibt es keine Ladestation!",
            "Rating": 1,
            "DateCreated": "2021-10-26T18:14:49.017Z",
            "User": {
                "ID": 28654,
                "Username": "KaLu"
            },
            "CheckinStatusTypeID": 0,
            "IsActionedByEditor": false
        }
    ],
    "IsRecentlyVerified": false,
    "ID": 186620,
    "UUID": "5FFE8FE8-55ED-43A4-A523-02A4C2697BAC",
    "DataProviderID": 29,
    "DataProvidersReference": "21111",
    "OperatorID": 103,
    "AddressInfo": {
        "ID": 186979,
        "Title": "Schützenstraße 67",
        "AddressLine1": "Schützenstraße 67",
        "Town": "Bad Sassendorf",
        "Postcode": "59505",
        "CountryID": 87,
        "Latitude": 51.579043,
        "Longitude": 8.585,
        "DistanceUnit": 0
    },
    "Connections": [
        {
            "ID": 299684,
            "ConnectionTypeID": 33,
            "StatusTypeID": 50,
            "LevelID": 3,
            "PowerKW": 50,
            "CurrentTypeID": 30
        },
        {
            "ID": 299685,
            "ConnectionTypeID": 2,
            "StatusTypeID": 50,
            "LevelID": 3,
            "PowerKW": 50,
            "CurrentTypeID": 30
        },
        {
            "ID": 299686,
            "ConnectionTypeID": 1036,
            "StatusTypeID": 50,
            "LevelID": 3,
            "PowerKW": 43,
            "CurrentTypeID": 20
        }
    ],
    "StatusTypeID": 50,
    "DateLastStatusUpdate": "2021-10-26T18:15:00Z",
    "MetadataValues": [
        {
            "ID": 18861,
            "MetadataFieldID": 4,
            "ItemValue": "Data from the German chargepoint registry provided by Bundesnetzagentur.de under the CC-BY 4.0 license"
        }
    ],
    "DataQualityLevel": 3,
    "DateCreated": "2021-07-12T02:48:00Z",
    "SubmissionStatusTypeID": 100
}