{
    "IsRecentlyVerified": false,
    "ID": 90389,
    "UUID": "27A2302B-CEB7-4486-88F0-BF3F44D4EFD9",
    "DataProviderID": 1,
    "OperatorID": 23,
    "OperatorsReference": "30829",
    "UsageTypeID": 4,
    "AddressInfo": {
        "ID": 90735,
        "Title": "Green Solution House",
        "AddressLine1": "Strandvejen 79",
        "Town": "Rønne",
        "Postcode": "3700",
        "CountryID": 65,
        "Latitude": 55.08522,
        "Longitude": 14.710275,
        "ContactTelephone1": "+45 56 95 19 13",
        "DistanceUnit": 0
    },
    "Connections": [
        {
            "ID": 128042,
            "ConnectionTypeID": 30,
            "StatusTypeID": 50,
            "LevelID": 2,
            "Amps": 32,
            "Voltage": 400,
            "PowerKW": 22,
            "CurrentTypeID": 20,
            "Quantity": 1
        }
    ],
    "NumberOfPoints": 1,
    "GeneralComments": "1 Tesla Connector, up to 22kW.Available for customers. Please see front desk.",
    "StatusTypeID": 50,
    "DateLastStatusUpdate": "2018-10-03T19:57:00Z",
    "DataQualityLevel": 1,
    "DateCreated": "2017-07-13T15:06:00Z",
    "SubmissionStatusTypeID": 200
}