{
    "IsRecentlyVerified": false,
    "ID": 138218,
    "UUID": "85D8106D-1F22-4D09-8902-D19E58DA36E5",
    "DataProviderID": 2,
    "DataProvidersReference": "148974",
    "OperatorID": 39,
    "UsageTypeID": 1,
    "AddressInfo": {
        "ID": 138567,
        "Title": "Casa Palma",
        "AddressLine1": "6112 Florida 7",
        "Town": "Coconut Creek",
        "StateOrProvince": "FL",
        "Postcode": "33073",
        "CountryID": 2,
        "Latitude": 26.3052257,
        "Longitude": -80.202068,
        "ContactTelephone1": "800-663-5633",
        "AccessComments": "MO: 12:00am-12:00am; TU: 12:00am-12:00am; WE: 12:00am-12:00am; TH: 12:00am-12:00am; FR: 12:00am-12:00am; SA: 12:00am-12:00am; SU: 12:00am-12:00am",
        "RelatedURL": "http://www.semacharge.com/",
        "DistanceUnit": 0
    },
    "Connections": [
        {
            "ID": 193287,
            "ConnectionTypeID": 1,
            "LevelID": 2,
            "Amps": 16,
            "Voltage": 230,
            "PowerKW": 3.7,
            "CurrentTypeID": 10,
            "Quantity": 3
        }
    ],
    "StatusTypeID": 50,
    "DateLastStatusUpdate": "2020-06-26T02:52:00Z",
    "DataQualityLevel": 3,
    "DateCreated": "2019-12-24T09:08:00Z",
    "SubmissionStatusTypeID": 100
}