{
    "IsRecentlyVerified": false,
    "ID": 144908,
    "UUID": "12D29489-17B3-469B-9539-36E3D86D2E8A",
    "DataProviderID": 2,
    "DataProvidersReference": "145488",
    "OperatorID": 90,
    "UsageTypeID": 1,
    "AddressInfo": {
        "ID": 145260,
        "Title": "Desjardins - CdS L'Épiphanie",
        "AddressLine1": "131 rue Amireault",
        "Town": "L’Épiphanie",
        "StateOrProvince": "QC",
        "Postcode": "J5X 2T2",
        "CountryID": 44,
        "Latitude": 45.849658,
        "Longitude": -73.487397,
        "ContactTelephone1": "877-505-2674",
        "AccessComments": "24 hours daily",
        "RelatedURL": "https://lecircuitelectrique.com/",
        "DistanceUnit": 0
    },
    "Connections": [
        {
            "ID": 201460,
            "ConnectionTypeID": 1,
            "LevelID": 2,
            "Amps": 16,
            "Voltage": 230,
            "PowerKW": 3.7,
            "CurrentTypeID": 10,
            "Quantity": 1
        }
    ],
    "StatusTypeID": 50,
    "DateLastStatusUpdate": "2020-06-26T03:09:00Z",
    "DataQualityLevel": 3,
    "DateCreated": "2019-12-24T09:24:00Z",
    "SubmissionStatusTypeID": 100
}