{
    "UserComments": [
        {
            "ID": 18010,
            "ChargePointID": 84463,
            "CommentTypeID": 10,
            "UserName": "ForumElettrico.it",
            "RelatedURL": "https://www.forumelettrico.it/forum/colonnina-in-arrivo-alla-moriggia-di-gallarate-va-t750.html",
            "DateCreated": "2017-12-07T14:40:33.28Z",
            "User": {
                "ID": 11749,
                "Username": "ForumElettrico.it"
            },
            "CheckinStatusTypeID": 10
        }
    ],
    "MediaItems": [
        {
            "ID": 13775,
            "ChargePointID": 84463,
            "ItemURL": "https://s3-ap-southeast-2.amazonaws.com/openchargemap/images/IT/OCM84463/OCM-84463.orig.2017120714434832.jpg",
            "ItemThumbnailURL": "https://s3-ap-southeast-2.amazonaws.com/openchargemap/images/IT/OCM84463/OCM-84463.thmb.2017120714434832.jpg",
            "Comment": "",
            "IsEnabled": true,
            "IsVideo": false,
            "IsFeaturedItem": false,
            "IsExternalResource": false,
            "User": {
                "ID": 11749,
                "Username": "ForumElettrico.it"
            },
            "DateCreated": "2017-12-07T14:44:00Z"
        },
        {
            "ID": 10654,
            "ChargePointID": 84463,
            "ItemURL": "https://s3-ap-southeast-2.amazonaws.com/openchargemap/images/IT/OCM84463/OCM-84463.orig.2017031909083243.jpg",
            "ItemThumbnailURL": "https://s3-ap-southeast-2.amazonaws.com/openchargemap/images/IT/OCM84463/OCM-84463.thmb.2017031909083243.jpg",
            "Comment": "",
            "IsEnabled": true,
            "IsVideo": false,
            "IsFeaturedItem": false,
            "IsExternalResource": false,
            "User": {
                "ID": 12207,
                "Username": "aldodal"
            },
            "DateCreated": "2017-03-19T09:09:00Z"
        },
        {
            "ID": 10655,
            "ChargePointID": 84463,
            "ItemURL": "https://s3-ap-southeast-2.amazonaws.com/openchargemap/images/IT/OCM84463/OCM-84463.orig.2017031909084902.jpg",
            "ItemThumbnailURL": "https://s3-ap-southeast-2.amazonaws.com/openchargemap/images/IT/OCM84463/OCM-84463.thmb.2017031909084902.jpg",
            "Comment": "",
            "IsEnabled": true,
            "IsVideo": false,
            "IsFeaturedItem": false,
            "IsExternalResource": false,
            "User": {
                "ID": 12207,
                "Username": "aldodal"
            },
            "DateCreated": "2017-03-19T09:09:00Z"
        },
        {
            "ID": 10653,
            "ChargePointID": 84463,
            "ItemURL": "https://s3-ap-southeast-2.amazonaws.com/openchargemap/images/IT/OCM84463/OCM-84463.orig.2017031909081610.jpg",
            "ItemThumbnailURL": "https://s3-ap-southeast-2.amazonaws.com/openchargemap/images/IT/OCM84463/OCM-84463.thmb.2017031909081610.jpg",
            "Comment": "",
            "IsEnabled": true,
            "IsVideo": false,
            "IsFeaturedItem": false,
            "IsExternalResource": false,
            "User": {
                "ID": 12207,
                "Username": "aldodal"
            },
            "DateCreated": "2017-03-19T09:08:00Z"
        }
    ],
    "IsRecentlyVerified": false,
    "ID": 84463,
    "UUID": "11214D34-2EF3-4419-88CD-831259583CC2",
    "DataProviderID": 1,
    "OperatorID": 1,
    "UsageTypeID": 2,
    "UsageCost": "0,30€/kW + 0,10€/min",
    "AddressInfo": {
        "ID": 84809,
        "Title": "Svoltando Piscina Comunale di Moriggia",
        "AddressLine1": "Via Benedetto Croce, 1",
        "AddressLine2": "Moriggia",
        "Town": "Gallarate ",
        "StateOrProvince": "VA",
        "Postcode": "21013",
        "CountryID": 112,
        "Latitude": 45.6733131443976,
        "Longitude": 8.75921295229091,
        "ContactTelephone1": "+39 03321646927",
        "ContactEmail": "erica@svoltando.it",
        "RelatedURL": "https://www.svoltando.it/",
        "DistanceUnit": 0
    },
    "Connections": [
        {
            "ID": 119919,
            "ConnectionTypeID": 25,
            "StatusTypeID": 50,
            "LevelID": 2,
            "Amps": 32,
            "Voltage": 400,
            "PowerKW": 22,
            "CurrentTypeID": 20,
            "Quantity": 2
        }
    ],
    "NumberOfPoints": 2,
    "StatusTypeID": 50,
    "DateLastStatusUpdate": "2020-12-09T09:58:00Z",
    "DataQualityLevel": 1,
    "DateCreated": "2017-02-27T15:54:00Z",
    "SubmissionStatusTypeID": 200
}