{
    "IsRecentlyVerified": false,
    "ID": 177233,
    "UUID": "CE353ECB-210C-4CF8-9655-D64BBF0F1295",
    "DataProviderID": 29,
    "DataProvidersReference": "14601",
    "AddressInfo": {
        "ID": 177592,
        "Title": "Gottlieb-Daimler-Straße 3",
        "AddressLine1": "Gottlieb-Daimler-Straße 3",
        "Town": "Althengstett",
        "Postcode": "75382",
        "CountryID": 87,
        "Latitude": 48.727666,
        "Longitude": 8.783165,
        "DistanceUnit": 0
    },
    "Connections": [
        {
            "ID": 276143,
            "ConnectionTypeID": 28,
            "StatusTypeID": 50,
            "LevelID": 2,
            "PowerKW": 22,
            "CurrentTypeID": 20
        },
        {
            "ID": 276144,
            "ConnectionTypeID": 25,
            "StatusTypeID": 50,
            "LevelID": 2,
            "PowerKW": 22,
            "CurrentTypeID": 20
        },
        {
            "ID": 296070,
            "ConnectionTypeID": 28,
            "StatusTypeID": 50,
            "LevelID": 2,
            "PowerKW": 22,
            "CurrentTypeID": 20
        },
        {
            "ID": 296071,
            "ConnectionTypeID": 25,
            "StatusTypeID": 50,
            "LevelID": 2,
            "PowerKW": 22,
            "CurrentTypeID": 20
        }
    ],
    "StatusTypeID": 0,
    "DateLastStatusUpdate": "2021-07-12T02:41:00Z",
    "MetadataValues": [
        {
            "ID": 9527,
            "MetadataFieldID": 4,
            "ItemValue": "Data from the German chargepoint registry provided by Bundesnetzagentur.de under the CC-BY 4.0 license"
        }
    ],
    "DataQualityLevel": 3,
    "DateCreated": "2021-07-08T09:48:00Z",
    "SubmissionStatusTypeID": 100
}