{
    "IsRecentlyVerified": false,
    "ID": 38661,
    "UUID": "4E3C21A3-E1A5-4DB5-816E-5A4365C430E1",
    "DataProviderID": 26,
    "DataProvidersReference": "35093",
    "OperatorsReference": "HVC",
    "UsageCost": "0.00 jaarabonnement",
    "AddressInfo": {
        "ID": 39007,
        "Title": "Handelskade 9",
        "AddressLine1": "Handelskade 9",
        "Town": "Urk",
        "Postcode": "8321 KB",
        "CountryID": 159,
        "Latitude": 52.659917905591,
        "Longitude": 5.5988484621048,
        "RelatedURL": "http://www.urk.nl",
        "DistanceUnit": 0
    },
    "Connections": [
        {
            "ID": 42172,
            "ConnectionTypeID": 25,
            "LevelID": 2,
            "PowerKW": 3.7,
            "CurrentTypeID": 10
        }
    ],
    "NumberOfPoints": 1,
    "StatusTypeID": 50,
    "DateLastStatusUpdate": "2016-06-04T02:55:00Z",
    "DataQualityLevel": 3,
    "DateCreated": "2015-01-09T06:08:00Z",
    "SubmissionStatusTypeID": 100
}