{
    "IsRecentlyVerified": false,
    "ID": 114204,
    "UUID": "2BF5B091-26E8-4418-987E-11D709E4F9BA",
    "DataProviderID": 1,
    "OperatorID": 23,
    "OperatorsReference": "47465",
    "UsageTypeID": 4,
    "AddressInfo": {
        "ID": 114550,
        "Title": "Russian River Brewing Company - Windsor",
        "AddressLine1": "700 Mitchell LN",
        "Town": "Windsor",
        "StateOrProvince": "California",
        "Postcode": "95492",
        "CountryID": 2,
        "Latitude": 38.532508,
        "Longitude": -122.80288,
        "ContactTelephone1": "(707) 545-2337",
        "DistanceUnit": 0
    },
    "Connections": [
        {
            "ID": 160774,
            "ConnectionTypeID": 30,
            "StatusTypeID": 50,
            "LevelID": 2,
            "PowerKW": 16,
            "CurrentTypeID": 20,
            "Quantity": 4
        }
    ],
    "NumberOfPoints": 4,
    "GeneralComments": "4 Tesla Connectors, up to 16kW.Available for customers. Self park.",
    "StatusTypeID": 50,
    "DateLastStatusUpdate": "2019-01-03T08:13:00Z",
    "DataQualityLevel": 1,
    "DateCreated": "2019-01-03T08:13:00Z",
    "SubmissionStatusTypeID": 200
}