{
    "IsRecentlyVerified": false,
    "ID": 187140,
    "UUID": "65F91A35-6B4E-4018-B612-BBB1E7E033EA",
    "DataProviderID": 29,
    "DataProvidersReference": "2310",
    "OperatorID": 220,
    "AddressInfo": {
        "ID": 187499,
        "Title": "Neuer Weg Ecke Frascati Platz",
        "AddressLine1": "Neuer Weg Ecke Frascati Platz",
        "Town": "Hamburg",
        "Postcode": "21029",
        "CountryID": 87,
        "Latitude": 53.483558,
        "Longitude": 10.211489,
        "DistanceUnit": 0
    },
    "Connections": [
        {
            "ID": 301363,
            "ConnectionTypeID": 33,
            "StatusTypeID": 50,
            "LevelID": 3,
            "PowerKW": 50,
            "CurrentTypeID": 30
        },
        {
            "ID": 301364,
            "ConnectionTypeID": 2,
            "StatusTypeID": 50,
            "LevelID": 3,
            "PowerKW": 50,
            "CurrentTypeID": 30
        },
        {
            "ID": 301365,
            "ConnectionTypeID": 25,
            "StatusTypeID": 50,
            "LevelID": 2,
            "PowerKW": 11,
            "CurrentTypeID": 20
        }
    ],
    "StatusTypeID": 50,
    "DateLastStatusUpdate": "2021-07-12T02:51:00Z",
    "MetadataValues": [
        {
            "ID": 19380,
            "MetadataFieldID": 4,
            "ItemValue": "Data from the German chargepoint registry provided by Bundesnetzagentur.de under the CC-BY 4.0 license"
        }
    ],
    "DataQualityLevel": 3,
    "DateCreated": "2021-07-12T02:51:00Z",
    "SubmissionStatusTypeID": 100
}