{
    "IsRecentlyVerified": false,
    "ID": 153511,
    "UUID": "BB2E6E4F-B8CE-442F-9F8B-6A5166FFC3E5",
    "DataProviderID": 28,
    "DataProvidersReference": "FR*S89*P89373*A",
    "UsageTypeID": 5,
    "AddressInfo": {
        "ID": 153864,
        "Title": "SALIGNY_Rue Du Gue",
        "AddressLine1": "Rue Du Gue 89100 SALIGNY",
        "CountryID": 80,
        "Latitude": 48.21262288,
        "Longitude": 3.35302339,
        "AccessComments": "24/24 7/7 jours",
        "DistanceUnit": 0
    },
    "Connections": [
        {
            "ID": 215405,
            "ConnectionTypeID": 28,
            "StatusTypeID": 50,
            "LevelID": 2,
            "PowerKW": 22,
            "CurrentTypeID": 10
        },
        {
            "ID": 215406,
            "ConnectionTypeID": 1036,
            "StatusTypeID": 50,
            "LevelID": 2,
            "PowerKW": 22,
            "CurrentTypeID": 20
        },
        {
            "ID": 248881,
            "ConnectionTypeID": 28,
            "StatusTypeID": 50,
            "LevelID": 2,
            "PowerKW": 22,
            "CurrentTypeID": 10
        },
        {
            "ID": 248882,
            "ConnectionTypeID": 1036,
            "StatusTypeID": 50,
            "LevelID": 2,
            "PowerKW": 22,
            "CurrentTypeID": 20
        }
    ],
    "GeneralComments": "",
    "StatusTypeID": 50,
    "DateLastStatusUpdate": "2020-08-27T05:14:00Z",
    "DataQualityLevel": 2,
    "DateCreated": "2020-03-15T10:54:00Z",
    "SubmissionStatusTypeID": 100
}