{
    "IsRecentlyVerified": false,
    "ID": 79321,
    "UUID": "01C02E99-9A02-491F-9681-DE43D94A8001",
    "DataProviderID": 1,
    "OperatorID": 23,
    "OperatorsReference": "20798",
    "UsageTypeID": 4,
    "UsageCost": "SEK 2.56/kWh; andra taxor möjligt för äldre bilar",
    "AddressInfo": {
        "ID": 79667,
        "Title": "Umeå Supercharger",
        "AddressLine1": "Marknadsgatan 19",
        "Town": "Umeå",
        "Postcode": "90421",
        "CountryID": 216,
        "Latitude": 63.811159,
        "Longitude": 20.250153,
        "DistanceUnit": 0
    },
    "Connections": [
        {
            "ID": 113949,
            "ConnectionTypeID": 27,
            "StatusTypeID": 50,
            "LevelID": 3,
            "PowerKW": 120,
            "CurrentTypeID": 30,
            "Quantity": 12
        }
    ],
    "NumberOfPoints": 12,
    "GeneralComments": "Charging4 Superchargers, available 24/7",
    "StatusTypeID": 50,
    "DateLastStatusUpdate": "2021-01-12T06:54:00Z",
    "DataQualityLevel": 1,
    "DateCreated": "2017-01-27T08:06:00Z",
    "SubmissionStatusTypeID": 200
}