{
    "IsRecentlyVerified": false,
    "ID": 119664,
    "UUID": "29B4C861-8812-4ECA-89D1-516776C9AFF7",
    "DataProviderID": 2,
    "DataProvidersReference": "77840",
    "UsageTypeID": 2,
    "AddressInfo": {
        "ID": 120010,
        "Title": "Florida Power & Light - Command Center",
        "AddressLine1": "4233 Upthegrove Ln",
        "Town": "West Palm Beach",
        "StateOrProvince": "FL",
        "Postcode": "33407",
        "CountryID": 2,
        "Latitude": 26.763911,
        "Longitude": -80.10438,
        "ContactTelephone1": "",
        "AccessComments": "Fleet use only",
        "RelatedURL": "",
        "DistanceUnit": 0
    },
    "Connections": [
        {
            "ID": 168944,
            "ConnectionTypeID": 1,
            "LevelID": 2,
            "Amps": 16,
            "Voltage": 230,
            "PowerKW": 3.7,
            "CurrentTypeID": 10,
            "Quantity": 2
        }
    ],
    "DateLastStatusUpdate": "2020-06-26T02:52:00Z",
    "DataQualityLevel": 3,
    "DateCreated": "2019-04-01T04:59:00Z",
    "SubmissionStatusTypeID": 100
}