{
    "IsRecentlyVerified": false,
    "ID": 70652,
    "UUID": "FC340456-57F6-4001-BA67-8192BFACF9FF",
    "DataProviderID": 1,
    "OperatorID": 3248,
    "UsageTypeID": 1,
    "AddressInfo": {
        "ID": 70998,
        "Title": "Rasthof Baden-Baden West",
        "AddressLine1": "A5",
        "Town": "Baden-Baden",
        "StateOrProvince": "Baden-Baden",
        "Postcode": "76532",
        "CountryID": 87,
        "Latitude": 48.8090202460372,
        "Longitude": 8.18124221948551,
        "AccessComments": "24/7 kostenlos nutzbar.",
        "RelatedURL": "http://tank.rast.de/emobility",
        "DistanceUnit": 0
    },
    "Connections": [
        {
            "ID": 101161,
            "ConnectionTypeID": 2,
            "StatusTypeID": 50,
            "LevelID": 3,
            "PowerKW": 50,
            "CurrentTypeID": 30,
            "Quantity": 1
        },
        {
            "ID": 101162,
            "ConnectionTypeID": 33,
            "StatusTypeID": 50,
            "LevelID": 3,
            "PowerKW": 50,
            "CurrentTypeID": 30,
            "Quantity": 1
        },
        {
            "ID": 101163,
            "ConnectionTypeID": 1036,
            "StatusTypeID": 50,
            "LevelID": 3,
            "Amps": 63,
            "Voltage": 400,
            "PowerKW": 43,
            "CurrentTypeID": 20,
            "Quantity": 1
        }
    ],
    "NumberOfPoints": 1,
    "StatusTypeID": 50,
    "DateLastStatusUpdate": "2016-08-02T07:02:00Z",
    "DataQualityLevel": 1,
    "DateCreated": "2016-08-01T07:06:00Z",
    "SubmissionStatusTypeID": 200
}