{
    "IsRecentlyVerified": false,
    "ID": 138372,
    "UUID": "DD23BB9F-1AA7-4BC7-A396-5E18C3352783",
    "DataProviderID": 2,
    "DataProvidersReference": "150297",
    "OperatorID": 5,
    "UsageTypeID": 1,
    "AddressInfo": {
        "ID": 138721,
        "Title": "LOT 1 UNIT 1",
        "AddressLine1": "One University Way",
        "Town": "San Antonio",
        "StateOrProvince": "TX",
        "Postcode": "78224",
        "CountryID": 2,
        "Latitude": 29.3042745,
        "Longitude": -98.5247016,
        "ContactTelephone1": "888-758-4389",
        "AccessComments": "24 hours daily",
        "RelatedURL": "http://www.chargepoint.com/",
        "DistanceUnit": 0
    },
    "Connections": [
        {
            "ID": 193481,
            "ConnectionTypeID": 1,
            "LevelID": 2,
            "Amps": 16,
            "Voltage": 230,
            "PowerKW": 3.7,
            "CurrentTypeID": 10,
            "Quantity": 2
        }
    ],
    "StatusTypeID": 50,
    "DateLastStatusUpdate": "2020-06-26T02:53:00Z",
    "DataQualityLevel": 3,
    "DateCreated": "2019-12-24T09:08:00Z",
    "SubmissionStatusTypeID": 100
}