{
    "IsRecentlyVerified": false,
    "ID": 173187,
    "UUID": "1243A36C-B0D6-4028-907F-1B938D56DBD0",
    "DataProviderID": 19,
    "DataProvidersReference": "6868",
    "AddressInfo": {
        "ID": 173546,
        "Title": "Tråkka",
        "AddressLine1": "Tråkka 30-34",
        "Town": "OSLO",
        "StateOrProvince": "Oslo",
        "Postcode": "0561",
        "CountryID": 168,
        "Latitude": 59.951824,
        "Longitude": 10.681616,
        "AccessComments": "",
        "DistanceUnit": 0
    },
    "Connections": [
        {
            "ID": 265741,
            "ConnectionTypeID": 25,
            "Reference": "1",
            "LevelID": 2,
            "Amps": 32,
            "Voltage": 230,
            "PowerKW": 7.4,
            "CurrentTypeID": 10,
            "Comments": "Mode 3"
        },
        {
            "ID": 265742,
            "ConnectionTypeID": 25,
            "Reference": "2",
            "LevelID": 2,
            "Amps": 32,
            "Voltage": 230,
            "PowerKW": 7.4,
            "CurrentTypeID": 10,
            "Comments": "Mode 3"
        },
        {
            "ID": 265743,
            "ConnectionTypeID": 25,
            "Reference": "3",
            "LevelID": 2,
            "Amps": 32,
            "Voltage": 230,
            "PowerKW": 7.4,
            "CurrentTypeID": 10,
            "Comments": "Mode 3"
        },
        {
            "ID": 265744,
            "ConnectionTypeID": 25,
            "Reference": "4",
            "LevelID": 2,
            "Amps": 32,
            "Voltage": 230,
            "PowerKW": 7.4,
            "CurrentTypeID": 10,
            "Comments": "Mode 3"
        },
        {
            "ID": 265745,
            "ConnectionTypeID": 25,
            "Reference": "5",
            "LevelID": 2,
            "Amps": 32,
            "Voltage": 230,
            "PowerKW": 7.4,
            "CurrentTypeID": 10,
            "Comments": "Mode 3"
        },
        {
            "ID": 265746,
            "ConnectionTypeID": 25,
            "Reference": "6",
            "LevelID": 2,
            "Amps": 32,
            "Voltage": 230,
            "PowerKW": 7.4,
            "CurrentTypeID": 10,
            "Comments": "Mode 3"
        },
        {
            "ID": 265747,
            "ConnectionTypeID": 25,
            "Reference": "7",
            "LevelID": 2,
            "Amps": 32,
            "Voltage": 230,
            "PowerKW": 7.4,
            "CurrentTypeID": 10,
            "Comments": "Mode 3"
        },
        {
            "ID": 265748,
            "ConnectionTypeID": 25,
            "Reference": "8",
            "LevelID": 2,
            "Amps": 32,
            "Voltage": 230,
            "PowerKW": 7.4,
            "CurrentTypeID": 10,
            "Comments": "Mode 3"
        }
    ],
    "NumberOfPoints": 8,
    "StatusTypeID": 0,
    "DateLastStatusUpdate": "2021-03-24T05:12:00Z",
    "DataQualityLevel": 2,
    "DateCreated": "2021-03-03T09:02:00Z",
    "SubmissionStatusTypeID": 100
}