{
    "IsRecentlyVerified": false,
    "ID": 59097,
    "UUID": "5543C116-95E4-4E82-973A-9F358F7FC1DD",
    "DataProviderID": 1,
    "OperatorID": 23,
    "OperatorsReference": "9005",
    "UsageTypeID": 1,
    "UsageCost": "£0.24/kWh;other tariffs for older cars",
    "AddressInfo": {
        "ID": 59443,
        "Title": "Barnsley Supercharger",
        "AddressLine1": "Church Lane",
        "Town": "Barnsley",
        "Postcode": "S75 3DQ",
        "CountryID": 1,
        "Latitude": 53.489393,
        "Longitude": -1.486223,
        "DistanceUnit": 0
    },
    "Connections": [
        {
            "ID": 74989,
            "ConnectionTypeID": 27,
            "StatusTypeID": 50,
            "LevelID": 3,
            "PowerKW": 150,
            "CurrentTypeID": 30,
            "Quantity": 2
        }
    ],
    "NumberOfPoints": 2,
    "StatusTypeID": 50,
    "DateLastStatusUpdate": "2020-05-20T07:42:00Z",
    "DataQualityLevel": 1,
    "DateCreated": "2016-01-07T11:52:00Z",
    "SubmissionStatusTypeID": 200
}