{
    "UserComments": [
        {
            "ID": 20827,
            "ChargePointID": 13528,
            "CommentTypeID": 10,
            "UserName": "My_Leaf",
            "Comment": "",
            "Rating": 5,
            "DateCreated": "2019-03-23T21:17:54.4Z",
            "User": {
                "ID": 4511,
                "Username": "My_Leaf"
            },
            "CheckinStatusTypeID": 10
        },
        {
            "ID": 10301,
            "ChargePointID": 13528,
            "CommentTypeID": 10,
            "UserName": "Familie van der Heide",
            "Comment": "Clean with facilities",
            "Rating": 4,
            "DateCreated": "2016-05-04T18:39:51.637Z",
            "User": {
                "ID": 9294,
                "Username": "Familie van der Heide"
            },
            "CheckinStatusTypeID": 10
        }
    ],
    "MediaItems": [
        {
            "ID": 17834,
            "ChargePointID": 13528,
            "ItemURL": "https://s3-ap-southeast-2.amazonaws.com/openchargemap/images/NL/OCM13528/OCM-13528.orig.2019032321172516.png",
            "ItemThumbnailURL": "https://s3-ap-southeast-2.amazonaws.com/openchargemap/images/NL/OCM13528/OCM-13528.thmb.2019032321172516.png",
            "Comment": "working fine . NissanElectricClub.nl",
            "IsEnabled": true,
            "IsVideo": false,
            "IsFeaturedItem": false,
            "IsExternalResource": false,
            "User": {
                "ID": 4511,
                "Username": "My_Leaf"
            },
            "DateCreated": "2019-03-23T21:18:00Z"
        },
        {
            "ID": 15113,
            "ChargePointID": 13528,
            "ItemURL": "https://s3-ap-southeast-2.amazonaws.com/openchargemap/images/NL/OCM13528/OCM-13528.orig.2018022410234320.jpeg",
            "ItemThumbnailURL": "https://s3-ap-southeast-2.amazonaws.com/openchargemap/images/NL/OCM13528/OCM-13528.thmb.2018022410234320.jpeg",
            "Comment": "Nissan Electric club nl",
            "IsEnabled": true,
            "IsVideo": false,
            "IsFeaturedItem": false,
            "IsExternalResource": false,
            "User": {
                "ID": 4511,
                "Username": "My_Leaf"
            },
            "DateCreated": "2018-02-24T10:24:00Z"
        },
        {
            "ID": 3026,
            "ChargePointID": 13528,
            "ItemURL": "https://s3-ap-southeast-2.amazonaws.com/openchargemap/images/NL/OCM13528/OCM-13528.orig.2015081512064329.jpg",
            "ItemThumbnailURL": "https://s3-ap-southeast-2.amazonaws.com/openchargemap/images/NL/OCM13528/OCM-13528.thmb.2015081512064329.jpg",
            "Comment": "via https://twitter.com/HvDijkhuizen/status/632160279065948160",
            "IsEnabled": true,
            "IsVideo": false,
            "IsFeaturedItem": false,
            "IsExternalResource": false,
            "User": {
                "ID": 1002,
                "Username": "Jean-Christophe"
            },
            "DateCreated": "2015-08-15T12:07:00Z"
        }
    ],
    "IsRecentlyVerified": false,
    "ID": 13528,
    "UUID": "E2DA4E3F-4B47-4572-AEA9-8332A97BB8AD",
    "DataProviderID": 1,
    "OperatorID": 1,
    "UsageTypeID": 5,
    "UsageCost": "",
    "AddressInfo": {
        "ID": 13425,
        "Title": "Servicestation H. van Dijkhuizen",
        "AddressLine1": "Prinsenhof 2",
        "AddressLine2": "",
        "Town": "Tiel",
        "StateOrProvince": "Gelderland",
        "Postcode": "4004 LN",
        "CountryID": 159,
        "Latitude": 51.9098903,
        "Longitude": 5.4537596,
        "ContactTelephone1": "+31 (0)344-820212",
        "ContactTelephone2": "",
        "ContactEmail": "",
        "AccessComments": "Servicestation \"Medel\"Openingstijden: 24/7Achter hek.",
        "RelatedURL": "http://www.hvandijkhuizen.nl/",
        "DistanceUnit": 0
    },
    "Connections": [
        {
            "ID": 10998,
            "ConnectionTypeID": 2,
            "StatusTypeID": 50,
            "LevelID": 3,
            "Amps": 120,
            "Voltage": 400,
            "PowerKW": 50,
            "CurrentTypeID": 30,
            "Quantity": 1
        },
        {
            "ID": 64533,
            "ConnectionTypeID": 33,
            "StatusTypeID": 0,
            "LevelID": 3,
            "CurrentTypeID": 30,
            "Quantity": 1
        },
        {
            "ID": 64534,
            "ConnectionTypeID": 25,
            "StatusTypeID": 0,
            "CurrentTypeID": 20
        }
    ],
    "NumberOfPoints": 1,
    "GeneralComments": "Betaling: In tankshop",
    "StatusTypeID": 50,
    "DateLastStatusUpdate": "2019-03-23T21:18:00Z",
    "DataQualityLevel": 1,
    "DateCreated": "2012-11-03T14:34:00Z",
    "SubmissionStatusTypeID": 200
}