{
    "MediaItems": [
        {
            "ID": 19621,
            "ChargePointID": 131220,
            "ItemURL": "https://s3-ap-southeast-2.amazonaws.com/openchargemap/images/US/OCM131220/OCM-131220.orig.2019091919521399.png",
            "ItemThumbnailURL": "https://s3-ap-southeast-2.amazonaws.com/openchargemap/images/US/OCM131220/OCM-131220.thmb.2019091919521399.png",
            "Comment": "",
            "IsEnabled": true,
            "IsVideo": false,
            "IsFeaturedItem": false,
            "IsExternalResource": false,
            "User": {
                "ID": 22107,
                "Username": "Hotel Saranac"
            },
            "DateCreated": "2019-09-19T19:53:00Z"
        },
        {
            "ID": 19620,
            "ChargePointID": 131220,
            "ItemURL": "https://s3-ap-southeast-2.amazonaws.com/openchargemap/images/US/OCM131220/OCM-131220.orig.2019091919495393.png",
            "ItemThumbnailURL": "https://s3-ap-southeast-2.amazonaws.com/openchargemap/images/US/OCM131220/OCM-131220.thmb.2019091919495393.png",
            "Comment": "",
            "IsEnabled": true,
            "IsVideo": false,
            "IsFeaturedItem": false,
            "IsExternalResource": false,
            "User": {
                "ID": 22107,
                "Username": "Hotel Saranac"
            },
            "DateCreated": "2019-09-19T19:50:00Z"
        }
    ],
    "IsRecentlyVerified": false,
    "ID": 131220,
    "UUID": "598B9019-4444-4345-865F-3CB79C817C4B",
    "DataProviderID": 1,
    "OperatorID": 5,
    "UsageTypeID": 1,
    "AddressInfo": {
        "ID": 131566,
        "Title": "Hotel Saranac",
        "AddressLine1": "100 Main Street",
        "Town": "Saranac Lake",
        "StateOrProvince": "Franklin County",
        "Postcode": "12983",
        "CountryID": 2,
        "Latitude": 44.3268504555664,
        "Longitude": -74.1304698827614,
        "ContactTelephone1": "518 891 6900",
        "ContactEmail": "lgraham@hotelsaranac.com",
        "AccessComments": "Hotel Saranac Mixes Classic Design With Modern Comforts. For nearly 100 years, Hotel Saranac has been a landmark of downtown Saranac Lake.",
        "RelatedURL": "https://hotelsaranac.com/?gclid=EAIaIQobChMIvfXxh6Wr5AIVhobACh0ncwCLEAAYAiAAEgLPvvD_BwE",
        "DistanceUnit": 0
    },
    "Connections": [
        {
            "ID": 183745,
            "ConnectionTypeID": 1,
            "StatusTypeID": 50,
            "LevelID": 2,
            "Amps": 32,
            "Voltage": 240,
            "PowerKW": 7,
            "CurrentTypeID": 10,
            "Quantity": 2
        }
    ],
    "NumberOfPoints": 2,
    "StatusTypeID": 50,
    "DateLastStatusUpdate": "2019-09-19T19:53:00Z",
    "DataQualityLevel": 1,
    "DateCreated": "2019-08-30T19:30:00Z",
    "SubmissionStatusTypeID": 200
}