{
    "IsRecentlyVerified": false,
    "ID": 68030,
    "UUID": "7D759B91-CF2B-4DB0-A099-81830B9437DF",
    "DataProviderID": 26,
    "DataProvidersReference": "92368",
    "OperatorID": 73,
    "OperatorsReference": "EV-Box EVB-P1416008",
    "UsageCost": "0.00 jaarabonnement",
    "AddressInfo": {
        "ID": 68376,
        "Title": "Chromiumweg 9",
        "AddressLine1": "Chromiumweg 9",
        "Town": "Amersfoort",
        "Postcode": "3812 NL",
        "CountryID": 159,
        "Latitude": 52.02137,
        "Longitude": 5.14909,
        "RelatedURL": "http://www.ev-box.nl",
        "DistanceUnit": 0
    },
    "Connections": [
        {
            "ID": 94723,
            "ConnectionTypeID": 25,
            "LevelID": 2,
            "PowerKW": 5,
            "CurrentTypeID": 10
        },
        {
            "ID": 94724,
            "ConnectionTypeID": 25,
            "LevelID": 2,
            "PowerKW": 11,
            "CurrentTypeID": 10
        }
    ],
    "NumberOfPoints": 1,
    "StatusTypeID": 50,
    "DateLastStatusUpdate": "2016-06-04T02:37:00Z",
    "DataQualityLevel": 3,
    "DateCreated": "2016-06-04T02:37:00Z",
    "SubmissionStatusTypeID": 100
}