{
    "IsRecentlyVerified": false,
    "ID": 60542,
    "UUID": "E7ADE205-E88F-445F-A9D5-50E1E90A28DC",
    "DataProviderID": 1,
    "OperatorID": 45,
    "UsageTypeID": 1,
    "AddressInfo": {
        "ID": 60888,
        "Title": "Schwimmbad Basinus",
        "AddressLine1": "Spessartstraße 12",
        "Town": "Bensheim",
        "StateOrProvince": "Kreis Bergstraße",
        "Postcode": "64625",
        "CountryID": 87,
        "Latitude": 49.68323,
        "Longitude": 8.6146,
        "AccessComments": "Nach der Einfahrt etwa in der Mitte der ersten Reihe auf der rechten Seite.  Die Säule ist nutzbar von Mo/Mi/Fr 10-22 Uhr; Di 06:30-22Uhr, Sa/So 08-22Uhr (während der Öffnungszeiten des Hallenbades).\r\n",
        "RelatedURL": "http://www.basinus-bad.de/",
        "DistanceUnit": 0
    },
    "Connections": [
        {
            "ID": 76701,
            "ConnectionTypeID": 25,
            "StatusTypeID": 50,
            "LevelID": 2,
            "Amps": 16,
            "Voltage": 400,
            "PowerKW": 11,
            "CurrentTypeID": 20,
            "Quantity": 1
        }
    ],
    "NumberOfPoints": 1,
    "GeneralComments": "Ladepunkt nur mit Ubitricity Smart Cable freischaltbar.",
    "StatusTypeID": 50,
    "DateLastStatusUpdate": "2019-10-23T17:20:00Z",
    "DataQualityLevel": 1,
    "DateCreated": "2016-02-01T06:19:00Z",
    "SubmissionStatusTypeID": 200
}