{
    "IsRecentlyVerified": false,
    "ID": 71911,
    "UUID": "475FC169-3A94-4A6A-B80D-865085D5F48E",
    "DataProviderID": 1,
    "UsageTypeID": 4,
    "AddressInfo": {
        "ID": 72257,
        "Title": "eBorn SDE07 - Les Vergnades",
        "AddressLine1": "Les Vergnades",
        "Town": "Largentière",
        "Postcode": "07110",
        "CountryID": 80,
        "Latitude": 44.53851,
        "Longitude": 4.291875,
        "RelatedURL": "http://www.sde07.com/",
        "DistanceUnit": 0
    },
    "Connections": [
        {
            "ID": 103056,
            "ConnectionTypeID": 25,
            "StatusTypeID": 50,
            "LevelID": 2,
            "Amps": 32,
            "Voltage": 400,
            "PowerKW": 22,
            "CurrentTypeID": 20,
            "Quantity": 2
        },
        {
            "ID": 103057,
            "ConnectionTypeID": 23,
            "StatusTypeID": 50,
            "LevelID": 2,
            "Amps": 16,
            "Voltage": 230,
            "PowerKW": 3,
            "CurrentTypeID": 10,
            "Quantity": 2
        }
    ],
    "NumberOfPoints": 2,
    "GeneralComments": "Nécessite le badge SDE07.\r\nFormulaire de demande de badge disponible à l'adresse suivante: http://www.sde07.com/communes-collectivites-ardeche/bornes-de-charges-vehicules-hybrides-electriques/",
    "StatusTypeID": 50,
    "DateLastStatusUpdate": "2016-09-25T14:28:00Z",
    "DataQualityLevel": 1,
    "DateCreated": "2016-09-22T14:08:00Z",
    "SubmissionStatusTypeID": 200
}