{
    "IsRecentlyVerified": false,
    "ID": 150253,
    "UUID": "9D484975-6862-4A4F-965E-A89910858A42",
    "DataProviderID": 28,
    "DataProvidersReference": "FR*S09*P09157*001",
    "OperatorID": 3257,
    "UsageTypeID": 5,
    "AddressInfo": {
        "ID": 150606,
        "Title": "LAROQUE D'OLMES - Square Georges Clemenceau",
        "AddressLine1": "Square Georges Clemenceau 9600 LAROQUE D'OLMES",
        "CountryID": 80,
        "Latitude": 42.968805,
        "Longitude": 1.866233,
        "AccessComments": "24h/24 7j/7",
        "DistanceUnit": 0
    },
    "Connections": [
        {
            "ID": 208753,
            "ConnectionTypeID": 1036,
            "StatusTypeID": 50,
            "LevelID": 2,
            "PowerKW": 22,
            "CurrentTypeID": 20
        },
        {
            "ID": 208754,
            "ConnectionTypeID": 28,
            "StatusTypeID": 50,
            "LevelID": 2,
            "PowerKW": 22,
            "CurrentTypeID": 10
        },
        {
            "ID": 237331,
            "ConnectionTypeID": 1036,
            "StatusTypeID": 50,
            "LevelID": 2,
            "PowerKW": 22,
            "CurrentTypeID": 20
        },
        {
            "ID": 237332,
            "ConnectionTypeID": 28,
            "StatusTypeID": 50,
            "LevelID": 2,
            "PowerKW": 22,
            "CurrentTypeID": 10
        }
    ],
    "GeneralComments": "Recharge par badge et avec une application smartphone",
    "StatusTypeID": 50,
    "DateLastStatusUpdate": "2020-08-27T05:10:00Z",
    "DataQualityLevel": 2,
    "DateCreated": "2020-03-15T06:17:00Z",
    "SubmissionStatusTypeID": 100
}