{
    "IsRecentlyVerified": false,
    "ID": 74042,
    "UUID": "501B393F-0F3E-4558-BB1F-3B40758467EB",
    "DataProviderID": 1,
    "OperatorID": 89,
    "OperatorsReference": "AAB-11447",
    "UsageTypeID": 4,
    "UsageCost": "CAD 1.00/hour",
    "AddressInfo": {
        "ID": 74388,
        "Title": "Rta-Manoir du Saguenay",
        "AddressLine1": "1655 Powell",
        "Town": "Jonquière",
        "StateOrProvince": "QC",
        "Postcode": "G7S 2Z1",
        "CountryID": 44,
        "Latitude": 48.438746,
        "Longitude": -71.18742,
        "DistanceUnit": 0
    },
    "Connections": [
        {
            "ID": 106360,
            "ConnectionTypeID": 1,
            "StatusTypeID": 50,
            "LevelID": 2,
            "Amps": 32,
            "Voltage": 230,
            "PowerKW": 7,
            "CurrentTypeID": 10,
            "Quantity": 1
        }
    ],
    "NumberOfPoints": 1,
    "StatusTypeID": 50,
    "DateLastStatusUpdate": "2018-01-05T13:52:00Z",
    "DataQualityLevel": 1,
    "DateCreated": "2016-11-24T00:04:00Z",
    "SubmissionStatusTypeID": 200
}