{
    "IsRecentlyVerified": false,
    "ID": 79215,
    "UUID": "045D5E28-CA93-4145-9845-8B5676BAFD1A",
    "DataProviderID": 1,
    "OperatorID": 23,
    "OperatorsReference": "11943",
    "UsageTypeID": 6,
    "UsageCost": "Free",
    "AddressInfo": {
        "ID": 79561,
        "Title": "Best Western Plus Abercorn Inn",
        "AddressLine1": "9260 Bridgeport RD",
        "Town": "Richmond",
        "StateOrProvince": "BC",
        "Postcode": "V6X 1S1",
        "CountryID": 44,
        "Latitude": 49.1917643,
        "Longitude": -123.1209056,
        "ContactTelephone1": "(604) 484-2570",
        "DistanceUnit": 0
    },
    "Connections": [
        {
            "ID": 113834,
            "ConnectionTypeID": 30,
            "StatusTypeID": 50,
            "LevelID": 2,
            "PowerKW": 16,
            "CurrentTypeID": 20,
            "Quantity": 1
        }
    ],
    "NumberOfPoints": 1,
    "GeneralComments": "1 Tesla Connector, up to 16kW.Available for patrons only. Please see front desk.",
    "StatusTypeID": 50,
    "DateLastStatusUpdate": "2017-01-26T21:08:00Z",
    "DataQualityLevel": 1,
    "DateCreated": "2017-01-26T21:08:00Z",
    "SubmissionStatusTypeID": 200
}