{
    "UserComments": [
        {
            "ID": 19147,
            "ChargePointID": 97843,
            "CommentTypeID": 10,
            "UserName": "ForumElettrico.it",
            "Comment": "https://www.forumelettrico.it/forum/tdc-22kw-ristorante-la-brace-ss38-forcola-so-t2213.html\n",
            "DateCreated": "2018-02-03T11:26:07.067Z",
            "User": {
                "ID": 11749,
                "Username": "ForumElettrico.it"
            },
            "CheckinStatusTypeID": 140
        },
        {
            "ID": 19135,
            "ChargePointID": 97843,
            "CommentTypeID": 10,
            "UserName": "polianto",
            "RelatedURL": "https://www.forumelettrico.it/forum/tdc-22kw-ristorante-la-brace-ss38-forcola-so-t2213.html",
            "DateCreated": "2018-01-28T10:53:38.03Z",
            "User": {
                "ID": 1606,
                "Username": "polianto"
            },
            "CheckinStatusTypeID": 140
        }
    ],
    "MediaItems": [
        {
            "ID": 13991,
            "ChargePointID": 97843,
            "ItemURL": "https://s3-ap-southeast-2.amazonaws.com/openchargemap/images/IT/OCM97843/OCM-97843.orig.2018012117404857.jpg",
            "ItemThumbnailURL": "https://s3-ap-southeast-2.amazonaws.com/openchargemap/images/IT/OCM97843/OCM-97843.thmb.2018012117404857.jpg",
            "Comment": "",
            "IsEnabled": true,
            "IsVideo": false,
            "IsFeaturedItem": false,
            "IsExternalResource": false,
            "User": {
                "ID": 1606,
                "Username": "polianto"
            },
            "DateCreated": "2018-01-21T17:41:00Z"
        },
        {
            "ID": 13992,
            "ChargePointID": 97843,
            "ItemURL": "https://s3-ap-southeast-2.amazonaws.com/openchargemap/images/IT/OCM97843/OCM-97843.orig.2018012117410666.jpg",
            "ItemThumbnailURL": "https://s3-ap-southeast-2.amazonaws.com/openchargemap/images/IT/OCM97843/OCM-97843.thmb.2018012117410666.jpg",
            "Comment": "",
            "IsEnabled": true,
            "IsVideo": false,
            "IsFeaturedItem": false,
            "IsExternalResource": false,
            "User": {
                "ID": 1606,
                "Username": "polianto"
            },
            "DateCreated": "2018-01-21T17:41:00Z"
        }
    ],
    "IsRecentlyVerified": false,
    "ID": 97843,
    "UUID": "10E9E6C8-135D-4B4B-AFE8-CDE7A64679BE",
    "DataProviderID": 1,
    "OperatorID": 23,
    "OperatorsReference": "39395",
    "UsageTypeID": 6,
    "AddressInfo": {
        "ID": 98189,
        "Title": "La Brace Hotel Restaurant & Bar",
        "AddressLine1": "Via Piani",
        "Town": "1",
        "StateOrProvince": "Forcola",
        "Postcode": "23010",
        "CountryID": 112,
        "Latitude": 46.165105,
        "Longitude": 9.676055,
        "ContactTelephone1": "+39 0342 660 408",
        "ContactEmail": "labrace@labrace.it",
        "RelatedURL": "https://www.labrace.it/#",
        "DistanceUnit": 0
    },
    "Connections": [
        {
            "ID": 138751,
            "ConnectionTypeID": 1036,
            "StatusTypeID": 50,
            "LevelID": 2,
            "Amps": 32,
            "Voltage": 400,
            "PowerKW": 22,
            "CurrentTypeID": 20,
            "Quantity": 1
        },
        {
            "ID": 138983,
            "ConnectionTypeID": 25,
            "StatusTypeID": 50,
            "LevelID": 2,
            "Amps": 32,
            "Voltage": 400,
            "PowerKW": 22,
            "CurrentTypeID": 20,
            "Quantity": 1
        },
        {
            "ID": 153488,
            "ConnectionTypeID": 30,
            "StatusTypeID": 50,
            "LevelID": 2,
            "Amps": 32,
            "Voltage": 400,
            "PowerKW": 22,
            "CurrentTypeID": 20,
            "Quantity": 1
        }
    ],
    "NumberOfPoints": 2,
    "GeneralComments": "1 Tesla Connector, up to 22kW. Available for customers. Please call ahead. + 1 for all EV\r\nNel parcheggio trovate anche  il nuovo spaccio della Galbusera.",
    "StatusTypeID": 50,
    "DateLastStatusUpdate": "2018-10-05T07:57:00Z",
    "DataQualityLevel": 1,
    "DateCreated": "2018-01-21T16:47:00Z",
    "SubmissionStatusTypeID": 200
}