{
    "IsRecentlyVerified": false,
    "ID": 160389,
    "UUID": "88831901-5978-403C-AA48-F9622BB31F75",
    "DataProviderID": 2,
    "DataProvidersReference": "151797",
    "OperatorID": 3293,
    "UsageTypeID": 1,
    "AddressInfo": {
        "ID": 160746,
        "Title": "Walgreens #13780",
        "AddressLine1": "955 SE Baseline St",
        "Town": "Hillsboro",
        "StateOrProvince": "OR",
        "Postcode": "97124",
        "CountryID": 2,
        "Latitude": 45.52018,
        "Longitude": -122.97503,
        "ContactTelephone1": "888-264-2208",
        "AccessComments": "6am-12am daily",
        "RelatedURL": "https://voltacharging.com/",
        "DistanceUnit": 0
    },
    "Connections": [
        {
            "ID": 230772,
            "ConnectionTypeID": 1,
            "LevelID": 2,
            "Amps": 16,
            "Voltage": 230,
            "PowerKW": 3.7,
            "CurrentTypeID": 10,
            "Quantity": 2
        }
    ],
    "StatusTypeID": 50,
    "DateLastStatusUpdate": "2020-06-26T03:09:00Z",
    "DataQualityLevel": 3,
    "DateCreated": "2020-06-26T03:09:00Z",
    "SubmissionStatusTypeID": 100
}