{
    "IsRecentlyVerified": false,
    "ID": 88371,
    "UUID": "968539A7-6BB9-4508-9B97-4B4219C2D43F",
    "DataProviderID": 1,
    "OperatorID": 234,
    "UsageTypeID": 4,
    "AddressInfo": {
        "ID": 88717,
        "Title": "Parkhaus Ringstraße",
        "AddressLine1": "Ringstraße 5a",
        "Town": "Neumarkt i.d.OPf.",
        "StateOrProvince": "Landkreis Neumarkt in der Oberpfalz",
        "Postcode": "92318",
        "CountryID": 87,
        "Latitude": 49.27639,
        "Longitude": 11.458689999999933,
        "RelatedURL": "http://www.ladeverbund-frankenplus.de/",
        "DistanceUnit": 0
    },
    "Connections": [
        {
            "ID": 125346,
            "ConnectionTypeID": 25,
            "StatusTypeID": 50,
            "LevelID": 2,
            "Amps": 16,
            "Voltage": 400,
            "PowerKW": 11,
            "CurrentTypeID": 20,
            "Quantity": 2
        }
    ],
    "NumberOfPoints": 2,
    "GeneralComments": "24/7 nutzbare Ladesäule auf dem Parkdeck E2\r\n",
    "StatusTypeID": 50,
    "DateLastStatusUpdate": "2017-05-29T06:21:00Z",
    "DataQualityLevel": 1,
    "DateCreated": "2017-05-29T06:21:00Z",
    "SubmissionStatusTypeID": 200
}