{
    "IsRecentlyVerified": false,
    "ID": 137954,
    "UUID": "5309E36C-F497-4142-9479-9D40998EB0ED",
    "DataProviderID": 2,
    "DataProvidersReference": "96498",
    "OperatorID": 9,
    "UsageTypeID": 1,
    "AddressInfo": {
        "ID": 138303,
        "Title": "Cascades - 5917 Stone Creek Drive",
        "AddressLine1": "5917 Stone Creek Drive",
        "Town": "The Colony",
        "StateOrProvince": "TX",
        "Postcode": "75056",
        "CountryID": 2,
        "Latitude": 33.082071,
        "Longitude": -96.85671,
        "ContactTelephone1": "888-998-2546",
        "AccessComments": "MON: 24 hours | TUE: 24 hours | WED: 24 hours | THU: 24 hours | FRI: 24 hours | SAT: 24 hours | SUN: 24 hours",
        "RelatedURL": "http://www.blinkcharging.com/",
        "DistanceUnit": 0
    },
    "Connections": [
        {
            "ID": 192984,
            "ConnectionTypeID": 1,
            "LevelID": 2,
            "Amps": 16,
            "Voltage": 230,
            "PowerKW": 3,
            "CurrentTypeID": 10,
            "Quantity": 2
        }
    ],
    "StatusTypeID": 50,
    "DateLastStatusUpdate": "2019-12-24T09:06:00Z",
    "DataQualityLevel": 3,
    "DateCreated": "2019-12-24T09:06:00Z",
    "SubmissionStatusTypeID": 100
}