{
    "IsRecentlyVerified": false,
    "ID": 99318,
    "UUID": "71DDE2AD-B98F-464D-9132-4670B0DC7234",
    "DataProviderID": 1,
    "OperatorID": 3279,
    "OperatorsReference": "0158",
    "UsageTypeID": 4,
    "UsageCost": "€0/kWh",
    "AddressInfo": {
        "ID": 99664,
        "Title": "Aguilar de Campoo",
        "AddressLine1": "Barrio Jose Gomez Briz S/N",
        "Town": "Aguilar de Campoo",
        "StateOrProvince": "Palencia",
        "CountryID": 210,
        "Latitude": 42.795425,
        "Longitude": -4.26558,
        "DistanceUnit": 0
    },
    "Connections": [
        {
            "ID": 140333,
            "ConnectionTypeID": 25,
            "StatusTypeID": 50,
            "LevelID": 2,
            "Amps": 32,
            "Voltage": 230,
            "PowerKW": 7,
            "CurrentTypeID": 10,
            "Quantity": 1
        },
        {
            "ID": 140334,
            "ConnectionTypeID": 28,
            "StatusTypeID": 50,
            "LevelID": 1,
            "Voltage": 230,
            "PowerKW": 2.3,
            "CurrentTypeID": 10,
            "Quantity": 1
        }
    ],
    "NumberOfPoints": 1,
    "StatusTypeID": 50,
    "DateLastStatusUpdate": "2018-07-12T05:45:00Z",
    "DataQualityLevel": 1,
    "DateCreated": "2018-01-25T18:57:00Z",
    "SubmissionStatusTypeID": 200
}