{
    "IsRecentlyVerified": true,
    "DateLastVerified": "2021-11-02T17:49:00Z",
    "ID": 189778,
    "UUID": "2C23DB5D-79DC-4E65-A6C4-EEA77811762A",
    "DataProviderID": 1,
    "OperatorID": 45,
    "UsageTypeID": 6,
    "UsageCost": "0.34€ per Kwh",
    "AddressInfo": {
        "ID": 190137,
        "Title": "Chemin de Garperon",
        "AddressLine1": "Chemin de Garperon",
        "AddressLine2": "Ludeye",
        "Town": "Listrac-Médoc",
        "StateOrProvince": "Gironde",
        "Postcode": "33480",
        "CountryID": 80,
        "Latitude": 45.0665539234943,
        "Longitude": -0.8107169984739357,
        "ContactTelephone1": "0660434775",
        "ContactEmail": "francois@angelelli.fr",
        "RelatedURL": "https://www.domainedeludeye.com",
        "DistanceUnit": 0
    },
    "Connections": [
        {
            "ID": 307052,
            "ConnectionTypeID": 13,
            "StatusTypeID": 50,
            "LevelID": 2,
            "Amps": 32,
            "Voltage": 400,
            "PowerKW": 11,
            "CurrentTypeID": 20
        }
    ],
    "NumberOfPoints": 1,
    "StatusTypeID": 50,
    "DateLastStatusUpdate": "2021-11-03T02:41:00Z",
    "DataQualityLevel": 1,
    "DateCreated": "2021-11-02T17:49:00Z",
    "SubmissionStatusTypeID": 200
}