{
    "IsRecentlyVerified": false,
    "ID": 110344,
    "UUID": "058327F3-0593-4C49-AB58-9228654D8E40",
    "DataProviderID": 2,
    "DataProvidersReference": "102630",
    "UsageTypeID": 2,
    "AddressInfo": {
        "ID": 110690,
        "Title": "Livermore Veterans Affairs Medical Center",
        "AddressLine1": "4951 Arroyo Rd",
        "Town": "Livermore",
        "StateOrProvince": "CA",
        "Postcode": "94550",
        "CountryID": 2,
        "Latitude": 37.625074,
        "Longitude": -121.757927,
        "ContactTelephone1": "925-373-4700",
        "AccessComments": "",
        "RelatedURL": "",
        "DistanceUnit": 0
    },
    "Connections": [
        {
            "ID": 155587,
            "ConnectionTypeID": 1,
            "LevelID": 2,
            "Amps": 16,
            "Voltage": 230,
            "PowerKW": 3,
            "CurrentTypeID": 10,
            "Quantity": 1
        }
    ],
    "DateLastStatusUpdate": "2019-04-06T04:02:00Z",
    "DataQualityLevel": 3,
    "DateCreated": "2018-10-18T23:36:00Z",
    "SubmissionStatusTypeID": 100
}