{
    "IsRecentlyVerified": false,
    "ID": 186809,
    "UUID": "A34D78B1-7F1D-4D9B-BAEE-7877420B27AF",
    "DataProviderID": 29,
    "DataProvidersReference": "1860",
    "OperatorID": 152,
    "AddressInfo": {
        "ID": 187168,
        "Title": "Breitscheidstraße 2",
        "AddressLine1": "Breitscheidstraße 2",
        "Town": "Magdeburg",
        "Postcode": "39114",
        "CountryID": 87,
        "Latitude": 52.141624,
        "Longitude": 11.680368,
        "DistanceUnit": 0
    },
    "Connections": [
        {
            "ID": 300222,
            "ConnectionTypeID": 25,
            "StatusTypeID": 50,
            "LevelID": 2,
            "PowerKW": 22,
            "CurrentTypeID": 20
        },
        {
            "ID": 300223,
            "ConnectionTypeID": 25,
            "StatusTypeID": 50,
            "LevelID": 2,
            "PowerKW": 22,
            "CurrentTypeID": 20
        }
    ],
    "StatusTypeID": 50,
    "DateLastStatusUpdate": "2021-07-12T02:49:00Z",
    "MetadataValues": [
        {
            "ID": 19050,
            "MetadataFieldID": 4,
            "ItemValue": "Data from the German chargepoint registry provided by Bundesnetzagentur.de under the CC-BY 4.0 license"
        }
    ],
    "DataQualityLevel": 3,
    "DateCreated": "2021-07-12T02:49:00Z",
    "SubmissionStatusTypeID": 100
}