{
    "IsRecentlyVerified": false,
    "ID": 120866,
    "UUID": "FB688EFD-2830-4318-8514-14B813D14C72",
    "DataProviderID": 2,
    "DataProvidersReference": "53903",
    "UsageTypeID": 7,
    "AddressInfo": {
        "ID": 121212,
        "Title": "Gosch Ford",
        "AddressLine1": "150 Carriage Cir",
        "Town": "Hemet",
        "StateOrProvince": "CA",
        "Postcode": "92545",
        "CountryID": 2,
        "Latitude": 33.737588,
        "Longitude": -117.030106,
        "ContactTelephone1": "951-396-7250",
        "AccessComments": "Dealership business hours\r\nPublic - Call ahead",
        "RelatedURL": "",
        "DistanceUnit": 0
    },
    "Connections": [
        {
            "ID": 170269,
            "ConnectionTypeID": 1,
            "LevelID": 2,
            "Amps": 16,
            "Voltage": 230,
            "PowerKW": 3.7,
            "CurrentTypeID": 10,
            "Quantity": 1
        }
    ],
    "DateLastStatusUpdate": "2020-06-26T02:56:00Z",
    "DataQualityLevel": 3,
    "DateCreated": "2019-04-01T04:59:00Z",
    "SubmissionStatusTypeID": 100
}