{
    "IsRecentlyVerified": false,
    "ID": 65425,
    "UUID": "2E301C59-B437-42C8-BC6E-BB53CDB32729",
    "DataProviderID": 26,
    "DataProvidersReference": "86396",
    "OperatorID": 73,
    "OperatorsReference": "EV-Box EVB-P1541495",
    "UsageCost": "0.00 jaarabonnement",
    "AddressInfo": {
        "ID": 65771,
        "Title": "Willi Martinalistraat 16",
        "AddressLine1": "Willi Martinalistraat 16",
        "Town": "Deurne",
        "Postcode": "5751 PS",
        "CountryID": 159,
        "Latitude": 51.46213,
        "Longitude": 5.77419,
        "RelatedURL": "http://www.ev-box.nl",
        "DistanceUnit": 0
    },
    "Connections": [
        {
            "ID": 90151,
            "ConnectionTypeID": 25,
            "LevelID": 2,
            "PowerKW": 5,
            "CurrentTypeID": 10
        }
    ],
    "NumberOfPoints": 1,
    "StatusTypeID": 50,
    "DateLastStatusUpdate": "2016-06-04T02:39:00Z",
    "DataQualityLevel": 3,
    "DateCreated": "2016-04-27T09:41:00Z",
    "SubmissionStatusTypeID": 100
}