{
    "IsRecentlyVerified": false,
    "ID": 74641,
    "UUID": "3CBF55B8-0E8C-421B-8C73-6F0B10809D6F",
    "DataProviderID": 2,
    "DataProvidersReference": "73442",
    "OperatorID": 3373,
    "UsageTypeID": 1,
    "AddressInfo": {
        "ID": 74987,
        "Title": "Westport - Berry Patch",
        "AddressLine1": "49289 US 30",
        "Town": "WESTPORT",
        "StateOrProvince": "OR",
        "Postcode": "97016",
        "CountryID": 2,
        "Latitude": 46.130686,
        "Longitude": -123.373559,
        "ContactTelephone1": "888-833-2148",
        "AccessComments": "24 hours daily",
        "RelatedURL": "https://www.evsolutions.com/ev-network",
        "DistanceUnit": 0
    },
    "Connections": [
        {
            "ID": 107249,
            "ConnectionTypeID": 1,
            "LevelID": 2,
            "Amps": 16,
            "Voltage": 230,
            "PowerKW": 3.7,
            "CurrentTypeID": 10,
            "Quantity": 1
        },
        {
            "ID": 107250,
            "ConnectionTypeID": 2,
            "LevelID": 3,
            "Amps": 100,
            "Voltage": 400,
            "PowerKW": 40,
            "CurrentTypeID": 30,
            "Quantity": 1
        }
    ],
    "DateLastStatusUpdate": "2020-06-26T03:10:00Z",
    "DataQualityLevel": 3,
    "DateCreated": "2016-12-03T00:13:00Z",
    "SubmissionStatusTypeID": 100
}