{
    "IsRecentlyVerified": false,
    "ID": 111494,
    "UUID": "CB67EE32-1B77-4B31-BA20-2D557213A3A8",
    "DataProviderID": 2,
    "DataProvidersReference": "83842",
    "UsageTypeID": 2,
    "AddressInfo": {
        "ID": 111840,
        "Title": "Bourgeois Chevrolet",
        "AddressLine1": "3502 rue Queen",
        "Town": "Rawdon",
        "StateOrProvince": "QC",
        "Postcode": "J0K 1S0",
        "CountryID": 44,
        "Latitude": 46.039478,
        "Longitude": -73.702869,
        "ContactTelephone1": "",
        "AccessComments": "For employees only",
        "RelatedURL": "",
        "DistanceUnit": 0
    },
    "Connections": [
        {
            "ID": 156933,
            "ConnectionTypeID": 1,
            "LevelID": 2,
            "Amps": 16,
            "Voltage": 230,
            "PowerKW": 3.7,
            "CurrentTypeID": 10,
            "Quantity": 16
        }
    ],
    "DateLastStatusUpdate": "2020-06-26T03:10:00Z",
    "DataQualityLevel": 3,
    "DateCreated": "2018-10-18T23:37:00Z",
    "SubmissionStatusTypeID": 100
}