{
    "IsRecentlyVerified": false,
    "ID": 46950,
    "UUID": "D96001AB-0F18-40C7-86D1-5AE79BF07559",
    "DataProviderID": 1,
    "OperatorID": 157,
    "OperatorsReference": "NewMotion ICUEVE000270",
    "UsageCost": "0.00 jaarabonnement",
    "AddressInfo": {
        "ID": 47296,
        "Title": "Herrlinger Straße",
        "AddressLine1": "Herrlinger Straße",
        "Town": "Grimmelfingen",
        "Postcode": "89081",
        "CountryID": 87,
        "Latitude": 48.4003181457519,
        "Longitude": 9.94979953765869,
        "ContactTelephone1": "088 0109500",
        "RelatedURL": "http://thenewmotion.nl/",
        "DistanceUnit": 0
    },
    "Connections": [
        {
            "ID": 57771,
            "ConnectionTypeID": 25,
            "LevelID": 2,
            "PowerKW": 22,
            "CurrentTypeID": 10
        }
    ],
    "NumberOfPoints": 2,
    "StatusTypeID": 50,
    "DateLastStatusUpdate": "2021-04-25T05:14:00Z",
    "DataQualityLevel": 3,
    "DateCreated": "2015-05-11T09:12:00Z",
    "SubmissionStatusTypeID": 200
}