{
    "IsRecentlyVerified": false,
    "ID": 65487,
    "UUID": "80638DB1-10A3-4C7A-8ED0-EF8FB6182017",
    "DataProviderID": 26,
    "DataProvidersReference": "86821",
    "OperatorID": 178,
    "OperatorsReference": "EVnetNL PNB-ENO143",
    "UsageCost": "0.00 jaarabonnement",
    "AddressInfo": {
        "ID": 65833,
        "Title": "Loevestein 2",
        "AddressLine1": "Loevestein 2",
        "Town": "Werkendam",
        "Postcode": "4254 EH",
        "CountryID": 159,
        "Latitude": 51.81846,
        "Longitude": 4.951841,
        "ContactTelephone1": "0800-3522365",
        "RelatedURL": "http://www.evnet.nl",
        "DistanceUnit": 0
    },
    "Connections": [
        {
            "ID": 90252,
            "ConnectionTypeID": 25,
            "LevelID": 2,
            "PowerKW": 11,
            "CurrentTypeID": 10
        }
    ],
    "NumberOfPoints": 2,
    "StatusTypeID": 50,
    "DateLastStatusUpdate": "2016-06-04T02:40:00Z",
    "DataQualityLevel": 3,
    "DateCreated": "2016-04-27T09:41:00Z",
    "SubmissionStatusTypeID": 100
}