{
    "IsRecentlyVerified": false,
    "ID": 97624,
    "UUID": "F1DF1F64-CAEC-44D7-962F-83BBE81E5F8B",
    "DataProviderID": 1,
    "OperatorID": 23,
    "OperatorsReference": "39372",
    "UsageTypeID": 4,
    "AddressInfo": {
        "ID": 97970,
        "Title": "Strandterrassen Steinhude",
        "AddressLine1": "Meerstrasse 2",
        "Town": "Wunstorf",
        "Postcode": "31515",
        "CountryID": 87,
        "Latitude": 52.45262,
        "Longitude": 9.34987,
        "ContactTelephone1": "+49 5033 5000",
        "DistanceUnit": 0
    },
    "Connections": [
        {
            "ID": 138532,
            "ConnectionTypeID": 30,
            "StatusTypeID": 50,
            "LevelID": 2,
            "Amps": 16,
            "Voltage": 400,
            "PowerKW": 11,
            "CurrentTypeID": 20,
            "Quantity": 2
        }
    ],
    "NumberOfPoints": 2,
    "GeneralComments": "2 Tesla Connectors, up to 11kW.Available for customers. Please see front desk.",
    "StatusTypeID": 50,
    "DateLastStatusUpdate": "2018-10-03T18:29:00Z",
    "DataQualityLevel": 1,
    "DateCreated": "2018-01-21T15:55:00Z",
    "SubmissionStatusTypeID": 200
}