{
    "IsRecentlyVerified": false,
    "ID": 138335,
    "UUID": "A0A09BE1-82D4-44DE-88FC-02D1A26E281F",
    "DataProviderID": 2,
    "DataProvidersReference": "92349",
    "OperatorID": 5,
    "UsageTypeID": 1,
    "AddressInfo": {
        "ID": 138684,
        "Title": "OUC",
        "AddressLine1": "800 E Princeton St",
        "Town": "Orlando",
        "StateOrProvince": "FL",
        "Postcode": "32803",
        "CountryID": 2,
        "Latitude": 28.57087,
        "Longitude": -81.36743,
        "ContactTelephone1": "888-758-4389",
        "AccessComments": "24 hours daily",
        "RelatedURL": "http://www.chargepoint.com/",
        "DistanceUnit": 0
    },
    "Connections": [
        {
            "ID": 193434,
            "ConnectionTypeID": 1,
            "LevelID": 2,
            "Amps": 16,
            "Voltage": 230,
            "PowerKW": 3.7,
            "CurrentTypeID": 10,
            "Quantity": 4
        }
    ],
    "StatusTypeID": 50,
    "DateLastStatusUpdate": "2020-06-26T02:52:00Z",
    "DataQualityLevel": 3,
    "DateCreated": "2019-12-24T09:08:00Z",
    "SubmissionStatusTypeID": 100
}