{
    "IsRecentlyVerified": false,
    "ID": 171503,
    "UUID": "2046051D-A8D9-4828-B885-460FA0DBFFAC",
    "DataProviderID": 1,
    "OperatorID": 45,
    "UsageTypeID": 1,
    "UsageCost": "Free",
    "AddressInfo": {
        "ID": 171862,
        "Title": "Penny Fizicienilor",
        "AddressLine1": "Strada Fizicienilor",
        "Town": "Bucharest",
        "StateOrProvince": "Bucharest",
        "CountryID": 184,
        "Latitude": 44.4111303,
        "Longitude": 26.1477054,
        "DistanceUnit": 0
    },
    "Connections": [
        {
            "ID": 262248,
            "ConnectionTypeID": 2,
            "StatusTypeID": 50,
            "LevelID": 3,
            "PowerKW": 50,
            "CurrentTypeID": 30,
            "Quantity": 1
        },
        {
            "ID": 262249,
            "ConnectionTypeID": 1036,
            "StatusTypeID": 50,
            "LevelID": 3,
            "Amps": 63,
            "Voltage": 400,
            "PowerKW": 43,
            "CurrentTypeID": 20,
            "Quantity": 1
        },
        {
            "ID": 262250,
            "ConnectionTypeID": 33,
            "StatusTypeID": 50,
            "LevelID": 3,
            "PowerKW": 50,
            "CurrentTypeID": 30,
            "Quantity": 1
        }
    ],
    "NumberOfPoints": 2,
    "StatusTypeID": 50,
    "DateLastStatusUpdate": "2021-01-03T16:11:00Z",
    "DataQualityLevel": 1,
    "DateCreated": "2021-01-03T15:00:00Z",
    "SubmissionStatusTypeID": 200
}