{
    "IsRecentlyVerified": false,
    "ID": 153187,
    "UUID": "4A74A36E-589D-4CF3-83E5-75F6A95E9C95",
    "DataProviderID": 28,
    "DataProvidersReference": "FR*S41*P41199-76",
    "UsageTypeID": 5,
    "AddressInfo": {
        "ID": 153540,
        "Title": "Saint-Ouen | Allée du Parc de Bel Air",
        "AddressLine1": "Allée du Parc de Bel Air 41100 Saint-Ouen",
        "CountryID": 80,
        "Latitude": 47.817921,
        "Longitude": 1.075453,
        "AccessComments": "24/24 7/7",
        "DistanceUnit": 0
    },
    "Connections": [
        {
            "ID": 214785,
            "ConnectionTypeID": 25,
            "StatusTypeID": 50,
            "LevelID": 2,
            "PowerKW": 18,
            "CurrentTypeID": 20
        },
        {
            "ID": 214786,
            "ConnectionTypeID": 28,
            "StatusTypeID": 50,
            "LevelID": 2,
            "PowerKW": 18,
            "CurrentTypeID": 10
        },
        {
            "ID": 248155,
            "ConnectionTypeID": 25,
            "StatusTypeID": 50,
            "LevelID": 2,
            "PowerKW": 18,
            "CurrentTypeID": 20
        },
        {
            "ID": 248156,
            "ConnectionTypeID": 28,
            "StatusTypeID": 50,
            "LevelID": 2,
            "PowerKW": 18,
            "CurrentTypeID": 10
        }
    ],
    "GeneralComments": "",
    "StatusTypeID": 50,
    "DateLastStatusUpdate": "2020-08-27T05:14:00Z",
    "DataQualityLevel": 2,
    "DateCreated": "2020-03-15T10:54:00Z",
    "SubmissionStatusTypeID": 100
}