{
    "IsRecentlyVerified": false,
    "ID": 80199,
    "UUID": "F26DA2A5-261A-4416-9C29-744F3276C72D",
    "DataProviderID": 2,
    "DataProvidersReference": "80872",
    "UsageTypeID": 1,
    "AddressInfo": {
        "ID": 80545,
        "Title": "Fresno Yosemite International Airport - Long Term Parking",
        "AddressLine1": "5175 E Clinton Way",
        "Town": "Fresno",
        "StateOrProvince": "CA",
        "Postcode": "93727",
        "CountryID": 2,
        "Latitude": 36.766768,
        "Longitude": -119.718483,
        "ContactTelephone1": "559-621-6650",
        "AccessComments": "24 hours daily",
        "RelatedURL": "",
        "DistanceUnit": 0
    },
    "Connections": [
        {
            "ID": 114865,
            "ConnectionTypeID": 0,
            "LevelID": 1,
            "Amps": 16,
            "Voltage": 120,
            "PowerKW": 1,
            "CurrentTypeID": 10,
            "Quantity": 8
        },
        {
            "ID": 114866,
            "ConnectionTypeID": 1,
            "LevelID": 2,
            "Amps": 16,
            "Voltage": 230,
            "PowerKW": 3,
            "CurrentTypeID": 10,
            "Quantity": 6
        }
    ],
    "DateLastStatusUpdate": "2019-04-06T04:02:00Z",
    "DataQualityLevel": 3,
    "DateCreated": "2017-01-31T01:05:00Z",
    "SubmissionStatusTypeID": 100
}