{
    "IsRecentlyVerified": false,
    "ID": 184600,
    "UUID": "9E657432-751E-4FC4-9037-805F86E0FF33",
    "DataProviderID": 29,
    "DataProvidersReference": "2779",
    "AddressInfo": {
        "ID": 184959,
        "Title": "Korneliusstraße 25",
        "AddressLine1": "Korneliusstraße 25",
        "Town": "Aachen",
        "Postcode": "52076",
        "CountryID": 87,
        "Latitude": 50.728826,
        "Longitude": 6.18461,
        "DistanceUnit": 0
    },
    "Connections": [
        {
            "ID": 293059,
            "ConnectionTypeID": 28,
            "StatusTypeID": 50,
            "LevelID": 2,
            "PowerKW": 22,
            "CurrentTypeID": 20
        },
        {
            "ID": 293060,
            "ConnectionTypeID": 25,
            "StatusTypeID": 50,
            "LevelID": 2,
            "PowerKW": 22,
            "CurrentTypeID": 20
        },
        {
            "ID": 298065,
            "ConnectionTypeID": 28,
            "StatusTypeID": 50,
            "LevelID": 2,
            "PowerKW": 22,
            "CurrentTypeID": 20
        },
        {
            "ID": 298066,
            "ConnectionTypeID": 25,
            "StatusTypeID": 50,
            "LevelID": 2,
            "PowerKW": 22,
            "CurrentTypeID": 20
        }
    ],
    "StatusTypeID": 50,
    "DateLastStatusUpdate": "2021-07-12T02:45:00Z",
    "MetadataValues": [
        {
            "ID": 16891,
            "MetadataFieldID": 4,
            "ItemValue": "Data from the German chargepoint registry provided by Bundesnetzagentur.de under the CC-BY 4.0 license"
        }
    ],
    "DataQualityLevel": 3,
    "DateCreated": "2021-07-08T10:05:00Z",
    "SubmissionStatusTypeID": 100
}