{
    "IsRecentlyVerified": false,
    "ID": 68293,
    "UUID": "36B261D7-9F4F-41A9-BC28-02E7AF2A1313",
    "DataProviderID": 26,
    "DataProvidersReference": "91463",
    "OperatorID": 73,
    "OperatorsReference": "EV-Box EVB-P1416097",
    "UsageCost": "0.00 jaarabonnement",
    "AddressInfo": {
        "ID": 68639,
        "Title": "Bloksleat",
        "AddressLine1": "Bloksleat",
        "Town": "De Fryske Marren",
        "Postcode": "8512 AA",
        "CountryID": 159,
        "Latitude": 52.99305,
        "Longitude": 5.75287,
        "RelatedURL": "http://www.ev-box.nl",
        "DistanceUnit": 0
    },
    "Connections": [
        {
            "ID": 95207,
            "ConnectionTypeID": 25,
            "LevelID": 2,
            "PowerKW": 11,
            "CurrentTypeID": 10
        },
        {
            "ID": 95208,
            "ConnectionTypeID": 25,
            "LevelID": 2,
            "PowerKW": 11,
            "CurrentTypeID": 10
        }
    ],
    "NumberOfPoints": 1,
    "StatusTypeID": 50,
    "DateLastStatusUpdate": "2016-06-04T02:37:00Z",
    "DataQualityLevel": 3,
    "DateCreated": "2016-06-04T02:37:00Z",
    "SubmissionStatusTypeID": 100
}