{
    "IsRecentlyVerified": false,
    "ID": 110297,
    "UUID": "1813078B-529B-42B7-90F8-4F4C43CEB11A",
    "DataProviderID": 2,
    "DataProvidersReference": "99488",
    "OperatorID": 5,
    "UsageTypeID": 1,
    "AddressInfo": {
        "ID": 110643,
        "Title": "HANFORD ESD",
        "AddressLine1": "300 Moroe Dr.",
        "Town": "Hanford",
        "StateOrProvince": "CA",
        "Postcode": "93230",
        "CountryID": 2,
        "Latitude": 36.3501246,
        "Longitude": -119.6504755,
        "ContactTelephone1": "888-758-4389",
        "AccessComments": "24 hours daily",
        "RelatedURL": "http://www.chargepoint.com/",
        "DistanceUnit": 0
    },
    "Connections": [
        {
            "ID": 155538,
            "ConnectionTypeID": 1,
            "LevelID": 2,
            "Amps": 16,
            "Voltage": 230,
            "PowerKW": 3,
            "CurrentTypeID": 10,
            "Quantity": 1
        }
    ],
    "DateLastStatusUpdate": "2019-04-06T04:02:00Z",
    "DataQualityLevel": 3,
    "DateCreated": "2018-10-18T23:36:00Z",
    "SubmissionStatusTypeID": 100
}