{
    "IsRecentlyVerified": false,
    "ID": 138852,
    "UUID": "2A3B34E8-4E0E-4BA6-BF38-212EA81E089A",
    "DataProviderID": 2,
    "DataProvidersReference": "72856",
    "OperatorID": 1242,
    "UsageTypeID": 1,
    "AddressInfo": {
        "ID": 139204,
        "Title": "GE WattStation 11",
        "AddressLine1": "13400  Sabre Springs Pkwy",
        "Town": "San Diego",
        "StateOrProvince": "CA",
        "Postcode": "92128",
        "CountryID": 2,
        "Latitude": 32.961506,
        "Longitude": -117.092757,
        "ContactTelephone1": "855-443-3873",
        "AccessComments": "24 hours daily",
        "RelatedURL": "https://www.gewattstation.com",
        "DistanceUnit": 0
    },
    "Connections": [
        {
            "ID": 194072,
            "ConnectionTypeID": 1,
            "LevelID": 2,
            "Amps": 16,
            "Voltage": 230,
            "PowerKW": 3.7,
            "CurrentTypeID": 10,
            "Quantity": 1
        }
    ],
    "StatusTypeID": 50,
    "DateLastStatusUpdate": "2020-06-26T02:55:00Z",
    "DataQualityLevel": 3,
    "DateCreated": "2019-12-24T09:09:00Z",
    "SubmissionStatusTypeID": 100
}