{
    "IsRecentlyVerified": false,
    "ID": 100281,
    "UUID": "89D82726-0972-473E-939E-DED7D503B1DF",
    "DataProviderID": 1,
    "OperatorID": 220,
    "OperatorsReference": "5214,5215",
    "UsageTypeID": 1,
    "UsageCost": "€1.73 + €0.3213/kWh; Andere Tarife möglich",
    "AddressInfo": {
        "ID": 100627,
        "Title": "Hellbrookstraße 9",
        "AddressLine1": "Hellbrookstraße 9",
        "Town": "Hamburg Nord",
        "StateOrProvince": "Hamburg",
        "Postcode": "22305",
        "CountryID": 87,
        "Latitude": 53.59141,
        "Longitude": 10.03813,
        "DistanceUnit": 0
    },
    "Connections": [
        {
            "ID": 141656,
            "ConnectionTypeID": 25,
            "StatusTypeID": 50,
            "LevelID": 2,
            "Amps": 32,
            "Voltage": 400,
            "PowerKW": 22,
            "CurrentTypeID": 20,
            "Quantity": 2
        },
        {
            "ID": 141681,
            "ConnectionTypeID": 28,
            "StatusTypeID": 50,
            "LevelID": 2,
            "Amps": 16,
            "Voltage": 230,
            "PowerKW": 3.7,
            "CurrentTypeID": 10,
            "Quantity": 2
        }
    ],
    "NumberOfPoints": 2,
    "StatusTypeID": 50,
    "DateLastStatusUpdate": "2018-02-21T07:20:00Z",
    "DataQualityLevel": 1,
    "DateCreated": "2018-02-20T06:44:00Z",
    "SubmissionStatusTypeID": 200
}