{
    "IsRecentlyVerified": false,
    "ID": 97781,
    "UUID": "4DEB6D77-876C-4F47-B400-37CD8EEA5486",
    "DataProviderID": 1,
    "OperatorID": 23,
    "OperatorsReference": "38570",
    "UsageTypeID": 4,
    "AddressInfo": {
        "ID": 98127,
        "Title": "Logis les Hauts de Montreuil",
        "AddressLine1": "21 Rue Pierre Ledent",
        "Town": "Montreuil",
        "Postcode": "62170",
        "CountryID": 80,
        "Latitude": 50.463167,
        "Longitude": 1.76005,
        "ContactTelephone1": "+33 3 21 81 95 92",
        "DistanceUnit": 0
    },
    "Connections": [
        {
            "ID": 138689,
            "ConnectionTypeID": 30,
            "StatusTypeID": 50,
            "LevelID": 2,
            "Amps": 32,
            "Voltage": 230,
            "PowerKW": 17,
            "CurrentTypeID": 20,
            "Quantity": 1
        }
    ],
    "NumberOfPoints": 1,
    "GeneralComments": "1 Tesla Connector, up to 17kW.Available for customers. Please call ahead.",
    "StatusTypeID": 50,
    "DateLastStatusUpdate": "2018-10-03T19:08:00Z",
    "DataQualityLevel": 1,
    "DateCreated": "2018-01-21T16:38:00Z",
    "SubmissionStatusTypeID": 200
}