{
    "IsRecentlyVerified": false,
    "ID": 73283,
    "UUID": "7C471A86-8D0F-4110-86B2-89332A208DA8",
    "DataProviderID": 1,
    "OperatorID": 156,
    "UsageTypeID": 0,
    "AddressInfo": {
        "ID": 73629,
        "Title": "Hotel Schloss Burgellern",
        "AddressLine1": "Kirchplatz 1",
        "Town": "Scheßlitz-Burgellern",
        "StateOrProvince": "Landkreis Bamberg",
        "Postcode": "96110",
        "CountryID": 87,
        "Latitude": 49.988051748386425,
        "Longitude": 11.045052980950922,
        "ContactTelephone1": "+49 9542 77475-0",
        "AccessComments": "Zugang ist unbekannt, ob öffentlich oder nur für Gäste.",
        "RelatedURL": "http://www.burgellern.de/",
        "DistanceUnit": 0
    },
    "Connections": [
        {
            "ID": 105449,
            "ConnectionTypeID": 25,
            "StatusTypeID": 50,
            "LevelID": 2,
            "Amps": 32,
            "Voltage": 400,
            "PowerKW": 22,
            "CurrentTypeID": 20,
            "Quantity": 1
        }
    ],
    "NumberOfPoints": 1,
    "StatusTypeID": 50,
    "DateLastStatusUpdate": "2016-11-17T10:05:00Z",
    "DataQualityLevel": 1,
    "DateCreated": "2016-11-17T10:05:00Z",
    "SubmissionStatusTypeID": 200
}