{
    "UserComments": [
        {
            "ID": 20330,
            "ChargePointID": 108134,
            "CommentTypeID": 10,
            "UserName": "ForumElettrico.it",
            "RelatedURL": "https://www.forumelettrico.it/forum/enelx-a-latina-t3863.html",
            "DateCreated": "2018-10-21T09:27:13.367Z",
            "User": {
                "ID": 11749,
                "Username": "ForumElettrico.it"
            },
            "CheckinStatusTypeID": 10
        }
    ],
    "MediaItems": [
        {
            "ID": 16846,
            "ChargePointID": 108134,
            "ItemURL": "https://s3-ap-southeast-2.amazonaws.com/openchargemap/images/IT/OCM108134/OCM-108134.orig.2018102109272545.jpg",
            "ItemThumbnailURL": "https://s3-ap-southeast-2.amazonaws.com/openchargemap/images/IT/OCM108134/OCM-108134.thmb.2018102109272545.jpg",
            "Comment": "",
            "IsEnabled": true,
            "IsVideo": false,
            "IsFeaturedItem": false,
            "IsExternalResource": false,
            "User": {
                "ID": 11749,
                "Username": "ForumElettrico.it"
            },
            "DateCreated": "2018-10-21T09:28:00Z"
        },
        {
            "ID": 16847,
            "ChargePointID": 108134,
            "ItemURL": "https://s3-ap-southeast-2.amazonaws.com/openchargemap/images/IT/OCM108134/OCM-108134.orig.2018102109273134.jpg",
            "ItemThumbnailURL": "https://s3-ap-southeast-2.amazonaws.com/openchargemap/images/IT/OCM108134/OCM-108134.thmb.2018102109273134.jpg",
            "Comment": "",
            "IsEnabled": true,
            "IsVideo": false,
            "IsFeaturedItem": false,
            "IsExternalResource": false,
            "User": {
                "ID": 11749,
                "Username": "ForumElettrico.it"
            },
            "DateCreated": "2018-10-21T09:28:00Z"
        }
    ],
    "IsRecentlyVerified": false,
    "ID": 108134,
    "UUID": "1655C5B8-EFD0-417D-B491-5CA388CDF834",
    "DataProviderID": 1,
    "OperatorID": 80,
    "UsageTypeID": 4,
    "AddressInfo": {
        "ID": 108480,
        "Title": "EnelX Latina Torre La Felce",
        "AddressLine1": "Strada Torre La Felce",
        "Town": "Latina",
        "StateOrProvince": "LT",
        "Postcode": "04100",
        "CountryID": 112,
        "Latitude": 41.4767433299674,
        "Longitude": 12.890485072310412,
        "RelatedURL": "https://www.enelx.com/it/it/emobility",
        "DistanceUnit": 0
    },
    "Connections": [
        {
            "ID": 152766,
            "ConnectionTypeID": 25,
            "StatusTypeID": 50,
            "LevelID": 2,
            "Amps": 32,
            "Voltage": 400,
            "PowerKW": 22,
            "CurrentTypeID": 20,
            "Quantity": 1
        },
        {
            "ID": 152767,
            "ConnectionTypeID": 36,
            "StatusTypeID": 50,
            "LevelID": 2,
            "Amps": 16,
            "Voltage": 240,
            "PowerKW": 3.7,
            "CurrentTypeID": 10,
            "Quantity": 1
        }
    ],
    "NumberOfPoints": 2,
    "StatusTypeID": 50,
    "DateLastStatusUpdate": "2018-10-21T09:28:00Z",
    "DataQualityLevel": 1,
    "DateCreated": "2018-09-07T16:09:00Z",
    "SubmissionStatusTypeID": 200
}