{
    "IsRecentlyVerified": false,
    "ID": 112636,
    "UUID": "E68BC739-C1A2-4E66-ACBD-27BC91D8D5C4",
    "DataProviderID": 1,
    "OperatorID": 3319,
    "UsageTypeID": 5,
    "UsageCost": "0.15€/min",
    "AddressInfo": {
        "ID": 112982,
        "Title": "e-mobi - Saldus tirgus",
        "AddressLine1": "Tirgus 1",
        "Town": "Saldus",
        "Postcode": "LV-3801",
        "CountryID": 125,
        "Latitude": 56.66763885913819,
        "Longitude": 22.49370888539488,
        "ContactTelephone1": "+371 22001859",
        "RelatedURL": "https://portal.e-mobi.lv",
        "DistanceUnit": 0
    },
    "Connections": [
        {
            "ID": 158497,
            "ConnectionTypeID": 2,
            "StatusTypeID": 50,
            "LevelID": 3,
            "PowerKW": 50,
            "CurrentTypeID": 30,
            "Quantity": 1
        },
        {
            "ID": 158498,
            "ConnectionTypeID": 33,
            "StatusTypeID": 50,
            "LevelID": 3,
            "PowerKW": 50,
            "CurrentTypeID": 30,
            "Quantity": 1
        },
        {
            "ID": 158499,
            "ConnectionTypeID": 25,
            "StatusTypeID": 50,
            "LevelID": 3,
            "PowerKW": 43,
            "CurrentTypeID": 20
        }
    ],
    "NumberOfPoints": 2,
    "StatusTypeID": 50,
    "DateLastStatusUpdate": "2018-11-10T09:23:00Z",
    "DataQualityLevel": 1,
    "DateCreated": "2018-11-09T20:07:00Z",
    "SubmissionStatusTypeID": 200
}