{
    "IsRecentlyVerified": false,
    "ID": 35050,
    "UUID": "D3C1484E-C9B8-45F5-9343-472860C3BF7C",
    "DataProviderID": 26,
    "DataProvidersReference": "34905",
    "OperatorID": 73,
    "OperatorsReference": "EV-Box EVB-P1335109",
    "UsageCost": "0.00 jaarabonnement",
    "AddressInfo": {
        "ID": 35396,
        "Title": "De Muggenwaard",
        "AddressLine1": "De Muggenwaard",
        "Town": "Zevenaar",
        "Postcode": "6988 CE",
        "CountryID": 159,
        "Latitude": 51.98831,
        "Longitude": 6.04381,
        "RelatedURL": "http://www.ev-box.nl",
        "DistanceUnit": 0
    },
    "Connections": [
        {
            "ID": 38561,
            "ConnectionTypeID": 25,
            "LevelID": 2,
            "PowerKW": 5,
            "CurrentTypeID": 10
        }
    ],
    "NumberOfPoints": 1,
    "StatusTypeID": 50,
    "DateLastStatusUpdate": "2016-06-04T02:43:00Z",
    "DataQualityLevel": 3,
    "DateCreated": "2015-01-09T06:04:00Z",
    "SubmissionStatusTypeID": 100
}