{
    "IsRecentlyVerified": false,
    "ID": 102649,
    "UUID": "153760B4-27F7-480C-B6D6-A986D190E126",
    "DataProviderID": 2,
    "DataProvidersReference": "81514",
    "OperatorID": 5,
    "UsageTypeID": 1,
    "AddressInfo": {
        "ID": 102995,
        "Title": "945 MARKET",
        "AddressLine1": "945 Market St",
        "Town": "San Francisco",
        "StateOrProvince": "CA",
        "Postcode": "94103",
        "CountryID": 2,
        "Latitude": 37.782834,
        "Longitude": -122.408838,
        "ContactTelephone1": "888-758-4389",
        "AccessComments": "24 hours daily",
        "RelatedURL": "http://www.chargepoint.com/",
        "DistanceUnit": 0
    },
    "Connections": [
        {
            "ID": 144755,
            "ConnectionTypeID": 1,
            "LevelID": 2,
            "Amps": 16,
            "Voltage": 230,
            "PowerKW": 3,
            "CurrentTypeID": 10,
            "Quantity": 2
        },
        {
            "ID": 149062,
            "ConnectionTypeID": 32,
            "LevelID": 2,
            "Amps": 100,
            "Voltage": 400,
            "PowerKW": 40,
            "CurrentTypeID": 10,
            "Quantity": 1
        }
    ],
    "DateLastStatusUpdate": "2019-04-06T04:02:00Z",
    "DataQualityLevel": 3,
    "DateCreated": "2018-04-21T04:13:00Z",
    "SubmissionStatusTypeID": 100
}