{
    "IsRecentlyVerified": false,
    "ID": 70561,
    "UUID": "96C79401-9AAF-4FE0-827F-D224860AC8C4",
    "DataProviderID": 1,
    "OperatorID": 220,
    "OperatorsReference": "3175,3175,3174",
    "UsageTypeID": 4,
    "UsageCost": "€1.73 + €0.3213/kWh; Andere Tarife möglich",
    "AddressInfo": {
        "ID": 70907,
        "Title": "Wilstorfer Straße",
        "AddressLine1": "Wilstorfer Straße",
        "Town": "Hamburg",
        "StateOrProvince": "Hamburg",
        "Postcode": "21073",
        "CountryID": 87,
        "Latitude": 53.456058,
        "Longitude": 9.986088800000061,
        "DistanceUnit": 0
    },
    "Connections": [
        {
            "ID": 100997,
            "ConnectionTypeID": 25,
            "StatusTypeID": 50,
            "LevelID": 2,
            "Amps": 32,
            "Voltage": 400,
            "PowerKW": 22,
            "CurrentTypeID": 20,
            "Quantity": 2
        },
        {
            "ID": 100998,
            "ConnectionTypeID": 28,
            "StatusTypeID": 50,
            "LevelID": 2,
            "Amps": 16,
            "Voltage": 230,
            "PowerKW": 3.7,
            "CurrentTypeID": 10,
            "Quantity": 2
        }
    ],
    "NumberOfPoints": 2,
    "StatusTypeID": 50,
    "DateLastStatusUpdate": "2017-04-20T22:50:00Z",
    "DataQualityLevel": 1,
    "DateCreated": "2016-07-25T07:22:00Z",
    "SubmissionStatusTypeID": 200
}