{
    "UserComments": [
        {
            "ID": 22478,
            "ChargePointID": 21196,
            "CommentTypeID": 10,
            "UserName": "ForumElettrico.it",
            "Comment": "Parcheggio gratuito per le prime 3 ore e solo a seguito di un acquisto. Leggi la recensione completa qui > https://www.forumelettrico.it/forum/colonnine-iper-la-grande-i-22-kw-portello-milano-mi-via-don-luigi-palazzolo-20-t10117.html",
            "RelatedURL": "https://www.forumelettrico.it/forum/colonnine-iper-la-grande-i-22-kw-portello-milano-mi-via-don-luigi-palazzolo-20-t10117.html",
            "DateCreated": "2020-04-22T16:37:13.107Z",
            "User": {
                "ID": 11749,
                "Username": "ForumElettrico.it"
            },
            "CheckinStatusTypeID": 140,
            "IsActionedByEditor": false
        },
        {
            "ID": 8048,
            "ChargePointID": 21196,
            "CommentTypeID": 10,
            "UserName": "Christian Schlaepfer",
            "Comment": "Ottima posizione",
            "Rating": 5,
            "DateCreated": "2015-11-21T07:29:34.21Z",
            "User": {
                "ID": 2320,
                "Username": "Christian Schlaepfer"
            },
            "CheckinStatusTypeID": 10
        }
    ],
    "MediaItems": [
        {
            "ID": 22072,
            "ChargePointID": 21196,
            "ItemURL": "https://s3-ap-southeast-2.amazonaws.com/openchargemap/images/IT/OCM21196/OCM-21196.orig.2020042216372818.jpg",
            "ItemThumbnailURL": "https://s3-ap-southeast-2.amazonaws.com/openchargemap/images/IT/OCM21196/OCM-21196.thmb.2020042216372818.jpg",
            "Comment": "",
            "IsEnabled": true,
            "IsVideo": false,
            "IsFeaturedItem": false,
            "IsExternalResource": false,
            "User": {
                "ID": 11749,
                "Username": "ForumElettrico.it"
            },
            "DateCreated": "2020-04-22T16:38:00Z"
        },
        {
            "ID": 22073,
            "ChargePointID": 21196,
            "ItemURL": "https://s3-ap-southeast-2.amazonaws.com/openchargemap/images/IT/OCM21196/OCM-21196.orig.2020042216373638.jpg",
            "ItemThumbnailURL": "https://s3-ap-southeast-2.amazonaws.com/openchargemap/images/IT/OCM21196/OCM-21196.thmb.2020042216373638.jpg",
            "Comment": "",
            "IsEnabled": true,
            "IsVideo": false,
            "IsFeaturedItem": false,
            "IsExternalResource": false,
            "User": {
                "ID": 11749,
                "Username": "ForumElettrico.it"
            },
            "DateCreated": "2020-04-22T16:38:00Z"
        },
        {
            "ID": 22074,
            "ChargePointID": 21196,
            "ItemURL": "https://s3-ap-southeast-2.amazonaws.com/openchargemap/images/IT/OCM21196/OCM-21196.orig.2020042216374224.jpg",
            "ItemThumbnailURL": "https://s3-ap-southeast-2.amazonaws.com/openchargemap/images/IT/OCM21196/OCM-21196.thmb.2020042216374224.jpg",
            "Comment": "",
            "IsEnabled": true,
            "IsVideo": false,
            "IsFeaturedItem": false,
            "IsExternalResource": false,
            "User": {
                "ID": 11749,
                "Username": "ForumElettrico.it"
            },
            "DateCreated": "2020-04-22T16:38:00Z"
        },
        {
            "ID": 22075,
            "ChargePointID": 21196,
            "ItemURL": "https://s3-ap-southeast-2.amazonaws.com/openchargemap/images/IT/OCM21196/OCM-21196.orig.2020042216374860.jpg",
            "ItemThumbnailURL": "https://s3-ap-southeast-2.amazonaws.com/openchargemap/images/IT/OCM21196/OCM-21196.thmb.2020042216374860.jpg",
            "Comment": "",
            "IsEnabled": true,
            "IsVideo": false,
            "IsFeaturedItem": false,
            "IsExternalResource": false,
            "User": {
                "ID": 11749,
                "Username": "ForumElettrico.it"
            },
            "DateCreated": "2020-04-22T16:38:00Z"
        },
        {
            "ID": 22076,
            "ChargePointID": 21196,
            "ItemURL": "https://s3-ap-southeast-2.amazonaws.com/openchargemap/images/IT/OCM21196/OCM-21196.orig.2020042216375553.jpg",
            "ItemThumbnailURL": "https://s3-ap-southeast-2.amazonaws.com/openchargemap/images/IT/OCM21196/OCM-21196.thmb.2020042216375553.jpg",
            "Comment": "",
            "IsEnabled": true,
            "IsVideo": false,
            "IsFeaturedItem": false,
            "IsExternalResource": false,
            "User": {
                "ID": 11749,
                "Username": "ForumElettrico.it"
            },
            "DateCreated": "2020-04-22T16:38:00Z"
        },
        {
            "ID": 22077,
            "ChargePointID": 21196,
            "ItemURL": "https://s3-ap-southeast-2.amazonaws.com/openchargemap/images/IT/OCM21196/OCM-21196.orig.2020042216380195.jpg",
            "ItemThumbnailURL": "https://s3-ap-southeast-2.amazonaws.com/openchargemap/images/IT/OCM21196/OCM-21196.thmb.2020042216380195.jpg",
            "Comment": "",
            "IsEnabled": true,
            "IsVideo": false,
            "IsFeaturedItem": false,
            "IsExternalResource": false,
            "User": {
                "ID": 11749,
                "Username": "ForumElettrico.it"
            },
            "DateCreated": "2020-04-22T16:38:00Z"
        },
        {
            "ID": 22078,
            "ChargePointID": 21196,
            "ItemURL": "https://s3-ap-southeast-2.amazonaws.com/openchargemap/images/IT/OCM21196/OCM-21196.orig.2020042216381741.jpg",
            "ItemThumbnailURL": "https://s3-ap-southeast-2.amazonaws.com/openchargemap/images/IT/OCM21196/OCM-21196.thmb.2020042216381741.jpg",
            "Comment": "",
            "IsEnabled": true,
            "IsVideo": false,
            "IsFeaturedItem": false,
            "IsExternalResource": false,
            "User": {
                "ID": 11749,
                "Username": "ForumElettrico.it"
            },
            "DateCreated": "2020-04-22T16:38:00Z"
        },
        {
            "ID": 22079,
            "ChargePointID": 21196,
            "ItemURL": "https://s3-ap-southeast-2.amazonaws.com/openchargemap/images/IT/OCM21196/OCM-21196.orig.2020042216382477.jpg",
            "ItemThumbnailURL": "https://s3-ap-southeast-2.amazonaws.com/openchargemap/images/IT/OCM21196/OCM-21196.thmb.2020042216382477.jpg",
            "Comment": "",
            "IsEnabled": true,
            "IsVideo": false,
            "IsFeaturedItem": false,
            "IsExternalResource": false,
            "User": {
                "ID": 11749,
                "Username": "ForumElettrico.it"
            },
            "DateCreated": "2020-04-22T16:38:00Z"
        },
        {
            "ID": 9033,
            "ChargePointID": 21196,
            "ItemURL": "https://s3-ap-southeast-2.amazonaws.com/openchargemap/images/IT/OCM21196/OCM-21196.orig.2017011411572167.jpg",
            "ItemThumbnailURL": "https://s3-ap-southeast-2.amazonaws.com/openchargemap/images/IT/OCM21196/OCM-21196.thmb.2017011411572167.jpg",
            "Comment": "",
            "IsEnabled": true,
            "IsVideo": false,
            "IsFeaturedItem": false,
            "IsExternalResource": false,
            "User": {
                "ID": 12207,
                "Username": "aldodal"
            },
            "DateCreated": "2017-01-14T11:58:00Z"
        },
        {
            "ID": 9034,
            "ChargePointID": 21196,
            "ItemURL": "https://s3-ap-southeast-2.amazonaws.com/openchargemap/images/IT/OCM21196/OCM-21196.orig.2017011411580886.jpg",
            "ItemThumbnailURL": "https://s3-ap-southeast-2.amazonaws.com/openchargemap/images/IT/OCM21196/OCM-21196.thmb.2017011411580886.jpg",
            "Comment": "",
            "IsEnabled": true,
            "IsVideo": false,
            "IsFeaturedItem": false,
            "IsExternalResource": false,
            "User": {
                "ID": 12207,
                "Username": "aldodal"
            },
            "DateCreated": "2017-01-14T11:58:00Z"
        }
    ],
    "IsRecentlyVerified": false,
    "ID": 21196,
    "UUID": "E5075530-90E4-4FEE-AC05-B1F1A80B95E0",
    "DataProviderID": 1,
    "OperatorID": 84,
    "UsageTypeID": 4,
    "UsageCost": "free",
    "AddressInfo": {
        "ID": 21541,
        "Title": "Iper Portello",
        "AddressLine1": "Via Grosotto 7",
        "AddressLine2": "Portello",
        "Town": "Milano",
        "StateOrProvince": "Milano",
        "Postcode": "20149",
        "CountryID": 112,
        "Latitude": 45.4903859784422,
        "Longitude": 9.14644287816019,
        "AccessComments": "necessaria registrazione con carta servizi regionale, oppure chiedere tessera temporanea al banco informazioni",
        "RelatedURL": "http://www.ricaricaev.it/",
        "DistanceUnit": 0
    },
    "Connections": [
        {
            "ID": 23065,
            "ConnectionTypeID": 25,
            "StatusTypeID": 50,
            "LevelID": 2,
            "CurrentTypeID": 10,
            "Quantity": 6
        }
    ],
    "NumberOfPoints": 6,
    "StatusTypeID": 50,
    "DateLastStatusUpdate": "2021-01-16T16:48:00Z",
    "DataQualityLevel": 1,
    "DateCreated": "2014-03-06T17:32:00Z",
    "SubmissionStatusTypeID": 200
}