{
    "IsRecentlyVerified": false,
    "ID": 165881,
    "UUID": "87B886A8-E228-4475-BFCB-3AFF6E0F0C66",
    "DataProviderID": 28,
    "DataProvidersReference": "FR*S33*PMB33*100",
    "OperatorID": 3407,
    "UsageTypeID": 5,
    "AddressInfo": {
        "ID": 166240,
        "Title": "PESSAC-SUR-DORDOGNE - Place Du Pont",
        "AddressLine1": "Place Du Pont 33890 PESSAC-SUR-DORDOGNE",
        "CountryID": 80,
        "Latitude": 44.82074354,
        "Longitude": 0.078746974,
        "AccessComments": "24h/24 7j/7",
        "DistanceUnit": 0
    },
    "Connections": [
        {
            "ID": 243071,
            "ConnectionTypeID": 25,
            "StatusTypeID": 50,
            "LevelID": 2,
            "PowerKW": 18,
            "CurrentTypeID": 20
        },
        {
            "ID": 243072,
            "ConnectionTypeID": 28,
            "StatusTypeID": 50,
            "LevelID": 2,
            "PowerKW": 18,
            "CurrentTypeID": 10
        },
        {
            "ID": 243073,
            "ConnectionTypeID": 25,
            "StatusTypeID": 50,
            "LevelID": 2,
            "PowerKW": 18,
            "CurrentTypeID": 20
        },
        {
            "ID": 243074,
            "ConnectionTypeID": 28,
            "StatusTypeID": 50,
            "LevelID": 2,
            "PowerKW": 18,
            "CurrentTypeID": 10
        }
    ],
    "GeneralComments": "Recharge par badge et avec une application smartphone",
    "StatusTypeID": 50,
    "DateLastStatusUpdate": "2020-08-27T05:12:00Z",
    "DataQualityLevel": 2,
    "DateCreated": "2020-08-27T05:12:00Z",
    "SubmissionStatusTypeID": 100
}