{
    "IsRecentlyVerified": false,
    "ID": 52566,
    "UUID": "8612D794-7C50-484E-AAF4-208182A0D265",
    "DataProviderID": 1,
    "OperatorID": 45,
    "UsageTypeID": 3,
    "AddressInfo": {
        "ID": 52912,
        "Title": "Westernstadt El Dorado",
        "AddressLine1": "Am Röddelinsee 1",
        "Town": "Templin",
        "StateOrProvince": "Landkreis Uckermark",
        "Postcode": "17268",
        "CountryID": 87,
        "Latitude": 53.0944343933026,
        "Longitude": 13.4482438693115,
        "ContactTelephone1": "03987-20840",
        "AccessComments": "Rote CEE Steckdose an der Hauswand links neben der schwarzen Tür auf dem Betriebshof der Westernstadt. Täglich von 9-18Uhr nutzbar, außerhalb der Zeiten ist der Betriebshof abgeschlossen. Beim Kauf der Eintrittskarten anmelden.",
        "RelatedURL": "http://www.eldorado-templin.de/",
        "DistanceUnit": 0
    },
    "Connections": [
        {
            "ID": 65287,
            "ConnectionTypeID": 17,
            "StatusTypeID": 50,
            "LevelID": 2,
            "Amps": 32,
            "Voltage": 400,
            "PowerKW": 22,
            "CurrentTypeID": 20,
            "Quantity": 1
        }
    ],
    "NumberOfPoints": 1,
    "StatusTypeID": 50,
    "DateLastStatusUpdate": "2015-09-04T08:56:00Z",
    "DataQualityLevel": 1,
    "DateCreated": "2015-09-03T11:42:00Z",
    "SubmissionStatusTypeID": 200
}