{
    "IsRecentlyVerified": false,
    "ID": 93729,
    "UUID": "5046F2F4-7FBB-4973-A860-48E869121AEA",
    "DataProviderID": 1,
    "OperatorID": 59,
    "UsageTypeID": 4,
    "AddressInfo": {
        "ID": 94075,
        "Title": "Technopreneur Centre",
        "AddressLine1": "20 Ayer Rajah Crescent",
        "Town": "Nepal Hill",
        "StateOrProvince": "Southwest",
        "Postcode": "139942",
        "CountryID": 202,
        "Latitude": 1.295541,
        "Longitude": 103.78969800000002,
        "DistanceUnit": 0
    },
    "Connections": [
        {
            "ID": 132700,
            "ConnectionTypeID": 1,
            "StatusTypeID": 50,
            "LevelID": 2,
            "CurrentTypeID": 10,
            "Quantity": 1
        }
    ],
    "NumberOfPoints": 1,
    "StatusTypeID": 50,
    "DateLastStatusUpdate": "2017-10-06T09:20:00Z",
    "DataQualityLevel": 1,
    "DateCreated": "2017-10-06T09:20:00Z",
    "SubmissionStatusTypeID": 200
}