{
    "IsRecentlyVerified": false,
    "ID": 166405,
    "UUID": "AD1F6BD9-9811-4566-937A-9A98E891961A",
    "DataProviderID": 28,
    "DataProvidersReference": "FR*S44*P44021A",
    "OperatorID": 3412,
    "UsageTypeID": 5,
    "AddressInfo": {
        "ID": 166764,
        "Title": "Mesquer | Route de Bouin",
        "AddressLine1": "Route de Bouin 44420 Mesquer",
        "CountryID": 80,
        "Latitude": 47.396174,
        "Longitude": -2.451702,
        "AccessComments": "24/24 7/7",
        "DistanceUnit": 0
    },
    "Connections": [
        {
            "ID": 247055,
            "ConnectionTypeID": 25,
            "StatusTypeID": 50,
            "LevelID": 2,
            "PowerKW": 18,
            "CurrentTypeID": 20
        },
        {
            "ID": 247056,
            "ConnectionTypeID": 28,
            "StatusTypeID": 50,
            "LevelID": 2,
            "PowerKW": 18,
            "CurrentTypeID": 10
        },
        {
            "ID": 247057,
            "ConnectionTypeID": 25,
            "StatusTypeID": 50,
            "LevelID": 2,
            "PowerKW": 18,
            "CurrentTypeID": 20
        },
        {
            "ID": 247058,
            "ConnectionTypeID": 28,
            "StatusTypeID": 50,
            "LevelID": 2,
            "PowerKW": 18,
            "CurrentTypeID": 10
        }
    ],
    "GeneralComments": "",
    "StatusTypeID": 50,
    "DateLastStatusUpdate": "2020-08-27T05:13:00Z",
    "DataQualityLevel": 2,
    "DateCreated": "2020-08-27T05:13:00Z",
    "SubmissionStatusTypeID": 100
}