{
    "IsRecentlyVerified": false,
    "ID": 150605,
    "UUID": "9743D9D4-6625-442F-B3F6-EABB87A9F382",
    "DataProviderID": 28,
    "DataProvidersReference": "FR*M13*P13054*001",
    "UsageTypeID": 5,
    "AddressInfo": {
        "ID": 150958,
        "Title": "MARIGNANE - Rue De Verdun",
        "AddressLine1": "Rue De Verdun 13700 MARIGNANE",
        "CountryID": 80,
        "Latitude": 43.416931,
        "Longitude": 5.21803,
        "AccessComments": "24h/24 7j/7",
        "DistanceUnit": 0
    },
    "Connections": [
        {
            "ID": 209552,
            "ConnectionTypeID": 28,
            "StatusTypeID": 50,
            "LevelID": 2,
            "PowerKW": 4,
            "CurrentTypeID": 10
        },
        {
            "ID": 238864,
            "ConnectionTypeID": 28,
            "StatusTypeID": 50,
            "LevelID": 2,
            "PowerKW": 4,
            "CurrentTypeID": 10
        }
    ],
    "GeneralComments": "Recharge par badge et avec une application smartphone",
    "StatusTypeID": 50,
    "DateLastStatusUpdate": "2020-08-27T05:10:00Z",
    "DataQualityLevel": 2,
    "DateCreated": "2020-03-15T06:17:00Z",
    "SubmissionStatusTypeID": 100
}