{
    "IsRecentlyVerified": false,
    "ID": 118475,
    "UUID": "B92D1396-E6AF-4B64-8EAC-7B2180C0A4A3",
    "DataProviderID": 1,
    "OperatorID": 80,
    "UsageTypeID": 4,
    "AddressInfo": {
        "ID": 118821,
        "Title": "Cavour 3°Alpini | EnelX",
        "AddressLine1": "Piazza 3°Alpini",
        "AddressLine2": "angolo Via Conte di Cavour",
        "Town": "Cavour",
        "StateOrProvince": "TO",
        "Postcode": "10061",
        "CountryID": 112,
        "Latitude": 44.7841047361162,
        "Longitude": 7.37123232754152,
        "ContactTelephone1": "800.069.850",
        "RelatedURL": "https://www.enelx.com/it/it/emobility",
        "DistanceUnit": 0
    },
    "Connections": [
        {
            "ID": 167573,
            "ConnectionTypeID": 25,
            "StatusTypeID": 50,
            "LevelID": 2,
            "Amps": 32,
            "Voltage": 400,
            "PowerKW": 22,
            "CurrentTypeID": 20,
            "Quantity": 2
        }
    ],
    "NumberOfPoints": 2,
    "StatusTypeID": 50,
    "DateLastStatusUpdate": "2019-03-24T14:55:00Z",
    "DataQualityLevel": 1,
    "DateCreated": "2019-03-24T14:55:00Z",
    "SubmissionStatusTypeID": 200
}