{
    "IsRecentlyVerified": false,
    "ID": 21279,
    "UUID": "37139137-0316-40E5-B055-372DE9A6CA38",
    "DataProviderID": 1,
    "OperatorID": 82,
    "UsageTypeID": 4,
    "UsageCost": "15€ for 3months",
    "AddressInfo": {
        "ID": 21624,
        "Title": "A2A Facoltà di Medicina",
        "AddressLine1": "Piazzale Padre Pio 1",
        "AddressLine2": "Circoscrizione Brescia Nord",
        "Town": "Brescia",
        "StateOrProvince": "Brescia",
        "Postcode": "25123",
        "CountryID": 112,
        "Latitude": 45.5604651168667,
        "Longitude": 10.232435092999834,
        "ContactTelephone1": "800035151",
        "RelatedURL": "http://www.e-moving.it/",
        "DistanceUnit": 0
    },
    "Connections": [
        {
            "ID": 23133,
            "ConnectionTypeID": 25,
            "StatusTypeID": 0,
            "LevelID": 2,
            "PowerKW": 3,
            "CurrentTypeID": 10,
            "Quantity": 1
        }
    ],
    "NumberOfPoints": 2,
    "StatusTypeID": 50,
    "DateLastStatusUpdate": "2014-03-18T18:40:00Z",
    "DataQualityLevel": 1,
    "DateCreated": "2014-03-18T18:40:00Z",
    "SubmissionStatusTypeID": 200
}