{
    "IsRecentlyVerified": false,
    "ID": 116409,
    "UUID": "952E5E56-D376-49E0-BB65-E18D298C9D91",
    "DataProviderID": 1,
    "DataProvidersReference": "5457",
    "OperatorID": 1,
    "AddressInfo": {
        "ID": 116755,
        "Title": "Bøsenteret",
        "AddressLine1": "Stasjonsvegen 28",
        "Town": "BØ I TELEMARK",
        "StateOrProvince": "Vestfold og Telemark",
        "Postcode": "3800",
        "CountryID": 168,
        "Latitude": 59.41132,
        "Longitude": 9.07084,
        "AccessComments": "",
        "DistanceUnit": 0
    },
    "Connections": [
        {
            "ID": 164264,
            "ConnectionTypeID": 0,
            "Reference": "1",
            "LevelID": 2,
            "Amps": 32,
            "Voltage": 400,
            "PowerKW": 22,
            "Comments": "Mode 3"
        },
        {
            "ID": 164265,
            "ConnectionTypeID": 2,
            "Reference": "2",
            "LevelID": 2,
            "Amps": 100,
            "Voltage": 500,
            "PowerKW": 50,
            "Comments": "Mode 4"
        },
        {
            "ID": 164266,
            "ConnectionTypeID": 0,
            "Reference": "3",
            "LevelID": 2,
            "Amps": 100,
            "Voltage": 500,
            "PowerKW": 50,
            "Comments": "Mode 4"
        },
        {
            "ID": 164267,
            "ConnectionTypeID": 0,
            "Reference": "4",
            "LevelID": 2,
            "Amps": 32,
            "Voltage": 400,
            "PowerKW": 22,
            "Comments": "Mode 3"
        },
        {
            "ID": 164268,
            "ConnectionTypeID": 2,
            "Reference": "5",
            "LevelID": 2,
            "Amps": 100,
            "Voltage": 500,
            "PowerKW": 50,
            "Comments": "Mode 4"
        },
        {
            "ID": 164269,
            "ConnectionTypeID": 0,
            "Reference": "6",
            "LevelID": 2,
            "Amps": 100,
            "Voltage": 500,
            "PowerKW": 50,
            "Comments": "Mode 4"
        },
        {
            "ID": 164270,
            "ConnectionTypeID": 0,
            "Reference": "7",
            "LevelID": 2,
            "Amps": 32,
            "Voltage": 400,
            "PowerKW": 22,
            "Comments": "Mode 3"
        },
        {
            "ID": 164271,
            "ConnectionTypeID": 2,
            "Reference": "8",
            "LevelID": 2,
            "Amps": 100,
            "Voltage": 500,
            "PowerKW": 50,
            "Comments": "Mode 4"
        },
        {
            "ID": 164272,
            "ConnectionTypeID": 0,
            "Reference": "9",
            "LevelID": 2,
            "Amps": 100,
            "Voltage": 500,
            "PowerKW": 50,
            "Comments": "Mode 4"
        }
    ],
    "NumberOfPoints": 9,
    "DateLastStatusUpdate": "2020-10-16T15:34:00Z",
    "DataQualityLevel": 2,
    "DateCreated": "2019-02-11T09:16:00Z",
    "SubmissionStatusTypeID": 100
}