{
    "IsRecentlyVerified": false,
    "ID": 93340,
    "UUID": "55660853-6F50-4923-99B6-C6DA8B01DFF6",
    "DataProviderID": 1,
    "OperatorID": 23,
    "OperatorsReference": "35866",
    "UsageTypeID": 4,
    "AddressInfo": {
        "ID": 93686,
        "Title": "Naples Grande Beach Resort",
        "AddressLine1": "475 Seagate DR",
        "Town": "Naples",
        "StateOrProvince": "Florida",
        "Postcode": "34103",
        "CountryID": 2,
        "Latitude": 26.212177,
        "Longitude": -81.81026,
        "ContactTelephone1": "(239) 227-2182",
        "DistanceUnit": 0
    },
    "Connections": [
        {
            "ID": 132217,
            "ConnectionTypeID": 30,
            "StatusTypeID": 50,
            "LevelID": 2,
            "PowerKW": 16,
            "CurrentTypeID": 20,
            "Quantity": 4
        }
    ],
    "NumberOfPoints": 4,
    "GeneralComments": "4 Tesla Connectors, up to 16kW.Available for customers. Self park.",
    "StatusTypeID": 50,
    "DateLastStatusUpdate": "2017-09-27T19:19:00Z",
    "DataQualityLevel": 1,
    "DateCreated": "2017-09-27T19:19:00Z",
    "SubmissionStatusTypeID": 200
}