{
    "IsRecentlyVerified": false,
    "ID": 113829,
    "UUID": "D17E7D38-CF85-4AF3-9C0C-83CE40E912BB",
    "DataProviderID": 1,
    "OperatorID": 23,
    "OperatorsReference": "46715",
    "UsageTypeID": 4,
    "AddressInfo": {
        "ID": 114175,
        "Title": "Relais Thalasso Hotel Atalante",
        "AddressLine1": "Rue Port Notre-Dame",
        "Town": "Sainte-Marie-de-Ré",
        "Postcode": "17740",
        "CountryID": 80,
        "Latitude": 46.145388,
        "Longitude": -1.296907,
        "ContactTelephone1": " +33 5 46 30 22 44",
        "DistanceUnit": 0
    },
    "Connections": [
        {
            "ID": 160399,
            "ConnectionTypeID": 30,
            "StatusTypeID": 50,
            "LevelID": 2,
            "Amps": 16,
            "Voltage": 400,
            "PowerKW": 11,
            "CurrentTypeID": 20,
            "Quantity": 2
        }
    ],
    "NumberOfPoints": 2,
    "GeneralComments": "2 Tesla Connectors, up to 11kW.Available for customers. Please see front desk.",
    "StatusTypeID": 50,
    "DateLastStatusUpdate": "2019-01-02T21:42:00Z",
    "DataQualityLevel": 1,
    "DateCreated": "2019-01-02T21:42:00Z",
    "SubmissionStatusTypeID": 200
}