{
    "IsRecentlyVerified": false,
    "ID": 46422,
    "UUID": "43852320-828F-48F3-A463-66BA08EB3EDB",
    "DataProviderID": 1,
    "DataProvidersReference": "745",
    "AddressInfo": {
        "ID": 46768,
        "Title": "Asbjørnsensgate, Hønefoss",
        "AddressLine1": "Asbjørnsensgate 14",
        "Town": "HØNEFOSS",
        "StateOrProvince": "Viken",
        "Postcode": "3513",
        "CountryID": 168,
        "Latitude": 60.17589,
        "Longitude": 10.2729,
        "AccessComments": "Parkering på oversiden av bygget til Ringeriks-Kraft.",
        "DistanceUnit": 0
    },
    "Connections": [
        {
            "ID": 57085,
            "ConnectionTypeID": 0,
            "Reference": "1",
            "LevelID": 2,
            "Amps": 16,
            "Voltage": 230,
            "PowerKW": 3.7,
            "Comments": "Mode 1"
        },
        {
            "ID": 88890,
            "ConnectionTypeID": 0,
            "Reference": "2",
            "LevelID": 2,
            "Amps": 16,
            "Voltage": 230,
            "PowerKW": 3.7,
            "Comments": "Mode 1"
        }
    ],
    "NumberOfPoints": 2,
    "DateLastStatusUpdate": "2020-05-26T08:24:00Z",
    "DataQualityLevel": 2,
    "DateCreated": "2015-05-03T00:54:00Z",
    "SubmissionStatusTypeID": 100
}