{
    "UserComments": [
        {
            "ID": 23958,
            "ChargePointID": 28304,
            "CommentTypeID": 10,
            "UserName": "helper1",
            "Rating": 5,
            "DateCreated": "2021-02-28T16:47:30.783Z",
            "User": {
                "ID": 30786,
                "Username": "helper1"
            },
            "CheckinStatusTypeID": 10,
            "IsActionedByEditor": false
        },
        {
            "ID": 19854,
            "ChargePointID": 28304,
            "CommentTypeID": 10,
            "UserName": "Hypermile",
            "Comment": "",
            "Rating": 5,
            "DateCreated": "2018-07-22T18:16:01.107Z",
            "User": {
                "ID": 11824,
                "Username": "Hypermile"
            },
            "CheckinStatusTypeID": 10
        }
    ],
    "MediaItems": [
        {
            "ID": 15973,
            "ChargePointID": 28304,
            "ItemURL": "https://s3-ap-southeast-2.amazonaws.com/openchargemap/images/US/OCM28304/OCM-28304.orig.2018072218114122.png",
            "ItemThumbnailURL": "https://s3-ap-southeast-2.amazonaws.com/openchargemap/images/US/OCM28304/OCM-28304.thmb.2018072218114122.png",
            "Comment": "Wonder women. Filling up their invisible jets... very clever disguises.",
            "IsEnabled": true,
            "IsVideo": false,
            "IsFeaturedItem": false,
            "IsExternalResource": false,
            "User": {
                "ID": 11824,
                "Username": "Hypermile"
            },
            "DateCreated": "2018-07-22T18:12:00Z"
        }
    ],
    "IsRecentlyVerified": false,
    "ID": 28304,
    "UUID": "4AEB43DF-5750-477C-B258-1C640A2C39E7",
    "DataProviderID": 1,
    "OperatorID": 23,
    "OperatorsReference": "6811",
    "UsageTypeID": 1,
    "UsageCost": "$0.24/min >=60kW; $0.12/min <60kW; other tariffs for older cars",
    "AddressInfo": {
        "ID": 28650,
        "Title": "Meijer - Tesla",
        "AddressLine1": "4901 State Rd 26E",
        "Town": "Lafayette",
        "StateOrProvince": "IN",
        "Postcode": "47905",
        "CountryID": 2,
        "Latitude": 40.4169274,
        "Longitude": -86.8130712,
        "ContactTelephone1": "877-798-3752",
        "AccessComments": "24 hours daily; for Tesla use only",
        "RelatedURL": "http://www.teslamotors.com/supercharger",
        "DistanceUnit": 0
    },
    "Connections": [
        {
            "ID": 31101,
            "ConnectionTypeID": 27,
            "StatusTypeID": 50,
            "LevelID": 3,
            "Amps": 100,
            "Voltage": 400,
            "PowerKW": 120,
            "CurrentTypeID": 30,
            "Quantity": 8
        }
    ],
    "NumberOfPoints": 8,
    "StatusTypeID": 50,
    "DateLastStatusUpdate": "2021-02-28T16:48:00Z",
    "DataQualityLevel": 3,
    "DateCreated": "2014-11-28T03:38:00Z",
    "SubmissionStatusTypeID": 100
}