{
    "IsRecentlyVerified": false,
    "ID": 179237,
    "UUID": "90342E7D-B75B-455C-A1AB-2D76F9755696",
    "DataProviderID": 29,
    "DataProvidersReference": "16503",
    "OperatorID": 3403,
    "AddressInfo": {
        "ID": 179596,
        "Title": "Kirchstrasse 1",
        "AddressLine1": "Kirchstrasse 1",
        "Town": "Treffelstein",
        "Postcode": "93492",
        "CountryID": 87,
        "Latitude": 49.423192,
        "Longitude": 12.615897,
        "DistanceUnit": 0
    },
    "Connections": [
        {
            "ID": 280770,
            "ConnectionTypeID": 25,
            "StatusTypeID": 50,
            "LevelID": 2,
            "PowerKW": 11,
            "CurrentTypeID": 20
        },
        {
            "ID": 280771,
            "ConnectionTypeID": 25,
            "StatusTypeID": 50,
            "LevelID": 2,
            "PowerKW": 22,
            "CurrentTypeID": 20
        }
    ],
    "StatusTypeID": 50,
    "DateLastStatusUpdate": "2021-07-12T02:43:00Z",
    "MetadataValues": [
        {
            "ID": 11531,
            "MetadataFieldID": 4,
            "ItemValue": "Data from the German chargepoint registry provided by Bundesnetzagentur.de under the CC-BY 4.0 license"
        }
    ],
    "DataQualityLevel": 3,
    "DateCreated": "2021-07-08T09:59:00Z",
    "SubmissionStatusTypeID": 100
}