{
    "IsRecentlyVerified": false,
    "ID": 84581,
    "UUID": "862D8D10-3BD0-4F7A-98A0-A410B0456D15",
    "DataProviderID": 1,
    "OperatorID": 23,
    "OperatorsReference": "25375",
    "UsageTypeID": 4,
    "AddressInfo": {
        "ID": 84927,
        "Title": "Centro Oberhausen",
        "AddressLine1": "1000 Centroallee",
        "Town": "Oberhausen",
        "Postcode": "46047",
        "CountryID": 87,
        "Latitude": 51.489227,
        "Longitude": 6.879317,
        "ContactTelephone1": "+49 208 8282055",
        "DistanceUnit": 0
    },
    "Connections": [
        {
            "ID": 120147,
            "ConnectionTypeID": 30,
            "StatusTypeID": 50,
            "LevelID": 2,
            "Amps": 32,
            "Voltage": 400,
            "PowerKW": 22,
            "CurrentTypeID": 20,
            "Quantity": 1
        }
    ],
    "NumberOfPoints": 1,
    "GeneralComments": "1 Tesla Connector, up to 22kW.Available for customers. Self park.",
    "StatusTypeID": 50,
    "DateLastStatusUpdate": "2018-10-03T14:34:00Z",
    "DataQualityLevel": 1,
    "DateCreated": "2017-03-04T06:36:00Z",
    "SubmissionStatusTypeID": 200
}