{
    "IsRecentlyVerified": false,
    "ID": 66489,
    "UUID": "C99E3C8A-AAF3-459A-B2EE-C9A48ECB02DE",
    "DataProviderID": 1,
    "OperatorID": 22,
    "OperatorsReference": "C9NSQ",
    "UsageTypeID": 4,
    "UsageCost": "Free",
    "AddressInfo": {
        "ID": 66835,
        "Title": "Topaz - Roche's Service Station",
        "AddressLine1": "R433",
        "Town": "Ballacolla",
        "StateOrProvince": "County Laois",
        "CountryID": 3,
        "Latitude": 52.8666761230419,
        "Longitude": -7.4808847437746,
        "AccessComments": "Duplicated with OCM-48004",
        "DistanceUnit": 0
    },
    "Connections": [
        {
            "ID": 178371,
            "ConnectionTypeID": 2,
            "StatusTypeID": 50,
            "LevelID": 3,
            "PowerKW": 50,
            "CurrentTypeID": 30,
            "Quantity": 1
        },
        {
            "ID": 178372,
            "ConnectionTypeID": 33,
            "StatusTypeID": 50,
            "LevelID": 3,
            "PowerKW": 50,
            "CurrentTypeID": 20,
            "Quantity": 1
        }
    ],
    "NumberOfPoints": 2,
    "GeneralComments": "requires ESB access card",
    "StatusTypeID": 50,
    "DateLastStatusUpdate": "2019-06-03T09:39:00Z",
    "DataQualityLevel": 1,
    "DateCreated": "2016-05-22T09:25:00Z",
    "SubmissionStatusTypeID": 200
}