{
    "IsRecentlyVerified": false,
    "ID": 167619,
    "UUID": "61BEB94A-E55B-49E0-AB01-2F7B74248DFE",
    "DataProviderID": 19,
    "DataProvidersReference": "5439",
    "AddressInfo": {
        "ID": 167978,
        "Title": "Scala Parkering Helsingborg",
        "AddressLine1": "Gasverksgatan ",
        "Town": "HELSINGBORG",
        "StateOrProvince": "SKÅNE",
        "Postcode": "25225",
        "CountryID": 216,
        "Latitude": 56.04071,
        "Longitude": 12.69921,
        "AccessComments": "Scala Parkering Helsingborg.",
        "DistanceUnit": 0
    },
    "Connections": [
        {
            "ID": 254507,
            "ConnectionTypeID": 25,
            "Reference": "1",
            "LevelID": 2,
            "Amps": 16,
            "Voltage": 400,
            "PowerKW": 11,
            "CurrentTypeID": 20,
            "Comments": "Mode 3"
        },
        {
            "ID": 254508,
            "ConnectionTypeID": 25,
            "Reference": "2",
            "LevelID": 2,
            "Amps": 16,
            "Voltage": 400,
            "PowerKW": 11,
            "CurrentTypeID": 20,
            "Comments": "Mode 3"
        },
        {
            "ID": 254509,
            "ConnectionTypeID": 25,
            "Reference": "3",
            "LevelID": 2,
            "Amps": 16,
            "Voltage": 400,
            "PowerKW": 11,
            "CurrentTypeID": 20,
            "Comments": "Mode 3"
        },
        {
            "ID": 254510,
            "ConnectionTypeID": 25,
            "Reference": "4",
            "LevelID": 2,
            "Amps": 16,
            "Voltage": 400,
            "PowerKW": 11,
            "CurrentTypeID": 20,
            "Comments": "Mode 3"
        },
        {
            "ID": 254511,
            "ConnectionTypeID": 25,
            "Reference": "5",
            "LevelID": 2,
            "Amps": 16,
            "Voltage": 400,
            "PowerKW": 11,
            "CurrentTypeID": 20,
            "Comments": "Mode 3"
        },
        {
            "ID": 254512,
            "ConnectionTypeID": 25,
            "Reference": "6",
            "LevelID": 2,
            "Amps": 16,
            "Voltage": 400,
            "PowerKW": 11,
            "CurrentTypeID": 20,
            "Comments": "Mode 3"
        }
    ],
    "NumberOfPoints": 6,
    "StatusTypeID": 0,
    "DateLastStatusUpdate": "2021-03-24T05:10:00Z",
    "DataQualityLevel": 2,
    "DateCreated": "2020-09-08T04:35:00Z",
    "SubmissionStatusTypeID": 100
}