{
    "IsRecentlyVerified": false,
    "ID": 75640,
    "UUID": "EFFA2A09-16DF-410D-B937-1F131820F691",
    "DataProviderID": 1,
    "OperatorID": 32,
    "OperatorsReference": "106540",
    "UsageTypeID": 4,
    "UsageCost": "Inclusive; for Polar Plus subscription members only",
    "AddressInfo": {
        "ID": 75986,
        "Title": "Ibis Bradford Shipley",
        "AddressLine1": "Wharf Street",
        "AddressLine2": "Temple Rhydding",
        "Town": "Bradford",
        "StateOrProvince": "England",
        "Postcode": "BD18 3ST",
        "CountryID": 1,
        "Latitude": 53.835949,
        "Longitude": -1.776874,
        "DistanceUnit": 0
    },
    "Connections": [
        {
            "ID": 109079,
            "ConnectionTypeID": 25,
            "StatusTypeID": 50,
            "LevelID": 2,
            "Amps": 16,
            "Voltage": 230,
            "PowerKW": 4,
            "CurrentTypeID": 10,
            "Quantity": 1
        }
    ],
    "NumberOfPoints": 1,
    "StatusTypeID": 50,
    "DateLastStatusUpdate": "2018-06-20T05:16:00Z",
    "DataQualityLevel": 1,
    "DateCreated": "2016-12-18T16:28:00Z",
    "SubmissionStatusTypeID": 200
}