{
    "IsRecentlyVerified": false,
    "ID": 143865,
    "UUID": "F275D70A-B40C-4690-8087-47CC392468D5",
    "DataProviderID": 2,
    "DataProvidersReference": "95757",
    "OperatorID": 9,
    "UsageTypeID": 1,
    "AddressInfo": {
        "ID": 144217,
        "Title": "Eastgate Business Center",
        "AddressLine1": "33900 SE Eastgate Circle",
        "Town": "Corvallis",
        "StateOrProvince": "OR",
        "Postcode": "97333",
        "CountryID": 2,
        "Latitude": 44.563768,
        "Longitude": -123.225812,
        "ContactTelephone1": "888-998-2546",
        "AccessComments": "MON: 24 hours | TUE: 24 hours | WED: 24 hours | THU: 24 hours | FRI: 24 hours | SAT: 24 hours | SUN: 24 hours",
        "RelatedURL": "http://www.blinkcharging.com/",
        "DistanceUnit": 0
    },
    "Connections": [
        {
            "ID": 200275,
            "ConnectionTypeID": 1,
            "LevelID": 2,
            "Amps": 16,
            "Voltage": 230,
            "PowerKW": 3.7,
            "CurrentTypeID": 10,
            "Quantity": 3
        }
    ],
    "StatusTypeID": 50,
    "DateLastStatusUpdate": "2020-06-26T03:08:00Z",
    "DataQualityLevel": 3,
    "DateCreated": "2019-12-24T09:22:00Z",
    "SubmissionStatusTypeID": 100
}