{
    "IsRecentlyVerified": false,
    "ID": 17492,
    "UUID": "2EDFA5BB-DA1B-4717-A987-40C1D56B66B2",
    "DataProviderID": 22,
    "DataProvidersReference": "5C46DFDE90D27CF400999DED4049F356",
    "AddressInfo": {
        "ID": 17837,
        "Title": "日産自動車九州工場",
        "AddressLine1": "福岡県京都郡苅田町新浜町1-3",
        "CountryID": 114,
        "Latitude": 33.76355375,
        "Longitude": 130.993288,
        "ContactTelephone1": "093-436-2345",
        "DistanceUnit": 0
    },
    "Connections": [
        {
            "ID": 17733,
            "ConnectionTypeID": 2,
            "LevelID": 2,
            "Amps": 100,
            "Voltage": 480,
            "PowerKW": 48,
            "Quantity": 1
        }
    ],
    "DateLastStatusUpdate": "2013-06-29T08:59:00Z",
    "DataQualityLevel": 2,
    "DateCreated": "2013-06-29T08:59:00Z",
    "SubmissionStatusTypeID": 200
}