{
    "IsRecentlyVerified": false,
    "ID": 185477,
    "UUID": "3BE41273-5BBA-425B-9CB6-D5019B2EA517",
    "DataProviderID": 29,
    "DataProvidersReference": "15470",
    "AddressInfo": {
        "ID": 185836,
        "Title": "Salzburger Str. 56",
        "AddressLine1": "Salzburger Str. 56",
        "Town": "Stuttgart",
        "Postcode": "70469",
        "CountryID": 87,
        "Latitude": 48.811516,
        "Longitude": 9.149708,
        "DistanceUnit": 0
    },
    "Connections": [
        {
            "ID": 295022,
            "ConnectionTypeID": 33,
            "StatusTypeID": 50,
            "LevelID": 3,
            "PowerKW": 22,
            "CurrentTypeID": 30
        },
        {
            "ID": 295023,
            "ConnectionTypeID": 25,
            "StatusTypeID": 50,
            "LevelID": 2,
            "PowerKW": 11,
            "CurrentTypeID": 20
        }
    ],
    "StatusTypeID": 50,
    "DateLastStatusUpdate": "2021-07-12T02:42:00Z",
    "MetadataValues": [
        {
            "ID": 17768,
            "MetadataFieldID": 4,
            "ItemValue": "Data from the German chargepoint registry provided by Bundesnetzagentur.de under the CC-BY 4.0 license"
        }
    ],
    "DataQualityLevel": 3,
    "DateCreated": "2021-07-08T10:07:00Z",
    "SubmissionStatusTypeID": 100
}