{
    "IsRecentlyVerified": false,
    "ID": 81801,
    "UUID": "E4162A52-D76B-4F5E-B4F3-D4615A964DD3",
    "DataProviderID": 1,
    "OperatorID": 23,
    "OperatorsReference": "6606",
    "UsageTypeID": 6,
    "AddressInfo": {
        "ID": 82147,
        "Title": "Indian Wells Resort Hotel",
        "AddressLine1": "76661 California 111",
        "Town": "Palm Desert",
        "StateOrProvince": "CA",
        "Postcode": "92260",
        "CountryID": 2,
        "Latitude": 33.721415,
        "Longitude": -116.326811,
        "ContactTelephone1": "(800) 248-3220",
        "DistanceUnit": 0
    },
    "Connections": [
        {
            "ID": 116559,
            "ConnectionTypeID": 30,
            "StatusTypeID": 50,
            "LevelID": 2,
            "PowerKW": 16,
            "CurrentTypeID": 20,
            "Quantity": 3
        }
    ],
    "NumberOfPoints": 3,
    "GeneralComments": "3 Tesla Connectors, up to 16kW.Available for patrons only. Please see valet.",
    "StatusTypeID": 50,
    "DateLastStatusUpdate": "2017-02-03T12:21:00Z",
    "DataQualityLevel": 1,
    "DateCreated": "2017-02-03T12:21:00Z",
    "SubmissionStatusTypeID": 200
}