{
    "IsRecentlyVerified": false,
    "ID": 143273,
    "UUID": "E674AFF4-DFAC-477B-9CDD-F5AB088D34BB",
    "DataProviderID": 2,
    "DataProvidersReference": "145110",
    "OperatorID": 5,
    "UsageTypeID": 1,
    "AddressInfo": {
        "ID": 143625,
        "Title": "NAT GRID WRKPLC",
        "AddressLine1": "60 brown street",
        "Town": "North Adams",
        "StateOrProvince": "MA",
        "Postcode": "01247",
        "CountryID": 2,
        "Latitude": 42.7032564,
        "Longitude": -73.1198846,
        "ContactTelephone1": "888-758-4389",
        "AccessComments": "24 hours daily",
        "RelatedURL": "http://www.chargepoint.com/",
        "DistanceUnit": 0
    },
    "Connections": [
        {
            "ID": 199568,
            "ConnectionTypeID": 1,
            "LevelID": 2,
            "Amps": 16,
            "Voltage": 230,
            "PowerKW": 3.7,
            "CurrentTypeID": 10,
            "Quantity": 2
        }
    ],
    "StatusTypeID": 50,
    "DateLastStatusUpdate": "2020-06-26T03:06:00Z",
    "DataQualityLevel": 3,
    "DateCreated": "2019-12-24T09:20:00Z",
    "SubmissionStatusTypeID": 100
}