{
    "UserComments": [
        {
            "ID": 4470,
            "ChargePointID": 19372,
            "CommentTypeID": 10,
            "UserName": "zcacmxi",
            "Comment": "Source London card used on Chargemaster wall unit.",
            "Rating": 5,
            "DateCreated": "2015-05-17T06:52:18.517Z",
            "User": {
                "ID": 4846,
                "Username": "zcacmxi"
            },
            "CheckinStatusTypeID": 10
        }
    ],
    "IsRecentlyVerified": false,
    "ID": 19372,
    "UUID": "6D3A2DFC-98D1-498D-8DD5-A1960645C024",
    "DataProviderID": 1,
    "OperatorID": 32,
    "OperatorsReference": "1620,500",
    "UsageTypeID": 4,
    "UsageCost": "Inclusive; for Polar Plus subscription members only",
    "AddressInfo": {
        "ID": 19717,
        "Title": " Waitrose Beckenham",
        "AddressLine1": "1 Southend Road",
        "AddressLine2": " Bromley",
        "Town": "London",
        "Postcode": "BR3 1SD",
        "CountryID": 1,
        "Latitude": 51.4110326,
        "Longitude": -0.0255257,
        "ContactTelephone1": "0845 850 0653",
        "AccessComments": "Charges may apply - refer to the owner of the parking bay for details.",
        "RelatedURL": "http://www.waitrose.com/bf_home/bf/212.html",
        "DistanceUnit": 0
    },
    "Connections": [
        {
            "ID": 19672,
            "ConnectionTypeID": 25,
            "StatusTypeID": 50,
            "LevelID": 2,
            "Amps": 32,
            "Voltage": 230,
            "PowerKW": 7,
            "CurrentTypeID": 10,
            "Quantity": 4
        }
    ],
    "NumberOfPoints": 4,
    "GeneralComments": "Chargemaster post. Polar Network cards accepted, but no longer Source London",
    "StatusTypeID": 50,
    "DateLastStatusUpdate": "2019-03-06T06:30:00Z",
    "MetadataValues": [
        {
            "ID": 25,
            "MetadataFieldID": 4,
            "ItemValue": "Data © OpenStreetMap contributors, ODbL 1.0. http://www.openstreetmap.org/copyright"
        }
    ],
    "DataQualityLevel": 1,
    "DateCreated": "2013-09-23T19:28:00Z",
    "SubmissionStatusTypeID": 200
}