{
    "IsRecentlyVerified": false,
    "ID": 62800,
    "UUID": "1A4A350C-1FBD-4DB2-951D-7EFD14094288",
    "DataProviderID": 26,
    "DataProvidersReference": "78562",
    "OperatorID": 36,
    "OperatorsReference": "ENO-ZEMO-A005_1",
    "UsageCost": "0.00 afhankelijk van pas",
    "AddressInfo": {
        "ID": 63146,
        "Title": "Chaussée De Soignies",
        "AddressLine1": "Chaussée De Soignies",
        "Town": "Silly",
        "Postcode": "7830",
        "CountryID": 26,
        "Latitude": 50.66565,
        "Longitude": 4.037644,
        "ContactTelephone1": "+32 (0) 10 750 650",
        "ContactEmail": "services@bluecorner.be",
        "RelatedURL": "http://www.ze-mo.be/",
        "DistanceUnit": 0
    },
    "Connections": [
        {
            "ID": 79757,
            "ConnectionTypeID": 25,
            "LevelID": 2,
            "PowerKW": 5,
            "CurrentTypeID": 10
        },
        {
            "ID": 79758,
            "ConnectionTypeID": 25,
            "LevelID": 2,
            "PowerKW": 22,
            "CurrentTypeID": 10
        }
    ],
    "NumberOfPoints": 1,
    "StatusTypeID": 50,
    "DateLastStatusUpdate": "2016-06-04T02:38:00Z",
    "DataQualityLevel": 3,
    "DateCreated": "2016-03-03T12:29:00Z",
    "SubmissionStatusTypeID": 100
}