{
    "IsRecentlyVerified": false,
    "ID": 36199,
    "UUID": "43FCE4FF-7336-4566-BE2E-6C3C74815050",
    "DataProviderID": 26,
    "DataProvidersReference": "55634",
    "OperatorID": 181,
    "OperatorsReference": "ENO-UT-0004",
    "UsageCost": "0.00 afhankelijk van pas",
    "AddressInfo": {
        "ID": 36545,
        "Title": "Albrecht Thaerlaan 20",
        "AddressLine1": "Albrecht Thaerlaan 20",
        "Town": "Utrecht",
        "Postcode": "3571 EB",
        "CountryID": 159,
        "Latitude": 52.110985,
        "Longitude": 5.1310215,
        "DistanceUnit": 0
    },
    "Connections": [
        {
            "ID": 39710,
            "ConnectionTypeID": 25,
            "LevelID": 2,
            "PowerKW": 5,
            "CurrentTypeID": 10
        }
    ],
    "NumberOfPoints": 2,
    "StatusTypeID": 50,
    "DateLastStatusUpdate": "2016-06-04T02:50:00Z",
    "DataQualityLevel": 3,
    "DateCreated": "2015-01-09T06:05:00Z",
    "SubmissionStatusTypeID": 100
}