{
    "IsRecentlyVerified": false,
    "ID": 111785,
    "UUID": "9C17D4C6-41D7-48FD-8BA8-594ECAFBA792",
    "DataProviderID": 2,
    "DataProvidersReference": "84559",
    "UsageTypeID": 1,
    "AddressInfo": {
        "ID": 112131,
        "Title": "Guillevin International",
        "AddressLine1": "1735 rue Mitis",
        "Town": "Saguenay",
        "StateOrProvince": "QC",
        "Postcode": "G7K 1H3",
        "CountryID": 44,
        "Latitude": 48.40349,
        "Longitude": -71.124877,
        "ContactTelephone1": "418-543-4459",
        "AccessComments": "24 hours daily",
        "RelatedURL": "",
        "DistanceUnit": 0
    },
    "Connections": [
        {
            "ID": 157283,
            "ConnectionTypeID": 1,
            "LevelID": 2,
            "Amps": 16,
            "Voltage": 230,
            "PowerKW": 3.7,
            "CurrentTypeID": 10,
            "Quantity": 1
        }
    ],
    "DateLastStatusUpdate": "2020-06-26T03:11:00Z",
    "DataQualityLevel": 3,
    "DateCreated": "2018-10-18T23:37:00Z",
    "SubmissionStatusTypeID": 100
}