{
    "IsRecentlyVerified": false,
    "ID": 119476,
    "UUID": "1C84460A-0B6E-45C3-9AAE-F0A5974029FC",
    "DataProviderID": 2,
    "DataProvidersReference": "74470",
    "OperatorID": 107,
    "UsageTypeID": 1,
    "AddressInfo": {
        "ID": 119822,
        "Title": "Windward Community College",
        "AddressLine1": "45-720 Keaahala Rd",
        "Town": "Kaneohe",
        "StateOrProvince": "HI",
        "Postcode": "96744",
        "CountryID": 2,
        "Latitude": 21.409485,
        "Longitude": -157.812773,
        "ContactTelephone1": "808-235-7377",
        "AccessComments": "24 hours daily",
        "RelatedURL": "http://www.opconnect.com/",
        "DistanceUnit": 0
    },
    "Connections": [
        {
            "ID": 168740,
            "ConnectionTypeID": 1,
            "LevelID": 2,
            "Amps": 16,
            "Voltage": 230,
            "PowerKW": 3.7,
            "CurrentTypeID": 10,
            "Quantity": 2
        }
    ],
    "DateLastStatusUpdate": "2020-06-26T02:52:00Z",
    "DataQualityLevel": 3,
    "DateCreated": "2019-04-01T04:59:00Z",
    "SubmissionStatusTypeID": 100
}