{
    "IsRecentlyVerified": false,
    "ID": 147752,
    "UUID": "8CC59A05-4117-4148-B527-65D088E39FD7",
    "DataProviderID": 1,
    "OperatorID": 3323,
    "UsageTypeID": 4,
    "AddressInfo": {
        "ID": 148104,
        "Title": "ZES - Novotel Trabzon",
        "AddressLine1": "D010",
        "Town": "Kaşüstü",
        "StateOrProvince": "Yomra",
        "Postcode": "61290",
        "CountryID": 229,
        "Latitude": 40.96902163263164,
        "Longitude": 39.83914052553007,
        "RelatedURL": "http://www.zes.net",
        "DistanceUnit": 0
    },
    "Connections": [
        {
            "ID": 205093,
            "ConnectionTypeID": 25,
            "StatusTypeID": 50,
            "LevelID": 2,
            "Amps": 32,
            "Voltage": 400,
            "PowerKW": 22,
            "CurrentTypeID": 20,
            "Quantity": 2
        }
    ],
    "NumberOfPoints": 2,
    "GeneralComments": "Hotel outdoor parking area. Open 7/24",
    "StatusTypeID": 50,
    "DateLastStatusUpdate": "2020-01-16T08:52:00Z",
    "DataQualityLevel": 1,
    "DateCreated": "2020-01-16T08:52:00Z",
    "SubmissionStatusTypeID": 200
}