{
    "IsRecentlyVerified": false,
    "ID": 56622,
    "UUID": "61BF39AC-02F1-4544-98F3-72908218928D",
    "DataProviderID": 2,
    "DataProvidersReference": "70496",
    "OperatorID": 5,
    "UsageTypeID": 1,
    "AddressInfo": {
        "ID": 56968,
        "Title": "HAMPTON INN",
        "AddressLine1": "1442 Western Ave",
        "Town": "Albany",
        "StateOrProvince": "NY",
        "Postcode": "12203",
        "CountryID": 2,
        "Latitude": 42.6791149,
        "Longitude": -73.8366303,
        "ContactTelephone1": "888-758-4389",
        "AccessComments": "24 hours daily",
        "RelatedURL": "http://www.chargepoint.com/",
        "DistanceUnit": 0
    },
    "Connections": [
        {
            "ID": 71383,
            "ConnectionTypeID": 1,
            "LevelID": 2,
            "Amps": 16,
            "Voltage": 230,
            "PowerKW": 3,
            "CurrentTypeID": 10,
            "Quantity": 2
        }
    ],
    "DateLastStatusUpdate": "2019-12-24T09:20:00Z",
    "DataQualityLevel": 3,
    "DateCreated": "2015-11-04T08:42:00Z",
    "SubmissionStatusTypeID": 100
}