{
    "IsRecentlyVerified": false,
    "ID": 153788,
    "UUID": "EC9A4AC4-D690-4090-A793-3E3E10C1E3A1",
    "DataProviderID": 28,
    "DataProvidersReference": "FR*S77*P77394A",
    "OperatorID": 3413,
    "UsageTypeID": 5,
    "AddressInfo": {
        "ID": 154141,
        "Title": "Rubelles",
        "AddressLine1": "rue du perres",
        "CountryID": 80,
        "Latitude": 48.5529881,
        "Longitude": 2.6709812,
        "AccessComments": "",
        "DistanceUnit": 0
    },
    "Connections": [
        {
            "ID": 215957,
            "ConnectionTypeID": 28,
            "StatusTypeID": 50,
            "LevelID": 2,
            "PowerKW": 18,
            "CurrentTypeID": 10
        },
        {
            "ID": 215958,
            "ConnectionTypeID": 25,
            "StatusTypeID": 50,
            "LevelID": 2,
            "PowerKW": 18,
            "CurrentTypeID": 20
        },
        {
            "ID": 249715,
            "ConnectionTypeID": 28,
            "StatusTypeID": 50,
            "LevelID": 2,
            "PowerKW": 18,
            "CurrentTypeID": 10
        },
        {
            "ID": 249716,
            "ConnectionTypeID": 25,
            "StatusTypeID": 50,
            "LevelID": 2,
            "PowerKW": 18,
            "CurrentTypeID": 20
        }
    ],
    "GeneralComments": "badge, appli et QR code",
    "StatusTypeID": 50,
    "DateLastStatusUpdate": "2020-08-27T05:15:00Z",
    "DataQualityLevel": 2,
    "DateCreated": "2020-03-15T10:54:00Z",
    "SubmissionStatusTypeID": 100
}