{
    "UserComments": [
        {
            "ID": 20849,
            "ChargePointID": 91555,
            "CommentTypeID": 10,
            "UserName": "Someone_Just_",
            "Comment": "Can only be used when shop is open.",
            "DateCreated": "2019-03-31T16:40:16.107Z",
            "User": {
                "ID": 1107,
                "Username": "Someone_Just_"
            }
        },
        {
            "ID": 19206,
            "ChargePointID": 91555,
            "CommentTypeID": 10,
            "UserName": "Someone_Just_",
            "Comment": "Can only be used at opening hours.",
            "DateCreated": "2018-02-18T18:35:22.14Z",
            "User": {
                "ID": 1107,
                "Username": "Someone_Just_"
            },
            "CheckinStatusTypeID": 140
        },
        {
            "ID": 17553,
            "ChargePointID": 91555,
            "CommentTypeID": 10,
            "UserName": "Someone_Just_",
            "Rating": 5,
            "DateCreated": "2017-08-06T19:26:19.957Z",
            "User": {
                "ID": 1107,
                "Username": "Someone_Just_"
            },
            "CheckinStatusTypeID": 100
        }
    ],
    "MediaItems": [
        {
            "ID": 13792,
            "ChargePointID": 91555,
            "ItemURL": "https://s3-ap-southeast-2.amazonaws.com/openchargemap/images/BE/OCM91555/OCM-91555.orig.2017121118392900.jpeg",
            "ItemThumbnailURL": "https://s3-ap-southeast-2.amazonaws.com/openchargemap/images/BE/OCM91555/OCM-91555.thmb.2017121118392900.jpeg",
            "Comment": "",
            "IsEnabled": true,
            "IsVideo": false,
            "IsFeaturedItem": false,
            "IsExternalResource": false,
            "User": {
                "ID": 12149,
                "Username": "Xavier Criel"
            },
            "DateCreated": "2017-12-11T18:40:00Z"
        },
        {
            "ID": 13118,
            "ChargePointID": 91555,
            "ItemURL": "https://s3-ap-southeast-2.amazonaws.com/openchargemap/images/BE/OCM91555/OCM-91555.orig.2017080619322579.jpg",
            "ItemThumbnailURL": "https://s3-ap-southeast-2.amazonaws.com/openchargemap/images/BE/OCM91555/OCM-91555.thmb.2017080619322579.jpg",
            "Comment": "Also 3 lockers for bicycle battery's. ",
            "IsEnabled": true,
            "IsVideo": false,
            "IsFeaturedItem": false,
            "IsExternalResource": false,
            "User": {
                "ID": 1107,
                "Username": "Someone_Just_"
            },
            "DateCreated": "2017-08-06T19:33:00Z"
        },
        {
            "ID": 13117,
            "ChargePointID": 91555,
            "ItemURL": "https://s3-ap-southeast-2.amazonaws.com/openchargemap/images/BE/OCM91555/OCM-91555.orig.2017080619253055.jpg",
            "ItemThumbnailURL": "https://s3-ap-southeast-2.amazonaws.com/openchargemap/images/BE/OCM91555/OCM-91555.thmb.2017080619253055.jpg",
            "Comment": "",
            "IsEnabled": true,
            "IsVideo": false,
            "IsFeaturedItem": false,
            "IsExternalResource": false,
            "User": {
                "ID": 1107,
                "Username": "Someone_Just_"
            },
            "DateCreated": "2017-08-06T19:26:00Z"
        },
        {
            "ID": 13116,
            "ChargePointID": 91555,
            "ItemURL": "https://s3-ap-southeast-2.amazonaws.com/openchargemap/images/BE/OCM91555/OCM-91555.orig.2017080619244033.jpg",
            "ItemThumbnailURL": "https://s3-ap-southeast-2.amazonaws.com/openchargemap/images/BE/OCM91555/OCM-91555.thmb.2017080619244033.jpg",
            "Comment": "",
            "IsEnabled": true,
            "IsVideo": false,
            "IsFeaturedItem": false,
            "IsExternalResource": false,
            "User": {
                "ID": 1107,
                "Username": "Someone_Just_"
            },
            "DateCreated": "2017-08-06T19:25:00Z"
        }
    ],
    "IsRecentlyVerified": false,
    "ID": 91555,
    "UUID": "E7603DE4-2304-40F3-A919-1B97948F1405",
    "DataProviderID": 1,
    "OperatorID": 45,
    "UsageTypeID": 6,
    "UsageCost": "free",
    "AddressInfo": {
        "ID": 91901,
        "Title": "Lidl Brecht",
        "AddressLine1": "Beukenlei 36",
        "Postcode": "2960",
        "CountryID": 26,
        "Latitude": 51.30616423339115,
        "Longitude": 4.565745328311079,
        "DistanceUnit": 0
    },
    "Connections": [
        {
            "ID": 129777,
            "ConnectionTypeID": 33,
            "StatusTypeID": 50,
            "LevelID": 3,
            "PowerKW": 50,
            "CurrentTypeID": 30,
            "Quantity": 1
        },
        {
            "ID": 129778,
            "ConnectionTypeID": 2,
            "StatusTypeID": 50,
            "LevelID": 3,
            "PowerKW": 50,
            "CurrentTypeID": 30,
            "Quantity": 1
        },
        {
            "ID": 129779,
            "ConnectionTypeID": 1036,
            "StatusTypeID": 50,
            "LevelID": 2,
            "PowerKW": 22,
            "CurrentTypeID": 20,
            "Quantity": 1
        }
    ],
    "NumberOfPoints": 2,
    "GeneralComments": "Free charging during opening hours: Mo - fr 8:30 - 20:00 Sa: 8:30 - 19:00 ",
    "StatusTypeID": 50,
    "DateLastStatusUpdate": "2019-03-31T16:40:00Z",
    "DataQualityLevel": 1,
    "DateCreated": "2017-08-06T19:22:00Z",
    "SubmissionStatusTypeID": 200
}