{
    "IsRecentlyVerified": false,
    "ID": 110421,
    "UUID": "EAFC686B-093D-4833-9DDB-EC569F41B34B",
    "DataProviderID": 2,
    "DataProvidersReference": "100240",
    "OperatorID": 39,
    "UsageTypeID": 1,
    "AddressInfo": {
        "ID": 110767,
        "Title": "The Signet Building",
        "AddressLine1": "6900 Fleetwood Road",
        "Town": "McLean",
        "StateOrProvince": "VA",
        "Postcode": "22101",
        "CountryID": 2,
        "Latitude": 38.9379928,
        "Longitude": -77.1809713,
        "ContactTelephone1": "800-663-5633",
        "AccessComments": "MO: Not Specified; TU: Not Specified; WE: Not Specified; TH: Not Specified; FR: Not Specified; SA: Not Specified; SU: Not Specified",
        "RelatedURL": "http://www.semacharge.com/",
        "DistanceUnit": 0
    },
    "Connections": [
        {
            "ID": 155673,
            "ConnectionTypeID": 1,
            "LevelID": 2,
            "Amps": 16,
            "Voltage": 230,
            "PowerKW": 3,
            "CurrentTypeID": 10,
            "Quantity": 2
        }
    ],
    "DateLastStatusUpdate": "2019-04-06T05:04:00Z",
    "DataQualityLevel": 3,
    "DateCreated": "2018-10-18T23:36:00Z",
    "SubmissionStatusTypeID": 100
}