{
    "IsRecentlyVerified": true,
    "DateLastVerified": "2021-09-01T18:41:00Z",
    "ID": 189022,
    "UUID": "9EEF76BA-88C6-4EC0-B65C-5BFED323EB76",
    "DataProviderID": 1,
    "OperatorID": 3471,
    "UsageTypeID": 5,
    "UsageCost": "£0.39/kWh",
    "AddressInfo": {
        "ID": 189381,
        "Title": "MFG Wellington",
        "AddressLine1": "Archway Road",
        "AddressLine2": "Highgate",
        "Town": "London",
        "StateOrProvince": "England",
        "Postcode": "N6 4HX",
        "CountryID": 1,
        "Latitude": 51.58103061410219,
        "Longitude": -0.15555384174172104,
        "DistanceUnit": 0
    },
    "Connections": [
        {
            "ID": 305524,
            "ConnectionTypeID": 33,
            "StatusTypeID": 50,
            "LevelID": 3,
            "PowerKW": 150,
            "CurrentTypeID": 30,
            "Quantity": 4
        },
        {
            "ID": 305525,
            "ConnectionTypeID": 2,
            "StatusTypeID": 50,
            "LevelID": 3,
            "PowerKW": 100,
            "CurrentTypeID": 30,
            "Quantity": 4
        }
    ],
    "NumberOfPoints": 4,
    "StatusTypeID": 50,
    "DateLastStatusUpdate": "2021-09-01T18:41:00Z",
    "DataQualityLevel": 1,
    "DateCreated": "2021-09-01T18:41:00Z",
    "SubmissionStatusTypeID": 200
}