{
    "IsRecentlyVerified": false,
    "ID": 36565,
    "UUID": "9BA7F329-733C-4CDC-BFCE-C6D480F5F9D4",
    "DataProviderID": 26,
    "DataProvidersReference": "48554",
    "OperatorID": 178,
    "OperatorsReference": "EVnetNL REE206",
    "UsageCost": "0.00 jaarabonnement",
    "AddressInfo": {
        "ID": 36911,
        "Title": "Markenhaven 25D",
        "AddressLine1": "Markenhaven 25D",
        "Town": "Amersfoort",
        "Postcode": "3826 AC",
        "CountryID": 159,
        "Latitude": 52.200292,
        "Longitude": 5.430298,
        "ContactTelephone1": "0800-3522365",
        "RelatedURL": "http://www.evnet.nl",
        "DistanceUnit": 0
    },
    "Connections": [
        {
            "ID": 40076,
            "ConnectionTypeID": 25,
            "LevelID": 2,
            "PowerKW": 11,
            "CurrentTypeID": 10
        }
    ],
    "NumberOfPoints": 2,
    "StatusTypeID": 50,
    "DateLastStatusUpdate": "2016-06-04T02:51:00Z",
    "DataQualityLevel": 3,
    "DateCreated": "2015-01-09T06:05:00Z",
    "SubmissionStatusTypeID": 100
}