{
    "IsRecentlyVerified": false,
    "ID": 92744,
    "UUID": "B2B76C3E-87BE-4262-900C-DEB3A15BFEAE",
    "DataProviderID": 1,
    "OperatorID": 20,
    "OperatorsReference": "40059,80129",
    "UsageTypeID": 4,
    "UsageCost": "Free",
    "AddressInfo": {
        "ID": 93090,
        "Title": "The Customs House / Milldam Car Park",
        "AddressLine1": "Mill Dam",
        "Town": "South Shields",
        "Postcode": "NE33 1ES",
        "CountryID": 1,
        "Latitude": 54.99473,
        "Longitude": -1.44086,
        "DistanceUnit": 0
    },
    "Connections": [
        {
            "ID": 131360,
            "ConnectionTypeID": 2,
            "StatusTypeID": 50,
            "LevelID": 3,
            "PowerKW": 50,
            "CurrentTypeID": 30,
            "Quantity": 1
        },
        {
            "ID": 131361,
            "ConnectionTypeID": 33,
            "StatusTypeID": 50,
            "LevelID": 3,
            "PowerKW": 50,
            "CurrentTypeID": 30,
            "Quantity": 1
        },
        {
            "ID": 131362,
            "ConnectionTypeID": 1036,
            "StatusTypeID": 50,
            "LevelID": 3,
            "PowerKW": 43,
            "CurrentTypeID": 20,
            "Quantity": 1
        },
        {
            "ID": 132214,
            "ConnectionTypeID": 25,
            "StatusTypeID": 100,
            "LevelID": 2,
            "Amps": 32,
            "Voltage": 230,
            "PowerKW": 7,
            "CurrentTypeID": 10,
            "Quantity": 2
        }
    ],
    "NumberOfPoints": 2,
    "StatusTypeID": 75,
    "DateLastStatusUpdate": "2020-01-02T08:24:00Z",
    "DataQualityLevel": 1,
    "DateCreated": "2017-09-09T05:26:00Z",
    "SubmissionStatusTypeID": 200
}