{
    "IsRecentlyVerified": false,
    "ID": 156771,
    "UUID": "384D7499-8D14-4E20-924E-49B141B6AF97",
    "DataProviderID": 19,
    "DataProvidersReference": "5524",
    "AddressInfo": {
        "ID": 157125,
        "Title": "P2 Skaraborgs sjukhus skövde",
        "AddressLine1": "Skaraborgs sjukhus skövde ",
        "Town": "SKÖVDE",
        "StateOrProvince": "VÄSTRA GÖTALAND",
        "Postcode": "54142",
        "CountryID": 216,
        "Latitude": 58.427005,
        "Longitude": 13.85538,
        "AccessComments": "Belägna under solcellstaken på parkering P2",
        "DistanceUnit": 0
    },
    "Connections": [
        {
            "ID": 221798,
            "ConnectionTypeID": 25,
            "Reference": "1",
            "LevelID": 2,
            "Amps": 16,
            "Voltage": 400,
            "PowerKW": 11,
            "CurrentTypeID": 20,
            "Comments": "Mode 3"
        },
        {
            "ID": 221799,
            "ConnectionTypeID": 25,
            "Reference": "2",
            "LevelID": 2,
            "Amps": 16,
            "Voltage": 400,
            "PowerKW": 11,
            "CurrentTypeID": 20,
            "Comments": "Mode 3"
        },
        {
            "ID": 221800,
            "ConnectionTypeID": 25,
            "Reference": "3",
            "LevelID": 2,
            "Amps": 16,
            "Voltage": 400,
            "PowerKW": 11,
            "CurrentTypeID": 20,
            "Comments": "Mode 3"
        },
        {
            "ID": 221801,
            "ConnectionTypeID": 25,
            "Reference": "4",
            "LevelID": 2,
            "Amps": 16,
            "Voltage": 400,
            "PowerKW": 11,
            "CurrentTypeID": 20,
            "Comments": "Mode 3"
        },
        {
            "ID": 221802,
            "ConnectionTypeID": 25,
            "Reference": "5",
            "LevelID": 2,
            "Amps": 16,
            "Voltage": 400,
            "PowerKW": 11,
            "CurrentTypeID": 20,
            "Comments": "Mode 3"
        },
        {
            "ID": 221803,
            "ConnectionTypeID": 25,
            "Reference": "6",
            "LevelID": 2,
            "Amps": 16,
            "Voltage": 400,
            "PowerKW": 11,
            "CurrentTypeID": 20,
            "Comments": "Mode 3"
        },
        {
            "ID": 221804,
            "ConnectionTypeID": 25,
            "Reference": "7",
            "LevelID": 2,
            "Amps": 16,
            "Voltage": 400,
            "PowerKW": 11,
            "CurrentTypeID": 20,
            "Comments": "Mode 3"
        },
        {
            "ID": 221805,
            "ConnectionTypeID": 25,
            "Reference": "8",
            "LevelID": 2,
            "Amps": 16,
            "Voltage": 400,
            "PowerKW": 11,
            "CurrentTypeID": 20,
            "Comments": "Mode 3"
        }
    ],
    "NumberOfPoints": 8,
    "StatusTypeID": 0,
    "DateLastStatusUpdate": "2021-03-24T05:11:00Z",
    "DataQualityLevel": 2,
    "DateCreated": "2020-05-26T08:22:00Z",
    "SubmissionStatusTypeID": 100
}