{
    "IsRecentlyVerified": false,
    "ID": 73643,
    "UUID": "24ED78FA-AC09-46A4-A9CF-24B6D525B207",
    "DataProviderID": 1,
    "OperatorID": 89,
    "OperatorsReference": "AAA-281",
    "UsageTypeID": 4,
    "UsageCost": "Free",
    "AddressInfo": {
        "ID": 73989,
        "Title": "Oak Bay Municipal Hall",
        "AddressLine1": "2167 Oak Bay Avenue",
        "Town": "Victoria",
        "StateOrProvince": "BC",
        "Postcode": "V8R 1G2",
        "CountryID": 44,
        "Latitude": 48.425923,
        "Longitude": -123.317224,
        "DistanceUnit": 0
    },
    "Connections": [
        {
            "ID": 105939,
            "ConnectionTypeID": 1,
            "StatusTypeID": 50,
            "LevelID": 2,
            "Amps": 32,
            "Voltage": 230,
            "PowerKW": 7,
            "CurrentTypeID": 10,
            "Quantity": 1
        }
    ],
    "NumberOfPoints": 1,
    "StatusTypeID": 50,
    "DateLastStatusUpdate": "2016-11-27T20:59:00Z",
    "DataQualityLevel": 1,
    "DateCreated": "2016-11-23T22:32:00Z",
    "SubmissionStatusTypeID": 200
}