{
    "IsRecentlyVerified": false,
    "ID": 112695,
    "UUID": "E3B2C04B-A028-4680-BFA7-B66DA4A5A43F",
    "DataProviderID": 1,
    "OperatorID": 3319,
    "UsageTypeID": 5,
    "UsageCost": "0.15€/min",
    "AddressInfo": {
        "ID": 113041,
        "Title": "e-mobi - BKSB",
        "AddressLine1": "Sergeja Eizenšteina iela 16",
        "Town": "Rīga",
        "Postcode": "LV-1079",
        "CountryID": 125,
        "Latitude": 56.96615245479115,
        "Longitude": 24.23272692173464,
        "ContactTelephone1": "+371 22001859",
        "RelatedURL": "https://portal.e-mobi.lv",
        "DistanceUnit": 0
    },
    "Connections": [
        {
            "ID": 158674,
            "ConnectionTypeID": 2,
            "StatusTypeID": 50,
            "LevelID": 3,
            "PowerKW": 50,
            "CurrentTypeID": 30,
            "Quantity": 1
        },
        {
            "ID": 158675,
            "ConnectionTypeID": 33,
            "StatusTypeID": 50,
            "LevelID": 3,
            "PowerKW": 50,
            "CurrentTypeID": 30,
            "Quantity": 1
        },
        {
            "ID": 158676,
            "ConnectionTypeID": 25,
            "StatusTypeID": 50,
            "LevelID": 3,
            "PowerKW": 43,
            "CurrentTypeID": 20
        }
    ],
    "NumberOfPoints": 2,
    "StatusTypeID": 50,
    "DateLastStatusUpdate": "2018-11-10T09:12:00Z",
    "DataQualityLevel": 1,
    "DateCreated": "2018-11-09T22:18:00Z",
    "SubmissionStatusTypeID": 200
}