{
    "IsRecentlyVerified": false,
    "ID": 98009,
    "UUID": "53FEC57F-CE36-4F2E-97E1-8A844328C39D",
    "DataProviderID": 1,
    "OperatorID": 23,
    "OperatorsReference": "39438",
    "UsageTypeID": 4,
    "AddressInfo": {
        "ID": 98355,
        "Title": "Hotel Restaurant Steiner",
        "AddressLine1": "Kennedy Strasse",
        "Town": "32",
        "StateOrProvince": "Leifers",
        "Postcode": "39055",
        "CountryID": 112,
        "Latitude": 46.429372,
        "Longitude": 11.343458,
        "ContactTelephone1": "+39 0471 954 225",
        "DistanceUnit": 0
    },
    "Connections": [
        {
            "ID": 138917,
            "ConnectionTypeID": 30,
            "StatusTypeID": 50,
            "LevelID": 2,
            "Amps": 32,
            "Voltage": 230,
            "PowerKW": 17,
            "CurrentTypeID": 20,
            "Quantity": 2
        }
    ],
    "NumberOfPoints": 2,
    "GeneralComments": "2 Tesla Connectors, up to 17kW.Available for customers. Please call ahead.",
    "StatusTypeID": 50,
    "DateLastStatusUpdate": "2018-10-03T23:39:00Z",
    "DataQualityLevel": 1,
    "DateCreated": "2018-01-21T17:33:00Z",
    "SubmissionStatusTypeID": 200
}