{
    "UserComments": [
        {
            "ID": 14015,
            "ChargePointID": 5294,
            "CommentTypeID": 10,
            "UserName": "David Richards",
            "Comment": "Charged OK on Level 1 of the car park.",
            "DateCreated": "2016-08-10T13:30:33.477Z",
            "User": {
                "ID": 6547,
                "Username": "David Richards"
            },
            "CheckinStatusTypeID": 10
        }
    ],
    "IsRecentlyVerified": false,
    "ID": 5294,
    "UUID": "382D0EFD-8926-4C11-A9F5-453E5D951299",
    "DataProviderID": 1,
    "OperatorID": 20,
    "OperatorsReference": "20007 Car Club Only,20008,41073..41076,41078..41088,41091,41092",
    "UsageTypeID": 4,
    "UsageCost": "Free. Parking fees do not apply whilst connected.",
    "AddressInfo": {
        "ID": 5233,
        "Title": "Eldon Garden Multi Storey Car Park",
        "AddressLine1": "Percy Street",
        "Town": "Newcastle upon Tyne",
        "StateOrProvince": "Tyne and Wear",
        "Postcode": "NE1 7RT",
        "CountryID": 1,
        "Latitude": 54.9767615,
        "Longitude": -1.6156849,
        "ContactTelephone1": "+44 191 277 8907",
        "AccessComments": "Car Park is open 07:00-22:00, Mon-Sat and 08:00-18:00, Sun.\r\n\r\nWhilst you can leave your car parked overnight, you cannot access the car whilst the car park is closed.",
        "RelatedURL": "http://www.newcastle.gov.uk/parking-roads-and-transport/travel-planning/electric-vehicle-charging-points",
        "DistanceUnit": 0
    },
    "Connections": [
        {
            "ID": 404,
            "ConnectionTypeID": 25,
            "StatusTypeID": 75,
            "LevelID": 2,
            "Amps": 32,
            "Voltage": 230,
            "PowerKW": 7,
            "CurrentTypeID": 10,
            "Quantity": 17
        },
        {
            "ID": 64521,
            "ConnectionTypeID": 3,
            "StatusTypeID": 100,
            "LevelID": 2,
            "Amps": 13,
            "Voltage": 230,
            "PowerKW": 3,
            "CurrentTypeID": 10,
            "Quantity": 2
        },
        {
            "ID": 101396,
            "ConnectionTypeID": 25,
            "StatusTypeID": 75,
            "LevelID": 2,
            "Amps": 32,
            "Voltage": 230,
            "PowerKW": 7,
            "CurrentTypeID": 10,
            "Quantity": 17
        }
    ],
    "NumberOfPoints": 22,
    "GeneralComments": "There are two charging points on Level 1 (one Mennekes type 2 and one BS1363) and two charging points on Level 3 (both Mennekes type 2). \r\n\r\nAdditional charging points on levels 5, 6. 7, 8, 9, 10, 11 & 12 (all Mennekes Type 2) are covered up and planned for future use as and when demand increases.",
    "StatusTypeID": 75,
    "DateLastStatusUpdate": "2018-04-25T05:16:00Z",
    "DataQualityLevel": 1,
    "DateCreated": "2011-08-24T15:40:00Z",
    "SubmissionStatusTypeID": 200
}