{
    "IsRecentlyVerified": false,
    "ID": 141440,
    "UUID": "6E1A954C-AF57-4E47-9D08-DAA8344CC1EF",
    "DataProviderID": 2,
    "DataProvidersReference": "122189",
    "UsageTypeID": 1,
    "AddressInfo": {
        "ID": 141792,
        "Title": "Smithsonian Libraries - Research Annex",
        "AddressLine1": "3400 Pennsy Dr",
        "Town": "Landover",
        "StateOrProvince": "MD",
        "Postcode": "20785",
        "CountryID": 2,
        "Latitude": 38.938404,
        "Longitude": -76.880421,
        "ContactTelephone1": "410-685-1109",
        "AccessComments": "24 hours daily",
        "RelatedURL": "",
        "DistanceUnit": 0
    },
    "Connections": [
        {
            "ID": 197370,
            "ConnectionTypeID": 1,
            "LevelID": 2,
            "Amps": 16,
            "Voltage": 230,
            "PowerKW": 3.7,
            "CurrentTypeID": 10,
            "Quantity": 8
        }
    ],
    "StatusTypeID": 50,
    "DateLastStatusUpdate": "2020-06-26T03:00:00Z",
    "DataQualityLevel": 3,
    "DateCreated": "2019-12-24T09:15:00Z",
    "SubmissionStatusTypeID": 100
}