{
    "IsRecentlyVerified": false,
    "ID": 57177,
    "UUID": "CB26E5AD-4D85-4D88-9C72-F7B2A3DD9C7E",
    "DataProviderID": 1,
    "OperatorID": 45,
    "UsageTypeID": 3,
    "AddressInfo": {
        "ID": 57523,
        "Title": "Kia Autohaus Büsgen",
        "AddressLine1": "Neuenkamper Straße 32",
        "AddressLine2": "Lüttringhausen",
        "Town": "Remscheid",
        "StateOrProvince": "Remscheid",
        "Postcode": "42855",
        "CountryID": 87,
        "Latitude": 51.176966,
        "Longitude": 7.21508870000002,
        "AccessComments": "Die Säule ist nutzbar: Mo-Fr 8:00-18:30Uhr, Sa: von 09:00 bis 14:00 Uhr\r\n",
        "DistanceUnit": 0
    },
    "Connections": [
        {
            "ID": 72247,
            "ConnectionTypeID": 2,
            "StatusTypeID": 50,
            "LevelID": 3,
            "PowerKW": 50,
            "CurrentTypeID": 30,
            "Quantity": 1
        },
        {
            "ID": 72248,
            "ConnectionTypeID": 33,
            "StatusTypeID": 50,
            "LevelID": 3,
            "PowerKW": 20,
            "CurrentTypeID": 30,
            "Quantity": 1
        }
    ],
    "NumberOfPoints": 2,
    "StatusTypeID": 50,
    "DateLastStatusUpdate": "2015-11-27T18:06:00Z",
    "DataQualityLevel": 1,
    "DateCreated": "2015-11-27T12:14:00Z",
    "SubmissionStatusTypeID": 200
}