{
    "IsRecentlyVerified": false,
    "ID": 52534,
    "UUID": "9961A546-3812-4E01-9230-C7DAF8C6B8F6",
    "DataProviderID": 1,
    "UsageTypeID": 6,
    "UsageCost": "free",
    "AddressInfo": {
        "ID": 52880,
        "Title": "Natura- & Trekking Hotel Rainer",
        "AddressLine1": "Val di mezzo 48",
        "AddressLine2": "Val Giovo",
        "Town": "Racines",
        "StateOrProvince": "Bolzano",
        "Postcode": "39040",
        "CountryID": 112,
        "Latitude": 46.854387191875716,
        "Longitude": 11.387098366845766,
        "ContactTelephone1": "+39 0472 765355",
        "ContactTelephone2": "+39 0472 767641",
        "ContactEmail": "info@hotel-rainer.it",
        "RelatedURL": "http://www.hotel-rainer.it/it/quicklink/novita-a-altro.html",
        "DistanceUnit": 0
    },
    "Connections": [
        {
            "ID": 65239,
            "ConnectionTypeID": 0,
            "StatusTypeID": 50,
            "LevelID": 2,
            "CurrentTypeID": 10
        }
    ],
    "NumberOfPoints": 1,
    "GeneralComments": "Nel nostro garage interrato una stazione di ricarica per auto elettriche o ibride plug-in è a disposizione di tutti gli ospiti del nostro albergo durante il loro soggiorno presso il nostro hotel.",
    "StatusTypeID": 50,
    "DateLastStatusUpdate": "2015-09-02T14:46:00Z",
    "DataQualityLevel": 1,
    "DateCreated": "2015-09-02T14:46:00Z",
    "SubmissionStatusTypeID": 200
}