{
    "IsRecentlyVerified": false,
    "ID": 171561,
    "UUID": "072D42BE-0ADD-4B91-800D-41F83DC19210",
    "DataProviderID": 1,
    "OperatorID": 23,
    "OperatorsReference": "56100",
    "UsageTypeID": 4,
    "UsageCost": "$0.26/kWh; other tariffs for older cars",
    "AddressInfo": {
        "ID": 171920,
        "Title": "Needles Supercharger",
        "AddressLine1": "2451 Needles Hwy",
        "Town": "Needles",
        "StateOrProvince": "CA",
        "Postcode": "92363",
        "CountryID": 2,
        "Latitude": 34.850835,
        "Longitude": -114.624329,
        "DistanceUnit": 0
    },
    "Connections": [
        {
            "ID": 262359,
            "ConnectionTypeID": 27,
            "StatusTypeID": 50,
            "LevelID": 3,
            "PowerKW": 120,
            "CurrentTypeID": 30,
            "Quantity": 4
        }
    ],
    "NumberOfPoints": 4,
    "GeneralComments": "4 superchargers, available 24/7, up to 150kW",
    "StatusTypeID": 50,
    "DateLastStatusUpdate": "2021-01-05T06:43:00Z",
    "DataQualityLevel": 1,
    "DateCreated": "2021-01-05T06:43:00Z",
    "SubmissionStatusTypeID": 200
}