{
    "IsRecentlyVerified": true,
    "DateLastVerified": "2021-09-19T09:25:00Z",
    "ID": 189281,
    "UUID": "1D70B0AC-6E0C-434F-8D69-8477E507F388",
    "DataProviderID": 1,
    "OperatorID": 1,
    "UsageTypeID": 4,
    "UsageCost": "€0.29/kWh",
    "AddressInfo": {
        "ID": 189640,
        "Title": "Kildare Primary Healthcare Campus",
        "AddressLine1": "Currah Road",
        "Town": "Kildare",
        "StateOrProvince": "",
        "Postcode": "R51 RX51",
        "CountryID": 3,
        "Latitude": 53.154111,
        "Longitude": -6.901866,
        "AccessComments": "08:30-18:00",
        "DistanceUnit": 0
    },
    "Connections": [
        {
            "ID": 306070,
            "ConnectionTypeID": 25,
            "StatusTypeID": 50,
            "LevelID": 2,
            "Amps": 32,
            "Voltage": 400,
            "PowerKW": 22,
            "CurrentTypeID": 20,
            "Quantity": 2
        }
    ],
    "NumberOfPoints": 2,
    "StatusTypeID": 50,
    "DateLastStatusUpdate": "2021-09-19T09:25:00Z",
    "DataQualityLevel": 1,
    "DateCreated": "2021-09-19T09:25:00Z",
    "SubmissionStatusTypeID": 200
}