{
    "IsRecentlyVerified": false,
    "ID": 23192,
    "UUID": "76AA0168-1EF2-47B4-84A8-C90A9FC848EB",
    "DataProviderID": 1,
    "OperatorID": 1,
    "UsageTypeID": 1,
    "UsageCost": "0",
    "AddressInfo": {
        "ID": 23537,
        "Title": "S-Market Nihtisilta",
        "AddressLine1": "Kutojantie 1",
        "AddressLine2": "Kilo",
        "Town": "Espoo",
        "StateOrProvince": "",
        "Postcode": "",
        "CountryID": 79,
        "Latitude": 60.2091362002382,
        "Longitude": 24.7535905539673,
        "ContactTelephone1": "",
        "ContactTelephone2": "",
        "ContactEmail": "",
        "AccessComments": "",
        "RelatedURL": "",
        "DistanceUnit": 0
    },
    "Connections": [
        {
            "ID": 24974,
            "ConnectionTypeID": 25,
            "StatusTypeID": 0,
            "LevelID": 2,
            "CurrentTypeID": 20,
            "Quantity": 1
        }
    ],
    "NumberOfPoints": 4,
    "GeneralComments": "Open when S-Market store is open.",
    "StatusTypeID": 50,
    "DateLastStatusUpdate": "2014-08-31T19:36:00Z",
    "DataQualityLevel": 1,
    "DateCreated": "2014-04-26T10:57:00Z",
    "SubmissionStatusTypeID": 200
}