{
    "UserComments": [
        {
            "ID": 14313,
            "ChargePointID": 71939,
            "CommentTypeID": 10,
            "UserName": "ozana",
            "Comment": "Po dohodě lze nabíjet i bez ubytování",
            "Rating": 5,
            "DateCreated": "2016-09-26T06:33:11.687Z",
            "User": {
                "ID": 6224,
                "Username": "ozana"
            },
            "CheckinStatusTypeID": 10
        }
    ],
    "MediaItems": [
        {
            "ID": 8330,
            "ChargePointID": 71939,
            "ItemURL": "https://s3-ap-southeast-2.amazonaws.com/openchargemap/images/CZ/OCM71939/OCM-71939.orig.2016092606312291.jpg",
            "ItemThumbnailURL": "https://s3-ap-southeast-2.amazonaws.com/openchargemap/images/CZ/OCM71939/OCM-71939.thmb.2016092606312291.jpg",
            "Comment": "Zásuvka u bočního vchodu",
            "IsEnabled": true,
            "IsVideo": false,
            "IsFeaturedItem": false,
            "IsExternalResource": false,
            "User": {
                "ID": 6224,
                "Username": "ozana"
            },
            "DateCreated": "2016-09-26T06:32:00Z"
        },
        {
            "ID": 8329,
            "ChargePointID": 71939,
            "ItemURL": "https://s3-ap-southeast-2.amazonaws.com/openchargemap/images/CZ/OCM71939/OCM-71939.orig.2016092606301104.jpg",
            "ItemThumbnailURL": "https://s3-ap-southeast-2.amazonaws.com/openchargemap/images/CZ/OCM71939/OCM-71939.thmb.2016092606301104.jpg",
            "Comment": "Zásuvky u vchodu do prodejny",
            "IsEnabled": true,
            "IsVideo": false,
            "IsFeaturedItem": false,
            "IsExternalResource": false,
            "User": {
                "ID": 6224,
                "Username": "ozana"
            },
            "DateCreated": "2016-09-26T06:30:00Z"
        }
    ],
    "IsRecentlyVerified": false,
    "ID": 71939,
    "UUID": "44B29227-7C5B-4DBF-9838-5B87CC0409C1",
    "DataProviderID": 1,
    "OperatorID": 45,
    "UsageTypeID": 6,
    "UsageCost": "5kč/kWh",
    "AddressInfo": {
        "ID": 72285,
        "Title": "Chalupa Družina",
        "AddressLine1": "Školní 140/30 ",
        "AddressLine2": "Janovice u Rýmařova",
        "Town": "Rýmařov",
        "StateOrProvince": "okres Bruntál",
        "Postcode": "79342",
        "CountryID": 64,
        "Latitude": 49.954283,
        "Longitude": 17.242518,
        "ContactTelephone1": "+420 773635919",
        "ContactEmail": "chalupadruzina@seznam.cz",
        "RelatedURL": "http://www.jeseniky.net/chalupa-druzina",
        "DistanceUnit": 0
    },
    "Connections": [
        {
            "ID": 103114,
            "ConnectionTypeID": 23,
            "StatusTypeID": 50,
            "LevelID": 2,
            "Amps": 16,
            "Voltage": 230,
            "PowerKW": 3.5,
            "CurrentTypeID": 10,
            "Quantity": 2
        },
        {
            "ID": 103115,
            "ConnectionTypeID": 17,
            "StatusTypeID": 50,
            "LevelID": 2,
            "Amps": 16,
            "Voltage": 400,
            "PowerKW": 11,
            "CurrentTypeID": 20,
            "Quantity": 1
        }
    ],
    "NumberOfPoints": 1,
    "GeneralComments": "Běžná zásuvka u vchodu, 3fázová ze strany (popř. hůře přístupná zezadu) objektu",
    "StatusTypeID": 50,
    "DateLastStatusUpdate": "2016-10-11T12:45:00Z",
    "DataQualityLevel": 1,
    "DateCreated": "2016-09-25T16:05:00Z",
    "SubmissionStatusTypeID": 200
}