{
    "IsRecentlyVerified": false,
    "ID": 97922,
    "UUID": "61F8176E-FE44-45FF-A38D-34A43F3F69E9",
    "DataProviderID": 1,
    "OperatorID": 23,
    "OperatorsReference": "39392",
    "UsageTypeID": 4,
    "AddressInfo": {
        "ID": 98268,
        "Title": "Hotel Kastel Seiser Alm",
        "AddressLine1": "Via Piani Grondl",
        "Town": "7",
        "StateOrProvince": "Castelrotto",
        "Postcode": "39040",
        "CountryID": 112,
        "Latitude": 46.568818,
        "Longitude": 11.562423,
        "ContactTelephone1": "+39 0471 706 121",
        "DistanceUnit": 0
    },
    "Connections": [
        {
            "ID": 138830,
            "ConnectionTypeID": 30,
            "StatusTypeID": 50,
            "LevelID": 2,
            "Amps": 32,
            "Voltage": 400,
            "PowerKW": 22,
            "CurrentTypeID": 20,
            "Quantity": 1
        }
    ],
    "NumberOfPoints": 1,
    "GeneralComments": "1 Tesla Connector, up to 22kW.Available for customers. Please call ahead.",
    "StatusTypeID": 50,
    "DateLastStatusUpdate": "2018-10-03T15:37:00Z",
    "DataQualityLevel": 1,
    "DateCreated": "2018-01-21T17:00:00Z",
    "SubmissionStatusTypeID": 200
}