{
    "IsRecentlyVerified": false,
    "ID": 94268,
    "UUID": "DF7E3C9C-D5FC-4749-B096-71540CD2F212",
    "DataProviderID": 2,
    "DataProvidersReference": "87609",
    "OperatorID": 5,
    "UsageTypeID": 1,
    "AddressInfo": {
        "ID": 94614,
        "Title": "DUKEPTS",
        "AddressLine1": "2300-2314 Erwin Rd",
        "Town": "Durham",
        "StateOrProvince": "NC",
        "Postcode": "27705",
        "CountryID": 2,
        "Latitude": 36.009416,
        "Longitude": -78.939453,
        "ContactTelephone1": "888-758-4389",
        "AccessComments": "24 hours daily",
        "RelatedURL": "http://www.chargepoint.com/",
        "DistanceUnit": 0
    },
    "Connections": [
        {
            "ID": 133367,
            "ConnectionTypeID": 1,
            "LevelID": 2,
            "Amps": 16,
            "Voltage": 230,
            "PowerKW": 3,
            "CurrentTypeID": 10,
            "Quantity": 4
        }
    ],
    "DateLastStatusUpdate": "2019-04-06T04:02:00Z",
    "DataQualityLevel": 3,
    "DateCreated": "2017-10-19T02:06:00Z",
    "SubmissionStatusTypeID": 100
}