{
    "UserComments": [
        {
            "ID": 22445,
            "ChargePointID": 133700,
            "CommentTypeID": 10,
            "UserName": "W-E",
            "Comment": "Parking space is a little short for long cars. ",
            "DateCreated": "2020-04-16T19:46:18.017Z",
            "User": {
                "ID": 25705,
                "Username": "W-E"
            },
            "CheckinStatusTypeID": 10,
            "IsActionedByEditor": false
        }
    ],
    "IsRecentlyVerified": false,
    "ID": 133700,
    "UUID": "A36F70E9-890C-4079-8964-A5688202C2D4",
    "DataProviderID": 1,
    "OperatorID": 105,
    "UsageTypeID": 1,
    "AddressInfo": {
        "ID": 134046,
        "Title": "Juistweg",
        "AddressLine1": "Juistweg 15",
        "Town": "Essen",
        "StateOrProvince": "NRW",
        "Postcode": "45149",
        "CountryID": 87,
        "Latitude": 51.4247519448403,
        "Longitude": 6.98166534689585,
        "DistanceUnit": 0
    },
    "Connections": [
        {
            "ID": 187118,
            "ConnectionTypeID": 25,
            "StatusTypeID": 50,
            "LevelID": 2,
            "Amps": 32,
            "Voltage": 400,
            "PowerKW": 22,
            "CurrentTypeID": 20,
            "Quantity": 2
        }
    ],
    "NumberOfPoints": 2,
    "StatusTypeID": 50,
    "DateLastStatusUpdate": "2020-04-16T19:46:00Z",
    "DataQualityLevel": 1,
    "DateCreated": "2019-10-24T06:11:00Z",
    "SubmissionStatusTypeID": 200
}