{
    "IsRecentlyVerified": false,
    "ID": 165238,
    "UUID": "ADEF2631-3733-4D2C-BD03-E2A38F5EA79C",
    "DataProviderID": 1,
    "DataProvidersReference": "TR-IST-087",
    "OperatorID": 70,
    "UsageTypeID": 1,
    "AddressInfo": {
        "ID": 165597,
        "Title": "Eşarj - Total, Tayakadın, İstanbul",
        "AddressLine1": "Tayakadın Mah. Kuzey Marmara Otoyolu, Arnavutköy",
        "Town": "İstanbul",
        "StateOrProvince": "İstanbul",
        "Postcode": "34277",
        "CountryID": 229,
        "Latitude": 41.245312,
        "Longitude": 28.701265,
        "ContactTelephone1": "+90 (850) 433 72 75",
        "ContactEmail": "destek@esarj.com",
        "RelatedURL": "https://esarj.com/en/map?s=TR-IST-087",
        "DistanceUnit": 0
    },
    "Connections": [
        {
            "ID": 236903,
            "ConnectionTypeID": 33,
            "LevelID": 2,
            "Amps": 120,
            "Voltage": 500,
            "PowerKW": 45,
            "Quantity": 1
        },
        {
            "ID": 236904,
            "ConnectionTypeID": 33,
            "LevelID": 2,
            "Amps": 32,
            "Voltage": 380,
            "PowerKW": 22,
            "Quantity": 1
        },
        {
            "ID": 236905,
            "ConnectionTypeID": 33,
            "LevelID": 2,
            "Amps": 125,
            "Voltage": 500,
            "PowerKW": 45,
            "Quantity": 1
        }
    ],
    "GeneralComments": "Eşarj Charging Systems",
    "StatusTypeID": 50,
    "DateLastStatusUpdate": "2020-08-26T08:19:00Z",
    "DataQualityLevel": 3,
    "DateCreated": "2020-08-26T08:19:00Z",
    "SubmissionStatusTypeID": 200
}