{
    "IsRecentlyVerified": false,
    "ID": 116388,
    "UUID": "07E0A179-F19D-4EF2-B6A1-C9327CD5A63F",
    "DataProviderID": 1,
    "DataProvidersReference": "5305",
    "AddressInfo": {
        "ID": 116734,
        "Title": "Sirkustomta",
        "AddressLine1": "Sirkustomta ",
        "Town": "SARPSBORG",
        "StateOrProvince": "Viken",
        "Postcode": "1723",
        "CountryID": 168,
        "Latitude": 59.28468,
        "Longitude": 11.09954,
        "AccessComments": "",
        "DistanceUnit": 0
    },
    "Connections": [
        {
            "ID": 164113,
            "ConnectionTypeID": 0,
            "Reference": "1",
            "LevelID": 2,
            "Amps": 32,
            "Voltage": 230,
            "PowerKW": 7.4,
            "Comments": "Mode 3"
        },
        {
            "ID": 164114,
            "ConnectionTypeID": 0,
            "Reference": "2",
            "LevelID": 2,
            "Amps": 32,
            "Voltage": 230,
            "PowerKW": 7.4,
            "Comments": "Mode 3"
        },
        {
            "ID": 164115,
            "ConnectionTypeID": 0,
            "Reference": "3",
            "LevelID": 2,
            "Amps": 32,
            "Voltage": 230,
            "PowerKW": 7.4,
            "Comments": "Mode 3"
        },
        {
            "ID": 164116,
            "ConnectionTypeID": 0,
            "Reference": "4",
            "LevelID": 2,
            "Amps": 32,
            "Voltage": 230,
            "PowerKW": 7.4,
            "Comments": "Mode 3"
        },
        {
            "ID": 164117,
            "ConnectionTypeID": 0,
            "Reference": "5",
            "LevelID": 2,
            "Amps": 32,
            "Voltage": 230,
            "PowerKW": 7.4,
            "Comments": "Mode 3"
        },
        {
            "ID": 164118,
            "ConnectionTypeID": 0,
            "Reference": "6",
            "LevelID": 2,
            "Amps": 32,
            "Voltage": 230,
            "PowerKW": 7.4,
            "Comments": "Mode 3"
        },
        {
            "ID": 164119,
            "ConnectionTypeID": 0,
            "Reference": "7",
            "LevelID": 2,
            "Amps": 32,
            "Voltage": 230,
            "PowerKW": 7.4,
            "Comments": "Mode 3"
        },
        {
            "ID": 164120,
            "ConnectionTypeID": 0,
            "Reference": "8",
            "LevelID": 2,
            "Amps": 32,
            "Voltage": 230,
            "PowerKW": 7.4,
            "Comments": "Mode 3"
        },
        {
            "ID": 164121,
            "ConnectionTypeID": 0,
            "Reference": "9",
            "LevelID": 2,
            "Amps": 32,
            "Voltage": 230,
            "PowerKW": 7.4,
            "Comments": "Mode 3"
        },
        {
            "ID": 164122,
            "ConnectionTypeID": 0,
            "Reference": "10",
            "LevelID": 2,
            "Amps": 32,
            "Voltage": 230,
            "PowerKW": 7.4,
            "Comments": "Mode 3"
        },
        {
            "ID": 164123,
            "ConnectionTypeID": 0,
            "Reference": "11",
            "LevelID": 2,
            "Amps": 32,
            "Voltage": 230,
            "PowerKW": 7.4,
            "Comments": "Mode 3"
        },
        {
            "ID": 164124,
            "ConnectionTypeID": 0,
            "Reference": "12",
            "LevelID": 2,
            "Amps": 32,
            "Voltage": 230,
            "PowerKW": 7.4,
            "Comments": "Mode 3"
        },
        {
            "ID": 164125,
            "ConnectionTypeID": 0,
            "Reference": "13",
            "LevelID": 2,
            "Amps": 32,
            "Voltage": 230,
            "PowerKW": 7.4,
            "Comments": "Mode 3"
        },
        {
            "ID": 164126,
            "ConnectionTypeID": 0,
            "Reference": "14",
            "LevelID": 2,
            "Amps": 32,
            "Voltage": 230,
            "PowerKW": 7.4,
            "Comments": "Mode 3"
        }
    ],
    "NumberOfPoints": 14,
    "DateLastStatusUpdate": "2020-05-26T08:22:00Z",
    "DataQualityLevel": 2,
    "DateCreated": "2019-02-11T09:16:00Z",
    "SubmissionStatusTypeID": 100
}