{
    "IsRecentlyVerified": false,
    "ID": 84278,
    "UUID": "3A5D8E16-EF26-478F-9AE1-6F93706E558F",
    "DataProviderID": 1,
    "OperatorID": 23,
    "OperatorsReference": "24735",
    "UsageTypeID": 6,
    "AddressInfo": {
        "ID": 84624,
        "Title": "Hotel Schweizerhof",
        "AddressLine1": "11 Plaz d'Ora",
        "Town": "Santa Maria",
        "Postcode": "7536",
        "CountryID": 217,
        "Latitude": 46.603446,
        "Longitude": 10.426609,
        "ContactTelephone1": "+41 8185 16030",
        "DistanceUnit": 0
    },
    "Connections": [
        {
            "ID": 119679,
            "ConnectionTypeID": 30,
            "StatusTypeID": 50,
            "LevelID": 2,
            "Amps": 16,
            "Voltage": 230,
            "PowerKW": 4,
            "CurrentTypeID": 10,
            "Quantity": 2
        }
    ],
    "NumberOfPoints": 2,
    "GeneralComments": "2 Tesla Connectors, up to 4kW.Available for patrons only. Please see front desk.",
    "StatusTypeID": 50,
    "DateLastStatusUpdate": "2018-10-03T19:17:00Z",
    "DataQualityLevel": 1,
    "DateCreated": "2017-02-16T17:31:00Z",
    "SubmissionStatusTypeID": 200
}