{
    "IsRecentlyVerified": false,
    "ID": 92726,
    "UUID": "2DB456A9-38CE-42B9-9F23-775A5A072C96",
    "DataProviderID": 1,
    "OperatorID": 3330,
    "UsageTypeID": 6,
    "AddressInfo": {
        "ID": 93072,
        "Title": " Palace Hotel Desenzano",
        "AddressLine1": "Viale F. Agello, 114A",
        "Town": "Desenzano del Garda ",
        "StateOrProvince": "BS",
        "Postcode": "25010",
        "CountryID": 112,
        "Latitude": 45.460629979788,
        "Longitude": 10.5863140215611,
        "ContactTelephone1": "+39.030.9902262",
        "ContactEmail": "info@palacehoteldesenzano.it",
        "RelatedURL": "http://www.palacehoteldesenzano.it/",
        "DistanceUnit": 0
    },
    "Connections": [
        {
            "ID": 131337,
            "ConnectionTypeID": 25,
            "StatusTypeID": 50,
            "LevelID": 2,
            "Amps": 32,
            "Voltage": 400,
            "PowerKW": 22,
            "CurrentTypeID": 20,
            "Quantity": 2
        }
    ],
    "NumberOfPoints": 2,
    "GeneralComments": "https://energiachetiserve.repower.com/ricarica101/",
    "StatusTypeID": 50,
    "DateLastStatusUpdate": "2019-01-13T18:56:00Z",
    "DataQualityLevel": 1,
    "DateCreated": "2017-09-08T08:46:00Z",
    "SubmissionStatusTypeID": 200
}