{
    "IsRecentlyVerified": false,
    "ID": 31950,
    "UUID": "EC3B8E29-ACD7-4145-BF15-39BF1AE231DB",
    "DataProviderID": 1,
    "OperatorID": 105,
    "OperatorsReference": "Essent EM-DE-08236004-01-00002",
    "UsageTypeID": 4,
    "AddressInfo": {
        "ID": 32296,
        "Title": "Alte Pforzheimerstr. 4",
        "AddressLine1": "Alte Pforzheimerstr. 4",
        "Town": "Birkenfeld",
        "Postcode": "75217",
        "CountryID": 87,
        "Latitude": 48.871179,
        "Longitude": 8.627425,
        "DistanceUnit": 0
    },
    "Connections": [
        {
            "ID": 35461,
            "ConnectionTypeID": 25,
            "LevelID": 2,
            "PowerKW": 11
        },
        {
            "ID": 46114,
            "ConnectionTypeID": 25,
            "LevelID": 2,
            "PowerKW": 11
        }
    ],
    "NumberOfPoints": 1,
    "StatusTypeID": 50,
    "DateLastStatusUpdate": "2015-04-13T16:07:00Z",
    "DataQualityLevel": 3,
    "DateCreated": "2015-01-09T06:03:00Z",
    "SubmissionStatusTypeID": 200
}