{
    "IsRecentlyVerified": false,
    "ID": 182379,
    "UUID": "97E5794F-F249-4945-B7CA-FF777A7AA5C6",
    "DataProviderID": 29,
    "DataProvidersReference": "14015",
    "OperatorID": 105,
    "AddressInfo": {
        "ID": 182738,
        "Title": "Kleppingstraße 21",
        "AddressLine1": "Kleppingstraße 21",
        "Town": "Dortmund",
        "Postcode": "44135",
        "CountryID": 87,
        "Latitude": 51.512761,
        "Longitude": 7.468058,
        "DistanceUnit": 0
    },
    "Connections": [
        {
            "ID": 288036,
            "ConnectionTypeID": 25,
            "StatusTypeID": 50,
            "LevelID": 2,
            "PowerKW": 22,
            "CurrentTypeID": 20
        },
        {
            "ID": 288037,
            "ConnectionTypeID": 25,
            "StatusTypeID": 50,
            "LevelID": 2,
            "PowerKW": 22,
            "CurrentTypeID": 20
        }
    ],
    "StatusTypeID": 50,
    "DateLastStatusUpdate": "2021-07-12T02:47:00Z",
    "MetadataValues": [
        {
            "ID": 14673,
            "MetadataFieldID": 4,
            "ItemValue": "Data from the German chargepoint registry provided by Bundesnetzagentur.de under the CC-BY 4.0 license"
        }
    ],
    "DataQualityLevel": 3,
    "DateCreated": "2021-07-08T10:02:00Z",
    "SubmissionStatusTypeID": 100
}