{
    "IsRecentlyVerified": false,
    "ID": 169593,
    "UUID": "36CC9DE8-58B7-49B4-92E2-894399D211CB",
    "DataProviderID": 1,
    "OperatorID": 136,
    "UsageTypeID": 4,
    "UsageCost": "0,15/kWh",
    "AddressInfo": {
        "ID": 169952,
        "Title": "Helsingin aikuisopisto",
        "AddressLine1": "Runeberginkatu 20-24",
        "Town": "Helsinki",
        "StateOrProvince": "Uusimaa",
        "CountryID": 79,
        "Latitude": 60.17323088185353,
        "Longitude": 24.922537362054754,
        "RelatedURL": "http://www.virta.fi",
        "DistanceUnit": 0
    },
    "Connections": [
        {
            "ID": 258175,
            "ConnectionTypeID": 25,
            "StatusTypeID": 50,
            "LevelID": 2,
            "Amps": 32,
            "Voltage": 400,
            "PowerKW": 22,
            "CurrentTypeID": 20,
            "Quantity": 4
        }
    ],
    "NumberOfPoints": 4,
    "StatusTypeID": 50,
    "DateLastStatusUpdate": "2020-10-28T04:53:00Z",
    "DataQualityLevel": 1,
    "DateCreated": "2020-10-25T04:44:00Z",
    "SubmissionStatusTypeID": 200
}