{
    "IsRecentlyVerified": false,
    "ID": 112995,
    "UUID": "E9380BA7-5BB5-45D9-825B-4C6F5C89CE45",
    "DataProviderID": 2,
    "DataProvidersReference": "104373",
    "OperatorID": 5,
    "UsageTypeID": 1,
    "AddressInfo": {
        "ID": 113341,
        "Title": "DC SOLAR",
        "AddressLine1": "2301 W Cheryl Dr",
        "Town": "Phoenix",
        "StateOrProvince": "AZ",
        "Postcode": "85021",
        "CountryID": 2,
        "Latitude": 33.5776427,
        "Longitude": -112.1112182,
        "ContactTelephone1": "888-758-4389",
        "AccessComments": "24 hours daily",
        "RelatedURL": "http://www.chargepoint.com/",
        "DistanceUnit": 0
    },
    "Connections": [
        {
            "ID": 159147,
            "ConnectionTypeID": 1,
            "LevelID": 2,
            "Amps": 16,
            "Voltage": 230,
            "PowerKW": 3,
            "CurrentTypeID": 10,
            "Quantity": 2
        }
    ],
    "DateLastStatusUpdate": "2019-04-06T04:01:00Z",
    "DataQualityLevel": 3,
    "DateCreated": "2018-11-28T02:04:00Z",
    "SubmissionStatusTypeID": 100
}