{
    "UserComments": [
        {
            "ID": 21061,
            "ChargePointID": 117716,
            "CommentTypeID": 10,
            "UserName": "Mauro",
            "Comment": "ricarica gratuita per i clienti della latteria. chiedere la card alla cassa. orari 7.30 - 19.30",
            "Rating": 4,
            "DateCreated": "2019-05-31T22:35:02.18Z",
            "User": {
                "ID": 21064,
                "Username": "Mauro"
            }
        },
        {
            "ID": 20751,
            "ChargePointID": 117716,
            "CommentTypeID": 10,
            "UserName": "polianto",
            "Comment": "https://www.forumelettrico.it/forum/colonnina-ac-7kw-latteria-sociale-di-chiuro-so-via-stelvio-18-t4912.html",
            "Rating": 3,
            "RelatedURL": "https://www.forumelettrico.it/forum/colonnina-ac-7kw-latteria-sociale-di-chiuro-so-via-stelvio-18-t4912.html",
            "DateCreated": "2019-02-24T18:48:46.673Z",
            "User": {
                "ID": 1606,
                "Username": "polianto"
            },
            "CheckinStatusTypeID": 140
        }
    ],
    "MediaItems": [
        {
            "ID": 18551,
            "ChargePointID": 117716,
            "ItemURL": "https://s3-ap-southeast-2.amazonaws.com/openchargemap/images/IT/OCM117716/OCM-117716.orig.2019053122305990.png",
            "ItemThumbnailURL": "https://s3-ap-southeast-2.amazonaws.com/openchargemap/images/IT/OCM117716/OCM-117716.thmb.2019053122305990.png",
            "Comment": "",
            "IsEnabled": true,
            "IsVideo": false,
            "IsFeaturedItem": false,
            "IsExternalResource": false,
            "User": {
                "ID": 21064,
                "Username": "Mauro"
            },
            "DateCreated": "2019-05-31T22:31:00Z"
        },
        {
            "ID": 17663,
            "ChargePointID": 117716,
            "ItemURL": "https://s3-ap-southeast-2.amazonaws.com/openchargemap/images/IT/OCM117716/OCM-117716.orig.2019022418403904.jpg",
            "ItemThumbnailURL": "https://s3-ap-southeast-2.amazonaws.com/openchargemap/images/IT/OCM117716/OCM-117716.thmb.2019022418403904.jpg",
            "Comment": "",
            "IsEnabled": true,
            "IsVideo": false,
            "IsFeaturedItem": false,
            "IsExternalResource": false,
            "User": {
                "ID": 1606,
                "Username": "polianto"
            },
            "DateCreated": "2019-02-24T18:41:00Z"
        },
        {
            "ID": 17664,
            "ChargePointID": 117716,
            "ItemURL": "https://s3-ap-southeast-2.amazonaws.com/openchargemap/images/IT/OCM117716/OCM-117716.orig.2019022418405724.jpg",
            "ItemThumbnailURL": "https://s3-ap-southeast-2.amazonaws.com/openchargemap/images/IT/OCM117716/OCM-117716.thmb.2019022418405724.jpg",
            "Comment": "",
            "IsEnabled": true,
            "IsVideo": false,
            "IsFeaturedItem": false,
            "IsExternalResource": false,
            "User": {
                "ID": 1606,
                "Username": "polianto"
            },
            "DateCreated": "2019-02-24T18:41:00Z"
        },
        {
            "ID": 17665,
            "ChargePointID": 117716,
            "ItemURL": "https://s3-ap-southeast-2.amazonaws.com/openchargemap/images/IT/OCM117716/OCM-117716.orig.2019022418411223.jpg",
            "ItemThumbnailURL": "https://s3-ap-southeast-2.amazonaws.com/openchargemap/images/IT/OCM117716/OCM-117716.thmb.2019022418411223.jpg",
            "Comment": "",
            "IsEnabled": true,
            "IsVideo": false,
            "IsFeaturedItem": false,
            "IsExternalResource": false,
            "User": {
                "ID": 1606,
                "Username": "polianto"
            },
            "DateCreated": "2019-02-24T18:41:00Z"
        }
    ],
    "IsRecentlyVerified": false,
    "ID": 117716,
    "UUID": "E9ECFAEB-FD0B-45DE-9A3E-85C6A86D5205",
    "DataProviderID": 1,
    "OperatorID": 3330,
    "UsageTypeID": 6,
    "AddressInfo": {
        "ID": 118062,
        "Title": "Latteria Sociale Di Chiuro",
        "AddressLine1": "SS38",
        "Town": "Chiuro",
        "StateOrProvince": "SO",
        "Postcode": "23030 ",
        "CountryID": 112,
        "Latitude": 46.16519972593622,
        "Longitude": 9.989286862478934,
        "RelatedURL": "https://www.latteriachiuro.it/",
        "DistanceUnit": 0
    },
    "Connections": [
        {
            "ID": 166541,
            "ConnectionTypeID": 25,
            "StatusTypeID": 50,
            "LevelID": 2,
            "Amps": 32,
            "Voltage": 240,
            "PowerKW": 7,
            "CurrentTypeID": 10,
            "Quantity": 2
        }
    ],
    "NumberOfPoints": 2,
    "StatusTypeID": 50,
    "DateLastStatusUpdate": "2019-05-31T22:35:00Z",
    "DataQualityLevel": 1,
    "DateCreated": "2019-02-24T18:20:00Z",
    "SubmissionStatusTypeID": 200
}