{
    "IsRecentlyVerified": false,
    "ID": 9001,
    "UUID": "C6072240-9A1C-4AE8-A0B7-B74126D77A43",
    "DataProviderID": 15,
    "DataProvidersReference": "12364",
    "OperatorID": 94,
    "UsageTypeID": 1,
    "AddressInfo": {
        "ID": 8898,
        "Title": "2405 Wade Ave",
        "AddressLine1": "2405 Wade Ave",
        "Town": "Raleigh",
        "StateOrProvince": "NC",
        "Postcode": "27607",
        "CountryID": 2,
        "Latitude": 35.800433,
        "Longitude": -78.662882,
        "ContactTelephone1": "919-831-6833",
        "RelatedURL": "http://carstations.com/12364",
        "DistanceUnit": 0
    },
    "Connections": [
        {
            "ID": 6572,
            "ConnectionTypeID": 1,
            "Reference": "J1772",
            "LevelID": 2
        }
    ],
    "NumberOfPoints": 2,
    "StatusTypeID": 0,
    "DateLastStatusUpdate": "2017-11-04T14:04:00Z",
    "DataQualityLevel": 1,
    "DateCreated": "2011-12-10T20:50:00Z",
    "SubmissionStatusTypeID": 100
}