{
    "IsRecentlyVerified": false,
    "ID": 70459,
    "UUID": "021AA5DF-C51D-4874-9850-1D99C13DAF3B",
    "DataProviderID": 1,
    "OperatorID": 45,
    "UsageTypeID": 1,
    "AddressInfo": {
        "ID": 70805,
        "Title": "Restaurent Zum hungrigen Wolf",
        "AddressLine1": "Am Stadtpark 1",
        "Town": "Neukirchen",
        "StateOrProvince": "Schwalm-Eder-Kreis",
        "Postcode": "34626",
        "CountryID": 87,
        "Latitude": 50.86694134496643,
        "Longitude": 9.338755278434737,
        "ContactTelephone1": "+49 6691 207407",
        "AccessComments": "Zwei 24/7 nutzbare Schukodosen, vermutlich in einem Stahlblechkasten.",
        "RelatedURL": "http://www.rotkaeppchenland.nordhessen.de/de/9c9773e6-da31-ed13-4d29-c49a97c65c40.html",
        "DistanceUnit": 0
    },
    "Connections": [
        {
            "ID": 100753,
            "ConnectionTypeID": 28,
            "StatusTypeID": 50,
            "LevelID": 2,
            "Amps": 16,
            "Voltage": 230,
            "PowerKW": 3.7,
            "CurrentTypeID": 10,
            "Quantity": 2
        }
    ],
    "NumberOfPoints": 2,
    "StatusTypeID": 50,
    "DateLastStatusUpdate": "2016-07-18T05:57:00Z",
    "DataQualityLevel": 1,
    "DateCreated": "2016-07-18T05:57:00Z",
    "SubmissionStatusTypeID": 200
}