{
    "IsRecentlyVerified": false,
    "ID": 36475,
    "UUID": "713A3DB6-51D0-4B86-BDB1-F76F8E25CDD3",
    "DataProviderID": 26,
    "DataProvidersReference": "48094",
    "OperatorID": 178,
    "OperatorsReference": "EVnetNL DB0336",
    "UsageCost": "0.00 jaarabonnement",
    "AddressInfo": {
        "ID": 36821,
        "Title": "Houtlaan",
        "AddressLine1": "Houtlaan",
        "Town": "Leiden",
        "Postcode": "2334 CK",
        "CountryID": 159,
        "Latitude": 52.174434,
        "Longitude": 4.481335,
        "ContactTelephone1": "0800-3522365",
        "RelatedURL": "http://www.evnet.nl",
        "DistanceUnit": 0
    },
    "Connections": [
        {
            "ID": 39986,
            "ConnectionTypeID": 25,
            "LevelID": 2,
            "PowerKW": 11,
            "CurrentTypeID": 10
        }
    ],
    "NumberOfPoints": 2,
    "StatusTypeID": 50,
    "DateLastStatusUpdate": "2016-06-04T02:51:00Z",
    "DataQualityLevel": 3,
    "DateCreated": "2015-01-09T06:05:00Z",
    "SubmissionStatusTypeID": 100
}