{
    "IsRecentlyVerified": false,
    "ID": 186431,
    "UUID": "B9954297-81E2-42EB-8D1A-8C5387133613",
    "DataProviderID": 29,
    "DataProvidersReference": "15489",
    "AddressInfo": {
        "ID": 186790,
        "Title": "Steinstraße 1",
        "AddressLine1": "Steinstraße 1",
        "Town": "Dingelstädt",
        "Postcode": "37351",
        "CountryID": 87,
        "Latitude": 51.317049,
        "Longitude": 10.319608,
        "DistanceUnit": 0
    },
    "Connections": [
        {
            "ID": 299118,
            "ConnectionTypeID": 25,
            "StatusTypeID": 50,
            "LevelID": 2,
            "PowerKW": 22,
            "CurrentTypeID": 20
        },
        {
            "ID": 299119,
            "ConnectionTypeID": 25,
            "StatusTypeID": 50,
            "LevelID": 2,
            "PowerKW": 22,
            "CurrentTypeID": 20
        }
    ],
    "StatusTypeID": 50,
    "DateLastStatusUpdate": "2021-07-12T02:47:00Z",
    "MetadataValues": [
        {
            "ID": 18672,
            "MetadataFieldID": 4,
            "ItemValue": "Data from the German chargepoint registry provided by Bundesnetzagentur.de under the CC-BY 4.0 license"
        }
    ],
    "DataQualityLevel": 3,
    "DateCreated": "2021-07-12T02:47:00Z",
    "SubmissionStatusTypeID": 100
}