{
    "IsRecentlyVerified": false,
    "ID": 134102,
    "UUID": "033C5CF9-8970-4CE9-A91F-059DBF225E68",
    "DataProviderID": 1,
    "OperatorID": 3315,
    "OperatorsReference": "51568,51569",
    "UsageTypeID": 4,
    "UsageCost": "Free",
    "AddressInfo": {
        "ID": 134448,
        "Title": "The Lochs Shopping Centre",
        "AddressLine1": "The Lochs Shopping Centre Car Park",
        "Town": "Westerhouse Road",
        "StateOrProvince": "Glasgow",
        "Postcode": "G34 9PE",
        "CountryID": 1,
        "Latitude": 55.86902,
        "Longitude": -4.12029,
        "DistanceUnit": 0
    },
    "Connections": [
        {
            "ID": 187647,
            "ConnectionTypeID": 33,
            "StatusTypeID": 100,
            "LevelID": 3,
            "PowerKW": 50,
            "CurrentTypeID": 30,
            "Quantity": 1
        },
        {
            "ID": 187648,
            "ConnectionTypeID": 2,
            "StatusTypeID": 100,
            "LevelID": 3,
            "PowerKW": 50,
            "CurrentTypeID": 30,
            "Quantity": 1
        },
        {
            "ID": 187649,
            "ConnectionTypeID": 1036,
            "StatusTypeID": 100,
            "LevelID": 3,
            "PowerKW": 43,
            "CurrentTypeID": 20,
            "Quantity": 1
        },
        {
            "ID": 187740,
            "ConnectionTypeID": 25,
            "StatusTypeID": 50,
            "LevelID": 2,
            "Amps": 32,
            "Voltage": 400,
            "PowerKW": 22,
            "CurrentTypeID": 20,
            "Quantity": 2
        }
    ],
    "NumberOfPoints": 2,
    "StatusTypeID": 75,
    "DateLastStatusUpdate": "2020-06-02T05:14:00Z",
    "DataQualityLevel": 1,
    "DateCreated": "2019-11-03T06:20:00Z",
    "SubmissionStatusTypeID": 200
}