{
    "IsRecentlyVerified": false,
    "ID": 179685,
    "UUID": "C2BCBE1E-C9F3-4241-9B62-738F1E5345D9",
    "DataProviderID": 29,
    "DataProvidersReference": "12598",
    "OperatorID": 105,
    "AddressInfo": {
        "ID": 180044,
        "Title": "Rathausstraße 1",
        "AddressLine1": "Rathausstraße 1",
        "Town": "Wilnsdorf",
        "Postcode": "57234",
        "CountryID": 87,
        "Latitude": 50.818715,
        "Longitude": 8.108642,
        "DistanceUnit": 0
    },
    "Connections": [
        {
            "ID": 281813,
            "ConnectionTypeID": 25,
            "StatusTypeID": 50,
            "LevelID": 2,
            "PowerKW": 22,
            "CurrentTypeID": 20
        },
        {
            "ID": 281814,
            "ConnectionTypeID": 25,
            "StatusTypeID": 50,
            "LevelID": 2,
            "PowerKW": 22,
            "CurrentTypeID": 20
        }
    ],
    "StatusTypeID": 50,
    "DateLastStatusUpdate": "2021-07-12T02:45:00Z",
    "MetadataValues": [
        {
            "ID": 11979,
            "MetadataFieldID": 4,
            "ItemValue": "Data from the German chargepoint registry provided by Bundesnetzagentur.de under the CC-BY 4.0 license"
        }
    ],
    "DataQualityLevel": 3,
    "DateCreated": "2021-07-08T09:59:00Z",
    "SubmissionStatusTypeID": 100
}