{
    "IsRecentlyVerified": false,
    "ID": 9545,
    "UUID": "FF2E8341-1CC9-4C75-8DAA-5AF7EC8C966E",
    "DataProviderID": 15,
    "DataProvidersReference": "14562",
    "OperatorID": 5,
    "AddressInfo": {
        "ID": 9442,
        "Title": "4120 86TH AVE. SE",
        "AddressLine1": "4120 86TH AVE. SE",
        "Town": "Mercer Island",
        "StateOrProvince": "Washington",
        "Postcode": "96164",
        "CountryID": 2,
        "Latitude": 47.57238007,
        "Longitude": -122.2232132,
        "ContactTelephone1": "",
        "RelatedURL": "http://carstations.com/14562",
        "DistanceUnit": 0
    },
    "Connections": [
        {
            "ID": 7207,
            "ConnectionTypeID": 1,
            "Reference": "J1772",
            "LevelID": 2
        },
        {
            "ID": 9080,
            "ConnectionTypeID": 9,
            "Reference": "NEMA5",
            "LevelID": 1,
            "Quantity": 1
        }
    ],
    "StatusTypeID": 0,
    "DateLastStatusUpdate": "2017-11-04T14:05:00Z",
    "DataQualityLevel": 2,
    "DateCreated": "2012-02-20T15:48:00Z",
    "SubmissionStatusTypeID": 100
}