{
    "IsRecentlyVerified": false,
    "ID": 127587,
    "UUID": "202BCA10-9446-498D-AF3A-E7B825E3A2C3",
    "DataProviderID": 1,
    "OperatorID": 23,
    "OperatorsReference": "50502",
    "UsageTypeID": 4,
    "AddressInfo": {
        "ID": 127933,
        "Title": "Uhn - Toronto General Hospital - Elizabeth St Garage",
        "AddressLine1": "201 Elizabeth St",
        "Town": "Toronto",
        "StateOrProvince": "Ontario",
        "Postcode": "M5G 2C4",
        "CountryID": 44,
        "Latitude": 43.659903,
        "Longitude": -79.386996,
        "ContactTelephone1": "(416) 595-7136",
        "DistanceUnit": 0
    },
    "Connections": [
        {
            "ID": 178592,
            "ConnectionTypeID": 30,
            "StatusTypeID": 50,
            "LevelID": 2,
            "PowerKW": 16,
            "CurrentTypeID": 20,
            "Quantity": 16
        }
    ],
    "NumberOfPoints": 16,
    "GeneralComments": "16 Tesla Connectors, up to 16kW.Parking fees will apply. Self park.",
    "StatusTypeID": 50,
    "DateLastStatusUpdate": "2019-06-05T11:56:00Z",
    "DataQualityLevel": 1,
    "DateCreated": "2019-06-05T11:56:00Z",
    "SubmissionStatusTypeID": 200
}