{
    "MediaItems": [
        {
            "ID": 28448,
            "ChargePointID": 175941,
            "ItemURL": "https://s3-ap-southeast-2.amazonaws.com/openchargemap/images/DE/OCM175941/OCM-175941.orig.2021070318173596.jpg",
            "ItemThumbnailURL": "https://s3-ap-southeast-2.amazonaws.com/openchargemap/images/DE/OCM175941/OCM-175941.thmb.2021070318173596.jpg",
            "Comment": "",
            "IsEnabled": true,
            "IsVideo": false,
            "IsFeaturedItem": false,
            "IsExternalResource": false,
            "User": {
                "ID": 32810,
                "Username": "Tom_Fred"
            },
            "DateCreated": "2021-07-03T18:18:00Z"
        },
        {
            "ID": 28449,
            "ChargePointID": 175941,
            "ItemURL": "https://s3-ap-southeast-2.amazonaws.com/openchargemap/images/DE/OCM175941/OCM-175941.orig.2021070318175326.jpg",
            "ItemThumbnailURL": "https://s3-ap-southeast-2.amazonaws.com/openchargemap/images/DE/OCM175941/OCM-175941.thmb.2021070318175326.jpg",
            "Comment": "",
            "IsEnabled": true,
            "IsVideo": false,
            "IsFeaturedItem": false,
            "IsExternalResource": false,
            "User": {
                "ID": 32810,
                "Username": "Tom_Fred"
            },
            "DateCreated": "2021-07-03T18:18:00Z"
        },
        {
            "ID": 28450,
            "ChargePointID": 175941,
            "ItemURL": "https://s3-ap-southeast-2.amazonaws.com/openchargemap/images/DE/OCM175941/OCM-175941.orig.2021070318180898.jpg",
            "ItemThumbnailURL": "https://s3-ap-southeast-2.amazonaws.com/openchargemap/images/DE/OCM175941/OCM-175941.thmb.2021070318180898.jpg",
            "Comment": "",
            "IsEnabled": true,
            "IsVideo": false,
            "IsFeaturedItem": false,
            "IsExternalResource": false,
            "User": {
                "ID": 32810,
                "Username": "Tom_Fred"
            },
            "DateCreated": "2021-07-03T18:18:00Z"
        },
        {
            "ID": 28447,
            "ChargePointID": 175941,
            "ItemURL": "https://s3-ap-southeast-2.amazonaws.com/openchargemap/images/DE/OCM175941/OCM-175941.orig.2021070318171918.jpg",
            "ItemThumbnailURL": "https://s3-ap-southeast-2.amazonaws.com/openchargemap/images/DE/OCM175941/OCM-175941.thmb.2021070318171918.jpg",
            "Comment": "",
            "IsEnabled": true,
            "IsVideo": false,
            "IsFeaturedItem": false,
            "IsExternalResource": false,
            "User": {
                "ID": 32810,
                "Username": "Tom_Fred"
            },
            "DateCreated": "2021-07-03T18:17:00Z"
        }
    ],
    "IsRecentlyVerified": false,
    "ID": 175941,
    "UUID": "BF29A611-FF57-4D98-990E-604343FB0367",
    "DataProviderID": 1,
    "OperatorID": 3248,
    "UsageTypeID": 4,
    "AddressInfo": {
        "ID": 176300,
        "Title": "Tank und Rast AVUS",
        "AddressLine1": "AVUS",
        "Town": "Berlin",
        "StateOrProvince": "Berlin",
        "Postcode": "14055",
        "CountryID": 87,
        "Latitude": 52.501920296079476,
        "Longitude": 13.277291148244103,
        "DistanceUnit": 0
    },
    "Connections": [
        {
            "ID": 273247,
            "ConnectionTypeID": 1036,
            "Reference": "DEUFCE3201163",
            "StatusTypeID": 50,
            "LevelID": 2,
            "Amps": 32,
            "Voltage": 400,
            "PowerKW": 22,
            "CurrentTypeID": 20,
            "Quantity": 1
        },
        {
            "ID": 273248,
            "ConnectionTypeID": 2,
            "Reference": "DEUFCE3201162",
            "StatusTypeID": 50,
            "LevelID": 3,
            "PowerKW": 50,
            "CurrentTypeID": 30,
            "Quantity": 1
        },
        {
            "ID": 273249,
            "ConnectionTypeID": 33,
            "Reference": "DEUFCE3201161",
            "StatusTypeID": 50,
            "LevelID": 3,
            "PowerKW": 150,
            "CurrentTypeID": 30,
            "Quantity": 1
        }
    ],
    "NumberOfPoints": 1,
    "StatusTypeID": 50,
    "DateLastStatusUpdate": "2021-07-03T18:18:00Z",
    "DataQualityLevel": 1,
    "DateCreated": "2021-06-19T21:16:00Z",
    "SubmissionStatusTypeID": 200
}