{
    "IsRecentlyVerified": false,
    "ID": 156006,
    "UUID": "F7E0B653-802B-40AF-96F7-9831536F0155",
    "DataProviderID": 1,
    "OperatorID": 136,
    "UsageTypeID": 4,
    "UsageCost": "0,25€/kWh + parking fee 1€/h after free time period",
    "AddressInfo": {
        "ID": 156360,
        "Title": "Hrlsingin Jäähalli",
        "AddressLine1": "Nordenskiöldinkatu 11-13",
        "Town": "Helsinki",
        "StateOrProvince": "Southern Finland",
        "Postcode": "00250",
        "CountryID": 79,
        "Latitude": 60.19093906208036,
        "Longitude": 24.924113844914928,
        "RelatedURL": "http://www.virta.fi",
        "DistanceUnit": 0
    },
    "Connections": [
        {
            "ID": 219591,
            "ConnectionTypeID": 25,
            "StatusTypeID": 50,
            "LevelID": 2,
            "Amps": 32,
            "Voltage": 400,
            "PowerKW": 22,
            "CurrentTypeID": 20,
            "Quantity": 4
        }
    ],
    "NumberOfPoints": 4,
    "StatusTypeID": 50,
    "DateLastStatusUpdate": "2020-05-02T07:45:00Z",
    "DataQualityLevel": 1,
    "DateCreated": "2020-05-02T06:07:00Z",
    "SubmissionStatusTypeID": 200
}