{
    "IsRecentlyVerified": false,
    "ID": 103003,
    "UUID": "816F62C2-0CBF-462A-A1AD-6E2E52A87609",
    "DataProviderID": 2,
    "DataProvidersReference": "93586",
    "OperatorID": 15,
    "UsageTypeID": 4,
    "AddressInfo": {
        "ID": 103349,
        "Title": "7-Eleven",
        "AddressLine1": "NE 82nd Way & NE Air Cargo Rd",
        "Town": "Portland",
        "StateOrProvince": "OR",
        "Postcode": "97218",
        "CountryID": 2,
        "Latitude": 45.579806,
        "Longitude": -122.574875,
        "ContactTelephone1": "877-455-3833",
        "AccessComments": "24 hours daily\r\nPublic - Card key at all times",
        "RelatedURL": "https://www.evgo.com/",
        "DistanceUnit": 0
    },
    "Connections": [
        {
            "ID": 145154,
            "ConnectionTypeID": 2,
            "LevelID": 3,
            "Amps": 100,
            "Voltage": 400,
            "PowerKW": 40,
            "CurrentTypeID": 30,
            "Quantity": 1
        },
        {
            "ID": 145155,
            "ConnectionTypeID": 32,
            "LevelID": 3,
            "Amps": 100,
            "Voltage": 400,
            "PowerKW": 40,
            "CurrentTypeID": 30,
            "Quantity": 1
        }
    ],
    "DateLastStatusUpdate": "2020-06-26T03:09:00Z",
    "DataQualityLevel": 3,
    "DateCreated": "2018-04-21T04:13:00Z",
    "SubmissionStatusTypeID": 100
}