{
    "IsRecentlyVerified": false,
    "ID": 111284,
    "UUID": "BDAA2922-FA42-47B2-BADB-42C9F81B1A48",
    "DataProviderID": 2,
    "DataProvidersReference": "84961",
    "UsageTypeID": 2,
    "AddressInfo": {
        "ID": 111630,
        "Title": "Salaberry-Valleyfield Usine",
        "AddressLine1": "64 Av du Centenaire",
        "Town": "Salaberry-de-Valleyfield",
        "StateOrProvince": "QC",
        "Postcode": "J6S 3L6",
        "CountryID": 44,
        "Latitude": 45.260038,
        "Longitude": -74.130475,
        "ContactTelephone1": "450-370-4323",
        "AccessComments": "For employee use only",
        "RelatedURL": "",
        "DistanceUnit": 0
    },
    "Connections": [
        {
            "ID": 156684,
            "ConnectionTypeID": 1,
            "LevelID": 2,
            "Amps": 16,
            "Voltage": 230,
            "PowerKW": 3.7,
            "CurrentTypeID": 10,
            "Quantity": 1
        }
    ],
    "DateLastStatusUpdate": "2020-06-26T03:08:00Z",
    "DataQualityLevel": 3,
    "DateCreated": "2018-10-18T23:36:00Z",
    "SubmissionStatusTypeID": 100
}