{
    "IsRecentlyVerified": false,
    "ID": 179431,
    "UUID": "92D8E598-8A22-4254-9411-11985E02A230",
    "DataProviderID": 29,
    "DataProvidersReference": "2524",
    "OperatorID": 127,
    "AddressInfo": {
        "ID": 179790,
        "Title": "Am Krumme Kamp 8",
        "AddressLine1": "Am Krumme Kamp 8",
        "Town": "Barßel",
        "Postcode": "26676",
        "CountryID": 87,
        "Latitude": 53.160429248005,
        "Longitude": 7.756315469742,
        "DistanceUnit": 0
    },
    "Connections": [
        {
            "ID": 281255,
            "ConnectionTypeID": 25,
            "StatusTypeID": 50,
            "LevelID": 2,
            "PowerKW": 22,
            "CurrentTypeID": 20
        },
        {
            "ID": 281256,
            "ConnectionTypeID": 25,
            "StatusTypeID": 50,
            "LevelID": 2,
            "PowerKW": 22,
            "CurrentTypeID": 20
        }
    ],
    "StatusTypeID": 50,
    "DateLastStatusUpdate": "2021-07-12T02:50:00Z",
    "MetadataValues": [
        {
            "ID": 11725,
            "MetadataFieldID": 4,
            "ItemValue": "Data from the German chargepoint registry provided by Bundesnetzagentur.de under the CC-BY 4.0 license"
        }
    ],
    "DataQualityLevel": 3,
    "DateCreated": "2021-07-08T09:59:00Z",
    "SubmissionStatusTypeID": 100
}