{
    "IsRecentlyVerified": false,
    "ID": 186658,
    "UUID": "707D3261-2FD2-4964-8AC3-E65D69147380",
    "DataProviderID": 29,
    "DataProvidersReference": "7116",
    "AddressInfo": {
        "ID": 187017,
        "Title": "Alter Grenzweg 2",
        "AddressLine1": "Alter Grenzweg 2",
        "Town": "Hamm",
        "Postcode": "59071",
        "CountryID": 87,
        "Latitude": 51.684062,
        "Longitude": 7.884656,
        "DistanceUnit": 0
    },
    "Connections": [
        {
            "ID": 299801,
            "ConnectionTypeID": 25,
            "StatusTypeID": 50,
            "LevelID": 2,
            "PowerKW": 22,
            "CurrentTypeID": 20
        },
        {
            "ID": 299802,
            "ConnectionTypeID": 25,
            "StatusTypeID": 50,
            "LevelID": 2,
            "PowerKW": 22,
            "CurrentTypeID": 20
        }
    ],
    "StatusTypeID": 50,
    "DateLastStatusUpdate": "2021-07-12T02:48:00Z",
    "MetadataValues": [
        {
            "ID": 18899,
            "MetadataFieldID": 4,
            "ItemValue": "Data from the German chargepoint registry provided by Bundesnetzagentur.de under the CC-BY 4.0 license"
        }
    ],
    "DataQualityLevel": 3,
    "DateCreated": "2021-07-12T02:48:00Z",
    "SubmissionStatusTypeID": 100
}