{
    "IsRecentlyVerified": false,
    "ID": 151864,
    "UUID": "EB2AF84D-C7D4-4054-86E6-FF15B40B6540",
    "DataProviderID": 28,
    "DataProvidersReference": "FR*S74*P74268*B",
    "OperatorID": 3408,
    "UsageTypeID": 5,
    "AddressInfo": {
        "ID": 152217,
        "Title": "SEYNOD_Centre Nautique - Rue Jean Clerc",
        "AddressLine1": "Centre Nautique - Rue Jean Clerc 74600 SEYNOD",
        "CountryID": 80,
        "Latitude": 45.88625,
        "Longitude": 6.09711,
        "AccessComments": "24/24 7/7 jours",
        "DistanceUnit": 0
    },
    "Connections": [
        {
            "ID": 212310,
            "ConnectionTypeID": 28,
            "StatusTypeID": 50,
            "LevelID": 2,
            "PowerKW": 22,
            "CurrentTypeID": 10
        },
        {
            "ID": 212311,
            "ConnectionTypeID": 1036,
            "StatusTypeID": 50,
            "LevelID": 2,
            "PowerKW": 22,
            "CurrentTypeID": 20
        },
        {
            "ID": 245030,
            "ConnectionTypeID": 28,
            "StatusTypeID": 50,
            "LevelID": 2,
            "PowerKW": 22,
            "CurrentTypeID": 10
        },
        {
            "ID": 245031,
            "ConnectionTypeID": 1036,
            "StatusTypeID": 50,
            "LevelID": 2,
            "PowerKW": 22,
            "CurrentTypeID": 20
        }
    ],
    "GeneralComments": "",
    "StatusTypeID": 50,
    "DateLastStatusUpdate": "2020-08-27T05:12:00Z",
    "DataQualityLevel": 2,
    "DateCreated": "2020-03-15T10:53:00Z",
    "SubmissionStatusTypeID": 100
}