{
    "IsRecentlyVerified": false,
    "ID": 36145,
    "UUID": "59620C7C-E9F3-4D8E-A8F7-832020A8FDDD",
    "DataProviderID": 26,
    "DataProvidersReference": "25717",
    "OperatorID": 78,
    "OperatorsReference": "Essent EM-NL-00000344-03-00001",
    "UsageCost": "0.00 jaarabonnement",
    "AddressInfo": {
        "ID": 36491,
        "Title": "Willem van Noortplein 2",
        "AddressLine1": "Willem van Noortplein 2",
        "Town": "Utrecht",
        "Postcode": "3514 GK",
        "CountryID": 159,
        "Latitude": 52.102332,
        "Longitude": 5.122054,
        "RelatedURL": "http://www.essent.nl",
        "DistanceUnit": 0
    },
    "Connections": [
        {
            "ID": 39656,
            "ConnectionTypeID": 25,
            "LevelID": 2,
            "PowerKW": 11,
            "CurrentTypeID": 10
        },
        {
            "ID": 48254,
            "ConnectionTypeID": 25,
            "LevelID": 2,
            "PowerKW": 11,
            "CurrentTypeID": 10
        }
    ],
    "NumberOfPoints": 1,
    "StatusTypeID": 50,
    "DateLastStatusUpdate": "2016-06-04T02:50:00Z",
    "DataQualityLevel": 3,
    "DateCreated": "2015-01-09T06:05:00Z",
    "SubmissionStatusTypeID": 100
}