{
    "IsRecentlyVerified": false,
    "ID": 103032,
    "UUID": "2B73391E-5BE2-4080-9648-0DB1D83315A9",
    "DataProviderID": 2,
    "DataProvidersReference": "93850",
    "UsageTypeID": 1,
    "AddressInfo": {
        "ID": 103378,
        "Title": "Lopez Community Land Trust",
        "AddressLine1": "25 Tuatara Rd",
        "Town": "Lopez",
        "StateOrProvince": "WA",
        "Postcode": "98261",
        "CountryID": 2,
        "Latitude": 48.530774,
        "Longitude": -122.914874,
        "ContactTelephone1": "360-468-3723",
        "AccessComments": "24 hours daily",
        "RelatedURL": "",
        "DistanceUnit": 0
    },
    "Connections": [
        {
            "ID": 145192,
            "ConnectionTypeID": 1,
            "LevelID": 2,
            "Amps": 16,
            "Voltage": 230,
            "PowerKW": 3.7,
            "CurrentTypeID": 10,
            "Quantity": 1
        }
    ],
    "DateLastStatusUpdate": "2020-06-26T03:11:00Z",
    "DataQualityLevel": 3,
    "DateCreated": "2018-04-21T04:13:00Z",
    "SubmissionStatusTypeID": 100
}