{
    "IsRecentlyVerified": false,
    "ID": 155201,
    "UUID": "F9E2FE5C-08CD-4BEE-9FCB-38FF38F347B5",
    "DataProviderID": 1,
    "OperatorID": 32,
    "UsageTypeID": 5,
    "UsageCost": "£0.30/kWh (Contactless); £0.15/kWh (Polar Plus subscription); £0.25/kWh (Polar Instant app). Overstay £10/hour after 90 minutes ",
    "AddressInfo": {
        "ID": 155555,
        "Title": "Adventure Leisure Vehicles",
        "AddressLine1": "Orton Road",
        "AddressLine2": "Tebay",
        "Town": "Eden",
        "StateOrProvince": "Cumbria",
        "Postcode": "CA10 3SS",
        "CountryID": 1,
        "Latitude": 54.438335,
        "Longitude": -2.592215,
        "AccessComments": "The unit is located in the back of the car park.Mon-Fri 8-5pm,Sat 11-4pm,Sundays April – October 11-4pm,Sundays November – March CLOSED",
        "DistanceUnit": 0
    },
    "Connections": [
        {
            "ID": 218454,
            "ConnectionTypeID": 33,
            "StatusTypeID": 50,
            "LevelID": 3,
            "PowerKW": 50,
            "CurrentTypeID": 30,
            "Quantity": 1
        },
        {
            "ID": 218455,
            "ConnectionTypeID": 1036,
            "StatusTypeID": 50,
            "LevelID": 3,
            "Amps": 63,
            "Voltage": 400,
            "PowerKW": 43,
            "CurrentTypeID": 20,
            "Quantity": 1
        },
        {
            "ID": 218456,
            "ConnectionTypeID": 2,
            "StatusTypeID": 50,
            "LevelID": 3,
            "PowerKW": 50,
            "CurrentTypeID": 30,
            "Quantity": 1
        }
    ],
    "NumberOfPoints": 1,
    "GeneralComments": "Contactless payment terminal fitted.",
    "StatusTypeID": 50,
    "DateLastStatusUpdate": "2020-03-30T16:27:00Z",
    "DataQualityLevel": 1,
    "DateCreated": "2020-03-30T16:27:00Z",
    "SubmissionStatusTypeID": 200
}