{
    "IsRecentlyVerified": false,
    "ID": 144409,
    "UUID": "C65C7D1F-0D2C-40F3-95E8-F3A5AA29B4BE",
    "DataProviderID": 2,
    "DataProvidersReference": "123280",
    "UsageTypeID": 2,
    "AddressInfo": {
        "ID": 144761,
        "Title": "Nike - Serena",
        "AddressLine1": "1 Bowerman Dr",
        "Town": "Beaverton",
        "StateOrProvince": "OR",
        "Postcode": "97005",
        "CountryID": 2,
        "Latitude": 45.511448,
        "Longitude": -122.826915,
        "ContactTelephone1": "",
        "AccessComments": "For employee use only",
        "RelatedURL": "",
        "DistanceUnit": 0
    },
    "Connections": [
        {
            "ID": 200914,
            "ConnectionTypeID": 1,
            "LevelID": 2,
            "Amps": 16,
            "Voltage": 230,
            "PowerKW": 3.7,
            "CurrentTypeID": 10,
            "Quantity": 10
        }
    ],
    "GeneralComments": "Planned for future date. Not Operational.",
    "DatePlanned": "2020-07-01T00:00:00Z",
    "StatusTypeID": 150,
    "DateLastStatusUpdate": "2020-06-26T03:09:00Z",
    "DataQualityLevel": 3,
    "DateCreated": "2019-12-24T09:23:00Z",
    "SubmissionStatusTypeID": 100
}