{
    "IsRecentlyVerified": false,
    "ID": 81686,
    "UUID": "4663818C-5ABE-414E-B6E6-D888B2AA2AEA",
    "DataProviderID": 1,
    "OperatorID": 23,
    "OperatorsReference": "7044",
    "UsageTypeID": 6,
    "AddressInfo": {
        "ID": 82032,
        "Title": "Comfort Inn Burlington, on",
        "AddressLine1": "3290 S Service RD",
        "Town": "Burlington",
        "StateOrProvince": "ON",
        "Postcode": "L7N 3M6",
        "CountryID": 44,
        "Latitude": 43.359198,
        "Longitude": -79.7949,
        "ContactTelephone1": "(905) 639-1700",
        "DistanceUnit": 0
    },
    "Connections": [
        {
            "ID": 116444,
            "ConnectionTypeID": 30,
            "StatusTypeID": 50,
            "LevelID": 2,
            "PowerKW": 16,
            "CurrentTypeID": 20,
            "Quantity": 2
        }
    ],
    "NumberOfPoints": 2,
    "GeneralComments": "2 Tesla Connectors, up to 16kW.Available for patrons only. Self park.",
    "StatusTypeID": 50,
    "DateLastStatusUpdate": "2017-02-03T11:13:00Z",
    "DataQualityLevel": 1,
    "DateCreated": "2017-02-03T11:13:00Z",
    "SubmissionStatusTypeID": 200
}