{
    "IsRecentlyVerified": false,
    "ID": 29739,
    "UUID": "D012B44F-528F-48FF-BD76-E484277C060B",
    "DataProviderID": 15,
    "DataProvidersReference": "33432",
    "OperatorID": 26,
    "AddressInfo": {
        "ID": 30085,
        "Title": "10625 East Kellogg Avenue",
        "AddressLine1": "10625 East Kellogg Avenue",
        "Town": "Wichita",
        "StateOrProvince": "KS",
        "Postcode": "67207",
        "CountryID": 2,
        "Latitude": 37.678378,
        "Longitude": -97.214726,
        "ContactTelephone1": "(316) 681-6900",
        "RelatedURL": "http://carstations.com/33432",
        "DistanceUnit": 0
    },
    "Connections": [
        {
            "ID": 32724,
            "ConnectionTypeID": 1,
            "Reference": "J1772",
            "LevelID": 2
        }
    ],
    "StatusTypeID": 0,
    "DateLastStatusUpdate": "2017-11-04T14:04:00Z",
    "DataQualityLevel": 2,
    "DateCreated": "2014-11-29T05:39:00Z",
    "SubmissionStatusTypeID": 100
}