{
    "IsRecentlyVerified": false,
    "ID": 73763,
    "UUID": "9E584BE7-62DA-4A1D-BEF0-CB961DDA1337",
    "DataProviderID": 1,
    "OperatorID": 89,
    "OperatorsReference": "CEA-10061",
    "UsageTypeID": 4,
    "UsageCost": "CAD 1.00/hour",
    "AddressInfo": {
        "ID": 74109,
        "Title": "St-Hubert-Arthabaska",
        "AddressLine1": "609 Boul. des Bois Francs Sud",
        "Town": "Victoriaville",
        "StateOrProvince": "QC",
        "Postcode": "G6P 5X1",
        "CountryID": 44,
        "Latitude": 46.047783455426,
        "Longitude": -71.9334653926944,
        "DistanceUnit": 0
    },
    "Connections": [
        {
            "ID": 106065,
            "ConnectionTypeID": 1,
            "StatusTypeID": 50,
            "LevelID": 2,
            "Amps": 32,
            "Voltage": 230,
            "PowerKW": 7,
            "CurrentTypeID": 10,
            "Quantity": 1
        }
    ],
    "NumberOfPoints": 1,
    "StatusTypeID": 50,
    "DateLastStatusUpdate": "2016-11-27T20:09:00Z",
    "DataQualityLevel": 1,
    "DateCreated": "2016-11-23T23:00:00Z",
    "SubmissionStatusTypeID": 200
}