{
    "IsRecentlyVerified": false,
    "ID": 34176,
    "UUID": "EE4F33FE-2E58-4A45-BF21-455E33401AE4",
    "DataProviderID": 26,
    "DataProvidersReference": "47192",
    "OperatorID": 178,
    "OperatorsReference": "EVnetNL AL342",
    "UsageCost": "0.00 jaarabonnement",
    "AddressInfo": {
        "ID": 34522,
        "Title": "Populierenlaan",
        "AddressLine1": "Populierenlaan",
        "Town": "Ridderkerk",
        "Postcode": "2982 CM",
        "CountryID": 159,
        "Latitude": 51.87814,
        "Longitude": 4.590524,
        "ContactTelephone1": "0800-3522365",
        "RelatedURL": "http://www.evnet.nl",
        "DistanceUnit": 0
    },
    "Connections": [
        {
            "ID": 37687,
            "ConnectionTypeID": 25,
            "LevelID": 2,
            "PowerKW": 11,
            "CurrentTypeID": 10
        }
    ],
    "NumberOfPoints": 2,
    "StatusTypeID": 50,
    "DateLastStatusUpdate": "2016-06-04T02:41:00Z",
    "DataQualityLevel": 3,
    "DateCreated": "2015-01-09T06:04:00Z",
    "SubmissionStatusTypeID": 100
}