{
    "IsRecentlyVerified": false,
    "ID": 138837,
    "UUID": "8A66B2C2-A7DB-4325-9E38-57E9BB709F3A",
    "DataProviderID": 2,
    "DataProvidersReference": "148853",
    "OperatorID": 39,
    "UsageTypeID": 1,
    "AddressInfo": {
        "ID": 139189,
        "Title": "Paseo Del Mar 3",
        "AddressLine1": "12275 El Camino Real",
        "Town": "San Diego",
        "StateOrProvince": "CA",
        "Postcode": "92130",
        "CountryID": 2,
        "Latitude": 32.9411774,
        "Longitude": -117.2392195,
        "ContactTelephone1": "800-663-5633",
        "AccessComments": "MO: Not Specified; TU: Not Specified; WE: Not Specified; TH: Not Specified; FR: Not Specified; SA: Not Specified; SU: Not Specified",
        "RelatedURL": "http://www.semacharge.com/",
        "DistanceUnit": 0
    },
    "Connections": [
        {
            "ID": 194054,
            "ConnectionTypeID": 1,
            "LevelID": 2,
            "Amps": 16,
            "Voltage": 230,
            "PowerKW": 3.7,
            "CurrentTypeID": 10,
            "Quantity": 2
        }
    ],
    "StatusTypeID": 50,
    "DateLastStatusUpdate": "2020-06-26T02:55:00Z",
    "DataQualityLevel": 3,
    "DateCreated": "2019-12-24T09:09:00Z",
    "SubmissionStatusTypeID": 100
}