{
    "IsRecentlyVerified": false,
    "ID": 36587,
    "UUID": "AF38CC76-F5DE-4758-AEE6-D7172EC1A5E8",
    "DataProviderID": 1,
    "OperatorID": 105,
    "OperatorsReference": "Essent EM-DE-05566068-01-00001",
    "UsageTypeID": 4,
    "AddressInfo": {
        "ID": 36933,
        "Title": "Laurenzstraße 108",
        "AddressLine1": "Laurenzstraße 108",
        "Town": "Ochtrup",
        "Postcode": "48607",
        "CountryID": 87,
        "Latitude": 52.205411,
        "Longitude": 7.211022,
        "DistanceUnit": 0
    },
    "Connections": [
        {
            "ID": 40098,
            "ConnectionTypeID": 25,
            "LevelID": 2,
            "PowerKW": 11
        },
        {
            "ID": 48416,
            "ConnectionTypeID": 25,
            "LevelID": 2,
            "PowerKW": 11
        }
    ],
    "NumberOfPoints": 1,
    "StatusTypeID": 50,
    "DateLastStatusUpdate": "2015-04-12T21:52:00Z",
    "DataQualityLevel": 3,
    "DateCreated": "2015-01-09T06:05:00Z",
    "SubmissionStatusTypeID": 200
}