{
    "MediaItems": [
        {
            "ID": 23150,
            "ChargePointID": 161697,
            "ItemURL": "https://s3-ap-southeast-2.amazonaws.com/openchargemap/images/IT/OCM161697/OCM-161697.orig.2020072114300860.jpg",
            "ItemThumbnailURL": "https://s3-ap-southeast-2.amazonaws.com/openchargemap/images/IT/OCM161697/OCM-161697.thmb.2020072114300860.jpg",
            "Comment": "",
            "IsEnabled": true,
            "IsVideo": false,
            "IsFeaturedItem": false,
            "IsExternalResource": false,
            "User": {
                "ID": 19496,
                "Username": "ECOGY"
            },
            "DateCreated": "2020-07-21T14:30:00Z"
        },
        {
            "ID": 23151,
            "ChargePointID": 161697,
            "ItemURL": "https://s3-ap-southeast-2.amazonaws.com/openchargemap/images/IT/OCM161697/OCM-161697.orig.2020072114302666.jpg",
            "ItemThumbnailURL": "https://s3-ap-southeast-2.amazonaws.com/openchargemap/images/IT/OCM161697/OCM-161697.thmb.2020072114302666.jpg",
            "Comment": "",
            "IsEnabled": true,
            "IsVideo": false,
            "IsFeaturedItem": false,
            "IsExternalResource": false,
            "User": {
                "ID": 19496,
                "Username": "ECOGY"
            },
            "DateCreated": "2020-07-21T14:30:00Z"
        }
    ],
    "IsRecentlyVerified": false,
    "ID": 161697,
    "UUID": "3B283320-CE0A-4E07-93D3-F231238F5A68",
    "DataProviderID": 1,
    "OperatorID": 45,
    "UsageTypeID": 4,
    "UsageCost": "0,30 Euro/ kWh",
    "AddressInfo": {
        "ID": 162054,
        "Title": "Hotel Mitterplarserhof ***",
        "AddressLine1": "Mitterplars 69",
        "Town": " Algund ",
        "StateOrProvince": "Bozen",
        "Postcode": "39022",
        "CountryID": 112,
        "Latitude": 46.68585823438164,
        "Longitude": 11.117507248565289,
        "ContactTelephone1": "+39 0473 221 390",
        "ContactEmail": "info@hotel-mitterplarserhof.com",
        "AccessComments": "Für Hotelkunden mittels RFID Karte\r\nEcogy 11 kE",
        "RelatedURL": "https://www.mitterplarser-hotel.it/de/das-hotel.html",
        "DistanceUnit": 0
    },
    "Connections": [
        {
            "ID": 232678,
            "ConnectionTypeID": 25,
            "StatusTypeID": 50,
            "LevelID": 2,
            "Amps": 16,
            "Voltage": 400,
            "PowerKW": 11,
            "CurrentTypeID": 20,
            "Quantity": 1
        }
    ],
    "NumberOfPoints": 1,
    "GeneralComments": "Die Ladestation befindet sich auf dem Kundenparkplatz",
    "StatusTypeID": 50,
    "DateLastStatusUpdate": "2020-07-21T14:31:00Z",
    "DataQualityLevel": 1,
    "DateCreated": "2020-07-21T14:30:00Z",
    "SubmissionStatusTypeID": 200
}