{
    "IsRecentlyVerified": false,
    "ID": 157721,
    "UUID": "BFA72A7B-BE49-467A-BC0E-297E1CA9CCEA",
    "DataProviderID": 1,
    "OperatorID": 21,
    "UsageTypeID": 4,
    "UsageCost": "Mobi.E compatible card",
    "AddressInfo": {
        "ID": 158075,
        "Title": "VIZ-00001",
        "AddressLine1": "Rua Joaquim Ribeiro Ferreira",
        "Town": "Caldas de Vizela",
        "StateOrProvince": "Braga",
        "Postcode": "4815-013",
        "CountryID": 180,
        "Latitude": 41.377864,
        "Longitude": -8.310084,
        "RelatedURL": "https://www.mobie.pt",
        "DistanceUnit": 0
    },
    "Connections": [
        {
            "ID": 227235,
            "ConnectionTypeID": 25,
            "StatusTypeID": 50,
            "LevelID": 2,
            "Amps": 32,
            "Voltage": 400,
            "PowerKW": 22,
            "CurrentTypeID": 20,
            "Quantity": 2
        }
    ],
    "NumberOfPoints": 2,
    "StatusTypeID": 50,
    "DateLastStatusUpdate": "2020-09-30T20:15:00Z",
    "DataQualityLevel": 3,
    "DateCreated": "2020-06-25T05:42:00Z",
    "SubmissionStatusTypeID": 100
}