{
    "IsRecentlyVerified": false,
    "ID": 156700,
    "UUID": "AA53EFFE-9198-423D-B7B6-A38A9BC43593",
    "DataProviderID": 19,
    "DataProvidersReference": "5506",
    "AddressInfo": {
        "ID": 157054,
        "Title": "Göteborg Energi - Wieselgrensgatan 4H",
        "AddressLine1": "Wieselgrensgatan 4H",
        "Town": "GÖTEBORG",
        "StateOrProvince": "VÄSTRA GÖTALAND",
        "Postcode": "41717",
        "CountryID": 216,
        "Latitude": 57.7222,
        "Longitude": 11.9333,
        "AccessComments": "På parkeringen",
        "DistanceUnit": 0
    },
    "Connections": [
        {
            "ID": 221356,
            "ConnectionTypeID": 25,
            "Reference": "1",
            "LevelID": 3,
            "Amps": 32,
            "Voltage": 400,
            "PowerKW": 22,
            "CurrentTypeID": 30
        },
        {
            "ID": 221357,
            "ConnectionTypeID": 25,
            "Reference": "2",
            "LevelID": 3,
            "Amps": 32,
            "Voltage": 400,
            "PowerKW": 22,
            "CurrentTypeID": 30
        },
        {
            "ID": 221358,
            "ConnectionTypeID": 25,
            "Reference": "3",
            "LevelID": 3,
            "Amps": 32,
            "Voltage": 400,
            "PowerKW": 22,
            "CurrentTypeID": 30
        },
        {
            "ID": 221359,
            "ConnectionTypeID": 25,
            "Reference": "4",
            "LevelID": 3,
            "Amps": 32,
            "Voltage": 400,
            "PowerKW": 22,
            "CurrentTypeID": 30
        },
        {
            "ID": 221360,
            "ConnectionTypeID": 25,
            "Reference": "5",
            "LevelID": 3,
            "Amps": 32,
            "Voltage": 400,
            "PowerKW": 22,
            "CurrentTypeID": 30
        },
        {
            "ID": 221361,
            "ConnectionTypeID": 25,
            "Reference": "6",
            "LevelID": 3,
            "Amps": 32,
            "Voltage": 400,
            "PowerKW": 22,
            "CurrentTypeID": 30
        },
        {
            "ID": 221362,
            "ConnectionTypeID": 25,
            "Reference": "7",
            "LevelID": 3,
            "Amps": 32,
            "Voltage": 400,
            "PowerKW": 22,
            "CurrentTypeID": 30
        },
        {
            "ID": 221363,
            "ConnectionTypeID": 25,
            "Reference": "8",
            "LevelID": 3,
            "Amps": 32,
            "Voltage": 400,
            "PowerKW": 22,
            "CurrentTypeID": 30
        },
        {
            "ID": 221364,
            "ConnectionTypeID": 25,
            "Reference": "9",
            "LevelID": 3,
            "Amps": 32,
            "Voltage": 400,
            "PowerKW": 22,
            "CurrentTypeID": 30
        },
        {
            "ID": 221365,
            "ConnectionTypeID": 25,
            "Reference": "10",
            "LevelID": 3,
            "Amps": 32,
            "Voltage": 400,
            "PowerKW": 22,
            "CurrentTypeID": 30
        },
        {
            "ID": 221366,
            "ConnectionTypeID": 25,
            "Reference": "11",
            "LevelID": 3,
            "Amps": 32,
            "Voltage": 400,
            "PowerKW": 22,
            "CurrentTypeID": 30
        },
        {
            "ID": 221367,
            "ConnectionTypeID": 25,
            "Reference": "12",
            "LevelID": 3,
            "Amps": 32,
            "Voltage": 400,
            "PowerKW": 22,
            "CurrentTypeID": 30
        }
    ],
    "NumberOfPoints": 12,
    "StatusTypeID": 0,
    "DateLastStatusUpdate": "2021-03-24T05:11:00Z",
    "DataQualityLevel": 2,
    "DateCreated": "2020-05-26T08:21:00Z",
    "SubmissionStatusTypeID": 100
}