{
    "IsRecentlyVerified": false,
    "ID": 176957,
    "UUID": "548742AD-031C-409E-90A3-1ADD20E52773",
    "DataProviderID": 29,
    "DataProvidersReference": "12635",
    "OperatorID": 105,
    "AddressInfo": {
        "ID": 177316,
        "Title": "Leiberger Str. 10",
        "AddressLine1": "Leiberger Str. 10",
        "Town": "Bad Wünnenberg",
        "Postcode": "33181",
        "CountryID": 87,
        "Latitude": 51.52281,
        "Longitude": 8.689991,
        "DistanceUnit": 0
    },
    "Connections": [
        {
            "ID": 275529,
            "ConnectionTypeID": 25,
            "StatusTypeID": 50,
            "LevelID": 2,
            "PowerKW": 22,
            "CurrentTypeID": 20
        },
        {
            "ID": 275530,
            "ConnectionTypeID": 25,
            "StatusTypeID": 50,
            "LevelID": 2,
            "PowerKW": 22,
            "CurrentTypeID": 20
        },
        {
            "ID": 275531,
            "ConnectionTypeID": 25,
            "StatusTypeID": 50,
            "LevelID": 2,
            "PowerKW": 22,
            "CurrentTypeID": 20
        }
    ],
    "StatusTypeID": 0,
    "DateLastStatusUpdate": "2021-07-12T02:47:00Z",
    "MetadataValues": [
        {
            "ID": 9251,
            "MetadataFieldID": 4,
            "ItemValue": "Data from the German chargepoint registry provided by Bundesnetzagentur.de under the CC-BY 4.0 license"
        }
    ],
    "DataQualityLevel": 3,
    "DateCreated": "2021-07-08T09:48:00Z",
    "SubmissionStatusTypeID": 100
}