{
    "IsRecentlyVerified": false,
    "ID": 148623,
    "UUID": "0A479FD6-180F-4809-9196-096547BF1C5A",
    "DataProviderID": 1,
    "OperatorID": 23,
    "OperatorsReference": "34704",
    "UsageTypeID": 4,
    "UsageCost": "$0.25/kWh; other tariffs for older cars",
    "AddressInfo": {
        "ID": 148975,
        "Title": "Spokane, Wa Supercharger",
        "AddressLine1": "10506 West Aero Road",
        "Town": "Spokane",
        "StateOrProvince": "WA",
        "Postcode": "99224",
        "CountryID": 2,
        "Latitude": 47.590147,
        "Longitude": -117.561816,
        "DistanceUnit": 0
    },
    "Connections": [
        {
            "ID": 206371,
            "ConnectionTypeID": 27,
            "StatusTypeID": 50,
            "LevelID": 3,
            "PowerKW": 120,
            "CurrentTypeID": 30,
            "Quantity": 8
        }
    ],
    "NumberOfPoints": 8,
    "GeneralComments": "Charging8 Superchargers, available 24/7, up to 150kW",
    "StatusTypeID": 50,
    "DateLastStatusUpdate": "2020-02-07T10:36:00Z",
    "DataQualityLevel": 1,
    "DateCreated": "2020-02-07T10:36:00Z",
    "SubmissionStatusTypeID": 200
}