{
    "IsRecentlyVerified": false,
    "ID": 177267,
    "UUID": "67681F30-ED5C-493D-9792-48A6FB9B42D9",
    "DataProviderID": 29,
    "DataProvidersReference": "7575",
    "AddressInfo": {
        "ID": 177626,
        "Title": "Paul-Heyse-Str. 28",
        "AddressLine1": "Paul-Heyse-Str. 28",
        "Town": "München",
        "Postcode": "80336",
        "CountryID": 87,
        "Latitude": 48.135632,
        "Longitude": 11.555516,
        "DistanceUnit": 0
    },
    "Connections": [
        {
            "ID": 276217,
            "ConnectionTypeID": 25,
            "StatusTypeID": 50,
            "LevelID": 2,
            "PowerKW": 22,
            "CurrentTypeID": 20
        },
        {
            "ID": 276218,
            "ConnectionTypeID": 25,
            "StatusTypeID": 50,
            "LevelID": 2,
            "PowerKW": 22,
            "CurrentTypeID": 20
        }
    ],
    "StatusTypeID": 0,
    "DateLastStatusUpdate": "2021-07-09T03:11:00Z",
    "MetadataValues": [
        {
            "ID": 9561,
            "MetadataFieldID": 4,
            "ItemValue": "Data from the German chargepoint registry provided by Bundesnetzagentur.de under the CC-BY 4.0 license"
        }
    ],
    "DataQualityLevel": 3,
    "DateCreated": "2021-07-08T09:48:00Z",
    "SubmissionStatusTypeID": 100
}