{
    "IsRecentlyVerified": false,
    "ID": 177387,
    "UUID": "FB600FF1-B2FC-4D7C-9683-64478C2D644D",
    "DataProviderID": 29,
    "DataProvidersReference": "18636",
    "AddressInfo": {
        "ID": 177746,
        "Title": "Gietherstraße",
        "AddressLine1": "Gietherstraße",
        "Town": "Willich",
        "Postcode": "47877",
        "CountryID": 87,
        "Latitude": 51.280401,
        "Longitude": 6.457576,
        "DistanceUnit": 0
    },
    "Connections": [
        {
            "ID": 276475,
            "ConnectionTypeID": 25,
            "StatusTypeID": 50,
            "LevelID": 2,
            "PowerKW": 22,
            "CurrentTypeID": 20
        },
        {
            "ID": 276476,
            "ConnectionTypeID": 25,
            "StatusTypeID": 50,
            "LevelID": 2,
            "PowerKW": 22,
            "CurrentTypeID": 20
        }
    ],
    "StatusTypeID": 0,
    "DateLastStatusUpdate": "2021-07-12T02:47:00Z",
    "MetadataValues": [
        {
            "ID": 9681,
            "MetadataFieldID": 4,
            "ItemValue": "Data from the German chargepoint registry provided by Bundesnetzagentur.de under the CC-BY 4.0 license"
        }
    ],
    "DataQualityLevel": 3,
    "DateCreated": "2021-07-08T09:49:00Z",
    "SubmissionStatusTypeID": 100
}