{
    "IsRecentlyVerified": false,
    "ID": 90114,
    "UUID": "227495EE-DBDB-47C1-8D9D-FDDC0B8534B8",
    "DataProviderID": 1,
    "OperatorID": 45,
    "UsageTypeID": 1,
    "UsageCost": "Spende (auch per Paypal mit QR Code  möglich)",
    "AddressInfo": {
        "ID": 90460,
        "Title": "Albani Elektronik",
        "AddressLine1": "Oberlungwitzer Straße 2",
        "Town": "Hohenstein-Ernstthal",
        "StateOrProvince": "Landkreis Zwickau",
        "Postcode": "09337",
        "CountryID": 87,
        "Latitude": 50.806413388351764,
        "Longitude": 12.753022974204992,
        "ContactTelephone1": "+49 3723 6519-0",
        "AccessComments": "24/7 barrierefrei nutzbare Ladestation am Eckhaus. Ladepunkt ist ein Crowdfunding Projekt des GoingElectric Forums. ",
        "RelatedURL": "http://albani-elektronik.de/",
        "DistanceUnit": 0
    },
    "Connections": [
        {
            "ID": 127742,
            "ConnectionTypeID": 1036,
            "StatusTypeID": 50,
            "LevelID": 3,
            "Amps": 63,
            "Voltage": 400,
            "PowerKW": 43,
            "CurrentTypeID": 20,
            "Quantity": 1
        },
        {
            "ID": 127743,
            "ConnectionTypeID": 17,
            "StatusTypeID": 50,
            "LevelID": 2,
            "Amps": 32,
            "Voltage": 400,
            "PowerKW": 22,
            "CurrentTypeID": 10,
            "Quantity": 1
        }
    ],
    "NumberOfPoints": 2,
    "StatusTypeID": 50,
    "DateLastStatusUpdate": "2017-07-10T06:59:00Z",
    "DataQualityLevel": 1,
    "DateCreated": "2017-07-10T06:59:00Z",
    "SubmissionStatusTypeID": 200
}