{
    "IsRecentlyVerified": false,
    "ID": 139679,
    "UUID": "31AB3C65-0339-457F-B074-7814FAB2AF1A",
    "DataProviderID": 2,
    "DataProvidersReference": "80146",
    "OperatorID": 5,
    "UsageTypeID": 1,
    "AddressInfo": {
        "ID": 140031,
        "Title": "SANTA MONICA VW",
        "AddressLine1": "2440 Santa Monica Blv",
        "Town": "Santa Monica",
        "StateOrProvince": "CA",
        "Postcode": "90404",
        "CountryID": 2,
        "Latitude": 34.0319317,
        "Longitude": -118.4756326,
        "ContactTelephone1": "888-758-4389",
        "AccessComments": "24 hours daily",
        "RelatedURL": "http://www.chargepoint.com/",
        "DistanceUnit": 0
    },
    "Connections": [
        {
            "ID": 195114,
            "ConnectionTypeID": 1,
            "LevelID": 2,
            "Amps": 16,
            "Voltage": 230,
            "PowerKW": 3,
            "CurrentTypeID": 10,
            "Quantity": 2
        }
    ],
    "StatusTypeID": 50,
    "DateLastStatusUpdate": "2019-12-24T09:11:00Z",
    "DataQualityLevel": 3,
    "DateCreated": "2019-12-24T09:11:00Z",
    "SubmissionStatusTypeID": 100
}