{
    "IsRecentlyVerified": false,
    "ID": 119643,
    "UUID": "9BA9A9CD-13D1-42EB-AFE8-D6B6DA61D6CA",
    "DataProviderID": 2,
    "DataProvidersReference": "99763",
    "OperatorID": 5,
    "UsageTypeID": 1,
    "AddressInfo": {
        "ID": 119989,
        "Title": "ELEC STATIONS",
        "AddressLine1": "15875 S Tamiami Trail",
        "Town": "Fort Myers",
        "StateOrProvince": "FL",
        "Postcode": "33908",
        "CountryID": 2,
        "Latitude": 26.5119474,
        "Longitude": -81.8620485,
        "ContactTelephone1": "888-758-4389",
        "AccessComments": "24 hours daily",
        "RelatedURL": "http://www.chargepoint.com/",
        "DistanceUnit": 0
    },
    "Connections": [
        {
            "ID": 168923,
            "ConnectionTypeID": 1,
            "LevelID": 2,
            "Amps": 16,
            "Voltage": 230,
            "PowerKW": 3.7,
            "CurrentTypeID": 10,
            "Quantity": 2
        }
    ],
    "DateLastStatusUpdate": "2020-06-26T02:52:00Z",
    "DataQualityLevel": 3,
    "DateCreated": "2019-04-01T04:59:00Z",
    "SubmissionStatusTypeID": 100
}