{
    "IsRecentlyVerified": false,
    "ID": 29247,
    "UUID": "FA93C90E-42AC-42FF-9997-75AC70879947",
    "DataProviderID": 2,
    "DataProvidersReference": "61778",
    "OperatorID": 5,
    "UsageTypeID": 1,
    "AddressInfo": {
        "ID": 29593,
        "Title": "HENNEPIN COUNTY",
        "AddressLine1": "417 5th St N",
        "Town": "Minneapolis",
        "StateOrProvince": "MN",
        "Postcode": "55401",
        "CountryID": 2,
        "Latitude": 44.9832216,
        "Longitude": -93.2781588,
        "ContactTelephone1": "888-758-4389",
        "AccessComments": "24 hours daily",
        "RelatedURL": "http://www.chargepoint.com/",
        "DistanceUnit": 0
    },
    "Connections": [
        {
            "ID": 32144,
            "ConnectionTypeID": 1,
            "LevelID": 2,
            "Amps": 16,
            "Voltage": 230,
            "PowerKW": 3.7,
            "CurrentTypeID": 10,
            "Quantity": 2
        }
    ],
    "DateLastStatusUpdate": "2020-06-26T03:08:00Z",
    "DataQualityLevel": 3,
    "DateCreated": "2014-11-28T03:39:00Z",
    "SubmissionStatusTypeID": 100
}