{
    "IsRecentlyVerified": false,
    "ID": 187054,
    "UUID": "CC3D1BF1-5F68-43F9-936D-ABCEE747BAAE",
    "DataProviderID": 29,
    "DataProvidersReference": "7736",
    "AddressInfo": {
        "ID": 187413,
        "Title": "Fr.-Wolf-Ring 52a",
        "AddressLine1": "Fr.-Wolf-Ring 52a",
        "Town": "Schwedt/Oder",
        "Postcode": "16303",
        "CountryID": 87,
        "Latitude": 53.060714,
        "Longitude": 14.28734,
        "DistanceUnit": 0
    },
    "Connections": [
        {
            "ID": 301081,
            "ConnectionTypeID": 25,
            "StatusTypeID": 50,
            "LevelID": 2,
            "PowerKW": 22,
            "CurrentTypeID": 20
        },
        {
            "ID": 301082,
            "ConnectionTypeID": 25,
            "StatusTypeID": 50,
            "LevelID": 2,
            "PowerKW": 22,
            "CurrentTypeID": 20
        }
    ],
    "StatusTypeID": 50,
    "DateLastStatusUpdate": "2021-07-12T02:50:00Z",
    "MetadataValues": [
        {
            "ID": 19294,
            "MetadataFieldID": 4,
            "ItemValue": "Data from the German chargepoint registry provided by Bundesnetzagentur.de under the CC-BY 4.0 license"
        }
    ],
    "DataQualityLevel": 3,
    "DateCreated": "2021-07-12T02:50:00Z",
    "SubmissionStatusTypeID": 100
}