{
    "IsRecentlyVerified": false,
    "ID": 153337,
    "UUID": "7526424A-EBD1-4650-A46B-A8D9D5C23C57",
    "DataProviderID": 28,
    "DataProvidersReference": "FR*M45*P45197*001",
    "OperatorID": 3410,
    "UsageTypeID": 5,
    "AddressInfo": {
        "ID": 153690,
        "Title": "MARIGNY LES USAGES - Parking Rue Du Vieux Bourg",
        "AddressLine1": "Parking Rue Du Vieux Bourg 45760 MARIGNY LES USAGES",
        "CountryID": 80,
        "Latitude": 47.95631,
        "Longitude": 2.01551,
        "AccessComments": "24h/24 7j/7",
        "DistanceUnit": 0
    },
    "Connections": [
        {
            "ID": 215066,
            "ConnectionTypeID": 1036,
            "StatusTypeID": 50,
            "LevelID": 2,
            "PowerKW": 22,
            "CurrentTypeID": 20
        },
        {
            "ID": 215067,
            "ConnectionTypeID": 28,
            "StatusTypeID": 50,
            "LevelID": 2,
            "PowerKW": 22,
            "CurrentTypeID": 10
        },
        {
            "ID": 248456,
            "ConnectionTypeID": 1036,
            "StatusTypeID": 50,
            "LevelID": 2,
            "PowerKW": 22,
            "CurrentTypeID": 20
        },
        {
            "ID": 248457,
            "ConnectionTypeID": 28,
            "StatusTypeID": 50,
            "LevelID": 2,
            "PowerKW": 22,
            "CurrentTypeID": 10
        }
    ],
    "GeneralComments": "Recharge par badge et avec une application smartphone",
    "StatusTypeID": 50,
    "DateLastStatusUpdate": "2020-08-27T05:14:00Z",
    "DataQualityLevel": 2,
    "DateCreated": "2020-03-15T10:54:00Z",
    "SubmissionStatusTypeID": 100
}