{
    "IsRecentlyVerified": false,
    "ID": 110860,
    "UUID": "064589A6-6F36-4534-9ABA-947C22913479",
    "DataProviderID": 2,
    "DataProvidersReference": "83310",
    "UsageTypeID": 1,
    "AddressInfo": {
        "ID": 111206,
        "Title": "Stratford-Perth Museum",
        "AddressLine1": "4275 Huron St",
        "Town": "Stratford",
        "StateOrProvince": "ON",
        "Postcode": "N5A 6S6",
        "CountryID": 44,
        "Latitude": 43.3844692,
        "Longitude": -81.0128508,
        "ContactTelephone1": "519-393-5311",
        "AccessComments": "24 hours daily",
        "RelatedURL": "",
        "DistanceUnit": 0
    },
    "Connections": [
        {
            "ID": 156168,
            "ConnectionTypeID": 1,
            "LevelID": 2,
            "Amps": 16,
            "Voltage": 230,
            "PowerKW": 3.7,
            "CurrentTypeID": 10,
            "Quantity": 1
        }
    ],
    "DateLastStatusUpdate": "2020-06-26T03:07:00Z",
    "DataQualityLevel": 3,
    "DateCreated": "2018-10-18T23:36:00Z",
    "SubmissionStatusTypeID": 100
}