{
    "MediaItems": [
        {
            "ID": 28661,
            "ChargePointID": 145315,
            "ItemURL": "https://s3-ap-southeast-2.amazonaws.com/openchargemap/images/US/OCM145315/OCM-145315.orig.2021071802202985.jpg",
            "ItemThumbnailURL": "https://s3-ap-southeast-2.amazonaws.com/openchargemap/images/US/OCM145315/OCM-145315.thmb.2021071802202985.jpg",
            "Comment": "",
            "IsEnabled": true,
            "IsVideo": false,
            "IsFeaturedItem": false,
            "IsExternalResource": false,
            "User": {
                "ID": 33325,
                "Username": "The EV Guy"
            },
            "DateCreated": "2021-07-18T02:21:00Z"
        }
    ],
    "IsRecentlyVerified": false,
    "ID": 145315,
    "UUID": "DBE29D5F-B91E-4351-955D-30B6B829857C",
    "DataProviderID": 2,
    "DataProvidersReference": "147131",
    "OperatorID": 3318,
    "UsageTypeID": 1,
    "AddressInfo": {
        "ID": 145667,
        "Title": "Target T0627 - Tukwila, WA",
        "AddressLine1": "301 Strander Blvd.",
        "Town": "Tukwila",
        "StateOrProvince": "WA",
        "Postcode": "98188",
        "CountryID": 2,
        "Latitude": 47.455711,
        "Longitude": -122.25738,
        "ContactTelephone1": "833-632-2778",
        "AccessComments": "24 hours daily",
        "RelatedURL": "https://www.electrifyamerica.com/",
        "DistanceUnit": 0
    },
    "Connections": [
        {
            "ID": 201961,
            "ConnectionTypeID": 2,
            "LevelID": 3,
            "Amps": 100,
            "Voltage": 400,
            "PowerKW": 40,
            "CurrentTypeID": 30,
            "Quantity": 1
        },
        {
            "ID": 201962,
            "ConnectionTypeID": 32,
            "LevelID": 3,
            "Amps": 100,
            "Voltage": 400,
            "PowerKW": 40,
            "CurrentTypeID": 30,
            "Quantity": 1
        }
    ],
    "StatusTypeID": 50,
    "DateLastStatusUpdate": "2021-07-18T02:21:00Z",
    "DataQualityLevel": 3,
    "DateCreated": "2019-12-24T09:24:00Z",
    "SubmissionStatusTypeID": 100
}