{
    "UserComments": [
        {
            "ID": 20606,
            "ChargePointID": 114468,
            "CommentTypeID": 10,
            "UserName": "Clara VDS",
            "Comment": "Laden met laadpas (Blue Corner, Mobility+)",
            "Rating": 4,
            "DateCreated": "2019-01-08T09:36:28.517Z",
            "User": {
                "ID": 19714,
                "Username": "Clara VDS"
            },
            "CheckinStatusTypeID": 10
        }
    ],
    "MediaItems": [
        {
            "ID": 17380,
            "ChargePointID": 114468,
            "ItemURL": "https://s3-ap-southeast-2.amazonaws.com/openchargemap/images/BE/OCM114468/OCM-114468.orig.2019010810210687.jpg",
            "ItemThumbnailURL": "https://s3-ap-southeast-2.amazonaws.com/openchargemap/images/BE/OCM114468/OCM-114468.thmb.2019010810210687.jpg",
            "Comment": "",
            "IsEnabled": true,
            "IsVideo": false,
            "IsFeaturedItem": false,
            "IsExternalResource": false,
            "User": {
                "ID": 19714,
                "Username": "Clara VDS"
            },
            "DateCreated": "2019-01-08T10:21:00Z"
        },
        {
            "ID": 17379,
            "ChargePointID": 114468,
            "ItemURL": "https://s3-ap-southeast-2.amazonaws.com/openchargemap/images/BE/OCM114468/OCM-114468.orig.2019010810192899.jpg",
            "ItemThumbnailURL": "https://s3-ap-southeast-2.amazonaws.com/openchargemap/images/BE/OCM114468/OCM-114468.thmb.2019010810192899.jpg",
            "Comment": "",
            "IsEnabled": true,
            "IsVideo": false,
            "IsFeaturedItem": false,
            "IsExternalResource": false,
            "User": {
                "ID": 19714,
                "Username": "Clara VDS"
            },
            "DateCreated": "2019-01-08T10:20:00Z"
        }
    ],
    "IsRecentlyVerified": false,
    "ID": 114468,
    "UUID": "E5719743-7256-44A5-B6E6-87E3C383B324",
    "DataProviderID": 1,
    "OperatorID": 103,
    "UsageTypeID": 1,
    "AddressInfo": {
        "ID": 114814,
        "Title": "Dendermondsesteenweg 135",
        "AddressLine1": "Dendermondsesteenweg 135",
        "Town": "Ghent",
        "StateOrProvince": "Gent",
        "Postcode": "9000",
        "CountryID": 26,
        "Latitude": 51.0542978042039,
        "Longitude": 3.74300877829591,
        "AccessComments": "Nabij Kruitvat en fietsenwinkel Upcycling",
        "DistanceUnit": 0
    },
    "Connections": [
        {
            "ID": 161138,
            "ConnectionTypeID": 25,
            "StatusTypeID": 50,
            "LevelID": 2,
            "Amps": 16,
            "Voltage": 400,
            "PowerKW": 11,
            "CurrentTypeID": 20,
            "Quantity": 2
        }
    ],
    "NumberOfPoints": 2,
    "StatusTypeID": 50,
    "DateLastStatusUpdate": "2019-01-08T10:47:00Z",
    "DataQualityLevel": 1,
    "DateCreated": "2019-01-08T09:35:00Z",
    "SubmissionStatusTypeID": 200
}