{
    "UserComments": [
        {
            "ID": 24948,
            "ChargePointID": 146400,
            "CommentTypeID": 10,
            "UserName": "ForumElettrico.it",
            "Comment": "A 3 km dall'Outlet Vicolungo dove esiste già un'altra fast: leggi la recensione completa qui https://www.forumelettrico.it/forum/fast-enelx-recetto-sp16-t8611.html",
            "RelatedURL": "https://www.forumelettrico.it/forum/fast-enelx-recetto-sp16-t8611.html",
            "DateCreated": "2021-10-14T06:19:10.523Z",
            "User": {
                "ID": 11749,
                "Username": "ForumElettrico.it"
            },
            "CheckinStatusTypeID": 10,
            "IsActionedByEditor": false
        }
    ],
    "MediaItems": [
        {
            "ID": 29519,
            "ChargePointID": 146400,
            "ItemURL": "https://s3-ap-southeast-2.amazonaws.com/openchargemap/images/IT/OCM146400/OCM-146400.orig.2021101406193409.jpg",
            "ItemThumbnailURL": "https://s3-ap-southeast-2.amazonaws.com/openchargemap/images/IT/OCM146400/OCM-146400.thmb.2021101406193409.jpg",
            "Comment": "",
            "IsEnabled": true,
            "IsVideo": false,
            "IsFeaturedItem": false,
            "IsExternalResource": false,
            "User": {
                "ID": 11749,
                "Username": "ForumElettrico.it"
            },
            "DateCreated": "2021-10-14T06:20:00Z"
        },
        {
            "ID": 29520,
            "ChargePointID": 146400,
            "ItemURL": "https://s3-ap-southeast-2.amazonaws.com/openchargemap/images/IT/OCM146400/OCM-146400.orig.2021101406194177.jpg",
            "ItemThumbnailURL": "https://s3-ap-southeast-2.amazonaws.com/openchargemap/images/IT/OCM146400/OCM-146400.thmb.2021101406194177.jpg",
            "Comment": "",
            "IsEnabled": true,
            "IsVideo": false,
            "IsFeaturedItem": false,
            "IsExternalResource": false,
            "User": {
                "ID": 11749,
                "Username": "ForumElettrico.it"
            },
            "DateCreated": "2021-10-14T06:20:00Z"
        },
        {
            "ID": 29517,
            "ChargePointID": 146400,
            "ItemURL": "https://s3-ap-southeast-2.amazonaws.com/openchargemap/images/IT/OCM146400/OCM-146400.orig.2021101406192353.jpg",
            "ItemThumbnailURL": "https://s3-ap-southeast-2.amazonaws.com/openchargemap/images/IT/OCM146400/OCM-146400.thmb.2021101406192353.jpg",
            "Comment": "",
            "IsEnabled": true,
            "IsVideo": false,
            "IsFeaturedItem": false,
            "IsExternalResource": false,
            "User": {
                "ID": 11749,
                "Username": "ForumElettrico.it"
            },
            "DateCreated": "2021-10-14T06:19:00Z"
        },
        {
            "ID": 29518,
            "ChargePointID": 146400,
            "ItemURL": "https://s3-ap-southeast-2.amazonaws.com/openchargemap/images/IT/OCM146400/OCM-146400.orig.2021101406192864.jpg",
            "ItemThumbnailURL": "https://s3-ap-southeast-2.amazonaws.com/openchargemap/images/IT/OCM146400/OCM-146400.thmb.2021101406192864.jpg",
            "Comment": "",
            "IsEnabled": true,
            "IsVideo": false,
            "IsFeaturedItem": false,
            "IsExternalResource": false,
            "User": {
                "ID": 11749,
                "Username": "ForumElettrico.it"
            },
            "DateCreated": "2021-10-14T06:19:00Z"
        }
    ],
    "IsRecentlyVerified": false,
    "ID": 146400,
    "UUID": "212DEDCA-1AAD-4CD1-9B9C-E2164EBEDC2A",
    "DataProviderID": 1,
    "OperatorID": 80,
    "UsageTypeID": 4,
    "UsageCost": "0,50€/kW",
    "AddressInfo": {
        "ID": 146753,
        "Title": "ADS Capozi Autotrasporti GNL | EnelX",
        "AddressLine1": "SP16 Strada Provinciale Biandrate-Recetto, 25",
        "Town": "Recetto",
        "StateOrProvince": "NO",
        "Postcode": "28060",
        "CountryID": 112,
        "Latitude": 45.45650485193147,
        "Longitude": 8.443324876393262,
        "RelatedURL": "https://www.enelx.com/it/it/emobility",
        "DistanceUnit": 0
    },
    "Connections": [
        {
            "ID": 203524,
            "ConnectionTypeID": 1036,
            "StatusTypeID": 50,
            "LevelID": 3,
            "Amps": 64,
            "Voltage": 400,
            "PowerKW": 43,
            "CurrentTypeID": 20,
            "Quantity": 1
        },
        {
            "ID": 203525,
            "ConnectionTypeID": 33,
            "StatusTypeID": 50,
            "LevelID": 3,
            "Amps": 120,
            "Voltage": 500,
            "PowerKW": 50,
            "CurrentTypeID": 30,
            "Quantity": 1
        },
        {
            "ID": 203526,
            "ConnectionTypeID": 2,
            "StatusTypeID": 50,
            "LevelID": 3,
            "Amps": 120,
            "Voltage": 500,
            "PowerKW": 50,
            "CurrentTypeID": 30,
            "Quantity": 1
        }
    ],
    "NumberOfPoints": 2,
    "StatusTypeID": 50,
    "DateLastStatusUpdate": "2021-10-14T06:20:00Z",
    "DataQualityLevel": 1,
    "DateCreated": "2020-01-09T16:44:00Z",
    "SubmissionStatusTypeID": 200
}