{
    "IsRecentlyVerified": false,
    "ID": 152827,
    "UUID": "7A9AE797-B86D-49CA-8BA5-9CC71C9CBE95",
    "DataProviderID": 28,
    "DataProvidersReference": "FRS1801501",
    "UsageTypeID": 5,
    "AddressInfo": {
        "ID": 153180,
        "Title": "Aubigny - Palais omnisports",
        "AddressLine1": "Le Mail Guichard - 18700 AUBIGNY-SUR-NERE",
        "CountryID": 80,
        "Latitude": 47.4912269,
        "Longitude": 2.4378559,
        "AccessComments": "24h/24h",
        "DistanceUnit": 0
    },
    "Connections": [
        {
            "ID": 214124,
            "ConnectionTypeID": 25,
            "StatusTypeID": 50,
            "LevelID": 2,
            "PowerKW": 18,
            "CurrentTypeID": 20
        },
        {
            "ID": 247359,
            "ConnectionTypeID": 25,
            "StatusTypeID": 50,
            "LevelID": 2,
            "PowerKW": 18,
            "CurrentTypeID": 20
        }
    ],
    "GeneralComments": "Borne en service",
    "StatusTypeID": 50,
    "DateLastStatusUpdate": "2020-08-27T05:13:00Z",
    "DataQualityLevel": 2,
    "DateCreated": "2020-03-15T10:54:00Z",
    "SubmissionStatusTypeID": 100
}