{
    "IsRecentlyVerified": false,
    "ID": 154107,
    "UUID": "58AF5EC9-64AD-41B4-9F93-887D0A13B8B0",
    "DataProviderID": 28,
    "DataProvidersReference": "FR*S27*PGAILLON*MAISONMEDIC",
    "UsageTypeID": 5,
    "AddressInfo": {
        "ID": 154460,
        "Title": "900005",
        "AddressLine1": "Rue R.Roche Gaillon",
        "CountryID": 80,
        "Latitude": 49.164969,
        "Longitude": 1.341375,
        "AccessComments": "24/24 7/7 jours",
        "DistanceUnit": 0
    },
    "Connections": [
        {
            "ID": 216583,
            "ConnectionTypeID": 28,
            "StatusTypeID": 50,
            "LevelID": 2,
            "PowerKW": 22,
            "CurrentTypeID": 10
        },
        {
            "ID": 216584,
            "ConnectionTypeID": 26,
            "StatusTypeID": 50,
            "LevelID": 2,
            "PowerKW": 22
        },
        {
            "ID": 250930,
            "ConnectionTypeID": 26,
            "StatusTypeID": 50,
            "LevelID": 2,
            "PowerKW": 22
        },
        {
            "ID": 250931,
            "ConnectionTypeID": 28,
            "StatusTypeID": 50,
            "LevelID": 2,
            "PowerKW": 22,
            "CurrentTypeID": 10
        }
    ],
    "GeneralComments": "Borne en service",
    "StatusTypeID": 50,
    "DateLastStatusUpdate": "2020-08-27T05:16:00Z",
    "DataQualityLevel": 2,
    "DateCreated": "2020-03-15T10:54:00Z",
    "SubmissionStatusTypeID": 100
}