{
    "IsRecentlyVerified": false,
    "ID": 31773,
    "UUID": "D62A3A75-870B-404F-AED4-56337D48C2C6",
    "DataProviderID": 1,
    "OperatorID": 86,
    "OperatorsReference": "EnWB Liebknechtstraße",
    "UsageTypeID": 4,
    "AddressInfo": {
        "ID": 32119,
        "Title": "Deutsche BKK",
        "AddressLine1": "Liebknechtstraße 29",
        "Town": "Stuttgart",
        "Postcode": "70565",
        "CountryID": 87,
        "Latitude": 48.72492,
        "Longitude": 9.11247,
        "AccessComments": "Ladeweile: Öffentliche Kantine direkt nebenan in der Deutschen BKK, Mo-Fr 11:30-13:30 (ab 12:30 für Gäste). Eingang über großen Parkplatz neben der Ladesäule.",
        "RelatedURL": "http://www.enbw.com/",
        "DistanceUnit": 0
    },
    "Connections": [
        {
            "ID": 35284,
            "ConnectionTypeID": 25,
            "StatusTypeID": 50,
            "LevelID": 2,
            "Amps": 32,
            "Voltage": 400,
            "PowerKW": 22,
            "CurrentTypeID": 20,
            "Quantity": 2
        }
    ],
    "NumberOfPoints": 2,
    "GeneralComments": "Am Fußgängerweg an der Deutschen BKK. Ladekarte der EnBW oder Ladenetz, The New Motion, PlugSurfing oder Elektronauten Ladekarte erforderlich.",
    "StatusTypeID": 50,
    "DateLastStatusUpdate": "2016-03-17T07:48:00Z",
    "DataQualityLevel": 3,
    "DateCreated": "2015-01-09T06:03:00Z",
    "SubmissionStatusTypeID": 200
}