{
    "IsRecentlyVerified": false,
    "ID": 150919,
    "UUID": "F06BAB14-7A57-4957-9A19-93C693E7644A",
    "DataProviderID": 28,
    "DataProvidersReference": "FR*SOD*S*WIIZ*94*1*_*_",
    "UsageTypeID": 5,
    "AddressInfo": {
        "ID": 151272,
        "Title": "Peymeinade ",
        "AddressLine1": "Boulevard des 5 Communes",
        "CountryID": 80,
        "Latitude": 43.645291,
        "Longitude": 6.891292,
        "AccessComments": "24h/24 ",
        "DistanceUnit": 0
    },
    "Connections": [
        {
            "ID": 210271,
            "ConnectionTypeID": 28,
            "LevelID": 2,
            "PowerKW": 22,
            "CurrentTypeID": 10
        },
        {
            "ID": 210272,
            "ConnectionTypeID": 25,
            "LevelID": 2,
            "PowerKW": 22,
            "CurrentTypeID": 10
        }
    ],
    "GeneralComments": "badge, appli et QR code ",
    "StatusTypeID": 50,
    "DateLastStatusUpdate": "2020-03-15T06:17:00Z",
    "DataQualityLevel": 2,
    "DateCreated": "2020-03-15T06:17:00Z",
    "SubmissionStatusTypeID": 100
}