{
    "IsRecentlyVerified": false,
    "ID": 155348,
    "UUID": "02205141-6D5B-49C8-A88A-8E68D24E780C",
    "DataProviderID": 1,
    "OperatorID": 32,
    "UsageTypeID": 5,
    "UsageCost": "£0.30/kWh (Contactless Payment); £0.15/kWh (Polar Plus subscription); £0.25/kWh (Polar Instant app)",
    "AddressInfo": {
        "ID": 155702,
        "Title": "The Bingham Townhouse Hotel",
        "AddressLine1": "5 Market Street",
        "Town": "Bingham",
        "Postcode": "NG13 8AB",
        "CountryID": 1,
        "Latitude": 52.95149412757209,
        "Longitude": -0.952250386386936,
        "ContactTelephone1": "0330 016 5126",
        "RelatedURL": "http://www.polar-network.com",
        "DistanceUnit": 0
    },
    "Connections": [
        {
            "ID": 218714,
            "ConnectionTypeID": 33,
            "StatusTypeID": 50,
            "LevelID": 3,
            "PowerKW": 50,
            "CurrentTypeID": 30,
            "Quantity": 1
        },
        {
            "ID": 218715,
            "ConnectionTypeID": 2,
            "StatusTypeID": 50,
            "LevelID": 3,
            "PowerKW": 50,
            "CurrentTypeID": 30,
            "Quantity": 1
        },
        {
            "ID": 218716,
            "ConnectionTypeID": 1036,
            "StatusTypeID": 50,
            "LevelID": 3,
            "Amps": 63,
            "Voltage": 400,
            "PowerKW": 43,
            "CurrentTypeID": 20,
            "Quantity": 1
        }
    ],
    "NumberOfPoints": 1,
    "StatusTypeID": 50,
    "DateLastStatusUpdate": "2020-10-02T10:51:00Z",
    "DataQualityLevel": 1,
    "DateCreated": "2020-04-07T09:40:00Z",
    "SubmissionStatusTypeID": 200
}