{
    "IsRecentlyVerified": false,
    "ID": 30137,
    "UUID": "5537B6E5-80DC-4F9D-9007-39B27BC70CFE",
    "DataProviderID": 1,
    "DataProvidersReference": "CBR-00001",
    "OperatorID": 21,
    "UsageTypeID": 4,
    "UsageCost": "Mobi.E compatible card",
    "AddressInfo": {
        "ID": 30483,
        "Title": "CBR-00001",
        "AddressLine1": "Rua Olímpio Nicolau Fernandes",
        "Town": "Coimbra",
        "Postcode": "3000-303",
        "CountryID": 180,
        "Latitude": 40.2116792,
        "Longitude": -8.4263217,
        "RelatedURL": "http://www.mobie.pt",
        "DistanceUnit": 0
    },
    "Connections": [
        {
            "ID": 33122,
            "ConnectionTypeID": 25,
            "StatusTypeID": 50,
            "LevelID": 2,
            "Amps": 16,
            "Voltage": 230,
            "PowerKW": 3.7,
            "CurrentTypeID": 10,
            "Quantity": 4
        }
    ],
    "NumberOfPoints": 4,
    "StatusTypeID": 50,
    "DateLastStatusUpdate": "2021-01-21T23:05:00Z",
    "DataQualityLevel": 3,
    "DateCreated": "2014-11-29T14:48:00Z",
    "SubmissionStatusTypeID": 100
}