{
    "IsRecentlyVerified": false,
    "ID": 48865,
    "UUID": "3255E959-9BB5-41A2-8318-EE09F31A47C7",
    "DataProviderID": 1,
    "OperatorID": 150,
    "OperatorsReference": "Trowbridge Train Station",
    "UsageTypeID": 0,
    "UsageCost": "Free",
    "AddressInfo": {
        "ID": 49211,
        "Title": "Trowbridge Railway Station",
        "AddressLine1": "Station Approach",
        "Town": "Trowbridge",
        "Postcode": "BA14 8HW",
        "CountryID": 1,
        "Latitude": 51.319684,
        "Longitude": -2.213762,
        "RelatedURL": "http://www.chargepointservices.co.uk",
        "DistanceUnit": 0
    },
    "Connections": [
        {
            "ID": 60383,
            "ConnectionTypeID": 25,
            "StatusTypeID": 50,
            "LevelID": 2,
            "Amps": 32,
            "Voltage": 400,
            "PowerKW": 22,
            "CurrentTypeID": 20,
            "Quantity": 2
        }
    ],
    "NumberOfPoints": 2,
    "GeneralComments": "GE Industrial Durastation charge point",
    "StatusTypeID": 0,
    "DateLastStatusUpdate": "2018-11-02T08:44:00Z",
    "MetadataValues": [
        {
            "ID": 1684,
            "MetadataFieldID": 4,
            "ItemValue": "Contains public sector information licensed under the Open Government Licence v2.0. http://www.nationalarchives.gov.uk/doc/open-government-licence/version/2/"
        }
    ],
    "DataQualityLevel": 3,
    "DateCreated": "2015-07-04T08:17:00Z",
    "SubmissionStatusTypeID": 100
}