{
    "IsRecentlyVerified": false,
    "ID": 183797,
    "UUID": "2C00C389-35F5-4645-AD69-F548BE183DD7",
    "DataProviderID": 29,
    "DataProvidersReference": "16453",
    "OperatorID": 86,
    "AddressInfo": {
        "ID": 184156,
        "Title": "Epplestraße Nr. 55",
        "AddressLine1": "Epplestraße Nr. 55",
        "Town": "Stuttgart",
        "Postcode": "70587",
        "CountryID": 87,
        "Latitude": 48.743641,
        "Longitude": 9.168953,
        "DistanceUnit": 0
    },
    "Connections": [
        {
            "ID": 291229,
            "ConnectionTypeID": 33,
            "StatusTypeID": 50,
            "LevelID": 3,
            "PowerKW": 300,
            "CurrentTypeID": 30
        },
        {
            "ID": 291230,
            "ConnectionTypeID": 33,
            "StatusTypeID": 50,
            "LevelID": 3,
            "PowerKW": 300,
            "CurrentTypeID": 30
        }
    ],
    "StatusTypeID": 50,
    "DateLastStatusUpdate": "2021-07-12T02:41:00Z",
    "MetadataValues": [
        {
            "ID": 16090,
            "MetadataFieldID": 4,
            "ItemValue": "Data from the German chargepoint registry provided by Bundesnetzagentur.de under the CC-BY 4.0 license"
        }
    ],
    "DataQualityLevel": 3,
    "DateCreated": "2021-07-08T10:04:00Z",
    "SubmissionStatusTypeID": 100
}