{
    "IsRecentlyVerified": false,
    "ID": 167130,
    "UUID": "9E34BC63-28D2-4872-88B7-C39DB589B1FE",
    "DataProviderID": 1,
    "OperatorID": 1,
    "UsageTypeID": 6,
    "AddressInfo": {
        "ID": 167489,
        "Title": "Colson Road",
        "AddressLine1": "Colson Road",
        "AddressLine2": "Addiscombe",
        "Town": "London Borough of Croydon",
        "StateOrProvince": "England",
        "Postcode": "CR0 6UA",
        "CountryID": 1,
        "Latitude": 51.376011,
        "Longitude": -0.090191,
        "DistanceUnit": 0
    },
    "Connections": [],
    "NumberOfPoints": 1,
    "StatusTypeID": 50,
    "DateLastStatusUpdate": "2020-08-27T11:13:00Z",
    "DataQualityLevel": 1,
    "DateCreated": "2020-08-27T08:17:00Z",
    "SubmissionStatusTypeID": 200
}