{
    "UserComments": [
        {
            "ID": 14158,
            "ChargePointID": 47164,
            "CommentTypeID": 10,
            "UserName": "Gavin Fraser",
            "Comment": "Never managed to charge here, every occasion spaces occupied by non EV vehicles. No enforcement seems to be taking place.",
            "Rating": 3,
            "DateCreated": "2016-08-27T14:10:50.793Z",
            "User": {
                "ID": 11776,
                "Username": "Gavin Fraser"
            },
            "CheckinStatusTypeID": 110
        },
        {
            "ID": 6304,
            "ChargePointID": 47164,
            "CommentTypeID": 10,
            "UserName": "Trevor Finnerty",
            "Comment": "Located close to the shop enterance so during the day it's impossible to charge as anyone parks there and won't move! Late evening or during the night a better chance to charge while you shop. Putting bollards in the parking bays has been suggested to Asda as most are too lazy to move them but would keep the bay's free for EV users",
            "Rating": 1,
            "DateCreated": "2015-08-25T13:29:23.203Z",
            "User": {
                "ID": 6273,
                "Username": "Trevor Finnerty"
            },
            "CheckinStatusTypeID": 110
        }
    ],
    "MediaItems": [
        {
            "ID": 3443,
            "ChargePointID": 47164,
            "ItemURL": "https://s3-ap-southeast-2.amazonaws.com/openchargemap/images/GB/OCM47164/OCM-47164.orig.2015102411222132.jpeg",
            "ItemThumbnailURL": "https://s3-ap-southeast-2.amazonaws.com/openchargemap/images/GB/OCM47164/OCM-47164.thmb.2015102411222132.jpeg",
            "Comment": "Difficult to find a empty bay due to anyone parking. Sometimes if lucky one may be available but easier in the evening",
            "IsEnabled": true,
            "IsVideo": false,
            "IsFeaturedItem": false,
            "IsExternalResource": false,
            "User": {
                "ID": 6273,
                "Username": "Trevor Finnerty"
            },
            "DateCreated": "2015-10-24T11:23:00Z"
        }
    ],
    "IsRecentlyVerified": false,
    "ID": 47164,
    "UUID": "7AC50A45-2BD3-4EF7-997C-F6873E5A22B9",
    "DataProviderID": 1,
    "OperatorID": 32,
    "OperatorsReference": "2605,2606",
    "UsageTypeID": 4,
    "UsageCost": "Inclusive; for Polar Plus subscription members only",
    "AddressInfo": {
        "ID": 47510,
        "Title": "ASDA Nuneaton Superstore",
        "AddressLine1": "Newtown Road",
        "Town": "Nuneaton",
        "Postcode": "CV11 4FL",
        "CountryID": 1,
        "Latitude": 52.526947,
        "Longitude": -1.46658,
        "ContactTelephone1": "024 7637 4757",
        "RelatedURL": "http://storelocator.asda.com/store/nuneaton",
        "DistanceUnit": 0
    },
    "Connections": [
        {
            "ID": 58126,
            "ConnectionTypeID": 25,
            "StatusTypeID": 50,
            "LevelID": 2,
            "Amps": 32,
            "Voltage": 230,
            "PowerKW": 7,
            "CurrentTypeID": 10,
            "Quantity": 4
        }
    ],
    "NumberOfPoints": 4,
    "StatusTypeID": 50,
    "DateLastStatusUpdate": "2019-03-06T06:21:00Z",
    "DataQualityLevel": 1,
    "DateCreated": "2015-05-15T12:40:00Z",
    "SubmissionStatusTypeID": 200
}