{
    "IsRecentlyVerified": false,
    "ID": 97578,
    "UUID": "771B19E6-50DB-4CF1-A900-9824FDE2626D",
    "DataProviderID": 1,
    "OperatorID": 23,
    "OperatorsReference": "39283",
    "UsageTypeID": 4,
    "AddressInfo": {
        "ID": 97924,
        "Title": "James Madison's Montpelier",
        "AddressLine1": "11350 Constitution Hwy",
        "Town": "Montpelier Station",
        "StateOrProvince": "Virginia",
        "Postcode": "22957",
        "CountryID": 2,
        "Latitude": 38.217746,
        "Longitude": -78.171122,
        "ContactTelephone1": "(540) 672-2728",
        "DistanceUnit": 0
    },
    "Connections": [
        {
            "ID": 138485,
            "ConnectionTypeID": 30,
            "StatusTypeID": 50,
            "LevelID": 2,
            "PowerKW": 16,
            "CurrentTypeID": 20,
            "Quantity": 4
        }
    ],
    "NumberOfPoints": 4,
    "GeneralComments": "4 Tesla Connectors, up to 16kW.Available to the public. Self park.",
    "StatusTypeID": 50,
    "DateLastStatusUpdate": "2018-01-21T15:48:00Z",
    "DataQualityLevel": 1,
    "DateCreated": "2018-01-21T15:48:00Z",
    "SubmissionStatusTypeID": 200
}