{
    "IsRecentlyVerified": false,
    "ID": 167412,
    "UUID": "D1E21FB7-2800-40C7-879A-E4193814EBEE",
    "DataProviderID": 18,
    "DataProvidersReference": "c93b785af09efd8d67b53eb2923b2099",
    "OperatorID": 25,
    "UsageTypeID": 4,
    "AddressInfo": {
        "ID": 167771,
        "Title": "South Parade (K&C)",
        "AddressLine1": "South Parade (K&C)",
        "Town": "K&C",
        "Postcode": "SW3 6LP",
        "CountryID": 1,
        "Latitude": 51.489438,
        "Longitude": -0.174396,
        "AccessComments": "",
        "RelatedURL": "https://www.sourcelondon.net",
        "DistanceUnit": 0
    },
    "Connections": [
        {
            "ID": 253566,
            "ConnectionTypeID": 25,
            "Reference": "1",
            "StatusTypeID": 50,
            "LevelID": 2,
            "Amps": 32,
            "Voltage": 400,
            "PowerKW": 22,
            "CurrentTypeID": 20
        },
        {
            "ID": 253567,
            "ConnectionTypeID": 25,
            "Reference": "2",
            "StatusTypeID": 50,
            "LevelID": 2,
            "Amps": 32,
            "Voltage": 230,
            "PowerKW": 7,
            "CurrentTypeID": 10
        },
        {
            "ID": 253568,
            "ConnectionTypeID": 1,
            "Reference": "3",
            "StatusTypeID": 50,
            "LevelID": 2,
            "Amps": 13,
            "Voltage": 230,
            "PowerKW": 3,
            "CurrentTypeID": 10
        }
    ],
    "StatusTypeID": 0,
    "DateLastStatusUpdate": "2020-09-08T02:47:00Z",
    "MetadataValues": [
        {
            "ID": 7953,
            "MetadataFieldID": 4,
            "ItemValue": "Contains public sector information licensed under the Open Government Licence v2.0. http://www.nationalarchives.gov.uk/doc/open-government-licence/version/2/"
        }
    ],
    "DataQualityLevel": 3,
    "DateCreated": "2020-09-08T02:47:00Z",
    "SubmissionStatusTypeID": 100
}