{
    "IsRecentlyVerified": false,
    "ID": 62765,
    "UUID": "FED819B9-6763-4712-93A5-847F029CCE89",
    "DataProviderID": 26,
    "DataProvidersReference": "1154",
    "OperatorID": 162,
    "OperatorsReference": "GARAGE PIEREN AG",
    "UsageCost": "0.00 onbekend",
    "AddressInfo": {
        "ID": 63111,
        "Title": "Thunstrasse",
        "AddressLine1": "Thunstrasse",
        "Town": "Thierachern",
        "Postcode": "3603",
        "CountryID": 217,
        "Latitude": 46.755314,
        "Longitude": 7.585985,
        "RelatedURL": "http://www.chademo.com",
        "DistanceUnit": 0
    },
    "Connections": [
        {
            "ID": 79704,
            "ConnectionTypeID": 2,
            "LevelID": 3,
            "PowerKW": 50,
            "CurrentTypeID": 30
        },
        {
            "ID": 95296,
            "ConnectionTypeID": 2,
            "LevelID": 3,
            "PowerKW": 50,
            "CurrentTypeID": 30
        }
    ],
    "NumberOfPoints": 1,
    "StatusTypeID": 50,
    "DateLastStatusUpdate": "2016-06-04T02:37:00Z",
    "DataQualityLevel": 3,
    "DateCreated": "2016-03-03T12:29:00Z",
    "SubmissionStatusTypeID": 100
}