{
    "IsRecentlyVerified": false,
    "ID": 181078,
    "UUID": "4C7B1F39-CC7D-483B-BD3F-3482B326960F",
    "DataProviderID": 29,
    "DataProvidersReference": "543",
    "AddressInfo": {
        "ID": 181437,
        "Title": "Schloßgasse",
        "AddressLine1": "Schloßgasse",
        "Town": "Römhild",
        "Postcode": "98630",
        "CountryID": 87,
        "Latitude": 50.396445,
        "Longitude": 10.53985,
        "DistanceUnit": 0
    },
    "Connections": [
        {
            "ID": 284941,
            "ConnectionTypeID": 25,
            "StatusTypeID": 50,
            "LevelID": 2,
            "PowerKW": 22,
            "CurrentTypeID": 20
        },
        {
            "ID": 284942,
            "ConnectionTypeID": 25,
            "StatusTypeID": 50,
            "LevelID": 2,
            "PowerKW": 22,
            "CurrentTypeID": 20
        }
    ],
    "StatusTypeID": 50,
    "DateLastStatusUpdate": "2021-07-09T03:19:00Z",
    "MetadataValues": [
        {
            "ID": 13372,
            "MetadataFieldID": 4,
            "ItemValue": "Data from the German chargepoint registry provided by Bundesnetzagentur.de under the CC-BY 4.0 license"
        }
    ],
    "DataQualityLevel": 3,
    "DateCreated": "2021-07-08T10:01:00Z",
    "SubmissionStatusTypeID": 100
}