{
    "IsRecentlyVerified": false,
    "ID": 143351,
    "UUID": "EE8B2A45-B255-463D-B212-13C652BB3EA7",
    "DataProviderID": 2,
    "DataProvidersReference": "147783",
    "OperatorID": 39,
    "UsageTypeID": 1,
    "AddressInfo": {
        "ID": 143703,
        "Title": "Leader Lights Properties",
        "AddressLine1": "2450 44th Street Southeast",
        "Town": "Grand Rapids",
        "StateOrProvince": "MI",
        "Postcode": "49512",
        "CountryID": 2,
        "Latitude": 42.8830324,
        "Longitude": -85.6055922,
        "ContactTelephone1": "800-663-5633",
        "AccessComments": "MO: Not Specified; TU: Not Specified; WE: Not Specified; TH: Not Specified; FR: Not Specified; SA: Not Specified; SU: Not Specified",
        "RelatedURL": "http://www.semacharge.com/",
        "DistanceUnit": 0
    },
    "Connections": [
        {
            "ID": 199652,
            "ConnectionTypeID": 1,
            "LevelID": 2,
            "Amps": 16,
            "Voltage": 230,
            "PowerKW": 3.7,
            "CurrentTypeID": 10,
            "Quantity": 2
        }
    ],
    "StatusTypeID": 50,
    "DateLastStatusUpdate": "2020-06-26T03:06:00Z",
    "DataQualityLevel": 3,
    "DateCreated": "2019-12-24T09:21:00Z",
    "SubmissionStatusTypeID": 100
}