{
    "IsRecentlyVerified": false,
    "ID": 154556,
    "UUID": "01A339D0-78AD-4C11-A299-F0805FBA4660",
    "DataProviderID": 1,
    "OperatorID": 20,
    "UsageTypeID": 5,
    "AddressInfo": {
        "ID": 154909,
        "Title": "Christchurch, Saxon Square Multi-Storey Car Park",
        "AddressLine1": "Christchurch, Saxon Square Multi-Storey Car Park",
        "Town": "Christchurch",
        "Postcode": "BH23 1QA",
        "CountryID": 1,
        "Latitude": 50.73548,
        "Longitude": -1.77691,
        "AccessComments": "",
        "RelatedURL": "http://www.chargeyourcar.org.uk",
        "DistanceUnit": 0
    },
    "Connections": [
        {
            "ID": 217377,
            "ConnectionTypeID": 2,
            "Reference": "1",
            "StatusTypeID": 50,
            "LevelID": 3,
            "Amps": 125,
            "Voltage": 400,
            "PowerKW": 50,
            "CurrentTypeID": 30
        },
        {
            "ID": 217378,
            "ConnectionTypeID": 33,
            "Reference": "2",
            "StatusTypeID": 50,
            "LevelID": 3,
            "Amps": 125,
            "Voltage": 400,
            "PowerKW": 50,
            "CurrentTypeID": 30
        },
        {
            "ID": 217379,
            "ConnectionTypeID": 1036,
            "Reference": "3",
            "StatusTypeID": 50,
            "LevelID": 3,
            "Amps": 63,
            "Voltage": 400,
            "PowerKW": 43,
            "CurrentTypeID": 20
        }
    ],
    "StatusTypeID": 50,
    "DateLastStatusUpdate": "2020-11-24T17:24:00Z",
    "MetadataValues": [
        {
            "ID": 7109,
            "MetadataFieldID": 4,
            "ItemValue": "Contains public sector information licensed under the Open Government Licence v2.0. http://www.nationalarchives.gov.uk/doc/open-government-licence/version/2/"
        }
    ],
    "DataQualityLevel": 3,
    "DateCreated": "2020-03-17T08:14:00Z",
    "SubmissionStatusTypeID": 100
}