{
    "IsRecentlyVerified": false,
    "ID": 118461,
    "UUID": "F7676559-99EF-42C0-B367-71767DDA9422",
    "DataProviderID": 1,
    "OperatorID": 3326,
    "UsageTypeID": 5,
    "AddressInfo": {
        "ID": 118807,
        "Title": "The Cow Dalbury",
        "AddressLine1": "Woodhouse Lane",
        "Town": "Ashbourne",
        "StateOrProvince": "Derbyshire",
        "Postcode": "DE6 5BE",
        "CountryID": 1,
        "Latitude": 52.931747,
        "Longitude": -1.607213,
        "RelatedURL": "http://www.alfapower.co.uk/",
        "DistanceUnit": 0
    },
    "Connections": [
        {
            "ID": 167558,
            "ConnectionTypeID": 25,
            "Reference": "A",
            "StatusTypeID": 50,
            "LevelID": 2,
            "Amps": 32,
            "Voltage": 400,
            "PowerKW": 22,
            "CurrentTypeID": 20,
            "Quantity": 2
        }
    ],
    "NumberOfPoints": 2,
    "StatusTypeID": 50,
    "DateLastStatusUpdate": "2019-03-24T16:15:00Z",
    "MetadataValues": [
        {
            "ID": 4154,
            "MetadataFieldID": 4,
            "ItemValue": "Contains public sector information licensed under the Open Government Licence v2.0. http://www.nationalarchives.gov.uk/doc/open-government-licence/version/2/"
        }
    ],
    "DataQualityLevel": 3,
    "DateCreated": "2019-03-24T12:30:00Z",
    "SubmissionStatusTypeID": 100
}