{
    "IsRecentlyVerified": false,
    "ID": 99969,
    "UUID": "FEF3D818-3993-469C-B0F5-1D3A1151D9DE",
    "DataProviderID": 1,
    "OperatorID": 23,
    "OperatorsReference": "40584",
    "UsageTypeID": 4,
    "AddressInfo": {
        "ID": 100315,
        "Title": "Media One Hotel",
        "AddressLine1": "Dubai Media City Plot No.1 Al Falak Street",
        "Town": "Dubai",
        "CountryID": 235,
        "Latitude": 25.089776,
        "Longitude": 55.152204,
        "ContactTelephone1": "+971 4 427 1000",
        "DistanceUnit": 0
    },
    "Connections": [
        {
            "ID": 141221,
            "ConnectionTypeID": 1036,
            "StatusTypeID": 50,
            "LevelID": 2,
            "PowerKW": 13,
            "CurrentTypeID": 20,
            "Quantity": 2
        }
    ],
    "NumberOfPoints": 2,
    "GeneralComments": "2 Tesla Connectors, up to 13kW.Available for customers. Please call ahead.",
    "StatusTypeID": 50,
    "DateLastStatusUpdate": "2018-02-09T06:46:00Z",
    "DataQualityLevel": 1,
    "DateCreated": "2018-02-09T06:46:00Z",
    "SubmissionStatusTypeID": 200
}