{
    "IsRecentlyVerified": false,
    "ID": 122485,
    "UUID": "A0E4ED6C-CCA9-49FD-B48F-B36FCB6AF781",
    "DataProviderID": 2,
    "DataProvidersReference": "53677",
    "UsageTypeID": 1,
    "AddressInfo": {
        "ID": 122831,
        "Title": "City of Pasadena - Marriott Garage",
        "AddressLine1": "171 N Raymond Ave",
        "Town": "Pasadena",
        "StateOrProvince": "CA",
        "Postcode": "91103",
        "CountryID": 2,
        "Latitude": 34.148874,
        "Longitude": -118.148914,
        "ContactTelephone1": "626-577-8963  626-744-7655",
        "AccessComments": "24 hours daily; pay lot",
        "RelatedURL": "",
        "DistanceUnit": 0
    },
    "Connections": [
        {
            "ID": 172378,
            "ConnectionTypeID": 1,
            "LevelID": 2,
            "Amps": 16,
            "Voltage": 230,
            "PowerKW": 3.7,
            "CurrentTypeID": 10,
            "Quantity": 3
        }
    ],
    "DateLastStatusUpdate": "2020-06-26T02:57:00Z",
    "DataQualityLevel": 3,
    "DateCreated": "2019-04-06T05:03:00Z",
    "SubmissionStatusTypeID": 100
}