{
    "IsRecentlyVerified": false,
    "ID": 97551,
    "UUID": "D3B34456-2EDE-4A4E-B20A-617D9535F8BC",
    "DataProviderID": 1,
    "OperatorID": 23,
    "OperatorsReference": "39468",
    "UsageTypeID": 4,
    "AddressInfo": {
        "ID": 97897,
        "Title": "Olaias Park Hotel",
        "AddressLine1": "Avenida Eng Arantes Oliveira 9",
        "Town": "Lisboa",
        "Postcode": "1900-221",
        "CountryID": 180,
        "Latitude": 38.739643,
        "Longitude": -9.124174,
        "ContactTelephone1": "+351 218 434 200",
        "DistanceUnit": 0
    },
    "Connections": [
        {
            "ID": 138458,
            "ConnectionTypeID": 30,
            "StatusTypeID": 50,
            "LevelID": 2,
            "Amps": 32,
            "Voltage": 400,
            "PowerKW": 22,
            "CurrentTypeID": 20,
            "Quantity": 1
        }
    ],
    "NumberOfPoints": 1,
    "GeneralComments": "1 Tesla Connector, up to 22kW.Available to the public. Self park.",
    "StatusTypeID": 50,
    "DateLastStatusUpdate": "2018-10-03T16:04:00Z",
    "DataQualityLevel": 1,
    "DateCreated": "2018-01-21T15:44:00Z",
    "SubmissionStatusTypeID": 200
}