{
    "IsRecentlyVerified": false,
    "ID": 116050,
    "UUID": "67FF98C4-5A70-42F9-BA90-A62782E95EC2",
    "DataProviderID": 2,
    "DataProvidersReference": "114480",
    "OperatorID": 23,
    "UsageTypeID": 1,
    "AddressInfo": {
        "ID": 116396,
        "Title": "Soaring Eagle Casino and Resort - Tesla Destination",
        "AddressLine1": "6800 E Soaring Eagle Blvd",
        "Town": "Mt Pleasant",
        "StateOrProvince": "MI",
        "Postcode": "48858",
        "CountryID": 2,
        "Latitude": 43.609156,
        "Longitude": -84.710293,
        "ContactTelephone1": "800-775-7777  877-798-3752",
        "AccessComments": "24 hours daily; for customer use only; see valet for access",
        "RelatedURL": "https://www.tesla.com/destination-charging",
        "DistanceUnit": 0
    },
    "Connections": [
        {
            "ID": 163110,
            "ConnectionTypeID": 30,
            "LevelID": 2,
            "Amps": 16,
            "Voltage": 230,
            "PowerKW": 3.7,
            "CurrentTypeID": 10,
            "Quantity": 2
        }
    ],
    "DateLastStatusUpdate": "2020-06-26T03:07:00Z",
    "DataQualityLevel": 3,
    "DateCreated": "2019-02-11T07:13:00Z",
    "SubmissionStatusTypeID": 100
}