{
    "IsRecentlyVerified": false,
    "ID": 37602,
    "UUID": "B0337523-86A7-4AD2-9BE5-DBC6363D7301",
    "DataProviderID": 26,
    "DataProvidersReference": "38081",
    "OperatorID": 78,
    "OperatorsReference": "Essent EM-NL-00000363-03-00017",
    "UsageCost": "0.00 jaarabonnement",
    "AddressInfo": {
        "ID": 37948,
        "Title": "Ruimzicht 173",
        "AddressLine1": "Ruimzicht 173",
        "Town": "Amsterdam",
        "Postcode": "1068 CT",
        "CountryID": 159,
        "Latitude": 52.361944,
        "Longitude": 4.808713,
        "RelatedURL": "http://www.essent.nl",
        "DistanceUnit": 0
    },
    "Connections": [
        {
            "ID": 41113,
            "ConnectionTypeID": 25,
            "LevelID": 2,
            "PowerKW": 11,
            "CurrentTypeID": 10
        },
        {
            "ID": 49118,
            "ConnectionTypeID": 25,
            "LevelID": 2,
            "PowerKW": 11,
            "CurrentTypeID": 10
        }
    ],
    "NumberOfPoints": 1,
    "StatusTypeID": 50,
    "DateLastStatusUpdate": "2016-06-04T02:53:00Z",
    "DataQualityLevel": 3,
    "DateCreated": "2015-01-09T06:07:00Z",
    "SubmissionStatusTypeID": 100
}