{
    "IsRecentlyVerified": false,
    "ID": 82189,
    "UUID": "90CB024D-7A32-4D98-A390-BB7D693CBCA5",
    "DataProviderID": 1,
    "OperatorID": 23,
    "OperatorsReference": "22334",
    "UsageTypeID": 4,
    "AddressInfo": {
        "ID": 82535,
        "Title": "The Z Deck Eff",
        "AddressLine1": "1234 1234 Library St",
        "Town": "Detroit",
        "StateOrProvince": "Michigan",
        "Postcode": "48226",
        "CountryID": 2,
        "Latitude": 42.334265,
        "Longitude": -83.045959,
        "ContactTelephone1": "(855) 487-6727",
        "DistanceUnit": 0
    },
    "Connections": [
        {
            "ID": 116949,
            "ConnectionTypeID": 30,
            "StatusTypeID": 50,
            "LevelID": 2,
            "PowerKW": 16,
            "CurrentTypeID": 20,
            "Quantity": 3
        }
    ],
    "NumberOfPoints": 3,
    "GeneralComments": "3 Tesla Connectors, up to 16kW.Available to the public. Self park.",
    "StatusTypeID": 50,
    "DateLastStatusUpdate": "2017-02-16T10:56:00Z",
    "DataQualityLevel": 1,
    "DateCreated": "2017-02-03T15:06:00Z",
    "SubmissionStatusTypeID": 200
}