{
    "IsRecentlyVerified": false,
    "ID": 91022,
    "UUID": "0E1E351D-BEE0-4307-96C8-CE5F1C3A42AD",
    "DataProviderID": 1,
    "OperatorID": 23,
    "OperatorsReference": "32392",
    "UsageTypeID": 6,
    "AddressInfo": {
        "ID": 91368,
        "Title": "H10 Duque de Loule",
        "AddressLine1": "Av. Duque de Loule 81",
        "Town": "Lisboa",
        "Postcode": "1050-088",
        "CountryID": 180,
        "Latitude": 38.726414,
        "Longitude": -9.147112,
        "ContactTelephone1": "+351 213 182 000",
        "AccessComments": "Only for customers",
        "DistanceUnit": 0
    },
    "Connections": [
        {
            "ID": 129077,
            "ConnectionTypeID": 30,
            "StatusTypeID": 50,
            "LevelID": 2,
            "Amps": 32,
            "Voltage": 400,
            "PowerKW": 22,
            "CurrentTypeID": 20,
            "Quantity": 1
        }
    ],
    "NumberOfPoints": 1,
    "GeneralComments": "1 Tesla Connector, up to 22kW.Available for patrons only. Please see front desk.",
    "StatusTypeID": 50,
    "DateLastStatusUpdate": "2020-08-15T19:40:00Z",
    "DataQualityLevel": 1,
    "DateCreated": "2017-07-28T05:40:00Z",
    "SubmissionStatusTypeID": 200
}