{
    "IsRecentlyVerified": false,
    "ID": 103675,
    "UUID": "94CBBADF-DC62-4C2C-BA1C-A2C028DB0FAF",
    "DataProviderID": 1,
    "OperatorID": 23,
    "OperatorsReference": "42527",
    "UsageTypeID": 7,
    "AddressInfo": {
        "ID": 104021,
        "Title": "Hyatt Paris Madeleine",
        "AddressLine1": "Hyatt Paris Madeleine",
        "Postcode": "75008",
        "CountryID": 80,
        "Latitude": 48.872876,
        "Longitude": 2.321405,
        "ContactTelephone1": "+33 1 55 27 12 34",
        "DistanceUnit": 0
    },
    "Connections": [
        {
            "ID": 146345,
            "ConnectionTypeID": 30,
            "StatusTypeID": 50,
            "LevelID": 2,
            "Amps": 32,
            "Voltage": 230,
            "PowerKW": 17,
            "CurrentTypeID": 20,
            "Quantity": 1
        }
    ],
    "NumberOfPoints": 1,
    "GeneralComments": "1 Tesla Connector, up to 17kW.Available by reservation only. Please see valet.",
    "StatusTypeID": 50,
    "DateLastStatusUpdate": "2018-10-03T20:33:00Z",
    "DataQualityLevel": 1,
    "DateCreated": "2018-05-05T05:51:00Z",
    "SubmissionStatusTypeID": 200
}