{
    "IsRecentlyVerified": false,
    "ID": 143223,
    "UUID": "B26A7110-AE60-428D-91EE-893AEC13C106",
    "DataProviderID": 2,
    "DataProvidersReference": "99995",
    "OperatorID": 5,
    "UsageTypeID": 1,
    "AddressInfo": {
        "ID": 143575,
        "Title": "NATIONAL GRID",
        "AddressLine1": "391 Main St",
        "Town": "Tewksbury",
        "StateOrProvince": "MA",
        "Postcode": "01876",
        "CountryID": 2,
        "Latitude": 42.619959,
        "Longitude": -71.2598618,
        "ContactTelephone1": "888-758-4389",
        "AccessComments": "24 hours daily",
        "RelatedURL": "http://www.chargepoint.com/",
        "DistanceUnit": 0
    },
    "Connections": [
        {
            "ID": 199512,
            "ConnectionTypeID": 1,
            "LevelID": 2,
            "Amps": 16,
            "Voltage": 230,
            "PowerKW": 3.7,
            "CurrentTypeID": 10,
            "Quantity": 2
        }
    ],
    "StatusTypeID": 50,
    "DateLastStatusUpdate": "2020-06-26T03:06:00Z",
    "DataQualityLevel": 3,
    "DateCreated": "2019-12-24T09:20:00Z",
    "SubmissionStatusTypeID": 100
}