{
    "IsRecentlyVerified": false,
    "ID": 165847,
    "UUID": "077E086D-E2F9-45DE-AA33-A2824797F205",
    "DataProviderID": 28,
    "DataProvidersReference": "FR*S33*PMB33*76",
    "OperatorID": 3407,
    "UsageTypeID": 5,
    "AddressInfo": {
        "ID": 166206,
        "Title": "LEGE - CAP-FERRET - Avenue Des Halles - Claouey",
        "AddressLine1": "Avenue Des Halles - Claouey 33950 LEGE - CAP-FERRET",
        "CountryID": 80,
        "Latitude": 44.74934373,
        "Longitude": -1.181364208,
        "AccessComments": "24h/24 7j/7",
        "DistanceUnit": 0
    },
    "Connections": [
        {
            "ID": 242863,
            "ConnectionTypeID": 25,
            "StatusTypeID": 50,
            "LevelID": 2,
            "PowerKW": 18,
            "CurrentTypeID": 20
        },
        {
            "ID": 242864,
            "ConnectionTypeID": 28,
            "StatusTypeID": 50,
            "LevelID": 2,
            "PowerKW": 18,
            "CurrentTypeID": 10
        },
        {
            "ID": 242865,
            "ConnectionTypeID": 25,
            "StatusTypeID": 50,
            "LevelID": 2,
            "PowerKW": 18,
            "CurrentTypeID": 20
        },
        {
            "ID": 242866,
            "ConnectionTypeID": 28,
            "StatusTypeID": 50,
            "LevelID": 2,
            "PowerKW": 18,
            "CurrentTypeID": 10
        }
    ],
    "GeneralComments": "Recharge par badge et avec une application smartphone",
    "StatusTypeID": 50,
    "DateLastStatusUpdate": "2020-08-27T05:11:00Z",
    "DataQualityLevel": 2,
    "DateCreated": "2020-08-27T05:11:00Z",
    "SubmissionStatusTypeID": 100
}