{
    "IsRecentlyVerified": false,
    "ID": 131997,
    "UUID": "8E20E5C9-68B9-4CA0-B21D-5CF0E2A0EF59",
    "DataProviderID": 1,
    "OperatorID": 1,
    "UsageTypeID": 4,
    "UsageCost": "gratis",
    "AddressInfo": {
        "ID": 132343,
        "Title": "Edrr sant fruitos",
        "AddressLine1": "Carretera de Berga",
        "AddressLine2": "Can Sala",
        "Town": "Bages",
        "StateOrProvince": "Bages",
        "Postcode": "08272",
        "CountryID": 210,
        "Latitude": 41.7518246602927,
        "Longitude": 1.86317732199245,
        "ContactTelephone1": "93 878 97 00",
        "DistanceUnit": 0
    },
    "Connections": [
        {
            "ID": 184688,
            "ConnectionTypeID": 2,
            "StatusTypeID": 50,
            "LevelID": 3,
            "Voltage": 400,
            "PowerKW": 50,
            "CurrentTypeID": 30,
            "Quantity": 1
        },
        {
            "ID": 184689,
            "ConnectionTypeID": 1036,
            "StatusTypeID": 50,
            "LevelID": 3,
            "Amps": 63,
            "Voltage": 400,
            "PowerKW": 43,
            "CurrentTypeID": 20,
            "Quantity": 1
        },
        {
            "ID": 184690,
            "ConnectionTypeID": 33,
            "StatusTypeID": 50,
            "LevelID": 3,
            "Voltage": 400,
            "PowerKW": 50,
            "CurrentTypeID": 30,
            "Quantity": 1
        }
    ],
    "NumberOfPoints": 2,
    "GeneralComments": "Per poder utilitzar aquest punt, cal disposar d una targeta RFID o amb la APP EVCharge by Etecnic. El punt és compatible amb les targetes de la aliança dels municipis, com la LIVE de Barcelona. El ajuntament, també disposa d aquestes targetes per als usuaris, previ registre al ajuntament. Para poder utilizar este punto, hay que disponer de una tarjeta RFID o mediante la APP EVCharge by Etecnic. El punto es compatible con las tarjetas de la alianza de los municipios, como la Live de Barcelona. El ayuntamiento también dispone de estas tarjetas para los usuarios, previo registro en el ayuntamiento.",
    "StatusTypeID": 50,
    "DateLastStatusUpdate": "2019-10-16T10:11:00Z",
    "DataQualityLevel": 1,
    "DateCreated": "2019-09-17T15:30:00Z",
    "SubmissionStatusTypeID": 200
}