{
    "IsRecentlyVerified": false,
    "ID": 183705,
    "UUID": "9794B1DA-3DCD-4313-928E-576C3661271F",
    "DataProviderID": 29,
    "DataProvidersReference": "5659",
    "AddressInfo": {
        "ID": 184064,
        "Title": "Beuditzstraße 54",
        "AddressLine1": "Beuditzstraße 54",
        "Town": "Weißenfels",
        "Postcode": "06667",
        "CountryID": 87,
        "Latitude": 51.199931,
        "Longitude": 11.956838,
        "DistanceUnit": 0
    },
    "Connections": [
        {
            "ID": 291020,
            "ConnectionTypeID": 25,
            "StatusTypeID": 50,
            "LevelID": 2,
            "PowerKW": 22,
            "CurrentTypeID": 20
        },
        {
            "ID": 291021,
            "ConnectionTypeID": 25,
            "StatusTypeID": 50,
            "LevelID": 2,
            "PowerKW": 22,
            "CurrentTypeID": 20
        }
    ],
    "StatusTypeID": 50,
    "DateLastStatusUpdate": "2021-07-12T02:46:00Z",
    "MetadataValues": [
        {
            "ID": 15998,
            "MetadataFieldID": 4,
            "ItemValue": "Data from the German chargepoint registry provided by Bundesnetzagentur.de under the CC-BY 4.0 license"
        }
    ],
    "DataQualityLevel": 3,
    "DateCreated": "2021-07-08T10:04:00Z",
    "SubmissionStatusTypeID": 100
}