{
    "IsRecentlyVerified": false,
    "ID": 163593,
    "UUID": "B94E0D93-576A-449F-A72C-85369537C1C7",
    "DataProviderID": 1,
    "OperatorID": 23,
    "OperatorsReference": "36720",
    "UsageTypeID": 4,
    "AddressInfo": {
        "ID": 163950,
        "Title": "Hotel Crowne Plaza Barcelona",
        "AddressLine1": "Avda Rius I Taulet 1-3",
        "Town": "Barcelona",
        "Postcode": "8004",
        "CountryID": 210,
        "Latitude": 41.372697,
        "Longitude": 2.154707,
        "ContactTelephone1": "+34 93 426 22 23",
        "DistanceUnit": 0
    },
    "Connections": [
        {
            "ID": 235190,
            "ConnectionTypeID": 30,
            "StatusTypeID": 50,
            "LevelID": 2,
            "PowerKW": 11,
            "CurrentTypeID": 20,
            "Quantity": 1
        }
    ],
    "NumberOfPoints": 1,
    "GeneralComments": "1 Tesla Connector, up to 11kW.Available for customers. Please see front desk.",
    "StatusTypeID": 50,
    "DateLastStatusUpdate": "2020-08-24T13:04:00Z",
    "DataQualityLevel": 1,
    "DateCreated": "2020-08-24T13:04:00Z",
    "SubmissionStatusTypeID": 200
}