{
    "IsRecentlyVerified": false,
    "ID": 110835,
    "UUID": "6C451DC9-8285-411F-912A-C98AADF3AF81",
    "DataProviderID": 2,
    "DataProvidersReference": "83399",
    "UsageTypeID": 1,
    "AddressInfo": {
        "ID": 111181,
        "Title": "York Parkade",
        "AddressLine1": "32 York Blvd",
        "Town": "Hamilton",
        "StateOrProvince": "ON",
        "Postcode": "L8R 3M8",
        "CountryID": 44,
        "Latitude": 43.259265,
        "Longitude": -79.869252,
        "ContactTelephone1": "905-540-6000",
        "AccessComments": "7am-10:30pm daily",
        "RelatedURL": "",
        "DistanceUnit": 0
    },
    "Connections": [
        {
            "ID": 156137,
            "ConnectionTypeID": 1,
            "LevelID": 2,
            "Amps": 16,
            "Voltage": 230,
            "PowerKW": 3.7,
            "CurrentTypeID": 10,
            "Quantity": 2
        }
    ],
    "DateLastStatusUpdate": "2020-06-26T03:06:00Z",
    "DataQualityLevel": 3,
    "DateCreated": "2018-10-18T23:36:00Z",
    "SubmissionStatusTypeID": 100
}