{
    "UserComments": [
        {
            "ID": 22394,
            "ChargePointID": 5730,
            "CommentTypeID": 10,
            "UserName": "crasymumma",
            "Comment": "All working now.",
            "DateCreated": "2020-04-06T23:08:18.967Z",
            "User": {
                "ID": 23568,
                "Username": "crasymumma"
            },
            "CheckinStatusTypeID": 10,
            "IsActionedByEditor": false
        },
        {
            "ID": 196,
            "ChargePointID": 5730,
            "CommentTypeID": 50,
            "UserName": "Nikki Gordon-Bloomfield",
            "Comment": "These have never worked. Avoid!!!",
            "DateCreated": "2012-11-19T17:59:25.233Z",
            "User": {
                "ID": 1034,
                "Username": "Nikki Gordon-Bloomfield"
            }
        },
        {
            "ID": 156,
            "ChargePointID": 5730,
            "CommentTypeID": 10,
            "UserName": "Paul Griffiths",
            "Comment": "Not working on 23 Aug 2012. I don't think this charger has ever worked. I have contacted both Podpoint and Sainsburys to resolve this impasse but to no avail.",
            "Rating": 1,
            "DateCreated": "2012-08-25T16:24:58.39Z"
        }
    ],
    "IsRecentlyVerified": false,
    "ID": 5730,
    "UUID": "668B53F2-E243-4D93-86D8-61593966852E",
    "DataProviderID": 1,
    "OperatorID": 3,
    "OperatorsReference": "PG-80661",
    "UsageTypeID": 4,
    "UsageCost": "Free",
    "AddressInfo": {
        "ID": 5652,
        "Title": "Sainsburys Car Park",
        "AddressLine1": "May Lane",
        "Town": "Dursley",
        "StateOrProvince": "Gloucestershire",
        "Postcode": "GL11 4BS",
        "CountryID": 1,
        "Latitude": 51.6822665,
        "Longitude": -2.355259,
        "ContactTelephone1": "020 7247 4114",
        "RelatedURL": "http://www.pod-point.com/",
        "DistanceUnit": 0
    },
    "Connections": [
        {
            "ID": 479,
            "ConnectionTypeID": 25,
            "StatusTypeID": 50,
            "LevelID": 2,
            "Amps": 32,
            "Voltage": 230,
            "PowerKW": 7,
            "CurrentTypeID": 10,
            "Quantity": 2
        }
    ],
    "NumberOfPoints": 2,
    "StatusTypeID": 50,
    "DateLastStatusUpdate": "2020-04-06T23:08:00Z",
    "DataQualityLevel": 1,
    "DateCreated": "2011-09-12T11:40:00Z",
    "SubmissionStatusTypeID": 200
}