{
    "IsRecentlyVerified": false,
    "ID": 9092,
    "UUID": "1BFB301B-60F3-43BD-AAFC-DED198FBA3C7",
    "DataProviderID": 1,
    "OperatorID": 1,
    "UsageTypeID": 3,
    "UsageCost": "Free",
    "AddressInfo": {
        "ID": 8989,
        "Title": "Greenbridge Incubator",
        "AddressLine1": "Wetenschapspark 1",
        "AddressLine2": "",
        "Town": "Oostende",
        "StateOrProvince": "",
        "Postcode": "8400",
        "CountryID": 26,
        "Latitude": 51.2170298,
        "Longitude": 2.9946674999999914,
        "ContactTelephone1": "+32 (0)59 24 27 30",
        "ContactTelephone2": "",
        "ContactEmail": "",
        "AccessComments": "",
        "RelatedURL": "http://www.greenbridge.be/",
        "DistanceUnit": 0
    },
    "Connections": [
        {
            "ID": 6796,
            "ConnectionTypeID": 23,
            "StatusTypeID": 0,
            "LevelID": 2,
            "Amps": 16,
            "Voltage": 220,
            "PowerKW": 3.5,
            "Quantity": 1
        }
    ],
    "NumberOfPoints": 1,
    "GeneralComments": "",
    "StatusTypeID": 50,
    "DateLastStatusUpdate": "2012-01-21T11:02:00Z",
    "DataQualityLevel": 1,
    "DateCreated": "2012-01-13T18:05:00Z",
    "SubmissionStatusTypeID": 200
}