{
    "IsRecentlyVerified": false,
    "ID": 32652,
    "UUID": "DA23E250-AAEB-4C21-9AB8-547A87C2EDB4",
    "DataProviderID": 26,
    "DataProvidersReference": "34627",
    "OperatorID": 73,
    "OperatorsReference": "EV-Box EVB-P1313052",
    "UsageCost": "0.00 jaarabonnement",
    "AddressInfo": {
        "ID": 32998,
        "Title": "Dragonder 20A",
        "AddressLine1": "Dragonder 20A",
        "Town": "Valkenswaard",
        "Postcode": "5554 GM",
        "CountryID": 159,
        "Latitude": 51.33942,
        "Longitude": 5.46612,
        "RelatedURL": "http://www.ev-box.nl",
        "DistanceUnit": 0
    },
    "Connections": [
        {
            "ID": 36163,
            "ConnectionTypeID": 25,
            "LevelID": 2,
            "PowerKW": 11,
            "CurrentTypeID": 10
        },
        {
            "ID": 46464,
            "ConnectionTypeID": 25,
            "LevelID": 2,
            "PowerKW": 11,
            "CurrentTypeID": 10
        }
    ],
    "NumberOfPoints": 1,
    "StatusTypeID": 50,
    "DateLastStatusUpdate": "2016-06-04T02:38:00Z",
    "DataQualityLevel": 3,
    "DateCreated": "2015-01-09T06:03:00Z",
    "SubmissionStatusTypeID": 100
}