{
    "IsRecentlyVerified": false,
    "ID": 59117,
    "UUID": "F87A4E49-BAF6-434B-B955-9F7DFE08968D",
    "DataProviderID": 1,
    "OperatorID": 235,
    "UsageTypeID": 1,
    "UsageCost": "0",
    "AddressInfo": {
        "ID": 59463,
        "Title": "SWD Peters Biergarten E-Bike-Ladestation",
        "AddressLine1": "Am Kleinforst 275",
        "AddressLine2": "Unterbach",
        "Town": "Düsseldorf",
        "Postcode": "40627",
        "CountryID": 87,
        "Latitude": 51.191408,
        "Longitude": 6.88116,
        "ContactTelephone1": "0211/821-8210",
        "ContactTelephone2": "0211/821-4093",
        "ContactEmail": "elektromobilitaet@swd-ag.de",
        "AccessComments": "E-Bike-Ladestation\r\nSommerzeit: täglich ab 11:00 Uhr\r\nWinterzeit:  Mo-Fr ab 14:00 und Sa + So ab 11:00 Uhr",
        "RelatedURL": "http://www.emobil-nrw.de",
        "DistanceUnit": 0
    },
    "Connections": [
        {
            "ID": 75020,
            "ConnectionTypeID": 28,
            "StatusTypeID": 50,
            "LevelID": 2,
            "Amps": 16,
            "Voltage": 230,
            "PowerKW": 3.7,
            "CurrentTypeID": 10,
            "Quantity": 4
        }
    ],
    "NumberOfPoints": 4,
    "GeneralComments": "E-Bike-Ladestation",
    "StatusTypeID": 50,
    "DateLastStatusUpdate": "2016-01-12T12:58:00Z",
    "DataQualityLevel": 1,
    "DateCreated": "2016-01-07T13:52:00Z",
    "SubmissionStatusTypeID": 200
}