{
    "IsRecentlyVerified": false,
    "ID": 133740,
    "UUID": "6C97F17E-3498-40C0-A42D-1AEAC7B7B229",
    "DataProviderID": 1,
    "OperatorID": 70,
    "UsageTypeID": 4,
    "AddressInfo": {
        "ID": 134086,
        "Title": "EŞARJ - İkbal Thermal Hotel",
        "AddressLine1": "İkbal Thermal Hotel",
        "AddressLine2": "4 Yol Mahallesi Kütahya Yolu Bulvarı No:2",
        "Town": "İzmir",
        "StateOrProvince": "Afyonkarahisar",
        "Postcode": "03096",
        "CountryID": 229,
        "Latitude": 38.7930382016503,
        "Longitude": 30.4565133137938,
        "RelatedURL": "https://esarj.com/harita?s=TR-AFY-001",
        "DistanceUnit": 0
    },
    "Connections": [
        {
            "ID": 187171,
            "ConnectionTypeID": 2,
            "StatusTypeID": 50,
            "LevelID": 3,
            "Amps": 125,
            "Voltage": 500,
            "PowerKW": 45,
            "CurrentTypeID": 30,
            "Quantity": 1
        },
        {
            "ID": 187172,
            "ConnectionTypeID": 33,
            "StatusTypeID": 50,
            "LevelID": 3,
            "Amps": 120,
            "Voltage": 500,
            "PowerKW": 45,
            "CurrentTypeID": 30,
            "Quantity": 1
        },
        {
            "ID": 187173,
            "ConnectionTypeID": 25,
            "StatusTypeID": 50,
            "LevelID": 2,
            "Amps": 32,
            "Voltage": 400,
            "PowerKW": 22,
            "CurrentTypeID": 20,
            "Quantity": 1
        }
    ],
    "NumberOfPoints": 1,
    "StatusTypeID": 50,
    "DateLastStatusUpdate": "2019-10-25T08:12:00Z",
    "DataQualityLevel": 1,
    "DateCreated": "2019-10-25T08:12:00Z",
    "SubmissionStatusTypeID": 200
}