{
    "IsRecentlyVerified": false,
    "ID": 125666,
    "UUID": "7F66C9B9-D945-4169-A6BB-D151BE049FB3",
    "DataProviderID": 1,
    "OperatorID": 150,
    "UsageTypeID": 4,
    "UsageCost": "£1.00 + £0.30/kWh",
    "AddressInfo": {
        "ID": 126012,
        "Title": "Morrisons Elland",
        "AddressLine1": "Jubilee Way",
        "Town": "Elland",
        "Postcode": "HX5 9DT",
        "CountryID": 1,
        "Latitude": 53.687909,
        "Longitude": -1.836282,
        "DistanceUnit": 0
    },
    "Connections": [
        {
            "ID": 176102,
            "ConnectionTypeID": 2,
            "StatusTypeID": 50,
            "LevelID": 3,
            "PowerKW": 50,
            "CurrentTypeID": 30,
            "Quantity": 1
        },
        {
            "ID": 176103,
            "ConnectionTypeID": 1036,
            "StatusTypeID": 50,
            "LevelID": 3,
            "Amps": 63,
            "Voltage": 400,
            "PowerKW": 43,
            "CurrentTypeID": 20,
            "Quantity": 1
        },
        {
            "ID": 176104,
            "ConnectionTypeID": 33,
            "StatusTypeID": 50,
            "LevelID": 3,
            "PowerKW": 50,
            "CurrentTypeID": 30,
            "Quantity": 1
        }
    ],
    "NumberOfPoints": 1,
    "StatusTypeID": 50,
    "DateLastStatusUpdate": "2019-04-23T18:49:00Z",
    "DataQualityLevel": 1,
    "DateCreated": "2019-04-23T17:30:00Z",
    "SubmissionStatusTypeID": 200
}