{
    "IsRecentlyVerified": false,
    "ID": 172506,
    "UUID": "12DBBE40-2E00-4BEA-894C-CA5BD99CA461",
    "DataProviderID": 1,
    "OperatorID": 23,
    "OperatorsReference": "55885",
    "UsageTypeID": 4,
    "UsageCost": "$0.22/min >=60kW; $0.11/min <60kW; other tariffs for older cars",
    "AddressInfo": {
        "ID": 172865,
        "Title": "Mebane, NC Supercharger",
        "AddressLine1": "1237 Mebane Oaks Road",
        "Town": "Mebane",
        "StateOrProvince": "NC",
        "Postcode": "27302",
        "CountryID": 2,
        "Latitude": 36.069862,
        "Longitude": -79.270016,
        "DistanceUnit": 0
    },
    "Connections": [
        {
            "ID": 263773,
            "ConnectionTypeID": 27,
            "StatusTypeID": 50,
            "LevelID": 3,
            "PowerKW": 120,
            "CurrentTypeID": 30,
            "Quantity": 8
        }
    ],
    "NumberOfPoints": 8,
    "GeneralComments": "Charging8 Superchargers, available 24/7, up to 250kW",
    "StatusTypeID": 50,
    "DateLastStatusUpdate": "2021-02-06T06:42:00Z",
    "DataQualityLevel": 1,
    "DateCreated": "2021-02-06T06:42:00Z",
    "SubmissionStatusTypeID": 200
}