{
    "IsRecentlyVerified": false,
    "ID": 177075,
    "UUID": "3424E2D9-E879-4111-A4F7-0E5503A40FE2",
    "DataProviderID": 29,
    "DataProvidersReference": "11418",
    "OperatorID": 127,
    "AddressInfo": {
        "ID": 177434,
        "Title": "Dersumer Str. 10",
        "AddressLine1": "Dersumer Str. 10",
        "Town": "Heede",
        "Postcode": "26892",
        "CountryID": 87,
        "Latitude": 52.9831946,
        "Longitude": 7.29033879999997,
        "DistanceUnit": 0
    },
    "Connections": [
        {
            "ID": 275788,
            "ConnectionTypeID": 25,
            "StatusTypeID": 50,
            "LevelID": 2,
            "PowerKW": 22,
            "CurrentTypeID": 20
        },
        {
            "ID": 275789,
            "ConnectionTypeID": 25,
            "StatusTypeID": 50,
            "LevelID": 2,
            "PowerKW": 22,
            "CurrentTypeID": 20
        }
    ],
    "StatusTypeID": 0,
    "DateLastStatusUpdate": "2021-07-12T02:50:00Z",
    "MetadataValues": [
        {
            "ID": 9369,
            "MetadataFieldID": 4,
            "ItemValue": "Data from the German chargepoint registry provided by Bundesnetzagentur.de under the CC-BY 4.0 license"
        }
    ],
    "DataQualityLevel": 3,
    "DateCreated": "2021-07-08T09:48:00Z",
    "SubmissionStatusTypeID": 100
}