{
    "IsRecentlyVerified": false,
    "ID": 136780,
    "UUID": "2E53ED61-AB38-4531-801C-0D29B760F32B",
    "DataProviderID": 18,
    "DataProvidersReference": "bbd318427404a9653b8760a576a50c26",
    "OperatorID": 2244,
    "UsageTypeID": 5,
    "AddressInfo": {
        "ID": 137126,
        "Title": "Percy Street",
        "AddressLine1": "Percy Street",
        "Town": "Liverpool",
        "Postcode": "L8 7NA",
        "CountryID": 1,
        "Latitude": 53.397816,
        "Longitude": -2.969885,
        "AccessComments": "",
        "RelatedURL": "https://www.ubitricity.com",
        "DistanceUnit": 0
    },
    "Connections": [
        {
            "ID": 191374,
            "ConnectionTypeID": 25,
            "Reference": "suby1100001781",
            "StatusTypeID": 50,
            "LevelID": 2,
            "Amps": 16,
            "Voltage": 230,
            "PowerKW": 3.7,
            "CurrentTypeID": 10
        }
    ],
    "StatusTypeID": 0,
    "DateLastStatusUpdate": "2021-04-25T05:46:00Z",
    "MetadataValues": [
        {
            "ID": 6632,
            "MetadataFieldID": 4,
            "ItemValue": "Contains public sector information licensed under the Open Government Licence v2.0. http://www.nationalarchives.gov.uk/doc/open-government-licence/version/2/"
        }
    ],
    "DataQualityLevel": 3,
    "DateCreated": "2019-12-24T05:23:00Z",
    "SubmissionStatusTypeID": 100
}