{
    "IsRecentlyVerified": false,
    "ID": 62148,
    "UUID": "6A7F71AF-1C58-42ED-BA3B-84F6187B6069",
    "DataProviderID": 2,
    "DataProvidersReference": "72540",
    "OperatorID": 5,
    "UsageTypeID": 1,
    "AddressInfo": {
        "ID": 62494,
        "Title": "LEXCHARGE01",
        "AddressLine1": "2607 Plum Creek Pkwy",
        "Town": "Lexington",
        "StateOrProvince": "NE",
        "Postcode": "68850",
        "CountryID": 2,
        "Latitude": 40.7491932,
        "Longitude": -99.7408917,
        "ContactTelephone1": "888-758-4389",
        "AccessComments": "24 hours daily",
        "RelatedURL": "http://www.chargepoint.com/",
        "DistanceUnit": 0
    },
    "Connections": [
        {
            "ID": 79051,
            "ConnectionTypeID": 1,
            "LevelID": 2,
            "Amps": 16,
            "Voltage": 230,
            "PowerKW": 3.7,
            "CurrentTypeID": 10,
            "Quantity": 2
        }
    ],
    "DateLastStatusUpdate": "2020-06-26T03:03:00Z",
    "DataQualityLevel": 3,
    "DateCreated": "2016-03-03T11:38:00Z",
    "SubmissionStatusTypeID": 100
}