{
    "IsRecentlyVerified": false,
    "ID": 89855,
    "UUID": "F12B9092-CF75-46A0-A8EF-D382BCA898DE",
    "DataProviderID": 1,
    "OperatorID": 32,
    "OperatorsReference": "24097",
    "UsageTypeID": 4,
    "UsageCost": "£0.108/kWh; for Polar Plus subscription members only",
    "AddressInfo": {
        "ID": 90201,
        "Title": "National Maritime Museum",
        "AddressLine1": "Park Row",
        "AddressLine2": "East Greenwich",
        "Town": "London",
        "StateOrProvince": "England",
        "Postcode": "SE10 9NF",
        "CountryID": 1,
        "Latitude": 51.481415,
        "Longitude": -0.002502,
        "DistanceUnit": 0
    },
    "Connections": [
        {
            "ID": 127369,
            "ConnectionTypeID": 2,
            "StatusTypeID": 50,
            "LevelID": 3,
            "Amps": 125,
            "Voltage": 400,
            "PowerKW": 50,
            "CurrentTypeID": 30,
            "Quantity": 1
        },
        {
            "ID": 127370,
            "ConnectionTypeID": 33,
            "StatusTypeID": 50,
            "LevelID": 3,
            "Amps": 125,
            "Voltage": 400,
            "PowerKW": 50,
            "CurrentTypeID": 30,
            "Quantity": 1
        },
        {
            "ID": 127371,
            "ConnectionTypeID": 1036,
            "StatusTypeID": 50,
            "LevelID": 3,
            "Amps": 63,
            "Voltage": 400,
            "PowerKW": 43,
            "CurrentTypeID": 20,
            "Quantity": 1
        }
    ],
    "NumberOfPoints": 1,
    "StatusTypeID": 50,
    "DateLastStatusUpdate": "2019-06-21T05:26:00Z",
    "DataQualityLevel": 1,
    "DateCreated": "2017-06-24T07:11:00Z",
    "SubmissionStatusTypeID": 200
}