{
    "IsRecentlyVerified": false,
    "ID": 97580,
    "UUID": "B1222E47-6407-4112-B01D-DB471DEB6735",
    "DataProviderID": 1,
    "OperatorID": 23,
    "OperatorsReference": "38756",
    "UsageTypeID": 4,
    "AddressInfo": {
        "ID": 97926,
        "Title": "Pembroke Mall",
        "AddressLine1": "4554 Virginia Beach BLVD",
        "Town": "Virginia Beach",
        "StateOrProvince": "Virginia",
        "Postcode": "23462",
        "CountryID": 2,
        "Latitude": 36.84446,
        "Longitude": -76.134411,
        "ContactTelephone1": "(757) 497-6255",
        "DistanceUnit": 0
    },
    "Connections": [
        {
            "ID": 138487,
            "ConnectionTypeID": 30,
            "StatusTypeID": 50,
            "LevelID": 2,
            "PowerKW": 16,
            "CurrentTypeID": 20,
            "Quantity": 2
        }
    ],
    "NumberOfPoints": 2,
    "GeneralComments": "2 Tesla Connectors, up to 16kW.Available for customers. Self park.",
    "StatusTypeID": 50,
    "DateLastStatusUpdate": "2018-01-21T15:48:00Z",
    "DataQualityLevel": 1,
    "DateCreated": "2018-01-21T15:48:00Z",
    "SubmissionStatusTypeID": 200
}