{
    "IsRecentlyVerified": false,
    "ID": 130294,
    "UUID": "8D2E7C87-29E2-4A1A-991C-38724C88ED32",
    "DataProviderID": 1,
    "OperatorID": 88,
    "UsageTypeID": 6,
    "AddressInfo": {
        "ID": 130640,
        "Title": "Greenway Polska Silesia City Center Katowice",
        "AddressLine1": "Chorzowska",
        "AddressLine2": "Dąb",
        "Town": "Katowice",
        "StateOrProvince": "Katowice",
        "Postcode": "40-101",
        "CountryID": 179,
        "Latitude": 50.27072305,
        "Longitude": 19.0038669472112,
        "ContactTelephone1": "+48 58 325 10 77",
        "RelatedURL": "https://greenwaypolska.pl/",
        "DistanceUnit": 0
    },
    "Connections": [
        {
            "ID": 182403,
            "ConnectionTypeID": 2,
            "StatusTypeID": 50,
            "LevelID": 3,
            "PowerKW": 50,
            "CurrentTypeID": 30,
            "Quantity": 1
        },
        {
            "ID": 182404,
            "ConnectionTypeID": 33,
            "StatusTypeID": 50,
            "LevelID": 3,
            "PowerKW": 50,
            "CurrentTypeID": 30,
            "Quantity": 1
        },
        {
            "ID": 182405,
            "ConnectionTypeID": 1036,
            "StatusTypeID": 50,
            "LevelID": 3,
            "Amps": 63,
            "Voltage": 400,
            "PowerKW": 43,
            "CurrentTypeID": 20,
            "Quantity": 1
        }
    ],
    "NumberOfPoints": 1,
    "StatusTypeID": 50,
    "DateLastStatusUpdate": "2019-08-12T18:03:00Z",
    "DataQualityLevel": 1,
    "DateCreated": "2019-08-02T12:37:00Z",
    "SubmissionStatusTypeID": 200
}