{
    "IsRecentlyVerified": false,
    "ID": 111931,
    "UUID": "98A344C7-1F90-4B70-8CA3-017A22EE7576",
    "DataProviderID": 2,
    "DataProvidersReference": "92562",
    "OperatorID": 5,
    "UsageTypeID": 1,
    "AddressInfo": {
        "ID": 112277,
        "Title": "SURREY MITS",
        "AddressLine1": "13820 104 Ave",
        "Town": "Surrey",
        "StateOrProvince": "BC",
        "Postcode": "V3T1W9",
        "CountryID": 44,
        "Latitude": 49.1912994,
        "Longitude": -122.8396958,
        "ContactTelephone1": "888-758-4389",
        "AccessComments": "24 hours daily",
        "RelatedURL": "http://www.chargepoint.com/",
        "DistanceUnit": 0
    },
    "Connections": [
        {
            "ID": 157447,
            "ConnectionTypeID": 1,
            "LevelID": 2,
            "Amps": 16,
            "Voltage": 230,
            "PowerKW": 3,
            "CurrentTypeID": 10,
            "Quantity": 2
        }
    ],
    "DateLastStatusUpdate": "2019-12-24T09:25:00Z",
    "DataQualityLevel": 3,
    "DateCreated": "2018-10-18T23:37:00Z",
    "SubmissionStatusTypeID": 100
}