{
    "UserComments": [
        {
            "ID": 23565,
            "ChargePointID": 128359,
            "CommentTypeID": 10,
            "UserName": "ForumElettrico.it",
            "Comment": "La colonnina si attiva gratuitamente con qualsiasi card RFID. Leggi la recensione completa qui > https://www.forumelettrico.it/forum/post156263.html#p156263",
            "RelatedURL": "https://www.forumelettrico.it/forum/post156263.html#p156263",
            "DateCreated": "2020-11-29T09:20:59.937Z",
            "User": {
                "ID": 11749,
                "Username": "ForumElettrico.it"
            },
            "CheckinStatusTypeID": 10,
            "IsActionedByEditor": false
        },
        {
            "ID": 21133,
            "ChargePointID": 128359,
            "CommentTypeID": 10,
            "UserName": "ForumElettrico.it",
            "RelatedURL": "https://www.forumelettrico.it/forum/colonnina-15-kw-reggio-motori-reggio-emilia-re-via-fratelli-cervi-91-t6002.html",
            "DateCreated": "2019-06-22T15:22:19.55Z",
            "User": {
                "ID": 11749,
                "Username": "ForumElettrico.it"
            },
            "CheckinStatusTypeID": 10
        }
    ],
    "MediaItems": [
        {
            "ID": 25607,
            "ChargePointID": 128359,
            "ItemURL": "https://s3-ap-southeast-2.amazonaws.com/openchargemap/images/IT/OCM128359/OCM-128359.orig.2020112909210913.jpg",
            "ItemThumbnailURL": "https://s3-ap-southeast-2.amazonaws.com/openchargemap/images/IT/OCM128359/OCM-128359.thmb.2020112909210913.jpg",
            "Comment": "",
            "IsEnabled": true,
            "IsVideo": false,
            "IsFeaturedItem": false,
            "IsExternalResource": false,
            "User": {
                "ID": 11749,
                "Username": "ForumElettrico.it"
            },
            "DateCreated": "2020-11-29T09:21:00Z"
        },
        {
            "ID": 25608,
            "ChargePointID": 128359,
            "ItemURL": "https://s3-ap-southeast-2.amazonaws.com/openchargemap/images/IT/OCM128359/OCM-128359.orig.2020112909211602.jpg",
            "ItemThumbnailURL": "https://s3-ap-southeast-2.amazonaws.com/openchargemap/images/IT/OCM128359/OCM-128359.thmb.2020112909211602.jpg",
            "Comment": "",
            "IsEnabled": true,
            "IsVideo": false,
            "IsFeaturedItem": false,
            "IsExternalResource": false,
            "User": {
                "ID": 11749,
                "Username": "ForumElettrico.it"
            },
            "DateCreated": "2020-11-29T09:21:00Z"
        },
        {
            "ID": 18699,
            "ChargePointID": 128359,
            "ItemURL": "https://s3-ap-southeast-2.amazonaws.com/openchargemap/images/IT/OCM128359/OCM-128359.orig.2019062215222944.jpg",
            "ItemThumbnailURL": "https://s3-ap-southeast-2.amazonaws.com/openchargemap/images/IT/OCM128359/OCM-128359.thmb.2019062215222944.jpg",
            "Comment": "",
            "IsEnabled": true,
            "IsVideo": false,
            "IsFeaturedItem": false,
            "IsExternalResource": false,
            "User": {
                "ID": 11749,
                "Username": "ForumElettrico.it"
            },
            "DateCreated": "2019-06-22T15:23:00Z"
        },
        {
            "ID": 18700,
            "ChargePointID": 128359,
            "ItemURL": "https://s3-ap-southeast-2.amazonaws.com/openchargemap/images/IT/OCM128359/OCM-128359.orig.2019062215223496.jpg",
            "ItemThumbnailURL": "https://s3-ap-southeast-2.amazonaws.com/openchargemap/images/IT/OCM128359/OCM-128359.thmb.2019062215223496.jpg",
            "Comment": "",
            "IsEnabled": true,
            "IsVideo": false,
            "IsFeaturedItem": false,
            "IsExternalResource": false,
            "User": {
                "ID": 11749,
                "Username": "ForumElettrico.it"
            },
            "DateCreated": "2019-06-22T15:23:00Z"
        },
        {
            "ID": 18701,
            "ChargePointID": 128359,
            "ItemURL": "https://s3-ap-southeast-2.amazonaws.com/openchargemap/images/IT/OCM128359/OCM-128359.orig.2019062215224020.jpg",
            "ItemThumbnailURL": "https://s3-ap-southeast-2.amazonaws.com/openchargemap/images/IT/OCM128359/OCM-128359.thmb.2019062215224020.jpg",
            "Comment": "",
            "IsEnabled": true,
            "IsVideo": false,
            "IsFeaturedItem": false,
            "IsExternalResource": false,
            "User": {
                "ID": 11749,
                "Username": "ForumElettrico.it"
            },
            "DateCreated": "2019-06-22T15:23:00Z"
        },
        {
            "ID": 18702,
            "ChargePointID": 128359,
            "ItemURL": "https://s3-ap-southeast-2.amazonaws.com/openchargemap/images/IT/OCM128359/OCM-128359.orig.2019062215224535.jpg",
            "ItemThumbnailURL": "https://s3-ap-southeast-2.amazonaws.com/openchargemap/images/IT/OCM128359/OCM-128359.thmb.2019062215224535.jpg",
            "Comment": "",
            "IsEnabled": true,
            "IsVideo": false,
            "IsFeaturedItem": false,
            "IsExternalResource": false,
            "User": {
                "ID": 11749,
                "Username": "ForumElettrico.it"
            },
            "DateCreated": "2019-06-22T15:23:00Z"
        }
    ],
    "IsRecentlyVerified": false,
    "ID": 128359,
    "UUID": "AF2286B4-FBE7-497A-B2D8-200F008DFBCF",
    "DataProviderID": 1,
    "OperatorID": 1,
    "UsageTypeID": 6,
    "AddressInfo": {
        "ID": 128705,
        "Title": "BMW Reggio Motori",
        "AddressLine1": "Via Fratelli Cervi 91",
        "Town": "Reggio Emilia",
        "StateOrProvince": "RE",
        "CountryID": 112,
        "Latitude": 44.713544,
        "Longitude": 10.588185,
        "RelatedURL": "https://www.forumelettrico.it/forum/colonnina-15-kw-reggio-motori-reggio-emilia-re-via-fratelli-cervi-91-t6002.html",
        "DistanceUnit": 0
    },
    "Connections": [
        {
            "ID": 179669,
            "ConnectionTypeID": 1036,
            "StatusTypeID": 0,
            "LevelID": 2,
            "PowerKW": 15,
            "CurrentTypeID": 20,
            "Quantity": 2
        }
    ],
    "NumberOfPoints": 2,
    "StatusTypeID": 50,
    "DateLastStatusUpdate": "2020-11-29T09:21:00Z",
    "DataQualityLevel": 1,
    "DateCreated": "2019-06-22T15:22:00Z",
    "SubmissionStatusTypeID": 200
}