{
    "IsRecentlyVerified": false,
    "ID": 8754,
    "UUID": "A5BE5443-5CCF-4E7D-B9BB-D72F6E755E55",
    "DataProviderID": 15,
    "DataProvidersReference": "11710",
    "OperatorID": 5,
    "UsageTypeID": 1,
    "AddressInfo": {
        "ID": 8651,
        "Title": "25 Chambers St",
        "AddressLine1": "25 Chambers St",
        "Town": "Princeton",
        "StateOrProvince": "New Jersey",
        "Postcode": "8542",
        "CountryID": 2,
        "Latitude": 40.35022,
        "Longitude": -74.66269,
        "ContactTelephone1": "",
        "RelatedURL": "http://carstations.com/11710",
        "DistanceUnit": 0
    },
    "Connections": [
        {
            "ID": 6163,
            "ConnectionTypeID": 9,
            "Reference": "NEMA5",
            "LevelID": 1,
            "Quantity": 1
        },
        {
            "ID": 6301,
            "ConnectionTypeID": 1,
            "Reference": "J1772",
            "LevelID": 2
        }
    ],
    "NumberOfPoints": 1,
    "StatusTypeID": 0,
    "DateLastStatusUpdate": "2017-11-04T14:04:00Z",
    "DataQualityLevel": 1,
    "DateCreated": "2011-11-19T21:32:00Z",
    "SubmissionStatusTypeID": 100
}