{
    "IsRecentlyVerified": false,
    "ID": 38887,
    "UUID": "F2E65ADD-4F62-42ED-B1B4-BC6C2E3A0D7A",
    "DataProviderID": 26,
    "DataProvidersReference": "37148",
    "OperatorID": 157,
    "OperatorsReference": "NewMotion 02008642",
    "UsageCost": "0.00 jaarabonnement",
    "AddressInfo": {
        "ID": 39233,
        "Title": "Skroef 54",
        "AddressLine1": "Skroef 54",
        "Town": "De Fryske Marren",
        "Postcode": "8502 BR",
        "CountryID": 159,
        "Latitude": 52.9774475097656,
        "Longitude": 5.80523920059204,
        "ContactTelephone1": "088 0109500",
        "RelatedURL": "http://thenewmotion.nl/",
        "DistanceUnit": 0
    },
    "Connections": [
        {
            "ID": 42398,
            "ConnectionTypeID": 25,
            "LevelID": 2,
            "PowerKW": 3.7,
            "CurrentTypeID": 10
        }
    ],
    "NumberOfPoints": 1,
    "StatusTypeID": 50,
    "DateLastStatusUpdate": "2016-06-04T02:55:00Z",
    "DataQualityLevel": 3,
    "DateCreated": "2015-01-09T06:08:00Z",
    "SubmissionStatusTypeID": 100
}