{
    "IsRecentlyVerified": false,
    "ID": 183276,
    "UUID": "71CBE24C-6989-49AB-8E2B-1C66F5603B30",
    "DataProviderID": 29,
    "DataProvidersReference": "10076",
    "OperatorID": 224,
    "AddressInfo": {
        "ID": 183635,
        "Title": "Lenzkircherstrasse 24",
        "AddressLine1": "Lenzkircherstrasse 24",
        "Town": "Bonndorf im Schwarzwald",
        "Postcode": "79848",
        "CountryID": 87,
        "Latitude": 47.818418,
        "Longitude": 8.331576,
        "DistanceUnit": 0
    },
    "Connections": [
        {
            "ID": 290061,
            "ConnectionTypeID": 28,
            "StatusTypeID": 50,
            "LevelID": 2,
            "PowerKW": 22,
            "CurrentTypeID": 20
        },
        {
            "ID": 290062,
            "ConnectionTypeID": 25,
            "StatusTypeID": 50,
            "LevelID": 2,
            "PowerKW": 22,
            "CurrentTypeID": 20
        },
        {
            "ID": 295384,
            "ConnectionTypeID": 25,
            "StatusTypeID": 50,
            "LevelID": 2,
            "PowerKW": 22,
            "CurrentTypeID": 20
        }
    ],
    "StatusTypeID": 50,
    "DateLastStatusUpdate": "2021-07-12T02:39:00Z",
    "MetadataValues": [
        {
            "ID": 15569,
            "MetadataFieldID": 4,
            "ItemValue": "Data from the German chargepoint registry provided by Bundesnetzagentur.de under the CC-BY 4.0 license"
        }
    ],
    "DataQualityLevel": 3,
    "DateCreated": "2021-07-08T10:03:00Z",
    "SubmissionStatusTypeID": 100
}