{
    "UserComments": [
        {
            "ID": 9748,
            "ChargePointID": 32581,
            "CommentTypeID": 10,
            "UserName": "HubertB",
            "Comment": "22kW",
            "Rating": 5,
            "DateCreated": "2016-02-19T15:32:43.4Z",
            "User": {
                "ID": 8988,
                "Username": "HubertB"
            },
            "CheckinStatusTypeID": 10
        }
    ],
    "IsRecentlyVerified": false,
    "ID": 32581,
    "UUID": "6B6D66C6-865C-45E7-A967-7A8CB484C28F",
    "DataProviderID": 1,
    "OperatorID": 105,
    "OperatorsReference": "Essent EM-DE-05166036-01-00001",
    "UsageTypeID": 4,
    "AddressInfo": {
        "ID": 32927,
        "Title": "Brauereistraße 7",
        "AddressLine1": "Brauereistraße 7",
        "Town": "Willich",
        "Postcode": "47877",
        "CountryID": 87,
        "Latitude": 51.263404,
        "Longitude": 6.551713,
        "DistanceUnit": 0
    },
    "Connections": [
        {
            "ID": 36092,
            "ConnectionTypeID": 25,
            "LevelID": 2,
            "PowerKW": 22,
            "CurrentTypeID": 20
        }
    ],
    "NumberOfPoints": 1,
    "StatusTypeID": 50,
    "DateLastStatusUpdate": "2016-02-21T19:34:00Z",
    "DataQualityLevel": 3,
    "DateCreated": "2015-01-09T06:03:00Z",
    "SubmissionStatusTypeID": 200
}