{
    "IsRecentlyVerified": false,
    "ID": 23744,
    "UUID": "1D71824A-1419-4E2E-9D29-E8C21833F8B5",
    "DataProviderID": 1,
    "OperatorID": 76,
    "UsageTypeID": 1,
    "UsageCost": "5€/up to 60min",
    "AddressInfo": {
        "ID": 24089,
        "Title": "Tartu-10",
        "AddressLine1": "Ringtee 61",
        "AddressLine2": "Mündeli",
        "Town": "Tartu",
        "StateOrProvince": "Tartu maakond",
        "Postcode": "61708",
        "CountryID": 74,
        "Latitude": 58.36892089466185,
        "Longitude": 26.67740601645756,
        "ContactTelephone1": "+372 6511911",
        "ContactEmail": "tugi@elmo.ee",
        "RelatedURL": "http://www.elmo.ee",
        "DistanceUnit": 0
    },
    "Connections": [
        {
            "ID": 25730,
            "ConnectionTypeID": 2,
            "StatusTypeID": 50,
            "LevelID": 3,
            "Amps": 120,
            "Voltage": 500,
            "PowerKW": 50,
            "CurrentTypeID": 30,
            "Quantity": 1
        },
        {
            "ID": 25731,
            "ConnectionTypeID": 25,
            "StatusTypeID": 50,
            "LevelID": 2,
            "Amps": 32,
            "Voltage": 400,
            "PowerKW": 22,
            "CurrentTypeID": 20,
            "Quantity": 1
        }
    ],
    "NumberOfPoints": 1,
    "GeneralComments": "Opened 24h (automatic). \r\nReal-time condition information (operational/not operational/free) - www.elmo.ee \r\nCan pay with client card, SMS or mobile application. \r\nCharger number 78143",
    "StatusTypeID": 50,
    "DateLastStatusUpdate": "2014-05-28T19:07:00Z",
    "DataQualityLevel": 1,
    "DateCreated": "2014-05-28T19:07:00Z",
    "SubmissionStatusTypeID": 200
}