{
    "IsRecentlyVerified": false,
    "ID": 8249,
    "UUID": "6B8A7755-0A3A-4A4D-8454-46D2BCA694C8",
    "DataProviderID": 15,
    "DataProvidersReference": "7306",
    "OperatorID": 26,
    "AddressInfo": {
        "ID": 8146,
        "Title": "3201 Wsw Loop 323",
        "AddressLine1": "3201 Wsw Loop 323",
        "Town": "Tyler",
        "StateOrProvince": "TX",
        "Postcode": "75701",
        "CountryID": 2,
        "Latitude": 32.31178,
        "Longitude": -95.34144,
        "ContactTelephone1": " (903) 561-7300",
        "RelatedURL": "http://carstations.com/7306",
        "DistanceUnit": 0
    },
    "Connections": [
        {
            "ID": 5678,
            "ConnectionTypeID": 1,
            "Reference": "J1772",
            "LevelID": 2
        }
    ],
    "StatusTypeID": 0,
    "DateLastStatusUpdate": "2017-11-04T14:03:00Z",
    "DataQualityLevel": 1,
    "DateCreated": "2011-11-11T12:06:00Z",
    "SubmissionStatusTypeID": 100
}