{
    "IsRecentlyVerified": false,
    "ID": 65427,
    "UUID": "2DB33F56-64E3-492A-903B-583731507231",
    "DataProviderID": 26,
    "DataProvidersReference": "86715",
    "OperatorID": 178,
    "OperatorsReference": "EVnetNL PNB-ENO133",
    "UsageCost": "0.00 jaarabonnement",
    "AddressInfo": {
        "ID": 65773,
        "Title": "Rietven 75",
        "AddressLine1": "Rietven 75",
        "Town": "Deurne",
        "Postcode": "5751 NJ",
        "CountryID": 159,
        "Latitude": 51.462595,
        "Longitude": 5.769597,
        "ContactTelephone1": "0800-3522365",
        "RelatedURL": "http://www.evnet.nl",
        "DistanceUnit": 0
    },
    "Connections": [
        {
            "ID": 90153,
            "ConnectionTypeID": 25,
            "LevelID": 2,
            "PowerKW": 11,
            "CurrentTypeID": 10
        }
    ],
    "NumberOfPoints": 2,
    "StatusTypeID": 50,
    "DateLastStatusUpdate": "2016-06-04T02:39:00Z",
    "DataQualityLevel": 3,
    "DateCreated": "2016-04-27T09:41:00Z",
    "SubmissionStatusTypeID": 100
}