{
    "IsRecentlyVerified": false,
    "ID": 53837,
    "UUID": "97BEE712-178D-4C49-B254-DD35BAFC10EC",
    "DataProviderID": 26,
    "DataProvidersReference": "68893",
    "OperatorID": 103,
    "OperatorsReference": "Allego NLALLEGO0003191",
    "UsageCost": "0.00 jaarabonnement",
    "AddressInfo": {
        "ID": 54183,
        "Title": "Elzekrulzoom 65",
        "AddressLine1": "Elzekrulzoom 65",
        "Town": "Alphen aan den Rijn",
        "Postcode": "2403 SK",
        "CountryID": 159,
        "Latitude": 52.1511459,
        "Longitude": 4.68070819,
        "ContactTelephone1": "0800-3745337",
        "RelatedURL": "http://www.allego.eu/",
        "DistanceUnit": 0
    },
    "Connections": [
        {
            "ID": 67219,
            "ConnectionTypeID": 25,
            "LevelID": 2,
            "PowerKW": 11,
            "CurrentTypeID": 10
        },
        {
            "ID": 67220,
            "ConnectionTypeID": 25,
            "LevelID": 2,
            "PowerKW": 11,
            "CurrentTypeID": 10
        }
    ],
    "NumberOfPoints": 1,
    "StatusTypeID": 50,
    "DateLastStatusUpdate": "2016-06-04T02:51:00Z",
    "DataQualityLevel": 3,
    "DateCreated": "2015-09-20T11:50:00Z",
    "SubmissionStatusTypeID": 100
}