{
    "IsRecentlyVerified": false,
    "ID": 93943,
    "UUID": "A780075B-1067-4151-A82F-874E42F32F76",
    "DataProviderID": 1,
    "OperatorID": 45,
    "UsageTypeID": 3,
    "AddressInfo": {
        "ID": 94289,
        "Title": "Buchan Electric",
        "AddressLine1": "Rettchensdorfer Straße 1",
        "Town": "Altdöbern",
        "StateOrProvince": "Altdöbern",
        "Postcode": "03229",
        "CountryID": 87,
        "Latitude": 51.650121,
        "Longitude": 14.009142999999995,
        "ContactTelephone1": "+49 35434 13203",
        "AccessComments": "Das Laden ist zu Bürozeiten möglich. Bitte bei Ladewunsch am Empfang melden.",
        "RelatedURL": "http://www.buchanelectric.de/component/content/article/7-kat-ueber-uns/53-e-mobility.html",
        "DistanceUnit": 0
    },
    "Connections": [
        {
            "ID": 132980,
            "ConnectionTypeID": 25,
            "StatusTypeID": 50,
            "LevelID": 2,
            "Amps": 16,
            "Voltage": 400,
            "PowerKW": 11,
            "CurrentTypeID": 20,
            "Quantity": 1
        }
    ],
    "NumberOfPoints": 1,
    "StatusTypeID": 50,
    "DateLastStatusUpdate": "2017-10-13T07:49:00Z",
    "DataQualityLevel": 1,
    "DateCreated": "2017-10-13T07:49:00Z",
    "SubmissionStatusTypeID": 200
}