{
    "IsRecentlyVerified": false,
    "ID": 19696,
    "UUID": "7BBE3938-4813-484C-90CC-017399C999CE",
    "DataProviderID": 1,
    "OperatorID": 69,
    "UsageTypeID": 4,
    "UsageCost": "Free",
    "AddressInfo": {
        "ID": 20041,
        "Title": "Stadtwerke Rösrath",
        "AddressLine1": "Hauptstraße 142",
        "Town": "Rösrath",
        "StateOrProvince": "Nordrhein-Westfalen",
        "Postcode": "51503",
        "CountryID": 87,
        "Latitude": 50.90731325,
        "Longitude": 7.18823506737866,
        "ContactTelephone1": "+4922059250600",
        "ContactEmail": "info@stadtwerke-roesrath.de",
        "AccessComments": "Ladenetz.de Karte erforderlich",
        "RelatedURL": "http://www.ladenetz.de",
        "DistanceUnit": 0
    },
    "Connections": [
        {
            "ID": 19876,
            "ConnectionTypeID": 25,
            "StatusTypeID": 50,
            "LevelID": 2,
            "Amps": 16,
            "Voltage": 400,
            "PowerKW": 11,
            "CurrentTypeID": 20,
            "Quantity": 2
        }
    ],
    "NumberOfPoints": 2,
    "GeneralComments": "Ladenetz.de card required",
    "StatusTypeID": 50,
    "DateLastStatusUpdate": "2013-10-11T08:39:00Z",
    "MetadataValues": [
        {
            "ID": 278,
            "MetadataFieldID": 4,
            "ItemValue": "Data © OpenStreetMap contributors, ODbL 1.0. http://www.openstreetmap.org/copyright"
        }
    ],
    "DataQualityLevel": 1,
    "DateCreated": "2013-10-10T15:54:00Z",
    "SubmissionStatusTypeID": 200
}