{
    "IsRecentlyVerified": false,
    "ID": 63938,
    "UUID": "53FBC095-38F6-4CDE-8302-AE9E1AEA0E28",
    "DataProviderID": 26,
    "DataProvidersReference": "74030",
    "OperatorID": 73,
    "OperatorsReference": "EV-Box EVB-P1421123",
    "UsageCost": "0.00 jaarabonnement",
    "AddressInfo": {
        "ID": 64284,
        "Title": "Leidsevaartweg 99",
        "AddressLine1": "Leidsevaartweg 99",
        "Town": "Heemstede",
        "Postcode": "2106 AS",
        "CountryID": 159,
        "Latitude": 52.3597,
        "Longitude": 4.60758,
        "RelatedURL": "http://www.ev-box.nl",
        "DistanceUnit": 0
    },
    "Connections": [
        {
            "ID": 81719,
            "ConnectionTypeID": 25,
            "LevelID": 2,
            "PowerKW": 11,
            "CurrentTypeID": 10
        },
        {
            "ID": 81720,
            "ConnectionTypeID": 25,
            "LevelID": 2,
            "PowerKW": 11,
            "CurrentTypeID": 10
        }
    ],
    "NumberOfPoints": 1,
    "StatusTypeID": 50,
    "DateLastStatusUpdate": "2016-06-04T02:53:00Z",
    "DataQualityLevel": 3,
    "DateCreated": "2016-03-03T12:32:00Z",
    "SubmissionStatusTypeID": 100
}