{
    "IsRecentlyVerified": false,
    "ID": 135927,
    "UUID": "FC58602A-EE1C-453B-A92A-45E8F6365F9D",
    "DataProviderID": 18,
    "DataProvidersReference": "d058119339a228a264b25bbd79b8b33d",
    "OperatorID": 2244,
    "UsageTypeID": 5,
    "AddressInfo": {
        "ID": 136273,
        "Title": "Killyon Road",
        "AddressLine1": "Killyon Road",
        "Town": "London",
        "Postcode": "SW4 6JX",
        "CountryID": 1,
        "Latitude": 51.46988,
        "Longitude": -0.137054,
        "AccessComments": "",
        "RelatedURL": "https://www.ubitricity.com",
        "DistanceUnit": 0
    },
    "Connections": [
        {
            "ID": 190350,
            "ConnectionTypeID": 25,
            "Reference": "suby1100000890",
            "StatusTypeID": 50,
            "LevelID": 2,
            "Amps": 16,
            "Voltage": 230,
            "PowerKW": 3.7,
            "CurrentTypeID": 10
        }
    ],
    "StatusTypeID": 0,
    "DateLastStatusUpdate": "2021-04-25T05:46:00Z",
    "MetadataValues": [
        {
            "ID": 5779,
            "MetadataFieldID": 4,
            "ItemValue": "Contains public sector information licensed under the Open Government Licence v2.0. http://www.nationalarchives.gov.uk/doc/open-government-licence/version/2/"
        }
    ],
    "DataQualityLevel": 3,
    "DateCreated": "2019-12-24T05:22:00Z",
    "SubmissionStatusTypeID": 100
}