{
    "IsRecentlyVerified": false,
    "ID": 110057,
    "UUID": "072F58E2-412A-4664-9C27-869DA2C5A762",
    "DataProviderID": 2,
    "DataProvidersReference": "103500",
    "OperatorID": 5,
    "UsageTypeID": 1,
    "AddressInfo": {
        "ID": 110403,
        "Title": "GRAYHAWKMEDICAL",
        "AddressLine1": "20401 N Scottsdale Healthcare Dr",
        "Town": "Scottsdale",
        "StateOrProvince": "AZ",
        "Postcode": "85255",
        "CountryID": 2,
        "Latitude": 33.6734442,
        "Longitude": -111.9233875,
        "ContactTelephone1": "888-758-4389",
        "AccessComments": "24 hours daily",
        "RelatedURL": "http://www.chargepoint.com/",
        "DistanceUnit": 0
    },
    "Connections": [
        {
            "ID": 155286,
            "ConnectionTypeID": 1,
            "LevelID": 2,
            "Amps": 16,
            "Voltage": 230,
            "PowerKW": 3,
            "CurrentTypeID": 10,
            "Quantity": 2
        }
    ],
    "DateLastStatusUpdate": "2019-04-06T04:01:00Z",
    "DataQualityLevel": 3,
    "DateCreated": "2018-10-18T23:35:00Z",
    "SubmissionStatusTypeID": 100
}