{
    "IsRecentlyVerified": false,
    "ID": 113120,
    "UUID": "F594637A-BA24-4A0E-A56C-94CA131F685E",
    "DataProviderID": 2,
    "DataProvidersReference": "104745",
    "UsageTypeID": 7,
    "AddressInfo": {
        "ID": 113466,
        "Title": "Shults Ford",
        "AddressLine1": "1300 Gulf Lab Rd",
        "Town": "Pittsburgh",
        "StateOrProvince": "PA",
        "Postcode": "15238",
        "CountryID": 2,
        "Latitude": 40.540543,
        "Longitude": -79.838003,
        "ContactTelephone1": "412-828-2300",
        "AccessComments": "Dealership business hours\r\nPublic - Call ahead",
        "RelatedURL": "",
        "DistanceUnit": 0
    },
    "Connections": [
        {
            "ID": 159290,
            "ConnectionTypeID": 1,
            "LevelID": 2,
            "Amps": 16,
            "Voltage": 230,
            "PowerKW": 3.7,
            "CurrentTypeID": 10,
            "Quantity": 1
        }
    ],
    "DateLastStatusUpdate": "2020-06-26T03:03:00Z",
    "DataQualityLevel": 3,
    "DateCreated": "2018-11-28T02:04:00Z",
    "SubmissionStatusTypeID": 100
}