{
    "IsRecentlyVerified": false,
    "ID": 109173,
    "UUID": "552A9D9E-2DFF-4CAC-8998-0437DB3AAAF1",
    "DataProviderID": 1,
    "OperatorID": 23,
    "OperatorsReference": "44755",
    "UsageTypeID": 4,
    "AddressInfo": {
        "ID": 109519,
        "Title": "Hotel Alte Werft Papenburg",
        "AddressLine1": "Oelmuehlenweg 1",
        "StateOrProvince": "Papenburg",
        "Postcode": "26871",
        "CountryID": 87,
        "Latitude": 53.08749,
        "Longitude": 7.3853313,
        "ContactTelephone1": " +49 4961 9200",
        "DistanceUnit": 0
    },
    "Connections": [
        {
            "ID": 154291,
            "ConnectionTypeID": 30,
            "StatusTypeID": 50,
            "LevelID": 2,
            "Amps": 16,
            "Voltage": 400,
            "PowerKW": 11,
            "CurrentTypeID": 20,
            "Quantity": 1
        }
    ],
    "NumberOfPoints": 1,
    "GeneralComments": "1 Tesla Connector, up to 11kW.Available for customers. Please see front desk.",
    "StatusTypeID": 50,
    "DateLastStatusUpdate": "2018-10-11T13:50:00Z",
    "DataQualityLevel": 1,
    "DateCreated": "2018-10-11T13:50:00Z",
    "SubmissionStatusTypeID": 200
}