{
    "IsRecentlyVerified": false,
    "ID": 136489,
    "UUID": "9BBACA97-3437-4EE1-AE0C-EF33C1B58419",
    "DataProviderID": 18,
    "DataProvidersReference": "4dfd1d3eb70a47d3611a8bc08fdc155d",
    "OperatorID": 2244,
    "UsageTypeID": 5,
    "AddressInfo": {
        "ID": 136835,
        "Title": "Frognal Lane",
        "AddressLine1": "Frognal Lane",
        "Town": "London",
        "Postcode": "NW3 7DU",
        "CountryID": 1,
        "Latitude": 51.553565,
        "Longitude": -0.186328,
        "AccessComments": "",
        "RelatedURL": "https://www.ubitricity.com",
        "DistanceUnit": 0
    },
    "Connections": [
        {
            "ID": 190939,
            "ConnectionTypeID": 25,
            "Reference": "suby1100003158",
            "StatusTypeID": 50,
            "LevelID": 2,
            "Amps": 16,
            "Voltage": 230,
            "PowerKW": 3.7,
            "CurrentTypeID": 10
        }
    ],
    "StatusTypeID": 0,
    "DateLastStatusUpdate": "2021-04-25T05:46:00Z",
    "MetadataValues": [
        {
            "ID": 6341,
            "MetadataFieldID": 4,
            "ItemValue": "Contains public sector information licensed under the Open Government Licence v2.0. http://www.nationalarchives.gov.uk/doc/open-government-licence/version/2/"
        }
    ],
    "DataQualityLevel": 3,
    "DateCreated": "2019-12-24T05:22:00Z",
    "SubmissionStatusTypeID": 100
}