{
    "IsRecentlyVerified": false,
    "ID": 157022,
    "UUID": "75C2B2BB-968F-4E5E-89FC-A1195AC49850",
    "DataProviderID": 19,
    "DataProvidersReference": "6417",
    "AddressInfo": {
        "ID": 157376,
        "Title": "Vestgrensa 5",
        "AddressLine1": "Vestgrensa 5",
        "Town": "OSLO",
        "StateOrProvince": "Oslo",
        "Postcode": "0851",
        "CountryID": 168,
        "Latitude": 59.94299,
        "Longitude": 10.72775,
        "AccessComments": "",
        "DistanceUnit": 0
    },
    "Connections": [
        {
            "ID": 224152,
            "ConnectionTypeID": 25,
            "Reference": "1",
            "LevelID": 2,
            "Amps": 16,
            "Voltage": 230,
            "PowerKW": 3.7,
            "CurrentTypeID": 10,
            "Comments": "Mode 3"
        },
        {
            "ID": 224153,
            "ConnectionTypeID": 25,
            "Reference": "2",
            "LevelID": 2,
            "Amps": 16,
            "Voltage": 230,
            "PowerKW": 3.7,
            "CurrentTypeID": 10,
            "Comments": "Mode 3"
        },
        {
            "ID": 224154,
            "ConnectionTypeID": 25,
            "Reference": "3",
            "LevelID": 2,
            "Amps": 16,
            "Voltage": 230,
            "PowerKW": 3.7,
            "CurrentTypeID": 10,
            "Comments": "Mode 3"
        },
        {
            "ID": 224155,
            "ConnectionTypeID": 25,
            "Reference": "4",
            "LevelID": 2,
            "Amps": 16,
            "Voltage": 230,
            "PowerKW": 3.7,
            "CurrentTypeID": 10,
            "Comments": "Mode 3"
        },
        {
            "ID": 224156,
            "ConnectionTypeID": 25,
            "Reference": "5",
            "LevelID": 2,
            "Amps": 16,
            "Voltage": 230,
            "PowerKW": 3.7,
            "CurrentTypeID": 10,
            "Comments": "Mode 3"
        },
        {
            "ID": 224157,
            "ConnectionTypeID": 25,
            "Reference": "6",
            "LevelID": 2,
            "Amps": 16,
            "Voltage": 230,
            "PowerKW": 3.7,
            "CurrentTypeID": 10,
            "Comments": "Mode 3"
        },
        {
            "ID": 224158,
            "ConnectionTypeID": 25,
            "Reference": "7",
            "LevelID": 2,
            "Amps": 16,
            "Voltage": 230,
            "PowerKW": 3.7,
            "CurrentTypeID": 10,
            "Comments": "Mode 3"
        },
        {
            "ID": 224159,
            "ConnectionTypeID": 25,
            "Reference": "8",
            "LevelID": 2,
            "Amps": 16,
            "Voltage": 230,
            "PowerKW": 3.7,
            "CurrentTypeID": 10,
            "Comments": "Mode 3"
        }
    ],
    "NumberOfPoints": 8,
    "StatusTypeID": 0,
    "DateLastStatusUpdate": "2021-03-24T05:11:00Z",
    "DataQualityLevel": 2,
    "DateCreated": "2020-05-26T08:23:00Z",
    "SubmissionStatusTypeID": 100
}