{
    "IsRecentlyVerified": false,
    "ID": 56989,
    "UUID": "5108E9C6-BEC5-45A3-8770-9324545D4BAB",
    "DataProviderID": 1,
    "OperatorID": 80,
    "UsageTypeID": 4,
    "UsageCost": "0,40 €/kW",
    "AddressInfo": {
        "ID": 57335,
        "Title": "Eneldrive  Renauto",
        "AddressLine1": "Viale Japigia 180",
        "Town": "Bari",
        "StateOrProvince": "BA",
        "Postcode": "70126",
        "CountryID": 112,
        "Latitude": 41.1129488309439,
        "Longitude": 16.8988563736502,
        "RelatedURL": "http://eneldrive.it",
        "DistanceUnit": 0
    },
    "Connections": [
        {
            "ID": 71956,
            "ConnectionTypeID": 25,
            "StatusTypeID": 50,
            "LevelID": 2,
            "Amps": 32,
            "Voltage": 400,
            "PowerKW": 22,
            "CurrentTypeID": 20,
            "Quantity": 2
        },
        {
            "ID": 71957,
            "ConnectionTypeID": 36,
            "StatusTypeID": 50,
            "LevelID": 2,
            "Amps": 16,
            "Voltage": 240,
            "PowerKW": 3.7,
            "CurrentTypeID": 10,
            "Quantity": 2
        }
    ],
    "NumberOfPoints": 2,
    "StatusTypeID": 50,
    "DateLastStatusUpdate": "2016-04-12T16:22:00Z",
    "DataQualityLevel": 1,
    "DateCreated": "2015-11-19T16:59:00Z",
    "SubmissionStatusTypeID": 200
}