{
    "UserComments": [
        {
            "ID": 1286,
            "ChargePointID": 24418,
            "CommentTypeID": 10,
            "UserName": "cros13",
            "Comment": "",
            "DateCreated": "2014-10-11T08:39:18.827Z",
            "User": {
                "ID": 2297,
                "Username": "cros13"
            },
            "CheckinStatusTypeID": 10
        }
    ],
    "IsRecentlyVerified": false,
    "ID": 24418,
    "UUID": "DFAA21B0-A49E-46AB-9374-02441E6BDD66",
    "DataProviderID": 1,
    "OperatorID": 22,
    "OperatorsReference": "C2H76",
    "UsageTypeID": 4,
    "UsageCost": "Free",
    "AddressInfo": {
        "ID": 24764,
        "Title": "Dolan's Service Station",
        "AddressLine1": "R446",
        "Town": "Ballinasloe",
        "StateOrProvince": "County Roscommon",
        "CountryID": 3,
        "Latitude": 53.3284981484586,
        "Longitude": -8.18510515804382,
        "DistanceUnit": 0
    },
    "Connections": [
        {
            "ID": 26615,
            "ConnectionTypeID": 2,
            "StatusTypeID": 50,
            "LevelID": 3,
            "Amps": 120,
            "Voltage": 500,
            "PowerKW": 50,
            "CurrentTypeID": 30,
            "Quantity": 1
        },
        {
            "ID": 26616,
            "ConnectionTypeID": 1036,
            "StatusTypeID": 50,
            "LevelID": 3,
            "Amps": 63,
            "Voltage": 400,
            "PowerKW": 43,
            "CurrentTypeID": 20,
            "Quantity": 1
        },
        {
            "ID": 26820,
            "ConnectionTypeID": 33,
            "StatusTypeID": 50,
            "LevelID": 3,
            "Amps": 120,
            "Voltage": 500,
            "PowerKW": 50,
            "CurrentTypeID": 30,
            "Quantity": 1
        }
    ],
    "NumberOfPoints": 2,
    "GeneralComments": "efacec QC45",
    "StatusTypeID": 50,
    "DateLastStatusUpdate": "2019-06-03T09:43:00Z",
    "DataQualityLevel": 1,
    "DateCreated": "2014-09-19T11:08:00Z",
    "SubmissionStatusTypeID": 200
}