{
    "MediaItems": [
        {
            "ID": 16090,
            "ChargePointID": 107475,
            "ItemURL": "https://s3-ap-southeast-2.amazonaws.com/openchargemap/images/HU/OCM107475/OCM-107475.orig.2018080113342174.jpg",
            "ItemThumbnailURL": "https://s3-ap-southeast-2.amazonaws.com/openchargemap/images/HU/OCM107475/OCM-107475.thmb.2018080113342174.jpg",
            "Comment": "(fotó: Tarjányi Ernő)",
            "IsEnabled": true,
            "IsVideo": false,
            "IsFeaturedItem": false,
            "IsExternalResource": false,
            "User": {
                "ID": 4438,
                "Username": "tibor.antaloczy"
            },
            "DateCreated": "2018-08-01T13:35:00Z"
        }
    ],
    "IsRecentlyVerified": false,
    "ID": 107475,
    "UUID": "9847F39B-345A-4E39-A6B5-EBC3608F98CD",
    "DataProviderID": 1,
    "OperatorID": 3307,
    "UsageTypeID": 1,
    "UsageCost": "Szolgáltatás díja (bruttó): 80Ft/kWh",
    "AddressInfo": {
        "ID": 107821,
        "Title": "Kiskunfélegyháza, Szent János tér 4.",
        "AddressLine1": "Szent János tér 4.",
        "Town": "Kiskunfélegyháza",
        "StateOrProvince": "Bács-Kiskun megye",
        "Postcode": "6100",
        "CountryID": 104,
        "Latitude": 46.710558992408565,
        "Longitude": 19.84939703439329,
        "ContactTelephone1": "+36 82 56-57-58",
        "ContactTelephone2": "",
        "ContactEmail": "help@mobiliti.hu",
        "RelatedURL": "http://www.mobiliti.hu",
        "DistanceUnit": 0
    },
    "Connections": [
        {
            "ID": 151626,
            "ConnectionTypeID": 25,
            "StatusTypeID": 50,
            "LevelID": 2,
            "Amps": 32,
            "Voltage": 400,
            "PowerKW": 22,
            "CurrentTypeID": 20,
            "Quantity": 2
        }
    ],
    "NumberOfPoints": 2,
    "StatusTypeID": 50,
    "DateLastStatusUpdate": "2020-05-08T07:47:00Z",
    "DataQualityLevel": 1,
    "DateCreated": "2018-07-29T21:01:00Z",
    "SubmissionStatusTypeID": 200
}