{
    "IsRecentlyVerified": false,
    "ID": 96338,
    "UUID": "447EBB62-D8B0-4FB6-9122-C429C39E2E3F",
    "DataProviderID": 1,
    "OperatorID": 1,
    "UsageTypeID": 5,
    "UsageCost": "2,26€ + 0.345€/kWh",
    "AddressInfo": {
        "ID": 96684,
        "Title": "Schnelllader Parkplatz Am Strande",
        "AddressLine1": "Seestraße",
        "AddressLine2": "Ecke Am Strande",
        "Town": "Grömitz",
        "StateOrProvince": "Kreis Ostholstein",
        "Postcode": "23743",
        "CountryID": 87,
        "Latitude": 54.145505184188,
        "Longitude": 10.9616968186724,
        "AccessComments": "24/7 nutzbar",
        "RelatedURL": "http://www.swnh.de/aktuelle-meldung/hier-gibts-saft-fuer-e-mobile-5-neue-schnellladesaeulen-in-neustadt-groemitz-und-heiligenhafen.html",
        "DistanceUnit": 0
    },
    "Connections": [
        {
            "ID": 136497,
            "ConnectionTypeID": 1036,
            "StatusTypeID": 50,
            "LevelID": 2,
            "Amps": 32,
            "Voltage": 400,
            "PowerKW": 22,
            "CurrentTypeID": 20,
            "Quantity": 1
        },
        {
            "ID": 136498,
            "ConnectionTypeID": 2,
            "StatusTypeID": 50,
            "LevelID": 3,
            "PowerKW": 50,
            "CurrentTypeID": 30,
            "Quantity": 1
        },
        {
            "ID": 136499,
            "ConnectionTypeID": 33,
            "StatusTypeID": 50,
            "LevelID": 3,
            "PowerKW": 50,
            "CurrentTypeID": 30,
            "Quantity": 1
        }
    ],
    "NumberOfPoints": 3,
    "GeneralComments": "Betreiber sind die Stadtwerke Heiligenhafen",
    "StatusTypeID": 50,
    "DateLastStatusUpdate": "2017-12-21T09:14:00Z",
    "DataQualityLevel": 1,
    "DateCreated": "2017-12-21T09:11:00Z",
    "SubmissionStatusTypeID": 200
}