{
    "IsRecentlyVerified": false,
    "ID": 81590,
    "UUID": "CA867166-8241-412D-A418-458DFC0D7E3F",
    "DataProviderID": 1,
    "OperatorID": 23,
    "OperatorsReference": "7635",
    "UsageTypeID": 6,
    "AddressInfo": {
        "ID": 81936,
        "Title": "Best Western Plus Tacoma Dome Hotel",
        "AddressLine1": "2611 East E St",
        "Town": "Tacoma",
        "StateOrProvince": "WA",
        "Postcode": "98421",
        "CountryID": 2,
        "Latitude": 47.23853,
        "Longitude": -122.427213,
        "ContactTelephone1": "(253) 272-7737",
        "DistanceUnit": 0
    },
    "Connections": [
        {
            "ID": 116331,
            "ConnectionTypeID": 30,
            "StatusTypeID": 50,
            "LevelID": 2,
            "PowerKW": 13,
            "CurrentTypeID": 20,
            "Quantity": 2
        }
    ],
    "NumberOfPoints": 2,
    "GeneralComments": "2 Tesla Connectors, up to 13kW.Available for patrons only. Please see front desk.",
    "StatusTypeID": 50,
    "DateLastStatusUpdate": "2017-02-02T22:53:00Z",
    "DataQualityLevel": 1,
    "DateCreated": "2017-02-02T22:53:00Z",
    "SubmissionStatusTypeID": 200
}