{
    "IsRecentlyVerified": false,
    "ID": 35447,
    "UUID": "94C123B3-9E8B-42D0-9F02-6422F5EFCF28",
    "DataProviderID": 26,
    "DataProvidersReference": "54578",
    "OperatorID": 180,
    "OperatorsReference": "Alfen RHL03222",
    "UsageCost": "0.00 jaarabonnement",
    "AddressInfo": {
        "ID": 35793,
        "Title": "Hermelijnwit 4",
        "AddressLine1": "Hermelijnwit 4",
        "Town": "Zoetermeer",
        "Postcode": "2718 AM",
        "CountryID": 159,
        "Latitude": 52.045134,
        "Longitude": 4.491067,
        "ContactTelephone1": "036 - 549 34 00",
        "RelatedURL": "http://www.icu-charging-stations.com/",
        "DistanceUnit": 0
    },
    "Connections": [
        {
            "ID": 38958,
            "ConnectionTypeID": 25,
            "LevelID": 2,
            "PowerKW": 11,
            "CurrentTypeID": 10
        },
        {
            "ID": 47868,
            "ConnectionTypeID": 25,
            "LevelID": 2,
            "PowerKW": 11,
            "CurrentTypeID": 10
        }
    ],
    "NumberOfPoints": 1,
    "StatusTypeID": 50,
    "DateLastStatusUpdate": "2016-06-04T02:44:00Z",
    "DataQualityLevel": 3,
    "DateCreated": "2015-01-09T06:05:00Z",
    "SubmissionStatusTypeID": 100
}