{
    "IsRecentlyVerified": false,
    "ID": 41486,
    "UUID": "5377C184-544F-4689-886D-21ED09ECEDAD",
    "DataProviderID": 1,
    "OperatorID": 93,
    "OperatorsReference": "SC33",
    "UsageTypeID": 4,
    "AddressInfo": {
        "ID": 41832,
        "Title": "DRD Car Park on Cromac Street",
        "AddressLine1": "Cromac Street",
        "Town": "Belfast",
        "Postcode": "BT2 8JN",
        "CountryID": 1,
        "Latitude": 54.594109,
        "Longitude": -5.924292,
        "AccessComments": "DRD Car Park on Cromac Street, usual car parking charges apply (Socket 1)",
        "DistanceUnit": 0
    },
    "Connections": [
        {
            "ID": 45370,
            "ConnectionTypeID": 25,
            "Reference": "LBBN24000974",
            "StatusTypeID": 100,
            "LevelID": 2,
            "Amps": 32,
            "Voltage": 400,
            "PowerKW": 22,
            "CurrentTypeID": 20,
            "Quantity": 2
        }
    ],
    "NumberOfPoints": 2,
    "StatusTypeID": 100,
    "DateLastStatusUpdate": "2019-06-03T09:02:00Z",
    "MetadataValues": [
        {
            "ID": 1322,
            "MetadataFieldID": 4,
            "ItemValue": "Contains public sector information licensed under the Open Government Licence v2.0. http://www.nationalarchives.gov.uk/doc/open-government-licence/version/2/"
        }
    ],
    "DataQualityLevel": 3,
    "DateCreated": "2015-02-05T08:39:00Z",
    "SubmissionStatusTypeID": 100
}