{
    "IsRecentlyVerified": false,
    "ID": 53995,
    "UUID": "C93C297C-1E01-491E-B651-36353BD3480D",
    "DataProviderID": 26,
    "DataProvidersReference": "70124",
    "OperatorID": 179,
    "OperatorsReference": "Ecotap 1601298",
    "UsageCost": "0.00 afhankelijk van pas",
    "AddressInfo": {
        "ID": 54341,
        "Title": "Waddenpromenade 3-1",
        "AddressLine1": "Waddenpromenade 3-1",
        "Town": "Harlingen",
        "Postcode": "8861 NT",
        "CountryID": 159,
        "Latitude": 53.176522,
        "Longitude": 5.414089,
        "RelatedURL": "http://www.ecotap.nl",
        "DistanceUnit": 0
    },
    "Connections": [
        {
            "ID": 67511,
            "ConnectionTypeID": 25,
            "LevelID": 2,
            "PowerKW": 22,
            "CurrentTypeID": 10
        }
    ],
    "NumberOfPoints": 2,
    "StatusTypeID": 50,
    "DateLastStatusUpdate": "2016-06-04T02:56:00Z",
    "DataQualityLevel": 3,
    "DateCreated": "2015-09-20T11:50:00Z",
    "SubmissionStatusTypeID": 100
}