{
    "IsRecentlyVerified": false,
    "ID": 46666,
    "UUID": "D082499F-6713-4EB9-BDBD-460D87611268",
    "DataProviderID": 1,
    "DataProvidersReference": "857",
    "AddressInfo": {
        "ID": 47012,
        "Title": "Fosen videregående skole",
        "AddressLine1": "Alf Nebbs gate 14",
        "Town": "BJUGN",
        "StateOrProvince": "Trøndelag",
        "Postcode": "7160",
        "CountryID": 168,
        "Latitude": 63.76586,
        "Longitude": 9.81975,
        "AccessComments": "Splittet i 2 stasjoner, litt fra hverandre.",
        "DistanceUnit": 0
    },
    "Connections": [
        {
            "ID": 57329,
            "ConnectionTypeID": 0,
            "Reference": "1",
            "LevelID": 2,
            "Amps": 16,
            "Voltage": 230,
            "PowerKW": 3.7,
            "Comments": "Mode 1"
        },
        {
            "ID": 87533,
            "ConnectionTypeID": 0,
            "Reference": "2",
            "LevelID": 2,
            "Amps": 16,
            "Voltage": 230,
            "PowerKW": 3.7,
            "Comments": "Mode 1"
        },
        {
            "ID": 87534,
            "ConnectionTypeID": 0,
            "Reference": "3",
            "LevelID": 2,
            "Amps": 16,
            "Voltage": 230,
            "PowerKW": 3.7,
            "Comments": "Mode 1"
        },
        {
            "ID": 89477,
            "ConnectionTypeID": 0,
            "Reference": "4",
            "LevelID": 2,
            "Amps": 16,
            "Voltage": 230,
            "PowerKW": 3.7,
            "Comments": "Mode 1"
        }
    ],
    "NumberOfPoints": 4,
    "DateLastStatusUpdate": "2020-05-26T08:25:00Z",
    "DataQualityLevel": 2,
    "DateCreated": "2015-05-03T00:54:00Z",
    "SubmissionStatusTypeID": 100
}