{
    "IsRecentlyVerified": false,
    "ID": 52236,
    "UUID": "C68F855F-F5F7-44D0-ACC2-AE694D39A5DA",
    "DataProviderID": 1,
    "OperatorID": 161,
    "UsageTypeID": 4,
    "AddressInfo": {
        "ID": 52582,
        "Title": "Zenkerstraße",
        "AddressLine1": "Zenkerstraße 10",
        "Town": "Halle (Saale)",
        "StateOrProvince": "Halle (Saale)",
        "Postcode": "06108",
        "CountryID": 87,
        "Latitude": 51.4796014479806,
        "Longitude": 11.967953616594,
        "ContactTelephone1": "+49 345 581-2222",
        "RelatedURL": "http://www.stadtwerke-halle.de/",
        "DistanceUnit": 0
    },
    "Connections": [
        {
            "ID": 64864,
            "ConnectionTypeID": 25,
            "StatusTypeID": 50,
            "LevelID": 2,
            "Amps": 32,
            "Voltage": 400,
            "PowerKW": 22,
            "CurrentTypeID": 20,
            "Quantity": 2
        }
    ],
    "NumberOfPoints": 2,
    "GeneralComments": "24/7 nutzbar, max. 4 Stunden Parken, freischaltbar mit EVH Stromtankkarte oder HAVAG Umweltcard Gold.",
    "StatusTypeID": 50,
    "DateLastStatusUpdate": "2017-01-20T07:13:00Z",
    "DataQualityLevel": 1,
    "DateCreated": "2015-08-26T05:58:00Z",
    "SubmissionStatusTypeID": 200
}