{
    "IsRecentlyVerified": false,
    "ID": 144261,
    "UUID": "E656247E-C0D9-4F21-9819-CACB444AF964",
    "DataProviderID": 2,
    "DataProvidersReference": "130393",
    "OperatorID": 90,
    "UsageTypeID": 1,
    "AddressInfo": {
        "ID": 144613,
        "Title": "400 Monkland : Centre culturel de Notre-Dame-de-Grâce",
        "AddressLine1": "400 Monkland Ave",
        "Town": "Montreal",
        "StateOrProvince": "QC",
        "Postcode": "H4B 1H3",
        "CountryID": 44,
        "Latitude": 45.4650448,
        "Longitude": -73.6318377,
        "ContactTelephone1": "877-505-2674",
        "AccessComments": "24 hours daily",
        "RelatedURL": "https://lecircuitelectrique.com/",
        "DistanceUnit": 0
    },
    "Connections": [
        {
            "ID": 200753,
            "ConnectionTypeID": 1,
            "LevelID": 2,
            "Amps": 16,
            "Voltage": 230,
            "PowerKW": 3.7,
            "CurrentTypeID": 10,
            "Quantity": 1
        }
    ],
    "StatusTypeID": 50,
    "DateLastStatusUpdate": "2020-06-26T03:09:00Z",
    "DataQualityLevel": 3,
    "DateCreated": "2019-12-24T09:23:00Z",
    "SubmissionStatusTypeID": 100
}