{
    "IsRecentlyVerified": false,
    "ID": 68791,
    "UUID": "8C6E2130-699C-4D15-9065-B3DFC3F0C43F",
    "DataProviderID": 1,
    "OperatorID": 23,
    "OperatorsReference": "18068",
    "UsageTypeID": 1,
    "UsageCost": "Free",
    "AddressInfo": {
        "ID": 69137,
        "Title": "Cambria Hotel & Suites - Tesla",
        "AddressLine1": "7500 Parkwood Blvd",
        "Town": "Plano",
        "StateOrProvince": "TX",
        "Postcode": "75024",
        "CountryID": 2,
        "Latitude": 33.0811404,
        "Longitude": -96.8175769,
        "ContactTelephone1": "972-473-9010  877-798-3752",
        "AccessComments": "24 hours daily; for Tesla use only",
        "RelatedURL": "http://www.teslamotors.com/supercharger",
        "DistanceUnit": 0
    },
    "Connections": [
        {
            "ID": 96491,
            "ConnectionTypeID": 30,
            "StatusTypeID": 50,
            "LevelID": 2,
            "Amps": 16,
            "Voltage": 230,
            "PowerKW": 8,
            "CurrentTypeID": 10,
            "Quantity": 2
        }
    ],
    "NumberOfPoints": 2,
    "StatusTypeID": 50,
    "DateLastStatusUpdate": "2017-01-31T20:05:00Z",
    "DataQualityLevel": 3,
    "DateCreated": "2016-06-25T03:36:00Z",
    "SubmissionStatusTypeID": 100
}