{
    "IsRecentlyVerified": false,
    "ID": 113184,
    "UUID": "33598F67-2FAD-4103-A8EF-2C8985E77DB6",
    "DataProviderID": 2,
    "DataProvidersReference": "104135",
    "UsageTypeID": 1,
    "AddressInfo": {
        "ID": 113530,
        "Title": "Village of Cherry Valley",
        "AddressLine1": "2 Genesee St",
        "Town": "Cherry Valley",
        "StateOrProvince": "NY",
        "Postcode": "13320",
        "CountryID": 2,
        "Latitude": 42.797294,
        "Longitude": -74.758022,
        "ContactTelephone1": "607-264-3791",
        "AccessComments": "24 hours daily",
        "RelatedURL": "",
        "DistanceUnit": 0
    },
    "Connections": [
        {
            "ID": 159369,
            "ConnectionTypeID": 1,
            "LevelID": 2,
            "Amps": 16,
            "Voltage": 230,
            "PowerKW": 3.7,
            "CurrentTypeID": 10,
            "Quantity": 2
        }
    ],
    "DateLastStatusUpdate": "2020-06-26T03:06:00Z",
    "DataQualityLevel": 3,
    "DateCreated": "2018-11-28T02:04:00Z",
    "SubmissionStatusTypeID": 100
}