{
    "IsRecentlyVerified": false,
    "ID": 138139,
    "UUID": "2E7C7D87-E53C-4D5F-8531-3340E54433FE",
    "DataProviderID": 2,
    "DataProvidersReference": "96484",
    "OperatorID": 9,
    "UsageTypeID": 1,
    "AddressInfo": {
        "ID": 138488,
        "Title": "Key Colony 2 Condominiums",
        "AddressLine1": "251 Crandon Boulevard",
        "Town": "Key Biscayne",
        "StateOrProvince": "FL",
        "Postcode": "33149",
        "CountryID": 2,
        "Latitude": 25.697788,
        "Longitude": -80.157979,
        "ContactTelephone1": "888-998-2546",
        "AccessComments": "MON: 24 hours | TUE: 24 hours | WED: 24 hours | THU: 24 hours | FRI: 24 hours | SAT: 24 hours | SUN: 24 hours",
        "RelatedURL": "http://www.blinkcharging.com/",
        "DistanceUnit": 0
    },
    "Connections": [
        {
            "ID": 193200,
            "ConnectionTypeID": 1,
            "LevelID": 2,
            "Amps": 16,
            "Voltage": 230,
            "PowerKW": 3.7,
            "CurrentTypeID": 10,
            "Quantity": 1
        }
    ],
    "StatusTypeID": 50,
    "DateLastStatusUpdate": "2020-06-26T02:52:00Z",
    "DataQualityLevel": 3,
    "DateCreated": "2019-12-24T09:08:00Z",
    "SubmissionStatusTypeID": 100
}