{
    "UserComments": [
        {
            "ID": 17505,
            "ChargePointID": 54204,
            "CommentTypeID": 10,
            "UserName": "dodavies",
            "Comment": "£5.90 for 15.4 kWh",
            "Rating": 3,
            "DateCreated": "2017-07-23T16:17:32.487Z",
            "User": {
                "ID": 1195,
                "Username": "dodavies"
            },
            "CheckinStatusTypeID": 10
        },
        {
            "ID": 16000,
            "ChargePointID": 54204,
            "CommentTypeID": 10,
            "UserName": "Wray Lane Rapid",
            "Comment": "All connectors working02/03/17",
            "DateCreated": "2017-03-04T22:59:13.977Z",
            "User": {
                "ID": 9513,
                "Username": "Wray Lane Rapid"
            },
            "CheckinStatusTypeID": 10
        },
        {
            "ID": 11660,
            "ChargePointID": 54204,
            "CommentTypeID": 10,
            "UserName": "Wray Lane Rapid",
            "Comment": "Working 17.00 18/6/16",
            "DateCreated": "2016-06-18T18:26:05.697Z",
            "User": {
                "ID": 9513,
                "Username": "Wray Lane Rapid"
            },
            "CheckinStatusTypeID": 10
        }
    ],
    "MediaItems": [
        {
            "ID": 3253,
            "ChargePointID": 54204,
            "ItemURL": "https://s3-ap-southeast-2.amazonaws.com/openchargemap/images/GB/OCM54204/OCM-54204.orig.2015092419195962.jpeg",
            "ItemThumbnailURL": "https://s3-ap-southeast-2.amazonaws.com/openchargemap/images/GB/OCM54204/OCM-54204.thmb.2015092419195962.jpeg",
            "Comment": "",
            "IsEnabled": true,
            "IsVideo": false,
            "IsFeaturedItem": false,
            "IsExternalResource": false,
            "User": {
                "ID": 1195,
                "Username": "dodavies"
            },
            "DateCreated": "2015-09-24T19:20:00Z"
        }
    ],
    "IsRecentlyVerified": false,
    "ID": 54204,
    "UUID": "5090D852-E582-4B82-B9E5-A8FA363F0AF8",
    "DataProviderID": 1,
    "OperatorID": 3341,
    "OperatorsReference": "70629",
    "UsageTypeID": 4,
    "UsageCost": "£2.00 + £0.20/kWh",
    "AddressInfo": {
        "ID": 54550,
        "Title": "Wray Lane Car Park",
        "AddressLine1": "Wray Lane",
        "AddressLine2": "Reigate Hill",
        "Town": "Reigate",
        "StateOrProvince": "Surrey",
        "Postcode": "RH2 0HX",
        "CountryID": 1,
        "Latitude": 51.2561004296823,
        "Longitude": -0.192067623138428,
        "AccessComments": "Charger is located near Café / Kiosk. No eligibility restrictions. Parking in charging bay limited to 1 hour. Café open 08:00-17:00",
        "DistanceUnit": 0
    },
    "Connections": [
        {
            "ID": 68184,
            "ConnectionTypeID": 2,
            "Reference": "SEC50104",
            "StatusTypeID": 50,
            "LevelID": 3,
            "Amps": 125,
            "Voltage": 400,
            "PowerKW": 50,
            "CurrentTypeID": 30,
            "Quantity": 1
        },
        {
            "ID": 68185,
            "ConnectionTypeID": 1036,
            "Reference": "SEC50104",
            "StatusTypeID": 50,
            "LevelID": 3,
            "Amps": 63,
            "Voltage": 400,
            "PowerKW": 43,
            "CurrentTypeID": 20,
            "Quantity": 1
        },
        {
            "ID": 68186,
            "ConnectionTypeID": 33,
            "Reference": "SEC50104",
            "StatusTypeID": 50,
            "LevelID": 3,
            "Amps": 125,
            "Voltage": 400,
            "PowerKW": 50,
            "CurrentTypeID": 30,
            "Quantity": 1
        }
    ],
    "NumberOfPoints": 1,
    "GeneralComments": "ABB triple-headed rapid charger.",
    "StatusTypeID": 50,
    "DateLastStatusUpdate": "2021-07-24T09:16:00Z",
    "DataQualityLevel": 1,
    "DateCreated": "2015-09-24T19:15:00Z",
    "SubmissionStatusTypeID": 200
}