{
    "IsRecentlyVerified": false,
    "ID": 137541,
    "UUID": "6E41B783-8C90-49E2-AFC9-782CABCA09D7",
    "DataProviderID": 2,
    "DataProvidersReference": "147431",
    "OperatorID": 5,
    "UsageTypeID": 1,
    "AddressInfo": {
        "ID": 137887,
        "Title": "FOUNDRY",
        "AddressLine1": "310 Comal St",
        "Town": "Austin",
        "StateOrProvince": "TX",
        "Postcode": "78702",
        "CountryID": 2,
        "Latitude": 30.261208,
        "Longitude": -97.727993,
        "ContactTelephone1": "888-758-4389",
        "AccessComments": "24 hours daily",
        "RelatedURL": "http://www.chargepoint.com/",
        "DistanceUnit": 0
    },
    "Connections": [
        {
            "ID": 192471,
            "ConnectionTypeID": 1,
            "LevelID": 2,
            "Amps": 16,
            "Voltage": 230,
            "PowerKW": 3,
            "CurrentTypeID": 10,
            "Quantity": 8
        }
    ],
    "StatusTypeID": 50,
    "DateLastStatusUpdate": "2019-12-24T09:05:00Z",
    "DataQualityLevel": 3,
    "DateCreated": "2019-12-24T09:05:00Z",
    "SubmissionStatusTypeID": 100
}