{
    "IsRecentlyVerified": false,
    "ID": 186200,
    "UUID": "37688D9D-34D5-4447-AF4E-A018BC521A85",
    "DataProviderID": 29,
    "DataProvidersReference": "19093",
    "AddressInfo": {
        "ID": 186559,
        "Title": "Kölner Landstraße 212",
        "AddressLine1": "Kölner Landstraße 212",
        "Town": "Düren",
        "Postcode": "52351",
        "CountryID": 87,
        "Latitude": 50.809375,
        "Longitude": 6.506461,
        "DistanceUnit": 0
    },
    "Connections": [
        {
            "ID": 298231,
            "ConnectionTypeID": 25,
            "StatusTypeID": 50,
            "LevelID": 2,
            "PowerKW": 22,
            "CurrentTypeID": 20
        }
    ],
    "StatusTypeID": 50,
    "DateLastStatusUpdate": "2021-07-12T02:45:00Z",
    "MetadataValues": [
        {
            "ID": 18441,
            "MetadataFieldID": 4,
            "ItemValue": "Data from the German chargepoint registry provided by Bundesnetzagentur.de under the CC-BY 4.0 license"
        }
    ],
    "DataQualityLevel": 3,
    "DateCreated": "2021-07-12T02:45:00Z",
    "SubmissionStatusTypeID": 100
}