{
    "IsRecentlyVerified": false,
    "ID": 33923,
    "UUID": "C953D80A-32BE-4905-AC24-7CD1F7FBE0F4",
    "DataProviderID": 26,
    "DataProvidersReference": "47401",
    "OperatorID": 178,
    "OperatorsReference": "EVnetNL AL559",
    "UsageCost": "0.00 jaarabonnement",
    "AddressInfo": {
        "ID": 34269,
        "Title": "Marijkestraat 3",
        "AddressLine1": "Marijkestraat 3",
        "Town": "Binnenmaas",
        "Postcode": "3274 AJ",
        "CountryID": 159,
        "Latitude": 51.828498,
        "Longitude": 4.477044,
        "ContactTelephone1": "0800-3522365",
        "RelatedURL": "http://www.evnet.nl",
        "DistanceUnit": 0
    },
    "Connections": [
        {
            "ID": 37434,
            "ConnectionTypeID": 25,
            "LevelID": 2,
            "PowerKW": 11,
            "CurrentTypeID": 10
        }
    ],
    "NumberOfPoints": 2,
    "StatusTypeID": 50,
    "DateLastStatusUpdate": "2016-06-04T02:41:00Z",
    "DataQualityLevel": 3,
    "DateCreated": "2015-01-09T06:04:00Z",
    "SubmissionStatusTypeID": 100
}