{
    "IsRecentlyVerified": false,
    "ID": 181062,
    "UUID": "4F14B4CC-7F9F-4C14-8F46-5D8B94D99D5F",
    "DataProviderID": 29,
    "DataProvidersReference": "11027",
    "OperatorID": 234,
    "AddressInfo": {
        "ID": 181421,
        "Title": "Vor Luitgradhof 1",
        "AddressLine1": "Vor Luitgradhof 1",
        "Town": "Markt Einersheim",
        "Postcode": "97348",
        "CountryID": 87,
        "Latitude": 49.68747,
        "Longitude": 10.29251,
        "DistanceUnit": 0
    },
    "Connections": [
        {
            "ID": 284903,
            "ConnectionTypeID": 25,
            "StatusTypeID": 50,
            "LevelID": 2,
            "PowerKW": 22,
            "CurrentTypeID": 20
        },
        {
            "ID": 284904,
            "ConnectionTypeID": 25,
            "StatusTypeID": 50,
            "LevelID": 2,
            "PowerKW": 22,
            "CurrentTypeID": 20
        }
    ],
    "StatusTypeID": 50,
    "DateLastStatusUpdate": "2021-07-12T02:43:00Z",
    "MetadataValues": [
        {
            "ID": 13356,
            "MetadataFieldID": 4,
            "ItemValue": "Data from the German chargepoint registry provided by Bundesnetzagentur.de under the CC-BY 4.0 license"
        }
    ],
    "DataQualityLevel": 3,
    "DateCreated": "2021-07-08T10:01:00Z",
    "SubmissionStatusTypeID": 100
}