{
    "MediaItems": [
        {
            "ID": 25208,
            "ChargePointID": 96376,
            "ItemURL": "https://s3-ap-southeast-2.amazonaws.com/openchargemap/images/DE/OCM96376/OCM-96376.orig.2020102418061773.jpg",
            "ItemThumbnailURL": "https://s3-ap-southeast-2.amazonaws.com/openchargemap/images/DE/OCM96376/OCM-96376.thmb.2020102418061773.jpg",
            "Comment": "",
            "IsEnabled": true,
            "IsVideo": false,
            "IsFeaturedItem": false,
            "IsExternalResource": false,
            "User": {
                "ID": 27940,
                "Username": "5R-MFT "
            },
            "DateCreated": "2020-10-24T18:06:00Z"
        },
        {
            "ID": 25207,
            "ChargePointID": 96376,
            "ItemURL": "https://s3-ap-southeast-2.amazonaws.com/openchargemap/images/DE/OCM96376/OCM-96376.orig.2020102418022481.jpg",
            "ItemThumbnailURL": "https://s3-ap-southeast-2.amazonaws.com/openchargemap/images/DE/OCM96376/OCM-96376.thmb.2020102418022481.jpg",
            "Comment": "",
            "IsEnabled": true,
            "IsVideo": false,
            "IsFeaturedItem": false,
            "IsExternalResource": false,
            "User": {
                "ID": 27940,
                "Username": "5R-MFT "
            },
            "DateCreated": "2020-10-24T18:02:00Z"
        }
    ],
    "IsRecentlyVerified": false,
    "ID": 96376,
    "UUID": "B05B1FEE-A6AE-411F-9500-067E5CF04AB3",
    "DataProviderID": 1,
    "OperatorID": 45,
    "UsageTypeID": 5,
    "AddressInfo": {
        "ID": 96722,
        "Title": "Stuttgart Airport P14",
        "AddressLine1": "Flughafenstraße",
        "Town": "Stuttgart",
        "Postcode": "70629",
        "CountryID": 87,
        "Latitude": 48.69183582084791,
        "Longitude": 9.196527847668467,
        "AccessComments": "Laden an den Säulen auf Ebene 3 ist kostenlos, Parkgebühren werden erhoben.",
        "RelatedURL": "http://www.flughafen-stuttgart.de/",
        "DistanceUnit": 0
    },
    "Connections": [
        {
            "ID": 136557,
            "ConnectionTypeID": 25,
            "StatusTypeID": 50,
            "LevelID": 2,
            "Amps": 16,
            "Voltage": 400,
            "PowerKW": 11,
            "CurrentTypeID": 20,
            "Quantity": 20
        }
    ],
    "NumberOfPoints": 20,
    "StatusTypeID": 50,
    "DateLastStatusUpdate": "2020-10-24T18:06:00Z",
    "DataQualityLevel": 1,
    "DateCreated": "2017-12-22T12:35:00Z",
    "SubmissionStatusTypeID": 200
}