{
    "IsRecentlyVerified": true,
    "DateLastVerified": "2021-10-12T07:02:00Z",
    "ID": 189565,
    "UUID": "6459EE8D-AA1D-4B77-995A-187864FA3FAF",
    "DataProviderID": 1,
    "OperatorID": 3338,
    "UsageTypeID": 4,
    "UsageCost": "Yearly Subscription",
    "AddressInfo": {
        "ID": 189924,
        "Title": "Petronas Ulu Bernam (S)",
        "AddressLine1": "Petronas Ulu Bernam (S)",
        "Town": "Tanjung Malim",
        "StateOrProvince": "Selangor",
        "Postcode": "",
        "CountryID": 137,
        "Latitude": 3.662987132925982,
        "Longitude": 101.52059533021533,
        "ContactTelephone1": "+60 11 2337 3387",
        "AccessComments": "use chargEV RFID card to start charging session",
        "RelatedURL": "http://chargev.my",
        "DistanceUnit": 0
    },
    "Connections": [
        {
            "ID": 306638,
            "ConnectionTypeID": 25,
            "StatusTypeID": 50,
            "LevelID": 2,
            "Amps": 32,
            "Voltage": 415,
            "PowerKW": 22,
            "CurrentTypeID": 20,
            "Quantity": 2
        }
    ],
    "NumberOfPoints": 1,
    "StatusTypeID": 50,
    "DateLastStatusUpdate": "2021-10-12T08:19:00Z",
    "DataQualityLevel": 1,
    "DateCreated": "2021-10-12T07:02:00Z",
    "SubmissionStatusTypeID": 200
}