{
    "IsRecentlyVerified": false,
    "ID": 20049,
    "UUID": "1C470FFE-E663-40DE-A997-E1C803AFB0B6",
    "DataProviderID": 1,
    "OperatorID": 1,
    "UsageTypeID": 0,
    "UsageCost": "Free",
    "AddressInfo": {
        "ID": 20394,
        "Title": " Nissan - Amiens",
        "AddressLine1": "89 Avenue de la Défense Passive",
        "AddressLine2": "",
        "Town": "",
        "StateOrProvince": "Amiens",
        "Postcode": "80000 ",
        "CountryID": 80,
        "Latitude": 49.90822,
        "Longitude": 2.32328,
        "ContactTelephone1": "+33 3 22 66 49 00",
        "ContactTelephone2": "",
        "ContactEmail": "",
        "AccessComments": "Ouvert à tous",
        "RelatedURL": "",
        "DistanceUnit": 0
    },
    "Connections": [],
    "NumberOfPoints": 1,
    "GeneralComments": "",
    "StatusTypeID": 50,
    "DateLastStatusUpdate": "2013-10-25T12:27:00Z",
    "DataQualityLevel": 1,
    "DateCreated": "2013-10-25T10:28:00Z",
    "SubmissionStatusTypeID": 200
}