{
    "IsRecentlyVerified": false,
    "ID": 121307,
    "UUID": "D589AED6-755B-4DA1-89B9-74138EE7BAB1",
    "DataProviderID": 2,
    "DataProvidersReference": "117854",
    "OperatorID": 5,
    "UsageTypeID": 1,
    "AddressInfo": {
        "ID": 121653,
        "Title": "CITY OF HOLLAND",
        "AddressLine1": "150 W 8th St",
        "Town": "Holland",
        "StateOrProvince": "MI",
        "Postcode": "49423",
        "CountryID": 2,
        "Latitude": 42.7896628,
        "Longitude": -86.1134277,
        "ContactTelephone1": "888-758-4389",
        "AccessComments": "24 hours daily",
        "RelatedURL": "http://www.chargepoint.com/",
        "DistanceUnit": 0
    },
    "Connections": [
        {
            "ID": 170749,
            "ConnectionTypeID": 1,
            "LevelID": 2,
            "Amps": 16,
            "Voltage": 230,
            "PowerKW": 3.7,
            "CurrentTypeID": 10,
            "Quantity": 2
        }
    ],
    "DateLastStatusUpdate": "2020-06-26T03:06:00Z",
    "DataQualityLevel": 3,
    "DateCreated": "2019-04-01T05:00:00Z",
    "SubmissionStatusTypeID": 100
}