{
    "IsRecentlyVerified": false,
    "ID": 95630,
    "UUID": "0D7B595D-83DF-4A55-8B62-30629F90EB7E",
    "DataProviderID": 1,
    "OperatorID": 125,
    "UsageTypeID": 4,
    "AddressInfo": {
        "ID": 95976,
        "Title": "Autohaus Spreckelsen",
        "AddressLine1": "Ernst-Bode-Straße 4",
        "Town": "Bremervörde",
        "StateOrProvince": "Landkreis Rotenburg",
        "Postcode": "27432",
        "CountryID": 87,
        "Latitude": 53.48590660659773,
        "Longitude": 9.142159153442444,
        "AccessComments": "24/7 nutzbar ",
        "DistanceUnit": 0
    },
    "Connections": [
        {
            "ID": 135464,
            "ConnectionTypeID": 25,
            "StatusTypeID": 50,
            "LevelID": 2,
            "Amps": 32,
            "Voltage": 400,
            "PowerKW": 22,
            "CurrentTypeID": 20,
            "Quantity": 2
        }
    ],
    "NumberOfPoints": 2,
    "StatusTypeID": 50,
    "DateLastStatusUpdate": "2017-11-16T09:22:00Z",
    "DataQualityLevel": 1,
    "DateCreated": "2017-11-16T09:22:00Z",
    "SubmissionStatusTypeID": 200
}