{
    "IsRecentlyVerified": false,
    "ID": 83460,
    "UUID": "2E62EDD2-4499-49E2-A13C-FAC96FAD156E",
    "DataProviderID": 1,
    "OperatorID": 156,
    "UsageTypeID": 4,
    "AddressInfo": {
        "ID": 83806,
        "Title": "Steigerwaldklinik",
        "AddressLine1": "Am Eichelberg 1",
        "Town": "Burgebrach",
        "StateOrProvince": "Burgebrach (VGem)",
        "Postcode": "96138",
        "CountryID": 87,
        "Latitude": 49.81897000000001,
        "Longitude": 10.73118999999997,
        "AccessComments": "Der Weg zur Ladestation ist mit grünen Pfeilen markiert. Laden ist 24/7 möglich und kostenlos.",
        "DistanceUnit": 0
    },
    "Connections": [
        {
            "ID": 118268,
            "ConnectionTypeID": 25,
            "StatusTypeID": 50,
            "LevelID": 2,
            "Amps": 32,
            "Voltage": 400,
            "PowerKW": 22,
            "CurrentTypeID": 20,
            "Quantity": 2
        }
    ],
    "NumberOfPoints": 2,
    "StatusTypeID": 50,
    "DateLastStatusUpdate": "2017-02-07T08:41:00Z",
    "DataQualityLevel": 1,
    "DateCreated": "2017-02-07T08:41:00Z",
    "SubmissionStatusTypeID": 200
}