{
    "IsRecentlyVerified": false,
    "ID": 129172,
    "UUID": "2A295D21-D3B6-4535-A6A6-E42BE2F9B45B",
    "DataProviderID": 1,
    "OperatorID": 23,
    "OperatorsReference": "51104",
    "UsageTypeID": 4,
    "AddressInfo": {
        "ID": 129518,
        "Title": "Moulin Saint Julien",
        "AddressLine1": "1303 Rue de la Reine Blanche",
        "Town": "Olivet",
        "Postcode": "45160",
        "CountryID": 80,
        "Latitude": 47.870794,
        "Longitude": 1.882575,
        "ContactTelephone1": "+33 6 18 09 35 70",
        "DistanceUnit": 0
    },
    "Connections": [
        {
            "ID": 180820,
            "ConnectionTypeID": 30,
            "StatusTypeID": 50,
            "LevelID": 2,
            "PowerKW": 22,
            "CurrentTypeID": 20,
            "Quantity": 1
        }
    ],
    "NumberOfPoints": 1,
    "GeneralComments": "1 Tesla Connector, up to 22kW.Available for customers. Please call ahead.",
    "StatusTypeID": 50,
    "DateLastStatusUpdate": "2019-07-15T16:11:00Z",
    "DataQualityLevel": 1,
    "DateCreated": "2019-07-15T16:11:00Z",
    "SubmissionStatusTypeID": 200
}