{
    "IsRecentlyVerified": false,
    "ID": 176919,
    "UUID": "7A37EE98-8877-4E01-B38B-62D71C35F1F8",
    "DataProviderID": 29,
    "DataProvidersReference": "2577",
    "AddressInfo": {
        "ID": 177278,
        "Title": "Gewerbestraße 1",
        "AddressLine1": "Gewerbestraße 1",
        "Town": "Jengen",
        "Postcode": "86860",
        "CountryID": 87,
        "Latitude": 48.003405,
        "Longitude": 10.721622,
        "DistanceUnit": 0
    },
    "Connections": [
        {
            "ID": 275445,
            "ConnectionTypeID": 33,
            "StatusTypeID": 50,
            "LevelID": 3,
            "PowerKW": 50,
            "CurrentTypeID": 30
        },
        {
            "ID": 275446,
            "ConnectionTypeID": 25,
            "StatusTypeID": 50,
            "LevelID": 2,
            "PowerKW": 22,
            "CurrentTypeID": 20
        }
    ],
    "StatusTypeID": 0,
    "DateLastStatusUpdate": "2021-07-09T03:11:00Z",
    "MetadataValues": [
        {
            "ID": 9214,
            "MetadataFieldID": 4,
            "ItemValue": "Data from the German chargepoint registry provided by Bundesnetzagentur.de under the CC-BY 4.0 license"
        }
    ],
    "DataQualityLevel": 3,
    "DateCreated": "2021-07-08T09:48:00Z",
    "SubmissionStatusTypeID": 100
}