{
    "IsRecentlyVerified": false,
    "ID": 17657,
    "UUID": "083A410F-A57B-42DC-9B64-939ADD4A6793",
    "DataProviderID": 22,
    "DataProvidersReference": "F38575EE8AF23BA6D923C0D98EE767FC",
    "AddressInfo": {
        "ID": 18002,
        "Title": "道の駅川場田園プラザ",
        "AddressLine1": "群馬県利根郡川場村萩室385",
        "CountryID": 114,
        "Latitude": 36.6879271,
        "Longitude": 139.105938,
        "ContactTelephone1": "0278-52-3412",
        "DistanceUnit": 0
    },
    "Connections": [
        {
            "ID": 17898,
            "ConnectionTypeID": 2,
            "LevelID": 2,
            "Amps": 100,
            "Voltage": 480,
            "PowerKW": 48,
            "Quantity": 1
        }
    ],
    "DateLastStatusUpdate": "2013-06-29T09:01:00Z",
    "DataQualityLevel": 2,
    "DateCreated": "2013-06-29T09:01:00Z",
    "SubmissionStatusTypeID": 200
}