{
    "IsRecentlyVerified": false,
    "ID": 144059,
    "UUID": "4DF6E7D9-250C-45E0-BC28-32489107A76E",
    "DataProviderID": 2,
    "DataProvidersReference": "86864",
    "UsageTypeID": 1,
    "AddressInfo": {
        "ID": 144411,
        "Title": "Elk River Utilities",
        "AddressLine1": "617 Main St NW",
        "Town": "Elk River",
        "StateOrProvince": "MN",
        "Postcode": "55330",
        "CountryID": 2,
        "Latitude": 45.303389,
        "Longitude": -93.568336,
        "ContactTelephone1": "888-758-4389",
        "AccessComments": "24 hours daily",
        "RelatedURL": "",
        "DistanceUnit": 0
    },
    "Connections": [
        {
            "ID": 200524,
            "ConnectionTypeID": 1,
            "LevelID": 2,
            "Amps": 16,
            "Voltage": 230,
            "PowerKW": 3.7,
            "CurrentTypeID": 10,
            "Quantity": 2
        }
    ],
    "StatusTypeID": 50,
    "DateLastStatusUpdate": "2020-06-26T03:08:00Z",
    "DataQualityLevel": 3,
    "DateCreated": "2019-12-24T09:22:00Z",
    "SubmissionStatusTypeID": 100
}