{
    "IsRecentlyVerified": false,
    "ID": 92347,
    "UUID": "B309B084-8322-4B06-8F2D-830CF8A7C9FC",
    "DataProviderID": 1,
    "OperatorID": 23,
    "OperatorsReference": "33324",
    "UsageTypeID": 4,
    "AddressInfo": {
        "ID": 92693,
        "Title": "Atlanta Airport Marriott Gateway",
        "AddressLine1": "2020 Convention Center Concourse",
        "Town": "Atlanta",
        "StateOrProvince": "Georgia",
        "Postcode": "30337",
        "CountryID": 2,
        "Latitude": 33.644389,
        "Longitude": -84.455351,
        "ContactTelephone1": "(404) 763-1544",
        "DistanceUnit": 0
    },
    "Connections": [
        {
            "ID": 130890,
            "ConnectionTypeID": 30,
            "StatusTypeID": 50,
            "LevelID": 2,
            "PowerKW": 8,
            "CurrentTypeID": 10,
            "Quantity": 1
        }
    ],
    "NumberOfPoints": 1,
    "GeneralComments": "1 Tesla Connector, up to 8kW.Available for customers. Self park.",
    "StatusTypeID": 50,
    "DateLastStatusUpdate": "2017-09-01T05:48:00Z",
    "DataQualityLevel": 1,
    "DateCreated": "2017-09-01T05:48:00Z",
    "SubmissionStatusTypeID": 200
}