{
    "IsRecentlyVerified": false,
    "ID": 188299,
    "UUID": "D2757D26-546F-4D06-B9F1-A3CEE2AFA3C2",
    "DataProviderID": 1,
    "OperatorID": 207,
    "UsageTypeID": 4,
    "AddressInfo": {
        "ID": 188658,
        "Title": "Parking Plaza Constitución",
        "AddressLine1": "Calle de Toledo, 17",
        "Town": "Ciudad Real",
        "StateOrProvince": "Castilla-La Mancha",
        "Postcode": "13003",
        "CountryID": 210,
        "Latitude": 38.98815136342603,
        "Longitude": -3.92836585816724,
        "ContactTelephone1": "800 760 255",
        "DistanceUnit": 0
    },
    "Connections": [
        {
            "ID": 303980,
            "ConnectionTypeID": 25,
            "StatusTypeID": 50,
            "LevelID": 2,
            "PowerKW": 11,
            "CurrentTypeID": 20,
            "Quantity": 1
        },
        {
            "ID": 303981,
            "ConnectionTypeID": 25,
            "StatusTypeID": 50,
            "LevelID": 2,
            "PowerKW": 11,
            "CurrentTypeID": 20,
            "Quantity": 1
        }
    ],
    "NumberOfPoints": 2,
    "GeneralComments": "24/7",
    "StatusTypeID": 50,
    "DateLastStatusUpdate": "2021-07-18T14:15:00Z",
    "DataQualityLevel": 1,
    "DateCreated": "2021-07-17T14:03:00Z",
    "SubmissionStatusTypeID": 200
}