{
    "MediaItems": [
        {
            "ID": 15016,
            "ChargePointID": 99546,
            "ItemURL": "https://s3-ap-southeast-2.amazonaws.com/openchargemap/images/HU/OCM99546/OCM-99546.orig.2018012912532146.jpg",
            "ItemThumbnailURL": "https://s3-ap-southeast-2.amazonaws.com/openchargemap/images/HU/OCM99546/OCM-99546.thmb.2018012912532146.jpg",
            "Comment": "",
            "IsEnabled": true,
            "IsVideo": false,
            "IsFeaturedItem": false,
            "IsExternalResource": false,
            "User": {
                "ID": 4438,
                "Username": "tibor.antaloczy"
            },
            "DateCreated": "2018-01-29T12:54:00Z"
        },
        {
            "ID": 15015,
            "ChargePointID": 99546,
            "ItemURL": "https://s3-ap-southeast-2.amazonaws.com/openchargemap/images/HU/OCM99546/OCM-99546.orig.2018012912530767.jpg",
            "ItemThumbnailURL": "https://s3-ap-southeast-2.amazonaws.com/openchargemap/images/HU/OCM99546/OCM-99546.thmb.2018012912530767.jpg",
            "Comment": "",
            "IsEnabled": true,
            "IsVideo": false,
            "IsFeaturedItem": false,
            "IsExternalResource": false,
            "User": {
                "ID": 4438,
                "Username": "tibor.antaloczy"
            },
            "DateCreated": "2018-01-29T12:53:00Z"
        }
    ],
    "IsRecentlyVerified": false,
    "ID": 99546,
    "UUID": "24455356-09E6-4C84-B6D4-638A3F4E5363",
    "DataProviderID": 1,
    "OperatorID": 45,
    "UsageTypeID": 1,
    "UsageCost": "free",
    "AddressInfo": {
        "ID": 99892,
        "Title": "Tatabánya, Vértes Center",
        "AddressLine1": "Győri út 7-9.",
        "Town": "Tatabánya",
        "StateOrProvince": "Komárom-Esztergom megye",
        "Postcode": "2800",
        "CountryID": 104,
        "Latitude": 47.5867925438632,
        "Longitude": 18.393785558197,
        "ContactEmail": "info@vertescenter.hu",
        "AccessComments": "Chargers are located in the parking lot on the top of the building.",
        "RelatedURL": "http://vertescenter.hu/rolunk/kapcsolat/",
        "DistanceUnit": 0
    },
    "Connections": [
        {
            "ID": 140671,
            "ConnectionTypeID": 25,
            "StatusTypeID": 50,
            "LevelID": 2,
            "Amps": 32,
            "Voltage": 400,
            "PowerKW": 22,
            "CurrentTypeID": 20,
            "Quantity": 2
        }
    ],
    "NumberOfPoints": 2,
    "StatusTypeID": 50,
    "DateLastStatusUpdate": "2018-02-01T20:42:00Z",
    "DataQualityLevel": 1,
    "DateCreated": "2018-01-29T12:53:00Z",
    "SubmissionStatusTypeID": 200
}