{
    "IsRecentlyVerified": false,
    "ID": 120427,
    "UUID": "698D8A1B-5091-4519-A444-9D551683528D",
    "DataProviderID": 2,
    "DataProvidersReference": "81772",
    "OperatorID": 107,
    "UsageTypeID": 1,
    "AddressInfo": {
        "ID": 120773,
        "Title": "Hillcrest Market",
        "AddressLine1": "3960 Normal St",
        "Town": "San Diego",
        "StateOrProvince": "CA",
        "Postcode": "92103",
        "CountryID": 2,
        "Latitude": 32.750461,
        "Longitude": -117.149469,
        "ContactTelephone1": "619-237-1632",
        "AccessComments": "24 hours daily",
        "RelatedURL": "http://www.opconnect.com/",
        "DistanceUnit": 0
    },
    "Connections": [
        {
            "ID": 169775,
            "ConnectionTypeID": 1,
            "LevelID": 2,
            "Amps": 16,
            "Voltage": 230,
            "PowerKW": 3.7,
            "CurrentTypeID": 10,
            "Quantity": 3
        }
    ],
    "DateLastStatusUpdate": "2020-06-26T02:55:00Z",
    "DataQualityLevel": 3,
    "DateCreated": "2019-04-01T04:59:00Z",
    "SubmissionStatusTypeID": 100
}