{
    "IsRecentlyVerified": false,
    "ID": 141167,
    "UUID": "F872DA46-46CF-4826-9E44-77C8ED698E85",
    "DataProviderID": 2,
    "DataProvidersReference": "147450",
    "UsageTypeID": 1,
    "AddressInfo": {
        "ID": 141519,
        "Title": "University of California - Davis Medical Center Education Building",
        "AddressLine1": "4610 X St",
        "Town": "Sacramento",
        "StateOrProvince": "CA",
        "Postcode": "95817",
        "CountryID": 2,
        "Latitude": 38.553216,
        "Longitude": -121.451263,
        "ContactTelephone1": "916-734-7055",
        "AccessComments": "24 hours daily",
        "RelatedURL": "",
        "DistanceUnit": 0
    },
    "Connections": [
        {
            "ID": 197019,
            "ConnectionTypeID": 1,
            "LevelID": 2,
            "Amps": 16,
            "Voltage": 230,
            "PowerKW": 3.7,
            "CurrentTypeID": 10,
            "Quantity": 3
        }
    ],
    "StatusTypeID": 50,
    "DateLastStatusUpdate": "2020-06-26T03:00:00Z",
    "DataQualityLevel": 3,
    "DateCreated": "2019-12-24T09:14:00Z",
    "SubmissionStatusTypeID": 100
}