{
    "IsRecentlyVerified": false,
    "ID": 95221,
    "UUID": "4CD63493-5C43-4479-B139-35D59A92AB04",
    "DataProviderID": 1,
    "OperatorID": 23,
    "OperatorsReference": "37226",
    "UsageTypeID": 4,
    "AddressInfo": {
        "ID": 95567,
        "Title": "Hof Van Reyen Zaal Orangerie",
        "AddressLine1": "Oudebaan 37",
        "Town": "Boechout",
        "Postcode": "2530",
        "CountryID": 26,
        "Latitude": 51.170277,
        "Longitude": 4.484434,
        "ContactTelephone1": "+32 34550894",
        "DistanceUnit": 0
    },
    "Connections": [
        {
            "ID": 134889,
            "ConnectionTypeID": 30,
            "StatusTypeID": 50,
            "LevelID": 2,
            "Amps": 32,
            "Voltage": 400,
            "PowerKW": 22,
            "CurrentTypeID": 20,
            "Quantity": 1
        }
    ],
    "NumberOfPoints": 1,
    "GeneralComments": "1 Tesla Connector, up to 22kW.Available for customers. Please call ahead.",
    "StatusTypeID": 50,
    "DateLastStatusUpdate": "2018-10-03T19:15:00Z",
    "DataQualityLevel": 1,
    "DateCreated": "2017-11-05T06:58:00Z",
    "SubmissionStatusTypeID": 200
}