{
    "IsRecentlyVerified": false,
    "ID": 142616,
    "UUID": "4232AE02-9405-4E1D-96B1-DBE100C1E723",
    "DataProviderID": 2,
    "DataProvidersReference": "149877",
    "OperatorID": 5,
    "UsageTypeID": 1,
    "AddressInfo": {
        "ID": 142968,
        "Title": "NYALA GAR 3",
        "AddressLine1": "400 Nyala Farms Rd",
        "Town": "Westport",
        "StateOrProvince": "CT",
        "Postcode": "06880",
        "CountryID": 2,
        "Latitude": 41.1223426,
        "Longitude": -73.3269248,
        "ContactTelephone1": "888-758-4389",
        "AccessComments": "24 hours daily",
        "RelatedURL": "http://www.chargepoint.com/",
        "DistanceUnit": 0
    },
    "Connections": [
        {
            "ID": 198788,
            "ConnectionTypeID": 1,
            "LevelID": 2,
            "Amps": 16,
            "Voltage": 230,
            "PowerKW": 3.7,
            "CurrentTypeID": 10,
            "Quantity": 2
        }
    ],
    "StatusTypeID": 50,
    "DateLastStatusUpdate": "2020-06-26T03:04:00Z",
    "DataQualityLevel": 3,
    "DateCreated": "2019-12-24T09:18:00Z",
    "SubmissionStatusTypeID": 100
}