{
    "IsRecentlyVerified": false,
    "ID": 28700,
    "UUID": "25F407AC-18CC-493C-B4B4-40AF1CC73BA9",
    "DataProviderID": 2,
    "DataProvidersReference": "64293",
    "OperatorID": 5,
    "UsageTypeID": 1,
    "AddressInfo": {
        "ID": 29046,
        "Title": "JNS",
        "AddressLine1": "939 W North Ave",
        "Town": "Chicago",
        "StateOrProvince": "IL",
        "Postcode": "60642",
        "CountryID": 2,
        "Latitude": 41.9105079,
        "Longitude": -87.651876,
        "ContactTelephone1": "888-758-4389",
        "AccessComments": "24 hours daily",
        "RelatedURL": "http://www.chargepoint.com/",
        "DistanceUnit": 0
    },
    "Connections": [
        {
            "ID": 31526,
            "ConnectionTypeID": 1,
            "LevelID": 2,
            "Amps": 16,
            "Voltage": 230,
            "PowerKW": 3.7,
            "CurrentTypeID": 10,
            "Quantity": 1
        }
    ],
    "DateLastStatusUpdate": "2020-06-26T03:05:00Z",
    "DataQualityLevel": 3,
    "DateCreated": "2014-11-28T03:38:00Z",
    "SubmissionStatusTypeID": 100
}