{
    "IsRecentlyVerified": false,
    "ID": 19958,
    "UUID": "C6D0A897-40A2-47B9-9A61-08665344F9D4",
    "DataProviderID": 1,
    "OperatorID": 1,
    "UsageTypeID": 0,
    "UsageCost": "",
    "AddressInfo": {
        "ID": 20303,
        "Title": "Barenton SA",
        "AddressLine1": "Le Fougeray",
        "AddressLine2": "",
        "Town": "",
        "StateOrProvince": "Bacilly",
        "Postcode": "50530 ",
        "CountryID": 80,
        "Latitude": 48.68717,
        "Longitude": -1.43936,
        "ContactTelephone1": "+33 2 33 79 06 79",
        "ContactTelephone2": "",
        "ContactEmail": "",
        "AccessComments": "Ouvert à tous",
        "RelatedURL": "",
        "DistanceUnit": 0
    },
    "Connections": [],
    "GeneralComments": "",
    "StatusTypeID": 50,
    "DateLastStatusUpdate": "2013-10-23T11:05:00Z",
    "DataQualityLevel": 1,
    "DateCreated": "2013-10-23T07:43:00Z",
    "SubmissionStatusTypeID": 200
}