{
    "IsRecentlyVerified": false,
    "ID": 75440,
    "UUID": "813FDC5F-096A-4BFE-A90A-91690EA7DD90",
    "DataProviderID": 1,
    "OperatorID": 23,
    "OperatorsReference": "21432",
    "UsageTypeID": 6,
    "UsageCost": "Free",
    "AddressInfo": {
        "ID": 75786,
        "Title": "Hotel Adler Thermae Spa & Relax Resort",
        "AddressLine1": "Hotel Adler Thermae Spa & Relax Resort",
        "Postcode": "53027",
        "CountryID": 112,
        "Latitude": 43.02844,
        "Longitude": 11.620396,
        "ContactTelephone1": "+39 0577 889 000",
        "DistanceUnit": 0
    },
    "Connections": [
        {
            "ID": 108745,
            "ConnectionTypeID": 30,
            "StatusTypeID": 50,
            "LevelID": 2,
            "Amps": 32,
            "Voltage": 400,
            "PowerKW": 22,
            "CurrentTypeID": 20,
            "Quantity": 1
        }
    ],
    "NumberOfPoints": 1,
    "GeneralComments": "1 Tesla Connector, up to 22kW.Available for patrons only. Please call ahead.",
    "StatusTypeID": 50,
    "DateLastStatusUpdate": "2018-10-04T06:14:00Z",
    "DataQualityLevel": 1,
    "DateCreated": "2016-12-14T20:25:00Z",
    "SubmissionStatusTypeID": 200
}