{
    "IsRecentlyVerified": false,
    "ID": 42768,
    "UUID": "193CFF33-7248-43EF-9F70-23F8D2AE22A8",
    "DataProviderID": 1,
    "OperatorID": 45,
    "UsageTypeID": 5,
    "UsageCost": "",
    "AddressInfo": {
        "ID": 43114,
        "Title": "Freibad Gronau",
        "AddressLine1": "Kuhmasch 2",
        "AddressLine2": "",
        "Town": "Gronau",
        "StateOrProvince": "Samtgemeinde Gronau (Leine)",
        "Postcode": "31028",
        "CountryID": 87,
        "Latitude": 52.0825739775719,
        "Longitude": 9.77031648558092,
        "ContactTelephone1": "05182 24 80",
        "ContactTelephone2": "",
        "ContactEmail": "",
        "AccessComments": "Während der Freibadesaison (15.5.-15.9) nutzbarer Stromanschluss auf dem Parkplatz. Strom 5€ pauschal, 10€ Kaution für Schlüssel, zahlbar im Schwimmbad oder der Minigolfanlage. ",
        "RelatedURL": "http://www.gronau-leine.de/tourismus/wohnmobilstellplatz-in-gronau-leine-/",
        "DistanceUnit": 0
    },
    "Connections": [
        {
            "ID": 51616,
            "ConnectionTypeID": 16,
            "StatusTypeID": 50,
            "LevelID": 2,
            "Amps": 16,
            "Voltage": 230,
            "PowerKW": 3.7,
            "CurrentTypeID": 10,
            "Quantity": 4
        }
    ],
    "NumberOfPoints": 4,
    "GeneralComments": "",
    "StatusTypeID": 50,
    "DateLastStatusUpdate": "2015-03-29T14:34:00Z",
    "DataQualityLevel": 1,
    "DateCreated": "2015-03-23T17:29:00Z",
    "SubmissionStatusTypeID": 200
}