{
    "IsRecentlyVerified": false,
    "ID": 160835,
    "UUID": "9F829447-71E9-4F1C-B743-1103D226ED93",
    "DataProviderID": 1,
    "OperatorID": 1,
    "UsageTypeID": 4,
    "UsageCost": "50 kW = 8 UAH / kW, 22 kW = 5 UAH / kW",
    "AddressInfo": {
        "ID": 161192,
        "Title": "Roshen",
        "AddressLine1": "Arcadia Mall",
        "Town": "Kyiv",
        "StateOrProvince": "",
        "Postcode": "02095",
        "CountryID": 234,
        "Latitude": 50.398037116546874,
        "Longitude": 30.61767655211065,
        "ContactTelephone1": "+380669252283",
        "RelatedURL": "https://quickpower.net/",
        "DistanceUnit": 0
    },
    "Connections": [
        {
            "ID": 231501,
            "ConnectionTypeID": 2,
            "StatusTypeID": 50,
            "LevelID": 3,
            "PowerKW": 50,
            "CurrentTypeID": 30,
            "Quantity": 1
        },
        {
            "ID": 231502,
            "ConnectionTypeID": 25,
            "StatusTypeID": 50,
            "LevelID": 2,
            "PowerKW": 22,
            "CurrentTypeID": 20,
            "Quantity": 1
        },
        {
            "ID": 231503,
            "ConnectionTypeID": 33,
            "StatusTypeID": 50,
            "LevelID": 3,
            "PowerKW": 50,
            "CurrentTypeID": 30,
            "Quantity": 1
        }
    ],
    "NumberOfPoints": 3,
    "StatusTypeID": 50,
    "DateLastStatusUpdate": "2020-06-29T17:54:00Z",
    "DataQualityLevel": 1,
    "DateCreated": "2020-06-29T07:53:00Z",
    "SubmissionStatusTypeID": 200
}