{
    "IsRecentlyVerified": false,
    "ID": 28126,
    "UUID": "35B3B613-CAE1-467C-B728-572ED3F450CE",
    "DataProviderID": 2,
    "DataProvidersReference": "62586",
    "UsageTypeID": 1,
    "AddressInfo": {
        "ID": 28472,
        "Title": "City of Morgantown - Farmers Market",
        "AddressLine1": "415 Spruce St",
        "Town": "Morgantown",
        "StateOrProvince": "WV",
        "Postcode": "26501",
        "CountryID": 2,
        "Latitude": 39.630685,
        "Longitude": -79.954116,
        "ContactTelephone1": "304-291-7201",
        "AccessComments": "24 hours daily",
        "RelatedURL": "",
        "DistanceUnit": 0
    },
    "Connections": [
        {
            "ID": 30909,
            "ConnectionTypeID": 1,
            "LevelID": 2,
            "Amps": 16,
            "Voltage": 230,
            "PowerKW": 3,
            "CurrentTypeID": 10,
            "Quantity": 1
        }
    ],
    "DateLastStatusUpdate": "2019-04-06T04:03:00Z",
    "DataQualityLevel": 3,
    "DateCreated": "2014-11-28T03:38:00Z",
    "SubmissionStatusTypeID": 100
}