{
    "IsRecentlyVerified": false,
    "ID": 143666,
    "UUID": "B9274078-258B-4984-9443-8F954FDD55C9",
    "DataProviderID": 2,
    "DataProvidersReference": "129547",
    "OperatorID": 89,
    "UsageTypeID": 1,
    "AddressInfo": {
        "ID": 144018,
        "Title": "FLO - Cadillac Fairview -  Shops at Don Mills",
        "AddressLine1": "1090 Don Mills Rd",
        "Town": "Toronto",
        "StateOrProvince": "ON",
        "Postcode": "M3C 3R6",
        "CountryID": 44,
        "Latitude": 43.736447,
        "Longitude": -79.34423,
        "ContactTelephone1": "888-356-8911",
        "AccessComments": "24 hours daily",
        "RelatedURL": "https://flo.ca/",
        "DistanceUnit": 0
    },
    "Connections": [
        {
            "ID": 200040,
            "ConnectionTypeID": 1,
            "LevelID": 2,
            "Amps": 16,
            "Voltage": 230,
            "PowerKW": 3.7,
            "CurrentTypeID": 10,
            "Quantity": 2
        },
        {
            "ID": 200041,
            "ConnectionTypeID": 2,
            "LevelID": 3,
            "Amps": 100,
            "Voltage": 400,
            "PowerKW": 40,
            "CurrentTypeID": 30,
            "Quantity": 1
        },
        {
            "ID": 200042,
            "ConnectionTypeID": 32,
            "LevelID": 3,
            "Amps": 100,
            "Voltage": 400,
            "PowerKW": 40,
            "CurrentTypeID": 30,
            "Quantity": 1
        }
    ],
    "StatusTypeID": 50,
    "DateLastStatusUpdate": "2020-06-26T03:07:00Z",
    "DataQualityLevel": 3,
    "DateCreated": "2019-12-24T09:21:00Z",
    "SubmissionStatusTypeID": 100
}