{
    "IsRecentlyVerified": false,
    "ID": 85798,
    "UUID": "80A748CB-7147-4DEC-8F4D-9AA26B12B10A",
    "DataProviderID": 1,
    "OperatorID": 3,
    "OperatorsReference": "PG-81034",
    "UsageTypeID": 6,
    "UsageCost": "1",
    "AddressInfo": {
        "ID": 86144,
        "Title": "Brooklyn-Hyundai",
        "AddressLine1": "Claremont Road",
        "Town": "East Sussex",
        "Postcode": "BN25 2BA",
        "CountryID": 1,
        "Latitude": 50.774325,
        "Longitude": 0.098105,
        "DistanceUnit": 0
    },
    "Connections": [
        {
            "ID": 121951,
            "ConnectionTypeID": 25,
            "StatusTypeID": 50,
            "LevelID": 2,
            "Amps": 32,
            "Voltage": 230,
            "PowerKW": 7,
            "CurrentTypeID": 10,
            "Quantity": 2
        }
    ],
    "NumberOfPoints": 3,
    "GeneralComments": "This is an open charge unit installed at the Brooklyn - Hyundai site in Claremont Road, Seaford, East Sussex",
    "StatusTypeID": 0,
    "DateLastStatusUpdate": "2020-02-06T06:26:00Z",
    "DataQualityLevel": 1,
    "DateCreated": "2017-04-15T10:20:00Z",
    "SubmissionStatusTypeID": 200
}