{
    "IsRecentlyVerified": false,
    "ID": 57464,
    "UUID": "04311B43-DDAC-44FF-9CE2-58D6285FB647",
    "DataProviderID": 26,
    "DataProvidersReference": "67862",
    "OperatorID": 73,
    "OperatorsReference": "EV-Box EVB-P1437001",
    "UsageCost": "0.00 jaarabonnement",
    "AddressInfo": {
        "ID": 57810,
        "Title": "Seidengasse 15",
        "AddressLine1": "Seidengasse 15",
        "Town": "Zürich",
        "Postcode": "8001",
        "CountryID": 217,
        "Latitude": 47.37522,
        "Longitude": 8.53717,
        "RelatedURL": "http://www.ev-box.nl",
        "DistanceUnit": 0
    },
    "Connections": [
        {
            "ID": 72586,
            "ConnectionTypeID": 25,
            "LevelID": 2,
            "PowerKW": 11,
            "CurrentTypeID": 10
        }
    ],
    "NumberOfPoints": 1,
    "StatusTypeID": 50,
    "DateLastStatusUpdate": "2016-06-04T02:38:00Z",
    "DataQualityLevel": 3,
    "DateCreated": "2015-11-30T12:42:00Z",
    "SubmissionStatusTypeID": 100
}