{
    "IsRecentlyVerified": false,
    "ID": 97102,
    "UUID": "AFF3EB57-0FC4-4A67-B486-E0AF17E85B12",
    "DataProviderID": 1,
    "OperatorID": 45,
    "UsageTypeID": 6,
    "UsageCost": "Free",
    "AddressInfo": {
        "ID": 97448,
        "Title": "Hotel Skagen Strand",
        "AddressLine1": "Tranevej 108",
        "Town": "Hulsig",
        "Postcode": "9990",
        "CountryID": 65,
        "Latitude": 57.660439,
        "Longitude": 10.465391,
        "AccessComments": "Contact front desk",
        "RelatedURL": "https://www.skagenstrand.dk",
        "DistanceUnit": 0
    },
    "Connections": [
        {
            "ID": 137860,
            "ConnectionTypeID": 16,
            "StatusTypeID": 50,
            "LevelID": 2,
            "Amps": 16,
            "Voltage": 240,
            "PowerKW": 3.7,
            "CurrentTypeID": 10,
            "Quantity": 1
        }
    ],
    "NumberOfPoints": 1,
    "StatusTypeID": 50,
    "DateLastStatusUpdate": "2018-01-05T11:29:00Z",
    "DataQualityLevel": 1,
    "DateCreated": "2018-01-05T00:00:00Z",
    "SubmissionStatusTypeID": 200
}