{
    "IsRecentlyVerified": false,
    "ID": 33678,
    "UUID": "37897EF1-2349-4B1D-AA04-C8B3F255103D",
    "DataProviderID": 1,
    "OperatorID": 105,
    "OperatorsReference": "Essent EM-DE-12071244-01-00001",
    "UsageTypeID": 4,
    "AddressInfo": {
        "ID": 34024,
        "Title": "Annahofer Graben 3",
        "AddressLine1": "Annahofer Graben 3",
        "Town": "Kolkwitz",
        "Postcode": "3099",
        "CountryID": 87,
        "Latitude": 51.717707,
        "Longitude": 14.288868,
        "DistanceUnit": 0
    },
    "Connections": [
        {
            "ID": 37189,
            "ConnectionTypeID": 25,
            "LevelID": 2,
            "PowerKW": 11
        },
        {
            "ID": 46899,
            "ConnectionTypeID": 25,
            "LevelID": 2,
            "PowerKW": 11
        },
        {
            "ID": 46900,
            "ConnectionTypeID": 25,
            "LevelID": 2,
            "PowerKW": 11
        },
        {
            "ID": 46901,
            "ConnectionTypeID": 25,
            "LevelID": 2,
            "PowerKW": 11
        }
    ],
    "NumberOfPoints": 1,
    "StatusTypeID": 50,
    "DateLastStatusUpdate": "2015-04-13T05:49:00Z",
    "DataQualityLevel": 3,
    "DateCreated": "2015-01-09T06:04:00Z",
    "SubmissionStatusTypeID": 200
}