{
    "IsRecentlyVerified": false,
    "ID": 161280,
    "UUID": "23453633-DBCC-4C3B-BD90-B154492F8F7F",
    "DataProviderID": 1,
    "OperatorID": 3378,
    "UsageTypeID": 5,
    "AddressInfo": {
        "ID": 161637,
        "Title": "Székesfehérvár Seregélyesi MOL",
        "AddressLine1": "Seregélyesi út",
        "Town": "Székesfehérvár",
        "StateOrProvince": "Fejér megye",
        "Postcode": "8000",
        "CountryID": 104,
        "Latitude": 47.1898204063782,
        "Longitude": 18.44841688295071,
        "RelatedURL": "https://molplugee.hu/hu/toltoink",
        "DistanceUnit": 0
    },
    "Connections": [
        {
            "ID": 232060,
            "ConnectionTypeID": 33,
            "StatusTypeID": 50,
            "LevelID": 3,
            "PowerKW": 50,
            "CurrentTypeID": 30,
            "Quantity": 1
        },
        {
            "ID": 232061,
            "ConnectionTypeID": 2,
            "StatusTypeID": 50,
            "LevelID": 3,
            "PowerKW": 50,
            "CurrentTypeID": 30,
            "Quantity": 1
        },
        {
            "ID": 232062,
            "ConnectionTypeID": 1036,
            "StatusTypeID": 50,
            "LevelID": 3,
            "PowerKW": 43,
            "CurrentTypeID": 20,
            "Quantity": 1
        }
    ],
    "NumberOfPoints": 1,
    "GeneralComments": "EFACEC QC45",
    "StatusTypeID": 50,
    "DateLastStatusUpdate": "2020-07-16T16:28:00Z",
    "DataQualityLevel": 1,
    "DateCreated": "2020-07-08T08:14:00Z",
    "SubmissionStatusTypeID": 200
}