{
    "IsRecentlyVerified": false,
    "ID": 145855,
    "UUID": "D64ECC14-06F0-4233-A81E-5D2257476F01",
    "DataProviderID": 2,
    "DataProvidersReference": "146723",
    "UsageTypeID": 1,
    "AddressInfo": {
        "ID": 146207,
        "Title": "Art Shop Gallery",
        "AddressLine1": "202 W Pioneer Ave",
        "Town": "Homer",
        "StateOrProvince": "AK",
        "Postcode": "99603",
        "CountryID": 2,
        "Latitude": 59.644843,
        "Longitude": -151.547325,
        "ContactTelephone1": "907-235-7076",
        "AccessComments": "24 hours daily; universal adapter available",
        "RelatedURL": "",
        "DistanceUnit": 0
    },
    "Connections": [
        {
            "ID": 202632,
            "ConnectionTypeID": 30,
            "LevelID": 2,
            "Amps": 16,
            "Voltage": 230,
            "PowerKW": 3.7,
            "CurrentTypeID": 10,
            "Quantity": 1
        }
    ],
    "StatusTypeID": 50,
    "DateLastStatusUpdate": "2020-06-26T03:12:00Z",
    "DataQualityLevel": 3,
    "DateCreated": "2019-12-24T09:25:00Z",
    "SubmissionStatusTypeID": 100
}