{
    "IsRecentlyVerified": false,
    "ID": 115613,
    "UUID": "EC2CCF88-FE8B-4520-9015-E42EEB48D938",
    "DataProviderID": 2,
    "DataProvidersReference": "113345",
    "OperatorID": 23,
    "UsageTypeID": 1,
    "AddressInfo": {
        "ID": 115959,
        "Title": "Atlantic Aviation - SJC - Tesla Destination",
        "AddressLine1": "1250 Aviation Ave",
        "Town": "San Jose",
        "StateOrProvince": "CA",
        "Postcode": "95110",
        "CountryID": 2,
        "Latitude": 37.357352,
        "Longitude": -121.930116,
        "ContactTelephone1": "408-297-7552  877-798-3752",
        "AccessComments": "24 hours daily; for Tesla use only; for customer use only",
        "RelatedURL": "https://www.tesla.com/destination-charging",
        "DistanceUnit": 0
    },
    "Connections": [
        {
            "ID": 162637,
            "ConnectionTypeID": 0,
            "LevelID": 2,
            "Amps": 16,
            "Voltage": 230,
            "PowerKW": 3,
            "CurrentTypeID": 10,
            "Quantity": 10
        }
    ],
    "DateLastStatusUpdate": "2019-04-06T04:02:00Z",
    "DataQualityLevel": 3,
    "DateCreated": "2019-02-11T07:13:00Z",
    "SubmissionStatusTypeID": 100
}