{
    "IsRecentlyVerified": false,
    "ID": 177700,
    "UUID": "82568332-CE5A-4AF7-B814-4ABED74D6BB1",
    "DataProviderID": 29,
    "DataProvidersReference": "2364",
    "OperatorID": 3423,
    "AddressInfo": {
        "ID": 178059,
        "Title": "Ostkorso 2",
        "AddressLine1": "Ostkorso 2",
        "Town": "Bad Oeynhausen",
        "Postcode": "32546",
        "CountryID": 87,
        "Latitude": 52.202047,
        "Longitude": 8.798169,
        "DistanceUnit": 0
    },
    "Connections": [
        {
            "ID": 277159,
            "ConnectionTypeID": 25,
            "StatusTypeID": 50,
            "LevelID": 2,
            "PowerKW": 22,
            "CurrentTypeID": 20
        },
        {
            "ID": 277160,
            "ConnectionTypeID": 25,
            "StatusTypeID": 50,
            "LevelID": 2,
            "PowerKW": 22,
            "CurrentTypeID": 20
        }
    ],
    "StatusTypeID": 0,
    "DateLastStatusUpdate": "2021-07-12T02:49:00Z",
    "MetadataValues": [
        {
            "ID": 9994,
            "MetadataFieldID": 4,
            "ItemValue": "Data from the German chargepoint registry provided by Bundesnetzagentur.de under the CC-BY 4.0 license"
        }
    ],
    "DataQualityLevel": 3,
    "DateCreated": "2021-07-08T09:49:00Z",
    "SubmissionStatusTypeID": 100
}