{
    "IsRecentlyVerified": false,
    "ID": 187936,
    "UUID": "17A99C31-6337-4EC7-BFDE-4DA3A7C54981",
    "DataProviderID": 18,
    "DataProvidersReference": "6adedd92232c5c48f311af50c2df0361",
    "OperatorID": 3345,
    "UsageTypeID": 5,
    "AddressInfo": {
        "ID": 188295,
        "Title": "CV6 2BP",
        "AddressLine1": "",
        "Town": "Coventry",
        "Postcode": "CV6 2BP",
        "CountryID": 1,
        "Latitude": 52.430014,
        "Longitude": -1.532753,
        "AccessComments": "",
        "RelatedURL": "https://char.gy",
        "DistanceUnit": 0
    },
    "Connections": [
        {
            "ID": 303266,
            "ConnectionTypeID": 25,
            "Reference": "803",
            "StatusTypeID": 50,
            "LevelID": 2,
            "Amps": 16,
            "Voltage": 230,
            "PowerKW": 3.7,
            "CurrentTypeID": 10
        }
    ],
    "StatusTypeID": 0,
    "DateLastStatusUpdate": "2021-07-12T03:39:00Z",
    "MetadataValues": [
        {
            "ID": 20176,
            "MetadataFieldID": 4,
            "ItemValue": "Contains public sector information licensed under the Open Government Licence v2.0. http://www.nationalarchives.gov.uk/doc/open-government-licence/version/2/"
        }
    ],
    "DataQualityLevel": 3,
    "DateCreated": "2021-07-12T03:39:00Z",
    "SubmissionStatusTypeID": 100
}