{
    "IsRecentlyVerified": false,
    "ID": 82377,
    "UUID": "4595C6B7-CD71-40D5-87E6-2508F9FD378C",
    "DataProviderID": 1,
    "OperatorID": 23,
    "OperatorsReference": "23625",
    "UsageTypeID": 4,
    "AddressInfo": {
        "ID": 82723,
        "Title": "Residence Inn Portsmouth Downtown",
        "AddressLine1": "100 Deer St",
        "Town": "Portsmouth",
        "StateOrProvince": "Rhode Island",
        "Postcode": "03801",
        "CountryID": 2,
        "Latitude": 43.077805,
        "Longitude": -70.760162,
        "ContactTelephone1": "(603) 422-9200",
        "DistanceUnit": 0
    },
    "Connections": [
        {
            "ID": 117143,
            "ConnectionTypeID": 30,
            "StatusTypeID": 50,
            "LevelID": 2,
            "PowerKW": 16,
            "CurrentTypeID": 20,
            "Quantity": 2
        }
    ],
    "NumberOfPoints": 2,
    "GeneralComments": "2 Tesla Connectors, up to 16kW.Available for customers. Please call ahead.",
    "StatusTypeID": 50,
    "DateLastStatusUpdate": "2017-02-03T15:46:00Z",
    "DataQualityLevel": 1,
    "DateCreated": "2017-02-03T15:46:00Z",
    "SubmissionStatusTypeID": 200
}