{
    "IsRecentlyVerified": false,
    "ID": 28477,
    "UUID": "627A2EB6-CCDE-4D64-9E36-B9CC0DADBBE5",
    "DataProviderID": 2,
    "DataProvidersReference": "62862",
    "OperatorID": 5,
    "UsageTypeID": 1,
    "AddressInfo": {
        "ID": 28823,
        "Title": "STONY BROOK UNV",
        "AddressLine1": "Lake Dr Stony Brook University",
        "Town": "Stony Brook",
        "StateOrProvince": "NY",
        "Postcode": "11790",
        "CountryID": 2,
        "Latitude": 40.9108162,
        "Longitude": -73.1215209,
        "ContactTelephone1": "888-758-4389",
        "AccessComments": "24 hours daily",
        "RelatedURL": "http://www.chargepoint.com/",
        "DistanceUnit": 0
    },
    "Connections": [
        {
            "ID": 31296,
            "ConnectionTypeID": 1,
            "LevelID": 2,
            "Amps": 16,
            "Voltage": 230,
            "PowerKW": 3,
            "CurrentTypeID": 10,
            "Quantity": 2
        }
    ],
    "DateLastStatusUpdate": "2019-04-06T05:05:00Z",
    "DataQualityLevel": 3,
    "DateCreated": "2014-11-28T03:38:00Z",
    "SubmissionStatusTypeID": 100
}