{
    "IsRecentlyVerified": false,
    "ID": 165237,
    "UUID": "55B0B39F-2EB2-426E-975E-2743F67FB3E1",
    "DataProviderID": 1,
    "DataProvidersReference": "TR-IST-085",
    "OperatorID": 70,
    "UsageTypeID": 1,
    "AddressInfo": {
        "ID": 165596,
        "Title": "Eşarj - Kosifler Oto, Bostancı",
        "AddressLine1": "İçerenköy Mah. Askent Sok. 3B D:3-6,  Ataşehir",
        "Town": "İstanbul",
        "StateOrProvince": "İstanbul",
        "Postcode": "34752",
        "CountryID": 229,
        "Latitude": 40.961561,
        "Longitude": 29.112241,
        "ContactTelephone1": "+90 (850) 433 72 75",
        "ContactEmail": "destek@esarj.com",
        "RelatedURL": "https://esarj.com/en/map?s=TR-IST-085",
        "DistanceUnit": 0
    },
    "Connections": [
        {
            "ID": 236902,
            "ConnectionTypeID": 33,
            "LevelID": 2,
            "Amps": 60,
            "Voltage": 400,
            "PowerKW": 24,
            "Quantity": 1
        }
    ],
    "GeneralComments": "Eşarj Charging Systems",
    "StatusTypeID": 50,
    "DateLastStatusUpdate": "2020-08-26T08:19:00Z",
    "DataQualityLevel": 3,
    "DateCreated": "2020-08-26T08:19:00Z",
    "SubmissionStatusTypeID": 200
}