{
    "IsRecentlyVerified": false,
    "ID": 96559,
    "UUID": "7EA70361-3CD3-4DA8-91C1-C345CD237456",
    "DataProviderID": 2,
    "DataProvidersReference": "88393",
    "OperatorID": 5,
    "UsageTypeID": 1,
    "AddressInfo": {
        "ID": 96905,
        "Title": "KINSTON",
        "AddressLine1": "421 E Grainger Ave",
        "Town": "Kinston",
        "StateOrProvince": "NC",
        "Postcode": "28501",
        "CountryID": 2,
        "Latitude": 35.2693967,
        "Longitude": -77.5744782,
        "ContactTelephone1": "888-758-4389",
        "AccessComments": "24 hours daily",
        "RelatedURL": "http://www.chargepoint.com/",
        "DistanceUnit": 0
    },
    "Connections": [
        {
            "ID": 136824,
            "ConnectionTypeID": 1,
            "LevelID": 2,
            "Amps": 16,
            "Voltage": 230,
            "PowerKW": 3.7,
            "CurrentTypeID": 10,
            "Quantity": 1
        }
    ],
    "DateLastStatusUpdate": "2020-06-26T02:58:00Z",
    "DataQualityLevel": 3,
    "DateCreated": "2017-12-29T21:01:00Z",
    "SubmissionStatusTypeID": 100
}