{
    "IsRecentlyVerified": false,
    "ID": 184655,
    "UUID": "415D3CA9-0A7C-4CE5-AFDE-D395531FFD33",
    "DataProviderID": 29,
    "DataProvidersReference": "14797",
    "OperatorID": 45,
    "AddressInfo": {
        "ID": 185014,
        "Title": "Leverkusenerstraße 10",
        "AddressLine1": "Leverkusenerstraße 10",
        "Town": "Bergisch Gladbach",
        "Postcode": "51467",
        "CountryID": 87,
        "Latitude": 51.017575,
        "Longitude": 7.079838,
        "DistanceUnit": 0
    },
    "Connections": [
        {
            "ID": 293179,
            "ConnectionTypeID": 25,
            "StatusTypeID": 50,
            "LevelID": 3,
            "PowerKW": 20,
            "CurrentTypeID": 30
        },
        {
            "ID": 293180,
            "ConnectionTypeID": 33,
            "StatusTypeID": 50,
            "LevelID": 3,
            "PowerKW": 20,
            "CurrentTypeID": 30
        },
        {
            "ID": 298595,
            "ConnectionTypeID": 2,
            "StatusTypeID": 50,
            "LevelID": 3,
            "PowerKW": 20,
            "CurrentTypeID": 30
        }
    ],
    "StatusTypeID": 50,
    "DateLastStatusUpdate": "2021-07-12T02:46:00Z",
    "MetadataValues": [
        {
            "ID": 16946,
            "MetadataFieldID": 4,
            "ItemValue": "Data from the German chargepoint registry provided by Bundesnetzagentur.de under the CC-BY 4.0 license"
        }
    ],
    "DataQualityLevel": 3,
    "DateCreated": "2021-07-08T10:05:00Z",
    "SubmissionStatusTypeID": 100
}