{
    "IsRecentlyVerified": false,
    "ID": 56323,
    "UUID": "6A5EF45D-BF81-4F16-9FB4-20071AB19DEF",
    "DataProviderID": 1,
    "OperatorID": 45,
    "UsageTypeID": 1,
    "AddressInfo": {
        "ID": 56669,
        "Title": "EVO Energie",
        "AddressLine1": "Marktplatz Osterfeld 14",
        "AddressLine2": "Osterfeld",
        "Town": "Oberhausen",
        "StateOrProvince": "Oberhausen",
        "Postcode": "46117",
        "CountryID": 87,
        "Latitude": 51.50220884750139,
        "Longitude": 6.884314282417345,
        "ContactTelephone1": "+49 800 2552 500",
        "AccessComments": "24/7 geöffnet, keine Ladekarte nötig.",
        "RelatedURL": "http://www.evo-energie.de/privatkunden",
        "DistanceUnit": 0
    },
    "Connections": [
        {
            "ID": 71040,
            "ConnectionTypeID": 25,
            "StatusTypeID": 50,
            "LevelID": 2,
            "Amps": 32,
            "Voltage": 400,
            "PowerKW": 22,
            "CurrentTypeID": 20,
            "Quantity": 1
        },
        {
            "ID": 71041,
            "ConnectionTypeID": 25,
            "StatusTypeID": 50,
            "LevelID": 2,
            "Amps": 16,
            "Voltage": 400,
            "PowerKW": 11,
            "CurrentTypeID": 10,
            "Quantity": 1
        }
    ],
    "NumberOfPoints": 2,
    "StatusTypeID": 50,
    "DateLastStatusUpdate": "2015-10-29T13:20:00Z",
    "DataQualityLevel": 1,
    "DateCreated": "2015-10-29T13:20:00Z",
    "SubmissionStatusTypeID": 200
}