{
    "IsRecentlyVerified": false,
    "ID": 124619,
    "UUID": "2C620685-78CC-4853-8F20-6617C6DFD8F2",
    "DataProviderID": 2,
    "DataProvidersReference": "93022",
    "OperatorID": 15,
    "UsageTypeID": 4,
    "AddressInfo": {
        "ID": 124965,
        "Title": "Darcars Nissan",
        "AddressLine1": "15911 Indianola Dr",
        "Town": "Derwood",
        "StateOrProvince": "MD",
        "Postcode": "20855",
        "CountryID": 2,
        "Latitude": 39.11374,
        "Longitude": -77.16079,
        "ContactTelephone1": "877-455-3833",
        "AccessComments": "24 hours daily\r\nPublic - Card key at all times",
        "RelatedURL": "https://www.evgo.com/",
        "DistanceUnit": 0
    },
    "Connections": [
        {
            "ID": 174745,
            "ConnectionTypeID": 2,
            "LevelID": 3,
            "Amps": 100,
            "Voltage": 400,
            "PowerKW": 40,
            "CurrentTypeID": 30,
            "Quantity": 1
        }
    ],
    "DateLastStatusUpdate": "2019-12-24T09:15:00Z",
    "DataQualityLevel": 3,
    "DateCreated": "2019-04-06T05:03:00Z",
    "SubmissionStatusTypeID": 100
}