{
    "IsRecentlyVerified": false,
    "ID": 33634,
    "UUID": "9003E981-1CB1-4030-8805-62224218E360",
    "DataProviderID": 26,
    "DataProvidersReference": "40681",
    "OperatorID": 157,
    "OperatorsReference": "NewMotion ICUEVE000198",
    "UsageCost": "0.00 jaarabonnement",
    "AddressInfo": {
        "ID": 33980,
        "Title": "Peter de Gorterstraat 1E",
        "AddressLine1": "Peter de Gorterstraat 1E",
        "Town": "'s-Hertogenbosch",
        "Postcode": "5248 NT",
        "CountryID": 159,
        "Latitude": 51.7011383664534,
        "Longitude": 5.36710198623041,
        "ContactTelephone1": "088 0109500",
        "RelatedURL": "http://thenewmotion.nl/",
        "DistanceUnit": 0
    },
    "Connections": [
        {
            "ID": 37145,
            "ConnectionTypeID": 25,
            "LevelID": 2,
            "PowerKW": 22,
            "CurrentTypeID": 10
        }
    ],
    "NumberOfPoints": 2,
    "StatusTypeID": 50,
    "DateLastStatusUpdate": "2016-06-04T02:40:00Z",
    "DataQualityLevel": 3,
    "DateCreated": "2015-01-09T06:04:00Z",
    "SubmissionStatusTypeID": 100
}