{
    "IsRecentlyVerified": false,
    "ID": 178401,
    "UUID": "F528FEF3-5B7F-49C4-A0F1-67BBCA38814E",
    "DataProviderID": 29,
    "DataProvidersReference": "16055",
    "AddressInfo": {
        "ID": 178760,
        "Title": "Stadthäger Straße",
        "AddressLine1": "Stadthäger Straße",
        "Town": "Eisenberg",
        "Postcode": "07607",
        "CountryID": 87,
        "Latitude": 50.97035,
        "Longitude": 11.88273,
        "DistanceUnit": 0
    },
    "Connections": [
        {
            "ID": 278759,
            "ConnectionTypeID": 1036,
            "StatusTypeID": 50,
            "LevelID": 3,
            "PowerKW": 43,
            "CurrentTypeID": 20
        },
        {
            "ID": 278760,
            "ConnectionTypeID": 33,
            "StatusTypeID": 50,
            "LevelID": 3,
            "PowerKW": 50,
            "CurrentTypeID": 30
        },
        {
            "ID": 298545,
            "ConnectionTypeID": 2,
            "StatusTypeID": 50,
            "LevelID": 3,
            "PowerKW": 50,
            "CurrentTypeID": 30
        }
    ],
    "StatusTypeID": 0,
    "DateLastStatusUpdate": "2021-07-12T02:46:00Z",
    "MetadataValues": [
        {
            "ID": 10695,
            "MetadataFieldID": 4,
            "ItemValue": "Data from the German chargepoint registry provided by Bundesnetzagentur.de under the CC-BY 4.0 license"
        }
    ],
    "DataQualityLevel": 3,
    "DateCreated": "2021-07-08T09:50:00Z",
    "SubmissionStatusTypeID": 100
}