{
    "UserComments": [
        {
            "ID": 23155,
            "ChargePointID": 148153,
            "CommentTypeID": 10,
            "UserName": "Victor Seal",
            "Comment": "Ça fonctionne très bien.",
            "DateCreated": "2020-08-28T14:11:57.993Z",
            "User": {
                "ID": 27193,
                "Username": "Victor Seal"
            },
            "CheckinStatusTypeID": 0,
            "IsActionedByEditor": false
        }
    ],
    "MediaItems": [
        {
            "ID": 24501,
            "ChargePointID": 148153,
            "ItemURL": "https://s3-ap-southeast-2.amazonaws.com/openchargemap/images/CA/OCM148153/OCM-148153.orig.2020082814131380.jpeg",
            "ItemThumbnailURL": "https://s3-ap-southeast-2.amazonaws.com/openchargemap/images/CA/OCM148153/OCM-148153.thmb.2020082814131380.jpeg",
            "Comment": "",
            "IsEnabled": true,
            "IsVideo": false,
            "IsFeaturedItem": false,
            "IsExternalResource": false,
            "User": {
                "ID": 27193,
                "Username": "Victor Seal"
            },
            "DateCreated": "2020-08-28T14:13:00Z"
        }
    ],
    "IsRecentlyVerified": false,
    "ID": 148153,
    "UUID": "9AD76EF9-B56D-4E32-99A2-8140365F46E4",
    "DataProviderID": 1,
    "OperatorID": 3375,
    "UsageTypeID": 5,
    "UsageCost": "$0.20 / min",
    "AddressInfo": {
        "ID": 148505,
        "Title": "Petro-Canada",
        "AddressLine1": "1230 Chemin Olivier",
        "Town": "Saint-Nicolas ",
        "StateOrProvince": "QC",
        "Postcode": "G7A 2M6",
        "CountryID": 44,
        "Latitude": 46.67948139912099,
        "Longitude": -71.34556303458237,
        "ContactTelephone1": "(418) 831-2328",
        "RelatedURL": "https://www.petro-canada.ca/ve",
        "DistanceUnit": 0
    },
    "Connections": [
        {
            "ID": 205698,
            "ConnectionTypeID": 32,
            "StatusTypeID": 50,
            "LevelID": 3,
            "Amps": 250,
            "Voltage": 400,
            "PowerKW": 100,
            "CurrentTypeID": 30,
            "Quantity": 2
        },
        {
            "ID": 205699,
            "ConnectionTypeID": 2,
            "StatusTypeID": 50,
            "LevelID": 3,
            "Amps": 250,
            "Voltage": 400,
            "PowerKW": 100,
            "CurrentTypeID": 30,
            "Quantity": 2
        }
    ],
    "NumberOfPoints": 2,
    "StatusTypeID": 50,
    "DateLastStatusUpdate": "2020-08-28T14:13:00Z",
    "DataQualityLevel": 1,
    "DateCreated": "2020-01-26T19:40:00Z",
    "SubmissionStatusTypeID": 200
}