{
    "UserComments": [
        {
            "ID": 24009,
            "ChargePointID": 107774,
            "CommentTypeID": 10,
            "UserName": "ForumElettrico.it",
            "Comment": "Subito sulla destra appena scesa la rampa del parcheggio sotterraneo, ma tutte fuori servizio. Leggi la recensione completa qui >  https://www.forumelettrico.it/forum/colonnine-lidl-corso-traiano-torino-t9613.html",
            "RelatedURL": "https://www.forumelettrico.it/forum/colonnine-lidl-corso-traiano-torino-t9613.html",
            "DateCreated": "2021-03-14T15:03:05.223Z",
            "User": {
                "ID": 11749,
                "Username": "ForumElettrico.it"
            },
            "CheckinStatusTypeID": 25,
            "IsActionedByEditor": false
        }
    ],
    "MediaItems": [
        {
            "ID": 26893,
            "ChargePointID": 107774,
            "ItemURL": "https://s3-ap-southeast-2.amazonaws.com/openchargemap/images/IT/OCM107774/OCM-107774.orig.2021031415053606.jpg",
            "ItemThumbnailURL": "https://s3-ap-southeast-2.amazonaws.com/openchargemap/images/IT/OCM107774/OCM-107774.thmb.2021031415053606.jpg",
            "Comment": "",
            "IsEnabled": true,
            "IsVideo": false,
            "IsFeaturedItem": false,
            "IsExternalResource": false,
            "User": {
                "ID": 11749,
                "Username": "ForumElettrico.it"
            },
            "DateCreated": "2021-03-14T15:06:00Z"
        },
        {
            "ID": 26894,
            "ChargePointID": 107774,
            "ItemURL": "https://s3-ap-southeast-2.amazonaws.com/openchargemap/images/IT/OCM107774/OCM-107774.orig.2021031415054378.jpg",
            "ItemThumbnailURL": "https://s3-ap-southeast-2.amazonaws.com/openchargemap/images/IT/OCM107774/OCM-107774.thmb.2021031415054378.jpg",
            "Comment": "",
            "IsEnabled": true,
            "IsVideo": false,
            "IsFeaturedItem": false,
            "IsExternalResource": false,
            "User": {
                "ID": 11749,
                "Username": "ForumElettrico.it"
            },
            "DateCreated": "2021-03-14T15:06:00Z"
        },
        {
            "ID": 26889,
            "ChargePointID": 107774,
            "ItemURL": "https://s3-ap-southeast-2.amazonaws.com/openchargemap/images/IT/OCM107774/OCM-107774.orig.2021031415050059.jpg",
            "ItemThumbnailURL": "https://s3-ap-southeast-2.amazonaws.com/openchargemap/images/IT/OCM107774/OCM-107774.thmb.2021031415050059.jpg",
            "Comment": "",
            "IsEnabled": true,
            "IsVideo": false,
            "IsFeaturedItem": false,
            "IsExternalResource": false,
            "User": {
                "ID": 11749,
                "Username": "ForumElettrico.it"
            },
            "DateCreated": "2021-03-14T15:05:00Z"
        },
        {
            "ID": 26890,
            "ChargePointID": 107774,
            "ItemURL": "https://s3-ap-southeast-2.amazonaws.com/openchargemap/images/IT/OCM107774/OCM-107774.orig.2021031415051003.jpg",
            "ItemThumbnailURL": "https://s3-ap-southeast-2.amazonaws.com/openchargemap/images/IT/OCM107774/OCM-107774.thmb.2021031415051003.jpg",
            "Comment": "",
            "IsEnabled": true,
            "IsVideo": false,
            "IsFeaturedItem": false,
            "IsExternalResource": false,
            "User": {
                "ID": 11749,
                "Username": "ForumElettrico.it"
            },
            "DateCreated": "2021-03-14T15:05:00Z"
        },
        {
            "ID": 26891,
            "ChargePointID": 107774,
            "ItemURL": "https://s3-ap-southeast-2.amazonaws.com/openchargemap/images/IT/OCM107774/OCM-107774.orig.2021031415051945.jpg",
            "ItemThumbnailURL": "https://s3-ap-southeast-2.amazonaws.com/openchargemap/images/IT/OCM107774/OCM-107774.thmb.2021031415051945.jpg",
            "Comment": "",
            "IsEnabled": true,
            "IsVideo": false,
            "IsFeaturedItem": false,
            "IsExternalResource": false,
            "User": {
                "ID": 11749,
                "Username": "ForumElettrico.it"
            },
            "DateCreated": "2021-03-14T15:05:00Z"
        },
        {
            "ID": 26892,
            "ChargePointID": 107774,
            "ItemURL": "https://s3-ap-southeast-2.amazonaws.com/openchargemap/images/IT/OCM107774/OCM-107774.orig.2021031415052781.jpg",
            "ItemThumbnailURL": "https://s3-ap-southeast-2.amazonaws.com/openchargemap/images/IT/OCM107774/OCM-107774.thmb.2021031415052781.jpg",
            "Comment": "",
            "IsEnabled": true,
            "IsVideo": false,
            "IsFeaturedItem": false,
            "IsExternalResource": false,
            "User": {
                "ID": 11749,
                "Username": "ForumElettrico.it"
            },
            "DateCreated": "2021-03-14T15:05:00Z"
        },
        {
            "ID": 26888,
            "ChargePointID": 107774,
            "ItemURL": "https://s3-ap-southeast-2.amazonaws.com/openchargemap/images/IT/OCM107774/OCM-107774.orig.2021031415031549.jpg",
            "ItemThumbnailURL": "https://s3-ap-southeast-2.amazonaws.com/openchargemap/images/IT/OCM107774/OCM-107774.thmb.2021031415031549.jpg",
            "Comment": "",
            "IsEnabled": true,
            "IsVideo": false,
            "IsFeaturedItem": false,
            "IsExternalResource": false,
            "User": {
                "ID": 11749,
                "Username": "ForumElettrico.it"
            },
            "DateCreated": "2021-03-14T15:03:00Z"
        }
    ],
    "IsRecentlyVerified": false,
    "ID": 107774,
    "UUID": "3A58F33C-A7FA-4931-BDE4-30126C16B17B",
    "DataProviderID": 1,
    "OperatorID": 38,
    "UsageTypeID": 1,
    "UsageCost": "free",
    "AddressInfo": {
        "ID": 108120,
        "Title": " Lidl Torino Traiano",
        "AddressLine1": "Corso Traiano, 124",
        "Town": "Torino",
        "StateOrProvince": "TO",
        "Postcode": "10127",
        "CountryID": 112,
        "Latitude": 45.0210603202806,
        "Longitude": 7.65093808419476,
        "RelatedURL": "https://www.lidl.it",
        "DistanceUnit": 0
    },
    "Connections": [
        {
            "ID": 152177,
            "ConnectionTypeID": 25,
            "StatusTypeID": 50,
            "LevelID": 2,
            "Amps": 32,
            "Voltage": 400,
            "PowerKW": 22,
            "CurrentTypeID": 20,
            "Quantity": 4
        }
    ],
    "NumberOfPoints": 4,
    "StatusTypeID": 50,
    "DateLastStatusUpdate": "2021-03-14T15:06:00Z",
    "DataQualityLevel": 1,
    "DateCreated": "2018-08-09T09:39:00Z",
    "SubmissionStatusTypeID": 200
}