{
    "UserComments": [
        {
            "ID": 22872,
            "ChargePointID": 155763,
            "CommentTypeID": 10,
            "UserName": "ForumElettrico.it",
            "Comment": "Siamo a circa 500 dalla colonnina più centrale di Sassuolo, quella del Palazzo Ducale. Leggi la recensione completa qui > https://www.forumelettrico.it/forum/colonnina-enel-x-22-kw-sassuolo-mo-via-emilio-alessandrini-3-t11330.html",
            "RelatedURL": "https://www.forumelettrico.it/forum/colonnina-enel-x-22-kw-sassuolo-mo-via-emilio-alessandrini-3-t11330.html",
            "DateCreated": "2020-07-07T16:05:00.74Z",
            "User": {
                "ID": 11749,
                "Username": "ForumElettrico.it"
            },
            "CheckinStatusTypeID": 10,
            "IsActionedByEditor": false
        }
    ],
    "MediaItems": [
        {
            "ID": 22955,
            "ChargePointID": 155763,
            "ItemURL": "https://s3-ap-southeast-2.amazonaws.com/openchargemap/images/IT/OCM155763/OCM-155763.orig.2020070716053117.jpg",
            "ItemThumbnailURL": "https://s3-ap-southeast-2.amazonaws.com/openchargemap/images/IT/OCM155763/OCM-155763.thmb.2020070716053117.jpg",
            "Comment": "",
            "IsEnabled": true,
            "IsVideo": false,
            "IsFeaturedItem": false,
            "IsExternalResource": false,
            "User": {
                "ID": 11749,
                "Username": "ForumElettrico.it"
            },
            "DateCreated": "2020-07-07T16:06:00Z"
        },
        {
            "ID": 22956,
            "ChargePointID": 155763,
            "ItemURL": "https://s3-ap-southeast-2.amazonaws.com/openchargemap/images/IT/OCM155763/OCM-155763.orig.2020070716053870.jpg",
            "ItemThumbnailURL": "https://s3-ap-southeast-2.amazonaws.com/openchargemap/images/IT/OCM155763/OCM-155763.thmb.2020070716053870.jpg",
            "Comment": "",
            "IsEnabled": true,
            "IsVideo": false,
            "IsFeaturedItem": false,
            "IsExternalResource": false,
            "User": {
                "ID": 11749,
                "Username": "ForumElettrico.it"
            },
            "DateCreated": "2020-07-07T16:06:00Z"
        },
        {
            "ID": 22952,
            "ChargePointID": 155763,
            "ItemURL": "https://s3-ap-southeast-2.amazonaws.com/openchargemap/images/IT/OCM155763/OCM-155763.orig.2020070716051199.jpg",
            "ItemThumbnailURL": "https://s3-ap-southeast-2.amazonaws.com/openchargemap/images/IT/OCM155763/OCM-155763.thmb.2020070716051199.jpg",
            "Comment": "",
            "IsEnabled": true,
            "IsVideo": false,
            "IsFeaturedItem": false,
            "IsExternalResource": false,
            "User": {
                "ID": 11749,
                "Username": "ForumElettrico.it"
            },
            "DateCreated": "2020-07-07T16:05:00Z"
        },
        {
            "ID": 22953,
            "ChargePointID": 155763,
            "ItemURL": "https://s3-ap-southeast-2.amazonaws.com/openchargemap/images/IT/OCM155763/OCM-155763.orig.2020070716051797.jpg",
            "ItemThumbnailURL": "https://s3-ap-southeast-2.amazonaws.com/openchargemap/images/IT/OCM155763/OCM-155763.thmb.2020070716051797.jpg",
            "Comment": "",
            "IsEnabled": true,
            "IsVideo": false,
            "IsFeaturedItem": false,
            "IsExternalResource": false,
            "User": {
                "ID": 11749,
                "Username": "ForumElettrico.it"
            },
            "DateCreated": "2020-07-07T16:05:00Z"
        },
        {
            "ID": 22954,
            "ChargePointID": 155763,
            "ItemURL": "https://s3-ap-southeast-2.amazonaws.com/openchargemap/images/IT/OCM155763/OCM-155763.orig.2020070716052432.jpg",
            "ItemThumbnailURL": "https://s3-ap-southeast-2.amazonaws.com/openchargemap/images/IT/OCM155763/OCM-155763.thmb.2020070716052432.jpg",
            "Comment": "",
            "IsEnabled": true,
            "IsVideo": false,
            "IsFeaturedItem": false,
            "IsExternalResource": false,
            "User": {
                "ID": 11749,
                "Username": "ForumElettrico.it"
            },
            "DateCreated": "2020-07-07T16:05:00Z"
        }
    ],
    "IsRecentlyVerified": false,
    "ID": 155763,
    "UUID": "D59B0311-D57F-47DC-8222-F30C45415A37",
    "DataProviderID": 1,
    "OperatorID": 80,
    "UsageTypeID": 4,
    "AddressInfo": {
        "ID": 156117,
        "Title": "SASSUOLO Alessandrini | ENELX",
        "AddressLine1": "Via Alessandrini",
        "Town": "Sassuolo",
        "StateOrProvince": "MO",
        "Postcode": "41049",
        "CountryID": 112,
        "Latitude": 44.53753231605424,
        "Longitude": 10.778371161569112,
        "RelatedURL": "https://www.enelx.com/it/it/emobility",
        "DistanceUnit": 0
    },
    "Connections": [
        {
            "ID": 219327,
            "ConnectionTypeID": 25,
            "StatusTypeID": 50,
            "LevelID": 2,
            "Amps": 32,
            "Voltage": 400,
            "PowerKW": 22,
            "CurrentTypeID": 20,
            "Quantity": 2
        }
    ],
    "NumberOfPoints": 2,
    "StatusTypeID": 50,
    "DateLastStatusUpdate": "2020-07-07T16:06:00Z",
    "DataQualityLevel": 1,
    "DateCreated": "2020-04-23T15:41:00Z",
    "SubmissionStatusTypeID": 200
}