{
    "IsRecentlyVerified": false,
    "ID": 136800,
    "UUID": "E60F70C8-7112-46B8-B867-001FB68583BE",
    "DataProviderID": 1,
    "OperatorID": 203,
    "UsageTypeID": 5,
    "UsageCost": "36p per kWh with credit or debit card (contactless).",
    "AddressInfo": {
        "ID": 137146,
        "Title": "The Eight Foot Way Pub & Restaurant",
        "AddressLine1": "2 Chaucer Rd",
        "Town": "Sheffield",
        "Postcode": "S5 9QY",
        "CountryID": 1,
        "Latitude": 53.42759,
        "Longitude": -1.49166,
        "AccessComments": "",
        "RelatedURL": "http://engenie.co.uk/",
        "DistanceUnit": 0
    },
    "Connections": [
        {
            "ID": 191398,
            "ConnectionTypeID": 25,
            "Reference": "ENG00091-3",
            "StatusTypeID": 50,
            "LevelID": 2,
            "Amps": 32,
            "Voltage": 400,
            "PowerKW": 22,
            "CurrentTypeID": 20,
            "Quantity": 1
        },
        {
            "ID": 191399,
            "ConnectionTypeID": 2,
            "Reference": "ENG00091-2",
            "StatusTypeID": 50,
            "LevelID": 3,
            "Amps": 125,
            "Voltage": 400,
            "PowerKW": 50,
            "CurrentTypeID": 30,
            "Quantity": 1
        },
        {
            "ID": 191400,
            "ConnectionTypeID": 33,
            "Reference": "ENG00091-1",
            "StatusTypeID": 50,
            "LevelID": 3,
            "Amps": 125,
            "Voltage": 400,
            "PowerKW": 50,
            "CurrentTypeID": 30,
            "Quantity": 1
        }
    ],
    "StatusTypeID": 50,
    "DateLastStatusUpdate": "2020-10-06T02:48:00Z",
    "MetadataValues": [
        {
            "ID": 6652,
            "MetadataFieldID": 4,
            "ItemValue": "Contains public sector information licensed under the Open Government Licence v2.0. http://www.nationalarchives.gov.uk/doc/open-government-licence/version/2/"
        }
    ],
    "DataQualityLevel": 3,
    "DateCreated": "2019-12-24T05:23:00Z",
    "SubmissionStatusTypeID": 100
}