{
    "IsRecentlyVerified": false,
    "ID": 133472,
    "UUID": "17DF88C1-A16B-49D7-8F98-1DE1C302C3BA",
    "DataProviderID": 1,
    "OperatorID": 80,
    "UsageTypeID": 4,
    "AddressInfo": {
        "ID": 133818,
        "Title": "Municipio di Castelfidardo | EnelX",
        "AddressLine1": "Via Cesare Battisti, 1",
        "Town": "Castelfidardo",
        "StateOrProvince": "AN",
        "Postcode": "60022",
        "CountryID": 112,
        "Latitude": 43.4642115163107,
        "Longitude": 13.5469190569238,
        "ContactTelephone1": "800.069.850",
        "RelatedURL": "https://www.enelx.com/it/it/emobility",
        "DistanceUnit": 0
    },
    "Connections": [
        {
            "ID": 186832,
            "ConnectionTypeID": 25,
            "StatusTypeID": 50,
            "LevelID": 2,
            "Amps": 32,
            "Voltage": 400,
            "PowerKW": 22,
            "CurrentTypeID": 20,
            "Quantity": 1
        },
        {
            "ID": 186833,
            "ConnectionTypeID": 36,
            "StatusTypeID": 50,
            "LevelID": 2,
            "Amps": 16,
            "Voltage": 240,
            "PowerKW": 3.7,
            "CurrentTypeID": 10,
            "Quantity": 1
        }
    ],
    "NumberOfPoints": 2,
    "StatusTypeID": 50,
    "DateLastStatusUpdate": "2019-10-18T15:25:00Z",
    "DataQualityLevel": 1,
    "DateCreated": "2019-10-18T15:25:00Z",
    "SubmissionStatusTypeID": 200
}