{
    "IsRecentlyVerified": false,
    "ID": 117686,
    "UUID": "FCFFF8AB-571A-47BD-9E22-A28679982B87",
    "DataProviderID": 1,
    "OperatorID": 105,
    "UsageTypeID": 4,
    "AddressInfo": {
        "ID": 118032,
        "Title": "Strandstraße",
        "AddressLine1": "Strandstraße 56",
        "Town": "Timmendorfer Strand",
        "StateOrProvince": "Ostholstein",
        "Postcode": "23669",
        "CountryID": 87,
        "Latitude": 53.99255089093231,
        "Longitude": 10.815321152577553,
        "AccessComments": "24/7 zugängliche Ladesäule auf dem Parkplatz mit 2 reservierten Parkplätzen. ",
        "DistanceUnit": 0
    },
    "Connections": [
        {
            "ID": 166477,
            "ConnectionTypeID": 25,
            "StatusTypeID": 50,
            "LevelID": 2,
            "Amps": 32,
            "Voltage": 400,
            "PowerKW": 22,
            "CurrentTypeID": 20,
            "Quantity": 2
        }
    ],
    "NumberOfPoints": 2,
    "StatusTypeID": 50,
    "DateLastStatusUpdate": "2019-02-22T14:34:00Z",
    "DataQualityLevel": 1,
    "DateCreated": "2019-02-22T14:34:00Z",
    "SubmissionStatusTypeID": 200
}