{
    "IsRecentlyVerified": false,
    "ID": 175703,
    "UUID": "2BC00D7E-22D3-4AF4-B308-060E7624E4D4",
    "DataProviderID": 1,
    "OperatorID": 21,
    "UsageTypeID": 4,
    "UsageCost": "Mobi.E compatible card or App",
    "AddressInfo": {
        "ID": 176062,
        "Title": "ARL-00001",
        "AddressLine1": "Rua das Fontainhas",
        "Town": "Arraiolos",
        "StateOrProvince": "Évora",
        "Postcode": "",
        "CountryID": 180,
        "Latitude": 38.72297725847929,
        "Longitude": -7.985659310068513,
        "DistanceUnit": 0
    },
    "Connections": [
        {
            "ID": 272830,
            "ConnectionTypeID": 25,
            "StatusTypeID": 50,
            "LevelID": 2,
            "Amps": 32,
            "Voltage": 400,
            "PowerKW": 22,
            "CurrentTypeID": 20,
            "Quantity": 2
        }
    ],
    "NumberOfPoints": 2,
    "StatusTypeID": 50,
    "DateLastStatusUpdate": "2021-06-07T15:33:00Z",
    "DataQualityLevel": 1,
    "DateCreated": "2021-06-07T15:33:00Z",
    "SubmissionStatusTypeID": 200
}