{
    "IsRecentlyVerified": false,
    "ID": 90896,
    "UUID": "C3793E63-4E70-46B8-971F-A01196B94A0F",
    "DataProviderID": 1,
    "OperatorID": 125,
    "UsageTypeID": 4,
    "AddressInfo": {
        "ID": 91242,
        "Title": "Supermarkt Edeka",
        "AddressLine1": "Handelspark 17",
        "Town": "Geestland",
        "StateOrProvince": "Landkreis Cuxhaven",
        "Postcode": "27624",
        "CountryID": 87,
        "Latitude": 53.6274436,
        "Longitude": 8.8107708,
        "AccessComments": "24/7 nutzbar mit Karten des SWB / EWE Verbundes.",
        "DistanceUnit": 0
    },
    "Connections": [
        {
            "ID": 128940,
            "ConnectionTypeID": 25,
            "StatusTypeID": 50,
            "LevelID": 2,
            "Amps": 32,
            "Voltage": 400,
            "PowerKW": 22,
            "CurrentTypeID": 20,
            "Quantity": 2
        }
    ],
    "NumberOfPoints": 2,
    "StatusTypeID": 50,
    "DateLastStatusUpdate": "2017-07-26T11:28:00Z",
    "DataQualityLevel": 1,
    "DateCreated": "2017-07-26T11:28:00Z",
    "SubmissionStatusTypeID": 200
}