{
    "UserComments": [
        {
            "ID": 19890,
            "ChargePointID": 107201,
            "CommentTypeID": 10,
            "UserName": "Hypermile",
            "Comment": "Tucked away. May need to coordinate with an incumbent car charging (likely belonging to the owner).",
            "Rating": 5,
            "DateCreated": "2018-07-22T22:51:01.58Z",
            "User": {
                "ID": 11824,
                "Username": "Hypermile"
            },
            "CheckinStatusTypeID": 10
        }
    ],
    "MediaItems": [
        {
            "ID": 15997,
            "ChargePointID": 107201,
            "ItemURL": "https://s3-ap-southeast-2.amazonaws.com/openchargemap/images/US/OCM107201/OCM-107201.orig.2018072222500962.jpg",
            "ItemThumbnailURL": "https://s3-ap-southeast-2.amazonaws.com/openchargemap/images/US/OCM107201/OCM-107201.thmb.2018072222500962.jpg",
            "Comment": "",
            "IsEnabled": true,
            "IsVideo": false,
            "IsFeaturedItem": false,
            "IsExternalResource": false,
            "User": {
                "ID": 11824,
                "Username": "Hypermile"
            },
            "DateCreated": "2018-07-22T22:50:00Z"
        }
    ],
    "IsRecentlyVerified": false,
    "ID": 107201,
    "UUID": "D5D0E586-464A-4E05-8B51-2A2CD3E03D1B",
    "DataProviderID": 1,
    "OperatorID": 45,
    "UsageTypeID": 1,
    "UsageCost": "Free",
    "AddressInfo": {
        "ID": 107547,
        "Title": "South Vermont Street",
        "AddressLine1": "South Vermont Street",
        "Town": "Palatine",
        "StateOrProvince": "Cook County",
        "Postcode": "60067",
        "CountryID": 2,
        "Latitude": 42.1027201,
        "Longitude": -88.0367887,
        "DistanceUnit": 0
    },
    "Connections": [
        {
            "ID": 151181,
            "ConnectionTypeID": 11,
            "StatusTypeID": 50,
            "LevelID": 2,
            "PowerKW": 7.5,
            "Quantity": 1
        }
    ],
    "NumberOfPoints": 1,
    "StatusTypeID": 50,
    "DateLastStatusUpdate": "2018-07-22T22:52:00Z",
    "DataQualityLevel": 1,
    "DateCreated": "2018-07-22T22:48:00Z",
    "SubmissionStatusTypeID": 200
}