{
    "IsRecentlyVerified": false,
    "ID": 129039,
    "UUID": "0704F4FE-61A5-4332-AF82-D8E7812F31F2",
    "DataProviderID": 1,
    "OperatorID": 3257,
    "UsageTypeID": 1,
    "AddressInfo": {
        "ID": 129385,
        "Title": "Pezenas",
        "AddressLine1": "Parking Herault Energies",
        "Town": "Pezenas",
        "Postcode": "34120",
        "CountryID": 80,
        "Latitude": 43.4601302638625,
        "Longitude": 3.40987006068485,
        "DistanceUnit": 0
    },
    "Connections": [
        {
            "ID": 180650,
            "ConnectionTypeID": 33,
            "StatusTypeID": 50,
            "LevelID": 3,
            "PowerKW": 50,
            "CurrentTypeID": 30,
            "Quantity": 1
        },
        {
            "ID": 180651,
            "ConnectionTypeID": 2,
            "StatusTypeID": 50,
            "LevelID": 3,
            "PowerKW": 50,
            "CurrentTypeID": 30,
            "Quantity": 1
        },
        {
            "ID": 180652,
            "ConnectionTypeID": 1036,
            "StatusTypeID": 50,
            "LevelID": 3,
            "PowerKW": 43,
            "CurrentTypeID": 20,
            "Quantity": 1
        }
    ],
    "NumberOfPoints": 1,
    "StatusTypeID": 50,
    "DateLastStatusUpdate": "2019-07-10T21:09:00Z",
    "DataQualityLevel": 1,
    "DateCreated": "2019-07-10T21:09:00Z",
    "SubmissionStatusTypeID": 200
}