{
    "IsRecentlyVerified": false,
    "ID": 88178,
    "UUID": "FDC98691-A4C6-473F-926F-953CF1C54AC7",
    "DataProviderID": 1,
    "OperatorID": 3,
    "OperatorsReference": "PG-80876",
    "UsageTypeID": 6,
    "UsageCost": "Free",
    "AddressInfo": {
        "ID": 88524,
        "Title": "W M Couper LTD-Hyundai",
        "AddressLine1": "18-20 Catherine Street",
        "Town": "Hertfordshire",
        "Postcode": "AL3 5BY",
        "CountryID": 1,
        "Latitude": 51.755247,
        "Longitude": -0.336576,
        "DistanceUnit": 0
    },
    "Connections": [
        {
            "ID": 125080,
            "ConnectionTypeID": 25,
            "StatusTypeID": 50,
            "LevelID": 2,
            "Amps": 32,
            "Voltage": 230,
            "PowerKW": 7,
            "CurrentTypeID": 10,
            "Quantity": 2
        }
    ],
    "NumberOfPoints": 2,
    "GeneralComments": "This is an open charge unit installed at the W M Couper Ltd - Hyundai dealership in Catherine Street, St Albans, Hertfordshire",
    "StatusTypeID": 50,
    "DateLastStatusUpdate": "2017-05-25T05:37:00Z",
    "DataQualityLevel": 1,
    "DateCreated": "2017-05-24T05:50:00Z",
    "SubmissionStatusTypeID": 200
}