{
    "IsRecentlyVerified": false,
    "ID": 73057,
    "UUID": "442482DB-9A89-4EB9-A7EA-58C3F31707E6",
    "DataProviderID": 1,
    "OperatorID": 110,
    "UsageTypeID": 5,
    "AddressInfo": {
        "ID": 73403,
        "Title": "Raststätte Münsingen Ost in Münsingen",
        "AddressLine1": "N6 Ost",
        "Town": "Münsingen",
        "StateOrProvince": "Switzerland",
        "Postcode": "3110",
        "CountryID": 217,
        "Latitude": 46.8784916484802,
        "Longitude": 7.54252195358276,
        "DistanceUnit": 0
    },
    "Connections": [
        {
            "ID": 104993,
            "ConnectionTypeID": 33,
            "StatusTypeID": 50,
            "LevelID": 3,
            "PowerKW": 20,
            "CurrentTypeID": 30,
            "Quantity": 1
        },
        {
            "ID": 104994,
            "ConnectionTypeID": 2,
            "StatusTypeID": 50,
            "LevelID": 3,
            "PowerKW": 20,
            "CurrentTypeID": 30,
            "Quantity": 1
        },
        {
            "ID": 104995,
            "ConnectionTypeID": 25,
            "StatusTypeID": 50,
            "LevelID": 2,
            "PowerKW": 22,
            "CurrentTypeID": 20,
            "Quantity": 1
        }
    ],
    "NumberOfPoints": 1,
    "StatusTypeID": 50,
    "DateLastStatusUpdate": "2016-11-05T11:18:00Z",
    "DataQualityLevel": 1,
    "DateCreated": "2016-11-03T07:56:00Z",
    "SubmissionStatusTypeID": 200
}