{
    "MediaItems": [
        {
            "ID": 24416,
            "ChargePointID": 156143,
            "ItemURL": "https://s3-ap-southeast-2.amazonaws.com/openchargemap/images/IT/OCM156143/OCM-156143.orig.2020082315175102.jpg",
            "ItemThumbnailURL": "https://s3-ap-southeast-2.amazonaws.com/openchargemap/images/IT/OCM156143/OCM-156143.thmb.2020082315175102.jpg",
            "Comment": "",
            "IsEnabled": true,
            "IsVideo": false,
            "IsFeaturedItem": false,
            "IsExternalResource": false,
            "User": {
                "ID": 1606,
                "Username": "polianto"
            },
            "DateCreated": "2020-08-23T15:18:00Z"
        }
    ],
    "IsRecentlyVerified": false,
    "ID": 156143,
    "UUID": "69FA5204-6CED-471B-884D-35DA2437C324",
    "DataProviderID": 1,
    "OperatorID": 164,
    "UsageTypeID": 4,
    "AddressInfo": {
        "ID": 156497,
        "Title": "FAMIGLIA COOPERATIVA Cavedago | NEOGY",
        "AddressLine1": "Via Croce, 1, - Strada Statale dei Laghi di Molveno e Tenno",
        "Town": "Cavedago",
        "StateOrProvince": "TN",
        "Postcode": "38010",
        "CountryID": 112,
        "Latitude": 46.18390620454235,
        "Longitude": 11.02871868379168,
        "DistanceUnit": 0
    },
    "Connections": [
        {
            "ID": 219754,
            "ConnectionTypeID": 25,
            "StatusTypeID": 50,
            "LevelID": 2,
            "Amps": 32,
            "Voltage": 240,
            "PowerKW": 7.5,
            "CurrentTypeID": 10,
            "Quantity": 2
        }
    ],
    "NumberOfPoints": 2,
    "StatusTypeID": 50,
    "DateLastStatusUpdate": "2020-08-23T15:18:00Z",
    "DataQualityLevel": 1,
    "DateCreated": "2020-05-08T15:29:00Z",
    "SubmissionStatusTypeID": 200
}