{
    "IsRecentlyVerified": false,
    "ID": 174207,
    "UUID": "A0DC7A6F-8A70-4800-B218-94E00F508B31",
    "DataProviderID": 1,
    "OperatorID": 3296,
    "UsageTypeID": 5,
    "UsageCost": "£0.40/kWh",
    "AddressInfo": {
        "ID": 174566,
        "Title": "Booths Hestketh Bank",
        "AddressLine1": "Station Road",
        "Town": "Hesketh Bank",
        "StateOrProvince": "Lancashire",
        "Postcode": "PR4 6SN",
        "CountryID": 1,
        "Latitude": 53.6982497932224,
        "Longitude": -2.8382758568553754,
        "DistanceUnit": 0
    },
    "Connections": [
        {
            "ID": 269341,
            "ConnectionTypeID": 33,
            "StatusTypeID": 50,
            "LevelID": 3,
            "PowerKW": 50,
            "CurrentTypeID": 30,
            "Quantity": 2
        },
        {
            "ID": 269342,
            "ConnectionTypeID": 2,
            "StatusTypeID": 50,
            "LevelID": 3,
            "PowerKW": 50,
            "CurrentTypeID": 30,
            "Quantity": 2
        }
    ],
    "NumberOfPoints": 2,
    "GeneralComments": "Contactless Payment",
    "StatusTypeID": 50,
    "DateLastStatusUpdate": "2021-05-26T08:06:00Z",
    "DataQualityLevel": 1,
    "DateCreated": "2021-03-22T09:13:00Z",
    "SubmissionStatusTypeID": 200
}