{
    "IsRecentlyVerified": false,
    "ID": 160441,
    "UUID": "9BCEB15E-EBAE-4C9F-8322-0D1F4C0A1CA3",
    "DataProviderID": 2,
    "DataProvidersReference": "158220",
    "UsageTypeID": 2,
    "AddressInfo": {
        "ID": 160798,
        "Title": "St. Hubert",
        "AddressLine1": "1415 boul. Moody",
        "Town": "Terrebonne",
        "StateOrProvince": "QC",
        "Postcode": "J6X 4C8",
        "CountryID": 44,
        "Latitude": 45.709782,
        "Longitude": -73.6531057,
        "ContactTelephone1": "",
        "AccessComments": "",
        "RelatedURL": "",
        "DistanceUnit": 0
    },
    "Connections": [
        {
            "ID": 230845,
            "ConnectionTypeID": 2,
            "LevelID": 3,
            "Amps": 100,
            "Voltage": 400,
            "PowerKW": 40,
            "CurrentTypeID": 30,
            "Quantity": 1
        },
        {
            "ID": 230846,
            "ConnectionTypeID": 32,
            "LevelID": 3,
            "Amps": 100,
            "Voltage": 400,
            "PowerKW": 40,
            "CurrentTypeID": 30,
            "Quantity": 1
        }
    ],
    "GeneralComments": "Planned for future date. Not Operational.",
    "DatePlanned": "2020-09-01T00:00:00Z",
    "StatusTypeID": 150,
    "DateLastStatusUpdate": "2020-06-26T03:09:00Z",
    "DataQualityLevel": 3,
    "DateCreated": "2020-06-26T03:09:00Z",
    "SubmissionStatusTypeID": 100
}