{
    "IsRecentlyVerified": false,
    "ID": 137131,
    "UUID": "A0D97CD9-7596-473A-A111-14A4F6AA3A3F",
    "DataProviderID": 1,
    "DataProvidersReference": "LSB-00040",
    "OperatorID": 21,
    "UsageTypeID": 4,
    "UsageCost": "Mobi.E compatible card",
    "AddressInfo": {
        "ID": 137477,
        "Title": "LSB-00040",
        "AddressLine1": "Passeio do Báltico",
        "Town": "Lisboa",
        "Postcode": "1990-036",
        "CountryID": 180,
        "Latitude": 38.766718,
        "Longitude": -9.098688,
        "RelatedURL": "http://www.mobie.pt",
        "DistanceUnit": 0
    },
    "Connections": [
        {
            "ID": 191988,
            "ConnectionTypeID": 25,
            "StatusTypeID": 50,
            "LevelID": 2,
            "Amps": 32,
            "Voltage": 400,
            "PowerKW": 22,
            "CurrentTypeID": 20,
            "Quantity": 2
        }
    ],
    "NumberOfPoints": 2,
    "StatusTypeID": 50,
    "DateLastStatusUpdate": "2020-08-15T11:21:00Z",
    "DataQualityLevel": 3,
    "DateCreated": "2019-12-24T08:08:00Z",
    "SubmissionStatusTypeID": 100
}