{
    "IsRecentlyVerified": false,
    "ID": 13000,
    "UUID": "73035B8A-FA9C-4F26-91E4-B9BB0A7B71F6",
    "DataProviderID": 15,
    "DataProvidersReference": "20293",
    "OperatorID": 1,
    "AddressInfo": {
        "ID": 12897,
        "Title": "12105 Pacific Ave",
        "AddressLine1": "12105 Pacific Ave",
        "Town": "Tacoma",
        "StateOrProvince": "WA",
        "Postcode": "98444",
        "CountryID": 2,
        "Latitude": 47.147143,
        "Longitude": -122.433631,
        "ContactTelephone1": "(253) 535-9302",
        "RelatedURL": "http://carstations.com/20293",
        "DistanceUnit": 0
    },
    "Connections": [
        {
            "ID": 10433,
            "ConnectionTypeID": 1,
            "Reference": "J1772",
            "LevelID": 2
        }
    ],
    "StatusTypeID": 0,
    "DateLastStatusUpdate": "2017-11-04T14:05:00Z",
    "DataQualityLevel": 2,
    "DateCreated": "2012-09-07T19:26:00Z",
    "SubmissionStatusTypeID": 100
}