{
    "UserComments": [
        {
            "ID": 17875,
            "ChargePointID": 92679,
            "CommentTypeID": 10,
            "UserName": "Erna_Schleck",
            "Comment": "Zugeparkt trotz Ausschilderung. Besser ist die 300m entfernte Ladestation am Autohaus Ahrens, da kostenlos, mit mehr Leistung und mehrere Parkplätzen, siehe Web Link! \r\nDie 3.7kW hier sind nur für Langsamlader oder über Nacht interessant, allerdings nur mit PlugSurfing, New Motion mit Zeittarif ist einfach absurd teuer!",
            "Rating": 1,
            "RelatedURL": "https://openchargemap.org/site/poi/details/71041",
            "DateCreated": "2017-11-01T10:21:56.737Z",
            "User": {
                "ID": 4573,
                "Username": "Erna_Schleck"
            },
            "CheckinStatusTypeID": 110
        }
    ],
    "MediaItems": [
        {
            "ID": 13611,
            "ChargePointID": 92679,
            "ItemURL": "https://s3-ap-southeast-2.amazonaws.com/openchargemap/images/DE/OCM92679/OCM-92679.orig.2017110110171130.jpg",
            "ItemThumbnailURL": "https://s3-ap-southeast-2.amazonaws.com/openchargemap/images/DE/OCM92679/OCM-92679.thmb.2017110110171130.jpg",
            "Comment": "Zugeparkt trotz Ausschilderung",
            "IsEnabled": true,
            "IsVideo": false,
            "IsFeaturedItem": false,
            "IsExternalResource": false,
            "User": {
                "ID": 4573,
                "Username": "Erna_Schleck"
            },
            "DateCreated": "2017-11-01T10:17:00Z"
        }
    ],
    "IsRecentlyVerified": false,
    "ID": 92679,
    "UUID": "57A305C1-7C95-4861-A8D8-B204070EE3BD",
    "DataProviderID": 1,
    "OperatorID": 156,
    "UsageTypeID": 4,
    "AddressInfo": {
        "ID": 93025,
        "Title": "Ladelaterne Bothfelder Straße",
        "AddressLine1": "Bothfelder Straße 18",
        "Town": "Hannover",
        "StateOrProvince": "Region Hannover",
        "Postcode": "30177",
        "CountryID": 87,
        "Latitude": 52.397148733532894,
        "Longitude": 9.763457408598368,
        "ContactTelephone1": "+49 511 430-3111",
        "AccessComments": "24/7 nutzbarer Ladepunkt an einer Straßenlaterne. Betreiber ist enerCity, Freischaltung mit New Motion, PlugSurfing (empfohlen, da enerCity Zeittarif hat und PlugSurfing nach kWh abrechnet) und anderen Ladekarten",
        "RelatedURL": "http://www.enercity.de/privatkunden/service/alternative-antriebe/index.html",
        "DistanceUnit": 0
    },
    "Connections": [
        {
            "ID": 131284,
            "ConnectionTypeID": 25,
            "StatusTypeID": 50,
            "LevelID": 2,
            "Amps": 16,
            "Voltage": 230,
            "PowerKW": 3.7,
            "CurrentTypeID": 10,
            "Quantity": 1
        }
    ],
    "NumberOfPoints": 1,
    "StatusTypeID": 50,
    "DateLastStatusUpdate": "2017-11-01T10:22:00Z",
    "DataQualityLevel": 1,
    "DateCreated": "2017-09-08T05:34:00Z",
    "SubmissionStatusTypeID": 200
}