{
    "IsRecentlyVerified": false,
    "ID": 40368,
    "UUID": "2C4FBCA6-66E4-441B-A4E3-9B6B48639A9E",
    "DataProviderID": 2,
    "DataProvidersReference": "55725",
    "OperatorID": 5,
    "UsageTypeID": 1,
    "AddressInfo": {
        "ID": 40714,
        "Title": "EVPASS",
        "AddressLine1": "135 North James Street",
        "Town": "Rome",
        "StateOrProvince": "NY",
        "Postcode": "13440",
        "CountryID": 2,
        "Latitude": 43.211739,
        "Longitude": -75.456778,
        "ContactTelephone1": "888-758-4389",
        "AccessComments": "24 hours daily",
        "RelatedURL": "http://www.chargepoint.com/",
        "DistanceUnit": 0
    },
    "Connections": [
        {
            "ID": 43933,
            "ConnectionTypeID": 1,
            "LevelID": 2,
            "Amps": 16,
            "Voltage": 230,
            "PowerKW": 3,
            "CurrentTypeID": 10,
            "Quantity": 4
        }
    ],
    "DateLastStatusUpdate": "2019-12-24T09:21:00Z",
    "DataQualityLevel": 3,
    "DateCreated": "2015-01-10T01:01:00Z",
    "SubmissionStatusTypeID": 100
}