{
    "IsRecentlyVerified": false,
    "ID": 53285,
    "UUID": "0EC7EAB7-0947-4F71-A31A-B319CCFE23C7",
    "DataProviderID": 2,
    "DataProvidersReference": "69883",
    "OperatorID": 5,
    "UsageTypeID": 1,
    "AddressInfo": {
        "ID": 53631,
        "Title": "ESSEX",
        "AddressLine1": "822 E Evelyn Ave",
        "Town": "Sunnyvale",
        "StateOrProvince": "CA",
        "Postcode": "94086",
        "CountryID": 2,
        "Latitude": 37.3710926,
        "Longitude": -122.0161176,
        "ContactTelephone1": "888-758-4389",
        "AccessComments": "24 hours daily",
        "RelatedURL": "http://www.chargepoint.com/",
        "DistanceUnit": 0
    },
    "Connections": [
        {
            "ID": 66391,
            "ConnectionTypeID": 1,
            "LevelID": 2,
            "Amps": 16,
            "Voltage": 230,
            "PowerKW": 3,
            "CurrentTypeID": 10,
            "Quantity": 2
        }
    ],
    "DateLastStatusUpdate": "2019-04-06T04:02:00Z",
    "DataQualityLevel": 3,
    "DateCreated": "2015-09-20T11:18:00Z",
    "SubmissionStatusTypeID": 100
}