{
    "UserComments": [
        {
            "ID": 13752,
            "ChargePointID": 65201,
            "CommentTypeID": 10,
            "UserName": "Robert Malcolm Kay",
            "Comment": "Only space for one vehicle. Still free- vend, no card required.",
            "Rating": 3,
            "DateCreated": "2016-07-02T14:48:49.703Z",
            "User": {
                "ID": 4751,
                "Username": "Robert Malcolm Kay"
            },
            "CheckinStatusTypeID": 10
        },
        {
            "ID": 10371,
            "ChargePointID": 65201,
            "CommentTypeID": 10,
            "UserName": "Alan Brown",
            "Comment": "The unit is on \"free vend\". No rfid card required. ",
            "DateCreated": "2016-05-11T08:26:36.887Z",
            "User": {
                "ID": 2055,
                "Username": "Alan Brown"
            },
            "CheckinStatusTypeID": 210
        },
        {
            "ID": 10351,
            "ChargePointID": 65201,
            "CommentTypeID": 10,
            "UserName": "Alan Brown",
            "Comment": "Successful Tesla CHAdeMO charge @ 40kWh",
            "DateCreated": "2016-05-09T19:31:12.073Z",
            "User": {
                "ID": 2055,
                "Username": "Alan Brown"
            },
            "CheckinStatusTypeID": 10
        }
    ],
    "MediaItems": [
        {
            "ID": 6391,
            "ChargePointID": 65201,
            "ItemURL": "https://s3-ap-southeast-2.amazonaws.com/openchargemap/images/GB/OCM65201/OCM-65201.orig.2016050920262982.jpeg",
            "ItemThumbnailURL": "https://s3-ap-southeast-2.amazonaws.com/openchargemap/images/GB/OCM65201/OCM-65201.thmb.2016050920262982.jpeg",
            "Comment": "",
            "IsEnabled": true,
            "IsVideo": false,
            "IsFeaturedItem": false,
            "IsExternalResource": false,
            "User": {
                "ID": 2055,
                "Username": "Alan Brown"
            },
            "DateCreated": "2016-05-09T20:27:00Z"
        },
        {
            "ID": 6268,
            "ChargePointID": 65201,
            "ItemURL": "https://s3-ap-southeast-2.amazonaws.com/openchargemap/images/GB/OCM65201/OCM-65201.orig.2016041918095238.jpg",
            "ItemThumbnailURL": "https://s3-ap-southeast-2.amazonaws.com/openchargemap/images/GB/OCM65201/OCM-65201.thmb.2016041918095238.jpg",
            "Comment": "",
            "IsEnabled": true,
            "IsVideo": false,
            "IsFeaturedItem": false,
            "IsExternalResource": false,
            "User": {
                "ID": 1192,
                "Username": "Anon74856763534"
            },
            "DateCreated": "2016-04-19T18:10:00Z"
        }
    ],
    "IsRecentlyVerified": false,
    "ID": 65201,
    "UUID": "5674B11F-A1F9-4BF7-98BB-233DFCEA45A8",
    "DataProviderID": 1,
    "OperatorID": 3315,
    "OperatorsReference": "50221",
    "UsageTypeID": 4,
    "UsageCost": "Free",
    "AddressInfo": {
        "ID": 65547,
        "Title": "Ullapool Harbour",
        "AddressLine1": "The Pier",
        "AddressLine2": "Shore Street",
        "Town": "Ullapool",
        "StateOrProvince": "Ross-shire",
        "Postcode": "IV26 2UH",
        "CountryID": 1,
        "Latitude": 57.895175,
        "Longitude": -5.158542,
        "DistanceUnit": 0
    },
    "Connections": [
        {
            "ID": 89763,
            "ConnectionTypeID": 2,
            "StatusTypeID": 50,
            "LevelID": 3,
            "PowerKW": 50,
            "CurrentTypeID": 30,
            "Quantity": 1
        },
        {
            "ID": 89764,
            "ConnectionTypeID": 1036,
            "StatusTypeID": 50,
            "LevelID": 3,
            "Voltage": 400,
            "PowerKW": 43,
            "CurrentTypeID": 20,
            "Quantity": 1
        },
        {
            "ID": 123973,
            "ConnectionTypeID": 33,
            "StatusTypeID": 50,
            "LevelID": 3,
            "PowerKW": 50,
            "CurrentTypeID": 30,
            "Quantity": 1
        }
    ],
    "NumberOfPoints": 1,
    "StatusTypeID": 50,
    "DateLastStatusUpdate": "2019-10-03T05:13:00Z",
    "DataQualityLevel": 1,
    "DateCreated": "2016-04-19T18:00:00Z",
    "SubmissionStatusTypeID": 200
}