{
    "IsRecentlyVerified": false,
    "ID": 177236,
    "UUID": "9715E5AC-4DC5-446E-BD28-89CA09FB83D2",
    "DataProviderID": 29,
    "DataProvidersReference": "134",
    "OperatorID": 3369,
    "AddressInfo": {
        "ID": 177595,
        "Title": "Goldäcker 2",
        "AddressLine1": "Goldäcker 2",
        "Town": "Bleicherode",
        "Postcode": "99752",
        "CountryID": 87,
        "Latitude": 51.447,
        "Longitude": 10.57188,
        "DistanceUnit": 0
    },
    "Connections": [
        {
            "ID": 276149,
            "ConnectionTypeID": 33,
            "StatusTypeID": 50,
            "LevelID": 3,
            "PowerKW": 150,
            "CurrentTypeID": 30
        },
        {
            "ID": 276150,
            "ConnectionTypeID": 33,
            "StatusTypeID": 50,
            "LevelID": 3,
            "PowerKW": 50,
            "CurrentTypeID": 30
        },
        {
            "ID": 299410,
            "ConnectionTypeID": 1036,
            "StatusTypeID": 50,
            "LevelID": 2,
            "PowerKW": 22,
            "CurrentTypeID": 20
        },
        {
            "ID": 299411,
            "ConnectionTypeID": 25,
            "StatusTypeID": 50,
            "LevelID": 2,
            "PowerKW": 22,
            "CurrentTypeID": 20
        }
    ],
    "StatusTypeID": 0,
    "DateLastStatusUpdate": "2021-07-12T02:47:00Z",
    "MetadataValues": [
        {
            "ID": 9530,
            "MetadataFieldID": 4,
            "ItemValue": "Data from the German chargepoint registry provided by Bundesnetzagentur.de under the CC-BY 4.0 license"
        }
    ],
    "DataQualityLevel": 3,
    "DateCreated": "2021-07-08T09:48:00Z",
    "SubmissionStatusTypeID": 100
}