{
    "IsRecentlyVerified": false,
    "ID": 71017,
    "UUID": "C5944B44-E0CA-4FA0-A0A0-A9D5B71964B9",
    "DataProviderID": 1,
    "OperatorID": 3279,
    "UsageTypeID": 4,
    "AddressInfo": {
        "ID": 71363,
        "Title": "Fenie - Montilla",
        "AddressLine1": "N-331",
        "Town": "Montilla",
        "StateOrProvince": "Córdoba",
        "Postcode": "14550",
        "CountryID": 210,
        "Latitude": 37.5969179607151,
        "Longitude": -4.66701280971677,
        "DistanceUnit": 0
    },
    "Connections": [
        {
            "ID": 101758,
            "ConnectionTypeID": 25,
            "StatusTypeID": 50,
            "LevelID": 2,
            "Amps": 32,
            "Voltage": 400,
            "PowerKW": 22,
            "CurrentTypeID": 20,
            "Quantity": 1
        },
        {
            "ID": 101759,
            "ConnectionTypeID": 28,
            "StatusTypeID": 50,
            "LevelID": 2,
            "Amps": 16,
            "Voltage": 230,
            "PowerKW": 3.6,
            "CurrentTypeID": 10,
            "Quantity": 1
        }
    ],
    "NumberOfPoints": 2,
    "GeneralComments": "Fenie Energia card",
    "StatusTypeID": 100,
    "DateLastStatusUpdate": "2019-11-04T17:33:00Z",
    "DataQualityLevel": 1,
    "DateCreated": "2016-08-22T18:19:00Z",
    "SubmissionStatusTypeID": 200
}