{
    "IsRecentlyVerified": false,
    "ID": 149308,
    "UUID": "FC120850-A60D-45EB-A719-A1D5B9ECF878",
    "DataProviderID": 1,
    "DataProvidersReference": "ENT-00001",
    "OperatorID": 21,
    "UsageTypeID": 4,
    "UsageCost": "Mobi.E compatible card",
    "AddressInfo": {
        "ID": 149661,
        "Title": "ENT-00001",
        "AddressLine1": "Praça Mal. Carmona",
        "Town": "Entroncamento",
        "Postcode": "-",
        "CountryID": 180,
        "Latitude": 39.465486006791366,
        "Longitude": -8.467343539045487,
        "RelatedURL": "http://www.mobie.pt",
        "DistanceUnit": 0
    },
    "Connections": [
        {
            "ID": 207319,
            "ConnectionTypeID": 25,
            "StatusTypeID": 50,
            "LevelID": 2,
            "Amps": 32,
            "Voltage": 400,
            "PowerKW": 22,
            "CurrentTypeID": 20,
            "Quantity": 2
        }
    ],
    "NumberOfPoints": 2,
    "StatusTypeID": 50,
    "DateLastStatusUpdate": "2020-08-08T10:54:00Z",
    "DataQualityLevel": 3,
    "DateCreated": "2020-02-22T15:42:00Z",
    "SubmissionStatusTypeID": 100
}