{
    "IsRecentlyVerified": false,
    "ID": 108363,
    "UUID": "8A2167C8-9AA9-4A59-921D-49BE8AA976D5",
    "DataProviderID": 1,
    "OperatorID": 3253,
    "OperatorsReference": "AT*SMA*EIT1802011*001AC",
    "UsageTypeID": 1,
    "UsageCost": "€0,15/min ; Andere Tarife möglich",
    "AddressInfo": {
        "ID": 108709,
        "Title": "Ladestation Greenstorm Hotel Bad Moos",
        "AddressLine1": "Fischleintalstraße 27",
        "Town": "Sexten",
        "StateOrProvince": "Trentino-Südtirol",
        "Postcode": "39030",
        "CountryID": 112,
        "Latitude": 46.681286,
        "Longitude": 12.364324,
        "DistanceUnit": 0
    },
    "Connections": [
        {
            "ID": 153207,
            "ConnectionTypeID": 1036,
            "StatusTypeID": 50,
            "LevelID": 2,
            "Amps": 32,
            "Voltage": 400,
            "PowerKW": 22,
            "CurrentTypeID": 20,
            "Quantity": 1
        }
    ],
    "NumberOfPoints": 37,
    "StatusTypeID": 50,
    "DateLastStatusUpdate": "2019-06-12T19:21:00Z",
    "DataQualityLevel": 1,
    "DateCreated": "2018-09-25T05:39:00Z",
    "SubmissionStatusTypeID": 200
}