{
    "IsRecentlyVerified": false,
    "ID": 35120,
    "UUID": "0727F5C3-59D9-499C-8E39-223E733019F6",
    "DataProviderID": 26,
    "DataProvidersReference": "54869",
    "OperatorID": 180,
    "OperatorsReference": "Alfen RHL04062",
    "UsageCost": "0.00 jaarabonnement",
    "AddressInfo": {
        "ID": 35466,
        "Title": "Kerkmeesterstraat 4",
        "AddressLine1": "Kerkmeesterstraat 4",
        "Town": "Pijnacker-Nootdorp",
        "Postcode": "2645 MA",
        "CountryID": 159,
        "Latitude": 52.000897,
        "Longitude": 4.396916,
        "ContactTelephone1": "036 - 549 34 00",
        "RelatedURL": "http://www.icu-charging-stations.com/",
        "DistanceUnit": 0
    },
    "Connections": [
        {
            "ID": 38631,
            "ConnectionTypeID": 25,
            "LevelID": 2,
            "PowerKW": 11,
            "CurrentTypeID": 10
        },
        {
            "ID": 47722,
            "ConnectionTypeID": 25,
            "LevelID": 2,
            "PowerKW": 11,
            "CurrentTypeID": 10
        }
    ],
    "NumberOfPoints": 1,
    "StatusTypeID": 50,
    "DateLastStatusUpdate": "2016-06-04T02:43:00Z",
    "DataQualityLevel": 3,
    "DateCreated": "2015-01-09T06:04:00Z",
    "SubmissionStatusTypeID": 100
}