{
    "IsRecentlyVerified": false,
    "ID": 24159,
    "UUID": "BD55B5A4-EB0D-4088-96BF-4FE9394D2A1E",
    "DataProviderID": 1,
    "OperatorID": 1,
    "UsageTypeID": 0,
    "AddressInfo": {
        "ID": 24504,
        "Title": "Madoerastraat",
        "AddressLine1": "Madoerastraat 1",
        "AddressLine2": "Den Haag",
        "Town": "Den Haag",
        "StateOrProvince": "Stadsgewest Haaglanden",
        "Postcode": "2585VA",
        "CountryID": 159,
        "Latitude": 52.0916835,
        "Longitude": 4.30253379999999,
        "DistanceUnit": 0
    },
    "Connections": [],
    "NumberOfPoints": 1,
    "StatusTypeID": 50,
    "DateLastStatusUpdate": "2014-07-09T14:39:00Z",
    "DataQualityLevel": 1,
    "DateCreated": "2014-07-09T14:18:00Z",
    "SubmissionStatusTypeID": 200
}