{
    "IsRecentlyVerified": false,
    "ID": 175097,
    "UUID": "77BC3155-2B56-46D1-92EB-8AA46B15ACF3",
    "DataProviderID": 1,
    "OperatorID": 3299,
    "UsageTypeID": 1,
    "AddressInfo": {
        "ID": 175456,
        "Title": "IONITY Kill South",
        "AddressLine1": "Naas Road",
        "Town": "Naas",
        "StateOrProvince": "County Kildare",
        "Postcode": "W91 TP38",
        "CountryID": 3,
        "Latitude": 53.253234,
        "Longitude": -6.5698138,
        "DistanceUnit": 0
    },
    "Connections": [
        {
            "ID": 271355,
            "ConnectionTypeID": 33,
            "StatusTypeID": 50,
            "LevelID": 3,
            "PowerKW": 350,
            "CurrentTypeID": 30,
            "Quantity": 4
        }
    ],
    "NumberOfPoints": 4,
    "StatusTypeID": 50,
    "DateLastStatusUpdate": "2021-05-01T09:40:00Z",
    "DataQualityLevel": 1,
    "DateCreated": "2021-04-26T13:17:00Z",
    "SubmissionStatusTypeID": 200
}