{
    "IsRecentlyVerified": false,
    "ID": 152545,
    "UUID": "21B0BE5F-65B4-4440-AA6D-36FEE9AFC6CC",
    "DataProviderID": 28,
    "DataProvidersReference": "FR*S49*P49328*001",
    "UsageTypeID": 5,
    "AddressInfo": {
        "ID": 152898,
        "Title": "SAUMUR - Parking Rue Chumeau",
        "AddressLine1": "Parking Rue Chumeau 49400 SAUMUR",
        "CountryID": 80,
        "Latitude": 47.249435,
        "Longitude": -0.090757,
        "AccessComments": "24h/24 7j/7",
        "DistanceUnit": 0
    },
    "Connections": [
        {
            "ID": 213589,
            "ConnectionTypeID": 25,
            "StatusTypeID": 50,
            "LevelID": 2,
            "PowerKW": 18,
            "CurrentTypeID": 20
        },
        {
            "ID": 213590,
            "ConnectionTypeID": 28,
            "StatusTypeID": 50,
            "LevelID": 2,
            "PowerKW": 18,
            "CurrentTypeID": 10
        },
        {
            "ID": 246639,
            "ConnectionTypeID": 25,
            "StatusTypeID": 50,
            "LevelID": 2,
            "PowerKW": 18,
            "CurrentTypeID": 20
        },
        {
            "ID": 246640,
            "ConnectionTypeID": 28,
            "StatusTypeID": 50,
            "LevelID": 2,
            "PowerKW": 18,
            "CurrentTypeID": 10
        }
    ],
    "GeneralComments": "Recharge par badge et avec une application smartphone",
    "StatusTypeID": 50,
    "DateLastStatusUpdate": "2020-08-27T05:13:00Z",
    "DataQualityLevel": 2,
    "DateCreated": "2020-03-15T10:53:00Z",
    "SubmissionStatusTypeID": 100
}