{
    "IsRecentlyVerified": false,
    "ID": 71890,
    "UUID": "8EE7CDA2-5B79-4BAD-B5D5-379ACA8B3F33",
    "DataProviderID": 1,
    "OperatorID": 1,
    "UsageTypeID": 1,
    "UsageCost": "free",
    "AddressInfo": {
        "ID": 72236,
        "Title": "Göteborg energi",
        "AddressLine1": "Johan willins gata",
        "Town": "GÖTEBORG",
        "StateOrProvince": "Västra götaland",
        "Postcode": "416 64",
        "CountryID": 216,
        "Latitude": 57.7083642281228,
        "Longitude": 11.9915997272034,
        "DistanceUnit": 0
    },
    "Connections": [
        {
            "ID": 103006,
            "ConnectionTypeID": 2,
            "StatusTypeID": 100,
            "LevelID": 3,
            "Amps": 106,
            "Voltage": 400,
            "PowerKW": 48,
            "CurrentTypeID": 30,
            "Quantity": 1
        },
        {
            "ID": 103008,
            "ConnectionTypeID": 25,
            "StatusTypeID": 0,
            "LevelID": 2,
            "Voltage": 400,
            "CurrentTypeID": 20,
            "Quantity": 1
        }
    ],
    "NumberOfPoints": 1,
    "GeneralComments": "They will change the charger soon",
    "StatusTypeID": 100,
    "DateLastStatusUpdate": "2016-09-21T12:48:00Z",
    "DataQualityLevel": 1,
    "DateCreated": "2016-09-20T16:42:00Z",
    "SubmissionStatusTypeID": 200
}