{
    "IsRecentlyVerified": false,
    "ID": 158988,
    "UUID": "2ACB0884-6DA9-4F9D-845F-0852269F8B37",
    "DataProviderID": 2,
    "DataProvidersReference": "156062",
    "OperatorID": 5,
    "UsageTypeID": 1,
    "AddressInfo": {
        "ID": 159345,
        "Title": "THE SUMEREL",
        "AddressLine1": "325 Rocky Slope Rd",
        "Town": "Greenville",
        "StateOrProvince": "SC",
        "Postcode": "29607",
        "CountryID": 2,
        "Latitude": 34.8300108,
        "Longitude": -82.3306754,
        "ContactTelephone1": "888-758-4389",
        "AccessComments": "24 hours daily",
        "RelatedURL": "http://www.chargepoint.com/",
        "DistanceUnit": 0
    },
    "Connections": [
        {
            "ID": 229037,
            "ConnectionTypeID": 1,
            "LevelID": 2,
            "Amps": 16,
            "Voltage": 230,
            "PowerKW": 3.7,
            "CurrentTypeID": 10,
            "Quantity": 2
        }
    ],
    "StatusTypeID": 50,
    "DateLastStatusUpdate": "2020-06-26T02:57:00Z",
    "DataQualityLevel": 3,
    "DateCreated": "2020-06-26T02:57:00Z",
    "SubmissionStatusTypeID": 100
}