{
    "IsRecentlyVerified": false,
    "ID": 57952,
    "UUID": "FBFB6CF6-5472-416A-B723-F2A7D20278CA",
    "DataProviderID": 1,
    "OperatorID": 234,
    "UsageTypeID": 4,
    "UsageCost": "0",
    "AddressInfo": {
        "ID": 58298,
        "Title": "N-Ergie Ladesäule",
        "AddressLine1": "Königstorgraben 1 ",
        "AddressLine2": "",
        "Town": "Nürnberg",
        "StateOrProvince": "",
        "Postcode": "90402",
        "CountryID": 87,
        "Latitude": 49.44959009999999,
        "Longitude": 11.083475000000021,
        "ContactTelephone1": "",
        "ContactTelephone2": "",
        "ContactEmail": "",
        "AccessComments": "Rund um die Uhr (24/7) nutzbar. Nur von der Bahnhofstraße aus zu erreichen.",
        "RelatedURL": "",
        "DistanceUnit": 0
    },
    "Connections": [
        {
            "ID": 73697,
            "ConnectionTypeID": 28,
            "StatusTypeID": 50,
            "LevelID": 2,
            "Amps": 16,
            "Voltage": 230,
            "PowerKW": 3.7,
            "CurrentTypeID": 10,
            "Quantity": 2
        }
    ],
    "NumberOfPoints": 2,
    "GeneralComments": "",
    "StatusTypeID": 50,
    "DateLastStatusUpdate": "2016-04-19T08:17:00Z",
    "DataQualityLevel": 1,
    "DateCreated": "2015-12-29T14:08:00Z",
    "SubmissionStatusTypeID": 200
}