{
    "IsRecentlyVerified": false,
    "ID": 26038,
    "UUID": "859F69A9-73B1-4B16-B9F2-53881600D27E",
    "DataProviderID": 1,
    "OperatorID": 22,
    "OperatorsReference": "C5275",
    "AddressInfo": {
        "ID": 26384,
        "Title": "Market Street",
        "AddressLine1": "Cootehill",
        "Town": "Cavan",
        "StateOrProvince": "County Cavan",
        "CountryID": 3,
        "Latitude": 54.075084,
        "Longitude": -7.079692,
        "DistanceUnit": 0
    },
    "Connections": [
        {
            "ID": 28406,
            "ConnectionTypeID": 25,
            "StatusTypeID": 50,
            "LevelID": 2,
            "Amps": 32,
            "Voltage": 400,
            "PowerKW": 22,
            "CurrentTypeID": 20,
            "Quantity": 2
        }
    ],
    "NumberOfPoints": 2,
    "StatusTypeID": 50,
    "DateLastStatusUpdate": "2019-06-25T05:31:00Z",
    "DataQualityLevel": 2,
    "DateCreated": "2014-11-27T09:11:00Z",
    "SubmissionStatusTypeID": 100
}