{
    "IsRecentlyVerified": false,
    "ID": 153912,
    "UUID": "FBBC0262-AC0F-4CB6-B583-8222CA223888",
    "DataProviderID": 28,
    "DataProvidersReference": "FR*SOD*S*SMOY*63*2*_*_",
    "UsageTypeID": 5,
    "AddressInfo": {
        "ID": 154265,
        "Title": "MONTGERON",
        "AddressLine1": "AVENUE DE LA REPUBLIQUE",
        "CountryID": 80,
        "Latitude": 48.710751,
        "Longitude": 2.450222,
        "AccessComments": "24h/24",
        "DistanceUnit": 0
    },
    "Connections": [
        {
            "ID": 216203,
            "ConnectionTypeID": 1036,
            "StatusTypeID": 50,
            "LevelID": 2,
            "PowerKW": 22,
            "CurrentTypeID": 20
        },
        {
            "ID": 216204,
            "ConnectionTypeID": 28,
            "StatusTypeID": 50,
            "LevelID": 2,
            "PowerKW": 22,
            "CurrentTypeID": 10
        },
        {
            "ID": 250165,
            "ConnectionTypeID": 1036,
            "StatusTypeID": 50,
            "LevelID": 2,
            "PowerKW": 22,
            "CurrentTypeID": 20
        },
        {
            "ID": 250166,
            "ConnectionTypeID": 28,
            "StatusTypeID": 50,
            "LevelID": 2,
            "PowerKW": 22,
            "CurrentTypeID": 10
        },
        {
            "ID": 250167,
            "ConnectionTypeID": 1036,
            "StatusTypeID": 50,
            "LevelID": 2,
            "PowerKW": 22,
            "CurrentTypeID": 20
        },
        {
            "ID": 250168,
            "ConnectionTypeID": 28,
            "StatusTypeID": 50,
            "LevelID": 2,
            "PowerKW": 22,
            "CurrentTypeID": 10
        },
        {
            "ID": 250169,
            "ConnectionTypeID": 1036,
            "StatusTypeID": 50,
            "LevelID": 2,
            "PowerKW": 22,
            "CurrentTypeID": 20
        },
        {
            "ID": 250170,
            "ConnectionTypeID": 28,
            "StatusTypeID": 50,
            "LevelID": 2,
            "PowerKW": 22,
            "CurrentTypeID": 10
        }
    ],
    "GeneralComments": "RAS",
    "StatusTypeID": 50,
    "DateLastStatusUpdate": "2020-08-27T05:15:00Z",
    "DataQualityLevel": 2,
    "DateCreated": "2020-03-15T10:54:00Z",
    "SubmissionStatusTypeID": 100
}