{
    "IsRecentlyVerified": false,
    "ID": 155902,
    "UUID": "02F803A9-A090-465E-B492-457EB3AE8896",
    "DataProviderID": 1,
    "OperatorID": 187,
    "UsageTypeID": 1,
    "UsageCost": "Free",
    "AddressInfo": {
        "ID": 156256,
        "Title": "ELMŰ, Árkád Szeged",
        "AddressLine1": "Londoni körút 3. ",
        "Town": "Szeged",
        "Postcode": "6724",
        "CountryID": 104,
        "Latitude": 46.25475,
        "Longitude": 20.136529,
        "ContactTelephone1": "+36 012381818",
        "RelatedURL": "https://e-autozas.hu/",
        "DistanceUnit": 0
    },
    "Connections": [
        {
            "ID": 219471,
            "ConnectionTypeID": 25,
            "StatusTypeID": 50,
            "LevelID": 2,
            "Amps": 32,
            "Voltage": 400,
            "PowerKW": 22,
            "CurrentTypeID": 20,
            "Quantity": 2
        }
    ],
    "NumberOfPoints": 2,
    "GeneralComments": "HU A töltés inditáshoz előzetes regisztráció szükséges a www.e-autozas.hu oldalon, ezután az eCharge+ applikáción keresztül menedzselhető a töltés.\r\nGB For start the charging, prelimary registration is necessary at the www.e-autozas.hu website, after that the charging is manageable via eCharge+ application.",
    "StatusTypeID": 50,
    "DateLastStatusUpdate": "2020-04-27T18:19:00Z",
    "DataQualityLevel": 1,
    "DateCreated": "2020-04-27T11:52:00Z",
    "SubmissionStatusTypeID": 200
}