{
    "IsRecentlyVerified": false,
    "ID": 88287,
    "UUID": "59F528DE-7E49-4F75-8F3C-F3A0B92762C6",
    "DataProviderID": 1,
    "OperatorID": 23,
    "OperatorsReference": "29541",
    "UsageTypeID": 6,
    "AddressInfo": {
        "ID": 88633,
        "Title": "Comfort Inn International Drive",
        "AddressLine1": "8134 International DR",
        "Town": "Orlando",
        "StateOrProvince": "Florida",
        "Postcode": "32819",
        "CountryID": 2,
        "Latitude": 28.447889,
        "Longitude": -81.472972,
        "ContactTelephone1": "(407) 313-4000",
        "DistanceUnit": 0
    },
    "Connections": [
        {
            "ID": 125243,
            "ConnectionTypeID": 30,
            "StatusTypeID": 50,
            "LevelID": 2,
            "PowerKW": 8,
            "CurrentTypeID": 10,
            "Quantity": 1
        }
    ],
    "NumberOfPoints": 1,
    "GeneralComments": "1 Tesla Connector, up to 8kW.Available for patrons only. Please see front desk.",
    "StatusTypeID": 50,
    "DateLastStatusUpdate": "2017-06-09T14:46:00Z",
    "DataQualityLevel": 1,
    "DateCreated": "2017-05-26T08:46:00Z",
    "SubmissionStatusTypeID": 200
}