{
    "IsRecentlyVerified": false,
    "ID": 62556,
    "UUID": "80116275-A986-4875-82B0-66118D011DC5",
    "DataProviderID": 26,
    "DataProvidersReference": "22501",
    "OperatorID": 162,
    "OperatorsReference": "日産プリンス大分販売㈱日産レンタカー　大分空港店",
    "UsageCost": "0.00 onbekend",
    "AddressInfo": {
        "ID": 62902,
        "Title": "国道２１３号",
        "AddressLine1": "国道２１３号",
        "Town": "国東市",
        "Postcode": "",
        "CountryID": 114,
        "Latitude": 33.474857,
        "Longitude": 131.731201,
        "DistanceUnit": 0
    },
    "Connections": [
        {
            "ID": 79476,
            "ConnectionTypeID": 2,
            "LevelID": 3,
            "PowerKW": 50,
            "CurrentTypeID": 30
        }
    ],
    "NumberOfPoints": 1,
    "StatusTypeID": 50,
    "DateLastStatusUpdate": "2016-03-03T12:28:00Z",
    "DataQualityLevel": 3,
    "DateCreated": "2016-03-03T12:28:00Z",
    "SubmissionStatusTypeID": 100
}