{
    "UserComments": [
        {
            "ID": 22404,
            "ChargePointID": 155385,
            "CommentTypeID": 10,
            "UserName": "ForumElettrico.it",
            "Comment": "Chiamando il numero 041-5969024 viene l’addetto del centro commerciale ad abilitare la carica fino a 3,7 kW. Leggi la recensione https://www.forumelettrico.it/forum/colonnine-quick-centro-commerciale-valecenter-marcon-ve-t6764.html",
            "RelatedURL": "https://www.forumelettrico.it/forum/colonnine-quick-centro-commerciale-valecenter-marcon-ve-t6764.html",
            "DateCreated": "2020-04-09T06:57:07.36Z",
            "User": {
                "ID": 11749,
                "Username": "ForumElettrico.it"
            },
            "CheckinStatusTypeID": 10,
            "IsActionedByEditor": false
        }
    ],
    "MediaItems": [
        {
            "ID": 21880,
            "ChargePointID": 155385,
            "ItemURL": "https://s3-ap-southeast-2.amazonaws.com/openchargemap/images/IT/OCM155385/OCM-155385.orig.2020040906571932.jpg",
            "ItemThumbnailURL": "https://s3-ap-southeast-2.amazonaws.com/openchargemap/images/IT/OCM155385/OCM-155385.thmb.2020040906571932.jpg",
            "Comment": "",
            "IsEnabled": true,
            "IsVideo": false,
            "IsFeaturedItem": false,
            "IsExternalResource": false,
            "User": {
                "ID": 11749,
                "Username": "ForumElettrico.it"
            },
            "DateCreated": "2020-04-09T06:57:00Z"
        },
        {
            "ID": 21881,
            "ChargePointID": 155385,
            "ItemURL": "https://s3-ap-southeast-2.amazonaws.com/openchargemap/images/IT/OCM155385/OCM-155385.orig.2020040906572680.jpg",
            "ItemThumbnailURL": "https://s3-ap-southeast-2.amazonaws.com/openchargemap/images/IT/OCM155385/OCM-155385.thmb.2020040906572680.jpg",
            "Comment": "",
            "IsEnabled": true,
            "IsVideo": false,
            "IsFeaturedItem": false,
            "IsExternalResource": false,
            "User": {
                "ID": 11749,
                "Username": "ForumElettrico.it"
            },
            "DateCreated": "2020-04-09T06:57:00Z"
        }
    ],
    "IsRecentlyVerified": false,
    "ID": 155385,
    "UUID": "93D1629E-80EC-4048-AACF-B008C0C6A10E",
    "DataProviderID": 1,
    "OperatorID": 1,
    "UsageTypeID": 1,
    "AddressInfo": {
        "ID": 155739,
        "Title": "Valecenter Gaggio",
        "AddressLine1": "Via Enrico Mattei 1/C",
        "Town": "Marcon",
        "StateOrProvince": "VE",
        "CountryID": 112,
        "Latitude": 45.5443903,
        "Longitude": 12.305517,
        "RelatedURL": "https://www.forumelettrico.it/forum/colonnine-quick-centro-commerciale-valecenter-marcon-ve-t6764.html",
        "DistanceUnit": 0
    },
    "Connections": [
        {
            "ID": 218768,
            "ConnectionTypeID": 25,
            "LevelID": 2,
            "PowerKW": 3,
            "Quantity": 2
        },
        {
            "ID": 218769,
            "ConnectionTypeID": 13,
            "Quantity": 2
        }
    ],
    "NumberOfPoints": 2,
    "StatusTypeID": 50,
    "DateLastStatusUpdate": "2020-04-09T06:57:00Z",
    "DataQualityLevel": 1,
    "DateCreated": "2020-04-09T06:44:00Z",
    "SubmissionStatusTypeID": 200
}