{
    "IsRecentlyVerified": false,
    "ID": 103724,
    "UUID": "DC1EC3C7-E743-4217-B688-6CF0B39BA76D",
    "DataProviderID": 1,
    "OperatorID": 23,
    "OperatorsReference": "42679",
    "UsageTypeID": 4,
    "AddressInfo": {
        "ID": 104070,
        "Title": "Grand Parc du Puy du Fou",
        "AddressLine1": "Le Puy du Fou",
        "Town": "Les Epesses",
        "Postcode": "85590",
        "CountryID": 80,
        "Latitude": 46.89375,
        "Longitude": -0.931264,
        "ContactTelephone1": "+33 8 20 09 10 10",
        "DistanceUnit": 0
    },
    "Connections": [
        {
            "ID": 146394,
            "ConnectionTypeID": 30,
            "StatusTypeID": 50,
            "LevelID": 2,
            "Amps": 16,
            "Voltage": 400,
            "PowerKW": 11,
            "CurrentTypeID": 20,
            "Quantity": 2
        }
    ],
    "NumberOfPoints": 2,
    "GeneralComments": "2 Tesla Connectors, up to 11kW.Available for customers. Self park.",
    "StatusTypeID": 50,
    "DateLastStatusUpdate": "2018-10-03T17:47:00Z",
    "DataQualityLevel": 1,
    "DateCreated": "2018-05-05T05:59:00Z",
    "SubmissionStatusTypeID": 200
}