{
    "IsRecentlyVerified": false,
    "ID": 124458,
    "UUID": "86CECF5E-F6FA-4BC4-B074-D7DDBCD708D7",
    "DataProviderID": 2,
    "DataProvidersReference": "63199",
    "OperatorID": 5,
    "UsageTypeID": 1,
    "AddressInfo": {
        "ID": 124804,
        "Title": "SNG-18",
        "AddressLine1": "500 R St",
        "Town": "Sacramento",
        "StateOrProvince": "CA",
        "Postcode": "95811",
        "CountryID": 2,
        "Latitude": 38.572757,
        "Longitude": -121.503397,
        "ContactTelephone1": "888-758-4389",
        "AccessComments": "24 hours daily",
        "RelatedURL": "http://www.chargepoint.com/",
        "DistanceUnit": 0
    },
    "Connections": [
        {
            "ID": 174559,
            "ConnectionTypeID": 1,
            "LevelID": 2,
            "Amps": 16,
            "Voltage": 230,
            "PowerKW": 3,
            "CurrentTypeID": 10,
            "Quantity": 7
        }
    ],
    "DateLastStatusUpdate": "2019-12-24T09:14:00Z",
    "DataQualityLevel": 3,
    "DateCreated": "2019-04-06T05:03:00Z",
    "SubmissionStatusTypeID": 100
}