{
    "IsRecentlyVerified": false,
    "ID": 54543,
    "UUID": "1232E7C9-A11C-46AF-AF29-EE3D0EB9E299",
    "DataProviderID": 1,
    "OperatorID": 1,
    "UsageTypeID": 6,
    "AddressInfo": {
        "ID": 54889,
        "Title": " Gasthof Weisses Kreuz - Oberwirt ",
        "AddressLine1": "Via Peter-Anich 5",
        "Town": "Collepietra ",
        "StateOrProvince": "Bolzano",
        "Postcode": "39050",
        "CountryID": 112,
        "Latitude": 46.484069257070054,
        "Longitude": 11.457155522884367,
        "ContactTelephone1": "+39 0471 376 525",
        "ContactEmail": "info@gasthofoberwirt.com",
        "RelatedURL": "http://www.gasthofoberwirt.com/",
        "DistanceUnit": 0
    },
    "Connections": [
        {
            "ID": 68832,
            "ConnectionTypeID": 0,
            "StatusTypeID": 50,
            "LevelID": 2,
            "CurrentTypeID": 10,
            "Quantity": 1
        }
    ],
    "NumberOfPoints": 1,
    "StatusTypeID": 50,
    "DateLastStatusUpdate": "2015-10-07T17:36:00Z",
    "DataQualityLevel": 1,
    "DateCreated": "2015-10-07T17:36:00Z",
    "SubmissionStatusTypeID": 200
}