{
    "IsRecentlyVerified": false,
    "ID": 28115,
    "UUID": "B8CB7DD1-1C1D-4E0C-A9F5-92B295DFCFB9",
    "DataProviderID": 2,
    "DataProvidersReference": "52269",
    "UsageTypeID": 1,
    "AddressInfo": {
        "ID": 28461,
        "Title": "Mountain View Solar",
        "AddressLine1": "1500 Valley Rd",
        "Town": "Berkeley Springs",
        "StateOrProvince": "WV",
        "Postcode": "25411",
        "CountryID": 2,
        "Latitude": 39.608723,
        "Longitude": -78.237145,
        "ContactTelephone1": "304-258-4733",
        "AccessComments": "8am-5pm daily",
        "RelatedURL": "",
        "DistanceUnit": 0
    },
    "Connections": [
        {
            "ID": 30898,
            "ConnectionTypeID": 1,
            "LevelID": 2,
            "Amps": 16,
            "Voltage": 230,
            "PowerKW": 3,
            "CurrentTypeID": 10,
            "Quantity": 2
        }
    ],
    "DateLastStatusUpdate": "2019-04-06T04:03:00Z",
    "DataQualityLevel": 3,
    "DateCreated": "2014-11-28T03:38:00Z",
    "SubmissionStatusTypeID": 100
}