{
    "IsRecentlyVerified": false,
    "ID": 45953,
    "UUID": "ABABF290-1007-4309-82A0-2FF044BE0FE5",
    "DataProviderID": 1,
    "DataProvidersReference": "2417",
    "AddressInfo": {
        "ID": 46299,
        "Title": "Danderyds sjukhus",
        "AddressLine1": "Mörbygårdsvägen 5",
        "Town": "DANDERYD",
        "StateOrProvince": "STOCKHOLM",
        "Postcode": "18257",
        "CountryID": 216,
        "Latitude": 59.39241,
        "Longitude": 18.03943,
        "AccessComments": "",
        "DistanceUnit": 0
    },
    "Connections": [
        {
            "ID": 56616,
            "ConnectionTypeID": 0,
            "Reference": "1",
            "LevelID": 2,
            "Amps": 32,
            "Voltage": 400,
            "PowerKW": 22,
            "Comments": "Mode 3"
        },
        {
            "ID": 84746,
            "ConnectionTypeID": 0,
            "Reference": "2",
            "LevelID": 2,
            "Amps": 32,
            "Voltage": 400,
            "PowerKW": 22,
            "Comments": "Mode 3"
        },
        {
            "ID": 84747,
            "ConnectionTypeID": 0,
            "Reference": "3",
            "LevelID": 2,
            "Amps": 16,
            "Voltage": 230,
            "PowerKW": 3.7,
            "Comments": "Mode 3"
        },
        {
            "ID": 88266,
            "ConnectionTypeID": 0,
            "Reference": "4",
            "LevelID": 2,
            "Amps": 16,
            "Voltage": 230,
            "PowerKW": 3.7,
            "Comments": "Mode 3"
        }
    ],
    "NumberOfPoints": 4,
    "DateLastStatusUpdate": "2020-05-26T08:22:00Z",
    "DataQualityLevel": 2,
    "DateCreated": "2015-05-03T00:54:00Z",
    "SubmissionStatusTypeID": 100
}