{
    "IsRecentlyVerified": false,
    "ID": 185324,
    "UUID": "45490595-A348-44AC-A8DC-E8A4EE169F4C",
    "DataProviderID": 29,
    "DataProvidersReference": "2564",
    "AddressInfo": {
        "ID": 185683,
        "Title": "Bahnhofstraße",
        "AddressLine1": "Bahnhofstraße",
        "Town": "Greven",
        "Postcode": "48268",
        "CountryID": 87,
        "Latitude": 52.12946,
        "Longitude": 7.551433,
        "DistanceUnit": 0
    },
    "Connections": [
        {
            "ID": 294676,
            "ConnectionTypeID": 25,
            "StatusTypeID": 50,
            "LevelID": 2,
            "PowerKW": 22,
            "CurrentTypeID": 20
        },
        {
            "ID": 300205,
            "ConnectionTypeID": 25,
            "StatusTypeID": 50,
            "LevelID": 2,
            "PowerKW": 22,
            "CurrentTypeID": 20
        }
    ],
    "StatusTypeID": 50,
    "DateLastStatusUpdate": "2021-07-12T02:49:00Z",
    "MetadataValues": [
        {
            "ID": 17615,
            "MetadataFieldID": 4,
            "ItemValue": "Data from the German chargepoint registry provided by Bundesnetzagentur.de under the CC-BY 4.0 license"
        }
    ],
    "DataQualityLevel": 3,
    "DateCreated": "2021-07-08T10:06:00Z",
    "SubmissionStatusTypeID": 100
}