{
    "IsRecentlyVerified": false,
    "ID": 177792,
    "UUID": "2E0A7E2C-0C8E-4199-B749-FACF728748B3",
    "DataProviderID": 29,
    "DataProvidersReference": "5972",
    "OperatorID": 3423,
    "AddressInfo": {
        "ID": 178151,
        "Title": "Obere Dorfstr. 15",
        "AddressLine1": "Obere Dorfstr. 15",
        "Town": "Boffzen",
        "Postcode": "37691",
        "CountryID": 87,
        "Latitude": 51.74713,
        "Longitude": 9.38615,
        "DistanceUnit": 0
    },
    "Connections": [
        {
            "ID": 277369,
            "ConnectionTypeID": 25,
            "StatusTypeID": 50,
            "LevelID": 2,
            "PowerKW": 22,
            "CurrentTypeID": 20
        },
        {
            "ID": 277370,
            "ConnectionTypeID": 25,
            "StatusTypeID": 50,
            "LevelID": 2,
            "PowerKW": 22,
            "CurrentTypeID": 20
        }
    ],
    "StatusTypeID": 0,
    "DateLastStatusUpdate": "2021-07-12T02:48:00Z",
    "MetadataValues": [
        {
            "ID": 10086,
            "MetadataFieldID": 4,
            "ItemValue": "Data from the German chargepoint registry provided by Bundesnetzagentur.de under the CC-BY 4.0 license"
        }
    ],
    "DataQualityLevel": 3,
    "DateCreated": "2021-07-08T09:49:00Z",
    "SubmissionStatusTypeID": 100
}