{
    "IsRecentlyVerified": false,
    "ID": 159220,
    "UUID": "DA4BC7F2-97D9-4C5B-932F-CFB201A7FD3E",
    "DataProviderID": 2,
    "DataProvidersReference": "155990",
    "UsageTypeID": 1,
    "AddressInfo": {
        "ID": 159577,
        "Title": "Love's Travel Stop",
        "AddressLine1": "1553 W Colony Rd",
        "Town": "Ripon",
        "StateOrProvince": "CA",
        "Postcode": "95366",
        "CountryID": 2,
        "Latitude": 37.754649,
        "Longitude": -121.141004,
        "ContactTelephone1": "209-599-0740",
        "AccessComments": "24 hours daily",
        "RelatedURL": "",
        "DistanceUnit": 0
    },
    "Connections": [
        {
            "ID": 229345,
            "ConnectionTypeID": 1,
            "LevelID": 2,
            "Amps": 16,
            "Voltage": 230,
            "PowerKW": 3.7,
            "CurrentTypeID": 10,
            "Quantity": 2
        },
        {
            "ID": 229346,
            "ConnectionTypeID": 2,
            "LevelID": 3,
            "Amps": 100,
            "Voltage": 400,
            "PowerKW": 40,
            "CurrentTypeID": 30,
            "Quantity": 1
        },
        {
            "ID": 229347,
            "ConnectionTypeID": 32,
            "LevelID": 3,
            "Amps": 100,
            "Voltage": 400,
            "PowerKW": 40,
            "CurrentTypeID": 30,
            "Quantity": 1
        }
    ],
    "StatusTypeID": 50,
    "DateLastStatusUpdate": "2020-06-26T02:59:00Z",
    "DataQualityLevel": 3,
    "DateCreated": "2020-06-26T02:59:00Z",
    "SubmissionStatusTypeID": 100
}