{
    "IsRecentlyVerified": false,
    "ID": 157912,
    "UUID": "0C882249-594B-48F3-9421-AD0F2D5815CE",
    "DataProviderID": 1,
    "OperatorID": 203,
    "UsageTypeID": 5,
    "AddressInfo": {
        "ID": 158266,
        "Title": "Nantgarw Rd",
        "AddressLine1": "Nantgarw Rd",
        "Town": "Caerphilly",
        "Postcode": "CF83 2AX",
        "CountryID": 1,
        "Latitude": 51.57125,
        "Longitude": -3.24406,
        "AccessComments": "",
        "RelatedURL": "http://engenie.co.uk/",
        "DistanceUnit": 0
    },
    "Connections": [
        {
            "ID": 227576,
            "ConnectionTypeID": 25,
            "Reference": "ENG00231-3",
            "StatusTypeID": 50,
            "LevelID": 2,
            "Amps": 32,
            "Voltage": 400,
            "PowerKW": 22,
            "CurrentTypeID": 20,
            "Quantity": 1
        },
        {
            "ID": 227577,
            "ConnectionTypeID": 2,
            "Reference": "ENG00231-2",
            "StatusTypeID": 50,
            "LevelID": 3,
            "Amps": 125,
            "Voltage": 400,
            "PowerKW": 50,
            "CurrentTypeID": 30,
            "Quantity": 1
        },
        {
            "ID": 227578,
            "ConnectionTypeID": 33,
            "Reference": "ENG00231-1",
            "StatusTypeID": 50,
            "LevelID": 3,
            "Amps": 125,
            "Voltage": 400,
            "PowerKW": 50,
            "CurrentTypeID": 30,
            "Quantity": 1
        }
    ],
    "StatusTypeID": 50,
    "DateLastStatusUpdate": "2020-10-08T02:03:00Z",
    "MetadataValues": [
        {
            "ID": 7445,
            "MetadataFieldID": 4,
            "ItemValue": "Contains public sector information licensed under the Open Government Licence v2.0. http://www.nationalarchives.gov.uk/doc/open-government-licence/version/2/"
        }
    ],
    "DataQualityLevel": 3,
    "DateCreated": "2020-06-25T10:00:00Z",
    "SubmissionStatusTypeID": 100
}