{
    "IsRecentlyVerified": false,
    "ID": 29697,
    "UUID": "ED34614A-797D-41B6-BC43-68B72BBD7DF0",
    "DataProviderID": 15,
    "DataProvidersReference": "5535",
    "OperatorID": 26,
    "AddressInfo": {
        "ID": 30043,
        "Title": "2700 Parr Ave",
        "AddressLine1": "2700 Parr Ave",
        "Town": "Dyersburg",
        "StateOrProvince": "TN",
        "Postcode": "38024",
        "CountryID": 2,
        "Latitude": 36.05921,
        "Longitude": -89.38059,
        "ContactTelephone1": " (731) 285-6294",
        "RelatedURL": "http://carstations.com/5535",
        "DistanceUnit": 0
    },
    "Connections": [
        {
            "ID": 32682,
            "ConnectionTypeID": 1,
            "Reference": "J1772",
            "LevelID": 2
        }
    ],
    "StatusTypeID": 0,
    "DateLastStatusUpdate": "2017-11-04T14:04:00Z",
    "DataQualityLevel": 2,
    "DateCreated": "2014-11-29T05:39:00Z",
    "SubmissionStatusTypeID": 100
}