{
    "IsRecentlyVerified": false,
    "ID": 145838,
    "UUID": "80753B70-0144-47A1-81F7-7352C2B8C6AD",
    "DataProviderID": 2,
    "DataProvidersReference": "125295",
    "OperatorID": 5,
    "UsageTypeID": 1,
    "AddressInfo": {
        "ID": 146190,
        "Title": "HI JASPER",
        "AddressLine1": "708 Sleepy Hollow Road",
        "Town": "Jasper",
        "StateOrProvince": "AB",
        "Postcode": "T0E 1E0",
        "CountryID": 44,
        "Latitude": 52.870766,
        "Longitude": -118.08184,
        "ContactTelephone1": "888-758-4389",
        "AccessComments": "24 hours daily",
        "RelatedURL": "http://www.chargepoint.com/",
        "DistanceUnit": 0
    },
    "Connections": [
        {
            "ID": 202609,
            "ConnectionTypeID": 1,
            "LevelID": 2,
            "Amps": 16,
            "Voltage": 230,
            "PowerKW": 3.7,
            "CurrentTypeID": 10,
            "Quantity": 2
        }
    ],
    "StatusTypeID": 50,
    "DateLastStatusUpdate": "2020-06-26T03:12:00Z",
    "DataQualityLevel": 3,
    "DateCreated": "2019-12-24T09:25:00Z",
    "SubmissionStatusTypeID": 100
}