{
    "IsRecentlyVerified": false,
    "ID": 123868,
    "UUID": "DEEBDC4A-E246-41CA-A274-B78B1FC61B7C",
    "DataProviderID": 1,
    "OperatorID": 5,
    "UsageTypeID": 1,
    "AddressInfo": {
        "ID": 124214,
        "Title": "VISITOR CENTER",
        "AddressLine1": "642-698 Berry Ct",
        "Town": "Mountain View",
        "StateOrProvince": "CA",
        "Postcode": "94043",
        "CountryID": 2,
        "Latitude": 37.40919007208544,
        "Longitude": -122.06326272549865,
        "ContactTelephone1": "888-758-4389",
        "AccessComments": "24 hours daily",
        "RelatedURL": "http://www.chargepoint.com/",
        "DistanceUnit": 0
    },
    "Connections": [
        {
            "ID": 173899,
            "ConnectionTypeID": 2,
            "LevelID": 3,
            "Amps": 100,
            "Voltage": 400,
            "PowerKW": 40,
            "CurrentTypeID": 30,
            "Quantity": 8
        },
        {
            "ID": 173900,
            "ConnectionTypeID": 32,
            "LevelID": 3,
            "Amps": 100,
            "Voltage": 400,
            "PowerKW": 40,
            "CurrentTypeID": 30,
            "Quantity": 8
        }
    ],
    "StatusTypeID": 0,
    "DateLastStatusUpdate": "2019-08-11T15:28:00Z",
    "DataQualityLevel": 3,
    "DateCreated": "2019-04-06T05:03:00Z",
    "SubmissionStatusTypeID": 100
}