{
    "IsRecentlyVerified": true,
    "DateLastVerified": "2021-09-12T10:30:00Z",
    "ID": 189190,
    "UUID": "BBAB6AAE-16AC-4D71-B89C-C7EDEACFCA21",
    "DataProviderID": 1,
    "OperatorID": 103,
    "UsageTypeID": 4,
    "UsageCost": "€0,37/kWh",
    "AddressInfo": {
        "ID": 189549,
        "Title": "Kagerdreef 90",
        "AddressLine1": "Kagerdreef 90",
        "Town": "Teylingen",
        "StateOrProvince": "South Holland",
        "Postcode": "2172HM",
        "CountryID": 159,
        "Latitude": 52.2209165058091,
        "Longitude": 4.531349788212651,
        "DistanceUnit": 0
    },
    "Connections": [
        {
            "ID": 305875,
            "ConnectionTypeID": 25,
            "Reference": "NLALLEGO011633",
            "StatusTypeID": 50,
            "LevelID": 2,
            "Amps": 16,
            "Voltage": 400,
            "PowerKW": 11,
            "CurrentTypeID": 20,
            "Quantity": 2
        }
    ],
    "NumberOfPoints": 2,
    "StatusTypeID": 50,
    "DateLastStatusUpdate": "2021-09-13T14:03:00Z",
    "DataQualityLevel": 1,
    "DateCreated": "2021-09-12T10:30:00Z",
    "SubmissionStatusTypeID": 200
}