{
    "IsRecentlyVerified": false,
    "ID": 156891,
    "UUID": "B0C57609-B5FF-4CE7-A8FE-03D38B957923",
    "DataProviderID": 19,
    "DataProvidersReference": "6439",
    "AddressInfo": {
        "ID": 157245,
        "Title": "Orrholmsplan",
        "AddressLine1": "Babordsgatan 1",
        "Town": "KARLSTAD",
        "StateOrProvince": "VÄRMLAND",
        "Postcode": "65227",
        "CountryID": 216,
        "Latitude": 59.36874,
        "Longitude": 13.4988,
        "AccessComments": "",
        "DistanceUnit": 0
    },
    "Connections": [
        {
            "ID": 222863,
            "ConnectionTypeID": 25,
            "Reference": "1",
            "LevelID": 2,
            "Amps": 16,
            "Voltage": 400,
            "PowerKW": 11,
            "CurrentTypeID": 20
        },
        {
            "ID": 222864,
            "ConnectionTypeID": 25,
            "Reference": "2",
            "LevelID": 2,
            "Amps": 16,
            "Voltage": 400,
            "PowerKW": 11,
            "CurrentTypeID": 20
        },
        {
            "ID": 222865,
            "ConnectionTypeID": 25,
            "Reference": "3",
            "LevelID": 2,
            "Amps": 16,
            "Voltage": 400,
            "PowerKW": 11,
            "CurrentTypeID": 20
        },
        {
            "ID": 222866,
            "ConnectionTypeID": 25,
            "Reference": "4",
            "LevelID": 2,
            "Amps": 16,
            "Voltage": 400,
            "PowerKW": 11,
            "CurrentTypeID": 20
        }
    ],
    "NumberOfPoints": 4,
    "StatusTypeID": 0,
    "DateLastStatusUpdate": "2021-03-24T05:11:00Z",
    "DataQualityLevel": 2,
    "DateCreated": "2020-05-26T08:22:00Z",
    "SubmissionStatusTypeID": 100
}