{
    "IsRecentlyVerified": false,
    "ID": 50931,
    "UUID": "B7BF5F9A-9C49-45A9-B3F0-77982112C6C8",
    "DataProviderID": 26,
    "DataProvidersReference": "65105",
    "OperatorID": 157,
    "OperatorsReference": "NewMotion 04000053",
    "UsageCost": "0.00 jaarabonnement",
    "AddressInfo": {
        "ID": 51277,
        "Title": "Maagdenburgstraat 26",
        "AddressLine1": "Maagdenburgstraat 26",
        "Town": "Deventer",
        "Postcode": "7421 ZC",
        "CountryID": 159,
        "Latitude": 52.2388708296583,
        "Longitude": 6.22011003243256,
        "ContactTelephone1": "088 0109500",
        "RelatedURL": "http://thenewmotion.nl/",
        "DistanceUnit": 0
    },
    "Connections": [
        {
            "ID": 62912,
            "ConnectionTypeID": 25,
            "LevelID": 2,
            "PowerKW": 22,
            "CurrentTypeID": 10
        }
    ],
    "NumberOfPoints": 1,
    "StatusTypeID": 50,
    "DateLastStatusUpdate": "2016-06-04T02:52:00Z",
    "DataQualityLevel": 3,
    "DateCreated": "2015-07-22T09:54:00Z",
    "SubmissionStatusTypeID": 100
}