{
    "IsRecentlyVerified": false,
    "ID": 4981,
    "UUID": "B29C2C2C-4D65-4D38-B70E-53D036A5DCE0",
    "DataProviderID": 2,
    "DataProvidersReference": "40026",
    "UsageTypeID": 7,
    "AddressInfo": {
        "ID": 4921,
        "Title": "Criswell Nissan",
        "AddressLine1": "19574 Amaranth Dr",
        "Town": "Germantown",
        "StateOrProvince": "MD",
        "Postcode": "20874",
        "CountryID": 2,
        "Latitude": 39.177414,
        "Longitude": -77.249773,
        "ContactTelephone1": "301-670-3900",
        "AccessComments": "Dealership business hours",
        "RelatedURL": "",
        "DistanceUnit": 0
    },
    "Connections": [
        {
            "ID": 16021,
            "ConnectionTypeID": 1,
            "LevelID": 2,
            "Amps": 16,
            "Voltage": 230,
            "PowerKW": 3,
            "CurrentTypeID": 10,
            "Quantity": 1
        },
        {
            "ID": 20997,
            "ConnectionTypeID": 1,
            "LevelID": 2,
            "Quantity": 1
        }
    ],
    "DateLastConfirmed": "2011-05-31T00:00:00Z",
    "StatusTypeID": 0,
    "DateLastStatusUpdate": "2019-04-06T04:03:00Z",
    "DataQualityLevel": 1,
    "DateCreated": "2011-07-04T18:02:00Z",
    "SubmissionStatusTypeID": 100
}