{
    "IsRecentlyVerified": false,
    "ID": 138610,
    "UUID": "6590C898-000D-40B9-9217-90C254D9A2DE",
    "DataProviderID": 2,
    "DataProvidersReference": "117142",
    "OperatorID": 9,
    "UsageTypeID": 1,
    "AddressInfo": {
        "ID": 138959,
        "Title": "City of Imperial Beach",
        "AddressLine1": "105 Palm Ave",
        "Town": "Imperial Beach",
        "StateOrProvince": "CA",
        "Postcode": "91932",
        "CountryID": 2,
        "Latitude": 32.58353,
        "Longitude": -117.131493,
        "ContactTelephone1": "888-998-2546",
        "AccessComments": "MON: 24 hours | TUE: 24 hours | WED: 24 hours | THU: 24 hours | FRI: 24 hours | SAT: 24 hours | SUN: 24 hours",
        "RelatedURL": "http://www.blinkcharging.com/",
        "DistanceUnit": 0
    },
    "Connections": [
        {
            "ID": 193762,
            "ConnectionTypeID": 1,
            "LevelID": 2,
            "Amps": 16,
            "Voltage": 230,
            "PowerKW": 3.7,
            "CurrentTypeID": 10,
            "Quantity": 1
        }
    ],
    "StatusTypeID": 50,
    "DateLastStatusUpdate": "2020-06-26T02:54:00Z",
    "DataQualityLevel": 3,
    "DateCreated": "2019-12-24T09:09:00Z",
    "SubmissionStatusTypeID": 100
}