{
    "UserComments": [
        {
            "ID": 24792,
            "ChargePointID": 128808,
            "CommentTypeID": 10,
            "UserName": "ForumElettrico.it",
            "Comment": "Al momento si ricarica gratuitamente con Enel X. Leggi la recensione completa qui: https://www.forumelettrico.it/forum/enel-fast-pan-barletta-via-barberini-t6064.html",
            "RelatedURL": "https://www.forumelettrico.it/forum/enel-fast-pan-barletta-via-barberini-t6064.html",
            "DateCreated": "2021-08-30T05:38:52.49Z",
            "User": {
                "ID": 11749,
                "Username": "ForumElettrico.it"
            },
            "CheckinStatusTypeID": 10,
            "IsActionedByEditor": false
        },
        {
            "ID": 21681,
            "ChargePointID": 128808,
            "CommentTypeID": 1000,
            "UserName": "Teschla",
            "Comment": "",
            "Rating": 1,
            "DateCreated": "2019-10-18T21:29:27.117Z",
            "User": {
                "ID": 22764,
                "Username": "Teschla"
            },
            "CheckinStatusTypeID": 20
        }
    ],
    "MediaItems": [
        {
            "ID": 29155,
            "ChargePointID": 128808,
            "ItemURL": "https://s3-ap-southeast-2.amazonaws.com/openchargemap/images/IT/OCM128808/OCM-128808.orig.2021083005390121.jpg",
            "ItemThumbnailURL": "https://s3-ap-southeast-2.amazonaws.com/openchargemap/images/IT/OCM128808/OCM-128808.thmb.2021083005390121.jpg",
            "Comment": "",
            "IsEnabled": true,
            "IsVideo": false,
            "IsFeaturedItem": false,
            "IsExternalResource": false,
            "User": {
                "ID": 11749,
                "Username": "ForumElettrico.it"
            },
            "DateCreated": "2021-08-30T05:39:00Z"
        }
    ],
    "IsRecentlyVerified": false,
    "ID": 128808,
    "UUID": "2C4CDF3B-4627-4140-9825-CB4354DF1668",
    "DataProviderID": 1,
    "OperatorID": 80,
    "UsageTypeID": 4,
    "UsageCost": "0,50 €/kWh",
    "AddressInfo": {
        "ID": 129154,
        "Title": "Enel PAN Barletta ADS ERG",
        "AddressLine1": "Via Matteo Barberini",
        "Town": "Barletta",
        "StateOrProvince": "BT",
        "Postcode": "76121",
        "CountryID": 112,
        "Latitude": 41.3032040687935,
        "Longitude": 16.2696310188957,
        "RelatedURL": "https://www.enelx.com/it/it/emobility",
        "DistanceUnit": 0
    },
    "Connections": [
        {
            "ID": 180214,
            "ConnectionTypeID": 33,
            "StatusTypeID": 50,
            "LevelID": 3,
            "Amps": 120,
            "Voltage": 500,
            "PowerKW": 50,
            "CurrentTypeID": 30,
            "Quantity": 1
        },
        {
            "ID": 180215,
            "ConnectionTypeID": 2,
            "StatusTypeID": 50,
            "LevelID": 3,
            "Amps": 120,
            "Voltage": 500,
            "PowerKW": 50,
            "CurrentTypeID": 30,
            "Quantity": 1
        },
        {
            "ID": 180216,
            "ConnectionTypeID": 1036,
            "StatusTypeID": 50,
            "LevelID": 3,
            "Amps": 64,
            "Voltage": 400,
            "PowerKW": 43,
            "CurrentTypeID": 20,
            "Quantity": 1
        },
        {
            "ID": 180217,
            "ConnectionTypeID": 25,
            "StatusTypeID": 50,
            "LevelID": 2,
            "Amps": 32,
            "Voltage": 400,
            "PowerKW": 22,
            "CurrentTypeID": 20,
            "Quantity": 1
        }
    ],
    "NumberOfPoints": 2,
    "StatusTypeID": 30,
    "DateLastStatusUpdate": "2021-08-30T05:39:00Z",
    "DataQualityLevel": 1,
    "DateCreated": "2019-06-28T10:29:00Z",
    "SubmissionStatusTypeID": 200
}