{
    "IsRecentlyVerified": false,
    "ID": 144733,
    "UUID": "55288CBE-378C-4976-84D9-6FB2ADA07662",
    "DataProviderID": 2,
    "DataProvidersReference": "88141",
    "UsageTypeID": 2,
    "AddressInfo": {
        "ID": 145085,
        "Title": "Hammond Bay State Harbor",
        "AddressLine1": "24025 US-23",
        "Town": "Millersburg",
        "StateOrProvince": "MI",
        "Postcode": "49759",
        "CountryID": 2,
        "Latitude": 45.589992,
        "Longitude": -84.161312,
        "ContactTelephone1": "800-423-6634",
        "AccessComments": "24 hours daily; Michigan DNR Recreation Passport required for park entry",
        "RelatedURL": "",
        "DistanceUnit": 0
    },
    "Connections": [
        {
            "ID": 201254,
            "ConnectionTypeID": 1,
            "LevelID": 2,
            "Amps": 16,
            "Voltage": 230,
            "PowerKW": 3.7,
            "CurrentTypeID": 10,
            "Quantity": 2
        }
    ],
    "GeneralComments": "Planned for future date. Not Operational.",
    "DatePlanned": "2020-06-30T00:00:00Z",
    "StatusTypeID": 150,
    "DateLastStatusUpdate": "2020-06-26T03:09:00Z",
    "DataQualityLevel": 3,
    "DateCreated": "2019-12-24T09:23:00Z",
    "SubmissionStatusTypeID": 100
}