{
    "IsRecentlyVerified": false,
    "ID": 14197,
    "UUID": "6EE2B14F-06F1-4104-886B-3780C24C1C5D",
    "DataProviderID": 2,
    "DataProvidersReference": "45896",
    "UsageTypeID": 7,
    "AddressInfo": {
        "ID": 14094,
        "Title": "Marlborough Nissan",
        "AddressLine1": "740 Boston Post Rd",
        "Town": "Marlborough",
        "StateOrProvince": "MA",
        "Postcode": "01752",
        "CountryID": 2,
        "Latitude": 42.351115,
        "Longitude": -71.500717,
        "ContactTelephone1": "508-481-3232",
        "AccessComments": "Dealership business hours\r\nPublic - Call ahead",
        "RelatedURL": "",
        "DistanceUnit": 0
    },
    "Connections": [
        {
            "ID": 16493,
            "ConnectionTypeID": 1,
            "LevelID": 2,
            "Amps": 16,
            "Voltage": 230,
            "PowerKW": 3.7,
            "CurrentTypeID": 10,
            "Quantity": 1
        },
        {
            "ID": 21579,
            "ConnectionTypeID": 2,
            "LevelID": 3,
            "Amps": 100,
            "Voltage": 400,
            "PowerKW": 40,
            "CurrentTypeID": 30,
            "Quantity": 1
        }
    ],
    "DateLastStatusUpdate": "2020-06-26T03:05:00Z",
    "DataQualityLevel": 3,
    "DateCreated": "2012-12-06T16:49:00Z",
    "SubmissionStatusTypeID": 100
}