{
    "IsRecentlyVerified": false,
    "ID": 42211,
    "UUID": "AFA2B60F-D1C7-487F-8229-A4ED573FFDEF",
    "DataProviderID": 1,
    "OperatorID": 161,
    "UsageTypeID": 1,
    "UsageCost": "0",
    "AddressInfo": {
        "ID": 42557,
        "Title": "Stadtwerke Halle GmbH",
        "AddressLine1": "Bornknechtstraße 5",
        "AddressLine2": "Heide-Süd",
        "Town": "Halle (Saale)",
        "StateOrProvince": "Halle (Saale)",
        "Postcode": " 06108",
        "CountryID": 87,
        "Latitude": 51.4806043,
        "Longitude": 11.9646136,
        "ContactTelephone1": "0345 5813333",
        "ContactEmail": "kontakt@evh.de",
        "AccessComments": "2 immer nutzbar Ladeplätze, alles kostenlos. Betreiber sind die Stadtwerke Halle GmbH.",
        "RelatedURL": "http://www.evh.de/EVH/Privatkunden/Natuerlich-EVH/Mit-Strom-fahren",
        "DistanceUnit": 0
    },
    "Connections": [
        {
            "ID": 50724,
            "ConnectionTypeID": 28,
            "StatusTypeID": 50,
            "LevelID": 2,
            "Amps": 16,
            "Voltage": 230,
            "PowerKW": 3.7,
            "CurrentTypeID": 10,
            "Quantity": 2
        }
    ],
    "NumberOfPoints": 2,
    "StatusTypeID": 50,
    "DateLastStatusUpdate": "2015-03-08T18:58:00Z",
    "DataQualityLevel": 1,
    "DateCreated": "2015-02-27T07:02:00Z",
    "SubmissionStatusTypeID": 200
}