{
    "IsRecentlyVerified": false,
    "ID": 106146,
    "UUID": "F1B35690-1E01-4E65-9363-ACC9CB9CE041",
    "DataProviderID": 1,
    "OperatorID": 23,
    "OperatorsReference": "44273",
    "UsageTypeID": 4,
    "AddressInfo": {
        "ID": 106492,
        "Title": "Holiday Inn Express & Suites Hudson",
        "AddressLine1": "1200 Gateway BLVD",
        "Town": "Hudson",
        "StateOrProvince": "Wisconsin",
        "Postcode": "54016",
        "CountryID": 2,
        "Latitude": 44.957555,
        "Longitude": -92.722507,
        "ContactTelephone1": "(715) 386-6200",
        "DistanceUnit": 0
    },
    "Connections": [
        {
            "ID": 149478,
            "ConnectionTypeID": 30,
            "StatusTypeID": 50,
            "LevelID": 2,
            "PowerKW": 10,
            "CurrentTypeID": 10,
            "Quantity": 2
        }
    ],
    "NumberOfPoints": 2,
    "GeneralComments": "2 Tesla Connectors, up to 10kW.Available for customers. Self park.",
    "StatusTypeID": 50,
    "DateLastStatusUpdate": "2018-06-16T05:30:00Z",
    "DataQualityLevel": 1,
    "DateCreated": "2018-06-16T05:30:00Z",
    "SubmissionStatusTypeID": 200
}