{
    "IsRecentlyVerified": false,
    "ID": 63882,
    "UUID": "5B1D37BB-AD72-41B9-955D-967AA2BA2AC8",
    "DataProviderID": 26,
    "DataProvidersReference": "74334",
    "OperatorsReference": "Alfen NLMAB_0351",
    "UsageCost": "0.00 jaarabonnement",
    "AddressInfo": {
        "ID": 64228,
        "Title": "Planetenweg 5",
        "AddressLine1": "Planetenweg 5",
        "Town": "Hoofddorp",
        "Postcode": "2132 HN",
        "CountryID": 159,
        "Latitude": 52.29771,
        "Longitude": 4.70333,
        "ContactTelephone1": "06-53505381",
        "RelatedURL": "http://www.nlmab.nl",
        "DistanceUnit": 0
    },
    "Connections": [
        {
            "ID": 81626,
            "ConnectionTypeID": 25,
            "LevelID": 2,
            "PowerKW": 11,
            "CurrentTypeID": 10
        },
        {
            "ID": 81627,
            "ConnectionTypeID": 25,
            "LevelID": 2,
            "PowerKW": 11
        }
    ],
    "NumberOfPoints": 1,
    "StatusTypeID": 50,
    "DateLastStatusUpdate": "2016-06-04T02:52:00Z",
    "DataQualityLevel": 3,
    "DateCreated": "2016-03-03T12:32:00Z",
    "SubmissionStatusTypeID": 100
}