{
    "UserComments": [
        {
            "ID": 20074,
            "ChargePointID": 19345,
            "CommentTypeID": 10,
            "UserName": "Simon Hewison",
            "Comment": "Unit crashed,  not online.  Fault already reported ",
            "Rating": 2,
            "DateCreated": "2018-08-29T13:49:25.067Z",
            "User": {
                "ID": 4575,
                "Username": "Simon Hewison"
            },
            "CheckinStatusTypeID": 20
        },
        {
            "ID": 19260,
            "ChargePointID": 19345,
            "CommentTypeID": 50,
            "UserName": "Simon Hewison",
            "Comment": "Chargemaster have replied that an engineer is scheduled to visit this site on Wednesday 7 March 2018.",
            "DateCreated": "2018-03-05T11:02:03.62Z",
            "User": {
                "ID": 4575,
                "Username": "Simon Hewison"
            },
            "CheckinStatusTypeID": 0
        },
        {
            "ID": 19254,
            "ChargePointID": 19345,
            "CommentTypeID": 10,
            "UserName": "Simon Hewison",
            "Comment": "Screen scrambled,  not responding to any input.  Reported to Chargemaster.  Unit has recently been replaced. ",
            "Rating": 1,
            "DateCreated": "2018-03-04T18:20:13.597Z",
            "User": {
                "ID": 4575,
                "Username": "Simon Hewison"
            },
            "CheckinStatusTypeID": 25
        },
        {
            "ID": 16061,
            "ChargePointID": 19345,
            "CommentTypeID": 1000,
            "UserName": "Simon Hewison",
            "Comment": "Software on unit had once again hung, not responding - stuck on tick mark. Reported to Chargemaster, who said they'd send an engineer to look at it.",
            "Rating": 1,
            "DateCreated": "2017-03-16T15:18:24.97Z",
            "User": {
                "ID": 4575,
                "Username": "Simon Hewison"
            },
            "CheckinStatusTypeID": 25
        },
        {
            "ID": 14427,
            "ChargePointID": 19345,
            "CommentTypeID": 50,
            "UserName": "Simon Hewison",
            "Comment": "Software on the unit had hung, phoned Chargemaster, unit not responding on network, they'll send an engineer, which will take a few days. Until then, it's not working.",
            "Rating": 1,
            "DateCreated": "2016-10-19T09:34:11.537Z",
            "User": {
                "ID": 4575,
                "Username": "Simon Hewison"
            },
            "CheckinStatusTypeID": 20
        },
        {
            "ID": 13832,
            "ChargePointID": 19345,
            "CommentTypeID": 10,
            "UserName": "Simon Hewison",
            "Rating": 3,
            "DateCreated": "2016-07-14T09:51:02.197Z",
            "User": {
                "ID": 4575,
                "Username": "Simon Hewison"
            },
            "CheckinStatusTypeID": 10
        },
        {
            "ID": 11544,
            "ChargePointID": 19345,
            "CommentTypeID": 10,
            "UserName": "Simon Hewison",
            "Rating": 3,
            "DateCreated": "2016-06-02T20:55:24.81Z",
            "User": {
                "ID": 4575,
                "Username": "Simon Hewison"
            },
            "CheckinStatusTypeID": 10
        },
        {
            "ID": 9555,
            "ChargePointID": 19345,
            "CommentTypeID": 10,
            "UserName": "Simon Hewison",
            "Comment": "There's now some nice new signage and bay bumper kerbs installed. No ICEing. ",
            "DateCreated": "2016-01-21T18:34:42.523Z",
            "User": {
                "ID": 4575,
                "Username": "Simon Hewison"
            },
            "CheckinStatusTypeID": 10
        },
        {
            "ID": 6520,
            "ChargePointID": 19345,
            "CommentTypeID": 10,
            "UserName": "Simon Hewison",
            "Comment": "There are now traffic cones in one of the bays to prevent ICEing. Still no bay markings or signage",
            "DateCreated": "2015-09-19T10:00:57.017Z",
            "User": {
                "ID": 4575,
                "Username": "Simon Hewison"
            },
            "CheckinStatusTypeID": 140
        },
        {
            "ID": 4753,
            "ChargePointID": 19345,
            "CommentTypeID": 10,
            "UserName": "Simon Hewison",
            "Comment": "One bay in use charging,  using socket labelled as 7kW. Second bay was ICEd.  I managed to park nearby and stretch cable to reach. Surprisingly,  got 7kw charge from socket labelled as 3kW.  Could be because outlander on other socket can only do 16A? Maybe it is really a 2x 7kw post?",
            "DateCreated": "2015-06-23T21:20:01.76Z",
            "User": {
                "ID": 4575,
                "Username": "Simon Hewison"
            },
            "CheckinStatusTypeID": 10
        },
        {
            "ID": 4639,
            "ChargePointID": 19345,
            "CommentTypeID": 10,
            "UserName": "Peter Galbavy",
            "Comment": "ICEd, two spaces. Had words with manager and they are in the process of having head office approve new signage and perhaps road markings.",
            "Rating": 1,
            "DateCreated": "2015-06-06T11:20:49.757Z",
            "User": {
                "ID": 4899,
                "Username": "Peter Galbavy"
            },
            "CheckinStatusTypeID": 110
        },
        {
            "ID": 4518,
            "ChargePointID": 19345,
            "CommentTypeID": 10,
            "UserName": "Simon Hewison",
            "Comment": "Both bays iced. Managed to stretch cable to nearby bay",
            "Rating": 2,
            "DateCreated": "2015-05-22T14:13:32.787Z",
            "User": {
                "ID": 4575,
                "Username": "Simon Hewison"
            },
            "CheckinStatusTypeID": 10
        },
        {
            "ID": 4462,
            "ChargePointID": 19345,
            "CommentTypeID": 10,
            "UserName": "Simon Hewison",
            "Comment": "It looks like the circular guard barrier around the chargepoint has had some impact, all the mounting bolts have sheared off - by design, the guard barrier is now loose. Reported to Source London, who will probably eventually report it to Chargemaster, who will then eventually report it to Waitrose, who will then report it to someone else. Still no signage. All bays were ICEd when I arrived, but a car just pulled out as I approached.",
            "Rating": 3,
            "DateCreated": "2015-05-15T20:50:30.707Z",
            "User": {
                "ID": 4575,
                "Username": "Simon Hewison"
            },
            "CheckinStatusTypeID": 10
        },
        {
            "ID": 4311,
            "ChargePointID": 19345,
            "CommentTypeID": 10,
            "UserName": "Simon Hewison",
            "Comment": "Both bays iced. No signage",
            "Rating": 2,
            "DateCreated": "2015-04-26T15:14:27.427Z",
            "User": {
                "ID": 4575,
                "Username": "Simon Hewison"
            },
            "CheckinStatusTypeID": 110
        },
        {
            "ID": 4168,
            "ChargePointID": 19345,
            "CommentTypeID": 10,
            "UserName": "Simon Hewison",
            "Comment": "Bays unmarked. Charge point unsigned. One bay iced",
            "Rating": 2,
            "DateCreated": "2015-04-06T17:26:24.72Z",
            "User": {
                "ID": 4575,
                "Username": "Simon Hewison"
            },
            "CheckinStatusTypeID": 10
        },
        {
            "ID": 3819,
            "ChargePointID": 19345,
            "CommentTypeID": 10,
            "UserName": "",
            "Comment": "Both bays ICEd, fortunately, my cable reached another nearby bay. Unlike some other Source London points, this one doesn't seem to accept Charge Your Car cards, managed to remotely activate charge via Polar Instant app.",
            "Rating": 3,
            "DateCreated": "2015-02-19T21:37:02.973Z",
            "CheckinStatusTypeID": 10
        },
        {
            "ID": 593,
            "ChargePointID": 19345,
            "CommentTypeID": 10,
            "UserName": "Martin Winlow",
            "Comment": "Both bays ICEd but car park is VERY busy and not big so not surprised.  Charge post is almost buried in a hedge.",
            "Rating": 3,
            "DateCreated": "2013-12-24T16:50:15.157Z",
            "User": {
                "ID": 1308,
                "Username": "Martin Winlow"
            },
            "CheckinStatusTypeID": 140
        }
    ],
    "IsRecentlyVerified": false,
    "ID": 19345,
    "UUID": "5D20286D-C18F-44E2-B091-5E517A27FAE2",
    "DataProviderID": 1,
    "OperatorID": 32,
    "OperatorsReference": "1852",
    "UsageTypeID": 4,
    "UsageCost": "Inclusive; for Polar Plus subscription members only",
    "AddressInfo": {
        "ID": 19690,
        "Title": "Waitrose Whetstone",
        "AddressLine1": "1305 High Road",
        "AddressLine2": "Whetstone",
        "Town": "London",
        "Postcode": "N20 9HX",
        "CountryID": 1,
        "Latitude": 51.6310779652486,
        "Longitude": -0.176135301589966,
        "ContactTelephone1": "0845 850 0653",
        "AccessComments": "At far end of Waitrose car park (not Boots) accessed from Totteridge Lane.  Max stay 1.5 hours ",
        "RelatedURL": "http://www.waitrose.com/content/waitrose/en/bf_home/bf/124.html",
        "DistanceUnit": 0
    },
    "Connections": [
        {
            "ID": 19643,
            "ConnectionTypeID": 25,
            "StatusTypeID": 50,
            "LevelID": 2,
            "Amps": 32,
            "Voltage": 230,
            "PowerKW": 7,
            "CurrentTypeID": 10,
            "Quantity": 2
        }
    ],
    "NumberOfPoints": 2,
    "GeneralComments": "Chargemaster post no longer accepts Source London or Source East cards.",
    "StatusTypeID": 50,
    "DateLastStatusUpdate": "2019-03-05T06:25:00Z",
    "DataQualityLevel": 1,
    "DateCreated": "2013-09-22T12:06:00Z",
    "SubmissionStatusTypeID": 200
}