{
    "IsRecentlyVerified": false,
    "ID": 20310,
    "UUID": "50C98817-ADFA-4DC7-8D03-1C3785809928",
    "DataProviderID": 1,
    "OperatorID": 1,
    "UsageTypeID": 0,
    "UsageCost": "",
    "AddressInfo": {
        "ID": 20655,
        "Title": "Parking Urbis Hôpital Nord",
        "AddressLine1": "34 Boulevard Pierre Dramard ",
        "AddressLine2": "",
        "Town": "Marseille",
        "StateOrProvince": "",
        "Postcode": "13015",
        "CountryID": 80,
        "Latitude": 43.37755,
        "Longitude": 5.36154,
        "ContactTelephone1": "",
        "ContactTelephone2": "",
        "ContactEmail": "",
        "AccessComments": "Ouvert à tous",
        "RelatedURL": "",
        "DistanceUnit": 0
    },
    "Connections": [],
    "GeneralComments": "",
    "StatusTypeID": 50,
    "DateLastStatusUpdate": "2013-11-11T18:20:00Z",
    "DataQualityLevel": 1,
    "DateCreated": "2013-11-11T14:23:00Z",
    "SubmissionStatusTypeID": 200
}