{
    "IsRecentlyVerified": false,
    "ID": 35583,
    "UUID": "D2F8C110-35A0-42F1-AE70-E66C2F6C68C9",
    "DataProviderID": 26,
    "DataProvidersReference": "56010",
    "OperatorID": 180,
    "OperatorsReference": "Alfen RHL03171",
    "UsageCost": "0.00 jaarabonnement",
    "AddressInfo": {
        "ID": 35929,
        "Title": "Ingenieur Veltplein",
        "AddressLine1": "Ingenieur Veltplein",
        "Town": "Zoetermeer",
        "Postcode": "2717 ZA",
        "CountryID": 159,
        "Latitude": 52.062219,
        "Longitude": 4.470911,
        "ContactTelephone1": "036 - 549 34 00",
        "RelatedURL": "http://www.icu-charging-stations.com/",
        "DistanceUnit": 0
    },
    "Connections": [
        {
            "ID": 39094,
            "ConnectionTypeID": 25,
            "LevelID": 2,
            "PowerKW": 11,
            "CurrentTypeID": 10
        },
        {
            "ID": 47955,
            "ConnectionTypeID": 25,
            "LevelID": 2,
            "PowerKW": 11,
            "CurrentTypeID": 10
        }
    ],
    "NumberOfPoints": 1,
    "StatusTypeID": 50,
    "DateLastStatusUpdate": "2016-06-04T02:45:00Z",
    "DataQualityLevel": 3,
    "DateCreated": "2015-01-09T06:05:00Z",
    "SubmissionStatusTypeID": 100
}