{
    "IsRecentlyVerified": false,
    "ID": 84636,
    "UUID": "4F828482-11FE-4E4D-9489-4BB661726292",
    "DataProviderID": 1,
    "OperatorID": 45,
    "UsageTypeID": 4,
    "UsageCost": "£1.00/4 hours",
    "AddressInfo": {
        "ID": 84982,
        "Title": " The Robert Jones & Agnes Hunt Orthopaedic Hospital",
        "AddressLine1": "North Drive",
        "AddressLine2": "Gobowen",
        "Town": "Oswestry",
        "StateOrProvince": "Shropshire",
        "Postcode": "SY10 7AG",
        "CountryID": 1,
        "Latitude": 52.8839355016652,
        "Longitude": -3.03498201097569,
        "AccessComments": "In main visitor car park",
        "RelatedURL": "http://www.rjah.nhs.uk/",
        "DistanceUnit": 0
    },
    "Connections": [
        {
            "ID": 120226,
            "ConnectionTypeID": 25,
            "StatusTypeID": 50,
            "LevelID": 2,
            "Amps": 16,
            "Voltage": 230,
            "PowerKW": 3.6,
            "CurrentTypeID": 10,
            "Quantity": 2
        }
    ],
    "NumberOfPoints": 2,
    "GeneralComments": "Coin-operated",
    "StatusTypeID": 50,
    "DateLastStatusUpdate": "2017-03-07T18:28:00Z",
    "DataQualityLevel": 1,
    "DateCreated": "2017-03-07T18:28:00Z",
    "SubmissionStatusTypeID": 200
}