{
    "IsRecentlyVerified": false,
    "ID": 144926,
    "UUID": "A5FCF4A4-9D0F-4EA0-9D93-6883ADA5F192",
    "DataProviderID": 2,
    "DataProvidersReference": "73438",
    "OperatorID": 3373,
    "UsageTypeID": 1,
    "AddressInfo": {
        "ID": 145278,
        "Title": "Cannon Beach - Cannon Beach RV Resort",
        "AddressLine1": "340 Elk Creek Road",
        "Town": "Cannon Beach",
        "StateOrProvince": "OR",
        "Postcode": "97110",
        "CountryID": 2,
        "Latitude": 45.890201,
        "Longitude": -123.954666,
        "ContactTelephone1": "888-833-2148",
        "AccessComments": "24 hours daily",
        "RelatedURL": "https://www.evsolutions.com/ev-network",
        "DistanceUnit": 0
    },
    "Connections": [
        {
            "ID": 201480,
            "ConnectionTypeID": 1,
            "LevelID": 2,
            "Amps": 16,
            "Voltage": 230,
            "PowerKW": 3.7,
            "CurrentTypeID": 10,
            "Quantity": 1
        },
        {
            "ID": 201481,
            "ConnectionTypeID": 2,
            "LevelID": 3,
            "Amps": 100,
            "Voltage": 400,
            "PowerKW": 40,
            "CurrentTypeID": 30,
            "Quantity": 1
        }
    ],
    "StatusTypeID": 50,
    "DateLastStatusUpdate": "2020-06-26T03:10:00Z",
    "DataQualityLevel": 3,
    "DateCreated": "2019-12-24T09:24:00Z",
    "SubmissionStatusTypeID": 100
}