{
    "IsRecentlyVerified": false,
    "ID": 101648,
    "UUID": "BA34F5BE-4C8E-472B-8967-FF31ECA3C8AD",
    "DataProviderID": 1,
    "OperatorID": 156,
    "UsageTypeID": 4,
    "AddressInfo": {
        "ID": 101994,
        "Title": "Kia Autohaus Fohl & Partner",
        "AddressLine1": "Schäferei 16",
        "Town": "Waldhufen",
        "StateOrProvince": "Diehsa",
        "Postcode": "02906",
        "CountryID": 87,
        "Latitude": 51.272105569689856,
        "Longitude": 14.813412770500236,
        "ContactTelephone1": "+49 3588 25180",
        "AccessComments": "Die Säule ist zu den Öffnungszeiten Mo-Fr 08:00-18:00 Uhr , Sa 09:00-12:00 Uhr nutzbar\r\n",
        "RelatedURL": "http://www.kia-fohl-waldhufen.de/",
        "DistanceUnit": 0
    },
    "Connections": [
        {
            "ID": 143492,
            "ConnectionTypeID": 25,
            "StatusTypeID": 50,
            "LevelID": 2,
            "Amps": 32,
            "Voltage": 400,
            "PowerKW": 22,
            "CurrentTypeID": 20,
            "Quantity": 1
        }
    ],
    "NumberOfPoints": 1,
    "StatusTypeID": 50,
    "DateLastStatusUpdate": "2018-04-03T12:24:00Z",
    "DataQualityLevel": 1,
    "DateCreated": "2018-04-03T12:24:00Z",
    "SubmissionStatusTypeID": 200
}