{
    "IsRecentlyVerified": false,
    "ID": 115697,
    "UUID": "4B48FD5B-C38A-4D14-B599-95E154310C6A",
    "DataProviderID": 2,
    "DataProvidersReference": "112893",
    "OperatorID": 23,
    "UsageTypeID": 1,
    "AddressInfo": {
        "ID": 116043,
        "Title": "Calistoga Ranch - Tesla Destination",
        "AddressLine1": "580 Lommel Rd",
        "Town": "Calistoga",
        "StateOrProvince": "CA",
        "Postcode": "94515",
        "CountryID": 2,
        "Latitude": 38.579841,
        "Longitude": -122.510567,
        "ContactTelephone1": "855-441-2459  877-798-3752",
        "AccessComments": "24 hours daily; for customer use only; see valet for access",
        "RelatedURL": "https://www.tesla.com/destination-charging",
        "DistanceUnit": 0
    },
    "Connections": [
        {
            "ID": 162730,
            "ConnectionTypeID": 30,
            "LevelID": 2,
            "Amps": 16,
            "Voltage": 230,
            "PowerKW": 3.7,
            "CurrentTypeID": 10,
            "Quantity": 2
        }
    ],
    "DateLastStatusUpdate": "2020-06-26T03:00:00Z",
    "DataQualityLevel": 3,
    "DateCreated": "2019-02-11T07:13:00Z",
    "SubmissionStatusTypeID": 100
}