{
    "IsRecentlyVerified": false,
    "ID": 144086,
    "UUID": "648B7C37-A95F-4DEE-B565-33878C8C6C94",
    "DataProviderID": 2,
    "DataProvidersReference": "129630",
    "OperatorID": 89,
    "UsageTypeID": 1,
    "AddressInfo": {
        "ID": 144438,
        "Title": "Centre écologique Fernand-Seguin (Héritage Saint-Bernard )",
        "AddressLine1": "257 Rue Fernand-Seguin",
        "Town": "Châteauguay",
        "StateOrProvince": "QC",
        "Postcode": "J6K 0J8",
        "CountryID": 44,
        "Latitude": 45.342035,
        "Longitude": -73.768032,
        "ContactTelephone1": "888-356-8911",
        "AccessComments": "24 hours daily",
        "RelatedURL": "https://flo.ca/",
        "DistanceUnit": 0
    },
    "Connections": [
        {
            "ID": 200554,
            "ConnectionTypeID": 1,
            "LevelID": 2,
            "Amps": 16,
            "Voltage": 230,
            "PowerKW": 3.7,
            "CurrentTypeID": 10,
            "Quantity": 2
        }
    ],
    "StatusTypeID": 50,
    "DateLastStatusUpdate": "2020-06-26T03:08:00Z",
    "DataQualityLevel": 3,
    "DateCreated": "2019-12-24T09:22:00Z",
    "SubmissionStatusTypeID": 100
}