{
    "IsRecentlyVerified": false,
    "ID": 110299,
    "UUID": "DB4B6AE5-91DF-4193-AEF9-9840C0EE174E",
    "DataProviderID": 2,
    "DataProvidersReference": "99997",
    "OperatorID": 5,
    "UsageTypeID": 1,
    "AddressInfo": {
        "ID": 110645,
        "Title": "HAMPTON  INN",
        "AddressLine1": "150 Charlestowne Dr",
        "Town": "Elkin",
        "StateOrProvince": "NC",
        "Postcode": "28621",
        "CountryID": 2,
        "Latitude": 36.3930985,
        "Longitude": -80.7862566,
        "ContactTelephone1": "888-758-4389",
        "AccessComments": "24 hours daily",
        "RelatedURL": "http://www.chargepoint.com/",
        "DistanceUnit": 0
    },
    "Connections": [
        {
            "ID": 155540,
            "ConnectionTypeID": 1,
            "LevelID": 2,
            "Amps": 16,
            "Voltage": 230,
            "PowerKW": 3,
            "CurrentTypeID": 10,
            "Quantity": 2
        }
    ],
    "DateLastStatusUpdate": "2019-04-06T04:02:00Z",
    "DataQualityLevel": 3,
    "DateCreated": "2018-10-18T23:36:00Z",
    "SubmissionStatusTypeID": 100
}