{
    "IsRecentlyVerified": false,
    "ID": 28804,
    "UUID": "B0CC1F4C-F0B4-40D2-9D2B-76534B4A04A4",
    "DataProviderID": 2,
    "DataProvidersReference": "62056",
    "OperatorID": 5,
    "UsageTypeID": 1,
    "AddressInfo": {
        "ID": 29150,
        "Title": "BMW ANN ARBOR",
        "AddressLine1": "501 Auto Mall Dr",
        "Town": "Ann Arbor",
        "StateOrProvince": "MI",
        "Postcode": "48103",
        "CountryID": 2,
        "Latitude": 42.285775,
        "Longitude": -83.8117448,
        "ContactTelephone1": "888-758-4389",
        "AccessComments": "24 hours daily",
        "RelatedURL": "http://www.chargepoint.com/",
        "DistanceUnit": 0
    },
    "Connections": [
        {
            "ID": 31645,
            "ConnectionTypeID": 1,
            "LevelID": 2,
            "Amps": 16,
            "Voltage": 230,
            "PowerKW": 3.7,
            "CurrentTypeID": 10,
            "Quantity": 2
        }
    ],
    "DateLastStatusUpdate": "2020-06-26T03:05:00Z",
    "DataQualityLevel": 3,
    "DateCreated": "2014-11-28T03:38:00Z",
    "SubmissionStatusTypeID": 100
}