{
    "IsRecentlyVerified": false,
    "ID": 33228,
    "UUID": "6C658CA6-06F4-4806-876A-F6E3F7EC4F01",
    "DataProviderID": 26,
    "DataProvidersReference": "48439",
    "OperatorID": 178,
    "OperatorsReference": "EVnetNL PNB-REE0085",
    "UsageCost": "0.00 jaarabonnement",
    "AddressInfo": {
        "ID": 33574,
        "Title": "Professor Dondersstraat 66",
        "AddressLine1": "Professor Dondersstraat 66",
        "Town": "Tilburg",
        "Postcode": "5017 HL",
        "CountryID": 159,
        "Latitude": 51.557061,
        "Longitude": 5.099131,
        "ContactTelephone1": "0800-3522365",
        "RelatedURL": "http://www.evnet.nl",
        "DistanceUnit": 0
    },
    "Connections": [
        {
            "ID": 36739,
            "ConnectionTypeID": 25,
            "LevelID": 1,
            "PowerKW": 2.3,
            "CurrentTypeID": 10
        },
        {
            "ID": 46729,
            "ConnectionTypeID": 25,
            "LevelID": 1,
            "PowerKW": 2.3,
            "CurrentTypeID": 10
        }
    ],
    "NumberOfPoints": 1,
    "StatusTypeID": 50,
    "DateLastStatusUpdate": "2016-06-04T02:39:00Z",
    "DataQualityLevel": 3,
    "DateCreated": "2015-01-09T06:04:00Z",
    "SubmissionStatusTypeID": 100
}