{
    "IsRecentlyVerified": false,
    "ID": 73152,
    "UUID": "3C113A5A-EF14-48E3-BDA4-31E845A5749F",
    "DataProviderID": 1,
    "OperatorID": 44,
    "UsageTypeID": 1,
    "AddressInfo": {
        "ID": 73498,
        "Title": "Ladepunkt Vierkirchen",
        "AddressLine1": "Am Anger 5",
        "Town": "Vierkirchen",
        "StateOrProvince": "Landkreis Dachau",
        "Postcode": "85256",
        "CountryID": 87,
        "Latitude": 48.36472999999999,
        "Longitude": 11.452930000000038,
        "ContactTelephone1": "+49 163 1552876",
        "AccessComments": "Täglich von 8-20Uhr nutzbar. Spende für Strom entsprechend 0,25€/kWh bitte in Briefkasten werden. Nach Anmeldung kann auch eine CEE Dose mit 11kW (400V/16A) zur Verfügung gestellt werden. Offenes Freifunk-WLAN direkt am Ladepunkt vorhanden.",
        "DistanceUnit": 0
    },
    "Connections": [
        {
            "ID": 105176,
            "ConnectionTypeID": 28,
            "StatusTypeID": 50,
            "LevelID": 2,
            "Amps": 16,
            "Voltage": 230,
            "PowerKW": 3.7,
            "CurrentTypeID": 10,
            "Quantity": 2
        }
    ],
    "NumberOfPoints": 2,
    "StatusTypeID": 50,
    "DateLastStatusUpdate": "2016-11-11T07:40:00Z",
    "DataQualityLevel": 1,
    "DateCreated": "2016-11-11T07:40:00Z",
    "SubmissionStatusTypeID": 200
}