{
    "IsRecentlyVerified": false,
    "ID": 74019,
    "UUID": "98402F3A-1C65-4CCD-9652-FA872F0C7312",
    "DataProviderID": 1,
    "OperatorID": 89,
    "OperatorsReference": "CEB-10118,CEB-10160",
    "UsageTypeID": 4,
    "UsageCost": "CAD 2.50",
    "AddressInfo": {
        "ID": 74365,
        "Title": "Amt-Stationnement Châteauguay",
        "AddressLine1": "42 boul. Saint-Jean Baptiste",
        "Town": "Chateauguay",
        "StateOrProvince": "QC",
        "Postcode": "J6J 3H6",
        "CountryID": 44,
        "Latitude": 45.3654670715332,
        "Longitude": -73.7114791870117,
        "DistanceUnit": 0
    },
    "Connections": [
        {
            "ID": 106336,
            "ConnectionTypeID": 1,
            "StatusTypeID": 50,
            "LevelID": 2,
            "Amps": 32,
            "Voltage": 230,
            "PowerKW": 7,
            "CurrentTypeID": 10,
            "Quantity": 2
        }
    ],
    "NumberOfPoints": 2,
    "StatusTypeID": 50,
    "DateLastStatusUpdate": "2017-11-12T06:38:00Z",
    "DataQualityLevel": 1,
    "DateCreated": "2016-11-23T23:58:00Z",
    "SubmissionStatusTypeID": 200
}