{
    "IsRecentlyVerified": false,
    "ID": 153178,
    "UUID": "A46BAAB3-A46D-417F-BFD9-56F1BC8C88E5",
    "DataProviderID": 28,
    "DataProvidersReference": "FR*S89*P89346*C",
    "UsageTypeID": 5,
    "AddressInfo": {
        "ID": 153531,
        "Title": "ST GEORGES SUR BAULCHE_74 Grande Rue",
        "AddressLine1": "74 Grande Rue 89000 ST GEORGES SUR BAULCHE",
        "CountryID": 80,
        "Latitude": 47.80873781,
        "Longitude": 3.53460235,
        "AccessComments": "24/24 7/7 jours",
        "DistanceUnit": 0
    },
    "Connections": [
        {
            "ID": 214769,
            "ConnectionTypeID": 28,
            "StatusTypeID": 50,
            "LevelID": 2,
            "PowerKW": 22,
            "CurrentTypeID": 10
        },
        {
            "ID": 214770,
            "ConnectionTypeID": 1036,
            "StatusTypeID": 50,
            "LevelID": 2,
            "PowerKW": 22,
            "CurrentTypeID": 20
        },
        {
            "ID": 248125,
            "ConnectionTypeID": 28,
            "StatusTypeID": 50,
            "LevelID": 2,
            "PowerKW": 22,
            "CurrentTypeID": 10
        },
        {
            "ID": 248126,
            "ConnectionTypeID": 1036,
            "StatusTypeID": 50,
            "LevelID": 2,
            "PowerKW": 22,
            "CurrentTypeID": 20
        }
    ],
    "GeneralComments": "",
    "StatusTypeID": 50,
    "DateLastStatusUpdate": "2020-08-27T05:14:00Z",
    "DataQualityLevel": 2,
    "DateCreated": "2020-03-15T10:54:00Z",
    "SubmissionStatusTypeID": 100
}