{
    "IsRecentlyVerified": false,
    "ID": 105237,
    "UUID": "A311DEFF-8290-430A-A385-91C04BD4FAC2",
    "DataProviderID": 1,
    "OperatorID": 3315,
    "OperatorsReference": "51393",
    "UsageTypeID": 4,
    "UsageCost": "Free",
    "AddressInfo": {
        "ID": 105583,
        "Title": "Church Square Car Park, Ballater",
        "AddressLine1": "Church Square",
        "Town": "Aberdeenshire",
        "Postcode": "AB35 5NE",
        "CountryID": 1,
        "Latitude": 57.04847,
        "Longitude": -3.04111,
        "DistanceUnit": 0
    },
    "Connections": [
        {
            "ID": 148359,
            "ConnectionTypeID": 25,
            "StatusTypeID": 50,
            "LevelID": 2,
            "Amps": 32,
            "Voltage": 400,
            "PowerKW": 22,
            "CurrentTypeID": 20,
            "Quantity": 2
        }
    ],
    "NumberOfPoints": 2,
    "StatusTypeID": 50,
    "DateLastStatusUpdate": "2019-08-09T05:15:00Z",
    "DataQualityLevel": 1,
    "DateCreated": "2018-06-04T05:14:00Z",
    "SubmissionStatusTypeID": 200
}