{
    "IsRecentlyVerified": false,
    "ID": 169950,
    "UUID": "2E6B6BCF-1B4A-4515-AEC1-8D17F9FC3EAB",
    "DataProviderID": 1,
    "OperatorID": 2247,
    "UsageTypeID": 1,
    "UsageCost": "0.3 €/kWh",
    "AddressInfo": {
        "ID": 170309,
        "Title": "Meson Ezequiel",
        "AddressLine1": "carretera de Asturias 7",
        "Town": "Villamanin",
        "StateOrProvince": "Leon",
        "Postcode": "24680",
        "CountryID": 210,
        "Latitude": 42.93862,
        "Longitude": -5.659568,
        "DistanceUnit": 0
    },
    "Connections": [
        {
            "ID": 258994,
            "ConnectionTypeID": 33,
            "StatusTypeID": 50,
            "LevelID": 2,
            "PowerKW": 50
        },
        {
            "ID": 258995,
            "ConnectionTypeID": 2,
            "StatusTypeID": 50,
            "LevelID": 2,
            "PowerKW": 50
        },
        {
            "ID": 258996,
            "ConnectionTypeID": 1036,
            "StatusTypeID": 50,
            "LevelID": 2,
            "PowerKW": 43
        }
    ],
    "NumberOfPoints": 2,
    "StatusTypeID": 50,
    "DateLastStatusUpdate": "2020-11-15T10:45:00Z",
    "DataQualityLevel": 1,
    "DateCreated": "2020-11-14T20:13:00Z",
    "SubmissionStatusTypeID": 200
}