{
    "IsRecentlyVerified": false,
    "ID": 141832,
    "UUID": "E92514A1-12B3-4343-8DAA-44591ACFAD6B",
    "DataProviderID": 2,
    "DataProvidersReference": "147994",
    "OperatorID": 39,
    "UsageTypeID": 1,
    "AddressInfo": {
        "ID": 142184,
        "Title": "Walgreens - Aurora, CO #11651 |P741",
        "AddressLine1": "24250 E Smoky Hill Rd",
        "Town": "Aurora",
        "StateOrProvince": "CO",
        "Postcode": "80016",
        "CountryID": 2,
        "Latitude": 39.596486,
        "Longitude": -104.705455,
        "ContactTelephone1": "800-663-5633",
        "AccessComments": "MO: Not Specified; TU: Not Specified; WE: Not Specified; TH: Not Specified; FR: Not Specified; SA: Not Specified; SU: Not Specified",
        "RelatedURL": "http://www.semacharge.com/",
        "DistanceUnit": 0
    },
    "Connections": [
        {
            "ID": 197859,
            "ConnectionTypeID": 1,
            "LevelID": 2,
            "Amps": 16,
            "Voltage": 230,
            "PowerKW": 3.7,
            "CurrentTypeID": 10,
            "Quantity": 1
        }
    ],
    "StatusTypeID": 50,
    "DateLastStatusUpdate": "2020-06-26T03:02:00Z",
    "DataQualityLevel": 3,
    "DateCreated": "2019-12-24T09:16:00Z",
    "SubmissionStatusTypeID": 100
}