{
    "IsRecentlyVerified": false,
    "ID": 176802,
    "UUID": "B60F2E08-2349-4B61-8DFE-AB9F45C2013F",
    "DataProviderID": 29,
    "DataProvidersReference": "7998",
    "AddressInfo": {
        "ID": 177161,
        "Title": "In den Rietbroken 28",
        "AddressLine1": "In den Rietbroken 28",
        "Town": "Lengerich",
        "Postcode": "49525",
        "CountryID": 87,
        "Latitude": 52.178411,
        "Longitude": 7.8483,
        "DistanceUnit": 0
    },
    "Connections": [
        {
            "ID": 275157,
            "ConnectionTypeID": 33,
            "StatusTypeID": 50,
            "LevelID": 3,
            "PowerKW": 22,
            "CurrentTypeID": 30
        },
        {
            "ID": 275158,
            "ConnectionTypeID": 25,
            "StatusTypeID": 50,
            "LevelID": 2,
            "PowerKW": 11,
            "CurrentTypeID": 20
        }
    ],
    "StatusTypeID": 0,
    "DateLastStatusUpdate": "2021-07-12T02:49:00Z",
    "MetadataValues": [
        {
            "ID": 9097,
            "MetadataFieldID": 4,
            "ItemValue": "Data from the German chargepoint registry provided by Bundesnetzagentur.de under the CC-BY 4.0 license"
        }
    ],
    "DataQualityLevel": 3,
    "DateCreated": "2021-07-08T09:48:00Z",
    "SubmissionStatusTypeID": 100
}