{
    "IsRecentlyVerified": false,
    "ID": 17002,
    "UUID": "31850255-DDA5-466F-BA6A-95CBAECA9E80",
    "DataProviderID": 22,
    "DataProvidersReference": "65F675B3CF48B79D1D4FE970F1688C6B",
    "AddressInfo": {
        "ID": 17347,
        "Title": "日産プリンス茨城販売鹿島店",
        "AddressLine1": "茨城県鹿嶋市大船津3623",
        "CountryID": 114,
        "Latitude": 35.94735224,
        "Longitude": 140.6220212,
        "ContactTelephone1": "0299-82-3011",
        "DistanceUnit": 0
    },
    "Connections": [
        {
            "ID": 17243,
            "ConnectionTypeID": 2,
            "LevelID": 2,
            "Amps": 100,
            "Voltage": 480,
            "PowerKW": 48,
            "Quantity": 1
        }
    ],
    "DateLastStatusUpdate": "2013-06-29T08:52:00Z",
    "DataQualityLevel": 2,
    "DateCreated": "2013-06-29T08:52:00Z",
    "SubmissionStatusTypeID": 200
}