{
    "IsRecentlyVerified": false,
    "ID": 94536,
    "UUID": "3EA9FBDC-AAB6-4B14-9AEE-94022952BCD9",
    "DataProviderID": 1,
    "OperatorID": 23,
    "OperatorsReference": "36693",
    "UsageTypeID": 6,
    "AddressInfo": {
        "ID": 94882,
        "Title": "Les Fermes de Marie",
        "AddressLine1": "163 Chemin de la Riante Colline",
        "Town": "Megève",
        "Postcode": "74120",
        "CountryID": 80,
        "Latitude": 45.856254,
        "Longitude": 6.613066,
        "ContactTelephone1": "+33 4 50 93 03 10",
        "DistanceUnit": 0
    },
    "Connections": [
        {
            "ID": 133675,
            "ConnectionTypeID": 30,
            "StatusTypeID": 50,
            "LevelID": 2,
            "Voltage": 230,
            "PowerKW": 6,
            "CurrentTypeID": 10,
            "Quantity": 1
        }
    ],
    "NumberOfPoints": 1,
    "GeneralComments": "1 Tesla Connector, up to 6kW.Available for patrons only. Please see valet.",
    "StatusTypeID": 50,
    "DateLastStatusUpdate": "2018-10-03T14:53:00Z",
    "DataQualityLevel": 1,
    "DateCreated": "2017-10-20T05:37:00Z",
    "SubmissionStatusTypeID": 200
}