{
    "IsRecentlyVerified": false,
    "ID": 95964,
    "UUID": "1F484B68-DF4C-42FC-8DFD-73542835E4EA",
    "DataProviderID": 1,
    "OperatorID": 45,
    "UsageTypeID": 6,
    "AddressInfo": {
        "ID": 96310,
        "Title": "Aparthotel Silver",
        "AddressLine1": "Carrer de Bretón de los Herreros",
        "AddressLine2": "la Vila de Gràcia",
        "Town": "Barcelona",
        "StateOrProvince": "Barcelonés",
        "Postcode": "08023",
        "CountryID": 210,
        "Latitude": 41.4020834588306,
        "Longitude": 2.15113402691419,
        "ContactTelephone1": "+34 932189100",
        "ContactEmail": "reservations@hotelsilver.com",
        "AccessComments": "APARTHOTEL SILVER",
        "RelatedURL": "http://www.hotelsilver.com",
        "DistanceUnit": 0
    },
    "Connections": [
        {
            "ID": 135945,
            "ConnectionTypeID": 25,
            "StatusTypeID": 50,
            "LevelID": 2,
            "Amps": 15,
            "Voltage": 240,
            "PowerKW": 3.6,
            "CurrentTypeID": 10,
            "Quantity": 2
        }
    ],
    "NumberOfPoints": 2,
    "GeneralComments": "Parking Aparthotel Silver\r\nServicio para los clientes del hotel (no público)",
    "StatusTypeID": 50,
    "DateLastStatusUpdate": "2017-12-04T19:42:00Z",
    "DataQualityLevel": 1,
    "DateCreated": "2017-12-03T21:49:00Z",
    "SubmissionStatusTypeID": 200
}