{
    "IsRecentlyVerified": false,
    "ID": 14350,
    "UUID": "C0795D4A-7380-4A00-9029-8FC7314DFF06",
    "DataProviderID": 2,
    "DataProvidersReference": "47079",
    "UsageTypeID": 7,
    "AddressInfo": {
        "ID": 14247,
        "Title": "Quality Nissan - Greenwood",
        "AddressLine1": "1724 Montague Ave Ext",
        "Town": "Greenwood",
        "StateOrProvince": "SC",
        "Postcode": "29646",
        "CountryID": 2,
        "Latitude": 34.223185,
        "Longitude": -82.18908,
        "ContactTelephone1": "864-223-0586",
        "AccessComments": "Dealership business hours\r\nPublic - Call ahead",
        "RelatedURL": "",
        "DistanceUnit": 0
    },
    "Connections": [
        {
            "ID": 16565,
            "ConnectionTypeID": 1,
            "LevelID": 2,
            "Amps": 16,
            "Voltage": 230,
            "PowerKW": 3.7,
            "CurrentTypeID": 10,
            "Quantity": 1
        },
        {
            "ID": 21683,
            "ConnectionTypeID": 1,
            "LevelID": 2,
            "Quantity": 1
        }
    ],
    "DateLastStatusUpdate": "2020-06-26T02:57:00Z",
    "DataQualityLevel": 3,
    "DateCreated": "2012-12-06T16:49:00Z",
    "SubmissionStatusTypeID": 100
}