{
    "IsRecentlyVerified": false,
    "ID": 40752,
    "UUID": "A8FF3725-2A12-41C9-84FE-AF4FFF02A881",
    "DataProviderID": 1,
    "OperatorID": 23,
    "OperatorsReference": "7063",
    "UsageTypeID": 1,
    "UsageCost": "$0.20/min >=60kW; $0.10/min <60kW; other tariffs for older cars",
    "AddressInfo": {
        "ID": 41098,
        "Title": "Prien Lake Shopping Center - Tesla",
        "AddressLine1": "1772 W Prien Lake Rd",
        "Town": "Lake Charles",
        "StateOrProvince": "LA",
        "Postcode": "70601",
        "CountryID": 2,
        "Latitude": 30.199071,
        "Longitude": -93.248782,
        "ContactTelephone1": "877-798-3752",
        "AccessComments": "24 hours daily; for Tesla use only",
        "RelatedURL": "http://www.teslamotors.com/supercharger",
        "DistanceUnit": 0
    },
    "Connections": [
        {
            "ID": 44375,
            "ConnectionTypeID": 27,
            "StatusTypeID": 50,
            "LevelID": 3,
            "Amps": 100,
            "Voltage": 400,
            "PowerKW": 120,
            "CurrentTypeID": 30,
            "Quantity": 6
        }
    ],
    "NumberOfPoints": 6,
    "StatusTypeID": 50,
    "DateLastStatusUpdate": "2018-03-13T13:52:00Z",
    "DataQualityLevel": 3,
    "DateCreated": "2015-01-15T07:46:00Z",
    "SubmissionStatusTypeID": 100
}