{
    "IsRecentlyVerified": false,
    "ID": 180378,
    "UUID": "B0730CCF-B1ED-4C00-AABA-985B2A957ABF",
    "DataProviderID": 29,
    "DataProvidersReference": "19607",
    "AddressInfo": {
        "ID": 180737,
        "Title": "Langgasse 69",
        "AddressLine1": "Langgasse 69",
        "Town": "Haßloch",
        "Postcode": "67454",
        "CountryID": 87,
        "Latitude": 49.363444,
        "Longitude": 8.255166,
        "DistanceUnit": 0
    },
    "Connections": [
        {
            "ID": 283387,
            "ConnectionTypeID": 25,
            "StatusTypeID": 50,
            "LevelID": 2,
            "PowerKW": 22,
            "CurrentTypeID": 20
        },
        {
            "ID": 283388,
            "ConnectionTypeID": 25,
            "StatusTypeID": 50,
            "LevelID": 2,
            "PowerKW": 22,
            "CurrentTypeID": 20
        }
    ],
    "StatusTypeID": 50,
    "DateLastStatusUpdate": "2021-07-12T02:43:00Z",
    "MetadataValues": [
        {
            "ID": 12672,
            "MetadataFieldID": 4,
            "ItemValue": "Data from the German chargepoint registry provided by Bundesnetzagentur.de under the CC-BY 4.0 license"
        }
    ],
    "DataQualityLevel": 3,
    "DateCreated": "2021-07-08T10:00:00Z",
    "SubmissionStatusTypeID": 100
}