{
    "IsRecentlyVerified": false,
    "ID": 50813,
    "UUID": "B8B450C2-0B00-4DDB-8193-017A74B3E458",
    "DataProviderID": 26,
    "DataProvidersReference": "66058",
    "OperatorID": 103,
    "OperatorsReference": "Allego NLALLEGO0002822",
    "UsageCost": "0.00 jaarabonnement",
    "AddressInfo": {
        "ID": 51159,
        "Title": "Helena Coetsstraat 21",
        "AddressLine1": "Helena Coetsstraat 21",
        "Town": "Arnhem",
        "Postcode": "6815 GN",
        "CountryID": 159,
        "Latitude": 52.0041,
        "Longitude": 5.899422,
        "ContactTelephone1": "0800-3745337",
        "RelatedURL": "http://www.allego.eu/",
        "DistanceUnit": 0
    },
    "Connections": [
        {
            "ID": 62702,
            "ConnectionTypeID": 25,
            "LevelID": 2,
            "PowerKW": 11,
            "CurrentTypeID": 10
        },
        {
            "ID": 62703,
            "ConnectionTypeID": 25,
            "LevelID": 2,
            "PowerKW": 11,
            "CurrentTypeID": 10
        }
    ],
    "NumberOfPoints": 1,
    "StatusTypeID": 50,
    "DateLastStatusUpdate": "2016-06-04T02:43:00Z",
    "DataQualityLevel": 3,
    "DateCreated": "2015-07-22T09:54:00Z",
    "SubmissionStatusTypeID": 100
}