{
    "IsRecentlyVerified": false,
    "ID": 120587,
    "UUID": "CD18F5CD-0D52-4853-86AB-A862D6A45962",
    "DataProviderID": 2,
    "DataProvidersReference": "72892",
    "OperatorID": 1242,
    "UsageTypeID": 1,
    "AddressInfo": {
        "ID": 120933,
        "Title": "AT&T 2 Plano",
        "AddressLine1": "701  N Central Expy",
        "Town": "Plano",
        "StateOrProvince": "TX",
        "Postcode": "75075",
        "CountryID": 2,
        "Latitude": 33.0095992241,
        "Longitude": -96.7088216809,
        "ContactTelephone1": "855-443-3873",
        "AccessComments": "24 hours daily",
        "RelatedURL": "https://www.gewattstation.com",
        "DistanceUnit": 0
    },
    "Connections": [
        {
            "ID": 169943,
            "ConnectionTypeID": 1,
            "LevelID": 2,
            "Amps": 16,
            "Voltage": 230,
            "PowerKW": 3.7,
            "CurrentTypeID": 10,
            "Quantity": 1
        }
    ],
    "DateLastStatusUpdate": "2020-06-26T02:55:00Z",
    "DataQualityLevel": 3,
    "DateCreated": "2019-04-01T04:59:00Z",
    "SubmissionStatusTypeID": 100
}