{
    "IsRecentlyVerified": false,
    "ID": 99475,
    "UUID": "F8E84BCE-B41F-485A-93F6-03D9A651E4A1",
    "DataProviderID": 1,
    "OperatorID": 45,
    "UsageTypeID": 1,
    "UsageCost": "Free",
    "AddressInfo": {
        "ID": 99821,
        "Title": "ON Djúpavík",
        "AddressLine1": "Djúpavogi",
        "AddressLine2": "",
        "Town": "Djúpavogi",
        "StateOrProvince": "",
        "Postcode": "765",
        "CountryID": 105,
        "Latitude": 64.65645,
        "Longitude": -14.283496,
        "ContactTelephone1": "",
        "ContactTelephone2": "",
        "ContactEmail": "",
        "AccessComments": "",
        "RelatedURL": "",
        "DistanceUnit": 0
    },
    "Connections": [
        {
            "ID": 140568,
            "ConnectionTypeID": 33,
            "StatusTypeID": 50,
            "LevelID": 3,
            "PowerKW": 50,
            "CurrentTypeID": 30
        },
        {
            "ID": 140569,
            "ConnectionTypeID": 2,
            "StatusTypeID": 50,
            "LevelID": 3,
            "PowerKW": 50,
            "CurrentTypeID": 30
        },
        {
            "ID": 140570,
            "ConnectionTypeID": 1036,
            "StatusTypeID": 50,
            "LevelID": 3,
            "PowerKW": 44,
            "CurrentTypeID": 20
        }
    ],
    "NumberOfPoints": 1,
    "GeneralComments": "",
    "StatusTypeID": 50,
    "DateLastStatusUpdate": "2018-01-26T19:51:00Z",
    "DataQualityLevel": 1,
    "DateCreated": "2018-01-26T11:00:00Z",
    "SubmissionStatusTypeID": 200
}