{
    "IsRecentlyVerified": false,
    "ID": 74717,
    "UUID": "AF4A8B41-F153-4263-BF04-686A97D502FB",
    "DataProviderID": 1,
    "DataProvidersReference": "3674",
    "AddressInfo": {
        "ID": 75063,
        "Title": "Tuvensenteret, Notodden",
        "AddressLine1": "Tuvenbøygen 2",
        "Town": "NOTODDEN",
        "StateOrProvince": "Vestfold og Telemark",
        "Postcode": "3676",
        "CountryID": 168,
        "Latitude": 59.56593,
        "Longitude": 9.22106,
        "AccessComments": "Ladepunktene er ved nordre inngang som vender mot E134.",
        "DistanceUnit": 0
    },
    "Connections": [
        {
            "ID": 107481,
            "ConnectionTypeID": 0,
            "Reference": "1",
            "LevelID": 2,
            "Amps": 16,
            "Voltage": 230,
            "PowerKW": 3.7,
            "Comments": "Mode 3"
        },
        {
            "ID": 107482,
            "ConnectionTypeID": 0,
            "Reference": "2",
            "LevelID": 2,
            "Amps": 16,
            "Voltage": 230,
            "PowerKW": 3.7,
            "Comments": "Mode 3"
        }
    ],
    "NumberOfPoints": 2,
    "DateLastStatusUpdate": "2020-05-26T08:23:00Z",
    "DataQualityLevel": 2,
    "DateCreated": "2016-12-03T02:36:00Z",
    "SubmissionStatusTypeID": 100
}