{
    "IsRecentlyVerified": false,
    "ID": 151106,
    "UUID": "49990176-A093-44B7-B5C6-3A0BF381F7F7",
    "DataProviderID": 1,
    "OperatorID": 1,
    "UsageTypeID": 1,
    "AddressInfo": {
        "ID": 151459,
        "Title": "NIMES - Allée De L'Amérique Latine ",
        "AddressLine1": "Allée De L'Amérique Latine 30900 NIMES",
        "CountryID": 80,
        "Latitude": 43.821187,
        "Longitude": 4.363303,
        "AccessComments": "24h/24 7j/7 ",
        "DistanceUnit": 0
    },
    "Connections": [
        {
            "ID": 210731,
            "ConnectionTypeID": 33,
            "LevelID": 3,
            "PowerKW": 50,
            "CurrentTypeID": 30
        },
        {
            "ID": 210732,
            "ConnectionTypeID": 25,
            "LevelID": 2,
            "PowerKW": 18,
            "CurrentTypeID": 10
        },
        {
            "ID": 210733,
            "ConnectionTypeID": 26,
            "LevelID": 2,
            "PowerKW": 18
        }
    ],
    "GeneralComments": "Recharge par badge et avec une application smartphone ",
    "StatusTypeID": 50,
    "DateLastStatusUpdate": "2020-07-16T17:33:00Z",
    "DataQualityLevel": 2,
    "DateCreated": "2020-03-15T06:18:00Z",
    "SubmissionStatusTypeID": 100
}