{
    "IsRecentlyVerified": false,
    "ID": 93170,
    "UUID": "2425671F-6968-48E3-95BB-71149D45524C",
    "DataProviderID": 1,
    "OperatorID": 23,
    "OperatorsReference": "35078",
    "UsageTypeID": 4,
    "UsageCost": "$0.21/kWh; other tariffs for older cars",
    "AddressInfo": {
        "ID": 93516,
        "Title": "Chester Supercharger",
        "AddressLine1": "11701 Jefferson Davis Highway",
        "Town": "Chester",
        "Postcode": "23831",
        "CountryID": 2,
        "Latitude": 37.367264,
        "Longitude": -77.416961,
        "DistanceUnit": 0
    },
    "Connections": [
        {
            "ID": 131976,
            "ConnectionTypeID": 27,
            "StatusTypeID": 50,
            "LevelID": 3,
            "PowerKW": 120,
            "CurrentTypeID": 30,
            "Quantity": 8
        }
    ],
    "NumberOfPoints": 8,
    "GeneralComments": "Charging8 Superchargers, available 24/7, up to 120kW",
    "StatusTypeID": 50,
    "DateLastStatusUpdate": "2018-03-13T13:46:00Z",
    "DataQualityLevel": 1,
    "DateCreated": "2017-09-21T05:34:00Z",
    "SubmissionStatusTypeID": 200
}