{
    "IsRecentlyVerified": false,
    "ID": 142843,
    "UUID": "09DEED04-B4DB-4300-9317-61B9F353DA7F",
    "DataProviderID": 2,
    "DataProvidersReference": "93510",
    "OperatorID": 15,
    "UsageTypeID": 4,
    "AddressInfo": {
        "ID": 143195,
        "Title": "Hilton Garden Inn",
        "AddressLine1": "220 India St",
        "Town": "Providence",
        "StateOrProvince": "RI",
        "Postcode": "02903",
        "CountryID": 2,
        "Latitude": 41.818569,
        "Longitude": -71.391405,
        "ContactTelephone1": "877-455-3833",
        "AccessComments": "24 hours daily\r\nPublic - Card key at all times",
        "RelatedURL": "https://www.evgo.com/",
        "DistanceUnit": 0
    },
    "Connections": [
        {
            "ID": 199069,
            "ConnectionTypeID": 2,
            "LevelID": 3,
            "Amps": 100,
            "Voltage": 400,
            "PowerKW": 40,
            "CurrentTypeID": 30,
            "Quantity": 1
        },
        {
            "ID": 199070,
            "ConnectionTypeID": 32,
            "LevelID": 3,
            "Amps": 100,
            "Voltage": 400,
            "PowerKW": 40,
            "CurrentTypeID": 30,
            "Quantity": 1
        }
    ],
    "StatusTypeID": 50,
    "DateLastStatusUpdate": "2020-06-26T03:05:00Z",
    "DataQualityLevel": 3,
    "DateCreated": "2019-12-24T09:19:00Z",
    "SubmissionStatusTypeID": 100
}