{
    "IsRecentlyVerified": false,
    "ID": 135996,
    "UUID": "337D8ABA-6C11-4C75-84D8-EB284CA2365E",
    "DataProviderID": 18,
    "DataProvidersReference": "cefb4b45542b2c02118250c369e627e1",
    "OperatorID": 2244,
    "UsageTypeID": 5,
    "AddressInfo": {
        "ID": 136342,
        "Title": "Asset No: 30K0459",
        "AddressLine1": "Asset No: 30K0459",
        "Town": "London",
        "Postcode": "SE7 7JE",
        "CountryID": 1,
        "Latitude": 51.479175,
        "Longitude": 0.022578,
        "AccessComments": "",
        "RelatedURL": "https://www.ubitricity.com",
        "DistanceUnit": 0
    },
    "Connections": [
        {
            "ID": 190423,
            "ConnectionTypeID": 25,
            "Reference": "suby1100001142",
            "StatusTypeID": 50,
            "LevelID": 2,
            "Amps": 16,
            "Voltage": 230,
            "PowerKW": 3.7,
            "CurrentTypeID": 10
        }
    ],
    "StatusTypeID": 0,
    "DateLastStatusUpdate": "2021-04-25T05:46:00Z",
    "MetadataValues": [
        {
            "ID": 5848,
            "MetadataFieldID": 4,
            "ItemValue": "Contains public sector information licensed under the Open Government Licence v2.0. http://www.nationalarchives.gov.uk/doc/open-government-licence/version/2/"
        }
    ],
    "DataQualityLevel": 3,
    "DateCreated": "2019-12-24T05:22:00Z",
    "SubmissionStatusTypeID": 100
}