{
    "IsRecentlyVerified": false,
    "ID": 123758,
    "UUID": "D76D0EE2-28AA-44B7-A1C7-25D8914A0B5D",
    "DataProviderID": 2,
    "DataProvidersReference": "88016",
    "OperatorID": 5,
    "UsageTypeID": 1,
    "AddressInfo": {
        "ID": 124104,
        "Title": "VALLEY FAIR",
        "AddressLine1": "48 Dorcich St",
        "Town": "San Jose",
        "StateOrProvince": "CA",
        "Postcode": "95128",
        "CountryID": 2,
        "Latitude": 37.3258958,
        "Longitude": -121.9475811,
        "ContactTelephone1": "888-758-4389",
        "AccessComments": "24 hours daily",
        "RelatedURL": "http://www.chargepoint.com/",
        "DistanceUnit": 0
    },
    "Connections": [
        {
            "ID": 173781,
            "ConnectionTypeID": 1,
            "LevelID": 2,
            "Amps": 16,
            "Voltage": 230,
            "PowerKW": 3,
            "CurrentTypeID": 10,
            "Quantity": 2
        }
    ],
    "DateLastStatusUpdate": "2019-12-24T09:13:00Z",
    "DataQualityLevel": 3,
    "DateCreated": "2019-04-06T05:03:00Z",
    "SubmissionStatusTypeID": 100
}