{
    "IsRecentlyVerified": false,
    "ID": 154337,
    "UUID": "9BE53CC5-D9F8-4235-A9FC-0DEFAAD13626",
    "DataProviderID": 28,
    "DataProvidersReference": "FR*SOD*P*SDE7*85*_*_*_",
    "OperatorID": 3262,
    "UsageTypeID": 5,
    "AddressInfo": {
        "ID": 154690,
        "Title": "Saint-Jean-du-Cardonnay",
        "AddressLine1": "Rue de l'Eglise",
        "CountryID": 80,
        "Latitude": 49.50685,
        "Longitude": 1.00664444,
        "AccessComments": "24/24 7/7",
        "DistanceUnit": 0
    },
    "Connections": [
        {
            "ID": 216988,
            "ConnectionTypeID": 28,
            "StatusTypeID": 50,
            "LevelID": 2,
            "PowerKW": 22,
            "CurrentTypeID": 10
        },
        {
            "ID": 216989,
            "ConnectionTypeID": 1036,
            "StatusTypeID": 50,
            "LevelID": 2,
            "PowerKW": 22,
            "CurrentTypeID": 20
        },
        {
            "ID": 251395,
            "ConnectionTypeID": 28,
            "StatusTypeID": 50,
            "LevelID": 2,
            "PowerKW": 22,
            "CurrentTypeID": 10
        },
        {
            "ID": 251396,
            "ConnectionTypeID": 1036,
            "StatusTypeID": 50,
            "LevelID": 2,
            "PowerKW": 22,
            "CurrentTypeID": 20
        }
    ],
    "GeneralComments": "RFID et application",
    "StatusTypeID": 50,
    "DateLastStatusUpdate": "2020-08-27T05:16:00Z",
    "DataQualityLevel": 2,
    "DateCreated": "2020-03-15T10:55:00Z",
    "SubmissionStatusTypeID": 100
}