{
    "IsRecentlyVerified": false,
    "ID": 5693,
    "UUID": "7AD1D6CE-8A92-4D17-B678-8071721F3B9D",
    "DataProviderID": 1,
    "OperatorID": 1,
    "UsageTypeID": 1,
    "AddressInfo": {
        "ID": 5615,
        "Title": "Mellow Johnny's Bike Shop",
        "AddressLine1": "400 Nueces St.",
        "AddressLine2": "",
        "Town": "Austin",
        "StateOrProvince": "TX",
        "Postcode": "78701",
        "CountryID": 2,
        "Latitude": 30.268109,
        "Longitude": -97.749269,
        "ContactTelephone1": "+1 512 473-0222",
        "ContactEmail": "",
        "AccessComments": "AeroVironment EVSE, free access",
        "DistanceUnit": 0
    },
    "Connections": [
        {
            "ID": 442,
            "ConnectionTypeID": 1,
            "LevelID": 2,
            "Quantity": 1
        }
    ],
    "NumberOfPoints": 1,
    "GeneralComments": "Verified free & operational in Jul 2011",
    "DateLastConfirmed": "2011-09-09T04:19:00Z",
    "StatusTypeID": 50,
    "DateLastStatusUpdate": "2011-09-09T04:19:00Z",
    "DataQualityLevel": 1,
    "DateCreated": "2011-09-09T04:19:00Z",
    "SubmissionStatusTypeID": 200
}