{
    "IsRecentlyVerified": false,
    "ID": 166940,
    "UUID": "C6B7D38C-439A-4468-B50D-2B3E6A87D48C",
    "DataProviderID": 28,
    "DataProvidersReference": "FR*H11*P62412*001",
    "OperatorID": 3409,
    "UsageTypeID": 5,
    "AddressInfo": {
        "ID": 167299,
        "Title": "HARDINGHEN - Rue Maurice Brouta",
        "AddressLine1": "Rue Maurice Brouta 62132 HARDINGHEN",
        "CountryID": 80,
        "Latitude": 50.806114,
        "Longitude": 1.818632,
        "AccessComments": "24h/24 7j/7",
        "DistanceUnit": 0
    },
    "Connections": [
        {
            "ID": 252731,
            "ConnectionTypeID": 28,
            "StatusTypeID": 50,
            "LevelID": 2,
            "PowerKW": 22,
            "CurrentTypeID": 10
        },
        {
            "ID": 252732,
            "ConnectionTypeID": 1036,
            "StatusTypeID": 50,
            "LevelID": 2,
            "PowerKW": 22,
            "CurrentTypeID": 20
        },
        {
            "ID": 252733,
            "ConnectionTypeID": 28,
            "StatusTypeID": 50,
            "LevelID": 2,
            "PowerKW": 22,
            "CurrentTypeID": 10
        },
        {
            "ID": 252734,
            "ConnectionTypeID": 1036,
            "StatusTypeID": 50,
            "LevelID": 2,
            "PowerKW": 22,
            "CurrentTypeID": 20
        }
    ],
    "GeneralComments": "Recharge par badge et avec une application smartphone",
    "StatusTypeID": 50,
    "DateLastStatusUpdate": "2020-08-27T05:16:00Z",
    "DataQualityLevel": 2,
    "DateCreated": "2020-08-27T05:16:00Z",
    "SubmissionStatusTypeID": 100
}