{
    "IsRecentlyVerified": false,
    "ID": 20141,
    "UUID": "BD2CDA47-01A3-4FF2-8BBB-CF8BD8E39572",
    "DataProviderID": 1,
    "OperatorID": 1,
    "UsageTypeID": 0,
    "UsageCost": "",
    "AddressInfo": {
        "ID": 20486,
        "Title": "Particulier - Lourdes",
        "AddressLine1": "16 Chemin de Soum de Lanne",
        "AddressLine2": "",
        "Town": "",
        "StateOrProvince": "Lourdes",
        "Postcode": "65100",
        "CountryID": 80,
        "Latitude": 43.08659,
        "Longitude": -0.04778,
        "ContactTelephone1": "",
        "ContactTelephone2": "",
        "ContactEmail": "",
        "AccessComments": "Ouvert à tous",
        "RelatedURL": "",
        "DistanceUnit": 0
    },
    "Connections": [],
    "GeneralComments": "",
    "StatusTypeID": 50,
    "DateLastStatusUpdate": "2013-11-04T21:07:00Z",
    "DataQualityLevel": 1,
    "DateCreated": "2013-11-04T00:02:00Z",
    "SubmissionStatusTypeID": 200
}