{
    "IsRecentlyVerified": false,
    "ID": 158816,
    "UUID": "6AA1D6CD-D2F6-4F69-925B-35FF35400DA2",
    "DataProviderID": 2,
    "DataProvidersReference": "158525",
    "OperatorID": 5,
    "UsageTypeID": 1,
    "AddressInfo": {
        "ID": 159173,
        "Title": "CY AGOURA HILLS",
        "AddressLine1": "29505 Agoura Rd",
        "Town": "Agoura Hills",
        "StateOrProvince": "CA",
        "Postcode": "91301",
        "CountryID": 2,
        "Latitude": 34.145388,
        "Longitude": -118.769647,
        "ContactTelephone1": "888-758-4389",
        "AccessComments": "24 hours daily",
        "RelatedURL": "http://www.chargepoint.com/",
        "DistanceUnit": 0
    },
    "Connections": [
        {
            "ID": 228850,
            "ConnectionTypeID": 1,
            "LevelID": 2,
            "Amps": 16,
            "Voltage": 230,
            "PowerKW": 3.7,
            "CurrentTypeID": 10,
            "Quantity": 10
        }
    ],
    "StatusTypeID": 50,
    "DateLastStatusUpdate": "2020-06-26T02:57:00Z",
    "DataQualityLevel": 3,
    "DateCreated": "2020-06-26T02:57:00Z",
    "SubmissionStatusTypeID": 100
}