{
    "IsRecentlyVerified": false,
    "ID": 119706,
    "UUID": "8257E4F0-15B0-4BCD-8450-33356C26189E",
    "DataProviderID": 2,
    "DataProvidersReference": "77835",
    "UsageTypeID": 2,
    "AddressInfo": {
        "ID": 120052,
        "Title": "Florida Power & Light - St. Lucie Service Center",
        "AddressLine1": "3301 Orange Ave",
        "Town": "Fort Pierce",
        "StateOrProvince": "FL",
        "Postcode": "34947",
        "CountryID": 2,
        "Latitude": 27.446531,
        "Longitude": -80.359154,
        "ContactTelephone1": "",
        "AccessComments": "Fleet use only",
        "RelatedURL": "",
        "DistanceUnit": 0
    },
    "Connections": [
        {
            "ID": 168987,
            "ConnectionTypeID": 9,
            "LevelID": 1,
            "Amps": 16,
            "Voltage": 120,
            "PowerKW": 1.9,
            "CurrentTypeID": 10,
            "Quantity": 6
        }
    ],
    "DateLastStatusUpdate": "2020-06-26T02:52:00Z",
    "DataQualityLevel": 3,
    "DateCreated": "2019-04-01T04:59:00Z",
    "SubmissionStatusTypeID": 100
}