{
    "IsRecentlyVerified": false,
    "ID": 108912,
    "UUID": "C9B952CD-1BBD-44D6-A460-CD4BC6FCE907",
    "DataProviderID": 1,
    "OperatorID": 23,
    "OperatorsReference": "45830",
    "UsageTypeID": 4,
    "AddressInfo": {
        "ID": 109258,
        "Title": "Glo Desoto Dallas",
        "AddressLine1": "1215 N I-35 E",
        "Town": "DeSoto",
        "StateOrProvince": "Texas",
        "Postcode": "75115",
        "CountryID": 2,
        "Latitude": 32.570158,
        "Longitude": -96.823234,
        "ContactTelephone1": "(972) 283-3000",
        "DistanceUnit": 0
    },
    "Connections": [
        {
            "ID": 154029,
            "ConnectionTypeID": 30,
            "StatusTypeID": 50,
            "LevelID": 2,
            "PowerKW": 16,
            "CurrentTypeID": 20,
            "Quantity": 3
        }
    ],
    "NumberOfPoints": 3,
    "GeneralComments": "3 Tesla Connectors, up to 16kW.Available for customers. Please see front desk.",
    "StatusTypeID": 50,
    "DateLastStatusUpdate": "2018-10-11T13:03:00Z",
    "DataQualityLevel": 1,
    "DateCreated": "2018-10-11T13:03:00Z",
    "SubmissionStatusTypeID": 200
}