{
    "IsRecentlyVerified": false,
    "ID": 141215,
    "UUID": "85EE0EBA-5243-46B1-820A-63C980A5552D",
    "DataProviderID": 2,
    "DataProvidersReference": "112882",
    "OperatorID": 23,
    "UsageTypeID": 7,
    "AddressInfo": {
        "ID": 141567,
        "Title": "Chateau Montelena Winery - Tesla Destination",
        "AddressLine1": "1429 Tubbs Ln",
        "Town": "Calistoga",
        "StateOrProvince": "CA",
        "Postcode": "94515",
        "CountryID": 2,
        "Latitude": 38.607568,
        "Longitude": -122.603962,
        "ContactTelephone1": "707-942-5105  877-798-3752",
        "AccessComments": "24 hours daily; for customer use only\r\nPublic - Call ahead",
        "RelatedURL": "https://www.tesla.com/destination-charging",
        "DistanceUnit": 0
    },
    "Connections": [
        {
            "ID": 197083,
            "ConnectionTypeID": 30,
            "LevelID": 2,
            "Amps": 16,
            "Voltage": 230,
            "PowerKW": 3.7,
            "CurrentTypeID": 10,
            "Quantity": 4
        }
    ],
    "StatusTypeID": 50,
    "DateLastStatusUpdate": "2020-06-26T03:00:00Z",
    "DataQualityLevel": 3,
    "DateCreated": "2019-12-24T09:15:00Z",
    "SubmissionStatusTypeID": 100
}