{
    "IsRecentlyVerified": false,
    "ID": 101093,
    "UUID": "D452FC6E-7DF5-400A-B7B9-8EFB5F70E414",
    "DataProviderID": 1,
    "OperatorID": 23,
    "OperatorsReference": "41518",
    "UsageTypeID": 4,
    "AddressInfo": {
        "ID": 101439,
        "Title": "The Sustainable City",
        "AddressLine1": "The Sustainable City",
        "Town": "nr Emirates Road",
        "StateOrProvince": "Dubai",
        "CountryID": 235,
        "Latitude": 25.026894,
        "Longitude": 55.273119,
        "ContactTelephone1": "+971 4 347 5955",
        "DistanceUnit": 0
    },
    "Connections": [
        {
            "ID": 142721,
            "ConnectionTypeID": 30,
            "StatusTypeID": 50,
            "LevelID": 2,
            "Amps": 32,
            "Voltage": 230,
            "PowerKW": 7,
            "CurrentTypeID": 10,
            "Quantity": 1
        }
    ],
    "NumberOfPoints": 1,
    "GeneralComments": "1 Tesla Connector, up to 7kW.Available to the public. Self park.",
    "StatusTypeID": 50,
    "DateLastStatusUpdate": "2018-10-04T00:07:00Z",
    "DataQualityLevel": 1,
    "DateCreated": "2018-03-17T07:07:00Z",
    "SubmissionStatusTypeID": 200
}