{
    "IsRecentlyVerified": false,
    "ID": 72879,
    "UUID": "79FE6D25-7A40-4EF6-8349-D4379590558E",
    "DataProviderID": 2,
    "DataProvidersReference": "78906",
    "OperatorID": 5,
    "UsageTypeID": 1,
    "AddressInfo": {
        "ID": 73225,
        "Title": "PIE AE",
        "AddressLine1": "Camp Mabry 1 Mile Track",
        "Town": "Austin",
        "StateOrProvince": "TX",
        "Postcode": "78703",
        "CountryID": 2,
        "Latitude": 30.3165756,
        "Longitude": -97.7576429,
        "ContactTelephone1": "888-758-4389",
        "AccessComments": "24 hours daily",
        "RelatedURL": "http://www.chargepoint.com/",
        "DistanceUnit": 0
    },
    "Connections": [
        {
            "ID": 104543,
            "ConnectionTypeID": 9,
            "LevelID": 1,
            "Amps": 16,
            "Voltage": 120,
            "PowerKW": 1,
            "CurrentTypeID": 10,
            "Quantity": 2
        },
        {
            "ID": 104544,
            "ConnectionTypeID": 1,
            "LevelID": 2,
            "Amps": 16,
            "Voltage": 230,
            "PowerKW": 3,
            "CurrentTypeID": 10,
            "Quantity": 2
        }
    ],
    "DateLastStatusUpdate": "2019-12-24T09:08:00Z",
    "DataQualityLevel": 3,
    "DateCreated": "2016-11-01T13:06:00Z",
    "SubmissionStatusTypeID": 100
}