{
    "IsRecentlyVerified": false,
    "ID": 68672,
    "UUID": "3B4376F5-AACD-4DB1-BBDC-639CCFFF88B0",
    "DataProviderID": 1,
    "OperatorID": 2241,
    "UsageTypeID": 4,
    "AddressInfo": {
        "ID": 69018,
        "Title": "Bahnhof",
        "AddressLine1": "Bahnhofstraße 2",
        "Town": "Sulzfeld",
        "StateOrProvince": "Verwaltungsgemeinschaft Sulzfeld",
        "Postcode": "75056",
        "CountryID": 87,
        "Latitude": 49.108199558368966,
        "Longitude": 8.851712769242098,
        "AccessComments": "24/7 verfügbar. Freischaltbar mit EWB Ladekarte oder per SMS nach Registrierung. Alternativ kann im Rathaus Mo-Fr. von 8:00 - 16:00 Uhr eine RFID-Karte ausgeliehen werden.",
        "RelatedURL": "http://www.ewb-bruchsal.de",
        "DistanceUnit": 0
    },
    "Connections": [
        {
            "ID": 96305,
            "ConnectionTypeID": 25,
            "StatusTypeID": 50,
            "LevelID": 2,
            "Amps": 32,
            "Voltage": 400,
            "PowerKW": 11,
            "CurrentTypeID": 20,
            "Quantity": 2
        },
        {
            "ID": 96306,
            "ConnectionTypeID": 28,
            "StatusTypeID": 50,
            "LevelID": 2,
            "Amps": 16,
            "Voltage": 230,
            "PowerKW": 3.7,
            "CurrentTypeID": 10,
            "Quantity": 2
        }
    ],
    "NumberOfPoints": 2,
    "StatusTypeID": 50,
    "DateLastStatusUpdate": "2016-06-15T09:15:00Z",
    "DataQualityLevel": 1,
    "DateCreated": "2016-06-15T09:15:00Z",
    "SubmissionStatusTypeID": 200
}