{
    "IsRecentlyVerified": false,
    "ID": 157830,
    "UUID": "78E8EFD7-412C-4E35-9EDB-26843F221081",
    "DataProviderID": 18,
    "DataProvidersReference": "3510418ba022e024e342ea5ebff9c756",
    "OperatorID": 8,
    "UsageTypeID": 4,
    "AddressInfo": {
        "ID": 158184,
        "Title": "College Street",
        "AddressLine1": "College Street",
        "Town": "Bristol",
        "Postcode": "BS1 5UU",
        "CountryID": 1,
        "Latitude": 51.451996,
        "Longitude": -2.602646,
        "AccessComments": "",
        "RelatedURL": "https://www.bpchargemaster.com",
        "DistanceUnit": 0
    },
    "Connections": [
        {
            "ID": 227416,
            "ConnectionTypeID": 25,
            "Reference": "1",
            "StatusTypeID": 50,
            "LevelID": 2,
            "Amps": 32,
            "Voltage": 230,
            "PowerKW": 7,
            "CurrentTypeID": 10
        }
    ],
    "StatusTypeID": 0,
    "DateLastStatusUpdate": "2020-06-25T10:00:00Z",
    "MetadataValues": [
        {
            "ID": 7363,
            "MetadataFieldID": 4,
            "ItemValue": "Contains public sector information licensed under the Open Government Licence v2.0. http://www.nationalarchives.gov.uk/doc/open-government-licence/version/2/"
        }
    ],
    "DataQualityLevel": 3,
    "DateCreated": "2020-06-25T10:00:00Z",
    "SubmissionStatusTypeID": 100
}