{
    "IsRecentlyVerified": false,
    "ID": 84191,
    "UUID": "0F7327D8-599D-4804-B572-6457C11222B8",
    "DataProviderID": 1,
    "OperatorID": 23,
    "OperatorsReference": "24374",
    "UsageTypeID": 4,
    "AddressInfo": {
        "ID": 84537,
        "Title": "Sigtunahojden Hotell Och Konferens Ab",
        "AddressLine1": "7 Hertigvägen",
        "Town": "Sigtuna",
        "Postcode": "19331",
        "CountryID": 216,
        "Latitude": 59.61964,
        "Longitude": 17.68839,
        "ContactTelephone1": "+46 859 25 77 00",
        "DistanceUnit": 0
    },
    "Connections": [
        {
            "ID": 119592,
            "ConnectionTypeID": 30,
            "StatusTypeID": 50,
            "LevelID": 2,
            "Amps": 16,
            "Voltage": 400,
            "PowerKW": 11,
            "CurrentTypeID": 20,
            "Quantity": 2
        }
    ],
    "NumberOfPoints": 2,
    "GeneralComments": "2 Tesla Connectors, up to 11kW.Available for customers. Please see front desk.",
    "StatusTypeID": 50,
    "DateLastStatusUpdate": "2018-10-03T18:10:00Z",
    "DataQualityLevel": 1,
    "DateCreated": "2017-02-16T17:11:00Z",
    "SubmissionStatusTypeID": 200
}