{
    "IsRecentlyVerified": false,
    "ID": 152299,
    "UUID": "636C2F41-15FB-4E1A-8E29-3C54EC6C50B2",
    "DataProviderID": 28,
    "DataProvidersReference": "",
    "UsageTypeID": 5,
    "AddressInfo": {
        "ID": 152652,
        "Title": "PREUILLY SUR CLAISE 4339",
        "AddressLine1": "place de l'hotel de ville - 37290 PREUILLY SUR CLAISE",
        "CountryID": 80,
        "Latitude": 46.854559,
        "Longitude": 0.929119,
        "AccessComments": "24/24 7/7",
        "DistanceUnit": 0
    },
    "Connections": [
        {
            "ID": 213164,
            "ConnectionTypeID": 28,
            "StatusTypeID": 50,
            "LevelID": 2,
            "PowerKW": 18,
            "CurrentTypeID": 10
        },
        {
            "ID": 213165,
            "ConnectionTypeID": 25,
            "StatusTypeID": 50,
            "LevelID": 2,
            "PowerKW": 18,
            "CurrentTypeID": 10
        }
    ],
    "GeneralComments": "www.virtaev.fr",
    "StatusTypeID": 50,
    "DateLastStatusUpdate": "2020-03-15T10:53:00Z",
    "DataQualityLevel": 2,
    "DateCreated": "2020-03-15T10:53:00Z",
    "SubmissionStatusTypeID": 100
}