{
    "IsRecentlyVerified": false,
    "ID": 113342,
    "UUID": "DD00FAFD-2844-4BD6-8422-53FF2DC39BFC",
    "DataProviderID": 1,
    "OperatorID": 69,
    "UsageTypeID": 4,
    "AddressInfo": {
        "ID": 113688,
        "Title": "Volksbank",
        "AddressLine1": "Hauptstraße 77",
        "Town": "Lilienthal",
        "StateOrProvince": "Landkreis Osterholz",
        "Postcode": "28865",
        "CountryID": 87,
        "Latitude": 53.14451854250953,
        "Longitude": 8.909440884655755,
        "AccessComments": "24/7 nutzbare blaue Ladesäule auf dem Parkplatz vor dem Haupteingang.",
        "DistanceUnit": 0
    },
    "Connections": [
        {
            "ID": 159611,
            "ConnectionTypeID": 25,
            "StatusTypeID": 50,
            "LevelID": 2,
            "Amps": 32,
            "Voltage": 400,
            "PowerKW": 22,
            "CurrentTypeID": 20,
            "Quantity": 2
        }
    ],
    "NumberOfPoints": 2,
    "StatusTypeID": 50,
    "DateLastStatusUpdate": "2018-12-04T08:36:00Z",
    "DataQualityLevel": 1,
    "DateCreated": "2018-12-04T08:36:00Z",
    "SubmissionStatusTypeID": 200
}