{
    "IsRecentlyVerified": false,
    "ID": 139564,
    "UUID": "1650CE34-E703-4E2B-B052-BBD680C7759B",
    "DataProviderID": 2,
    "DataProvidersReference": "146912",
    "OperatorID": 59,
    "UsageTypeID": 1,
    "AddressInfo": {
        "ID": 139916,
        "Title": "Greenlots - 12602",
        "AddressLine1": "6279 Westchester Pkwy",
        "Town": "Los Angeles",
        "StateOrProvince": "CA",
        "Postcode": "90045",
        "CountryID": 2,
        "Latitude": 33.9546928405762,
        "Longitude": -118.395774841309,
        "ContactTelephone1": "855-900-7584",
        "AccessComments": "24 hours daily",
        "RelatedURL": "http://greenlots.com/",
        "DistanceUnit": 0
    },
    "Connections": [
        {
            "ID": 194969,
            "ConnectionTypeID": 1,
            "LevelID": 2,
            "Amps": 16,
            "Voltage": 230,
            "PowerKW": 3.7,
            "CurrentTypeID": 10,
            "Quantity": 1
        }
    ],
    "StatusTypeID": 50,
    "DateLastStatusUpdate": "2020-06-26T02:56:00Z",
    "DataQualityLevel": 3,
    "DateCreated": "2019-12-24T09:11:00Z",
    "SubmissionStatusTypeID": 100
}