{
    "IsRecentlyVerified": false,
    "ID": 121240,
    "UUID": "B267C085-A22F-4516-81B4-F70D3D1D746F",
    "DataProviderID": 2,
    "DataProvidersReference": "120818",
    "OperatorID": 5,
    "UsageTypeID": 1,
    "AddressInfo": {
        "ID": 121586,
        "Title": "HUNTINGTON",
        "AddressLine1": "5550 New Albany Rd E",
        "Town": "New Albany",
        "StateOrProvince": "OH",
        "Postcode": "43054",
        "CountryID": 2,
        "Latitude": 40.0952707,
        "Longitude": -82.8192322,
        "ContactTelephone1": "888-758-4389",
        "AccessComments": "24 hours daily",
        "RelatedURL": "http://www.chargepoint.com/",
        "DistanceUnit": 0
    },
    "Connections": [
        {
            "ID": 170680,
            "ConnectionTypeID": 1,
            "LevelID": 2,
            "Amps": 16,
            "Voltage": 230,
            "PowerKW": 3.7,
            "CurrentTypeID": 10,
            "Quantity": 2
        }
    ],
    "DateLastStatusUpdate": "2020-06-26T03:02:00Z",
    "DataQualityLevel": 3,
    "DateCreated": "2019-04-01T05:00:00Z",
    "SubmissionStatusTypeID": 100
}