{
    "IsRecentlyVerified": false,
    "ID": 14484,
    "UUID": "2CFC31F9-B8BF-4B6C-AB4A-3F66BC0BF68D",
    "DataProviderID": 2,
    "DataProvidersReference": "47796",
    "UsageTypeID": 7,
    "AddressInfo": {
        "ID": 14381,
        "Title": "Wright Automotive Group",
        "AddressLine1": "10520 Perry Hwy",
        "Town": "Wexford",
        "StateOrProvince": "PA",
        "Postcode": "15090",
        "CountryID": 2,
        "Latitude": 40.610785,
        "Longitude": -80.053089,
        "ContactTelephone1": "",
        "AccessComments": "Dealership business hours; contact 724-935-4646 for more information\r\nPublic - Call ahead",
        "RelatedURL": "",
        "DistanceUnit": 0
    },
    "Connections": [
        {
            "ID": 16647,
            "ConnectionTypeID": 1,
            "LevelID": 2,
            "Amps": 16,
            "Voltage": 230,
            "PowerKW": 3.7,
            "CurrentTypeID": 10,
            "Quantity": 1
        },
        {
            "ID": 21771,
            "ConnectionTypeID": 2,
            "LevelID": 3,
            "Amps": 100,
            "Voltage": 400,
            "PowerKW": 40,
            "CurrentTypeID": 30,
            "Quantity": 1
        },
        {
            "ID": 157813,
            "ConnectionTypeID": 32,
            "LevelID": 2,
            "Amps": 100,
            "Voltage": 400,
            "PowerKW": 40,
            "CurrentTypeID": 10,
            "Quantity": 1
        }
    ],
    "DateLastStatusUpdate": "2020-06-26T03:03:00Z",
    "DataQualityLevel": 3,
    "DateCreated": "2012-12-06T16:49:00Z",
    "SubmissionStatusTypeID": 100
}