{
    "IsRecentlyVerified": false,
    "ID": 137374,
    "UUID": "5ADB44C4-F4AF-45E0-8FEB-91CD3EFB7A32",
    "DataProviderID": 2,
    "DataProvidersReference": "145004",
    "OperatorID": 5,
    "UsageTypeID": 1,
    "AddressInfo": {
        "ID": 137720,
        "Title": "BMW SOUTH ORL",
        "AddressLine1": "9750 S Orange Blossom Trail",
        "Town": "Orlando",
        "StateOrProvince": "FL",
        "Postcode": "32837",
        "CountryID": 2,
        "Latitude": 28.4145298,
        "Longitude": -81.4051631,
        "ContactTelephone1": "888-758-4389",
        "AccessComments": "24 hours daily",
        "RelatedURL": "http://www.chargepoint.com/",
        "DistanceUnit": 0
    },
    "Connections": [
        {
            "ID": 192273,
            "ConnectionTypeID": 1,
            "LevelID": 2,
            "Amps": 16,
            "Voltage": 230,
            "PowerKW": 3,
            "CurrentTypeID": 10,
            "Quantity": 2
        }
    ],
    "StatusTypeID": 50,
    "DateLastStatusUpdate": "2019-12-24T09:05:00Z",
    "DataQualityLevel": 3,
    "DateCreated": "2019-12-24T09:05:00Z",
    "SubmissionStatusTypeID": 100
}