{
    "IsRecentlyVerified": false,
    "ID": 64479,
    "UUID": "22060117-CD06-4B91-9421-F983620D68E8",
    "DataProviderID": 1,
    "OperatorID": 98,
    "UsageTypeID": 4,
    "AddressInfo": {
        "ID": 64825,
        "Title": "Rheingauer Dom",
        "AddressLine1": "Bischof-Blum-Str",
        "Town": "Geisenheim",
        "StateOrProvince": "Rheingau-Taunus-Kreis",
        "Postcode": "65366",
        "CountryID": 87,
        "Latitude": 49.9829367,
        "Longitude": 7.96707739999999,
        "AccessComments": "An der Nordseite des Doms an Einmündung Neustraße, gelber Steckdosenkasten an 4 stehenden Holzbalken.Box F-150.",
        "RelatedURL": "http://www.www.geisenheim.de",
        "DistanceUnit": 0
    },
    "Connections": [
        {
            "ID": 82743,
            "ConnectionTypeID": 16,
            "StatusTypeID": 50,
            "LevelID": 2,
            "Amps": 16,
            "Voltage": 230,
            "PowerKW": 3.7,
            "CurrentTypeID": 10,
            "Quantity": 1
        },
        {
            "ID": 82744,
            "ConnectionTypeID": 17,
            "StatusTypeID": 50,
            "LevelID": 2,
            "Amps": 16,
            "Voltage": 400,
            "PowerKW": 11,
            "CurrentTypeID": 20,
            "Quantity": 1
        },
        {
            "ID": 82745,
            "ConnectionTypeID": 28,
            "StatusTypeID": 50,
            "LevelID": 2,
            "Amps": 16,
            "Voltage": 230,
            "PowerKW": 3.7,
            "CurrentTypeID": 10,
            "Quantity": 1
        }
    ],
    "NumberOfPoints": 1,
    "StatusTypeID": 50,
    "DateLastStatusUpdate": "2016-03-08T12:36:00Z",
    "DataQualityLevel": 1,
    "DateCreated": "2016-03-08T12:36:00Z",
    "SubmissionStatusTypeID": 200
}