{
    "IsRecentlyVerified": false,
    "ID": 52187,
    "UUID": "07C94CEC-D6FD-456B-B1BF-D246C1012F9F",
    "DataProviderID": 1,
    "OperatorID": 161,
    "UsageTypeID": 4,
    "UsageCost": "0",
    "AddressInfo": {
        "ID": 52533,
        "Title": " Hallesche Verkehrs-AG",
        "AddressLine1": "Freiimfelder Straße 74",
        "AddressLine2": "Thaerviertel",
        "Town": "Halle (Saale)",
        "StateOrProvince": "Halle (Saale)",
        "Postcode": "06108",
        "CountryID": 87,
        "Latitude": 51.48521,
        "Longitude": 11.99501,
        "ContactTelephone1": "+49 345 581-2222",
        "AccessComments": "2 kostenlose Parkplätze auf dem Betriebsgelände. Ladekarte der Stadtwerke Halle erforderlich. ",
        "RelatedURL": "http://www.stadtwerke-halle.de/",
        "DistanceUnit": 0
    },
    "Connections": [
        {
            "ID": 64781,
            "ConnectionTypeID": 25,
            "StatusTypeID": 50,
            "LevelID": 2,
            "Amps": 32,
            "Voltage": 400,
            "PowerKW": 22,
            "CurrentTypeID": 20,
            "Quantity": 1
        },
        {
            "ID": 64782,
            "ConnectionTypeID": 25,
            "StatusTypeID": 50,
            "LevelID": 2,
            "Amps": 32,
            "Voltage": 400,
            "PowerKW": 22,
            "CurrentTypeID": 20,
            "Quantity": 1
        }
    ],
    "NumberOfPoints": 2,
    "StatusTypeID": 50,
    "DateLastStatusUpdate": "2015-08-23T14:12:00Z",
    "DataQualityLevel": 1,
    "DateCreated": "2015-08-23T09:31:00Z",
    "SubmissionStatusTypeID": 200
}