{
    "IsRecentlyVerified": false,
    "ID": 187086,
    "UUID": "E4610ADE-8599-4012-B2BC-5E12F408209E",
    "DataProviderID": 29,
    "DataProvidersReference": "11684",
    "OperatorID": 45,
    "AddressInfo": {
        "ID": 187445,
        "Title": "Zum Rosenteich 14",
        "AddressLine1": "Zum Rosenteich 14",
        "Town": "Bad Zwischenahn",
        "Postcode": "26160",
        "CountryID": 87,
        "Latitude": 53.183126,
        "Longitude": 8.0280539,
        "DistanceUnit": 0
    },
    "Connections": [
        {
            "ID": 301179,
            "ConnectionTypeID": 25,
            "StatusTypeID": 50,
            "LevelID": 2,
            "PowerKW": 22,
            "CurrentTypeID": 20
        },
        {
            "ID": 301180,
            "ConnectionTypeID": 25,
            "StatusTypeID": 50,
            "LevelID": 2,
            "PowerKW": 22,
            "CurrentTypeID": 20
        }
    ],
    "StatusTypeID": 50,
    "DateLastStatusUpdate": "2021-07-12T02:50:00Z",
    "MetadataValues": [
        {
            "ID": 19326,
            "MetadataFieldID": 4,
            "ItemValue": "Data from the German chargepoint registry provided by Bundesnetzagentur.de under the CC-BY 4.0 license"
        }
    ],
    "DataQualityLevel": 3,
    "DateCreated": "2021-07-12T02:50:00Z",
    "SubmissionStatusTypeID": 100
}