{
    "IsRecentlyVerified": false,
    "ID": 167002,
    "UUID": "4E69DBC3-C00A-48FB-9B7E-F1C0D38271F5",
    "DataProviderID": 18,
    "DataProvidersReference": "05bb4b2d9ae7b698e9fbbc34c362d676",
    "UsageTypeID": 5,
    "AddressInfo": {
        "ID": 167361,
        "Title": "Jubilee Way, Wimbledon",
        "AddressLine1": "Jubilee Way, Wimbledon",
        "Town": "Merton",
        "Postcode": "SW19 3XD",
        "CountryID": 1,
        "Latitude": 51.41137,
        "Longitude": -0.191949,
        "AccessComments": "",
        "RelatedURL": "http://www.esb-evsolutions.co.uk/",
        "DistanceUnit": 0
    },
    "Connections": [
        {
            "ID": 252837,
            "ConnectionTypeID": 2,
            "Reference": "CHAdeMO",
            "StatusTypeID": 50,
            "LevelID": 3,
            "Amps": 125,
            "Voltage": 400,
            "PowerKW": 50,
            "CurrentTypeID": 30
        },
        {
            "ID": 252838,
            "ConnectionTypeID": 1036,
            "Reference": "CCS",
            "StatusTypeID": 50,
            "LevelID": 3,
            "Amps": 125,
            "Voltage": 400,
            "PowerKW": 50,
            "CurrentTypeID": 30
        },
        {
            "ID": 252839,
            "ConnectionTypeID": 1036,
            "Reference": "AC43",
            "StatusTypeID": 50,
            "LevelID": 3,
            "Amps": 63,
            "Voltage": 400,
            "PowerKW": 43,
            "CurrentTypeID": 20
        }
    ],
    "StatusTypeID": 0,
    "DateLastStatusUpdate": "2021-07-12T03:38:00Z",
    "MetadataValues": [
        {
            "ID": 7759,
            "MetadataFieldID": 4,
            "ItemValue": "Contains public sector information licensed under the Open Government Licence v2.0. http://www.nationalarchives.gov.uk/doc/open-government-licence/version/2/"
        }
    ],
    "DataQualityLevel": 3,
    "DateCreated": "2020-08-27T08:10:00Z",
    "SubmissionStatusTypeID": 100
}