{
    "IsRecentlyVerified": false,
    "ID": 157502,
    "UUID": "356DA5A1-6556-46B3-BCD6-544151EC533E",
    "DataProviderID": 1,
    "OperatorID": 1241,
    "UsageTypeID": 4,
    "AddressInfo": {
        "ID": 157856,
        "Title": "Athy HSE Primary Health Care Centre",
        "AddressLine1": "Woodstock Street",
        "Town": "Athy",
        "StateOrProvince": "County Kildare",
        "CountryID": 3,
        "Latitude": 52.99450541312311,
        "Longitude": -6.991441133624903,
        "DistanceUnit": 0
    },
    "Connections": [
        {
            "ID": 226885,
            "ConnectionTypeID": 25,
            "StatusTypeID": 50,
            "LevelID": 2,
            "Amps": 32,
            "Voltage": 400,
            "PowerKW": 22,
            "CurrentTypeID": 20,
            "Quantity": 2
        }
    ],
    "NumberOfPoints": 2,
    "GeneralComments": "Available to use while visiting the Primary Health Care Centre",
    "StatusTypeID": 50,
    "DateLastStatusUpdate": "2020-06-29T18:11:00Z",
    "DataQualityLevel": 1,
    "DateCreated": "2020-06-11T13:45:00Z",
    "SubmissionStatusTypeID": 200
}