{
    "IsRecentlyVerified": false,
    "ID": 38959,
    "UUID": "DFF36281-4910-4664-865E-3CBED284D266",
    "DataProviderID": 26,
    "DataProvidersReference": "31551",
    "OperatorID": 157,
    "OperatorsReference": "NewMotion 02002650",
    "UsageCost": "0.00 jaarabonnement",
    "AddressInfo": {
        "ID": 39305,
        "Title": "Polderweg 19",
        "AddressLine1": "Polderweg 19",
        "Town": "Texel",
        "Postcode": "1793 AB",
        "CountryID": 159,
        "Latitude": 53.0748023986816,
        "Longitude": 4.82026290893555,
        "ContactTelephone1": "088 0109500",
        "RelatedURL": "http://thenewmotion.nl/",
        "DistanceUnit": 0
    },
    "Connections": [
        {
            "ID": 42470,
            "ConnectionTypeID": 25,
            "LevelID": 2,
            "PowerKW": 3.7,
            "CurrentTypeID": 10
        }
    ],
    "NumberOfPoints": 1,
    "StatusTypeID": 50,
    "DateLastStatusUpdate": "2016-06-04T02:56:00Z",
    "DataQualityLevel": 3,
    "DateCreated": "2015-01-09T06:08:00Z",
    "SubmissionStatusTypeID": 100
}