{
    "UserComments": [
        {
            "ID": 6035,
            "ChargePointID": 9552,
            "CommentTypeID": 10,
            "UserName": "Jamie Wilde",
            "Comment": "In a car park this really needs to be a fast Type 2 32 amp charger. A 3 hour charge on a 3 pin plug would barely provide any benefit. Hull is so poor for charging options if you need to visit the city outside the opening hours of the Nissan dealership",
            "Rating": 2,
            "DateCreated": "2015-07-26T20:51:37.61Z",
            "User": {
                "ID": 6146,
                "Username": "Jamie Wilde"
            },
            "CheckinStatusTypeID": 10
        },
        {
            "ID": 632,
            "ChargePointID": 9552,
            "CommentTypeID": 10,
            "UserName": "mydogisdead",
            "Comment": "",
            "DateCreated": "2014-01-17T09:12:24.11Z",
            "User": {
                "ID": 1190,
                "Username": "mydogisdead"
            },
            "CheckinStatusTypeID": 30
        }
    ],
    "MediaItems": [
        {
            "ID": 187,
            "ChargePointID": 9552,
            "ItemURL": "https://s3-ap-southeast-2.amazonaws.com/openchargemap/images/GB/OCM9552/OCM-9552.orig.2014011709184871.jpg",
            "ItemThumbnailURL": "https://s3-ap-southeast-2.amazonaws.com/openchargemap/images/GB/OCM9552/OCM-9552.thmb.2014011709184871.jpg",
            "Comment": "It has a 3pin domestic socket and some blue round pin socket but no J1772 connections . I pointed this out to the car park attendant, and he took a picture. But this may not be altered from my enquiry... From January 2014.... ",
            "IsEnabled": true,
            "IsVideo": false,
            "IsFeaturedItem": false,
            "IsExternalResource": false,
            "User": {
                "ID": 1190,
                "Username": "mydogisdead"
            },
            "DateCreated": "2014-01-17T09:19:00Z"
        },
        {
            "ID": 188,
            "ChargePointID": 9552,
            "ItemURL": "https://s3-ap-southeast-2.amazonaws.com/openchargemap/images/GB/OCM9552/OCM-9552.orig.2014011709185301.jpg",
            "ItemThumbnailURL": "https://s3-ap-southeast-2.amazonaws.com/openchargemap/images/GB/OCM9552/OCM-9552.thmb.2014011709185301.jpg",
            "Comment": "It has a 3pin domestic socket and some blue round pin socket but no J1772 connections . I pointed this out to the car park attendant, and he took a picture. But this may not be altered from my enquiry... From January 2014.... ",
            "IsEnabled": true,
            "IsVideo": false,
            "IsFeaturedItem": false,
            "IsExternalResource": false,
            "User": {
                "ID": 1190,
                "Username": "mydogisdead"
            },
            "DateCreated": "2014-01-17T09:19:00Z"
        },
        {
            "ID": 189,
            "ChargePointID": 9552,
            "ItemURL": "https://s3-ap-southeast-2.amazonaws.com/openchargemap/images/GB/OCM9552/OCM-9552.orig.2014011709185085.jpg",
            "ItemThumbnailURL": "https://s3-ap-southeast-2.amazonaws.com/openchargemap/images/GB/OCM9552/OCM-9552.thmb.2014011709185085.jpg",
            "Comment": "It has a 3pin domestic socket and some blue round pin socket but no J1772 connections . I pointed this out to the car park attendant, and he took a picture. But this may not be altered from my enquiry... From January 2014.... ",
            "IsEnabled": true,
            "IsVideo": false,
            "IsFeaturedItem": false,
            "IsExternalResource": false,
            "User": {
                "ID": 1190,
                "Username": "mydogisdead"
            },
            "DateCreated": "2014-01-17T09:19:00Z"
        }
    ],
    "IsRecentlyVerified": false,
    "ID": 9552,
    "UUID": "5BD1C9A8-51B4-4BB5-B867-6649FEFBFA6E",
    "DataProviderID": 1,
    "OperatorID": 19,
    "UsageTypeID": 1,
    "UsageCost": "Free but Parking charges apply",
    "AddressInfo": {
        "ID": 9449,
        "Title": "St Stephens Shopping Centre ",
        "AddressLine1": "110 Ferensway Hull",
        "AddressLine2": "Hull Town Centre",
        "Town": "Hull",
        "StateOrProvince": "East Yorkshire",
        "Postcode": "HU2 8LN",
        "CountryID": 1,
        "Latitude": 53.745442,
        "Longitude": -0.347555,
        "ContactTelephone1": "01482 313960",
        "ContactTelephone2": "Car park 01482 218568",
        "ContactEmail": "enquiries@ststephens-hull.com",
        "AccessComments": "Charging availability Mon to Fri 09.00 to 19.00, Sat 09.00 to 18.00, Sun 10.00 to 17.00",
        "RelatedURL": "http://www.ststephens-hull.com",
        "DistanceUnit": 0
    },
    "Connections": [
        {
            "ID": 7257,
            "ConnectionTypeID": 25,
            "StatusTypeID": 50,
            "LevelID": 2,
            "Amps": 32,
            "Voltage": 230,
            "PowerKW": 7,
            "CurrentTypeID": 10,
            "Quantity": 2
        },
        {
            "ID": 7258,
            "ConnectionTypeID": 4,
            "StatusTypeID": 50,
            "LevelID": 2,
            "Amps": 16,
            "Voltage": 230,
            "PowerKW": 4,
            "CurrentTypeID": 20,
            "Quantity": 1
        },
        {
            "ID": 183059,
            "ConnectionTypeID": 3,
            "StatusTypeID": 50,
            "LevelID": 2,
            "Amps": 13,
            "Voltage": 230,
            "PowerKW": 3,
            "CurrentTypeID": 10,
            "Quantity": 1
        }
    ],
    "NumberOfPoints": 4,
    "GeneralComments": "Car charge points are available on the 1st floor of the multi-storey car park.\r\n",
    "StatusTypeID": 50,
    "DateLastStatusUpdate": "2019-08-13T12:48:00Z",
    "DataQualityLevel": 1,
    "DateCreated": "2012-02-23T15:30:00Z",
    "SubmissionStatusTypeID": 200
}