{
    "IsRecentlyVerified": false,
    "ID": 9062,
    "UUID": "5A91A834-FD45-4A72-82C6-AA90E94F3D1F",
    "DataProviderID": 15,
    "DataProvidersReference": "12564",
    "OperatorID": 5,
    "AddressInfo": {
        "ID": 8959,
        "Title": "50-00 56th Rd",
        "AddressLine1": "50-00 56th Rd",
        "Town": "Flushing",
        "StateOrProvince": "New York",
        "Postcode": "11364",
        "CountryID": 2,
        "Latitude": 40.75572205,
        "Longitude": -73.75698853,
        "ContactTelephone1": "",
        "RelatedURL": "http://carstations.com/12564",
        "DistanceUnit": 0
    },
    "Connections": [
        {
            "ID": 6725,
            "ConnectionTypeID": 1,
            "Reference": "J1772",
            "LevelID": 2,
            "Quantity": 1
        },
        {
            "ID": 9145,
            "ConnectionTypeID": 9,
            "Reference": "NEMA5",
            "LevelID": 1
        }
    ],
    "StatusTypeID": 0,
    "DateLastStatusUpdate": "2017-11-04T14:04:00Z",
    "DataQualityLevel": 1,
    "DateCreated": "2011-12-22T13:59:00Z",
    "SubmissionStatusTypeID": 100
}