{
    "IsRecentlyVerified": false,
    "ID": 66169,
    "UUID": "296C58CD-97B9-4D26-BDCC-0BD0978806B8",
    "DataProviderID": 1,
    "OperatorID": 156,
    "UsageTypeID": 4,
    "AddressInfo": {
        "ID": 66515,
        "Title": "Tourist Info ",
        "AddressLine1": "Kampenwandstraße 38",
        "Town": "Aschau im Chiemgau",
        "StateOrProvince": "Landkreis Rosenheim",
        "Postcode": "83229",
        "CountryID": 87,
        "Latitude": 47.77285,
        "Longitude": 12.324479999999994,
        "AccessComments": "24/7 verfügbar auf dem Parkplatz neben der Touristeninfor. Freischaltbar mit The New Motion Ladekarte oder von Roamingpartnern, z.B. PlugSurfing, WSW, SUN, SW LB. ",
        "DistanceUnit": 0
    },
    "Connections": [
        {
            "ID": 91460,
            "ConnectionTypeID": 25,
            "StatusTypeID": 50,
            "LevelID": 2,
            "Amps": 16,
            "Voltage": 400,
            "PowerKW": 11,
            "CurrentTypeID": 20,
            "Quantity": 1
        }
    ],
    "NumberOfPoints": 1,
    "StatusTypeID": 50,
    "DateLastStatusUpdate": "2016-05-12T08:19:00Z",
    "DataQualityLevel": 1,
    "DateCreated": "2016-05-12T08:19:00Z",
    "SubmissionStatusTypeID": 200
}