{
    "IsRecentlyVerified": false,
    "ID": 56796,
    "UUID": "B6AEBC27-BCC4-4BEC-A40A-1838E23A4502",
    "DataProviderID": 1,
    "OperatorID": 189,
    "UsageTypeID": 4,
    "AddressInfo": {
        "ID": 57142,
        "Title": "Küferstraße",
        "AddressLine1": "Küferstraße 5",
        "Town": "Heuchlingen",
        "StateOrProvince": "Ostalbkreis",
        "Postcode": "73572",
        "CountryID": 87,
        "Latitude": 48.85212,
        "Longitude": 9.945429999999988,
        "AccessComments": "Mit diesen Ladekarten / Angeboten kann diese Ladesäule 24/7 genutzt werden: Charge&Pay, E-Wald ",
        "DistanceUnit": 0
    },
    "Connections": [
        {
            "ID": 71652,
            "ConnectionTypeID": 25,
            "StatusTypeID": 50,
            "LevelID": 2,
            "PowerKW": 22,
            "CurrentTypeID": 20,
            "Quantity": 2
        }
    ],
    "NumberOfPoints": 2,
    "StatusTypeID": 50,
    "DateLastStatusUpdate": "2015-11-10T08:01:00Z",
    "DataQualityLevel": 1,
    "DateCreated": "2015-11-10T08:01:00Z",
    "SubmissionStatusTypeID": 200
}