{
    "IsRecentlyVerified": false,
    "ID": 145401,
    "UUID": "37F08FCB-512F-46B8-8F24-6F7484FC2958",
    "DataProviderID": 2,
    "DataProvidersReference": "95551",
    "OperatorID": 9,
    "UsageTypeID": 1,
    "AddressInfo": {
        "ID": 145753,
        "Title": "2200 Westlake",
        "AddressLine1": "2200 Westlake Ave",
        "Town": "Seattle",
        "StateOrProvince": "WA",
        "Postcode": "98121",
        "CountryID": 2,
        "Latitude": 47.617712,
        "Longitude": -122.337994,
        "ContactTelephone1": "888-998-2546",
        "AccessComments": "MON: 24 hours | TUE: 24 hours | WED: 24 hours | THU: 24 hours | FRI: 24 hours | SAT: 24 hours | SUN: 24 hours",
        "RelatedURL": "http://www.blinkcharging.com/",
        "DistanceUnit": 0
    },
    "Connections": [
        {
            "ID": 202066,
            "ConnectionTypeID": 1,
            "LevelID": 2,
            "Amps": 16,
            "Voltage": 230,
            "PowerKW": 3.7,
            "CurrentTypeID": 10,
            "Quantity": 2
        }
    ],
    "StatusTypeID": 50,
    "DateLastStatusUpdate": "2020-06-26T03:11:00Z",
    "DataQualityLevel": 3,
    "DateCreated": "2019-12-24T09:24:00Z",
    "SubmissionStatusTypeID": 100
}