{
    "IsRecentlyVerified": false,
    "ID": 29586,
    "UUID": "2AC3EC25-7AF7-48A6-8752-FF58954D9FA0",
    "DataProviderID": 15,
    "DataProvidersReference": "25767",
    "OperatorID": 94,
    "UsageTypeID": 1,
    "AddressInfo": {
        "ID": 29932,
        "Title": "Enterprise Drive",
        "AddressLine1": "Enterprise Drive",
        "Town": "Irvine",
        "StateOrProvince": "CA",
        "Postcode": "92618",
        "CountryID": 2,
        "Latitude": 33.652573,
        "Longitude": -117.742488,
        "ContactTelephone1": "(949) 753-5180",
        "RelatedURL": "http://carstations.com/25767",
        "DistanceUnit": 0
    },
    "Connections": [
        {
            "ID": 32571,
            "ConnectionTypeID": 1,
            "Reference": "J1772",
            "LevelID": 2
        }
    ],
    "NumberOfPoints": 4,
    "StatusTypeID": 0,
    "DateLastStatusUpdate": "2017-11-04T14:04:00Z",
    "DataQualityLevel": 2,
    "DateCreated": "2014-11-29T05:39:00Z",
    "SubmissionStatusTypeID": 100
}