{
    "IsRecentlyVerified": false,
    "ID": 133031,
    "UUID": "A179A2D2-67DF-4897-90FE-D4422BEF5904",
    "DataProviderID": 1,
    "OperatorID": 23,
    "OperatorsReference": "52059",
    "UsageTypeID": 4,
    "AddressInfo": {
        "ID": 133377,
        "Title": "Simpson Center",
        "AddressLine1": "1490 Oneida St",
        "Town": "Menasha",
        "StateOrProvince": "Wisconsin",
        "Postcode": "54115",
        "CountryID": 2,
        "Latitude": 44.22927,
        "Longitude": -88.404479,
        "ContactTelephone1": "(920) 362-2725",
        "DistanceUnit": 0
    },
    "Connections": [
        {
            "ID": 186312,
            "ConnectionTypeID": 30,
            "StatusTypeID": 50,
            "LevelID": 2,
            "PowerKW": 10,
            "CurrentTypeID": 20,
            "Quantity": 2
        }
    ],
    "NumberOfPoints": 2,
    "GeneralComments": "2 Tesla Connectors, up to 10kW.Available to the public. Self park.",
    "StatusTypeID": 50,
    "DateLastStatusUpdate": "2019-10-12T05:43:00Z",
    "DataQualityLevel": 1,
    "DateCreated": "2019-10-12T05:43:00Z",
    "SubmissionStatusTypeID": 200
}