{
    "IsRecentlyVerified": false,
    "ID": 186610,
    "UUID": "5786F579-6CA0-4975-9652-58A0A6A0EB01",
    "DataProviderID": 29,
    "DataProvidersReference": "7939",
    "OperatorID": 132,
    "AddressInfo": {
        "ID": 186969,
        "Title": "Am Papenberg 11",
        "AddressLine1": "Am Papenberg 11",
        "Town": "Göttingen",
        "Postcode": "37075",
        "CountryID": 87,
        "Latitude": 51.551481,
        "Longitude": 9.946965,
        "DistanceUnit": 0
    },
    "Connections": [
        {
            "ID": 299636,
            "ConnectionTypeID": 25,
            "StatusTypeID": 50,
            "LevelID": 2,
            "PowerKW": 22,
            "CurrentTypeID": 20
        },
        {
            "ID": 299637,
            "ConnectionTypeID": 25,
            "StatusTypeID": 50,
            "LevelID": 2,
            "PowerKW": 22,
            "CurrentTypeID": 20
        },
        {
            "ID": 299638,
            "ConnectionTypeID": 25,
            "StatusTypeID": 50,
            "LevelID": 2,
            "PowerKW": 22,
            "CurrentTypeID": 20
        },
        {
            "ID": 299639,
            "ConnectionTypeID": 25,
            "StatusTypeID": 50,
            "LevelID": 2,
            "PowerKW": 22,
            "CurrentTypeID": 20
        }
    ],
    "StatusTypeID": 50,
    "DateLastStatusUpdate": "2021-07-12T02:48:00Z",
    "MetadataValues": [
        {
            "ID": 18851,
            "MetadataFieldID": 4,
            "ItemValue": "Data from the German chargepoint registry provided by Bundesnetzagentur.de under the CC-BY 4.0 license"
        }
    ],
    "DataQualityLevel": 3,
    "DateCreated": "2021-07-12T02:48:00Z",
    "SubmissionStatusTypeID": 100
}