{
    "IsRecentlyVerified": false,
    "ID": 140729,
    "UUID": "34E12613-8426-43F1-A8F1-A82700A97D2E",
    "DataProviderID": 2,
    "DataProvidersReference": "123207",
    "OperatorID": 3372,
    "UsageTypeID": 1,
    "AddressInfo": {
        "ID": 141081,
        "Title": "Lockheed Martin - Solar and Astrophysics Laboratory",
        "AddressLine1": "3176 Porter Dr",
        "Town": "Palo Alto",
        "StateOrProvince": "CA",
        "Postcode": "94306",
        "CountryID": 2,
        "Latitude": 37.4071557,
        "Longitude": -122.1493244,
        "ContactTelephone1": "866-816-7584",
        "AccessComments": "24 hours daily",
        "RelatedURL": "http://evconnect.com/",
        "DistanceUnit": 0
    },
    "Connections": [
        {
            "ID": 196440,
            "ConnectionTypeID": 1,
            "LevelID": 2,
            "Amps": 16,
            "Voltage": 230,
            "PowerKW": 3.7,
            "CurrentTypeID": 10,
            "Quantity": 6
        }
    ],
    "StatusTypeID": 50,
    "DateLastStatusUpdate": "2020-06-26T02:59:00Z",
    "DataQualityLevel": 3,
    "DateCreated": "2019-12-24T09:13:00Z",
    "SubmissionStatusTypeID": 100
}