{
    "IsRecentlyVerified": false,
    "ID": 179934,
    "UUID": "7DCE5661-6E63-4EDC-A27D-270646B0B733",
    "DataProviderID": 29,
    "DataProvidersReference": "15713",
    "AddressInfo": {
        "ID": 180293,
        "Title": "Grabenstraße 37",
        "AddressLine1": "Grabenstraße 37",
        "Town": "Seligenstadt",
        "Postcode": "63500",
        "CountryID": 87,
        "Latitude": 50.0466,
        "Longitude": 8.973033,
        "DistanceUnit": 0
    },
    "Connections": [
        {
            "ID": 282413,
            "ConnectionTypeID": 25,
            "StatusTypeID": 50,
            "LevelID": 2,
            "PowerKW": 22,
            "CurrentTypeID": 20
        },
        {
            "ID": 282414,
            "ConnectionTypeID": 25,
            "StatusTypeID": 50,
            "LevelID": 2,
            "PowerKW": 22,
            "CurrentTypeID": 20
        }
    ],
    "StatusTypeID": 50,
    "DateLastStatusUpdate": "2021-07-12T02:44:00Z",
    "MetadataValues": [
        {
            "ID": 12228,
            "MetadataFieldID": 4,
            "ItemValue": "Data from the German chargepoint registry provided by Bundesnetzagentur.de under the CC-BY 4.0 license"
        }
    ],
    "DataQualityLevel": 3,
    "DateCreated": "2021-07-08T10:00:00Z",
    "SubmissionStatusTypeID": 100
}