{
    "IsRecentlyVerified": false,
    "ID": 35366,
    "UUID": "703A1E5E-08C3-450D-9528-A51311E266AB",
    "DataProviderID": 26,
    "DataProvidersReference": "48893",
    "OperatorID": 73,
    "OperatorsReference": "EV-Box EVB-P1402358",
    "UsageCost": "0.00 jaarabonnement",
    "AddressInfo": {
        "ID": 35712,
        "Title": "Wattbaan 31-49",
        "AddressLine1": "Wattbaan 31-49",
        "Town": "Nieuwegein",
        "Postcode": "3439 ML",
        "CountryID": 159,
        "Latitude": 52.03479,
        "Longitude": 5.10295,
        "RelatedURL": "http://www.ev-box.nl",
        "DistanceUnit": 0
    },
    "Connections": [
        {
            "ID": 38877,
            "ConnectionTypeID": 25,
            "LevelID": 2,
            "PowerKW": 11,
            "CurrentTypeID": 10
        },
        {
            "ID": 47833,
            "ConnectionTypeID": 25,
            "LevelID": 2,
            "PowerKW": 11,
            "CurrentTypeID": 10
        }
    ],
    "NumberOfPoints": 1,
    "StatusTypeID": 50,
    "DateLastStatusUpdate": "2016-06-04T02:44:00Z",
    "DataQualityLevel": 3,
    "DateCreated": "2015-01-09T06:04:00Z",
    "SubmissionStatusTypeID": 100
}