{
    "IsRecentlyVerified": false,
    "ID": 11861,
    "UUID": "F5680579-543A-4849-A309-10010F8DA0A1",
    "DataProviderID": 1,
    "OperatorID": 1,
    "UsageTypeID": 0,
    "UsageCost": "Free",
    "AddressInfo": {
        "ID": 11758,
        "Title": "Max Burger",
        "AddressLine1": "124 LaSalle Rd",
        "AddressLine2": "",
        "Town": "West Hartford",
        "StateOrProvince": "ct",
        "Postcode": "06107",
        "CountryID": 2,
        "Latitude": 41.75844,
        "Longitude": -72.7445227,
        "ContactTelephone1": "",
        "ContactTelephone2": "",
        "ContactEmail": "",
        "AccessComments": "From South Main st to Arapahoe Rd to LaSalle Rd",
        "RelatedURL": "",
        "DistanceUnit": 0
    },
    "Connections": [
        {
            "ID": 9266,
            "ConnectionTypeID": 0,
            "StatusTypeID": 50,
            "LevelID": 1,
            "Quantity": 1
        }
    ],
    "NumberOfPoints": 1,
    "GeneralComments": "2 hour limit on street town meter for parking at that location",
    "StatusTypeID": 50,
    "DateLastStatusUpdate": "2012-08-20T13:50:00Z",
    "DataQualityLevel": 1,
    "DateCreated": "2012-08-13T11:18:00Z",
    "SubmissionStatusTypeID": 200
}