{
    "IsRecentlyVerified": false,
    "ID": 39193,
    "UUID": "546A28B6-1E36-4E85-AEE1-B6DDAACB913C",
    "DataProviderID": 1,
    "OperatorID": 220,
    "OperatorsReference": "2764,2764,2765",
    "UsageTypeID": 1,
    "UsageCost": "€1.73 + €0.3213/kWh; Andere Tarife möglich",
    "AddressInfo": {
        "ID": 39539,
        "Title": "Supermarkt Rewe",
        "AddressLine1": "Von-Sauer-Straße 11",
        "Town": "Hamburg",
        "Postcode": "22761",
        "CountryID": 87,
        "Latitude": 53.565557376028,
        "Longitude": 9.90878836574553,
        "AccessComments": "2 kostenlose grün markierte Parkplätze in der Ecke des Rewe Parkplatzes nahe Pneumobil. 24/7 nutzbar.",
        "DistanceUnit": 0
    },
    "Connections": [
        {
            "ID": 42704,
            "ConnectionTypeID": 25,
            "StatusTypeID": 50,
            "LevelID": 2,
            "Amps": 32,
            "Voltage": 400,
            "PowerKW": 11,
            "CurrentTypeID": 20,
            "Quantity": 2
        },
        {
            "ID": 49939,
            "ConnectionTypeID": 28,
            "StatusTypeID": 50,
            "LevelID": 2,
            "Amps": 16,
            "Voltage": 230,
            "PowerKW": 3.7,
            "CurrentTypeID": 10,
            "Quantity": 2
        }
    ],
    "NumberOfPoints": 2,
    "StatusTypeID": 50,
    "DateLastStatusUpdate": "2017-11-03T06:45:00Z",
    "DataQualityLevel": 3,
    "DateCreated": "2015-01-09T06:08:00Z",
    "SubmissionStatusTypeID": 200
}