{
    "IsRecentlyVerified": false,
    "ID": 119942,
    "UUID": "D350EB5F-D6BD-4E82-8263-62FBBF2F45C9",
    "DataProviderID": 2,
    "DataProvidersReference": "48594",
    "UsageTypeID": 2,
    "AddressInfo": {
        "ID": 120288,
        "Title": "Johnson Space Center",
        "AddressLine1": "2101 NASA Pkwy",
        "Town": "Houston",
        "StateOrProvince": "TX",
        "Postcode": "77058",
        "CountryID": 2,
        "Latitude": 29.567354,
        "Longitude": -95.101315,
        "ContactTelephone1": "",
        "AccessComments": "NASA fleet use only; Also accessible through chip keys",
        "RelatedURL": "",
        "DistanceUnit": 0
    },
    "Connections": [
        {
            "ID": 169245,
            "ConnectionTypeID": 1,
            "LevelID": 2,
            "Amps": 16,
            "Voltage": 230,
            "PowerKW": 3.7,
            "CurrentTypeID": 10,
            "Quantity": 1
        }
    ],
    "DateLastStatusUpdate": "2020-06-26T02:53:00Z",
    "DataQualityLevel": 3,
    "DateCreated": "2019-04-01T04:59:00Z",
    "SubmissionStatusTypeID": 100
}