{
    "IsRecentlyVerified": false,
    "ID": 107928,
    "UUID": "356DF781-719B-45A3-B415-628AB459EFEE",
    "DataProviderID": 1,
    "OperatorID": 1,
    "UsageTypeID": 1,
    "UsageCost": "free",
    "AddressInfo": {
        "ID": 108274,
        "Title": "Debrecen, Piac utca",
        "AddressLine1": "Piac utca",
        "AddressLine2": "",
        "Town": "Debrecen",
        "StateOrProvince": "Hajdú-Bihar megye",
        "Postcode": "4025",
        "CountryID": 104,
        "Latitude": 47.52791138465506,
        "Longitude": 21.625656504065773,
        "ContactTelephone1": "",
        "ContactTelephone2": "",
        "ContactEmail": "",
        "AccessComments": "",
        "RelatedURL": "",
        "DistanceUnit": 0
    },
    "Connections": [
        {
            "ID": 152418,
            "ConnectionTypeID": 25,
            "StatusTypeID": 150,
            "LevelID": 2,
            "Amps": 32,
            "Voltage": 400,
            "PowerKW": 22,
            "CurrentTypeID": 20,
            "Quantity": 2
        }
    ],
    "NumberOfPoints": 2,
    "GeneralComments": "",
    "StatusTypeID": 150,
    "DateLastStatusUpdate": "2018-10-16T20:30:00Z",
    "DataQualityLevel": 1,
    "DateCreated": "2018-08-19T13:09:00Z",
    "SubmissionStatusTypeID": 200
}