{
    "IsRecentlyVerified": false,
    "ID": 154022,
    "UUID": "F8968E01-BDA1-4B33-89FE-EADE51735573",
    "DataProviderID": 28,
    "DataProvidersReference": "FR*S77*P77118A",
    "OperatorID": 3413,
    "UsageTypeID": 5,
    "AddressInfo": {
        "ID": 154375,
        "Title": "Claye-Souilly",
        "AddressLine1": "allée André Benoist",
        "CountryID": 80,
        "Latitude": 48.945903,
        "Longitude": 2.687649,
        "AccessComments": "",
        "DistanceUnit": 0
    },
    "Connections": [
        {
            "ID": 216423,
            "ConnectionTypeID": 28,
            "StatusTypeID": 50,
            "LevelID": 2,
            "PowerKW": 18,
            "CurrentTypeID": 10
        },
        {
            "ID": 216424,
            "ConnectionTypeID": 25,
            "StatusTypeID": 50,
            "LevelID": 2,
            "PowerKW": 18,
            "CurrentTypeID": 20
        },
        {
            "ID": 250582,
            "ConnectionTypeID": 28,
            "StatusTypeID": 50,
            "LevelID": 2,
            "PowerKW": 18,
            "CurrentTypeID": 10
        },
        {
            "ID": 250583,
            "ConnectionTypeID": 25,
            "StatusTypeID": 50,
            "LevelID": 2,
            "PowerKW": 18,
            "CurrentTypeID": 20
        }
    ],
    "GeneralComments": "badge, appli et QR code",
    "StatusTypeID": 50,
    "DateLastStatusUpdate": "2020-08-27T05:16:00Z",
    "DataQualityLevel": 2,
    "DateCreated": "2020-03-15T10:54:00Z",
    "SubmissionStatusTypeID": 100
}