{
    "IsRecentlyVerified": false,
    "ID": 57193,
    "UUID": "894A2FF2-D73E-4919-B47B-BA0226530EFC",
    "DataProviderID": 1,
    "OperatorID": 45,
    "UsageTypeID": 3,
    "AddressInfo": {
        "ID": 57539,
        "Title": "Kia Autohaus Kurt",
        "AddressLine1": "Bochumer Straße 82A",
        "AddressLine2": "Rechklinghausen Süd",
        "Town": "Recklinghausen",
        "StateOrProvince": "Kreis Recklinghausen",
        "Postcode": "45661",
        "CountryID": 87,
        "Latitude": 51.5768585,
        "Longitude": 7.2129453,
        "AccessComments": "Die Säule ist nutzbar: Mo-Fr. 08-19Uhr, Sa. 09-14Uhr\r\n\r\n\r\n",
        "RelatedURL": "http://www.kia-kurt-recklinghausen.de",
        "DistanceUnit": 0
    },
    "Connections": [
        {
            "ID": 72279,
            "ConnectionTypeID": 2,
            "StatusTypeID": 50,
            "LevelID": 3,
            "PowerKW": 50,
            "CurrentTypeID": 30,
            "Quantity": 1
        },
        {
            "ID": 72280,
            "ConnectionTypeID": 33,
            "StatusTypeID": 50,
            "LevelID": 3,
            "PowerKW": 20,
            "CurrentTypeID": 30,
            "Quantity": 1
        }
    ],
    "NumberOfPoints": 2,
    "StatusTypeID": 50,
    "DateLastStatusUpdate": "2015-11-27T17:56:00Z",
    "DataQualityLevel": 1,
    "DateCreated": "2015-11-27T12:34:00Z",
    "SubmissionStatusTypeID": 200
}