{
    "IsRecentlyVerified": false,
    "ID": 107876,
    "UUID": "B2433F6B-DF8D-49FE-BDCE-D54BAB6D27D9",
    "DataProviderID": 1,
    "OperatorID": 3253,
    "UsageTypeID": 4,
    "AddressInfo": {
        "ID": 108222,
        "Title": "Volkswagen Parkhaus IT:City",
        "AddressLine1": "Innovationskamp",
        "Town": "Wolfsburg",
        "StateOrProvince": "Wolfsburg",
        "Postcode": "38448",
        "CountryID": 87,
        "Latitude": 52.450085917172636,
        "Longitude": 10.780003076612843,
        "AccessComments": "16 graue Wallboxen im Parkhaus im Erdgeschoss nahe der Einfahrt Nord. Mit jeder Ladekarte aktivierbar.",
        "RelatedURL": "http://vwk.smatrics.com/",
        "DistanceUnit": 0
    },
    "Connections": [
        {
            "ID": 152336,
            "ConnectionTypeID": 1036,
            "StatusTypeID": 50,
            "LevelID": 2,
            "Amps": 16,
            "Voltage": 230,
            "PowerKW": 3.7,
            "CurrentTypeID": 10,
            "Quantity": 16
        }
    ],
    "NumberOfPoints": 16,
    "StatusTypeID": 50,
    "DateLastStatusUpdate": "2018-08-16T06:14:00Z",
    "DataQualityLevel": 1,
    "DateCreated": "2018-08-16T06:14:00Z",
    "SubmissionStatusTypeID": 200
}