{
    "IsRecentlyVerified": false,
    "ID": 97524,
    "UUID": "439065C5-D18E-48F3-92A7-AFA7A0C6120A",
    "DataProviderID": 1,
    "OperatorID": 23,
    "OperatorsReference": "39172",
    "UsageTypeID": 4,
    "AddressInfo": {
        "ID": 97870,
        "Title": "Courtyard By Marriot Chihuahua",
        "AddressLine1": "Courtyard By Marriot Chihuahua",
        "Postcode": "31110",
        "CountryID": 146,
        "Latitude": 28.662662,
        "Longitude": -106.127617,
        "ContactTelephone1": "+52 614 311 0200",
        "DistanceUnit": 0
    },
    "Connections": [
        {
            "ID": 138431,
            "ConnectionTypeID": 30,
            "StatusTypeID": 50,
            "LevelID": 2,
            "PowerKW": 18,
            "CurrentTypeID": 20,
            "Quantity": 2
        }
    ],
    "NumberOfPoints": 2,
    "GeneralComments": "2 Tesla Connectors, up to 18kW.Available for customers. Self park.",
    "StatusTypeID": 50,
    "DateLastStatusUpdate": "2018-01-21T15:39:00Z",
    "DataQualityLevel": 1,
    "DateCreated": "2018-01-21T15:39:00Z",
    "SubmissionStatusTypeID": 200
}