{
    "IsRecentlyVerified": false,
    "ID": 62851,
    "UUID": "38F6542C-2BE0-415B-A76A-FA270B348F0E",
    "DataProviderID": 26,
    "DataProvidersReference": "79866",
    "OperatorID": 73,
    "OperatorsReference": "EV-Box EVB-P1420204",
    "UsageCost": "0.00 jaarabonnement",
    "AddressInfo": {
        "ID": 63197,
        "Title": "Sicco Mansholtstraat 3",
        "AddressLine1": "Sicco Mansholtstraat 3",
        "Town": "Roermond",
        "Postcode": "6049 HC",
        "CountryID": 159,
        "Latitude": 51.17529,
        "Longitude": 5.97444,
        "RelatedURL": "http://www.ev-box.nl",
        "DistanceUnit": 0
    },
    "Connections": [
        {
            "ID": 79838,
            "ConnectionTypeID": 25,
            "LevelID": 2,
            "PowerKW": 5,
            "CurrentTypeID": 10
        }
    ],
    "NumberOfPoints": 1,
    "StatusTypeID": 50,
    "DateLastStatusUpdate": "2016-06-04T02:38:00Z",
    "DataQualityLevel": 3,
    "DateCreated": "2016-03-03T12:29:00Z",
    "SubmissionStatusTypeID": 100
}