{
    "IsRecentlyVerified": false,
    "ID": 136910,
    "UUID": "91CEC908-37F8-4412-B63E-0B9F5F98D0CB",
    "DataProviderID": 18,
    "DataProvidersReference": "5b6a98d1701494ba253b9995df8c9e6c",
    "OperatorID": 20,
    "UsageTypeID": 4,
    "AddressInfo": {
        "ID": 137256,
        "Title": "Newcastle Upon Tyne",
        "AddressLine1": "Swing Bridge Carpark",
        "Town": "Newcastle upon Tyne",
        "Postcode": "NE1 3RQ",
        "CountryID": 1,
        "Latitude": 54.967738,
        "Longitude": -1.609539,
        "AccessComments": "Swing Bridge Carpark",
        "RelatedURL": "http://www.chargeyourcar.org.uk",
        "DistanceUnit": 0
    },
    "Connections": [
        {
            "ID": 191603,
            "ConnectionTypeID": 25,
            "Reference": "0",
            "StatusTypeID": 50,
            "LevelID": 2,
            "Amps": 32,
            "Voltage": 230,
            "PowerKW": 7,
            "CurrentTypeID": 10
        }
    ],
    "StatusTypeID": 0,
    "DateLastStatusUpdate": "2019-12-24T05:23:00Z",
    "MetadataValues": [
        {
            "ID": 6762,
            "MetadataFieldID": 4,
            "ItemValue": "Contains public sector information licensed under the Open Government Licence v2.0. http://www.nationalarchives.gov.uk/doc/open-government-licence/version/2/"
        }
    ],
    "DataQualityLevel": 3,
    "DateCreated": "2019-12-24T05:23:00Z",
    "SubmissionStatusTypeID": 100
}