{
    "IsRecentlyVerified": false,
    "ID": 7722,
    "UUID": "880C0B8A-7749-4ACC-B9E4-6911A7560D08",
    "DataProviderID": 15,
    "DataProvidersReference": "6902",
    "OperatorID": 26,
    "AddressInfo": {
        "ID": 7619,
        "Title": "3820 Parkway Ln",
        "AddressLine1": "3820 Parkway Ln",
        "Town": "Hilliard",
        "StateOrProvince": "OH",
        "Postcode": "43026",
        "CountryID": 2,
        "Latitude": 40.03135,
        "Longitude": -83.12497,
        "ContactTelephone1": "(614) 771-2345",
        "RelatedURL": "http://carstations.com/6902",
        "DistanceUnit": 0
    },
    "Connections": [
        {
            "ID": 5154,
            "ConnectionTypeID": 1,
            "Reference": "J1772",
            "LevelID": 2
        }
    ],
    "StatusTypeID": 0,
    "DateLastStatusUpdate": "2017-11-04T14:04:00Z",
    "DataQualityLevel": 1,
    "DateCreated": "2011-11-11T12:05:00Z",
    "SubmissionStatusTypeID": 100
}