{
    "IsRecentlyVerified": false,
    "ID": 44569,
    "UUID": "53C61E84-C449-475F-A5D4-E3E9DEA00987",
    "DataProviderID": 2,
    "DataProvidersReference": "66561",
    "UsageTypeID": 1,
    "AddressInfo": {
        "ID": 44915,
        "Title": "Virginia Clean Cities - James Madison University",
        "AddressLine1": "1401 Technology Dr",
        "Town": "Harrisonburg",
        "StateOrProvince": "VA",
        "Postcode": "22802",
        "CountryID": 2,
        "Latitude": 38.465788,
        "Longitude": -78.852888,
        "ContactTelephone1": "540-568-8896",
        "AccessComments": "24 hours daily",
        "RelatedURL": "",
        "DistanceUnit": 0
    },
    "Connections": [
        {
            "ID": 54749,
            "ConnectionTypeID": 1,
            "LevelID": 2,
            "Amps": 16,
            "Voltage": 230,
            "PowerKW": 3.7,
            "CurrentTypeID": 10,
            "Quantity": 2
        }
    ],
    "DateLastStatusUpdate": "2020-06-26T03:00:00Z",
    "DataQualityLevel": 3,
    "DateCreated": "2015-04-17T12:30:00Z",
    "SubmissionStatusTypeID": 100
}