{
    "IsRecentlyVerified": false,
    "ID": 67420,
    "UUID": "48880DF0-4E37-423C-9009-E3644DF5AE0E",
    "DataProviderID": 1,
    "OperatorID": 23,
    "OperatorsReference": "10087",
    "UsageTypeID": 1,
    "UsageCost": "Free",
    "AddressInfo": {
        "ID": 67766,
        "Title": "Tamarack Country Club - Tesla",
        "AddressLine1": "55 Locust Rd",
        "Town": "Greenwich",
        "StateOrProvince": "CT",
        "Postcode": "06831",
        "CountryID": 2,
        "Latitude": 41.0942381,
        "Longitude": -73.7098113,
        "ContactTelephone1": "203-531-7300  877-798-3752",
        "AccessComments": "24 hours daily; for Tesla use only; for member use only; see valet for access",
        "RelatedURL": "http://www.teslamotors.com/supercharger",
        "DistanceUnit": 0
    },
    "Connections": [
        {
            "ID": 92924,
            "ConnectionTypeID": 30,
            "StatusTypeID": 50,
            "LevelID": 2,
            "Amps": 16,
            "Voltage": 230,
            "PowerKW": 8,
            "CurrentTypeID": 10,
            "Quantity": 2
        }
    ],
    "NumberOfPoints": 2,
    "StatusTypeID": 50,
    "DateLastStatusUpdate": "2017-01-31T20:20:00Z",
    "DataQualityLevel": 3,
    "DateCreated": "2016-05-29T02:05:00Z",
    "SubmissionStatusTypeID": 100
}