{
    "IsRecentlyVerified": false,
    "ID": 177150,
    "UUID": "9F52AD43-FB1D-48B2-A05C-0E3A681BAC9B",
    "DataProviderID": 29,
    "DataProvidersReference": "1161",
    "OperatorID": 69,
    "AddressInfo": {
        "ID": 177509,
        "Title": "Peißenbergstr. 1a",
        "AddressLine1": "Peißenbergstr. 1a",
        "Town": "München",
        "Postcode": "81457",
        "CountryID": 87,
        "Latitude": 48.107403,
        "Longitude": 11.575105,
        "DistanceUnit": 0
    },
    "Connections": [
        {
            "ID": 275954,
            "ConnectionTypeID": 25,
            "StatusTypeID": 50,
            "LevelID": 2,
            "PowerKW": 22,
            "CurrentTypeID": 20
        },
        {
            "ID": 275955,
            "ConnectionTypeID": 25,
            "StatusTypeID": 50,
            "LevelID": 2,
            "PowerKW": 22,
            "CurrentTypeID": 20
        }
    ],
    "StatusTypeID": 0,
    "DateLastStatusUpdate": "2021-07-09T03:11:00Z",
    "MetadataValues": [
        {
            "ID": 9444,
            "MetadataFieldID": 4,
            "ItemValue": "Data from the German chargepoint registry provided by Bundesnetzagentur.de under the CC-BY 4.0 license"
        }
    ],
    "DataQualityLevel": 3,
    "DateCreated": "2021-07-08T09:48:00Z",
    "SubmissionStatusTypeID": 100
}