{
    "IsRecentlyVerified": false,
    "ID": 71718,
    "UUID": "C05B537F-7877-4012-8D36-5E937D466243",
    "DataProviderID": 1,
    "OperatorID": 45,
    "UsageTypeID": 1,
    "AddressInfo": {
        "ID": 72064,
        "Title": "Franken-Therme",
        "AddressLine1": "Erkenbrechtallee 10",
        "Town": "Bad Windsheim",
        "StateOrProvince": "Neustadt an der Aisch-Bad Windsheim",
        "Postcode": "91438",
        "CountryID": 87,
        "Latitude": 49.51335,
        "Longitude": 10.41449,
        "AccessComments": "2 reservierte Parkplätze, 24/7 kostenlos nutzbar.",
        "DistanceUnit": 0
    },
    "Connections": [
        {
            "ID": 102720,
            "ConnectionTypeID": 1036,
            "StatusTypeID": 50,
            "LevelID": 2,
            "Amps": 16,
            "Voltage": 400,
            "PowerKW": 11,
            "CurrentTypeID": 20,
            "Quantity": 2
        },
        {
            "ID": 102721,
            "ConnectionTypeID": 28,
            "StatusTypeID": 50,
            "LevelID": 2,
            "Amps": 16,
            "Voltage": 230,
            "PowerKW": 3.7,
            "CurrentTypeID": 10,
            "Quantity": 1
        }
    ],
    "NumberOfPoints": 2,
    "StatusTypeID": 50,
    "DateLastStatusUpdate": "2016-09-05T07:23:00Z",
    "DataQualityLevel": 1,
    "DateCreated": "2016-09-05T07:23:00Z",
    "SubmissionStatusTypeID": 200
}