{
    "IsRecentlyVerified": false,
    "ID": 187290,
    "UUID": "99B8C9C8-F8B0-40BB-A3ED-377ABB8C7261",
    "DataProviderID": 29,
    "DataProvidersReference": "13776",
    "OperatorID": 45,
    "AddressInfo": {
        "ID": 187649,
        "Title": "Dassower Str. 8b",
        "AddressLine1": "Dassower Str. 8b",
        "Town": "Schönberg",
        "Postcode": "23923",
        "CountryID": 87,
        "Latitude": 53.855498,
        "Longitude": 10.926665,
        "DistanceUnit": 0
    },
    "Connections": [
        {
            "ID": 302205,
            "ConnectionTypeID": 25,
            "StatusTypeID": 50,
            "LevelID": 3,
            "PowerKW": 50,
            "CurrentTypeID": 30
        },
        {
            "ID": 302206,
            "ConnectionTypeID": 33,
            "StatusTypeID": 50,
            "LevelID": 3,
            "PowerKW": 50,
            "CurrentTypeID": 30
        },
        {
            "ID": 302207,
            "ConnectionTypeID": 1036,
            "StatusTypeID": 50,
            "LevelID": 3,
            "PowerKW": 50,
            "CurrentTypeID": 30
        },
        {
            "ID": 302208,
            "ConnectionTypeID": 2,
            "StatusTypeID": 50,
            "LevelID": 3,
            "PowerKW": 50,
            "CurrentTypeID": 30
        },
        {
            "ID": 302209,
            "ConnectionTypeID": 25,
            "StatusTypeID": 50,
            "LevelID": 3,
            "PowerKW": 22,
            "CurrentTypeID": 30
        },
        {
            "ID": 302210,
            "ConnectionTypeID": 33,
            "StatusTypeID": 50,
            "LevelID": 3,
            "PowerKW": 22,
            "CurrentTypeID": 30
        }
    ],
    "StatusTypeID": 50,
    "DateLastStatusUpdate": "2021-07-12T02:52:00Z",
    "MetadataValues": [
        {
            "ID": 19530,
            "MetadataFieldID": 4,
            "ItemValue": "Data from the German chargepoint registry provided by Bundesnetzagentur.de under the CC-BY 4.0 license"
        }
    ],
    "DataQualityLevel": 3,
    "DateCreated": "2021-07-12T02:52:00Z",
    "SubmissionStatusTypeID": 100
}