{
    "IsRecentlyVerified": false,
    "ID": 68941,
    "UUID": "ACF45A1A-894C-47DE-970E-DA5CAD6CC704",
    "DataProviderID": 1,
    "DataProvidersReference": "3427",
    "AddressInfo": {
        "ID": 69287,
        "Title": "Göteborg Energi - Rastplats Delsjön",
        "AddressLine1": "J A Fagerbergs väg 3",
        "Town": "GÖTEBORG",
        "StateOrProvince": "VÄSTRA GÖTALAND",
        "Postcode": "41276",
        "CountryID": 216,
        "Latitude": 57.67715,
        "Longitude": 12.02691,
        "AccessComments": "Vid Burger Kings parkering.",
        "DistanceUnit": 0
    },
    "Connections": [
        {
            "ID": 96664,
            "ConnectionTypeID": 0,
            "Reference": "1",
            "LevelID": 2,
            "Amps": 100,
            "Voltage": 500,
            "PowerKW": 50,
            "Comments": "Mode 4"
        },
        {
            "ID": 96665,
            "ConnectionTypeID": 0,
            "Reference": "2",
            "LevelID": 2,
            "Amps": 100,
            "Voltage": 500,
            "PowerKW": 50,
            "Comments": "Mode 4"
        },
        {
            "ID": 96666,
            "ConnectionTypeID": 0,
            "Reference": "3",
            "LevelID": 2,
            "Amps": 32,
            "Voltage": 400,
            "PowerKW": 22,
            "Comments": "Mode 3"
        }
    ],
    "NumberOfPoints": 3,
    "DateLastStatusUpdate": "2020-05-26T08:21:00Z",
    "DataQualityLevel": 2,
    "DateCreated": "2016-06-25T03:52:00Z",
    "SubmissionStatusTypeID": 100
}