{
    "IsRecentlyVerified": false,
    "ID": 83536,
    "UUID": "EBED70C7-A820-49C4-9B52-8D21D33D5D5F",
    "DataProviderID": 1,
    "OperatorID": 25,
    "OperatorsReference": "wandsworth-bramfieldroad",
    "UsageTypeID": 4,
    "UsageCost": "£0.059/minute; min £1.18; other tariffs available",
    "AddressInfo": {
        "ID": 83882,
        "Title": "Bramfield Road",
        "AddressLine1": "66 Bramfield Road",
        "Town": "LONDON",
        "Postcode": "SW11 6PY",
        "CountryID": 1,
        "Latitude": 51.4556270979,
        "Longitude": -0.164647814867,
        "DistanceUnit": 0
    },
    "Connections": [
        {
            "ID": 118375,
            "ConnectionTypeID": 25,
            "StatusTypeID": 50,
            "LevelID": 2,
            "Amps": 32,
            "Voltage": 230,
            "PowerKW": 7,
            "CurrentTypeID": 10,
            "Quantity": 2
        },
        {
            "ID": 118376,
            "ConnectionTypeID": 1,
            "StatusTypeID": 50,
            "LevelID": 2,
            "Amps": 16,
            "Voltage": 230,
            "PowerKW": 4,
            "CurrentTypeID": 10,
            "Quantity": 2
        }
    ],
    "NumberOfPoints": 2,
    "StatusTypeID": 50,
    "DateLastStatusUpdate": "2017-09-19T05:24:00Z",
    "DataQualityLevel": 1,
    "DateCreated": "2017-02-09T17:06:00Z",
    "SubmissionStatusTypeID": 200
}