{
    "IsRecentlyVerified": false,
    "ID": 57201,
    "UUID": "422FEC54-A03D-49B6-BCBC-1C7D291E8D3D",
    "DataProviderID": 1,
    "OperatorID": 45,
    "UsageTypeID": 5,
    "AddressInfo": {
        "ID": 57547,
        "Title": "Schlossbergstellplatz",
        "AddressLine1": "Keltenstraße",
        "AddressLine2": "Im Gschlatt",
        "Town": "Marktoberdorf",
        "StateOrProvince": "Landkreis Ostallgäu",
        "Postcode": "87616",
        "CountryID": 87,
        "Latitude": 47.78027517945328,
        "Longitude": 10.62428720634672,
        "AccessComments": "Der ruhig gelegenen Wohnmobilstellplatz ist Teil des Großparkplatzes am Schloß. Hier steht eine Münzstromsäule mit 4 Anschlüssen. Sicherungen sind zugänglich.",
        "DistanceUnit": 0
    },
    "Connections": [
        {
            "ID": 72291,
            "ConnectionTypeID": 16,
            "StatusTypeID": 50,
            "LevelID": 2,
            "Amps": 16,
            "Voltage": 230,
            "PowerKW": 3.7,
            "CurrentTypeID": 10,
            "Quantity": 4
        }
    ],
    "NumberOfPoints": 4,
    "StatusTypeID": 50,
    "DateLastStatusUpdate": "2015-11-28T14:44:00Z",
    "DataQualityLevel": 1,
    "DateCreated": "2015-11-28T14:44:00Z",
    "SubmissionStatusTypeID": 200
}