{
    "IsRecentlyVerified": false,
    "ID": 74919,
    "UUID": "A2886E49-EEE0-47CF-9F85-A9AC578AC4C1",
    "DataProviderID": 1,
    "OperatorID": 45,
    "UsageTypeID": 1,
    "AddressInfo": {
        "ID": 75265,
        "Title": "E-Bike Station am Brauhaus Goldener Engel",
        "AddressLine1": "Neisser Straße 1",
        "Town": " Ingelheim am Rhein",
        "StateOrProvince": "Landkreis Mainz-Bingen",
        "Postcode": "55218",
        "CountryID": 87,
        "Latitude": 49.9719229,
        "Longitude": 8.02492529999995,
        "ContactTelephone1": "+49 6132 7801-0",
        "AccessComments": "24/7 nutzbare Schukodose am Brauhaus.",
        "RelatedURL": "http://www.rheinhessische.de/service/mobilitaet/e-bike-tankstellen.html",
        "DistanceUnit": 0
    },
    "Connections": [
        {
            "ID": 108093,
            "ConnectionTypeID": 28,
            "StatusTypeID": 50,
            "LevelID": 1,
            "Amps": 10,
            "Voltage": 230,
            "PowerKW": 2.3,
            "CurrentTypeID": 10,
            "Quantity": 1
        }
    ],
    "NumberOfPoints": 1,
    "StatusTypeID": 50,
    "DateLastStatusUpdate": "2016-12-08T07:30:00Z",
    "DataQualityLevel": 1,
    "DateCreated": "2016-12-08T07:30:00Z",
    "SubmissionStatusTypeID": 200
}