{
    "IsRecentlyVerified": false,
    "ID": 175892,
    "UUID": "CAB12A72-FE4D-41C3-8CBF-C1D89AFC0519",
    "DataProviderID": 1,
    "OperatorID": 3,
    "UsageTypeID": 1,
    "UsageCost": "Free",
    "AddressInfo": {
        "ID": 176251,
        "Title": "Tesco Extra-Crewe",
        "AddressLine1": "Vernon Way",
        "Town": "Crewe",
        "StateOrProvince": "England",
        "Postcode": "CW1 2DD",
        "CountryID": 1,
        "Latitude": 53.094422,
        "Longitude": -2.43788,
        "DistanceUnit": 0
    },
    "Connections": [
        {
            "ID": 273160,
            "ConnectionTypeID": 25,
            "Reference": "PG-70380",
            "StatusTypeID": 50,
            "LevelID": 2,
            "Amps": 32,
            "Voltage": 230,
            "PowerKW": 7,
            "CurrentTypeID": 10,
            "Quantity": 2
        },
        {
            "ID": 273161,
            "ConnectionTypeID": 25,
            "Reference": "PG-86469",
            "StatusTypeID": 50,
            "LevelID": 2,
            "Amps": 32,
            "Voltage": 230,
            "PowerKW": 7,
            "CurrentTypeID": 10,
            "Quantity": 2
        }
    ],
    "NumberOfPoints": 4,
    "StatusTypeID": 50,
    "DateLastStatusUpdate": "2021-06-18T08:23:00Z",
    "DataQualityLevel": 1,
    "DateCreated": "2021-06-18T08:23:00Z",
    "SubmissionStatusTypeID": 200
}