{
    "IsRecentlyVerified": false,
    "ID": 23775,
    "UUID": "E19AAC09-96D5-4FF4-89D2-147084F61D9F",
    "DataProviderID": 1,
    "OperatorID": 76,
    "UsageTypeID": 1,
    "UsageCost": "5€/up to 60min",
    "AddressInfo": {
        "ID": 24120,
        "Title": "Tondi",
        "AddressLine1": "A. H. Tammsaare street 47",
        "AddressLine2": "Kristiine linnaosa",
        "Town": "Tallinn",
        "StateOrProvince": "Harju maakond",
        "Postcode": "11317",
        "CountryID": 74,
        "Latitude": 59.40176957098955,
        "Longitude": 24.71649750224561,
        "ContactTelephone1": "+372 6511911",
        "ContactEmail": "tugi@elmo.ee",
        "RelatedURL": "http://www.elmo.ee",
        "DistanceUnit": 0
    },
    "Connections": [
        {
            "ID": 25790,
            "ConnectionTypeID": 2,
            "StatusTypeID": 50,
            "LevelID": 3,
            "Amps": 120,
            "Voltage": 500,
            "PowerKW": 50,
            "CurrentTypeID": 30,
            "Quantity": 1
        },
        {
            "ID": 25791,
            "ConnectionTypeID": 25,
            "StatusTypeID": 50,
            "LevelID": 2,
            "Amps": 32,
            "Voltage": 400,
            "PowerKW": 22,
            "CurrentTypeID": 20,
            "Quantity": 1
        }
    ],
    "NumberOfPoints": 1,
    "GeneralComments": "Opened 24h (automatic). \r\nReal-time condition information (operational/not operational/free) - www.elmo.ee \r\nCan pay with client card, SMS or mobile application. \r\nCharger number  37034",
    "StatusTypeID": 50,
    "DateLastStatusUpdate": "2014-05-28T21:14:00Z",
    "DataQualityLevel": 1,
    "DateCreated": "2014-05-28T21:14:00Z",
    "SubmissionStatusTypeID": 200
}