{
    "IsRecentlyVerified": false,
    "ID": 67071,
    "UUID": "0ABBA267-921F-424D-B9E6-756195D20344",
    "DataProviderID": 1,
    "OperatorID": 23,
    "OperatorsReference": "10734",
    "UsageTypeID": 1,
    "UsageCost": "Free",
    "AddressInfo": {
        "ID": 67417,
        "Title": "CaliPaso Winery - Tesla",
        "AddressLine1": "4230 Buena Vista Dr",
        "Town": "Paso Robles",
        "StateOrProvince": "CA",
        "Postcode": "93446",
        "CountryID": 2,
        "Latitude": 35.6633445,
        "Longitude": -120.6687053,
        "ContactTelephone1": "805-226-9296  877-798-3752",
        "AccessComments": "24 hours daily; for Tesla use only; for guest use only",
        "RelatedURL": "http://www.teslamotors.com/supercharger",
        "DistanceUnit": 0
    },
    "Connections": [
        {
            "ID": 92565,
            "ConnectionTypeID": 30,
            "StatusTypeID": 50,
            "LevelID": 2,
            "Amps": 16,
            "Voltage": 230,
            "PowerKW": 13,
            "CurrentTypeID": 10,
            "Quantity": 2
        }
    ],
    "NumberOfPoints": 2,
    "StatusTypeID": 50,
    "DateLastStatusUpdate": "2017-01-31T19:04:00Z",
    "DataQualityLevel": 3,
    "DateCreated": "2016-05-29T02:04:00Z",
    "SubmissionStatusTypeID": 100
}