{
    "IsRecentlyVerified": false,
    "ID": 97681,
    "UUID": "070EB26B-908B-4E25-B56B-352A7FEE1F5E",
    "DataProviderID": 1,
    "OperatorID": 23,
    "OperatorsReference": "34396",
    "UsageTypeID": 4,
    "UsageCost": "0.00/kWh; other tariffs for older cars",
    "AddressInfo": {
        "ID": 98027,
        "Title": "Hatta Supercharger",
        "AddressLine1": "102 Sharjah Kalba Road",
        "Town": "Dubai",
        "CountryID": 235,
        "Latitude": 24.819503,
        "Longitude": 56.134411,
        "DistanceUnit": 0
    },
    "Connections": [
        {
            "ID": 138589,
            "ConnectionTypeID": 27,
            "StatusTypeID": 50,
            "LevelID": 3,
            "PowerKW": 120,
            "CurrentTypeID": 30,
            "Quantity": 4
        }
    ],
    "NumberOfPoints": 4,
    "GeneralComments": "Charging4 Superchargers, available 24/7, up to 120kW",
    "StatusTypeID": 50,
    "DateLastStatusUpdate": "2018-01-21T16:23:00Z",
    "DataQualityLevel": 1,
    "DateCreated": "2018-01-21T16:23:00Z",
    "SubmissionStatusTypeID": 200
}