{
    "IsRecentlyVerified": false,
    "ID": 91247,
    "UUID": "1F33BC1B-F144-42C9-B47C-5046EA61853F",
    "DataProviderID": 1,
    "OperatorID": 23,
    "OperatorsReference": "32522",
    "UsageTypeID": 6,
    "AddressInfo": {
        "ID": 91593,
        "Title": "Burgunderhof Hagnau",
        "AddressLine1": "Am Sonnenbuehl 70",
        "Town": "Hagnau",
        "Postcode": "88709",
        "CountryID": 87,
        "Latitude": 47.67653,
        "Longitude": 9.326838,
        "ContactTelephone1": "+49 7532 807680",
        "DistanceUnit": 0
    },
    "Connections": [
        {
            "ID": 129378,
            "ConnectionTypeID": 30,
            "StatusTypeID": 50,
            "LevelID": 2,
            "Amps": 16,
            "Voltage": 400,
            "PowerKW": 11,
            "CurrentTypeID": 20,
            "Quantity": 2
        }
    ],
    "NumberOfPoints": 2,
    "GeneralComments": "2 Tesla Connectors, up to 11kW.Available for patrons only. Please call ahead.",
    "StatusTypeID": 50,
    "DateLastStatusUpdate": "2018-10-03T17:53:00Z",
    "DataQualityLevel": 1,
    "DateCreated": "2017-08-02T05:39:00Z",
    "SubmissionStatusTypeID": 200
}