{
    "IsRecentlyVerified": false,
    "ID": 92466,
    "UUID": "4FEE5D8F-733B-4260-8F15-3312A02B1AE7",
    "DataProviderID": 1,
    "OperatorID": 23,
    "OperatorsReference": "33711",
    "UsageTypeID": 6,
    "AddressInfo": {
        "ID": 92812,
        "Title": "Crowne Plaza Brugge",
        "AddressLine1": "Burg 10",
        "Town": "Brugge",
        "Postcode": "8000",
        "CountryID": 26,
        "Latitude": 51.208938,
        "Longitude": 3.227367,
        "ContactTelephone1": "+32 50 44 68 44",
        "DistanceUnit": 0
    },
    "Connections": [
        {
            "ID": 131067,
            "ConnectionTypeID": 30,
            "StatusTypeID": 50,
            "LevelID": 2,
            "Amps": 32,
            "Voltage": 400,
            "PowerKW": 22,
            "CurrentTypeID": 20,
            "Quantity": 1
        }
    ],
    "NumberOfPoints": 1,
    "GeneralComments": "1 Tesla Connector, up to 22kW.Available for patrons only. Please see front desk.",
    "StatusTypeID": 50,
    "DateLastStatusUpdate": "2018-10-03T15:25:00Z",
    "DataQualityLevel": 1,
    "DateCreated": "2017-09-07T05:46:00Z",
    "SubmissionStatusTypeID": 200
}