{
    "IsRecentlyVerified": false,
    "ID": 135287,
    "UUID": "B22B7D50-4038-468B-8020-307A9F121387",
    "DataProviderID": 1,
    "OperatorID": 3,
    "OperatorsReference": "PG-70159,PG-84086",
    "UsageTypeID": 4,
    "UsageCost": "Free",
    "AddressInfo": {
        "ID": 135633,
        "Title": "Tesco Superstore-Seaton",
        "AddressLine1": "Harbour Road",
        "Town": "Seaton",
        "Postcode": "EX12 2PB",
        "CountryID": 1,
        "Latitude": 50.705334,
        "Longitude": -3.065998,
        "DistanceUnit": 0
    },
    "Connections": [
        {
            "ID": 189540,
            "ConnectionTypeID": 25,
            "StatusTypeID": 50,
            "LevelID": 2,
            "Amps": 32,
            "Voltage": 230,
            "PowerKW": 7,
            "CurrentTypeID": 10,
            "Quantity": 4
        }
    ],
    "NumberOfPoints": 4,
    "GeneralComments": "This is an open charge unit installed at the Tesco super store at Harbour Road, Seaton",
    "StatusTypeID": 50,
    "DateLastStatusUpdate": "2020-02-14T08:24:00Z",
    "DataQualityLevel": 1,
    "DateCreated": "2019-12-15T13:22:00Z",
    "SubmissionStatusTypeID": 200
}