{
    "IsRecentlyVerified": false,
    "ID": 151877,
    "UUID": "EA08D1DD-528B-45F2-8447-94A83F9D64BE",
    "DataProviderID": 28,
    "DataProvidersReference": "FR*S74*P74080*A",
    "OperatorID": 3408,
    "UsageTypeID": 5,
    "AddressInfo": {
        "ID": 152230,
        "Title": "LA CLUSAZ_39 Rue du cimeti?re",
        "AddressLine1": "39 Rue du cimeti?re 74220 LA CLUSAZ",
        "CountryID": 80,
        "Latitude": 45.9061111,
        "Longitude": 6.425,
        "AccessComments": "24/24 7/7 jours",
        "DistanceUnit": 0
    },
    "Connections": [
        {
            "ID": 212335,
            "ConnectionTypeID": 28,
            "StatusTypeID": 50,
            "LevelID": 2,
            "PowerKW": 22,
            "CurrentTypeID": 10
        },
        {
            "ID": 212336,
            "ConnectionTypeID": 1036,
            "StatusTypeID": 50,
            "LevelID": 2,
            "PowerKW": 22,
            "CurrentTypeID": 20
        },
        {
            "ID": 245089,
            "ConnectionTypeID": 28,
            "StatusTypeID": 50,
            "LevelID": 2,
            "PowerKW": 22,
            "CurrentTypeID": 10
        },
        {
            "ID": 245090,
            "ConnectionTypeID": 1036,
            "StatusTypeID": 50,
            "LevelID": 2,
            "PowerKW": 22,
            "CurrentTypeID": 20
        }
    ],
    "GeneralComments": "",
    "StatusTypeID": 50,
    "DateLastStatusUpdate": "2020-08-27T05:12:00Z",
    "DataQualityLevel": 2,
    "DateCreated": "2020-03-15T10:53:00Z",
    "SubmissionStatusTypeID": 100
}