{
    "MediaItems": [
        {
            "ID": 13027,
            "ChargePointID": 27745,
            "ItemURL": "https://s3-ap-southeast-2.amazonaws.com/openchargemap/images/US/OCM27745/OCM-27745.orig.2017072219563187.jpg",
            "ItemThumbnailURL": "https://s3-ap-southeast-2.amazonaws.com/openchargemap/images/US/OCM27745/OCM-27745.thmb.2017072219563187.jpg",
            "Comment": "Across from Sebastopol police station.",
            "IsEnabled": true,
            "IsVideo": false,
            "IsFeaturedItem": false,
            "IsExternalResource": false,
            "User": {
                "ID": 15860,
                "Username": "Sheldon"
            },
            "DateCreated": "2017-07-22T19:57:00Z"
        }
    ],
    "IsRecentlyVerified": false,
    "ID": 27745,
    "UUID": "B9426CA9-CE6F-4F66-85A4-46806529873E",
    "DataProviderID": 2,
    "DataProvidersReference": "51071",
    "OperatorID": 5,
    "UsageTypeID": 1,
    "AddressInfo": {
        "ID": 28091,
        "Title": "SEBASTOPOL",
        "AddressLine1": "6800-6898 McKinley St",
        "Town": "Sebastopol",
        "StateOrProvince": "CA",
        "Postcode": "95472",
        "CountryID": 2,
        "Latitude": 38.403947,
        "Longitude": -122.821628,
        "ContactTelephone1": "888-758-4389",
        "AccessComments": "24 hours daily",
        "RelatedURL": "http://www.chargepoint.com/",
        "DistanceUnit": 0
    },
    "Connections": [
        {
            "ID": 30450,
            "ConnectionTypeID": 9,
            "LevelID": 1,
            "Amps": 16,
            "Voltage": 120,
            "PowerKW": 1,
            "CurrentTypeID": 10,
            "Quantity": 3
        },
        {
            "ID": 30451,
            "ConnectionTypeID": 1,
            "LevelID": 2,
            "Amps": 16,
            "Voltage": 230,
            "PowerKW": 3,
            "CurrentTypeID": 10,
            "Quantity": 3
        }
    ],
    "DateLastStatusUpdate": "2018-10-19T14:50:00Z",
    "DataQualityLevel": 3,
    "DateCreated": "2014-11-28T03:38:00Z",
    "SubmissionStatusTypeID": 100
}