{
    "IsRecentlyVerified": false,
    "ID": 62357,
    "UUID": "B386C0C8-7187-4AF8-A95E-87577D082EF8",
    "DataProviderID": 2,
    "DataProvidersReference": "73097",
    "OperatorID": 1242,
    "UsageTypeID": 2,
    "AddressInfo": {
        "ID": 62703,
        "Title": "60 Building # 1",
        "AddressLine1": "22360  Watertown Rd",
        "Town": "Waukesha",
        "StateOrProvince": "WI",
        "Postcode": "53186",
        "CountryID": 2,
        "Latitude": 43.0495081,
        "Longitude": -88.1865252,
        "ContactTelephone1": "855-443-3873",
        "AccessComments": "",
        "RelatedURL": "https://www.gewattstation.com",
        "DistanceUnit": 0
    },
    "Connections": [
        {
            "ID": 79262,
            "ConnectionTypeID": 1,
            "LevelID": 2,
            "Amps": 16,
            "Voltage": 230,
            "PowerKW": 3.7,
            "CurrentTypeID": 10,
            "Quantity": 1
        }
    ],
    "DateLastStatusUpdate": "2020-06-26T03:06:00Z",
    "DataQualityLevel": 3,
    "DateCreated": "2016-03-03T11:39:00Z",
    "SubmissionStatusTypeID": 100
}