{
    "IsRecentlyVerified": false,
    "ID": 111467,
    "UUID": "0EFE445C-E2A2-40AB-9E55-C4382DB14E1A",
    "DataProviderID": 2,
    "DataProvidersReference": "94992",
    "OperatorID": 5,
    "UsageTypeID": 1,
    "AddressInfo": {
        "ID": 111813,
        "Title": "MITSUBISHI PEMB",
        "AddressLine1": "1912 Petawawa Blvd",
        "Town": "Pembroke",
        "StateOrProvince": "ON",
        "Postcode": "K8A 7H2",
        "CountryID": 44,
        "Latitude": 45.853719,
        "Longitude": -77.210129,
        "ContactTelephone1": "888-758-4389",
        "AccessComments": "24 hours daily",
        "RelatedURL": "http://www.chargepoint.com/",
        "DistanceUnit": 0
    },
    "Connections": [
        {
            "ID": 156901,
            "ConnectionTypeID": 1,
            "LevelID": 2,
            "Amps": 16,
            "Voltage": 230,
            "PowerKW": 3,
            "CurrentTypeID": 10,
            "Quantity": 3
        }
    ],
    "DateLastStatusUpdate": "2019-12-24T09:24:00Z",
    "DataQualityLevel": 3,
    "DateCreated": "2018-10-18T23:37:00Z",
    "SubmissionStatusTypeID": 100
}