{
    "IsRecentlyVerified": false,
    "ID": 29692,
    "UUID": "6DC0BE92-C3B1-4250-9F14-F3E24EC03A07",
    "DataProviderID": 15,
    "DataProvidersReference": "19811",
    "OperatorID": 9,
    "AddressInfo": {
        "ID": 30038,
        "Title": "9111 Cross Park Dr",
        "AddressLine1": "9111 Cross Park Dr",
        "Town": "Knoxville",
        "StateOrProvince": "TN",
        "Postcode": "37923",
        "CountryID": 2,
        "Latitude": 35.960631,
        "Longitude": -83.920076,
        "ContactTelephone1": "(888) 998-2546",
        "RelatedURL": "http://carstations.com/19811",
        "DistanceUnit": 0
    },
    "Connections": [
        {
            "ID": 32677,
            "ConnectionTypeID": 1,
            "Reference": "J1772",
            "LevelID": 2
        }
    ],
    "StatusTypeID": 0,
    "DateLastStatusUpdate": "2017-11-04T14:04:00Z",
    "DataQualityLevel": 2,
    "DateCreated": "2014-11-29T05:39:00Z",
    "SubmissionStatusTypeID": 100
}