{
    "IsRecentlyVerified": false,
    "ID": 87765,
    "UUID": "50E833E3-E861-4159-ABEA-5EB889E30AEE",
    "DataProviderID": 1,
    "DataProvidersReference": "4048",
    "AddressInfo": {
        "ID": 88111,
        "Title": "Skåne Tranås parkering S300",
        "AddressLine1": "Onslunda 1620",
        "Town": "TOMELILLA",
        "StateOrProvince": "SKÅNE",
        "Postcode": "27395",
        "CountryID": 216,
        "Latitude": 55.6117,
        "Longitude": 14.0308,
        "AccessComments": "",
        "DistanceUnit": 0
    },
    "Connections": [
        {
            "ID": 124393,
            "ConnectionTypeID": 0,
            "Reference": "1",
            "LevelID": 2,
            "Amps": 32,
            "Voltage": 400,
            "PowerKW": 22,
            "Comments": "Mode 3"
        },
        {
            "ID": 124394,
            "ConnectionTypeID": 0,
            "Reference": "2",
            "LevelID": 2,
            "Amps": 32,
            "Voltage": 400,
            "PowerKW": 22,
            "Comments": "Mode 3"
        }
    ],
    "NumberOfPoints": 2,
    "DateLastStatusUpdate": "2020-05-26T08:21:00Z",
    "DataQualityLevel": 2,
    "DateCreated": "2017-05-16T11:07:00Z",
    "SubmissionStatusTypeID": 100
}