{
    "IsRecentlyVerified": false,
    "ID": 168020,
    "UUID": "CE4F7C13-83C3-4561-94E6-3CCFB2AA811A",
    "DataProviderID": 1,
    "OperatorID": 23,
    "OperatorsReference": "54559",
    "UsageTypeID": 4,
    "AddressInfo": {
        "ID": 168379,
        "Title": "Hotel Vincci Selección Rumaykiyya",
        "AddressLine1": "Urbanización",
        "Town": "18196 Sierra",
        "StateOrProvince": "Sierra",
        "Postcode": "18196",
        "CountryID": 210,
        "Latitude": 37.094357,
        "Longitude": -3.392802,
        "ContactTelephone1": "+34 958 482 508",
        "DistanceUnit": 0
    },
    "Connections": [
        {
            "ID": 255084,
            "ConnectionTypeID": 30,
            "StatusTypeID": 50,
            "LevelID": 2,
            "PowerKW": 11,
            "CurrentTypeID": 20,
            "Quantity": 2
        }
    ],
    "NumberOfPoints": 2,
    "GeneralComments": "Charging2 Tesla Connector, up to 11kW.Available for customers. Please see front desk.",
    "StatusTypeID": 50,
    "DateLastStatusUpdate": "2020-09-19T05:31:00Z",
    "DataQualityLevel": 1,
    "DateCreated": "2020-09-19T05:31:00Z",
    "SubmissionStatusTypeID": 200
}