{
    "IsRecentlyVerified": false,
    "ID": 11679,
    "UUID": "9AFD6517-67C2-481A-8C6A-AE1E6CDF2164",
    "DataProviderID": 1,
    "OperatorID": 1,
    "UsageTypeID": 2,
    "UsageCost": "Free",
    "AddressInfo": {
        "ID": 11576,
        "Title": "787 Loggerhead Island Way",
        "AddressLine1": "787 Loggerhead Island Way",
        "AddressLine2": "",
        "Town": "Satellite Beach",
        "StateOrProvince": "FL",
        "Postcode": "32937",
        "CountryID": 2,
        "Latitude": 28.191271,
        "Longitude": -80.61332600000003,
        "ContactTelephone1": "",
        "ContactTelephone2": "",
        "ContactEmail": "",
        "AccessComments": "",
        "RelatedURL": "",
        "DistanceUnit": 0
    },
    "Connections": [
        {
            "ID": 9021,
            "ConnectionTypeID": 11,
            "StatusTypeID": 50,
            "LevelID": 2,
            "Amps": 50,
            "Voltage": 240,
            "PowerKW": 12,
            "Quantity": 1
        }
    ],
    "NumberOfPoints": 1,
    "GeneralComments": "",
    "StatusTypeID": 50,
    "DateLastStatusUpdate": "2012-06-10T15:20:00Z",
    "DataQualityLevel": 1,
    "DateCreated": "2012-06-09T21:34:00Z",
    "SubmissionStatusTypeID": 200
}