{
    "IsRecentlyVerified": false,
    "ID": 23696,
    "UUID": "01838C4E-CAE8-4504-9D34-61036FD77692",
    "DataProviderID": 1,
    "OperatorID": 76,
    "UsageTypeID": 1,
    "UsageCost": "5€/up to 60 min",
    "AddressInfo": {
        "ID": 24041,
        "Title": "Viljandi-3",
        "AddressLine1": "Tallinna road",
        "Town": "Viljandi",
        "StateOrProvince": "Viljandi maakond",
        "Postcode": "71018",
        "CountryID": 74,
        "Latitude": 58.37680607303482,
        "Longitude": 25.59684055102708,
        "ContactTelephone1": "+372 6511911",
        "ContactEmail": "tugi@elmo.ee",
        "RelatedURL": "http://www.elmo.ee",
        "DistanceUnit": 0
    },
    "Connections": [
        {
            "ID": 25634,
            "ConnectionTypeID": 2,
            "StatusTypeID": 50,
            "LevelID": 3,
            "Amps": 120,
            "Voltage": 500,
            "PowerKW": 50,
            "CurrentTypeID": 30,
            "Quantity": 1
        },
        {
            "ID": 25635,
            "ConnectionTypeID": 25,
            "StatusTypeID": 50,
            "LevelID": 2,
            "Amps": 32,
            "Voltage": 400,
            "PowerKW": 22,
            "CurrentTypeID": 20,
            "Quantity": 1
        }
    ],
    "NumberOfPoints": 1,
    "GeneralComments": "Opened 24h (automatic). \r\nReal-time condition information (operational/not operational/free) - www.elmo.ee \r\nCan pay with client card, SMS or mobile application. \r\nCharger number 84156",
    "StatusTypeID": 50,
    "DateLastStatusUpdate": "2014-05-28T10:23:00Z",
    "DataQualityLevel": 1,
    "DateCreated": "2014-05-28T10:23:00Z",
    "SubmissionStatusTypeID": 200
}