{
    "IsRecentlyVerified": false,
    "ID": 32717,
    "UUID": "40F485D3-A15F-4759-A98D-FF4EBED5374F",
    "DataProviderID": 26,
    "DataProvidersReference": "47092",
    "OperatorID": 178,
    "OperatorsReference": "EVnetNL AL238",
    "UsageCost": "0.00 jaarabonnement",
    "AddressInfo": {
        "ID": 33063,
        "Title": "Meester Slootsweg 3a",
        "AddressLine1": "Meester Slootsweg 3a",
        "Town": "Waalre",
        "Postcode": "5581 AS",
        "CountryID": 159,
        "Latitude": 51.38784,
        "Longitude": 5.439952,
        "ContactTelephone1": "0800-3522365",
        "RelatedURL": "http://www.evnet.nl",
        "DistanceUnit": 0
    },
    "Connections": [
        {
            "ID": 36228,
            "ConnectionTypeID": 25,
            "LevelID": 2,
            "PowerKW": 11,
            "CurrentTypeID": 10
        }
    ],
    "NumberOfPoints": 2,
    "StatusTypeID": 50,
    "DateLastStatusUpdate": "2016-06-04T02:38:00Z",
    "DataQualityLevel": 3,
    "DateCreated": "2015-01-09T06:03:00Z",
    "SubmissionStatusTypeID": 100
}