{
    "IsRecentlyVerified": false,
    "ID": 12924,
    "UUID": "3EE0EAA2-CFA5-421C-AB2F-09A0C7834E56",
    "DataProviderID": 15,
    "DataProvidersReference": "20237",
    "OperatorID": 1,
    "AddressInfo": {
        "ID": 12821,
        "Title": "7629 Richmond Highway",
        "AddressLine1": "7629 Richmond Highway",
        "Town": "Alexandria",
        "StateOrProvince": "VA",
        "Postcode": "22306",
        "CountryID": 2,
        "Latitude": 38.75022,
        "Longitude": -77.08253,
        "ContactTelephone1": "",
        "RelatedURL": "http://carstations.com/20237",
        "DistanceUnit": 0
    },
    "Connections": [
        {
            "ID": 10357,
            "ConnectionTypeID": 1,
            "Reference": "J1772",
            "LevelID": 2
        }
    ],
    "StatusTypeID": 0,
    "DateLastStatusUpdate": "2017-11-04T14:04:00Z",
    "DataQualityLevel": 2,
    "DateCreated": "2012-09-07T19:25:00Z",
    "SubmissionStatusTypeID": 100
}