{
    "IsRecentlyVerified": false,
    "ID": 141196,
    "UUID": "A3589E86-12FB-41B6-A3E6-1278BFC52B6D",
    "DataProviderID": 2,
    "DataProvidersReference": "95347",
    "OperatorID": 9,
    "UsageTypeID": 1,
    "AddressInfo": {
        "ID": 141548,
        "Title": "IKEA - West Sacramento",
        "AddressLine1": "700 IKEA Court",
        "Town": "West Sacramento",
        "StateOrProvince": "CA",
        "Postcode": "95605",
        "CountryID": 2,
        "Latitude": 38.58643,
        "Longitude": -121.552595,
        "ContactTelephone1": "888-998-2546",
        "AccessComments": "MON: 24 hours | TUE: 24 hours | WED: 24 hours | THU: 24 hours | FRI: 24 hours | SAT: 24 hours | SUN: 24 hours",
        "RelatedURL": "http://www.blinkcharging.com/",
        "DistanceUnit": 0
    },
    "Connections": [
        {
            "ID": 197059,
            "ConnectionTypeID": 1,
            "LevelID": 2,
            "Amps": 16,
            "Voltage": 230,
            "PowerKW": 3.7,
            "CurrentTypeID": 10,
            "Quantity": 3
        }
    ],
    "StatusTypeID": 50,
    "DateLastStatusUpdate": "2020-06-26T03:00:00Z",
    "DataQualityLevel": 3,
    "DateCreated": "2019-12-24T09:15:00Z",
    "SubmissionStatusTypeID": 100
}