{
    "IsRecentlyVerified": false,
    "ID": 179637,
    "UUID": "D9066F16-62B0-4C92-9E77-615687BD995E",
    "DataProviderID": 29,
    "DataProvidersReference": "6100",
    "AddressInfo": {
        "ID": 179996,
        "Title": "Neuer Weg 21",
        "AddressLine1": "Neuer Weg 21",
        "Town": "Heusenstamm",
        "Postcode": "63150",
        "CountryID": 87,
        "Latitude": 50.06165,
        "Longitude": 8.80655,
        "DistanceUnit": 0
    },
    "Connections": [
        {
            "ID": 281714,
            "ConnectionTypeID": 25,
            "StatusTypeID": 50,
            "LevelID": 2,
            "PowerKW": 22,
            "CurrentTypeID": 20
        },
        {
            "ID": 281715,
            "ConnectionTypeID": 25,
            "StatusTypeID": 50,
            "LevelID": 2,
            "PowerKW": 22,
            "CurrentTypeID": 20
        }
    ],
    "StatusTypeID": 50,
    "DateLastStatusUpdate": "2021-07-12T02:44:00Z",
    "MetadataValues": [
        {
            "ID": 11931,
            "MetadataFieldID": 4,
            "ItemValue": "Data from the German chargepoint registry provided by Bundesnetzagentur.de under the CC-BY 4.0 license"
        }
    ],
    "DataQualityLevel": 3,
    "DateCreated": "2021-07-08T09:59:00Z",
    "SubmissionStatusTypeID": 100
}