{
    "IsRecentlyVerified": false,
    "ID": 52898,
    "UUID": "6F5AC9AE-9E08-418D-B5D1-08E4E43277EA",
    "DataProviderID": 1,
    "OperatorID": 32,
    "OperatorsReference": "1685",
    "UsageTypeID": 6,
    "UsageCost": "Inclusive; for Polar Plus subscription members only",
    "AddressInfo": {
        "ID": 53244,
        "Title": "Motorline Toyota",
        "AddressLine1": "The Crescent",
        "AddressLine2": "Orbital Park",
        "Town": "Ashford",
        "Postcode": "TN24 0SN",
        "CountryID": 1,
        "Latitude": 51.128101,
        "Longitude": 0.898514,
        "DistanceUnit": 0
    },
    "Connections": [
        {
            "ID": 65841,
            "ConnectionTypeID": 25,
            "StatusTypeID": 50,
            "LevelID": 2,
            "Amps": 32,
            "Voltage": 230,
            "PowerKW": 7,
            "CurrentTypeID": 10,
            "Quantity": 2
        }
    ],
    "NumberOfPoints": 2,
    "StatusTypeID": 50,
    "DateLastStatusUpdate": "2019-03-07T06:14:00Z",
    "DataQualityLevel": 1,
    "DateCreated": "2015-09-13T21:25:00Z",
    "SubmissionStatusTypeID": 200
}