{
    "IsRecentlyVerified": false,
    "ID": 175713,
    "UUID": "7A72E1C2-0702-4AA5-A04E-63E6F50D297F",
    "DataProviderID": 1,
    "OperatorID": 3311,
    "UsageTypeID": 1,
    "AddressInfo": {
        "ID": 176072,
        "Title": "ELEN Postira",
        "AddressLine1": "9 Strančica",
        "Town": "Postira",
        "StateOrProvince": "",
        "Postcode": "21410",
        "CountryID": 60,
        "Latitude": 43.373865,
        "Longitude": 16.627056,
        "DistanceUnit": 0
    },
    "Connections": [
        {
            "ID": 272853,
            "ConnectionTypeID": 33,
            "StatusTypeID": 50,
            "LevelID": 3,
            "PowerKW": 50,
            "CurrentTypeID": 30,
            "Quantity": 1
        },
        {
            "ID": 272854,
            "ConnectionTypeID": 2,
            "StatusTypeID": 50,
            "LevelID": 3,
            "PowerKW": 50,
            "CurrentTypeID": 30,
            "Quantity": 1
        },
        {
            "ID": 272855,
            "ConnectionTypeID": 1036,
            "StatusTypeID": 50,
            "LevelID": 3,
            "Amps": 63,
            "Voltage": 400,
            "PowerKW": 43,
            "CurrentTypeID": 20,
            "Quantity": 1
        }
    ],
    "NumberOfPoints": 1,
    "StatusTypeID": 50,
    "DateLastStatusUpdate": "2021-06-09T19:33:00Z",
    "DataQualityLevel": 1,
    "DateCreated": "2021-06-08T11:47:00Z",
    "SubmissionStatusTypeID": 200
}