{
    "IsRecentlyVerified": false,
    "ID": 143183,
    "UUID": "F8562D0E-4873-4469-84F8-D510605ACE11",
    "DataProviderID": 2,
    "DataProvidersReference": "150383",
    "OperatorID": 59,
    "UsageTypeID": 1,
    "AddressInfo": {
        "ID": 143535,
        "Title": "Greenlots - 153152",
        "AddressLine1": "225 Commercial St.",
        "Town": "Waterloo",
        "StateOrProvince": "IA",
        "Postcode": "50701",
        "CountryID": 2,
        "Latitude": 42.4969177246094,
        "Longitude": -92.3409576416016,
        "ContactTelephone1": "855-900-7584",
        "AccessComments": "24 hours daily",
        "RelatedURL": "http://greenlots.com/",
        "DistanceUnit": 0
    },
    "Connections": [
        {
            "ID": 199462,
            "ConnectionTypeID": 2,
            "LevelID": 3,
            "Amps": 100,
            "Voltage": 400,
            "PowerKW": 40,
            "CurrentTypeID": 30,
            "Quantity": 1
        },
        {
            "ID": 199463,
            "ConnectionTypeID": 32,
            "LevelID": 3,
            "Amps": 100,
            "Voltage": 400,
            "PowerKW": 40,
            "CurrentTypeID": 30,
            "Quantity": 1
        }
    ],
    "StatusTypeID": 50,
    "DateLastStatusUpdate": "2019-12-24T09:20:00Z",
    "DataQualityLevel": 3,
    "DateCreated": "2019-12-24T09:20:00Z",
    "SubmissionStatusTypeID": 100
}