{
    "IsRecentlyVerified": false,
    "ID": 177751,
    "UUID": "DF6BCAF1-848F-4148-9DBA-2B1650726A54",
    "DataProviderID": 29,
    "DataProvidersReference": "17846",
    "AddressInfo": {
        "ID": 178110,
        "Title": "Gewerbering Süd 1",
        "AddressLine1": "Gewerbering Süd 1",
        "Town": "Amtsberg",
        "Postcode": "09439",
        "CountryID": 87,
        "Latitude": 50.742315,
        "Longitude": 13.005666,
        "DistanceUnit": 0
    },
    "Connections": [
        {
            "ID": 277273,
            "ConnectionTypeID": 25,
            "StatusTypeID": 50,
            "LevelID": 2,
            "PowerKW": 22,
            "CurrentTypeID": 20
        },
        {
            "ID": 277274,
            "ConnectionTypeID": 25,
            "StatusTypeID": 50,
            "LevelID": 2,
            "PowerKW": 22,
            "CurrentTypeID": 20
        }
    ],
    "StatusTypeID": 0,
    "DateLastStatusUpdate": "2021-07-12T02:45:00Z",
    "MetadataValues": [
        {
            "ID": 10045,
            "MetadataFieldID": 4,
            "ItemValue": "Data from the German chargepoint registry provided by Bundesnetzagentur.de under the CC-BY 4.0 license"
        }
    ],
    "DataQualityLevel": 3,
    "DateCreated": "2021-07-08T09:49:00Z",
    "SubmissionStatusTypeID": 100
}