{
    "IsRecentlyVerified": false,
    "ID": 126689,
    "UUID": "45B9F068-6948-43DF-A742-2DBF4E276BB8",
    "DataProviderID": 1,
    "OperatorID": 23,
    "OperatorsReference": "50163",
    "UsageTypeID": 4,
    "AddressInfo": {
        "ID": 127035,
        "Title": "The Blue Heron Company Limited",
        "AddressLine1": "20 Head St",
        "Town": "Tobermory",
        "StateOrProvince": "Ontario",
        "Postcode": "N0H 2R",
        "CountryID": 44,
        "Latitude": 45.254316,
        "Longitude": -81.662421,
        "ContactTelephone1": "(519) 596-2999",
        "DistanceUnit": 0
    },
    "Connections": [
        {
            "ID": 177456,
            "ConnectionTypeID": 30,
            "StatusTypeID": 50,
            "LevelID": 2,
            "PowerKW": 16,
            "CurrentTypeID": 20,
            "Quantity": 2
        }
    ],
    "NumberOfPoints": 2,
    "GeneralComments": "2 Tesla Connectors, up to 16kW.Available to the public. Self park.",
    "StatusTypeID": 50,
    "DateLastStatusUpdate": "2019-05-17T05:49:00Z",
    "DataQualityLevel": 1,
    "DateCreated": "2019-05-17T05:49:00Z",
    "SubmissionStatusTypeID": 200
}