{
    "IsRecentlyVerified": false,
    "ID": 178913,
    "UUID": "D7C0BE85-40AC-44C0-8F39-0E5642A23E2C",
    "DataProviderID": 29,
    "DataProvidersReference": "7996",
    "OperatorID": 139,
    "AddressInfo": {
        "ID": 179272,
        "Title": "Rathausmarkt 1",
        "AddressLine1": "Rathausmarkt 1",
        "Town": "Schleswig",
        "Postcode": "24837",
        "CountryID": 87,
        "Latitude": 54.514134627477,
        "Longitude": 9.571629166603,
        "DistanceUnit": 0
    },
    "Connections": [
        {
            "ID": 279957,
            "ConnectionTypeID": 25,
            "StatusTypeID": 50,
            "LevelID": 2,
            "PowerKW": 22,
            "CurrentTypeID": 20
        },
        {
            "ID": 279958,
            "ConnectionTypeID": 25,
            "StatusTypeID": 50,
            "LevelID": 2,
            "PowerKW": 22,
            "CurrentTypeID": 20
        }
    ],
    "StatusTypeID": 50,
    "DateLastStatusUpdate": "2021-07-12T02:52:00Z",
    "MetadataValues": [
        {
            "ID": 11207,
            "MetadataFieldID": 4,
            "ItemValue": "Data from the German chargepoint registry provided by Bundesnetzagentur.de under the CC-BY 4.0 license"
        }
    ],
    "DataQualityLevel": 3,
    "DateCreated": "2021-07-08T09:59:00Z",
    "SubmissionStatusTypeID": 100
}