{
    "IsRecentlyVerified": false,
    "ID": 175559,
    "UUID": "44BEE8AB-8A1A-4DE4-89C9-650FE7F95C95",
    "DataProviderID": 1,
    "OperatorID": 3296,
    "UsageTypeID": 5,
    "UsageCost": "£0.35/kWh",
    "AddressInfo": {
        "ID": 175918,
        "Title": "McDonald’s Morley",
        "AddressLine1": "Wide Lane",
        "Town": "Morley",
        "StateOrProvince": "England",
        "Postcode": "LS27 8PL",
        "CountryID": 1,
        "Latitude": 53.74629066421008,
        "Longitude": -1.5692149798326227,
        "ContactTelephone1": "0808 281 4444",
        "RelatedURL": "https://instavolt.co.uk/",
        "DistanceUnit": 0
    },
    "Connections": [
        {
            "ID": 272549,
            "ConnectionTypeID": 33,
            "StatusTypeID": 50,
            "LevelID": 3,
            "PowerKW": 50,
            "CurrentTypeID": 30,
            "Quantity": 3
        },
        {
            "ID": 272550,
            "ConnectionTypeID": 2,
            "StatusTypeID": 50,
            "LevelID": 3,
            "PowerKW": 50,
            "CurrentTypeID": 30,
            "Quantity": 3
        }
    ],
    "NumberOfPoints": 1,
    "GeneralComments": "3 Instavolt DC rapid chargers https://www.instavolt.co.uk https://what3words.com/spider.lights.donor",
    "StatusTypeID": 50,
    "DateLastStatusUpdate": "2021-05-28T10:38:00Z",
    "DataQualityLevel": 1,
    "DateCreated": "2021-05-28T10:38:00Z",
    "SubmissionStatusTypeID": 200
}