{
    "IsRecentlyVerified": false,
    "ID": 73506,
    "UUID": "956CCD53-B3B6-431B-A0C4-2E6020CDDF4A",
    "DataProviderID": 1,
    "OperatorID": 6,
    "UsageTypeID": 1,
    "UsageCost": "Free",
    "AddressInfo": {
        "ID": 73852,
        "Title": "Serra Visser Nissan",
        "AddressLine1": "1724 Cherokee Ave SW",
        "AddressLine2": "",
        "Town": "Cullman",
        "StateOrProvince": "AL",
        "Postcode": "35055",
        "CountryID": 2,
        "Latitude": 34.14516208741347,
        "Longitude": -86.84688091278076,
        "ContactTelephone1": "(256) 739-1771",
        "ContactTelephone2": "",
        "ContactEmail": "",
        "AccessComments": "Accessible 24-hours daily. Charging location in front of dealership at left-most customer parking spaces. Level 2 at 30 amp.",
        "RelatedURL": "",
        "DistanceUnit": 0
    },
    "Connections": [
        {
            "ID": 105743,
            "ConnectionTypeID": 1,
            "StatusTypeID": 50,
            "LevelID": 2,
            "Amps": 30,
            "Quantity": 2
        }
    ],
    "NumberOfPoints": 2,
    "GeneralComments": "",
    "StatusTypeID": 50,
    "DateLastStatusUpdate": "2016-11-22T16:08:00Z",
    "DataQualityLevel": 1,
    "DateCreated": "2016-11-22T15:03:00Z",
    "SubmissionStatusTypeID": 200
}