{
    "IsRecentlyVerified": false,
    "ID": 128605,
    "UUID": "E4DE5050-628E-461E-971C-1023BDE3D366",
    "DataProviderID": 1,
    "OperatorID": 2244,
    "UsageTypeID": 4,
    "AddressInfo": {
        "ID": 128951,
        "Title": "Asset No. 810/7",
        "AddressLine1": "Kingswood Road",
        "Town": "London",
        "Postcode": "SW2 4JH",
        "CountryID": 1,
        "Latitude": 51.450117,
        "Longitude": -0.128715,
        "RelatedURL": "https://www.ubitricity.com",
        "DistanceUnit": 0
    },
    "Connections": [
        {
            "ID": 179998,
            "ConnectionTypeID": 25,
            "Reference": "steob100000640",
            "StatusTypeID": 50,
            "LevelID": 2,
            "Amps": 16,
            "Voltage": 230,
            "PowerKW": 3.7,
            "CurrentTypeID": 10,
            "Quantity": 1
        }
    ],
    "NumberOfPoints": 1,
    "StatusTypeID": 50,
    "DateLastStatusUpdate": "2019-06-28T08:41:00Z",
    "MetadataValues": [
        {
            "ID": 4552,
            "MetadataFieldID": 4,
            "ItemValue": "Contains public sector information licensed under the Open Government Licence v2.0. http://www.nationalarchives.gov.uk/doc/open-government-licence/version/2/"
        }
    ],
    "DataQualityLevel": 3,
    "DateCreated": "2019-06-26T17:26:00Z",
    "SubmissionStatusTypeID": 100
}