{
    "IsRecentlyVerified": false,
    "ID": 4307,
    "UUID": "8A2A9573-F0D6-441A-BCFD-DC95632278FE",
    "DataProviderID": 1,
    "OperatorID": 5,
    "UsageTypeID": 1,
    "UsageCost": "Free",
    "AddressInfo": {
        "ID": 4306,
        "Title": "CITY OF REDMOND",
        "AddressLine1": "15670 NE 85th St",
        "Town": "Redmond",
        "StateOrProvince": "WA",
        "Postcode": "98052",
        "CountryID": 2,
        "Latitude": 47.6792243,
        "Longitude": -122.1299498,
        "ContactTelephone1": "888-758-4389",
        "AccessComments": "24 hours daily",
        "RelatedURL": "http://www.chargepoint.com/",
        "DistanceUnit": 0
    },
    "Connections": [
        {
            "ID": 3457,
            "ConnectionTypeID": 1,
            "StatusTypeID": 50,
            "LevelID": 2,
            "Amps": 30,
            "Voltage": 230,
            "PowerKW": 6,
            "CurrentTypeID": 10,
            "Quantity": 1
        },
        {
            "ID": 20644,
            "ConnectionTypeID": 1,
            "StatusTypeID": 50,
            "LevelID": 2,
            "Amps": 30,
            "Voltage": 230,
            "PowerKW": 6,
            "CurrentTypeID": 10,
            "Quantity": 1
        }
    ],
    "NumberOfPoints": 2,
    "DateLastConfirmed": "2011-04-30T00:00:00Z",
    "StatusTypeID": 50,
    "DateLastStatusUpdate": "2019-02-19T04:48:00Z",
    "DataQualityLevel": 1,
    "DateCreated": "2011-05-09T14:58:00Z",
    "SubmissionStatusTypeID": 100
}