{
    "IsRecentlyVerified": false,
    "ID": 28423,
    "UUID": "8F7E835D-4D8A-4A67-A9AF-54A7E994D53A",
    "DataProviderID": 2,
    "DataProvidersReference": "49581",
    "OperatorID": 5,
    "UsageTypeID": 1,
    "AddressInfo": {
        "ID": 28769,
        "Title": "CARCHARGING",
        "AddressLine1": "450 WEST 42nd St.",
        "Town": "New York",
        "StateOrProvince": "NY",
        "Postcode": "10036",
        "CountryID": 2,
        "Latitude": 40.759041,
        "Longitude": -73.994972,
        "ContactTelephone1": "888-758-4389",
        "AccessComments": "24 hours daily",
        "RelatedURL": "http://www.chargepoint.com/",
        "DistanceUnit": 0
    },
    "Connections": [
        {
            "ID": 31232,
            "ConnectionTypeID": 9,
            "LevelID": 1,
            "Amps": 16,
            "Voltage": 120,
            "PowerKW": 1,
            "CurrentTypeID": 10,
            "Quantity": 1
        },
        {
            "ID": 31233,
            "ConnectionTypeID": 1,
            "LevelID": 2,
            "Amps": 16,
            "Voltage": 230,
            "PowerKW": 3,
            "CurrentTypeID": 10,
            "Quantity": 2
        }
    ],
    "DateLastStatusUpdate": "2019-04-06T05:05:00Z",
    "DataQualityLevel": 3,
    "DateCreated": "2014-11-28T03:38:00Z",
    "SubmissionStatusTypeID": 100
}