{
    "IsRecentlyVerified": false,
    "ID": 124615,
    "UUID": "2E26708E-2EBE-40A2-B810-2278AC2BDC81",
    "DataProviderID": 2,
    "DataProvidersReference": "61301",
    "OperatorID": 5,
    "UsageTypeID": 1,
    "AddressInfo": {
        "ID": 124961,
        "Title": "EVERGY",
        "AddressLine1": "1505 Genessee St",
        "Town": "Kansas City",
        "StateOrProvince": "MO",
        "Postcode": "64102",
        "CountryID": 2,
        "Latitude": 39.0957897,
        "Longitude": -94.604679,
        "ContactTelephone1": "888-758-4389",
        "AccessComments": "24 hours daily",
        "RelatedURL": "http://www.chargepoint.com/",
        "DistanceUnit": 0
    },
    "Connections": [
        {
            "ID": 174741,
            "ConnectionTypeID": 1,
            "LevelID": 2,
            "Amps": 16,
            "Voltage": 230,
            "PowerKW": 3,
            "CurrentTypeID": 10,
            "Quantity": 1
        }
    ],
    "DateLastStatusUpdate": "2019-12-24T09:15:00Z",
    "DataQualityLevel": 3,
    "DateCreated": "2019-04-06T05:03:00Z",
    "SubmissionStatusTypeID": 100
}