{
    "IsRecentlyVerified": false,
    "ID": 151093,
    "UUID": "127E1793-848B-44F7-9408-89C5ADC85C82",
    "DataProviderID": 28,
    "DataProvidersReference": "FR*S13*P13064*002",
    "UsageTypeID": 5,
    "AddressInfo": {
        "ID": 151446,
        "Title": "MOLLEGES - Route De St Andiol",
        "AddressLine1": "Route De St Andiol 13940 MOLLEGES",
        "CountryID": 80,
        "Latitude": 43.807491,
        "Longitude": 4.949075,
        "AccessComments": "24h/24 7j/7",
        "DistanceUnit": 0
    },
    "Connections": [
        {
            "ID": 210696,
            "ConnectionTypeID": 28,
            "StatusTypeID": 50,
            "LevelID": 2,
            "PowerKW": 22,
            "CurrentTypeID": 10
        },
        {
            "ID": 210697,
            "ConnectionTypeID": 1036,
            "StatusTypeID": 50,
            "LevelID": 2,
            "PowerKW": 22,
            "CurrentTypeID": 20
        },
        {
            "ID": 240666,
            "ConnectionTypeID": 28,
            "StatusTypeID": 50,
            "LevelID": 2,
            "PowerKW": 22,
            "CurrentTypeID": 10
        },
        {
            "ID": 240667,
            "ConnectionTypeID": 1036,
            "StatusTypeID": 50,
            "LevelID": 2,
            "PowerKW": 22,
            "CurrentTypeID": 20
        }
    ],
    "GeneralComments": "Recharge par badge et avec une application smartphone",
    "StatusTypeID": 50,
    "DateLastStatusUpdate": "2020-08-27T05:11:00Z",
    "DataQualityLevel": 2,
    "DateCreated": "2020-03-15T06:18:00Z",
    "SubmissionStatusTypeID": 100
}