{
    "IsRecentlyVerified": false,
    "ID": 184318,
    "UUID": "D6642B64-60B6-4E0A-A88F-62A493F895F5",
    "DataProviderID": 29,
    "DataProvidersReference": "9851",
    "AddressInfo": {
        "ID": 184677,
        "Title": "Friesische Lücke 15",
        "AddressLine1": "Friesische Lücke 15",
        "Town": "Flensburg",
        "Postcode": "24937",
        "CountryID": 87,
        "Latitude": 54.77686,
        "Longitude": 9.41855,
        "DistanceUnit": 0
    },
    "Connections": [
        {
            "ID": 292435,
            "ConnectionTypeID": 25,
            "StatusTypeID": 50,
            "LevelID": 2,
            "PowerKW": 22,
            "CurrentTypeID": 20
        },
        {
            "ID": 292436,
            "ConnectionTypeID": 25,
            "StatusTypeID": 50,
            "LevelID": 2,
            "PowerKW": 22,
            "CurrentTypeID": 20
        }
    ],
    "StatusTypeID": 50,
    "DateLastStatusUpdate": "2021-07-12T02:52:00Z",
    "MetadataValues": [
        {
            "ID": 16609,
            "MetadataFieldID": 4,
            "ItemValue": "Data from the German chargepoint registry provided by Bundesnetzagentur.de under the CC-BY 4.0 license"
        }
    ],
    "DataQualityLevel": 3,
    "DateCreated": "2021-07-08T10:05:00Z",
    "SubmissionStatusTypeID": 100
}