{
    "IsRecentlyVerified": false,
    "ID": 174898,
    "UUID": "58BEE419-506D-4366-BB69-2073AA9E3239",
    "DataProviderID": 1,
    "OperatorID": 103,
    "UsageTypeID": 1,
    "AddressInfo": {
        "ID": 175257,
        "Title": "De Brink",
        "AddressLine1": "Marktstraat",
        "Town": "Zuidlaren",
        "StateOrProvince": "Drenthe",
        "Postcode": "9471AA",
        "CountryID": 159,
        "Latitude": 53.092833955052896,
        "Longitude": 6.686966293022351,
        "DistanceUnit": 0
    },
    "Connections": [
        {
            "ID": 271016,
            "ConnectionTypeID": 25,
            "StatusTypeID": 50,
            "LevelID": 2,
            "Amps": 16,
            "Voltage": 400,
            "PowerKW": 11,
            "CurrentTypeID": 20,
            "Quantity": 2
        }
    ],
    "NumberOfPoints": 2,
    "StatusTypeID": 50,
    "DateLastStatusUpdate": "2021-04-18T14:40:00Z",
    "DataQualityLevel": 1,
    "DateCreated": "2021-04-18T08:52:00Z",
    "SubmissionStatusTypeID": 200
}