{
    "IsRecentlyVerified": false,
    "ID": 172935,
    "UUID": "042AF67D-645F-42F4-BD30-6A80DC0428C5",
    "DataProviderID": 1,
    "OperatorID": 213,
    "UsageTypeID": 1,
    "AddressInfo": {
        "ID": 173294,
        "Title": "Izivia Charger Intermarché, Limoges",
        "AddressLine1": "26 Rue Bernard de Ventadour",
        "Town": "Limoges",
        "Postcode": "87000",
        "CountryID": 80,
        "Latitude": 45.8144,
        "Longitude": -1.2682,
        "DistanceUnit": 0
    },
    "Connections": [
        {
            "ID": 264562,
            "ConnectionTypeID": 33,
            "StatusTypeID": 50,
            "LevelID": 3,
            "PowerKW": 50,
            "CurrentTypeID": 30,
            "Quantity": 1
        },
        {
            "ID": 264563,
            "ConnectionTypeID": 2,
            "StatusTypeID": 50,
            "LevelID": 3,
            "PowerKW": 50,
            "CurrentTypeID": 30,
            "Quantity": 1
        },
        {
            "ID": 264564,
            "ConnectionTypeID": 1036,
            "StatusTypeID": 50,
            "LevelID": 3,
            "PowerKW": 43,
            "CurrentTypeID": 20,
            "Quantity": 1
        }
    ],
    "NumberOfPoints": 1,
    "StatusTypeID": 50,
    "DateLastStatusUpdate": "2021-02-23T09:31:00Z",
    "DataQualityLevel": 1,
    "DateCreated": "2021-02-22T12:00:00Z",
    "SubmissionStatusTypeID": 200
}