{
    "IsRecentlyVerified": false,
    "ID": 85020,
    "UUID": "00C87A28-F854-4D7C-BEC1-35500C506895",
    "DataProviderID": 1,
    "OperatorID": 23,
    "OperatorsReference": "26028",
    "UsageTypeID": 4,
    "AddressInfo": {
        "ID": 85366,
        "Title": "Ipark 247 N 7th Street",
        "AddressLine1": "249 N 7th St",
        "Town": "Brooklyn",
        "StateOrProvince": "New York",
        "Postcode": "11248",
        "CountryID": 2,
        "Latitude": 40.715954,
        "Longitude": -73.954681,
        "ContactTelephone1": "(929) 337-8633",
        "DistanceUnit": 0
    },
    "Connections": [
        {
            "ID": 120771,
            "ConnectionTypeID": 30,
            "StatusTypeID": 50,
            "LevelID": 2,
            "Amps": 16,
            "Voltage": 400,
            "PowerKW": 11,
            "CurrentTypeID": 20,
            "Quantity": 2
        }
    ],
    "NumberOfPoints": 2,
    "GeneralComments": "2 Tesla Connectors, up to 11kW.Available to the public. Please see valet.",
    "StatusTypeID": 50,
    "DateLastStatusUpdate": "2017-03-24T06:27:00Z",
    "DataQualityLevel": 1,
    "DateCreated": "2017-03-24T06:27:00Z",
    "SubmissionStatusTypeID": 200
}