{
    "IsRecentlyVerified": false,
    "ID": 77550,
    "UUID": "801D13AE-134C-46FF-B67C-1A52D7722E76",
    "DataProviderID": 1,
    "OperatorID": 1235,
    "OperatorsReference": "5703557de4b0ad00f86aaf8c",
    "UsageTypeID": 4,
    "UsageCost": ">3kW: 0,25€/15min <60min; 2,00€/15min >60min <75min; 4,00€/15min >=75min",
    "AddressInfo": {
        "ID": 77896,
        "Title": "Rue Perignon",
        "AddressLine1": "2 RUE PERIGNON",
        "Town": "Paris",
        "StateOrProvince": "Paris 9",
        "Postcode": "75007",
        "CountryID": 80,
        "Latitude": 48.847931,
        "Longitude": 2.309952,
        "DistanceUnit": 0
    },
    "Connections": [
        {
            "ID": 111958,
            "ConnectionTypeID": 26,
            "StatusTypeID": 150,
            "LevelID": 2,
            "Amps": 32,
            "Voltage": 400,
            "PowerKW": 22,
            "CurrentTypeID": 20,
            "Quantity": 1
        },
        {
            "ID": 111959,
            "ConnectionTypeID": 23,
            "StatusTypeID": 150,
            "LevelID": 2,
            "PowerKW": 3,
            "CurrentTypeID": 20,
            "Quantity": 1
        },
        {
            "ID": 111960,
            "ConnectionTypeID": 1036,
            "StatusTypeID": 150,
            "LevelID": 2,
            "Amps": 32,
            "Voltage": 400,
            "PowerKW": 22,
            "CurrentTypeID": 20,
            "Quantity": 1
        },
        {
            "ID": 111961,
            "ConnectionTypeID": 2,
            "StatusTypeID": 150,
            "LevelID": 2,
            "Amps": 32,
            "Voltage": 400,
            "PowerKW": 22,
            "CurrentTypeID": 20,
            "Quantity": 1
        },
        {
            "ID": 111962,
            "ConnectionTypeID": 33,
            "StatusTypeID": 150,
            "LevelID": 2,
            "Amps": 32,
            "Voltage": 400,
            "PowerKW": 22,
            "CurrentTypeID": 20,
            "Quantity": 1
        },
        {
            "ID": 111963,
            "ConnectionTypeID": 26,
            "StatusTypeID": 150,
            "LevelID": 2,
            "PowerKW": 3,
            "CurrentTypeID": 20,
            "Quantity": 1
        },
        {
            "ID": 111964,
            "ConnectionTypeID": 33,
            "StatusTypeID": 150,
            "LevelID": 2,
            "Amps": 32,
            "Voltage": 400,
            "PowerKW": 22,
            "CurrentTypeID": 20,
            "Quantity": 1
        },
        {
            "ID": 111965,
            "ConnectionTypeID": 2,
            "StatusTypeID": 150,
            "LevelID": 2,
            "PowerKW": 3,
            "CurrentTypeID": 30,
            "Quantity": 1
        }
    ],
    "NumberOfPoints": 4,
    "StatusTypeID": 100,
    "DateLastStatusUpdate": "2017-04-10T22:29:00Z",
    "DataQualityLevel": 1,
    "DateCreated": "2017-01-18T10:51:00Z",
    "SubmissionStatusTypeID": 200
}