{
    "IsRecentlyVerified": false,
    "ID": 40199,
    "UUID": "B55410AE-B978-4A1C-AA90-72C075D8CA6C",
    "DataProviderID": 2,
    "DataProvidersReference": "64914",
    "OperatorID": 5,
    "UsageTypeID": 1,
    "AddressInfo": {
        "ID": 40545,
        "Title": "STONERIDGE CORP",
        "AddressLine1": "6140 Stoneridge Mall Rd",
        "Town": "Pleasanton",
        "StateOrProvince": "CA",
        "Postcode": "94588",
        "CountryID": 2,
        "Latitude": 37.697157,
        "Longitude": -121.925994,
        "ContactTelephone1": "888-758-4389",
        "AccessComments": "24 hours daily",
        "RelatedURL": "http://www.chargepoint.com/",
        "DistanceUnit": 0
    },
    "Connections": [
        {
            "ID": 43756,
            "ConnectionTypeID": 1,
            "LevelID": 2,
            "Amps": 16,
            "Voltage": 230,
            "PowerKW": 3,
            "CurrentTypeID": 10,
            "Quantity": 22
        }
    ],
    "DateLastStatusUpdate": "2019-12-24T09:14:00Z",
    "DataQualityLevel": 3,
    "DateCreated": "2015-01-10T01:01:00Z",
    "SubmissionStatusTypeID": 100
}