{
    "IsRecentlyVerified": false,
    "ID": 8487,
    "UUID": "D85D7C22-DC88-4E06-ABDD-121582F95D98",
    "DataProviderID": 15,
    "DataProvidersReference": "503",
    "OperatorID": 1,
    "AddressInfo": {
        "ID": 8384,
        "Title": "Campus Drive",
        "AddressLine1": "Campus Drive",
        "Town": "Portland",
        "StateOrProvince": "Oregon",
        "Postcode": "",
        "CountryID": 2,
        "Latitude": 45.49848,
        "Longitude": -122.68521,
        "ContactTelephone1": "",
        "RelatedURL": "http://carstations.com/503",
        "DistanceUnit": 0
    },
    "Connections": [
        {
            "ID": 5912,
            "ConnectionTypeID": 9,
            "Reference": "NEMA5",
            "LevelID": 1
        }
    ],
    "StatusTypeID": 0,
    "DateLastStatusUpdate": "2017-11-04T14:05:00Z",
    "DataQualityLevel": 1,
    "DateCreated": "2011-11-11T12:06:00Z",
    "SubmissionStatusTypeID": 100
}