{
    "IsRecentlyVerified": false,
    "ID": 91076,
    "UUID": "C8764123-FF31-4393-B1EC-5F7DDDFD85AA",
    "DataProviderID": 1,
    "OperatorID": 69,
    "UsageTypeID": 4,
    "AddressInfo": {
        "ID": 91422,
        "Title": "Bavariastraße",
        "AddressLine1": "Bavariastraße 5",
        "Town": "München",
        "StateOrProvince": "Bayern",
        "Postcode": "80336",
        "CountryID": 87,
        "Latitude": 48.1265091,
        "Longitude": 11.5465802,
        "AccessComments": "24/7 nutzbar mit allen Karten des Verbundes Ladenetz ",
        "RelatedURL": "http://www.swm.de/privatkunden/unternehmen/innovation/elektromobilitaet.html",
        "DistanceUnit": 0
    },
    "Connections": [
        {
            "ID": 129136,
            "ConnectionTypeID": 25,
            "StatusTypeID": 50,
            "LevelID": 2,
            "Amps": 32,
            "Voltage": 400,
            "PowerKW": 22,
            "CurrentTypeID": 10,
            "Quantity": 4
        }
    ],
    "NumberOfPoints": 4,
    "StatusTypeID": 50,
    "DateLastStatusUpdate": "2017-07-28T06:57:00Z",
    "DataQualityLevel": 1,
    "DateCreated": "2017-07-28T06:55:00Z",
    "SubmissionStatusTypeID": 200
}