{
    "IsRecentlyVerified": false,
    "ID": 71769,
    "UUID": "BC61A628-11E9-45BE-87DB-7064363D6C59",
    "DataProviderID": 1,
    "OperatorID": 15,
    "UsageTypeID": 1,
    "UsageCost": "$9.95/30 minutes for rapid charge, $1.50/hour for J1172",
    "AddressInfo": {
        "ID": 72115,
        "Title": "Whole Foods - Redwood City",
        "AddressLine1": "1250 Jefferson Ave Redwood City, CA",
        "Town": "redwoodcity",
        "StateOrProvince": "ca",
        "Postcode": "94061",
        "CountryID": 2,
        "Latitude": 37.4822993,
        "Longitude": -122.2316749,
        "DistanceUnit": 0
    },
    "Connections": [
        {
            "ID": 102803,
            "ConnectionTypeID": 32,
            "StatusTypeID": 50,
            "LevelID": 3,
            "PowerKW": 50,
            "CurrentTypeID": 30,
            "Quantity": 2
        },
        {
            "ID": 103117,
            "ConnectionTypeID": 2,
            "StatusTypeID": 50,
            "LevelID": 3,
            "PowerKW": 50,
            "CurrentTypeID": 30,
            "Quantity": 2
        },
        {
            "ID": 103118,
            "ConnectionTypeID": 1,
            "StatusTypeID": 50,
            "LevelID": 2,
            "CurrentTypeID": 10,
            "Quantity": 1
        }
    ],
    "NumberOfPoints": 3,
    "StatusTypeID": 50,
    "DateLastStatusUpdate": "2016-09-25T20:45:00Z",
    "DataQualityLevel": 1,
    "DateCreated": "2016-09-07T03:15:00Z",
    "SubmissionStatusTypeID": 200
}