{
    "IsRecentlyVerified": false,
    "ID": 26910,
    "UUID": "D8065456-39AF-42CE-A567-CE1A8C2F6074",
    "DataProviderID": 2,
    "DataProvidersReference": "62023",
    "OperatorID": 5,
    "UsageTypeID": 1,
    "AddressInfo": {
        "ID": 27256,
        "Title": "ACCESSO SERVICE",
        "AddressLine1": "555 North Point Center East",
        "Town": "Alpharetta",
        "StateOrProvince": "GA",
        "Postcode": "30022",
        "CountryID": 2,
        "Latitude": 34.0479429,
        "Longitude": -84.300965,
        "ContactTelephone1": "888-758-4389",
        "AccessComments": "24 hours daily",
        "RelatedURL": "http://www.chargepoint.com/",
        "DistanceUnit": 0
    },
    "Connections": [
        {
            "ID": 29470,
            "ConnectionTypeID": 1,
            "LevelID": 2,
            "Amps": 16,
            "Voltage": 230,
            "PowerKW": 3,
            "CurrentTypeID": 10,
            "Quantity": 2
        }
    ],
    "DateLastStatusUpdate": "2019-04-06T04:01:00Z",
    "DataQualityLevel": 3,
    "DateCreated": "2014-11-28T03:37:00Z",
    "SubmissionStatusTypeID": 100
}