{
    "IsRecentlyVerified": false,
    "ID": 32819,
    "UUID": "1F4ED86B-CCD4-4D23-9987-564A6E020595",
    "DataProviderID": 1,
    "OperatorID": 105,
    "OperatorsReference": "Essent EM-DE-05170028-01-00002",
    "UsageTypeID": 4,
    "AddressInfo": {
        "ID": 33165,
        "Title": "Leineweberplatz",
        "AddressLine1": "Leineweberplatz",
        "Town": "Neukirchen-Vluyn",
        "Postcode": "47506",
        "CountryID": 87,
        "Latitude": 51.438333,
        "Longitude": 6.5325,
        "DistanceUnit": 0
    },
    "Connections": [
        {
            "ID": 36330,
            "ConnectionTypeID": 25,
            "LevelID": 2,
            "PowerKW": 11
        },
        {
            "ID": 46554,
            "ConnectionTypeID": 25,
            "LevelID": 2,
            "PowerKW": 11
        }
    ],
    "NumberOfPoints": 1,
    "StatusTypeID": 50,
    "DateLastStatusUpdate": "2015-04-13T18:03:00Z",
    "DataQualityLevel": 3,
    "DateCreated": "2015-01-09T06:03:00Z",
    "SubmissionStatusTypeID": 200
}