{
    "IsRecentlyVerified": false,
    "ID": 135186,
    "UUID": "F1C658AC-5BFF-463E-B889-52E73AC82B1F",
    "DataProviderID": 1,
    "OperatorID": 3327,
    "UsageTypeID": 4,
    "AddressInfo": {
        "ID": 135532,
        "Title": "Becharge Castelletto Libertà",
        "AddressLine1": "Via Caduti per la Libertà",
        "Town": "Castelletto sopra Ticino",
        "StateOrProvince": "NO",
        "Postcode": "28053",
        "CountryID": 112,
        "Latitude": 45.70707658005688,
        "Longitude": 8.628852009492903,
        "ContactTelephone1": "02-49527730",
        "ContactEmail": "emobility@buildingenergy.it",
        "RelatedURL": "https://www.bec.energy/",
        "DistanceUnit": 0
    },
    "Connections": [
        {
            "ID": 189268,
            "ConnectionTypeID": 25,
            "StatusTypeID": 50,
            "LevelID": 2,
            "Amps": 32,
            "Voltage": 400,
            "PowerKW": 22,
            "CurrentTypeID": 20,
            "Quantity": 4
        }
    ],
    "NumberOfPoints": 4,
    "StatusTypeID": 50,
    "DateLastStatusUpdate": "2019-12-10T13:49:00Z",
    "DataQualityLevel": 1,
    "DateCreated": "2019-12-10T13:49:00Z",
    "SubmissionStatusTypeID": 200
}