{
    "IsRecentlyVerified": false,
    "ID": 27556,
    "UUID": "6661C7F5-FFAB-4C7D-BB23-6A3178C4DA0F",
    "DataProviderID": 2,
    "DataProvidersReference": "60677",
    "OperatorID": 5,
    "UsageTypeID": 1,
    "AddressInfo": {
        "ID": 27902,
        "Title": "ORACLE PLS",
        "AddressLine1": "5805 Owens Dr",
        "Town": "Pleasanton",
        "StateOrProvince": "CA",
        "Postcode": "94588",
        "CountryID": 2,
        "Latitude": 37.699445,
        "Longitude": -121.8902215,
        "ContactTelephone1": "888-758-4389",
        "AccessComments": "24 hours daily",
        "RelatedURL": "http://www.chargepoint.com/",
        "DistanceUnit": 0
    },
    "Connections": [
        {
            "ID": 30210,
            "ConnectionTypeID": 1,
            "LevelID": 2,
            "Amps": 16,
            "Voltage": 230,
            "PowerKW": 3,
            "CurrentTypeID": 10,
            "Quantity": 2
        }
    ],
    "DateLastStatusUpdate": "2019-04-06T04:02:00Z",
    "DataQualityLevel": 3,
    "DateCreated": "2014-11-28T03:38:00Z",
    "SubmissionStatusTypeID": 100
}