{
    "IsRecentlyVerified": false,
    "ID": 182186,
    "UUID": "D0EADDD7-C9E8-494A-9B91-6C92BD90AFE7",
    "DataProviderID": 29,
    "DataProvidersReference": "16874",
    "OperatorID": 103,
    "AddressInfo": {
        "ID": 182545,
        "Title": "Feldstr. 51",
        "AddressLine1": "Feldstr. 51",
        "Town": "Berlin",
        "Postcode": "13585",
        "CountryID": 87,
        "Latitude": 52.543395,
        "Longitude": 13.205021,
        "DistanceUnit": 0
    },
    "Connections": [
        {
            "ID": 287616,
            "ConnectionTypeID": 25,
            "StatusTypeID": 50,
            "LevelID": 2,
            "PowerKW": 11,
            "CurrentTypeID": 20
        },
        {
            "ID": 287617,
            "ConnectionTypeID": 25,
            "StatusTypeID": 50,
            "LevelID": 2,
            "PowerKW": 11,
            "CurrentTypeID": 20
        }
    ],
    "StatusTypeID": 50,
    "DateLastStatusUpdate": "2021-07-12T02:50:00Z",
    "MetadataValues": [
        {
            "ID": 14480,
            "MetadataFieldID": 4,
            "ItemValue": "Data from the German chargepoint registry provided by Bundesnetzagentur.de under the CC-BY 4.0 license"
        }
    ],
    "DataQualityLevel": 3,
    "DateCreated": "2021-07-08T10:02:00Z",
    "SubmissionStatusTypeID": 100
}