{
    "IsRecentlyVerified": false,
    "ID": 66482,
    "UUID": "AA2B0558-13E9-47E2-A2EF-1B4662FA5ECB",
    "DataProviderID": 1,
    "OperatorID": 93,
    "OperatorsReference": "RC15",
    "UsageTypeID": 4,
    "UsageCost": "Free",
    "AddressInfo": {
        "ID": 66828,
        "Title": "EMO Fort Service Station",
        "AddressLine1": "287 Shore Road",
        "AddressLine2": "",
        "Town": "Belfast",
        "StateOrProvince": "County Antrim",
        "Postcode": "BT15 9PW",
        "CountryID": 1,
        "Latitude": 54.62978684699866,
        "Longitude": -5.922191073402467,
        "ContactTelephone1": "",
        "ContactTelephone2": "",
        "ContactEmail": "",
        "AccessComments": "",
        "RelatedURL": "",
        "DistanceUnit": 0
    },
    "Connections": [
        {
            "ID": 91863,
            "ConnectionTypeID": 2,
            "StatusTypeID": 50,
            "LevelID": 3,
            "Amps": 110,
            "Voltage": 400,
            "PowerKW": 44,
            "CurrentTypeID": 30,
            "Quantity": 1
        },
        {
            "ID": 91864,
            "ConnectionTypeID": 33,
            "StatusTypeID": 50,
            "LevelID": 3,
            "Amps": 110,
            "Voltage": 400,
            "PowerKW": 44,
            "CurrentTypeID": 30,
            "Quantity": 1
        },
        {
            "ID": 91865,
            "ConnectionTypeID": 1036,
            "StatusTypeID": 50,
            "LevelID": 3,
            "Amps": 110,
            "Voltage": 400,
            "PowerKW": 43,
            "CurrentTypeID": 20,
            "Quantity": 1
        }
    ],
    "NumberOfPoints": 2,
    "GeneralComments": "",
    "StatusTypeID": 50,
    "DateLastStatusUpdate": "2018-06-07T16:35:00Z",
    "DataQualityLevel": 1,
    "DateCreated": "2016-05-21T20:37:00Z",
    "SubmissionStatusTypeID": 200
}