{
    "IsRecentlyVerified": false,
    "ID": 131964,
    "UUID": "EEFB5F0B-4A49-4DF8-9768-B42884629F7A",
    "DataProviderID": 1,
    "OperatorID": 23,
    "OperatorsReference": "51821",
    "UsageTypeID": 4,
    "AddressInfo": {
        "ID": 132310,
        "Title": "Hotel Miramonti",
        "AddressLine1": "Via Acquapartita",
        "Town": "Bagno di Romagna",
        "Postcode": "47021",
        "CountryID": 112,
        "Latitude": 43.86335,
        "Longitude": 12.024522,
        "ContactTelephone1": "+39 0543 903640",
        "DistanceUnit": 0
    },
    "Connections": [
        {
            "ID": 184640,
            "ConnectionTypeID": 30,
            "StatusTypeID": 50,
            "LevelID": 2,
            "PowerKW": 11,
            "CurrentTypeID": 20,
            "Quantity": 2
        }
    ],
    "NumberOfPoints": 2,
    "GeneralComments": "2 Tesla Connectors, up to 11kW.Available for customers. Please call ahead.",
    "StatusTypeID": 50,
    "DateLastStatusUpdate": "2019-09-16T05:36:00Z",
    "DataQualityLevel": 1,
    "DateCreated": "2019-09-16T05:36:00Z",
    "SubmissionStatusTypeID": 200
}