{
    "IsRecentlyVerified": true,
    "DateLastVerified": "2021-08-23T21:51:00Z",
    "ID": 188895,
    "UUID": "9C26952F-588C-40BC-AC13-8B7F029E1C52",
    "DataProviderID": 1,
    "OperatorID": 2247,
    "UsageTypeID": 1,
    "AddressInfo": {
        "ID": 189254,
        "Title": "Hotel Bellavista",
        "AddressLine1": "Carretera de Puigcerdà 43",
        "Town": "Bellver de Cerdanya",
        "StateOrProvince": "Lleida",
        "Postcode": "25720",
        "CountryID": 210,
        "Latitude": 42.373524325205466,
        "Longitude": 1.7752427437333154,
        "DistanceUnit": 0
    },
    "Connections": [
        {
            "ID": 305250,
            "ConnectionTypeID": 33,
            "StatusTypeID": 50,
            "LevelID": 3,
            "PowerKW": 50,
            "CurrentTypeID": 30,
            "Quantity": 2
        },
        {
            "ID": 305251,
            "ConnectionTypeID": 2,
            "StatusTypeID": 50,
            "LevelID": 3,
            "PowerKW": 50,
            "CurrentTypeID": 30,
            "Quantity": 1
        },
        {
            "ID": 305252,
            "ConnectionTypeID": 1036,
            "StatusTypeID": 50,
            "LevelID": 2,
            "Amps": 32,
            "Voltage": 400,
            "PowerKW": 22,
            "CurrentTypeID": 20,
            "Quantity": 2
        }
    ],
    "NumberOfPoints": 4,
    "StatusTypeID": 50,
    "DateLastStatusUpdate": "2021-08-24T19:47:00Z",
    "DataQualityLevel": 1,
    "DateCreated": "2021-08-23T21:51:00Z",
    "SubmissionStatusTypeID": 200
}