{
    "IsRecentlyVerified": false,
    "ID": 153779,
    "UUID": "A715A40E-0934-4680-91DF-669DDA6626AA",
    "DataProviderID": 28,
    "DataProvidersReference": "FR*S10*P10367A",
    "UsageTypeID": 5,
    "AddressInfo": {
        "ID": 154132,
        "Title": "LA SAULSOTTE",
        "AddressLine1": "1 Rue Saint Fergel 10400 LA SAULSOTTE",
        "CountryID": 80,
        "Latitude": 48.540725,
        "Longitude": 3.500127,
        "AccessComments": "",
        "DistanceUnit": 0
    },
    "Connections": [
        {
            "ID": 215939,
            "ConnectionTypeID": 28,
            "StatusTypeID": 50,
            "LevelID": 2,
            "PowerKW": 18,
            "CurrentTypeID": 10
        },
        {
            "ID": 215940,
            "ConnectionTypeID": 25,
            "StatusTypeID": 50,
            "LevelID": 2,
            "PowerKW": 18,
            "CurrentTypeID": 20
        },
        {
            "ID": 249675,
            "ConnectionTypeID": 28,
            "StatusTypeID": 50,
            "LevelID": 2,
            "PowerKW": 18,
            "CurrentTypeID": 10
        },
        {
            "ID": 249676,
            "ConnectionTypeID": 25,
            "StatusTypeID": 50,
            "LevelID": 2,
            "PowerKW": 18,
            "CurrentTypeID": 20
        }
    ],
    "GeneralComments": "\"Une unité = 6kWh de recharge. Utilisateur abonné : 1€/unité",
    "StatusTypeID": 50,
    "DateLastStatusUpdate": "2020-08-27T05:15:00Z",
    "DataQualityLevel": 2,
    "DateCreated": "2020-03-15T10:54:00Z",
    "SubmissionStatusTypeID": 100
}