{
    "IsRecentlyVerified": false,
    "ID": 97867,
    "UUID": "7E412C32-52BE-40E9-9E09-8C2DDB269893",
    "DataProviderID": 1,
    "OperatorID": 23,
    "OperatorsReference": "38164",
    "UsageTypeID": 4,
    "AddressInfo": {
        "ID": 98213,
        "Title": "Hôtel la Villa Douce",
        "AddressLine1": "8 Corniche de Paris",
        "Town": "Rayol-Canadel-sur-Mer",
        "Postcode": "83820",
        "CountryID": 80,
        "Latitude": 43.160327,
        "Longitude": 6.486813,
        "ContactTelephone1": "+33 4 94 15 30 30",
        "DistanceUnit": 0
    },
    "Connections": [
        {
            "ID": 138775,
            "ConnectionTypeID": 30,
            "StatusTypeID": 50,
            "LevelID": 2,
            "Amps": 32,
            "Voltage": 230,
            "PowerKW": 11,
            "CurrentTypeID": 10,
            "Quantity": 2
        }
    ],
    "NumberOfPoints": 2,
    "GeneralComments": "2 Tesla Connectors, up to 6kW.Available for customers. Please call ahead.",
    "StatusTypeID": 50,
    "DateLastStatusUpdate": "2018-10-03T17:53:00Z",
    "DataQualityLevel": 1,
    "DateCreated": "2018-01-21T16:51:00Z",
    "SubmissionStatusTypeID": 200
}