{
    "IsRecentlyVerified": false,
    "ID": 139734,
    "UUID": "66F12154-2F45-4CB0-8B51-184F6D9719D9",
    "DataProviderID": 2,
    "DataProvidersReference": "95328",
    "OperatorID": 9,
    "UsageTypeID": 1,
    "AddressInfo": {
        "ID": 140086,
        "Title": "Hotel Solaire Los Angeles",
        "AddressLine1": "1710 West 7th Street",
        "Town": "Los Angeles",
        "StateOrProvince": "CA",
        "Postcode": "90017",
        "CountryID": 2,
        "Latitude": 34.05449,
        "Longitude": -118.272838,
        "ContactTelephone1": "888-998-2546",
        "AccessComments": "MON: 24 hours | TUE: 24 hours | WED: 24 hours | THU: 24 hours | FRI: 24 hours | SAT: 24 hours | SUN: 24 hours",
        "RelatedURL": "http://www.blinkcharging.com/",
        "DistanceUnit": 0
    },
    "Connections": [
        {
            "ID": 195181,
            "ConnectionTypeID": 1,
            "LevelID": 2,
            "Amps": 16,
            "Voltage": 230,
            "PowerKW": 3.7,
            "CurrentTypeID": 10,
            "Quantity": 3
        }
    ],
    "StatusTypeID": 50,
    "DateLastStatusUpdate": "2020-06-26T02:56:00Z",
    "DataQualityLevel": 3,
    "DateCreated": "2019-12-24T09:11:00Z",
    "SubmissionStatusTypeID": 100
}