{
    "IsRecentlyVerified": false,
    "ID": 142569,
    "UUID": "09D1D054-25C0-42F1-AFF3-F409049600C5",
    "DataProviderID": 1,
    "OperatorID": 3318,
    "UsageTypeID": 1,
    "AddressInfo": {
        "ID": 142921,
        "Title": "Walmart 2368 - East Stroudsburg, PA",
        "AddressLine1": "355 Lincoln Ave.",
        "Town": "East Stroudsburg",
        "StateOrProvince": "PA",
        "Postcode": "18301",
        "CountryID": 2,
        "Latitude": 40.99165325443653,
        "Longitude": -75.1828138885329,
        "ContactTelephone1": "833-632-2778",
        "AccessComments": "24 hours daily",
        "RelatedURL": "https://www.electrifyamerica.com/",
        "DistanceUnit": 0
    },
    "Connections": [
        {
            "ID": 198732,
            "ConnectionTypeID": 2,
            "LevelID": 3,
            "Amps": 100,
            "Voltage": 400,
            "PowerKW": 40,
            "CurrentTypeID": 30,
            "Quantity": 1
        },
        {
            "ID": 198733,
            "ConnectionTypeID": 32,
            "LevelID": 3,
            "Amps": 100,
            "Voltage": 400,
            "PowerKW": 40,
            "CurrentTypeID": 30,
            "Quantity": 1
        }
    ],
    "StatusTypeID": 30,
    "DateLastStatusUpdate": "2020-10-26T12:53:00Z",
    "DataQualityLevel": 3,
    "DateCreated": "2019-12-24T09:18:00Z",
    "SubmissionStatusTypeID": 100
}