{
    "IsRecentlyVerified": false,
    "ID": 3635,
    "UUID": "B153A80E-E26E-43A9-82A8-DDD0E0E093D3",
    "DataProviderID": 1,
    "OperatorID": 6,
    "UsageTypeID": 1,
    "AddressInfo": {
        "ID": 3636,
        "Title": "Victory Nissan of Chantilly",
        "AddressLine1": "14840 Stonecroft Center Ct.",
        "Town": "Chantilly",
        "StateOrProvince": "VA",
        "Postcode": "20151",
        "CountryID": 2,
        "Latitude": 38.89933,
        "Longitude": -77.459997,
        "ContactTelephone1": "703-889-3700",
        "DistanceUnit": 0
    },
    "Connections": [
        {
            "ID": 150,
            "ConnectionTypeID": 1,
            "Quantity": 1
        }
    ],
    "NumberOfPoints": 3,
    "DateLastStatusUpdate": "2019-12-15T06:07:00Z",
    "DateCreated": "2010-02-28T00:00:00Z",
    "SubmissionStatusTypeID": 200
}