{
    "IsRecentlyVerified": false,
    "ID": 156200,
    "UUID": "8EC13096-66E1-4002-A5E5-31E9442131B5",
    "DataProviderID": 1,
    "OperatorID": 80,
    "UsageTypeID": 4,
    "AddressInfo": {
        "ID": 156554,
        "Title": "Mercedes-Benz New Motors AUTOTORINO | ENELX",
        "AddressLine1": "Via Bruno Jamoretti, 9/11",
        "Town": "Induno Olona",
        "StateOrProvince": "VA",
        "Postcode": "21056",
        "CountryID": 112,
        "Latitude": 45.846654454573866,
        "Longitude": 8.839927303856825,
        "RelatedURL": "https://www.enelx.com/it/it/emobility",
        "DistanceUnit": 0
    },
    "Connections": [
        {
            "ID": 219828,
            "ConnectionTypeID": 25,
            "StatusTypeID": 50,
            "LevelID": 2,
            "Amps": 32,
            "Voltage": 400,
            "PowerKW": 22,
            "CurrentTypeID": 20,
            "Quantity": 2
        }
    ],
    "NumberOfPoints": 2,
    "StatusTypeID": 50,
    "DateLastStatusUpdate": "2020-05-10T11:43:00Z",
    "DataQualityLevel": 1,
    "DateCreated": "2020-05-10T11:43:00Z",
    "SubmissionStatusTypeID": 200
}