{
    "IsRecentlyVerified": false,
    "ID": 112478,
    "UUID": "79768DE8-4C1B-4F89-A46F-1841F9AFD47E",
    "DataProviderID": 1,
    "OperatorID": 3315,
    "OperatorsReference": "51120",
    "UsageTypeID": 4,
    "UsageCost": "Free",
    "AddressInfo": {
        "ID": 112824,
        "Title": "Beith Road, Glengarnock",
        "AddressLine1": "Garnock Community Campus",
        "Town": "Beith Road",
        "StateOrProvince": "Glengarnock",
        "Postcode": "KA14 3BF",
        "CountryID": 1,
        "Latitude": 55.73899,
        "Longitude": -4.66963,
        "DistanceUnit": 0
    },
    "Connections": [
        {
            "ID": 158225,
            "ConnectionTypeID": 25,
            "StatusTypeID": 50,
            "LevelID": 2,
            "Amps": 32,
            "Voltage": 400,
            "PowerKW": 22,
            "CurrentTypeID": 20,
            "Quantity": 2
        }
    ],
    "NumberOfPoints": 2,
    "StatusTypeID": 50,
    "DateLastStatusUpdate": "2020-01-14T09:31:00Z",
    "DataQualityLevel": 1,
    "DateCreated": "2018-11-02T06:26:00Z",
    "SubmissionStatusTypeID": 200
}