{
    "IsRecentlyVerified": false,
    "ID": 130538,
    "UUID": "C3D187DF-5F62-4426-BB76-8C4463FFF7AD",
    "DataProviderID": 1,
    "OperatorID": 80,
    "UsageTypeID": 4,
    "AddressInfo": {
        "ID": 130884,
        "Title": "Nemi De Santis | EnelX",
        "AddressLine1": "Piazza De Santis",
        "Town": "Nemi",
        "StateOrProvince": "RM",
        "Postcode": "00074",
        "CountryID": 112,
        "Latitude": 41.7239988160254,
        "Longitude": 12.7222122665216,
        "ContactTelephone1": "800.069.850",
        "RelatedURL": "https://www.enelx.com/it/it/emobility",
        "DistanceUnit": 0
    },
    "Connections": [
        {
            "ID": 182738,
            "ConnectionTypeID": 25,
            "StatusTypeID": 150,
            "LevelID": 2,
            "Amps": 32,
            "Voltage": 400,
            "PowerKW": 22,
            "CurrentTypeID": 20,
            "Quantity": 1
        },
        {
            "ID": 182739,
            "ConnectionTypeID": 36,
            "StatusTypeID": 150,
            "LevelID": 2,
            "Amps": 16,
            "Voltage": 240,
            "PowerKW": 3.7,
            "CurrentTypeID": 10,
            "Quantity": 1
        }
    ],
    "NumberOfPoints": 2,
    "StatusTypeID": 150,
    "DateLastStatusUpdate": "2019-08-06T10:09:00Z",
    "DataQualityLevel": 1,
    "DateCreated": "2019-08-06T10:09:00Z",
    "SubmissionStatusTypeID": 200
}