{
    "UserComments": [
        {
            "ID": 21558,
            "ChargePointID": 126991,
            "CommentTypeID": 10,
            "UserName": "vsmith1",
            "Rating": 5,
            "DateCreated": "2019-09-26T09:41:09.033Z",
            "User": {
                "ID": 19526,
                "Username": "vsmith1"
            },
            "CheckinStatusTypeID": 10
        }
    ],
    "IsRecentlyVerified": false,
    "ID": 126991,
    "UUID": "422A97F7-A749-45A4-8C24-7C1315A4F2FD",
    "DataProviderID": 1,
    "OperatorID": 32,
    "OperatorsReference": "24384,24385",
    "UsageTypeID": 4,
    "UsageCost": "£0.108/kWh; for Polar Plus subscription members only",
    "AddressInfo": {
        "ID": 127337,
        "Title": "Co-Op Petrol",
        "AddressLine1": "Co-Op Petrol",
        "Town": "Saxon Cross",
        "StateOrProvince": "Sandbach",
        "Postcode": "CW11 4SP",
        "CountryID": 1,
        "Latitude": 53.151863885565,
        "Longitude": -2.34849144206805,
        "DistanceUnit": 0
    },
    "Connections": [
        {
            "ID": 177847,
            "ConnectionTypeID": 33,
            "StatusTypeID": 50,
            "LevelID": 3,
            "PowerKW": 50,
            "CurrentTypeID": 30,
            "Quantity": 2
        },
        {
            "ID": 177848,
            "ConnectionTypeID": 2,
            "StatusTypeID": 50,
            "LevelID": 3,
            "PowerKW": 50,
            "CurrentTypeID": 30,
            "Quantity": 2
        },
        {
            "ID": 177849,
            "ConnectionTypeID": 1036,
            "StatusTypeID": 50,
            "LevelID": 3,
            "PowerKW": 43,
            "CurrentTypeID": 20,
            "Quantity": 2
        }
    ],
    "NumberOfPoints": 2,
    "GeneralComments": "The unit is located in the outside the Co-Op Shop",
    "StatusTypeID": 50,
    "DateLastStatusUpdate": "2019-09-26T09:41:00Z",
    "DataQualityLevel": 1,
    "DateCreated": "2019-05-25T05:18:00Z",
    "SubmissionStatusTypeID": 200
}