{
    "IsRecentlyVerified": false,
    "ID": 65797,
    "UUID": "5B3DCAA2-6120-4F5E-A2CB-26058991606C",
    "DataProviderID": 26,
    "DataProvidersReference": "85332",
    "OperatorID": 73,
    "OperatorsReference": "EV-Box EVB-P1414269",
    "UsageCost": "0.00 jaarabonnement",
    "AddressInfo": {
        "ID": 66143,
        "Title": "Verlengde Hereweg 174",
        "AddressLine1": "Verlengde Hereweg 174",
        "Town": "Groningen",
        "Postcode": "9722 AM",
        "CountryID": 159,
        "Latitude": 53.19255,
        "Longitude": 6.58483,
        "RelatedURL": "http://www.ev-box.nl",
        "DistanceUnit": 0
    },
    "Connections": [
        {
            "ID": 90868,
            "ConnectionTypeID": 25,
            "LevelID": 2,
            "PowerKW": 11,
            "CurrentTypeID": 10
        },
        {
            "ID": 90869,
            "ConnectionTypeID": 25,
            "LevelID": 2,
            "PowerKW": 11,
            "CurrentTypeID": 10
        }
    ],
    "NumberOfPoints": 1,
    "StatusTypeID": 50,
    "DateLastStatusUpdate": "2016-06-04T02:56:00Z",
    "DataQualityLevel": 3,
    "DateCreated": "2016-04-27T09:42:00Z",
    "SubmissionStatusTypeID": 100
}