{
    "IsRecentlyVerified": false,
    "ID": 156807,
    "UUID": "B3EE6600-3769-46C1-8268-4E991F80479D",
    "DataProviderID": 19,
    "DataProvidersReference": "5864",
    "AddressInfo": {
        "ID": 157161,
        "Title": "Circle K Ålgård",
        "AddressLine1": "Sandnesveien 40",
        "Town": "ÅLGÅRD",
        "StateOrProvince": "Rogaland",
        "Postcode": "4330",
        "CountryID": 168,
        "Latitude": 58.77161,
        "Longitude": 5.847608,
        "AccessComments": "",
        "DistanceUnit": 0
    },
    "Connections": [
        {
            "ID": 221949,
            "ConnectionTypeID": 2,
            "Reference": "1",
            "LevelID": 3,
            "Amps": 100,
            "Voltage": 500,
            "PowerKW": 50,
            "CurrentTypeID": 30,
            "Comments": "Mode 4"
        },
        {
            "ID": 221950,
            "ConnectionTypeID": 33,
            "Reference": "2",
            "LevelID": 3,
            "Amps": 100,
            "Voltage": 500,
            "PowerKW": 50,
            "CurrentTypeID": 30,
            "Comments": "Mode 4"
        },
        {
            "ID": 221951,
            "ConnectionTypeID": 2,
            "Reference": "3",
            "LevelID": 3,
            "Amps": 100,
            "Voltage": 500,
            "PowerKW": 50,
            "CurrentTypeID": 30,
            "Comments": "Mode 4"
        },
        {
            "ID": 221952,
            "ConnectionTypeID": 33,
            "Reference": "4",
            "LevelID": 3,
            "Amps": 100,
            "Voltage": 500,
            "PowerKW": 50,
            "CurrentTypeID": 30,
            "Comments": "Mode 4"
        },
        {
            "ID": 221953,
            "ConnectionTypeID": 2,
            "Reference": "5",
            "LevelID": 3,
            "Amps": 100,
            "Voltage": 500,
            "PowerKW": 50,
            "CurrentTypeID": 30,
            "Comments": "Mode 4"
        },
        {
            "ID": 221954,
            "ConnectionTypeID": 33,
            "Reference": "6",
            "LevelID": 3,
            "Amps": 100,
            "Voltage": 500,
            "PowerKW": 50,
            "CurrentTypeID": 30,
            "Comments": "Mode 4"
        },
        {
            "ID": 221955,
            "ConnectionTypeID": 33,
            "Reference": "7",
            "LevelID": 3,
            "Amps": 375,
            "Voltage": 400,
            "PowerKW": 150,
            "CurrentTypeID": 30,
            "Comments": "Mode 4"
        },
        {
            "ID": 221956,
            "ConnectionTypeID": 33,
            "Reference": "8",
            "LevelID": 3,
            "Amps": 375,
            "Voltage": 400,
            "PowerKW": 150,
            "CurrentTypeID": 30,
            "Comments": "Mode 4"
        }
    ],
    "NumberOfPoints": 8,
    "StatusTypeID": 0,
    "DateLastStatusUpdate": "2021-03-24T05:11:00Z",
    "DataQualityLevel": 2,
    "DateCreated": "2020-05-26T08:22:00Z",
    "SubmissionStatusTypeID": 100
}