{
    "IsRecentlyVerified": false,
    "ID": 3517,
    "UUID": "AFB01834-11DA-4EF0-AE24-E6D849556B45",
    "DataProviderID": 1,
    "UsageTypeID": 1,
    "AddressInfo": {
        "ID": 3518,
        "Title": "Green Energy",
        "AddressLine1": "575 Cooke St",
        "Town": "Honolulu",
        "StateOrProvince": "HI",
        "Postcode": "96813",
        "CountryID": 2,
        "Latitude": 21.299686,
        "Longitude": -157.857,
        "ContactTelephone1": "808-591-1900",
        "DistanceUnit": 0
    },
    "Connections": [
        {
            "ID": 33,
            "ConnectionTypeID": 1,
            "Quantity": 1
        }
    ],
    "NumberOfPoints": 1,
    "DateLastStatusUpdate": "2019-12-15T06:07:00Z",
    "DateCreated": "2010-02-28T00:00:00Z",
    "SubmissionStatusTypeID": 200
}