{
    "IsRecentlyVerified": false,
    "ID": 9538,
    "UUID": "5DC5C905-B2B0-4271-B634-212C955CBAEE",
    "DataProviderID": 15,
    "DataProvidersReference": "14711",
    "OperatorID": 5,
    "AddressInfo": {
        "ID": 9435,
        "Title": "825 Grand Army Hwy",
        "AddressLine1": "825 Grand Army Hwy",
        "Town": "Somerset",
        "StateOrProvince": "Massachusetts",
        "Postcode": "2725",
        "CountryID": 2,
        "Latitude": 41.73106003,
        "Longitude": -71.17089844,
        "ContactTelephone1": "",
        "RelatedURL": "http://carstations.com/14711",
        "DistanceUnit": 0
    },
    "Connections": [
        {
            "ID": 7200,
            "ConnectionTypeID": 9,
            "Reference": "NEMA5",
            "Quantity": 1
        },
        {
            "ID": 7307,
            "ConnectionTypeID": 1,
            "Reference": "J1772",
            "LevelID": 2
        }
    ],
    "StatusTypeID": 0,
    "DateLastStatusUpdate": "2017-11-04T14:04:00Z",
    "DataQualityLevel": 2,
    "DateCreated": "2012-02-20T15:47:00Z",
    "SubmissionStatusTypeID": 100
}