{
    "MediaItems": [
        {
            "ID": 20226,
            "ChargePointID": 133713,
            "ItemURL": "https://s3-ap-southeast-2.amazonaws.com/openchargemap/images/IT/OCM133713/OCM-133713.orig.2019110415343695.jpg",
            "ItemThumbnailURL": "https://s3-ap-southeast-2.amazonaws.com/openchargemap/images/IT/OCM133713/OCM-133713.thmb.2019110415343695.jpg",
            "Comment": "",
            "IsEnabled": true,
            "IsVideo": false,
            "IsFeaturedItem": false,
            "IsExternalResource": false,
            "User": {
                "ID": 19496,
                "Username": "ECOGY"
            },
            "DateCreated": "2019-11-04T15:35:00Z"
        },
        {
            "ID": 20105,
            "ChargePointID": 133713,
            "ItemURL": "https://s3-ap-southeast-2.amazonaws.com/openchargemap/images/IT/OCM133713/OCM-133713.orig.2019102413465560.jpg",
            "ItemThumbnailURL": "https://s3-ap-southeast-2.amazonaws.com/openchargemap/images/IT/OCM133713/OCM-133713.thmb.2019102413465560.jpg",
            "Comment": "",
            "IsEnabled": true,
            "IsVideo": false,
            "IsFeaturedItem": false,
            "IsExternalResource": false,
            "User": {
                "ID": 19496,
                "Username": "ECOGY"
            },
            "DateCreated": "2019-10-24T13:47:00Z"
        }
    ],
    "IsRecentlyVerified": false,
    "ID": 133713,
    "UUID": "4E3ECA2C-27A3-47A0-9456-4466FFC28571",
    "DataProviderID": 1,
    "OperatorID": 45,
    "UsageTypeID": 4,
    "UsageCost": "0,30 Euro/ kWh",
    "AddressInfo": {
        "ID": 134059,
        "Title": "Hotel Sonnenheim ***",
        "AddressLine1": "Falzebenerstr. 63",
        "Town": "Hafling",
        "StateOrProvince": "Bozen",
        "Postcode": "39010 Hafling",
        "CountryID": 112,
        "Latitude": 46.65317035,
        "Longitude": 11.2207353834502,
        "ContactTelephone1": "+39 0473 279 410",
        "ContactEmail": "info@sonnenheim.com",
        "AccessComments": "Für Hotelkunden mittels RFID Karte\r\nEcogy 11 kW",
        "RelatedURL": "https://www.sonnenheim.com",
        "DistanceUnit": 0
    },
    "Connections": [
        {
            "ID": 187134,
            "ConnectionTypeID": 25,
            "StatusTypeID": 50,
            "LevelID": 2,
            "Amps": 16,
            "Voltage": 400,
            "PowerKW": 11,
            "CurrentTypeID": 20,
            "Quantity": 1
        }
    ],
    "NumberOfPoints": 1,
    "GeneralComments": "Die Ladestation befindet sich auf dem Kundenparkplatz in der Tiefgarage",
    "StatusTypeID": 50,
    "DateLastStatusUpdate": "2019-11-04T15:35:00Z",
    "DataQualityLevel": 1,
    "DateCreated": "2019-10-24T13:46:00Z",
    "SubmissionStatusTypeID": 200
}