{
    "IsRecentlyVerified": false,
    "ID": 23279,
    "UUID": "4512301D-B77F-4D3A-9F81-46E342F41B6E",
    "DataProviderID": 1,
    "OperatorID": 62,
    "UsageTypeID": 4,
    "AddressInfo": {
        "ID": 23624,
        "Title": "Auchan CREIL NOGENT SUR OISE",
        "AddressLine1": "Allée de Londres",
        "Town": "Nogent-sur-Oise",
        "StateOrProvince": "Senlis",
        "Postcode": "60180",
        "CountryID": 80,
        "Latitude": 49.2710436661887,
        "Longitude": 2.48338755137331,
        "ContactTelephone1": "03.44.66.84.00",
        "RelatedURL": "http://www.auchan.fr/magasins/creil-nogent-sur-oise/81/informations-pratiques/",
        "DistanceUnit": 0
    },
    "Connections": [
        {
            "ID": 25115,
            "ConnectionTypeID": 2,
            "LevelID": 3,
            "CurrentTypeID": 30,
            "Quantity": 1
        },
        {
            "ID": 25116,
            "ConnectionTypeID": 25,
            "LevelID": 3,
            "CurrentTypeID": 20,
            "Quantity": 1
        }
    ],
    "NumberOfPoints": 1,
    "StatusTypeID": 150,
    "DateLastStatusUpdate": "2014-09-25T13:05:00Z",
    "DataQualityLevel": 1,
    "DateCreated": "2014-05-11T15:19:00Z",
    "SubmissionStatusTypeID": 200
}