{
    "IsRecentlyVerified": false,
    "ID": 133471,
    "UUID": "FE06BF83-EA26-4B34-B92B-E2FD9B0AD840",
    "DataProviderID": 1,
    "OperatorID": 80,
    "UsageTypeID": 4,
    "AddressInfo": {
        "ID": 133817,
        "Title": "Casorate Sempione Cueta | EnelX",
        "AddressLine1": "Piazza della Cueta",
        "Town": "Casorate Sempione",
        "StateOrProvince": "VA",
        "Postcode": "21011",
        "CountryID": 112,
        "Latitude": 45.671560103527895,
        "Longitude": 8.74546065442712,
        "ContactTelephone1": "800.069.850",
        "RelatedURL": "https://www.enelx.com/it/it/emobility",
        "DistanceUnit": 0
    },
    "Connections": [
        {
            "ID": 186831,
            "ConnectionTypeID": 25,
            "StatusTypeID": 50,
            "LevelID": 2,
            "Amps": 32,
            "Voltage": 400,
            "PowerKW": 22,
            "CurrentTypeID": 20,
            "Quantity": 2
        }
    ],
    "NumberOfPoints": 2,
    "StatusTypeID": 50,
    "DateLastStatusUpdate": "2019-10-18T15:21:00Z",
    "DataQualityLevel": 1,
    "DateCreated": "2019-10-18T15:21:00Z",
    "SubmissionStatusTypeID": 200
}