{
    "IsRecentlyVerified": false,
    "ID": 20867,
    "UUID": "F3942EDE-29EC-4CE2-86DC-3BF3F7580614",
    "DataProviderID": 2,
    "DataProvidersReference": "53963",
    "UsageTypeID": 1,
    "AddressInfo": {
        "ID": 21212,
        "Title": "Whole Foods Market",
        "AddressLine1": "1800 Laskin Rd",
        "Town": "Virginia Beach",
        "StateOrProvince": "VA",
        "Postcode": "23454",
        "CountryID": 2,
        "Latitude": 36.850535,
        "Longitude": -76.027886,
        "ContactTelephone1": "757-422-0444",
        "AccessComments": "8am-9pm daily",
        "RelatedURL": "",
        "DistanceUnit": 0
    },
    "Connections": [
        {
            "ID": 22732,
            "ConnectionTypeID": 1,
            "LevelID": 2,
            "Amps": 16,
            "Voltage": 230,
            "PowerKW": 3.7,
            "CurrentTypeID": 10,
            "Quantity": 2
        }
    ],
    "DateLastStatusUpdate": "2020-06-26T02:59:00Z",
    "DataQualityLevel": 3,
    "DateCreated": "2014-01-17T04:54:00Z",
    "SubmissionStatusTypeID": 100
}