{
    "IsRecentlyVerified": false,
    "ID": 108120,
    "UUID": "F5833431-5E46-4FBC-B1B5-0D423E66AF72",
    "DataProviderID": 1,
    "OperatorID": 20,
    "OperatorsReference": "80981",
    "UsageTypeID": 4,
    "UsageCost": "£0.50 + £0.20/kWh",
    "AddressInfo": {
        "ID": 108466,
        "Title": "Castlefield Road, Reigate, Surrey,",
        "AddressLine1": "Castlefield Road, Reigate, Surrey,",
        "Postcode": "RH2 0SH",
        "CountryID": 1,
        "Latitude": 51.23886,
        "Longitude": -0.20509,
        "DistanceUnit": 0
    },
    "Connections": [
        {
            "ID": 152745,
            "ConnectionTypeID": 25,
            "StatusTypeID": 50,
            "LevelID": 2,
            "Amps": 32,
            "Voltage": 400,
            "PowerKW": 22,
            "CurrentTypeID": 20,
            "Quantity": 2
        }
    ],
    "NumberOfPoints": 2,
    "StatusTypeID": 50,
    "DateLastStatusUpdate": "2020-05-09T05:16:00Z",
    "DataQualityLevel": 1,
    "DateCreated": "2018-09-06T05:16:00Z",
    "SubmissionStatusTypeID": 200
}