{
    "IsRecentlyVerified": false,
    "ID": 174580,
    "UUID": "949359ED-EAD4-42EA-AF05-1AE7BE22B36A",
    "DataProviderID": 1,
    "OperatorID": 38,
    "UsageTypeID": 1,
    "AddressInfo": {
        "ID": 174939,
        "Title": "Lidl Hateg",
        "AddressLine1": "Strada Tudor Vladimirescu Strada 12, Hațeg 335500",
        "Town": "Hateg",
        "StateOrProvince": "Hunedoara",
        "Postcode": "335500",
        "CountryID": 184,
        "Latitude": 45.610493582681755,
        "Longitude": 22.95521331739178,
        "DistanceUnit": 0
    },
    "Connections": [
        {
            "ID": 270485,
            "ConnectionTypeID": 33,
            "StatusTypeID": 50,
            "LevelID": 3,
            "Amps": 125,
            "Voltage": 400,
            "PowerKW": 50,
            "CurrentTypeID": 30,
            "Quantity": 1
        },
        {
            "ID": 270486,
            "ConnectionTypeID": 2,
            "StatusTypeID": 50,
            "LevelID": 3,
            "Amps": 125,
            "Voltage": 400,
            "PowerKW": 50,
            "CurrentTypeID": 30,
            "Quantity": 1
        },
        {
            "ID": 270487,
            "ConnectionTypeID": 1036,
            "StatusTypeID": 50,
            "LevelID": 2,
            "Voltage": 400,
            "PowerKW": 22,
            "CurrentTypeID": 20,
            "Quantity": 1
        }
    ],
    "NumberOfPoints": 1,
    "StatusTypeID": 50,
    "DateLastStatusUpdate": "2021-04-07T22:07:00Z",
    "DataQualityLevel": 1,
    "DateCreated": "2021-04-07T13:36:00Z",
    "SubmissionStatusTypeID": 200
}