{
    "IsRecentlyVerified": false,
    "ID": 122229,
    "UUID": "4A34F782-0828-4C9D-8B90-CAF776B1E147",
    "DataProviderID": 2,
    "DataProvidersReference": "76725",
    "UsageTypeID": 2,
    "AddressInfo": {
        "ID": 122575,
        "Title": "Los Angeles County - Fire Department Headquarters",
        "AddressLine1": "1320 N Eastern Ave",
        "Town": "Los Angeles",
        "StateOrProvince": "CA",
        "Postcode": "90063",
        "CountryID": 2,
        "Latitude": 34.054045,
        "Longitude": -118.172655,
        "ContactTelephone1": "",
        "AccessComments": "Fleet use only",
        "RelatedURL": "",
        "DistanceUnit": 0
    },
    "Connections": [
        {
            "ID": 172102,
            "ConnectionTypeID": 1,
            "LevelID": 2,
            "Amps": 16,
            "Voltage": 230,
            "PowerKW": 3.7,
            "CurrentTypeID": 10,
            "Quantity": 3
        }
    ],
    "DateLastStatusUpdate": "2020-06-26T02:56:00Z",
    "DataQualityLevel": 3,
    "DateCreated": "2019-04-06T05:02:00Z",
    "SubmissionStatusTypeID": 100
}