{
    "IsRecentlyVerified": false,
    "ID": 85899,
    "UUID": "13E3F7F9-F331-4ACB-A383-F08FF79FB851",
    "DataProviderID": 1,
    "OperatorID": 69,
    "UsageTypeID": 4,
    "AddressInfo": {
        "ID": 86245,
        "Title": "Dünenstraße",
        "AddressLine1": "Dünenstraße 14",
        "Town": "Wenningstedt-Braderup (Sylt)",
        "StateOrProvince": "Landschaft Sylt",
        "Postcode": "25996",
        "CountryID": 87,
        "Latitude": 54.9367512,
        "Longitude": 8.317138800000066,
        "AccessComments": "Rund um die Uhr (24/7) nutzbar.\r\n",
        "DistanceUnit": 0
    },
    "Connections": [
        {
            "ID": 122092,
            "ConnectionTypeID": 25,
            "StatusTypeID": 50,
            "LevelID": 2,
            "Amps": 32,
            "Voltage": 400,
            "PowerKW": 22,
            "CurrentTypeID": 20,
            "Quantity": 2
        },
        {
            "ID": 122093,
            "ConnectionTypeID": 28,
            "StatusTypeID": 50,
            "LevelID": 2,
            "Amps": 16,
            "Voltage": 230,
            "PowerKW": 3.7,
            "CurrentTypeID": 10,
            "Quantity": 2
        }
    ],
    "NumberOfPoints": 4,
    "StatusTypeID": 50,
    "DateLastStatusUpdate": "2017-04-20T06:48:00Z",
    "DataQualityLevel": 1,
    "DateCreated": "2017-04-20T06:48:00Z",
    "SubmissionStatusTypeID": 200
}