{
    "IsRecentlyVerified": false,
    "ID": 77310,
    "UUID": "C338B107-5D82-4939-B90A-C6948A342F7F",
    "DataProviderID": 1,
    "OperatorID": 3253,
    "OperatorsReference": "AT*SMA*EAT0701705*001AC,AT*SMA*EAT0701705*002AC,AT*SMA*EAT0701705*003AC,AT*SMA*EAT0701705*004AC",
    "UsageTypeID": 1,
    "UsageCost": "€0,04/min ; Andere Tarife möglich",
    "AddressInfo": {
        "ID": 77656,
        "Title": "Ladestation Nothegger Parkpl 6380 St. Johann Tirol",
        "AddressLine1": "Kaiserstraße 16",
        "Town": "St. Johann in Tirol",
        "StateOrProvince": "Tirol",
        "Postcode": "6380",
        "CountryID": 19,
        "Latitude": 47.522869,
        "Longitude": 12.425366,
        "DistanceUnit": 0
    },
    "Connections": [
        {
            "ID": 111388,
            "ConnectionTypeID": 25,
            "StatusTypeID": 50,
            "LevelID": 2,
            "Amps": 16,
            "Voltage": 400,
            "PowerKW": 11,
            "CurrentTypeID": 20,
            "Quantity": 4
        }
    ],
    "NumberOfPoints": 12,
    "StatusTypeID": 50,
    "DateLastStatusUpdate": "2017-01-23T16:43:00Z",
    "DataQualityLevel": 1,
    "DateCreated": "2017-01-09T09:06:00Z",
    "SubmissionStatusTypeID": 200
}