{
    "IsRecentlyVerified": false,
    "ID": 141040,
    "UUID": "08FB3151-1ECC-494B-803D-33734BBD2D0E",
    "DataProviderID": 2,
    "DataProvidersReference": "95885",
    "OperatorID": 9,
    "UsageTypeID": 1,
    "AddressInfo": {
        "ID": 141392,
        "Title": "McDonald's #12525 on Main Street in Oakley, CA",
        "AddressLine1": "914 Main Street",
        "Town": "Oakley",
        "StateOrProvince": "CA",
        "Postcode": "94561",
        "CountryID": 2,
        "Latitude": 38.005536,
        "Longitude": -121.751895,
        "ContactTelephone1": "888-998-2546",
        "AccessComments": "MON: 24 hours | TUE: 24 hours | WED: 24 hours | THU: 24 hours | FRI: 24 hours | SAT: 24 hours | SUN: 24 hours",
        "RelatedURL": "http://www.blinkcharging.com/",
        "DistanceUnit": 0
    },
    "Connections": [
        {
            "ID": 196848,
            "ConnectionTypeID": 1,
            "LevelID": 2,
            "Amps": 16,
            "Voltage": 230,
            "PowerKW": 3.7,
            "CurrentTypeID": 10,
            "Quantity": 2
        }
    ],
    "StatusTypeID": 50,
    "DateLastStatusUpdate": "2020-06-26T02:59:00Z",
    "DataQualityLevel": 3,
    "DateCreated": "2019-12-24T09:14:00Z",
    "SubmissionStatusTypeID": 100
}