{
    "IsRecentlyVerified": false,
    "ID": 139404,
    "UUID": "58675CE3-7811-4396-93F3-C943A3933683",
    "DataProviderID": 2,
    "DataProvidersReference": "149210",
    "OperatorID": 5,
    "UsageTypeID": 1,
    "AddressInfo": {
        "ID": 139756,
        "Title": "G&M OIL",
        "AddressLine1": "4991 Long Beach Blvd",
        "Town": "Long Beach",
        "StateOrProvince": "CA",
        "Postcode": "90805",
        "CountryID": 2,
        "Latitude": 33.8462472,
        "Longitude": -118.1942013,
        "ContactTelephone1": "888-758-4389",
        "AccessComments": "24 hours daily",
        "RelatedURL": "http://www.chargepoint.com/",
        "DistanceUnit": 0
    },
    "Connections": [
        {
            "ID": 194749,
            "ConnectionTypeID": 2,
            "LevelID": 3,
            "Amps": 100,
            "Voltage": 400,
            "PowerKW": 40,
            "CurrentTypeID": 30,
            "Quantity": 1
        },
        {
            "ID": 194750,
            "ConnectionTypeID": 32,
            "LevelID": 3,
            "Amps": 100,
            "Voltage": 400,
            "PowerKW": 40,
            "CurrentTypeID": 30,
            "Quantity": 1
        }
    ],
    "StatusTypeID": 50,
    "DateLastStatusUpdate": "2019-12-24T09:10:00Z",
    "DataQualityLevel": 3,
    "DateCreated": "2019-12-24T09:10:00Z",
    "SubmissionStatusTypeID": 100
}