{
    "UserComments": [
        {
            "ID": 20079,
            "ChargePointID": 103231,
            "CommentTypeID": 10,
            "UserName": "Kit",
            "Comment": "Worked fine. Will charge for 15 mins before shutting off if you don’t pay via app. Lovely location. Cafe, nice walks etc.. ",
            "Rating": 5,
            "DateCreated": "2018-08-30T11:04:11.9Z",
            "User": {
                "ID": 18918,
                "Username": "Kit"
            },
            "CheckinStatusTypeID": 10
        }
    ],
    "MediaItems": [
        {
            "ID": 16399,
            "ChargePointID": 103231,
            "ItemURL": "https://s3-ap-southeast-2.amazonaws.com/openchargemap/images/GB/OCM103231/OCM-103231.orig.2018083011054641.jpeg",
            "ItemThumbnailURL": "https://s3-ap-southeast-2.amazonaws.com/openchargemap/images/GB/OCM103231/OCM-103231.thmb.2018083011054641.jpeg",
            "Comment": "Tight spots but ok in Leaf!",
            "IsEnabled": true,
            "IsVideo": false,
            "IsFeaturedItem": false,
            "IsExternalResource": false,
            "User": {
                "ID": 18918,
                "Username": "Kit"
            },
            "DateCreated": "2018-08-30T11:06:00Z"
        }
    ],
    "IsRecentlyVerified": false,
    "ID": 103231,
    "UUID": "A99C4C13-B2EE-4782-81C3-05782B94DA36",
    "DataProviderID": 1,
    "OperatorID": 3,
    "OperatorsReference": "PG-81878",
    "UsageTypeID": 4,
    "UsageCost": "£1.00/hour",
    "AddressInfo": {
        "ID": 103577,
        "Title": "Forest Holidays-Thorpe Forest",
        "AddressLine1": "Shadwell",
        "Town": "Norfolk",
        "Postcode": "IP24 2RX",
        "CountryID": 1,
        "Latitude": 52.419508,
        "Longitude": 0.861239,
        "DistanceUnit": 0
    },
    "Connections": [
        {
            "ID": 145846,
            "ConnectionTypeID": 25,
            "StatusTypeID": 50,
            "LevelID": 2,
            "Amps": 32,
            "Voltage": 230,
            "PowerKW": 7,
            "CurrentTypeID": 10,
            "Quantity": 2
        }
    ],
    "NumberOfPoints": 2,
    "GeneralComments": "This is an open charge unit installed at the Forest Holidays - Thorpe Forest site in Shadwell, Thetford, Norfolk",
    "StatusTypeID": 50,
    "DateLastStatusUpdate": "2019-05-02T20:54:00Z",
    "DataQualityLevel": 1,
    "DateCreated": "2018-04-25T05:33:00Z",
    "SubmissionStatusTypeID": 200
}