{
    "IsRecentlyVerified": false,
    "ID": 36909,
    "UUID": "3A84CBF5-BC46-4D75-A981-B379FC9DAE17",
    "DataProviderID": 26,
    "DataProvidersReference": "31280",
    "OperatorsReference": "Juniper  (slagboom dus voor personeel en bezoekers)",
    "UsageCost": "0.00 jaarabonnement",
    "AddressInfo": {
        "ID": 37255,
        "Title": "Boeingavenue 266",
        "AddressLine1": "Boeingavenue 266",
        "Town": "Haarlemmermeer",
        "Postcode": "1119 PZ",
        "CountryID": 159,
        "Latitude": 52.277112070604,
        "Longitude": 4.7535717487335,
        "DistanceUnit": 0
    },
    "Connections": [
        {
            "ID": 40420,
            "ConnectionTypeID": 25,
            "LevelID": 2,
            "PowerKW": 3.7,
            "CurrentTypeID": 10
        }
    ],
    "NumberOfPoints": 2,
    "StatusTypeID": 50,
    "DateLastStatusUpdate": "2016-06-04T02:52:00Z",
    "DataQualityLevel": 3,
    "DateCreated": "2015-01-09T06:07:00Z",
    "SubmissionStatusTypeID": 100
}