{
    "IsRecentlyVerified": false,
    "ID": 46318,
    "UUID": "5C955AC1-97E6-4D0E-8A5B-95C9B98923D7",
    "DataProviderID": 1,
    "DataProvidersReference": "79",
    "AddressInfo": {
        "ID": 46664,
        "Title": "Ole Vigs gate, Oslo",
        "AddressLine1": "Ole Vigs gate 23",
        "Town": "OSLO",
        "StateOrProvince": "Oslo",
        "Postcode": "0366",
        "CountryID": 168,
        "Latitude": 59.92937,
        "Longitude": 10.71812,
        "AccessComments": "Plasser på Frogner i enden av gaten mot Kirkeveien (gata stengt ved Kirkeveien).",
        "DistanceUnit": 0
    },
    "Connections": [
        {
            "ID": 56981,
            "ConnectionTypeID": 0,
            "Reference": "1",
            "LevelID": 2,
            "Amps": 16,
            "Voltage": 230,
            "PowerKW": 3.7,
            "Comments": "Mode 3"
        },
        {
            "ID": 86034,
            "ConnectionTypeID": 0,
            "Reference": "2",
            "LevelID": 2,
            "Amps": 16,
            "Voltage": 230,
            "PowerKW": 3.7,
            "Comments": "Mode 3"
        },
        {
            "ID": 86035,
            "ConnectionTypeID": 0,
            "Reference": "3",
            "LevelID": 2,
            "Amps": 16,
            "Voltage": 230,
            "PowerKW": 3.7,
            "Comments": "Mode 3"
        },
        {
            "ID": 88716,
            "ConnectionTypeID": 0,
            "Reference": "4",
            "LevelID": 2,
            "Amps": 16,
            "Voltage": 230,
            "PowerKW": 3.7,
            "Comments": "Mode 3"
        }
    ],
    "NumberOfPoints": 4,
    "DateLastStatusUpdate": "2020-05-26T08:23:00Z",
    "DataQualityLevel": 2,
    "DateCreated": "2015-05-03T00:54:00Z",
    "SubmissionStatusTypeID": 100
}