{
    "IsRecentlyVerified": false,
    "ID": 105528,
    "UUID": "684A4472-FB26-4F4F-A0B1-DCEB76A8B22C",
    "DataProviderID": 1,
    "OperatorID": 23,
    "OperatorsReference": "44119",
    "UsageTypeID": 4,
    "AddressInfo": {
        "ID": 105874,
        "Title": "Homewood Suites By Hilton Reno",
        "AddressLine1": "5450 Kietzke LN",
        "Town": "Reno",
        "StateOrProvince": "Nevada",
        "Postcode": "89511",
        "CountryID": 2,
        "Latitude": 39.46583,
        "Longitude": -119.789914,
        "ContactTelephone1": "(775) 853-7100",
        "DistanceUnit": 0
    },
    "Connections": [
        {
            "ID": 148710,
            "ConnectionTypeID": 30,
            "StatusTypeID": 50,
            "LevelID": 2,
            "PowerKW": 16,
            "CurrentTypeID": 20,
            "Quantity": 2
        }
    ],
    "NumberOfPoints": 2,
    "GeneralComments": "2 Tesla Connectors, up to 16kW.Available for customers. Please see front desk.",
    "StatusTypeID": 50,
    "DateLastStatusUpdate": "2018-06-08T05:34:00Z",
    "DataQualityLevel": 1,
    "DateCreated": "2018-06-08T05:34:00Z",
    "SubmissionStatusTypeID": 200
}