{
    "IsRecentlyVerified": false,
    "ID": 80293,
    "UUID": "EFC96B34-7F36-46C8-8441-D1AFACEBD752",
    "DataProviderID": 2,
    "DataProvidersReference": "80637",
    "UsageTypeID": 7,
    "AddressInfo": {
        "ID": 80639,
        "Title": "Jeff Drennen Chevrolet",
        "AddressLine1": "3657 Maple Ave",
        "Town": "Zanesville",
        "StateOrProvince": "OH",
        "Postcode": "43701",
        "CountryID": 2,
        "Latitude": 39.990391,
        "Longitude": -82.023716,
        "ContactTelephone1": "740-617-0910",
        "AccessComments": "Dealership business hours\r\nPublic - Call ahead",
        "RelatedURL": "",
        "DistanceUnit": 0
    },
    "Connections": [
        {
            "ID": 114967,
            "ConnectionTypeID": 1,
            "LevelID": 2,
            "Amps": 16,
            "Voltage": 230,
            "PowerKW": 3.7,
            "CurrentTypeID": 10,
            "Quantity": 1
        }
    ],
    "DateLastStatusUpdate": "2020-06-26T03:02:00Z",
    "DataQualityLevel": 3,
    "DateCreated": "2017-01-31T01:05:00Z",
    "SubmissionStatusTypeID": 100
}