{
    "IsRecentlyVerified": false,
    "ID": 166637,
    "UUID": "BFA6D753-0990-44CD-BFD5-FCC2FA0046B6",
    "DataProviderID": 28,
    "DataProvidersReference": "FR*S61*P61006D",
    "UsageTypeID": 5,
    "AddressInfo": {
        "ID": 166996,
        "Title": "Argentan | Rue de la Picardie",
        "AddressLine1": "Rue de la Picardie 61200 Argentan",
        "CountryID": 80,
        "Latitude": 48.750603,
        "Longitude": -0.029512,
        "AccessComments": "24/24 7/7",
        "DistanceUnit": 0
    },
    "Connections": [
        {
            "ID": 250284,
            "ConnectionTypeID": 0,
            "StatusTypeID": 50,
            "LevelID": 2,
            "PowerKW": 60
        },
        {
            "ID": 250285,
            "ConnectionTypeID": 0,
            "StatusTypeID": 50,
            "LevelID": 2,
            "PowerKW": 60
        },
        {
            "ID": 250286,
            "ConnectionTypeID": 28,
            "StatusTypeID": 50,
            "LevelID": 1,
            "PowerKW": 2.3,
            "CurrentTypeID": 10
        },
        {
            "ID": 250287,
            "ConnectionTypeID": 1036,
            "StatusTypeID": 50,
            "LevelID": 2,
            "PowerKW": 22,
            "CurrentTypeID": 20
        }
    ],
    "GeneralComments": "",
    "StatusTypeID": 50,
    "DateLastStatusUpdate": "2020-08-27T05:15:00Z",
    "DataQualityLevel": 2,
    "DateCreated": "2020-08-27T05:15:00Z",
    "SubmissionStatusTypeID": 100
}