{
    "IsRecentlyVerified": false,
    "ID": 68909,
    "UUID": "8A6E4D86-BE25-4888-8210-49C057C069FC",
    "DataProviderID": 2,
    "DataProvidersReference": "74120",
    "OperatorID": 1242,
    "UsageTypeID": 1,
    "AddressInfo": {
        "ID": 69255,
        "Title": "GE WS #6 (0000415)",
        "AddressLine1": "1 Research Circle",
        "Town": "Niskayuna",
        "StateOrProvince": "NY",
        "Postcode": "12309",
        "CountryID": 2,
        "Latitude": 42.829136,
        "Longitude": -73.8769949299,
        "ContactTelephone1": "855-443-3873",
        "AccessComments": "24 hours daily",
        "RelatedURL": "https://www.gewattstation.com",
        "DistanceUnit": 0
    },
    "Connections": [
        {
            "ID": 96612,
            "ConnectionTypeID": 1,
            "LevelID": 2,
            "Amps": 16,
            "Voltage": 230,
            "PowerKW": 3.7,
            "CurrentTypeID": 10,
            "Quantity": 1
        }
    ],
    "DateLastStatusUpdate": "2020-06-26T03:06:00Z",
    "DataQualityLevel": 3,
    "DateCreated": "2016-06-25T03:36:00Z",
    "SubmissionStatusTypeID": 100
}