{
    "IsRecentlyVerified": false,
    "ID": 30774,
    "UUID": "D0FDFD01-72B6-4B65-A1BA-7E98AA2EA5A4",
    "DataProviderID": 1,
    "DataProvidersReference": "1439",
    "AddressInfo": {
        "ID": 31120,
        "Title": "Coop OBS Jessheim",
        "AddressLine1": "Romsaas Allé 1",
        "Town": "JESSHEIM",
        "StateOrProvince": "Viken",
        "Postcode": "2050",
        "CountryID": 168,
        "Latitude": 60.14317,
        "Longitude": 11.16416,
        "AccessComments": "Vestre side av hovedinngang.",
        "DistanceUnit": 0
    },
    "Connections": [
        {
            "ID": 34003,
            "ConnectionTypeID": 0,
            "Reference": "1",
            "LevelID": 2,
            "Amps": 32,
            "Voltage": 400,
            "PowerKW": 22,
            "Comments": "Mode 3"
        },
        {
            "ID": 88862,
            "ConnectionTypeID": 0,
            "Reference": "2",
            "LevelID": 2,
            "Amps": 32,
            "Voltage": 400,
            "PowerKW": 22,
            "Comments": "Mode 3"
        },
        {
            "ID": 89975,
            "ConnectionTypeID": 0,
            "Reference": "3",
            "LevelID": 2,
            "Amps": 32,
            "Voltage": 230,
            "PowerKW": 7.4,
            "Comments": "Mode 3"
        },
        {
            "ID": 89976,
            "ConnectionTypeID": 0,
            "Reference": "4",
            "LevelID": 2,
            "Amps": 32,
            "Voltage": 230,
            "PowerKW": 7.4,
            "Comments": "Mode 3"
        },
        {
            "ID": 93216,
            "ConnectionTypeID": 0,
            "Reference": "5",
            "LevelID": 2,
            "Amps": 32,
            "Voltage": 230,
            "PowerKW": 7.4,
            "Comments": "Mode 3"
        },
        {
            "ID": 93217,
            "ConnectionTypeID": 0,
            "Reference": "6",
            "LevelID": 2,
            "Amps": 32,
            "Voltage": 230,
            "PowerKW": 7.4,
            "Comments": "Mode 3"
        }
    ],
    "NumberOfPoints": 6,
    "DateLastStatusUpdate": "2020-05-26T08:23:00Z",
    "DataQualityLevel": 2,
    "DateCreated": "2014-12-09T09:00:00Z",
    "SubmissionStatusTypeID": 100
}