{
    "IsRecentlyVerified": false,
    "ID": 13757,
    "UUID": "E8FF5718-F738-419B-BF46-21C0B1AA5F46",
    "DataProviderID": 15,
    "DataProvidersReference": "22550",
    "OperatorID": 1,
    "UsageTypeID": 1,
    "AddressInfo": {
        "ID": 13654,
        "Title": "415 Centre Street",
        "AddressLine1": "415 Centre Street",
        "Town": "Jamaica Plain",
        "StateOrProvince": "MA",
        "Postcode": "02130",
        "CountryID": 2,
        "Latitude": 42.321388,
        "Longitude": -71.110903,
        "ContactTelephone1": "855-443-3873",
        "RelatedURL": "http://carstations.com/22550",
        "DistanceUnit": 0
    },
    "Connections": [
        {
            "ID": 11205,
            "ConnectionTypeID": 1,
            "Reference": "J1772",
            "LevelID": 2
        }
    ],
    "NumberOfPoints": 1,
    "StatusTypeID": 0,
    "DateLastStatusUpdate": "2017-11-04T14:04:00Z",
    "DataQualityLevel": 2,
    "DateCreated": "2012-12-06T11:08:00Z",
    "SubmissionStatusTypeID": 100
}