{
    "MediaItems": [
        {
            "ID": 10716,
            "ChargePointID": 49089,
            "ItemURL": "https://s3-ap-southeast-2.amazonaws.com/openchargemap/images/IT/OCM49089/OCM-49089.orig.2017033015593229.jpg",
            "ItemThumbnailURL": "https://s3-ap-southeast-2.amazonaws.com/openchargemap/images/IT/OCM49089/OCM-49089.thmb.2017033015593229.jpg",
            "Comment": "",
            "IsEnabled": true,
            "IsVideo": false,
            "IsFeaturedItem": false,
            "IsExternalResource": false,
            "User": {
                "ID": 1606,
                "Username": "polianto"
            },
            "DateCreated": "2017-03-30T16:00:00Z"
        },
        {
            "ID": 10714,
            "ChargePointID": 49089,
            "ItemURL": "https://s3-ap-southeast-2.amazonaws.com/openchargemap/images/IT/OCM49089/OCM-49089.orig.2017033015590056.jpg",
            "ItemThumbnailURL": "https://s3-ap-southeast-2.amazonaws.com/openchargemap/images/IT/OCM49089/OCM-49089.thmb.2017033015590056.jpg",
            "Comment": "",
            "IsEnabled": true,
            "IsVideo": false,
            "IsFeaturedItem": false,
            "IsExternalResource": false,
            "User": {
                "ID": 1606,
                "Username": "polianto"
            },
            "DateCreated": "2017-03-30T15:59:00Z"
        },
        {
            "ID": 10715,
            "ChargePointID": 49089,
            "ItemURL": "https://s3-ap-southeast-2.amazonaws.com/openchargemap/images/IT/OCM49089/OCM-49089.orig.2017033015591712.jpg",
            "ItemThumbnailURL": "https://s3-ap-southeast-2.amazonaws.com/openchargemap/images/IT/OCM49089/OCM-49089.thmb.2017033015591712.jpg",
            "Comment": "",
            "IsEnabled": true,
            "IsVideo": false,
            "IsFeaturedItem": false,
            "IsExternalResource": false,
            "User": {
                "ID": 1606,
                "Username": "polianto"
            },
            "DateCreated": "2017-03-30T15:59:00Z"
        }
    ],
    "IsRecentlyVerified": false,
    "ID": 49089,
    "UUID": "47A9A0C4-296D-4136-8404-1E1AC4565FAD",
    "DataProviderID": 1,
    "OperatorID": 80,
    "UsageTypeID": 4,
    "UsageCost": "0,40 €/kW",
    "AddressInfo": {
        "ID": 49435,
        "Title": "Eneldrive Ananas A4",
        "AddressLine1": "Via Gracchi, 27",
        "Town": "Cinisello Balsamo",
        "StateOrProvince": "Milano",
        "Postcode": "20092",
        "CountryID": 112,
        "Latitude": 45.5533430087571,
        "Longitude": 9.24338957279654,
        "RelatedURL": "https://www.eneldrive.it/",
        "DistanceUnit": 0
    },
    "Connections": [
        {
            "ID": 60663,
            "ConnectionTypeID": 25,
            "StatusTypeID": 50,
            "LevelID": 2,
            "Amps": 32,
            "Voltage": 400,
            "PowerKW": 22,
            "CurrentTypeID": 20,
            "Quantity": 1
        },
        {
            "ID": 121051,
            "ConnectionTypeID": 36,
            "StatusTypeID": 50,
            "LevelID": 2,
            "Amps": 16,
            "Voltage": 240,
            "PowerKW": 3.5,
            "CurrentTypeID": 10,
            "Quantity": 1
        }
    ],
    "NumberOfPoints": 1,
    "GeneralComments": "Parcheggio accessibile solo in orario diurno",
    "StatusTypeID": 50,
    "DateLastStatusUpdate": "2017-03-30T16:03:00Z",
    "DataQualityLevel": 1,
    "DateCreated": "2015-07-10T08:30:00Z",
    "SubmissionStatusTypeID": 200
}