{
    "IsRecentlyVerified": false,
    "ID": 15120,
    "UUID": "CE6D2D03-70D5-4041-8015-693D9EE030ED",
    "DataProviderID": 1,
    "OperatorID": 45,
    "OperatorsReference": "Django's Hostel",
    "UsageTypeID": 7,
    "UsageCost": "Free",
    "AddressInfo": {
        "ID": 15466,
        "Title": "Django's Hostel",
        "AddressLine1": "Cloughjordan Ecovillage",
        "AddressLine2": "Roscrea",
        "Town": "Tipperary",
        "StateOrProvince": "County Tipperary",
        "CountryID": 3,
        "Latitude": 52.943776,
        "Longitude": -8.039284,
        "DistanceUnit": 0
    },
    "Connections": [
        {
            "ID": 28131,
            "ConnectionTypeID": 25,
            "StatusTypeID": 50,
            "LevelID": 2,
            "Amps": 16,
            "Voltage": 230,
            "PowerKW": 3.7,
            "CurrentTypeID": 10,
            "Quantity": 1
        }
    ],
    "NumberOfPoints": 1,
    "StatusTypeID": 50,
    "DateLastStatusUpdate": "2016-06-01T14:59:00Z",
    "DataQualityLevel": 2,
    "DateCreated": "2012-12-11T15:08:00Z",
    "SubmissionStatusTypeID": 100
}