{
    "IsRecentlyVerified": false,
    "ID": 174254,
    "UUID": "9E28BC5E-5B9B-4F05-8A13-3241E7B1A398",
    "DataProviderID": 19,
    "DataProvidersReference": "7388",
    "AddressInfo": {
        "ID": 174613,
        "Title": "OKQ8 Vällingby",
        "AddressLine1": "Jämtlandsgatan 139-143 ",
        "Town": "VÄLLINGBY",
        "StateOrProvince": "STOCKHOLM",
        "Postcode": "16260",
        "CountryID": 216,
        "Latitude": 59.35779,
        "Longitude": 17.87607,
        "AccessComments": "Vid OKQ8 Vällingby",
        "DistanceUnit": 0
    },
    "Connections": [
        {
            "ID": 269565,
            "ConnectionTypeID": 25,
            "Reference": "1",
            "LevelID": 3,
            "Amps": 32,
            "Voltage": 400,
            "PowerKW": 22,
            "CurrentTypeID": 30,
            "Comments": "Mode 3"
        },
        {
            "ID": 269566,
            "ConnectionTypeID": 25,
            "Reference": "2",
            "LevelID": 3,
            "Amps": 32,
            "Voltage": 400,
            "PowerKW": 22,
            "CurrentTypeID": 30,
            "Comments": "Mode 3"
        },
        {
            "ID": 269567,
            "ConnectionTypeID": 25,
            "Reference": "3",
            "LevelID": 3,
            "Amps": 32,
            "Voltage": 400,
            "PowerKW": 22,
            "CurrentTypeID": 30,
            "Comments": "Mode 3"
        },
        {
            "ID": 269568,
            "ConnectionTypeID": 25,
            "Reference": "4",
            "LevelID": 3,
            "Amps": 32,
            "Voltage": 400,
            "PowerKW": 22,
            "CurrentTypeID": 30,
            "Comments": "Mode 3"
        }
    ],
    "NumberOfPoints": 4,
    "StatusTypeID": 0,
    "DateLastStatusUpdate": "2021-03-24T05:11:00Z",
    "DataQualityLevel": 2,
    "DateCreated": "2021-03-24T05:11:00Z",
    "SubmissionStatusTypeID": 100
}