{
    "IsRecentlyVerified": false,
    "ID": 90540,
    "UUID": "56821011-AA3A-4F3C-A4C7-0C7E96B49B87",
    "DataProviderID": 1,
    "OperatorID": 45,
    "UsageTypeID": 1,
    "AddressInfo": {
        "ID": 90886,
        "Title": "Wormser Straße",
        "AddressLine1": "Wormser Straße 2",
        "AddressLine2": "Ecke Kaiserstraße",
        "Town": "Alzey",
        "StateOrProvince": "Landkreis Alzey-Worms",
        "Postcode": "55232",
        "CountryID": 87,
        "Latitude": 49.7419647091174,
        "Longitude": 8.11446650339667,
        "AccessComments": "24/7 nutzbar; weitere Infos siehe Website.",
        "RelatedURL": "http://www.wormser-zeitung.de/lokales/rheinhessen/unter-strom_18022541.htm",
        "DistanceUnit": 0
    },
    "Connections": [
        {
            "ID": 128217,
            "ConnectionTypeID": 25,
            "StatusTypeID": 50,
            "LevelID": 2,
            "Amps": 32,
            "Voltage": 400,
            "PowerKW": 22,
            "CurrentTypeID": 20,
            "Quantity": 2
        }
    ],
    "NumberOfPoints": 2,
    "StatusTypeID": 50,
    "DateLastStatusUpdate": "2017-07-17T05:57:00Z",
    "DataQualityLevel": 1,
    "DateCreated": "2017-07-17T05:56:00Z",
    "SubmissionStatusTypeID": 200
}