{
    "IsRecentlyVerified": false,
    "ID": 167414,
    "UUID": "5F4CCED6-8CD3-4E90-A84C-180F09113821",
    "DataProviderID": 18,
    "DataProvidersReference": "6813f98e8fa906c5bfe16183ca89c381",
    "OperatorID": 3345,
    "UsageTypeID": 5,
    "AddressInfo": {
        "ID": 167773,
        "Title": "SE173BW",
        "AddressLine1": "",
        "Town": "London",
        "Postcode": "SE173BW",
        "CountryID": 1,
        "Latitude": 51.490196,
        "Longitude": -0.099688,
        "AccessComments": "",
        "RelatedURL": "https://char.gy",
        "DistanceUnit": 0
    },
    "Connections": [
        {
            "ID": 253571,
            "ConnectionTypeID": 25,
            "Reference": "393",
            "StatusTypeID": 50,
            "LevelID": 2,
            "Amps": 16,
            "Voltage": 230,
            "PowerKW": 3.7,
            "CurrentTypeID": 10
        }
    ],
    "StatusTypeID": 0,
    "DateLastStatusUpdate": "2020-09-08T02:47:00Z",
    "MetadataValues": [
        {
            "ID": 7955,
            "MetadataFieldID": 4,
            "ItemValue": "Contains public sector information licensed under the Open Government Licence v2.0. http://www.nationalarchives.gov.uk/doc/open-government-licence/version/2/"
        }
    ],
    "DataQualityLevel": 3,
    "DateCreated": "2020-09-08T02:47:00Z",
    "SubmissionStatusTypeID": 100
}