{
    "IsRecentlyVerified": false,
    "ID": 159733,
    "UUID": "492CDAB7-669D-4B79-94E6-22015867B4A3",
    "DataProviderID": 2,
    "DataProvidersReference": "154922",
    "OperatorID": 3372,
    "UsageTypeID": 1,
    "AddressInfo": {
        "ID": 160090,
        "Title": "Tebbens Steel",
        "AddressLine1": "800 Burman Blvd",
        "Town": "Calverton",
        "StateOrProvince": "NY",
        "Postcode": "11933",
        "CountryID": 2,
        "Latitude": 40.913144,
        "Longitude": -72.7931184,
        "ContactTelephone1": "866-816-7584",
        "AccessComments": "24 hours daily; Also accepts Paypal",
        "RelatedURL": "http://evconnect.com/",
        "DistanceUnit": 0
    },
    "Connections": [
        {
            "ID": 229946,
            "ConnectionTypeID": 1,
            "LevelID": 2,
            "Amps": 16,
            "Voltage": 230,
            "PowerKW": 3.7,
            "CurrentTypeID": 10,
            "Quantity": 2
        }
    ],
    "StatusTypeID": 50,
    "DateLastStatusUpdate": "2020-06-26T03:03:00Z",
    "DataQualityLevel": 3,
    "DateCreated": "2020-06-26T03:03:00Z",
    "SubmissionStatusTypeID": 100
}