{
    "IsRecentlyVerified": false,
    "ID": 152325,
    "UUID": "91BE76CC-67B2-472F-A606-0A8A4F50E1FD",
    "DataProviderID": 28,
    "DataProvidersReference": "FR*S86*PSORE*B073",
    "UsageTypeID": 5,
    "AddressInfo": {
        "ID": 152678,
        "Title": "B073",
        "AddressLine1": "Rue des caves de Brion - 86420 - Monts sur Guesnes",
        "CountryID": 80,
        "Latitude": 46.91925,
        "Longitude": 0.21306,
        "AccessComments": "24/24 7/7 jours",
        "DistanceUnit": 0
    },
    "Connections": [
        {
            "ID": 213209,
            "ConnectionTypeID": 28,
            "StatusTypeID": 50,
            "LevelID": 2,
            "PowerKW": 18,
            "CurrentTypeID": 10
        },
        {
            "ID": 213210,
            "ConnectionTypeID": 25,
            "StatusTypeID": 50,
            "LevelID": 2,
            "PowerKW": 18,
            "CurrentTypeID": 20
        },
        {
            "ID": 246084,
            "ConnectionTypeID": 28,
            "StatusTypeID": 50,
            "LevelID": 2,
            "PowerKW": 18,
            "CurrentTypeID": 10
        },
        {
            "ID": 246085,
            "ConnectionTypeID": 25,
            "StatusTypeID": 50,
            "LevelID": 2,
            "PowerKW": 18,
            "CurrentTypeID": 20
        }
    ],
    "GeneralComments": "",
    "StatusTypeID": 50,
    "DateLastStatusUpdate": "2020-08-27T05:13:00Z",
    "DataQualityLevel": 2,
    "DateCreated": "2020-03-15T10:53:00Z",
    "SubmissionStatusTypeID": 100
}