{
    "IsRecentlyVerified": false,
    "ID": 81496,
    "UUID": "4B547F04-5683-4810-A422-5445819C3DD6",
    "DataProviderID": 1,
    "OperatorID": 23,
    "OperatorsReference": "10078",
    "UsageTypeID": 6,
    "UsageCost": "Free",
    "AddressInfo": {
        "ID": 81842,
        "Title": "Ok Corral Gun Club",
        "AddressLine1": "9449 48th Street Northeast",
        "Town": "Okeechobee",
        "StateOrProvince": "FL",
        "Postcode": "34972",
        "CountryID": 2,
        "Latitude": 27.301358,
        "Longitude": -80.731338,
        "ContactTelephone1": "(863) 357-2226",
        "DistanceUnit": 0
    },
    "Connections": [
        {
            "ID": 116232,
            "ConnectionTypeID": 30,
            "StatusTypeID": 50,
            "LevelID": 2,
            "PowerKW": 13,
            "CurrentTypeID": 20,
            "Quantity": 2
        }
    ],
    "NumberOfPoints": 2,
    "GeneralComments": "2 Tesla Connectors, up to 13kW.Available for patrons only. Please see front desk.",
    "StatusTypeID": 50,
    "DateLastStatusUpdate": "2017-02-02T17:25:00Z",
    "DataQualityLevel": 1,
    "DateCreated": "2017-02-02T17:25:00Z",
    "SubmissionStatusTypeID": 200
}