{
    "IsRecentlyVerified": false,
    "ID": 63294,
    "UUID": "F6CEE318-914C-4738-8EEE-0F185D34A629",
    "DataProviderID": 26,
    "DataProvidersReference": "66929",
    "OperatorID": 73,
    "OperatorsReference": "EV-Box EVB-P1521019",
    "UsageCost": "0.00 jaarabonnement",
    "AddressInfo": {
        "ID": 63640,
        "Title": "Van der Dussenstraat 1",
        "AddressLine1": "Van der Dussenstraat 1",
        "Town": "Rotterdam",
        "Postcode": "3039 TA",
        "CountryID": 159,
        "Latitude": 51.93226,
        "Longitude": 4.45651,
        "RelatedURL": "http://www.ev-box.nl",
        "DistanceUnit": 0
    },
    "Connections": [
        {
            "ID": 80646,
            "ConnectionTypeID": 25,
            "LevelID": 2,
            "PowerKW": 11,
            "CurrentTypeID": 10
        },
        {
            "ID": 80647,
            "ConnectionTypeID": 25,
            "LevelID": 2,
            "PowerKW": 11,
            "CurrentTypeID": 10
        }
    ],
    "NumberOfPoints": 1,
    "StatusTypeID": 50,
    "DateLastStatusUpdate": "2016-06-04T02:42:00Z",
    "DataQualityLevel": 3,
    "DateCreated": "2016-03-03T12:30:00Z",
    "SubmissionStatusTypeID": 100
}