{
    "IsRecentlyVerified": false,
    "ID": 140243,
    "UUID": "972039F8-F3B9-41F5-9CCE-7A5AB63FDE8C",
    "DataProviderID": 2,
    "DataProvidersReference": "81000",
    "UsageTypeID": 1,
    "AddressInfo": {
        "ID": 140595,
        "Title": "Ingles Market",
        "AddressLine1": "867 Brevard Rd",
        "Town": "Asheville",
        "StateOrProvince": "NC",
        "Postcode": "28806",
        "CountryID": 2,
        "Latitude": 35.530128,
        "Longitude": -82.606464,
        "ContactTelephone1": "828-665-0787",
        "AccessComments": "24 hours daily",
        "RelatedURL": "",
        "DistanceUnit": 0
    },
    "Connections": [
        {
            "ID": 195836,
            "ConnectionTypeID": 1,
            "LevelID": 2,
            "Amps": 16,
            "Voltage": 230,
            "PowerKW": 3.7,
            "CurrentTypeID": 10,
            "Quantity": 4
        }
    ],
    "StatusTypeID": 50,
    "DateLastStatusUpdate": "2020-06-26T02:58:00Z",
    "DataQualityLevel": 3,
    "DateCreated": "2019-12-24T09:12:00Z",
    "SubmissionStatusTypeID": 100
}