{
    "IsRecentlyVerified": false,
    "ID": 129530,
    "UUID": "4F06F72D-81A7-4892-85BE-BB2306451831",
    "DataProviderID": 2,
    "DataProvidersReference": "122130",
    "UsageTypeID": 2,
    "AddressInfo": {
        "ID": 129876,
        "Title": "Naval Facilities Engineering Command - Naval Air Station Corpus Christi",
        "AddressLine1": "11001 D St",
        "Town": "Corpus Christi",
        "StateOrProvince": "TX",
        "Postcode": "78418",
        "CountryID": 2,
        "Latitude": 27.6945303,
        "Longitude": -97.2742353,
        "ContactTelephone1": "",
        "AccessComments": "Fleet use only",
        "RelatedURL": "",
        "DistanceUnit": 0
    },
    "Connections": [
        {
            "ID": 181268,
            "ConnectionTypeID": 9,
            "LevelID": 1,
            "Amps": 16,
            "Voltage": 120,
            "PowerKW": 1.9,
            "CurrentTypeID": 10,
            "Quantity": 10
        }
    ],
    "DateLastStatusUpdate": "2020-06-26T02:52:00Z",
    "DataQualityLevel": 3,
    "DateCreated": "2019-07-21T11:43:00Z",
    "SubmissionStatusTypeID": 100
}