{
    "IsRecentlyVerified": false,
    "ID": 81655,
    "UUID": "E89FAE7F-EB7B-4562-99EF-C1679E360ECF",
    "DataProviderID": 1,
    "OperatorID": 23,
    "OperatorsReference": "20709",
    "UsageTypeID": 4,
    "AddressInfo": {
        "ID": 82001,
        "Title": "Verkkokauppa.com",
        "AddressLine1": "11 Tyynenmerenkatu",
        "Town": "Helsinki",
        "Postcode": "220",
        "CountryID": 79,
        "Latitude": 60.15643,
        "Longitude": 24.92092,
        "ContactTelephone1": "+358 103 09 55 55",
        "DistanceUnit": 0
    },
    "Connections": [
        {
            "ID": 116403,
            "ConnectionTypeID": 30,
            "StatusTypeID": 50,
            "LevelID": 2,
            "Amps": 32,
            "Voltage": 230,
            "PowerKW": 17,
            "CurrentTypeID": 20,
            "Quantity": 2
        }
    ],
    "NumberOfPoints": 2,
    "GeneralComments": "2 Tesla Connectors, up to 17kW.Available to the public. Self park.",
    "StatusTypeID": 50,
    "DateLastStatusUpdate": "2018-10-03T23:45:00Z",
    "DataQualityLevel": 1,
    "DateCreated": "2017-02-03T09:14:00Z",
    "SubmissionStatusTypeID": 200
}