{
    "IsRecentlyVerified": false,
    "ID": 187386,
    "UUID": "17F7565A-BA11-4803-AA44-081C5A4FFD0B",
    "DataProviderID": 29,
    "DataProvidersReference": "12139",
    "AddressInfo": {
        "ID": 187745,
        "Title": "Siemensstr. 30",
        "AddressLine1": "Siemensstr. 30",
        "Town": "Husum",
        "Postcode": "25813",
        "CountryID": 87,
        "Latitude": 54.49189,
        "Longitude": 9.07561,
        "DistanceUnit": 0
    },
    "Connections": [
        {
            "ID": 302476,
            "ConnectionTypeID": 25,
            "StatusTypeID": 50,
            "LevelID": 2,
            "PowerKW": 22,
            "CurrentTypeID": 20
        },
        {
            "ID": 302477,
            "ConnectionTypeID": 25,
            "StatusTypeID": 50,
            "LevelID": 2,
            "PowerKW": 22,
            "CurrentTypeID": 20
        }
    ],
    "StatusTypeID": 50,
    "DateLastStatusUpdate": "2021-07-12T02:52:00Z",
    "MetadataValues": [
        {
            "ID": 19626,
            "MetadataFieldID": 4,
            "ItemValue": "Data from the German chargepoint registry provided by Bundesnetzagentur.de under the CC-BY 4.0 license"
        }
    ],
    "DataQualityLevel": 3,
    "DateCreated": "2021-07-12T02:52:00Z",
    "SubmissionStatusTypeID": 100
}