{
    "IsRecentlyVerified": false,
    "ID": 124635,
    "UUID": "58C39AB8-FF9B-43F7-982A-105DA351A59F",
    "DataProviderID": 2,
    "DataProvidersReference": "40026",
    "UsageTypeID": 7,
    "AddressInfo": {
        "ID": 124981,
        "Title": "Criswell Nissan",
        "AddressLine1": "19574 Amaranth Dr",
        "Town": "Germantown",
        "StateOrProvince": "MD",
        "Postcode": "20874",
        "CountryID": 2,
        "Latitude": 39.177414,
        "Longitude": -77.249773,
        "ContactTelephone1": "301-670-3900",
        "AccessComments": "Dealership business hours\r\nPublic - Call ahead",
        "RelatedURL": "",
        "DistanceUnit": 0
    },
    "Connections": [
        {
            "ID": 174764,
            "ConnectionTypeID": 1,
            "LevelID": 2,
            "Amps": 16,
            "Voltage": 230,
            "PowerKW": 3.7,
            "CurrentTypeID": 10,
            "Quantity": 1
        }
    ],
    "DateLastStatusUpdate": "2020-06-26T03:01:00Z",
    "DataQualityLevel": 3,
    "DateCreated": "2019-04-06T05:03:00Z",
    "SubmissionStatusTypeID": 100
}