{
    "IsRecentlyVerified": false,
    "ID": 187892,
    "UUID": "EACDEDD5-A385-4876-8188-0DC68B108B9D",
    "DataProviderID": 18,
    "DataProvidersReference": "8a8f84b4b3a0c83b44c046073d1d3eba",
    "OperatorID": 3345,
    "UsageTypeID": 5,
    "AddressInfo": {
        "ID": 188251,
        "Title": "CV5 8AR",
        "AddressLine1": "",
        "Town": "Coventry",
        "Postcode": "CV5 8AR",
        "CountryID": 1,
        "Latitude": 52.409162,
        "Longitude": -1.556779,
        "AccessComments": "",
        "RelatedURL": "https://char.gy",
        "DistanceUnit": 0
    },
    "Connections": [
        {
            "ID": 303220,
            "ConnectionTypeID": 25,
            "Reference": "695",
            "StatusTypeID": 50,
            "LevelID": 2,
            "Amps": 16,
            "Voltage": 230,
            "PowerKW": 3.7,
            "CurrentTypeID": 10
        }
    ],
    "StatusTypeID": 0,
    "DateLastStatusUpdate": "2021-07-12T03:39:00Z",
    "MetadataValues": [
        {
            "ID": 20132,
            "MetadataFieldID": 4,
            "ItemValue": "Contains public sector information licensed under the Open Government Licence v2.0. http://www.nationalarchives.gov.uk/doc/open-government-licence/version/2/"
        }
    ],
    "DataQualityLevel": 3,
    "DateCreated": "2021-07-12T03:39:00Z",
    "SubmissionStatusTypeID": 100
}