{
    "IsRecentlyVerified": false,
    "ID": 127621,
    "UUID": "67D2CC16-E192-460B-98C3-72C93E4ED236",
    "DataProviderID": 1,
    "OperatorID": 25,
    "OperatorsReference": "ealing-alacrossroad",
    "UsageTypeID": 4,
    "UsageCost": "£0.059/minute; min £1.18; other tariffs available",
    "AddressInfo": {
        "ID": 127967,
        "Title": "Alacross Road",
        "AddressLine1": "39 Alacross Road",
        "Town": "London",
        "Postcode": "W5 4HT",
        "CountryID": 1,
        "Latitude": 51.502181,
        "Longitude": -0.308221,
        "DistanceUnit": 0
    },
    "Connections": [
        {
            "ID": 178635,
            "ConnectionTypeID": 25,
            "StatusTypeID": 50,
            "LevelID": 2,
            "Amps": 32,
            "Voltage": 230,
            "PowerKW": 7,
            "CurrentTypeID": 10,
            "Quantity": 3
        },
        {
            "ID": 178636,
            "ConnectionTypeID": 1,
            "StatusTypeID": 50,
            "LevelID": 2,
            "Voltage": 230,
            "PowerKW": 4,
            "CurrentTypeID": 10,
            "Quantity": 3
        }
    ],
    "NumberOfPoints": 3,
    "StatusTypeID": 50,
    "DateLastStatusUpdate": "2019-06-12T05:34:00Z",
    "DataQualityLevel": 1,
    "DateCreated": "2019-06-06T05:36:00Z",
    "SubmissionStatusTypeID": 200
}