{
    "IsRecentlyVerified": false,
    "ID": 124241,
    "UUID": "A898EE6D-17FC-42D6-BFC1-3C05B18F80D3",
    "DataProviderID": 1,
    "UsageTypeID": 1,
    "AddressInfo": {
        "ID": 124587,
        "Title": "South B Street",
        "AddressLine1": "South B Street",
        "Town": "Stockton",
        "StateOrProvince": "San Joaquin County",
        "Postcode": "95213",
        "CountryID": 2,
        "Latitude": 37.9411126802138,
        "Longitude": -121.257389308119,
        "AccessComments": "Available for public use during business hours ",
        "DistanceUnit": 0
    },
    "Connections": [
        {
            "ID": 174318,
            "ConnectionTypeID": 1,
            "LevelID": 2,
            "Amps": 16,
            "Voltage": 230,
            "PowerKW": 3,
            "CurrentTypeID": 10,
            "Quantity": 1
        }
    ],
    "StatusTypeID": 50,
    "DateLastStatusUpdate": "2019-06-12T07:16:00Z",
    "DataQualityLevel": 3,
    "DateCreated": "2019-04-06T05:03:00Z",
    "SubmissionStatusTypeID": 100
}