{
    "IsRecentlyVerified": false,
    "ID": 184538,
    "UUID": "DAFE7BB7-7080-452E-B45B-15C3C6164FBC",
    "DataProviderID": 29,
    "DataProvidersReference": "17269",
    "OperatorID": 45,
    "AddressInfo": {
        "ID": 184897,
        "Title": "Rudolf-Diesel-Str. 11",
        "AddressLine1": "Rudolf-Diesel-Str. 11",
        "Town": "Walsrode",
        "Postcode": "29664",
        "CountryID": 87,
        "Latitude": 52.862122,
        "Longitude": 9.620171,
        "DistanceUnit": 0
    },
    "Connections": [
        {
            "ID": 292935,
            "ConnectionTypeID": 25,
            "StatusTypeID": 50,
            "LevelID": 2,
            "PowerKW": 11,
            "CurrentTypeID": 20
        },
        {
            "ID": 292936,
            "ConnectionTypeID": 25,
            "StatusTypeID": 50,
            "LevelID": 2,
            "PowerKW": 11,
            "CurrentTypeID": 20
        }
    ],
    "StatusTypeID": 50,
    "DateLastStatusUpdate": "2021-07-09T03:28:00Z",
    "MetadataValues": [
        {
            "ID": 16829,
            "MetadataFieldID": 4,
            "ItemValue": "Data from the German chargepoint registry provided by Bundesnetzagentur.de under the CC-BY 4.0 license"
        }
    ],
    "DataQualityLevel": 3,
    "DateCreated": "2021-07-08T10:05:00Z",
    "SubmissionStatusTypeID": 100
}