{
    "IsRecentlyVerified": false,
    "ID": 184210,
    "UUID": "99C8378E-9840-46F9-849D-9B7BA74E581B",
    "DataProviderID": 29,
    "DataProvidersReference": "7466",
    "OperatorID": 128,
    "AddressInfo": {
        "ID": 184569,
        "Title": "Stendaler Str. 48",
        "AddressLine1": "Stendaler Str. 48",
        "Town": "Oebisfelde",
        "Postcode": "39646",
        "CountryID": 87,
        "Latitude": 52.435941,
        "Longitude": 11.00323,
        "DistanceUnit": 0
    },
    "Connections": [
        {
            "ID": 292167,
            "ConnectionTypeID": 25,
            "StatusTypeID": 50,
            "LevelID": 2,
            "PowerKW": 22,
            "CurrentTypeID": 20
        },
        {
            "ID": 292168,
            "ConnectionTypeID": 25,
            "StatusTypeID": 50,
            "LevelID": 2,
            "PowerKW": 22,
            "CurrentTypeID": 20
        }
    ],
    "StatusTypeID": 50,
    "DateLastStatusUpdate": "2021-07-09T03:27:00Z",
    "MetadataValues": [
        {
            "ID": 16502,
            "MetadataFieldID": 4,
            "ItemValue": "Data from the German chargepoint registry provided by Bundesnetzagentur.de under the CC-BY 4.0 license"
        }
    ],
    "DataQualityLevel": 3,
    "DateCreated": "2021-07-08T10:05:00Z",
    "SubmissionStatusTypeID": 100
}