{
    "IsRecentlyVerified": false,
    "ID": 8785,
    "UUID": "E68DAAE6-FB12-49AC-B3CB-762A65F733C0",
    "DataProviderID": 15,
    "DataProvidersReference": "11896",
    "OperatorID": 5,
    "UsageTypeID": 2,
    "AddressInfo": {
        "ID": 8682,
        "Title": "1125 Squires Beach Rd",
        "AddressLine1": "1125 Squires Beach Rd",
        "Town": "Pickering",
        "StateOrProvince": "Ontario",
        "Postcode": "L1W 3A3",
        "CountryID": 44,
        "Latitude": 43.8223,
        "Longitude": -79.05204,
        "ContactTelephone1": "",
        "RelatedURL": "http://carstations.com/11896",
        "DistanceUnit": 0
    },
    "Connections": [
        {
            "ID": 6267,
            "ConnectionTypeID": 1,
            "Reference": "J1772",
            "LevelID": 2
        },
        {
            "ID": 7415,
            "ConnectionTypeID": 9,
            "Reference": "NEMA5",
            "LevelID": 1,
            "Quantity": 1
        }
    ],
    "NumberOfPoints": 1,
    "StatusTypeID": 0,
    "DateLastStatusUpdate": "2017-11-04T14:04:00Z",
    "DataQualityLevel": 1,
    "DateCreated": "2011-11-26T14:31:00Z",
    "SubmissionStatusTypeID": 100
}