{
    "IsRecentlyVerified": false,
    "ID": 168775,
    "UUID": "EB47CC8E-52FC-4DD6-86EB-9B30091AACAE",
    "DataProviderID": 1,
    "OperatorID": 45,
    "UsageTypeID": 4,
    "UsageCost": "0,30 Euro/ kWh",
    "AddressInfo": {
        "ID": 169134,
        "Title": "Hotel Alpenland ***S, ",
        "AddressLine1": "Stuls 7B",
        "Town": "Moos in Passeier",
        "StateOrProvince": "Bozen",
        "Postcode": "39013 ",
        "CountryID": 112,
        "Latitude": 46.828088447064346,
        "Longitude": 11.19555999905981,
        "ContactTelephone1": "+39 0473 649 544",
        "ContactEmail": "info@hotelalpenland.com",
        "AccessComments": "Für Hotelkunden mittels RFID Karte\r\nEcogy 11 kW",
        "RelatedURL": "https://www.hotelalpenland.com/de/",
        "DistanceUnit": 0
    },
    "Connections": [
        {
            "ID": 256525,
            "ConnectionTypeID": 25,
            "StatusTypeID": 50,
            "LevelID": 2,
            "Amps": 16,
            "Voltage": 400,
            "PowerKW": 11,
            "CurrentTypeID": 20,
            "Quantity": 1
        }
    ],
    "NumberOfPoints": 1,
    "GeneralComments": "Die Ladestation befindet sich auf dem Kundenparkplatz",
    "StatusTypeID": 50,
    "DateLastStatusUpdate": "2020-10-05T15:57:00Z",
    "DataQualityLevel": 1,
    "DateCreated": "2020-10-05T15:57:00Z",
    "SubmissionStatusTypeID": 200
}