{
    "IsRecentlyVerified": false,
    "ID": 50805,
    "UUID": "1771983B-7F9E-4D3A-A039-8D5C4D8BF56D",
    "DataProviderID": 26,
    "DataProvidersReference": "62776",
    "OperatorID": 180,
    "OperatorsReference": "Alfen RHL02212",
    "UsageCost": "0.00 jaarabonnement",
    "AddressInfo": {
        "ID": 51151,
        "Title": "Hoefblad 30",
        "AddressLine1": "Hoefblad 30",
        "Town": "Westland",
        "Postcode": "2671 WX",
        "CountryID": 159,
        "Latitude": 51.994022,
        "Longitude": 4.19851,
        "ContactTelephone1": "036 - 549 34 00",
        "RelatedURL": "http://www.icu-charging-stations.com/",
        "DistanceUnit": 0
    },
    "Connections": [
        {
            "ID": 62688,
            "ConnectionTypeID": 25,
            "LevelID": 2,
            "PowerKW": 11,
            "CurrentTypeID": 10
        },
        {
            "ID": 62689,
            "ConnectionTypeID": 25,
            "LevelID": 2,
            "PowerKW": 11,
            "CurrentTypeID": 10
        }
    ],
    "NumberOfPoints": 1,
    "StatusTypeID": 50,
    "DateLastStatusUpdate": "2016-06-04T02:43:00Z",
    "DataQualityLevel": 3,
    "DateCreated": "2015-07-22T09:53:00Z",
    "SubmissionStatusTypeID": 100
}