{
    "IsRecentlyVerified": false,
    "ID": 178774,
    "UUID": "97B3F340-2C52-4E83-84F2-E62AE363D908",
    "DataProviderID": 29,
    "DataProvidersReference": "10241",
    "AddressInfo": {
        "ID": 179133,
        "Title": "Universitätsstraße 30",
        "AddressLine1": "Universitätsstraße 30",
        "Town": "Bayreuth",
        "Postcode": "95447",
        "CountryID": 87,
        "Latitude": 49.926511,
        "Longitude": 11.584689,
        "DistanceUnit": 0
    },
    "Connections": [
        {
            "ID": 279668,
            "ConnectionTypeID": 25,
            "StatusTypeID": 50,
            "LevelID": 2,
            "PowerKW": 22,
            "CurrentTypeID": 20
        },
        {
            "ID": 279669,
            "ConnectionTypeID": 25,
            "StatusTypeID": 50,
            "LevelID": 2,
            "PowerKW": 22,
            "CurrentTypeID": 20
        }
    ],
    "StatusTypeID": 0,
    "DateLastStatusUpdate": "2021-07-12T02:44:00Z",
    "MetadataValues": [
        {
            "ID": 11068,
            "MetadataFieldID": 4,
            "ItemValue": "Data from the German chargepoint registry provided by Bundesnetzagentur.de under the CC-BY 4.0 license"
        }
    ],
    "DataQualityLevel": 3,
    "DateCreated": "2021-07-08T09:50:00Z",
    "SubmissionStatusTypeID": 100
}