{
    "IsRecentlyVerified": false,
    "ID": 46272,
    "UUID": "D227F63E-2530-415E-AAF6-5B2A666DC6B1",
    "DataProviderID": 1,
    "DataProvidersReference": "2274",
    "AddressInfo": {
        "ID": 46618,
        "Title": "Jørgen Moes gate, Oslo",
        "AddressLine1": "Jørgen Moes gate ",
        "Town": "OSLO",
        "StateOrProvince": "Oslo",
        "Postcode": "0259",
        "CountryID": 168,
        "Latitude": 59.92157,
        "Longitude": 10.71901,
        "AccessComments": "I Jørgen Moes gate foran muren til Urianienborg kirke, mellom Holtegaten og Eilert Sundts gate.",
        "DistanceUnit": 0
    },
    "Connections": [
        {
            "ID": 56935,
            "ConnectionTypeID": 0,
            "LevelID": 2,
            "Amps": 16,
            "Voltage": 230,
            "PowerKW": 3.68
        },
        {
            "ID": 85885,
            "ConnectionTypeID": 0,
            "Reference": "1",
            "LevelID": 2,
            "Amps": 16,
            "Voltage": 230,
            "PowerKW": 3.7,
            "Comments": "Mode 3"
        },
        {
            "ID": 85886,
            "ConnectionTypeID": 0,
            "LevelID": 2,
            "Amps": 16,
            "Voltage": 230,
            "PowerKW": 3.68
        },
        {
            "ID": 88660,
            "ConnectionTypeID": 0,
            "Reference": "2",
            "LevelID": 2,
            "Amps": 16,
            "Voltage": 230,
            "PowerKW": 3.7,
            "Comments": "Mode 3"
        },
        {
            "ID": 223956,
            "ConnectionTypeID": 0,
            "LevelID": 2,
            "Amps": 16,
            "Voltage": 230,
            "PowerKW": 3.68
        },
        {
            "ID": 223957,
            "ConnectionTypeID": 0,
            "Reference": "3",
            "LevelID": 2,
            "Amps": 16,
            "Voltage": 230,
            "PowerKW": 3.7,
            "Comments": "Mode 3"
        },
        {
            "ID": 223958,
            "ConnectionTypeID": 0,
            "LevelID": 2,
            "Amps": 16,
            "Voltage": 230,
            "PowerKW": 3.68
        },
        {
            "ID": 223959,
            "ConnectionTypeID": 0,
            "Reference": "4",
            "LevelID": 2,
            "Amps": 16,
            "Voltage": 230,
            "PowerKW": 3.7,
            "Comments": "Mode 3"
        }
    ],
    "NumberOfPoints": 4,
    "DateLastStatusUpdate": "2020-05-26T08:23:00Z",
    "DataQualityLevel": 2,
    "DateCreated": "2015-05-03T00:54:00Z",
    "SubmissionStatusTypeID": 100
}