{
    "MediaItems": [
        {
            "ID": 1176,
            "ChargePointID": 40980,
            "ItemURL": "https://s3-ap-southeast-2.amazonaws.com/openchargemap/images/DE/OCM40980/OCM-40980.orig.2015040316001278.jpg",
            "ItemThumbnailURL": "https://s3-ap-southeast-2.amazonaws.com/openchargemap/images/DE/OCM40980/OCM-40980.thmb.2015040316001278.jpg",
            "Comment": "Der Supermarkt ist, wenn man auf den Parkplatz fährt, tatsächlich links. Die dunkelgraue Mennekes Säule ist ganz hinten am Gebäude, also von der Einfahrt aus links hinten.",
            "IsEnabled": true,
            "IsVideo": false,
            "IsFeaturedItem": false,
            "IsExternalResource": false,
            "User": {
                "ID": 4573,
                "Username": "Erna_Schleck"
            },
            "DateCreated": "2015-04-03T16:00:00Z"
        }
    ],
    "IsRecentlyVerified": false,
    "ID": 40980,
    "UUID": "6BE5BEEF-97D7-47E7-A911-D351E8326005",
    "DataProviderID": 1,
    "OperatorID": 45,
    "UsageTypeID": 1,
    "AddressInfo": {
        "ID": 41326,
        "Title": "Edeka Wennigsen",
        "AddressLine1": "Hauptstraße 14",
        "Town": "Wennigsen",
        "StateOrProvince": "Region Hannover",
        "Postcode": "30974",
        "CountryID": 87,
        "Latitude": 52.27245,
        "Longitude": 9.56831,
        "ContactTelephone1": "051032266",
        "AccessComments": "Auf dem Parkplatz auf dem Hof auf der linken Seite sind 2 Parkplätze. Strom kostenlos. Nutzbar während der Öffnungszeiten Mo-Sa 7-21Uhr",
        "RelatedURL": "http://www.edeka.de",
        "DistanceUnit": 0
    },
    "Connections": [
        {
            "ID": 44665,
            "ConnectionTypeID": 28,
            "StatusTypeID": 50,
            "LevelID": 2,
            "Amps": 16,
            "Voltage": 230,
            "PowerKW": 3.7,
            "CurrentTypeID": 10,
            "Quantity": 2
        },
        {
            "ID": 44666,
            "ConnectionTypeID": 25,
            "StatusTypeID": 50,
            "LevelID": 2,
            "Amps": 32,
            "PowerKW": 22,
            "CurrentTypeID": 20,
            "Quantity": 2
        }
    ],
    "NumberOfPoints": 4,
    "StatusTypeID": 50,
    "DateLastStatusUpdate": "2015-04-13T08:03:00Z",
    "DataQualityLevel": 1,
    "DateCreated": "2015-01-20T07:00:00Z",
    "SubmissionStatusTypeID": 200
}