{
    "IsRecentlyVerified": false,
    "ID": 135847,
    "UUID": "1B722582-D8B4-4836-A359-31F50898C0DA",
    "DataProviderID": 18,
    "DataProvidersReference": "660040e976b97bed9edfeb52bd2cf6f8",
    "OperatorID": 2244,
    "UsageTypeID": 5,
    "AddressInfo": {
        "ID": 136193,
        "Title": "Chelverton Road",
        "AddressLine1": "Chelverton Road",
        "Town": "London",
        "Postcode": "SW15 1RL",
        "CountryID": 1,
        "Latitude": 51.463098,
        "Longitude": -0.219649,
        "AccessComments": "",
        "RelatedURL": "https://www.ubitricity.com",
        "DistanceUnit": 0
    },
    "Connections": [
        {
            "ID": 190268,
            "ConnectionTypeID": 25,
            "Reference": "suby1100002183",
            "StatusTypeID": 50,
            "LevelID": 2,
            "Amps": 16,
            "Voltage": 230,
            "PowerKW": 3.7,
            "CurrentTypeID": 10
        }
    ],
    "StatusTypeID": 0,
    "DateLastStatusUpdate": "2021-04-25T05:46:00Z",
    "MetadataValues": [
        {
            "ID": 5699,
            "MetadataFieldID": 4,
            "ItemValue": "Contains public sector information licensed under the Open Government Licence v2.0. http://www.nationalarchives.gov.uk/doc/open-government-licence/version/2/"
        }
    ],
    "DataQualityLevel": 3,
    "DateCreated": "2019-12-24T05:22:00Z",
    "SubmissionStatusTypeID": 100
}