{
    "IsRecentlyVerified": false,
    "ID": 130503,
    "UUID": "299D02E6-FC79-4BC3-A409-83BB3CBE38A1",
    "DataProviderID": 1,
    "OperatorID": 80,
    "UsageTypeID": 4,
    "AddressInfo": {
        "ID": 130849,
        "Title": "Lancenigo Piave | EnelX",
        "AddressLine1": "Via Piave angolo Via Gorizia",
        "AddressLine2": "Lancenigo",
        "Town": "Villorba",
        "StateOrProvince": "TV",
        "Postcode": "31020",
        "CountryID": 112,
        "Latitude": 45.71352167678387,
        "Longitude": 12.273685401655598,
        "ContactTelephone1": "800.069.850",
        "RelatedURL": "https://www.enelx.com/it/it/emobility",
        "DistanceUnit": 0
    },
    "Connections": [
        {
            "ID": 182690,
            "ConnectionTypeID": 25,
            "StatusTypeID": 50,
            "LevelID": 2,
            "Amps": 32,
            "Voltage": 400,
            "PowerKW": 22,
            "CurrentTypeID": 20,
            "Quantity": 2
        }
    ],
    "NumberOfPoints": 2,
    "StatusTypeID": 50,
    "DateLastStatusUpdate": "2019-08-06T08:05:00Z",
    "DataQualityLevel": 1,
    "DateCreated": "2019-08-06T08:05:00Z",
    "SubmissionStatusTypeID": 200
}