{
    "IsRecentlyVerified": false,
    "ID": 125628,
    "UUID": "EA02F5BE-1631-429C-86D8-CC03E71D429D",
    "DataProviderID": 1,
    "OperatorID": 62,
    "UsageTypeID": 4,
    "UsageCost": "Free",
    "AddressInfo": {
        "ID": 125974,
        "Title": "Nissan taillefer",
        "AddressLine1": "1056 Rue François Joseph Gossec",
        "Town": "Montpellier ",
        "Postcode": "34970",
        "CountryID": 80,
        "Latitude": 43.57484508661213,
        "Longitude": 3.8689613536179195,
        "DistanceUnit": 0
    },
    "Connections": [
        {
            "ID": 176029,
            "ConnectionTypeID": 2,
            "StatusTypeID": 50,
            "LevelID": 3,
            "PowerKW": 50,
            "CurrentTypeID": 30,
            "Quantity": 1
        }
    ],
    "NumberOfPoints": 1,
    "GeneralComments": "Open Monday to Friday 09:00 - 17:00",
    "StatusTypeID": 50,
    "DateLastStatusUpdate": "2019-04-23T07:30:00Z",
    "DataQualityLevel": 1,
    "DateCreated": "2019-04-22T09:05:00Z",
    "SubmissionStatusTypeID": 200
}