{
    "IsRecentlyVerified": false,
    "ID": 5289,
    "UUID": "AAD1A3BE-FC37-42E5-B43F-87EA321B179A",
    "DataProviderID": 1,
    "OperatorID": 20,
    "OperatorsReference": "70637,70638",
    "UsageTypeID": 4,
    "UsageCost": "Free",
    "AddressInfo": {
        "ID": 5228,
        "Title": "City Road",
        "AddressLine1": "City Road",
        "Town": "Newcastle Upon Tyne",
        "StateOrProvince": "Tyne and Wear",
        "Postcode": "NE1 2AF",
        "CountryID": 1,
        "Latitude": 54.9711963,
        "Longitude": -1.6036316,
        "DistanceUnit": 0
    },
    "Connections": [
        {
            "ID": 399,
            "ConnectionTypeID": 3,
            "StatusTypeID": 50,
            "LevelID": 2,
            "Amps": 13,
            "Voltage": 230,
            "PowerKW": 3,
            "CurrentTypeID": 10,
            "Quantity": 1
        },
        {
            "ID": 64106,
            "ConnectionTypeID": 25,
            "StatusTypeID": 75,
            "LevelID": 2,
            "Amps": 32,
            "Voltage": 230,
            "PowerKW": 7,
            "CurrentTypeID": 10,
            "Quantity": 2
        }
    ],
    "NumberOfPoints": 2,
    "StatusTypeID": 75,
    "DateLastStatusUpdate": "2020-06-03T05:13:00Z",
    "DataQualityLevel": 1,
    "DateCreated": "2011-08-24T15:40:00Z",
    "SubmissionStatusTypeID": 200
}