{
    "IsRecentlyVerified": false,
    "ID": 81443,
    "UUID": "D54A33BB-79F7-4AF1-B1A1-1ABA6717D8BA",
    "DataProviderID": 1,
    "OperatorID": 20,
    "OperatorsReference": "80017",
    "UsageTypeID": 4,
    "UsageCost": "Free",
    "AddressInfo": {
        "ID": 81789,
        "Title": "Norfolk Street",
        "AddressLine1": "Norfolk Street",
        "Town": "North Shields",
        "Postcode": "NE30 1DB",
        "CountryID": 1,
        "Latitude": 55.009836,
        "Longitude": -1.444229,
        "DistanceUnit": 0
    },
    "Connections": [
        {
            "ID": 116171,
            "ConnectionTypeID": 25,
            "StatusTypeID": 50,
            "LevelID": 2,
            "Amps": 32,
            "Voltage": 230,
            "PowerKW": 7,
            "CurrentTypeID": 10,
            "Quantity": 1
        }
    ],
    "NumberOfPoints": 2,
    "StatusTypeID": 50,
    "DateLastStatusUpdate": "2020-05-26T05:18:00Z",
    "DataQualityLevel": 1,
    "DateCreated": "2017-02-02T06:26:00Z",
    "SubmissionStatusTypeID": 200
}