{
    "IsRecentlyVerified": false,
    "ID": 74529,
    "UUID": "B5C52CBE-8963-4EDC-9524-20161138B9D7",
    "DataProviderID": 1,
    "OperatorID": 23,
    "OperatorsReference": "21169",
    "UsageTypeID": 1,
    "UsageCost": "Free",
    "AddressInfo": {
        "ID": 74875,
        "Title": "The Coachman Hotel - Tesla",
        "AddressLine1": "4100 Pine Blvd",
        "Town": "South Lake Tahoe",
        "StateOrProvince": "CA",
        "Postcode": "96150",
        "CountryID": 2,
        "Latitude": 38.959433,
        "Longitude": -119.946523,
        "ContactTelephone1": "530-545-6460  877-798-3752",
        "AccessComments": "24 hours daily; for Tesla use only; for guest use only",
        "RelatedURL": "http://www.teslamotors.com/supercharger",
        "DistanceUnit": 0
    },
    "Connections": [
        {
            "ID": 107131,
            "ConnectionTypeID": 30,
            "StatusTypeID": 50,
            "LevelID": 2,
            "Amps": 16,
            "Voltage": 230,
            "PowerKW": 16,
            "CurrentTypeID": 10,
            "Quantity": 1
        }
    ],
    "NumberOfPoints": 1,
    "StatusTypeID": 50,
    "DateLastStatusUpdate": "2017-01-26T02:31:00Z",
    "DataQualityLevel": 3,
    "DateCreated": "2016-12-03T00:12:00Z",
    "SubmissionStatusTypeID": 100
}