{
    "IsRecentlyVerified": false,
    "ID": 160765,
    "UUID": "A9AB79A1-4FBB-4CE9-B580-79C880F98DEE",
    "DataProviderID": 2,
    "DataProvidersReference": "153066",
    "OperatorID": 5,
    "UsageTypeID": 1,
    "AddressInfo": {
        "ID": 161122,
        "Title": "KAMLOOPS VW",
        "AddressLine1": "2483 Trans Canada Hwy East Frontage Rd",
        "Town": "Kamloops",
        "StateOrProvince": "BC",
        "Postcode": "V2C 4A9",
        "CountryID": 44,
        "Latitude": 50.6756722,
        "Longitude": -120.2465878,
        "ContactTelephone1": "888-758-4389",
        "AccessComments": "24 hours daily",
        "RelatedURL": "http://www.chargepoint.com/",
        "DistanceUnit": 0
    },
    "Connections": [
        {
            "ID": 231366,
            "ConnectionTypeID": 1,
            "LevelID": 2,
            "Amps": 16,
            "Voltage": 230,
            "PowerKW": 3.7,
            "CurrentTypeID": 10,
            "Quantity": 2
        }
    ],
    "StatusTypeID": 50,
    "DateLastStatusUpdate": "2020-06-26T03:12:00Z",
    "DataQualityLevel": 3,
    "DateCreated": "2020-06-26T03:12:00Z",
    "SubmissionStatusTypeID": 100
}