{
    "IsRecentlyVerified": false,
    "ID": 101929,
    "UUID": "43499413-3A6E-461D-BD4B-C14796D1B76E",
    "DataProviderID": 1,
    "OperatorID": 23,
    "OperatorsReference": "42133",
    "UsageTypeID": 4,
    "AddressInfo": {
        "ID": 102275,
        "Title": "Residence Inn Denver Airport/Convention Center",
        "AddressLine1": "6762 Tower RD",
        "Town": "Denver",
        "StateOrProvince": "Colorado",
        "Postcode": "80249",
        "CountryID": 2,
        "Latitude": 39.818968,
        "Longitude": -104.770335,
        "ContactTelephone1": "(303) 307-9100",
        "DistanceUnit": 0
    },
    "Connections": [
        {
            "ID": 143912,
            "ConnectionTypeID": 30,
            "StatusTypeID": 50,
            "LevelID": 2,
            "PowerKW": 16,
            "CurrentTypeID": 20,
            "Quantity": 2
        }
    ],
    "NumberOfPoints": 2,
    "GeneralComments": "2 Tesla Connectors, up to 16kW.Available for customers. Self park.",
    "StatusTypeID": 50,
    "DateLastStatusUpdate": "2019-06-05T11:39:00Z",
    "DataQualityLevel": 1,
    "DateCreated": "2018-04-16T04:37:00Z",
    "SubmissionStatusTypeID": 200
}