{
    "IsRecentlyVerified": false,
    "ID": 152553,
    "UUID": "CF2B9347-3DC6-4876-A1D3-403C0D7C657C",
    "DataProviderID": 28,
    "DataProvidersReference": "",
    "UsageTypeID": 5,
    "AddressInfo": {
        "ID": 152906,
        "Title": "SORIGNY 2480 - Place Antoine de St Exupéry",
        "AddressLine1": "ISOPARC Tranche 3 Place Antoine de St Exupéry - 37250 SORIGNY",
        "CountryID": 80,
        "Latitude": 47.256705,
        "Longitude": 0.693495,
        "AccessComments": "24/24 7/7",
        "DistanceUnit": 0
    },
    "Connections": [
        {
            "ID": 213604,
            "ConnectionTypeID": 28,
            "StatusTypeID": 50,
            "LevelID": 2,
            "PowerKW": 18,
            "CurrentTypeID": 10
        },
        {
            "ID": 213605,
            "ConnectionTypeID": 25,
            "StatusTypeID": 50,
            "LevelID": 2,
            "PowerKW": 18,
            "CurrentTypeID": 10
        }
    ],
    "GeneralComments": "www.virtaev.fr",
    "StatusTypeID": 50,
    "DateLastStatusUpdate": "2020-03-15T10:53:00Z",
    "DataQualityLevel": 2,
    "DateCreated": "2020-03-15T10:53:00Z",
    "SubmissionStatusTypeID": 100
}