{
    "IsRecentlyVerified": false,
    "ID": 72304,
    "UUID": "10F4D8DA-4107-4816-8734-53E593FDD86E",
    "DataProviderID": 2,
    "DataProvidersReference": "78446",
    "OperatorID": 5,
    "UsageTypeID": 1,
    "AddressInfo": {
        "ID": 72650,
        "Title": "GAS&ELECTRIC;",
        "AddressLine1": "2-16 S Broad St",
        "Town": "Westfield",
        "StateOrProvince": "MA",
        "Postcode": "01085",
        "CountryID": 2,
        "Latitude": 42.1122989,
        "Longitude": -72.7477309,
        "ContactTelephone1": "888-758-4389",
        "AccessComments": "24 hours daily",
        "RelatedURL": "http://www.chargepoint.com/",
        "DistanceUnit": 0
    },
    "Connections": [
        {
            "ID": 103610,
            "ConnectionTypeID": 1,
            "LevelID": 2,
            "Amps": 16,
            "Voltage": 230,
            "PowerKW": 3,
            "CurrentTypeID": 10,
            "Quantity": 2
        }
    ],
    "DateLastStatusUpdate": "2019-12-24T09:19:00Z",
    "DataQualityLevel": 3,
    "DateCreated": "2016-10-09T02:45:00Z",
    "SubmissionStatusTypeID": 100
}