{
    "IsRecentlyVerified": false,
    "ID": 101650,
    "UUID": "9F76F95E-A3B4-4E8C-A137-76023B35044B",
    "DataProviderID": 1,
    "OperatorID": 45,
    "UsageTypeID": 1,
    "AddressInfo": {
        "ID": 101996,
        "Title": "Hemmelrath Lackfabrik",
        "AddressLine1": "Jakob-Hemmelrath-Straße 1\t",
        "AddressLine2": "Röllfeld",
        "Town": "Klingenberg",
        "StateOrProvince": "Landkreis Miltenberg",
        "Postcode": "63911",
        "CountryID": 87,
        "Latitude": 49.76876,
        "Longitude": 9.184309999999982,
        "AccessComments": "Vier Lademöglichkeiten, davon eine öffentliche.",
        "RelatedURL": "http://www.hemmelrath.de/",
        "DistanceUnit": 0
    },
    "Connections": [
        {
            "ID": 143494,
            "ConnectionTypeID": 25,
            "StatusTypeID": 50,
            "LevelID": 2,
            "Amps": 32,
            "Voltage": 400,
            "PowerKW": 22,
            "CurrentTypeID": 20,
            "Quantity": 1
        }
    ],
    "NumberOfPoints": 4,
    "StatusTypeID": 50,
    "DateLastStatusUpdate": "2018-04-03T12:28:00Z",
    "DataQualityLevel": 1,
    "DateCreated": "2018-04-03T12:28:00Z",
    "SubmissionStatusTypeID": 200
}