{
    "IsRecentlyVerified": false,
    "ID": 67039,
    "UUID": "95AC9AAA-4612-4B1E-894C-73B2E98A9435",
    "DataProviderID": 1,
    "OperatorID": 23,
    "OperatorsReference": "17207",
    "UsageTypeID": 1,
    "UsageCost": "Free",
    "AddressInfo": {
        "ID": 67385,
        "Title": "SpringHill Suites - Tesla",
        "AddressLine1": "12325 Johnston Rd",
        "Town": "Charlotte",
        "StateOrProvince": "NC",
        "Postcode": "28277",
        "CountryID": 2,
        "Latitude": 35.070574,
        "Longitude": -80.8421164,
        "ContactTelephone1": "704-817-1500  877-798-3752",
        "AccessComments": "24 hours daily; for Tesla use only; for guest use only; see front desk for access",
        "RelatedURL": "http://www.teslamotors.com/supercharger",
        "DistanceUnit": 0
    },
    "Connections": [
        {
            "ID": 92533,
            "ConnectionTypeID": 30,
            "StatusTypeID": 50,
            "LevelID": 2,
            "Amps": 16,
            "Voltage": 230,
            "PowerKW": 16,
            "CurrentTypeID": 10,
            "Quantity": 2
        }
    ],
    "NumberOfPoints": 2,
    "StatusTypeID": 50,
    "DateLastStatusUpdate": "2017-01-31T18:03:00Z",
    "DataQualityLevel": 3,
    "DateCreated": "2016-05-29T02:04:00Z",
    "SubmissionStatusTypeID": 100
}