{
    "IsRecentlyVerified": false,
    "ID": 127539,
    "UUID": "A552F455-2937-4E30-B93A-118FA0B40AEF",
    "DataProviderID": 1,
    "OperatorID": 20,
    "OperatorsReference": "70185",
    "UsageTypeID": 4,
    "UsageCost": "£1.00/charge admin fee",
    "AddressInfo": {
        "ID": 127885,
        "Title": "Poltimore Road",
        "AddressLine1": "Corner of Poltimore Road & Agreria Road",
        "Town": "Guildford",
        "StateOrProvince": "Surrey",
        "Postcode": "GU2 7PX",
        "CountryID": 1,
        "Latitude": 51.23557,
        "Longitude": -0.58723,
        "DistanceUnit": 0
    },
    "Connections": [
        {
            "ID": 178540,
            "ConnectionTypeID": 25,
            "StatusTypeID": 50,
            "LevelID": 2,
            "Amps": 32,
            "Voltage": 230,
            "PowerKW": 7,
            "CurrentTypeID": 10,
            "Quantity": 1
        }
    ],
    "NumberOfPoints": 1,
    "StatusTypeID": 50,
    "DateLastStatusUpdate": "2020-01-02T08:40:00Z",
    "DataQualityLevel": 1,
    "DateCreated": "2019-06-05T05:28:00Z",
    "SubmissionStatusTypeID": 200
}