{
    "IsRecentlyVerified": false,
    "ID": 32546,
    "UUID": "8FECFC52-B42B-4E2E-8710-8D0646940167",
    "DataProviderID": 1,
    "OperatorID": 105,
    "OperatorsReference": "Essent EM-DE-05111000-02-00001",
    "UsageTypeID": 4,
    "AddressInfo": {
        "ID": 32892,
        "Title": "Höherweg 101",
        "AddressLine1": "Höherweg 101",
        "Town": "Düsseldorf",
        "Postcode": "40233",
        "CountryID": 87,
        "Latitude": 51.220003,
        "Longitude": 6.816114,
        "DistanceUnit": 0
    },
    "Connections": [
        {
            "ID": 36057,
            "ConnectionTypeID": 25,
            "LevelID": 2,
            "PowerKW": 11
        },
        {
            "ID": 46418,
            "ConnectionTypeID": 25,
            "LevelID": 2,
            "PowerKW": 11
        }
    ],
    "NumberOfPoints": 1,
    "StatusTypeID": 50,
    "DateLastStatusUpdate": "2015-04-13T19:33:00Z",
    "DataQualityLevel": 3,
    "DateCreated": "2015-01-09T06:03:00Z",
    "SubmissionStatusTypeID": 200
}