{
    "IsRecentlyVerified": false,
    "ID": 103248,
    "UUID": "64810EAA-7632-41B8-83C9-A134AB3AB280",
    "DataProviderID": 1,
    "OperatorID": 1,
    "UsageTypeID": 7,
    "UsageCost": "Free",
    "AddressInfo": {
        "ID": 103594,
        "Title": "Hotel Opera 02",
        "AddressLine1": "Via Medusia 32",
        "Town": "Castelvetro di Modena MO",
        "CountryID": 112,
        "Latitude": 44.498096,
        "Longitude": 10.917437,
        "RelatedURL": "https://www.forumelettrico.it/forum/colonnina-22kw-hotel-opera-02-castelvetro-di-modena-mo-via-medusia-32-t2671.html",
        "DistanceUnit": 0
    },
    "Connections": [
        {
            "ID": 145886,
            "ConnectionTypeID": 25,
            "StatusTypeID": 50,
            "LevelID": 2,
            "Amps": 32,
            "Voltage": 400,
            "PowerKW": 22,
            "CurrentTypeID": 20,
            "Quantity": 2
        }
    ],
    "NumberOfPoints": 2,
    "GeneralComments": "Attivabile tramite card da richiedere in reception / Ask at reception for card",
    "StatusTypeID": 50,
    "DateLastStatusUpdate": "2018-04-25T12:48:00Z",
    "DataQualityLevel": 1,
    "DateCreated": "2018-04-24T12:50:00Z",
    "SubmissionStatusTypeID": 200
}