{
    "IsRecentlyVerified": false,
    "ID": 176367,
    "UUID": "31030628-6AB0-45F5-9483-C56A97DDB0ED",
    "DataProviderID": 29,
    "DataProvidersReference": "20527",
    "AddressInfo": {
        "ID": 176726,
        "Title": "An der Plüschwebwerei 15",
        "AddressLine1": "An der Plüschwebwerei 15",
        "Town": "Grefrath",
        "Postcode": "47929",
        "CountryID": 87,
        "Latitude": 51.339031,
        "Longitude": 6.334877,
        "DistanceUnit": 0
    },
    "Connections": [
        {
            "ID": 274192,
            "ConnectionTypeID": 17,
            "StatusTypeID": 50,
            "LevelID": 2,
            "PowerKW": 22,
            "CurrentTypeID": 20
        },
        {
            "ID": 274193,
            "ConnectionTypeID": 25,
            "StatusTypeID": 50,
            "LevelID": 2,
            "PowerKW": 22,
            "CurrentTypeID": 20
        },
        {
            "ID": 299168,
            "ConnectionTypeID": 17,
            "StatusTypeID": 50,
            "LevelID": 2,
            "PowerKW": 22,
            "CurrentTypeID": 20
        },
        {
            "ID": 299169,
            "ConnectionTypeID": 25,
            "StatusTypeID": 50,
            "LevelID": 2,
            "PowerKW": 22,
            "CurrentTypeID": 20
        }
    ],
    "StatusTypeID": 0,
    "DateLastStatusUpdate": "2021-07-12T02:47:00Z",
    "MetadataValues": [
        {
            "ID": 8662,
            "MetadataFieldID": 4,
            "ItemValue": "Data from the German chargepoint registry provided by Bundesnetzagentur.de under the CC-BY 4.0 license"
        }
    ],
    "DataQualityLevel": 3,
    "DateCreated": "2021-07-08T09:48:00Z",
    "SubmissionStatusTypeID": 100
}