{
    "IsRecentlyVerified": false,
    "ID": 126818,
    "UUID": "09FDAAE3-6C39-489B-BC49-77A6DAD40F7D",
    "DataProviderID": 1,
    "OperatorID": 3266,
    "UsageTypeID": 4,
    "UsageCost": "0.02€/min + 0.35€/kWh",
    "AddressInfo": {
        "ID": 127164,
        "Title": "Park & Ride Parkplatz Stöcken / Stadtbahnhaltestelle",
        "AddressLine1": "Mecklenheidestraße 123",
        "Town": "Hannover",
        "StateOrProvince": "Region Hannover",
        "Postcode": "30419",
        "CountryID": 87,
        "Latitude": 52.4149405556046,
        "Longitude": 9.6668632384027,
        "RelatedURL": "https://www.enercity.de/elektromobilitaet/ladesaeulen/index.html",
        "DistanceUnit": 0
    },
    "Connections": [
        {
            "ID": 177622,
            "ConnectionTypeID": 25,
            "StatusTypeID": 50,
            "LevelID": 2,
            "Amps": 32,
            "Voltage": 400,
            "PowerKW": 22,
            "CurrentTypeID": 20,
            "Quantity": 2
        }
    ],
    "NumberOfPoints": 2,
    "GeneralComments": "24/7 verfügbar; Freischaltung mit PlugSurfing App oder Keyhanger. Betreiber sind sind Stadtwerke EnerCity.",
    "StatusTypeID": 50,
    "DateLastStatusUpdate": "2019-05-20T06:44:00Z",
    "DataQualityLevel": 1,
    "DateCreated": "2019-05-20T06:44:00Z",
    "SubmissionStatusTypeID": 200
}