{
    "IsRecentlyVerified": false,
    "ID": 56779,
    "UUID": "3C798331-C0A7-421F-9BEA-954AF8A2C9EB",
    "DataProviderID": 1,
    "OperatorID": 45,
    "UsageTypeID": 3,
    "AddressInfo": {
        "ID": 57125,
        "Title": "Ladepunkt Strodehne",
        "AddressLine1": "Grossdorf 17",
        "Town": "Havelaue OT Strodehne",
        "StateOrProvince": "Rhinow",
        "Postcode": "14715",
        "CountryID": 87,
        "Latitude": 52.7581157,
        "Longitude": 12.227189100000032,
        "ContactTelephone1": "+49 33875 169001",
        "AccessComments": "Rund um die Uhr (24/7) nutzbar. Es kann entweder Typ2 (11 KW) oder CEE rot (11 KW) geladen werden Adapter können u.U. geliehen werden. Solarstrom vom eigenen Dach und Ökostrom der EWS. Bitte telefonisch anmelden, um den Schlüssel zu erhalten.. Umgebung:Spaziergang, Badestelle 500m, Dorfgaststätte (außer Di.) ",
        "RelatedURL": "http://www.stromtankstelle-strodehne.de",
        "DistanceUnit": 0
    },
    "Connections": [
        {
            "ID": 71619,
            "ConnectionTypeID": 25,
            "StatusTypeID": 50,
            "LevelID": 2,
            "Amps": 16,
            "Voltage": 400,
            "PowerKW": 11,
            "CurrentTypeID": 20,
            "Quantity": 1
        },
        {
            "ID": 71620,
            "ConnectionTypeID": 17,
            "StatusTypeID": 50,
            "LevelID": 2,
            "Amps": 16,
            "Voltage": 400,
            "PowerKW": 11,
            "CurrentTypeID": 20,
            "Quantity": 1
        }
    ],
    "NumberOfPoints": 2,
    "StatusTypeID": 50,
    "DateLastStatusUpdate": "2015-11-09T13:37:00Z",
    "DataQualityLevel": 1,
    "DateCreated": "2015-11-09T13:37:00Z",
    "SubmissionStatusTypeID": 200
}