{
    "IsRecentlyVerified": false,
    "ID": 179172,
    "UUID": "B4993E38-228B-4A88-B3AD-F83403967EBD",
    "DataProviderID": 29,
    "DataProvidersReference": "14434",
    "OperatorID": 127,
    "AddressInfo": {
        "ID": 179531,
        "Title": "Am Kiekeberg 1",
        "AddressLine1": "Am Kiekeberg 1",
        "Town": "Rosengarten",
        "Postcode": "21224",
        "CountryID": 87,
        "Latitude": 53.43976,
        "Longitude": 9.90381000000002,
        "DistanceUnit": 0
    },
    "Connections": [
        {
            "ID": 280615,
            "ConnectionTypeID": 25,
            "StatusTypeID": 50,
            "LevelID": 2,
            "PowerKW": 22,
            "CurrentTypeID": 20
        },
        {
            "ID": 280616,
            "ConnectionTypeID": 1036,
            "StatusTypeID": 50,
            "LevelID": 2,
            "PowerKW": 22,
            "CurrentTypeID": 20
        },
        {
            "ID": 301310,
            "ConnectionTypeID": 25,
            "StatusTypeID": 50,
            "LevelID": 2,
            "PowerKW": 22,
            "CurrentTypeID": 20
        }
    ],
    "StatusTypeID": 50,
    "DateLastStatusUpdate": "2021-07-12T02:51:00Z",
    "MetadataValues": [
        {
            "ID": 11466,
            "MetadataFieldID": 4,
            "ItemValue": "Data from the German chargepoint registry provided by Bundesnetzagentur.de under the CC-BY 4.0 license"
        }
    ],
    "DataQualityLevel": 3,
    "DateCreated": "2021-07-08T09:59:00Z",
    "SubmissionStatusTypeID": 100
}