{
    "IsRecentlyVerified": false,
    "ID": 129694,
    "UUID": "47BD5CE2-277D-410B-AE21-BBDEBD0A4AC3",
    "DataProviderID": 1,
    "OperatorID": 80,
    "UsageTypeID": 4,
    "AddressInfo": {
        "ID": 130040,
        "Title": "Catania Dante | EnelX",
        "AddressLine1": "Piazza Dante",
        "Town": "Catania",
        "StateOrProvince": "CT",
        "Postcode": "95100",
        "CountryID": 112,
        "Latitude": 37.50440931732784,
        "Longitude": 15.081210303506282,
        "RelatedURL": "https://www.enelx.com/it/it/mobilita-elettrica",
        "DistanceUnit": 0
    },
    "Connections": [
        {
            "ID": 181511,
            "ConnectionTypeID": 25,
            "StatusTypeID": 50,
            "LevelID": 2,
            "Amps": 32,
            "Voltage": 400,
            "PowerKW": 22,
            "CurrentTypeID": 20,
            "Quantity": 3
        },
        {
            "ID": 181512,
            "ConnectionTypeID": 36,
            "StatusTypeID": 50,
            "LevelID": 2,
            "Amps": 16,
            "Voltage": 240,
            "PowerKW": 3.7,
            "CurrentTypeID": 10,
            "Quantity": 1
        }
    ],
    "NumberOfPoints": 4,
    "StatusTypeID": 50,
    "DateLastStatusUpdate": "2019-07-23T15:42:00Z",
    "DataQualityLevel": 1,
    "DateCreated": "2019-07-23T15:42:00Z",
    "SubmissionStatusTypeID": 200
}