{
    "IsRecentlyVerified": false,
    "ID": 146159,
    "UUID": "EBDA44EF-1BCB-44DD-9F3D-7C3643BB4E39",
    "DataProviderID": 1,
    "OperatorID": 3315,
    "OperatorsReference": "52555",
    "UsageTypeID": 4,
    "UsageCost": "Free",
    "AddressInfo": {
        "ID": 146511,
        "Title": "West Calder Station",
        "AddressLine1": "Station Road",
        "Town": "near Livingston",
        "StateOrProvince": "West Lothian",
        "Postcode": "EH55 8BP",
        "CountryID": 1,
        "Latitude": 55.85365,
        "Longitude": -3.5668,
        "DistanceUnit": 0
    },
    "Connections": [
        {
            "ID": 203090,
            "ConnectionTypeID": 25,
            "StatusTypeID": 100,
            "LevelID": 2,
            "Amps": 16,
            "Voltage": 400,
            "PowerKW": 11,
            "CurrentTypeID": 20,
            "Quantity": 2
        }
    ],
    "NumberOfPoints": 2,
    "StatusTypeID": 100,
    "DateLastStatusUpdate": "2020-03-26T06:18:00Z",
    "DataQualityLevel": 1,
    "DateCreated": "2020-01-02T08:19:00Z",
    "SubmissionStatusTypeID": 200
}