{
    "IsRecentlyVerified": false,
    "ID": 121715,
    "UUID": "80C865D3-D856-481E-BDD8-848E2FDA2AC5",
    "DataProviderID": 2,
    "DataProvidersReference": "105274",
    "OperatorID": 5,
    "UsageTypeID": 1,
    "AddressInfo": {
        "ID": 122061,
        "Title": "HONDA",
        "AddressLine1": "1601 Dallas Pkwy",
        "Town": "Frisco",
        "StateOrProvince": "TX",
        "Postcode": "75034",
        "CountryID": 2,
        "Latitude": 33.092599,
        "Longitude": -96.824777,
        "ContactTelephone1": "888-758-4389",
        "AccessComments": "24 hours daily",
        "RelatedURL": "http://www.chargepoint.com/",
        "DistanceUnit": 0
    },
    "Connections": [
        {
            "ID": 171527,
            "ConnectionTypeID": 1,
            "LevelID": 2,
            "Amps": 16,
            "Voltage": 230,
            "PowerKW": 3.7,
            "CurrentTypeID": 10,
            "Quantity": 2
        }
    ],
    "DateLastStatusUpdate": "2020-06-26T02:55:00Z",
    "DataQualityLevel": 3,
    "DateCreated": "2019-04-06T05:02:00Z",
    "SubmissionStatusTypeID": 100
}