{
    "IsRecentlyVerified": false,
    "ID": 146247,
    "UUID": "46886926-C8B5-4267-AE84-21082EF58278",
    "DataProviderID": 1,
    "OperatorID": 1,
    "UsageTypeID": 6,
    "AddressInfo": {
        "ID": 146599,
        "Title": "Mjóstræti",
        "AddressLine1": "Mjóstræti",
        "AddressLine2": "Miðborg",
        "Town": "Reykjavíkurborg",
        "Postcode": "101",
        "CountryID": 105,
        "Latitude": 64.14892261592891,
        "Longitude": -21.942936994618435,
        "AccessComments": "Located within the paid carpark on the second floor.",
        "DistanceUnit": 0
    },
    "Connections": [
        {
            "ID": 203241,
            "ConnectionTypeID": 25,
            "StatusTypeID": 50,
            "LevelID": 2,
            "Quantity": 4
        }
    ],
    "NumberOfPoints": 4,
    "StatusTypeID": 50,
    "DateLastStatusUpdate": "2020-01-05T13:55:00Z",
    "DataQualityLevel": 1,
    "DateCreated": "2020-01-04T18:30:00Z",
    "SubmissionStatusTypeID": 200
}