{
    "IsRecentlyVerified": false,
    "ID": 103722,
    "UUID": "C7017A40-1F43-43E4-9851-F33B3CD4D859",
    "DataProviderID": 1,
    "OperatorID": 23,
    "OperatorsReference": "42664",
    "UsageTypeID": 4,
    "AddressInfo": {
        "ID": 104068,
        "Title": "Royal Cinemas",
        "AddressLine1": "5 Towne Center CT",
        "Town": "Pooler",
        "StateOrProvince": "Georgia",
        "Postcode": "31322",
        "CountryID": 2,
        "Latitude": 32.146895,
        "Longitude": -81.25244,
        "ContactTelephone1": "(912) 988-4025",
        "DistanceUnit": 0
    },
    "Connections": [
        {
            "ID": 146392,
            "ConnectionTypeID": 30,
            "StatusTypeID": 50,
            "LevelID": 2,
            "PowerKW": 13,
            "CurrentTypeID": 20,
            "Quantity": 3
        }
    ],
    "NumberOfPoints": 3,
    "GeneralComments": "3 Tesla Connectors, up to 13kW.Available for customers. Self park.",
    "StatusTypeID": 50,
    "DateLastStatusUpdate": "2018-05-05T05:59:00Z",
    "DataQualityLevel": 1,
    "DateCreated": "2018-05-05T05:59:00Z",
    "SubmissionStatusTypeID": 200
}