{
    "IsRecentlyVerified": false,
    "ID": 18644,
    "UUID": "F494512F-DF63-4C8A-83B0-3E4361CC1864",
    "DataProviderID": 15,
    "DataProvidersReference": "31981",
    "OperatorID": 5,
    "AddressInfo": {
        "ID": 18989,
        "Title": "5620-5720 198 St",
        "AddressLine1": "5620-5720 198 St",
        "Town": "Langley",
        "StateOrProvince": "British Columbia",
        "Postcode": "V3A 7C7",
        "CountryID": 44,
        "Latitude": 49.10579269,
        "Longitude": -122.6736238,
        "ContactTelephone1": "",
        "RelatedURL": "http://carstations.com/31981",
        "DistanceUnit": 0
    },
    "Connections": [
        {
            "ID": 18877,
            "ConnectionTypeID": 1,
            "Reference": "J1772",
            "LevelID": 2
        }
    ],
    "StatusTypeID": 0,
    "DateLastStatusUpdate": "2017-11-04T14:05:00Z",
    "DataQualityLevel": 2,
    "DateCreated": "2013-08-25T03:29:00Z",
    "SubmissionStatusTypeID": 200
}