{
    "IsRecentlyVerified": false,
    "ID": 136306,
    "UUID": "8A9777C8-6768-48EF-B0D9-94ED2FBB4477",
    "DataProviderID": 18,
    "DataProvidersReference": "3187cdf53c86b95f0028cbce8a03bb27",
    "OperatorID": 2244,
    "UsageTypeID": 5,
    "AddressInfo": {
        "ID": 136652,
        "Title": "Aldridge Road Villas",
        "AddressLine1": "Aldridge Road Villas",
        "Town": "London",
        "Postcode": "W11 1BW",
        "CountryID": 1,
        "Latitude": 51.519502,
        "Longitude": -0.200601,
        "AccessComments": "",
        "RelatedURL": "https://www.ubitricity.com",
        "DistanceUnit": 0
    },
    "Connections": [
        {
            "ID": 190743,
            "ConnectionTypeID": 25,
            "Reference": "suby1100002503",
            "StatusTypeID": 50,
            "LevelID": 2,
            "Amps": 16,
            "Voltage": 230,
            "PowerKW": 3.7,
            "CurrentTypeID": 10
        }
    ],
    "StatusTypeID": 0,
    "DateLastStatusUpdate": "2021-04-25T05:46:00Z",
    "MetadataValues": [
        {
            "ID": 6158,
            "MetadataFieldID": 4,
            "ItemValue": "Contains public sector information licensed under the Open Government Licence v2.0. http://www.nationalarchives.gov.uk/doc/open-government-licence/version/2/"
        }
    ],
    "DataQualityLevel": 3,
    "DateCreated": "2019-12-24T05:22:00Z",
    "SubmissionStatusTypeID": 100
}