{
    "IsRecentlyVerified": false,
    "ID": 57823,
    "UUID": "5D89CEC7-C3AE-4013-B70C-A7198A6B6A80",
    "DataProviderID": 1,
    "DataProvidersReference": "3168",
    "AddressInfo": {
        "ID": 58169,
        "Title": "SKF Göteborg",
        "AddressLine1": "Hornsgatan 1",
        "Town": "GÖTEBORG",
        "StateOrProvince": "VÄSTRA GÖTALAND",
        "Postcode": "41550",
        "CountryID": 216,
        "Latitude": 57.72805,
        "Longitude": 12.01344,
        "AccessComments": "Till höger om SKFs huvudentré",
        "DistanceUnit": 0
    },
    "Connections": [
        {
            "ID": 73286,
            "ConnectionTypeID": 0,
            "Reference": "1",
            "LevelID": 2,
            "Amps": 16,
            "Voltage": 230,
            "PowerKW": 3.7,
            "Comments": "Mode 1"
        },
        {
            "ID": 87882,
            "ConnectionTypeID": 0,
            "Reference": "2",
            "LevelID": 2,
            "Amps": 16,
            "Voltage": 230,
            "PowerKW": 3.7,
            "Comments": "Mode 1"
        }
    ],
    "NumberOfPoints": 2,
    "DateLastStatusUpdate": "2020-05-26T08:21:00Z",
    "DataQualityLevel": 2,
    "DateCreated": "2015-12-26T11:12:00Z",
    "SubmissionStatusTypeID": 100
}