{
    "IsRecentlyVerified": false,
    "ID": 137132,
    "UUID": "F81F2A8B-D009-4975-AEA4-D9A81A8CC8DD",
    "DataProviderID": 1,
    "DataProvidersReference": "LSB-00079",
    "OperatorID": 21,
    "UsageTypeID": 4,
    "UsageCost": "Mobi.E compatible card",
    "AddressInfo": {
        "ID": 137478,
        "Title": "LSB-00079",
        "AddressLine1": "Alameda das Linhas de Torres 187",
        "Town": "Lisboa",
        "Postcode": "1750-143",
        "CountryID": 180,
        "Latitude": 38.769167,
        "Longitude": -9.159167,
        "RelatedURL": "http://www.mobie.pt",
        "DistanceUnit": 0
    },
    "Connections": [
        {
            "ID": 191989,
            "ConnectionTypeID": 25,
            "StatusTypeID": 50,
            "LevelID": 2,
            "Amps": 32,
            "Voltage": 230,
            "PowerKW": 7.4,
            "CurrentTypeID": 10,
            "Quantity": 2
        }
    ],
    "NumberOfPoints": 2,
    "StatusTypeID": 50,
    "DateLastStatusUpdate": "2020-08-16T09:28:00Z",
    "DataQualityLevel": 3,
    "DateCreated": "2019-12-24T08:08:00Z",
    "SubmissionStatusTypeID": 100
}