{
    "UserComments": [
        {
            "ID": 20933,
            "ChargePointID": 118276,
            "CommentTypeID": 10,
            "UserName": "ForumElettrico.it",
            "RelatedURL": "https://www.forumelettrico.it/forum/colonnina-enelx-via-benedetto-croce-15-fermignano-t5067.html",
            "DateCreated": "2019-04-26T15:19:25.963Z",
            "User": {
                "ID": 11749,
                "Username": "ForumElettrico.it"
            },
            "CheckinStatusTypeID": 10
        }
    ],
    "MediaItems": [
        {
            "ID": 18175,
            "ChargePointID": 118276,
            "ItemURL": "https://s3-ap-southeast-2.amazonaws.com/openchargemap/images/IT/OCM118276/OCM-118276.orig.2019042615193976.jpg",
            "ItemThumbnailURL": "https://s3-ap-southeast-2.amazonaws.com/openchargemap/images/IT/OCM118276/OCM-118276.thmb.2019042615193976.jpg",
            "Comment": "",
            "IsEnabled": true,
            "IsVideo": false,
            "IsFeaturedItem": false,
            "IsExternalResource": false,
            "User": {
                "ID": 11749,
                "Username": "ForumElettrico.it"
            },
            "DateCreated": "2019-04-26T15:20:00Z"
        },
        {
            "ID": 18176,
            "ChargePointID": 118276,
            "ItemURL": "https://s3-ap-southeast-2.amazonaws.com/openchargemap/images/IT/OCM118276/OCM-118276.orig.2019042615194742.jpg",
            "ItemThumbnailURL": "https://s3-ap-southeast-2.amazonaws.com/openchargemap/images/IT/OCM118276/OCM-118276.thmb.2019042615194742.jpg",
            "Comment": "",
            "IsEnabled": true,
            "IsVideo": false,
            "IsFeaturedItem": false,
            "IsExternalResource": false,
            "User": {
                "ID": 11749,
                "Username": "ForumElettrico.it"
            },
            "DateCreated": "2019-04-26T15:20:00Z"
        },
        {
            "ID": 18177,
            "ChargePointID": 118276,
            "ItemURL": "https://s3-ap-southeast-2.amazonaws.com/openchargemap/images/IT/OCM118276/OCM-118276.orig.2019042615195432.jpg",
            "ItemThumbnailURL": "https://s3-ap-southeast-2.amazonaws.com/openchargemap/images/IT/OCM118276/OCM-118276.thmb.2019042615195432.jpg",
            "Comment": "",
            "IsEnabled": true,
            "IsVideo": false,
            "IsFeaturedItem": false,
            "IsExternalResource": false,
            "User": {
                "ID": 11749,
                "Username": "ForumElettrico.it"
            },
            "DateCreated": "2019-04-26T15:20:00Z"
        },
        {
            "ID": 18178,
            "ChargePointID": 118276,
            "ItemURL": "https://s3-ap-southeast-2.amazonaws.com/openchargemap/images/IT/OCM118276/OCM-118276.orig.2019042615200232.jpg",
            "ItemThumbnailURL": "https://s3-ap-southeast-2.amazonaws.com/openchargemap/images/IT/OCM118276/OCM-118276.thmb.2019042615200232.jpg",
            "Comment": "",
            "IsEnabled": true,
            "IsVideo": false,
            "IsFeaturedItem": false,
            "IsExternalResource": false,
            "User": {
                "ID": 11749,
                "Username": "ForumElettrico.it"
            },
            "DateCreated": "2019-04-26T15:20:00Z"
        }
    ],
    "IsRecentlyVerified": false,
    "ID": 118276,
    "UUID": "3948BCF8-B9A6-4E13-B1E4-841BDA3A501C",
    "DataProviderID": 1,
    "OperatorID": 80,
    "UsageTypeID": 4,
    "AddressInfo": {
        "ID": 118622,
        "Title": "Conad Fermignano | EnelX",
        "AddressLine1": "Via Benedetto Croce, 15",
        "Town": "Fermignano",
        "StateOrProvince": "PU",
        "Postcode": "61033",
        "CountryID": 112,
        "Latitude": 43.673496142049146,
        "Longitude": 12.647663066523137,
        "RelatedURL": "https://www.enelx.com/it/it/emobility",
        "DistanceUnit": 0
    },
    "Connections": [
        {
            "ID": 167351,
            "ConnectionTypeID": 25,
            "StatusTypeID": 50,
            "LevelID": 2,
            "Amps": 32,
            "Voltage": 400,
            "PowerKW": 22,
            "CurrentTypeID": 20,
            "Quantity": 1
        },
        {
            "ID": 167352,
            "ConnectionTypeID": 36,
            "StatusTypeID": 50,
            "LevelID": 2,
            "Amps": 16,
            "Voltage": 240,
            "PowerKW": 3.7,
            "CurrentTypeID": 10,
            "Quantity": 1
        }
    ],
    "NumberOfPoints": 2,
    "StatusTypeID": 50,
    "DateLastStatusUpdate": "2019-04-26T15:20:00Z",
    "DataQualityLevel": 1,
    "DateCreated": "2019-03-20T17:34:00Z",
    "SubmissionStatusTypeID": 200
}