{
    "IsRecentlyVerified": false,
    "ID": 121613,
    "UUID": "6A437326-2E5E-4CCB-98DC-885F49558F93",
    "DataProviderID": 2,
    "DataProvidersReference": "121178",
    "OperatorID": 3318,
    "UsageTypeID": 1,
    "AddressInfo": {
        "ID": 121959,
        "Title": "Walmart 361 Collinsville",
        "AddressLine1": "1040 Collinsville Crossing Blvd",
        "Town": "Collinsville",
        "StateOrProvince": "IL",
        "Postcode": "62234",
        "CountryID": 2,
        "Latitude": 38.6757463,
        "Longitude": -90.0175845,
        "ContactTelephone1": "833-632-2778",
        "AccessComments": "24 hours daily",
        "RelatedURL": "https://www.electrifyamerica.com/",
        "DistanceUnit": 0
    },
    "Connections": [
        {
            "ID": 171378,
            "ConnectionTypeID": 2,
            "LevelID": 2,
            "Amps": 100,
            "Voltage": 400,
            "PowerKW": 40,
            "CurrentTypeID": 10,
            "Quantity": 1
        },
        {
            "ID": 171379,
            "ConnectionTypeID": 32,
            "LevelID": 2,
            "Amps": 100,
            "Voltage": 400,
            "PowerKW": 40,
            "CurrentTypeID": 10,
            "Quantity": 1
        }
    ],
    "DateLastStatusUpdate": "2019-04-06T04:01:00Z",
    "DataQualityLevel": 3,
    "DateCreated": "2019-04-06T04:01:00Z",
    "SubmissionStatusTypeID": 100
}