{
    "IsRecentlyVerified": false,
    "ID": 187423,
    "UUID": "F2E42CA7-B39E-4B7E-BB87-6321953C82F9",
    "DataProviderID": 18,
    "DataProvidersReference": "3789e287804a11ddc7414eebf690ef65",
    "OperatorID": 2244,
    "UsageTypeID": 5,
    "AddressInfo": {
        "ID": 187782,
        "Title": "1 Clive Road",
        "AddressLine1": "1 Clive Road",
        "Town": "London",
        "Postcode": "TW1 4SQ",
        "CountryID": 1,
        "Latitude": -0.33072,
        "Longitude": 51.43517,
        "AccessComments": "",
        "RelatedURL": "https://www.ubitricity.com",
        "DistanceUnit": 0
    },
    "Connections": [
        {
            "ID": 302557,
            "ConnectionTypeID": 25,
            "Reference": "suby1100005416",
            "StatusTypeID": 50,
            "LevelID": 2,
            "Amps": 16,
            "Voltage": 230,
            "PowerKW": 3.7,
            "CurrentTypeID": 10
        }
    ],
    "StatusTypeID": 0,
    "DateLastStatusUpdate": "2021-07-12T03:38:00Z",
    "MetadataValues": [
        {
            "ID": 19663,
            "MetadataFieldID": 4,
            "ItemValue": "Contains public sector information licensed under the Open Government Licence v2.0. http://www.nationalarchives.gov.uk/doc/open-government-licence/version/2/"
        }
    ],
    "DataQualityLevel": 3,
    "DateCreated": "2021-07-12T03:38:00Z",
    "SubmissionStatusTypeID": 100
}