{
    "IsRecentlyVerified": false,
    "ID": 27306,
    "UUID": "941FA22F-E957-4C63-8C70-03C9847F3420",
    "DataProviderID": 2,
    "DataProvidersReference": "61508",
    "OperatorID": 5,
    "UsageTypeID": 1,
    "AddressInfo": {
        "ID": 27652,
        "Title": "MGM RESORTS INT",
        "AddressLine1": "3720 Las Vegas Strip",
        "Town": "Las Vegas",
        "StateOrProvince": "NV",
        "Postcode": "89158",
        "CountryID": 2,
        "Latitude": 36.1087909,
        "Longitude": -115.1735401,
        "ContactTelephone1": "888-758-4389",
        "AccessComments": "24 hours daily",
        "RelatedURL": "http://www.chargepoint.com/",
        "DistanceUnit": 0
    },
    "Connections": [
        {
            "ID": 29909,
            "ConnectionTypeID": 1,
            "LevelID": 2,
            "Amps": 16,
            "Voltage": 230,
            "PowerKW": 3,
            "CurrentTypeID": 10,
            "Quantity": 2
        }
    ],
    "DateLastStatusUpdate": "2019-04-06T04:02:00Z",
    "DataQualityLevel": 3,
    "DateCreated": "2014-11-28T03:37:00Z",
    "SubmissionStatusTypeID": 100
}