{
    "IsRecentlyVerified": false,
    "ID": 17890,
    "UUID": "C29FB792-D8DD-485A-B133-8F98627E5F9F",
    "DataProviderID": 22,
    "DataProvidersReference": "0059745D4A01D8CFDC42D82CBA64717F",
    "AddressInfo": {
        "ID": 18235,
        "Title": "三菱自動車工業パワートレイン製作所滋賀工場",
        "AddressLine1": "滋賀県湖南市小砂町2-1",
        "CountryID": 114,
        "Latitude": 35.00495237,
        "Longitude": 136.1307625,
        "ContactTelephone1": "0748-75-3131",
        "DistanceUnit": 0
    },
    "Connections": [
        {
            "ID": 18131,
            "ConnectionTypeID": 2,
            "LevelID": 2,
            "Amps": 100,
            "Voltage": 480,
            "PowerKW": 48,
            "Quantity": 1
        }
    ],
    "DateLastStatusUpdate": "2013-06-29T09:04:00Z",
    "DataQualityLevel": 2,
    "DateCreated": "2013-06-29T09:04:00Z",
    "SubmissionStatusTypeID": 200
}