{
    "IsRecentlyVerified": false,
    "ID": 144896,
    "UUID": "56C60A93-0EA1-4447-901C-03C1B3403EEA",
    "DataProviderID": 2,
    "DataProvidersReference": "130959",
    "OperatorID": 90,
    "UsageTypeID": 1,
    "AddressInfo": {
        "ID": 145248,
        "Title": "Académie Lafontaine",
        "AddressLine1": "2171 Boulevard Maurice",
        "Town": "Saint-Jérôme",
        "StateOrProvince": "QC",
        "Postcode": "J5K 1E5",
        "CountryID": 44,
        "Latitude": 45.803683,
        "Longitude": -74.007809,
        "ContactTelephone1": "877-505-2674",
        "AccessComments": "24 hours daily",
        "RelatedURL": "https://lecircuitelectrique.com/",
        "DistanceUnit": 0
    },
    "Connections": [
        {
            "ID": 201446,
            "ConnectionTypeID": 1,
            "LevelID": 2,
            "Amps": 16,
            "Voltage": 230,
            "PowerKW": 3.7,
            "CurrentTypeID": 10,
            "Quantity": 2
        }
    ],
    "StatusTypeID": 50,
    "DateLastStatusUpdate": "2020-06-26T03:09:00Z",
    "DataQualityLevel": 3,
    "DateCreated": "2019-12-24T09:23:00Z",
    "SubmissionStatusTypeID": 100
}