{
    "IsRecentlyVerified": false,
    "ID": 14173,
    "UUID": "803184AF-F7C3-4051-8330-9C6EB31ECFA1",
    "DataProviderID": 2,
    "DataProvidersReference": "45830",
    "UsageTypeID": 7,
    "AddressInfo": {
        "ID": 14070,
        "Title": "Cannon Nissan",
        "AddressLine1": "69900 Highway 82 W",
        "Town": "Greenwood",
        "StateOrProvince": "MS",
        "Postcode": "38930",
        "CountryID": 2,
        "Latitude": 33.525183,
        "Longitude": -90.207653,
        "ContactTelephone1": "662-453-4211",
        "AccessComments": "Dealership business hours\r\nPublic - Call ahead",
        "RelatedURL": "",
        "DistanceUnit": 0
    },
    "Connections": [
        {
            "ID": 16481,
            "ConnectionTypeID": 1,
            "LevelID": 2,
            "Amps": 16,
            "Voltage": 230,
            "PowerKW": 3.7,
            "CurrentTypeID": 10,
            "Quantity": 1
        },
        {
            "ID": 21567,
            "ConnectionTypeID": 1,
            "LevelID": 2,
            "Quantity": 1
        }
    ],
    "DateLastStatusUpdate": "2020-06-26T02:55:00Z",
    "DataQualityLevel": 3,
    "DateCreated": "2012-12-06T16:49:00Z",
    "SubmissionStatusTypeID": 100
}