{
    "IsRecentlyVerified": false,
    "ID": 115507,
    "UUID": "22BF4290-C8AB-479E-BE19-7719EA4F9605",
    "DataProviderID": 2,
    "DataProvidersReference": "112816",
    "OperatorID": 23,
    "UsageTypeID": 1,
    "AddressInfo": {
        "ID": 115853,
        "Title": "Mariposa - Latin Inspired Grill - Tesla Destination",
        "AddressLine1": "700 W Highway 89A",
        "Town": "Sedona",
        "StateOrProvince": "AZ",
        "Postcode": "86336",
        "CountryID": 2,
        "Latitude": 34.865888,
        "Longitude": -111.767824,
        "ContactTelephone1": "928-862-4444  877-798-3752",
        "AccessComments": "24 hours daily; for Tesla use only; for customer use only",
        "RelatedURL": "https://www.tesla.com/destination-charging",
        "DistanceUnit": 0
    },
    "Connections": [
        {
            "ID": 162522,
            "ConnectionTypeID": 0,
            "LevelID": 2,
            "Amps": 16,
            "Voltage": 230,
            "PowerKW": 3,
            "CurrentTypeID": 10,
            "Quantity": 1
        }
    ],
    "DateLastStatusUpdate": "2019-04-06T04:02:00Z",
    "DataQualityLevel": 3,
    "DateCreated": "2019-02-11T07:13:00Z",
    "SubmissionStatusTypeID": 100
}