{
    "IsRecentlyVerified": false,
    "ID": 160325,
    "UUID": "79DEBE5E-9040-466A-8C4F-1FFD7B956453",
    "DataProviderID": 2,
    "DataProvidersReference": "163547",
    "OperatorID": 5,
    "UsageTypeID": 1,
    "AddressInfo": {
        "ID": 160682,
        "Title": "SHOREVIEW",
        "AddressLine1": "4600 Victoria St N",
        "Town": "Shoreview",
        "StateOrProvince": "MN",
        "Postcode": "55126",
        "CountryID": 2,
        "Latitude": 45.080447,
        "Longitude": -93.132429,
        "ContactTelephone1": "888-758-4389",
        "AccessComments": "24 hours daily",
        "RelatedURL": "http://www.chargepoint.com/",
        "DistanceUnit": 0
    },
    "Connections": [
        {
            "ID": 230677,
            "ConnectionTypeID": 1,
            "LevelID": 2,
            "Amps": 16,
            "Voltage": 230,
            "PowerKW": 3.7,
            "CurrentTypeID": 10,
            "Quantity": 4
        }
    ],
    "StatusTypeID": 50,
    "DateLastStatusUpdate": "2020-06-26T03:08:00Z",
    "DataQualityLevel": 3,
    "DateCreated": "2020-06-26T03:08:00Z",
    "SubmissionStatusTypeID": 100
}