{
    "IsRecentlyVerified": false,
    "ID": 99682,
    "UUID": "83B87249-4A73-4678-AD77-9B7BAD6F38CB",
    "DataProviderID": 1,
    "OperatorID": 23,
    "OperatorsReference": "40198",
    "UsageTypeID": 4,
    "AddressInfo": {
        "ID": 100028,
        "Title": "De Woeste Wieven - Boutique & Conference Hotel",
        "AddressLine1": "Deldensestraat 11",
        "Town": "Diepenheim",
        "Postcode": "7478pg",
        "CountryID": 159,
        "Latitude": 52.175972,
        "Longitude": 6.614891,
        "ContactTelephone1": "+31 620848424",
        "DistanceUnit": 0
    },
    "Connections": [
        {
            "ID": 140827,
            "ConnectionTypeID": 30,
            "StatusTypeID": 50,
            "LevelID": 2,
            "Amps": 32,
            "Voltage": 400,
            "PowerKW": 22,
            "CurrentTypeID": 20,
            "Quantity": 2
        }
    ],
    "NumberOfPoints": 2,
    "GeneralComments": "2 Tesla Connectors, up to 22kW.Available for customers. Please call ahead.",
    "StatusTypeID": 50,
    "DateLastStatusUpdate": "2018-10-03T16:26:00Z",
    "DataQualityLevel": 1,
    "DateCreated": "2018-02-01T07:10:00Z",
    "SubmissionStatusTypeID": 200
}