{
    "IsRecentlyVerified": false,
    "ID": 91210,
    "UUID": "6DD2C641-E522-4CCD-A9C5-7D09D3221863",
    "DataProviderID": 1,
    "OperatorID": 23,
    "OperatorsReference": "32516",
    "UsageTypeID": 4,
    "AddressInfo": {
        "ID": 91556,
        "Title": "Gamla Uppsala Museum",
        "AddressLine1": "Disavägen",
        "Town": "Uppsala",
        "Postcode": "754 40",
        "CountryID": 216,
        "Latitude": 59.897916,
        "Longitude": 17.634001,
        "ContactTelephone1": "+46 (0) 704153732",
        "DistanceUnit": 0
    },
    "Connections": [
        {
            "ID": 129341,
            "ConnectionTypeID": 30,
            "StatusTypeID": 50,
            "LevelID": 2,
            "Amps": 32,
            "Voltage": 230,
            "PowerKW": 14,
            "CurrentTypeID": 20,
            "Quantity": 2
        }
    ],
    "NumberOfPoints": 2,
    "GeneralComments": "2 Tesla Connectors, up to 14kW.Available to the public. Self park.",
    "StatusTypeID": 50,
    "DateLastStatusUpdate": "2018-10-03T18:28:00Z",
    "DataQualityLevel": 1,
    "DateCreated": "2017-08-02T05:33:00Z",
    "SubmissionStatusTypeID": 200
}