{
    "IsRecentlyVerified": false,
    "ID": 52851,
    "UUID": "DD089F84-CD4D-4B8F-A722-915AFE0725B3",
    "DataProviderID": 1,
    "OperatorID": 155,
    "UsageTypeID": 4,
    "UsageCost": "0",
    "AddressInfo": {
        "ID": 53197,
        "Title": "Ostplatz",
        "AddressLine1": "Ostplatz 5",
        "AddressLine2": "Reudnitz-Thonberg",
        "Town": "Leipzig",
        "StateOrProvince": "Leipzig",
        "Postcode": "04317",
        "CountryID": 87,
        "Latitude": 51.33257,
        "Longitude": 12.39566,
        "ContactTelephone1": "Tel: +49 341 121-6404",
        "AccessComments": "24/7 nutzbar, Zugang mit Ladekarte der Stadtwerke Leipzig, PlugSurfing Keyhanger, Stromticket \"easyGo\" App oder mit Webseite intercharge direct.\r\n",
        "RelatedURL": "https://www.l.de/gruppe/wir-fuer-leipzig/elektromobilitaet",
        "DistanceUnit": 0
    },
    "Connections": [
        {
            "ID": 65775,
            "ConnectionTypeID": 25,
            "StatusTypeID": 50,
            "LevelID": 2,
            "Amps": 16,
            "Voltage": 400,
            "PowerKW": 11,
            "CurrentTypeID": 20,
            "Quantity": 2
        }
    ],
    "NumberOfPoints": 2,
    "StatusTypeID": 50,
    "DateLastStatusUpdate": "2016-05-23T08:09:00Z",
    "DataQualityLevel": 1,
    "DateCreated": "2015-09-13T08:48:00Z",
    "SubmissionStatusTypeID": 200
}