{
    "MediaItems": [
        {
            "ID": 20148,
            "ChargePointID": 133854,
            "ItemURL": "https://s3-ap-southeast-2.amazonaws.com/openchargemap/images/CA/OCM133854/OCM-133854.orig.2019102823265582.jpg",
            "ItemThumbnailURL": "https://s3-ap-southeast-2.amazonaws.com/openchargemap/images/CA/OCM133854/OCM-133854.thmb.2019102823265582.jpg",
            "Comment": "BC Hydro Open anouncement",
            "IsEnabled": true,
            "IsVideo": false,
            "IsFeaturedItem": false,
            "IsExternalResource": false,
            "User": {
                "ID": 22855,
                "Username": "bert hogendoorn "
            },
            "DateCreated": "2019-10-28T23:27:00Z"
        }
    ],
    "IsRecentlyVerified": false,
    "ID": 133854,
    "UUID": "E8FCD110-B538-43DE-AD73-8F0B97ABE258",
    "DataProviderID": 1,
    "OperatorID": 1,
    "UsageTypeID": 1,
    "AddressInfo": {
        "ID": 134200,
        "Title": "Valemount Centennial Park CCS/SAE, CHAdeMO",
        "AddressLine1": "1300 5 Ave, ",
        "Town": "Valemount",
        "StateOrProvince": "BC",
        "CountryID": 44,
        "Latitude": 52.833753189588,
        "Longitude": -119.269140324228,
        "AccessComments": "BC Hydro dual-standard fast charger (one vehicle at a time) located off Dogwood Street, near 4th Avenue.\r\n",
        "DistanceUnit": 0
    },
    "Connections": [
        {
            "ID": 187319,
            "ConnectionTypeID": 2,
            "StatusTypeID": 50,
            "LevelID": 3,
            "Voltage": 400,
            "PowerKW": 50,
            "CurrentTypeID": 30,
            "Quantity": 1
        },
        {
            "ID": 187320,
            "ConnectionTypeID": 32,
            "StatusTypeID": 50,
            "LevelID": 3,
            "Voltage": 400,
            "PowerKW": 50,
            "CurrentTypeID": 30,
            "Quantity": 1
        }
    ],
    "NumberOfPoints": 1,
    "GeneralComments": "The fast charger can be activated by the BC Hydro EV app, RFID card or by calling BC Hydro at 1 866 338-3369. Flo app/Card and ChargePoint app also supported.",
    "StatusTypeID": 50,
    "DateLastStatusUpdate": "2019-11-02T08:31:00Z",
    "DataQualityLevel": 1,
    "DateCreated": "2019-10-28T22:45:00Z",
    "SubmissionStatusTypeID": 200
}