{
    "IsRecentlyVerified": false,
    "ID": 9208,
    "UUID": "859E4073-2BA7-4E5C-BB1F-BDA222763E51",
    "DataProviderID": 15,
    "DataProvidersReference": "13425",
    "OperatorID": 5,
    "AddressInfo": {
        "ID": 9105,
        "Title": "152 SW Cascade Avenue",
        "AddressLine1": "152 SW Cascade Avenue",
        "Town": "Stevenson",
        "StateOrProvince": "Washington",
        "Postcode": "98648",
        "CountryID": 2,
        "Latitude": 45.69189835,
        "Longitude": -121.8830032,
        "ContactTelephone1": "",
        "RelatedURL": "http://carstations.com/13425",
        "DistanceUnit": 0
    },
    "Connections": [
        {
            "ID": 6889,
            "ConnectionTypeID": 1,
            "Reference": "J1772",
            "LevelID": 2
        },
        {
            "ID": 7059,
            "ConnectionTypeID": 9,
            "Reference": "NEMA5",
            "LevelID": 1,
            "Quantity": 1
        }
    ],
    "StatusTypeID": 0,
    "DateLastStatusUpdate": "2017-11-04T14:05:00Z",
    "DataQualityLevel": 2,
    "DateCreated": "2012-01-23T15:12:00Z",
    "SubmissionStatusTypeID": 100
}