{
    "IsRecentlyVerified": false,
    "ID": 109341,
    "UUID": "8BB0024B-F722-401B-86D3-F8D5B2DF0E61",
    "DataProviderID": 1,
    "OperatorID": 23,
    "OperatorsReference": "44786",
    "UsageTypeID": 4,
    "AddressInfo": {
        "ID": 109687,
        "Title": "Hilton Garden Inn Minneapolis Eagan",
        "AddressLine1": "1975 Rahncliff CT",
        "Town": "Eagan",
        "StateOrProvince": "Minnesota",
        "Postcode": "55122",
        "CountryID": 2,
        "Latitude": 44.788633,
        "Longitude": -93.206451,
        "ContactTelephone1": "(651) 686-4605",
        "DistanceUnit": 0
    },
    "Connections": [
        {
            "ID": 154459,
            "ConnectionTypeID": 30,
            "StatusTypeID": 50,
            "LevelID": 2,
            "PowerKW": 16,
            "CurrentTypeID": 20,
            "Quantity": 3
        }
    ],
    "NumberOfPoints": 3,
    "GeneralComments": "3 Tesla Connectors, up to 16kW.Available for customers. Self park.",
    "StatusTypeID": 50,
    "DateLastStatusUpdate": "2018-10-11T14:28:00Z",
    "DataQualityLevel": 1,
    "DateCreated": "2018-10-11T14:28:00Z",
    "SubmissionStatusTypeID": 200
}