{
    "IsRecentlyVerified": false,
    "ID": 150320,
    "UUID": "E19F6B9D-5ACE-459E-99A5-C561B305DD17",
    "DataProviderID": 28,
    "DataProvidersReference": "FR*S83*P83123*B",
    "UsageTypeID": 5,
    "AddressInfo": {
        "ID": 150673,
        "Title": "SANARY SUR MER_71 Boulevard George Clemenceau",
        "AddressLine1": "71 Boulevard George Clemenceau 83110 SANARY SUR MER",
        "CountryID": 80,
        "Latitude": 43.117049,
        "Longitude": 5.806379,
        "AccessComments": "24/24 7/7 jours",
        "DistanceUnit": 0
    },
    "Connections": [
        {
            "ID": 208904,
            "ConnectionTypeID": 28,
            "StatusTypeID": 50,
            "LevelID": 2,
            "PowerKW": 22,
            "CurrentTypeID": 10
        },
        {
            "ID": 208905,
            "ConnectionTypeID": 1036,
            "StatusTypeID": 50,
            "LevelID": 2,
            "PowerKW": 22,
            "CurrentTypeID": 20
        },
        {
            "ID": 237523,
            "ConnectionTypeID": 28,
            "StatusTypeID": 50,
            "LevelID": 2,
            "PowerKW": 22,
            "CurrentTypeID": 10
        },
        {
            "ID": 237524,
            "ConnectionTypeID": 1036,
            "StatusTypeID": 50,
            "LevelID": 2,
            "PowerKW": 22,
            "CurrentTypeID": 20
        }
    ],
    "GeneralComments": "",
    "StatusTypeID": 50,
    "DateLastStatusUpdate": "2020-08-27T05:10:00Z",
    "DataQualityLevel": 2,
    "DateCreated": "2020-03-15T06:17:00Z",
    "SubmissionStatusTypeID": 100
}