{
    "IsRecentlyVerified": false,
    "ID": 102867,
    "UUID": "D66AE234-DFA5-48A5-8F8A-168A3B0ABCAC",
    "DataProviderID": 2,
    "DataProvidersReference": "94870",
    "OperatorID": 3372,
    "UsageTypeID": 1,
    "AddressInfo": {
        "ID": 103213,
        "Title": "City of Yonkers",
        "AddressLine1": "40 S Broadway",
        "Town": "Yonkers",
        "StateOrProvince": "NY",
        "Postcode": "10701",
        "CountryID": 2,
        "Latitude": 40.932276,
        "Longitude": -73.897606,
        "ContactTelephone1": "866-816-7584",
        "AccessComments": "24 hours daily",
        "RelatedURL": "http://evconnect.com/",
        "DistanceUnit": 0
    },
    "Connections": [
        {
            "ID": 145009,
            "ConnectionTypeID": 1,
            "LevelID": 2,
            "Amps": 16,
            "Voltage": 230,
            "PowerKW": 3.7,
            "CurrentTypeID": 10,
            "Quantity": 3
        }
    ],
    "DateLastStatusUpdate": "2020-06-26T03:03:00Z",
    "DataQualityLevel": 3,
    "DateCreated": "2018-04-21T04:13:00Z",
    "SubmissionStatusTypeID": 100
}