{
    "IsRecentlyVerified": false,
    "ID": 160543,
    "UUID": "5AD42CD3-0B8E-4781-9432-7F1F9124CCB5",
    "DataProviderID": 2,
    "DataProvidersReference": "163519",
    "OperatorID": 5,
    "UsageTypeID": 1,
    "AddressInfo": {
        "ID": 160900,
        "Title": "MOTORPOOL",
        "AddressLine1": "103 Sid Snyder Ave SW",
        "Town": "Olympia",
        "StateOrProvince": "WA",
        "Postcode": "98501",
        "CountryID": 2,
        "Latitude": 47.03505,
        "Longitude": -122.901843,
        "ContactTelephone1": "888-758-4389",
        "AccessComments": "24 hours daily",
        "RelatedURL": "http://www.chargepoint.com/",
        "DistanceUnit": 0
    },
    "Connections": [
        {
            "ID": 231002,
            "ConnectionTypeID": 1,
            "LevelID": 2,
            "Amps": 16,
            "Voltage": 230,
            "PowerKW": 3.7,
            "CurrentTypeID": 10,
            "Quantity": 4
        }
    ],
    "StatusTypeID": 50,
    "DateLastStatusUpdate": "2020-06-26T03:10:00Z",
    "DataQualityLevel": 3,
    "DateCreated": "2020-06-26T03:10:00Z",
    "SubmissionStatusTypeID": 100
}