{
    "IsRecentlyVerified": false,
    "ID": 63058,
    "UUID": "CD63B9A1-A9EF-47BB-976A-F0986E6A32E5",
    "DataProviderID": 26,
    "DataProvidersReference": "77842",
    "OperatorID": 73,
    "OperatorsReference": "EV-Box EVB-P1541657",
    "UsageCost": "0.00 jaarabonnement",
    "AddressInfo": {
        "ID": 63404,
        "Title": "Romeinenweg 47",
        "AddressLine1": "Romeinenweg 47",
        "Town": "Oss",
        "Postcode": "5349 AL",
        "CountryID": 159,
        "Latitude": 51.75844,
        "Longitude": 5.55131,
        "RelatedURL": "http://www.ev-box.nl",
        "DistanceUnit": 0
    },
    "Connections": [
        {
            "ID": 80175,
            "ConnectionTypeID": 25,
            "LevelID": 2,
            "PowerKW": 11,
            "CurrentTypeID": 10
        }
    ],
    "NumberOfPoints": 1,
    "StatusTypeID": 50,
    "DateLastStatusUpdate": "2016-06-04T02:40:00Z",
    "DataQualityLevel": 3,
    "DateCreated": "2016-03-03T12:29:00Z",
    "SubmissionStatusTypeID": 100
}