{
    "IsRecentlyVerified": false,
    "ID": 73068,
    "UUID": "DFF79058-38BD-44F4-9A6B-66B61BB6F86A",
    "DataProviderID": 1,
    "OperatorID": 25,
    "OperatorsReference": "hounslow-strandongreen",
    "UsageTypeID": 4,
    "UsageCost": "£0.059/minute; min £1.18; other tariffs available",
    "AddressInfo": {
        "ID": 73414,
        "Title": "Strand on Green",
        "AddressLine1": "Strand on Green",
        "Town": "London",
        "StateOrProvince": "England",
        "Postcode": "W4 3NQ",
        "CountryID": 1,
        "Latitude": 51.4880175,
        "Longitude": -0.2868412,
        "DistanceUnit": 0
    },
    "Connections": [
        {
            "ID": 105022,
            "ConnectionTypeID": 25,
            "StatusTypeID": 50,
            "LevelID": 2,
            "Amps": 32,
            "Voltage": 230,
            "PowerKW": 7,
            "CurrentTypeID": 10,
            "Quantity": 3
        },
        {
            "ID": 105023,
            "ConnectionTypeID": 1,
            "StatusTypeID": 50,
            "LevelID": 2,
            "Amps": 16,
            "Voltage": 230,
            "PowerKW": 4,
            "CurrentTypeID": 10,
            "Quantity": 3
        }
    ],
    "NumberOfPoints": 3,
    "StatusTypeID": 50,
    "DateLastStatusUpdate": "2017-08-15T05:22:00Z",
    "DataQualityLevel": 1,
    "DateCreated": "2016-11-03T16:13:00Z",
    "SubmissionStatusTypeID": 200
}