{
    "IsRecentlyVerified": false,
    "ID": 144140,
    "UUID": "080DF625-5275-483E-BB14-FE5814E207A4",
    "DataProviderID": 2,
    "DataProvidersReference": "129648",
    "OperatorID": 89,
    "UsageTypeID": 1,
    "AddressInfo": {
        "ID": 144492,
        "Title": "Sherbrooke",
        "AddressLine1": "2144 Rue King ouest",
        "Town": "Sherbrooke",
        "StateOrProvince": "QC",
        "Postcode": "J1J 2E8",
        "CountryID": 44,
        "Latitude": 45.397723,
        "Longitude": -71.925803,
        "ContactTelephone1": "888-356-8911",
        "AccessComments": "24 hours daily",
        "RelatedURL": "https://flo.ca/",
        "DistanceUnit": 0
    },
    "Connections": [
        {
            "ID": 200620,
            "ConnectionTypeID": 1,
            "LevelID": 2,
            "Amps": 16,
            "Voltage": 230,
            "PowerKW": 3.7,
            "CurrentTypeID": 10,
            "Quantity": 2
        }
    ],
    "StatusTypeID": 50,
    "DateLastStatusUpdate": "2020-06-26T03:09:00Z",
    "DataQualityLevel": 3,
    "DateCreated": "2019-12-24T09:23:00Z",
    "SubmissionStatusTypeID": 100
}