{
    "IsRecentlyVerified": false,
    "ID": 103611,
    "UUID": "1401E7EA-C851-49C3-9C67-5DE6B0295403",
    "DataProviderID": 1,
    "OperatorID": 1,
    "UsageTypeID": 1,
    "AddressInfo": {
        "ID": 103957,
        "Title": "Ather Grid Point - Chapter One",
        "AddressLine1": "New BEL Road",
        "AddressLine2": "Aramane Nagara Ward",
        "Town": "Bengaluru",
        "StateOrProvince": "Bangalore Urban",
        "Postcode": "560094",
        "CountryID": 106,
        "Latitude": 13.0323019,
        "Longitude": 77.5697127,
        "DistanceUnit": 0
    },
    "Connections": [
        {
            "ID": 146278,
            "ConnectionTypeID": 0,
            "StatusTypeID": 50,
            "LevelID": 2,
            "Amps": 16,
            "Voltage": 270,
            "PowerKW": 3,
            "CurrentTypeID": 10,
            "Quantity": 1
        }
    ],
    "NumberOfPoints": 1,
    "StatusTypeID": 50,
    "DateLastStatusUpdate": "2018-05-11T11:05:00Z",
    "DataQualityLevel": 1,
    "DateCreated": "2018-05-04T08:38:00Z",
    "SubmissionStatusTypeID": 200
}