{
    "IsRecentlyVerified": false,
    "ID": 141697,
    "UUID": "B33AA5D3-3ABC-4207-A516-FDBDC6116B63",
    "DataProviderID": 2,
    "DataProvidersReference": "87593",
    "OperatorID": 5,
    "UsageTypeID": 1,
    "AddressInfo": {
        "ID": 142049,
        "Title": "EVERGY",
        "AddressLine1": "2521 Glenn Hendren Dr @ Liberty Hospital",
        "Town": "Liberty",
        "StateOrProvince": "MO",
        "Postcode": "64068",
        "CountryID": 2,
        "Latitude": 39.275331,
        "Longitude": -94.424933,
        "ContactTelephone1": "888-758-4389",
        "AccessComments": "24 hours daily",
        "RelatedURL": "http://www.chargepoint.com/",
        "DistanceUnit": 0
    },
    "Connections": [
        {
            "ID": 197687,
            "ConnectionTypeID": 1,
            "LevelID": 2,
            "Amps": 16,
            "Voltage": 230,
            "PowerKW": 3.7,
            "CurrentTypeID": 10,
            "Quantity": 6
        }
    ],
    "StatusTypeID": 50,
    "DateLastStatusUpdate": "2020-06-26T03:01:00Z",
    "DataQualityLevel": 3,
    "DateCreated": "2019-12-24T09:16:00Z",
    "SubmissionStatusTypeID": 100
}