{
    "IsRecentlyVerified": false,
    "ID": 19932,
    "UUID": "B00EECEC-948B-40C5-95E1-DA2C7902BF2E",
    "DataProviderID": 1,
    "OperatorID": 1,
    "UsageTypeID": 0,
    "UsageCost": "",
    "AddressInfo": {
        "ID": 20277,
        "Title": "  Leclerc Vern / Val d'Orson",
        "AddressLine1": "3 Rue Orson",
        "AddressLine2": "",
        "Town": "",
        "StateOrProvince": "VERN-SUR-SEICHE",
        "Postcode": "35770",
        "CountryID": 80,
        "Latitude": 48.06382,
        "Longitude": -1.6223,
        "ContactTelephone1": "",
        "ContactTelephone2": "",
        "ContactEmail": "",
        "AccessComments": "",
        "RelatedURL": "",
        "DistanceUnit": 0
    },
    "Connections": [],
    "GeneralComments": "",
    "StatusTypeID": 50,
    "DateLastStatusUpdate": "2013-10-22T16:56:00Z",
    "DataQualityLevel": 1,
    "DateCreated": "2013-10-22T08:06:00Z",
    "SubmissionStatusTypeID": 200
}