{
    "IsRecentlyVerified": false,
    "ID": 45589,
    "UUID": "AA94AB38-AD9C-45EE-82C8-5F0942241166",
    "DataProviderID": 1,
    "DataProvidersReference": "2441",
    "AddressInfo": {
        "ID": 45935,
        "Title": "Fyra årstiders park Sölvesborg",
        "AddressLine1": "Hamngatan 10",
        "Town": "SÖLVESBORG",
        "StateOrProvince": "BLEKINGE",
        "Postcode": "29431",
        "CountryID": 216,
        "Latitude": 56.05149,
        "Longitude": 14.58901,
        "AccessComments": "Parkeringen vid fyra årstiders park, nära småbåtshamnen och Sölvesborgsbron",
        "DistanceUnit": 0
    },
    "Connections": [
        {
            "ID": 56252,
            "ConnectionTypeID": 0,
            "Reference": "1",
            "LevelID": 2,
            "Amps": 32,
            "Voltage": 400,
            "PowerKW": 22,
            "Comments": "Mode 3"
        },
        {
            "ID": 87755,
            "ConnectionTypeID": 0,
            "Reference": "2",
            "LevelID": 2,
            "Amps": 32,
            "Voltage": 400,
            "PowerKW": 22,
            "Comments": "Mode 3"
        }
    ],
    "NumberOfPoints": 2,
    "DateLastStatusUpdate": "2020-05-26T08:21:00Z",
    "DataQualityLevel": 2,
    "DateCreated": "2015-05-03T00:54:00Z",
    "SubmissionStatusTypeID": 100
}