{
    "IsRecentlyVerified": false,
    "ID": 187786,
    "UUID": "63D94129-78E7-4CF9-A86C-0A6638971D23",
    "DataProviderID": 18,
    "DataProvidersReference": "feb90a9d974a41da3e2790a1a687de73",
    "OperatorID": 3,
    "UsageTypeID": 1,
    "AddressInfo": {
        "ID": 188145,
        "Title": "Whipps Cross University Hospital,Whipps Cross Road",
        "AddressLine1": "Whipps Cross University Hospital,Whipps Cross Road",
        "Town": "Waltham Forest",
        "Postcode": "E11 1NR",
        "CountryID": 1,
        "Latitude": 51.577401,
        "Longitude": 0.003291,
        "AccessComments": "",
        "RelatedURL": "http://pod-point.com",
        "DistanceUnit": 0
    },
    "Connections": [
        {
            "ID": 303039,
            "ConnectionTypeID": 25,
            "Reference": "0",
            "StatusTypeID": 50,
            "LevelID": 2,
            "Amps": 32,
            "Voltage": 230,
            "PowerKW": 7,
            "CurrentTypeID": 10
        },
        {
            "ID": 303040,
            "ConnectionTypeID": 3,
            "Reference": "1",
            "StatusTypeID": 50,
            "LevelID": 2,
            "Amps": 16,
            "Voltage": 230,
            "PowerKW": 3.7,
            "CurrentTypeID": 10
        }
    ],
    "StatusTypeID": 0,
    "DateLastStatusUpdate": "2021-07-12T03:39:00Z",
    "MetadataValues": [
        {
            "ID": 20026,
            "MetadataFieldID": 4,
            "ItemValue": "Contains public sector information licensed under the Open Government Licence v2.0. http://www.nationalarchives.gov.uk/doc/open-government-licence/version/2/"
        }
    ],
    "DataQualityLevel": 3,
    "DateCreated": "2021-07-12T03:39:00Z",
    "SubmissionStatusTypeID": 100
}