{
    "IsRecentlyVerified": false,
    "ID": 184477,
    "UUID": "BFF18303-E4AB-4856-8B76-3307CD9DF008",
    "DataProviderID": 29,
    "DataProvidersReference": "13457",
    "OperatorID": 69,
    "AddressInfo": {
        "ID": 184836,
        "Title": "Willohstr. 19",
        "AddressLine1": "Willohstr. 19",
        "Town": "Vechta",
        "Postcode": "49377",
        "CountryID": 87,
        "Latitude": 52.724884,
        "Longitude": 8.289351,
        "DistanceUnit": 0
    },
    "Connections": [
        {
            "ID": 292814,
            "ConnectionTypeID": 25,
            "StatusTypeID": 50,
            "LevelID": 2,
            "PowerKW": 22,
            "CurrentTypeID": 20
        },
        {
            "ID": 292815,
            "ConnectionTypeID": 25,
            "StatusTypeID": 50,
            "LevelID": 2,
            "PowerKW": 22,
            "CurrentTypeID": 20
        }
    ],
    "StatusTypeID": 50,
    "DateLastStatusUpdate": "2021-07-09T03:28:00Z",
    "MetadataValues": [
        {
            "ID": 16768,
            "MetadataFieldID": 4,
            "ItemValue": "Data from the German chargepoint registry provided by Bundesnetzagentur.de under the CC-BY 4.0 license"
        }
    ],
    "DataQualityLevel": 3,
    "DateCreated": "2021-07-08T10:05:00Z",
    "SubmissionStatusTypeID": 100
}