{
    "IsRecentlyVerified": false,
    "ID": 51214,
    "UUID": "A5261DB3-B7F2-493E-B3C9-6FBFE015C53C",
    "DataProviderID": 1,
    "DataProvidersReference": "2832",
    "AddressInfo": {
        "ID": 51560,
        "Title": "OKQ8 Blästervägen",
        "AddressLine1": "Blästervägen 2",
        "Town": "ARVIKA",
        "StateOrProvince": "VÄRMLAND",
        "Postcode": "67141",
        "CountryID": 216,
        "Latitude": 59.66943,
        "Longitude": 12.59312,
        "AccessComments": "",
        "DistanceUnit": 0
    },
    "Connections": [
        {
            "ID": 63376,
            "ConnectionTypeID": 0,
            "Reference": "1",
            "LevelID": 2,
            "Amps": 100,
            "Voltage": 500,
            "PowerKW": 50,
            "Comments": "Mode 4"
        },
        {
            "ID": 84976,
            "ConnectionTypeID": 0,
            "Reference": "2",
            "LevelID": 2,
            "Amps": 100,
            "Voltage": 500,
            "PowerKW": 50,
            "Comments": "Mode 4"
        },
        {
            "ID": 88392,
            "ConnectionTypeID": 0,
            "Reference": "3",
            "LevelID": 2,
            "Amps": 32,
            "Voltage": 400,
            "PowerKW": 22,
            "Comments": "Mode 3"
        }
    ],
    "NumberOfPoints": 3,
    "DateLastStatusUpdate": "2020-05-26T08:23:00Z",
    "DataQualityLevel": 2,
    "DateCreated": "2015-07-24T02:17:00Z",
    "SubmissionStatusTypeID": 100
}