{
    "IsRecentlyVerified": false,
    "ID": 136119,
    "UUID": "5C8D417D-416C-4E9C-BA8D-D83B0A4E3F93",
    "DataProviderID": 18,
    "DataProvidersReference": "7a632c3e59577e114d2c74020b2aece2",
    "OperatorID": 2244,
    "UsageTypeID": 4,
    "AddressInfo": {
        "ID": 136465,
        "Title": "Roland Way",
        "AddressLine1": "Roland Way",
        "Town": "London",
        "Postcode": "SW7 3PH",
        "CountryID": 1,
        "Latitude": 51.490763,
        "Longitude": -0.180902,
        "AccessComments": "",
        "RelatedURL": "https://www.ubitricity.com",
        "DistanceUnit": 0
    },
    "Connections": [
        {
            "ID": 190546,
            "ConnectionTypeID": 25,
            "Reference": "suby1100000035",
            "StatusTypeID": 50,
            "LevelID": 2,
            "Amps": 16,
            "Voltage": 230,
            "PowerKW": 3.7,
            "CurrentTypeID": 10
        }
    ],
    "StatusTypeID": 0,
    "DateLastStatusUpdate": "2021-04-25T05:46:00Z",
    "MetadataValues": [
        {
            "ID": 5971,
            "MetadataFieldID": 4,
            "ItemValue": "Contains public sector information licensed under the Open Government Licence v2.0. http://www.nationalarchives.gov.uk/doc/open-government-licence/version/2/"
        }
    ],
    "DataQualityLevel": 3,
    "DateCreated": "2019-12-24T05:22:00Z",
    "SubmissionStatusTypeID": 100
}