{
    "IsRecentlyVerified": false,
    "ID": 184002,
    "UUID": "7F8C0603-32EB-4C24-923B-EFFB02248B98",
    "DataProviderID": 29,
    "DataProvidersReference": "4916",
    "AddressInfo": {
        "ID": 184361,
        "Title": "Topsloh 2-4",
        "AddressLine1": "Topsloh 2-4",
        "Town": "Georgsmarienhütte",
        "Postcode": "49124",
        "CountryID": 87,
        "Latitude": 52.1944,
        "Longitude": 8.070845,
        "DistanceUnit": 0
    },
    "Connections": [
        {
            "ID": 291685,
            "ConnectionTypeID": 25,
            "StatusTypeID": 50,
            "LevelID": 2,
            "PowerKW": 11,
            "CurrentTypeID": 20
        },
        {
            "ID": 291686,
            "ConnectionTypeID": 33,
            "StatusTypeID": 50,
            "LevelID": 3,
            "PowerKW": 22,
            "CurrentTypeID": 30
        }
    ],
    "StatusTypeID": 50,
    "DateLastStatusUpdate": "2021-07-12T02:49:00Z",
    "MetadataValues": [
        {
            "ID": 16295,
            "MetadataFieldID": 4,
            "ItemValue": "Data from the German chargepoint registry provided by Bundesnetzagentur.de under the CC-BY 4.0 license"
        }
    ],
    "DataQualityLevel": 3,
    "DateCreated": "2021-07-08T10:04:00Z",
    "SubmissionStatusTypeID": 100
}