{
    "MediaItems": [
        {
            "ID": 20675,
            "ChargePointID": 135471,
            "ItemURL": "https://s3-ap-southeast-2.amazonaws.com/openchargemap/images/GR/OCM135471/OCM-135471.orig.2019122122243686.jpg",
            "ItemThumbnailURL": "https://s3-ap-southeast-2.amazonaws.com/openchargemap/images/GR/OCM135471/OCM-135471.thmb.2019122122243686.jpg",
            "Comment": "",
            "IsEnabled": true,
            "IsVideo": false,
            "IsFeaturedItem": false,
            "IsExternalResource": false,
            "User": {
                "ID": 18761,
                "Username": "EVentusiast"
            },
            "DateCreated": "2019-12-21T22:25:00Z"
        },
        {
            "ID": 20676,
            "ChargePointID": 135471,
            "ItemURL": "https://s3-ap-southeast-2.amazonaws.com/openchargemap/images/GR/OCM135471/OCM-135471.orig.2019122122251521.jpg",
            "ItemThumbnailURL": "https://s3-ap-southeast-2.amazonaws.com/openchargemap/images/GR/OCM135471/OCM-135471.thmb.2019122122251521.jpg",
            "Comment": "",
            "IsEnabled": true,
            "IsVideo": false,
            "IsFeaturedItem": false,
            "IsExternalResource": false,
            "User": {
                "ID": 18761,
                "Username": "EVentusiast"
            },
            "DateCreated": "2019-12-21T22:25:00Z"
        },
        {
            "ID": 20674,
            "ChargePointID": 135471,
            "ItemURL": "https://s3-ap-southeast-2.amazonaws.com/openchargemap/images/GR/OCM135471/OCM-135471.orig.2019122122240662.jpg",
            "ItemThumbnailURL": "https://s3-ap-southeast-2.amazonaws.com/openchargemap/images/GR/OCM135471/OCM-135471.thmb.2019122122240662.jpg",
            "Comment": "",
            "IsEnabled": true,
            "IsVideo": false,
            "IsFeaturedItem": false,
            "IsExternalResource": false,
            "User": {
                "ID": 18761,
                "Username": "EVentusiast"
            },
            "DateCreated": "2019-12-21T22:24:00Z"
        }
    ],
    "IsRecentlyVerified": false,
    "ID": 135471,
    "UUID": "BE19BF2B-0C52-4DE6-A243-027E7BCBCFA7",
    "DataProviderID": 1,
    "OperatorID": 1,
    "UsageTypeID": 7,
    "AddressInfo": {
        "ID": 135817,
        "Title": "U SAVE Car Park",
        "AddressLine1": "3ο χλμ Λεωφ. Μαρκόπουλου",
        "AddressLine2": "Argithea",
        "Town": "Municipality of Paiania",
        "StateOrProvince": "Municipality of Paiania",
        "Postcode": "19002",
        "CountryID": 90,
        "Latitude": 37.927815551756595,
        "Longitude": 23.88566037713565,
        "ContactTelephone1": "+302114111400",
        "ContactTelephone2": "+30",
        "ContactEmail": "info@usaveparking.gr",
        "AccessComments": "Mandatory prior booking via telephone or email",
        "RelatedURL": "https://www.usaveparking.gr",
        "DistanceUnit": 0
    },
    "Connections": [
        {
            "ID": 189807,
            "ConnectionTypeID": 25,
            "StatusTypeID": 50,
            "LevelID": 2,
            "Amps": 32,
            "Voltage": 400,
            "PowerKW": 22,
            "CurrentTypeID": 20,
            "Quantity": 1
        }
    ],
    "NumberOfPoints": 1,
    "StatusTypeID": 50,
    "DateLastStatusUpdate": "2019-12-23T09:28:00Z",
    "DataQualityLevel": 1,
    "DateCreated": "2019-12-21T22:24:00Z",
    "SubmissionStatusTypeID": 200
}