{
    "IsRecentlyVerified": false,
    "ID": 8794,
    "UUID": "1F3EA8A3-67E3-4998-817D-028F9DBA69BB",
    "DataProviderID": 15,
    "DataProvidersReference": "12106",
    "OperatorID": 5,
    "AddressInfo": {
        "ID": 8691,
        "Title": "20 Park St",
        "AddressLine1": "20 Park St",
        "Town": "Montclair",
        "StateOrProvince": "New Jersey",
        "Postcode": "7042",
        "CountryID": 2,
        "Latitude": 40.81567764,
        "Longitude": -74.21853638,
        "ContactTelephone1": "(973) 509-8888",
        "RelatedURL": "http://carstations.com/12106",
        "DistanceUnit": 0
    },
    "Connections": [
        {
            "ID": 6276,
            "ConnectionTypeID": 1,
            "Reference": "J1772",
            "LevelID": 2
        },
        {
            "ID": 9168,
            "ConnectionTypeID": 9,
            "Reference": "NEMA5",
            "LevelID": 1,
            "Quantity": 1
        }
    ],
    "StatusTypeID": 0,
    "DateLastStatusUpdate": "2017-11-04T14:04:00Z",
    "DataQualityLevel": 1,
    "DateCreated": "2011-11-26T14:32:00Z",
    "SubmissionStatusTypeID": 100
}