{
    "IsRecentlyVerified": false,
    "ID": 40936,
    "UUID": "49793372-15F7-4EE7-908B-93FBD6C68F3E",
    "DataProviderID": 1,
    "OperatorID": 127,
    "UsageTypeID": 1,
    "AddressInfo": {
        "ID": 41282,
        "Title": "EWE Kundencenter Aurich",
        "AddressLine1": "Dreekamp 20",
        "Town": "Aurich",
        "StateOrProvince": "Landkreis Aurich",
        "Postcode": "26605",
        "CountryID": 87,
        "Latitude": 53.4687501441336,
        "Longitude": 7.46041407133065,
        "ContactTelephone1": "04418030",
        "ContactTelephone2": "08001014432",
        "AccessComments": "Kundenparkplatz immer geöffnet",
        "RelatedURL": "http://www.ewe.de/privatkunden/mobilitaet.php",
        "DistanceUnit": 0
    },
    "Connections": [
        {
            "ID": 44585,
            "ConnectionTypeID": 25,
            "StatusTypeID": 50,
            "Quantity": 1
        },
        {
            "ID": 44586,
            "ConnectionTypeID": 17,
            "StatusTypeID": 50,
            "Quantity": 1
        }
    ],
    "NumberOfPoints": 2,
    "GeneralComments": "Zugang mit EWE / SWB RFID Karte",
    "StatusTypeID": 50,
    "DateLastStatusUpdate": "2015-01-19T19:29:00Z",
    "DataQualityLevel": 1,
    "DateCreated": "2015-01-17T16:09:00Z",
    "SubmissionStatusTypeID": 200
}