{
    "MediaItems": [
        {
            "ID": 9380,
            "ChargePointID": 23080,
            "ItemURL": "https://s3-ap-southeast-2.amazonaws.com/openchargemap/images/GB/OCM23080/OCM-23080.orig.2017020304451462.jpg",
            "ItemThumbnailURL": "https://s3-ap-southeast-2.amazonaws.com/openchargemap/images/GB/OCM23080/OCM-23080.thmb.2017020304451462.jpg",
            "Comment": "",
            "IsEnabled": true,
            "IsVideo": false,
            "IsFeaturedItem": false,
            "IsExternalResource": false,
            "User": {
                "ID": 12296,
                "Username": "smudgeshouse"
            },
            "DateCreated": "2017-02-03T04:45:00Z"
        },
        {
            "ID": 9379,
            "ChargePointID": 23080,
            "ItemURL": "https://s3-ap-southeast-2.amazonaws.com/openchargemap/images/GB/OCM23080/OCM-23080.orig.2017020304302557.jpg",
            "ItemThumbnailURL": "https://s3-ap-southeast-2.amazonaws.com/openchargemap/images/GB/OCM23080/OCM-23080.thmb.2017020304302557.jpg",
            "Comment": "Located at far end of car park from barriers",
            "IsEnabled": true,
            "IsVideo": false,
            "IsFeaturedItem": false,
            "IsExternalResource": false,
            "User": {
                "ID": 12296,
                "Username": "smudgeshouse"
            },
            "DateCreated": "2017-02-03T04:31:00Z"
        }
    ],
    "IsRecentlyVerified": false,
    "ID": 23080,
    "UUID": "A7A5718C-4A8C-4031-8DA3-3612FC7C5906",
    "DataProviderID": 1,
    "OperatorID": 20,
    "OperatorsReference": "70508",
    "UsageTypeID": 4,
    "UsageCost": "£1.00/charge admin fee. Parking fees £12.00 Mon-Fri, £4 Sat&Sun",
    "AddressInfo": {
        "ID": 23425,
        "Title": "Parker Street Station Car Park",
        "AddressLine1": "White St",
        "AddressLine2": "Bewsey",
        "Town": "Warrington",
        "StateOrProvince": "Warrington",
        "Postcode": "WA1 1LW",
        "CountryID": 1,
        "Latitude": 53.3864915041709,
        "Longitude": -2.60278172555325,
        "AccessComments": "Access through Parker Street Station car park barrier",
        "DistanceUnit": 0
    },
    "Connections": [
        {
            "ID": 24778,
            "ConnectionTypeID": 25,
            "StatusTypeID": 50,
            "LevelID": 2,
            "Amps": 32,
            "Voltage": 230,
            "PowerKW": 7,
            "CurrentTypeID": 10,
            "Quantity": 2
        }
    ],
    "NumberOfPoints": 2,
    "GeneralComments": "These charge points are for paying users of the Station Car Park",
    "StatusTypeID": 50,
    "DateLastStatusUpdate": "2017-06-14T12:56:00Z",
    "DataQualityLevel": 1,
    "DateCreated": "2014-04-09T14:38:00Z",
    "SubmissionStatusTypeID": 200
}