{
    "IsRecentlyVerified": false,
    "ID": 54429,
    "UUID": "0494A95E-1ECD-42BE-AB78-96E5D12F7A4B",
    "DataProviderID": 1,
    "OperatorID": 101,
    "UsageTypeID": 4,
    "AddressInfo": {
        "ID": 54775,
        "Title": "Busbahnhof am Industriepark",
        "AddressLine1": "Parkweg 1a",
        "Town": "Sömmerda",
        "StateOrProvince": "Landkreis Sömmerda",
        "Postcode": "99610",
        "CountryID": 87,
        "Latitude": 51.1652721496611,
        "Longitude": 11.117051695176,
        "ContactTelephone1": "+49 3634 3711 -0",
        "AccessComments": "Am Busbahnhof ist eine 24/7 nutzbare Belectric Ladesäule. Ladekarte von PlugSurfing (auch App), ladeticket, WSW Strom emobil, The New Motion, ChargeNow, Ladekarte SW DU, SWM etc nötig.",
        "RelatedURL": "http://www.sev-soemmerda.de/",
        "DistanceUnit": 0
    },
    "Connections": [
        {
            "ID": 68625,
            "ConnectionTypeID": 25,
            "StatusTypeID": 50,
            "LevelID": 2,
            "Amps": 32,
            "Voltage": 400,
            "PowerKW": 22,
            "CurrentTypeID": 20,
            "Quantity": 2
        }
    ],
    "NumberOfPoints": 2,
    "StatusTypeID": 50,
    "DateLastStatusUpdate": "2015-10-02T11:04:00Z",
    "DataQualityLevel": 1,
    "DateCreated": "2015-10-02T07:51:00Z",
    "SubmissionStatusTypeID": 200
}