{
    "IsRecentlyVerified": false,
    "ID": 92252,
    "UUID": "CA70A0C6-21FB-4CF6-AD0F-61C21671AA05",
    "DataProviderID": 1,
    "OperatorID": 23,
    "OperatorsReference": "33377",
    "UsageTypeID": 4,
    "AddressInfo": {
        "ID": 92598,
        "Title": "Cheltenham Park Hotel",
        "AddressLine1": "Cheltenham Park Hotel",
        "Postcode": "GL53 8EA",
        "CountryID": 1,
        "Latitude": 51.874817,
        "Longitude": -2.053748,
        "ContactTelephone1": "+44 124 222 9295",
        "DistanceUnit": 0
    },
    "Connections": [
        {
            "ID": 130795,
            "ConnectionTypeID": 30,
            "StatusTypeID": 50,
            "LevelID": 2,
            "Amps": 32,
            "Voltage": 230,
            "PowerKW": 7,
            "CurrentTypeID": 10,
            "Quantity": 2
        }
    ],
    "NumberOfPoints": 2,
    "GeneralComments": "2 Tesla Connectors, up to 7kW.Available for customers. Self park.",
    "StatusTypeID": 50,
    "DateLastStatusUpdate": "2018-10-03T16:40:00Z",
    "DataQualityLevel": 1,
    "DateCreated": "2017-09-01T05:33:00Z",
    "SubmissionStatusTypeID": 200
}