{
    "IsRecentlyVerified": false,
    "ID": 119747,
    "UUID": "D0936C08-CF2C-4BBD-A883-BEF241745CEF",
    "DataProviderID": 2,
    "DataProvidersReference": "86110",
    "UsageTypeID": 2,
    "AddressInfo": {
        "ID": 120093,
        "Title": "Duke Energy",
        "AddressLine1": "199 E Mountain Lake Cut-Off Rd",
        "Town": "Lake Wales",
        "StateOrProvince": "FL",
        "Postcode": "33859",
        "CountryID": 2,
        "Latitude": 27.922127,
        "Longitude": -81.607838,
        "ContactTelephone1": "",
        "AccessComments": "Fleet vehicles only",
        "RelatedURL": "",
        "DistanceUnit": 0
    },
    "Connections": [
        {
            "ID": 169032,
            "ConnectionTypeID": 1,
            "LevelID": 2,
            "Amps": 16,
            "Voltage": 230,
            "PowerKW": 3.7,
            "CurrentTypeID": 10,
            "Quantity": 1
        }
    ],
    "DateLastStatusUpdate": "2020-06-26T02:52:00Z",
    "DataQualityLevel": 3,
    "DateCreated": "2019-04-01T04:59:00Z",
    "SubmissionStatusTypeID": 100
}