{
    "IsRecentlyVerified": false,
    "ID": 97910,
    "UUID": "DC816905-B868-4DE5-8AC1-13042363E4DC",
    "DataProviderID": 1,
    "OperatorID": 23,
    "OperatorsReference": "39436",
    "UsageTypeID": 4,
    "AddressInfo": {
        "ID": 98256,
        "Title": "Mcarthurglen Designer Outlet Neumünster",
        "AddressLine1": "Oderstrasse 10",
        "Town": "Neumünster",
        "Postcode": "24539",
        "CountryID": 87,
        "Latitude": 54.04391,
        "Longitude": 9.978857,
        "ContactTelephone1": "+49 4321 5586880 ",
        "DistanceUnit": 0
    },
    "Connections": [
        {
            "ID": 138818,
            "ConnectionTypeID": 30,
            "StatusTypeID": 50,
            "LevelID": 2,
            "Amps": 32,
            "Voltage": 230,
            "PowerKW": 11,
            "CurrentTypeID": 20,
            "Quantity": 2
        }
    ],
    "NumberOfPoints": 2,
    "GeneralComments": "2 Tesla Connectors, up to 14kW.Available for customers. Self park.",
    "StatusTypeID": 50,
    "DateLastStatusUpdate": "2018-10-03T21:15:00Z",
    "DataQualityLevel": 1,
    "DateCreated": "2018-01-21T16:58:00Z",
    "SubmissionStatusTypeID": 200
}