{
    "IsRecentlyVerified": false,
    "ID": 180258,
    "UUID": "25BC3A00-0DE8-4B04-93DE-9790A7F8D3B2",
    "DataProviderID": 29,
    "DataProvidersReference": "18359",
    "OperatorID": 105,
    "AddressInfo": {
        "ID": 180617,
        "Title": "Am Stausee 23",
        "AddressLine1": "Am Stausee 23",
        "Town": "Niederhausen",
        "Postcode": "55585",
        "CountryID": 87,
        "Latitude": 49.802158,
        "Longitude": 7.784844,
        "DistanceUnit": 0
    },
    "Connections": [
        {
            "ID": 283111,
            "ConnectionTypeID": 25,
            "StatusTypeID": 50,
            "LevelID": 2,
            "PowerKW": 22,
            "CurrentTypeID": 20
        },
        {
            "ID": 283112,
            "ConnectionTypeID": 25,
            "StatusTypeID": 50,
            "LevelID": 2,
            "PowerKW": 22,
            "CurrentTypeID": 20
        }
    ],
    "StatusTypeID": 50,
    "DateLastStatusUpdate": "2021-07-09T03:18:00Z",
    "MetadataValues": [
        {
            "ID": 12552,
            "MetadataFieldID": 4,
            "ItemValue": "Data from the German chargepoint registry provided by Bundesnetzagentur.de under the CC-BY 4.0 license"
        }
    ],
    "DataQualityLevel": 3,
    "DateCreated": "2021-07-08T10:00:00Z",
    "SubmissionStatusTypeID": 100
}