{
    "IsRecentlyVerified": false,
    "ID": 119577,
    "UUID": "2D308E07-60DF-4AC2-BC8D-08ED6BA02E99",
    "DataProviderID": 2,
    "DataProvidersReference": "105074",
    "OperatorID": 5,
    "UsageTypeID": 1,
    "AddressInfo": {
        "ID": 119923,
        "Title": "MASTER OFFICE",
        "AddressLine1": "1850 S Ocean Dr",
        "Town": "Hallandale Beach",
        "StateOrProvince": "FL",
        "Postcode": "33009",
        "CountryID": 2,
        "Latitude": 25.984287,
        "Longitude": -80.118787,
        "ContactTelephone1": "888-758-4389",
        "AccessComments": "24 hours daily",
        "RelatedURL": "http://www.chargepoint.com/",
        "DistanceUnit": 0
    },
    "Connections": [
        {
            "ID": 168853,
            "ConnectionTypeID": 1,
            "LevelID": 2,
            "Amps": 16,
            "Voltage": 230,
            "PowerKW": 3.7,
            "CurrentTypeID": 10,
            "Quantity": 4
        }
    ],
    "DateLastStatusUpdate": "2020-06-26T02:52:00Z",
    "DataQualityLevel": 3,
    "DateCreated": "2019-04-01T04:59:00Z",
    "SubmissionStatusTypeID": 100
}