{
    "IsRecentlyVerified": false,
    "ID": 187569,
    "UUID": "ECB5BF95-DA5A-419A-8E70-2FFA5F7B7C2E",
    "DataProviderID": 18,
    "DataProvidersReference": "44a56e7bb950f26acde1bd0fa7fb5727",
    "OperatorID": 3393,
    "UsageTypeID": 1,
    "AddressInfo": {
        "ID": 187928,
        "Title": "13-15 Archers Road",
        "AddressLine1": "13-15 Archers Road",
        "Town": "Eastleigh",
        "Postcode": "SO50 9AR",
        "CountryID": 1,
        "Latitude": 50.9714,
        "Longitude": -1.3555,
        "AccessComments": "Bollard light between the houses number 13 and 15",
        "RelatedURL": "http://www.joju.co.uk/",
        "DistanceUnit": 0
    },
    "Connections": [
        {
            "ID": 302738,
            "ConnectionTypeID": 25,
            "Reference": "08131",
            "StatusTypeID": 50,
            "LevelID": 2,
            "Amps": 16,
            "Voltage": 230,
            "PowerKW": 3.7,
            "CurrentTypeID": 10
        }
    ],
    "StatusTypeID": 0,
    "DateLastStatusUpdate": "2021-07-12T03:38:00Z",
    "MetadataValues": [
        {
            "ID": 19809,
            "MetadataFieldID": 4,
            "ItemValue": "Contains public sector information licensed under the Open Government Licence v2.0. http://www.nationalarchives.gov.uk/doc/open-government-licence/version/2/"
        }
    ],
    "DataQualityLevel": 3,
    "DateCreated": "2021-07-12T03:38:00Z",
    "SubmissionStatusTypeID": 100
}