{
    "IsRecentlyVerified": false,
    "ID": 170961,
    "UUID": "60938F9E-F727-4DA4-9105-2A0310FDA538",
    "DataProviderID": 1,
    "OperatorID": 80,
    "UsageTypeID": 4,
    "AddressInfo": {
        "ID": 171320,
        "Title": "Garage Dacar Roma | EnelX",
        "AddressLine1": "Via Buccari, 5",
        "Town": "Roma",
        "StateOrProvince": "RM",
        "Postcode": "00195",
        "CountryID": 112,
        "Latitude": 41.91210056748042,
        "Longitude": 12.453967614410544,
        "RelatedURL": "https://www.enelx.com/it/it/mobilita-elettrica",
        "DistanceUnit": 0
    },
    "Connections": [
        {
            "ID": 261202,
            "ConnectionTypeID": 25,
            "StatusTypeID": 50,
            "LevelID": 2,
            "Amps": 32,
            "Voltage": 400,
            "PowerKW": 3,
            "CurrentTypeID": 20,
            "Quantity": 3
        }
    ],
    "NumberOfPoints": 3,
    "GeneralComments": "LUN-SAB 05:30-01:30 DOM 05:30-12:30/15:00-01:30",
    "StatusTypeID": 50,
    "DateLastStatusUpdate": "2020-12-14T17:05:00Z",
    "DataQualityLevel": 1,
    "DateCreated": "2020-12-14T17:05:00Z",
    "SubmissionStatusTypeID": 200
}