{
    "IsRecentlyVerified": false,
    "ID": 167588,
    "UUID": "F384A81A-2A88-4924-8DCA-957286BB9418",
    "DataProviderID": 19,
    "DataProvidersReference": "2910",
    "AddressInfo": {
        "ID": 167947,
        "Title": "Lom",
        "AddressLine1": "Nedre Ulstadveg 1",
        "Town": "LOM",
        "StateOrProvince": "Innlandet",
        "Postcode": "2686",
        "CountryID": 168,
        "Latitude": 61.83618,
        "Longitude": 8.56653,
        "AccessComments": "",
        "DistanceUnit": 0
    },
    "Connections": [
        {
            "ID": 254359,
            "ConnectionTypeID": 33,
            "Reference": "1",
            "LevelID": 3,
            "Amps": 375,
            "Voltage": 400,
            "PowerKW": 150,
            "CurrentTypeID": 30,
            "Comments": "Mode 4"
        },
        {
            "ID": 254360,
            "ConnectionTypeID": 33,
            "Reference": "2",
            "LevelID": 3,
            "Amps": 375,
            "Voltage": 400,
            "PowerKW": 150,
            "CurrentTypeID": 30,
            "Comments": "Mode 4"
        },
        {
            "ID": 254361,
            "ConnectionTypeID": 33,
            "Reference": "3",
            "LevelID": 3,
            "Amps": 100,
            "Voltage": 500,
            "PowerKW": 50,
            "CurrentTypeID": 30,
            "Comments": "Mode 4"
        },
        {
            "ID": 254362,
            "ConnectionTypeID": 33,
            "Reference": "4",
            "LevelID": 3,
            "Amps": 100,
            "Voltage": 500,
            "PowerKW": 50,
            "CurrentTypeID": 30,
            "Comments": "Mode 4"
        },
        {
            "ID": 254363,
            "ConnectionTypeID": 33,
            "Reference": "9",
            "LevelID": 3,
            "Amps": 100,
            "Voltage": 500,
            "PowerKW": 50,
            "CurrentTypeID": 30,
            "Comments": "Mode 4"
        },
        {
            "ID": 254364,
            "ConnectionTypeID": 2,
            "Reference": "10",
            "LevelID": 3,
            "Amps": 100,
            "Voltage": 500,
            "PowerKW": 50,
            "CurrentTypeID": 30,
            "Comments": "Mode 4"
        },
        {
            "ID": 254365,
            "ConnectionTypeID": 2,
            "Reference": "7",
            "LevelID": 3,
            "Amps": 100,
            "Voltage": 500,
            "PowerKW": 50,
            "CurrentTypeID": 30,
            "Comments": "Mode 4"
        },
        {
            "ID": 254366,
            "ConnectionTypeID": 25,
            "Reference": "8",
            "LevelID": 3,
            "Amps": 32,
            "Voltage": 400,
            "PowerKW": 22,
            "CurrentTypeID": 30,
            "Comments": "Mode 3"
        }
    ],
    "NumberOfPoints": 10,
    "StatusTypeID": 0,
    "DateLastStatusUpdate": "2021-03-24T05:12:00Z",
    "DataQualityLevel": 2,
    "DateCreated": "2020-09-08T04:14:00Z",
    "SubmissionStatusTypeID": 100
}