{
    "UserComments": [
        {
            "ID": 8422,
            "ChargePointID": 58002,
            "CommentTypeID": 10,
            "UserName": "Anon74856763534",
            "Comment": "Successful CHAdeMO charge reported earlier today.",
            "DateCreated": "2016-01-03T20:50:10.2Z",
            "User": {
                "ID": 1192,
                "Username": "Anon74856763534"
            },
            "CheckinStatusTypeID": 0
        }
    ],
    "IsRecentlyVerified": false,
    "ID": 58002,
    "UUID": "51DABB43-12AF-421B-8182-90E2F513725C",
    "DataProviderID": 1,
    "OperatorID": 24,
    "UsageTypeID": 5,
    "UsageCost": "£0.30/kWh",
    "AddressInfo": {
        "ID": 58348,
        "Title": "Port Rodie Service Station",
        "AddressLine1": "Bellevilla Road",
        "Town": "Stranraer",
        "StateOrProvince": "Dumfries and Galloway",
        "Postcode": "DG9 8EF",
        "CountryID": 1,
        "Latitude": 54.905071,
        "Longitude": -5.022762,
        "DistanceUnit": 0
    },
    "Connections": [
        {
            "ID": 73830,
            "ConnectionTypeID": 33,
            "Reference": "GB*GFX*EGS10384*1",
            "StatusTypeID": 50,
            "LevelID": 3,
            "Amps": 200,
            "Voltage": 920,
            "PowerKW": 60,
            "CurrentTypeID": 30,
            "Quantity": 1
        },
        {
            "ID": 73831,
            "ConnectionTypeID": 2,
            "Reference": "GB*GFX*EGS10384*2",
            "StatusTypeID": 50,
            "LevelID": 3,
            "Amps": 200,
            "Voltage": 500,
            "PowerKW": 60,
            "CurrentTypeID": 30,
            "Quantity": 1
        }
    ],
    "NumberOfPoints": 2,
    "StatusTypeID": 50,
    "DateLastStatusUpdate": "2021-10-28T20:03:00Z",
    "DataQualityLevel": 1,
    "DateCreated": "2016-01-03T20:39:00Z",
    "SubmissionStatusTypeID": 200
}