{
    "IsRecentlyVerified": false,
    "ID": 177995,
    "UUID": "D5A572C6-0F7F-4302-AAB4-94D7F3AC32D1",
    "DataProviderID": 29,
    "DataProvidersReference": "7317",
    "OperatorID": 86,
    "AddressInfo": {
        "ID": 178354,
        "Title": "Föhrstraße 4",
        "AddressLine1": "Föhrstraße 4",
        "Town": "Reutlingen",
        "Postcode": "72760",
        "CountryID": 87,
        "Latitude": 48.501781,
        "Longitude": 9.206215,
        "DistanceUnit": 0
    },
    "Connections": [
        {
            "ID": 277835,
            "ConnectionTypeID": 1036,
            "StatusTypeID": 50,
            "LevelID": 3,
            "PowerKW": 43,
            "CurrentTypeID": 20
        },
        {
            "ID": 277836,
            "ConnectionTypeID": 33,
            "StatusTypeID": 50,
            "LevelID": 3,
            "PowerKW": 50,
            "CurrentTypeID": 30
        }
    ],
    "StatusTypeID": 0,
    "DateLastStatusUpdate": "2021-07-09T03:12:00Z",
    "MetadataValues": [
        {
            "ID": 10289,
            "MetadataFieldID": 4,
            "ItemValue": "Data from the German chargepoint registry provided by Bundesnetzagentur.de under the CC-BY 4.0 license"
        }
    ],
    "DataQualityLevel": 3,
    "DateCreated": "2021-07-08T09:49:00Z",
    "SubmissionStatusTypeID": 100
}