{
    "IsRecentlyVerified": false,
    "ID": 91513,
    "UUID": "884A07C8-0067-45BE-9FCC-5AA0E518D0FD",
    "DataProviderID": 1,
    "OperatorID": 3,
    "OperatorsReference": "PG-81234",
    "UsageTypeID": 6,
    "UsageCost": "Free",
    "AddressInfo": {
        "ID": 91859,
        "Title": "Yeomans-Hyundai",
        "AddressLine1": "5-7 Beeching Road",
        "Town": "East Sussex",
        "Postcode": "TN39 3LG",
        "CountryID": 1,
        "Latitude": 50.843632,
        "Longitude": 0.466999,
        "DistanceUnit": 0
    },
    "Connections": [
        {
            "ID": 129713,
            "ConnectionTypeID": 25,
            "StatusTypeID": 50,
            "LevelID": 2,
            "Amps": 32,
            "Voltage": 230,
            "PowerKW": 7,
            "CurrentTypeID": 10,
            "Quantity": 2
        }
    ],
    "NumberOfPoints": 3,
    "GeneralComments": "This is an open charge unit installed at the Yeomans - Hyundai dealership in Beeching Road, Bexhill-On-Sea, East Sussex",
    "StatusTypeID": 50,
    "DateLastStatusUpdate": "2017-12-20T11:46:00Z",
    "DataQualityLevel": 1,
    "DateCreated": "2017-08-04T05:23:00Z",
    "SubmissionStatusTypeID": 200
}