{
    "IsRecentlyVerified": false,
    "ID": 57902,
    "UUID": "6FF559BD-3BC4-4BB6-9D58-CC6DE9912744",
    "DataProviderID": 1,
    "OperatorID": 46,
    "UsageTypeID": 4,
    "UsageCost": "99 DKK",
    "AddressInfo": {
        "ID": 58248,
        "Title": "E-on",
        "AddressLine1": "Torvet 28",
        "Town": "Koge",
        "StateOrProvince": "Denmark",
        "Postcode": "4600",
        "CountryID": 65,
        "Latitude": 55.4568737,
        "Longitude": 12.1804632,
        "RelatedURL": "http://www.eon.dk/e-mobility/Charge-your-electric-car-in-Denmark/",
        "DistanceUnit": 0
    },
    "Connections": [
        {
            "ID": 73440,
            "ConnectionTypeID": 33,
            "StatusTypeID": 0,
            "LevelID": 2,
            "PowerKW": 3.4
        }
    ],
    "NumberOfPoints": 2,
    "GeneralComments": "nb. This doesn't show up on e-on's maps, need confirmation of location.",
    "StatusTypeID": 150,
    "DateLastStatusUpdate": "2015-12-29T19:55:00Z",
    "DataQualityLevel": 1,
    "DateCreated": "2015-12-27T12:03:00Z",
    "SubmissionStatusTypeID": 200
}