{
    "IsRecentlyVerified": false,
    "ID": 178240,
    "UUID": "93075FA5-6510-4F0E-8FD9-DBF6C154D552",
    "DataProviderID": 29,
    "DataProvidersReference": "8082",
    "OperatorID": 105,
    "AddressInfo": {
        "ID": 178599,
        "Title": "Bahnhofstr. 8",
        "AddressLine1": "Bahnhofstr. 8",
        "Town": "Jünkerath",
        "Postcode": "54584",
        "CountryID": 87,
        "Latitude": 50.343887,
        "Longitude": 6.58196,
        "DistanceUnit": 0
    },
    "Connections": [
        {
            "ID": 278389,
            "ConnectionTypeID": 25,
            "StatusTypeID": 50,
            "LevelID": 2,
            "PowerKW": 22,
            "CurrentTypeID": 20
        },
        {
            "ID": 278390,
            "ConnectionTypeID": 25,
            "StatusTypeID": 50,
            "LevelID": 2,
            "PowerKW": 22,
            "CurrentTypeID": 20
        }
    ],
    "StatusTypeID": 0,
    "DateLastStatusUpdate": "2021-07-12T02:44:00Z",
    "MetadataValues": [
        {
            "ID": 10534,
            "MetadataFieldID": 4,
            "ItemValue": "Data from the German chargepoint registry provided by Bundesnetzagentur.de under the CC-BY 4.0 license"
        }
    ],
    "DataQualityLevel": 3,
    "DateCreated": "2021-07-08T09:49:00Z",
    "SubmissionStatusTypeID": 100
}