{
    "IsRecentlyVerified": false,
    "ID": 88989,
    "UUID": "CDC0C9A2-E40A-4B85-A3B7-22B3EE4438FE",
    "DataProviderID": 1,
    "OperatorID": 1,
    "UsageTypeID": 1,
    "AddressInfo": {
        "ID": 89335,
        "Title": "Centrum Opoka",
        "AddressLine1": "Papieska 10",
        "Town": "Stary Sącz",
        "Postcode": "33-340",
        "CountryID": 179,
        "Latitude": 49.5592637991902,
        "Longitude": 20.6473633220207,
        "ContactTelephone1": "+48 510 413 878",
        "ContactEmail": "info@elektrosolar.pl",
        "AccessComments": "Diecezjalne Centrum Pielgrzymowania im. Jana Pawła II ul. Papieska 10 33-340 Stary Sącz",
        "RelatedURL": "http://www.elektrosolar.pl",
        "DistanceUnit": 0
    },
    "Connections": [
        {
            "ID": 126288,
            "ConnectionTypeID": 25,
            "StatusTypeID": 50,
            "LevelID": 2,
            "Amps": 32,
            "PowerKW": 22,
            "CurrentTypeID": 20,
            "Quantity": 1
        }
    ],
    "NumberOfPoints": 1,
    "GeneralComments": "Type 2 22kW",
    "StatusTypeID": 50,
    "DateLastStatusUpdate": "2017-06-17T18:59:00Z",
    "DataQualityLevel": 1,
    "DateCreated": "2017-06-17T17:59:00Z",
    "SubmissionStatusTypeID": 200
}