{
    "IsRecentlyVerified": false,
    "ID": 72224,
    "UUID": "9BB6FDA6-A5FC-4698-9C63-EF432B57DCA8",
    "DataProviderID": 2,
    "DataProvidersReference": "78484",
    "OperatorID": 5,
    "UsageTypeID": 1,
    "AddressInfo": {
        "ID": 72570,
        "Title": "HUDSON 333 TWIN",
        "AddressLine1": "333 Twin Dolphin Dr",
        "Town": "Redwood City",
        "StateOrProvince": "CA",
        "Postcode": "94065",
        "CountryID": 2,
        "Latitude": 37.5224707,
        "Longitude": -122.2576166,
        "ContactTelephone1": "888-758-4389",
        "AccessComments": "24 hours daily",
        "RelatedURL": "http://www.chargepoint.com/",
        "DistanceUnit": 0
    },
    "Connections": [
        {
            "ID": 103527,
            "ConnectionTypeID": 1,
            "LevelID": 2,
            "Amps": 16,
            "Voltage": 230,
            "PowerKW": 3,
            "CurrentTypeID": 10,
            "Quantity": 2
        }
    ],
    "DateLastStatusUpdate": "2019-04-06T04:02:00Z",
    "DataQualityLevel": 3,
    "DateCreated": "2016-10-09T02:45:00Z",
    "SubmissionStatusTypeID": 100
}