{
    "IsRecentlyVerified": false,
    "ID": 60266,
    "UUID": "6692722C-4DDB-47DD-8407-D3F4D0A0E3D4",
    "DataProviderID": 1,
    "OperatorID": 3,
    "OperatorsReference": "PG-80360,PG-81548,PG-81552",
    "UsageTypeID": 6,
    "UsageCost": "Free",
    "AddressInfo": {
        "ID": 60612,
        "Title": "DP World London Gateway Port",
        "AddressLine1": "Atlantic Avenue",
        "AddressLine2": "Fobbing",
        "Town": "Thurrock",
        "StateOrProvince": "Essex",
        "Postcode": "SS17 9DY",
        "CountryID": 1,
        "Latitude": 51.504925,
        "Longitude": 0.484085,
        "DistanceUnit": 0
    },
    "Connections": [
        {
            "ID": 76290,
            "ConnectionTypeID": 25,
            "StatusTypeID": 50,
            "LevelID": 2,
            "Amps": 32,
            "Voltage": 230,
            "PowerKW": 7,
            "CurrentTypeID": 10,
            "Quantity": 6
        },
        {
            "ID": 76291,
            "ConnectionTypeID": 3,
            "StatusTypeID": 50,
            "LevelID": 2,
            "Amps": 13,
            "Voltage": 230,
            "PowerKW": 3,
            "CurrentTypeID": 10,
            "Quantity": 2
        }
    ],
    "NumberOfPoints": 12,
    "StatusTypeID": 50,
    "DateLastStatusUpdate": "2017-12-20T11:07:00Z",
    "DataQualityLevel": 1,
    "DateCreated": "2016-01-18T11:58:00Z",
    "SubmissionStatusTypeID": 200
}