{
    "IsRecentlyVerified": false,
    "ID": 133581,
    "UUID": "DACCA533-DD09-4D7C-8BBC-EADD503FBC88",
    "DataProviderID": 1,
    "OperatorID": 80,
    "UsageTypeID": 4,
    "AddressInfo": {
        "ID": 133927,
        "Title": "Campobasso Tiberio | EnelX",
        "AddressLine1": "Via Vincenzo Tiberio",
        "Town": "Campobasso",
        "StateOrProvince": "CB",
        "Postcode": "86100",
        "CountryID": 112,
        "Latitude": 41.56559182495059,
        "Longitude": 14.656310626890217,
        "ContactTelephone1": "800.069.850",
        "RelatedURL": "https://www.enelx.com/it/it/emobility",
        "DistanceUnit": 0
    },
    "Connections": [
        {
            "ID": 186977,
            "ConnectionTypeID": 25,
            "StatusTypeID": 50,
            "LevelID": 2,
            "Amps": 32,
            "Voltage": 400,
            "PowerKW": 22,
            "CurrentTypeID": 20,
            "Quantity": 4
        }
    ],
    "NumberOfPoints": 4,
    "StatusTypeID": 50,
    "DateLastStatusUpdate": "2019-10-21T13:31:00Z",
    "DataQualityLevel": 1,
    "DateCreated": "2019-10-21T13:31:00Z",
    "SubmissionStatusTypeID": 200
}