{
    "IsRecentlyVerified": false,
    "ID": 104073,
    "UUID": "EAAE2A6D-73D0-404D-B91D-3F73230458C9",
    "DataProviderID": 1,
    "OperatorID": 80,
    "UsageTypeID": 4,
    "AddressInfo": {
        "ID": 104419,
        "Title": "EnelX EVA+ Porto di Genova",
        "AddressLine1": "Via Magazzini Generali",
        "AddressLine2": "Centro Est",
        "Town": "Genova",
        "StateOrProvince": "Genoa",
        "Postcode": "16128",
        "CountryID": 112,
        "Latitude": 44.4083411357807,
        "Longitude": 8.92332384939903,
        "DistanceUnit": 0
    },
    "Connections": [
        {
            "ID": 146916,
            "ConnectionTypeID": 33,
            "LevelID": 1,
            "Amps": 500,
            "Voltage": 120,
            "PowerKW": 50,
            "CurrentTypeID": 30
        },
        {
            "ID": 146917,
            "ConnectionTypeID": 2,
            "LevelID": 1,
            "Amps": 500,
            "Voltage": 120,
            "PowerKW": 50,
            "CurrentTypeID": 30
        },
        {
            "ID": 146918,
            "ConnectionTypeID": 1036,
            "LevelID": 1,
            "Amps": 400,
            "Voltage": 64,
            "PowerKW": 43,
            "CurrentTypeID": 20
        }
    ],
    "NumberOfPoints": 2,
    "StatusTypeID": 150,
    "DateLastStatusUpdate": "2018-07-09T10:46:00Z",
    "DataQualityLevel": 1,
    "DateCreated": "2018-05-15T15:11:00Z",
    "SubmissionStatusTypeID": 200
}