{
    "IsRecentlyVerified": false,
    "ID": 83909,
    "UUID": "2AEC9E70-85DE-414D-ABD8-7FB120166847",
    "DataProviderID": 1,
    "OperatorID": 3,
    "OperatorsReference": "PG-91018",
    "UsageTypeID": 6,
    "UsageCost": "1",
    "AddressInfo": {
        "ID": 84255,
        "Title": "Frosts Accident Repairs",
        "AddressLine1": "58 Burners Lane",
        "AddressLine2": "Abbey Hill",
        "Town": "Wolverton",
        "StateOrProvince": "Milton Keynes",
        "Postcode": "MK11 3HD",
        "CountryID": 1,
        "Latitude": 52.048707,
        "Longitude": -0.821369,
        "DistanceUnit": 0
    },
    "Connections": [
        {
            "ID": 119096,
            "ConnectionTypeID": 25,
            "StatusTypeID": 50,
            "LevelID": 2,
            "Amps": 32,
            "Voltage": 230,
            "PowerKW": 7,
            "CurrentTypeID": 10,
            "Quantity": 1
        }
    ],
    "NumberOfPoints": 1,
    "StatusTypeID": 0,
    "DateLastStatusUpdate": "2020-01-20T06:35:00Z",
    "DataQualityLevel": 1,
    "DateCreated": "2017-02-11T21:03:00Z",
    "SubmissionStatusTypeID": 200
}