{
    "UserComments": [
        {
            "ID": 20064,
            "ChargePointID": 61306,
            "CommentTypeID": 10,
            "UserName": "JOBY",
            "Comment": "Non funzionante",
            "DateCreated": "2018-08-28T08:07:06.62Z",
            "User": {
                "ID": 18804,
                "Username": "JOBY"
            },
            "CheckinStatusTypeID": 0
        },
        {
            "ID": 20063,
            "ChargePointID": 61306,
            "CommentTypeID": 10,
            "UserName": "JOBY",
            "Comment": "mai stata operativa",
            "DateCreated": "2018-08-28T07:59:26.32Z",
            "User": {
                "ID": 18804,
                "Username": "JOBY"
            },
            "CheckinStatusTypeID": 0
        }
    ],
    "IsRecentlyVerified": false,
    "ID": 61306,
    "UUID": "D90C882A-2BBD-496F-8017-99F25305A59E",
    "DataProviderID": 1,
    "OperatorID": 1,
    "UsageTypeID": 1,
    "AddressInfo": {
        "ID": 61652,
        "Title": " Distributore Conad",
        "AddressLine1": "Via Milano, 6",
        "Town": "Porcia",
        "StateOrProvince": "PN",
        "Postcode": "33080",
        "CountryID": 112,
        "Latitude": 45.97292658016,
        "Longitude": 12.6164442972408,
        "RelatedURL": "http://www.conad.it/",
        "DistanceUnit": 0
    },
    "Connections": [
        {
            "ID": 78068,
            "ConnectionTypeID": 0,
            "StatusTypeID": 50,
            "LevelID": 2,
            "Quantity": 1
        }
    ],
    "NumberOfPoints": 1,
    "GeneralComments": "Installata all'apertura del distributore carburanti CONAD, ma mai realmente allacciata alla rete elettrica",
    "StatusTypeID": 100,
    "DateLastStatusUpdate": "2018-08-29T13:00:00Z",
    "DataQualityLevel": 1,
    "DateCreated": "2016-02-23T10:01:00Z",
    "SubmissionStatusTypeID": 200
}