{
    "IsRecentlyVerified": false,
    "ID": 15750,
    "UUID": "DAA03B5F-B844-4500-B51A-40FB53A12F4E",
    "DataProviderID": 1,
    "OperatorID": 56,
    "UsageTypeID": 4,
    "UsageCost": "Free",
    "AddressInfo": {
        "ID": 16095,
        "Title": "René Cassin",
        "AddressLine1": "8 rue Marie Bashkirtseff",
        "Town": "NICE",
        "Postcode": "06200",
        "CountryID": 80,
        "Latitude": 43.67431750000001,
        "Longitude": 7.226624799999968,
        "DistanceUnit": 0
    },
    "Connections": [
        {
            "ID": 14095,
            "ConnectionTypeID": 13,
            "StatusTypeID": 0,
            "LevelID": 2,
            "Amps": 16,
            "Voltage": 220,
            "PowerKW": 4,
            "CurrentTypeID": 20,
            "Quantity": 2
        }
    ],
    "NumberOfPoints": 2,
    "StatusTypeID": 50,
    "DateLastStatusUpdate": "2017-04-21T20:03:00Z",
    "DataQualityLevel": 1,
    "DateCreated": "2013-01-21T16:58:00Z",
    "SubmissionStatusTypeID": 200
}