{
    "IsRecentlyVerified": false,
    "ID": 96319,
    "UUID": "5D66036B-2E33-4766-994A-44BA10EEA709",
    "DataProviderID": 1,
    "OperatorID": 156,
    "UsageTypeID": 4,
    "AddressInfo": {
        "ID": 96665,
        "Title": "Autohaus Siepmann Becker (Kia)",
        "AddressLine1": "Ziegeleiweg 3",
        "Town": "Velbert",
        "StateOrProvince": "Kreis Mettmann",
        "Postcode": "42555",
        "CountryID": 87,
        "Latitude": 51.372989521282584,
        "Longitude": 7.131822882452052,
        "AccessComments": "Details nicht bekannt",
        "RelatedURL": "http://www.kia-siepmann-becker-velbert.de/",
        "DistanceUnit": 0
    },
    "Connections": [
        {
            "ID": 136470,
            "ConnectionTypeID": 25,
            "StatusTypeID": 50,
            "LevelID": 2,
            "Amps": 32,
            "Voltage": 400,
            "PowerKW": 22,
            "CurrentTypeID": 20,
            "Quantity": 1
        }
    ],
    "NumberOfPoints": 1,
    "StatusTypeID": 50,
    "DateLastStatusUpdate": "2017-12-21T07:06:00Z",
    "DataQualityLevel": 1,
    "DateCreated": "2017-12-21T07:06:00Z",
    "SubmissionStatusTypeID": 200
}