{
    "IsRecentlyVerified": false,
    "ID": 35142,
    "UUID": "9304BB7D-F00C-4668-AACD-E43AEC93DF47",
    "DataProviderID": 26,
    "DataProvidersReference": "48073",
    "OperatorID": 178,
    "OperatorsReference": "EVnetNL DB0315",
    "UsageCost": "0.00 jaarabonnement",
    "AddressInfo": {
        "ID": 35488,
        "Title": "Julianalaan 133",
        "AddressLine1": "Julianalaan 133",
        "Town": "Delft",
        "Postcode": "2628 BE",
        "CountryID": 159,
        "Latitude": 52.003638,
        "Longitude": 4.367251,
        "ContactTelephone1": "0800-3522365",
        "RelatedURL": "http://www.evnet.nl",
        "DistanceUnit": 0
    },
    "Connections": [
        {
            "ID": 38653,
            "ConnectionTypeID": 25,
            "LevelID": 2,
            "PowerKW": 11,
            "CurrentTypeID": 10
        }
    ],
    "NumberOfPoints": 2,
    "StatusTypeID": 50,
    "DateLastStatusUpdate": "2016-06-04T02:43:00Z",
    "DataQualityLevel": 3,
    "DateCreated": "2015-01-09T06:04:00Z",
    "SubmissionStatusTypeID": 100
}