{
    "IsRecentlyVerified": false,
    "ID": 152447,
    "UUID": "7CB02DC8-36FD-45AE-80AC-EA3834B2081D",
    "DataProviderID": 28,
    "DataProvidersReference": "",
    "UsageTypeID": 5,
    "AddressInfo": {
        "ID": 152800,
        "Title": "SAINT JEAN SAINT GERMAIN 1321",
        "AddressLine1": "Route de Coudray - 37600 ST JEAN ST GERMAIN",
        "CountryID": 80,
        "Latitude": 47.082539,
        "Longitude": 1.034772,
        "AccessComments": "24/24 7/7",
        "DistanceUnit": 0
    },
    "Connections": [
        {
            "ID": 213419,
            "ConnectionTypeID": 28,
            "StatusTypeID": 50,
            "LevelID": 2,
            "PowerKW": 18,
            "CurrentTypeID": 10
        },
        {
            "ID": 213420,
            "ConnectionTypeID": 25,
            "StatusTypeID": 50,
            "LevelID": 2,
            "PowerKW": 18,
            "CurrentTypeID": 10
        }
    ],
    "GeneralComments": "www.virtaev.fr",
    "StatusTypeID": 50,
    "DateLastStatusUpdate": "2020-03-15T10:53:00Z",
    "DataQualityLevel": 2,
    "DateCreated": "2020-03-15T10:53:00Z",
    "SubmissionStatusTypeID": 100
}