{
    "IsRecentlyVerified": false,
    "ID": 84629,
    "UUID": "B6467E11-1637-4F4E-90C8-6F45BD0063D6",
    "DataProviderID": 1,
    "OperatorID": 45,
    "UsageTypeID": 1,
    "AddressInfo": {
        "ID": 84975,
        "Title": "E-Bike Station Restaurant Alter Bahnhof",
        "AddressLine1": "Bahnhofstraße 1",
        "Town": "Bad Orb",
        "StateOrProvince": "Main-Kinzig-Kreis",
        "Postcode": "63619",
        "CountryID": 87,
        "Latitude": 50.22877624650162,
        "Longitude": 9.348394529430374,
        "AccessComments": "Das Laden ist kostenlos. Gesamtbelastung 3.7kW/16A",
        "RelatedURL": "http://www.alterbahnhofbadorb.de/",
        "DistanceUnit": 0
    },
    "Connections": [
        {
            "ID": 120212,
            "ConnectionTypeID": 28,
            "StatusTypeID": 50,
            "LevelID": 1,
            "Amps": 16,
            "Voltage": 230,
            "PowerKW": 2.3,
            "CurrentTypeID": 10,
            "Quantity": 4
        }
    ],
    "NumberOfPoints": 4,
    "StatusTypeID": 50,
    "DateLastStatusUpdate": "2017-03-07T07:32:00Z",
    "DataQualityLevel": 1,
    "DateCreated": "2017-03-07T07:32:00Z",
    "SubmissionStatusTypeID": 200
}