{
    "IsRecentlyVerified": false,
    "ID": 121444,
    "UUID": "A6307827-833E-4CF7-86B7-A1607916FCC2",
    "DataProviderID": 1,
    "OperatorID": 25,
    "OperatorsReference": "haringey-lawrenceroad",
    "UsageTypeID": 4,
    "UsageCost": "£0.059/minute; min £1.18; other tariffs available",
    "AddressInfo": {
        "ID": 121790,
        "Title": "Lawrence Road",
        "AddressLine1": "47 Lawrence Road",
        "Town": "London",
        "Postcode": "N15 4EF",
        "CountryID": 1,
        "Latitude": 51.587599,
        "Longitude": -0.079707,
        "DistanceUnit": 0
    },
    "Connections": [
        {
            "ID": 171095,
            "ConnectionTypeID": 1,
            "StatusTypeID": 50,
            "LevelID": 2,
            "Amps": 16,
            "Voltage": 230,
            "PowerKW": 4,
            "CurrentTypeID": 10,
            "Quantity": 3
        },
        {
            "ID": 171096,
            "ConnectionTypeID": 25,
            "StatusTypeID": 50,
            "LevelID": 2,
            "Amps": 32,
            "Voltage": 230,
            "PowerKW": 7,
            "CurrentTypeID": 10,
            "Quantity": 3
        },
        {
            "ID": 171097,
            "ConnectionTypeID": 1,
            "StatusTypeID": 50,
            "LevelID": 2,
            "Amps": 16,
            "Voltage": 230,
            "PowerKW": 4,
            "CurrentTypeID": 10,
            "Quantity": 3
        },
        {
            "ID": 171098,
            "ConnectionTypeID": 25,
            "StatusTypeID": 50,
            "LevelID": 2,
            "Amps": 32,
            "Voltage": 230,
            "PowerKW": 7,
            "CurrentTypeID": 10,
            "Quantity": 3
        },
        {
            "ID": 171099,
            "ConnectionTypeID": 1,
            "StatusTypeID": 50,
            "LevelID": 2,
            "Amps": 16,
            "Voltage": 230,
            "PowerKW": 4,
            "CurrentTypeID": 10,
            "Quantity": 3
        },
        {
            "ID": 171100,
            "ConnectionTypeID": 25,
            "StatusTypeID": 50,
            "LevelID": 2,
            "Amps": 32,
            "Voltage": 230,
            "PowerKW": 7,
            "CurrentTypeID": 10,
            "Quantity": 3
        }
    ],
    "NumberOfPoints": 3,
    "StatusTypeID": 50,
    "DateLastStatusUpdate": "2019-04-01T15:17:00Z",
    "DataQualityLevel": 1,
    "DateCreated": "2019-04-01T14:18:00Z",
    "SubmissionStatusTypeID": 200
}