{
    "IsRecentlyVerified": false,
    "ID": 120062,
    "UUID": "76398896-B673-4446-93E0-D4287D5D7CB3",
    "DataProviderID": 2,
    "DataProvidersReference": "45864",
    "UsageTypeID": 7,
    "AddressInfo": {
        "ID": 120408,
        "Title": "Giles Nissan",
        "AddressLine1": "6137 Johnston St",
        "Town": "Lafayette",
        "StateOrProvince": "LA",
        "Postcode": "70503",
        "CountryID": 2,
        "Latitude": 30.165233,
        "Longitude": -92.083374,
        "ContactTelephone1": "337-988-1920",
        "AccessComments": "Dealership business hours\r\nPublic - Call ahead",
        "RelatedURL": "",
        "DistanceUnit": 0
    },
    "Connections": [
        {
            "ID": 169375,
            "ConnectionTypeID": 1,
            "LevelID": 2,
            "Amps": 16,
            "Voltage": 230,
            "PowerKW": 3.7,
            "CurrentTypeID": 10,
            "Quantity": 1
        }
    ],
    "DateLastStatusUpdate": "2020-06-26T02:54:00Z",
    "DataQualityLevel": 3,
    "DateCreated": "2019-04-01T04:59:00Z",
    "SubmissionStatusTypeID": 100
}