{
    "IsRecentlyVerified": false,
    "ID": 112848,
    "UUID": "D0E4E9F2-EEA8-46CF-A310-7FA05614D707",
    "DataProviderID": 1,
    "OperatorID": 80,
    "UsageTypeID": 4,
    "AddressInfo": {
        "ID": 113194,
        "Title": "Spezzano Piccolo | EnelX",
        "AddressLine1": "Via Roma",
        "Town": "Spezzano Piccolo",
        "StateOrProvince": "CS",
        "Postcode": "87050 ",
        "CountryID": 112,
        "Latitude": 39.2873191528672,
        "Longitude": 16.3437502210872,
        "ContactTelephone1": "800.069.850",
        "RelatedURL": "https://www.enelx.com/it/it/emobility",
        "DistanceUnit": 0
    },
    "Connections": [
        {
            "ID": 158937,
            "ConnectionTypeID": 25,
            "StatusTypeID": 50,
            "LevelID": 2,
            "Amps": 32,
            "Voltage": 400,
            "PowerKW": 22,
            "CurrentTypeID": 20,
            "Quantity": 2
        }
    ],
    "NumberOfPoints": 2,
    "GeneralComments": "Posizione esatta della colonnina da verificare",
    "StatusTypeID": 50,
    "DateLastStatusUpdate": "2019-08-06T14:01:00Z",
    "DataQualityLevel": 1,
    "DateCreated": "2018-11-21T10:27:00Z",
    "SubmissionStatusTypeID": 200
}