{
    "IsRecentlyVerified": false,
    "ID": 155378,
    "UUID": "F7D128FA-1AD7-4501-884A-B5753E7D5003",
    "DataProviderID": 1,
    "OperatorID": 23,
    "OperatorsReference": "53311",
    "UsageTypeID": 4,
    "AddressInfo": {
        "ID": 155732,
        "Title": "Hotel Viu",
        "AddressLine1": "152 Avenue Centrale",
        "Town": "Villars sur Ollon",
        "Postcode": "1884",
        "CountryID": 217,
        "Latitude": 46.294764,
        "Longitude": 7.055609,
        "ContactTelephone1": "+41 24 496 38 38",
        "DistanceUnit": 0
    },
    "Connections": [
        {
            "ID": 218761,
            "ConnectionTypeID": 30,
            "StatusTypeID": 50,
            "LevelID": 2,
            "PowerKW": 22,
            "CurrentTypeID": 20,
            "Quantity": 3
        }
    ],
    "NumberOfPoints": 3,
    "GeneralComments": "Charging3 Tesla Connector, up to 22kW.Available for customers. Please call ahead.",
    "StatusTypeID": 50,
    "DateLastStatusUpdate": "2020-04-09T05:45:00Z",
    "DataQualityLevel": 1,
    "DateCreated": "2020-04-09T05:45:00Z",
    "SubmissionStatusTypeID": 200
}