{
    "IsRecentlyVerified": false,
    "ID": 102515,
    "UUID": "577E2126-CF70-44F2-8F8C-A2D11F75E34A",
    "DataProviderID": 2,
    "DataProvidersReference": "92458",
    "OperatorID": 5,
    "UsageTypeID": 1,
    "AddressInfo": {
        "ID": 102861,
        "Title": "STUDIO",
        "AddressLine1": "River Rd",
        "Town": "Universal City",
        "StateOrProvince": "CA",
        "Postcode": "91608",
        "CountryID": 2,
        "Latitude": 34.1419979,
        "Longitude": -118.3447522,
        "ContactTelephone1": "888-758-4389",
        "AccessComments": "24 hours daily",
        "RelatedURL": "http://www.chargepoint.com/",
        "DistanceUnit": 0
    },
    "Connections": [
        {
            "ID": 144599,
            "ConnectionTypeID": 1,
            "LevelID": 2,
            "Amps": 16,
            "Voltage": 230,
            "PowerKW": 3,
            "CurrentTypeID": 10,
            "Quantity": 2
        }
    ],
    "DateLastStatusUpdate": "2019-04-06T04:01:00Z",
    "DataQualityLevel": 3,
    "DateCreated": "2018-04-21T04:13:00Z",
    "SubmissionStatusTypeID": 100
}