{
    "UserComments": [
        {
            "ID": 23034,
            "ChargePointID": 162182,
            "CommentTypeID": 50,
            "UserName": "interssl.com",
            "Comment": "The chargers are to the left after you have entered the garage. Do NOT go down to level -2, the way down is very VERY narrow and there are no chargers on -2.  The chargers are on level -1 on the very left (seen from entrance).",
            "Rating": 3,
            "DateCreated": "2020-08-05T17:51:19.99Z",
            "User": {
                "ID": 26760,
                "Username": "interssl.com"
            },
            "CheckinStatusTypeID": 140,
            "IsActionedByEditor": false
        }
    ],
    "MediaItems": [
        {
            "ID": 23901,
            "ChargePointID": 162182,
            "ItemURL": "https://s3-ap-southeast-2.amazonaws.com/openchargemap/images/AT/OCM162182/OCM-162182.orig.2020080517493887.jpg",
            "ItemThumbnailURL": "https://s3-ap-southeast-2.amazonaws.com/openchargemap/images/AT/OCM162182/OCM-162182.thmb.2020080517493887.jpg",
            "Comment": "",
            "IsEnabled": true,
            "IsVideo": false,
            "IsFeaturedItem": false,
            "IsExternalResource": false,
            "User": {
                "ID": 26760,
                "Username": "interssl.com"
            },
            "DateCreated": "2020-08-05T17:50:00Z"
        },
        {
            "ID": 23898,
            "ChargePointID": 162182,
            "ItemURL": "https://s3-ap-southeast-2.amazonaws.com/openchargemap/images/AT/OCM162182/OCM-162182.orig.2020080517485877.jpg",
            "ItemThumbnailURL": "https://s3-ap-southeast-2.amazonaws.com/openchargemap/images/AT/OCM162182/OCM-162182.thmb.2020080517485877.jpg",
            "Comment": "",
            "IsEnabled": true,
            "IsVideo": false,
            "IsFeaturedItem": false,
            "IsExternalResource": false,
            "User": {
                "ID": 26760,
                "Username": "interssl.com"
            },
            "DateCreated": "2020-08-05T17:49:00Z"
        },
        {
            "ID": 23899,
            "ChargePointID": 162182,
            "ItemURL": "https://s3-ap-southeast-2.amazonaws.com/openchargemap/images/AT/OCM162182/OCM-162182.orig.2020080517491178.jpg",
            "ItemThumbnailURL": "https://s3-ap-southeast-2.amazonaws.com/openchargemap/images/AT/OCM162182/OCM-162182.thmb.2020080517491178.jpg",
            "Comment": "",
            "IsEnabled": true,
            "IsVideo": false,
            "IsFeaturedItem": false,
            "IsExternalResource": false,
            "User": {
                "ID": 26760,
                "Username": "interssl.com"
            },
            "DateCreated": "2020-08-05T17:49:00Z"
        },
        {
            "ID": 23900,
            "ChargePointID": 162182,
            "ItemURL": "https://s3-ap-southeast-2.amazonaws.com/openchargemap/images/AT/OCM162182/OCM-162182.orig.2020080517492539.jpg",
            "ItemThumbnailURL": "https://s3-ap-southeast-2.amazonaws.com/openchargemap/images/AT/OCM162182/OCM-162182.thmb.2020080517492539.jpg",
            "Comment": "",
            "IsEnabled": true,
            "IsVideo": false,
            "IsFeaturedItem": false,
            "IsExternalResource": false,
            "User": {
                "ID": 26760,
                "Username": "interssl.com"
            },
            "DateCreated": "2020-08-05T17:49:00Z"
        }
    ],
    "IsRecentlyVerified": false,
    "ID": 162182,
    "UUID": "4FA4D740-D332-4D7F-9786-73B773F77D30",
    "DataProviderID": 1,
    "OperatorID": 1,
    "UsageTypeID": 1,
    "UsageCost": "paid charging, paid parking",
    "AddressInfo": {
        "ID": 162539,
        "Title": "PG Untere Stadt",
        "AddressLine1": "Fassergasse",
        "AddressLine2": "Heiligkreuz",
        "Town": "Stadt Hall in Tirol",
        "StateOrProvince": "Bezirk Innsbruck-Land",
        "Postcode": "6060",
        "CountryID": 19,
        "Latitude": 47.280849736955474,
        "Longitude": 11.504039894056405,
        "DistanceUnit": 0
    },
    "Connections": [
        {
            "ID": 233402,
            "ConnectionTypeID": 25,
            "StatusTypeID": 50,
            "LevelID": 2,
            "Amps": 32,
            "PowerKW": 22,
            "CurrentTypeID": 20,
            "Quantity": 3
        }
    ],
    "NumberOfPoints": 3,
    "StatusTypeID": 50,
    "DateLastStatusUpdate": "2020-08-05T17:51:00Z",
    "DataQualityLevel": 1,
    "DateCreated": "2020-08-02T11:06:00Z",
    "SubmissionStatusTypeID": 200
}