{
    "IsRecentlyVerified": false,
    "ID": 111182,
    "UUID": "E0F651F7-7017-41DB-BE07-E74DE0CA8BE9",
    "DataProviderID": 2,
    "DataProvidersReference": "92575",
    "OperatorID": 5,
    "UsageTypeID": 1,
    "AddressInfo": {
        "ID": 111528,
        "Title": "BRUCE POWER",
        "AddressLine1": "177 Tie Rd",
        "Town": "Tiverton",
        "StateOrProvince": "ON",
        "Postcode": "NOG 2T0",
        "CountryID": 44,
        "Latitude": 44.3369007,
        "Longitude": -81.5713445,
        "ContactTelephone1": "888-758-4389",
        "AccessComments": "24 hours daily",
        "RelatedURL": "http://www.chargepoint.com/",
        "DistanceUnit": 0
    },
    "Connections": [
        {
            "ID": 156555,
            "ConnectionTypeID": 1,
            "LevelID": 2,
            "Amps": 16,
            "Voltage": 230,
            "PowerKW": 3,
            "CurrentTypeID": 10,
            "Quantity": 2
        }
    ],
    "DateLastStatusUpdate": "2019-12-24T09:22:00Z",
    "DataQualityLevel": 3,
    "DateCreated": "2018-10-18T23:36:00Z",
    "SubmissionStatusTypeID": 100
}