{
    "IsRecentlyVerified": false,
    "ID": 24389,
    "UUID": "F83E5D9A-3753-481C-AA85-CB1C176965BD",
    "DataProviderID": 1,
    "OperatorID": 22,
    "OperatorsReference": "C7GDS",
    "UsageTypeID": 4,
    "UsageCost": "Free",
    "AddressInfo": {
        "ID": 24735,
        "Title": "Stranorlar",
        "AddressLine1": "Main Street",
        "Town": "Stranorlar",
        "StateOrProvince": "County Donegal",
        "CountryID": 3,
        "Latitude": 54.8049023691974,
        "Longitude": -7.7689003944397,
        "DistanceUnit": 0
    },
    "Connections": [
        {
            "ID": 26570,
            "ConnectionTypeID": 25,
            "StatusTypeID": 50,
            "LevelID": 2,
            "Amps": 32,
            "Voltage": 400,
            "PowerKW": 22,
            "CurrentTypeID": 20,
            "Quantity": 2
        }
    ],
    "NumberOfPoints": 2,
    "GeneralComments": "on street charger opposite hotel beside junction",
    "StatusTypeID": 50,
    "DateLastStatusUpdate": "2019-06-03T09:42:00Z",
    "DataQualityLevel": 1,
    "DateCreated": "2014-09-11T19:57:00Z",
    "SubmissionStatusTypeID": 200
}