{
    "MediaItems": [
        {
            "ID": 9241,
            "ChargePointID": 65032,
            "ItemURL": "https://s3-ap-southeast-2.amazonaws.com/openchargemap/images/IT/OCM65032/OCM-65032.orig.2017011816264903.jpg",
            "ItemThumbnailURL": "https://s3-ap-southeast-2.amazonaws.com/openchargemap/images/IT/OCM65032/OCM-65032.thmb.2017011816264903.jpg",
            "Comment": "",
            "IsEnabled": true,
            "IsVideo": false,
            "IsFeaturedItem": false,
            "IsExternalResource": false,
            "User": {
                "ID": 12207,
                "Username": "aldodal"
            },
            "DateCreated": "2017-01-18T16:27:00Z"
        }
    ],
    "IsRecentlyVerified": false,
    "ID": 65032,
    "UUID": "D0CA0CB6-2F2E-4006-972B-BB2C79E6F717",
    "DataProviderID": 1,
    "OperatorID": 1,
    "UsageTypeID": 6,
    "UsageCost": "2€/h",
    "AddressInfo": {
        "ID": 65378,
        "Title": " Hotel Savoy",
        "AddressLine1": "Via Carducci 33",
        "Town": "Grado",
        "StateOrProvince": "GO",
        "Postcode": "34073",
        "CountryID": 112,
        "Latitude": 45.6781966984701,
        "Longitude": 13.3936948085205,
        "ContactTelephone1": "0039 0431 897111",
        "ContactEmail": "reservation@hotelsavoy-grado.it",
        "RelatedURL": "http://www.hotelsavoy-grado.it/",
        "DistanceUnit": 0
    },
    "Connections": [
        {
            "ID": 83706,
            "ConnectionTypeID": 25,
            "StatusTypeID": 50,
            "LevelID": 2,
            "Amps": 32,
            "Voltage": 240,
            "PowerKW": 7,
            "CurrentTypeID": 10,
            "Quantity": 2
        }
    ],
    "NumberOfPoints": 2,
    "StatusTypeID": 50,
    "DateLastStatusUpdate": "2017-01-18T16:33:00Z",
    "DataQualityLevel": 1,
    "DateCreated": "2016-04-05T14:42:00Z",
    "SubmissionStatusTypeID": 200
}