{
    "IsRecentlyVerified": false,
    "ID": 182114,
    "UUID": "88FFEAB6-9C4F-4FCD-8432-0D49AE23E02E",
    "DataProviderID": 29,
    "DataProvidersReference": "19701",
    "AddressInfo": {
        "ID": 182473,
        "Title": "Große Langgasse 11",
        "AddressLine1": "Große Langgasse 11",
        "Town": "Mainz",
        "Postcode": "55116",
        "CountryID": 87,
        "Latitude": 50.000024,
        "Longitude": 8.266562,
        "DistanceUnit": 0
    },
    "Connections": [
        {
            "ID": 287450,
            "ConnectionTypeID": 25,
            "StatusTypeID": 50,
            "LevelID": 2,
            "PowerKW": 22,
            "CurrentTypeID": 20
        },
        {
            "ID": 287451,
            "ConnectionTypeID": 25,
            "StatusTypeID": 50,
            "LevelID": 2,
            "PowerKW": 22,
            "CurrentTypeID": 20
        }
    ],
    "StatusTypeID": 50,
    "DateLastStatusUpdate": "2021-07-12T02:44:00Z",
    "MetadataValues": [
        {
            "ID": 14408,
            "MetadataFieldID": 4,
            "ItemValue": "Data from the German chargepoint registry provided by Bundesnetzagentur.de under the CC-BY 4.0 license"
        }
    ],
    "DataQualityLevel": 3,
    "DateCreated": "2021-07-08T10:02:00Z",
    "SubmissionStatusTypeID": 100
}