{
    "UserComments": [
        {
            "ID": 24038,
            "ChargePointID": 107717,
            "CommentTypeID": 10,
            "UserName": "hlinden",
            "Comment": "20kW CCS, Opel Corsa-e",
            "Rating": 5,
            "DateCreated": "2021-03-19T20:21:22.49Z",
            "User": {
                "ID": 27699,
                "Username": "hlinden"
            },
            "CheckinStatusTypeID": 10,
            "IsActionedByEditor": false
        }
    ],
    "IsRecentlyVerified": false,
    "ID": 107717,
    "UUID": "9B183585-B534-4BDB-B01B-B211A00D21AD",
    "DataProviderID": 1,
    "OperatorID": 45,
    "UsageTypeID": 1,
    "AddressInfo": {
        "ID": 108063,
        "Title": "Möbelhaus IKEA",
        "AddressLine1": "Kamen Karree 1",
        "Town": "Kamen",
        "StateOrProvince": "Kreis Unna",
        "Postcode": "59174",
        "CountryID": 87,
        "Latitude": 51.57045092249958,
        "Longitude": 7.6694424613770025,
        "RelatedURL": "http://www.ikea.de/",
        "DistanceUnit": 0
    },
    "Connections": [
        {
            "ID": 152084,
            "ConnectionTypeID": 2,
            "StatusTypeID": 50,
            "LevelID": 3,
            "PowerKW": 20,
            "CurrentTypeID": 30,
            "Quantity": 2
        },
        {
            "ID": 152085,
            "ConnectionTypeID": 33,
            "StatusTypeID": 50,
            "LevelID": 3,
            "PowerKW": 20,
            "CurrentTypeID": 30,
            "Quantity": 2
        },
        {
            "ID": 152086,
            "ConnectionTypeID": 1036,
            "StatusTypeID": 50,
            "LevelID": 2,
            "Amps": 63,
            "Voltage": 400,
            "PowerKW": 22,
            "CurrentTypeID": 20,
            "Quantity": 2
        }
    ],
    "NumberOfPoints": 6,
    "GeneralComments": "Direkt neben dem Eingang auf den ehemaligen Familienparkplätzen. Kostenlos nutzbar von Mo-Sa 10-20Uhr.",
    "StatusTypeID": 50,
    "DateLastStatusUpdate": "2021-03-19T20:21:00Z",
    "DataQualityLevel": 1,
    "DateCreated": "2018-08-08T06:20:00Z",
    "SubmissionStatusTypeID": 200
}