{
    "IsRecentlyVerified": false,
    "ID": 109399,
    "UUID": "741562E5-87EF-4071-BF63-1C53DDADFB92",
    "DataProviderID": 1,
    "OperatorID": 2242,
    "UsageTypeID": 4,
    "UsageCost": "Depends on membership ",
    "AddressInfo": {
        "ID": 109745,
        "Title": "Am Schloss ",
        "AddressLine1": "Domplatz ",
        "AddressLine2": "",
        "Town": "Fulda ",
        "StateOrProvince": "Hessen",
        "Postcode": "36037",
        "CountryID": 87,
        "Latitude": 50.553541,
        "Longitude": 9.672668,
        "ContactTelephone1": "",
        "ContactTelephone2": "",
        "ContactEmail": "",
        "AccessComments": "RhönEnergy",
        "RelatedURL": "",
        "DistanceUnit": 0
    },
    "Connections": [
        {
            "ID": 154525,
            "ConnectionTypeID": 25,
            "StatusTypeID": 10,
            "LevelID": 2,
            "PowerKW": 22,
            "CurrentTypeID": 20,
            "Quantity": 2
        },
        {
            "ID": 154526,
            "ConnectionTypeID": 25,
            "StatusTypeID": 10,
            "LevelID": 2,
            "Amps": 16,
            "Voltage": 230,
            "PowerKW": 11,
            "CurrentTypeID": 20,
            "Quantity": 2
        }
    ],
    "NumberOfPoints": 2,
    "GeneralComments": "Kann zb mit newmotion oder Ladenetz gestartet werden ",
    "StatusTypeID": 10,
    "DateLastStatusUpdate": "2018-10-14T15:00:00Z",
    "DataQualityLevel": 1,
    "DateCreated": "2018-10-12T12:07:00Z",
    "SubmissionStatusTypeID": 200
}