{
    "IsRecentlyVerified": false,
    "ID": 95447,
    "UUID": "11888CCC-80F9-4413-9068-FE3424C984C5",
    "DataProviderID": 1,
    "OperatorID": 3,
    "OperatorsReference": "PG-92150,PG-92153",
    "UsageTypeID": 4,
    "UsageCost": "Free for 2 hours,then £1.50/hour",
    "AddressInfo": {
        "ID": 95793,
        "Title": "The Octagon Shopping Centre",
        "AddressLine1": "New Street",
        "Town": "Staffordshire",
        "Postcode": "DE14 3TN",
        "CountryID": 1,
        "Latitude": 52.800232,
        "Longitude": -1.634706,
        "DistanceUnit": 0
    },
    "Connections": [
        {
            "ID": 135225,
            "ConnectionTypeID": 25,
            "StatusTypeID": 50,
            "LevelID": 2,
            "Amps": 32,
            "Voltage": 230,
            "PowerKW": 7,
            "CurrentTypeID": 10,
            "Quantity": 2
        }
    ],
    "NumberOfPoints": 2,
    "GeneralComments": "This is an open charge unit installed in The Octagon Shopping Centre car park in New Street, Burton upon Trent",
    "StatusTypeID": 50,
    "DateLastStatusUpdate": "2021-03-08T11:47:00Z",
    "DataQualityLevel": 1,
    "DateCreated": "2017-11-11T06:21:00Z",
    "SubmissionStatusTypeID": 200
}