{
    "IsRecentlyVerified": false,
    "ID": 175739,
    "UUID": "5F4AE9AA-2089-478A-A5B8-ADF528104F8B",
    "DataProviderID": 1,
    "OperatorID": 1,
    "UsageTypeID": 1,
    "UsageCost": "Free of charge",
    "AddressInfo": {
        "ID": 176098,
        "Title": "bike energy Ladestation",
        "AddressLine1": "36 Stadtplatz",
        "Town": "Neustadt a.d.Waldnaab",
        "StateOrProvince": "Free State of Bavaria",
        "Postcode": "92660",
        "CountryID": 87,
        "Latitude": 49.73087275542065,
        "Longitude": 12.172638493440445,
        "ContactTelephone1": "+499602791060",
        "DistanceUnit": 0
    },
    "Connections": [
        {
            "ID": 272907,
            "ConnectionTypeID": 28,
            "StatusTypeID": 50,
            "LevelID": 1,
            "Amps": 10,
            "Voltage": 230,
            "PowerKW": 2.3,
            "CurrentTypeID": 10,
            "Quantity": 1
        },
        {
            "ID": 272908,
            "ConnectionTypeID": 0,
            "StatusTypeID": 50,
            "Quantity": 1,
            "Comments": "3 magnetic sockets for proprietary Bike Energy L3B cables. Can be borrowed free of charge from the tourist information office 20 m further on at Stadtplatz 34."
        }
    ],
    "NumberOfPoints": 3,
    "StatusTypeID": 50,
    "DateLastStatusUpdate": "2021-06-12T08:46:00Z",
    "DataQualityLevel": 1,
    "DateCreated": "2021-06-10T15:41:00Z",
    "SubmissionStatusTypeID": 200
}