{
    "IsRecentlyVerified": false,
    "ID": 95580,
    "UUID": "264698DC-6A46-4401-9D45-688FB96259E5",
    "DataProviderID": 1,
    "OperatorID": 150,
    "OperatorsReference": "Linlithgow",
    "UsageTypeID": 6,
    "UsageCost": "Â£0.40 + Â£0.13/kWh",
    "AddressInfo": {
        "ID": 95926,
        "Title": "Oracle Linlithgow",
        "AddressLine1": "Blackness Road",
        "AddressLine2": "Springfield",
        "Town": "Linlithgow",
        "StateOrProvince": "West Lothian",
        "Postcode": "EH49 7LR",
        "CountryID": 1,
        "Latitude": 55.984682,
        "Longitude": -3.579938,
        "RelatedURL": "https://www.oracle.com/uk/corporate/contact/field-offices.html",
        "DistanceUnit": 0
    },
    "Connections": [
        {
            "ID": 135384,
            "ConnectionTypeID": 25,
            "StatusTypeID": 50,
            "LevelID": 2,
            "Amps": 32,
            "Voltage": 230,
            "PowerKW": 7,
            "CurrentTypeID": 10,
            "Quantity": 4
        }
    ],
    "NumberOfPoints": 4,
    "StatusTypeID": 0,
    "DateLastStatusUpdate": "2018-11-02T08:48:00Z",
    "DataQualityLevel": 1,
    "DateCreated": "2017-11-13T14:30:00Z",
    "SubmissionStatusTypeID": 200
}