{
    "IsRecentlyVerified": false,
    "ID": 105629,
    "UUID": "F119DB35-AA95-44FA-80B7-845DC2621D5F",
    "DataProviderID": 2,
    "DataProvidersReference": "98619",
    "UsageTypeID": 2,
    "AddressInfo": {
        "ID": 105975,
        "Title": "Camp Pendleton Marine Corps Base",
        "AddressLine1": "11th St",
        "Town": "Camp Pendleton",
        "StateOrProvince": "CA",
        "Postcode": "92055",
        "CountryID": 2,
        "Latitude": 33.295445,
        "Longitude": -117.344939,
        "ContactTelephone1": "",
        "AccessComments": "Fleet use only",
        "RelatedURL": "",
        "DistanceUnit": 0
    },
    "Connections": [
        {
            "ID": 148817,
            "ConnectionTypeID": 1,
            "LevelID": 2,
            "Amps": 16,
            "Voltage": 230,
            "PowerKW": 3,
            "CurrentTypeID": 10,
            "Quantity": 1
        }
    ],
    "DateLastStatusUpdate": "2019-04-06T04:01:00Z",
    "DataQualityLevel": 3,
    "DateCreated": "2018-06-09T04:01:00Z",
    "SubmissionStatusTypeID": 100
}