{
    "UserComments": [
        {
            "ID": 17340,
            "ChargePointID": 54282,
            "CommentTypeID": 10,
            "UserName": "polianto",
            "Comment": "La ricarica non è più gratuita, per avviare la carica ho utilizzato con successo il badge evway",
            "Rating": 4,
            "DateCreated": "2017-05-28T18:07:13.773Z",
            "User": {
                "ID": 1606,
                "Username": "polianto"
            },
            "CheckinStatusTypeID": 10
        },
        {
            "ID": 11579,
            "ChargePointID": 54282,
            "CommentTypeID": 10,
            "UserName": "Christian Schlaepfer",
            "Comment": "Ottima posizione vicino al centro",
            "Rating": 5,
            "DateCreated": "2016-06-07T17:32:24.453Z",
            "User": {
                "ID": 2320,
                "Username": "Christian Schlaepfer"
            },
            "CheckinStatusTypeID": 10
        },
        {
            "ID": 11547,
            "ChargePointID": 54282,
            "CommentTypeID": 10,
            "UserName": "mark23",
            "Comment": "VW dealership but accessible easily from road. Currently free and all 4 tethered cable and connector types",
            "Rating": 4,
            "DateCreated": "2016-06-03T06:28:09.84Z",
            "User": {
                "ID": 9448,
                "Username": "mark23"
            },
            "CheckinStatusTypeID": 10
        }
    ],
    "MediaItems": [
        {
            "ID": 12589,
            "ChargePointID": 54282,
            "ItemURL": "https://s3-ap-southeast-2.amazonaws.com/openchargemap/images/CH/OCM54282/OCM-54282.orig.2017052818091628.jpg",
            "ItemThumbnailURL": "https://s3-ap-southeast-2.amazonaws.com/openchargemap/images/CH/OCM54282/OCM-54282.thmb.2017052818091628.jpg",
            "Comment": "",
            "IsEnabled": true,
            "IsVideo": false,
            "IsFeaturedItem": false,
            "IsExternalResource": false,
            "User": {
                "ID": 1606,
                "Username": "polianto"
            },
            "DateCreated": "2017-05-28T18:09:00Z"
        },
        {
            "ID": 12587,
            "ChargePointID": 54282,
            "ItemURL": "https://s3-ap-southeast-2.amazonaws.com/openchargemap/images/CH/OCM54282/OCM-54282.orig.2017052818042340.jpg",
            "ItemThumbnailURL": "https://s3-ap-southeast-2.amazonaws.com/openchargemap/images/CH/OCM54282/OCM-54282.thmb.2017052818042340.jpg",
            "Comment": "",
            "IsEnabled": true,
            "IsVideo": false,
            "IsFeaturedItem": false,
            "IsExternalResource": false,
            "User": {
                "ID": 1606,
                "Username": "polianto"
            },
            "DateCreated": "2017-05-28T18:05:00Z"
        },
        {
            "ID": 12588,
            "ChargePointID": 54282,
            "ItemURL": "https://s3-ap-southeast-2.amazonaws.com/openchargemap/images/CH/OCM54282/OCM-54282.orig.2017052818044406.jpg",
            "ItemThumbnailURL": "https://s3-ap-southeast-2.amazonaws.com/openchargemap/images/CH/OCM54282/OCM-54282.thmb.2017052818044406.jpg",
            "Comment": "",
            "IsEnabled": true,
            "IsVideo": false,
            "IsFeaturedItem": false,
            "IsExternalResource": false,
            "User": {
                "ID": 1606,
                "Username": "polianto"
            },
            "DateCreated": "2017-05-28T18:05:00Z"
        },
        {
            "ID": 6579,
            "ChargePointID": 54282,
            "ItemURL": "https://s3-ap-southeast-2.amazonaws.com/openchargemap/images/CH/OCM54282/OCM-54282.orig.2016060717313568.jpeg",
            "ItemThumbnailURL": "https://s3-ap-southeast-2.amazonaws.com/openchargemap/images/CH/OCM54282/OCM-54282.thmb.2016060717313568.jpeg",
            "Comment": "",
            "IsEnabled": true,
            "IsVideo": false,
            "IsFeaturedItem": false,
            "IsExternalResource": false,
            "User": {
                "ID": 2320,
                "Username": "Christian Schlaepfer"
            },
            "DateCreated": "2016-06-07T17:32:00Z"
        },
        {
            "ID": 6578,
            "ChargePointID": 54282,
            "ItemURL": "https://s3-ap-southeast-2.amazonaws.com/openchargemap/images/CH/OCM54282/OCM-54282.orig.2016060717311009.jpeg",
            "ItemThumbnailURL": "https://s3-ap-southeast-2.amazonaws.com/openchargemap/images/CH/OCM54282/OCM-54282.thmb.2016060717311009.jpeg",
            "Comment": "",
            "IsEnabled": true,
            "IsVideo": false,
            "IsFeaturedItem": false,
            "IsExternalResource": false,
            "User": {
                "ID": 2320,
                "Username": "Christian Schlaepfer"
            },
            "DateCreated": "2016-06-07T17:31:00Z"
        }
    ],
    "IsRecentlyVerified": false,
    "ID": 54282,
    "UUID": "DD4361EE-18F3-4542-A531-71F9D7D142AB",
    "DataProviderID": 1,
    "OperatorID": 110,
    "UsageTypeID": 4,
    "AddressInfo": {
        "ID": 54628,
        "Title": "Amag Evite",
        "AddressLine1": "Via Monte Boglia",
        "AddressLine2": "Via Giacomo e Filippo Ciani",
        "Town": "Lugano",
        "StateOrProvince": "Ticino",
        "CountryID": 217,
        "Latitude": 46.017135161783,
        "Longitude": 8.9617164630432,
        "RelatedURL": "http://www.swiss-emobility.ch",
        "DistanceUnit": 0
    },
    "Connections": [
        {
            "ID": 68335,
            "ConnectionTypeID": 2,
            "StatusTypeID": 50,
            "LevelID": 3,
            "PowerKW": 50,
            "CurrentTypeID": 30,
            "Quantity": 1
        },
        {
            "ID": 68336,
            "ConnectionTypeID": 25,
            "StatusTypeID": 50,
            "LevelID": 2,
            "Amps": 32,
            "Voltage": 400,
            "PowerKW": 22,
            "CurrentTypeID": 20,
            "Quantity": 1
        },
        {
            "ID": 68337,
            "ConnectionTypeID": 33,
            "StatusTypeID": 50,
            "LevelID": 3,
            "PowerKW": 50,
            "CurrentTypeID": 30,
            "Quantity": 1
        }
    ],
    "NumberOfPoints": 2,
    "StatusTypeID": 50,
    "DateLastStatusUpdate": "2017-05-28T20:44:00Z",
    "DataQualityLevel": 1,
    "DateCreated": "2015-09-25T17:00:00Z",
    "SubmissionStatusTypeID": 200
}