{
    "IsRecentlyVerified": false,
    "ID": 119497,
    "UUID": "2308561E-AF4C-4F3D-B264-09F17B0CD36D",
    "DataProviderID": 2,
    "DataProvidersReference": "113807",
    "OperatorID": 23,
    "UsageTypeID": 1,
    "AddressInfo": {
        "ID": 119843,
        "Title": "Hyatt Place / Faro Blanco Resort & Yacht Club - Tesla Destination",
        "AddressLine1": "1996  Overseas Hwy",
        "Town": "Marathon",
        "StateOrProvince": "FL",
        "Postcode": "33050",
        "CountryID": 2,
        "Latitude": 24.71098,
        "Longitude": -81.10521,
        "ContactTelephone1": "305-743-1234  877-798-3752",
        "AccessComments": "24 hours daily; for customer use only",
        "RelatedURL": "https://www.tesla.com/destination-charging",
        "DistanceUnit": 0
    },
    "Connections": [
        {
            "ID": 168768,
            "ConnectionTypeID": 30,
            "LevelID": 2,
            "Amps": 16,
            "Voltage": 230,
            "PowerKW": 3.7,
            "CurrentTypeID": 10,
            "Quantity": 3
        }
    ],
    "DateLastStatusUpdate": "2020-06-26T02:52:00Z",
    "DataQualityLevel": 3,
    "DateCreated": "2019-04-01T04:59:00Z",
    "SubmissionStatusTypeID": 100
}