{
    "IsRecentlyVerified": false,
    "ID": 50599,
    "UUID": "140F632A-3AB4-4C48-A9B9-3E74E3CDC17C",
    "DataProviderID": 26,
    "DataProvidersReference": "64683",
    "OperatorID": 178,
    "OperatorsReference": "EVnetNL PNB-REE0110",
    "UsageCost": "0.00 jaarabonnement",
    "AddressInfo": {
        "ID": 50945,
        "Title": "Wegedoornlaan 2",
        "AddressLine1": "Wegedoornlaan 2",
        "Town": "Eindhoven",
        "Postcode": "5646 AC",
        "CountryID": 159,
        "Latitude": 51.416182,
        "Longitude": 5.502173,
        "ContactTelephone1": "0800-3522365",
        "RelatedURL": "http://www.evnet.nl",
        "DistanceUnit": 0
    },
    "Connections": [
        {
            "ID": 62369,
            "ConnectionTypeID": 25,
            "LevelID": 2,
            "PowerKW": 11,
            "CurrentTypeID": 10
        }
    ],
    "NumberOfPoints": 1,
    "StatusTypeID": 50,
    "DateLastStatusUpdate": "2016-06-04T02:38:00Z",
    "DataQualityLevel": 3,
    "DateCreated": "2015-07-22T09:53:00Z",
    "SubmissionStatusTypeID": 100
}