{
    "IsRecentlyVerified": false,
    "ID": 16206,
    "UUID": "F2077259-58F9-497D-B223-534C4783B1E7",
    "DataProviderID": 1,
    "OperatorID": 47,
    "UsageTypeID": 1,
    "UsageCost": "gebruik van laadpas van iedere nederlandse aanbieder",
    "AddressInfo": {
        "ID": 16551,
        "Title": "Plus Verbeeten Vierlingsbeek",
        "AddressLine1": "Spoorstraat 6",
        "AddressLine2": "",
        "Town": "Vierlingsbeek",
        "StateOrProvince": "",
        "Postcode": "5821BD",
        "CountryID": 159,
        "Latitude": 51.596496,
        "Longitude": 6.010058,
        "ContactTelephone1": "",
        "ContactTelephone2": "",
        "ContactEmail": "",
        "AccessComments": "Zijkant BibloBeek",
        "RelatedURL": "http://www.plusverbeeten.nl",
        "DistanceUnit": 0
    },
    "Connections": [
        {
            "ID": 14634,
            "ConnectionTypeID": 25,
            "StatusTypeID": 50,
            "LevelID": 2,
            "Amps": 16,
            "Voltage": 230,
            "PowerKW": 3.7,
            "Quantity": 1
        }
    ],
    "NumberOfPoints": 1,
    "GeneralComments": "",
    "StatusTypeID": 50,
    "DateLastStatusUpdate": "2013-03-13T05:38:00Z",
    "DataQualityLevel": 1,
    "DateCreated": "2013-03-11T17:55:00Z",
    "SubmissionStatusTypeID": 200
}