{
    "IsRecentlyVerified": false,
    "ID": 183443,
    "UUID": "55A19DF4-941B-468B-A243-F8C4E69CC27E",
    "DataProviderID": 29,
    "DataProvidersReference": "7636",
    "AddressInfo": {
        "ID": 183802,
        "Title": "Nußdorfer Str. 101",
        "AddressLine1": "Nußdorfer Str. 101",
        "Town": "Überlingen",
        "Postcode": "88662",
        "CountryID": 87,
        "Latitude": 47.754222,
        "Longitude": 9.189806,
        "DistanceUnit": 0
    },
    "Connections": [
        {
            "ID": 290437,
            "ConnectionTypeID": 25,
            "StatusTypeID": 50,
            "LevelID": 2,
            "PowerKW": 22,
            "CurrentTypeID": 20
        },
        {
            "ID": 290438,
            "ConnectionTypeID": 25,
            "StatusTypeID": 50,
            "LevelID": 2,
            "PowerKW": 22,
            "CurrentTypeID": 20
        }
    ],
    "StatusTypeID": 50,
    "DateLastStatusUpdate": "2021-07-12T02:39:00Z",
    "MetadataValues": [
        {
            "ID": 15736,
            "MetadataFieldID": 4,
            "ItemValue": "Data from the German chargepoint registry provided by Bundesnetzagentur.de under the CC-BY 4.0 license"
        }
    ],
    "DataQualityLevel": 3,
    "DateCreated": "2021-07-08T10:04:00Z",
    "SubmissionStatusTypeID": 100
}