{
    "IsRecentlyVerified": false,
    "ID": 63753,
    "UUID": "F8B77E0B-E2C3-41D3-8136-ABB317BCAD38",
    "DataProviderID": 26,
    "DataProvidersReference": "78226",
    "OperatorID": 157,
    "OperatorsReference": "NewMotion 03002759",
    "UsageCost": "0.00 jaarabonnement",
    "AddressInfo": {
        "ID": 64099,
        "Title": "Arnhemseweg 97",
        "AddressLine1": "Arnhemseweg 97",
        "Town": "Apeldoorn",
        "Postcode": "7331 BD",
        "CountryID": 159,
        "Latitude": 52.2033393,
        "Longitude": 5.9603621,
        "ContactTelephone1": "088 0109500",
        "RelatedURL": "http://thenewmotion.nl/",
        "DistanceUnit": 0
    },
    "Connections": [
        {
            "ID": 81428,
            "ConnectionTypeID": 25,
            "LevelID": 2,
            "PowerKW": 22,
            "CurrentTypeID": 10
        }
    ],
    "NumberOfPoints": 1,
    "StatusTypeID": 50,
    "DateLastStatusUpdate": "2016-06-04T02:51:00Z",
    "DataQualityLevel": 3,
    "DateCreated": "2016-03-03T12:31:00Z",
    "SubmissionStatusTypeID": 100
}