{
    "IsRecentlyVerified": false,
    "ID": 101408,
    "UUID": "4080882A-A244-4158-A7D0-733C8EC2959C",
    "DataProviderID": 1,
    "OperatorID": 3272,
    "UsageTypeID": 4,
    "AddressInfo": {
        "ID": 101754,
        "Title": "Emotì Evpass Swissminiatur",
        "AddressLine1": "Via alla Bola",
        "Town": "Melide",
        "StateOrProvince": "Distretto di Lugano",
        "Postcode": "6815",
        "CountryID": 217,
        "Latitude": 45.95422930048277,
        "Longitude": 8.94969231769619,
        "ContactTelephone1": "+41 91 946 39 28",
        "ContactTelephone2": "+41 58 221 96 60",
        "RelatedURL": "https://emoti.evpass.ch/",
        "DistanceUnit": 0
    },
    "Connections": [
        {
            "ID": 143179,
            "ConnectionTypeID": 1036,
            "StatusTypeID": 50,
            "LevelID": 2,
            "Amps": 32,
            "Voltage": 400,
            "PowerKW": 22,
            "CurrentTypeID": 20,
            "Quantity": 2
        },
        {
            "ID": 143180,
            "ConnectionTypeID": 1,
            "StatusTypeID": 50,
            "LevelID": 2,
            "Amps": 32,
            "Voltage": 240,
            "PowerKW": 7,
            "CurrentTypeID": 10,
            "Quantity": 2
        },
        {
            "ID": 143181,
            "ConnectionTypeID": 1037,
            "StatusTypeID": 50,
            "LevelID": 2,
            "Amps": 16,
            "Voltage": 240,
            "PowerKW": 3.7,
            "CurrentTypeID": 10,
            "Quantity": 2
        }
    ],
    "NumberOfPoints": 2,
    "StatusTypeID": 50,
    "DateLastStatusUpdate": "2018-03-27T15:35:00Z",
    "DataQualityLevel": 1,
    "DateCreated": "2018-03-27T15:35:00Z",
    "SubmissionStatusTypeID": 200
}