{
    "IsRecentlyVerified": false,
    "ID": 65061,
    "UUID": "07195763-F188-4C66-8B60-E7FBE8BB3994",
    "DataProviderID": 1,
    "OperatorID": 45,
    "UsageTypeID": 3,
    "AddressInfo": {
        "ID": 65407,
        "Title": "Carmeq",
        "AddressLine1": "Carnotstraße 4",
        "AddressLine2": "Charlottenburg",
        "Town": "Berlin",
        "StateOrProvince": "Berlin",
        "Postcode": "10587",
        "CountryID": 87,
        "Latitude": 52.52379218680711,
        "Longitude": 13.3206803749382,
        "ContactTelephone1": "+49 30 3983537-0",
        "AccessComments": "Ladekarte am Empfang von Carmeq, daher ist das Laden nur zu den Geschäftszeiten möglich.",
        "RelatedURL": "http://www.carmeq.de/aktuelles-erste-gleich-und-wechselstromschnellladesaeule.html",
        "DistanceUnit": 0
    },
    "Connections": [
        {
            "ID": 83757,
            "ConnectionTypeID": 33,
            "StatusTypeID": 50,
            "LevelID": 3,
            "PowerKW": 20,
            "CurrentTypeID": 30,
            "Quantity": 1
        },
        {
            "ID": 83758,
            "ConnectionTypeID": 25,
            "StatusTypeID": 50,
            "LevelID": 2,
            "Amps": 32,
            "Voltage": 400,
            "PowerKW": 22,
            "CurrentTypeID": 20,
            "Quantity": 1
        },
        {
            "ID": 83759,
            "ConnectionTypeID": 28,
            "StatusTypeID": 50,
            "LevelID": 2,
            "Amps": 16,
            "Voltage": 230,
            "PowerKW": 3.7,
            "CurrentTypeID": 10,
            "Quantity": 1
        }
    ],
    "NumberOfPoints": 2,
    "StatusTypeID": 50,
    "DateLastStatusUpdate": "2016-04-07T07:41:00Z",
    "DataQualityLevel": 1,
    "DateCreated": "2016-04-07T07:41:00Z",
    "SubmissionStatusTypeID": 200
}