{
    "IsRecentlyVerified": false,
    "ID": 153382,
    "UUID": "077AED84-96CF-4A2C-BBEA-A15DED5397B1",
    "DataProviderID": 28,
    "DataProvidersReference": "FRS29PSDE29YHKE",
    "OperatorID": 3379,
    "UsageTypeID": 5,
    "AddressInfo": {
        "ID": 153735,
        "Title": "Quimper - Croix des gardiens",
        "AddressLine1": "Croix des gardiens - 29232 Quimper",
        "CountryID": 80,
        "Latitude": 48.01109,
        "Longitude": -4.095197,
        "AccessComments": "24/24_7/7",
        "DistanceUnit": 0
    },
    "Connections": [
        {
            "ID": 215154,
            "ConnectionTypeID": 1036,
            "StatusTypeID": 50,
            "LevelID": 2,
            "PowerKW": 22,
            "CurrentTypeID": 20
        },
        {
            "ID": 215155,
            "ConnectionTypeID": 28,
            "StatusTypeID": 50,
            "LevelID": 2,
            "PowerKW": 22,
            "CurrentTypeID": 10
        },
        {
            "ID": 248549,
            "ConnectionTypeID": 1036,
            "StatusTypeID": 50,
            "LevelID": 2,
            "PowerKW": 22,
            "CurrentTypeID": 20
        },
        {
            "ID": 248550,
            "ConnectionTypeID": 28,
            "StatusTypeID": 50,
            "LevelID": 2,
            "PowerKW": 22,
            "CurrentTypeID": 10
        }
    ],
    "GeneralComments": "",
    "StatusTypeID": 50,
    "DateLastStatusUpdate": "2020-08-27T05:14:00Z",
    "DataQualityLevel": 2,
    "DateCreated": "2020-03-15T10:54:00Z",
    "SubmissionStatusTypeID": 100
}