{
    "IsRecentlyVerified": false,
    "ID": 4611,
    "UUID": "36156AA5-4545-44BE-AF9D-465B11815036",
    "DataProviderID": 1,
    "OperatorID": 1,
    "UsageTypeID": 1,
    "AddressInfo": {
        "ID": 4556,
        "Title": "Briggs Nissan of Lawrence",
        "AddressLine1": "2300 W 29th Terr",
        "AddressLine2": "",
        "Town": "Lawrence",
        "StateOrProvince": "KS",
        "Postcode": "66047",
        "CountryID": 2,
        "Latitude": 38.9303376,
        "Longitude": -95.2632237,
        "ContactTelephone1": "785.856.8889",
        "ContactEmail": "",
        "AccessComments": "",
        "DistanceUnit": 0
    },
    "Connections": [
        {
            "ID": 266,
            "ConnectionTypeID": 1,
            "LevelID": 2,
            "Quantity": 1
        }
    ],
    "NumberOfPoints": 1,
    "GeneralComments": "",
    "DateLastConfirmed": "2011-06-09T19:57:00Z",
    "StatusTypeID": 50,
    "DateLastStatusUpdate": "2011-06-09T19:57:00Z",
    "DataQualityLevel": 1,
    "DateCreated": "2011-06-09T19:57:00Z",
    "SubmissionStatusTypeID": 200
}