{
    "IsRecentlyVerified": false,
    "ID": 182491,
    "UUID": "C5EA1082-2869-4367-B3D3-D5C692D66AA6",
    "DataProviderID": 29,
    "DataProvidersReference": "6909",
    "OperatorID": 127,
    "AddressInfo": {
        "ID": 182850,
        "Title": "Vogtstraße 26",
        "AddressLine1": "Vogtstraße 26",
        "Town": "Lohne",
        "Postcode": "49393",
        "CountryID": 87,
        "Latitude": 52.664388342554,
        "Longitude": 8.236720561981,
        "DistanceUnit": 0
    },
    "Connections": [
        {
            "ID": 288302,
            "ConnectionTypeID": 25,
            "StatusTypeID": 50,
            "LevelID": 2,
            "PowerKW": 22,
            "CurrentTypeID": 20
        },
        {
            "ID": 288303,
            "ConnectionTypeID": 25,
            "StatusTypeID": 50,
            "LevelID": 2,
            "PowerKW": 22,
            "CurrentTypeID": 20
        }
    ],
    "StatusTypeID": 50,
    "DateLastStatusUpdate": "2021-07-12T02:50:00Z",
    "MetadataValues": [
        {
            "ID": 14784,
            "MetadataFieldID": 4,
            "ItemValue": "Data from the German chargepoint registry provided by Bundesnetzagentur.de under the CC-BY 4.0 license"
        }
    ],
    "DataQualityLevel": 3,
    "DateCreated": "2021-07-08T10:03:00Z",
    "SubmissionStatusTypeID": 100
}