{
    "IsRecentlyVerified": false,
    "ID": 99696,
    "UUID": "9D403796-6CFD-4C26-9CA6-57DD390404AA",
    "DataProviderID": 1,
    "OperatorID": 45,
    "UsageTypeID": 1,
    "UsageCost": "free",
    "AddressInfo": {
        "ID": 100042,
        "Title": "Budapest, Penny Market, Kolozsvári utca",
        "AddressLine1": "Kolozsvári utca 55.",
        "Town": "Budapest",
        "StateOrProvince": "Budapest",
        "Postcode": "1102",
        "CountryID": 104,
        "Latitude": 47.49094672723217,
        "Longitude": 19.137207216076607,
        "DistanceUnit": 0
    },
    "Connections": [
        {
            "ID": 140849,
            "ConnectionTypeID": 25,
            "StatusTypeID": 50,
            "LevelID": 2,
            "Amps": 32,
            "Voltage": 400,
            "PowerKW": 22,
            "CurrentTypeID": 20,
            "Quantity": 2
        }
    ],
    "NumberOfPoints": 2,
    "StatusTypeID": 50,
    "DateLastStatusUpdate": "2018-02-01T17:05:00Z",
    "DataQualityLevel": 1,
    "DateCreated": "2018-02-01T17:05:00Z",
    "SubmissionStatusTypeID": 200
}