{
    "IsRecentlyVerified": false,
    "ID": 79862,
    "UUID": "CBD52723-EB62-4765-99AE-7D67505E016E",
    "DataProviderID": 1,
    "OperatorID": 23,
    "OperatorsReference": "16187",
    "UsageTypeID": 6,
    "UsageCost": "Free",
    "AddressInfo": {
        "ID": 80208,
        "Title": "Ducard Vineyards",
        "AddressLine1": "40 Gibson Hollow LN",
        "Town": "Etlan",
        "StateOrProvince": "VA",
        "Postcode": "22719",
        "CountryID": 2,
        "Latitude": 38.51513,
        "Longitude": -78.303035,
        "ContactTelephone1": "(540) 923-4206",
        "DistanceUnit": 0
    },
    "Connections": [
        {
            "ID": 114509,
            "ConnectionTypeID": 30,
            "StatusTypeID": 50,
            "LevelID": 2,
            "PowerKW": 16,
            "CurrentTypeID": 20,
            "Quantity": 1
        }
    ],
    "NumberOfPoints": 1,
    "GeneralComments": "1 Tesla Connector, up to 16kW.Available for patrons only. Please see front desk.",
    "StatusTypeID": 50,
    "DateLastStatusUpdate": "2017-01-30T13:36:00Z",
    "DataQualityLevel": 1,
    "DateCreated": "2017-01-30T13:36:00Z",
    "SubmissionStatusTypeID": 200
}