{
    "UserComments": [
        {
            "ID": 10078,
            "ChargePointID": 32203,
            "CommentTypeID": 10,
            "UserName": "Thomas Walther",
            "Comment": "",
            "Rating": 5,
            "DateCreated": "2016-04-03T15:31:11.387Z",
            "User": {
                "ID": 9031,
                "Username": "Thomas Walther"
            },
            "CheckinStatusTypeID": 10
        }
    ],
    "MediaItems": [
        {
            "ID": 6150,
            "ChargePointID": 32203,
            "ItemURL": "https://s3-ap-southeast-2.amazonaws.com/openchargemap/images/DE/OCM32203/OCM-32203.orig.2016040315350569.jpeg",
            "ItemThumbnailURL": "https://s3-ap-southeast-2.amazonaws.com/openchargemap/images/DE/OCM32203/OCM-32203.thmb.2016040315350569.jpeg",
            "Comment": "",
            "IsEnabled": true,
            "IsVideo": false,
            "IsFeaturedItem": false,
            "IsExternalResource": false,
            "User": {
                "ID": 9031,
                "Username": "Thomas Walther"
            },
            "DateCreated": "2016-04-03T15:35:00Z"
        },
        {
            "ID": 6148,
            "ChargePointID": 32203,
            "ItemURL": "https://s3-ap-southeast-2.amazonaws.com/openchargemap/images/DE/OCM32203/OCM-32203.orig.2016040315332473.jpeg",
            "ItemThumbnailURL": "https://s3-ap-southeast-2.amazonaws.com/openchargemap/images/DE/OCM32203/OCM-32203.thmb.2016040315332473.jpeg",
            "Comment": "",
            "IsEnabled": true,
            "IsVideo": false,
            "IsFeaturedItem": false,
            "IsExternalResource": false,
            "User": {
                "ID": 9031,
                "Username": "Thomas Walther"
            },
            "DateCreated": "2016-04-03T15:34:00Z"
        },
        {
            "ID": 6149,
            "ChargePointID": 32203,
            "ItemURL": "https://s3-ap-southeast-2.amazonaws.com/openchargemap/images/DE/OCM32203/OCM-32203.orig.2016040315341116.jpeg",
            "ItemThumbnailURL": "https://s3-ap-southeast-2.amazonaws.com/openchargemap/images/DE/OCM32203/OCM-32203.thmb.2016040315341116.jpeg",
            "Comment": "",
            "IsEnabled": true,
            "IsVideo": false,
            "IsFeaturedItem": false,
            "IsExternalResource": false,
            "User": {
                "ID": 9031,
                "Username": "Thomas Walther"
            },
            "DateCreated": "2016-04-03T15:34:00Z"
        },
        {
            "ID": 6147,
            "ChargePointID": 32203,
            "ItemURL": "https://s3-ap-southeast-2.amazonaws.com/openchargemap/images/DE/OCM32203/OCM-32203.orig.2016040315322148.jpeg",
            "ItemThumbnailURL": "https://s3-ap-southeast-2.amazonaws.com/openchargemap/images/DE/OCM32203/OCM-32203.thmb.2016040315322148.jpeg",
            "Comment": "",
            "IsEnabled": true,
            "IsVideo": false,
            "IsFeaturedItem": false,
            "IsExternalResource": false,
            "User": {
                "ID": 9031,
                "Username": "Thomas Walther"
            },
            "DateCreated": "2016-04-03T15:33:00Z"
        }
    ],
    "IsRecentlyVerified": false,
    "ID": 32203,
    "UUID": "654DDDED-6BE0-4CB3-B984-EE060BDE3C8C",
    "DataProviderID": 1,
    "OperatorID": 105,
    "OperatorsReference": "Essent EM-DE-14524330-01-00004",
    "UsageTypeID": 4,
    "AddressInfo": {
        "ID": 32549,
        "Title": "Moritzstraße 44",
        "AddressLine1": "Moritzstraße 44",
        "Town": "Zwickau",
        "Postcode": "8056",
        "CountryID": 87,
        "Latitude": 50.723511,
        "Longitude": 12.494341,
        "DistanceUnit": 0
    },
    "Connections": [
        {
            "ID": 35714,
            "ConnectionTypeID": 25,
            "LevelID": 2,
            "PowerKW": 11,
            "CurrentTypeID": 10
        },
        {
            "ID": 46287,
            "ConnectionTypeID": 25,
            "LevelID": 2,
            "PowerKW": 11
        }
    ],
    "NumberOfPoints": 1,
    "StatusTypeID": 50,
    "DateLastStatusUpdate": "2016-04-03T15:35:00Z",
    "DataQualityLevel": 3,
    "DateCreated": "2015-01-09T06:03:00Z",
    "SubmissionStatusTypeID": 200
}