{
    "IsRecentlyVerified": false,
    "ID": 61163,
    "UUID": "36CEEE2A-0B62-4E63-B1EC-3933AC8E6D16",
    "DataProviderID": 27,
    "DataProvidersReference": "77",
    "OperatorID": 1237,
    "UsageTypeID": 1,
    "AddressInfo": {
        "ID": 61509,
        "Title": "Plaza del Ayuntamiento",
        "AddressLine1": "Calle Cardenal Cisneros, 2",
        "Town": "Santander",
        "StateOrProvince": "Cantabria",
        "Postcode": "39001",
        "CountryID": 210,
        "Latitude": 43.463279,
        "Longitude": -3.810767,
        "ContactTelephone1": "+34 900102260",
        "ContactEmail": "contacto.emobility@eon.com",
        "RelatedURL": "http://www.eonespana.com/es/empresa/nuevas...",
        "DistanceUnit": 0
    },
    "Connections": [
        {
            "ID": 77840,
            "ConnectionTypeID": 25,
            "LevelID": 2,
            "Amps": 32,
            "Voltage": 220,
            "PowerKW": 7
        },
        {
            "ID": 77841,
            "ConnectionTypeID": 28,
            "LevelID": 2,
            "Amps": 16,
            "Voltage": 220,
            "PowerKW": 3.5
        }
    ],
    "StatusTypeID": 0,
    "DateLastStatusUpdate": "2016-02-13T00:24:00Z",
    "DataQualityLevel": 3,
    "DateCreated": "2016-02-13T00:24:00Z",
    "SubmissionStatusTypeID": 200
}