{
    "IsRecentlyVerified": false,
    "ID": 72205,
    "UUID": "5D27F99F-A3A8-49DB-A9AE-E1F2EC82A989",
    "DataProviderID": 2,
    "DataProvidersReference": "78294",
    "UsageTypeID": 1,
    "AddressInfo": {
        "ID": 72551,
        "Title": "University of Tennessee - Agriculture Campus",
        "AddressLine1": "2402 Chapman Dr",
        "Town": "Knoxville",
        "StateOrProvince": "TN",
        "Postcode": "37916",
        "CountryID": 2,
        "Latitude": 35.946202,
        "Longitude": -83.93878,
        "ContactTelephone1": "865-974-6031",
        "AccessComments": "24 hours daily; parking permit required",
        "RelatedURL": "",
        "DistanceUnit": 0
    },
    "Connections": [
        {
            "ID": 103506,
            "ConnectionTypeID": 1,
            "LevelID": 2,
            "Amps": 16,
            "Voltage": 230,
            "PowerKW": 3.7,
            "CurrentTypeID": 10,
            "Quantity": 6
        }
    ],
    "DateLastStatusUpdate": "2020-06-26T02:58:00Z",
    "DataQualityLevel": 3,
    "DateCreated": "2016-10-09T02:45:00Z",
    "SubmissionStatusTypeID": 100
}