{
    "IsRecentlyVerified": false,
    "ID": 8508,
    "UUID": "C4C66439-27A5-4F53-A001-B996FC7C66D6",
    "DataProviderID": 15,
    "DataProvidersReference": "8686",
    "OperatorID": 9,
    "AddressInfo": {
        "ID": 8405,
        "Title": "11480 North Torrey Pines Road",
        "AddressLine1": "11480 North Torrey Pines Road",
        "Town": "La Jolla",
        "StateOrProvince": "CA",
        "Postcode": "US",
        "CountryID": 2,
        "Latitude": 32.904796,
        "Longitude": -117.244227,
        "ContactTelephone1": "(858) 452-3226",
        "RelatedURL": "http://carstations.com/8686",
        "DistanceUnit": 0
    },
    "Connections": [
        {
            "ID": 5932,
            "ConnectionTypeID": 1,
            "Reference": "J1772",
            "LevelID": 2
        }
    ],
    "StatusTypeID": 0,
    "DateLastStatusUpdate": "2017-11-04T14:04:00Z",
    "DataQualityLevel": 1,
    "DateCreated": "2011-11-11T12:06:00Z",
    "SubmissionStatusTypeID": 100
}