{
    "IsRecentlyVerified": false,
    "ID": 61616,
    "UUID": "EFAE7C18-11AB-44B6-AE93-ADC103B88DD3",
    "DataProviderID": 1,
    "OperatorID": 23,
    "OperatorsReference": "12276",
    "UsageTypeID": 1,
    "UsageCost": "Free",
    "AddressInfo": {
        "ID": 61962,
        "Title": "Renaissance Charleston Historic District - Tesla",
        "AddressLine1": "68 Wentworth St",
        "Town": "Charleston",
        "StateOrProvince": "SC",
        "Postcode": "29401",
        "CountryID": 2,
        "Latitude": 32.7829508,
        "Longitude": -79.9336248,
        "ContactTelephone1": "843-534-0300  877-798-3752",
        "AccessComments": "24 hours daily; for Tesla use only; for guest use only; see front desk for access",
        "RelatedURL": "http://www.teslamotors.com/supercharger",
        "DistanceUnit": 0
    },
    "Connections": [
        {
            "ID": 78505,
            "ConnectionTypeID": 30,
            "StatusTypeID": 50,
            "LevelID": 2,
            "Amps": 16,
            "Voltage": 230,
            "PowerKW": 13,
            "CurrentTypeID": 10,
            "Quantity": 1
        }
    ],
    "NumberOfPoints": 1,
    "StatusTypeID": 50,
    "DateLastStatusUpdate": "2017-01-26T19:42:00Z",
    "DataQualityLevel": 3,
    "DateCreated": "2016-03-03T11:38:00Z",
    "SubmissionStatusTypeID": 100
}