{
    "IsRecentlyVerified": false,
    "ID": 104962,
    "UUID": "869646A1-8BE0-45B5-893F-D21D24446ABA",
    "DataProviderID": 1,
    "OperatorID": 23,
    "OperatorsReference": "43366",
    "UsageTypeID": 6,
    "AddressInfo": {
        "ID": 105308,
        "Title": "Ramon Park Hotel Y Restaurante",
        "AddressLine1": "Cami de Juncadella",
        "Town": "s/n",
        "StateOrProvince": "Santpedor",
        "Postcode": "8251",
        "CountryID": 210,
        "Latitude": 41.779178,
        "Longitude": 1.831411,
        "ContactTelephone1": "+34 938 320 850",
        "DistanceUnit": 0
    },
    "Connections": [
        {
            "ID": 148035,
            "ConnectionTypeID": 30,
            "StatusTypeID": 50,
            "LevelID": 2,
            "Amps": 32,
            "Voltage": 400,
            "PowerKW": 22,
            "CurrentTypeID": 20,
            "Quantity": 1
        }
    ],
    "NumberOfPoints": 1,
    "GeneralComments": "1 Tesla Connector, up to 22kW.Available for patrons only. Please see front desk.",
    "StatusTypeID": 50,
    "DateLastStatusUpdate": "2020-08-17T12:16:00Z",
    "DataQualityLevel": 1,
    "DateCreated": "2018-05-26T05:39:00Z",
    "SubmissionStatusTypeID": 200
}