{
    "IsRecentlyVerified": false,
    "ID": 48750,
    "UUID": "EDD149ED-2EA3-4774-A063-F3130C6BBB8C",
    "DataProviderID": 1,
    "OperatorID": 44,
    "UsageTypeID": 1,
    "UsageCost": "0",
    "AddressInfo": {
        "ID": 49096,
        "Title": "Ladepunkt Hinter den Langen Höfen",
        "AddressLine1": "Hinter den Langen Höfen 3K",
        "AddressLine2": "",
        "Town": "Immensen bei Lehrte",
        "StateOrProvince": "Region Hannover",
        "Postcode": "31275",
        "CountryID": 87,
        "Latitude": 52.3969920815346,
        "Longitude": 10.064088106155396,
        "ContactTelephone1": " +49 177 5422061",
        "ContactTelephone2": "",
        "ContactEmail": "",
        "AccessComments": "Steckdosen sind vor dem Haus an der Garagentür. Durchgehend nutzbar und kostenlos. Ladeweile: Hof-Cafe, Landgasthaus Scheuers Hof, Gaststätte Lükens Hoff und Postfiliale an der Hauptstraße (ist Parallelstraße)",
        "RelatedURL": "",
        "DistanceUnit": 0
    },
    "Connections": [
        {
            "ID": 60212,
            "ConnectionTypeID": 28,
            "StatusTypeID": 50,
            "LevelID": 2,
            "Amps": 16,
            "Voltage": 230,
            "PowerKW": 3.7,
            "CurrentTypeID": 10,
            "Quantity": 1
        },
        {
            "ID": 106908,
            "ConnectionTypeID": 17,
            "StatusTypeID": 50,
            "LevelID": 2,
            "Amps": 16,
            "Voltage": 400,
            "PowerKW": 11,
            "CurrentTypeID": 20,
            "Quantity": 1
        }
    ],
    "NumberOfPoints": 2,
    "GeneralComments": "",
    "StatusTypeID": 50,
    "DateLastStatusUpdate": "2016-12-02T11:55:00Z",
    "DataQualityLevel": 1,
    "DateCreated": "2015-06-29T12:36:00Z",
    "SubmissionStatusTypeID": 200
}