{
    "UserComments": [
        {
            "ID": 16013,
            "ChargePointID": 77795,
            "CommentTypeID": 10,
            "UserName": "Quiesy",
            "Comment": "Während der Öffnungszeiten des Bäckers kann auf nachfrage die Säule eingeschaltet und anschließend geladen werden.",
            "Rating": 5,
            "DateCreated": "2017-03-06T07:26:58.573Z",
            "User": {
                "ID": 12250,
                "Username": "Quiesy"
            },
            "CheckinStatusTypeID": 10
        },
        {
            "ID": 14870,
            "ChargePointID": 77795,
            "CommentTypeID": 10,
            "UserName": "Quiesy",
            "Comment": "Juli 2016: Laden leider nicht möglich. Aber vielleicht auf Nachfrage während der Öffnungszeiten des Bäckers",
            "Rating": 4,
            "DateCreated": "2017-01-25T18:19:23.883Z",
            "User": {
                "ID": 12250,
                "Username": "Quiesy"
            },
            "CheckinStatusTypeID": 20
        }
    ],
    "MediaItems": [
        {
            "ID": 10591,
            "ChargePointID": 77795,
            "ItemURL": "https://s3-ap-southeast-2.amazonaws.com/openchargemap/images/DE/OCM77795/OCM-77795.orig.2017030607272184.jpg",
            "ItemThumbnailURL": "https://s3-ap-southeast-2.amazonaws.com/openchargemap/images/DE/OCM77795/OCM-77795.thmb.2017030607272184.jpg",
            "Comment": "",
            "IsEnabled": true,
            "IsVideo": false,
            "IsFeaturedItem": false,
            "IsExternalResource": false,
            "User": {
                "ID": 12250,
                "Username": "Quiesy"
            },
            "DateCreated": "2017-03-06T07:28:00Z"
        },
        {
            "ID": 10592,
            "ChargePointID": 77795,
            "ItemURL": "https://s3-ap-southeast-2.amazonaws.com/openchargemap/images/DE/OCM77795/OCM-77795.orig.2017030607273732.jpg",
            "ItemThumbnailURL": "https://s3-ap-southeast-2.amazonaws.com/openchargemap/images/DE/OCM77795/OCM-77795.thmb.2017030607273732.jpg",
            "Comment": "",
            "IsEnabled": true,
            "IsVideo": false,
            "IsFeaturedItem": false,
            "IsExternalResource": false,
            "User": {
                "ID": 12250,
                "Username": "Quiesy"
            },
            "DateCreated": "2017-03-06T07:28:00Z"
        },
        {
            "ID": 9325,
            "ChargePointID": 77795,
            "ItemURL": "https://s3-ap-southeast-2.amazonaws.com/openchargemap/images/DE/OCM77795/OCM-77795.orig.2017012518193408.jpg",
            "ItemThumbnailURL": "https://s3-ap-southeast-2.amazonaws.com/openchargemap/images/DE/OCM77795/OCM-77795.thmb.2017012518193408.jpg",
            "Comment": "",
            "IsEnabled": true,
            "IsVideo": false,
            "IsFeaturedItem": false,
            "IsExternalResource": false,
            "User": {
                "ID": 12250,
                "Username": "Quiesy"
            },
            "DateCreated": "2017-01-25T18:20:00Z"
        },
        {
            "ID": 9326,
            "ChargePointID": 77795,
            "ItemURL": "https://s3-ap-southeast-2.amazonaws.com/openchargemap/images/DE/OCM77795/OCM-77795.orig.2017012518194213.jpg",
            "ItemThumbnailURL": "https://s3-ap-southeast-2.amazonaws.com/openchargemap/images/DE/OCM77795/OCM-77795.thmb.2017012518194213.jpg",
            "Comment": "",
            "IsEnabled": true,
            "IsVideo": false,
            "IsFeaturedItem": false,
            "IsExternalResource": false,
            "User": {
                "ID": 12250,
                "Username": "Quiesy"
            },
            "DateCreated": "2017-01-25T18:20:00Z"
        }
    ],
    "IsRecentlyVerified": false,
    "ID": 77795,
    "UUID": "05D3D240-9679-4195-8F3B-D2224975FAA9",
    "DataProviderID": 1,
    "OperatorID": 105,
    "UsageTypeID": 7,
    "UsageCost": "Free",
    "AddressInfo": {
        "ID": 78141,
        "Title": "E-Bike Station Bäckerei H. J. Steuwer (RWE)",
        "AddressLine1": "Lindenstraße 75",
        "AddressLine2": "",
        "Town": "Belm",
        "StateOrProvince": "Niedersachen",
        "Postcode": "49191",
        "CountryID": 87,
        "Latitude": 52.302180847343,
        "Longitude": 8.14058482646942,
        "ContactTelephone1": "+49(0) 800 88 88 862",
        "ContactTelephone2": "",
        "ContactEmail": "",
        "AccessComments": "Während der Öffnungszeiten auf Nachfrage",
        "RelatedURL": "https://www.rwe-mobility.com/",
        "DistanceUnit": 0
    },
    "Connections": [
        {
            "ID": 112387,
            "ConnectionTypeID": 28,
            "StatusTypeID": 50,
            "LevelID": 1,
            "Amps": 10,
            "Voltage": 230,
            "PowerKW": 2,
            "CurrentTypeID": 10,
            "Quantity": 3
        }
    ],
    "NumberOfPoints": 1,
    "GeneralComments": "",
    "StatusTypeID": 50,
    "DateLastStatusUpdate": "2017-03-06T07:45:00Z",
    "DataQualityLevel": 1,
    "DateCreated": "2017-01-24T20:53:00Z",
    "SubmissionStatusTypeID": 200
}