{
    "IsRecentlyVerified": false,
    "ID": 26072,
    "UUID": "2DA5122A-53AE-4224-9532-176390F02210",
    "DataProviderID": 2,
    "DataProvidersReference": "49017",
    "UsageTypeID": 1,
    "AddressInfo": {
        "ID": 26418,
        "Title": "Maui Nui Golf Club",
        "AddressLine1": "1345 Piilani Hwy",
        "Town": "Kihei",
        "StateOrProvince": "HI",
        "Postcode": "96753",
        "CountryID": 2,
        "Latitude": 20.748419,
        "Longitude": -156.446058,
        "ContactTelephone1": "808-874-0777",
        "AccessComments": "6:30am-6pm, 8pm-10pm daily; see Pro Shop or Restaurant attendant for access",
        "RelatedURL": "",
        "DistanceUnit": 0
    },
    "Connections": [
        {
            "ID": 28440,
            "ConnectionTypeID": 1,
            "LevelID": 2,
            "Amps": 16,
            "Voltage": 230,
            "PowerKW": 3.7,
            "CurrentTypeID": 10,
            "Quantity": 1
        }
    ],
    "DateLastStatusUpdate": "2020-06-26T02:52:00Z",
    "DataQualityLevel": 3,
    "DateCreated": "2014-11-28T03:37:00Z",
    "SubmissionStatusTypeID": 100
}