{
    "IsRecentlyVerified": false,
    "ID": 104145,
    "UUID": "6D379440-AD99-4F9D-9A2C-E26518078166",
    "DataProviderID": 1,
    "OperatorID": 214,
    "UsageTypeID": 4,
    "AddressInfo": {
        "ID": 104491,
        "Title": "Transvaalstraße",
        "AddressLine1": "Transvaalstraße 32",
        "AddressLine2": "Stadtteil Wedding",
        "Town": "Berlin",
        "StateOrProvince": "Berlin",
        "Postcode": "13351",
        "CountryID": 87,
        "Latitude": 52.5512559,
        "Longitude": 13.340817000000015,
        "AccessComments": "24/7 open",
        "DistanceUnit": 0
    },
    "Connections": [
        {
            "ID": 147071,
            "ConnectionTypeID": 25,
            "StatusTypeID": 50,
            "LevelID": 2,
            "Amps": 16,
            "Voltage": 400,
            "PowerKW": 11,
            "CurrentTypeID": 20,
            "Quantity": 2
        }
    ],
    "NumberOfPoints": 2,
    "StatusTypeID": 50,
    "DateLastStatusUpdate": "2018-05-16T12:18:00Z",
    "DataQualityLevel": 1,
    "DateCreated": "2018-05-16T12:18:00Z",
    "SubmissionStatusTypeID": 200
}