{
    "IsRecentlyVerified": false,
    "ID": 73107,
    "UUID": "E3200745-107B-4624-9C0B-E413748874E9",
    "DataProviderID": 1,
    "OperatorID": 45,
    "UsageTypeID": 5,
    "UsageCost": "Pay by credit card",
    "AddressInfo": {
        "ID": 73453,
        "Title": "Parkplatz Marktplatz in Gossau",
        "AddressLine1": "Herisauerstrasse 32",
        "Town": "Gossau",
        "StateOrProvince": "Switzerland",
        "Postcode": "9200",
        "CountryID": 217,
        "Latitude": 47.4139753927184,
        "Longitude": 9.24930810928345,
        "DistanceUnit": 0
    },
    "Connections": [
        {
            "ID": 105109,
            "ConnectionTypeID": 33,
            "StatusTypeID": 50,
            "LevelID": 3,
            "PowerKW": 50,
            "CurrentTypeID": 30,
            "Quantity": 1
        },
        {
            "ID": 105110,
            "ConnectionTypeID": 2,
            "StatusTypeID": 50,
            "LevelID": 3,
            "PowerKW": 50,
            "CurrentTypeID": 30,
            "Quantity": 1
        },
        {
            "ID": 105111,
            "ConnectionTypeID": 25,
            "StatusTypeID": 50,
            "LevelID": 2,
            "Amps": 32,
            "Voltage": 400,
            "PowerKW": 22,
            "CurrentTypeID": 20,
            "Quantity": 1
        }
    ],
    "NumberOfPoints": 1,
    "StatusTypeID": 50,
    "DateLastStatusUpdate": "2016-11-08T09:28:00Z",
    "DataQualityLevel": 1,
    "DateCreated": "2016-11-07T05:15:00Z",
    "SubmissionStatusTypeID": 200
}