{
    "IsRecentlyVerified": false,
    "ID": 115521,
    "UUID": "7E21118D-B61D-406B-9315-C7B393B8DD1C",
    "DataProviderID": 2,
    "DataProvidersReference": "117333",
    "OperatorID": 5,
    "UsageTypeID": 1,
    "AddressInfo": {
        "ID": 115867,
        "Title": "HENDRICK SBLVD",
        "AddressLine1": "8901 South Blvd",
        "Town": "Charlotte",
        "StateOrProvince": "NC",
        "Postcode": "28273",
        "CountryID": 2,
        "Latitude": 35.116514,
        "Longitude": -80.882152,
        "ContactTelephone1": "888-758-4389",
        "AccessComments": "24 hours daily",
        "RelatedURL": "http://www.chargepoint.com/",
        "DistanceUnit": 0
    },
    "Connections": [
        {
            "ID": 162537,
            "ConnectionTypeID": 1,
            "LevelID": 2,
            "Amps": 16,
            "Voltage": 230,
            "PowerKW": 3,
            "CurrentTypeID": 10,
            "Quantity": 2
        }
    ],
    "DateLastStatusUpdate": "2019-04-06T04:02:00Z",
    "DataQualityLevel": 3,
    "DateCreated": "2019-02-11T07:13:00Z",
    "SubmissionStatusTypeID": 100
}