{
    "IsRecentlyVerified": false,
    "ID": 73620,
    "UUID": "A645F80D-CEF7-4305-86A6-D292555E345D",
    "DataProviderID": 1,
    "OperatorID": 89,
    "OperatorsReference": "CEC-00065",
    "UsageTypeID": 4,
    "UsageCost": "CAD 10.00/hour",
    "AddressInfo": {
        "ID": 73966,
        "Title": "BRCC-les Promenades Gatineau",
        "AddressLine1": "1100 boulevard Maloney Ouest",
        "Town": "Gatineau",
        "StateOrProvince": "QC",
        "Postcode": "J8T 6G3",
        "CountryID": 44,
        "Latitude": 45.475865,
        "Longitude": -75.693477,
        "DistanceUnit": 0
    },
    "Connections": [
        {
            "ID": 105914,
            "ConnectionTypeID": 2,
            "StatusTypeID": 50,
            "LevelID": 3,
            "PowerKW": 50,
            "CurrentTypeID": 20,
            "Quantity": 1
        },
        {
            "ID": 105915,
            "ConnectionTypeID": 32,
            "StatusTypeID": 50,
            "LevelID": 3,
            "PowerKW": 50,
            "CurrentTypeID": 20,
            "Quantity": 1
        }
    ],
    "NumberOfPoints": 1,
    "StatusTypeID": 50,
    "DateLastStatusUpdate": "2017-01-22T19:38:00Z",
    "DataQualityLevel": 1,
    "DateCreated": "2016-11-23T22:26:00Z",
    "SubmissionStatusTypeID": 200
}