{
    "IsRecentlyVerified": false,
    "ID": 47424,
    "UUID": "3030F492-EEFC-46EE-81EE-3DE46D549946",
    "DataProviderID": 1,
    "OperatorID": 23,
    "OperatorsReference": "18571",
    "UsageTypeID": 1,
    "UsageCost": "$0.22/kWh; other tariffs for older cars",
    "AddressInfo": {
        "ID": 47770,
        "Title": "Tesla Service Center",
        "AddressLine1": "2312 S State St",
        "Town": "South Salt Lake",
        "StateOrProvince": "UT",
        "Postcode": "84115",
        "CountryID": 2,
        "Latitude": 40.720616,
        "Longitude": -111.8887785,
        "ContactTelephone1": "877-798-3752",
        "AccessComments": "24 hours daily; for Tesla use only",
        "RelatedURL": "http://www.teslamotors.com/supercharger",
        "DistanceUnit": 0
    },
    "Connections": [
        {
            "ID": 58463,
            "ConnectionTypeID": 0,
            "LevelID": 2,
            "Amps": 16,
            "Voltage": 230,
            "PowerKW": 3,
            "CurrentTypeID": 10,
            "Quantity": 3
        },
        {
            "ID": 93149,
            "ConnectionTypeID": 27,
            "StatusTypeID": 50,
            "LevelID": 3,
            "Amps": 100,
            "Voltage": 400,
            "PowerKW": 120,
            "CurrentTypeID": 30,
            "Quantity": 10
        }
    ],
    "NumberOfPoints": 10,
    "StatusTypeID": 50,
    "DateLastStatusUpdate": "2018-03-13T08:49:00Z",
    "DataQualityLevel": 3,
    "DateCreated": "2015-05-27T08:51:00Z",
    "SubmissionStatusTypeID": 100
}