{
    "IsRecentlyVerified": false,
    "ID": 15016,
    "UUID": "06E8600B-9186-4F9C-9A61-3DBEEAAD39CF",
    "DataProviderID": 1,
    "OperatorID": 22,
    "OperatorsReference": "C748G",
    "UsageTypeID": 4,
    "AddressInfo": {
        "ID": 15362,
        "Title": "Old Cross Square",
        "AddressLine1": "Monaghan",
        "Town": "Monaghan",
        "StateOrProvince": "County Monaghan",
        "CountryID": 3,
        "Latitude": 54.246923,
        "Longitude": -6.964533,
        "DistanceUnit": 0
    },
    "Connections": [
        {
            "ID": 13390,
            "ConnectionTypeID": 25,
            "StatusTypeID": 50,
            "LevelID": 2,
            "Amps": 32,
            "Voltage": 400,
            "PowerKW": 22,
            "CurrentTypeID": 20,
            "Quantity": 2
        }
    ],
    "NumberOfPoints": 2,
    "StatusTypeID": 50,
    "DateLastStatusUpdate": "2019-06-04T06:13:00Z",
    "DataQualityLevel": 2,
    "DateCreated": "2012-12-11T15:08:00Z",
    "SubmissionStatusTypeID": 100
}