{
    "IsRecentlyVerified": false,
    "ID": 118515,
    "UUID": "DB3A2075-D24B-48DA-8977-FBF1EDB8C98A",
    "DataProviderID": 1,
    "OperatorID": 23,
    "OperatorsReference": "49515",
    "UsageTypeID": 4,
    "AddressInfo": {
        "ID": 118861,
        "Title": "Carson Valley Inn Casino",
        "AddressLine1": "1627 Us Hwy 395 N",
        "Town": "Minden",
        "StateOrProvince": "Nevada",
        "Postcode": "89423",
        "CountryID": 2,
        "Latitude": 38.956665,
        "Longitude": -119.767703,
        "ContactTelephone1": "(775) 782-9711",
        "DistanceUnit": 0
    },
    "Connections": [
        {
            "ID": 167619,
            "ConnectionTypeID": 30,
            "StatusTypeID": 50,
            "LevelID": 2,
            "PowerKW": 16,
            "CurrentTypeID": 20,
            "Quantity": 4
        }
    ],
    "NumberOfPoints": 4,
    "GeneralComments": "4 Tesla Connectors, up to 16kW.Available for customers. Self park.",
    "StatusTypeID": 50,
    "DateLastStatusUpdate": "2019-03-25T06:52:00Z",
    "DataQualityLevel": 1,
    "DateCreated": "2019-03-25T06:52:00Z",
    "SubmissionStatusTypeID": 200
}