{
    "IsRecentlyVerified": false,
    "ID": 106071,
    "UUID": "A91F5BB3-BB57-41B6-A167-F1AD856D2DB3",
    "DataProviderID": 1,
    "OperatorID": 32,
    "OperatorsReference": "24337",
    "UsageTypeID": 4,
    "UsageCost": "£0.108/kWh; for Polar Plus subscription members only",
    "AddressInfo": {
        "ID": 106417,
        "Title": "Q-Park",
        "AddressLine1": "Bath Road",
        "AddressLine2": "Heathrow",
        "Town": "Hounslow",
        "Postcode": "TW6 2AL",
        "CountryID": 1,
        "Latitude": 51.479416,
        "Longitude": -0.42572,
        "DistanceUnit": 0
    },
    "Connections": [
        {
            "ID": 149389,
            "ConnectionTypeID": 33,
            "StatusTypeID": 50,
            "LevelID": 3,
            "PowerKW": 50,
            "CurrentTypeID": 30,
            "Quantity": 1
        },
        {
            "ID": 149390,
            "ConnectionTypeID": 2,
            "StatusTypeID": 50,
            "LevelID": 3,
            "PowerKW": 50,
            "CurrentTypeID": 30,
            "Quantity": 1
        },
        {
            "ID": 149391,
            "ConnectionTypeID": 1036,
            "StatusTypeID": 50,
            "LevelID": 3,
            "PowerKW": 43,
            "CurrentTypeID": 20,
            "Quantity": 1
        }
    ],
    "NumberOfPoints": 1,
    "StatusTypeID": 50,
    "DateLastStatusUpdate": "2019-06-21T05:14:00Z",
    "DataQualityLevel": 1,
    "DateCreated": "2018-06-15T05:16:00Z",
    "SubmissionStatusTypeID": 200
}