{
    "IsRecentlyVerified": false,
    "ID": 16783,
    "UUID": "BD24EB6E-4627-4E98-AE40-C6F1BA1B0DFE",
    "DataProviderID": 2,
    "DataProvidersReference": "51975",
    "OperatorID": 5,
    "UsageTypeID": 1,
    "AddressInfo": {
        "ID": 17128,
        "Title": "STRACK &VAN; TI",
        "AddressLine1": "9599 W 133rd Ave",
        "Town": "Cedar Lake",
        "StateOrProvince": "IN",
        "Postcode": "46303",
        "CountryID": 2,
        "Latitude": 41.3755772,
        "Longitude": -87.451816,
        "ContactTelephone1": "888-758-4389",
        "AccessComments": "24 hours daily",
        "RelatedURL": "http://www.chargepoint.com/",
        "DistanceUnit": 0
    },
    "Connections": [
        {
            "ID": 17007,
            "ConnectionTypeID": 1,
            "LevelID": 2,
            "Amps": 16,
            "Voltage": 230,
            "PowerKW": 3,
            "CurrentTypeID": 10,
            "Quantity": 2
        },
        {
            "ID": 22231,
            "ConnectionTypeID": 1,
            "LevelID": 2,
            "Quantity": 2
        }
    ],
    "DateLastStatusUpdate": "2019-12-24T09:18:00Z",
    "DataQualityLevel": 3,
    "DateCreated": "2013-06-16T03:49:00Z",
    "SubmissionStatusTypeID": 200
}