{
    "UserComments": [
        {
            "ID": 8162,
            "ChargePointID": 19344,
            "CommentTypeID": 10,
            "UserName": "Simon Hewison",
            "Comment": "No ICEing today; but two of the units out of service.",
            "Rating": 3,
            "DateCreated": "2015-12-08T09:12:46.003Z",
            "User": {
                "ID": 4575,
                "Username": "Simon Hewison"
            },
            "CheckinStatusTypeID": 10
        },
        {
            "ID": 6260,
            "ChargePointID": 19344,
            "CommentTypeID": 10,
            "UserName": "RootlessCosmo",
            "Comment": "Regularly 2-3 non EV cars parked in bays. Reported to NCP",
            "DateCreated": "2015-08-21T07:46:39.367Z",
            "User": {
                "ID": 6218,
                "Username": "RootlessCosmo"
            },
            "CheckinStatusTypeID": 110
        },
        {
            "ID": 6258,
            "ChargePointID": 19344,
            "CommentTypeID": 1000,
            "UserName": "RootlessCosmo",
            "Comment": "Two of the five double posts out of action. Reported to Source London on 19/8/15",
            "DateCreated": "2015-08-21T07:44:55.783Z",
            "User": {
                "ID": 6218,
                "Username": "RootlessCosmo"
            },
            "CheckinStatusTypeID": 10
        }
    ],
    "MediaItems": [
        {
            "ID": 3571,
            "ChargePointID": 19344,
            "ItemURL": "https://s3-ap-southeast-2.amazonaws.com/openchargemap/images/GB/OCM19344/OCM-19344.orig.2015120818365727.jpg",
            "ItemThumbnailURL": "https://s3-ap-southeast-2.amazonaws.com/openchargemap/images/GB/OCM19344/OCM-19344.thmb.2015120818365727.jpg",
            "Comment": "",
            "IsEnabled": true,
            "IsVideo": false,
            "IsFeaturedItem": false,
            "IsExternalResource": false,
            "User": {
                "ID": 4575,
                "Username": "Simon Hewison"
            },
            "DateCreated": "2015-12-08T18:37:00Z"
        }
    ],
    "IsRecentlyVerified": false,
    "ID": 19344,
    "UUID": "CD2D1737-ED62-4FC2-B9DE-A6A2A08BEA85",
    "DataProviderID": 1,
    "OperatorID": 25,
    "OperatorsReference": "500 10108,500 10109,500 10110,500 10111,500 10112",
    "UsageTypeID": 4,
    "UsageCost": "Free. Parking fees apply.",
    "AddressInfo": {
        "ID": 19689,
        "Title": "Arnos Grove Station",
        "AddressLine1": "Bowes Rd",
        "AddressLine2": "Enfield",
        "Town": " London",
        "Postcode": "N11 1AN",
        "CountryID": 1,
        "Latitude": 51.6157944,
        "Longitude": -0.130454099999952,
        "ContactTelephone1": " 0845 850 0653",
        "DistanceUnit": 0
    },
    "Connections": [
        {
            "ID": 19642,
            "ConnectionTypeID": 25,
            "StatusTypeID": 75,
            "LevelID": 2,
            "Amps": 32,
            "Voltage": 400,
            "PowerKW": 22,
            "CurrentTypeID": 20,
            "Quantity": 5
        }
    ],
    "NumberOfPoints": 10,
    "StatusTypeID": 75,
    "DateLastStatusUpdate": "2018-01-06T13:36:00Z",
    "DataQualityLevel": 1,
    "DateCreated": "2013-09-22T11:58:00Z",
    "SubmissionStatusTypeID": 200
}