{
    "IsRecentlyVerified": false,
    "ID": 5835,
    "UUID": "CA6188C0-43E0-4810-ABFE-AE98A2F8FFEF",
    "DataProviderID": 1,
    "OperatorID": 25,
    "UsageTypeID": 4,
    "UsageCost": "Free",
    "AddressInfo": {
        "ID": 5757,
        "Title": "Holborn NCP Car Park",
        "AddressLine1": "Museum Street",
        "Town": "Camden",
        "StateOrProvince": "London",
        "Postcode": "WC1A 1JP",
        "CountryID": 1,
        "Latitude": 51.5181387,
        "Longitude": -0.1255737,
        "ContactTelephone1": "0845 850 0653",
        "AccessComments": "1.83m height restriction. Located on the right of entrance near disabled bays.. \r",
        "RelatedURL": "https://www.sourcelondon.net/",
        "DistanceUnit": 0
    },
    "Connections": [
        {
            "ID": 584,
            "ConnectionTypeID": 3,
            "StatusTypeID": 50,
            "LevelID": 2,
            "Amps": 13,
            "Voltage": 230,
            "PowerKW": 3,
            "CurrentTypeID": 10,
            "Quantity": 2
        }
    ],
    "NumberOfPoints": 4,
    "StatusTypeID": 0,
    "DateLastStatusUpdate": "2016-11-03T10:28:00Z",
    "DataQualityLevel": 1,
    "DateCreated": "2011-09-12T11:40:00Z",
    "SubmissionStatusTypeID": 200
}