{
    "IsRecentlyVerified": false,
    "ID": 65189,
    "UUID": "64840F23-883E-4B6F-9553-17A7497492FA",
    "DataProviderID": 1,
    "OperatorID": 45,
    "UsageTypeID": 3,
    "AddressInfo": {
        "ID": 65535,
        "Title": "Baywa Baumarkt",
        "AddressLine1": "Kilianstraße 104A",
        "Town": "Nürnberg",
        "StateOrProvince": "Bayern",
        "Postcode": "90425",
        "CountryID": 87,
        "Latitude": 49.4733541421917,
        "Longitude": 11.0782012833977,
        "ContactTelephone1": "+49 911 3610452",
        "AccessComments": "Kostenlos an Anmeldung (Schlüssel an der Info ausleihen, an der Mennekes-Ladesäule kurz auf 1 stellen, springt auf 0 zurück!) nutzbar zu den Öffnungszeiten Mo-Sa 8-20Uhr. Nach dem Laden einfach abstecken. Position ist am roten Schriftzug an der Wand \"Bau & Garten...\" neben dem Bäcker.",
        "RelatedURL": "http://baywa-baumarkt.de/",
        "DistanceUnit": 0
    },
    "Connections": [
        {
            "ID": 89745,
            "ConnectionTypeID": 25,
            "StatusTypeID": 50,
            "LevelID": 2,
            "Amps": 32,
            "Voltage": 400,
            "PowerKW": 22,
            "CurrentTypeID": 20,
            "Quantity": 2
        },
        {
            "ID": 89746,
            "ConnectionTypeID": 28,
            "StatusTypeID": 50,
            "LevelID": 2,
            "Amps": 16,
            "Voltage": 230,
            "PowerKW": 3.7,
            "CurrentTypeID": 10,
            "Quantity": 2
        }
    ],
    "NumberOfPoints": 2,
    "StatusTypeID": 50,
    "DateLastStatusUpdate": "2016-04-19T08:32:00Z",
    "DataQualityLevel": 1,
    "DateCreated": "2016-04-19T08:32:00Z",
    "SubmissionStatusTypeID": 200
}