{
    "IsRecentlyVerified": false,
    "ID": 129832,
    "UUID": "686F2E29-253B-45FD-A29C-22960F258822",
    "DataProviderID": 1,
    "OperatorID": 3365,
    "UsageTypeID": 1,
    "UsageCost": "15.00$ / Heure - 1,50$ / heure",
    "AddressInfo": {
        "ID": 130178,
        "Title": "NBP - Needs Convenience and PetroCanada",
        "AddressLine1": "12 Park Drive",
        "Town": "Richibucto",
        "StateOrProvince": "New-Brunswick",
        "Postcode": "E4W 4G5",
        "CountryID": 44,
        "Latitude": 46.6679041,
        "Longitude": -64.8674759,
        "ContactTelephone1": "(877) 505-2674 (ext. 201)",
        "RelatedURL": "https://echargenetwork.com/",
        "DistanceUnit": 0
    },
    "Connections": [
        {
            "ID": 181759,
            "ConnectionTypeID": 32,
            "StatusTypeID": 50,
            "LevelID": 2,
            "Amps": 125,
            "PowerKW": 50,
            "CurrentTypeID": 10,
            "Quantity": 1
        },
        {
            "ID": 181760,
            "ConnectionTypeID": 1,
            "StatusTypeID": 50,
            "LevelID": 2,
            "Amps": 30,
            "PowerKW": 7.2,
            "CurrentTypeID": 10,
            "Quantity": 2
        },
        {
            "ID": 181761,
            "ConnectionTypeID": 2,
            "StatusTypeID": 50,
            "LevelID": 2,
            "Amps": 125,
            "PowerKW": 50,
            "CurrentTypeID": 10,
            "Quantity": 1
        }
    ],
    "NumberOfPoints": 1,
    "StatusTypeID": 50,
    "DateLastStatusUpdate": "2019-07-30T10:56:00Z",
    "DataQualityLevel": 1,
    "DateCreated": "2019-07-28T11:04:00Z",
    "SubmissionStatusTypeID": 200
}