{
    "IsRecentlyVerified": false,
    "ID": 35170,
    "UUID": "C3FA7CD3-2B25-4429-9ABE-62A1311DFF76",
    "DataProviderID": 26,
    "DataProvidersReference": "47282",
    "OperatorID": 178,
    "OperatorsReference": "EVnetNL AL438",
    "UsageCost": "0.00 jaarabonnement",
    "AddressInfo": {
        "ID": 35516,
        "Title": "Wilhelminaplein",
        "AddressLine1": "Wilhelminaplein",
        "Town": "Lansingerland",
        "Postcode": "2665 XL",
        "CountryID": 159,
        "Latitude": 52.008417,
        "Longitude": 4.529253,
        "ContactTelephone1": "0800-3522365",
        "RelatedURL": "http://www.evnet.nl",
        "DistanceUnit": 0
    },
    "Connections": [
        {
            "ID": 38681,
            "ConnectionTypeID": 25,
            "LevelID": 2,
            "PowerKW": 11,
            "CurrentTypeID": 10
        }
    ],
    "NumberOfPoints": 2,
    "StatusTypeID": 50,
    "DateLastStatusUpdate": "2016-06-04T02:44:00Z",
    "DataQualityLevel": 3,
    "DateCreated": "2015-01-09T06:04:00Z",
    "SubmissionStatusTypeID": 100
}