{
    "IsRecentlyVerified": false,
    "ID": 123471,
    "UUID": "90FC571F-9E80-4BE4-B9EF-5C190041EEAE",
    "DataProviderID": 2,
    "DataProvidersReference": "71131",
    "OperatorID": 5,
    "UsageTypeID": 1,
    "AddressInfo": {
        "ID": 123817,
        "Title": "TCOE DOE AVENUE",
        "AddressLine1": "2101 N Shirk Rd",
        "Town": "Visalia",
        "StateOrProvince": "CA",
        "Postcode": "93291",
        "CountryID": 2,
        "Latitude": 36.3481784,
        "Longitude": -119.3694453,
        "ContactTelephone1": "888-758-4389",
        "AccessComments": "24 hours daily",
        "RelatedURL": "http://www.chargepoint.com/",
        "DistanceUnit": 0
    },
    "Connections": [
        {
            "ID": 173453,
            "ConnectionTypeID": 1,
            "LevelID": 2,
            "Amps": 16,
            "Voltage": 230,
            "PowerKW": 3,
            "CurrentTypeID": 10,
            "Quantity": 1
        }
    ],
    "DateLastStatusUpdate": "2019-12-24T09:13:00Z",
    "DataQualityLevel": 3,
    "DateCreated": "2019-04-06T05:03:00Z",
    "SubmissionStatusTypeID": 100
}