{
    "IsRecentlyVerified": false,
    "ID": 181016,
    "UUID": "2BCC84D6-CE18-4971-8347-454C526ED98C",
    "DataProviderID": 29,
    "DataProvidersReference": "20788",
    "OperatorID": 224,
    "AddressInfo": {
        "ID": 181375,
        "Title": "Wallbrunnstrasse 42",
        "AddressLine1": "Wallbrunnstrasse 42",
        "Town": "Lörrach",
        "Postcode": "79539",
        "CountryID": 87,
        "Latitude": 47.610213,
        "Longitude": 7.664981,
        "DistanceUnit": 0
    },
    "Connections": [
        {
            "ID": 284806,
            "ConnectionTypeID": 28,
            "StatusTypeID": 50,
            "LevelID": 2,
            "PowerKW": 22,
            "CurrentTypeID": 20
        },
        {
            "ID": 284807,
            "ConnectionTypeID": 25,
            "StatusTypeID": 50,
            "LevelID": 2,
            "PowerKW": 22,
            "CurrentTypeID": 20
        },
        {
            "ID": 295253,
            "ConnectionTypeID": 25,
            "StatusTypeID": 50,
            "LevelID": 2,
            "PowerKW": 22,
            "CurrentTypeID": 20
        }
    ],
    "StatusTypeID": 50,
    "DateLastStatusUpdate": "2021-07-12T02:39:00Z",
    "MetadataValues": [
        {
            "ID": 13310,
            "MetadataFieldID": 4,
            "ItemValue": "Data from the German chargepoint registry provided by Bundesnetzagentur.de under the CC-BY 4.0 license"
        }
    ],
    "DataQualityLevel": 3,
    "DateCreated": "2021-07-08T10:01:00Z",
    "SubmissionStatusTypeID": 100
}