{
    "IsRecentlyVerified": false,
    "ID": 141668,
    "UUID": "393F715D-B09B-4B18-9A8A-A1F99A136A3F",
    "DataProviderID": 2,
    "DataProvidersReference": "88413",
    "OperatorID": 5,
    "UsageTypeID": 1,
    "AddressInfo": {
        "ID": 142020,
        "Title": "COLUMBIA ASSOC",
        "AddressLine1": "5440 Old Tucker Row",
        "Town": "Columbia",
        "StateOrProvince": "MD",
        "Postcode": "21044",
        "CountryID": 2,
        "Latitude": 39.222503,
        "Longitude": -76.887476,
        "ContactTelephone1": "888-758-4389",
        "AccessComments": "24 hours daily",
        "RelatedURL": "http://www.chargepoint.com/",
        "DistanceUnit": 0
    },
    "Connections": [
        {
            "ID": 197647,
            "ConnectionTypeID": 1,
            "LevelID": 2,
            "Amps": 16,
            "Voltage": 230,
            "PowerKW": 3.7,
            "CurrentTypeID": 10,
            "Quantity": 2
        }
    ],
    "StatusTypeID": 50,
    "DateLastStatusUpdate": "2020-06-26T03:01:00Z",
    "DataQualityLevel": 3,
    "DateCreated": "2019-12-24T09:16:00Z",
    "SubmissionStatusTypeID": 100
}