{
    "IsRecentlyVerified": false,
    "ID": 137510,
    "UUID": "2B77BC7C-C72E-4280-8DFE-1CBD6A9A75C2",
    "DataProviderID": 2,
    "DataProvidersReference": "147004",
    "UsageTypeID": 1,
    "AddressInfo": {
        "ID": 137856,
        "Title": "South Coast Solar",
        "AddressLine1": "2605 Ridgelake Dr",
        "Town": "Metairie",
        "StateOrProvince": "LA",
        "Postcode": "70002",
        "CountryID": 2,
        "Latitude": 29.999889,
        "Longitude": -90.153424,
        "ContactTelephone1": "855-980-7047",
        "AccessComments": "24 hours daily; primarily for employee use",
        "RelatedURL": "",
        "DistanceUnit": 0
    },
    "Connections": [
        {
            "ID": 192434,
            "ConnectionTypeID": 1,
            "LevelID": 2,
            "Amps": 16,
            "Voltage": 230,
            "PowerKW": 3,
            "CurrentTypeID": 10,
            "Quantity": 1
        }
    ],
    "StatusTypeID": 50,
    "DateLastStatusUpdate": "2019-12-24T09:05:00Z",
    "DataQualityLevel": 3,
    "DateCreated": "2019-12-24T09:05:00Z",
    "SubmissionStatusTypeID": 100
}