{
    "IsRecentlyVerified": false,
    "ID": 93272,
    "UUID": "B9B764A2-76AD-4DE8-8D51-EDE5C12E98EC",
    "DataProviderID": 1,
    "OperatorID": 45,
    "UsageTypeID": 3,
    "AddressInfo": {
        "ID": 93618,
        "Title": "E-Bike Station Waldmichelbacher Hof",
        "AddressLine1": "Waldmichelbach 4",
        "Town": "Bessenbach",
        "StateOrProvince": "Landkreis Aschaffenburg",
        "Postcode": "63856",
        "CountryID": 87,
        "Latitude": 49.9583445379599,
        "Longitude": 9.274880085983334,
        "AccessComments": "Bike energy Ladestation, nur mit zum Fahrrad passenden Spezialkabel nutzbar. Im Landgasthof gegen Pfand ausleihbar. Keine normale Steckdose!",
        "RelatedURL": "https://www.waldmichelbacher-hof.de/landgasthof-bessenbach/startseite",
        "DistanceUnit": 0
    },
    "Connections": [
        {
            "ID": 132122,
            "ConnectionTypeID": 0,
            "StatusTypeID": 50,
            "LevelID": 1,
            "Amps": 6,
            "Voltage": 48,
            "PowerKW": 0.3,
            "CurrentTypeID": 30,
            "Quantity": 4
        }
    ],
    "NumberOfPoints": 4,
    "StatusTypeID": 50,
    "DateLastStatusUpdate": "2017-09-25T09:31:00Z",
    "DataQualityLevel": 1,
    "DateCreated": "2017-09-25T09:31:00Z",
    "SubmissionStatusTypeID": 200
}