{
    "IsRecentlyVerified": false,
    "ID": 145820,
    "UUID": "E50D87D4-A3FF-45D1-A0ED-F7E6DE8A2C20",
    "DataProviderID": 2,
    "DataProvidersReference": "84779",
    "UsageTypeID": 1,
    "AddressInfo": {
        "ID": 146172,
        "Title": "Hyatt Mitsubishi",
        "AddressLine1": "170 Glendeer Cir SE",
        "Town": "Calgary",
        "StateOrProvince": "AB",
        "Postcode": "T2H 2S8",
        "CountryID": 44,
        "Latitude": 50.988267,
        "Longitude": -114.032204,
        "ContactTelephone1": "403-253-6800",
        "AccessComments": "7:30am-5:30pm M-F, 9am-3pm Sat; For client use only",
        "RelatedURL": "",
        "DistanceUnit": 0
    },
    "Connections": [
        {
            "ID": 202580,
            "ConnectionTypeID": 1,
            "LevelID": 2,
            "Amps": 16,
            "Voltage": 230,
            "PowerKW": 3.7,
            "CurrentTypeID": 10,
            "Quantity": 3
        }
    ],
    "StatusTypeID": 50,
    "DateLastStatusUpdate": "2020-06-26T03:12:00Z",
    "DataQualityLevel": 3,
    "DateCreated": "2019-12-24T09:25:00Z",
    "SubmissionStatusTypeID": 100
}