{
    "IsRecentlyVerified": false,
    "ID": 135246,
    "UUID": "F56FD284-07A1-4321-BF5D-3ABFDEAB7F9F",
    "DataProviderID": 1,
    "OperatorID": 70,
    "UsageTypeID": 4,
    "AddressInfo": {
        "ID": 135592,
        "Title": "EŞARJ - Edirne Erasta AVM",
        "AddressLine1": "Talat Paşa Caddesi",
        "AddressLine2": "Sabuni Mahallesi",
        "Town": "Edirne merkez",
        "StateOrProvince": "Edirne merkez",
        "Postcode": "22030",
        "CountryID": 229,
        "Latitude": 41.666571,
        "Longitude": 26.571236,
        "AccessComments": "Underground parking Orange floor (-1), column S2. Available between 10:00 - 22:00",
        "RelatedURL": "https://esarj.com",
        "DistanceUnit": 0
    },
    "Connections": [
        {
            "ID": 189463,
            "ConnectionTypeID": 2,
            "StatusTypeID": 50,
            "LevelID": 3,
            "Amps": 125,
            "Voltage": 500,
            "PowerKW": 45,
            "CurrentTypeID": 30,
            "Quantity": 1
        },
        {
            "ID": 189464,
            "ConnectionTypeID": 33,
            "StatusTypeID": 50,
            "LevelID": 3,
            "Amps": 120,
            "Voltage": 500,
            "PowerKW": 45,
            "CurrentTypeID": 30,
            "Quantity": 1
        },
        {
            "ID": 189465,
            "ConnectionTypeID": 25,
            "StatusTypeID": 50,
            "LevelID": 2,
            "Amps": 32,
            "Voltage": 400,
            "PowerKW": 22,
            "CurrentTypeID": 20,
            "Quantity": 1
        }
    ],
    "NumberOfPoints": 1,
    "GeneralComments": "Available between 10:00 - 22:00",
    "StatusTypeID": 50,
    "DateLastStatusUpdate": "2019-12-18T21:04:00Z",
    "DataQualityLevel": 1,
    "DateCreated": "2019-12-12T12:02:00Z",
    "SubmissionStatusTypeID": 200
}