{
    "IsRecentlyVerified": false,
    "ID": 72944,
    "UUID": "8280E224-74A2-4823-97C4-F8267076B944",
    "DataProviderID": 2,
    "DataProvidersReference": "79293",
    "OperatorID": 5,
    "UsageTypeID": 1,
    "AddressInfo": {
        "ID": 73290,
        "Title": "PUBLIC STATIONS",
        "AddressLine1": "3810 Capitol Ave",
        "Town": "Fremont",
        "StateOrProvince": "CA",
        "Postcode": "94538",
        "CountryID": 2,
        "Latitude": 37.5484955,
        "Longitude": -121.9857394,
        "ContactTelephone1": "888-758-4389",
        "AccessComments": "24 hours daily",
        "RelatedURL": "http://www.chargepoint.com/",
        "DistanceUnit": 0
    },
    "Connections": [
        {
            "ID": 104627,
            "ConnectionTypeID": 1,
            "LevelID": 2,
            "Amps": 16,
            "Voltage": 230,
            "PowerKW": 3,
            "CurrentTypeID": 10,
            "Quantity": 2
        }
    ],
    "DateLastStatusUpdate": "2019-12-24T09:14:00Z",
    "DataQualityLevel": 3,
    "DateCreated": "2016-11-01T13:06:00Z",
    "SubmissionStatusTypeID": 100
}