{
    "IsRecentlyVerified": false,
    "ID": 187946,
    "UUID": "667B728B-1EDB-40D6-8764-E2CF4CC0E020",
    "DataProviderID": 18,
    "DataProvidersReference": "dcfbe87ba0579cb9c80afb8bc7942eea",
    "OperatorID": 3345,
    "UsageTypeID": 5,
    "AddressInfo": {
        "ID": 188305,
        "Title": "CV6 2HR",
        "AddressLine1": "",
        "Town": "Coventry",
        "Postcode": "CV6 2HR",
        "CountryID": 1,
        "Latitude": 52.437154,
        "Longitude": -1.522856,
        "AccessComments": "",
        "RelatedURL": "https://char.gy",
        "DistanceUnit": 0
    },
    "Connections": [
        {
            "ID": 303276,
            "ConnectionTypeID": 25,
            "Reference": "931",
            "StatusTypeID": 50,
            "LevelID": 2,
            "Amps": 16,
            "Voltage": 230,
            "PowerKW": 3.7,
            "CurrentTypeID": 10
        }
    ],
    "StatusTypeID": 0,
    "DateLastStatusUpdate": "2021-07-12T03:39:00Z",
    "MetadataValues": [
        {
            "ID": 20186,
            "MetadataFieldID": 4,
            "ItemValue": "Contains public sector information licensed under the Open Government Licence v2.0. http://www.nationalarchives.gov.uk/doc/open-government-licence/version/2/"
        }
    ],
    "DataQualityLevel": 3,
    "DateCreated": "2021-07-12T03:39:00Z",
    "SubmissionStatusTypeID": 100
}