{
    "IsRecentlyVerified": false,
    "ID": 130535,
    "UUID": "B0FDDFB3-5564-42C5-B1A2-C4A1F03DAFF6",
    "DataProviderID": 1,
    "OperatorID": 80,
    "UsageTypeID": 4,
    "UsageCost": "0.45€/KWh",
    "AddressInfo": {
        "ID": 130881,
        "Title": "Cascioli RENT - Noleggio a Lungo Termine | EnelX",
        "AddressLine1": "via Francia",
        "AddressLine2": "angolo Via Italia",
        "Town": "Mosciano Sant'Angelo",
        "StateOrProvince": "TE",
        "Postcode": "64023",
        "CountryID": 112,
        "Latitude": 42.7129667302951,
        "Longitude": 13.907844657266,
        "RelatedURL": "https://www.enelx.com/it/it/emobility",
        "DistanceUnit": 0
    },
    "Connections": [
        {
            "ID": 182731,
            "ConnectionTypeID": 25,
            "StatusTypeID": 50,
            "LevelID": 2,
            "Amps": 32,
            "Voltage": 400,
            "PowerKW": 22,
            "CurrentTypeID": 20,
            "Quantity": 2
        },
        {
            "ID": 182732,
            "ConnectionTypeID": 36,
            "StatusTypeID": 50,
            "LevelID": 2,
            "Amps": 16,
            "Voltage": 240,
            "PowerKW": 3.7,
            "CurrentTypeID": 10,
            "Quantity": 1
        }
    ],
    "NumberOfPoints": 2,
    "GeneralComments": "Lun -Ven 09:00 - 13:00 / 15:00 - 19:00 Sab 09:00 - 13:00 /15:30 -19:00",
    "StatusTypeID": 50,
    "DateLastStatusUpdate": "2020-05-06T15:50:00Z",
    "DataQualityLevel": 1,
    "DateCreated": "2019-08-06T10:00:00Z",
    "SubmissionStatusTypeID": 200
}