{
    "IsRecentlyVerified": false,
    "ID": 177478,
    "UUID": "1051D09E-891E-4B32-A768-E37AF0187FE3",
    "DataProviderID": 29,
    "DataProvidersReference": "17760",
    "AddressInfo": {
        "ID": 177837,
        "Title": "Lampingstraße 3",
        "AddressLine1": "Lampingstraße 3",
        "Town": "Bielefeld",
        "Postcode": "33615",
        "CountryID": 87,
        "Latitude": 52.027915,
        "Longitude": 8.512097,
        "DistanceUnit": 0
    },
    "Connections": [
        {
            "ID": 276655,
            "ConnectionTypeID": 25,
            "StatusTypeID": 50,
            "LevelID": 2,
            "PowerKW": 22,
            "CurrentTypeID": 20
        },
        {
            "ID": 276656,
            "ConnectionTypeID": 25,
            "StatusTypeID": 50,
            "LevelID": 2,
            "PowerKW": 22,
            "CurrentTypeID": 20
        }
    ],
    "StatusTypeID": 0,
    "DateLastStatusUpdate": "2021-07-12T02:48:00Z",
    "MetadataValues": [
        {
            "ID": 9772,
            "MetadataFieldID": 4,
            "ItemValue": "Data from the German chargepoint registry provided by Bundesnetzagentur.de under the CC-BY 4.0 license"
        }
    ],
    "DataQualityLevel": 3,
    "DateCreated": "2021-07-08T09:49:00Z",
    "SubmissionStatusTypeID": 100
}