{
    "IsRecentlyVerified": false,
    "ID": 15141,
    "UUID": "65375B3C-92E3-4506-B0A8-99D734DE89F1",
    "DataProviderID": 1,
    "AddressInfo": {
        "ID": 15487,
        "Title": "Hill Street",
        "AddressLine1": "Newry",
        "Town": "Down",
        "StateOrProvince": "County Down",
        "Postcode": "BT35 6BH",
        "CountryID": 1,
        "Latitude": 54.175246,
        "Longitude": -6.338146,
        "DistanceUnit": 0
    },
    "Connections": [],
    "StatusTypeID": 50,
    "DateLastStatusUpdate": "2018-06-02T14:15:00Z",
    "DataQualityLevel": 2,
    "DateCreated": "2012-12-11T15:08:00Z",
    "SubmissionStatusTypeID": 100
}