{
    "IsRecentlyVerified": false,
    "ID": 96772,
    "UUID": "7E2BB215-DAC8-4911-85FA-4D18F1D0B538",
    "DataProviderID": 2,
    "DataProvidersReference": "88340",
    "UsageTypeID": 1,
    "AddressInfo": {
        "ID": 97118,
        "Title": "Lakeland Park",
        "AddressLine1": "11 Foreman St",
        "Town": "Cazenovia",
        "StateOrProvince": "NY",
        "Postcode": "13035",
        "CountryID": 2,
        "Latitude": 42.929429,
        "Longitude": -75.859296,
        "ContactTelephone1": "315-655-3041",
        "AccessComments": "Dawn to dusk daily",
        "RelatedURL": "",
        "DistanceUnit": 0
    },
    "Connections": [
        {
            "ID": 137051,
            "ConnectionTypeID": 1,
            "LevelID": 2,
            "Amps": 16,
            "Voltage": 230,
            "PowerKW": 3.7,
            "CurrentTypeID": 10,
            "Quantity": 2
        }
    ],
    "DateLastStatusUpdate": "2020-06-26T03:06:00Z",
    "DataQualityLevel": 3,
    "DateCreated": "2017-12-29T21:01:00Z",
    "SubmissionStatusTypeID": 100
}