{
    "IsRecentlyVerified": false,
    "ID": 35508,
    "UUID": "273FBFB1-1AC9-4DA0-8147-674505D73C26",
    "DataProviderID": 26,
    "DataProvidersReference": "55499",
    "OperatorID": 180,
    "OperatorsReference": "Alfen RHL03081",
    "UsageCost": "0.00 jaarabonnement",
    "AddressInfo": {
        "ID": 35854,
        "Title": "Javalaan 71",
        "AddressLine1": "Javalaan 71",
        "Town": "Zoetermeer",
        "Postcode": "2721 KA",
        "CountryID": 159,
        "Latitude": 52.05368,
        "Longitude": 4.53712,
        "ContactTelephone1": "036 - 549 34 00",
        "RelatedURL": "http://www.icu-charging-stations.com/",
        "DistanceUnit": 0
    },
    "Connections": [
        {
            "ID": 39019,
            "ConnectionTypeID": 25,
            "LevelID": 2,
            "PowerKW": 11,
            "CurrentTypeID": 10
        },
        {
            "ID": 47903,
            "ConnectionTypeID": 25,
            "LevelID": 2,
            "PowerKW": 11,
            "CurrentTypeID": 10
        }
    ],
    "NumberOfPoints": 1,
    "StatusTypeID": 50,
    "DateLastStatusUpdate": "2016-06-04T02:45:00Z",
    "DataQualityLevel": 3,
    "DateCreated": "2015-01-09T06:05:00Z",
    "SubmissionStatusTypeID": 100
}