{
    "IsRecentlyVerified": false,
    "ID": 75398,
    "UUID": "EC217422-6E4F-47B6-B61F-6853B4AFFBEC",
    "DataProviderID": 1,
    "OperatorID": 23,
    "OperatorsReference": "19740",
    "UsageTypeID": 6,
    "UsageCost": "Free",
    "AddressInfo": {
        "ID": 75744,
        "Title": "Le Majestic Barrière Cannes",
        "AddressLine1": "10 La Croisette",
        "Town": "Cannes",
        "StateOrProvince": "Provence-Alpes-Côte d'Azur",
        "Postcode": "6400",
        "CountryID": 80,
        "Latitude": 43.550812,
        "Longitude": 7.020081,
        "ContactTelephone1": "+33 4 92 98 77 00",
        "DistanceUnit": 0
    },
    "Connections": [
        {
            "ID": 108703,
            "ConnectionTypeID": 30,
            "StatusTypeID": 50,
            "LevelID": 2,
            "Amps": 32,
            "Voltage": 400,
            "PowerKW": 22,
            "CurrentTypeID": 20,
            "Quantity": 2
        }
    ],
    "NumberOfPoints": 2,
    "GeneralComments": "2 Tesla Connector, up to 22kW.Available for patrons only. Please see valet.",
    "StatusTypeID": 50,
    "DateLastStatusUpdate": "2018-10-03T15:57:00Z",
    "DataQualityLevel": 1,
    "DateCreated": "2016-12-14T19:50:00Z",
    "SubmissionStatusTypeID": 200
}