{
    "IsRecentlyVerified": false,
    "ID": 114120,
    "UUID": "CE4E6570-3E51-4E11-BD11-4C5D448FE3FB",
    "DataProviderID": 1,
    "OperatorID": 23,
    "OperatorsReference": "47577",
    "UsageTypeID": 6,
    "AddressInfo": {
        "ID": 114466,
        "Title": "Ace Cafe Luzern",
        "AddressLine1": "Sonnmatthof 2",
        "Town": "Rothenburg",
        "Postcode": "6023",
        "CountryID": 217,
        "Latitude": 47.09152,
        "Longitude": 8.242202,
        "ContactTelephone1": " +41 4153 00044",
        "DistanceUnit": 0
    },
    "Connections": [
        {
            "ID": 160690,
            "ConnectionTypeID": 30,
            "StatusTypeID": 50,
            "LevelID": 2,
            "Amps": 16,
            "Voltage": 400,
            "PowerKW": 11,
            "CurrentTypeID": 20,
            "Quantity": 2
        }
    ],
    "NumberOfPoints": 2,
    "GeneralComments": "2 Tesla Connectors, up to 11kW.Available for patrons only. Self park.",
    "StatusTypeID": 50,
    "DateLastStatusUpdate": "2019-01-03T07:56:00Z",
    "DataQualityLevel": 1,
    "DateCreated": "2019-01-03T07:56:00Z",
    "SubmissionStatusTypeID": 200
}