{
    "IsRecentlyVerified": false,
    "ID": 149778,
    "UUID": "565043B3-D6F1-4660-AC4C-EC3A80A34252",
    "DataProviderID": 18,
    "DataProvidersReference": "0ce89c036f00ea18143e1e72d75e28ee",
    "OperatorID": 3391,
    "UsageTypeID": 1,
    "AddressInfo": {
        "ID": 150131,
        "Title": "West Hill Street",
        "AddressLine1": "West Hill Street",
        "Town": "Brighton",
        "Postcode": "BN1 3RR",
        "CountryID": 1,
        "Latitude": 50.829389,
        "Longitude": -0.145706,
        "AccessComments": "",
        "RelatedURL": "https://www.electricblueuk.com/",
        "DistanceUnit": 0
    },
    "Connections": [
        {
            "ID": 207951,
            "ConnectionTypeID": 25,
            "Reference": "62196-2 (SINGLE PHASE)",
            "StatusTypeID": 50,
            "LevelID": 2,
            "Amps": 16,
            "Voltage": 230,
            "PowerKW": 3.7,
            "CurrentTypeID": 10
        }
    ],
    "StatusTypeID": 0,
    "DateLastStatusUpdate": "2020-03-17T08:53:00Z",
    "MetadataValues": [
        {
            "ID": 7039,
            "MetadataFieldID": 4,
            "ItemValue": "Contains public sector information licensed under the Open Government Licence v2.0. http://www.nationalarchives.gov.uk/doc/open-government-licence/version/2/"
        }
    ],
    "DataQualityLevel": 3,
    "DateCreated": "2020-03-05T14:22:00Z",
    "SubmissionStatusTypeID": 100
}