{
    "IsRecentlyVerified": false,
    "ID": 128803,
    "UUID": "621E215A-8E7D-4D49-86CB-A90044BB1B55",
    "DataProviderID": 1,
    "OperatorID": 150,
    "UsageTypeID": 4,
    "UsageCost": "£0.85 + £0.25/kWh",
    "AddressInfo": {
        "ID": 129149,
        "Title": "Rhodfa Padarn",
        "AddressLine1": "Canolfan Rheidol",
        "Town": "Aberystwyth",
        "StateOrProvince": "Ceredigion",
        "Postcode": "SY23 3UR",
        "CountryID": 1,
        "Latitude": 52.407964,
        "Longitude": -4.069735,
        "DistanceUnit": 0
    },
    "Connections": [
        {
            "ID": 180202,
            "ConnectionTypeID": 25,
            "StatusTypeID": 50,
            "LevelID": 2,
            "Amps": 32,
            "Voltage": 400,
            "PowerKW": 22,
            "CurrentTypeID": 20,
            "Quantity": 2
        }
    ],
    "NumberOfPoints": 2,
    "StatusTypeID": 50,
    "DateLastStatusUpdate": "2019-06-28T08:54:00Z",
    "DataQualityLevel": 1,
    "DateCreated": "2019-06-28T08:54:00Z",
    "SubmissionStatusTypeID": 200
}