{
    "IsRecentlyVerified": false,
    "ID": 102016,
    "UUID": "885481E5-5E7E-4386-8735-0C3D89F1FBB4",
    "DataProviderID": 1,
    "OperatorID": 23,
    "OperatorsReference": "42234",
    "UsageTypeID": 4,
    "AddressInfo": {
        "ID": 102362,
        "Title": "Club Village & Hotel Spiaggia Romea",
        "AddressLine1": "Via Oasi",
        "Town": "2",
        "StateOrProvince": "Lido delle Nazioni - Comacchio",
        "Postcode": "44022",
        "CountryID": 112,
        "Latitude": 44.783762,
        "Longitude": 12.25106,
        "ContactTelephone1": "+39 0533 355 366",
        "DistanceUnit": 0
    },
    "Connections": [
        {
            "ID": 143999,
            "ConnectionTypeID": 30,
            "StatusTypeID": 50,
            "LevelID": 2,
            "Amps": 32,
            "Voltage": 400,
            "PowerKW": 22,
            "CurrentTypeID": 20,
            "Quantity": 1
        }
    ],
    "NumberOfPoints": 1,
    "GeneralComments": "1 Tesla Connector, up to 22kW.Available for customers. Please call ahead.",
    "StatusTypeID": 50,
    "DateLastStatusUpdate": "2018-10-03T23:46:00Z",
    "DataQualityLevel": 1,
    "DateCreated": "2018-04-16T04:56:00Z",
    "SubmissionStatusTypeID": 200
}