{
    "IsRecentlyVerified": false,
    "ID": 184221,
    "UUID": "BFA0F69C-0221-4D18-9955-CF9532A467AA",
    "DataProviderID": 29,
    "DataProvidersReference": "1903,243",
    "AddressInfo": {
        "ID": 184580,
        "Title": "Drömlingsstraße 14",
        "AddressLine1": "Drömlingsstraße 14",
        "Town": "Wolfsburg",
        "Postcode": "38448",
        "CountryID": 87,
        "Latitude": 52.443049,
        "Longitude": 10.816064,
        "DistanceUnit": 0
    },
    "Connections": [
        {
            "ID": 292192,
            "ConnectionTypeID": 25,
            "StatusTypeID": 50,
            "LevelID": 2,
            "PowerKW": 22,
            "CurrentTypeID": 20
        },
        {
            "ID": 292193,
            "ConnectionTypeID": 25,
            "StatusTypeID": 50,
            "LevelID": 2,
            "PowerKW": 22,
            "CurrentTypeID": 20
        },
        {
            "ID": 292194,
            "ConnectionTypeID": 25,
            "StatusTypeID": 50,
            "LevelID": 2,
            "PowerKW": 22,
            "CurrentTypeID": 20
        },
        {
            "ID": 292195,
            "ConnectionTypeID": 25,
            "StatusTypeID": 50,
            "LevelID": 2,
            "PowerKW": 22,
            "CurrentTypeID": 20
        }
    ],
    "StatusTypeID": 50,
    "DateLastStatusUpdate": "2021-07-09T03:27:00Z",
    "MetadataValues": [
        {
            "ID": 16512,
            "MetadataFieldID": 4,
            "ItemValue": "Data from the German chargepoint registry provided by Bundesnetzagentur.de under the CC-BY 4.0 license"
        }
    ],
    "DataQualityLevel": 3,
    "DateCreated": "2021-07-08T10:05:00Z",
    "SubmissionStatusTypeID": 100
}