{
    "MediaItems": [
        {
            "ID": 27278,
            "ChargePointID": 165455,
            "ItemURL": "https://s3-ap-southeast-2.amazonaws.com/openchargemap/images/FR/OCM165455/OCM-165455.orig.2021041308413446.jpg",
            "ItemThumbnailURL": "https://s3-ap-southeast-2.amazonaws.com/openchargemap/images/FR/OCM165455/OCM-165455.thmb.2021041308413446.jpg",
            "Comment": "",
            "IsEnabled": true,
            "IsVideo": false,
            "IsFeaturedItem": false,
            "IsExternalResource": false,
            "User": {
                "ID": 31601,
                "Username": "leofra31"
            },
            "DateCreated": "2021-04-13T08:42:00Z"
        },
        {
            "ID": 27277,
            "ChargePointID": 165455,
            "ItemURL": "https://s3-ap-southeast-2.amazonaws.com/openchargemap/images/FR/OCM165455/OCM-165455.orig.2021041308411704.jpg",
            "ItemThumbnailURL": "https://s3-ap-southeast-2.amazonaws.com/openchargemap/images/FR/OCM165455/OCM-165455.thmb.2021041308411704.jpg",
            "Comment": "",
            "IsEnabled": true,
            "IsVideo": false,
            "IsFeaturedItem": false,
            "IsExternalResource": false,
            "User": {
                "ID": 31601,
                "Username": "leofra31"
            },
            "DateCreated": "2021-04-13T08:41:00Z"
        }
    ],
    "IsRecentlyVerified": false,
    "ID": 165455,
    "UUID": "AE1E6815-653B-4FFE-A61A-C915DE32922A",
    "DataProviderID": 28,
    "DataProvidersReference": "FR*S64*PMB64*65",
    "OperatorID": 3407,
    "UsageTypeID": 5,
    "AddressInfo": {
        "ID": 165814,
        "Title": "LA BASTIDE DE CLAIRENCE - Parking Rd10",
        "AddressLine1": "Parking Rd10 64240 LA BASTIDE DE CLAIRENCE",
        "CountryID": 80,
        "Latitude": 43.429482,
        "Longitude": -1.256211,
        "AccessComments": "24h/24 7j/7",
        "DistanceUnit": 0
    },
    "Connections": [
        {
            "ID": 238902,
            "ConnectionTypeID": 25,
            "StatusTypeID": 50,
            "LevelID": 2,
            "PowerKW": 18,
            "CurrentTypeID": 20
        },
        {
            "ID": 238903,
            "ConnectionTypeID": 28,
            "StatusTypeID": 50,
            "LevelID": 2,
            "PowerKW": 18,
            "CurrentTypeID": 10
        },
        {
            "ID": 238904,
            "ConnectionTypeID": 25,
            "StatusTypeID": 50,
            "LevelID": 2,
            "PowerKW": 18,
            "CurrentTypeID": 20
        },
        {
            "ID": 238905,
            "ConnectionTypeID": 28,
            "StatusTypeID": 50,
            "LevelID": 2,
            "PowerKW": 18,
            "CurrentTypeID": 10
        }
    ],
    "GeneralComments": "Recharge par badge et avec une application smartphone",
    "StatusTypeID": 50,
    "DateLastStatusUpdate": "2021-04-13T08:42:00Z",
    "DataQualityLevel": 2,
    "DateCreated": "2020-08-27T05:10:00Z",
    "SubmissionStatusTypeID": 100
}