{
    "IsRecentlyVerified": false,
    "ID": 36649,
    "UUID": "886624A0-A527-43EF-A586-AFCFC773CD7D",
    "DataProviderID": 26,
    "DataProvidersReference": "21344",
    "OperatorID": 157,
    "OperatorsReference": "NewMotion 01000855",
    "UsageCost": "0.00 afhankelijk van pas",
    "AddressInfo": {
        "ID": 36995,
        "Title": "Roggestraat",
        "AddressLine1": "Roggestraat",
        "Town": "Apeldoorn",
        "Postcode": "7311 CE",
        "CountryID": 159,
        "Latitude": 52.2158699035645,
        "Longitude": 5.95658302307129,
        "ContactTelephone1": "088 0109500",
        "RelatedURL": "http://thenewmotion.nl/",
        "DistanceUnit": 0
    },
    "Connections": [
        {
            "ID": 40160,
            "ConnectionTypeID": 25,
            "LevelID": 2,
            "PowerKW": 3.7,
            "CurrentTypeID": 10
        },
        {
            "ID": 82309,
            "ConnectionTypeID": 25,
            "LevelID": 2,
            "PowerKW": 3.7,
            "CurrentTypeID": 10
        }
    ],
    "NumberOfPoints": 1,
    "StatusTypeID": 50,
    "DateLastStatusUpdate": "2016-06-04T02:51:00Z",
    "DataQualityLevel": 3,
    "DateCreated": "2015-01-09T06:05:00Z",
    "SubmissionStatusTypeID": 100
}