{
    "IsRecentlyVerified": false,
    "ID": 145934,
    "UUID": "1AAA2431-ABAE-43F5-91BB-8383E5D36330",
    "DataProviderID": 1,
    "OperatorID": 45,
    "UsageTypeID": 1,
    "UsageCost": "0",
    "AddressInfo": {
        "ID": 146286,
        "Title": "LMT Inc.",
        "AddressLine1": "1105 Southeast 2nd Street",
        "Town": "Galva",
        "StateOrProvince": "Henry County",
        "Postcode": "61434",
        "CountryID": 2,
        "Latitude": 41.163296927350615,
        "Longitude": -90.02499200157172,
        "ContactTelephone1": "319-530-8878 (text)",
        "ContactEmail": "info@lmtmfg.com",
        "AccessComments": "Provided as a service to promote EV adoption in the area. LMT is located East of the center of Galva, IL on US Hwy 34. Across the highway from the ethanol plant. The charger is located on the North side of the building to the left of the main entrance.",
        "RelatedURL": "https://www.lmtmfg.com",
        "DistanceUnit": 0
    },
    "Connections": [
        {
            "ID": 202807,
            "ConnectionTypeID": 1,
            "StatusTypeID": 50,
            "LevelID": 2,
            "Amps": 40,
            "Voltage": 240,
            "PowerKW": 9.6,
            "CurrentTypeID": 10,
            "Quantity": 1
        }
    ],
    "NumberOfPoints": 1,
    "GeneralComments": "JuiceBox Pro 40 Smart EV Charging Station with WiFi - 40 amp Level 2 EVSE, 24-foot cable. Powered by 150 x 345W (50kW) Solar Panel Array - WiFi SSID: LMT_Guest  And no, the sun does not need to be shining.",
    "StatusTypeID": 50,
    "DateLastStatusUpdate": "2020-01-02T17:36:00Z",
    "DataQualityLevel": 1,
    "DateCreated": "2019-12-28T14:47:00Z",
    "SubmissionStatusTypeID": 200
}