{
    "IsRecentlyVerified": false,
    "ID": 90250,
    "UUID": "C74876C8-6EE1-4304-8D74-F2258659CE95",
    "DataProviderID": 1,
    "OperatorID": 23,
    "OperatorsReference": "31580",
    "UsageTypeID": 6,
    "AddressInfo": {
        "ID": 90596,
        "Title": "Poplar Springs Inn & Spa",
        "AddressLine1": "5025 Casanova RD",
        "Town": "Warrenton",
        "StateOrProvince": "Virginia",
        "Postcode": "20187",
        "CountryID": 2,
        "Latitude": 38.651111,
        "Longitude": -77.713847,
        "ContactTelephone1": "(540) 788-4600",
        "DistanceUnit": 0
    },
    "Connections": [
        {
            "ID": 127903,
            "ConnectionTypeID": 30,
            "StatusTypeID": 50,
            "LevelID": 2,
            "PowerKW": 13,
            "CurrentTypeID": 20,
            "Quantity": 2
        }
    ],
    "NumberOfPoints": 2,
    "GeneralComments": "2 Tesla Connectors, up to 13kW.Available for patrons only. Please call ahead.",
    "StatusTypeID": 50,
    "DateLastStatusUpdate": "2017-07-13T14:29:00Z",
    "DataQualityLevel": 1,
    "DateCreated": "2017-07-13T14:29:00Z",
    "SubmissionStatusTypeID": 200
}