{
    "IsRecentlyVerified": false,
    "ID": 87574,
    "UUID": "9B096B00-9CCA-4684-B760-F94399817375",
    "DataProviderID": 1,
    "OperatorID": 229,
    "UsageTypeID": 4,
    "UsageCost": "$0.25/kWh + $0.25/min",
    "AddressInfo": {
        "ID": 87920,
        "Title": "Tairua, Opposite Ambulance Station",
        "AddressLine1": "Manaia Road",
        "AddressLine2": "Paku",
        "Town": "Thames Coromandel District",
        "StateOrProvince": "Thames Coromandel District",
        "CountryID": 161,
        "Latitude": -37.000794,
        "Longitude": 175.850207,
        "DistanceUnit": 0
    },
    "Connections": [
        {
            "ID": 124142,
            "ConnectionTypeID": 2,
            "StatusTypeID": 50,
            "LevelID": 3,
            "PowerKW": 50,
            "CurrentTypeID": 30,
            "Quantity": 1
        },
        {
            "ID": 124143,
            "ConnectionTypeID": 33,
            "StatusTypeID": 50,
            "LevelID": 3,
            "PowerKW": 50,
            "CurrentTypeID": 30,
            "Quantity": 1
        }
    ],
    "NumberOfPoints": 1,
    "StatusTypeID": 50,
    "DateLastStatusUpdate": "2017-05-13T10:56:00Z",
    "DataQualityLevel": 1,
    "DateCreated": "2017-05-13T10:56:00Z",
    "SubmissionStatusTypeID": 200
}