{
    "IsRecentlyVerified": false,
    "ID": 75681,
    "UUID": "4182BD38-261E-4902-BD4E-A40AFADB13AF",
    "DataProviderID": 1,
    "OperatorID": 105,
    "UsageTypeID": 4,
    "AddressInfo": {
        "ID": 76027,
        "Title": "Parkplatz Westküstenklinikum",
        "AddressLine1": "Gartenweg",
        "Town": "Heide",
        "StateOrProvince": "Kreis Dithmarschen",
        "Postcode": "25746",
        "CountryID": 87,
        "Latitude": 54.19818108803648,
        "Longitude": 9.080565931877134,
        "AccessComments": "2 Parkplätze hinter einer Schranke auf dem Parkplatz. 24/7 nutzbar mit Parkgebühren.",
        "DistanceUnit": 0
    },
    "Connections": [
        {
            "ID": 109144,
            "ConnectionTypeID": 25,
            "StatusTypeID": 50,
            "LevelID": 2,
            "Amps": 32,
            "Voltage": 400,
            "PowerKW": 22,
            "CurrentTypeID": 20,
            "Quantity": 2
        }
    ],
    "NumberOfPoints": 2,
    "StatusTypeID": 50,
    "DateLastStatusUpdate": "2016-12-19T12:07:00Z",
    "DataQualityLevel": 1,
    "DateCreated": "2016-12-19T12:07:00Z",
    "SubmissionStatusTypeID": 200
}