{
    "IsRecentlyVerified": false,
    "ID": 119496,
    "UUID": "2332E279-CAB9-42D6-A2AB-DBA7EE2E29BA",
    "DataProviderID": 2,
    "DataProvidersReference": "45985",
    "UsageTypeID": 1,
    "AddressInfo": {
        "ID": 119842,
        "Title": "Princeville Shopping Center",
        "AddressLine1": "5-4280 Kuhio Hwy",
        "Town": "Princeville",
        "StateOrProvince": "HI",
        "Postcode": "96722",
        "CountryID": 2,
        "Latitude": 22.212721,
        "Longitude": -159.476393,
        "ContactTelephone1": "808-826-9497",
        "AccessComments": "6am-11pm daily; pay lot",
        "RelatedURL": "",
        "DistanceUnit": 0
    },
    "Connections": [
        {
            "ID": 168767,
            "ConnectionTypeID": 1,
            "LevelID": 2,
            "Amps": 16,
            "Voltage": 230,
            "PowerKW": 3.7,
            "CurrentTypeID": 10,
            "Quantity": 2
        }
    ],
    "DateLastStatusUpdate": "2020-06-26T02:52:00Z",
    "DataQualityLevel": 3,
    "DateCreated": "2019-04-01T04:59:00Z",
    "SubmissionStatusTypeID": 100
}