{
    "IsRecentlyVerified": false,
    "ID": 141704,
    "UUID": "F4A4CBE9-0D07-4EB3-A2B8-507895DB1E77",
    "DataProviderID": 2,
    "DataProvidersReference": "123641",
    "UsageTypeID": 1,
    "AddressInfo": {
        "ID": 142056,
        "Title": "Maryland Science Center",
        "AddressLine1": "601 Light St",
        "Town": "Baltimore",
        "StateOrProvince": "MD",
        "Postcode": "21230",
        "CountryID": 2,
        "Latitude": 39.28223,
        "Longitude": -76.612824,
        "ContactTelephone1": "410-685-1109",
        "AccessComments": "24 hours daily",
        "RelatedURL": "",
        "DistanceUnit": 0
    },
    "Connections": [
        {
            "ID": 197697,
            "ConnectionTypeID": 1,
            "LevelID": 2,
            "Amps": 16,
            "Voltage": 230,
            "PowerKW": 3.7,
            "CurrentTypeID": 10,
            "Quantity": 2
        }
    ],
    "StatusTypeID": 50,
    "DateLastStatusUpdate": "2020-06-26T03:01:00Z",
    "DataQualityLevel": 3,
    "DateCreated": "2019-12-24T09:16:00Z",
    "SubmissionStatusTypeID": 100
}