{
    "IsRecentlyVerified": false,
    "ID": 31848,
    "UUID": "B56C0485-BB38-44E8-8181-7A8AF993DC7B",
    "DataProviderID": 1,
    "OperatorID": 45,
    "OperatorsReference": "Essent EM-DE-09161000-02-00001",
    "UsageTypeID": 1,
    "UsageCost": "0",
    "AddressInfo": {
        "ID": 32194,
        "Title": "Saturn Markt (mit E-Bike Station)",
        "AddressLine1": "Am Westpark 7",
        "Town": "Ingolstadt",
        "Postcode": "85057",
        "CountryID": 87,
        "Latitude": 48.7764,
        "Longitude": 11.3869,
        "AccessComments": "Auto-Ladestation gleich in der ersten Parkreihe vor dem Eingang. Wird mit Pylonen von Verbrennern freigehalten! Kabel einstecken und schon geht die Ladung los!\r\nGrüngelbe E-Bike Station von Bike Energy mit 3 Schukodosen mit 16A Gesamtbelastbarkeit und 3 DC Akkuladeanschlüssen, nur mit Sepzialkabel nutzbar.",
        "DistanceUnit": 0
    },
    "Connections": [
        {
            "ID": 35359,
            "ConnectionTypeID": 25,
            "StatusTypeID": 50,
            "LevelID": 2,
            "Amps": 32,
            "Voltage": 400,
            "PowerKW": 22,
            "CurrentTypeID": 20,
            "Quantity": 2
        },
        {
            "ID": 105814,
            "ConnectionTypeID": 28,
            "StatusTypeID": 50,
            "LevelID": 1,
            "Amps": 10,
            "Voltage": 230,
            "PowerKW": 2.3,
            "CurrentTypeID": 10,
            "Quantity": 3
        }
    ],
    "NumberOfPoints": 3,
    "StatusTypeID": 50,
    "DateLastStatusUpdate": "2016-11-23T08:47:00Z",
    "DataQualityLevel": 3,
    "DateCreated": "2015-01-09T06:03:00Z",
    "SubmissionStatusTypeID": 200
}