{
    "MediaItems": [
        {
            "ID": 20588,
            "ChargePointID": 134044,
            "ItemURL": "https://s3-ap-southeast-2.amazonaws.com/openchargemap/images/CA/OCM134044/OCM-134044.orig.2019121518304575.jpg",
            "ItemThumbnailURL": "https://s3-ap-southeast-2.amazonaws.com/openchargemap/images/CA/OCM134044/OCM-134044.thmb.2019121518304575.jpg",
            "Comment": "",
            "IsEnabled": true,
            "IsVideo": false,
            "IsFeaturedItem": false,
            "IsExternalResource": false,
            "User": {
                "ID": 22855,
                "Username": "bert hogendoorn "
            },
            "DateCreated": "2019-12-15T18:31:00Z"
        },
        {
            "ID": 20423,
            "ChargePointID": 134044,
            "ItemURL": "https://s3-ap-southeast-2.amazonaws.com/openchargemap/images/CA/OCM134044/OCM-134044.orig.2019112318015748.jpg",
            "ItemThumbnailURL": "https://s3-ap-southeast-2.amazonaws.com/openchargemap/images/CA/OCM134044/OCM-134044.thmb.2019112318015748.jpg",
            "Comment": "",
            "IsEnabled": true,
            "IsVideo": false,
            "IsFeaturedItem": false,
            "IsExternalResource": false,
            "User": {
                "ID": 22855,
                "Username": "bert hogendoorn "
            },
            "DateCreated": "2019-11-23T18:02:00Z"
        },
        {
            "ID": 20172,
            "ChargePointID": 134044,
            "ItemURL": "https://s3-ap-southeast-2.amazonaws.com/openchargemap/images/CA/OCM134044/OCM-134044.orig.2019110122132625.jpg",
            "ItemThumbnailURL": "https://s3-ap-southeast-2.amazonaws.com/openchargemap/images/CA/OCM134044/OCM-134044.thmb.2019110122132625.jpg",
            "Comment": "",
            "IsEnabled": true,
            "IsVideo": false,
            "IsFeaturedItem": false,
            "IsExternalResource": false,
            "User": {
                "ID": 22855,
                "Username": "bert hogendoorn "
            },
            "DateCreated": "2019-11-01T22:14:00Z"
        }
    ],
    "IsRecentlyVerified": false,
    "ID": 134044,
    "UUID": "8A9B5DFC-A95E-4251-9D4F-0D4798D52798",
    "DataProviderID": 1,
    "OperatorID": 3375,
    "UsageTypeID": 1,
    "AddressInfo": {
        "ID": 134390,
        "Title": "Petro Canada Merritt",
        "AddressLine1": "3591 Voght Street",
        "Town": "Merritt",
        "StateOrProvince": "British Columbia",
        "Postcode": "V1K 1C5",
        "CountryID": 44,
        "Latitude": 50.123536610397224,
        "Longitude": -120.76556729359197,
        "AccessComments": "Petro-Canada\r\n“Update: Our Merritt Fast Chargers are online and available for testing. We are requesting EV owners leave their comments or message us. Thank you for your assistance. -- checkin created before location officially marked open.”",
        "DistanceUnit": 0
    },
    "Connections": [
        {
            "ID": 187558,
            "ConnectionTypeID": 2,
            "StatusTypeID": 0,
            "LevelID": 3,
            "PowerKW": 100,
            "CurrentTypeID": 30,
            "Quantity": 2
        },
        {
            "ID": 187559,
            "ConnectionTypeID": 32,
            "StatusTypeID": 0,
            "LevelID": 3,
            "PowerKW": 200,
            "CurrentTypeID": 30,
            "Quantity": 2
        }
    ],
    "NumberOfPoints": 2,
    "GeneralComments": "Petro-Canada DC Fast Chargers\r\nUp to 200kW CCS\r\nUp to 100kW CHAdeMO\r\nwww.petro-canada.ca/EV",
    "StatusTypeID": 50,
    "DateLastStatusUpdate": "2019-12-16T06:08:00Z",
    "DataQualityLevel": 1,
    "DateCreated": "2019-11-01T22:11:00Z",
    "SubmissionStatusTypeID": 200
}