{
    "IsRecentlyVerified": false,
    "ID": 184960,
    "UUID": "8FBBDBAB-9120-4F0B-8F6B-C3443508E78E",
    "DataProviderID": 29,
    "DataProvidersReference": "746",
    "OperatorID": 3403,
    "AddressInfo": {
        "ID": 185319,
        "Title": "Moosbürger Straße 15",
        "AddressLine1": "Moosbürger Straße 15",
        "Town": "Weiden",
        "Postcode": "92637",
        "CountryID": 87,
        "Latitude": 49.65966,
        "Longitude": 12.154597,
        "DistanceUnit": 0
    },
    "Connections": [
        {
            "ID": 293865,
            "ConnectionTypeID": 25,
            "StatusTypeID": 50,
            "LevelID": 2,
            "PowerKW": 11,
            "CurrentTypeID": 20
        },
        {
            "ID": 293866,
            "ConnectionTypeID": 25,
            "StatusTypeID": 50,
            "LevelID": 2,
            "PowerKW": 22,
            "CurrentTypeID": 20
        }
    ],
    "StatusTypeID": 50,
    "DateLastStatusUpdate": "2021-07-12T02:43:00Z",
    "MetadataValues": [
        {
            "ID": 17251,
            "MetadataFieldID": 4,
            "ItemValue": "Data from the German chargepoint registry provided by Bundesnetzagentur.de under the CC-BY 4.0 license"
        }
    ],
    "DataQualityLevel": 3,
    "DateCreated": "2021-07-08T10:06:00Z",
    "SubmissionStatusTypeID": 100
}