{
    "IsRecentlyVerified": false,
    "ID": 33668,
    "UUID": "CB741D55-35A3-400A-8558-F3A7909EEC74",
    "DataProviderID": 26,
    "DataProvidersReference": "22819",
    "OperatorID": 157,
    "OperatorsReference": "NewMotion 02001715",
    "UsageCost": "0.00 jaarabonnement",
    "AddressInfo": {
        "ID": 34014,
        "Title": "Heescheweg 29",
        "AddressLine1": "Heescheweg 29",
        "Town": "Bernheze",
        "Postcode": "5388 RG",
        "CountryID": 159,
        "Latitude": 51.7143402099609,
        "Longitude": 5.55686140060425,
        "ContactTelephone1": "088 0109500",
        "RelatedURL": "http://thenewmotion.nl/",
        "DistanceUnit": 0
    },
    "Connections": [
        {
            "ID": 37179,
            "ConnectionTypeID": 25,
            "LevelID": 2,
            "PowerKW": 3.7,
            "CurrentTypeID": 10
        },
        {
            "ID": 46896,
            "ConnectionTypeID": 25,
            "LevelID": 2,
            "PowerKW": 3.7,
            "CurrentTypeID": 10
        }
    ],
    "NumberOfPoints": 1,
    "StatusTypeID": 50,
    "DateLastStatusUpdate": "2016-06-04T02:40:00Z",
    "DataQualityLevel": 3,
    "DateCreated": "2015-01-09T06:04:00Z",
    "SubmissionStatusTypeID": 100
}