{
    "IsRecentlyVerified": false,
    "ID": 84172,
    "UUID": "BF25CA61-4B76-4625-919E-D593A055B76E",
    "DataProviderID": 1,
    "OperatorID": 23,
    "OperatorsReference": "24771",
    "UsageTypeID": 6,
    "AddressInfo": {
        "ID": 84518,
        "Title": "Hotel Federale Lugano",
        "AddressLine1": "8 Via Paolo Regazzoni",
        "Town": "Lugano",
        "Postcode": "6900",
        "CountryID": 217,
        "Latitude": 46.005549,
        "Longitude": 8.947701,
        "ContactTelephone1": "+41 9191 00808",
        "DistanceUnit": 0
    },
    "Connections": [
        {
            "ID": 119573,
            "ConnectionTypeID": 30,
            "StatusTypeID": 50,
            "LevelID": 2,
            "Amps": 16,
            "Voltage": 400,
            "PowerKW": 11,
            "CurrentTypeID": 20,
            "Quantity": 1
        }
    ],
    "NumberOfPoints": 1,
    "GeneralComments": "1 Tesla Connector, up to 11kW.Available for patrons only. Please see front desk.",
    "StatusTypeID": 50,
    "DateLastStatusUpdate": "2018-10-03T21:25:00Z",
    "DataQualityLevel": 1,
    "DateCreated": "2017-02-16T17:06:00Z",
    "SubmissionStatusTypeID": 200
}