{
    "IsRecentlyVerified": false,
    "ID": 92250,
    "UUID": "BA6A320C-9C1B-4D09-A8B6-8AA3993383A6",
    "DataProviderID": 1,
    "OperatorID": 23,
    "OperatorsReference": "33330",
    "UsageTypeID": 4,
    "AddressInfo": {
        "ID": 92596,
        "Title": "Lewis & Clark College",
        "AddressLine1": "0615 SW Palatine Hill RD",
        "Town": "Lake Oswego",
        "StateOrProvince": "Oregon",
        "Postcode": "97219",
        "CountryID": 2,
        "Latitude": 45.447334,
        "Longitude": -122.670041,
        "ContactTelephone1": "(503) 768-7000",
        "DistanceUnit": 0
    },
    "Connections": [
        {
            "ID": 130793,
            "ConnectionTypeID": 30,
            "StatusTypeID": 50,
            "LevelID": 2,
            "PowerKW": 10,
            "CurrentTypeID": 10,
            "Quantity": 1
        }
    ],
    "NumberOfPoints": 1,
    "GeneralComments": "1 Tesla Connector, up to 10kW.Available to the public. Self park.",
    "StatusTypeID": 50,
    "DateLastStatusUpdate": "2017-09-01T05:32:00Z",
    "DataQualityLevel": 1,
    "DateCreated": "2017-09-01T05:32:00Z",
    "SubmissionStatusTypeID": 200
}