{
    "IsRecentlyVerified": false,
    "ID": 105624,
    "UUID": "79351ECB-A659-4F84-99B5-3617D6074A75",
    "DataProviderID": 2,
    "DataProvidersReference": "98781",
    "OperatorID": 5,
    "UsageTypeID": 1,
    "AddressInfo": {
        "ID": 105970,
        "Title": "CARLSBAD CA",
        "AddressLine1": "3209 Harding St",
        "Town": "Carlsbad",
        "StateOrProvince": "CA",
        "Postcode": "92008",
        "CountryID": 2,
        "Latitude": 33.1589673,
        "Longitude": -117.342644,
        "ContactTelephone1": "888-758-4389",
        "AccessComments": "24 hours daily",
        "RelatedURL": "http://www.chargepoint.com/",
        "DistanceUnit": 0
    },
    "Connections": [
        {
            "ID": 148812,
            "ConnectionTypeID": 1,
            "LevelID": 2,
            "Amps": 16,
            "Voltage": 230,
            "PowerKW": 3,
            "CurrentTypeID": 10,
            "Quantity": 2
        }
    ],
    "DateLastStatusUpdate": "2019-04-06T04:01:00Z",
    "DataQualityLevel": 3,
    "DateCreated": "2018-06-09T04:01:00Z",
    "SubmissionStatusTypeID": 100
}