{
    "IsRecentlyVerified": false,
    "ID": 133464,
    "UUID": "E29B2A59-27DF-4D65-A59E-9AFDCE238812",
    "DataProviderID": 1,
    "OperatorID": 3330,
    "UsageTypeID": 6,
    "AddressInfo": {
        "ID": 133810,
        "Title": "Ristorante Albergo da Mimi",
        "AddressLine1": "Via Di Lascio Domenico ",
        "Town": "Nemoli",
        "StateOrProvince": "PZ",
        "Postcode": "85044",
        "CountryID": 112,
        "Latitude": 40.0915842804679,
        "Longitude": 15.8079343093932,
        "ContactTelephone1": "097340586",
        "DistanceUnit": 0
    },
    "Connections": [
        {
            "ID": 186822,
            "ConnectionTypeID": 25,
            "StatusTypeID": 50,
            "LevelID": 2,
            "Amps": 32,
            "Voltage": 400,
            "PowerKW": 22,
            "CurrentTypeID": 20,
            "Quantity": 2
        }
    ],
    "NumberOfPoints": 2,
    "StatusTypeID": 50,
    "DateLastStatusUpdate": "2019-10-18T14:46:00Z",
    "DataQualityLevel": 1,
    "DateCreated": "2019-10-18T07:10:00Z",
    "SubmissionStatusTypeID": 200
}