{
    "IsRecentlyVerified": false,
    "ID": 152694,
    "UUID": "54FD8AFB-C068-443E-A20A-D14F6F264CCC",
    "DataProviderID": 28,
    "DataProvidersReference": "",
    "UsageTypeID": 5,
    "AddressInfo": {
        "ID": 153047,
        "Title": "ST PIERRE DES CORPS 4344",
        "AddressLine1": "Parking Despouy - Maison de la Jeunesse - 37700 ST PIERRE DES CORPS",
        "CountryID": 80,
        "Latitude": 47.39166,
        "Longitude": 0.718057,
        "AccessComments": "24/24 7/7",
        "DistanceUnit": 0
    },
    "Connections": [
        {
            "ID": 213868,
            "ConnectionTypeID": 28,
            "StatusTypeID": 50,
            "LevelID": 2,
            "PowerKW": 18,
            "CurrentTypeID": 10
        },
        {
            "ID": 213869,
            "ConnectionTypeID": 25,
            "StatusTypeID": 50,
            "LevelID": 2,
            "PowerKW": 18,
            "CurrentTypeID": 10
        }
    ],
    "GeneralComments": "www.virtaev.fr",
    "StatusTypeID": 50,
    "DateLastStatusUpdate": "2020-03-15T10:54:00Z",
    "DataQualityLevel": 2,
    "DateCreated": "2020-03-15T10:54:00Z",
    "SubmissionStatusTypeID": 100
}