{
    "IsRecentlyVerified": false,
    "ID": 121643,
    "UUID": "D872DDAB-FB2B-4A3D-B54E-A448835CA7B0",
    "DataProviderID": 2,
    "DataProvidersReference": "121156",
    "OperatorID": 3318,
    "UsageTypeID": 1,
    "AddressInfo": {
        "ID": 121989,
        "Title": "Alltown Fresh Convenience Market",
        "AddressLine1": "24 Long Pond Road",
        "Town": "Plymouth",
        "StateOrProvince": "MA",
        "Postcode": "02360",
        "CountryID": 2,
        "Latitude": 41.932809,
        "Longitude": -70.657551,
        "ContactTelephone1": "833-632-2778",
        "AccessComments": "24 hours daily",
        "RelatedURL": "https://www.electrifyamerica.com/",
        "DistanceUnit": 0
    },
    "Connections": [
        {
            "ID": 171427,
            "ConnectionTypeID": 2,
            "LevelID": 2,
            "Amps": 100,
            "Voltage": 400,
            "PowerKW": 40,
            "CurrentTypeID": 10,
            "Quantity": 1
        },
        {
            "ID": 171428,
            "ConnectionTypeID": 32,
            "LevelID": 2,
            "Amps": 100,
            "Voltage": 400,
            "PowerKW": 40,
            "CurrentTypeID": 10,
            "Quantity": 1
        }
    ],
    "DateLastStatusUpdate": "2019-04-06T04:01:00Z",
    "DataQualityLevel": 3,
    "DateCreated": "2019-04-06T04:01:00Z",
    "SubmissionStatusTypeID": 100
}