{
    "IsRecentlyVerified": false,
    "ID": 63264,
    "UUID": "F1DBCA27-850A-4D26-9C95-3FA301F0E2C7",
    "DataProviderID": 26,
    "DataProvidersReference": "75884",
    "OperatorID": 73,
    "OperatorsReference": "EV-Box EVB-P1450084",
    "UsageCost": "0.00 jaarabonnement",
    "AddressInfo": {
        "ID": 63610,
        "Title": "Rondo 100",
        "AddressLine1": "Rondo 100",
        "Town": "Krimpen aan den IJssel",
        "Postcode": "2925 AG",
        "CountryID": 159,
        "Latitude": 51.91777,
        "Longitude": 4.61253,
        "RelatedURL": "http://www.ev-box.nl",
        "DistanceUnit": 0
    },
    "Connections": [
        {
            "ID": 80590,
            "ConnectionTypeID": 25,
            "LevelID": 2,
            "PowerKW": 5,
            "CurrentTypeID": 10
        }
    ],
    "NumberOfPoints": 1,
    "StatusTypeID": 50,
    "DateLastStatusUpdate": "2016-06-04T02:42:00Z",
    "DataQualityLevel": 3,
    "DateCreated": "2016-03-03T12:30:00Z",
    "SubmissionStatusTypeID": 100
}