{
    "IsRecentlyVerified": false,
    "ID": 120726,
    "UUID": "93F66E04-585D-4089-BE68-BD1B317220F0",
    "DataProviderID": 2,
    "DataProvidersReference": "60634",
    "OperatorID": 5,
    "UsageTypeID": 1,
    "AddressInfo": {
        "ID": 121072,
        "Title": "BMW S ATLANTA",
        "AddressLine1": "4171 Jonesboro Rd",
        "Town": "Union City",
        "StateOrProvince": "GA",
        "Postcode": "30291",
        "CountryID": 2,
        "Latitude": 33.5673248,
        "Longitude": -84.5226611,
        "ContactTelephone1": "888-758-4389",
        "AccessComments": "24 hours daily",
        "RelatedURL": "http://www.chargepoint.com/",
        "DistanceUnit": 0
    },
    "Connections": [
        {
            "ID": 170104,
            "ConnectionTypeID": 1,
            "LevelID": 2,
            "Amps": 16,
            "Voltage": 230,
            "PowerKW": 3,
            "CurrentTypeID": 10,
            "Quantity": 2
        }
    ],
    "DateLastStatusUpdate": "2019-12-24T09:10:00Z",
    "DataQualityLevel": 3,
    "DateCreated": "2019-04-01T04:59:00Z",
    "SubmissionStatusTypeID": 100
}