{
    "IsRecentlyVerified": false,
    "ID": 173046,
    "UUID": "E5626443-37B2-44E1-9889-9B51970E2B9F",
    "DataProviderID": 1,
    "OperatorID": 3,
    "OperatorsReference": "PG-70368,PG-86114",
    "UsageTypeID": 4,
    "UsageCost": "Free",
    "AddressInfo": {
        "ID": 173405,
        "Title": "Tesco Metro-Brandon",
        "AddressLine1": "London Road",
        "Town": "Brandon",
        "Postcode": "IP27 0ER",
        "CountryID": 1,
        "Latitude": 52.444333,
        "Longitude": 0.618738,
        "DistanceUnit": 0
    },
    "Connections": [
        {
            "ID": 264774,
            "ConnectionTypeID": 25,
            "StatusTypeID": 50,
            "LevelID": 2,
            "Amps": 32,
            "Voltage": 230,
            "PowerKW": 7,
            "CurrentTypeID": 10,
            "Quantity": 4
        }
    ],
    "NumberOfPoints": 4,
    "GeneralComments": "This is an open charge unit installed at the Tesco Metro super store at London Road, Brandon",
    "StatusTypeID": 50,
    "DateLastStatusUpdate": "2021-03-02T21:10:00Z",
    "DataQualityLevel": 1,
    "DateCreated": "2021-03-02T21:01:00Z",
    "SubmissionStatusTypeID": 200
}