{
    "MediaItems": [
        {
            "ID": 17143,
            "ChargePointID": 113319,
            "ItemURL": "https://s3-ap-southeast-2.amazonaws.com/openchargemap/images/GR/OCM113319/OCM-113319.orig.2018120113001888.jpg",
            "ItemThumbnailURL": "https://s3-ap-southeast-2.amazonaws.com/openchargemap/images/GR/OCM113319/OCM-113319.thmb.2018120113001888.jpg",
            "Comment": "",
            "IsEnabled": true,
            "IsVideo": false,
            "IsFeaturedItem": false,
            "IsExternalResource": false,
            "User": {
                "ID": 18761,
                "Username": "EVentusiast"
            },
            "DateCreated": "2018-12-01T13:00:00Z"
        }
    ],
    "IsRecentlyVerified": false,
    "ID": 113319,
    "UUID": "BC2F3EF3-FF9E-428C-B226-D43EB05CE9A6",
    "DataProviderID": 1,
    "OperatorID": 85,
    "UsageTypeID": 1,
    "UsageCost": "7 EUR / 3hours session",
    "AddressInfo": {
        "ID": 113665,
        "Title": "Athens Marriott Hotel",
        "AddressLine1": "Leoforos Andrea Siggrou 385",
        "Town": "Paleo Faliro",
        "Postcode": "175 64 ",
        "CountryID": 90,
        "Latitude": 37.940889,
        "Longitude": 23.69666069999994,
        "ContactTelephone1": " +302109471000",
        "DistanceUnit": 0
    },
    "Connections": [
        {
            "ID": 159558,
            "ConnectionTypeID": 25,
            "StatusTypeID": 50,
            "LevelID": 2,
            "Amps": 32,
            "Voltage": 400,
            "PowerKW": 22,
            "CurrentTypeID": 20
        }
    ],
    "NumberOfPoints": 1,
    "StatusTypeID": 50,
    "DateLastStatusUpdate": "2018-12-01T20:37:00Z",
    "DataQualityLevel": 1,
    "DateCreated": "2018-12-01T12:51:00Z",
    "SubmissionStatusTypeID": 200
}