{
    "MediaItems": [
        {
            "ID": 7787,
            "ChargePointID": 34125,
            "ItemURL": "https://s3-ap-southeast-2.amazonaws.com/openchargemap/images/NL/OCM34125/OCM-34125.orig.2016071818432899.jpg",
            "ItemThumbnailURL": "https://s3-ap-southeast-2.amazonaws.com/openchargemap/images/NL/OCM34125/OCM-34125.thmb.2016071818432899.jpg",
            "Comment": "",
            "IsEnabled": true,
            "IsVideo": false,
            "IsFeaturedItem": false,
            "IsExternalResource": false,
            "User": {
                "ID": 11617,
                "Username": "Bert van Sas"
            },
            "DateCreated": "2016-07-18T18:44:00Z"
        },
        {
            "ID": 7788,
            "ChargePointID": 34125,
            "ItemURL": "https://s3-ap-southeast-2.amazonaws.com/openchargemap/images/NL/OCM34125/OCM-34125.orig.2016071818435152.jpg",
            "ItemThumbnailURL": "https://s3-ap-southeast-2.amazonaws.com/openchargemap/images/NL/OCM34125/OCM-34125.thmb.2016071818435152.jpg",
            "Comment": "",
            "IsEnabled": true,
            "IsVideo": false,
            "IsFeaturedItem": false,
            "IsExternalResource": false,
            "User": {
                "ID": 11617,
                "Username": "Bert van Sas"
            },
            "DateCreated": "2016-07-18T18:44:00Z"
        }
    ],
    "IsRecentlyVerified": false,
    "ID": 34125,
    "UUID": "F8B1B6DA-80C6-4634-9497-DC30103893BD",
    "DataProviderID": 1,
    "OperatorID": 103,
    "OperatorsReference": "Allego NLAMSEEFAC00042",
    "UsageTypeID": 4,
    "AddressInfo": {
        "ID": 34471,
        "Title": "Van der Valk - Ridderkerk",
        "AddressLine1": "Krommeweg  1",
        "Town": "Ridderkerk",
        "Postcode": "2988 CB",
        "CountryID": 159,
        "Latitude": 51.86674,
        "Longitude": 4.556687,
        "ContactTelephone1": "0800-3745337",
        "RelatedURL": "http://www.allego.eu/",
        "DistanceUnit": 0
    },
    "Connections": [
        {
            "ID": 37636,
            "ConnectionTypeID": 33,
            "StatusTypeID": 50,
            "LevelID": 3,
            "Amps": 120,
            "Voltage": 400,
            "PowerKW": 50,
            "CurrentTypeID": 30,
            "Quantity": 1
        },
        {
            "ID": 47076,
            "ConnectionTypeID": 2,
            "StatusTypeID": 50,
            "LevelID": 3,
            "Amps": 120,
            "Voltage": 400,
            "PowerKW": 50,
            "CurrentTypeID": 30,
            "Quantity": 1
        },
        {
            "ID": 47077,
            "ConnectionTypeID": 25,
            "StatusTypeID": 50,
            "LevelID": 3,
            "PowerKW": 43,
            "CurrentTypeID": 20
        }
    ],
    "NumberOfPoints": 1,
    "StatusTypeID": 50,
    "DateLastStatusUpdate": "2016-07-18T18:44:00Z",
    "DataQualityLevel": 3,
    "DateCreated": "2015-01-09T06:04:00Z",
    "SubmissionStatusTypeID": 100
}