{
    "IsRecentlyVerified": false,
    "ID": 130090,
    "UUID": "1B4F6C6C-0440-46D3-AD6D-7CA835A4E91F",
    "DataProviderID": 1,
    "OperatorID": 23,
    "OperatorsReference": "41532",
    "UsageTypeID": 4,
    "AddressInfo": {
        "ID": 130436,
        "Title": "The Queens Arms",
        "AddressLine1": "Corton Denham",
        "Town": "Sherbourne",
        "Postcode": "DT9 4LR",
        "CountryID": 1,
        "Latitude": 51.000471,
        "Longitude": -2.521205,
        "ContactTelephone1": "+44 196 322 0317",
        "DistanceUnit": 0
    },
    "Connections": [
        {
            "ID": 182095,
            "ConnectionTypeID": 30,
            "StatusTypeID": 50,
            "LevelID": 2,
            "PowerKW": 7,
            "CurrentTypeID": 20,
            "Quantity": 2
        }
    ],
    "NumberOfPoints": 2,
    "GeneralComments": "2 Tesla Connectors, up to 7kW.Available for customers. Please call ahead.",
    "StatusTypeID": 50,
    "DateLastStatusUpdate": "2019-07-31T05:50:00Z",
    "DataQualityLevel": 1,
    "DateCreated": "2019-07-31T05:50:00Z",
    "SubmissionStatusTypeID": 200
}