{
    "IsRecentlyVerified": false,
    "ID": 152719,
    "UUID": "5B30BF29-F747-4F1F-9E0B-A157B5140FDA",
    "DataProviderID": 28,
    "DataProvidersReference": "FR*S49*P49307*001",
    "UsageTypeID": 5,
    "AddressInfo": {
        "ID": 153072,
        "Title": "SAINT MATHURIN SUR LOIRE - Place du 19 Mars 1962",
        "AddressLine1": "Place du 19 Mars 1962 49250 SAINT MATHURIN SUR LOIRE",
        "CountryID": 80,
        "Latitude": 47.410707,
        "Longitude": -0.32078,
        "AccessComments": "24h/24 7j/7",
        "DistanceUnit": 0
    },
    "Connections": [
        {
            "ID": 213914,
            "ConnectionTypeID": 25,
            "StatusTypeID": 50,
            "LevelID": 2,
            "PowerKW": 18,
            "CurrentTypeID": 20
        },
        {
            "ID": 213915,
            "ConnectionTypeID": 28,
            "StatusTypeID": 50,
            "LevelID": 2,
            "PowerKW": 18,
            "CurrentTypeID": 10
        },
        {
            "ID": 247097,
            "ConnectionTypeID": 25,
            "StatusTypeID": 50,
            "LevelID": 2,
            "PowerKW": 18,
            "CurrentTypeID": 20
        },
        {
            "ID": 247098,
            "ConnectionTypeID": 28,
            "StatusTypeID": 50,
            "LevelID": 2,
            "PowerKW": 18,
            "CurrentTypeID": 10
        }
    ],
    "GeneralComments": "Recharge par badge et avec une application smartphone",
    "StatusTypeID": 50,
    "DateLastStatusUpdate": "2020-08-27T05:13:00Z",
    "DataQualityLevel": 2,
    "DateCreated": "2020-03-15T10:54:00Z",
    "SubmissionStatusTypeID": 100
}