{
    "IsRecentlyVerified": false,
    "ID": 172731,
    "UUID": "1F53F6FD-AF7E-4A84-9AF7-5E0D588DF464",
    "DataProviderID": 1,
    "OperatorID": 3299,
    "UsageTypeID": 5,
    "UsageCost": "EUR  0.79/kWh; andere tarife möglich",
    "AddressInfo": {
        "ID": 173090,
        "Title": "Innogy Charging Station",
        "AddressLine1": "L141",
        "Town": "Wittlich",
        "Postcode": "54516",
        "CountryID": 87,
        "Latitude": 49.97001450050925,
        "Longitude": 6.862356675983506,
        "DistanceUnit": 0
    },
    "Connections": [
        {
            "ID": 264154,
            "ConnectionTypeID": 33,
            "StatusTypeID": 50,
            "LevelID": 3,
            "PowerKW": 350,
            "CurrentTypeID": 30,
            "Quantity": 1
        },
        {
            "ID": 264155,
            "ConnectionTypeID": 2,
            "StatusTypeID": 50,
            "LevelID": 2,
            "PowerKW": 60,
            "Quantity": 1
        },
        {
            "ID": 264156,
            "ConnectionTypeID": 25,
            "StatusTypeID": 50,
            "LevelID": 2,
            "PowerKW": 22,
            "Quantity": 1
        }
    ],
    "NumberOfPoints": 1,
    "StatusTypeID": 50,
    "DateLastStatusUpdate": "2021-02-15T10:03:00Z",
    "DataQualityLevel": 1,
    "DateCreated": "2021-02-14T11:10:00Z",
    "SubmissionStatusTypeID": 200
}