{
    "IsRecentlyVerified": false,
    "ID": 92145,
    "UUID": "99F4CE67-17F5-4D5D-82CF-8D04292FB57F",
    "DataProviderID": 1,
    "OperatorID": 105,
    "UsageTypeID": 1,
    "AddressInfo": {
        "ID": 92491,
        "Title": "E-Bike Station Deutschherrenstraße",
        "AddressLine1": "Deutschherrenstraße 34",
        "AddressLine2": "Forsthaus Sabel",
        "Town": "Zeltingen-Rachtig",
        "StateOrProvince": "Bernkastel-Kues",
        "Postcode": "54492",
        "CountryID": 87,
        "Latitude": 49.96284,
        "Longitude": 7.001548200000002,
        "AccessComments": "Genaue Position unbekannt; 3 fach Ladeschrank.",
        "DistanceUnit": 0
    },
    "Connections": [
        {
            "ID": 130645,
            "ConnectionTypeID": 28,
            "StatusTypeID": 50,
            "LevelID": 1,
            "Amps": 10,
            "Voltage": 230,
            "PowerKW": 2.3,
            "CurrentTypeID": 10,
            "Quantity": 3
        }
    ],
    "NumberOfPoints": 3,
    "StatusTypeID": 50,
    "DateLastStatusUpdate": "2017-08-29T11:39:00Z",
    "DataQualityLevel": 1,
    "DateCreated": "2017-08-29T11:39:00Z",
    "SubmissionStatusTypeID": 200
}