{
    "IsRecentlyVerified": false,
    "ID": 30835,
    "UUID": "794A51AD-140A-4F64-A00F-E838FE016215",
    "DataProviderID": 1,
    "DataProvidersReference": "1610",
    "AddressInfo": {
        "ID": 31181,
        "Title": "Hotell Hadeland, Gran",
        "AddressLine1": "Granavollen 35 ",
        "Town": "GRAN",
        "StateOrProvince": "Innlandet",
        "Postcode": "2750",
        "CountryID": 168,
        "Latitude": 60.37127,
        "Longitude": 10.53297,
        "AccessComments": "",
        "DistanceUnit": 0
    },
    "Connections": [
        {
            "ID": 34064,
            "ConnectionTypeID": 0,
            "Reference": "1",
            "LevelID": 2,
            "Amps": 16,
            "Voltage": 230,
            "PowerKW": 3.7,
            "Comments": "Mode 1"
        },
        {
            "ID": 86827,
            "ConnectionTypeID": 0,
            "Reference": "2",
            "LevelID": 2,
            "Amps": 16,
            "Voltage": 230,
            "PowerKW": 3.7,
            "Comments": "Mode 1"
        },
        {
            "ID": 86828,
            "ConnectionTypeID": 0,
            "Reference": "3",
            "LevelID": 2,
            "Amps": 16,
            "Voltage": 230,
            "PowerKW": 3.7,
            "Comments": "Mode 1"
        },
        {
            "ID": 88999,
            "ConnectionTypeID": 0,
            "Reference": "4",
            "LevelID": 2,
            "Amps": 16,
            "Voltage": 230,
            "PowerKW": 3.7,
            "Comments": "Mode 1"
        }
    ],
    "NumberOfPoints": 4,
    "DateLastStatusUpdate": "2020-05-26T08:24:00Z",
    "DataQualityLevel": 2,
    "DateCreated": "2014-12-09T09:01:00Z",
    "SubmissionStatusTypeID": 100
}