{
    "IsRecentlyVerified": true,
    "DateLastVerified": "2021-08-11T03:50:00Z",
    "ID": 188684,
    "UUID": "AEE53049-CC1F-4754-B025-ABF610E46BB7",
    "DataProviderID": 1,
    "OperatorID": 3364,
    "UsageTypeID": 4,
    "UsageCost": "35 CLP/min",
    "AddressInfo": {
        "ID": 189043,
        "Title": "Flow - Echeverría Izquierdo",
        "AddressLine1": "Vicuña Mackenna 1385",
        "Town": "Santiago",
        "StateOrProvince": "Región Metropolitana de Santiago",
        "Postcode": "8940000",
        "CountryID": 49,
        "Latitude": -33.460239,
        "Longitude": -70.6285,
        "RelatedURL": "https://copecvoltex.cl/",
        "DistanceUnit": 0
    },
    "Connections": [
        {
            "ID": 304820,
            "ConnectionTypeID": 0,
            "StatusTypeID": 50,
            "LevelID": 2,
            "PowerKW": 7.4,
            "Quantity": 1
        },
        {
            "ID": 304821,
            "ConnectionTypeID": 0,
            "StatusTypeID": 50,
            "LevelID": 2,
            "PowerKW": 7.4,
            "Quantity": 1
        }
    ],
    "NumberOfPoints": 1,
    "StatusTypeID": 50,
    "DateLastStatusUpdate": "2021-08-11T03:50:00Z",
    "DataQualityLevel": 1,
    "DateCreated": "2021-08-11T03:50:00Z",
    "SubmissionStatusTypeID": 200
}