{
    "IsRecentlyVerified": false,
    "ID": 169315,
    "UUID": "BC47FB84-9E37-4E76-83AC-7EA641763125",
    "DataProviderID": 1,
    "OperatorID": 80,
    "UsageTypeID": 4,
    "AddressInfo": {
        "ID": 169674,
        "Title": "AGRATE CONTURBIA Gallone | ENELX",
        "AddressLine1": "Via Gallone",
        "Town": "Agrate Conturbia",
        "StateOrProvince": "NO",
        "Postcode": "28010",
        "CountryID": 112,
        "Latitude": 45.67476506642177,
        "Longitude": 8.551915148159651,
        "ContactTelephone1": "800.069.850",
        "RelatedURL": "https://www.enelx.com/it/it/emobility",
        "DistanceUnit": 0
    },
    "Connections": [
        {
            "ID": 257613,
            "ConnectionTypeID": 25,
            "StatusTypeID": 50,
            "LevelID": 2,
            "Amps": 32,
            "Voltage": 400,
            "PowerKW": 22,
            "CurrentTypeID": 20,
            "Quantity": 1
        },
        {
            "ID": 257614,
            "ConnectionTypeID": 36,
            "StatusTypeID": 50,
            "LevelID": 2,
            "Amps": 16,
            "Voltage": 240,
            "PowerKW": 3.7,
            "CurrentTypeID": 10,
            "Quantity": 1
        }
    ],
    "NumberOfPoints": 2,
    "StatusTypeID": 50,
    "DateLastStatusUpdate": "2020-10-14T09:26:00Z",
    "DataQualityLevel": 1,
    "DateCreated": "2020-10-14T09:26:00Z",
    "SubmissionStatusTypeID": 200
}