{
    "IsRecentlyVerified": false,
    "ID": 47347,
    "UUID": "1E140525-6995-413B-B499-9227E438964F",
    "DataProviderID": 1,
    "OperatorID": 23,
    "OperatorsReference": "7917",
    "UsageTypeID": 1,
    "UsageCost": "Free",
    "AddressInfo": {
        "ID": 47693,
        "Title": "Eddie V'S Prime Seafood",
        "AddressLine1": "4400 W Boy Scout Blvd",
        "Town": "Tampa",
        "StateOrProvince": "FL",
        "Postcode": "33607",
        "CountryID": 2,
        "Latitude": 27.9603147,
        "Longitude": -82.5183189,
        "ContactTelephone1": "813-877-7290  877-798-3752",
        "AccessComments": "24 hours daily; guest use only; see valet for access",
        "RelatedURL": "http://www.teslamotors.com/supercharger",
        "DistanceUnit": 0
    },
    "Connections": [
        {
            "ID": 58384,
            "ConnectionTypeID": 30,
            "StatusTypeID": 50,
            "LevelID": 2,
            "Amps": 16,
            "Voltage": 230,
            "PowerKW": 16,
            "CurrentTypeID": 10,
            "Quantity": 1
        }
    ],
    "NumberOfPoints": 1,
    "StatusTypeID": 50,
    "DateLastStatusUpdate": "2017-01-26T16:53:00Z",
    "DataQualityLevel": 3,
    "DateCreated": "2015-05-27T08:50:00Z",
    "SubmissionStatusTypeID": 100
}