{
    "IsRecentlyVerified": false,
    "ID": 26867,
    "UUID": "AE86D303-F3F1-46BD-9B67-D8896A2BB54C",
    "DataProviderID": 2,
    "DataProvidersReference": "63149",
    "OperatorID": 5,
    "UsageTypeID": 1,
    "AddressInfo": {
        "ID": 27213,
        "Title": "6080 CENTER DR",
        "AddressLine1": "6080 Center Dr",
        "Town": "Los Angeles",
        "StateOrProvince": "CA",
        "Postcode": "90045",
        "CountryID": 2,
        "Latitude": 33.976454,
        "Longitude": -118.391831,
        "ContactTelephone1": "888-758-4389",
        "AccessComments": "24 hours daily",
        "RelatedURL": "http://www.chargepoint.com/",
        "DistanceUnit": 0
    },
    "Connections": [
        {
            "ID": 29420,
            "ConnectionTypeID": 1,
            "LevelID": 2,
            "Amps": 16,
            "Voltage": 230,
            "PowerKW": 3,
            "CurrentTypeID": 10,
            "Quantity": 4
        }
    ],
    "DateLastStatusUpdate": "2019-04-06T04:01:00Z",
    "DataQualityLevel": 3,
    "DateCreated": "2014-11-28T03:37:00Z",
    "SubmissionStatusTypeID": 100
}