{
    "IsRecentlyVerified": false,
    "ID": 64010,
    "UUID": "D7E77ECE-1167-426E-A398-365A6C3B5BC5",
    "DataProviderID": 26,
    "DataProvidersReference": "83558",
    "OperatorID": 103,
    "OperatorsReference": "Allego NLALLEGO0005952",
    "UsageCost": "0.00 jaarabonnement",
    "AddressInfo": {
        "ID": 64356,
        "Title": "Van Burgplein",
        "AddressLine1": "Van Burgplein",
        "Town": "Purmerend",
        "Postcode": "1447 CR",
        "CountryID": 159,
        "Latitude": 52.49424399,
        "Longitude": 4.96789975,
        "ContactTelephone1": "0800-3745337",
        "RelatedURL": "http://www.allego.eu/",
        "DistanceUnit": 0
    },
    "Connections": [
        {
            "ID": 81828,
            "ConnectionTypeID": 25,
            "LevelID": 2,
            "PowerKW": 11,
            "CurrentTypeID": 10
        },
        {
            "ID": 81829,
            "ConnectionTypeID": 25,
            "LevelID": 2,
            "PowerKW": 11,
            "CurrentTypeID": 10
        }
    ],
    "NumberOfPoints": 1,
    "StatusTypeID": 50,
    "DateLastStatusUpdate": "2016-06-04T02:54:00Z",
    "DataQualityLevel": 3,
    "DateCreated": "2016-03-03T12:32:00Z",
    "SubmissionStatusTypeID": 100
}