{
    "UserComments": [
        {
            "ID": 12717,
            "ChargePointID": 47694,
            "CommentTypeID": 10,
            "UserName": "Simon Hewison",
            "Comment": "Collision damaged charge point removed ",
            "Rating": 1,
            "DateCreated": "2016-06-29T06:51:25.343Z",
            "User": {
                "ID": 4575,
                "Username": "Simon Hewison"
            },
            "CheckinStatusTypeID": 50
        },
        {
            "ID": 4633,
            "ChargePointID": 47694,
            "CommentTypeID": 10,
            "UserName": "Simon Hewison",
            "Comment": "Unclear as to whether pay and display charges apply when charging. Other EV charging doesn't necessarily mean my Source London card would work on this Elektromotive post.",
            "Rating": 3,
            "DateCreated": "2015-06-05T21:21:03.207Z",
            "User": {
                "ID": 4575,
                "Username": "Simon Hewison"
            },
            "CheckinStatusTypeID": 100
        }
    ],
    "MediaItems": [
        {
            "ID": 1530,
            "ChargePointID": 47694,
            "ItemURL": "https://s3-ap-southeast-2.amazonaws.com/openchargemap/images/GB/OCM47694/OCM-47694.orig.2015060519190284.jpg",
            "ItemThumbnailURL": "https://s3-ap-southeast-2.amazonaws.com/openchargemap/images/GB/OCM47694/OCM-47694.thmb.2015060519190284.jpg",
            "Comment": "",
            "IsEnabled": true,
            "IsVideo": false,
            "IsFeaturedItem": false,
            "IsExternalResource": false,
            "User": {
                "ID": 4575,
                "Username": "Simon Hewison"
            },
            "DateCreated": "2015-06-05T19:19:00Z"
        }
    ],
    "IsRecentlyVerified": false,
    "ID": 47694,
    "UUID": "E086317F-C7F6-4D0B-B727-47B41D871A7D",
    "DataProviderID": 1,
    "OperatorID": 25,
    "OperatorsReference": "200 20225",
    "UsageTypeID": 4,
    "UsageCost": "Free. Parking fees apply.",
    "AddressInfo": {
        "ID": 48040,
        "Title": "Crouch Hall Road Car Park",
        "AddressLine1": "Crouch Hall Road",
        "AddressLine2": "Crouch End",
        "Town": "London",
        "Postcode": "N8 8HJ",
        "CountryID": 1,
        "Latitude": 51.5791397665848,
        "Longitude": -0.124969482421875,
        "AccessComments": "in pay and display car park. max stay 4 hours while charging",
        "RelatedURL": "http://www.haringey.gov.uk/parking-roads-and-travel/parking/car-parks/crouch-hall-road-car-park",
        "DistanceUnit": 0
    },
    "Connections": [
        {
            "ID": 58806,
            "ConnectionTypeID": 3,
            "StatusTypeID": 100,
            "LevelID": 2,
            "Amps": 13,
            "Voltage": 230,
            "PowerKW": 3,
            "CurrentTypeID": 10,
            "Quantity": 1
        }
    ],
    "NumberOfPoints": 1,
    "GeneralComments": "Source London ID 200 20225Parking fees apply Mon - Sat, 08:00-18:30",
    "StatusTypeID": 0,
    "DateLastStatusUpdate": "2016-11-03T10:43:00Z",
    "DataQualityLevel": 1,
    "DateCreated": "2015-06-05T12:07:00Z",
    "SubmissionStatusTypeID": 200
}