{
    "IsRecentlyVerified": false,
    "ID": 48173,
    "UUID": "FF7EDFCA-16A5-425A-891D-0BBB479731BB",
    "DataProviderID": 2,
    "DataProvidersReference": "60446",
    "UsageTypeID": 7,
    "AddressInfo": {
        "ID": 48519,
        "Title": "University Honda of Davis",
        "AddressLine1": "4343 Chiles Rd",
        "Town": "Davis",
        "StateOrProvince": "CA",
        "Postcode": "95618",
        "CountryID": 2,
        "Latitude": 38.551486,
        "Longitude": -121.697458,
        "ContactTelephone1": "530-758-8770",
        "AccessComments": "Dealership business hours; for customer use only\r\nPublic - Call ahead",
        "RelatedURL": "",
        "DistanceUnit": 0
    },
    "Connections": [
        {
            "ID": 59576,
            "ConnectionTypeID": 1,
            "LevelID": 2,
            "Amps": 16,
            "Voltage": 230,
            "PowerKW": 3.7,
            "CurrentTypeID": 10,
            "Quantity": 1
        }
    ],
    "DateLastStatusUpdate": "2020-06-26T03:00:00Z",
    "DataQualityLevel": 3,
    "DateCreated": "2015-06-24T11:44:00Z",
    "SubmissionStatusTypeID": 100
}