{
    "IsRecentlyVerified": false,
    "ID": 46396,
    "UUID": "D6F14B97-81A1-447D-A0E9-FBC8ED9072ED",
    "DataProviderID": 1,
    "DataProvidersReference": "656",
    "AddressInfo": {
        "ID": 46742,
        "Title": "Skedsmo VGS, Lillestrøm",
        "AddressLine1": "Vestbygata 61",
        "Town": "LILLESTRØM",
        "StateOrProvince": "Viken",
        "Postcode": "2003",
        "CountryID": 168,
        "Latitude": 59.96451,
        "Longitude": 11.04357,
        "AccessComments": "",
        "DistanceUnit": 0
    },
    "Connections": [
        {
            "ID": 57059,
            "ConnectionTypeID": 0,
            "Reference": "1",
            "LevelID": 2,
            "Amps": 16,
            "Voltage": 230,
            "PowerKW": 3.7,
            "Comments": "Mode 1"
        },
        {
            "ID": 88815,
            "ConnectionTypeID": 0,
            "Reference": "2",
            "LevelID": 2,
            "Amps": 16,
            "Voltage": 230,
            "PowerKW": 3.7,
            "Comments": "Mode 1"
        }
    ],
    "NumberOfPoints": 2,
    "DateLastStatusUpdate": "2020-05-26T08:23:00Z",
    "DataQualityLevel": 2,
    "DateCreated": "2015-05-03T00:54:00Z",
    "SubmissionStatusTypeID": 100
}