{
    "IsRecentlyVerified": false,
    "ID": 10616,
    "UUID": "55DE3FC0-94AE-4B96-9CB1-315F187750F5",
    "DataProviderID": 1,
    "DataProvidersReference": "764",
    "AddressInfo": {
        "ID": 10513,
        "Title": "Orkdal Energi, Fannrem",
        "AddressLine1": "Megardsvegen 1",
        "Town": "FANNREM",
        "StateOrProvince": "Trøndelag",
        "Postcode": "7320",
        "CountryID": 168,
        "Latitude": 63.26676,
        "Longitude": 9.81542,
        "AccessComments": "",
        "DistanceUnit": 0
    },
    "Connections": [
        {
            "ID": 8615,
            "ConnectionTypeID": 0,
            "Reference": "1",
            "LevelID": 2,
            "Amps": 16,
            "Voltage": 230,
            "PowerKW": 3.7,
            "Comments": "Mode 1"
        },
        {
            "ID": 89380,
            "ConnectionTypeID": 0,
            "Reference": "2",
            "LevelID": 2,
            "Amps": 16,
            "Voltage": 230,
            "PowerKW": 3.7,
            "Comments": "Mode 1"
        }
    ],
    "NumberOfPoints": 2,
    "StatusTypeID": 0,
    "DateLastStatusUpdate": "2020-05-26T08:25:00Z",
    "DataQualityLevel": 2,
    "DateCreated": "2012-06-02T11:55:00Z",
    "SubmissionStatusTypeID": 100
}