{
    "IsRecentlyVerified": false,
    "ID": 137706,
    "UUID": "0E37D43F-0EBF-4EC4-9834-01E07E9FD02A",
    "DataProviderID": 2,
    "DataProvidersReference": "95179",
    "OperatorID": 9,
    "UsageTypeID": 2,
    "AddressInfo": {
        "ID": 138053,
        "Title": "Pearl Hotel",
        "AddressLine1": "1410 Rosecrans Street",
        "Town": "San Diego",
        "StateOrProvince": "CA",
        "Postcode": "92106",
        "CountryID": 2,
        "Latitude": 32.725288,
        "Longitude": -117.22891,
        "ContactTelephone1": "888-998-2546",
        "AccessComments": "MON: 24 hours | TUE: 24 hours | WED: 24 hours | THU: 24 hours | FRI: 24 hours | SAT: 24 hours | SUN: 24 hours",
        "RelatedURL": "http://www.blinkcharging.com/",
        "DistanceUnit": 0
    },
    "Connections": [
        {
            "ID": 192679,
            "ConnectionTypeID": 1,
            "LevelID": 2,
            "Amps": 16,
            "Voltage": 230,
            "PowerKW": 3,
            "CurrentTypeID": 10,
            "Quantity": 2
        }
    ],
    "StatusTypeID": 50,
    "DateLastStatusUpdate": "2019-12-24T09:06:00Z",
    "DataQualityLevel": 3,
    "DateCreated": "2019-12-24T09:06:00Z",
    "SubmissionStatusTypeID": 100
}