{
    "IsRecentlyVerified": false,
    "ID": 73952,
    "UUID": "D3AEB62A-97C9-4FB6-AF99-CD1248B97820",
    "DataProviderID": 1,
    "OperatorID": 89,
    "OperatorsReference": "AAB-10632",
    "UsageTypeID": 4,
    "UsageCost": "Free",
    "AddressInfo": {
        "ID": 74298,
        "Title": "South Surrey Recreation Centre",
        "AddressLine1": "14601 20th Avenue",
        "Town": "Surrey",
        "StateOrProvince": "BC",
        "Postcode": "V4A 9P5",
        "CountryID": 44,
        "Latitude": 49.040341,
        "Longitude": -122.8178,
        "DistanceUnit": 0
    },
    "Connections": [
        {
            "ID": 106266,
            "ConnectionTypeID": 1,
            "StatusTypeID": 50,
            "LevelID": 2,
            "Amps": 32,
            "Voltage": 230,
            "PowerKW": 7,
            "CurrentTypeID": 10,
            "Quantity": 1
        }
    ],
    "NumberOfPoints": 1,
    "StatusTypeID": 50,
    "DateLastStatusUpdate": "2016-11-27T17:05:00Z",
    "DataQualityLevel": 1,
    "DateCreated": "2016-11-23T23:43:00Z",
    "SubmissionStatusTypeID": 200
}