{
    "IsRecentlyVerified": false,
    "ID": 87482,
    "UUID": "74A22228-1388-44BC-A3BC-4ADB550663F9",
    "DataProviderID": 1,
    "OperatorID": 23,
    "OperatorsReference": "28673",
    "UsageTypeID": 4,
    "UsageCost": "$0.20/min >=60kW; $0.10/min <60kW; other tariffs for older cars",
    "AddressInfo": {
        "ID": 87828,
        "Title": "Sidney Supercharger",
        "AddressLine1": "645 Cabela Drive",
        "Town": "Sidney",
        "Postcode": "69162-3047",
        "CountryID": 2,
        "Latitude": 41.11549,
        "Longitude": -102.949669,
        "DistanceUnit": 0
    },
    "Connections": [
        {
            "ID": 124015,
            "ConnectionTypeID": 27,
            "StatusTypeID": 50,
            "LevelID": 3,
            "PowerKW": 120,
            "CurrentTypeID": 30,
            "Quantity": 8
        }
    ],
    "NumberOfPoints": 8,
    "GeneralComments": "Charging8 Superchargers, available 24/7",
    "StatusTypeID": 50,
    "DateLastStatusUpdate": "2018-03-13T16:28:00Z",
    "DataQualityLevel": 1,
    "DateCreated": "2017-05-11T05:32:00Z",
    "SubmissionStatusTypeID": 200
}