{
    "IsRecentlyVerified": false,
    "ID": 178898,
    "UUID": "C3467853-071C-449A-AF17-4BD5BB8EB286",
    "DataProviderID": 29,
    "DataProvidersReference": "13530",
    "AddressInfo": {
        "ID": 179257,
        "Title": "Georgenstraße 37",
        "AddressLine1": "Georgenstraße 37",
        "Town": "Spremberg",
        "Postcode": "03130",
        "CountryID": 87,
        "Latitude": 51.573321,
        "Longitude": 14.379096,
        "DistanceUnit": 0
    },
    "Connections": [
        {
            "ID": 279926,
            "ConnectionTypeID": 25,
            "StatusTypeID": 50,
            "LevelID": 2,
            "PowerKW": 22,
            "CurrentTypeID": 20
        },
        {
            "ID": 279927,
            "ConnectionTypeID": 25,
            "StatusTypeID": 50,
            "LevelID": 2,
            "PowerKW": 22,
            "CurrentTypeID": 20
        }
    ],
    "StatusTypeID": 50,
    "DateLastStatusUpdate": "2021-07-12T02:48:00Z",
    "MetadataValues": [
        {
            "ID": 11192,
            "MetadataFieldID": 4,
            "ItemValue": "Data from the German chargepoint registry provided by Bundesnetzagentur.de under the CC-BY 4.0 license"
        }
    ],
    "DataQualityLevel": 3,
    "DateCreated": "2021-07-08T09:59:00Z",
    "SubmissionStatusTypeID": 100
}