{
    "IsRecentlyVerified": false,
    "ID": 143985,
    "UUID": "9E163B49-8543-49F1-A00D-D9B301E01BAE",
    "DataProviderID": 2,
    "DataProvidersReference": "98987",
    "OperatorID": 59,
    "UsageTypeID": 1,
    "AddressInfo": {
        "ID": 144337,
        "Title": "Greenlots - 43019",
        "AddressLine1": "5660 Main Street Northeast",
        "Town": "Fridley",
        "StateOrProvince": "MN",
        "Postcode": "55432",
        "CountryID": 2,
        "Latitude": 45.0713157653809,
        "Longitude": -93.269889831543,
        "ContactTelephone1": "855-900-7584",
        "AccessComments": "24 hours daily",
        "RelatedURL": "http://greenlots.com/",
        "DistanceUnit": 0
    },
    "Connections": [
        {
            "ID": 200433,
            "ConnectionTypeID": 2,
            "LevelID": 3,
            "Amps": 100,
            "Voltage": 400,
            "PowerKW": 40,
            "CurrentTypeID": 30,
            "Quantity": 1
        },
        {
            "ID": 200434,
            "ConnectionTypeID": 32,
            "LevelID": 3,
            "Amps": 100,
            "Voltage": 400,
            "PowerKW": 40,
            "CurrentTypeID": 30,
            "Quantity": 1
        }
    ],
    "StatusTypeID": 50,
    "DateLastStatusUpdate": "2020-06-26T03:08:00Z",
    "DataQualityLevel": 3,
    "DateCreated": "2019-12-24T09:22:00Z",
    "SubmissionStatusTypeID": 100
}