{
    "IsRecentlyVerified": false,
    "ID": 175929,
    "UUID": "4F96FC8F-1459-49A5-ADA3-1E071E5BC627",
    "DataProviderID": 1,
    "OperatorID": 121,
    "UsageTypeID": 4,
    "UsageCost": "0,35€/kWh (+2c/min von 8-22Uhr)",
    "AddressInfo": {
        "ID": 176288,
        "Title": "Schwimmbad AquaLaatzium",
        "AddressLine1": "Hildesheimer Straße",
        "Town": "Laatzen",
        "StateOrProvince": "Lower Saxony",
        "Postcode": "30880",
        "CountryID": 87,
        "Latitude": 52.31158795172351,
        "Longitude": 9.795823793190948,
        "DistanceUnit": 0
    },
    "Connections": [
        {
            "ID": 273221,
            "ConnectionTypeID": 25,
            "StatusTypeID": 50,
            "LevelID": 2,
            "Amps": 32,
            "Voltage": 400,
            "PowerKW": 22,
            "CurrentTypeID": 20,
            "Quantity": 2
        }
    ],
    "NumberOfPoints": 2,
    "GeneralComments": "24/7 verfügbare Ladestation vor dem Schwimmbadparkplatz",
    "StatusTypeID": 50,
    "DateLastStatusUpdate": "2021-06-19T11:46:00Z",
    "DataQualityLevel": 1,
    "DateCreated": "2021-06-19T11:46:00Z",
    "SubmissionStatusTypeID": 200
}