{
    "IsRecentlyVerified": false,
    "ID": 71343,
    "UUID": "76D22B0B-BB17-4E43-9CEB-BDA67AD67B33",
    "DataProviderID": 1,
    "UsageTypeID": 2,
    "AddressInfo": {
        "ID": 71689,
        "Title": "Defense Logistics Agency - Defense Distribution Center",
        "AddressLine1": "South Ave & 3rd St",
        "Town": "New Cumberland",
        "StateOrProvince": "PA",
        "Postcode": "17070",
        "CountryID": 2,
        "Latitude": 40.21045,
        "Longitude": -76.840468,
        "DistanceUnit": 0
    },
    "Connections": [
        {
            "ID": 102155,
            "ConnectionTypeID": 1,
            "LevelID": 2,
            "Amps": 16,
            "Voltage": 230,
            "PowerKW": 3,
            "CurrentTypeID": 10,
            "Quantity": 1
        }
    ],
    "StatusTypeID": 0,
    "DateLastStatusUpdate": "2018-04-29T09:28:00Z",
    "DataQualityLevel": 3,
    "DateCreated": "2016-09-02T10:14:00Z",
    "SubmissionStatusTypeID": 100
}