{
    "IsRecentlyVerified": false,
    "ID": 63708,
    "UUID": "370EE17C-3591-47C3-B6BE-AA83B798BEB1",
    "DataProviderID": 26,
    "DataProvidersReference": "79959",
    "OperatorID": 157,
    "OperatorsReference": "NewMotion 03004596",
    "UsageCost": "0.00 jaarabonnement",
    "AddressInfo": {
        "ID": 64054,
        "Title": "Reespoor 18",
        "AddressLine1": "Reespoor 18",
        "Town": "Soest",
        "Postcode": "3766 JX",
        "CountryID": 159,
        "Latitude": 52.1665074632406,
        "Longitude": 5.27564148227839,
        "ContactTelephone1": "088 0109500",
        "RelatedURL": "http://thenewmotion.nl/",
        "DistanceUnit": 0
    },
    "Connections": [
        {
            "ID": 81343,
            "ConnectionTypeID": 25,
            "LevelID": 2,
            "PowerKW": 22,
            "CurrentTypeID": 10
        }
    ],
    "NumberOfPoints": 1,
    "StatusTypeID": 50,
    "DateLastStatusUpdate": "2016-06-04T02:51:00Z",
    "DataQualityLevel": 3,
    "DateCreated": "2016-03-03T12:31:00Z",
    "SubmissionStatusTypeID": 100
}