{
    "IsRecentlyVerified": false,
    "ID": 124879,
    "UUID": "65C00DF4-7F3A-47DE-A9FA-4CF880F3F7F7",
    "DataProviderID": 2,
    "DataProvidersReference": "121118",
    "OperatorID": 5,
    "UsageTypeID": 1,
    "AddressInfo": {
        "ID": 125225,
        "Title": "APA",
        "AddressLine1": "401 Hamilton St",
        "Town": "Allentown",
        "StateOrProvince": "PA",
        "Postcode": "18101",
        "CountryID": 2,
        "Latitude": 40.604083,
        "Longitude": -75.466464,
        "ContactTelephone1": "888-758-4389",
        "AccessComments": "24 hours daily",
        "RelatedURL": "http://www.chargepoint.com/",
        "DistanceUnit": 0
    },
    "Connections": [
        {
            "ID": 175033,
            "ConnectionTypeID": 1,
            "LevelID": 2,
            "Amps": 16,
            "Voltage": 230,
            "PowerKW": 3.7,
            "CurrentTypeID": 10,
            "Quantity": 4
        }
    ],
    "DateLastStatusUpdate": "2020-06-26T03:03:00Z",
    "DataQualityLevel": 3,
    "DateCreated": "2019-04-06T05:04:00Z",
    "SubmissionStatusTypeID": 100
}