{
    "IsRecentlyVerified": false,
    "ID": 181759,
    "UUID": "72EB9FBB-4273-49A8-873A-BD9C5294753F",
    "DataProviderID": 29,
    "DataProvidersReference": "369",
    "OperatorID": 86,
    "AddressInfo": {
        "ID": 182118,
        "Title": "Ferdinand-Braun-Straße 26",
        "AddressLine1": "Ferdinand-Braun-Straße 26",
        "Town": "Heilbronn",
        "Postcode": "74074",
        "CountryID": 87,
        "Latitude": 49.120114,
        "Longitude": 9.221301,
        "DistanceUnit": 0
    },
    "Connections": [
        {
            "ID": 286520,
            "ConnectionTypeID": 25,
            "StatusTypeID": 50,
            "LevelID": 2,
            "PowerKW": 22,
            "CurrentTypeID": 20
        },
        {
            "ID": 286521,
            "ConnectionTypeID": 25,
            "StatusTypeID": 50,
            "LevelID": 2,
            "PowerKW": 22,
            "CurrentTypeID": 20
        },
        {
            "ID": 296620,
            "ConnectionTypeID": 25,
            "StatusTypeID": 50,
            "LevelID": 2,
            "PowerKW": 22,
            "CurrentTypeID": 20
        },
        {
            "ID": 296621,
            "ConnectionTypeID": 25,
            "StatusTypeID": 50,
            "LevelID": 2,
            "PowerKW": 22,
            "CurrentTypeID": 20
        }
    ],
    "StatusTypeID": 50,
    "DateLastStatusUpdate": "2021-07-12T02:42:00Z",
    "MetadataValues": [
        {
            "ID": 14053,
            "MetadataFieldID": 4,
            "ItemValue": "Data from the German chargepoint registry provided by Bundesnetzagentur.de under the CC-BY 4.0 license"
        }
    ],
    "DataQualityLevel": 3,
    "DateCreated": "2021-07-08T10:02:00Z",
    "SubmissionStatusTypeID": 100
}