{
    "IsRecentlyVerified": false,
    "ID": 188069,
    "UUID": "C4E3F691-071D-4FED-A2E9-43D074810AB6",
    "DataProviderID": 18,
    "DataProvidersReference": "fb2b6f6724a343bc1a019004847aa59d",
    "OperatorID": 3298,
    "UsageTypeID": 5,
    "AddressInfo": {
        "ID": 188428,
        "Title": "Dallas Road",
        "AddressLine1": "Dallas Road",
        "Town": "Lancaster",
        "Postcode": "LA1 1TW",
        "CountryID": 1,
        "Latitude": 54.04721,
        "Longitude": -2.8045,
        "AccessComments": "",
        "RelatedURL": "http://www.eocharging.com",
        "DistanceUnit": 0
    },
    "Connections": [
        {
            "ID": 303497,
            "ConnectionTypeID": 25,
            "Reference": "EG-04802",
            "StatusTypeID": 50,
            "LevelID": 2,
            "Amps": 32,
            "Voltage": 400,
            "PowerKW": 22,
            "CurrentTypeID": 20
        },
        {
            "ID": 303498,
            "ConnectionTypeID": 25,
            "Reference": "EG-04803",
            "StatusTypeID": 50,
            "LevelID": 2,
            "Amps": 32,
            "Voltage": 400,
            "PowerKW": 22,
            "CurrentTypeID": 20
        }
    ],
    "StatusTypeID": 0,
    "DateLastStatusUpdate": "2021-07-12T03:39:00Z",
    "MetadataValues": [
        {
            "ID": 20309,
            "MetadataFieldID": 4,
            "ItemValue": "Contains public sector information licensed under the Open Government Licence v2.0. http://www.nationalarchives.gov.uk/doc/open-government-licence/version/2/"
        }
    ],
    "DataQualityLevel": 3,
    "DateCreated": "2021-07-12T03:39:00Z",
    "SubmissionStatusTypeID": 100
}