{
    "IsRecentlyVerified": false,
    "ID": 14213,
    "UUID": "71EADD26-756F-4A54-8D40-A075EA013F69",
    "DataProviderID": 2,
    "DataProvidersReference": "46236",
    "UsageTypeID": 2,
    "AddressInfo": {
        "ID": 14110,
        "Title": "ComEd",
        "AddressLine1": "4401 W 135th St",
        "Town": "Crestwood",
        "StateOrProvince": "IL",
        "Postcode": "60445",
        "CountryID": 2,
        "Latitude": 41.647334,
        "Longitude": -87.729414,
        "ContactTelephone1": "",
        "AccessComments": "ComEd fleet use only",
        "RelatedURL": "",
        "DistanceUnit": 0
    },
    "Connections": [
        {
            "ID": 11664,
            "ConnectionTypeID": 1,
            "LevelID": 2,
            "Amps": 16,
            "Voltage": 230,
            "PowerKW": 3.7,
            "CurrentTypeID": 10,
            "Quantity": 6
        },
        {
            "ID": 21589,
            "ConnectionTypeID": 1,
            "LevelID": 2,
            "Quantity": 6
        }
    ],
    "DateLastStatusUpdate": "2020-06-26T03:04:00Z",
    "DataQualityLevel": 3,
    "DateCreated": "2012-12-06T16:49:00Z",
    "SubmissionStatusTypeID": 100
}