{
    "IsRecentlyVerified": false,
    "ID": 73891,
    "UUID": "DEA0AB86-8722-4304-9D86-62711AFB9E5D",
    "DataProviderID": 1,
    "OperatorID": 90,
    "OperatorsReference": "CEC-00063",
    "UsageTypeID": 4,
    "UsageCost": "CAD 11.50/hour",
    "AddressInfo": {
        "ID": 74237,
        "Title": "BRCC-CDSMML-Chandler",
        "AddressLine1": "125 boul. René Lévesque Ouest",
        "Town": "Chandler",
        "StateOrProvince": "QC",
        "Postcode": "G0C 1K0",
        "CountryID": 44,
        "Latitude": 48.349331,
        "Longitude": -64.683954,
        "DistanceUnit": 0
    },
    "Connections": [
        {
            "ID": 106202,
            "ConnectionTypeID": 2,
            "StatusTypeID": 50,
            "LevelID": 3,
            "PowerKW": 50,
            "CurrentTypeID": 20,
            "Quantity": 1
        },
        {
            "ID": 106203,
            "ConnectionTypeID": 32,
            "StatusTypeID": 50,
            "LevelID": 3,
            "PowerKW": 50,
            "CurrentTypeID": 20,
            "Quantity": 1
        }
    ],
    "NumberOfPoints": 1,
    "StatusTypeID": 50,
    "DateLastStatusUpdate": "2019-08-02T07:17:00Z",
    "DataQualityLevel": 1,
    "DateCreated": "2016-11-23T23:29:00Z",
    "SubmissionStatusTypeID": 200
}