{
    "UserComments": [
        {
            "ID": 764,
            "ChargePointID": 4237,
            "CommentTypeID": 10,
            "UserName": "Karl Bloss",
            "Comment": "UMKC parking lot.  Free to charge with ChargePoint card, but requires a $1/hour parking fee before 10 PM.  Parking fee is cash-only at machine.",
            "Rating": 5,
            "DateCreated": "2014-04-24T06:40:24.327Z",
            "User": {
                "ID": 1818,
                "Username": "Karl Bloss"
            },
            "CheckinStatusTypeID": 10
        }
    ],
    "IsRecentlyVerified": false,
    "ID": 4237,
    "UUID": "9C69C755-2EB3-44DF-A183-C03F7EFD4949",
    "DataProviderID": 2,
    "DataProvidersReference": "38888",
    "OperatorID": 5,
    "UsageTypeID": 1,
    "AddressInfo": {
        "ID": 4236,
        "Title": "UMKC",
        "AddressLine1": "5115 Oak St",
        "Town": "Kansas City",
        "StateOrProvince": "MO",
        "Postcode": "64112",
        "CountryID": 2,
        "Latitude": 39.0340233,
        "Longitude": -94.5830917,
        "ContactTelephone1": "888-758-4389",
        "AccessComments": "24 hours daily",
        "RelatedURL": "http://www.mychargepoint.net/",
        "DistanceUnit": 0
    },
    "Connections": [
        {
            "ID": 15637,
            "ConnectionTypeID": 9,
            "LevelID": 1,
            "Amps": 16,
            "Voltage": 120,
            "PowerKW": 1,
            "CurrentTypeID": 10,
            "Quantity": 1
        },
        {
            "ID": 15638,
            "ConnectionTypeID": 1,
            "LevelID": 2,
            "Amps": 16,
            "Voltage": 230,
            "PowerKW": 3,
            "CurrentTypeID": 10,
            "Quantity": 1
        },
        {
            "ID": 20590,
            "ConnectionTypeID": 1,
            "LevelID": 2,
            "Quantity": 1
        }
    ],
    "DateLastConfirmed": "2011-04-30T00:00:00Z",
    "StatusTypeID": 0,
    "DateLastStatusUpdate": "2015-06-24T09:04:00Z",
    "DataQualityLevel": 1,
    "DateCreated": "2011-05-09T14:58:00Z",
    "SubmissionStatusTypeID": 100
}