{
    "IsRecentlyVerified": false,
    "ID": 39178,
    "UUID": "18F3B6E4-1499-41B5-98F7-AFCDA2DC01A3",
    "DataProviderID": 1,
    "OperatorID": 220,
    "OperatorsReference": "9012,9012,9011",
    "UsageTypeID": 4,
    "UsageCost": "€1.73 + €0.3213/kWh; Andere Tarife möglich",
    "AddressInfo": {
        "ID": 39524,
        "Title": "Parkhaus Europapassage",
        "AddressLine1": "Hermannstraße 13",
        "Town": "Hamburg",
        "Postcode": "20095",
        "CountryID": 87,
        "Latitude": 53.552008,
        "Longitude": 9.996625,
        "AccessComments": "Die Ladesäulen befinden sich auf P2 London. Parkhaus Öffnungszeiten Mo-Sa 07:00-01:00; So 09:00-01:00.",
        "DistanceUnit": 0
    },
    "Connections": [
        {
            "ID": 42689,
            "ConnectionTypeID": 25,
            "StatusTypeID": 50,
            "LevelID": 2,
            "Amps": 16,
            "Voltage": 400,
            "PowerKW": 11,
            "CurrentTypeID": 20,
            "Quantity": 2
        },
        {
            "ID": 49912,
            "ConnectionTypeID": 28,
            "StatusTypeID": 50,
            "LevelID": 2,
            "Amps": 16,
            "Voltage": 230,
            "PowerKW": 3.7,
            "CurrentTypeID": 10,
            "Quantity": 2
        }
    ],
    "NumberOfPoints": 2,
    "StatusTypeID": 50,
    "DateLastStatusUpdate": "2017-04-20T22:58:00Z",
    "DataQualityLevel": 3,
    "DateCreated": "2015-01-09T06:08:00Z",
    "SubmissionStatusTypeID": 200
}