{
    "IsRecentlyVerified": false,
    "ID": 57037,
    "UUID": "190A488B-5B36-4DCD-B767-FB9549655FBF",
    "DataProviderID": 1,
    "OperatorID": 167,
    "UsageTypeID": 3,
    "AddressInfo": {
        "ID": 57383,
        "Title": "Autohaus Walter Maltlt",
        "AddressLine1": "Kiefernstraße 5",
        "Town": "Königsdorf",
        "StateOrProvince": "Landkreis Bad Tölz-Wolfratshausen",
        "Postcode": "82549",
        "CountryID": 87,
        "Latitude": 47.83183,
        "Longitude": 11.479730000000018,
        "ContactTelephone1": " 08179 / 99 88 60",
        "AccessComments": "Kostenloses Laden nach Ausfüllen des Anmeldeformulars während der Öffnungszeiten Mo-Do 8-18Uhr, Fr 8-17Uhr, Sa/So geschlossen.",
        "RelatedURL": "http://matl.nissan-haendler.de/",
        "DistanceUnit": 0
    },
    "Connections": [
        {
            "ID": 72045,
            "ConnectionTypeID": 28,
            "StatusTypeID": 50,
            "LevelID": 2,
            "Amps": 16,
            "Voltage": 230,
            "PowerKW": 3.7,
            "CurrentTypeID": 10,
            "Quantity": 1
        }
    ],
    "NumberOfPoints": 1,
    "StatusTypeID": 50,
    "DateLastStatusUpdate": "2015-11-21T09:55:00Z",
    "DataQualityLevel": 1,
    "DateCreated": "2015-11-21T09:55:00Z",
    "SubmissionStatusTypeID": 200
}