{
    "IsRecentlyVerified": false,
    "ID": 63823,
    "UUID": "9888B91F-2128-4301-BFAE-E760E9D05ADD",
    "DataProviderID": 26,
    "DataProvidersReference": "79011",
    "OperatorID": 157,
    "OperatorsReference": "NewMotion 03002562",
    "UsageCost": "0.00 jaarabonnement",
    "AddressInfo": {
        "ID": 64169,
        "Title": "Handelskade",
        "AddressLine1": "Handelskade",
        "Town": "Deventer",
        "Postcode": "7411 HX",
        "CountryID": 159,
        "Latitude": 52.2543783,
        "Longitude": 6.1680351,
        "ContactTelephone1": "088 0109500",
        "RelatedURL": "http://thenewmotion.nl/",
        "DistanceUnit": 0
    },
    "Connections": [
        {
            "ID": 81534,
            "ConnectionTypeID": 25,
            "LevelID": 2,
            "PowerKW": 22,
            "CurrentTypeID": 10
        },
        {
            "ID": 81535,
            "ConnectionTypeID": 25,
            "LevelID": 2,
            "PowerKW": 22,
            "CurrentTypeID": 10
        }
    ],
    "NumberOfPoints": 1,
    "StatusTypeID": 50,
    "DateLastStatusUpdate": "2016-06-04T02:52:00Z",
    "DataQualityLevel": 3,
    "DateCreated": "2016-03-03T12:32:00Z",
    "SubmissionStatusTypeID": 100
}