{
    "IsRecentlyVerified": false,
    "ID": 113089,
    "UUID": "C509E8F1-8527-4A4E-AB97-EB5A4828A514",
    "DataProviderID": 2,
    "DataProvidersReference": "104335",
    "UsageTypeID": 1,
    "AddressInfo": {
        "ID": 113435,
        "Title": "One Light Street",
        "AddressLine1": "1 Light St",
        "Town": "Baltimore",
        "StateOrProvince": "MD",
        "Postcode": "21201",
        "CountryID": 2,
        "Latitude": 39.289496,
        "Longitude": -76.613588,
        "ContactTelephone1": "410-685-1109",
        "AccessComments": "Garage business hours",
        "RelatedURL": "",
        "DistanceUnit": 0
    },
    "Connections": [
        {
            "ID": 159256,
            "ConnectionTypeID": 1,
            "LevelID": 2,
            "Amps": 16,
            "Voltage": 230,
            "PowerKW": 3.7,
            "CurrentTypeID": 10,
            "Quantity": 2
        }
    ],
    "DateLastStatusUpdate": "2020-06-26T03:01:00Z",
    "DataQualityLevel": 3,
    "DateCreated": "2018-11-28T02:04:00Z",
    "SubmissionStatusTypeID": 100
}