{
    "IsRecentlyVerified": false,
    "ID": 42030,
    "UUID": "653BFE2B-00CD-4D12-8656-3AAF06E2F68C",
    "DataProviderID": 2,
    "DataProvidersReference": "65664",
    "UsageTypeID": 7,
    "AddressInfo": {
        "ID": 42376,
        "Title": "Grappone Toyota",
        "AddressLine1": "594 New Hampshire 3A",
        "Town": "Bow",
        "StateOrProvince": "NH",
        "Postcode": "03304",
        "CountryID": 2,
        "Latitude": 43.15747,
        "Longitude": -71.505224,
        "ContactTelephone1": "603-224-9912",
        "AccessComments": "Dealership business hours\r\nPublic - Call ahead",
        "RelatedURL": "",
        "DistanceUnit": 0
    },
    "Connections": [
        {
            "ID": 50408,
            "ConnectionTypeID": 1,
            "LevelID": 2,
            "Amps": 16,
            "Voltage": 230,
            "PowerKW": 3.7,
            "CurrentTypeID": 10,
            "Quantity": 2
        }
    ],
    "DateLastStatusUpdate": "2020-06-26T03:06:00Z",
    "DataQualityLevel": 3,
    "DateCreated": "2015-02-23T02:10:00Z",
    "SubmissionStatusTypeID": 100
}