{
    "IsRecentlyVerified": false,
    "ID": 119478,
    "UUID": "E8C5F98E-F51C-4EA6-89B1-D55D76ED1B18",
    "DataProviderID": 2,
    "DataProvidersReference": "96884",
    "OperatorID": 5,
    "UsageTypeID": 1,
    "AddressInfo": {
        "ID": 119824,
        "Title": "CASTLE PROF CTR",
        "AddressLine1": "46-001 Kamehameha Hwy",
        "Town": "Kaneohe",
        "StateOrProvince": "HI",
        "Postcode": "96744",
        "CountryID": 2,
        "Latitude": 21.4187174,
        "Longitude": -157.8017897,
        "ContactTelephone1": "888-758-4389",
        "AccessComments": "24 hours daily",
        "RelatedURL": "http://www.chargepoint.com/",
        "DistanceUnit": 0
    },
    "Connections": [
        {
            "ID": 168742,
            "ConnectionTypeID": 1,
            "LevelID": 2,
            "Amps": 16,
            "Voltage": 230,
            "PowerKW": 3.7,
            "CurrentTypeID": 10,
            "Quantity": 2
        }
    ],
    "DateLastStatusUpdate": "2020-06-26T02:52:00Z",
    "DataQualityLevel": 3,
    "DateCreated": "2019-04-01T04:59:00Z",
    "SubmissionStatusTypeID": 100
}