{
    "IsRecentlyVerified": false,
    "ID": 106318,
    "UUID": "6C8E335C-1CA5-4DB4-B7A8-2787295CF53E",
    "DataProviderID": 1,
    "OperatorID": 23,
    "OperatorsReference": "43273",
    "UsageTypeID": 4,
    "UsageCost": "$0.44/min >=60kW; $0.22/min <60kW; other tariffs for older cars",
    "AddressInfo": {
        "ID": 106664,
        "Title": "Burlington, on Supercharger",
        "AddressLine1": "900 Maple Avenue",
        "Town": "Burlington",
        "Postcode": "L7S 2J8",
        "CountryID": 44,
        "Latitude": 43.326276,
        "Longitude": -79.822231,
        "DistanceUnit": 0
    },
    "Connections": [
        {
            "ID": 149672,
            "ConnectionTypeID": 27,
            "StatusTypeID": 50,
            "LevelID": 3,
            "PowerKW": 120,
            "CurrentTypeID": 30,
            "Quantity": 16
        }
    ],
    "NumberOfPoints": 16,
    "GeneralComments": "Charging16 Superchargers, available 24/7, up to 120kW",
    "StatusTypeID": 50,
    "DateLastStatusUpdate": "2021-01-04T13:35:00Z",
    "DataQualityLevel": 1,
    "DateCreated": "2018-06-20T05:32:00Z",
    "SubmissionStatusTypeID": 200
}