{
    "IsRecentlyVerified": false,
    "ID": 159678,
    "UUID": "6301AA15-1095-4EB2-B94E-9ED3E25C7618",
    "DataProviderID": 2,
    "DataProvidersReference": "154785",
    "OperatorID": 5,
    "UsageTypeID": 1,
    "AddressInfo": {
        "ID": 160035,
        "Title": "GRANGER MEDICAL",
        "AddressLine1": "3532 Beehive St",
        "Town": "West Valley City",
        "StateOrProvince": "UT",
        "Postcode": "84119",
        "CountryID": 2,
        "Latitude": 40.6956659,
        "Longitude": -111.9635782,
        "ContactTelephone1": "888-758-4389",
        "AccessComments": "24 hours daily",
        "RelatedURL": "http://www.chargepoint.com/",
        "DistanceUnit": 0
    },
    "Connections": [
        {
            "ID": 229882,
            "ConnectionTypeID": 1,
            "LevelID": 2,
            "Amps": 16,
            "Voltage": 230,
            "PowerKW": 3.7,
            "CurrentTypeID": 10,
            "Quantity": 2
        }
    ],
    "StatusTypeID": 50,
    "DateLastStatusUpdate": "2020-06-26T03:03:00Z",
    "DataQualityLevel": 3,
    "DateCreated": "2020-06-26T03:03:00Z",
    "SubmissionStatusTypeID": 100
}