{
    "IsRecentlyVerified": false,
    "ID": 170608,
    "UUID": "F5633723-1D27-42F4-9E22-79E7F5AA323B",
    "DataProviderID": 1,
    "OperatorID": 25,
    "UsageTypeID": 4,
    "UsageCost": "Free. Parking fees apply.",
    "AddressInfo": {
        "ID": 170967,
        "Title": "Watford Underground Station NCP Car Park",
        "AddressLine1": "Metropolitan Station Approach",
        "Town": "West Watford",
        "StateOrProvince": "Hertfordshire",
        "Postcode": "WD18 7BP",
        "CountryID": 1,
        "Latitude": 51.6565461920776,
        "Longitude": -0.41780682816249737,
        "DistanceUnit": 0
    },
    "Connections": [
        {
            "ID": 260463,
            "ConnectionTypeID": 3,
            "StatusTypeID": 50,
            "LevelID": 2,
            "Amps": 13,
            "Voltage": 230,
            "PowerKW": 3,
            "CurrentTypeID": 10,
            "Quantity": 3
        }
    ],
    "NumberOfPoints": 3,
    "GeneralComments": "Location has disappeared from Source London website. Elektrobay classic 13A posts, may or may not work",
    "StatusTypeID": 0,
    "DateLastStatusUpdate": "2020-12-03T11:19:00Z",
    "DataQualityLevel": 1,
    "DateCreated": "2020-12-03T11:19:00Z",
    "SubmissionStatusTypeID": 200
}