{
    "IsRecentlyVerified": false,
    "ID": 135593,
    "UUID": "3BBD6B1C-62DB-4EC3-B790-097562D913A6",
    "DataProviderID": 1,
    "OperatorID": 20,
    "UsageTypeID": 1,
    "UsageCost": "CYC: 25p per kWh. Needs RFID card (£20 per year) or CYC app ",
    "AddressInfo": {
        "ID": 135939,
        "Title": "Old Forest Road",
        "AddressLine1": "Old Forest Road",
        "Town": "Wokingham",
        "Postcode": "RG40 5QP",
        "CountryID": 1,
        "Latitude": 51.423036,
        "Longitude": -0.862208,
        "ContactTelephone1": "44 191 265 0500",
        "AccessComments": "",
        "RelatedURL": "http://www.chargeyourcar.org.uk",
        "DistanceUnit": 0
    },
    "Connections": [
        {
            "ID": 189997,
            "ConnectionTypeID": 2,
            "Reference": "1",
            "StatusTypeID": 50,
            "LevelID": 3,
            "Amps": 125,
            "Voltage": 400,
            "PowerKW": 50,
            "CurrentTypeID": 30,
            "Quantity": 1
        },
        {
            "ID": 189998,
            "ConnectionTypeID": 33,
            "Reference": "2",
            "StatusTypeID": 50,
            "LevelID": 3,
            "Amps": 125,
            "Voltage": 400,
            "PowerKW": 50,
            "CurrentTypeID": 30,
            "Quantity": 1
        },
        {
            "ID": 189999,
            "ConnectionTypeID": 1036,
            "Reference": "3",
            "StatusTypeID": 50,
            "LevelID": 3,
            "Amps": 63,
            "Voltage": 400,
            "PowerKW": 43,
            "CurrentTypeID": 20,
            "Quantity": 1
        }
    ],
    "StatusTypeID": 50,
    "DateLastStatusUpdate": "2021-03-08T08:57:00Z",
    "MetadataValues": [
        {
            "ID": 5445,
            "MetadataFieldID": 4,
            "ItemValue": "Contains public sector information licensed under the Open Government Licence v2.0. http://www.nationalarchives.gov.uk/doc/open-government-licence/version/2/"
        }
    ],
    "DataQualityLevel": 3,
    "DateCreated": "2019-12-24T05:22:00Z",
    "SubmissionStatusTypeID": 100
}