{
    "IsRecentlyVerified": false,
    "ID": 115822,
    "UUID": "E60A01A3-DF34-4652-BB05-98595EFE1DF9",
    "DataProviderID": 2,
    "DataProvidersReference": "105451",
    "OperatorID": 5,
    "UsageTypeID": 1,
    "AddressInfo": {
        "ID": 116168,
        "Title": "CHESTNUT ST EV",
        "AddressLine1": "401 E Gay St",
        "Town": "West Chester",
        "StateOrProvince": "PA",
        "Postcode": "19380",
        "CountryID": 2,
        "Latitude": 39.963759,
        "Longitude": -75.5990801,
        "ContactTelephone1": "888-758-4389",
        "AccessComments": "24 hours daily",
        "RelatedURL": "http://www.chargepoint.com/",
        "DistanceUnit": 0
    },
    "Connections": [
        {
            "ID": 162863,
            "ConnectionTypeID": 1,
            "LevelID": 2,
            "Amps": 16,
            "Voltage": 230,
            "PowerKW": 3.7,
            "CurrentTypeID": 10,
            "Quantity": 2
        }
    ],
    "DateLastStatusUpdate": "2020-06-26T03:02:00Z",
    "DataQualityLevel": 3,
    "DateCreated": "2019-02-11T07:13:00Z",
    "SubmissionStatusTypeID": 100
}