{
    "MediaItems": [
        {
            "ID": 28863,
            "ChargePointID": 188508,
            "ItemURL": "https://s3-ap-southeast-2.amazonaws.com/openchargemap/images/IL/OCM188508/OCM-188508.orig.2021073120205468.jpg",
            "ItemThumbnailURL": "https://s3-ap-southeast-2.amazonaws.com/openchargemap/images/IL/OCM188508/OCM-188508.thmb.2021073120205468.jpg",
            "Comment": "",
            "IsEnabled": true,
            "IsVideo": false,
            "IsFeaturedItem": false,
            "IsExternalResource": false,
            "User": {
                "ID": 21880,
                "Username": "Siegi "
            },
            "DateCreated": "2021-07-31T20:21:00Z"
        }
    ],
    "IsRecentlyVerified": false,
    "ID": 188508,
    "UUID": "3497F310-BF6B-4BD9-A91C-778A0F91F119",
    "DataProviderID": 1,
    "OperatorID": 3435,
    "UsageTypeID": 4,
    "UsageCost": "ac - 5 + 1.2 / kwh, dc - 2 / kwh",
    "AddressInfo": {
        "ID": 188867,
        "Title": "BIG Center",
        "AddressLine1": "BIG Center",
        "Town": "Yehud Monosson",
        "StateOrProvince": "Center District",
        "Postcode": "5647003",
        "CountryID": 111,
        "Latitude": 32.02634026708189,
        "Longitude": 34.899722157101905,
        "DistanceUnit": 0
    },
    "Connections": [
        {
            "ID": 304447,
            "ConnectionTypeID": 33,
            "StatusTypeID": 50,
            "LevelID": 3,
            "PowerKW": 50,
            "CurrentTypeID": 30,
            "Quantity": 1
        },
        {
            "ID": 304448,
            "ConnectionTypeID": 2,
            "StatusTypeID": 50,
            "LevelID": 3,
            "PowerKW": 50,
            "CurrentTypeID": 30,
            "Quantity": 1
        },
        {
            "ID": 304449,
            "ConnectionTypeID": 25,
            "StatusTypeID": 50,
            "LevelID": 2,
            "PowerKW": 22,
            "CurrentTypeID": 20,
            "Quantity": 4
        }
    ],
    "NumberOfPoints": 6,
    "GeneralComments": " העמדות נמצאות בחניון המקורה, קומה מינוס 1. בירידה ימינה, להמשיך עוד קצת ולפנות ימינה לשורות 1-4 (ליד קיר צפוני).",
    "StatusTypeID": 50,
    "DateLastStatusUpdate": "2021-08-03T13:05:00Z",
    "DataQualityLevel": 1,
    "DateCreated": "2021-07-30T14:22:00Z",
    "SubmissionStatusTypeID": 200
}