{
    "IsRecentlyVerified": false,
    "ID": 163778,
    "UUID": "00BE1986-BB11-4CB2-BAFA-4A099F73BF5E",
    "DataProviderID": 1,
    "OperatorID": 23,
    "OperatorsReference": "49133",
    "UsageTypeID": 4,
    "AddressInfo": {
        "ID": 164135,
        "Title": "Insel-Hotel",
        "AddressLine1": "Willy-Mayer-Bruecke",
        "Town": "Heilbronn",
        "Postcode": "74072",
        "CountryID": 87,
        "Latitude": 49.14298,
        "Longitude": 9.215696,
        "ContactTelephone1": "+49 7131 630 0",
        "DistanceUnit": 0
    },
    "Connections": [
        {
            "ID": 235375,
            "ConnectionTypeID": 30,
            "StatusTypeID": 50,
            "LevelID": 2,
            "PowerKW": 22,
            "CurrentTypeID": 20,
            "Quantity": 1
        }
    ],
    "NumberOfPoints": 1,
    "GeneralComments": "1 Tesla Connector, up to 22kW.Available for customers. Self park.",
    "StatusTypeID": 50,
    "DateLastStatusUpdate": "2020-08-24T17:19:00Z",
    "DataQualityLevel": 1,
    "DateCreated": "2020-08-24T17:18:00Z",
    "SubmissionStatusTypeID": 200
}