{
    "IsRecentlyVerified": false,
    "ID": 85103,
    "UUID": "438460DD-3FC1-40B9-930E-5BE2AD398B7D",
    "DataProviderID": 1,
    "OperatorID": 23,
    "OperatorsReference": "26060",
    "UsageTypeID": 6,
    "AddressInfo": {
        "ID": 85449,
        "Title": "Adler Resort",
        "AddressLine1": "378 Hasenbachweg",
        "Town": "Hinterglemm",
        "Postcode": "5754",
        "CountryID": 19,
        "Latitude": 47.380622,
        "Longitude": 12.598188,
        "ContactTelephone1": "+43 6541 7331",
        "DistanceUnit": 0
    },
    "Connections": [
        {
            "ID": 120861,
            "ConnectionTypeID": 30,
            "StatusTypeID": 50,
            "LevelID": 2,
            "Amps": 16,
            "Voltage": 400,
            "PowerKW": 11,
            "CurrentTypeID": 20,
            "Quantity": 2
        }
    ],
    "NumberOfPoints": 2,
    "GeneralComments": "2 Tesla Connectors, up to 11kW.Available for patrons only. Please see front desk.",
    "StatusTypeID": 50,
    "DateLastStatusUpdate": "2018-10-03T18:05:00Z",
    "DataQualityLevel": 1,
    "DateCreated": "2017-03-26T05:24:00Z",
    "SubmissionStatusTypeID": 200
}