{
    "IsRecentlyVerified": false,
    "ID": 154064,
    "UUID": "0176BD85-403E-4A09-9A5C-B1DE34F810A8",
    "DataProviderID": 28,
    "DataProvidersReference": "FR*S27*PSTGERMAINCAMP*EGLISE",
    "UsageTypeID": 5,
    "AddressInfo": {
        "ID": 154417,
        "Title": "900074",
        "AddressLine1": "Eglise Saint Germain la Campagne",
        "CountryID": 80,
        "Latitude": 49.048847,
        "Longitude": 0.40543,
        "AccessComments": "24/24 7/7 jours",
        "DistanceUnit": 0
    },
    "Connections": [
        {
            "ID": 216507,
            "ConnectionTypeID": 28,
            "StatusTypeID": 50,
            "LevelID": 2,
            "PowerKW": 22,
            "CurrentTypeID": 10
        },
        {
            "ID": 216508,
            "ConnectionTypeID": 26,
            "StatusTypeID": 50,
            "LevelID": 2,
            "PowerKW": 22
        },
        {
            "ID": 250838,
            "ConnectionTypeID": 28,
            "StatusTypeID": 50,
            "LevelID": 2,
            "PowerKW": 22,
            "CurrentTypeID": 10
        },
        {
            "ID": 250839,
            "ConnectionTypeID": 26,
            "StatusTypeID": 50,
            "LevelID": 2,
            "PowerKW": 22
        }
    ],
    "GeneralComments": "Borne en service",
    "StatusTypeID": 50,
    "DateLastStatusUpdate": "2020-08-27T05:16:00Z",
    "DataQualityLevel": 2,
    "DateCreated": "2020-03-15T10:54:00Z",
    "SubmissionStatusTypeID": 100
}