{
    "UserComments": [
        {
            "ID": 23066,
            "ChargePointID": 162602,
            "CommentTypeID": 10,
            "UserName": "interssl.com",
            "Comment": "Drove by it yesterday. Didn't try charging.",
            "DateCreated": "2020-08-12T11:36:27.26Z",
            "User": {
                "ID": 26760,
                "Username": "interssl.com"
            },
            "CheckinStatusTypeID": 140,
            "IsActionedByEditor": false
        }
    ],
    "IsRecentlyVerified": false,
    "ID": 162602,
    "UUID": "1686BA11-4CC7-42D6-A788-CC81A9E7B34B",
    "DataProviderID": 1,
    "OperatorID": 45,
    "UsageTypeID": 6,
    "AddressInfo": {
        "ID": 162959,
        "Title": "Hotel Wasserfall",
        "AddressLine1": "Großglockner Hochalpenstraße",
        "AddressLine2": "Bad Fusch",
        "Town": "Fusch an der Großglocknerstraße",
        "StateOrProvince": "Bezirk Zell am See",
        "Postcode": "5672",
        "CountryID": 19,
        "Latitude": 47.2234620840498,
        "Longitude": 12.826883870510528,
        "RelatedURL": "https://www.hotel-wasserfall.at/",
        "DistanceUnit": 0
    },
    "Connections": [
        {
            "ID": 234034,
            "ConnectionTypeID": 25,
            "StatusTypeID": 50,
            "LevelID": 2,
            "Amps": 16,
            "PowerKW": 11,
            "CurrentTypeID": 20,
            "Quantity": 1
        }
    ],
    "NumberOfPoints": 1,
    "StatusTypeID": 50,
    "DateLastStatusUpdate": "2020-08-12T17:11:00Z",
    "DataQualityLevel": 1,
    "DateCreated": "2020-08-12T11:36:00Z",
    "SubmissionStatusTypeID": 200
}