{
    "IsRecentlyVerified": false,
    "ID": 124138,
    "UUID": "C8DAB90E-5F19-4618-8B09-65C5426414BF",
    "DataProviderID": 2,
    "DataProvidersReference": "104310",
    "UsageTypeID": 1,
    "AddressInfo": {
        "ID": 124484,
        "Title": "Stanislaus County - Oakdale Library",
        "AddressLine1": "151 S 1st Ave",
        "Town": "Oakdale",
        "StateOrProvince": "CA",
        "Postcode": "95361",
        "CountryID": 2,
        "Latitude": 37.764711,
        "Longitude": -120.848771,
        "ContactTelephone1": "209-847-4204",
        "AccessComments": "10am-6pm M & W, 10am-8pm T & Th, 10am-5pm F-Sat",
        "RelatedURL": "",
        "DistanceUnit": 0
    },
    "Connections": [
        {
            "ID": 174197,
            "ConnectionTypeID": 1,
            "LevelID": 2,
            "Amps": 16,
            "Voltage": 230,
            "PowerKW": 3.7,
            "CurrentTypeID": 10,
            "Quantity": 2
        }
    ],
    "DateLastStatusUpdate": "2020-06-26T02:59:00Z",
    "DataQualityLevel": 3,
    "DateCreated": "2019-04-06T05:03:00Z",
    "SubmissionStatusTypeID": 100
}