{
    "IsRecentlyVerified": false,
    "ID": 173221,
    "UUID": "40DB843A-7205-4B51-8AE7-344A2BC89154",
    "DataProviderID": 19,
    "DataProvidersReference": "7170",
    "AddressInfo": {
        "ID": 173580,
        "Title": "Alvdal",
        "AddressLine1": "Nord-Østerdalsveien 5196",
        "Town": "ALVDAL",
        "StateOrProvince": "Innlandet",
        "Postcode": "2560",
        "CountryID": 168,
        "Latitude": 62.118898,
        "Longitude": 10.613358,
        "AccessComments": "",
        "DistanceUnit": 0
    },
    "Connections": [
        {
            "ID": 265946,
            "ConnectionTypeID": 33,
            "Reference": "1",
            "LevelID": 3,
            "PowerKW": 350,
            "CurrentTypeID": 30,
            "Comments": "Mode 4"
        },
        {
            "ID": 265947,
            "ConnectionTypeID": 33,
            "Reference": "2",
            "LevelID": 3,
            "PowerKW": 350,
            "CurrentTypeID": 30,
            "Comments": "Mode 4"
        },
        {
            "ID": 265948,
            "ConnectionTypeID": 33,
            "Reference": "3",
            "LevelID": 3,
            "PowerKW": 350,
            "CurrentTypeID": 30,
            "Comments": "Mode 4"
        },
        {
            "ID": 265949,
            "ConnectionTypeID": 33,
            "Reference": "4",
            "LevelID": 3,
            "PowerKW": 350,
            "CurrentTypeID": 30,
            "Comments": "Mode 4"
        }
    ],
    "NumberOfPoints": 4,
    "StatusTypeID": 0,
    "DateLastStatusUpdate": "2021-03-03T09:02:00Z",
    "DataQualityLevel": 2,
    "DateCreated": "2021-03-03T09:02:00Z",
    "SubmissionStatusTypeID": 100
}