{
    "IsRecentlyVerified": false,
    "ID": 159084,
    "UUID": "662FA592-FA5A-4650-BC7D-1FE3B5FF2B0E",
    "DataProviderID": 2,
    "DataProvidersReference": "155619",
    "OperatorID": 5,
    "UsageTypeID": 1,
    "AddressInfo": {
        "ID": 159441,
        "Title": "FFISCATOOSA",
        "AddressLine1": "200 Elliott Ln",
        "Town": "Catoosa",
        "StateOrProvince": "OK",
        "Postcode": "74015",
        "CountryID": 2,
        "Latitude": 36.16614,
        "Longitude": -95.7571,
        "ContactTelephone1": "888-758-4389",
        "AccessComments": "24 hours daily",
        "RelatedURL": "http://www.chargepoint.com/",
        "DistanceUnit": 0
    },
    "Connections": [
        {
            "ID": 229159,
            "ConnectionTypeID": 1,
            "LevelID": 2,
            "Amps": 16,
            "Voltage": 230,
            "PowerKW": 3.7,
            "CurrentTypeID": 10,
            "Quantity": 2
        }
    ],
    "StatusTypeID": 50,
    "DateLastStatusUpdate": "2020-06-26T02:58:00Z",
    "DataQualityLevel": 3,
    "DateCreated": "2020-06-26T02:58:00Z",
    "SubmissionStatusTypeID": 100
}