{
    "IsRecentlyVerified": false,
    "ID": 18693,
    "UUID": "A8D8E578-452F-4C7A-BFFA-55D47158A179",
    "DataProviderID": 15,
    "DataProvidersReference": "31987",
    "OperatorID": 5,
    "AddressInfo": {
        "ID": 19038,
        "Title": "301 St Anns Rd",
        "AddressLine1": "301 St Anns Rd",
        "Town": "Campbell River",
        "StateOrProvince": "British Columbia",
        "Postcode": "V9W 2P8",
        "CountryID": 44,
        "Latitude": 50.02342308,
        "Longitude": -125.2444568,
        "ContactTelephone1": "",
        "RelatedURL": "http://carstations.com/31987",
        "DistanceUnit": 0
    },
    "Connections": [
        {
            "ID": 18926,
            "ConnectionTypeID": 1,
            "Reference": "J1772",
            "LevelID": 2
        }
    ],
    "StatusTypeID": 0,
    "DateLastStatusUpdate": "2017-11-04T14:05:00Z",
    "DataQualityLevel": 2,
    "DateCreated": "2013-08-25T03:30:00Z",
    "SubmissionStatusTypeID": 200
}