{
    "IsRecentlyVerified": false,
    "ID": 95828,
    "UUID": "ABD5285C-9463-4D7A-9B8D-3F196C118CB1",
    "DataProviderID": 1,
    "OperatorID": 1,
    "UsageTypeID": 1,
    "UsageCost": "Free",
    "AddressInfo": {
        "ID": 96174,
        "Title": "Stoppustuð Vogum",
        "AddressLine1": "Hafnargötu",
        "Town": "Vogum",
        "StateOrProvince": "Vogum",
        "CountryID": 105,
        "Latitude": 63.9847312,
        "Longitude": -22.3820153,
        "DistanceUnit": 0
    },
    "Connections": [
        {
            "ID": 135736,
            "ConnectionTypeID": 25,
            "StatusTypeID": 50,
            "LevelID": 2,
            "Amps": 32,
            "Voltage": 400,
            "PowerKW": 22,
            "CurrentTypeID": 20,
            "Quantity": 1
        }
    ],
    "NumberOfPoints": 1,
    "StatusTypeID": 50,
    "DateLastStatusUpdate": "2017-11-26T20:40:00Z",
    "DataQualityLevel": 1,
    "DateCreated": "2017-11-26T09:27:00Z",
    "SubmissionStatusTypeID": 200
}