{
    "IsRecentlyVerified": false,
    "ID": 38493,
    "UUID": "16F12415-6B06-4B61-9FCA-ECD71E7EF3C3",
    "DataProviderID": 1,
    "OperatorID": 105,
    "OperatorsReference": "Essent EM-DE-11000000-18-00006",
    "UsageTypeID": 4,
    "AddressInfo": {
        "ID": 38839,
        "Title": "Marzahner Promenade 8",
        "AddressLine1": "Marzahner Promenade 8",
        "Town": "Berlin",
        "Postcode": "12679",
        "CountryID": 87,
        "Latitude": 52.542246,
        "Longitude": 13.543413,
        "DistanceUnit": 0
    },
    "Connections": [
        {
            "ID": 42004,
            "ConnectionTypeID": 25,
            "LevelID": 2,
            "PowerKW": 11
        },
        {
            "ID": 49703,
            "ConnectionTypeID": 25,
            "LevelID": 2,
            "PowerKW": 11
        }
    ],
    "NumberOfPoints": 1,
    "StatusTypeID": 50,
    "DateLastStatusUpdate": "2015-04-12T20:32:00Z",
    "DataQualityLevel": 3,
    "DateCreated": "2015-01-09T06:07:00Z",
    "SubmissionStatusTypeID": 200
}