{
    "IsRecentlyVerified": false,
    "ID": 20279,
    "UUID": "0FEA135E-CCD8-441D-8686-1C7014E9F852",
    "DataProviderID": 1,
    "OperatorID": 1,
    "UsageTypeID": 0,
    "UsageCost": "",
    "AddressInfo": {
        "ID": 20624,
        "Title": "BewweB",
        "AddressLine1": "78 Chemin de Vergeze ",
        "AddressLine2": "",
        "Town": "Calvisson",
        "StateOrProvince": "",
        "Postcode": "30420",
        "CountryID": 80,
        "Latitude": 43.77616,
        "Longitude": 4.21054,
        "ContactTelephone1": "",
        "ContactTelephone2": "",
        "ContactEmail": "",
        "AccessComments": "Ouvert à tous",
        "RelatedURL": "",
        "DistanceUnit": 0
    },
    "Connections": [],
    "GeneralComments": "",
    "StatusTypeID": 50,
    "DateLastStatusUpdate": "2013-11-11T15:41:00Z",
    "DataQualityLevel": 1,
    "DateCreated": "2013-11-11T14:23:00Z",
    "SubmissionStatusTypeID": 200
}