{
    "UserComments": [
        {
            "ID": 606,
            "ChargePointID": 15463,
            "CommentTypeID": 50,
            "UserName": "EcoWarriorAndCo",
            "Comment": "Don't use the satnav postcode - it's actually at Home Farm just off the A40. Turn off towards llandeilo and turn right almost immediately. Big car park on left - take the right hand car park and it's on a farm building door at the top .  From discussions with local NT staff this could be available 24/7",
            "Rating": 4,
            "DateCreated": "2014-01-04T14:02:17.12Z",
            "User": {
                "ID": 1275,
                "Username": "EcoWarriorAndCo"
            },
            "CheckinStatusTypeID": 10
        },
        {
            "ID": 579,
            "ChargePointID": 15463,
            "CommentTypeID": 10,
            "UserName": "EcoWarriorAndCo",
            "Comment": "",
            "DateCreated": "2013-12-16T12:25:12.387Z",
            "User": {
                "ID": 1275,
                "Username": "EcoWarriorAndCo"
            },
            "CheckinStatusTypeID": 10
        }
    ],
    "MediaItems": [
        {
            "ID": 18201,
            "ChargePointID": 15463,
            "ItemURL": "https://s3-ap-southeast-2.amazonaws.com/openchargemap/images/GB/OCM15463/OCM-15463.orig.2019043013443811.jpg",
            "ItemThumbnailURL": "https://s3-ap-southeast-2.amazonaws.com/openchargemap/images/GB/OCM15463/OCM-15463.thmb.2019043013443811.jpg",
            "Comment": "",
            "IsEnabled": true,
            "IsVideo": false,
            "IsFeaturedItem": false,
            "IsExternalResource": false,
            "User": {
                "ID": 15366,
                "Username": "ZCWCara"
            },
            "DateCreated": "2019-04-30T13:45:00Z"
        },
        {
            "ID": 18200,
            "ChargePointID": 15463,
            "ItemURL": "https://s3-ap-southeast-2.amazonaws.com/openchargemap/images/GB/OCM15463/OCM-15463.orig.2019043013425521.jpg",
            "ItemThumbnailURL": "https://s3-ap-southeast-2.amazonaws.com/openchargemap/images/GB/OCM15463/OCM-15463.thmb.2019043013425521.jpg",
            "Comment": "",
            "IsEnabled": true,
            "IsVideo": false,
            "IsFeaturedItem": false,
            "IsExternalResource": false,
            "User": {
                "ID": 15366,
                "Username": "ZCWCara"
            },
            "DateCreated": "2019-04-30T13:43:00Z"
        },
        {
            "ID": 12787,
            "ChargePointID": 15463,
            "ItemURL": "https://s3-ap-southeast-2.amazonaws.com/openchargemap/images/GB/OCM15463/OCM-15463.orig.2017060318364159.jpg",
            "ItemThumbnailURL": "https://s3-ap-southeast-2.amazonaws.com/openchargemap/images/GB/OCM15463/OCM-15463.thmb.2017060318364159.jpg",
            "Comment": "This charge point is situated on the side of a farm building a good mile walk from the NT property. Not a good place to charge if you find it difficult to walk far or have young children. Certainly not a place to stop after dark or when pouring down with rain! Most NT properties site their charge points in the main car parks where there are facilities close by shame Dinefwr didn't place there's in a most accessible place. Plus side charge point was working if you are happy to hang round in an farm yard for a few hours!",
            "IsEnabled": true,
            "IsVideo": false,
            "IsFeaturedItem": false,
            "IsExternalResource": false,
            "User": {
                "ID": 13882,
                "Username": "Bean"
            },
            "DateCreated": "2017-06-03T18:37:00Z"
        },
        {
            "ID": 167,
            "ChargePointID": 15463,
            "ItemURL": "https://s3-ap-southeast-2.amazonaws.com/openchargemap/images/GB/OCM15463/OCM-15463.orig.2013121612235793.jpg",
            "ItemThumbnailURL": "https://s3-ap-southeast-2.amazonaws.com/openchargemap/images/GB/OCM15463/OCM-15463.thmb.2013121612235793.jpg",
            "Comment": "",
            "IsEnabled": true,
            "IsVideo": false,
            "IsFeaturedItem": false,
            "IsExternalResource": false,
            "User": {
                "ID": 1275,
                "Username": "EcoWarriorAndCo"
            },
            "DateCreated": "2013-12-16T12:24:00Z"
        }
    ],
    "IsRecentlyVerified": false,
    "ID": 15463,
    "UUID": "ACDF8BA8-C5D1-4410-BF87-78BD06E5091C",
    "DataProviderID": 1,
    "OperatorID": 19,
    "UsageTypeID": 1,
    "UsageCost": "Free",
    "AddressInfo": {
        "ID": 15809,
        "Title": "National Trust Newton House, Home Farm",
        "AddressLine1": "Dinefwr Park & Castle",
        "Town": "Llandeilo",
        "StateOrProvince": "Wales",
        "Postcode": "SA19 6RT",
        "CountryID": 1,
        "Latitude": 51.88818,
        "Longitude": -4.008486,
        "ContactTelephone1": "01558 824512  ",
        "ContactEmail": "dinefwr@nationaltrust.org.uk",
        "RelatedURL": "http://www.nationaltrust.org.uk/dinefwr",
        "DistanceUnit": 0
    },
    "Connections": [
        {
            "ID": 13773,
            "ConnectionTypeID": 25,
            "StatusTypeID": 50,
            "LevelID": 2,
            "Amps": 32,
            "Voltage": 230,
            "PowerKW": 7,
            "CurrentTypeID": 10,
            "Quantity": 1
        },
        {
            "ID": 13774,
            "ConnectionTypeID": 3,
            "StatusTypeID": 50,
            "LevelID": 2,
            "Amps": 13,
            "Voltage": 230,
            "PowerKW": 3,
            "CurrentTypeID": 10,
            "Quantity": 1
        }
    ],
    "NumberOfPoints": 2,
    "StatusTypeID": 50,
    "DateLastStatusUpdate": "2019-04-30T13:45:00Z",
    "DataQualityLevel": 1,
    "DateCreated": "2013-01-10T10:41:00Z",
    "SubmissionStatusTypeID": 200
}