{
    "IsRecentlyVerified": false,
    "ID": 177922,
    "UUID": "D43538FC-F937-4185-B938-7663223DB643",
    "DataProviderID": 29,
    "DataProvidersReference": "13884",
    "AddressInfo": {
        "ID": 178281,
        "Title": "Bahnhofstraße 14",
        "AddressLine1": "Bahnhofstraße 14",
        "Town": "Sachsenheim",
        "Postcode": "74343",
        "CountryID": 87,
        "Latitude": 48.96162,
        "Longitude": 9.064904,
        "DistanceUnit": 0
    },
    "Connections": [
        {
            "ID": 277672,
            "ConnectionTypeID": 25,
            "StatusTypeID": 50,
            "LevelID": 2,
            "PowerKW": 22,
            "CurrentTypeID": 20
        },
        {
            "ID": 296454,
            "ConnectionTypeID": 25,
            "StatusTypeID": 50,
            "LevelID": 2,
            "PowerKW": 22,
            "CurrentTypeID": 20
        }
    ],
    "StatusTypeID": 0,
    "DateLastStatusUpdate": "2021-07-12T02:42:00Z",
    "MetadataValues": [
        {
            "ID": 10216,
            "MetadataFieldID": 4,
            "ItemValue": "Data from the German chargepoint registry provided by Bundesnetzagentur.de under the CC-BY 4.0 license"
        }
    ],
    "DataQualityLevel": 3,
    "DateCreated": "2021-07-08T09:49:00Z",
    "SubmissionStatusTypeID": 100
}