{
    "IsRecentlyVerified": false,
    "ID": 61023,
    "UUID": "0290A8BC-AA7D-4D4C-8C90-926A557496DC",
    "DataProviderID": 27,
    "DataProvidersReference": "318",
    "UsageTypeID": 1,
    "AddressInfo": {
        "ID": 61369,
        "Title": "Aparcamiento Calle Luna",
        "AddressLine1": "Calle Pintor Murillo, 11",
        "Town": "Móstoles",
        "StateOrProvince": "Móstoles",
        "Postcode": "28933",
        "CountryID": 210,
        "Latitude": 40.326608,
        "Longitude": -3.870572,
        "ContactTelephone1": "916645642/43",
        "RelatedURL": "http://www.mostoles.es/mostoles/cm/...",
        "DistanceUnit": 0
    },
    "Connections": [
        {
            "ID": 77512,
            "ConnectionTypeID": 28
        },
        {
            "ID": 77513,
            "ConnectionTypeID": 28
        }
    ],
    "GeneralComments": "Llamar al teléfono indicado",
    "StatusTypeID": 0,
    "DateLastStatusUpdate": "2016-02-13T00:23:00Z",
    "DataQualityLevel": 3,
    "DateCreated": "2016-02-13T00:23:00Z",
    "SubmissionStatusTypeID": 200
}