{
    "IsRecentlyVerified": false,
    "ID": 70454,
    "UUID": "2D26B724-9B38-43C6-B6CC-2A13C5AC3D52",
    "DataProviderID": 1,
    "OperatorID": 220,
    "OperatorsReference": "3255,3255,3254",
    "UsageTypeID": 4,
    "UsageCost": "€1.73 + €0.3213/kWh; Andere Tarife möglich",
    "AddressInfo": {
        "ID": 70800,
        "Title": "Parkplatz Groß Flottbeker Straße",
        "AddressLine1": "Groß Flottbeker Straße 72",
        "Town": "Hamburg",
        "StateOrProvince": "Hamburg",
        "Postcode": "22607",
        "CountryID": 87,
        "Latitude": 53.56801824985344,
        "Longitude": 9.878919431877197,
        "AccessComments": "24/7 nutzbar mit Ladekarte Vattenfall, SW LB, SUN, Charge&Fuel, PlugSurfing, The New Motion, Hamburg Energie oder per SMS Direct Pay.",
        "DistanceUnit": 0
    },
    "Connections": [
        {
            "ID": 100747,
            "ConnectionTypeID": 25,
            "StatusTypeID": 50,
            "LevelID": 2,
            "Amps": 32,
            "Voltage": 400,
            "PowerKW": 22,
            "CurrentTypeID": 20,
            "Quantity": 2
        },
        {
            "ID": 100748,
            "ConnectionTypeID": 28,
            "StatusTypeID": 50,
            "LevelID": 2,
            "Amps": 16,
            "Voltage": 230,
            "PowerKW": 3.7,
            "CurrentTypeID": 10,
            "Quantity": 2
        }
    ],
    "NumberOfPoints": 2,
    "StatusTypeID": 50,
    "DateLastStatusUpdate": "2017-04-20T22:51:00Z",
    "DataQualityLevel": 1,
    "DateCreated": "2016-07-18T05:43:00Z",
    "SubmissionStatusTypeID": 200
}