{
    "IsRecentlyVerified": false,
    "ID": 173919,
    "UUID": "C13222B7-7EE6-47A5-A502-3DC0E3130B2B",
    "DataProviderID": 1,
    "OperatorID": 3,
    "OperatorsReference": "t54_it1_3820_007",
    "UsageTypeID": 4,
    "UsageCost": "£0.25/kWh",
    "AddressInfo": {
        "ID": 174278,
        "Title": "Lidl-Eastway Retail Hub",
        "AddressLine1": "Eastway Retail Hub",
        "Town": "Preston",
        "Postcode": "PR2 3FB",
        "CountryID": 1,
        "Latitude": 53.7992039,
        "Longitude": -2.7228277,
        "DistanceUnit": 0
    },
    "Connections": [
        {
            "ID": 267625,
            "ConnectionTypeID": 25,
            "StatusTypeID": 50,
            "LevelID": 2,
            "Amps": 32,
            "Voltage": 400,
            "PowerKW": 22,
            "CurrentTypeID": 20,
            "Quantity": 1
        },
        {
            "ID": 269989,
            "ConnectionTypeID": 33,
            "StatusTypeID": 50,
            "LevelID": 3,
            "PowerKW": 50,
            "CurrentTypeID": 30,
            "Quantity": 1
        },
        {
            "ID": 270043,
            "ConnectionTypeID": 2,
            "StatusTypeID": 50,
            "LevelID": 3,
            "PowerKW": 50,
            "CurrentTypeID": 30,
            "Quantity": 1
        }
    ],
    "NumberOfPoints": 2,
    "GeneralComments": "This is an open charge unit installed at the Lidl super store at Eastway Retail Hub, Preston",
    "StatusTypeID": 50,
    "DateLastStatusUpdate": "2021-03-25T15:53:00Z",
    "DataQualityLevel": 1,
    "DateCreated": "2021-03-07T06:20:00Z",
    "SubmissionStatusTypeID": 200
}