{
    "IsRecentlyVerified": false,
    "ID": 110754,
    "UUID": "1E3478B6-CC19-425C-8F3D-AE6B0399E781",
    "DataProviderID": 2,
    "DataProvidersReference": "99360",
    "UsageTypeID": 1,
    "AddressInfo": {
        "ID": 111100,
        "Title": "Village of Waterville - West Main Street",
        "AddressLine1": "115 W Main St",
        "Town": "Waterville",
        "StateOrProvince": "NY",
        "Postcode": "13480",
        "CountryID": 2,
        "Latitude": 42.930765,
        "Longitude": -75.38053,
        "ContactTelephone1": "315-841-4221",
        "AccessComments": "24 hours daily",
        "RelatedURL": "",
        "DistanceUnit": 0
    },
    "Connections": [
        {
            "ID": 156040,
            "ConnectionTypeID": 1,
            "LevelID": 2,
            "Amps": 16,
            "Voltage": 230,
            "PowerKW": 3.7,
            "CurrentTypeID": 10,
            "Quantity": 2
        }
    ],
    "DateLastStatusUpdate": "2020-06-26T03:06:00Z",
    "DataQualityLevel": 3,
    "DateCreated": "2018-10-18T23:36:00Z",
    "SubmissionStatusTypeID": 100
}