{
    "IsRecentlyVerified": false,
    "ID": 183295,
    "UUID": "B7C54126-FFEE-4FD4-87F4-D84A0A776C41",
    "DataProviderID": 29,
    "DataProvidersReference": "14037",
    "OperatorID": 45,
    "AddressInfo": {
        "ID": 183654,
        "Title": "Hauptstrasse 106-110",
        "AddressLine1": "Hauptstrasse 106-110",
        "Town": "Waldfischbach",
        "Postcode": "67714",
        "CountryID": 87,
        "Latitude": 49.2836345,
        "Longitude": 7.6484184,
        "DistanceUnit": 0
    },
    "Connections": [
        {
            "ID": 290097,
            "ConnectionTypeID": 25,
            "StatusTypeID": 50,
            "LevelID": 2,
            "PowerKW": 22,
            "CurrentTypeID": 20
        },
        {
            "ID": 290098,
            "ConnectionTypeID": 25,
            "StatusTypeID": 50,
            "LevelID": 2,
            "PowerKW": 22,
            "CurrentTypeID": 20
        }
    ],
    "StatusTypeID": 50,
    "DateLastStatusUpdate": "2021-07-12T02:43:00Z",
    "MetadataValues": [
        {
            "ID": 15588,
            "MetadataFieldID": 4,
            "ItemValue": "Data from the German chargepoint registry provided by Bundesnetzagentur.de under the CC-BY 4.0 license"
        }
    ],
    "DataQualityLevel": 3,
    "DateCreated": "2021-07-08T10:03:00Z",
    "SubmissionStatusTypeID": 100
}