{
    "IsRecentlyVerified": false,
    "ID": 81423,
    "UUID": "58C45D26-FF8C-438E-8571-0A0B5E3850B7",
    "DataProviderID": 1,
    "OperatorID": 23,
    "OperatorsReference": "20900",
    "UsageTypeID": 6,
    "UsageCost": "Free",
    "AddressInfo": {
        "ID": 81769,
        "Title": "Sankt Jorgen Park Resort",
        "AddressLine1": "Knipplekullen 8-10",
        "Town": "Gothenburg",
        "Postcode": "41749",
        "CountryID": 216,
        "Latitude": 57.743942,
        "Longitude": 11.946361,
        "ContactTelephone1": "+46 313 48 40 00",
        "DistanceUnit": 0
    },
    "Connections": [
        {
            "ID": 116143,
            "ConnectionTypeID": 30,
            "StatusTypeID": 50,
            "LevelID": 2,
            "Amps": 16,
            "Voltage": 400,
            "PowerKW": 11,
            "CurrentTypeID": 20,
            "Quantity": 2
        }
    ],
    "NumberOfPoints": 2,
    "GeneralComments": "2 Tesla Connectors, up to 11kW.Available for patrons only. Please see front desk.",
    "StatusTypeID": 50,
    "DateLastStatusUpdate": "2018-10-03T18:44:00Z",
    "DataQualityLevel": 1,
    "DateCreated": "2017-02-01T13:45:00Z",
    "SubmissionStatusTypeID": 200
}