{
    "IsRecentlyVerified": false,
    "ID": 142553,
    "UUID": "B8B9939C-DFA4-4925-818E-004303B4E237",
    "DataProviderID": 2,
    "DataProvidersReference": "150441",
    "UsageTypeID": 2,
    "AddressInfo": {
        "ID": 142905,
        "Title": "Paramus Inn",
        "AddressLine1": "50 NJ-17",
        "Town": "Paramus",
        "StateOrProvince": "NJ",
        "Postcode": "07652",
        "CountryID": 2,
        "Latitude": 40.923957,
        "Longitude": -74.071121,
        "ContactTelephone1": "",
        "AccessComments": "",
        "RelatedURL": "",
        "DistanceUnit": 0
    },
    "Connections": [
        {
            "ID": 198714,
            "ConnectionTypeID": 1,
            "LevelID": 2,
            "Amps": 16,
            "Voltage": 230,
            "PowerKW": 3.7,
            "CurrentTypeID": 10,
            "Quantity": 4
        }
    ],
    "StatusTypeID": 50,
    "DateLastStatusUpdate": "2020-06-26T03:03:00Z",
    "DataQualityLevel": 3,
    "DateCreated": "2019-12-24T09:18:00Z",
    "SubmissionStatusTypeID": 100
}