{
    "IsRecentlyVerified": false,
    "ID": 44682,
    "UUID": "BC965F12-D219-49E8-A45A-813EDEEE6A33",
    "DataProviderID": 26,
    "DataProvidersReference": "60738",
    "OperatorID": 178,
    "OperatorsReference": "EVnetNL PNB-ENO033",
    "UsageCost": "0.00 jaarabonnement",
    "AddressInfo": {
        "ID": 45028,
        "Title": "Spoordijk 5",
        "AddressLine1": "Spoordijk 5",
        "Town": "Geertruidenberg",
        "Postcode": "4941 RZ",
        "CountryID": 159,
        "Latitude": 51.699643,
        "Longitude": 4.870305,
        "ContactTelephone1": "0800-3522365",
        "RelatedURL": "http://www.evnet.nl",
        "DistanceUnit": 0
    },
    "Connections": [
        {
            "ID": 54877,
            "ConnectionTypeID": 25,
            "LevelID": 2,
            "PowerKW": 11,
            "CurrentTypeID": 10
        }
    ],
    "NumberOfPoints": 2,
    "StatusTypeID": 50,
    "DateLastStatusUpdate": "2016-06-04T02:40:00Z",
    "DataQualityLevel": 3,
    "DateCreated": "2015-04-18T13:02:00Z",
    "SubmissionStatusTypeID": 100
}