{
    "IsRecentlyVerified": false,
    "ID": 176844,
    "UUID": "4512BC10-1049-4B0D-895F-1B71DE48CE5F",
    "DataProviderID": 29,
    "DataProvidersReference": "8878",
    "OperatorID": 69,
    "AddressInfo": {
        "ID": 177203,
        "Title": "Herderstraße",
        "AddressLine1": "Herderstraße",
        "Town": "Hildesheim",
        "Postcode": "31135",
        "CountryID": 87,
        "Latitude": 52.153618,
        "Longitude": 9.958914,
        "DistanceUnit": 0
    },
    "Connections": [
        {
            "ID": 275251,
            "ConnectionTypeID": 25,
            "StatusTypeID": 50,
            "LevelID": 2,
            "PowerKW": 22,
            "CurrentTypeID": 20
        },
        {
            "ID": 275252,
            "ConnectionTypeID": 25,
            "StatusTypeID": 50,
            "LevelID": 2,
            "PowerKW": 22,
            "CurrentTypeID": 20
        }
    ],
    "StatusTypeID": 0,
    "DateLastStatusUpdate": "2021-07-12T02:49:00Z",
    "MetadataValues": [
        {
            "ID": 9139,
            "MetadataFieldID": 4,
            "ItemValue": "Data from the German chargepoint registry provided by Bundesnetzagentur.de under the CC-BY 4.0 license"
        }
    ],
    "DataQualityLevel": 3,
    "DateCreated": "2021-07-08T09:48:00Z",
    "SubmissionStatusTypeID": 100
}