{
    "IsRecentlyVerified": false,
    "ID": 63825,
    "UUID": "66A4485F-5B7E-4B43-9850-2581BB16F9DB",
    "DataProviderID": 26,
    "DataProvidersReference": "77143",
    "OperatorID": 73,
    "OperatorsReference": "EV-Box EVB-P1542059",
    "UsageCost": "0.00 jaarabonnement",
    "AddressInfo": {
        "ID": 64171,
        "Title": "Robertinkkamp 2",
        "AddressLine1": "Robertinkkamp 2",
        "Town": "Enschede",
        "Postcode": "7524 BP",
        "CountryID": 159,
        "Latitude": 52.25421,
        "Longitude": 6.91451,
        "RelatedURL": "http://www.ev-box.nl",
        "DistanceUnit": 0
    },
    "Connections": [
        {
            "ID": 81537,
            "ConnectionTypeID": 25,
            "LevelID": 2,
            "PowerKW": 5,
            "CurrentTypeID": 10
        }
    ],
    "NumberOfPoints": 1,
    "StatusTypeID": 50,
    "DateLastStatusUpdate": "2016-06-04T02:52:00Z",
    "DataQualityLevel": 3,
    "DateCreated": "2016-03-03T12:32:00Z",
    "SubmissionStatusTypeID": 100
}