{
    "IsRecentlyVerified": false,
    "ID": 18978,
    "UUID": "2F195DBA-E1BB-4DFA-91BD-06A5B502EDE0",
    "DataProviderID": 1,
    "OperatorID": 93,
    "OperatorsReference": "SC108",
    "UsageTypeID": 0,
    "AddressInfo": {
        "ID": 19323,
        "Title": "Main Street Limavady",
        "AddressLine1": "County Derry",
        "Town": "Derry",
        "Postcode": "BT49 0EU",
        "CountryID": 1,
        "Latitude": 55.052944,
        "Longitude": -6.951432,
        "DistanceUnit": 0
    },
    "Connections": [
        {
            "ID": 19449,
            "ConnectionTypeID": 25,
            "StatusTypeID": 50,
            "LevelID": 2,
            "Amps": 32,
            "Voltage": 400,
            "PowerKW": 22,
            "CurrentTypeID": 20,
            "Quantity": 2
        }
    ],
    "NumberOfPoints": 2,
    "StatusTypeID": 50,
    "DateLastStatusUpdate": "2019-06-16T05:53:00Z",
    "DataQualityLevel": 2,
    "DateCreated": "2013-09-05T03:51:00Z",
    "SubmissionStatusTypeID": 200
}