{
    "IsRecentlyVerified": false,
    "ID": 121947,
    "UUID": "2BC87B2E-7288-47B9-A1B2-CA4EFF9DBA8F",
    "DataProviderID": 2,
    "DataProvidersReference": "95005",
    "OperatorID": 3372,
    "UsageTypeID": 1,
    "AddressInfo": {
        "ID": 122293,
        "Title": "Los Angeles Metro - Norwalk Station",
        "AddressLine1": "12901 Hoxie Ave",
        "Town": "Norwalk",
        "StateOrProvince": "CA",
        "Postcode": "90650",
        "CountryID": 2,
        "Latitude": 33.9139919,
        "Longitude": -118.1036001,
        "ContactTelephone1": "213-922-4638",
        "AccessComments": "24 hours daily; pay lot; must have EV Connect account to access, see www.metro.net/projects/ev/ for more information",
        "RelatedURL": "http://evconnect.com/",
        "DistanceUnit": 0
    },
    "Connections": [
        {
            "ID": 171792,
            "ConnectionTypeID": 1,
            "LevelID": 2,
            "Amps": 16,
            "Voltage": 230,
            "PowerKW": 3.7,
            "CurrentTypeID": 10,
            "Quantity": 4
        }
    ],
    "DateLastStatusUpdate": "2020-06-26T02:56:00Z",
    "DataQualityLevel": 3,
    "DateCreated": "2019-04-06T05:02:00Z",
    "SubmissionStatusTypeID": 100
}