{
    "IsRecentlyVerified": false,
    "ID": 160393,
    "UUID": "A6388A8D-8900-4A0A-9B5A-0F1B935B62E6",
    "DataProviderID": 2,
    "DataProvidersReference": "153345",
    "OperatorID": 89,
    "UsageTypeID": 1,
    "AddressInfo": {
        "ID": 160750,
        "Title": "Groupe Mercille - 121 De La Barre",
        "AddressLine1": "121 De la Barre",
        "Town": "Longueuil",
        "StateOrProvince": "QC",
        "Postcode": "J4K 2T9",
        "CountryID": 44,
        "Latitude": 45.528504,
        "Longitude": -73.521037,
        "ContactTelephone1": "888-356-8911",
        "AccessComments": "24 hours daily",
        "RelatedURL": "https://flo.ca/",
        "DistanceUnit": 0
    },
    "Connections": [
        {
            "ID": 230776,
            "ConnectionTypeID": 1,
            "LevelID": 2,
            "Amps": 16,
            "Voltage": 230,
            "PowerKW": 3.7,
            "CurrentTypeID": 10,
            "Quantity": 4
        }
    ],
    "StatusTypeID": 50,
    "DateLastStatusUpdate": "2020-06-26T03:09:00Z",
    "DataQualityLevel": 3,
    "DateCreated": "2020-06-26T03:09:00Z",
    "SubmissionStatusTypeID": 100
}