{
    "UserComments": [
        {
            "ID": 22033,
            "ChargePointID": 146680,
            "CommentTypeID": 10,
            "UserName": "Dylan_Hudson",
            "Rating": 5,
            "DateCreated": "2020-01-13T19:42:53.767Z",
            "User": {
                "ID": 23370,
                "Username": "Dylan_Hudson"
            },
            "CheckinStatusTypeID": 140,
            "IsActionedByEditor": false
        }
    ],
    "MediaItems": [
        {
            "ID": 20963,
            "ChargePointID": 146680,
            "ItemURL": "https://s3-ap-southeast-2.amazonaws.com/openchargemap/images/GB/OCM146680/OCM-146680.orig.2020011318405400.jpg",
            "ItemThumbnailURL": "https://s3-ap-southeast-2.amazonaws.com/openchargemap/images/GB/OCM146680/OCM-146680.thmb.2020011318405400.jpg",
            "Comment": "",
            "IsEnabled": true,
            "IsVideo": false,
            "IsFeaturedItem": false,
            "IsExternalResource": false,
            "User": {
                "ID": 23370,
                "Username": "Dylan_Hudson"
            },
            "DateCreated": "2020-01-13T18:41:00Z"
        }
    ],
    "IsRecentlyVerified": false,
    "ID": 146680,
    "UUID": "B27598F9-0E78-447E-9C98-639AE7F6D145",
    "DataProviderID": 1,
    "OperatorID": 150,
    "UsageTypeID": 1,
    "UsageCost": "Free",
    "AddressInfo": {
        "ID": 147032,
        "Title": "The Cluster of Nuts Car Park",
        "AddressLine1": "42 Hall field Lane",
        "AddressLine2": "Wetherby",
        "Town": "Leeds",
        "StateOrProvince": "England",
        "Postcode": "LS22 6JS",
        "CountryID": 1,
        "Latitude": 53.92789865953495,
        "Longitude": -1.3834341588525376,
        "ContactTelephone1": "+44 333 666 0059",
        "AccessComments": "Located in the main car park next to the disabled bays.",
        "RelatedURL": "https://ev.engie.co.uk",
        "DistanceUnit": 0
    },
    "Connections": [
        {
            "ID": 203951,
            "ConnectionTypeID": 2,
            "StatusTypeID": 50,
            "LevelID": 3,
            "PowerKW": 50,
            "CurrentTypeID": 30,
            "Quantity": 1
        },
        {
            "ID": 203952,
            "ConnectionTypeID": 33,
            "StatusTypeID": 50,
            "LevelID": 3,
            "PowerKW": 50,
            "CurrentTypeID": 30,
            "Quantity": 1
        },
        {
            "ID": 203953,
            "ConnectionTypeID": 25,
            "StatusTypeID": 50,
            "LevelID": 2,
            "PowerKW": 22,
            "CurrentTypeID": 20,
            "Quantity": 1
        }
    ],
    "NumberOfPoints": 1,
    "GeneralComments": "Engie rapid charger, 50kW DC, AC is a 22 Kw Socket. One bay for General use, one bay for taxis. Both Free to charge. Please Register at ev.engie.co.uk  £10 overstay fee after 75 mins, then £10 every subsequent 75 mins. completely free to use until 29th October 2021",
    "StatusTypeID": 50,
    "DateLastStatusUpdate": "2020-01-13T20:58:00Z",
    "DataQualityLevel": 1,
    "DateCreated": "2020-01-13T18:40:00Z",
    "SubmissionStatusTypeID": 200
}