{
    "IsRecentlyVerified": false,
    "ID": 101842,
    "UUID": "C2E4BC86-4035-4F42-A23C-9DCF232E19F2",
    "DataProviderID": 1,
    "OperatorID": 45,
    "UsageTypeID": 0,
    "AddressInfo": {
        "ID": 102188,
        "Title": " Centro Commerciale AURA",
        "AddressLine1": "Viale di Valle Aurelia, 30",
        "Town": "Roma ",
        "StateOrProvince": "RM",
        "Postcode": "00167 ",
        "CountryID": 112,
        "Latitude": 41.9020907047518,
        "Longitude": 12.439146047913255,
        "ContactTelephone1": "+06.39751750",
        "ContactEmail": "info@centrocommercialeaura.it",
        "AccessComments": "P-1 lato ovest",
        "RelatedURL": "http://www.centrocommercialeaura.it",
        "DistanceUnit": 0
    },
    "Connections": [
        {
            "ID": 143761,
            "ConnectionTypeID": 25,
            "StatusTypeID": 150,
            "LevelID": 2,
            "Amps": 32,
            "Voltage": 400,
            "PowerKW": 22,
            "CurrentTypeID": 20,
            "Quantity": 6
        }
    ],
    "NumberOfPoints": 6,
    "StatusTypeID": 150,
    "DateLastStatusUpdate": "2018-04-11T16:07:00Z",
    "DataQualityLevel": 1,
    "DateCreated": "2018-04-11T16:06:00Z",
    "SubmissionStatusTypeID": 200
}