{
    "IsRecentlyVerified": false,
    "ID": 149403,
    "UUID": "E705AF93-BE1F-482C-9BED-9FD6F076940A",
    "DataProviderID": 1,
    "OperatorID": 207,
    "UsageTypeID": 1,
    "UsageCost": "0.50€/kWh",
    "AddressInfo": {
        "ID": 149756,
        "Title": "E.S. El Delfin Azul",
        "AddressLine1": "Caretera Madrid-Cadiz (N-323a) Km. 295",
        "Town": "Bailen",
        "StateOrProvince": "Jaen",
        "Postcode": "23710",
        "CountryID": 210,
        "Latitude": 38.09374198545055,
        "Longitude": -3.768834063674035,
        "DistanceUnit": 0
    },
    "Connections": [
        {
            "ID": 207439,
            "ConnectionTypeID": 33,
            "StatusTypeID": 50,
            "LevelID": 3,
            "PowerKW": 50,
            "CurrentTypeID": 30,
            "Quantity": 1
        },
        {
            "ID": 207440,
            "ConnectionTypeID": 2,
            "StatusTypeID": 50,
            "LevelID": 3,
            "PowerKW": 50,
            "CurrentTypeID": 30,
            "Quantity": 1
        },
        {
            "ID": 207441,
            "ConnectionTypeID": 1036,
            "StatusTypeID": 50,
            "LevelID": 3,
            "Amps": 63,
            "Voltage": 400,
            "PowerKW": 43,
            "CurrentTypeID": 20,
            "Quantity": 1
        }
    ],
    "NumberOfPoints": 1,
    "GeneralComments": "App. JuicePass",
    "StatusTypeID": 50,
    "DateLastStatusUpdate": "2020-02-25T08:11:00Z",
    "DataQualityLevel": 1,
    "DateCreated": "2020-02-24T23:31:00Z",
    "SubmissionStatusTypeID": 200
}