{
    "IsRecentlyVerified": false,
    "ID": 136019,
    "UUID": "60A40520-EBA0-4796-8208-370A41D30D47",
    "DataProviderID": 18,
    "DataProvidersReference": "74398c40d0828895d4176c751a8d2c45",
    "OperatorID": 2244,
    "UsageTypeID": 5,
    "AddressInfo": {
        "ID": 136365,
        "Title": "Bowling Green Street",
        "AddressLine1": "Bowling Green Street",
        "Town": "London",
        "Postcode": "SE11 5BU",
        "CountryID": 1,
        "Latitude": 51.483913,
        "Longitude": -0.113143,
        "AccessComments": "",
        "RelatedURL": "https://www.ubitricity.com",
        "DistanceUnit": 0
    },
    "Connections": [
        {
            "ID": 190446,
            "ConnectionTypeID": 25,
            "Reference": "suby1100000057",
            "StatusTypeID": 50,
            "LevelID": 2,
            "Amps": 16,
            "Voltage": 230,
            "PowerKW": 3.7,
            "CurrentTypeID": 10
        }
    ],
    "StatusTypeID": 0,
    "DateLastStatusUpdate": "2021-04-25T05:46:00Z",
    "MetadataValues": [
        {
            "ID": 5871,
            "MetadataFieldID": 4,
            "ItemValue": "Contains public sector information licensed under the Open Government Licence v2.0. http://www.nationalarchives.gov.uk/doc/open-government-licence/version/2/"
        }
    ],
    "DataQualityLevel": 3,
    "DateCreated": "2019-12-24T05:22:00Z",
    "SubmissionStatusTypeID": 100
}