{
    "IsRecentlyVerified": false,
    "ID": 57712,
    "UUID": "F18EA1F7-C197-45BC-B11B-1243B5736FDD",
    "DataProviderID": 1,
    "OperatorID": 80,
    "UsageTypeID": 4,
    "UsageCost": "0,45 €/kW",
    "AddressInfo": {
        "ID": 58058,
        "Title": "Roma Il Milione | EnelX",
        "AddressLine1": "Via dei Verbiti angolo Viale Marco Polo",
        "Town": "Roma",
        "StateOrProvince": "RM",
        "Postcode": "00154",
        "CountryID": 112,
        "Latitude": 41.874518587742,
        "Longitude": 12.4856596156585,
        "RelatedURL": "https://www.enelx.com/it/it/emobility",
        "DistanceUnit": 0
    },
    "Connections": [
        {
            "ID": 73029,
            "ConnectionTypeID": 25,
            "StatusTypeID": 50,
            "LevelID": 2,
            "Amps": 16,
            "Voltage": 240,
            "PowerKW": 3,
            "CurrentTypeID": 10,
            "Quantity": 2
        },
        {
            "ID": 73030,
            "ConnectionTypeID": 36,
            "StatusTypeID": 50,
            "LevelID": 2,
            "Amps": 13,
            "Voltage": 240,
            "PowerKW": 3,
            "CurrentTypeID": 10,
            "Quantity": 2
        }
    ],
    "NumberOfPoints": 2,
    "GeneralComments": "Non compatibile con Renault ZOE e Smart 22kW",
    "StatusTypeID": 50,
    "DateLastStatusUpdate": "2019-11-07T16:14:00Z",
    "DataQualityLevel": 1,
    "DateCreated": "2015-12-17T16:47:00Z",
    "SubmissionStatusTypeID": 200
}