{
    "IsRecentlyVerified": false,
    "ID": 187551,
    "UUID": "8C8C0843-CDA7-47E8-B467-50A09BD4957B",
    "DataProviderID": 18,
    "DataProvidersReference": "d30b1cdd4e457e9643142c12072c30e5",
    "OperatorID": 3393,
    "UsageTypeID": 1,
    "AddressInfo": {
        "ID": 187910,
        "Title": "Southbrook Road Car Park",
        "AddressLine1": "Southbrook Road Car Park",
        "Town": "Southampton",
        "Postcode": "SO15 1AL",
        "CountryID": 1,
        "Latitude": 50.90796,
        "Longitude": -1.41483,
        "AccessComments": "",
        "RelatedURL": "http://www.joju.co.uk/",
        "DistanceUnit": 0
    },
    "Connections": [
        {
            "ID": 302714,
            "ConnectionTypeID": 25,
            "Reference": "ICUEVE900646-1",
            "StatusTypeID": 50,
            "LevelID": 2,
            "Amps": 32,
            "Voltage": 230,
            "PowerKW": 7,
            "CurrentTypeID": 10
        },
        {
            "ID": 302715,
            "ConnectionTypeID": 25,
            "Reference": "ICUEVE900646-2",
            "StatusTypeID": 50,
            "LevelID": 2,
            "Amps": 32,
            "Voltage": 230,
            "PowerKW": 7,
            "CurrentTypeID": 10
        }
    ],
    "StatusTypeID": 0,
    "DateLastStatusUpdate": "2021-07-12T03:38:00Z",
    "MetadataValues": [
        {
            "ID": 19791,
            "MetadataFieldID": 4,
            "ItemValue": "Contains public sector information licensed under the Open Government Licence v2.0. http://www.nationalarchives.gov.uk/doc/open-government-licence/version/2/"
        }
    ],
    "DataQualityLevel": 3,
    "DateCreated": "2021-07-12T03:38:00Z",
    "SubmissionStatusTypeID": 100
}