{
    "IsRecentlyVerified": false,
    "ID": 20375,
    "UUID": "AEB04960-DA8F-4429-8B3F-1FC24C2931D8",
    "DataProviderID": 1,
    "OperatorID": 56,
    "UsageTypeID": 0,
    "AddressInfo": {
        "ID": 20720,
        "Title": " AutoBleue Garnier",
        "AddressLine1": "28 Boulevard Joseph Garnier",
        "Town": "Nice",
        "Postcode": "06000",
        "CountryID": 80,
        "Latitude": 43.71027,
        "Longitude": 7.25815,
        "AccessComments": "Réservé aux clients de l'établissement",
        "DistanceUnit": 0
    },
    "Connections": [],
    "StatusTypeID": 50,
    "DateLastStatusUpdate": "2017-01-08T19:03:00Z",
    "DataQualityLevel": 1,
    "DateCreated": "2013-11-13T11:36:00Z",
    "SubmissionStatusTypeID": 200
}