{
    "IsRecentlyVerified": false,
    "ID": 148938,
    "UUID": "9E8E2B27-BA65-4839-8E44-B4199BD1898F",
    "DataProviderID": 1,
    "OperatorID": 1,
    "UsageTypeID": 1,
    "UsageCost": "0",
    "AddressInfo": {
        "ID": 149291,
        "Title": "Mercadona Los Molinos Getafe",
        "AddressLine1": "Avenida Sancho Panza s/n",
        "Town": "Getafe",
        "StateOrProvince": "Madrid",
        "Postcode": "2806",
        "CountryID": 210,
        "Latitude": 40.31769961744237,
        "Longitude": -3.7068955990271206,
        "DistanceUnit": 0
    },
    "Connections": [
        {
            "ID": 206821,
            "ConnectionTypeID": 25,
            "StatusTypeID": 50,
            "LevelID": 2,
            "Amps": 32,
            "Voltage": 230,
            "PowerKW": 7.4,
            "CurrentTypeID": 10,
            "Quantity": 4
        }
    ],
    "NumberOfPoints": 4,
    "GeneralComments": "for supermarket clients",
    "StatusTypeID": 50,
    "DateLastStatusUpdate": "2020-02-13T13:48:00Z",
    "DataQualityLevel": 1,
    "DateCreated": "2020-02-13T13:13:00Z",
    "SubmissionStatusTypeID": 200
}