{
    "IsRecentlyVerified": false,
    "ID": 110281,
    "UUID": "3EBAD27F-45EE-40DC-8E43-5573AB9FA723",
    "DataProviderID": 2,
    "DataProvidersReference": "102676",
    "OperatorID": 5,
    "UsageTypeID": 1,
    "AddressInfo": {
        "ID": 110627,
        "Title": "NV ENERGY",
        "AddressLine1": "4996 W Warm Springs Rd",
        "Town": "Las Vegas",
        "StateOrProvince": "NV",
        "Postcode": "89118",
        "CountryID": 2,
        "Latitude": 36.0574413,
        "Longitude": -115.219524,
        "ContactTelephone1": "888-758-4389",
        "AccessComments": "24 hours daily",
        "RelatedURL": "http://www.chargepoint.com/",
        "DistanceUnit": 0
    },
    "Connections": [
        {
            "ID": 155520,
            "ConnectionTypeID": 1,
            "LevelID": 2,
            "Amps": 16,
            "Voltage": 230,
            "PowerKW": 3,
            "CurrentTypeID": 10,
            "Quantity": 1
        }
    ],
    "DateLastStatusUpdate": "2019-04-06T04:02:00Z",
    "DataQualityLevel": 3,
    "DateCreated": "2018-10-18T23:36:00Z",
    "SubmissionStatusTypeID": 100
}