{
    "IsRecentlyVerified": false,
    "ID": 29334,
    "UUID": "4FA49D9D-22D1-4103-8CA9-2FF2B983E992",
    "DataProviderID": 2,
    "DataProvidersReference": "63088",
    "OperatorID": 5,
    "UsageTypeID": 1,
    "AddressInfo": {
        "ID": 29680,
        "Title": "LCC",
        "AddressLine1": "1810 Maple Street",
        "Town": "Longview",
        "StateOrProvince": "WA",
        "Postcode": "98632",
        "CountryID": 2,
        "Latitude": 46.1419219,
        "Longitude": -122.9401915,
        "ContactTelephone1": "888-758-4389",
        "AccessComments": "24 hours daily",
        "RelatedURL": "http://www.chargepoint.com/",
        "DistanceUnit": 0
    },
    "Connections": [
        {
            "ID": 32254,
            "ConnectionTypeID": 1,
            "LevelID": 2,
            "Amps": 16,
            "Voltage": 230,
            "PowerKW": 3.7,
            "CurrentTypeID": 10,
            "Quantity": 2
        }
    ],
    "DateLastStatusUpdate": "2020-06-26T03:10:00Z",
    "DataQualityLevel": 3,
    "DateCreated": "2014-11-28T03:39:00Z",
    "SubmissionStatusTypeID": 100
}