{
    "IsRecentlyVerified": false,
    "ID": 97911,
    "UUID": "3A213076-6893-4E33-8F79-13FE5D9A59F6",
    "DataProviderID": 1,
    "OperatorID": 23,
    "OperatorsReference": "38824",
    "UsageTypeID": 4,
    "AddressInfo": {
        "ID": 98257,
        "Title": "Hotel Dolomitenhof",
        "AddressLine1": "Via Val Fiscalina",
        "Town": "33",
        "StateOrProvince": "Sexten",
        "Postcode": "39030",
        "CountryID": 112,
        "Latitude": 46.665921,
        "Longitude": 12.353872,
        "ContactTelephone1": "+39 04 747 13000",
        "DistanceUnit": 0
    },
    "Connections": [
        {
            "ID": 138819,
            "ConnectionTypeID": 30,
            "StatusTypeID": 50,
            "LevelID": 2,
            "Amps": 16,
            "Voltage": 400,
            "PowerKW": 11,
            "CurrentTypeID": 20,
            "Quantity": 2
        }
    ],
    "NumberOfPoints": 2,
    "GeneralComments": "2 Tesla Connectors, up to 11kW.Available for customers. Please call ahead.",
    "StatusTypeID": 50,
    "DateLastStatusUpdate": "2018-10-03T22:09:00Z",
    "DataQualityLevel": 1,
    "DateCreated": "2018-01-21T16:58:00Z",
    "SubmissionStatusTypeID": 200
}