{
    "IsRecentlyVerified": false,
    "ID": 160386,
    "UUID": "51436AEA-0E35-4EEE-9D68-219B499C67B8",
    "DataProviderID": 2,
    "DataProvidersReference": "158187",
    "UsageTypeID": 2,
    "AddressInfo": {
        "ID": 160743,
        "Title": "Hydro-Québec",
        "AddressLine1": "2950 boul. St-Charles",
        "Town": "Montreal",
        "StateOrProvince": "QC",
        "Postcode": "H4R 2E4",
        "CountryID": 44,
        "Latitude": 45.5130733,
        "Longitude": -73.726228,
        "ContactTelephone1": "",
        "AccessComments": "",
        "RelatedURL": "",
        "DistanceUnit": 0
    },
    "Connections": [
        {
            "ID": 230768,
            "ConnectionTypeID": 2,
            "LevelID": 3,
            "Amps": 100,
            "Voltage": 400,
            "PowerKW": 40,
            "CurrentTypeID": 30,
            "Quantity": 1
        },
        {
            "ID": 230769,
            "ConnectionTypeID": 32,
            "LevelID": 3,
            "Amps": 100,
            "Voltage": 400,
            "PowerKW": 40,
            "CurrentTypeID": 30,
            "Quantity": 1
        }
    ],
    "GeneralComments": "Planned for future date. Not Operational.",
    "DatePlanned": "2020-09-01T00:00:00Z",
    "StatusTypeID": 150,
    "DateLastStatusUpdate": "2020-06-26T03:09:00Z",
    "DataQualityLevel": 3,
    "DateCreated": "2020-06-26T03:09:00Z",
    "SubmissionStatusTypeID": 100
}