{
    "IsRecentlyVerified": false,
    "ID": 122034,
    "UUID": "F21BA3CE-35EE-4744-B2A0-82B8D68C0FF0",
    "DataProviderID": 2,
    "DataProvidersReference": "53071",
    "OperatorID": 5,
    "UsageTypeID": 1,
    "AddressInfo": {
        "ID": 122380,
        "Title": "UCR",
        "AddressLine1": "900 University Ave",
        "Town": "Riverside",
        "StateOrProvince": "CA",
        "Postcode": "92507",
        "CountryID": 2,
        "Latitude": 33.975213,
        "Longitude": -117.332551,
        "ContactTelephone1": "888-758-4389",
        "AccessComments": "24 hours daily",
        "RelatedURL": "http://www.chargepoint.com/",
        "DistanceUnit": 0
    },
    "Connections": [
        {
            "ID": 171885,
            "ConnectionTypeID": 1,
            "LevelID": 2,
            "Amps": 16,
            "Voltage": 230,
            "PowerKW": 3,
            "CurrentTypeID": 10,
            "Quantity": 6
        }
    ],
    "DateLastStatusUpdate": "2019-12-24T09:11:00Z",
    "DataQualityLevel": 3,
    "DateCreated": "2019-04-06T05:02:00Z",
    "SubmissionStatusTypeID": 100
}