{
    "IsRecentlyVerified": false,
    "ID": 64113,
    "UUID": "02F9F6EB-91EC-430B-9E60-49AB0FDAF43A",
    "DataProviderID": 26,
    "DataProvidersReference": "77974",
    "OperatorID": 73,
    "OperatorsReference": "EV-Box EVB-P1414013",
    "UsageCost": "0.00 jaarabonnement",
    "AddressInfo": {
        "ID": 64459,
        "Title": "Menisweg 21",
        "AddressLine1": "Menisweg 21",
        "Town": "Schagen",
        "Postcode": "1742 NJ",
        "CountryID": 159,
        "Latitude": 52.78253,
        "Longitude": 4.77997,
        "RelatedURL": "http://www.ev-box.nl",
        "DistanceUnit": 0
    },
    "Connections": [
        {
            "ID": 82003,
            "ConnectionTypeID": 25,
            "LevelID": 2,
            "PowerKW": 11,
            "CurrentTypeID": 10
        }
    ],
    "NumberOfPoints": 1,
    "StatusTypeID": 50,
    "DateLastStatusUpdate": "2016-06-04T02:55:00Z",
    "DataQualityLevel": 3,
    "DateCreated": "2016-03-03T12:33:00Z",
    "SubmissionStatusTypeID": 100
}