{
    "IsRecentlyVerified": false,
    "ID": 36400,
    "UUID": "D9E665C7-6866-41DA-8B58-BD01401EBE9D",
    "DataProviderID": 26,
    "DataProvidersReference": "47209",
    "OperatorID": 178,
    "OperatorsReference": "EVnetNL AL360",
    "UsageCost": "0.00 jaarabonnement",
    "AddressInfo": {
        "ID": 36746,
        "Title": "Julianalaan 2",
        "AddressLine1": "Julianalaan 2",
        "Town": "Nieuwkoop",
        "Postcode": "2421 CW",
        "CountryID": 159,
        "Latitude": 52.155204,
        "Longitude": 4.786111,
        "ContactTelephone1": "0800-3522365",
        "RelatedURL": "http://www.evnet.nl",
        "DistanceUnit": 0
    },
    "Connections": [
        {
            "ID": 39911,
            "ConnectionTypeID": 25,
            "LevelID": 2,
            "PowerKW": 11,
            "CurrentTypeID": 10
        }
    ],
    "NumberOfPoints": 2,
    "StatusTypeID": 50,
    "DateLastStatusUpdate": "2016-06-04T02:51:00Z",
    "DataQualityLevel": 3,
    "DateCreated": "2015-01-09T06:05:00Z",
    "SubmissionStatusTypeID": 100
}