{
    "IsRecentlyVerified": false,
    "ID": 160575,
    "UUID": "4BB39A4B-9DCB-4B4B-BF92-0A54F0C7EECA",
    "DataProviderID": 1,
    "OperatorID": 5,
    "UsageTypeID": 4,
    "UsageCost": "$15/hour",
    "AddressInfo": {
        "ID": 160932,
        "Title": "Irving Oil Port Aux Basques",
        "AddressLine1": "3 High Street",
        "Town": "Channel-Port aux Basques",
        "StateOrProvince": "NL",
        "Postcode": "A0M 1C0",
        "CountryID": 44,
        "Latitude": 47.5900956,
        "Longitude": -59.1619438,
        "ContactTelephone1": "",
        "AccessComments": "",
        "RelatedURL": "",
        "DistanceUnit": 0
    },
    "Connections": [
        {
            "ID": 231049,
            "ConnectionTypeID": 2,
            "StatusTypeID": 50,
            "LevelID": 3,
            "Amps": 156,
            "Voltage": 400,
            "PowerKW": 62.5,
            "CurrentTypeID": 30,
            "Quantity": 1
        },
        {
            "ID": 231050,
            "ConnectionTypeID": 32,
            "StatusTypeID": 50,
            "LevelID": 3,
            "Amps": 156,
            "Voltage": 400,
            "PowerKW": 62.5,
            "CurrentTypeID": 30,
            "Quantity": 1
        },
        {
            "ID": 305939,
            "ConnectionTypeID": 1,
            "StatusTypeID": 50,
            "LevelID": 2,
            "Amps": 32,
            "Voltage": 240,
            "PowerKW": 7,
            "CurrentTypeID": 10,
            "Quantity": 1
        }
    ],
    "NumberOfPoints": 2,
    "GeneralComments": "",
    "DatePlanned": "2020-09-01T00:00:00Z",
    "StatusTypeID": 50,
    "DateLastStatusUpdate": "2021-09-14T13:39:00Z",
    "DataQualityLevel": 3,
    "DateCreated": "2020-06-26T03:11:00Z",
    "SubmissionStatusTypeID": 100
}