{
    "IsRecentlyVerified": false,
    "ID": 122637,
    "UUID": "CFFEE2DB-F871-46CE-85F3-4805AA2A5F81",
    "DataProviderID": 2,
    "DataProvidersReference": "103805",
    "UsageTypeID": 2,
    "AddressInfo": {
        "ID": 122983,
        "Title": "LADWP - West Valley District",
        "AddressLine1": "18144 Devonshire St",
        "Town": "Northridge",
        "StateOrProvince": "CA",
        "Postcode": "91325",
        "CountryID": 2,
        "Latitude": 34.25707,
        "Longitude": -118.529347,
        "ContactTelephone1": "",
        "AccessComments": "Fleet use only",
        "RelatedURL": "",
        "DistanceUnit": 0
    },
    "Connections": [
        {
            "ID": 172542,
            "ConnectionTypeID": 1,
            "LevelID": 2,
            "Amps": 16,
            "Voltage": 230,
            "PowerKW": 3.7,
            "CurrentTypeID": 10,
            "Quantity": 4
        }
    ],
    "DateLastStatusUpdate": "2020-06-26T02:57:00Z",
    "DataQualityLevel": 3,
    "DateCreated": "2019-04-06T05:03:00Z",
    "SubmissionStatusTypeID": 100
}