{
    "UserComments": [
        {
            "ID": 17722,
            "ChargePointID": 93096,
            "CommentTypeID": 10,
            "UserName": "ForumElettrico.it",
            "DateCreated": "2017-09-19T05:14:23.83Z",
            "User": {
                "ID": 11749,
                "Username": "ForumElettrico.it"
            },
            "CheckinStatusTypeID": 10
        }
    ],
    "MediaItems": [
        {
            "ID": 13318,
            "ChargePointID": 93096,
            "ItemURL": "https://s3-ap-southeast-2.amazonaws.com/openchargemap/images/IT/OCM93096/OCM-93096.orig.2017091905135957.jpg",
            "ItemThumbnailURL": "https://s3-ap-southeast-2.amazonaws.com/openchargemap/images/IT/OCM93096/OCM-93096.thmb.2017091905135957.jpg",
            "Comment": "",
            "IsEnabled": true,
            "IsVideo": false,
            "IsFeaturedItem": false,
            "IsExternalResource": false,
            "User": {
                "ID": 11749,
                "Username": "ForumElettrico.it"
            },
            "DateCreated": "2017-09-19T05:14:00Z"
        }
    ],
    "IsRecentlyVerified": false,
    "ID": 93096,
    "UUID": "72B234A7-0E57-47BF-BE05-BE79AFAEB40A",
    "DataProviderID": 1,
    "OperatorID": 1,
    "UsageTypeID": 0,
    "UsageCost": "Free",
    "AddressInfo": {
        "ID": 93442,
        "Title": "Piazza Unità ",
        "AddressLine1": "Via C. Franceschin",
        "StateOrProvince": "Castelnovo ne’ Monti",
        "CountryID": 112,
        "Latitude": 44.435745,
        "Longitude": 10.400072,
        "RelatedURL": "https://www.enduroelettrico.it/2017/09/13/piazza-unita-castelnovo-ne-monti/",
        "DistanceUnit": 0
    },
    "Connections": [
        {
            "ID": 131873,
            "ConnectionTypeID": 17,
            "StatusTypeID": 50,
            "LevelID": 2,
            "Amps": 16,
            "Voltage": 230,
            "PowerKW": 3.7,
            "CurrentTypeID": 10,
            "Quantity": 5
        }
    ],
    "NumberOfPoints": 1,
    "StatusTypeID": 50,
    "DateLastStatusUpdate": "2017-09-19T05:14:00Z",
    "DataQualityLevel": 1,
    "DateCreated": "2017-09-18T00:16:00Z",
    "SubmissionStatusTypeID": 200
}