{
    "IsRecentlyVerified": false,
    "ID": 52572,
    "UUID": "66A4B2B5-C69A-4F1E-A66B-5DCA9736CEDC",
    "DataProviderID": 1,
    "OperatorID": 1,
    "UsageTypeID": 4,
    "AddressInfo": {
        "ID": 52918,
        "Title": "Es Pujols",
        "AddressLine1": "Av de Miramar, 74",
        "Town": "Es Pujols",
        "StateOrProvince": "Islas Baleares",
        "Postcode": "07871",
        "CountryID": 210,
        "Latitude": 38.722631,
        "Longitude": 1.45718,
        "ContactTelephone1": "+34 97321210",
        "ContactEmail": "turisme@formentera.es",
        "AccessComments": "Tarjeta de acceso",
        "DistanceUnit": 0
    },
    "Connections": [
        {
            "ID": 65295,
            "ConnectionTypeID": 28,
            "StatusTypeID": 0,
            "LevelID": 2,
            "Amps": 16,
            "Voltage": 230,
            "PowerKW": 3.4,
            "Quantity": 2
        }
    ],
    "NumberOfPoints": 2,
    "StatusTypeID": 0,
    "DateLastStatusUpdate": "2016-02-14T13:57:00Z",
    "DataQualityLevel": 1,
    "DateCreated": "2015-09-03T12:15:00Z",
    "SubmissionStatusTypeID": 200
}