{
    "IsRecentlyVerified": false,
    "ID": 29192,
    "UUID": "3A8F0673-6551-4F53-A23E-F5EA6C51F79E",
    "DataProviderID": 2,
    "DataProvidersReference": "62531",
    "OperatorID": 5,
    "UsageTypeID": 1,
    "AddressInfo": {
        "ID": 29538,
        "Title": "TRAVERSE BMW",
        "AddressLine1": "2801 US-31",
        "Town": "Traverse City",
        "StateOrProvince": "MI",
        "Postcode": "49684",
        "CountryID": 2,
        "Latitude": 44.7274952,
        "Longitude": -85.6468187,
        "ContactTelephone1": "888-758-4389",
        "AccessComments": "24 hours daily",
        "RelatedURL": "http://www.chargepoint.com/",
        "DistanceUnit": 0
    },
    "Connections": [
        {
            "ID": 32083,
            "ConnectionTypeID": 1,
            "LevelID": 2,
            "Amps": 16,
            "Voltage": 230,
            "PowerKW": 3.7,
            "CurrentTypeID": 10,
            "Quantity": 1
        }
    ],
    "DateLastStatusUpdate": "2020-06-26T03:08:00Z",
    "DataQualityLevel": 3,
    "DateCreated": "2014-11-28T03:39:00Z",
    "SubmissionStatusTypeID": 100
}