{
    "MediaItems": [
        {
            "ID": 17112,
            "ChargePointID": 107654,
            "ItemURL": "https://s3-ap-southeast-2.amazonaws.com/openchargemap/images/GB/OCM107654/OCM-107654.orig.2018112822282088.jpeg",
            "ItemThumbnailURL": "https://s3-ap-southeast-2.amazonaws.com/openchargemap/images/GB/OCM107654/OCM-107654.thmb.2018112822282088.jpeg",
            "Comment": "8 bays coned to dissuade ICEing. Free. You can see elephants for nothing too!",
            "IsEnabled": true,
            "IsVideo": false,
            "IsFeaturedItem": false,
            "IsExternalResource": false,
            "User": {
                "ID": 19434,
                "Username": "Clwydian"
            },
            "DateCreated": "2018-11-28T22:29:00Z"
        }
    ],
    "IsRecentlyVerified": false,
    "ID": 107654,
    "UUID": "0A4254C0-651B-4533-8C7E-06FDFAD62B96",
    "DataProviderID": 1,
    "OperatorID": 3,
    "OperatorsReference": "PG-81932..PG-81935",
    "UsageTypeID": 4,
    "UsageCost": "£3.00/session",
    "AddressInfo": {
        "ID": 108000,
        "Title": "Chester Zoo",
        "AddressLine1": "Moston Road",
        "Town": "Chester",
        "StateOrProvince": "Cheshire",
        "Postcode": "CH2 1EU",
        "CountryID": 1,
        "Latitude": 53.2278774290065,
        "Longitude": -2.8850441292343,
        "ContactTelephone1": "01244 380280",
        "AccessComments": "Follow signs for taxi/drop off (ask staff for directions on entering the site)",
        "RelatedURL": "https://www.chesterzoo.org/plan-your-visit/how-to-get-here/road",
        "DistanceUnit": 0
    },
    "Connections": [
        {
            "ID": 151992,
            "ConnectionTypeID": 25,
            "StatusTypeID": 50,
            "LevelID": 2,
            "Amps": 32,
            "Voltage": 230,
            "PowerKW": 7,
            "CurrentTypeID": 10,
            "Quantity": 13
        }
    ],
    "NumberOfPoints": 26,
    "GeneralComments": "Pod Point app required to start charge",
    "StatusTypeID": 50,
    "DateLastStatusUpdate": "2021-07-25T10:14:00Z",
    "DataQualityLevel": 1,
    "DateCreated": "2018-08-05T15:47:00Z",
    "SubmissionStatusTypeID": 200
}