{
    "IsRecentlyVerified": false,
    "ID": 38937,
    "UUID": "67A43FFB-AE38-4544-8D8D-4263471BAECB",
    "DataProviderID": 1,
    "OperatorID": 48,
    "OperatorsReference": "Essent EM-DE-03401000-01-00001",
    "UsageTypeID": 0,
    "UsageCost": "",
    "AddressInfo": {
        "ID": 39283,
        "Title": "ADAC Servicecenter",
        "AddressLine1": "Reinersweg 34",
        "AddressLine2": "",
        "Town": "Delmenhorst",
        "StateOrProvince": "",
        "Postcode": "27751",
        "CountryID": 87,
        "Latitude": 53.036667,
        "Longitude": 8.672222,
        "ContactTelephone1": "",
        "ContactTelephone2": "",
        "ContactEmail": "",
        "AccessComments": "Während der Geschäftszeiten (Mo-Do 9-17, Fr 9-16Uhr) für alle kostenloses Laden nach \"Laut geben\" an der Info, ggf. Link auf Webseite zeigen. Sonst nur mit RWE eMobility Zugang oder Roamingpartner PlugSurfing App, LübbeckeStrom eMobil, BEW, ChargeNow etc. Viele Märkte in der Nähe.",
        "RelatedURL": "http://cdn.ecomento.tv/wp-content/uploads/2015/01/ADAC-Elektroauto-laden-kostenlos-Karte.jpg",
        "DistanceUnit": 0
    },
    "Connections": [
        {
            "ID": 42448,
            "ConnectionTypeID": 25,
            "StatusTypeID": 50,
            "LevelID": 2,
            "PowerKW": 11,
            "CurrentTypeID": 20,
            "Quantity": 1
        },
        {
            "ID": 49815,
            "ConnectionTypeID": 25,
            "StatusTypeID": 50,
            "LevelID": 2,
            "PowerKW": 22,
            "CurrentTypeID": 20,
            "Quantity": 1
        }
    ],
    "NumberOfPoints": 1,
    "GeneralComments": "",
    "StatusTypeID": 50,
    "DateLastStatusUpdate": "2015-05-19T20:57:00Z",
    "DataQualityLevel": 3,
    "DateCreated": "2015-01-09T06:08:00Z",
    "SubmissionStatusTypeID": 100
}