{
    "IsRecentlyVerified": false,
    "ID": 116862,
    "UUID": "A965C2B4-4810-43D0-9D63-6A4FEC0E2BCC",
    "DataProviderID": 1,
    "OperatorID": 3315,
    "OperatorsReference": "51559",
    "UsageTypeID": 4,
    "UsageCost": "Free",
    "AddressInfo": {
        "ID": 117208,
        "Title": "Sportscotland National Training Centre Inverclyde",
        "AddressLine1": "Inverclyde National Centre",
        "Town": "Burnside Road",
        "StateOrProvince": "Largs",
        "Postcode": "KA30 8RW",
        "CountryID": 1,
        "Latitude": 55.80297,
        "Longitude": -4.84906,
        "DistanceUnit": 0
    },
    "Connections": [
        {
            "ID": 165432,
            "ConnectionTypeID": 25,
            "StatusTypeID": 50,
            "LevelID": 2,
            "Amps": 32,
            "Voltage": 400,
            "PowerKW": 22,
            "CurrentTypeID": 20,
            "Quantity": 2
        },
        {
            "ID": 176536,
            "ConnectionTypeID": 2,
            "StatusTypeID": 50,
            "LevelID": 3,
            "PowerKW": 50,
            "CurrentTypeID": 30,
            "Quantity": 1
        },
        {
            "ID": 176537,
            "ConnectionTypeID": 33,
            "StatusTypeID": 50,
            "LevelID": 3,
            "PowerKW": 50,
            "CurrentTypeID": 30,
            "Quantity": 1
        },
        {
            "ID": 186721,
            "ConnectionTypeID": 1036,
            "StatusTypeID": 50,
            "LevelID": 3,
            "PowerKW": 43,
            "CurrentTypeID": 20,
            "Quantity": 1
        }
    ],
    "NumberOfPoints": 2,
    "StatusTypeID": 50,
    "DateLastStatusUpdate": "2020-06-01T05:14:00Z",
    "DataQualityLevel": 1,
    "DateCreated": "2019-02-13T06:24:00Z",
    "SubmissionStatusTypeID": 200
}