{
    "UserComments": [
        {
            "ID": 20629,
            "ChargePointID": 92436,
            "CommentTypeID": 10,
            "UserName": "Evbility",
            "Comment": "Buongiorno in riferimento al commento precedente di @polianto: si ringrazia per il giudizio positivo di utilizzo. Unica precisazione: il Rfid è quello in uso agli utenti del sito ricaricaev.it dove sono inserite anche le UNDICI colonnine di Evbility. Buona ricarica GRATUITA a Rivolta d'Adda, grazie agli sponsor di EVBILITY, di questa stazione, visibili al link https://evbility.net/stazioni-di-ricarica/rivolta-dadda",
            "Rating": 5,
            "RelatedURL": "https://evbility.net/",
            "DateCreated": "2019-01-13T16:19:10.533Z",
            "User": {
                "ID": 9062,
                "Username": "Evbility"
            },
            "CheckinStatusTypeID": 140
        },
        {
            "ID": 19545,
            "ChargePointID": 92436,
            "CommentTypeID": 10,
            "UserName": "polianto",
            "Comment": "Tutto bene, attivata con rfid Class Onlus\r\nhttps://www.forumelettrico.it/forum/colonnina-evibility-22kw-ac-rivolta-d-adda-cr-t2779.html",
            "Rating": 5,
            "RelatedURL": "https://www.forumelettrico.it/forum/colonnina-evibility-22kw-ac-rivolta-d-adda-cr-t2779.html",
            "DateCreated": "2018-05-12T19:25:18.577Z",
            "User": {
                "ID": 1606,
                "Username": "polianto"
            },
            "CheckinStatusTypeID": 10
        }
    ],
    "MediaItems": [
        {
            "ID": 29353,
            "ChargePointID": 92436,
            "ItemURL": "https://s3-ap-southeast-2.amazonaws.com/openchargemap/images/IT/OCM92436/OCM-92436.orig.2021092610071597.jpg",
            "ItemThumbnailURL": "https://s3-ap-southeast-2.amazonaws.com/openchargemap/images/IT/OCM92436/OCM-92436.thmb.2021092610071597.jpg",
            "Comment": "IMG-20210909-WA0004 Rivolta vw id4 front e colonnina",
            "IsEnabled": true,
            "IsVideo": false,
            "IsFeaturedItem": false,
            "IsExternalResource": false,
            "User": {
                "ID": 9062,
                "Username": "Evbility"
            },
            "DateCreated": "2021-09-26T10:07:00Z"
        },
        {
            "ID": 27812,
            "ChargePointID": 92436,
            "ItemURL": "https://s3-ap-southeast-2.amazonaws.com/openchargemap/images/IT/OCM92436/OCM-92436.orig.2021052210480156.jpg",
            "ItemThumbnailURL": "https://s3-ap-southeast-2.amazonaws.com/openchargemap/images/IT/OCM92436/OCM-92436.thmb.2021052210480156.jpg",
            "Comment": "IMG_20201004_182809 Rivolta Tesla bca lat st rit sist ww",
            "IsEnabled": true,
            "IsVideo": false,
            "IsFeaturedItem": false,
            "IsExternalResource": false,
            "User": {
                "ID": 9062,
                "Username": "Evbility"
            },
            "DateCreated": "2021-05-22T10:48:00Z"
        },
        {
            "ID": 25670,
            "ChargePointID": 92436,
            "ItemURL": "https://s3-ap-southeast-2.amazonaws.com/openchargemap/images/IT/OCM92436/OCM-92436.orig.2020120314360738.jpg",
            "ItemThumbnailURL": "https://s3-ap-southeast-2.amazonaws.com/openchargemap/images/IT/OCM92436/OCM-92436.thmb.2020120314360738.jpg",
            "Comment": "20201022 fb_Grioni Rivolta Evbility id3 w",
            "IsEnabled": true,
            "IsVideo": false,
            "IsFeaturedItem": false,
            "IsExternalResource": false,
            "User": {
                "ID": 9062,
                "Username": "Evbility"
            },
            "DateCreated": "2020-12-03T14:36:00Z"
        },
        {
            "ID": 22257,
            "ChargePointID": 92436,
            "ItemURL": "https://s3-ap-southeast-2.amazonaws.com/openchargemap/images/IT/OCM92436/OCM-92436.orig.2020051009502788.jpg",
            "ItemThumbnailURL": "https://s3-ap-southeast-2.amazonaws.com/openchargemap/images/IT/OCM92436/OCM-92436.thmb.2020051009502788.jpg",
            "Comment": "Inked20200208_122652_LI Rivolta eNV200 e BMWi3 w m",
            "IsEnabled": true,
            "IsVideo": false,
            "IsFeaturedItem": false,
            "IsExternalResource": false,
            "User": {
                "ID": 9062,
                "Username": "Evbility"
            },
            "DateCreated": "2020-05-10T09:51:00Z"
        },
        {
            "ID": 22258,
            "ChargePointID": 92436,
            "ItemURL": "https://s3-ap-southeast-2.amazonaws.com/openchargemap/images/IT/OCM92436/OCM-92436.orig.2020051009510590.jpg",
            "ItemThumbnailURL": "https://s3-ap-southeast-2.amazonaws.com/openchargemap/images/IT/OCM92436/OCM-92436.thmb.2020051009510590.jpg",
            "Comment": "20200327 (1) Rivolta Tesla lat w",
            "IsEnabled": true,
            "IsVideo": false,
            "IsFeaturedItem": false,
            "IsExternalResource": false,
            "User": {
                "ID": 9062,
                "Username": "Evbility"
            },
            "DateCreated": "2020-05-10T09:51:00Z"
        },
        {
            "ID": 21419,
            "ChargePointID": 92436,
            "ItemURL": "https://s3-ap-southeast-2.amazonaws.com/openchargemap/images/IT/OCM92436/OCM-92436.orig.2020030117515316.jpg",
            "ItemThumbnailURL": "https://s3-ap-southeast-2.amazonaws.com/openchargemap/images/IT/OCM92436/OCM-92436.thmb.2020030117515316.jpg",
            "Comment": "facebook_121219 Rivolta Paolo Mercedes classeB w",
            "IsEnabled": true,
            "IsVideo": false,
            "IsFeaturedItem": false,
            "IsExternalResource": false,
            "User": {
                "ID": 9062,
                "Username": "Evbility"
            },
            "DateCreated": "2020-03-01T17:52:00Z"
        },
        {
            "ID": 21418,
            "ChargePointID": 92436,
            "ItemURL": "https://s3-ap-southeast-2.amazonaws.com/openchargemap/images/IT/OCM92436/OCM-92436.orig.2020030117491825.jpg",
            "ItemThumbnailURL": "https://s3-ap-southeast-2.amazonaws.com/openchargemap/images/IT/OCM92436/OCM-92436.thmb.2020030117491825.jpg",
            "Comment": "facebook_103019 Rivolta Tesla Luca w",
            "IsEnabled": true,
            "IsVideo": false,
            "IsFeaturedItem": false,
            "IsExternalResource": false,
            "User": {
                "ID": 9062,
                "Username": "Evbility"
            },
            "DateCreated": "2020-03-01T17:49:00Z"
        },
        {
            "ID": 19450,
            "ChargePointID": 92436,
            "ItemURL": "https://s3-ap-southeast-2.amazonaws.com/openchargemap/images/IT/OCM92436/OCM-92436.orig.2019090219545571.png",
            "ItemThumbnailURL": "https://s3-ap-southeast-2.amazonaws.com/openchargemap/images/IT/OCM92436/OCM-92436.thmb.2019090219545571.png",
            "Comment": "Rivolta d'Adda Grioni eGolf 140819",
            "IsEnabled": true,
            "IsVideo": false,
            "IsFeaturedItem": false,
            "IsExternalResource": false,
            "User": {
                "ID": 9062,
                "Username": "Evbility"
            },
            "DateCreated": "2019-09-02T19:55:00Z"
        },
        {
            "ID": 18604,
            "ChargePointID": 92436,
            "ItemURL": "https://s3-ap-southeast-2.amazonaws.com/openchargemap/images/IT/OCM92436/OCM-92436.orig.2019060819333163.jpg",
            "ItemThumbnailURL": "https://s3-ap-southeast-2.amazonaws.com/openchargemap/images/IT/OCM92436/OCM-92436.thmb.2019060819333163.jpg",
            "Comment": "Inked20190306_121243(0)_LI Rivolta Tesla e van La Floriade w",
            "IsEnabled": true,
            "IsVideo": false,
            "IsFeaturedItem": false,
            "IsExternalResource": false,
            "User": {
                "ID": 9062,
                "Username": "Evbility"
            },
            "DateCreated": "2019-06-08T19:34:00Z"
        },
        {
            "ID": 18601,
            "ChargePointID": 92436,
            "ItemURL": "https://s3-ap-southeast-2.amazonaws.com/openchargemap/images/IT/OCM92436/OCM-92436.orig.2019060819242782.jpg",
            "ItemThumbnailURL": "https://s3-ap-southeast-2.amazonaws.com/openchargemap/images/IT/OCM92436/OCM-92436.thmb.2019060819242782.jpg",
            "Comment": "IMG_20190504_165251 Rivolta d Adda BMW i3ss w",
            "IsEnabled": true,
            "IsVideo": false,
            "IsFeaturedItem": false,
            "IsExternalResource": false,
            "User": {
                "ID": 9062,
                "Username": "Evbility"
            },
            "DateCreated": "2019-06-08T19:25:00Z"
        },
        {
            "ID": 18242,
            "ChargePointID": 92436,
            "ItemURL": "https://s3-ap-southeast-2.amazonaws.com/openchargemap/images/IT/OCM92436/OCM-92436.orig.2019050219091884.jpg",
            "ItemThumbnailURL": "https://s3-ap-southeast-2.amazonaws.com/openchargemap/images/IT/OCM92436/OCM-92436.thmb.2019050219091884.jpg",
            "Comment": "030319 Rivolta Garabugi Zoe_n w",
            "IsEnabled": true,
            "IsVideo": false,
            "IsFeaturedItem": false,
            "IsExternalResource": false,
            "User": {
                "ID": 9062,
                "Username": "Evbility"
            },
            "DateCreated": "2019-05-02T19:09:00Z"
        },
        {
            "ID": 17414,
            "ChargePointID": 92436,
            "ItemURL": "https://s3-ap-southeast-2.amazonaws.com/openchargemap/images/IT/OCM92436/OCM-92436.orig.2019011316231621.jpg",
            "ItemThumbnailURL": "https://s3-ap-southeast-2.amazonaws.com/openchargemap/images/IT/OCM92436/OCM-92436.thmb.2019011316231621.jpg",
            "Comment": "100618 Rivolta Smart Flavio st w rit rit",
            "IsEnabled": true,
            "IsVideo": false,
            "IsFeaturedItem": false,
            "IsExternalResource": false,
            "User": {
                "ID": 9062,
                "Username": "Evbility"
            },
            "DateCreated": "2019-01-13T16:23:00Z"
        },
        {
            "ID": 17103,
            "ChargePointID": 92436,
            "ItemURL": "https://s3-ap-southeast-2.amazonaws.com/openchargemap/images/IT/OCM92436/OCM-92436.orig.2018112620523400.jpg",
            "ItemThumbnailURL": "https://s3-ap-southeast-2.amazonaws.com/openchargemap/images/IT/OCM92436/OCM-92436.thmb.2018112620523400.jpg",
            "Comment": "092918 Rivolta Golf lat_n w",
            "IsEnabled": true,
            "IsVideo": false,
            "IsFeaturedItem": false,
            "IsExternalResource": false,
            "User": {
                "ID": 9062,
                "Username": "Evbility"
            },
            "DateCreated": "2018-11-26T20:53:00Z"
        },
        {
            "ID": 15458,
            "ChargePointID": 92436,
            "ItemURL": "https://s3-ap-southeast-2.amazonaws.com/openchargemap/images/IT/OCM92436/OCM-92436.orig.2018051219243175.jpg",
            "ItemThumbnailURL": "https://s3-ap-southeast-2.amazonaws.com/openchargemap/images/IT/OCM92436/OCM-92436.thmb.2018051219243175.jpg",
            "Comment": "",
            "IsEnabled": true,
            "IsVideo": false,
            "IsFeaturedItem": false,
            "IsExternalResource": false,
            "User": {
                "ID": 1606,
                "Username": "polianto"
            },
            "DateCreated": "2018-05-12T19:25:00Z"
        },
        {
            "ID": 15455,
            "ChargePointID": 92436,
            "ItemURL": "https://s3-ap-southeast-2.amazonaws.com/openchargemap/images/IT/OCM92436/OCM-92436.orig.2018051219235470.jpg",
            "ItemThumbnailURL": "https://s3-ap-southeast-2.amazonaws.com/openchargemap/images/IT/OCM92436/OCM-92436.thmb.2018051219235470.jpg",
            "Comment": "",
            "IsEnabled": true,
            "IsVideo": false,
            "IsFeaturedItem": false,
            "IsExternalResource": false,
            "User": {
                "ID": 1606,
                "Username": "polianto"
            },
            "DateCreated": "2018-05-12T19:24:00Z"
        },
        {
            "ID": 15456,
            "ChargePointID": 92436,
            "ItemURL": "https://s3-ap-southeast-2.amazonaws.com/openchargemap/images/IT/OCM92436/OCM-92436.orig.2018051219240577.jpg",
            "ItemThumbnailURL": "https://s3-ap-southeast-2.amazonaws.com/openchargemap/images/IT/OCM92436/OCM-92436.thmb.2018051219240577.jpg",
            "Comment": "",
            "IsEnabled": true,
            "IsVideo": false,
            "IsFeaturedItem": false,
            "IsExternalResource": false,
            "User": {
                "ID": 1606,
                "Username": "polianto"
            },
            "DateCreated": "2018-05-12T19:24:00Z"
        },
        {
            "ID": 13644,
            "ChargePointID": 92436,
            "ItemURL": "https://s3-ap-southeast-2.amazonaws.com/openchargemap/images/IT/OCM92436/OCM-92436.orig.2017110517231672.jpg",
            "ItemThumbnailURL": "https://s3-ap-southeast-2.amazonaws.com/openchargemap/images/IT/OCM92436/OCM-92436.thmb.2017110517231672.jpg",
            "Comment": "20171015 photo by Ardigo RSE",
            "IsEnabled": true,
            "IsVideo": false,
            "IsFeaturedItem": false,
            "IsExternalResource": false,
            "User": {
                "ID": 9062,
                "Username": "Evbility"
            },
            "DateCreated": "2017-11-05T17:23:00Z"
        },
        {
            "ID": 13474,
            "ChargePointID": 92436,
            "ItemURL": "https://s3-ap-southeast-2.amazonaws.com/openchargemap/images/IT/OCM92436/OCM-92436.orig.2017100912110285.jpg",
            "ItemThumbnailURL": "https://s3-ap-southeast-2.amazonaws.com/openchargemap/images/IT/OCM92436/OCM-92436.thmb.2017100912110285.jpg",
            "Comment": "Stazione Evbility di Rivolta Ampera in ricarica 25092017 test pre inaugurazione 30092017",
            "IsEnabled": true,
            "IsVideo": false,
            "IsFeaturedItem": false,
            "IsExternalResource": false,
            "User": {
                "ID": 9062,
                "Username": "Evbility"
            },
            "DateCreated": "2017-10-09T12:11:00Z"
        },
        {
            "ID": 13462,
            "ChargePointID": 92436,
            "ItemURL": "https://s3-ap-southeast-2.amazonaws.com/openchargemap/images/IT/OCM92436/OCM-92436.orig.2017100718115388.jpg",
            "ItemThumbnailURL": "https://s3-ap-southeast-2.amazonaws.com/openchargemap/images/IT/OCM92436/OCM-92436.thmb.2017100718115388.jpg",
            "Comment": "Stazione Evbility di Rivolta d Adda: ev charging station in operation since 30 September 2017",
            "IsEnabled": true,
            "IsVideo": false,
            "IsFeaturedItem": false,
            "IsExternalResource": false,
            "User": {
                "ID": 9062,
                "Username": "Evbility"
            },
            "DateCreated": "2017-10-07T18:12:00Z"
        }
    ],
    "IsRecentlyVerified": false,
    "ID": 92436,
    "UUID": "EA82F6EA-C951-41E2-BBB4-BC9E9B0C67FF",
    "DataProviderID": 1,
    "OperatorID": 87,
    "UsageTypeID": 4,
    "UsageCost": "free @ http://ricaricaev.it/",
    "AddressInfo": {
        "ID": 92782,
        "Title": "Evbility Rivolta d'adda",
        "AddressLine1": "Via Giulio Cesare, 1",
        "AddressLine2": "",
        "Town": "Rivolta d' Adda ",
        "StateOrProvince": "BG",
        "Postcode": "26027 ",
        "CountryID": 112,
        "Latitude": 45.46982203182148,
        "Longitude": 9.515950165001064,
        "ContactTelephone1": "035 902451",
        "ContactTelephone2": "3273132170",
        "ContactEmail": "info@evbility.com",
        "AccessComments": "",
        "RelatedURL": "http://evbility.eu/",
        "DistanceUnit": 0
    },
    "Connections": [
        {
            "ID": 131030,
            "ConnectionTypeID": 25,
            "StatusTypeID": 50,
            "LevelID": 2,
            "PowerKW": 22,
            "CurrentTypeID": 20,
            "Quantity": 1
        },
        {
            "ID": 131031,
            "ConnectionTypeID": 36,
            "StatusTypeID": 50,
            "LevelID": 2,
            "PowerKW": 3.7,
            "CurrentTypeID": 10,
            "Quantity": 1
        },
        {
            "ID": 139042,
            "ConnectionTypeID": 25,
            "StatusTypeID": 50,
            "LevelID": 2,
            "PowerKW": 7
        },
        {
            "ID": 139043,
            "ConnectionTypeID": 36,
            "StatusTypeID": 50,
            "LevelID": 2,
            "PowerKW": 3
        }
    ],
    "NumberOfPoints": 2,
    "GeneralComments": "",
    "StatusTypeID": 50,
    "DateLastStatusUpdate": "2021-09-26T10:07:00Z",
    "DataQualityLevel": 1,
    "DateCreated": "2017-09-06T12:14:00Z",
    "SubmissionStatusTypeID": 200
}