{
    "IsRecentlyVerified": false,
    "ID": 77237,
    "UUID": "70A1D2C8-743B-4482-AE1E-7168300586D6",
    "DataProviderID": 1,
    "OperatorID": 45,
    "UsageTypeID": 1,
    "UsageCost": "0",
    "AddressInfo": {
        "ID": 77583,
        "Title": "Parkhaus Naabwiesen P5 in Weiden",
        "AddressLine1": "Leibnizstraße 5",
        "Town": "Weiden i.d.OPf",
        "StateOrProvince": "Weiden i.d.OPf",
        "Postcode": "92637",
        "CountryID": 87,
        "Latitude": 49.6730470230096,
        "Longitude": 12.1591167065251,
        "ContactTelephone1": "0961 67 13 0",
        "ContactEmail": "service@stadtwerke-weiden.de",
        "AccessComments": "Montag bis Samstag 8:00 bis 20:00 Uhr\r\n0,90 EUR/Std. für die 1. Stunde\r\n1,20 EUR/Std. ab der 2. Stunde\r\n\r\nMontag bis Samstag 20:00 bis 8:00 Uhr\r\nSonn- und Feiertage ganztags 0,50 EUR/Std.",
        "DistanceUnit": 0
    },
    "Connections": [
        {
            "ID": 111078,
            "ConnectionTypeID": 1036,
            "StatusTypeID": 50,
            "LevelID": 2,
            "PowerKW": 11,
            "CurrentTypeID": 30
        }
    ],
    "NumberOfPoints": 2,
    "StatusTypeID": 50,
    "DateLastStatusUpdate": "2017-01-07T09:35:00Z",
    "DataQualityLevel": 1,
    "DateCreated": "2017-01-07T03:30:00Z",
    "SubmissionStatusTypeID": 200
}