{
    "IsRecentlyVerified": false,
    "ID": 134383,
    "UUID": "A58380A4-8C42-4A77-8557-E22D7B39FC10",
    "DataProviderID": 1,
    "OperatorID": 80,
    "UsageTypeID": 4,
    "UsageCost": "0,45 €/kW",
    "AddressInfo": {
        "ID": 134729,
        "Title": "Bologna Albertoni | EnelX",
        "AddressLine1": "Via Pietro Albertoni, 19",
        "Town": "Bologna",
        "StateOrProvince": "BO",
        "Postcode": "40138",
        "CountryID": 112,
        "Latitude": 44.491927954335324,
        "Longitude": 11.364689900160897,
        "RelatedURL": "https://www.enelx.com/it/it/emobility",
        "DistanceUnit": 0
    },
    "Connections": [
        {
            "ID": 188093,
            "ConnectionTypeID": 25,
            "StatusTypeID": 150,
            "LevelID": 2,
            "Amps": 32,
            "Voltage": 400,
            "PowerKW": 22,
            "CurrentTypeID": 20,
            "Quantity": 2
        }
    ],
    "NumberOfPoints": 2,
    "StatusTypeID": 150,
    "DateLastStatusUpdate": "2019-11-11T08:09:00Z",
    "DataQualityLevel": 1,
    "DateCreated": "2019-11-11T08:09:00Z",
    "SubmissionStatusTypeID": 200
}