{
    "IsRecentlyVerified": false,
    "ID": 143951,
    "UUID": "6977690C-00C5-48C3-9FA9-51E64FBCD6B3",
    "DataProviderID": 2,
    "DataProvidersReference": "64811",
    "UsageTypeID": 1,
    "AddressInfo": {
        "ID": 144303,
        "Title": "Green Rock Apartments",
        "AddressLine1": "1501 Portland Ave S",
        "Town": "Minneapolis",
        "StateOrProvince": "MN",
        "Postcode": "55404",
        "CountryID": 2,
        "Latitude": 44.967773,
        "Longitude": -93.267233,
        "ContactTelephone1": "612-372-5048",
        "AccessComments": "8am-5pm daily",
        "RelatedURL": "",
        "DistanceUnit": 0
    },
    "Connections": [
        {
            "ID": 200385,
            "ConnectionTypeID": 1,
            "LevelID": 2,
            "Amps": 16,
            "Voltage": 230,
            "PowerKW": 3.7,
            "CurrentTypeID": 10,
            "Quantity": 1
        }
    ],
    "StatusTypeID": 50,
    "DateLastStatusUpdate": "2020-06-26T03:08:00Z",
    "DataQualityLevel": 3,
    "DateCreated": "2019-12-24T09:22:00Z",
    "SubmissionStatusTypeID": 100
}