{
    "MediaItems": [
        {
            "ID": 23262,
            "ChargePointID": 109201,
            "ItemURL": "https://s3-ap-southeast-2.amazonaws.com/openchargemap/images/AT/OCM109201/OCM-109201.orig.2020072718483880.jpg",
            "ItemThumbnailURL": "https://s3-ap-southeast-2.amazonaws.com/openchargemap/images/AT/OCM109201/OCM-109201.thmb.2020072718483880.jpg",
            "Comment": "",
            "IsEnabled": true,
            "IsVideo": false,
            "IsFeaturedItem": false,
            "IsExternalResource": false,
            "User": {
                "ID": 26760,
                "Username": "interssl.com"
            },
            "DateCreated": "2020-07-27T18:49:00Z"
        },
        {
            "ID": 23259,
            "ChargePointID": 109201,
            "ItemURL": "https://s3-ap-southeast-2.amazonaws.com/openchargemap/images/AT/OCM109201/OCM-109201.orig.2020072718475420.jpg",
            "ItemThumbnailURL": "https://s3-ap-southeast-2.amazonaws.com/openchargemap/images/AT/OCM109201/OCM-109201.thmb.2020072718475420.jpg",
            "Comment": "",
            "IsEnabled": true,
            "IsVideo": false,
            "IsFeaturedItem": false,
            "IsExternalResource": false,
            "User": {
                "ID": 26760,
                "Username": "interssl.com"
            },
            "DateCreated": "2020-07-27T18:48:00Z"
        },
        {
            "ID": 23260,
            "ChargePointID": 109201,
            "ItemURL": "https://s3-ap-southeast-2.amazonaws.com/openchargemap/images/AT/OCM109201/OCM-109201.orig.2020072718480658.jpg",
            "ItemThumbnailURL": "https://s3-ap-southeast-2.amazonaws.com/openchargemap/images/AT/OCM109201/OCM-109201.thmb.2020072718480658.jpg",
            "Comment": "",
            "IsEnabled": true,
            "IsVideo": false,
            "IsFeaturedItem": false,
            "IsExternalResource": false,
            "User": {
                "ID": 26760,
                "Username": "interssl.com"
            },
            "DateCreated": "2020-07-27T18:48:00Z"
        },
        {
            "ID": 23261,
            "ChargePointID": 109201,
            "ItemURL": "https://s3-ap-southeast-2.amazonaws.com/openchargemap/images/AT/OCM109201/OCM-109201.orig.2020072718481980.jpg",
            "ItemThumbnailURL": "https://s3-ap-southeast-2.amazonaws.com/openchargemap/images/AT/OCM109201/OCM-109201.thmb.2020072718481980.jpg",
            "Comment": "",
            "IsEnabled": true,
            "IsVideo": false,
            "IsFeaturedItem": false,
            "IsExternalResource": false,
            "User": {
                "ID": 26760,
                "Username": "interssl.com"
            },
            "DateCreated": "2020-07-27T18:48:00Z"
        }
    ],
    "IsRecentlyVerified": false,
    "ID": 109201,
    "UUID": "7A43293D-F85C-4C6C-8A4E-007351537DE7",
    "DataProviderID": 1,
    "OperatorID": 23,
    "OperatorsReference": "44771",
    "UsageTypeID": 4,
    "AddressInfo": {
        "ID": 109547,
        "Title": "Hotel Restaurant Hexenalm",
        "AddressLine1": "Hotel Restaurant Hexenalm",
        "Postcode": "6306",
        "CountryID": 19,
        "Latitude": 47.49806247,
        "Longitude": 12.198091,
        "DistanceUnit": 0
    },
    "Connections": [
        {
            "ID": 154319,
            "ConnectionTypeID": 30,
            "StatusTypeID": 50,
            "LevelID": 2,
            "Amps": 16,
            "Voltage": 400,
            "PowerKW": 11,
            "CurrentTypeID": 20,
            "Quantity": 1
        }
    ],
    "NumberOfPoints": 1,
    "GeneralComments": "1 Tesla Connector, up to 11kW.Available for customers. Please call ahead.",
    "StatusTypeID": 50,
    "DateLastStatusUpdate": "2020-07-27T18:49:00Z",
    "DataQualityLevel": 1,
    "DateCreated": "2018-10-11T13:55:00Z",
    "SubmissionStatusTypeID": 200
}