{
    "UserComments": [
        {
            "ID": 1165,
            "ChargePointID": 22510,
            "CommentTypeID": 10,
            "UserName": "Chris Jones",
            "Comment": "PiM card did not work on one of the charging units but luckily it recognised it ok on the other one which was also free.",
            "Rating": 3,
            "DateCreated": "2014-08-31T21:34:10.89Z",
            "User": {
                "ID": 2271,
                "Username": "Chris Jones"
            },
            "CheckinStatusTypeID": 10
        }
    ],
    "MediaItems": [
        {
            "ID": 623,
            "ChargePointID": 22510,
            "ItemURL": "https://s3-ap-southeast-2.amazonaws.com/openchargemap/images/GB/OCM22510/OCM-22510.orig.2014083121310857.jpg",
            "ItemThumbnailURL": "https://s3-ap-southeast-2.amazonaws.com/openchargemap/images/GB/OCM22510/OCM-22510.thmb.2014083121310857.jpg",
            "Comment": "",
            "IsEnabled": true,
            "IsVideo": false,
            "IsFeaturedItem": false,
            "IsExternalResource": false,
            "User": {
                "ID": 2271,
                "Username": "Chris Jones"
            },
            "DateCreated": "2014-08-31T21:31:00Z"
        }
    ],
    "IsRecentlyVerified": false,
    "ID": 22510,
    "UUID": "DAA77773-4987-4B06-87C3-9C8CEAF19B86",
    "DataProviderID": 18,
    "DataProvidersReference": "39ffe0b5809a15fcc7637b21b3026a72",
    "UsageTypeID": 4,
    "AddressInfo": {
        "ID": 22855,
        "Title": "Ground floor of car park",
        "AddressLine1": "Moor Street",
        "Town": "Birmingham",
        "Postcode": "B5 4BP",
        "CountryID": 1,
        "Latitude": 52.477824,
        "Longitude": -1.891308,
        "AccessComments": "Ground floor of car park. Parking fees and times apply. Fitted under Midlands PiP",
        "RelatedURL": "http://www.national-charge-point-registry.uk/",
        "DistanceUnit": 0
    },
    "Connections": [
        {
            "ID": 24191,
            "ConnectionTypeID": 25,
            "Reference": "0",
            "StatusTypeID": 50,
            "LevelID": 2,
            "Amps": 32,
            "Voltage": 400,
            "PowerKW": 22,
            "CurrentTypeID": 20
        },
        {
            "ID": 189379,
            "ConnectionTypeID": 25,
            "Reference": "1",
            "StatusTypeID": 50,
            "LevelID": 2,
            "Amps": 32,
            "Voltage": 400,
            "PowerKW": 22,
            "CurrentTypeID": 20
        }
    ],
    "DateLastStatusUpdate": "2020-06-25T10:00:00Z",
    "MetadataValues": [
        {
            "ID": 497,
            "MetadataFieldID": 4,
            "ItemValue": "Contains public sector information licensed under the Open Government Licence v2.0. http://www.nationalarchives.gov.uk/doc/open-government-licence/version/2/"
        }
    ],
    "DataQualityLevel": 3,
    "DateCreated": "2014-03-22T08:41:00Z",
    "SubmissionStatusTypeID": 100
}