{
    "IsRecentlyVerified": false,
    "ID": 42950,
    "UUID": "DDD355F1-770A-4D78-BDB3-5421F5371FC8",
    "DataProviderID": 26,
    "DataProvidersReference": "60399",
    "OperatorID": 180,
    "OperatorsReference": "Alfen DHPR05022",
    "UsageCost": "0.00 jaarabonnement",
    "AddressInfo": {
        "ID": 43296,
        "Title": "Jaap Edenweg",
        "AddressLine1": "Jaap Edenweg",
        "Town": "Den Haag",
        "Postcode": "2544 NG",
        "CountryID": 159,
        "Latitude": 52.038758,
        "Longitude": 4.238927,
        "ContactTelephone1": "036 - 549 34 00",
        "RelatedURL": "http://www.icu-charging-stations.com/",
        "DistanceUnit": 0
    },
    "Connections": [
        {
            "ID": 51924,
            "ConnectionTypeID": 25,
            "LevelID": 2,
            "PowerKW": 11,
            "CurrentTypeID": 10
        }
    ],
    "NumberOfPoints": 1,
    "StatusTypeID": 50,
    "DateLastStatusUpdate": "2016-06-04T02:44:00Z",
    "DataQualityLevel": 3,
    "DateCreated": "2015-03-25T02:49:00Z",
    "SubmissionStatusTypeID": 100
}