{
    "IsRecentlyVerified": false,
    "ID": 178802,
    "UUID": "C8C89F94-C508-4F2A-A924-927585C0FB75",
    "DataProviderID": 29,
    "DataProvidersReference": "20189",
    "AddressInfo": {
        "ID": 179161,
        "Title": "Am Schelmenbusch 18-22",
        "AddressLine1": "Am Schelmenbusch 18-22",
        "Town": "Karlsbad",
        "Postcode": "76307",
        "CountryID": 87,
        "Latitude": 48.912464,
        "Longitude": 8.495495,
        "DistanceUnit": 0
    },
    "Connections": [
        {
            "ID": 279726,
            "ConnectionTypeID": 25,
            "StatusTypeID": 50,
            "LevelID": 2,
            "PowerKW": 22,
            "CurrentTypeID": 20
        },
        {
            "ID": 279727,
            "ConnectionTypeID": 25,
            "StatusTypeID": 50,
            "LevelID": 2,
            "PowerKW": 22,
            "CurrentTypeID": 20
        }
    ],
    "StatusTypeID": 0,
    "DateLastStatusUpdate": "2021-07-09T03:14:00Z",
    "MetadataValues": [
        {
            "ID": 11096,
            "MetadataFieldID": 4,
            "ItemValue": "Data from the German chargepoint registry provided by Bundesnetzagentur.de under the CC-BY 4.0 license"
        }
    ],
    "DataQualityLevel": 3,
    "DateCreated": "2021-07-08T09:50:00Z",
    "SubmissionStatusTypeID": 100
}