{
    "IsRecentlyVerified": false,
    "ID": 144249,
    "UUID": "1D52A2F0-BA03-4D16-B974-5DEA79A1DD03",
    "DataProviderID": 2,
    "DataProvidersReference": "130379",
    "OperatorID": 90,
    "UsageTypeID": 1,
    "AddressInfo": {
        "ID": 144601,
        "Title": "METRO - Kirkland",
        "AddressLine1": "3801 boul. Saint-Charles",
        "Town": "Kirkland",
        "StateOrProvince": "QC",
        "Postcode": "H9H 3C3",
        "CountryID": 44,
        "Latitude": 45.460537,
        "Longitude": -73.866032,
        "ContactTelephone1": "877-505-2674",
        "AccessComments": "24 hours daily",
        "RelatedURL": "https://lecircuitelectrique.com/",
        "DistanceUnit": 0
    },
    "Connections": [
        {
            "ID": 200738,
            "ConnectionTypeID": 1,
            "LevelID": 2,
            "Amps": 16,
            "Voltage": 230,
            "PowerKW": 3.7,
            "CurrentTypeID": 10,
            "Quantity": 2
        }
    ],
    "StatusTypeID": 50,
    "DateLastStatusUpdate": "2020-06-26T03:09:00Z",
    "DataQualityLevel": 3,
    "DateCreated": "2019-12-24T09:23:00Z",
    "SubmissionStatusTypeID": 100
}