{
    "IsRecentlyVerified": false,
    "ID": 135340,
    "UUID": "54DEAE76-272B-4631-AA08-3876FFAAD8AE",
    "DataProviderID": 1,
    "OperatorID": 80,
    "UsageTypeID": 4,
    "UsageCost": "0,45 €/kW",
    "AddressInfo": {
        "ID": 135686,
        "Title": "SAN LAZZARO DI SAVENA Galletta | ENELX",
        "AddressLine1": "Via Galletta",
        "Town": "San Lazzaro di Savena",
        "StateOrProvince": "BO",
        "Postcode": "40068",
        "CountryID": 112,
        "Latitude": 44.448899302354675,
        "Longitude": 11.412928674688033,
        "RelatedURL": "https://www.enelx.com/it/it/emobility",
        "DistanceUnit": 0
    },
    "Connections": [
        {
            "ID": 189621,
            "ConnectionTypeID": 25,
            "StatusTypeID": 50,
            "LevelID": 2,
            "Amps": 32,
            "Voltage": 400,
            "PowerKW": 22,
            "CurrentTypeID": 20,
            "Quantity": 1
        },
        {
            "ID": 189622,
            "ConnectionTypeID": 36,
            "StatusTypeID": 50,
            "LevelID": 2,
            "Amps": 16,
            "Voltage": 240,
            "PowerKW": 3.7,
            "CurrentTypeID": 10,
            "Quantity": 1
        }
    ],
    "NumberOfPoints": 2,
    "StatusTypeID": 50,
    "DateLastStatusUpdate": "2019-12-18T15:13:00Z",
    "DataQualityLevel": 1,
    "DateCreated": "2019-12-18T15:13:00Z",
    "SubmissionStatusTypeID": 200
}