{
    "IsRecentlyVerified": false,
    "ID": 61697,
    "UUID": "33745DD4-8084-44BA-AC66-A388F1D8C610",
    "DataProviderID": 1,
    "OperatorID": 23,
    "OperatorsReference": "13122",
    "UsageTypeID": 1,
    "UsageCost": "Free",
    "AddressInfo": {
        "ID": 62043,
        "Title": "Hilton Myrtle Beach - Tesla",
        "AddressLine1": "10000 Beach Club Dr",
        "Town": "Myrtle Beach",
        "StateOrProvince": "SC",
        "Postcode": "29572",
        "CountryID": 2,
        "Latitude": 33.7699875,
        "Longitude": -78.775031,
        "ContactTelephone1": "800-876-0010  877-798-3752",
        "AccessComments": "24 hours daily; for Tesla use only; see valet for access",
        "RelatedURL": "http://www.teslamotors.com/supercharger",
        "DistanceUnit": 0
    },
    "Connections": [
        {
            "ID": 78586,
            "ConnectionTypeID": 30,
            "StatusTypeID": 50,
            "LevelID": 2,
            "Amps": 16,
            "Voltage": 230,
            "PowerKW": 8,
            "CurrentTypeID": 10,
            "Quantity": 1
        }
    ],
    "NumberOfPoints": 1,
    "StatusTypeID": 50,
    "DateLastStatusUpdate": "2017-01-26T15:40:00Z",
    "DataQualityLevel": 3,
    "DateCreated": "2016-03-03T11:38:00Z",
    "SubmissionStatusTypeID": 100
}