{
    "UserComments": [
        {
            "ID": 21046,
            "ChargePointID": 113634,
            "CommentTypeID": 10,
            "UserName": "PhilT",
            "Comment": "Used this twice, has a tendency to disconnect & reconnect a few times when charging my Zoe.",
            "DateCreated": "2019-05-24T19:25:33.087Z",
            "User": {
                "ID": 18298,
                "Username": "PhilT"
            }
        }
    ],
    "IsRecentlyVerified": false,
    "ID": 113634,
    "UUID": "42565B8D-AB0E-4461-8791-F49D26A97A47",
    "DataProviderID": 1,
    "OperatorID": 32,
    "OperatorsReference": "24299",
    "UsageTypeID": 4,
    "UsageCost": "£0.108/kWh; for Polar Plus subscription members only",
    "AddressInfo": {
        "ID": 113980,
        "Title": "Swift Car Care",
        "AddressLine1": "St Pauls Road",
        "Town": "Peterborough",
        "Postcode": "PE1 3ED",
        "CountryID": 1,
        "Latitude": 52.594681,
        "Longitude": -0.249741,
        "DistanceUnit": 0
    },
    "Connections": [
        {
            "ID": 160148,
            "ConnectionTypeID": 33,
            "StatusTypeID": 50,
            "LevelID": 3,
            "PowerKW": 50,
            "CurrentTypeID": 30,
            "Quantity": 1
        },
        {
            "ID": 160149,
            "ConnectionTypeID": 2,
            "StatusTypeID": 50,
            "LevelID": 3,
            "PowerKW": 50,
            "CurrentTypeID": 30,
            "Quantity": 1
        },
        {
            "ID": 160150,
            "ConnectionTypeID": 1036,
            "StatusTypeID": 50,
            "LevelID": 3,
            "PowerKW": 43,
            "CurrentTypeID": 20,
            "Quantity": 1
        }
    ],
    "NumberOfPoints": 1,
    "GeneralComments": "Unit located at Swift Car Care.",
    "StatusTypeID": 50,
    "DateLastStatusUpdate": "2019-06-24T05:14:00Z",
    "DataQualityLevel": 1,
    "DateCreated": "2018-12-25T06:15:00Z",
    "SubmissionStatusTypeID": 200
}