{
    "IsRecentlyVerified": false,
    "ID": 77532,
    "UUID": "85673F51-BF77-4CBC-9D6A-390ED9F5B034",
    "DataProviderID": 1,
    "OperatorID": 1235,
    "OperatorsReference": "5703563be4b0ad00f86ab1de",
    "UsageTypeID": 4,
    "UsageCost": ">3kW: 0,25€/15min <60min; 2,00€/15min >60min <75min; 4,00€/15min >=75min",
    "AddressInfo": {
        "ID": 77878,
        "Title": "Rue Didot",
        "AddressLine1": "47 RUE DIDOT",
        "Town": "Paris",
        "StateOrProvince": "Paris 9",
        "Postcode": "75014",
        "CountryID": 80,
        "Latitude": 48.831448,
        "Longitude": 2.320052,
        "DistanceUnit": 0
    },
    "Connections": [
        {
            "ID": 111867,
            "ConnectionTypeID": 2,
            "StatusTypeID": 50,
            "LevelID": 2,
            "Amps": 32,
            "Voltage": 400,
            "PowerKW": 22,
            "CurrentTypeID": 20,
            "Quantity": 1
        },
        {
            "ID": 111868,
            "ConnectionTypeID": 33,
            "StatusTypeID": 50,
            "LevelID": 2,
            "Amps": 32,
            "Voltage": 400,
            "PowerKW": 22,
            "CurrentTypeID": 20,
            "Quantity": 1
        },
        {
            "ID": 111869,
            "ConnectionTypeID": 23,
            "StatusTypeID": 50,
            "LevelID": 2,
            "PowerKW": 3,
            "CurrentTypeID": 20,
            "Quantity": 1
        },
        {
            "ID": 111870,
            "ConnectionTypeID": 26,
            "StatusTypeID": 50,
            "LevelID": 2,
            "Amps": 32,
            "Voltage": 400,
            "PowerKW": 22,
            "CurrentTypeID": 20,
            "Quantity": 1
        },
        {
            "ID": 111871,
            "ConnectionTypeID": 1036,
            "StatusTypeID": 50,
            "LevelID": 2,
            "Amps": 32,
            "Voltage": 400,
            "PowerKW": 22,
            "CurrentTypeID": 20,
            "Quantity": 1
        }
    ],
    "NumberOfPoints": 1,
    "StatusTypeID": 50,
    "DateLastStatusUpdate": "2017-01-19T14:55:00Z",
    "DataQualityLevel": 1,
    "DateCreated": "2017-01-18T10:45:00Z",
    "SubmissionStatusTypeID": 200
}