{
    "IsRecentlyVerified": false,
    "ID": 82174,
    "UUID": "F56D672D-AEB2-4BAB-9FDB-0C082F621A61",
    "DataProviderID": 1,
    "OperatorID": 23,
    "OperatorsReference": "19952",
    "UsageTypeID": 7,
    "AddressInfo": {
        "ID": 82520,
        "Title": "Hôtel le Cep",
        "AddressLine1": "27 Rue Maufoux",
        "Town": "Beaune",
        "Postcode": "21200",
        "CountryID": 80,
        "Latitude": 47.022146,
        "Longitude": 4.835343,
        "ContactTelephone1": "+33 3 80 22 35 48",
        "DistanceUnit": 0
    },
    "Connections": [
        {
            "ID": 116934,
            "ConnectionTypeID": 30,
            "StatusTypeID": 50,
            "LevelID": 2,
            "Amps": 32,
            "Voltage": 400,
            "PowerKW": 22,
            "CurrentTypeID": 20,
            "Quantity": 2
        }
    ],
    "NumberOfPoints": 2,
    "GeneralComments": "2 Tesla Connectors, up to 22kW.Available by reservation only. Self park.",
    "StatusTypeID": 50,
    "DateLastStatusUpdate": "2018-10-03T18:40:00Z",
    "DataQualityLevel": 1,
    "DateCreated": "2017-02-03T15:02:00Z",
    "SubmissionStatusTypeID": 200
}