{
    "IsRecentlyVerified": false,
    "ID": 180350,
    "UUID": "B90EE1FA-D347-4A0A-A7A8-0A48820EB673",
    "DataProviderID": 29,
    "DataProvidersReference": "3252",
    "OperatorID": 69,
    "AddressInfo": {
        "ID": 180709,
        "Title": "Meraner Str. 11",
        "AddressLine1": "Meraner Str. 11",
        "Town": "München",
        "Postcode": "81547",
        "CountryID": 87,
        "Latitude": 48.101949,
        "Longitude": 11.570127,
        "DistanceUnit": 0
    },
    "Connections": [
        {
            "ID": 283327,
            "ConnectionTypeID": 25,
            "StatusTypeID": 50,
            "LevelID": 2,
            "PowerKW": 22,
            "CurrentTypeID": 20
        },
        {
            "ID": 283328,
            "ConnectionTypeID": 25,
            "StatusTypeID": 50,
            "LevelID": 2,
            "PowerKW": 22,
            "CurrentTypeID": 20
        }
    ],
    "StatusTypeID": 50,
    "DateLastStatusUpdate": "2021-07-12T02:40:00Z",
    "MetadataValues": [
        {
            "ID": 12644,
            "MetadataFieldID": 4,
            "ItemValue": "Data from the German chargepoint registry provided by Bundesnetzagentur.de under the CC-BY 4.0 license"
        }
    ],
    "DataQualityLevel": 3,
    "DateCreated": "2021-07-08T10:00:00Z",
    "SubmissionStatusTypeID": 100
}