{
    "UserComments": [
        {
            "ID": 6712,
            "ChargePointID": 14892,
            "CommentTypeID": 10,
            "UserName": "cros13",
            "DateCreated": "2015-10-06T15:12:03.06Z",
            "User": {
                "ID": 2297,
                "Username": "cros13"
            },
            "CheckinStatusTypeID": 140
        }
    ],
    "IsRecentlyVerified": false,
    "ID": 14892,
    "UUID": "9B2D6152-567F-4BB9-9C3C-AA2DC2F4219C",
    "DataProviderID": 1,
    "OperatorID": 22,
    "OperatorsReference": "C6HLG",
    "UsageTypeID": 4,
    "UsageCost": "Free",
    "AddressInfo": {
        "ID": 15238,
        "Title": "Topaz Service Station",
        "AddressLine1": "M8 Interchange",
        "AddressLine2": "Wallers Lot",
        "Town": "Tipperary",
        "StateOrProvince": "Cashel",
        "CountryID": 3,
        "Latitude": 52.509038,
        "Longitude": -7.872552,
        "DistanceUnit": 0
    },
    "Connections": [
        {
            "ID": 13299,
            "ConnectionTypeID": 2,
            "StatusTypeID": 50,
            "LevelID": 3,
            "Amps": 110,
            "Voltage": 500,
            "PowerKW": 50,
            "CurrentTypeID": 30,
            "Quantity": 1
        },
        {
            "ID": 68803,
            "ConnectionTypeID": 33,
            "StatusTypeID": 50,
            "LevelID": 3,
            "Amps": 110,
            "Voltage": 500,
            "PowerKW": 50,
            "CurrentTypeID": 30,
            "Quantity": 1
        },
        {
            "ID": 68804,
            "ConnectionTypeID": 1036,
            "StatusTypeID": 50,
            "LevelID": 2,
            "Amps": 43,
            "Voltage": 400,
            "PowerKW": 43,
            "CurrentTypeID": 20,
            "Quantity": 1
        }
    ],
    "NumberOfPoints": 2,
    "GeneralComments": "The dual head DBT charger at this location was replaced on 06/10/2015 with a triple head efacec",
    "StatusTypeID": 50,
    "DateLastStatusUpdate": "2019-06-03T09:47:00Z",
    "DataQualityLevel": 2,
    "DateCreated": "2012-12-11T15:08:00Z",
    "SubmissionStatusTypeID": 200
}