{
    "IsRecentlyVerified": false,
    "ID": 131932,
    "UUID": "73DEDC9D-120C-4E14-BEAE-8D984BE98552",
    "DataProviderID": 1,
    "OperatorID": 23,
    "OperatorsReference": "51812",
    "UsageTypeID": 4,
    "AddressInfo": {
        "ID": 132278,
        "Title": "Buena Vista Social Golf SSD",
        "AddressLine1": "Via Cavogno",
        "Town": "Anzano del Parco",
        "Postcode": "22040",
        "CountryID": 112,
        "Latitude": 45.775997,
        "Longitude": 9.212842,
        "ContactTelephone1": "+39 344 2205605",
        "DistanceUnit": 0
    },
    "Connections": [
        {
            "ID": 184608,
            "ConnectionTypeID": 30,
            "StatusTypeID": 50,
            "LevelID": 2,
            "PowerKW": 22,
            "CurrentTypeID": 20,
            "Quantity": 1
        }
    ],
    "NumberOfPoints": 1,
    "GeneralComments": "1 Tesla Connector, up to 22kW.Available for customers. Please see front desk.",
    "StatusTypeID": 50,
    "DateLastStatusUpdate": "2019-09-16T05:31:00Z",
    "DataQualityLevel": 1,
    "DateCreated": "2019-09-16T05:31:00Z",
    "SubmissionStatusTypeID": 200
}