{
    "IsRecentlyVerified": false,
    "ID": 158498,
    "UUID": "5C83B5F9-5193-4502-BE70-8F1FFA5D8C92",
    "DataProviderID": 2,
    "DataProvidersReference": "163541",
    "OperatorID": 5,
    "UsageTypeID": 1,
    "AddressInfo": {
        "ID": 158855,
        "Title": "CHARGEPOINT",
        "AddressLine1": "9977 N 90th St",
        "Town": "Scottsdale",
        "StateOrProvince": "AZ",
        "Postcode": "85258",
        "CountryID": 2,
        "Latitude": 33.576124,
        "Longitude": -111.884857,
        "ContactTelephone1": "888-758-4389",
        "AccessComments": "24 hours daily",
        "RelatedURL": "http://www.chargepoint.com/",
        "DistanceUnit": 0
    },
    "Connections": [
        {
            "ID": 228486,
            "ConnectionTypeID": 1,
            "LevelID": 2,
            "Amps": 16,
            "Voltage": 230,
            "PowerKW": 3.7,
            "CurrentTypeID": 10,
            "Quantity": 6
        }
    ],
    "StatusTypeID": 50,
    "DateLastStatusUpdate": "2020-06-26T02:55:00Z",
    "DataQualityLevel": 3,
    "DateCreated": "2020-06-26T02:55:00Z",
    "SubmissionStatusTypeID": 100
}