{
    "IsRecentlyVerified": false,
    "ID": 57637,
    "UUID": "77E3E8B4-D9D3-4185-89E0-047EF610972D",
    "DataProviderID": 1,
    "OperatorID": 20,
    "OperatorsReference": "80601",
    "UsageTypeID": 4,
    "UsageCost": "£0.20/kWh;min £0.50",
    "AddressInfo": {
        "ID": 57983,
        "Title": "Ripley Hospital",
        "AddressLine1": "Sandham Lane",
        "Town": "Ripley",
        "StateOrProvince": "Derbyshire",
        "Postcode": "DE5 3HE",
        "CountryID": 1,
        "Latitude": 53.04831,
        "Longitude": -1.41041,
        "AccessComments": "Charge points are located at parking spaces at rear of car park, near building. Charge points are for Hospital users, visitors & staff only during normal\r\n working week; unrestricted evenings & weekends. Length of stay limited during working hours to active charging period only or duration of Hospital appointment / visiting, as space \r\nis required for Hospital users. No time restrictions evenings & weekends. The only exception to this is Hospital pool vehicles, which will have a permanent parking space. No parking fees.",
        "DistanceUnit": 0
    },
    "Connections": [
        {
            "ID": 72894,
            "ConnectionTypeID": 25,
            "StatusTypeID": 50,
            "LevelID": 2,
            "Amps": 32,
            "Voltage": 400,
            "PowerKW": 22,
            "CurrentTypeID": 20,
            "Quantity": 2
        },
        {
            "ID": 72895,
            "ConnectionTypeID": 3,
            "StatusTypeID": 0,
            "LevelID": 2,
            "Amps": 13,
            "Voltage": 230,
            "PowerKW": 3,
            "CurrentTypeID": 10,
            "Quantity": 1
        }
    ],
    "NumberOfPoints": 4,
    "StatusTypeID": 50,
    "DateLastStatusUpdate": "2019-03-27T06:15:00Z",
    "DataQualityLevel": 1,
    "DateCreated": "2015-12-11T09:37:00Z",
    "SubmissionStatusTypeID": 200
}