{
    "IsRecentlyVerified": false,
    "ID": 176531,
    "UUID": "10A46451-AA4B-4754-A6E3-E83349E2CE6C",
    "DataProviderID": 29,
    "DataProvidersReference": "20213",
    "AddressInfo": {
        "ID": 176890,
        "Title": "Friedrichstraße 69",
        "AddressLine1": "Friedrichstraße 69",
        "Town": "Lahr/Schwarzwald",
        "Postcode": "77933",
        "CountryID": 87,
        "Latitude": 48.341465,
        "Longitude": 7.880197,
        "DistanceUnit": 0
    },
    "Connections": [
        {
            "ID": 274554,
            "ConnectionTypeID": 28,
            "StatusTypeID": 50,
            "LevelID": 2,
            "PowerKW": 22,
            "CurrentTypeID": 20
        },
        {
            "ID": 274555,
            "ConnectionTypeID": 25,
            "StatusTypeID": 50,
            "LevelID": 2,
            "PowerKW": 22,
            "CurrentTypeID": 20
        },
        {
            "ID": 295743,
            "ConnectionTypeID": 1036,
            "StatusTypeID": 50,
            "LevelID": 2,
            "PowerKW": 22,
            "CurrentTypeID": 20
        }
    ],
    "StatusTypeID": 0,
    "DateLastStatusUpdate": "2021-07-12T02:40:00Z",
    "MetadataValues": [
        {
            "ID": 8826,
            "MetadataFieldID": 4,
            "ItemValue": "Data from the German chargepoint registry provided by Bundesnetzagentur.de under the CC-BY 4.0 license"
        }
    ],
    "DataQualityLevel": 3,
    "DateCreated": "2021-07-08T09:48:00Z",
    "SubmissionStatusTypeID": 100
}