{
    "IsRecentlyVerified": false,
    "ID": 35614,
    "UUID": "6EDE7EBA-B673-4968-BC1E-86F5402B0335",
    "DataProviderID": 26,
    "DataProvidersReference": "47544",
    "OperatorID": 178,
    "OperatorsReference": "EVnetNL AL696",
    "UsageCost": "0.00 jaarabonnement",
    "AddressInfo": {
        "ID": 35960,
        "Title": "Jacob Catsstraat 474",
        "AddressLine1": "Jacob Catsstraat 474",
        "Town": "Den Haag",
        "Postcode": "2515 EX",
        "CountryID": 159,
        "Latitude": 52.065941,
        "Longitude": 4.314159,
        "ContactTelephone1": "0800-3522365",
        "RelatedURL": "http://www.evnet.nl",
        "DistanceUnit": 0
    },
    "Connections": [
        {
            "ID": 39125,
            "ConnectionTypeID": 25,
            "LevelID": 1,
            "PowerKW": 2.3,
            "CurrentTypeID": 10
        }
    ],
    "NumberOfPoints": 2,
    "StatusTypeID": 50,
    "DateLastStatusUpdate": "2016-06-04T02:45:00Z",
    "DataQualityLevel": 3,
    "DateCreated": "2015-01-09T06:05:00Z",
    "SubmissionStatusTypeID": 100
}