{
    "IsRecentlyVerified": false,
    "ID": 177185,
    "UUID": "D2A7146F-FE80-4A34-A90E-DCEB79EC787E",
    "DataProviderID": 29,
    "DataProvidersReference": "17931",
    "OperatorID": 86,
    "AddressInfo": {
        "ID": 177544,
        "Title": "Schwarzwaldstr. 4",
        "AddressLine1": "Schwarzwaldstr. 4",
        "Town": "Emmendingen",
        "Postcode": "79312",
        "CountryID": 87,
        "Latitude": 48.116881,
        "Longitude": 7.850507,
        "DistanceUnit": 0
    },
    "Connections": [
        {
            "ID": 276029,
            "ConnectionTypeID": 25,
            "StatusTypeID": 50,
            "LevelID": 2,
            "PowerKW": 22,
            "CurrentTypeID": 20
        },
        {
            "ID": 276030,
            "ConnectionTypeID": 25,
            "StatusTypeID": 50,
            "LevelID": 2,
            "PowerKW": 22,
            "CurrentTypeID": 20
        }
    ],
    "StatusTypeID": 0,
    "DateLastStatusUpdate": "2021-07-09T03:11:00Z",
    "MetadataValues": [
        {
            "ID": 9479,
            "MetadataFieldID": 4,
            "ItemValue": "Data from the German chargepoint registry provided by Bundesnetzagentur.de under the CC-BY 4.0 license"
        }
    ],
    "DataQualityLevel": 3,
    "DateCreated": "2021-07-08T09:48:00Z",
    "SubmissionStatusTypeID": 100
}