{
    "IsRecentlyVerified": false,
    "ID": 174423,
    "UUID": "4E310CB1-AE1A-4CD5-AD94-59CA9AD660D3",
    "DataProviderID": 1,
    "OperatorID": 1,
    "UsageTypeID": 1,
    "AddressInfo": {
        "ID": 174782,
        "Title": "ESPH HEREDIA",
        "AddressLine1": "Calle 38",
        "AddressLine2": "ESPH Heredia",
        "Town": "Mercedes",
        "StateOrProvince": "Heredia",
        "Postcode": "40801",
        "CountryID": 58,
        "Latitude": 9.999941435962157,
        "Longitude": -84.13438766908877,
        "DistanceUnit": 0
    },
    "Connections": [
        {
            "ID": 270190,
            "ConnectionTypeID": 1,
            "Reference": "ESPH",
            "StatusTypeID": 50,
            "LevelID": 2,
            "Amps": 32,
            "Voltage": 240,
            "PowerKW": 7,
            "CurrentTypeID": 10,
            "Quantity": 1,
            "Comments": "fines de semana cerrado"
        }
    ],
    "NumberOfPoints": 1,
    "GeneralComments": "fines cerrado",
    "StatusTypeID": 50,
    "DateLastStatusUpdate": "2021-05-06T22:37:00Z",
    "DataQualityLevel": 1,
    "DateCreated": "2021-03-29T00:27:00Z",
    "SubmissionStatusTypeID": 200
}