{
    "IsRecentlyVerified": false,
    "ID": 9853,
    "UUID": "7C77149B-E674-4455-BA8E-8D211C6F7928",
    "DataProviderID": 15,
    "DataProvidersReference": "17206",
    "OperatorID": 42,
    "UsageTypeID": 1,
    "AddressInfo": {
        "ID": 9750,
        "Title": "6600 Louisburg Rd",
        "AddressLine1": "6600 Louisburg Rd",
        "Town": "Raleigh",
        "StateOrProvince": "NC",
        "Postcode": "27616",
        "CountryID": 2,
        "Latitude": 35.86795,
        "Longitude": -78.5434,
        "ContactTelephone1": "(919) 532-5502",
        "RelatedURL": "http://carstations.com/17206",
        "DistanceUnit": 0
    },
    "Connections": [
        {
            "ID": 7706,
            "ConnectionTypeID": 1,
            "Reference": "J1772",
            "LevelID": 2
        }
    ],
    "NumberOfPoints": 2,
    "StatusTypeID": 50,
    "DateLastStatusUpdate": "2017-11-04T14:04:00Z",
    "DataQualityLevel": 2,
    "DateCreated": "2012-05-01T20:37:00Z",
    "SubmissionStatusTypeID": 100
}