{
    "IsRecentlyVerified": false,
    "ID": 64721,
    "UUID": "47D79BB8-B9A6-4103-ACC9-14978F8FE27D",
    "DataProviderID": 2,
    "DataProvidersReference": "73979",
    "OperatorID": 1242,
    "UsageTypeID": 2,
    "AddressInfo": {
        "ID": 65067,
        "Title": "iTek 6 (QR 2000304)",
        "AddressLine1": "15555 Lundy Parkway",
        "Town": "Dearborn",
        "StateOrProvince": "MI",
        "Postcode": "48126",
        "CountryID": 2,
        "Latitude": 42.3300893787,
        "Longitude": -83.1991402465,
        "ContactTelephone1": "855-443-3873",
        "AccessComments": "",
        "RelatedURL": "https://www.gewattstation.com",
        "DistanceUnit": 0
    },
    "Connections": [
        {
            "ID": 83173,
            "ConnectionTypeID": 1,
            "LevelID": 2,
            "Amps": 16,
            "Voltage": 230,
            "PowerKW": 3.7,
            "CurrentTypeID": 10,
            "Quantity": 1
        }
    ],
    "DateLastStatusUpdate": "2020-06-26T03:05:00Z",
    "DataQualityLevel": 3,
    "DateCreated": "2016-03-16T09:07:00Z",
    "SubmissionStatusTypeID": 100
}