{
    "IsRecentlyVerified": false,
    "ID": 157657,
    "UUID": "5DB53C1D-3EDD-4FBA-AFDC-E8EDE8824A74",
    "DataProviderID": 1,
    "OperatorID": 103,
    "UsageTypeID": 4,
    "AddressInfo": {
        "ID": 158011,
        "Title": "Gent Kastanjestraat 93",
        "AddressLine1": "Kastanjestraat 93",
        "Town": "Gent",
        "StateOrProvince": "",
        "Postcode": "9000",
        "CountryID": 26,
        "Latitude": 51.06071514571525,
        "Longitude": 3.6988404932801586,
        "DistanceUnit": 0
    },
    "Connections": [
        {
            "ID": 227164,
            "ConnectionTypeID": 25,
            "StatusTypeID": 50,
            "LevelID": 2,
            "PowerKW": 11,
            "CurrentTypeID": 20,
            "Quantity": 2
        }
    ],
    "NumberOfPoints": 1,
    "StatusTypeID": 50,
    "DateLastStatusUpdate": "2020-06-25T21:14:00Z",
    "DataQualityLevel": 1,
    "DateCreated": "2020-06-23T13:02:00Z",
    "SubmissionStatusTypeID": 200
}