{
    "IsRecentlyVerified": false,
    "ID": 181312,
    "UUID": "2204220F-6293-4E0B-ACC0-F8DE187D2297",
    "DataProviderID": 29,
    "DataProvidersReference": "13251",
    "AddressInfo": {
        "ID": 181671,
        "Title": "Kolpingplatz 1a",
        "AddressLine1": "Kolpingplatz 1a",
        "Town": "Vilsbiburg",
        "Postcode": "84137",
        "CountryID": 87,
        "Latitude": 48.448783,
        "Longitude": 12.358694,
        "DistanceUnit": 0
    },
    "Connections": [
        {
            "ID": 285463,
            "ConnectionTypeID": 28,
            "StatusTypeID": 50,
            "LevelID": 2,
            "PowerKW": 22,
            "CurrentTypeID": 20
        },
        {
            "ID": 285464,
            "ConnectionTypeID": 25,
            "StatusTypeID": 50,
            "LevelID": 2,
            "PowerKW": 22,
            "CurrentTypeID": 20
        },
        {
            "ID": 295811,
            "ConnectionTypeID": 28,
            "StatusTypeID": 50,
            "LevelID": 2,
            "PowerKW": 22,
            "CurrentTypeID": 20
        },
        {
            "ID": 295812,
            "ConnectionTypeID": 25,
            "StatusTypeID": 50,
            "LevelID": 2,
            "PowerKW": 22,
            "CurrentTypeID": 20
        }
    ],
    "StatusTypeID": 50,
    "DateLastStatusUpdate": "2021-07-12T02:41:00Z",
    "MetadataValues": [
        {
            "ID": 13606,
            "MetadataFieldID": 4,
            "ItemValue": "Data from the German chargepoint registry provided by Bundesnetzagentur.de under the CC-BY 4.0 license"
        }
    ],
    "DataQualityLevel": 3,
    "DateCreated": "2021-07-08T10:01:00Z",
    "SubmissionStatusTypeID": 100
}