{
    "IsRecentlyVerified": false,
    "ID": 144126,
    "UUID": "B565D7CE-B74C-47B3-B1F3-D2C008658A03",
    "DataProviderID": 2,
    "DataProvidersReference": "130278",
    "OperatorID": 90,
    "UsageTypeID": 1,
    "AddressInfo": {
        "ID": 144478,
        "Title": "Parc des Éperviers-rue Rivelaine",
        "AddressLine1": "89 rue Rivelaine",
        "Town": "Notre-Dame-de-l'Île-Perrot",
        "StateOrProvince": "QC",
        "Postcode": "J7V 8P1",
        "CountryID": 44,
        "Latitude": 45.385993,
        "Longitude": -73.933951,
        "ContactTelephone1": "877-505-2674",
        "AccessComments": "24 hours daily",
        "RelatedURL": "https://lecircuitelectrique.com/",
        "DistanceUnit": 0
    },
    "Connections": [
        {
            "ID": 200603,
            "ConnectionTypeID": 1,
            "LevelID": 2,
            "Amps": 16,
            "Voltage": 230,
            "PowerKW": 3.7,
            "CurrentTypeID": 10,
            "Quantity": 1
        }
    ],
    "StatusTypeID": 50,
    "DateLastStatusUpdate": "2020-06-26T03:08:00Z",
    "DataQualityLevel": 3,
    "DateCreated": "2019-12-24T09:23:00Z",
    "SubmissionStatusTypeID": 100
}