{
    "IsRecentlyVerified": false,
    "ID": 185455,
    "UUID": "5801EFE6-F78E-4903-BB2F-DAC3A9653DA3",
    "DataProviderID": 29,
    "DataProvidersReference": "3502,2369",
    "AddressInfo": {
        "ID": 185814,
        "Title": "Am Freesenbruch 1",
        "AddressLine1": "Am Freesenbruch 1",
        "Town": "Zingst",
        "Postcode": "18374",
        "CountryID": 87,
        "Latitude": 54.4411601482206,
        "Longitude": 12.660584449768,
        "DistanceUnit": 0
    },
    "Connections": [
        {
            "ID": 294972,
            "ConnectionTypeID": 25,
            "StatusTypeID": 50,
            "LevelID": 2,
            "PowerKW": 22,
            "CurrentTypeID": 20
        },
        {
            "ID": 294973,
            "ConnectionTypeID": 25,
            "StatusTypeID": 50,
            "LevelID": 2,
            "PowerKW": 22,
            "CurrentTypeID": 20
        },
        {
            "ID": 294974,
            "ConnectionTypeID": 25,
            "StatusTypeID": 50,
            "LevelID": 2,
            "PowerKW": 22,
            "CurrentTypeID": 20
        },
        {
            "ID": 294975,
            "ConnectionTypeID": 25,
            "StatusTypeID": 50,
            "LevelID": 2,
            "PowerKW": 22,
            "CurrentTypeID": 20
        }
    ],
    "StatusTypeID": 50,
    "DateLastStatusUpdate": "2021-07-09T03:31:00Z",
    "MetadataValues": [
        {
            "ID": 17746,
            "MetadataFieldID": 4,
            "ItemValue": "Data from the German chargepoint registry provided by Bundesnetzagentur.de under the CC-BY 4.0 license"
        }
    ],
    "DataQualityLevel": 3,
    "DateCreated": "2021-07-08T10:06:00Z",
    "SubmissionStatusTypeID": 100
}