{
    "MediaItems": [
        {
            "ID": 22030,
            "ChargePointID": 155564,
            "ItemURL": "https://s3-ap-southeast-2.amazonaws.com/openchargemap/images/CZ/OCM155564/OCM-155564.orig.2020041919163879.jpg",
            "ItemThumbnailURL": "https://s3-ap-southeast-2.amazonaws.com/openchargemap/images/CZ/OCM155564/OCM-155564.thmb.2020041919163879.jpg",
            "Comment": "",
            "IsEnabled": true,
            "IsVideo": false,
            "IsFeaturedItem": false,
            "IsExternalResource": false,
            "User": {
                "ID": 19523,
                "Username": "Martin1713"
            },
            "DateCreated": "2020-04-19T19:17:00Z"
        }
    ],
    "IsRecentlyVerified": false,
    "ID": 155564,
    "UUID": "D5DA18CA-C96D-421F-92CA-AFECC03BC05A",
    "DataProviderID": 1,
    "OperatorID": 1,
    "UsageTypeID": 5,
    "UsageCost": "Temporary free",
    "AddressInfo": {
        "ID": 155918,
        "Title": "MOL 5. května (D1)",
        "AddressLine1": "směr / direction Praha",
        "Town": "Prague",
        "StateOrProvince": "Prague",
        "Postcode": "CZ14100",
        "CountryID": 64,
        "Latitude": 50.03612541393332,
        "Longitude": 14.49241600390667,
        "AccessComments": "The petrol station staff will turn on charger.",
        "DistanceUnit": 0
    },
    "Connections": [
        {
            "ID": 218991,
            "ConnectionTypeID": 33,
            "StatusTypeID": 50,
            "LevelID": 3,
            "PowerKW": 50,
            "CurrentTypeID": 30,
            "Quantity": 1
        },
        {
            "ID": 218992,
            "ConnectionTypeID": 2,
            "StatusTypeID": 50,
            "LevelID": 3,
            "PowerKW": 50,
            "CurrentTypeID": 30,
            "Quantity": 1
        },
        {
            "ID": 218993,
            "ConnectionTypeID": 1036,
            "StatusTypeID": 50,
            "LevelID": 2,
            "PowerKW": 22,
            "CurrentTypeID": 20,
            "Quantity": 1
        }
    ],
    "NumberOfPoints": 1,
    "GeneralComments": "Obsluha čerpací stanice spustí nabíjení",
    "StatusTypeID": 50,
    "DateLastStatusUpdate": "2020-04-23T07:26:00Z",
    "DataQualityLevel": 1,
    "DateCreated": "2020-04-18T16:06:00Z",
    "SubmissionStatusTypeID": 200
}