{
    "IsRecentlyVerified": false,
    "ID": 15185,
    "UUID": "D96ED160-586A-4055-93A2-C8F5EA4DF234",
    "DataProviderID": 2,
    "DataProvidersReference": "49021",
    "UsageTypeID": 1,
    "AddressInfo": {
        "ID": 15531,
        "Title": "Maui County Building",
        "AddressLine1": "200 S High St",
        "Town": "Wailuku",
        "StateOrProvince": "HI",
        "Postcode": "96793",
        "CountryID": 2,
        "Latitude": 20.885721,
        "Longitude": -156.504489,
        "ContactTelephone1": "808-270-6802",
        "AccessComments": "24 hours daily; for EVohana member use only",
        "RelatedURL": "",
        "DistanceUnit": 0
    },
    "Connections": [
        {
            "ID": 16698,
            "ConnectionTypeID": 1,
            "LevelID": 2,
            "Amps": 16,
            "Voltage": 230,
            "PowerKW": 3.7,
            "CurrentTypeID": 10,
            "Quantity": 1
        },
        {
            "ID": 32424,
            "ConnectionTypeID": 2,
            "LevelID": 3,
            "Amps": 100,
            "Voltage": 400,
            "PowerKW": 40,
            "CurrentTypeID": 30,
            "Quantity": 2
        }
    ],
    "DateLastStatusUpdate": "2020-06-26T02:52:00Z",
    "DataQualityLevel": 3,
    "DateCreated": "2012-12-20T04:46:00Z",
    "SubmissionStatusTypeID": 100
}