{
    "IsRecentlyVerified": false,
    "ID": 18919,
    "UUID": "AD772E3A-0AB4-48A1-86DB-36F36F16A6BD",
    "DataProviderID": 1,
    "OperatorID": 3,
    "OperatorsReference": "1747",
    "UsageTypeID": 6,
    "AddressInfo": {
        "ID": 19264,
        "Title": "Suffolk County Council, Constantine House",
        "AddressLine1": "8 Russell Road ",
        "Town": "Ipswich",
        "Postcode": "IP1 2BX",
        "CountryID": 1,
        "Latitude": 52.0542420999214,
        "Longitude": 1.14190220832825,
        "AccessComments": "At the moment this charger is not available to the public, according to SCC staff. That may change in the future, apparently?",
        "DistanceUnit": 0
    },
    "Connections": [
        {
            "ID": 19174,
            "ConnectionTypeID": 25,
            "Reference": "1747a",
            "StatusTypeID": 50,
            "LevelID": 2,
            "Amps": 32,
            "PowerKW": 7,
            "CurrentTypeID": 10,
            "Quantity": 1
        }
    ],
    "StatusTypeID": 50,
    "DateLastStatusUpdate": "2017-04-01T11:19:00Z",
    "DataQualityLevel": 3,
    "DateCreated": "2013-08-30T03:44:00Z",
    "SubmissionStatusTypeID": 200
}