{
    "IsRecentlyVerified": false,
    "ID": 181422,
    "UUID": "967DDB9B-6BF8-474A-A84D-1541267615D9",
    "DataProviderID": 29,
    "DataProvidersReference": "12615",
    "AddressInfo": {
        "ID": 181781,
        "Title": "Alte Neustädter Straße 4",
        "AddressLine1": "Alte Neustädter Straße 4",
        "Town": "Triptis",
        "Postcode": "07819",
        "CountryID": 87,
        "Latitude": 50.7365,
        "Longitude": 11.86416,
        "DistanceUnit": 0
    },
    "Connections": [
        {
            "ID": 285725,
            "ConnectionTypeID": 25,
            "StatusTypeID": 50,
            "LevelID": 2,
            "PowerKW": 22,
            "CurrentTypeID": 20
        },
        {
            "ID": 285726,
            "ConnectionTypeID": 25,
            "StatusTypeID": 50,
            "LevelID": 2,
            "PowerKW": 22,
            "CurrentTypeID": 20
        }
    ],
    "StatusTypeID": 50,
    "DateLastStatusUpdate": "2021-07-09T03:20:00Z",
    "MetadataValues": [
        {
            "ID": 13716,
            "MetadataFieldID": 4,
            "ItemValue": "Data from the German chargepoint registry provided by Bundesnetzagentur.de under the CC-BY 4.0 license"
        }
    ],
    "DataQualityLevel": 3,
    "DateCreated": "2021-07-08T10:01:00Z",
    "SubmissionStatusTypeID": 100
}