{
    "UserComments": [
        {
            "ID": 23638,
            "ChargePointID": 134830,
            "CommentTypeID": 10,
            "UserName": "DavorP",
            "Comment": "",
            "Rating": 5,
            "DateCreated": "2020-12-11T17:40:01.497Z",
            "User": {
                "ID": 22474,
                "Username": "DavorP"
            },
            "CheckinStatusTypeID": 10,
            "IsActionedByEditor": false
        },
        {
            "ID": 22591,
            "ChargePointID": 134830,
            "CommentTypeID": 10,
            "UserName": "DavorP",
            "Comment": "29 kW",
            "Rating": 4,
            "DateCreated": "2020-05-12T10:48:34.05Z",
            "User": {
                "ID": 22474,
                "Username": "DavorP"
            },
            "CheckinStatusTypeID": 10,
            "IsActionedByEditor": false
        },
        {
            "ID": 22134,
            "ChargePointID": 134830,
            "CommentTypeID": 10,
            "UserName": "DavorP",
            "Comment": "",
            "Rating": 5,
            "DateCreated": "2020-02-12T08:28:10.91Z",
            "User": {
                "ID": 22474,
                "Username": "DavorP"
            },
            "CheckinStatusTypeID": 10,
            "IsActionedByEditor": false
        }
    ],
    "MediaItems": [
        {
            "ID": 21216,
            "ChargePointID": 134830,
            "ItemURL": "https://s3-ap-southeast-2.amazonaws.com/openchargemap/images/HR/OCM134830/OCM-134830.orig.2020021208283531.jpg",
            "ItemThumbnailURL": "https://s3-ap-southeast-2.amazonaws.com/openchargemap/images/HR/OCM134830/OCM-134830.thmb.2020021208283531.jpg",
            "Comment": "",
            "IsEnabled": true,
            "IsVideo": false,
            "IsFeaturedItem": false,
            "IsExternalResource": false,
            "User": {
                "ID": 22474,
                "Username": "DavorP"
            },
            "DateCreated": "2020-02-12T08:29:00Z"
        }
    ],
    "IsRecentlyVerified": false,
    "ID": 134830,
    "UUID": "FE2A0440-822F-486F-9806-DBED277A4F20",
    "DataProviderID": 1,
    "OperatorID": 3311,
    "UsageTypeID": 4,
    "AddressInfo": {
        "ID": 135176,
        "Title": "ELEN Odmorište Ljubešćica ISTOK",
        "AddressLine1": "Odmorište Ljubešćica ISTOK",
        "Town": "Ljubešćica",
        "StateOrProvince": "Varaždin County",
        "Postcode": "42222",
        "CountryID": 60,
        "Latitude": 46.16920219048461,
        "Longitude": 16.375852787552276,
        "AccessComments": "https://www.plugshare.com/location/189233",
        "RelatedURL": "https://elen.hep.hr/",
        "DistanceUnit": 0
    },
    "Connections": [
        {
            "ID": 188644,
            "ConnectionTypeID": 33,
            "StatusTypeID": 50,
            "LevelID": 3,
            "PowerKW": 40,
            "CurrentTypeID": 30,
            "Quantity": 1
        },
        {
            "ID": 188645,
            "ConnectionTypeID": 2,
            "StatusTypeID": 50,
            "LevelID": 3,
            "PowerKW": 40,
            "CurrentTypeID": 30,
            "Quantity": 1
        },
        {
            "ID": 188646,
            "ConnectionTypeID": 1036,
            "StatusTypeID": 50,
            "LevelID": 3,
            "Amps": 63,
            "Voltage": 400,
            "PowerKW": 43,
            "CurrentTypeID": 20,
            "Quantity": 1
        }
    ],
    "NumberOfPoints": 1,
    "GeneralComments": "1x50kW CHAdeMO\r\n1x50kW CCS\r\n1x43kW Type2\r\nOpen 24/7 \r\nRFID Elen",
    "StatusTypeID": 50,
    "DateLastStatusUpdate": "2020-12-11T17:40:00Z",
    "DataQualityLevel": 1,
    "DateCreated": "2019-11-24T17:53:00Z",
    "SubmissionStatusTypeID": 200
}