{
    "IsRecentlyVerified": false,
    "ID": 112450,
    "UUID": "24947CD4-521D-453E-A233-4D1B721DC26E",
    "DataProviderID": 1,
    "OperatorID": 20,
    "OperatorsReference": "80876",
    "UsageTypeID": 4,
    "UsageCost": "Free",
    "AddressInfo": {
        "ID": 112796,
        "Title": "The Nook , South Tyneside",
        "AddressLine1": "The Nook",
        "Town": "Prince Edward Road",
        "StateOrProvince": "South Shields",
        "Postcode": "NE34 8PS",
        "CountryID": 1,
        "Latitude": 54.97189,
        "Longitude": -1.40965,
        "DistanceUnit": 0
    },
    "Connections": [
        {
            "ID": 158179,
            "ConnectionTypeID": 25,
            "StatusTypeID": 50,
            "LevelID": 2,
            "Amps": 32,
            "Voltage": 230,
            "PowerKW": 7,
            "CurrentTypeID": 10,
            "Quantity": 2
        }
    ],
    "NumberOfPoints": 2,
    "StatusTypeID": 50,
    "DateLastStatusUpdate": "2018-10-30T13:04:00Z",
    "DataQualityLevel": 1,
    "DateCreated": "2018-10-30T13:04:00Z",
    "SubmissionStatusTypeID": 200
}