{
    "IsRecentlyVerified": false,
    "ID": 38751,
    "UUID": "4FA3AE0A-E8E9-4465-8A01-C604DBF79E4E",
    "DataProviderID": 26,
    "DataProvidersReference": "47333",
    "OperatorID": 178,
    "OperatorsReference": "EVnetNL AL489",
    "UsageCost": "0.00 jaarabonnement",
    "AddressInfo": {
        "ID": 39097,
        "Title": "Valeriaan 3",
        "AddressLine1": "Valeriaan 3",
        "Town": "Hoogeveen",
        "Postcode": "7909 HC",
        "CountryID": 159,
        "Latitude": 52.720711,
        "Longitude": 6.438447,
        "ContactTelephone1": "0800-3522365",
        "RelatedURL": "http://www.evnet.nl",
        "DistanceUnit": 0
    },
    "Connections": [
        {
            "ID": 42262,
            "ConnectionTypeID": 25,
            "LevelID": 2,
            "PowerKW": 11,
            "CurrentTypeID": 10
        }
    ],
    "NumberOfPoints": 2,
    "StatusTypeID": 50,
    "DateLastStatusUpdate": "2016-06-04T02:55:00Z",
    "DataQualityLevel": 3,
    "DateCreated": "2015-01-09T06:08:00Z",
    "SubmissionStatusTypeID": 100
}