{
    "IsRecentlyVerified": false,
    "ID": 175657,
    "UUID": "7C1BCE02-2975-43E1-91CC-6A8663B7C120",
    "DataProviderID": 1,
    "OperatorID": 3453,
    "UsageTypeID": 1,
    "UsageCost": "1.19 PLN/kWh",
    "AddressInfo": {
        "ID": 176016,
        "Title": "Dworzec PKP Warszawa Wschodnia",
        "AddressLine1": "Kijowska 20",
        "Town": "Warsaw",
        "StateOrProvince": "Masovian Voivodeship",
        "Postcode": "03-743",
        "CountryID": 179,
        "Latitude": 52.252045,
        "Longitude": 21.050473,
        "DistanceUnit": 0
    },
    "Connections": [
        {
            "ID": 272749,
            "ConnectionTypeID": 25,
            "StatusTypeID": 50,
            "LevelID": 2,
            "PowerKW": 22,
            "CurrentTypeID": 20,
            "Quantity": 2
        }
    ],
    "NumberOfPoints": 2,
    "StatusTypeID": 50,
    "DateLastStatusUpdate": "2021-06-04T09:25:00Z",
    "DataQualityLevel": 1,
    "DateCreated": "2021-06-04T09:25:00Z",
    "SubmissionStatusTypeID": 200
}