{
    "IsRecentlyVerified": false,
    "ID": 113036,
    "UUID": "C066B53C-CB7C-4D14-AE55-673A2E0E8FD2",
    "DataProviderID": 2,
    "DataProvidersReference": "104599",
    "UsageTypeID": 1,
    "AddressInfo": {
        "ID": 113382,
        "Title": "Whole Foods Market",
        "AddressLine1": "6730 Paper Mill Dr",
        "Town": "Knoxville",
        "StateOrProvince": "TN",
        "Postcode": "37919",
        "CountryID": 2,
        "Latitude": 35.933164,
        "Longitude": -84.015576,
        "ContactTelephone1": "865-291-6400",
        "AccessComments": "8am-9pm daily",
        "RelatedURL": "",
        "DistanceUnit": 0
    },
    "Connections": [
        {
            "ID": 159195,
            "ConnectionTypeID": 1,
            "LevelID": 2,
            "Amps": 16,
            "Voltage": 230,
            "PowerKW": 3,
            "CurrentTypeID": 10,
            "Quantity": 2
        }
    ],
    "DateLastStatusUpdate": "2019-04-06T04:02:00Z",
    "DataQualityLevel": 3,
    "DateCreated": "2018-11-28T02:04:00Z",
    "SubmissionStatusTypeID": 100
}