{
    "UserComments": [
        {
            "ID": 23481,
            "ChargePointID": 131373,
            "CommentTypeID": 10,
            "UserName": "ForumElettrico.it",
            "Comment": "Il parcheggio è chiuso da cancello per cui bisogna prestare attenzione agli orario del supermercato. Leggi la recensione completa qui > https://www.forumelettrico.it/forum/colonnina-enel-x-22-kw-u2-casalmaggiore-cr-via-della-repubblica-84-t13781.html",
            "RelatedURL": "https://www.forumelettrico.it/forum/colonnina-enel-x-22-kw-u2-casalmaggiore-cr-via-della-repubblica-84-t13781.html",
            "DateCreated": "2020-11-05T17:02:00.353Z",
            "User": {
                "ID": 11749,
                "Username": "ForumElettrico.it"
            },
            "CheckinStatusTypeID": 10,
            "IsActionedByEditor": false
        }
    ],
    "MediaItems": [
        {
            "ID": 25369,
            "ChargePointID": 131373,
            "ItemURL": "https://s3-ap-southeast-2.amazonaws.com/openchargemap/images/IT/OCM131373/OCM-131373.orig.2020110517023139.jpg",
            "ItemThumbnailURL": "https://s3-ap-southeast-2.amazonaws.com/openchargemap/images/IT/OCM131373/OCM-131373.thmb.2020110517023139.jpg",
            "Comment": "",
            "IsEnabled": true,
            "IsVideo": false,
            "IsFeaturedItem": false,
            "IsExternalResource": false,
            "User": {
                "ID": 11749,
                "Username": "ForumElettrico.it"
            },
            "DateCreated": "2020-11-05T17:03:00Z"
        },
        {
            "ID": 25366,
            "ChargePointID": 131373,
            "ItemURL": "https://s3-ap-southeast-2.amazonaws.com/openchargemap/images/IT/OCM131373/OCM-131373.orig.2020110517021063.jpg",
            "ItemThumbnailURL": "https://s3-ap-southeast-2.amazonaws.com/openchargemap/images/IT/OCM131373/OCM-131373.thmb.2020110517021063.jpg",
            "Comment": "",
            "IsEnabled": true,
            "IsVideo": false,
            "IsFeaturedItem": false,
            "IsExternalResource": false,
            "User": {
                "ID": 11749,
                "Username": "ForumElettrico.it"
            },
            "DateCreated": "2020-11-05T17:02:00Z"
        },
        {
            "ID": 25367,
            "ChargePointID": 131373,
            "ItemURL": "https://s3-ap-southeast-2.amazonaws.com/openchargemap/images/IT/OCM131373/OCM-131373.orig.2020110517021669.jpg",
            "ItemThumbnailURL": "https://s3-ap-southeast-2.amazonaws.com/openchargemap/images/IT/OCM131373/OCM-131373.thmb.2020110517021669.jpg",
            "Comment": "",
            "IsEnabled": true,
            "IsVideo": false,
            "IsFeaturedItem": false,
            "IsExternalResource": false,
            "User": {
                "ID": 11749,
                "Username": "ForumElettrico.it"
            },
            "DateCreated": "2020-11-05T17:02:00Z"
        },
        {
            "ID": 25368,
            "ChargePointID": 131373,
            "ItemURL": "https://s3-ap-southeast-2.amazonaws.com/openchargemap/images/IT/OCM131373/OCM-131373.orig.2020110517022535.jpg",
            "ItemThumbnailURL": "https://s3-ap-southeast-2.amazonaws.com/openchargemap/images/IT/OCM131373/OCM-131373.thmb.2020110517022535.jpg",
            "Comment": "",
            "IsEnabled": true,
            "IsVideo": false,
            "IsFeaturedItem": false,
            "IsExternalResource": false,
            "User": {
                "ID": 11749,
                "Username": "ForumElettrico.it"
            },
            "DateCreated": "2020-11-05T17:02:00Z"
        }
    ],
    "IsRecentlyVerified": false,
    "ID": 131373,
    "UUID": "321D6A82-9087-492B-907D-288459AFFA4F",
    "DataProviderID": 1,
    "OperatorID": 80,
    "UsageTypeID": 4,
    "AddressInfo": {
        "ID": 131719,
        "Title": "U2 Supermercato Casalmaggiore | EnelX",
        "AddressLine1": "Via della Repubblica, 84",
        "Town": "Casalmaggiore",
        "StateOrProvince": "CR",
        "Postcode": "26041",
        "CountryID": 112,
        "Latitude": 44.99635393671301,
        "Longitude": 10.416938009574892,
        "ContactTelephone1": "800.069.850",
        "RelatedURL": "https://www.enelx.com/it/it/emobility",
        "DistanceUnit": 0
    },
    "Connections": [
        {
            "ID": 183918,
            "ConnectionTypeID": 25,
            "StatusTypeID": 50,
            "LevelID": 2,
            "Amps": 32,
            "Voltage": 400,
            "PowerKW": 22,
            "CurrentTypeID": 20,
            "Quantity": 2
        }
    ],
    "NumberOfPoints": 2,
    "GeneralComments": "LUN -SAB 08:00 - 20:00 ; DOM 08:30 -13:00",
    "StatusTypeID": 50,
    "DateLastStatusUpdate": "2020-11-05T17:03:00Z",
    "DataQualityLevel": 1,
    "DateCreated": "2019-09-04T08:18:00Z",
    "SubmissionStatusTypeID": 200
}