{
    "IsRecentlyVerified": false,
    "ID": 181367,
    "UUID": "38821144-6544-48F4-9E51-C19A559197E5",
    "DataProviderID": 29,
    "DataProvidersReference": "13315",
    "AddressInfo": {
        "ID": 181726,
        "Title": "Haugerpfarrgasse 14",
        "AddressLine1": "Haugerpfarrgasse 14",
        "Town": "Würzburg",
        "Postcode": "97070",
        "CountryID": 87,
        "Latitude": 49.79771,
        "Longitude": 9.935638,
        "DistanceUnit": 0
    },
    "Connections": [
        {
            "ID": 285585,
            "ConnectionTypeID": 25,
            "StatusTypeID": 50,
            "LevelID": 2,
            "PowerKW": 22,
            "CurrentTypeID": 20
        },
        {
            "ID": 285586,
            "ConnectionTypeID": 25,
            "StatusTypeID": 50,
            "LevelID": 2,
            "PowerKW": 22,
            "CurrentTypeID": 20
        }
    ],
    "StatusTypeID": 50,
    "DateLastStatusUpdate": "2021-07-12T02:43:00Z",
    "MetadataValues": [
        {
            "ID": 13661,
            "MetadataFieldID": 4,
            "ItemValue": "Data from the German chargepoint registry provided by Bundesnetzagentur.de under the CC-BY 4.0 license"
        }
    ],
    "DataQualityLevel": 3,
    "DateCreated": "2021-07-08T10:01:00Z",
    "SubmissionStatusTypeID": 100
}