{
    "IsRecentlyVerified": false,
    "ID": 167365,
    "UUID": "BCF165C8-FC10-48A8-8CF6-6059607F08EC",
    "DataProviderID": 18,
    "DataProvidersReference": "1fb0dd3ed335dde917cb1bf8947f18ee",
    "OperatorID": 25,
    "UsageTypeID": 4,
    "AddressInfo": {
        "ID": 167724,
        "Title": "Calonne Road",
        "AddressLine1": "Calonne Road",
        "Town": "Merton",
        "Postcode": "SW19 5HH",
        "CountryID": 1,
        "Latitude": 51.432674,
        "Longitude": -0.223301,
        "AccessComments": "",
        "RelatedURL": "https://www.sourcelondon.net",
        "DistanceUnit": 0
    },
    "Connections": [
        {
            "ID": 253466,
            "ConnectionTypeID": 25,
            "Reference": "1",
            "StatusTypeID": 50,
            "LevelID": 2,
            "Amps": 32,
            "Voltage": 230,
            "PowerKW": 7,
            "CurrentTypeID": 10
        },
        {
            "ID": 253467,
            "ConnectionTypeID": 1,
            "Reference": "2",
            "StatusTypeID": 50,
            "LevelID": 2,
            "Amps": 13,
            "Voltage": 230,
            "PowerKW": 3,
            "CurrentTypeID": 10
        }
    ],
    "StatusTypeID": 0,
    "DateLastStatusUpdate": "2020-09-08T02:47:00Z",
    "MetadataValues": [
        {
            "ID": 7906,
            "MetadataFieldID": 4,
            "ItemValue": "Contains public sector information licensed under the Open Government Licence v2.0. http://www.nationalarchives.gov.uk/doc/open-government-licence/version/2/"
        }
    ],
    "DataQualityLevel": 3,
    "DateCreated": "2020-09-08T02:47:00Z",
    "SubmissionStatusTypeID": 100
}