{
    "IsRecentlyVerified": false,
    "ID": 8572,
    "UUID": "281B7E0A-EADB-4E24-B469-EC7CF653B96F",
    "DataProviderID": 15,
    "DataProvidersReference": "540",
    "OperatorID": 43,
    "AddressInfo": {
        "ID": 8469,
        "Title": "1036 Broxton Ave.",
        "AddressLine1": "1036 Broxton Ave.",
        "Town": "Los Angeles",
        "StateOrProvince": "California",
        "Postcode": "90024",
        "CountryID": 2,
        "Latitude": 34.0619,
        "Longitude": -118.44644,
        "ContactTelephone1": "",
        "RelatedURL": "http://carstations.com/540",
        "DistanceUnit": 0
    },
    "Connections": [
        {
            "ID": 5996,
            "ConnectionTypeID": 7,
            "Reference": "AVCON",
            "Quantity": 1
        },
        {
            "ID": 6218,
            "ConnectionTypeID": 0,
            "Reference": "SPI"
        }
    ],
    "StatusTypeID": 0,
    "DateLastStatusUpdate": "2017-11-04T14:04:00Z",
    "DataQualityLevel": 1,
    "DateCreated": "2011-11-11T12:06:00Z",
    "SubmissionStatusTypeID": 100
}