{
    "IsRecentlyVerified": false,
    "ID": 106722,
    "UUID": "4FDD74BA-9B69-4457-B600-D6E6D5082A1D",
    "DataProviderID": 1,
    "DataProvidersReference": "4827",
    "AddressInfo": {
        "ID": 107068,
        "Title": "Älvdalen - Dalakraft Snabbladdare",
        "AddressLine1": "Dalgatan 81C",
        "Town": "ÄLVDALEN",
        "StateOrProvince": "DALARNA",
        "Postcode": "79630",
        "CountryID": 216,
        "Latitude": 61.229376,
        "Longitude": 14.037099,
        "AccessComments": "Bakom Swedbanks kontor i Älvdalen.",
        "DistanceUnit": 0
    },
    "Connections": [
        {
            "ID": 150378,
            "ConnectionTypeID": 0,
            "Reference": "1",
            "LevelID": 2,
            "Amps": 100,
            "Voltage": 500,
            "PowerKW": 50,
            "Comments": "Mode 4"
        },
        {
            "ID": 150379,
            "ConnectionTypeID": 0,
            "Reference": "2",
            "LevelID": 2,
            "Amps": 100,
            "Voltage": 500,
            "PowerKW": 50,
            "Comments": "Mode 4"
        },
        {
            "ID": 150380,
            "ConnectionTypeID": 0,
            "Reference": "3",
            "LevelID": 2,
            "Amps": 32,
            "Voltage": 400,
            "PowerKW": 22,
            "Comments": "Mode 3"
        },
        {
            "ID": 150381,
            "ConnectionTypeID": 0,
            "Reference": "4",
            "LevelID": 2,
            "Amps": 32,
            "Voltage": 400,
            "PowerKW": 22,
            "Comments": "Mode 3"
        }
    ],
    "NumberOfPoints": 4,
    "DateLastStatusUpdate": "2020-05-26T08:24:00Z",
    "DataQualityLevel": 2,
    "DateCreated": "2018-06-27T12:11:00Z",
    "SubmissionStatusTypeID": 100
}