{
    "IsRecentlyVerified": false,
    "ID": 113393,
    "UUID": "FA00B7DE-01E1-4788-91E7-AEFC1DBB7B5E",
    "DataProviderID": 1,
    "OperatorID": 3,
    "OperatorsReference": "PG-81847",
    "UsageTypeID": 4,
    "UsageCost": "£1.00/hour",
    "AddressInfo": {
        "ID": 113739,
        "Title": "Turnberry Holiday Park",
        "AddressLine1": "Turnberry Holiday Park",
        "Town": "Girvan",
        "StateOrProvince": "South Ayrshire",
        "Postcode": "KA26 9JW",
        "CountryID": 1,
        "Latitude": 55.292157086334,
        "Longitude": -4.8246036396423,
        "DistanceUnit": 0
    },
    "Connections": [
        {
            "ID": 159719,
            "ConnectionTypeID": 25,
            "StatusTypeID": 50,
            "LevelID": 2,
            "Amps": 32,
            "Voltage": 230,
            "PowerKW": 7,
            "CurrentTypeID": 10,
            "Quantity": 2
        }
    ],
    "NumberOfPoints": 2,
    "StatusTypeID": 50,
    "DateLastStatusUpdate": "2019-05-13T12:40:00Z",
    "DataQualityLevel": 1,
    "DateCreated": "2018-12-07T09:37:00Z",
    "SubmissionStatusTypeID": 200
}