{
    "IsRecentlyVerified": false,
    "ID": 31051,
    "UUID": "CF2813CD-4C26-483D-972A-9243E958CE7B",
    "DataProviderID": 1,
    "DataProvidersReference": "1717",
    "AddressInfo": {
        "ID": 31397,
        "Title": "Høgskolen i Nord-Trøndelag, Stjørdal",
        "AddressLine1": "Ligaardvegen 15",
        "Town": "STJØRDAL",
        "StateOrProvince": "Trøndelag",
        "Postcode": "7500",
        "CountryID": 168,
        "Latitude": 63.47091,
        "Longitude": 10.9446,
        "AccessComments": "Bak skolen, en rad med P-plasser reservert for skolebiler.",
        "DistanceUnit": 0
    },
    "Connections": [
        {
            "ID": 34280,
            "ConnectionTypeID": 0,
            "Reference": "1",
            "LevelID": 2,
            "Amps": 16,
            "Voltage": 230,
            "PowerKW": 3.7,
            "Comments": "Mode 1"
        },
        {
            "ID": 87516,
            "ConnectionTypeID": 0,
            "Reference": "2",
            "LevelID": 2,
            "Amps": 16,
            "Voltage": 230,
            "PowerKW": 3.7,
            "Comments": "Mode 1"
        },
        {
            "ID": 87517,
            "ConnectionTypeID": 0,
            "Reference": "3",
            "LevelID": 2,
            "Amps": 16,
            "Voltage": 230,
            "PowerKW": 3.7,
            "Comments": "Mode 1"
        },
        {
            "ID": 87518,
            "ConnectionTypeID": 0,
            "Reference": "4",
            "LevelID": 2,
            "Amps": 16,
            "Voltage": 230,
            "PowerKW": 3.7,
            "Comments": "Mode 1"
        },
        {
            "ID": 87519,
            "ConnectionTypeID": 0,
            "Reference": "5",
            "LevelID": 2,
            "Amps": 16,
            "Voltage": 230,
            "PowerKW": 3.7,
            "Comments": "Mode 1"
        },
        {
            "ID": 89454,
            "ConnectionTypeID": 0,
            "Reference": "6",
            "LevelID": 2,
            "Amps": 16,
            "Voltage": 230,
            "PowerKW": 3.7,
            "Comments": "Mode 1"
        }
    ],
    "NumberOfPoints": 6,
    "DateLastStatusUpdate": "2020-05-26T08:25:00Z",
    "DataQualityLevel": 2,
    "DateCreated": "2014-12-09T09:01:00Z",
    "SubmissionStatusTypeID": 100
}