{
    "IsRecentlyVerified": false,
    "ID": 73289,
    "UUID": "3BB3E2A5-90FE-4D3A-9420-E96CBD1B5A2B",
    "DataProviderID": 1,
    "OperatorID": 45,
    "UsageTypeID": 6,
    "AddressInfo": {
        "ID": 73635,
        "Title": "Hotel Platzl",
        "AddressLine1": "Sparkassenstraße 10",
        "Town": "München",
        "StateOrProvince": "Bayern",
        "Postcode": "80331",
        "CountryID": 87,
        "Latitude": 48.13789999999999,
        "Longitude": 11.578960000000052,
        "ContactTelephone1": "+49 8923 7030",
        "AccessComments": "Tesla Destination Charging location. Funktioniert wahrscheinlich nur bei Tesla Fahrzeugen.\r\n",
        "RelatedURL": "http://www.platzl.de/",
        "DistanceUnit": 0
    },
    "Connections": [
        {
            "ID": 105458,
            "ConnectionTypeID": 25,
            "StatusTypeID": 50,
            "LevelID": 2,
            "Amps": 32,
            "Voltage": 400,
            "PowerKW": 22,
            "CurrentTypeID": 20,
            "Quantity": 1
        }
    ],
    "NumberOfPoints": 1,
    "StatusTypeID": 50,
    "DateLastStatusUpdate": "2016-11-17T10:42:00Z",
    "DataQualityLevel": 1,
    "DateCreated": "2016-11-17T10:42:00Z",
    "SubmissionStatusTypeID": 200
}