{
    "IsRecentlyVerified": false,
    "ID": 106492,
    "UUID": "972DDC94-A401-4DF3-AA9C-A2AED150F610",
    "DataProviderID": 1,
    "OperatorID": 23,
    "OperatorsReference": "44415",
    "UsageTypeID": 4,
    "AddressInfo": {
        "ID": 106838,
        "Title": "Il Giardino Ristorante",
        "AddressLine1": "2500 Tournament DR",
        "Town": "Virginia Beach",
        "StateOrProvince": "Virginia",
        "Postcode": "23456",
        "CountryID": 2,
        "Latitude": 36.7592861,
        "Longitude": -76.0747554,
        "ContactTelephone1": "(757) 563-9440",
        "DistanceUnit": 0
    },
    "Connections": [
        {
            "ID": 149869,
            "ConnectionTypeID": 30,
            "StatusTypeID": 50,
            "LevelID": 2,
            "PowerKW": 16,
            "CurrentTypeID": 20,
            "Quantity": 4
        }
    ],
    "NumberOfPoints": 4,
    "GeneralComments": "4 Tesla Connectors, up to 16kW.Available for customers. Please see front desk.",
    "StatusTypeID": 50,
    "DateLastStatusUpdate": "2018-06-23T05:37:00Z",
    "DataQualityLevel": 1,
    "DateCreated": "2018-06-23T05:37:00Z",
    "SubmissionStatusTypeID": 200
}