{
    "IsRecentlyVerified": false,
    "ID": 75815,
    "UUID": "25784823-282B-4BB5-9A26-2D68CBEBA405",
    "DataProviderID": 1,
    "OperatorID": 23,
    "OperatorsReference": "21808",
    "UsageTypeID": 1,
    "UsageCost": "Free",
    "AddressInfo": {
        "ID": 76161,
        "Title": "Hampton Inn & Suites - Tesla",
        "AddressLine1": "7141 S Springs Dr",
        "Town": "Franklin",
        "StateOrProvince": "TN",
        "Postcode": "37067",
        "CountryID": 2,
        "Latitude": 35.9524035,
        "Longitude": -86.8137311,
        "ContactTelephone1": "615-771-7225  877-798-3752",
        "AccessComments": "24 hours daily; for Tesla use only; for guest use only; see valet for access",
        "RelatedURL": "http://www.teslamotors.com/supercharger",
        "DistanceUnit": 0
    },
    "Connections": [
        {
            "ID": 109321,
            "ConnectionTypeID": 30,
            "StatusTypeID": 50,
            "LevelID": 2,
            "Amps": 16,
            "Voltage": 230,
            "PowerKW": 13,
            "CurrentTypeID": 10,
            "Quantity": 2
        }
    ],
    "NumberOfPoints": 2,
    "StatusTypeID": 50,
    "DateLastStatusUpdate": "2017-01-31T18:06:00Z",
    "DataQualityLevel": 3,
    "DateCreated": "2016-12-23T01:25:00Z",
    "SubmissionStatusTypeID": 100
}