{
    "IsRecentlyVerified": false,
    "ID": 135757,
    "UUID": "7962D063-49C6-4813-A438-56ECCA7DD3CD",
    "DataProviderID": 18,
    "DataProvidersReference": "7e1f35e9e0262960fcbf7476342dd49d",
    "OperatorID": 2244,
    "UsageTypeID": 5,
    "AddressInfo": {
        "ID": 136103,
        "Title": "Caldervale Road",
        "AddressLine1": "Caldervale Road",
        "Town": "London",
        "Postcode": "SW4 8RA",
        "CountryID": 1,
        "Latitude": 51.455454,
        "Longitude": -0.134705,
        "AccessComments": "",
        "RelatedURL": "https://www.ubitricity.com",
        "DistanceUnit": 0
    },
    "Connections": [
        {
            "ID": 190177,
            "ConnectionTypeID": 25,
            "Reference": "suby1100000544",
            "StatusTypeID": 50,
            "LevelID": 2,
            "Amps": 16,
            "Voltage": 230,
            "PowerKW": 3.7,
            "CurrentTypeID": 10
        }
    ],
    "StatusTypeID": 0,
    "DateLastStatusUpdate": "2021-04-25T05:46:00Z",
    "MetadataValues": [
        {
            "ID": 5609,
            "MetadataFieldID": 4,
            "ItemValue": "Contains public sector information licensed under the Open Government Licence v2.0. http://www.nationalarchives.gov.uk/doc/open-government-licence/version/2/"
        }
    ],
    "DataQualityLevel": 3,
    "DateCreated": "2019-12-24T05:22:00Z",
    "SubmissionStatusTypeID": 100
}