{
    "IsRecentlyVerified": false,
    "ID": 177406,
    "UUID": "2D3592C9-BAE3-460E-8848-1E183995CFA4",
    "DataProviderID": 29,
    "DataProvidersReference": "5460",
    "OperatorID": 69,
    "AddressInfo": {
        "ID": 177765,
        "Title": "Peter-Kreuder-Str. 5a",
        "AddressLine1": "Peter-Kreuder-Str. 5a",
        "Town": "München",
        "Postcode": "80245",
        "CountryID": 87,
        "Latitude": 48.159701,
        "Longitude": 11.445643,
        "DistanceUnit": 0
    },
    "Connections": [
        {
            "ID": 276513,
            "ConnectionTypeID": 25,
            "StatusTypeID": 50,
            "LevelID": 2,
            "PowerKW": 22,
            "CurrentTypeID": 20
        },
        {
            "ID": 276514,
            "ConnectionTypeID": 25,
            "StatusTypeID": 50,
            "LevelID": 2,
            "PowerKW": 22,
            "CurrentTypeID": 20
        }
    ],
    "StatusTypeID": 0,
    "DateLastStatusUpdate": "2021-07-09T03:11:00Z",
    "MetadataValues": [
        {
            "ID": 9700,
            "MetadataFieldID": 4,
            "ItemValue": "Data from the German chargepoint registry provided by Bundesnetzagentur.de under the CC-BY 4.0 license"
        }
    ],
    "DataQualityLevel": 3,
    "DateCreated": "2021-07-08T09:49:00Z",
    "SubmissionStatusTypeID": 100
}