{
    "IsRecentlyVerified": false,
    "ID": 102586,
    "UUID": "BC7EB399-6CA9-44D4-B38B-F2EF6A334C82",
    "DataProviderID": 2,
    "DataProvidersReference": "47549",
    "UsageTypeID": 7,
    "AddressInfo": {
        "ID": 102932,
        "Title": "Nissan of Chesapeake",
        "AddressLine1": "930 Battlefield Blvd",
        "Town": "Chesapeake",
        "StateOrProvince": "VA",
        "Postcode": "23320",
        "CountryID": 2,
        "Latitude": 36.693108,
        "Longitude": -76.232032,
        "ContactTelephone1": "757-436-4900",
        "AccessComments": "Dealership business hours",
        "RelatedURL": "",
        "DistanceUnit": 0
    },
    "Connections": [
        {
            "ID": 144677,
            "ConnectionTypeID": 1,
            "LevelID": 2,
            "Amps": 16,
            "Voltage": 230,
            "PowerKW": 3,
            "CurrentTypeID": 10,
            "Quantity": 1
        },
        {
            "ID": 144678,
            "ConnectionTypeID": 2,
            "LevelID": 2,
            "Amps": 100,
            "Voltage": 400,
            "PowerKW": 40,
            "CurrentTypeID": 10,
            "Quantity": 1
        }
    ],
    "DateLastStatusUpdate": "2019-04-06T04:02:00Z",
    "DataQualityLevel": 3,
    "DateCreated": "2018-04-21T04:13:00Z",
    "SubmissionStatusTypeID": 100
}