{
    "IsRecentlyVerified": false,
    "ID": 179214,
    "UUID": "86B68805-0EB6-4878-8278-56301E684BF6",
    "DataProviderID": 29,
    "DataProvidersReference": "17641",
    "OperatorID": 69,
    "AddressInfo": {
        "ID": 179573,
        "Title": "Carl-Wery-Str. 42a",
        "AddressLine1": "Carl-Wery-Str. 42a",
        "Town": "München",
        "Postcode": "81739",
        "CountryID": 87,
        "Latitude": 48.086988,
        "Longitude": 11.644977,
        "DistanceUnit": 0
    },
    "Connections": [
        {
            "ID": 280723,
            "ConnectionTypeID": 25,
            "StatusTypeID": 50,
            "LevelID": 2,
            "PowerKW": 22,
            "CurrentTypeID": 20
        },
        {
            "ID": 280724,
            "ConnectionTypeID": 25,
            "StatusTypeID": 50,
            "LevelID": 2,
            "PowerKW": 22,
            "CurrentTypeID": 20
        }
    ],
    "StatusTypeID": 50,
    "DateLastStatusUpdate": "2021-07-12T02:40:00Z",
    "MetadataValues": [
        {
            "ID": 11508,
            "MetadataFieldID": 4,
            "ItemValue": "Data from the German chargepoint registry provided by Bundesnetzagentur.de under the CC-BY 4.0 license"
        }
    ],
    "DataQualityLevel": 3,
    "DateCreated": "2021-07-08T09:59:00Z",
    "SubmissionStatusTypeID": 100
}