{
    "IsRecentlyVerified": false,
    "ID": 144065,
    "UUID": "A2D31234-D9A1-46B0-BFB2-6B55FAE5F39D",
    "DataProviderID": 2,
    "DataProvidersReference": "130237",
    "OperatorID": 90,
    "UsageTypeID": 1,
    "AddressInfo": {
        "ID": 144417,
        "Title": "DCFC - Casselman",
        "AddressLine1": "641 Rue Principale",
        "Town": "Casselman",
        "StateOrProvince": "ON",
        "Postcode": "K0A 1M0",
        "CountryID": 44,
        "Latitude": 45.306924,
        "Longitude": -75.083287,
        "ContactTelephone1": "877-505-2674",
        "AccessComments": "24 hours daily",
        "RelatedURL": "https://lecircuitelectrique.com/",
        "DistanceUnit": 0
    },
    "Connections": [
        {
            "ID": 200530,
            "ConnectionTypeID": 2,
            "LevelID": 3,
            "Amps": 100,
            "Voltage": 400,
            "PowerKW": 40,
            "CurrentTypeID": 30,
            "Quantity": 1
        },
        {
            "ID": 200531,
            "ConnectionTypeID": 32,
            "LevelID": 3,
            "Amps": 100,
            "Voltage": 400,
            "PowerKW": 40,
            "CurrentTypeID": 30,
            "Quantity": 1
        }
    ],
    "StatusTypeID": 50,
    "DateLastStatusUpdate": "2020-06-26T03:08:00Z",
    "DataQualityLevel": 3,
    "DateCreated": "2019-12-24T09:22:00Z",
    "SubmissionStatusTypeID": 100
}