{
    "IsRecentlyVerified": false,
    "ID": 122465,
    "UUID": "9930FCE7-9515-4151-B49F-416D7D424FBC",
    "DataProviderID": 2,
    "DataProvidersReference": "70060",
    "UsageTypeID": 2,
    "AddressInfo": {
        "ID": 122811,
        "Title": "Richard H. Chambers United States Courthouse",
        "AddressLine1": "125 S Grand Ave",
        "Town": "Pasadena",
        "StateOrProvince": "CA",
        "Postcode": "91105",
        "CountryID": 2,
        "Latitude": 34.145098,
        "Longitude": -118.162618,
        "ContactTelephone1": "",
        "AccessComments": "Employee use only",
        "RelatedURL": "",
        "DistanceUnit": 0
    },
    "Connections": [
        {
            "ID": 172358,
            "ConnectionTypeID": 1,
            "LevelID": 2,
            "Amps": 16,
            "Voltage": 230,
            "PowerKW": 3.7,
            "CurrentTypeID": 10,
            "Quantity": 2
        }
    ],
    "DateLastStatusUpdate": "2020-06-26T02:57:00Z",
    "DataQualityLevel": 3,
    "DateCreated": "2019-04-06T05:03:00Z",
    "SubmissionStatusTypeID": 100
}