{
    "IsRecentlyVerified": false,
    "ID": 80310,
    "UUID": "F3D68576-03E3-461E-BB02-450E2253DE50",
    "DataProviderID": 2,
    "DataProvidersReference": "80625",
    "UsageTypeID": 1,
    "AddressInfo": {
        "ID": 80656,
        "Title": "Kent State University - Office of Institutional Advancement",
        "AddressLine1": "350 S Lincoln St",
        "Town": "Kent",
        "StateOrProvince": "OH",
        "Postcode": "44242",
        "CountryID": 2,
        "Latitude": 41.150865,
        "Longitude": -81.351347,
        "ContactTelephone1": "330-672-4432",
        "AccessComments": "See front desk for access; maximum session time of 4 hours",
        "RelatedURL": "",
        "DistanceUnit": 0
    },
    "Connections": [
        {
            "ID": 114984,
            "ConnectionTypeID": 1,
            "LevelID": 2,
            "Amps": 16,
            "Voltage": 230,
            "PowerKW": 3.7,
            "CurrentTypeID": 10,
            "Quantity": 1
        }
    ],
    "DateLastStatusUpdate": "2020-06-26T03:04:00Z",
    "DataQualityLevel": 3,
    "DateCreated": "2017-01-31T01:05:00Z",
    "SubmissionStatusTypeID": 100
}