{
    "IsRecentlyVerified": false,
    "ID": 187791,
    "UUID": "5A99D205-D72B-4AAF-BF53-9301882B45A3",
    "DataProviderID": 18,
    "DataProvidersReference": "8a39b68e7dadd5253cc665be50a164ca",
    "UsageTypeID": 5,
    "AddressInfo": {
        "ID": 188150,
        "Title": "Carnarvon Road",
        "AddressLine1": "Carnarvon Road",
        "Town": "Leyton",
        "Postcode": "E10 6DL",
        "CountryID": 1,
        "Latitude": 51.579183,
        "Longitude": -0.003192,
        "AccessComments": "",
        "RelatedURL": "http://www.ev-dot.co.uk/",
        "DistanceUnit": 0
    },
    "Connections": [
        {
            "ID": 303046,
            "ConnectionTypeID": 25,
            "Reference": "Connector 1",
            "StatusTypeID": 50,
            "LevelID": 2,
            "Amps": 32,
            "Voltage": 400,
            "PowerKW": 22,
            "CurrentTypeID": 20
        },
        {
            "ID": 303047,
            "ConnectionTypeID": 25,
            "Reference": "Connector 2",
            "StatusTypeID": 50,
            "LevelID": 2,
            "Amps": 32,
            "Voltage": 400,
            "PowerKW": 22,
            "CurrentTypeID": 20
        }
    ],
    "StatusTypeID": 0,
    "DateLastStatusUpdate": "2021-07-12T03:39:00Z",
    "MetadataValues": [
        {
            "ID": 20031,
            "MetadataFieldID": 4,
            "ItemValue": "Contains public sector information licensed under the Open Government Licence v2.0. http://www.nationalarchives.gov.uk/doc/open-government-licence/version/2/"
        }
    ],
    "DataQualityLevel": 3,
    "DateCreated": "2021-07-12T03:39:00Z",
    "SubmissionStatusTypeID": 100
}