{
    "IsRecentlyVerified": false,
    "ID": 121221,
    "UUID": "4E1BB8BB-91B5-46CB-8588-5E94E75D8693",
    "DataProviderID": 2,
    "DataProvidersReference": "120984",
    "OperatorID": 5,
    "UsageTypeID": 1,
    "AddressInfo": {
        "ID": 121567,
        "Title": "CDA LABORATORY",
        "AddressLine1": "300 S. Technology Ct",
        "Town": "Broomfield",
        "StateOrProvince": "CO",
        "Postcode": "80021",
        "CountryID": 2,
        "Latitude": 39.917497,
        "Longitude": -105.113696,
        "ContactTelephone1": "888-758-4389",
        "AccessComments": "24 hours daily",
        "RelatedURL": "http://www.chargepoint.com/",
        "DistanceUnit": 0
    },
    "Connections": [
        {
            "ID": 170661,
            "ConnectionTypeID": 1,
            "LevelID": 2,
            "Amps": 16,
            "Voltage": 230,
            "PowerKW": 3,
            "CurrentTypeID": 10,
            "Quantity": 4
        }
    ],
    "DateLastStatusUpdate": "2019-04-01T05:00:00Z",
    "DataQualityLevel": 3,
    "DateCreated": "2019-04-01T05:00:00Z",
    "SubmissionStatusTypeID": 100
}