{
    "UserComments": [
        {
            "ID": 24037,
            "ChargePointID": 170000,
            "CommentTypeID": 10,
            "UserName": "ForumElettrico.it",
            "Comment": "A circa 500 mt dall'uscita omonima di Acquasparta della E 45 Orte-Cesena. Leggi la recensione completa qui >  https://www.forumelettrico.it/forum/colonnina-22-kw-be-charge-acquasparta-terni-t9956.html",
            "RelatedURL": "https://www.forumelettrico.it/forum/colonnina-22-kw-be-charge-acquasparta-terni-t9956.html",
            "DateCreated": "2021-03-19T17:24:32.757Z",
            "User": {
                "ID": 11749,
                "Username": "ForumElettrico.it"
            },
            "CheckinStatusTypeID": 140,
            "IsActionedByEditor": false
        }
    ],
    "MediaItems": [
        {
            "ID": 26960,
            "ChargePointID": 170000,
            "ItemURL": "https://s3-ap-southeast-2.amazonaws.com/openchargemap/images/IT/OCM170000/OCM-170000.orig.2021031917244398.jpg",
            "ItemThumbnailURL": "https://s3-ap-southeast-2.amazonaws.com/openchargemap/images/IT/OCM170000/OCM-170000.thmb.2021031917244398.jpg",
            "Comment": "",
            "IsEnabled": true,
            "IsVideo": false,
            "IsFeaturedItem": false,
            "IsExternalResource": false,
            "User": {
                "ID": 11749,
                "Username": "ForumElettrico.it"
            },
            "DateCreated": "2021-03-19T17:25:00Z"
        },
        {
            "ID": 26961,
            "ChargePointID": 170000,
            "ItemURL": "https://s3-ap-southeast-2.amazonaws.com/openchargemap/images/IT/OCM170000/OCM-170000.orig.2021031917245137.jpg",
            "ItemThumbnailURL": "https://s3-ap-southeast-2.amazonaws.com/openchargemap/images/IT/OCM170000/OCM-170000.thmb.2021031917245137.jpg",
            "Comment": "",
            "IsEnabled": true,
            "IsVideo": false,
            "IsFeaturedItem": false,
            "IsExternalResource": false,
            "User": {
                "ID": 11749,
                "Username": "ForumElettrico.it"
            },
            "DateCreated": "2021-03-19T17:25:00Z"
        },
        {
            "ID": 26962,
            "ChargePointID": 170000,
            "ItemURL": "https://s3-ap-southeast-2.amazonaws.com/openchargemap/images/IT/OCM170000/OCM-170000.orig.2021031917245878.jpg",
            "ItemThumbnailURL": "https://s3-ap-southeast-2.amazonaws.com/openchargemap/images/IT/OCM170000/OCM-170000.thmb.2021031917245878.jpg",
            "Comment": "",
            "IsEnabled": true,
            "IsVideo": false,
            "IsFeaturedItem": false,
            "IsExternalResource": false,
            "User": {
                "ID": 11749,
                "Username": "ForumElettrico.it"
            },
            "DateCreated": "2021-03-19T17:25:00Z"
        }
    ],
    "IsRecentlyVerified": false,
    "ID": 170000,
    "UUID": "AC46BBDE-B326-4F62-AC5C-C8A13828FFE0",
    "DataProviderID": 1,
    "OperatorID": 3327,
    "UsageTypeID": 4,
    "AddressInfo": {
        "ID": 170359,
        "Title": "ADS Esso Acquasparta BECHARGE",
        "AddressLine1": "Via Tiberina",
        "Town": "Acquasparta",
        "StateOrProvince": "TR",
        "Postcode": "05021",
        "CountryID": 112,
        "Latitude": 42.68742819440055,
        "Longitude": 12.549396552205053,
        "ContactTelephone1": "02-49527730",
        "ContactEmail": "emobility@buildingenergy.it",
        "RelatedURL": "https://www.bec.energy/",
        "DistanceUnit": 0
    },
    "Connections": [
        {
            "ID": 259121,
            "ConnectionTypeID": 25,
            "StatusTypeID": 50,
            "LevelID": 2,
            "Amps": 32,
            "Voltage": 400,
            "PowerKW": 22,
            "CurrentTypeID": 20,
            "Quantity": 2
        }
    ],
    "NumberOfPoints": 2,
    "StatusTypeID": 50,
    "DateLastStatusUpdate": "2021-03-19T17:25:00Z",
    "DataQualityLevel": 1,
    "DateCreated": "2020-11-16T10:44:00Z",
    "SubmissionStatusTypeID": 200
}