{
    "IsRecentlyVerified": false,
    "ID": 187752,
    "UUID": "CC51F042-7838-4B31-B0BC-4B4B125634F4",
    "DataProviderID": 18,
    "DataProvidersReference": "a4be9b8d247e72e855ddee20c894c055",
    "OperatorID": 2244,
    "UsageTypeID": 5,
    "AddressInfo": {
        "ID": 188111,
        "Title": "3 Dalgarno Way",
        "AddressLine1": "3 Dalgarno Way",
        "Town": "London",
        "Postcode": "W10 5LG",
        "CountryID": 1,
        "Latitude": 51.524182,
        "Longitude": -0.224872,
        "AccessComments": "",
        "RelatedURL": "https://www.ubitricity.com",
        "DistanceUnit": 0
    },
    "Connections": [
        {
            "ID": 302992,
            "ConnectionTypeID": 25,
            "Reference": "suby1100007133",
            "StatusTypeID": 50,
            "LevelID": 2,
            "Amps": 16,
            "Voltage": 230,
            "PowerKW": 3.7,
            "CurrentTypeID": 10
        }
    ],
    "StatusTypeID": 0,
    "DateLastStatusUpdate": "2021-07-12T03:38:00Z",
    "MetadataValues": [
        {
            "ID": 19992,
            "MetadataFieldID": 4,
            "ItemValue": "Contains public sector information licensed under the Open Government Licence v2.0. http://www.nationalarchives.gov.uk/doc/open-government-licence/version/2/"
        }
    ],
    "DataQualityLevel": 3,
    "DateCreated": "2021-07-12T03:38:00Z",
    "SubmissionStatusTypeID": 100
}