{
    "IsRecentlyVerified": false,
    "ID": 17371,
    "UUID": "2A8C2A36-AE24-4CA7-9047-5FA4BDECA95B",
    "DataProviderID": 22,
    "DataProvidersReference": "FB6A4114C5D63FC0BE8286359AFF72CE",
    "AddressInfo": {
        "ID": 17716,
        "Title": "エコール・リラショッピングセンター",
        "AddressLine1": "兵庫県神戸市北区藤原台中町1-2-2",
        "CountryID": 114,
        "Latitude": 34.82115612,
        "Longitude": 135.2195134,
        "ContactTelephone1": "078-322-5305",
        "DistanceUnit": 0
    },
    "Connections": [
        {
            "ID": 17612,
            "ConnectionTypeID": 2,
            "LevelID": 2,
            "Amps": 100,
            "Voltage": 480,
            "PowerKW": 48,
            "Quantity": 1
        }
    ],
    "DateLastStatusUpdate": "2013-06-29T08:57:00Z",
    "DataQualityLevel": 2,
    "DateCreated": "2013-06-29T08:57:00Z",
    "SubmissionStatusTypeID": 200
}