{
    "IsRecentlyVerified": false,
    "ID": 32858,
    "UUID": "B06557D2-ACF4-4F48-A488-D971BDEB5CC8",
    "DataProviderID": 1,
    "OperatorID": 105,
    "OperatorsReference": "Essent EM-DE-05170024-01-00002",
    "UsageTypeID": 4,
    "AddressInfo": {
        "ID": 33204,
        "Title": "Uerdinger Straße 31",
        "AddressLine1": "Uerdinger Straße 31",
        "Town": "Moers",
        "Postcode": "47441",
        "CountryID": 87,
        "Latitude": 51.447816,
        "Longitude": 6.632268,
        "DistanceUnit": 0
    },
    "Connections": [
        {
            "ID": 36369,
            "ConnectionTypeID": 25,
            "LevelID": 2,
            "PowerKW": 11
        },
        {
            "ID": 46562,
            "ConnectionTypeID": 25,
            "LevelID": 2,
            "PowerKW": 11
        }
    ],
    "NumberOfPoints": 1,
    "StatusTypeID": 50,
    "DateLastStatusUpdate": "2015-04-13T17:34:00Z",
    "DataQualityLevel": 3,
    "DateCreated": "2015-01-09T06:03:00Z",
    "SubmissionStatusTypeID": 200
}