{
    "IsRecentlyVerified": false,
    "ID": 185866,
    "UUID": "CC4636A9-8443-4FB0-9005-EA14F380C0AC",
    "DataProviderID": 29,
    "DataProvidersReference": "14158",
    "AddressInfo": {
        "ID": 186225,
        "Title": "Ecke Brückenstraße/Breitensteinweg",
        "AddressLine1": "Ecke Brückenstraße/Breitensteinweg",
        "Town": "Eberbach",
        "Postcode": "69412",
        "CountryID": 87,
        "Latitude": 49.461069,
        "Longitude": 8.987824,
        "DistanceUnit": 0
    },
    "Connections": [
        {
            "ID": 297032,
            "ConnectionTypeID": 28,
            "StatusTypeID": 50,
            "LevelID": 2,
            "PowerKW": 22,
            "CurrentTypeID": 20
        },
        {
            "ID": 297033,
            "ConnectionTypeID": 25,
            "StatusTypeID": 50,
            "LevelID": 2,
            "PowerKW": 22,
            "CurrentTypeID": 20
        },
        {
            "ID": 297034,
            "ConnectionTypeID": 28,
            "StatusTypeID": 50,
            "LevelID": 2,
            "PowerKW": 22,
            "CurrentTypeID": 20
        },
        {
            "ID": 297035,
            "ConnectionTypeID": 25,
            "StatusTypeID": 50,
            "LevelID": 2,
            "PowerKW": 22,
            "CurrentTypeID": 20
        }
    ],
    "StatusTypeID": 50,
    "DateLastStatusUpdate": "2021-07-12T02:43:00Z",
    "MetadataValues": [
        {
            "ID": 18108,
            "MetadataFieldID": 4,
            "ItemValue": "Data from the German chargepoint registry provided by Bundesnetzagentur.de under the CC-BY 4.0 license"
        }
    ],
    "DataQualityLevel": 3,
    "DateCreated": "2021-07-12T02:43:00Z",
    "SubmissionStatusTypeID": 100
}