{
    "UserComments": [
        {
            "ID": 19146,
            "ChargePointID": 51385,
            "CommentTypeID": 10,
            "UserName": "Simon Hewison",
            "Comment": "CYC card accepted. Right hand post. Parking ticket machines were both faulty. 3 hours free parking.",
            "Rating": 4,
            "DateCreated": "2018-02-02T10:55:25.457Z",
            "User": {
                "ID": 4575,
                "Username": "Simon Hewison"
            },
            "CheckinStatusTypeID": 10
        },
        {
            "ID": 7862,
            "ChargePointID": 51385,
            "CommentTypeID": 10,
            "UserName": "Simon Hewison",
            "Comment": "CYC card accepted. 13A socket. ",
            "Rating": 4,
            "DateCreated": "2015-10-27T20:12:57.657Z",
            "User": {
                "ID": 4575,
                "Username": "Simon Hewison"
            },
            "CheckinStatusTypeID": 10
        },
        {
            "ID": 6008,
            "ChargePointID": 51385,
            "CommentTypeID": 10,
            "UserName": "Simon Hewison",
            "Comment": "An unexpected bonus. Unmarked posts, accepted CYC card",
            "Rating": 3,
            "DateCreated": "2015-07-24T14:56:56.34Z",
            "User": {
                "ID": 4575,
                "Username": "Simon Hewison"
            },
            "CheckinStatusTypeID": 10
        }
    ],
    "IsRecentlyVerified": false,
    "ID": 51385,
    "UUID": "A573C353-826D-4D96-927A-51C9677DE216",
    "DataProviderID": 1,
    "OperatorID": 20,
    "UsageTypeID": 4,
    "UsageCost": "Free",
    "AddressInfo": {
        "ID": 51731,
        "Title": "Finchley Memorial Hospital",
        "AddressLine1": "Granville Place",
        "AddressLine2": "North Finchley",
        "Town": "London",
        "StateOrProvince": "England",
        "Postcode": "N12 0GL",
        "CountryID": 1,
        "Latitude": 51.6063506783767,
        "Longitude": -0.176575183868408,
        "AccessComments": "in the main car park. 3 hours free parking with ticket",
        "DistanceUnit": 0
    },
    "Connections": [
        {
            "ID": 63632,
            "ConnectionTypeID": 3,
            "StatusTypeID": 50,
            "LevelID": 2,
            "Amps": 13,
            "Voltage": 230,
            "PowerKW": 3,
            "CurrentTypeID": 10,
            "Quantity": 3
        }
    ],
    "NumberOfPoints": 3,
    "GeneralComments": "Three Elektromotive Classic posts. one in disabled parking bay.",
    "StatusTypeID": 50,
    "DateLastStatusUpdate": "2018-02-02T10:55:00Z",
    "DataQualityLevel": 1,
    "DateCreated": "2015-05-23T10:15:00Z",
    "SubmissionStatusTypeID": 200
}