{
    "IsRecentlyVerified": false,
    "ID": 168355,
    "UUID": "7CC38C86-1B33-417A-AA49-C5E66CF12D92",
    "DataProviderID": 1,
    "OperatorID": 23,
    "OperatorsReference": "54567",
    "UsageTypeID": 4,
    "AddressInfo": {
        "ID": 168714,
        "Title": "Hotel Ali Baba",
        "AddressLine1": "Namestie Slobody 51",
        "Town": "Humenne",
        "Postcode": "066 01 ",
        "CountryID": 204,
        "Latitude": 48.932242,
        "Longitude": 21.910467,
        "ContactTelephone1": "+421 57 487 20 00",
        "DistanceUnit": 0
    },
    "Connections": [
        {
            "ID": 255684,
            "ConnectionTypeID": 30,
            "StatusTypeID": 50,
            "LevelID": 2,
            "PowerKW": 14,
            "CurrentTypeID": 20,
            "Quantity": 2
        }
    ],
    "NumberOfPoints": 2,
    "GeneralComments": "Charging2 Tesla Connector, up to 14kW.Available for customers. Self park.",
    "StatusTypeID": 50,
    "DateLastStatusUpdate": "2020-09-23T05:28:00Z",
    "DataQualityLevel": 1,
    "DateCreated": "2020-09-23T05:28:00Z",
    "SubmissionStatusTypeID": 200
}