{
    "IsRecentlyVerified": false,
    "ID": 130056,
    "UUID": "52DD1929-F3C5-497F-82FD-6D4C0C06AA21",
    "DataProviderID": 1,
    "OperatorID": 3299,
    "UsageTypeID": 1,
    "AddressInfo": {
        "ID": 130402,
        "Title": "IONITY Neuenkirch",
        "AddressLine1": "Rastanlage Neuenkirch, A2, 6023 Rothenburg, Schweiz",
        "Town": "Rothenburg",
        "Postcode": "6023",
        "CountryID": 217,
        "Latitude": 47.113372,
        "Longitude": 8.232328,
        "DistanceUnit": 0
    },
    "Connections": [
        {
            "ID": 182047,
            "ConnectionTypeID": 33,
            "StatusTypeID": 50,
            "LevelID": 3,
            "PowerKW": 350,
            "CurrentTypeID": 30,
            "Quantity": 6
        }
    ],
    "NumberOfPoints": 6,
    "StatusTypeID": 50,
    "DateLastStatusUpdate": "2019-08-01T21:46:00Z",
    "DataQualityLevel": 1,
    "DateCreated": "2019-07-30T13:00:00Z",
    "SubmissionStatusTypeID": 200
}