{
    "IsRecentlyVerified": false,
    "ID": 159096,
    "UUID": "AA6ED15F-8D61-4D3F-88A1-D88140650DC8",
    "DataProviderID": 2,
    "DataProvidersReference": "156368",
    "OperatorID": 5,
    "UsageTypeID": 1,
    "AddressInfo": {
        "ID": 159453,
        "Title": "THADEN SCHOOL",
        "AddressLine1": "417 SW 10th St",
        "Town": "Bentonville",
        "StateOrProvince": "AR",
        "Postcode": "72712",
        "CountryID": 2,
        "Latitude": 36.36149,
        "Longitude": -94.20492,
        "ContactTelephone1": "888-758-4389",
        "AccessComments": "24 hours daily",
        "RelatedURL": "http://www.chargepoint.com/",
        "DistanceUnit": 0
    },
    "Connections": [
        {
            "ID": 229177,
            "ConnectionTypeID": 1,
            "LevelID": 2,
            "Amps": 16,
            "Voltage": 230,
            "PowerKW": 3.7,
            "CurrentTypeID": 10,
            "Quantity": 2
        }
    ],
    "StatusTypeID": 50,
    "DateLastStatusUpdate": "2020-06-26T02:58:00Z",
    "DataQualityLevel": 3,
    "DateCreated": "2020-06-26T02:58:00Z",
    "SubmissionStatusTypeID": 100
}