{
    "IsRecentlyVerified": false,
    "ID": 133848,
    "UUID": "AFE8F024-48EB-40B7-A045-9729ED3C8B8F",
    "DataProviderID": 1,
    "OperatorID": 3296,
    "UsageTypeID": 5,
    "UsageCost": "£0.40/kWh",
    "AddressInfo": {
        "ID": 134194,
        "Title": "Booths Ulverston",
        "AddressLine1": "Canal Street",
        "AddressLine2": "Ulverston",
        "Town": "South Lakeland",
        "StateOrProvince": "Cumbria",
        "Postcode": "LA12 7LA",
        "CountryID": 1,
        "Latitude": 54.1989273594283,
        "Longitude": -3.08164627425685,
        "DistanceUnit": 0
    },
    "Connections": [
        {
            "ID": 187306,
            "ConnectionTypeID": 2,
            "StatusTypeID": 50,
            "LevelID": 3,
            "PowerKW": 50,
            "CurrentTypeID": 30,
            "Quantity": 2
        },
        {
            "ID": 187307,
            "ConnectionTypeID": 33,
            "StatusTypeID": 50,
            "LevelID": 3,
            "PowerKW": 50,
            "CurrentTypeID": 30,
            "Quantity": 2
        }
    ],
    "NumberOfPoints": 2,
    "StatusTypeID": 50,
    "DateLastStatusUpdate": "2021-05-26T10:33:00Z",
    "DataQualityLevel": 1,
    "DateCreated": "2019-10-28T16:56:00Z",
    "SubmissionStatusTypeID": 200
}