{
    "IsRecentlyVerified": false,
    "ID": 110653,
    "UUID": "12BCCAE2-815F-4DC0-9E08-1FBDE68C9A8B",
    "DataProviderID": 2,
    "DataProvidersReference": "84177",
    "UsageTypeID": 1,
    "AddressInfo": {
        "ID": 110999,
        "Title": "Mastronardi Produce",
        "AddressLine1": "2100 Rd 4 E",
        "Town": "Kingsville",
        "StateOrProvince": "ON",
        "Postcode": "N9Y 2E5",
        "CountryID": 44,
        "Latitude": 42.0738707540659,
        "Longitude": -82.648533586853,
        "ContactTelephone1": "519-326-3218",
        "AccessComments": "For guest use only",
        "RelatedURL": "",
        "DistanceUnit": 0
    },
    "Connections": [
        {
            "ID": 155924,
            "ConnectionTypeID": 1,
            "LevelID": 2,
            "Amps": 16,
            "Voltage": 230,
            "PowerKW": 3.7,
            "CurrentTypeID": 10,
            "Quantity": 3
        }
    ],
    "DateLastStatusUpdate": "2020-06-26T03:05:00Z",
    "DataQualityLevel": 3,
    "DateCreated": "2018-10-18T23:36:00Z",
    "SubmissionStatusTypeID": 100
}