{
    "IsRecentlyVerified": false,
    "ID": 176916,
    "UUID": "6507C41B-1F5E-446D-A9BC-F11D6757A239",
    "DataProviderID": 29,
    "DataProvidersReference": "14013",
    "AddressInfo": {
        "ID": 177275,
        "Title": "Saarbrücker Straße 179",
        "AddressLine1": "Saarbrücker Straße 179",
        "Town": "Völklingen",
        "Postcode": "66333",
        "CountryID": 87,
        "Latitude": 49.248123,
        "Longitude": 6.886058,
        "DistanceUnit": 0
    },
    "Connections": [
        {
            "ID": 275437,
            "ConnectionTypeID": 25,
            "StatusTypeID": 50,
            "LevelID": 2,
            "PowerKW": 22,
            "CurrentTypeID": 20
        },
        {
            "ID": 275438,
            "ConnectionTypeID": 1036,
            "StatusTypeID": 50,
            "LevelID": 2,
            "PowerKW": 22,
            "CurrentTypeID": 20
        },
        {
            "ID": 296780,
            "ConnectionTypeID": 25,
            "StatusTypeID": 50,
            "LevelID": 2,
            "PowerKW": 22,
            "CurrentTypeID": 20
        },
        {
            "ID": 296781,
            "ConnectionTypeID": 1036,
            "StatusTypeID": 50,
            "LevelID": 2,
            "PowerKW": 22,
            "CurrentTypeID": 20
        }
    ],
    "StatusTypeID": 0,
    "DateLastStatusUpdate": "2021-07-12T02:42:00Z",
    "MetadataValues": [
        {
            "ID": 9211,
            "MetadataFieldID": 4,
            "ItemValue": "Data from the German chargepoint registry provided by Bundesnetzagentur.de under the CC-BY 4.0 license"
        }
    ],
    "DataQualityLevel": 3,
    "DateCreated": "2021-07-08T09:48:00Z",
    "SubmissionStatusTypeID": 100
}