{
    "IsRecentlyVerified": false,
    "ID": 112860,
    "UUID": "472E2854-CBB0-4A47-A7F9-08B3C3C9A60B",
    "DataProviderID": 1,
    "OperatorID": 80,
    "UsageTypeID": 4,
    "AddressInfo": {
        "ID": 113206,
        "Title": "Cremona Piscina Comunale | EnelX",
        "AddressLine1": "Piazzale Atleti Azzurri D'Italia",
        "Town": "Cremona",
        "StateOrProvince": "CR",
        "Postcode": "26100",
        "CountryID": 112,
        "Latitude": 45.1282534601881,
        "Longitude": 10.004142104078,
        "ContactTelephone1": "800.069.850",
        "RelatedURL": "https://www.enelx.com/it/it/emobility",
        "DistanceUnit": 0
    },
    "Connections": [
        {
            "ID": 158954,
            "ConnectionTypeID": 25,
            "StatusTypeID": 50,
            "LevelID": 2,
            "Amps": 32,
            "Voltage": 400,
            "PowerKW": 22,
            "CurrentTypeID": 20,
            "Quantity": 2
        }
    ],
    "NumberOfPoints": 2,
    "StatusTypeID": 50,
    "DateLastStatusUpdate": "2019-03-04T15:46:00Z",
    "DataQualityLevel": 1,
    "DateCreated": "2018-11-21T14:21:00Z",
    "SubmissionStatusTypeID": 200
}