{
    "IsRecentlyVerified": false,
    "ID": 145427,
    "UUID": "F7782C66-0801-4566-B0D6-618D184BD8DE",
    "DataProviderID": 2,
    "DataProvidersReference": "146922",
    "OperatorID": 59,
    "UsageTypeID": 1,
    "AddressInfo": {
        "ID": 145779,
        "Title": "Greenlots - 143001",
        "AddressLine1": "5323 MN-61",
        "Town": "Lutsen",
        "StateOrProvince": "MN",
        "Postcode": "55612",
        "CountryID": 2,
        "Latitude": 47.6474838256836,
        "Longitude": -90.6743469238281,
        "ContactTelephone1": "855-900-7584",
        "AccessComments": "24 hours daily",
        "RelatedURL": "http://greenlots.com/",
        "DistanceUnit": 0
    },
    "Connections": [
        {
            "ID": 202095,
            "ConnectionTypeID": 2,
            "LevelID": 3,
            "Amps": 100,
            "Voltage": 400,
            "PowerKW": 40,
            "CurrentTypeID": 30,
            "Quantity": 1
        },
        {
            "ID": 202096,
            "ConnectionTypeID": 32,
            "LevelID": 3,
            "Amps": 100,
            "Voltage": 400,
            "PowerKW": 40,
            "CurrentTypeID": 30,
            "Quantity": 1
        }
    ],
    "StatusTypeID": 50,
    "DateLastStatusUpdate": "2020-06-26T03:11:00Z",
    "DataQualityLevel": 3,
    "DateCreated": "2019-12-24T09:24:00Z",
    "SubmissionStatusTypeID": 100
}