{
    "IsRecentlyVerified": false,
    "ID": 95585,
    "UUID": "22928B58-812E-43E0-8867-02592F7F1203",
    "DataProviderID": 1,
    "OperatorID": 45,
    "UsageTypeID": 1,
    "AddressInfo": {
        "ID": 95931,
        "Title": "Lüttfeld Berufskolleg",
        "AddressLine1": "Lüttfeld 1",
        "Town": "Lemgo",
        "StateOrProvince": "Kreis Lippe",
        "Postcode": "32657",
        "CountryID": 87,
        "Latitude": 52.01941,
        "Longitude": 8.910370000000057,
        "ContactTelephone1": "+49 526 180701",
        "AccessComments": "Der linke Säulenanschluss ist ohne Ladekarte nutzbar ; einfach einstecken. Ansonsten zum Laden im Sekretariat melden; dort kann eine Ladekarte geliehen werden.",
        "DistanceUnit": 0
    },
    "Connections": [
        {
            "ID": 135394,
            "ConnectionTypeID": 25,
            "StatusTypeID": 50,
            "LevelID": 2,
            "Amps": 32,
            "Voltage": 400,
            "PowerKW": 22,
            "CurrentTypeID": 20,
            "Quantity": 2
        }
    ],
    "NumberOfPoints": 2,
    "StatusTypeID": 50,
    "DateLastStatusUpdate": "2017-11-13T15:11:00Z",
    "DataQualityLevel": 1,
    "DateCreated": "2017-11-13T15:11:00Z",
    "SubmissionStatusTypeID": 200
}