{
    "IsRecentlyVerified": false,
    "ID": 143769,
    "UUID": "07F1B3E1-E5FE-40F1-95C6-F2F11DA1E903",
    "DataProviderID": 2,
    "DataProvidersReference": "143486",
    "OperatorID": 5,
    "UsageTypeID": 1,
    "AddressInfo": {
        "ID": 144121,
        "Title": "CT4020-HD-GW",
        "AddressLine1": "7559 Court St",
        "Town": "Elizabethtown",
        "StateOrProvince": "NY",
        "Postcode": "12932",
        "CountryID": 2,
        "Latitude": 44.215187,
        "Longitude": -73.59424,
        "ContactTelephone1": "888-758-4389",
        "AccessComments": "24 hours daily",
        "RelatedURL": "http://www.chargepoint.com/",
        "DistanceUnit": 0
    },
    "Connections": [
        {
            "ID": 200164,
            "ConnectionTypeID": 1,
            "LevelID": 2,
            "Amps": 16,
            "Voltage": 230,
            "PowerKW": 3.7,
            "CurrentTypeID": 10,
            "Quantity": 2
        }
    ],
    "StatusTypeID": 50,
    "DateLastStatusUpdate": "2020-06-26T03:07:00Z",
    "DataQualityLevel": 3,
    "DateCreated": "2019-12-24T09:22:00Z",
    "SubmissionStatusTypeID": 100
}