{
    "IsRecentlyVerified": false,
    "ID": 39153,
    "UUID": "93DF7D2F-2FA0-47BC-BBA1-B7F4C7007CEA",
    "DataProviderID": 26,
    "DataProvidersReference": "47019",
    "OperatorID": 178,
    "OperatorsReference": "EVnetNL AL156",
    "UsageCost": "0.00 jaarabonnement",
    "AddressInfo": {
        "ID": 39499,
        "Title": "Jan Jacobsweg",
        "AddressLine1": "Jan Jacobsweg",
        "Town": "Ameland",
        "Postcode": "9161 BW",
        "CountryID": 159,
        "Latitude": 53.441401,
        "Longitude": 5.634636,
        "ContactTelephone1": "0800-3522365",
        "RelatedURL": "http://www.evnet.nl",
        "DistanceUnit": 0
    },
    "Connections": [
        {
            "ID": 42664,
            "ConnectionTypeID": 25,
            "LevelID": 2,
            "PowerKW": 11,
            "CurrentTypeID": 10
        }
    ],
    "NumberOfPoints": 1,
    "StatusTypeID": 50,
    "DateLastStatusUpdate": "2016-06-04T02:56:00Z",
    "DataQualityLevel": 3,
    "DateCreated": "2015-01-09T06:08:00Z",
    "SubmissionStatusTypeID": 100
}