{
    "UserComments": [
        {
            "ID": 24535,
            "ChargePointID": 176217,
            "CommentTypeID": 10,
            "UserName": "ForumElettrico.it",
            "Comment": "Bisogna prestare attenzione alla sbarra, che viene aperta 15 minuti prima del supermercato e chiude 15 minuti dopo. Leggi la recensione completa qui >  https://www.forumelettrico.it/forum/colonnina-enel-x-20-kw-conad-modena-mo-via-ludwig-van-beethoven-60-t18829.html",
            "RelatedURL": "https://www.forumelettrico.it/forum/colonnina-enel-x-20-kw-conad-modena-mo-via-ludwig-van-beethoven-60-t18829.html",
            "DateCreated": "2021-07-01T09:14:10.783Z",
            "User": {
                "ID": 11749,
                "Username": "ForumElettrico.it"
            },
            "CheckinStatusTypeID": 10,
            "IsActionedByEditor": false
        }
    ],
    "MediaItems": [
        {
            "ID": 28391,
            "ChargePointID": 176217,
            "ItemURL": "https://s3-ap-southeast-2.amazonaws.com/openchargemap/images/IT/OCM176217/OCM-176217.orig.2021070109142908.jpg",
            "ItemThumbnailURL": "https://s3-ap-southeast-2.amazonaws.com/openchargemap/images/IT/OCM176217/OCM-176217.thmb.2021070109142908.jpg",
            "Comment": "",
            "IsEnabled": true,
            "IsVideo": false,
            "IsFeaturedItem": false,
            "IsExternalResource": false,
            "User": {
                "ID": 11749,
                "Username": "ForumElettrico.it"
            },
            "DateCreated": "2021-07-01T09:15:00Z"
        },
        {
            "ID": 28392,
            "ChargePointID": 176217,
            "ItemURL": "https://s3-ap-southeast-2.amazonaws.com/openchargemap/images/IT/OCM176217/OCM-176217.orig.2021070109143582.jpg",
            "ItemThumbnailURL": "https://s3-ap-southeast-2.amazonaws.com/openchargemap/images/IT/OCM176217/OCM-176217.thmb.2021070109143582.jpg",
            "Comment": "",
            "IsEnabled": true,
            "IsVideo": false,
            "IsFeaturedItem": false,
            "IsExternalResource": false,
            "User": {
                "ID": 11749,
                "Username": "ForumElettrico.it"
            },
            "DateCreated": "2021-07-01T09:15:00Z"
        },
        {
            "ID": 28393,
            "ChargePointID": 176217,
            "ItemURL": "https://s3-ap-southeast-2.amazonaws.com/openchargemap/images/IT/OCM176217/OCM-176217.orig.2021070109144233.jpg",
            "ItemThumbnailURL": "https://s3-ap-southeast-2.amazonaws.com/openchargemap/images/IT/OCM176217/OCM-176217.thmb.2021070109144233.jpg",
            "Comment": "",
            "IsEnabled": true,
            "IsVideo": false,
            "IsFeaturedItem": false,
            "IsExternalResource": false,
            "User": {
                "ID": 11749,
                "Username": "ForumElettrico.it"
            },
            "DateCreated": "2021-07-01T09:15:00Z"
        },
        {
            "ID": 28394,
            "ChargePointID": 176217,
            "ItemURL": "https://s3-ap-southeast-2.amazonaws.com/openchargemap/images/IT/OCM176217/OCM-176217.orig.2021070109144881.jpg",
            "ItemThumbnailURL": "https://s3-ap-southeast-2.amazonaws.com/openchargemap/images/IT/OCM176217/OCM-176217.thmb.2021070109144881.jpg",
            "Comment": "",
            "IsEnabled": true,
            "IsVideo": false,
            "IsFeaturedItem": false,
            "IsExternalResource": false,
            "User": {
                "ID": 11749,
                "Username": "ForumElettrico.it"
            },
            "DateCreated": "2021-07-01T09:15:00Z"
        },
        {
            "ID": 28390,
            "ChargePointID": 176217,
            "ItemURL": "https://s3-ap-southeast-2.amazonaws.com/openchargemap/images/IT/OCM176217/OCM-176217.orig.2021070109142208.jpg",
            "ItemThumbnailURL": "https://s3-ap-southeast-2.amazonaws.com/openchargemap/images/IT/OCM176217/OCM-176217.thmb.2021070109142208.jpg",
            "Comment": "",
            "IsEnabled": true,
            "IsVideo": false,
            "IsFeaturedItem": false,
            "IsExternalResource": false,
            "User": {
                "ID": 11749,
                "Username": "ForumElettrico.it"
            },
            "DateCreated": "2021-07-01T09:14:00Z"
        }
    ],
    "IsRecentlyVerified": false,
    "ID": 176217,
    "UUID": "578F87B2-6F55-4A42-BD4A-FF183E0251C0",
    "DataProviderID": 1,
    "OperatorID": 80,
    "UsageTypeID": 1,
    "AddressInfo": {
        "ID": 176576,
        "Title": "Enel X Conad",
        "AddressLine1": "Via Ludwig Van Beethoven 60",
        "Town": "Modena",
        "StateOrProvince": "MO",
        "CountryID": 112,
        "Latitude": 44.634528,
        "Longitude": 10.969068,
        "RelatedURL": "https://www.forumelettrico.it/forum/colonnina-enel-x-20-kw-conad-modena-mo-via-ludwig-van-beethoven-60-t18829.html",
        "DistanceUnit": 0
    },
    "Connections": [
        {
            "ID": 273851,
            "ConnectionTypeID": 25,
            "LevelID": 2,
            "PowerKW": 20,
            "Quantity": 1
        },
        {
            "ID": 273852,
            "ConnectionTypeID": 36,
            "LevelID": 2,
            "PowerKW": 3
        }
    ],
    "NumberOfPoints": 1,
    "StatusTypeID": 50,
    "DateLastStatusUpdate": "2021-07-01T09:15:00Z",
    "DataQualityLevel": 1,
    "DateCreated": "2021-07-01T09:14:00Z",
    "SubmissionStatusTypeID": 200
}