{
    "IsRecentlyVerified": false,
    "ID": 135441,
    "UUID": "4FBE71D7-3F96-42B2-A706-C8DE26481736",
    "DataProviderID": 1,
    "OperatorID": 108,
    "UsageTypeID": 1,
    "UsageCost": "€0.34/kWh",
    "AddressInfo": {
        "ID": 135787,
        "Title": "Sterappelstraat ",
        "AddressLine1": "Sterappelstraat 46",
        "Town": "Den haag",
        "CountryID": 159,
        "Latitude": 52.06545893864143,
        "Longitude": 4.255977912920798,
        "DistanceUnit": 0
    },
    "Connections": [
        {
            "ID": 189777,
            "ConnectionTypeID": 25,
            "StatusTypeID": 50,
            "LevelID": 2,
            "Amps": 32,
            "Voltage": 400,
            "PowerKW": 22,
            "CurrentTypeID": 20,
            "Quantity": 2
        }
    ],
    "NumberOfPoints": 2,
    "StatusTypeID": 50,
    "DateLastStatusUpdate": "2019-12-21T17:21:00Z",
    "DataQualityLevel": 1,
    "DateCreated": "2019-12-21T08:21:00Z",
    "SubmissionStatusTypeID": 200
}