{
    "UserComments": [
        {
            "ID": 24517,
            "ChargePointID": 176014,
            "CommentTypeID": 10,
            "UserName": "xester",
            "Rating": 5,
            "DateCreated": "2021-06-22T15:52:18.343Z",
            "User": {
                "ID": 6169,
                "Username": "xester"
            },
            "CheckinStatusTypeID": 10,
            "IsActionedByEditor": false
        }
    ],
    "IsRecentlyVerified": false,
    "ID": 176014,
    "UUID": "2F5FABA7-36F4-4E33-8E68-793852DD27CB",
    "DataProviderID": 1,
    "OperatorID": 1,
    "UsageTypeID": 4,
    "AddressInfo": {
        "ID": 176373,
        "Title": "Hotel Puerta de la Serranía",
        "AddressLine1": "Carr. de Valencia-Ademuz, km 32, 5",
        "Town": "Llíria",
        "StateOrProvince": "Valencia",
        "Postcode": "46160",
        "CountryID": 210,
        "Latitude": 39.65700263315813,
        "Longitude": -0.6499759608526574,
        "RelatedURL": "http://www.puertadelaserrania.com",
        "DistanceUnit": 0
    },
    "Connections": [
        {
            "ID": 273423,
            "ConnectionTypeID": 2,
            "StatusTypeID": 50,
            "LevelID": 3,
            "Amps": 125,
            "Voltage": 400,
            "PowerKW": 50,
            "CurrentTypeID": 30,
            "Quantity": 1
        },
        {
            "ID": 273424,
            "ConnectionTypeID": 33,
            "StatusTypeID": 50,
            "LevelID": 3,
            "Amps": 125,
            "Voltage": 400,
            "PowerKW": 50,
            "CurrentTypeID": 30,
            "Quantity": 1
        },
        {
            "ID": 273425,
            "ConnectionTypeID": 1036,
            "StatusTypeID": 50,
            "LevelID": 3,
            "Amps": 64,
            "Voltage": 400,
            "PowerKW": 43,
            "CurrentTypeID": 20,
            "Quantity": 1
        },
        {
            "ID": 273426,
            "ConnectionTypeID": 25,
            "StatusTypeID": 50,
            "LevelID": 2,
            "Amps": 32,
            "Voltage": 400,
            "PowerKW": 22,
            "CurrentTypeID": 20,
            "Quantity": 2
        }
    ],
    "NumberOfPoints": 4,
    "StatusTypeID": 50,
    "DateLastStatusUpdate": "2021-06-22T15:52:00Z",
    "DataQualityLevel": 1,
    "DateCreated": "2021-06-22T14:30:00Z",
    "SubmissionStatusTypeID": 200
}