{
    "IsRecentlyVerified": false,
    "ID": 137148,
    "UUID": "5E8F72AE-DEB2-4D83-9923-7F09F0B00B07",
    "DataProviderID": 1,
    "DataProvidersReference": "VNG-00030",
    "OperatorID": 21,
    "UsageTypeID": 4,
    "UsageCost": "Mobi.E compatible card",
    "AddressInfo": {
        "ID": 137494,
        "Title": "VNG-00030",
        "AddressLine1": "Rua das Lages",
        "Town": "Vila Nova de Gaia",
        "StateOrProvince": "Porto",
        "Postcode": "4410-303",
        "CountryID": 180,
        "Latitude": 41.087008,
        "Longitude": -8.602542,
        "RelatedURL": "http://www.mobie.pt",
        "DistanceUnit": 0
    },
    "Connections": [
        {
            "ID": 192005,
            "ConnectionTypeID": 25,
            "StatusTypeID": 50,
            "LevelID": 2,
            "Amps": 32,
            "Voltage": 230,
            "PowerKW": 7.4,
            "CurrentTypeID": 10,
            "Quantity": 1
        }
    ],
    "NumberOfPoints": 1,
    "StatusTypeID": 50,
    "DateLastStatusUpdate": "2020-10-09T14:34:00Z",
    "DataQualityLevel": 3,
    "DateCreated": "2019-12-24T08:09:00Z",
    "SubmissionStatusTypeID": 100
}