{
    "IsRecentlyVerified": false,
    "ID": 107127,
    "UUID": "9846D691-9800-4E26-B212-394B0A90CD1C",
    "DataProviderID": 1,
    "OperatorID": 3315,
    "OperatorsReference": "51409",
    "UsageTypeID": 4,
    "UsageCost": "Free",
    "AddressInfo": {
        "ID": 107473,
        "Title": "Hansel, Murdoch House",
        "AddressLine1": "Broadmeadowa",
        "Town": "Symington",
        "Postcode": "KA1 5PU",
        "CountryID": 1,
        "Latitude": 55.53809,
        "Longitude": -4.56919,
        "DistanceUnit": 0
    },
    "Connections": [
        {
            "ID": 151058,
            "ConnectionTypeID": 25,
            "StatusTypeID": 50,
            "LevelID": 2,
            "Amps": 32,
            "Voltage": 400,
            "PowerKW": 22,
            "CurrentTypeID": 20,
            "Quantity": 2
        }
    ],
    "NumberOfPoints": 2,
    "StatusTypeID": 50,
    "DateLastStatusUpdate": "2018-07-20T05:15:00Z",
    "DataQualityLevel": 1,
    "DateCreated": "2018-07-20T05:15:00Z",
    "SubmissionStatusTypeID": 200
}