{
    "IsRecentlyVerified": false,
    "ID": 173561,
    "UUID": "B82CC1D5-6723-4731-A71E-91D0C28EF18C",
    "DataProviderID": 18,
    "DataProvidersReference": "f4e7110c212f9527e399c038cf7302f4",
    "OperatorID": 2244,
    "UsageTypeID": 5,
    "AddressInfo": {
        "ID": 173920,
        "Title": "40 Grove End Road",
        "AddressLine1": "40 Grove End Road",
        "Town": "London",
        "Postcode": "NW8 9NE",
        "CountryID": 1,
        "Latitude": 51.532218,
        "Longitude": -0.17682,
        "AccessComments": "",
        "RelatedURL": "https://www.ubitricity.com",
        "DistanceUnit": 0
    },
    "Connections": [
        {
            "ID": 266626,
            "ConnectionTypeID": 25,
            "Reference": "suby1100006632",
            "StatusTypeID": 50,
            "LevelID": 2,
            "Amps": 16,
            "Voltage": 230,
            "PowerKW": 3.7,
            "CurrentTypeID": 10
        }
    ],
    "StatusTypeID": 0,
    "DateLastStatusUpdate": "2021-04-25T05:46:00Z",
    "MetadataValues": [
        {
            "ID": 8483,
            "MetadataFieldID": 4,
            "ItemValue": "Contains public sector information licensed under the Open Government Licence v2.0. http://www.nationalarchives.gov.uk/doc/open-government-licence/version/2/"
        }
    ],
    "DataQualityLevel": 3,
    "DateCreated": "2021-03-03T11:25:00Z",
    "SubmissionStatusTypeID": 100
}