{
    "IsRecentlyVerified": false,
    "ID": 16288,
    "UUID": "8E027EE7-C9AC-4AA8-90F6-D35832D00763",
    "DataProviderID": 1,
    "OperatorID": 45,
    "UsageTypeID": 5,
    "UsageCost": "Free",
    "AddressInfo": {
        "ID": 16633,
        "Title": "Goderich St Carpark - City of Perth Parking",
        "AddressLine1": "133 Goderich Street",
        "AddressLine2": "East Perth",
        "Town": "Perth",
        "StateOrProvince": "WA",
        "Postcode": "6004",
        "CountryID": 18,
        "Latitude": -31.957191,
        "Longitude": 115.87013200000001,
        "ContactTelephone1": "",
        "ContactTelephone2": "",
        "ContactEmail": "",
        "AccessComments": "",
        "RelatedURL": "",
        "DistanceUnit": 0
    },
    "Connections": [
        {
            "ID": 14745,
            "ConnectionTypeID": 1041,
            "StatusTypeID": 50,
            "LevelID": 2,
            "Amps": 32,
            "Voltage": 415,
            "PowerKW": 22,
            "CurrentTypeID": 20,
            "Quantity": 1
        }
    ],
    "NumberOfPoints": 1,
    "GeneralComments": "not officially an ev spot",
    "StatusTypeID": 50,
    "DateLastStatusUpdate": "2020-05-20T01:02:00Z",
    "DataQualityLevel": 1,
    "DateCreated": "2013-03-28T09:36:00Z",
    "SubmissionStatusTypeID": 200
}