{
    "IsRecentlyVerified": false,
    "ID": 29193,
    "UUID": "5502C954-71E8-4CA4-A27B-6D69B3D4761C",
    "DataProviderID": 2,
    "DataProvidersReference": "44298",
    "UsageTypeID": 2,
    "AddressInfo": {
        "ID": 29539,
        "Title": "Traverse City Auto Plaza",
        "AddressLine1": "1331 S Garfield Ave",
        "Town": "Traverse City",
        "StateOrProvince": "MI",
        "Postcode": "49686",
        "CountryID": 2,
        "Latitude": 44.743331,
        "Longitude": -85.594781,
        "ContactTelephone1": "231-946-5540",
        "AccessComments": "",
        "RelatedURL": "",
        "DistanceUnit": 0
    },
    "Connections": [
        {
            "ID": 32084,
            "ConnectionTypeID": 1,
            "LevelID": 2,
            "Amps": 16,
            "Voltage": 230,
            "PowerKW": 3.7,
            "CurrentTypeID": 10,
            "Quantity": 1
        }
    ],
    "DateLastStatusUpdate": "2020-06-26T03:08:00Z",
    "DataQualityLevel": 3,
    "DateCreated": "2014-11-28T03:39:00Z",
    "SubmissionStatusTypeID": 100
}