{
    "IsRecentlyVerified": false,
    "ID": 149370,
    "UUID": "63EE099A-5D62-4EBB-8CCC-B035F0C868D4",
    "DataProviderID": 1,
    "OperatorID": 1241,
    "UsageTypeID": 6,
    "AddressInfo": {
        "ID": 149723,
        "Title": "Lyrath Estate Hotel",
        "AddressLine1": "Dublin Road,",
        "AddressLine2": "Lyrath,",
        "Town": "Kilkenny",
        "StateOrProvince": "County Kilkenny",
        "Postcode": "R95 F685",
        "CountryID": 3,
        "Latitude": 52.647390926459195,
        "Longitude": -7.195435924003505,
        "DistanceUnit": 0
    },
    "Connections": [
        {
            "ID": 207388,
            "ConnectionTypeID": 25,
            "StatusTypeID": 50,
            "LevelID": 2,
            "PowerKW": 17.3,
            "CurrentTypeID": 20,
            "Quantity": 1
        }
    ],
    "NumberOfPoints": 2,
    "GeneralComments": "One charging point with two parking bays.\r\nFree to use, but charging must be initiated using an EasyGo account.",
    "StatusTypeID": 50,
    "DateLastStatusUpdate": "2020-02-24T07:47:00Z",
    "DataQualityLevel": 1,
    "DateCreated": "2020-02-23T22:33:00Z",
    "SubmissionStatusTypeID": 200
}