{
    "IsRecentlyVerified": false,
    "ID": 35150,
    "UUID": "856B1658-7D23-464C-BB63-08320E61FCA1",
    "DataProviderID": 26,
    "DataProvidersReference": "56059",
    "OperatorID": 157,
    "OperatorsReference": "NewMotion 02010836",
    "UsageCost": "0.00 jaarabonnement",
    "AddressInfo": {
        "ID": 35496,
        "Title": "Benedeneind Zuidzijde 251",
        "AddressLine1": "Benedeneind Zuidzijde 251",
        "Town": "Lopik",
        "Postcode": "3405 CJ",
        "CountryID": 159,
        "Latitude": 52.0051918029785,
        "Longitude": 4.96086454391479,
        "ContactTelephone1": "088 0109500",
        "RelatedURL": "http://thenewmotion.nl/",
        "DistanceUnit": 0
    },
    "Connections": [
        {
            "ID": 38661,
            "ConnectionTypeID": 25,
            "LevelID": 2,
            "PowerKW": 3.7,
            "CurrentTypeID": 10
        }
    ],
    "NumberOfPoints": 1,
    "StatusTypeID": 50,
    "DateLastStatusUpdate": "2016-06-04T02:43:00Z",
    "DataQualityLevel": 3,
    "DateCreated": "2015-01-09T06:04:00Z",
    "SubmissionStatusTypeID": 100
}