{
    "IsRecentlyVerified": false,
    "ID": 50604,
    "UUID": "9932481F-BC2D-4EB2-AF25-A92B3036566F",
    "DataProviderID": 26,
    "DataProvidersReference": "64116",
    "OperatorID": 178,
    "OperatorsReference": "EVnetNL PNB-REE0107",
    "UsageCost": "0.00 jaarabonnement",
    "AddressInfo": {
        "ID": 50950,
        "Title": "Karel Martelweg",
        "AddressLine1": "Karel Martelweg",
        "Town": "Eindhoven",
        "Postcode": "5616 JJ",
        "CountryID": 159,
        "Latitude": 51.434396,
        "Longitude": 5.457947,
        "ContactTelephone1": "0800-3522365",
        "RelatedURL": "http://www.evnet.nl",
        "DistanceUnit": 0
    },
    "Connections": [
        {
            "ID": 62374,
            "ConnectionTypeID": 25,
            "LevelID": 2,
            "PowerKW": 11,
            "CurrentTypeID": 10
        }
    ],
    "NumberOfPoints": 1,
    "StatusTypeID": 50,
    "DateLastStatusUpdate": "2016-06-04T02:39:00Z",
    "DataQualityLevel": 3,
    "DateCreated": "2015-07-22T09:53:00Z",
    "SubmissionStatusTypeID": 100
}