{
    "IsRecentlyVerified": false,
    "ID": 121180,
    "UUID": "1828302E-9852-4392-877C-AF7E7E4E0DC9",
    "DataProviderID": 2,
    "DataProvidersReference": "118896",
    "OperatorID": 5,
    "UsageTypeID": 1,
    "AddressInfo": {
        "ID": 121526,
        "Title": "PGE GREEN FUELS",
        "AddressLine1": "1100 S 27th St",
        "Town": "Richmond",
        "StateOrProvince": "CA",
        "Postcode": "94804",
        "CountryID": 2,
        "Latitude": 37.9156442,
        "Longitude": -122.3433497,
        "ContactTelephone1": "888-758-4389",
        "AccessComments": "24 hours daily",
        "RelatedURL": "http://www.chargepoint.com/",
        "DistanceUnit": 0
    },
    "Connections": [
        {
            "ID": 170617,
            "ConnectionTypeID": 1,
            "LevelID": 2,
            "Amps": 16,
            "Voltage": 230,
            "PowerKW": 3,
            "CurrentTypeID": 10,
            "Quantity": 1
        }
    ],
    "DateLastStatusUpdate": "2019-12-24T09:14:00Z",
    "DataQualityLevel": 3,
    "DateCreated": "2019-04-01T04:59:00Z",
    "SubmissionStatusTypeID": 100
}