{
    "IsRecentlyVerified": false,
    "ID": 45602,
    "UUID": "E8C5D0D7-FCCA-4837-8219-336E38E962C1",
    "DataProviderID": 1,
    "DataProvidersReference": "2720",
    "AddressInfo": {
        "ID": 45948,
        "Title": "Snabbladdning Giraffen",
        "AddressLine1": "Polhemsgatan ",
        "Town": "KALMAR",
        "StateOrProvince": "KALMAR",
        "Postcode": "39239",
        "CountryID": 216,
        "Latitude": 56.66961,
        "Longitude": 16.34049,
        "AccessComments": "Laddstationen finns på parkeringen på köpcentret Giraffen.",
        "DistanceUnit": 0
    },
    "Connections": [
        {
            "ID": 56265,
            "ConnectionTypeID": 0,
            "Reference": "1",
            "LevelID": 2,
            "Amps": 100,
            "Voltage": 500,
            "PowerKW": 50,
            "Comments": "Mode 4"
        }
    ],
    "NumberOfPoints": 1,
    "DateLastStatusUpdate": "2020-05-26T08:21:00Z",
    "DataQualityLevel": 2,
    "DateCreated": "2015-05-03T00:54:00Z",
    "SubmissionStatusTypeID": 100
}