{
    "IsRecentlyVerified": false,
    "ID": 13408,
    "UUID": "D728D6B0-9DD4-4865-8D27-917CEBE52D3D",
    "DataProviderID": 15,
    "DataProvidersReference": "23666",
    "OperatorID": 1,
    "UsageTypeID": 1,
    "AddressInfo": {
        "ID": 13305,
        "Title": "217 Road East 85",
        "AddressLine1": "217 Road East 85",
        "Town": "Ogallala",
        "StateOrProvince": "NE",
        "Postcode": "69153",
        "CountryID": 2,
        "Latitude": 41.112913,
        "Longitude": -101.707039,
        "ContactTelephone1": "(308) 284-4327",
        "RelatedURL": "http://carstations.com/23666",
        "DistanceUnit": 0
    },
    "Connections": [
        {
            "ID": 10860,
            "ConnectionTypeID": 0,
            "Reference": "RVHOOKUPS"
        }
    ],
    "NumberOfPoints": 1,
    "StatusTypeID": 50,
    "DateLastStatusUpdate": "2017-11-04T14:04:00Z",
    "DataQualityLevel": 2,
    "DateCreated": "2012-10-03T04:32:00Z",
    "SubmissionStatusTypeID": 100
}