{
    "UserComments": [
        {
            "ID": 20589,
            "ChargePointID": 5532,
            "CommentTypeID": 10,
            "UserName": "Clive ",
            "Comment": "Have not been working for about 8 years. Quite a good car park and at 70p per hour not too expensive .",
            "Rating": 4,
            "DateCreated": "2019-01-03T12:36:01Z",
            "User": {
                "ID": 9176,
                "Username": "Clive "
            }
        },
        {
            "ID": 8385,
            "ChargePointID": 5532,
            "CommentTypeID": 10,
            "UserName": "Simon Hewison",
            "Comment": "Confirmed from car park management that the company that provided them (e-On) cut the supply off without informing the car park management, and they're looking into other options to continue to provide electric car charging.",
            "Rating": 2,
            "DateCreated": "2015-12-31T16:41:36.543Z",
            "User": {
                "ID": 4575,
                "Username": "Simon Hewison"
            },
            "CheckinStatusTypeID": 0
        },
        {
            "ID": 8348,
            "ChargePointID": 5532,
            "CommentTypeID": 10,
            "UserName": "Robert Malcolm Kay",
            "Comment": "Car park privatised and the four three pin plug sockets do not work and are ICED",
            "Rating": 1,
            "DateCreated": "2015-12-28T18:51:00.47Z",
            "User": {
                "ID": 4751,
                "Username": "Robert Malcolm Kay"
            },
            "CheckinStatusTypeID": 25
        }
    ],
    "IsRecentlyVerified": false,
    "ID": 5532,
    "UUID": "CBBCECCA-A311-4945-897C-BFAF4512ED51",
    "DataProviderID": 1,
    "OperatorID": 45,
    "UsageTypeID": 1,
    "AddressInfo": {
        "ID": 5470,
        "Title": "Belgrade Plaza Car Park",
        "AddressLine1": "Ryley street",
        "Town": "Coventry",
        "StateOrProvince": "West Midlands",
        "Postcode": "CV1 4AJ",
        "CountryID": 1,
        "Latitude": 52.4099502,
        "Longitude": -1.5166815,
        "ContactTelephone1": "024 7618 3180",
        "ContactEmail": "info@belgradeplaza.co.uk",
        "RelatedURL": "http://www.belgradeplaza.co.uk/park/additional-services/",
        "DistanceUnit": 0
    },
    "Connections": [
        {
            "ID": 73495,
            "ConnectionTypeID": 3,
            "StatusTypeID": 100,
            "LevelID": 2,
            "Amps": 13,
            "Voltage": 230,
            "PowerKW": 3,
            "CurrentTypeID": 10,
            "Quantity": 4
        }
    ],
    "NumberOfPoints": 1,
    "StatusTypeID": 100,
    "DateLastStatusUpdate": "2019-01-03T12:36:00Z",
    "DataQualityLevel": 1,
    "DateCreated": "2011-08-29T11:42:00Z",
    "SubmissionStatusTypeID": 200
}