{
    "IsRecentlyVerified": false,
    "ID": 71309,
    "UUID": "37A4BDAB-F15D-49B5-85E8-ADFFF9656814",
    "DataProviderID": 1,
    "OperatorID": 23,
    "OperatorsReference": "19524",
    "UsageTypeID": 1,
    "UsageCost": "Free",
    "AddressInfo": {
        "ID": 71655,
        "Title": "Ayres Inn - Tesla",
        "AddressLine1": "2260 Griffin Way",
        "Town": "Corona",
        "StateOrProvince": "CA",
        "Postcode": "92879",
        "CountryID": 2,
        "Latitude": 33.8881749,
        "Longitude": -117.5165239,
        "ContactTelephone1": "951-734-2140  877-798-3752",
        "AccessComments": "24 hours daily; for Tesla use only; for guest use only; see front desk for access",
        "RelatedURL": "http://www.teslamotors.com/supercharger",
        "DistanceUnit": 0
    },
    "Connections": [
        {
            "ID": 102119,
            "ConnectionTypeID": 30,
            "StatusTypeID": 50,
            "LevelID": 2,
            "Amps": 16,
            "Voltage": 230,
            "PowerKW": 16,
            "CurrentTypeID": 10,
            "Quantity": 3
        }
    ],
    "NumberOfPoints": 3,
    "StatusTypeID": 50,
    "DateLastStatusUpdate": "2017-01-31T19:49:00Z",
    "DataQualityLevel": 3,
    "DateCreated": "2016-09-02T10:14:00Z",
    "SubmissionStatusTypeID": 100
}