{
    "IsRecentlyVerified": false,
    "ID": 175492,
    "UUID": "DAA77C0B-51A5-4B27-8C7F-374547958A54",
    "DataProviderID": 1,
    "OperatorID": 21,
    "UsageTypeID": 4,
    "UsageCost": "Mobi.E compatible card or App",
    "AddressInfo": {
        "ID": 175851,
        "Title": "MFR-00013/14 - Intermarché",
        "AddressLine1": "",
        "Town": "Ericeira",
        "StateOrProvince": "Lisboa",
        "Postcode": "",
        "CountryID": 180,
        "Latitude": 38.96610534218297,
        "Longitude": -9.407624270422275,
        "AccessComments": "Intermarché",
        "DistanceUnit": 0
    },
    "Connections": [
        {
            "ID": 272352,
            "ConnectionTypeID": 2,
            "StatusTypeID": 50,
            "LevelID": 3,
            "Amps": 120,
            "Voltage": 500,
            "PowerKW": 50,
            "CurrentTypeID": 30,
            "Quantity": 1
        },
        {
            "ID": 272353,
            "ConnectionTypeID": 33,
            "StatusTypeID": 50,
            "LevelID": 3,
            "Amps": 125,
            "Voltage": 500,
            "PowerKW": 50,
            "CurrentTypeID": 30,
            "Quantity": 1
        },
        {
            "ID": 272354,
            "ConnectionTypeID": 1036,
            "StatusTypeID": 50,
            "LevelID": 3,
            "Amps": 64,
            "Voltage": 400,
            "PowerKW": 43,
            "CurrentTypeID": 20,
            "Quantity": 1
        },
        {
            "ID": 272355,
            "ConnectionTypeID": 25,
            "StatusTypeID": 50,
            "LevelID": 2,
            "Amps": 32,
            "Voltage": 400,
            "PowerKW": 22,
            "CurrentTypeID": 20,
            "Quantity": 2
        }
    ],
    "NumberOfPoints": 4,
    "StatusTypeID": 50,
    "DateLastStatusUpdate": "2021-05-23T15:12:00Z",
    "DataQualityLevel": 1,
    "DateCreated": "2021-05-23T15:12:00Z",
    "SubmissionStatusTypeID": 200
}