{
    "IsRecentlyVerified": false,
    "ID": 179259,
    "UUID": "9735DABC-6112-4274-BF74-35E1EB26C82C",
    "DataProviderID": 29,
    "DataProvidersReference": "9779,1837",
    "AddressInfo": {
        "ID": 179618,
        "Title": "Bahnhofstr. 21-29",
        "AddressLine1": "Bahnhofstr. 21-29",
        "Town": "Pirmasens",
        "Postcode": "66953",
        "CountryID": 87,
        "Latitude": 49.202036,
        "Longitude": 7.60140471,
        "DistanceUnit": 0
    },
    "Connections": [
        {
            "ID": 280817,
            "ConnectionTypeID": 25,
            "StatusTypeID": 50,
            "LevelID": 2,
            "PowerKW": 11,
            "CurrentTypeID": 20
        },
        {
            "ID": 280818,
            "ConnectionTypeID": 25,
            "StatusTypeID": 50,
            "LevelID": 2,
            "PowerKW": 11,
            "CurrentTypeID": 20
        },
        {
            "ID": 280819,
            "ConnectionTypeID": 25,
            "StatusTypeID": 50,
            "LevelID": 2,
            "PowerKW": 22,
            "CurrentTypeID": 20
        },
        {
            "ID": 280820,
            "ConnectionTypeID": 25,
            "StatusTypeID": 50,
            "LevelID": 2,
            "PowerKW": 22,
            "CurrentTypeID": 20
        }
    ],
    "StatusTypeID": 50,
    "DateLastStatusUpdate": "2021-07-09T03:15:00Z",
    "MetadataValues": [
        {
            "ID": 11553,
            "MetadataFieldID": 4,
            "ItemValue": "Data from the German chargepoint registry provided by Bundesnetzagentur.de under the CC-BY 4.0 license"
        }
    ],
    "DataQualityLevel": 3,
    "DateCreated": "2021-07-08T09:59:00Z",
    "SubmissionStatusTypeID": 100
}