{
    "IsRecentlyVerified": false,
    "ID": 20674,
    "UUID": "35C0A2CC-453F-40EF-8407-0961CCEBA7F9",
    "DataProviderID": 1,
    "OperatorID": 23,
    "OperatorsReference": "6517",
    "UsageTypeID": 1,
    "UsageCost": "$0.24/min >=60kW; $0.12/min <60kW; other tariffs for older cars",
    "AddressInfo": {
        "ID": 21019,
        "Title": "Panera Bread - Tesla",
        "AddressLine1": "3260 Niles Rd",
        "Town": "St. Joseph",
        "StateOrProvince": "MI",
        "Postcode": "49085",
        "CountryID": 2,
        "Latitude": 42.056717,
        "Longitude": -86.456695,
        "ContactTelephone1": "877-798-3752",
        "AccessComments": "24 hours daily; for Tesla use only",
        "RelatedURL": "http://www.teslamotors.com/supercharger",
        "DistanceUnit": 0
    },
    "Connections": [
        {
            "ID": 22496,
            "ConnectionTypeID": 27,
            "StatusTypeID": 50,
            "LevelID": 3,
            "Amps": 100,
            "Voltage": 400,
            "PowerKW": 120,
            "CurrentTypeID": 30,
            "Quantity": 8
        }
    ],
    "NumberOfPoints": 8,
    "StatusTypeID": 50,
    "DateLastStatusUpdate": "2018-03-13T13:38:00Z",
    "DataQualityLevel": 3,
    "DateCreated": "2013-12-18T04:57:00Z",
    "SubmissionStatusTypeID": 100
}