{
    "IsRecentlyVerified": false,
    "ID": 136192,
    "UUID": "9A3AD252-D836-4DC1-8A60-E9F20DF3E22D",
    "DataProviderID": 18,
    "DataProvidersReference": "b70652de9dffc827c434fb750d80909c",
    "OperatorID": 2244,
    "UsageTypeID": 4,
    "AddressInfo": {
        "ID": 136538,
        "Title": "Abinger Road",
        "AddressLine1": "Abinger Road",
        "Town": "London",
        "Postcode": "W4 1EL",
        "CountryID": 1,
        "Latitude": 51.498075,
        "Longitude": -0.250538,
        "AccessComments": "",
        "RelatedURL": "https://www.ubitricity.com",
        "DistanceUnit": 0
    },
    "Connections": [
        {
            "ID": 190621,
            "ConnectionTypeID": 25,
            "Reference": "suby1100000683",
            "StatusTypeID": 50,
            "LevelID": 2,
            "Amps": 16,
            "Voltage": 230,
            "PowerKW": 3.7,
            "CurrentTypeID": 10
        }
    ],
    "StatusTypeID": 0,
    "DateLastStatusUpdate": "2021-04-25T05:46:00Z",
    "MetadataValues": [
        {
            "ID": 6044,
            "MetadataFieldID": 4,
            "ItemValue": "Contains public sector information licensed under the Open Government Licence v2.0. http://www.nationalarchives.gov.uk/doc/open-government-licence/version/2/"
        }
    ],
    "DataQualityLevel": 3,
    "DateCreated": "2019-12-24T05:22:00Z",
    "SubmissionStatusTypeID": 100
}