{
    "IsRecentlyVerified": false,
    "ID": 149780,
    "UUID": "D9749DB0-39A5-4D3C-8EEA-06F332B762BA",
    "DataProviderID": 18,
    "DataProvidersReference": "e825661002f7af7d86cded8bec649466",
    "OperatorID": 3391,
    "UsageTypeID": 1,
    "AddressInfo": {
        "ID": 150133,
        "Title": "Richardson Road",
        "AddressLine1": "Richardson Road",
        "Town": "Brighton",
        "Postcode": "BN3 5RB",
        "CountryID": 1,
        "Latitude": 50.831282,
        "Longitude": -0.188074,
        "AccessComments": "",
        "RelatedURL": "https://www.electricblueuk.com/",
        "DistanceUnit": 0
    },
    "Connections": [
        {
            "ID": 207953,
            "ConnectionTypeID": 25,
            "Reference": "62196-2 (SINGLE PHASE)",
            "StatusTypeID": 50,
            "LevelID": 2,
            "Amps": 16,
            "Voltage": 230,
            "PowerKW": 3.7,
            "CurrentTypeID": 10
        }
    ],
    "StatusTypeID": 0,
    "DateLastStatusUpdate": "2020-03-17T08:53:00Z",
    "MetadataValues": [
        {
            "ID": 7041,
            "MetadataFieldID": 4,
            "ItemValue": "Contains public sector information licensed under the Open Government Licence v2.0. http://www.nationalarchives.gov.uk/doc/open-government-licence/version/2/"
        }
    ],
    "DataQualityLevel": 3,
    "DateCreated": "2020-03-05T14:22:00Z",
    "SubmissionStatusTypeID": 100
}