{
    "IsRecentlyVerified": false,
    "ID": 160740,
    "UUID": "29A90DFB-4830-44BA-BCC9-AA01AA8110DD",
    "DataProviderID": 2,
    "DataProvidersReference": "157815",
    "UsageTypeID": 2,
    "AddressInfo": {
        "ID": 161097,
        "Title": "Federated Co-operatives Ltd (FCL)",
        "AddressLine1": "3425 Roblin Blvd",
        "Town": "Winnipeg",
        "StateOrProvince": "MB",
        "Postcode": "R3R 0C6",
        "CountryID": 44,
        "Latitude": 49.8688695,
        "Longitude": -97.2602167,
        "ContactTelephone1": "",
        "AccessComments": "",
        "RelatedURL": "",
        "DistanceUnit": 0
    },
    "Connections": [
        {
            "ID": 231320,
            "ConnectionTypeID": 2,
            "LevelID": 3,
            "Amps": 100,
            "Voltage": 400,
            "PowerKW": 40,
            "CurrentTypeID": 30,
            "Quantity": 1
        },
        {
            "ID": 231321,
            "ConnectionTypeID": 32,
            "LevelID": 3,
            "Amps": 100,
            "Voltage": 400,
            "PowerKW": 40,
            "CurrentTypeID": 30,
            "Quantity": 1
        }
    ],
    "GeneralComments": "Planned for future date. Not Operational.",
    "DatePlanned": "2020-09-01T00:00:00Z",
    "StatusTypeID": 150,
    "DateLastStatusUpdate": "2020-06-26T03:12:00Z",
    "DataQualityLevel": 3,
    "DateCreated": "2020-06-26T03:12:00Z",
    "SubmissionStatusTypeID": 100
}