{
    "MediaItems": [
        {
            "ID": 12804,
            "ChargePointID": 88658,
            "ItemURL": "https://s3-ap-southeast-2.amazonaws.com/openchargemap/images/PL/OCM88658/OCM-88658.orig.2017060709411786.jpg",
            "ItemThumbnailURL": "https://s3-ap-southeast-2.amazonaws.com/openchargemap/images/PL/OCM88658/OCM-88658.thmb.2017060709411786.jpg",
            "Comment": "",
            "IsEnabled": true,
            "IsVideo": false,
            "IsFeaturedItem": false,
            "IsExternalResource": false,
            "User": {
                "ID": 12269,
                "Username": "Alphabet PL"
            },
            "DateCreated": "2017-06-07T09:41:00Z"
        }
    ],
    "IsRecentlyVerified": false,
    "ID": 88658,
    "UUID": "A6779168-3CAD-4085-874D-8990E2D0D1F3",
    "DataProviderID": 1,
    "OperatorID": 38,
    "UsageTypeID": 1,
    "AddressInfo": {
        "ID": 89004,
        "Title": "Lidl Warszawa",
        "AddressLine1": "Zabłocka 4",
        "Town": "Warszawa",
        "StateOrProvince": "Mazowieckie",
        "Postcode": "03-194",
        "CountryID": 179,
        "Latitude": 52.303849,
        "Longitude": 20.987065,
        "DistanceUnit": 0
    },
    "Connections": [
        {
            "ID": 125749,
            "ConnectionTypeID": 2,
            "LevelID": 3,
            "PowerKW": 50,
            "CurrentTypeID": 30,
            "Quantity": 1
        },
        {
            "ID": 125750,
            "ConnectionTypeID": 33,
            "LevelID": 3,
            "PowerKW": 50,
            "CurrentTypeID": 30,
            "Quantity": 1
        },
        {
            "ID": 125751,
            "ConnectionTypeID": 25,
            "LevelID": 3,
            "PowerKW": 43,
            "CurrentTypeID": 20,
            "Quantity": 1
        }
    ],
    "NumberOfPoints": 3,
    "StatusTypeID": 50,
    "DateLastStatusUpdate": "2017-06-07T18:40:00Z",
    "DataQualityLevel": 1,
    "DateCreated": "2017-06-07T09:41:00Z",
    "SubmissionStatusTypeID": 200
}