{
    "IsRecentlyVerified": false,
    "ID": 17642,
    "UUID": "6FBFA6DD-62A1-4597-A5B6-7A87F0319E5A",
    "DataProviderID": 22,
    "DataProvidersReference": "5075DC36E6FB5B2F19A38AC28D8A7FCA",
    "AddressInfo": {
        "ID": 17987,
        "Title": "栃木銀行陽南支店",
        "AddressLine1": "栃木県宇都宮市宮本町17-7",
        "CountryID": 114,
        "Latitude": 36.52864902,
        "Longitude": 139.8624297,
        "ContactTelephone1": "028-658-1261",
        "DistanceUnit": 0
    },
    "Connections": [
        {
            "ID": 17883,
            "ConnectionTypeID": 2,
            "LevelID": 2,
            "Amps": 100,
            "Voltage": 480,
            "PowerKW": 48,
            "Quantity": 1
        }
    ],
    "DateLastStatusUpdate": "2013-06-29T09:01:00Z",
    "DataQualityLevel": 2,
    "DateCreated": "2013-06-29T09:01:00Z",
    "SubmissionStatusTypeID": 200
}