{
    "IsRecentlyVerified": false,
    "ID": 10499,
    "UUID": "1BACE2B4-0561-4B23-8F1B-836292714661",
    "DataProviderID": 15,
    "DataProvidersReference": "18496",
    "OperatorID": 5,
    "AddressInfo": {
        "ID": 10396,
        "Title": "7 Cambridge Center",
        "AddressLine1": "7 Cambridge Center",
        "Town": "Mid-Cambridge",
        "StateOrProvince": "Massachusetts",
        "Postcode": "02142",
        "CountryID": 2,
        "Latitude": 42.36314392,
        "Longitude": -71.08908081,
        "ContactTelephone1": "(877) 717-0004",
        "RelatedURL": "http://carstations.com/18496",
        "DistanceUnit": 0
    },
    "Connections": [
        {
            "ID": 8449,
            "ConnectionTypeID": 1,
            "Reference": "J1772",
            "LevelID": 2
        },
        {
            "ID": 9044,
            "ConnectionTypeID": 9,
            "Reference": "NEMA5",
            "LevelID": 1,
            "Quantity": 1
        }
    ],
    "StatusTypeID": 0,
    "DateLastStatusUpdate": "2017-11-04T14:04:00Z",
    "DataQualityLevel": 2,
    "DateCreated": "2012-05-28T15:37:00Z",
    "SubmissionStatusTypeID": 100
}