{
    "IsRecentlyVerified": false,
    "ID": 147757,
    "UUID": "11EE61BA-E237-4EF1-88F9-3425FC320597",
    "DataProviderID": 1,
    "OperatorID": 80,
    "UsageTypeID": 4,
    "AddressInfo": {
        "ID": 148109,
        "Title": "Castelfidardo Murri | EnelX",
        "AddressLine1": "Via Romolo Murri",
        "Town": "Castelfidardo",
        "StateOrProvince": "AN",
        "Postcode": "60022",
        "CountryID": 112,
        "Latitude": 43.4701790085669,
        "Longitude": 13.571918564249017,
        "ContactTelephone1": "800.069.850",
        "RelatedURL": "https://www.enelx.com/it/it/emobility",
        "DistanceUnit": 0
    },
    "Connections": [
        {
            "ID": 205098,
            "ConnectionTypeID": 25,
            "StatusTypeID": 50,
            "LevelID": 2,
            "Amps": 32,
            "Voltage": 400,
            "PowerKW": 22,
            "CurrentTypeID": 20,
            "Quantity": 2
        }
    ],
    "NumberOfPoints": 2,
    "StatusTypeID": 50,
    "DateLastStatusUpdate": "2020-01-16T11:30:00Z",
    "DataQualityLevel": 1,
    "DateCreated": "2020-01-16T11:30:00Z",
    "SubmissionStatusTypeID": 200
}