{
    "IsRecentlyVerified": false,
    "ID": 37540,
    "UUID": "8044309E-476C-45D5-A08C-20C5D56FA0C0",
    "DataProviderID": 26,
    "DataProvidersReference": "57459",
    "OperatorID": 157,
    "OperatorsReference": "NewMotion ICUEVE000504",
    "UsageCost": "0.00 jaarabonnement",
    "AddressInfo": {
        "ID": 37886,
        "Title": "Hendrikje Stoffelsstraat 2A",
        "AddressLine1": "Hendrikje Stoffelsstraat 2A",
        "Town": "Amsterdam",
        "Postcode": "1058 GC",
        "CountryID": 159,
        "Latitude": 52.3572654724121,
        "Longitude": 4.84424686431885,
        "ContactTelephone1": "088 0109500",
        "RelatedURL": "http://thenewmotion.nl/",
        "DistanceUnit": 0
    },
    "Connections": [
        {
            "ID": 41051,
            "ConnectionTypeID": 25,
            "LevelID": 2,
            "PowerKW": 22,
            "CurrentTypeID": 10
        }
    ],
    "NumberOfPoints": 2,
    "StatusTypeID": 50,
    "DateLastStatusUpdate": "2016-06-04T02:53:00Z",
    "DataQualityLevel": 3,
    "DateCreated": "2015-01-09T06:07:00Z",
    "SubmissionStatusTypeID": 100
}