{
    "IsRecentlyVerified": false,
    "ID": 111338,
    "UUID": "37E6986D-B428-414D-AB21-9EBD9F8162E3",
    "DataProviderID": 2,
    "DataProvidersReference": "83652",
    "UsageTypeID": 1,
    "AddressInfo": {
        "ID": 111684,
        "Title": "Parrsboro Town Hall",
        "AddressLine1": "4030 Eastern Ave",
        "Town": "Parrsboro",
        "StateOrProvince": "NS",
        "Postcode": "B0M 1S0",
        "CountryID": 44,
        "Latitude": 45.406473,
        "Longitude": -64.325486,
        "ContactTelephone1": "902-254-2036",
        "AccessComments": "24 hours daily",
        "RelatedURL": "",
        "DistanceUnit": 0
    },
    "Connections": [
        {
            "ID": 156744,
            "ConnectionTypeID": 1,
            "LevelID": 2,
            "Amps": 16,
            "Voltage": 230,
            "PowerKW": 3.7,
            "CurrentTypeID": 10,
            "Quantity": 1
        }
    ],
    "DateLastStatusUpdate": "2020-06-26T03:09:00Z",
    "DataQualityLevel": 3,
    "DateCreated": "2018-10-18T23:37:00Z",
    "SubmissionStatusTypeID": 100
}