{
    "IsRecentlyVerified": false,
    "ID": 74097,
    "UUID": "EA4608D7-095C-4A76-B65B-6804859FA37C",
    "DataProviderID": 1,
    "OperatorID": 89,
    "OperatorsReference": "CEA-479",
    "UsageTypeID": 4,
    "UsageCost": "CAD 1.00/hour",
    "AddressInfo": {
        "ID": 74443,
        "Title": "St-Hubert-Mirabel",
        "AddressLine1": "17525 chemin Charles",
        "Town": "Mirabel",
        "StateOrProvince": "QC",
        "Postcode": "J7J 1P3",
        "CountryID": 44,
        "Latitude": 45.694949,
        "Longitude": -73.93684,
        "DistanceUnit": 0
    },
    "Connections": [
        {
            "ID": 106421,
            "ConnectionTypeID": 1,
            "StatusTypeID": 50,
            "LevelID": 2,
            "Amps": 32,
            "Voltage": 230,
            "PowerKW": 7,
            "CurrentTypeID": 10,
            "Quantity": 1
        }
    ],
    "NumberOfPoints": 1,
    "StatusTypeID": 50,
    "DateLastStatusUpdate": "2016-11-27T11:54:00Z",
    "DataQualityLevel": 1,
    "DateCreated": "2016-11-24T00:17:00Z",
    "SubmissionStatusTypeID": 200
}