{
    "IsRecentlyVerified": false,
    "ID": 14258,
    "UUID": "E4EC830F-C21D-485E-9A8C-66D16F34F597",
    "DataProviderID": 2,
    "DataProvidersReference": "46603",
    "UsageTypeID": 7,
    "AddressInfo": {
        "ID": 14155,
        "Title": "Renaissance Orlando at SeaWorld",
        "AddressLine1": "6677 Sea Harbor Dr",
        "Town": "Orlando",
        "StateOrProvince": "FL",
        "Postcode": "32821",
        "CountryID": 2,
        "Latitude": 28.411709,
        "Longitude": -81.467094,
        "ContactTelephone1": "407-351-5555",
        "AccessComments": "24 hours daily; hotel guest and visitor use only",
        "RelatedURL": "",
        "DistanceUnit": 0
    },
    "Connections": [
        {
            "ID": 11714,
            "ConnectionTypeID": 1,
            "LevelID": 2,
            "Amps": 16,
            "Voltage": 230,
            "PowerKW": 3,
            "CurrentTypeID": 10,
            "Quantity": 2
        },
        {
            "ID": 21624,
            "ConnectionTypeID": 1,
            "LevelID": 2,
            "Quantity": 2
        }
    ],
    "DateLastStatusUpdate": "2019-04-06T04:01:00Z",
    "DataQualityLevel": 3,
    "DateCreated": "2012-12-06T16:49:00Z",
    "SubmissionStatusTypeID": 100
}