{
    "IsRecentlyVerified": false,
    "ID": 122493,
    "UUID": "959EDC1B-E8A1-46DB-8D24-07CEB84DB6A5",
    "DataProviderID": 2,
    "DataProvidersReference": "78788",
    "OperatorID": 5,
    "UsageTypeID": 1,
    "AddressInfo": {
        "ID": 122839,
        "Title": "3075",
        "AddressLine1": "3043 Townsgate Rd",
        "Town": "Westlake Village",
        "StateOrProvince": "CA",
        "Postcode": "91361",
        "CountryID": 2,
        "Latitude": 34.151895,
        "Longitude": -118.820131,
        "ContactTelephone1": "888-758-4389",
        "AccessComments": "24 hours daily",
        "RelatedURL": "http://www.chargepoint.com/",
        "DistanceUnit": 0
    },
    "Connections": [
        {
            "ID": 172387,
            "ConnectionTypeID": 1,
            "LevelID": 2,
            "Amps": 16,
            "Voltage": 230,
            "PowerKW": 3,
            "CurrentTypeID": 10,
            "Quantity": 6
        }
    ],
    "DateLastStatusUpdate": "2019-12-24T09:11:00Z",
    "DataQualityLevel": 3,
    "DateCreated": "2019-04-06T05:03:00Z",
    "SubmissionStatusTypeID": 100
}