{
    "IsRecentlyVerified": false,
    "ID": 177365,
    "UUID": "ADB99BDD-8BB8-4D9C-A390-ED047DB7B978",
    "DataProviderID": 29,
    "DataProvidersReference": "18283",
    "AddressInfo": {
        "ID": 177724,
        "Title": "Wittekindstr. 3",
        "AddressLine1": "Wittekindstr. 3",
        "Town": "Detmold",
        "Postcode": "32756",
        "CountryID": 87,
        "Latitude": 51.942809,
        "Longitude": 8.863036,
        "DistanceUnit": 0
    },
    "Connections": [
        {
            "ID": 276430,
            "ConnectionTypeID": 25,
            "StatusTypeID": 50,
            "LevelID": 2,
            "PowerKW": 22,
            "CurrentTypeID": 20
        },
        {
            "ID": 276431,
            "ConnectionTypeID": 25,
            "StatusTypeID": 50,
            "LevelID": 2,
            "PowerKW": 22,
            "CurrentTypeID": 20
        }
    ],
    "StatusTypeID": 0,
    "DateLastStatusUpdate": "2021-07-12T02:48:00Z",
    "MetadataValues": [
        {
            "ID": 9659,
            "MetadataFieldID": 4,
            "ItemValue": "Data from the German chargepoint registry provided by Bundesnetzagentur.de under the CC-BY 4.0 license"
        }
    ],
    "DataQualityLevel": 3,
    "DateCreated": "2021-07-08T09:48:00Z",
    "SubmissionStatusTypeID": 100
}