{
    "IsRecentlyVerified": false,
    "ID": 162626,
    "UUID": "13E3C447-7D85-4DBC-87B8-29F169F6313B",
    "DataProviderID": 1,
    "OperatorID": 136,
    "UsageTypeID": 4,
    "UsageCost": "0,15€/kWh",
    "AddressInfo": {
        "ID": 162983,
        "Title": "Keuda Kirkkotie",
        "AddressLine1": "Kirkkotie 11",
        "Town": "Tuusula",
        "StateOrProvince": "Southern Finland",
        "Postcode": "04310",
        "CountryID": 79,
        "Latitude": 60.411074299167836,
        "Longitude": 25.038757931831356,
        "RelatedURL": "http://www.virta.fi",
        "DistanceUnit": 0
    },
    "Connections": [
        {
            "ID": 234067,
            "ConnectionTypeID": 25,
            "StatusTypeID": 50,
            "LevelID": 2,
            "Amps": 16,
            "Voltage": 400,
            "PowerKW": 11,
            "CurrentTypeID": 20,
            "Quantity": 2
        }
    ],
    "NumberOfPoints": 2,
    "StatusTypeID": 50,
    "DateLastStatusUpdate": "2020-08-13T07:38:00Z",
    "DataQualityLevel": 1,
    "DateCreated": "2020-08-12T16:35:00Z",
    "SubmissionStatusTypeID": 200
}