{
    "IsRecentlyVerified": false,
    "ID": 160151,
    "UUID": "D63DF123-17B6-4B48-9708-31960DA95123",
    "DataProviderID": 2,
    "DataProvidersReference": "156670",
    "UsageTypeID": 2,
    "AddressInfo": {
        "ID": 160508,
        "Title": "Hydro One Inc",
        "AddressLine1": "4585 Cherry Ave S",
        "Town": "Lincoln",
        "StateOrProvince": "ON",
        "Postcode": "L0R 1B1",
        "CountryID": 44,
        "Latitude": 43.180176,
        "Longitude": -79.41503,
        "ContactTelephone1": "",
        "AccessComments": "",
        "RelatedURL": "",
        "DistanceUnit": 0
    },
    "Connections": [
        {
            "ID": 230401,
            "ConnectionTypeID": 2,
            "LevelID": 3,
            "Amps": 100,
            "Voltage": 400,
            "PowerKW": 40,
            "CurrentTypeID": 30,
            "Quantity": 1
        },
        {
            "ID": 230402,
            "ConnectionTypeID": 32,
            "LevelID": 3,
            "Amps": 100,
            "Voltage": 400,
            "PowerKW": 40,
            "CurrentTypeID": 30,
            "Quantity": 1
        }
    ],
    "GeneralComments": "Planned for future date. Not Operational.",
    "DatePlanned": "2020-09-01T00:00:00Z",
    "StatusTypeID": 150,
    "DateLastStatusUpdate": "2020-06-26T03:06:00Z",
    "DataQualityLevel": 3,
    "DateCreated": "2020-06-26T03:06:00Z",
    "SubmissionStatusTypeID": 100
}