{
    "IsRecentlyVerified": false,
    "ID": 175635,
    "UUID": "F2CD7081-15FC-4EB0-85F1-4FB8A9D9FFFC",
    "DataProviderID": 1,
    "OperatorID": 22,
    "UsageTypeID": 4,
    "UsageCost": "€0.268/kWh (PAYG), €0.23/kWh (membership)",
    "AddressInfo": {
        "ID": 175994,
        "Title": "Tesco Arklow Extra",
        "AddressLine1": "Wexford Road",
        "Town": "Arklow",
        "StateOrProvince": "Wicklow",
        "CountryID": 3,
        "Latitude": 52.79526266388447,
        "Longitude": -6.1604078488627465,
        "DistanceUnit": 0
    },
    "Connections": [
        {
            "ID": 272701,
            "ConnectionTypeID": 25,
            "StatusTypeID": 50,
            "LevelID": 2,
            "Amps": 32,
            "Voltage": 400,
            "PowerKW": 22,
            "CurrentTypeID": 20,
            "Quantity": 2
        }
    ],
    "NumberOfPoints": 2,
    "StatusTypeID": 50,
    "DateLastStatusUpdate": "2021-06-03T02:39:00Z",
    "DataQualityLevel": 1,
    "DateCreated": "2021-06-02T22:52:00Z",
    "SubmissionStatusTypeID": 200
}