{
    "IsRecentlyVerified": false,
    "ID": 179812,
    "UUID": "FEF5664D-FDAE-4D76-8739-D0CA7154E0A7",
    "DataProviderID": 29,
    "DataProvidersReference": "3815",
    "AddressInfo": {
        "ID": 180171,
        "Title": "Stresemannplatz 15",
        "AddressLine1": "Stresemannplatz 15",
        "Town": "Fürth",
        "Postcode": "90763",
        "CountryID": 87,
        "Latitude": 49.46513,
        "Longitude": 10.994186,
        "DistanceUnit": 0
    },
    "Connections": [
        {
            "ID": 282129,
            "ConnectionTypeID": 25,
            "StatusTypeID": 50,
            "LevelID": 2,
            "PowerKW": 22,
            "CurrentTypeID": 20
        },
        {
            "ID": 282130,
            "ConnectionTypeID": 25,
            "StatusTypeID": 50,
            "LevelID": 2,
            "PowerKW": 22,
            "CurrentTypeID": 20
        }
    ],
    "StatusTypeID": 50,
    "DateLastStatusUpdate": "2021-07-09T03:17:00Z",
    "MetadataValues": [
        {
            "ID": 12106,
            "MetadataFieldID": 4,
            "ItemValue": "Data from the German chargepoint registry provided by Bundesnetzagentur.de under the CC-BY 4.0 license"
        }
    ],
    "DataQualityLevel": 3,
    "DateCreated": "2021-07-08T09:59:00Z",
    "SubmissionStatusTypeID": 100
}