{
    "IsRecentlyVerified": false,
    "ID": 159013,
    "UUID": "899451DC-DF71-49C7-9F12-179ECB7CB2AE",
    "DataProviderID": 2,
    "DataProvidersReference": "158538",
    "OperatorID": 3318,
    "UsageTypeID": 1,
    "AddressInfo": {
        "ID": 159370,
        "Title": "Love's 262 (Tucumcari, NM)",
        "AddressLine1": "1900 South Mountain Road",
        "Town": "Tucumcari",
        "StateOrProvince": "NM",
        "Postcode": "88401",
        "CountryID": 2,
        "Latitude": 35.158319,
        "Longitude": -103.701723,
        "ContactTelephone1": "833-632-2778",
        "AccessComments": "24 hours daily",
        "RelatedURL": "https://www.electrifyamerica.com/",
        "DistanceUnit": 0
    },
    "Connections": [
        {
            "ID": 229076,
            "ConnectionTypeID": 2,
            "LevelID": 3,
            "Amps": 100,
            "Voltage": 400,
            "PowerKW": 40,
            "CurrentTypeID": 30,
            "Quantity": 1
        },
        {
            "ID": 229077,
            "ConnectionTypeID": 32,
            "LevelID": 3,
            "Amps": 100,
            "Voltage": 400,
            "PowerKW": 40,
            "CurrentTypeID": 30,
            "Quantity": 1
        }
    ],
    "StatusTypeID": 50,
    "DateLastStatusUpdate": "2020-06-26T02:57:00Z",
    "DataQualityLevel": 3,
    "DateCreated": "2020-06-26T02:57:00Z",
    "SubmissionStatusTypeID": 100
}