{
    "IsRecentlyVerified": false,
    "ID": 17226,
    "UUID": "F8CEB53A-51E7-4A0A-9C35-1DD7A048B8A2",
    "DataProviderID": 22,
    "DataProvidersReference": "F38575EE8AF23BA6D923C0D98EE767FC",
    "AddressInfo": {
        "ID": 17571,
        "Title": "長野日産自動車伊那店",
        "AddressLine1": "長野県伊那市御園81-1",
        "CountryID": 114,
        "Latitude": 35.85106623,
        "Longitude": 137.9706263,
        "ContactTelephone1": "0265-72-7244",
        "DistanceUnit": 0
    },
    "Connections": [
        {
            "ID": 17467,
            "ConnectionTypeID": 2,
            "LevelID": 2,
            "Amps": 100,
            "Voltage": 480,
            "PowerKW": 48,
            "Quantity": 1
        }
    ],
    "DateLastStatusUpdate": "2013-06-29T08:55:00Z",
    "DataQualityLevel": 2,
    "DateCreated": "2013-06-29T08:55:00Z",
    "SubmissionStatusTypeID": 200
}