{
    "IsRecentlyVerified": false,
    "ID": 90024,
    "UUID": "4E0070E4-2F95-4A5C-8556-528C005C9273",
    "DataProviderID": 1,
    "OperatorID": 45,
    "UsageTypeID": 3,
    "AddressInfo": {
        "ID": 90370,
        "Title": "Touristinformation Dornumersiel",
        "AddressLine1": "Hafenstraße 3a",
        "Town": "Dornum",
        "StateOrProvince": "Landkreis Aurich",
        "Postcode": "26553",
        "CountryID": 87,
        "Latitude": 53.67731999999999,
        "Longitude": 7.480209999999943,
        "ContactTelephone1": "+49 4933 / 91110",
        "AccessComments": "24/7 nutzbar, aber nur, wenn nicht von  Carsharer der Nordsee-Flitzer. belegt! Auf dem Parkplatz an der Rückseite der Tourist-Info, Parken 90 Minuten mit Parkscheibe. Daher vielleicht besser vorher anfragen.\r\n",
        "RelatedURL": "http://www.dornum.de/index.php",
        "DistanceUnit": 0
    },
    "Connections": [
        {
            "ID": 127619,
            "ConnectionTypeID": 25,
            "StatusTypeID": 50,
            "LevelID": 2,
            "Amps": 16,
            "Voltage": 400,
            "PowerKW": 11,
            "CurrentTypeID": 20,
            "Quantity": 1
        }
    ],
    "NumberOfPoints": 1,
    "StatusTypeID": 50,
    "DateLastStatusUpdate": "2017-07-04T11:15:00Z",
    "DataQualityLevel": 1,
    "DateCreated": "2017-07-04T11:15:00Z",
    "SubmissionStatusTypeID": 200
}