{
    "IsRecentlyVerified": false,
    "ID": 8735,
    "UUID": "C11AB73C-79B5-4BF9-9C05-D1A9D816415D",
    "DataProviderID": 15,
    "DataProvidersReference": "490",
    "OperatorID": 5,
    "AddressInfo": {
        "ID": 8632,
        "Title": "Balat Mh., 5. Sk 401",
        "AddressLine1": "Balat Mh., 5. Sk 401",
        "Town": "Bursa",
        "StateOrProvince": "",
        "Postcode": "16140",
        "CountryID": 229,
        "Latitude": 40.25445,
        "Longitude": 28.95228,
        "ContactTelephone1": "",
        "RelatedURL": "http://carstations.com/490",
        "DistanceUnit": 0
    },
    "Connections": [
        {
            "ID": 6151,
            "ConnectionTypeID": 9,
            "Reference": "NEMA5",
            "LevelID": 1
        }
    ],
    "StatusTypeID": 0,
    "DateLastStatusUpdate": "2017-11-04T14:04:00Z",
    "DataQualityLevel": 1,
    "DateCreated": "2011-11-11T12:07:00Z",
    "SubmissionStatusTypeID": 100
}