{
    "UserComments": [
        {
            "ID": 24715,
            "ChargePointID": 47311,
            "CommentTypeID": 1000,
            "UserName": "Sfabris",
            "Comment": "Can't start charging. The problem is not limited to my EV, as I had the opportunity to speak with other EV users who tried to recharge.",
            "Rating": 2,
            "DateCreated": "2021-08-10T21:51:03.343Z",
            "User": {
                "ID": 33584,
                "Username": "Sfabris"
            },
            "CheckinStatusTypeID": 25,
            "IsActionedByEditor": false
        }
    ],
    "MediaItems": [
        {
            "ID": 9140,
            "ChargePointID": 47311,
            "ItemURL": "https://s3-ap-southeast-2.amazonaws.com/openchargemap/images/IT/OCM47311/OCM-47311.orig.2017011515211068.jpeg",
            "ItemThumbnailURL": "https://s3-ap-southeast-2.amazonaws.com/openchargemap/images/IT/OCM47311/OCM-47311.thmb.2017011515211068.jpeg",
            "Comment": "",
            "IsEnabled": true,
            "IsVideo": false,
            "IsFeaturedItem": false,
            "IsExternalResource": false,
            "User": {
                "ID": 12207,
                "Username": "aldodal"
            },
            "DateCreated": "2017-01-15T15:21:00Z"
        }
    ],
    "IsRecentlyVerified": false,
    "ID": 47311,
    "UUID": "F7468EFA-2307-4C96-A294-13708CA08F79",
    "DataProviderID": 1,
    "OperatorID": 1,
    "UsageTypeID": 1,
    "AddressInfo": {
        "ID": 47657,
        "Title": "Via Bosco dei Preti",
        "AddressLine1": "Via Bosco dei Preti",
        "Town": "Thiene",
        "StateOrProvince": "VI",
        "Postcode": "36016",
        "CountryID": 112,
        "Latitude": 45.70761122815528,
        "Longitude": 11.484532432892829,
        "DistanceUnit": 0
    },
    "Connections": [
        {
            "ID": 58327,
            "ConnectionTypeID": 25,
            "StatusTypeID": 50,
            "LevelID": 2,
            "PowerKW": 7,
            "CurrentTypeID": 10,
            "Quantity": 1
        },
        {
            "ID": 304368,
            "ConnectionTypeID": 26,
            "StatusTypeID": 50,
            "CurrentTypeID": 10,
            "Quantity": 1
        }
    ],
    "NumberOfPoints": 2,
    "StatusTypeID": 50,
    "DateLastStatusUpdate": "2021-08-10T21:51:00Z",
    "DataQualityLevel": 1,
    "DateCreated": "2015-05-26T06:02:00Z",
    "SubmissionStatusTypeID": 200
}