{
    "IsRecentlyVerified": false,
    "ID": 158223,
    "UUID": "968543EE-4953-4271-A5EB-FC202D42B1A6",
    "DataProviderID": 2,
    "DataProvidersReference": "153253",
    "OperatorID": 23,
    "OperatorsReference": "52914",
    "UsageTypeID": 1,
    "UsageCost": "$0.22/kWh; other tariffs for older cars",
    "AddressInfo": {
        "ID": 158577,
        "Title": "Wawa - Tesla Supercharger",
        "AddressLine1": "6971 SW 24th Street",
        "Town": "Miami",
        "StateOrProvince": "FL",
        "Postcode": "33155",
        "CountryID": 2,
        "Latitude": 25.7485,
        "Longitude": -80.308,
        "ContactTelephone1": "877-798-3752",
        "AccessComments": "24 hours daily; for Tesla use only",
        "RelatedURL": "http://www.teslamotors.com/supercharger",
        "DistanceUnit": 0
    },
    "Connections": [
        {
            "ID": 228177,
            "ConnectionTypeID": 27,
            "StatusTypeID": 50,
            "LevelID": 3,
            "Amps": 100,
            "Voltage": 400,
            "PowerKW": 120,
            "CurrentTypeID": 30,
            "Quantity": 8
        }
    ],
    "NumberOfPoints": 8,
    "StatusTypeID": 50,
    "DateLastStatusUpdate": "2020-08-25T05:50:00Z",
    "DataQualityLevel": 3,
    "DateCreated": "2020-06-26T02:52:00Z",
    "SubmissionStatusTypeID": 100
}