{
    "IsRecentlyVerified": false,
    "ID": 110310,
    "UUID": "36728141-ED51-496C-A555-EF6C585966D9",
    "DataProviderID": 2,
    "DataProvidersReference": "100384",
    "OperatorID": 5,
    "UsageTypeID": 1,
    "AddressInfo": {
        "ID": 110656,
        "Title": "CITY HALL #1",
        "AddressLine1": "2 N Ash St",
        "Town": "Aztec",
        "StateOrProvince": "NM",
        "Postcode": "87410",
        "CountryID": 2,
        "Latitude": 36.8243925,
        "Longitude": -107.9970548,
        "ContactTelephone1": "888-758-4389",
        "AccessComments": "24 hours daily",
        "RelatedURL": "http://www.chargepoint.com/",
        "DistanceUnit": 0
    },
    "Connections": [
        {
            "ID": 155551,
            "ConnectionTypeID": 1,
            "LevelID": 2,
            "Amps": 16,
            "Voltage": 230,
            "PowerKW": 3,
            "CurrentTypeID": 10,
            "Quantity": 2
        }
    ],
    "DateLastStatusUpdate": "2019-04-06T04:02:00Z",
    "DataQualityLevel": 3,
    "DateCreated": "2018-10-18T23:36:00Z",
    "SubmissionStatusTypeID": 100
}