{
    "IsRecentlyVerified": false,
    "ID": 174848,
    "UUID": "DD759D8E-7288-4C42-BE3F-E8558E85B14E",
    "DataProviderID": 1,
    "OperatorID": 80,
    "UsageTypeID": 1,
    "AddressInfo": {
        "ID": 175207,
        "Title": "Enel X",
        "AddressLine1": "Via Erminio Ferretto",
        "AddressLine2": "Olme",
        "Town": "Treviso",
        "StateOrProvince": "Treviso",
        "Postcode": "31021",
        "CountryID": 112,
        "Latitude": 45.55257967258885,
        "Longitude": 12.247342151793418,
        "DistanceUnit": 0
    },
    "Connections": [
        {
            "ID": 270935,
            "ConnectionTypeID": 25,
            "StatusTypeID": 50,
            "LevelID": 2,
            "PowerKW": 20,
            "CurrentTypeID": 20,
            "Quantity": 2
        }
    ],
    "NumberOfPoints": 2,
    "StatusTypeID": 50,
    "DateLastStatusUpdate": "2021-04-15T19:58:00Z",
    "DataQualityLevel": 1,
    "DateCreated": "2021-04-15T15:27:00Z",
    "SubmissionStatusTypeID": 200
}