{
    "IsRecentlyVerified": false,
    "ID": 115536,
    "UUID": "690964AC-A0BC-4735-90EC-405CF8D0DB20",
    "DataProviderID": 2,
    "DataProvidersReference": "113247",
    "OperatorID": 23,
    "UsageTypeID": 7,
    "AddressInfo": {
        "ID": 115882,
        "Title": "Jada Vineyard & Winery - Tesla Destination",
        "AddressLine1": "5620 Vineyard Dr",
        "Town": "Paso Robles",
        "StateOrProvince": "CA",
        "Postcode": "93446",
        "CountryID": 2,
        "Latitude": 35.581277,
        "Longitude": -120.80007,
        "ContactTelephone1": "805-226-4200  877-798-3752",
        "AccessComments": "24 hours daily; for Tesla use only; for customer use only",
        "RelatedURL": "https://www.tesla.com/destination-charging",
        "DistanceUnit": 0
    },
    "Connections": [
        {
            "ID": 162553,
            "ConnectionTypeID": 0,
            "LevelID": 2,
            "Amps": 16,
            "Voltage": 230,
            "PowerKW": 3,
            "CurrentTypeID": 10,
            "Quantity": 2
        }
    ],
    "DateLastStatusUpdate": "2019-04-06T04:02:00Z",
    "DataQualityLevel": 3,
    "DateCreated": "2019-02-11T07:13:00Z",
    "SubmissionStatusTypeID": 100
}