{
    "IsRecentlyVerified": false,
    "ID": 119570,
    "UUID": "512EB5BC-BA1F-428F-ABD2-D2DA6BF860CF",
    "DataProviderID": 1,
    "OperatorID": 5,
    "UsageTypeID": 6,
    "AddressInfo": {
        "ID": 119916,
        "Title": "OBE POWER",
        "AddressLine1": "2000 Island Blvd",
        "Town": "Aventura",
        "StateOrProvince": "FL",
        "Postcode": "33160",
        "CountryID": 2,
        "Latitude": 25.938840426976697,
        "Longitude": -80.1371921820155,
        "ContactTelephone1": "888-758-4389",
        "AccessComments": "24 hours daily",
        "RelatedURL": "http://www.chargepoint.com/",
        "DistanceUnit": 0
    },
    "Connections": [
        {
            "ID": 168846,
            "ConnectionTypeID": 1,
            "StatusTypeID": 50,
            "LevelID": 2,
            "Amps": 16,
            "Voltage": 230,
            "PowerKW": 3,
            "CurrentTypeID": 10,
            "Quantity": 2
        }
    ],
    "NumberOfPoints": 1,
    "GeneralComments": "Located in the 2000 building on Williams Island. Usage limited to residents and visitors. Charger is on the third floor of the garage. Note charging spots are in a small corner of the garage, use care when parking. ",
    "StatusTypeID": 50,
    "DateLastStatusUpdate": "2020-01-05T13:55:00Z",
    "DataQualityLevel": 3,
    "DateCreated": "2019-04-01T04:59:00Z",
    "SubmissionStatusTypeID": 100
}