{
    "IsRecentlyVerified": false,
    "ID": 121253,
    "UUID": "F05AB572-D134-4177-B9FB-3356F71291A5",
    "DataProviderID": 2,
    "DataProvidersReference": "120865",
    "OperatorID": 5,
    "UsageTypeID": 1,
    "AddressInfo": {
        "ID": 121599,
        "Title": "INDUSTRY CITY",
        "AddressLine1": "147 41st  St",
        "Town": "Sunset Park",
        "StateOrProvince": "NY",
        "Postcode": "11232",
        "CountryID": 2,
        "Latitude": 40.654857,
        "Longitude": -74.012496,
        "ContactTelephone1": "888-758-4389",
        "AccessComments": "24 hours daily",
        "RelatedURL": "http://www.chargepoint.com/",
        "DistanceUnit": 0
    },
    "Connections": [
        {
            "ID": 170693,
            "ConnectionTypeID": 1,
            "LevelID": 2,
            "Amps": 16,
            "Voltage": 230,
            "PowerKW": 3,
            "CurrentTypeID": 10,
            "Quantity": 4
        }
    ],
    "DateLastStatusUpdate": "2019-04-01T05:00:00Z",
    "DataQualityLevel": 3,
    "DateCreated": "2019-04-01T05:00:00Z",
    "SubmissionStatusTypeID": 100
}