{
    "IsRecentlyVerified": false,
    "ID": 114116,
    "UUID": "51AA5073-A769-4119-81BC-CA655AA4C062",
    "DataProviderID": 1,
    "OperatorID": 23,
    "OperatorsReference": "46709",
    "UsageTypeID": 4,
    "AddressInfo": {
        "ID": 114462,
        "Title": "Lorraine Hôtel",
        "AddressLine1": "29 Avenue de la Résistance",
        "Town": "Laxou",
        "Postcode": "54520",
        "CountryID": 80,
        "Latitude": 48.694742,
        "Longitude": 6.12497,
        "ContactTelephone1": " +33 3 83 93 16 16",
        "DistanceUnit": 0
    },
    "Connections": [
        {
            "ID": 160686,
            "ConnectionTypeID": 30,
            "StatusTypeID": 50,
            "LevelID": 2,
            "Amps": 16,
            "Voltage": 400,
            "PowerKW": 11,
            "CurrentTypeID": 20,
            "Quantity": 2
        }
    ],
    "NumberOfPoints": 2,
    "GeneralComments": "2 Tesla Connectors, up to 11kW.Available for customers. Please see front desk.",
    "StatusTypeID": 50,
    "DateLastStatusUpdate": "2019-01-03T07:55:00Z",
    "DataQualityLevel": 1,
    "DateCreated": "2019-01-03T07:55:00Z",
    "SubmissionStatusTypeID": 200
}