{
    "IsRecentlyVerified": false,
    "ID": 159435,
    "UUID": "7F7DD49E-C9A1-4685-8485-715E39F7E911",
    "DataProviderID": 2,
    "DataProvidersReference": "158528",
    "OperatorID": 5,
    "UsageTypeID": 1,
    "AddressInfo": {
        "ID": 159792,
        "Title": "GLENWOOD SPRNGS",
        "AddressLine1": "546 Hyland Park Dr",
        "Town": "Glenwood Springs",
        "StateOrProvince": "CO",
        "Postcode": "81601",
        "CountryID": 2,
        "Latitude": 39.5345171,
        "Longitude": -107.3228629,
        "ContactTelephone1": "888-758-4389",
        "AccessComments": "24 hours daily",
        "RelatedURL": "http://www.chargepoint.com/",
        "DistanceUnit": 0
    },
    "Connections": [
        {
            "ID": 229613,
            "ConnectionTypeID": 1,
            "LevelID": 2,
            "Amps": 16,
            "Voltage": 230,
            "PowerKW": 3.7,
            "CurrentTypeID": 10,
            "Quantity": 2
        }
    ],
    "StatusTypeID": 50,
    "DateLastStatusUpdate": "2020-06-26T03:02:00Z",
    "DataQualityLevel": 3,
    "DateCreated": "2020-06-26T03:02:00Z",
    "SubmissionStatusTypeID": 100
}