{
    "IsRecentlyVerified": false,
    "ID": 131940,
    "UUID": "2F4BDBF1-14FC-45A7-9D47-0C26035AD376",
    "DataProviderID": 1,
    "OperatorID": 23,
    "OperatorsReference": "51825",
    "UsageTypeID": 4,
    "AddressInfo": {
        "ID": 132286,
        "Title": "King Mokinba Hotels",
        "AddressLine1": "Corso Magenta",
        "Town": "Milano",
        "Postcode": "20123",
        "CountryID": 112,
        "Latitude": 45.465569,
        "Longitude": 9.17779,
        "ContactTelephone1": " +39 02 87 44 32",
        "DistanceUnit": 0
    },
    "Connections": [
        {
            "ID": 184616,
            "ConnectionTypeID": 30,
            "StatusTypeID": 50,
            "LevelID": 2,
            "PowerKW": 22,
            "CurrentTypeID": 20,
            "Quantity": 1
        }
    ],
    "NumberOfPoints": 1,
    "GeneralComments": "1 Tesla Connector, up to 22kW.Available for customers. Please call ahead.",
    "StatusTypeID": 50,
    "DateLastStatusUpdate": "2019-09-16T05:31:00Z",
    "DataQualityLevel": 1,
    "DateCreated": "2019-09-16T05:31:00Z",
    "SubmissionStatusTypeID": 200
}