{
    "IsRecentlyVerified": false,
    "ID": 174694,
    "UUID": "47E6F255-998B-4AC3-B9EF-10164C206C58",
    "DataProviderID": 1,
    "OperatorID": 125,
    "UsageTypeID": 4,
    "AddressInfo": {
        "ID": 175053,
        "Title": "Pappelstraße",
        "AddressLine1": "Pappelstraße 100",
        "AddressLine2": "Neustadt",
        "Town": "Bremen",
        "StateOrProvince": "Free Hanseatic City of Bremen",
        "Postcode": "28199",
        "CountryID": 87,
        "Latitude": 53.066562912073294,
        "Longitude": 8.793407787735305,
        "DistanceUnit": 0
    },
    "Connections": [
        {
            "ID": 270694,
            "ConnectionTypeID": 25,
            "StatusTypeID": 50,
            "LevelID": 2,
            "Amps": 32,
            "Voltage": 400,
            "PowerKW": 22,
            "CurrentTypeID": 20,
            "Quantity": 2
        }
    ],
    "NumberOfPoints": 2,
    "GeneralComments": "Am Straßenrand steht die durchgehend verfügbare rot-weiße Ladesäule mit 2 reservierten Parkplätzen daneben. Parkscheibe (max 3h) von 8-18 Uhr erforderlich.",
    "StatusTypeID": 50,
    "DateLastStatusUpdate": "2021-04-11T11:35:00Z",
    "DataQualityLevel": 1,
    "DateCreated": "2021-04-11T11:35:00Z",
    "SubmissionStatusTypeID": 200
}