{
    "IsRecentlyVerified": false,
    "ID": 62243,
    "UUID": "6A290DEE-73EC-4B7D-A4E5-7D9447737B31",
    "DataProviderID": 2,
    "DataProvidersReference": "71477",
    "OperatorID": 5,
    "UsageTypeID": 1,
    "AddressInfo": {
        "ID": 62589,
        "Title": "GAULT BMW",
        "AddressLine1": "2311 North St",
        "Town": "Endicott",
        "StateOrProvince": "NY",
        "Postcode": "13760",
        "CountryID": 2,
        "Latitude": 42.107059,
        "Longitude": -76.035088,
        "ContactTelephone1": "888-758-4389",
        "AccessComments": "24 hours daily",
        "RelatedURL": "http://www.chargepoint.com/",
        "DistanceUnit": 0
    },
    "Connections": [
        {
            "ID": 79146,
            "ConnectionTypeID": 1,
            "LevelID": 2,
            "Amps": 16,
            "Voltage": 230,
            "PowerKW": 3,
            "CurrentTypeID": 10,
            "Quantity": 2
        }
    ],
    "DateLastStatusUpdate": "2019-12-24T09:19:00Z",
    "DataQualityLevel": 3,
    "DateCreated": "2016-03-03T11:38:00Z",
    "SubmissionStatusTypeID": 100
}