{
    "IsRecentlyVerified": false,
    "ID": 176296,
    "UUID": "ED48485E-7878-4D28-9549-286CA75953BB",
    "DataProviderID": 1,
    "OperatorID": 3455,
    "UsageTypeID": 4,
    "AddressInfo": {
        "ID": 176655,
        "Title": "Aral Bürener Straße",
        "AddressLine1": "155 Bürener Straße",
        "Town": "Geseke",
        "StateOrProvince": "North Rhine-Westphalia",
        "Postcode": "59590",
        "CountryID": 87,
        "Latitude": 51.598004747825456,
        "Longitude": 8.516419926568915,
        "DistanceUnit": 0
    },
    "Connections": [
        {
            "ID": 274013,
            "ConnectionTypeID": 33,
            "StatusTypeID": 50,
            "LevelID": 3,
            "Amps": 500,
            "Voltage": 1000,
            "PowerKW": 300,
            "CurrentTypeID": 30,
            "Quantity": 1
        },
        {
            "ID": 274014,
            "ConnectionTypeID": 33,
            "StatusTypeID": 50,
            "LevelID": 3,
            "Amps": 500,
            "Voltage": 1000,
            "PowerKW": 300,
            "CurrentTypeID": 30,
            "Quantity": 1
        },
        {
            "ID": 274015,
            "ConnectionTypeID": 2,
            "StatusTypeID": 50,
            "LevelID": 3,
            "Amps": 500,
            "Voltage": 1000,
            "PowerKW": 300,
            "CurrentTypeID": 30,
            "Quantity": 1
        },
        {
            "ID": 274016,
            "ConnectionTypeID": 33,
            "StatusTypeID": 50,
            "LevelID": 3,
            "Amps": 500,
            "Voltage": 1000,
            "PowerKW": 300,
            "CurrentTypeID": 30,
            "Quantity": 1
        },
        {
            "ID": 274017,
            "ConnectionTypeID": 33,
            "StatusTypeID": 50,
            "LevelID": 3,
            "Amps": 500,
            "Voltage": 1000,
            "PowerKW": 300,
            "CurrentTypeID": 30,
            "Quantity": 1
        },
        {
            "ID": 274018,
            "ConnectionTypeID": 2,
            "StatusTypeID": 50,
            "LevelID": 3,
            "Amps": 500,
            "Voltage": 1000,
            "PowerKW": 300,
            "CurrentTypeID": 30,
            "Quantity": 1
        }
    ],
    "NumberOfPoints": 1,
    "StatusTypeID": 50,
    "DateLastStatusUpdate": "2021-07-04T05:23:00Z",
    "DataQualityLevel": 1,
    "DateCreated": "2021-07-04T05:23:00Z",
    "SubmissionStatusTypeID": 200
}