{
    "IsRecentlyVerified": false,
    "ID": 151179,
    "UUID": "DC58CAC4-BD70-47BA-B76D-929F68261288",
    "DataProviderID": 28,
    "DataProvidersReference": "FR*S81*P81004*011",
    "OperatorID": 3257,
    "UsageTypeID": 5,
    "AddressInfo": {
        "ID": 151532,
        "Title": "ALBI - Innoprod - Chemin de la Teulière",
        "AddressLine1": "Chemin de la Teulière 81000 ALBI - Innoprod",
        "CountryID": 80,
        "Latitude": 43.921309,
        "Longitude": 2.181805,
        "AccessComments": "24h/24 7j/7",
        "DistanceUnit": 0
    },
    "Connections": [
        {
            "ID": 210901,
            "ConnectionTypeID": 2,
            "StatusTypeID": 50,
            "LevelID": 3,
            "PowerKW": 36,
            "CurrentTypeID": 30
        },
        {
            "ID": 240923,
            "ConnectionTypeID": 33,
            "StatusTypeID": 50,
            "LevelID": 3,
            "PowerKW": 36,
            "CurrentTypeID": 30
        },
        {
            "ID": 240924,
            "ConnectionTypeID": 28,
            "StatusTypeID": 50,
            "LevelID": 2,
            "PowerKW": 4,
            "CurrentTypeID": 10
        },
        {
            "ID": 240925,
            "ConnectionTypeID": 2,
            "StatusTypeID": 50,
            "LevelID": 3,
            "PowerKW": 36,
            "CurrentTypeID": 30
        }
    ],
    "GeneralComments": "Recharge par badge et avec une application smartphone",
    "StatusTypeID": 50,
    "DateLastStatusUpdate": "2020-08-27T05:11:00Z",
    "DataQualityLevel": 2,
    "DateCreated": "2020-03-15T10:53:00Z",
    "SubmissionStatusTypeID": 100
}