{
    "IsRecentlyVerified": false,
    "ID": 186982,
    "UUID": "478E8A3E-6709-4FAD-9677-3A893A7D9810",
    "DataProviderID": 29,
    "DataProvidersReference": "18754",
    "OperatorID": 69,
    "AddressInfo": {
        "ID": 187341,
        "Title": "Berliner Str. 54",
        "AddressLine1": "Berliner Str. 54",
        "Town": "Emlichheim",
        "Postcode": "49824",
        "CountryID": 87,
        "Latitude": 52.615905,
        "Longitude": 6.84503,
        "DistanceUnit": 0
    },
    "Connections": [
        {
            "ID": 300860,
            "ConnectionTypeID": 28,
            "StatusTypeID": 50,
            "LevelID": 2,
            "PowerKW": 22,
            "CurrentTypeID": 20
        },
        {
            "ID": 300861,
            "ConnectionTypeID": 25,
            "StatusTypeID": 50,
            "LevelID": 2,
            "PowerKW": 22,
            "CurrentTypeID": 20
        },
        {
            "ID": 300862,
            "ConnectionTypeID": 28,
            "StatusTypeID": 50,
            "LevelID": 2,
            "PowerKW": 22,
            "CurrentTypeID": 20
        },
        {
            "ID": 300863,
            "ConnectionTypeID": 25,
            "StatusTypeID": 50,
            "LevelID": 2,
            "PowerKW": 22,
            "CurrentTypeID": 20
        }
    ],
    "StatusTypeID": 50,
    "DateLastStatusUpdate": "2021-07-12T02:50:00Z",
    "MetadataValues": [
        {
            "ID": 19222,
            "MetadataFieldID": 4,
            "ItemValue": "Data from the German chargepoint registry provided by Bundesnetzagentur.de under the CC-BY 4.0 license"
        }
    ],
    "DataQualityLevel": 3,
    "DateCreated": "2021-07-12T02:50:00Z",
    "SubmissionStatusTypeID": 100
}