{
    "IsRecentlyVerified": false,
    "ID": 142729,
    "UUID": "88D3FE55-5E4A-4493-AB9E-5A0A0D6F3A83",
    "DataProviderID": 2,
    "DataProvidersReference": "123085",
    "OperatorID": 3372,
    "UsageTypeID": 1,
    "AddressInfo": {
        "ID": 143081,
        "Title": "Beacon Department of Motor Vehicles",
        "AddressLine1": "223 Main St",
        "Town": "Beacon",
        "StateOrProvince": "NY",
        "Postcode": "12508",
        "CountryID": 2,
        "Latitude": 41.5070254,
        "Longitude": -73.9741415,
        "ContactTelephone1": "866-816-7584",
        "AccessComments": "24 hours daily",
        "RelatedURL": "http://evconnect.com/",
        "DistanceUnit": 0
    },
    "Connections": [
        {
            "ID": 198934,
            "ConnectionTypeID": 1,
            "LevelID": 2,
            "Amps": 16,
            "Voltage": 230,
            "PowerKW": 3.7,
            "CurrentTypeID": 10,
            "Quantity": 1
        }
    ],
    "StatusTypeID": 50,
    "DateLastStatusUpdate": "2020-06-26T03:04:00Z",
    "DataQualityLevel": 3,
    "DateCreated": "2019-12-24T09:18:00Z",
    "SubmissionStatusTypeID": 100
}