{
    "IsRecentlyVerified": false,
    "ID": 65527,
    "UUID": "F3341AD3-099D-4FC8-BC6C-241432A6EA7E",
    "DataProviderID": 26,
    "DataProvidersReference": "83834",
    "OperatorID": 157,
    "OperatorsReference": "NewMotion 03004440",
    "UsageCost": "0.00 jaarabonnement",
    "AddressInfo": {
        "ID": 65873,
        "Title": "Vondelingenweg 550",
        "AddressLine1": "Vondelingenweg 550",
        "Town": "Rotterdam",
        "Postcode": "3196 KK",
        "CountryID": 159,
        "Latitude": 51.8890077193619,
        "Longitude": 4.32729732245207,
        "ContactTelephone1": "088 0109500",
        "RelatedURL": "http://thenewmotion.nl/",
        "DistanceUnit": 0
    },
    "Connections": [
        {
            "ID": 90321,
            "ConnectionTypeID": 25,
            "LevelID": 2,
            "PowerKW": 22,
            "CurrentTypeID": 10
        }
    ],
    "NumberOfPoints": 1,
    "StatusTypeID": 50,
    "DateLastStatusUpdate": "2016-06-04T02:41:00Z",
    "DataQualityLevel": 3,
    "DateCreated": "2016-04-27T09:41:00Z",
    "SubmissionStatusTypeID": 100
}