{
    "IsRecentlyVerified": false,
    "ID": 56309,
    "UUID": "39DA24F3-1481-4721-B48D-9F7A811C569B",
    "DataProviderID": 1,
    "OperatorID": 80,
    "UsageTypeID": 4,
    "UsageCost": "0,40 €/kW",
    "AddressInfo": {
        "ID": 56655,
        "Title": "Eneldrive Navacchio Stazione FS",
        "AddressLine1": "Largo Gori",
        "Town": "Cascina",
        "StateOrProvince": "PI",
        "Postcode": "56021",
        "CountryID": 112,
        "Latitude": 43.6864330622562,
        "Longitude": 10.4864417603094,
        "RelatedURL": "http://eneldrive.it",
        "DistanceUnit": 0
    },
    "Connections": [
        {
            "ID": 71018,
            "ConnectionTypeID": 25,
            "StatusTypeID": 50,
            "LevelID": 2,
            "Amps": 32,
            "Voltage": 400,
            "PowerKW": 22,
            "CurrentTypeID": 20,
            "Quantity": 1
        },
        {
            "ID": 71019,
            "ConnectionTypeID": 36,
            "StatusTypeID": 50,
            "LevelID": 2,
            "Amps": 16,
            "Voltage": 240,
            "PowerKW": 3.7,
            "CurrentTypeID": 10,
            "Quantity": 1
        }
    ],
    "NumberOfPoints": 1,
    "StatusTypeID": 50,
    "DateLastStatusUpdate": "2016-06-28T17:28:00Z",
    "DataQualityLevel": 1,
    "DateCreated": "2015-10-28T17:41:00Z",
    "SubmissionStatusTypeID": 200
}