{
    "IsRecentlyVerified": false,
    "ID": 79851,
    "UUID": "29594022-C9BB-47F2-886F-8C021434A713",
    "DataProviderID": 1,
    "OperatorID": 23,
    "OperatorsReference": "10736",
    "UsageTypeID": 4,
    "UsageCost": "AUD 0.42/kWh;other tariffs for older cars",
    "AddressInfo": {
        "ID": 80197,
        "Title": "Goulburn Supercharger",
        "AddressLine1": "201 Sloan St",
        "Town": "Goulburn",
        "CountryID": 18,
        "Latitude": -34.755597,
        "Longitude": 149.720984,
        "DistanceUnit": 0
    },
    "Connections": [
        {
            "ID": 114498,
            "ConnectionTypeID": 27,
            "StatusTypeID": 50,
            "LevelID": 3,
            "PowerKW": 120,
            "CurrentTypeID": 30,
            "Quantity": 8
        }
    ],
    "NumberOfPoints": 8,
    "GeneralComments": "8 Superchargers, available 24/7",
    "StatusTypeID": 50,
    "DateLastStatusUpdate": "2019-03-22T18:25:00Z",
    "DataQualityLevel": 1,
    "DateCreated": "2017-01-30T13:33:00Z",
    "SubmissionStatusTypeID": 200
}