{
    "IsRecentlyVerified": false,
    "ID": 34643,
    "UUID": "D5C26761-09DA-4D8B-BE73-B6791B065C2B",
    "DataProviderID": 26,
    "DataProvidersReference": "55947",
    "OperatorID": 73,
    "OperatorsReference": "EV-Box EVB-P1430114",
    "UsageCost": "0.00 jaarabonnement",
    "AddressInfo": {
        "ID": 34989,
        "Title": "Prins Pieter Christiaanstraat 81",
        "AddressLine1": "Prins Pieter Christiaanstraat 81",
        "Town": "Rotterdam",
        "Postcode": "3066 TB",
        "CountryID": 159,
        "Latitude": 51.93435,
        "Longitude": 4.56286,
        "RelatedURL": "http://www.ev-box.nl",
        "DistanceUnit": 0
    },
    "Connections": [
        {
            "ID": 38154,
            "ConnectionTypeID": 25,
            "LevelID": 2,
            "PowerKW": 11,
            "CurrentTypeID": 10
        },
        {
            "ID": 47423,
            "ConnectionTypeID": 25,
            "LevelID": 2,
            "PowerKW": 11,
            "CurrentTypeID": 10
        }
    ],
    "NumberOfPoints": 1,
    "StatusTypeID": 50,
    "DateLastStatusUpdate": "2016-06-04T02:42:00Z",
    "DataQualityLevel": 3,
    "DateCreated": "2015-01-09T06:04:00Z",
    "SubmissionStatusTypeID": 100
}