{
    "IsRecentlyVerified": false,
    "ID": 177064,
    "UUID": "EA4D1661-F8E5-4CB6-918A-95D6102C3064",
    "DataProviderID": 29,
    "DataProvidersReference": "12985",
    "AddressInfo": {
        "ID": 177423,
        "Title": "Markt 1",
        "AddressLine1": "Markt 1",
        "Town": "Colditz",
        "Postcode": "04680",
        "CountryID": 87,
        "Latitude": 51.1294455,
        "Longitude": 12.8063783,
        "DistanceUnit": 0
    },
    "Connections": [
        {
            "ID": 275759,
            "ConnectionTypeID": 25,
            "StatusTypeID": 50,
            "LevelID": 2,
            "PowerKW": 22,
            "CurrentTypeID": 20
        },
        {
            "ID": 275760,
            "ConnectionTypeID": 25,
            "StatusTypeID": 50,
            "LevelID": 2,
            "PowerKW": 22,
            "CurrentTypeID": 20
        }
    ],
    "StatusTypeID": 0,
    "DateLastStatusUpdate": "2021-07-12T02:46:00Z",
    "MetadataValues": [
        {
            "ID": 9358,
            "MetadataFieldID": 4,
            "ItemValue": "Data from the German chargepoint registry provided by Bundesnetzagentur.de under the CC-BY 4.0 license"
        }
    ],
    "DataQualityLevel": 3,
    "DateCreated": "2021-07-08T09:48:00Z",
    "SubmissionStatusTypeID": 100
}