{
    "IsRecentlyVerified": false,
    "ID": 94950,
    "UUID": "48A6ABED-8C90-403F-AD78-66A81A3C3159",
    "DataProviderID": 1,
    "DataProvidersReference": "4406",
    "OperatorID": 1,
    "UsageTypeID": 5,
    "AddressInfo": {
        "ID": 95296,
        "Title": "Circle K Namsskogan",
        "AddressLine1": "Kleist Geddes Vei 35",
        "Town": "NAMSSKOGAN",
        "StateOrProvince": "Trøndelag",
        "Postcode": "7890",
        "CountryID": 168,
        "Latitude": 64.93368,
        "Longitude": 13.16657,
        "AccessComments": "",
        "DistanceUnit": 0
    },
    "Connections": [
        {
            "ID": 134505,
            "ConnectionTypeID": 33,
            "Reference": "1",
            "StatusTypeID": 50,
            "LevelID": 3,
            "Amps": 100,
            "Voltage": 500,
            "PowerKW": 50,
            "CurrentTypeID": 30,
            "Quantity": 2,
            "Comments": "Mode 4"
        },
        {
            "ID": 134506,
            "ConnectionTypeID": 2,
            "Reference": "2",
            "StatusTypeID": 50,
            "LevelID": 3,
            "Amps": 100,
            "Voltage": 500,
            "PowerKW": 50,
            "CurrentTypeID": 30,
            "Quantity": 2,
            "Comments": "Mode 4"
        },
        {
            "ID": 134509,
            "ConnectionTypeID": 25,
            "Reference": "5",
            "StatusTypeID": 50,
            "LevelID": 2,
            "Amps": 32,
            "Voltage": 400,
            "PowerKW": 22,
            "CurrentTypeID": 20,
            "Quantity": 2,
            "Comments": "Mode 3"
        }
    ],
    "NumberOfPoints": 6,
    "StatusTypeID": 50,
    "DateLastStatusUpdate": "2020-08-27T19:19:00Z",
    "DataQualityLevel": 2,
    "DateCreated": "2017-10-28T13:36:00Z",
    "SubmissionStatusTypeID": 100
}