{
    "IsRecentlyVerified": false,
    "ID": 107987,
    "UUID": "2B5E28E3-A8A0-4D95-B1C3-10ABD09EF7C7",
    "DataProviderID": 1,
    "OperatorID": 103,
    "UsageTypeID": 1,
    "UsageCost": "0,34",
    "AddressInfo": {
        "ID": 108333,
        "Title": "Hamont Market",
        "AddressLine1": "Stad 32",
        "Town": "HAMONT-ACHEL",
        "Postcode": "3930",
        "CountryID": 26,
        "Latitude": 51.2511975314127,
        "Longitude": 5.54505224008517,
        "DistanceUnit": 0
    },
    "Connections": [
        {
            "ID": 152523,
            "ConnectionTypeID": 25,
            "StatusTypeID": 0,
            "LevelID": 2,
            "PowerKW": 11,
            "CurrentTypeID": 20,
            "Quantity": 2
        }
    ],
    "NumberOfPoints": 2,
    "StatusTypeID": 50,
    "DateLastStatusUpdate": "2018-08-24T20:22:00Z",
    "DataQualityLevel": 1,
    "DateCreated": "2018-08-23T20:02:00Z",
    "SubmissionStatusTypeID": 200
}