{
    "IsRecentlyVerified": false,
    "ID": 81779,
    "UUID": "BA02002F-E702-43A4-AEBF-2BE28392D0E9",
    "DataProviderID": 1,
    "OperatorID": 23,
    "OperatorsReference": "19362",
    "UsageTypeID": 6,
    "AddressInfo": {
        "ID": 82125,
        "Title": "Residence Inn Pittsburgh University/Medical Center",
        "AddressLine1": "3896 Bigelow BLVD",
        "Town": "Pittsburgh",
        "StateOrProvince": "Pennsylvania",
        "Postcode": "15213",
        "CountryID": 2,
        "Latitude": 40.454172,
        "Longitude": -79.954741,
        "ContactTelephone1": "(412) 621-2200",
        "DistanceUnit": 0
    },
    "Connections": [
        {
            "ID": 116537,
            "ConnectionTypeID": 30,
            "StatusTypeID": 50,
            "LevelID": 2,
            "PowerKW": 8,
            "CurrentTypeID": 10,
            "Quantity": 2
        }
    ],
    "NumberOfPoints": 2,
    "GeneralComments": "2 Tesla Connectors, up to 8kW.Available for patrons only. Please see front desk.",
    "StatusTypeID": 50,
    "DateLastStatusUpdate": "2019-06-05T11:37:00Z",
    "DataQualityLevel": 1,
    "DateCreated": "2017-02-03T12:17:00Z",
    "SubmissionStatusTypeID": 200
}