{
    "UserComments": [
        {
            "ID": 20221,
            "ChargePointID": 31529,
            "CommentTypeID": 10,
            "UserName": "Jack",
            "Comment": "2.80 Eur for 30 minutes\nby PayPal or Credit card",
            "DateCreated": "2018-09-28T15:35:44.14Z",
            "User": {
                "ID": 19127,
                "Username": "Jack"
            },
            "CheckinStatusTypeID": 10
        }
    ],
    "MediaItems": [
        {
            "ID": 16682,
            "ChargePointID": 31529,
            "ItemURL": "https://s3-ap-southeast-2.amazonaws.com/openchargemap/images/AT/OCM31529/OCM-31529.orig.2018092815365055.jpg",
            "ItemThumbnailURL": "https://s3-ap-southeast-2.amazonaws.com/openchargemap/images/AT/OCM31529/OCM-31529.thmb.2018092815365055.jpg",
            "Comment": "",
            "IsEnabled": true,
            "IsVideo": false,
            "IsFeaturedItem": false,
            "IsExternalResource": false,
            "User": {
                "ID": 19127,
                "Username": "Jack"
            },
            "DateCreated": "2018-09-28T15:37:00Z"
        }
    ],
    "IsRecentlyVerified": false,
    "ID": 31529,
    "UUID": "17EEC71D-4502-4AAE-8754-A74E8EE89EB0",
    "DataProviderID": 26,
    "DataProvidersReference": "24061",
    "OperatorID": 78,
    "OperatorsReference": "Essent EM-AT-00020527-01-00001",
    "UsageCost": "0.00 jaarabonnement",
    "AddressInfo": {
        "ID": 31875,
        "Title": "Völkermarkter Straße",
        "AddressLine1": "Völkermarkter Straße",
        "Town": "Sankt Veit an der Glan",
        "Postcode": "9300",
        "CountryID": 19,
        "Latitude": 46.76696,
        "Longitude": 14.363483,
        "RelatedURL": "http://www.essent.nl",
        "DistanceUnit": 0
    },
    "Connections": [
        {
            "ID": 35040,
            "ConnectionTypeID": 25,
            "LevelID": 2,
            "PowerKW": 11,
            "CurrentTypeID": 10
        },
        {
            "ID": 45947,
            "ConnectionTypeID": 25,
            "LevelID": 2,
            "PowerKW": 11,
            "CurrentTypeID": 10
        }
    ],
    "NumberOfPoints": 1,
    "StatusTypeID": 50,
    "DateLastStatusUpdate": "2018-09-28T15:37:00Z",
    "DataQualityLevel": 3,
    "DateCreated": "2015-01-09T06:03:00Z",
    "SubmissionStatusTypeID": 100
}