{
    "UserComments": [
        {
            "ID": 22976,
            "ChargePointID": 161987,
            "CommentTypeID": 10,
            "UserName": "ForumElettrico.it",
            "Comment": "Una delle poche (finora) installazioni interessanti in un distributore di benzina in quanto è all'ombra (almeno alla mattina) ma soprattutto è poco trafficata e di fianco ad un tipico bar tabacchino. Leggi la recensione completa qui > https://www.forumelettrico.it/forum/colonnina-be-charge-22-kw-distributore-esso-viterbo-vt-sp-7-km-11-304-commenda-t11725.html",
            "RelatedURL": "https://www.forumelettrico.it/forum/colonnina-be-charge-22-kw-distributore-esso-viterbo-vt-sp-7-km-11-304-commenda-t11725.html",
            "DateCreated": "2020-07-30T15:09:25.933Z",
            "User": {
                "ID": 11749,
                "Username": "ForumElettrico.it"
            },
            "CheckinStatusTypeID": 10,
            "IsActionedByEditor": false
        }
    ],
    "MediaItems": [
        {
            "ID": 23338,
            "ChargePointID": 161987,
            "ItemURL": "https://s3-ap-southeast-2.amazonaws.com/openchargemap/images/IT/OCM161987/OCM-161987.orig.2020073015093694.jpg",
            "ItemThumbnailURL": "https://s3-ap-southeast-2.amazonaws.com/openchargemap/images/IT/OCM161987/OCM-161987.thmb.2020073015093694.jpg",
            "Comment": "",
            "IsEnabled": true,
            "IsVideo": false,
            "IsFeaturedItem": false,
            "IsExternalResource": false,
            "User": {
                "ID": 11749,
                "Username": "ForumElettrico.it"
            },
            "DateCreated": "2020-07-30T15:10:00Z"
        },
        {
            "ID": 23339,
            "ChargePointID": 161987,
            "ItemURL": "https://s3-ap-southeast-2.amazonaws.com/openchargemap/images/IT/OCM161987/OCM-161987.orig.2020073015094323.jpg",
            "ItemThumbnailURL": "https://s3-ap-southeast-2.amazonaws.com/openchargemap/images/IT/OCM161987/OCM-161987.thmb.2020073015094323.jpg",
            "Comment": "",
            "IsEnabled": true,
            "IsVideo": false,
            "IsFeaturedItem": false,
            "IsExternalResource": false,
            "User": {
                "ID": 11749,
                "Username": "ForumElettrico.it"
            },
            "DateCreated": "2020-07-30T15:10:00Z"
        },
        {
            "ID": 23340,
            "ChargePointID": 161987,
            "ItemURL": "https://s3-ap-southeast-2.amazonaws.com/openchargemap/images/IT/OCM161987/OCM-161987.orig.2020073015095158.jpg",
            "ItemThumbnailURL": "https://s3-ap-southeast-2.amazonaws.com/openchargemap/images/IT/OCM161987/OCM-161987.thmb.2020073015095158.jpg",
            "Comment": "",
            "IsEnabled": true,
            "IsVideo": false,
            "IsFeaturedItem": false,
            "IsExternalResource": false,
            "User": {
                "ID": 11749,
                "Username": "ForumElettrico.it"
            },
            "DateCreated": "2020-07-30T15:10:00Z"
        },
        {
            "ID": 23341,
            "ChargePointID": 161987,
            "ItemURL": "https://s3-ap-southeast-2.amazonaws.com/openchargemap/images/IT/OCM161987/OCM-161987.orig.2020073015095896.jpg",
            "ItemThumbnailURL": "https://s3-ap-southeast-2.amazonaws.com/openchargemap/images/IT/OCM161987/OCM-161987.thmb.2020073015095896.jpg",
            "Comment": "",
            "IsEnabled": true,
            "IsVideo": false,
            "IsFeaturedItem": false,
            "IsExternalResource": false,
            "User": {
                "ID": 11749,
                "Username": "ForumElettrico.it"
            },
            "DateCreated": "2020-07-30T15:10:00Z"
        },
        {
            "ID": 23342,
            "ChargePointID": 161987,
            "ItemURL": "https://s3-ap-southeast-2.amazonaws.com/openchargemap/images/IT/OCM161987/OCM-161987.orig.2020073015100614.jpg",
            "ItemThumbnailURL": "https://s3-ap-southeast-2.amazonaws.com/openchargemap/images/IT/OCM161987/OCM-161987.thmb.2020073015100614.jpg",
            "Comment": "",
            "IsEnabled": true,
            "IsVideo": false,
            "IsFeaturedItem": false,
            "IsExternalResource": false,
            "User": {
                "ID": 11749,
                "Username": "ForumElettrico.it"
            },
            "DateCreated": "2020-07-30T15:10:00Z"
        }
    ],
    "IsRecentlyVerified": false,
    "ID": 161987,
    "UUID": "C2EFC7B5-EECC-47F8-B3B4-0336DE91EAD6",
    "DataProviderID": 1,
    "OperatorID": 3327,
    "UsageTypeID": 1,
    "AddressInfo": {
        "ID": 162344,
        "Title": "BeCharge Distributore Esso Commenda",
        "AddressLine1": "SP 7 km 11,304",
        "Town": "Viterbo",
        "StateOrProvince": "VT",
        "CountryID": 112,
        "Latitude": 42.520443,
        "Longitude": 11.974188,
        "RelatedURL": "https://www.forumelettrico.it/forum/colonnina-be-charge-22-kw-distributore-esso-viterbo-vt-sp-7-km-11-304-commenda-t11725.html",
        "DistanceUnit": 0
    },
    "Connections": [
        {
            "ID": 233144,
            "ConnectionTypeID": 25,
            "LevelID": 2,
            "PowerKW": 22,
            "Quantity": 2
        }
    ],
    "NumberOfPoints": 1,
    "StatusTypeID": 50,
    "DateLastStatusUpdate": "2020-08-27T14:44:00Z",
    "DataQualityLevel": 1,
    "DateCreated": "2020-07-30T15:09:00Z",
    "SubmissionStatusTypeID": 200
}