{
    "IsRecentlyVerified": false,
    "ID": 167962,
    "UUID": "1A1A2FB8-CB96-4F7A-AE91-DF3CCF4AD98C",
    "DataProviderID": 1,
    "OperatorID": 150,
    "UsageTypeID": 4,
    "UsageCost": "Completely free to use until October 2021",
    "AddressInfo": {
        "ID": 168321,
        "Title": "Timber Street Car Park",
        "AddressLine1": "Huddersfield Road",
        "Town": "Elland",
        "StateOrProvince": "West Yorkshire",
        "Postcode": "HX5 0ER",
        "CountryID": 1,
        "Latitude": 53.685115,
        "Longitude": -1.835851,
        "ContactTelephone1": "443336660059",
        "ContactTelephone2": "£10 overstay fee after 75 mins, then £10 every subsequent 75 mins.",
        "AccessComments": "Parking Fees may Apply Mon-Sat 08:00 - 18:00 Up to 1 hour\t        £0.40 Up to 2 hours\t£0.80 Up to 3 hours\t£1.20 Up to 4 hours\t£1.60 Up to 5 hours\t£2.00 Up to 6 hours\t£2.40",
        "RelatedURL": "https://ev.engie.co.uk/",
        "DistanceUnit": 0
    },
    "Connections": [
        {
            "ID": 255003,
            "ConnectionTypeID": 25,
            "Reference": "1",
            "StatusTypeID": 50,
            "LevelID": 2,
            "Amps": 32,
            "Voltage": 400,
            "PowerKW": 22,
            "CurrentTypeID": 20,
            "Quantity": 1
        },
        {
            "ID": 255004,
            "ConnectionTypeID": 2,
            "Reference": "2",
            "StatusTypeID": 50,
            "LevelID": 3,
            "Amps": 125,
            "Voltage": 400,
            "PowerKW": 50,
            "CurrentTypeID": 30,
            "Quantity": 1
        },
        {
            "ID": 255005,
            "ConnectionTypeID": 33,
            "Reference": "3",
            "StatusTypeID": 50,
            "LevelID": 3,
            "Amps": 125,
            "Voltage": 400,
            "PowerKW": 50,
            "CurrentTypeID": 30,
            "Quantity": 1
        }
    ],
    "NumberOfPoints": 2,
    "GeneralComments": "Engie rapid charger, 50kW DC, AC is a 22kW Socket. One bay for general use, one bay for taxis. Both Free to charge. Please register at : ev.engie.co.uk",
    "StatusTypeID": 50,
    "DateLastStatusUpdate": "2020-10-04T03:29:00Z",
    "MetadataValues": [
        {
            "ID": 8006,
            "MetadataFieldID": 4,
            "ItemValue": "Contains public sector information licensed under the Open Government Licence v2.0. http://www.nationalarchives.gov.uk/doc/open-government-licence/version/2/"
        }
    ],
    "DataQualityLevel": 3,
    "DateCreated": "2020-09-17T21:04:00Z",
    "SubmissionStatusTypeID": 100
}