{
    "IsRecentlyVerified": false,
    "ID": 73151,
    "UUID": "A025B6E5-E760-4B60-BF3C-AE9FBCE0F68B",
    "DataProviderID": 1,
    "OperatorID": 2241,
    "UsageTypeID": 4,
    "AddressInfo": {
        "ID": 73497,
        "Title": "Kriegsstraße",
        "AddressLine1": "Kriegsstraße 43",
        "Town": "Hambrücken",
        "StateOrProvince": "Verwaltungsgemeinschaft Bruchsal",
        "Postcode": "76707",
        "CountryID": 87,
        "Latitude": 49.188668923254994,
        "Longitude": 8.53897443072321,
        "AccessComments": "Auf dem Parkplatz ist die 24/7 nutzbare weißgrüne Ladesäule. ",
        "DistanceUnit": 0
    },
    "Connections": [
        {
            "ID": 105174,
            "ConnectionTypeID": 25,
            "StatusTypeID": 50,
            "LevelID": 2,
            "Amps": 32,
            "Voltage": 400,
            "PowerKW": 22,
            "CurrentTypeID": 20,
            "Quantity": 2
        },
        {
            "ID": 105175,
            "ConnectionTypeID": 28,
            "StatusTypeID": 50,
            "LevelID": 2,
            "Amps": 16,
            "Voltage": 230,
            "PowerKW": 3.7,
            "CurrentTypeID": 10,
            "Quantity": 2
        }
    ],
    "NumberOfPoints": 4,
    "StatusTypeID": 50,
    "DateLastStatusUpdate": "2016-11-11T07:31:00Z",
    "DataQualityLevel": 1,
    "DateCreated": "2016-11-11T07:31:00Z",
    "SubmissionStatusTypeID": 200
}