{
    "IsRecentlyVerified": false,
    "ID": 162456,
    "UUID": "114E3B30-4C26-4362-928E-B13AB12F2021",
    "DataProviderID": 1,
    "OperatorID": 21,
    "UsageTypeID": 4,
    "UsageCost": "Mobi.E compatible card",
    "AddressInfo": {
        "ID": 162813,
        "Title": "AMD-00026",
        "AddressLine1": "Lidl Alfragide",
        "Town": "Alfragide",
        "StateOrProvince": "Lisboa",
        "Postcode": "2610-141",
        "CountryID": 180,
        "Latitude": 38.74123113786709,
        "Longitude": -9.22491677594303,
        "DistanceUnit": 0
    },
    "Connections": [
        {
            "ID": 233824,
            "ConnectionTypeID": 2,
            "StatusTypeID": 50,
            "LevelID": 3,
            "Amps": 120,
            "Voltage": 500,
            "PowerKW": 50,
            "CurrentTypeID": 30,
            "Quantity": 1
        },
        {
            "ID": 233825,
            "ConnectionTypeID": 33,
            "StatusTypeID": 50,
            "LevelID": 3,
            "Amps": 125,
            "Voltage": 500,
            "PowerKW": 50,
            "CurrentTypeID": 30,
            "Quantity": 1
        },
        {
            "ID": 233826,
            "ConnectionTypeID": 1036,
            "StatusTypeID": 50,
            "LevelID": 3,
            "Amps": 64,
            "Voltage": 400,
            "PowerKW": 43,
            "CurrentTypeID": 20,
            "Quantity": 1
        }
    ],
    "NumberOfPoints": 2,
    "StatusTypeID": 50,
    "DateLastStatusUpdate": "2020-08-08T23:01:00Z",
    "DataQualityLevel": 1,
    "DateCreated": "2020-08-08T23:01:00Z",
    "SubmissionStatusTypeID": 200
}