{
    "IsRecentlyVerified": false,
    "ID": 135431,
    "UUID": "3748BF1B-75D6-48C0-9771-F9A6AE8DBF3F",
    "DataProviderID": 1,
    "OperatorID": 1,
    "UsageTypeID": 5,
    "AddressInfo": {
        "ID": 135777,
        "Title": "Vesturgata Car Park",
        "AddressLine1": "Mjóstræti 2",
        "Town": "Reykjavík",
        "CountryID": 105,
        "Latitude": 64.1485883,
        "Longitude": -21.9453599,
        "AccessComments": "Located on the second floor of the car park",
        "DistanceUnit": 0
    },
    "Connections": [
        {
            "ID": 189757,
            "ConnectionTypeID": 25,
            "StatusTypeID": 50,
            "LevelID": 2
        }
    ],
    "NumberOfPoints": 4,
    "GeneralComments": "Free charging within paid carpark",
    "StatusTypeID": 50,
    "DateLastStatusUpdate": "2020-02-25T10:39:00Z",
    "DataQualityLevel": 1,
    "DateCreated": "2019-12-20T20:05:00Z",
    "SubmissionStatusTypeID": 200
}