{
    "IsRecentlyVerified": false,
    "ID": 29031,
    "UUID": "C31FF368-A2E8-4D01-8803-6F7E99B87254",
    "DataProviderID": 2,
    "DataProvidersReference": "58205",
    "OperatorID": 5,
    "UsageTypeID": 1,
    "AddressInfo": {
        "ID": 29377,
        "Title": "HOLIDAY INN J",
        "AddressLine1": "308 N Comrie Ave",
        "Town": "Johnstown",
        "StateOrProvince": "NY",
        "Postcode": "12095",
        "CountryID": 2,
        "Latitude": 43.0224088,
        "Longitude": -74.3602289,
        "ContactTelephone1": "888-758-4389",
        "AccessComments": "24 hours daily",
        "RelatedURL": "http://www.chargepoint.com/",
        "DistanceUnit": 0
    },
    "Connections": [
        {
            "ID": 31902,
            "ConnectionTypeID": 1,
            "LevelID": 2,
            "Amps": 16,
            "Voltage": 230,
            "PowerKW": 3,
            "CurrentTypeID": 10,
            "Quantity": 2
        }
    ],
    "DateLastStatusUpdate": "2019-12-24T09:21:00Z",
    "DataQualityLevel": 3,
    "DateCreated": "2014-11-28T03:38:00Z",
    "SubmissionStatusTypeID": 100
}