{
    "IsRecentlyVerified": false,
    "ID": 73983,
    "UUID": "5AEA6ED9-D502-4C2A-8854-020581D7060C",
    "DataProviderID": 1,
    "OperatorID": 89,
    "OperatorsReference": "CEA-10139",
    "UsageTypeID": 4,
    "UsageCost": "CAD 2.50",
    "AddressInfo": {
        "ID": 74329,
        "Title": "Collège Laval",
        "AddressLine1": "1275 Avenue du Collège",
        "Town": "Laval",
        "StateOrProvince": "QC",
        "Postcode": "H7C 1W8",
        "CountryID": 44,
        "Latitude": 45.615499,
        "Longitude": -73.648099,
        "DistanceUnit": 0
    },
    "Connections": [
        {
            "ID": 106297,
            "ConnectionTypeID": 1,
            "StatusTypeID": 50,
            "LevelID": 2,
            "Amps": 32,
            "Voltage": 230,
            "PowerKW": 7,
            "CurrentTypeID": 10,
            "Quantity": 1
        }
    ],
    "NumberOfPoints": 1,
    "StatusTypeID": 50,
    "DateLastStatusUpdate": "2016-11-27T16:48:00Z",
    "DataQualityLevel": 1,
    "DateCreated": "2016-11-23T23:50:00Z",
    "SubmissionStatusTypeID": 200
}