{
    "IsRecentlyVerified": false,
    "ID": 183511,
    "UUID": "111283DD-BF1B-40FA-8C73-EB8F9B951047",
    "DataProviderID": 29,
    "DataProvidersReference": "17096",
    "AddressInfo": {
        "ID": 183870,
        "Title": "Börnecker Straße 6",
        "AddressLine1": "Börnecker Straße 6",
        "Town": "Blankenburg (Harz)",
        "Postcode": "38889",
        "CountryID": 87,
        "Latitude": 51.797066,
        "Longitude": 10.966681,
        "DistanceUnit": 0
    },
    "Connections": [
        {
            "ID": 290591,
            "ConnectionTypeID": 25,
            "StatusTypeID": 50,
            "LevelID": 2,
            "PowerKW": 22,
            "CurrentTypeID": 20
        },
        {
            "ID": 290592,
            "ConnectionTypeID": 25,
            "StatusTypeID": 50,
            "LevelID": 2,
            "PowerKW": 22,
            "CurrentTypeID": 20
        }
    ],
    "StatusTypeID": 50,
    "DateLastStatusUpdate": "2021-07-09T03:25:00Z",
    "MetadataValues": [
        {
            "ID": 15804,
            "MetadataFieldID": 4,
            "ItemValue": "Data from the German chargepoint registry provided by Bundesnetzagentur.de under the CC-BY 4.0 license"
        }
    ],
    "DataQualityLevel": 3,
    "DateCreated": "2021-07-08T10:04:00Z",
    "SubmissionStatusTypeID": 100
}