{
    "IsRecentlyVerified": false,
    "ID": 54140,
    "UUID": "218FCD31-5378-4DF1-82FF-4F1567159919",
    "DataProviderID": 1,
    "OperatorID": 215,
    "UsageTypeID": 4,
    "AddressInfo": {
        "ID": 54486,
        "Title": "Autohaus Heise",
        "AddressLine1": "Heidestraße 75",
        "Town": "Dessau-Roßlau",
        "Postcode": "06842",
        "CountryID": 87,
        "Latitude": 51.8180557,
        "Longitude": 12.2418783000001,
        "ContactTelephone1": "+49 340 87010",
        "AccessComments": "Die Säule ist nutzbar: Mo: von 06:30 bis 19:00 Uhr Di: von 06:30 bis 19:00 Uhr Mi: von 06:30 bis 19:00 Uhr Do: von 06:30 bis 19:00 Uhr Fr: von 06:30 bis 19:00 Uhr Sa: von 08:00 bis 13:00 Uhr So: geschlossen Freischaltung durch Mitarbeiter. Position: Die beiden Ladeplätze sind leider meist von Fahrzeugen des Autohauses zugeparkt. fest installierte Ladekabel, nur für Fahrzeuge mit Typ2 Anschluss nutzbar ACHTUNG: CCS muss noch verifiziert werden!\r\n",
        "RelatedURL": "http://www.autohaus-heise.de",
        "DistanceUnit": 0
    },
    "Connections": [
        {
            "ID": 68008,
            "ConnectionTypeID": 28,
            "StatusTypeID": 50,
            "LevelID": 2,
            "Amps": 16,
            "Voltage": 230,
            "PowerKW": 3.7,
            "CurrentTypeID": 10,
            "Quantity": 0
        },
        {
            "ID": 68009,
            "ConnectionTypeID": 25,
            "StatusTypeID": 50,
            "LevelID": 2,
            "PowerKW": 3.7,
            "CurrentTypeID": 20,
            "Quantity": 2
        },
        {
            "ID": 68010,
            "ConnectionTypeID": 16,
            "StatusTypeID": 50,
            "LevelID": 2,
            "Amps": 16,
            "Voltage": 230,
            "PowerKW": 3.7,
            "CurrentTypeID": 10,
            "Quantity": 0
        },
        {
            "ID": 68011,
            "ConnectionTypeID": 17,
            "StatusTypeID": 50,
            "LevelID": 2,
            "PowerKW": 0,
            "CurrentTypeID": 20,
            "Quantity": 0
        },
        {
            "ID": 68012,
            "ConnectionTypeID": 2,
            "StatusTypeID": 50,
            "LevelID": 2,
            "PowerKW": 0,
            "CurrentTypeID": 30,
            "Quantity": 0
        },
        {
            "ID": 68013,
            "ConnectionTypeID": 33,
            "StatusTypeID": 50,
            "LevelID": 2,
            "PowerKW": 0,
            "CurrentTypeID": 30,
            "Quantity": 0
        }
    ],
    "NumberOfPoints": 2,
    "StatusTypeID": 50,
    "DateLastStatusUpdate": "2015-09-24T17:25:00Z",
    "DataQualityLevel": 1,
    "DateCreated": "2015-09-23T18:20:00Z",
    "SubmissionStatusTypeID": 200
}