{
    "IsRecentlyVerified": false,
    "ID": 115595,
    "UUID": "F8C25365-B8DC-4CF2-B599-4315AB7AF40F",
    "DataProviderID": 2,
    "DataProvidersReference": "116020",
    "OperatorID": 23,
    "UsageTypeID": 1,
    "AddressInfo": {
        "ID": 115941,
        "Title": "First Landing State Park - Tesla Destination",
        "AddressLine1": "2500 Shore Dr ",
        "Town": "Virginia Beach",
        "StateOrProvince": "VA",
        "Postcode": "23451",
        "CountryID": 2,
        "Latitude": 36.916519,
        "Longitude": -76.055714,
        "ContactTelephone1": "757-412-2300  877-798-3752",
        "AccessComments": "24 hours daily; for Tesla use only ",
        "RelatedURL": "https://www.tesla.com/destination-charging",
        "DistanceUnit": 0
    },
    "Connections": [
        {
            "ID": 162619,
            "ConnectionTypeID": 0,
            "LevelID": 2,
            "Amps": 16,
            "Voltage": 230,
            "PowerKW": 3,
            "CurrentTypeID": 10,
            "Quantity": 2
        }
    ],
    "DateLastStatusUpdate": "2019-04-06T04:02:00Z",
    "DataQualityLevel": 3,
    "DateCreated": "2019-02-11T07:13:00Z",
    "SubmissionStatusTypeID": 100
}