{
    "IsRecentlyVerified": false,
    "ID": 29228,
    "UUID": "E4C8BF25-B68D-406A-8F54-651F1B288AAF",
    "DataProviderID": 2,
    "DataProvidersReference": "62624",
    "OperatorID": 5,
    "UsageTypeID": 1,
    "AddressInfo": {
        "ID": 29574,
        "Title": "CITY OF ST PAUL",
        "AddressLine1": "1071 Marshall Ave",
        "Town": "St Paul",
        "StateOrProvince": "MN",
        "Postcode": "55104",
        "CountryID": 2,
        "Latitude": 44.9488625,
        "Longitude": -93.1454098,
        "ContactTelephone1": "888-758-4389",
        "AccessComments": "24 hours daily",
        "RelatedURL": "http://www.chargepoint.com/",
        "DistanceUnit": 0
    },
    "Connections": [
        {
            "ID": 32123,
            "ConnectionTypeID": 1,
            "LevelID": 2,
            "Amps": 16,
            "Voltage": 230,
            "PowerKW": 3.7,
            "CurrentTypeID": 10,
            "Quantity": 2
        }
    ],
    "DateLastStatusUpdate": "2020-06-26T03:08:00Z",
    "DataQualityLevel": 3,
    "DateCreated": "2014-11-28T03:39:00Z",
    "SubmissionStatusTypeID": 100
}