{
    "IsRecentlyVerified": false,
    "ID": 6946,
    "UUID": "F9139820-46C6-4E08-9586-6910A24937DE",
    "DataProviderID": 1,
    "UsageTypeID": 1,
    "UsageCost": "Free",
    "AddressInfo": {
        "ID": 6847,
        "Title": "Parking Hoche",
        "AddressLine1": "    Rue François Raoult  ",
        "AddressLine2": "",
        "Town": "Grenoble",
        "StateOrProvince": "",
        "Postcode": "38000",
        "CountryID": 80,
        "Latitude": 45.1861865,
        "Longitude": 5.7265125000000126,
        "ContactTelephone1": "+33 4 76 43 08 63",
        "ContactTelephone2": "",
        "ContactEmail": "p380009@vincipark.com",
        "AccessComments": "",
        "DistanceUnit": 0
    },
    "Connections": [],
    "NumberOfPoints": 1,
    "GeneralComments": "",
    "DateLastConfirmed": "2011-10-10T20:05:00Z",
    "StatusTypeID": 0,
    "DateLastStatusUpdate": "2011-10-10T20:05:00Z",
    "DataQualityLevel": 1,
    "DateCreated": "2011-10-10T20:05:00Z",
    "SubmissionStatusTypeID": 200
}