{
    "IsRecentlyVerified": false,
    "ID": 15347,
    "UUID": "804B1BC8-D846-4038-B661-BC0F82ABD265",
    "DataProviderID": 1,
    "OperatorID": 51,
    "UsageTypeID": 0,
    "UsageCost": "Free",
    "AddressInfo": {
        "ID": 15693,
        "Title": "Infirmary Capital Health",
        "AddressLine1": "1796 Summer Street",
        "AddressLine2": "",
        "Town": "Halifax",
        "StateOrProvince": "NS",
        "Postcode": "B3H 3A6",
        "CountryID": 44,
        "Latitude": 44.645847,
        "Longitude": -63.58608129999999,
        "ContactTelephone1": "",
        "ContactTelephone2": "",
        "ContactEmail": "",
        "AccessComments": "",
        "RelatedURL": "http://www.cdha.nshealth.ca/about-us/our-facilities/qeii-health-sciences-centre",
        "DistanceUnit": 0
    },
    "Connections": [
        {
            "ID": 13651,
            "ConnectionTypeID": 1,
            "StatusTypeID": 0,
            "LevelID": 2,
            "Amps": 72,
            "Voltage": 240,
            "PowerKW": 17.3,
            "Quantity": 1
        }
    ],
    "NumberOfPoints": 1,
    "GeneralComments": "",
    "StatusTypeID": 50,
    "DateLastStatusUpdate": "2013-01-08T15:25:00Z",
    "DataQualityLevel": 1,
    "DateCreated": "2013-01-08T15:25:00Z",
    "SubmissionStatusTypeID": 200
}