{
    "IsRecentlyVerified": false,
    "ID": 152610,
    "UUID": "E9A9D312-947E-4AF0-9F7F-54CFA43BD6A3",
    "DataProviderID": 28,
    "DataProvidersReference": "FR*S49*P49360*001",
    "UsageTypeID": 5,
    "AddressInfo": {
        "ID": 152963,
        "Title": "LA VARENNE - Rue De Bretagne",
        "AddressLine1": "Rue De Bretagne 49270 LA VARENNE",
        "CountryID": 80,
        "Latitude": 47.313,
        "Longitude": -1.322585,
        "AccessComments": "24h/24 7j/7",
        "DistanceUnit": 0
    },
    "Connections": [
        {
            "ID": 213710,
            "ConnectionTypeID": 25,
            "StatusTypeID": 50,
            "LevelID": 2,
            "PowerKW": 18,
            "CurrentTypeID": 20
        },
        {
            "ID": 213711,
            "ConnectionTypeID": 28,
            "StatusTypeID": 50,
            "LevelID": 2,
            "PowerKW": 18,
            "CurrentTypeID": 10
        },
        {
            "ID": 246804,
            "ConnectionTypeID": 25,
            "StatusTypeID": 50,
            "LevelID": 2,
            "PowerKW": 18,
            "CurrentTypeID": 20
        },
        {
            "ID": 246805,
            "ConnectionTypeID": 28,
            "StatusTypeID": 50,
            "LevelID": 2,
            "PowerKW": 18,
            "CurrentTypeID": 10
        }
    ],
    "GeneralComments": "Recharge par badge et avec une application smartphone",
    "StatusTypeID": 50,
    "DateLastStatusUpdate": "2020-08-27T05:13:00Z",
    "DataQualityLevel": 2,
    "DateCreated": "2020-03-15T10:53:00Z",
    "SubmissionStatusTypeID": 100
}