{
    "IsRecentlyVerified": false,
    "ID": 185913,
    "UUID": "DB1D960E-467C-4354-85AA-C89411A91A6F",
    "DataProviderID": 29,
    "DataProvidersReference": "16166",
    "AddressInfo": {
        "ID": 186272,
        "Title": "Lorscher Str. 7",
        "AddressLine1": "Lorscher Str. 7",
        "Town": "Weinheim",
        "Postcode": "69469",
        "CountryID": 87,
        "Latitude": 49.558527,
        "Longitude": 8.64968,
        "DistanceUnit": 0
    },
    "Connections": [
        {
            "ID": 297181,
            "ConnectionTypeID": 25,
            "StatusTypeID": 50,
            "LevelID": 2,
            "PowerKW": 22,
            "CurrentTypeID": 20
        },
        {
            "ID": 297182,
            "ConnectionTypeID": 25,
            "StatusTypeID": 50,
            "LevelID": 2,
            "PowerKW": 22,
            "CurrentTypeID": 20
        }
    ],
    "StatusTypeID": 50,
    "DateLastStatusUpdate": "2021-07-12T02:43:00Z",
    "MetadataValues": [
        {
            "ID": 18155,
            "MetadataFieldID": 4,
            "ItemValue": "Data from the German chargepoint registry provided by Bundesnetzagentur.de under the CC-BY 4.0 license"
        }
    ],
    "DataQualityLevel": 3,
    "DateCreated": "2021-07-12T02:43:00Z",
    "SubmissionStatusTypeID": 100
}