{
    "IsRecentlyVerified": false,
    "ID": 183048,
    "UUID": "9B812A1F-2A02-452E-80F0-D8EC7E410A57",
    "DataProviderID": 29,
    "DataProvidersReference": "12893",
    "OperatorID": 45,
    "AddressInfo": {
        "ID": 183407,
        "Title": "Im Bödel 1",
        "AddressLine1": "Im Bödel 1",
        "Town": "Wörth am Rhein",
        "Postcode": "76744",
        "CountryID": 87,
        "Latitude": 49.047811,
        "Longitude": 8.264299,
        "DistanceUnit": 0
    },
    "Connections": [
        {
            "ID": 289548,
            "ConnectionTypeID": 25,
            "StatusTypeID": 50,
            "LevelID": 2,
            "PowerKW": 22,
            "CurrentTypeID": 20
        },
        {
            "ID": 289549,
            "ConnectionTypeID": 25,
            "StatusTypeID": 50,
            "LevelID": 2,
            "PowerKW": 22,
            "CurrentTypeID": 20
        }
    ],
    "StatusTypeID": 50,
    "DateLastStatusUpdate": "2021-07-12T02:42:00Z",
    "MetadataValues": [
        {
            "ID": 15341,
            "MetadataFieldID": 4,
            "ItemValue": "Data from the German chargepoint registry provided by Bundesnetzagentur.de under the CC-BY 4.0 license"
        }
    ],
    "DataQualityLevel": 3,
    "DateCreated": "2021-07-08T10:03:00Z",
    "SubmissionStatusTypeID": 100
}