{
    "IsRecentlyVerified": false,
    "ID": 131707,
    "UUID": "FDDDD0C1-10A2-4E04-83C5-BC9C89ED8CB1",
    "DataProviderID": 1,
    "OperatorID": 3,
    "OperatorsReference": "PG-83292,PG-83571",
    "UsageTypeID": 4,
    "UsageCost": "Free",
    "AddressInfo": {
        "ID": 132053,
        "Title": "The Pig-At Bridge Place",
        "AddressLine1": "Bourne Park Road",
        "Town": "Bridge",
        "StateOrProvince": "Canterbury",
        "Postcode": "CT4 5LF",
        "CountryID": 1,
        "Latitude": 51.242652,
        "Longitude": 1.123623,
        "DistanceUnit": 0
    },
    "Connections": [
        {
            "ID": 184343,
            "ConnectionTypeID": 25,
            "StatusTypeID": 50,
            "LevelID": 2,
            "Amps": 32,
            "Voltage": 230,
            "PowerKW": 7,
            "CurrentTypeID": 10,
            "Quantity": 4
        }
    ],
    "NumberOfPoints": 4,
    "GeneralComments": "This is an open charge unit installed at The Pig - at Bridge Place restaurant at Bourne Park Road, Bridge, Canterbury",
    "StatusTypeID": 50,
    "DateLastStatusUpdate": "2019-09-12T05:23:00Z",
    "DataQualityLevel": 1,
    "DateCreated": "2019-09-11T05:32:00Z",
    "SubmissionStatusTypeID": 200
}