{
    "IsRecentlyVerified": false,
    "ID": 149653,
    "UUID": "F5C154DE-EB42-46E1-A04C-BF34AA5E0A2D",
    "DataProviderID": 1,
    "OperatorID": 23,
    "OperatorsReference": "53097",
    "UsageTypeID": 4,
    "AddressInfo": {
        "ID": 150006,
        "Title": "Best Western Hotel Horizon Ath Lessines",
        "AddressLine1": "Avenue des Artisans 1 Ghislenghien",
        "Town": "Ghislenghien",
        "Postcode": "7822",
        "CountryID": 26,
        "Latitude": 50.669343,
        "Longitude": 3.869279,
        "ContactTelephone1": "+32 68 44 51 11",
        "DistanceUnit": 0
    },
    "Connections": [
        {
            "ID": 207771,
            "ConnectionTypeID": 30,
            "StatusTypeID": 50,
            "LevelID": 2,
            "PowerKW": 11,
            "CurrentTypeID": 20,
            "Quantity": 2
        }
    ],
    "NumberOfPoints": 2,
    "GeneralComments": "2 Tesla Connectors, up to 11kW.Available for customers. Please call ahead.",
    "StatusTypeID": 50,
    "DateLastStatusUpdate": "2020-03-02T06:55:00Z",
    "DataQualityLevel": 1,
    "DateCreated": "2020-03-02T06:55:00Z",
    "SubmissionStatusTypeID": 200
}