{
    "IsRecentlyVerified": false,
    "ID": 141953,
    "UUID": "91FADDC3-882A-45A2-809F-0FA405B26CE7",
    "DataProviderID": 2,
    "DataProvidersReference": "147943",
    "OperatorID": 39,
    "UsageTypeID": 1,
    "AddressInfo": {
        "ID": 142305,
        "Title": "Walgreens - Thornton, CO #5837",
        "AddressLine1": "4351 E 104th Ave",
        "Town": "Thornton",
        "StateOrProvince": "CO",
        "Postcode": "80233",
        "CountryID": 2,
        "Latitude": 39.8850765,
        "Longitude": -104.9361791,
        "ContactTelephone1": "800-663-5633",
        "AccessComments": "MO: Not Specified; TU: Not Specified; WE: Not Specified; TH: Not Specified; FR: Not Specified; SA: Not Specified; SU: Not Specified",
        "RelatedURL": "http://www.semacharge.com/",
        "DistanceUnit": 0
    },
    "Connections": [
        {
            "ID": 197999,
            "ConnectionTypeID": 1,
            "LevelID": 2,
            "Amps": 16,
            "Voltage": 230,
            "PowerKW": 3,
            "CurrentTypeID": 10,
            "Quantity": 1
        }
    ],
    "StatusTypeID": 50,
    "DateLastStatusUpdate": "2019-12-24T09:16:00Z",
    "DataQualityLevel": 3,
    "DateCreated": "2019-12-24T09:16:00Z",
    "SubmissionStatusTypeID": 100
}