{
    "IsRecentlyVerified": false,
    "ID": 63505,
    "UUID": "A40F5480-607E-41CA-8EF0-732950AA14DC",
    "DataProviderID": 26,
    "DataProvidersReference": "78433",
    "OperatorID": 73,
    "OperatorsReference": "EV-Box EVB-P1536390",
    "UsageCost": "0.00 jaarabonnement",
    "AddressInfo": {
        "ID": 63851,
        "Title": "Haarweg 1c",
        "AddressLine1": "Haarweg 1c",
        "Town": "Utrechtse Heuvelrug",
        "Postcode": "3953 BG",
        "CountryID": 159,
        "Latitude": 52.05816,
        "Longitude": 5.40805,
        "RelatedURL": "http://www.ev-box.nl",
        "DistanceUnit": 0
    },
    "Connections": [
        {
            "ID": 81031,
            "ConnectionTypeID": 25,
            "LevelID": 2,
            "PowerKW": 5,
            "CurrentTypeID": 10
        }
    ],
    "NumberOfPoints": 1,
    "StatusTypeID": 50,
    "DateLastStatusUpdate": "2016-06-04T02:45:00Z",
    "DataQualityLevel": 3,
    "DateCreated": "2016-03-03T12:31:00Z",
    "SubmissionStatusTypeID": 100
}