{
    "IsRecentlyVerified": false,
    "ID": 122967,
    "UUID": "02FBA078-BD61-43AF-8920-7636FF9ECEE8",
    "DataProviderID": 2,
    "DataProvidersReference": "92452",
    "OperatorID": 5,
    "UsageTypeID": 1,
    "AddressInfo": {
        "ID": 123313,
        "Title": "GASTONIA",
        "AddressLine1": "330 Dr M.L.K. Jr. Way",
        "Town": "Gastonia",
        "StateOrProvince": "NC",
        "Postcode": "28052",
        "CountryID": 2,
        "Latitude": 35.266117,
        "Longitude": -81.1812969,
        "ContactTelephone1": "888-758-4389",
        "AccessComments": "24 hours daily",
        "RelatedURL": "http://www.chargepoint.com/",
        "DistanceUnit": 0
    },
    "Connections": [
        {
            "ID": 172897,
            "ConnectionTypeID": 1,
            "LevelID": 2,
            "Amps": 16,
            "Voltage": 230,
            "PowerKW": 3.7,
            "CurrentTypeID": 10,
            "Quantity": 2
        }
    ],
    "DateLastStatusUpdate": "2020-06-26T02:58:00Z",
    "DataQualityLevel": 3,
    "DateCreated": "2019-04-06T05:03:00Z",
    "SubmissionStatusTypeID": 100
}