{
    "IsRecentlyVerified": false,
    "ID": 41591,
    "UUID": "77D4F073-B434-4252-AF92-FCA23EA202A5",
    "DataProviderID": 26,
    "DataProvidersReference": "58865",
    "OperatorsReference": "Vesta Terminal Flushing BV",
    "UsageCost": "0.00 jaarabonnement",
    "AddressInfo": {
        "ID": 41937,
        "Title": "Oosterhavenweg 14",
        "AddressLine1": "Oosterhavenweg 14",
        "Town": "Vlissingen",
        "Postcode": "4382 NL",
        "CountryID": 159,
        "Latitude": 51.449326753365,
        "Longitude": 3.6013805866241,
        "DistanceUnit": 0
    },
    "Connections": [
        {
            "ID": 45540,
            "ConnectionTypeID": 25,
            "LevelID": 2,
            "PowerKW": 11,
            "CurrentTypeID": 10
        }
    ],
    "NumberOfPoints": 1,
    "StatusTypeID": 50,
    "DateLastStatusUpdate": "2016-06-04T02:39:00Z",
    "DataQualityLevel": 3,
    "DateCreated": "2015-02-09T03:25:00Z",
    "SubmissionStatusTypeID": 100
}