{
    "IsRecentlyVerified": false,
    "ID": 105297,
    "UUID": "DEF25E2D-3DC6-422A-A92F-BC639AF88C87",
    "DataProviderID": 1,
    "OperatorID": 156,
    "UsageTypeID": 4,
    "AddressInfo": {
        "ID": 105643,
        "Title": "Albert-Einstein-Straße",
        "AddressLine1": "Albert-Einstein-Straße 6",
        "Town": "Radevormwald",
        "StateOrProvince": "Oberbergischer Kreis",
        "Postcode": "42477",
        "CountryID": 87,
        "Latitude": 51.19514150000001,
        "Longitude": 7.383966299999997,
        "DistanceUnit": 0
    },
    "Connections": [
        {
            "ID": 148448,
            "ConnectionTypeID": 25,
            "StatusTypeID": 50,
            "LevelID": 2,
            "Amps": 32,
            "Voltage": 400,
            "PowerKW": 22,
            "CurrentTypeID": 20,
            "Quantity": 2
        }
    ],
    "NumberOfPoints": 2,
    "StatusTypeID": 50,
    "DateLastStatusUpdate": "2018-06-05T05:08:00Z",
    "DataQualityLevel": 1,
    "DateCreated": "2018-06-05T05:08:00Z",
    "SubmissionStatusTypeID": 200
}