{
    "IsRecentlyVerified": false,
    "ID": 108928,
    "UUID": "78B0E261-4BBE-4112-8221-0119CDCA8187",
    "DataProviderID": 1,
    "OperatorID": 23,
    "OperatorsReference": "46229",
    "UsageTypeID": 4,
    "AddressInfo": {
        "ID": 109274,
        "Title": "Prairie Knights Casino & Resort",
        "AddressLine1": "7932 Hwy 24",
        "Town": "Fort Yates",
        "StateOrProvince": "North Dakota",
        "Postcode": "58538",
        "CountryID": 2,
        "Latitude": 46.0869,
        "Longitude": -100.6301,
        "ContactTelephone1": "(800) 425-8277",
        "DistanceUnit": 0
    },
    "Connections": [
        {
            "ID": 154045,
            "ConnectionTypeID": 30,
            "StatusTypeID": 50,
            "LevelID": 2,
            "PowerKW": 16,
            "CurrentTypeID": 20,
            "Quantity": 4
        }
    ],
    "NumberOfPoints": 4,
    "GeneralComments": "4 Tesla Connectors, up to 16kW.Available to the public. Self park.",
    "StatusTypeID": 50,
    "DateLastStatusUpdate": "2018-10-11T13:06:00Z",
    "DataQualityLevel": 1,
    "DateCreated": "2018-10-11T13:06:00Z",
    "SubmissionStatusTypeID": 200
}