{
    "IsRecentlyVerified": false,
    "ID": 175780,
    "UUID": "EB3E0397-3CCF-4BFE-B45C-62C924F8AAF1",
    "DataProviderID": 1,
    "OperatorID": 80,
    "UsageTypeID": 4,
    "UsageCost": "free",
    "AddressInfo": {
        "ID": 176139,
        "Title": "Duoc",
        "AddressLine1": "Av. Vicuña Mackenna 4917",
        "AddressLine2": "San Joquin",
        "Town": "Santiago",
        "Postcode": "8940000",
        "CountryID": 49,
        "Latitude": -33.500257,
        "Longitude": -70.616472,
        "RelatedURL": "https://www.enelx.com/cl/es",
        "DistanceUnit": 0
    },
    "Connections": [
        {
            "ID": 272982,
            "ConnectionTypeID": 25,
            "StatusTypeID": 50,
            "LevelID": 2,
            "Amps": 32,
            "Voltage": 400,
            "PowerKW": 22,
            "CurrentTypeID": 20,
            "Quantity": 1
        }
    ],
    "NumberOfPoints": 1,
    "StatusTypeID": 50,
    "DateLastStatusUpdate": "2021-06-14T18:22:00Z",
    "DataQualityLevel": 1,
    "DateCreated": "2021-06-14T11:24:00Z",
    "SubmissionStatusTypeID": 200
}