{
    "MediaItems": [
        {
            "ID": 12174,
            "ChargePointID": 87876,
            "ItemURL": "https://s3-ap-southeast-2.amazonaws.com/openchargemap/images/NZ/OCM87876/OCM-87876.orig.2017051708281380.jpg",
            "ItemThumbnailURL": "https://s3-ap-southeast-2.amazonaws.com/openchargemap/images/NZ/OCM87876/OCM-87876.thmb.2017051708281380.jpg",
            "Comment": "",
            "IsEnabled": true,
            "IsVideo": false,
            "IsFeaturedItem": false,
            "IsExternalResource": false,
            "User": {
                "ID": 15365,
                "Username": "sliday"
            },
            "DateCreated": "2017-05-17T08:28:00Z"
        }
    ],
    "IsRecentlyVerified": false,
    "ID": 87876,
    "UUID": "30611638-671F-447F-ACD8-ECC3D6B5793D",
    "DataProviderID": 1,
    "UsageCost": "$5",
    "AddressInfo": {
        "ID": 88222,
        "Title": "Tapu Camp",
        "AddressLine1": "723 Thames Coast Rd",
        "Town": "Tapu",
        "Postcode": "3575",
        "CountryID": 161,
        "Latitude": -36.9837061,
        "Longitude": 175.5014959,
        "ContactTelephone1": "(647) 868-4837",
        "DistanceUnit": 0
    },
    "Connections": [
        {
            "ID": 124682,
            "ConnectionTypeID": 4
        }
    ],
    "NumberOfPoints": 2,
    "GeneralComments": "If camp office is closed please pay at the pub which is open till late\r\nThere are a couple of Blue Commando sockets available for EV charging just past the office and several more around the camp. Enjoy walks on the beach, a swim, or a meal and refreshments at the historic Royal Oak Hotel across the road. Cost is $5 flat fee for as long as you need. Just check in at the camp office or pub. Casual EV charging welcome. Enjoy your visit.",
    "StatusTypeID": 50,
    "DateLastStatusUpdate": "2017-05-17T08:28:00Z",
    "DataQualityLevel": 1,
    "DateCreated": "2017-05-17T08:28:00Z",
    "SubmissionStatusTypeID": 200
}