{
    "IsRecentlyVerified": false,
    "ID": 3532,
    "UUID": "40C03948-17D0-4657-95E0-1A1DC5FBBF31",
    "DataProviderID": 1,
    "UsageTypeID": 1,
    "AddressInfo": {
        "ID": 3533,
        "Title": "Hargett St. at Dawson Street",
        "AddressLine1": "285 W. Hargett St",
        "Town": "Raleigh",
        "StateOrProvince": "NC",
        "Postcode": "27601",
        "CountryID": 2,
        "Latitude": 35.77838,
        "Longitude": -78.643,
        "DistanceUnit": 0
    },
    "Connections": [
        {
            "ID": 48,
            "ConnectionTypeID": 1,
            "Quantity": 1
        }
    ],
    "NumberOfPoints": 1,
    "DateLastStatusUpdate": "2019-12-15T06:07:00Z",
    "DateCreated": "2010-02-28T00:00:00Z",
    "SubmissionStatusTypeID": 200
}