{
    "IsRecentlyVerified": false,
    "ID": 103795,
    "UUID": "6A8C9E98-F707-49C8-A36F-75DB4EB24D87",
    "DataProviderID": 1,
    "OperatorID": 3315,
    "OperatorsReference": "50507",
    "UsageTypeID": 4,
    "UsageCost": "Free",
    "AddressInfo": {
        "ID": 104141,
        "Title": "Avenue Square Car Park, Stewarton",
        "AddressLine1": "Avenue Square Car Park",
        "Town": "Stewarton",
        "StateOrProvince": "East Ayrshire",
        "Postcode": "KA3 5AP",
        "CountryID": 1,
        "Latitude": 55.68192,
        "Longitude": -4.51457,
        "DistanceUnit": 0
    },
    "Connections": [
        {
            "ID": 146496,
            "ConnectionTypeID": 25,
            "StatusTypeID": 50,
            "LevelID": 2,
            "Amps": 32,
            "Voltage": 400,
            "PowerKW": 22,
            "CurrentTypeID": 20,
            "Quantity": 2
        }
    ],
    "NumberOfPoints": 2,
    "StatusTypeID": 50,
    "DateLastStatusUpdate": "2018-05-09T05:14:00Z",
    "DataQualityLevel": 1,
    "DateCreated": "2018-05-09T05:14:00Z",
    "SubmissionStatusTypeID": 200
}