{
    "IsRecentlyVerified": false,
    "ID": 115546,
    "UUID": "0F976CEB-F17E-478B-AE5F-7685A0E886AB",
    "DataProviderID": 2,
    "DataProvidersReference": "114814",
    "OperatorID": 23,
    "UsageTypeID": 1,
    "AddressInfo": {
        "ID": 115892,
        "Title": "Four Seasons Resort - Rancho Encantado Santa Fe - Tesla Destination",
        "AddressLine1": "198 State Rd 592",
        "Town": "Santa Fe",
        "StateOrProvince": "NM",
        "Postcode": "87506",
        "CountryID": 2,
        "Latitude": 35.796123,
        "Longitude": -105.928822,
        "ContactTelephone1": "505-946-5700  877-798-3752",
        "AccessComments": "24 hours daily; for Tesla use only; for customer use only; see valet for access",
        "RelatedURL": "https://www.tesla.com/destination-charging",
        "DistanceUnit": 0
    },
    "Connections": [
        {
            "ID": 162563,
            "ConnectionTypeID": 0,
            "LevelID": 2,
            "Amps": 16,
            "Voltage": 230,
            "PowerKW": 3,
            "CurrentTypeID": 10,
            "Quantity": 2
        }
    ],
    "DateLastStatusUpdate": "2019-04-06T04:02:00Z",
    "DataQualityLevel": 3,
    "DateCreated": "2019-02-11T07:13:00Z",
    "SubmissionStatusTypeID": 100
}