{
    "IsRecentlyVerified": false,
    "ID": 64570,
    "UUID": "8C896BF6-EFB9-4354-A8A2-4421284C81F7",
    "DataProviderID": 1,
    "OperatorID": 214,
    "UsageTypeID": 4,
    "AddressInfo": {
        "ID": 64916,
        "Title": "Friedrich-Karl-Straße",
        "AddressLine1": "Friedrich-Karl-Straße 38",
        "AddressLine2": "Tempelhof",
        "Town": "Berlin",
        "StateOrProvince": "Berlin",
        "Postcode": "12103",
        "CountryID": 87,
        "Latitude": 52.45652,
        "Longitude": 13.376719999999978,
        "AccessComments": "Rund um die Uhr (24/7) nutzbar. Ladekarte von be eMobil oder Roamingpartnern The New Motion, LichtBlick Fahrstrom Chip oder ACE Ladekarte Power Me erforderlich. ",
        "DistanceUnit": 0
    },
    "Connections": [
        {
            "ID": 82954,
            "ConnectionTypeID": 25,
            "StatusTypeID": 50,
            "LevelID": 2,
            "Amps": 16,
            "Voltage": 400,
            "PowerKW": 11,
            "CurrentTypeID": 20,
            "Quantity": 2
        }
    ],
    "NumberOfPoints": 2,
    "StatusTypeID": 50,
    "DateLastStatusUpdate": "2016-03-11T10:48:00Z",
    "DataQualityLevel": 1,
    "DateCreated": "2016-03-11T10:48:00Z",
    "SubmissionStatusTypeID": 200
}