{
    "IsRecentlyVerified": false,
    "ID": 43386,
    "UUID": "F211D781-8421-4A6C-8BBE-9A3FD3D9E41F",
    "DataProviderID": 1,
    "OperatorID": 1,
    "UsageTypeID": 5,
    "UsageCost": "0.50€/kWh",
    "AddressInfo": {
        "ID": 43732,
        "Title": "Finanzamt Reutlingen",
        "AddressLine1": "Burgstrasse",
        "Town": "Reutlingen ",
        "Postcode": "72766",
        "CountryID": 87,
        "Latitude": 48.4903702165712,
        "Longitude": 9.21874993954674,
        "AccessComments": "Two reserved parkings in front of entry of \"Tiefgarage Finanzamt\"",
        "RelatedURL": "https://www.pbw.de/?cmd=e-parken&id_city=42&id_object=-1",
        "DistanceUnit": 0
    },
    "Connections": [
        {
            "ID": 52581,
            "ConnectionTypeID": 25,
            "StatusTypeID": 50,
            "LevelID": 2,
            "Amps": 16,
            "Voltage": 230,
            "PowerKW": 11,
            "CurrentTypeID": 20,
            "Quantity": 2
        },
        {
            "ID": 52582,
            "ConnectionTypeID": 28,
            "StatusTypeID": 50,
            "LevelID": 2,
            "Amps": 13,
            "Voltage": 230,
            "PowerKW": 3,
            "CurrentTypeID": 10,
            "Quantity": 2
        }
    ],
    "NumberOfPoints": 2,
    "StatusTypeID": 50,
    "DateLastStatusUpdate": "2015-03-29T13:50:00Z",
    "DataQualityLevel": 1,
    "DateCreated": "2015-03-29T13:17:00Z",
    "SubmissionStatusTypeID": 200
}