{
    "IsRecentlyVerified": false,
    "ID": 57908,
    "UUID": "10C33ED5-CBC8-40A2-BBCD-13C8B41813A4",
    "DataProviderID": 1,
    "OperatorID": 45,
    "UsageTypeID": 1,
    "UsageCost": "0",
    "AddressInfo": {
        "ID": 58254,
        "Title": "Euro Park Hotel",
        "AddressLine1": "Reutherstraße 1A",
        "Town": "Hennef",
        "Postcode": "53773",
        "CountryID": 87,
        "Latitude": 50.78147999999999,
        "Longitude": 7.257209999999986,
        "ContactTelephone1": "+49 (0)2242 8760",
        "AccessComments": "Rund um die Uhr (24/7) nutzbar \r\n",
        "RelatedURL": "http://www.euro-park-hotel.de/",
        "DistanceUnit": 0
    },
    "Connections": [
        {
            "ID": 73472,
            "ConnectionTypeID": 28,
            "StatusTypeID": 50,
            "LevelID": 2,
            "Amps": 16,
            "Voltage": 230,
            "PowerKW": 3.7,
            "CurrentTypeID": 10,
            "Quantity": 0
        },
        {
            "ID": 73473,
            "ConnectionTypeID": 25,
            "StatusTypeID": 50,
            "LevelID": 2,
            "PowerKW": 22,
            "CurrentTypeID": 20,
            "Quantity": 1
        },
        {
            "ID": 73474,
            "ConnectionTypeID": 16,
            "StatusTypeID": 50,
            "LevelID": 2,
            "Amps": 16,
            "Voltage": 230,
            "PowerKW": 3.7,
            "CurrentTypeID": 10,
            "Quantity": 0
        },
        {
            "ID": 73475,
            "ConnectionTypeID": 17,
            "StatusTypeID": 50,
            "LevelID": 2,
            "PowerKW": 0,
            "CurrentTypeID": 20,
            "Quantity": 0
        },
        {
            "ID": 73476,
            "ConnectionTypeID": 2,
            "StatusTypeID": 50,
            "LevelID": 2,
            "PowerKW": 0,
            "CurrentTypeID": 30,
            "Quantity": 0
        },
        {
            "ID": 73477,
            "ConnectionTypeID": 33,
            "StatusTypeID": 50,
            "LevelID": 2,
            "PowerKW": 0,
            "CurrentTypeID": 30,
            "Quantity": 0
        }
    ],
    "NumberOfPoints": 1,
    "StatusTypeID": 50,
    "DateLastStatusUpdate": "2015-12-27T23:10:00Z",
    "DataQualityLevel": 1,
    "DateCreated": "2015-12-27T23:10:00Z",
    "SubmissionStatusTypeID": 200
}