{
    "IsRecentlyVerified": false,
    "ID": 3407,
    "UUID": "50FBCDC5-89BC-4FC8-A7EC-AA8974A3DE2D",
    "DataProviderID": 1,
    "OperatorID": 1,
    "AddressInfo": {
        "ID": 3408,
        "Title": "City Hall",
        "AddressLine1": "15670 NE 85th St.",
        "Town": "Redmond",
        "StateOrProvince": "WA",
        "Postcode": "98052",
        "CountryID": 2,
        "Latitude": 47.679,
        "Longitude": -122.13,
        "DistanceUnit": 0
    },
    "Connections": [],
    "NumberOfPoints": 2,
    "GeneralComments": "Cost To Charge: ChargePoint Access Hours: 24 Hr",
    "DateLastStatusUpdate": "2019-12-15T06:07:00Z",
    "DateCreated": "2010-02-28T00:00:00Z",
    "SubmissionStatusTypeID": 200
}