{
    "IsRecentlyVerified": false,
    "ID": 186215,
    "UUID": "61A68AC9-4290-4B32-A07D-2236BE7E700A",
    "DataProviderID": 29,
    "DataProvidersReference": "4196",
    "AddressInfo": {
        "ID": 186574,
        "Title": "Sachsenallee 65",
        "AddressLine1": "Sachsenallee 65",
        "Town": "Glauchau",
        "Postcode": "08371",
        "CountryID": 87,
        "Latitude": 50.826807,
        "Longitude": 12.520004,
        "DistanceUnit": 0
    },
    "Connections": [
        {
            "ID": 298293,
            "ConnectionTypeID": 25,
            "StatusTypeID": 50,
            "LevelID": 2,
            "PowerKW": 22,
            "CurrentTypeID": 20
        },
        {
            "ID": 298294,
            "ConnectionTypeID": 25,
            "StatusTypeID": 50,
            "LevelID": 2,
            "PowerKW": 22,
            "CurrentTypeID": 20
        }
    ],
    "StatusTypeID": 50,
    "DateLastStatusUpdate": "2021-07-12T02:45:00Z",
    "MetadataValues": [
        {
            "ID": 18456,
            "MetadataFieldID": 4,
            "ItemValue": "Data from the German chargepoint registry provided by Bundesnetzagentur.de under the CC-BY 4.0 license"
        }
    ],
    "DataQualityLevel": 3,
    "DateCreated": "2021-07-12T02:45:00Z",
    "SubmissionStatusTypeID": 100
}