{
    "IsRecentlyVerified": false,
    "ID": 183327,
    "UUID": "5266C8C7-F56F-496F-971F-143B117ABB75",
    "DataProviderID": 29,
    "DataProvidersReference": "6818",
    "OperatorID": 234,
    "AddressInfo": {
        "ID": 183686,
        "Title": "Patersholzer Weg 19",
        "AddressLine1": "Patersholzer Weg 19",
        "Town": "Hilpoltstein ",
        "Postcode": "91161",
        "CountryID": 87,
        "Latitude": 49.184426,
        "Longitude": 11.198128,
        "DistanceUnit": 0
    },
    "Connections": [
        {
            "ID": 290166,
            "ConnectionTypeID": 25,
            "StatusTypeID": 50,
            "LevelID": 2,
            "PowerKW": 22,
            "CurrentTypeID": 20
        },
        {
            "ID": 290167,
            "ConnectionTypeID": 25,
            "StatusTypeID": 50,
            "LevelID": 2,
            "PowerKW": 22,
            "CurrentTypeID": 20
        }
    ],
    "StatusTypeID": 50,
    "DateLastStatusUpdate": "2021-07-12T02:42:00Z",
    "MetadataValues": [
        {
            "ID": 15620,
            "MetadataFieldID": 4,
            "ItemValue": "Data from the German chargepoint registry provided by Bundesnetzagentur.de under the CC-BY 4.0 license"
        }
    ],
    "DataQualityLevel": 3,
    "DateCreated": "2021-07-08T10:03:00Z",
    "SubmissionStatusTypeID": 100
}