{
    "IsRecentlyVerified": false,
    "ID": 186926,
    "UUID": "B075C7F7-6E9F-4F7E-B6D8-D085AFDBAB82",
    "DataProviderID": 29,
    "DataProvidersReference": "20450",
    "OperatorID": 103,
    "AddressInfo": {
        "ID": 187285,
        "Title": "Roseggerstr. 14",
        "AddressLine1": "Roseggerstr. 14",
        "Town": "Berlin",
        "Postcode": "12059",
        "CountryID": 87,
        "Latitude": 52.479501,
        "Longitude": 13.445771,
        "DistanceUnit": 0
    },
    "Connections": [
        {
            "ID": 300637,
            "ConnectionTypeID": 25,
            "StatusTypeID": 50,
            "LevelID": 2,
            "PowerKW": 11,
            "CurrentTypeID": 20
        },
        {
            "ID": 300638,
            "ConnectionTypeID": 25,
            "StatusTypeID": 50,
            "LevelID": 2,
            "PowerKW": 11,
            "CurrentTypeID": 20
        }
    ],
    "StatusTypeID": 50,
    "DateLastStatusUpdate": "2021-07-12T02:49:00Z",
    "MetadataValues": [
        {
            "ID": 19166,
            "MetadataFieldID": 4,
            "ItemValue": "Data from the German chargepoint registry provided by Bundesnetzagentur.de under the CC-BY 4.0 license"
        }
    ],
    "DataQualityLevel": 3,
    "DateCreated": "2021-07-12T02:49:00Z",
    "SubmissionStatusTypeID": 100
}