{
    "UserComments": [
        {
            "ID": 6510,
            "ChargePointID": 10420,
            "CommentTypeID": 10,
            "UserName": "ZeroNetOfficial",
            "Comment": "Very friendly and lovely campsite. Charging Stations located in campsite area opposite reception. Also allows guests to charge using the commando caravan hook ups - even has commando socket adapters for 3 pin plugs in the shop at reception.",
            "Rating": 4,
            "DateCreated": "2015-09-17T14:21:16.37Z",
            "User": {
                "ID": 2262,
                "Username": "ZeroNetOfficial"
            },
            "CheckinStatusTypeID": 10
        }
    ],
    "MediaItems": [
        {
            "ID": 17948,
            "ChargePointID": 10420,
            "ItemURL": "https://s3-ap-southeast-2.amazonaws.com/openchargemap/images/GB/OCM10420/OCM-10420.orig.2019040216310504.jpg",
            "ItemThumbnailURL": "https://s3-ap-southeast-2.amazonaws.com/openchargemap/images/GB/OCM10420/OCM-10420.thmb.2019040216310504.jpg",
            "Comment": "",
            "IsEnabled": true,
            "IsVideo": false,
            "IsFeaturedItem": false,
            "IsExternalResource": false,
            "User": {
                "ID": 15366,
                "Username": "ZCWCara"
            },
            "DateCreated": "2019-04-02T16:31:00Z"
        }
    ],
    "IsRecentlyVerified": false,
    "ID": 10420,
    "UUID": "13D890A7-4AD6-4BB9-B1C5-844B9A41418D",
    "DataProviderID": 1,
    "OperatorID": 19,
    "UsageTypeID": 1,
    "AddressInfo": {
        "ID": 10317,
        "Title": "Lower Treave Caravan & Camping Park",
        "AddressLine1": "Crows-An-Wra",
        "Town": "Penzance",
        "StateOrProvince": "Cornwall",
        "Postcode": "TR19 6HZ",
        "CountryID": 1,
        "Latitude": 50.088453,
        "Longitude": -5.65516,
        "ContactTelephone1": "01736 810559",
        "ContactEmail": "camping@lowertreave.co.uk",
        "RelatedURL": "http://www.lowertreave.co.uk",
        "DistanceUnit": 0
    },
    "Connections": [
        {
            "ID": 8351,
            "ConnectionTypeID": 3,
            "StatusTypeID": 50,
            "LevelID": 2,
            "Amps": 13,
            "Voltage": 230,
            "PowerKW": 3,
            "CurrentTypeID": 10,
            "Quantity": 1
        },
        {
            "ID": 8352,
            "ConnectionTypeID": 4,
            "StatusTypeID": 50,
            "LevelID": 2,
            "Amps": 32,
            "Voltage": 230,
            "PowerKW": 7,
            "CurrentTypeID": 20,
            "Quantity": 1
        }
    ],
    "NumberOfPoints": 2,
    "StatusTypeID": 50,
    "DateLastStatusUpdate": "2019-04-02T16:31:00Z",
    "DataQualityLevel": 1,
    "DateCreated": "2012-05-25T09:36:00Z",
    "SubmissionStatusTypeID": 200
}