{
    "IsRecentlyVerified": false,
    "ID": 178845,
    "UUID": "DEE7F232-099F-472A-8DB3-3F0DDF9C63DC",
    "DataProviderID": 29,
    "DataProvidersReference": "4973,8235",
    "AddressInfo": {
        "ID": 179204,
        "Title": "Weissacher Straße 73",
        "AddressLine1": "Weissacher Straße 73",
        "Town": "Backnang",
        "Postcode": "71522",
        "CountryID": 87,
        "Latitude": 48.9356761162533,
        "Longitude": 9.44646371868514,
        "DistanceUnit": 0
    },
    "Connections": [
        {
            "ID": 279809,
            "ConnectionTypeID": 25,
            "StatusTypeID": 50,
            "LevelID": 2,
            "PowerKW": 22,
            "CurrentTypeID": 20
        },
        {
            "ID": 279810,
            "ConnectionTypeID": 25,
            "StatusTypeID": 50,
            "LevelID": 2,
            "PowerKW": 22,
            "CurrentTypeID": 20
        },
        {
            "ID": 279811,
            "ConnectionTypeID": 33,
            "StatusTypeID": 50,
            "LevelID": 3,
            "PowerKW": 62.5,
            "CurrentTypeID": 30
        }
    ],
    "StatusTypeID": 0,
    "DateLastStatusUpdate": "2021-07-09T03:14:00Z",
    "MetadataValues": [
        {
            "ID": 11139,
            "MetadataFieldID": 4,
            "ItemValue": "Data from the German chargepoint registry provided by Bundesnetzagentur.de under the CC-BY 4.0 license"
        }
    ],
    "DataQualityLevel": 3,
    "DateCreated": "2021-07-08T09:50:00Z",
    "SubmissionStatusTypeID": 100
}