{
    "UserComments": [
        {
            "ID": 14609,
            "ChargePointID": 52160,
            "CommentTypeID": 10,
            "UserName": "Simon Hewison",
            "Comment": "Chademo charged ok, there's now also a Subway sandwich franchise on site.",
            "Rating": 5,
            "DateCreated": "2016-11-26T18:00:02.63Z",
            "User": {
                "ID": 4575,
                "Username": "Simon Hewison"
            }
        },
        {
            "ID": 14255,
            "ChargePointID": 52160,
            "CommentTypeID": 10,
            "UserName": "John Riley",
            "Comment": "First use of app and first Subway meal. ",
            "Rating": 4,
            "DateCreated": "2016-09-15T14:07:41.65Z",
            "User": {
                "ID": 3404,
                "Username": "John Riley"
            },
            "CheckinStatusTypeID": 10
        },
        {
            "ID": 11600,
            "ChargePointID": 52160,
            "CommentTypeID": 10,
            "UserName": "David M Eyrie",
            "Comment": "Working fine they are building a Subway ( the Sandwich store) there so it is messy but you can now drive up to the charger from the car park. The worst thing about this charger is pulling out on to the A12 afterwards. There is no run up so difficult at busy times to pull onto the road and build up speed.",
            "Rating": 3,
            "DateCreated": "2016-06-10T15:31:22.313Z",
            "User": {
                "ID": 9483,
                "Username": "David M Eyrie"
            },
            "CheckinStatusTypeID": 10
        },
        {
            "ID": 10181,
            "ChargePointID": 52160,
            "CommentTypeID": 1000,
            "UserName": "John Riley",
            "Comment": "Rubble in car park should be clear tomorrow 15th April. It is possible to charge over the verge but not desirable. ",
            "Rating": 2,
            "DateCreated": "2016-04-14T14:39:19.53Z",
            "User": {
                "ID": 3404,
                "Username": "John Riley"
            },
            "CheckinStatusTypeID": 10
        },
        {
            "ID": 10175,
            "ChargePointID": 52160,
            "CommentTypeID": 1000,
            "UserName": "John Riley",
            "Comment": "Parking area is blocked by rubble from roadworks. You might be able to make the leads reach across the grass verge but I was unable to try. ",
            "Rating": 1,
            "DateCreated": "2016-04-13T16:54:55.84Z",
            "User": {
                "ID": 3404,
                "Username": "John Riley"
            },
            "CheckinStatusTypeID": 120
        },
        {
            "ID": 9962,
            "ChargePointID": 52160,
            "CommentTypeID": 10,
            "UserName": "John Riley",
            "Comment": "AC tripped which is no surprise as both AC & CCS plugs were lying on the floor. CCS & Chademo OK, \n",
            "Rating": 4,
            "DateCreated": "2016-03-20T13:39:21.073Z",
            "User": {
                "ID": 3404,
                "Username": "John Riley"
            },
            "CheckinStatusTypeID": 10
        },
        {
            "ID": 8397,
            "ChargePointID": 52160,
            "CommentTypeID": 10,
            "UserName": "Simon Hewison",
            "Comment": "Good location, and Starbucks wifi reaches the charge point, useful when they are shut.",
            "Rating": 4,
            "DateCreated": "2016-01-01T19:51:53.13Z",
            "User": {
                "ID": 4575,
                "Username": "Simon Hewison"
            },
            "CheckinStatusTypeID": 10
        },
        {
            "ID": 8214,
            "ChargePointID": 52160,
            "CommentTypeID": 10,
            "UserName": "Bluemoon82",
            "Comment": "I have spoken to Ecotricity and they confirmed this site is now operational. ",
            "DateCreated": "2015-12-13T10:32:47.617Z",
            "User": {
                "ID": 6332,
                "Username": "Bluemoon82"
            },
            "CheckinStatusTypeID": 210
        },
        {
            "ID": 8018,
            "ChargePointID": 52160,
            "CommentTypeID": 10,
            "UserName": "Antoncott",
            "Comment": "Becoming a regular charge here now... very convenient ",
            "Rating": 5,
            "DateCreated": "2015-11-18T10:51:20.103Z",
            "User": {
                "ID": 6611,
                "Username": "Antoncott"
            },
            "CheckinStatusTypeID": 10
        },
        {
            "ID": 7977,
            "ChargePointID": 52160,
            "CommentTypeID": 10,
            "UserName": "John Riley",
            "Comment": "Can be accessed from Colchester bound carriageway by taking exit 23 Kelvedon then at bottom of slip road turn right under A12 signed London, 2 miles. \nTo get back to Colchester take first slip road Tiptree then left at T junction    then first left to A12, 1 mile ",
            "Rating": 4,
            "DateCreated": "2015-11-12T15:50:10.117Z",
            "User": {
                "ID": 3404,
                "Username": "John Riley"
            },
            "CheckinStatusTypeID": 10
        }
    ],
    "MediaItems": [
        {
            "ID": 8021,
            "ChargePointID": 52160,
            "ItemURL": "https://s3-ap-southeast-2.amazonaws.com/openchargemap/images/GB/OCM52160/OCM-52160.orig.2016081214014038.jpg",
            "ItemThumbnailURL": "https://s3-ap-southeast-2.amazonaws.com/openchargemap/images/GB/OCM52160/OCM-52160.thmb.2016081214014038.jpg",
            "Comment": "",
            "IsEnabled": true,
            "IsVideo": false,
            "IsFeaturedItem": false,
            "IsExternalResource": false,
            "User": {
                "ID": 3404,
                "Username": "John Riley"
            },
            "DateCreated": "2016-08-12T14:02:00Z"
        },
        {
            "ID": 3494,
            "ChargePointID": 52160,
            "ItemURL": "https://s3-ap-southeast-2.amazonaws.com/openchargemap/images/GB/OCM52160/OCM-52160.orig.2015111215522468.jpg",
            "ItemThumbnailURL": "https://s3-ap-southeast-2.amazonaws.com/openchargemap/images/GB/OCM52160/OCM-52160.thmb.2015111215522468.jpg",
            "Comment": "",
            "IsEnabled": true,
            "IsVideo": false,
            "IsFeaturedItem": false,
            "IsExternalResource": false,
            "User": {
                "ID": 3404,
                "Username": "John Riley"
            },
            "DateCreated": "2015-11-12T15:53:00Z"
        }
    ],
    "IsRecentlyVerified": false,
    "ID": 52160,
    "UUID": "1D7BF805-B497-40A0-B6F5-96E0559B26AB",
    "DataProviderID": 1,
    "OperatorID": 24,
    "OperatorsReference": "1292",
    "UsageTypeID": 4,
    "UsageCost": "£0.30/kWh; £0.15/kWh for Ecotricity energy customers. Ecotricity energy customers free",
    "AddressInfo": {
        "ID": 52506,
        "Title": "Euro Garages, Riven Hall Starbucks, A12 Southbound, Rivenhall End, Witham",
        "AddressLine1": "A12 Southbound",
        "AddressLine2": "Rivenhall End",
        "Town": "Witham",
        "StateOrProvince": "Essex",
        "Postcode": "CM8 3HB",
        "CountryID": 1,
        "Latitude": 51.81827,
        "Longitude": 0.670252,
        "ContactTelephone1": "01453 761455",
        "ContactEmail": "fortheroad@ecotricity.co.uk",
        "RelatedURL": "http://www.ecotricity.co.uk/for-the-road/our-electric-highway",
        "DistanceUnit": 0
    },
    "Connections": [
        {
            "ID": 64727,
            "ConnectionTypeID": 2,
            "StatusTypeID": 50,
            "LevelID": 3,
            "Amps": 125,
            "Voltage": 400,
            "PowerKW": 50,
            "CurrentTypeID": 30,
            "Quantity": 1
        },
        {
            "ID": 64728,
            "ConnectionTypeID": 1036,
            "StatusTypeID": 50,
            "LevelID": 3,
            "Amps": 63,
            "Voltage": 400,
            "PowerKW": 43,
            "CurrentTypeID": 20,
            "Quantity": 1
        },
        {
            "ID": 64729,
            "ConnectionTypeID": 33,
            "StatusTypeID": 50,
            "LevelID": 3,
            "Amps": 125,
            "Voltage": 400,
            "PowerKW": 50,
            "CurrentTypeID": 30,
            "Quantity": 1
        }
    ],
    "NumberOfPoints": 2,
    "GeneralComments": "Access via Ecotricity Electric Highway app",
    "StatusTypeID": 50,
    "DateLastStatusUpdate": "2021-03-19T06:14:00Z",
    "DataQualityLevel": 1,
    "DateCreated": "2015-08-20T15:41:00Z",
    "SubmissionStatusTypeID": 200
}