{
    "MediaItems": [
        {
            "ID": 21206,
            "ChargePointID": 148713,
            "ItemURL": "https://s3-ap-southeast-2.amazonaws.com/openchargemap/images/DE/OCM148713/OCM-148713.orig.2020021012354790.jpg",
            "ItemThumbnailURL": "https://s3-ap-southeast-2.amazonaws.com/openchargemap/images/DE/OCM148713/OCM-148713.thmb.2020021012354790.jpg",
            "Comment": "",
            "IsEnabled": true,
            "IsVideo": false,
            "IsFeaturedItem": false,
            "IsExternalResource": false,
            "User": {
                "ID": 12201,
                "Username": "Haegar2004"
            },
            "DateCreated": "2020-02-10T12:36:00Z"
        }
    ],
    "IsRecentlyVerified": false,
    "ID": 148713,
    "UUID": "B58F0E9C-C1DC-4453-936D-A7AE7DFB0CFE",
    "DataProviderID": 1,
    "OperatorID": 156,
    "UsageTypeID": 6,
    "AddressInfo": {
        "ID": 149065,
        "Title": "LH-Mitarbeiterparkhaus P43",
        "AddressLine1": "Airportring",
        "Town": "Frankfurt am Main",
        "StateOrProvince": "Hesse",
        "Postcode": "60549",
        "CountryID": 87,
        "Latitude": 50.04848588669398,
        "Longitude": 8.559743916602429,
        "DistanceUnit": 0
    },
    "Connections": [
        {
            "ID": 206491,
            "ConnectionTypeID": 25,
            "StatusTypeID": 50,
            "LevelID": 2,
            "PowerKW": 11,
            "CurrentTypeID": 20,
            "Quantity": 16
        }
    ],
    "NumberOfPoints": 16,
    "StatusTypeID": 50,
    "DateLastStatusUpdate": "2020-02-10T12:36:00Z",
    "DataQualityLevel": 1,
    "DateCreated": "2020-02-09T14:54:00Z",
    "SubmissionStatusTypeID": 200
}