{
    "IsRecentlyVerified": false,
    "ID": 184573,
    "UUID": "84A4543B-F4F0-4DCF-8E7E-BD70F68BBBAB",
    "DataProviderID": 29,
    "DataProvidersReference": "1582",
    "OperatorID": 45,
    "AddressInfo": {
        "ID": 184932,
        "Title": "Stollberger Str. 7",
        "AddressLine1": "Stollberger Str. 7",
        "Town": "Niederwürschnitz",
        "Postcode": "09339",
        "CountryID": 87,
        "Latitude": 50.72071,
        "Longitude": 12.75549,
        "DistanceUnit": 0
    },
    "Connections": [
        {
            "ID": 293007,
            "ConnectionTypeID": 25,
            "StatusTypeID": 50,
            "LevelID": 2,
            "PowerKW": 22,
            "CurrentTypeID": 20
        },
        {
            "ID": 293008,
            "ConnectionTypeID": 1036,
            "StatusTypeID": 50,
            "LevelID": 3,
            "PowerKW": 43,
            "CurrentTypeID": 30
        },
        {
            "ID": 298057,
            "ConnectionTypeID": 2,
            "StatusTypeID": 50,
            "LevelID": 3,
            "PowerKW": 43,
            "CurrentTypeID": 30
        },
        {
            "ID": 298058,
            "ConnectionTypeID": 33,
            "StatusTypeID": 50,
            "LevelID": 3,
            "PowerKW": 43,
            "CurrentTypeID": 30
        }
    ],
    "StatusTypeID": 50,
    "DateLastStatusUpdate": "2021-07-12T02:45:00Z",
    "MetadataValues": [
        {
            "ID": 16864,
            "MetadataFieldID": 4,
            "ItemValue": "Data from the German chargepoint registry provided by Bundesnetzagentur.de under the CC-BY 4.0 license"
        }
    ],
    "DataQualityLevel": 3,
    "DateCreated": "2021-07-08T10:05:00Z",
    "SubmissionStatusTypeID": 100
}