{
    "IsRecentlyVerified": false,
    "ID": 128151,
    "UUID": "CAAD992A-EF36-43A4-8983-12FC7B8AE0C7",
    "DataProviderID": 1,
    "OperatorID": 80,
    "UsageTypeID": 4,
    "UsageCost": "0,45€/h",
    "AddressInfo": {
        "ID": 128497,
        "Title": "YouGo Prenestina | EnelX",
        "AddressLine1": "Via Prenestina",
        "Town": "Roma",
        "StateOrProvince": "RM",
        "Postcode": "00155 ",
        "CountryID": 112,
        "Latitude": 41.893723251952,
        "Longitude": 12.5928501169858,
        "RelatedURL": "https://www.enelx.com/it/it/emobility",
        "DistanceUnit": 0
    },
    "Connections": [
        {
            "ID": 179327,
            "ConnectionTypeID": 25,
            "StatusTypeID": 50,
            "LevelID": 2,
            "Amps": 32,
            "Voltage": 400,
            "PowerKW": 22,
            "CurrentTypeID": 20,
            "Quantity": 1
        },
        {
            "ID": 179328,
            "ConnectionTypeID": 36,
            "StatusTypeID": 50,
            "LevelID": 2,
            "Amps": 16,
            "Voltage": 240,
            "PowerKW": 3.7,
            "CurrentTypeID": 10,
            "Quantity": 1
        }
    ],
    "NumberOfPoints": 2,
    "GeneralComments": " Lun-Ven 8:30-18 Sab 8.30-13 Dom Chiuso",
    "StatusTypeID": 50,
    "DateLastStatusUpdate": "2019-06-16T16:14:00Z",
    "DataQualityLevel": 1,
    "DateCreated": "2019-06-16T16:14:00Z",
    "SubmissionStatusTypeID": 200
}