{
    "IsRecentlyVerified": false,
    "ID": 103120,
    "UUID": "267F35DC-0859-4013-B841-9624D1708208",
    "DataProviderID": 1,
    "DataProvidersReference": "4713",
    "AddressInfo": {
        "ID": 103466,
        "Title": "Bondsjöhöjdens IP",
        "AddressLine1": "Stigsjövägen 3",
        "Town": "HÄRNÖSAND",
        "StateOrProvince": "VÄSTERNORRLAND",
        "Postcode": "87153",
        "CountryID": 216,
        "Latitude": 62.642621,
        "Longitude": 17.900365,
        "AccessComments": "Parkering mellan fotbollsplanerna",
        "DistanceUnit": 0
    },
    "Connections": [
        {
            "ID": 145562,
            "ConnectionTypeID": 0,
            "Reference": "1",
            "LevelID": 2,
            "Amps": 32,
            "Voltage": 400,
            "PowerKW": 22,
            "Comments": "Mode 3"
        },
        {
            "ID": 145563,
            "ConnectionTypeID": 0,
            "Reference": "2",
            "LevelID": 2,
            "Amps": 32,
            "Voltage": 400,
            "PowerKW": 22,
            "Comments": "Mode 3"
        }
    ],
    "NumberOfPoints": 2,
    "DateLastStatusUpdate": "2020-05-26T08:25:00Z",
    "DataQualityLevel": 2,
    "DateCreated": "2018-04-21T06:52:00Z",
    "SubmissionStatusTypeID": 100
}