{
    "UserComments": [
        {
            "ID": 8203,
            "ChargePointID": 32985,
            "CommentTypeID": 10,
            "UserName": "YANNOSICK",
            "Comment": "Opel Ampera",
            "Rating": 4,
            "DateCreated": "2015-12-11T22:02:29.577Z",
            "User": {
                "ID": 6237,
                "Username": "YANNOSICK"
            },
            "CheckinStatusTypeID": 10
        }
    ],
    "MediaItems": [
        {
            "ID": 3588,
            "ChargePointID": 32985,
            "ItemURL": "https://s3-ap-southeast-2.amazonaws.com/openchargemap/images/NL/OCM32985/OCM-32985.orig.2015121122032423.jpg",
            "ItemThumbnailURL": "https://s3-ap-southeast-2.amazonaws.com/openchargemap/images/NL/OCM32985/OCM-32985.thmb.2015121122032423.jpg",
            "Comment": "Media Markt",
            "IsEnabled": true,
            "IsVideo": false,
            "IsFeaturedItem": false,
            "IsExternalResource": false,
            "User": {
                "ID": 6237,
                "Username": "YANNOSICK"
            },
            "DateCreated": "2015-12-11T22:04:00Z"
        }
    ],
    "IsRecentlyVerified": false,
    "ID": 32985,
    "UUID": "1E26C75B-309A-4CD6-851C-AFCA537A3267",
    "DataProviderID": 26,
    "DataProvidersReference": "48877",
    "OperatorsReference": "Media Markt Middelburg",
    "UsageCost": "0.00 jaarabonnement",
    "AddressInfo": {
        "ID": 33331,
        "Title": "Mortiereboulevard 4",
        "AddressLine1": "Mortiereboulevard 4",
        "Town": "Middelburg",
        "Postcode": "4336 RA",
        "CountryID": 159,
        "Latitude": 51.48045665192,
        "Longitude": 3.6241344362497,
        "RelatedURL": "http://www.mediamarkt.nl",
        "DistanceUnit": 0
    },
    "Connections": [
        {
            "ID": 36496,
            "ConnectionTypeID": 25,
            "LevelID": 2,
            "PowerKW": 11,
            "CurrentTypeID": 10
        }
    ],
    "NumberOfPoints": 2,
    "StatusTypeID": 50,
    "DateLastStatusUpdate": "2016-06-04T02:39:00Z",
    "DataQualityLevel": 3,
    "DateCreated": "2015-01-09T06:03:00Z",
    "SubmissionStatusTypeID": 100
}