{
    "IsRecentlyVerified": false,
    "ID": 4936,
    "UUID": "25C21C60-7388-4579-8FE5-C6A430F4ED8C",
    "DataProviderID": 2,
    "DataProvidersReference": "39980",
    "UsageTypeID": 7,
    "AddressInfo": {
        "ID": 4876,
        "Title": "Sutherlin Nissan",
        "AddressLine1": "946 S US Highway 1",
        "Town": "Vero Beach",
        "StateOrProvince": "FL",
        "Postcode": "32962",
        "CountryID": 2,
        "Latitude": 27.585356,
        "Longitude": -80.376442,
        "ContactTelephone1": "772-778-3600",
        "AccessComments": "Dealership business hours\r\nPublic - Call ahead",
        "RelatedURL": "",
        "DistanceUnit": 0
    },
    "Connections": [
        {
            "ID": 15982,
            "ConnectionTypeID": 1,
            "LevelID": 2,
            "Amps": 16,
            "Voltage": 230,
            "PowerKW": 3.7,
            "CurrentTypeID": 10,
            "Quantity": 1
        },
        {
            "ID": 20956,
            "ConnectionTypeID": 1,
            "LevelID": 2,
            "Quantity": 1
        }
    ],
    "DateLastConfirmed": "2011-05-31T00:00:00Z",
    "StatusTypeID": 0,
    "DateLastStatusUpdate": "2020-06-26T02:52:00Z",
    "DataQualityLevel": 1,
    "DateCreated": "2011-07-04T18:02:00Z",
    "SubmissionStatusTypeID": 100
}