{
    "IsRecentlyVerified": false,
    "ID": 149753,
    "UUID": "3578E576-11D6-468F-966D-42CDF1DE80BA",
    "DataProviderID": 1,
    "OperatorID": 1,
    "UsageTypeID": 1,
    "AddressInfo": {
        "ID": 150106,
        "Title": "Semeljci DC punionica",
        "AddressLine1": "Ulica braće Radića",
        "AddressLine2": "Pivarnica",
        "Town": "Semeljci",
        "StateOrProvince": "Osječko-baranjska županija",
        "Postcode": "31402",
        "CountryID": 60,
        "Latitude": 45.3618069083316,
        "Longitude": 18.542840913200962,
        "AccessComments": "https://www.plugshare.com/location/236540",
        "RelatedURL": "http://www.semeljci.hr/",
        "DistanceUnit": 0
    },
    "Connections": [
        {
            "ID": 207897,
            "ConnectionTypeID": 33,
            "StatusTypeID": 50,
            "LevelID": 3,
            "PowerKW": 50,
            "CurrentTypeID": 30,
            "Quantity": 1
        },
        {
            "ID": 207898,
            "ConnectionTypeID": 2,
            "StatusTypeID": 50,
            "LevelID": 3,
            "PowerKW": 50,
            "CurrentTypeID": 30,
            "Quantity": 1
        },
        {
            "ID": 207899,
            "ConnectionTypeID": 1036,
            "StatusTypeID": 50,
            "LevelID": 3,
            "Amps": 63,
            "Voltage": 400,
            "PowerKW": 43,
            "CurrentTypeID": 20,
            "Quantity": 1
        }
    ],
    "NumberOfPoints": 1,
    "GeneralComments": "50 kW - CHAdeMO\r\n50 kW - CCS 2\r\n43 kW - TYPE 2\r\n\r\nhttp://www.semeljci.hr/",
    "StatusTypeID": 50,
    "DateLastStatusUpdate": "2020-03-05T12:24:00Z",
    "DataQualityLevel": 1,
    "DateCreated": "2020-03-05T11:37:00Z",
    "SubmissionStatusTypeID": 200
}