{
    "IsRecentlyVerified": false,
    "ID": 35252,
    "UUID": "DFE98814-1423-4EC1-B59E-8CAB60D9ECE3",
    "DataProviderID": 26,
    "DataProvidersReference": "30931",
    "OperatorID": 157,
    "OperatorsReference": "NewMotion 02006663",
    "UsageCost": "0.00 jaarabonnement",
    "AddressInfo": {
        "ID": 35598,
        "Title": "Smeltwater 16",
        "AddressLine1": "Smeltwater 16",
        "Town": "Houten",
        "Postcode": "3991 MG",
        "CountryID": 159,
        "Latitude": 52.017951965332,
        "Longitude": 5.16607809066772,
        "ContactTelephone1": "088 0109500",
        "RelatedURL": "http://thenewmotion.nl/",
        "DistanceUnit": 0
    },
    "Connections": [
        {
            "ID": 38763,
            "ConnectionTypeID": 25,
            "LevelID": 2,
            "PowerKW": 3.7,
            "CurrentTypeID": 10
        }
    ],
    "NumberOfPoints": 1,
    "StatusTypeID": 50,
    "DateLastStatusUpdate": "2016-06-04T02:44:00Z",
    "DataQualityLevel": 3,
    "DateCreated": "2015-01-09T06:04:00Z",
    "SubmissionStatusTypeID": 100
}