{
    "IsRecentlyVerified": false,
    "ID": 155062,
    "UUID": "0423EACD-EC56-4C4F-8DC3-FCD7DE40AE28",
    "DataProviderID": 1,
    "OperatorID": 23,
    "OperatorsReference": "53253",
    "UsageTypeID": 4,
    "UsageCost": "$0.25/kWh; other tariffs for older cars",
    "AddressInfo": {
        "ID": 155416,
        "Title": "Tumwater, Wa Supercharger",
        "AddressLine1": "2430 93RD Avenue Southwest",
        "Town": "Tumwater",
        "StateOrProvince": "WA",
        "Postcode": "98512",
        "CountryID": 2,
        "Latitude": 46.952938,
        "Longitude": -122.935249,
        "DistanceUnit": 0
    },
    "Connections": [
        {
            "ID": 218266,
            "ConnectionTypeID": 27,
            "StatusTypeID": 50,
            "LevelID": 3,
            "PowerKW": 120,
            "CurrentTypeID": 30,
            "Quantity": 8
        }
    ],
    "NumberOfPoints": 8,
    "GeneralComments": "Charging8 Superchargers, available 24/7, up to 250kW",
    "StatusTypeID": 50,
    "DateLastStatusUpdate": "2020-03-25T07:10:00Z",
    "DataQualityLevel": 1,
    "DateCreated": "2020-03-25T07:10:00Z",
    "SubmissionStatusTypeID": 200
}