{
    "IsRecentlyVerified": false,
    "ID": 99819,
    "UUID": "C2E93583-8C12-4F01-A467-56A644E76E58",
    "DataProviderID": 1,
    "OperatorID": 23,
    "OperatorsReference": "40356",
    "UsageTypeID": 4,
    "AddressInfo": {
        "ID": 100165,
        "Title": "Splash Coworking",
        "AddressLine1": "326 N LBJ DR",
        "Town": "San Marcos",
        "StateOrProvince": "Texas",
        "Postcode": "78666",
        "CountryID": 2,
        "Latitude": 29.885038,
        "Longitude": -97.940158,
        "ContactTelephone1": "(512) 667-0492",
        "DistanceUnit": 0
    },
    "Connections": [
        {
            "ID": 141036,
            "ConnectionTypeID": 30,
            "StatusTypeID": 50,
            "LevelID": 2,
            "PowerKW": 16,
            "CurrentTypeID": 20,
            "Quantity": 3
        }
    ],
    "NumberOfPoints": 3,
    "GeneralComments": "3 Tesla Connectors, up to 16kW.Available to the public. Self park.",
    "StatusTypeID": 50,
    "DateLastStatusUpdate": "2018-02-06T06:41:00Z",
    "DataQualityLevel": 1,
    "DateCreated": "2018-02-06T06:41:00Z",
    "SubmissionStatusTypeID": 200
}