{
    "IsRecentlyVerified": false,
    "ID": 178954,
    "UUID": "DB262AC5-E906-4CD5-9C04-4E9E12A66290",
    "DataProviderID": 29,
    "DataProvidersReference": "14724",
    "OperatorID": 3403,
    "AddressInfo": {
        "ID": 179313,
        "Title": "Raststätte Grundbergsee Nord",
        "AddressLine1": "Raststätte Grundbergsee Nord",
        "Town": "Sottrum",
        "Postcode": "27376",
        "CountryID": 87,
        "Latitude": 53.090847,
        "Longitude": 9.176298,
        "DistanceUnit": 0
    },
    "Connections": [
        {
            "ID": 280070,
            "ConnectionTypeID": 1036,
            "StatusTypeID": 50,
            "LevelID": 3,
            "PowerKW": 43,
            "CurrentTypeID": 20
        },
        {
            "ID": 280071,
            "ConnectionTypeID": 33,
            "StatusTypeID": 50,
            "LevelID": 3,
            "PowerKW": 50,
            "CurrentTypeID": 30
        },
        {
            "ID": 301112,
            "ConnectionTypeID": 2,
            "StatusTypeID": 50,
            "LevelID": 3,
            "PowerKW": 50,
            "CurrentTypeID": 30
        }
    ],
    "StatusTypeID": 50,
    "DateLastStatusUpdate": "2021-07-12T02:50:00Z",
    "MetadataValues": [
        {
            "ID": 11248,
            "MetadataFieldID": 4,
            "ItemValue": "Data from the German chargepoint registry provided by Bundesnetzagentur.de under the CC-BY 4.0 license"
        }
    ],
    "DataQualityLevel": 3,
    "DateCreated": "2021-07-08T09:59:00Z",
    "SubmissionStatusTypeID": 100
}