{
    "IsRecentlyVerified": false,
    "ID": 186339,
    "UUID": "1664761F-2815-4072-BD4A-04B7C7938422",
    "DataProviderID": 1,
    "OperatorID": 1,
    "AddressInfo": {
        "ID": 186698,
        "Title": "Obertor 8",
        "AddressLine1": "Obertor 8",
        "Town": "Niedenstein",
        "Postcode": "34305",
        "CountryID": 87,
        "Latitude": 51.23650334362068,
        "Longitude": 9.313299832631628,
        "DistanceUnit": 0
    },
    "Connections": [
        {
            "ID": 298791,
            "ConnectionTypeID": 25,
            "StatusTypeID": 50,
            "LevelID": 2,
            "PowerKW": 22,
            "CurrentTypeID": 20
        },
        {
            "ID": 298794,
            "ConnectionTypeID": 25,
            "StatusTypeID": 50,
            "LevelID": 2,
            "PowerKW": 22,
            "CurrentTypeID": 20
        }
    ],
    "StatusTypeID": 50,
    "DateLastStatusUpdate": "2021-09-08T19:48:00Z",
    "MetadataValues": [
        {
            "ID": 18580,
            "MetadataFieldID": 4,
            "ItemValue": "Data from the German chargepoint registry provided by Bundesnetzagentur.de under the CC-BY 4.0 license"
        }
    ],
    "DataQualityLevel": 3,
    "DateCreated": "2021-07-12T02:46:00Z",
    "SubmissionStatusTypeID": 100
}