{
    "IsRecentlyVerified": false,
    "ID": 129118,
    "UUID": "E67163B5-2A2C-4C4E-B3DD-FCF9CEE8CBEC",
    "DataProviderID": 1,
    "OperatorID": 3296,
    "UsageTypeID": 5,
    "UsageCost": "£0.40/kWh",
    "AddressInfo": {
        "ID": 129464,
        "Title": "Collectables Retail Park",
        "AddressLine1": "Ross Road",
        "Town": "Stockton-on-Tees",
        "Postcode": "TS18 2LX",
        "CountryID": 1,
        "Latitude": 54.57188,
        "Longitude": -1.294276,
        "DistanceUnit": 0
    },
    "Connections": [
        {
            "ID": 180751,
            "ConnectionTypeID": 2,
            "Reference": "CHA045-001-01",
            "StatusTypeID": 50,
            "LevelID": 3,
            "Amps": 125,
            "Voltage": 400,
            "PowerKW": 50,
            "CurrentTypeID": 30,
            "Quantity": 2
        },
        {
            "ID": 180775,
            "ConnectionTypeID": 33,
            "StatusTypeID": 50,
            "LevelID": 3,
            "Amps": 125,
            "Voltage": 400,
            "PowerKW": 50,
            "CurrentTypeID": 30,
            "Quantity": 2
        }
    ],
    "NumberOfPoints": 2,
    "StatusTypeID": 50,
    "DateLastStatusUpdate": "2021-05-26T10:36:00Z",
    "MetadataValues": [
        {
            "ID": 4776,
            "MetadataFieldID": 4,
            "ItemValue": "Contains public sector information licensed under the Open Government Licence v2.0. http://www.nationalarchives.gov.uk/doc/open-government-licence/version/2/"
        }
    ],
    "DataQualityLevel": 3,
    "DateCreated": "2019-07-15T09:48:00Z",
    "SubmissionStatusTypeID": 200
}