{
    "IsRecentlyVerified": false,
    "ID": 51550,
    "UUID": "864F4793-0580-4F3A-8030-186532354F79",
    "DataProviderID": 1,
    "OperatorID": 201,
    "UsageTypeID": 4,
    "UsageCost": "",
    "AddressInfo": {
        "ID": 51896,
        "Title": "Tiefgarage Rathaus",
        "AddressLine1": "Rathausplatz 3",
        "AddressLine2": "",
        "Town": "Garching",
        "StateOrProvince": "Landkreis München",
        "Postcode": "85748",
        "CountryID": 87,
        "Latitude": 48.25130430000001,
        "Longitude": 11.6498842,
        "ContactTelephone1": "",
        "ContactTelephone2": "",
        "ContactEmail": "",
        "AccessComments": "Zwei reservierte Parkplätze , 24/7 nutzbar. \"München Umland\" oder \"KommEnergie\" Ladekarte erforderlich.",
        "RelatedURL": "",
        "DistanceUnit": 0
    },
    "Connections": [
        {
            "ID": 63896,
            "ConnectionTypeID": 25,
            "StatusTypeID": 50,
            "LevelID": 2,
            "Amps": 16,
            "Voltage": 400,
            "PowerKW": 11,
            "CurrentTypeID": 20,
            "Quantity": 2
        },
        {
            "ID": 63897,
            "ConnectionTypeID": 28,
            "StatusTypeID": 50,
            "LevelID": 2,
            "Amps": 16,
            "Voltage": 230,
            "PowerKW": 3.7,
            "CurrentTypeID": 10,
            "Quantity": 2
        }
    ],
    "NumberOfPoints": 2,
    "GeneralComments": "",
    "StatusTypeID": 50,
    "DateLastStatusUpdate": "2015-07-28T20:46:00Z",
    "DataQualityLevel": 1,
    "DateCreated": "2015-07-28T12:56:00Z",
    "SubmissionStatusTypeID": 200
}