{
    "IsRecentlyVerified": false,
    "ID": 79584,
    "UUID": "3292452D-1A26-4817-9432-149CCD130954",
    "DataProviderID": 1,
    "OperatorID": 23,
    "OperatorsReference": "17740",
    "UsageTypeID": 6,
    "UsageCost": "Free",
    "AddressInfo": {
        "ID": 79930,
        "Title": "York House Inn",
        "AddressLine1": "416 York House RD",
        "Town": "Rabun Gap",
        "StateOrProvince": "Georgia",
        "Postcode": "30568",
        "CountryID": 2,
        "Latitude": 34.9374316,
        "Longitude": -83.3831738,
        "ContactTelephone1": "(706) 746-2068",
        "DistanceUnit": 0
    },
    "Connections": [
        {
            "ID": 114224,
            "ConnectionTypeID": 30,
            "StatusTypeID": 50,
            "LevelID": 2,
            "PowerKW": 8,
            "CurrentTypeID": 10,
            "Quantity": 1
        }
    ],
    "NumberOfPoints": 1,
    "GeneralComments": "1 Tesla Connector, up to 8kW.Available for patrons only. Please see front desk.",
    "StatusTypeID": 50,
    "DateLastStatusUpdate": "2017-07-13T14:41:00Z",
    "DataQualityLevel": 1,
    "DateCreated": "2017-01-29T18:02:00Z",
    "SubmissionStatusTypeID": 200
}