{
    "IsRecentlyVerified": false,
    "ID": 63619,
    "UUID": "53A8CCF5-B56B-43D7-B9D5-124C72BCF2EE",
    "DataProviderID": 26,
    "DataProvidersReference": "83371",
    "OperatorID": 157,
    "OperatorsReference": "NewMotion UTPITEN442",
    "UsageCost": "0.00 jaarabonnement",
    "AddressInfo": {
        "ID": 63965,
        "Title": "Moezeldreef 117",
        "AddressLine1": "Moezeldreef 117",
        "Town": "Utrecht",
        "Postcode": "3562 SR",
        "CountryID": 159,
        "Latitude": 52.1159600970457,
        "Longitude": 5.11596009704567,
        "ContactTelephone1": "088 0109500",
        "RelatedURL": "http://thenewmotion.nl/",
        "DistanceUnit": 0
    },
    "Connections": [
        {
            "ID": 81188,
            "ConnectionTypeID": 25,
            "LevelID": 2,
            "PowerKW": 11,
            "CurrentTypeID": 10
        }
    ],
    "NumberOfPoints": 2,
    "StatusTypeID": 50,
    "DateLastStatusUpdate": "2016-06-04T02:50:00Z",
    "DataQualityLevel": 3,
    "DateCreated": "2016-03-03T12:31:00Z",
    "SubmissionStatusTypeID": 100
}