{
    "IsRecentlyVerified": false,
    "ID": 187057,
    "UUID": "E9D498BB-6BA7-4092-9FA4-2B7BBD9AD6D2",
    "DataProviderID": 29,
    "DataProvidersReference": "21339",
    "OperatorID": 45,
    "AddressInfo": {
        "ID": 187416,
        "Title": "Louis-Schmetzer-Str. 4",
        "AddressLine1": "Louis-Schmetzer-Str. 4",
        "Town": "Ansbach",
        "Postcode": "91522",
        "CountryID": 87,
        "Latitude": 53.06672,
        "Longitude": 8.773295,
        "DistanceUnit": 0
    },
    "Connections": [
        {
            "ID": 301089,
            "ConnectionTypeID": 25,
            "StatusTypeID": 50,
            "LevelID": 2,
            "PowerKW": 22,
            "CurrentTypeID": 20
        },
        {
            "ID": 301090,
            "ConnectionTypeID": 1036,
            "StatusTypeID": 50,
            "LevelID": 2,
            "PowerKW": 22,
            "CurrentTypeID": 20
        },
        {
            "ID": 301091,
            "ConnectionTypeID": 33,
            "StatusTypeID": 50,
            "LevelID": 3,
            "PowerKW": 50,
            "CurrentTypeID": 30
        },
        {
            "ID": 301092,
            "ConnectionTypeID": 1036,
            "StatusTypeID": 50,
            "LevelID": 3,
            "PowerKW": 50,
            "CurrentTypeID": 30
        },
        {
            "ID": 301093,
            "ConnectionTypeID": 2,
            "StatusTypeID": 50,
            "LevelID": 3,
            "PowerKW": 50,
            "CurrentTypeID": 30
        }
    ],
    "StatusTypeID": 50,
    "DateLastStatusUpdate": "2021-07-12T02:50:00Z",
    "MetadataValues": [
        {
            "ID": 19297,
            "MetadataFieldID": 4,
            "ItemValue": "Data from the German chargepoint registry provided by Bundesnetzagentur.de under the CC-BY 4.0 license"
        }
    ],
    "DataQualityLevel": 3,
    "DateCreated": "2021-07-12T02:50:00Z",
    "SubmissionStatusTypeID": 100
}