{
    "IsRecentlyVerified": false,
    "ID": 167210,
    "UUID": "C0EE7D8E-F518-4D6B-89BA-74A0BFEDC837",
    "DataProviderID": 1,
    "OperatorID": 59,
    "UsageTypeID": 4,
    "UsageCost": "Free",
    "AddressInfo": {
        "ID": 167569,
        "Title": "Meadowwood Technology Campus",
        "AddressLine1": "24021 E Mission Ave",
        "Town": "Liberty Lake",
        "StateOrProvince": "Washington",
        "Postcode": "99019",
        "CountryID": 2,
        "Latitude": 47.672506775532526,
        "Longitude": -117.083536188263,
        "DistanceUnit": 0
    },
    "Connections": [
        {
            "ID": 253215,
            "ConnectionTypeID": 1,
            "StatusTypeID": 50,
            "LevelID": 2,
            "Amps": 32,
            "Voltage": 240,
            "PowerKW": 7.2,
            "CurrentTypeID": 10,
            "Quantity": 4
        }
    ],
    "NumberOfPoints": 4,
    "StatusTypeID": 50,
    "DateLastStatusUpdate": "2020-08-29T15:54:00Z",
    "DataQualityLevel": 1,
    "DateCreated": "2020-08-29T15:54:00Z",
    "SubmissionStatusTypeID": 200
}