{
    "IsRecentlyVerified": false,
    "ID": 187041,
    "UUID": "DB05764E-0FB7-4FAA-B4CB-82D9A5D6195D",
    "DataProviderID": 29,
    "DataProvidersReference": "3218",
    "AddressInfo": {
        "ID": 187400,
        "Title": "Parkplatz Feldstraße Ecke Bergstraße",
        "AddressLine1": "Parkplatz Feldstraße Ecke Bergstraße",
        "Town": "Achim",
        "Postcode": "28832",
        "CountryID": 87,
        "Latitude": 53.011462,
        "Longitude": 9.040272,
        "DistanceUnit": 0
    },
    "Connections": [
        {
            "ID": 301038,
            "ConnectionTypeID": 25,
            "StatusTypeID": 50,
            "LevelID": 2,
            "PowerKW": 22,
            "CurrentTypeID": 20
        },
        {
            "ID": 301039,
            "ConnectionTypeID": 25,
            "StatusTypeID": 50,
            "LevelID": 2,
            "PowerKW": 22,
            "CurrentTypeID": 20
        }
    ],
    "StatusTypeID": 50,
    "DateLastStatusUpdate": "2021-07-12T02:50:00Z",
    "MetadataValues": [
        {
            "ID": 19281,
            "MetadataFieldID": 4,
            "ItemValue": "Data from the German chargepoint registry provided by Bundesnetzagentur.de under the CC-BY 4.0 license"
        }
    ],
    "DataQualityLevel": 3,
    "DateCreated": "2021-07-12T02:50:00Z",
    "SubmissionStatusTypeID": 100
}