{
    "IsRecentlyVerified": false,
    "ID": 63605,
    "UUID": "183767C2-E152-45B8-AAE2-6AC0C5F3A5DF",
    "DataProviderID": 26,
    "DataProvidersReference": "82528",
    "OperatorID": 73,
    "OperatorsReference": "EV-Box EVB-P1536171",
    "UsageCost": "0.00 jaarabonnement",
    "AddressInfo": {
        "ID": 63951,
        "Title": "Jasmijnstraat 20",
        "AddressLine1": "Jasmijnstraat 20",
        "Town": "De Bilt",
        "Postcode": "3732 EC",
        "CountryID": 159,
        "Latitude": 52.10578,
        "Longitude": 5.18357,
        "RelatedURL": "http://www.ev-box.nl",
        "DistanceUnit": 0
    },
    "Connections": [
        {
            "ID": 81171,
            "ConnectionTypeID": 25,
            "LevelID": 2,
            "PowerKW": 5,
            "CurrentTypeID": 10
        }
    ],
    "NumberOfPoints": 1,
    "StatusTypeID": 50,
    "DateLastStatusUpdate": "2016-06-04T02:50:00Z",
    "DataQualityLevel": 3,
    "DateCreated": "2016-03-03T12:31:00Z",
    "SubmissionStatusTypeID": 100
}