{
    "IsRecentlyVerified": false,
    "ID": 104883,
    "UUID": "7A7BE23E-A108-4DA7-B690-594744D61D84",
    "DataProviderID": 1,
    "OperatorID": 45,
    "UsageTypeID": 1,
    "AddressInfo": {
        "ID": 105229,
        "Title": "Klaus Scholz Elektrotechnik",
        "AddressLine1": "Schulstraße 14",
        "Town": "Obernkirchen",
        "StateOrProvince": "Landkreis Schaumburg",
        "Postcode": "31683",
        "CountryID": 87,
        "Latitude": 52.2828928,
        "Longitude": 9.12162360000002,
        "ContactTelephone1": "+49 5724 4270",
        "AccessComments": "24/7 kostenlos nutzbare blaue Ladesäule, die primär für das Firmenfahrzeug benutzt wird. ",
        "RelatedURL": "https://kscholz-elektrotechnik.de/",
        "DistanceUnit": 0
    },
    "Connections": [
        {
            "ID": 147938,
            "ConnectionTypeID": 25,
            "StatusTypeID": 50,
            "LevelID": 2,
            "Amps": 16,
            "Voltage": 400,
            "PowerKW": 11,
            "CurrentTypeID": 20,
            "Quantity": 2
        },
        {
            "ID": 147939,
            "ConnectionTypeID": 28,
            "StatusTypeID": 50,
            "LevelID": 2,
            "Amps": 16,
            "Voltage": 230,
            "PowerKW": 3.7,
            "CurrentTypeID": 10,
            "Quantity": 2
        }
    ],
    "NumberOfPoints": 4,
    "StatusTypeID": 50,
    "DateLastStatusUpdate": "2018-05-25T06:40:00Z",
    "DataQualityLevel": 1,
    "DateCreated": "2018-05-25T06:40:00Z",
    "SubmissionStatusTypeID": 200
}