{
    "IsRecentlyVerified": false,
    "ID": 85382,
    "UUID": "0EF6F46B-FA4C-494E-90D9-A646F20D35A2",
    "DataProviderID": 1,
    "OperatorID": 45,
    "UsageTypeID": 3,
    "AddressInfo": {
        "ID": 85728,
        "Title": "Renault Retail Group",
        "AddressLine1": "Nedderfeld 80",
        "Town": "Hamburg",
        "StateOrProvince": "Hamburg",
        "Postcode": "22529",
        "CountryID": 87,
        "Latitude": 53.601379981812606,
        "Longitude": 9.976371234726447,
        "ContactTelephone1": "+49 40 22636360",
        "AccessComments": "Eine Wallbox auf dem Kundenparkplatz, die zu den Öffnungszeiten nutzbar (Mo-Fr 8-19Uhr, Sa 9-14Uhr) ist. . Telefonische Anmeldung ist erforderlich.",
        "RelatedURL": "http://www.renault-hamburg.de/",
        "DistanceUnit": 0
    },
    "Connections": [
        {
            "ID": 121419,
            "ConnectionTypeID": 25,
            "StatusTypeID": 50,
            "LevelID": 2,
            "Amps": 16,
            "Voltage": 400,
            "PowerKW": 11,
            "CurrentTypeID": 20,
            "Quantity": 1
        }
    ],
    "NumberOfPoints": 1,
    "StatusTypeID": 50,
    "DateLastStatusUpdate": "2017-04-03T07:36:00Z",
    "DataQualityLevel": 1,
    "DateCreated": "2017-04-03T07:36:00Z",
    "SubmissionStatusTypeID": 200
}