{
    "IsRecentlyVerified": false,
    "ID": 186501,
    "UUID": "34888446-F39C-4C20-83EB-6193A9186000",
    "DataProviderID": 29,
    "DataProvidersReference": "5047",
    "AddressInfo": {
        "ID": 186860,
        "Title": "Am Markt",
        "AddressLine1": "Am Markt",
        "Town": "Sollstedt",
        "Postcode": "99759",
        "CountryID": 87,
        "Latitude": 51.415775,
        "Longitude": 10.53771,
        "DistanceUnit": 0
    },
    "Connections": [
        {
            "ID": 299311,
            "ConnectionTypeID": 25,
            "StatusTypeID": 50,
            "LevelID": 2,
            "PowerKW": 22,
            "CurrentTypeID": 20
        },
        {
            "ID": 299312,
            "ConnectionTypeID": 25,
            "StatusTypeID": 50,
            "LevelID": 2,
            "PowerKW": 22,
            "CurrentTypeID": 20
        }
    ],
    "StatusTypeID": 50,
    "DateLastStatusUpdate": "2021-07-12T02:47:00Z",
    "MetadataValues": [
        {
            "ID": 18742,
            "MetadataFieldID": 4,
            "ItemValue": "Data from the German chargepoint registry provided by Bundesnetzagentur.de under the CC-BY 4.0 license"
        }
    ],
    "DataQualityLevel": 3,
    "DateCreated": "2021-07-12T02:47:00Z",
    "SubmissionStatusTypeID": 100
}