{
    "IsRecentlyVerified": false,
    "ID": 30702,
    "UUID": "F7A8F10E-713D-448C-8673-56F3730D227D",
    "DataProviderID": 1,
    "DataProvidersReference": "2216",
    "AddressInfo": {
        "ID": 31048,
        "Title": "Marstrandsgate  6",
        "AddressLine1": "Marstrandsgate 6",
        "Town": "OSLO",
        "StateOrProvince": "Oslo",
        "Postcode": "0566",
        "CountryID": 168,
        "Latitude": 59.92681,
        "Longitude": 10.76911,
        "AccessComments": "",
        "DistanceUnit": 0
    },
    "Connections": [
        {
            "ID": 33931,
            "ConnectionTypeID": 0,
            "Reference": "1",
            "LevelID": 2,
            "Amps": 16,
            "Voltage": 230,
            "PowerKW": 3.7,
            "Comments": "Mode 1"
        }
    ],
    "NumberOfPoints": 1,
    "DateLastStatusUpdate": "2020-05-26T08:23:00Z",
    "DataQualityLevel": 2,
    "DateCreated": "2014-12-09T09:00:00Z",
    "SubmissionStatusTypeID": 100
}