{
    "MediaItems": [
        {
            "ID": 24562,
            "ChargePointID": 114593,
            "ItemURL": "https://s3-ap-southeast-2.amazonaws.com/openchargemap/images/CZ/OCM114593/OCM-114593.orig.2020090121580042.jpg",
            "ItemThumbnailURL": "https://s3-ap-southeast-2.amazonaws.com/openchargemap/images/CZ/OCM114593/OCM-114593.thmb.2020090121580042.jpg",
            "Comment": "#ikea #zlicin #pre #prazskaenergetika #parkoviste #praha #nabijecka #wififree ",
            "IsEnabled": true,
            "IsVideo": false,
            "IsFeaturedItem": false,
            "IsExternalResource": false,
            "User": {
                "ID": 22495,
                "Username": "MAJKL_elektro🔋"
            },
            "DateCreated": "2020-09-01T21:58:00Z"
        },
        {
            "ID": 24561,
            "ChargePointID": 114593,
            "ItemURL": "https://s3-ap-southeast-2.amazonaws.com/openchargemap/images/CZ/OCM114593/OCM-114593.orig.2020090121572474.jpg",
            "ItemThumbnailURL": "https://s3-ap-southeast-2.amazonaws.com/openchargemap/images/CZ/OCM114593/OCM-114593.thmb.2020090121572474.jpg",
            "Comment": "#ikea #zlicin #pre #prazskaenergetika #parkoviste #praha #nabijecka #wififree",
            "IsEnabled": true,
            "IsVideo": false,
            "IsFeaturedItem": false,
            "IsExternalResource": false,
            "User": {
                "ID": 22495,
                "Username": "MAJKL_elektro🔋"
            },
            "DateCreated": "2020-09-01T21:57:00Z"
        },
        {
            "ID": 24559,
            "ChargePointID": 114593,
            "ItemURL": "https://s3-ap-southeast-2.amazonaws.com/openchargemap/images/CZ/OCM114593/OCM-114593.orig.2020090121554807.jpg",
            "ItemThumbnailURL": "https://s3-ap-southeast-2.amazonaws.com/openchargemap/images/CZ/OCM114593/OCM-114593.thmb.2020090121554807.jpg",
            "Comment": "#ikea #zlicin #pre #prazskaenergetika #parkoviste #praha #nabijecka #wififree ",
            "IsEnabled": true,
            "IsVideo": false,
            "IsFeaturedItem": false,
            "IsExternalResource": false,
            "User": {
                "ID": 22495,
                "Username": "MAJKL_elektro🔋"
            },
            "DateCreated": "2020-09-01T21:56:00Z"
        },
        {
            "ID": 24560,
            "ChargePointID": 114593,
            "ItemURL": "https://s3-ap-southeast-2.amazonaws.com/openchargemap/images/CZ/OCM114593/OCM-114593.orig.2020090121562484.jpg",
            "ItemThumbnailURL": "https://s3-ap-southeast-2.amazonaws.com/openchargemap/images/CZ/OCM114593/OCM-114593.thmb.2020090121562484.jpg",
            "Comment": "#ikea #zlicin #pre #prazskaenergetika #parkoviste #praha #nabijecka #wififree ",
            "IsEnabled": true,
            "IsVideo": false,
            "IsFeaturedItem": false,
            "IsExternalResource": false,
            "User": {
                "ID": 22495,
                "Username": "MAJKL_elektro🔋"
            },
            "DateCreated": "2020-09-01T21:56:00Z"
        },
        {
            "ID": 24558,
            "ChargePointID": 114593,
            "ItemURL": "https://s3-ap-southeast-2.amazonaws.com/openchargemap/images/CZ/OCM114593/OCM-114593.orig.2020090121543798.jpg",
            "ItemThumbnailURL": "https://s3-ap-southeast-2.amazonaws.com/openchargemap/images/CZ/OCM114593/OCM-114593.thmb.2020090121543798.jpg",
            "Comment": "#ikea #zlicin #pre #prazskaenergetika #parkoviste #praha #nabijecka #wififree ",
            "IsEnabled": true,
            "IsVideo": false,
            "IsFeaturedItem": false,
            "IsExternalResource": false,
            "User": {
                "ID": 22495,
                "Username": "MAJKL_elektro🔋"
            },
            "DateCreated": "2020-09-01T21:55:00Z"
        },
        {
            "ID": 24557,
            "ChargePointID": 114593,
            "ItemURL": "https://s3-ap-southeast-2.amazonaws.com/openchargemap/images/CZ/OCM114593/OCM-114593.orig.2020090121535731.jpg",
            "ItemThumbnailURL": "https://s3-ap-southeast-2.amazonaws.com/openchargemap/images/CZ/OCM114593/OCM-114593.thmb.2020090121535731.jpg",
            "Comment": "#ikea #zlicin #pre #prazskaenergetika #parkoviste #praha #nabijecka ",
            "IsEnabled": true,
            "IsVideo": false,
            "IsFeaturedItem": false,
            "IsExternalResource": false,
            "User": {
                "ID": 22495,
                "Username": "MAJKL_elektro🔋"
            },
            "DateCreated": "2020-09-01T21:54:00Z"
        },
        {
            "ID": 17401,
            "ChargePointID": 114593,
            "ItemURL": "https://s3-ap-southeast-2.amazonaws.com/openchargemap/images/CZ/OCM114593/OCM-114593.orig.2019011015383430.jpeg",
            "ItemThumbnailURL": "https://s3-ap-southeast-2.amazonaws.com/openchargemap/images/CZ/OCM114593/OCM-114593.thmb.2019011015383430.jpeg",
            "Comment": "2019/01/10",
            "IsEnabled": true,
            "IsVideo": false,
            "IsFeaturedItem": false,
            "IsExternalResource": false,
            "User": {
                "ID": 19523,
                "Username": "Martin1713"
            },
            "DateCreated": "2019-01-10T15:39:00Z"
        },
        {
            "ID": 17400,
            "ChargePointID": 114593,
            "ItemURL": "https://s3-ap-southeast-2.amazonaws.com/openchargemap/images/CZ/OCM114593/OCM-114593.orig.2019011015360568.jpeg",
            "ItemThumbnailURL": "https://s3-ap-southeast-2.amazonaws.com/openchargemap/images/CZ/OCM114593/OCM-114593.thmb.2019011015360568.jpeg",
            "Comment": "2019/01/10",
            "IsEnabled": true,
            "IsVideo": false,
            "IsFeaturedItem": false,
            "IsExternalResource": false,
            "User": {
                "ID": 19523,
                "Username": "Martin1713"
            },
            "DateCreated": "2019-01-10T15:36:00Z"
        }
    ],
    "IsRecentlyVerified": false,
    "ID": 114593,
    "UUID": "A75EE46F-A237-4236-81EF-FBCD7A97FC20",
    "DataProviderID": 1,
    "OperatorID": 190,
    "UsageTypeID": 1,
    "AddressInfo": {
        "ID": 114939,
        "Title": "PRE IKEA Černý Most",
        "AddressLine1": "Chlumecká 664/10",
        "Town": "Praha",
        "Postcode": "19800",
        "CountryID": 64,
        "Latitude": 50.1045207578567,
        "Longitude": 14.5874063374724,
        "AccessComments": "V podzemních garážích 30 m od vchodu\r\nIn the underground garage 30 metres from IKEA Entrance",
        "DistanceUnit": 0
    },
    "Connections": [
        {
            "ID": 161294,
            "ConnectionTypeID": 33,
            "StatusTypeID": 50,
            "LevelID": 3,
            "Amps": 125,
            "Voltage": 400,
            "PowerKW": 50,
            "CurrentTypeID": 30,
            "Quantity": 1
        },
        {
            "ID": 161295,
            "ConnectionTypeID": 2,
            "StatusTypeID": 50,
            "LevelID": 3,
            "Amps": 120,
            "Voltage": 400,
            "PowerKW": 50,
            "CurrentTypeID": 30,
            "Quantity": 1
        },
        {
            "ID": 161296,
            "ConnectionTypeID": 1036,
            "StatusTypeID": 50,
            "LevelID": 2,
            "Amps": 63,
            "Voltage": 400,
            "PowerKW": 43,
            "Quantity": 1
        }
    ],
    "NumberOfPoints": 1,
    "StatusTypeID": 50,
    "DateLastStatusUpdate": "2020-09-01T21:58:00Z",
    "DataQualityLevel": 1,
    "DateCreated": "2019-01-10T15:32:00Z",
    "SubmissionStatusTypeID": 200
}