{
    "IsRecentlyVerified": false,
    "ID": 45003,
    "UUID": "8A0EB6D7-9B32-4372-BAE8-E309B9C39D48",
    "DataProviderID": 1,
    "OperatorID": 5,
    "UsageTypeID": 4,
    "UsageCost": "Free",
    "AddressInfo": {
        "ID": 45349,
        "Title": "Northern Westchester Hospital",
        "AddressLine1": "400 E Main St",
        "Town": "Mount Kisco",
        "StateOrProvince": "New York",
        "Postcode": "10549",
        "CountryID": 2,
        "Latitude": 41.19595159,
        "Longitude": -73.7262749,
        "AccessComments": "Basement level of garage - Next to Electric Room",
        "RelatedURL": "http://carstations.com/32985",
        "DistanceUnit": 0
    },
    "Connections": [
        {
            "ID": 55326,
            "ConnectionTypeID": 1,
            "Reference": "J1772",
            "StatusTypeID": 50,
            "LevelID": 2,
            "Amps": 30,
            "Voltage": 240,
            "PowerKW": 7,
            "CurrentTypeID": 10,
            "Quantity": 2
        }
    ],
    "StatusTypeID": 50,
    "DateLastStatusUpdate": "2015-06-04T08:51:00Z",
    "DataQualityLevel": 2,
    "DateCreated": "2015-04-22T03:24:00Z",
    "SubmissionStatusTypeID": 200
}