{
    "IsRecentlyVerified": false,
    "ID": 169386,
    "UUID": "01277F16-6F73-4D52-B21C-93236F08AC7B",
    "DataProviderID": 1,
    "OperatorID": 3,
    "OperatorsReference": "PG-70258,PG-84870",
    "UsageTypeID": 4,
    "UsageCost": "Free",
    "AddressInfo": {
        "ID": 169745,
        "Title": "Tesco Superstore-Sale",
        "AddressLine1": "Hereford Street",
        "Town": "Sale",
        "Postcode": "M33 7XN",
        "CountryID": 1,
        "Latitude": 53.42447,
        "Longitude": -2.324096,
        "DistanceUnit": 0
    },
    "Connections": [
        {
            "ID": 257710,
            "ConnectionTypeID": 25,
            "StatusTypeID": 50,
            "LevelID": 2,
            "Amps": 32,
            "Voltage": 230,
            "PowerKW": 7,
            "CurrentTypeID": 10,
            "Quantity": 4
        }
    ],
    "NumberOfPoints": 4,
    "GeneralComments": "This is an open charge unit installed at the Tesco super store at Hereford Street, Sale",
    "StatusTypeID": 50,
    "DateLastStatusUpdate": "2020-10-15T21:59:00Z",
    "DataQualityLevel": 1,
    "DateCreated": "2020-10-15T21:37:00Z",
    "SubmissionStatusTypeID": 200
}