{
    "IsRecentlyVerified": false,
    "ID": 143615,
    "UUID": "B1CACF85-2DEB-4A55-AD95-3312776DC529",
    "DataProviderID": 2,
    "DataProvidersReference": "99646",
    "OperatorID": 5,
    "UsageTypeID": 1,
    "AddressInfo": {
        "ID": 143967,
        "Title": "LPCO",
        "AddressLine1": "7805 W Gratz Dr",
        "Town": "Boise",
        "StateOrProvince": "ID",
        "Postcode": "83709",
        "CountryID": 2,
        "Latitude": 43.6011404,
        "Longitude": -116.2791558,
        "ContactTelephone1": "888-758-4389",
        "AccessComments": "24 hours daily",
        "RelatedURL": "http://www.chargepoint.com/",
        "DistanceUnit": 0
    },
    "Connections": [
        {
            "ID": 199975,
            "ConnectionTypeID": 32,
            "LevelID": 3,
            "Amps": 100,
            "Voltage": 400,
            "PowerKW": 40,
            "CurrentTypeID": 30,
            "Quantity": 1
        }
    ],
    "StatusTypeID": 50,
    "DateLastStatusUpdate": "2020-06-26T03:07:00Z",
    "DataQualityLevel": 3,
    "DateCreated": "2019-12-24T09:21:00Z",
    "SubmissionStatusTypeID": 100
}