{
    "IsRecentlyVerified": false,
    "ID": 68102,
    "UUID": "E48CBEE4-C2E4-45A4-82A5-A784FC4DDA1C",
    "DataProviderID": 26,
    "DataProvidersReference": "93205",
    "OperatorID": 73,
    "OperatorsReference": "EV-Box EVB-P1406193",
    "UsageCost": "0.00 jaarabonnement",
    "AddressInfo": {
        "ID": 68448,
        "Title": "Oostzeestraat 1a",
        "AddressLine1": "Oostzeestraat 1a",
        "Town": "Zutphen",
        "Postcode": "7202 CM",
        "CountryID": 159,
        "Latitude": 52.15914,
        "Longitude": 6.20272,
        "RelatedURL": "http://www.ev-box.nl",
        "DistanceUnit": 0
    },
    "Connections": [
        {
            "ID": 94851,
            "ConnectionTypeID": 25,
            "LevelID": 2,
            "PowerKW": 11,
            "CurrentTypeID": 10
        },
        {
            "ID": 94852,
            "ConnectionTypeID": 25,
            "LevelID": 2,
            "PowerKW": 11,
            "CurrentTypeID": 10
        }
    ],
    "NumberOfPoints": 1,
    "StatusTypeID": 50,
    "DateLastStatusUpdate": "2016-06-04T02:37:00Z",
    "DataQualityLevel": 3,
    "DateCreated": "2016-06-04T02:37:00Z",
    "SubmissionStatusTypeID": 100
}