{
    "IsRecentlyVerified": false,
    "ID": 95942,
    "UUID": "DEB06E20-1527-4090-B57A-CB1EC3F9E86F",
    "DataProviderID": 1,
    "OperatorID": 80,
    "UsageTypeID": 4,
    "UsageCost": "0,40 €/kWh",
    "AddressInfo": {
        "ID": 96288,
        "Title": "Eneldrive Comune Di Barletta",
        "AddressLine1": "Via Santa Marta",
        "Town": "Barletta",
        "StateOrProvince": "BT",
        "Postcode": "76121",
        "CountryID": 112,
        "Latitude": 41.32028717965962,
        "Longitude": 16.279952019233857,
        "RelatedURL": "http://eneldrive.it",
        "DistanceUnit": 0
    },
    "Connections": [
        {
            "ID": 135912,
            "ConnectionTypeID": 25,
            "StatusTypeID": 50,
            "LevelID": 2,
            "Amps": 32,
            "Voltage": 400,
            "PowerKW": 22,
            "CurrentTypeID": 20,
            "Quantity": 1
        },
        {
            "ID": 135913,
            "ConnectionTypeID": 36,
            "StatusTypeID": 50,
            "LevelID": 2,
            "Amps": 16,
            "Voltage": 240,
            "PowerKW": 3,
            "CurrentTypeID": 10,
            "Quantity": 1
        }
    ],
    "NumberOfPoints": 2,
    "StatusTypeID": 50,
    "DateLastStatusUpdate": "2017-12-02T17:24:00Z",
    "DataQualityLevel": 1,
    "DateCreated": "2017-12-02T17:24:00Z",
    "SubmissionStatusTypeID": 200
}