{
    "IsRecentlyVerified": false,
    "ID": 70408,
    "UUID": "B95657CF-CD28-46BA-9626-1C3434665963",
    "DataProviderID": 1,
    "OperatorID": 45,
    "UsageTypeID": 1,
    "UsageCost": "0,20 €/kW (für Gäaste kostenlos)",
    "AddressInfo": {
        "ID": 70754,
        "Title": " Blockhausrestaurant / Elchpark",
        "AddressLine1": "Beckstraße",
        "AddressLine2": "",
        "Town": "Thale OT Friedrichsbrunn",
        "StateOrProvince": "Landkreis Harz",
        "Postcode": "06493",
        "CountryID": 87,
        "Latitude": 51.679406128863185,
        "Longitude": 11.061006596478244,
        "ContactTelephone1": "",
        "ContactTelephone2": "",
        "ContactEmail": "",
        "AccessComments": "Weiße Ladesäule auf dem Parkplatz. 24/7 nutzbar-",
        "RelatedURL": "",
        "DistanceUnit": 0
    },
    "Connections": [
        {
            "ID": 100659,
            "ConnectionTypeID": 1036,
            "StatusTypeID": 50,
            "LevelID": 3,
            "Amps": 63,
            "Voltage": 400,
            "PowerKW": 43,
            "CurrentTypeID": 20,
            "Quantity": 1
        },
        {
            "ID": 100660,
            "ConnectionTypeID": 17,
            "StatusTypeID": 50,
            "LevelID": 2,
            "Amps": 32,
            "Voltage": 400,
            "PowerKW": 22,
            "CurrentTypeID": 20,
            "Quantity": 1
        },
        {
            "ID": 100661,
            "ConnectionTypeID": 28,
            "StatusTypeID": 50,
            "LevelID": 2,
            "Amps": 16,
            "Voltage": 230,
            "PowerKW": 3.7,
            "CurrentTypeID": 10,
            "Quantity": 2
        }
    ],
    "NumberOfPoints": 4,
    "GeneralComments": "",
    "StatusTypeID": 50,
    "DateLastStatusUpdate": "2017-03-04T15:01:00Z",
    "DataQualityLevel": 1,
    "DateCreated": "2016-07-16T20:59:00Z",
    "SubmissionStatusTypeID": 200
}