{
    "IsRecentlyVerified": false,
    "ID": 100790,
    "UUID": "315E0B91-2281-43FB-9600-E000DA378F01",
    "DataProviderID": 1,
    "OperatorID": 23,
    "OperatorsReference": "41338",
    "UsageTypeID": 4,
    "AddressInfo": {
        "ID": 101136,
        "Title": "Historic Peninsula Inn",
        "AddressLine1": "2937 Beach BLVD S",
        "Town": "Gulfport",
        "StateOrProvince": "Florida",
        "Postcode": "33707",
        "CountryID": 2,
        "Latitude": 27.740316,
        "Longitude": -82.708163,
        "ContactTelephone1": "(727) 346-9800",
        "DistanceUnit": 0
    },
    "Connections": [
        {
            "ID": 142370,
            "ConnectionTypeID": 30,
            "StatusTypeID": 50,
            "LevelID": 2,
            "PowerKW": 8,
            "CurrentTypeID": 10,
            "Quantity": 2
        }
    ],
    "NumberOfPoints": 2,
    "GeneralComments": "2 Tesla Connectors, up to 8kW.Available for customers. Please see front desk.",
    "StatusTypeID": 50,
    "DateLastStatusUpdate": "2018-03-10T06:49:00Z",
    "DataQualityLevel": 1,
    "DateCreated": "2018-03-10T06:49:00Z",
    "SubmissionStatusTypeID": 200
}