{
    "IsRecentlyVerified": false,
    "ID": 162065,
    "UUID": "7F2906FA-809B-4588-9BE2-EAE7C2C856C8",
    "DataProviderID": 1,
    "OperatorID": 86,
    "UsageTypeID": 4,
    "AddressInfo": {
        "ID": 162422,
        "Title": "Autohof Pfalz Wattenheim",
        "AddressLine1": "",
        "Town": "Wattenheim",
        "CountryID": 87,
        "Latitude": 49.52756720456915,
        "Longitude": 8.07099110879085,
        "DistanceUnit": 0
    },
    "Connections": [
        {
            "ID": 233253,
            "ConnectionTypeID": 33,
            "Reference": "enbw",
            "StatusTypeID": 50,
            "LevelID": 3,
            "PowerKW": 300,
            "CurrentTypeID": 30,
            "Quantity": 2
        }
    ],
    "NumberOfPoints": 2,
    "StatusTypeID": 50,
    "DateLastStatusUpdate": "2020-08-04T10:01:00Z",
    "DataQualityLevel": 1,
    "DateCreated": "2020-08-01T12:55:00Z",
    "SubmissionStatusTypeID": 200
}