{
    "IsRecentlyVerified": false,
    "ID": 48758,
    "UUID": "ED1207D2-CE53-40D7-9E6E-13DBD0751351",
    "DataProviderID": 1,
    "OperatorID": 45,
    "UsageTypeID": 3,
    "UsageCost": "0",
    "AddressInfo": {
        "ID": 49104,
        "Title": "Autowelt Gruppe Filiale Rostock",
        "AddressLine1": "Rövershäger Chaussee 4",
        "Town": "Rostock",
        "StateOrProvince": "Ortsamt Mitte",
        "Postcode": "18146",
        "CountryID": 87,
        "Latitude": 54.0970168824192,
        "Longitude": 12.1790792711639,
        "ContactTelephone1": "+49 381 699421 ",
        "AccessComments": "Kostenloses Laden im Renault/Dacia Autohaus. Ladeplatz hinten an der Werkstatt. Kostenlos nutzbar während der Öffnungszeiten Mo-Fr 08:00-18:30, Sa 09:00-12:00Uhr.",
        "RelatedURL": "https://www.autowelt-gruppe.de/filialen/rostock",
        "DistanceUnit": 0
    },
    "Connections": [
        {
            "ID": 60220,
            "ConnectionTypeID": 25,
            "StatusTypeID": 50,
            "LevelID": 2,
            "Amps": 16,
            "Voltage": 400,
            "PowerKW": 11,
            "CurrentTypeID": 20,
            "Quantity": 1
        }
    ],
    "NumberOfPoints": 1,
    "StatusTypeID": 50,
    "DateLastStatusUpdate": "2015-07-01T06:25:00Z",
    "DataQualityLevel": 1,
    "DateCreated": "2015-06-30T06:18:00Z",
    "SubmissionStatusTypeID": 200
}