{
    "IsRecentlyVerified": false,
    "ID": 130911,
    "UUID": "156ABE9C-6102-4572-98DE-A0B1D46AF2B9",
    "DataProviderID": 1,
    "OperatorID": 150,
    "UsageTypeID": 4,
    "UsageCost": "£1 connection plus 30p per kWh",
    "AddressInfo": {
        "ID": 131257,
        "Title": "Morrisons - Milton Keynes",
        "AddressLine1": "4, Barnsdale Drive",
        "Town": "Milton Keynes",
        "Postcode": "MK4 4DD",
        "CountryID": 1,
        "Latitude": 52.004166,
        "Longitude": -0.794126,
        "ContactTelephone1": " 20 3598 4087",
        "RelatedURL": "https://www.geniepoint.co.uk/ds",
        "DistanceUnit": 0
    },
    "Connections": [
        {
            "ID": 183373,
            "ConnectionTypeID": 1036,
            "Reference": "1",
            "StatusTypeID": 50,
            "LevelID": 3,
            "Amps": 63,
            "Voltage": 400,
            "PowerKW": 43,
            "CurrentTypeID": 20,
            "Quantity": 1
        },
        {
            "ID": 183379,
            "ConnectionTypeID": 33,
            "StatusTypeID": 50,
            "LevelID": 3,
            "PowerKW": 50,
            "CurrentTypeID": 30,
            "Quantity": 1
        },
        {
            "ID": 183380,
            "ConnectionTypeID": 2,
            "StatusTypeID": 50,
            "LevelID": 3,
            "PowerKW": 50,
            "CurrentTypeID": 30,
            "Quantity": 1
        }
    ],
    "NumberOfPoints": 2,
    "StatusTypeID": 50,
    "DateLastStatusUpdate": "2020-10-07T13:46:00Z",
    "MetadataValues": [
        {
            "ID": 4906,
            "MetadataFieldID": 4,
            "ItemValue": "Contains public sector information licensed under the Open Government Licence v2.0. http://www.nationalarchives.gov.uk/doc/open-government-licence/version/2/"
        }
    ],
    "DataQualityLevel": 3,
    "DateCreated": "2019-08-24T12:04:00Z",
    "SubmissionStatusTypeID": 200
}