{
    "IsRecentlyVerified": false,
    "ID": 144282,
    "UUID": "763CAF88-FB27-4FED-9607-A5CB150D894D",
    "DataProviderID": 2,
    "DataProvidersReference": "73436",
    "OperatorID": 3373,
    "UsageTypeID": 1,
    "AddressInfo": {
        "ID": 144634,
        "Title": "Tillamook - Fred Meyer",
        "AddressLine1": "2500 N Main St",
        "Town": "Tillamook",
        "StateOrProvince": "OR",
        "Postcode": "97141",
        "CountryID": 2,
        "Latitude": 45.474795,
        "Longitude": -123.845554,
        "ContactTelephone1": "888-833-2148",
        "AccessComments": "24 hours daily",
        "RelatedURL": "https://www.evsolutions.com/ev-network",
        "DistanceUnit": 0
    },
    "Connections": [
        {
            "ID": 200774,
            "ConnectionTypeID": 1,
            "LevelID": 2,
            "Amps": 16,
            "Voltage": 230,
            "PowerKW": 3.7,
            "CurrentTypeID": 10,
            "Quantity": 1
        },
        {
            "ID": 200775,
            "ConnectionTypeID": 2,
            "LevelID": 3,
            "Amps": 100,
            "Voltage": 400,
            "PowerKW": 40,
            "CurrentTypeID": 30,
            "Quantity": 1
        }
    ],
    "StatusTypeID": 50,
    "DateLastStatusUpdate": "2020-06-26T03:09:00Z",
    "DataQualityLevel": 3,
    "DateCreated": "2019-12-24T09:23:00Z",
    "SubmissionStatusTypeID": 100
}