{
    "UserComments": [
        {
            "ID": 17633,
            "ChargePointID": 92066,
            "CommentTypeID": 10,
            "UserName": "HybridStutensee",
            "Comment": "RFID card needs to be put at the sensor for more than 5 seconds to authenticate successfully.",
            "Rating": 4,
            "DateCreated": "2017-08-25T14:59:06.217Z",
            "User": {
                "ID": 15747,
                "Username": "HybridStutensee"
            },
            "CheckinStatusTypeID": 10
        }
    ],
    "IsRecentlyVerified": false,
    "ID": 92066,
    "UUID": "9A34BA07-3CDE-4774-9772-17737432B0DD",
    "DataProviderID": 1,
    "OperatorID": 86,
    "UsageTypeID": 1,
    "AddressInfo": {
        "ID": 92412,
        "Title": "SM!GHT Ladelaterne Turmberg",
        "AddressLine1": "Reichardtstrasse 33",
        "Town": "Karlsruhe",
        "Postcode": "76227",
        "CountryID": 87,
        "Latitude": 48.9974011274076,
        "Longitude": 8.48562650818824,
        "AccessComments": "free parking during charging",
        "DistanceUnit": 0
    },
    "Connections": [
        {
            "ID": 130536,
            "ConnectionTypeID": 25,
            "StatusTypeID": 50,
            "LevelID": 2,
            "Quantity": 2
        }
    ],
    "NumberOfPoints": 2,
    "GeneralComments": "EnBW Elektronauten-Ladekarte oder Intercharge-Verbund-Ladekarte zur Authentifizierung erforderlich.",
    "StatusTypeID": 50,
    "DateLastStatusUpdate": "2017-08-25T14:59:00Z",
    "DataQualityLevel": 1,
    "DateCreated": "2017-08-24T19:28:00Z",
    "SubmissionStatusTypeID": 200
}