{
    "IsRecentlyVerified": false,
    "ID": 115801,
    "UUID": "FD67F5C4-53C7-4731-99CC-1864B3CEFA19",
    "DataProviderID": 2,
    "DataProvidersReference": "105479",
    "UsageTypeID": 1,
    "AddressInfo": {
        "ID": 116147,
        "Title": "Hagerstown - Central Parking Lot",
        "AddressLine1": "14 N Potomac St",
        "Town": "Hagerstown",
        "StateOrProvince": "MD",
        "Postcode": "21740",
        "CountryID": 2,
        "Latitude": 39.642218,
        "Longitude": -77.719215,
        "ContactTelephone1": "410-685-1109",
        "AccessComments": "24 hours daily",
        "RelatedURL": "",
        "DistanceUnit": 0
    },
    "Connections": [
        {
            "ID": 162840,
            "ConnectionTypeID": 2,
            "LevelID": 3,
            "Amps": 100,
            "Voltage": 400,
            "PowerKW": 40,
            "CurrentTypeID": 30,
            "Quantity": 1
        },
        {
            "ID": 162841,
            "ConnectionTypeID": 32,
            "LevelID": 3,
            "Amps": 100,
            "Voltage": 400,
            "PowerKW": 40,
            "CurrentTypeID": 30,
            "Quantity": 1
        }
    ],
    "DateLastStatusUpdate": "2020-06-26T03:02:00Z",
    "DataQualityLevel": 3,
    "DateCreated": "2019-02-11T07:13:00Z",
    "SubmissionStatusTypeID": 100
}