{
    "IsRecentlyVerified": false,
    "ID": 113365,
    "UUID": "EE2EFD24-ED95-4F4F-8056-1A69F2867A39",
    "DataProviderID": 1,
    "OperatorID": 3276,
    "UsageTypeID": 1,
    "AddressInfo": {
        "ID": 113711,
        "Title": "E.S. Tapia de Casariego - Avia (Adenor)",
        "AddressLine1": "Calle Parc. 18",
        "Town": "Tapia de Casariego",
        "StateOrProvince": "Asturias",
        "Postcode": "33740",
        "CountryID": 210,
        "Latitude": 43.56187389999999,
        "Longitude": -6.92312430000004,
        "DistanceUnit": 0
    },
    "Connections": [
        {
            "ID": 159664,
            "ConnectionTypeID": 2,
            "StatusTypeID": 50,
            "LevelID": 3,
            "PowerKW": 50,
            "CurrentTypeID": 30,
            "Quantity": 1
        },
        {
            "ID": 159665,
            "ConnectionTypeID": 33,
            "StatusTypeID": 50,
            "LevelID": 3,
            "PowerKW": 50,
            "CurrentTypeID": 30,
            "Quantity": 1
        },
        {
            "ID": 159666,
            "ConnectionTypeID": 1036,
            "StatusTypeID": 50,
            "LevelID": 3,
            "PowerKW": 43,
            "CurrentTypeID": 30,
            "Quantity": 1
        }
    ],
    "NumberOfPoints": 1,
    "StatusTypeID": 50,
    "DateLastStatusUpdate": "2018-12-05T22:54:00Z",
    "DataQualityLevel": 1,
    "DateCreated": "2018-12-05T21:25:00Z",
    "SubmissionStatusTypeID": 200
}