{
    "IsRecentlyVerified": false,
    "ID": 175888,
    "UUID": "361928DD-E8AD-41D5-B61F-13BA057C46D3",
    "DataProviderID": 1,
    "OperatorID": 80,
    "UsageTypeID": 4,
    "UsageCost": "free",
    "AddressInfo": {
        "ID": 176247,
        "Title": "Autoplanet - Las Condes 1",
        "AddressLine1": "Las Condes 10462",
        "Town": "Vitacura",
        "StateOrProvince": "Región Metropolitana de Santiago",
        "Postcode": "7630000",
        "CountryID": 49,
        "Latitude": -33.38264039693417,
        "Longitude": -70.53319803181768,
        "RelatedURL": "https://www.enelx.com/cl/es",
        "DistanceUnit": 0
    },
    "Connections": [
        {
            "ID": 273151,
            "ConnectionTypeID": 25,
            "StatusTypeID": 50,
            "LevelID": 2,
            "PowerKW": 7.4,
            "Quantity": 1
        }
    ],
    "NumberOfPoints": 1,
    "StatusTypeID": 50,
    "DateLastStatusUpdate": "2021-06-18T05:29:00Z",
    "DataQualityLevel": 1,
    "DateCreated": "2021-06-18T05:29:00Z",
    "SubmissionStatusTypeID": 200
}