{
    "IsRecentlyVerified": false,
    "ID": 92223,
    "UUID": "D05B921D-099D-4813-AC56-7FC80F23B0F3",
    "DataProviderID": 1,
    "OperatorID": 3,
    "OperatorsReference": "PG-91555,PG-91556,PG-91558,PG-91586,PG-91593,PG-91748",
    "UsageTypeID": 6,
    "UsageCost": "Free",
    "AddressInfo": {
        "ID": 92569,
        "Title": "GSK Brentford",
        "AddressLine1": "980 Great West Road",
        "Town": "Middlesex",
        "Postcode": "TW8 9GS",
        "CountryID": 1,
        "Latitude": 51.488046,
        "Longitude": -0.316619,
        "DistanceUnit": 0
    },
    "Connections": [
        {
            "ID": 130766,
            "ConnectionTypeID": 25,
            "StatusTypeID": 50,
            "LevelID": 2,
            "Amps": 32,
            "Voltage": 230,
            "PowerKW": 7,
            "CurrentTypeID": 10,
            "Quantity": 6
        }
    ],
    "NumberOfPoints": 12,
    "GeneralComments": "This is an open charge unit installed at GSK in Bredtford",
    "StatusTypeID": 50,
    "DateLastStatusUpdate": "2017-12-21T06:33:00Z",
    "DataQualityLevel": 1,
    "DateCreated": "2017-09-01T05:19:00Z",
    "SubmissionStatusTypeID": 200
}