{
    "IsRecentlyVerified": false,
    "ID": 68459,
    "UUID": "8CDE1A0C-0197-4ABB-82BD-CA760282FBF0",
    "DataProviderID": 1,
    "OperatorID": 23,
    "OperatorsReference": "18260",
    "UsageTypeID": 1,
    "UsageCost": "€0.33/kWh; Andere Tarife für ältere Autos",
    "AddressInfo": {
        "ID": 68805,
        "Title": "Tesla Supercharger Bernau",
        "AddressLine1": "Theodor-Sanne-Straße 6",
        "AddressLine2": "Reit",
        "Town": "Bernau am Chiemsee",
        "StateOrProvince": "Landkreis Rosenheim",
        "Postcode": "83233",
        "CountryID": 87,
        "Latitude": 47.8145794482747,
        "Longitude": 12.3679681349182,
        "AccessComments": "24/7 verfügbar.",
        "DistanceUnit": 0
    },
    "Connections": [
        {
            "ID": 95748,
            "ConnectionTypeID": 27,
            "StatusTypeID": 50,
            "LevelID": 3,
            "Voltage": 400,
            "PowerKW": 135,
            "CurrentTypeID": 30,
            "Quantity": 8
        }
    ],
    "NumberOfPoints": 8,
    "StatusTypeID": 50,
    "DateLastStatusUpdate": "2019-05-12T19:50:00Z",
    "DataQualityLevel": 1,
    "DateCreated": "2016-06-08T08:35:00Z",
    "SubmissionStatusTypeID": 200
}