{
    "IsRecentlyVerified": false,
    "ID": 160013,
    "UUID": "FAC8257D-0241-4795-A451-29DEFEF92C1E",
    "DataProviderID": 2,
    "DataProvidersReference": "157946",
    "OperatorID": 3372,
    "UsageTypeID": 1,
    "AddressInfo": {
        "ID": 160370,
        "Title": "Village of Burdett",
        "AddressLine1": "4125 NY-79",
        "Town": "Burdett",
        "StateOrProvince": "NY",
        "Postcode": "14818",
        "CountryID": 2,
        "Latitude": 42.421065,
        "Longitude": -76.838615,
        "ContactTelephone1": "866-816-7584",
        "AccessComments": "24 hours daily",
        "RelatedURL": "http://evconnect.com/",
        "DistanceUnit": 0
    },
    "Connections": [
        {
            "ID": 230246,
            "ConnectionTypeID": 1,
            "LevelID": 2,
            "Amps": 16,
            "Voltage": 230,
            "PowerKW": 3.7,
            "CurrentTypeID": 10,
            "Quantity": 2
        }
    ],
    "StatusTypeID": 50,
    "DateLastStatusUpdate": "2020-06-26T03:06:00Z",
    "DataQualityLevel": 3,
    "DateCreated": "2020-06-26T03:06:00Z",
    "SubmissionStatusTypeID": 100
}