{
    "IsRecentlyVerified": false,
    "ID": 105756,
    "UUID": "FC885C93-4483-4D90-8F79-D3796084E9B5",
    "DataProviderID": 2,
    "DataProvidersReference": "96862",
    "OperatorID": 5,
    "UsageTypeID": 1,
    "AddressInfo": {
        "ID": 106102,
        "Title": "9&CO",
        "AddressLine1": "4040-4110 E 11th Ave",
        "Town": "Denver",
        "StateOrProvince": "CO",
        "Postcode": "80220",
        "CountryID": 2,
        "Latitude": 39.732598,
        "Longitude": -104.9397685,
        "ContactTelephone1": "888-758-4389",
        "AccessComments": "24 hours daily",
        "RelatedURL": "http://www.chargepoint.com/",
        "DistanceUnit": 0
    },
    "Connections": [
        {
            "ID": 148954,
            "ConnectionTypeID": 1,
            "LevelID": 2,
            "Amps": 16,
            "Voltage": 230,
            "PowerKW": 3.7,
            "CurrentTypeID": 10,
            "Quantity": 2
        }
    ],
    "DateLastStatusUpdate": "2020-06-26T03:02:00Z",
    "DataQualityLevel": 3,
    "DateCreated": "2018-06-09T04:01:00Z",
    "SubmissionStatusTypeID": 100
}