{
    "IsRecentlyVerified": false,
    "ID": 65371,
    "UUID": "B165C5CE-4172-4ABB-93CA-55E73089B08B",
    "DataProviderID": 26,
    "DataProvidersReference": "85593",
    "OperatorID": 73,
    "OperatorsReference": "EV-Box EVB-P1426222",
    "UsageCost": "0.00 jaarabonnement",
    "AddressInfo": {
        "ID": 65717,
        "Title": "Zevekotestraat",
        "AddressLine1": "Zevekotestraat",
        "Town": "Kortrijk",
        "Postcode": "8500;8501;85",
        "CountryID": 26,
        "Latitude": 50.77322,
        "Longitude": 3.23423,
        "RelatedURL": "http://www.ev-box.nl",
        "DistanceUnit": 0
    },
    "Connections": [
        {
            "ID": 90072,
            "ConnectionTypeID": 25,
            "LevelID": 2,
            "PowerKW": 11,
            "CurrentTypeID": 10
        }
    ],
    "NumberOfPoints": 1,
    "StatusTypeID": 50,
    "DateLastStatusUpdate": "2016-06-04T02:38:00Z",
    "DataQualityLevel": 3,
    "DateCreated": "2016-04-27T09:41:00Z",
    "SubmissionStatusTypeID": 100
}