{
    "IsRecentlyVerified": false,
    "ID": 73558,
    "UUID": "EE537EF8-1FF5-4E93-A0C3-AE99ECE6086A",
    "DataProviderID": 1,
    "OperatorID": 25,
    "OperatorsReference": "merton-gorringepark",
    "UsageTypeID": 4,
    "UsageCost": "£0.059/minute; min £1.18; other tariffs available",
    "AddressInfo": {
        "ID": 73904,
        "Title": "Gorringe Park",
        "AddressLine1": "46 Gorringe Park Avenue",
        "Town": "CROYDON",
        "Postcode": "CR4 2DH",
        "CountryID": 1,
        "Latitude": 51.4174578,
        "Longitude": -0.1602936,
        "DistanceUnit": 0
    },
    "Connections": [
        {
            "ID": 105836,
            "ConnectionTypeID": 25,
            "StatusTypeID": 50,
            "LevelID": 2,
            "Amps": 32,
            "Voltage": 230,
            "PowerKW": 7,
            "CurrentTypeID": 10,
            "Quantity": 2
        },
        {
            "ID": 105837,
            "ConnectionTypeID": 1,
            "StatusTypeID": 50,
            "LevelID": 2,
            "Amps": 16,
            "Voltage": 230,
            "PowerKW": 4,
            "CurrentTypeID": 10,
            "Quantity": 2
        }
    ],
    "NumberOfPoints": 2,
    "StatusTypeID": 50,
    "DateLastStatusUpdate": "2017-06-09T05:31:00Z",
    "DataQualityLevel": 1,
    "DateCreated": "2016-11-23T19:34:00Z",
    "SubmissionStatusTypeID": 200
}