{
    "IsRecentlyVerified": false,
    "ID": 15256,
    "UUID": "A07558E2-0B9E-46B7-9225-60BA6F382D82",
    "DataProviderID": 1,
    "OperatorID": 1,
    "UsageTypeID": 5,
    "UsageCost": "Free",
    "AddressInfo": {
        "ID": 15602,
        "Title": "Parking Saint-Nicolas",
        "AddressLine1": "Avenue des Guelfes",
        "AddressLine2": "",
        "Town": "Fontvieille",
        "StateOrProvince": "",
        "Postcode": "",
        "CountryID": 149,
        "Latitude": 43.72641240000001,
        "Longitude": 7.4172697999999855,
        "ContactTelephone1": "+377 98 98 20 73",
        "ContactTelephone2": "",
        "ContactEmail": "",
        "AccessComments": " emplacements sont signalés par un panneau vert apposé sur le mur du parking.",
        "RelatedURL": "https://www.monaco-parkings.mc/",
        "DistanceUnit": 0
    },
    "Connections": [
        {
            "ID": 13562,
            "ConnectionTypeID": 0,
            "StatusTypeID": 0,
            "Amps": 20,
            "Quantity": 1
        }
    ],
    "NumberOfPoints": 1,
    "GeneralComments": " PARKING CHARGES APPLY",
    "StatusTypeID": 50,
    "DateLastStatusUpdate": "2012-12-28T17:56:00Z",
    "DataQualityLevel": 1,
    "DateCreated": "2012-12-28T17:56:00Z",
    "SubmissionStatusTypeID": 200
}