{
    "IsRecentlyVerified": false,
    "ID": 68230,
    "UUID": "274AB08D-9986-45E3-9CA9-FAD81E391411",
    "DataProviderID": 26,
    "DataProvidersReference": "90034",
    "OperatorID": 177,
    "OperatorsReference": "Nuon EVB-P1521075",
    "UsageCost": "0.00 jaarabonnement",
    "AddressInfo": {
        "ID": 68576,
        "Title": "Dennenlaan 14",
        "AddressLine1": "Dennenlaan 14",
        "Town": "Haarlemmermeer",
        "Postcode": "1161 CR",
        "CountryID": 159,
        "Latitude": 52.379488,
        "Longitude": 4.751577,
        "RelatedURL": "http://www.nuon.nl/ev",
        "DistanceUnit": 0
    },
    "Connections": [
        {
            "ID": 95099,
            "ConnectionTypeID": 25,
            "LevelID": 2,
            "PowerKW": 11,
            "CurrentTypeID": 10
        },
        {
            "ID": 95100,
            "ConnectionTypeID": 25,
            "LevelID": 2,
            "PowerKW": 11,
            "CurrentTypeID": 10
        }
    ],
    "NumberOfPoints": 1,
    "StatusTypeID": 50,
    "DateLastStatusUpdate": "2016-06-04T02:37:00Z",
    "DataQualityLevel": 3,
    "DateCreated": "2016-06-04T02:37:00Z",
    "SubmissionStatusTypeID": 100
}