{
    "IsRecentlyVerified": false,
    "ID": 32540,
    "UUID": "3FFBA7A7-0B8B-4976-9DC3-528960698D73",
    "DataProviderID": 26,
    "DataProvidersReference": "31312",
    "OperatorID": 157,
    "OperatorsReference": "NewMotion ICUEVE000021",
    "UsageCost": "0.00 jaarabonnement",
    "AddressInfo": {
        "ID": 32886,
        "Title": "Kerkpad 28",
        "AddressLine1": "Kerkpad 28",
        "Town": "Leudal",
        "Postcode": "6085 BB",
        "CountryID": 159,
        "Latitude": 51.2073953981646,
        "Longitude": 5.94862377643585,
        "ContactTelephone1": "088 0109500",
        "RelatedURL": "http://thenewmotion.nl/",
        "DistanceUnit": 0
    },
    "Connections": [
        {
            "ID": 36051,
            "ConnectionTypeID": 25,
            "LevelID": 2,
            "PowerKW": 11,
            "CurrentTypeID": 10
        }
    ],
    "NumberOfPoints": 2,
    "StatusTypeID": 50,
    "DateLastStatusUpdate": "2016-06-04T02:38:00Z",
    "DataQualityLevel": 3,
    "DateCreated": "2015-01-09T06:03:00Z",
    "SubmissionStatusTypeID": 100
}