{
    "IsRecentlyVerified": false,
    "ID": 159815,
    "UUID": "4C0BC3FE-1AC5-4766-99E9-0A13031ABABB",
    "DataProviderID": 2,
    "DataProvidersReference": "154076",
    "OperatorID": 5,
    "UsageTypeID": 1,
    "AddressInfo": {
        "ID": 160172,
        "Title": "ECOLOGIC INC.",
        "AddressLine1": "79 Aquidneck Dr",
        "Town": "Tiverton",
        "StateOrProvince": "RI",
        "Postcode": "02878",
        "CountryID": 2,
        "Latitude": 41.66475,
        "Longitude": -71.158414,
        "ContactTelephone1": "888-758-4389",
        "AccessComments": "24 hours daily",
        "RelatedURL": "http://www.chargepoint.com/",
        "DistanceUnit": 0
    },
    "Connections": [
        {
            "ID": 230033,
            "ConnectionTypeID": 1,
            "LevelID": 2,
            "Amps": 16,
            "Voltage": 230,
            "PowerKW": 3.7,
            "CurrentTypeID": 10,
            "Quantity": 4
        }
    ],
    "StatusTypeID": 50,
    "DateLastStatusUpdate": "2020-06-26T03:04:00Z",
    "DataQualityLevel": 3,
    "DateCreated": "2020-06-26T03:04:00Z",
    "SubmissionStatusTypeID": 100
}