{
    "IsRecentlyVerified": false,
    "ID": 187133,
    "UUID": "4B57D976-C454-4F82-9128-3B1500A3E82E",
    "DataProviderID": 29,
    "DataProvidersReference": "330",
    "AddressInfo": {
        "ID": 187492,
        "Title": "Buxtehuder Straße 5",
        "AddressLine1": "Buxtehuder Straße 5",
        "Town": "Apensen",
        "Postcode": "21641",
        "CountryID": 87,
        "Latitude": 53.434168,
        "Longitude": 9.614719,
        "DistanceUnit": 0
    },
    "Connections": [
        {
            "ID": 301308,
            "ConnectionTypeID": 25,
            "StatusTypeID": 50,
            "LevelID": 2,
            "PowerKW": 22,
            "CurrentTypeID": 20
        },
        {
            "ID": 301309,
            "ConnectionTypeID": 25,
            "StatusTypeID": 50,
            "LevelID": 2,
            "PowerKW": 22,
            "CurrentTypeID": 20
        }
    ],
    "StatusTypeID": 50,
    "DateLastStatusUpdate": "2021-07-12T02:51:00Z",
    "MetadataValues": [
        {
            "ID": 19373,
            "MetadataFieldID": 4,
            "ItemValue": "Data from the German chargepoint registry provided by Bundesnetzagentur.de under the CC-BY 4.0 license"
        }
    ],
    "DataQualityLevel": 3,
    "DateCreated": "2021-07-12T02:51:00Z",
    "SubmissionStatusTypeID": 100
}