{
    "IsRecentlyVerified": false,
    "ID": 35659,
    "UUID": "EEF7718F-3838-4C76-8F17-2E48A15B7343",
    "DataProviderID": 26,
    "DataProvidersReference": "54570",
    "OperatorID": 180,
    "OperatorsReference": "Alfen RHL03031",
    "UsageCost": "0.00 jaarabonnement",
    "AddressInfo": {
        "ID": 36005,
        "Title": "Sartrezijde 60",
        "AddressLine1": "Sartrezijde 60",
        "Town": "Zoetermeer",
        "Postcode": "2725 PR",
        "CountryID": 159,
        "Latitude": 52.069779,
        "Longitude": 4.496416,
        "ContactTelephone1": "036 - 549 34 00",
        "RelatedURL": "http://www.icu-charging-stations.com/",
        "DistanceUnit": 0
    },
    "Connections": [
        {
            "ID": 39170,
            "ConnectionTypeID": 25,
            "LevelID": 2,
            "PowerKW": 11,
            "CurrentTypeID": 10
        },
        {
            "ID": 47989,
            "ConnectionTypeID": 25,
            "LevelID": 2,
            "PowerKW": 11,
            "CurrentTypeID": 10
        }
    ],
    "NumberOfPoints": 1,
    "StatusTypeID": 50,
    "DateLastStatusUpdate": "2016-06-04T02:46:00Z",
    "DataQualityLevel": 3,
    "DateCreated": "2015-01-09T06:05:00Z",
    "SubmissionStatusTypeID": 100
}