{
    "UserComments": [
        {
            "ID": 24476,
            "ChargePointID": 175745,
            "CommentTypeID": 10,
            "UserName": "eberna",
            "Comment": "it works with nextcharge app.",
            "Rating": 5,
            "DateCreated": "2021-06-13T05:10:48.353Z",
            "User": {
                "ID": 29281,
                "Username": "eberna"
            },
            "CheckinStatusTypeID": 10,
            "IsActionedByEditor": false
        }
    ],
    "MediaItems": [
        {
            "ID": 28127,
            "ChargePointID": 175745,
            "ItemURL": "https://s3-ap-southeast-2.amazonaws.com/openchargemap/images/IT/OCM175745/OCM-175745.orig.2021061305094801.jpg",
            "ItemThumbnailURL": "https://s3-ap-southeast-2.amazonaws.com/openchargemap/images/IT/OCM175745/OCM-175745.thmb.2021061305094801.jpg",
            "Comment": "",
            "IsEnabled": true,
            "IsVideo": false,
            "IsFeaturedItem": false,
            "IsExternalResource": false,
            "User": {
                "ID": 29281,
                "Username": "eberna"
            },
            "DateCreated": "2021-06-13T05:10:00Z"
        },
        {
            "ID": 28126,
            "ChargePointID": 175745,
            "ItemURL": "https://s3-ap-southeast-2.amazonaws.com/openchargemap/images/IT/OCM175745/OCM-175745.orig.2021061305092033.jpg",
            "ItemThumbnailURL": "https://s3-ap-southeast-2.amazonaws.com/openchargemap/images/IT/OCM175745/OCM-175745.thmb.2021061305092033.jpg",
            "Comment": "",
            "IsEnabled": true,
            "IsVideo": false,
            "IsFeaturedItem": false,
            "IsExternalResource": false,
            "User": {
                "ID": 29281,
                "Username": "eberna"
            },
            "DateCreated": "2021-06-13T05:09:00Z"
        }
    ],
    "IsRecentlyVerified": false,
    "ID": 175745,
    "UUID": "9DC4B2AE-0F6D-4FAA-9004-5A9D4D9E1828",
    "DataProviderID": 1,
    "OperatorID": 80,
    "UsageTypeID": 4,
    "UsageCost": "0.35€/kWh",
    "AddressInfo": {
        "ID": 176104,
        "Title": "shopping center Coop Rosignano Solvay",
        "AddressLine1": "639/641 Via Aurelia",
        "Town": "Rosignano Solvay",
        "StateOrProvince": "Tuscany",
        "Postcode": "57016",
        "CountryID": 112,
        "Latitude": 43.39648558083155,
        "Longitude": 10.430018922695808,
        "RelatedURL": "http://ricarica.biz",
        "DistanceUnit": 0
    },
    "Connections": [
        {
            "ID": 272917,
            "ConnectionTypeID": 25,
            "StatusTypeID": 50,
            "LevelID": 2,
            "PowerKW": 22,
            "CurrentTypeID": 20,
            "Quantity": 2
        }
    ],
    "NumberOfPoints": 2,
    "StatusTypeID": 50,
    "DateLastStatusUpdate": "2021-06-13T20:35:00Z",
    "DataQualityLevel": 1,
    "DateCreated": "2021-06-11T11:22:00Z",
    "SubmissionStatusTypeID": 200
}