{
    "IsRecentlyVerified": false,
    "ID": 159608,
    "UUID": "61A27035-3212-45F4-9C14-C2E91E52704E",
    "DataProviderID": 2,
    "DataProvidersReference": "156360",
    "OperatorID": 5,
    "UsageTypeID": 1,
    "AddressInfo": {
        "ID": 159965,
        "Title": "TRANSIT PARK",
        "AddressLine1": "811 Market St",
        "Town": "Harrisburg",
        "StateOrProvince": "PA",
        "Postcode": "17105",
        "CountryID": 2,
        "Latitude": 40.262906,
        "Longitude": -76.876536,
        "ContactTelephone1": "888-758-4389",
        "AccessComments": "24 hours daily",
        "RelatedURL": "http://www.chargepoint.com/",
        "DistanceUnit": 0
    },
    "Connections": [
        {
            "ID": 229808,
            "ConnectionTypeID": 1,
            "LevelID": 2,
            "Amps": 16,
            "Voltage": 230,
            "PowerKW": 3.7,
            "CurrentTypeID": 10,
            "Quantity": 4
        }
    ],
    "StatusTypeID": 50,
    "DateLastStatusUpdate": "2020-06-26T03:02:00Z",
    "DataQualityLevel": 3,
    "DateCreated": "2020-06-26T03:02:00Z",
    "SubmissionStatusTypeID": 100
}