{
    "IsRecentlyVerified": false,
    "ID": 96876,
    "UUID": "2E45947A-8C68-42ED-B355-E097BE040EA4",
    "DataProviderID": 1,
    "OperatorID": 45,
    "UsageTypeID": 1,
    "AddressInfo": {
        "ID": 97222,
        "Title": "Restaurant Gaumentanz",
        "AddressLine1": "Porschestraße 5",
        "AddressLine2": "Heutingsheim",
        "Town": "Freiberg am Neckar",
        "StateOrProvince": "Vereinbarte Verwaltungsgemeinschaft der Stadt Freiberg am Neckar",
        "Postcode": "71691",
        "CountryID": 87,
        "Latitude": 48.9256995,
        "Longitude": 9.203625299999999,
        "AccessComments": "Rund um die Uhr (24/7) nutzbar.  auf dem Parkplatz der Backmanufaktur & Restaurant Gaumentanz\r\n",
        "DistanceUnit": 0
    },
    "Connections": [
        {
            "ID": 137218,
            "ConnectionTypeID": 25,
            "StatusTypeID": 50,
            "LevelID": 2,
            "Amps": 32,
            "Voltage": 400,
            "PowerKW": 22,
            "CurrentTypeID": 20,
            "Quantity": 2
        },
        {
            "ID": 137219,
            "ConnectionTypeID": 28,
            "StatusTypeID": 50,
            "LevelID": 2,
            "Amps": 16,
            "Voltage": 230,
            "PowerKW": 3.7,
            "CurrentTypeID": 10,
            "Quantity": 2
        }
    ],
    "NumberOfPoints": 2,
    "StatusTypeID": 50,
    "DateLastStatusUpdate": "2018-01-02T11:52:00Z",
    "DataQualityLevel": 1,
    "DateCreated": "2018-01-02T11:52:00Z",
    "SubmissionStatusTypeID": 200
}