{
    "IsRecentlyVerified": false,
    "ID": 125372,
    "UUID": "F33C459C-90BE-44DE-9C3D-56AB80076B0A",
    "DataProviderID": 1,
    "OperatorID": 3299,
    "UsageTypeID": 5,
    "UsageCost": "80 SEK pr charge",
    "AddressInfo": {
        "ID": 125718,
        "Title": "Circle K",
        "AddressLine1": "Bastekärrsvegen 2",
        "Town": "Strömstad",
        "Postcode": "452 94",
        "CountryID": 216,
        "Latitude": 58.914616222831,
        "Longitude": 11.2596247726133,
        "DistanceUnit": 0
    },
    "Connections": [
        {
            "ID": 175681,
            "ConnectionTypeID": 33,
            "StatusTypeID": 50,
            "LevelID": 3,
            "PowerKW": 350,
            "CurrentTypeID": 30,
            "Quantity": 4
        }
    ],
    "NumberOfPoints": 4,
    "StatusTypeID": 50,
    "DateLastStatusUpdate": "2019-04-15T15:32:00Z",
    "DataQualityLevel": 1,
    "DateCreated": "2019-04-15T14:00:00Z",
    "SubmissionStatusTypeID": 200
}