{
    "IsRecentlyVerified": false,
    "ID": 129894,
    "UUID": "58E9814A-D5F5-4000-AA42-7115FB269995",
    "DataProviderID": 1,
    "OperatorID": 23,
    "OperatorsReference": "51250",
    "UsageTypeID": 4,
    "AddressInfo": {
        "ID": 130240,
        "Title": "Boutique Apartments Blitz",
        "AddressLine1": "Trnji 13",
        "Town": "Bibinje",
        "Postcode": "23205",
        "CountryID": 60,
        "Latitude": 44.06634,
        "Longitude": 15.286072,
        "ContactTelephone1": "+385 95 883 0041",
        "DistanceUnit": 0
    },
    "Connections": [
        {
            "ID": 181884,
            "ConnectionTypeID": 30,
            "StatusTypeID": 50,
            "LevelID": 2,
            "PowerKW": 14,
            "CurrentTypeID": 20,
            "Quantity": 1
        }
    ],
    "NumberOfPoints": 1,
    "GeneralComments": "1 Tesla Connector, up to 14kW.Available for customers. Please call ahead.",
    "StatusTypeID": 50,
    "DateLastStatusUpdate": "2019-07-30T09:16:00Z",
    "DataQualityLevel": 1,
    "DateCreated": "2019-07-30T09:16:00Z",
    "SubmissionStatusTypeID": 200
}