{
    "IsRecentlyVerified": false,
    "ID": 156015,
    "UUID": "BA50EABE-0C3A-4597-9D0F-BEC87B32E800",
    "DataProviderID": 1,
    "OperatorID": 3310,
    "UsageTypeID": 4,
    "UsageCost": "see NEXTCHARGE app",
    "AddressInfo": {
        "ID": 156369,
        "Title": "Shell Alkimos ",
        "AddressLine1": "",
        "CountryID": 18,
        "Latitude": -31.628026035643767,
        "Longitude": 115.69091903987871,
        "DistanceUnit": 0
    },
    "Connections": [
        {
            "ID": 219604,
            "ConnectionTypeID": 25,
            "StatusTypeID": 50,
            "LevelID": 2,
            "PowerKW": 22,
            "CurrentTypeID": 20,
            "Quantity": 2,
            "Comments": "only one bay"
        }
    ],
    "NumberOfPoints": 1,
    "StatusTypeID": 50,
    "DateLastStatusUpdate": "2021-10-13T05:59:00Z",
    "DataQualityLevel": 1,
    "DateCreated": "2020-05-03T04:47:00Z",
    "SubmissionStatusTypeID": 200
}