{
    "IsRecentlyVerified": false,
    "ID": 92778,
    "UUID": "3B0A0FF3-D8D2-4E0B-B75D-AE055EE7B4E1",
    "DataProviderID": 1,
    "OperatorID": 220,
    "OperatorsReference": "4034",
    "UsageTypeID": 1,
    "UsageCost": "€1.73 + €0.3213/kWh; Andere Tarife möglich",
    "AddressInfo": {
        "ID": 93124,
        "Title": "Robert-Koch-Straße 2",
        "AddressLine1": "Robert-Koch-Straße 2",
        "Town": "HH-Nord",
        "StateOrProvince": "Hamburg",
        "Postcode": "20249",
        "CountryID": 87,
        "Latitude": 53.58743,
        "Longitude": 9.9827,
        "DistanceUnit": 0
    },
    "Connections": [
        {
            "ID": 131400,
            "ConnectionTypeID": 25,
            "StatusTypeID": 50,
            "LevelID": 2,
            "Amps": 32,
            "Voltage": 400,
            "PowerKW": 22,
            "CurrentTypeID": 20,
            "Quantity": 2
        },
        {
            "ID": 131412,
            "ConnectionTypeID": 28,
            "StatusTypeID": 50,
            "LevelID": 2,
            "Amps": 16,
            "Voltage": 230,
            "PowerKW": 3.7,
            "CurrentTypeID": 10,
            "Quantity": 2
        }
    ],
    "NumberOfPoints": 2,
    "StatusTypeID": 50,
    "DateLastStatusUpdate": "2017-09-10T14:17:00Z",
    "DataQualityLevel": 1,
    "DateCreated": "2017-09-10T14:12:00Z",
    "SubmissionStatusTypeID": 200
}