{
    "IsRecentlyVerified": false,
    "ID": 98027,
    "UUID": "EA735BE4-EE38-45CC-90DC-689EEB5EA4FA",
    "DataProviderID": 1,
    "OperatorID": 23,
    "OperatorsReference": "38122",
    "UsageTypeID": 4,
    "AddressInfo": {
        "ID": 98373,
        "Title": "Carlton Hotel St. Moritz",
        "AddressLine1": "Via Johannes Badrutt 11",
        "Town": "St. Moritz",
        "Postcode": "7500",
        "CountryID": 217,
        "Latitude": 46.499875,
        "Longitude": 9.846417,
        "ContactTelephone1": "+41 8183 67000",
        "DistanceUnit": 0
    },
    "Connections": [
        {
            "ID": 138935,
            "ConnectionTypeID": 30,
            "StatusTypeID": 50,
            "LevelID": 2,
            "Amps": 32,
            "Voltage": 400,
            "PowerKW": 22,
            "CurrentTypeID": 20,
            "Quantity": 2
        }
    ],
    "NumberOfPoints": 2,
    "GeneralComments": "2 Tesla Connectors, up to 22kW.Available for customers. Please see front desk.",
    "StatusTypeID": 50,
    "DateLastStatusUpdate": "2018-10-03T15:03:00Z",
    "DataQualityLevel": 1,
    "DateCreated": "2018-01-21T17:36:00Z",
    "SubmissionStatusTypeID": 200
}