{
    "IsRecentlyVerified": false,
    "ID": 43557,
    "UUID": "FB93A3FD-3B5D-405A-9FA7-DCAF6AB158EC",
    "DataProviderID": 1,
    "OperatorID": 45,
    "UsageTypeID": 1,
    "UsageCost": "0",
    "AddressInfo": {
        "ID": 43903,
        "Title": "Autohaus Holst",
        "AddressLine1": "Vareler Weg 60",
        "Town": "Scheeßel",
        "StateOrProvince": "Landkreis Rotenburg",
        "Postcode": "27383",
        "CountryID": 87,
        "Latitude": 53.1793064,
        "Longitude": 9.49014639999996,
        "ContactTelephone1": " +49 4263 3060",
        "AccessComments": "24/7 nutzbare Wallbox am VW Autohaus mit 2 Parkplätzen.. ",
        "RelatedURL": "http://www.autohaus-holst.de/",
        "DistanceUnit": 0
    },
    "Connections": [
        {
            "ID": 52838,
            "ConnectionTypeID": 25,
            "StatusTypeID": 50,
            "LevelID": 2,
            "Amps": 16,
            "Voltage": 230,
            "PowerKW": 3.7,
            "CurrentTypeID": 10,
            "Quantity": 2
        }
    ],
    "NumberOfPoints": 2,
    "StatusTypeID": 50,
    "DateLastStatusUpdate": "2015-04-04T20:55:00Z",
    "DataQualityLevel": 1,
    "DateCreated": "2015-04-04T11:16:00Z",
    "SubmissionStatusTypeID": 200
}