{
    "IsRecentlyVerified": false,
    "ID": 46288,
    "UUID": "52B516C7-02F2-4178-8B8D-F6A7E03CECE5",
    "DataProviderID": 1,
    "DataProvidersReference": "1129",
    "AddressInfo": {
        "ID": 46634,
        "Title": "Trondheimsveien/Carl Berners plass, Oslo",
        "AddressLine1": "Trondheimsveien 84",
        "Town": "OSLO",
        "StateOrProvince": "Oslo",
        "Postcode": "0565",
        "CountryID": 168,
        "Latitude": 59.92421,
        "Longitude": 10.77347,
        "AccessComments": "",
        "DistanceUnit": 0
    },
    "Connections": [
        {
            "ID": 56951,
            "ConnectionTypeID": 0,
            "Reference": "1",
            "LevelID": 2,
            "Amps": 16,
            "Voltage": 230,
            "PowerKW": 3.7,
            "Comments": "Mode 1"
        },
        {
            "ID": 85954,
            "ConnectionTypeID": 0,
            "Reference": "2",
            "LevelID": 2,
            "Amps": 16,
            "Voltage": 230,
            "PowerKW": 3.7,
            "Comments": "Mode 1"
        },
        {
            "ID": 85955,
            "ConnectionTypeID": 0,
            "Reference": "3",
            "LevelID": 2,
            "Amps": 16,
            "Voltage": 230,
            "PowerKW": 3.7,
            "Comments": "Mode 1"
        },
        {
            "ID": 88680,
            "ConnectionTypeID": 0,
            "Reference": "4",
            "LevelID": 2,
            "Amps": 16,
            "Voltage": 230,
            "PowerKW": 3.7,
            "Comments": "Mode 1"
        }
    ],
    "NumberOfPoints": 4,
    "DateLastStatusUpdate": "2020-05-26T08:23:00Z",
    "DataQualityLevel": 2,
    "DateCreated": "2015-05-03T00:54:00Z",
    "SubmissionStatusTypeID": 100
}