{
    "IsRecentlyVerified": false,
    "ID": 113364,
    "UUID": "1AE61132-CC9F-4CF9-BD51-A7830A926BA8",
    "DataProviderID": 1,
    "OperatorID": 3377,
    "UsageTypeID": 4,
    "UsageCost": "gratis",
    "AddressInfo": {
        "ID": 113710,
        "Title": "EdRR Vandellòs i l'Hospitalet de l'Infant",
        "AddressLine1": "Carretera de Móra, 5, L'Hospitalet de l'Infant",
        "Town": "L'Hospitalet de l'Infant",
        "StateOrProvince": "Tarragona",
        "Postcode": "43890",
        "CountryID": 210,
        "Latitude": 40.9919174,
        "Longitude": 0.921468199999936,
        "RelatedURL": "http://etecnic.es",
        "DistanceUnit": 0
    },
    "Connections": [
        {
            "ID": 159661,
            "ConnectionTypeID": 2,
            "StatusTypeID": 50,
            "LevelID": 3,
            "PowerKW": 50,
            "CurrentTypeID": 30,
            "Quantity": 1
        },
        {
            "ID": 159662,
            "ConnectionTypeID": 33,
            "StatusTypeID": 50,
            "LevelID": 3,
            "PowerKW": 50,
            "CurrentTypeID": 30,
            "Quantity": 1
        },
        {
            "ID": 159663,
            "ConnectionTypeID": 1036,
            "StatusTypeID": 50,
            "LevelID": 3,
            "PowerKW": 43,
            "CurrentTypeID": 20,
            "Quantity": 1
        }
    ],
    "NumberOfPoints": 4,
    "StatusTypeID": 50,
    "DateLastStatusUpdate": "2021-03-12T10:51:00Z",
    "DataQualityLevel": 1,
    "DateCreated": "2018-12-05T21:07:00Z",
    "SubmissionStatusTypeID": 200
}