{
    "IsRecentlyVerified": false,
    "ID": 17141,
    "UUID": "814131B6-0FBB-4A0C-99BA-43BD1354A6A8",
    "DataProviderID": 22,
    "DataProvidersReference": "FB6A4114C5D63FC0BE8286359AFF72CE",
    "AddressInfo": {
        "ID": 17486,
        "Title": "ＥＮＥＯＳ　Ｄｒ．Ｄｒｉｖｅ小杉店",
        "AddressLine1": "神奈川県川崎市中原区小杉町2-271-1",
        "CountryID": 114,
        "Latitude": 35.57705555,
        "Longitude": 139.6570267,
        "ContactTelephone1": "044-722-5432",
        "DistanceUnit": 0
    },
    "Connections": [
        {
            "ID": 17382,
            "ConnectionTypeID": 2,
            "LevelID": 2,
            "Amps": 100,
            "Voltage": 480,
            "PowerKW": 48,
            "Quantity": 1
        }
    ],
    "DateLastStatusUpdate": "2013-06-29T08:54:00Z",
    "DataQualityLevel": 2,
    "DateCreated": "2013-06-29T08:54:00Z",
    "SubmissionStatusTypeID": 200
}