{
    "IsRecentlyVerified": false,
    "ID": 90490,
    "UUID": "2F06B86C-4783-4C86-A2D5-4DA6DA8CA780",
    "DataProviderID": 1,
    "OperatorID": 45,
    "UsageTypeID": 6,
    "AddressInfo": {
        "ID": 90836,
        "Title": "Eyedentity",
        "AddressLine1": "Scheelenstraße 10",
        "Town": "Hildesheim",
        "Postcode": "31134",
        "CountryID": 87,
        "Latitude": 52.1515,
        "Longitude": 9.952310000000011,
        "ContactTelephone1": "+49 512132019",
        "AccessComments": "Nur für Kunden. Einfahrt mit Rolltor in verkehrsberuhigter Zone (Scheelenstraße selbst ist Fußgängerzone).",
        "RelatedURL": "http://eyedentity.me/",
        "DistanceUnit": 0
    },
    "Connections": [
        {
            "ID": 128147,
            "ConnectionTypeID": 25,
            "StatusTypeID": 50,
            "LevelID": 2,
            "Amps": 32,
            "Voltage": 400,
            "PowerKW": 22,
            "CurrentTypeID": 20,
            "Quantity": 1
        }
    ],
    "NumberOfPoints": 1,
    "StatusTypeID": 50,
    "DateLastStatusUpdate": "2017-07-14T06:29:00Z",
    "DataQualityLevel": 1,
    "DateCreated": "2017-07-14T06:29:00Z",
    "SubmissionStatusTypeID": 200
}