{
    "IsRecentlyVerified": false,
    "ID": 187931,
    "UUID": "C687D1B6-D043-4E61-817B-76FD28B6F718",
    "DataProviderID": 18,
    "DataProvidersReference": "ff2d21b1285b42e995157b72b32cd92e",
    "OperatorID": 3345,
    "UsageTypeID": 5,
    "AddressInfo": {
        "ID": 188290,
        "Title": "CV2 1HZ",
        "AddressLine1": "",
        "Town": "Coventry",
        "Postcode": "CV2 1HZ",
        "CountryID": 1,
        "Latitude": 52.426371,
        "Longitude": -1.459004,
        "AccessComments": "",
        "RelatedURL": "https://char.gy",
        "DistanceUnit": 0
    },
    "Connections": [
        {
            "ID": 303261,
            "ConnectionTypeID": 25,
            "Reference": "789",
            "StatusTypeID": 50,
            "LevelID": 2,
            "Amps": 32,
            "Voltage": 230,
            "PowerKW": 7,
            "CurrentTypeID": 10
        }
    ],
    "StatusTypeID": 0,
    "DateLastStatusUpdate": "2021-07-12T03:39:00Z",
    "MetadataValues": [
        {
            "ID": 20171,
            "MetadataFieldID": 4,
            "ItemValue": "Contains public sector information licensed under the Open Government Licence v2.0. http://www.nationalarchives.gov.uk/doc/open-government-licence/version/2/"
        }
    ],
    "DataQualityLevel": 3,
    "DateCreated": "2021-07-12T03:39:00Z",
    "SubmissionStatusTypeID": 100
}