{
    "IsRecentlyVerified": false,
    "ID": 145818,
    "UUID": "715E0194-DC6C-4140-819C-87473D9142E7",
    "DataProviderID": 2,
    "DataProvidersReference": "147439",
    "OperatorID": 5,
    "UsageTypeID": 1,
    "AddressInfo": {
        "ID": 146170,
        "Title": "WESTMAN VILLAGE",
        "AddressLine1": "121 Mahogany Centre SE",
        "Town": "Calgary",
        "StateOrProvince": "AB",
        "Postcode": "T3M 2V6",
        "CountryID": 44,
        "Latitude": 50.896354,
        "Longitude": -113.938972,
        "ContactTelephone1": "888-758-4389",
        "AccessComments": "24 hours daily",
        "RelatedURL": "http://www.chargepoint.com/",
        "DistanceUnit": 0
    },
    "Connections": [
        {
            "ID": 202576,
            "ConnectionTypeID": 1,
            "LevelID": 2,
            "Amps": 16,
            "Voltage": 230,
            "PowerKW": 3,
            "CurrentTypeID": 10,
            "Quantity": 4
        }
    ],
    "StatusTypeID": 50,
    "DateLastStatusUpdate": "2019-12-24T09:25:00Z",
    "DataQualityLevel": 3,
    "DateCreated": "2019-12-24T09:25:00Z",
    "SubmissionStatusTypeID": 100
}