{
    "IsRecentlyVerified": false,
    "ID": 123008,
    "UUID": "82F3F280-D7EB-4593-89AD-5CF201B89D07",
    "DataProviderID": 2,
    "DataProvidersReference": "114705",
    "OperatorID": 23,
    "UsageTypeID": 1,
    "AddressInfo": {
        "ID": 123354,
        "Title": "Historic Tapoco Lodge - Tesla Destination",
        "AddressLine1": "14981 Tapoco Rd",
        "Town": "Robbinsville",
        "StateOrProvince": "NC",
        "Postcode": "28771",
        "CountryID": 2,
        "Latitude": 35.443895,
        "Longitude": -83.943754,
        "ContactTelephone1": "828-498-2800  877-798-3752",
        "AccessComments": "24 hours daily; for customer use only; see front desk for access",
        "RelatedURL": "https://www.tesla.com/destination-charging",
        "DistanceUnit": 0
    },
    "Connections": [
        {
            "ID": 172943,
            "ConnectionTypeID": 30,
            "LevelID": 2,
            "Amps": 16,
            "Voltage": 230,
            "PowerKW": 3.7,
            "CurrentTypeID": 10,
            "Quantity": 4
        }
    ],
    "DateLastStatusUpdate": "2020-06-26T02:58:00Z",
    "DataQualityLevel": 3,
    "DateCreated": "2019-04-06T05:03:00Z",
    "SubmissionStatusTypeID": 100
}