{
    "IsRecentlyVerified": false,
    "ID": 16768,
    "UUID": "AF3EAC2C-BCF0-4928-9590-6C67CA63291B",
    "DataProviderID": 2,
    "DataProvidersReference": "51921",
    "UsageTypeID": 1,
    "AddressInfo": {
        "ID": 17113,
        "Title": "Lodi Animals Service and Shelter",
        "AddressLine1": "1345 W Kettleman Ln",
        "Town": "Lodi",
        "StateOrProvince": "CA",
        "Postcode": "95242",
        "CountryID": 2,
        "Latitude": 38.115528,
        "Longitude": -121.288943,
        "ContactTelephone1": "209-333-6762",
        "AccessComments": "24 hours daily",
        "RelatedURL": "",
        "DistanceUnit": 0
    },
    "Connections": [
        {
            "ID": 16991,
            "ConnectionTypeID": 1,
            "LevelID": 2,
            "Amps": 16,
            "Voltage": 230,
            "PowerKW": 3,
            "CurrentTypeID": 10,
            "Quantity": 1
        },
        {
            "ID": 22216,
            "ConnectionTypeID": 1,
            "LevelID": 2,
            "Quantity": 1
        }
    ],
    "DateLastStatusUpdate": "2019-04-06T04:02:00Z",
    "DataQualityLevel": 3,
    "DateCreated": "2013-06-16T03:49:00Z",
    "SubmissionStatusTypeID": 200
}