{
    "UserComments": [
        {
            "ID": 3504,
            "ChargePointID": 5202,
            "CommentTypeID": 10,
            "UserName": "dodavies",
            "Comment": "",
            "Rating": 4,
            "DateCreated": "2015-01-01T15:17:25.053Z",
            "User": {
                "ID": 1195,
                "Username": "dodavies"
            },
            "CheckinStatusTypeID": 10
        }
    ],
    "IsRecentlyVerified": false,
    "ID": 5202,
    "UUID": "4FA6CE5B-3ACF-4438-8B18-454C76B3F620",
    "DataProviderID": 1,
    "OperatorID": 20,
    "OperatorsReference": "772,773",
    "UsageTypeID": 0,
    "UsageCost": "£1.00/charge admin fee",
    "AddressInfo": {
        "ID": 5142,
        "Title": "Brooklands",
        "AddressLine1": "Brooklands",
        "AddressLine2": "Western Road",
        "Town": "Worthing",
        "StateOrProvince": "West Sussex",
        "Postcode": "BN11 2HP",
        "CountryID": 1,
        "Latitude": 50.8206045107893,
        "Longitude": -0.337443351745606,
        "DistanceUnit": 0
    },
    "Connections": [
        {
            "ID": 312,
            "ConnectionTypeID": 3,
            "StatusTypeID": 75,
            "LevelID": 2,
            "Amps": 13,
            "Voltage": 230,
            "PowerKW": 3,
            "CurrentTypeID": 10,
            "Quantity": 2
        }
    ],
    "NumberOfPoints": 2,
    "StatusTypeID": 75,
    "DateLastStatusUpdate": "2017-08-24T05:37:00Z",
    "DataQualityLevel": 1,
    "DateCreated": "2011-08-24T15:40:00Z",
    "SubmissionStatusTypeID": 200
}