{
    "IsRecentlyVerified": false,
    "ID": 122007,
    "UUID": "A6231462-B3AE-49CA-BA74-6DDE6E5A239F",
    "DataProviderID": 2,
    "DataProvidersReference": "61493",
    "OperatorID": 5,
    "UsageTypeID": 1,
    "AddressInfo": {
        "ID": 122353,
        "Title": "BMW GWINNETT",
        "AddressLine1": "3264 Commerce Ave NW",
        "Town": "Duluth",
        "StateOrProvince": "GA",
        "Postcode": "30096",
        "CountryID": 2,
        "Latitude": 33.9596134,
        "Longitude": -84.1194598,
        "ContactTelephone1": "888-758-4389",
        "AccessComments": "24 hours daily",
        "RelatedURL": "http://www.chargepoint.com/",
        "DistanceUnit": 0
    },
    "Connections": [
        {
            "ID": 171857,
            "ConnectionTypeID": 1,
            "LevelID": 2,
            "Amps": 16,
            "Voltage": 230,
            "PowerKW": 3,
            "CurrentTypeID": 10,
            "Quantity": 2
        }
    ],
    "DateLastStatusUpdate": "2019-12-24T09:11:00Z",
    "DataQualityLevel": 3,
    "DateCreated": "2019-04-06T05:02:00Z",
    "SubmissionStatusTypeID": 100
}