{
    "IsRecentlyVerified": false,
    "ID": 33582,
    "UUID": "334498F4-04F6-4422-87CE-5CB964E10F3B",
    "DataProviderID": 26,
    "DataProvidersReference": "52902",
    "OperatorID": 73,
    "OperatorsReference": "EV-Box EVB-P1416134",
    "UsageCost": "0.00 jaarabonnement",
    "AddressInfo": {
        "ID": 33928,
        "Title": "Groenewoud",
        "AddressLine1": "Groenewoud",
        "Town": "Heusden",
        "Postcode": "5151 DA",
        "CountryID": 159,
        "Latitude": 51.6887,
        "Longitude": 5.15025,
        "RelatedURL": "http://www.ev-box.nl",
        "DistanceUnit": 0
    },
    "Connections": [
        {
            "ID": 37093,
            "ConnectionTypeID": 25,
            "LevelID": 2,
            "PowerKW": 11,
            "CurrentTypeID": 10
        },
        {
            "ID": 46845,
            "ConnectionTypeID": 25,
            "LevelID": 2,
            "PowerKW": 11,
            "CurrentTypeID": 10
        }
    ],
    "NumberOfPoints": 1,
    "StatusTypeID": 50,
    "DateLastStatusUpdate": "2016-06-04T02:40:00Z",
    "DataQualityLevel": 3,
    "DateCreated": "2015-01-09T06:04:00Z",
    "SubmissionStatusTypeID": 100
}