{
    "IsRecentlyVerified": false,
    "ID": 111032,
    "UUID": "DD805A50-63DA-4867-9C3D-3882B3EA4913",
    "DataProviderID": 2,
    "DataProvidersReference": "99555",
    "OperatorID": 5,
    "UsageTypeID": 1,
    "AddressInfo": {
        "ID": 111378,
        "Title": "FRANKENSOLAR",
        "AddressLine1": "165 Sun Pac Blvd",
        "Town": "Brampton",
        "StateOrProvince": "ON",
        "Postcode": "L6S 5Z6",
        "CountryID": 44,
        "Latitude": 43.7552947,
        "Longitude": -79.6909184,
        "ContactTelephone1": "888-758-4389",
        "AccessComments": "24 hours daily",
        "RelatedURL": "http://www.chargepoint.com/",
        "DistanceUnit": 0
    },
    "Connections": [
        {
            "ID": 156374,
            "ConnectionTypeID": 1,
            "LevelID": 2,
            "Amps": 16,
            "Voltage": 230,
            "PowerKW": 3.7,
            "CurrentTypeID": 10,
            "Quantity": 2
        }
    ],
    "DateLastStatusUpdate": "2020-06-26T03:07:00Z",
    "DataQualityLevel": 3,
    "DateCreated": "2018-10-18T23:36:00Z",
    "SubmissionStatusTypeID": 100
}