{
    "IsRecentlyVerified": false,
    "ID": 63360,
    "UUID": "34E6B592-803D-49DD-AA6F-F81D116ACBDE",
    "DataProviderID": 26,
    "DataProvidersReference": "72842",
    "OperatorID": 103,
    "OperatorsReference": "Allego NLALLEGO0002162",
    "UsageCost": "0.00 jaarabonnement",
    "AddressInfo": {
        "ID": 63706,
        "Title": "Lange Wal 24-1",
        "AddressLine1": "Lange Wal 24-1",
        "Town": "Arnhem",
        "Postcode": "6826 NB",
        "CountryID": 159,
        "Latitude": 51.98245837,
        "Longitude": 5.9509098,
        "ContactTelephone1": "0800-3745337",
        "RelatedURL": "http://www.allego.eu/",
        "DistanceUnit": 0
    },
    "Connections": [
        {
            "ID": 80764,
            "ConnectionTypeID": 25,
            "LevelID": 2,
            "PowerKW": 11,
            "CurrentTypeID": 10
        },
        {
            "ID": 80765,
            "ConnectionTypeID": 25,
            "LevelID": 2,
            "PowerKW": 11,
            "CurrentTypeID": 10
        }
    ],
    "NumberOfPoints": 1,
    "StatusTypeID": 50,
    "DateLastStatusUpdate": "2016-06-04T02:43:00Z",
    "DataQualityLevel": 3,
    "DateCreated": "2016-03-03T12:30:00Z",
    "SubmissionStatusTypeID": 100
}