{
    "IsRecentlyVerified": false,
    "ID": 73287,
    "UUID": "1ED24803-E4A2-4743-B0B1-DD95FC67DC1E",
    "DataProviderID": 1,
    "OperatorID": 45,
    "UsageTypeID": 4,
    "AddressInfo": {
        "ID": 73633,
        "Title": "Supermarkt Rewe",
        "AddressLine1": "Segeberger Chaussee 138",
        "AddressLine2": "Glashütte",
        "Town": "Norderstedt",
        "StateOrProvince": "Kreis Segeberg",
        "Postcode": "22851",
        "CountryID": 87,
        "Latitude": 53.684733297661204,
        "Longitude": 10.021318619049126,
        "ContactTelephone1": "+49 40 51203994",
        "AccessComments": "Ladekarte kann im Supermarkt an der Info ausgeliehen werden zu den Öffnungszeiten Mo-Sa 7-22Uhr. Säule steht direkt an Ein- und Ausfahrt des Kundenparkplatzes.",
        "RelatedURL": "http://www.rewe.de/marktseite/rewe-markt-norderstedt-segeberger-chaussee-138",
        "DistanceUnit": 0
    },
    "Connections": [
        {
            "ID": 105455,
            "ConnectionTypeID": 25,
            "StatusTypeID": 50,
            "LevelID": 2,
            "Amps": 32,
            "Voltage": 400,
            "PowerKW": 22,
            "CurrentTypeID": 20,
            "Quantity": 2
        }
    ],
    "NumberOfPoints": 2,
    "StatusTypeID": 50,
    "DateLastStatusUpdate": "2016-11-17T10:37:00Z",
    "DataQualityLevel": 1,
    "DateCreated": "2016-11-17T10:37:00Z",
    "SubmissionStatusTypeID": 200
}