{
    "UserComments": [
        {
            "ID": 23607,
            "ChargePointID": 60195,
            "CommentTypeID": 10,
            "UserName": "Scanner",
            "Comment": "Ths site is dead it hasn't worked since Source East ceased operations some years ago.",
            "Rating": 1,
            "DateCreated": "2020-12-07T23:13:57.6Z",
            "User": {
                "ID": 28607,
                "Username": "Scanner"
            },
            "CheckinStatusTypeID": 10,
            "IsActionedByEditor": false
        }
    ],
    "IsRecentlyVerified": false,
    "ID": 60195,
    "UUID": "776A3FAB-B11A-4D92-9403-3233D19D3269",
    "DataProviderID": 1,
    "OperatorID": 3,
    "OperatorsReference": "PP-5112109",
    "UsageTypeID": 4,
    "UsageCost": "Free",
    "AddressInfo": {
        "ID": 60541,
        "Title": "Bridge Place",
        "AddressLine1": "Bridge Place",
        "AddressLine2": "Godmanchester",
        "Town": "Huntingdonshire",
        "StateOrProvince": "Cambridgeshire",
        "Postcode": "PE29 2XQ",
        "CountryID": 1,
        "Latitude": 52.3257528,
        "Longitude": -0.176402199999984,
        "DistanceUnit": 0
    },
    "Connections": [
        {
            "ID": 76189,
            "ConnectionTypeID": 25,
            "StatusTypeID": 50,
            "LevelID": 2,
            "Amps": 32,
            "Voltage": 230,
            "PowerKW": 7,
            "CurrentTypeID": 10,
            "Quantity": 2
        }
    ],
    "NumberOfPoints": 2,
    "GeneralComments": "Formerly on Source East",
    "StatusTypeID": 0,
    "DateLastStatusUpdate": "2020-12-07T23:14:00Z",
    "DataQualityLevel": 1,
    "DateCreated": "2016-01-12T21:55:00Z",
    "SubmissionStatusTypeID": 200
}