{
    "IsRecentlyVerified": false,
    "ID": 183581,
    "UUID": "C69DC18F-140D-47DD-87C9-70DB9826D4CC",
    "DataProviderID": 29,
    "DataProvidersReference": "10370",
    "OperatorID": 45,
    "AddressInfo": {
        "ID": 183940,
        "Title": "Industrieweg 5",
        "AddressLine1": "Industrieweg 5",
        "Town": "Sendenhorst",
        "Postcode": "48324",
        "CountryID": 87,
        "Latitude": 51.84015,
        "Longitude": 7.845129,
        "DistanceUnit": 0
    },
    "Connections": [
        {
            "ID": 290739,
            "ConnectionTypeID": 33,
            "StatusTypeID": 50,
            "LevelID": 3,
            "PowerKW": 22,
            "CurrentTypeID": 30
        },
        {
            "ID": 290740,
            "ConnectionTypeID": 25,
            "StatusTypeID": 50,
            "LevelID": 2,
            "PowerKW": 11,
            "CurrentTypeID": 20
        }
    ],
    "StatusTypeID": 50,
    "DateLastStatusUpdate": "2021-07-09T03:25:00Z",
    "MetadataValues": [
        {
            "ID": 15874,
            "MetadataFieldID": 4,
            "ItemValue": "Data from the German chargepoint registry provided by Bundesnetzagentur.de under the CC-BY 4.0 license"
        }
    ],
    "DataQualityLevel": 3,
    "DateCreated": "2021-07-08T10:04:00Z",
    "SubmissionStatusTypeID": 100
}