{
    "IsRecentlyVerified": false,
    "ID": 160573,
    "UUID": "D6CD8310-311E-462D-8D9F-B2E876E198D6",
    "DataProviderID": 2,
    "DataProvidersReference": "156727",
    "UsageTypeID": 2,
    "AddressInfo": {
        "ID": 160930,
        "Title": "Hydro-Quebec",
        "AddressLine1": "215 rue Rochette",
        "Town": "St-Pascal",
        "StateOrProvince": "QC",
        "Postcode": "G0L 3Y0",
        "CountryID": 44,
        "Latitude": 47.529917,
        "Longitude": -69.819511,
        "ContactTelephone1": "",
        "AccessComments": "",
        "RelatedURL": "",
        "DistanceUnit": 0
    },
    "Connections": [
        {
            "ID": 231046,
            "ConnectionTypeID": 2,
            "LevelID": 3,
            "Amps": 100,
            "Voltage": 400,
            "PowerKW": 40,
            "CurrentTypeID": 30,
            "Quantity": 1
        },
        {
            "ID": 231047,
            "ConnectionTypeID": 32,
            "LevelID": 3,
            "Amps": 100,
            "Voltage": 400,
            "PowerKW": 40,
            "CurrentTypeID": 30,
            "Quantity": 1
        }
    ],
    "GeneralComments": "Planned for future date. Not Operational.",
    "DatePlanned": "2020-09-01T00:00:00Z",
    "StatusTypeID": 150,
    "DateLastStatusUpdate": "2020-06-26T03:10:00Z",
    "DataQualityLevel": 3,
    "DateCreated": "2020-06-26T03:10:00Z",
    "SubmissionStatusTypeID": 100
}