{
    "IsRecentlyVerified": false,
    "ID": 143533,
    "UUID": "5677CA53-7438-4B5C-B8B0-37CDC02D9805",
    "DataProviderID": 2,
    "DataProvidersReference": "129492",
    "OperatorID": 89,
    "UsageTypeID": 1,
    "AddressInfo": {
        "ID": 143885,
        "Title": "McMaster University - Gerald Hatch Centre",
        "AddressLine1": "1280, Main St. West",
        "Town": "Hamilton",
        "StateOrProvince": "ON",
        "Postcode": "L8S 4L7",
        "CountryID": 44,
        "Latitude": 43.258128,
        "Longitude": -79.917014,
        "ContactTelephone1": "888-356-8911",
        "AccessComments": "24 hours daily",
        "RelatedURL": "https://flo.ca/",
        "DistanceUnit": 0
    },
    "Connections": [
        {
            "ID": 199872,
            "ConnectionTypeID": 1,
            "LevelID": 2,
            "Amps": 16,
            "Voltage": 230,
            "PowerKW": 3.7,
            "CurrentTypeID": 10,
            "Quantity": 4
        }
    ],
    "StatusTypeID": 50,
    "DateLastStatusUpdate": "2020-06-26T03:06:00Z",
    "DataQualityLevel": 3,
    "DateCreated": "2019-12-24T09:21:00Z",
    "SubmissionStatusTypeID": 100
}