{
    "IsRecentlyVerified": true,
    "DateLastVerified": "2021-10-26T19:46:00Z",
    "ID": 189693,
    "UUID": "B0E8EAED-E72B-4A17-9E78-C13A72741C4E",
    "DataProviderID": 1,
    "OperatorID": 1,
    "UsageTypeID": 4,
    "UsageCost": "0.32 Eur/kWh",
    "AddressInfo": {
        "ID": 190052,
        "Title": "21 Dorfstraße",
        "AddressLine1": "21 Dorfstraße",
        "Town": "Roppen",
        "StateOrProvince": "Tyrol",
        "Postcode": "6426",
        "CountryID": 19,
        "Latitude": 47.22277312349172,
        "Longitude": 10.822963018469409,
        "DistanceUnit": 0
    },
    "Connections": [
        {
            "ID": 306884,
            "ConnectionTypeID": 1036,
            "Reference": "Everters.com",
            "StatusTypeID": 50,
            "LevelID": 2,
            "Amps": 16,
            "Voltage": 230,
            "PowerKW": 11,
            "CurrentTypeID": 20,
            "Quantity": 1
        }
    ],
    "NumberOfPoints": 1,
    "StatusTypeID": 50,
    "DateLastStatusUpdate": "2021-10-27T20:57:00Z",
    "DataQualityLevel": 1,
    "DateCreated": "2021-10-26T19:46:00Z",
    "SubmissionStatusTypeID": 200
}