{
    "IsRecentlyVerified": false,
    "ID": 107257,
    "UUID": "FA805375-7C18-4001-B4D7-7DC94B53EA7B",
    "DataProviderID": 1,
    "OperatorID": 25,
    "OperatorsReference": "brent-moraroad",
    "UsageTypeID": 4,
    "UsageCost": "£0.059/minute; min £1.18; other tariffs available",
    "AddressInfo": {
        "ID": 107603,
        "Title": "Mora Road",
        "AddressLine1": "2 Mora Road",
        "Town": "London",
        "Postcode": "NW2 6TG",
        "CountryID": 1,
        "Latitude": 51.559631857,
        "Longitude": -0.219353085945,
        "DistanceUnit": 0
    },
    "Connections": [
        {
            "ID": 151279,
            "ConnectionTypeID": 25,
            "StatusTypeID": 50,
            "LevelID": 2,
            "Amps": 32,
            "Voltage": 230,
            "PowerKW": 7,
            "CurrentTypeID": 10,
            "Quantity": 2
        },
        {
            "ID": 151280,
            "ConnectionTypeID": 1,
            "StatusTypeID": 50,
            "LevelID": 2,
            "Amps": 16,
            "Voltage": 230,
            "PowerKW": 4,
            "CurrentTypeID": 10,
            "Quantity": 2
        }
    ],
    "NumberOfPoints": 2,
    "StatusTypeID": 50,
    "DateLastStatusUpdate": "2019-06-11T05:31:00Z",
    "DataQualityLevel": 1,
    "DateCreated": "2018-07-23T15:31:00Z",
    "SubmissionStatusTypeID": 200
}