{
    "IsRecentlyVerified": false,
    "ID": 124289,
    "UUID": "40EB1CC6-4765-479B-B2AC-7E01A1F211D0",
    "DataProviderID": 2,
    "DataProvidersReference": "36347",
    "OperatorID": 5,
    "UsageTypeID": 1,
    "AddressInfo": {
        "ID": 124635,
        "Title": "MARTINEZ CA",
        "AddressLine1": "680 Court St",
        "Town": "Martinez",
        "StateOrProvince": "CA",
        "Postcode": "94553",
        "CountryID": 2,
        "Latitude": 38.0184746,
        "Longitude": -122.1345444,
        "ContactTelephone1": "888-758-4389",
        "AccessComments": "24 hours daily",
        "RelatedURL": "http://www.chargepoint.com/",
        "DistanceUnit": 0
    },
    "Connections": [
        {
            "ID": 174370,
            "ConnectionTypeID": 9,
            "LevelID": 1,
            "Amps": 16,
            "Voltage": 120,
            "PowerKW": 1,
            "CurrentTypeID": 10,
            "Quantity": 1
        },
        {
            "ID": 174371,
            "ConnectionTypeID": 1,
            "LevelID": 2,
            "Amps": 16,
            "Voltage": 230,
            "PowerKW": 3,
            "CurrentTypeID": 10,
            "Quantity": 1
        }
    ],
    "DateLastStatusUpdate": "2019-12-24T09:14:00Z",
    "DataQualityLevel": 3,
    "DateCreated": "2019-04-06T05:03:00Z",
    "SubmissionStatusTypeID": 100
}