{
    "IsRecentlyVerified": false,
    "ID": 59128,
    "UUID": "F577E2FD-E67A-40F8-B078-57C4DCC7A46D",
    "DataProviderID": 1,
    "OperatorID": 45,
    "UsageTypeID": 6,
    "UsageCost": "$1/hour",
    "AddressInfo": {
        "ID": 59474,
        "Title": "Kopu Cafe",
        "AddressLine1": "101 Kopu Rd",
        "AddressLine2": "",
        "Town": "Kopu",
        "StateOrProvince": "",
        "Postcode": "3578",
        "CountryID": 161,
        "Latitude": -37.1886974,
        "Longitude": 175.5667872,
        "ContactTelephone1": "07 868 5926",
        "ContactTelephone2": "",
        "ContactEmail": "",
        "AccessComments": "Business hours only (5am-4pm, 7 days)",
        "RelatedURL": "",
        "DistanceUnit": 0
    },
    "Connections": [
        {
            "ID": 75033,
            "ConnectionTypeID": 1,
            "StatusTypeID": 50,
            "LevelID": 2,
            "Amps": 30,
            "PowerKW": 7
        }
    ],
    "NumberOfPoints": 1,
    "GeneralComments": "Customers only",
    "StatusTypeID": 50,
    "DateLastStatusUpdate": "2016-01-13T07:53:00Z",
    "DataQualityLevel": 1,
    "DateCreated": "2016-01-07T14:52:00Z",
    "SubmissionStatusTypeID": 200
}