{
    "MediaItems": [
        {
            "ID": 1238,
            "ChargePointID": 45031,
            "ItemURL": "https://s3-ap-southeast-2.amazonaws.com/openchargemap/images/GB/OCM45031/OCM-45031.orig.2015042311305761.jpg",
            "ItemThumbnailURL": "https://s3-ap-southeast-2.amazonaws.com/openchargemap/images/GB/OCM45031/OCM-45031.thmb.2015042311305761.jpg",
            "Comment": "",
            "IsEnabled": true,
            "IsVideo": false,
            "IsFeaturedItem": false,
            "IsExternalResource": false,
            "User": {
                "ID": 4779,
                "Username": "Filip Van Rickstal"
            },
            "DateCreated": "2015-04-23T11:31:00Z"
        }
    ],
    "IsRecentlyVerified": false,
    "ID": 45031,
    "UUID": "BF2D5FDD-4AD7-4508-A68D-301120111FA2",
    "DataProviderID": 1,
    "OperatorID": 49,
    "UsageTypeID": 1,
    "AddressInfo": {
        "ID": 45377,
        "Title": "Sporthal Lummen",
        "AddressLine1": "Sportweg",
        "Town": "Lummen",
        "Postcode": "3560",
        "CountryID": 26,
        "Latitude": 50.9908867091148,
        "Longitude": 5.18945379203069,
        "RelatedURL": "http://www.ev-point.be/",
        "DistanceUnit": 0
    },
    "Connections": [
        {
            "ID": 55363,
            "ConnectionTypeID": 25,
            "StatusTypeID": 50,
            "LevelID": 2,
            "Amps": 32,
            "Voltage": 400,
            "PowerKW": 22,
            "CurrentTypeID": 20,
            "Quantity": 2
        }
    ],
    "NumberOfPoints": 2,
    "StatusTypeID": 50,
    "DateLastStatusUpdate": "2015-04-26T08:34:00Z",
    "DataQualityLevel": 1,
    "DateCreated": "2015-04-23T11:31:00Z",
    "SubmissionStatusTypeID": 200
}