{
    "IsRecentlyVerified": false,
    "ID": 165519,
    "UUID": "FD969752-A387-4A93-B9BC-2A14ACEFA822",
    "DataProviderID": 28,
    "DataProvidersReference": "FR*A16*P*WIIZ*95*_*_*_",
    "UsageTypeID": 5,
    "AddressInfo": {
        "ID": 165878,
        "Title": "Le Cannet - Parking Palèstre",
        "AddressLine1": "Avenue Georges Pompidou",
        "CountryID": 80,
        "Latitude": 43.568851,
        "Longitude": 6.984026,
        "AccessComments": "24h/24",
        "DistanceUnit": 0
    },
    "Connections": [
        {
            "ID": 239566,
            "ConnectionTypeID": 28,
            "StatusTypeID": 50,
            "LevelID": 2,
            "PowerKW": 22,
            "CurrentTypeID": 10
        },
        {
            "ID": 239567,
            "ConnectionTypeID": 1036,
            "StatusTypeID": 50,
            "LevelID": 2,
            "PowerKW": 22,
            "CurrentTypeID": 20
        },
        {
            "ID": 239568,
            "ConnectionTypeID": 28,
            "StatusTypeID": 50,
            "LevelID": 2,
            "PowerKW": 22,
            "CurrentTypeID": 10
        },
        {
            "ID": 239569,
            "ConnectionTypeID": 1036,
            "StatusTypeID": 50,
            "LevelID": 2,
            "PowerKW": 22,
            "CurrentTypeID": 20
        }
    ],
    "GeneralComments": "badge, appli et QR code",
    "StatusTypeID": 50,
    "DateLastStatusUpdate": "2020-08-27T05:10:00Z",
    "DataQualityLevel": 2,
    "DateCreated": "2020-08-27T05:10:00Z",
    "SubmissionStatusTypeID": 100
}