{
    "IsRecentlyVerified": false,
    "ID": 34118,
    "UUID": "5FC397F8-0E6B-4CBE-AD9E-9B14B73524AB",
    "DataProviderID": 26,
    "DataProvidersReference": "27755",
    "OperatorID": 157,
    "OperatorsReference": "NewMotion 02001678",
    "UsageCost": "0.00 jaarabonnement",
    "AddressInfo": {
        "ID": 34464,
        "Title": "Akkerwindeplaats 2",
        "AddressLine1": "Akkerwindeplaats 2",
        "Town": "Molenwaard",
        "Postcode": "2971 BC",
        "CountryID": 159,
        "Latitude": 51.8724414,
        "Longitude": 4.78425670000001,
        "ContactTelephone1": "088 0109500",
        "RelatedURL": "http://thenewmotion.nl/",
        "DistanceUnit": 0
    },
    "Connections": [
        {
            "ID": 37629,
            "ConnectionTypeID": 25,
            "LevelID": 2,
            "PowerKW": 3.7,
            "CurrentTypeID": 10
        }
    ],
    "NumberOfPoints": 1,
    "StatusTypeID": 50,
    "DateLastStatusUpdate": "2016-06-04T02:41:00Z",
    "DataQualityLevel": 3,
    "DateCreated": "2015-01-09T06:04:00Z",
    "SubmissionStatusTypeID": 100
}