{
    "IsRecentlyVerified": false,
    "ID": 99689,
    "UUID": "57997022-E6C1-4199-A857-97B2C9F2761A",
    "DataProviderID": 1,
    "OperatorID": 23,
    "OperatorsReference": "34790",
    "UsageTypeID": 4,
    "UsageCost": "$0.44/min >=60kW; $0.22/min <60kW; other tariffs for older cars",
    "AddressInfo": {
        "ID": 100035,
        "Title": "Whistler, BC Supercharger",
        "AddressLine1": "4599 Chateau Boulevard",
        "Town": "Whistler",
        "Postcode": "V0N 1B4",
        "CountryID": 44,
        "Latitude": 50.117555,
        "Longitude": -122.944756,
        "DistanceUnit": 0
    },
    "Connections": [
        {
            "ID": 140834,
            "ConnectionTypeID": 27,
            "StatusTypeID": 50,
            "LevelID": 3,
            "PowerKW": 72,
            "CurrentTypeID": 30,
            "Quantity": 10
        }
    ],
    "NumberOfPoints": 10,
    "GeneralComments": "Charging10 Superchargers, available 24/7, up to 72kW",
    "StatusTypeID": 50,
    "DateLastStatusUpdate": "2021-04-19T15:30:00Z",
    "DataQualityLevel": 1,
    "DateCreated": "2018-02-01T07:11:00Z",
    "SubmissionStatusTypeID": 200
}