{
    "IsRecentlyVerified": false,
    "ID": 2892,
    "UUID": "C7615DCC-1AC4-48D1-BF83-18F2FAC2896F",
    "DataProviderID": 2,
    "DataProvidersReference": "35480",
    "OperatorID": 5,
    "UsageTypeID": 1,
    "AddressInfo": {
        "ID": 2893,
        "Title": "LBCC",
        "AddressLine1": "Ellingson Rd SW",
        "Town": "Albany",
        "StateOrProvince": "OR",
        "Postcode": "97321",
        "CountryID": 2,
        "Latitude": 44.5861227,
        "Longitude": -123.1153894,
        "ContactTelephone1": "888-758-4389",
        "AccessComments": "24 hours daily",
        "RelatedURL": "http://www.chargepoint.com/",
        "DistanceUnit": 0
    },
    "Connections": [
        {
            "ID": 3651,
            "ConnectionTypeID": 1,
            "LevelID": 2,
            "Amps": 16,
            "Voltage": 230,
            "PowerKW": 3.7,
            "CurrentTypeID": 10,
            "Quantity": 6
        },
        {
            "ID": 20303,
            "ConnectionTypeID": 1,
            "LevelID": 2,
            "Amps": 16,
            "Voltage": 230,
            "PowerKW": 3,
            "CurrentTypeID": 10,
            "Quantity": 3
        }
    ],
    "DateLastConfirmed": "2011-04-30T00:00:00Z",
    "StatusTypeID": 0,
    "DateLastStatusUpdate": "2020-06-26T03:08:00Z",
    "DataQualityLevel": 1,
    "DateCreated": "2011-04-30T00:00:00Z",
    "SubmissionStatusTypeID": 100
}