{
    "IsRecentlyVerified": false,
    "ID": 110061,
    "UUID": "D32E2FB0-99CC-4454-B694-818848ED98A8",
    "DataProviderID": 2,
    "DataProvidersReference": "99477",
    "OperatorID": 5,
    "UsageTypeID": 1,
    "AddressInfo": {
        "ID": 110407,
        "Title": "LAKESHORE",
        "AddressLine1": "18171 Von Karman Ave",
        "Town": "Irvine",
        "StateOrProvince": "CA",
        "Postcode": "92612",
        "CountryID": 2,
        "Latitude": 33.6790372,
        "Longitude": -117.8535714,
        "ContactTelephone1": "888-758-4389",
        "AccessComments": "24 hours daily",
        "RelatedURL": "http://www.chargepoint.com/",
        "DistanceUnit": 0
    },
    "Connections": [
        {
            "ID": 155290,
            "ConnectionTypeID": 1,
            "LevelID": 2,
            "Amps": 16,
            "Voltage": 230,
            "PowerKW": 3,
            "CurrentTypeID": 10,
            "Quantity": 2
        }
    ],
    "DateLastStatusUpdate": "2019-04-06T04:01:00Z",
    "DataQualityLevel": 3,
    "DateCreated": "2018-10-18T23:35:00Z",
    "SubmissionStatusTypeID": 100
}