{
    "IsRecentlyVerified": false,
    "ID": 113845,
    "UUID": "076CB499-E4CD-4424-A959-605BDD5DF501",
    "DataProviderID": 1,
    "OperatorID": 23,
    "OperatorsReference": "47395",
    "UsageTypeID": 6,
    "AddressInfo": {
        "ID": 114191,
        "Title": "Casino Vilamoura Solverde",
        "AddressLine1": "Casino de Vilamoura - Avenida Da Marina S/N",
        "Town": "Quarteira",
        "Postcode": "8125-909",
        "CountryID": 180,
        "Latitude": 37.073563,
        "Longitude": -8.115922,
        "ContactTelephone1": " +351 28 931 0000",
        "AccessComments": "Only by reservation",
        "DistanceUnit": 0
    },
    "Connections": [
        {
            "ID": 160415,
            "ConnectionTypeID": 30,
            "StatusTypeID": 50,
            "LevelID": 2,
            "Amps": 32,
            "Voltage": 400,
            "PowerKW": 22,
            "CurrentTypeID": 20,
            "Quantity": 2
        }
    ],
    "NumberOfPoints": 2,
    "GeneralComments": "2 Tesla Connectors, up to 22kW.Available by reservation only. Self park.",
    "StatusTypeID": 50,
    "DateLastStatusUpdate": "2020-08-06T18:31:00Z",
    "DataQualityLevel": 1,
    "DateCreated": "2019-01-02T21:45:00Z",
    "SubmissionStatusTypeID": 200
}