{
    "IsRecentlyVerified": false,
    "ID": 108744,
    "UUID": "9342C74F-7C36-4823-BA2B-8A38FF3B652B",
    "DataProviderID": 1,
    "OperatorID": 23,
    "OperatorsReference": "45820",
    "UsageTypeID": 4,
    "AddressInfo": {
        "ID": 109090,
        "Title": "Gordon Bubolz Nature Presrerve",
        "AddressLine1": "4815 N Lynndale DR",
        "Town": "Appleton",
        "StateOrProvince": "Wisconsin",
        "Postcode": "54913",
        "CountryID": 2,
        "Latitude": 44.311612,
        "Longitude": -88.449619,
        "ContactTelephone1": "(920) 731-6041",
        "DistanceUnit": 0
    },
    "Connections": [
        {
            "ID": 153859,
            "ConnectionTypeID": 30,
            "StatusTypeID": 50,
            "LevelID": 2,
            "PowerKW": 16,
            "CurrentTypeID": 20,
            "Quantity": 4
        }
    ],
    "NumberOfPoints": 4,
    "GeneralComments": "4 Tesla Connectors, up to 16kW.Available to the public. Self park.",
    "StatusTypeID": 50,
    "DateLastStatusUpdate": "2018-10-11T12:33:00Z",
    "DataQualityLevel": 1,
    "DateCreated": "2018-10-11T12:33:00Z",
    "SubmissionStatusTypeID": 200
}