{
    "IsRecentlyVerified": false,
    "ID": 166230,
    "UUID": "10A9AFE2-41E9-49E1-959C-0F5E0DECEB40",
    "DataProviderID": 28,
    "DataProvidersReference": "FRS42S42145A1",
    "UsageTypeID": 5,
    "AddressInfo": {
        "ID": 166589,
        "Title": "Parking rue jacquard",
        "AddressLine1": "Rue jacquard",
        "CountryID": 80,
        "Latitude": 46.031578,
        "Longitude": 4.234594,
        "AccessComments": "24/24 - 7/7",
        "DistanceUnit": 0
    },
    "Connections": [
        {
            "ID": 245248,
            "ConnectionTypeID": 28,
            "StatusTypeID": 50,
            "LevelID": 2,
            "PowerKW": 22,
            "CurrentTypeID": 10
        },
        {
            "ID": 245249,
            "ConnectionTypeID": 0,
            "StatusTypeID": 50,
            "LevelID": 2,
            "PowerKW": 22
        }
    ],
    "GeneralComments": "En service",
    "StatusTypeID": 50,
    "DateLastStatusUpdate": "2020-08-27T05:12:00Z",
    "DataQualityLevel": 2,
    "DateCreated": "2020-08-27T05:12:00Z",
    "SubmissionStatusTypeID": 100
}