{
    "IsRecentlyVerified": false,
    "ID": 94039,
    "UUID": "BA238076-2AE5-496D-AF79-0F0BF63505E7",
    "DataProviderID": 1,
    "OperatorID": 23,
    "OperatorsReference": "36242",
    "UsageTypeID": 4,
    "AddressInfo": {
        "ID": 94385,
        "Title": "Radisson Hotel Santa Maria",
        "AddressLine1": "3455 Skyway DR",
        "Town": "Santa Maria",
        "StateOrProvince": "California",
        "Postcode": "93455",
        "CountryID": 2,
        "Latitude": 34.896575,
        "Longitude": -120.444896,
        "ContactTelephone1": "(805) 928-8000",
        "DistanceUnit": 0
    },
    "Connections": [
        {
            "ID": 133093,
            "ConnectionTypeID": 30,
            "StatusTypeID": 50,
            "LevelID": 2,
            "PowerKW": 16,
            "CurrentTypeID": 20,
            "Quantity": 2
        }
    ],
    "NumberOfPoints": 2,
    "GeneralComments": "2 Tesla Connectors, up to 16kW.Available for customers. Please see front desk.",
    "StatusTypeID": 50,
    "DateLastStatusUpdate": "2017-10-14T05:41:00Z",
    "DataQualityLevel": 1,
    "DateCreated": "2017-10-14T05:41:00Z",
    "SubmissionStatusTypeID": 200
}