{
    "IsRecentlyVerified": false,
    "ID": 142457,
    "UUID": "59A6EF3D-532F-42E3-A50C-BB6D9E84C7A5",
    "DataProviderID": 2,
    "DataProvidersReference": "95028",
    "OperatorID": 5,
    "UsageTypeID": 1,
    "AddressInfo": {
        "ID": 142809,
        "Title": "PUBLIC USE",
        "AddressLine1": "349 W 300 S Pioneer Park",
        "Town": "Salt Lake City",
        "StateOrProvince": "UT",
        "Postcode": "84101",
        "CountryID": 2,
        "Latitude": 40.7627132,
        "Longitude": -111.9008997,
        "ContactTelephone1": "888-758-4389",
        "AccessComments": "24 hours daily",
        "RelatedURL": "http://www.chargepoint.com/",
        "DistanceUnit": 0
    },
    "Connections": [
        {
            "ID": 198593,
            "ConnectionTypeID": 1,
            "LevelID": 2,
            "Amps": 16,
            "Voltage": 230,
            "PowerKW": 3.7,
            "CurrentTypeID": 10,
            "Quantity": 2
        }
    ],
    "StatusTypeID": 50,
    "DateLastStatusUpdate": "2020-06-26T03:03:00Z",
    "DataQualityLevel": 3,
    "DateCreated": "2019-12-24T09:17:00Z",
    "SubmissionStatusTypeID": 100
}