{
    "IsRecentlyVerified": false,
    "ID": 125858,
    "UUID": "7786B98D-31A4-4871-822E-F4AE6AB87A7B",
    "DataProviderID": 1,
    "OperatorID": 45,
    "UsageTypeID": 5,
    "UsageCost": "35p/kWh",
    "AddressInfo": {
        "ID": 126204,
        "Title": "Merrion Centre Car Park",
        "AddressLine1": "Merrion Way",
        "Town": "Leeds",
        "Postcode": "LS2 8BT",
        "CountryID": 1,
        "Latitude": 53.80226,
        "Longitude": -1.543198,
        "DistanceUnit": 0
    },
    "Connections": [
        {
            "ID": 176382,
            "ConnectionTypeID": 33,
            "StatusTypeID": 50,
            "LevelID": 3,
            "PowerKW": 50,
            "CurrentTypeID": 30,
            "Quantity": 1
        },
        {
            "ID": 176383,
            "ConnectionTypeID": 2,
            "StatusTypeID": 50,
            "LevelID": 3,
            "PowerKW": 50,
            "CurrentTypeID": 30,
            "Quantity": 1
        },
        {
            "ID": 176384,
            "ConnectionTypeID": 1036,
            "StatusTypeID": 50,
            "LevelID": 3,
            "PowerKW": 43,
            "CurrentTypeID": 20,
            "Quantity": 1
        }
    ],
    "NumberOfPoints": 2,
    "GeneralComments": "CitiCharge evolt charger",
    "StatusTypeID": 50,
    "DateLastStatusUpdate": "2019-05-01T21:20:00Z",
    "DataQualityLevel": 1,
    "DateCreated": "2019-05-01T21:20:00Z",
    "SubmissionStatusTypeID": 200
}