{
    "IsRecentlyVerified": false,
    "ID": 159534,
    "UUID": "1D5A5636-F376-47D3-A80E-E73C75C22293",
    "DataProviderID": 2,
    "DataProvidersReference": "150041",
    "OperatorID": 5,
    "UsageTypeID": 1,
    "AddressInfo": {
        "ID": 159891,
        "Title": "OHIO STATE UNV",
        "AddressLine1": "2490 CARMACK ROAD",
        "Town": "Columbus",
        "StateOrProvince": "OH",
        "Postcode": "43210",
        "CountryID": 2,
        "Latitude": 40.0127319,
        "Longitude": -83.0422411,
        "ContactTelephone1": "888-758-4389",
        "AccessComments": "24 hours daily",
        "RelatedURL": "http://www.chargepoint.com/",
        "DistanceUnit": 0
    },
    "Connections": [
        {
            "ID": 229726,
            "ConnectionTypeID": 1,
            "LevelID": 2,
            "Amps": 16,
            "Voltage": 230,
            "PowerKW": 3.7,
            "CurrentTypeID": 10,
            "Quantity": 1
        }
    ],
    "StatusTypeID": 50,
    "DateLastStatusUpdate": "2020-06-26T03:02:00Z",
    "DataQualityLevel": 3,
    "DateCreated": "2020-06-26T03:02:00Z",
    "SubmissionStatusTypeID": 100
}