{
    "IsRecentlyVerified": false,
    "ID": 176581,
    "UUID": "ADD7CCB7-7FCD-4D6A-BFEF-14C02102959B",
    "DataProviderID": 29,
    "DataProvidersReference": "3583",
    "OperatorID": 3403,
    "AddressInfo": {
        "ID": 176940,
        "Title": "Badstr. 1",
        "AddressLine1": "Badstr. 1",
        "Town": "Fischbachau",
        "Postcode": "83730",
        "CountryID": 87,
        "Latitude": 47.72049,
        "Longitude": 11.95064,
        "DistanceUnit": 0
    },
    "Connections": [
        {
            "ID": 274658,
            "ConnectionTypeID": 25,
            "StatusTypeID": 50,
            "LevelID": 2,
            "PowerKW": 11,
            "CurrentTypeID": 20
        },
        {
            "ID": 274659,
            "ConnectionTypeID": 25,
            "StatusTypeID": 50,
            "LevelID": 2,
            "PowerKW": 22,
            "CurrentTypeID": 20
        }
    ],
    "StatusTypeID": 0,
    "DateLastStatusUpdate": "2021-07-09T03:10:00Z",
    "MetadataValues": [
        {
            "ID": 8876,
            "MetadataFieldID": 4,
            "ItemValue": "Data from the German chargepoint registry provided by Bundesnetzagentur.de under the CC-BY 4.0 license"
        }
    ],
    "DataQualityLevel": 3,
    "DateCreated": "2021-07-08T09:48:00Z",
    "SubmissionStatusTypeID": 100
}