{
    "IsRecentlyVerified": false,
    "ID": 182629,
    "UUID": "03184A45-02F1-4914-BBF1-38DF89FD2F5A",
    "DataProviderID": 29,
    "DataProvidersReference": "8740",
    "AddressInfo": {
        "ID": 182988,
        "Title": "Hagener Straße Höhe Nr. 76",
        "AddressLine1": "Hagener Straße Höhe Nr. 76",
        "Town": "Nachrodt-Wiblingwerde",
        "Postcode": "58769",
        "CountryID": 87,
        "Latitude": 51.337757,
        "Longitude": 7.63608,
        "DistanceUnit": 0
    },
    "Connections": [
        {
            "ID": 288607,
            "ConnectionTypeID": 25,
            "StatusTypeID": 50,
            "LevelID": 2,
            "PowerKW": 22,
            "CurrentTypeID": 20
        },
        {
            "ID": 288608,
            "ConnectionTypeID": 25,
            "StatusTypeID": 50,
            "LevelID": 2,
            "PowerKW": 22,
            "CurrentTypeID": 20
        }
    ],
    "StatusTypeID": 50,
    "DateLastStatusUpdate": "2021-07-09T03:23:00Z",
    "MetadataValues": [
        {
            "ID": 14922,
            "MetadataFieldID": 4,
            "ItemValue": "Data from the German chargepoint registry provided by Bundesnetzagentur.de under the CC-BY 4.0 license"
        }
    ],
    "DataQualityLevel": 3,
    "DateCreated": "2021-07-08T10:03:00Z",
    "SubmissionStatusTypeID": 100
}