{
    "IsRecentlyVerified": false,
    "ID": 67364,
    "UUID": "57478195-163F-46C4-925A-710C80945805",
    "DataProviderID": 1,
    "OperatorID": 23,
    "OperatorsReference": "16164",
    "UsageTypeID": 1,
    "UsageCost": "Free",
    "AddressInfo": {
        "ID": 67710,
        "Title": "GGMC Parking - Tesla",
        "AddressLine1": "100 E 15th St",
        "Town": "New York",
        "StateOrProvince": "NY",
        "Postcode": "10003",
        "CountryID": 2,
        "Latitude": 40.7349191,
        "Longitude": -73.9893665,
        "ContactTelephone1": "212-677-2026  877-798-3752",
        "AccessComments": "24 hours daily; for Tesla use only; see valet for access",
        "RelatedURL": "http://www.teslamotors.com/supercharger",
        "DistanceUnit": 0
    },
    "Connections": [
        {
            "ID": 92868,
            "ConnectionTypeID": 30,
            "StatusTypeID": 50,
            "LevelID": 2,
            "Amps": 16,
            "Voltage": 230,
            "PowerKW": 8,
            "CurrentTypeID": 10,
            "Quantity": 4
        }
    ],
    "NumberOfPoints": 4,
    "StatusTypeID": 50,
    "DateLastStatusUpdate": "2017-02-01T10:02:00Z",
    "DataQualityLevel": 3,
    "DateCreated": "2016-05-29T02:05:00Z",
    "SubmissionStatusTypeID": 100
}