{
    "MediaItems": [
        {
            "ID": 18786,
            "ChargePointID": 128833,
            "ItemURL": "https://s3-ap-southeast-2.amazonaws.com/openchargemap/images/GB/OCM128833/OCM-128833.orig.2019070319205584.png",
            "ItemThumbnailURL": "https://s3-ap-southeast-2.amazonaws.com/openchargemap/images/GB/OCM128833/OCM-128833.thmb.2019070319205584.png",
            "Comment": "",
            "IsEnabled": true,
            "IsVideo": false,
            "IsFeaturedItem": false,
            "IsExternalResource": false,
            "User": {
                "ID": 21411,
                "Username": "kurt"
            },
            "DateCreated": "2019-07-03T19:21:00Z"
        },
        {
            "ID": 18785,
            "ChargePointID": 128833,
            "ItemURL": "https://s3-ap-southeast-2.amazonaws.com/openchargemap/images/GB/OCM128833/OCM-128833.orig.2019070319194291.png",
            "ItemThumbnailURL": "https://s3-ap-southeast-2.amazonaws.com/openchargemap/images/GB/OCM128833/OCM-128833.thmb.2019070319194291.png",
            "Comment": "",
            "IsEnabled": true,
            "IsVideo": false,
            "IsFeaturedItem": false,
            "IsExternalResource": false,
            "User": {
                "ID": 21411,
                "Username": "kurt"
            },
            "DateCreated": "2019-07-03T19:20:00Z"
        }
    ],
    "IsRecentlyVerified": false,
    "ID": 128833,
    "UUID": "715888B1-3D27-4B43-9180-64875D006226",
    "DataProviderID": 1,
    "OperatorID": 3344,
    "UsageTypeID": 4,
    "UsageCost": "DC - 9 UAH/kWh (≈0.30 €/kWh), AC - 4.5 UAH/kWh (≈0.15 €/kWh). No fees for time or session.",
    "AddressInfo": {
        "ID": 129179,
        "Title": "[018] STRUM 50 kW (SOCAR)",
        "AddressLine1": "а/д Київ-Чоп 321км+800м (ліворуч), Біла Криниця, Рівненська область",
        "Town": "Біла Криниця",
        "CountryID": 234,
        "Latitude": 50.6089588396559,
        "Longitude": 26.3499059411394,
        "ContactTelephone1": "+380 800 212 333",
        "AccessComments": "24h access.",
        "RelatedURL": "http://strum.dtek.com",
        "DistanceUnit": 0
    },
    "Connections": [
        {
            "ID": 180264,
            "ConnectionTypeID": 2,
            "StatusTypeID": 50,
            "LevelID": 3,
            "Amps": 125,
            "PowerKW": 50,
            "CurrentTypeID": 30,
            "Quantity": 1
        },
        {
            "ID": 180265,
            "ConnectionTypeID": 33,
            "StatusTypeID": 50,
            "LevelID": 3,
            "Amps": 125,
            "PowerKW": 50,
            "CurrentTypeID": 30,
            "Quantity": 1
        },
        {
            "ID": 180266,
            "ConnectionTypeID": 25,
            "StatusTypeID": 50,
            "LevelID": 2,
            "PowerKW": 22,
            "CurrentTypeID": 20
        }
    ],
    "NumberOfPoints": 1,
    "GeneralComments": "Registration, top-up & charging via 'STRUM Charging' mobile app (iOS/Android), at least 25.00 kWh must be available on the account at the start of each charging session. Parking is free. You can book your STRUM card only after registrartion & top-up by sending request to support.strum@dtek.com.\r\n \r\n You pay only for kWh, no fees for time or session. Price during top-up is 9 UAH/KWH (≈ 0.3 €/KWH). While charging on CHAdeMO/CCS, 1 KWH is taken away for each 1 kWh of charging. While charging on Type2, 0.5 KWH is taken away for each 1 kWh of charging (half price). Actual prices at http://strum.dtek.com/en/prices/.\r\n \r\n Android App download - https://play.google.com/store/apps/details?id=com.beenergised.chargemobile.dtek&hl=en\r\n iOS App download - https://itunes.apple.com/us/app/strum-charging/id1368596475?mt=8",
    "StatusTypeID": 50,
    "DateLastStatusUpdate": "2019-07-08T11:05:00Z",
    "DataQualityLevel": 1,
    "DateCreated": "2019-07-01T09:26:00Z",
    "SubmissionStatusTypeID": 200
}