{
    "IsRecentlyVerified": false,
    "ID": 19106,
    "UUID": "1841A6FA-D051-4A82-BE4B-E5D2378FD75F",
    "DataProviderID": 1,
    "OperatorID": 7,
    "UsageTypeID": 1,
    "UsageCost": "Free",
    "AddressInfo": {
        "ID": 19451,
        "Title": " Limerick Nissan (Pat Tiernan Motors)",
        "AddressLine1": "Delta Retail Park",
        "AddressLine2": "Ballysimon Road",
        "Town": "Limerick",
        "StateOrProvince": "",
        "Postcode": "",
        "CountryID": 3,
        "Latitude": 52.6473078,
        "Longitude": -8.583394699999985,
        "ContactTelephone1": "(061) 402000",
        "ContactTelephone2": "",
        "ContactEmail": "info@limericknissan.ie",
        "AccessComments": "",
        "RelatedURL": "http://www.limericknissan.ie/",
        "DistanceUnit": 0
    },
    "Connections": [
        {
            "ID": 19347,
            "ConnectionTypeID": 2,
            "StatusTypeID": 50,
            "LevelID": 3,
            "Amps": 100,
            "Voltage": 230,
            "PowerKW": 50,
            "CurrentTypeID": 30,
            "Quantity": 1
        }
    ],
    "NumberOfPoints": 1,
    "GeneralComments": "",
    "StatusTypeID": 50,
    "DateLastStatusUpdate": "2013-09-11T20:42:00Z",
    "DataQualityLevel": 1,
    "DateCreated": "2013-09-11T10:44:00Z",
    "SubmissionStatusTypeID": 200
}