{
    "IsRecentlyVerified": false,
    "ID": 183245,
    "UUID": "C5234308-D638-4868-9180-6F06326599C0",
    "DataProviderID": 29,
    "DataProvidersReference": "19022",
    "OperatorID": 45,
    "AddressInfo": {
        "ID": 183604,
        "Title": "Görschlitzer Str. 8",
        "AddressLine1": "Görschlitzer Str. 8",
        "Town": "Bad Düben",
        "Postcode": "04849",
        "CountryID": 87,
        "Latitude": 51.589606,
        "Longitude": 12.604307,
        "DistanceUnit": 0
    },
    "Connections": [
        {
            "ID": 289991,
            "ConnectionTypeID": 33,
            "StatusTypeID": 50,
            "LevelID": 3,
            "PowerKW": 22,
            "CurrentTypeID": 30
        },
        {
            "ID": 289992,
            "ConnectionTypeID": 25,
            "StatusTypeID": 50,
            "LevelID": 2,
            "PowerKW": 11,
            "CurrentTypeID": 20
        }
    ],
    "StatusTypeID": 50,
    "DateLastStatusUpdate": "2021-07-09T03:24:00Z",
    "MetadataValues": [
        {
            "ID": 15538,
            "MetadataFieldID": 4,
            "ItemValue": "Data from the German chargepoint registry provided by Bundesnetzagentur.de under the CC-BY 4.0 license"
        }
    ],
    "DataQualityLevel": 3,
    "DateCreated": "2021-07-08T10:03:00Z",
    "SubmissionStatusTypeID": 100
}