{
    "IsRecentlyVerified": false,
    "ID": 46573,
    "UUID": "65621E3F-E84E-4A72-9448-FDF388EC5311",
    "DataProviderID": 1,
    "DataProvidersReference": "765",
    "AddressInfo": {
        "ID": 46919,
        "Title": "Vinstra vgs",
        "AddressLine1": "Gamle Skåbuvegen 10",
        "Town": "VINSTRA",
        "StateOrProvince": "Innlandet",
        "Postcode": "2640",
        "CountryID": 168,
        "Latitude": 61.59777,
        "Longitude": 9.73349,
        "AccessComments": "På parkeringsområdet bak skulen.",
        "DistanceUnit": 0
    },
    "Connections": [
        {
            "ID": 57236,
            "ConnectionTypeID": 0,
            "Reference": "1",
            "LevelID": 2,
            "Amps": 16,
            "Voltage": 230,
            "PowerKW": 3.7,
            "Comments": "Mode 1"
        },
        {
            "ID": 87185,
            "ConnectionTypeID": 0,
            "Reference": "2",
            "LevelID": 2,
            "Amps": 16,
            "Voltage": 230,
            "PowerKW": 3.7,
            "Comments": "Mode 1"
        },
        {
            "ID": 87186,
            "ConnectionTypeID": 0,
            "Reference": "3",
            "LevelID": 2,
            "Amps": 16,
            "Voltage": 230,
            "PowerKW": 3.7,
            "Comments": "Mode 1"
        },
        {
            "ID": 89239,
            "ConnectionTypeID": 0,
            "Reference": "4",
            "LevelID": 2,
            "Amps": 16,
            "Voltage": 230,
            "PowerKW": 3.7,
            "Comments": "Mode 1"
        }
    ],
    "NumberOfPoints": 4,
    "DateLastStatusUpdate": "2020-05-26T08:24:00Z",
    "DataQualityLevel": 2,
    "DateCreated": "2015-05-03T00:54:00Z",
    "SubmissionStatusTypeID": 100
}