{
    "IsRecentlyVerified": false,
    "ID": 79769,
    "UUID": "ED97B3F2-3073-4349-9752-74317BD5F428",
    "DataProviderID": 1,
    "OperatorID": 23,
    "OperatorsReference": "38752",
    "UsageTypeID": 4,
    "UsageCost": "Free",
    "AddressInfo": {
        "ID": 80115,
        "Title": "Mote Marine Laboratory & Aquarium",
        "AddressLine1": "1600 Ken Thompson Pkwy",
        "Town": "Sarasota",
        "StateOrProvince": "FL",
        "Postcode": "34236",
        "CountryID": 2,
        "Latitude": 27.332824,
        "Longitude": -82.576708,
        "ContactTelephone1": "(941) 388-4441",
        "DistanceUnit": 0
    },
    "Connections": [
        {
            "ID": 114416,
            "ConnectionTypeID": 30,
            "StatusTypeID": 50,
            "LevelID": 2,
            "PowerKW": 8,
            "CurrentTypeID": 10,
            "Quantity": 1
        }
    ],
    "NumberOfPoints": 1,
    "GeneralComments": "1 Tesla Connector, up to 8kW.Available to the public. Self park.",
    "StatusTypeID": 50,
    "DateLastStatusUpdate": "2018-01-21T17:04:00Z",
    "DataQualityLevel": 1,
    "DateCreated": "2017-01-30T13:09:00Z",
    "SubmissionStatusTypeID": 200
}