{
    "IsRecentlyVerified": false,
    "ID": 31706,
    "UUID": "AA5616F4-DEB6-4F6D-8CE2-27C278DAF112",
    "DataProviderID": 1,
    "OperatorID": 156,
    "OperatorsReference": "NewMotion 02010493",
    "UsageTypeID": 4,
    "AddressInfo": {
        "ID": 32052,
        "Title": "Auto Gruber",
        "AddressLine1": "Kopernikus Straße  23",
        "Town": "Dachau",
        "Postcode": "85221",
        "CountryID": 87,
        "Latitude": 48.2573738098144,
        "Longitude": 11.4746170043945,
        "ContactTelephone1": "+49 8131 321717",
        "RelatedURL": "http://www.auto-gruber-dachau.de/",
        "DistanceUnit": 0
    },
    "Connections": [
        {
            "ID": 35217,
            "ConnectionTypeID": 25,
            "StatusTypeID": 50,
            "LevelID": 2,
            "Amps": 16,
            "Voltage": 230,
            "PowerKW": 3.7,
            "CurrentTypeID": 10,
            "Quantity": 1
        }
    ],
    "NumberOfPoints": 1,
    "StatusTypeID": 50,
    "DateLastStatusUpdate": "2017-04-21T19:58:00Z",
    "DataQualityLevel": 3,
    "DateCreated": "2015-01-09T06:03:00Z",
    "SubmissionStatusTypeID": 200
}