{
    "UserComments": [
        {
            "ID": 4494,
            "ChargePointID": 47217,
            "CommentTypeID": 10,
            "UserName": "tibor.antaloczy",
            "DateCreated": "2015-05-19T07:55:59.677Z",
            "User": {
                "ID": 4438,
                "Username": "tibor.antaloczy"
            },
            "CheckinStatusTypeID": 140
        }
    ],
    "MediaItems": [
        {
            "ID": 1437,
            "ChargePointID": 47217,
            "ItemURL": "https://s3-ap-southeast-2.amazonaws.com/openchargemap/images/HU/OCM47217/OCM-47217.orig.2015051907552114.jpg",
            "ItemThumbnailURL": "https://s3-ap-southeast-2.amazonaws.com/openchargemap/images/HU/OCM47217/OCM-47217.thmb.2015051907552114.jpg",
            "Comment": "Only for Volkswagen and Audi owners.",
            "IsEnabled": true,
            "IsVideo": false,
            "IsFeaturedItem": false,
            "IsExternalResource": false,
            "User": {
                "ID": 4438,
                "Username": "tibor.antaloczy"
            },
            "DateCreated": "2015-05-19T07:56:00Z"
        }
    ],
    "IsRecentlyVerified": false,
    "ID": 47217,
    "UUID": "F080C66F-E908-418D-BA96-8B8D4476A8EA",
    "DataProviderID": 1,
    "OperatorID": 45,
    "UsageTypeID": 6,
    "UsageCost": "free",
    "AddressInfo": {
        "ID": 47563,
        "Title": "Budapest, Volkswagen dealership",
        "AddressLine1": "Fáy utca 27.",
        "Town": "Budapest",
        "Postcode": "1139",
        "CountryID": 104,
        "Latitude": 47.5362895860651,
        "Longitude": 19.077456232016,
        "AccessComments": "A Porsche Hungária központi kapuján keresztül a Fáy utcából. Munkanapokon reggel 7 és este 7 között használható. / Through the main gate of the Porsche Hungária center from Fáy street. Open on working days between 7 am and 7 pm.",
        "DistanceUnit": 0
    },
    "Connections": [
        {
            "ID": 58203,
            "ConnectionTypeID": 25,
            "StatusTypeID": 50,
            "LevelID": 2,
            "Amps": 32,
            "Voltage": 400,
            "PowerKW": 22,
            "CurrentTypeID": 20,
            "Quantity": 2
        }
    ],
    "NumberOfPoints": 2,
    "GeneralComments": "Csak Volkswagen és Audi villanyautók és plug-in hibridek számára elérhető.  / Charging is only available for Volkswagen and Audi EV and PHEV owners.",
    "StatusTypeID": 50,
    "DateLastStatusUpdate": "2016-12-27T18:34:00Z",
    "DataQualityLevel": 1,
    "DateCreated": "2015-05-19T07:55:00Z",
    "SubmissionStatusTypeID": 200
}