{
    "IsRecentlyVerified": false,
    "ID": 158446,
    "UUID": "A770E0DA-1F9C-48E7-A647-CCC7F49E8349",
    "DataProviderID": 2,
    "DataProvidersReference": "154162",
    "OperatorID": 5,
    "UsageTypeID": 1,
    "AddressInfo": {
        "ID": 158803,
        "Title": "PINAL COUNTY",
        "AddressLine1": "Jason Lopez Cir",
        "Town": "Florence",
        "StateOrProvince": "AZ",
        "Postcode": "85132",
        "CountryID": 2,
        "Latitude": 33.0416024,
        "Longitude": -111.3772315,
        "ContactTelephone1": "888-758-4389",
        "AccessComments": "24 hours daily",
        "RelatedURL": "http://www.chargepoint.com/",
        "DistanceUnit": 0
    },
    "Connections": [
        {
            "ID": 228429,
            "ConnectionTypeID": 1,
            "LevelID": 2,
            "Amps": 16,
            "Voltage": 230,
            "PowerKW": 3.7,
            "CurrentTypeID": 10,
            "Quantity": 4
        }
    ],
    "StatusTypeID": 50,
    "DateLastStatusUpdate": "2020-06-26T02:55:00Z",
    "DataQualityLevel": 3,
    "DateCreated": "2020-06-26T02:55:00Z",
    "SubmissionStatusTypeID": 100
}