{
    "UserComments": [
        {
            "ID": 6290,
            "ChargePointID": 47760,
            "CommentTypeID": 1000,
            "UserName": "earlscroft",
            "Comment": "All three units showed a red light - 'out of operation'. Staff had no knowledge of fault and said I was the first customer ever to ask for a charging token.",
            "Rating": 4,
            "DateCreated": "2015-08-24T07:57:55.453Z",
            "User": {
                "ID": 6268,
                "Username": "earlscroft"
            },
            "CheckinStatusTypeID": 25
        }
    ],
    "IsRecentlyVerified": false,
    "ID": 47760,
    "UUID": "32139698-C298-4850-BED6-F6822345CBE7",
    "DataProviderID": 1,
    "OperatorID": 45,
    "UsageTypeID": 5,
    "UsageCost": "50p per 30min",
    "AddressInfo": {
        "ID": 48106,
        "Title": "Shell Garage",
        "AddressLine1": "Bollingbrook Way",
        "Town": "Louth",
        "StateOrProvince": "Lincolnshire",
        "Postcode": "LN11 0WA",
        "CountryID": 1,
        "Latitude": 53.3826709158281,
        "Longitude": -0.0126143772765719,
        "ContactTelephone1": "01507601358",
        "AccessComments": "Attached to garage shop on opposite side to garage forecourt entrance",
        "RelatedURL": "http://www.shell.co.uk/motoris/station-locator.html",
        "DistanceUnit": 0
    },
    "Connections": [
        {
            "ID": 58888,
            "ConnectionTypeID": 25,
            "StatusTypeID": 50,
            "LevelID": 2,
            "Amps": 32,
            "Voltage": 230,
            "PowerKW": 7.2,
            "CurrentTypeID": 10,
            "Quantity": 3
        }
    ],
    "NumberOfPoints": 3,
    "GeneralComments": "Purchase 30min tokens in garage shop and pay as you charge.",
    "StatusTypeID": 50,
    "DateLastStatusUpdate": "2015-08-24T07:58:00Z",
    "DataQualityLevel": 1,
    "DateCreated": "2015-06-09T08:50:00Z",
    "SubmissionStatusTypeID": 200
}