{
    "IsRecentlyVerified": false,
    "ID": 150341,
    "UUID": "4F2727FF-2C55-4186-AE11-379F93CA907B",
    "DataProviderID": 28,
    "DataProvidersReference": "FR*S83*P83070*A",
    "UsageTypeID": 5,
    "AddressInfo": {
        "ID": 150694,
        "Title": "LE LAVANDOU_Boulevard Des Acacias",
        "AddressLine1": "Boulevard Des Acacias 83980 LE LAVANDOU",
        "CountryID": 80,
        "Latitude": 43.152094,
        "Longitude": 6.425536,
        "AccessComments": "24/24 7/7 jours",
        "DistanceUnit": 0
    },
    "Connections": [
        {
            "ID": 208948,
            "ConnectionTypeID": 28,
            "StatusTypeID": 50,
            "LevelID": 2,
            "PowerKW": 22,
            "CurrentTypeID": 10
        },
        {
            "ID": 208949,
            "ConnectionTypeID": 1036,
            "StatusTypeID": 50,
            "LevelID": 2,
            "PowerKW": 22,
            "CurrentTypeID": 20
        },
        {
            "ID": 237599,
            "ConnectionTypeID": 28,
            "StatusTypeID": 50,
            "LevelID": 2,
            "PowerKW": 22,
            "CurrentTypeID": 10
        },
        {
            "ID": 237600,
            "ConnectionTypeID": 1036,
            "StatusTypeID": 50,
            "LevelID": 2,
            "PowerKW": 22,
            "CurrentTypeID": 20
        }
    ],
    "GeneralComments": "",
    "StatusTypeID": 50,
    "DateLastStatusUpdate": "2020-08-27T05:10:00Z",
    "DataQualityLevel": 2,
    "DateCreated": "2020-03-15T06:17:00Z",
    "SubmissionStatusTypeID": 100
}