{
    "IsRecentlyVerified": false,
    "ID": 160720,
    "UUID": "5775D154-4BEF-40D9-BEC6-605687DDDA73",
    "DataProviderID": 2,
    "DataProvidersReference": "152309",
    "OperatorID": 89,
    "UsageTypeID": 1,
    "AddressInfo": {
        "ID": 161077,
        "Title": "Kimberley Aquatic Centre Parking Lot",
        "AddressLine1": "520 Archibald Street",
        "Town": "Kimberley",
        "StateOrProvince": "BC",
        "Postcode": "V1A 1E4",
        "CountryID": 44,
        "Latitude": 49.674467,
        "Longitude": -115.977188,
        "ContactTelephone1": "888-356-8911",
        "AccessComments": "24 hours daily",
        "RelatedURL": "https://flo.ca/",
        "DistanceUnit": 0
    },
    "Connections": [
        {
            "ID": 231281,
            "ConnectionTypeID": 1,
            "LevelID": 2,
            "Amps": 16,
            "Voltage": 230,
            "PowerKW": 3.7,
            "CurrentTypeID": 10,
            "Quantity": 1
        }
    ],
    "StatusTypeID": 50,
    "DateLastStatusUpdate": "2020-06-26T03:12:00Z",
    "DataQualityLevel": 3,
    "DateCreated": "2020-06-26T03:12:00Z",
    "SubmissionStatusTypeID": 100
}