{
    "IsRecentlyVerified": false,
    "ID": 74448,
    "UUID": "7CD9D3E3-B75E-4EB0-9017-DD0814EB9802",
    "DataProviderID": 2,
    "DataProvidersReference": "79453",
    "UsageTypeID": 1,
    "AddressInfo": {
        "ID": 74794,
        "Title": "University of North Georgia - Dahlonega Campus",
        "AddressLine1": "82 College Cir",
        "Town": "Dahlonega",
        "StateOrProvince": "GA",
        "Postcode": "30597",
        "CountryID": 2,
        "Latitude": 34.529123,
        "Longitude": -83.98662,
        "ContactTelephone1": "404-736-9173",
        "AccessComments": "24 hours daily",
        "RelatedURL": "",
        "DistanceUnit": 0
    },
    "Connections": [
        {
            "ID": 107034,
            "ConnectionTypeID": 1,
            "LevelID": 2,
            "Amps": 16,
            "Voltage": 230,
            "PowerKW": 3,
            "CurrentTypeID": 10,
            "Quantity": 2
        }
    ],
    "DateLastStatusUpdate": "2019-04-06T04:02:00Z",
    "DataQualityLevel": 3,
    "DateCreated": "2016-12-03T00:12:00Z",
    "SubmissionStatusTypeID": 100
}