{
    "MediaItems": [
        {
            "ID": 17008,
            "ChargePointID": 91098,
            "ItemURL": "https://s3-ap-southeast-2.amazonaws.com/openchargemap/images/GB/OCM91098/OCM-91098.orig.2018111611192380.png",
            "ItemThumbnailURL": "https://s3-ap-southeast-2.amazonaws.com/openchargemap/images/GB/OCM91098/OCM-91098.thmb.2018111611192380.png",
            "Comment": "",
            "IsEnabled": true,
            "IsVideo": false,
            "IsFeaturedItem": false,
            "IsExternalResource": false,
            "User": {
                "ID": 18890,
                "Username": "Terry IoW"
            },
            "DateCreated": "2018-11-16T11:20:00Z"
        }
    ],
    "IsRecentlyVerified": false,
    "ID": 91098,
    "UUID": "E6DA9B1D-F58E-40C8-8D71-3FBB4B61C24E",
    "DataProviderID": 1,
    "OperatorID": 3,
    "OperatorsReference": "PG-81175,PG-81176",
    "UsageTypeID": 4,
    "UsageCost": "Free",
    "AddressInfo": {
        "ID": 91444,
        "Title": "Sainsbury's Badger Farm",
        "AddressLine1": "Meadow Way",
        "AddressLine2": "Badger Farm",
        "Town": "Winchester",
        "StateOrProvince": "Hampshire",
        "Postcode": "SO22 4LY",
        "CountryID": 1,
        "Latitude": 51.0461192730253,
        "Longitude": -1.34177235120386,
        "DistanceUnit": 0
    },
    "Connections": [
        {
            "ID": 129173,
            "ConnectionTypeID": 25,
            "StatusTypeID": 50,
            "LevelID": 2,
            "Amps": 32,
            "Voltage": 400,
            "PowerKW": 22,
            "CurrentTypeID": 20,
            "Quantity": 4
        }
    ],
    "NumberOfPoints": 4,
    "GeneralComments": "This is an open charge unit installed at the Sainsbury's Badger Farm superstore in Badger Farm Road, Winchester",
    "StatusTypeID": 50,
    "DateLastStatusUpdate": "2018-11-16T15:40:00Z",
    "DataQualityLevel": 1,
    "DateCreated": "2017-07-29T05:18:00Z",
    "SubmissionStatusTypeID": 200
}