{
    "IsRecentlyVerified": false,
    "ID": 47453,
    "UUID": "217DA481-FDB8-44FE-922C-A432758BCECC",
    "DataProviderID": 1,
    "OperatorID": 23,
    "OperatorsReference": "9289",
    "UsageTypeID": 7,
    "UsageCost": "Free",
    "AddressInfo": {
        "ID": 47799,
        "Title": "Swift House Inn",
        "AddressLine1": "25 Steward Ln",
        "Town": "Middlebury",
        "StateOrProvince": "VT",
        "Postcode": "05753",
        "CountryID": 2,
        "Latitude": 44.0187028,
        "Longitude": -73.1648974,
        "ContactTelephone1": "802-388-9925  877-798-3752",
        "AccessComments": "24 hours daily; for guest use only",
        "RelatedURL": "http://www.teslamotors.com/supercharger",
        "DistanceUnit": 0
    },
    "Connections": [
        {
            "ID": 58494,
            "ConnectionTypeID": 30,
            "StatusTypeID": 50,
            "LevelID": 2,
            "Amps": 16,
            "Voltage": 230,
            "PowerKW": 8,
            "CurrentTypeID": 10,
            "Quantity": 1
        }
    ],
    "NumberOfPoints": 1,
    "StatusTypeID": 50,
    "DateLastStatusUpdate": "2017-01-26T20:17:00Z",
    "DataQualityLevel": 3,
    "DateCreated": "2015-05-27T08:51:00Z",
    "SubmissionStatusTypeID": 100
}