{
    "IsRecentlyVerified": false,
    "ID": 175623,
    "UUID": "85E1DCFD-A647-4407-BCAD-0F7CDF783E2A",
    "DataProviderID": 1,
    "OperatorID": 74,
    "UsageTypeID": 5,
    "UsageCost": "",
    "AddressInfo": {
        "ID": 175982,
        "Title": "Angel of the North",
        "AddressLine1": "Durham Road",
        "Town": "Gateshead",
        "StateOrProvince": "England",
        "Postcode": "NE9 7UB",
        "CountryID": 1,
        "Latitude": 54.91543513355222,
        "Longitude": -1.5889915272223334,
        "DistanceUnit": 0
    },
    "Connections": [
        {
            "ID": 272683,
            "ConnectionTypeID": 33,
            "StatusTypeID": 150,
            "LevelID": 3,
            "PowerKW": 175,
            "CurrentTypeID": 30,
            "Quantity": 2
        },
        {
            "ID": 272684,
            "ConnectionTypeID": 2,
            "StatusTypeID": 150,
            "LevelID": 3,
            "PowerKW": 100,
            "CurrentTypeID": 30,
            "Quantity": 2
        }
    ],
    "NumberOfPoints": 2,
    "StatusTypeID": 150,
    "DateLastStatusUpdate": "2021-06-02T17:09:00Z",
    "DataQualityLevel": 1,
    "DateCreated": "2021-06-02T17:05:00Z",
    "SubmissionStatusTypeID": 200
}