{
    "IsRecentlyVerified": false,
    "ID": 180775,
    "UUID": "A62BD74D-25B0-45D1-B98F-D1B442C1066F",
    "DataProviderID": 29,
    "DataProvidersReference": "14912",
    "OperatorID": 69,
    "AddressInfo": {
        "ID": 181134,
        "Title": "Löberstraße 19",
        "AddressLine1": "Löberstraße 19",
        "Town": "Erfurt",
        "Postcode": "99084",
        "CountryID": 87,
        "Latitude": 50.970915,
        "Longitude": 11.031094,
        "DistanceUnit": 0
    },
    "Connections": [
        {
            "ID": 284284,
            "ConnectionTypeID": 25,
            "StatusTypeID": 50,
            "LevelID": 2,
            "PowerKW": 22,
            "CurrentTypeID": 20
        },
        {
            "ID": 284285,
            "ConnectionTypeID": 25,
            "StatusTypeID": 50,
            "LevelID": 2,
            "PowerKW": 22,
            "CurrentTypeID": 20
        }
    ],
    "StatusTypeID": 50,
    "DateLastStatusUpdate": "2021-07-12T02:46:00Z",
    "MetadataValues": [
        {
            "ID": 13069,
            "MetadataFieldID": 4,
            "ItemValue": "Data from the German chargepoint registry provided by Bundesnetzagentur.de under the CC-BY 4.0 license"
        }
    ],
    "DataQualityLevel": 3,
    "DateCreated": "2021-07-08T10:01:00Z",
    "SubmissionStatusTypeID": 100
}