{
    "IsRecentlyVerified": false,
    "ID": 171659,
    "UUID": "CF52E997-DF86-4951-B540-B68D7C3FB56A",
    "DataProviderID": 1,
    "OperatorID": 1,
    "UsageTypeID": 4,
    "AddressInfo": {
        "ID": 172018,
        "Title": "Total Atlantis Larache",
        "AddressLine1": "Autoroute du Nord",
        "Town": "Laouamra العوامرة",
        "StateOrProvince": "Tangier-Tetouan-Al Hoceima",
        "Postcode": "",
        "CountryID": 153,
        "Latitude": 35.170874518323316,
        "Longitude": -6.1220614289923105,
        "DistanceUnit": 0
    },
    "Connections": [
        {
            "ID": 262497,
            "ConnectionTypeID": 25,
            "StatusTypeID": 50,
            "LevelID": 2,
            "Amps": 32,
            "Voltage": 230,
            "PowerKW": 22,
            "CurrentTypeID": 20,
            "Quantity": 1
        }
    ],
    "NumberOfPoints": 1,
    "StatusTypeID": 50,
    "DateLastStatusUpdate": "2021-01-09T03:34:00Z",
    "DataQualityLevel": 1,
    "DateCreated": "2021-01-09T03:34:00Z",
    "SubmissionStatusTypeID": 200
}