{
    "IsRecentlyVerified": false,
    "ID": 171975,
    "UUID": "E4303453-AAD9-4A07-81F5-656E4E216AE4",
    "DataProviderID": 1,
    "OperatorID": 1,
    "UsageTypeID": 1,
    "UsageCost": "free",
    "AddressInfo": {
        "ID": 172334,
        "Title": "PDR Plaza de la Iglesia",
        "AddressLine1": "Plaza de la Iglesia",
        "Town": "Villar del Arzobispo",
        "StateOrProvince": "Valencian Community",
        "Postcode": "",
        "CountryID": 210,
        "Latitude": 39.73071064220841,
        "Longitude": -0.825361263672221,
        "DistanceUnit": 0
    },
    "Connections": [
        {
            "ID": 262828,
            "ConnectionTypeID": 25,
            "StatusTypeID": 50,
            "LevelID": 2,
            "PowerKW": 4.3,
            "Quantity": 1
        }
    ],
    "NumberOfPoints": 2,
    "StatusTypeID": 50,
    "DateLastStatusUpdate": "2021-01-10T12:09:00Z",
    "DataQualityLevel": 1,
    "DateCreated": "2021-01-10T11:42:00Z",
    "SubmissionStatusTypeID": 200
}