{
    "IsRecentlyVerified": false,
    "ID": 44726,
    "UUID": "D58BE343-25D1-4C44-B6C0-7B0107FA8693",
    "DataProviderID": 26,
    "DataProvidersReference": "61194",
    "OperatorID": 180,
    "OperatorsReference": "Alfen RHL08031",
    "UsageCost": "0.00 jaarabonnement",
    "AddressInfo": {
        "ID": 45072,
        "Title": "Zanderijpad",
        "AddressLine1": "Zanderijpad",
        "Town": "Wassenaar",
        "Postcode": "2242 GW",
        "CountryID": 159,
        "Latitude": 52.137034,
        "Longitude": 4.390633,
        "ContactTelephone1": "036 - 549 34 00",
        "RelatedURL": "http://www.icu-charging-stations.com/",
        "DistanceUnit": 0
    },
    "Connections": [
        {
            "ID": 54934,
            "ConnectionTypeID": 25,
            "LevelID": 2,
            "PowerKW": 11,
            "CurrentTypeID": 10
        },
        {
            "ID": 54935,
            "ConnectionTypeID": 25,
            "LevelID": 2,
            "PowerKW": 11,
            "CurrentTypeID": 10
        }
    ],
    "NumberOfPoints": 1,
    "StatusTypeID": 50,
    "DateLastStatusUpdate": "2016-06-04T02:50:00Z",
    "DataQualityLevel": 3,
    "DateCreated": "2015-04-18T13:02:00Z",
    "SubmissionStatusTypeID": 100
}