{
    "IsRecentlyVerified": false,
    "ID": 101250,
    "UUID": "564CC042-93E8-4653-9BFD-1E5B86CE41A2",
    "DataProviderID": 1,
    "OperatorID": 164,
    "UsageTypeID": 4,
    "AddressInfo": {
        "ID": 101596,
        "Title": "Fié allo Sciliar | Neogy",
        "AddressLine1": "Via del Paese",
        "Town": "Fié allo Sciliar",
        "StateOrProvince": "BZ",
        "Postcode": "39050 ",
        "CountryID": 112,
        "Latitude": 46.5186164208387,
        "Longitude": 11.5029784054044,
        "DistanceUnit": 0
    },
    "Connections": [
        {
            "ID": 142934,
            "ConnectionTypeID": 25,
            "StatusTypeID": 50,
            "LevelID": 2,
            "Amps": 32,
            "Voltage": 400,
            "PowerKW": 22,
            "CurrentTypeID": 20,
            "Quantity": 2
        }
    ],
    "NumberOfPoints": 2,
    "StatusTypeID": 50,
    "DateLastStatusUpdate": "2019-07-14T17:07:00Z",
    "DataQualityLevel": 1,
    "DateCreated": "2018-03-22T13:40:00Z",
    "SubmissionStatusTypeID": 200
}