{
    "IsRecentlyVerified": false,
    "ID": 144969,
    "UUID": "781C041B-7266-454B-9CD7-14ACDF538B39",
    "DataProviderID": 2,
    "DataProvidersReference": "131015",
    "OperatorID": 90,
    "UsageTypeID": 1,
    "AddressInfo": {
        "ID": 145321,
        "Title": "Ville de Notre-Dame-des-Prairies - Curé-Rondeau",
        "AddressLine1": "171 rue Curé-Rondeau",
        "Town": "Notre-Dame-des-Prairies",
        "StateOrProvince": "QC",
        "Postcode": "J6E 1H2",
        "CountryID": 44,
        "Latitude": 46.041694,
        "Longitude": -73.433176,
        "ContactTelephone1": "877-505-2674",
        "AccessComments": "24 hours daily",
        "RelatedURL": "https://lecircuitelectrique.com/",
        "DistanceUnit": 0
    },
    "Connections": [
        {
            "ID": 201534,
            "ConnectionTypeID": 1,
            "LevelID": 2,
            "Amps": 16,
            "Voltage": 230,
            "PowerKW": 3.7,
            "CurrentTypeID": 10,
            "Quantity": 2
        }
    ],
    "StatusTypeID": 50,
    "DateLastStatusUpdate": "2020-06-26T03:10:00Z",
    "DataQualityLevel": 3,
    "DateCreated": "2019-12-24T09:24:00Z",
    "SubmissionStatusTypeID": 100
}