{
    "IsRecentlyVerified": false,
    "ID": 158313,
    "UUID": "8899922A-0326-4C4A-91C1-0FCD2A4ED3E3",
    "DataProviderID": 2,
    "DataProvidersReference": "153797",
    "OperatorID": 3293,
    "UsageTypeID": 1,
    "AddressInfo": {
        "ID": 158667,
        "Title": "Pearl Midtown",
        "AddressLine1": "515 Elgin St",
        "Town": "Houston",
        "StateOrProvince": "TX",
        "Postcode": "77006",
        "CountryID": 2,
        "Latitude": 29.744288,
        "Longitude": -95.380189,
        "ContactTelephone1": "888-264-2208",
        "AccessComments": "6am-12am",
        "RelatedURL": "https://voltacharging.com/",
        "DistanceUnit": 0
    },
    "Connections": [
        {
            "ID": 228277,
            "ConnectionTypeID": 1,
            "LevelID": 2,
            "Amps": 16,
            "Voltage": 230,
            "PowerKW": 3.7,
            "CurrentTypeID": 10,
            "Quantity": 2
        }
    ],
    "StatusTypeID": 50,
    "DateLastStatusUpdate": "2020-06-26T02:53:00Z",
    "DataQualityLevel": 3,
    "DateCreated": "2020-06-26T02:53:00Z",
    "SubmissionStatusTypeID": 100
}