{
    "IsRecentlyVerified": false,
    "ID": 95238,
    "UUID": "A84087E2-440A-43FF-AB45-69409853A96B",
    "DataProviderID": 1,
    "OperatorID": 23,
    "OperatorsReference": "37245",
    "UsageTypeID": 4,
    "AddressInfo": {
        "ID": 95584,
        "Title": "Central Parking Malpensa",
        "AddressLine1": "Via Luigi Bailo",
        "Town": "11",
        "StateOrProvince": "Somma Lombardo",
        "Postcode": "21019",
        "CountryID": 112,
        "Latitude": 45.643703,
        "Longitude": 8.706916,
        "ContactTelephone1": "+39 0331 231 396",
        "DistanceUnit": 0
    },
    "Connections": [
        {
            "ID": 134906,
            "ConnectionTypeID": 30,
            "StatusTypeID": 50,
            "LevelID": 2,
            "Amps": 32,
            "Voltage": 400,
            "PowerKW": 22,
            "CurrentTypeID": 20,
            "Quantity": 1
        }
    ],
    "NumberOfPoints": 1,
    "GeneralComments": "1 Tesla Connector, up to 22kW.Available for customers. Please see front desk.",
    "StatusTypeID": 50,
    "DateLastStatusUpdate": "2018-10-03T22:34:00Z",
    "DataQualityLevel": 1,
    "DateCreated": "2017-11-05T07:00:00Z",
    "SubmissionStatusTypeID": 200
}