{
    "IsRecentlyVerified": false,
    "ID": 112708,
    "UUID": "3042ACDD-DBE9-4162-AD17-91BD4DEAAB7D",
    "DataProviderID": 1,
    "OperatorID": 3295,
    "OperatorsReference": "UKEV0924,UKEV0925",
    "UsageTypeID": 5,
    "UsageCost": "£1.20/hour",
    "AddressInfo": {
        "ID": 113054,
        "Title": "Tesco Car Park (outside Holywell Town Council Offices)",
        "AddressLine1": "Bank Place Offices",
        "AddressLine2": "Holywell",
        "Town": "Flintshire",
        "StateOrProvince": "Flintshire",
        "Postcode": "CH8 7TJ",
        "CountryID": 1,
        "Latitude": 53.2743124650387,
        "Longitude": -3.22090181957401,
        "ContactTelephone1": "01352711757",
        "ContactTelephone2": "01352711757",
        "ContactEmail": "support.officer@holywell.wales",
        "RelatedURL": "https://holywell-town.gov.uk",
        "DistanceUnit": 0
    },
    "Connections": [
        {
            "ID": 158699,
            "ConnectionTypeID": 25,
            "StatusTypeID": 50,
            "LevelID": 2,
            "Amps": 32,
            "Voltage": 230,
            "PowerKW": 7.2,
            "CurrentTypeID": 10,
            "Quantity": 2
        }
    ],
    "NumberOfPoints": 2,
    "GeneralComments": "Non-profit chargers installed to encourage electric car owners to use this facility whilst using the town of Holywell",
    "StatusTypeID": 50,
    "DateLastStatusUpdate": "2018-11-12T16:08:00Z",
    "DataQualityLevel": 1,
    "DateCreated": "2018-11-12T11:48:00Z",
    "SubmissionStatusTypeID": 200
}