{
    "IsRecentlyVerified": false,
    "ID": 175854,
    "UUID": "04214B96-DE42-4B27-9129-FF90E851CF1D",
    "DataProviderID": 1,
    "OperatorID": 214,
    "UsageTypeID": 4,
    "AddressInfo": {
        "ID": 176213,
        "Title": "be emobil Sophienstraße",
        "AddressLine1": "9 Sophienstraße",
        "Town": "Berlin",
        "StateOrProvince": "Berlin",
        "Postcode": "12203",
        "CountryID": 87,
        "Latitude": 52.44266158893359,
        "Longitude": 13.302928682440324,
        "DistanceUnit": 0
    },
    "Connections": [
        {
            "ID": 273086,
            "ConnectionTypeID": 25,
            "StatusTypeID": 50,
            "LevelID": 2,
            "Amps": 16,
            "Voltage": 400,
            "PowerKW": 11,
            "CurrentTypeID": 20,
            "Quantity": 2
        }
    ],
    "NumberOfPoints": 2,
    "StatusTypeID": 50,
    "DateLastStatusUpdate": "2021-06-19T17:53:00Z",
    "DataQualityLevel": 1,
    "DateCreated": "2021-06-16T17:47:00Z",
    "SubmissionStatusTypeID": 200
}