{
    "IsRecentlyVerified": false,
    "ID": 163040,
    "UUID": "3E171172-E91F-40E6-90EF-F164D017E347",
    "DataProviderID": 1,
    "OperatorID": 136,
    "UsageTypeID": 4,
    "UsageCost": "0,22/min",
    "AddressInfo": {
        "ID": 163397,
        "Title": "Kummunkatu",
        "AddressLine1": "Kummunkatu 11",
        "Town": "Outokumpu",
        "StateOrProvince": "Eastern Finland",
        "Postcode": "83500",
        "CountryID": 79,
        "Latitude": 62.726955097260856,
        "Longitude": 29.013390034715485,
        "AccessComments": "On the middle of the main street of Outokumpu. Between two markets (S and K). Next to pizzeria La Milano. Nearby more restaurants, hotel/b&b, mining museum etc",
        "DistanceUnit": 0
    },
    "Connections": [
        {
            "ID": 234596,
            "ConnectionTypeID": 33,
            "StatusTypeID": 50,
            "LevelID": 3,
            "PowerKW": 50,
            "CurrentTypeID": 30,
            "Quantity": 1
        },
        {
            "ID": 234597,
            "ConnectionTypeID": 2,
            "StatusTypeID": 50,
            "LevelID": 3,
            "PowerKW": 50,
            "CurrentTypeID": 30,
            "Quantity": 1
        }
    ],
    "NumberOfPoints": 1,
    "StatusTypeID": 50,
    "DateLastStatusUpdate": "2020-08-21T07:21:00Z",
    "DataQualityLevel": 1,
    "DateCreated": "2020-08-19T21:13:00Z",
    "SubmissionStatusTypeID": 200
}