{
    "IsRecentlyVerified": false,
    "ID": 186542,
    "UUID": "CAEB9AB6-379C-4AFB-91F0-C57BB1366DE7",
    "DataProviderID": 29,
    "DataProvidersReference": "21239",
    "AddressInfo": {
        "ID": 186901,
        "Title": "Nordwall 3",
        "AddressLine1": "Nordwall 3",
        "Town": "Beckum",
        "Postcode": "59269",
        "CountryID": 87,
        "Latitude": 51.4525,
        "Longitude": 8.0222,
        "DistanceUnit": 0
    },
    "Connections": [
        {
            "ID": 299424,
            "ConnectionTypeID": 25,
            "StatusTypeID": 50,
            "LevelID": 2,
            "PowerKW": 22,
            "CurrentTypeID": 20
        },
        {
            "ID": 299425,
            "ConnectionTypeID": 25,
            "StatusTypeID": 50,
            "LevelID": 2,
            "PowerKW": 22,
            "CurrentTypeID": 20
        }
    ],
    "StatusTypeID": 50,
    "DateLastStatusUpdate": "2021-07-12T02:47:00Z",
    "MetadataValues": [
        {
            "ID": 18783,
            "MetadataFieldID": 4,
            "ItemValue": "Data from the German chargepoint registry provided by Bundesnetzagentur.de under the CC-BY 4.0 license"
        }
    ],
    "DataQualityLevel": 3,
    "DateCreated": "2021-07-12T02:47:00Z",
    "SubmissionStatusTypeID": 100
}