{
    "IsRecentlyVerified": false,
    "ID": 40741,
    "UUID": "A568888F-9732-4226-81E7-D46A9D7425D7",
    "DataProviderID": 1,
    "OperatorID": 69,
    "UsageTypeID": 1,
    "UsageCost": "free",
    "AddressInfo": {
        "ID": 41087,
        "Title": "Alte Eppelheimer Straße",
        "AddressLine1": "Alte Eppelheimer Straße",
        "AddressLine2": "Bergheim",
        "Town": "Heidelberg",
        "StateOrProvince": "Heidelberg",
        "Postcode": "69115",
        "CountryID": 87,
        "Latitude": 49.406193018304,
        "Longitude": 8.68112211380003,
        "AccessComments": "accessible 24 hours 7 days a week",
        "DistanceUnit": 0
    },
    "Connections": [
        {
            "ID": 44354,
            "ConnectionTypeID": 25,
            "StatusTypeID": 50,
            "LevelID": 2,
            "CurrentTypeID": 20
        }
    ],
    "NumberOfPoints": 2,
    "GeneralComments": "2 x Type 2 Mennekes or Schuko F 230V",
    "StatusTypeID": 50,
    "DateLastStatusUpdate": "2015-01-14T20:00:00Z",
    "DataQualityLevel": 1,
    "DateCreated": "2015-01-13T19:35:00Z",
    "SubmissionStatusTypeID": 200
}