{
    "IsRecentlyVerified": false,
    "ID": 157276,
    "UUID": "00568613-31EE-4773-89AC-33A76DD95316",
    "DataProviderID": 19,
    "DataProvidersReference": "5776",
    "AddressInfo": {
        "ID": 157630,
        "Title": "Esso Rønvik",
        "AddressLine1": "Teglverksveien 1",
        "Town": "BODØ",
        "StateOrProvince": "Nordland",
        "Postcode": "8006",
        "CountryID": 168,
        "Latitude": 67.29327,
        "Longitude": 14.40789,
        "AccessComments": "",
        "DistanceUnit": 0
    },
    "Connections": [
        {
            "ID": 226379,
            "ConnectionTypeID": 2,
            "Reference": "1",
            "LevelID": 3,
            "Amps": 100,
            "Voltage": 500,
            "PowerKW": 50,
            "CurrentTypeID": 30,
            "Comments": "Mode 4"
        },
        {
            "ID": 226380,
            "ConnectionTypeID": 33,
            "Reference": "2",
            "LevelID": 3,
            "Amps": 100,
            "Voltage": 500,
            "PowerKW": 50,
            "CurrentTypeID": 30,
            "Comments": "Mode 4"
        },
        {
            "ID": 226381,
            "ConnectionTypeID": 25,
            "Reference": "3",
            "LevelID": 3,
            "Amps": 32,
            "Voltage": 400,
            "PowerKW": 22,
            "CurrentTypeID": 30,
            "Comments": "Mode 3"
        },
        {
            "ID": 226382,
            "ConnectionTypeID": 2,
            "Reference": "4",
            "LevelID": 3,
            "Amps": 100,
            "Voltage": 500,
            "PowerKW": 50,
            "CurrentTypeID": 30,
            "Comments": "Mode 4"
        },
        {
            "ID": 226383,
            "ConnectionTypeID": 33,
            "Reference": "5",
            "LevelID": 3,
            "Amps": 375,
            "Voltage": 400,
            "PowerKW": 150,
            "CurrentTypeID": 30,
            "Comments": "Mode 4"
        },
        {
            "ID": 226384,
            "ConnectionTypeID": 25,
            "Reference": "6",
            "LevelID": 3,
            "Amps": 32,
            "Voltage": 400,
            "PowerKW": 22,
            "CurrentTypeID": 30,
            "Comments": "Mode 3"
        }
    ],
    "NumberOfPoints": 6,
    "StatusTypeID": 0,
    "DateLastStatusUpdate": "2021-03-24T05:12:00Z",
    "DataQualityLevel": 2,
    "DateCreated": "2020-05-26T08:25:00Z",
    "SubmissionStatusTypeID": 100
}