{
    "IsRecentlyVerified": false,
    "ID": 54817,
    "UUID": "9C362931-38DA-467D-B639-BDDF6F450FD4",
    "DataProviderID": 1,
    "OperatorID": 23,
    "OperatorsReference": "11840",
    "UsageTypeID": 1,
    "UsageCost": "$0.22/kWh; other tariffs for older cars",
    "AddressInfo": {
        "ID": 55163,
        "Title": "Village Commons Shopping Center - Tesla",
        "AddressLine1": "3528 Thomasville Rd",
        "Town": "Tallahassee",
        "StateOrProvince": "FL",
        "Postcode": "32308",
        "CountryID": 2,
        "Latitude": 30.510938,
        "Longitude": -84.247131,
        "ContactTelephone1": "877-798-3752",
        "AccessComments": "24 hours daily; for Tesla use only",
        "RelatedURL": "http://www.teslamotors.com/supercharger",
        "DistanceUnit": 0
    },
    "Connections": [
        {
            "ID": 69291,
            "ConnectionTypeID": 27,
            "StatusTypeID": 50,
            "LevelID": 3,
            "Amps": 100,
            "Voltage": 400,
            "PowerKW": 120,
            "CurrentTypeID": 30,
            "Quantity": 6
        }
    ],
    "NumberOfPoints": 6,
    "StatusTypeID": 50,
    "DateLastStatusUpdate": "2018-03-13T13:16:00Z",
    "DataQualityLevel": 3,
    "DateCreated": "2015-10-09T07:24:00Z",
    "SubmissionStatusTypeID": 100
}