{
    "IsRecentlyVerified": false,
    "ID": 31912,
    "UUID": "065209A5-802E-495A-8149-81D88E3521FC",
    "DataProviderID": 26,
    "DataProvidersReference": "30328",
    "OperatorID": 86,
    "OperatorsReference": "EnWB Fichtelbergstraße",
    "UsageCost": "0.00 afhankelijk van pas",
    "AddressInfo": {
        "ID": 32258,
        "Title": "Fichtelbergstraße 36",
        "AddressLine1": "Fichtelbergstraße 36",
        "Town": "Stuttgart",
        "Postcode": "70469",
        "CountryID": 87,
        "Latitude": 48.81581,
        "Longitude": 9.14953,
        "ContactTelephone1": "0800 3629-000",
        "ContactEmail": "-",
        "RelatedURL": "http://www.enbw.com/",
        "DistanceUnit": 0
    },
    "Connections": [
        {
            "ID": 35423,
            "ConnectionTypeID": 25,
            "LevelID": 2,
            "PowerKW": 5,
            "CurrentTypeID": 10
        }
    ],
    "NumberOfPoints": 1,
    "StatusTypeID": 50,
    "DateLastStatusUpdate": "2015-01-09T06:03:00Z",
    "DataQualityLevel": 3,
    "DateCreated": "2015-01-09T06:03:00Z",
    "SubmissionStatusTypeID": 100
}