{
    "IsRecentlyVerified": false,
    "ID": 92890,
    "UUID": "D1821D32-AA15-41D7-BA09-0C98D7671812",
    "DataProviderID": 1,
    "OperatorID": 3,
    "OperatorsReference": "3639,3843",
    "UsageTypeID": 1,
    "UsageCost": "Free to use",
    "AddressInfo": {
        "ID": 93236,
        "Title": "White Rose Shopping Centre",
        "AddressLine1": "White Rose Shopping Centre",
        "Town": "Dewsbury Road",
        "StateOrProvince": "Leeds",
        "Postcode": "LS11 8LU",
        "CountryID": 1,
        "Latitude": 53.757748,
        "Longitude": -1.57529,
        "ContactTelephone1": "44 20 7247 4114",
        "AccessComments": "Use podpoint app to confirm charge",
        "RelatedURL": "https://charge.pod-point.com/",
        "DistanceUnit": 0
    },
    "Connections": [
        {
            "ID": 256174,
            "ConnectionTypeID": 25,
            "StatusTypeID": 50,
            "LevelID": 2,
            "PowerKW": 7,
            "CurrentTypeID": 20,
            "Quantity": 1
        },
        {
            "ID": 256175,
            "ConnectionTypeID": 25,
            "StatusTypeID": 50,
            "LevelID": 2,
            "PowerKW": 7,
            "CurrentTypeID": 20,
            "Quantity": 1
        },
        {
            "ID": 256176,
            "ConnectionTypeID": 25,
            "StatusTypeID": 50,
            "LevelID": 2,
            "PowerKW": 7,
            "CurrentTypeID": 20,
            "Quantity": 1
        },
        {
            "ID": 256177,
            "ConnectionTypeID": 25,
            "StatusTypeID": 50,
            "LevelID": 2,
            "PowerKW": 7,
            "CurrentTypeID": 20,
            "Quantity": 1
        },
        {
            "ID": 256178,
            "ConnectionTypeID": 25,
            "StatusTypeID": 50,
            "LevelID": 2,
            "PowerKW": 7,
            "CurrentTypeID": 20,
            "Quantity": 1
        },
        {
            "ID": 256179,
            "ConnectionTypeID": 25,
            "StatusTypeID": 50,
            "LevelID": 2,
            "PowerKW": 7,
            "CurrentTypeID": 20,
            "Quantity": 1
        }
    ],
    "NumberOfPoints": 6,
    "GeneralComments": "Free To Use: Podpoint Chargers Remember to confirm charge within 15 mins using app otherwise charge will stop automatically after 15 minutes.",
    "StatusTypeID": 50,
    "DateLastStatusUpdate": "2020-10-03T02:44:00Z",
    "DataQualityLevel": 1,
    "DateCreated": "2017-09-13T13:44:00Z",
    "SubmissionStatusTypeID": 200
}