{
    "IsRecentlyVerified": false,
    "ID": 155239,
    "UUID": "159318FB-8EF6-4126-A610-B943DAA25EEC",
    "DataProviderID": 1,
    "OperatorID": 3,
    "OperatorsReference": "PG-84143",
    "UsageTypeID": 4,
    "UsageCost": "£0.22/kWh",
    "AddressInfo": {
        "ID": 155593,
        "Title": "Cofton Country Holidays-Cottages",
        "AddressLine1": "Starcross",
        "Town": "Exeter",
        "Postcode": "EX6 8RP",
        "CountryID": 1,
        "Latitude": 50.613074,
        "Longitude": -3.460541,
        "DistanceUnit": 0
    },
    "Connections": [
        {
            "ID": 218531,
            "ConnectionTypeID": 25,
            "StatusTypeID": 50,
            "LevelID": 2,
            "Amps": 32,
            "Voltage": 230,
            "PowerKW": 7,
            "CurrentTypeID": 10,
            "Quantity": 2
        }
    ],
    "NumberOfPoints": 2,
    "GeneralComments": "This is an open charge unit installed at the Cofton Country Holidays - Cottages site at Starcross, Exeter",
    "StatusTypeID": 50,
    "DateLastStatusUpdate": "2020-05-07T05:41:00Z",
    "DataQualityLevel": 1,
    "DateCreated": "2020-04-02T05:39:00Z",
    "SubmissionStatusTypeID": 200
}