{
    "IsRecentlyVerified": false,
    "ID": 90365,
    "UUID": "9C9DFFA7-FBFC-484C-BA67-FD4FBBD661D4",
    "DataProviderID": 1,
    "OperatorID": 23,
    "OperatorsReference": "31545",
    "UsageTypeID": 6,
    "AddressInfo": {
        "ID": 90711,
        "Title": "Hotel Rauriserhof",
        "AddressLine1": "Marktstrasse 6",
        "Town": "Rauris",
        "Postcode": "5661",
        "CountryID": 19,
        "Latitude": 47.232644,
        "Longitude": 12.993426,
        "ContactTelephone1": "+43 6544 6213",
        "DistanceUnit": 0
    },
    "Connections": [
        {
            "ID": 128018,
            "ConnectionTypeID": 30,
            "StatusTypeID": 50,
            "LevelID": 2,
            "Amps": 16,
            "Voltage": 400,
            "PowerKW": 11,
            "CurrentTypeID": 20,
            "Quantity": 1
        }
    ],
    "NumberOfPoints": 1,
    "GeneralComments": "1 Tesla Connector, up to 11kW.Available for patrons only. Please see front desk.",
    "StatusTypeID": 50,
    "DateLastStatusUpdate": "2018-10-03T15:29:00Z",
    "DataQualityLevel": 1,
    "DateCreated": "2017-07-13T15:00:00Z",
    "SubmissionStatusTypeID": 200
}