{
    "IsRecentlyVerified": false,
    "ID": 29803,
    "UUID": "E50803D3-52C2-4D9F-B249-DEB484342162",
    "DataProviderID": 1,
    "OperatorID": 1,
    "UsageTypeID": 1,
    "AddressInfo": {
        "ID": 30149,
        "Title": "705 East Pete Rose Way",
        "AddressLine1": "705 East Pete Rose Way",
        "Town": "Cincinnati",
        "StateOrProvince": "OH",
        "Postcode": "45202",
        "CountryID": 2,
        "Latitude": 39.101097231021896,
        "Longitude": -84.49979017195335,
        "ContactTelephone1": "",
        "RelatedURL": "http://carstations.com/31219",
        "DistanceUnit": 0
    },
    "Connections": [
        {
            "ID": 32788,
            "ConnectionTypeID": 1,
            "Reference": "J1772",
            "LevelID": 2
        }
    ],
    "NumberOfPoints": 4,
    "StatusTypeID": 50,
    "DateLastStatusUpdate": "2020-08-12T01:15:00Z",
    "DataQualityLevel": 2,
    "DateCreated": "2014-11-29T05:39:00Z",
    "SubmissionStatusTypeID": 100
}