{
    "IsRecentlyVerified": false,
    "ID": 8176,
    "UUID": "61547B86-84FA-4460-A2D1-599CA31F68F3",
    "DataProviderID": 15,
    "DataProvidersReference": "7176",
    "OperatorID": 26,
    "AddressInfo": {
        "ID": 8073,
        "Title": "2327 S Range Line Rd",
        "AddressLine1": "2327 S Range Line Rd",
        "Town": "Joplin",
        "StateOrProvince": "MO",
        "Postcode": "64804",
        "CountryID": 2,
        "Latitude": 37.06473,
        "Longitude": -94.47714,
        "ContactTelephone1": " (417) 781-1177",
        "RelatedURL": "http://carstations.com/7176",
        "DistanceUnit": 0
    },
    "Connections": [
        {
            "ID": 5605,
            "ConnectionTypeID": 1,
            "Reference": "J1772",
            "LevelID": 2
        }
    ],
    "StatusTypeID": 0,
    "DateLastStatusUpdate": "2017-11-04T14:04:00Z",
    "DataQualityLevel": 1,
    "DateCreated": "2011-11-11T12:06:00Z",
    "SubmissionStatusTypeID": 100
}