{
    "IsRecentlyVerified": false,
    "ID": 135657,
    "UUID": "08A65DC5-7761-4791-AA18-CB1ABF2B728B",
    "DataProviderID": 18,
    "DataProvidersReference": "496a5ec6e8bdcb48c714b6f8ed3f9278",
    "OperatorID": 2244,
    "UsageTypeID": 5,
    "AddressInfo": {
        "ID": 136003,
        "Title": "Holmes Road",
        "AddressLine1": "Holmes Road",
        "Town": "Twickenham",
        "Postcode": "TW1 4RE",
        "CountryID": 1,
        "Latitude": 51.441139,
        "Longitude": -0.333711,
        "AccessComments": "",
        "RelatedURL": "https://www.ubitricity.com",
        "DistanceUnit": 0
    },
    "Connections": [
        {
            "ID": 190067,
            "ConnectionTypeID": 25,
            "Reference": "suby1100001528",
            "StatusTypeID": 50,
            "LevelID": 2,
            "Amps": 16,
            "Voltage": 230,
            "PowerKW": 3.7,
            "CurrentTypeID": 10
        }
    ],
    "StatusTypeID": 0,
    "DateLastStatusUpdate": "2021-04-25T05:46:00Z",
    "MetadataValues": [
        {
            "ID": 5509,
            "MetadataFieldID": 4,
            "ItemValue": "Contains public sector information licensed under the Open Government Licence v2.0. http://www.nationalarchives.gov.uk/doc/open-government-licence/version/2/"
        }
    ],
    "DataQualityLevel": 3,
    "DateCreated": "2019-12-24T05:22:00Z",
    "SubmissionStatusTypeID": 100
}