{
    "IsRecentlyVerified": false,
    "ID": 74513,
    "UUID": "8D442E91-D759-4F14-98F1-9C7C673C8DDD",
    "DataProviderID": 2,
    "DataProvidersReference": "79920",
    "OperatorID": 5,
    "UsageTypeID": 1,
    "AddressInfo": {
        "ID": 74859,
        "Title": "COUNTY SONOMA",
        "AddressLine1": "16255 First St",
        "Town": "Guerneville",
        "StateOrProvince": "CA",
        "Postcode": "95446",
        "CountryID": 2,
        "Latitude": 38.5013424,
        "Longitude": -122.9982527,
        "ContactTelephone1": "888-758-4389",
        "AccessComments": "24 hours daily",
        "RelatedURL": "http://www.chargepoint.com/",
        "DistanceUnit": 0
    },
    "Connections": [
        {
            "ID": 107111,
            "ConnectionTypeID": 9,
            "LevelID": 1,
            "Amps": 16,
            "Voltage": 120,
            "PowerKW": 1,
            "CurrentTypeID": 10,
            "Quantity": 1
        },
        {
            "ID": 107112,
            "ConnectionTypeID": 1,
            "LevelID": 2,
            "Amps": 16,
            "Voltage": 230,
            "PowerKW": 3,
            "CurrentTypeID": 10,
            "Quantity": 1
        }
    ],
    "DateLastStatusUpdate": "2019-12-24T09:14:00Z",
    "DataQualityLevel": 3,
    "DateCreated": "2016-12-03T00:12:00Z",
    "SubmissionStatusTypeID": 100
}