{
    "IsRecentlyVerified": false,
    "ID": 28056,
    "UUID": "A52383C0-5D3C-4ECE-AC91-572E798DD900",
    "DataProviderID": 2,
    "DataProvidersReference": "43191",
    "OperatorID": 5,
    "UsageTypeID": 1,
    "AddressInfo": {
        "ID": 28402,
        "Title": "UM PTS",
        "AddressLine1": "622 W Fayette St",
        "Town": "Baltimore",
        "StateOrProvince": "MD",
        "Postcode": "21201",
        "CountryID": 2,
        "Latitude": 39.2907645,
        "Longitude": -76.6243896,
        "ContactTelephone1": "888-758-4389",
        "AccessComments": "24 hours daily",
        "RelatedURL": "http://www.chargepoint.com/",
        "DistanceUnit": 0
    },
    "Connections": [
        {
            "ID": 30826,
            "ConnectionTypeID": 1,
            "LevelID": 2,
            "Amps": 16,
            "Voltage": 230,
            "PowerKW": 3.7,
            "CurrentTypeID": 10,
            "Quantity": 2
        },
        {
            "ID": 30827,
            "ConnectionTypeID": 1,
            "LevelID": 2,
            "Amps": 16,
            "Voltage": 230,
            "PowerKW": 3,
            "CurrentTypeID": 10,
            "Quantity": 3
        }
    ],
    "DateLastStatusUpdate": "2020-06-26T03:01:00Z",
    "DataQualityLevel": 3,
    "DateCreated": "2014-11-28T03:38:00Z",
    "SubmissionStatusTypeID": 100
}