{
    "IsRecentlyVerified": false,
    "ID": 18076,
    "UUID": "2727C48E-C6AD-4C6F-9644-AB4FDA45519A",
    "DataProviderID": 22,
    "DataProvidersReference": "106D6A60386B448F80D401758C203F54",
    "AddressInfo": {
        "ID": 18421,
        "Title": "熊本日産自動車熊本支店",
        "AddressLine1": "熊本県熊本市西区上熊本2-4-15",
        "CountryID": 114,
        "Latitude": 32.81103936,
        "Longitude": 130.6977814,
        "ContactTelephone1": "096-354-0123",
        "DistanceUnit": 0
    },
    "Connections": [
        {
            "ID": 18317,
            "ConnectionTypeID": 2,
            "LevelID": 2,
            "Amps": 100,
            "Voltage": 480,
            "PowerKW": 48,
            "Quantity": 1
        }
    ],
    "DateLastStatusUpdate": "2013-06-29T09:07:00Z",
    "DataQualityLevel": 2,
    "DateCreated": "2013-06-29T09:07:00Z",
    "SubmissionStatusTypeID": 200
}