{
    "IsRecentlyVerified": false,
    "ID": 85720,
    "UUID": "E1628F39-9F82-4B9D-BDDB-573579057700",
    "DataProviderID": 1,
    "OperatorID": 23,
    "OperatorsReference": "26659",
    "UsageTypeID": 6,
    "AddressInfo": {
        "ID": 86066,
        "Title": "Gîte des PRÈS de Garnes",
        "AddressLine1": "30 Rue de la Cour Senlisse",
        "Town": "Senlisse",
        "Postcode": "78720",
        "CountryID": 80,
        "Latitude": 48.688491,
        "Longitude": 1.976781,
        "ContactTelephone1": "+33 6 69 72 21 56",
        "DistanceUnit": 0
    },
    "Connections": [
        {
            "ID": 121861,
            "ConnectionTypeID": 30,
            "StatusTypeID": 50,
            "LevelID": 2,
            "Amps": 32,
            "Voltage": 400,
            "PowerKW": 22,
            "CurrentTypeID": 20,
            "Quantity": 1
        }
    ],
    "NumberOfPoints": 1,
    "GeneralComments": "1 Tesla Connector, up to 22kW.Available for patrons only. Please call ahead.",
    "StatusTypeID": 50,
    "DateLastStatusUpdate": "2018-10-03T22:17:00Z",
    "DataQualityLevel": 1,
    "DateCreated": "2017-04-13T05:45:00Z",
    "SubmissionStatusTypeID": 200
}