{
    "IsRecentlyVerified": false,
    "ID": 100011,
    "UUID": "CB7901F0-A21E-4150-BA30-0C96E3CC34B4",
    "DataProviderID": 1,
    "OperatorID": 23,
    "OperatorsReference": "40554",
    "UsageTypeID": 4,
    "AddressInfo": {
        "ID": 100357,
        "Title": "Springhill Suites By Marriott Napa Valley",
        "AddressLine1": "101 Gateway RD E",
        "Town": "Napa",
        "StateOrProvince": "California",
        "Postcode": "94558",
        "CountryID": 2,
        "Latitude": 38.2242325,
        "Longitude": -122.2594288,
        "ContactTelephone1": "(707) 253-1900",
        "DistanceUnit": 0
    },
    "Connections": [
        {
            "ID": 141263,
            "ConnectionTypeID": 30,
            "StatusTypeID": 50,
            "LevelID": 2,
            "PowerKW": 16,
            "CurrentTypeID": 20,
            "Quantity": 5
        }
    ],
    "NumberOfPoints": 5,
    "GeneralComments": "5 Tesla Connectors, up to 16kW.Available for customers. Please see front desk.",
    "StatusTypeID": 50,
    "DateLastStatusUpdate": "2018-02-09T06:54:00Z",
    "DataQualityLevel": 1,
    "DateCreated": "2018-02-09T06:54:00Z",
    "SubmissionStatusTypeID": 200
}