{
    "IsRecentlyVerified": false,
    "ID": 67457,
    "UUID": "DBC5D62A-42E7-4841-871B-FE0176EC21A1",
    "DataProviderID": 2,
    "DataProvidersReference": "75857",
    "OperatorID": 5,
    "UsageTypeID": 1,
    "AddressInfo": {
        "ID": 67803,
        "Title": "TOWNHALL",
        "AddressLine1": "100 Bentley Dr",
        "Town": "Harwinton",
        "StateOrProvince": "CT",
        "Postcode": "06791",
        "CountryID": 2,
        "Latitude": 41.7640244,
        "Longitude": -73.070231,
        "ContactTelephone1": "888-758-4389",
        "AccessComments": "24 hours daily",
        "RelatedURL": "http://www.chargepoint.com/",
        "DistanceUnit": 0
    },
    "Connections": [
        {
            "ID": 92961,
            "ConnectionTypeID": 1,
            "LevelID": 2,
            "Amps": 16,
            "Voltage": 230,
            "PowerKW": 3.7,
            "CurrentTypeID": 10,
            "Quantity": 2
        }
    ],
    "DateLastStatusUpdate": "2020-06-26T03:05:00Z",
    "DataQualityLevel": 3,
    "DateCreated": "2016-05-29T02:05:00Z",
    "SubmissionStatusTypeID": 100
}