{
    "IsRecentlyVerified": false,
    "ID": 94558,
    "UUID": "7402F370-5179-429A-A483-35EA67A50C2F",
    "DataProviderID": 1,
    "OperatorID": 23,
    "OperatorsReference": "36727",
    "UsageTypeID": 6,
    "AddressInfo": {
        "ID": 94904,
        "Title": "Hôtel Mercure Reims Centre Cathedrale",
        "AddressLine1": "31 Boulevard Paul Doumer",
        "Town": "Reims",
        "Postcode": "51100",
        "CountryID": 80,
        "Latitude": 49.249047,
        "Longitude": 4.026702,
        "ContactTelephone1": "+33 3 26 84 49 49",
        "DistanceUnit": 0
    },
    "Connections": [
        {
            "ID": 133697,
            "ConnectionTypeID": 30,
            "StatusTypeID": 50,
            "LevelID": 2,
            "Amps": 16,
            "Voltage": 400,
            "PowerKW": 11,
            "CurrentTypeID": 20,
            "Quantity": 2
        }
    ],
    "NumberOfPoints": 2,
    "GeneralComments": "2 Tesla Connectors, up to 11kW.Available for patrons only. Self park.",
    "StatusTypeID": 50,
    "DateLastStatusUpdate": "2018-10-03T19:14:00Z",
    "DataQualityLevel": 1,
    "DateCreated": "2017-10-20T05:40:00Z",
    "SubmissionStatusTypeID": 200
}