{
    "IsRecentlyVerified": false,
    "ID": 135316,
    "UUID": "92D8E7A5-239D-41FE-853F-CB8A34A89322",
    "DataProviderID": 1,
    "OperatorID": 80,
    "UsageTypeID": 4,
    "AddressInfo": {
        "ID": 135662,
        "Title": "Cimitero di Cappella | EnelX",
        "AddressLine1": "Via Moglianese Cappella",
        "AddressLine2": "Cappella",
        "Town": "Scorzè",
        "StateOrProvince": "VE",
        "Postcode": "30037",
        "CountryID": 112,
        "Latitude": 45.568078935373194,
        "Longitude": 12.149413653147576,
        "ContactTelephone1": "800.069.850",
        "RelatedURL": "https://www.enelx.com/it/it/emobility",
        "DistanceUnit": 0
    },
    "Connections": [
        {
            "ID": 189578,
            "ConnectionTypeID": 25,
            "StatusTypeID": 50,
            "LevelID": 2,
            "Amps": 32,
            "Voltage": 400,
            "PowerKW": 22,
            "CurrentTypeID": 20,
            "Quantity": 2
        }
    ],
    "NumberOfPoints": 2,
    "StatusTypeID": 50,
    "DateLastStatusUpdate": "2019-12-17T11:34:00Z",
    "DataQualityLevel": 1,
    "DateCreated": "2019-12-17T11:34:00Z",
    "SubmissionStatusTypeID": 200
}