{
    "IsRecentlyVerified": false,
    "ID": 153757,
    "UUID": "F147D876-9530-4BE2-AB55-CBAE7545B95C",
    "DataProviderID": 28,
    "DataProvidersReference": "FR*S10*P10314A",
    "UsageTypeID": 5,
    "AddressInfo": {
        "ID": 154110,
        "Title": "RAMERUPT",
        "AddressLine1": "16 Rue Charles Delaunay 10240 RAMERUPT",
        "CountryID": 80,
        "Latitude": 48.519764,
        "Longitude": 4.290049,
        "AccessComments": "",
        "DistanceUnit": 0
    },
    "Connections": [
        {
            "ID": 215895,
            "ConnectionTypeID": 28,
            "StatusTypeID": 50,
            "LevelID": 2,
            "PowerKW": 18,
            "CurrentTypeID": 10
        },
        {
            "ID": 215896,
            "ConnectionTypeID": 25,
            "StatusTypeID": 50,
            "LevelID": 2,
            "PowerKW": 18,
            "CurrentTypeID": 20
        },
        {
            "ID": 249612,
            "ConnectionTypeID": 28,
            "StatusTypeID": 50,
            "LevelID": 2,
            "PowerKW": 18,
            "CurrentTypeID": 10
        },
        {
            "ID": 249613,
            "ConnectionTypeID": 25,
            "StatusTypeID": 50,
            "LevelID": 2,
            "PowerKW": 18,
            "CurrentTypeID": 20
        }
    ],
    "GeneralComments": "\"Une unité = 6kWh de recharge. Utilisateur abonné : 1€/unité",
    "StatusTypeID": 50,
    "DateLastStatusUpdate": "2020-08-27T05:15:00Z",
    "DataQualityLevel": 2,
    "DateCreated": "2020-03-15T10:54:00Z",
    "SubmissionStatusTypeID": 100
}