{
    "IsRecentlyVerified": false,
    "ID": 94785,
    "UUID": "501DB8FA-D167-470A-87FB-ACFC473C447F",
    "DataProviderID": 1,
    "OperatorID": 3,
    "OperatorsReference": "PG-91130,PSL-109090,PSL-109092",
    "UsageTypeID": 6,
    "UsageCost": "Free",
    "AddressInfo": {
        "ID": 95131,
        "Title": "M&a Coachworks Hertfordshire",
        "AddressLine1": "Unit 22 Cranbourne Industrial Estate",
        "Town": "Potters Bar",
        "Postcode": "EN6 3JN",
        "CountryID": 1,
        "Latitude": 51.704553,
        "Longitude": -0.202393,
        "DistanceUnit": 0
    },
    "Connections": [
        {
            "ID": 133981,
            "ConnectionTypeID": 25,
            "StatusTypeID": 50,
            "LevelID": 2,
            "Amps": 32,
            "Voltage": 230,
            "PowerKW": 7,
            "CurrentTypeID": 10,
            "Quantity": 3
        }
    ],
    "NumberOfPoints": 3,
    "GeneralComments": "This is an open charge unit installed at the M&A Coachworks site in Unit 22 Cranbourne Industrial Estate, Cranbourne Road, Hertfordshire",
    "StatusTypeID": 50,
    "DateLastStatusUpdate": "2017-10-27T11:30:00Z",
    "DataQualityLevel": 1,
    "DateCreated": "2017-10-27T05:24:00Z",
    "SubmissionStatusTypeID": 200
}