{
    "IsRecentlyVerified": false,
    "ID": 111592,
    "UUID": "1E6BF062-9266-49E8-806A-07EB13BF3D20",
    "DataProviderID": 2,
    "DataProvidersReference": "83372",
    "UsageTypeID": 1,
    "AddressInfo": {
        "ID": 111938,
        "Title": "Casse-Croute Chez Dany",
        "AddressLine1": "92 rue Langevin",
        "Town": "St-Henedine",
        "StateOrProvince": "QC",
        "Postcode": "G0S 2R0",
        "CountryID": 44,
        "Latitude": 46.5594991433683,
        "Longitude": -70.9849696772461,
        "ContactTelephone1": "418-935-3904",
        "AccessComments": "24 hours daily",
        "RelatedURL": "",
        "DistanceUnit": 0
    },
    "Connections": [
        {
            "ID": 157053,
            "ConnectionTypeID": 1,
            "LevelID": 2,
            "Amps": 16,
            "Voltage": 230,
            "PowerKW": 3.7,
            "CurrentTypeID": 10,
            "Quantity": 1
        }
    ],
    "DateLastStatusUpdate": "2020-06-26T03:10:00Z",
    "DataQualityLevel": 3,
    "DateCreated": "2018-10-18T23:37:00Z",
    "SubmissionStatusTypeID": 100
}