{
    "IsRecentlyVerified": false,
    "ID": 8038,
    "UUID": "97030031-923C-4A80-8DD6-769FD6D40E97",
    "DataProviderID": 15,
    "DataProvidersReference": "9276",
    "OperatorID": 5,
    "UsageTypeID": 2,
    "AddressInfo": {
        "ID": 7935,
        "Title": "426 College Pkwy",
        "AddressLine1": "426 College Pkwy",
        "Town": "Colchester",
        "StateOrProvince": "Vermont",
        "Postcode": "5446",
        "CountryID": 2,
        "Latitude": 44.49318695,
        "Longitude": -73.16618346999999,
        "ContactTelephone1": "",
        "RelatedURL": "http://carstations.com/9276",
        "DistanceUnit": 0
    },
    "Connections": [
        {
            "ID": 5467,
            "ConnectionTypeID": 1,
            "Reference": "J1772",
            "LevelID": 2
        },
        {
            "ID": 6196,
            "ConnectionTypeID": 9,
            "Reference": "NEMA5",
            "LevelID": 1,
            "Quantity": 1
        }
    ],
    "NumberOfPoints": 1,
    "StatusTypeID": 0,
    "DateLastStatusUpdate": "2017-11-04T14:05:00Z",
    "DataQualityLevel": 1,
    "DateCreated": "2011-11-11T12:05:00Z",
    "SubmissionStatusTypeID": 100
}