{
    "IsRecentlyVerified": false,
    "ID": 87193,
    "UUID": "A342C55E-2B9D-4D1A-A265-9D83378D5E95",
    "DataProviderID": 1,
    "OperatorID": 23,
    "OperatorsReference": "29230",
    "UsageTypeID": 6,
    "AddressInfo": {
        "ID": 87539,
        "Title": "Der Alpenhof",
        "AddressLine1": "1 Osterhofen",
        "Town": "Bayrischzell",
        "Postcode": "83735",
        "CountryID": 87,
        "Latitude": 47.684606,
        "Longitude": 11.988474,
        "ContactTelephone1": "+49 8023 90650",
        "DistanceUnit": 0
    },
    "Connections": [
        {
            "ID": 123597,
            "ConnectionTypeID": 30,
            "StatusTypeID": 50,
            "LevelID": 2,
            "Amps": 32,
            "Voltage": 400,
            "PowerKW": 22,
            "CurrentTypeID": 20,
            "Quantity": 2
        }
    ],
    "NumberOfPoints": 2,
    "GeneralComments": "2 Tesla Connectors, up to 22kW.Available for patrons only. Please call ahead.",
    "StatusTypeID": 50,
    "DateLastStatusUpdate": "2018-10-03T14:13:00Z",
    "DataQualityLevel": 1,
    "DateCreated": "2017-05-02T05:24:00Z",
    "SubmissionStatusTypeID": 200
}