{
    "IsRecentlyVerified": false,
    "ID": 135110,
    "UUID": "A7A8F1F0-77F1-47D3-9687-444C436A6F04",
    "DataProviderID": 1,
    "OperatorID": 1,
    "UsageTypeID": 1,
    "AddressInfo": {
        "ID": 135456,
        "Title": "Port Renfrew Community Centre",
        "AddressLine1": "6638 Deering, Rd",
        "Town": "Port Renfrew",
        "StateOrProvince": "BC",
        "Postcode": "V0S 1K0",
        "CountryID": 44,
        "Latitude": 48.557224961713615,
        "Longitude": -124.40046141513767,
        "RelatedURL": "https://www.plugshare.com/location/185188",
        "DistanceUnit": 0
    },
    "Connections": [
        {
            "ID": 189103,
            "ConnectionTypeID": 2,
            "StatusTypeID": 50,
            "LevelID": 2,
            "PowerKW": 50,
            "Quantity": 2
        },
        {
            "ID": 189104,
            "ConnectionTypeID": 32,
            "StatusTypeID": 50,
            "LevelID": 3,
            "PowerKW": 50,
            "CurrentTypeID": 30,
            "Quantity": 2
        },
        {
            "ID": 189105,
            "ConnectionTypeID": 1,
            "StatusTypeID": 50,
            "LevelID": 1,
            "CurrentTypeID": 10,
            "Quantity": 1
        }
    ],
    "NumberOfPoints": 3,
    "GeneralComments": "There is free WiFi at the Community Center where the chargers are located.",
    "StatusTypeID": 50,
    "DateLastStatusUpdate": "2019-12-05T19:48:00Z",
    "DataQualityLevel": 1,
    "DateCreated": "2019-12-05T17:05:00Z",
    "SubmissionStatusTypeID": 200
}