{
    "IsRecentlyVerified": false,
    "ID": 133766,
    "UUID": "5A909494-6DA6-44F3-822F-0B7C9839AE37",
    "DataProviderID": 1,
    "OperatorID": 23,
    "OperatorsReference": "52226",
    "UsageTypeID": 4,
    "UsageCost": "€0.25/kWh; andere tarieven voor oudere auto's",
    "AddressInfo": {
        "ID": 134112,
        "Title": "Naarden Supercharger",
        "AddressLine1": "Ijsselmeerweg 3",
        "Town": "Naarden",
        "Postcode": "1411",
        "CountryID": 159,
        "Latitude": 52.308658,
        "Longitude": 5.140926,
        "DistanceUnit": 0
    },
    "Connections": [
        {
            "ID": 187209,
            "ConnectionTypeID": 27,
            "StatusTypeID": 50,
            "LevelID": 3,
            "PowerKW": 120,
            "CurrentTypeID": 30,
            "Quantity": 32
        }
    ],
    "NumberOfPoints": 32,
    "GeneralComments": "12 Superchargers, available 24/7, up to 120kW",
    "StatusTypeID": 50,
    "DateLastStatusUpdate": "2021-01-30T07:04:00Z",
    "DataQualityLevel": 1,
    "DateCreated": "2019-10-26T05:53:00Z",
    "SubmissionStatusTypeID": 200
}