{
    "IsRecentlyVerified": false,
    "ID": 113917,
    "UUID": "17166C01-2844-4095-AF62-2CFE553D8C53",
    "DataProviderID": 1,
    "OperatorID": 23,
    "OperatorsReference": "47382",
    "UsageTypeID": 4,
    "AddressInfo": {
        "ID": 114263,
        "Title": "Falkensteiner Hotel Sonnenparadies",
        "AddressLine1": "Via San Giorgi",
        "Town": "Terento",
        "Postcode": "39030",
        "CountryID": 112,
        "Latitude": 46.831119,
        "Longitude": 11.776992,
        "ContactTelephone1": " +39 0472 546 266",
        "DistanceUnit": 0
    },
    "Connections": [
        {
            "ID": 160487,
            "ConnectionTypeID": 30,
            "StatusTypeID": 50,
            "LevelID": 2,
            "Amps": 32,
            "Voltage": 400,
            "PowerKW": 22,
            "CurrentTypeID": 20,
            "Quantity": 1
        }
    ],
    "NumberOfPoints": 1,
    "GeneralComments": "1 Tesla Connector, up to 22kW.Available for customers. Please call ahead.",
    "StatusTypeID": 50,
    "DateLastStatusUpdate": "2019-01-02T21:57:00Z",
    "DataQualityLevel": 1,
    "DateCreated": "2019-01-02T21:57:00Z",
    "SubmissionStatusTypeID": 200
}