{
    "IsRecentlyVerified": false,
    "ID": 65176,
    "UUID": "145D71D0-754A-4065-B770-127594B697F8",
    "DataProviderID": 1,
    "OperatorID": 45,
    "UsageTypeID": 1,
    "AddressInfo": {
        "ID": 65522,
        "Title": "Supermarkt Lidl",
        "AddressLine1": "Hauptstraße 122",
        "AddressLine2": "Schöneberg",
        "Town": "Berlin",
        "StateOrProvince": "Berlin",
        "Postcode": "10827",
        "CountryID": 87,
        "Latitude": 52.48316359275756,
        "Longitude": 13.351298868786653,
        "AccessComments": "Kostenlos nutzbar während der Öffnungszeiten Mo-Sa 8-22Uhr.",
        "DistanceUnit": 0
    },
    "Connections": [
        {
            "ID": 89726,
            "ConnectionTypeID": 2,
            "StatusTypeID": 50,
            "LevelID": 3,
            "PowerKW": 50,
            "CurrentTypeID": 30,
            "Quantity": 1
        },
        {
            "ID": 89727,
            "ConnectionTypeID": 33,
            "StatusTypeID": 50,
            "LevelID": 3,
            "PowerKW": 50,
            "CurrentTypeID": 30,
            "Quantity": 1
        },
        {
            "ID": 89728,
            "ConnectionTypeID": 25,
            "StatusTypeID": 50,
            "LevelID": 3,
            "Amps": 63,
            "Voltage": 400,
            "PowerKW": 43,
            "CurrentTypeID": 20,
            "Quantity": 1
        }
    ],
    "NumberOfPoints": 3,
    "StatusTypeID": 50,
    "DateLastStatusUpdate": "2016-04-19T06:04:00Z",
    "DataQualityLevel": 1,
    "DateCreated": "2016-04-19T06:04:00Z",
    "SubmissionStatusTypeID": 200
}