{
    "IsRecentlyVerified": false,
    "ID": 139204,
    "UUID": "1754116E-BA42-49A2-8667-CDA2EB363426",
    "DataProviderID": 2,
    "DataProvidersReference": "117035",
    "OperatorID": 5,
    "UsageTypeID": 1,
    "AddressInfo": {
        "ID": 139556,
        "Title": "CHARGE HARBOR",
        "AddressLine1": "2233 Martin",
        "Town": "Irvine",
        "StateOrProvince": "CA",
        "Postcode": "92612",
        "CountryID": 2,
        "Latitude": 33.6724533,
        "Longitude": -117.858686,
        "ContactTelephone1": "888-758-4389",
        "AccessComments": "24 hours daily",
        "RelatedURL": "http://www.chargepoint.com/",
        "DistanceUnit": 0
    },
    "Connections": [
        {
            "ID": 194479,
            "ConnectionTypeID": 1,
            "LevelID": 2,
            "Amps": 16,
            "Voltage": 230,
            "PowerKW": 3,
            "CurrentTypeID": 10,
            "Quantity": 2
        }
    ],
    "StatusTypeID": 50,
    "DateLastStatusUpdate": "2019-12-24T09:10:00Z",
    "DataQualityLevel": 3,
    "DateCreated": "2019-12-24T09:10:00Z",
    "SubmissionStatusTypeID": 100
}