{
    "IsRecentlyVerified": false,
    "ID": 137019,
    "UUID": "6F31F02C-6312-4CA7-96AC-A7A92DE96152",
    "DataProviderID": 1,
    "OperatorID": 3315,
    "OperatorsReference": "50304",
    "UsageTypeID": 1,
    "AddressInfo": {
        "ID": 137365,
        "Title": "Elvingston Science Centre",
        "AddressLine1": "Gladsmuir",
        "Town": "Tranent",
        "Postcode": "EH33 1EH",
        "CountryID": 1,
        "Latitude": 55.960828,
        "Longitude": -2.864355,
        "AccessComments": "Outside the front of the Science Centre\r\nPost owner: Elvingston Science Centre Access: 24 hours",
        "DistanceUnit": 0
    },
    "Connections": [
        {
            "ID": 191797,
            "ConnectionTypeID": 25,
            "Reference": "50304",
            "StatusTypeID": 100,
            "LevelID": 2,
            "Amps": 32,
            "Voltage": 230,
            "PowerKW": 7,
            "CurrentTypeID": 10,
            "Quantity": 1
        }
    ],
    "StatusTypeID": 100,
    "DateLastStatusUpdate": "2021-07-19T10:32:00Z",
    "MetadataValues": [
        {
            "ID": 6871,
            "MetadataFieldID": 4,
            "ItemValue": "Contains public sector information licensed under the Open Government Licence v2.0. http://www.nationalarchives.gov.uk/doc/open-government-licence/version/2/"
        }
    ],
    "DataQualityLevel": 3,
    "DateCreated": "2019-12-24T05:23:00Z",
    "SubmissionStatusTypeID": 100
}