{
    "IsRecentlyVerified": false,
    "ID": 187714,
    "UUID": "D6E856D8-D0A1-40EB-9A45-EFB921CD1FB2",
    "DataProviderID": 18,
    "DataProvidersReference": "f0a004b1f4d4817dc596c6a590e68c1f",
    "OperatorID": 2244,
    "UsageTypeID": 5,
    "AddressInfo": {
        "ID": 188073,
        "Title": "1 Campden Hill",
        "AddressLine1": "1 Campden Hill",
        "Town": "London",
        "Postcode": "W8 7AD",
        "CountryID": 1,
        "Latitude": 51.504335,
        "Longitude": -0.198029,
        "AccessComments": "",
        "RelatedURL": "https://www.ubitricity.com",
        "DistanceUnit": 0
    },
    "Connections": [
        {
            "ID": 302951,
            "ConnectionTypeID": 25,
            "Reference": "suby1100007380",
            "StatusTypeID": 50,
            "LevelID": 2,
            "Amps": 16,
            "Voltage": 230,
            "PowerKW": 3.7,
            "CurrentTypeID": 10
        }
    ],
    "StatusTypeID": 0,
    "DateLastStatusUpdate": "2021-07-12T03:38:00Z",
    "MetadataValues": [
        {
            "ID": 19954,
            "MetadataFieldID": 4,
            "ItemValue": "Contains public sector information licensed under the Open Government Licence v2.0. http://www.nationalarchives.gov.uk/doc/open-government-licence/version/2/"
        }
    ],
    "DataQualityLevel": 3,
    "DateCreated": "2021-07-12T03:38:00Z",
    "SubmissionStatusTypeID": 100
}