{
    "IsRecentlyVerified": false,
    "ID": 153704,
    "UUID": "CDDB8D57-DDF8-4251-A639-38D781A03D32",
    "DataProviderID": 28,
    "DataProvidersReference": "FR*S61*P61241A",
    "UsageTypeID": 5,
    "AddressInfo": {
        "ID": 154057,
        "Title": "La Madeleine-Bouvet | Rue de Paris",
        "AddressLine1": "Rue de Paris 61110 La Madeleine-Bouvet",
        "CountryID": 80,
        "Latitude": 48.47147,
        "Longitude": 0.90238,
        "AccessComments": "24/24 7/7",
        "DistanceUnit": 0
    },
    "Connections": [
        {
            "ID": 215790,
            "ConnectionTypeID": 26,
            "StatusTypeID": 50,
            "LevelID": 2,
            "PowerKW": 18
        },
        {
            "ID": 215791,
            "ConnectionTypeID": 28,
            "StatusTypeID": 50,
            "LevelID": 2,
            "PowerKW": 18,
            "CurrentTypeID": 10
        },
        {
            "ID": 249494,
            "ConnectionTypeID": 26,
            "StatusTypeID": 50,
            "LevelID": 2,
            "PowerKW": 18
        },
        {
            "ID": 249495,
            "ConnectionTypeID": 28,
            "StatusTypeID": 50,
            "LevelID": 2,
            "PowerKW": 18,
            "CurrentTypeID": 10
        }
    ],
    "GeneralComments": "",
    "StatusTypeID": 50,
    "DateLastStatusUpdate": "2020-08-27T05:15:00Z",
    "DataQualityLevel": 2,
    "DateCreated": "2020-03-15T10:54:00Z",
    "SubmissionStatusTypeID": 100
}