{
    "IsRecentlyVerified": false,
    "ID": 86056,
    "UUID": "A975D388-12A5-45D6-83CD-E3D72376FEAE",
    "DataProviderID": 1,
    "OperatorID": 3248,
    "UsageTypeID": 1,
    "AddressInfo": {
        "ID": 86402,
        "Title": "Rasthof Auerswalder Blick Nord",
        "AddressLine1": "A4",
        "Town": "Lichtenau",
        "StateOrProvince": "Landkreis Mittelsachsen",
        "Postcode": "09244",
        "CountryID": 87,
        "Latitude": 50.89364638561478,
        "Longitude": 12.940750558216898,
        "AccessComments": "In Nördlicher Richtung Chemnitz Ost abfahren und nach dem Laden über Chemnitz Glösa wieder in nördlicher Richtung auffahren, keine Unterführung am Rasthof.",
        "DistanceUnit": 0
    },
    "Connections": [
        {
            "ID": 122388,
            "ConnectionTypeID": 1036,
            "StatusTypeID": 50,
            "LevelID": 3,
            "Amps": 63,
            "Voltage": 400,
            "PowerKW": 43,
            "CurrentTypeID": 20,
            "Quantity": 1
        },
        {
            "ID": 122389,
            "ConnectionTypeID": 2,
            "StatusTypeID": 50,
            "LevelID": 3,
            "PowerKW": 50,
            "CurrentTypeID": 30,
            "Quantity": 1
        },
        {
            "ID": 122390,
            "ConnectionTypeID": 33,
            "StatusTypeID": 50,
            "LevelID": 3,
            "PowerKW": 50,
            "CurrentTypeID": 30,
            "Quantity": 1
        }
    ],
    "NumberOfPoints": 3,
    "StatusTypeID": 50,
    "DateLastStatusUpdate": "2017-04-24T07:15:00Z",
    "DataQualityLevel": 1,
    "DateCreated": "2017-04-24T07:15:00Z",
    "SubmissionStatusTypeID": 200
}