{
    "IsRecentlyVerified": false,
    "ID": 117043,
    "UUID": "1C07B89B-606C-4298-856F-DDFB0161ADC1",
    "DataProviderID": 1,
    "OperatorID": 23,
    "OperatorsReference": "7181",
    "UsageTypeID": 6,
    "AddressInfo": {
        "ID": 117389,
        "Title": "Suds Hut Famous Chicken & Casino",
        "AddressLine1": "2701 North Montana Ave",
        "Town": "Helena",
        "StateOrProvince": "MT",
        "Postcode": "59601",
        "CountryID": 2,
        "Latitude": 46.611568,
        "Longitude": -112.020013,
        "ContactTelephone1": "(406) 443-7837",
        "DistanceUnit": 0
    },
    "Connections": [
        {
            "ID": 165666,
            "ConnectionTypeID": 30,
            "StatusTypeID": 50,
            "LevelID": 2,
            "PowerKW": 13,
            "CurrentTypeID": 20,
            "Quantity": 2
        }
    ],
    "NumberOfPoints": 2,
    "GeneralComments": "2 Tesla Connectors, up to 13kW.Available for patrons only. Self park.",
    "StatusTypeID": 50,
    "DateLastStatusUpdate": "2019-02-16T06:35:00Z",
    "DataQualityLevel": 1,
    "DateCreated": "2019-02-16T06:35:00Z",
    "SubmissionStatusTypeID": 200
}