{
    "IsRecentlyVerified": false,
    "ID": 147962,
    "UUID": "D44D13AF-41FC-4A75-B6CC-5F0BB4B76438",
    "DataProviderID": 1,
    "OperatorID": 3266,
    "UsageTypeID": 4,
    "AddressInfo": {
        "ID": 148314,
        "Title": "Concessionario Nissan AB Auto S.p.A",
        "AddressLine1": "SS16, Km 980",
        "Town": "Melpignano",
        "StateOrProvince": "LE",
        "Postcode": "73020",
        "CountryID": 112,
        "Latitude": 40.142885927309806,
        "Longitude": 18.28422714765827,
        "RelatedURL": "https://abauto.concessionarienissan.it/it/homepage",
        "DistanceUnit": 0
    },
    "Connections": [
        {
            "ID": 205397,
            "ConnectionTypeID": 2,
            "StatusTypeID": 50,
            "LevelID": 3,
            "Amps": 120,
            "Voltage": 500,
            "PowerKW": 50,
            "CurrentTypeID": 30,
            "Quantity": 1
        },
        {
            "ID": 205398,
            "ConnectionTypeID": 33,
            "StatusTypeID": 50,
            "LevelID": 3,
            "Amps": 120,
            "Voltage": 500,
            "PowerKW": 50,
            "CurrentTypeID": 30,
            "Quantity": 1
        },
        {
            "ID": 205399,
            "ConnectionTypeID": 25,
            "StatusTypeID": 50,
            "LevelID": 2,
            "Amps": 32,
            "Voltage": 400,
            "PowerKW": 22,
            "CurrentTypeID": 20,
            "Quantity": 1
        }
    ],
    "NumberOfPoints": 2,
    "StatusTypeID": 50,
    "DateLastStatusUpdate": "2020-01-21T09:51:00Z",
    "DataQualityLevel": 1,
    "DateCreated": "2020-01-21T09:51:00Z",
    "SubmissionStatusTypeID": 200
}