{
    "IsRecentlyVerified": false,
    "ID": 97822,
    "UUID": "8C5349BC-52D3-4749-9F14-9A17D13DB90F",
    "DataProviderID": 1,
    "OperatorID": 23,
    "OperatorsReference": "28721",
    "UsageTypeID": 4,
    "UsageCost": "$0.22/kWh; other tariffs for older cars",
    "AddressInfo": {
        "ID": 98168,
        "Title": "West Melbourne, FL Supercharger",
        "AddressLine1": "206 Palm Bay Road",
        "Town": "West Melbourne",
        "StateOrProvince": "FL",
        "Postcode": "32904-0000",
        "CountryID": 2,
        "Latitude": 28.037013,
        "Longitude": -80.664151,
        "DistanceUnit": 0
    },
    "Connections": [
        {
            "ID": 138730,
            "ConnectionTypeID": 27,
            "StatusTypeID": 50,
            "LevelID": 3,
            "PowerKW": 120,
            "CurrentTypeID": 30,
            "Quantity": 8
        }
    ],
    "NumberOfPoints": 8,
    "GeneralComments": "Charging8 Superchargers, available 24/7, up to 120kW",
    "StatusTypeID": 50,
    "DateLastStatusUpdate": "2018-03-13T14:01:00Z",
    "DataQualityLevel": 1,
    "DateCreated": "2018-01-21T16:44:00Z",
    "SubmissionStatusTypeID": 200
}