{
    "IsRecentlyVerified": false,
    "ID": 71908,
    "UUID": "9B4159BF-5C2B-487E-848B-1E7F2E2DFF15",
    "DataProviderID": 1,
    "UsageTypeID": 4,
    "AddressInfo": {
        "ID": 72254,
        "Title": "eBorn SDE07 - Place du Foiral",
        "AddressLine1": "Place du Foiral",
        "Town": "Privas",
        "Postcode": "07000",
        "CountryID": 80,
        "Latitude": 44.734093,
        "Longitude": 4.595151,
        "RelatedURL": "http://www.sde07.com/",
        "DistanceUnit": 0
    },
    "Connections": [
        {
            "ID": 103044,
            "ConnectionTypeID": 25,
            "StatusTypeID": 50,
            "LevelID": 2,
            "Amps": 32,
            "Voltage": 400,
            "PowerKW": 22,
            "CurrentTypeID": 20,
            "Quantity": 2
        },
        {
            "ID": 103045,
            "ConnectionTypeID": 23,
            "StatusTypeID": 50,
            "LevelID": 2,
            "Amps": 16,
            "Voltage": 230,
            "PowerKW": 3,
            "CurrentTypeID": 10,
            "Quantity": 2
        }
    ],
    "NumberOfPoints": 2,
    "GeneralComments": "Nécessite le badge SDE07.\r\nFormulaire de demande de badge disponible à l'adresse suivante: http://www.sde07.com/communes-collectivites-ardeche/bornes-de-charges-vehicules-hybrides-electriques/",
    "StatusTypeID": 50,
    "DateLastStatusUpdate": "2017-01-08T18:18:00Z",
    "DataQualityLevel": 1,
    "DateCreated": "2016-09-22T13:53:00Z",
    "SubmissionStatusTypeID": 200
}