{
    "IsRecentlyVerified": false,
    "ID": 138823,
    "UUID": "3DC576B6-A19C-452D-BF50-2FFE0B452562",
    "DataProviderID": 2,
    "DataProvidersReference": "143450",
    "OperatorID": 5,
    "UsageTypeID": 1,
    "AddressInfo": {
        "ID": 139175,
        "Title": "WALTERBORO SBUX",
        "AddressLine1": "1630 Bells Hwy",
        "Town": "Walterboro",
        "StateOrProvince": "SC",
        "Postcode": "29488",
        "CountryID": 2,
        "Latitude": 32.929059,
        "Longitude": -80.687578,
        "ContactTelephone1": "888-758-4389",
        "AccessComments": "24 hours daily",
        "RelatedURL": "http://www.chargepoint.com/",
        "DistanceUnit": 0
    },
    "Connections": [
        {
            "ID": 194038,
            "ConnectionTypeID": 1,
            "LevelID": 2,
            "Amps": 16,
            "Voltage": 230,
            "PowerKW": 3.7,
            "CurrentTypeID": 10,
            "Quantity": 4
        }
    ],
    "StatusTypeID": 50,
    "DateLastStatusUpdate": "2020-06-26T02:55:00Z",
    "DataQualityLevel": 3,
    "DateCreated": "2019-12-24T09:09:00Z",
    "SubmissionStatusTypeID": 100
}