{
    "IsRecentlyVerified": false,
    "ID": 91057,
    "UUID": "D81474EB-71E1-42B2-9A8C-18AAB998A606",
    "DataProviderID": 1,
    "OperatorID": 23,
    "OperatorsReference": "32320",
    "UsageTypeID": 6,
    "AddressInfo": {
        "ID": 91403,
        "Title": "Belarosa Hotel",
        "AddressLine1": "Eichhornliweg",
        "Town": "Arosa",
        "StateOrProvince": "Graubunden",
        "Postcode": "7050",
        "CountryID": 217,
        "Latitude": 46.780345,
        "Longitude": 9.677358,
        "ContactTelephone1": "+41 8137 88999",
        "DistanceUnit": 0
    },
    "Connections": [
        {
            "ID": 129112,
            "ConnectionTypeID": 30,
            "StatusTypeID": 50,
            "LevelID": 2,
            "Amps": 16,
            "Voltage": 400,
            "PowerKW": 11,
            "CurrentTypeID": 20,
            "Quantity": 1
        }
    ],
    "NumberOfPoints": 1,
    "GeneralComments": "1 Tesla Connector, up to 11kW.Available for patrons only. Please see front desk.",
    "StatusTypeID": 50,
    "DateLastStatusUpdate": "2018-10-03T14:45:00Z",
    "DataQualityLevel": 1,
    "DateCreated": "2017-07-28T05:46:00Z",
    "SubmissionStatusTypeID": 200
}