{
    "IsRecentlyVerified": false,
    "ID": 18878,
    "UUID": "FED4E00A-8410-4F10-B006-123E491C6F27",
    "DataProviderID": 2,
    "DataProvidersReference": "52598",
    "OperatorID": 5,
    "UsageTypeID": 1,
    "AddressInfo": {
        "ID": 19223,
        "Title": "NATIONAL GRID",
        "AddressLine1": "950 Succotash Rd",
        "Town": "South Kingstown",
        "StateOrProvince": "RI",
        "Postcode": "02879",
        "CountryID": 2,
        "Latitude": 41.377485,
        "Longitude": -71.524399,
        "ContactTelephone1": "888-758-4389",
        "AccessComments": "24 hours daily",
        "RelatedURL": "http://www.chargepoint.com/",
        "DistanceUnit": 0
    },
    "Connections": [
        {
            "ID": 19117,
            "ConnectionTypeID": 1,
            "LevelID": 2,
            "Amps": 16,
            "Voltage": 230,
            "PowerKW": 3.7,
            "CurrentTypeID": 10,
            "Quantity": 2
        },
        {
            "ID": 22314,
            "ConnectionTypeID": 1,
            "LevelID": 2,
            "Quantity": 2
        }
    ],
    "DateLastStatusUpdate": "2020-06-26T03:04:00Z",
    "DataQualityLevel": 3,
    "DateCreated": "2013-08-25T04:20:00Z",
    "SubmissionStatusTypeID": 200
}