{
    "IsRecentlyVerified": false,
    "ID": 178488,
    "UUID": "E8F98953-C5AC-42BC-AA79-7E2347969085",
    "DataProviderID": 29,
    "DataProvidersReference": "1352",
    "OperatorID": 3403,
    "AddressInfo": {
        "ID": 178847,
        "Title": "Fröbelweg 1",
        "AddressLine1": "Fröbelweg 1",
        "Town": "Kaltenkirchen",
        "Postcode": "24568",
        "CountryID": 87,
        "Latitude": 53.839438,
        "Longitude": 9.963859,
        "DistanceUnit": 0
    },
    "Connections": [
        {
            "ID": 278976,
            "ConnectionTypeID": 25,
            "StatusTypeID": 50,
            "LevelID": 2,
            "PowerKW": 22,
            "CurrentTypeID": 20
        },
        {
            "ID": 278977,
            "ConnectionTypeID": 25,
            "StatusTypeID": 50,
            "LevelID": 2,
            "PowerKW": 22,
            "CurrentTypeID": 20
        },
        {
            "ID": 278978,
            "ConnectionTypeID": 25,
            "StatusTypeID": 50,
            "LevelID": 2,
            "PowerKW": 22,
            "CurrentTypeID": 20
        },
        {
            "ID": 278979,
            "ConnectionTypeID": 25,
            "StatusTypeID": 50,
            "LevelID": 2,
            "PowerKW": 22,
            "CurrentTypeID": 20
        }
    ],
    "StatusTypeID": 0,
    "DateLastStatusUpdate": "2021-07-12T02:52:00Z",
    "MetadataValues": [
        {
            "ID": 10782,
            "MetadataFieldID": 4,
            "ItemValue": "Data from the German chargepoint registry provided by Bundesnetzagentur.de under the CC-BY 4.0 license"
        }
    ],
    "DataQualityLevel": 3,
    "DateCreated": "2021-07-08T09:50:00Z",
    "SubmissionStatusTypeID": 100
}