{
    "IsRecentlyVerified": false,
    "ID": 32910,
    "UUID": "69E72C16-99E6-4FDE-84F0-8610A4A750BA",
    "DataProviderID": 26,
    "DataProvidersReference": "47285",
    "OperatorID": 178,
    "OperatorsReference": "EVnetNL AL441",
    "UsageCost": "0.00 jaarabonnement",
    "AddressInfo": {
        "ID": 33256,
        "Title": "Herselsestraat 3",
        "AddressLine1": "Herselsestraat 3",
        "Town": "Helmond",
        "Postcode": "5708 XK",
        "CountryID": 159,
        "Latitude": 51.46084,
        "Longitude": 5.609982,
        "ContactTelephone1": "0800-3522365",
        "RelatedURL": "http://www.evnet.nl",
        "DistanceUnit": 0
    },
    "Connections": [
        {
            "ID": 36421,
            "ConnectionTypeID": 25,
            "LevelID": 2,
            "PowerKW": 11,
            "CurrentTypeID": 10
        }
    ],
    "NumberOfPoints": 2,
    "StatusTypeID": 50,
    "DateLastStatusUpdate": "2016-06-04T02:39:00Z",
    "DataQualityLevel": 3,
    "DateCreated": "2015-01-09T06:03:00Z",
    "SubmissionStatusTypeID": 100
}