{
    "IsRecentlyVerified": false,
    "ID": 67387,
    "UUID": "369DF9F4-E925-465E-B3AD-5FB035704FD7",
    "DataProviderID": 1,
    "OperatorID": 23,
    "OperatorsReference": "13158",
    "UsageTypeID": 1,
    "UsageCost": "Free",
    "AddressInfo": {
        "ID": 67733,
        "Title": "Quik Park - Tesla",
        "AddressLine1": "350 E 82nd St",
        "Town": "New York",
        "StateOrProvince": "NY",
        "Postcode": "10028",
        "CountryID": 2,
        "Latitude": 40.7743149,
        "Longitude": -73.9519209,
        "ContactTelephone1": "212-352-0514  877-798-3752",
        "AccessComments": "24 hours daily; for Tesla use only; see valet for access",
        "RelatedURL": "http://www.teslamotors.com/supercharger",
        "DistanceUnit": 0
    },
    "Connections": [
        {
            "ID": 92891,
            "ConnectionTypeID": 30,
            "StatusTypeID": 50,
            "LevelID": 2,
            "Amps": 16,
            "Voltage": 230,
            "PowerKW": 8,
            "CurrentTypeID": 10,
            "Quantity": 2
        }
    ],
    "NumberOfPoints": 2,
    "StatusTypeID": 50,
    "DateLastStatusUpdate": "2017-01-31T18:19:00Z",
    "DataQualityLevel": 3,
    "DateCreated": "2016-05-29T02:05:00Z",
    "SubmissionStatusTypeID": 100
}