{
    "IsRecentlyVerified": false,
    "ID": 34141,
    "UUID": "7746DC1B-1807-4C52-99A2-858D8BCD9338",
    "DataProviderID": 26,
    "DataProvidersReference": "48594",
    "OperatorID": 178,
    "OperatorsReference": "EVnetNL REE246",
    "UsageCost": "0.00 jaarabonnement",
    "AddressInfo": {
        "ID": 34487,
        "Title": "Sorongstraat 75",
        "AddressLine1": "Sorongstraat 75",
        "Town": "Rotterdam",
        "Postcode": "3193 ER",
        "CountryID": 159,
        "Latitude": 51.870029,
        "Longitude": 4.352011,
        "ContactTelephone1": "0800-3522365",
        "RelatedURL": "http://www.evnet.nl",
        "DistanceUnit": 0
    },
    "Connections": [
        {
            "ID": 37652,
            "ConnectionTypeID": 25,
            "LevelID": 1,
            "PowerKW": 2.3,
            "CurrentTypeID": 10
        }
    ],
    "NumberOfPoints": 2,
    "StatusTypeID": 50,
    "DateLastStatusUpdate": "2016-06-04T02:41:00Z",
    "DataQualityLevel": 3,
    "DateCreated": "2015-01-09T06:04:00Z",
    "SubmissionStatusTypeID": 100
}