{
    "IsRecentlyVerified": false,
    "ID": 175831,
    "UUID": "209B8EB2-D58B-4165-A15F-6D2C6ADBF93E",
    "DataProviderID": 1,
    "OperatorID": 203,
    "UsageTypeID": 5,
    "UsageCost": "£0.36/kWh. Other tariffs available",
    "AddressInfo": {
        "ID": 176190,
        "Title": "Windsor Place",
        "AddressLine1": "Windsor Place",
        "Town": "Cardiff",
        "StateOrProvince": "Wales",
        "Postcode": "CF10 3BZ",
        "CountryID": 1,
        "Latitude": 51.48411195707345,
        "Longitude": -3.173525273882774,
        "RelatedURL": "https://ospreycharging.co.uk/",
        "DistanceUnit": 0
    },
    "Connections": [
        {
            "ID": 273060,
            "ConnectionTypeID": 25,
            "StatusTypeID": 50,
            "LevelID": 2,
            "Amps": 32,
            "Voltage": 400,
            "PowerKW": 22,
            "CurrentTypeID": 20,
            "Quantity": 2
        },
        {
            "ID": 273061,
            "ConnectionTypeID": 2,
            "StatusTypeID": 50,
            "LevelID": 3,
            "Amps": 125,
            "Voltage": 400,
            "PowerKW": 50,
            "CurrentTypeID": 30,
            "Quantity": 2
        },
        {
            "ID": 273062,
            "ConnectionTypeID": 33,
            "StatusTypeID": 50,
            "LevelID": 3,
            "Amps": 125,
            "Voltage": 400,
            "PowerKW": 50,
            "CurrentTypeID": 30,
            "Quantity": 2
        }
    ],
    "NumberOfPoints": 1,
    "StatusTypeID": 50,
    "DateLastStatusUpdate": "2021-06-17T12:17:00Z",
    "DataQualityLevel": 1,
    "DateCreated": "2021-06-16T15:21:00Z",
    "SubmissionStatusTypeID": 200
}