{
    "IsRecentlyVerified": false,
    "ID": 184451,
    "UUID": "8AE01B76-CB14-4F98-9ABD-07DB397F755A",
    "DataProviderID": 29,
    "DataProvidersReference": "16130",
    "OperatorID": 45,
    "AddressInfo": {
        "ID": 184810,
        "Title": "Friedewalder Str. 25",
        "AddressLine1": "Friedewalder Str. 25",
        "Town": "Petershagen",
        "Postcode": "32469",
        "CountryID": 87,
        "Latitude": 52.354947,
        "Longitude": 8.850108,
        "DistanceUnit": 0
    },
    "Connections": [
        {
            "ID": 292753,
            "ConnectionTypeID": 33,
            "StatusTypeID": 50,
            "LevelID": 3,
            "PowerKW": 22,
            "CurrentTypeID": 30
        },
        {
            "ID": 292754,
            "ConnectionTypeID": 25,
            "StatusTypeID": 50,
            "LevelID": 2,
            "PowerKW": 11,
            "CurrentTypeID": 20
        }
    ],
    "StatusTypeID": 50,
    "DateLastStatusUpdate": "2021-07-12T02:49:00Z",
    "MetadataValues": [
        {
            "ID": 16742,
            "MetadataFieldID": 4,
            "ItemValue": "Data from the German chargepoint registry provided by Bundesnetzagentur.de under the CC-BY 4.0 license"
        }
    ],
    "DataQualityLevel": 3,
    "DateCreated": "2021-07-08T10:05:00Z",
    "SubmissionStatusTypeID": 100
}