{
    "IsRecentlyVerified": false,
    "ID": 144155,
    "UUID": "CD07F7B8-B3A1-4853-8677-4AE1810CD149",
    "DataProviderID": 2,
    "DataProvidersReference": "130301",
    "OperatorID": 90,
    "UsageTypeID": 1,
    "AddressInfo": {
        "ID": 144507,
        "Title": "Municipalité de Sainte-Anne-de-la-Rochelle",
        "AddressLine1": "142 rue Principale Est",
        "Town": "Sainte-Anne-de-la-Rochelle",
        "StateOrProvince": "QC",
        "Postcode": "J0E 2B0",
        "CountryID": 44,
        "Latitude": 45.404755,
        "Longitude": -72.401518,
        "ContactTelephone1": "877-505-2674",
        "AccessComments": "24 hours daily",
        "RelatedURL": "https://lecircuitelectrique.com/",
        "DistanceUnit": 0
    },
    "Connections": [
        {
            "ID": 200636,
            "ConnectionTypeID": 1,
            "LevelID": 2,
            "Amps": 16,
            "Voltage": 230,
            "PowerKW": 3.7,
            "CurrentTypeID": 10,
            "Quantity": 1
        }
    ],
    "StatusTypeID": 50,
    "DateLastStatusUpdate": "2020-06-26T03:09:00Z",
    "DataQualityLevel": 3,
    "DateCreated": "2019-12-24T09:23:00Z",
    "SubmissionStatusTypeID": 100
}