{
    "IsRecentlyVerified": false,
    "ID": 159688,
    "UUID": "8A86CBED-6D69-4ADB-9926-CD8849E098DA",
    "DataProviderID": 2,
    "DataProvidersReference": "158511",
    "OperatorID": 5,
    "UsageTypeID": 1,
    "AddressInfo": {
        "ID": 160045,
        "Title": "HQ1",
        "AddressLine1": "1 Penn Plaza",
        "Town": "Newark",
        "StateOrProvince": "NJ",
        "Postcode": "07102",
        "CountryID": 2,
        "Latitude": 40.734657,
        "Longitude": -74.16184,
        "ContactTelephone1": "888-758-4389",
        "AccessComments": "24 hours daily",
        "RelatedURL": "http://www.chargepoint.com/",
        "DistanceUnit": 0
    },
    "Connections": [
        {
            "ID": 229893,
            "ConnectionTypeID": 1,
            "LevelID": 2,
            "Amps": 16,
            "Voltage": 230,
            "PowerKW": 3.7,
            "CurrentTypeID": 10,
            "Quantity": 1
        }
    ],
    "StatusTypeID": 50,
    "DateLastStatusUpdate": "2020-06-26T03:03:00Z",
    "DataQualityLevel": 3,
    "DateCreated": "2020-06-26T03:03:00Z",
    "SubmissionStatusTypeID": 100
}