{
    "IsRecentlyVerified": false,
    "ID": 47380,
    "UUID": "F590AE03-5DB9-4533-9CC4-7DAA12B641D2",
    "DataProviderID": 1,
    "OperatorID": 23,
    "OperatorsReference": "7812",
    "UsageTypeID": 1,
    "UsageCost": "$0.20/min >=60kW; $0.10/min <60kW; other tariffs for older cars",
    "AddressInfo": {
        "ID": 47726,
        "Title": "Lucille's Road House - Tesla",
        "AddressLine1": "1301 N Airport Rd",
        "Town": "Weatherford",
        "StateOrProvince": "OK",
        "Postcode": "73096",
        "CountryID": 2,
        "Latitude": 35.538453,
        "Longitude": -98.6597125,
        "ContactTelephone1": "877-798-3752",
        "AccessComments": "24 hours daily; for Tesla use only",
        "RelatedURL": "http://www.teslamotors.com/supercharger",
        "DistanceUnit": 0
    },
    "Connections": [
        {
            "ID": 58417,
            "ConnectionTypeID": 27,
            "StatusTypeID": 50,
            "LevelID": 3,
            "Amps": 100,
            "Voltage": 400,
            "PowerKW": 120,
            "CurrentTypeID": 30,
            "Quantity": 6
        }
    ],
    "NumberOfPoints": 6,
    "StatusTypeID": 50,
    "DateLastStatusUpdate": "2018-03-13T13:45:00Z",
    "DataQualityLevel": 3,
    "DateCreated": "2015-05-27T08:50:00Z",
    "SubmissionStatusTypeID": 100
}