{
    "IsRecentlyVerified": false,
    "ID": 187984,
    "UUID": "404FADF8-572A-4883-B7C6-990E007F3AF9",
    "DataProviderID": 18,
    "DataProvidersReference": "076b2ed8bde20942539d7c25042d66ff",
    "OperatorID": 3345,
    "UsageTypeID": 5,
    "AddressInfo": {
        "ID": 188343,
        "Title": "LE2 1TW",
        "AddressLine1": "",
        "Town": "Leicester",
        "Postcode": "LE2 1TW",
        "CountryID": 1,
        "Latitude": 52.617866,
        "Longitude": -1.115284,
        "AccessComments": "",
        "RelatedURL": "https://char.gy",
        "DistanceUnit": 0
    },
    "Connections": [
        {
            "ID": 303327,
            "ConnectionTypeID": 25,
            "Reference": "870",
            "StatusTypeID": 50,
            "LevelID": 2,
            "Amps": 16,
            "Voltage": 230,
            "PowerKW": 3.7,
            "CurrentTypeID": 10
        }
    ],
    "StatusTypeID": 0,
    "DateLastStatusUpdate": "2021-07-12T03:39:00Z",
    "MetadataValues": [
        {
            "ID": 20224,
            "MetadataFieldID": 4,
            "ItemValue": "Contains public sector information licensed under the Open Government Licence v2.0. http://www.nationalarchives.gov.uk/doc/open-government-licence/version/2/"
        }
    ],
    "DataQualityLevel": 3,
    "DateCreated": "2021-07-12T03:39:00Z",
    "SubmissionStatusTypeID": 100
}