{
    "IsRecentlyVerified": false,
    "ID": 81827,
    "UUID": "433B3216-086B-4BEE-A613-0424CA7F993F",
    "DataProviderID": 1,
    "OperatorID": 23,
    "OperatorsReference": "7657",
    "UsageTypeID": 6,
    "AddressInfo": {
        "ID": 82173,
        "Title": "JW Marriott Desert Springs Resort and Spa",
        "AddressLine1": "74855 Country Club DR",
        "Town": "Palm Desert",
        "StateOrProvince": "CA",
        "Postcode": "92260",
        "CountryID": 2,
        "Latitude": 33.757998,
        "Longitude": -116.360617,
        "ContactTelephone1": "(760) 341-2211",
        "DistanceUnit": 0
    },
    "Connections": [
        {
            "ID": 116585,
            "ConnectionTypeID": 30,
            "StatusTypeID": 50,
            "LevelID": 2,
            "Amps": 16,
            "Voltage": 400,
            "PowerKW": 11,
            "CurrentTypeID": 20,
            "Quantity": 4
        }
    ],
    "NumberOfPoints": 4,
    "GeneralComments": "4 Tesla Connectors, up to 11kW.Available for patrons only. Please see valet.",
    "StatusTypeID": 50,
    "DateLastStatusUpdate": "2017-02-03T13:05:00Z",
    "DataQualityLevel": 1,
    "DateCreated": "2017-02-03T13:05:00Z",
    "SubmissionStatusTypeID": 200
}