{
    "IsRecentlyVerified": false,
    "ID": 180298,
    "UUID": "ACFD78E8-4362-43BC-9601-D88D15EEC404",
    "DataProviderID": 29,
    "DataProvidersReference": "591",
    "AddressInfo": {
        "ID": 180657,
        "Title": "Kaiserstr. 63",
        "AddressLine1": "Kaiserstr. 63",
        "Town": "Rastatt",
        "Postcode": "76437",
        "CountryID": 87,
        "Latitude": 48.859517,
        "Longitude": 8.20073,
        "DistanceUnit": 0
    },
    "Connections": [
        {
            "ID": 283195,
            "ConnectionTypeID": 25,
            "StatusTypeID": 50,
            "LevelID": 2,
            "PowerKW": 22,
            "CurrentTypeID": 20
        },
        {
            "ID": 283196,
            "ConnectionTypeID": 25,
            "StatusTypeID": 50,
            "LevelID": 2,
            "PowerKW": 22,
            "CurrentTypeID": 20
        }
    ],
    "StatusTypeID": 50,
    "DateLastStatusUpdate": "2021-07-12T02:42:00Z",
    "MetadataValues": [
        {
            "ID": 12592,
            "MetadataFieldID": 4,
            "ItemValue": "Data from the German chargepoint registry provided by Bundesnetzagentur.de under the CC-BY 4.0 license"
        }
    ],
    "DataQualityLevel": 3,
    "DateCreated": "2021-07-08T10:00:00Z",
    "SubmissionStatusTypeID": 100
}