{
    "IsRecentlyVerified": false,
    "ID": 115814,
    "UUID": "AD3D57BE-2999-4175-8E34-0EDE3A6E90EE",
    "DataProviderID": 2,
    "DataProvidersReference": "115284",
    "OperatorID": 23,
    "UsageTypeID": 1,
    "AddressInfo": {
        "ID": 116160,
        "Title": "Hampton Inn & Suites Scioto Downs - Tesla Destination",
        "AddressLine1": "5950 S High St",
        "Town": "Columbus",
        "StateOrProvince": "OH",
        "Postcode": "43137",
        "CountryID": 2,
        "Latitude": 39.852042,
        "Longitude": -83.002332,
        "ContactTelephone1": "614-491-3800  877-798-3752",
        "AccessComments": "24 hours daily; for customer use only; see front desk for access",
        "RelatedURL": "https://www.tesla.com/destination-charging",
        "DistanceUnit": 0
    },
    "Connections": [
        {
            "ID": 162855,
            "ConnectionTypeID": 30,
            "LevelID": 2,
            "Amps": 16,
            "Voltage": 230,
            "PowerKW": 3.7,
            "CurrentTypeID": 10,
            "Quantity": 3
        }
    ],
    "DateLastStatusUpdate": "2020-06-26T03:02:00Z",
    "DataQualityLevel": 3,
    "DateCreated": "2019-02-11T07:13:00Z",
    "SubmissionStatusTypeID": 100
}