{
    "IsRecentlyVerified": false,
    "ID": 36550,
    "UUID": "5978E380-C463-40B8-9FC5-D2CC00581AB1",
    "DataProviderID": 26,
    "DataProvidersReference": "50265",
    "OperatorID": 157,
    "OperatorsReference": "NewMotion 02009240",
    "UsageCost": "0.00 jaarabonnement",
    "AddressInfo": {
        "ID": 36896,
        "Title": "Eschberg 7",
        "AddressLine1": "Eschberg 7",
        "Town": "Amersfoort",
        "Postcode": "3825 BG",
        "CountryID": 159,
        "Latitude": 52.1974029541016,
        "Longitude": 5.40966987609863,
        "ContactTelephone1": "088 0109500",
        "RelatedURL": "http://thenewmotion.nl/",
        "DistanceUnit": 0
    },
    "Connections": [
        {
            "ID": 40061,
            "ConnectionTypeID": 25,
            "LevelID": 2,
            "PowerKW": 3.7,
            "CurrentTypeID": 10
        }
    ],
    "NumberOfPoints": 1,
    "StatusTypeID": 50,
    "DateLastStatusUpdate": "2016-06-04T02:51:00Z",
    "DataQualityLevel": 3,
    "DateCreated": "2015-01-09T06:05:00Z",
    "SubmissionStatusTypeID": 100
}