{
    "IsRecentlyVerified": false,
    "ID": 130068,
    "UUID": "21C2FCB9-6EC5-4C4C-8B14-BC0250119159",
    "DataProviderID": 1,
    "OperatorID": 80,
    "UsageTypeID": 4,
    "AddressInfo": {
        "ID": 130414,
        "Title": "San Nicolò d'Arcidano Centro Polivalente | EnelX",
        "AddressLine1": "Viale Repubblica",
        "Town": "San Nicolò d'Arcidano",
        "StateOrProvince": "OR",
        "Postcode": "09097",
        "CountryID": 112,
        "Latitude": 39.68341324444137,
        "Longitude": 8.646904823981117,
        "RelatedURL": "https://www.enelx.com/it/it/emobility",
        "DistanceUnit": 0
    },
    "Connections": [
        {
            "ID": 182059,
            "ConnectionTypeID": 25,
            "StatusTypeID": 50,
            "LevelID": 2,
            "Amps": 32,
            "Voltage": 400,
            "PowerKW": 22,
            "CurrentTypeID": 20,
            "Quantity": 2
        }
    ],
    "NumberOfPoints": 2,
    "StatusTypeID": 50,
    "DateLastStatusUpdate": "2019-07-30T15:13:00Z",
    "DataQualityLevel": 1,
    "DateCreated": "2019-07-30T15:13:00Z",
    "SubmissionStatusTypeID": 200
}