{
    "IsRecentlyVerified": false,
    "ID": 141760,
    "UUID": "3DF5B949-8A5E-4A8A-AD49-68F014AF4B56",
    "DataProviderID": 2,
    "DataProvidersReference": "148029",
    "OperatorID": 39,
    "UsageTypeID": 1,
    "AddressInfo": {
        "ID": 142112,
        "Title": "Riverwalk",
        "AddressLine1": "115 Wilcox Street",
        "Town": "Castle Rock",
        "StateOrProvince": "CO",
        "Postcode": "80104",
        "CountryID": 2,
        "Latitude": 39.3707962,
        "Longitude": -104.860623,
        "ContactTelephone1": "800-663-5633",
        "AccessComments": "MO: Not Specified; TU: Not Specified; WE: Not Specified; TH: Not Specified; FR: Not Specified; SA: Not Specified; SU: Not Specified",
        "RelatedURL": "http://www.semacharge.com/",
        "DistanceUnit": 0
    },
    "Connections": [
        {
            "ID": 197766,
            "ConnectionTypeID": 1,
            "LevelID": 2,
            "Amps": 16,
            "Voltage": 230,
            "PowerKW": 3.7,
            "CurrentTypeID": 10,
            "Quantity": 2
        }
    ],
    "StatusTypeID": 50,
    "DateLastStatusUpdate": "2020-06-26T03:01:00Z",
    "DataQualityLevel": 3,
    "DateCreated": "2019-12-24T09:16:00Z",
    "SubmissionStatusTypeID": 100
}