{
    "IsRecentlyVerified": false,
    "ID": 94661,
    "UUID": "3806F6F7-C7B3-4E00-8651-E98058D69907",
    "DataProviderID": 1,
    "OperatorID": 23,
    "OperatorsReference": "36848",
    "UsageTypeID": 4,
    "AddressInfo": {
        "ID": 95007,
        "Title": "Best Western Plus Tower",
        "AddressLine1": "Viale Lenin",
        "Town": "43",
        "StateOrProvince": "Bologna",
        "Postcode": "40138",
        "CountryID": 112,
        "Latitude": 44.490974,
        "Longitude": 11.390805,
        "ContactTelephone1": "+39 0516 024 111",
        "DistanceUnit": 0
    },
    "Connections": [
        {
            "ID": 133814,
            "ConnectionTypeID": 30,
            "StatusTypeID": 50,
            "LevelID": 2,
            "Amps": 32,
            "Voltage": 400,
            "PowerKW": 22,
            "CurrentTypeID": 20,
            "Quantity": 1
        }
    ],
    "NumberOfPoints": 1,
    "GeneralComments": "1 Tesla Connector, up to 22kW.Available for customers. Please call ahead.",
    "StatusTypeID": 50,
    "DateLastStatusUpdate": "2018-10-03T22:18:00Z",
    "DataQualityLevel": 1,
    "DateCreated": "2017-10-22T05:44:00Z",
    "SubmissionStatusTypeID": 200
}