{
    "IsRecentlyVerified": false,
    "ID": 17411,
    "UUID": "9BC10CD3-7428-4BBB-8EB0-6318FDBE24C7",
    "DataProviderID": 22,
    "DataProvidersReference": "980017891FF67CF8A20F23AA810E7B5A",
    "AddressInfo": {
        "ID": 17756,
        "Title": "奈良三菱橿原店",
        "AddressLine1": "奈良県橿原市曽我町36-1",
        "CountryID": 114,
        "Latitude": 34.50672158,
        "Longitude": 135.7695683,
        "ContactTelephone1": "0744-23-0981",
        "DistanceUnit": 0
    },
    "Connections": [
        {
            "ID": 17652,
            "ConnectionTypeID": 2,
            "LevelID": 2,
            "Amps": 100,
            "Voltage": 480,
            "PowerKW": 48,
            "Quantity": 1
        }
    ],
    "DateLastStatusUpdate": "2013-06-29T08:58:00Z",
    "DataQualityLevel": 2,
    "DateCreated": "2013-06-29T08:58:00Z",
    "SubmissionStatusTypeID": 200
}