{
    "IsRecentlyVerified": false,
    "ID": 173546,
    "UUID": "151327E9-E465-4363-B70D-D3306AC36764",
    "DataProviderID": 18,
    "DataProvidersReference": "eb0f08c416d76724e4d5530f736c09f4",
    "OperatorID": 2244,
    "UsageTypeID": 5,
    "AddressInfo": {
        "ID": 173905,
        "Title": "36 Senior Street",
        "AddressLine1": "36 Senior Street",
        "Town": "London",
        "Postcode": "W2 5TJ",
        "CountryID": 1,
        "Latitude": 51.521749,
        "Longitude": -0.190294,
        "AccessComments": "",
        "RelatedURL": "https://www.ubitricity.com",
        "DistanceUnit": 0
    },
    "Connections": [
        {
            "ID": 266609,
            "ConnectionTypeID": 25,
            "Reference": "suby1100006163",
            "StatusTypeID": 50,
            "LevelID": 2,
            "Amps": 16,
            "Voltage": 230,
            "PowerKW": 3.7,
            "CurrentTypeID": 10
        }
    ],
    "StatusTypeID": 0,
    "DateLastStatusUpdate": "2021-04-25T05:46:00Z",
    "MetadataValues": [
        {
            "ID": 8468,
            "MetadataFieldID": 4,
            "ItemValue": "Contains public sector information licensed under the Open Government Licence v2.0. http://www.nationalarchives.gov.uk/doc/open-government-licence/version/2/"
        }
    ],
    "DataQualityLevel": 3,
    "DateCreated": "2021-03-03T11:25:00Z",
    "SubmissionStatusTypeID": 100
}