{
    "IsRecentlyVerified": false,
    "ID": 177207,
    "UUID": "4BC93483-B695-4D1C-A47C-A539B41417DC",
    "DataProviderID": 29,
    "DataProvidersReference": "5959",
    "OperatorID": 127,
    "AddressInfo": {
        "ID": 177566,
        "Title": "Hajo-Unken-Straße 15",
        "AddressLine1": "Hajo-Unken-Straße 15",
        "Town": "Leer",
        "Postcode": "26789",
        "CountryID": 87,
        "Latitude": 53.23152,
        "Longitude": 7.44938999999999,
        "DistanceUnit": 0
    },
    "Connections": [
        {
            "ID": 276073,
            "ConnectionTypeID": 25,
            "StatusTypeID": 50,
            "LevelID": 2,
            "PowerKW": 22,
            "CurrentTypeID": 20
        },
        {
            "ID": 276074,
            "ConnectionTypeID": 25,
            "StatusTypeID": 50,
            "LevelID": 2,
            "PowerKW": 22,
            "CurrentTypeID": 20
        }
    ],
    "StatusTypeID": 0,
    "DateLastStatusUpdate": "2021-07-12T02:50:00Z",
    "MetadataValues": [
        {
            "ID": 9501,
            "MetadataFieldID": 4,
            "ItemValue": "Data from the German chargepoint registry provided by Bundesnetzagentur.de under the CC-BY 4.0 license"
        }
    ],
    "DataQualityLevel": 3,
    "DateCreated": "2021-07-08T09:48:00Z",
    "SubmissionStatusTypeID": 100
}