{
    "IsRecentlyVerified": false,
    "ID": 62711,
    "UUID": "30A2AA5E-C2BA-4404-96BB-7F1BF3A52404",
    "DataProviderID": 1,
    "OperatorID": 45,
    "OperatorsReference": "REICOMSA",
    "UsageTypeID": 6,
    "AddressInfo": {
        "ID": 63057,
        "Title": "Nissan Ibericar Reicomsa",
        "AddressLine1": "Calle de Raimundo Fernández Villaverde 45",
        "Town": "Madrid",
        "Postcode": "28003",
        "CountryID": 210,
        "Latitude": 40.446606,
        "Longitude": -3.697228,
        "ContactTelephone1": "+34 915 358 129",
        "RelatedURL": "http://red.nissan.es/ibericarreicomsa",
        "DistanceUnit": 0
    },
    "Connections": [
        {
            "ID": 79636,
            "ConnectionTypeID": 2,
            "LevelID": 3,
            "Amps": 125,
            "Voltage": 400,
            "PowerKW": 50,
            "CurrentTypeID": 30,
            "Quantity": 1
        }
    ],
    "NumberOfPoints": 1,
    "StatusTypeID": 50,
    "DateLastStatusUpdate": "2017-01-22T13:01:00Z",
    "DataQualityLevel": 3,
    "DateCreated": "2016-03-03T12:29:00Z",
    "SubmissionStatusTypeID": 100
}