{
    "UserComments": [
        {
            "ID": 23150,
            "ChargePointID": 161942,
            "CommentTypeID": 10,
            "UserName": "ForumElettrico.it",
            "Comment": "Installazione determinante per chi viaggia tra Liguria e Torino/resto del Piemonte. Leggi la recensione completa qui > https://www.forumelettrico.it/forum/carru-enel-x-fast-50kw-piazza-del-mercato-t11683.html",
            "RelatedURL": "https://www.forumelettrico.it/forum/carru-enel-x-fast-50kw-piazza-del-mercato-t11683.html",
            "DateCreated": "2020-08-26T15:16:22.32Z",
            "User": {
                "ID": 11749,
                "Username": "ForumElettrico.it"
            },
            "CheckinStatusTypeID": 10,
            "IsActionedByEditor": false
        }
    ],
    "MediaItems": [
        {
            "ID": 24469,
            "ChargePointID": 161942,
            "ItemURL": "https://s3-ap-southeast-2.amazonaws.com/openchargemap/images/IT/OCM161942/OCM-161942.orig.2020082615163707.jpg",
            "ItemThumbnailURL": "https://s3-ap-southeast-2.amazonaws.com/openchargemap/images/IT/OCM161942/OCM-161942.thmb.2020082615163707.jpg",
            "Comment": "",
            "IsEnabled": true,
            "IsVideo": false,
            "IsFeaturedItem": false,
            "IsExternalResource": false,
            "User": {
                "ID": 11749,
                "Username": "ForumElettrico.it"
            },
            "DateCreated": "2020-08-26T15:17:00Z"
        },
        {
            "ID": 24470,
            "ChargePointID": 161942,
            "ItemURL": "https://s3-ap-southeast-2.amazonaws.com/openchargemap/images/IT/OCM161942/OCM-161942.orig.2020082615164346.jpg",
            "ItemThumbnailURL": "https://s3-ap-southeast-2.amazonaws.com/openchargemap/images/IT/OCM161942/OCM-161942.thmb.2020082615164346.jpg",
            "Comment": "",
            "IsEnabled": true,
            "IsVideo": false,
            "IsFeaturedItem": false,
            "IsExternalResource": false,
            "User": {
                "ID": 11749,
                "Username": "ForumElettrico.it"
            },
            "DateCreated": "2020-08-26T15:17:00Z"
        },
        {
            "ID": 24471,
            "ChargePointID": 161942,
            "ItemURL": "https://s3-ap-southeast-2.amazonaws.com/openchargemap/images/IT/OCM161942/OCM-161942.orig.2020082615164930.jpg",
            "ItemThumbnailURL": "https://s3-ap-southeast-2.amazonaws.com/openchargemap/images/IT/OCM161942/OCM-161942.thmb.2020082615164930.jpg",
            "Comment": "",
            "IsEnabled": true,
            "IsVideo": false,
            "IsFeaturedItem": false,
            "IsExternalResource": false,
            "User": {
                "ID": 11749,
                "Username": "ForumElettrico.it"
            },
            "DateCreated": "2020-08-26T15:17:00Z"
        }
    ],
    "IsRecentlyVerified": false,
    "ID": 161942,
    "UUID": "E4165670-E525-477C-AAFA-AE0BC5ADD655",
    "DataProviderID": 1,
    "OperatorID": 80,
    "UsageTypeID": 4,
    "AddressInfo": {
        "ID": 162299,
        "Title": "Carrù Mercato | ENELX FAST",
        "AddressLine1": "Piazza Mercato",
        "Town": "Carrù",
        "StateOrProvince": "CN",
        "Postcode": "12061",
        "CountryID": 112,
        "Latitude": 44.478921942945334,
        "Longitude": 7.87516765551652,
        "RelatedURL": "https://www.enelx.com/it/it/emobility",
        "DistanceUnit": 0
    },
    "Connections": [
        {
            "ID": 233059,
            "ConnectionTypeID": 33,
            "StatusTypeID": 50,
            "LevelID": 3,
            "Amps": 120,
            "Voltage": 500,
            "PowerKW": 50,
            "CurrentTypeID": 30,
            "Quantity": 1
        },
        {
            "ID": 233060,
            "ConnectionTypeID": 2,
            "StatusTypeID": 50,
            "LevelID": 3,
            "Amps": 120,
            "Voltage": 500,
            "PowerKW": 50,
            "CurrentTypeID": 30,
            "Quantity": 1
        },
        {
            "ID": 233061,
            "ConnectionTypeID": 1036,
            "StatusTypeID": 50,
            "LevelID": 3,
            "Amps": 64,
            "Voltage": 400,
            "PowerKW": 43,
            "CurrentTypeID": 20,
            "Quantity": 1
        }
    ],
    "NumberOfPoints": 2,
    "StatusTypeID": 50,
    "DateLastStatusUpdate": "2020-11-16T18:16:00Z",
    "DataQualityLevel": 1,
    "DateCreated": "2020-07-29T07:53:00Z",
    "SubmissionStatusTypeID": 200
}