{
    "IsRecentlyVerified": false,
    "ID": 176588,
    "UUID": "8D7A9E6D-E136-4D01-A4F8-DD04CEA898D1",
    "DataProviderID": 29,
    "DataProvidersReference": "1076",
    "AddressInfo": {
        "ID": 176947,
        "Title": "Sudelfeldstraße 106",
        "AddressLine1": "Sudelfeldstraße 106",
        "Town": "Brannenburg",
        "Postcode": "83098",
        "CountryID": 87,
        "Latitude": 47.725245,
        "Longitude": 12.093061,
        "DistanceUnit": 0
    },
    "Connections": [
        {
            "ID": 274674,
            "ConnectionTypeID": 25,
            "StatusTypeID": 50,
            "LevelID": 2,
            "PowerKW": 22,
            "CurrentTypeID": 20
        },
        {
            "ID": 274675,
            "ConnectionTypeID": 25,
            "StatusTypeID": 50,
            "LevelID": 2,
            "PowerKW": 22,
            "CurrentTypeID": 20
        }
    ],
    "StatusTypeID": 0,
    "DateLastStatusUpdate": "2021-07-09T03:10:00Z",
    "MetadataValues": [
        {
            "ID": 8883,
            "MetadataFieldID": 4,
            "ItemValue": "Data from the German chargepoint registry provided by Bundesnetzagentur.de under the CC-BY 4.0 license"
        }
    ],
    "DataQualityLevel": 3,
    "DateCreated": "2021-07-08T09:48:00Z",
    "SubmissionStatusTypeID": 100
}