{
    "UserComments": [
        {
            "ID": 22428,
            "ChargePointID": 155493,
            "CommentTypeID": 10,
            "UserName": "ForumElettrico.it",
            "Comment": "La postazione permette di arrivare in centro a piedi in poco tempo, dove ci sono tanti locali. Leggi la recensione qui > https://www.forumelettrico.it/forum/colonnina-ricarica-22-kw-via-giorgi-privata-sarzana-t6972.html",
            "RelatedURL": "https://www.forumelettrico.it/forum/colonnina-ricarica-22-kw-via-giorgi-privata-sarzana-t6972.html",
            "DateCreated": "2020-04-14T09:58:05.323Z",
            "User": {
                "ID": 11749,
                "Username": "ForumElettrico.it"
            },
            "CheckinStatusTypeID": 10,
            "IsActionedByEditor": false
        }
    ],
    "MediaItems": [
        {
            "ID": 21936,
            "ChargePointID": 155493,
            "ItemURL": "https://s3-ap-southeast-2.amazonaws.com/openchargemap/images/IT/OCM155493/OCM-155493.orig.2020041409581577.jpg",
            "ItemThumbnailURL": "https://s3-ap-southeast-2.amazonaws.com/openchargemap/images/IT/OCM155493/OCM-155493.thmb.2020041409581577.jpg",
            "Comment": "",
            "IsEnabled": true,
            "IsVideo": false,
            "IsFeaturedItem": false,
            "IsExternalResource": false,
            "User": {
                "ID": 11749,
                "Username": "ForumElettrico.it"
            },
            "DateCreated": "2020-04-14T09:58:00Z"
        },
        {
            "ID": 21937,
            "ChargePointID": 155493,
            "ItemURL": "https://s3-ap-southeast-2.amazonaws.com/openchargemap/images/IT/OCM155493/OCM-155493.orig.2020041409582124.jpg",
            "ItemThumbnailURL": "https://s3-ap-southeast-2.amazonaws.com/openchargemap/images/IT/OCM155493/OCM-155493.thmb.2020041409582124.jpg",
            "Comment": "",
            "IsEnabled": true,
            "IsVideo": false,
            "IsFeaturedItem": false,
            "IsExternalResource": false,
            "User": {
                "ID": 11749,
                "Username": "ForumElettrico.it"
            },
            "DateCreated": "2020-04-14T09:58:00Z"
        },
        {
            "ID": 21938,
            "ChargePointID": 155493,
            "ItemURL": "https://s3-ap-southeast-2.amazonaws.com/openchargemap/images/IT/OCM155493/OCM-155493.orig.2020041409582782.jpg",
            "ItemThumbnailURL": "https://s3-ap-southeast-2.amazonaws.com/openchargemap/images/IT/OCM155493/OCM-155493.thmb.2020041409582782.jpg",
            "Comment": "",
            "IsEnabled": true,
            "IsVideo": false,
            "IsFeaturedItem": false,
            "IsExternalResource": false,
            "User": {
                "ID": 11749,
                "Username": "ForumElettrico.it"
            },
            "DateCreated": "2020-04-14T09:58:00Z"
        }
    ],
    "IsRecentlyVerified": false,
    "ID": 155493,
    "UUID": "4BB6EBB6-4FA3-4FD6-87AD-D84FBE75FD2A",
    "DataProviderID": 1,
    "OperatorID": 1,
    "UsageTypeID": 1,
    "AddressInfo": {
        "ID": 155847,
        "Title": "Ricarica Multisala Moderno",
        "AddressLine1": "Via Privata Giorgi 9",
        "Town": "Sarzana",
        "StateOrProvince": "SP",
        "CountryID": 112,
        "Latitude": 44.1127,
        "Longitude": 9.957171,
        "RelatedURL": "https://www.forumelettrico.it/forum/colonnina-ricarica-22-kw-via-giorgi-privata-sarzana-t6972.html",
        "DistanceUnit": 0
    },
    "Connections": [
        {
            "ID": 218912,
            "ConnectionTypeID": 25,
            "LevelID": 2,
            "PowerKW": 22
        }
    ],
    "NumberOfPoints": 1,
    "StatusTypeID": 50,
    "DateLastStatusUpdate": "2020-04-14T09:58:00Z",
    "DataQualityLevel": 1,
    "DateCreated": "2020-04-14T09:57:00Z",
    "SubmissionStatusTypeID": 200
}