{
    "IsRecentlyVerified": false,
    "ID": 73582,
    "UUID": "4CED5F55-A92B-4284-BF52-7D2759718D10",
    "DataProviderID": 1,
    "OperatorID": 89,
    "OperatorsReference": "CEA-10241",
    "UsageTypeID": 4,
    "UsageCost": "CAD 1.00/hour",
    "AddressInfo": {
        "ID": 73928,
        "Title": "St-Agapit-Complexe des Seigneuries",
        "AddressLine1": "1080 avenue Bergeron",
        "Town": "Saint-Agapit",
        "StateOrProvince": "QC",
        "Postcode": "G0S 1Z0",
        "CountryID": 44,
        "Latitude": 46.563661,
        "Longitude": -71.43698,
        "DistanceUnit": 0
    },
    "Connections": [
        {
            "ID": 105871,
            "ConnectionTypeID": 1,
            "StatusTypeID": 50,
            "LevelID": 2,
            "Amps": 32,
            "Voltage": 230,
            "PowerKW": 7,
            "CurrentTypeID": 10,
            "Quantity": 1
        }
    ],
    "NumberOfPoints": 1,
    "StatusTypeID": 50,
    "DateLastStatusUpdate": "2016-11-27T21:13:00Z",
    "DataQualityLevel": 1,
    "DateCreated": "2016-11-23T22:18:00Z",
    "SubmissionStatusTypeID": 200
}