{
    "IsRecentlyVerified": false,
    "ID": 90176,
    "UUID": "7388F9E3-057E-4E70-B192-A78D116B7BF7",
    "DataProviderID": 1,
    "OperatorID": 23,
    "OperatorsReference": "31557",
    "UsageTypeID": 4,
    "AddressInfo": {
        "ID": 90522,
        "Title": "Domaine d'Essendiéras",
        "AddressLine1": "Domaine d'Essendiéras",
        "Town": "Saint Médard d'Excideuil",
        "Postcode": "24160",
        "CountryID": 80,
        "Latitude": 45.355258,
        "Longitude": 1.094706,
        "ContactTelephone1": "+33 5 53 55 34 34",
        "DistanceUnit": 0
    },
    "Connections": [
        {
            "ID": 127829,
            "ConnectionTypeID": 30,
            "StatusTypeID": 50,
            "LevelID": 2,
            "Amps": 32,
            "Voltage": 230,
            "PowerKW": 17,
            "CurrentTypeID": 20,
            "Quantity": 1
        }
    ],
    "NumberOfPoints": 1,
    "GeneralComments": "1 Tesla Connector, up to 17kW.Available to the public. Self park.",
    "StatusTypeID": 50,
    "DateLastStatusUpdate": "2018-10-03T15:00:00Z",
    "DataQualityLevel": 1,
    "DateCreated": "2017-07-13T14:07:00Z",
    "SubmissionStatusTypeID": 200
}