{
    "IsRecentlyVerified": false,
    "ID": 172677,
    "UUID": "E2DF7F5F-B5C3-49E4-AC1D-AE66372FC57D",
    "DataProviderID": 1,
    "OperatorID": 1,
    "UsageTypeID": 4,
    "AddressInfo": {
        "ID": 173036,
        "Title": "Cambrils Jaume I",
        "AddressLine1": "Rambla de Jaume I",
        "Town": "Cambrils",
        "StateOrProvince": "Tarragona",
        "Postcode": "43850",
        "CountryID": 210,
        "Latitude": 41.067193140003155,
        "Longitude": 1.0639182841944148,
        "DistanceUnit": 0
    },
    "Connections": [
        {
            "ID": 264063,
            "ConnectionTypeID": 33,
            "StatusTypeID": 50,
            "LevelID": 3,
            "PowerKW": 50,
            "CurrentTypeID": 30,
            "Quantity": 1
        },
        {
            "ID": 264064,
            "ConnectionTypeID": 2,
            "StatusTypeID": 50,
            "LevelID": 3,
            "PowerKW": 50,
            "CurrentTypeID": 30,
            "Quantity": 1
        },
        {
            "ID": 264065,
            "ConnectionTypeID": 1036,
            "StatusTypeID": 50,
            "LevelID": 2,
            "PowerKW": 22,
            "Quantity": 1
        }
    ],
    "NumberOfPoints": 1,
    "GeneralComments": "Targeta de l'Aliança de Municipis, Aplicació EV Charge o clauer Electromaps. Trio amb dues places reservades",
    "StatusTypeID": 50,
    "DateLastStatusUpdate": "2021-02-13T01:07:00Z",
    "DataQualityLevel": 1,
    "DateCreated": "2021-02-12T16:22:00Z",
    "SubmissionStatusTypeID": 200
}