{
    "IsRecentlyVerified": false,
    "ID": 9578,
    "UUID": "CAA45981-F426-4A9B-8CF5-F75B999D086A",
    "DataProviderID": 15,
    "DataProvidersReference": "15070",
    "OperatorID": 5,
    "AddressInfo": {
        "ID": 9475,
        "Title": "45110 3rd St E",
        "AddressLine1": "45110 3rd St E",
        "Town": "Lancaster",
        "StateOrProvince": "California",
        "Postcode": "93535",
        "CountryID": 2,
        "Latitude": 34.7025795,
        "Longitude": -118.1253357,
        "ContactTelephone1": "(661) 942-3431",
        "RelatedURL": "http://carstations.com/15070",
        "DistanceUnit": 0
    },
    "Connections": [
        {
            "ID": 7286,
            "ConnectionTypeID": 1,
            "Reference": "J1772",
            "LevelID": 2
        },
        {
            "ID": 8482,
            "ConnectionTypeID": 9,
            "Reference": "NEMA5",
            "Quantity": 1
        }
    ],
    "StatusTypeID": 0,
    "DateLastStatusUpdate": "2017-11-04T14:04:00Z",
    "DataQualityLevel": 2,
    "DateCreated": "2012-02-26T15:07:00Z",
    "SubmissionStatusTypeID": 100
}