{
    "IsRecentlyVerified": false,
    "ID": 149642,
    "UUID": "DDA40407-7B85-402B-8EF7-E7378D03E928",
    "DataProviderID": 1,
    "OperatorID": 23,
    "OperatorsReference": "53072",
    "UsageTypeID": 4,
    "AddressInfo": {
        "ID": 149995,
        "Title": "Baker and Brewer",
        "AddressLine1": "94 Stuart Street",
        "Town": "Charleston",
        "StateOrProvince": "South Caroline",
        "Postcode": "29403",
        "CountryID": 2,
        "Latitude": 32.802496,
        "Longitude": -79.942195,
        "ContactTelephone1": "(843) 297-8233",
        "DistanceUnit": 0
    },
    "Connections": [
        {
            "ID": 207760,
            "ConnectionTypeID": 30,
            "StatusTypeID": 50,
            "LevelID": 2,
            "PowerKW": 7,
            "CurrentTypeID": 20,
            "Quantity": 2
        }
    ],
    "NumberOfPoints": 2,
    "GeneralComments": "2 Tesla Connectors, up to 7kW.Available for Customers ",
    "StatusTypeID": 50,
    "DateLastStatusUpdate": "2020-03-02T06:52:00Z",
    "DataQualityLevel": 1,
    "DateCreated": "2020-03-02T06:52:00Z",
    "SubmissionStatusTypeID": 200
}