{
    "IsRecentlyVerified": false,
    "ID": 100012,
    "UUID": "487FA87D-4D5D-4E8D-8032-19C6333DCD51",
    "DataProviderID": 1,
    "OperatorID": 3297,
    "UsageTypeID": 4,
    "AddressInfo": {
        "ID": 100358,
        "Title": "Neuastenberger Straße",
        "AddressLine1": "Neuastenberger Straße 15",
        "Town": "Winterberg",
        "StateOrProvince": "Hochsauerlandkreis",
        "Postcode": "59955",
        "CountryID": 87,
        "Latitude": 51.16142689010394,
        "Longitude": 8.484064370708428,
        "AccessComments": "24/7 nutzbare Ladestation im Verbund LastMileSolutions der Entega. Freischaltbar auch mit PlugSurfing oder New Motion Ladekarten bzw. App.",
        "DistanceUnit": 0
    },
    "Connections": [
        {
            "ID": 141264,
            "ConnectionTypeID": 25,
            "StatusTypeID": 50,
            "LevelID": 2,
            "Amps": 16,
            "Voltage": 400,
            "PowerKW": 11,
            "CurrentTypeID": 20,
            "Quantity": 1
        }
    ],
    "NumberOfPoints": 1,
    "StatusTypeID": 50,
    "DateLastStatusUpdate": "2018-02-09T06:54:00Z",
    "DataQualityLevel": 1,
    "DateCreated": "2018-02-09T06:54:00Z",
    "SubmissionStatusTypeID": 200
}