{
    "IsRecentlyVerified": false,
    "ID": 7049,
    "UUID": "E952067E-9D82-4263-916F-8CC5AA7DE408",
    "DataProviderID": 1,
    "UsageTypeID": 1,
    "UsageCost": "Free",
    "AddressInfo": {
        "ID": 6950,
        "Title": "Parking \"Pessac Centre\"",
        "AddressLine1": " Rue des Poilus",
        "AddressLine2": "",
        "Town": "Pessac",
        "StateOrProvince": "",
        "Postcode": "",
        "CountryID": 80,
        "Latitude": 44.805145,
        "Longitude": -0.6322834999999714,
        "ContactTelephone1": "+33 (0)5.56.99.50.00",
        "ContactTelephone2": "",
        "ContactEmail": "contact@parcub.com",
        "AccessComments": "",
        "DistanceUnit": 0
    },
    "Connections": [],
    "NumberOfPoints": 2,
    "GeneralComments": "Proche du poste de garde niveau 0",
    "DateLastConfirmed": "2011-10-18T13:54:00Z",
    "StatusTypeID": 0,
    "DateLastStatusUpdate": "2011-10-18T13:54:00Z",
    "DataQualityLevel": 1,
    "DateCreated": "2011-10-18T13:54:00Z",
    "SubmissionStatusTypeID": 200
}