{
    "IsRecentlyVerified": false,
    "ID": 31749,
    "UUID": "4CDC0327-9C88-42A0-99CD-45196DD5FDF6",
    "DataProviderID": 1,
    "OperatorID": 157,
    "OperatorsReference": "NewMotion ICUEVE000425",
    "UsageCost": "0.00 jaarabonnement",
    "AddressInfo": {
        "ID": 32095,
        "Title": "Bronnmattstraße 9",
        "AddressLine1": "Bronnmattstraße 9",
        "Town": "Kappelrodeck",
        "Postcode": "77876",
        "CountryID": 87,
        "Latitude": 48.5962104797363,
        "Longitude": 8.11222934722901,
        "ContactTelephone1": "088 0109500",
        "RelatedURL": "http://thenewmotion.nl/",
        "DistanceUnit": 0
    },
    "Connections": [
        {
            "ID": 35260,
            "ConnectionTypeID": 25,
            "LevelID": 2,
            "PowerKW": 22,
            "CurrentTypeID": 10
        }
    ],
    "NumberOfPoints": 2,
    "StatusTypeID": 50,
    "DateLastStatusUpdate": "2021-04-25T05:14:00Z",
    "DataQualityLevel": 3,
    "DateCreated": "2015-01-09T06:03:00Z",
    "SubmissionStatusTypeID": 200
}