{
    "IsRecentlyVerified": false,
    "ID": 28073,
    "UUID": "632A4C8A-E4F0-4671-9C08-E2CCB6B0018E",
    "DataProviderID": 2,
    "DataProvidersReference": "42715",
    "OperatorID": 39,
    "UsageTypeID": 4,
    "AddressInfo": {
        "ID": 28419,
        "Title": "Walgreens - Baltimore, MD #10076",
        "AddressLine1": "2560 Quarry Lake Drive",
        "Town": "Baltimore",
        "StateOrProvince": "MD",
        "Postcode": "21209",
        "CountryID": 2,
        "Latitude": 39.3847962,
        "Longitude": -76.686881,
        "ContactTelephone1": "800-663-5633",
        "AccessComments": "MO: Not Specified; TU: Not Specified; WE: Not Specified; TH: Not Specified; FR: Not Specified; SA: Not Specified; SU: Not Specified",
        "RelatedURL": "http://www.semacharge.com/",
        "DistanceUnit": 0
    },
    "Connections": [
        {
            "ID": 30848,
            "ConnectionTypeID": 1,
            "LevelID": 2,
            "Amps": 16,
            "Voltage": 230,
            "PowerKW": 3,
            "CurrentTypeID": 10,
            "Quantity": 1
        }
    ],
    "DateLastStatusUpdate": "2019-04-06T04:03:00Z",
    "DataQualityLevel": 3,
    "DateCreated": "2014-11-28T03:38:00Z",
    "SubmissionStatusTypeID": 100
}