{
    "UserComments": [
        {
            "ID": 13879,
            "ChargePointID": 61502,
            "CommentTypeID": 10,
            "UserName": "Zyg0te",
            "Comment": "Fungerte fint å lade her i dag også!",
            "Rating": 5,
            "DateCreated": "2016-07-24T08:25:52.843Z",
            "User": {
                "ID": 7885,
                "Username": "Zyg0te"
            }
        },
        {
            "ID": 13807,
            "ChargePointID": 61502,
            "CommentTypeID": 10,
            "UserName": "Zyg0te",
            "Comment": "Stort sett alltid ledig ladeplass her. Utmerket stopp før Rena.",
            "Rating": 5,
            "DateCreated": "2016-07-12T10:24:52.793Z",
            "User": {
                "ID": 7885,
                "Username": "Zyg0te"
            },
            "CheckinStatusTypeID": 10
        }
    ],
    "MediaItems": [
        {
            "ID": 6016,
            "ChargePointID": 61502,
            "ItemURL": "https://s3-ap-southeast-2.amazonaws.com/openchargemap/images/NO/OCM61502/OCM-61502.orig.2016030214140027.jpeg",
            "ItemThumbnailURL": "https://s3-ap-southeast-2.amazonaws.com/openchargemap/images/NO/OCM61502/OCM-61502.thmb.2016030214140027.jpeg",
            "Comment": "",
            "IsEnabled": true,
            "IsVideo": false,
            "IsFeaturedItem": false,
            "IsExternalResource": false,
            "User": {
                "ID": 7885,
                "Username": "Zyg0te"
            },
            "DateCreated": "2016-03-02T14:14:00Z"
        }
    ],
    "IsRecentlyVerified": false,
    "ID": 61502,
    "UUID": "303CC3E3-6019-4ABD-8FCB-42897765568A",
    "DataProviderID": 1,
    "OperatorID": 23,
    "OperatorsReference": "6876",
    "UsageTypeID": 1,
    "UsageCost": "NKR 1.70/kWh; andre tariffer for eldre biler",
    "AddressInfo": {
        "ID": 61848,
        "Title": "Elverum Supercharger",
        "AddressLine1": "Trondheimsveien 9",
        "Town": "Elverum",
        "Postcode": "2406",
        "CountryID": 168,
        "Latitude": 60.8842556729891,
        "Longitude": 11.540634071661,
        "ContactTelephone1": "80011093",
        "AccessComments": "På parkeringsplass på baksiden av Scandix Elgstua.",
        "DistanceUnit": 0
    },
    "Connections": [
        {
            "ID": 78376,
            "ConnectionTypeID": 27,
            "StatusTypeID": 50,
            "LevelID": 3,
            "Amps": 200,
            "PowerKW": 120,
            "CurrentTypeID": 30,
            "Quantity": 16
        }
    ],
    "NumberOfPoints": 16,
    "StatusTypeID": 50,
    "DateLastStatusUpdate": "2020-08-24T10:47:00Z",
    "DataQualityLevel": 1,
    "DateCreated": "2016-03-02T14:14:00Z",
    "SubmissionStatusTypeID": 200
}