{
    "IsRecentlyVerified": false,
    "ID": 52824,
    "UUID": "8F4598C5-0633-44FC-A663-C37D6A0071BE",
    "DataProviderID": 1,
    "OperatorID": 32,
    "OperatorsReference": "2641",
    "UsageTypeID": 4,
    "UsageCost": "Inclusive; for Polar Plus subscription members only. Bus ride mandatory",
    "AddressInfo": {
        "ID": 53170,
        "Title": "Meynells Gorse Park and Ride",
        "AddressLine1": "Meynells Gorse Park and Ride",
        "Town": "Leicester",
        "StateOrProvince": "Leicestershire",
        "Postcode": "LE3 3LF",
        "CountryID": 1,
        "Latitude": 52.628101,
        "Longitude": -1.20224,
        "DistanceUnit": 0
    },
    "Connections": [
        {
            "ID": 65735,
            "ConnectionTypeID": 25,
            "StatusTypeID": 50,
            "LevelID": 2,
            "Amps": 32,
            "Voltage": 230,
            "PowerKW": 7,
            "CurrentTypeID": 10,
            "Quantity": 2
        }
    ],
    "NumberOfPoints": 4,
    "StatusTypeID": 50,
    "DateLastStatusUpdate": "2019-03-09T06:13:00Z",
    "DataQualityLevel": 1,
    "DateCreated": "2015-09-12T07:59:00Z",
    "SubmissionStatusTypeID": 200
}