{
    "IsRecentlyVerified": false,
    "ID": 141085,
    "UUID": "3E479C94-2EBF-4A5C-B6A9-B7A3428D938D",
    "DataProviderID": 2,
    "DataProvidersReference": "93556",
    "OperatorID": 15,
    "UsageTypeID": 4,
    "AddressInfo": {
        "ID": 141437,
        "Title": "Lucky",
        "AddressLine1": "1312 Trancas St",
        "Town": "Napa",
        "StateOrProvince": "CA",
        "Postcode": "94558",
        "CountryID": 2,
        "Latitude": 38.323631,
        "Longitude": -122.301407,
        "ContactTelephone1": "877-455-3833",
        "AccessComments": "24 hours daily\r\nPublic - Card key at all times",
        "RelatedURL": "https://www.evgo.com/",
        "DistanceUnit": 0
    },
    "Connections": [
        {
            "ID": 196909,
            "ConnectionTypeID": 2,
            "LevelID": 3,
            "Amps": 100,
            "Voltage": 400,
            "PowerKW": 40,
            "CurrentTypeID": 30,
            "Quantity": 1
        },
        {
            "ID": 196910,
            "ConnectionTypeID": 32,
            "LevelID": 3,
            "Amps": 100,
            "Voltage": 400,
            "PowerKW": 40,
            "CurrentTypeID": 30,
            "Quantity": 1
        }
    ],
    "StatusTypeID": 50,
    "DateLastStatusUpdate": "2020-06-26T02:59:00Z",
    "DataQualityLevel": 3,
    "DateCreated": "2019-12-24T09:14:00Z",
    "SubmissionStatusTypeID": 100
}