{
    "IsRecentlyVerified": false,
    "ID": 124571,
    "UUID": "35253F30-0C96-4A9C-BD0B-8806D795B88D",
    "DataProviderID": 2,
    "DataProvidersReference": "63013",
    "OperatorID": 5,
    "UsageTypeID": 1,
    "AddressInfo": {
        "ID": 124917,
        "Title": "MONOGRAM RES",
        "AddressLine1": "8210 Crestwood Heights Dr",
        "Town": "Tysons Corner",
        "StateOrProvince": "VA",
        "Postcode": "22102",
        "CountryID": 2,
        "Latitude": 38.930426,
        "Longitude": -77.2280368,
        "ContactTelephone1": "888-758-4389",
        "AccessComments": "24 hours daily",
        "RelatedURL": "http://www.chargepoint.com/",
        "DistanceUnit": 0
    },
    "Connections": [
        {
            "ID": 174687,
            "ConnectionTypeID": 1,
            "LevelID": 2,
            "Amps": 16,
            "Voltage": 230,
            "PowerKW": 3.7,
            "CurrentTypeID": 10,
            "Quantity": 2
        }
    ],
    "DateLastStatusUpdate": "2020-06-26T03:00:00Z",
    "DataQualityLevel": 3,
    "DateCreated": "2019-04-06T05:03:00Z",
    "SubmissionStatusTypeID": 100
}