{
    "IsRecentlyVerified": false,
    "ID": 63588,
    "UUID": "73F442C2-E375-4CF2-96BD-1A70AC33968B",
    "DataProviderID": 26,
    "DataProvidersReference": "78238",
    "OperatorID": 180,
    "OperatorsReference": "Alfen GDH3942",
    "UsageCost": "0.00 jaarabonnement",
    "AddressInfo": {
        "ID": 63934,
        "Title": "Hellingweg 21",
        "AddressLine1": "Hellingweg 21",
        "Town": "Den Haag",
        "Postcode": "2583 DZ",
        "CountryID": 159,
        "Latitude": 52.097653,
        "Longitude": 4.26598,
        "ContactTelephone1": "036 - 549 34 00",
        "RelatedURL": "http://www.icu-charging-stations.com/",
        "DistanceUnit": 0
    },
    "Connections": [
        {
            "ID": 81147,
            "ConnectionTypeID": 25,
            "LevelID": 2,
            "PowerKW": 11,
            "CurrentTypeID": 10
        },
        {
            "ID": 81148,
            "ConnectionTypeID": 25,
            "LevelID": 2,
            "PowerKW": 11,
            "CurrentTypeID": 10
        }
    ],
    "NumberOfPoints": 1,
    "StatusTypeID": 50,
    "DateLastStatusUpdate": "2016-06-04T02:50:00Z",
    "DataQualityLevel": 3,
    "DateCreated": "2016-03-03T12:31:00Z",
    "SubmissionStatusTypeID": 100
}