{
    "IsRecentlyVerified": false,
    "ID": 178382,
    "UUID": "367EB9D0-7E6A-4734-98DD-85809C3416D6",
    "DataProviderID": 29,
    "DataProvidersReference": "14653",
    "OperatorID": 3403,
    "AddressInfo": {
        "ID": 178741,
        "Title": "Hechthof ",
        "AddressLine1": "Hechthof ",
        "Town": "Altomünster",
        "Postcode": "85250",
        "CountryID": 87,
        "Latitude": 48.3878,
        "Longitude": 11.2533,
        "DistanceUnit": 0
    },
    "Connections": [
        {
            "ID": 278713,
            "ConnectionTypeID": 25,
            "StatusTypeID": 50,
            "LevelID": 2,
            "PowerKW": 11,
            "CurrentTypeID": 20
        },
        {
            "ID": 278714,
            "ConnectionTypeID": 25,
            "StatusTypeID": 50,
            "LevelID": 2,
            "PowerKW": 22,
            "CurrentTypeID": 20
        }
    ],
    "StatusTypeID": 0,
    "DateLastStatusUpdate": "2021-07-12T02:41:00Z",
    "MetadataValues": [
        {
            "ID": 10676,
            "MetadataFieldID": 4,
            "ItemValue": "Data from the German chargepoint registry provided by Bundesnetzagentur.de under the CC-BY 4.0 license"
        }
    ],
    "DataQualityLevel": 3,
    "DateCreated": "2021-07-08T09:50:00Z",
    "SubmissionStatusTypeID": 100
}