{
    "IsRecentlyVerified": false,
    "ID": 120685,
    "UUID": "13B000AA-EE60-4983-964B-F867E2E8D978",
    "DataProviderID": 2,
    "DataProvidersReference": "69173",
    "OperatorID": 5,
    "UsageTypeID": 1,
    "AddressInfo": {
        "ID": 121031,
        "Title": "AZ AVILLA",
        "AddressLine1": "4200 N Falcon Dr",
        "Town": "Goodyear",
        "StateOrProvince": "AZ",
        "Postcode": "85395",
        "CountryID": 2,
        "Latitude": 33.4941696,
        "Longitude": -112.3870961,
        "ContactTelephone1": "888-758-4389",
        "AccessComments": "24 hours daily",
        "RelatedURL": "http://www.chargepoint.com/",
        "DistanceUnit": 0
    },
    "Connections": [
        {
            "ID": 170055,
            "ConnectionTypeID": 1,
            "LevelID": 2,
            "Amps": 16,
            "Voltage": 230,
            "PowerKW": 3,
            "CurrentTypeID": 10,
            "Quantity": 1
        }
    ],
    "DateLastStatusUpdate": "2019-04-01T04:59:00Z",
    "DataQualityLevel": 3,
    "DateCreated": "2019-04-01T04:59:00Z",
    "SubmissionStatusTypeID": 100
}