{
    "IsRecentlyVerified": false,
    "ID": 138927,
    "UUID": "05EEE2AC-320D-4515-BBED-4A79FD880702",
    "DataProviderID": 2,
    "DataProvidersReference": "145267",
    "OperatorID": 3293,
    "UsageTypeID": 1,
    "AddressInfo": {
        "ID": 139279,
        "Title": "Cinemark",
        "AddressLine1": "921 TX-121",
        "Town": "Allen",
        "StateOrProvince": "TX",
        "Postcode": "75013",
        "CountryID": 2,
        "Latitude": 33.143928,
        "Longitude": -96.67455,
        "ContactTelephone1": "888-264-2208",
        "AccessComments": "6am-12am daily",
        "RelatedURL": "https://voltacharging.com/",
        "DistanceUnit": 0
    },
    "Connections": [
        {
            "ID": 194159,
            "ConnectionTypeID": 1,
            "LevelID": 2,
            "Amps": 16,
            "Voltage": 230,
            "PowerKW": 3.7,
            "CurrentTypeID": 10,
            "Quantity": 2
        }
    ],
    "StatusTypeID": 50,
    "DateLastStatusUpdate": "2020-06-26T02:55:00Z",
    "DataQualityLevel": 3,
    "DateCreated": "2019-12-24T09:09:00Z",
    "SubmissionStatusTypeID": 100
}