{
    "IsRecentlyVerified": false,
    "ID": 67234,
    "UUID": "CE5543A0-BBC7-44F5-82AD-C29FFC62DDDF",
    "DataProviderID": 2,
    "DataProvidersReference": "75116",
    "OperatorID": 5,
    "UsageTypeID": 1,
    "AddressInfo": {
        "ID": 67580,
        "Title": "BMW KC SOUTH",
        "AddressLine1": "1200 W 104 St",
        "Town": "Kansas City",
        "StateOrProvince": "MO",
        "Postcode": "64114",
        "CountryID": 2,
        "Latitude": 38.938614,
        "Longitude": -94.6063198,
        "ContactTelephone1": "888-758-4389",
        "AccessComments": "24 hours daily",
        "RelatedURL": "http://www.chargepoint.com/",
        "DistanceUnit": 0
    },
    "Connections": [
        {
            "ID": 92733,
            "ConnectionTypeID": 32,
            "LevelID": 3,
            "Amps": 100,
            "Voltage": 400,
            "PowerKW": 40,
            "CurrentTypeID": 30,
            "Quantity": 1
        },
        {
            "ID": 92734,
            "ConnectionTypeID": 32,
            "LevelID": 2,
            "Amps": 100,
            "Voltage": 400,
            "PowerKW": 40,
            "CurrentTypeID": 10,
            "Quantity": 1
        }
    ],
    "DateLastStatusUpdate": "2019-12-24T09:15:00Z",
    "DataQualityLevel": 3,
    "DateCreated": "2016-05-29T02:04:00Z",
    "SubmissionStatusTypeID": 100
}