{
    "IsRecentlyVerified": false,
    "ID": 13391,
    "UUID": "5A7BBEB0-EAE6-44D1-BA8C-2652C6CAD03F",
    "DataProviderID": 15,
    "DataProvidersReference": "23087",
    "OperatorID": 1,
    "AddressInfo": {
        "ID": 13288,
        "Title": "1200 Upper James Street",
        "AddressLine1": "1200 Upper James Street",
        "Town": "Hamilton",
        "StateOrProvince": "",
        "Postcode": "L9C 3B1",
        "CountryID": 44,
        "Latitude": 43.215982,
        "Longitude": -79.887678,
        "ContactTelephone1": "(800) 569-1631",
        "RelatedURL": "http://carstations.com/23087",
        "DistanceUnit": 0
    },
    "Connections": [
        {
            "ID": 10845,
            "ConnectionTypeID": 1,
            "Reference": "J1772",
            "LevelID": 2
        }
    ],
    "StatusTypeID": 0,
    "DateLastStatusUpdate": "2017-11-04T14:04:00Z",
    "DataQualityLevel": 2,
    "DateCreated": "2012-09-28T04:32:00Z",
    "SubmissionStatusTypeID": 100
}