{
    "IsRecentlyVerified": false,
    "ID": 182799,
    "UUID": "A1F77EA8-E228-4E90-9396-38476D44DE8F",
    "DataProviderID": 29,
    "DataProvidersReference": "6007",
    "OperatorID": 69,
    "AddressInfo": {
        "ID": 183158,
        "Title": "Dr.-Ulrich-Weg 4",
        "AddressLine1": "Dr.-Ulrich-Weg 4",
        "Town": "Erding",
        "Postcode": "85435",
        "CountryID": 87,
        "Latitude": 48.30331,
        "Longitude": 11.90523,
        "DistanceUnit": 0
    },
    "Connections": [
        {
            "ID": 288975,
            "ConnectionTypeID": 25,
            "StatusTypeID": 50,
            "LevelID": 2,
            "PowerKW": 22,
            "CurrentTypeID": 20
        },
        {
            "ID": 288976,
            "ConnectionTypeID": 25,
            "StatusTypeID": 50,
            "LevelID": 2,
            "PowerKW": 22,
            "CurrentTypeID": 20
        },
        {
            "ID": 288977,
            "ConnectionTypeID": 25,
            "StatusTypeID": 50,
            "LevelID": 2,
            "PowerKW": 22,
            "CurrentTypeID": 20
        }
    ],
    "StatusTypeID": 50,
    "DateLastStatusUpdate": "2021-07-12T02:40:00Z",
    "MetadataValues": [
        {
            "ID": 15092,
            "MetadataFieldID": 4,
            "ItemValue": "Data from the German chargepoint registry provided by Bundesnetzagentur.de under the CC-BY 4.0 license"
        }
    ],
    "DataQualityLevel": 3,
    "DateCreated": "2021-07-08T10:03:00Z",
    "SubmissionStatusTypeID": 100
}