{
    "IsRecentlyVerified": false,
    "ID": 91930,
    "UUID": "A84A3D4E-49DA-404D-89A7-745751331C7F",
    "DataProviderID": 1,
    "OperatorID": 1,
    "UsageTypeID": 0,
    "UsageCost": "",
    "AddressInfo": {
        "ID": 92276,
        "Title": "Ruka parkkihalli",
        "AddressLine1": "Rukankyläntie 6",
        "AddressLine2": "",
        "Town": "Rukatunturi",
        "StateOrProvince": "Pohjois-Pohjanmaa",
        "Postcode": "93825",
        "CountryID": 79,
        "Latitude": 66.16788,
        "Longitude": 29.13788,
        "ContactTelephone1": "",
        "ContactTelephone2": "",
        "ContactEmail": "",
        "AccessComments": "Ruka parking hall",
        "RelatedURL": "",
        "DistanceUnit": 0
    },
    "Connections": [
        {
            "ID": 130323,
            "ConnectionTypeID": 25,
            "Reference": "1",
            "StatusTypeID": 0,
            "LevelID": 2,
            "Amps": 32,
            "Voltage": 400,
            "PowerKW": 22,
            "CurrentTypeID": 20,
            "Comments": "Mode 3"
        },
        {
            "ID": 130324,
            "ConnectionTypeID": 25,
            "Reference": "2",
            "StatusTypeID": 0,
            "LevelID": 2,
            "Amps": 32,
            "Voltage": 400,
            "PowerKW": 22,
            "CurrentTypeID": 20,
            "Comments": "Mode 3"
        }
    ],
    "NumberOfPoints": 2,
    "GeneralComments": "",
    "StatusTypeID": 50,
    "DateLastStatusUpdate": "2018-07-19T07:47:00Z",
    "DataQualityLevel": 2,
    "DateCreated": "2017-08-20T15:59:00Z",
    "SubmissionStatusTypeID": 100
}