{
    "IsRecentlyVerified": false,
    "ID": 160259,
    "UUID": "018CE986-8B70-416F-954C-D4BD44134FAD",
    "DataProviderID": 2,
    "DataProvidersReference": "157853",
    "UsageTypeID": 2,
    "AddressInfo": {
        "ID": 160616,
        "Title": "Ontario Charging Network LP",
        "AddressLine1": "110 Young St",
        "Town": "Alliston",
        "StateOrProvince": "ON",
        "Postcode": "L9R 1P8",
        "CountryID": 44,
        "Latitude": 44.14954,
        "Longitude": -79.8841,
        "ContactTelephone1": "",
        "AccessComments": "",
        "RelatedURL": "",
        "DistanceUnit": 0
    },
    "Connections": [
        {
            "ID": 230574,
            "ConnectionTypeID": 2,
            "LevelID": 3,
            "Amps": 100,
            "Voltage": 400,
            "PowerKW": 40,
            "CurrentTypeID": 30,
            "Quantity": 1
        },
        {
            "ID": 230575,
            "ConnectionTypeID": 32,
            "LevelID": 3,
            "Amps": 100,
            "Voltage": 400,
            "PowerKW": 40,
            "CurrentTypeID": 30,
            "Quantity": 1
        }
    ],
    "GeneralComments": "Planned for future date. Not Operational.",
    "DatePlanned": "2020-09-01T00:00:00Z",
    "StatusTypeID": 150,
    "DateLastStatusUpdate": "2020-06-26T03:07:00Z",
    "DataQualityLevel": 3,
    "DateCreated": "2020-06-26T03:07:00Z",
    "SubmissionStatusTypeID": 100
}