{
    "IsRecentlyVerified": false,
    "ID": 116161,
    "UUID": "5C57C8F4-52DE-4D56-A82E-36ACCD6930B9",
    "DataProviderID": 2,
    "DataProvidersReference": "105066",
    "OperatorID": 5,
    "UsageTypeID": 1,
    "AddressInfo": {
        "ID": 116507,
        "Title": "KING COUNTY DOT",
        "AddressLine1": "13800 SE 32nd St",
        "Town": "Bellevue",
        "StateOrProvince": "WA",
        "Postcode": "98005",
        "CountryID": 2,
        "Latitude": 47.5823364,
        "Longitude": -122.1586436,
        "ContactTelephone1": "888-758-4389",
        "AccessComments": "24 hours daily",
        "RelatedURL": "http://www.chargepoint.com/",
        "DistanceUnit": 0
    },
    "Connections": [
        {
            "ID": 163232,
            "ConnectionTypeID": 1,
            "LevelID": 2,
            "Amps": 16,
            "Voltage": 230,
            "PowerKW": 3.7,
            "CurrentTypeID": 10,
            "Quantity": 2
        }
    ],
    "DateLastStatusUpdate": "2020-06-26T03:11:00Z",
    "DataQualityLevel": 3,
    "DateCreated": "2019-02-11T07:13:00Z",
    "SubmissionStatusTypeID": 100
}