{
    "UserComments": [
        {
            "ID": 22892,
            "ChargePointID": 148823,
            "CommentTypeID": 10,
            "UserName": "ForumElettrico.it",
            "Comment": "A fianco c'è il Municipio con il suo bel parco giardino visitabile liberamente. Leggi la recensione completa qui > https://www.forumelettrico.it/forum/colonnina-hera-22-kw-municipio-di-vignola-mo-via-giuseppe-mazzini-10-t11390.html",
            "RelatedURL": "https://www.forumelettrico.it/forum/colonnina-hera-22-kw-municipio-di-vignola-mo-via-giuseppe-mazzini-10-t11390.html",
            "DateCreated": "2020-07-11T14:26:02.007Z",
            "User": {
                "ID": 11749,
                "Username": "ForumElettrico.it"
            },
            "CheckinStatusTypeID": 10,
            "IsActionedByEditor": false
        }
    ],
    "MediaItems": [
        {
            "ID": 23011,
            "ChargePointID": 148823,
            "ItemURL": "https://s3-ap-southeast-2.amazonaws.com/openchargemap/images/IT/OCM148823/OCM-148823.orig.2020071114263279.jpg",
            "ItemThumbnailURL": "https://s3-ap-southeast-2.amazonaws.com/openchargemap/images/IT/OCM148823/OCM-148823.thmb.2020071114263279.jpg",
            "Comment": "",
            "IsEnabled": true,
            "IsVideo": false,
            "IsFeaturedItem": false,
            "IsExternalResource": false,
            "User": {
                "ID": 11749,
                "Username": "ForumElettrico.it"
            },
            "DateCreated": "2020-07-11T14:27:00Z"
        },
        {
            "ID": 23012,
            "ChargePointID": 148823,
            "ItemURL": "https://s3-ap-southeast-2.amazonaws.com/openchargemap/images/IT/OCM148823/OCM-148823.orig.2020071114263957.jpg",
            "ItemThumbnailURL": "https://s3-ap-southeast-2.amazonaws.com/openchargemap/images/IT/OCM148823/OCM-148823.thmb.2020071114263957.jpg",
            "Comment": "",
            "IsEnabled": true,
            "IsVideo": false,
            "IsFeaturedItem": false,
            "IsExternalResource": false,
            "User": {
                "ID": 11749,
                "Username": "ForumElettrico.it"
            },
            "DateCreated": "2020-07-11T14:27:00Z"
        },
        {
            "ID": 23008,
            "ChargePointID": 148823,
            "ItemURL": "https://s3-ap-southeast-2.amazonaws.com/openchargemap/images/IT/OCM148823/OCM-148823.orig.2020071114261274.jpg",
            "ItemThumbnailURL": "https://s3-ap-southeast-2.amazonaws.com/openchargemap/images/IT/OCM148823/OCM-148823.thmb.2020071114261274.jpg",
            "Comment": "",
            "IsEnabled": true,
            "IsVideo": false,
            "IsFeaturedItem": false,
            "IsExternalResource": false,
            "User": {
                "ID": 11749,
                "Username": "ForumElettrico.it"
            },
            "DateCreated": "2020-07-11T14:26:00Z"
        },
        {
            "ID": 23009,
            "ChargePointID": 148823,
            "ItemURL": "https://s3-ap-southeast-2.amazonaws.com/openchargemap/images/IT/OCM148823/OCM-148823.orig.2020071114261956.jpg",
            "ItemThumbnailURL": "https://s3-ap-southeast-2.amazonaws.com/openchargemap/images/IT/OCM148823/OCM-148823.thmb.2020071114261956.jpg",
            "Comment": "",
            "IsEnabled": true,
            "IsVideo": false,
            "IsFeaturedItem": false,
            "IsExternalResource": false,
            "User": {
                "ID": 11749,
                "Username": "ForumElettrico.it"
            },
            "DateCreated": "2020-07-11T14:26:00Z"
        },
        {
            "ID": 23010,
            "ChargePointID": 148823,
            "ItemURL": "https://s3-ap-southeast-2.amazonaws.com/openchargemap/images/IT/OCM148823/OCM-148823.orig.2020071114262597.jpg",
            "ItemThumbnailURL": "https://s3-ap-southeast-2.amazonaws.com/openchargemap/images/IT/OCM148823/OCM-148823.thmb.2020071114262597.jpg",
            "Comment": "",
            "IsEnabled": true,
            "IsVideo": false,
            "IsFeaturedItem": false,
            "IsExternalResource": false,
            "User": {
                "ID": 11749,
                "Username": "ForumElettrico.it"
            },
            "DateCreated": "2020-07-11T14:26:00Z"
        }
    ],
    "IsRecentlyVerified": false,
    "ID": 148823,
    "UUID": "2FCF19B0-4C9C-4EC4-A626-F186CDF9F19A",
    "DataProviderID": 1,
    "OperatorID": 80,
    "UsageTypeID": 4,
    "AddressInfo": {
        "ID": 149175,
        "Title": "Municipio di Vignola | ENELX BY HERA",
        "AddressLine1": "Via Giuseppe Mazzini, 7",
        "Town": "Vignola",
        "StateOrProvince": "MO",
        "Postcode": "41058",
        "CountryID": 112,
        "Latitude": 44.479823840927764,
        "Longitude": 11.010694153899863,
        "RelatedURL": "https://www.enelx.com/it/it/emobility",
        "DistanceUnit": 0
    },
    "Connections": [
        {
            "ID": 206663,
            "ConnectionTypeID": 25,
            "StatusTypeID": 50,
            "LevelID": 2,
            "Amps": 32,
            "Voltage": 400,
            "PowerKW": 22,
            "CurrentTypeID": 20,
            "Quantity": 2
        }
    ],
    "NumberOfPoints": 2,
    "StatusTypeID": 150,
    "DateLastStatusUpdate": "2020-07-11T14:27:00Z",
    "DataQualityLevel": 1,
    "DateCreated": "2020-02-11T07:49:00Z",
    "SubmissionStatusTypeID": 200
}