{
    "MediaItems": [
        {
            "ID": 687,
            "ChargePointID": 24575,
            "ItemURL": "https://s3-ap-southeast-2.amazonaws.com/openchargemap/images/DE/OCM24575/OCM-24575.orig.2014102521295398.jpg",
            "ItemThumbnailURL": "https://s3-ap-southeast-2.amazonaws.com/openchargemap/images/DE/OCM24575/OCM-24575.thmb.2014102521295398.jpg",
            "Comment": "",
            "IsEnabled": true,
            "IsVideo": false,
            "IsFeaturedItem": false,
            "IsExternalResource": false,
            "User": {
                "ID": 1713,
                "Username": "Armin Lobeck"
            },
            "DateCreated": "2014-10-25T21:30:00Z"
        }
    ],
    "IsRecentlyVerified": false,
    "ID": 24575,
    "UUID": "F498E4DD-ADEB-43E0-9618-91551F315DB9",
    "DataProviderID": 1,
    "OperatorID": 45,
    "UsageTypeID": 1,
    "AddressInfo": {
        "ID": 24921,
        "Title": "GESPA GmbH",
        "AddressLine1": "Heinrich-Lersch-Str. 3",
        "Town": "Rüsselsheim",
        "StateOrProvince": "Hessen",
        "Postcode": "65428",
        "CountryID": 87,
        "Latitude": 49.9852931576435,
        "Longitude": 8.41567190489354,
        "ContactTelephone1": "06142 3009 400",
        "ContactEmail": "info@gespa-energy.de",
        "AccessComments": "Firmenparkplatz der Fa. GESPA, laden innerhalb der Öffnungszeiten Montag - Donnerstag 07:00-17:00 Uhr, Freitag von 07:00 - 14:00. Kostenloses Parken während der Ladezeit. ",
        "RelatedURL": "http://www.gespa-energy.de",
        "DistanceUnit": 0
    },
    "Connections": [
        {
            "ID": 26843,
            "ConnectionTypeID": 25,
            "StatusTypeID": 50,
            "LevelID": 2,
            "Amps": 32,
            "Voltage": 400,
            "PowerKW": 22,
            "CurrentTypeID": 20,
            "Quantity": 1
        },
        {
            "ID": 26844,
            "ConnectionTypeID": 28,
            "StatusTypeID": 50,
            "LevelID": 2,
            "Amps": 16,
            "Voltage": 230,
            "PowerKW": 4,
            "CurrentTypeID": 10,
            "Quantity": 2
        }
    ],
    "NumberOfPoints": 2,
    "StatusTypeID": 50,
    "DateLastStatusUpdate": "2014-10-27T20:37:00Z",
    "DataQualityLevel": 1,
    "DateCreated": "2014-10-19T10:09:00Z",
    "SubmissionStatusTypeID": 200
}