{
    "IsRecentlyVerified": false,
    "ID": 124717,
    "UUID": "DE14A0BC-CC3E-4B9D-831D-976048E4812C",
    "DataProviderID": 2,
    "DataProvidersReference": "46540",
    "UsageTypeID": 2,
    "AddressInfo": {
        "ID": 125063,
        "Title": "Saint Anthony Hospital",
        "AddressLine1": "11600 W 2nd Pl",
        "Town": "Lakewood",
        "StateOrProvince": "CO",
        "Postcode": "80228",
        "CountryID": 2,
        "Latitude": 39.7171136,
        "Longitude": -105.1288004,
        "ContactTelephone1": "",
        "AccessComments": "",
        "RelatedURL": "",
        "DistanceUnit": 0
    },
    "Connections": [
        {
            "ID": 174852,
            "ConnectionTypeID": 1,
            "LevelID": 2,
            "Amps": 16,
            "Voltage": 230,
            "PowerKW": 3.7,
            "CurrentTypeID": 10,
            "Quantity": 4
        }
    ],
    "DateLastStatusUpdate": "2020-06-26T03:02:00Z",
    "DataQualityLevel": 3,
    "DateCreated": "2019-04-06T05:04:00Z",
    "SubmissionStatusTypeID": 100
}