{
    "IsRecentlyVerified": false,
    "ID": 74676,
    "UUID": "23F54648-964B-4DF1-8F58-EF5199B3BCB3",
    "DataProviderID": 1,
    "DataProvidersReference": "3574",
    "AddressInfo": {
        "ID": 75022,
        "Title": "Visby Lägenhetshotell",
        "AddressLine1": "Artillerigatan 19",
        "Town": "VISBY",
        "StateOrProvince": "GOTLAND",
        "Postcode": "62138",
        "CountryID": 216,
        "Latitude": 57.63171,
        "Longitude": 18.30519,
        "AccessComments": "På parkeringsplatsen som vetter mot Kolgårdsgatan",
        "DistanceUnit": 0
    },
    "Connections": [
        {
            "ID": 107336,
            "ConnectionTypeID": 0,
            "Reference": "1",
            "LevelID": 2,
            "Amps": 16,
            "Voltage": 230,
            "PowerKW": 3.7,
            "Comments": "Mode 3"
        },
        {
            "ID": 107337,
            "ConnectionTypeID": 0,
            "Reference": "2",
            "LevelID": 2,
            "Amps": 16,
            "Voltage": 230,
            "PowerKW": 3.7,
            "Comments": "Mode 3"
        },
        {
            "ID": 107338,
            "ConnectionTypeID": 0,
            "Reference": "3",
            "LevelID": 2,
            "Amps": 16,
            "Voltage": 230,
            "PowerKW": 3.7,
            "Comments": "Mode 1"
        },
        {
            "ID": 107339,
            "ConnectionTypeID": 0,
            "Reference": "4",
            "LevelID": 2,
            "Amps": 16,
            "Voltage": 230,
            "PowerKW": 3.7,
            "Comments": "Mode 1"
        }
    ],
    "NumberOfPoints": 4,
    "DateLastStatusUpdate": "2020-05-26T08:21:00Z",
    "DataQualityLevel": 2,
    "DateCreated": "2016-12-03T02:36:00Z",
    "SubmissionStatusTypeID": 100
}