{
    "IsRecentlyVerified": false,
    "ID": 79837,
    "UUID": "30816550-C039-41DE-ABE0-AD8F3B313FA5",
    "DataProviderID": 1,
    "OperatorID": 23,
    "OperatorsReference": "11902",
    "UsageTypeID": 6,
    "UsageCost": "Free",
    "AddressInfo": {
        "ID": 80183,
        "Title": "Streamsong Resort Golf & Spa",
        "AddressLine1": "1000 Streamsong DR",
        "Town": "Streamsong",
        "StateOrProvince": "FL",
        "Postcode": "33834",
        "CountryID": 2,
        "Latitude": 27.692637,
        "Longitude": -81.934157,
        "ContactTelephone1": "(863) 428-1000",
        "DistanceUnit": 0
    },
    "Connections": [
        {
            "ID": 114484,
            "ConnectionTypeID": 30,
            "StatusTypeID": 50,
            "LevelID": 2,
            "PowerKW": 16,
            "CurrentTypeID": 20,
            "Quantity": 1
        }
    ],
    "NumberOfPoints": 1,
    "GeneralComments": "1 Tesla Connector, up to 16kW.Available for patrons only. Please see valet.",
    "StatusTypeID": 50,
    "DateLastStatusUpdate": "2017-01-30T13:27:00Z",
    "DataQualityLevel": 1,
    "DateCreated": "2017-01-30T13:27:00Z",
    "SubmissionStatusTypeID": 200
}