{
    "IsRecentlyVerified": false,
    "ID": 110965,
    "UUID": "4DFFBC2C-A934-4142-B580-3701179A87BD",
    "DataProviderID": 2,
    "DataProvidersReference": "99308",
    "UsageTypeID": 1,
    "AddressInfo": {
        "ID": 111311,
        "Title": "Appalachian Mountain Club - Cardigan Lodge",
        "AddressLine1": "774 Shem Valley Rd",
        "Town": "Alexandria",
        "StateOrProvince": "NH",
        "Postcode": "03222",
        "CountryID": 2,
        "Latitude": 43.649708,
        "Longitude": -71.877581,
        "ContactTelephone1": "603-744-8091",
        "AccessComments": "24 hours daily; donations accepted",
        "RelatedURL": "",
        "DistanceUnit": 0
    },
    "Connections": [
        {
            "ID": 156295,
            "ConnectionTypeID": 1,
            "LevelID": 2,
            "Amps": 16,
            "Voltage": 230,
            "PowerKW": 3.7,
            "CurrentTypeID": 10,
            "Quantity": 1
        }
    ],
    "DateLastStatusUpdate": "2020-06-26T03:07:00Z",
    "DataQualityLevel": 3,
    "DateCreated": "2018-10-18T23:36:00Z",
    "SubmissionStatusTypeID": 100
}