{
    "IsRecentlyVerified": false,
    "ID": 138358,
    "UUID": "F116971C-72FF-49E8-B12A-7672167B8006",
    "DataProviderID": 2,
    "DataProvidersReference": "149604",
    "OperatorID": 59,
    "UsageTypeID": 1,
    "AddressInfo": {
        "ID": 138707,
        "Title": "Greenlots - 53201",
        "AddressLine1": "200 N Sinclair Ave",
        "Town": "Tavares",
        "StateOrProvince": "FL",
        "Postcode": "32778",
        "CountryID": 2,
        "Latitude": 28.8027667999268,
        "Longitude": -81.7309417724609,
        "ContactTelephone1": "855-900-7584",
        "AccessComments": "24 hours daily",
        "RelatedURL": "http://greenlots.com/",
        "DistanceUnit": 0
    },
    "Connections": [
        {
            "ID": 193462,
            "ConnectionTypeID": 2,
            "LevelID": 3,
            "Amps": 100,
            "Voltage": 400,
            "PowerKW": 40,
            "CurrentTypeID": 30,
            "Quantity": 1
        },
        {
            "ID": 193463,
            "ConnectionTypeID": 32,
            "LevelID": 3,
            "Amps": 100,
            "Voltage": 400,
            "PowerKW": 40,
            "CurrentTypeID": 30,
            "Quantity": 1
        }
    ],
    "StatusTypeID": 50,
    "DateLastStatusUpdate": "2020-06-26T02:52:00Z",
    "DataQualityLevel": 3,
    "DateCreated": "2019-12-24T09:08:00Z",
    "SubmissionStatusTypeID": 100
}