{
    "IsRecentlyVerified": false,
    "ID": 12913,
    "UUID": "7F01C8B5-9CAC-4B93-BF53-AAD4CC90836A",
    "DataProviderID": 15,
    "DataProvidersReference": "21441",
    "OperatorID": 5,
    "AddressInfo": {
        "ID": 12810,
        "Title": "3148 Rose St.",
        "AddressLine1": "3148 Rose St.",
        "Town": "Franklin Park",
        "StateOrProvince": "Illinois",
        "Postcode": "60131",
        "CountryID": 2,
        "Latitude": 41.93677521,
        "Longitude": -87.86582947,
        "ContactTelephone1": "",
        "RelatedURL": "http://carstations.com/21441",
        "DistanceUnit": 0
    },
    "Connections": [
        {
            "ID": 10346,
            "ConnectionTypeID": 1,
            "Reference": "J1772",
            "LevelID": 2
        }
    ],
    "StatusTypeID": 0,
    "DateLastStatusUpdate": "2017-11-04T14:04:00Z",
    "DataQualityLevel": 2,
    "DateCreated": "2012-09-07T19:25:00Z",
    "SubmissionStatusTypeID": 100
}