{
    "IsRecentlyVerified": false,
    "ID": 13965,
    "UUID": "B8E31025-DE92-4E51-96F1-058E80AC0DC7",
    "DataProviderID": 2,
    "DataProvidersReference": "43249",
    "UsageTypeID": 2,
    "AddressInfo": {
        "ID": 13862,
        "Title": "DTE Energy - Pontiac Service Center",
        "AddressLine1": "1970 Orchard Lake Rd",
        "Town": "Bloomfield Township",
        "StateOrProvince": "MI",
        "Postcode": "48320",
        "CountryID": 2,
        "Latitude": 42.615654,
        "Longitude": -83.324374,
        "ContactTelephone1": "",
        "AccessComments": "Employee and official visitor use only, 24 hours daily with employee security badge",
        "RelatedURL": "",
        "DistanceUnit": 0
    },
    "Connections": [
        {
            "ID": 11397,
            "ConnectionTypeID": 1,
            "LevelID": 2,
            "Amps": 16,
            "Voltage": 230,
            "PowerKW": 3.7,
            "CurrentTypeID": 10,
            "Quantity": 2
        },
        {
            "ID": 21414,
            "ConnectionTypeID": 1,
            "LevelID": 2,
            "Quantity": 2
        }
    ],
    "DateLastStatusUpdate": "2020-06-26T03:06:00Z",
    "DataQualityLevel": 3,
    "DateCreated": "2012-12-06T16:48:00Z",
    "SubmissionStatusTypeID": 100
}