{
    "IsRecentlyVerified": false,
    "ID": 66365,
    "UUID": "DCD0EC75-0ED7-4E60-AB28-4C1545355A78",
    "DataProviderID": 1,
    "OperatorID": 108,
    "UsageTypeID": 4,
    "AddressInfo": {
        "ID": 66711,
        "Title": "Emilienstraße",
        "AddressLine1": "Emilienstraße 11",
        "AddressLine2": "Eimsbüttel",
        "Town": "Hamburg",
        "StateOrProvince": "Hamburg",
        "Postcode": "20259",
        "CountryID": 87,
        "Latitude": 53.57550939999999,
        "Longitude": 9.955540700000029,
        "AccessComments": "24/7 verfügbar mit Ladekarten Vattenfall, The New Motion, PlugSurfing, Hamburg Energie, Ladenetz oder per SMS.",
        "DistanceUnit": 0
    },
    "Connections": [
        {
            "ID": 91749,
            "ConnectionTypeID": 25,
            "StatusTypeID": 50,
            "LevelID": 2,
            "Amps": 32,
            "Voltage": 400,
            "PowerKW": 22,
            "CurrentTypeID": 20,
            "Quantity": 2
        },
        {
            "ID": 91750,
            "ConnectionTypeID": 28,
            "StatusTypeID": 50,
            "LevelID": 2,
            "Amps": 16,
            "Voltage": 230,
            "PowerKW": 3.7,
            "CurrentTypeID": 10,
            "Quantity": 2
        }
    ],
    "NumberOfPoints": 2,
    "StatusTypeID": 50,
    "DateLastStatusUpdate": "2016-05-19T06:08:00Z",
    "DataQualityLevel": 1,
    "DateCreated": "2016-05-19T06:08:00Z",
    "SubmissionStatusTypeID": 200
}