{
    "IsRecentlyVerified": false,
    "ID": 54646,
    "UUID": "C21F23D9-497B-4F63-B615-375DEF6451B6",
    "DataProviderID": 26,
    "DataProvidersReference": "71002",
    "OperatorID": 157,
    "OperatorsReference": "NewMotion 02013191",
    "UsageCost": "0.00 jaarabonnement",
    "AddressInfo": {
        "ID": 54992,
        "Title": "Boonsweg 63",
        "AddressLine1": "Boonsweg 63",
        "Town": "Binnenmaas",
        "Postcode": "3274 LH",
        "CountryID": 159,
        "Latitude": 51.8147231,
        "Longitude": 4.5210949,
        "ContactTelephone1": "088 0109500",
        "RelatedURL": "http://thenewmotion.nl/",
        "DistanceUnit": 0
    },
    "Connections": [
        {
            "ID": 68982,
            "ConnectionTypeID": 25,
            "LevelID": 2,
            "PowerKW": 3.7,
            "CurrentTypeID": 10
        }
    ],
    "NumberOfPoints": 1,
    "StatusTypeID": 50,
    "DateLastStatusUpdate": "2016-06-04T02:40:00Z",
    "DataQualityLevel": 3,
    "DateCreated": "2015-10-09T06:18:00Z",
    "SubmissionStatusTypeID": 100
}