{
    "MediaItems": [
        {
            "ID": 8293,
            "ChargePointID": 46012,
            "ItemURL": "https://s3-ap-southeast-2.amazonaws.com/openchargemap/images/NO/OCM46012/OCM-46012.orig.2016091512293713.jpg",
            "ItemThumbnailURL": "https://s3-ap-southeast-2.amazonaws.com/openchargemap/images/NO/OCM46012/OCM-46012.thmb.2016091512293713.jpg",
            "Comment": "",
            "IsEnabled": true,
            "IsVideo": false,
            "IsFeaturedItem": false,
            "IsExternalResource": false,
            "User": {
                "ID": 7885,
                "Username": "Zyg0te"
            },
            "DateCreated": "2016-09-15T12:30:00Z"
        }
    ],
    "IsRecentlyVerified": false,
    "ID": 46012,
    "UUID": "77AB32F3-D698-4557-A0AE-56BC930CBD64",
    "DataProviderID": 1,
    "UsageTypeID": 5,
    "AddressInfo": {
        "ID": 46358,
        "Title": "Circle K Sekkelsten Hurtigladestasjon, Askim",
        "AddressLine1": "Rakkestadveien 50",
        "Town": "ASKIM",
        "StateOrProvince": "Østfold",
        "Postcode": "1814",
        "CountryID": 168,
        "Latitude": 59.57438,
        "Longitude": 11.21659,
        "DistanceUnit": 0
    },
    "Connections": [
        {
            "ID": 56675,
            "ConnectionTypeID": 2,
            "Reference": "1",
            "LevelID": 3,
            "Amps": 100,
            "Voltage": 500,
            "PowerKW": 50,
            "CurrentTypeID": 30,
            "Comments": "Mode 4"
        },
        {
            "ID": 84880,
            "ConnectionTypeID": 2,
            "Reference": "2",
            "LevelID": 3,
            "Amps": 100,
            "Voltage": 500,
            "PowerKW": 50,
            "CurrentTypeID": 30,
            "Comments": "Mode 4"
        },
        {
            "ID": 88338,
            "ConnectionTypeID": 25,
            "Reference": "3",
            "LevelID": 2,
            "Amps": 63,
            "Voltage": 400,
            "PowerKW": 25,
            "CurrentTypeID": 20,
            "Comments": "Mode 3"
        }
    ],
    "NumberOfPoints": 3,
    "StatusTypeID": 50,
    "DateLastStatusUpdate": "2016-09-15T12:30:00Z",
    "DataQualityLevel": 2,
    "DateCreated": "2015-05-03T00:54:00Z",
    "SubmissionStatusTypeID": 100
}