{
    "IsRecentlyVerified": false,
    "ID": 121148,
    "UUID": "22EE61A8-949F-4B01-B3D9-10A401C16412",
    "DataProviderID": 2,
    "DataProvidersReference": "120910",
    "UsageTypeID": 1,
    "AddressInfo": {
        "ID": 121494,
        "Title": "City of Shelby",
        "AddressLine1": "126 W Marion St",
        "Town": "Shelby",
        "StateOrProvince": "NC",
        "Postcode": "28150",
        "CountryID": 2,
        "Latitude": 35.29263,
        "Longitude": -81.541347,
        "ContactTelephone1": "704-484-6866",
        "AccessComments": "24 hours daily",
        "RelatedURL": "",
        "DistanceUnit": 0
    },
    "Connections": [
        {
            "ID": 170584,
            "ConnectionTypeID": 1,
            "LevelID": 2,
            "Amps": 16,
            "Voltage": 230,
            "PowerKW": 3.7,
            "CurrentTypeID": 10,
            "Quantity": 1
        }
    ],
    "DateLastStatusUpdate": "2020-06-26T02:58:00Z",
    "DataQualityLevel": 3,
    "DateCreated": "2019-04-01T04:59:00Z",
    "SubmissionStatusTypeID": 100
}