{
    "IsRecentlyVerified": false,
    "ID": 107748,
    "UUID": "28689BFF-AB46-427D-9B0E-76AF396EC6C6",
    "DataProviderID": 1,
    "OperatorID": 105,
    "UsageTypeID": 4,
    "AddressInfo": {
        "ID": 108094,
        "Title": "Polizeistation Darmstädter Straße",
        "AddressLine1": "Darmstädter Straße 30",
        "Town": "Dietzenbach",
        "StateOrProvince": "Landkreis Offenbach",
        "Postcode": "63128",
        "CountryID": 87,
        "Latitude": 50.008869105519736,
        "Longitude": 8.777001167984054,
        "AccessComments": "24/7 nutzbar, max. 2 Stunden Parken mit Parkscheibe; gegenüber der Polizei.",
        "RelatedURL": "https://www.maingau-energie.de/e-mobilit%C3%A4t/lades%C3%A4uleninfrastruktur",
        "DistanceUnit": 0
    },
    "Connections": [
        {
            "ID": 152136,
            "ConnectionTypeID": 25,
            "StatusTypeID": 50,
            "LevelID": 2,
            "Amps": 32,
            "Voltage": 400,
            "PowerKW": 22,
            "CurrentTypeID": 20,
            "Quantity": 2
        }
    ],
    "NumberOfPoints": 2,
    "StatusTypeID": 50,
    "DateLastStatusUpdate": "2018-08-08T11:12:00Z",
    "DataQualityLevel": 1,
    "DateCreated": "2018-08-08T11:12:00Z",
    "SubmissionStatusTypeID": 200
}