{
    "IsRecentlyVerified": false,
    "ID": 179599,
    "UUID": "C2FA7BD8-42B2-4E5D-960F-042B446AF95A",
    "DataProviderID": 29,
    "DataProvidersReference": "8254",
    "AddressInfo": {
        "ID": 179958,
        "Title": "Harburgerstr. 19",
        "AddressLine1": "Harburgerstr. 19",
        "Town": "Buchholz",
        "Postcode": "21244",
        "CountryID": 87,
        "Latitude": 53.363945,
        "Longitude": 9.872744,
        "DistanceUnit": 0
    },
    "Connections": [
        {
            "ID": 281630,
            "ConnectionTypeID": 25,
            "StatusTypeID": 50,
            "LevelID": 2,
            "PowerKW": 22,
            "CurrentTypeID": 20
        },
        {
            "ID": 281631,
            "ConnectionTypeID": 25,
            "StatusTypeID": 50,
            "LevelID": 2,
            "PowerKW": 22,
            "CurrentTypeID": 20
        },
        {
            "ID": 281632,
            "ConnectionTypeID": 25,
            "StatusTypeID": 50,
            "LevelID": 2,
            "PowerKW": 22,
            "CurrentTypeID": 20
        }
    ],
    "StatusTypeID": 50,
    "DateLastStatusUpdate": "2021-07-12T02:51:00Z",
    "MetadataValues": [
        {
            "ID": 11893,
            "MetadataFieldID": 4,
            "ItemValue": "Data from the German chargepoint registry provided by Bundesnetzagentur.de under the CC-BY 4.0 license"
        }
    ],
    "DataQualityLevel": 3,
    "DateCreated": "2021-07-08T09:59:00Z",
    "SubmissionStatusTypeID": 100
}