{
    "IsRecentlyVerified": false,
    "ID": 93973,
    "UUID": "D50FE4A7-523B-4518-B1E9-77F5E0977DC6",
    "DataProviderID": 1,
    "OperatorID": 23,
    "OperatorsReference": "36296",
    "UsageTypeID": 4,
    "AddressInfo": {
        "ID": 94319,
        "Title": "Technopolis",
        "AddressLine1": "Technologielaan 1",
        "Town": "Mechelen",
        "Postcode": "2800",
        "CountryID": 26,
        "Latitude": 51.001998,
        "Longitude": 4.469994,
        "ContactTelephone1": "+32 15 34 20 00",
        "DistanceUnit": 0
    },
    "Connections": [
        {
            "ID": 133027,
            "ConnectionTypeID": 30,
            "StatusTypeID": 50,
            "LevelID": 2,
            "Amps": 16,
            "Voltage": 400,
            "PowerKW": 11,
            "CurrentTypeID": 20,
            "Quantity": 2
        }
    ],
    "NumberOfPoints": 2,
    "GeneralComments": "2 Tesla Connectors, up to 11kW.Available to the public. Self park.",
    "StatusTypeID": 50,
    "DateLastStatusUpdate": "2018-10-03T20:39:00Z",
    "DataQualityLevel": 1,
    "DateCreated": "2017-10-14T05:31:00Z",
    "SubmissionStatusTypeID": 200
}