{
    "IsRecentlyVerified": false,
    "ID": 95208,
    "UUID": "69EBDD70-0B73-469F-8EE6-8B6B7055D0E4",
    "DataProviderID": 1,
    "OperatorID": 23,
    "OperatorsReference": "37180",
    "UsageTypeID": 4,
    "AddressInfo": {
        "ID": 95554,
        "Title": "Holiday Inn Tulsa City Center",
        "AddressLine1": "17 W 7th St",
        "Town": "Tulsa",
        "StateOrProvince": "Oklahoma",
        "Postcode": "74119",
        "CountryID": 2,
        "Latitude": 36.14957,
        "Longitude": -95.990034,
        "ContactTelephone1": "(918) 585-5898",
        "DistanceUnit": 0
    },
    "Connections": [
        {
            "ID": 134876,
            "ConnectionTypeID": 30,
            "StatusTypeID": 50,
            "LevelID": 2,
            "PowerKW": 16,
            "CurrentTypeID": 20,
            "Quantity": 4
        }
    ],
    "NumberOfPoints": 4,
    "GeneralComments": "4 Tesla Connectors, up to 16kW.Available for customers. Please see front desk.",
    "StatusTypeID": 50,
    "DateLastStatusUpdate": "2017-11-05T06:56:00Z",
    "DataQualityLevel": 1,
    "DateCreated": "2017-11-05T06:56:00Z",
    "SubmissionStatusTypeID": 200
}