{
    "IsRecentlyVerified": false,
    "ID": 138839,
    "UUID": "190A5222-12BF-486B-82ED-DF867D5D690D",
    "DataProviderID": 2,
    "DataProvidersReference": "96159",
    "OperatorID": 9,
    "UsageTypeID": 1,
    "AddressInfo": {
        "ID": 139191,
        "Title": "Greenhill School Student Parking - Water Tower Lot",
        "AddressLine1": "4141 Spring Valley Road",
        "Town": "Addison",
        "StateOrProvince": "TX",
        "Postcode": "75001",
        "CountryID": 2,
        "Latitude": 32.94297,
        "Longitude": -96.84453,
        "ContactTelephone1": "888-998-2546",
        "AccessComments": "MON: 24 hours | TUE: 24 hours | WED: 24 hours | THU: 24 hours | FRI: 24 hours | SAT: 24 hours | SUN: 24 hours",
        "RelatedURL": "http://www.blinkcharging.com/",
        "DistanceUnit": 0
    },
    "Connections": [
        {
            "ID": 194056,
            "ConnectionTypeID": 1,
            "LevelID": 2,
            "Amps": 16,
            "Voltage": 230,
            "PowerKW": 3.7,
            "CurrentTypeID": 10,
            "Quantity": 2
        }
    ],
    "StatusTypeID": 50,
    "DateLastStatusUpdate": "2020-06-26T02:55:00Z",
    "DataQualityLevel": 3,
    "DateCreated": "2019-12-24T09:09:00Z",
    "SubmissionStatusTypeID": 100
}