{
    "IsRecentlyVerified": false,
    "ID": 33373,
    "UUID": "B8C7A8D6-D4AA-470F-B741-0D1D40B5A106",
    "DataProviderID": 26,
    "DataProvidersReference": "54863",
    "OperatorID": 157,
    "OperatorsReference": "NewMotion 02010243",
    "UsageCost": "0.00 jaarabonnement",
    "AddressInfo": {
        "ID": 33719,
        "Title": "Nieuweweg",
        "AddressLine1": "Nieuweweg",
        "Town": "Breda",
        "Postcode": "4811 LW",
        "CountryID": 159,
        "Latitude": 51.5874109748716,
        "Longitude": 4.77242708206177,
        "ContactTelephone1": "088 0109500",
        "RelatedURL": "http://thenewmotion.nl/",
        "DistanceUnit": 0
    },
    "Connections": [
        {
            "ID": 36884,
            "ConnectionTypeID": 25,
            "LevelID": 2,
            "PowerKW": 3.7,
            "CurrentTypeID": 10
        },
        {
            "ID": 46773,
            "ConnectionTypeID": 25,
            "LevelID": 2,
            "PowerKW": 3.7,
            "CurrentTypeID": 10
        }
    ],
    "NumberOfPoints": 1,
    "StatusTypeID": 50,
    "DateLastStatusUpdate": "2016-06-04T02:39:00Z",
    "DataQualityLevel": 3,
    "DateCreated": "2015-01-09T06:04:00Z",
    "SubmissionStatusTypeID": 100
}