{
    "IsRecentlyVerified": false,
    "ID": 177715,
    "UUID": "00F1B377-ADDC-4097-8D71-019B85F45CD6",
    "DataProviderID": 29,
    "DataProvidersReference": "20317",
    "OperatorID": 105,
    "AddressInfo": {
        "ID": 178074,
        "Title": "Perlengasse 6",
        "AddressLine1": "Perlengasse 6",
        "Town": "Kastellaun",
        "Postcode": "56288",
        "CountryID": 87,
        "Latitude": 50.072766,
        "Longitude": 7.440709,
        "DistanceUnit": 0
    },
    "Connections": [
        {
            "ID": 277188,
            "ConnectionTypeID": 25,
            "StatusTypeID": 50,
            "LevelID": 2,
            "PowerKW": 22,
            "CurrentTypeID": 20
        },
        {
            "ID": 277189,
            "ConnectionTypeID": 25,
            "StatusTypeID": 50,
            "LevelID": 2,
            "PowerKW": 22,
            "CurrentTypeID": 20
        }
    ],
    "StatusTypeID": 0,
    "DateLastStatusUpdate": "2021-07-12T02:44:00Z",
    "MetadataValues": [
        {
            "ID": 10009,
            "MetadataFieldID": 4,
            "ItemValue": "Data from the German chargepoint registry provided by Bundesnetzagentur.de under the CC-BY 4.0 license"
        }
    ],
    "DataQualityLevel": 3,
    "DateCreated": "2021-07-08T09:49:00Z",
    "SubmissionStatusTypeID": 100
}