{
    "IsRecentlyVerified": false,
    "ID": 33822,
    "UUID": "237DD69F-EE2F-4846-9813-D4077984DBA4",
    "DataProviderID": 26,
    "DataProvidersReference": "57470",
    "OperatorsReference": "De Waal Autogroep",
    "UsageCost": "0.00 jaarabonnement",
    "AddressInfo": {
        "ID": 34168,
        "Title": "Van Voordenpark 2",
        "AddressLine1": "Van Voordenpark 2",
        "Town": "Zaltbommel",
        "Postcode": "5301 KP",
        "CountryID": 159,
        "Latitude": 51.795676275936,
        "Longitude": 5.2594041824341,
        "RelatedURL": "http://www.dewaalautogroep.nl",
        "DistanceUnit": 0
    },
    "Connections": [
        {
            "ID": 37333,
            "ConnectionTypeID": 25,
            "LevelID": 2,
            "PowerKW": 3.7,
            "CurrentTypeID": 10
        }
    ],
    "NumberOfPoints": 1,
    "StatusTypeID": 50,
    "DateLastStatusUpdate": "2016-06-04T02:40:00Z",
    "DataQualityLevel": 3,
    "DateCreated": "2015-01-09T06:04:00Z",
    "SubmissionStatusTypeID": 100
}