{
    "IsRecentlyVerified": true,
    "DateLastVerified": "2021-09-08T07:35:00Z",
    "ID": 189108,
    "UUID": "CAEFE17B-4704-489F-B124-427D81C0DC1E",
    "DataProviderID": 1,
    "OperatorID": 3271,
    "UsageTypeID": 4,
    "UsageCost": "1.95RON/kWh - DC, 1.45RON/kWh - AC",
    "AddressInfo": {
        "ID": 189467,
        "Title": "e-charge Shopping City Tg Mures",
        "AddressLine1": "Bulevardul 1 Decembrie 1918",
        "AddressLine2": "Tudor Vladimirescu",
        "Town": "Târgu Mureș",
        "StateOrProvince": "Mureș",
        "Postcode": "540510",
        "CountryID": 184,
        "Latitude": 46.528530366452,
        "Longitude": 24.59545045434254,
        "DistanceUnit": 0
    },
    "Connections": [
        {
            "ID": 305713,
            "ConnectionTypeID": 25,
            "StatusTypeID": 50,
            "LevelID": 2,
            "Amps": 32,
            "Voltage": 400,
            "PowerKW": 22,
            "CurrentTypeID": 20,
            "Quantity": 1
        },
        {
            "ID": 305714,
            "ConnectionTypeID": 2,
            "StatusTypeID": 50,
            "LevelID": 3,
            "PowerKW": 50,
            "CurrentTypeID": 30,
            "Quantity": 2
        },
        {
            "ID": 305715,
            "ConnectionTypeID": 33,
            "StatusTypeID": 50,
            "LevelID": 3,
            "PowerKW": 50,
            "CurrentTypeID": 30,
            "Quantity": 1
        },
        {
            "ID": 305716,
            "ConnectionTypeID": 33,
            "StatusTypeID": 50,
            "LevelID": 3,
            "PowerKW": 160,
            "CurrentTypeID": 30,
            "Quantity": 1
        }
    ],
    "NumberOfPoints": 3,
    "StatusTypeID": 75,
    "DateLastStatusUpdate": "2021-09-08T07:35:00Z",
    "DataQualityLevel": 1,
    "DateCreated": "2021-09-08T07:35:00Z",
    "SubmissionStatusTypeID": 200
}