{
    "IsRecentlyVerified": false,
    "ID": 184351,
    "UUID": "9EADAC19-5E5E-4FAB-9BDB-47B33FB1EDE2",
    "DataProviderID": 29,
    "DataProvidersReference": "8773",
    "OperatorID": 45,
    "AddressInfo": {
        "ID": 184710,
        "Title": "Kniprodestr.26",
        "AddressLine1": "Kniprodestr.26",
        "Town": "Berlin",
        "Postcode": "10407",
        "CountryID": 87,
        "Latitude": 52.534841,
        "Longitude": 13.446252,
        "DistanceUnit": 0
    },
    "Connections": [
        {
            "ID": 292516,
            "ConnectionTypeID": 25,
            "StatusTypeID": 50,
            "LevelID": 2,
            "PowerKW": 22,
            "CurrentTypeID": 20
        },
        {
            "ID": 292517,
            "ConnectionTypeID": 25,
            "StatusTypeID": 50,
            "LevelID": 2,
            "PowerKW": 22,
            "CurrentTypeID": 20
        }
    ],
    "StatusTypeID": 50,
    "DateLastStatusUpdate": "2021-07-09T03:28:00Z",
    "MetadataValues": [
        {
            "ID": 16642,
            "MetadataFieldID": 4,
            "ItemValue": "Data from the German chargepoint registry provided by Bundesnetzagentur.de under the CC-BY 4.0 license"
        }
    ],
    "DataQualityLevel": 3,
    "DateCreated": "2021-07-08T10:05:00Z",
    "SubmissionStatusTypeID": 100
}