{
    "IsRecentlyVerified": false,
    "ID": 32492,
    "UUID": "1A459F6D-3480-4E63-9A54-E7265C40C01F",
    "DataProviderID": 26,
    "DataProvidersReference": "47170",
    "OperatorID": 178,
    "OperatorsReference": "EVnetNL AL320",
    "UsageCost": "0.00 jaarabonnement",
    "AddressInfo": {
        "ID": 32838,
        "Title": "Brachterveld 1",
        "AddressLine1": "Brachterveld 1",
        "Town": "Maasgouw",
        "Postcode": "6051 HW",
        "CountryID": 159,
        "Latitude": 51.146111,
        "Longitude": 5.894452,
        "ContactTelephone1": "0800-3522365",
        "RelatedURL": "http://www.evnet.nl",
        "DistanceUnit": 0
    },
    "Connections": [
        {
            "ID": 36003,
            "ConnectionTypeID": 25,
            "LevelID": 2,
            "PowerKW": 11,
            "CurrentTypeID": 10
        }
    ],
    "NumberOfPoints": 2,
    "StatusTypeID": 50,
    "DateLastStatusUpdate": "2016-06-04T02:38:00Z",
    "DataQualityLevel": 3,
    "DateCreated": "2015-01-09T06:03:00Z",
    "SubmissionStatusTypeID": 100
}