{
    "MediaItems": [
        {
            "ID": 19928,
            "ChargePointID": 132961,
            "ItemURL": "https://s3-ap-southeast-2.amazonaws.com/openchargemap/images/DE/OCM132961/OCM-132961.orig.2019100920282997.jpeg",
            "ItemThumbnailURL": "https://s3-ap-southeast-2.amazonaws.com/openchargemap/images/DE/OCM132961/OCM-132961.thmb.2019100920282997.jpeg",
            "Comment": "",
            "IsEnabled": true,
            "IsVideo": false,
            "IsFeaturedItem": false,
            "IsExternalResource": false,
            "User": {
                "ID": 21695,
                "Username": "et42"
            },
            "DateCreated": "2019-10-09T20:29:00Z"
        },
        {
            "ID": 19929,
            "ChargePointID": 132961,
            "ItemURL": "https://s3-ap-southeast-2.amazonaws.com/openchargemap/images/DE/OCM132961/OCM-132961.orig.2019100920285123.jpeg",
            "ItemThumbnailURL": "https://s3-ap-southeast-2.amazonaws.com/openchargemap/images/DE/OCM132961/OCM-132961.thmb.2019100920285123.jpeg",
            "Comment": "",
            "IsEnabled": true,
            "IsVideo": false,
            "IsFeaturedItem": false,
            "IsExternalResource": false,
            "User": {
                "ID": 21695,
                "Username": "et42"
            },
            "DateCreated": "2019-10-09T20:29:00Z"
        }
    ],
    "IsRecentlyVerified": false,
    "ID": 132961,
    "UUID": "14604BC8-AAF8-4A27-AC0D-2AA9D18D9EBB",
    "DataProviderID": 1,
    "OperatorID": 103,
    "UsageTypeID": 4,
    "AddressInfo": {
        "ID": 133307,
        "Title": "Europahaus",
        "AddressLine1": "Europaplatz 5",
        "Town": "Darmstadt",
        "StateOrProvince": "Hessen",
        "Postcode": "64293",
        "CountryID": 87,
        "Latitude": 49.8718633299713,
        "Longitude": 8.62585434078824,
        "AccessComments": "Zufahrt über Lise-Meitner-Straße, Ecke Marie-Curie-Straße.",
        "RelatedURL": "https://www.allego.eu",
        "DistanceUnit": 0
    },
    "Connections": [
        {
            "ID": 186228,
            "ConnectionTypeID": 33,
            "StatusTypeID": 50,
            "LevelID": 3,
            "PowerKW": 50,
            "CurrentTypeID": 30,
            "Quantity": 1
        },
        {
            "ID": 186229,
            "ConnectionTypeID": 2,
            "StatusTypeID": 50,
            "LevelID": 3,
            "PowerKW": 50,
            "CurrentTypeID": 30,
            "Quantity": 1
        },
        {
            "ID": 186230,
            "ConnectionTypeID": 1036,
            "StatusTypeID": 50,
            "LevelID": 3,
            "PowerKW": 43,
            "CurrentTypeID": 20,
            "Quantity": 1
        }
    ],
    "NumberOfPoints": 2,
    "StatusTypeID": 50,
    "DateLastStatusUpdate": "2019-10-09T21:38:00Z",
    "DataQualityLevel": 1,
    "DateCreated": "2019-10-09T20:19:00Z",
    "SubmissionStatusTypeID": 200
}