{
    "IsRecentlyVerified": false,
    "ID": 182406,
    "UUID": "390936AE-B852-45EF-A916-70514B9970B6",
    "DataProviderID": 29,
    "DataProvidersReference": "15065",
    "OperatorID": 86,
    "AddressInfo": {
        "ID": 182765,
        "Title": "Karl-Kloß-Str. 34",
        "AddressLine1": "Karl-Kloß-Str. 34",
        "Town": "Stuttgart ",
        "Postcode": "70199",
        "CountryID": 87,
        "Latitude": 48.758301,
        "Longitude": 9.15921,
        "DistanceUnit": 0
    },
    "Connections": [
        {
            "ID": 288094,
            "ConnectionTypeID": 28,
            "StatusTypeID": 50,
            "LevelID": 2,
            "PowerKW": 22,
            "CurrentTypeID": 20
        },
        {
            "ID": 288095,
            "ConnectionTypeID": 25,
            "StatusTypeID": 50,
            "LevelID": 2,
            "PowerKW": 22,
            "CurrentTypeID": 20
        },
        {
            "ID": 296142,
            "ConnectionTypeID": 28,
            "StatusTypeID": 50,
            "LevelID": 2,
            "PowerKW": 22,
            "CurrentTypeID": 20
        },
        {
            "ID": 296143,
            "ConnectionTypeID": 25,
            "StatusTypeID": 50,
            "LevelID": 2,
            "PowerKW": 22,
            "CurrentTypeID": 20
        }
    ],
    "StatusTypeID": 50,
    "DateLastStatusUpdate": "2021-07-12T02:41:00Z",
    "MetadataValues": [
        {
            "ID": 14700,
            "MetadataFieldID": 4,
            "ItemValue": "Data from the German chargepoint registry provided by Bundesnetzagentur.de under the CC-BY 4.0 license"
        }
    ],
    "DataQualityLevel": 3,
    "DateCreated": "2021-07-08T10:03:00Z",
    "SubmissionStatusTypeID": 100
}