{
    "IsRecentlyVerified": false,
    "ID": 70187,
    "UUID": "CCCC3DCF-D071-4544-9A04-0C135698E173",
    "DataProviderID": 1,
    "OperatorID": 1,
    "UsageTypeID": 4,
    "AddressInfo": {
        "ID": 70533,
        "Title": "Selux",
        "AddressLine1": "Motzener Straße 34",
        "Town": "Berlin",
        "StateOrProvince": "Berlin",
        "Postcode": "12277",
        "CountryID": 87,
        "Latitude": 52.40045,
        "Longitude": 13.381809999999973,
        "AccessComments": "Die Ladesäule von ebee ist mit der New Motion Ladekarte, PlugSurfing App oder Keyhanger, intercharge direct und vielen anderen Ladekarten aktivierbar. Sie ist an der Einfahrt von der Motzener Straße aus gleich links. Selux ist Hersteller dieses Ladesäulentyps.",
        "RelatedURL": "http://www.selux.com/",
        "DistanceUnit": 0
    },
    "Connections": [
        {
            "ID": 100191,
            "ConnectionTypeID": 25,
            "StatusTypeID": 50,
            "LevelID": 2,
            "Amps": 16,
            "Voltage": 230,
            "PowerKW": 3.7,
            "CurrentTypeID": 10,
            "Quantity": 1
        }
    ],
    "NumberOfPoints": 1,
    "StatusTypeID": 50,
    "DateLastStatusUpdate": "2016-07-13T06:24:00Z",
    "DataQualityLevel": 1,
    "DateCreated": "2016-07-13T06:24:00Z",
    "SubmissionStatusTypeID": 200
}