{
    "IsRecentlyVerified": false,
    "ID": 106382,
    "UUID": "6FC0FE6A-9C37-4AA3-A4B2-0B61BE94E8AD",
    "DataProviderID": 1,
    "OperatorID": 45,
    "UsageTypeID": 6,
    "AddressInfo": {
        "ID": 106728,
        "Title": " Lack & Karosseriezentrum Erding GmbH",
        "AddressLine1": "Zum Burgstall 9",
        "Town": "Berglern",
        "StateOrProvince": "Wartenberg (VGem)",
        "Postcode": "85459",
        "CountryID": 87,
        "Latitude": 48.370938,
        "Longitude": 11.929421999999931,
        "AccessComments": "Kostenlos laden zu den Öffnungszeiten",
        "RelatedURL": "http://www.lkz-erding.de/",
        "DistanceUnit": 0
    },
    "Connections": [
        {
            "ID": 149749,
            "ConnectionTypeID": 25,
            "StatusTypeID": 50,
            "LevelID": 2,
            "Amps": 16,
            "Voltage": 400,
            "PowerKW": 11,
            "CurrentTypeID": 20,
            "Quantity": 2
        }
    ],
    "NumberOfPoints": 2,
    "StatusTypeID": 50,
    "DateLastStatusUpdate": "2018-06-21T08:33:00Z",
    "DataQualityLevel": 1,
    "DateCreated": "2018-06-21T08:33:00Z",
    "SubmissionStatusTypeID": 200
}