{
    "IsRecentlyVerified": false,
    "ID": 162230,
    "UUID": "F63D8F93-739A-4755-B58D-274181D7C4A2",
    "DataProviderID": 1,
    "OperatorID": 3311,
    "UsageTypeID": 1,
    "AddressInfo": {
        "ID": 162587,
        "Title": "Odmorište Kozjak sjever",
        "AddressLine1": "30 Odmorište Kozjak sjever",
        "Town": "Blaca",
        "StateOrProvince": "",
        "Postcode": "21212",
        "CountryID": 60,
        "Latitude": 43.58761203402085,
        "Longitude": 16.459444036577224,
        "AccessComments": "Motorway, direction north",
        "DistanceUnit": 0
    },
    "Connections": [
        {
            "ID": 233474,
            "ConnectionTypeID": 33,
            "StatusTypeID": 50,
            "LevelID": 3,
            "PowerKW": 50,
            "CurrentTypeID": 30,
            "Quantity": 1
        },
        {
            "ID": 233475,
            "ConnectionTypeID": 2,
            "StatusTypeID": 50,
            "LevelID": 3,
            "PowerKW": 50,
            "CurrentTypeID": 30,
            "Quantity": 1
        },
        {
            "ID": 233476,
            "ConnectionTypeID": 1036,
            "StatusTypeID": 50,
            "LevelID": 3,
            "Amps": 63,
            "Voltage": 400,
            "PowerKW": 43,
            "CurrentTypeID": 20,
            "Quantity": 1
        }
    ],
    "NumberOfPoints": 1,
    "StatusTypeID": 50,
    "DateLastStatusUpdate": "2020-08-04T10:00:00Z",
    "DataQualityLevel": 1,
    "DateCreated": "2020-08-03T07:17:00Z",
    "SubmissionStatusTypeID": 200
}