{
    "IsRecentlyVerified": false,
    "ID": 177636,
    "UUID": "0FF994D7-5294-41E0-BE7F-7E9781D39548",
    "DataProviderID": 29,
    "DataProvidersReference": "8961",
    "OperatorID": 45,
    "AddressInfo": {
        "ID": 177995,
        "Title": "Gaswerkstraße 41",
        "AddressLine1": "Gaswerkstraße 41",
        "Town": "Heilbronn",
        "Postcode": "74076",
        "CountryID": 87,
        "Latitude": 49.150278,
        "Longitude": 9.216667,
        "DistanceUnit": 0
    },
    "Connections": [
        {
            "ID": 277008,
            "ConnectionTypeID": 33,
            "StatusTypeID": 50,
            "LevelID": 3,
            "PowerKW": 125,
            "CurrentTypeID": 30
        },
        {
            "ID": 277009,
            "ConnectionTypeID": 33,
            "StatusTypeID": 50,
            "LevelID": 3,
            "PowerKW": 125,
            "CurrentTypeID": 30
        },
        {
            "ID": 296643,
            "ConnectionTypeID": 25,
            "StatusTypeID": 50,
            "LevelID": 2,
            "PowerKW": 22,
            "CurrentTypeID": 20
        }
    ],
    "StatusTypeID": 0,
    "DateLastStatusUpdate": "2021-07-12T02:42:00Z",
    "MetadataValues": [
        {
            "ID": 9930,
            "MetadataFieldID": 4,
            "ItemValue": "Data from the German chargepoint registry provided by Bundesnetzagentur.de under the CC-BY 4.0 license"
        }
    ],
    "DataQualityLevel": 3,
    "DateCreated": "2021-07-08T09:49:00Z",
    "SubmissionStatusTypeID": 100
}