{
    "IsRecentlyVerified": false,
    "ID": 104123,
    "UUID": "3957474A-6250-4B14-BF01-39C24CF6CAA4",
    "DataProviderID": 1,
    "OperatorID": 45,
    "UsageTypeID": 1,
    "AddressInfo": {
        "ID": 104469,
        "Title": "BMW Niederlassung",
        "AddressLine1": "Werner-Heisenberg-Allee 10",
        "Town": "München",
        "StateOrProvince": "Bayern",
        "Postcode": "80939",
        "CountryID": 87,
        "Latitude": 48.209254693293474,
        "Longitude": 11.620928668786632,
        "ContactTelephone1": "+49 89 248 837 755",
        "DistanceUnit": 0
    },
    "Connections": [
        {
            "ID": 147033,
            "ConnectionTypeID": 33,
            "StatusTypeID": 50,
            "LevelID": 3,
            "PowerKW": 50,
            "CurrentTypeID": 30,
            "Quantity": 1
        },
        {
            "ID": 147034,
            "ConnectionTypeID": 25,
            "StatusTypeID": 50,
            "LevelID": 2,
            "Amps": 32,
            "Voltage": 400,
            "PowerKW": 22,
            "CurrentTypeID": 20,
            "Quantity": 1
        }
    ],
    "NumberOfPoints": 2,
    "StatusTypeID": 50,
    "DateLastStatusUpdate": "2018-05-16T06:42:00Z",
    "DataQualityLevel": 1,
    "DateCreated": "2018-05-16T06:42:00Z",
    "SubmissionStatusTypeID": 200
}