{
    "MediaItems": [
        {
            "ID": 19005,
            "ChargePointID": 129626,
            "ItemURL": "https://s3-ap-southeast-2.amazonaws.com/openchargemap/images/IT/OCM129626/OCM-129626.orig.2019072116554277.jpeg",
            "ItemThumbnailURL": "https://s3-ap-southeast-2.amazonaws.com/openchargemap/images/IT/OCM129626/OCM-129626.thmb.2019072116554277.jpeg",
            "Comment": "",
            "IsEnabled": true,
            "IsVideo": false,
            "IsFeaturedItem": false,
            "IsExternalResource": false,
            "User": {
                "ID": 16306,
                "Username": "e-station"
            },
            "DateCreated": "2019-07-21T16:56:00Z"
        },
        {
            "ID": 19006,
            "ChargePointID": 129626,
            "ItemURL": "https://s3-ap-southeast-2.amazonaws.com/openchargemap/images/IT/OCM129626/OCM-129626.orig.2019072116561178.jpeg",
            "ItemThumbnailURL": "https://s3-ap-southeast-2.amazonaws.com/openchargemap/images/IT/OCM129626/OCM-129626.thmb.2019072116561178.jpeg",
            "Comment": "",
            "IsEnabled": true,
            "IsVideo": false,
            "IsFeaturedItem": false,
            "IsExternalResource": false,
            "User": {
                "ID": 16306,
                "Username": "e-station"
            },
            "DateCreated": "2019-07-21T16:56:00Z"
        }
    ],
    "IsRecentlyVerified": false,
    "ID": 129626,
    "UUID": "DE976300-4738-4B35-ADEE-D695E0F71B4D",
    "DataProviderID": 1,
    "OperatorID": 1,
    "UsageTypeID": 1,
    "AddressInfo": {
        "ID": 129972,
        "Title": "Hotel Bivio",
        "AddressLine1": "Via Plan, 422/a",
        "Town": "Livigno",
        "StateOrProvince": "Sondrio",
        "Postcode": "23041",
        "CountryID": 112,
        "Latitude": 46.542191,
        "Longitude": 10.138299,
        "ContactTelephone1": "0342996137",
        "ContactEmail": "bivio@biviogroup.it",
        "DistanceUnit": 0
    },
    "Connections": [
        {
            "ID": 181398,
            "ConnectionTypeID": 25,
            "StatusTypeID": 50,
            "LevelID": 2,
            "Amps": 16,
            "Voltage": 400,
            "PowerKW": 11,
            "CurrentTypeID": 20,
            "Quantity": 1
        }
    ],
    "NumberOfPoints": 1,
    "GeneralComments": "Charging station free for customers, 11 kW (16A 400V).",
    "StatusTypeID": 50,
    "DateLastStatusUpdate": "2019-07-22T08:49:00Z",
    "DataQualityLevel": 1,
    "DateCreated": "2019-07-21T16:55:00Z",
    "SubmissionStatusTypeID": 200
}