{
    "IsRecentlyVerified": false,
    "ID": 82253,
    "UUID": "8436EB56-21E7-427E-BDFB-9EA3C8B7EB1C",
    "DataProviderID": 1,
    "OperatorID": 23,
    "OperatorsReference": "14638",
    "UsageTypeID": 4,
    "AddressInfo": {
        "ID": 82599,
        "Title": "Chelnik Parking Nyc 880 5th",
        "AddressLine1": "880 5th Ave",
        "Town": "New York",
        "StateOrProvince": "NY",
        "Postcode": "10021",
        "CountryID": 2,
        "Latitude": 40.770292,
        "Longitude": -73.967735,
        "ContactTelephone1": "(212) 988-9130",
        "DistanceUnit": 0
    },
    "Connections": [
        {
            "ID": 117016,
            "ConnectionTypeID": 30,
            "StatusTypeID": 50,
            "LevelID": 2,
            "PowerKW": 13,
            "CurrentTypeID": 20,
            "Quantity": 2
        }
    ],
    "NumberOfPoints": 2,
    "GeneralComments": "2 Tesla Connectors, up to 13kW.Available to the public. Please see valet.",
    "StatusTypeID": 50,
    "DateLastStatusUpdate": "2017-02-03T15:19:00Z",
    "DataQualityLevel": 1,
    "DateCreated": "2017-02-03T15:19:00Z",
    "SubmissionStatusTypeID": 200
}