{
    "IsRecentlyVerified": false,
    "ID": 152203,
    "UUID": "272C55E7-9966-4FDE-84AB-F8B9427C725B",
    "DataProviderID": 28,
    "DataProvidersReference": "FR*S86*PSORE*B106",
    "UsageTypeID": 5,
    "AddressInfo": {
        "ID": 152556,
        "Title": "B106",
        "AddressLine1": "Rue de la croix - 86190 - Villiers",
        "CountryID": 80,
        "Latitude": 46.67593,
        "Longitude": 0.17571,
        "AccessComments": "24/24 7/7 jours",
        "DistanceUnit": 0
    },
    "Connections": [
        {
            "ID": 212975,
            "ConnectionTypeID": 28,
            "StatusTypeID": 50,
            "LevelID": 2,
            "PowerKW": 18,
            "CurrentTypeID": 10
        },
        {
            "ID": 212976,
            "ConnectionTypeID": 25,
            "StatusTypeID": 50,
            "LevelID": 2,
            "PowerKW": 18,
            "CurrentTypeID": 20
        },
        {
            "ID": 245839,
            "ConnectionTypeID": 28,
            "StatusTypeID": 50,
            "LevelID": 2,
            "PowerKW": 18,
            "CurrentTypeID": 10
        },
        {
            "ID": 245840,
            "ConnectionTypeID": 25,
            "StatusTypeID": 50,
            "LevelID": 2,
            "PowerKW": 18,
            "CurrentTypeID": 20
        }
    ],
    "GeneralComments": "",
    "StatusTypeID": 50,
    "DateLastStatusUpdate": "2020-08-27T05:12:00Z",
    "DataQualityLevel": 2,
    "DateCreated": "2020-03-15T10:53:00Z",
    "SubmissionStatusTypeID": 100
}