{
    "IsRecentlyVerified": false,
    "ID": 183654,
    "UUID": "A1B8DF89-054C-45F1-803C-FD711D95219C",
    "DataProviderID": 29,
    "DataProvidersReference": "13180",
    "OperatorID": 3403,
    "AddressInfo": {
        "ID": 184013,
        "Title": "Im Tölletal 21",
        "AddressLine1": "Im Tölletal 21",
        "Town": "Langelsheim",
        "Postcode": "38685",
        "CountryID": 87,
        "Latitude": 51.9124,
        "Longitude": 10.32261,
        "DistanceUnit": 0
    },
    "Connections": [
        {
            "ID": 290893,
            "ConnectionTypeID": 25,
            "StatusTypeID": 50,
            "LevelID": 2,
            "PowerKW": 22,
            "CurrentTypeID": 20
        },
        {
            "ID": 290894,
            "ConnectionTypeID": 25,
            "StatusTypeID": 50,
            "LevelID": 2,
            "PowerKW": 22,
            "CurrentTypeID": 20
        }
    ],
    "StatusTypeID": 50,
    "DateLastStatusUpdate": "2021-07-09T03:25:00Z",
    "MetadataValues": [
        {
            "ID": 15947,
            "MetadataFieldID": 4,
            "ItemValue": "Data from the German chargepoint registry provided by Bundesnetzagentur.de under the CC-BY 4.0 license"
        }
    ],
    "DataQualityLevel": 3,
    "DateCreated": "2021-07-08T10:04:00Z",
    "SubmissionStatusTypeID": 100
}