{
    "IsRecentlyVerified": false,
    "ID": 111168,
    "UUID": "97B585EE-0E38-4550-A59F-858AAB96B30B",
    "DataProviderID": 1,
    "OperatorID": 3375,
    "UsageTypeID": 1,
    "AddressInfo": {
        "ID": 111514,
        "Title": "Petro-Canada",
        "AddressLine1": "1586 Centennial Dr",
        "Town": "Kingston",
        "StateOrProvince": "ON",
        "Postcode": "K7P 0C7",
        "CountryID": 44,
        "Latitude": 44.280476000912245,
        "Longitude": -76.570891000816,
        "ContactTelephone1": "613-389-8010",
        "AccessComments": "24 hours daily",
        "DistanceUnit": 0
    },
    "Connections": [
        {
            "ID": 156541,
            "ConnectionTypeID": 1,
            "LevelID": 2,
            "Amps": 16,
            "Voltage": 230,
            "PowerKW": 3,
            "CurrentTypeID": 10,
            "Quantity": 1
        },
        {
            "ID": 188613,
            "ConnectionTypeID": 32,
            "StatusTypeID": 50,
            "LevelID": 3,
            "PowerKW": 200,
            "CurrentTypeID": 30,
            "Quantity": 2
        },
        {
            "ID": 261446,
            "ConnectionTypeID": 2,
            "StatusTypeID": 50,
            "LevelID": 3,
            "PowerKW": 100,
            "CurrentTypeID": 30,
            "Quantity": 2
        }
    ],
    "StatusTypeID": 50,
    "DateLastStatusUpdate": "2020-12-20T10:57:00Z",
    "DataQualityLevel": 3,
    "DateCreated": "2018-10-18T23:36:00Z",
    "SubmissionStatusTypeID": 100
}