{
    "IsRecentlyVerified": false,
    "ID": 51891,
    "UUID": "04E4BBD6-A894-4353-A450-EFA94316428B",
    "DataProviderID": 1,
    "OperatorID": 23,
    "OperatorsReference": "8300",
    "UsageTypeID": 7,
    "UsageCost": "Free",
    "AddressInfo": {
        "ID": 52237,
        "Title": "Inn on Randolph - Tesla",
        "AddressLine1": "411 Randolph St",
        "Town": "Napa",
        "StateOrProvince": "CA",
        "Postcode": "94559",
        "CountryID": 2,
        "Latitude": 38.292615,
        "Longitude": -122.287015,
        "ContactTelephone1": "707-257-2886  877-798-3752",
        "AccessComments": "24 hours daily; for Tesla use only; for guest use only",
        "RelatedURL": "http://www.teslamotors.com/supercharger",
        "DistanceUnit": 0
    },
    "Connections": [
        {
            "ID": 64373,
            "ConnectionTypeID": 30,
            "StatusTypeID": 50,
            "LevelID": 2,
            "Amps": 16,
            "Voltage": 230,
            "PowerKW": 13,
            "CurrentTypeID": 10,
            "Quantity": 1
        }
    ],
    "NumberOfPoints": 1,
    "StatusTypeID": 50,
    "DateLastStatusUpdate": "2017-01-26T15:38:00Z",
    "DataQualityLevel": 3,
    "DateCreated": "2015-08-13T03:43:00Z",
    "SubmissionStatusTypeID": 100
}