{
    "IsRecentlyVerified": false,
    "ID": 136179,
    "UUID": "35706FD7-56E6-43F6-A663-FC4C430B708A",
    "DataProviderID": 18,
    "DataProvidersReference": "8be6210b0214833433b04c4f0b874810",
    "OperatorID": 2244,
    "UsageTypeID": 4,
    "AddressInfo": {
        "ID": 136525,
        "Title": "Rupert Road",
        "AddressLine1": "Rupert Road",
        "Town": "London",
        "Postcode": "W4 1TX",
        "CountryID": 1,
        "Latitude": 51.497004,
        "Longitude": -0.253008,
        "AccessComments": "",
        "RelatedURL": "https://www.ubitricity.com",
        "DistanceUnit": 0
    },
    "Connections": [
        {
            "ID": 190608,
            "ConnectionTypeID": 25,
            "Reference": "steob100000754",
            "StatusTypeID": 50,
            "LevelID": 2,
            "Amps": 16,
            "Voltage": 230,
            "PowerKW": 3.7,
            "CurrentTypeID": 10
        }
    ],
    "StatusTypeID": 0,
    "DateLastStatusUpdate": "2021-04-25T05:46:00Z",
    "MetadataValues": [
        {
            "ID": 6031,
            "MetadataFieldID": 4,
            "ItemValue": "Contains public sector information licensed under the Open Government Licence v2.0. http://www.nationalarchives.gov.uk/doc/open-government-licence/version/2/"
        }
    ],
    "DataQualityLevel": 3,
    "DateCreated": "2019-12-24T05:22:00Z",
    "SubmissionStatusTypeID": 100
}