{
    "IsRecentlyVerified": false,
    "ID": 47260,
    "UUID": "4B2EE0F4-E977-491B-82FC-25BD07FE1583",
    "DataProviderID": 1,
    "OperatorID": 45,
    "UsageTypeID": 1,
    "UsageCost": "0",
    "AddressInfo": {
        "ID": 47606,
        "Title": "E-Bike Ladestation Touristeninformation",
        "AddressLine1": "Europaplatz 1",
        "Town": "Bad Pyrmont",
        "StateOrProvince": "Landkreis Hameln-Pyrmont",
        "Postcode": "31812",
        "CountryID": 87,
        "Latitude": 51.98084619999999,
        "Longitude": 9.2512021,
        "ContactTelephone1": "+49 5281/940511",
        "ContactEmail": "info@badpyrmont.de",
        "AccessComments": "Kostenloses Laden während der Öffnungszeiten in der Touristeninformationen möglich in 4 abschließbaren Akkuladeschränken mit Schukosteckdose.",
        "RelatedURL": "http://www.weserradweg-info.de/etappen-highlights/e-bike-weser-radweg/akkuladeschraenke.html",
        "DistanceUnit": 0
    },
    "Connections": [
        {
            "ID": 58265,
            "ConnectionTypeID": 28,
            "StatusTypeID": 50,
            "LevelID": 1,
            "Amps": 10,
            "Voltage": 230,
            "PowerKW": 2.3,
            "CurrentTypeID": 10,
            "Quantity": 4
        }
    ],
    "NumberOfPoints": 4,
    "StatusTypeID": 50,
    "DateLastStatusUpdate": "2015-05-22T08:09:00Z",
    "DataQualityLevel": 1,
    "DateCreated": "2015-05-22T08:09:00Z",
    "SubmissionStatusTypeID": 200
}