{
    "IsRecentlyVerified": false,
    "ID": 113375,
    "UUID": "CB165DE3-5A66-4962-A6EF-6C7ACC1AABFD",
    "DataProviderID": 1,
    "OperatorID": 82,
    "UsageTypeID": 4,
    "AddressInfo": {
        "ID": 113721,
        "Title": "A2A BG Palanorda",
        "AddressLine1": "Via Pitentino",
        "AddressLine2": "Borgo Santa Caterina",
        "Town": "Bergamo",
        "StateOrProvince": "BG",
        "Postcode": "24124",
        "CountryID": 112,
        "Latitude": 45.702388795334,
        "Longitude": 9.67835323933444,
        "ContactTelephone1": "800035151",
        "RelatedURL": "http://www.e-moving.it/",
        "DistanceUnit": 0
    },
    "Connections": [
        {
            "ID": 159687,
            "ConnectionTypeID": 25,
            "StatusTypeID": 50,
            "LevelID": 2,
            "Amps": 32,
            "Voltage": 400,
            "PowerKW": 22,
            "CurrentTypeID": 20,
            "Quantity": 2
        },
        {
            "ID": 165287,
            "ConnectionTypeID": 36,
            "StatusTypeID": 50,
            "LevelID": 2,
            "Amps": 16,
            "Voltage": 240,
            "PowerKW": 3.7,
            "CurrentTypeID": 10,
            "Quantity": 2
        }
    ],
    "NumberOfPoints": 2,
    "StatusTypeID": 50,
    "DateLastStatusUpdate": "2019-04-11T16:17:00Z",
    "DataQualityLevel": 1,
    "DateCreated": "2018-12-06T08:11:00Z",
    "SubmissionStatusTypeID": 200
}