{
    "UserComments": [
        {
            "ID": 24649,
            "ChargePointID": 130724,
            "CommentTypeID": 10,
            "UserName": "RichardAB",
            "Comment": "Successful charge, 50KW CCS. Nice village. 24.7.21.",
            "DateCreated": "2021-07-25T23:30:58.317Z",
            "User": {
                "ID": 33551,
                "Username": "RichardAB"
            },
            "CheckinStatusTypeID": 10,
            "IsActionedByEditor": false
        },
        {
            "ID": 21340,
            "ChargePointID": 130724,
            "CommentTypeID": 10,
            "UserName": "Simon Hewison",
            "Comment": "very busy. new location. three vehicles queueing",
            "DateCreated": "2019-08-17T11:46:34.063Z",
            "User": {
                "ID": 4575,
                "Username": "Simon Hewison"
            }
        }
    ],
    "IsRecentlyVerified": false,
    "ID": 130724,
    "UUID": "7993F643-9062-467D-BE4D-7049DB56C8EF",
    "DataProviderID": 1,
    "OperatorID": 32,
    "UsageTypeID": 5,
    "UsageCost": "£0.30/kWh (Contactless); £0.15/kWh (Polar Plus subscription); £0.25/kWh (Polar Instant app). Overstay £10/hour after 90 minutes ",
    "AddressInfo": {
        "ID": 131070,
        "Title": "Lincolnshire Co-op Long Bennington",
        "AddressLine1": "Great North Road",
        "AddressLine2": "Long Bennington CP",
        "Town": "South Kesteven",
        "StateOrProvince": "Lincolnshire",
        "Postcode": "NG23 5DJ",
        "CountryID": 1,
        "Latitude": 52.9939595927368,
        "Longitude": -0.758870623652228,
        "DistanceUnit": 0
    },
    "Connections": [
        {
            "ID": 182998,
            "ConnectionTypeID": 33,
            "StatusTypeID": 50,
            "LevelID": 3,
            "PowerKW": 50,
            "CurrentTypeID": 30,
            "Quantity": 1
        },
        {
            "ID": 183000,
            "ConnectionTypeID": 1036,
            "StatusTypeID": 50,
            "LevelID": 3,
            "Amps": 63,
            "Voltage": 400,
            "PowerKW": 43,
            "CurrentTypeID": 20,
            "Quantity": 1
        },
        {
            "ID": 183001,
            "ConnectionTypeID": 2,
            "StatusTypeID": 50,
            "LevelID": 3,
            "PowerKW": 50,
            "CurrentTypeID": 30,
            "Quantity": 1
        }
    ],
    "NumberOfPoints": 1,
    "StatusTypeID": 50,
    "DateLastStatusUpdate": "2021-07-25T23:31:00Z",
    "DataQualityLevel": 1,
    "DateCreated": "2019-08-11T07:54:00Z",
    "SubmissionStatusTypeID": 200
}