{
    "IsRecentlyVerified": false,
    "ID": 9893,
    "UUID": "D0BB598C-F2DD-4A6B-9CF5-A6D05CE14C93",
    "DataProviderID": 15,
    "DataProvidersReference": "17655",
    "OperatorID": 1,
    "AddressInfo": {
        "ID": 9790,
        "Title": "621 I Street",
        "AddressLine1": "621 I Street",
        "Town": "Chula Vista",
        "StateOrProvince": "CA",
        "Postcode": "92220",
        "CountryID": 2,
        "Latitude": 32.627665,
        "Longitude": -117.088766,
        "ContactTelephone1": "(619) 407-4057",
        "RelatedURL": "http://carstations.com/17655",
        "DistanceUnit": 0
    },
    "Connections": [
        {
            "ID": 7767,
            "ConnectionTypeID": 1,
            "Reference": "J1772",
            "LevelID": 2
        }
    ],
    "StatusTypeID": 0,
    "DateLastStatusUpdate": "2017-11-04T14:03:00Z",
    "DataQualityLevel": 2,
    "DateCreated": "2012-05-02T14:03:00Z",
    "SubmissionStatusTypeID": 100
}