{
    "IsRecentlyVerified": false,
    "ID": 31609,
    "UUID": "B469F062-7691-4CA7-9CE5-ECA210A482BF",
    "DataProviderID": 26,
    "DataProvidersReference": "37998",
    "OperatorID": 78,
    "OperatorsReference": "Essent EM-CH-00003203-01-00001",
    "UsageCost": "0.00 jaarabonnement",
    "AddressInfo": {
        "ID": 31955,
        "Title": "Fürstenlandstrasse",
        "AddressLine1": "Fürstenlandstrasse",
        "Town": "St. Gallen",
        "Postcode": "9023",
        "CountryID": 217,
        "Latitude": 47.414625,
        "Longitude": 9.351787,
        "RelatedURL": "http://www.essent.nl",
        "DistanceUnit": 0
    },
    "Connections": [
        {
            "ID": 35120,
            "ConnectionTypeID": 25,
            "LevelID": 2,
            "PowerKW": 11,
            "CurrentTypeID": 10
        }
    ],
    "NumberOfPoints": 1,
    "StatusTypeID": 50,
    "DateLastStatusUpdate": "2016-06-04T02:38:00Z",
    "DataQualityLevel": 3,
    "DateCreated": "2015-01-09T06:03:00Z",
    "SubmissionStatusTypeID": 100
}