{
    "UserComments": [
        {
            "ID": 17986,
            "ChargePointID": 74328,
            "CommentTypeID": 10,
            "UserName": "markrassell",
            "Comment": "Free free free and fast!",
            "Rating": 5,
            "DateCreated": "2017-12-01T23:11:50.12Z",
            "User": {
                "ID": 15812,
                "Username": "markrassell"
            },
            "CheckinStatusTypeID": 10
        },
        {
            "ID": 17539,
            "ChargePointID": 74328,
            "CommentTypeID": 10,
            "UserName": "markrassell",
            "Comment": "43kwh. Fast and free. What more could you ask for!",
            "Rating": 5,
            "DateCreated": "2017-08-02T22:19:20.44Z",
            "User": {
                "ID": 15812,
                "Username": "markrassell"
            },
            "CheckinStatusTypeID": 10
        },
        {
            "ID": 17538,
            "ChargePointID": 74328,
            "CommentTypeID": 10,
            "UserName": "markrassell",
            "Comment": "43kwh. Fast and free. What more could you ask for!",
            "Rating": 5,
            "DateCreated": "2017-08-02T22:18:10.517Z",
            "User": {
                "ID": 15812,
                "Username": "markrassell"
            },
            "CheckinStatusTypeID": 10
        }
    ],
    "MediaItems": [
        {
            "ID": 9281,
            "ChargePointID": 74328,
            "ItemURL": "https://s3-ap-southeast-2.amazonaws.com/openchargemap/images/GB/OCM74328/OCM-74328.orig.2017012015205879.jpg",
            "ItemThumbnailURL": "https://s3-ap-southeast-2.amazonaws.com/openchargemap/images/GB/OCM74328/OCM-74328.thmb.2017012015205879.jpg",
            "Comment": "",
            "IsEnabled": true,
            "IsVideo": false,
            "IsFeaturedItem": false,
            "IsExternalResource": false,
            "User": {
                "ID": 12244,
                "Username": "MikedotRog"
            },
            "DateCreated": "2017-01-20T15:21:00Z"
        },
        {
            "ID": 9280,
            "ChargePointID": 74328,
            "ItemURL": "https://s3-ap-southeast-2.amazonaws.com/openchargemap/images/GB/OCM74328/OCM-74328.orig.2017012015200365.jpg",
            "ItemThumbnailURL": "https://s3-ap-southeast-2.amazonaws.com/openchargemap/images/GB/OCM74328/OCM-74328.thmb.2017012015200365.jpg",
            "Comment": "",
            "IsEnabled": true,
            "IsVideo": false,
            "IsFeaturedItem": false,
            "IsExternalResource": false,
            "User": {
                "ID": 12244,
                "Username": "MikedotRog"
            },
            "DateCreated": "2017-01-20T15:20:00Z"
        }
    ],
    "IsRecentlyVerified": false,
    "ID": 74328,
    "UUID": "CB4B3178-6F24-4F27-B7AB-1B511BDAE541",
    "DataProviderID": 1,
    "OperatorID": 3,
    "OperatorsReference": "t53_it1_3716_011",
    "UsageTypeID": 4,
    "UsageCost": "£0.25/kWh",
    "AddressInfo": {
        "ID": 74674,
        "Title": "Lidl - Maldon",
        "AddressLine1": "2 Station Road",
        "Town": "Maldon",
        "StateOrProvince": "Essex",
        "Postcode": "CM9 4LQ",
        "CountryID": 1,
        "Latitude": 51.7355076147175,
        "Longitude": 0.680412455017079,
        "DistanceUnit": 0
    },
    "Connections": [
        {
            "ID": 106885,
            "ConnectionTypeID": 2,
            "StatusTypeID": 50,
            "LevelID": 3,
            "Amps": 125,
            "Voltage": 400,
            "PowerKW": 50,
            "CurrentTypeID": 30,
            "Quantity": 1
        },
        {
            "ID": 106886,
            "ConnectionTypeID": 1036,
            "StatusTypeID": 50,
            "LevelID": 3,
            "Amps": 63,
            "Voltage": 400,
            "PowerKW": 43,
            "CurrentTypeID": 20,
            "Quantity": 1
        },
        {
            "ID": 106887,
            "ConnectionTypeID": 33,
            "StatusTypeID": 50,
            "LevelID": 3,
            "Amps": 125,
            "Voltage": 400,
            "PowerKW": 50,
            "CurrentTypeID": 30,
            "Quantity": 1
        }
    ],
    "NumberOfPoints": 3,
    "GeneralComments": "No authentication required.",
    "StatusTypeID": 50,
    "DateLastStatusUpdate": "2021-03-22T19:35:00Z",
    "DataQualityLevel": 1,
    "DateCreated": "2016-12-01T14:34:00Z",
    "SubmissionStatusTypeID": 200
}