{
    "IsRecentlyVerified": false,
    "ID": 152650,
    "UUID": "F9DF33A5-0C25-4348-81C8-D7E39EE9FC64",
    "DataProviderID": 28,
    "DataProvidersReference": "FR*S58*P58304*A",
    "UsageTypeID": 5,
    "AddressInfo": {
        "ID": 153003,
        "Title": "VARZY_Place de la salle des fetes",
        "AddressLine1": "Place de la salle des fetes 58210 VARZY",
        "CountryID": 80,
        "Latitude": 47.35506345,
        "Longitude": 3.38581078,
        "AccessComments": "24/24 7/7 jours",
        "DistanceUnit": 0
    },
    "Connections": [
        {
            "ID": 213786,
            "ConnectionTypeID": 28,
            "StatusTypeID": 50,
            "LevelID": 2,
            "PowerKW": 22,
            "CurrentTypeID": 10
        },
        {
            "ID": 213787,
            "ConnectionTypeID": 1036,
            "StatusTypeID": 50,
            "LevelID": 2,
            "PowerKW": 22,
            "CurrentTypeID": 20
        },
        {
            "ID": 246931,
            "ConnectionTypeID": 28,
            "StatusTypeID": 50,
            "LevelID": 2,
            "PowerKW": 22,
            "CurrentTypeID": 10
        },
        {
            "ID": 246932,
            "ConnectionTypeID": 1036,
            "StatusTypeID": 50,
            "LevelID": 2,
            "PowerKW": 22,
            "CurrentTypeID": 20
        }
    ],
    "GeneralComments": "",
    "StatusTypeID": 50,
    "DateLastStatusUpdate": "2020-08-27T05:13:00Z",
    "DataQualityLevel": 2,
    "DateCreated": "2020-03-15T10:54:00Z",
    "SubmissionStatusTypeID": 100
}