{
    "IsRecentlyVerified": false,
    "ID": 63331,
    "UUID": "02F8637E-D891-41A6-B8C5-BC5E8187189B",
    "DataProviderID": 26,
    "DataProvidersReference": "79158",
    "OperatorID": 73,
    "OperatorsReference": "EV-Box EVB-P1548053",
    "UsageCost": "0.00 jaarabonnement",
    "AddressInfo": {
        "ID": 63677,
        "Title": "Esdoornlaan 1",
        "AddressLine1": "Esdoornlaan 1",
        "Town": "Rotterdam",
        "Postcode": "3053 WS",
        "CountryID": 159,
        "Latitude": 51.95964,
        "Longitude": 4.4793,
        "RelatedURL": "http://www.ev-box.nl",
        "DistanceUnit": 0
    },
    "Connections": [
        {
            "ID": 80717,
            "ConnectionTypeID": 25,
            "LevelID": 2,
            "PowerKW": 11,
            "CurrentTypeID": 10
        },
        {
            "ID": 80718,
            "ConnectionTypeID": 25,
            "LevelID": 2,
            "PowerKW": 11,
            "CurrentTypeID": 10
        }
    ],
    "NumberOfPoints": 1,
    "StatusTypeID": 50,
    "DateLastStatusUpdate": "2016-06-04T02:43:00Z",
    "DataQualityLevel": 3,
    "DateCreated": "2016-03-03T12:30:00Z",
    "SubmissionStatusTypeID": 100
}