{
    "IsRecentlyVerified": false,
    "ID": 27124,
    "UUID": "07BF7859-EBF4-4B64-8770-D4C5E9D774D5",
    "DataProviderID": 2,
    "DataProvidersReference": "60660",
    "OperatorID": 5,
    "UsageTypeID": 1,
    "AddressInfo": {
        "ID": 27470,
        "Title": "CENTURY BMW",
        "AddressLine1": "3126-3160 US-276",
        "Town": "Greenville",
        "StateOrProvince": "SC",
        "Postcode": "29607",
        "CountryID": 2,
        "Latitude": 34.8071902,
        "Longitude": -82.3301111,
        "ContactTelephone1": "888-758-4389",
        "AccessComments": "24 hours daily",
        "RelatedURL": "http://www.chargepoint.com/",
        "DistanceUnit": 0
    },
    "Connections": [
        {
            "ID": 29708,
            "ConnectionTypeID": 1,
            "LevelID": 2,
            "Amps": 16,
            "Voltage": 230,
            "PowerKW": 3,
            "CurrentTypeID": 10,
            "Quantity": 2
        }
    ],
    "DateLastStatusUpdate": "2019-04-06T04:02:00Z",
    "DataQualityLevel": 3,
    "DateCreated": "2014-11-28T03:37:00Z",
    "SubmissionStatusTypeID": 100
}