{
    "IsRecentlyVerified": false,
    "ID": 131005,
    "UUID": "5DD7D499-EDB3-43AB-99EB-5BDCDDD86178",
    "DataProviderID": 1,
    "OperatorID": 23,
    "OperatorsReference": "51626",
    "UsageTypeID": 4,
    "AddressInfo": {
        "ID": 131351,
        "Title": "Hotel Crocus Strbske Pleso A.s.",
        "AddressLine1": "Szentivanyho 4078/11",
        "Town": "Strbske Pleso",
        "Postcode": "5985",
        "CountryID": 204,
        "Latitude": 49.118802,
        "Longitude": 20.063368,
        "ContactTelephone1": "+421 9175 04298",
        "DistanceUnit": 0
    },
    "Connections": [
        {
            "ID": 183500,
            "ConnectionTypeID": 30,
            "StatusTypeID": 50,
            "LevelID": 2,
            "PowerKW": 22,
            "CurrentTypeID": 20,
            "Quantity": 3
        }
    ],
    "NumberOfPoints": 3,
    "GeneralComments": "2 Tesla Connectors, up to 22kW.Available for members only. Please call ahead.",
    "StatusTypeID": 50,
    "DateLastStatusUpdate": "2020-07-02T10:04:00Z",
    "DataQualityLevel": 1,
    "DateCreated": "2019-08-28T19:55:00Z",
    "SubmissionStatusTypeID": 200
}