{
    "IsRecentlyVerified": false,
    "ID": 174073,
    "UUID": "C97D7C85-C31B-4E8E-BBCF-2271E5B7160A",
    "DataProviderID": 1,
    "OperatorID": 3,
    "OperatorsReference": "t54_it1_4620_058",
    "UsageTypeID": 4,
    "UsageCost": "£0.25/kWh",
    "AddressInfo": {
        "ID": 174432,
        "Title": "Lidl-Bognor Regis",
        "AddressLine1": "Oldlands Farm",
        "Town": "Steyning Way",
        "StateOrProvince": "Bognor Regis",
        "Postcode": "PO22 9NN",
        "CountryID": 1,
        "Latitude": 50.8068,
        "Longitude": -0.664,
        "DistanceUnit": 0
    },
    "Connections": [
        {
            "ID": 268781,
            "ConnectionTypeID": 25,
            "StatusTypeID": 50,
            "LevelID": 2,
            "Amps": 32,
            "Voltage": 400,
            "PowerKW": 22,
            "CurrentTypeID": 20,
            "Quantity": 1
        },
        {
            "ID": 268782,
            "ConnectionTypeID": 33,
            "StatusTypeID": 50,
            "LevelID": 3,
            "PowerKW": 50,
            "CurrentTypeID": 30,
            "Quantity": 1
        },
        {
            "ID": 268783,
            "ConnectionTypeID": 2,
            "StatusTypeID": 50,
            "LevelID": 3,
            "PowerKW": 50,
            "CurrentTypeID": 30,
            "Quantity": 1
        }
    ],
    "NumberOfPoints": 1,
    "GeneralComments": "This is a Pod Point rapid charge unit installed at the Lidl super store at Oldlands Farm, Steyning Way, Bognor Regis",
    "StatusTypeID": 50,
    "DateLastStatusUpdate": "2021-03-17T06:21:00Z",
    "DataQualityLevel": 1,
    "DateCreated": "2021-03-14T06:22:00Z",
    "SubmissionStatusTypeID": 200
}