{
    "MediaItems": [
        {
            "ID": 16749,
            "ChargePointID": 24352,
            "ItemURL": "https://s3-ap-southeast-2.amazonaws.com/openchargemap/images/FI/OCM24352/OCM-24352.orig.2018100821080526.jpg",
            "ItemThumbnailURL": "https://s3-ap-southeast-2.amazonaws.com/openchargemap/images/FI/OCM24352/OCM-24352.thmb.2018100821080526.jpg",
            "Comment": "",
            "IsEnabled": true,
            "IsVideo": false,
            "IsFeaturedItem": false,
            "IsExternalResource": false,
            "User": {
                "ID": 18019,
                "Username": "JoeTheProgrammer"
            },
            "DateCreated": "2018-10-08T21:08:00Z"
        }
    ],
    "IsRecentlyVerified": false,
    "ID": 24352,
    "UUID": "B11F501D-7A04-473A-901E-3E61711274E1",
    "DataProviderID": 1,
    "OperatorID": 198,
    "UsageTypeID": 1,
    "AddressInfo": {
        "ID": 24698,
        "Title": "Kallisensuora",
        "AddressLine1": "Kallisensuora",
        "AddressLine2": "Äimärautio",
        "Town": "Oulu",
        "StateOrProvince": "Pohjois-Pohjanmaa",
        "CountryID": 79,
        "Latitude": 64.99248761318617,
        "Longitude": 25.46049406415318,
        "DistanceUnit": 0
    },
    "Connections": [
        {
            "ID": 26516,
            "ConnectionTypeID": 2,
            "StatusTypeID": 50,
            "LevelID": 3,
            "CurrentTypeID": 30
        },
        {
            "ID": 26517,
            "ConnectionTypeID": 33,
            "StatusTypeID": 50,
            "LevelID": 3,
            "CurrentTypeID": 30
        }
    ],
    "NumberOfPoints": 1,
    "StatusTypeID": 50,
    "DateLastStatusUpdate": "2020-12-27T16:44:00Z",
    "DataQualityLevel": 1,
    "DateCreated": "2014-08-31T19:30:00Z",
    "SubmissionStatusTypeID": 200
}