{
    "UserComments": [
        {
            "ID": 3468,
            "ChargePointID": 21471,
            "CommentTypeID": 10,
            "UserName": "Michael Johnson",
            "Comment": "Supports Nissan's 2014 No Charge to Charge program.",
            "Rating": 5,
            "DateCreated": "2014-12-22T01:25:35.347Z",
            "User": {
                "ID": 1475,
                "Username": "Michael Johnson"
            },
            "CheckinStatusTypeID": 210
        }
    ],
    "MediaItems": [
        {
            "ID": 775,
            "ChargePointID": 21471,
            "ItemURL": "https://s3-ap-southeast-2.amazonaws.com/openchargemap/images/US/OCM21471/OCM-21471.orig.2014122319330241.jpg",
            "ItemThumbnailURL": "https://s3-ap-southeast-2.amazonaws.com/openchargemap/images/US/OCM21471/OCM-21471.thmb.2014122319330241.jpg",
            "Comment": "Pricing details:  Blink members pay $0.39 per kwh, guests pay $0.49 per kWh.",
            "IsEnabled": true,
            "IsVideo": false,
            "IsFeaturedItem": false,
            "IsExternalResource": false,
            "User": {
                "ID": 4444,
                "Username": "Michael Johnson"
            },
            "DateCreated": "2014-12-23T19:33:00Z"
        },
        {
            "ID": 774,
            "ChargePointID": 21471,
            "ItemURL": "https://s3-ap-southeast-2.amazonaws.com/openchargemap/images/US/OCM21471/OCM-21471.orig.2014122318025031.jpg",
            "ItemThumbnailURL": "https://s3-ap-southeast-2.amazonaws.com/openchargemap/images/US/OCM21471/OCM-21471.thmb.2014122318025031.jpg",
            "Comment": "This Blink L2 is allocated to a parking spot for people with disabilities.",
            "IsEnabled": true,
            "IsVideo": false,
            "IsFeaturedItem": false,
            "IsExternalResource": false,
            "User": {
                "ID": 4444,
                "Username": "Michael Johnson"
            },
            "DateCreated": "2014-12-23T18:03:00Z"
        },
        {
            "ID": 773,
            "ChargePointID": 21471,
            "ItemURL": "https://s3-ap-southeast-2.amazonaws.com/openchargemap/images/US/OCM21471/OCM-21471.orig.2014122317562213.jpg",
            "ItemThumbnailURL": "https://s3-ap-southeast-2.amazonaws.com/openchargemap/images/US/OCM21471/OCM-21471.thmb.2014122317562213.jpg",
            "Comment": "\"Nissan No-Charge-To-Charge Eligible\".  See https://www.ez-charge.com/faq/",
            "IsEnabled": true,
            "IsVideo": false,
            "IsFeaturedItem": false,
            "IsExternalResource": false,
            "User": {
                "ID": 4444,
                "Username": "Michael Johnson"
            },
            "DateCreated": "2014-12-23T17:57:00Z"
        }
    ],
    "IsRecentlyVerified": false,
    "ID": 21471,
    "UUID": "B4D16CDE-4D24-4A47-B8F8-1A654B47FA72",
    "DataProviderID": 1,
    "OperatorID": 9,
    "OperatorsReference": "MzI5MTQ_3",
    "UsageTypeID": 5,
    "UsageCost": "Blink members: $0.39/kWh, guests: $0.49/kWh",
    "AddressInfo": {
        "ID": 21816,
        "Title": "Starbucks Center - accessible parking",
        "AddressLine1": "2401 Utah Ave South",
        "Town": "Seattle",
        "StateOrProvince": "WA",
        "Postcode": "98134",
        "CountryID": 2,
        "Latitude": 47.5804361579088,
        "Longitude": -122.335027596838,
        "RelatedURL": "http://www.blinknetwork.com",
        "DistanceUnit": 0
    },
    "Connections": [
        {
            "ID": 23316,
            "ConnectionTypeID": 1,
            "StatusTypeID": 50,
            "LevelID": 2,
            "Voltage": 220,
            "Quantity": 1
        }
    ],
    "NumberOfPoints": 1,
    "GeneralComments": "This EVSE has a cord that can reach two adjacent parking spots, one of which is marked for people with disabilities.",
    "StatusTypeID": 50,
    "DateLastStatusUpdate": "2014-12-23T21:00:00Z",
    "DataQualityLevel": 3,
    "DateCreated": "2014-03-22T08:34:00Z",
    "SubmissionStatusTypeID": 100
}