{
    "IsRecentlyVerified": false,
    "ID": 108865,
    "UUID": "6E8C66B8-257E-4FD8-BFF8-59FA065EF779",
    "DataProviderID": 1,
    "OperatorID": 23,
    "OperatorsReference": "44953",
    "UsageTypeID": 4,
    "AddressInfo": {
        "ID": 109211,
        "Title": "Century Parking Corp",
        "AddressLine1": "2600 Netherland Ave",
        "Town": "Bronx",
        "StateOrProvince": "New York",
        "Postcode": "10463",
        "CountryID": 2,
        "Latitude": 40.878532,
        "Longitude": -73.916201,
        "ContactTelephone1": "(718) 543-6002",
        "DistanceUnit": 0
    },
    "Connections": [
        {
            "ID": 153982,
            "ConnectionTypeID": 30,
            "StatusTypeID": 50,
            "LevelID": 2,
            "PowerKW": 6,
            "CurrentTypeID": 10,
            "Quantity": 4
        }
    ],
    "NumberOfPoints": 4,
    "GeneralComments": "4 Tesla Connectors, up to 6kW.Parking fees will apply. Please see valet.",
    "StatusTypeID": 50,
    "DateLastStatusUpdate": "2018-10-11T12:54:00Z",
    "DataQualityLevel": 1,
    "DateCreated": "2018-10-11T12:54:00Z",
    "SubmissionStatusTypeID": 200
}