{
    "IsRecentlyVerified": false,
    "ID": 175764,
    "UUID": "A0F6E2F7-E57D-4A54-BEEB-1BAAF5AD5635",
    "DataProviderID": 1,
    "OperatorID": 23,
    "UsageTypeID": 1,
    "AddressInfo": {
        "ID": 176123,
        "Title": "Designer-Outlet-Straße",
        "AddressLine1": "Designer-Outlet-Straße",
        "Town": "Parndorf",
        "StateOrProvince": "Burgenland",
        "Postcode": "7111",
        "CountryID": 19,
        "Latitude": 47.976792102700074,
        "Longitude": 16.852638221416555,
        "DistanceUnit": 0
    },
    "Connections": [
        {
            "ID": 272955,
            "ConnectionTypeID": 1036,
            "StatusTypeID": 50,
            "Quantity": 1
        },
        {
            "ID": 272956,
            "ConnectionTypeID": 30,
            "StatusTypeID": 50,
            "Quantity": 1
        }
    ],
    "NumberOfPoints": 2,
    "StatusTypeID": 50,
    "DateLastStatusUpdate": "2021-06-13T20:38:00Z",
    "DataQualityLevel": 1,
    "DateCreated": "2021-06-13T16:06:00Z",
    "SubmissionStatusTypeID": 200
}