{
    "IsRecentlyVerified": false,
    "ID": 84817,
    "UUID": "DE4BDA44-61EB-40FF-B9D9-E1FDBBC8317F",
    "DataProviderID": 1,
    "OperatorID": 1,
    "UsageTypeID": 1,
    "UsageCost": "2 kostenlose Parkplätze",
    "AddressInfo": {
        "ID": 85163,
        "Title": "Rathaus in Wasserburg",
        "AddressLine1": "Lindenplatz 1",
        "Town": " Wasserburg",
        "StateOrProvince": "Baden-Württemberg",
        "Postcode": "88142",
        "CountryID": 87,
        "Latitude": 47.5705529,
        "Longitude": 9.63833950000003,
        "ContactTelephone1": "+49 8382 704-0",
        "AccessComments": "Stadtwerke Lindau",
        "RelatedURL": "http://www.sw-lindau.de/",
        "DistanceUnit": 0
    },
    "Connections": [
        {
            "ID": 120490,
            "ConnectionTypeID": 25,
            "StatusTypeID": 50,
            "LevelID": 2,
            "Amps": 32,
            "Voltage": 400,
            "PowerKW": 22,
            "CurrentTypeID": 20,
            "Quantity": 2
        },
        {
            "ID": 120492,
            "ConnectionTypeID": 28,
            "StatusTypeID": 50,
            "LevelID": 2,
            "Amps": 16,
            "Voltage": 230,
            "PowerKW": 3.7,
            "CurrentTypeID": 10,
            "Quantity": 2
        }
    ],
    "NumberOfPoints": 4,
    "GeneralComments": "RFID-Karte erhältlich bei: Stadtwerke Lindau GmbH & Co.KG, Auenstraße 12, 88131 Lindau, +49-08382-7040. Derzeit (24.5.2014) funktionieren alle möglichen RFID Karten. 2 x Typ 2 22 kW\r\n2 x Schuko\r\nÖffnungszeiten\r\nRund um die Uhr (24/7) nutzbar",
    "StatusTypeID": 50,
    "DateLastStatusUpdate": "2017-03-16T08:31:00Z",
    "DataQualityLevel": 1,
    "DateCreated": "2017-03-16T08:25:00Z",
    "SubmissionStatusTypeID": 200
}