{
    "IsRecentlyVerified": false,
    "ID": 41880,
    "UUID": "6995403D-621E-4ECE-BC6D-D6312F48F164",
    "DataProviderID": 1,
    "OperatorID": 45,
    "UsageTypeID": 1,
    "UsageCost": "0",
    "AddressInfo": {
        "ID": 42226,
        "Title": "Autohäuser Wilk & Kaczmarek GmbH",
        "AddressLine1": "Rogahner Straße 64",
        "Town": "Schwerin",
        "StateOrProvince": "Mecklenburg-Vorpommern",
        "Postcode": "19061",
        "CountryID": 87,
        "Latitude": 53.6107039,
        "Longitude": 11.3796726,
        "ContactTelephone1": "0385/773320 ",
        "AccessComments": "Kostenloses Laden während der Öffnungszeiten Mo.-Fr. 9.00 bis 19.00 Uhr, Sa. 9.00 bis 14.00 Uhr. Nissan \"Freistrom für Alle\" Programm.",
        "RelatedURL": "http://wilkkaczmarek.nissan-haendler.de",
        "DistanceUnit": 0
    },
    "Connections": [
        {
            "ID": 50215,
            "ConnectionTypeID": 25,
            "StatusTypeID": 50,
            "LevelID": 2,
            "Amps": 16,
            "Voltage": 230,
            "PowerKW": 3.7,
            "CurrentTypeID": 10,
            "Quantity": 1
        },
        {
            "ID": 50216,
            "ConnectionTypeID": 28,
            "StatusTypeID": 50,
            "LevelID": 2,
            "Amps": 16,
            "Voltage": 230,
            "PowerKW": 3.7,
            "CurrentTypeID": 10,
            "Quantity": 1
        }
    ],
    "NumberOfPoints": 2,
    "StatusTypeID": 50,
    "DateLastStatusUpdate": "2015-02-17T09:52:00Z",
    "DataQualityLevel": 1,
    "DateCreated": "2015-02-17T07:30:00Z",
    "SubmissionStatusTypeID": 200
}