{
    "IsRecentlyVerified": false,
    "ID": 7910,
    "UUID": "44D945A9-3182-48D3-AD23-098A083AC530",
    "DataProviderID": 15,
    "DataProvidersReference": "6377",
    "OperatorID": 26,
    "AddressInfo": {
        "ID": 7807,
        "Title": "4760 Greensboro Rd",
        "AddressLine1": "4760 Greensboro Rd",
        "Town": "Ridgeway",
        "StateOrProvince": "VA",
        "Postcode": "24148",
        "CountryID": 2,
        "Latitude": 36.62963,
        "Longitude": -79.85963,
        "ContactTelephone1": " (276) 956-1212",
        "RelatedURL": "http://carstations.com/6377",
        "DistanceUnit": 0
    },
    "Connections": [
        {
            "ID": 5339,
            "ConnectionTypeID": 1,
            "Reference": "J1772",
            "LevelID": 2
        }
    ],
    "StatusTypeID": 0,
    "DateLastStatusUpdate": "2017-11-04T14:04:00Z",
    "DataQualityLevel": 1,
    "DateCreated": "2011-11-11T12:05:00Z",
    "SubmissionStatusTypeID": 100
}