{
    "IsRecentlyVerified": false,
    "ID": 169390,
    "UUID": "8E1D5236-C852-4C65-BFE0-6CBA09B0A9EA",
    "DataProviderID": 1,
    "OperatorID": 3,
    "OperatorsReference": "t54_hu1_4419_010",
    "UsageTypeID": 4,
    "UsageCost": "£0.25/kWh",
    "AddressInfo": {
        "ID": 169749,
        "Title": "Lidl-Canvey Island",
        "AddressLine1": "Northwick Road",
        "Town": "Canvey Island",
        "Postcode": "SS8 0PU",
        "CountryID": 1,
        "Latitude": 51.5235,
        "Longitude": 0.5553,
        "DistanceUnit": 0
    },
    "Connections": [
        {
            "ID": 257714,
            "ConnectionTypeID": 25,
            "StatusTypeID": 50,
            "LevelID": 2,
            "Amps": 32,
            "Voltage": 400,
            "PowerKW": 22,
            "CurrentTypeID": 20,
            "Quantity": 1
        },
        {
            "ID": 270001,
            "ConnectionTypeID": 33,
            "StatusTypeID": 50,
            "LevelID": 3,
            "PowerKW": 50,
            "CurrentTypeID": 30,
            "Quantity": 1
        },
        {
            "ID": 270049,
            "ConnectionTypeID": 2,
            "StatusTypeID": 50,
            "LevelID": 3,
            "PowerKW": 50,
            "CurrentTypeID": 30,
            "Quantity": 1
        }
    ],
    "NumberOfPoints": 2,
    "GeneralComments": "This is a Pod Point rapid charger installed at the Lidl super store at Northwick Road, Canvey Island",
    "StatusTypeID": 50,
    "DateLastStatusUpdate": "2021-03-25T15:54:00Z",
    "DataQualityLevel": 1,
    "DateCreated": "2020-10-15T21:37:00Z",
    "SubmissionStatusTypeID": 200
}