{
    "IsRecentlyVerified": false,
    "ID": 29177,
    "UUID": "ACCE4985-49B3-4A59-A914-C3B1C9531E00",
    "DataProviderID": 2,
    "DataProvidersReference": "60509",
    "UsageTypeID": 1,
    "AddressInfo": {
        "ID": 29523,
        "Title": "Kwik Trip #863",
        "AddressLine1": "5311 Old Highway 18",
        "Town": "Stevens Point",
        "StateOrProvince": "WI",
        "Postcode": "54482",
        "CountryID": 2,
        "Latitude": 44.521893,
        "Longitude": -89.524605,
        "ContactTelephone1": "715-344-6623",
        "AccessComments": "24 hours daily",
        "RelatedURL": "",
        "DistanceUnit": 0
    },
    "Connections": [
        {
            "ID": 32064,
            "ConnectionTypeID": 9,
            "LevelID": 1,
            "Amps": 16,
            "Voltage": 120,
            "PowerKW": 1.9,
            "CurrentTypeID": 10,
            "Quantity": 1
        }
    ],
    "DateLastStatusUpdate": "2020-06-26T03:08:00Z",
    "DataQualityLevel": 3,
    "DateCreated": "2014-11-28T03:39:00Z",
    "SubmissionStatusTypeID": 100
}