{
    "MediaItems": [
        {
            "ID": 17632,
            "ChargePointID": 114206,
            "ItemURL": "https://s3-ap-southeast-2.amazonaws.com/openchargemap/images/IT/OCM114206/OCM-114206.orig.2019022014505620.jpg",
            "ItemThumbnailURL": "https://s3-ap-southeast-2.amazonaws.com/openchargemap/images/IT/OCM114206/OCM-114206.thmb.2019022014505620.jpg",
            "Comment": "",
            "IsEnabled": true,
            "IsVideo": false,
            "IsFeaturedItem": false,
            "IsExternalResource": false,
            "User": {
                "ID": 19496,
                "Username": "ECOGY"
            },
            "DateCreated": "2019-02-20T14:51:00Z"
        },
        {
            "ID": 17558,
            "ChargePointID": 114206,
            "ItemURL": "https://s3-ap-southeast-2.amazonaws.com/openchargemap/images/IT/OCM114206/OCM-114206.orig.2019021107355813.jpg",
            "ItemThumbnailURL": "https://s3-ap-southeast-2.amazonaws.com/openchargemap/images/IT/OCM114206/OCM-114206.thmb.2019021107355813.jpg",
            "Comment": "",
            "IsEnabled": true,
            "IsVideo": false,
            "IsFeaturedItem": false,
            "IsExternalResource": false,
            "User": {
                "ID": 19496,
                "Username": "ECOGY"
            },
            "DateCreated": "2019-02-11T07:36:00Z"
        },
        {
            "ID": 17557,
            "ChargePointID": 114206,
            "ItemURL": "https://s3-ap-southeast-2.amazonaws.com/openchargemap/images/IT/OCM114206/OCM-114206.orig.2019021107345231.jpg",
            "ItemThumbnailURL": "https://s3-ap-southeast-2.amazonaws.com/openchargemap/images/IT/OCM114206/OCM-114206.thmb.2019021107345231.jpg",
            "Comment": "",
            "IsEnabled": true,
            "IsVideo": false,
            "IsFeaturedItem": false,
            "IsExternalResource": false,
            "User": {
                "ID": 19496,
                "Username": "ECOGY"
            },
            "DateCreated": "2019-02-11T07:35:00Z"
        }
    ],
    "IsRecentlyVerified": false,
    "ID": 114206,
    "UUID": "78C77A64-5A30-4D36-A0B6-9E958E1C3272",
    "DataProviderID": 1,
    "OperatorID": 45,
    "UsageTypeID": 7,
    "UsageCost": "0,30 Cent/kWh",
    "AddressInfo": {
        "ID": 114552,
        "Title": "Appartmenthotel Ritterhof Schenna ",
        "AddressLine1": "Schennastr.41/B",
        "Town": "Schenna",
        "StateOrProvince": "BZ",
        "Postcode": "39017",
        "CountryID": 112,
        "Latitude": 46.6829006909515,
        "Longitude": 11.1892200345639,
        "ContactTelephone1": "+39 0473 945850",
        "ContactEmail": "ritterhof@schenna.com",
        "AccessComments": "Für Hotelkunden mittels RFID Karte",
        "RelatedURL": "https://www.ritterhof-schenna.com",
        "DistanceUnit": 0
    },
    "Connections": [
        {
            "ID": 160778,
            "ConnectionTypeID": 25,
            "StatusTypeID": 50,
            "LevelID": 2,
            "Amps": 10,
            "Voltage": 400,
            "PowerKW": 7,
            "CurrentTypeID": 20,
            "Quantity": 1
        }
    ],
    "NumberOfPoints": 1,
    "GeneralComments": "Ladestation befindet sich beim Kundenparkplatz",
    "StatusTypeID": 50,
    "DateLastStatusUpdate": "2019-02-20T14:51:00Z",
    "DataQualityLevel": 1,
    "DateCreated": "2019-01-03T10:28:00Z",
    "SubmissionStatusTypeID": 200
}