{
    "UserComments": [
        {
            "ID": 19468,
            "ChargePointID": 103165,
            "CommentTypeID": 10,
            "UserName": "ForumElettrico.it",
            "RelatedURL": "https://www.forumelettrico.it/forum/nuova-fast-enel-a-noventa-di-piave-t2661.html",
            "DateCreated": "2018-04-25T16:35:00.687Z",
            "User": {
                "ID": 11749,
                "Username": "ForumElettrico.it"
            },
            "CheckinStatusTypeID": 140
        },
        {
            "ID": 19467,
            "ChargePointID": 103165,
            "CommentTypeID": 10,
            "UserName": "ForumElettrico.it",
            "Comment": "https://www.forumelettrico.it/forum/nuova-fast-enel-a-noventa-di-piave-t2661.html\n",
            "DateCreated": "2018-04-25T16:34:39.66Z",
            "User": {
                "ID": 11749,
                "Username": "ForumElettrico.it"
            },
            "CheckinStatusTypeID": 140
        }
    ],
    "MediaItems": [
        {
            "ID": 16322,
            "ChargePointID": 103165,
            "ItemURL": "https://s3-ap-southeast-2.amazonaws.com/openchargemap/images/IT/OCM103165/OCM-103165.orig.2018082012083199.jpg",
            "ItemThumbnailURL": "https://s3-ap-southeast-2.amazonaws.com/openchargemap/images/IT/OCM103165/OCM-103165.thmb.2018082012083199.jpg",
            "Comment": "",
            "IsEnabled": true,
            "IsVideo": false,
            "IsFeaturedItem": false,
            "IsExternalResource": false,
            "User": {
                "ID": 11749,
                "Username": "ForumElettrico.it"
            },
            "DateCreated": "2018-08-20T12:09:00Z"
        },
        {
            "ID": 16323,
            "ChargePointID": 103165,
            "ItemURL": "https://s3-ap-southeast-2.amazonaws.com/openchargemap/images/IT/OCM103165/OCM-103165.orig.2018082012084047.jpg",
            "ItemThumbnailURL": "https://s3-ap-southeast-2.amazonaws.com/openchargemap/images/IT/OCM103165/OCM-103165.thmb.2018082012084047.jpg",
            "Comment": "",
            "IsEnabled": true,
            "IsVideo": false,
            "IsFeaturedItem": false,
            "IsExternalResource": false,
            "User": {
                "ID": 11749,
                "Username": "ForumElettrico.it"
            },
            "DateCreated": "2018-08-20T12:09:00Z"
        },
        {
            "ID": 16324,
            "ChargePointID": 103165,
            "ItemURL": "https://s3-ap-southeast-2.amazonaws.com/openchargemap/images/IT/OCM103165/OCM-103165.orig.2018082012084852.jpg",
            "ItemThumbnailURL": "https://s3-ap-southeast-2.amazonaws.com/openchargemap/images/IT/OCM103165/OCM-103165.thmb.2018082012084852.jpg",
            "Comment": "",
            "IsEnabled": true,
            "IsVideo": false,
            "IsFeaturedItem": false,
            "IsExternalResource": false,
            "User": {
                "ID": 11749,
                "Username": "ForumElettrico.it"
            },
            "DateCreated": "2018-08-20T12:09:00Z"
        },
        {
            "ID": 16325,
            "ChargePointID": 103165,
            "ItemURL": "https://s3-ap-southeast-2.amazonaws.com/openchargemap/images/IT/OCM103165/OCM-103165.orig.2018082012085617.jpg",
            "ItemThumbnailURL": "https://s3-ap-southeast-2.amazonaws.com/openchargemap/images/IT/OCM103165/OCM-103165.thmb.2018082012085617.jpg",
            "Comment": "",
            "IsEnabled": true,
            "IsVideo": false,
            "IsFeaturedItem": false,
            "IsExternalResource": false,
            "User": {
                "ID": 11749,
                "Username": "ForumElettrico.it"
            },
            "DateCreated": "2018-08-20T12:09:00Z"
        },
        {
            "ID": 15344,
            "ChargePointID": 103165,
            "ItemURL": "https://s3-ap-southeast-2.amazonaws.com/openchargemap/images/IT/OCM103165/OCM-103165.orig.2018042516352173.jpg",
            "ItemThumbnailURL": "https://s3-ap-southeast-2.amazonaws.com/openchargemap/images/IT/OCM103165/OCM-103165.thmb.2018042516352173.jpg",
            "Comment": "",
            "IsEnabled": true,
            "IsVideo": false,
            "IsFeaturedItem": false,
            "IsExternalResource": false,
            "User": {
                "ID": 11749,
                "Username": "ForumElettrico.it"
            },
            "DateCreated": "2018-04-25T16:36:00Z"
        },
        {
            "ID": 15345,
            "ChargePointID": 103165,
            "ItemURL": "https://s3-ap-southeast-2.amazonaws.com/openchargemap/images/IT/OCM103165/OCM-103165.orig.2018042516353769.jpg",
            "ItemThumbnailURL": "https://s3-ap-southeast-2.amazonaws.com/openchargemap/images/IT/OCM103165/OCM-103165.thmb.2018042516353769.jpg",
            "Comment": "",
            "IsEnabled": true,
            "IsVideo": false,
            "IsFeaturedItem": false,
            "IsExternalResource": false,
            "User": {
                "ID": 11749,
                "Username": "ForumElettrico.it"
            },
            "DateCreated": "2018-04-25T16:36:00Z"
        }
    ],
    "IsRecentlyVerified": false,
    "ID": 103165,
    "UUID": "EB467BF3-E9F4-4D6E-81D1-7DE176FB028F",
    "DataProviderID": 1,
    "OperatorID": 80,
    "UsageTypeID": 4,
    "UsageCost": "0,40 €/kWh",
    "AddressInfo": {
        "ID": 103511,
        "Title": "EnelX EVA+ Noventa di Piave",
        "AddressLine1": "Via Marco Polo, 1",
        "Town": "Noventa di Piave",
        "StateOrProvince": "VE",
        "Postcode": "30020 ",
        "CountryID": 112,
        "Latitude": 45.6723258429843,
        "Longitude": 12.536229780015,
        "RelatedURL": "http://eneldrive.it",
        "DistanceUnit": 0
    },
    "Connections": [
        {
            "ID": 145759,
            "ConnectionTypeID": 33,
            "StatusTypeID": 50,
            "LevelID": 3,
            "PowerKW": 50,
            "CurrentTypeID": 30,
            "Quantity": 1
        },
        {
            "ID": 145760,
            "ConnectionTypeID": 2,
            "StatusTypeID": 50,
            "LevelID": 3,
            "PowerKW": 50,
            "CurrentTypeID": 30,
            "Quantity": 1
        },
        {
            "ID": 145761,
            "ConnectionTypeID": 1036,
            "StatusTypeID": 50,
            "LevelID": 3,
            "Amps": 64,
            "Voltage": 400,
            "PowerKW": 43,
            "CurrentTypeID": 20,
            "Quantity": 1
        }
    ],
    "NumberOfPoints": 2,
    "StatusTypeID": 50,
    "DateLastStatusUpdate": "2018-08-20T12:09:00Z",
    "DataQualityLevel": 1,
    "DateCreated": "2018-04-23T09:39:00Z",
    "SubmissionStatusTypeID": 200
}