{
    "UserComments": [
        {
            "ID": 15945,
            "ChargePointID": 52926,
            "CommentTypeID": 50,
            "UserName": "Francine Merry",
            "Comment": "These chargers are no longer run by Source London but by PolarPlus. Really annoying as, being a member of Source London, I was not notified",
            "Rating": 3,
            "DateCreated": "2017-02-18T14:26:15.597Z",
            "User": {
                "ID": 13346,
                "Username": "Francine Merry"
            },
            "CheckinStatusTypeID": 40
        }
    ],
    "IsRecentlyVerified": false,
    "ID": 52926,
    "UUID": "8F7F5177-932C-442E-877C-09E3EEF5ABB4",
    "DataProviderID": 1,
    "OperatorID": 32,
    "OperatorsReference": "1888,1892,1904,1912,1916,1921,1924",
    "UsageTypeID": 4,
    "UsageCost": "£0.108/kWh; for Polar Plus subscription members only. Parking fees apply",
    "AddressInfo": {
        "ID": 53272,
        "Title": "Canary Wharf",
        "AddressLine1": "Canada Square",
        "AddressLine2": "Tower Hamlets",
        "Town": "London",
        "Postcode": "E14 5EW",
        "CountryID": 1,
        "Latitude": 51.504501,
        "Longitude": -0.015718,
        "AccessComments": "Level P3",
        "DistanceUnit": 0
    },
    "Connections": [
        {
            "ID": 65884,
            "ConnectionTypeID": 25,
            "StatusTypeID": 50,
            "LevelID": 2,
            "Amps": 32,
            "Voltage": 230,
            "PowerKW": 7,
            "CurrentTypeID": 10,
            "Quantity": 14
        }
    ],
    "NumberOfPoints": 14,
    "GeneralComments": "Chargemaster posts. No longer on Source London",
    "StatusTypeID": 50,
    "DateLastStatusUpdate": "2019-03-08T06:32:00Z",
    "DataQualityLevel": 1,
    "DateCreated": "2015-09-14T09:56:00Z",
    "SubmissionStatusTypeID": 100
}