{
    "IsRecentlyVerified": false,
    "ID": 120236,
    "UUID": "DDD648FC-E3B0-45FF-BFEC-937B76F8C3D1",
    "DataProviderID": 2,
    "DataProvidersReference": "80874",
    "UsageTypeID": 1,
    "AddressInfo": {
        "ID": 120582,
        "Title": "City of Baton Rouge - Louisiana Avenue",
        "AddressLine1": "351 Louisiana Ave",
        "Town": "Baton Rouge",
        "StateOrProvince": "LA",
        "Postcode": "70802",
        "CountryID": 2,
        "Latitude": 30.444913,
        "Longitude": -91.187056,
        "ContactTelephone1": "225-389-3246",
        "AccessComments": "24 hours daily",
        "RelatedURL": "",
        "DistanceUnit": 0
    },
    "Connections": [
        {
            "ID": 169565,
            "ConnectionTypeID": 1,
            "LevelID": 2,
            "Amps": 16,
            "Voltage": 230,
            "PowerKW": 3.7,
            "CurrentTypeID": 10,
            "Quantity": 2
        }
    ],
    "DateLastStatusUpdate": "2020-06-26T02:54:00Z",
    "DataQualityLevel": 3,
    "DateCreated": "2019-04-01T04:59:00Z",
    "SubmissionStatusTypeID": 100
}