{
    "IsRecentlyVerified": false,
    "ID": 66825,
    "UUID": "D724ACAA-EF1E-4181-8643-AA929B33919C",
    "DataProviderID": 1,
    "OperatorID": 23,
    "OperatorsReference": "11896",
    "UsageTypeID": 1,
    "UsageCost": "Free",
    "AddressInfo": {
        "ID": 67171,
        "Title": "Wing Aviation Hanger - Tesla",
        "AddressLine1": "8410 Larson St",
        "Town": "Houston",
        "StateOrProvince": "TX",
        "Postcode": "77061",
        "CountryID": 2,
        "Latitude": 29.6492185,
        "Longitude": -95.2688903,
        "ContactTelephone1": "866-944-9464  877-798-3752",
        "AccessComments": "24 hours daily; for Tesla use only; for guest use only; see front desk for access",
        "RelatedURL": "http://www.teslamotors.com/supercharger",
        "DistanceUnit": 0
    },
    "Connections": [
        {
            "ID": 92312,
            "ConnectionTypeID": 30,
            "StatusTypeID": 50,
            "LevelID": 2,
            "Amps": 16,
            "Voltage": 230,
            "PowerKW": 16,
            "CurrentTypeID": 10,
            "Quantity": 1
        }
    ],
    "NumberOfPoints": 1,
    "StatusTypeID": 50,
    "DateLastStatusUpdate": "2017-01-26T02:35:00Z",
    "DataQualityLevel": 3,
    "DateCreated": "2016-05-29T02:04:00Z",
    "SubmissionStatusTypeID": 100
}