{
    "IsRecentlyVerified": false,
    "ID": 72427,
    "UUID": "D489D68F-B556-42CA-B931-56F1EC807C17",
    "DataProviderID": 1,
    "OperatorID": 3,
    "OperatorsReference": "PG-90605",
    "UsageTypeID": 6,
    "UsageCost": "Free",
    "AddressInfo": {
        "ID": 72773,
        "Title": "Vantage Preston-Hyundai",
        "AddressLine1": "Riversway Motor Park",
        "AddressLine2": "Admiral Way",
        "Town": "Preston",
        "StateOrProvince": "Lancashire",
        "Postcode": "PR2 2TY",
        "CountryID": 1,
        "Latitude": 53.760094,
        "Longitude": -2.761198,
        "DistanceUnit": 0
    },
    "Connections": [
        {
            "ID": 103794,
            "ConnectionTypeID": 25,
            "StatusTypeID": 50,
            "LevelID": 2,
            "Amps": 32,
            "Voltage": 230,
            "PowerKW": 7,
            "CurrentTypeID": 10,
            "Quantity": 1
        }
    ],
    "NumberOfPoints": 3,
    "StatusTypeID": 50,
    "DateLastStatusUpdate": "2017-10-11T05:19:00Z",
    "DataQualityLevel": 1,
    "DateCreated": "2016-10-13T16:31:00Z",
    "SubmissionStatusTypeID": 200
}