{
    "IsRecentlyVerified": false,
    "ID": 53574,
    "UUID": "4A5956A0-3D0E-447A-86ED-77F2ED23742E",
    "DataProviderID": 26,
    "DataProvidersReference": "68969",
    "OperatorID": 78,
    "OperatorsReference": "Essent EM-CH-00002517-01-00001",
    "UsageCost": "0.00 jaarabonnement",
    "AddressInfo": {
        "ID": 53920,
        "Title": "Hauptstrasse 59a",
        "AddressLine1": "Hauptstrasse 59a",
        "Town": "Derendingen",
        "Postcode": "4552",
        "CountryID": 217,
        "Latitude": 47.1931,
        "Longitude": 7.5872,
        "RelatedURL": "http://www.essent.nl",
        "DistanceUnit": 0
    },
    "Connections": [
        {
            "ID": 66716,
            "ConnectionTypeID": 25,
            "LevelID": 2,
            "PowerKW": 11,
            "CurrentTypeID": 10
        }
    ],
    "NumberOfPoints": 1,
    "StatusTypeID": 50,
    "DateLastStatusUpdate": "2016-06-04T02:38:00Z",
    "DataQualityLevel": 3,
    "DateCreated": "2015-09-20T11:50:00Z",
    "SubmissionStatusTypeID": 100
}