{
    "IsRecentlyVerified": false,
    "ID": 142578,
    "UUID": "0BCAF744-9AE4-4461-B822-D345795E344F",
    "DataProviderID": 2,
    "DataProvidersReference": "150420",
    "UsageTypeID": 2,
    "AddressInfo": {
        "ID": 142930,
        "Title": "Borough of Park Ridge",
        "AddressLine1": "55 Park Ave",
        "Town": "Park Ridge",
        "StateOrProvince": "NJ",
        "Postcode": "07656",
        "CountryID": 2,
        "Latitude": 41.021155,
        "Longitude": -74.02708,
        "ContactTelephone1": "",
        "AccessComments": "",
        "RelatedURL": "",
        "DistanceUnit": 0
    },
    "Connections": [
        {
            "ID": 198743,
            "ConnectionTypeID": 1,
            "LevelID": 2,
            "Amps": 16,
            "Voltage": 230,
            "PowerKW": 3.7,
            "CurrentTypeID": 10,
            "Quantity": 2
        }
    ],
    "StatusTypeID": 50,
    "DateLastStatusUpdate": "2020-06-26T03:03:00Z",
    "DataQualityLevel": 3,
    "DateCreated": "2019-12-24T09:18:00Z",
    "SubmissionStatusTypeID": 100
}