{
    "IsRecentlyVerified": false,
    "ID": 157682,
    "UUID": "E3307449-E83F-4E83-BDA4-10793D669FCF",
    "DataProviderID": 1,
    "OperatorID": 21,
    "UsageTypeID": 4,
    "UsageCost": "Mobi.E compatible card",
    "AddressInfo": {
        "ID": 158036,
        "Title": "OER-00020",
        "AddressLine1": "Makro Alfragide ",
        "Town": "Oeiras",
        "Postcode": "2790-236",
        "CountryID": 180,
        "Latitude": 38.72419109453398,
        "Longitude": -9.21409124037973,
        "AccessComments": "Makro",
        "RelatedURL": "https://www.mobie.pt",
        "DistanceUnit": 0
    },
    "Connections": [
        {
            "ID": 227196,
            "ConnectionTypeID": 25,
            "StatusTypeID": 50,
            "LevelID": 2,
            "Amps": 32,
            "Voltage": 400,
            "PowerKW": 22,
            "CurrentTypeID": 20,
            "Quantity": 2
        }
    ],
    "NumberOfPoints": 2,
    "StatusTypeID": 50,
    "DateLastStatusUpdate": "2020-08-12T13:48:00Z",
    "DataQualityLevel": 3,
    "DateCreated": "2020-06-25T05:42:00Z",
    "SubmissionStatusTypeID": 100
}