{
    "IsRecentlyVerified": false,
    "ID": 73513,
    "UUID": "770CC941-6A6B-49C2-951B-FEAFCBB080EF",
    "DataProviderID": 1,
    "OperatorID": 1,
    "UsageTypeID": 1,
    "UsageCost": "Free",
    "AddressInfo": {
        "ID": 73859,
        "Title": "Metro Ford",
        "AddressLine1": "1000 Barnes Crossing Rd",
        "AddressLine2": "",
        "Town": "Tupelo",
        "StateOrProvince": "MS",
        "Postcode": "38804",
        "CountryID": 2,
        "Latitude": 34.317485545925244,
        "Longitude": -88.7017947435379,
        "ContactTelephone1": "(662) 841-1000",
        "ContactTelephone2": "",
        "ContactEmail": "",
        "AccessComments": "",
        "RelatedURL": "",
        "DistanceUnit": 0
    },
    "Connections": [
        {
            "ID": 105751,
            "ConnectionTypeID": 1,
            "StatusTypeID": 50,
            "LevelID": 2
        }
    ],
    "NumberOfPoints": 1,
    "GeneralComments": "",
    "StatusTypeID": 50,
    "DateLastStatusUpdate": "2016-11-22T16:46:00Z",
    "DataQualityLevel": 1,
    "DateCreated": "2016-11-22T13:45:00Z",
    "SubmissionStatusTypeID": 200
}