{
    "IsRecentlyVerified": false,
    "ID": 135144,
    "UUID": "A3D5A6FF-6914-4DFC-A40C-E7CBBD1FC668",
    "DataProviderID": 1,
    "OperatorID": 3311,
    "UsageTypeID": 1,
    "UsageCost": "Free",
    "AddressInfo": {
        "ID": 135490,
        "Title": "ELEN - Ulica braće Radić",
        "AddressLine1": "Ulica braće Radić",
        "Town": "Varaždin",
        "StateOrProvince": "Varaždin County",
        "Postcode": "42 000",
        "CountryID": 60,
        "Latitude": 46.30588803718675,
        "Longitude": 16.332256279812327,
        "DistanceUnit": 0
    },
    "Connections": [
        {
            "ID": 189179,
            "ConnectionTypeID": 25,
            "StatusTypeID": 50,
            "LevelID": 2,
            "Amps": 32,
            "Voltage": 400,
            "PowerKW": 22,
            "CurrentTypeID": 20,
            "Quantity": 2
        }
    ],
    "NumberOfPoints": 2,
    "GeneralComments": "Free access and parking, any RFID will activate",
    "StatusTypeID": 50,
    "DateLastStatusUpdate": "2019-12-08T19:08:00Z",
    "DataQualityLevel": 1,
    "DateCreated": "2019-12-08T19:08:00Z",
    "SubmissionStatusTypeID": 200
}