{
    "IsRecentlyVerified": false,
    "ID": 175228,
    "UUID": "C4600AD9-B979-4F55-9DAC-EB0F0CF9F380",
    "DataProviderID": 1,
    "OperatorID": 3253,
    "UsageTypeID": 1,
    "UsageCost": "",
    "AddressInfo": {
        "ID": 175587,
        "Title": "St. Pölten Süd - Merkur Markt",
        "AddressLine1": "6 Anton-Scheiblin-Gasse",
        "Town": "Sankt Pölten",
        "StateOrProvince": "Lower Austria",
        "Postcode": "3103",
        "CountryID": 19,
        "Latitude": 48.18279,
        "Longitude": 15.62005,
        "DistanceUnit": 0
    },
    "Connections": [
        {
            "ID": 271695,
            "ConnectionTypeID": 33,
            "StatusTypeID": 50,
            "LevelID": 3,
            "PowerKW": 50,
            "CurrentTypeID": 30,
            "Quantity": 1
        },
        {
            "ID": 271696,
            "ConnectionTypeID": 2,
            "StatusTypeID": 50,
            "LevelID": 3,
            "PowerKW": 50,
            "CurrentTypeID": 30,
            "Quantity": 1
        },
        {
            "ID": 271697,
            "ConnectionTypeID": 1036,
            "StatusTypeID": 50,
            "LevelID": 3,
            "PowerKW": 43,
            "CurrentTypeID": 20,
            "Quantity": 1
        },
        {
            "ID": 271698,
            "ConnectionTypeID": 1036,
            "StatusTypeID": 50,
            "LevelID": 2,
            "PowerKW": 22,
            "CurrentTypeID": 20,
            "Quantity": 6
        }
    ],
    "NumberOfPoints": 8,
    "StatusTypeID": 50,
    "DateLastStatusUpdate": "2021-05-02T14:59:00Z",
    "DataQualityLevel": 1,
    "DateCreated": "2021-05-02T08:07:00Z",
    "SubmissionStatusTypeID": 200
}