{
    "IsRecentlyVerified": false,
    "ID": 64953,
    "UUID": "0B91464F-BFA2-4B37-8CA4-9550DC43F8F4",
    "DataProviderID": 1,
    "DataProvidersReference": "3315",
    "AddressInfo": {
        "ID": 65299,
        "Title": "Bee Hisings Backa / Preem",
        "AddressLine1": "Importgatan 2",
        "Town": "HISINGS BACKA",
        "StateOrProvince": "VÄSTRA GÖTALAND",
        "Postcode": "42246",
        "CountryID": 216,
        "Latitude": 57.74793,
        "Longitude": 11.99451,
        "AccessComments": "Preem Hisings Backa",
        "DistanceUnit": 0
    },
    "Connections": [
        {
            "ID": 83599,
            "ConnectionTypeID": 0,
            "Reference": "1",
            "LevelID": 2,
            "Amps": 100,
            "Voltage": 500,
            "PowerKW": 50,
            "Comments": "Mode 4"
        },
        {
            "ID": 83954,
            "ConnectionTypeID": 0,
            "Reference": "2",
            "LevelID": 2,
            "Amps": 100,
            "Voltage": 500,
            "PowerKW": 50,
            "Comments": "Mode 4"
        },
        {
            "ID": 87884,
            "ConnectionTypeID": 0,
            "Reference": "3",
            "LevelID": 2,
            "Amps": 63,
            "Voltage": 400,
            "PowerKW": 43,
            "Comments": "Mode 3"
        }
    ],
    "NumberOfPoints": 3,
    "DateLastStatusUpdate": "2020-05-26T08:21:00Z",
    "DataQualityLevel": 2,
    "DateCreated": "2016-04-01T07:49:00Z",
    "SubmissionStatusTypeID": 100
}