{
    "IsRecentlyVerified": false,
    "ID": 183972,
    "UUID": "5BC70241-00D5-4756-8629-71FA13DAB933",
    "DataProviderID": 29,
    "DataProvidersReference": "228",
    "OperatorID": 3403,
    "AddressInfo": {
        "ID": 184331,
        "Title": "Im Hahn 0",
        "AddressLine1": "Im Hahn 0",
        "Town": "Stolberg",
        "Postcode": "52222",
        "CountryID": 87,
        "Latitude": 50.756531,
        "Longitude": 6.2776291,
        "DistanceUnit": 0
    },
    "Connections": [
        {
            "ID": 291624,
            "ConnectionTypeID": 25,
            "StatusTypeID": 50,
            "LevelID": 2,
            "PowerKW": 22,
            "CurrentTypeID": 20
        },
        {
            "ID": 291625,
            "ConnectionTypeID": 25,
            "StatusTypeID": 50,
            "LevelID": 2,
            "PowerKW": 22,
            "CurrentTypeID": 20
        }
    ],
    "StatusTypeID": 50,
    "DateLastStatusUpdate": "2021-07-12T02:45:00Z",
    "MetadataValues": [
        {
            "ID": 16265,
            "MetadataFieldID": 4,
            "ItemValue": "Data from the German chargepoint registry provided by Bundesnetzagentur.de under the CC-BY 4.0 license"
        }
    ],
    "DataQualityLevel": 3,
    "DateCreated": "2021-07-08T10:04:00Z",
    "SubmissionStatusTypeID": 100
}