{
    "IsRecentlyVerified": false,
    "ID": 173637,
    "UUID": "1EA07C8A-54FF-4E5B-A66B-ABE6D49DDB9F",
    "DataProviderID": 18,
    "DataProvidersReference": "39cbe40b9e4e4177ab7b7bb01519171a",
    "UsageTypeID": 1,
    "AddressInfo": {
        "ID": 173996,
        "Title": "Heol y Parc",
        "AddressLine1": "Heol y Parc",
        "Town": "Pontyberem",
        "Postcode": "SA15 5EA",
        "CountryID": 1,
        "Latitude": 51.778861,
        "Longitude": -4.173797,
        "AccessComments": "",
        "RelatedURL": "http://www.clenerg-ev.com/",
        "DistanceUnit": 0
    },
    "Connections": [
        {
            "ID": 266742,
            "ConnectionTypeID": 25,
            "Reference": "Connector 1",
            "StatusTypeID": 50,
            "LevelID": 2,
            "Amps": 32,
            "Voltage": 400,
            "PowerKW": 22,
            "CurrentTypeID": 20
        },
        {
            "ID": 266743,
            "ConnectionTypeID": 25,
            "Reference": "Connector 2",
            "StatusTypeID": 50,
            "LevelID": 2,
            "Amps": 32,
            "Voltage": 400,
            "PowerKW": 22,
            "CurrentTypeID": 20
        }
    ],
    "StatusTypeID": 0,
    "DateLastStatusUpdate": "2021-03-03T11:25:00Z",
    "MetadataValues": [
        {
            "ID": 8559,
            "MetadataFieldID": 4,
            "ItemValue": "Contains public sector information licensed under the Open Government Licence v2.0. http://www.nationalarchives.gov.uk/doc/open-government-licence/version/2/"
        }
    ],
    "DataQualityLevel": 3,
    "DateCreated": "2021-03-03T11:25:00Z",
    "SubmissionStatusTypeID": 100
}