{
    "IsRecentlyVerified": false,
    "ID": 172002,
    "UUID": "9D526585-4367-4A19-9F75-28AA7302633D",
    "DataProviderID": 1,
    "OperatorID": 3341,
    "UsageTypeID": 5,
    "AddressInfo": {
        "ID": 172361,
        "Title": "Jamaica Inn",
        "AddressLine1": "Launceston ",
        "Town": "Launceston",
        "StateOrProvince": "England",
        "Postcode": "PL15 7TS",
        "CountryID": 1,
        "Latitude": 50.56228331073146,
        "Longitude": -4.56673877879598,
        "RelatedURL": "https://www.swarcoeconnect.org/",
        "DistanceUnit": 0
    },
    "Connections": [
        {
            "ID": 262881,
            "ConnectionTypeID": 2,
            "StatusTypeID": 50,
            "LevelID": 3,
            "PowerKW": 50,
            "CurrentTypeID": 30,
            "Quantity": 2
        },
        {
            "ID": 262882,
            "ConnectionTypeID": 33,
            "StatusTypeID": 50,
            "LevelID": 3,
            "PowerKW": 50,
            "CurrentTypeID": 30,
            "Quantity": 2
        },
        {
            "ID": 262883,
            "ConnectionTypeID": 1036,
            "StatusTypeID": 50,
            "LevelID": 2,
            "Amps": 63,
            "Voltage": 400,
            "PowerKW": 22,
            "CurrentTypeID": 20,
            "Quantity": 2
        }
    ],
    "NumberOfPoints": 1,
    "GeneralComments": "Installation funded by Highways England",
    "StatusTypeID": 50,
    "DateLastStatusUpdate": "2021-07-14T10:57:00Z",
    "DataQualityLevel": 1,
    "DateCreated": "2021-01-11T08:02:00Z",
    "SubmissionStatusTypeID": 200
}