{
    "IsRecentlyVerified": false,
    "ID": 143109,
    "UUID": "F71B862C-F455-4E12-98EE-EB2F879C7168",
    "DataProviderID": 2,
    "DataProvidersReference": "93377",
    "OperatorID": 15,
    "UsageTypeID": 4,
    "AddressInfo": {
        "ID": 143461,
        "Title": "Dunkin' Donuts",
        "AddressLine1": "39600 Ann Arbor Rd E",
        "Town": "Plymouth",
        "StateOrProvince": "MI",
        "Postcode": "48170",
        "CountryID": 2,
        "Latitude": 42.360011,
        "Longitude": -83.43257,
        "ContactTelephone1": "877-455-3833",
        "AccessComments": "24 hours daily\r\nPublic - Card key at all times",
        "RelatedURL": "https://www.evgo.com/",
        "DistanceUnit": 0
    },
    "Connections": [
        {
            "ID": 199373,
            "ConnectionTypeID": 2,
            "LevelID": 3,
            "Amps": 100,
            "Voltage": 400,
            "PowerKW": 40,
            "CurrentTypeID": 30,
            "Quantity": 1
        },
        {
            "ID": 199374,
            "ConnectionTypeID": 32,
            "LevelID": 3,
            "Amps": 100,
            "Voltage": 400,
            "PowerKW": 40,
            "CurrentTypeID": 30,
            "Quantity": 1
        }
    ],
    "StatusTypeID": 50,
    "DateLastStatusUpdate": "2020-06-26T03:05:00Z",
    "DataQualityLevel": 3,
    "DateCreated": "2019-12-24T09:20:00Z",
    "SubmissionStatusTypeID": 100
}