{
    "IsRecentlyVerified": false,
    "ID": 144798,
    "UUID": "FBA6E9C0-95B2-4165-AC3F-727D88F002E0",
    "DataProviderID": 1,
    "OperatorID": 90,
    "UsageTypeID": 1,
    "UsageCost": "11,78$/hour",
    "AddressInfo": {
        "ID": 145150,
        "Title": "BRCC - Lachute - Petro-Canada",
        "AddressLine1": "512 Avenue Béthany",
        "Town": "Lachute",
        "StateOrProvince": "QC",
        "Postcode": "J8H 4H4",
        "CountryID": 44,
        "Latitude": 45.63646619198559,
        "Longitude": -74.32742680083754,
        "ContactTelephone1": "877-505-2674",
        "AccessComments": "24 hours daily",
        "RelatedURL": "https://lecircuitelectrique.com/",
        "DistanceUnit": 0
    },
    "Connections": [
        {
            "ID": 201331,
            "ConnectionTypeID": 2,
            "StatusTypeID": 50,
            "LevelID": 3,
            "Amps": 125,
            "Voltage": 400,
            "PowerKW": 50,
            "CurrentTypeID": 30,
            "Quantity": 4
        },
        {
            "ID": 201332,
            "ConnectionTypeID": 32,
            "StatusTypeID": 50,
            "LevelID": 3,
            "Amps": 100,
            "Voltage": 400,
            "PowerKW": 50,
            "CurrentTypeID": 30,
            "Quantity": 4
        }
    ],
    "NumberOfPoints": 4,
    "StatusTypeID": 50,
    "DateLastStatusUpdate": "2020-06-22T12:58:00Z",
    "DataQualityLevel": 3,
    "DateCreated": "2019-12-24T09:23:00Z",
    "SubmissionStatusTypeID": 100
}