{
    "IsRecentlyVerified": false,
    "ID": 42186,
    "UUID": "358B5FE4-9204-471F-BB0D-06555B7890E1",
    "DataProviderID": 1,
    "OperatorID": 155,
    "UsageTypeID": 4,
    "UsageCost": "0",
    "AddressInfo": {
        "ID": 42532,
        "Title": "Wohnungsgenossenschaft Lipsia",
        "AddressLine1": "Brünner Straße 13",
        "AddressLine2": "Grünau-Ost",
        "Town": "Leipzig",
        "StateOrProvince": "Leipzig",
        "Postcode": "04209",
        "CountryID": 87,
        "Latitude": 51.3245828,
        "Longitude": 12.3064956000001,
        "ContactTelephone1": "0341 121 7010",
        "ContactEmail": "elektromobilitaet@swl.de",
        "AccessComments": "4 kostenfreie immer nutzbare Parkplätze. Die Wohnungsgenossenschaft hat mehrere eigene E-Autos, die die Parkplätze belegen! \r\nRFID Karte im Empfang während der Öffnungszeiten (Mo 8-16, Di 9-19, Mi 8-16, Do 9-17, Fr 9-17, Sa 8-12Uhr) ausleihen (SWL Karte NICHT funktionsfähig, obwohl Betreiber) oder PlugSurfing Keyhanger nötig.\r\n",
        "RelatedURL": "http://openchargemap.org/app/?view=locationdetails-page#",
        "DistanceUnit": 0
    },
    "Connections": [
        {
            "ID": 50680,
            "ConnectionTypeID": 25,
            "StatusTypeID": 50,
            "LevelID": 2,
            "Amps": 25,
            "Voltage": 400,
            "PowerKW": 17,
            "CurrentTypeID": 20,
            "Quantity": 2
        },
        {
            "ID": 50681,
            "ConnectionTypeID": 28,
            "StatusTypeID": 50,
            "LevelID": 2,
            "Amps": 16,
            "Voltage": 230,
            "PowerKW": 3.7,
            "CurrentTypeID": 10,
            "Quantity": 2
        }
    ],
    "NumberOfPoints": 4,
    "StatusTypeID": 50,
    "DateLastStatusUpdate": "2015-02-26T21:08:00Z",
    "DataQualityLevel": 1,
    "DateCreated": "2015-02-25T11:48:00Z",
    "SubmissionStatusTypeID": 200
}