{
    "IsRecentlyVerified": false,
    "ID": 110083,
    "UUID": "3305CAFE-0359-4729-BA4D-EFD88626F44A",
    "DataProviderID": 2,
    "DataProvidersReference": "102066",
    "OperatorID": 23,
    "UsageTypeID": 1,
    "AddressInfo": {
        "ID": 110429,
        "Title": "Mainplace Mall - Tesla Supercharger",
        "AddressLine1": "2800 N Main St",
        "Town": "Santa Ana",
        "StateOrProvince": "CA",
        "Postcode": "92705",
        "CountryID": 2,
        "Latitude": 33.77453,
        "Longitude": -117.867637,
        "ContactTelephone1": "877-798-3752",
        "AccessComments": "24 hours daily; for Tesla use only",
        "RelatedURL": "http://www.teslamotors.com/supercharger",
        "DistanceUnit": 0
    },
    "Connections": [
        {
            "ID": 155314,
            "ConnectionTypeID": 27,
            "LevelID": 2,
            "Amps": 100,
            "Voltage": 400,
            "PowerKW": 40,
            "CurrentTypeID": 10,
            "Quantity": 12
        }
    ],
    "DateLastStatusUpdate": "2019-04-06T04:01:00Z",
    "DataQualityLevel": 3,
    "DateCreated": "2018-10-18T23:35:00Z",
    "SubmissionStatusTypeID": 100
}