{
    "IsRecentlyVerified": false,
    "ID": 178789,
    "UUID": "6AF44293-D6D9-4998-9928-F305E48D04C0",
    "DataProviderID": 29,
    "DataProvidersReference": "8383",
    "OperatorID": 184,
    "AddressInfo": {
        "ID": 179148,
        "Title": "Werkzeugstr. 19-23",
        "AddressLine1": "Werkzeugstr. 19-23",
        "Town": "Hagen",
        "Postcode": "58093",
        "CountryID": 87,
        "Latitude": 51.382926,
        "Longitude": 7.505462,
        "DistanceUnit": 0
    },
    "Connections": [
        {
            "ID": 279700,
            "ConnectionTypeID": 25,
            "StatusTypeID": 50,
            "LevelID": 2,
            "PowerKW": 22,
            "CurrentTypeID": 20
        },
        {
            "ID": 279701,
            "ConnectionTypeID": 25,
            "StatusTypeID": 50,
            "LevelID": 2,
            "PowerKW": 22,
            "CurrentTypeID": 20
        }
    ],
    "StatusTypeID": 0,
    "DateLastStatusUpdate": "2021-07-12T02:47:00Z",
    "MetadataValues": [
        {
            "ID": 11083,
            "MetadataFieldID": 4,
            "ItemValue": "Data from the German chargepoint registry provided by Bundesnetzagentur.de under the CC-BY 4.0 license"
        }
    ],
    "DataQualityLevel": 3,
    "DateCreated": "2021-07-08T09:50:00Z",
    "SubmissionStatusTypeID": 100
}