{
    "IsRecentlyVerified": false,
    "ID": 33353,
    "UUID": "B1581F79-A29F-4661-B2D5-A692DB676498",
    "DataProviderID": 26,
    "DataProvidersReference": "47828",
    "OperatorID": 178,
    "OperatorsReference": "EVnetNL DB0060",
    "UsageCost": "0.00 jaarabonnement",
    "AddressInfo": {
        "ID": 33699,
        "Title": "Moerasbos 19",
        "AddressLine1": "Moerasbos 19",
        "Town": "Halderberge",
        "Postcode": "4731 WG",
        "CountryID": 159,
        "Latitude": 51.583073,
        "Longitude": 4.533212,
        "ContactTelephone1": "0800-3522365",
        "RelatedURL": "http://www.evnet.nl",
        "DistanceUnit": 0
    },
    "Connections": [
        {
            "ID": 36864,
            "ConnectionTypeID": 25,
            "LevelID": 2,
            "PowerKW": 11,
            "CurrentTypeID": 10
        }
    ],
    "NumberOfPoints": 2,
    "StatusTypeID": 50,
    "DateLastStatusUpdate": "2016-06-04T02:39:00Z",
    "DataQualityLevel": 3,
    "DateCreated": "2015-01-09T06:04:00Z",
    "SubmissionStatusTypeID": 100
}