{
    "MediaItems": [
        {
            "ID": 25614,
            "ChargePointID": 167268,
            "ItemURL": "https://s3-ap-southeast-2.amazonaws.com/openchargemap/images/IT/OCM167268/OCM-167268.orig.2020112911161194.jpg",
            "ItemThumbnailURL": "https://s3-ap-southeast-2.amazonaws.com/openchargemap/images/IT/OCM167268/OCM-167268.thmb.2020112911161194.jpg",
            "Comment": "",
            "IsEnabled": true,
            "IsVideo": false,
            "IsFeaturedItem": false,
            "IsExternalResource": false,
            "User": {
                "ID": 27477,
                "Username": "AndreaL77"
            },
            "DateCreated": "2020-11-29T11:16:00Z"
        }
    ],
    "IsRecentlyVerified": false,
    "ID": 167268,
    "UUID": "98166CBD-A513-4FCD-87A6-348AFBD7750C",
    "DataProviderID": 1,
    "OperatorID": 38,
    "UsageTypeID": 1,
    "UsageCost": "free",
    "AddressInfo": {
        "ID": 167627,
        "Title": "  LIDL Cassano Magnago",
        "AddressLine1": "Via Alcide De Gasperi",
        "Town": "Cassano Magnago",
        "StateOrProvince": "VA",
        "Postcode": "21012",
        "CountryID": 112,
        "Latitude": 45.675322662773226,
        "Longitude": 8.83071327248922,
        "RelatedURL": "https://www.lidl.it/it",
        "DistanceUnit": 0
    },
    "Connections": [
        {
            "ID": 253310,
            "ConnectionTypeID": 25,
            "StatusTypeID": 50,
            "LevelID": 2,
            "Amps": 32,
            "Voltage": 400,
            "PowerKW": 22,
            "CurrentTypeID": 20,
            "Quantity": 2
        }
    ],
    "NumberOfPoints": 2,
    "StatusTypeID": 50,
    "DateLastStatusUpdate": "2020-11-29T11:16:00Z",
    "DataQualityLevel": 1,
    "DateCreated": "2020-09-04T10:45:00Z",
    "SubmissionStatusTypeID": 200
}