{
    "IsRecentlyVerified": false,
    "ID": 123093,
    "UUID": "7A7F42E1-F66A-4725-9E8D-6921F8634C00",
    "DataProviderID": 2,
    "DataProvidersReference": "42872",
    "UsageTypeID": 1,
    "AddressInfo": {
        "ID": 123439,
        "Title": "Alexander's Storage",
        "AddressLine1": "101 W 8th St",
        "Town": "Columbia",
        "StateOrProvince": "TN",
        "Postcode": "38401",
        "CountryID": 2,
        "Latitude": 35.61323,
        "Longitude": -87.034614,
        "ContactTelephone1": "931-381-0954",
        "AccessComments": "24 hours daily",
        "RelatedURL": "",
        "DistanceUnit": 0
    },
    "Connections": [
        {
            "ID": 173031,
            "ConnectionTypeID": 1,
            "LevelID": 2,
            "Amps": 16,
            "Voltage": 230,
            "PowerKW": 3.7,
            "CurrentTypeID": 10,
            "Quantity": 1
        }
    ],
    "DateLastStatusUpdate": "2020-06-26T02:58:00Z",
    "DataQualityLevel": 3,
    "DateCreated": "2019-04-06T05:03:00Z",
    "SubmissionStatusTypeID": 100
}