{
    "IsRecentlyVerified": false,
    "ID": 73376,
    "UUID": "57CAD8AE-1714-4523-9237-B5584DCE39B0",
    "DataProviderID": 1,
    "OperatorID": 5,
    "UsageTypeID": 4,
    "UsageCost": "$0.20/minute",
    "AddressInfo": {
        "ID": 73722,
        "Title": "Oakland Volkswagen",
        "AddressLine1": "2740 Broadway ",
        "Town": "Oakland",
        "StateOrProvince": "California",
        "Postcode": "94612",
        "CountryID": 2,
        "Latitude": 37.8160149,
        "Longitude": -122.2634295,
        "DistanceUnit": 0
    },
    "Connections": [
        {
            "ID": 105575,
            "ConnectionTypeID": 32,
            "StatusTypeID": 50,
            "LevelID": 3,
            "PowerKW": 24,
            "CurrentTypeID": 30,
            "Quantity": 1
        }
    ],
    "NumberOfPoints": 1,
    "StatusTypeID": 50,
    "DateLastStatusUpdate": "2016-11-21T21:08:00Z",
    "DataQualityLevel": 1,
    "DateCreated": "2016-11-21T09:00:00Z",
    "SubmissionStatusTypeID": 200
}