{
    "IsRecentlyVerified": false,
    "ID": 183913,
    "UUID": "545979FD-DADC-48C8-8955-BB20953A6754",
    "DataProviderID": 29,
    "DataProvidersReference": "10659",
    "OperatorID": 3403,
    "AddressInfo": {
        "ID": 184272,
        "Title": "An der Feuerwehr bei Nr. 1",
        "AddressLine1": "An der Feuerwehr bei Nr. 1",
        "Town": "Hohe Börde / Hermsdorf",
        "Postcode": "39326",
        "CountryID": 87,
        "Latitude": 52.180514,
        "Longitude": 11.486027,
        "DistanceUnit": 0
    },
    "Connections": [
        {
            "ID": 291481,
            "ConnectionTypeID": 25,
            "StatusTypeID": 50,
            "LevelID": 2,
            "PowerKW": 22,
            "CurrentTypeID": 20
        },
        {
            "ID": 291482,
            "ConnectionTypeID": 25,
            "StatusTypeID": 50,
            "LevelID": 2,
            "PowerKW": 22,
            "CurrentTypeID": 20
        }
    ],
    "StatusTypeID": 50,
    "DateLastStatusUpdate": "2021-07-09T03:26:00Z",
    "MetadataValues": [
        {
            "ID": 16206,
            "MetadataFieldID": 4,
            "ItemValue": "Data from the German chargepoint registry provided by Bundesnetzagentur.de under the CC-BY 4.0 license"
        }
    ],
    "DataQualityLevel": 3,
    "DateCreated": "2021-07-08T10:04:00Z",
    "SubmissionStatusTypeID": 100
}