{
    "IsRecentlyVerified": false,
    "ID": 184681,
    "UUID": "5B486A29-427A-4A18-81E7-6CFA4784EA2A",
    "DataProviderID": 29,
    "DataProvidersReference": "17209",
    "OperatorID": 3253,
    "AddressInfo": {
        "ID": 185040,
        "Title": "Georg-Rückert-Straße 2",
        "AddressLine1": "Georg-Rückert-Straße 2",
        "Town": "Bad Soden",
        "Postcode": "65812",
        "CountryID": 87,
        "Latitude": 50.15312,
        "Longitude": 8.503799,
        "DistanceUnit": 0
    },
    "Connections": [
        {
            "ID": 293245,
            "ConnectionTypeID": 25,
            "StatusTypeID": 50,
            "LevelID": 2,
            "PowerKW": 22,
            "CurrentTypeID": 20
        },
        {
            "ID": 293246,
            "ConnectionTypeID": 25,
            "StatusTypeID": 50,
            "LevelID": 2,
            "PowerKW": 22,
            "CurrentTypeID": 20
        }
    ],
    "StatusTypeID": 50,
    "DateLastStatusUpdate": "2021-07-12T02:44:00Z",
    "MetadataValues": [
        {
            "ID": 16972,
            "MetadataFieldID": 4,
            "ItemValue": "Data from the German chargepoint registry provided by Bundesnetzagentur.de under the CC-BY 4.0 license"
        }
    ],
    "DataQualityLevel": 3,
    "DateCreated": "2021-07-08T10:05:00Z",
    "SubmissionStatusTypeID": 100
}