{
    "IsRecentlyVerified": false,
    "ID": 31435,
    "UUID": "8012BB73-CF71-4FA1-8F28-45E2FF280B34",
    "DataProviderID": 26,
    "DataProvidersReference": "56049",
    "OperatorID": 78,
    "OperatorsReference": "Essent EM-MT-00000051-01-00001",
    "UsageCost": "0.00 jaarabonnement",
    "AddressInfo": {
        "ID": 31781,
        "Title": "Triq it-Trunċiera",
        "AddressLine1": "Triq it-Trunċiera",
        "Town": "St Paul`s Bay",
        "Postcode": "SPB 1500",
        "CountryID": 140,
        "Latitude": 35.956648,
        "Longitude": 14.419331,
        "RelatedURL": "http://www.essent.nl",
        "DistanceUnit": 0
    },
    "Connections": [
        {
            "ID": 34946,
            "ConnectionTypeID": 25,
            "LevelID": 2,
            "PowerKW": 11,
            "CurrentTypeID": 10
        },
        {
            "ID": 45868,
            "ConnectionTypeID": 25,
            "LevelID": 2,
            "PowerKW": 11,
            "CurrentTypeID": 10
        }
    ],
    "NumberOfPoints": 1,
    "StatusTypeID": 50,
    "DateLastStatusUpdate": "2016-06-04T02:37:00Z",
    "DataQualityLevel": 3,
    "DateCreated": "2015-01-09T06:03:00Z",
    "SubmissionStatusTypeID": 100
}