{
    "IsRecentlyVerified": false,
    "ID": 141310,
    "UUID": "FEDB3E98-24D7-4F98-A88B-962F0A6229A5",
    "DataProviderID": 2,
    "DataProvidersReference": "145644",
    "OperatorID": 5,
    "UsageTypeID": 1,
    "AddressInfo": {
        "ID": 141662,
        "Title": "SPRINGS UTIL",
        "AddressLine1": "1521 Hancock expressway",
        "Town": "Colorado Springs",
        "StateOrProvince": "CO",
        "Postcode": "80903",
        "CountryID": 2,
        "Latitude": 38.811863,
        "Longitude": -104.79937,
        "ContactTelephone1": "888-758-4389",
        "AccessComments": "24 hours daily",
        "RelatedURL": "http://www.chargepoint.com/",
        "DistanceUnit": 0
    },
    "Connections": [
        {
            "ID": 197215,
            "ConnectionTypeID": 1,
            "LevelID": 2,
            "Amps": 16,
            "Voltage": 230,
            "PowerKW": 3.7,
            "CurrentTypeID": 10,
            "Quantity": 2
        }
    ],
    "StatusTypeID": 50,
    "DateLastStatusUpdate": "2020-06-26T03:00:00Z",
    "DataQualityLevel": 3,
    "DateCreated": "2019-12-24T09:15:00Z",
    "SubmissionStatusTypeID": 100
}