{
    "IsRecentlyVerified": false,
    "ID": 181897,
    "UUID": "71B2FBB0-6BB3-4817-955C-5C36D429364B",
    "DataProviderID": 29,
    "DataProvidersReference": "9219",
    "AddressInfo": {
        "ID": 182256,
        "Title": "Lohmener Straße 12",
        "AddressLine1": "Lohmener Straße 12",
        "Town": "Pirna",
        "Postcode": "01796",
        "CountryID": 87,
        "Latitude": 50.98011,
        "Longitude": 13.948233,
        "DistanceUnit": 0
    },
    "Connections": [
        {
            "ID": 286907,
            "ConnectionTypeID": 33,
            "StatusTypeID": 50,
            "LevelID": 3,
            "PowerKW": 50,
            "CurrentTypeID": 30
        },
        {
            "ID": 286908,
            "ConnectionTypeID": 25,
            "StatusTypeID": 50,
            "LevelID": 2,
            "PowerKW": 22,
            "CurrentTypeID": 20
        }
    ],
    "StatusTypeID": 50,
    "DateLastStatusUpdate": "2021-07-09T03:21:00Z",
    "MetadataValues": [
        {
            "ID": 14191,
            "MetadataFieldID": 4,
            "ItemValue": "Data from the German chargepoint registry provided by Bundesnetzagentur.de under the CC-BY 4.0 license"
        }
    ],
    "DataQualityLevel": 3,
    "DateCreated": "2021-07-08T10:02:00Z",
    "SubmissionStatusTypeID": 100
}