{
    "IsRecentlyVerified": false,
    "ID": 183623,
    "UUID": "2E056661-70F3-4F09-9938-B15DC1F35919",
    "DataProviderID": 29,
    "DataProvidersReference": "15295",
    "OperatorID": 45,
    "AddressInfo": {
        "ID": 183982,
        "Title": "Habitzheimer Straße 5",
        "AddressLine1": "Habitzheimer Straße 5",
        "Town": "Groß-Umstadt",
        "Postcode": "64823",
        "CountryID": 87,
        "Latitude": 49.865914,
        "Longitude": 8.922853,
        "DistanceUnit": 0
    },
    "Connections": [
        {
            "ID": 290829,
            "ConnectionTypeID": 25,
            "StatusTypeID": 50,
            "LevelID": 2,
            "PowerKW": 22,
            "CurrentTypeID": 20
        },
        {
            "ID": 290830,
            "ConnectionTypeID": 25,
            "StatusTypeID": 50,
            "LevelID": 2,
            "PowerKW": 22,
            "CurrentTypeID": 20
        }
    ],
    "StatusTypeID": 50,
    "DateLastStatusUpdate": "2021-07-12T02:44:00Z",
    "MetadataValues": [
        {
            "ID": 15916,
            "MetadataFieldID": 4,
            "ItemValue": "Data from the German chargepoint registry provided by Bundesnetzagentur.de under the CC-BY 4.0 license"
        }
    ],
    "DataQualityLevel": 3,
    "DateCreated": "2021-07-08T10:04:00Z",
    "SubmissionStatusTypeID": 100
}