{
    "IsRecentlyVerified": false,
    "ID": 88170,
    "UUID": "E8AFAC09-B027-4891-9B55-891420D3C1EA",
    "DataProviderID": 1,
    "OperatorID": 1,
    "UsageTypeID": 0,
    "AddressInfo": {
        "ID": 88516,
        "Title": "Глинищевский переулок",
        "AddressLine1": "Глинищевский переулок",
        "AddressLine2": "Тверская",
        "StateOrProvince": "Москва",
        "Postcode": "125009",
        "CountryID": 185,
        "Latitude": 55.76302198603613,
        "Longitude": 37.60974774061437,
        "DistanceUnit": 0
    },
    "Connections": [
        {
            "ID": 125069,
            "ConnectionTypeID": 25,
            "LevelID": 2
        }
    ],
    "NumberOfPoints": 1,
    "StatusTypeID": 50,
    "DateLastStatusUpdate": "2017-05-23T13:36:00Z",
    "DataQualityLevel": 1,
    "DateCreated": "2017-05-23T13:36:00Z",
    "SubmissionStatusTypeID": 200
}