{
    "IsRecentlyVerified": false,
    "ID": 104427,
    "UUID": "86E70334-5B69-4AB8-A795-6244F8FBDAA8",
    "DataProviderID": 1,
    "OperatorID": 23,
    "OperatorsReference": "43235",
    "UsageTypeID": 4,
    "AddressInfo": {
        "ID": 104773,
        "Title": "Hôtel les Airelles",
        "AddressLine1": "Rue du Jardin Alpin",
        "Town": "Courchevel",
        "Postcode": "73120",
        "CountryID": 80,
        "Latitude": 45.410034,
        "Longitude": 6.634488,
        "ContactTelephone1": "+33 4 79 00 38 38",
        "DistanceUnit": 0
    },
    "Connections": [
        {
            "ID": 147422,
            "ConnectionTypeID": 30,
            "StatusTypeID": 50,
            "LevelID": 2,
            "Amps": 32,
            "Voltage": 230,
            "PowerKW": 17,
            "CurrentTypeID": 20,
            "Quantity": 1
        }
    ],
    "NumberOfPoints": 1,
    "GeneralComments": "1 Tesla Connector, up to 17kW.Available for customers. Please see valet.",
    "StatusTypeID": 50,
    "DateLastStatusUpdate": "2018-10-03T15:08:00Z",
    "DataQualityLevel": 1,
    "DateCreated": "2018-05-20T05:34:00Z",
    "SubmissionStatusTypeID": 200
}