{
    "IsRecentlyVerified": false,
    "ID": 184707,
    "UUID": "668BC900-1A1A-437A-BD38-E5DD83936C04",
    "DataProviderID": 29,
    "DataProvidersReference": "7134",
    "OperatorID": 86,
    "AddressInfo": {
        "ID": 185066,
        "Title": "Weiherstr. 8",
        "AddressLine1": "Weiherstr. 8",
        "Town": "Ehingen",
        "Postcode": "89584",
        "CountryID": 87,
        "Latitude": 48.283056,
        "Longitude": 9.70439,
        "DistanceUnit": 0
    },
    "Connections": [
        {
            "ID": 293303,
            "ConnectionTypeID": 28,
            "StatusTypeID": 50,
            "LevelID": 2,
            "PowerKW": 22,
            "CurrentTypeID": 20
        },
        {
            "ID": 293304,
            "ConnectionTypeID": 25,
            "StatusTypeID": 50,
            "LevelID": 2,
            "PowerKW": 22,
            "CurrentTypeID": 20
        },
        {
            "ID": 293305,
            "ConnectionTypeID": 28,
            "StatusTypeID": 50,
            "LevelID": 2,
            "PowerKW": 22,
            "CurrentTypeID": 20
        },
        {
            "ID": 295702,
            "ConnectionTypeID": 25,
            "StatusTypeID": 50,
            "LevelID": 2,
            "PowerKW": 22,
            "CurrentTypeID": 20
        }
    ],
    "StatusTypeID": 50,
    "DateLastStatusUpdate": "2021-07-12T02:40:00Z",
    "MetadataValues": [
        {
            "ID": 16998,
            "MetadataFieldID": 4,
            "ItemValue": "Data from the German chargepoint registry provided by Bundesnetzagentur.de under the CC-BY 4.0 license"
        }
    ],
    "DataQualityLevel": 3,
    "DateCreated": "2021-07-08T10:05:00Z",
    "SubmissionStatusTypeID": 100
}