{
    "IsRecentlyVerified": false,
    "ID": 123623,
    "UUID": "F4AE7821-3662-4BEC-B115-CE8A9DACB81B",
    "DataProviderID": 2,
    "DataProvidersReference": "98551",
    "UsageTypeID": 1,
    "AddressInfo": {
        "ID": 123969,
        "Title": "Liberty Utilities",
        "AddressLine1": "703 W Olive",
        "Town": "Aurora",
        "StateOrProvince": "MO",
        "Postcode": "65605",
        "CountryID": 2,
        "Latitude": 36.975977,
        "Longitude": -93.729391,
        "ContactTelephone1": "800-206-2300",
        "AccessComments": "24 hours daily",
        "RelatedURL": "",
        "DistanceUnit": 0
    },
    "Connections": [
        {
            "ID": 173635,
            "ConnectionTypeID": 1,
            "LevelID": 2,
            "Amps": 16,
            "Voltage": 230,
            "PowerKW": 3.7,
            "CurrentTypeID": 10,
            "Quantity": 1
        }
    ],
    "DateLastStatusUpdate": "2020-06-26T02:59:00Z",
    "DataQualityLevel": 3,
    "DateCreated": "2019-04-06T05:03:00Z",
    "SubmissionStatusTypeID": 100
}