{
    "IsRecentlyVerified": false,
    "ID": 34427,
    "UUID": "4F874E39-EA74-44C4-8946-E5F222A8C5F3",
    "DataProviderID": 26,
    "DataProvidersReference": "52918",
    "OperatorID": 157,
    "OperatorsReference": "NewMotion 02008401",
    "UsageCost": "0.00 jaarabonnement",
    "AddressInfo": {
        "ID": 34773,
        "Title": "Pluim-Es 74",
        "AddressLine1": "Pluim-Es 74",
        "Town": "Krimpen aan den IJssel",
        "Postcode": "2925 CN",
        "CountryID": 159,
        "Latitude": 51.9151122,
        "Longitude": 4.61978769999996,
        "ContactTelephone1": "088 0109500",
        "RelatedURL": "http://thenewmotion.nl/",
        "DistanceUnit": 0
    },
    "Connections": [
        {
            "ID": 37938,
            "ConnectionTypeID": 25,
            "LevelID": 2,
            "PowerKW": 3.7,
            "CurrentTypeID": 10
        }
    ],
    "NumberOfPoints": 1,
    "StatusTypeID": 50,
    "DateLastStatusUpdate": "2016-06-04T02:42:00Z",
    "DataQualityLevel": 3,
    "DateCreated": "2015-01-09T06:04:00Z",
    "SubmissionStatusTypeID": 100
}