{
    "IsRecentlyVerified": false,
    "ID": 60517,
    "UUID": "4D4D82D7-10C1-44B8-8BD9-B6FE5D39C69C",
    "DataProviderID": 1,
    "OperatorID": 45,
    "UsageTypeID": 1,
    "AddressInfo": {
        "ID": 60863,
        "Title": "VW Autohaus Steegmüller",
        "AddressLine1": "Renninger Straße 36",
        "Town": "Magstadt",
        "StateOrProvince": "Landkreis Böblingen",
        "Postcode": "71106",
        "CountryID": 87,
        "Latitude": 48.74684,
        "Longitude": 8.95186000000001,
        "AccessComments": "24/7 kostenlos Laden am VW Autohaus. 2 eStations mit fest montierten Kabeln links neben dem Eingang.",
        "RelatedURL": "http://partner.volkswagen.de/p_26409/de.html",
        "DistanceUnit": 0
    },
    "Connections": [
        {
            "ID": 76669,
            "ConnectionTypeID": 25,
            "StatusTypeID": 50,
            "LevelID": 2,
            "Amps": 16,
            "Voltage": 230,
            "PowerKW": 3.7,
            "CurrentTypeID": 10,
            "Quantity": 2
        }
    ],
    "NumberOfPoints": 2,
    "StatusTypeID": 50,
    "DateLastStatusUpdate": "2016-01-29T12:44:00Z",
    "DataQualityLevel": 1,
    "DateCreated": "2016-01-29T12:44:00Z",
    "SubmissionStatusTypeID": 200
}