{
    "IsRecentlyVerified": false,
    "ID": 140228,
    "UUID": "52D61630-9481-47F5-9D7D-BB33147E301A",
    "DataProviderID": 2,
    "DataProvidersReference": "93747",
    "OperatorID": 15,
    "UsageTypeID": 4,
    "AddressInfo": {
        "ID": 140580,
        "Title": "Phillips 66",
        "AddressLine1": "Interstate 25 Exit 259 State Route 22",
        "Town": "Kewa Pueblo",
        "StateOrProvince": "NM",
        "Postcode": "87052",
        "CountryID": 2,
        "Latitude": 35.473229,
        "Longitude": -106.30729,
        "ContactTelephone1": "877-455-3833",
        "AccessComments": "24 hours daily\r\nPublic - Card key at all times",
        "RelatedURL": "https://www.evgo.com/",
        "DistanceUnit": 0
    },
    "Connections": [
        {
            "ID": 195814,
            "ConnectionTypeID": 2,
            "LevelID": 3,
            "Amps": 100,
            "Voltage": 400,
            "PowerKW": 40,
            "CurrentTypeID": 30,
            "Quantity": 1
        },
        {
            "ID": 195815,
            "ConnectionTypeID": 32,
            "LevelID": 3,
            "Amps": 100,
            "Voltage": 400,
            "PowerKW": 40,
            "CurrentTypeID": 30,
            "Quantity": 1
        }
    ],
    "StatusTypeID": 50,
    "DateLastStatusUpdate": "2020-06-26T02:58:00Z",
    "DataQualityLevel": 3,
    "DateCreated": "2019-12-24T09:12:00Z",
    "SubmissionStatusTypeID": 100
}