{
    "IsRecentlyVerified": false,
    "ID": 87379,
    "UUID": "39305A70-3941-4468-946E-E796B44DF668",
    "DataProviderID": 1,
    "OperatorID": 102,
    "UsageTypeID": 4,
    "UsageCost": "Free",
    "AddressInfo": {
        "ID": 87725,
        "Title": "ON Varmahlíð",
        "AddressLine1": "Þjóðvegur",
        "Town": "Varmahlíð",
        "Postcode": "560",
        "CountryID": 105,
        "Latitude": 65.554025,
        "Longitude": -19.44709,
        "AccessComments": "ON Varmahlíð",
        "DistanceUnit": 0
    },
    "Connections": [
        {
            "ID": 123868,
            "ConnectionTypeID": 2,
            "StatusTypeID": 50,
            "LevelID": 3,
            "PowerKW": 62.5,
            "CurrentTypeID": 30
        },
        {
            "ID": 123869,
            "ConnectionTypeID": 33,
            "StatusTypeID": 50,
            "LevelID": 3,
            "PowerKW": 100,
            "CurrentTypeID": 30,
            "Quantity": 2
        }
    ],
    "NumberOfPoints": 1,
    "StatusTypeID": 50,
    "DateLastStatusUpdate": "2021-01-24T09:40:00Z",
    "DataQualityLevel": 1,
    "DateCreated": "2017-05-05T11:32:00Z",
    "SubmissionStatusTypeID": 200
}