{
    "IsRecentlyVerified": false,
    "ID": 132823,
    "UUID": "20B52E52-0168-4877-AE89-C060B7A9A1E8",
    "DataProviderID": 1,
    "OperatorID": 80,
    "UsageTypeID": 4,
    "AddressInfo": {
        "ID": 133169,
        "Title": "Santa Palomba Fiorucci | EnelX",
        "AddressLine1": "Via Cesare Fiorucci",
        "AddressLine2": "Santa Palomba",
        "Town": "Pomezia",
        "StateOrProvince": "RM",
        "Postcode": "00040",
        "CountryID": 112,
        "Latitude": 41.70748704437992,
        "Longitude": 12.568671581150966,
        "ContactTelephone1": "800.069.850",
        "RelatedURL": "https://www.enelx.com/it/it/emobility",
        "DistanceUnit": 0
    },
    "Connections": [
        {
            "ID": 186054,
            "ConnectionTypeID": 25,
            "StatusTypeID": 50,
            "LevelID": 2,
            "Amps": 32,
            "Voltage": 400,
            "PowerKW": 22,
            "CurrentTypeID": 20,
            "Quantity": 1
        },
        {
            "ID": 186055,
            "ConnectionTypeID": 36,
            "StatusTypeID": 50,
            "LevelID": 2,
            "Amps": 16,
            "Voltage": 240,
            "PowerKW": 3.7,
            "CurrentTypeID": 10,
            "Quantity": 1
        }
    ],
    "NumberOfPoints": 2,
    "StatusTypeID": 50,
    "DateLastStatusUpdate": "2019-10-08T12:37:00Z",
    "DataQualityLevel": 1,
    "DateCreated": "2019-10-08T12:37:00Z",
    "SubmissionStatusTypeID": 200
}