{
    "IsRecentlyVerified": false,
    "ID": 175767,
    "UUID": "EF3927E6-8BD8-4048-BF6B-29DFE2B28C06",
    "DataProviderID": 1,
    "OperatorID": 198,
    "UsageTypeID": 4,
    "UsageCost": "0,30€/kWh",
    "AddressInfo": {
        "ID": 176126,
        "Title": "Lumme Energia Rantakatu 2",
        "AddressLine1": "Rantakatu 2",
        "Town": "Savonlinna",
        "StateOrProvince": "Eastern Finland",
        "Postcode": "57130",
        "CountryID": 79,
        "Latitude": 61.866181929775564,
        "Longitude": 28.88746839749274,
        "ContactTelephone1": " +35820334455",
        "RelatedURL": "http://www.rechargeinfra.com",
        "DistanceUnit": 0
    },
    "Connections": [
        {
            "ID": 272962,
            "ConnectionTypeID": 25,
            "StatusTypeID": 50,
            "LevelID": 2,
            "Amps": 32,
            "Voltage": 400,
            "PowerKW": 22,
            "CurrentTypeID": 20,
            "Quantity": 2
        }
    ],
    "NumberOfPoints": 2,
    "StatusTypeID": 50,
    "DateLastStatusUpdate": "2021-06-13T20:37:00Z",
    "DataQualityLevel": 1,
    "DateCreated": "2021-06-13T18:05:00Z",
    "SubmissionStatusTypeID": 200
}