{
    "IsRecentlyVerified": false,
    "ID": 133942,
    "UUID": "A506CC25-B3B0-4BFA-B6C6-82964EF730A2",
    "DataProviderID": 1,
    "OperatorID": 80,
    "UsageTypeID": 4,
    "AddressInfo": {
        "ID": 134288,
        "Title": " Figline Valdarno Parcheggio Poste | EnelX",
        "AddressLine1": "Piazza Salvo d'Acquisto",
        "Town": "Figline Valdarno",
        "StateOrProvince": "FI",
        "Postcode": "50063",
        "CountryID": 112,
        "Latitude": 43.61914559567225,
        "Longitude": 11.474994370868785,
        "ContactTelephone1": "800.069.850",
        "RelatedURL": "https://www.enelx.com/it/it/emobility",
        "DistanceUnit": 0
    },
    "Connections": [
        {
            "ID": 187428,
            "ConnectionTypeID": 25,
            "StatusTypeID": 50,
            "LevelID": 2,
            "Amps": 32,
            "Voltage": 400,
            "PowerKW": 22,
            "CurrentTypeID": 20,
            "Quantity": 2
        }
    ],
    "NumberOfPoints": 2,
    "StatusTypeID": 50,
    "DateLastStatusUpdate": "2019-10-30T17:10:00Z",
    "DataQualityLevel": 1,
    "DateCreated": "2019-10-30T17:10:00Z",
    "SubmissionStatusTypeID": 200
}