{
    "IsRecentlyVerified": false,
    "ID": 181023,
    "UUID": "C148FE93-D5B5-4171-84E3-02682D13F37B",
    "DataProviderID": 29,
    "DataProvidersReference": "7676",
    "OperatorID": 188,
    "AddressInfo": {
        "ID": 181382,
        "Title": "Ringstraße 2",
        "AddressLine1": "Ringstraße 2",
        "Town": "Ortenberg",
        "Postcode": "63683",
        "CountryID": 87,
        "Latitude": 50.343733,
        "Longitude": 9.008161,
        "DistanceUnit": 0
    },
    "Connections": [
        {
            "ID": 284821,
            "ConnectionTypeID": 25,
            "StatusTypeID": 50,
            "LevelID": 2,
            "PowerKW": 22,
            "CurrentTypeID": 20
        },
        {
            "ID": 284822,
            "ConnectionTypeID": 25,
            "StatusTypeID": 50,
            "LevelID": 2,
            "PowerKW": 22,
            "CurrentTypeID": 20
        }
    ],
    "StatusTypeID": 50,
    "DateLastStatusUpdate": "2021-07-09T03:19:00Z",
    "MetadataValues": [
        {
            "ID": 13317,
            "MetadataFieldID": 4,
            "ItemValue": "Data from the German chargepoint registry provided by Bundesnetzagentur.de under the CC-BY 4.0 license"
        }
    ],
    "DataQualityLevel": 3,
    "DateCreated": "2021-07-08T10:01:00Z",
    "SubmissionStatusTypeID": 100
}