{
    "IsRecentlyVerified": false,
    "ID": 95257,
    "UUID": "D4CDD0E1-43C8-4B37-8A35-72DCBEF52BEE",
    "DataProviderID": 1,
    "OperatorID": 23,
    "OperatorsReference": "37270",
    "UsageTypeID": 4,
    "AddressInfo": {
        "ID": 95603,
        "Title": "Pulheim Eins",
        "AddressLine1": "Am Westufer 1",
        "Town": "Pulheim",
        "Postcode": "50259",
        "CountryID": 87,
        "Latitude": 50.993302,
        "Longitude": 6.820619,
        "DistanceUnit": 0
    },
    "Connections": [
        {
            "ID": 134925,
            "ConnectionTypeID": 30,
            "StatusTypeID": 50,
            "LevelID": 2,
            "Amps": 32,
            "Voltage": 400,
            "PowerKW": 22,
            "CurrentTypeID": 20,
            "Quantity": 2
        }
    ],
    "NumberOfPoints": 2,
    "GeneralComments": "2 Tesla Connectors, up to 22kW.Available for customers. Self park.",
    "StatusTypeID": 50,
    "DateLastStatusUpdate": "2018-10-03T14:31:00Z",
    "DataQualityLevel": 1,
    "DateCreated": "2017-11-05T07:04:00Z",
    "SubmissionStatusTypeID": 200
}