{
    "IsRecentlyVerified": false,
    "ID": 141362,
    "UUID": "84C5B4C7-DCAC-4F98-8071-496D708B9A13",
    "DataProviderID": 2,
    "DataProvidersReference": "95813",
    "OperatorID": 9,
    "UsageTypeID": 1,
    "AddressInfo": {
        "ID": 141714,
        "Title": "JBG - L'Enfant Plaza - Washington DC",
        "AddressLine1": "480 L'Enfant Plaza Southwest",
        "Town": "Washington",
        "StateOrProvince": "DC",
        "Postcode": "20024",
        "CountryID": 2,
        "Latitude": 38.883525,
        "Longitude": -77.025527,
        "ContactTelephone1": "888-998-2546",
        "AccessComments": "MON: 24 hours | TUE: 24 hours | WED: 24 hours | THU: 24 hours | FRI: 24 hours | SAT: 24 hours | SUN: 24 hours",
        "RelatedURL": "http://www.blinkcharging.com/",
        "DistanceUnit": 0
    },
    "Connections": [
        {
            "ID": 197281,
            "ConnectionTypeID": 1,
            "LevelID": 2,
            "Amps": 16,
            "Voltage": 230,
            "PowerKW": 3.7,
            "CurrentTypeID": 10,
            "Quantity": 2
        }
    ],
    "StatusTypeID": 50,
    "DateLastStatusUpdate": "2020-06-26T03:00:00Z",
    "DataQualityLevel": 3,
    "DateCreated": "2019-12-24T09:15:00Z",
    "SubmissionStatusTypeID": 100
}