{
    "IsRecentlyVerified": false,
    "ID": 121627,
    "UUID": "8F329F2A-8FCD-46C6-ABEB-A6C3844D20B3",
    "DataProviderID": 2,
    "DataProvidersReference": "121120",
    "OperatorID": 5,
    "UsageTypeID": 1,
    "AddressInfo": {
        "ID": 121973,
        "Title": "APA",
        "AddressLine1": "13 south 6th street",
        "Town": "Allentown",
        "StateOrProvince": "PA",
        "Postcode": "18101",
        "CountryID": 2,
        "Latitude": 40.6024458,
        "Longitude": -75.4694821,
        "ContactTelephone1": "888-758-4389",
        "AccessComments": "24 hours daily",
        "RelatedURL": "http://www.chargepoint.com/",
        "DistanceUnit": 0
    },
    "Connections": [
        {
            "ID": 171401,
            "ConnectionTypeID": 1,
            "LevelID": 2,
            "Amps": 16,
            "Voltage": 230,
            "PowerKW": 3,
            "CurrentTypeID": 10,
            "Quantity": 2
        }
    ],
    "DateLastStatusUpdate": "2019-04-06T04:01:00Z",
    "DataQualityLevel": 3,
    "DateCreated": "2019-04-06T04:01:00Z",
    "SubmissionStatusTypeID": 100
}