{
    "IsRecentlyVerified": false,
    "ID": 52775,
    "UUID": "77A8FC2A-5C2D-4E41-9D00-83F55BEC2AFC",
    "DataProviderID": 1,
    "OperatorID": 45,
    "UsageTypeID": 5,
    "UsageCost": "bisher frei, Parkgebühren 1€/h",
    "AddressInfo": {
        "ID": 53121,
        "Title": "Parkhaus Kranzlereck",
        "AddressLine1": "Kurfürstendamm 21",
        "AddressLine2": "Charlottenburg",
        "Town": "Berlin",
        "StateOrProvince": "Berlin",
        "Postcode": "10623",
        "CountryID": 87,
        "Latitude": 52.50481111738415,
        "Longitude": 13.329121542050174,
        "ContactTelephone1": "+49 30 26404444",
        "AccessComments": "Einfahrt über Kantstraße hinter der S-Bahntrasse. Nach der Einfahrt bis zum Ende der Spur und dann links. Auf der rechten Seite, kurz vor Ende der Gasse befinden sich 2 grün markierte Parkpätze.",
        "RelatedURL": "http://www.contipark.de/",
        "DistanceUnit": 0
    },
    "Connections": [
        {
            "ID": 65652,
            "ConnectionTypeID": 29,
            "StatusTypeID": 50,
            "LevelID": 2,
            "Amps": 16,
            "Voltage": 230,
            "PowerKW": 3.7,
            "CurrentTypeID": 10,
            "Quantity": 1
        },
        {
            "ID": 65653,
            "ConnectionTypeID": 28,
            "StatusTypeID": 50,
            "LevelID": 2,
            "Amps": 16,
            "Voltage": 230,
            "PowerKW": 3.7,
            "CurrentTypeID": 10,
            "Quantity": 2
        }
    ],
    "NumberOfPoints": 2,
    "StatusTypeID": 50,
    "DateLastStatusUpdate": "2015-09-11T08:09:00Z",
    "DataQualityLevel": 1,
    "DateCreated": "2015-09-11T08:09:00Z",
    "SubmissionStatusTypeID": 200
}