{
    "IsRecentlyVerified": false,
    "ID": 95584,
    "UUID": "958B23B0-7661-4678-A33D-E231F0648C00",
    "DataProviderID": 1,
    "OperatorID": 45,
    "UsageTypeID": 0,
    "AddressInfo": {
        "ID": 95930,
        "Title": "Autohaus Rühle (Renault/Dacia)",
        "AddressLine1": "Merseburger Straße 248",
        "Town": "Leipzig",
        "StateOrProvince": "Leipzig",
        "Postcode": "04178",
        "CountryID": 87,
        "Latitude": 51.34567,
        "Longitude": 12.272699999999986,
        "ContactTelephone1": "+49 341 4771827",
        "AccessComments": "Zugang bitte erfragen; Z.E. Ladestation links neben dem Werkstatt Rolltor.",
        "RelatedURL": "http://www.autohaus-ruehle.de/",
        "DistanceUnit": 0
    },
    "Connections": [
        {
            "ID": 135393,
            "ConnectionTypeID": 1036,
            "StatusTypeID": 50,
            "LevelID": 2,
            "Amps": 16,
            "Voltage": 400,
            "PowerKW": 11,
            "CurrentTypeID": 20,
            "Quantity": 1
        }
    ],
    "NumberOfPoints": 1,
    "StatusTypeID": 50,
    "DateLastStatusUpdate": "2017-11-13T15:09:00Z",
    "DataQualityLevel": 1,
    "DateCreated": "2017-11-13T15:09:00Z",
    "SubmissionStatusTypeID": 200
}