{
    "IsRecentlyVerified": false,
    "ID": 36799,
    "UUID": "12235EDB-91CB-4FA9-B812-90452AA619A9",
    "DataProviderID": 26,
    "DataProvidersReference": "34421",
    "OperatorID": 73,
    "OperatorsReference": "EV-Box EVB-P1306004",
    "UsageCost": "0.00 jaarabonnement",
    "AddressInfo": {
        "ID": 37145,
        "Title": "Eemnesserweg 42-k101",
        "AddressLine1": "Eemnesserweg 42-k101",
        "Town": "Laren",
        "Postcode": "1251 ND",
        "CountryID": 159,
        "Latitude": 52.2553,
        "Longitude": 5.23385,
        "RelatedURL": "http://www.ev-box.nl",
        "DistanceUnit": 0
    },
    "Connections": [
        {
            "ID": 40310,
            "ConnectionTypeID": 25,
            "LevelID": 2,
            "PowerKW": 11,
            "CurrentTypeID": 10
        },
        {
            "ID": 48497,
            "ConnectionTypeID": 25,
            "LevelID": 2,
            "PowerKW": 11,
            "CurrentTypeID": 10
        }
    ],
    "NumberOfPoints": 1,
    "StatusTypeID": 50,
    "DateLastStatusUpdate": "2016-06-04T02:52:00Z",
    "DataQualityLevel": 3,
    "DateCreated": "2015-01-09T06:07:00Z",
    "SubmissionStatusTypeID": 100
}