{
    "IsRecentlyVerified": false,
    "ID": 9200,
    "UUID": "33B86013-CC20-4333-BCF2-ED6138C0F534",
    "DataProviderID": 15,
    "DataProvidersReference": "12688",
    "OperatorID": 26,
    "UsageTypeID": 1,
    "AddressInfo": {
        "ID": 9097,
        "Title": "2400 West 104th Avenue",
        "AddressLine1": "2400 West 104th Avenue",
        "Town": "Federal Heights",
        "StateOrProvince": "CO",
        "Postcode": "80234",
        "CountryID": 2,
        "Latitude": 39.884614,
        "Longitude": -105.016428,
        "ContactTelephone1": "(888) 211-3305",
        "RelatedURL": "http://carstations.com/12688",
        "DistanceUnit": 0
    },
    "Connections": [
        {
            "ID": 6881,
            "ConnectionTypeID": 1,
            "Reference": "J1772",
            "LevelID": 2
        }
    ],
    "NumberOfPoints": 1,
    "StatusTypeID": 50,
    "DateLastStatusUpdate": "2017-11-04T14:04:00Z",
    "DataQualityLevel": 2,
    "DateCreated": "2012-01-23T15:12:00Z",
    "SubmissionStatusTypeID": 100
}