{
    "MediaItems": [
        {
            "ID": 19392,
            "ChargePointID": 130960,
            "ItemURL": "https://s3-ap-southeast-2.amazonaws.com/openchargemap/images/GB/OCM130960/OCM-130960.orig.2019082813161871.jpeg",
            "ItemThumbnailURL": "https://s3-ap-southeast-2.amazonaws.com/openchargemap/images/GB/OCM130960/OCM-130960.thmb.2019082813161871.jpeg",
            "Comment": "",
            "IsEnabled": true,
            "IsVideo": false,
            "IsFeaturedItem": false,
            "IsExternalResource": false,
            "User": {
                "ID": 15366,
                "Username": "ZCWCara"
            },
            "DateCreated": "2019-08-28T13:17:00Z"
        },
        {
            "ID": 19391,
            "ChargePointID": 130960,
            "ItemURL": "https://s3-ap-southeast-2.amazonaws.com/openchargemap/images/GB/OCM130960/OCM-130960.orig.2019082812073593.jpeg",
            "ItemThumbnailURL": "https://s3-ap-southeast-2.amazonaws.com/openchargemap/images/GB/OCM130960/OCM-130960.thmb.2019082812073593.jpeg",
            "Comment": "",
            "IsEnabled": true,
            "IsVideo": false,
            "IsFeaturedItem": false,
            "IsExternalResource": false,
            "User": {
                "ID": 15366,
                "Username": "ZCWCara"
            },
            "DateCreated": "2019-08-28T12:08:00Z"
        }
    ],
    "IsRecentlyVerified": false,
    "ID": 130960,
    "UUID": "4B5E489D-D542-4D68-82FF-F76C5885ED11",
    "DataProviderID": 1,
    "OperatorID": 19,
    "UsageTypeID": 1,
    "AddressInfo": {
        "ID": 131306,
        "Title": "Treworgey Cottages ",
        "AddressLine1": "Duloe, ",
        "Town": "Looe",
        "StateOrProvince": "Cornwall ",
        "Postcode": "PL14 4PP ",
        "CountryID": 1,
        "Latitude": 50.383703,
        "Longitude": -4.475011,
        "ContactTelephone1": "01503 262730",
        "ContactEmail": "stay@treworgeycottages.co.uk",
        "RelatedURL": "https://www.treworgeycottages.com",
        "DistanceUnit": 0
    },
    "Connections": [
        {
            "ID": 183453,
            "ConnectionTypeID": 25,
            "StatusTypeID": 50,
            "LevelID": 2,
            "Amps": 32,
            "Voltage": 230,
            "PowerKW": 7,
            "CurrentTypeID": 10,
            "Quantity": 1
        }
    ],
    "NumberOfPoints": 1,
    "GeneralComments": "For guests staying at the cottages",
    "StatusTypeID": 50,
    "DateLastStatusUpdate": "2019-08-28T13:17:00Z",
    "DataQualityLevel": 1,
    "DateCreated": "2019-08-28T12:06:00Z",
    "SubmissionStatusTypeID": 200
}