{
    "IsRecentlyVerified": false,
    "ID": 123786,
    "UUID": "65489C53-6FE3-44DD-BAC8-B04A4F975CFD",
    "DataProviderID": 2,
    "DataProvidersReference": "88984",
    "UsageTypeID": 1,
    "AddressInfo": {
        "ID": 124132,
        "Title": "Mountain View High School",
        "AddressLine1": "3535 Truman Ave",
        "Town": "Mountain View",
        "StateOrProvince": "CA",
        "Postcode": "94040",
        "CountryID": 2,
        "Latitude": 37.358089,
        "Longitude": -122.068703,
        "ContactTelephone1": "650-940-4600",
        "AccessComments": "For students and staff during school day",
        "RelatedURL": "",
        "DistanceUnit": 0
    },
    "Connections": [
        {
            "ID": 173813,
            "ConnectionTypeID": 1,
            "LevelID": 2,
            "Amps": 16,
            "Voltage": 230,
            "PowerKW": 3.7,
            "CurrentTypeID": 10,
            "Quantity": 26
        }
    ],
    "DateLastStatusUpdate": "2020-06-26T02:59:00Z",
    "DataQualityLevel": 3,
    "DateCreated": "2019-04-06T05:03:00Z",
    "SubmissionStatusTypeID": 100
}