{
    "IsRecentlyVerified": false,
    "ID": 182868,
    "UUID": "F4A37FF1-7D42-45B9-A10D-B4C7F16A3B62",
    "DataProviderID": 29,
    "DataProvidersReference": "10594",
    "AddressInfo": {
        "ID": 183227,
        "Title": "Dreilindenstraße 5",
        "AddressLine1": "Dreilindenstraße 5",
        "Town": "Zusmarshausen",
        "Postcode": "86441",
        "CountryID": 87,
        "Latitude": 48.406443,
        "Longitude": 10.602171,
        "DistanceUnit": 0
    },
    "Connections": [
        {
            "ID": 289148,
            "ConnectionTypeID": 25,
            "StatusTypeID": 50,
            "LevelID": 2,
            "PowerKW": 22,
            "CurrentTypeID": 20
        },
        {
            "ID": 289149,
            "ConnectionTypeID": 25,
            "StatusTypeID": 50,
            "LevelID": 2,
            "PowerKW": 22,
            "CurrentTypeID": 20
        }
    ],
    "StatusTypeID": 50,
    "DateLastStatusUpdate": "2021-07-12T02:41:00Z",
    "MetadataValues": [
        {
            "ID": 15161,
            "MetadataFieldID": 4,
            "ItemValue": "Data from the German chargepoint registry provided by Bundesnetzagentur.de under the CC-BY 4.0 license"
        }
    ],
    "DataQualityLevel": 3,
    "DateCreated": "2021-07-08T10:03:00Z",
    "SubmissionStatusTypeID": 100
}