{
    "IsRecentlyVerified": false,
    "ID": 183730,
    "UUID": "6F557CB0-A34C-4AA1-8CAC-E39017A59F81",
    "DataProviderID": 29,
    "DataProvidersReference": "10702",
    "OperatorID": 86,
    "AddressInfo": {
        "ID": 184089,
        "Title": "Kalte Gasse 2",
        "AddressLine1": "Kalte Gasse 2",
        "Town": "Leingarten",
        "Postcode": "74211",
        "CountryID": 87,
        "Latitude": 49.143898,
        "Longitude": 9.120727,
        "DistanceUnit": 0
    },
    "Connections": [
        {
            "ID": 291077,
            "ConnectionTypeID": 25,
            "StatusTypeID": 50,
            "LevelID": 2,
            "PowerKW": 22,
            "CurrentTypeID": 20
        },
        {
            "ID": 296639,
            "ConnectionTypeID": 25,
            "StatusTypeID": 50,
            "LevelID": 2,
            "PowerKW": 22,
            "CurrentTypeID": 20
        }
    ],
    "StatusTypeID": 50,
    "DateLastStatusUpdate": "2021-07-12T02:42:00Z",
    "MetadataValues": [
        {
            "ID": 16023,
            "MetadataFieldID": 4,
            "ItemValue": "Data from the German chargepoint registry provided by Bundesnetzagentur.de under the CC-BY 4.0 license"
        }
    ],
    "DataQualityLevel": 3,
    "DateCreated": "2021-07-08T10:04:00Z",
    "SubmissionStatusTypeID": 100
}