{
    "IsRecentlyVerified": false,
    "ID": 119680,
    "UUID": "50D894FB-2803-4ECC-A5FF-E689D958E652",
    "DataProviderID": 2,
    "DataProvidersReference": "48029",
    "UsageTypeID": 2,
    "AddressInfo": {
        "ID": 120026,
        "Title": "Florida Power & Light - Stuart Service Center",
        "AddressLine1": "4406 SW Cargo Way",
        "Town": "Palm City",
        "StateOrProvince": "FL",
        "Postcode": "34990",
        "CountryID": 2,
        "Latitude": 27.167492,
        "Longitude": -80.313691,
        "ContactTelephone1": "",
        "AccessComments": "",
        "RelatedURL": "",
        "DistanceUnit": 0
    },
    "Connections": [
        {
            "ID": 168960,
            "ConnectionTypeID": 1,
            "LevelID": 2,
            "Amps": 16,
            "Voltage": 230,
            "PowerKW": 3.7,
            "CurrentTypeID": 10,
            "Quantity": 4
        }
    ],
    "DateLastStatusUpdate": "2020-06-26T02:52:00Z",
    "DataQualityLevel": 3,
    "DateCreated": "2019-04-01T04:59:00Z",
    "SubmissionStatusTypeID": 100
}