{
    "IsRecentlyVerified": false,
    "ID": 62873,
    "UUID": "A6DAE719-85A5-4627-9570-A59D198623E6",
    "DataProviderID": 26,
    "DataProvidersReference": "82933",
    "OperatorID": 73,
    "OperatorsReference": "EV-Box EVB-P1541023",
    "UsageCost": "0.00 jaarabonnement",
    "AddressInfo": {
        "ID": 63219,
        "Title": "Sigarenmaker 14",
        "AddressLine1": "Sigarenmaker 14",
        "Town": "Eersel",
        "Postcode": "5521 DJ",
        "CountryID": 159,
        "Latitude": 51.88731,
        "Longitude": 4.55172,
        "RelatedURL": "http://www.ev-box.nl",
        "DistanceUnit": 0
    },
    "Connections": [
        {
            "ID": 79863,
            "ConnectionTypeID": 25,
            "LevelID": 2,
            "PowerKW": 11,
            "CurrentTypeID": 10
        },
        {
            "ID": 79864,
            "ConnectionTypeID": 25,
            "LevelID": 2,
            "PowerKW": 11,
            "CurrentTypeID": 10
        }
    ],
    "NumberOfPoints": 1,
    "StatusTypeID": 50,
    "DateLastStatusUpdate": "2016-06-04T02:41:00Z",
    "DataQualityLevel": 3,
    "DateCreated": "2016-03-03T12:29:00Z",
    "SubmissionStatusTypeID": 100
}