{
    "IsRecentlyVerified": false,
    "ID": 187408,
    "UUID": "ACBA9918-AA6E-4B15-98DB-6F120ECB15A0",
    "DataProviderID": 29,
    "DataProvidersReference": "4972",
    "AddressInfo": {
        "ID": 187767,
        "Title": "Am Nordertor",
        "AddressLine1": "Am Nordertor",
        "Town": "Flensburg",
        "Postcode": "24939",
        "CountryID": 87,
        "Latitude": 54.795707,
        "Longitude": 9.430071,
        "DistanceUnit": 0
    },
    "Connections": [
        {
            "ID": 302535,
            "ConnectionTypeID": 25,
            "StatusTypeID": 50,
            "LevelID": 2,
            "PowerKW": 22,
            "CurrentTypeID": 20
        },
        {
            "ID": 302536,
            "ConnectionTypeID": 25,
            "StatusTypeID": 50,
            "LevelID": 2,
            "PowerKW": 22,
            "CurrentTypeID": 20
        }
    ],
    "StatusTypeID": 50,
    "DateLastStatusUpdate": "2021-07-12T02:52:00Z",
    "MetadataValues": [
        {
            "ID": 19648,
            "MetadataFieldID": 4,
            "ItemValue": "Data from the German chargepoint registry provided by Bundesnetzagentur.de under the CC-BY 4.0 license"
        }
    ],
    "DataQualityLevel": 3,
    "DateCreated": "2021-07-12T02:52:00Z",
    "SubmissionStatusTypeID": 100
}