{
    "IsRecentlyVerified": false,
    "ID": 123916,
    "UUID": "5B27C7B2-E89F-4DEE-9D9B-4061C03915FA",
    "DataProviderID": 2,
    "DataProvidersReference": "88990",
    "UsageTypeID": 1,
    "AddressInfo": {
        "ID": 124262,
        "Title": "Audi - Palo Alto",
        "AddressLine1": "1730 Embarcadero Rd",
        "Town": "Palo Alto",
        "StateOrProvince": "CA",
        "Postcode": "94303",
        "CountryID": 2,
        "Latitude": 37.449726,
        "Longitude": -122.118056,
        "ContactTelephone1": "833-830-1068",
        "AccessComments": "9am-7pm M-Sat, 10am-6pm Sun; for customer use only",
        "RelatedURL": "",
        "DistanceUnit": 0
    },
    "Connections": [
        {
            "ID": 173949,
            "ConnectionTypeID": 1,
            "LevelID": 2,
            "Amps": 16,
            "Voltage": 230,
            "PowerKW": 3.7,
            "CurrentTypeID": 10,
            "Quantity": 1
        }
    ],
    "DateLastStatusUpdate": "2020-06-26T02:59:00Z",
    "DataQualityLevel": 3,
    "DateCreated": "2019-04-06T05:03:00Z",
    "SubmissionStatusTypeID": 100
}