{
    "IsRecentlyVerified": false,
    "ID": 103576,
    "UUID": "EF31CA1A-52D6-4200-933B-A3E02F4B4C5D",
    "DataProviderID": 1,
    "OperatorID": 23,
    "OperatorsReference": "42772",
    "UsageTypeID": 7,
    "AddressInfo": {
        "ID": 103922,
        "Title": "Hotel du Lac Parc & Residence",
        "AddressLine1": "Via Trieste",
        "Town": "32",
        "StateOrProvince": "Lavarone",
        "Postcode": "38046",
        "CountryID": 112,
        "Latitude": 45.937872,
        "Longitude": 11.255309,
        "ContactTelephone1": "+39 0464 783 112",
        "DistanceUnit": 0
    },
    "Connections": [
        {
            "ID": 146243,
            "ConnectionTypeID": 30,
            "StatusTypeID": 50,
            "LevelID": 2,
            "Amps": 32,
            "Voltage": 400,
            "PowerKW": 22,
            "CurrentTypeID": 20,
            "Quantity": 1
        }
    ],
    "NumberOfPoints": 1,
    "GeneralComments": "1 Tesla Connector, up to 22kW.Available by reservation only. Please call ahead.",
    "StatusTypeID": 50,
    "DateLastStatusUpdate": "2018-10-03T22:36:00Z",
    "DataQualityLevel": 1,
    "DateCreated": "2018-05-04T05:43:00Z",
    "SubmissionStatusTypeID": 200
}