{
    "IsRecentlyVerified": false,
    "ID": 90035,
    "UUID": "7D4AB773-E9CB-4188-A7A0-2CDF297067F2",
    "DataProviderID": 1,
    "OperatorID": 45,
    "UsageTypeID": 1,
    "AddressInfo": {
        "ID": 90381,
        "Title": "ESWE Versorgung",
        "AddressLine1": "Weidenbornstraße 1",
        "Town": "Wiesbaden",
        "StateOrProvince": "Hessen",
        "Postcode": "65189",
        "CountryID": 87,
        "Latitude": 50.0606663,
        "Longitude": 8.255946799999947,
        "AccessComments": "Ladesäule befindet sich direkt gegenüber zum Haupteingang der ESWE Versorgungs AG in der Konradinerallee 25. Keine Ladekarte nötig, Mo-Fr von 8.18Uhr geöffnet",
        "RelatedURL": "http://www.eswe-versorgung.de/",
        "DistanceUnit": 0
    },
    "Connections": [
        {
            "ID": 127632,
            "ConnectionTypeID": 25,
            "StatusTypeID": 50,
            "LevelID": 2,
            "Amps": 32,
            "Voltage": 400,
            "PowerKW": 22,
            "CurrentTypeID": 20,
            "Quantity": 2
        }
    ],
    "NumberOfPoints": 2,
    "StatusTypeID": 50,
    "DateLastStatusUpdate": "2017-07-04T12:31:00Z",
    "DataQualityLevel": 1,
    "DateCreated": "2017-07-04T12:31:00Z",
    "SubmissionStatusTypeID": 200
}