{
    "IsRecentlyVerified": false,
    "ID": 57272,
    "UUID": "A260AE6C-DEAB-4FD7-AF5B-1839B2D7815C",
    "DataProviderID": 1,
    "OperatorID": 23,
    "OperatorsReference": "7619",
    "UsageTypeID": 1,
    "AddressInfo": {
        "ID": 57618,
        "Title": "Best Western Plus Abbey Inn and Suites - Tesla",
        "AddressLine1": "1129 S Bluff St",
        "Town": "St. George",
        "StateOrProvince": "UT",
        "Postcode": "84770",
        "CountryID": 2,
        "Latitude": 37.0889798,
        "Longitude": -113.5843228,
        "ContactTelephone1": "435-652-1234  877-798-3752",
        "AccessComments": "24 hours daily; for Tesla use only",
        "RelatedURL": "http://www.teslamotors.com/supercharger",
        "DistanceUnit": 0
    },
    "Connections": [
        {
            "ID": 72370,
            "ConnectionTypeID": 30,
            "StatusTypeID": 50,
            "LevelID": 2,
            "Amps": 16,
            "Voltage": 230,
            "PowerKW": 6,
            "CurrentTypeID": 10,
            "Quantity": 2
        }
    ],
    "NumberOfPoints": 2,
    "StatusTypeID": 50,
    "DateLastStatusUpdate": "2017-02-02T17:41:00Z",
    "DataQualityLevel": 3,
    "DateCreated": "2015-11-30T11:50:00Z",
    "SubmissionStatusTypeID": 100
}