{
    "IsRecentlyVerified": false,
    "ID": 122661,
    "UUID": "F63F2309-016C-412C-9557-A773AEF5BB98",
    "DataProviderID": 2,
    "DataProvidersReference": "98405",
    "OperatorID": 5,
    "UsageTypeID": 1,
    "AddressInfo": {
        "ID": 123007,
        "Title": "SF CITY EV",
        "AddressLine1": "1120 Truman St",
        "Town": "San Fernando",
        "StateOrProvince": "CA",
        "Postcode": "91340",
        "CountryID": 2,
        "Latitude": 34.2840554,
        "Longitude": -118.4419903,
        "ContactTelephone1": "888-758-4389",
        "AccessComments": "24 hours daily",
        "RelatedURL": "http://www.chargepoint.com/",
        "DistanceUnit": 0
    },
    "Connections": [
        {
            "ID": 172568,
            "ConnectionTypeID": 1,
            "LevelID": 2,
            "Amps": 16,
            "Voltage": 230,
            "PowerKW": 3,
            "CurrentTypeID": 10,
            "Quantity": 2
        }
    ],
    "DateLastStatusUpdate": "2019-12-24T09:12:00Z",
    "DataQualityLevel": 3,
    "DateCreated": "2019-04-06T05:03:00Z",
    "SubmissionStatusTypeID": 100
}