{
    "MediaItems": [
        {
            "ID": 19253,
            "ChargePointID": 90658,
            "ItemURL": "https://s3-ap-southeast-2.amazonaws.com/openchargemap/images/GB/OCM90658/OCM-90658.orig.2019081709494497.png",
            "ItemThumbnailURL": "https://s3-ap-southeast-2.amazonaws.com/openchargemap/images/GB/OCM90658/OCM-90658.thmb.2019081709494497.png",
            "Comment": "",
            "IsEnabled": true,
            "IsVideo": false,
            "IsFeaturedItem": false,
            "IsExternalResource": false,
            "User": {
                "ID": 20646,
                "Username": "Nigels Ipace "
            },
            "DateCreated": "2019-08-17T09:50:00Z"
        },
        {
            "ID": 19252,
            "ChargePointID": 90658,
            "ItemURL": "https://s3-ap-southeast-2.amazonaws.com/openchargemap/images/GB/OCM90658/OCM-90658.orig.2019081709490683.png",
            "ItemThumbnailURL": "https://s3-ap-southeast-2.amazonaws.com/openchargemap/images/GB/OCM90658/OCM-90658.thmb.2019081709490683.png",
            "Comment": "",
            "IsEnabled": true,
            "IsVideo": false,
            "IsFeaturedItem": false,
            "IsExternalResource": false,
            "User": {
                "ID": 20646,
                "Username": "Nigels Ipace "
            },
            "DateCreated": "2019-08-17T09:49:00Z"
        }
    ],
    "IsRecentlyVerified": false,
    "ID": 90658,
    "UUID": "B65DBFAB-4B3B-4325-AF46-52804517B3F0",
    "DataProviderID": 1,
    "OperatorID": 32,
    "OperatorsReference": "24064",
    "UsageTypeID": 4,
    "UsageCost": "£0.108/kWh; for Polar Plus subscription members only",
    "AddressInfo": {
        "ID": 91004,
        "Title": "Holiday Inn Birmingham North-Cannock",
        "AddressLine1": "Bridge Street",
        "AddressLine2": "Bridgtown",
        "Town": "Cannock Chase",
        "StateOrProvince": "Staffordshire",
        "Postcode": "WS11 0DQ",
        "CountryID": 1,
        "Latitude": 52.67337,
        "Longitude": -2.0247,
        "DistanceUnit": 0
    },
    "Connections": [
        {
            "ID": 128371,
            "ConnectionTypeID": 2,
            "StatusTypeID": 50,
            "LevelID": 3,
            "Amps": 125,
            "Voltage": 400,
            "PowerKW": 50,
            "CurrentTypeID": 30,
            "Quantity": 1
        },
        {
            "ID": 128372,
            "ConnectionTypeID": 33,
            "StatusTypeID": 50,
            "LevelID": 3,
            "Amps": 125,
            "Voltage": 400,
            "PowerKW": 50,
            "CurrentTypeID": 30,
            "Quantity": 1
        },
        {
            "ID": 128373,
            "ConnectionTypeID": 1036,
            "StatusTypeID": 50,
            "LevelID": 3,
            "Amps": 63,
            "Voltage": 400,
            "PowerKW": 43,
            "CurrentTypeID": 20,
            "Quantity": 1
        }
    ],
    "NumberOfPoints": 1,
    "StatusTypeID": 50,
    "DateLastStatusUpdate": "2019-08-17T09:50:00Z",
    "DataQualityLevel": 1,
    "DateCreated": "2017-07-21T13:56:00Z",
    "SubmissionStatusTypeID": 200
}