{
    "IsRecentlyVerified": false,
    "ID": 180536,
    "UUID": "1B0F4DF1-4C0D-45FA-8574-0585E38D900A",
    "DataProviderID": 29,
    "DataProvidersReference": "15422",
    "AddressInfo": {
        "ID": 180895,
        "Title": "Schulstraße 20",
        "AddressLine1": "Schulstraße 20",
        "Town": "Schwebheim",
        "Postcode": "97525",
        "CountryID": 87,
        "Latitude": 49.99912,
        "Longitude": 10.25055,
        "DistanceUnit": 0
    },
    "Connections": [
        {
            "ID": 283729,
            "ConnectionTypeID": 25,
            "StatusTypeID": 50,
            "LevelID": 2,
            "PowerKW": 22,
            "CurrentTypeID": 20
        },
        {
            "ID": 283730,
            "ConnectionTypeID": 25,
            "StatusTypeID": 50,
            "LevelID": 2,
            "PowerKW": 22,
            "CurrentTypeID": 20
        },
        {
            "ID": 283731,
            "ConnectionTypeID": 25,
            "StatusTypeID": 50,
            "LevelID": 2,
            "PowerKW": 22,
            "CurrentTypeID": 20
        },
        {
            "ID": 283732,
            "ConnectionTypeID": 25,
            "StatusTypeID": 50,
            "LevelID": 2,
            "PowerKW": 22,
            "CurrentTypeID": 20
        }
    ],
    "StatusTypeID": 50,
    "DateLastStatusUpdate": "2021-07-09T03:18:00Z",
    "MetadataValues": [
        {
            "ID": 12830,
            "MetadataFieldID": 4,
            "ItemValue": "Data from the German chargepoint registry provided by Bundesnetzagentur.de under the CC-BY 4.0 license"
        }
    ],
    "DataQualityLevel": 3,
    "DateCreated": "2021-07-08T10:00:00Z",
    "SubmissionStatusTypeID": 100
}