{
    "IsRecentlyVerified": false,
    "ID": 113576,
    "UUID": "41294E5A-024F-4DE5-82DD-C269071E0B65",
    "DataProviderID": 1,
    "OperatorID": 3296,
    "UsageTypeID": 5,
    "UsageCost": "£0.35/kWh",
    "AddressInfo": {
        "ID": 113922,
        "Title": "Grange Farm Service Station",
        "AddressLine1": "A45 London Road",
        "Town": "Northampton",
        "Postcode": "NN4 0LY",
        "CountryID": 1,
        "Latitude": 52.193665,
        "Longitude": -0.891413,
        "DistanceUnit": 0
    },
    "Connections": [
        {
            "ID": 160054,
            "ConnectionTypeID": 33,
            "StatusTypeID": 50,
            "LevelID": 3,
            "PowerKW": 50,
            "CurrentTypeID": 30,
            "Quantity": 2
        },
        {
            "ID": 160055,
            "ConnectionTypeID": 2,
            "StatusTypeID": 50,
            "LevelID": 3,
            "PowerKW": 50,
            "CurrentTypeID": 30,
            "Quantity": 2
        }
    ],
    "NumberOfPoints": 2,
    "StatusTypeID": 50,
    "DateLastStatusUpdate": "2018-12-20T15:19:00Z",
    "DataQualityLevel": 1,
    "DateCreated": "2018-12-20T15:19:00Z",
    "SubmissionStatusTypeID": 200
}