{
    "IsRecentlyVerified": false,
    "ID": 109370,
    "UUID": "5F0FE1CC-B043-4759-82DA-E355845D19AB",
    "DataProviderID": 1,
    "OperatorID": 23,
    "OperatorsReference": "34477",
    "UsageTypeID": 4,
    "UsageCost": "HRK 1.69/kWh; Ostale cijene za starije automobile",
    "AddressInfo": {
        "ID": 109716,
        "Title": "Karlovac Supercharger",
        "AddressLine1": "162/a Banija",
        "Town": "Karlovac",
        "StateOrProvince": "Zagreb county",
        "CountryID": 60,
        "Latitude": 45.5130940050654,
        "Longitude": 15.5474229175568,
        "DistanceUnit": 0
    },
    "Connections": [
        {
            "ID": 154488,
            "ConnectionTypeID": 27,
            "StatusTypeID": 50,
            "LevelID": 3,
            "PowerKW": 125,
            "CurrentTypeID": 30,
            "Quantity": 6
        }
    ],
    "NumberOfPoints": 6,
    "GeneralComments": "Charging6 Superchargers, available 24/7, up to 120kW",
    "StatusTypeID": 50,
    "DateLastStatusUpdate": "2020-02-26T22:29:00Z",
    "DataQualityLevel": 1,
    "DateCreated": "2018-10-11T14:43:00Z",
    "SubmissionStatusTypeID": 200
}