{
    "IsRecentlyVerified": false,
    "ID": 156472,
    "UUID": "90792854-C25C-4E10-84C5-F9F412D3BFDB",
    "DataProviderID": 1,
    "OperatorID": 3318,
    "UsageTypeID": 1,
    "AddressInfo": {
        "ID": 156826,
        "Title": "Wal-Mart 2177",
        "AddressLine1": "3352 Murphy Canyon Road",
        "Town": "San Diego",
        "StateOrProvince": "CA",
        "Postcode": "92123",
        "CountryID": 2,
        "Latitude": 32.8046198,
        "Longitude": -117.1150854,
        "DistanceUnit": 0
    },
    "Connections": [
        {
            "ID": 220189,
            "ConnectionTypeID": 1,
            "StatusTypeID": 50,
            "LevelID": 2,
            "Amps": 16,
            "Voltage": 230,
            "PowerKW": 3,
            "CurrentTypeID": 10,
            "Quantity": 1
        },
        {
            "ID": 220190,
            "ConnectionTypeID": 2,
            "StatusTypeID": 50,
            "LevelID": 3,
            "Amps": 100,
            "Voltage": 400,
            "PowerKW": 40,
            "CurrentTypeID": 30,
            "Quantity": 1
        },
        {
            "ID": 220191,
            "ConnectionTypeID": 32,
            "StatusTypeID": 50,
            "LevelID": 3,
            "Amps": 100,
            "Voltage": 400,
            "PowerKW": 150,
            "CurrentTypeID": 30,
            "Quantity": 5
        }
    ],
    "NumberOfPoints": 4,
    "StatusTypeID": 50,
    "DateLastStatusUpdate": "2020-05-25T05:58:00Z",
    "DataQualityLevel": 1,
    "DateCreated": "2020-05-23T06:18:00Z",
    "SubmissionStatusTypeID": 200
}