{
    "IsRecentlyVerified": false,
    "ID": 154772,
    "UUID": "6D042BAE-B198-4163-ABA0-11703FF0B7FD",
    "DataProviderID": 1,
    "OperatorID": 3315,
    "OperatorsReference": "52305,52306,52683",
    "UsageTypeID": 4,
    "UsageCost": "Free",
    "AddressInfo": {
        "ID": 155125,
        "Title": "Pier Car Park, Helensburgh",
        "AddressLine1": "Pier Car Park",
        "Town": "West Clyde Street",
        "StateOrProvince": "Helensburgh",
        "Postcode": "G84 8SQ",
        "CountryID": 1,
        "Latitude": 56.002059,
        "Longitude": -4.735666,
        "DistanceUnit": 0
    },
    "Connections": [
        {
            "ID": 217799,
            "ConnectionTypeID": 33,
            "StatusTypeID": 75,
            "LevelID": 3,
            "PowerKW": 50,
            "CurrentTypeID": 30,
            "Quantity": 2
        },
        {
            "ID": 217800,
            "ConnectionTypeID": 2,
            "StatusTypeID": 75,
            "LevelID": 3,
            "PowerKW": 50,
            "CurrentTypeID": 30,
            "Quantity": 2
        },
        {
            "ID": 217801,
            "ConnectionTypeID": 1036,
            "StatusTypeID": 75,
            "LevelID": 3,
            "PowerKW": 43,
            "CurrentTypeID": 20,
            "Quantity": 2
        },
        {
            "ID": 217890,
            "ConnectionTypeID": 25,
            "StatusTypeID": 50,
            "LevelID": 2,
            "Amps": 32,
            "Voltage": 230,
            "PowerKW": 7,
            "CurrentTypeID": 10,
            "Quantity": 2
        },
        {
            "ID": 217975,
            "ConnectionTypeID": 25,
            "StatusTypeID": 50,
            "LevelID": 2,
            "Amps": 32,
            "Voltage": 230,
            "PowerKW": 7,
            "CurrentTypeID": 10,
            "Quantity": 2
        }
    ],
    "NumberOfPoints": 4,
    "StatusTypeID": 75,
    "DateLastStatusUpdate": "2020-04-07T05:17:00Z",
    "DataQualityLevel": 1,
    "DateCreated": "2020-03-19T06:19:00Z",
    "SubmissionStatusTypeID": 200
}