{
    "IsRecentlyVerified": false,
    "ID": 159814,
    "UUID": "8B77DBFE-73B7-4C5D-A453-665E7C8D4A39",
    "DataProviderID": 2,
    "DataProvidersReference": "154170",
    "OperatorID": 5,
    "UsageTypeID": 1,
    "AddressInfo": {
        "ID": 160171,
        "Title": "UIOWA",
        "AddressLine1": "360 Newton Rd",
        "Town": "Iowa City",
        "StateOrProvince": "IA",
        "Postcode": "52246",
        "CountryID": 2,
        "Latitude": 41.6636169,
        "Longitude": -91.5449182,
        "ContactTelephone1": "888-758-4389",
        "AccessComments": "24 hours daily",
        "RelatedURL": "http://www.chargepoint.com/",
        "DistanceUnit": 0
    },
    "Connections": [
        {
            "ID": 230032,
            "ConnectionTypeID": 1,
            "LevelID": 2,
            "Amps": 16,
            "Voltage": 230,
            "PowerKW": 3.7,
            "CurrentTypeID": 10,
            "Quantity": 2
        }
    ],
    "StatusTypeID": 50,
    "DateLastStatusUpdate": "2020-06-26T03:04:00Z",
    "DataQualityLevel": 3,
    "DateCreated": "2020-06-26T03:04:00Z",
    "SubmissionStatusTypeID": 100
}