{
    "IsRecentlyVerified": false,
    "ID": 162932,
    "UUID": "3982E0AF-C98A-4434-B900-B57706C5015B",
    "DataProviderID": 1,
    "OperatorID": 1,
    "UsageTypeID": 0,
    "AddressInfo": {
        "ID": 163289,
        "Title": "Ridgedale Target",
        "AddressLine1": "13201 Ridgedale Dr",
        "Town": "Minnetonka",
        "StateOrProvince": "MN",
        "Postcode": "55305",
        "CountryID": 2,
        "Latitude": 44.970479132002,
        "Longitude": -93.4464650334125,
        "DistanceUnit": 0
    },
    "Connections": [
        {
            "ID": 234479,
            "ConnectionTypeID": 1
        },
        {
            "ID": 234480,
            "ConnectionTypeID": 27
        }
    ],
    "NumberOfPoints": 12,
    "GeneralComments": "2 Dual-plug J-1772 stations, 8 Supercharger stations",
    "StatusTypeID": 150,
    "DateLastStatusUpdate": "2020-08-19T05:52:00Z",
    "DataQualityLevel": 1,
    "DateCreated": "2020-08-19T01:42:00Z",
    "SubmissionStatusTypeID": 200
}