{
    "IsRecentlyVerified": false,
    "ID": 187209,
    "UUID": "D8C48534-BBFE-4477-A36B-4C113EC07F62",
    "DataProviderID": 29,
    "DataProvidersReference": "21450",
    "AddressInfo": {
        "ID": 187568,
        "Title": "Dassower Straße 3",
        "AddressLine1": "Dassower Straße 3",
        "Town": "Neuenhagen",
        "Postcode": "23942",
        "CountryID": 87,
        "Latitude": 53.572307,
        "Longitude": 11.01242,
        "DistanceUnit": 0
    },
    "Connections": [
        {
            "ID": 301773,
            "ConnectionTypeID": 28,
            "StatusTypeID": 50,
            "LevelID": 2,
            "PowerKW": 22,
            "CurrentTypeID": 20
        },
        {
            "ID": 301774,
            "ConnectionTypeID": 25,
            "StatusTypeID": 50,
            "LevelID": 2,
            "PowerKW": 22,
            "CurrentTypeID": 20
        }
    ],
    "StatusTypeID": 50,
    "DateLastStatusUpdate": "2021-07-12T02:51:00Z",
    "MetadataValues": [
        {
            "ID": 19449,
            "MetadataFieldID": 4,
            "ItemValue": "Data from the German chargepoint registry provided by Bundesnetzagentur.de under the CC-BY 4.0 license"
        }
    ],
    "DataQualityLevel": 3,
    "DateCreated": "2021-07-12T02:51:00Z",
    "SubmissionStatusTypeID": 100
}