{
    "IsRecentlyVerified": false,
    "ID": 32077,
    "UUID": "12C40B50-41D2-4680-94BC-E52B62027081",
    "DataProviderID": 1,
    "OperatorID": 105,
    "OperatorsReference": "Essent EM-DE-06439012-01-00001",
    "UsageTypeID": 4,
    "AddressInfo": {
        "ID": 32423,
        "Title": "Paul-Gerhardt-Weg 1",
        "AddressLine1": "Paul-Gerhardt-Weg 1",
        "Town": "Oestrich-Winkel",
        "Postcode": "65375",
        "CountryID": 87,
        "Latitude": 50.008442,
        "Longitude": 8.01959,
        "DistanceUnit": 0
    },
    "Connections": [
        {
            "ID": 35588,
            "ConnectionTypeID": 25,
            "LevelID": 2,
            "PowerKW": 11
        },
        {
            "ID": 46180,
            "ConnectionTypeID": 25,
            "LevelID": 2,
            "PowerKW": 11
        }
    ],
    "NumberOfPoints": 1,
    "StatusTypeID": 50,
    "DateLastStatusUpdate": "2015-04-13T22:33:00Z",
    "DataQualityLevel": 3,
    "DateCreated": "2015-01-09T06:03:00Z",
    "SubmissionStatusTypeID": 200
}