{
    "IsRecentlyVerified": false,
    "ID": 28687,
    "UUID": "066127BF-2458-4AE2-A626-61F2248D89DC",
    "DataProviderID": 2,
    "DataProvidersReference": "58326",
    "OperatorID": 5,
    "UsageTypeID": 1,
    "AddressInfo": {
        "ID": 29033,
        "Title": "3RD FLOOR",
        "AddressLine1": "60 W Kinzie St",
        "Town": "Chicago",
        "StateOrProvince": "IL",
        "Postcode": "60661",
        "CountryID": 2,
        "Latitude": 41.889421,
        "Longitude": -87.630028,
        "ContactTelephone1": "888-758-4389",
        "AccessComments": "24 hours daily",
        "RelatedURL": "http://www.chargepoint.com/",
        "DistanceUnit": 0
    },
    "Connections": [
        {
            "ID": 31512,
            "ConnectionTypeID": 1,
            "LevelID": 2,
            "Amps": 16,
            "Voltage": 230,
            "PowerKW": 3.7,
            "CurrentTypeID": 10,
            "Quantity": 6
        }
    ],
    "DateLastStatusUpdate": "2020-06-26T03:05:00Z",
    "DataQualityLevel": 3,
    "DateCreated": "2014-11-28T03:38:00Z",
    "SubmissionStatusTypeID": 100
}