{
    "IsRecentlyVerified": false,
    "ID": 133035,
    "UUID": "43D34F34-0A5B-449E-AF58-F0DA8E4011C1",
    "DataProviderID": 1,
    "OperatorID": 23,
    "OperatorsReference": "52075",
    "UsageTypeID": 4,
    "AddressInfo": {
        "ID": 133381,
        "Title": "Bloomsburys Biddenden",
        "AddressLine1": "Sissinghurst Road",
        "Town": "Biddenden",
        "Postcode": "TN27 8DQ",
        "CountryID": 1,
        "Latitude": 51.115045,
        "Longitude": 0.627198,
        "ContactTelephone1": "+44 158 029 2992",
        "DistanceUnit": 0
    },
    "Connections": [
        {
            "ID": 186316,
            "ConnectionTypeID": 30,
            "StatusTypeID": 50,
            "LevelID": 2,
            "PowerKW": 22,
            "CurrentTypeID": 20,
            "Quantity": 1
        }
    ],
    "NumberOfPoints": 1,
    "GeneralComments": "1 Tesla Connector, up to 22kW.Available to the public. Self park.",
    "StatusTypeID": 50,
    "DateLastStatusUpdate": "2019-10-12T05:43:00Z",
    "DataQualityLevel": 1,
    "DateCreated": "2019-10-12T05:43:00Z",
    "SubmissionStatusTypeID": 200
}