{
    "IsRecentlyVerified": false,
    "ID": 183716,
    "UUID": "F2D00540-64BA-418C-ABD5-E65AD42E41D1",
    "DataProviderID": 29,
    "DataProvidersReference": "3833",
    "OperatorID": 3423,
    "AddressInfo": {
        "ID": 184075,
        "Title": "Im Hagen 10",
        "AddressLine1": "Im Hagen 10",
        "Town": "Bodenwerder",
        "Postcode": "37619",
        "CountryID": 87,
        "Latitude": 51.976589,
        "Longitude": 9.512661,
        "DistanceUnit": 0
    },
    "Connections": [
        {
            "ID": 291044,
            "ConnectionTypeID": 25,
            "StatusTypeID": 50,
            "LevelID": 2,
            "PowerKW": 22,
            "CurrentTypeID": 20
        },
        {
            "ID": 291045,
            "ConnectionTypeID": 25,
            "StatusTypeID": 50,
            "LevelID": 2,
            "PowerKW": 22,
            "CurrentTypeID": 20
        }
    ],
    "StatusTypeID": 50,
    "DateLastStatusUpdate": "2021-07-09T03:25:00Z",
    "MetadataValues": [
        {
            "ID": 16009,
            "MetadataFieldID": 4,
            "ItemValue": "Data from the German chargepoint registry provided by Bundesnetzagentur.de under the CC-BY 4.0 license"
        }
    ],
    "DataQualityLevel": 3,
    "DateCreated": "2021-07-08T10:04:00Z",
    "SubmissionStatusTypeID": 100
}