{
    "IsRecentlyVerified": false,
    "ID": 18077,
    "UUID": "827F2946-FBD3-49A9-9F6D-C0CC33B09A0D",
    "DataProviderID": 22,
    "DataProvidersReference": "A90218782025C48E09BA0436CF30D029",
    "AddressInfo": {
        "ID": 18422,
        "Title": "道の駅阿蘇",
        "AddressLine1": "熊本県阿蘇市黒川1440-1",
        "CountryID": 114,
        "Latitude": 32.93672982,
        "Longitude": 131.0808438,
        "ContactTelephone1": "0967-35-5088",
        "DistanceUnit": 0
    },
    "Connections": [
        {
            "ID": 18318,
            "ConnectionTypeID": 2,
            "LevelID": 2,
            "Amps": 100,
            "Voltage": 480,
            "PowerKW": 48,
            "Quantity": 1
        }
    ],
    "DateLastStatusUpdate": "2013-06-29T09:07:00Z",
    "DataQualityLevel": 2,
    "DateCreated": "2013-06-29T09:07:00Z",
    "SubmissionStatusTypeID": 200
}