{
    "IsRecentlyVerified": false,
    "ID": 64437,
    "UUID": "4B7A979D-9F74-41BE-ABB9-B88A22CDB94A",
    "DataProviderID": 1,
    "OperatorID": 213,
    "UsageTypeID": 4,
    "UsageCost": "0",
    "AddressInfo": {
        "ID": 64783,
        "Title": "Havre - Office du Tourisme",
        "AddressLine1": "186 Boulevard Clémenceau",
        "AddressLine2": "Les Gobelins",
        "Town": "Le Havre",
        "StateOrProvince": "Le Havre",
        "Postcode": "76600;76610;76620",
        "CountryID": 80,
        "Latitude": 49.492576221011866,
        "Longitude": 0.09600286983639794,
        "DistanceUnit": 0
    },
    "Connections": [
        {
            "ID": 82660,
            "ConnectionTypeID": 28,
            "LevelID": 2,
            "Amps": 16,
            "Voltage": 220,
            "PowerKW": 3,
            "CurrentTypeID": 10,
            "Quantity": 2
        }
    ],
    "NumberOfPoints": 2,
    "StatusTypeID": 50,
    "DateLastStatusUpdate": "2016-03-06T13:29:00Z",
    "DataQualityLevel": 1,
    "DateCreated": "2016-03-06T13:29:00Z",
    "SubmissionStatusTypeID": 200
}