{
    "IsRecentlyVerified": false,
    "ID": 35974,
    "UUID": "9620104E-D358-4EB3-86EE-1EDAEA65CB72",
    "DataProviderID": 26,
    "DataProvidersReference": "50769",
    "OperatorID": 180,
    "OperatorsReference": "Alfen GDH1561",
    "UsageCost": "0.00 jaarabonnement",
    "AddressInfo": {
        "ID": 36320,
        "Title": "Celebesstraat 119",
        "AddressLine1": "Celebesstraat 119",
        "Town": "Den Haag",
        "Postcode": "2585 TH",
        "CountryID": 159,
        "Latitude": 52.09042,
        "Longitude": 4.296941,
        "ContactTelephone1": "036 - 549 34 00",
        "RelatedURL": "http://www.icu-charging-stations.com/",
        "DistanceUnit": 0
    },
    "Connections": [
        {
            "ID": 39485,
            "ConnectionTypeID": 25,
            "LevelID": 2,
            "PowerKW": 11,
            "CurrentTypeID": 10
        },
        {
            "ID": 48159,
            "ConnectionTypeID": 25,
            "LevelID": 2,
            "PowerKW": 11,
            "CurrentTypeID": 10
        }
    ],
    "NumberOfPoints": 1,
    "StatusTypeID": 50,
    "DateLastStatusUpdate": "2016-06-04T02:50:00Z",
    "DataQualityLevel": 3,
    "DateCreated": "2015-01-09T06:05:00Z",
    "SubmissionStatusTypeID": 100
}