{
    "IsRecentlyVerified": false,
    "ID": 122259,
    "UUID": "4730EE3D-C37E-436F-AB65-36EA901C8802",
    "DataProviderID": 2,
    "DataProvidersReference": "63060",
    "UsageTypeID": 1,
    "AddressInfo": {
        "ID": 122605,
        "Title": "Los Angeles County Sheriff - Headquarters",
        "AddressLine1": "4700 Ramona Blvd",
        "Town": "Monterey Park",
        "StateOrProvince": "CA",
        "Postcode": "91754",
        "CountryID": 2,
        "Latitude": 34.060685,
        "Longitude": -118.168137,
        "ContactTelephone1": "323-267-2023",
        "AccessComments": "8am-5pm M-F; keypad activated, instructions on EVSE",
        "RelatedURL": "",
        "DistanceUnit": 0
    },
    "Connections": [
        {
            "ID": 172134,
            "ConnectionTypeID": 1,
            "LevelID": 2,
            "Amps": 16,
            "Voltage": 230,
            "PowerKW": 3.7,
            "CurrentTypeID": 10,
            "Quantity": 1
        }
    ],
    "DateLastStatusUpdate": "2020-06-26T02:56:00Z",
    "DataQualityLevel": 3,
    "DateCreated": "2019-04-06T05:02:00Z",
    "SubmissionStatusTypeID": 100
}