{
    "IsRecentlyVerified": false,
    "ID": 176842,
    "UUID": "80F3A0B4-B454-4ECC-B739-73ECDFA5547D",
    "DataProviderID": 29,
    "DataProvidersReference": "7951,18698",
    "AddressInfo": {
        "ID": 177201,
        "Title": "Am Bahnhof 1",
        "AddressLine1": "Am Bahnhof 1",
        "Town": "Bad Waldsee",
        "Postcode": "88339",
        "CountryID": 87,
        "Latitude": 47.92522,
        "Longitude": 9.751775,
        "DistanceUnit": 0
    },
    "Connections": [
        {
            "ID": 275243,
            "ConnectionTypeID": 25,
            "StatusTypeID": 50,
            "LevelID": 2,
            "PowerKW": 22,
            "CurrentTypeID": 20
        },
        {
            "ID": 275244,
            "ConnectionTypeID": 25,
            "StatusTypeID": 50,
            "LevelID": 2,
            "PowerKW": 22,
            "CurrentTypeID": 20
        },
        {
            "ID": 275245,
            "ConnectionTypeID": 25,
            "StatusTypeID": 50,
            "LevelID": 2,
            "PowerKW": 22,
            "CurrentTypeID": 20
        },
        {
            "ID": 275246,
            "ConnectionTypeID": 25,
            "StatusTypeID": 50,
            "LevelID": 2,
            "PowerKW": 22,
            "CurrentTypeID": 20
        }
    ],
    "StatusTypeID": 0,
    "DateLastStatusUpdate": "2021-07-09T03:10:00Z",
    "MetadataValues": [
        {
            "ID": 9137,
            "MetadataFieldID": 4,
            "ItemValue": "Data from the German chargepoint registry provided by Bundesnetzagentur.de under the CC-BY 4.0 license"
        }
    ],
    "DataQualityLevel": 3,
    "DateCreated": "2021-07-08T09:48:00Z",
    "SubmissionStatusTypeID": 100
}