{
    "IsRecentlyVerified": false,
    "ID": 31662,
    "UUID": "D4139DAE-043A-499A-AD2A-4AC8BE62F66E",
    "DataProviderID": 1,
    "OperatorID": 157,
    "OperatorsReference": "NewMotion 02009408",
    "UsageCost": "0.00 jaarabonnement",
    "AddressInfo": {
        "ID": 32008,
        "Title": "B 304",
        "AddressLine1": "B 304",
        "Town": "Traunstein",
        "Postcode": "83278",
        "CountryID": 87,
        "Latitude": 47.8689099,
        "Longitude": 12.6686778000001,
        "ContactTelephone1": "088 0109500",
        "RelatedURL": "http://thenewmotion.nl/",
        "DistanceUnit": 0
    },
    "Connections": [
        {
            "ID": 35173,
            "ConnectionTypeID": 25,
            "LevelID": 2,
            "PowerKW": 3.7,
            "CurrentTypeID": 10
        }
    ],
    "NumberOfPoints": 1,
    "StatusTypeID": 50,
    "DateLastStatusUpdate": "2021-04-25T05:14:00Z",
    "DataQualityLevel": 3,
    "DateCreated": "2015-01-09T06:03:00Z",
    "SubmissionStatusTypeID": 200
}