{
    "IsRecentlyVerified": false,
    "ID": 136341,
    "UUID": "F9129199-91E8-4ADC-ABEE-92DFA013D46A",
    "DataProviderID": 18,
    "DataProvidersReference": "d1e97eace1c3c2b32452ea3d4f58eb31",
    "OperatorID": 2244,
    "UsageTypeID": 5,
    "AddressInfo": {
        "ID": 136687,
        "Title": "21 Clifton Gardens",
        "AddressLine1": "21 Clifton Gardens",
        "Town": "London",
        "Postcode": "W9 1AU",
        "CountryID": 1,
        "Latitude": 51.524495,
        "Longitude": -0.181529,
        "AccessComments": "",
        "RelatedURL": "https://www.ubitricity.com",
        "DistanceUnit": 0
    },
    "Connections": [
        {
            "ID": 190781,
            "ConnectionTypeID": 25,
            "Reference": "suby1100003221",
            "StatusTypeID": 50,
            "LevelID": 2,
            "Amps": 16,
            "Voltage": 230,
            "PowerKW": 3.7,
            "CurrentTypeID": 10
        }
    ],
    "StatusTypeID": 0,
    "DateLastStatusUpdate": "2021-04-25T05:46:00Z",
    "MetadataValues": [
        {
            "ID": 6193,
            "MetadataFieldID": 4,
            "ItemValue": "Contains public sector information licensed under the Open Government Licence v2.0. http://www.nationalarchives.gov.uk/doc/open-government-licence/version/2/"
        }
    ],
    "DataQualityLevel": 3,
    "DateCreated": "2019-12-24T05:22:00Z",
    "SubmissionStatusTypeID": 100
}