{
    "IsRecentlyVerified": false,
    "ID": 85655,
    "UUID": "B1C375F0-6CFA-4B79-85AC-DEA547326405",
    "DataProviderID": 1,
    "OperatorID": 23,
    "OperatorsReference": "26391",
    "UsageTypeID": 6,
    "AddressInfo": {
        "ID": 86001,
        "Title": "l'Orée du Bois",
        "AddressLine1": "1 Lieu Dit l'Orée du Bois",
        "Town": "Vittel",
        "Postcode": "88800",
        "CountryID": 80,
        "Latitude": 48.217885,
        "Longitude": 5.936027,
        "ContactTelephone1": "+33 3 29 08 88 88",
        "DistanceUnit": 0
    },
    "Connections": [
        {
            "ID": 121773,
            "ConnectionTypeID": 30,
            "StatusTypeID": 50,
            "LevelID": 2,
            "Amps": 32,
            "Voltage": 230,
            "PowerKW": 14,
            "CurrentTypeID": 20,
            "Quantity": 1
        }
    ],
    "NumberOfPoints": 1,
    "GeneralComments": "1 Tesla Connector, up to 14kW.Available for patrons only. Please see front desk.",
    "StatusTypeID": 50,
    "DateLastStatusUpdate": "2018-10-03T21:46:00Z",
    "DataQualityLevel": 1,
    "DateCreated": "2017-04-10T05:39:00Z",
    "SubmissionStatusTypeID": 200
}