{
    "IsRecentlyVerified": false,
    "ID": 114662,
    "UUID": "24F97904-117D-49D0-A3BB-1E6E70054525",
    "DataProviderID": 1,
    "OperatorID": 23,
    "OperatorsReference": "48174",
    "UsageTypeID": 6,
    "AddressInfo": {
        "ID": 115008,
        "Title": "Romero Restaurant",
        "AddressLine1": "3 Mohammad Hussein Haykal Street",
        "Town": "Amman",
        "StateOrProvince": "3rd Circle",
        "Postcode": "11118",
        "CountryID": 116,
        "Latitude": 31.952704,
        "Longitude": 35.912359,
        "ContactTelephone1": "+962 6 464 4227",
        "DistanceUnit": 0
    },
    "Connections": [
        {
            "ID": 161382,
            "ConnectionTypeID": 30,
            "StatusTypeID": 50,
            "LevelID": 2,
            "Amps": 16,
            "Voltage": 400,
            "PowerKW": 11,
            "CurrentTypeID": 20,
            "Quantity": 1
        }
    ],
    "NumberOfPoints": 1,
    "GeneralComments": "1 Tesla Connector, up to 11kW.Available for patrons only. Please see valet.",
    "StatusTypeID": 50,
    "DateLastStatusUpdate": "2019-01-13T06:39:00Z",
    "DataQualityLevel": 1,
    "DateCreated": "2019-01-13T06:39:00Z",
    "SubmissionStatusTypeID": 200
}