{
    "IsRecentlyVerified": false,
    "ID": 77369,
    "UUID": "25714E9A-6F59-4038-99AF-61BD0589A7AA",
    "DataProviderID": 1,
    "OperatorID": 45,
    "UsageTypeID": 5,
    "AddressInfo": {
        "ID": 77715,
        "Title": "Parkhaus",
        "AddressLine1": "Joseph-Heppel-Straße",
        "Town": "Limburg",
        "StateOrProvince": "Landkreis Limburg-Weilburg",
        "Postcode": "65549",
        "CountryID": 87,
        "Latitude": 50.3854309,
        "Longitude": 8.049685400000044,
        "AccessComments": "24/7 nutzbar unter einem Parkdeck. Es sind 2 Plätze in der hinteren rechten Ecke reserviert. Parkgebühren fallen an\r\n",
        "DistanceUnit": 0
    },
    "Connections": [
        {
            "ID": 111484,
            "ConnectionTypeID": 25,
            "StatusTypeID": 50,
            "LevelID": 2,
            "Amps": 16,
            "Voltage": 400,
            "PowerKW": 11,
            "CurrentTypeID": 20,
            "Quantity": 2
        }
    ],
    "NumberOfPoints": 2,
    "StatusTypeID": 50,
    "DateLastStatusUpdate": "2017-01-13T14:54:00Z",
    "DataQualityLevel": 1,
    "DateCreated": "2017-01-13T14:54:00Z",
    "SubmissionStatusTypeID": 200
}