{
    "IsRecentlyVerified": false,
    "ID": 160186,
    "UUID": "B802F0BC-0FC3-4867-9D5E-E3FC392A2068",
    "DataProviderID": 2,
    "DataProvidersReference": "83533",
    "UsageTypeID": 1,
    "AddressInfo": {
        "ID": 160543,
        "Title": "University of Guelph",
        "AddressLine1": "50 McGilvray St",
        "Town": "Guelph",
        "StateOrProvince": "ON",
        "Postcode": "N1G 3A5",
        "CountryID": 44,
        "Latitude": 43.5272454290549,
        "Longitude": -80.2342533968506,
        "ContactTelephone1": "519-824-4120 x52245",
        "AccessComments": "24 hours daily; parking fee required",
        "RelatedURL": "",
        "DistanceUnit": 0
    },
    "Connections": [
        {
            "ID": 230450,
            "ConnectionTypeID": 1,
            "LevelID": 2,
            "Amps": 16,
            "Voltage": 230,
            "PowerKW": 3.7,
            "CurrentTypeID": 10,
            "Quantity": 4
        }
    ],
    "StatusTypeID": 50,
    "DateLastStatusUpdate": "2020-06-26T03:07:00Z",
    "DataQualityLevel": 3,
    "DateCreated": "2020-06-26T03:07:00Z",
    "SubmissionStatusTypeID": 100
}