{
    "IsRecentlyVerified": false,
    "ID": 105482,
    "UUID": "1BB911E0-49E8-47F1-A2F7-5703B98736C9",
    "DataProviderID": 1,
    "OperatorID": 23,
    "OperatorsReference": "44140",
    "UsageTypeID": 4,
    "AddressInfo": {
        "ID": 105828,
        "Title": "Eva,garden Hotel",
        "AddressLine1": "Unterer Ronachweg 458",
        "Town": "Saalbach",
        "Postcode": "5753",
        "CountryID": 19,
        "Latitude": 47.391018,
        "Longitude": 12.644573,
        "ContactTelephone1": "+43 6541 6262",
        "DistanceUnit": 0
    },
    "Connections": [
        {
            "ID": 148664,
            "ConnectionTypeID": 30,
            "StatusTypeID": 50,
            "LevelID": 2,
            "Amps": 32,
            "Voltage": 400,
            "PowerKW": 22,
            "CurrentTypeID": 20,
            "Quantity": 2
        }
    ],
    "NumberOfPoints": 2,
    "GeneralComments": "2 Tesla Connectors, up to 22kW.Available for customers. Please see front desk.",
    "StatusTypeID": 50,
    "DateLastStatusUpdate": "2018-10-03T20:39:00Z",
    "DataQualityLevel": 1,
    "DateCreated": "2018-06-08T05:27:00Z",
    "SubmissionStatusTypeID": 200
}