{
    "IsRecentlyVerified": false,
    "ID": 44778,
    "UUID": "632FBBA0-526C-4485-9D76-1406B09BB70A",
    "DataProviderID": 26,
    "DataProvidersReference": "60595",
    "OperatorID": 179,
    "OperatorsReference": "Ecotap 1420165",
    "UsageCost": "0.00 afhankelijk van pas",
    "AddressInfo": {
        "ID": 45124,
        "Title": "Dampten 900",
        "AddressLine1": "Dampten 900",
        "Town": "Hoorn",
        "Postcode": "1624 NR",
        "CountryID": 159,
        "Latitude": 52.646115,
        "Longitude": 5.046213,
        "RelatedURL": "http://www.ecotap.nl",
        "DistanceUnit": 0
    },
    "Connections": [
        {
            "ID": 55020,
            "ConnectionTypeID": 25,
            "LevelID": 2,
            "PowerKW": 22,
            "CurrentTypeID": 10
        }
    ],
    "NumberOfPoints": 2,
    "StatusTypeID": 50,
    "DateLastStatusUpdate": "2016-06-04T02:55:00Z",
    "DataQualityLevel": 3,
    "DateCreated": "2015-04-18T13:02:00Z",
    "SubmissionStatusTypeID": 100
}