{
    "IsRecentlyVerified": false,
    "ID": 8799,
    "UUID": "BF5AF64A-982A-4B16-A3F3-5FE2E4A5960B",
    "DataProviderID": 15,
    "DataProvidersReference": "12139",
    "OperatorID": 5,
    "AddressInfo": {
        "ID": 8696,
        "Title": "5802 Journeys End Way",
        "AddressLine1": "5802 Journeys End Way",
        "Town": "Port Orange",
        "StateOrProvince": "Florida",
        "Postcode": "32127",
        "CountryID": 2,
        "Latitude": 29.1072464,
        "Longitude": -81.0258255,
        "ContactTelephone1": "",
        "RelatedURL": "http://carstations.com/12139",
        "DistanceUnit": 0
    },
    "Connections": [
        {
            "ID": 6281,
            "ConnectionTypeID": 1,
            "Reference": "J1772",
            "LevelID": 2
        },
        {
            "ID": 7049,
            "ConnectionTypeID": 9,
            "Reference": "NEMA5",
            "LevelID": 1,
            "Quantity": 1
        }
    ],
    "StatusTypeID": 0,
    "DateLastStatusUpdate": "2017-11-04T14:03:00Z",
    "DataQualityLevel": 1,
    "DateCreated": "2011-11-26T14:32:00Z",
    "SubmissionStatusTypeID": 100
}