{
    "IsRecentlyVerified": false,
    "ID": 59093,
    "UUID": "5D1F62E6-11E2-4F9A-A39D-205E505B9565",
    "DataProviderID": 1,
    "OperatorID": 23,
    "OperatorsReference": "10445",
    "UsageTypeID": 4,
    "UsageCost": "£0.24/kWh;other tariffs for older cars",
    "AddressInfo": {
        "ID": 59439,
        "Title": "Birchanger Green Supercharger",
        "AddressLine1": "Welcome Break Birchanger Green Services",
        "Town": "Bishop's Stortford",
        "StateOrProvince": "Essex",
        "Postcode": "CM23 5QZ",
        "CountryID": 1,
        "Latitude": 51.871092935199,
        "Longitude": 0.194248193670647,
        "DistanceUnit": 0
    },
    "Connections": [
        {
            "ID": 74985,
            "ConnectionTypeID": 27,
            "StatusTypeID": 50,
            "LevelID": 3,
            "PowerKW": 150,
            "CurrentTypeID": 30,
            "Quantity": 4
        }
    ],
    "NumberOfPoints": 4,
    "StatusTypeID": 50,
    "DateLastStatusUpdate": "2020-05-20T07:43:00Z",
    "DataQualityLevel": 1,
    "DateCreated": "2016-01-07T10:44:00Z",
    "SubmissionStatusTypeID": 200
}