{
    "MediaItems": [
        {
            "ID": 18123,
            "ChargePointID": 125631,
            "ItemURL": "https://s3-ap-southeast-2.amazonaws.com/openchargemap/images/GB/OCM125631/OCM-125631.orig.2019042211051127.jpeg",
            "ItemThumbnailURL": "https://s3-ap-southeast-2.amazonaws.com/openchargemap/images/GB/OCM125631/OCM-125631.thmb.2019042211051127.jpeg",
            "Comment": "coming from Aups center on the right side, directly next to the entry of the intermarche",
            "IsEnabled": true,
            "IsVideo": false,
            "IsFeaturedItem": false,
            "IsExternalResource": false,
            "User": {
                "ID": 20558,
                "Username": "evIguana"
            },
            "DateCreated": "2019-04-22T11:05:00Z"
        }
    ],
    "IsRecentlyVerified": false,
    "ID": 125631,
    "UUID": "3CBD6AF0-F78E-440A-B207-51D9475DD49D",
    "DataProviderID": 1,
    "OperatorID": 45,
    "UsageTypeID": 1,
    "UsageCost": "?",
    "AddressInfo": {
        "ID": 125977,
        "Title": "intermarche aups",
        "AddressLine1": "1220 Route de Salernes",
        "Town": "Aups",
        "StateOrProvince": "Brignoles",
        "Postcode": "83630",
        "CountryID": 80,
        "Latitude": 43.6283799,
        "Longitude": 6.2253165,
        "AccessComments": "not sure how much this is, it works with my german rfid-card",
        "DistanceUnit": 0
    },
    "Connections": [
        {
            "ID": 176032,
            "ConnectionTypeID": 25,
            "StatusTypeID": 50,
            "LevelID": 2,
            "PowerKW": 22,
            "CurrentTypeID": 20,
            "Quantity": 1
        }
    ],
    "NumberOfPoints": 1,
    "StatusTypeID": 50,
    "DateLastStatusUpdate": "2019-04-23T07:43:00Z",
    "DataQualityLevel": 1,
    "DateCreated": "2019-04-22T11:00:00Z",
    "SubmissionStatusTypeID": 200
}