{
    "IsRecentlyVerified": false,
    "ID": 50318,
    "UUID": "1131495B-875E-4C93-BE54-B5AEB1B854DC",
    "DataProviderID": 1,
    "OperatorID": 115,
    "UsageTypeID": 4,
    "AddressInfo": {
        "ID": 50664,
        "Title": "Teplárna Trmice",
        "AddressLine1": "Edisonova 453",
        "Town": "Trmice",
        "Postcode": "400 04",
        "CountryID": 64,
        "Latitude": 50.6461628954553,
        "Longitude": 13.9868497535308,
        "ContactTelephone1": "+420 731 144 297",
        "RelatedURL": "http://www.elektromobilita.cz/",
        "DistanceUnit": 0
    },
    "Connections": [
        {
            "ID": 61976,
            "ConnectionTypeID": 2,
            "StatusTypeID": 50,
            "LevelID": 3,
            "PowerKW": 50,
            "CurrentTypeID": 30,
            "Quantity": 1
        },
        {
            "ID": 61977,
            "ConnectionTypeID": 33,
            "StatusTypeID": 50,
            "LevelID": 3,
            "PowerKW": 50,
            "CurrentTypeID": 30,
            "Quantity": 1
        },
        {
            "ID": 61978,
            "ConnectionTypeID": 25,
            "StatusTypeID": 50,
            "LevelID": 2,
            "Amps": 32,
            "Voltage": 400,
            "PowerKW": 22,
            "CurrentTypeID": 20,
            "Quantity": 2
        },
        {
            "ID": 61979,
            "ConnectionTypeID": 23,
            "StatusTypeID": 50,
            "LevelID": 2,
            "Amps": 16,
            "Voltage": 230,
            "PowerKW": 3.6,
            "CurrentTypeID": 10,
            "Quantity": 1
        }
    ],
    "NumberOfPoints": 2,
    "GeneralComments": "SK: Za poplatok, treba si vybaviť RFID kartu od ČEZ. Jedna zo staníc by mala obsahovať konektory CHAdeMO, CCS a Mennekes a druhá Mennekes a obyčajnú zásuvku.\r\nEN: Paid, need to get an RFID card from ČEZ. One of the stations should have the CHAdeMO, CCS and Mennekes connectors and the other one the Mennekes connector and  CEE 7/5 socket.",
    "StatusTypeID": 50,
    "DateLastStatusUpdate": "2016-05-16T10:36:00Z",
    "DataQualityLevel": 1,
    "DateCreated": "2015-07-21T07:29:00Z",
    "SubmissionStatusTypeID": 200
}