{
    "IsRecentlyVerified": false,
    "ID": 98107,
    "UUID": "ABC9135F-7D6E-4317-925F-52360A811349",
    "DataProviderID": 1,
    "OperatorID": 23,
    "OperatorsReference": "20463",
    "UsageTypeID": 4,
    "UsageCost": "0.00/kWh; other tariffs for older cars",
    "AddressInfo": {
        "ID": 98453,
        "Title": "Studio City Supercharger",
        "AddressLine1": "Estrada Do Istmo Macau",
        "Town": "Cotai Macau",
        "StateOrProvince": "Macau",
        "CountryID": 133,
        "Latitude": 22.141222,
        "Longitude": 113.5626,
        "DistanceUnit": 0
    },
    "Connections": [
        {
            "ID": 139016,
            "ConnectionTypeID": 27,
            "StatusTypeID": 50,
            "LevelID": 3,
            "PowerKW": 120,
            "CurrentTypeID": 30,
            "Quantity": 4
        }
    ],
    "NumberOfPoints": 4,
    "GeneralComments": "4 superchargers, available 24/7, up to 120kW",
    "StatusTypeID": 50,
    "DateLastStatusUpdate": "2018-01-21T17:51:00Z",
    "DataQualityLevel": 1,
    "DateCreated": "2018-01-21T17:51:00Z",
    "SubmissionStatusTypeID": 200
}