{
    "IsRecentlyVerified": false,
    "ID": 124213,
    "UUID": "ABE189D9-8DE3-4C62-BE9E-0B768C6A9698",
    "DataProviderID": 2,
    "DataProvidersReference": "62071",
    "UsageTypeID": 2,
    "AddressInfo": {
        "ID": 124559,
        "Title": "Muir Woods",
        "AddressLine1": "1 Muir Woods Rd",
        "Town": "Mill Valley",
        "StateOrProvince": "CA",
        "Postcode": "94941",
        "CountryID": 2,
        "Latitude": 37.893488,
        "Longitude": -122.572748,
        "ContactTelephone1": "",
        "AccessComments": "",
        "RelatedURL": "",
        "DistanceUnit": 0
    },
    "Connections": [
        {
            "ID": 174285,
            "ConnectionTypeID": 1,
            "LevelID": 2,
            "Amps": 16,
            "Voltage": 230,
            "PowerKW": 3.7,
            "CurrentTypeID": 10,
            "Quantity": 1
        }
    ],
    "DateLastStatusUpdate": "2020-06-26T02:59:00Z",
    "DataQualityLevel": 3,
    "DateCreated": "2019-04-06T05:03:00Z",
    "SubmissionStatusTypeID": 100
}