{
    "IsRecentlyVerified": false,
    "ID": 152684,
    "UUID": "A86507F2-305F-4D42-B048-8ADB264FF45C",
    "DataProviderID": 28,
    "DataProvidersReference": "FR*S49*P49329*001",
    "UsageTypeID": 5,
    "AddressInfo": {
        "ID": 153037,
        "Title": "SAVENNIERES - Place Du Mail",
        "AddressLine1": "Place Du Mail 49170 SAVENNIERES",
        "CountryID": 80,
        "Latitude": 47.383595,
        "Longitude": -0.655311,
        "AccessComments": "24h/24 7j/7",
        "DistanceUnit": 0
    },
    "Connections": [
        {
            "ID": 213848,
            "ConnectionTypeID": 1036,
            "StatusTypeID": 50,
            "LevelID": 2,
            "PowerKW": 22,
            "CurrentTypeID": 20
        },
        {
            "ID": 213849,
            "ConnectionTypeID": 28,
            "StatusTypeID": 50,
            "LevelID": 2,
            "PowerKW": 22,
            "CurrentTypeID": 10
        },
        {
            "ID": 247021,
            "ConnectionTypeID": 1036,
            "StatusTypeID": 50,
            "LevelID": 2,
            "PowerKW": 22,
            "CurrentTypeID": 20
        },
        {
            "ID": 247022,
            "ConnectionTypeID": 28,
            "StatusTypeID": 50,
            "LevelID": 2,
            "PowerKW": 22,
            "CurrentTypeID": 10
        }
    ],
    "GeneralComments": "Recharge par badge et avec une application smartphone",
    "StatusTypeID": 50,
    "DateLastStatusUpdate": "2020-08-27T05:13:00Z",
    "DataQualityLevel": 2,
    "DateCreated": "2020-03-15T10:54:00Z",
    "SubmissionStatusTypeID": 100
}