{
    "IsRecentlyVerified": false,
    "ID": 101175,
    "UUID": "14CC21AA-4588-4173-A137-8C3822463ECF",
    "DataProviderID": 1,
    "UsageTypeID": 0,
    "AddressInfo": {
        "ID": 101521,
        "Title": " ALDI Bagnolo Mella",
        "AddressLine1": "Via Lombardia, 1",
        "Town": "Bagnolo Mella",
        "StateOrProvince": "BS",
        "Postcode": "25021",
        "CountryID": 112,
        "Latitude": 45.42766133426043,
        "Longitude": 10.187490814996181,
        "RelatedURL": "https://www.aldi.it/",
        "DistanceUnit": 0
    },
    "Connections": [
        {
            "ID": 142828,
            "ConnectionTypeID": 25,
            "StatusTypeID": 50,
            "LevelID": 2,
            "Quantity": 2
        }
    ],
    "NumberOfPoints": 2,
    "StatusTypeID": 50,
    "DateLastStatusUpdate": "2018-03-19T13:43:00Z",
    "DataQualityLevel": 1,
    "DateCreated": "2018-03-19T13:43:00Z",
    "SubmissionStatusTypeID": 200
}