{
    "IsRecentlyVerified": false,
    "ID": 88383,
    "UUID": "94C29C20-3940-46DF-9796-8EF6C92095BB",
    "DataProviderID": 1,
    "OperatorID": 156,
    "UsageTypeID": 4,
    "AddressInfo": {
        "ID": 88729,
        "Title": "Autohaus Römer",
        "AddressLine1": "Hauptstraße 69",
        "Town": "Altmittweida",
        "StateOrProvince": "Mittweida",
        "Postcode": "09648",
        "CountryID": 87,
        "Latitude": 50.9662456,
        "Longitude": 12.952779599999985,
        "ContactTelephone1": "+49 3727 612308",
        "DistanceUnit": 0
    },
    "Connections": [
        {
            "ID": 125358,
            "ConnectionTypeID": 25,
            "StatusTypeID": 50,
            "LevelID": 2,
            "Amps": 32,
            "Voltage": 400,
            "PowerKW": 22,
            "CurrentTypeID": 20,
            "Quantity": 1
        }
    ],
    "NumberOfPoints": 1,
    "GeneralComments": "\r\n",
    "StatusTypeID": 50,
    "DateLastStatusUpdate": "2017-05-29T06:41:00Z",
    "DataQualityLevel": 1,
    "DateCreated": "2017-05-29T06:41:00Z",
    "SubmissionStatusTypeID": 200
}