{
    "IsRecentlyVerified": false,
    "ID": 186391,
    "UUID": "90969917-652E-4EB5-AE03-70D0BB7CF66D",
    "DataProviderID": 29,
    "DataProvidersReference": "15467",
    "AddressInfo": {
        "ID": 186750,
        "Title": "Niederdonkerstraße",
        "AddressLine1": "Niederdonkerstraße",
        "Town": "Meerbusch",
        "Postcode": "40667",
        "CountryID": 87,
        "Latitude": 51.24179,
        "Longitude": 6.68963,
        "DistanceUnit": 0
    },
    "Connections": [
        {
            "ID": 298974,
            "ConnectionTypeID": 25,
            "StatusTypeID": 50,
            "LevelID": 2,
            "PowerKW": 22,
            "CurrentTypeID": 20
        },
        {
            "ID": 298975,
            "ConnectionTypeID": 25,
            "StatusTypeID": 50,
            "LevelID": 2,
            "PowerKW": 22,
            "CurrentTypeID": 20
        }
    ],
    "StatusTypeID": 50,
    "DateLastStatusUpdate": "2021-07-12T02:46:00Z",
    "MetadataValues": [
        {
            "ID": 18632,
            "MetadataFieldID": 4,
            "ItemValue": "Data from the German chargepoint registry provided by Bundesnetzagentur.de under the CC-BY 4.0 license"
        }
    ],
    "DataQualityLevel": 3,
    "DateCreated": "2021-07-12T02:46:00Z",
    "SubmissionStatusTypeID": 100
}