{
    "IsRecentlyVerified": false,
    "ID": 110505,
    "UUID": "E6479E20-4477-4865-9D6F-521BF922A428",
    "DataProviderID": 2,
    "DataProvidersReference": "104062",
    "OperatorID": 39,
    "UsageTypeID": 1,
    "AddressInfo": {
        "ID": 110851,
        "Title": "Main Location",
        "AddressLine1": "2101 Co Rd 27",
        "Town": "Fort Lupton",
        "StateOrProvince": "CO",
        "Postcode": "80621",
        "CountryID": 2,
        "Latitude": 40.0315939,
        "Longitude": -104.8115885,
        "ContactTelephone1": "800-663-5633",
        "AccessComments": "MO: Not Specified; TU: Not Specified; WE: Not Specified; TH: Not Specified; FR: Not Specified; SA: Not Specified; SU: Not Specified",
        "RelatedURL": "http://www.semacharge.com/",
        "DistanceUnit": 0
    },
    "Connections": [
        {
            "ID": 155762,
            "ConnectionTypeID": 1,
            "LevelID": 2,
            "Amps": 16,
            "Voltage": 230,
            "PowerKW": 3,
            "CurrentTypeID": 10,
            "Quantity": 7
        }
    ],
    "DateLastStatusUpdate": "2019-04-06T05:04:00Z",
    "DataQualityLevel": 3,
    "DateCreated": "2018-10-18T23:36:00Z",
    "SubmissionStatusTypeID": 100
}