{
    "IsRecentlyVerified": false,
    "ID": 100031,
    "UUID": "9C7B5833-6585-486B-9CE4-EAE028EAA986",
    "DataProviderID": 1,
    "OperatorID": 45,
    "UsageTypeID": 1,
    "AddressInfo": {
        "ID": 100377,
        "Title": "E-Bike Station Ettringen",
        "AddressLine1": "Hauptstraße 34",
        "Town": "Ettringen",
        "StateOrProvince": "Landkreis Unterallgäu",
        "Postcode": "86833",
        "CountryID": 87,
        "Latitude": 48.1065056,
        "Longitude": 10.6582109,
        "ContactTelephone1": "+49 82 36 58 11 0",
        "ContactEmail": "Claudia.Schuster@fischach.bayern.de",
        "RelatedURL": "http://www.diestauden.eu/projekte/e-bike-ladestationen",
        "DistanceUnit": 0
    },
    "Connections": [
        {
            "ID": 141283,
            "ConnectionTypeID": 28,
            "StatusTypeID": 50,
            "LevelID": 1,
            "Amps": 16,
            "Voltage": 230,
            "PowerKW": 2.3,
            "CurrentTypeID": 10,
            "Quantity": 3
        }
    ],
    "NumberOfPoints": 3,
    "GeneralComments": "24/7 kostenlos und ohne Ladekarte nutzbare Steckdosen. Betreiber sind die Regionalentwicklung Stauden / LEW.",
    "StatusTypeID": 50,
    "DateLastStatusUpdate": "2018-02-09T07:12:00Z",
    "DataQualityLevel": 1,
    "DateCreated": "2018-02-09T07:10:00Z",
    "SubmissionStatusTypeID": 200
}