{
    "IsRecentlyVerified": false,
    "ID": 183599,
    "UUID": "772D55E8-5E60-4CE9-8BA1-0D3CF725D08E",
    "DataProviderID": 29,
    "DataProvidersReference": "5433",
    "OperatorID": 220,
    "AddressInfo": {
        "ID": 183958,
        "Title": "Kleine Freiheit 42",
        "AddressLine1": "Kleine Freiheit 42",
        "Town": "Hamburg",
        "Postcode": "22767",
        "CountryID": 87,
        "Latitude": 53.55182,
        "Longitude": 9.95625,
        "DistanceUnit": 0
    },
    "Connections": [
        {
            "ID": 290777,
            "ConnectionTypeID": 33,
            "StatusTypeID": 50,
            "LevelID": 3,
            "PowerKW": 50,
            "CurrentTypeID": 30
        },
        {
            "ID": 290778,
            "ConnectionTypeID": 2,
            "StatusTypeID": 50,
            "LevelID": 3,
            "PowerKW": 50,
            "CurrentTypeID": 30
        },
        {
            "ID": 301568,
            "ConnectionTypeID": 25,
            "StatusTypeID": 50,
            "LevelID": 2,
            "PowerKW": 11,
            "CurrentTypeID": 20
        }
    ],
    "StatusTypeID": 50,
    "DateLastStatusUpdate": "2021-07-12T02:51:00Z",
    "MetadataValues": [
        {
            "ID": 15892,
            "MetadataFieldID": 4,
            "ItemValue": "Data from the German chargepoint registry provided by Bundesnetzagentur.de under the CC-BY 4.0 license"
        }
    ],
    "DataQualityLevel": 3,
    "DateCreated": "2021-07-08T10:04:00Z",
    "SubmissionStatusTypeID": 100
}