{
    "IsRecentlyVerified": false,
    "ID": 144231,
    "UUID": "8D37670E-D353-40F4-98DF-58245C778725",
    "DataProviderID": 2,
    "DataProvidersReference": "130359",
    "OperatorID": 90,
    "UsageTypeID": 1,
    "AddressInfo": {
        "ID": 144583,
        "Title": "Pointe-Claire - Centre Aquatique/Aréna Bob Birnie",
        "AddressLine1": "58 Av. Maywood",
        "Town": "Pointe-Claire",
        "StateOrProvince": "QC",
        "Postcode": "H9R 0A7",
        "CountryID": 44,
        "Latitude": 45.451899,
        "Longitude": -73.813738,
        "ContactTelephone1": "877-505-2674",
        "AccessComments": "24 hours daily",
        "RelatedURL": "https://lecircuitelectrique.com/",
        "DistanceUnit": 0
    },
    "Connections": [
        {
            "ID": 200720,
            "ConnectionTypeID": 1,
            "LevelID": 2,
            "Amps": 16,
            "Voltage": 230,
            "PowerKW": 3.7,
            "CurrentTypeID": 10,
            "Quantity": 2
        }
    ],
    "StatusTypeID": 50,
    "DateLastStatusUpdate": "2020-06-26T03:09:00Z",
    "DataQualityLevel": 3,
    "DateCreated": "2019-12-24T09:23:00Z",
    "SubmissionStatusTypeID": 100
}