{
    "IsRecentlyVerified": false,
    "ID": 180724,
    "UUID": "FE07FCF9-C233-4206-BD96-7A6C50B25CA2",
    "DataProviderID": 29,
    "DataProvidersReference": "16943",
    "OperatorID": 45,
    "AddressInfo": {
        "ID": 181083,
        "Title": "Henricistr. 68",
        "AddressLine1": "Henricistr. 68",
        "Town": "Aachen",
        "Postcode": "52072",
        "CountryID": 87,
        "Latitude": 50.78804,
        "Longitude": 6.06803,
        "DistanceUnit": 0
    },
    "Connections": [
        {
            "ID": 284158,
            "ConnectionTypeID": 25,
            "StatusTypeID": 50,
            "LevelID": 2,
            "PowerKW": 22,
            "CurrentTypeID": 20
        },
        {
            "ID": 284159,
            "ConnectionTypeID": 1036,
            "StatusTypeID": 50,
            "LevelID": 2,
            "PowerKW": 22,
            "CurrentTypeID": 20
        },
        {
            "ID": 298183,
            "ConnectionTypeID": 25,
            "StatusTypeID": 50,
            "LevelID": 2,
            "PowerKW": 22,
            "CurrentTypeID": 20
        },
        {
            "ID": 298184,
            "ConnectionTypeID": 1036,
            "StatusTypeID": 50,
            "LevelID": 2,
            "PowerKW": 22,
            "CurrentTypeID": 20
        }
    ],
    "StatusTypeID": 50,
    "DateLastStatusUpdate": "2021-07-12T02:45:00Z",
    "MetadataValues": [
        {
            "ID": 13018,
            "MetadataFieldID": 4,
            "ItemValue": "Data from the German chargepoint registry provided by Bundesnetzagentur.de under the CC-BY 4.0 license"
        }
    ],
    "DataQualityLevel": 3,
    "DateCreated": "2021-07-08T10:00:00Z",
    "SubmissionStatusTypeID": 100
}