{
    "IsRecentlyVerified": false,
    "ID": 184153,
    "UUID": "F432805E-D523-4B1E-A87E-7077A6DD3DE1",
    "DataProviderID": 29,
    "DataProvidersReference": "15260",
    "OperatorID": 45,
    "AddressInfo": {
        "ID": 184512,
        "Title": "Heimsheimer Straße 34",
        "AddressLine1": "Heimsheimer Straße 34",
        "Town": "Stuttgart",
        "Postcode": "70499",
        "CountryID": 87,
        "Latitude": 48.82127,
        "Longitude": 9.09874,
        "DistanceUnit": 0
    },
    "Connections": [
        {
            "ID": 292029,
            "ConnectionTypeID": 25,
            "StatusTypeID": 50,
            "LevelID": 3,
            "PowerKW": 20,
            "CurrentTypeID": 30
        },
        {
            "ID": 292030,
            "ConnectionTypeID": 33,
            "StatusTypeID": 50,
            "LevelID": 3,
            "PowerKW": 20,
            "CurrentTypeID": 30
        },
        {
            "ID": 296251,
            "ConnectionTypeID": 2,
            "StatusTypeID": 50,
            "LevelID": 3,
            "PowerKW": 20,
            "CurrentTypeID": 30
        }
    ],
    "StatusTypeID": 50,
    "DateLastStatusUpdate": "2021-07-12T02:42:00Z",
    "MetadataValues": [
        {
            "ID": 16445,
            "MetadataFieldID": 4,
            "ItemValue": "Data from the German chargepoint registry provided by Bundesnetzagentur.de under the CC-BY 4.0 license"
        }
    ],
    "DataQualityLevel": 3,
    "DateCreated": "2021-07-08T10:05:00Z",
    "SubmissionStatusTypeID": 100
}