{
    "IsRecentlyVerified": false,
    "ID": 113243,
    "UUID": "379C6E26-FD0E-44C5-94FA-6CAD9D94A703",
    "DataProviderID": 2,
    "DataProvidersReference": "104545",
    "OperatorID": 9,
    "UsageTypeID": 1,
    "AddressInfo": {
        "ID": 113589,
        "Title": "The Hanger - Kenmore",
        "AddressLine1": "6704 NE 181st Street",
        "Town": "Kenmore",
        "StateOrProvince": "WA",
        "Postcode": "98028",
        "CountryID": 2,
        "Latitude": 47.759665,
        "Longitude": -122.250898,
        "ContactTelephone1": "888-998-2546",
        "AccessComments": "MON: 24 hours | TUE: 24 hours | WED: 24 hours | THU: 24 hours | FRI: 24 hours | SAT: 24 hours | SUN: 24 hours",
        "RelatedURL": "http://www.blinkcharging.com/",
        "DistanceUnit": 0
    },
    "Connections": [
        {
            "ID": 159434,
            "ConnectionTypeID": 1,
            "LevelID": 2,
            "Amps": 16,
            "Voltage": 230,
            "PowerKW": 3,
            "CurrentTypeID": 10,
            "Quantity": 1
        }
    ],
    "DateLastStatusUpdate": "2019-04-06T05:07:00Z",
    "DataQualityLevel": 3,
    "DateCreated": "2018-11-28T02:04:00Z",
    "SubmissionStatusTypeID": 100
}