{
    "IsRecentlyVerified": false,
    "ID": 160909,
    "UUID": "DCE38A74-8B2E-453B-AB09-92146ABFC316",
    "DataProviderID": 1,
    "OperatorID": 23,
    "OperatorsReference": "53857",
    "UsageTypeID": 4,
    "AddressInfo": {
        "ID": 161266,
        "Title": "Quinta Do Quetzal",
        "AddressLine1": "Estrada das Sesmarias",
        "Town": "Vila de Frades",
        "Postcode": "7960-909 ",
        "CountryID": 180,
        "Latitude": 38.22432275,
        "Longitude": 7.8268521,
        "ContactTelephone1": "00351 284 441 618",
        "DistanceUnit": 0
    },
    "Connections": [
        {
            "ID": 231592,
            "ConnectionTypeID": 30,
            "StatusTypeID": 50,
            "LevelID": 2,
            "PowerKW": 22,
            "CurrentTypeID": 20,
            "Quantity": 2
        }
    ],
    "NumberOfPoints": 2,
    "GeneralComments": "Charging2 Tesla Connector, up to 22kW.Available for customers. Please see front desk.",
    "StatusTypeID": 50,
    "DateLastStatusUpdate": "2020-07-02T09:58:00Z",
    "DataQualityLevel": 1,
    "DateCreated": "2020-07-02T09:58:00Z",
    "SubmissionStatusTypeID": 200
}