{
    "IsRecentlyVerified": false,
    "ID": 30730,
    "UUID": "2DA0924D-276A-4D8B-B99B-8C1DC4918F3B",
    "DataProviderID": 1,
    "DataProvidersReference": "1571",
    "AddressInfo": {
        "ID": 31076,
        "Title": "Sandefjordgata, Oslo",
        "AddressLine1": "Sandefjordgata 1",
        "Town": "OSLO",
        "StateOrProvince": "Oslo",
        "Postcode": "0464",
        "CountryID": 168,
        "Latitude": 59.93875,
        "Longitude": 10.75056,
        "AccessComments": "",
        "DistanceUnit": 0
    },
    "Connections": [
        {
            "ID": 33959,
            "ConnectionTypeID": 0,
            "Reference": "1",
            "LevelID": 2,
            "Amps": 16,
            "Voltage": 230,
            "PowerKW": 3.7,
            "Comments": "Mode 1"
        },
        {
            "ID": 86213,
            "ConnectionTypeID": 0,
            "Reference": "2",
            "LevelID": 2,
            "Amps": 16,
            "Voltage": 230,
            "PowerKW": 3.7,
            "Comments": "Mode 1"
        },
        {
            "ID": 86214,
            "ConnectionTypeID": 0,
            "Reference": "3",
            "LevelID": 2,
            "Amps": 16,
            "Voltage": 230,
            "PowerKW": 3.7,
            "Comments": "Mode 1"
        },
        {
            "ID": 88765,
            "ConnectionTypeID": 0,
            "Reference": "4",
            "LevelID": 2,
            "Amps": 16,
            "Voltage": 230,
            "PowerKW": 3.7,
            "Comments": "Mode 1"
        }
    ],
    "NumberOfPoints": 4,
    "DateLastStatusUpdate": "2020-05-26T08:23:00Z",
    "DataQualityLevel": 2,
    "DateCreated": "2014-12-09T09:00:00Z",
    "SubmissionStatusTypeID": 100
}