{
    "IsRecentlyVerified": false,
    "ID": 48285,
    "UUID": "6CBDB86B-1170-45E9-8E08-0ECAB29A1970",
    "DataProviderID": 2,
    "DataProvidersReference": "63714",
    "UsageTypeID": 7,
    "AddressInfo": {
        "ID": 48631,
        "Title": "Avis Ford",
        "AddressLine1": "29200 Telegraph Rd",
        "Town": "Southfield",
        "StateOrProvince": "MI",
        "Postcode": "48034",
        "CountryID": 2,
        "Latitude": 42.502907,
        "Longitude": -83.28388,
        "ContactTelephone1": "248-355-7500",
        "AccessComments": "Dealership business hours\r\nPublic - Call ahead",
        "RelatedURL": "",
        "DistanceUnit": 0
    },
    "Connections": [
        {
            "ID": 59706,
            "ConnectionTypeID": 1,
            "LevelID": 2,
            "Amps": 16,
            "Voltage": 230,
            "PowerKW": 3.7,
            "CurrentTypeID": 10,
            "Quantity": 1
        }
    ],
    "DateLastStatusUpdate": "2020-06-26T03:06:00Z",
    "DataQualityLevel": 3,
    "DateCreated": "2015-06-24T11:44:00Z",
    "SubmissionStatusTypeID": 100
}