{
    "IsRecentlyVerified": false,
    "ID": 142713,
    "UUID": "DF36B7E7-2559-4D8C-B773-DA268610732B",
    "DataProviderID": 2,
    "DataProvidersReference": "98854",
    "OperatorID": 5,
    "UsageTypeID": 1,
    "AddressInfo": {
        "ID": 143065,
        "Title": "NATIONAL GRID",
        "AddressLine1": "85 Fort Adams Dr",
        "Town": "Newport",
        "StateOrProvince": "RI",
        "Postcode": "02840",
        "CountryID": 2,
        "Latitude": 41.4776771,
        "Longitude": -71.3359163,
        "ContactTelephone1": "888-758-4389",
        "AccessComments": "24 hours daily",
        "RelatedURL": "http://www.chargepoint.com/",
        "DistanceUnit": 0
    },
    "Connections": [
        {
            "ID": 198914,
            "ConnectionTypeID": 1,
            "LevelID": 2,
            "Amps": 16,
            "Voltage": 230,
            "PowerKW": 3.7,
            "CurrentTypeID": 10,
            "Quantity": 2
        }
    ],
    "StatusTypeID": 50,
    "DateLastStatusUpdate": "2020-06-26T03:04:00Z",
    "DataQualityLevel": 3,
    "DateCreated": "2019-12-24T09:18:00Z",
    "SubmissionStatusTypeID": 100
}