{
    "IsRecentlyVerified": false,
    "ID": 89962,
    "UUID": "D2A7089D-D06D-4550-8A20-92CDECED5684",
    "DataProviderID": 1,
    "OperatorID": 1,
    "UsageTypeID": 1,
    "AddressInfo": {
        "ID": 90308,
        "Title": "М-12",
        "AddressLine1": "М-12",
        "Town": "Винницкий район",
        "StateOrProvince": "Винницкий район",
        "CountryID": 234,
        "Latitude": 49.237167,
        "Longitude": 28.398123,
        "ContactTelephone1": "+390677460662",
        "ContactEmail": "manager@electro.vn.ua",
        "RelatedURL": "https://electro.vn.ua",
        "DistanceUnit": 0
    },
    "Connections": [
        {
            "ID": 127521,
            "ConnectionTypeID": 1,
            "StatusTypeID": 50,
            "LevelID": 2,
            "Amps": 32,
            "Voltage": 220,
            "PowerKW": 7,
            "CurrentTypeID": 10,
            "Quantity": 1
        },
        {
            "ID": 127522,
            "ConnectionTypeID": 17,
            "StatusTypeID": 50,
            "LevelID": 2,
            "Amps": 32,
            "Voltage": 380,
            "PowerKW": 22,
            "CurrentTypeID": 20
        },
        {
            "ID": 127523,
            "ConnectionTypeID": 13,
            "LevelID": 2,
            "Amps": 16,
            "Voltage": 220,
            "PowerKW": 3,
            "Quantity": 2
        }
    ],
    "NumberOfPoints": 1,
    "StatusTypeID": 50,
    "DateLastStatusUpdate": "2017-07-05T10:23:00Z",
    "DataQualityLevel": 1,
    "DateCreated": "2017-07-02T12:18:00Z",
    "SubmissionStatusTypeID": 200
}