{
    "IsRecentlyVerified": false,
    "ID": 75879,
    "UUID": "BDEECDBB-463A-4F42-A04C-9BF122229CD7",
    "DataProviderID": 1,
    "OperatorID": 23,
    "OperatorsReference": "23216",
    "UsageTypeID": 1,
    "UsageCost": "Free",
    "AddressInfo": {
        "ID": 76225,
        "Title": "Standard Parking - Tesla",
        "AddressLine1": "21 E 15th St",
        "Town": "Manhattan",
        "StateOrProvince": "NY",
        "Postcode": "10003",
        "CountryID": 2,
        "Latitude": 40.7363576,
        "Longitude": -73.9919602,
        "ContactTelephone1": "800-836-6666  877-798-3752",
        "AccessComments": "24 hours daily; for Tesla use only; see valet for access",
        "RelatedURL": "http://www.teslamotors.com/supercharger",
        "DistanceUnit": 0
    },
    "Connections": [
        {
            "ID": 109390,
            "ConnectionTypeID": 30,
            "StatusTypeID": 50,
            "LevelID": 2,
            "Amps": 16,
            "Voltage": 230,
            "PowerKW": 16,
            "CurrentTypeID": 10,
            "Quantity": 2
        }
    ],
    "NumberOfPoints": 2,
    "StatusTypeID": 50,
    "DateLastStatusUpdate": "2017-01-31T18:15:00Z",
    "DataQualityLevel": 3,
    "DateCreated": "2016-12-23T01:25:00Z",
    "SubmissionStatusTypeID": 100
}