{
    "IsRecentlyVerified": false,
    "ID": 5332,
    "UUID": "463F4CB2-F8C4-487A-855E-61B249D1A33B",
    "DataProviderID": 1,
    "OperatorID": 21,
    "UsageTypeID": 4,
    "UsageCost": "Mobi.E compatible card",
    "AddressInfo": {
        "ID": 5271,
        "Title": "VRL-00004",
        "AddressLine1": "Avenida da Universidade",
        "Town": "Vila Real",
        "StateOrProvince": "Vila Real",
        "Postcode": "5000-556",
        "CountryID": 180,
        "Latitude": 41.2941194116096,
        "Longitude": -7.73511707292243,
        "RelatedURL": "http://www.mobie.pt",
        "DistanceUnit": 0
    },
    "Connections": [
        {
            "ID": 33382,
            "ConnectionTypeID": 25,
            "StatusTypeID": 50,
            "LevelID": 2,
            "Amps": 32,
            "Voltage": 230,
            "PowerKW": 7.4,
            "CurrentTypeID": 10,
            "Quantity": 2
        }
    ],
    "NumberOfPoints": 2,
    "StatusTypeID": 50,
    "DateLastStatusUpdate": "2020-09-18T21:14:00Z",
    "DataQualityLevel": 1,
    "DateCreated": "2011-08-25T12:48:00Z",
    "SubmissionStatusTypeID": 100
}