{
    "IsRecentlyVerified": false,
    "ID": 137991,
    "UUID": "098F293A-FE42-4C4E-8373-0189207970B5",
    "DataProviderID": 2,
    "DataProvidersReference": "96626",
    "OperatorID": 9,
    "UsageTypeID": 1,
    "AddressInfo": {
        "ID": 138340,
        "Title": "YMCA - Frisco #61",
        "AddressLine1": "3415 Main Street",
        "Town": "Frisco",
        "StateOrProvince": "TX",
        "Postcode": "75034",
        "CountryID": 2,
        "Latitude": 33.151462,
        "Longitude": -96.860377,
        "ContactTelephone1": "888-998-2546",
        "AccessComments": "unknown",
        "RelatedURL": "http://www.blinkcharging.com/",
        "DistanceUnit": 0
    },
    "Connections": [
        {
            "ID": 193028,
            "ConnectionTypeID": 1,
            "LevelID": 2,
            "Amps": 16,
            "Voltage": 230,
            "PowerKW": 3,
            "CurrentTypeID": 10,
            "Quantity": 3
        }
    ],
    "StatusTypeID": 50,
    "DateLastStatusUpdate": "2019-12-24T09:06:00Z",
    "DataQualityLevel": 3,
    "DateCreated": "2019-12-24T09:06:00Z",
    "SubmissionStatusTypeID": 100
}