{
    "IsRecentlyVerified": false,
    "ID": 151815,
    "UUID": "CE1D5E00-AC39-4B6A-BDA5-A8A2D8D840D8",
    "DataProviderID": 28,
    "DataProvidersReference": "",
    "AddressInfo": {
        "ID": 152168,
        "Title": "Helios",
        "AddressLine1": "Helios, avenue du Lac Leman, 73370 Le Bourget-du-Lac",
        "CountryID": 80,
        "Latitude": 45.639726,
        "Longitude": 5.875138,
        "AccessComments": "PMR",
        "DistanceUnit": 0
    },
    "Connections": [
        {
            "ID": 212211,
            "ConnectionTypeID": 0,
            "StatusTypeID": 50,
            "LevelID": 2,
            "PowerKW": 48
        },
        {
            "ID": 212212,
            "ConnectionTypeID": 0,
            "StatusTypeID": 50,
            "LevelID": 2,
            "PowerKW": 48
        }
    ],
    "GeneralComments": "SCHEVC000002",
    "StatusTypeID": 50,
    "DateLastStatusUpdate": "2020-03-15T10:53:00Z",
    "DataQualityLevel": 2,
    "DateCreated": "2020-03-15T10:53:00Z",
    "SubmissionStatusTypeID": 100
}