{
    "IsRecentlyVerified": false,
    "ID": 119452,
    "UUID": "2AF3ED64-40AD-41C9-AEA2-8DF05D432298",
    "DataProviderID": 2,
    "DataProvidersReference": "85493",
    "OperatorID": 5,
    "UsageTypeID": 1,
    "AddressInfo": {
        "ID": 119798,
        "Title": "KAPOLEILOFTS",
        "AddressLine1": "761 Wakea St",
        "Town": "Kapolei",
        "StateOrProvince": "HI",
        "Postcode": "96707",
        "CountryID": 2,
        "Latitude": 21.3299915,
        "Longitude": -158.0776693,
        "ContactTelephone1": "888-758-4389",
        "AccessComments": "24 hours daily",
        "RelatedURL": "http://www.chargepoint.com/",
        "DistanceUnit": 0
    },
    "Connections": [
        {
            "ID": 168715,
            "ConnectionTypeID": 1,
            "LevelID": 2,
            "Amps": 16,
            "Voltage": 230,
            "PowerKW": 3,
            "CurrentTypeID": 10,
            "Quantity": 2
        }
    ],
    "DateLastStatusUpdate": "2019-04-01T04:59:00Z",
    "DataQualityLevel": 3,
    "DateCreated": "2019-04-01T04:59:00Z",
    "SubmissionStatusTypeID": 100
}