{
    "IsRecentlyVerified": false,
    "ID": 124105,
    "UUID": "B6082E65-D1F3-48F4-8205-CC2A82D675C4",
    "DataProviderID": 2,
    "DataProvidersReference": "79858",
    "UsageTypeID": 1,
    "AddressInfo": {
        "ID": 124451,
        "Title": "Richmond Electricians' Joint Apprenticeship and Training Center",
        "AddressLine1": "11255 Air Park Rd",
        "Town": "Ashland",
        "StateOrProvince": "VA",
        "Postcode": "23005",
        "CountryID": 2,
        "Latitude": 37.708642,
        "Longitude": -77.444334,
        "ContactTelephone1": "804-752-8266",
        "AccessComments": "24 hours daily",
        "RelatedURL": "",
        "DistanceUnit": 0
    },
    "Connections": [
        {
            "ID": 174160,
            "ConnectionTypeID": 1,
            "LevelID": 2,
            "Amps": 16,
            "Voltage": 230,
            "PowerKW": 3.7,
            "CurrentTypeID": 10,
            "Quantity": 2
        }
    ],
    "DateLastStatusUpdate": "2020-06-26T02:59:00Z",
    "DataQualityLevel": 3,
    "DateCreated": "2019-04-06T05:03:00Z",
    "SubmissionStatusTypeID": 100
}