{
    "IsRecentlyVerified": false,
    "ID": 139357,
    "UUID": "168B58A7-D279-4AE2-A50E-FDF5CD116CEB",
    "DataProviderID": 2,
    "DataProvidersReference": "150039",
    "OperatorID": 5,
    "UsageTypeID": 1,
    "AddressInfo": {
        "ID": 139709,
        "Title": "DLR",
        "AddressLine1": "320 W. Katella Ave.",
        "Town": "Anaheim",
        "StateOrProvince": "CA",
        "Postcode": "92802",
        "CountryID": 2,
        "Latitude": 33.803046,
        "Longitude": -117.909103,
        "ContactTelephone1": "888-758-4389",
        "AccessComments": "24 hours daily",
        "RelatedURL": "http://www.chargepoint.com/",
        "DistanceUnit": 0
    },
    "Connections": [
        {
            "ID": 194682,
            "ConnectionTypeID": 1,
            "LevelID": 2,
            "Amps": 16,
            "Voltage": 230,
            "PowerKW": 3,
            "CurrentTypeID": 10,
            "Quantity": 8
        }
    ],
    "StatusTypeID": 50,
    "DateLastStatusUpdate": "2019-12-24T09:10:00Z",
    "DataQualityLevel": 3,
    "DateCreated": "2019-12-24T09:10:00Z",
    "SubmissionStatusTypeID": 100
}