{
    "IsRecentlyVerified": false,
    "ID": 177388,
    "UUID": "E7690CF0-7ABE-4695-A39A-F128695313F8",
    "DataProviderID": 29,
    "DataProvidersReference": "18372",
    "AddressInfo": {
        "ID": 177747,
        "Title": "Labahnstr. 40",
        "AddressLine1": "Labahnstr. 40",
        "Town": "Heringsdorf",
        "Postcode": "17429",
        "CountryID": 87,
        "Latitude": 53.95986,
        "Longitude": 14.1573,
        "DistanceUnit": 0
    },
    "Connections": [
        {
            "ID": 276477,
            "ConnectionTypeID": 25,
            "StatusTypeID": 50,
            "LevelID": 2,
            "PowerKW": 22,
            "CurrentTypeID": 20
        },
        {
            "ID": 276478,
            "ConnectionTypeID": 33,
            "StatusTypeID": 50,
            "LevelID": 3,
            "PowerKW": 250,
            "CurrentTypeID": 30
        }
    ],
    "StatusTypeID": 0,
    "DateLastStatusUpdate": "2021-07-12T02:52:00Z",
    "MetadataValues": [
        {
            "ID": 9682,
            "MetadataFieldID": 4,
            "ItemValue": "Data from the German chargepoint registry provided by Bundesnetzagentur.de under the CC-BY 4.0 license"
        }
    ],
    "DataQualityLevel": 3,
    "DateCreated": "2021-07-08T09:49:00Z",
    "SubmissionStatusTypeID": 100
}