{
    "IsRecentlyVerified": false,
    "ID": 181476,
    "UUID": "D3E7A208-6742-4BE1-B71B-618C662895C6",
    "DataProviderID": 29,
    "DataProvidersReference": "1328,7608",
    "AddressInfo": {
        "ID": 181835,
        "Title": "Neuenhofstr. 100",
        "AddressLine1": "Neuenhofstr. 100",
        "Town": "Aachen",
        "Postcode": "52078",
        "CountryID": 87,
        "Latitude": 50.767712,
        "Longitude": 6.144996,
        "DistanceUnit": 0
    },
    "Connections": [
        {
            "ID": 285842,
            "ConnectionTypeID": 28,
            "StatusTypeID": 50,
            "LevelID": 2,
            "PowerKW": 22,
            "CurrentTypeID": 10
        },
        {
            "ID": 285843,
            "ConnectionTypeID": 28,
            "StatusTypeID": 50,
            "LevelID": 2,
            "PowerKW": 22,
            "CurrentTypeID": 10
        },
        {
            "ID": 285844,
            "ConnectionTypeID": 28,
            "StatusTypeID": 50,
            "LevelID": 2,
            "PowerKW": 22,
            "CurrentTypeID": 10
        },
        {
            "ID": 285845,
            "ConnectionTypeID": 28,
            "StatusTypeID": 50,
            "LevelID": 2,
            "PowerKW": 22,
            "CurrentTypeID": 10
        }
    ],
    "StatusTypeID": 50,
    "DateLastStatusUpdate": "2021-07-09T03:20:00Z",
    "MetadataValues": [
        {
            "ID": 13770,
            "MetadataFieldID": 4,
            "ItemValue": "Data from the German chargepoint registry provided by Bundesnetzagentur.de under the CC-BY 4.0 license"
        }
    ],
    "DataQualityLevel": 3,
    "DateCreated": "2021-07-08T10:01:00Z",
    "SubmissionStatusTypeID": 100
}