{
    "MediaItems": [
        {
            "ID": 26816,
            "ChargePointID": 171055,
            "ItemURL": "https://s3-ap-southeast-2.amazonaws.com/openchargemap/images/IT/OCM171055/OCM-171055.orig.2021030820092544.jpg",
            "ItemThumbnailURL": "https://s3-ap-southeast-2.amazonaws.com/openchargemap/images/IT/OCM171055/OCM-171055.thmb.2021030820092544.jpg",
            "Comment": "",
            "IsEnabled": true,
            "IsVideo": false,
            "IsFeaturedItem": false,
            "IsExternalResource": false,
            "User": {
                "ID": 19460,
                "Username": "Ekomobil"
            },
            "DateCreated": "2021-03-08T20:10:00Z"
        },
        {
            "ID": 26817,
            "ChargePointID": 171055,
            "ItemURL": "https://s3-ap-southeast-2.amazonaws.com/openchargemap/images/IT/OCM171055/OCM-171055.orig.2021030820095082.jpg",
            "ItemThumbnailURL": "https://s3-ap-southeast-2.amazonaws.com/openchargemap/images/IT/OCM171055/OCM-171055.thmb.2021030820095082.jpg",
            "Comment": "",
            "IsEnabled": true,
            "IsVideo": false,
            "IsFeaturedItem": false,
            "IsExternalResource": false,
            "User": {
                "ID": 19460,
                "Username": "Ekomobil"
            },
            "DateCreated": "2021-03-08T20:10:00Z"
        }
    ],
    "IsRecentlyVerified": false,
    "ID": 171055,
    "UUID": "13323DCD-ED1A-401B-936F-C37E248D8F1A",
    "DataProviderID": 1,
    "OperatorID": 3342,
    "UsageTypeID": 4,
    "AddressInfo": {
        "ID": 171414,
        "Title": "Ekomobil",
        "AddressLine1": "Via Roma 48",
        "Town": "Castellucchio",
        "StateOrProvince": "Lombardy",
        "Postcode": "46014",
        "CountryID": 112,
        "Latitude": 45.149482,
        "Longitude": 10.644071,
        "ContactTelephone1": "0372596311",
        "RelatedURL": "https://www.ekomobil.it/",
        "DistanceUnit": 0
    },
    "Connections": [
        {
            "ID": 261373,
            "ConnectionTypeID": 25,
            "StatusTypeID": 50,
            "LevelID": 2,
            "Amps": 32,
            "Voltage": 400,
            "PowerKW": 11,
            "CurrentTypeID": 20,
            "Quantity": 2
        }
    ],
    "NumberOfPoints": 1,
    "StatusTypeID": 50,
    "DateLastStatusUpdate": "2021-03-09T22:29:00Z",
    "DataQualityLevel": 1,
    "DateCreated": "2020-12-18T17:00:00Z",
    "SubmissionStatusTypeID": 200
}