{
    "MediaItems": [
        {
            "ID": 28319,
            "ChargePointID": 175940,
            "ItemURL": "https://s3-ap-southeast-2.amazonaws.com/openchargemap/images/DE/OCM175940/OCM-175940.orig.2021062616293054.jpg",
            "ItemThumbnailURL": "https://s3-ap-southeast-2.amazonaws.com/openchargemap/images/DE/OCM175940/OCM-175940.thmb.2021062616293054.jpg",
            "Comment": "",
            "IsEnabled": true,
            "IsVideo": false,
            "IsFeaturedItem": false,
            "IsExternalResource": false,
            "User": {
                "ID": 32810,
                "Username": "Tom_Fred"
            },
            "DateCreated": "2021-06-26T16:30:00Z"
        },
        {
            "ID": 28317,
            "ChargePointID": 175940,
            "ItemURL": "https://s3-ap-southeast-2.amazonaws.com/openchargemap/images/DE/OCM175940/OCM-175940.orig.2021062616273256.jpg",
            "ItemThumbnailURL": "https://s3-ap-southeast-2.amazonaws.com/openchargemap/images/DE/OCM175940/OCM-175940.thmb.2021062616273256.jpg",
            "Comment": "",
            "IsEnabled": true,
            "IsVideo": false,
            "IsFeaturedItem": false,
            "IsExternalResource": false,
            "User": {
                "ID": 32810,
                "Username": "Tom_Fred"
            },
            "DateCreated": "2021-06-26T16:28:00Z"
        }
    ],
    "IsRecentlyVerified": false,
    "ID": 175940,
    "UUID": "314EB292-0EF3-4C09-A844-AB8B49D19A87",
    "DataProviderID": 1,
    "OperatorID": 214,
    "UsageTypeID": 4,
    "AddressInfo": {
        "ID": 176299,
        "Title": "Urselweg",
        "AddressLine1": "Urselweg",
        "Town": "Berlin",
        "StateOrProvince": "Berlin",
        "Postcode": "14163",
        "CountryID": 87,
        "Latitude": 52.436773297147795,
        "Longitude": 13.232574252070435,
        "DistanceUnit": 0
    },
    "Connections": [
        {
            "ID": 273246,
            "ConnectionTypeID": 25,
            "StatusTypeID": 50,
            "LevelID": 2,
            "Amps": 16,
            "Voltage": 400,
            "PowerKW": 11,
            "CurrentTypeID": 20,
            "Quantity": 2
        }
    ],
    "NumberOfPoints": 1,
    "StatusTypeID": 50,
    "DateLastStatusUpdate": "2021-06-26T16:30:00Z",
    "DataQualityLevel": 1,
    "DateCreated": "2021-06-19T20:27:00Z",
    "SubmissionStatusTypeID": 200
}