{
    "IsRecentlyVerified": false,
    "ID": 160642,
    "UUID": "E3D83B21-745A-4AFC-A26C-FFE439B89701",
    "DataProviderID": 2,
    "DataProvidersReference": "156719",
    "UsageTypeID": 2,
    "AddressInfo": {
        "ID": 160999,
        "Title": "Hydro-Quebec",
        "AddressLine1": "579 route 198",
        "Town": "Murdochville",
        "StateOrProvince": "QC",
        "Postcode": "G0E 1W0",
        "CountryID": 44,
        "Latitude": 48.961023,
        "Longitude": -65.491998,
        "ContactTelephone1": "",
        "AccessComments": "",
        "RelatedURL": "",
        "DistanceUnit": 0
    },
    "Connections": [
        {
            "ID": 231150,
            "ConnectionTypeID": 2,
            "LevelID": 3,
            "Amps": 100,
            "Voltage": 400,
            "PowerKW": 40,
            "CurrentTypeID": 30,
            "Quantity": 1
        },
        {
            "ID": 231151,
            "ConnectionTypeID": 32,
            "LevelID": 3,
            "Amps": 100,
            "Voltage": 400,
            "PowerKW": 40,
            "CurrentTypeID": 30,
            "Quantity": 1
        }
    ],
    "GeneralComments": "Planned for future date. Not Operational.",
    "DatePlanned": "2020-09-01T00:00:00Z",
    "StatusTypeID": 150,
    "DateLastStatusUpdate": "2020-06-26T03:11:00Z",
    "DataQualityLevel": 3,
    "DateCreated": "2020-06-26T03:11:00Z",
    "SubmissionStatusTypeID": 100
}