{
    "IsRecentlyVerified": false,
    "ID": 157594,
    "UUID": "F5B54716-9DB9-4B4C-9BDF-DA8D649FFEFA",
    "DataProviderID": 1,
    "OperatorID": 1,
    "UsageTypeID": 1,
    "AddressInfo": {
        "ID": 157948,
        "Title": "Lidl - Epernay ",
        "AddressLine1": "11 Avenue du 8 Mai 1945",
        "Town": "Épernay",
        "StateOrProvince": "Grand-Est",
        "Postcode": "51200",
        "CountryID": 80,
        "Latitude": 49.02603249168078,
        "Longitude": 3.952436316403805,
        "DistanceUnit": 0
    },
    "Connections": [
        {
            "ID": 227041,
            "ConnectionTypeID": 25,
            "StatusTypeID": 50,
            "LevelID": 2,
            "Amps": 32,
            "Voltage": 400,
            "PowerKW": 22,
            "CurrentTypeID": 20,
            "Quantity": 4
        },
        {
            "ID": 227042,
            "ConnectionTypeID": 28,
            "StatusTypeID": 50,
            "LevelID": 2,
            "Amps": 13,
            "Voltage": 230,
            "PowerKW": 3,
            "CurrentTypeID": 10,
            "Quantity": 4
        }
    ],
    "NumberOfPoints": 2,
    "StatusTypeID": 50,
    "DateLastStatusUpdate": "2020-06-19T07:40:00Z",
    "DataQualityLevel": 1,
    "DateCreated": "2020-06-18T19:16:00Z",
    "SubmissionStatusTypeID": 200
}