{
    "IsRecentlyVerified": false,
    "ID": 175643,
    "UUID": "6CE5096A-DAE3-4AAF-857F-750E19BBE138",
    "DataProviderID": 1,
    "OperatorID": 3315,
    "UsageTypeID": 4,
    "UsageCost": "£0.16/kWh; minimum charge £1.00",
    "AddressInfo": {
        "ID": 176002,
        "Title": "Wallyford Community Centre",
        "AddressLine1": "Albert Place",
        "Town": "Wallyford",
        "StateOrProvince": "Scotland",
        "Postcode": "EH21 8LB",
        "CountryID": 1,
        "Latitude": 55.937539,
        "Longitude": -3.011895,
        "DistanceUnit": 0
    },
    "Connections": [
        {
            "ID": 272711,
            "ConnectionTypeID": 25,
            "Reference": "54201",
            "StatusTypeID": 50,
            "LevelID": 2,
            "Amps": 32,
            "Voltage": 400,
            "PowerKW": 7,
            "CurrentTypeID": 20,
            "Quantity": 2
        }
    ],
    "NumberOfPoints": 1,
    "StatusTypeID": 50,
    "DateLastStatusUpdate": "2021-06-03T14:16:00Z",
    "DataQualityLevel": 1,
    "DateCreated": "2021-06-03T14:16:00Z",
    "SubmissionStatusTypeID": 200
}