{
    "IsRecentlyVerified": false,
    "ID": 2663,
    "UUID": "8C24D322-9C86-48AA-9F38-588A8D33679C",
    "DataProviderID": 2,
    "DataProvidersReference": "25520",
    "UsageTypeID": 1,
    "AddressInfo": {
        "ID": 2664,
        "Title": "Pitt School Plaza",
        "AddressLine1": "1440 Ary Ln",
        "Town": "Dixon",
        "StateOrProvince": "CA",
        "Postcode": "95620",
        "CountryID": 2,
        "Latitude": 38.457369,
        "Longitude": -121.842567,
        "ContactTelephone1": "707-449-5424",
        "AccessComments": "24 hours daily",
        "RelatedURL": "",
        "DistanceUnit": 0
    },
    "Connections": [
        {
            "ID": 12389,
            "ConnectionTypeID": 9,
            "LevelID": 1,
            "Amps": 16,
            "Voltage": 120,
            "PowerKW": 1,
            "CurrentTypeID": 10,
            "Quantity": 1
        }
    ],
    "GeneralComments": "1 SP Inductive  1 Tesla Conductive",
    "DateLastConfirmed": "2011-07-31T00:00:00Z",
    "StatusTypeID": 0,
    "DateLastStatusUpdate": "2019-04-06T04:03:00Z",
    "DataQualityLevel": 1,
    "DateCreated": "2010-10-31T00:00:00Z",
    "SubmissionStatusTypeID": 100
}