{
    "IsRecentlyVerified": false,
    "ID": 108235,
    "UUID": "0D392453-CF6A-4800-8987-626CDD22B736",
    "DataProviderID": 1,
    "OperatorID": 3321,
    "UsageTypeID": 4,
    "AddressInfo": {
        "ID": 108581,
        "Title": "Pall Center - Chargy",
        "AddressLine1": "237 Route d'Arlon",
        "Town": "Strassen",
        "Postcode": "8010",
        "CountryID": 132,
        "Latitude": 49.6202915879352,
        "Longitude": 6.06888155085289,
        "ContactTelephone1": "+352 80062020",
        "AccessComments": "Behind Pall Center, on the left.",
        "RelatedURL": "https://www.chargy.lu",
        "DistanceUnit": 0
    },
    "Connections": [
        {
            "ID": 152958,
            "ConnectionTypeID": 25,
            "StatusTypeID": 50,
            "LevelID": 2,
            "Amps": 32,
            "Voltage": 400,
            "PowerKW": 22,
            "CurrentTypeID": 20,
            "Quantity": 2
        }
    ],
    "NumberOfPoints": 2,
    "GeneralComments": "Chargy network. Requires compatible ID badge. 2 EV parking spots and 2 plugs available.",
    "StatusTypeID": 50,
    "DateLastStatusUpdate": "2018-10-06T05:05:00Z",
    "DataQualityLevel": 1,
    "DateCreated": "2018-09-15T13:45:00Z",
    "SubmissionStatusTypeID": 200
}