{
    "IsRecentlyVerified": false,
    "ID": 91900,
    "UUID": "1CA89EAE-E92F-41AB-93C0-C34E02BB4014",
    "DataProviderID": 1,
    "OperatorID": 198,
    "UsageTypeID": 5,
    "UsageCost": "£0.30/kWh. Parking fees apply.",
    "AddressInfo": {
        "ID": 92246,
        "Title": "Q-Park Leeds Rockingham Street",
        "AddressLine1": "Rockingham Street",
        "AddressLine2": "Saint George's",
        "Town": "Sheffield",
        "StateOrProvince": "South Yorkshire",
        "Postcode": "S1 4NL",
        "CountryID": 1,
        "Latitude": 53.38131260058927,
        "Longitude": -1.476287327508543,
        "AccessComments": "1st Floor",
        "DistanceUnit": 0
    },
    "Connections": [
        {
            "ID": 130257,
            "ConnectionTypeID": 25,
            "StatusTypeID": 50,
            "LevelID": 2,
            "Amps": 32,
            "Voltage": 400,
            "PowerKW": 22,
            "CurrentTypeID": 20,
            "Quantity": 2
        }
    ],
    "NumberOfPoints": 2,
    "StatusTypeID": 50,
    "DateLastStatusUpdate": "2017-08-20T15:00:00Z",
    "DataQualityLevel": 1,
    "DateCreated": "2017-08-20T15:00:00Z",
    "SubmissionStatusTypeID": 200
}