{
    "IsRecentlyVerified": false,
    "ID": 184925,
    "UUID": "8A83A74F-2613-4BAF-ADE4-D3662C42E007",
    "DataProviderID": 29,
    "DataProvidersReference": "12609",
    "OperatorID": 45,
    "AddressInfo": {
        "ID": 185284,
        "Title": "Felix- Wankel- Str. 39",
        "AddressLine1": "Felix- Wankel- Str. 39",
        "Town": "Buxtehude",
        "Postcode": "21614",
        "CountryID": 87,
        "Latitude": 53.466927,
        "Longitude": 9.71623,
        "DistanceUnit": 0
    },
    "Connections": [
        {
            "ID": 293795,
            "ConnectionTypeID": 25,
            "StatusTypeID": 50,
            "LevelID": 2,
            "PowerKW": 22,
            "CurrentTypeID": 20
        },
        {
            "ID": 301354,
            "ConnectionTypeID": 33,
            "StatusTypeID": 50,
            "LevelID": 3,
            "PowerKW": 50,
            "CurrentTypeID": 30
        },
        {
            "ID": 301355,
            "ConnectionTypeID": 2,
            "StatusTypeID": 50,
            "LevelID": 3,
            "PowerKW": 50,
            "CurrentTypeID": 30
        }
    ],
    "StatusTypeID": 50,
    "DateLastStatusUpdate": "2021-07-12T02:51:00Z",
    "MetadataValues": [
        {
            "ID": 17216,
            "MetadataFieldID": 4,
            "ItemValue": "Data from the German chargepoint registry provided by Bundesnetzagentur.de under the CC-BY 4.0 license"
        }
    ],
    "DataQualityLevel": 3,
    "DateCreated": "2021-07-08T10:06:00Z",
    "SubmissionStatusTypeID": 100
}