{
    "IsRecentlyVerified": false,
    "ID": 110348,
    "UUID": "4ABBAF8B-375E-4326-8435-5A1B20333B4C",
    "DataProviderID": 2,
    "DataProvidersReference": "99915",
    "OperatorID": 5,
    "UsageTypeID": 1,
    "AddressInfo": {
        "ID": 110694,
        "Title": "STONERIDGE",
        "AddressLine1": "7901 Stoneridge Dr",
        "Town": "Pleasanton",
        "StateOrProvince": "CA",
        "Postcode": "94588",
        "CountryID": 2,
        "Latitude": 37.690081,
        "Longitude": -121.929974,
        "ContactTelephone1": "888-758-4389",
        "AccessComments": "24 hours daily",
        "RelatedURL": "http://www.chargepoint.com/",
        "DistanceUnit": 0
    },
    "Connections": [
        {
            "ID": 155593,
            "ConnectionTypeID": 1,
            "LevelID": 2,
            "Amps": 16,
            "Voltage": 230,
            "PowerKW": 3,
            "CurrentTypeID": 10,
            "Quantity": 4
        }
    ],
    "DateLastStatusUpdate": "2019-04-06T04:02:00Z",
    "DataQualityLevel": 3,
    "DateCreated": "2018-10-18T23:36:00Z",
    "SubmissionStatusTypeID": 100
}