{
    "IsRecentlyVerified": false,
    "ID": 176618,
    "UUID": "EC0A96E4-B1B2-48F4-88F2-8BD32C615322",
    "DataProviderID": 29,
    "DataProvidersReference": "5028",
    "OperatorID": 103,
    "AddressInfo": {
        "ID": 176977,
        "Title": "Kiefernwald 1",
        "AddressLine1": "Kiefernwald 1",
        "Town": "Neustrelitz",
        "Postcode": "17235",
        "CountryID": 87,
        "Latitude": 53.361166,
        "Longitude": 13.09138,
        "DistanceUnit": 0
    },
    "Connections": [
        {
            "ID": 274736,
            "ConnectionTypeID": 33,
            "StatusTypeID": 50,
            "LevelID": 3,
            "PowerKW": 50,
            "CurrentTypeID": 30
        },
        {
            "ID": 274737,
            "ConnectionTypeID": 2,
            "StatusTypeID": 50,
            "LevelID": 3,
            "PowerKW": 50,
            "CurrentTypeID": 30
        },
        {
            "ID": 301257,
            "ConnectionTypeID": 1036,
            "StatusTypeID": 50,
            "LevelID": 3,
            "PowerKW": 43,
            "CurrentTypeID": 20
        }
    ],
    "StatusTypeID": 0,
    "DateLastStatusUpdate": "2021-07-12T02:51:00Z",
    "MetadataValues": [
        {
            "ID": 8913,
            "MetadataFieldID": 4,
            "ItemValue": "Data from the German chargepoint registry provided by Bundesnetzagentur.de under the CC-BY 4.0 license"
        }
    ],
    "DataQualityLevel": 3,
    "DateCreated": "2021-07-08T09:48:00Z",
    "SubmissionStatusTypeID": 100
}