{
    "IsRecentlyVerified": false,
    "ID": 71571,
    "UUID": "3E41C81B-FA4F-4408-B364-DE4A2A6792F2",
    "DataProviderID": 2,
    "DataProvidersReference": "77196",
    "OperatorID": 5,
    "UsageTypeID": 1,
    "AddressInfo": {
        "ID": 71917,
        "Title": "900 TOWER",
        "AddressLine1": "900 Tower Dr",
        "Town": "Troy",
        "StateOrProvince": "MI",
        "Postcode": "48098",
        "CountryID": 2,
        "Latitude": 42.5969552,
        "Longitude": -83.1670938,
        "ContactTelephone1": "888-758-4389",
        "AccessComments": "24 hours daily",
        "RelatedURL": "http://www.chargepoint.com/",
        "DistanceUnit": 0
    },
    "Connections": [
        {
            "ID": 102396,
            "ConnectionTypeID": 1,
            "LevelID": 2,
            "Amps": 16,
            "Voltage": 230,
            "PowerKW": 3.7,
            "CurrentTypeID": 10,
            "Quantity": 2
        }
    ],
    "DateLastStatusUpdate": "2020-06-26T03:06:00Z",
    "DataQualityLevel": 3,
    "DateCreated": "2016-09-02T10:15:00Z",
    "SubmissionStatusTypeID": 100
}