{
    "IsRecentlyVerified": false,
    "ID": 119458,
    "UUID": "B5EEDFDA-F450-468B-8290-784686B54521",
    "DataProviderID": 2,
    "DataProvidersReference": "45927",
    "OperatorID": 107,
    "UsageTypeID": 2,
    "AddressInfo": {
        "ID": 119804,
        "Title": "Alamo Rent-A-Car - Nimitz",
        "AddressLine1": "3055 N Nimitz Hwy",
        "Town": "Honolulu",
        "StateOrProvince": "HI",
        "Postcode": "96819",
        "CountryID": 2,
        "Latitude": 21.335432,
        "Longitude": -157.908209,
        "ContactTelephone1": "",
        "AccessComments": "Alamo use only",
        "RelatedURL": "http://www.opconnect.com/",
        "DistanceUnit": 0
    },
    "Connections": [
        {
            "ID": 168721,
            "ConnectionTypeID": 1,
            "LevelID": 2,
            "Amps": 16,
            "Voltage": 230,
            "PowerKW": 3,
            "CurrentTypeID": 10,
            "Quantity": 3
        }
    ],
    "DateLastStatusUpdate": "2019-04-01T04:59:00Z",
    "DataQualityLevel": 3,
    "DateCreated": "2019-04-01T04:59:00Z",
    "SubmissionStatusTypeID": 100
}