{
    "IsRecentlyVerified": false,
    "ID": 145747,
    "UUID": "26207DEC-E2D2-42CB-BC41-8953AC0BA4B8",
    "DataProviderID": 2,
    "DataProvidersReference": "116413",
    "OperatorID": 23,
    "UsageTypeID": 1,
    "AddressInfo": {
        "ID": 146099,
        "Title": "Cypress Mountain - Tesla Destination",
        "AddressLine1": "6000 Cypress Bowl Rd",
        "Town": "West Vancouver",
        "StateOrProvince": "BC",
        "Postcode": "V7V 3N9",
        "CountryID": 44,
        "Latitude": 49.347904,
        "Longitude": -123.195861,
        "ContactTelephone1": "604-926-5612  877-798-3752",
        "AccessComments": "24 hours daily; for customer use only",
        "RelatedURL": "https://www.tesla.com/destination-charging",
        "DistanceUnit": 0
    },
    "Connections": [
        {
            "ID": 202477,
            "ConnectionTypeID": 30,
            "LevelID": 2,
            "Amps": 16,
            "Voltage": 230,
            "PowerKW": 3.7,
            "CurrentTypeID": 10,
            "Quantity": 2
        }
    ],
    "StatusTypeID": 50,
    "DateLastStatusUpdate": "2020-06-26T03:12:00Z",
    "DataQualityLevel": 3,
    "DateCreated": "2019-12-24T09:25:00Z",
    "SubmissionStatusTypeID": 100
}