{
    "IsRecentlyVerified": false,
    "ID": 16954,
    "UUID": "6C22B6AB-7CEB-4EDF-B874-6C782BDA6CB2",
    "DataProviderID": 22,
    "DataProvidersReference": "65F675B3CF48B79D1D4FE970F1688C6B",
    "AddressInfo": {
        "ID": 17299,
        "Title": "日産プリンス山形販売南陽店",
        "AddressLine1": "山形県南陽市赤湯3300-2",
        "CountryID": 114,
        "Latitude": 38.05361353,
        "Longitude": 140.1715977,
        "ContactTelephone1": "0238-40-3434",
        "DistanceUnit": 0
    },
    "Connections": [
        {
            "ID": 17195,
            "ConnectionTypeID": 2,
            "LevelID": 2,
            "Amps": 100,
            "Voltage": 480,
            "PowerKW": 48,
            "Quantity": 1
        }
    ],
    "DateLastStatusUpdate": "2013-06-29T08:51:00Z",
    "DataQualityLevel": 2,
    "DateCreated": "2013-06-29T08:51:00Z",
    "SubmissionStatusTypeID": 200
}