{
    "IsRecentlyVerified": true,
    "DateLastVerified": "2021-08-14T17:22:00Z",
    "ID": 188752,
    "UUID": "7ED8AA50-664C-4CD0-93F4-0F8783945ECC",
    "DataProviderID": 1,
    "OperatorID": 21,
    "UsageTypeID": 4,
    "UsageCost": "Mobi.E compatible card or App",
    "AddressInfo": {
        "ID": 189111,
        "Title": "VNF-00020 - Mercadona",
        "AddressLine1": "Rua António Ferreira Magalhães",
        "Town": "Vila Nova de Famalicão",
        "StateOrProvince": "Braga",
        "Postcode": "4760-855",
        "CountryID": 180,
        "Latitude": 41.40142252831777,
        "Longitude": -8.524021286412335,
        "AccessComments": "Mercadona",
        "DistanceUnit": 0
    },
    "Connections": [
        {
            "ID": 304974,
            "ConnectionTypeID": 25,
            "StatusTypeID": 50,
            "LevelID": 2,
            "Amps": 32,
            "Voltage": 400,
            "PowerKW": 22,
            "CurrentTypeID": 20,
            "Quantity": 2
        }
    ],
    "NumberOfPoints": 2,
    "StatusTypeID": 50,
    "DateLastStatusUpdate": "2021-08-14T17:22:00Z",
    "DataQualityLevel": 1,
    "DateCreated": "2021-08-14T17:22:00Z",
    "SubmissionStatusTypeID": 200
}