{
    "IsRecentlyVerified": false,
    "ID": 149373,
    "UUID": "D162CFEC-EEDD-4805-ADD2-6D984BA46B52",
    "DataProviderID": 1,
    "OperatorID": 23,
    "OperatorsReference": "53012",
    "UsageTypeID": 4,
    "UsageCost": "$0.26/kWh; other tariffs for older cars",
    "AddressInfo": {
        "ID": 149726,
        "Title": "Roseville, Ca - Galleria Boulevard Supercharger",
        "AddressLine1": "1120 Galleria Boulevard",
        "Town": "Roseville",
        "StateOrProvince": "CA",
        "Postcode": "95678",
        "CountryID": 2,
        "Latitude": 38.768299,
        "Longitude": -121.263596,
        "DistanceUnit": 0
    },
    "Connections": [
        {
            "ID": 207392,
            "ConnectionTypeID": 27,
            "StatusTypeID": 50,
            "LevelID": 3,
            "PowerKW": 120,
            "CurrentTypeID": 30,
            "Quantity": 20
        }
    ],
    "NumberOfPoints": 20,
    "GeneralComments": "Charging20 Superchargers, available 24/7, up to 150kW",
    "StatusTypeID": 50,
    "DateLastStatusUpdate": "2020-02-24T06:53:00Z",
    "DataQualityLevel": 1,
    "DateCreated": "2020-02-24T06:53:00Z",
    "SubmissionStatusTypeID": 200
}