{
    "IsRecentlyVerified": false,
    "ID": 153516,
    "UUID": "2A8D430F-C023-40C0-922C-AAD4737EF41F",
    "DataProviderID": 28,
    "DataProvidersReference": "FR*S89*P89274*A",
    "UsageTypeID": 5,
    "AddressInfo": {
        "ID": 153869,
        "Title": "NAILLY_Rue De L Eglise",
        "AddressLine1": "Rue De L Eglise 89100 NAILLY",
        "CountryID": 80,
        "Latitude": 48.22329579,
        "Longitude": 3.22550631,
        "AccessComments": "24/24 7/7 jours",
        "DistanceUnit": 0
    },
    "Connections": [
        {
            "ID": 215414,
            "ConnectionTypeID": 28,
            "StatusTypeID": 50,
            "LevelID": 2,
            "PowerKW": 22,
            "CurrentTypeID": 10
        },
        {
            "ID": 215415,
            "ConnectionTypeID": 1036,
            "StatusTypeID": 50,
            "LevelID": 2,
            "PowerKW": 22,
            "CurrentTypeID": 20
        },
        {
            "ID": 248901,
            "ConnectionTypeID": 28,
            "StatusTypeID": 50,
            "LevelID": 2,
            "PowerKW": 22,
            "CurrentTypeID": 10
        },
        {
            "ID": 248902,
            "ConnectionTypeID": 1036,
            "StatusTypeID": 50,
            "LevelID": 2,
            "PowerKW": 22,
            "CurrentTypeID": 20
        }
    ],
    "GeneralComments": "",
    "StatusTypeID": 50,
    "DateLastStatusUpdate": "2020-08-27T05:14:00Z",
    "DataQualityLevel": 2,
    "DateCreated": "2020-03-15T10:54:00Z",
    "SubmissionStatusTypeID": 100
}