{
    "IsRecentlyVerified": false,
    "ID": 121636,
    "UUID": "F204BB5B-0B18-4AAF-B254-E7DBE5EC395D",
    "DataProviderID": 2,
    "DataProvidersReference": "121109",
    "OperatorID": 39,
    "UsageTypeID": 4,
    "AddressInfo": {
        "ID": 121982,
        "Title": "Swope Parking Lot",
        "AddressLine1": "59 Millfield Street",
        "Town": "Falmouth",
        "StateOrProvince": "MA",
        "Postcode": "02543",
        "CountryID": 2,
        "Latitude": 41.527881,
        "Longitude": -70.6724173,
        "ContactTelephone1": "800-663-5633",
        "AccessComments": "MO: Not Specified; TU: Not Specified; WE: Not Specified; TH: Not Specified; FR: Not Specified; SA: Not Specified; SU: Not Specified",
        "RelatedURL": "http://www.semacharge.com/",
        "DistanceUnit": 0
    },
    "Connections": [
        {
            "ID": 171416,
            "ConnectionTypeID": 1,
            "LevelID": 2,
            "Amps": 16,
            "Voltage": 230,
            "PowerKW": 3,
            "CurrentTypeID": 10,
            "Quantity": 2
        }
    ],
    "DateLastStatusUpdate": "2019-04-06T04:01:00Z",
    "DataQualityLevel": 3,
    "DateCreated": "2019-04-06T04:01:00Z",
    "SubmissionStatusTypeID": 100
}