{
    "IsRecentlyVerified": false,
    "ID": 45713,
    "UUID": "4CEEE7D7-91BB-49EC-9159-F259270A1C6B",
    "DataProviderID": 1,
    "DataProvidersReference": "2450",
    "AddressInfo": {
        "ID": 46059,
        "Title": "Gärdhemsvägen  9",
        "AddressLine1": "Gärdhemsvägen 9",
        "Town": "TROLLHÄTTAN",
        "StateOrProvince": "VÄSTRA GÖTALAND",
        "Postcode": "46183",
        "CountryID": 216,
        "Latitude": 58.28153,
        "Longitude": 12.2926,
        "AccessComments": "Laddstationerna står på parkeringen vid kommunhuset.",
        "DistanceUnit": 0
    },
    "Connections": [
        {
            "ID": 56376,
            "ConnectionTypeID": 0,
            "Reference": "1",
            "LevelID": 2,
            "Amps": 32,
            "Voltage": 400,
            "PowerKW": 22,
            "Comments": "Mode 3"
        },
        {
            "ID": 84037,
            "ConnectionTypeID": 0,
            "Reference": "2",
            "LevelID": 2,
            "Amps": 32,
            "Voltage": 230,
            "PowerKW": 7.4,
            "Comments": "Mode 3"
        },
        {
            "ID": 84038,
            "ConnectionTypeID": 0,
            "Reference": "3",
            "LevelID": 2,
            "Amps": 16,
            "Voltage": 230,
            "PowerKW": 3.7,
            "Comments": "Mode 3"
        },
        {
            "ID": 87948,
            "ConnectionTypeID": 0,
            "Reference": "4",
            "LevelID": 2,
            "Amps": 16,
            "Voltage": 230,
            "PowerKW": 3.7,
            "Comments": "Mode 1"
        }
    ],
    "NumberOfPoints": 4,
    "DateLastStatusUpdate": "2020-05-26T08:22:00Z",
    "DataQualityLevel": 2,
    "DateCreated": "2015-05-03T00:54:00Z",
    "SubmissionStatusTypeID": 100
}