{
    "IsRecentlyVerified": false,
    "ID": 149121,
    "UUID": "504C89DE-B434-4256-A395-FB85D38D5E2A",
    "DataProviderID": 1,
    "OperatorID": 20,
    "OperatorsReference": "80908",
    "UsageTypeID": 4,
    "UsageCost": "Free",
    "AddressInfo": {
        "ID": 149474,
        "Title": "West Ealing Library, Ealing",
        "AddressLine1": "Melbourne Avneue",
        "AddressLine2": "Ealing",
        "Town": "London",
        "Postcode": "W13 9BT",
        "CountryID": 1,
        "Latitude": 51.5087,
        "Longitude": -0.32483,
        "DistanceUnit": 0
    },
    "Connections": [
        {
            "ID": 207077,
            "ConnectionTypeID": 25,
            "StatusTypeID": 50,
            "LevelID": 2,
            "Amps": 32,
            "Voltage": 230,
            "PowerKW": 7,
            "CurrentTypeID": 10,
            "Quantity": 2
        }
    ],
    "NumberOfPoints": 2,
    "StatusTypeID": 50,
    "DateLastStatusUpdate": "2020-02-18T09:32:00Z",
    "DataQualityLevel": 1,
    "DateCreated": "2020-02-18T06:15:00Z",
    "SubmissionStatusTypeID": 200
}