{
    "IsRecentlyVerified": false,
    "ID": 188114,
    "UUID": "9DDBC41A-83A6-4E4C-8F26-178C86B6397A",
    "DataProviderID": 18,
    "DataProvidersReference": "2e2130005743cc92e2d4625d6aa5b6f6",
    "OperatorID": 3298,
    "UsageTypeID": 5,
    "AddressInfo": {
        "ID": 188473,
        "Title": "Shaddon Mills/Shaddongate",
        "AddressLine1": "Shaddon Mills/Shaddongate",
        "Town": "Carlisle",
        "Postcode": "CA2 5TZ",
        "CountryID": 1,
        "Latitude": 54.892559,
        "Longitude": -2.944617,
        "AccessComments": "",
        "RelatedURL": "http://www.eocharging.com",
        "DistanceUnit": 0
    },
    "Connections": [
        {
            "ID": 303579,
            "ConnectionTypeID": 25,
            "Reference": "EG-04613",
            "StatusTypeID": 50,
            "LevelID": 2,
            "Amps": 32,
            "Voltage": 400,
            "PowerKW": 22,
            "CurrentTypeID": 20
        },
        {
            "ID": 303580,
            "ConnectionTypeID": 25,
            "Reference": "EG-04612",
            "StatusTypeID": 50,
            "LevelID": 2,
            "Amps": 32,
            "Voltage": 400,
            "PowerKW": 22,
            "CurrentTypeID": 20
        }
    ],
    "StatusTypeID": 0,
    "DateLastStatusUpdate": "2021-07-12T03:39:00Z",
    "MetadataValues": [
        {
            "ID": 20354,
            "MetadataFieldID": 4,
            "ItemValue": "Contains public sector information licensed under the Open Government Licence v2.0. http://www.nationalarchives.gov.uk/doc/open-government-licence/version/2/"
        }
    ],
    "DataQualityLevel": 3,
    "DateCreated": "2021-07-12T03:39:00Z",
    "SubmissionStatusTypeID": 100
}