{
    "IsRecentlyVerified": false,
    "ID": 118269,
    "UUID": "6FBA8757-C4FF-47E2-AFC1-2A722BAB00D6",
    "DataProviderID": 1,
    "UsageTypeID": 4,
    "UsageCost": "29p/kWh PAYG",
    "AddressInfo": {
        "ID": 118615,
        "Title": "40 Godstone Road",
        "AddressLine1": "Godstone Road",
        "Town": "London",
        "Postcode": "CR8 5JE",
        "CountryID": 1,
        "Latitude": 51.328179,
        "Longitude": -0.106276,
        "DistanceUnit": 0
    },
    "Connections": [
        {
            "ID": 167342,
            "ConnectionTypeID": 2,
            "StatusTypeID": 50,
            "LevelID": 3,
            "PowerKW": 50,
            "CurrentTypeID": 30,
            "Quantity": 1
        },
        {
            "ID": 167343,
            "ConnectionTypeID": 33,
            "StatusTypeID": 50,
            "LevelID": 3,
            "PowerKW": 50,
            "CurrentTypeID": 30,
            "Quantity": 1
        },
        {
            "ID": 167344,
            "ConnectionTypeID": 1036,
            "StatusTypeID": 50,
            "LevelID": 3,
            "PowerKW": 43,
            "CurrentTypeID": 20,
            "Quantity": 1
        }
    ],
    "NumberOfPoints": 1,
    "GeneralComments": "ESB EV Solutions",
    "StatusTypeID": 50,
    "DateLastStatusUpdate": "2019-03-20T16:42:00Z",
    "DataQualityLevel": 1,
    "DateCreated": "2019-03-20T16:42:00Z",
    "SubmissionStatusTypeID": 200
}