{
    "IsRecentlyVerified": false,
    "ID": 99597,
    "UUID": "46205078-48A0-4379-8032-B0BBBCA8854B",
    "DataProviderID": 1,
    "OperatorID": 2244,
    "UsageTypeID": 4,
    "AddressInfo": {
        "ID": 99943,
        "Title": "Ubitricity Adair Road / Appleford Road",
        "AddressLine1": "Appleford Road",
        "AddressLine2": "North Kensington",
        "Town": "London",
        "StateOrProvince": "England",
        "Postcode": "W10 5EE",
        "CountryID": 1,
        "Latitude": 51.524099,
        "Longitude": -0.207852,
        "RelatedURL": "https://www.rbkc.gov.uk/parking-transport-and-streets/parking/visitor-parking/electric-vehicles",
        "DistanceUnit": 0
    },
    "Connections": [
        {
            "ID": 140740,
            "ConnectionTypeID": 25,
            "StatusTypeID": 50,
            "LevelID": 2,
            "Amps": 16,
            "Voltage": 230,
            "PowerKW": 3.6,
            "CurrentTypeID": 10,
            "Quantity": 1
        }
    ],
    "NumberOfPoints": 1,
    "GeneralComments": "Bollard charger. Ubitricity dongle needed.",
    "StatusTypeID": 50,
    "DateLastStatusUpdate": "2018-01-31T12:53:00Z",
    "DataQualityLevel": 1,
    "DateCreated": "2018-01-31T12:53:00Z",
    "SubmissionStatusTypeID": 200
}