{
    "UserComments": [
        {
            "ID": 24456,
            "ChargePointID": 20769,
            "CommentTypeID": 10,
            "UserName": "Simon Hewison",
            "Comment": "four outlets, only, two parking bays, five vehicales requiring charge. Queueing.",
            "DateCreated": "2021-06-06T17:09:55.037Z",
            "User": {
                "ID": 4575,
                "Username": "Simon Hewison"
            },
            "CheckinStatusTypeID": 100,
            "IsActionedByEditor": false
        },
        {
            "ID": 23170,
            "ChargePointID": 20769,
            "CommentTypeID": 10,
            "UserName": "Simon Hewison",
            "Comment": "two vehicles queueing",
            "DateCreated": "2020-09-01T20:09:04.66Z",
            "User": {
                "ID": 4575,
                "Username": "Simon Hewison"
            },
            "CheckinStatusTypeID": 100,
            "IsActionedByEditor": false
        },
        {
            "ID": 23051,
            "ChargePointID": 20769,
            "CommentTypeID": 10,
            "UserName": "Simon Hewison",
            "Comment": "very busy location, two cars queueing after me",
            "DateCreated": "2020-08-09T14:24:38.913Z",
            "User": {
                "ID": 4575,
                "Username": "Simon Hewison"
            },
            "CheckinStatusTypeID": 10,
            "IsActionedByEditor": false
        },
        {
            "ID": 20742,
            "ChargePointID": 20769,
            "CommentTypeID": 10,
            "UserName": "Simon Hewison",
            "Comment": "two cars happily charging on Chademo",
            "Rating": 4,
            "DateCreated": "2019-02-23T07:57:10.24Z",
            "User": {
                "ID": 4575,
                "Username": "Simon Hewison"
            }
        },
        {
            "ID": 19245,
            "ChargePointID": 20769,
            "CommentTypeID": 10,
            "UserName": "Simon Hewison",
            "Comment": "Both charge points working fine for Chademo. Right hand (CCS/Chademo) unit on free vend.",
            "Rating": 4,
            "DateCreated": "2018-02-28T15:40:19.627Z",
            "User": {
                "ID": 4575,
                "Username": "Simon Hewison"
            },
            "CheckinStatusTypeID": 10
        },
        {
            "ID": 17315,
            "ChargePointID": 20769,
            "CommentTypeID": 10,
            "UserName": "Simon Hewison",
            "Comment": "Left hand unit failed to start chademo charge,right hand unit okay ",
            "Rating": 2,
            "DateCreated": "2017-05-22T07:46:57.263Z",
            "User": {
                "ID": 4575,
                "Username": "Simon Hewison"
            },
            "CheckinStatusTypeID": 10
        },
        {
            "ID": 14647,
            "ChargePointID": 20769,
            "CommentTypeID": 10,
            "UserName": "Simon Hewison",
            "Comment": "One unit out of service,  chademo/ac unit functional",
            "Rating": 2,
            "DateCreated": "2016-12-05T09:22:04.98Z",
            "User": {
                "ID": 4575,
                "Username": "Simon Hewison"
            },
            "CheckinStatusTypeID": 10
        },
        {
            "ID": 14626,
            "ChargePointID": 20769,
            "CommentTypeID": 10,
            "UserName": "Simon Hewison",
            "Comment": "Chademo charged ok",
            "DateCreated": "2016-12-01T09:01:54.643Z",
            "User": {
                "ID": 4575,
                "Username": "Simon Hewison"
            },
            "CheckinStatusTypeID": 0
        },
        {
            "ID": 14537,
            "ChargePointID": 20769,
            "CommentTypeID": 10,
            "UserName": "Simon Hewison",
            "Comment": "Chademo charged ok",
            "Rating": 4,
            "DateCreated": "2016-11-14T18:14:58.807Z",
            "User": {
                "ID": 4575,
                "Username": "Simon Hewison"
            },
            "CheckinStatusTypeID": 10
        },
        {
            "ID": 14096,
            "ChargePointID": 20769,
            "CommentTypeID": 1000,
            "UserName": "Torsten",
            "Comment": "CCS is still not compatible with the VW eGolf as flagged many times to the operator. ",
            "Rating": 3,
            "DateCreated": "2016-08-18T12:55:30.353Z",
            "User": {
                "ID": 4992,
                "Username": "Torsten"
            },
            "CheckinStatusTypeID": 30
        },
        {
            "ID": 10022,
            "ChargePointID": 20769,
            "CommentTypeID": 10,
            "UserName": "Simon Hewison",
            "Comment": "Chademo charged fine. Another vehicle was happily using the CCS on the other unit.",
            "Rating": 5,
            "DateCreated": "2016-03-28T14:12:02.61Z",
            "User": {
                "ID": 4575,
                "Username": "Simon Hewison"
            },
            "CheckinStatusTypeID": 10
        },
        {
            "ID": 9671,
            "ChargePointID": 20769,
            "CommentTypeID": 10,
            "UserName": "jetjetjet",
            "Comment": "Charged CCS for the second time today. Can't see me first visit comment but the charge works fine",
            "Rating": 5,
            "DateCreated": "2016-02-08T17:50:30.17Z",
            "User": {
                "ID": 4495,
                "Username": "jetjetjet"
            },
            "CheckinStatusTypeID": 10
        },
        {
            "ID": 9664,
            "ChargePointID": 20769,
            "CommentTypeID": 10,
            "UserName": "jetjetjet",
            "Comment": "Charged CSS fine",
            "Rating": 5,
            "DateCreated": "2016-02-08T12:00:21.727Z",
            "User": {
                "ID": 4495,
                "Username": "jetjetjet"
            },
            "CheckinStatusTypeID": 10
        },
        {
            "ID": 8336,
            "ChargePointID": 20769,
            "CommentTypeID": 1000,
            "UserName": "Kev",
            "Comment": "Neither unit responsive to 2 ecoctricity cards tried",
            "Rating": 1,
            "DateCreated": "2015-12-27T19:23:13.467Z",
            "User": {
                "ID": 6756,
                "Username": "Kev"
            },
            "CheckinStatusTypeID": 25
        },
        {
            "ID": 8324,
            "ChargePointID": 20769,
            "CommentTypeID": 50,
            "UserName": "rovinreed",
            "Comment": "Both rapid charge machines out of action.\n Left hand unit in error waiting for card to finish charging session (was working yesterday). \nRight hand unit card reader not working (engineer booked to fix confirmed by Ecotricity yesterday). ",
            "DateCreated": "2015-12-26T16:30:13.937Z",
            "User": {
                "ID": 4555,
                "Username": "rovinreed"
            },
            "CheckinStatusTypeID": 20
        },
        {
            "ID": 7999,
            "ChargePointID": 20769,
            "CommentTypeID": 50,
            "UserName": "sjdunphy",
            "Comment": "Right hand charging unit not working - ChaDeMo plug appears not to lock into place. Left hand unit with Nissan markings is fine.",
            "Rating": 3,
            "DateCreated": "2015-11-15T17:32:19.017Z",
            "User": {
                "ID": 6501,
                "Username": "sjdunphy"
            },
            "CheckinStatusTypeID": 10
        },
        {
            "ID": 6529,
            "ChargePointID": 20769,
            "CommentTypeID": 10,
            "UserName": "Simon Hewison",
            "Comment": "CHAdeMO charged fine.  Right hand unit.  Ecotricity card. ",
            "DateCreated": "2015-09-21T10:22:44.623Z",
            "User": {
                "ID": 4575,
                "Username": "Simon Hewison"
            },
            "CheckinStatusTypeID": 10
        },
        {
            "ID": 6353,
            "ChargePointID": 20769,
            "CommentTypeID": 10,
            "UserName": "James Alexander",
            "Comment": "",
            "Rating": 4,
            "DateCreated": "2015-08-30T13:19:57.523Z",
            "User": {
                "ID": 6294,
                "Username": "James Alexander"
            },
            "CheckinStatusTypeID": 10
        },
        {
            "ID": 6256,
            "ChargePointID": 20769,
            "CommentTypeID": 10,
            "UserName": "Simon Hewison",
            "Comment": "Ecotricity map has now changed to flag the CCS unit is now working.",
            "DateCreated": "2015-08-20T16:45:17.94Z",
            "User": {
                "ID": 4575,
                "Username": "Simon Hewison"
            },
            "CheckinStatusTypeID": 0
        },
        {
            "ID": 6220,
            "ChargePointID": 20769,
            "CommentTypeID": 10,
            "UserName": "Simon Hewison",
            "Comment": "CCS/Chademo unit stuck user interface after ccs charge. Charged with Chademo with the other unit. CYC card",
            "Rating": 2,
            "DateCreated": "2015-08-18T23:25:15.533Z",
            "User": {
                "ID": 4575,
                "Username": "Simon Hewison"
            },
            "CheckinStatusTypeID": 10
        },
        {
            "ID": 4784,
            "ChargePointID": 20769,
            "CommentTypeID": 1000,
            "UserName": "Torsten",
            "Comment": "CCS not working",
            "Rating": 2,
            "DateCreated": "2015-06-27T08:41:07.993Z",
            "User": {
                "ID": 4992,
                "Username": "Torsten"
            },
            "CheckinStatusTypeID": 20
        },
        {
            "ID": 4701,
            "ChargePointID": 20769,
            "CommentTypeID": 10,
            "UserName": "Simon Hewison",
            "Comment": "Left hand Chademo still not working Connector error. Had to queue for right hand Chademo.",
            "DateCreated": "2015-06-16T08:28:21.797Z",
            "User": {
                "ID": 4575,
                "Username": "Simon Hewison"
            },
            "CheckinStatusTypeID": 10
        },
        {
            "ID": 4595,
            "ChargePointID": 20769,
            "CommentTypeID": 50,
            "UserName": "rovinreed",
            "Comment": "Left hand CHademo not working. Right hand side worked fine. ",
            "Rating": 3,
            "DateCreated": "2015-05-31T11:39:36.31Z",
            "User": {
                "ID": 4555,
                "Username": "rovinreed"
            },
            "CheckinStatusTypeID": 22
        },
        {
            "ID": 4386,
            "ChargePointID": 20769,
            "CommentTypeID": 10,
            "UserName": "Simon Hewison",
            "Comment": "Chademo worked well on right hand unit",
            "DateCreated": "2015-05-06T08:20:24.147Z",
            "User": {
                "ID": 4575,
                "Username": "Simon Hewison"
            },
            "CheckinStatusTypeID": 10
        },
        {
            "ID": 4362,
            "ChargePointID": 20769,
            "CommentTypeID": 10,
            "UserName": "chrisnsteffie",
            "Comment": "Chademo working well!",
            "DateCreated": "2015-05-04T15:51:18.973Z",
            "User": {
                "ID": 4593,
                "Username": "chrisnsteffie"
            },
            "CheckinStatusTypeID": 10
        },
        {
            "ID": 3992,
            "ChargePointID": 20769,
            "CommentTypeID": 10,
            "UserName": "jetjetjet",
            "Comment": "CCS charged successfully Saturday 14/03/15 evening at 6pm. BMW i3",
            "Rating": 5,
            "DateCreated": "2015-03-14T18:10:18.813Z",
            "User": {
                "ID": 4495,
                "Username": "jetjetjet"
            },
            "CheckinStatusTypeID": 10
        },
        {
            "ID": 3955,
            "ChargePointID": 20769,
            "CommentTypeID": 1000,
            "UserName": "rovinreed",
            "Comment": "Both DC quick charging units not working on Saturday",
            "DateCreated": "2015-03-08T17:03:14.777Z",
            "User": {
                "ID": 4555,
                "Username": "rovinreed"
            },
            "CheckinStatusTypeID": 22
        },
        {
            "ID": 3914,
            "ChargePointID": 20769,
            "CommentTypeID": 10,
            "UserName": "GonvilleB",
            "Comment": "CCS post not powered on. AC/DC post on. ",
            "Rating": 2,
            "DateCreated": "2015-03-03T17:22:22.68Z",
            "User": {
                "ID": 1815,
                "Username": "GonvilleB"
            },
            "CheckinStatusTypeID": 140
        },
        {
            "ID": 3701,
            "ChargePointID": 20769,
            "CommentTypeID": 10,
            "UserName": "SnaxMuppet",
            "Comment": "Charge is back online",
            "DateCreated": "2015-02-06T09:32:44.53Z",
            "User": {
                "ID": 1009,
                "Username": "SnaxMuppet"
            },
            "CheckinStatusTypeID": 0
        },
        {
            "ID": 3544,
            "ChargePointID": 20769,
            "CommentTypeID": 1000,
            "UserName": "jetjetjet",
            "Comment": "Charger is offline",
            "DateCreated": "2015-01-08T23:48:20.237Z",
            "User": {
                "ID": 4495,
                "Username": "jetjetjet"
            },
            "CheckinStatusTypeID": 200
        },
        {
            "ID": 879,
            "ChargePointID": 20769,
            "CommentTypeID": 10,
            "UserName": "the_davew",
            "Comment": "01-Jun-2014: Renault Zoe\nNissan Leaf had just hooked up when I arrived, so chatted with owner and waited 15 mins.\n48% charge in 17 mins - no problem.\nWhile charging, two Nissan Leafs arrived and had to wait.  It feels like autumn with all these leafs around.",
            "Rating": 5,
            "DateCreated": "2014-06-06T15:31:27.423Z",
            "User": {
                "ID": 1829,
                "Username": "the_davew"
            },
            "CheckinStatusTypeID": 10
        },
        {
            "ID": 878,
            "ChargePointID": 20769,
            "CommentTypeID": 10,
            "UserName": "the_davew",
            "Comment": "30-May-2014: Renault Zoe\n50% charge in 28 mins - no problems\n",
            "Rating": 5,
            "DateCreated": "2014-06-06T15:30:00.22Z",
            "User": {
                "ID": 1829,
                "Username": "the_davew"
            },
            "CheckinStatusTypeID": 10
        }
    ],
    "IsRecentlyVerified": false,
    "ID": 20769,
    "UUID": "D3FD65C8-8D1E-44EA-AA4C-A40B868B4F35",
    "DataProviderID": 1,
    "OperatorID": 24,
    "OperatorsReference": "0046,0048",
    "UsageTypeID": 5,
    "UsageCost": "£0.30/kWh",
    "AddressInfo": {
        "ID": 21114,
        "Title": "Chieveley Moto M4 Services",
        "AddressLine1": "Oxford Road",
        "Town": "Chieveley",
        "StateOrProvince": "Berkshire",
        "Postcode": "RG18 9XX",
        "CountryID": 1,
        "Latitude": 51.448912,
        "Longitude": -1.310287,
        "AccessComments": "In main car park",
        "DistanceUnit": 0
    },
    "Connections": [
        {
            "ID": 22571,
            "ConnectionTypeID": 2,
            "Reference": "GB*GFX*EGS10046*2",
            "StatusTypeID": 50,
            "LevelID": 3,
            "Amps": 200,
            "Voltage": 500,
            "PowerKW": 60,
            "CurrentTypeID": 30,
            "Quantity": 1
        },
        {
            "ID": 22572,
            "ConnectionTypeID": 33,
            "Reference": "GB*GFX*EGS10046*1",
            "StatusTypeID": 50,
            "LevelID": 3,
            "Amps": 200,
            "Voltage": 920,
            "PowerKW": 60,
            "CurrentTypeID": 30,
            "Quantity": 1
        },
        {
            "ID": 272472,
            "ConnectionTypeID": 33,
            "Reference": "GB*GFX*EGS10048*1",
            "StatusTypeID": 50,
            "LevelID": 3,
            "PowerKW": 120,
            "CurrentTypeID": 30,
            "Quantity": 1
        },
        {
            "ID": 306675,
            "ConnectionTypeID": 33,
            "Reference": "GB*GFX*EGS10048*2",
            "StatusTypeID": 50,
            "LevelID": 3,
            "Amps": 200,
            "Voltage": 920,
            "PowerKW": 60,
            "CurrentTypeID": 30,
            "Quantity": 1
        },
        {
            "ID": 306676,
            "ConnectionTypeID": 25,
            "Reference": "GB*GFX*ETACW2243920T0463*1",
            "StatusTypeID": 50,
            "LevelID": 2,
            "Amps": 32,
            "Voltage": 400,
            "PowerKW": 22,
            "CurrentTypeID": 20,
            "Quantity": 1
        }
    ],
    "NumberOfPoints": 4,
    "StatusTypeID": 50,
    "DateLastStatusUpdate": "2021-10-14T15:28:00Z",
    "DataQualityLevel": 1,
    "DateCreated": "2014-01-11T09:12:00Z",
    "SubmissionStatusTypeID": 200
}