{
    "IsRecentlyVerified": false,
    "ID": 145078,
    "UUID": "F21AC93D-D41F-46F7-957D-850004D384E8",
    "DataProviderID": 2,
    "DataProvidersReference": "150557",
    "OperatorID": 23,
    "UsageTypeID": 1,
    "AddressInfo": {
        "ID": 145430,
        "Title": "Freehand Cellars - Tesla Destination",
        "AddressLine1": "420 Windy Point Dr",
        "Town": "Wapato",
        "StateOrProvince": "WA",
        "Postcode": "98951",
        "CountryID": 2,
        "Latitude": 46.489666,
        "Longitude": -120.407303,
        "ContactTelephone1": "509-866-4664  877-798-3752",
        "AccessComments": "24 hours daily; for customer use only",
        "RelatedURL": "https://www.tesla.com/destination-charging",
        "DistanceUnit": 0
    },
    "Connections": [
        {
            "ID": 201673,
            "ConnectionTypeID": 30,
            "LevelID": 2,
            "Amps": 16,
            "Voltage": 230,
            "PowerKW": 3.7,
            "CurrentTypeID": 10,
            "Quantity": 1
        }
    ],
    "StatusTypeID": 50,
    "DateLastStatusUpdate": "2020-06-26T03:10:00Z",
    "DataQualityLevel": 3,
    "DateCreated": "2019-12-24T09:24:00Z",
    "SubmissionStatusTypeID": 100
}