{
    "IsRecentlyVerified": false,
    "ID": 53981,
    "UUID": "DC3103CC-3AE4-43EB-95AF-A661AD1D8499",
    "DataProviderID": 26,
    "DataProvidersReference": "65344",
    "OperatorID": 73,
    "OperatorsReference": "EV-Box EVB-P1348049",
    "UsageCost": "0.00 jaarabonnement",
    "AddressInfo": {
        "ID": 54327,
        "Title": "Van Echtenskanaal NZ 126",
        "AddressLine1": "Van Echtenskanaal NZ 126",
        "Town": "Emmen",
        "Postcode": "7891 AG",
        "CountryID": 159,
        "Latitude": 52.72529,
        "Longitude": 6.98448,
        "RelatedURL": "http://www.ev-box.nl",
        "DistanceUnit": 0
    },
    "Connections": [
        {
            "ID": 67494,
            "ConnectionTypeID": 25,
            "LevelID": 2,
            "PowerKW": 11,
            "CurrentTypeID": 10
        }
    ],
    "NumberOfPoints": 1,
    "StatusTypeID": 50,
    "DateLastStatusUpdate": "2016-06-04T02:55:00Z",
    "DataQualityLevel": 3,
    "DateCreated": "2015-09-20T11:50:00Z",
    "SubmissionStatusTypeID": 100
}