{
    "IsRecentlyVerified": false,
    "ID": 62321,
    "UUID": "536006C1-C06A-4C5E-BA69-7F9DF4C428E1",
    "DataProviderID": 2,
    "DataProvidersReference": "73238",
    "UsageTypeID": 2,
    "AddressInfo": {
        "ID": 62667,
        "Title": "National Grid",
        "AddressLine1": "164 Viscoloid Ave",
        "Town": "Leominster",
        "StateOrProvince": "MA",
        "Postcode": "01453",
        "CountryID": 2,
        "Latitude": 42.518874,
        "Longitude": -71.740495,
        "ContactTelephone1": "",
        "AccessComments": "Employee use only",
        "RelatedURL": "",
        "DistanceUnit": 0
    },
    "Connections": [
        {
            "ID": 79224,
            "ConnectionTypeID": 1,
            "LevelID": 2,
            "Amps": 16,
            "Voltage": 230,
            "PowerKW": 3.7,
            "CurrentTypeID": 10,
            "Quantity": 1
        }
    ],
    "DateLastStatusUpdate": "2020-06-26T03:06:00Z",
    "DataQualityLevel": 3,
    "DateCreated": "2016-03-03T11:39:00Z",
    "SubmissionStatusTypeID": 100
}