{
    "IsRecentlyVerified": false,
    "ID": 67862,
    "UUID": "8B614FC7-C58C-460F-9423-9C91ACD5632F",
    "DataProviderID": 1,
    "OperatorID": 156,
    "OperatorsReference": "NewMotion ICUEVE900062",
    "UsageTypeID": 4,
    "AddressInfo": {
        "ID": 68208,
        "Title": "Wohnmobilstellplatz",
        "AddressLine1": "Thüngfeld 2",
        "Town": "Schlüsselfeld",
        "Postcode": "96132",
        "CountryID": 87,
        "Latitude": 49.7556877477319,
        "Longitude": 10.6226011365652,
        "AccessComments": "24/7 nutzbare New Motion lolo duo Box neben dem Womo-Stellplatz.",
        "DistanceUnit": 0
    },
    "Connections": [
        {
            "ID": 94429,
            "ConnectionTypeID": 25,
            "StatusTypeID": 50,
            "LevelID": 2,
            "Amps": 16,
            "Voltage": 400,
            "PowerKW": 11,
            "CurrentTypeID": 20,
            "Quantity": 2
        }
    ],
    "NumberOfPoints": 2,
    "StatusTypeID": 50,
    "DateLastStatusUpdate": "2017-03-09T07:59:00Z",
    "DataQualityLevel": 3,
    "DateCreated": "2016-06-04T02:37:00Z",
    "SubmissionStatusTypeID": 200
}