{
    "IsRecentlyVerified": false,
    "ID": 35720,
    "UUID": "2A5EE1C5-5111-4371-8776-A47E975D4D96",
    "DataProviderID": 26,
    "DataProvidersReference": "50817",
    "OperatorID": 180,
    "OperatorsReference": "Alfen GDH1741",
    "UsageCost": "0.00 jaarabonnement",
    "AddressInfo": {
        "ID": 36066,
        "Title": "Laan van Poot 412",
        "AddressLine1": "Laan van Poot 412",
        "Town": "Den Haag",
        "Postcode": "2566 DM",
        "CountryID": 159,
        "Latitude": 52.075839,
        "Longitude": 4.241794,
        "ContactTelephone1": "036 - 549 34 00",
        "RelatedURL": "http://www.icu-charging-stations.com/",
        "DistanceUnit": 0
    },
    "Connections": [
        {
            "ID": 39231,
            "ConnectionTypeID": 25,
            "LevelID": 2,
            "PowerKW": 11,
            "CurrentTypeID": 10
        },
        {
            "ID": 48016,
            "ConnectionTypeID": 25,
            "LevelID": 2,
            "PowerKW": 11,
            "CurrentTypeID": 10
        }
    ],
    "NumberOfPoints": 1,
    "StatusTypeID": 50,
    "DateLastStatusUpdate": "2016-06-04T02:48:00Z",
    "DataQualityLevel": 3,
    "DateCreated": "2015-01-09T06:05:00Z",
    "SubmissionStatusTypeID": 100
}