{
    "IsRecentlyVerified": false,
    "ID": 35669,
    "UUID": "E9F77E7C-B379-4F28-AD5A-701E5E8F381F",
    "DataProviderID": 26,
    "DataProvidersReference": "47709",
    "OperatorID": 178,
    "OperatorsReference": "EVnetNL AL858",
    "UsageCost": "0.00 jaarabonnement",
    "AddressInfo": {
        "ID": 36015,
        "Title": "Kampioensingel 13",
        "AddressLine1": "Kampioensingel 13",
        "Town": "Den Haag",
        "Postcode": "2492 WT",
        "CountryID": 159,
        "Latitude": 52.071516,
        "Longitude": 4.404516,
        "ContactTelephone1": "0800-3522365",
        "RelatedURL": "http://www.evnet.nl",
        "DistanceUnit": 0
    },
    "Connections": [
        {
            "ID": 39180,
            "ConnectionTypeID": 25,
            "LevelID": 2,
            "PowerKW": 11,
            "CurrentTypeID": 10
        }
    ],
    "NumberOfPoints": 2,
    "StatusTypeID": 50,
    "DateLastStatusUpdate": "2016-06-04T02:46:00Z",
    "DataQualityLevel": 3,
    "DateCreated": "2015-01-09T06:05:00Z",
    "SubmissionStatusTypeID": 100
}