{
    "IsRecentlyVerified": false,
    "ID": 181236,
    "UUID": "3DA40A89-EC6C-49FC-A5B7-641F32802DAD",
    "DataProviderID": 29,
    "DataProvidersReference": "7791",
    "OperatorID": 154,
    "AddressInfo": {
        "ID": 181595,
        "Title": "Schweriner Straße 64",
        "AddressLine1": "Schweriner Straße 64",
        "Town": "Rostock",
        "Postcode": "18069",
        "CountryID": 87,
        "Latitude": 54.093314,
        "Longitude": 12.097891,
        "DistanceUnit": 0
    },
    "Connections": [
        {
            "ID": 285312,
            "ConnectionTypeID": 25,
            "StatusTypeID": 50,
            "LevelID": 2,
            "PowerKW": 22,
            "CurrentTypeID": 20
        },
        {
            "ID": 285313,
            "ConnectionTypeID": 25,
            "StatusTypeID": 50,
            "LevelID": 2,
            "PowerKW": 22,
            "CurrentTypeID": 20
        }
    ],
    "StatusTypeID": 50,
    "DateLastStatusUpdate": "2021-07-12T02:52:00Z",
    "MetadataValues": [
        {
            "ID": 13530,
            "MetadataFieldID": 4,
            "ItemValue": "Data from the German chargepoint registry provided by Bundesnetzagentur.de under the CC-BY 4.0 license"
        }
    ],
    "DataQualityLevel": 3,
    "DateCreated": "2021-07-08T10:01:00Z",
    "SubmissionStatusTypeID": 100
}