{
    "IsRecentlyVerified": false,
    "ID": 66690,
    "UUID": "1115EAFB-F0C2-4404-8216-D763C071A6CF",
    "DataProviderID": 1,
    "OperatorID": 1,
    "UsageTypeID": 6,
    "UsageCost": "",
    "AddressInfo": {
        "ID": 67036,
        "Title": "Living Tomorrow",
        "AddressLine1": "Indringingsweg 1",
        "AddressLine2": "",
        "Town": "Halle-Vilvoorde",
        "StateOrProvince": "Halle-Vilvoorde",
        "Postcode": "1800",
        "CountryID": 26,
        "Latitude": 50.90887383025753,
        "Longitude": 4.386094442852815,
        "ContactTelephone1": " +32 2 263 01 33",
        "ContactTelephone2": "",
        "ContactEmail": "",
        "AccessComments": "",
        "RelatedURL": "http://www.livingtomorrow.com/",
        "DistanceUnit": 0
    },
    "Connections": [
        {
            "ID": 92142,
            "ConnectionTypeID": 2,
            "StatusTypeID": 0
        },
        {
            "ID": 92147,
            "ConnectionTypeID": 25,
            "StatusTypeID": 0
        }
    ],
    "NumberOfPoints": 1,
    "GeneralComments": "",
    "StatusTypeID": 50,
    "DateLastStatusUpdate": "2016-05-26T12:22:00Z",
    "DataQualityLevel": 1,
    "DateCreated": "2016-05-25T21:16:00Z",
    "SubmissionStatusTypeID": 200
}