{
    "IsRecentlyVerified": false,
    "ID": 88947,
    "UUID": "81B516C0-7289-40F6-99D1-D5B21ACC9F09",
    "DataProviderID": 1,
    "OperatorID": 45,
    "UsageTypeID": 1,
    "AddressInfo": {
        "ID": 89293,
        "Title": "Sparkasse",
        "AddressLine1": "Rosenstraße 12",
        "Town": "Altensteig",
        "StateOrProvince": "Verwaltungsgemeinschaft Altensteig",
        "Postcode": "72213",
        "CountryID": 87,
        "Latitude": 48.584626267989776,
        "Longitude": 8.603414631581234,
        "ContactTelephone1": "+49 7051 1300-301",
        "AccessComments": "24/7 nutzbar, Aktivierung mit beliebiger RFID Karte. Kein reservierter Parkplatz!",
        "RelatedURL": "http://www.encw.de/e-ladesaeulen-info",
        "DistanceUnit": 0
    },
    "Connections": [
        {
            "ID": 126227,
            "ConnectionTypeID": 25,
            "StatusTypeID": 50,
            "LevelID": 2,
            "Amps": 32,
            "Voltage": 400,
            "PowerKW": 22,
            "CurrentTypeID": 20,
            "Quantity": 2
        }
    ],
    "NumberOfPoints": 2,
    "StatusTypeID": 50,
    "DateLastStatusUpdate": "2017-06-13T09:23:00Z",
    "DataQualityLevel": 1,
    "DateCreated": "2017-06-13T09:23:00Z",
    "SubmissionStatusTypeID": 200
}