{
    "IsRecentlyVerified": false,
    "ID": 140398,
    "UUID": "25131DAC-56F6-4DA9-ACE7-CB2D33748533",
    "DataProviderID": 2,
    "DataProvidersReference": "65650",
    "OperatorID": 5,
    "UsageTypeID": 1,
    "AddressInfo": {
        "ID": 140750,
        "Title": "WHOLE FOODS MKT",
        "AddressLine1": "9136 S Yale Ave",
        "Town": "Tulsa",
        "StateOrProvince": "OK",
        "Postcode": "74137",
        "CountryID": 2,
        "Latitude": 36.0308894,
        "Longitude": -95.9230903,
        "ContactTelephone1": "888-758-4389",
        "AccessComments": "24 hours daily",
        "RelatedURL": "http://www.chargepoint.com/",
        "DistanceUnit": 0
    },
    "Connections": [
        {
            "ID": 196018,
            "ConnectionTypeID": 1,
            "LevelID": 2,
            "Amps": 16,
            "Voltage": 230,
            "PowerKW": 3.7,
            "CurrentTypeID": 10,
            "Quantity": 2
        },
        {
            "ID": 196019,
            "ConnectionTypeID": 1,
            "LevelID": 2,
            "Amps": 16,
            "Voltage": 230,
            "PowerKW": 3,
            "CurrentTypeID": 10,
            "Quantity": 1
        }
    ],
    "StatusTypeID": 50,
    "DateLastStatusUpdate": "2020-06-26T02:58:00Z",
    "DataQualityLevel": 3,
    "DateCreated": "2019-12-24T09:12:00Z",
    "SubmissionStatusTypeID": 100
}