{
    "IsRecentlyVerified": false,
    "ID": 157250,
    "UUID": "35A5BF4C-3B0A-4098-AE84-369805D4820D",
    "DataProviderID": 19,
    "DataProvidersReference": "5495",
    "AddressInfo": {
        "ID": 157604,
        "Title": "Laddplats Coop",
        "AddressLine1": "Hamnplan 41",
        "Town": "PITEÅ",
        "StateOrProvince": "NORRBOTTEN",
        "Postcode": "94162",
        "CountryID": 216,
        "Latitude": 65.31681,
        "Longitude": 21.47353,
        "AccessComments": "Parkeringsdäck nedre plan till höger",
        "DistanceUnit": 0
    },
    "Connections": [
        {
            "ID": 226276,
            "ConnectionTypeID": 25,
            "Reference": "1",
            "LevelID": 3,
            "Amps": 32,
            "Voltage": 400,
            "PowerKW": 22,
            "CurrentTypeID": 30,
            "Comments": "Mode 3"
        },
        {
            "ID": 226277,
            "ConnectionTypeID": 25,
            "Reference": "2",
            "LevelID": 3,
            "Amps": 32,
            "Voltage": 400,
            "PowerKW": 22,
            "CurrentTypeID": 30,
            "Comments": "Mode 3"
        },
        {
            "ID": 226278,
            "ConnectionTypeID": 25,
            "Reference": "3",
            "LevelID": 3,
            "Amps": 32,
            "Voltage": 400,
            "PowerKW": 22,
            "CurrentTypeID": 30,
            "Comments": "Mode 3"
        },
        {
            "ID": 226279,
            "ConnectionTypeID": 25,
            "Reference": "4",
            "LevelID": 3,
            "Amps": 32,
            "Voltage": 400,
            "PowerKW": 22,
            "CurrentTypeID": 30,
            "Comments": "Mode 3"
        }
    ],
    "NumberOfPoints": 4,
    "StatusTypeID": 0,
    "DateLastStatusUpdate": "2021-03-24T05:12:00Z",
    "DataQualityLevel": 2,
    "DateCreated": "2020-05-26T08:25:00Z",
    "SubmissionStatusTypeID": 100
}