{
    "IsRecentlyVerified": false,
    "ID": 42053,
    "UUID": "4EFA776E-3F81-4D9C-B759-98C71A9B78B9",
    "DataProviderID": 26,
    "DataProvidersReference": "59752",
    "OperatorID": 157,
    "OperatorsReference": "NewMotion 02006311",
    "UsageCost": "0.00 jaarabonnement",
    "AddressInfo": {
        "ID": 42399,
        "Title": "Hovenlaan 21",
        "AddressLine1": "Hovenlaan 21",
        "Town": "Dordrecht",
        "Postcode": "3329 BB",
        "CountryID": 159,
        "Latitude": 51.7930135,
        "Longitude": 4.7284058,
        "ContactTelephone1": "088 0109500",
        "RelatedURL": "http://thenewmotion.nl/",
        "DistanceUnit": 0
    },
    "Connections": [
        {
            "ID": 50444,
            "ConnectionTypeID": 25,
            "LevelID": 2,
            "PowerKW": 3.7,
            "CurrentTypeID": 10
        }
    ],
    "NumberOfPoints": 1,
    "StatusTypeID": 50,
    "DateLastStatusUpdate": "2016-06-04T02:40:00Z",
    "DataQualityLevel": 3,
    "DateCreated": "2015-02-23T03:16:00Z",
    "SubmissionStatusTypeID": 100
}