{
    "IsRecentlyVerified": false,
    "ID": 45228,
    "UUID": "5A049087-811E-4607-B29E-3648820566D5",
    "DataProviderID": 1,
    "OperatorID": 105,
    "UsageTypeID": 1,
    "UsageCost": "0",
    "AddressInfo": {
        "ID": 45574,
        "Title": "E-Bike Station Rathaus",
        "AddressLine1": "Konrad Adenauer Platz 1",
        "Town": "Langenfeld",
        "Postcode": "40764",
        "CountryID": 87,
        "Latitude": 51.11309,
        "Longitude": 6.95140000000004,
        "RelatedURL": "http://www.rwe.com/web/cms/de/494436/e-bikes-on-tour/ladestationen/",
        "DistanceUnit": 0
    },
    "Connections": [
        {
            "ID": 55745,
            "ConnectionTypeID": 28,
            "StatusTypeID": 50,
            "LevelID": 1,
            "Amps": 10,
            "Voltage": 230,
            "PowerKW": 2.3,
            "CurrentTypeID": 10,
            "Quantity": 3
        }
    ],
    "NumberOfPoints": 3,
    "StatusTypeID": 50,
    "DateLastStatusUpdate": "2015-04-28T15:50:00Z",
    "DataQualityLevel": 1,
    "DateCreated": "2015-04-28T08:57:00Z",
    "SubmissionStatusTypeID": 200
}