{
    "IsRecentlyVerified": false,
    "ID": 87543,
    "UUID": "F373CB65-6A4B-4F59-A94A-B76D342F2FF8",
    "DataProviderID": 1,
    "UsageCost": "$2.50 per hour",
    "AddressInfo": {
        "ID": 87889,
        "Title": "Katikati Motel",
        "AddressLine1": "89 Fairview Rd",
        "Town": "Katikati ",
        "Postcode": "3129",
        "CountryID": 161,
        "Latitude": -37.5569112,
        "Longitude": 175.91780619999997,
        "ContactTelephone1": "(647) 549-0385",
        "DistanceUnit": 0
    },
    "Connections": [
        {
            "ID": 124096,
            "ConnectionTypeID": 4
        }
    ],
    "NumberOfPoints": 1,
    "GeneralComments": "9:30 am to 10:30pm\r\nWe have caravan plugins that you are more than welcome to use. If you stay overnight with us at the Katikati Motel there is no charge for plugging your car in.",
    "StatusTypeID": 50,
    "DateLastStatusUpdate": "2017-05-12T09:23:00Z",
    "DataQualityLevel": 1,
    "DateCreated": "2017-05-12T09:23:00Z",
    "SubmissionStatusTypeID": 200
}