{
    "IsRecentlyVerified": false,
    "ID": 179313,
    "UUID": "16BB4EE4-3856-40E9-82BB-1D5F0F72AA21",
    "DataProviderID": 29,
    "DataProvidersReference": "20849",
    "OperatorID": 3403,
    "AddressInfo": {
        "ID": 179672,
        "Title": "Hüttener Berge West BAB7 ",
        "AddressLine1": "Hüttener Berge West BAB7 ",
        "Town": "Alt Duvenstedt",
        "Postcode": "24791",
        "CountryID": 87,
        "Latitude": 54.36398,
        "Longitude": 9.669951,
        "DistanceUnit": 0
    },
    "Connections": [
        {
            "ID": 280972,
            "ConnectionTypeID": 1036,
            "StatusTypeID": 50,
            "LevelID": 3,
            "PowerKW": 43,
            "CurrentTypeID": 20
        },
        {
            "ID": 280973,
            "ConnectionTypeID": 33,
            "StatusTypeID": 50,
            "LevelID": 3,
            "PowerKW": 50,
            "CurrentTypeID": 30
        },
        {
            "ID": 302403,
            "ConnectionTypeID": 2,
            "StatusTypeID": 50,
            "LevelID": 3,
            "PowerKW": 50,
            "CurrentTypeID": 30
        }
    ],
    "StatusTypeID": 50,
    "DateLastStatusUpdate": "2021-07-12T02:52:00Z",
    "MetadataValues": [
        {
            "ID": 11607,
            "MetadataFieldID": 4,
            "ItemValue": "Data from the German chargepoint registry provided by Bundesnetzagentur.de under the CC-BY 4.0 license"
        }
    ],
    "DataQualityLevel": 3,
    "DateCreated": "2021-07-08T09:59:00Z",
    "SubmissionStatusTypeID": 100
}