{
    "IsRecentlyVerified": false,
    "ID": 115670,
    "UUID": "4D0EA574-3F8E-485F-8327-707BD4331ADB",
    "DataProviderID": 2,
    "DataProvidersReference": "105335",
    "OperatorID": 5,
    "UsageTypeID": 1,
    "AddressInfo": {
        "ID": 116016,
        "Title": "PW LIBRARY",
        "AddressLine1": "298 S Joe Martinez Blvd",
        "Town": "Pueblo West",
        "StateOrProvince": "CO",
        "Postcode": "81007",
        "CountryID": 2,
        "Latitude": 38.3247763,
        "Longitude": -104.7414323,
        "ContactTelephone1": "888-758-4389",
        "AccessComments": "24 hours daily",
        "RelatedURL": "http://www.chargepoint.com/",
        "DistanceUnit": 0
    },
    "Connections": [
        {
            "ID": 162699,
            "ConnectionTypeID": 1,
            "LevelID": 2,
            "Amps": 16,
            "Voltage": 230,
            "PowerKW": 3.7,
            "CurrentTypeID": 10,
            "Quantity": 1
        },
        {
            "ID": 162700,
            "ConnectionTypeID": 2,
            "LevelID": 2,
            "Amps": 100,
            "Voltage": 400,
            "PowerKW": 40,
            "CurrentTypeID": 10,
            "Quantity": 1
        },
        {
            "ID": 162701,
            "ConnectionTypeID": 32,
            "LevelID": 2,
            "Amps": 100,
            "Voltage": 400,
            "PowerKW": 40,
            "CurrentTypeID": 10,
            "Quantity": 1
        }
    ],
    "DateLastStatusUpdate": "2020-06-26T02:59:00Z",
    "DataQualityLevel": 3,
    "DateCreated": "2019-02-11T07:13:00Z",
    "SubmissionStatusTypeID": 100
}