{
    "IsRecentlyVerified": false,
    "ID": 26678,
    "UUID": "FE797D97-3F3B-4CAA-8790-DA67CBE95B79",
    "DataProviderID": 2,
    "DataProvidersReference": "53905",
    "UsageTypeID": 1,
    "AddressInfo": {
        "ID": 27024,
        "Title": "Indian Wells Resort Hotel",
        "AddressLine1": "76661 Highway 111",
        "Town": "Indian Wells",
        "StateOrProvince": "CA",
        "Postcode": "92210",
        "CountryID": 2,
        "Latitude": 33.720751,
        "Longitude": -116.327495,
        "ContactTelephone1": "800-248-3220",
        "AccessComments": "24 hours daily; guest use only",
        "RelatedURL": "",
        "DistanceUnit": 0
    },
    "Connections": [
        {
            "ID": 29202,
            "ConnectionTypeID": 1,
            "LevelID": 2,
            "Amps": 16,
            "Voltage": 230,
            "PowerKW": 3.7,
            "CurrentTypeID": 10,
            "Quantity": 1
        }
    ],
    "DateLastStatusUpdate": "2020-06-26T02:55:00Z",
    "DataQualityLevel": 3,
    "DateCreated": "2014-11-28T03:37:00Z",
    "SubmissionStatusTypeID": 100
}