{
    "IsRecentlyVerified": false,
    "ID": 176630,
    "UUID": "92C956EF-EFEA-497C-AB53-0BEB1CCCC669",
    "DataProviderID": 29,
    "DataProvidersReference": "4459",
    "OperatorID": 220,
    "AddressInfo": {
        "ID": 176989,
        "Title": "Flotowstrasse 3",
        "AddressLine1": "Flotowstrasse 3",
        "Town": "Hamburg",
        "Postcode": "22083",
        "CountryID": 87,
        "Latitude": 53.57788,
        "Longitude": 10.02753,
        "DistanceUnit": 0
    },
    "Connections": [
        {
            "ID": 274763,
            "ConnectionTypeID": 28,
            "StatusTypeID": 50,
            "LevelID": 2,
            "PowerKW": 22,
            "CurrentTypeID": 20
        },
        {
            "ID": 301812,
            "ConnectionTypeID": 25,
            "StatusTypeID": 50,
            "LevelID": 2,
            "PowerKW": 22,
            "CurrentTypeID": 20
        },
        {
            "ID": 301813,
            "ConnectionTypeID": 28,
            "StatusTypeID": 50,
            "LevelID": 2,
            "PowerKW": 22,
            "CurrentTypeID": 20
        },
        {
            "ID": 301814,
            "ConnectionTypeID": 25,
            "StatusTypeID": 50,
            "LevelID": 2,
            "PowerKW": 22,
            "CurrentTypeID": 20
        }
    ],
    "StatusTypeID": 0,
    "DateLastStatusUpdate": "2021-07-12T02:51:00Z",
    "MetadataValues": [
        {
            "ID": 8925,
            "MetadataFieldID": 4,
            "ItemValue": "Data from the German chargepoint registry provided by Bundesnetzagentur.de under the CC-BY 4.0 license"
        }
    ],
    "DataQualityLevel": 3,
    "DateCreated": "2021-07-08T09:48:00Z",
    "SubmissionStatusTypeID": 100
}