{
    "IsRecentlyVerified": false,
    "ID": 139802,
    "UUID": "D6B4E9C7-5D6F-40AF-BC33-250EF20EAC8B",
    "DataProviderID": 2,
    "DataProvidersReference": "95528",
    "OperatorID": 9,
    "UsageTypeID": 1,
    "AddressInfo": {
        "ID": 140154,
        "Title": "Kaiser Permanente - Fontana",
        "AddressLine1": "9961 Sierra Ave",
        "Town": "Fontana",
        "StateOrProvince": "CA",
        "Postcode": "92335",
        "CountryID": 2,
        "Latitude": 34.073878,
        "Longitude": -117.43098,
        "ContactTelephone1": "888-998-2546",
        "AccessComments": "MON: 24 hours | TUE: 24 hours | WED: 24 hours | THU: 24 hours | FRI: 24 hours | SAT: 24 hours | SUN: 24 hours",
        "RelatedURL": "http://www.blinkcharging.com/",
        "DistanceUnit": 0
    },
    "Connections": [
        {
            "ID": 195263,
            "ConnectionTypeID": 1,
            "LevelID": 2,
            "Amps": 16,
            "Voltage": 230,
            "PowerKW": 3.7,
            "CurrentTypeID": 10,
            "Quantity": 3
        }
    ],
    "StatusTypeID": 50,
    "DateLastStatusUpdate": "2020-06-26T02:57:00Z",
    "DataQualityLevel": 3,
    "DateCreated": "2019-12-24T09:11:00Z",
    "SubmissionStatusTypeID": 100
}