{
    "IsRecentlyVerified": false,
    "ID": 53835,
    "UUID": "05CB763C-D99C-423C-BF3D-3240F08E9B87",
    "DataProviderID": 26,
    "DataProvidersReference": "69082",
    "OperatorID": 157,
    "OperatorsReference": "NewMotion 03001698",
    "UsageCost": "0.00 jaarabonnement",
    "AddressInfo": {
        "ID": 54181,
        "Title": "Van Foreestlaan 1",
        "AddressLine1": "Van Foreestlaan 1",
        "Town": "Alphen aan den Rijn",
        "Postcode": "2404 HC",
        "CountryID": 159,
        "Latitude": 52.1358871,
        "Longitude": 4.6479859,
        "ContactTelephone1": "088 0109500",
        "RelatedURL": "http://thenewmotion.nl/",
        "DistanceUnit": 0
    },
    "Connections": [
        {
            "ID": 67217,
            "ConnectionTypeID": 25,
            "LevelID": 2,
            "PowerKW": 22,
            "CurrentTypeID": 10
        }
    ],
    "NumberOfPoints": 1,
    "StatusTypeID": 50,
    "DateLastStatusUpdate": "2016-06-04T02:50:00Z",
    "DataQualityLevel": 3,
    "DateCreated": "2015-09-20T11:50:00Z",
    "SubmissionStatusTypeID": 100
}