{
    "IsRecentlyVerified": false,
    "ID": 17867,
    "UUID": "7D6E9828-14F2-4D9B-9763-A934F36CC951",
    "DataProviderID": 22,
    "DataProvidersReference": "980017891FF67CF8A20F23AA810E7B5A",
    "AddressInfo": {
        "ID": 18212,
        "Title": "ららぽーと磐田",
        "AddressLine1": "静岡県磐田市高見丘1200",
        "CountryID": 114,
        "Latitude": 34.75040393,
        "Longitude": 137.8419905,
        "ContactTelephone1": "0538-59-0100",
        "DistanceUnit": 0
    },
    "Connections": [
        {
            "ID": 18108,
            "ConnectionTypeID": 2,
            "LevelID": 2,
            "Amps": 100,
            "Voltage": 480,
            "PowerKW": 48,
            "Quantity": 1
        }
    ],
    "DateLastStatusUpdate": "2013-06-29T09:04:00Z",
    "DataQualityLevel": 2,
    "DateCreated": "2013-06-29T09:04:00Z",
    "SubmissionStatusTypeID": 200
}