{
    "IsRecentlyVerified": false,
    "ID": 173996,
    "UUID": "28C803D9-152D-49B8-A8EC-754D64C09429",
    "DataProviderID": 1,
    "OperatorID": 3377,
    "UsageTypeID": 1,
    "UsageCost": "Free",
    "AddressInfo": {
        "ID": 174355,
        "Title": "Flix Punt de Recàrrega Públic",
        "AddressLine1": "Carrer del Mercat",
        "Town": "Flix",
        "StateOrProvince": "Catalonia",
        "Postcode": "",
        "CountryID": 210,
        "Latitude": 41.23108852005774,
        "Longitude": 0.5515340065661576,
        "RelatedURL": "http://etecnic.es",
        "DistanceUnit": 0
    },
    "Connections": [
        {
            "ID": 268229,
            "ConnectionTypeID": 25,
            "StatusTypeID": 50,
            "LevelID": 2,
            "Amps": 32,
            "Voltage": 400,
            "PowerKW": 22.2,
            "CurrentTypeID": 20,
            "Quantity": 2
        }
    ],
    "NumberOfPoints": 2,
    "StatusTypeID": 50,
    "DateLastStatusUpdate": "2021-03-09T12:22:00Z",
    "DataQualityLevel": 1,
    "DateCreated": "2021-03-09T12:22:00Z",
    "SubmissionStatusTypeID": 200
}