{
    "IsRecentlyVerified": false,
    "ID": 139763,
    "UUID": "810F2494-1436-484D-9AD6-8D6DDCF4D94A",
    "DataProviderID": 2,
    "DataProvidersReference": "119023",
    "OperatorID": 5,
    "UsageTypeID": 1,
    "AddressInfo": {
        "ID": 140115,
        "Title": "MANSFIELD",
        "AddressLine1": "5100 Wilshire Blvd",
        "Town": "Los Angeles",
        "StateOrProvince": "CA",
        "Postcode": "90036",
        "CountryID": 2,
        "Latitude": 34.061844,
        "Longitude": -118.34115,
        "ContactTelephone1": "888-758-4389",
        "AccessComments": "24 hours daily",
        "RelatedURL": "http://www.chargepoint.com/",
        "DistanceUnit": 0
    },
    "Connections": [
        {
            "ID": 195213,
            "ConnectionTypeID": 1,
            "LevelID": 2,
            "Amps": 16,
            "Voltage": 230,
            "PowerKW": 3,
            "CurrentTypeID": 10,
            "Quantity": 8
        }
    ],
    "StatusTypeID": 50,
    "DateLastStatusUpdate": "2019-12-24T09:11:00Z",
    "DataQualityLevel": 3,
    "DateCreated": "2019-12-24T09:11:00Z",
    "SubmissionStatusTypeID": 100
}