{
    "IsRecentlyVerified": false,
    "ID": 108010,
    "UUID": "EC3A8730-A382-4B96-B18B-926E1859999F",
    "DataProviderID": 1,
    "OperatorID": 45,
    "UsageTypeID": 5,
    "UsageCost": "0,25 €/kWh",
    "AddressInfo": {
        "ID": 108356,
        "Title": "Hotel Gruberhof ",
        "AddressLine1": "Oberverdins 2",
        "Town": "Schenna",
        "StateOrProvince": "BZ",
        "Postcode": "39017",
        "CountryID": 112,
        "Latitude": 46.7141964317101,
        "Longitude": 11.2088512098217,
        "ContactTelephone1": "+39 0473 949465",
        "ContactEmail": "gruberhof@schenna.com",
        "AccessComments": "Wallbe / Ecogy 14 kW für Hotelgäste mittels RFID-Autorisierung",
        "RelatedURL": "https://www.gruberhof-schenna.com",
        "DistanceUnit": 0
    },
    "Connections": [
        {
            "ID": 152554,
            "ConnectionTypeID": 1036,
            "StatusTypeID": 50,
            "LevelID": 2,
            "Amps": 15,
            "Voltage": 400,
            "PowerKW": 14,
            "CurrentTypeID": 20,
            "Quantity": 1
        }
    ],
    "NumberOfPoints": 1,
    "GeneralComments": "Eingangsbereich Chck-in / Check-out area",
    "StatusTypeID": 50,
    "DateLastStatusUpdate": "2018-08-25T18:24:00Z",
    "DataQualityLevel": 1,
    "DateCreated": "2018-08-25T04:08:00Z",
    "SubmissionStatusTypeID": 200
}