{
    "IsRecentlyVerified": false,
    "ID": 91148,
    "UUID": "D9FF8229-71F0-409B-AF15-9AD599DA96AE",
    "DataProviderID": 1,
    "OperatorID": 3283,
    "UsageTypeID": 4,
    "UsageCost": "Free with MELIB card",
    "AddressInfo": {
        "ID": 91494,
        "Title": "MELIB Plaça de París",
        "AddressLine1": " Plaça de París, 3",
        "Town": "Palma",
        "StateOrProvince": "Illes Balears",
        "Postcode": "07010",
        "CountryID": 210,
        "Latitude": 39.583711,
        "Longitude": 2.64900039999998,
        "AccessComments": "Open 24 hours",
        "DistanceUnit": 0
    },
    "Connections": [
        {
            "ID": 129257,
            "ConnectionTypeID": 25,
            "StatusTypeID": 50,
            "LevelID": 2,
            "Quantity": 2
        },
        {
            "ID": 129258,
            "ConnectionTypeID": 28,
            "StatusTypeID": 50,
            "LevelID": 2,
            "Quantity": 2
        }
    ],
    "NumberOfPoints": 2,
    "StatusTypeID": 50,
    "DateLastStatusUpdate": "2017-08-04T08:23:00Z",
    "DataQualityLevel": 1,
    "DateCreated": "2017-07-31T14:58:00Z",
    "SubmissionStatusTypeID": 200
}