{
    "IsRecentlyVerified": false,
    "ID": 115900,
    "UUID": "DA540517-AA3F-42B3-954A-25CB88D5D573",
    "DataProviderID": 2,
    "DataProvidersReference": "113615",
    "OperatorID": 23,
    "UsageTypeID": 1,
    "AddressInfo": {
        "ID": 116246,
        "Title": "Delamar Southport - Tesla Destination",
        "AddressLine1": "275 Old Post Rd",
        "Town": "Fairfield",
        "StateOrProvince": "CT",
        "Postcode": "06890",
        "CountryID": 2,
        "Latitude": 41.146162,
        "Longitude": -73.245943,
        "ContactTelephone1": "203-259-2800  877-798-3752",
        "AccessComments": "24 hours daily; for customer use only; see valet for access",
        "RelatedURL": "https://www.tesla.com/destination-charging",
        "DistanceUnit": 0
    },
    "Connections": [
        {
            "ID": 162944,
            "ConnectionTypeID": 30,
            "LevelID": 2,
            "Amps": 16,
            "Voltage": 230,
            "PowerKW": 3.7,
            "CurrentTypeID": 10,
            "Quantity": 3
        }
    ],
    "DateLastStatusUpdate": "2020-06-26T03:04:00Z",
    "DataQualityLevel": 3,
    "DateCreated": "2019-02-11T07:13:00Z",
    "SubmissionStatusTypeID": 100
}