{
    "IsRecentlyVerified": false,
    "ID": 13695,
    "UUID": "ADAB6715-5ADA-4EC4-B220-C31906FF2864",
    "DataProviderID": 1,
    "OperatorID": 44,
    "UsageTypeID": 1,
    "UsageCost": "Spende",
    "AddressInfo": {
        "ID": 13592,
        "Title": "Talkredius Chargingpoint 24/7 open ",
        "AddressLine1": "Sandstr. 14",
        "Town": "Hückelhoven",
        "StateOrProvince": "Nordrhein-Westfalen",
        "Postcode": "D-41836",
        "CountryID": 87,
        "Latitude": 51.046101,
        "Longitude": 6.25099,
        "ContactTelephone1": "+49 172 2634678",
        "ContactEmail": "hopp@terminal-beach.de",
        "AccessComments": "http://www.tff-forum.de/viewtopic.php?f=9&t=674#p5497   im Navi am besten Sandstr. 18 eingeben ### for the GPS put in Sandstr, 18",
        "RelatedURL": "http://www.tff-forum.de/viewtopic.php?f=6&t=7",
        "DistanceUnit": 0
    },
    "Connections": [
        {
            "ID": 11127,
            "ConnectionTypeID": 8,
            "StatusTypeID": 50,
            "LevelID": 2,
            "Amps": 70,
            "Voltage": 230,
            "PowerKW": 16.8,
            "CurrentTypeID": 10,
            "Quantity": 1
        },
        {
            "ID": 11128,
            "ConnectionTypeID": 17,
            "StatusTypeID": 50,
            "LevelID": 2,
            "Amps": 32,
            "Voltage": 400,
            "PowerKW": 22,
            "CurrentTypeID": 20,
            "Quantity": 3
        },
        {
            "ID": 11129,
            "ConnectionTypeID": 16,
            "StatusTypeID": 50,
            "LevelID": 2,
            "Amps": 16,
            "Voltage": 230,
            "PowerKW": 3.7,
            "CurrentTypeID": 10,
            "Quantity": 2
        },
        {
            "ID": 11130,
            "ConnectionTypeID": 28,
            "StatusTypeID": 50,
            "LevelID": 2,
            "Amps": 16,
            "Voltage": 230,
            "PowerKW": 3.7,
            "CurrentTypeID": 10,
            "Quantity": 2
        },
        {
            "ID": 58932,
            "ConnectionTypeID": 25,
            "StatusTypeID": 50,
            "LevelID": 3,
            "Amps": 63,
            "Voltage": 400,
            "PowerKW": 43,
            "CurrentTypeID": 20,
            "Quantity": 1
        }
    ],
    "NumberOfPoints": 2,
    "GeneralComments": "24/7 geöffnet, jedoch Garagenausfahrt bitte ab 5:30 freihalten.  Wenn die Garage leer ist , kann das Auto auch dort reingestellt werden. An der Straße Drehstromkiste, Schlüssel dafür 10m neben dem Briefkasten.",
    "StatusTypeID": 50,
    "DateLastStatusUpdate": "2015-06-10T06:45:00Z",
    "DataQualityLevel": 1,
    "DateCreated": "2012-11-24T17:39:00Z",
    "SubmissionStatusTypeID": 200
}