{
    "IsRecentlyVerified": false,
    "ID": 54858,
    "UUID": "A1D5B749-88DA-498E-8CFD-99D595FEB7CA",
    "DataProviderID": 2,
    "DataProvidersReference": "70152",
    "OperatorID": 5,
    "UsageTypeID": 1,
    "AddressInfo": {
        "ID": 55204,
        "Title": "NEW CENTURY VW",
        "AddressLine1": "1220 S Brand Blvd",
        "Town": "Glendale",
        "StateOrProvince": "CA",
        "Postcode": "91205",
        "CountryID": 2,
        "Latitude": 34.131263,
        "Longitude": -118.254409,
        "ContactTelephone1": "888-758-4389",
        "AccessComments": "24 hours daily",
        "RelatedURL": "http://www.chargepoint.com/",
        "DistanceUnit": 0
    },
    "Connections": [
        {
            "ID": 69332,
            "ConnectionTypeID": 1,
            "LevelID": 2,
            "Amps": 16,
            "Voltage": 230,
            "PowerKW": 3,
            "CurrentTypeID": 10,
            "Quantity": 2
        }
    ],
    "DateLastStatusUpdate": "2019-04-06T04:01:00Z",
    "DataQualityLevel": 3,
    "DateCreated": "2015-10-09T07:24:00Z",
    "SubmissionStatusTypeID": 100
}