{
    "IsRecentlyVerified": false,
    "ID": 123627,
    "UUID": "1A479665-0C3C-4865-93A9-3BE6C1134837",
    "DataProviderID": 2,
    "DataProvidersReference": "47457",
    "UsageTypeID": 7,
    "AddressInfo": {
        "ID": 123973,
        "Title": "Toyota of Santa Cruz",
        "AddressLine1": "4200 Auto Plaza Dr",
        "Town": "Capitola",
        "StateOrProvince": "CA",
        "Postcode": "95010",
        "CountryID": 2,
        "Latitude": 36.981884,
        "Longitude": -121.962228,
        "ContactTelephone1": "831-462-4200",
        "AccessComments": "Dealership business hours\r\nPublic - Call ahead",
        "RelatedURL": "",
        "DistanceUnit": 0
    },
    "Connections": [
        {
            "ID": 173639,
            "ConnectionTypeID": 9,
            "LevelID": 1,
            "Amps": 16,
            "Voltage": 120,
            "PowerKW": 1.9,
            "CurrentTypeID": 10,
            "Quantity": 1
        },
        {
            "ID": 173640,
            "ConnectionTypeID": 1,
            "LevelID": 2,
            "Amps": 16,
            "Voltage": 230,
            "PowerKW": 3.7,
            "CurrentTypeID": 10,
            "Quantity": 1
        }
    ],
    "DateLastStatusUpdate": "2020-06-26T02:59:00Z",
    "DataQualityLevel": 3,
    "DateCreated": "2019-04-06T05:03:00Z",
    "SubmissionStatusTypeID": 100
}