{
    "IsRecentlyVerified": false,
    "ID": 23102,
    "UUID": "82D8B8DD-5D84-47E2-A90E-8E1DFF5EFD4A",
    "DataProviderID": 1,
    "OperatorID": 1,
    "UsageTypeID": 0,
    "UsageCost": "",
    "AddressInfo": {
        "ID": 23447,
        "Title": "Ministère de l’Economie",
        "AddressLine1": "Rue de Bercy 139",
        "AddressLine2": "Bercy",
        "Town": "Parijs",
        "StateOrProvince": "Paris",
        "Postcode": "75012",
        "CountryID": 80,
        "Latitude": 48.84003443899817,
        "Longitude": 2.3778533935546875,
        "ContactTelephone1": "",
        "ContactTelephone2": "",
        "ContactEmail": "",
        "AccessComments": "",
        "RelatedURL": "",
        "DistanceUnit": 0
    },
    "Connections": [
        {
            "ID": 24811,
            "ConnectionTypeID": 2,
            "StatusTypeID": 0,
            "LevelID": 3,
            "CurrentTypeID": 30,
            "Quantity": 1
        },
        {
            "ID": 24812,
            "ConnectionTypeID": 25,
            "StatusTypeID": 0,
            "LevelID": 3,
            "CurrentTypeID": 20,
            "Quantity": 1
        }
    ],
    "NumberOfPoints": 1,
    "GeneralComments": "",
    "StatusTypeID": 50,
    "DateLastStatusUpdate": "2015-07-19T09:03:00Z",
    "DataQualityLevel": 1,
    "DateCreated": "2014-04-12T15:51:00Z",
    "SubmissionStatusTypeID": 200
}