{
    "IsRecentlyVerified": false,
    "ID": 181365,
    "UUID": "430F0C75-4BAD-4999-AD1C-C065C659F61B",
    "DataProviderID": 29,
    "DataProvidersReference": "1945",
    "AddressInfo": {
        "ID": 181724,
        "Title": "Sertürnerstraße 39",
        "AddressLine1": "Sertürnerstraße 39",
        "Town": "Bonn",
        "Postcode": "53127",
        "CountryID": 87,
        "Latitude": 50.703038,
        "Longitude": 7.097346,
        "DistanceUnit": 0
    },
    "Connections": [
        {
            "ID": 285581,
            "ConnectionTypeID": 25,
            "StatusTypeID": 50,
            "LevelID": 2,
            "PowerKW": 22,
            "CurrentTypeID": 20
        },
        {
            "ID": 285582,
            "ConnectionTypeID": 25,
            "StatusTypeID": 50,
            "LevelID": 2,
            "PowerKW": 22,
            "CurrentTypeID": 20
        }
    ],
    "StatusTypeID": 50,
    "DateLastStatusUpdate": "2021-07-09T03:20:00Z",
    "MetadataValues": [
        {
            "ID": 13659,
            "MetadataFieldID": 4,
            "ItemValue": "Data from the German chargepoint registry provided by Bundesnetzagentur.de under the CC-BY 4.0 license"
        }
    ],
    "DataQualityLevel": 3,
    "DateCreated": "2021-07-08T10:01:00Z",
    "SubmissionStatusTypeID": 100
}