{
    "IsRecentlyVerified": false,
    "ID": 155056,
    "UUID": "110A02C4-3ECA-425B-978B-FF1F643F0175",
    "DataProviderID": 1,
    "OperatorID": 23,
    "OperatorsReference": "53248",
    "UsageTypeID": 4,
    "UsageCost": "$0.44/min >=60kW; $0.22/min <60kW; other tariffs for older cars",
    "AddressInfo": {
        "ID": 155410,
        "Title": "Abbotsford, BC - Mount Lehman Road Supercharger",
        "AddressLine1": "3122 Mount Lehman RD",
        "Town": "Abbotsford",
        "StateOrProvince": "BC",
        "Postcode": "V4X 2K9",
        "CountryID": 44,
        "Latitude": 49.059056,
        "Longitude": -122.377021,
        "DistanceUnit": 0
    },
    "Connections": [
        {
            "ID": 218260,
            "ConnectionTypeID": 27,
            "StatusTypeID": 50,
            "LevelID": 3,
            "PowerKW": 120,
            "CurrentTypeID": 30,
            "Quantity": 12
        }
    ],
    "NumberOfPoints": 12,
    "GeneralComments": "Charging12 Superchargers, available 24/7, up to 250kW",
    "StatusTypeID": 50,
    "DateLastStatusUpdate": "2021-01-04T13:33:00Z",
    "DataQualityLevel": 1,
    "DateCreated": "2020-03-25T07:08:00Z",
    "SubmissionStatusTypeID": 200
}