{
    "IsRecentlyVerified": false,
    "ID": 33740,
    "UUID": "2E7F6054-ACB1-455E-8D94-F9615EB522A8",
    "DataProviderID": 26,
    "DataProvidersReference": "48503",
    "OperatorID": 178,
    "OperatorsReference": "EVnetNL REE061",
    "UsageCost": "0.00 jaarabonnement",
    "AddressInfo": {
        "ID": 34086,
        "Title": "Gravin Sabinastraat 31",
        "AddressLine1": "Gravin Sabinastraat 31",
        "Town": "Korendijk",
        "Postcode": "3284 AN",
        "CountryID": 159,
        "Latitude": 51.750996,
        "Longitude": 4.367162,
        "ContactTelephone1": "0800-3522365",
        "RelatedURL": "http://www.evnet.nl",
        "DistanceUnit": 0
    },
    "Connections": [
        {
            "ID": 37251,
            "ConnectionTypeID": 25,
            "LevelID": 1,
            "PowerKW": 2.3,
            "CurrentTypeID": 10
        }
    ],
    "NumberOfPoints": 2,
    "StatusTypeID": 50,
    "DateLastStatusUpdate": "2016-06-04T02:40:00Z",
    "DataQualityLevel": 3,
    "DateCreated": "2015-01-09T06:04:00Z",
    "SubmissionStatusTypeID": 100
}