{
    "IsRecentlyVerified": false,
    "ID": 33124,
    "UUID": "E848EB40-1869-4173-930D-5DB9F40246F1",
    "DataProviderID": 1,
    "OperatorID": 105,
    "OperatorsReference": "Essent EM-DE-05913000-01-00003",
    "UsageTypeID": 4,
    "AddressInfo": {
        "ID": 33470,
        "Title": "Freistuhl 7",
        "AddressLine1": "Freistuhl 7",
        "Town": "Dortmund",
        "Postcode": "44137",
        "CountryID": 87,
        "Latitude": 51.5164,
        "Longitude": 7.461781,
        "DistanceUnit": 0
    },
    "Connections": [
        {
            "ID": 36635,
            "ConnectionTypeID": 25,
            "LevelID": 2,
            "PowerKW": 11
        },
        {
            "ID": 46690,
            "ConnectionTypeID": 25,
            "LevelID": 2,
            "PowerKW": 11
        }
    ],
    "NumberOfPoints": 1,
    "StatusTypeID": 50,
    "DateLastStatusUpdate": "2015-04-13T05:03:00Z",
    "DataQualityLevel": 3,
    "DateCreated": "2015-01-09T06:04:00Z",
    "SubmissionStatusTypeID": 200
}