{
    "IsRecentlyVerified": false,
    "ID": 107160,
    "UUID": "1F9BC344-9A35-4017-B989-AAE78F7E19D6",
    "DataProviderID": 1,
    "OperatorID": 3272,
    "UsageTypeID": 4,
    "AddressInfo": {
        "ID": 107506,
        "Title": "Emotì Evpass  Giardini Pioda",
        "AddressLine1": "Largo Zorzi ",
        "Town": "Locarno",
        "StateOrProvince": "Distretto di Locarno",
        "Postcode": "6600",
        "CountryID": 217,
        "Latitude": 46.16955518113668,
        "Longitude": 8.797504134045994,
        "ContactTelephone1": "+41 91 946 39 28",
        "ContactTelephone2": "+41 58 221 96 60",
        "RelatedURL": "https://emoti.evpass.ch/",
        "DistanceUnit": 0
    },
    "Connections": [
        {
            "ID": 151119,
            "ConnectionTypeID": 1036,
            "StatusTypeID": 50,
            "LevelID": 2,
            "Amps": 32,
            "Voltage": 400,
            "PowerKW": 22,
            "CurrentTypeID": 20,
            "Quantity": 2
        },
        {
            "ID": 151120,
            "ConnectionTypeID": 1,
            "StatusTypeID": 50,
            "LevelID": 2,
            "Amps": 32,
            "Voltage": 240,
            "PowerKW": 7,
            "CurrentTypeID": 10,
            "Quantity": 2
        },
        {
            "ID": 151121,
            "ConnectionTypeID": 1037,
            "StatusTypeID": 50,
            "LevelID": 2,
            "Amps": 16,
            "Voltage": 240,
            "PowerKW": 3.7,
            "CurrentTypeID": 10,
            "Quantity": 2
        }
    ],
    "NumberOfPoints": 2,
    "StatusTypeID": 50,
    "DateLastStatusUpdate": "2018-07-20T13:34:00Z",
    "DataQualityLevel": 1,
    "DateCreated": "2018-07-20T13:34:00Z",
    "SubmissionStatusTypeID": 200
}