{
    "IsRecentlyVerified": false,
    "ID": 32962,
    "UUID": "71BDFEDA-C211-4C12-959E-05D406DAB4AC",
    "DataProviderID": 26,
    "DataProvidersReference": "39671",
    "OperatorsReference": "Automotive Campus",
    "UsageCost": "0.00 gratis",
    "AddressInfo": {
        "ID": 33308,
        "Title": "Steenovenweg",
        "AddressLine1": "Steenovenweg",
        "Town": "Helmond",
        "Postcode": "5700 MC",
        "CountryID": 159,
        "Latitude": 51.474319913489,
        "Longitude": 5.6251260638237,
        "RelatedURL": "http://www.helmond.nl",
        "DistanceUnit": 0
    },
    "Connections": [
        {
            "ID": 36473,
            "ConnectionTypeID": 25,
            "LevelID": 2,
            "PowerKW": 11,
            "CurrentTypeID": 10
        }
    ],
    "NumberOfPoints": 2,
    "StatusTypeID": 50,
    "DateLastStatusUpdate": "2016-06-04T02:39:00Z",
    "DataQualityLevel": 3,
    "DateCreated": "2015-01-09T06:03:00Z",
    "SubmissionStatusTypeID": 100
}