{
    "IsRecentlyVerified": false,
    "ID": 18881,
    "UUID": "CBB337F4-FBCE-4328-9E89-BFF68E8BCC7D",
    "DataProviderID": 2,
    "DataProvidersReference": "52621",
    "UsageTypeID": 7,
    "AddressInfo": {
        "ID": 19226,
        "Title": "Ford of Branford",
        "AddressLine1": "301 E Main St",
        "Town": "Branford",
        "StateOrProvince": "CT",
        "Postcode": "06405",
        "CountryID": 2,
        "Latitude": 41.292505,
        "Longitude": -72.789844,
        "ContactTelephone1": "203-488-8321",
        "AccessComments": "Dealership business hours; Ford use only\r\nPublic - Call ahead",
        "RelatedURL": "",
        "DistanceUnit": 0
    },
    "Connections": [
        {
            "ID": 19120,
            "ConnectionTypeID": 1,
            "LevelID": 2,
            "Amps": 16,
            "Voltage": 230,
            "PowerKW": 3.7,
            "CurrentTypeID": 10,
            "Quantity": 2
        },
        {
            "ID": 32454,
            "ConnectionTypeID": 1,
            "LevelID": 2,
            "Quantity": 2
        }
    ],
    "DateLastStatusUpdate": "2020-06-26T03:04:00Z",
    "DataQualityLevel": 3,
    "DateCreated": "2013-08-25T04:20:00Z",
    "SubmissionStatusTypeID": 200
}