{
    "IsRecentlyVerified": false,
    "ID": 108635,
    "UUID": "95DDF1E0-65BF-425A-B683-DA7484F5DFE6",
    "DataProviderID": 1,
    "OperatorID": 32,
    "OperatorsReference": "24375",
    "UsageTypeID": 5,
    "UsageCost": "£0.108/kWh; for Polar Plus subscription members only",
    "AddressInfo": {
        "ID": 108981,
        "Title": "Redbridge Station Car Park",
        "AddressLine1": "130 Eastern Avenue",
        "Town": "Ilford",
        "Postcode": "IG4 5AQ",
        "CountryID": 1,
        "Latitude": 51.57648,
        "Longitude": 0.046099,
        "DistanceUnit": 0
    },
    "Connections": [
        {
            "ID": 153713,
            "ConnectionTypeID": 33,
            "StatusTypeID": 50,
            "LevelID": 3,
            "PowerKW": 50,
            "CurrentTypeID": 30,
            "Quantity": 1
        },
        {
            "ID": 153714,
            "ConnectionTypeID": 2,
            "StatusTypeID": 50,
            "LevelID": 3,
            "PowerKW": 50,
            "CurrentTypeID": 30,
            "Quantity": 1
        },
        {
            "ID": 153715,
            "ConnectionTypeID": 1036,
            "StatusTypeID": 50,
            "LevelID": 3,
            "PowerKW": 43,
            "CurrentTypeID": 20,
            "Quantity": 1
        }
    ],
    "NumberOfPoints": 1,
    "StatusTypeID": 50,
    "DateLastStatusUpdate": "2019-06-22T05:14:00Z",
    "DataQualityLevel": 1,
    "DateCreated": "2018-10-08T16:08:00Z",
    "SubmissionStatusTypeID": 200
}