{
    "IsRecentlyVerified": false,
    "ID": 115717,
    "UUID": "BF9436A4-02D6-4409-BCB3-132B402B3971",
    "DataProviderID": 2,
    "DataProvidersReference": "113558",
    "OperatorID": 23,
    "UsageTypeID": 1,
    "AddressInfo": {
        "ID": 116063,
        "Title": "Carr Manor - Tesla Destination",
        "AddressLine1": "350 E Carr Ave",
        "Town": "Cripple Creek",
        "StateOrProvince": "CO",
        "Postcode": "80813",
        "CountryID": 2,
        "Latitude": 38.747008,
        "Longitude": -105.18701,
        "ContactTelephone1": "719-689-3709  877-798-3752",
        "AccessComments": "24 hours daily; for customer use only; see front desk for access",
        "RelatedURL": "https://www.tesla.com/destination-charging",
        "DistanceUnit": 0
    },
    "Connections": [
        {
            "ID": 162750,
            "ConnectionTypeID": 30,
            "LevelID": 2,
            "Amps": 16,
            "Voltage": 230,
            "PowerKW": 3.7,
            "CurrentTypeID": 10,
            "Quantity": 1
        }
    ],
    "DateLastStatusUpdate": "2020-06-26T03:00:00Z",
    "DataQualityLevel": 3,
    "DateCreated": "2019-02-11T07:13:00Z",
    "SubmissionStatusTypeID": 100
}