{
    "IsRecentlyVerified": false,
    "ID": 73388,
    "UUID": "B40268A3-9ED4-4BDE-9289-A412BD4A05B3",
    "DataProviderID": 1,
    "OperatorID": 89,
    "OperatorsReference": "AAA-298",
    "UsageTypeID": 4,
    "UsageCost": "Free",
    "AddressInfo": {
        "ID": 73734,
        "Title": "Discovery Harbour Centre",
        "AddressLine1": "1416 Island Highway",
        "Town": "Campbell River",
        "StateOrProvince": "BC",
        "Postcode": "V9W 8C9",
        "CountryID": 44,
        "Latitude": 50.033996,
        "Longitude": -125.247946,
        "DistanceUnit": 0
    },
    "Connections": [
        {
            "ID": 105591,
            "ConnectionTypeID": 1,
            "StatusTypeID": 50,
            "LevelID": 2,
            "Amps": 32,
            "Voltage": 230,
            "PowerKW": 7,
            "CurrentTypeID": 10,
            "Quantity": 1
        }
    ],
    "NumberOfPoints": 1,
    "StatusTypeID": 50,
    "DateLastStatusUpdate": "2016-11-27T17:07:00Z",
    "DataQualityLevel": 1,
    "DateCreated": "2016-11-21T21:50:00Z",
    "SubmissionStatusTypeID": 200
}