{
    "IsRecentlyVerified": false,
    "ID": 74632,
    "UUID": "7C5BF9F5-2BCD-49FC-B4EC-68CA0DA54241",
    "DataProviderID": 1,
    "OperatorID": 23,
    "OperatorsReference": "21544",
    "UsageTypeID": 1,
    "UsageCost": "Free",
    "AddressInfo": {
        "ID": 74978,
        "Title": "Ashbrooke Hotel - Tesla",
        "AddressLine1": "7942 Highway 42",
        "Town": "Egg Harbor",
        "StateOrProvince": "WI",
        "Postcode": "54209",
        "CountryID": 2,
        "Latitude": 45.0572125,
        "Longitude": -87.279241,
        "ContactTelephone1": "877-868-3113  877-798-3752",
        "AccessComments": "24 hours daily; for Tesla use only; for guest use only",
        "RelatedURL": "http://www.teslamotors.com/supercharger",
        "DistanceUnit": 0
    },
    "Connections": [
        {
            "ID": 107240,
            "ConnectionTypeID": 30,
            "StatusTypeID": 50,
            "LevelID": 2,
            "Amps": 16,
            "Voltage": 230,
            "PowerKW": 16,
            "CurrentTypeID": 10,
            "Quantity": 2
        }
    ],
    "NumberOfPoints": 2,
    "StatusTypeID": 50,
    "DateLastStatusUpdate": "2017-01-31T19:30:00Z",
    "DataQualityLevel": 3,
    "DateCreated": "2016-12-03T00:13:00Z",
    "SubmissionStatusTypeID": 100
}