{
    "IsRecentlyVerified": false,
    "ID": 185453,
    "UUID": "11F36029-5680-4ECD-A255-3DF14DD84E3F",
    "DataProviderID": 29,
    "DataProvidersReference": "1554",
    "AddressInfo": {
        "ID": 185812,
        "Title": "Eichwaldstraße 10",
        "AddressLine1": "Eichwaldstraße 10",
        "Town": "Bad Wörishofen",
        "Postcode": "86825",
        "CountryID": 87,
        "Latitude": 48.008998,
        "Longitude": 10.591253,
        "DistanceUnit": 0
    },
    "Connections": [
        {
            "ID": 294968,
            "ConnectionTypeID": 25,
            "StatusTypeID": 50,
            "LevelID": 2,
            "PowerKW": 22,
            "CurrentTypeID": 20
        },
        {
            "ID": 294969,
            "ConnectionTypeID": 25,
            "StatusTypeID": 50,
            "LevelID": 2,
            "PowerKW": 22,
            "CurrentTypeID": 20
        }
    ],
    "StatusTypeID": 50,
    "DateLastStatusUpdate": "2021-07-12T02:40:00Z",
    "MetadataValues": [
        {
            "ID": 17744,
            "MetadataFieldID": 4,
            "ItemValue": "Data from the German chargepoint registry provided by Bundesnetzagentur.de under the CC-BY 4.0 license"
        }
    ],
    "DataQualityLevel": 3,
    "DateCreated": "2021-07-08T10:06:00Z",
    "SubmissionStatusTypeID": 100
}