{
    "IsRecentlyVerified": false,
    "ID": 66853,
    "UUID": "E8EC3F00-37A9-4577-8625-468F0035EFF2",
    "DataProviderID": 1,
    "OperatorID": 23,
    "OperatorsReference": "14808",
    "UsageTypeID": 1,
    "UsageCost": "$0.20/min >=60kW; $0.10/min <60kW; other tariffs for older cars",
    "AddressInfo": {
        "ID": 67199,
        "Title": "Fremaux Town Center - Tesla",
        "AddressLine1": "1303 Town Center Pkwy",
        "Town": "Slidell",
        "StateOrProvince": "LA",
        "Postcode": "70458",
        "CountryID": 2,
        "Latitude": 30.266552,
        "Longitude": -89.760156,
        "ContactTelephone1": "877-798-3752",
        "AccessComments": "24 hours daily; for Tesla use only",
        "RelatedURL": "http://www.teslamotors.com/supercharger",
        "DistanceUnit": 0
    },
    "Connections": [
        {
            "ID": 92340,
            "ConnectionTypeID": 27,
            "StatusTypeID": 50,
            "LevelID": 3,
            "Amps": 100,
            "Voltage": 400,
            "PowerKW": 120,
            "CurrentTypeID": 30,
            "Quantity": 8
        }
    ],
    "NumberOfPoints": 8,
    "StatusTypeID": 50,
    "DateLastStatusUpdate": "2018-03-13T08:52:00Z",
    "DataQualityLevel": 3,
    "DateCreated": "2016-05-29T02:04:00Z",
    "SubmissionStatusTypeID": 100
}