{
    "IsRecentlyVerified": false,
    "ID": 110834,
    "UUID": "015EBA8A-A986-4554-B4C5-AF16E7D677B5",
    "DataProviderID": 2,
    "DataProvidersReference": "83018",
    "UsageTypeID": 1,
    "AddressInfo": {
        "ID": 111180,
        "Title": "Harbour House Hotel",
        "AddressLine1": "85 Melville St",
        "Town": "Niagara-On-The-Lake",
        "StateOrProvince": "ON",
        "Postcode": "L0S 1J0",
        "CountryID": 44,
        "Latitude": 43.255276,
        "Longitude": -79.064583,
        "ContactTelephone1": "905-468-4683",
        "AccessComments": "24 hours daily; for guest use only",
        "RelatedURL": "",
        "DistanceUnit": 0
    },
    "Connections": [
        {
            "ID": 156136,
            "ConnectionTypeID": 1,
            "LevelID": 2,
            "Amps": 16,
            "Voltage": 230,
            "PowerKW": 3.7,
            "CurrentTypeID": 10,
            "Quantity": 3
        }
    ],
    "DateLastStatusUpdate": "2020-06-26T03:06:00Z",
    "DataQualityLevel": 3,
    "DateCreated": "2018-10-18T23:36:00Z",
    "SubmissionStatusTypeID": 100
}