{
    "IsRecentlyVerified": false,
    "ID": 123899,
    "UUID": "6152DD65-EE67-4227-A7D9-A844BF24BED8",
    "DataProviderID": 2,
    "DataProvidersReference": "79942",
    "UsageTypeID": 7,
    "AddressInfo": {
        "ID": 124245,
        "Title": "Haley Chevrolet",
        "AddressLine1": "12400 Tennessee Plaza",
        "Town": "Midlothian",
        "StateOrProvince": "VA",
        "Postcode": "23112",
        "CountryID": 2,
        "Latitude": 37.427728,
        "Longitude": -77.626797,
        "ContactTelephone1": "804-818-7660",
        "AccessComments": "Dealership business hours; for customer use only\r\nPublic - Call ahead",
        "RelatedURL": "",
        "DistanceUnit": 0
    },
    "Connections": [
        {
            "ID": 173931,
            "ConnectionTypeID": 1,
            "LevelID": 2,
            "Amps": 16,
            "Voltage": 230,
            "PowerKW": 3.7,
            "CurrentTypeID": 10,
            "Quantity": 1
        },
        {
            "ID": 173932,
            "ConnectionTypeID": 32,
            "LevelID": 3,
            "Amps": 100,
            "Voltage": 400,
            "PowerKW": 40,
            "CurrentTypeID": 30,
            "Quantity": 1
        }
    ],
    "DateLastStatusUpdate": "2020-06-26T02:59:00Z",
    "DataQualityLevel": 3,
    "DateCreated": "2019-04-06T05:03:00Z",
    "SubmissionStatusTypeID": 100
}