{
    "IsRecentlyVerified": false,
    "ID": 30736,
    "UUID": "9727D200-DBA3-407E-AB19-8C4ED5B2C6D7",
    "DataProviderID": 1,
    "DataProvidersReference": "1384",
    "AddressInfo": {
        "ID": 31082,
        "Title": "Sameiet Borgenveien 66, Oslo",
        "AddressLine1": "Borgenveien 66",
        "Town": "OSLO",
        "StateOrProvince": "Oslo",
        "Postcode": "0373",
        "CountryID": 168,
        "Latitude": 59.94401,
        "Longitude": 10.7039,
        "AccessComments": "",
        "DistanceUnit": 0
    },
    "Connections": [
        {
            "ID": 33965,
            "ConnectionTypeID": 0,
            "Reference": "1",
            "LevelID": 2,
            "Amps": 16,
            "Voltage": 230,
            "PowerKW": 3.7,
            "Comments": "Mode 1"
        },
        {
            "ID": 88784,
            "ConnectionTypeID": 0,
            "Reference": "2",
            "LevelID": 2,
            "Amps": 16,
            "Voltage": 230,
            "PowerKW": 3.7,
            "Comments": "Mode 1"
        }
    ],
    "NumberOfPoints": 2,
    "DateLastStatusUpdate": "2020-05-26T08:23:00Z",
    "DataQualityLevel": 2,
    "DateCreated": "2014-12-09T09:00:00Z",
    "SubmissionStatusTypeID": 100
}