{
    "IsRecentlyVerified": false,
    "ID": 161594,
    "UUID": "C0978C22-7BFA-425C-B6DA-812F389B5292",
    "DataProviderID": 1,
    "OperatorID": 23,
    "OperatorsReference": "54081",
    "UsageTypeID": 4,
    "AddressInfo": {
        "ID": 161951,
        "Title": "Romeo's Pizza",
        "AddressLine1": "66 Church Street",
        "Town": "Mercersburg",
        "StateOrProvince": "PA",
        "Postcode": "17236",
        "CountryID": 2,
        "Latitude": 39.830618,
        "Longitude": -77.90102,
        "DistanceUnit": 0
    },
    "Connections": [
        {
            "ID": 232552,
            "ConnectionTypeID": 30,
            "StatusTypeID": 50,
            "LevelID": 2,
            "PowerKW": 9,
            "CurrentTypeID": 20,
            "Quantity": 1
        }
    ],
    "NumberOfPoints": 1,
    "GeneralComments": "1 Tesla Connector, up to 9kW.Available to the public. Self park.",
    "StatusTypeID": 50,
    "DateLastStatusUpdate": "2020-07-17T05:30:00Z",
    "DataQualityLevel": 1,
    "DateCreated": "2020-07-17T05:30:00Z",
    "SubmissionStatusTypeID": 200
}