{
    "IsRecentlyVerified": false,
    "ID": 47565,
    "UUID": "070BEE04-6A6F-4A00-A7EE-610C8DF0472E",
    "DataProviderID": 1,
    "OperatorID": 45,
    "UsageTypeID": 6,
    "UsageCost": "0",
    "AddressInfo": {
        "ID": 47911,
        "Title": "Bioladen Guten Morgen",
        "AddressLine1": "Hagenbrücke 1-2",
        "Town": "Braunschweig",
        "StateOrProvince": "Braunschweig",
        "Postcode": "38100",
        "CountryID": 87,
        "Latitude": 52.2672431298369,
        "Longitude": 10.5225164981475,
        "ContactTelephone1": "+49 531 18801",
        "ContactEmail": "info@guten-morgen-laden.de",
        "AccessComments": "2 Garagen ohne Tor auf der Gebäuderückseite im Litolffweg. In der rechten Garage ist eine Wallbox mit festem Typ2 Kabel. Nutzbar während der Öffnungszeiten Mo-Fr 9-19, Sa 9-16Uhr.",
        "RelatedURL": "http://www.guten-morgen-laden.de/",
        "DistanceUnit": 0
    },
    "Connections": [
        {
            "ID": 58644,
            "ConnectionTypeID": 25,
            "StatusTypeID": 50,
            "LevelID": 2,
            "Amps": 16,
            "Voltage": 400,
            "PowerKW": 11,
            "CurrentTypeID": 20,
            "Quantity": 1
        }
    ],
    "NumberOfPoints": 1,
    "StatusTypeID": 50,
    "DateLastStatusUpdate": "2015-06-01T12:12:00Z",
    "DataQualityLevel": 1,
    "DateCreated": "2015-06-01T09:30:00Z",
    "SubmissionStatusTypeID": 200
}