{
    "UserComments": [
        {
            "ID": 4430,
            "ChargePointID": 5814,
            "CommentTypeID": 10,
            "UserName": "Simon Hewison",
            "Comment": "More elektromotive posts that don't accept Source London cards (or any other common cards I have)",
            "Rating": 1,
            "DateCreated": "2015-05-12T19:50:23.13Z",
            "User": {
                "ID": 4575,
                "Username": "Simon Hewison"
            },
            "CheckinStatusTypeID": 40
        },
        {
            "ID": 295,
            "ChargePointID": 5814,
            "CommentTypeID": 10,
            "UserName": "Brammyd",
            "Comment": " 2 x 13A posts...plenty of space 4 hours free whilst charging. Chargemaster card requd",
            "Rating": 3,
            "DateCreated": "2013-04-09T20:39:17.89Z",
            "User": {
                "ID": 1040,
                "Username": "Brammyd"
            }
        }
    ],
    "IsRecentlyVerified": false,
    "ID": 5814,
    "UUID": "AAB7ABFB-1D70-4AC4-B174-DA5B26AE3086",
    "DataProviderID": 1,
    "OperatorID": 25,
    "OperatorsReference": "greenwich-horseferryplace",
    "UsageTypeID": 4,
    "UsageCost": "£0.059/minute; min £1.18; other tariffs available",
    "AddressInfo": {
        "ID": 5736,
        "Title": "Horseferry Place",
        "AddressLine1": "Horseferry Place",
        "Town": "Greenwich",
        "StateOrProvince": "London",
        "Postcode": "SE10 9HG",
        "CountryID": 1,
        "Latitude": 51.4827075,
        "Longitude": -0.0131555,
        "DistanceUnit": 0
    },
    "Connections": [
        {
            "ID": 563,
            "ConnectionTypeID": 25,
            "StatusTypeID": 50,
            "LevelID": 2,
            "Amps": 32,
            "Voltage": 230,
            "PowerKW": 7,
            "CurrentTypeID": 10,
            "Quantity": 3
        },
        {
            "ID": 72876,
            "ConnectionTypeID": 1,
            "StatusTypeID": 50,
            "LevelID": 2,
            "Amps": 16,
            "Voltage": 230,
            "PowerKW": 4,
            "CurrentTypeID": 10,
            "Quantity": 3
        }
    ],
    "NumberOfPoints": 3,
    "StatusTypeID": 50,
    "DateLastStatusUpdate": "2019-10-07T08:07:00Z",
    "DataQualityLevel": 1,
    "DateCreated": "2011-09-12T11:40:00Z",
    "SubmissionStatusTypeID": 200
}