{
    "MediaItems": [
        {
            "ID": 17731,
            "ChargePointID": 9582,
            "ItemURL": "https://s3-ap-southeast-2.amazonaws.com/openchargemap/images/GB/OCM9582/OCM-9582.orig.2019030513281445.png",
            "ItemThumbnailURL": "https://s3-ap-southeast-2.amazonaws.com/openchargemap/images/GB/OCM9582/OCM-9582.thmb.2019030513281445.png",
            "Comment": "",
            "IsEnabled": true,
            "IsVideo": false,
            "IsFeaturedItem": false,
            "IsExternalResource": false,
            "User": {
                "ID": 15366,
                "Username": "ZCWCara"
            },
            "DateCreated": "2019-03-05T13:28:00Z"
        },
        {
            "ID": 17730,
            "ChargePointID": 9582,
            "ItemURL": "https://s3-ap-southeast-2.amazonaws.com/openchargemap/images/GB/OCM9582/OCM-9582.orig.2019030513243902.png",
            "ItemThumbnailURL": "https://s3-ap-southeast-2.amazonaws.com/openchargemap/images/GB/OCM9582/OCM-9582.thmb.2019030513243902.png",
            "Comment": "",
            "IsEnabled": true,
            "IsVideo": false,
            "IsFeaturedItem": false,
            "IsExternalResource": false,
            "User": {
                "ID": 15366,
                "Username": "ZCWCara"
            },
            "DateCreated": "2019-03-05T13:25:00Z"
        }
    ],
    "IsRecentlyVerified": false,
    "ID": 9582,
    "UUID": "A9C21193-41AC-4B4A-8B1D-4318EC09AE1A",
    "DataProviderID": 1,
    "OperatorID": 19,
    "UsageTypeID": 1,
    "AddressInfo": {
        "ID": 9479,
        "Title": "Grand Arcade Shopping Centre",
        "AddressLine1": "23 Crompton Street",
        "Town": "Wigan",
        "StateOrProvince": "Greater Manchester",
        "Postcode": "WN1 1BH",
        "CountryID": 1,
        "Latitude": 53.546389,
        "Longitude": -2.628832,
        "ContactTelephone1": "01942 326080",
        "ContactEmail": "information@grand-arcade.co.uk",
        "AccessComments": "Charging availability Mon to Sat 09.00 to 18.00, Sun 11.00 to 17.00",
        "RelatedURL": "http://www.grand-arcade.co.uk",
        "DistanceUnit": 0
    },
    "Connections": [
        {
            "ID": 7329,
            "ConnectionTypeID": 3,
            "StatusTypeID": 50,
            "LevelID": 2,
            "Amps": 13,
            "Voltage": 230,
            "PowerKW": 3,
            "CurrentTypeID": 10,
            "Quantity": 1
        },
        {
            "ID": 7330,
            "ConnectionTypeID": 3,
            "StatusTypeID": 50,
            "LevelID": 2,
            "Amps": 13,
            "Voltage": 230,
            "PowerKW": 3,
            "CurrentTypeID": 10,
            "Quantity": 1
        },
        {
            "ID": 7331,
            "ConnectionTypeID": 3,
            "StatusTypeID": 50,
            "LevelID": 2,
            "Amps": 13,
            "Voltage": 230,
            "PowerKW": 3,
            "CurrentTypeID": 10,
            "Quantity": 1
        },
        {
            "ID": 7332,
            "ConnectionTypeID": 3,
            "StatusTypeID": 50,
            "LevelID": 2,
            "Amps": 13,
            "Voltage": 230,
            "PowerKW": 3,
            "CurrentTypeID": 10,
            "Quantity": 1
        }
    ],
    "NumberOfPoints": 4,
    "StatusTypeID": 50,
    "DateLastStatusUpdate": "2019-03-05T13:28:00Z",
    "DataQualityLevel": 1,
    "DateCreated": "2012-02-27T14:36:00Z",
    "SubmissionStatusTypeID": 200
}