{
    "IsRecentlyVerified": false,
    "ID": 170007,
    "UUID": "4BC411DD-C4D5-4052-A87D-DB28E68E5C1A",
    "DataProviderID": 1,
    "OperatorID": 3327,
    "UsageTypeID": 4,
    "AddressInfo": {
        "ID": 170366,
        "Title": "ADS ESSO Ardea BECHARGE",
        "AddressLine1": "Via di Campo Selva Km. 3+700",
        "AddressLine2": "Via Pratica di Mare  ",
        "Town": "Ardea",
        "StateOrProvince": "RM",
        "Postcode": "00040",
        "CountryID": 112,
        "Latitude": 41.60831832337681,
        "Longitude": 12.501379896487492,
        "ContactTelephone1": "02-49527730",
        "ContactEmail": "emobility@buildingenergy.it",
        "RelatedURL": "https://www.bec.energy/",
        "DistanceUnit": 0
    },
    "Connections": [
        {
            "ID": 259128,
            "ConnectionTypeID": 25,
            "StatusTypeID": 50,
            "LevelID": 2,
            "Amps": 32,
            "Voltage": 400,
            "PowerKW": 22,
            "CurrentTypeID": 20,
            "Quantity": 2
        }
    ],
    "NumberOfPoints": 2,
    "StatusTypeID": 50,
    "DateLastStatusUpdate": "2020-11-16T13:14:00Z",
    "DataQualityLevel": 1,
    "DateCreated": "2020-11-16T13:14:00Z",
    "SubmissionStatusTypeID": 200
}