{
    "IsRecentlyVerified": false,
    "ID": 175900,
    "UUID": "1C6AE0E6-8D96-4251-9B83-645419931DC9",
    "DataProviderID": 1,
    "OperatorID": 1,
    "UsageTypeID": 1,
    "UsageCost": "Free",
    "AddressInfo": {
        "ID": 176259,
        "Title": "Ever’man",
        "AddressLine1": "315 W Garden St",
        "Town": "Pensacola",
        "StateOrProvince": "FL",
        "Postcode": "32505",
        "CountryID": 2,
        "Latitude": 30.411994968885182,
        "Longitude": -87.22069482151534,
        "DistanceUnit": 0
    },
    "Connections": [
        {
            "ID": 273174,
            "ConnectionTypeID": 1,
            "StatusTypeID": 50,
            "CurrentTypeID": 20,
            "Quantity": 2
        }
    ],
    "NumberOfPoints": 2,
    "StatusTypeID": 50,
    "DateLastStatusUpdate": "2021-06-21T03:26:00Z",
    "DataQualityLevel": 1,
    "DateCreated": "2021-06-18T13:19:00Z",
    "SubmissionStatusTypeID": 200
}