{
    "IsRecentlyVerified": false,
    "ID": 45034,
    "UUID": "AA100CC6-A334-4E62-856A-5A9FF06EE206",
    "DataProviderID": 1,
    "OperatorID": 140,
    "UsageTypeID": 4,
    "AddressInfo": {
        "ID": 45380,
        "Title": "Tierpark Sababurg",
        "AddressLine1": "Sababurg 1",
        "Town": "Hofgeismar",
        "StateOrProvince": "Landkreis Kassel",
        "Postcode": "34369",
        "CountryID": 87,
        "Latitude": 51.5459133903191,
        "Longitude": 9.52978481957392,
        "ContactTelephone1": "+49 561 9330 9330",
        "AccessComments": "2 kostenlose unmarkierte Plätze neben den Behintertenparkplätzen, durchgehend nutzbar. Ladekarte der EAM \"Free\" (gilt auch für SUN) notwendig (http://www.free-e-mobil.de/mit-free-unterwegs/ladestationen/). Ausleihbar an der Kasse des Tierparks zu den Öffnungszeiten (siehe http://www.tierpark-sababurg.de)",
        "RelatedURL": "http://www.eam.de/",
        "DistanceUnit": 0
    },
    "Connections": [
        {
            "ID": 55369,
            "ConnectionTypeID": 25,
            "StatusTypeID": 50,
            "LevelID": 2,
            "Amps": 16,
            "Voltage": 400,
            "PowerKW": 11,
            "CurrentTypeID": 20,
            "Quantity": 2
        },
        {
            "ID": 55370,
            "ConnectionTypeID": 28,
            "StatusTypeID": 50,
            "LevelID": 2,
            "Amps": 16,
            "Voltage": 230,
            "PowerKW": 3.7,
            "CurrentTypeID": 10,
            "Quantity": 2
        }
    ],
    "NumberOfPoints": 4,
    "StatusTypeID": 50,
    "DateLastStatusUpdate": "2015-04-23T12:41:00Z",
    "DataQualityLevel": 1,
    "DateCreated": "2015-04-23T12:24:00Z",
    "SubmissionStatusTypeID": 200
}