{
    "IsRecentlyVerified": false,
    "ID": 18565,
    "UUID": "0979E51C-8BD1-4E76-B295-8EA812EAA5F0",
    "DataProviderID": 1,
    "OperatorID": 32,
    "OperatorsReference": "918,934",
    "UsageTypeID": 0,
    "UsageCost": "£0.108/kWh; for Polar Plus subscription members only. £1.70 for type2. Car Park fees apply as well.",
    "AddressInfo": {
        "ID": 18910,
        "Title": "NCP Car Park Garrard Street",
        "AddressLine1": "1 Garrard Street",
        "Town": "Reading",
        "Postcode": "RG1 1NR",
        "CountryID": 1,
        "Latitude": 51.457936,
        "Longitude": -0.9738,
        "AccessComments": "4 dedicated bays for EV charging",
        "DistanceUnit": 0
    },
    "Connections": [
        {
            "ID": 18784,
            "ConnectionTypeID": 3,
            "StatusTypeID": 50,
            "LevelID": 2,
            "Amps": 13,
            "Voltage": 230,
            "PowerKW": 3,
            "CurrentTypeID": 10,
            "Quantity": 2
        },
        {
            "ID": 18785,
            "ConnectionTypeID": 25,
            "StatusTypeID": 50,
            "LevelID": 2,
            "Amps": 32,
            "Voltage": 230,
            "PowerKW": 7,
            "CurrentTypeID": 10,
            "Quantity": 2
        }
    ],
    "NumberOfPoints": 4,
    "GeneralComments": "Chargemaster/Polar RFID Card required",
    "StatusTypeID": 50,
    "DateLastStatusUpdate": "2019-03-06T06:32:00Z",
    "DataQualityLevel": 1,
    "DateCreated": "2013-08-06T21:44:00Z",
    "SubmissionStatusTypeID": 200
}