{
    "IsRecentlyVerified": false,
    "ID": 137046,
    "UUID": "D302C2C3-147C-4E6F-9303-EE9BB2B89FA3",
    "DataProviderID": 1,
    "OperatorID": 3315,
    "UsageTypeID": 4,
    "UsageCost": "£0.38 + £0.19/kWh",
    "AddressInfo": {
        "ID": 137392,
        "Title": "Satrosphere Car Park, Aberdeen",
        "AddressLine1": "179 Constitution Street",
        "Town": "Aberdeen",
        "Postcode": "AB24 5TU",
        "CountryID": 1,
        "Latitude": 57.153271,
        "Longitude": -2.084727,
        "DistanceUnit": 0
    },
    "Connections": [
        {
            "ID": 191858,
            "ConnectionTypeID": 25,
            "Reference": "50961-1",
            "StatusTypeID": 50,
            "LevelID": 2,
            "Amps": 32,
            "Voltage": 400,
            "PowerKW": 22,
            "CurrentTypeID": 20,
            "Quantity": 1
        },
        {
            "ID": 191859,
            "ConnectionTypeID": 25,
            "Reference": "50961-2",
            "StatusTypeID": 50,
            "LevelID": 2,
            "Amps": 32,
            "Voltage": 400,
            "PowerKW": 22,
            "CurrentTypeID": 20,
            "Quantity": 1
        }
    ],
    "NumberOfPoints": 2,
    "StatusTypeID": 50,
    "DateLastStatusUpdate": "2021-07-20T08:00:00Z",
    "MetadataValues": [
        {
            "ID": 6898,
            "MetadataFieldID": 4,
            "ItemValue": "Contains public sector information licensed under the Open Government Licence v2.0. http://www.nationalarchives.gov.uk/doc/open-government-licence/version/2/"
        }
    ],
    "DataQualityLevel": 3,
    "DateCreated": "2019-12-24T05:23:00Z",
    "SubmissionStatusTypeID": 100
}