{
    "IsRecentlyVerified": false,
    "ID": 165740,
    "UUID": "55E74A01-978C-46A8-BF4A-C4B02F91E394",
    "DataProviderID": 28,
    "DataProvidersReference": "FR*S47*PMB47*22",
    "OperatorID": 3407,
    "UsageTypeID": 5,
    "AddressInfo": {
        "ID": 166099,
        "Title": "MONFLANQUIN - Place Yves Balségur",
        "AddressLine1": "Place Yves Balségur 47150 MONFLANQUIN",
        "CountryID": 80,
        "Latitude": 44.53087,
        "Longitude": 0.767955,
        "AccessComments": "24h/24 7j/7",
        "DistanceUnit": 0
    },
    "Connections": [
        {
            "ID": 242180,
            "ConnectionTypeID": 25,
            "StatusTypeID": 50,
            "LevelID": 2,
            "PowerKW": 18,
            "CurrentTypeID": 20
        },
        {
            "ID": 242181,
            "ConnectionTypeID": 28,
            "StatusTypeID": 50,
            "LevelID": 2,
            "PowerKW": 18,
            "CurrentTypeID": 10
        },
        {
            "ID": 242182,
            "ConnectionTypeID": 25,
            "StatusTypeID": 50,
            "LevelID": 2,
            "PowerKW": 18,
            "CurrentTypeID": 20
        },
        {
            "ID": 242183,
            "ConnectionTypeID": 28,
            "StatusTypeID": 50,
            "LevelID": 2,
            "PowerKW": 18,
            "CurrentTypeID": 10
        }
    ],
    "GeneralComments": "Recharge par badge et avec une application smartphone",
    "StatusTypeID": 50,
    "DateLastStatusUpdate": "2020-08-27T05:11:00Z",
    "DataQualityLevel": 2,
    "DateCreated": "2020-08-27T05:11:00Z",
    "SubmissionStatusTypeID": 100
}