{
    "IsRecentlyVerified": false,
    "ID": 74607,
    "UUID": "E1AB3B6B-A13A-4E94-8E67-16B9C319377E",
    "DataProviderID": 2,
    "DataProvidersReference": "79729",
    "OperatorID": 5,
    "UsageTypeID": 1,
    "AddressInfo": {
        "ID": 74953,
        "Title": "K COLLEGE",
        "AddressLine1": "888-912 Academy St",
        "Town": "Kalamazoo",
        "StateOrProvince": "MI",
        "Postcode": "49006",
        "CountryID": 2,
        "Latitude": 42.2907698,
        "Longitude": -85.59687,
        "ContactTelephone1": "888-758-4389",
        "AccessComments": "24 hours daily",
        "RelatedURL": "http://www.chargepoint.com/",
        "DistanceUnit": 0
    },
    "Connections": [
        {
            "ID": 107214,
            "ConnectionTypeID": 1,
            "LevelID": 2,
            "Amps": 16,
            "Voltage": 230,
            "PowerKW": 3.7,
            "CurrentTypeID": 10,
            "Quantity": 1
        }
    ],
    "DateLastStatusUpdate": "2020-06-26T03:05:00Z",
    "DataQualityLevel": 3,
    "DateCreated": "2016-12-03T00:13:00Z",
    "SubmissionStatusTypeID": 100
}