{
    "UserComments": [
        {
            "ID": 21783,
            "ChargePointID": 130323,
            "CommentTypeID": 10,
            "UserName": "TeslaFRA",
            "Comment": "Seems a little lonely. Had been there at dark. No infrastructure close by ",
            "Rating": 5,
            "DateCreated": "2019-11-08T11:51:46.327Z",
            "User": {
                "ID": 22075,
                "Username": "TeslaFRA"
            },
            "CheckinStatusTypeID": 10,
            "IsActionedByEditor": false
        },
        {
            "ID": 21294,
            "ChargePointID": 130323,
            "CommentTypeID": 10,
            "UserName": "Kestas",
            "Comment": "",
            "DateCreated": "2019-08-04T16:51:09.807Z",
            "User": {
                "ID": 21795,
                "Username": "Kestas"
            },
            "CheckinStatusTypeID": 10
        }
    ],
    "MediaItems": [
        {
            "ID": 20289,
            "ChargePointID": 130323,
            "ItemURL": "https://s3-ap-southeast-2.amazonaws.com/openchargemap/images/LT/OCM130323/OCM-130323.orig.2019110811472121.jpg",
            "ItemThumbnailURL": "https://s3-ap-southeast-2.amazonaws.com/openchargemap/images/LT/OCM130323/OCM-130323.thmb.2019110811472121.jpg",
            "Comment": "",
            "IsEnabled": true,
            "IsVideo": false,
            "IsFeaturedItem": false,
            "IsExternalResource": false,
            "User": {
                "ID": 22075,
                "Username": "TeslaFRA"
            },
            "DateCreated": "2019-11-08T11:48:00Z"
        },
        {
            "ID": 20290,
            "ChargePointID": 130323,
            "ItemURL": "https://s3-ap-southeast-2.amazonaws.com/openchargemap/images/LT/OCM130323/OCM-130323.orig.2019110811474095.jpg",
            "ItemThumbnailURL": "https://s3-ap-southeast-2.amazonaws.com/openchargemap/images/LT/OCM130323/OCM-130323.thmb.2019110811474095.jpg",
            "Comment": "",
            "IsEnabled": true,
            "IsVideo": false,
            "IsFeaturedItem": false,
            "IsExternalResource": false,
            "User": {
                "ID": 22075,
                "Username": "TeslaFRA"
            },
            "DateCreated": "2019-11-08T11:48:00Z"
        },
        {
            "ID": 20291,
            "ChargePointID": 130323,
            "ItemURL": "https://s3-ap-southeast-2.amazonaws.com/openchargemap/images/LT/OCM130323/OCM-130323.orig.2019110811480895.jpg",
            "ItemThumbnailURL": "https://s3-ap-southeast-2.amazonaws.com/openchargemap/images/LT/OCM130323/OCM-130323.thmb.2019110811480895.jpg",
            "Comment": "",
            "IsEnabled": true,
            "IsVideo": false,
            "IsFeaturedItem": false,
            "IsExternalResource": false,
            "User": {
                "ID": 22075,
                "Username": "TeslaFRA"
            },
            "DateCreated": "2019-11-08T11:48:00Z"
        },
        {
            "ID": 20287,
            "ChargePointID": 130323,
            "ItemURL": "https://s3-ap-southeast-2.amazonaws.com/openchargemap/images/LT/OCM130323/OCM-130323.orig.2019110811463442.jpg",
            "ItemThumbnailURL": "https://s3-ap-southeast-2.amazonaws.com/openchargemap/images/LT/OCM130323/OCM-130323.thmb.2019110811463442.jpg",
            "Comment": "",
            "IsEnabled": true,
            "IsVideo": false,
            "IsFeaturedItem": false,
            "IsExternalResource": false,
            "User": {
                "ID": 22075,
                "Username": "TeslaFRA"
            },
            "DateCreated": "2019-11-08T11:47:00Z"
        },
        {
            "ID": 20288,
            "ChargePointID": 130323,
            "ItemURL": "https://s3-ap-southeast-2.amazonaws.com/openchargemap/images/LT/OCM130323/OCM-130323.orig.2019110811470622.jpg",
            "ItemThumbnailURL": "https://s3-ap-southeast-2.amazonaws.com/openchargemap/images/LT/OCM130323/OCM-130323.thmb.2019110811470622.jpg",
            "Comment": "",
            "IsEnabled": true,
            "IsVideo": false,
            "IsFeaturedItem": false,
            "IsExternalResource": false,
            "User": {
                "ID": 22075,
                "Username": "TeslaFRA"
            },
            "DateCreated": "2019-11-08T11:47:00Z"
        },
        {
            "ID": 19589,
            "ChargePointID": 130323,
            "ItemURL": "https://s3-ap-southeast-2.amazonaws.com/openchargemap/images/LT/OCM130323/OCM-130323.orig.2019091520473207.jpeg",
            "ItemThumbnailURL": "https://s3-ap-southeast-2.amazonaws.com/openchargemap/images/LT/OCM130323/OCM-130323.thmb.2019091520473207.jpeg",
            "Comment": "",
            "IsEnabled": true,
            "IsVideo": false,
            "IsFeaturedItem": false,
            "IsExternalResource": false,
            "User": {
                "ID": 22075,
                "Username": "TeslaFRA"
            },
            "DateCreated": "2019-09-15T20:48:00Z"
        },
        {
            "ID": 19588,
            "ChargePointID": 130323,
            "ItemURL": "https://s3-ap-southeast-2.amazonaws.com/openchargemap/images/LT/OCM130323/OCM-130323.orig.2019091520462319.jpeg",
            "ItemThumbnailURL": "https://s3-ap-southeast-2.amazonaws.com/openchargemap/images/LT/OCM130323/OCM-130323.thmb.2019091520462319.jpeg",
            "Comment": "",
            "IsEnabled": true,
            "IsVideo": false,
            "IsFeaturedItem": false,
            "IsExternalResource": false,
            "User": {
                "ID": 22075,
                "Username": "TeslaFRA"
            },
            "DateCreated": "2019-09-15T20:47:00Z"
        }
    ],
    "IsRecentlyVerified": false,
    "ID": 130323,
    "UUID": "AEBE6486-BD3E-468A-AF6C-BE9281A952ED",
    "DataProviderID": 1,
    "OperatorID": 1,
    "UsageTypeID": 1,
    "UsageCost": "0",
    "AddressInfo": {
        "ID": 130669,
        "Title": "A6/E262 166 km -Degučiai",
        "AddressLine1": "E262 29",
        "Town": "Degučiai",
        "StateOrProvince": "Degučių seniūnija",
        "Postcode": "32232",
        "CountryID": 131,
        "Latitude": 55.6582214224048,
        "Longitude": 26.052682244954,
        "DistanceUnit": 0
    },
    "Connections": [
        {
            "ID": 182479,
            "ConnectionTypeID": 2,
            "StatusTypeID": 50,
            "LevelID": 3,
            "PowerKW": 50,
            "CurrentTypeID": 30,
            "Quantity": 1
        },
        {
            "ID": 182480,
            "ConnectionTypeID": 33,
            "StatusTypeID": 50,
            "LevelID": 3,
            "PowerKW": 50,
            "CurrentTypeID": 30,
            "Quantity": 1
        }
    ],
    "NumberOfPoints": 1,
    "GeneralComments": "50 kW",
    "StatusTypeID": 50,
    "DateLastStatusUpdate": "2019-11-08T11:52:00Z",
    "DataQualityLevel": 1,
    "DateCreated": "2019-08-03T05:31:00Z",
    "SubmissionStatusTypeID": 200
}