{
    "IsRecentlyVerified": false,
    "ID": 129919,
    "UUID": "7FFEBA30-E0E5-4BF9-9F23-81F345D85C0E",
    "DataProviderID": 1,
    "OperatorID": 23,
    "OperatorsReference": "43660",
    "UsageTypeID": 4,
    "UsageCost": "$0.26/kWh; other tariffs for older cars",
    "AddressInfo": {
        "ID": 130265,
        "Title": "Palm Springs, Ca Supercharger",
        "AddressLine1": "101 North Museum Drive",
        "Town": "Palm Springs",
        "StateOrProvince": "CA",
        "Postcode": "92262",
        "CountryID": 2,
        "Latitude": 33.82533,
        "Longitude": -116.547843,
        "DistanceUnit": 0
    },
    "Connections": [
        {
            "ID": 181909,
            "ConnectionTypeID": 27,
            "StatusTypeID": 50,
            "LevelID": 3,
            "PowerKW": 120,
            "CurrentTypeID": 30,
            "Quantity": 11
        }
    ],
    "NumberOfPoints": 11,
    "GeneralComments": "Charging11 Superchargers, available 24/7, up to 72kW",
    "StatusTypeID": 50,
    "DateLastStatusUpdate": "2019-07-30T09:20:00Z",
    "DataQualityLevel": 1,
    "DateCreated": "2019-07-30T09:20:00Z",
    "SubmissionStatusTypeID": 200
}