{
    "IsRecentlyVerified": false,
    "ID": 70317,
    "UUID": "8D4FD86B-FA05-4B92-AA83-A63CEE4EA586",
    "DataProviderID": 2,
    "DataProvidersReference": "72999",
    "OperatorID": 1242,
    "UsageTypeID": 1,
    "AddressInfo": {
        "ID": 70663,
        "Title": "GE WS - Market Bistro #138 Loudon Unit 2",
        "AddressLine1": "Rt 9 & Cobbee Rd",
        "Town": "Latham",
        "StateOrProvince": "NY",
        "Postcode": "12110",
        "CountryID": 2,
        "Latitude": 42.752997,
        "Longitude": -73.757776,
        "ContactTelephone1": "855-443-3873",
        "AccessComments": "24 hours daily",
        "RelatedURL": "https://www.gewattstation.com",
        "DistanceUnit": 0
    },
    "Connections": [
        {
            "ID": 100360,
            "ConnectionTypeID": 1,
            "LevelID": 2,
            "Amps": 16,
            "Voltage": 230,
            "PowerKW": 3.7,
            "CurrentTypeID": 10,
            "Quantity": 1
        }
    ],
    "DateLastStatusUpdate": "2020-06-26T03:06:00Z",
    "DataQualityLevel": 3,
    "DateCreated": "2016-07-14T00:53:00Z",
    "SubmissionStatusTypeID": 100
}