{
    "IsRecentlyVerified": false,
    "ID": 31940,
    "UUID": "B9D3116D-EDA0-4B74-86AC-EA5F413D2BFB",
    "DataProviderID": 26,
    "DataProvidersReference": "30425",
    "OperatorID": 86,
    "OperatorsReference": "EnWB Ecke Baltenstraße  ",
    "UsageCost": "0.00 afhankelijk van pas",
    "AddressInfo": {
        "ID": 32286,
        "Title": "Revaler Straße 3",
        "AddressLine1": "Revaler Straße 3",
        "Town": "Viesenhäuser Hof",
        "Postcode": "70378",
        "CountryID": 87,
        "Latitude": 48.842038,
        "Longitude": 9.228376,
        "ContactTelephone1": "0800 3629-000",
        "ContactEmail": "-",
        "RelatedURL": "http://www.enbw.com/",
        "DistanceUnit": 0
    },
    "Connections": [
        {
            "ID": 35451,
            "ConnectionTypeID": 25,
            "LevelID": 2,
            "PowerKW": 5,
            "CurrentTypeID": 10
        }
    ],
    "NumberOfPoints": 2,
    "StatusTypeID": 50,
    "DateLastStatusUpdate": "2016-03-03T12:34:00Z",
    "DataQualityLevel": 3,
    "DateCreated": "2015-01-09T06:03:00Z",
    "SubmissionStatusTypeID": 100
}