{
    "IsRecentlyVerified": false,
    "ID": 129817,
    "UUID": "493F9769-B1BC-46CE-8BB5-3D2CC9ED657D",
    "DataProviderID": 1,
    "OperatorID": 1,
    "UsageTypeID": 6,
    "UsageCost": "Free with stay.",
    "AddressInfo": {
        "ID": 130163,
        "Title": "Country Cabins Inn",
        "AddressLine1": "21 7th Street",
        "Town": "Mountain View",
        "StateOrProvince": "Wyoming",
        "Postcode": "82939",
        "CountryID": 2,
        "Latitude": 41.2762551770365,
        "Longitude": -110.336263869746,
        "ContactTelephone1": "13077827888",
        "DistanceUnit": 0
    },
    "Connections": [
        {
            "ID": 181733,
            "ConnectionTypeID": 22,
            "StatusTypeID": 50,
            "LevelID": 1,
            "Quantity": 6
        },
        {
            "ID": 181734,
            "ConnectionTypeID": 10,
            "StatusTypeID": 50,
            "LevelID": 2,
            "Amps": 30,
            "Quantity": 1
        }
    ],
    "NumberOfPoints": 6,
    "GeneralComments": "May provide charging for non-guests, for a fee. Level 2 plug is of a L 14-30 type, located between cabins 2 and 3.",
    "StatusTypeID": 50,
    "DateLastStatusUpdate": "2019-07-30T09:11:00Z",
    "DataQualityLevel": 1,
    "DateCreated": "2019-07-27T09:46:00Z",
    "SubmissionStatusTypeID": 200
}