{
    "IsRecentlyVerified": false,
    "ID": 146553,
    "UUID": "15970EBC-6CC4-4804-A6E8-09A123122070",
    "DataProviderID": 1,
    "OperatorID": 3,
    "OperatorsReference": "PG-70142,PG-84072",
    "UsageTypeID": 4,
    "UsageCost": "Free",
    "AddressInfo": {
        "ID": 146905,
        "Title": "Tesco Extra-Ivybridge Lee Mill",
        "AddressLine1": "Lee Mill Industrial Estate",
        "Town": "Central Avenue",
        "StateOrProvince": "Ivybridge",
        "Postcode": "PL21 9PE",
        "CountryID": 1,
        "Latitude": 50.386316,
        "Longitude": -3.964258,
        "DistanceUnit": 0
    },
    "Connections": [
        {
            "ID": 203774,
            "ConnectionTypeID": 25,
            "StatusTypeID": 50,
            "LevelID": 2,
            "Amps": 32,
            "Voltage": 230,
            "PowerKW": 7,
            "CurrentTypeID": 10,
            "Quantity": 4
        }
    ],
    "NumberOfPoints": 4,
    "GeneralComments": "This is an open charge unit installed at the Tesco Extra super store at Lee Mill Industrial Estate, Central Avenue, Ivybridge",
    "StatusTypeID": 50,
    "DateLastStatusUpdate": "2020-01-11T10:56:00Z",
    "DataQualityLevel": 1,
    "DateCreated": "2020-01-11T01:29:00Z",
    "SubmissionStatusTypeID": 200
}