{
    "IsRecentlyVerified": false,
    "ID": 95775,
    "UUID": "B3440714-842F-4FEB-82D0-39B1EC5B4D3B",
    "DataProviderID": 1,
    "OperatorID": 3297,
    "UsageTypeID": 4,
    "AddressInfo": {
        "ID": 96121,
        "Title": "Matthäusgemeinde",
        "AddressLine1": "Am Pelz 75",
        "Town": "Darmstadt",
        "StateOrProvince": "Darmstadt",
        "Postcode": "64295",
        "CountryID": 87,
        "Latitude": 49.85204034527825,
        "Longitude": 8.634012892396198,
        "RelatedURL": "http://www.entega.de/energie-sparen/ladestation-elektroauto/",
        "DistanceUnit": 0
    },
    "Connections": [
        {
            "ID": 135675,
            "ConnectionTypeID": 25,
            "StatusTypeID": 50,
            "LevelID": 2,
            "Amps": 32,
            "Voltage": 400,
            "PowerKW": 22,
            "CurrentTypeID": 20,
            "Quantity": 2
        }
    ],
    "NumberOfPoints": 2,
    "GeneralComments": "24/7 verfügbar. Freischaltung mit Ladekarten des LastMileSolution Verbundes: Entega , PlugSurfing, New Motion",
    "StatusTypeID": 50,
    "DateLastStatusUpdate": "2017-11-24T07:00:00Z",
    "DataQualityLevel": 1,
    "DateCreated": "2017-11-24T07:00:00Z",
    "SubmissionStatusTypeID": 200
}