{
    "IsRecentlyVerified": false,
    "ID": 155660,
    "UUID": "817A1C97-E099-4B55-8B3B-96BA4FAAD9DE",
    "DataProviderID": 1,
    "OperatorID": 3389,
    "UsageTypeID": 1,
    "UsageCost": "$1.00/session+$0.32/minute",
    "AddressInfo": {
        "ID": 156014,
        "Title": "The Last Drop - Francis Energy",
        "AddressLine1": "5425 N Lincoln Blvd",
        "Town": "Oklahoma City",
        "StateOrProvince": "OK",
        "Postcode": "73105",
        "CountryID": 2,
        "Latitude": 35.5258267351592,
        "Longitude": -97.50383668965151,
        "AccessComments": "Use EVGateway App to manage charging",
        "RelatedURL": "https://francis.energy/",
        "DistanceUnit": 0
    },
    "Connections": [
        {
            "ID": 219178,
            "ConnectionTypeID": 32,
            "StatusTypeID": 50,
            "LevelID": 3,
            "Amps": 350,
            "Voltage": 950,
            "PowerKW": 200,
            "CurrentTypeID": 30,
            "Quantity": 2,
            "Comments": "BTCPower EVDSP-350-5-120-0-2-C-4-0"
        },
        {
            "ID": 219179,
            "ConnectionTypeID": 2,
            "StatusTypeID": 50,
            "LevelID": 3,
            "Amps": 50,
            "Voltage": 500,
            "PowerKW": 100,
            "CurrentTypeID": 30,
            "Quantity": 2,
            "Comments": "BTCPower EVDSP-350-5-120-0-2-C-4-0"
        }
    ],
    "NumberOfPoints": 2,
    "GeneralComments": "200kW HPC Chargers Provided by Francis Energy",
    "StatusTypeID": 50,
    "DateLastStatusUpdate": "2021-04-11T12:50:00Z",
    "DataQualityLevel": 1,
    "DateCreated": "2020-04-21T02:55:00Z",
    "SubmissionStatusTypeID": 200
}