{
    "IsRecentlyVerified": false,
    "ID": 173171,
    "UUID": "9CDF3332-F78D-47E3-9F5C-71667BBB59C1",
    "DataProviderID": 19,
    "DataProvidersReference": "7263",
    "AddressInfo": {
        "ID": 173530,
        "Title": "Henie Onstad Kunstsenter",
        "AddressLine1": "Sonja Henies vei 31",
        "Town": "HØVIKODDEN",
        "StateOrProvince": "Viken",
        "Postcode": "1311",
        "CountryID": 168,
        "Latitude": 59.88864,
        "Longitude": 10.55424,
        "AccessComments": "",
        "DistanceUnit": 0
    },
    "Connections": [
        {
            "ID": 265591,
            "ConnectionTypeID": 25,
            "Reference": "1",
            "LevelID": 3,
            "Amps": 32,
            "Voltage": 400,
            "PowerKW": 22,
            "CurrentTypeID": 30
        },
        {
            "ID": 265592,
            "ConnectionTypeID": 25,
            "Reference": "2",
            "LevelID": 3,
            "Amps": 32,
            "Voltage": 400,
            "PowerKW": 22,
            "CurrentTypeID": 30
        },
        {
            "ID": 265593,
            "ConnectionTypeID": 25,
            "Reference": "3",
            "LevelID": 3,
            "Amps": 32,
            "Voltage": 400,
            "PowerKW": 22,
            "CurrentTypeID": 30
        },
        {
            "ID": 265594,
            "ConnectionTypeID": 25,
            "Reference": "4",
            "LevelID": 3,
            "Amps": 32,
            "Voltage": 400,
            "PowerKW": 22,
            "CurrentTypeID": 30
        },
        {
            "ID": 265595,
            "ConnectionTypeID": 25,
            "Reference": "5",
            "LevelID": 3,
            "Amps": 32,
            "Voltage": 400,
            "PowerKW": 22,
            "CurrentTypeID": 30
        },
        {
            "ID": 265596,
            "ConnectionTypeID": 25,
            "Reference": "6",
            "LevelID": 3,
            "Amps": 32,
            "Voltage": 400,
            "PowerKW": 22,
            "CurrentTypeID": 30
        },
        {
            "ID": 265597,
            "ConnectionTypeID": 25,
            "Reference": "7",
            "LevelID": 3,
            "Amps": 32,
            "Voltage": 400,
            "PowerKW": 22,
            "CurrentTypeID": 30
        },
        {
            "ID": 265598,
            "ConnectionTypeID": 25,
            "Reference": "8",
            "LevelID": 3,
            "Amps": 32,
            "Voltage": 400,
            "PowerKW": 22,
            "CurrentTypeID": 30
        }
    ],
    "NumberOfPoints": 8,
    "StatusTypeID": 0,
    "DateLastStatusUpdate": "2021-03-24T05:11:00Z",
    "DataQualityLevel": 2,
    "DateCreated": "2021-03-03T09:02:00Z",
    "SubmissionStatusTypeID": 100
}