{
    "IsRecentlyVerified": false,
    "ID": 3346,
    "UUID": "0BC0A7CC-626F-4D42-AF6F-1147E2465BE5",
    "DataProviderID": 1,
    "OperatorID": 6,
    "UsageTypeID": 6,
    "AddressInfo": {
        "ID": 3347,
        "Title": "Chico Nissan",
        "AddressLine1": "575 Manzanita Avenue",
        "Town": "Chico",
        "StateOrProvince": "CA",
        "Postcode": "95926",
        "CountryID": 2,
        "Latitude": 39.7568,
        "Longitude": -121.8435,
        "ContactTelephone1": "530-891-1777",
        "DistanceUnit": 0
    },
    "Connections": [],
    "NumberOfPoints": 2,
    "GeneralComments": "Cost To Charge: Free Access Hours: Unknown",
    "DateLastStatusUpdate": "2019-12-15T06:07:00Z",
    "DateCreated": "2010-02-28T00:00:00Z",
    "SubmissionStatusTypeID": 200
}