{
    "IsRecentlyVerified": false,
    "ID": 116501,
    "UUID": "AEC76F83-04E2-4CEC-B885-596F71BF1EED",
    "DataProviderID": 1,
    "DataProvidersReference": "5090",
    "AddressInfo": {
        "ID": 116847,
        "Title": "Skistar Björnrike",
        "AddressLine1": "Björnvallsvägen 11",
        "Town": "VEMDALEN",
        "StateOrProvince": "JÄMTLAND",
        "Postcode": "84092",
        "CountryID": 216,
        "Latitude": 62.41449,
        "Longitude": 13.95178,
        "AccessComments": "",
        "DistanceUnit": 0
    },
    "Connections": [
        {
            "ID": 164777,
            "ConnectionTypeID": 0,
            "Reference": "1",
            "LevelID": 2,
            "Amps": 16,
            "Voltage": 400,
            "PowerKW": 11,
            "Comments": "Mode 3"
        },
        {
            "ID": 164778,
            "ConnectionTypeID": 0,
            "Reference": "2",
            "LevelID": 2,
            "Amps": 16,
            "Voltage": 230,
            "PowerKW": 3.7,
            "Comments": "Mode 3"
        }
    ],
    "NumberOfPoints": 2,
    "DateLastStatusUpdate": "2020-05-26T08:25:00Z",
    "DataQualityLevel": 2,
    "DateCreated": "2019-02-11T09:16:00Z",
    "SubmissionStatusTypeID": 100
}