{
    "IsRecentlyVerified": false,
    "ID": 128166,
    "UUID": "2F34B147-D21D-4449-928B-1FECB9B3A4BD",
    "DataProviderID": 1,
    "OperatorID": 150,
    "UsageTypeID": 5,
    "UsageCost": "£0.30/kWh",
    "AddressInfo": {
        "ID": 128512,
        "Title": "Lowry Outlet - Salford",
        "AddressLine1": "1 Lowry Plaza",
        "Town": "Salford",
        "Postcode": "M50 3UB",
        "CountryID": 1,
        "Latitude": 53.471442,
        "Longitude": -2.294555,
        "RelatedURL": "http://www.chargepointservices.co.uk",
        "DistanceUnit": 0
    },
    "Connections": [
        {
            "ID": 179347,
            "ConnectionTypeID": 25,
            "Reference": "1",
            "StatusTypeID": 50,
            "LevelID": 2,
            "Amps": 32,
            "Voltage": 400,
            "PowerKW": 22,
            "CurrentTypeID": 20,
            "Quantity": 2
        }
    ],
    "NumberOfPoints": 2,
    "StatusTypeID": 50,
    "DateLastStatusUpdate": "2019-06-17T13:31:00Z",
    "MetadataValues": [
        {
            "ID": 4510,
            "MetadataFieldID": 4,
            "ItemValue": "Contains public sector information licensed under the Open Government Licence v2.0. http://www.nationalarchives.gov.uk/doc/open-government-licence/version/2/"
        }
    ],
    "DataQualityLevel": 3,
    "DateCreated": "2019-06-17T06:40:00Z",
    "SubmissionStatusTypeID": 100
}