{
    "IsRecentlyVerified": false,
    "ID": 141417,
    "UUID": "8912A29C-F255-4607-9301-C5E849FA2C09",
    "DataProviderID": 2,
    "DataProvidersReference": "149193",
    "OperatorID": 15,
    "UsageTypeID": 1,
    "AddressInfo": {
        "ID": 141769,
        "Title": "Pike 7 Plaza- A1",
        "AddressLine1": "8350 Leesburg Pike",
        "Town": "Vienna",
        "StateOrProvince": "VA",
        "Postcode": "22182",
        "CountryID": 2,
        "Latitude": 38.921778,
        "Longitude": -77.236743,
        "ContactTelephone1": "877-455-3833",
        "AccessComments": "24 hours daily",
        "RelatedURL": "https://www.evgo.com/",
        "DistanceUnit": 0
    },
    "Connections": [
        {
            "ID": 197343,
            "ConnectionTypeID": 2,
            "LevelID": 3,
            "Amps": 100,
            "Voltage": 400,
            "PowerKW": 40,
            "CurrentTypeID": 30,
            "Quantity": 1
        },
        {
            "ID": 197344,
            "ConnectionTypeID": 32,
            "LevelID": 3,
            "Amps": 100,
            "Voltage": 400,
            "PowerKW": 40,
            "CurrentTypeID": 30,
            "Quantity": 1
        }
    ],
    "StatusTypeID": 50,
    "DateLastStatusUpdate": "2020-06-26T03:00:00Z",
    "DataQualityLevel": 3,
    "DateCreated": "2019-12-24T09:15:00Z",
    "SubmissionStatusTypeID": 100
}