{
    "IsRecentlyVerified": false,
    "ID": 14284,
    "UUID": "167516BB-468B-45C0-96BD-C2E2CC0A86F4",
    "DataProviderID": 2,
    "DataProvidersReference": "46755",
    "UsageTypeID": 2,
    "AddressInfo": {
        "ID": 14181,
        "Title": "A123 Systems",
        "AddressLine1": "76 Treble Cove Rd",
        "Town": "North Billerica",
        "StateOrProvince": "MA",
        "Postcode": "01862",
        "CountryID": 2,
        "Latitude": 42.577259,
        "Longitude": -71.289749,
        "ContactTelephone1": "",
        "AccessComments": "Employee use only",
        "RelatedURL": "",
        "DistanceUnit": 0
    },
    "Connections": [
        {
            "ID": 11740,
            "ConnectionTypeID": 1,
            "LevelID": 2,
            "Amps": 16,
            "Voltage": 230,
            "PowerKW": 3,
            "CurrentTypeID": 10,
            "Quantity": 3
        },
        {
            "ID": 21641,
            "ConnectionTypeID": 1,
            "LevelID": 2,
            "Quantity": 3
        }
    ],
    "DateLastStatusUpdate": "2019-04-06T05:05:00Z",
    "DataQualityLevel": 3,
    "DateCreated": "2012-12-06T16:49:00Z",
    "SubmissionStatusTypeID": 100
}