{
    "UserComments": [
        {
            "ID": 8278,
            "ChargePointID": 57709,
            "CommentTypeID": 10,
            "UserName": "Simon Hewison",
            "Comment": "Short bay (for a commercial vehicle), blocked by a trailer advocating hydrogen fuel cells.",
            "Rating": 2,
            "DateCreated": "2015-12-21T14:59:27.68Z",
            "User": {
                "ID": 4575,
                "Username": "Simon Hewison"
            },
            "CheckinStatusTypeID": 140
        }
    ],
    "IsRecentlyVerified": false,
    "ID": 57709,
    "UUID": "6929B323-D41F-42C1-895F-38E0E3CE0124",
    "DataProviderID": 1,
    "OperatorID": 45,
    "UsageTypeID": 1,
    "UsageCost": "Free",
    "AddressInfo": {
        "ID": 58055,
        "Title": "Camden Transport Services",
        "AddressLine1": "Freight Road",
        "AddressLine2": "off York Way",
        "Town": "London",
        "Postcode": "N1C 4BE",
        "CountryID": 1,
        "Latitude": 51.5405040833944,
        "Longitude": -0.126926303704866,
        "RelatedURL": "http://www.camden.gov.uk/ccm/cms-service/download/asset/?asset_id=2547726",
        "DistanceUnit": 0
    },
    "Connections": [
        {
            "ID": 73019,
            "ConnectionTypeID": 17,
            "StatusTypeID": 0,
            "LevelID": 2,
            "Amps": 32,
            "Voltage": 400,
            "PowerKW": 22,
            "CurrentTypeID": 20,
            "Quantity": 1
        }
    ],
    "NumberOfPoints": 1,
    "GeneralComments": "Elektromotive Elektrobay three-phase post, installed for charging light goods vehicles.",
    "StatusTypeID": 0,
    "DateLastStatusUpdate": "2015-12-21T14:59:00Z",
    "DataQualityLevel": 1,
    "DateCreated": "2015-12-17T13:05:00Z",
    "SubmissionStatusTypeID": 200
}