{
    "IsRecentlyVerified": false,
    "ID": 144988,
    "UUID": "8937ECA0-EF8D-44E1-BCD2-5830F31948E5",
    "DataProviderID": 2,
    "DataProvidersReference": "149422",
    "OperatorID": 89,
    "UsageTypeID": 1,
    "AddressInfo": {
        "ID": 145340,
        "Title": "Thetford Mines",
        "AddressLine1": "1065 rue du parc",
        "Town": "Thetford Mines",
        "StateOrProvince": "QC",
        "Postcode": "G6H 1A2",
        "CountryID": 44,
        "Latitude": 46.066937,
        "Longitude": -71.356812,
        "ContactTelephone1": "888-356-8911",
        "AccessComments": "24 hours daily",
        "RelatedURL": "https://flo.ca/",
        "DistanceUnit": 0
    },
    "Connections": [
        {
            "ID": 201554,
            "ConnectionTypeID": 1,
            "LevelID": 2,
            "Amps": 16,
            "Voltage": 230,
            "PowerKW": 3.7,
            "CurrentTypeID": 10,
            "Quantity": 1
        }
    ],
    "StatusTypeID": 50,
    "DateLastStatusUpdate": "2020-06-26T03:10:00Z",
    "DataQualityLevel": 3,
    "DateCreated": "2019-12-24T09:24:00Z",
    "SubmissionStatusTypeID": 100
}