{
    "IsRecentlyVerified": false,
    "ID": 103660,
    "UUID": "0FA60F3E-387B-4149-8A30-0EA459C1441B",
    "DataProviderID": 1,
    "OperatorID": 23,
    "OperatorsReference": "42463",
    "UsageTypeID": 4,
    "AddressInfo": {
        "ID": 104006,
        "Title": "Chocholowskie Termy",
        "AddressLine1": "Chocholow 400",
        "Town": "Chocholow",
        "Postcode": "34-513",
        "CountryID": 179,
        "Latitude": 49.3517902,
        "Longitude": 19.8209238,
        "ContactTelephone1": "+48 7813 00301",
        "DistanceUnit": 0
    },
    "Connections": [
        {
            "ID": 146330,
            "ConnectionTypeID": 30,
            "StatusTypeID": 50,
            "LevelID": 2,
            "Amps": 32,
            "Voltage": 400,
            "PowerKW": 22,
            "CurrentTypeID": 20,
            "Quantity": 1
        }
    ],
    "NumberOfPoints": 1,
    "GeneralComments": "1 Tesla Connector, up to 22kW.Available for customers. Please see front desk.",
    "StatusTypeID": 50,
    "DateLastStatusUpdate": "2018-10-03T20:26:00Z",
    "DataQualityLevel": 1,
    "DateCreated": "2018-05-05T05:48:00Z",
    "SubmissionStatusTypeID": 200
}