{
    "IsRecentlyVerified": false,
    "ID": 138334,
    "UUID": "605A5B2C-1390-4405-9488-16FF77A6F69A",
    "DataProviderID": 2,
    "DataProvidersReference": "143693",
    "OperatorID": 5,
    "UsageTypeID": 1,
    "AddressInfo": {
        "ID": 138683,
        "Title": "ZRSMGMT",
        "AddressLine1": "1915 Lakemont Avenue",
        "Town": "Orlando",
        "StateOrProvince": "FL",
        "Postcode": "32814",
        "CountryID": 2,
        "Latitude": 28.568875,
        "Longitude": -81.3270651,
        "ContactTelephone1": "888-758-4389",
        "AccessComments": "24 hours daily",
        "RelatedURL": "http://www.chargepoint.com/",
        "DistanceUnit": 0
    },
    "Connections": [
        {
            "ID": 193433,
            "ConnectionTypeID": 1,
            "LevelID": 2,
            "Amps": 16,
            "Voltage": 230,
            "PowerKW": 3,
            "CurrentTypeID": 10,
            "Quantity": 1
        }
    ],
    "StatusTypeID": 50,
    "DateLastStatusUpdate": "2019-12-24T09:08:00Z",
    "DataQualityLevel": 3,
    "DateCreated": "2019-12-24T09:08:00Z",
    "SubmissionStatusTypeID": 100
}