{
    "IsRecentlyVerified": false,
    "ID": 140506,
    "UUID": "97F1F948-4780-488F-ACA5-FFA87831829F",
    "DataProviderID": 2,
    "DataProvidersReference": "145557",
    "OperatorID": 5,
    "UsageTypeID": 1,
    "AddressInfo": {
        "ID": 140858,
        "Title": "7SPC",
        "AddressLine1": "201 N Roan St",
        "Town": "Johnson City",
        "StateOrProvince": "TN",
        "Postcode": "37601",
        "CountryID": 2,
        "Latitude": 36.319176,
        "Longitude": -82.35326,
        "ContactTelephone1": "888-758-4389",
        "AccessComments": "24 hours daily",
        "RelatedURL": "http://www.chargepoint.com/",
        "DistanceUnit": 0
    },
    "Connections": [
        {
            "ID": 196150,
            "ConnectionTypeID": 1,
            "LevelID": 2,
            "Amps": 16,
            "Voltage": 230,
            "PowerKW": 3.7,
            "CurrentTypeID": 10,
            "Quantity": 2
        }
    ],
    "StatusTypeID": 50,
    "DateLastStatusUpdate": "2020-06-26T02:58:00Z",
    "DataQualityLevel": 3,
    "DateCreated": "2019-12-24T09:13:00Z",
    "SubmissionStatusTypeID": 100
}