{
    "IsRecentlyVerified": false,
    "ID": 118094,
    "UUID": "75C68E2E-81E1-4D3F-A495-10A26B8B85F2",
    "DataProviderID": 1,
    "OperatorID": 23,
    "OperatorsReference": "43712",
    "UsageTypeID": 4,
    "UsageCost": "$0.22/kWh; other tariffs for older cars",
    "AddressInfo": {
        "ID": 118440,
        "Title": "Orlando, FL - North Alafaya Trail Supercharger",
        "AddressLine1": "413 North Alafaya Trail",
        "Town": "Orlando",
        "StateOrProvince": "FL",
        "Postcode": "32828",
        "CountryID": 2,
        "Latitude": 28.555349,
        "Longitude": -81.199006,
        "DistanceUnit": 0
    },
    "Connections": [
        {
            "ID": 167113,
            "ConnectionTypeID": 27,
            "StatusTypeID": 50,
            "LevelID": 3,
            "PowerKW": 120,
            "CurrentTypeID": 30,
            "Quantity": 14
        }
    ],
    "NumberOfPoints": 14,
    "GeneralComments": "Charging14 Superchargers, available 24/7, up to 120kW",
    "StatusTypeID": 50,
    "DateLastStatusUpdate": "2019-03-14T23:31:00Z",
    "DataQualityLevel": 1,
    "DateCreated": "2019-03-14T23:31:00Z",
    "SubmissionStatusTypeID": 200
}