{
    "IsRecentlyVerified": true,
    "DateLastVerified": "2021-10-05T15:21:00Z",
    "ID": 189501,
    "UUID": "082D5821-B932-4B8E-B3D2-A19A9D66AB5A",
    "DataProviderID": 1,
    "OperatorID": 3371,
    "UsageTypeID": 4,
    "UsageCost": "",
    "AddressInfo": {
        "ID": 189860,
        "Title": "Grijota Golf",
        "AddressLine1": "",
        "Town": "Grijota",
        "StateOrProvince": "Castile and León",
        "Postcode": "34192",
        "CountryID": 210,
        "Latitude": 42.04818762966053,
        "Longitude": -4.577420591326472,
        "RelatedURL": "http://wenea.com",
        "DistanceUnit": 0
    },
    "Connections": [
        {
            "ID": 306517,
            "ConnectionTypeID": 33,
            "StatusTypeID": 50,
            "LevelID": 3,
            "Amps": 400,
            "Voltage": 920,
            "PowerKW": 100,
            "CurrentTypeID": 30,
            "Quantity": 2
        },
        {
            "ID": 306518,
            "ConnectionTypeID": 2,
            "StatusTypeID": 50,
            "LevelID": 3,
            "Amps": 125,
            "Voltage": 500,
            "PowerKW": 50,
            "CurrentTypeID": 30,
            "Quantity": 1
        },
        {
            "ID": 306519,
            "ConnectionTypeID": 25,
            "StatusTypeID": 50,
            "LevelID": 2,
            "Amps": 32,
            "Voltage": 400,
            "PowerKW": 22,
            "CurrentTypeID": 20,
            "Quantity": 1
        }
    ],
    "NumberOfPoints": 2,
    "StatusTypeID": 50,
    "DateLastStatusUpdate": "2021-10-08T15:23:00Z",
    "DataQualityLevel": 1,
    "DateCreated": "2021-10-05T15:21:00Z",
    "SubmissionStatusTypeID": 200
}