{
    "IsRecentlyVerified": false,
    "ID": 142583,
    "UUID": "277DAA5D-78D4-4033-A67F-CD40B6D3B287",
    "DataProviderID": 2,
    "DataProvidersReference": "122437",
    "OperatorID": 23,
    "UsageTypeID": 1,
    "AddressInfo": {
        "ID": 142935,
        "Title": "Fairfield Inn and Suites Fair Oaks Farms - Tesla Destination",
        "AddressLine1": "708 N 600 E",
        "Town": "Fair Oaks",
        "StateOrProvince": "IN",
        "Postcode": "47943",
        "CountryID": 2,
        "Latitude": 41.033639,
        "Longitude": -87.276211,
        "ContactTelephone1": "219-394-2100  877-798-3752",
        "AccessComments": "24 hours daily; for customer use only; see front desk for access",
        "RelatedURL": "https://www.tesla.com/destination-charging",
        "DistanceUnit": 0
    },
    "Connections": [
        {
            "ID": 198751,
            "ConnectionTypeID": 30,
            "LevelID": 2,
            "Amps": 16,
            "Voltage": 230,
            "PowerKW": 3.7,
            "CurrentTypeID": 10,
            "Quantity": 2
        }
    ],
    "StatusTypeID": 50,
    "DateLastStatusUpdate": "2020-06-26T03:03:00Z",
    "DataQualityLevel": 3,
    "DateCreated": "2019-12-24T09:18:00Z",
    "SubmissionStatusTypeID": 100
}