{
    "IsRecentlyVerified": false,
    "ID": 94876,
    "UUID": "06690BB7-7557-4328-84A7-3DBA85C15157",
    "DataProviderID": 1,
    "DataProvidersReference": "4380",
    "AddressInfo": {
        "ID": 95222,
        "Title": "Pendlarparkering Hässleholm Norra stationsområdet",
        "AddressLine1": "Maskingatan 4",
        "Town": "HÄSSLEHOLM",
        "StateOrProvince": "SKÅNE",
        "Postcode": "28148",
        "CountryID": 216,
        "Latitude": 56.15865,
        "Longitude": 13.76227,
        "AccessComments": "Pendlarparkering vid Norra stationsområdet i Hässleholm",
        "DistanceUnit": 0
    },
    "Connections": [
        {
            "ID": 134119,
            "ConnectionTypeID": 0,
            "Reference": "1",
            "LevelID": 2,
            "Amps": 32,
            "Voltage": 400,
            "PowerKW": 22,
            "Comments": "Mode 3"
        },
        {
            "ID": 134120,
            "ConnectionTypeID": 0,
            "Reference": "2",
            "LevelID": 2,
            "Amps": 32,
            "Voltage": 400,
            "PowerKW": 22,
            "Comments": "Mode 3"
        }
    ],
    "NumberOfPoints": 2,
    "DateLastStatusUpdate": "2020-05-26T08:21:00Z",
    "DataQualityLevel": 2,
    "DateCreated": "2017-10-28T13:36:00Z",
    "SubmissionStatusTypeID": 100
}