{
    "IsRecentlyVerified": false,
    "ID": 57104,
    "UUID": "41EC9AB9-8E1E-40B7-885B-2E15F54B8499",
    "DataProviderID": 1,
    "OperatorID": 105,
    "UsageTypeID": 4,
    "AddressInfo": {
        "ID": 57450,
        "Title": "Rathaus",
        "AddressLine1": "Am Rathaus",
        "Town": "Ostbevern",
        "StateOrProvince": "Kreis Warendorf",
        "Postcode": "48346",
        "CountryID": 87,
        "Latitude": 52.0352081,
        "Longitude": 7.838821800000005,
        "ContactTelephone1": "+49 2504 7006-0",
        "AccessComments": "Rund um die Uhr (24/7) nutzbar Eintrag lt. Info Verzeichnis RWE und Pressemeldung siehe Webseite.\r\n",
        "RelatedURL": "http://www.wn.de/Muensterland/Kreis-Warendorf/Ostbevern/2182473-Stromtankstelle-Strom-aus-der-Saeule",
        "DistanceUnit": 0
    },
    "Connections": [
        {
            "ID": 72151,
            "ConnectionTypeID": 25,
            "StatusTypeID": 50,
            "LevelID": 2,
            "PowerKW": 22,
            "CurrentTypeID": 20,
            "Quantity": 2
        },
        {
            "ID": 72152,
            "ConnectionTypeID": 28,
            "StatusTypeID": 50,
            "LevelID": 2,
            "PowerKW": 3.7,
            "CurrentTypeID": 10,
            "Quantity": 0
        }
    ],
    "NumberOfPoints": 2,
    "StatusTypeID": 50,
    "DateLastStatusUpdate": "2015-11-23T08:31:00Z",
    "DataQualityLevel": 1,
    "DateCreated": "2015-11-23T08:31:00Z",
    "SubmissionStatusTypeID": 200
}