{
    "IsRecentlyVerified": false,
    "ID": 119714,
    "UUID": "A2B9F42F-A1C8-47F3-B1F8-0F395A09A34A",
    "DataProviderID": 2,
    "DataProvidersReference": "39717",
    "UsageTypeID": 7,
    "AddressInfo": {
        "ID": 120060,
        "Title": "Ed Hicks Nissan",
        "AddressLine1": "3000 S Padre Island Dr",
        "Town": "Corpus Christi",
        "StateOrProvince": "TX",
        "Postcode": "78415",
        "CountryID": 2,
        "Latitude": 27.73082,
        "Longitude": -97.416019,
        "ContactTelephone1": "361-854-1955",
        "AccessComments": "Dealership business hours\r\nPublic - Call ahead",
        "RelatedURL": "",
        "DistanceUnit": 0
    },
    "Connections": [
        {
            "ID": 168995,
            "ConnectionTypeID": 1,
            "LevelID": 2,
            "Amps": 16,
            "Voltage": 230,
            "PowerKW": 3.7,
            "CurrentTypeID": 10,
            "Quantity": 1
        }
    ],
    "DateLastStatusUpdate": "2020-06-26T02:52:00Z",
    "DataQualityLevel": 3,
    "DateCreated": "2019-04-01T04:59:00Z",
    "SubmissionStatusTypeID": 100
}