{
    "IsRecentlyVerified": false,
    "ID": 184578,
    "UUID": "2D7BB93E-0CF5-45D1-B7B3-3D6A9ECC2904",
    "DataProviderID": 29,
    "DataProvidersReference": "15577",
    "AddressInfo": {
        "ID": 184937,
        "Title": "Kietz 9",
        "AddressLine1": "Kietz 9",
        "Town": "Lunow-Stolzenhagen",
        "Postcode": "16248",
        "CountryID": 87,
        "Latitude": 52.948939,
        "Longitude": 14.108532,
        "DistanceUnit": 0
    },
    "Connections": [
        {
            "ID": 293016,
            "ConnectionTypeID": 25,
            "StatusTypeID": 50,
            "LevelID": 2,
            "PowerKW": 22,
            "CurrentTypeID": 20
        },
        {
            "ID": 293017,
            "ConnectionTypeID": 25,
            "StatusTypeID": 50,
            "LevelID": 2,
            "PowerKW": 22,
            "CurrentTypeID": 20
        }
    ],
    "StatusTypeID": 50,
    "DateLastStatusUpdate": "2021-07-09T03:28:00Z",
    "MetadataValues": [
        {
            "ID": 16869,
            "MetadataFieldID": 4,
            "ItemValue": "Data from the German chargepoint registry provided by Bundesnetzagentur.de under the CC-BY 4.0 license"
        }
    ],
    "DataQualityLevel": 3,
    "DateCreated": "2021-07-08T10:05:00Z",
    "SubmissionStatusTypeID": 100
}