{
    "IsRecentlyVerified": false,
    "ID": 41640,
    "UUID": "E345F3FD-FC06-4074-951B-F9A418C0BB49",
    "DataProviderID": 26,
    "DataProvidersReference": "50705",
    "OperatorID": 180,
    "OperatorsReference": "Alfen GDH1192",
    "UsageCost": "0.00 jaarabonnement",
    "AddressInfo": {
        "ID": 41986,
        "Title": "Van Limburg Stirumstraat 1",
        "AddressLine1": "Van Limburg Stirumstraat 1",
        "Town": "Den Haag",
        "Postcode": "2515 PA",
        "CountryID": 159,
        "Latitude": 52.072052,
        "Longitude": 4.319676,
        "ContactTelephone1": "036 - 549 34 00",
        "RelatedURL": "http://www.icu-charging-stations.com/",
        "DistanceUnit": 0
    },
    "Connections": [
        {
            "ID": 45625,
            "ConnectionTypeID": 25,
            "LevelID": 2,
            "PowerKW": 11,
            "CurrentTypeID": 10
        },
        {
            "ID": 45626,
            "ConnectionTypeID": 25,
            "LevelID": 2,
            "PowerKW": 11,
            "CurrentTypeID": 10
        }
    ],
    "NumberOfPoints": 1,
    "StatusTypeID": 50,
    "DateLastStatusUpdate": "2016-06-04T02:46:00Z",
    "DataQualityLevel": 3,
    "DateCreated": "2015-02-09T03:25:00Z",
    "SubmissionStatusTypeID": 100
}