{
    "IsRecentlyVerified": false,
    "ID": 174273,
    "UUID": "0643CF2D-5F34-499F-9B04-2F5BDA363F8F",
    "DataProviderID": 19,
    "DataProvidersReference": "7425",
    "AddressInfo": {
        "ID": 174632,
        "Title": "Resecentrum",
        "AddressLine1": "Stationsgatan 6 ",
        "Town": "SANDVIKEN",
        "StateOrProvince": "GÄVLEBORG",
        "Postcode": "81133",
        "CountryID": 216,
        "Latitude": 60.615092,
        "Longitude": 16.781586,
        "AccessComments": "Parkering östra delen",
        "DistanceUnit": 0
    },
    "Connections": [
        {
            "ID": 269687,
            "ConnectionTypeID": 25,
            "Reference": "1",
            "LevelID": 3,
            "Amps": 32,
            "Voltage": 400,
            "PowerKW": 22,
            "CurrentTypeID": 30,
            "Comments": "Mode 3"
        },
        {
            "ID": 269688,
            "ConnectionTypeID": 25,
            "Reference": "2",
            "LevelID": 3,
            "Amps": 32,
            "Voltage": 400,
            "PowerKW": 22,
            "CurrentTypeID": 30,
            "Comments": "Mode 3"
        },
        {
            "ID": 269689,
            "ConnectionTypeID": 25,
            "Reference": "3",
            "LevelID": 3,
            "Amps": 32,
            "Voltage": 400,
            "PowerKW": 22,
            "CurrentTypeID": 30,
            "Comments": "Mode 3"
        },
        {
            "ID": 269690,
            "ConnectionTypeID": 25,
            "Reference": "4",
            "LevelID": 3,
            "Amps": 32,
            "Voltage": 400,
            "PowerKW": 22,
            "CurrentTypeID": 30,
            "Comments": "Mode 3"
        },
        {
            "ID": 269691,
            "ConnectionTypeID": 25,
            "Reference": "5",
            "LevelID": 3,
            "Amps": 32,
            "Voltage": 400,
            "PowerKW": 22,
            "CurrentTypeID": 30,
            "Comments": "Mode 3"
        },
        {
            "ID": 269692,
            "ConnectionTypeID": 25,
            "Reference": "6",
            "LevelID": 3,
            "Amps": 32,
            "Voltage": 400,
            "PowerKW": 22,
            "CurrentTypeID": 30,
            "Comments": "Mode 3"
        }
    ],
    "NumberOfPoints": 6,
    "StatusTypeID": 0,
    "DateLastStatusUpdate": "2021-03-24T05:12:00Z",
    "DataQualityLevel": 2,
    "DateCreated": "2021-03-24T05:12:00Z",
    "SubmissionStatusTypeID": 100
}