{
    "IsRecentlyVerified": false,
    "ID": 99828,
    "UUID": "3BF1CA4C-CA2B-4727-BC80-061A1FB213E7",
    "DataProviderID": 1,
    "OperatorID": 23,
    "OperatorsReference": "40406",
    "UsageTypeID": 4,
    "AddressInfo": {
        "ID": 100174,
        "Title": "Hof Van Reyen Zaal Brouwerij",
        "AddressLine1": "Veldkant 14 - Parking 1",
        "Town": "Boechout",
        "Postcode": "2530",
        "CountryID": 26,
        "Latitude": 51.169867,
        "Longitude": 4.483727,
        "ContactTelephone1": "+32 34550894",
        "DistanceUnit": 0
    },
    "Connections": [
        {
            "ID": 141045,
            "ConnectionTypeID": 30,
            "StatusTypeID": 50,
            "LevelID": 2,
            "Amps": 32,
            "Voltage": 230,
            "PowerKW": 17,
            "CurrentTypeID": 20,
            "Quantity": 1
        }
    ],
    "NumberOfPoints": 1,
    "GeneralComments": "1 Tesla Connector, up to 17kW.Available for customers. Please call ahead.",
    "StatusTypeID": 50,
    "DateLastStatusUpdate": "2018-10-03T14:05:00Z",
    "DataQualityLevel": 1,
    "DateCreated": "2018-02-06T06:42:00Z",
    "SubmissionStatusTypeID": 200
}