{
    "IsRecentlyVerified": false,
    "ID": 92824,
    "UUID": "23055E33-8225-4F7C-85B5-E2538AB0F641",
    "DataProviderID": 1,
    "OperatorID": 45,
    "UsageTypeID": 1,
    "AddressInfo": {
        "ID": 93170,
        "Title": "E-Bike Station Hauptstraße",
        "AddressLine1": "Hauptstraße 48",
        "Town": "Leupoldsgrün",
        "StateOrProvince": "Schauenstein",
        "Postcode": "95191",
        "CountryID": 87,
        "Latitude": 50.29451480541457,
        "Longitude": 11.799265687766267,
        "ContactTelephone1": "+49 9292 415",
        "AccessComments": "Am weißen Gebäuse mit dem roten Schild Feuerwehr. Durchgehend nutzbare Ladestation direkt unter dem Schild.",
        "RelatedURL": "https://www.leupoldsgruen.de/",
        "DistanceUnit": 0
    },
    "Connections": [
        {
            "ID": 131489,
            "ConnectionTypeID": 28,
            "StatusTypeID": 50,
            "LevelID": 2,
            "Amps": 16,
            "Voltage": 230,
            "PowerKW": 3.7,
            "CurrentTypeID": 10,
            "Quantity": 2
        }
    ],
    "NumberOfPoints": 2,
    "StatusTypeID": 50,
    "DateLastStatusUpdate": "2017-09-11T11:14:00Z",
    "DataQualityLevel": 1,
    "DateCreated": "2017-09-11T11:14:00Z",
    "SubmissionStatusTypeID": 200
}