{
    "IsRecentlyVerified": false,
    "ID": 52599,
    "UUID": "23A19874-4B74-42AE-8CC7-DF3AFC6169E4",
    "DataProviderID": 1,
    "OperatorID": 1,
    "UsageTypeID": 0,
    "AddressInfo": {
        "ID": 52945,
        "Title": "MILAKO, spol. s r. o.",
        "AddressLine1": "Bedrč 14",
        "Town": "Bedrč",
        "StateOrProvince": "okres Benešov",
        "Postcode": "25601",
        "CountryID": 64,
        "Latitude": 49.8008828,
        "Longitude": 14.726818099999946,
        "ContactTelephone1": "+420 728 352 187",
        "ContactTelephone2": "+420 777 602 602",
        "ContactEmail": "milako.sro@seznam.cz",
        "RelatedURL": "http://www.univerzalbazar.wz.cz",
        "DistanceUnit": 0
    },
    "Connections": [
        {
            "ID": 65335,
            "ConnectionTypeID": 17,
            "StatusTypeID": 0,
            "LevelID": 2,
            "Amps": 32,
            "Voltage": 400,
            "PowerKW": 22,
            "CurrentTypeID": 20,
            "Quantity": 1
        },
        {
            "ID": 65336,
            "ConnectionTypeID": 23,
            "StatusTypeID": 0,
            "LevelID": 2,
            "Amps": 16,
            "Voltage": 230,
            "PowerKW": 3.6,
            "CurrentTypeID": 10,
            "Quantity": 1
        }
    ],
    "NumberOfPoints": 1,
    "GeneralComments": "Po - Pá 09:00 - 17:00\r\nSo 9:00 - 13:00",
    "StatusTypeID": 0,
    "DateLastStatusUpdate": "2015-09-04T09:07:00Z",
    "DataQualityLevel": 1,
    "DateCreated": "2015-09-04T09:07:00Z",
    "SubmissionStatusTypeID": 200
}