{
    "IsRecentlyVerified": false,
    "ID": 149878,
    "UUID": "BDB210DF-0DFA-4363-9FA4-02EFB4C5BF6C",
    "DataProviderID": 1,
    "OperatorID": 23,
    "OperatorsReference": "52661",
    "UsageTypeID": 4,
    "UsageCost": "$0.24/kWh; other tariffs for older cars",
    "AddressInfo": {
        "ID": 150231,
        "Title": "Chestertown, Ny Supercharger",
        "AddressLine1": "6151 Ny-8",
        "Town": "Chestertown",
        "StateOrProvince": "NY",
        "Postcode": "12817",
        "CountryID": 2,
        "Latitude": 43.665428,
        "Longitude": -73.784215,
        "DistanceUnit": 0
    },
    "Connections": [
        {
            "ID": 208099,
            "ConnectionTypeID": 27,
            "StatusTypeID": 50,
            "LevelID": 3,
            "PowerKW": 120,
            "CurrentTypeID": 30,
            "Quantity": 6
        }
    ],
    "NumberOfPoints": 6,
    "GeneralComments": "Charging6 Superchargers, available 24/7, up to 250kW",
    "StatusTypeID": 50,
    "DateLastStatusUpdate": "2020-03-08T06:44:00Z",
    "DataQualityLevel": 1,
    "DateCreated": "2020-03-08T06:44:00Z",
    "SubmissionStatusTypeID": 200
}