{
    "IsRecentlyVerified": false,
    "ID": 80202,
    "UUID": "E8947F9B-F895-4186-90B5-3C145D2B0F4A",
    "DataProviderID": 2,
    "DataProvidersReference": "80564",
    "UsageTypeID": 1,
    "AddressInfo": {
        "ID": 80548,
        "Title": "Priority Toyota",
        "AddressLine1": "2301 W Mercury Blvd",
        "Town": "Hampton",
        "StateOrProvince": "VA",
        "Postcode": "23666",
        "CountryID": 2,
        "Latitude": 37.037491,
        "Longitude": -76.406188,
        "ContactTelephone1": "757-838-5000",
        "AccessComments": "24 hours daily",
        "RelatedURL": "",
        "DistanceUnit": 0
    },
    "Connections": [
        {
            "ID": 114869,
            "ConnectionTypeID": 1,
            "LevelID": 2,
            "Amps": 16,
            "Voltage": 230,
            "PowerKW": 3,
            "CurrentTypeID": 10,
            "Quantity": 2
        }
    ],
    "DateLastStatusUpdate": "2019-04-06T04:02:00Z",
    "DataQualityLevel": 3,
    "DateCreated": "2017-01-31T01:05:00Z",
    "SubmissionStatusTypeID": 100
}