{
    "MediaItems": [
        {
            "ID": 28257,
            "ChargePointID": 175857,
            "ItemURL": "https://s3-ap-southeast-2.amazonaws.com/openchargemap/images/DE/OCM175857/OCM-175857.orig.2021062117161569.jpg",
            "ItemThumbnailURL": "https://s3-ap-southeast-2.amazonaws.com/openchargemap/images/DE/OCM175857/OCM-175857.thmb.2021062117161569.jpg",
            "Comment": "",
            "IsEnabled": true,
            "IsVideo": false,
            "IsFeaturedItem": false,
            "IsExternalResource": false,
            "User": {
                "ID": 32810,
                "Username": "Tom_Fred"
            },
            "DateCreated": "2021-06-21T17:16:00Z"
        }
    ],
    "IsRecentlyVerified": false,
    "ID": 175857,
    "UUID": "C5E7F53F-F7B8-475D-8A5D-4F374B8FE00E",
    "DataProviderID": 1,
    "OperatorID": 2244,
    "UsageTypeID": 4,
    "AddressInfo": {
        "ID": 176216,
        "Title": "ubitricity Laterne Lentzeallee",
        "AddressLine1": "2 Lentzeallee",
        "Town": "Berlin",
        "StateOrProvince": "Berlin",
        "Postcode": "14195",
        "CountryID": 87,
        "Latitude": 52.470524993198865,
        "Longitude": 13.290863028199965,
        "DistanceUnit": 0
    },
    "Connections": [
        {
            "ID": 273089,
            "ConnectionTypeID": 25,
            "StatusTypeID": 50,
            "LevelID": 2,
            "Amps": 16,
            "Voltage": 230,
            "PowerKW": 3.7,
            "CurrentTypeID": 10,
            "Quantity": 1
        }
    ],
    "NumberOfPoints": 1,
    "StatusTypeID": 50,
    "DateLastStatusUpdate": "2021-06-21T17:16:00Z",
    "DataQualityLevel": 1,
    "DateCreated": "2021-06-16T17:55:00Z",
    "SubmissionStatusTypeID": 200
}