{
    "IsRecentlyVerified": false,
    "ID": 36812,
    "UUID": "742E25AD-B8E0-48EE-95F0-CBE83033D0BB",
    "DataProviderID": 26,
    "DataProvidersReference": "48225",
    "OperatorID": 178,
    "OperatorsReference": "EVnetNL EV0111",
    "UsageCost": "0.00 jaarabonnement",
    "AddressInfo": {
        "ID": 37158,
        "Title": "Waterlelieplantsoen 34",
        "AddressLine1": "Waterlelieplantsoen 34",
        "Town": "Haarlemmermeer",
        "Postcode": "2165 XM",
        "CountryID": 159,
        "Latitude": 52.258106,
        "Longitude": 4.576146,
        "ContactTelephone1": "0800-3522365",
        "RelatedURL": "http://www.evnet.nl",
        "DistanceUnit": 0
    },
    "Connections": [
        {
            "ID": 40323,
            "ConnectionTypeID": 25,
            "LevelID": 2,
            "PowerKW": 11,
            "CurrentTypeID": 10
        }
    ],
    "NumberOfPoints": 1,
    "StatusTypeID": 50,
    "DateLastStatusUpdate": "2016-06-04T02:52:00Z",
    "DataQualityLevel": 3,
    "DateCreated": "2015-01-09T06:07:00Z",
    "SubmissionStatusTypeID": 100
}