{
    "IsRecentlyVerified": false,
    "ID": 187777,
    "UUID": "E724A78B-7A98-49C2-A4F6-D0A02E0B8E15",
    "DataProviderID": 18,
    "DataProvidersReference": "f254f3ef81e5a81e22b75511504e6b8b",
    "OperatorID": 3345,
    "UsageTypeID": 5,
    "AddressInfo": {
        "ID": 188136,
        "Title": "HA2 9UU",
        "AddressLine1": "",
        "Town": "London",
        "Postcode": "HA2 9UU",
        "CountryID": 1,
        "Latitude": 51.571122,
        "Longitude": -0.365707,
        "AccessComments": "",
        "RelatedURL": "https://char.gy",
        "DistanceUnit": 0
    },
    "Connections": [
        {
            "ID": 303029,
            "ConnectionTypeID": 25,
            "Reference": "530",
            "StatusTypeID": 50,
            "LevelID": 2,
            "Amps": 16,
            "Voltage": 230,
            "PowerKW": 3.7,
            "CurrentTypeID": 10
        }
    ],
    "StatusTypeID": 0,
    "DateLastStatusUpdate": "2021-07-12T03:38:00Z",
    "MetadataValues": [
        {
            "ID": 20017,
            "MetadataFieldID": 4,
            "ItemValue": "Contains public sector information licensed under the Open Government Licence v2.0. http://www.nationalarchives.gov.uk/doc/open-government-licence/version/2/"
        }
    ],
    "DataQualityLevel": 3,
    "DateCreated": "2021-07-12T03:38:00Z",
    "SubmissionStatusTypeID": 100
}