{
    "IsRecentlyVerified": false,
    "ID": 90238,
    "UUID": "CCB117F5-10A8-4DD5-A179-49CA2AB855BE",
    "DataProviderID": 1,
    "OperatorID": 23,
    "OperatorsReference": "28753",
    "UsageTypeID": 4,
    "UsageCost": "€0.24/kWh; Autres tarifs pour les voitures anciennes",
    "AddressInfo": {
        "ID": 90584,
        "Title": "Val-de-Meuse Supercharger",
        "AddressLine1": "D132",
        "Town": "Val-de-Meuse",
        "Postcode": "52140",
        "CountryID": 80,
        "Latitude": 47.99147,
        "Longitude": 5.51296,
        "DistanceUnit": 0
    },
    "Connections": [
        {
            "ID": 127891,
            "ConnectionTypeID": 27,
            "StatusTypeID": 50,
            "LevelID": 3,
            "PowerKW": 120,
            "CurrentTypeID": 30,
            "Quantity": 16
        }
    ],
    "NumberOfPoints": 16,
    "GeneralComments": "Charging16 Superchargers, available 24/7",
    "StatusTypeID": 50,
    "DateLastStatusUpdate": "2019-03-22T19:01:00Z",
    "DataQualityLevel": 1,
    "DateCreated": "2017-07-13T14:25:00Z",
    "SubmissionStatusTypeID": 200
}