{
    "IsRecentlyVerified": false,
    "ID": 5769,
    "UUID": "EFA2CCF0-BD87-4FE7-A762-53E687E09225",
    "DataProviderID": 1,
    "OperatorID": 32,
    "OperatorsReference": "346",
    "UsageTypeID": 4,
    "UsageCost": "Inclusive; for Polar Plus subscription members only",
    "AddressInfo": {
        "ID": 5691,
        "Title": "Harrow Civic Centre Car Park",
        "AddressLine1": "Station Road",
        "Town": "Harrow",
        "Postcode": "HA1 2XY",
        "CountryID": 1,
        "Latitude": 51.5890385,
        "Longitude": -0.3339929,
        "ContactTelephone1": "0845 850 0653",
        "RelatedURL": "https://www.sourcelondon.net/",
        "DistanceUnit": 0
    },
    "Connections": [
        {
            "ID": 518,
            "ConnectionTypeID": 3,
            "StatusTypeID": 50,
            "LevelID": 2,
            "Amps": 13,
            "Voltage": 230,
            "PowerKW": 3,
            "CurrentTypeID": 10,
            "Quantity": 2
        }
    ],
    "NumberOfPoints": 2,
    "StatusTypeID": 50,
    "DateLastStatusUpdate": "2019-03-05T06:13:00Z",
    "DataQualityLevel": 1,
    "DateCreated": "2011-09-12T11:40:00Z",
    "SubmissionStatusTypeID": 200
}