{
    "IsRecentlyVerified": false,
    "ID": 176608,
    "UUID": "C4538E14-61C4-433C-899A-623C9B35C094",
    "DataProviderID": 29,
    "DataProvidersReference": "12769",
    "OperatorID": 69,
    "AddressInfo": {
        "ID": 176967,
        "Title": "Baaderstr. 52",
        "AddressLine1": "Baaderstr. 52",
        "Town": "München",
        "Postcode": "80469",
        "CountryID": 87,
        "Latitude": 48.129772,
        "Longitude": 11.577498,
        "DistanceUnit": 0
    },
    "Connections": [
        {
            "ID": 274715,
            "ConnectionTypeID": 25,
            "StatusTypeID": 50,
            "LevelID": 2,
            "PowerKW": 22,
            "CurrentTypeID": 20
        },
        {
            "ID": 274716,
            "ConnectionTypeID": 25,
            "StatusTypeID": 50,
            "LevelID": 2,
            "PowerKW": 22,
            "CurrentTypeID": 20
        }
    ],
    "StatusTypeID": 0,
    "DateLastStatusUpdate": "2021-07-12T02:40:00Z",
    "MetadataValues": [
        {
            "ID": 8903,
            "MetadataFieldID": 4,
            "ItemValue": "Data from the German chargepoint registry provided by Bundesnetzagentur.de under the CC-BY 4.0 license"
        }
    ],
    "DataQualityLevel": 3,
    "DateCreated": "2021-07-08T09:48:00Z",
    "SubmissionStatusTypeID": 100
}