{
    "IsRecentlyVerified": false,
    "ID": 134427,
    "UUID": "5181A970-5E95-4A23-857D-A3F39C35793B",
    "DataProviderID": 1,
    "OperatorID": 23,
    "OperatorsReference": "34612",
    "UsageTypeID": 4,
    "UsageCost": "$0.22/kWh; other tariffs for older cars",
    "AddressInfo": {
        "ID": 134773,
        "Title": "Portland, Me Supercharger",
        "AddressLine1": "295 Forest Avenue",
        "Town": "Portland",
        "StateOrProvince": "ME",
        "Postcode": "04101",
        "CountryID": 2,
        "Latitude": 43.664439,
        "Longitude": -70.269546,
        "DistanceUnit": 0
    },
    "Connections": [
        {
            "ID": 188152,
            "ConnectionTypeID": 27,
            "StatusTypeID": 50,
            "LevelID": 3,
            "PowerKW": 120,
            "CurrentTypeID": 30,
            "Quantity": 12
        }
    ],
    "NumberOfPoints": 12,
    "GeneralComments": "Charging12 Superchargers, available 24/7, up to 150kW",
    "StatusTypeID": 50,
    "DateLastStatusUpdate": "2019-11-11T18:25:00Z",
    "DataQualityLevel": 1,
    "DateCreated": "2019-11-11T18:25:00Z",
    "SubmissionStatusTypeID": 200
}