{
    "IsRecentlyVerified": false,
    "ID": 153084,
    "UUID": "C8CC4029-5CBC-49DF-94D8-F7F4D01847B8",
    "DataProviderID": 28,
    "DataProvidersReference": "FR*S49*P49103*001",
    "UsageTypeID": 5,
    "AddressInfo": {
        "ID": 153437,
        "Title": "COMBREE - Place du Commerce",
        "AddressLine1": "Place du Commerce 49520 COMBREE",
        "CountryID": 80,
        "Latitude": 47.711017,
        "Longitude": -0.989022,
        "AccessComments": "24h/24 7j/7",
        "DistanceUnit": 0
    },
    "Connections": [
        {
            "ID": 214589,
            "ConnectionTypeID": 25,
            "StatusTypeID": 50,
            "LevelID": 2,
            "PowerKW": 18,
            "CurrentTypeID": 20
        },
        {
            "ID": 214590,
            "ConnectionTypeID": 28,
            "StatusTypeID": 50,
            "LevelID": 2,
            "PowerKW": 18,
            "CurrentTypeID": 10
        },
        {
            "ID": 247923,
            "ConnectionTypeID": 25,
            "StatusTypeID": 50,
            "LevelID": 2,
            "PowerKW": 18,
            "CurrentTypeID": 20
        },
        {
            "ID": 247924,
            "ConnectionTypeID": 28,
            "StatusTypeID": 50,
            "LevelID": 2,
            "PowerKW": 18,
            "CurrentTypeID": 10
        }
    ],
    "GeneralComments": "Recharge par badge et avec une application smartphone",
    "StatusTypeID": 50,
    "DateLastStatusUpdate": "2020-08-27T05:14:00Z",
    "DataQualityLevel": 2,
    "DateCreated": "2020-03-15T10:54:00Z",
    "SubmissionStatusTypeID": 100
}