{
    "IsRecentlyVerified": false,
    "ID": 138975,
    "UUID": "BDD9421F-8694-4631-A4F5-D333675645EE",
    "DataProviderID": 2,
    "DataProvidersReference": "92238",
    "OperatorID": 5,
    "UsageTypeID": 1,
    "AddressInfo": {
        "ID": 139327,
        "Title": "AAA NCNU",
        "AddressLine1": "4126 E Valley Auto Dr",
        "Town": "Mesa",
        "StateOrProvince": "AZ",
        "Postcode": "85206",
        "CountryID": 2,
        "Latitude": 33.3827699,
        "Longitude": -111.744527,
        "ContactTelephone1": "888-758-4389",
        "AccessComments": "24 hours daily",
        "RelatedURL": "http://www.chargepoint.com/",
        "DistanceUnit": 0
    },
    "Connections": [
        {
            "ID": 194216,
            "ConnectionTypeID": 1,
            "LevelID": 2,
            "Amps": 16,
            "Voltage": 230,
            "PowerKW": 3.7,
            "CurrentTypeID": 10,
            "Quantity": 1
        }
    ],
    "StatusTypeID": 50,
    "DateLastStatusUpdate": "2020-06-26T02:55:00Z",
    "DataQualityLevel": 3,
    "DateCreated": "2019-12-24T09:09:00Z",
    "SubmissionStatusTypeID": 100
}