{
    "IsRecentlyVerified": false,
    "ID": 126684,
    "UUID": "BA207575-C117-4EEB-8030-4170242DF5C6",
    "DataProviderID": 1,
    "OperatorID": 23,
    "OperatorsReference": "50168",
    "UsageTypeID": 4,
    "AddressInfo": {
        "ID": 127030,
        "Title": "The Exchange",
        "AddressLine1": "475 Howe St",
        "Town": "Vancouver",
        "StateOrProvince": "British Columbia",
        "Postcode": "V6C 2B3",
        "CountryID": 44,
        "Latitude": 49.285604,
        "Longitude": -123.115794,
        "ContactTelephone1": "(604) 631-3986",
        "DistanceUnit": 0
    },
    "Connections": [
        {
            "ID": 177451,
            "ConnectionTypeID": 30,
            "StatusTypeID": 50,
            "LevelID": 2,
            "PowerKW": 16,
            "CurrentTypeID": 20,
            "Quantity": 16
        }
    ],
    "NumberOfPoints": 16,
    "GeneralComments": "16 Tesla Connectors, up to 16kW.Parking fees will apply. Self park.",
    "StatusTypeID": 50,
    "DateLastStatusUpdate": "2019-05-17T05:46:00Z",
    "DataQualityLevel": 1,
    "DateCreated": "2019-05-17T05:46:00Z",
    "SubmissionStatusTypeID": 200
}