{
    "IsRecentlyVerified": false,
    "ID": 96164,
    "UUID": "9D0EA364-9CDC-4B62-89A1-6EFB41CA9170",
    "DataProviderID": 1,
    "OperatorID": 3297,
    "UsageTypeID": 4,
    "AddressInfo": {
        "ID": 96510,
        "Title": "Gernsheimer Straße",
        "AddressLine1": "Gernsheimer Straße",
        "AddressLine2": "Ecke Obergasse",
        "Town": "Pfungstadt",
        "StateOrProvince": "Landkreis Darmstadt-Dieburg",
        "Postcode": "64319",
        "CountryID": 87,
        "Latitude": 49.79353185982917,
        "Longitude": 8.559383377246146,
        "AccessComments": "24/7 nutzbare Ladesäule, freizuschalten auch mit New Motion oder PlugSurfing Keyhanger oder App.",
        "RelatedURL": "http://www.entega.de/ladestation-elektroauto/",
        "DistanceUnit": 0
    },
    "Connections": [
        {
            "ID": 136255,
            "ConnectionTypeID": 25,
            "StatusTypeID": 50,
            "LevelID": 2,
            "Amps": 32,
            "Voltage": 400,
            "PowerKW": 22,
            "CurrentTypeID": 20,
            "Quantity": 2
        }
    ],
    "NumberOfPoints": 2,
    "StatusTypeID": 50,
    "DateLastStatusUpdate": "2017-12-13T08:06:00Z",
    "DataQualityLevel": 1,
    "DateCreated": "2017-12-13T08:06:00Z",
    "SubmissionStatusTypeID": 200
}