{
    "IsRecentlyVerified": false,
    "ID": 64851,
    "UUID": "5BBA1837-B149-4F63-AB54-20653A5116B0",
    "DataProviderID": 1,
    "OperatorID": 45,
    "UsageTypeID": 1,
    "AddressInfo": {
        "ID": 65197,
        "Title": "Restaurant ESPITAS",
        "AddressLine1": "Torgauer Straße 306",
        "AddressLine2": "Paunsdorf",
        "Town": "Leipzig",
        "StateOrProvince": "Leipzig",
        "Postcode": "04347",
        "CountryID": 87,
        "Latitude": 51.3656383,
        "Longitude": 12.4564786,
        "AccessComments": "Direkt an der Einfahrt links sind 2 Mennekes Säulen hinter den beiden historischen Tanksäulen versteckt. 24/7 nutzbar, 4 kostenlose Parkplätze, kostenloses Laden.",
        "RelatedURL": "http://www.espitas.de/restaurants/espitas-leipzig",
        "DistanceUnit": 0
    },
    "Connections": [
        {
            "ID": 83393,
            "ConnectionTypeID": 25,
            "StatusTypeID": 50,
            "LevelID": 2,
            "Amps": 16,
            "Voltage": 400,
            "PowerKW": 11,
            "CurrentTypeID": 20,
            "Quantity": 4
        }
    ],
    "NumberOfPoints": 4,
    "StatusTypeID": 50,
    "DateLastStatusUpdate": "2016-03-29T07:09:00Z",
    "DataQualityLevel": 1,
    "DateCreated": "2016-03-29T06:47:00Z",
    "SubmissionStatusTypeID": 200
}