{
    "IsRecentlyVerified": false,
    "ID": 74178,
    "UUID": "19BFC4E8-8682-4CE8-BBCB-967D9AB97D79",
    "DataProviderID": 1,
    "OperatorID": 89,
    "OperatorsReference": "CEA-197",
    "UsageTypeID": 4,
    "UsageCost": "CAD 2.50",
    "AddressInfo": {
        "ID": 74524,
        "Title": "Hydro-Québec-St-Hubert",
        "AddressLine1": "5250 Armand-Frappier",
        "Town": "St-Hubert",
        "StateOrProvince": "QC",
        "Postcode": "J3Z 1G3",
        "CountryID": 44,
        "Latitude": 45.45869,
        "Longitude": -73.40989,
        "DistanceUnit": 0
    },
    "Connections": [
        {
            "ID": 106522,
            "ConnectionTypeID": 1,
            "StatusTypeID": 50,
            "LevelID": 2,
            "Amps": 32,
            "Voltage": 230,
            "PowerKW": 7,
            "CurrentTypeID": 10,
            "Quantity": 1
        }
    ],
    "NumberOfPoints": 1,
    "StatusTypeID": 50,
    "DateLastStatusUpdate": "2016-11-29T17:09:00Z",
    "DataQualityLevel": 1,
    "DateCreated": "2016-11-24T14:29:00Z",
    "SubmissionStatusTypeID": 200
}