{
    "IsRecentlyVerified": true,
    "DateLastVerified": "2021-10-02T14:38:00Z",
    "ID": 189469,
    "UUID": "F34BEBA8-F0F3-44EF-A5D2-67A1617EEB0F",
    "DataProviderID": 1,
    "OperatorID": 1,
    "UsageTypeID": 6,
    "UsageCost": "free",
    "AddressInfo": {
        "ID": 189828,
        "Title": "Lidl",
        "AddressLine1": "Viale Martiri della Resistenza 61",
        "Town": "Spoleto",
        "StateOrProvince": "Umbria",
        "Postcode": "06049",
        "CountryID": 112,
        "Latitude": 42.736911129553704,
        "Longitude": 12.732642908184516,
        "DistanceUnit": 0
    },
    "Connections": [
        {
            "ID": 306447,
            "ConnectionTypeID": 25,
            "StatusTypeID": 50,
            "LevelID": 2,
            "PowerKW": 22,
            "CurrentTypeID": 20,
            "Quantity": 2
        }
    ],
    "NumberOfPoints": 1,
    "StatusTypeID": 50,
    "DateLastStatusUpdate": "2021-10-05T14:53:00Z",
    "DataQualityLevel": 1,
    "DateCreated": "2021-10-02T14:38:00Z",
    "SubmissionStatusTypeID": 200
}