{
    "IsRecentlyVerified": false,
    "ID": 81991,
    "UUID": "6F3AD0C2-8474-4298-AE0A-AFDF2FF1A851",
    "DataProviderID": 1,
    "OperatorID": 23,
    "OperatorsReference": "10565",
    "UsageTypeID": 6,
    "AddressInfo": {
        "ID": 82337,
        "Title": "Mandarin Oriental, Las Vegas",
        "AddressLine1": "3752 S Las Vegas BLVD",
        "Town": "Las Vegas",
        "StateOrProvince": "NV",
        "Postcode": "89109",
        "CountryID": 2,
        "Latitude": 36.1062236,
        "Longitude": -115.1745805,
        "ContactTelephone1": "(702) 590-8888",
        "DistanceUnit": 0
    },
    "Connections": [
        {
            "ID": 116751,
            "ConnectionTypeID": 30,
            "StatusTypeID": 50,
            "LevelID": 2,
            "PowerKW": 8,
            "CurrentTypeID": 10,
            "Quantity": 8
        }
    ],
    "NumberOfPoints": 8,
    "GeneralComments": "4 Tesla Connectors, up to 8kW.Available for patrons only. Please see valet.",
    "StatusTypeID": 50,
    "DateLastStatusUpdate": "2019-01-02T21:58:00Z",
    "DataQualityLevel": 1,
    "DateCreated": "2017-02-03T13:55:00Z",
    "SubmissionStatusTypeID": 200
}