{
    "IsRecentlyVerified": false,
    "ID": 65976,
    "UUID": "52DB69F9-A5E0-46BB-B62D-6BE75BA3B3A2",
    "DataProviderID": 1,
    "OperatorID": 80,
    "UsageTypeID": 4,
    "UsageCost": "0,40 €/kW",
    "AddressInfo": {
        "ID": 66322,
        "Title": "Eneldrive Lavagnini 2",
        "AddressLine1": "Viale Spartaco Lavagnini, 2",
        "Town": "Firenze",
        "StateOrProvince": "FI",
        "Postcode": "50121",
        "CountryID": 112,
        "Latitude": 43.783764091413,
        "Longitude": 11.2602532139795,
        "RelatedURL": "http://eneldrive.it",
        "DistanceUnit": 0
    },
    "Connections": [
        {
            "ID": 91206,
            "ConnectionTypeID": 36,
            "StatusTypeID": 50,
            "LevelID": 2,
            "Amps": 16,
            "Voltage": 240,
            "PowerKW": 3,
            "CurrentTypeID": 10,
            "Quantity": 2
        }
    ],
    "NumberOfPoints": 2,
    "StatusTypeID": 50,
    "DateLastStatusUpdate": "2018-04-10T15:12:00Z",
    "DataQualityLevel": 1,
    "DateCreated": "2016-05-07T15:22:00Z",
    "SubmissionStatusTypeID": 200
}