{
    "IsRecentlyVerified": false,
    "ID": 152369,
    "UUID": "B9F79E17-2745-45BA-A5C9-9069ACEA34C9",
    "DataProviderID": 28,
    "DataProvidersReference": "FRSEOPAB16001A",
    "OperatorID": 3383,
    "UsageTypeID": 5,
    "AddressInfo": {
        "ID": 152722,
        "Title": "Réseau AlterBase - St Pierre des Echaubrognes - Centre",
        "AddressLine1": "Place Saint Hubert - 79700 ST PIERRE DES ECHAUBROGNES",
        "CountryID": 80,
        "Latitude": 46.989946,
        "Longitude": -0.742817,
        "AccessComments": "24/24 7/7 jours",
        "DistanceUnit": 0
    },
    "Connections": [
        {
            "ID": 213289,
            "ConnectionTypeID": 28,
            "StatusTypeID": 50,
            "LevelID": 2,
            "PowerKW": 3.18,
            "CurrentTypeID": 10
        },
        {
            "ID": 213290,
            "ConnectionTypeID": 25,
            "StatusTypeID": 50,
            "LevelID": 2,
            "PowerKW": 3.18,
            "CurrentTypeID": 10
        },
        {
            "ID": 246165,
            "ConnectionTypeID": 28,
            "StatusTypeID": 50,
            "LevelID": 2,
            "PowerKW": 3.18,
            "CurrentTypeID": 10
        },
        {
            "ID": 246166,
            "ConnectionTypeID": 25,
            "StatusTypeID": 50,
            "LevelID": 2,
            "PowerKW": 3.18,
            "CurrentTypeID": 10
        }
    ],
    "GeneralComments": "www.alterbase.fr",
    "StatusTypeID": 50,
    "DateLastStatusUpdate": "2020-08-27T05:13:00Z",
    "DataQualityLevel": 2,
    "DateCreated": "2020-03-15T10:53:00Z",
    "SubmissionStatusTypeID": 100
}