{
    "IsRecentlyVerified": false,
    "ID": 103571,
    "UUID": "A60BEA89-7FDD-485C-A3B4-9C418B2AB504",
    "DataProviderID": 1,
    "OperatorID": 23,
    "OperatorsReference": "42666",
    "UsageTypeID": 4,
    "AddressInfo": {
        "ID": 103917,
        "Title": "GMP 388 Bridge Street",
        "AddressLine1": "388 Bridge St",
        "Town": "Brooklyn",
        "StateOrProvince": "New York",
        "Postcode": "11201",
        "CountryID": 2,
        "Latitude": 40.691469,
        "Longitude": -73.985446,
        "ContactTelephone1": "(718) 855-1061",
        "DistanceUnit": 0
    },
    "Connections": [
        {
            "ID": 146238,
            "ConnectionTypeID": 30,
            "StatusTypeID": 50,
            "LevelID": 2,
            "PowerKW": 16,
            "CurrentTypeID": 20,
            "Quantity": 3
        }
    ],
    "NumberOfPoints": 3,
    "GeneralComments": "3 Tesla Connectors, up to 16kW.Parking fees will apply. Please see valet.",
    "StatusTypeID": 50,
    "DateLastStatusUpdate": "2018-05-04T05:42:00Z",
    "DataQualityLevel": 1,
    "DateCreated": "2018-05-04T05:42:00Z",
    "SubmissionStatusTypeID": 200
}