{
    "IsRecentlyVerified": false,
    "ID": 35933,
    "UUID": "AD13EDBD-953D-4F4C-BAC0-6B865741BF31",
    "DataProviderID": 26,
    "DataProvidersReference": "16687",
    "OperatorID": 162,
    "OperatorsReference": "Winkelcentrum Leidsenhage",
    "UsageCost": "0.00 gratis",
    "AddressInfo": {
        "ID": 36279,
        "Title": "Ligusterhof",
        "AddressLine1": "Ligusterhof",
        "Town": "Leidschendam-Voorburg",
        "Postcode": "2262 AC",
        "CountryID": 159,
        "Latitude": 52.087966430023,
        "Longitude": 4.3854469433427,
        "DistanceUnit": 0
    },
    "Connections": [
        {
            "ID": 39444,
            "ConnectionTypeID": 25,
            "LevelID": 2,
            "PowerKW": 5,
            "CurrentTypeID": 10
        }
    ],
    "NumberOfPoints": 2,
    "StatusTypeID": 50,
    "DateLastStatusUpdate": "2016-03-03T12:38:00Z",
    "DataQualityLevel": 3,
    "DateCreated": "2015-01-09T06:05:00Z",
    "SubmissionStatusTypeID": 100
}