{
    "IsRecentlyVerified": false,
    "ID": 154452,
    "UUID": "3FED3C58-7B06-4141-A81D-1BB756130192",
    "DataProviderID": 28,
    "DataProvidersReference": "FR*SOD*S*NPDC*234*1*_*_",
    "UsageTypeID": 5,
    "AddressInfo": {
        "ID": 154805,
        "Title": "Vendeville - St Rita",
        "AddressLine1": "Rue de Seclin, Vendeville",
        "CountryID": 80,
        "Latitude": 50.576415,
        "Longitude": 3.080624,
        "AccessComments": "24/24 7/7 jours",
        "DistanceUnit": 0
    },
    "Connections": [
        {
            "ID": 217210,
            "ConnectionTypeID": 28,
            "StatusTypeID": 50,
            "LevelID": 2,
            "PowerKW": 22,
            "CurrentTypeID": 10
        },
        {
            "ID": 217211,
            "ConnectionTypeID": 1036,
            "StatusTypeID": 50,
            "LevelID": 2,
            "PowerKW": 22,
            "CurrentTypeID": 20
        },
        {
            "ID": 252298,
            "ConnectionTypeID": 28,
            "StatusTypeID": 50,
            "LevelID": 2,
            "PowerKW": 22,
            "CurrentTypeID": 10
        },
        {
            "ID": 252299,
            "ConnectionTypeID": 1036,
            "StatusTypeID": 50,
            "LevelID": 2,
            "PowerKW": 22,
            "CurrentTypeID": 20
        }
    ],
    "GeneralComments": "\"Type charge indiquée selon décret de 2017",
    "StatusTypeID": 50,
    "DateLastStatusUpdate": "2020-08-27T05:16:00Z",
    "DataQualityLevel": 2,
    "DateCreated": "2020-03-15T10:55:00Z",
    "SubmissionStatusTypeID": 100
}