{
    "IsRecentlyVerified": false,
    "ID": 185253,
    "UUID": "B911F982-082A-42E3-B4B0-BBFB3350D095",
    "DataProviderID": 29,
    "DataProvidersReference": "15298",
    "OperatorID": 86,
    "AddressInfo": {
        "ID": 185612,
        "Title": "Friedhofstraße 2",
        "AddressLine1": "Friedhofstraße 2",
        "Town": "Tuningen",
        "Postcode": "78609",
        "CountryID": 87,
        "Latitude": 48.026878,
        "Longitude": 8.601595,
        "DistanceUnit": 0
    },
    "Connections": [
        {
            "ID": 294512,
            "ConnectionTypeID": 28,
            "StatusTypeID": 50,
            "LevelID": 2,
            "PowerKW": 22,
            "CurrentTypeID": 20
        },
        {
            "ID": 294513,
            "ConnectionTypeID": 25,
            "StatusTypeID": 50,
            "LevelID": 2,
            "PowerKW": 22,
            "CurrentTypeID": 20
        },
        {
            "ID": 295466,
            "ConnectionTypeID": 28,
            "StatusTypeID": 50,
            "LevelID": 2,
            "PowerKW": 22,
            "CurrentTypeID": 20
        },
        {
            "ID": 295467,
            "ConnectionTypeID": 25,
            "StatusTypeID": 50,
            "LevelID": 2,
            "PowerKW": 22,
            "CurrentTypeID": 20
        }
    ],
    "StatusTypeID": 50,
    "DateLastStatusUpdate": "2021-07-12T02:40:00Z",
    "MetadataValues": [
        {
            "ID": 17544,
            "MetadataFieldID": 4,
            "ItemValue": "Data from the German chargepoint registry provided by Bundesnetzagentur.de under the CC-BY 4.0 license"
        }
    ],
    "DataQualityLevel": 3,
    "DateCreated": "2021-07-08T10:06:00Z",
    "SubmissionStatusTypeID": 100
}