{
    "IsRecentlyVerified": false,
    "ID": 102795,
    "UUID": "27C626EB-86FA-4DE2-A58E-3B0903C1B77A",
    "DataProviderID": 2,
    "DataProvidersReference": "85384",
    "OperatorID": 39,
    "UsageTypeID": 4,
    "AddressInfo": {
        "ID": 103141,
        "Title": "Gunbarrel Center",
        "AddressLine1": "5340 Gunbarrel Center Court",
        "Town": "Boulder",
        "StateOrProvince": "CO",
        "Postcode": "80301",
        "CountryID": 2,
        "Latitude": 40.0716883,
        "Longitude": -105.1988929,
        "ContactTelephone1": "800-663-5633",
        "AccessComments": "MO: 12:00am-12:00am; TU: 12:00am-12:00am; WE: 12:00am-12:00am; TH: 12:00am-12:00am; FR: 12:00am-12:00am; SA: 12:00am-12:00am; SU: 12:00am-12:00am",
        "RelatedURL": "http://www.semacharge.com/",
        "DistanceUnit": 0
    },
    "Connections": [
        {
            "ID": 144929,
            "ConnectionTypeID": 1,
            "LevelID": 2,
            "Amps": 16,
            "Voltage": 230,
            "PowerKW": 3,
            "CurrentTypeID": 10,
            "Quantity": 3
        }
    ],
    "DateLastStatusUpdate": "2019-04-06T05:04:00Z",
    "DataQualityLevel": 3,
    "DateCreated": "2018-04-21T04:13:00Z",
    "SubmissionStatusTypeID": 100
}