{
    "IsRecentlyVerified": false,
    "ID": 150560,
    "UUID": "CCA87F2D-9AE0-41A0-82CC-6C0489DA6F92",
    "DataProviderID": 28,
    "DataProvidersReference": "FR*M13*P13033*001",
    "UsageTypeID": 5,
    "AddressInfo": {
        "ID": 150913,
        "Title": "ENSUES-LA-REDONNE - Parking Des Coulins",
        "AddressLine1": "Parking Des Coulins 13820 ENSUES-LA-REDONNE",
        "CountryID": 80,
        "Latitude": 43.356012,
        "Longitude": 5.193556,
        "AccessComments": "24h/24 7j/7",
        "DistanceUnit": 0
    },
    "Connections": [
        {
            "ID": 209448,
            "ConnectionTypeID": 28,
            "StatusTypeID": 50,
            "LevelID": 2,
            "PowerKW": 22,
            "CurrentTypeID": 10
        },
        {
            "ID": 209449,
            "ConnectionTypeID": 1036,
            "StatusTypeID": 50,
            "LevelID": 2,
            "PowerKW": 22,
            "CurrentTypeID": 20
        },
        {
            "ID": 238628,
            "ConnectionTypeID": 28,
            "StatusTypeID": 50,
            "LevelID": 2,
            "PowerKW": 22,
            "CurrentTypeID": 10
        },
        {
            "ID": 238629,
            "ConnectionTypeID": 1036,
            "StatusTypeID": 50,
            "LevelID": 2,
            "PowerKW": 22,
            "CurrentTypeID": 20
        }
    ],
    "GeneralComments": "Recharge par badge et avec une application smartphone",
    "StatusTypeID": 50,
    "DateLastStatusUpdate": "2020-08-27T05:10:00Z",
    "DataQualityLevel": 2,
    "DateCreated": "2020-03-15T06:17:00Z",
    "SubmissionStatusTypeID": 100
}