{
    "IsRecentlyVerified": false,
    "ID": 94608,
    "UUID": "F7869464-6BDB-43B6-AB61-1042F7C0BBCE",
    "DataProviderID": 1,
    "OperatorID": 23,
    "OperatorsReference": "36858",
    "UsageTypeID": 7,
    "AddressInfo": {
        "ID": 94954,
        "Title": "Apartment Hotel Zigzag Zagreb",
        "AddressLine1": "Petrinjska 9",
        "Town": "Zagreb",
        "Postcode": "10000",
        "CountryID": 60,
        "Latitude": 45.811083,
        "Longitude": 15.97991,
        "ContactTelephone1": "+385 1 8895 433",
        "DistanceUnit": 0
    },
    "Connections": [
        {
            "ID": 133761,
            "ConnectionTypeID": 30,
            "StatusTypeID": 50,
            "LevelID": 2,
            "Amps": 16,
            "Voltage": 400,
            "PowerKW": 11,
            "CurrentTypeID": 20,
            "Quantity": 1
        }
    ],
    "NumberOfPoints": 1,
    "GeneralComments": "1 Tesla Connector, up to 11kW.Available by reservation only. Please call ahead.",
    "StatusTypeID": 50,
    "DateLastStatusUpdate": "2018-10-03T23:08:00Z",
    "DataQualityLevel": 1,
    "DateCreated": "2017-10-22T05:37:00Z",
    "SubmissionStatusTypeID": 200
}