{
    "IsRecentlyVerified": false,
    "ID": 32400,
    "UUID": "E5AFCE2C-EEED-4296-8999-D71FF553BDAA",
    "DataProviderID": 1,
    "OperatorID": 156,
    "OperatorsReference": "NewMotion 02008881",
    "UsageTypeID": 4,
    "AddressInfo": {
        "ID": 32746,
        "Title": "Autohaus Homrich & Neike",
        "AddressLine1": "Auwiese 5",
        "Town": "Kreuztal",
        "Postcode": "57223",
        "CountryID": 87,
        "Latitude": 50.9661102294922,
        "Longitude": 8.04074954986572,
        "ContactTelephone1": "+49 2732 27970",
        "RelatedURL": "http://www.homrich-neike.de/",
        "DistanceUnit": 0
    },
    "Connections": [
        {
            "ID": 35911,
            "ConnectionTypeID": 25,
            "StatusTypeID": 50,
            "LevelID": 2,
            "Amps": 16,
            "Voltage": 230,
            "PowerKW": 3.7,
            "CurrentTypeID": 10,
            "Quantity": 2
        }
    ],
    "NumberOfPoints": 2,
    "StatusTypeID": 50,
    "DateLastStatusUpdate": "2015-05-06T07:51:00Z",
    "DataQualityLevel": 3,
    "DateCreated": "2015-01-09T06:03:00Z",
    "SubmissionStatusTypeID": 100
}