{
    "IsRecentlyVerified": false,
    "ID": 18810,
    "UUID": "D274C70B-D84E-42B9-BA62-F5209AB10B65",
    "DataProviderID": 15,
    "DataProvidersReference": "30543",
    "OperatorID": 1,
    "UsageTypeID": 1,
    "AddressInfo": {
        "ID": 19155,
        "Title": "?????????????????",
        "AddressLine1": "?????????????????",
        "Town": "??",
        "StateOrProvince": "",
        "Postcode": "518172",
        "CountryID": 50,
        "Latitude": 22.721466,
        "Longitude": 114.226463,
        "ContactTelephone1": "",
        "RelatedURL": "http://carstations.com/30543",
        "DistanceUnit": 0
    },
    "Connections": [
        {
            "ID": 19043,
            "ConnectionTypeID": 1,
            "Reference": "J1772",
            "LevelID": 2,
            "Quantity": 1
        }
    ],
    "NumberOfPoints": 1,
    "StatusTypeID": 0,
    "DateLastStatusUpdate": "2014-03-22T04:39:00Z",
    "DataQualityLevel": 2,
    "DateCreated": "2013-08-25T03:32:00Z",
    "SubmissionStatusTypeID": 200
}