{
    "IsRecentlyVerified": false,
    "ID": 153175,
    "UUID": "31BF4CBF-BCA8-426E-B688-40871686EAED",
    "DataProviderID": 28,
    "DataProvidersReference": "FR*S41*P41269-91",
    "UsageTypeID": 5,
    "AddressInfo": {
        "ID": 153528,
        "Title": "Vendôme | Avenue Jean Moulin",
        "AddressLine1": "Avenue Jean Moulin 41100 Vendôme",
        "CountryID": 80,
        "Latitude": 47.806585,
        "Longitude": 1.057401,
        "AccessComments": "24/24 7/7",
        "DistanceUnit": 0
    },
    "Connections": [
        {
            "ID": 214760,
            "ConnectionTypeID": 25,
            "StatusTypeID": 50,
            "LevelID": 2,
            "PowerKW": 18,
            "CurrentTypeID": 20
        },
        {
            "ID": 214761,
            "ConnectionTypeID": 28,
            "StatusTypeID": 50,
            "LevelID": 2,
            "PowerKW": 18,
            "CurrentTypeID": 10
        },
        {
            "ID": 248123,
            "ConnectionTypeID": 25,
            "StatusTypeID": 50,
            "LevelID": 2,
            "PowerKW": 18,
            "CurrentTypeID": 20
        },
        {
            "ID": 248124,
            "ConnectionTypeID": 28,
            "StatusTypeID": 50,
            "LevelID": 2,
            "PowerKW": 18,
            "CurrentTypeID": 10
        }
    ],
    "GeneralComments": "",
    "StatusTypeID": 50,
    "DateLastStatusUpdate": "2020-08-27T05:14:00Z",
    "DataQualityLevel": 2,
    "DateCreated": "2020-03-15T10:54:00Z",
    "SubmissionStatusTypeID": 100
}