{
    "IsRecentlyVerified": false,
    "ID": 67267,
    "UUID": "F72F4EE1-2E7F-48CE-9B11-AA2F7DDE7A74",
    "DataProviderID": 1,
    "OperatorID": 23,
    "OperatorsReference": "16176",
    "UsageTypeID": 1,
    "UsageCost": "Free",
    "AddressInfo": {
        "ID": 67613,
        "Title": "Mendocino Inn & Spa - Tesla",
        "AddressLine1": "8211 N Highway 1",
        "Town": "Little River",
        "StateOrProvince": "CA",
        "Postcode": "95456",
        "CountryID": 2,
        "Latitude": 39.2780149,
        "Longitude": -123.790152,
        "ContactTelephone1": "707-593-4255  877-798-3752",
        "AccessComments": "24 hours daily; for Tesla use only; for guest use only",
        "RelatedURL": "http://www.teslamotors.com/supercharger",
        "DistanceUnit": 0
    },
    "Connections": [
        {
            "ID": 92768,
            "ConnectionTypeID": 30,
            "StatusTypeID": 50,
            "LevelID": 2,
            "Amps": 16,
            "Voltage": 230,
            "PowerKW": 16,
            "CurrentTypeID": 10,
            "Quantity": 2
        }
    ],
    "NumberOfPoints": 2,
    "StatusTypeID": 50,
    "DateLastStatusUpdate": "2017-01-31T19:08:00Z",
    "DataQualityLevel": 3,
    "DateCreated": "2016-05-29T02:05:00Z",
    "SubmissionStatusTypeID": 100
}