{
    "UserComments": [
        {
            "ID": 20791,
            "ChargePointID": 108340,
            "CommentTypeID": 50,
            "UserName": "oli_b",
            "Comment": "Display is dead, and the charger says RFID card is required, but don't worry, just connect the car and press the green button, charging will start.",
            "Rating": 4,
            "DateCreated": "2019-03-12T23:33:56.513Z",
            "User": {
                "ID": 18023,
                "Username": "oli_b"
            },
            "CheckinStatusTypeID": 140
        }
    ],
    "MediaItems": [
        {
            "ID": 17349,
            "ChargePointID": 108340,
            "ItemURL": "https://s3-ap-southeast-2.amazonaws.com/openchargemap/images/HU/OCM108340/OCM-108340.orig.2019010411411603.jpeg",
            "ItemThumbnailURL": "https://s3-ap-southeast-2.amazonaws.com/openchargemap/images/HU/OCM108340/OCM-108340.thmb.2019010411411603.jpeg",
            "Comment": "",
            "IsEnabled": true,
            "IsVideo": false,
            "IsFeaturedItem": false,
            "IsExternalResource": false,
            "User": {
                "ID": 19691,
                "Username": "Smog"
            },
            "DateCreated": "2019-01-04T11:41:00Z"
        }
    ],
    "IsRecentlyVerified": false,
    "ID": 108340,
    "UUID": "A5E89B63-6C40-4151-A050-2299FFEB2511",
    "DataProviderID": 1,
    "OperatorID": 3319,
    "UsageTypeID": 1,
    "UsageCost": "100Ft/kWh, töltés ideje alatt inggyenes parkolás",
    "AddressInfo": {
        "ID": 108686,
        "Title": "4 Hollán Ernő utca",
        "AddressLine1": "4 Hollán Ernő utca",
        "Town": "Szombathely",
        "StateOrProvince": "Transdanubia",
        "Postcode": "9700",
        "CountryID": 104,
        "Latitude": 47.2303784005785,
        "Longitude": 16.61781402463282,
        "AccessComments": "Use Mobiliti App or Smart Key ",
        "DistanceUnit": 0
    },
    "Connections": [
        {
            "ID": 154665,
            "ConnectionTypeID": 33,
            "StatusTypeID": 50,
            "LevelID": 3,
            "PowerKW": 22,
            "CurrentTypeID": 30,
            "Quantity": 1
        },
        {
            "ID": 154666,
            "ConnectionTypeID": 2,
            "StatusTypeID": 50,
            "LevelID": 3,
            "PowerKW": 22,
            "CurrentTypeID": 30,
            "Quantity": 1
        }
    ],
    "NumberOfPoints": 1,
    "StatusTypeID": 50,
    "DateLastStatusUpdate": "2020-12-20T10:57:00Z",
    "DataQualityLevel": 1,
    "DateCreated": "2018-09-23T11:31:00Z",
    "SubmissionStatusTypeID": 200
}