{
    "IsRecentlyVerified": false,
    "ID": 176198,
    "UUID": "D67E43FB-EA55-4D59-8A39-05EBC6FA1F81",
    "DataProviderID": 1,
    "OperatorID": 142,
    "UsageTypeID": 1,
    "AddressInfo": {
        "ID": 176557,
        "Title": "Zacretje",
        "AddressLine1": "Mišak",
        "Town": "Štrucljevo",
        "Postcode": "49223",
        "CountryID": 60,
        "Latitude": 46.07430052840712,
        "Longitude": 15.90783988477392,
        "AccessComments": "app required",
        "RelatedURL": "http://elen.hep.hr",
        "DistanceUnit": 0
    },
    "Connections": [
        {
            "ID": 273823,
            "ConnectionTypeID": 25,
            "StatusTypeID": 50,
            "LevelID": 2,
            "Amps": 32,
            "Voltage": 400,
            "PowerKW": 22,
            "CurrentTypeID": 20,
            "Quantity": 2
        }
    ],
    "NumberOfPoints": 1,
    "StatusTypeID": 50,
    "DateLastStatusUpdate": "2021-07-02T10:38:00Z",
    "DataQualityLevel": 1,
    "DateCreated": "2021-06-30T15:26:00Z",
    "SubmissionStatusTypeID": 200
}