{
    "IsRecentlyVerified": false,
    "ID": 129692,
    "UUID": "49CB99B4-311F-4F7A-8144-5074836B4946",
    "DataProviderID": 1,
    "OperatorID": 80,
    "UsageTypeID": 4,
    "AddressInfo": {
        "ID": 130038,
        "Title": "Catania Corso Italia | EnelX",
        "AddressLine1": "Corso Italia, 92",
        "Town": "Catania",
        "StateOrProvince": "CT",
        "Postcode": " 95129",
        "CountryID": 112,
        "Latitude": 37.51497703971174,
        "Longitude": 15.096083791247452,
        "RelatedURL": "https://www.enelx.com/it/it/mobilita-elettrica",
        "DistanceUnit": 0
    },
    "Connections": [
        {
            "ID": 181507,
            "ConnectionTypeID": 25,
            "StatusTypeID": 50,
            "LevelID": 2,
            "Amps": 32,
            "Voltage": 400,
            "PowerKW": 22,
            "CurrentTypeID": 20,
            "Quantity": 3
        },
        {
            "ID": 181508,
            "ConnectionTypeID": 36,
            "StatusTypeID": 50,
            "LevelID": 2,
            "Amps": 16,
            "Voltage": 240,
            "PowerKW": 3.7,
            "CurrentTypeID": 10,
            "Quantity": 1
        }
    ],
    "NumberOfPoints": 4,
    "StatusTypeID": 50,
    "DateLastStatusUpdate": "2019-07-23T15:37:00Z",
    "DataQualityLevel": 1,
    "DateCreated": "2019-07-23T15:37:00Z",
    "SubmissionStatusTypeID": 200
}