{
    "IsRecentlyVerified": false,
    "ID": 97418,
    "UUID": "EACE0FAC-8B92-4EEA-90DB-AC80EA46A71C",
    "DataProviderID": 1,
    "OperatorID": 23,
    "OperatorsReference": "39164",
    "UsageTypeID": 4,
    "AddressInfo": {
        "ID": 97764,
        "Title": "Courtyard By Marriott Kingston",
        "AddressLine1": "500 Frank Sottile BLVD",
        "Town": "Kingston",
        "StateOrProvince": "New York",
        "Postcode": "12401",
        "CountryID": 2,
        "Latitude": 41.9696902,
        "Longitude": -73.9863869,
        "ContactTelephone1": "(845) 382-2300",
        "DistanceUnit": 0
    },
    "Connections": [
        {
            "ID": 138325,
            "ConnectionTypeID": 30,
            "StatusTypeID": 50,
            "LevelID": 2,
            "PowerKW": 8,
            "CurrentTypeID": 10,
            "Quantity": 2
        }
    ],
    "NumberOfPoints": 2,
    "GeneralComments": "2 Tesla Connectors, up to 8kW.Available for customers. Please see front desk.",
    "StatusTypeID": 50,
    "DateLastStatusUpdate": "2018-01-21T15:22:00Z",
    "DataQualityLevel": 1,
    "DateCreated": "2018-01-21T15:22:00Z",
    "SubmissionStatusTypeID": 200
}