{
    "IsRecentlyVerified": false,
    "ID": 94630,
    "UUID": "D1953F1E-906D-4A3A-8B34-A2B7D3E75711",
    "DataProviderID": 1,
    "OperatorID": 23,
    "OperatorsReference": "36846",
    "UsageTypeID": 4,
    "AddressInfo": {
        "ID": 94976,
        "Title": "Falkensteiner Hotel & Spa Jesolo",
        "AddressLine1": "Piazza le Corbusier",
        "Town": "6",
        "StateOrProvince": "Lido di Jesolo",
        "Postcode": "30016",
        "CountryID": 112,
        "Latitude": 45.511353,
        "Longitude": 12.664186,
        "ContactTelephone1": "+39 0421 183 1900",
        "DistanceUnit": 0
    },
    "Connections": [
        {
            "ID": 133783,
            "ConnectionTypeID": 30,
            "StatusTypeID": 50,
            "LevelID": 2,
            "Amps": 32,
            "Voltage": 400,
            "PowerKW": 22,
            "CurrentTypeID": 20,
            "Quantity": 2
        }
    ],
    "NumberOfPoints": 2,
    "GeneralComments": "2 Tesla Connectors, up to 22kW.Available for customers. Please call ahead.",
    "StatusTypeID": 50,
    "DateLastStatusUpdate": "2018-10-03T22:16:00Z",
    "DataQualityLevel": 1,
    "DateCreated": "2017-10-22T05:40:00Z",
    "SubmissionStatusTypeID": 200
}