{
    "IsRecentlyVerified": false,
    "ID": 46264,
    "UUID": "7CA8425A-DE84-495A-8135-403A05766BCE",
    "DataProviderID": 1,
    "DataProvidersReference": "73",
    "AddressInfo": {
        "ID": 46610,
        "Title": "Eckersbergs gate, Oslo",
        "AddressLine1": "Eckersbergs gate 13",
        "Town": "OSLO",
        "StateOrProvince": "Oslo",
        "Postcode": "0266",
        "CountryID": 168,
        "Latitude": 59.92011,
        "Longitude": 10.70113,
        "AccessComments": "Plasser på Frogner mellom Nobels gate og Erling Skjalgssons gate.",
        "DistanceUnit": 0
    },
    "Connections": [
        {
            "ID": 56927,
            "ConnectionTypeID": 0,
            "LevelID": 2,
            "Amps": 16,
            "Voltage": 230,
            "PowerKW": 3.68
        },
        {
            "ID": 85860,
            "ConnectionTypeID": 0,
            "Reference": "1",
            "LevelID": 2,
            "Amps": 16,
            "Voltage": 230,
            "PowerKW": 3.7,
            "Comments": "Mode 3"
        },
        {
            "ID": 85861,
            "ConnectionTypeID": 0,
            "LevelID": 2,
            "Amps": 16,
            "Voltage": 230,
            "PowerKW": 3.68
        },
        {
            "ID": 88647,
            "ConnectionTypeID": 0,
            "Reference": "2",
            "LevelID": 2,
            "Amps": 16,
            "Voltage": 230,
            "PowerKW": 3.7,
            "Comments": "Mode 3"
        },
        {
            "ID": 223918,
            "ConnectionTypeID": 0,
            "LevelID": 2,
            "Amps": 16,
            "Voltage": 230,
            "PowerKW": 3.68
        },
        {
            "ID": 223919,
            "ConnectionTypeID": 0,
            "Reference": "3",
            "LevelID": 2,
            "Amps": 16,
            "Voltage": 230,
            "PowerKW": 3.7,
            "Comments": "Mode 3"
        },
        {
            "ID": 223920,
            "ConnectionTypeID": 0,
            "LevelID": 2,
            "Amps": 16,
            "Voltage": 230,
            "PowerKW": 3.68
        },
        {
            "ID": 223921,
            "ConnectionTypeID": 0,
            "Reference": "4",
            "LevelID": 2,
            "Amps": 16,
            "Voltage": 230,
            "PowerKW": 3.7,
            "Comments": "Mode 3"
        }
    ],
    "NumberOfPoints": 4,
    "DateLastStatusUpdate": "2020-05-26T08:23:00Z",
    "DataQualityLevel": 2,
    "DateCreated": "2015-05-03T00:54:00Z",
    "SubmissionStatusTypeID": 100
}