{
    "UserComments": [
        {
            "ID": 22844,
            "ChargePointID": 161106,
            "CommentTypeID": 10,
            "UserName": "Dylan_Hudson",
            "DateCreated": "2020-07-03T19:39:20.107Z",
            "User": {
                "ID": 23370,
                "Username": "Dylan_Hudson"
            },
            "CheckinStatusTypeID": 140,
            "IsActionedByEditor": false
        },
        {
            "ID": 22843,
            "ChargePointID": 161106,
            "CommentTypeID": 10,
            "UserName": "Dylan_Hudson",
            "Comment": "Brand new and working perfectly",
            "Rating": 5,
            "DateCreated": "2020-07-03T16:09:46.767Z",
            "User": {
                "ID": 23370,
                "Username": "Dylan_Hudson"
            },
            "CheckinStatusTypeID": 10,
            "IsActionedByEditor": false
        }
    ],
    "IsRecentlyVerified": false,
    "ID": 161106,
    "UUID": "A907EF74-9451-4061-859B-9ABE26485A4E",
    "DataProviderID": 1,
    "OperatorID": 3296,
    "UsageTypeID": 5,
    "UsageCost": "£0.40/kWh",
    "AddressInfo": {
        "ID": 161463,
        "Title": "Starbucks Gain Lane",
        "AddressLine1": "Gain Lane",
        "AddressLine2": "Thornbury",
        "Town": "Bradford",
        "StateOrProvince": "England",
        "Postcode": "BD3 7DW",
        "CountryID": 1,
        "Latitude": 53.80252875469989,
        "Longitude": -1.7024169554094897,
        "DistanceUnit": 0
    },
    "Connections": [
        {
            "ID": 231806,
            "ConnectionTypeID": 2,
            "StatusTypeID": 50,
            "LevelID": 3,
            "PowerKW": 50,
            "CurrentTypeID": 30,
            "Quantity": 2
        },
        {
            "ID": 231807,
            "ConnectionTypeID": 33,
            "StatusTypeID": 50,
            "LevelID": 3,
            "PowerKW": 50,
            "CurrentTypeID": 30,
            "Quantity": 2
        }
    ],
    "NumberOfPoints": 2,
    "GeneralComments": "Open 24/7 - Chargers accessible 24/7.\r\nStarbucks open 06:00-21:00.",
    "StatusTypeID": 50,
    "DateLastStatusUpdate": "2021-05-26T10:19:00Z",
    "DataQualityLevel": 1,
    "DateCreated": "2020-07-03T16:09:00Z",
    "SubmissionStatusTypeID": 200
}