{
    "IsRecentlyVerified": false,
    "ID": 107814,
    "UUID": "DD802EEC-8AD3-4C5D-8DB4-E6A615C0BC91",
    "DataProviderID": 1,
    "OperatorID": 80,
    "UsageTypeID": 4,
    "AddressInfo": {
        "ID": 108160,
        "Title": "EnelX Campo di Pile",
        "AddressLine1": "Via Campo di Pile",
        "AddressLine2": "Nucleo Industriale Pile ",
        "Town": "L'Aquila",
        "StateOrProvince": "AQ",
        "Postcode": "67100",
        "CountryID": 112,
        "Latitude": 42.3568034164532,
        "Longitude": 13.3502655812973,
        "ContactTelephone1": "800.069.850",
        "RelatedURL": "https://www.enelx.com/it/it/emobility",
        "DistanceUnit": 0
    },
    "Connections": [
        {
            "ID": 152235,
            "ConnectionTypeID": 25,
            "StatusTypeID": 50,
            "LevelID": 2,
            "Amps": 32,
            "Voltage": 400,
            "PowerKW": 22,
            "CurrentTypeID": 20,
            "Quantity": 1
        },
        {
            "ID": 152236,
            "ConnectionTypeID": 36,
            "StatusTypeID": 50,
            "LevelID": 2,
            "Amps": 16,
            "Voltage": 240,
            "PowerKW": 3.7,
            "CurrentTypeID": 10,
            "Quantity": 1
        }
    ],
    "NumberOfPoints": 2,
    "StatusTypeID": 50,
    "DateLastStatusUpdate": "2018-10-16T13:13:00Z",
    "DataQualityLevel": 1,
    "DateCreated": "2018-08-10T13:48:00Z",
    "SubmissionStatusTypeID": 200
}