{
    "IsRecentlyVerified": false,
    "ID": 90584,
    "UUID": "82028CCB-7946-496D-9FCA-4914726FBE1C",
    "DataProviderID": 1,
    "OperatorID": 23,
    "OperatorsReference": "31904",
    "UsageTypeID": 4,
    "AddressInfo": {
        "ID": 90930,
        "Title": "Fiesta Americana Hermosillo",
        "AddressLine1": "Boulevard Eusebio Kino 369 Lomas de Pitic",
        "Town": "Hermosillo",
        "StateOrProvince": "Sonora",
        "Postcode": "83010",
        "CountryID": 146,
        "Latitude": 29.097112,
        "Longitude": -110.933122,
        "ContactTelephone1": "+52 662 259 6000",
        "DistanceUnit": 0
    },
    "Connections": [
        {
            "ID": 128274,
            "ConnectionTypeID": 30,
            "StatusTypeID": 50,
            "LevelID": 2,
            "PowerKW": 18,
            "CurrentTypeID": 20,
            "Quantity": 2
        }
    ],
    "NumberOfPoints": 2,
    "GeneralComments": "2 Tesla Connectors, up to 18kW.Available for customers. Please see front desk.",
    "StatusTypeID": 50,
    "DateLastStatusUpdate": "2017-07-19T05:43:00Z",
    "DataQualityLevel": 1,
    "DateCreated": "2017-07-19T05:43:00Z",
    "SubmissionStatusTypeID": 200
}