{
    "IsRecentlyVerified": false,
    "ID": 168424,
    "UUID": "F1B7F1EF-777B-4B84-A10D-E30EB049E422",
    "DataProviderID": 1,
    "OperatorID": 80,
    "UsageTypeID": 4,
    "AddressInfo": {
        "ID": 168783,
        "Title": "Zona Artigianale Saragiolo  | ENELX",
        "AddressLine1": "SP18",
        "AddressLine2": "Saragiolo",
        "Town": "Piancastagnaio",
        "StateOrProvince": "SI",
        "Postcode": "53025",
        "CountryID": 112,
        "Latitude": 42.83780067546124,
        "Longitude": 11.638895729017008,
        "RelatedURL": "https://www.enelx.com/it/it/emobility",
        "DistanceUnit": 0
    },
    "Connections": [
        {
            "ID": 255792,
            "ConnectionTypeID": 25,
            "StatusTypeID": 50,
            "LevelID": 2,
            "Amps": 32,
            "Voltage": 400,
            "PowerKW": 22,
            "CurrentTypeID": 20,
            "Quantity": 2
        }
    ],
    "NumberOfPoints": 2,
    "StatusTypeID": 50,
    "DateLastStatusUpdate": "2020-09-25T10:23:00Z",
    "DataQualityLevel": 1,
    "DateCreated": "2020-09-25T10:23:00Z",
    "SubmissionStatusTypeID": 200
}