{
    "IsRecentlyVerified": false,
    "ID": 31188,
    "UUID": "521A59D3-FCF2-45D5-81F1-5B69152DFBA3",
    "DataProviderID": 1,
    "DataProvidersReference": "2470",
    "OperatorID": 1,
    "UsageTypeID": 5,
    "AddressInfo": {
        "ID": 31534,
        "Title": "Kiwi Øyer",
        "AddressLine1": "Kongsvegen 4",
        "Town": "ØYER",
        "StateOrProvince": "Innlandet",
        "Postcode": "2636",
        "CountryID": 168,
        "Latitude": 61.24387,
        "Longitude": 10.43865,
        "AccessComments": "",
        "DistanceUnit": 0
    },
    "Connections": [
        {
            "ID": 34455,
            "ConnectionTypeID": 33,
            "Reference": "1",
            "StatusTypeID": 50,
            "LevelID": 3,
            "Amps": 100,
            "Voltage": 500,
            "PowerKW": 50,
            "CurrentTypeID": 30,
            "Quantity": 2,
            "Comments": "Mode 4"
        },
        {
            "ID": 87151,
            "ConnectionTypeID": 2,
            "Reference": "2",
            "StatusTypeID": 50,
            "LevelID": 3,
            "Amps": 100,
            "Voltage": 500,
            "PowerKW": 50,
            "CurrentTypeID": 30,
            "Quantity": 2,
            "Comments": "Mode 4"
        },
        {
            "ID": 89207,
            "ConnectionTypeID": 25,
            "Reference": "3",
            "StatusTypeID": 50,
            "LevelID": 2,
            "Amps": 32,
            "Voltage": 400,
            "PowerKW": 22,
            "CurrentTypeID": 20,
            "Quantity": 2,
            "Comments": "Mode 3"
        }
    ],
    "NumberOfPoints": 8,
    "StatusTypeID": 50,
    "DateLastStatusUpdate": "2020-08-27T18:19:00Z",
    "DataQualityLevel": 2,
    "DateCreated": "2014-12-11T09:03:00Z",
    "SubmissionStatusTypeID": 100
}