{
    "IsRecentlyVerified": false,
    "ID": 35180,
    "UUID": "06DADB94-66D2-4CA7-AA57-0EC028BBF9DD",
    "DataProviderID": 26,
    "DataProvidersReference": "39270",
    "OperatorID": 157,
    "OperatorsReference": "NewMotion 02006639",
    "UsageCost": "0.00 jaarabonnement",
    "AddressInfo": {
        "ID": 35526,
        "Title": "Schelmseweg",
        "AddressLine1": "Schelmseweg",
        "Town": "Arnhem",
        "Postcode": "6816 SG",
        "CountryID": 159,
        "Latitude": 52.0086644018742,
        "Longitude": 5.90659618377686,
        "ContactTelephone1": "088 0109500",
        "RelatedURL": "http://thenewmotion.nl/",
        "DistanceUnit": 0
    },
    "Connections": [
        {
            "ID": 38691,
            "ConnectionTypeID": 25,
            "LevelID": 2,
            "PowerKW": 3.7,
            "CurrentTypeID": 10
        }
    ],
    "NumberOfPoints": 1,
    "StatusTypeID": 50,
    "DateLastStatusUpdate": "2016-06-04T02:44:00Z",
    "DataQualityLevel": 3,
    "DateCreated": "2015-01-09T06:04:00Z",
    "SubmissionStatusTypeID": 100
}