{
    "IsRecentlyVerified": false,
    "ID": 13581,
    "UUID": "2D6547C0-0FF9-440B-8335-10AF5ECDE2A9",
    "DataProviderID": 1,
    "UsageTypeID": 0,
    "UsageCost": "Free",
    "AddressInfo": {
        "ID": 13478,
        "Title": "Auberge de Faune ",
        "AddressLine1": "Rue des Grottes 4",
        "AddressLine2": "",
        "Town": "Han-Sur-Lesse",
        "StateOrProvince": "",
        "Postcode": "5580 ",
        "CountryID": 26,
        "Latitude": 50.1249532,
        "Longitude": 5.188153800000009,
        "ContactTelephone1": "",
        "ContactTelephone2": "",
        "ContactEmail": "",
        "AccessComments": "",
        "RelatedURL": "",
        "DistanceUnit": 0
    },
    "Connections": [],
    "NumberOfPoints": 1,
    "GeneralComments": "",
    "StatusTypeID": 50,
    "DateLastStatusUpdate": "2012-11-17T12:24:00Z",
    "DataQualityLevel": 1,
    "DateCreated": "2012-11-17T12:24:00Z",
    "SubmissionStatusTypeID": 200
}