{
    "IsRecentlyVerified": false,
    "ID": 99456,
    "UUID": "54B6C661-086B-4EAB-BF31-190C41734DDE",
    "DataProviderID": 1,
    "OperatorID": 23,
    "OperatorsReference": "40022",
    "UsageTypeID": 4,
    "AddressInfo": {
        "ID": 99802,
        "Title": "German Center",
        "AddressLine1": "Av Sta Fe 170 Zedec Sta Fe",
        "Town": "Alvaro Obregon",
        "StateOrProvince": "Ciudad de Mexico",
        "Postcode": "01219",
        "CountryID": 146,
        "Latitude": 19.366749,
        "Longitude": -99.260706,
        "ContactTelephone1": "+52 55 9172 9210",
        "DistanceUnit": 0
    },
    "Connections": [
        {
            "ID": 140545,
            "ConnectionTypeID": 30,
            "StatusTypeID": 50,
            "LevelID": 2,
            "PowerKW": 18,
            "CurrentTypeID": 20,
            "Quantity": 3
        }
    ],
    "NumberOfPoints": 3,
    "GeneralComments": "3 Tesla Connectors, up to 18kW.Available for members only. Please see valet.",
    "StatusTypeID": 50,
    "DateLastStatusUpdate": "2018-01-26T06:52:00Z",
    "DataQualityLevel": 1,
    "DateCreated": "2018-01-26T06:52:00Z",
    "SubmissionStatusTypeID": 200
}