{
    "IsRecentlyVerified": false,
    "ID": 152297,
    "UUID": "690EE41C-5A0F-4729-84A2-737E572201E6",
    "DataProviderID": 28,
    "DataProvidersReference": "FRSEOPAB09287A",
    "OperatorID": 3383,
    "UsageTypeID": 5,
    "AddressInfo": {
        "ID": 152650,
        "Title": "R‚seau AlterBase - Bressuire - Centre commercial Pont d'Ouit - QC",
        "AddressLine1": "Zone commerciale Pont d'Ouit - 79300 BRESSUIRE",
        "CountryID": 80,
        "Latitude": 46.8509075,
        "Longitude": -0.495796,
        "AccessComments": "24/24 7/7 jours",
        "DistanceUnit": 0
    },
    "Connections": [
        {
            "ID": 213160,
            "ConnectionTypeID": 1036,
            "StatusTypeID": 50,
            "LevelID": 3,
            "PowerKW": 43,
            "CurrentTypeID": 20
        },
        {
            "ID": 213161,
            "ConnectionTypeID": 33,
            "StatusTypeID": 50,
            "LevelID": 3,
            "PowerKW": 50,
            "CurrentTypeID": 30
        },
        {
            "ID": 246024,
            "ConnectionTypeID": 1036,
            "StatusTypeID": 50,
            "LevelID": 3,
            "PowerKW": 43,
            "CurrentTypeID": 20
        }
    ],
    "GeneralComments": "www.alterbase.fr",
    "StatusTypeID": 50,
    "DateLastStatusUpdate": "2020-08-27T05:13:00Z",
    "DataQualityLevel": 2,
    "DateCreated": "2020-03-15T10:53:00Z",
    "SubmissionStatusTypeID": 100
}