{
    "UserComments": [
        {
            "ID": 19808,
            "ChargePointID": 54225,
            "CommentTypeID": 10,
            "UserName": "Simon Hewison",
            "Comment": "Fairly slow, max 31kW.",
            "Rating": 2,
            "DateCreated": "2018-07-15T04:11:17.02Z",
            "User": {
                "ID": 4575,
                "Username": "Simon Hewison"
            },
            "CheckinStatusTypeID": 10
        }
    ],
    "IsRecentlyVerified": false,
    "ID": 54225,
    "UUID": "0A1E606B-B987-4206-8A64-113982272695",
    "DataProviderID": 1,
    "OperatorID": 20,
    "OperatorsReference": "70623",
    "UsageTypeID": 4,
    "UsageCost": "£0.18/kWh;min £1.50;Overstay charge of £5.00 after 60 minutes",
    "AddressInfo": {
        "ID": 54571,
        "Title": "Maidenstone Hill / Blackheath Hill (A2)",
        "AddressLine1": "Maidenstone Hill",
        "AddressLine2": "Royal Borough of Greenwich",
        "Town": "London",
        "Postcode": "SE10 8SX",
        "CountryID": 1,
        "Latitude": 51.4725750096212,
        "Longitude": -0.0125145556739881,
        "DistanceUnit": 0
    },
    "Connections": [
        {
            "ID": 68223,
            "ConnectionTypeID": 2,
            "StatusTypeID": 50,
            "LevelID": 3,
            "Amps": 125,
            "Voltage": 400,
            "PowerKW": 50,
            "CurrentTypeID": 30,
            "Quantity": 1
        },
        {
            "ID": 68224,
            "ConnectionTypeID": 1036,
            "StatusTypeID": 100,
            "LevelID": 3,
            "Amps": 63,
            "Voltage": 400,
            "PowerKW": 43,
            "CurrentTypeID": 20,
            "Quantity": 1
        },
        {
            "ID": 68225,
            "ConnectionTypeID": 33,
            "StatusTypeID": 50,
            "LevelID": 3,
            "Amps": 125,
            "Voltage": 400,
            "PowerKW": 50,
            "CurrentTypeID": 30,
            "Quantity": 1
        }
    ],
    "NumberOfPoints": 1,
    "GeneralComments": "DBT triple-headed rapid charger.",
    "StatusTypeID": 75,
    "DateLastStatusUpdate": "2020-06-02T14:21:00Z",
    "DataQualityLevel": 1,
    "DateCreated": "2015-09-25T09:21:00Z",
    "SubmissionStatusTypeID": 200
}