{
    "IsRecentlyVerified": false,
    "ID": 39808,
    "UUID": "638F8025-AAE7-47E1-87C9-DB5E58B42BBF",
    "DataProviderID": 2,
    "DataProvidersReference": "49168",
    "UsageTypeID": 1,
    "AddressInfo": {
        "ID": 40154,
        "Title": "Hilton Garden Inn - Parking Garage",
        "AddressLine1": "275 Baker St",
        "Town": "Atlanta",
        "StateOrProvince": "GA",
        "Postcode": "30313",
        "CountryID": 2,
        "Latitude": 33.76202,
        "Longitude": -84.3962,
        "ContactTelephone1": "404-577-2001",
        "AccessComments": "24 hours daily; see valet for access",
        "RelatedURL": "",
        "DistanceUnit": 0
    },
    "Connections": [
        {
            "ID": 43339,
            "ConnectionTypeID": 1,
            "LevelID": 2,
            "Amps": 16,
            "Voltage": 230,
            "PowerKW": 3.7,
            "CurrentTypeID": 10,
            "Quantity": 2
        }
    ],
    "DateLastStatusUpdate": "2020-06-26T02:56:00Z",
    "DataQualityLevel": 3,
    "DateCreated": "2015-01-10T01:01:00Z",
    "SubmissionStatusTypeID": 100
}