{
    "IsRecentlyVerified": false,
    "ID": 139938,
    "UUID": "A5B6014E-533C-47A6-B13A-5F5FC4FA12ED",
    "DataProviderID": 2,
    "DataProvidersReference": "149959",
    "UsageTypeID": 2,
    "AddressInfo": {
        "ID": 140290,
        "Title": "Silver Star Chevrolet",
        "AddressLine1": "3440 Thousand Oaks Blvd",
        "Town": "Thousand Oaks",
        "StateOrProvince": "CA",
        "Postcode": "91362",
        "CountryID": 2,
        "Latitude": 34.175229590149,
        "Longitude": -118.843920807549,
        "ContactTelephone1": "805-267-3100",
        "AccessComments": "Dealership business hours; customer use only",
        "RelatedURL": "",
        "DistanceUnit": 0
    },
    "Connections": [
        {
            "ID": 195442,
            "ConnectionTypeID": 1,
            "LevelID": 2,
            "Amps": 16,
            "Voltage": 230,
            "PowerKW": 3.7,
            "CurrentTypeID": 10,
            "Quantity": 4
        },
        {
            "ID": 195443,
            "ConnectionTypeID": 32,
            "LevelID": 3,
            "Amps": 100,
            "Voltage": 400,
            "PowerKW": 40,
            "CurrentTypeID": 30,
            "Quantity": 1
        }
    ],
    "StatusTypeID": 50,
    "DateLastStatusUpdate": "2020-06-26T02:57:00Z",
    "DataQualityLevel": 3,
    "DateCreated": "2019-12-24T09:11:00Z",
    "SubmissionStatusTypeID": 100
}