{
    "IsRecentlyVerified": false,
    "ID": 15223,
    "UUID": "F606C366-228D-4D20-A1A5-63777236C49C",
    "DataProviderID": 1,
    "OperatorID": 1,
    "UsageTypeID": 0,
    "UsageCost": "Free",
    "AddressInfo": {
        "ID": 15569,
        "Title": "Nissan Autolyv",
        "AddressLine1": "ZI Sud, rue de la prévachère",
        "AddressLine2": "",
        "Town": "Saint Martin d'Hères",
        "StateOrProvince": "",
        "Postcode": "38400 ",
        "CountryID": 80,
        "Latitude": 45.165133,
        "Longitude": 5.767761000000064,
        "ContactTelephone1": "04 76 62 81 81",
        "ContactTelephone2": "",
        "ContactEmail": "contacts@autolyv.com",
        "AccessComments": " Ouvert du lundi au vendredi de 8h à 12h et de 14h à 19h Le samedi de 9h à 12h et de 14h à 17h30",
        "RelatedURL": "http://autolyv.autosmanuel.fr/autosmanuel/index.aspx?site=AUTOSMA&lang=FR",
        "DistanceUnit": 0
    },
    "Connections": [
        {
            "ID": 13513,
            "ConnectionTypeID": 2,
            "StatusTypeID": 0,
            "LevelID": 3,
            "Quantity": 1
        }
    ],
    "NumberOfPoints": 1,
    "GeneralComments": "",
    "StatusTypeID": 50,
    "DateLastStatusUpdate": "2012-12-25T19:29:00Z",
    "DataQualityLevel": 1,
    "DateCreated": "2012-12-25T19:29:00Z",
    "SubmissionStatusTypeID": 200
}