{
    "IsRecentlyVerified": false,
    "ID": 119465,
    "UUID": "03C41721-8005-409F-9B91-9E912BFD2CE0",
    "DataProviderID": 2,
    "DataProvidersReference": "45951",
    "OperatorID": 107,
    "UsageTypeID": 1,
    "AddressInfo": {
        "ID": 119811,
        "Title": "Stadium Marketplace",
        "AddressLine1": "4561 Salt Lake Blvd",
        "Town": "Honolulu",
        "StateOrProvince": "HI",
        "Postcode": "96818",
        "CountryID": 2,
        "Latitude": 21.36605,
        "Longitude": -157.92987,
        "ContactTelephone1": "650-845-2869",
        "AccessComments": "24 hours daily",
        "RelatedURL": "http://www.opconnect.com/",
        "DistanceUnit": 0
    },
    "Connections": [
        {
            "ID": 168728,
            "ConnectionTypeID": 1,
            "LevelID": 2,
            "Amps": 16,
            "Voltage": 230,
            "PowerKW": 3.7,
            "CurrentTypeID": 10,
            "Quantity": 4
        }
    ],
    "DateLastStatusUpdate": "2020-06-26T02:52:00Z",
    "DataQualityLevel": 3,
    "DateCreated": "2019-04-01T04:59:00Z",
    "SubmissionStatusTypeID": 100
}