{
    "IsRecentlyVerified": false,
    "ID": 95206,
    "UUID": "33EDA440-0D6E-47D6-A828-7ABD9BAE9F71",
    "DataProviderID": 1,
    "OperatorID": 23,
    "OperatorsReference": "37252",
    "UsageTypeID": 4,
    "AddressInfo": {
        "ID": 95552,
        "Title": "Serengeti Park Hodenhagen",
        "AddressLine1": "Am Safaripark 1",
        "Town": "Hodenhagen",
        "Postcode": "29693",
        "CountryID": 87,
        "Latitude": 52.748966,
        "Longitude": 9.616828,
        "ContactTelephone1": "+49 5164 97990",
        "DistanceUnit": 0
    },
    "Connections": [
        {
            "ID": 134874,
            "ConnectionTypeID": 30,
            "StatusTypeID": 50,
            "LevelID": 2,
            "Amps": 16,
            "Voltage": 400,
            "PowerKW": 11,
            "CurrentTypeID": 20,
            "Quantity": 1
        }
    ],
    "NumberOfPoints": 1,
    "GeneralComments": "1 Tesla Connector, up to 11kW.Available for customers. Please see front desk.",
    "StatusTypeID": 50,
    "DateLastStatusUpdate": "2018-10-03T18:26:00Z",
    "DataQualityLevel": 1,
    "DateCreated": "2017-11-05T06:56:00Z",
    "SubmissionStatusTypeID": 200
}