{
    "IsRecentlyVerified": false,
    "ID": 173941,
    "UUID": "60F435A2-2D7E-481E-BA3A-71DCCC67F9F4",
    "DataProviderID": 1,
    "OperatorID": 3,
    "OperatorsReference": "t54_hu1_3920_018",
    "UsageTypeID": 4,
    "UsageCost": "£0.25/kWh",
    "AddressInfo": {
        "ID": 174300,
        "Title": "Lidl-Hornchurch",
        "AddressLine1": "31 High Street",
        "Town": "Hornchurch",
        "Postcode": "RM11 1TP",
        "CountryID": 1,
        "Latitude": 51.563479,
        "Longitude": 0.215635,
        "DistanceUnit": 0
    },
    "Connections": [
        {
            "ID": 267852,
            "ConnectionTypeID": 25,
            "StatusTypeID": 50,
            "LevelID": 2,
            "Amps": 32,
            "Voltage": 400,
            "PowerKW": 22,
            "CurrentTypeID": 20,
            "Quantity": 1
        },
        {
            "ID": 267853,
            "ConnectionTypeID": 33,
            "StatusTypeID": 50,
            "LevelID": 3,
            "PowerKW": 50,
            "CurrentTypeID": 30,
            "Quantity": 1
        },
        {
            "ID": 267854,
            "ConnectionTypeID": 2,
            "StatusTypeID": 50,
            "LevelID": 3,
            "PowerKW": 50,
            "CurrentTypeID": 30,
            "Quantity": 1
        }
    ],
    "NumberOfPoints": 1,
    "GeneralComments": "This is a Pod Point rapid charger installed at the Lidl super store at High Street, Hornchurch",
    "StatusTypeID": 50,
    "DateLastStatusUpdate": "2021-03-22T06:16:00Z",
    "DataQualityLevel": 1,
    "DateCreated": "2021-03-08T06:32:00Z",
    "SubmissionStatusTypeID": 200
}