{
    "UserComments": [
        {
            "ID": 21186,
            "ChargePointID": 118124,
            "CommentTypeID": 10,
            "UserName": "ForumElettrico.it",
            "RelatedURL": "https://www.forumelettrico.it/forum/colonnina-enel-x-44-kw-camaiore-lucca-via-gusceri-41-t6191.html",
            "DateCreated": "2019-07-09T08:48:04.503Z",
            "User": {
                "ID": 11749,
                "Username": "ForumElettrico.it"
            },
            "CheckinStatusTypeID": 10
        }
    ],
    "MediaItems": [
        {
            "ID": 18842,
            "ChargePointID": 118124,
            "ItemURL": "https://s3-ap-southeast-2.amazonaws.com/openchargemap/images/IT/OCM118124/OCM-118124.orig.2019070908481757.jpg",
            "ItemThumbnailURL": "https://s3-ap-southeast-2.amazonaws.com/openchargemap/images/IT/OCM118124/OCM-118124.thmb.2019070908481757.jpg",
            "Comment": "",
            "IsEnabled": true,
            "IsVideo": false,
            "IsFeaturedItem": false,
            "IsExternalResource": false,
            "User": {
                "ID": 11749,
                "Username": "ForumElettrico.it"
            },
            "DateCreated": "2019-07-09T08:49:00Z"
        },
        {
            "ID": 18843,
            "ChargePointID": 118124,
            "ItemURL": "https://s3-ap-southeast-2.amazonaws.com/openchargemap/images/IT/OCM118124/OCM-118124.orig.2019070908482338.jpg",
            "ItemThumbnailURL": "https://s3-ap-southeast-2.amazonaws.com/openchargemap/images/IT/OCM118124/OCM-118124.thmb.2019070908482338.jpg",
            "Comment": "",
            "IsEnabled": true,
            "IsVideo": false,
            "IsFeaturedItem": false,
            "IsExternalResource": false,
            "User": {
                "ID": 11749,
                "Username": "ForumElettrico.it"
            },
            "DateCreated": "2019-07-09T08:49:00Z"
        }
    ],
    "IsRecentlyVerified": false,
    "ID": 118124,
    "UUID": "51115E1C-7EF0-4B2B-A6E3-FDCBE4B0A66F",
    "DataProviderID": 1,
    "OperatorID": 80,
    "UsageTypeID": 4,
    "AddressInfo": {
        "ID": 118470,
        "Title": "Camaiore Gusceri | EnelX",
        "AddressLine1": "Via Gusceri",
        "Town": "Camaiore",
        "StateOrProvince": "LU",
        "Postcode": "55041",
        "CountryID": 112,
        "Latitude": 43.94328203586227,
        "Longitude": 10.308384789496017,
        "ContactTelephone1": "800.069.850",
        "RelatedURL": "https://www.enelx.com/it/it/emobility",
        "DistanceUnit": 0
    },
    "Connections": [
        {
            "ID": 167157,
            "ConnectionTypeID": 25,
            "StatusTypeID": 50,
            "LevelID": 2,
            "Amps": 32,
            "Voltage": 400,
            "PowerKW": 22,
            "CurrentTypeID": 20,
            "Quantity": 1
        },
        {
            "ID": 167158,
            "ConnectionTypeID": 36,
            "StatusTypeID": 50,
            "LevelID": 2,
            "Amps": 16,
            "Voltage": 240,
            "PowerKW": 3.7,
            "CurrentTypeID": 10,
            "Quantity": 1
        }
    ],
    "NumberOfPoints": 2,
    "StatusTypeID": 50,
    "DateLastStatusUpdate": "2019-07-09T08:49:00Z",
    "DataQualityLevel": 1,
    "DateCreated": "2019-03-15T16:24:00Z",
    "SubmissionStatusTypeID": 200
}