{
    "IsRecentlyVerified": false,
    "ID": 46508,
    "UUID": "4A7C83F3-BDB2-43B8-8708-9A0012BBBD2B",
    "DataProviderID": 1,
    "DataProvidersReference": "39",
    "AddressInfo": {
        "ID": 46854,
        "Title": "Åsane Storsenter, Bergen",
        "AddressLine1": "Åsane senter 16",
        "Town": "ULSET",
        "StateOrProvince": "Vestland",
        "Postcode": "5116",
        "CountryID": 168,
        "Latitude": 60.46547,
        "Longitude": 5.32418,
        "AccessComments": "To plasser i Åsane Storsenters parkeringskjeller(under gamle Arken) mot motorveien.",
        "DistanceUnit": 0
    },
    "Connections": [
        {
            "ID": 57171,
            "ConnectionTypeID": 0,
            "Reference": "1",
            "LevelID": 2,
            "Amps": 16,
            "Voltage": 230,
            "PowerKW": 3.7,
            "Comments": "Mode 1"
        },
        {
            "ID": 86963,
            "ConnectionTypeID": 0,
            "Reference": "2",
            "LevelID": 2,
            "Amps": 16,
            "Voltage": 230,
            "PowerKW": 3.7,
            "Comments": "Mode 1"
        },
        {
            "ID": 86964,
            "ConnectionTypeID": 0,
            "Reference": "3",
            "LevelID": 2,
            "Amps": 16,
            "Voltage": 230,
            "PowerKW": 3.7,
            "Comments": "Mode 1"
        },
        {
            "ID": 86965,
            "ConnectionTypeID": 0,
            "Reference": "4",
            "LevelID": 2,
            "Amps": 16,
            "Voltage": 230,
            "PowerKW": 3.7,
            "Comments": "Mode 1"
        },
        {
            "ID": 89057,
            "ConnectionTypeID": 0,
            "Reference": "5",
            "LevelID": 2,
            "Amps": 16,
            "Voltage": 230,
            "PowerKW": 3.7,
            "Comments": "Mode 1"
        }
    ],
    "NumberOfPoints": 5,
    "DateLastStatusUpdate": "2020-05-26T08:24:00Z",
    "DataQualityLevel": 2,
    "DateCreated": "2015-05-03T00:54:00Z",
    "SubmissionStatusTypeID": 100
}