{
    "IsRecentlyVerified": false,
    "ID": 101183,
    "UUID": "2396006F-3458-4B7A-9D4F-89BC8C029439",
    "DataProviderID": 1,
    "OperatorID": 32,
    "OperatorsReference": "24184",
    "UsageTypeID": 4,
    "UsageCost": "£0.108/kWh; for Polar Plus subscription members only",
    "AddressInfo": {
        "ID": 101529,
        "Title": "Holiday Inn Derby-Nottingham M1",
        "AddressLine1": "Holiday Inn Derby",
        "Postcode": "NG10 5NJ",
        "CountryID": 1,
        "Latitude": 52.918674,
        "Longitude": -1.30164,
        "DistanceUnit": 0
    },
    "Connections": [
        {
            "ID": 142846,
            "ConnectionTypeID": 33,
            "StatusTypeID": 50,
            "LevelID": 3,
            "PowerKW": 50,
            "CurrentTypeID": 30,
            "Quantity": 1
        },
        {
            "ID": 142847,
            "ConnectionTypeID": 2,
            "StatusTypeID": 50,
            "LevelID": 3,
            "PowerKW": 50,
            "CurrentTypeID": 30,
            "Quantity": 1
        },
        {
            "ID": 142848,
            "ConnectionTypeID": 1036,
            "StatusTypeID": 50,
            "LevelID": 3,
            "PowerKW": 43,
            "CurrentTypeID": 20,
            "Quantity": 1
        }
    ],
    "NumberOfPoints": 1,
    "GeneralComments": "M1, Junction 25",
    "StatusTypeID": 50,
    "DateLastStatusUpdate": "2019-06-21T05:24:00Z",
    "DataQualityLevel": 1,
    "DateCreated": "2018-03-20T06:15:00Z",
    "SubmissionStatusTypeID": 200
}