{
    "IsRecentlyVerified": false,
    "ID": 125720,
    "UUID": "FF4D4C3A-7CC2-4D68-B805-29B71B7B2DE1",
    "DataProviderID": 1,
    "OperatorID": 80,
    "UsageTypeID": 4,
    "AddressInfo": {
        "ID": 126066,
        "Title": "Castel di Sangro Terminal Bus | EnelX",
        "AddressLine1": "Via Sangro, 72",
        "Town": "Castel di Sangro",
        "StateOrProvince": "AQ",
        "Postcode": "67031",
        "CountryID": 112,
        "Latitude": 41.7828597035185,
        "Longitude": 14.1029565238458,
        "RelatedURL": "https://www.enelx.com/it/it/emobility",
        "DistanceUnit": 0
    },
    "Connections": [
        {
            "ID": 176164,
            "ConnectionTypeID": 25,
            "StatusTypeID": 50,
            "LevelID": 2,
            "Amps": 32,
            "Voltage": 400,
            "PowerKW": 22,
            "CurrentTypeID": 20,
            "Quantity": 1
        },
        {
            "ID": 176165,
            "ConnectionTypeID": 36,
            "StatusTypeID": 50,
            "LevelID": 2,
            "Amps": 16,
            "Voltage": 240,
            "PowerKW": 3.7,
            "CurrentTypeID": 10,
            "Quantity": 1
        }
    ],
    "NumberOfPoints": 2,
    "StatusTypeID": 50,
    "DateLastStatusUpdate": "2019-09-26T08:54:00Z",
    "DataQualityLevel": 1,
    "DateCreated": "2019-04-24T08:48:00Z",
    "SubmissionStatusTypeID": 200
}