{
    "IsRecentlyVerified": false,
    "ID": 11849,
    "UUID": "23F72ACF-667C-455F-8C2F-75729EC600CB",
    "DataProviderID": 1,
    "OperatorID": 3373,
    "UsageTypeID": 1,
    "AddressInfo": {
        "ID": 11746,
        "Title": "2004 Boulevard Rome",
        "AddressLine1": "2004 Boulevard Rome",
        "Town": "Brossard",
        "Postcode": "J4W 3M7",
        "CountryID": 44,
        "Latitude": 45.455619889562854,
        "Longitude": -73.46562578791759,
        "ContactTelephone1": "855-999-8378",
        "DistanceUnit": 0
    },
    "Connections": [
        {
            "ID": 9258,
            "ConnectionTypeID": 1,
            "Reference": "J1772",
            "LevelID": 2
        }
    ],
    "NumberOfPoints": 2,
    "StatusTypeID": 0,
    "DateLastStatusUpdate": "2020-11-18T18:31:00Z",
    "DataQualityLevel": 2,
    "DateCreated": "2012-08-05T04:32:00Z",
    "SubmissionStatusTypeID": 100
}