{
    "IsRecentlyVerified": false,
    "ID": 123211,
    "UUID": "6CDF09D8-AE98-49F7-B8E6-E8F9ADEEF97D",
    "DataProviderID": 2,
    "DataProvidersReference": "95140",
    "OperatorID": 9,
    "UsageTypeID": 2,
    "AddressInfo": {
        "ID": 123557,
        "Title": "Integra Creek",
        "AddressLine1": "3625 Manson Pike",
        "Town": "Murfreesboro",
        "StateOrProvince": "TN",
        "Postcode": "37128",
        "CountryID": 2,
        "Latitude": 35.8694,
        "Longitude": -86.468,
        "ContactTelephone1": "888-998-2546",
        "AccessComments": "MON: 24 hours | TUE: 24 hours | WED: 24 hours | THU: 24 hours | FRI: 24 hours | SAT: 24 hours | SUN: 24 hours",
        "RelatedURL": "http://www.blinkcharging.com/",
        "DistanceUnit": 0
    },
    "Connections": [
        {
            "ID": 173163,
            "ConnectionTypeID": 1,
            "LevelID": 2,
            "Amps": 16,
            "Voltage": 230,
            "PowerKW": 3.7,
            "CurrentTypeID": 10,
            "Quantity": 4
        }
    ],
    "DateLastStatusUpdate": "2020-06-26T02:58:00Z",
    "DataQualityLevel": 3,
    "DateCreated": "2019-04-06T05:03:00Z",
    "SubmissionStatusTypeID": 100
}