{
    "IsRecentlyVerified": false,
    "ID": 93431,
    "UUID": "EC628134-A35D-44B4-A264-CAA76DA150A1",
    "DataProviderID": 1,
    "OperatorID": 23,
    "OperatorsReference": "35820",
    "UsageTypeID": 6,
    "AddressInfo": {
        "ID": 93777,
        "Title": "Acantus Hotel & Restaurant",
        "AddressLine1": "Ringstrasse 11",
        "Town": "Weisendorf",
        "Postcode": "91085",
        "CountryID": 87,
        "Latitude": 49.633715,
        "Longitude": 10.820229,
        "ContactTelephone1": "+49 9135 211660",
        "DistanceUnit": 0
    },
    "Connections": [
        {
            "ID": 132308,
            "ConnectionTypeID": 30,
            "StatusTypeID": 50,
            "LevelID": 2,
            "Amps": 32,
            "Voltage": 400,
            "PowerKW": 22,
            "CurrentTypeID": 20,
            "Quantity": 2
        }
    ],
    "NumberOfPoints": 2,
    "GeneralComments": "2 Tesla Connectors, up to 22kW.Available for patrons only. Please see front desk.",
    "StatusTypeID": 50,
    "DateLastStatusUpdate": "2018-10-03T19:49:00Z",
    "DataQualityLevel": 1,
    "DateCreated": "2017-09-27T19:32:00Z",
    "SubmissionStatusTypeID": 200
}