{
    "IsRecentlyVerified": false,
    "ID": 90319,
    "UUID": "5D67B41E-43BB-4099-9A4C-4A3E16E3D78C",
    "DataProviderID": 1,
    "OperatorID": 23,
    "OperatorsReference": "28759",
    "UsageTypeID": 4,
    "UsageCost": "€0.24/kWh; Autres tarifs pour les voitures anciennes",
    "AddressInfo": {
        "ID": 90665,
        "Title": "Valenciennes Supercharger",
        "AddressLine1": "Rue de Maugré",
        "Town": "Rouvignies",
        "Postcode": "59220",
        "CountryID": 80,
        "Latitude": 50.336704,
        "Longitude": 3.455931,
        "DistanceUnit": 0
    },
    "Connections": [
        {
            "ID": 127972,
            "ConnectionTypeID": 27,
            "StatusTypeID": 50,
            "LevelID": 3,
            "PowerKW": 120,
            "CurrentTypeID": 30,
            "Quantity": 10
        }
    ],
    "NumberOfPoints": 10,
    "GeneralComments": "Charging10 Superchargers, available 24/7",
    "StatusTypeID": 50,
    "DateLastStatusUpdate": "2019-03-22T17:51:00Z",
    "DataQualityLevel": 1,
    "DateCreated": "2017-07-13T14:46:00Z",
    "SubmissionStatusTypeID": 200
}