{
    "IsRecentlyVerified": false,
    "ID": 35914,
    "UUID": "B34E7687-9076-4B26-ADDB-4FD83610EFE1",
    "DataProviderID": 26,
    "DataProvidersReference": "47552",
    "OperatorID": 178,
    "OperatorsReference": "EVnetNL AL703",
    "UsageCost": "0.00 jaarabonnement",
    "AddressInfo": {
        "ID": 36260,
        "Title": "Wilhelminapark 67",
        "AddressLine1": "Wilhelminapark 67",
        "Town": "Utrecht",
        "Postcode": "3581 NP",
        "CountryID": 159,
        "Latitude": 52.086763,
        "Longitude": 5.141701,
        "ContactTelephone1": "0800-3522365",
        "RelatedURL": "http://www.evnet.nl",
        "DistanceUnit": 0
    },
    "Connections": [
        {
            "ID": 39425,
            "ConnectionTypeID": 25,
            "LevelID": 2,
            "PowerKW": 11,
            "CurrentTypeID": 10
        }
    ],
    "NumberOfPoints": 2,
    "StatusTypeID": 50,
    "DateLastStatusUpdate": "2016-06-04T02:50:00Z",
    "DataQualityLevel": 3,
    "DateCreated": "2015-01-09T06:05:00Z",
    "SubmissionStatusTypeID": 100
}