{
    "IsRecentlyVerified": false,
    "ID": 28439,
    "UUID": "1E51DE91-494E-4FD8-8AAE-C213FEB69275",
    "DataProviderID": 2,
    "DataProvidersReference": "60791",
    "OperatorID": 5,
    "UsageTypeID": 1,
    "AddressInfo": {
        "ID": 28785,
        "Title": "RALLYE BMW",
        "AddressLine1": "4016-4952 Brush Hollow Rd",
        "Town": "Westbury",
        "StateOrProvince": "NY",
        "Postcode": "11590",
        "CountryID": 2,
        "Latitude": 40.7788001,
        "Longitude": -73.5579658,
        "ContactTelephone1": "888-758-4389",
        "AccessComments": "24 hours daily",
        "RelatedURL": "http://www.chargepoint.com/",
        "DistanceUnit": 0
    },
    "Connections": [
        {
            "ID": 31253,
            "ConnectionTypeID": 1,
            "LevelID": 2,
            "Amps": 16,
            "Voltage": 230,
            "PowerKW": 3,
            "CurrentTypeID": 10,
            "Quantity": 2
        }
    ],
    "DateLastStatusUpdate": "2019-12-24T09:18:00Z",
    "DataQualityLevel": 3,
    "DateCreated": "2014-11-28T03:38:00Z",
    "SubmissionStatusTypeID": 100
}