{
    "IsRecentlyVerified": false,
    "ID": 123275,
    "UUID": "4E30CBB8-C03B-4197-8DC0-CB84677A7ADF",
    "DataProviderID": 2,
    "DataProvidersReference": "81839",
    "OperatorID": 5,
    "UsageTypeID": 1,
    "AddressInfo": {
        "ID": 123621,
        "Title": "DUKEPTS",
        "AddressLine1": "304 Research Dr",
        "Town": "Durham",
        "StateOrProvince": "NC",
        "Postcode": "27710",
        "CountryID": 2,
        "Latitude": 36.0070201,
        "Longitude": -78.9412623,
        "ContactTelephone1": "888-758-4389",
        "AccessComments": "24 hours daily",
        "RelatedURL": "http://www.chargepoint.com/",
        "DistanceUnit": 0
    },
    "Connections": [
        {
            "ID": 173236,
            "ConnectionTypeID": 1,
            "LevelID": 2,
            "Amps": 16,
            "Voltage": 230,
            "PowerKW": 3.7,
            "CurrentTypeID": 10,
            "Quantity": 2
        }
    ],
    "DateLastStatusUpdate": "2020-06-26T02:58:00Z",
    "DataQualityLevel": 3,
    "DateCreated": "2019-04-06T05:03:00Z",
    "SubmissionStatusTypeID": 100
}