{
    "IsRecentlyVerified": false,
    "ID": 181110,
    "UUID": "D984E65A-131E-4C30-9E39-CCBCB1A9B49D",
    "DataProviderID": 29,
    "DataProvidersReference": "14673",
    "AddressInfo": {
        "ID": 181469,
        "Title": "An der Hochschule 1",
        "AddressLine1": "An der Hochschule 1",
        "Town": "Feuchtwangen",
        "Postcode": "91555",
        "CountryID": 87,
        "Latitude": 49.17962,
        "Longitude": 10.33563,
        "DistanceUnit": 0
    },
    "Connections": [
        {
            "ID": 285016,
            "ConnectionTypeID": 25,
            "StatusTypeID": 50,
            "LevelID": 2,
            "PowerKW": 22,
            "CurrentTypeID": 20
        },
        {
            "ID": 285017,
            "ConnectionTypeID": 25,
            "StatusTypeID": 50,
            "LevelID": 2,
            "PowerKW": 22,
            "CurrentTypeID": 20
        },
        {
            "ID": 285018,
            "ConnectionTypeID": 25,
            "StatusTypeID": 50,
            "LevelID": 2,
            "PowerKW": 22,
            "CurrentTypeID": 20
        },
        {
            "ID": 285019,
            "ConnectionTypeID": 25,
            "StatusTypeID": 50,
            "LevelID": 2,
            "PowerKW": 22,
            "CurrentTypeID": 20
        }
    ],
    "StatusTypeID": 50,
    "DateLastStatusUpdate": "2021-07-12T02:42:00Z",
    "MetadataValues": [
        {
            "ID": 13404,
            "MetadataFieldID": 4,
            "ItemValue": "Data from the German chargepoint registry provided by Bundesnetzagentur.de under the CC-BY 4.0 license"
        }
    ],
    "DataQualityLevel": 3,
    "DateCreated": "2021-07-08T10:01:00Z",
    "SubmissionStatusTypeID": 100
}