{
    "IsRecentlyVerified": false,
    "ID": 159931,
    "UUID": "BE7853C9-B8C3-439C-8171-3A0B0411EC37",
    "DataProviderID": 2,
    "DataProvidersReference": "151859",
    "OperatorID": 3293,
    "UsageTypeID": 1,
    "AddressInfo": {
        "ID": 160288,
        "Title": "Walgreens #5832",
        "AddressLine1": "1225 W Dundee Rd",
        "Town": "Buffalo Grove",
        "StateOrProvince": "IL",
        "Postcode": "60089",
        "CountryID": 2,
        "Latitude": 42.138564,
        "Longitude": -87.986826,
        "ContactTelephone1": "888-264-2208",
        "AccessComments": "6am-12am daily",
        "RelatedURL": "https://voltacharging.com/",
        "DistanceUnit": 0
    },
    "Connections": [
        {
            "ID": 230152,
            "ConnectionTypeID": 1,
            "LevelID": 2,
            "Amps": 16,
            "Voltage": 230,
            "PowerKW": 3.7,
            "CurrentTypeID": 10,
            "Quantity": 2
        }
    ],
    "StatusTypeID": 50,
    "DateLastStatusUpdate": "2020-06-26T03:05:00Z",
    "DataQualityLevel": 3,
    "DateCreated": "2020-06-26T03:05:00Z",
    "SubmissionStatusTypeID": 100
}