{
    "IsRecentlyVerified": false,
    "ID": 61880,
    "UUID": "F5F57003-EA8C-4885-9C81-1CCC87AF5221",
    "DataProviderID": 2,
    "DataProvidersReference": "69988",
    "UsageTypeID": 2,
    "AddressInfo": {
        "ID": 62226,
        "Title": "Caltrans - District 6",
        "AddressLine1": "1352 W Olive Ave",
        "Town": "Fresno",
        "StateOrProvince": "CA",
        "Postcode": "93728",
        "CountryID": 2,
        "Latitude": 36.757664,
        "Longitude": -119.828227,
        "ContactTelephone1": "",
        "AccessComments": "Fleet vehicle use only",
        "RelatedURL": "",
        "DistanceUnit": 0
    },
    "Connections": [
        {
            "ID": 78774,
            "ConnectionTypeID": 1,
            "LevelID": 2,
            "Amps": 16,
            "Voltage": 230,
            "PowerKW": 3,
            "CurrentTypeID": 10,
            "Quantity": 7
        }
    ],
    "DateLastStatusUpdate": "2019-04-06T04:02:00Z",
    "DataQualityLevel": 3,
    "DateCreated": "2016-03-03T11:38:00Z",
    "SubmissionStatusTypeID": 100
}