{
    "IsRecentlyVerified": false,
    "ID": 158364,
    "UUID": "5DBFEBA9-1ED5-4FEC-B566-EB7DA0A4B39D",
    "DataProviderID": 2,
    "DataProvidersReference": "156075",
    "OperatorID": 5,
    "UsageTypeID": 1,
    "AddressInfo": {
        "ID": 158718,
        "Title": "ENMARKET",
        "AddressLine1": "7002 GA-21",
        "Town": "Savannah",
        "StateOrProvince": "GA",
        "Postcode": "31407",
        "CountryID": 2,
        "Latitude": 32.1891275,
        "Longitude": -81.1932976,
        "ContactTelephone1": "888-758-4389",
        "AccessComments": "24 hours daily",
        "RelatedURL": "http://www.chargepoint.com/",
        "DistanceUnit": 0
    },
    "Connections": [
        {
            "ID": 228332,
            "ConnectionTypeID": 2,
            "LevelID": 3,
            "Amps": 100,
            "Voltage": 400,
            "PowerKW": 40,
            "CurrentTypeID": 30,
            "Quantity": 1
        },
        {
            "ID": 228333,
            "ConnectionTypeID": 32,
            "LevelID": 3,
            "Amps": 100,
            "Voltage": 400,
            "PowerKW": 40,
            "CurrentTypeID": 30,
            "Quantity": 1
        }
    ],
    "StatusTypeID": 50,
    "DateLastStatusUpdate": "2020-06-26T02:54:00Z",
    "DataQualityLevel": 3,
    "DateCreated": "2020-06-26T02:54:00Z",
    "SubmissionStatusTypeID": 100
}