{
    "IsRecentlyVerified": false,
    "ID": 3497,
    "UUID": "D09632B7-D87A-4CF7-B359-0B51FD07FD17",
    "DataProviderID": 1,
    "OperatorID": 6,
    "UsageTypeID": 1,
    "AddressInfo": {
        "ID": 3498,
        "Title": "Mossy Nissan Poway",
        "AddressLine1": "14100 Poway Rd",
        "Town": "Poway",
        "StateOrProvince": "CA",
        "Postcode": "92064",
        "CountryID": 2,
        "Latitude": 32.9564,
        "Longitude": -117.0261,
        "ContactTelephone1": "877-957-0606",
        "DistanceUnit": 0
    },
    "Connections": [
        {
            "ID": 13,
            "ConnectionTypeID": 1,
            "Quantity": 1
        }
    ],
    "NumberOfPoints": 2,
    "DateLastStatusUpdate": "2019-12-15T06:07:00Z",
    "DateCreated": "2010-02-28T00:00:00Z",
    "SubmissionStatusTypeID": 200
}