{
    "IsRecentlyVerified": false,
    "ID": 151549,
    "UUID": "4E38E575-40C1-42FB-8418-0F37882094E9",
    "DataProviderID": 28,
    "DataProvidersReference": "FR*S05*P05003*A",
    "OperatorID": 3408,
    "UsageTypeID": 5,
    "AddressInfo": {
        "ID": 151902,
        "Title": "AIGUILLES_Parking Piscine",
        "AddressLine1": "Parking Piscine 05470 AIGUILLES",
        "CountryID": 80,
        "Latitude": 44.781915,
        "Longitude": 6.869095,
        "AccessComments": "24/24 7/7 jours",
        "DistanceUnit": 0
    },
    "Connections": [
        {
            "ID": 211696,
            "ConnectionTypeID": 28,
            "StatusTypeID": 50,
            "LevelID": 2,
            "PowerKW": 22,
            "CurrentTypeID": 10
        },
        {
            "ID": 211697,
            "ConnectionTypeID": 1036,
            "StatusTypeID": 50,
            "LevelID": 2,
            "PowerKW": 22,
            "CurrentTypeID": 20
        },
        {
            "ID": 242956,
            "ConnectionTypeID": 28,
            "StatusTypeID": 50,
            "LevelID": 2,
            "PowerKW": 22,
            "CurrentTypeID": 10
        },
        {
            "ID": 242957,
            "ConnectionTypeID": 1036,
            "StatusTypeID": 50,
            "LevelID": 2,
            "PowerKW": 22,
            "CurrentTypeID": 20
        }
    ],
    "GeneralComments": "",
    "StatusTypeID": 50,
    "DateLastStatusUpdate": "2020-08-27T05:11:00Z",
    "DataQualityLevel": 2,
    "DateCreated": "2020-03-15T10:53:00Z",
    "SubmissionStatusTypeID": 100
}