{
    "IsRecentlyVerified": false,
    "ID": 123240,
    "UUID": "8CA56636-8A88-4467-AD60-55C67A09CB8B",
    "DataProviderID": 2,
    "DataProvidersReference": "96925",
    "UsageTypeID": 2,
    "AddressInfo": {
        "ID": 123586,
        "Title": "PowerSecure",
        "AddressLine1": "4068 Stirrup Creek Dr",
        "Town": "Durham",
        "StateOrProvince": "NC",
        "Postcode": "27703",
        "CountryID": 2,
        "Latitude": 35.921114,
        "Longitude": -78.841953,
        "ContactTelephone1": "919-556-3056",
        "AccessComments": "",
        "RelatedURL": "",
        "DistanceUnit": 0
    },
    "Connections": [
        {
            "ID": 173192,
            "ConnectionTypeID": 1,
            "LevelID": 2,
            "Amps": 16,
            "Voltage": 230,
            "PowerKW": 3.7,
            "CurrentTypeID": 10,
            "Quantity": 2
        }
    ],
    "DateLastStatusUpdate": "2020-06-26T02:58:00Z",
    "DataQualityLevel": 3,
    "DateCreated": "2019-04-06T05:03:00Z",
    "SubmissionStatusTypeID": 100
}