{
    "MediaItems": [
        {
            "ID": 17761,
            "ChargePointID": 117933,
            "ItemURL": "https://s3-ap-southeast-2.amazonaws.com/openchargemap/images/CH/OCM117933/OCM-117933.orig.2019031117142683.jpeg",
            "ItemThumbnailURL": "https://s3-ap-southeast-2.amazonaws.com/openchargemap/images/CH/OCM117933/OCM-117933.thmb.2019031117142683.jpeg",
            "Comment": "",
            "IsEnabled": true,
            "IsVideo": false,
            "IsFeaturedItem": false,
            "IsExternalResource": false,
            "User": {
                "ID": 19988,
                "Username": "pap"
            },
            "DateCreated": "2019-03-11T17:15:00Z"
        },
        {
            "ID": 17762,
            "ChargePointID": 117933,
            "ItemURL": "https://s3-ap-southeast-2.amazonaws.com/openchargemap/images/CH/OCM117933/OCM-117933.orig.2019031117150424.jpeg",
            "ItemThumbnailURL": "https://s3-ap-southeast-2.amazonaws.com/openchargemap/images/CH/OCM117933/OCM-117933.thmb.2019031117150424.jpeg",
            "Comment": "",
            "IsEnabled": true,
            "IsVideo": false,
            "IsFeaturedItem": false,
            "IsExternalResource": false,
            "User": {
                "ID": 19988,
                "Username": "pap"
            },
            "DateCreated": "2019-03-11T17:15:00Z"
        }
    ],
    "IsRecentlyVerified": false,
    "ID": 117933,
    "UUID": "4C03AD73-C76B-406D-B409-045CEE7CDC13",
    "DataProviderID": 1,
    "OperatorID": 3273,
    "UsageTypeID": 4,
    "UsageCost": "0.25 CHF/kWh plus 2 CHF/h",
    "AddressInfo": {
        "ID": 118279,
        "Title": "Perry Center",
        "AddressLine1": "Bernstrasse 4",
        "Town": "Oftringen",
        "StateOrProvince": "Bezirk Zofingen",
        "Postcode": "4665",
        "CountryID": 217,
        "Latitude": 47.3123604911233,
        "Longitude": 7.91459833049453,
        "AccessComments": "public parking garage just right after entry",
        "DistanceUnit": 0
    },
    "Connections": [
        {
            "ID": 166921,
            "ConnectionTypeID": 25,
            "StatusTypeID": 50,
            "LevelID": 2,
            "PowerKW": 22,
            "CurrentTypeID": 20,
            "Quantity": 2
        }
    ],
    "NumberOfPoints": 2,
    "GeneralComments": "Operator is Energie 360",
    "StatusTypeID": 50,
    "DateLastStatusUpdate": "2019-03-11T19:59:00Z",
    "DataQualityLevel": 1,
    "DateCreated": "2019-03-11T17:13:00Z",
    "SubmissionStatusTypeID": 200
}