{
    "IsRecentlyVerified": false,
    "ID": 65772,
    "UUID": "FFBAB552-33DE-43CB-A678-E4ECA0116C8B",
    "DataProviderID": 26,
    "DataProvidersReference": "84639",
    "OperatorID": 103,
    "OperatorsReference": "Allego NLALLEGO0004612",
    "UsageCost": "0.00 jaarabonnement",
    "AddressInfo": {
        "ID": 66118,
        "Title": "Middelweg 108",
        "AddressLine1": "Middelweg 108",
        "Town": "Uitgeest",
        "Postcode": "1911 EK",
        "CountryID": 159,
        "Latitude": 52.52383177,
        "Longitude": 4.70943206,
        "ContactTelephone1": "0800-3745337",
        "RelatedURL": "http://www.allego.eu/",
        "DistanceUnit": 0
    },
    "Connections": [
        {
            "ID": 90818,
            "ConnectionTypeID": 25,
            "LevelID": 2,
            "PowerKW": 11,
            "CurrentTypeID": 10
        },
        {
            "ID": 90819,
            "ConnectionTypeID": 25,
            "LevelID": 2,
            "PowerKW": 11,
            "CurrentTypeID": 10
        }
    ],
    "NumberOfPoints": 1,
    "StatusTypeID": 50,
    "DateLastStatusUpdate": "2016-06-04T02:54:00Z",
    "DataQualityLevel": 3,
    "DateCreated": "2016-04-27T09:42:00Z",
    "SubmissionStatusTypeID": 100
}