{
    "IsRecentlyVerified": false,
    "ID": 40852,
    "UUID": "3E5FD622-D394-4A37-9BF4-16E4CB4B350C",
    "DataProviderID": 26,
    "DataProvidersReference": "57439",
    "OperatorID": 73,
    "OperatorsReference": "EV-Box EVB-P1430059",
    "UsageCost": "0.00 jaarabonnement",
    "AddressInfo": {
        "ID": 41198,
        "Title": "Boulevard",
        "AddressLine1": "Boulevard",
        "Town": "Katwijk",
        "Postcode": "2225 AD",
        "CountryID": 159,
        "Latitude": 52.2067475824065,
        "Longitude": 4.39497692315672,
        "RelatedURL": "http://www.ev-box.nl",
        "DistanceUnit": 0
    },
    "Connections": [
        {
            "ID": 44475,
            "ConnectionTypeID": 25,
            "LevelID": 2,
            "PowerKW": 11,
            "CurrentTypeID": 10
        }
    ],
    "NumberOfPoints": 1,
    "StatusTypeID": 50,
    "DateLastStatusUpdate": "2016-06-04T02:51:00Z",
    "DataQualityLevel": 3,
    "DateCreated": "2015-01-15T09:05:00Z",
    "SubmissionStatusTypeID": 100
}