{
    "IsRecentlyVerified": false,
    "ID": 170148,
    "UUID": "718F7BCA-E546-48B7-9810-CD8CE7DC24DB",
    "DataProviderID": 1,
    "OperatorID": 3408,
    "UsageTypeID": 5,
    "AddressInfo": {
        "ID": 170507,
        "Title": "Rue du Docteur Jean Rebattu",
        "AddressLine1": "Rue du Docteur Jean Rebattu",
        "Town": "Barcelonnette",
        "StateOrProvince": "Provence-Alpes-Côte d'Azur",
        "Postcode": "04400",
        "CountryID": 80,
        "Latitude": 44.38606768231506,
        "Longitude": 6.650203479412085,
        "DistanceUnit": 0
    },
    "Connections": [
        {
            "ID": 259394,
            "ConnectionTypeID": 1036,
            "StatusTypeID": 50,
            "LevelID": 3,
            "PowerKW": 43,
            "CurrentTypeID": 20
        },
        {
            "ID": 259395,
            "ConnectionTypeID": 2,
            "StatusTypeID": 50,
            "LevelID": 3,
            "PowerKW": 50,
            "CurrentTypeID": 30
        },
        {
            "ID": 259396,
            "ConnectionTypeID": 33,
            "StatusTypeID": 50,
            "LevelID": 3,
            "PowerKW": 50,
            "CurrentTypeID": 30
        }
    ],
    "NumberOfPoints": 1,
    "StatusTypeID": 50,
    "DateLastStatusUpdate": "2020-11-20T14:16:00Z",
    "DataQualityLevel": 1,
    "DateCreated": "2020-11-19T15:08:00Z",
    "SubmissionStatusTypeID": 200
}