{
    "IsRecentlyVerified": false,
    "ID": 143033,
    "UUID": "305F97CB-6E8A-4F98-9FEB-8DECE130755C",
    "DataProviderID": 2,
    "DataProvidersReference": "143516",
    "OperatorID": 5,
    "UsageTypeID": 1,
    "AddressInfo": {
        "ID": 143385,
        "Title": "MASS AUDUBON",
        "AddressLine1": "280 Eliot St",
        "Town": "Natick",
        "StateOrProvince": "MA",
        "Postcode": "01760",
        "CountryID": 2,
        "Latitude": 42.25655,
        "Longitude": -71.33928,
        "ContactTelephone1": "888-758-4389",
        "AccessComments": "24 hours daily",
        "RelatedURL": "http://www.chargepoint.com/",
        "DistanceUnit": 0
    },
    "Connections": [
        {
            "ID": 199288,
            "ConnectionTypeID": 1,
            "LevelID": 2,
            "Amps": 16,
            "Voltage": 230,
            "PowerKW": 3.7,
            "CurrentTypeID": 10,
            "Quantity": 2
        }
    ],
    "StatusTypeID": 50,
    "DateLastStatusUpdate": "2020-06-26T03:05:00Z",
    "DataQualityLevel": 3,
    "DateCreated": "2019-12-24T09:19:00Z",
    "SubmissionStatusTypeID": 100
}