{
    "IsRecentlyVerified": false,
    "ID": 19975,
    "UUID": "AB77649C-2F9C-48ED-BB9F-0AE862E4C6D8",
    "DataProviderID": 1,
    "OperatorID": 1,
    "UsageTypeID": 0,
    "UsageCost": "",
    "AddressInfo": {
        "ID": 20320,
        "Title": "Station service - Leclerc - Ifs",
        "AddressLine1": "190 Rue de Rocquancourt",
        "AddressLine2": "",
        "Town": "",
        "StateOrProvince": "IFS",
        "Postcode": "14123",
        "CountryID": 80,
        "Latitude": 49.14085,
        "Longitude": -0.34044,
        "ContactTelephone1": "+33 2 31 35 42 00",
        "ContactTelephone2": "",
        "ContactEmail": "",
        "AccessComments": "Ouvert à tous",
        "RelatedURL": "",
        "DistanceUnit": 0
    },
    "Connections": [],
    "GeneralComments": "",
    "StatusTypeID": 50,
    "DateLastStatusUpdate": "2013-10-23T13:48:00Z",
    "DataQualityLevel": 1,
    "DateCreated": "2013-10-23T07:43:00Z",
    "SubmissionStatusTypeID": 200
}