{
    "IsRecentlyVerified": false,
    "ID": 137894,
    "UUID": "9AB9DD30-0852-4F28-B840-42C9C68855F1",
    "DataProviderID": 2,
    "DataProvidersReference": "148854",
    "OperatorID": 39,
    "UsageTypeID": 1,
    "AddressInfo": {
        "ID": 138243,
        "Title": "Paseo Del Mar 2",
        "AddressLine1": "12265 El Camino Real",
        "Town": "San Diego",
        "StateOrProvince": "CA",
        "Postcode": "92130",
        "CountryID": 2,
        "Latitude": 32.9402292,
        "Longitude": -117.2390431,
        "ContactTelephone1": "800-663-5633",
        "AccessComments": "MO: Not Specified; TU: Not Specified; WE: Not Specified; TH: Not Specified; FR: Not Specified; SA: Not Specified; SU: Not Specified",
        "RelatedURL": "http://www.semacharge.com/",
        "DistanceUnit": 0
    },
    "Connections": [
        {
            "ID": 192916,
            "ConnectionTypeID": 1,
            "LevelID": 2,
            "Amps": 16,
            "Voltage": 230,
            "PowerKW": 3,
            "CurrentTypeID": 10,
            "Quantity": 4
        }
    ],
    "StatusTypeID": 50,
    "DateLastStatusUpdate": "2019-12-24T09:06:00Z",
    "DataQualityLevel": 3,
    "DateCreated": "2019-12-24T09:06:00Z",
    "SubmissionStatusTypeID": 100
}