{
    "IsRecentlyVerified": false,
    "ID": 54085,
    "UUID": "EA36B50B-CACC-49D6-9ED5-64E579C9E4B4",
    "DataProviderID": 1,
    "OperatorID": 101,
    "UsageTypeID": 4,
    "AddressInfo": {
        "ID": 54431,
        "Title": "Markt",
        "AddressLine1": "Marktplatz",
        "Town": "Rotenburg an der Fulda",
        "StateOrProvince": "Landkreis Hersfeld-Rotenburg",
        "Postcode": "36199",
        "CountryID": 87,
        "Latitude": 50.9948431,
        "Longitude": 9.72680800000001,
        "ContactTelephone1": "+49 800 0670000",
        "AccessComments": " Die Säule liefert auf der Typ2-Dose dreiphasig 20A, also ca. 14kW.\r\n",
        "RelatedURL": "http://www.belectric-drive.com",
        "DistanceUnit": 0
    },
    "Connections": [
        {
            "ID": 67754,
            "ConnectionTypeID": 28,
            "StatusTypeID": 50,
            "LevelID": 2,
            "PowerKW": 3.7,
            "CurrentTypeID": 10,
            "Quantity": 1
        },
        {
            "ID": 67755,
            "ConnectionTypeID": 25,
            "StatusTypeID": 50,
            "LevelID": 2,
            "PowerKW": 11,
            "CurrentTypeID": 20,
            "Quantity": 1
        },
        {
            "ID": 67756,
            "ConnectionTypeID": 16,
            "StatusTypeID": 50,
            "LevelID": 2,
            "PowerKW": 3.7,
            "CurrentTypeID": 10,
            "Quantity": 0
        },
        {
            "ID": 67757,
            "ConnectionTypeID": 17,
            "StatusTypeID": 50,
            "LevelID": 2,
            "PowerKW": 11,
            "CurrentTypeID": 20,
            "Quantity": 0
        },
        {
            "ID": 67758,
            "ConnectionTypeID": 2,
            "StatusTypeID": 50,
            "LevelID": 3,
            "PowerKW": 20,
            "CurrentTypeID": 30,
            "Quantity": 0
        },
        {
            "ID": 67759,
            "ConnectionTypeID": 33,
            "StatusTypeID": 50,
            "LevelID": 3,
            "PowerKW": 20,
            "CurrentTypeID": 30,
            "Quantity": 0
        }
    ],
    "NumberOfPoints": 2,
    "StatusTypeID": 50,
    "DateLastStatusUpdate": "2015-09-23T19:15:00Z",
    "DataQualityLevel": 1,
    "DateCreated": "2015-09-22T20:21:00Z",
    "SubmissionStatusTypeID": 200
}