{
    "UserComments": [
        {
            "ID": 20813,
            "ChargePointID": 97126,
            "CommentTypeID": 10,
            "UserName": "JimDiesel",
            "Comment": "",
            "DateCreated": "2019-03-20T16:00:49.037Z",
            "User": {
                "ID": 18165,
                "Username": "JimDiesel"
            },
            "CheckinStatusTypeID": 10
        },
        {
            "ID": 19367,
            "ChargePointID": 97126,
            "CommentTypeID": 10,
            "UserName": "JimDiesel",
            "Comment": "CCS charger on the left rapid working well",
            "Rating": 5,
            "DateCreated": "2018-04-02T14:21:38.207Z",
            "User": {
                "ID": 18165,
                "Username": "JimDiesel"
            },
            "CheckinStatusTypeID": 10
        }
    ],
    "IsRecentlyVerified": false,
    "ID": 97126,
    "UUID": "D38DFF96-2B78-4C96-B2ED-21FE06E29C6F",
    "DataProviderID": 1,
    "OperatorID": 3315,
    "OperatorsReference": "51367,51543",
    "UsageTypeID": 4,
    "UsageCost": "Free",
    "AddressInfo": {
        "ID": 97472,
        "Title": "Dyce (Craibstone) Park & Ride, Craibstone",
        "AddressLine1": "Dyce (Craibstone) Park & Ride, Craibstone",
        "Town": "Aberdeen",
        "Postcode": "AB21 9TT",
        "CountryID": 1,
        "Latitude": 57.1926951217266,
        "Longitude": -2.21336498413086,
        "DistanceUnit": 0
    },
    "Connections": [
        {
            "ID": 137894,
            "ConnectionTypeID": 2,
            "StatusTypeID": 50,
            "LevelID": 3,
            "PowerKW": 50,
            "CurrentTypeID": 30,
            "Quantity": 2
        },
        {
            "ID": 137895,
            "ConnectionTypeID": 1036,
            "StatusTypeID": 50,
            "LevelID": 3,
            "Amps": 63,
            "Voltage": 400,
            "PowerKW": 43,
            "CurrentTypeID": 20,
            "Quantity": 2
        },
        {
            "ID": 137896,
            "ConnectionTypeID": 33,
            "StatusTypeID": 50,
            "LevelID": 3,
            "PowerKW": 50,
            "CurrentTypeID": 30,
            "Quantity": 2
        }
    ],
    "NumberOfPoints": 2,
    "StatusTypeID": 50,
    "DateLastStatusUpdate": "2020-05-17T05:18:00Z",
    "DataQualityLevel": 1,
    "DateCreated": "2018-01-05T20:12:00Z",
    "SubmissionStatusTypeID": 200
}