{
    "IsRecentlyVerified": false,
    "ID": 176183,
    "UUID": "864434BB-6E21-4984-B010-39530BBA74EA",
    "DataProviderID": 1,
    "OperatorID": 213,
    "UsageTypeID": 1,
    "UsageCost": "1€/5 minutes",
    "AddressInfo": {
        "ID": 176542,
        "Title": "Boulevard Henri Dunant",
        "AddressLine1": "Boulevard Henri Dunant",
        "Town": "Belfort",
        "StateOrProvince": "Bourgogne-Franche-Comté",
        "Postcode": "90000",
        "CountryID": 80,
        "Latitude": 47.627800472738585,
        "Longitude": 6.860463612737476,
        "DistanceUnit": 0
    },
    "Connections": [
        {
            "ID": 273801,
            "ConnectionTypeID": 33,
            "StatusTypeID": 50,
            "LevelID": 3,
            "PowerKW": 43,
            "CurrentTypeID": 30,
            "Quantity": 1
        },
        {
            "ID": 273802,
            "ConnectionTypeID": 2,
            "StatusTypeID": 50,
            "LevelID": 3,
            "PowerKW": 43,
            "CurrentTypeID": 30,
            "Quantity": 1
        },
        {
            "ID": 273803,
            "ConnectionTypeID": 1036,
            "StatusTypeID": 50,
            "LevelID": 3,
            "PowerKW": 43,
            "CurrentTypeID": 20,
            "Quantity": 1
        }
    ],
    "NumberOfPoints": 1,
    "StatusTypeID": 50,
    "DateLastStatusUpdate": "2021-06-30T22:17:00Z",
    "DataQualityLevel": 1,
    "DateCreated": "2021-06-29T20:07:00Z",
    "SubmissionStatusTypeID": 200
}