{
    "IsRecentlyVerified": false,
    "ID": 63684,
    "UUID": "D8EF2D0D-2F0B-43EA-9CA8-46C3EECD8D5F",
    "DataProviderID": 26,
    "DataProvidersReference": "79741",
    "OperatorID": 103,
    "OperatorsReference": "Allego NLALLEGO0005602",
    "UsageCost": "0.00 jaarabonnement",
    "AddressInfo": {
        "ID": 64030,
        "Title": "Aldegondestraat 2",
        "AddressLine1": "Aldegondestraat 2",
        "Town": "Amersfoort",
        "Postcode": "3817 AT",
        "CountryID": 159,
        "Latitude": 52.150017,
        "Longitude": 5.385464,
        "ContactTelephone1": "0800-3745337",
        "RelatedURL": "http://www.allego.eu/",
        "DistanceUnit": 0
    },
    "Connections": [
        {
            "ID": 81299,
            "ConnectionTypeID": 25,
            "LevelID": 2,
            "PowerKW": 11,
            "CurrentTypeID": 10
        },
        {
            "ID": 81300,
            "ConnectionTypeID": 25,
            "LevelID": 2,
            "PowerKW": 11,
            "CurrentTypeID": 10
        }
    ],
    "NumberOfPoints": 1,
    "StatusTypeID": 50,
    "DateLastStatusUpdate": "2016-06-04T02:51:00Z",
    "DataQualityLevel": 3,
    "DateCreated": "2016-03-03T12:31:00Z",
    "SubmissionStatusTypeID": 100
}