{
    "IsRecentlyVerified": false,
    "ID": 132051,
    "UUID": "48A0483D-52A3-4700-B37B-3554BAE8DE98",
    "DataProviderID": 1,
    "OperatorID": 3315,
    "OperatorsReference": "52025,52026,52027,52028",
    "UsageTypeID": 4,
    "UsageCost": "Free",
    "AddressInfo": {
        "ID": 132397,
        "Title": "Waterside Car Park, Kilmarnock",
        "AddressLine1": "Waterside Car Park",
        "Town": "Kilmarnock",
        "StateOrProvince": "Scotland",
        "Postcode": "KA1 1RJ",
        "CountryID": 1,
        "Latitude": 55.607386,
        "Longitude": -4.498087,
        "DistanceUnit": 0
    },
    "Connections": [
        {
            "ID": 184764,
            "ConnectionTypeID": 33,
            "StatusTypeID": 50,
            "LevelID": 3,
            "PowerKW": 50,
            "CurrentTypeID": 30,
            "Quantity": 1
        },
        {
            "ID": 184765,
            "ConnectionTypeID": 2,
            "StatusTypeID": 50,
            "LevelID": 3,
            "PowerKW": 50,
            "CurrentTypeID": 30,
            "Quantity": 1
        },
        {
            "ID": 184766,
            "ConnectionTypeID": 1036,
            "StatusTypeID": 50,
            "LevelID": 3,
            "PowerKW": 43,
            "CurrentTypeID": 20,
            "Quantity": 1
        },
        {
            "ID": 184797,
            "ConnectionTypeID": 25,
            "StatusTypeID": 50,
            "LevelID": 2,
            "Amps": 32,
            "Voltage": 230,
            "PowerKW": 7,
            "CurrentTypeID": 10,
            "Quantity": 6
        }
    ],
    "NumberOfPoints": 6,
    "StatusTypeID": 50,
    "DateLastStatusUpdate": "2019-09-20T05:15:00Z",
    "DataQualityLevel": 1,
    "DateCreated": "2019-09-19T05:13:00Z",
    "SubmissionStatusTypeID": 200
}