{
    "IsRecentlyVerified": false,
    "ID": 32471,
    "UUID": "C7BB241E-24EE-4253-B9F8-F5069585F237",
    "DataProviderID": 1,
    "OperatorID": 105,
    "OperatorsReference": "Essent EM-DE-05162008-01-00001",
    "UsageTypeID": 4,
    "AddressInfo": {
        "ID": 32817,
        "Title": "Nordstraße 44",
        "AddressLine1": "Nordstraße 44",
        "Town": "Grevenbroich",
        "Postcode": "41515",
        "CountryID": 87,
        "Latitude": 51.09025,
        "Longitude": 6.60419,
        "DistanceUnit": 0
    },
    "Connections": [
        {
            "ID": 35982,
            "ConnectionTypeID": 25,
            "LevelID": 2,
            "PowerKW": 11
        },
        {
            "ID": 46386,
            "ConnectionTypeID": 25,
            "LevelID": 2,
            "PowerKW": 11
        }
    ],
    "NumberOfPoints": 1,
    "StatusTypeID": 50,
    "DateLastStatusUpdate": "2015-04-14T00:31:00Z",
    "DataQualityLevel": 3,
    "DateCreated": "2015-01-09T06:03:00Z",
    "SubmissionStatusTypeID": 200
}