{
    "IsRecentlyVerified": false,
    "ID": 181601,
    "UUID": "0A26357E-E663-461F-845B-447982F573CB",
    "DataProviderID": 29,
    "DataProvidersReference": "4530",
    "OperatorID": 69,
    "AddressInfo": {
        "ID": 181960,
        "Title": "Am Sportpark 19",
        "AddressLine1": "Am Sportpark 19",
        "Town": "Nordhorn",
        "Postcode": "48531",
        "CountryID": 87,
        "Latitude": 52.42406,
        "Longitude": 7.082893,
        "DistanceUnit": 0
    },
    "Connections": [
        {
            "ID": 286158,
            "ConnectionTypeID": 28,
            "StatusTypeID": 50,
            "LevelID": 2,
            "PowerKW": 22,
            "CurrentTypeID": 20
        },
        {
            "ID": 286159,
            "ConnectionTypeID": 25,
            "StatusTypeID": 50,
            "LevelID": 2,
            "PowerKW": 22,
            "CurrentTypeID": 20
        },
        {
            "ID": 300550,
            "ConnectionTypeID": 28,
            "StatusTypeID": 50,
            "LevelID": 2,
            "PowerKW": 22,
            "CurrentTypeID": 20
        },
        {
            "ID": 300551,
            "ConnectionTypeID": 25,
            "StatusTypeID": 50,
            "LevelID": 2,
            "PowerKW": 22,
            "CurrentTypeID": 20
        }
    ],
    "StatusTypeID": 50,
    "DateLastStatusUpdate": "2021-07-12T02:49:00Z",
    "MetadataValues": [
        {
            "ID": 13895,
            "MetadataFieldID": 4,
            "ItemValue": "Data from the German chargepoint registry provided by Bundesnetzagentur.de under the CC-BY 4.0 license"
        }
    ],
    "DataQualityLevel": 3,
    "DateCreated": "2021-07-08T10:02:00Z",
    "SubmissionStatusTypeID": 100
}