{
    "UserComments": [
        {
            "ID": 8327,
            "ChargePointID": 46693,
            "CommentTypeID": 10,
            "UserName": "Erna_Schleck",
            "Comment": "Alle Fächer abgeschlossen, keine Schlüssel da. ",
            "DateCreated": "2015-12-26T18:24:56.51Z",
            "User": {
                "ID": 4573,
                "Username": "Erna_Schleck"
            },
            "CheckinStatusTypeID": 20
        }
    ],
    "MediaItems": [
        {
            "ID": 3671,
            "ChargePointID": 46693,
            "ItemURL": "https://s3-ap-southeast-2.amazonaws.com/openchargemap/images/DE/OCM46693/OCM-46693.orig.2015122618234137.jpg",
            "ItemThumbnailURL": "https://s3-ap-southeast-2.amazonaws.com/openchargemap/images/DE/OCM46693/OCM-46693.thmb.2015122618234137.jpg",
            "Comment": "",
            "IsEnabled": true,
            "IsVideo": false,
            "IsFeaturedItem": false,
            "IsExternalResource": false,
            "User": {
                "ID": 4573,
                "Username": "Erna_Schleck"
            },
            "DateCreated": "2015-12-26T18:24:00Z"
        }
    ],
    "IsRecentlyVerified": false,
    "ID": 46693,
    "UUID": "235F10F7-8286-44CA-9CED-9E138C1C38B2",
    "DataProviderID": 1,
    "OperatorID": 45,
    "UsageTypeID": 1,
    "UsageCost": "0",
    "AddressInfo": {
        "ID": 47039,
        "Title": "e-Bike Station C&A",
        "AddressLine1": "Marktstraße 49",
        "AddressLine2": "",
        "Town": "Barsinghausen",
        "StateOrProvince": "Region Hannover",
        "Postcode": "30890",
        "CountryID": 87,
        "Latitude": 52.303129856729,
        "Longitude": 9.45930866652839,
        "ContactTelephone1": "",
        "ContactTelephone2": "",
        "ContactEmail": "",
        "AccessComments": "4 nebeneinander liegende durch Pfand abschließbare Ladekästen zwischen dem C&A Parkplatz für PKWs und  der Fußgängerzone. Belastbarkeit 8A / 230V. Hinter den Fächern ist ein Parkplatz. Man kommt von hinten direkt an die Ladefächer, es gibt jedoch keine reservierten Parkplätze. Eine Kabeldurchführung ist an jedem Fach unten vorhanden.",
        "RelatedURL": "http://deister-journal.de/?p=1634",
        "DistanceUnit": 0
    },
    "Connections": [
        {
            "ID": 57358,
            "ConnectionTypeID": 28,
            "StatusTypeID": 50,
            "LevelID": 1,
            "Amps": 8,
            "Voltage": 230,
            "PowerKW": 1.84,
            "CurrentTypeID": 10,
            "Quantity": 4
        }
    ],
    "NumberOfPoints": 4,
    "GeneralComments": "",
    "StatusTypeID": 50,
    "DateLastStatusUpdate": "2015-12-26T18:26:00Z",
    "DataQualityLevel": 1,
    "DateCreated": "2015-05-03T13:53:00Z",
    "SubmissionStatusTypeID": 200
}