{
    "MediaItems": [
        {
            "ID": 25665,
            "ChargePointID": 169863,
            "ItemURL": "https://s3-ap-southeast-2.amazonaws.com/openchargemap/images/ES/OCM169863/OCM-169863.orig.2020120312034562.jpg",
            "ItemThumbnailURL": "https://s3-ap-southeast-2.amazonaws.com/openchargemap/images/ES/OCM169863/OCM-169863.thmb.2020120312034562.jpg",
            "Comment": "",
            "IsEnabled": true,
            "IsVideo": false,
            "IsFeaturedItem": false,
            "IsExternalResource": false,
            "User": {
                "ID": 27955,
                "Username": "CARGACOCHES"
            },
            "DateCreated": "2020-12-03T12:04:00Z"
        },
        {
            "ID": 25666,
            "ChargePointID": 169863,
            "ItemURL": "https://s3-ap-southeast-2.amazonaws.com/openchargemap/images/ES/OCM169863/OCM-169863.orig.2020120312040008.jpg",
            "ItemThumbnailURL": "https://s3-ap-southeast-2.amazonaws.com/openchargemap/images/ES/OCM169863/OCM-169863.thmb.2020120312040008.jpg",
            "Comment": "",
            "IsEnabled": true,
            "IsVideo": false,
            "IsFeaturedItem": false,
            "IsExternalResource": false,
            "User": {
                "ID": 27955,
                "Username": "CARGACOCHES"
            },
            "DateCreated": "2020-12-03T12:04:00Z"
        },
        {
            "ID": 25667,
            "ChargePointID": 169863,
            "ItemURL": "https://s3-ap-southeast-2.amazonaws.com/openchargemap/images/ES/OCM169863/OCM-169863.orig.2020120312041615.jpg",
            "ItemThumbnailURL": "https://s3-ap-southeast-2.amazonaws.com/openchargemap/images/ES/OCM169863/OCM-169863.thmb.2020120312041615.jpg",
            "Comment": "",
            "IsEnabled": true,
            "IsVideo": false,
            "IsFeaturedItem": false,
            "IsExternalResource": false,
            "User": {
                "ID": 27955,
                "Username": "CARGACOCHES"
            },
            "DateCreated": "2020-12-03T12:04:00Z"
        },
        {
            "ID": 25664,
            "ChargePointID": 169863,
            "ItemURL": "https://s3-ap-southeast-2.amazonaws.com/openchargemap/images/ES/OCM169863/OCM-169863.orig.2020120312032461.jpg",
            "ItemThumbnailURL": "https://s3-ap-southeast-2.amazonaws.com/openchargemap/images/ES/OCM169863/OCM-169863.thmb.2020120312032461.jpg",
            "Comment": "",
            "IsEnabled": true,
            "IsVideo": false,
            "IsFeaturedItem": false,
            "IsExternalResource": false,
            "User": {
                "ID": 27955,
                "Username": "CARGACOCHES"
            },
            "DateCreated": "2020-12-03T12:03:00Z"
        }
    ],
    "IsRecentlyVerified": false,
    "ID": 169863,
    "UUID": "C8652B3A-AFDD-46EA-B1A2-FE289F9861BC",
    "DataProviderID": 1,
    "OperatorID": 1,
    "UsageTypeID": 1,
    "UsageCost": "0.30€",
    "AddressInfo": {
        "ID": 170222,
        "Title": "Cal Bernat",
        "AddressLine1": "Cal Bernat",
        "Town": "Prats de Lluçanès",
        "StateOrProvince": "Catalonia",
        "Postcode": "",
        "CountryID": 210,
        "Latitude": 42.009190020866384,
        "Longitude": 2.027777645811966,
        "ContactTelephone1": "961679024",
        "ContactTelephone2": "914047405",
        "RelatedURL": "http://WWW.CARGACOCHES.COM",
        "DistanceUnit": 0
    },
    "Connections": [
        {
            "ID": 258837,
            "ConnectionTypeID": 33,
            "Reference": "CHARGEANDPARKING",
            "StatusTypeID": 50,
            "LevelID": 3,
            "PowerKW": 50,
            "CurrentTypeID": 30,
            "Quantity": 1
        },
        {
            "ID": 258838,
            "ConnectionTypeID": 2,
            "Reference": "CHARGEANDPARKING",
            "StatusTypeID": 50,
            "LevelID": 3,
            "PowerKW": 50,
            "CurrentTypeID": 30,
            "Quantity": 1
        },
        {
            "ID": 258839,
            "ConnectionTypeID": 25,
            "Reference": "CHARGEANDPARKING",
            "StatusTypeID": 50,
            "LevelID": 2,
            "PowerKW": 22,
            "CurrentTypeID": 20,
            "Quantity": 1
        }
    ],
    "NumberOfPoints": 1,
    "StatusTypeID": 50,
    "DateLastStatusUpdate": "2020-12-03T12:04:00Z",
    "DataQualityLevel": 1,
    "DateCreated": "2020-11-11T16:02:00Z",
    "SubmissionStatusTypeID": 200
}