{
    "IsRecentlyVerified": false,
    "ID": 45940,
    "UUID": "BD3765E7-115E-4A72-8DBA-5BE691F929E7",
    "DataProviderID": 1,
    "DataProvidersReference": "2133",
    "AddressInfo": {
        "ID": 46286,
        "Title": "Åregaraget",
        "AddressLine1": "Årevägen 12",
        "Town": "VÄLLINGBY",
        "StateOrProvince": "STOCKHOLM",
        "Postcode": "16261",
        "CountryID": 216,
        "Latitude": 59.36025,
        "Longitude": 17.87484,
        "AccessComments": "Nedre infarten, laddstationer till höger om infarten.",
        "DistanceUnit": 0
    },
    "Connections": [
        {
            "ID": 56603,
            "ConnectionTypeID": 0,
            "Reference": "1",
            "LevelID": 2,
            "Amps": 16,
            "Voltage": 230,
            "PowerKW": 3.7,
            "Comments": "Mode 3"
        },
        {
            "ID": 84711,
            "ConnectionTypeID": 0,
            "Reference": "2",
            "LevelID": 2,
            "Amps": 16,
            "Voltage": 230,
            "PowerKW": 3.7,
            "Comments": "Mode 3"
        },
        {
            "ID": 84712,
            "ConnectionTypeID": 0,
            "Reference": "3",
            "LevelID": 2,
            "Amps": 16,
            "Voltage": 230,
            "PowerKW": 3.7,
            "Comments": "Mode 3"
        },
        {
            "ID": 88245,
            "ConnectionTypeID": 0,
            "Reference": "4",
            "LevelID": 2,
            "Amps": 16,
            "Voltage": 230,
            "PowerKW": 3.7,
            "Comments": "Mode 3"
        }
    ],
    "NumberOfPoints": 4,
    "DateLastStatusUpdate": "2020-05-26T08:22:00Z",
    "DataQualityLevel": 2,
    "DateCreated": "2015-05-03T00:54:00Z",
    "SubmissionStatusTypeID": 100
}