{
    "IsRecentlyVerified": false,
    "ID": 150928,
    "UUID": "DCE43469-1AC2-4DCB-9FDB-D737B6CF6A56",
    "DataProviderID": 28,
    "DataProvidersReference": "FR*A16*P*WIIZ*61*_*_*_",
    "UsageTypeID": 5,
    "AddressInfo": {
        "ID": 151281,
        "Title": "Grasse Parking Square des Diables Bleus",
        "AddressLine1": "Traverse Kellermann",
        "CountryID": 80,
        "Latitude": 43.651211,
        "Longitude": 6.92296,
        "AccessComments": "24h/24",
        "DistanceUnit": 0
    },
    "Connections": [
        {
            "ID": 210291,
            "ConnectionTypeID": 28,
            "StatusTypeID": 50,
            "LevelID": 2,
            "PowerKW": 22,
            "CurrentTypeID": 10
        },
        {
            "ID": 210292,
            "ConnectionTypeID": 1036,
            "StatusTypeID": 50,
            "LevelID": 2,
            "PowerKW": 22,
            "CurrentTypeID": 20
        },
        {
            "ID": 240069,
            "ConnectionTypeID": 28,
            "StatusTypeID": 50,
            "LevelID": 2,
            "PowerKW": 22,
            "CurrentTypeID": 10
        },
        {
            "ID": 240070,
            "ConnectionTypeID": 1036,
            "StatusTypeID": 50,
            "LevelID": 2,
            "PowerKW": 22,
            "CurrentTypeID": 20
        }
    ],
    "GeneralComments": "badge, appli et QR code",
    "StatusTypeID": 50,
    "DateLastStatusUpdate": "2020-08-27T05:11:00Z",
    "DataQualityLevel": 2,
    "DateCreated": "2020-03-15T06:18:00Z",
    "SubmissionStatusTypeID": 100
}