{
    "IsRecentlyVerified": false,
    "ID": 66053,
    "UUID": "12521FDE-B32A-4769-BA14-9E7FF907C5AF",
    "DataProviderID": 1,
    "OperatorID": 45,
    "UsageTypeID": 6,
    "AddressInfo": {
        "ID": 66399,
        "Title": "Ferienpark Weissenhäuser Strand",
        "AddressLine1": "Seestraße 1003",
        "Town": "Wangels",
        "StateOrProvince": "Oldenburg-Land",
        "Postcode": "23758",
        "CountryID": 87,
        "Latitude": 54.3066011644267,
        "Longitude": 10.7939070858097,
        "AccessComments": "Kostenloses Laden nach vorheriger Anmeldung für Gäste an der Steckdose der Müllpresse, die mit 25A abgesichert ist.",
        "RelatedURL": "http://www.weissenhaeuserstrand.de/",
        "DistanceUnit": 0
    },
    "Connections": [
        {
            "ID": 91335,
            "ConnectionTypeID": 17,
            "StatusTypeID": 50,
            "LevelID": 2,
            "Amps": 25,
            "Voltage": 400,
            "PowerKW": 16,
            "CurrentTypeID": 20,
            "Quantity": 1
        }
    ],
    "NumberOfPoints": 1,
    "StatusTypeID": 50,
    "DateLastStatusUpdate": "2016-05-11T06:28:00Z",
    "DataQualityLevel": 1,
    "DateCreated": "2016-05-11T06:16:00Z",
    "SubmissionStatusTypeID": 200
}