{
    "IsRecentlyVerified": false,
    "ID": 42914,
    "UUID": "4000F24A-983B-43A0-8CF2-2CBB53F922C6",
    "DataProviderID": 26,
    "DataProvidersReference": "60114",
    "OperatorID": 73,
    "OperatorsReference": "EV-Box EVB-P1408072",
    "UsageCost": "0.00 jaarabonnement",
    "AddressInfo": {
        "ID": 43260,
        "Title": "Roosje Vosstraat 9",
        "AddressLine1": "Roosje Vosstraat 9",
        "Town": "Nissewaard",
        "Postcode": "3207 SK",
        "CountryID": 159,
        "Latitude": 51.83559,
        "Longitude": 4.35459,
        "RelatedURL": "http://www.ev-box.nl",
        "DistanceUnit": 0
    },
    "Connections": [
        {
            "ID": 51861,
            "ConnectionTypeID": 25,
            "LevelID": 2,
            "PowerKW": 11,
            "CurrentTypeID": 10
        },
        {
            "ID": 51862,
            "ConnectionTypeID": 25,
            "LevelID": 2,
            "PowerKW": 11,
            "CurrentTypeID": 10
        }
    ],
    "NumberOfPoints": 1,
    "StatusTypeID": 50,
    "DateLastStatusUpdate": "2016-06-04T02:41:00Z",
    "DataQualityLevel": 3,
    "DateCreated": "2015-03-25T02:49:00Z",
    "SubmissionStatusTypeID": 100
}