{
    "UserComments": [
        {
            "ID": 24067,
            "ChargePointID": 132056,
            "CommentTypeID": 10,
            "UserName": "ForumElettrico.it",
            "Comment": "Non h24 in quanto ci sono i dossi mobili che escono dal pavimento alle 22.30. Leggi la recensione completa qui > https://www.forumelettrico.it/forum/via-francesco-brambilla-milano-lidl-t10519.html",
            "RelatedURL": "https://www.forumelettrico.it/forum/via-francesco-brambilla-milano-lidl-t10519.html",
            "DateCreated": "2021-03-26T17:21:43.21Z",
            "User": {
                "ID": 11749,
                "Username": "ForumElettrico.it"
            },
            "CheckinStatusTypeID": 10,
            "IsActionedByEditor": false
        }
    ],
    "MediaItems": [
        {
            "ID": 27042,
            "ChargePointID": 132056,
            "ItemURL": "https://s3-ap-southeast-2.amazonaws.com/openchargemap/images/IT/OCM132056/OCM-132056.orig.2021032617215266.jpg",
            "ItemThumbnailURL": "https://s3-ap-southeast-2.amazonaws.com/openchargemap/images/IT/OCM132056/OCM-132056.thmb.2021032617215266.jpg",
            "Comment": "",
            "IsEnabled": true,
            "IsVideo": false,
            "IsFeaturedItem": false,
            "IsExternalResource": false,
            "User": {
                "ID": 11749,
                "Username": "ForumElettrico.it"
            },
            "DateCreated": "2021-03-26T17:22:00Z"
        },
        {
            "ID": 27043,
            "ChargePointID": 132056,
            "ItemURL": "https://s3-ap-southeast-2.amazonaws.com/openchargemap/images/IT/OCM132056/OCM-132056.orig.2021032617215931.jpg",
            "ItemThumbnailURL": "https://s3-ap-southeast-2.amazonaws.com/openchargemap/images/IT/OCM132056/OCM-132056.thmb.2021032617215931.jpg",
            "Comment": "",
            "IsEnabled": true,
            "IsVideo": false,
            "IsFeaturedItem": false,
            "IsExternalResource": false,
            "User": {
                "ID": 11749,
                "Username": "ForumElettrico.it"
            },
            "DateCreated": "2021-03-26T17:22:00Z"
        },
        {
            "ID": 27044,
            "ChargePointID": 132056,
            "ItemURL": "https://s3-ap-southeast-2.amazonaws.com/openchargemap/images/IT/OCM132056/OCM-132056.orig.2021032617220507.jpg",
            "ItemThumbnailURL": "https://s3-ap-southeast-2.amazonaws.com/openchargemap/images/IT/OCM132056/OCM-132056.thmb.2021032617220507.jpg",
            "Comment": "",
            "IsEnabled": true,
            "IsVideo": false,
            "IsFeaturedItem": false,
            "IsExternalResource": false,
            "User": {
                "ID": 11749,
                "Username": "ForumElettrico.it"
            },
            "DateCreated": "2021-03-26T17:22:00Z"
        }
    ],
    "IsRecentlyVerified": false,
    "ID": 132056,
    "UUID": "092E078C-4D27-4EC9-A4B0-8151F9C62CB3",
    "DataProviderID": 1,
    "OperatorID": 38,
    "UsageTypeID": 1,
    "UsageCost": "free",
    "AddressInfo": {
        "ID": 132402,
        "Title": "LIDL Milano Adriano",
        "AddressLine1": "Via Adriano, 22",
        "AddressLine2": "angolo Via Brambilla",
        "Town": "Milano",
        "StateOrProvince": "MI",
        "Postcode": "20128 ",
        "CountryID": 112,
        "Latitude": 45.5125757727297,
        "Longitude": 9.24662304342826,
        "RelatedURL": "https://www.lidl.it",
        "DistanceUnit": 0
    },
    "Connections": [
        {
            "ID": 184775,
            "ConnectionTypeID": 25,
            "StatusTypeID": 150,
            "LevelID": 2,
            "CurrentTypeID": 20,
            "Quantity": 2
        }
    ],
    "NumberOfPoints": 2,
    "StatusTypeID": 150,
    "DateLastStatusUpdate": "2021-03-26T17:22:00Z",
    "DataQualityLevel": 1,
    "DateCreated": "2019-09-19T07:36:00Z",
    "SubmissionStatusTypeID": 200
}