{
    "IsRecentlyVerified": false,
    "ID": 181825,
    "UUID": "A901FD71-DF59-45A2-BE0D-DDA08AB40B10",
    "DataProviderID": 29,
    "DataProvidersReference": "5,9174,18508,8485",
    "OperatorID": 72,
    "AddressInfo": {
        "ID": 182184,
        "Title": "Kardinal-Frings-Straße 1-3",
        "AddressLine1": "Kardinal-Frings-Straße 1-3",
        "Town": "Köln",
        "Postcode": "50668",
        "CountryID": 87,
        "Latitude": 50.944306,
        "Longitude": 6.952838,
        "DistanceUnit": 0
    },
    "Connections": [
        {
            "ID": 286703,
            "ConnectionTypeID": 25,
            "StatusTypeID": 50,
            "LevelID": 2,
            "PowerKW": 11,
            "CurrentTypeID": 20
        },
        {
            "ID": 286704,
            "ConnectionTypeID": 25,
            "StatusTypeID": 50,
            "LevelID": 2,
            "PowerKW": 11,
            "CurrentTypeID": 20
        },
        {
            "ID": 286705,
            "ConnectionTypeID": 25,
            "StatusTypeID": 50,
            "LevelID": 2,
            "PowerKW": 22,
            "CurrentTypeID": 20
        },
        {
            "ID": 286706,
            "ConnectionTypeID": 25,
            "StatusTypeID": 50,
            "LevelID": 2,
            "PowerKW": 22,
            "CurrentTypeID": 20
        }
    ],
    "StatusTypeID": 50,
    "DateLastStatusUpdate": "2021-07-09T03:21:00Z",
    "MetadataValues": [
        {
            "ID": 14119,
            "MetadataFieldID": 4,
            "ItemValue": "Data from the German chargepoint registry provided by Bundesnetzagentur.de under the CC-BY 4.0 license"
        }
    ],
    "DataQualityLevel": 3,
    "DateCreated": "2021-07-08T10:02:00Z",
    "SubmissionStatusTypeID": 100
}