{
    "IsRecentlyVerified": false,
    "ID": 38855,
    "UUID": "348249F2-F680-4659-93C5-723225C6275D",
    "DataProviderID": 26,
    "DataProvidersReference": "48043",
    "OperatorID": 178,
    "OperatorsReference": "EVnetNL DB0284",
    "UsageCost": "0.00 jaarabonnement",
    "AddressInfo": {
        "ID": 39201,
        "Title": "Jan Verfailleweg 5",
        "AddressLine1": "Jan Verfailleweg 5",
        "Town": "Den Helder",
        "Postcode": "1783 BW",
        "CountryID": 159,
        "Latitude": 52.935066,
        "Longitude": 4.732897,
        "ContactTelephone1": "0800-3522365",
        "RelatedURL": "http://www.evnet.nl",
        "DistanceUnit": 0
    },
    "Connections": [
        {
            "ID": 42366,
            "ConnectionTypeID": 25,
            "LevelID": 2,
            "PowerKW": 11,
            "CurrentTypeID": 10
        }
    ],
    "NumberOfPoints": 2,
    "StatusTypeID": 50,
    "DateLastStatusUpdate": "2016-06-04T02:55:00Z",
    "DataQualityLevel": 3,
    "DateCreated": "2015-01-09T06:08:00Z",
    "SubmissionStatusTypeID": 100
}