{
    "IsRecentlyVerified": false,
    "ID": 175450,
    "UUID": "6F698772-36A1-4D56-A6FB-4A1CF786DBEE",
    "DataProviderID": 1,
    "OperatorID": 3447,
    "UsageTypeID": 1,
    "AddressInfo": {
        "ID": 175809,
        "Title": "Total - Relais Bourg Jasseron",
        "AddressLine1": "Aire de Bourg Jasseron",
        "Town": "Ceyzeriat",
        "Postcode": "01250",
        "CountryID": 80,
        "Latitude": 46.2029178154705,
        "Longitude": 5.296224677465148,
        "RelatedURL": "https://apps.total-ev-charge.com/charge-points/CS-TOTAL-NF076523-001",
        "DistanceUnit": 0
    },
    "Connections": [
        {
            "ID": 272248,
            "ConnectionTypeID": 33,
            "StatusTypeID": 50,
            "LevelID": 3,
            "PowerKW": 50,
            "CurrentTypeID": 30,
            "Quantity": 1
        },
        {
            "ID": 272249,
            "ConnectionTypeID": 2,
            "StatusTypeID": 50,
            "LevelID": 3,
            "PowerKW": 50,
            "CurrentTypeID": 30,
            "Quantity": 1
        },
        {
            "ID": 272250,
            "ConnectionTypeID": 1036,
            "StatusTypeID": 50,
            "LevelID": 3,
            "PowerKW": 43,
            "CurrentTypeID": 20,
            "Quantity": 1
        },
        {
            "ID": 272251,
            "ConnectionTypeID": 28,
            "StatusTypeID": 50,
            "CurrentTypeID": 10,
            "Quantity": 1
        },
        {
            "ID": 272252,
            "ConnectionTypeID": 33,
            "StatusTypeID": 50,
            "LevelID": 3,
            "PowerKW": 175,
            "CurrentTypeID": 30,
            "Quantity": 1
        },
        {
            "ID": 272253,
            "ConnectionTypeID": 2,
            "StatusTypeID": 50,
            "LevelID": 3,
            "PowerKW": 100,
            "CurrentTypeID": 30,
            "Quantity": 1
        }
    ],
    "NumberOfPoints": 2,
    "StatusTypeID": 50,
    "DateLastStatusUpdate": "2021-05-21T20:42:00Z",
    "DataQualityLevel": 1,
    "DateCreated": "2021-05-20T07:45:00Z",
    "SubmissionStatusTypeID": 200
}