{
    "IsRecentlyVerified": false,
    "ID": 184640,
    "UUID": "82F56452-887E-43B0-A78B-F65F136A603E",
    "DataProviderID": 29,
    "DataProvidersReference": "19682",
    "OperatorID": 224,
    "AddressInfo": {
        "ID": 184999,
        "Title": "Schwimmbadstraße 2",
        "AddressLine1": "Schwimmbadstraße 2",
        "Town": "Bonndorf",
        "Postcode": "79848",
        "CountryID": 87,
        "Latitude": 47.81782,
        "Longitude": 8.34056,
        "DistanceUnit": 0
    },
    "Connections": [
        {
            "ID": 293144,
            "ConnectionTypeID": 28,
            "StatusTypeID": 50,
            "LevelID": 2,
            "PowerKW": 22,
            "CurrentTypeID": 20
        },
        {
            "ID": 293145,
            "ConnectionTypeID": 25,
            "StatusTypeID": 50,
            "LevelID": 2,
            "PowerKW": 22,
            "CurrentTypeID": 20
        },
        {
            "ID": 295383,
            "ConnectionTypeID": 25,
            "StatusTypeID": 50,
            "LevelID": 2,
            "PowerKW": 22,
            "CurrentTypeID": 20
        }
    ],
    "StatusTypeID": 50,
    "DateLastStatusUpdate": "2021-07-12T02:39:00Z",
    "MetadataValues": [
        {
            "ID": 16931,
            "MetadataFieldID": 4,
            "ItemValue": "Data from the German chargepoint registry provided by Bundesnetzagentur.de under the CC-BY 4.0 license"
        }
    ],
    "DataQualityLevel": 3,
    "DateCreated": "2021-07-08T10:05:00Z",
    "SubmissionStatusTypeID": 100
}