{
    "IsRecentlyVerified": true,
    "DateLastVerified": "2021-10-28T12:45:00Z",
    "ID": 189712,
    "UUID": "8E0E667E-DE1D-4413-ADC0-ED7CB96ED701",
    "DataProviderID": 1,
    "OperatorID": 3462,
    "UsageTypeID": 4,
    "AddressInfo": {
        "ID": 190071,
        "Title": "TEA. Lázbérc",
        "AddressLine1": "2506",
        "Town": "Dédestapolcsány",
        "CountryID": 104,
        "Latitude": 48.18761188834796,
        "Longitude": 20.487143487618738,
        "ContactTelephone1": "+36305509858",
        "RelatedURL": "http://www.teapont.hu",
        "DistanceUnit": 0
    },
    "Connections": [
        {
            "ID": 306918,
            "ConnectionTypeID": 25,
            "StatusTypeID": 50,
            "LevelID": 2,
            "PowerKW": 22,
            "CurrentTypeID": 20,
            "Quantity": 2
        }
    ],
    "NumberOfPoints": 1,
    "GeneralComments": "help@teapont.hu",
    "StatusTypeID": 50,
    "DateLastStatusUpdate": "2021-10-28T19:56:00Z",
    "DataQualityLevel": 1,
    "DateCreated": "2021-10-28T12:45:00Z",
    "SubmissionStatusTypeID": 200
}