{
    "IsRecentlyVerified": false,
    "ID": 144824,
    "UUID": "08A9546F-BD56-4C34-8985-0A09D4B53C3A",
    "DataProviderID": 2,
    "DataProvidersReference": "144525",
    "OperatorID": 90,
    "UsageTypeID": 1,
    "AddressInfo": {
        "ID": 145176,
        "Title": "Desjardins - CdS Richmond",
        "AddressLine1": "303, rue du Collège Nord",
        "Town": "Richmond",
        "StateOrProvince": "QC",
        "Postcode": "J0B 2H0",
        "CountryID": 44,
        "Latitude": 45.66122,
        "Longitude": -72.14219,
        "ContactTelephone1": "877-505-2674",
        "AccessComments": "24 hours daily",
        "RelatedURL": "https://lecircuitelectrique.com/",
        "DistanceUnit": 0
    },
    "Connections": [
        {
            "ID": 201362,
            "ConnectionTypeID": 1,
            "LevelID": 2,
            "Amps": 16,
            "Voltage": 230,
            "PowerKW": 3.7,
            "CurrentTypeID": 10,
            "Quantity": 1
        }
    ],
    "StatusTypeID": 50,
    "DateLastStatusUpdate": "2020-06-26T03:09:00Z",
    "DataQualityLevel": 3,
    "DateCreated": "2019-12-24T09:23:00Z",
    "SubmissionStatusTypeID": 100
}