{
    "IsRecentlyVerified": false,
    "ID": 142832,
    "UUID": "85F71D65-1E61-4826-A70C-74F1D51446F0",
    "DataProviderID": 2,
    "DataProvidersReference": "146607",
    "OperatorID": 5,
    "UsageTypeID": 1,
    "AddressInfo": {
        "ID": 143184,
        "Title": "5252 S CORNELL",
        "AddressLine1": "1600 E 53rd St",
        "Town": "Chicago",
        "StateOrProvince": "IL",
        "Postcode": "60615",
        "CountryID": 2,
        "Latitude": 41.799683,
        "Longitude": -87.5862961,
        "ContactTelephone1": "888-758-4389",
        "AccessComments": "24 hours daily",
        "RelatedURL": "http://www.chargepoint.com/",
        "DistanceUnit": 0
    },
    "Connections": [
        {
            "ID": 199058,
            "ConnectionTypeID": 1,
            "LevelID": 2,
            "Amps": 16,
            "Voltage": 230,
            "PowerKW": 3.7,
            "CurrentTypeID": 10,
            "Quantity": 2
        }
    ],
    "StatusTypeID": 50,
    "DateLastStatusUpdate": "2020-06-26T03:05:00Z",
    "DataQualityLevel": 3,
    "DateCreated": "2019-12-24T09:19:00Z",
    "SubmissionStatusTypeID": 100
}