{
    "IsRecentlyVerified": false,
    "ID": 90438,
    "UUID": "CC927625-F357-4918-B526-41A4282317F3",
    "DataProviderID": 1,
    "OperatorID": 23,
    "OperatorsReference": "30567",
    "UsageTypeID": 6,
    "AddressInfo": {
        "ID": 90784,
        "Title": "Hotel Neubergerhof",
        "AddressLine1": "Neuberg 84",
        "Town": "Filzmoos",
        "Postcode": "5532",
        "CountryID": 19,
        "Latitude": 47.453712,
        "Longitude": 13.474096,
        "ContactTelephone1": "+43 64 53 83 81",
        "DistanceUnit": 0
    },
    "Connections": [
        {
            "ID": 128091,
            "ConnectionTypeID": 30,
            "StatusTypeID": 50,
            "LevelID": 2,
            "Amps": 32,
            "Voltage": 400,
            "PowerKW": 22,
            "CurrentTypeID": 20,
            "Quantity": 1
        }
    ],
    "NumberOfPoints": 1,
    "GeneralComments": "1 Tesla Connector, up to 22kW.Available for patrons only. Please see front desk.",
    "StatusTypeID": 50,
    "DateLastStatusUpdate": "2018-10-03T20:53:00Z",
    "DataQualityLevel": 1,
    "DateCreated": "2017-07-13T15:20:00Z",
    "SubmissionStatusTypeID": 200
}