{
    "IsRecentlyVerified": false,
    "ID": 137477,
    "UUID": "397F13A9-BDC1-44D2-A879-566407F100EC",
    "DataProviderID": 2,
    "DataProvidersReference": "150031",
    "OperatorID": 5,
    "UsageTypeID": 1,
    "AddressInfo": {
        "ID": 137823,
        "Title": "BROOKFIELD PROP",
        "AddressLine1": "1200 Bagby St",
        "Town": "Houston",
        "StateOrProvince": "TX",
        "Postcode": "77002",
        "CountryID": 2,
        "Latitude": 29.758931,
        "Longitude": -95.3709709,
        "ContactTelephone1": "888-758-4389",
        "AccessComments": "24 hours daily",
        "RelatedURL": "http://www.chargepoint.com/",
        "DistanceUnit": 0
    },
    "Connections": [
        {
            "ID": 192395,
            "ConnectionTypeID": 1,
            "LevelID": 2,
            "Amps": 16,
            "Voltage": 230,
            "PowerKW": 3,
            "CurrentTypeID": 10,
            "Quantity": 2
        }
    ],
    "StatusTypeID": 50,
    "DateLastStatusUpdate": "2019-12-24T09:05:00Z",
    "DataQualityLevel": 3,
    "DateCreated": "2019-12-24T09:05:00Z",
    "SubmissionStatusTypeID": 100
}