{
    "IsRecentlyVerified": false,
    "ID": 169857,
    "UUID": "1C8CB7EE-10BC-4A46-A720-E366DCCC69EE",
    "DataProviderID": 1,
    "OperatorID": 82,
    "UsageTypeID": 4,
    "AddressInfo": {
        "ID": 170216,
        "Title": "A2A CREMA Marconi",
        "AddressLine1": "Piazza Guglielmo Marconi",
        "Town": "Crema ",
        "StateOrProvince": "CR",
        "Postcode": "26013",
        "CountryID": 112,
        "Latitude": 45.36420729104972,
        "Longitude": 9.685406645708781,
        "ContactTelephone1": "800035151",
        "RelatedURL": "http://www.e-moving.it/",
        "DistanceUnit": 0
    },
    "Connections": [
        {
            "ID": 258816,
            "ConnectionTypeID": 25,
            "StatusTypeID": 50,
            "LevelID": 2,
            "Amps": 32,
            "Voltage": 400,
            "PowerKW": 22,
            "CurrentTypeID": 20,
            "Quantity": 2
        },
        {
            "ID": 258817,
            "ConnectionTypeID": 36,
            "StatusTypeID": 50,
            "LevelID": 2,
            "Amps": 16,
            "Voltage": 240,
            "PowerKW": 3.7,
            "CurrentTypeID": 10,
            "Quantity": 2
        }
    ],
    "NumberOfPoints": 2,
    "StatusTypeID": 50,
    "DateLastStatusUpdate": "2020-11-11T14:27:00Z",
    "DataQualityLevel": 1,
    "DateCreated": "2020-11-11T14:20:00Z",
    "SubmissionStatusTypeID": 200
}