{
    "IsRecentlyVerified": false,
    "ID": 63234,
    "UUID": "9967DFB9-F8BC-4522-ABD5-16962D724237",
    "DataProviderID": 26,
    "DataProvidersReference": "71819",
    "OperatorID": 157,
    "OperatorsReference": "NewMotion 03002695",
    "UsageCost": "0.00 jaarabonnement",
    "AddressInfo": {
        "ID": 63580,
        "Title": "Schuilheuvelstraat 1",
        "AddressLine1": "Schuilheuvelstraat 1",
        "Town": "Buren",
        "Postcode": "4116 GA",
        "CountryID": 159,
        "Latitude": 51.9068463,
        "Longitude": 5.3346993,
        "ContactTelephone1": "088 0109500",
        "RelatedURL": "http://thenewmotion.nl/",
        "DistanceUnit": 0
    },
    "Connections": [
        {
            "ID": 80525,
            "ConnectionTypeID": 25,
            "LevelID": 2,
            "PowerKW": 22,
            "CurrentTypeID": 10
        },
        {
            "ID": 80526,
            "ConnectionTypeID": 25,
            "LevelID": 2,
            "PowerKW": 22,
            "CurrentTypeID": 10
        }
    ],
    "NumberOfPoints": 1,
    "StatusTypeID": 50,
    "DateLastStatusUpdate": "2016-06-04T02:42:00Z",
    "DataQualityLevel": 3,
    "DateCreated": "2016-03-03T12:30:00Z",
    "SubmissionStatusTypeID": 100
}