{
    "IsRecentlyVerified": false,
    "ID": 143595,
    "UUID": "3D4D5680-3A85-4A67-8C00-7EF63EBA3537",
    "DataProviderID": 2,
    "DataProvidersReference": "129515",
    "OperatorID": 89,
    "UsageTypeID": 1,
    "AddressInfo": {
        "ID": 143947,
        "Title": "Icarus - Guelph",
        "AddressLine1": "218 Silver Creek Parkway N",
        "Town": "Guelph",
        "StateOrProvince": "ON",
        "Postcode": "G9N 0A3",
        "CountryID": 44,
        "Latitude": 43.542703,
        "Longitude": -80.28544,
        "ContactTelephone1": "888-356-8911",
        "AccessComments": "24 hours daily",
        "RelatedURL": "https://flo.ca/",
        "DistanceUnit": 0
    },
    "Connections": [
        {
            "ID": 199951,
            "ConnectionTypeID": 1,
            "LevelID": 2,
            "Amps": 16,
            "Voltage": 230,
            "PowerKW": 3.7,
            "CurrentTypeID": 10,
            "Quantity": 1
        }
    ],
    "StatusTypeID": 50,
    "DateLastStatusUpdate": "2020-06-26T03:07:00Z",
    "DataQualityLevel": 3,
    "DateCreated": "2019-12-24T09:21:00Z",
    "SubmissionStatusTypeID": 100
}