{
    "UserComments": [
        {
            "ID": 21752,
            "ChargePointID": 73096,
            "CommentTypeID": 50,
            "UserName": "Gioacchino P.",
            "Comment": "Not working!",
            "Rating": 1,
            "DateCreated": "2019-11-02T17:48:35.887Z",
            "User": {
                "ID": 19889,
                "Username": "Gioacchino P."
            },
            "CheckinStatusTypeID": 20,
            "IsActionedByEditor": true
        }
    ],
    "IsRecentlyVerified": false,
    "ID": 73096,
    "UUID": "79B65BBB-1B81-42AA-8719-CDAE65DAF608",
    "DataProviderID": 1,
    "OperatorID": 80,
    "UsageTypeID": 4,
    "UsageCost": "0,40 €/kW",
    "AddressInfo": {
        "ID": 73442,
        "Title": "Supermercato MEGA | Eneldrive ",
        "AddressLine1": "Via Unità d'Italia, 51",
        "Town": "San Donà di Piave",
        "StateOrProvince": "VE",
        "Postcode": "30027",
        "CountryID": 112,
        "Latitude": 45.64763618230208,
        "Longitude": 12.548215429665902,
        "RelatedURL": "http://eneldrive.it",
        "DistanceUnit": 0
    },
    "Connections": [
        {
            "ID": 105078,
            "ConnectionTypeID": 25,
            "StatusTypeID": 100,
            "LevelID": 2,
            "Amps": 32,
            "Voltage": 400,
            "PowerKW": 22,
            "CurrentTypeID": 20,
            "Quantity": 1
        },
        {
            "ID": 105079,
            "ConnectionTypeID": 36,
            "StatusTypeID": 100,
            "LevelID": 2,
            "Amps": 13,
            "Voltage": 240,
            "PowerKW": 3,
            "CurrentTypeID": 10,
            "Quantity": 1
        }
    ],
    "NumberOfPoints": 2,
    "StatusTypeID": 100,
    "DateLastStatusUpdate": "2019-11-04T11:40:00Z",
    "DataQualityLevel": 1,
    "DateCreated": "2016-11-07T10:42:00Z",
    "SubmissionStatusTypeID": 200
}