{
    "IsRecentlyVerified": false,
    "ID": 20247,
    "UUID": "90F18118-23A0-4C67-9791-288CDCEB85C6",
    "DataProviderID": 1,
    "OperatorID": 1,
    "UsageTypeID": 0,
    "UsageCost": "",
    "AddressInfo": {
        "ID": 20592,
        "Title": " Llrenov",
        "AddressLine1": "GR RUE",
        "AddressLine2": "",
        "Town": "",
        "StateOrProvince": "Cenne Monesties",
        "Postcode": "11170",
        "CountryID": 80,
        "Latitude": 43.33085,
        "Longitude": 2.11668,
        "ContactTelephone1": "",
        "ContactTelephone2": "",
        "ContactEmail": "",
        "AccessComments": "Ouvert à tous",
        "RelatedURL": "",
        "DistanceUnit": 0
    },
    "Connections": [],
    "GeneralComments": "",
    "StatusTypeID": 50,
    "DateLastStatusUpdate": "2013-11-07T18:06:00Z",
    "DataQualityLevel": 1,
    "DateCreated": "2013-11-07T09:16:00Z",
    "SubmissionStatusTypeID": 200
}