{
    "IsRecentlyVerified": false,
    "ID": 184783,
    "UUID": "A9FEAFC5-72DE-44E7-9686-4DE85FBD80DD",
    "DataProviderID": 29,
    "DataProvidersReference": "2374",
    "OperatorID": 3297,
    "AddressInfo": {
        "ID": 185142,
        "Title": "Eschollbrückerstr. 1a",
        "AddressLine1": "Eschollbrückerstr. 1a",
        "Town": "Darmstadt",
        "Postcode": "64283",
        "CountryID": 87,
        "Latitude": 49.865625,
        "Longitude": 8.646158,
        "DistanceUnit": 0
    },
    "Connections": [
        {
            "ID": 293470,
            "ConnectionTypeID": 25,
            "StatusTypeID": 50,
            "LevelID": 2,
            "PowerKW": 22,
            "CurrentTypeID": 20
        },
        {
            "ID": 293471,
            "ConnectionTypeID": 25,
            "StatusTypeID": 50,
            "LevelID": 2,
            "PowerKW": 22,
            "CurrentTypeID": 20
        }
    ],
    "StatusTypeID": 50,
    "DateLastStatusUpdate": "2021-07-12T02:44:00Z",
    "MetadataValues": [
        {
            "ID": 17074,
            "MetadataFieldID": 4,
            "ItemValue": "Data from the German chargepoint registry provided by Bundesnetzagentur.de under the CC-BY 4.0 license"
        }
    ],
    "DataQualityLevel": 3,
    "DateCreated": "2021-07-08T10:05:00Z",
    "SubmissionStatusTypeID": 100
}