{
    "IsRecentlyVerified": false,
    "ID": 102642,
    "UUID": "942F88C9-F82F-4A4C-AB11-86DC68FF6CB1",
    "DataProviderID": 1,
    "OperatorID": 5,
    "UsageTypeID": 1,
    "UsageCost": "Through Aug 31: First 45 minutes free, $5/hr after. Effective September 1: $0.20/kWh + $5/hour after 45 minutes.",
    "AddressInfo": {
        "ID": 102988,
        "Title": "BRISBANEVILLAGE",
        "AddressLine1": "108 Old County Rd",
        "Town": "Brisbane",
        "StateOrProvince": "CA",
        "Postcode": "94005",
        "CountryID": 2,
        "Latitude": 37.6857101,
        "Longitude": -122.3995539,
        "ContactTelephone1": "888-758-4389",
        "AccessComments": "24 hours daily",
        "RelatedURL": "http://www.chargepoint.com/",
        "DistanceUnit": 0
    },
    "Connections": [
        {
            "ID": 144745,
            "ConnectionTypeID": 2,
            "StatusTypeID": 50,
            "LevelID": 3,
            "Amps": 125,
            "Voltage": 500,
            "PowerKW": 50,
            "CurrentTypeID": 30,
            "Quantity": 1
        },
        {
            "ID": 144746,
            "ConnectionTypeID": 32,
            "StatusTypeID": 50,
            "LevelID": 3,
            "Amps": 125,
            "Voltage": 500,
            "PowerKW": 50,
            "CurrentTypeID": 30,
            "Quantity": 1
        }
    ],
    "NumberOfPoints": 1,
    "StatusTypeID": 50,
    "DateLastStatusUpdate": "2018-08-24T20:32:00Z",
    "DataQualityLevel": 3,
    "DateCreated": "2018-04-21T04:13:00Z",
    "SubmissionStatusTypeID": 100
}