{
    "UserComments": [
        {
            "ID": 14789,
            "ChargePointID": 77177,
            "CommentTypeID": 10,
            "UserName": "polianto",
            "Rating": 3,
            "DateCreated": "2017-01-06T14:03:11.313Z",
            "User": {
                "ID": 1606,
                "Username": "polianto"
            },
            "CheckinStatusTypeID": 110
        }
    ],
    "MediaItems": [
        {
            "ID": 8962,
            "ChargePointID": 77177,
            "ItemURL": "https://s3-ap-southeast-2.amazonaws.com/openchargemap/images/IT/OCM77177/OCM-77177.orig.2017010614024906.jpg",
            "ItemThumbnailURL": "https://s3-ap-southeast-2.amazonaws.com/openchargemap/images/IT/OCM77177/OCM-77177.thmb.2017010614024906.jpg",
            "Comment": "",
            "IsEnabled": true,
            "IsVideo": false,
            "IsFeaturedItem": false,
            "IsExternalResource": false,
            "User": {
                "ID": 1606,
                "Username": "polianto"
            },
            "DateCreated": "2017-01-06T14:03:00Z"
        }
    ],
    "IsRecentlyVerified": false,
    "ID": 77177,
    "UUID": "F450F705-5F91-4CEB-9328-FBFC8BFF21F2",
    "DataProviderID": 1,
    "OperatorID": 45,
    "UsageTypeID": 1,
    "UsageCost": "free",
    "AddressInfo": {
        "ID": 77523,
        "Title": "Aumai Market - Lainate",
        "AddressLine1": "Via ex prove Pirelli",
        "Town": "Lainate",
        "StateOrProvince": "MI",
        "Postcode": "20020",
        "CountryID": 112,
        "Latitude": 45.56223834066798,
        "Longitude": 9.031184935199805,
        "ContactTelephone1": "02 937 3956",
        "RelatedURL": "https://www.facebook.com/Aumai-Market-Lainate-261741367550608/?ref=page_internal",
        "DistanceUnit": 0
    },
    "Connections": [
        {
            "ID": 110883,
            "ConnectionTypeID": 25,
            "StatusTypeID": 50,
            "LevelID": 2,
            "Amps": 16,
            "Voltage": 240,
            "PowerKW": 3,
            "CurrentTypeID": 10,
            "Quantity": 3
        }
    ],
    "NumberOfPoints": 3,
    "GeneralComments": "Attivazione senza nessuna tessera\r\nParcheggi non riservati, è possibile che siano occupati da ICE",
    "StatusTypeID": 50,
    "DateLastStatusUpdate": "2017-01-06T14:03:00Z",
    "DataQualityLevel": 1,
    "DateCreated": "2017-01-06T14:01:00Z",
    "SubmissionStatusTypeID": 200
}