{
    "IsRecentlyVerified": false,
    "ID": 116782,
    "UUID": "EB8DC759-D4F9-4C54-AFD1-437F1561E22C",
    "DataProviderID": 1,
    "OperatorID": 23,
    "OperatorsReference": "48790",
    "UsageTypeID": 4,
    "AddressInfo": {
        "ID": 117128,
        "Title": "Chalet Mafis Terchova",
        "AddressLine1": "Majova 457",
        "Town": "Terchova",
        "Postcode": "1306",
        "CountryID": 204,
        "Latitude": 49.257175,
        "Longitude": 19.033962,
        "ContactTelephone1": " +42 1917 200700",
        "DistanceUnit": 0
    },
    "Connections": [
        {
            "ID": 165335,
            "ConnectionTypeID": 30,
            "StatusTypeID": 50,
            "LevelID": 2,
            "PowerKW": 14,
            "CurrentTypeID": 20,
            "Quantity": 1
        }
    ],
    "NumberOfPoints": 1,
    "GeneralComments": "1 Tesla Connector, up to 14kW.Available for customers. Please see front desk.",
    "StatusTypeID": 50,
    "DateLastStatusUpdate": "2019-02-12T11:28:00Z",
    "DataQualityLevel": 1,
    "DateCreated": "2019-02-12T11:28:00Z",
    "SubmissionStatusTypeID": 200
}