{
    "IsRecentlyVerified": false,
    "ID": 121662,
    "UUID": "A06512E2-CB31-4C69-9199-7E3C79C520B9",
    "DataProviderID": 2,
    "DataProvidersReference": "121211",
    "OperatorID": 3318,
    "UsageTypeID": 1,
    "AddressInfo": {
        "ID": 122008,
        "Title": "Walmart 3572 Pearland",
        "AddressLine1": "10505 Broadway St.",
        "Town": "Pearland",
        "StateOrProvince": "TX",
        "Postcode": "77584",
        "CountryID": 2,
        "Latitude": 29.557122,
        "Longitude": -95.384055,
        "ContactTelephone1": "833-632-2778",
        "AccessComments": "24 hours daily",
        "RelatedURL": "https://www.electrifyamerica.com/",
        "DistanceUnit": 0
    },
    "Connections": [
        {
            "ID": 171460,
            "ConnectionTypeID": 1,
            "LevelID": 2,
            "Amps": 16,
            "Voltage": 230,
            "PowerKW": 3,
            "CurrentTypeID": 10,
            "Quantity": 1
        },
        {
            "ID": 171461,
            "ConnectionTypeID": 2,
            "LevelID": 2,
            "Amps": 100,
            "Voltage": 400,
            "PowerKW": 40,
            "CurrentTypeID": 10,
            "Quantity": 1
        },
        {
            "ID": 171462,
            "ConnectionTypeID": 32,
            "LevelID": 2,
            "Amps": 100,
            "Voltage": 400,
            "PowerKW": 40,
            "CurrentTypeID": 10,
            "Quantity": 1
        }
    ],
    "DateLastStatusUpdate": "2019-04-06T05:02:00Z",
    "DataQualityLevel": 3,
    "DateCreated": "2019-04-06T05:02:00Z",
    "SubmissionStatusTypeID": 100
}