{
    "IsRecentlyVerified": false,
    "ID": 138633,
    "UUID": "E6137041-1A3C-43D7-BD04-07F71B81B217",
    "DataProviderID": 2,
    "DataProvidersReference": "125122",
    "OperatorID": 15,
    "UsageTypeID": 4,
    "AddressInfo": {
        "ID": 138983,
        "Title": "SDECC",
        "AddressLine1": "4343 Ocean View Blvd",
        "Town": "San Diego",
        "StateOrProvince": "CA",
        "Postcode": "92113",
        "CountryID": 2,
        "Latitude": 32.699457,
        "Longitude": -117.101887,
        "ContactTelephone1": "877-455-3833",
        "AccessComments": "24 hours daily\r\nPublic - Card key at all times",
        "RelatedURL": "https://www.evgo.com/",
        "DistanceUnit": 0
    },
    "Connections": [
        {
            "ID": 193796,
            "ConnectionTypeID": 2,
            "LevelID": 3,
            "Amps": 100,
            "Voltage": 400,
            "PowerKW": 40,
            "CurrentTypeID": 30,
            "Quantity": 1
        },
        {
            "ID": 193797,
            "ConnectionTypeID": 32,
            "LevelID": 3,
            "Amps": 100,
            "Voltage": 400,
            "PowerKW": 40,
            "CurrentTypeID": 30,
            "Quantity": 1
        }
    ],
    "StatusTypeID": 50,
    "DateLastStatusUpdate": "2020-06-26T02:55:00Z",
    "DataQualityLevel": 3,
    "DateCreated": "2019-12-24T09:09:00Z",
    "SubmissionStatusTypeID": 100
}