{
    "IsRecentlyVerified": false,
    "ID": 180431,
    "UUID": "DD6E0694-AC63-448D-B24C-A5906440437F",
    "DataProviderID": 29,
    "DataProvidersReference": "951",
    "AddressInfo": {
        "ID": 180790,
        "Title": "Pfarrer-Baumann-Straße",
        "AddressLine1": "Pfarrer-Baumann-Straße",
        "Town": "Oberaurach",
        "Postcode": "97514",
        "CountryID": 87,
        "Latitude": 49.947841,
        "Longitude": 10.598556,
        "DistanceUnit": 0
    },
    "Connections": [
        {
            "ID": 283494,
            "ConnectionTypeID": 28,
            "StatusTypeID": 50,
            "LevelID": 2,
            "PowerKW": 22,
            "CurrentTypeID": 10
        },
        {
            "ID": 283495,
            "ConnectionTypeID": 28,
            "StatusTypeID": 50,
            "LevelID": 2,
            "PowerKW": 22,
            "CurrentTypeID": 10
        }
    ],
    "StatusTypeID": 50,
    "DateLastStatusUpdate": "2021-07-09T03:18:00Z",
    "MetadataValues": [
        {
            "ID": 12725,
            "MetadataFieldID": 4,
            "ItemValue": "Data from the German chargepoint registry provided by Bundesnetzagentur.de under the CC-BY 4.0 license"
        }
    ],
    "DataQualityLevel": 3,
    "DateCreated": "2021-07-08T10:00:00Z",
    "SubmissionStatusTypeID": 100
}