{
    "IsRecentlyVerified": false,
    "ID": 148637,
    "UUID": "E163944D-76DB-49A5-96E0-ABBCBB7533C5",
    "DataProviderID": 1,
    "OperatorID": 20,
    "OperatorsReference": "60483",
    "UsageTypeID": 4,
    "UsageCost": "£1.00/charge admin fee",
    "AddressInfo": {
        "ID": 148989,
        "Title": "Regent Arcade",
        "AddressLine1": "Regent Arcade",
        "Postcode": "GL50 1JZ",
        "CountryID": 1,
        "Latitude": 51.8993,
        "Longitude": -2.075,
        "DistanceUnit": 0
    },
    "Connections": [
        {
            "ID": 206388,
            "ConnectionTypeID": 25,
            "StatusTypeID": 50,
            "LevelID": 2,
            "Amps": 32,
            "Voltage": 230,
            "PowerKW": 7,
            "CurrentTypeID": 10,
            "Quantity": 2
        }
    ],
    "NumberOfPoints": 2,
    "StatusTypeID": 50,
    "DateLastStatusUpdate": "2020-02-08T06:15:00Z",
    "DataQualityLevel": 1,
    "DateCreated": "2020-02-08T06:15:00Z",
    "SubmissionStatusTypeID": 200
}