{
    "IsRecentlyVerified": false,
    "ID": 127709,
    "UUID": "1FA0A4DB-D15A-47AA-A3CC-BF329816DDEC",
    "DataProviderID": 1,
    "OperatorID": 74,
    "UsageTypeID": 1,
    "AddressInfo": {
        "ID": 128055,
        "Title": "Fastned Hoge Kwel",
        "AddressLine1": "Hoge Kwel, Wieringerwerf",
        "AddressLine2": "Wieringerwerf",
        "Town": "Hollands Kroon",
        "StateOrProvince": "Noord-Holland",
        "Postcode": "1771MN",
        "CountryID": 159,
        "Latitude": 52.8573098519762,
        "Longitude": 5.02145534255908,
        "ContactTelephone1": "020-7055300",
        "ContactEmail": "support@fastned.nl",
        "RelatedURL": "https://fastned.nl/locaties",
        "DistanceUnit": 0
    },
    "Connections": [
        {
            "ID": 178771,
            "ConnectionTypeID": 33,
            "StatusTypeID": 50,
            "LevelID": 3,
            "PowerKW": 175,
            "CurrentTypeID": 30,
            "Quantity": 2
        },
        {
            "ID": 178772,
            "ConnectionTypeID": 33,
            "StatusTypeID": 50,
            "LevelID": 3,
            "PowerKW": 50,
            "CurrentTypeID": 30
        },
        {
            "ID": 178773,
            "ConnectionTypeID": 2,
            "StatusTypeID": 50,
            "LevelID": 3,
            "PowerKW": 50,
            "CurrentTypeID": 30
        },
        {
            "ID": 178780,
            "ConnectionTypeID": 1036,
            "StatusTypeID": 50,
            "LevelID": 2,
            "PowerKW": 38,
            "CurrentTypeID": 20,
            "Quantity": 1
        }
    ],
    "NumberOfPoints": 1,
    "StatusTypeID": 50,
    "DateLastStatusUpdate": "2019-09-30T15:26:00Z",
    "DataQualityLevel": 1,
    "DateCreated": "2019-06-09T05:01:00Z",
    "SubmissionStatusTypeID": 200
}