{
    "IsRecentlyVerified": false,
    "ID": 35958,
    "UUID": "D04E5D31-8F98-408B-BDCC-C78A26788046",
    "DataProviderID": 26,
    "DataProvidersReference": "54708",
    "OperatorID": 180,
    "OperatorsReference": "Alfen GDH2441",
    "UsageCost": "0.00 jaarabonnement",
    "AddressInfo": {
        "ID": 36304,
        "Title": "Van den Eyndestraat 24",
        "AddressLine1": "Van den Eyndestraat 24",
        "Town": "Den Haag",
        "Postcode": "2582 EC",
        "CountryID": 159,
        "Latitude": 52.089319,
        "Longitude": 4.276014,
        "ContactTelephone1": "036 - 549 34 00",
        "RelatedURL": "http://www.icu-charging-stations.com/",
        "DistanceUnit": 0
    },
    "Connections": [
        {
            "ID": 39469,
            "ConnectionTypeID": 25,
            "LevelID": 2,
            "PowerKW": 11,
            "CurrentTypeID": 10
        },
        {
            "ID": 48152,
            "ConnectionTypeID": 25,
            "LevelID": 2,
            "PowerKW": 11,
            "CurrentTypeID": 10
        }
    ],
    "NumberOfPoints": 1,
    "StatusTypeID": 50,
    "DateLastStatusUpdate": "2016-06-04T02:50:00Z",
    "DataQualityLevel": 3,
    "DateCreated": "2015-01-09T06:05:00Z",
    "SubmissionStatusTypeID": 100
}