{
    "IsRecentlyVerified": false,
    "ID": 128877,
    "UUID": "C3742A29-AE58-45E2-837A-126C68C10B31",
    "DataProviderID": 1,
    "OperatorID": 80,
    "UsageTypeID": 4,
    "AddressInfo": {
        "ID": 129223,
        "Title": "Genova Vittorino Era | EnelX",
        "AddressLine1": "Via Vittorino Era",
        "Town": "Genova",
        "StateOrProvince": "GE",
        "Postcode": "16147",
        "CountryID": 112,
        "Latitude": 44.39498529449352,
        "Longitude": 8.983142634106002,
        "RelatedURL": "https://www.enelx.com/it/it/emobility",
        "DistanceUnit": 0
    },
    "Connections": [
        {
            "ID": 180382,
            "ConnectionTypeID": 25,
            "StatusTypeID": 50,
            "LevelID": 2,
            "Amps": 32,
            "Voltage": 400,
            "PowerKW": 22,
            "CurrentTypeID": 20,
            "Quantity": 1
        },
        {
            "ID": 180383,
            "ConnectionTypeID": 36,
            "StatusTypeID": 50,
            "LevelID": 2,
            "Amps": 16,
            "Voltage": 240,
            "PowerKW": 3.7,
            "CurrentTypeID": 10,
            "Quantity": 1
        }
    ],
    "NumberOfPoints": 2,
    "StatusTypeID": 50,
    "DateLastStatusUpdate": "2019-07-02T15:48:00Z",
    "DataQualityLevel": 1,
    "DateCreated": "2019-07-02T15:48:00Z",
    "SubmissionStatusTypeID": 200
}