{
    "IsRecentlyVerified": false,
    "ID": 116151,
    "UUID": "FA831C89-7017-4187-BB76-B6BFC1C907E4",
    "DataProviderID": 1,
    "UsageTypeID": 7,
    "AddressInfo": {
        "ID": 116497,
        "Title": "Cascade Chevrolet",
        "AddressLine1": "148 Easy St",
        "Town": "Wenatchee",
        "StateOrProvince": "WA",
        "Postcode": "98801",
        "CountryID": 2,
        "Latitude": 47.467463,
        "Longitude": -120.336918,
        "ContactTelephone1": "509-888-2985",
        "AccessComments": "Dealership business hours; for Chevrolet use only\r\nPublic - Call ahead",
        "DistanceUnit": 0
    },
    "Connections": [
        {
            "ID": 163219,
            "ConnectionTypeID": 1,
            "LevelID": 2,
            "Amps": 16,
            "Voltage": 230,
            "PowerKW": 3.7,
            "CurrentTypeID": 10,
            "Quantity": 1
        }
    ],
    "StatusTypeID": 0,
    "DateLastStatusUpdate": "2021-03-26T09:18:00Z",
    "DataQualityLevel": 3,
    "DateCreated": "2019-02-11T07:13:00Z",
    "SubmissionStatusTypeID": 100
}