{
    "IsRecentlyVerified": false,
    "ID": 150948,
    "UUID": "E22DE0BF-6004-48BC-BCB5-CDC7F4EF2B38",
    "DataProviderID": 28,
    "DataProvidersReference": "FR*A16*P*WIIZ*15*_*_*_",
    "UsageTypeID": 5,
    "AddressInfo": {
        "ID": 151301,
        "Title": "Grasse Parking salle omnisports",
        "AddressLine1": "Avenue de Provence",
        "CountryID": 80,
        "Latitude": 43.65687,
        "Longitude": 6.927089,
        "AccessComments": "24h/24",
        "DistanceUnit": 0
    },
    "Connections": [
        {
            "ID": 210337,
            "ConnectionTypeID": 28,
            "StatusTypeID": 50,
            "LevelID": 2,
            "PowerKW": 22,
            "CurrentTypeID": 10
        },
        {
            "ID": 210338,
            "ConnectionTypeID": 1036,
            "StatusTypeID": 50,
            "LevelID": 2,
            "PowerKW": 22,
            "CurrentTypeID": 20
        },
        {
            "ID": 240137,
            "ConnectionTypeID": 28,
            "StatusTypeID": 50,
            "LevelID": 2,
            "PowerKW": 22,
            "CurrentTypeID": 10
        },
        {
            "ID": 240138,
            "ConnectionTypeID": 1036,
            "StatusTypeID": 50,
            "LevelID": 2,
            "PowerKW": 22,
            "CurrentTypeID": 20
        }
    ],
    "GeneralComments": "badge, appli et QR code",
    "StatusTypeID": 50,
    "DateLastStatusUpdate": "2020-08-27T05:11:00Z",
    "DataQualityLevel": 2,
    "DateCreated": "2020-03-15T06:18:00Z",
    "SubmissionStatusTypeID": 100
}