{
    "IsRecentlyVerified": false,
    "ID": 112225,
    "UUID": "E87A1CD5-A288-43F3-A5E3-B953292EA43D",
    "DataProviderID": 2,
    "DataProvidersReference": "85784",
    "UsageTypeID": 1,
    "AddressInfo": {
        "ID": 112571,
        "Title": "Peace Energy Co-op",
        "AddressLine1": "1204 103rd Ave",
        "Town": "Dawson Creek",
        "StateOrProvince": "BC",
        "Postcode": "V1G 2G9",
        "CountryID": 44,
        "Latitude": 55.759161,
        "Longitude": -120.234186,
        "ContactTelephone1": "250-782-3882",
        "AccessComments": "24 hours daily",
        "RelatedURL": "",
        "DistanceUnit": 0
    },
    "Connections": [
        {
            "ID": 157778,
            "ConnectionTypeID": 1,
            "LevelID": 2,
            "Amps": 16,
            "Voltage": 230,
            "PowerKW": 3.7,
            "CurrentTypeID": 10,
            "Quantity": 1
        }
    ],
    "DateLastStatusUpdate": "2020-06-26T03:12:00Z",
    "DataQualityLevel": 3,
    "DateCreated": "2018-10-18T23:37:00Z",
    "SubmissionStatusTypeID": 100
}