{
    "IsRecentlyVerified": false,
    "ID": 99211,
    "UUID": "803697E0-F19D-49AA-A3A0-720D7FCDFB09",
    "DataProviderID": 1,
    "OperatorID": 45,
    "UsageTypeID": 1,
    "AddressInfo": {
        "ID": 99557,
        "Title": "E-Bike Station Schutterzeller Mühle",
        "AddressLine1": "Schutterzeller Mühle 1",
        "Town": "Neuried",
        "StateOrProvince": "Ortenaukreis",
        "Postcode": "77743",
        "CountryID": 87,
        "Latitude": 48.414483929208295,
        "Longitude": 7.848736891015622,
        "AccessComments": "Die 24/7 kostenlos nutzbare Ladestation gehört zum neu eingerichteten Bure-Radweg\r\n",
        "RelatedURL": "https://www.neuried.net/fahrradfahren.html",
        "DistanceUnit": 0
    },
    "Connections": [
        {
            "ID": 140158,
            "ConnectionTypeID": 28,
            "StatusTypeID": 50,
            "LevelID": 1,
            "Amps": 10,
            "Voltage": 230,
            "PowerKW": 2.3,
            "CurrentTypeID": 10,
            "Quantity": 3
        }
    ],
    "NumberOfPoints": 3,
    "StatusTypeID": 50,
    "DateLastStatusUpdate": "2018-01-24T06:31:00Z",
    "DataQualityLevel": 1,
    "DateCreated": "2018-01-24T06:31:00Z",
    "SubmissionStatusTypeID": 200
}