{
    "UserComments": [
        {
            "ID": 4817,
            "ChargePointID": 47273,
            "CommentTypeID": 10,
            "UserName": "Erna_Schleck",
            "Comment": "Renault Twizy mit Schuko 2kW",
            "Rating": 4,
            "DateCreated": "2015-07-01T20:39:50.407Z",
            "User": {
                "ID": 4573,
                "Username": "Erna_Schleck"
            },
            "CheckinStatusTypeID": 10
        }
    ],
    "MediaItems": [
        {
            "ID": 1627,
            "ChargePointID": 47273,
            "ItemURL": "https://s3-ap-southeast-2.amazonaws.com/openchargemap/images/DE/OCM47273/OCM-47273.orig.2015070120355311.jpg",
            "ItemThumbnailURL": "https://s3-ap-southeast-2.amazonaws.com/openchargemap/images/DE/OCM47273/OCM-47273.thmb.2015070120355311.jpg",
            "Comment": "",
            "IsEnabled": true,
            "IsVideo": false,
            "IsFeaturedItem": false,
            "IsExternalResource": false,
            "User": {
                "ID": 4573,
                "Username": "Erna_Schleck"
            },
            "DateCreated": "2015-07-01T20:36:00Z"
        }
    ],
    "IsRecentlyVerified": false,
    "ID": 47273,
    "UUID": "5C401C62-1A6A-48DF-AA7E-BF0A2A22945C",
    "DataProviderID": 1,
    "OperatorID": 45,
    "UsageTypeID": 6,
    "UsageCost": "",
    "AddressInfo": {
        "ID": 47619,
        "Title": "E-Bike Ladestation Landhaus am Sonnenberg",
        "AddressLine1": "Sonnenberg",
        "AddressLine2": "",
        "Town": "Egenstedt",
        "StateOrProvince": "Landkreis Hildesheim",
        "Postcode": "31199",
        "CountryID": 87,
        "Latitude": 52.092801006186555,
        "Longitude": 9.994398310589515,
        "ContactTelephone1": "",
        "ContactTelephone2": "",
        "ContactEmail": "",
        "AccessComments": "Für Gäste des Hotel, Restaurants und Biergarten gibt es 4 Steckdosen am Fahrradständer. Dazu die Einfahrt hochfahren, das Sperrschild ignorieren und oben auf den Parkplatz oder direkt am Fahrradständer halten",
        "RelatedURL": "http://www.landhaus-am-sonnenberg.com/Anfahrt.html",
        "DistanceUnit": 0
    },
    "Connections": [
        {
            "ID": 58282,
            "ConnectionTypeID": 28,
            "StatusTypeID": 50,
            "LevelID": 1,
            "Amps": 10,
            "Voltage": 230,
            "PowerKW": 2.3,
            "CurrentTypeID": 10,
            "Quantity": 4
        }
    ],
    "NumberOfPoints": 4,
    "GeneralComments": "",
    "StatusTypeID": 50,
    "DateLastStatusUpdate": "2015-07-01T20:40:00Z",
    "DataQualityLevel": 1,
    "DateCreated": "2015-05-22T09:26:00Z",
    "SubmissionStatusTypeID": 200
}