{
    "IsRecentlyVerified": false,
    "ID": 168847,
    "UUID": "23D56B6A-64BF-4AF5-9392-6C323847FD69",
    "DataProviderID": 1,
    "OperatorID": 150,
    "UsageTypeID": 4,
    "UsageCost": "£0.35/kWh",
    "AddressInfo": {
        "ID": 169206,
        "Title": "Morrisons Oswestry",
        "AddressLine1": "180 College Rd",
        "Town": "Oswestry",
        "StateOrProvince": "England",
        "Postcode": "SY11 2RZ",
        "CountryID": 1,
        "Latitude": 52.85092671073383,
        "Longitude": -3.041247249488947,
        "RelatedURL": "https://www.cpsgenie.com/ds",
        "DistanceUnit": 0
    },
    "Connections": [
        {
            "ID": 256689,
            "ConnectionTypeID": 2,
            "StatusTypeID": 50,
            "LevelID": 3,
            "PowerKW": 50,
            "CurrentTypeID": 30,
            "Quantity": 2
        },
        {
            "ID": 256690,
            "ConnectionTypeID": 33,
            "StatusTypeID": 50,
            "LevelID": 3,
            "PowerKW": 50,
            "CurrentTypeID": 30,
            "Quantity": 2
        },
        {
            "ID": 256691,
            "ConnectionTypeID": 25,
            "StatusTypeID": 50,
            "LevelID": 2,
            "Amps": 32,
            "Voltage": 400,
            "PowerKW": 22,
            "CurrentTypeID": 20,
            "Quantity": 2
        }
    ],
    "NumberOfPoints": 4,
    "GeneralComments": "£10.00 overstay fee after 95 mins ,then £10.00 every subsequent 95 mins",
    "StatusTypeID": 50,
    "DateLastStatusUpdate": "2021-07-28T16:03:00Z",
    "DataQualityLevel": 1,
    "DateCreated": "2020-10-06T19:50:00Z",
    "SubmissionStatusTypeID": 200
}