{
    "UserComments": [
        {
            "ID": 19459,
            "ChargePointID": 85828,
            "CommentTypeID": 10,
            "UserName": "Clive ",
            "Comment": "I noted that the description says 4 bays but not strictly true as bike shed covers one of them and there is only one post. Directors charge using them and therefore can be in use. If you are visiting the property you will need to ask but they are 22 Kwh sockets and do not need the app to confirm. ",
            "Rating": 3,
            "DateCreated": "2018-04-23T16:02:53.623Z",
            "User": {
                "ID": 9176,
                "Username": "Clive "
            },
            "CheckinStatusTypeID": 10
        }
    ],
    "IsRecentlyVerified": false,
    "ID": 85828,
    "UUID": "F7A730D1-29F3-4D2D-9222-8D023215BD1A",
    "DataProviderID": 1,
    "OperatorID": 3,
    "OperatorsReference": "PG-80975",
    "UsageTypeID": 6,
    "UsageCost": "1",
    "AddressInfo": {
        "ID": 86174,
        "Title": "Sapa Building Systems LTD",
        "AddressLine1": "Severn Drive",
        "Town": "Gloucestershire",
        "Postcode": "GL20 8SF",
        "CountryID": 1,
        "Latitude": 52.00559,
        "Longitude": -2.125047,
        "DistanceUnit": 0
    },
    "Connections": [
        {
            "ID": 121981,
            "ConnectionTypeID": 25,
            "StatusTypeID": 50,
            "LevelID": 2,
            "Amps": 32,
            "Voltage": 400,
            "PowerKW": 22,
            "CurrentTypeID": 20,
            "Quantity": 2
        }
    ],
    "NumberOfPoints": 4,
    "GeneralComments": "This is an open charge unit installed at the Sapa Building Systems Ltd site in Severn Drive, Tewkesbury",
    "StatusTypeID": 0,
    "DateLastStatusUpdate": "2020-01-20T06:38:00Z",
    "DataQualityLevel": 1,
    "DateCreated": "2017-04-15T20:19:00Z",
    "SubmissionStatusTypeID": 200
}