{
    "IsRecentlyVerified": false,
    "ID": 110278,
    "UUID": "C7B860EE-6812-4493-8E5B-6FDA9A1740F8",
    "DataProviderID": 2,
    "DataProvidersReference": "100341",
    "OperatorID": 5,
    "UsageTypeID": 1,
    "AddressInfo": {
        "ID": 110624,
        "Title": "DC SOLAR",
        "AddressLine1": "8133 Dean Martin Dr",
        "Town": "Las Vegas",
        "StateOrProvince": "NV",
        "Postcode": "89139",
        "CountryID": 2,
        "Latitude": 36.041995,
        "Longitude": -115.1882878,
        "ContactTelephone1": "888-758-4389",
        "AccessComments": "24 hours daily",
        "RelatedURL": "http://www.chargepoint.com/",
        "DistanceUnit": 0
    },
    "Connections": [
        {
            "ID": 155517,
            "ConnectionTypeID": 1,
            "LevelID": 2,
            "Amps": 16,
            "Voltage": 230,
            "PowerKW": 3,
            "CurrentTypeID": 10,
            "Quantity": 1
        }
    ],
    "DateLastStatusUpdate": "2019-04-06T04:02:00Z",
    "DataQualityLevel": 3,
    "DateCreated": "2018-10-18T23:36:00Z",
    "SubmissionStatusTypeID": 100
}