{
    "IsRecentlyVerified": false,
    "ID": 162715,
    "UUID": "36AFCE1E-CB13-412B-85D9-BC55B4F0A7AE",
    "DataProviderID": 1,
    "OperatorID": 21,
    "UsageTypeID": 4,
    "UsageCost": "Mobi.E compatible card",
    "AddressInfo": {
        "ID": 163072,
        "Title": "LSB-00301",
        "AddressLine1": "Avenida Helen Keller",
        "Town": "Lisbon",
        "StateOrProvince": "Lisboa",
        "Postcode": "1300",
        "CountryID": 180,
        "Latitude": 38.71047176893413,
        "Longitude": -9.204337054690086,
        "AccessComments": "Galp",
        "DistanceUnit": 0
    },
    "Connections": [
        {
            "ID": 234224,
            "ConnectionTypeID": 2,
            "StatusTypeID": 50,
            "LevelID": 3,
            "Amps": 120,
            "Voltage": 500,
            "PowerKW": 50,
            "CurrentTypeID": 30,
            "Quantity": 1
        },
        {
            "ID": 234225,
            "ConnectionTypeID": 33,
            "StatusTypeID": 50,
            "LevelID": 3,
            "Amps": 125,
            "Voltage": 500,
            "PowerKW": 50,
            "CurrentTypeID": 30,
            "Quantity": 1
        },
        {
            "ID": 234226,
            "ConnectionTypeID": 1036,
            "StatusTypeID": 50,
            "LevelID": 3,
            "Amps": 64,
            "Voltage": 400,
            "PowerKW": 43,
            "CurrentTypeID": 20,
            "Quantity": 1
        }
    ],
    "NumberOfPoints": 2,
    "StatusTypeID": 50,
    "DateLastStatusUpdate": "2020-08-14T21:48:00Z",
    "DataQualityLevel": 1,
    "DateCreated": "2020-08-14T21:48:00Z",
    "SubmissionStatusTypeID": 200
}