{
    "IsRecentlyVerified": false,
    "ID": 15941,
    "UUID": "6F7FA9D5-5570-4CBE-9696-781CE5AB5256",
    "DataProviderID": 1,
    "OperatorID": 1,
    "UsageTypeID": 0,
    "UsageCost": "Free",
    "AddressInfo": {
        "ID": 16286,
        "Title": "Decospan",
        "AddressLine1": "Lageweg 33 ",
        "AddressLine2": "",
        "Town": "Menen ",
        "StateOrProvince": "",
        "Postcode": "8930 ",
        "CountryID": 26,
        "Latitude": 50.7931524,
        "Longitude": 3.103710200000023,
        "ContactTelephone1": "+32 (0)56 52 88 00 ",
        "ContactTelephone2": "",
        "ContactEmail": "info@decospan.com",
        "AccessComments": "",
        "RelatedURL": "http://www.decospan.com",
        "DistanceUnit": 0
    },
    "Connections": [
        {
            "ID": 14315,
            "ConnectionTypeID": 0,
            "StatusTypeID": 0,
            "LevelID": 2,
            "Amps": 16,
            "Voltage": 230,
            "PowerKW": 3.7,
            "Quantity": 1
        }
    ],
    "NumberOfPoints": 1,
    "GeneralComments": "",
    "StatusTypeID": 50,
    "DateLastStatusUpdate": "2013-02-15T15:28:00Z",
    "DataQualityLevel": 1,
    "DateCreated": "2013-02-15T15:28:00Z",
    "SubmissionStatusTypeID": 200
}