{
    "IsRecentlyVerified": false,
    "ID": 90820,
    "UUID": "908277B3-BAE2-4FE5-AB3F-84D3AFB0BF00",
    "DataProviderID": 1,
    "DataProvidersReference": "4154",
    "AddressInfo": {
        "ID": 91166,
        "Title": "P-Hus Baggen",
        "AddressLine1": "Kungsgatan 24",
        "Town": "LINKÖPING",
        "StateOrProvince": "ÖSTERGÖTLAND",
        "Postcode": "58218",
        "CountryID": 216,
        "Latitude": 58.41292,
        "Longitude": 15.62115,
        "AccessComments": "",
        "DistanceUnit": 0
    },
    "Connections": [
        {
            "ID": 128614,
            "ConnectionTypeID": 0,
            "Reference": "1",
            "LevelID": 2,
            "Amps": 32,
            "Voltage": 400,
            "PowerKW": 22,
            "Comments": "Mode 3"
        },
        {
            "ID": 128615,
            "ConnectionTypeID": 0,
            "Reference": "2",
            "LevelID": 2,
            "Amps": 32,
            "Voltage": 400,
            "PowerKW": 22,
            "Comments": "Mode 3"
        },
        {
            "ID": 128616,
            "ConnectionTypeID": 0,
            "Reference": "3",
            "LevelID": 2,
            "Amps": 32,
            "Voltage": 400,
            "PowerKW": 22,
            "Comments": "Mode 3"
        },
        {
            "ID": 128617,
            "ConnectionTypeID": 0,
            "Reference": "4",
            "LevelID": 2,
            "Amps": 32,
            "Voltage": 400,
            "PowerKW": 22,
            "Comments": "Mode 3"
        },
        {
            "ID": 128618,
            "ConnectionTypeID": 0,
            "Reference": "5",
            "LevelID": 2,
            "Amps": 32,
            "Voltage": 400,
            "PowerKW": 22,
            "Comments": "Mode 3"
        },
        {
            "ID": 128619,
            "ConnectionTypeID": 0,
            "Reference": "6",
            "LevelID": 2,
            "Amps": 32,
            "Voltage": 400,
            "PowerKW": 22,
            "Comments": "Mode 3"
        },
        {
            "ID": 128620,
            "ConnectionTypeID": 0,
            "Reference": "7",
            "LevelID": 2,
            "Amps": 32,
            "Voltage": 400,
            "PowerKW": 22,
            "Comments": "Mode 3"
        },
        {
            "ID": 128621,
            "ConnectionTypeID": 0,
            "Reference": "8",
            "LevelID": 2,
            "Amps": 32,
            "Voltage": 400,
            "PowerKW": 22,
            "Comments": "Mode 3"
        },
        {
            "ID": 128622,
            "ConnectionTypeID": 0,
            "Reference": "9",
            "LevelID": 2,
            "Amps": 32,
            "Voltage": 400,
            "PowerKW": 22,
            "Comments": "Mode 3"
        },
        {
            "ID": 128623,
            "ConnectionTypeID": 0,
            "Reference": "10",
            "LevelID": 2,
            "Amps": 32,
            "Voltage": 400,
            "PowerKW": 22,
            "Comments": "Mode 3"
        },
        {
            "ID": 128624,
            "ConnectionTypeID": 0,
            "Reference": "11",
            "LevelID": 2,
            "Amps": 32,
            "Voltage": 400,
            "PowerKW": 22,
            "Comments": "Mode 3"
        },
        {
            "ID": 128625,
            "ConnectionTypeID": 0,
            "Reference": "12",
            "LevelID": 2,
            "Amps": 32,
            "Voltage": 400,
            "PowerKW": 22,
            "Comments": "Mode 3"
        }
    ],
    "NumberOfPoints": 12,
    "DateLastStatusUpdate": "2020-05-26T08:22:00Z",
    "DataQualityLevel": 2,
    "DateCreated": "2017-07-25T08:28:00Z",
    "SubmissionStatusTypeID": 100
}