{
    "MediaItems": [
        {
            "ID": 23781,
            "ChargePointID": 162233,
            "ItemURL": "https://s3-ap-southeast-2.amazonaws.com/openchargemap/images/AT/OCM162233/OCM-162233.orig.2020080309383324.jpg",
            "ItemThumbnailURL": "https://s3-ap-southeast-2.amazonaws.com/openchargemap/images/AT/OCM162233/OCM-162233.thmb.2020080309383324.jpg",
            "Comment": "",
            "IsEnabled": true,
            "IsVideo": false,
            "IsFeaturedItem": false,
            "IsExternalResource": false,
            "User": {
                "ID": 26760,
                "Username": "interssl.com"
            },
            "DateCreated": "2020-08-03T09:39:00Z"
        },
        {
            "ID": 23782,
            "ChargePointID": 162233,
            "ItemURL": "https://s3-ap-southeast-2.amazonaws.com/openchargemap/images/AT/OCM162233/OCM-162233.orig.2020080309384592.jpg",
            "ItemThumbnailURL": "https://s3-ap-southeast-2.amazonaws.com/openchargemap/images/AT/OCM162233/OCM-162233.thmb.2020080309384592.jpg",
            "Comment": "",
            "IsEnabled": true,
            "IsVideo": false,
            "IsFeaturedItem": false,
            "IsExternalResource": false,
            "User": {
                "ID": 26760,
                "Username": "interssl.com"
            },
            "DateCreated": "2020-08-03T09:39:00Z"
        },
        {
            "ID": 23783,
            "ChargePointID": 162233,
            "ItemURL": "https://s3-ap-southeast-2.amazonaws.com/openchargemap/images/AT/OCM162233/OCM-162233.orig.2020080309385728.jpg",
            "ItemThumbnailURL": "https://s3-ap-southeast-2.amazonaws.com/openchargemap/images/AT/OCM162233/OCM-162233.thmb.2020080309385728.jpg",
            "Comment": "",
            "IsEnabled": true,
            "IsVideo": false,
            "IsFeaturedItem": false,
            "IsExternalResource": false,
            "User": {
                "ID": 26760,
                "Username": "interssl.com"
            },
            "DateCreated": "2020-08-03T09:39:00Z"
        },
        {
            "ID": 23784,
            "ChargePointID": 162233,
            "ItemURL": "https://s3-ap-southeast-2.amazonaws.com/openchargemap/images/AT/OCM162233/OCM-162233.orig.2020080309390788.jpg",
            "ItemThumbnailURL": "https://s3-ap-southeast-2.amazonaws.com/openchargemap/images/AT/OCM162233/OCM-162233.thmb.2020080309390788.jpg",
            "Comment": "",
            "IsEnabled": true,
            "IsVideo": false,
            "IsFeaturedItem": false,
            "IsExternalResource": false,
            "User": {
                "ID": 26760,
                "Username": "interssl.com"
            },
            "DateCreated": "2020-08-03T09:39:00Z"
        },
        {
            "ID": 23780,
            "ChargePointID": 162233,
            "ItemURL": "https://s3-ap-southeast-2.amazonaws.com/openchargemap/images/AT/OCM162233/OCM-162233.orig.2020080309382021.jpg",
            "ItemThumbnailURL": "https://s3-ap-southeast-2.amazonaws.com/openchargemap/images/AT/OCM162233/OCM-162233.thmb.2020080309382021.jpg",
            "Comment": "",
            "IsEnabled": true,
            "IsVideo": false,
            "IsFeaturedItem": false,
            "IsExternalResource": false,
            "User": {
                "ID": 26760,
                "Username": "interssl.com"
            },
            "DateCreated": "2020-08-03T09:38:00Z"
        }
    ],
    "IsRecentlyVerified": false,
    "ID": 162233,
    "UUID": "82270E71-85B5-4D5E-A2C2-DEBC7554D0AB",
    "DataProviderID": 1,
    "OperatorID": 3261,
    "UsageTypeID": 6,
    "UsageCost": "paid",
    "AddressInfo": {
        "ID": 162590,
        "Title": "Hotel Kaiserblick",
        "AddressLine1": "Kirchbichl 5",
        "Town": "Gemeinde Ellmau",
        "StateOrProvince": "Tirol",
        "Postcode": "6352",
        "CountryID": 19,
        "Latitude": 47.51095357338315,
        "Longitude": 12.301695651573255,
        "DistanceUnit": 0
    },
    "Connections": [
        {
            "ID": 233480,
            "ConnectionTypeID": 25,
            "StatusTypeID": 50,
            "LevelID": 2,
            "Amps": 32,
            "PowerKW": 22,
            "CurrentTypeID": 20,
            "Quantity": 4
        }
    ],
    "NumberOfPoints": 4,
    "StatusTypeID": 50,
    "DateLastStatusUpdate": "2020-08-04T09:29:00Z",
    "DataQualityLevel": 1,
    "DateCreated": "2020-08-03T09:38:00Z",
    "SubmissionStatusTypeID": 200
}