{
    "IsRecentlyVerified": false,
    "ID": 124412,
    "UUID": "3E1E93A6-A8CB-41C7-8591-F36F6F7F11ED",
    "DataProviderID": 2,
    "DataProvidersReference": "116873",
    "OperatorID": 5,
    "UsageTypeID": 1,
    "AddressInfo": {
        "ID": 124758,
        "Title": "SIMON",
        "AddressLine1": "629 Factory Stores Dr",
        "Town": "Napa",
        "StateOrProvince": "CA",
        "Postcode": "94558",
        "CountryID": 2,
        "Latitude": 38.294684,
        "Longitude": -122.302724,
        "ContactTelephone1": "888-758-4389",
        "AccessComments": "24 hours daily",
        "RelatedURL": "http://www.chargepoint.com/",
        "DistanceUnit": 0
    },
    "Connections": [
        {
            "ID": 174504,
            "ConnectionTypeID": 1,
            "LevelID": 2,
            "Amps": 16,
            "Voltage": 230,
            "PowerKW": 3,
            "CurrentTypeID": 10,
            "Quantity": 2
        }
    ],
    "DateLastStatusUpdate": "2019-12-24T09:14:00Z",
    "DataQualityLevel": 3,
    "DateCreated": "2019-04-06T05:03:00Z",
    "SubmissionStatusTypeID": 100
}