{
    "IsRecentlyVerified": false,
    "ID": 106971,
    "UUID": "AE7EBA4D-645C-48D7-B9A7-28F22F25372A",
    "DataProviderID": 1,
    "OperatorID": 220,
    "UsageTypeID": 4,
    "AddressInfo": {
        "ID": 107317,
        "Title": "Lübsche Straße",
        "AddressLine1": "Lübsche Straße 28",
        "Town": "Gadebusch",
        "StateOrProvince": "Nordwestmecklenburg",
        "Postcode": "19205",
        "CountryID": 87,
        "Latitude": 53.70124313352474,
        "Longitude": 11.115066125606745,
        "AccessComments": "24/7 nutzbar. Betreiber ist die WEMAG.",
        "RelatedURL": "http://www.wemag.com/laden",
        "DistanceUnit": 0
    },
    "Connections": [
        {
            "ID": 150802,
            "ConnectionTypeID": 25,
            "StatusTypeID": 50,
            "LevelID": 2,
            "Amps": 32,
            "Voltage": 400,
            "PowerKW": 22,
            "CurrentTypeID": 20,
            "Quantity": 2
        }
    ],
    "NumberOfPoints": 2,
    "StatusTypeID": 50,
    "DateLastStatusUpdate": "2018-07-11T06:58:00Z",
    "DataQualityLevel": 1,
    "DateCreated": "2018-07-11T06:58:00Z",
    "SubmissionStatusTypeID": 200
}