{
    "IsRecentlyVerified": false,
    "ID": 84476,
    "UUID": "BF542AED-B0EB-487D-92BA-5483BE79BE7E",
    "DataProviderID": 1,
    "OperatorID": 105,
    "UsageTypeID": 4,
    "AddressInfo": {
        "ID": 84822,
        "Title": "Volksbank",
        "AddressLine1": "Nerotalstraße 2",
        "Town": "Mainz",
        "StateOrProvince": "Rheinland-Pfalz",
        "Postcode": "55124",
        "CountryID": 87,
        "Latitude": 50.0029816833498,
        "Longitude": 8.20984353862309,
        "AccessComments": "Auf dem Kundenparkplatz der Volksbank gegenüber von der angegebenen Adresse. 24/7 nutzbar",
        "RelatedURL": "http://www.allgemeine-zeitung.de/lokales/mainz/nachrichten-mainz/laden-waehrend-des-einkaufs_17705944.htm",
        "DistanceUnit": 0
    },
    "Connections": [
        {
            "ID": 119937,
            "ConnectionTypeID": 25,
            "StatusTypeID": 50,
            "LevelID": 2,
            "Amps": 32,
            "Voltage": 400,
            "PowerKW": 22,
            "CurrentTypeID": 20,
            "Quantity": 2
        }
    ],
    "NumberOfPoints": 2,
    "StatusTypeID": 50,
    "DateLastStatusUpdate": "2017-02-28T08:25:00Z",
    "DataQualityLevel": 1,
    "DateCreated": "2017-02-28T08:25:00Z",
    "SubmissionStatusTypeID": 200
}