{
    "IsRecentlyVerified": false,
    "ID": 115429,
    "UUID": "DF09EC1D-B3EA-4365-A1D8-7CB19A1C62E1",
    "DataProviderID": 2,
    "DataProvidersReference": "105332",
    "OperatorID": 5,
    "UsageTypeID": 1,
    "AddressInfo": {
        "ID": 115775,
        "Title": "3 HOURS MAX",
        "AddressLine1": "1980 Main Street",
        "Town": "Santa Ana",
        "StateOrProvince": "CA",
        "Postcode": "92707",
        "CountryID": 2,
        "Latitude": 33.722646,
        "Longitude": -117.868057,
        "ContactTelephone1": "888-758-4389",
        "AccessComments": "24 hours daily",
        "RelatedURL": "http://www.chargepoint.com/",
        "DistanceUnit": 0
    },
    "Connections": [
        {
            "ID": 162438,
            "ConnectionTypeID": 1,
            "LevelID": 2,
            "Amps": 16,
            "Voltage": 230,
            "PowerKW": 3,
            "CurrentTypeID": 10,
            "Quantity": 4
        }
    ],
    "DateLastStatusUpdate": "2019-04-06T04:01:00Z",
    "DataQualityLevel": 3,
    "DateCreated": "2019-02-11T07:13:00Z",
    "SubmissionStatusTypeID": 100
}