{
    "IsRecentlyVerified": false,
    "ID": 100390,
    "UUID": "EB4991CE-4498-406C-9C5F-3517FFEB8D86",
    "DataProviderID": 1,
    "OperatorID": 23,
    "OperatorsReference": "40901",
    "UsageTypeID": 4,
    "AddressInfo": {
        "ID": 100736,
        "Title": "The Huggy's Bar - Nandrin",
        "AddressLine1": "Route du Condroz 310",
        "Town": "Nandrin",
        "Postcode": "4550",
        "CountryID": 26,
        "Latitude": 50.520636,
        "Longitude": 5.416578,
        "ContactTelephone1": "+32 4 91 95 47 02",
        "DistanceUnit": 0
    },
    "Connections": [
        {
            "ID": 141809,
            "ConnectionTypeID": 30,
            "StatusTypeID": 50,
            "LevelID": 2,
            "Amps": 32,
            "Voltage": 230,
            "PowerKW": 14,
            "CurrentTypeID": 20,
            "Quantity": 1
        }
    ],
    "NumberOfPoints": 1,
    "GeneralComments": "1 Tesla Connector, up to 14kW.Available for customers. Self park.",
    "StatusTypeID": 50,
    "DateLastStatusUpdate": "2018-10-03T19:02:00Z",
    "DataQualityLevel": 1,
    "DateCreated": "2018-02-23T06:58:00Z",
    "SubmissionStatusTypeID": 200
}