{
    "IsRecentlyVerified": false,
    "ID": 171157,
    "UUID": "3064CE92-3022-4F23-AE1E-93C451172007",
    "DataProviderID": 1,
    "OperatorID": 3271,
    "UsageTypeID": 4,
    "UsageCost": "DC: 1.95RON/kWh AC: 1.45RON/kWh ",
    "AddressInfo": {
        "ID": 171516,
        "Title": "Kaufland Valea Cascadelor",
        "AddressLine1": "Strada Valea Cascadelor",
        "Town": "Bucharest",
        "StateOrProvince": "",
        "Postcode": "061093",
        "CountryID": 184,
        "Latitude": 44.43199780000057,
        "Longitude": 26.00557330000106,
        "DistanceUnit": 0
    },
    "Connections": [
        {
            "ID": 261564,
            "ConnectionTypeID": 25,
            "StatusTypeID": 50,
            "LevelID": 2,
            "Amps": 32,
            "Voltage": 400,
            "PowerKW": 22,
            "CurrentTypeID": 20,
            "Quantity": 1
        },
        {
            "ID": 261565,
            "ConnectionTypeID": 2,
            "StatusTypeID": 50,
            "LevelID": 3,
            "Amps": 120,
            "Voltage": 500,
            "PowerKW": 50,
            "CurrentTypeID": 30,
            "Quantity": 1
        },
        {
            "ID": 261566,
            "ConnectionTypeID": 33,
            "StatusTypeID": 50,
            "LevelID": 3,
            "Amps": 120,
            "Voltage": 500,
            "PowerKW": 50,
            "CurrentTypeID": 30,
            "Quantity": 1
        }
    ],
    "NumberOfPoints": 2,
    "StatusTypeID": 50,
    "DateLastStatusUpdate": "2021-01-18T08:57:00Z",
    "DataQualityLevel": 1,
    "DateCreated": "2020-12-22T18:20:00Z",
    "SubmissionStatusTypeID": 200
}