{
    "IsRecentlyVerified": false,
    "ID": 20862,
    "UUID": "5CC09185-3649-4EE1-9EB8-84B0234A98A4",
    "DataProviderID": 2,
    "DataProvidersReference": "53954",
    "UsageTypeID": 7,
    "AddressInfo": {
        "ID": 21207,
        "Title": "Sheehy Ford Lincoln",
        "AddressLine1": "10601 Midlothian Turnpike",
        "Town": "Midlothian",
        "StateOrProvince": "VA",
        "Postcode": "23235",
        "CountryID": 2,
        "Latitude": 37.506999,
        "Longitude": -77.592621,
        "ContactTelephone1": "804-794-0500",
        "AccessComments": "Dealership business hours; for customer use only",
        "RelatedURL": "",
        "DistanceUnit": 0
    },
    "Connections": [
        {
            "ID": 22726,
            "ConnectionTypeID": 1,
            "LevelID": 2,
            "Amps": 16,
            "Voltage": 230,
            "PowerKW": 3,
            "CurrentTypeID": 10,
            "Quantity": 1
        }
    ],
    "DateLastStatusUpdate": "2019-04-06T04:02:00Z",
    "DataQualityLevel": 3,
    "DateCreated": "2014-01-17T04:54:00Z",
    "SubmissionStatusTypeID": 100
}