{
    "IsRecentlyVerified": false,
    "ID": 124441,
    "UUID": "66A3CE0A-9A52-426B-AE5B-3A289BFBD5A7",
    "DataProviderID": 2,
    "DataProvidersReference": "63783",
    "OperatorID": 5,
    "UsageTypeID": 1,
    "AddressInfo": {
        "ID": 124787,
        "Title": "MAINTENANCE-1",
        "AddressLine1": "8300 Demetre Ave",
        "Town": "Sacramento",
        "StateOrProvince": "CA",
        "Postcode": "95828",
        "CountryID": 2,
        "Latitude": 38.520132,
        "Longitude": -121.3962257,
        "ContactTelephone1": "888-758-4389",
        "AccessComments": "24 hours daily",
        "RelatedURL": "http://www.chargepoint.com/",
        "DistanceUnit": 0
    },
    "Connections": [
        {
            "ID": 174540,
            "ConnectionTypeID": 1,
            "LevelID": 2,
            "Amps": 16,
            "Voltage": 230,
            "PowerKW": 3,
            "CurrentTypeID": 10,
            "Quantity": 2
        }
    ],
    "DateLastStatusUpdate": "2019-12-24T09:14:00Z",
    "DataQualityLevel": 3,
    "DateCreated": "2019-04-06T05:03:00Z",
    "SubmissionStatusTypeID": 100
}