{
    "IsRecentlyVerified": false,
    "ID": 38907,
    "UUID": "F5636B0D-E4F1-4F0E-9025-539571CA6802",
    "DataProviderID": 26,
    "DataProvidersReference": "16761",
    "OperatorID": 162,
    "OperatorsReference": "Verlengde Asserstraat 67",
    "UsageCost": "0.00 gratis",
    "AddressInfo": {
        "ID": 39253,
        "Title": "Verlengde Asserstraat 83",
        "AddressLine1": "Verlengde Asserstraat 83",
        "Town": "Aa en Hunze",
        "Postcode": "9461 TV",
        "CountryID": 159,
        "Latitude": 53.000249,
        "Longitude": 6.747325,
        "DistanceUnit": 0
    },
    "Connections": [
        {
            "ID": 42418,
            "ConnectionTypeID": 28,
            "LevelID": 1,
            "PowerKW": 2.3,
            "CurrentTypeID": 10
        }
    ],
    "NumberOfPoints": 1,
    "StatusTypeID": 50,
    "DateLastStatusUpdate": "2016-06-04T02:55:00Z",
    "DataQualityLevel": 3,
    "DateCreated": "2015-01-09T06:08:00Z",
    "SubmissionStatusTypeID": 100
}