{
    "IsRecentlyVerified": false,
    "ID": 146204,
    "UUID": "98913324-5D26-4455-96E0-3940E39EB225",
    "DataProviderID": 1,
    "OperatorID": 3315,
    "OperatorsReference": "51373",
    "UsageTypeID": 4,
    "UsageCost": "Free",
    "AddressInfo": {
        "ID": 146556,
        "Title": "Scottish Parliament Building, Edinburgh",
        "AddressLine1": "Scottish Parliament Building",
        "Town": "Horse Wynd",
        "StateOrProvince": "City of Edinburgh",
        "Postcode": "EH99 1SP",
        "CountryID": 1,
        "Latitude": 55.951319,
        "Longitude": -3.1753173,
        "DistanceUnit": 0
    },
    "Connections": [
        {
            "ID": 203154,
            "ConnectionTypeID": 25,
            "StatusTypeID": 50,
            "LevelID": 2,
            "Amps": 32,
            "Voltage": 400,
            "PowerKW": 22,
            "CurrentTypeID": 20,
            "Quantity": 2
        }
    ],
    "NumberOfPoints": 2,
    "StatusTypeID": 50,
    "DateLastStatusUpdate": "2020-01-02T08:30:00Z",
    "DataQualityLevel": 1,
    "DateCreated": "2020-01-02T08:30:00Z",
    "SubmissionStatusTypeID": 200
}