{
    "IsRecentlyVerified": false,
    "ID": 175283,
    "UUID": "69F63387-2531-42E2-82AE-633183561DC0",
    "DataProviderID": 1,
    "OperatorID": 3253,
    "UsageTypeID": 4,
    "AddressInfo": {
        "ID": 175642,
        "Title": "ÖAMTC - St. Valentin",
        "AddressLine1": "Rasthausstraße 1",
        "Town": "St. Valentin",
        "StateOrProvince": "Lower Austria",
        "Postcode": "4300",
        "CountryID": 19,
        "Latitude": 48.19687,
        "Longitude": 14.52685,
        "DistanceUnit": 0
    },
    "Connections": [
        {
            "ID": 271830,
            "ConnectionTypeID": 33,
            "StatusTypeID": 50,
            "LevelID": 3,
            "PowerKW": 50,
            "CurrentTypeID": 30,
            "Quantity": 2
        },
        {
            "ID": 271831,
            "ConnectionTypeID": 2,
            "StatusTypeID": 50,
            "LevelID": 3,
            "PowerKW": 50,
            "CurrentTypeID": 30,
            "Quantity": 1
        },
        {
            "ID": 271832,
            "ConnectionTypeID": 25,
            "StatusTypeID": 50,
            "LevelID": 2,
            "PowerKW": 22,
            "CurrentTypeID": 20,
            "Quantity": 1
        }
    ],
    "NumberOfPoints": 3,
    "StatusTypeID": 50,
    "DateLastStatusUpdate": "2021-05-07T07:29:00Z",
    "DataQualityLevel": 1,
    "DateCreated": "2021-05-06T08:51:00Z",
    "SubmissionStatusTypeID": 200
}