{
    "IsRecentlyVerified": false,
    "ID": 106809,
    "UUID": "B2C8B8FE-B7BB-41FC-BA75-6F0E7739C321",
    "DataProviderID": 1,
    "OperatorID": 45,
    "UsageTypeID": 6,
    "AddressInfo": {
        "ID": 107155,
        "Title": "Akademie des Handwerks Schloss Raesfeld (mit E-Bike Station)",
        "AddressLine1": "Rabodoweg 1",
        "Town": "Raesfeld",
        "StateOrProvince": "Kreis Borken",
        "Postcode": "46348",
        "CountryID": 87,
        "Latitude": 51.765021415308425,
        "Longitude": 6.827107268497798,
        "AccessComments": "Nur für Gäste des Hotels / des Restaurants auf Schloss Raesfeld nach Anmeldung. Eine frei nutzbare E-Bike-Ladestation (Schukodose am Fahrradständer) ist dort auch vorhanden.",
        "RelatedURL": "https://www.akademie-des-handwerks.de/",
        "DistanceUnit": 0
    },
    "Connections": [
        {
            "ID": 150561,
            "ConnectionTypeID": 28,
            "StatusTypeID": 50,
            "LevelID": 2,
            "Amps": 16,
            "Voltage": 400,
            "PowerKW": 11,
            "CurrentTypeID": 20,
            "Quantity": 1
        },
        {
            "ID": 150562,
            "ConnectionTypeID": 28,
            "StatusTypeID": 50,
            "LevelID": 2,
            "Amps": 16,
            "Voltage": 230,
            "PowerKW": 3.7,
            "CurrentTypeID": 10,
            "Quantity": 2
        }
    ],
    "NumberOfPoints": 2,
    "StatusTypeID": 50,
    "DateLastStatusUpdate": "2018-07-02T07:44:00Z",
    "DataQualityLevel": 1,
    "DateCreated": "2018-07-02T07:44:00Z",
    "SubmissionStatusTypeID": 200
}