{
    "IsRecentlyVerified": false,
    "ID": 158281,
    "UUID": "9B63440E-1235-4AF5-A493-B055D9E844DB",
    "DataProviderID": 2,
    "DataProvidersReference": "155471",
    "OperatorID": 59,
    "UsageTypeID": 1,
    "AddressInfo": {
        "ID": 158635,
        "Title": "Greenlots - 162266",
        "AddressLine1": "16729 Cagan Oaks",
        "Town": "Clermont",
        "StateOrProvince": "FL",
        "Postcode": "34714",
        "CountryID": 2,
        "Latitude": 28.356347,
        "Longitude": -81.678559,
        "ContactTelephone1": "855-900-7584",
        "AccessComments": "24 hours daily",
        "RelatedURL": "http://greenlots.com/",
        "DistanceUnit": 0
    },
    "Connections": [
        {
            "ID": 228242,
            "ConnectionTypeID": 1,
            "LevelID": 2,
            "Amps": 16,
            "Voltage": 230,
            "PowerKW": 3.7,
            "CurrentTypeID": 10,
            "Quantity": 2
        },
        {
            "ID": 228243,
            "ConnectionTypeID": 2,
            "LevelID": 3,
            "Amps": 100,
            "Voltage": 400,
            "PowerKW": 40,
            "CurrentTypeID": 30,
            "Quantity": 1
        },
        {
            "ID": 228244,
            "ConnectionTypeID": 32,
            "LevelID": 3,
            "Amps": 100,
            "Voltage": 400,
            "PowerKW": 40,
            "CurrentTypeID": 30,
            "Quantity": 1
        }
    ],
    "StatusTypeID": 50,
    "DateLastStatusUpdate": "2020-06-26T02:52:00Z",
    "DataQualityLevel": 3,
    "DateCreated": "2020-06-26T02:52:00Z",
    "SubmissionStatusTypeID": 100
}