{
    "IsRecentlyVerified": false,
    "ID": 157613,
    "UUID": "46BD8019-51EF-4A8A-8825-DA1C07B9E182",
    "DataProviderID": 1,
    "OperatorID": 136,
    "UsageTypeID": 4,
    "UsageCost": "0,25€/kWh after 3h parking + 1€/h",
    "AddressInfo": {
        "ID": 157967,
        "Title": "Helen Hernesaaren Jäähalli",
        "AddressLine1": "Hernematalankatu 6",
        "Town": "Helsinki",
        "StateOrProvince": "Southern Finland",
        "Postcode": "00220",
        "CountryID": 79,
        "Latitude": 60.14938978987118,
        "Longitude": 24.92140272788265,
        "RelatedURL": "http://www.virta.fi",
        "DistanceUnit": 0
    },
    "Connections": [
        {
            "ID": 227094,
            "ConnectionTypeID": 25,
            "StatusTypeID": 50,
            "LevelID": 2,
            "Amps": 32,
            "Voltage": 400,
            "PowerKW": 22,
            "CurrentTypeID": 20,
            "Quantity": 1
        }
    ],
    "NumberOfPoints": 1,
    "StatusTypeID": 50,
    "DateLastStatusUpdate": "2020-06-21T20:02:00Z",
    "DataQualityLevel": 1,
    "DateCreated": "2020-06-20T15:47:00Z",
    "SubmissionStatusTypeID": 200
}