{
    "IsRecentlyVerified": false,
    "ID": 104214,
    "UUID": "F67655E2-D18E-4039-9B2C-E0AB4E4CE68F",
    "DataProviderID": 1,
    "OperatorID": 45,
    "UsageTypeID": 6,
    "AddressInfo": {
        "ID": 104560,
        "Title": " Trattoria Al Gufo Nero",
        "AddressLine1": "Via Novara, 162",
        "Town": "Ghemme",
        "StateOrProvince": "NO",
        "Postcode": "28074",
        "CountryID": 112,
        "Latitude": 45.58917535426505,
        "Longitude": 8.427656193875237,
        "ContactTelephone1": "Tel.0163 840251",
        "ContactEmail": "gufoneroghemme@tiscali.it",
        "RelatedURL": "http://gufonero.it/",
        "DistanceUnit": 0
    },
    "Connections": [
        {
            "ID": 147162,
            "ConnectionTypeID": 25,
            "StatusTypeID": 50,
            "LevelID": 2,
            "Quantity": 1
        }
    ],
    "NumberOfPoints": 1,
    "GeneralComments": "http://gufonero.it/chi-siamo/",
    "StatusTypeID": 50,
    "DateLastStatusUpdate": "2018-05-17T10:17:00Z",
    "DataQualityLevel": 1,
    "DateCreated": "2018-05-17T10:17:00Z",
    "SubmissionStatusTypeID": 200
}