{
    "IsRecentlyVerified": false,
    "ID": 157860,
    "UUID": "A57F141A-49BE-40DA-9E17-5FE997F0A3FC",
    "DataProviderID": 18,
    "DataProvidersReference": "b3377e183990b02e56a51ab3db814d2e",
    "UsageTypeID": 1,
    "AddressInfo": {
        "ID": 158214,
        "Title": "Northern Perimeter Road (Heathrow)",
        "AddressLine1": "Northern Perimeter Road (Heathrow)",
        "Town": "Longford",
        "Postcode": "TW6 2EQ",
        "CountryID": 1,
        "Latitude": 51.48021,
        "Longitude": -0.450892,
        "AccessComments": "",
        "RelatedURL": "http://www.national-charge-point-registry.uk/",
        "DistanceUnit": 0
    },
    "Connections": [
        {
            "ID": 227475,
            "ConnectionTypeID": 25,
            "Reference": "4001795",
            "StatusTypeID": 50,
            "LevelID": 2,
            "Amps": 16,
            "Voltage": 400,
            "PowerKW": 11,
            "CurrentTypeID": 20
        }
    ],
    "StatusTypeID": 0,
    "DateLastStatusUpdate": "2020-06-25T10:00:00Z",
    "MetadataValues": [
        {
            "ID": 7393,
            "MetadataFieldID": 4,
            "ItemValue": "Contains public sector information licensed under the Open Government Licence v2.0. http://www.nationalarchives.gov.uk/doc/open-government-licence/version/2/"
        }
    ],
    "DataQualityLevel": 3,
    "DateCreated": "2020-06-25T10:00:00Z",
    "SubmissionStatusTypeID": 100
}