{
    "IsRecentlyVerified": false,
    "ID": 110678,
    "UUID": "87CB4D63-633F-491D-BD29-BEAB56E4C71E",
    "DataProviderID": 2,
    "DataProvidersReference": "104212",
    "OperatorID": 5,
    "UsageTypeID": 1,
    "AddressInfo": {
        "ID": 111024,
        "Title": "TD BANK",
        "AddressLine1": "950 American Legion Hwy",
        "Town": "Boston",
        "StateOrProvince": "MA",
        "Postcode": "02131",
        "CountryID": 2,
        "Latitude": 42.2763551,
        "Longitude": -71.1143612,
        "ContactTelephone1": "888-758-4389",
        "AccessComments": "24 hours daily",
        "RelatedURL": "http://www.chargepoint.com/",
        "DistanceUnit": 0
    },
    "Connections": [
        {
            "ID": 155954,
            "ConnectionTypeID": 1,
            "LevelID": 2,
            "Amps": 16,
            "Voltage": 230,
            "PowerKW": 3.7,
            "CurrentTypeID": 10,
            "Quantity": 1
        }
    ],
    "DateLastStatusUpdate": "2020-06-26T03:05:00Z",
    "DataQualityLevel": 3,
    "DateCreated": "2018-10-18T23:36:00Z",
    "SubmissionStatusTypeID": 100
}