{
    "IsRecentlyVerified": false,
    "ID": 122155,
    "UUID": "0126756E-9EFF-40D7-B1A5-455132044C8F",
    "DataProviderID": 2,
    "DataProvidersReference": "63008",
    "OperatorID": 5,
    "UsageTypeID": 1,
    "AddressInfo": {
        "ID": 122501,
        "Title": "KILROY REALTY",
        "AddressLine1": "12233 W Olympic Blvd",
        "Town": "Los Angeles",
        "StateOrProvince": "CA",
        "Postcode": "90064",
        "CountryID": 2,
        "Latitude": 34.03224,
        "Longitude": -118.456431,
        "ContactTelephone1": "888-758-4389",
        "AccessComments": "24 hours daily",
        "RelatedURL": "http://www.chargepoint.com/",
        "DistanceUnit": 0
    },
    "Connections": [
        {
            "ID": 172022,
            "ConnectionTypeID": 1,
            "LevelID": 2,
            "Amps": 16,
            "Voltage": 230,
            "PowerKW": 3,
            "CurrentTypeID": 10,
            "Quantity": 4
        }
    ],
    "DateLastStatusUpdate": "2019-12-24T09:11:00Z",
    "DataQualityLevel": 3,
    "DateCreated": "2019-04-06T05:02:00Z",
    "SubmissionStatusTypeID": 100
}