{
    "IsRecentlyVerified": false,
    "ID": 116906,
    "UUID": "C663ADA0-8140-498B-A837-D27D9881887B",
    "DataProviderID": 1,
    "OperatorID": 3299,
    "UsageTypeID": 5,
    "UsageCost": "€8,00/session",
    "AddressInfo": {
        "ID": 117252,
        "Title": "IONITY",
        "AddressLine1": "Raststation Kaiserwald",
        "Town": "Premstätten",
        "StateOrProvince": "Graz-Umgebung",
        "Postcode": "8141",
        "CountryID": 19,
        "Latitude": 46.959972,
        "Longitude": 15.383121,
        "DistanceUnit": 0
    },
    "Connections": [
        {
            "ID": 165483,
            "ConnectionTypeID": 33,
            "StatusTypeID": 50,
            "LevelID": 3,
            "PowerKW": 350,
            "CurrentTypeID": 30,
            "Quantity": 1
        },
        {
            "ID": 165484,
            "ConnectionTypeID": 33,
            "StatusTypeID": 50,
            "LevelID": 3,
            "PowerKW": 350,
            "CurrentTypeID": 30,
            "Quantity": 1
        },
        {
            "ID": 165485,
            "ConnectionTypeID": 33,
            "StatusTypeID": 50,
            "LevelID": 3,
            "PowerKW": 350,
            "CurrentTypeID": 30,
            "Quantity": 1
        }
    ],
    "NumberOfPoints": 3,
    "StatusTypeID": 50,
    "DateLastStatusUpdate": "2020-01-09T09:25:00Z",
    "DataQualityLevel": 1,
    "DateCreated": "2019-02-13T18:31:00Z",
    "SubmissionStatusTypeID": 200
}