{
    "IsRecentlyVerified": false,
    "ID": 73978,
    "UUID": "8A8EB50A-62B9-4FB2-B785-BB49B3D3B35A",
    "DataProviderID": 1,
    "OperatorID": 89,
    "OperatorsReference": "CEA-089",
    "UsageTypeID": 4,
    "UsageCost": "CAD 2.50",
    "AddressInfo": {
        "ID": 74324,
        "Title": "Anjou-Chaumont (côté Nord)",
        "AddressLine1": "8621 Avenue Chaumont",
        "Town": "Montréal",
        "StateOrProvince": "QC",
        "Postcode": "H1K 1N3",
        "CountryID": 44,
        "Latitude": 45.610535,
        "Longitude": -73.54809,
        "DistanceUnit": 0
    },
    "Connections": [
        {
            "ID": 106292,
            "ConnectionTypeID": 1,
            "StatusTypeID": 50,
            "LevelID": 2,
            "Amps": 32,
            "Voltage": 230,
            "PowerKW": 7,
            "CurrentTypeID": 10,
            "Quantity": 1
        }
    ],
    "NumberOfPoints": 1,
    "StatusTypeID": 50,
    "DateLastStatusUpdate": "2016-11-27T17:07:00Z",
    "DataQualityLevel": 1,
    "DateCreated": "2016-11-23T23:49:00Z",
    "SubmissionStatusTypeID": 200
}