{
    "IsRecentlyVerified": false,
    "ID": 61049,
    "UUID": "21D62F84-C40C-4543-9C83-4686466328A6",
    "DataProviderID": 1,
    "OperatorID": 91,
    "UsageTypeID": 1,
    "AddressInfo": {
        "ID": 61395,
        "Title": "Fernández de los Ríos, 42",
        "AddressLine1": "Calle Fernández de los Ríos, 42",
        "Town": "Madrid",
        "StateOrProvince": "Madrid",
        "Postcode": "28015",
        "CountryID": 210,
        "Latitude": 40.43521747482015,
        "Longitude": -3.7092862635062147,
        "ContactTelephone1": "+34 902 540 810",
        "ContactEmail": "ibil@ibil.es",
        "RelatedURL": "http://www.www.ibil.es",
        "DistanceUnit": 0
    },
    "Connections": [
        {
            "ID": 77577,
            "ConnectionTypeID": 33,
            "StatusTypeID": 50,
            "LevelID": 3,
            "Amps": 210,
            "Voltage": 400,
            "PowerKW": 50,
            "CurrentTypeID": 30
        }
    ],
    "GeneralComments": "IBIL card",
    "StatusTypeID": 50,
    "DateLastStatusUpdate": "2019-11-14T23:56:00Z",
    "DataQualityLevel": 3,
    "DateCreated": "2016-02-13T00:23:00Z",
    "SubmissionStatusTypeID": 200
}