{
    "IsRecentlyVerified": false,
    "ID": 10899,
    "UUID": "3A6D49C7-CF04-43DC-98EC-A1E0DABC3F4B",
    "DataProviderID": 1,
    "DataProvidersReference": "549",
    "AddressInfo": {
        "ID": 10796,
        "Title": "Prof.Dahls gt. beboerparkering, Bergen",
        "AddressLine1": "Professor Dahls gate 32",
        "Town": "BERGEN",
        "StateOrProvince": "Vestland",
        "Postcode": "5031",
        "CountryID": 168,
        "Latitude": 60.40055,
        "Longitude": 5.32667,
        "AccessComments": "Plassene 13 og 35.",
        "DistanceUnit": 0
    },
    "Connections": [
        {
            "ID": 8884,
            "ConnectionTypeID": 0,
            "Reference": "1",
            "LevelID": 2,
            "Amps": 16,
            "Voltage": 230,
            "PowerKW": 3.7,
            "Comments": "Mode 1"
        },
        {
            "ID": 89035,
            "ConnectionTypeID": 0,
            "Reference": "2",
            "LevelID": 2,
            "Amps": 16,
            "Voltage": 230,
            "PowerKW": 3.7,
            "Comments": "Mode 1"
        }
    ],
    "NumberOfPoints": 2,
    "StatusTypeID": 0,
    "DateLastStatusUpdate": "2020-05-26T08:24:00Z",
    "DataQualityLevel": 2,
    "DateCreated": "2012-06-02T11:56:00Z",
    "SubmissionStatusTypeID": 100
}