{
    "IsRecentlyVerified": false,
    "ID": 42564,
    "UUID": "0B4737D0-E367-486D-9C8E-C9DA534B9FBA",
    "DataProviderID": 1,
    "OperatorID": 45,
    "UsageTypeID": 5,
    "UsageCost": "0",
    "AddressInfo": {
        "ID": 42910,
        "Title": "Hotel Fünf Seen Blick Edersee",
        "AddressLine1": "Kurstraße 4",
        "Town": "Edertal-Bringhausen ",
        "StateOrProvince": "Landkreis Waldeck-Frankenberg",
        "Postcode": "34549",
        "CountryID": 87,
        "Latitude": 51.169916747631,
        "Longitude": 8.9961218379593,
        "ContactTelephone1": "+49 5623 9494 0",
        "ContactEmail": "info@hotel-fuenfseenblick-edersee.de",
        "RelatedURL": "http://www.hotel-fuenfseenblick-edersee.de",
        "DistanceUnit": 0
    },
    "Connections": [
        {
            "ID": 51275,
            "ConnectionTypeID": 16,
            "StatusTypeID": 50,
            "LevelID": 2,
            "Amps": 16,
            "Voltage": 230,
            "PowerKW": 3.7,
            "CurrentTypeID": 10,
            "Quantity": 2
        }
    ],
    "NumberOfPoints": 2,
    "GeneralComments": "Für Hotelgäste kostenlos und immer verfügbar, sonst 4€ Parkgebühr. Anmeldung an der Rezeption (täglich von 8-18Uhr besetzt).",
    "StatusTypeID": 50,
    "DateLastStatusUpdate": "2015-03-16T10:37:00Z",
    "DataQualityLevel": 1,
    "DateCreated": "2015-03-16T07:53:00Z",
    "SubmissionStatusTypeID": 200
}