{
    "IsRecentlyVerified": false,
    "ID": 52602,
    "UUID": "E460C55E-8F53-4DDF-B342-3B004D83E3DE",
    "DataProviderID": 1,
    "OperatorID": 45,
    "UsageTypeID": 0,
    "AddressInfo": {
        "ID": 52948,
        "Title": "Česká inspekce životního prostředí ",
        "AddressLine1": "Na břehu 267/1a",
        "AddressLine2": "Vysočany",
        "Town": "Praha",
        "StateOrProvince": "okres Hlavní město Praha",
        "Postcode": "19000",
        "CountryID": 64,
        "Latitude": 50.1099676,
        "Longitude": 14.49610180000002,
        "ContactTelephone1": "+420 222 860 301",
        "ContactEmail": "hankova_lenka@cizp.cz",
        "AccessComments": "Po - Pá 6:00 - 18:00",
        "DistanceUnit": 0
    },
    "Connections": [
        {
            "ID": 65340,
            "ConnectionTypeID": 17,
            "StatusTypeID": 0,
            "LevelID": 2,
            "Amps": 16,
            "Voltage": 400,
            "PowerKW": 11,
            "CurrentTypeID": 20,
            "Quantity": 1
        },
        {
            "ID": 65341,
            "ConnectionTypeID": 23,
            "StatusTypeID": 0,
            "LevelID": 2,
            "Amps": 16,
            "Voltage": 230,
            "PowerKW": 3.6,
            "CurrentTypeID": 10,
            "Quantity": 1
        }
    ],
    "NumberOfPoints": 1,
    "StatusTypeID": 50,
    "DateLastStatusUpdate": "2015-09-04T09:19:00Z",
    "DataQualityLevel": 1,
    "DateCreated": "2015-09-04T09:19:00Z",
    "SubmissionStatusTypeID": 200
}