{
    "IsRecentlyVerified": false,
    "ID": 126604,
    "UUID": "466C0D94-D9A4-41F2-A2A7-D88C9C121BB5",
    "DataProviderID": 1,
    "OperatorID": 103,
    "UsageTypeID": 5,
    "UsageCost": "39p/kWh",
    "AddressInfo": {
        "ID": 126950,
        "Title": "Shell Balhaldie",
        "AddressLine1": "A9 Southbound",
        "Town": "Dunblane",
        "Postcode": "FK15 0NB",
        "CountryID": 1,
        "Latitude": 56.225366,
        "Longitude": -3.915243,
        "DistanceUnit": 0
    },
    "Connections": [
        {
            "ID": 177341,
            "ConnectionTypeID": 2,
            "StatusTypeID": 50,
            "LevelID": 3,
            "PowerKW": 50,
            "CurrentTypeID": 30,
            "Quantity": 1
        },
        {
            "ID": 177342,
            "ConnectionTypeID": 33,
            "StatusTypeID": 50,
            "LevelID": 3,
            "PowerKW": 50,
            "CurrentTypeID": 30,
            "Quantity": 1
        },
        {
            "ID": 177343,
            "ConnectionTypeID": 1036,
            "StatusTypeID": 50,
            "LevelID": 3,
            "PowerKW": 43,
            "CurrentTypeID": 20,
            "Quantity": 1
        }
    ],
    "NumberOfPoints": 1,
    "StatusTypeID": 50,
    "DateLastStatusUpdate": "2019-05-15T23:51:00Z",
    "DataQualityLevel": 1,
    "DateCreated": "2019-05-15T23:51:00Z",
    "SubmissionStatusTypeID": 200
}