{
    "IsRecentlyVerified": false,
    "ID": 136020,
    "UUID": "9073C0A0-CE53-4A7C-867C-95438B8EE90B",
    "DataProviderID": 18,
    "DataProvidersReference": "a1b17ce94ea00c187d658da2aab55d80",
    "OperatorID": 2244,
    "UsageTypeID": 5,
    "AddressInfo": {
        "ID": 136366,
        "Title": "Redcliffe Place",
        "AddressLine1": "Redcliffe Place",
        "Town": "London",
        "Postcode": "SW10 9DD",
        "CountryID": 1,
        "Latitude": 51.484162,
        "Longitude": -0.185595,
        "AccessComments": "",
        "RelatedURL": "https://www.ubitricity.com",
        "DistanceUnit": 0
    },
    "Connections": [
        {
            "ID": 190447,
            "ConnectionTypeID": 25,
            "Reference": "suby1100003096",
            "StatusTypeID": 50,
            "LevelID": 2,
            "Amps": 16,
            "Voltage": 230,
            "PowerKW": 3.7,
            "CurrentTypeID": 10
        }
    ],
    "StatusTypeID": 0,
    "DateLastStatusUpdate": "2021-04-25T05:46:00Z",
    "MetadataValues": [
        {
            "ID": 5872,
            "MetadataFieldID": 4,
            "ItemValue": "Contains public sector information licensed under the Open Government Licence v2.0. http://www.nationalarchives.gov.uk/doc/open-government-licence/version/2/"
        }
    ],
    "DataQualityLevel": 3,
    "DateCreated": "2019-12-24T05:22:00Z",
    "SubmissionStatusTypeID": 100
}