{
    "IsRecentlyVerified": false,
    "ID": 166592,
    "UUID": "198E43BD-5BB5-45F7-9398-7FA47A7DB212",
    "DataProviderID": 28,
    "DataProvidersReference": "FR*S28*PSDE28*THYM2",
    "UsageTypeID": 5,
    "AddressInfo": {
        "ID": 166951,
        "Title": "Châteauneuf-en-Thymerais | Rue Maurice Viollette 23",
        "AddressLine1": "23 Rue Maurice Viollette 28170 Châteauneuf-en-Thymerais",
        "CountryID": 80,
        "Latitude": 48.58158,
        "Longitude": 1.242375,
        "AccessComments": "24/24 7/7",
        "DistanceUnit": 0
    },
    "Connections": [
        {
            "ID": 249771,
            "ConnectionTypeID": 1036,
            "StatusTypeID": 50,
            "LevelID": 2,
            "PowerKW": 22,
            "CurrentTypeID": 20
        },
        {
            "ID": 249772,
            "ConnectionTypeID": 26,
            "StatusTypeID": 50,
            "LevelID": 2,
            "PowerKW": 22
        },
        {
            "ID": 249773,
            "ConnectionTypeID": 28,
            "StatusTypeID": 50,
            "LevelID": 2,
            "PowerKW": 22,
            "CurrentTypeID": 10
        }
    ],
    "GeneralComments": "",
    "StatusTypeID": 50,
    "DateLastStatusUpdate": "2020-08-27T05:15:00Z",
    "DataQualityLevel": 2,
    "DateCreated": "2020-08-27T05:15:00Z",
    "SubmissionStatusTypeID": 100
}