{
    "IsRecentlyVerified": false,
    "ID": 68053,
    "UUID": "88A8E2A0-3CA4-4783-9844-D39DF60EE3A7",
    "DataProviderID": 26,
    "DataProvidersReference": "90803",
    "OperatorID": 177,
    "OperatorsReference": "Nuon EVB-P1548437",
    "UsageCost": "0.00 jaarabonnement",
    "AddressInfo": {
        "ID": 68399,
        "Title": "Aziëlaan",
        "AddressLine1": "Aziëlaan",
        "Town": "Utrecht",
        "Postcode": "3526 KG",
        "CountryID": 159,
        "Latitude": 52.066401,
        "Longitude": 5.104642,
        "RelatedURL": "http://www.nuon.nl/ev",
        "DistanceUnit": 0
    },
    "Connections": [
        {
            "ID": 94758,
            "ConnectionTypeID": 25,
            "LevelID": 2,
            "PowerKW": 11,
            "CurrentTypeID": 10
        },
        {
            "ID": 94759,
            "ConnectionTypeID": 25,
            "LevelID": 2,
            "PowerKW": 11,
            "CurrentTypeID": 10
        }
    ],
    "NumberOfPoints": 1,
    "StatusTypeID": 50,
    "DateLastStatusUpdate": "2016-06-04T02:37:00Z",
    "DataQualityLevel": 3,
    "DateCreated": "2016-06-04T02:37:00Z",
    "SubmissionStatusTypeID": 100
}