{
    "IsRecentlyVerified": false,
    "ID": 56710,
    "UUID": "74592DA6-E22B-42FB-8556-61F6105E701D",
    "DataProviderID": 1,
    "DataProvidersReference": "3052",
    "AddressInfo": {
        "ID": 57056,
        "Title": "FEV Nybroparkeringen",
        "AddressLine1": "Nybrogatan 42",
        "Town": "FALUN",
        "StateOrProvince": "DALARNA",
        "Postcode": "79173",
        "CountryID": 216,
        "Latitude": 60.60711,
        "Longitude": 15.61904,
        "AccessComments": "4 platser på Nybroparkeringen, första raden till vänster. Längst upp mot återvinningsstationen.",
        "DistanceUnit": 0
    },
    "Connections": [
        {
            "ID": 71509,
            "ConnectionTypeID": 0,
            "Reference": "1",
            "LevelID": 2,
            "Amps": 16,
            "Voltage": 400,
            "PowerKW": 11,
            "Comments": "Mode 3"
        },
        {
            "ID": 87016,
            "ConnectionTypeID": 0,
            "Reference": "2",
            "LevelID": 2,
            "Amps": 16,
            "Voltage": 400,
            "PowerKW": 11,
            "Comments": "Mode 3"
        },
        {
            "ID": 87017,
            "ConnectionTypeID": 0,
            "Reference": "3",
            "LevelID": 2,
            "Amps": 16,
            "Voltage": 400,
            "PowerKW": 11,
            "Comments": "Mode 3"
        },
        {
            "ID": 89090,
            "ConnectionTypeID": 0,
            "Reference": "4",
            "LevelID": 2,
            "Amps": 16,
            "Voltage": 400,
            "PowerKW": 11,
            "Comments": "Mode 3"
        }
    ],
    "NumberOfPoints": 4,
    "DateLastStatusUpdate": "2020-05-26T08:24:00Z",
    "DataQualityLevel": 2,
    "DateCreated": "2015-11-06T03:39:00Z",
    "SubmissionStatusTypeID": 100
}