{
    "IsRecentlyVerified": false,
    "ID": 113410,
    "UUID": "776DC9B3-F6AD-4CB6-8BD9-3600EA28BCEF",
    "DataProviderID": 1,
    "OperatorID": 22,
    "OperatorsReference": "C59B6",
    "UsageTypeID": 4,
    "AddressInfo": {
        "ID": 113756,
        "Title": "Circle K / Topaz Service Station",
        "AddressLine1": "Circle K / Topaz Service Station",
        "CountryID": 3,
        "Latitude": 52.6716,
        "Longitude": -8.63531,
        "DistanceUnit": 0
    },
    "Connections": [
        {
            "ID": 159755,
            "ConnectionTypeID": 2,
            "StatusTypeID": 50,
            "LevelID": 3,
            "PowerKW": 50,
            "CurrentTypeID": 30,
            "Quantity": 1
        },
        {
            "ID": 159756,
            "ConnectionTypeID": 33,
            "StatusTypeID": 50,
            "LevelID": 3,
            "PowerKW": 50,
            "CurrentTypeID": 30,
            "Quantity": 1
        }
    ],
    "NumberOfPoints": 1,
    "StatusTypeID": 50,
    "DateLastStatusUpdate": "2019-06-03T09:46:00Z",
    "DataQualityLevel": 1,
    "DateCreated": "2018-12-11T06:21:00Z",
    "SubmissionStatusTypeID": 200
}