{
    "IsRecentlyVerified": false,
    "ID": 89448,
    "UUID": "C4441108-4101-4483-8D09-98243D4ADBD5",
    "DataProviderID": 2,
    "DataProvidersReference": "81497",
    "OperatorID": 5,
    "UsageTypeID": 1,
    "AddressInfo": {
        "ID": 89794,
        "Title": "ESSEX",
        "AddressLine1": "4234 Hacienda Dr",
        "Town": "Pleasanton",
        "StateOrProvince": "CA",
        "Postcode": "94588",
        "CountryID": 2,
        "Latitude": 37.689339,
        "Longitude": -121.89482,
        "ContactTelephone1": "888-758-4389",
        "AccessComments": "24 hours daily",
        "RelatedURL": "http://www.chargepoint.com/",
        "DistanceUnit": 0
    },
    "Connections": [
        {
            "ID": 126844,
            "ConnectionTypeID": 1,
            "LevelID": 2,
            "Amps": 16,
            "Voltage": 230,
            "PowerKW": 3,
            "CurrentTypeID": 10,
            "Quantity": 5
        }
    ],
    "DateLastStatusUpdate": "2019-04-06T04:02:00Z",
    "DataQualityLevel": 3,
    "DateCreated": "2017-06-22T08:16:00Z",
    "SubmissionStatusTypeID": 100
}