{
    "IsRecentlyVerified": false,
    "ID": 124062,
    "UUID": "D2400E4E-6EC0-41D8-8BDC-3B3F5EBBE4D9",
    "DataProviderID": 2,
    "DataProvidersReference": "63333",
    "OperatorID": 5,
    "UsageTypeID": 1,
    "AddressInfo": {
        "ID": 124408,
        "Title": "BRISBANE MARINA",
        "AddressLine1": "400 Sierra Point Pkwy",
        "Town": "Brisbane",
        "StateOrProvince": "CA",
        "Postcode": "94005",
        "CountryID": 2,
        "Latitude": 37.6733629,
        "Longitude": -122.3816357,
        "ContactTelephone1": "888-758-4389",
        "AccessComments": "24 hours daily",
        "RelatedURL": "http://www.chargepoint.com/",
        "DistanceUnit": 0
    },
    "Connections": [
        {
            "ID": 174110,
            "ConnectionTypeID": 1,
            "LevelID": 2,
            "Amps": 16,
            "Voltage": 230,
            "PowerKW": 3,
            "CurrentTypeID": 10,
            "Quantity": 2
        }
    ],
    "DateLastStatusUpdate": "2019-12-24T09:14:00Z",
    "DataQualityLevel": 3,
    "DateCreated": "2019-04-06T05:03:00Z",
    "SubmissionStatusTypeID": 100
}