{
    "IsRecentlyVerified": false,
    "ID": 141243,
    "UUID": "567D1A8D-687E-4F29-A4B8-4553B449BE57",
    "DataProviderID": 2,
    "DataProvidersReference": "147330",
    "OperatorID": 9,
    "UsageTypeID": 1,
    "AddressInfo": {
        "ID": 141595,
        "Title": "McDonald's #37948 - Sunrise Blvd",
        "AddressLine1": "5402 Sunrise Boulevard",
        "Town": "Citrus Heights",
        "StateOrProvince": "CA",
        "Postcode": "95610",
        "CountryID": 2,
        "Latitude": 38.6646,
        "Longitude": -121.272229,
        "ContactTelephone1": "888-998-2546",
        "AccessComments": "MON: 24 hours | TUE: 24 hours | WED: 24 hours | THU: 24 hours | FRI: 24 hours | SAT: 24 hours | SUN: 24 hours",
        "RelatedURL": "http://www.blinkcharging.com/",
        "DistanceUnit": 0
    },
    "Connections": [
        {
            "ID": 197124,
            "ConnectionTypeID": 1,
            "LevelID": 2,
            "Amps": 16,
            "Voltage": 230,
            "PowerKW": 3.7,
            "CurrentTypeID": 10,
            "Quantity": 1
        }
    ],
    "StatusTypeID": 50,
    "DateLastStatusUpdate": "2020-06-26T03:00:00Z",
    "DataQualityLevel": 3,
    "DateCreated": "2019-12-24T09:15:00Z",
    "SubmissionStatusTypeID": 100
}