{
    "IsRecentlyVerified": false,
    "ID": 179003,
    "UUID": "776B9C51-5327-4F37-AA48-09D5631CA1D8",
    "DataProviderID": 29,
    "DataProvidersReference": "3207",
    "AddressInfo": {
        "ID": 179362,
        "Title": "Spitalgasse 4",
        "AddressLine1": "Spitalgasse 4",
        "Town": "Schelklingen",
        "Postcode": "89601",
        "CountryID": 87,
        "Latitude": 48.37562,
        "Longitude": 9.73393,
        "DistanceUnit": 0
    },
    "Connections": [
        {
            "ID": 280196,
            "ConnectionTypeID": 1036,
            "StatusTypeID": 50,
            "LevelID": 3,
            "PowerKW": 43,
            "CurrentTypeID": 20
        },
        {
            "ID": 280197,
            "ConnectionTypeID": 33,
            "StatusTypeID": 50,
            "LevelID": 3,
            "PowerKW": 50,
            "CurrentTypeID": 30
        },
        {
            "ID": 295767,
            "ConnectionTypeID": 2,
            "StatusTypeID": 50,
            "LevelID": 3,
            "PowerKW": 50,
            "CurrentTypeID": 30
        }
    ],
    "StatusTypeID": 50,
    "DateLastStatusUpdate": "2021-07-12T02:41:00Z",
    "MetadataValues": [
        {
            "ID": 11297,
            "MetadataFieldID": 4,
            "ItemValue": "Data from the German chargepoint registry provided by Bundesnetzagentur.de under the CC-BY 4.0 license"
        }
    ],
    "DataQualityLevel": 3,
    "DateCreated": "2021-07-08T09:59:00Z",
    "SubmissionStatusTypeID": 100
}