{
    "IsRecentlyVerified": false,
    "ID": 107498,
    "UUID": "68D8F144-39C3-4E80-9346-4A2BEA430284",
    "DataProviderID": 1,
    "OperatorID": 3291,
    "UsageTypeID": 4,
    "AddressInfo": {
        "ID": 107844,
        "Title": " Bar Ristorante Conca D'Oro - Dal Baffo",
        "AddressLine1": "Località Fondo Grande, 160",
        "Town": "Folgaria",
        "StateOrProvince": "TN",
        "Postcode": "38064",
        "CountryID": 112,
        "Latitude": 45.89256572115224,
        "Longitude": 11.191774874232806,
        "ContactTelephone1": " +390464721323",
        "ContactEmail": "f.gerola@virgilio.it",
        "RelatedURL": "https://www.facebook.com/La-Conca-DOro-Dal-Baffo-1863441890649928/",
        "DistanceUnit": 0
    },
    "Connections": [
        {
            "ID": 151663,
            "ConnectionTypeID": 25,
            "StatusTypeID": 50,
            "LevelID": 2,
            "Amps": 32,
            "Voltage": 240,
            "PowerKW": 7,
            "CurrentTypeID": 10,
            "Quantity": 2
        }
    ],
    "NumberOfPoints": 2,
    "GeneralComments": "Per utilizzare la colonnina è necessaria la APP evway.\r\n",
    "StatusTypeID": 50,
    "DateLastStatusUpdate": "2018-07-30T12:38:00Z",
    "DataQualityLevel": 1,
    "DateCreated": "2018-07-30T12:38:00Z",
    "SubmissionStatusTypeID": 200
}