{
    "IsRecentlyVerified": false,
    "ID": 112077,
    "UUID": "91A6DA0A-CBA1-42D4-BEB2-01319258547E",
    "DataProviderID": 2,
    "DataProvidersReference": "83118",
    "UsageTypeID": 1,
    "AddressInfo": {
        "ID": 112423,
        "Title": "IKEA",
        "AddressLine1": "500 Sterling Lyon Pkwy",
        "Town": "Winnipeg",
        "StateOrProvince": "MB",
        "Postcode": "R3P 1E7",
        "CountryID": 44,
        "Latitude": 49.8415,
        "Longitude": -97.209875,
        "ContactTelephone1": "204-475-4532",
        "AccessComments": "24 hours daily",
        "RelatedURL": "",
        "DistanceUnit": 0
    },
    "Connections": [
        {
            "ID": 157619,
            "ConnectionTypeID": 1,
            "LevelID": 2,
            "Amps": 16,
            "Voltage": 230,
            "PowerKW": 3.7,
            "CurrentTypeID": 10,
            "Quantity": 2
        }
    ],
    "DateLastStatusUpdate": "2020-06-26T03:12:00Z",
    "DataQualityLevel": 3,
    "DateCreated": "2018-10-18T23:37:00Z",
    "SubmissionStatusTypeID": 100
}