{
    "IsRecentlyVerified": false,
    "ID": 145015,
    "UUID": "AB9A8162-3B13-47D3-8740-32CCBD5125BF",
    "DataProviderID": 2,
    "DataProvidersReference": "124131",
    "OperatorID": 5,
    "UsageTypeID": 1,
    "AddressInfo": {
        "ID": 145367,
        "Title": "SYDNEY MITSUBIS",
        "AddressLine1": "104 Disco St",
        "Town": "Sydney",
        "StateOrProvince": "NS",
        "Postcode": "B1P 6Y6",
        "CountryID": 44,
        "Latitude": 46.141507,
        "Longitude": -60.17818,
        "ContactTelephone1": "888-758-4389",
        "AccessComments": "24 hours daily",
        "RelatedURL": "http://www.chargepoint.com/",
        "DistanceUnit": 0
    },
    "Connections": [
        {
            "ID": 201592,
            "ConnectionTypeID": 1,
            "LevelID": 2,
            "Amps": 16,
            "Voltage": 230,
            "PowerKW": 3.7,
            "CurrentTypeID": 10,
            "Quantity": 2
        }
    ],
    "StatusTypeID": 50,
    "DateLastStatusUpdate": "2020-06-26T03:10:00Z",
    "DataQualityLevel": 3,
    "DateCreated": "2019-12-24T09:24:00Z",
    "SubmissionStatusTypeID": 100
}