{
    "IsRecentlyVerified": false,
    "ID": 112838,
    "UUID": "25333EB2-544E-4D98-B465-B52AEACFB3A2",
    "DataProviderID": 1,
    "OperatorID": 3266,
    "UsageTypeID": 4,
    "AddressInfo": {
        "ID": 113184,
        "Title": "Leibniz Universität",
        "AddressLine1": "Welfengarten 1",
        "AddressLine2": "Nordstadt",
        "Town": "Hannover",
        "StateOrProvince": "Region Hannover",
        "Postcode": "30167",
        "CountryID": 87,
        "Latitude": 52.38111163591338,
        "Longitude": 9.71913481310572,
        "AccessComments": "24/7 zugängliche Ladestation auf dem Parkplatz zwischen dem Hauptgebäude der Leibniz Universität Hannover und der Technischen Informationsbibliothek",
        "DistanceUnit": 0
    },
    "Connections": [
        {
            "ID": 158915,
            "ConnectionTypeID": 25,
            "StatusTypeID": 50,
            "LevelID": 2,
            "Amps": 32,
            "Voltage": 400,
            "PowerKW": 22,
            "CurrentTypeID": 20,
            "Quantity": 2
        }
    ],
    "NumberOfPoints": 2,
    "StatusTypeID": 50,
    "DateLastStatusUpdate": "2018-11-20T13:43:00Z",
    "DataQualityLevel": 1,
    "DateCreated": "2018-11-20T13:43:00Z",
    "SubmissionStatusTypeID": 200
}