{
    "IsRecentlyVerified": false,
    "ID": 63379,
    "UUID": "BFAE030A-2194-4D9F-B326-AFFC3998DED0",
    "DataProviderID": 26,
    "DataProvidersReference": "76165",
    "OperatorID": 73,
    "OperatorsReference": "EV-Box EVB-P1427034",
    "UsageCost": "0.00 jaarabonnement",
    "AddressInfo": {
        "ID": 63725,
        "Title": "Oudzoom 78",
        "AddressLine1": "Oudzoom 78",
        "Town": "Lansingerland",
        "Postcode": "2662 HG",
        "CountryID": 159,
        "Latitude": 51.99683,
        "Longitude": 4.49314,
        "RelatedURL": "http://www.ev-box.nl",
        "DistanceUnit": 0
    },
    "Connections": [
        {
            "ID": 80797,
            "ConnectionTypeID": 25,
            "LevelID": 2,
            "PowerKW": 5,
            "CurrentTypeID": 10
        }
    ],
    "NumberOfPoints": 1,
    "StatusTypeID": 50,
    "DateLastStatusUpdate": "2016-04-27T09:44:00Z",
    "DataQualityLevel": 3,
    "DateCreated": "2016-03-03T12:30:00Z",
    "SubmissionStatusTypeID": 100
}