{
    "IsRecentlyVerified": false,
    "ID": 165312,
    "UUID": "5A76653C-3D21-4EDC-84D0-DA3C61426B4C",
    "DataProviderID": 28,
    "DataProvidersReference": "FR*S64*PMB64*81",
    "OperatorID": 3407,
    "UsageTypeID": 5,
    "AddressInfo": {
        "ID": 165671,
        "Title": "MONTAUT - Rue Des Annettes",
        "AddressLine1": "Rue Des Annettes 64800 MONTAUT",
        "CountryID": 80,
        "Latitude": 43.125578,
        "Longitude": -0.199239,
        "AccessComments": "24h/24 7j/7",
        "DistanceUnit": 0
    },
    "Connections": [
        {
            "ID": 237544,
            "ConnectionTypeID": 25,
            "StatusTypeID": 50,
            "LevelID": 2,
            "PowerKW": 18,
            "CurrentTypeID": 20
        },
        {
            "ID": 237545,
            "ConnectionTypeID": 28,
            "StatusTypeID": 50,
            "LevelID": 2,
            "PowerKW": 18,
            "CurrentTypeID": 10
        },
        {
            "ID": 237546,
            "ConnectionTypeID": 25,
            "StatusTypeID": 50,
            "LevelID": 2,
            "PowerKW": 18,
            "CurrentTypeID": 20
        },
        {
            "ID": 237547,
            "ConnectionTypeID": 28,
            "StatusTypeID": 50,
            "LevelID": 2,
            "PowerKW": 18,
            "CurrentTypeID": 10
        }
    ],
    "GeneralComments": "Recharge par badge et avec une application smartphone",
    "StatusTypeID": 50,
    "DateLastStatusUpdate": "2020-08-27T05:10:00Z",
    "DataQualityLevel": 2,
    "DateCreated": "2020-08-27T05:10:00Z",
    "SubmissionStatusTypeID": 100
}