{
    "IsRecentlyVerified": false,
    "ID": 26972,
    "UUID": "27E9EBAE-7A7A-4B1D-AD59-347A32EA239F",
    "DataProviderID": 2,
    "DataProvidersReference": "63290",
    "OperatorID": 5,
    "UsageTypeID": 1,
    "AddressInfo": {
        "ID": 27318,
        "Title": "COVINA EV",
        "AddressLine1": "124 E College St",
        "Town": "Covina",
        "StateOrProvince": "CA",
        "Postcode": "91723",
        "CountryID": 2,
        "Latitude": 34.0871867,
        "Longitude": -117.8893966,
        "ContactTelephone1": "888-758-4389",
        "AccessComments": "24 hours daily",
        "RelatedURL": "http://www.chargepoint.com/",
        "DistanceUnit": 0
    },
    "Connections": [
        {
            "ID": 29535,
            "ConnectionTypeID": 1,
            "LevelID": 2,
            "Amps": 16,
            "Voltage": 230,
            "PowerKW": 3,
            "CurrentTypeID": 10,
            "Quantity": 2
        }
    ],
    "DateLastStatusUpdate": "2019-04-06T04:01:00Z",
    "DataQualityLevel": 3,
    "DateCreated": "2014-11-28T03:37:00Z",
    "SubmissionStatusTypeID": 100
}