{
    "IsRecentlyVerified": false,
    "ID": 88041,
    "UUID": "9F06BD7D-7546-4202-A6FF-D15764A4DEF3",
    "DataProviderID": 1,
    "OperatorID": 23,
    "OperatorsReference": "29622",
    "UsageTypeID": 6,
    "AddressInfo": {
        "ID": 88387,
        "Title": "Arlberg1800 Resort",
        "AddressLine1": "1 St. Christoph 1",
        "Town": "St. Anton am Arlberg",
        "Postcode": "6580",
        "CountryID": 19,
        "Latitude": 47.127317,
        "Longitude": 10.21365,
        "ContactTelephone1": "+43 6646 113151",
        "DistanceUnit": 0
    },
    "Connections": [
        {
            "ID": 124894,
            "ConnectionTypeID": 30,
            "StatusTypeID": 50,
            "LevelID": 2,
            "Amps": 32,
            "Voltage": 400,
            "PowerKW": 22,
            "CurrentTypeID": 20,
            "Quantity": 2
        }
    ],
    "NumberOfPoints": 2,
    "GeneralComments": "2 Tesla Connectors, up to 22kW.Available for patrons only. Please see front desk.",
    "StatusTypeID": 50,
    "DateLastStatusUpdate": "2018-10-03T14:10:00Z",
    "DataQualityLevel": 1,
    "DateCreated": "2017-05-20T05:34:00Z",
    "SubmissionStatusTypeID": 200
}