{
    "IsRecentlyVerified": false,
    "ID": 23266,
    "UUID": "E25EC235-23E0-402C-A05E-BDCCA234BB9E",
    "DataProviderID": 1,
    "OperatorID": 62,
    "UsageTypeID": 4,
    "AddressInfo": {
        "ID": 23611,
        "Title": "Auchan LOUVROIL",
        "AddressLine1": "Rue de l'Espérance",
        "Town": "Louvroil",
        "StateOrProvince": "Avesnes-sur-Helpe",
        "Postcode": "59720",
        "CountryID": 80,
        "Latitude": 50.2559181434954,
        "Longitude": 3.93757156549099,
        "ContactTelephone1": "03.27.53.81.00 ",
        "RelatedURL": "http://www.auchan.fr/magasins/louvroil/10/informations-pratiques/",
        "DistanceUnit": 0
    },
    "Connections": [
        {
            "ID": 25095,
            "ConnectionTypeID": 2,
            "LevelID": 3,
            "CurrentTypeID": 30,
            "Quantity": 1
        },
        {
            "ID": 25096,
            "ConnectionTypeID": 25,
            "LevelID": 3,
            "CurrentTypeID": 20,
            "Quantity": 1
        }
    ],
    "NumberOfPoints": 1,
    "StatusTypeID": 150,
    "DateLastStatusUpdate": "2014-09-25T13:05:00Z",
    "DataQualityLevel": 1,
    "DateCreated": "2014-05-09T16:15:00Z",
    "SubmissionStatusTypeID": 200
}