{
    "UserComments": [
        {
            "ID": 22091,
            "ChargePointID": 148397,
            "CommentTypeID": 10,
            "UserName": "ForumElettrico.it",
            "RelatedURL": "https://www.forumelettrico.it/forum/colonnina-2x22-kw-credit-agricole-via-la-spezia-138-a-parma-t8464.html",
            "DateCreated": "2020-02-01T13:07:12.21Z",
            "User": {
                "ID": 11749,
                "Username": "ForumElettrico.it"
            },
            "CheckinStatusTypeID": 10,
            "IsActionedByEditor": false
        }
    ],
    "MediaItems": [
        {
            "ID": 21113,
            "ChargePointID": 148397,
            "ItemURL": "https://s3-ap-southeast-2.amazonaws.com/openchargemap/images/IT/OCM148397/OCM-148397.orig.2020020113073039.jpg",
            "ItemThumbnailURL": "https://s3-ap-southeast-2.amazonaws.com/openchargemap/images/IT/OCM148397/OCM-148397.thmb.2020020113073039.jpg",
            "Comment": "",
            "IsEnabled": true,
            "IsVideo": false,
            "IsFeaturedItem": false,
            "IsExternalResource": false,
            "User": {
                "ID": 11749,
                "Username": "ForumElettrico.it"
            },
            "DateCreated": "2020-02-01T13:08:00Z"
        },
        {
            "ID": 21114,
            "ChargePointID": 148397,
            "ItemURL": "https://s3-ap-southeast-2.amazonaws.com/openchargemap/images/IT/OCM148397/OCM-148397.orig.2020020113073804.jpg",
            "ItemThumbnailURL": "https://s3-ap-southeast-2.amazonaws.com/openchargemap/images/IT/OCM148397/OCM-148397.thmb.2020020113073804.jpg",
            "Comment": "",
            "IsEnabled": true,
            "IsVideo": false,
            "IsFeaturedItem": false,
            "IsExternalResource": false,
            "User": {
                "ID": 11749,
                "Username": "ForumElettrico.it"
            },
            "DateCreated": "2020-02-01T13:08:00Z"
        },
        {
            "ID": 21115,
            "ChargePointID": 148397,
            "ItemURL": "https://s3-ap-southeast-2.amazonaws.com/openchargemap/images/IT/OCM148397/OCM-148397.orig.2020020113074621.jpg",
            "ItemThumbnailURL": "https://s3-ap-southeast-2.amazonaws.com/openchargemap/images/IT/OCM148397/OCM-148397.thmb.2020020113074621.jpg",
            "Comment": "",
            "IsEnabled": true,
            "IsVideo": false,
            "IsFeaturedItem": false,
            "IsExternalResource": false,
            "User": {
                "ID": 11749,
                "Username": "ForumElettrico.it"
            },
            "DateCreated": "2020-02-01T13:08:00Z"
        },
        {
            "ID": 21112,
            "ChargePointID": 148397,
            "ItemURL": "https://s3-ap-southeast-2.amazonaws.com/openchargemap/images/IT/OCM148397/OCM-148397.orig.2020020113072344.jpg",
            "ItemThumbnailURL": "https://s3-ap-southeast-2.amazonaws.com/openchargemap/images/IT/OCM148397/OCM-148397.thmb.2020020113072344.jpg",
            "Comment": "",
            "IsEnabled": true,
            "IsVideo": false,
            "IsFeaturedItem": false,
            "IsExternalResource": false,
            "User": {
                "ID": 11749,
                "Username": "ForumElettrico.it"
            },
            "DateCreated": "2020-02-01T13:07:00Z"
        }
    ],
    "IsRecentlyVerified": false,
    "ID": 148397,
    "UUID": "19EE9D22-9A5B-4F99-B4CA-FE56908DC8E9",
    "DataProviderID": 1,
    "OperatorID": 3282,
    "UsageTypeID": 1,
    "AddressInfo": {
        "ID": 148749,
        "Title": "Emobitaly Crédit Agricole Green Life",
        "AddressLine1": "Via la Spezia 138/A",
        "Town": "Parma",
        "StateOrProvince": "PR",
        "CountryID": 112,
        "Latitude": 44.785613,
        "Longitude": 10.296442,
        "RelatedURL": "https://www.forumelettrico.it/forum/colonnina-2x22-kw-credit-agricole-via-la-spezia-138-a-parma-t8464.html",
        "DistanceUnit": 0
    },
    "Connections": [
        {
            "ID": 206024,
            "ConnectionTypeID": 25,
            "LevelID": 2,
            "PowerKW": 22,
            "Quantity": 2
        }
    ],
    "NumberOfPoints": 1,
    "StatusTypeID": 50,
    "DateLastStatusUpdate": "2020-02-01T13:08:00Z",
    "DataQualityLevel": 1,
    "DateCreated": "2020-02-01T13:07:00Z",
    "SubmissionStatusTypeID": 200
}