{
    "IsRecentlyVerified": false,
    "ID": 84550,
    "UUID": "201F8F56-15FB-48AA-A406-9D96414B2D62",
    "DataProviderID": 1,
    "OperatorID": 23,
    "OperatorsReference": "25363",
    "UsageTypeID": 4,
    "AddressInfo": {
        "ID": 84896,
        "Title": "Golden Ball Boardinghouse",
        "AddressLine1": "45 Karl-Hammerschmidt-Str.",
        "Town": "Aschheim-Dornach",
        "Postcode": "85609",
        "CountryID": 87,
        "Latitude": 48.150085,
        "Longitude": 11.682085,
        "ContactTelephone1": "+49 89 90777636",
        "DistanceUnit": 0
    },
    "Connections": [
        {
            "ID": 120108,
            "ConnectionTypeID": 30,
            "StatusTypeID": 50,
            "LevelID": 2,
            "Amps": 32,
            "Voltage": 400,
            "PowerKW": 22,
            "CurrentTypeID": 20,
            "Quantity": 2
        }
    ],
    "NumberOfPoints": 2,
    "GeneralComments": "2 Tesla Connectors, up to 22kW.Available for customers. Please see front desk.",
    "StatusTypeID": 50,
    "DateLastStatusUpdate": "2018-10-03T19:16:00Z",
    "DataQualityLevel": 1,
    "DateCreated": "2017-03-03T06:38:00Z",
    "SubmissionStatusTypeID": 200
}