{
    "MediaItems": [
        {
            "ID": 13801,
            "ChargePointID": 94892,
            "ItemURL": "https://s3-ap-southeast-2.amazonaws.com/openchargemap/images/SE/OCM94892/OCM-94892.orig.2017121620192778.jpg",
            "ItemThumbnailURL": "https://s3-ap-southeast-2.amazonaws.com/openchargemap/images/SE/OCM94892/OCM-94892.thmb.2017121620192778.jpg",
            "Comment": "",
            "IsEnabled": true,
            "IsVideo": false,
            "IsFeaturedItem": false,
            "IsExternalResource": false,
            "User": {
                "ID": 15931,
                "Username": "Stefan"
            },
            "DateCreated": "2017-12-16T20:20:00Z"
        }
    ],
    "IsRecentlyVerified": false,
    "ID": 94892,
    "UUID": "832EDAD4-8EF1-4934-A4C4-46F25E59E235",
    "DataProviderID": 1,
    "DataProvidersReference": "4299",
    "AddressInfo": {
        "ID": 95238,
        "Title": "Fortum McD Ulricehamn",
        "AddressLine1": "Vist Kyrkvägen 3",
        "Town": "ULRICEHAMN",
        "StateOrProvince": "VÄSTRA GÖTALAND",
        "Postcode": "52337",
        "CountryID": 216,
        "Latitude": 57.8122,
        "Longitude": 13.41923,
        "AccessComments": "Laddstation på McDonalds parkering i Ulricehamn.",
        "DistanceUnit": 0
    },
    "Connections": [
        {
            "ID": 134180,
            "ConnectionTypeID": 0,
            "Reference": "1",
            "LevelID": 2,
            "Amps": 100,
            "Voltage": 500,
            "PowerKW": 50,
            "Comments": "Mode 4"
        },
        {
            "ID": 134181,
            "ConnectionTypeID": 0,
            "Reference": "2",
            "LevelID": 2,
            "Amps": 100,
            "Voltage": 500,
            "PowerKW": 50,
            "Comments": "Mode 4"
        }
    ],
    "NumberOfPoints": 2,
    "DateLastStatusUpdate": "2020-05-26T08:21:00Z",
    "DataQualityLevel": 2,
    "DateCreated": "2017-10-28T13:36:00Z",
    "SubmissionStatusTypeID": 100
}