{
    "IsRecentlyVerified": false,
    "ID": 73622,
    "UUID": "8B07442B-4AB8-44CC-AA33-2086D94A2503",
    "DataProviderID": 1,
    "OperatorID": 89,
    "OperatorsReference": "CEA-243",
    "UsageTypeID": 4,
    "UsageCost": "CAD 2.50",
    "AddressInfo": {
        "ID": 73968,
        "Title": "Bentall Kennedy-Tour KPMG",
        "AddressLine1": "600 Boulevard de Maisonneuve Ouest",
        "Town": "Montréal",
        "StateOrProvince": "QC",
        "Postcode": "H3A 0A3",
        "CountryID": 44,
        "Latitude": 45.504524,
        "Longitude": -73.5705,
        "DistanceUnit": 0
    },
    "Connections": [
        {
            "ID": 105917,
            "ConnectionTypeID": 1,
            "StatusTypeID": 50,
            "LevelID": 2,
            "Amps": 32,
            "Voltage": 230,
            "PowerKW": 7,
            "CurrentTypeID": 10,
            "Quantity": 1
        }
    ],
    "NumberOfPoints": 1,
    "StatusTypeID": 50,
    "DateLastStatusUpdate": "2017-01-24T09:37:00Z",
    "DataQualityLevel": 1,
    "DateCreated": "2016-11-23T22:27:00Z",
    "SubmissionStatusTypeID": 200
}