{
    "IsRecentlyVerified": false,
    "ID": 162294,
    "UUID": "B1573FEA-4D21-4C14-9BDC-56EEB45C8C68",
    "DataProviderID": 1,
    "OperatorID": 23,
    "OperatorsReference": "53858",
    "UsageTypeID": 4,
    "AddressInfo": {
        "ID": 162651,
        "Title": "Ramada Resort Kranjska Gora",
        "AddressLine1": "Borovška Cesta 99",
        "Town": "Kranjska Gora",
        "Postcode": "4280",
        "CountryID": 205,
        "Latitude": 46.48462406,
        "Longitude": 13.78046406,
        "ContactTelephone1": "+386 4 5884100",
        "DistanceUnit": 0
    },
    "Connections": [
        {
            "ID": 233592,
            "ConnectionTypeID": 30,
            "StatusTypeID": 50,
            "LevelID": 2,
            "PowerKW": 22,
            "CurrentTypeID": 20,
            "Quantity": 2
        }
    ],
    "NumberOfPoints": 2,
    "GeneralComments": "2 Tesla Connector, up to 22kW.Available for customers. Please see front desk.",
    "StatusTypeID": 50,
    "DateLastStatusUpdate": "2020-08-05T05:30:00Z",
    "DataQualityLevel": 1,
    "DateCreated": "2020-08-05T05:30:00Z",
    "SubmissionStatusTypeID": 200
}