{
    "IsRecentlyVerified": false,
    "ID": 17472,
    "UUID": "198E1C8B-6EA9-45AF-893B-7D647061C982",
    "DataProviderID": 22,
    "DataProvidersReference": "228A37C4A96D1CDC1659B9E2BF4B0000",
    "AddressInfo": {
        "ID": 17817,
        "Title": "愛媛日産自動車アミックス宇和島",
        "AddressLine1": "愛媛県宇和島市和霊町1232-1",
        "CountryID": 114,
        "Latitude": 33.23139374,
        "Longitude": 132.5683734,
        "ContactTelephone1": "0895-24-1423",
        "DistanceUnit": 0
    },
    "Connections": [
        {
            "ID": 17713,
            "ConnectionTypeID": 2,
            "LevelID": 2,
            "Amps": 100,
            "Voltage": 480,
            "PowerKW": 48,
            "Quantity": 1
        }
    ],
    "DateLastStatusUpdate": "2013-06-29T08:58:00Z",
    "DataQualityLevel": 2,
    "DateCreated": "2013-06-29T08:58:00Z",
    "SubmissionStatusTypeID": 200
}