{
    "UserComments": [
        {
            "ID": 2414,
            "ChargePointID": 19499,
            "CommentTypeID": 10,
            "UserName": "dodavies",
            "Comment": "4 bays",
            "Rating": 5,
            "DateCreated": "2014-12-02T18:16:50.527Z",
            "User": {
                "ID": 1195,
                "Username": "dodavies"
            },
            "CheckinStatusTypeID": 10
        }
    ],
    "IsRecentlyVerified": false,
    "ID": 19499,
    "UUID": "DEFFC1DF-2D71-4AF2-B49C-CF8A8B70052B",
    "DataProviderID": 1,
    "OperatorID": 32,
    "OperatorsReference": "1648,1776",
    "UsageTypeID": 4,
    "UsageCost": "Inclusive; for Polar Plus subscription members only",
    "AddressInfo": {
        "ID": 19844,
        "Title": " Waitrose, South Woodford",
        "AddressLine1": "92-96 High Road",
        "AddressLine2": "South Woodford, Redbridge",
        "Town": "London",
        "Postcode": "E18 2NA",
        "CountryID": 1,
        "Latitude": 51.595077,
        "Longitude": 0.0221284,
        "ContactTelephone1": "0845 850 0653",
        "AccessComments": "Charges may apply - refer to the owner of the parking bay for details.",
        "RelatedURL": "http://www.waitrose.com/bf_home/bf/231.html",
        "DistanceUnit": 0
    },
    "Connections": [
        {
            "ID": 19827,
            "ConnectionTypeID": 25,
            "StatusTypeID": 50,
            "LevelID": 2,
            "Amps": 32,
            "Voltage": 230,
            "PowerKW": 7,
            "CurrentTypeID": 10,
            "Quantity": 4
        }
    ],
    "NumberOfPoints": 4,
    "GeneralComments": "Chargemaster posts. Polar Network cards / app accepted, but no longer accepts Source London.",
    "StatusTypeID": 50,
    "DateLastStatusUpdate": "2019-03-07T06:33:00Z",
    "MetadataValues": [
        {
            "ID": 109,
            "MetadataFieldID": 4,
            "ItemValue": "Data © OpenStreetMap contributors, ODbL 1.0. http://www.openstreetmap.org/copyright"
        }
    ],
    "DataQualityLevel": 1,
    "DateCreated": "2013-10-02T11:59:00Z",
    "SubmissionStatusTypeID": 200
}