{
    "IsRecentlyVerified": false,
    "ID": 138116,
    "UUID": "9255621F-488C-4B83-B13A-CDEFE24BA6A4",
    "DataProviderID": 2,
    "DataProvidersReference": "85906",
    "OperatorID": 5,
    "UsageTypeID": 1,
    "AddressInfo": {
        "ID": 138465,
        "Title": "KAPIOLANI",
        "AddressLine1": "1703 Bingham St",
        "Town": "Honolulu",
        "StateOrProvince": "HI",
        "Postcode": "96826",
        "CountryID": 2,
        "Latitude": 21.29925,
        "Longitude": -157.832359,
        "ContactTelephone1": "888-758-4389",
        "AccessComments": "24 hours daily",
        "RelatedURL": "http://www.chargepoint.com/",
        "DistanceUnit": 0
    },
    "Connections": [
        {
            "ID": 193173,
            "ConnectionTypeID": 1,
            "LevelID": 2,
            "Amps": 16,
            "Voltage": 230,
            "PowerKW": 3.7,
            "CurrentTypeID": 10,
            "Quantity": 8
        }
    ],
    "StatusTypeID": 50,
    "DateLastStatusUpdate": "2020-06-26T02:52:00Z",
    "DataQualityLevel": 3,
    "DateCreated": "2019-12-24T09:08:00Z",
    "SubmissionStatusTypeID": 100
}