{
    "IsRecentlyVerified": false,
    "ID": 34228,
    "UUID": "1B9DA1DA-A8B7-4E16-BDD7-58FED114B64D",
    "DataProviderID": 26,
    "DataProvidersReference": "48698",
    "OperatorID": 178,
    "OperatorsReference": "EVnetNL REE577",
    "UsageCost": "0.00 jaarabonnement",
    "AddressInfo": {
        "ID": 34574,
        "Title": "Claudius Civilisstraat 34",
        "AddressLine1": "Claudius Civilisstraat 34",
        "Town": "Rijnwaarden",
        "Postcode": "6911 AW",
        "CountryID": 159,
        "Latitude": 51.889571,
        "Longitude": 6.040066,
        "ContactTelephone1": "0800-3522365",
        "RelatedURL": "http://www.evnet.nl",
        "DistanceUnit": 0
    },
    "Connections": [
        {
            "ID": 37739,
            "ConnectionTypeID": 25,
            "LevelID": 1,
            "PowerKW": 2.3,
            "CurrentTypeID": 10
        }
    ],
    "NumberOfPoints": 1,
    "StatusTypeID": 50,
    "DateLastStatusUpdate": "2016-06-04T02:41:00Z",
    "DataQualityLevel": 3,
    "DateCreated": "2015-01-09T06:04:00Z",
    "SubmissionStatusTypeID": 100
}