{
    "IsRecentlyVerified": false,
    "ID": 186587,
    "UUID": "9F3C226F-795C-4B00-866C-80DB4BD72C50",
    "DataProviderID": 29,
    "DataProvidersReference": "17861",
    "OperatorID": 132,
    "AddressInfo": {
        "ID": 186946,
        "Title": "Söseweg 14",
        "AddressLine1": "Söseweg 14",
        "Town": "Göttingen",
        "Postcode": "37081",
        "CountryID": 87,
        "Latitude": 51.522373,
        "Longitude": 9.911027,
        "DistanceUnit": 0
    },
    "Connections": [
        {
            "ID": 299564,
            "ConnectionTypeID": 25,
            "StatusTypeID": 50,
            "LevelID": 2,
            "PowerKW": 22,
            "CurrentTypeID": 20
        },
        {
            "ID": 299565,
            "ConnectionTypeID": 25,
            "StatusTypeID": 50,
            "LevelID": 2,
            "PowerKW": 22,
            "CurrentTypeID": 20
        }
    ],
    "StatusTypeID": 50,
    "DateLastStatusUpdate": "2021-07-12T02:47:00Z",
    "MetadataValues": [
        {
            "ID": 18828,
            "MetadataFieldID": 4,
            "ItemValue": "Data from the German chargepoint registry provided by Bundesnetzagentur.de under the CC-BY 4.0 license"
        }
    ],
    "DataQualityLevel": 3,
    "DateCreated": "2021-07-12T02:47:00Z",
    "SubmissionStatusTypeID": 100
}