{
    "IsRecentlyVerified": true,
    "DateLastVerified": "2021-08-31T06:03:00Z",
    "ID": 188998,
    "UUID": "ABF8E52E-1320-485F-86E3-7CD02AD24B4B",
    "DataProviderID": 1,
    "OperatorID": 164,
    "UsageTypeID": 4,
    "AddressInfo": {
        "ID": 189357,
        "Title": "30 Via Duca Tassilo",
        "AddressLine1": "30 Via Duca Tassilo",
        "Town": "Innichen - San Candido",
        "StateOrProvince": "Trentino-Alto Adige - Südtirol",
        "Postcode": "39038",
        "CountryID": 112,
        "Latitude": 46.73448898122743,
        "Longitude": 12.288061633991447,
        "DistanceUnit": 0
    },
    "Connections": [
        {
            "ID": 305477,
            "ConnectionTypeID": 25,
            "StatusTypeID": 50,
            "LevelID": 2,
            "Amps": 22,
            "Voltage": 400,
            "PowerKW": 22,
            "CurrentTypeID": 20,
            "Quantity": 2
        }
    ],
    "NumberOfPoints": 1,
    "StatusTypeID": 50,
    "DateLastStatusUpdate": "2021-09-01T07:57:00Z",
    "DataQualityLevel": 1,
    "DateCreated": "2021-08-31T06:03:00Z",
    "SubmissionStatusTypeID": 200
}