{
    "IsRecentlyVerified": false,
    "ID": 159716,
    "UUID": "D94F6573-F1F9-4C39-BD73-0880DD3DC0B3",
    "DataProviderID": 2,
    "DataProvidersReference": "154043",
    "OperatorID": 5,
    "UsageTypeID": 1,
    "AddressInfo": {
        "ID": 160073,
        "Title": "FASTWAY GAS",
        "AddressLine1": "386 Dover Chester Rd",
        "Town": "Randolph",
        "StateOrProvince": "NJ",
        "Postcode": "07869",
        "CountryID": 2,
        "Latitude": 40.8228152,
        "Longitude": -74.6266184,
        "ContactTelephone1": "888-758-4389",
        "AccessComments": "24 hours daily",
        "RelatedURL": "http://www.chargepoint.com/",
        "DistanceUnit": 0
    },
    "Connections": [
        {
            "ID": 229922,
            "ConnectionTypeID": 1,
            "LevelID": 2,
            "Amps": 16,
            "Voltage": 230,
            "PowerKW": 3.7,
            "CurrentTypeID": 10,
            "Quantity": 2
        }
    ],
    "StatusTypeID": 50,
    "DateLastStatusUpdate": "2020-06-26T03:03:00Z",
    "DataQualityLevel": 3,
    "DateCreated": "2020-06-26T03:03:00Z",
    "SubmissionStatusTypeID": 100
}