{
    "IsRecentlyVerified": false,
    "ID": 128304,
    "UUID": "1AA28A85-9639-4662-A89E-F173BC164401",
    "DataProviderID": 1,
    "OperatorID": 23,
    "OperatorsReference": "50737",
    "UsageTypeID": 4,
    "AddressInfo": {
        "ID": 128650,
        "Title": "Courtyard By Marriott Atlanta/Vinings",
        "AddressLine1": "2829 Overlook Pkwy",
        "Town": "Atlanta",
        "StateOrProvince": "Georgia",
        "Postcode": "30339",
        "CountryID": 2,
        "Latitude": 33.780634,
        "Longitude": -84.480871,
        "ContactTelephone1": "(770) 436-8300",
        "DistanceUnit": 0
    },
    "Connections": [
        {
            "ID": 179593,
            "ConnectionTypeID": 30,
            "StatusTypeID": 50,
            "LevelID": 2,
            "PowerKW": 16,
            "CurrentTypeID": 20,
            "Quantity": 2
        }
    ],
    "NumberOfPoints": 2,
    "GeneralComments": "2 Tesla Connectors, up to 16kW.Available for customers. Self park.",
    "StatusTypeID": 50,
    "DateLastStatusUpdate": "2019-06-21T06:09:00Z",
    "DataQualityLevel": 1,
    "DateCreated": "2019-06-21T06:09:00Z",
    "SubmissionStatusTypeID": 200
}