{
    "IsRecentlyVerified": false,
    "ID": 97385,
    "UUID": "50D99D1D-B14F-4B42-BF54-487DF116632F",
    "DataProviderID": 1,
    "OperatorID": 23,
    "OperatorsReference": "38724",
    "UsageTypeID": 4,
    "AddressInfo": {
        "ID": 97731,
        "Title": "Legacy Vacation Club - Steamboat Suites",
        "AddressLine1": "1485 Pine Grove RD",
        "Town": "Steamboat Springs",
        "StateOrProvince": "Colorado",
        "Postcode": "80477",
        "CountryID": 2,
        "Latitude": 40.464727,
        "Longitude": -106.823199,
        "ContactTelephone1": "(970) 879-1211",
        "DistanceUnit": 0
    },
    "Connections": [
        {
            "ID": 138292,
            "ConnectionTypeID": 30,
            "StatusTypeID": 50,
            "LevelID": 2,
            "PowerKW": 16,
            "CurrentTypeID": 20,
            "Quantity": 4
        }
    ],
    "NumberOfPoints": 4,
    "GeneralComments": "4 Tesla Connectors, up to 16kW.Available for customers. Please see front desk.",
    "StatusTypeID": 50,
    "DateLastStatusUpdate": "2018-01-21T15:17:00Z",
    "DataQualityLevel": 1,
    "DateCreated": "2018-01-21T15:17:00Z",
    "SubmissionStatusTypeID": 200
}