{
    "IsRecentlyVerified": false,
    "ID": 161434,
    "UUID": "5209AEEC-BD10-4F74-87A8-01F2649ACF58",
    "DataProviderID": 1,
    "OperatorID": 23,
    "OperatorsReference": "54038",
    "UsageTypeID": 4,
    "UsageCost": "€0.25/kWh; andere tarieven voor oudere auto's",
    "AddressInfo": {
        "ID": 161791,
        "Title": "Apeldoorn Oost Supercharger",
        "AddressLine1": "Landgoedlaan 26",
        "Town": "Apeldoorn",
        "Postcode": "7325 AW",
        "CountryID": 159,
        "Latitude": 52.204703,
        "Longitude": 6.016104,
        "DistanceUnit": 0
    },
    "Connections": [
        {
            "ID": 232332,
            "ConnectionTypeID": 27,
            "StatusTypeID": 50,
            "LevelID": 3,
            "PowerKW": 120,
            "CurrentTypeID": 30,
            "Quantity": 20
        }
    ],
    "NumberOfPoints": 20,
    "GeneralComments": "Charging12 Superchargers, available 24/7, up to 250kW",
    "StatusTypeID": 50,
    "DateLastStatusUpdate": "2020-12-20T06:34:00Z",
    "DataQualityLevel": 1,
    "DateCreated": "2020-07-12T05:32:00Z",
    "SubmissionStatusTypeID": 200
}