{
    "IsRecentlyVerified": false,
    "ID": 48155,
    "UUID": "76C30B7A-48FD-4748-A330-02121E3DA7B5",
    "DataProviderID": 2,
    "DataProvidersReference": "67322",
    "OperatorID": 5,
    "UsageTypeID": 1,
    "AddressInfo": {
        "ID": 48501,
        "Title": "LIBRARY HOST",
        "AddressLine1": "5200 Lake Rd",
        "Town": "Merced",
        "StateOrProvince": "CA",
        "Postcode": "95343",
        "CountryID": 2,
        "Latitude": 37.3661667,
        "Longitude": -120.4252597,
        "ContactTelephone1": "888-758-4389",
        "AccessComments": "24 hours daily",
        "RelatedURL": "http://www.chargepoint.com/",
        "DistanceUnit": 0
    },
    "Connections": [
        {
            "ID": 59547,
            "ConnectionTypeID": 1,
            "LevelID": 2,
            "Amps": 16,
            "Voltage": 230,
            "PowerKW": 3,
            "CurrentTypeID": 10,
            "Quantity": 2
        }
    ],
    "DateLastStatusUpdate": "2019-04-06T04:02:00Z",
    "DataQualityLevel": 3,
    "DateCreated": "2015-06-24T11:44:00Z",
    "SubmissionStatusTypeID": 100
}