{
    "IsRecentlyVerified": false,
    "ID": 132064,
    "UUID": "46467E08-1FBD-4449-8F89-B7D803B8FE2E",
    "DataProviderID": 1,
    "OperatorID": 105,
    "UsageTypeID": 6,
    "AddressInfo": {
        "ID": 132410,
        "Title": "Warsaw Spire - Innogy",
        "AddressLine1": "Plac Europejski 1",
        "Town": "Warsaw",
        "CountryID": 179,
        "Latitude": 52.2317715093435,
        "Longitude": 20.984022747728,
        "DistanceUnit": 0
    },
    "Connections": [
        {
            "ID": 184784,
            "ConnectionTypeID": 33,
            "LevelID": 2,
            "Amps": 32,
            "Voltage": 400,
            "PowerKW": 22,
            "Quantity": 2
        }
    ],
    "NumberOfPoints": 1,
    "StatusTypeID": 0,
    "DateLastStatusUpdate": "2019-09-20T08:05:00Z",
    "DataQualityLevel": 1,
    "DateCreated": "2019-09-19T13:50:00Z",
    "SubmissionStatusTypeID": 200
}