{
    "IsRecentlyVerified": false,
    "ID": 140662,
    "UUID": "3F3588F2-920F-47C6-906A-3964AECEDF2B",
    "DataProviderID": 2,
    "DataProvidersReference": "85530",
    "OperatorID": 5,
    "UsageTypeID": 1,
    "AddressInfo": {
        "ID": 141014,
        "Title": "ESSEX",
        "AddressLine1": "19900-19918 Olivewood St",
        "Town": "Cupertino",
        "StateOrProvince": "CA",
        "Postcode": "95014",
        "CountryID": 2,
        "Latitude": 37.3331249,
        "Longitude": -122.0216699,
        "ContactTelephone1": "888-758-4389",
        "AccessComments": "24 hours daily",
        "RelatedURL": "http://www.chargepoint.com/",
        "DistanceUnit": 0
    },
    "Connections": [
        {
            "ID": 196359,
            "ConnectionTypeID": 1,
            "LevelID": 2,
            "Amps": 16,
            "Voltage": 230,
            "PowerKW": 3,
            "CurrentTypeID": 10,
            "Quantity": 2
        }
    ],
    "StatusTypeID": 50,
    "DateLastStatusUpdate": "2019-12-24T09:13:00Z",
    "DataQualityLevel": 3,
    "DateCreated": "2019-12-24T09:13:00Z",
    "SubmissionStatusTypeID": 100
}