{
    "IsRecentlyVerified": false,
    "ID": 94781,
    "UUID": "1C2384B3-8D7A-4E20-9023-6903B17DC15B",
    "DataProviderID": 1,
    "OperatorID": 45,
    "UsageTypeID": 5,
    "UsageCost": "5 € / Stunde ; 8,3 Cent / Minute ; 45 Cent / kWh",
    "AddressInfo": {
        "ID": 95127,
        "Title": "Privater Ladepunkt Gemeinde Altdorf Rathaus",
        "AddressLine1": "Kirchplatz 4",
        "Town": "Altdorf",
        "Postcode": "71155",
        "CountryID": 87,
        "Latitude": 48.6277,
        "Longitude": 8.99662999999998,
        "ContactTelephone1": "+49-7031-7474-0",
        "AccessComments": "Kostenloses Parken; Nur Bargeld Bezahlung (im Briefkasten des Rathaus deponieren) \r\nLadeweile: Heimatmuseum, Rathaus, Kirche St. Blasius, Bücherei, Bäckerei mit Stehkaffee",
        "RelatedURL": "http://www.altdorf-boeblingen.de/de/index.php",
        "DistanceUnit": 0
    },
    "Connections": [
        {
            "ID": 133976,
            "ConnectionTypeID": 25,
            "StatusTypeID": 50,
            "LevelID": 2,
            "Amps": 16,
            "Voltage": 380,
            "PowerKW": 11,
            "CurrentTypeID": 20,
            "Quantity": 1
        }
    ],
    "NumberOfPoints": 1,
    "StatusTypeID": 50,
    "DateLastStatusUpdate": "2017-11-01T12:54:00Z",
    "DataQualityLevel": 1,
    "DateCreated": "2017-10-26T16:24:00Z",
    "SubmissionStatusTypeID": 200
}