{
    "IsRecentlyVerified": false,
    "ID": 151067,
    "UUID": "B0C51ECA-BD58-4B93-AFC4-6BDDC4359D91",
    "DataProviderID": 28,
    "DataProvidersReference": "FR*ABA*P13094*001",
    "UsageTypeID": 5,
    "AddressInfo": {
        "ID": 151420,
        "Title": "SAINT-ETIENNE-DU-GRES - Avenue Frédéric Mistral",
        "AddressLine1": "Avenue Frédéric Mistral 13103 SAINT-ETIENNE-DU-GRES",
        "CountryID": 80,
        "Latitude": 43.781708,
        "Longitude": 4.726419,
        "AccessComments": "24h/24 7j/7",
        "DistanceUnit": 0
    },
    "Connections": [
        {
            "ID": 210632,
            "ConnectionTypeID": 28,
            "StatusTypeID": 50,
            "LevelID": 2,
            "PowerKW": 22,
            "CurrentTypeID": 10
        },
        {
            "ID": 210633,
            "ConnectionTypeID": 1036,
            "StatusTypeID": 50,
            "LevelID": 2,
            "PowerKW": 22,
            "CurrentTypeID": 20
        },
        {
            "ID": 240590,
            "ConnectionTypeID": 28,
            "StatusTypeID": 50,
            "LevelID": 2,
            "PowerKW": 22,
            "CurrentTypeID": 10
        },
        {
            "ID": 240591,
            "ConnectionTypeID": 1036,
            "StatusTypeID": 50,
            "LevelID": 2,
            "PowerKW": 22,
            "CurrentTypeID": 20
        }
    ],
    "GeneralComments": "Recharge par badge et avec une application smartphone",
    "StatusTypeID": 50,
    "DateLastStatusUpdate": "2020-08-27T05:11:00Z",
    "DataQualityLevel": 2,
    "DateCreated": "2020-03-15T06:18:00Z",
    "SubmissionStatusTypeID": 100
}