{
    "IsRecentlyVerified": false,
    "ID": 38222,
    "UUID": "BFB154D8-7E57-4B80-B7F2-1EF759EA54BA",
    "DataProviderID": 26,
    "DataProvidersReference": "47993",
    "OperatorID": 178,
    "OperatorsReference": "EVnetNL DB0233",
    "UsageCost": "0.00 jaarabonnement",
    "AddressInfo": {
        "ID": 38568,
        "Title": "Van Borsselestraat 26",
        "AddressLine1": "Van Borsselestraat 26",
        "Town": "Beverwijk",
        "Postcode": "1947 JL",
        "CountryID": 159,
        "Latitude": 52.485177,
        "Longitude": 4.664989,
        "ContactTelephone1": "0800-3522365",
        "RelatedURL": "http://www.evnet.nl",
        "DistanceUnit": 0
    },
    "Connections": [
        {
            "ID": 41733,
            "ConnectionTypeID": 25,
            "LevelID": 2,
            "PowerKW": 11,
            "CurrentTypeID": 10
        }
    ],
    "NumberOfPoints": 2,
    "StatusTypeID": 50,
    "DateLastStatusUpdate": "2016-06-04T02:54:00Z",
    "DataQualityLevel": 3,
    "DateCreated": "2015-01-09T06:07:00Z",
    "SubmissionStatusTypeID": 100
}