{
    "IsRecentlyVerified": false,
    "ID": 65179,
    "UUID": "28BCC17F-BFB6-49AB-A877-175CAC943355",
    "DataProviderID": 1,
    "OperatorID": 45,
    "OperatorsReference": "44463,44463",
    "UsageTypeID": 1,
    "AddressInfo": {
        "ID": 65525,
        "Title": "Stadtwerke",
        "AddressLine1": "Westerstraße 50",
        "Town": "Elmshorn",
        "StateOrProvince": "Kreis Pinneberg",
        "Postcode": "25336",
        "CountryID": 87,
        "Latitude": 53.7481225544387,
        "Longitude": 9.64964244445797,
        "AccessComments": "Kostenloses Laden ohne Ladekarte 24/7 möglich.",
        "RelatedURL": "http://www.stadtwerke-elmshorn.de/",
        "DistanceUnit": 0
    },
    "Connections": [
        {
            "ID": 89731,
            "ConnectionTypeID": 25,
            "StatusTypeID": 50,
            "LevelID": 2,
            "Amps": 16,
            "Voltage": 230,
            "PowerKW": 3.7,
            "CurrentTypeID": 10,
            "Quantity": 1
        }
    ],
    "NumberOfPoints": 2,
    "StatusTypeID": 50,
    "DateLastStatusUpdate": "2018-06-23T05:42:00Z",
    "DataQualityLevel": 1,
    "DateCreated": "2016-04-19T07:44:00Z",
    "SubmissionStatusTypeID": 200
}