{
    "IsRecentlyVerified": false,
    "ID": 127498,
    "UUID": "34576F54-0172-449B-ADDF-5C4BB0EA12A4",
    "DataProviderID": 1,
    "OperatorID": 22,
    "OperatorsReference": "C4X9R",
    "UsageTypeID": 4,
    "AddressInfo": {
        "ID": 127844,
        "Title": "Castlebar Street",
        "AddressLine1": "Westport",
        "Town": "County Mayo",
        "CountryID": 3,
        "Latitude": 53.8007,
        "Longitude": -9.5199,
        "DistanceUnit": 0
    },
    "Connections": [
        {
            "ID": 178471,
            "ConnectionTypeID": 25,
            "StatusTypeID": 50,
            "LevelID": 2,
            "Amps": 32,
            "Voltage": 400,
            "PowerKW": 22,
            "CurrentTypeID": 20,
            "Quantity": 2
        }
    ],
    "NumberOfPoints": 2,
    "StatusTypeID": 50,
    "DateLastStatusUpdate": "2019-06-04T06:11:00Z",
    "DataQualityLevel": 1,
    "DateCreated": "2019-06-03T12:47:00Z",
    "SubmissionStatusTypeID": 200
}