{
    "IsRecentlyVerified": false,
    "ID": 30127,
    "UUID": "393FC5A8-2D1D-423F-9625-A039E2AFCD8E",
    "DataProviderID": 1,
    "DataProvidersReference": "CBC-00006",
    "OperatorID": 21,
    "UsageTypeID": 4,
    "UsageCost": "Mobi.E compatible card",
    "AddressInfo": {
        "ID": 30473,
        "Title": "CTB-00006",
        "AddressLine1": "Avenida do Empresário",
        "Town": "Castelo Branco",
        "Postcode": "6000-767",
        "CountryID": 180,
        "Latitude": 39.819479291528296,
        "Longitude": -7.511481913584021,
        "RelatedURL": "http://www.mobie.pt",
        "DistanceUnit": 0
    },
    "Connections": [
        {
            "ID": 33112,
            "ConnectionTypeID": 25,
            "StatusTypeID": 50,
            "LevelID": 2,
            "Amps": 16,
            "Voltage": 230,
            "PowerKW": 3.7,
            "CurrentTypeID": 10,
            "Quantity": 2
        }
    ],
    "NumberOfPoints": 2,
    "StatusTypeID": 50,
    "DateLastStatusUpdate": "2021-01-22T19:44:00Z",
    "DataQualityLevel": 3,
    "DateCreated": "2014-11-29T14:48:00Z",
    "SubmissionStatusTypeID": 100
}