{
    "IsRecentlyVerified": false,
    "ID": 73759,
    "UUID": "B48CA885-A9C3-4D53-86E9-FF58A15FDB0C",
    "DataProviderID": 1,
    "OperatorID": 89,
    "OperatorsReference": "CEA-341",
    "UsageTypeID": 4,
    "UsageCost": "CAD 2.50",
    "AddressInfo": {
        "ID": 74105,
        "Title": "MRC du Haut-Richelieu",
        "AddressLine1": "380 4e avenue",
        "Town": "Saint-Jean-sur-Richelieu",
        "StateOrProvince": "QC",
        "Postcode": "J2X 1W9",
        "CountryID": 44,
        "Latitude": 45.306833,
        "Longitude": -73.23268,
        "DistanceUnit": 0
    },
    "Connections": [
        {
            "ID": 106061,
            "ConnectionTypeID": 1,
            "StatusTypeID": 50,
            "LevelID": 2,
            "Amps": 32,
            "Voltage": 230,
            "PowerKW": 7,
            "CurrentTypeID": 10,
            "Quantity": 1
        }
    ],
    "NumberOfPoints": 1,
    "StatusTypeID": 50,
    "DateLastStatusUpdate": "2017-01-24T09:37:00Z",
    "DataQualityLevel": 1,
    "DateCreated": "2016-11-23T22:59:00Z",
    "SubmissionStatusTypeID": 200
}