{
    "IsRecentlyVerified": false,
    "ID": 9492,
    "UUID": "DEB4DA16-9AAF-4BEF-AD35-C51CCDE2E75A",
    "DataProviderID": 1,
    "OperatorID": 1,
    "UsageTypeID": 1,
    "UsageCost": "Free",
    "AddressInfo": {
        "ID": 9389,
        "Title": "Arturo Soria Plaza",
        "AddressLine1": "Calle de Arturo Soria 126",
        "AddressLine2": "",
        "Town": "Madrid",
        "StateOrProvince": "Madrid",
        "Postcode": "28043",
        "CountryID": 210,
        "Latitude": 40.4501354,
        "Longitude": -3.6511895999999524,
        "ContactTelephone1": "",
        "ContactTelephone2": "",
        "ContactEmail": "",
        "AccessComments": "Turn right after entering down the ramp.",
        "RelatedURL": "",
        "DistanceUnit": 0
    },
    "Connections": [
        {
            "ID": 7162,
            "ConnectionTypeID": 13,
            "StatusTypeID": 75,
            "LevelID": 2,
            "Quantity": 1
        }
    ],
    "NumberOfPoints": 2,
    "GeneralComments": "The Security Guys are supposed to know how to use them although they are not very familiar.",
    "StatusTypeID": 50,
    "DateLastStatusUpdate": "2012-02-14T12:02:00Z",
    "DataQualityLevel": 1,
    "DateCreated": "2012-02-08T22:40:00Z",
    "SubmissionStatusTypeID": 200
}