{
    "IsRecentlyVerified": false,
    "ID": 17079,
    "UUID": "24CB22B5-C491-4BA4-B586-0415E9E8D7E6",
    "DataProviderID": 22,
    "DataProvidersReference": "4AFEA7D073863B9DBE80CFAC0BA75D5A",
    "AddressInfo": {
        "ID": 17424,
        "Title": "ＥＮＥＯＳ　ＤＤセルフ府中栄町店",
        "AddressLine1": "東京都府中市栄町2-20-5",
        "CountryID": 114,
        "Latitude": 35.68835997,
        "Longitude": 139.4783142,
        "ContactTelephone1": "042-334-5288",
        "DistanceUnit": 0
    },
    "Connections": [
        {
            "ID": 17320,
            "ConnectionTypeID": 2,
            "LevelID": 2,
            "Amps": 100,
            "Voltage": 480,
            "PowerKW": 48,
            "Quantity": 1
        }
    ],
    "DateLastStatusUpdate": "2013-06-29T08:53:00Z",
    "DataQualityLevel": 2,
    "DateCreated": "2013-06-29T08:53:00Z",
    "SubmissionStatusTypeID": 200
}