{
    "IsRecentlyVerified": false,
    "ID": 42798,
    "UUID": "B8BB562C-C185-49AC-B238-1B0BA5C9E27C",
    "DataProviderID": 1,
    "OperatorID": 45,
    "UsageTypeID": 5,
    "UsageCost": "0,50€/kWh",
    "AddressInfo": {
        "ID": 43144,
        "Title": "Stellplatz unter der Burg",
        "AddressLine1": "Unter der Burg",
        "Town": "Borchen",
        "StateOrProvince": "Kreis Paderborn",
        "Postcode": "33178",
        "CountryID": 87,
        "Latitude": 51.658941902443,
        "Longitude": 8.72069851520541,
        "ContactTelephone1": "05251 38880",
        "AccessComments": "2 Anschlüsse auf 2 Wohnmobil-Stellplätzen, 50Cent/kWh",
        "RelatedURL": "http://www.borchen.de",
        "DistanceUnit": 0
    },
    "Connections": [
        {
            "ID": 51649,
            "ConnectionTypeID": 16,
            "StatusTypeID": 50,
            "LevelID": 2,
            "Amps": 16,
            "Voltage": 230,
            "PowerKW": 3.7,
            "CurrentTypeID": 10,
            "Quantity": 2
        }
    ],
    "NumberOfPoints": 2,
    "StatusTypeID": 50,
    "DateLastStatusUpdate": "2015-03-24T08:47:00Z",
    "DataQualityLevel": 1,
    "DateCreated": "2015-03-24T08:43:00Z",
    "SubmissionStatusTypeID": 200
}