{
    "IsRecentlyVerified": false,
    "ID": 156671,
    "UUID": "0A786CDA-7222-4FE6-9F85-767A1200B805",
    "DataProviderID": 19,
    "DataProvidersReference": "6487",
    "AddressInfo": {
        "ID": 157025,
        "Title": "Grafiska vägen",
        "AddressLine1": "Grafiska vägen 2b",
        "Town": "GÖTEBORG",
        "StateOrProvince": "VÄSTRA GÖTALAND",
        "Postcode": "41263",
        "CountryID": 216,
        "Latitude": 57.68303,
        "Longitude": 12.00303,
        "AccessComments": "",
        "DistanceUnit": 0
    },
    "Connections": [
        {
            "ID": 221019,
            "ConnectionTypeID": 25,
            "Reference": "1",
            "LevelID": 2,
            "Amps": 16,
            "Voltage": 230,
            "PowerKW": 3.7,
            "CurrentTypeID": 10,
            "Comments": "Mode 2"
        },
        {
            "ID": 221020,
            "ConnectionTypeID": 25,
            "Reference": "2",
            "LevelID": 2,
            "Amps": 16,
            "Voltage": 230,
            "PowerKW": 3.7,
            "CurrentTypeID": 10,
            "Comments": "Mode 2"
        },
        {
            "ID": 221021,
            "ConnectionTypeID": 25,
            "Reference": "3",
            "LevelID": 2,
            "Amps": 16,
            "Voltage": 230,
            "PowerKW": 3.7,
            "CurrentTypeID": 10,
            "Comments": "Mode 2"
        },
        {
            "ID": 221022,
            "ConnectionTypeID": 25,
            "Reference": "4",
            "LevelID": 2,
            "Amps": 16,
            "Voltage": 230,
            "PowerKW": 3.7,
            "CurrentTypeID": 10,
            "Comments": "Mode 2"
        },
        {
            "ID": 221023,
            "ConnectionTypeID": 25,
            "Reference": "5",
            "LevelID": 2,
            "Amps": 16,
            "Voltage": 230,
            "PowerKW": 3.7,
            "CurrentTypeID": 10,
            "Comments": "Mode 2"
        },
        {
            "ID": 221024,
            "ConnectionTypeID": 25,
            "Reference": "6",
            "LevelID": 2,
            "Amps": 16,
            "Voltage": 230,
            "PowerKW": 3.7,
            "CurrentTypeID": 10,
            "Comments": "Mode 2"
        },
        {
            "ID": 221025,
            "ConnectionTypeID": 25,
            "Reference": "7",
            "LevelID": 2,
            "Amps": 16,
            "Voltage": 230,
            "PowerKW": 3.7,
            "CurrentTypeID": 10,
            "Comments": "Mode 2"
        },
        {
            "ID": 221026,
            "ConnectionTypeID": 25,
            "Reference": "8",
            "LevelID": 2,
            "Amps": 16,
            "Voltage": 230,
            "PowerKW": 3.7,
            "CurrentTypeID": 10,
            "Comments": "Mode 2"
        },
        {
            "ID": 221027,
            "ConnectionTypeID": 25,
            "Reference": "9",
            "LevelID": 2,
            "Amps": 16,
            "Voltage": 230,
            "PowerKW": 3.7,
            "CurrentTypeID": 10,
            "Comments": "Mode 2"
        },
        {
            "ID": 221028,
            "ConnectionTypeID": 25,
            "Reference": "10",
            "LevelID": 2,
            "Amps": 16,
            "Voltage": 230,
            "PowerKW": 3.7,
            "CurrentTypeID": 10,
            "Comments": "Mode 2"
        }
    ],
    "NumberOfPoints": 10,
    "StatusTypeID": 0,
    "DateLastStatusUpdate": "2020-05-26T08:21:00Z",
    "DataQualityLevel": 2,
    "DateCreated": "2020-05-26T08:21:00Z",
    "SubmissionStatusTypeID": 100
}