{
    "IsRecentlyVerified": false,
    "ID": 94345,
    "UUID": "E8FEF0B2-2394-4D3E-912C-34E5D7FA03AB",
    "DataProviderID": 2,
    "DataProvidersReference": "88007",
    "OperatorID": 5,
    "UsageTypeID": 1,
    "AddressInfo": {
        "ID": 94691,
        "Title": "SYNC 36",
        "AddressLine1": "10851-10999 Westminster Blvd",
        "Town": "Westminster",
        "StateOrProvince": "CO",
        "Postcode": "80020",
        "CountryID": 2,
        "Latitude": 39.894825,
        "Longitude": -105.07406,
        "ContactTelephone1": "888-758-4389",
        "AccessComments": "24 hours daily",
        "RelatedURL": "http://www.chargepoint.com/",
        "DistanceUnit": 0
    },
    "Connections": [
        {
            "ID": 133447,
            "ConnectionTypeID": 1,
            "LevelID": 2,
            "Amps": 16,
            "Voltage": 230,
            "PowerKW": 3.7,
            "CurrentTypeID": 10,
            "Quantity": 2
        }
    ],
    "DateLastStatusUpdate": "2020-06-26T03:02:00Z",
    "DataQualityLevel": 3,
    "DateCreated": "2017-10-19T02:06:00Z",
    "SubmissionStatusTypeID": 100
}