{
    "IsRecentlyVerified": false,
    "ID": 46159,
    "UUID": "5FF86D3A-1D55-47B8-B1DB-9158732507B2",
    "DataProviderID": 1,
    "DataProvidersReference": "147",
    "AddressInfo": {
        "ID": 46505,
        "Title": "Lille Ekeberg borettslag, Oslo",
        "AddressLine1": "Vårsvingen 3-9",
        "Town": "OSLO",
        "StateOrProvince": "Oslo",
        "Postcode": "1181",
        "CountryID": 168,
        "Latitude": 59.89717,
        "Longitude": 10.78728,
        "AccessComments": "",
        "DistanceUnit": 0
    },
    "Connections": [
        {
            "ID": 56822,
            "ConnectionTypeID": 0,
            "Reference": "1",
            "LevelID": 2,
            "Amps": 16,
            "Voltage": 230,
            "PowerKW": 3.7,
            "Comments": "Mode 1"
        },
        {
            "ID": 85336,
            "ConnectionTypeID": 0,
            "Reference": "2",
            "LevelID": 2,
            "Amps": 16,
            "Voltage": 230,
            "PowerKW": 3.7,
            "Comments": "Mode 1"
        },
        {
            "ID": 88531,
            "ConnectionTypeID": 0,
            "Reference": "3",
            "LevelID": 2,
            "Amps": 16,
            "Voltage": 230,
            "PowerKW": 3.7,
            "Comments": "Mode 1"
        }
    ],
    "NumberOfPoints": 3,
    "DateLastStatusUpdate": "2020-05-26T08:23:00Z",
    "DataQualityLevel": 2,
    "DateCreated": "2015-05-03T00:54:00Z",
    "SubmissionStatusTypeID": 100
}