{
    "IsRecentlyVerified": false,
    "ID": 133607,
    "UUID": "830340F7-2B7F-447D-8079-099A26CAEF3B",
    "DataProviderID": 1,
    "OperatorID": 73,
    "UsageTypeID": 5,
    "UsageCost": "$0.15/kWh < 2 hours; $1.50/hour > 2 hours",
    "AddressInfo": {
        "ID": 133953,
        "Title": "City of Centennial Civic Center",
        "AddressLine1": "13133 E. Arapahoe Rd.",
        "Town": "Centennial",
        "StateOrProvince": "Colorado",
        "Postcode": "80112",
        "CountryID": 2,
        "Latitude": 39.5959786251788,
        "Longitude": -104.835473882805,
        "ContactEmail": "wpeterson@centennialco.gov",
        "DistanceUnit": 0
    },
    "Connections": [
        {
            "ID": 187007,
            "ConnectionTypeID": 1,
            "StatusTypeID": 50,
            "LevelID": 2,
            "Voltage": 240,
            "CurrentTypeID": 10,
            "Quantity": 2
        }
    ],
    "NumberOfPoints": 1,
    "GeneralComments": "EVBox BusinessLine Level II Dual Charger Station w/ 25 ft. cables.",
    "StatusTypeID": 50,
    "DateLastStatusUpdate": "2021-04-24T07:35:00Z",
    "DataQualityLevel": 1,
    "DateCreated": "2019-10-21T15:21:00Z",
    "SubmissionStatusTypeID": 200
}