{
    "IsRecentlyVerified": false,
    "ID": 142672,
    "UUID": "59852886-16AF-4A44-940B-2352D798B077",
    "DataProviderID": 2,
    "DataProvidersReference": "123056",
    "OperatorID": 3372,
    "UsageTypeID": 1,
    "AddressInfo": {
        "ID": 143024,
        "Title": "Bear Mountain State Park",
        "AddressLine1": "3006 Seven Lakes Pkwy",
        "Town": "Bear Mountain",
        "StateOrProvince": "NY",
        "Postcode": "10911",
        "CountryID": 2,
        "Latitude": 41.309433,
        "Longitude": -73.990271,
        "ContactTelephone1": "866-816-7584",
        "AccessComments": "24 hours daily",
        "RelatedURL": "http://evconnect.com/",
        "DistanceUnit": 0
    },
    "Connections": [
        {
            "ID": 198856,
            "ConnectionTypeID": 1,
            "LevelID": 2,
            "Amps": 16,
            "Voltage": 230,
            "PowerKW": 3.7,
            "CurrentTypeID": 10,
            "Quantity": 1
        }
    ],
    "StatusTypeID": 50,
    "DateLastStatusUpdate": "2020-06-26T03:04:00Z",
    "DataQualityLevel": 3,
    "DateCreated": "2019-12-24T09:18:00Z",
    "SubmissionStatusTypeID": 100
}