{
    "IsRecentlyVerified": false,
    "ID": 181746,
    "UUID": "647F9521-1645-484E-9E55-2FDECDD06897",
    "DataProviderID": 29,
    "DataProvidersReference": "7977",
    "AddressInfo": {
        "ID": 182105,
        "Title": "Hohenzollernstraße 10",
        "AddressLine1": "Hohenzollernstraße 10",
        "Town": "Völklingen",
        "Postcode": "66333",
        "CountryID": 87,
        "Latitude": 49.251725,
        "Longitude": 6.860141,
        "DistanceUnit": 0
    },
    "Connections": [
        {
            "ID": 286486,
            "ConnectionTypeID": 25,
            "StatusTypeID": 50,
            "LevelID": 2,
            "PowerKW": 22,
            "CurrentTypeID": 20
        },
        {
            "ID": 286487,
            "ConnectionTypeID": 1036,
            "StatusTypeID": 50,
            "LevelID": 2,
            "PowerKW": 22,
            "CurrentTypeID": 20
        },
        {
            "ID": 296795,
            "ConnectionTypeID": 25,
            "StatusTypeID": 50,
            "LevelID": 2,
            "PowerKW": 22,
            "CurrentTypeID": 20
        },
        {
            "ID": 296796,
            "ConnectionTypeID": 1036,
            "StatusTypeID": 50,
            "LevelID": 2,
            "PowerKW": 22,
            "CurrentTypeID": 20
        }
    ],
    "StatusTypeID": 50,
    "DateLastStatusUpdate": "2021-07-12T02:43:00Z",
    "MetadataValues": [
        {
            "ID": 14040,
            "MetadataFieldID": 4,
            "ItemValue": "Data from the German chargepoint registry provided by Bundesnetzagentur.de under the CC-BY 4.0 license"
        }
    ],
    "DataQualityLevel": 3,
    "DateCreated": "2021-07-08T10:02:00Z",
    "SubmissionStatusTypeID": 100
}