{
    "IsRecentlyVerified": false,
    "ID": 89851,
    "UUID": "51D2F517-491A-47CD-AC85-0F5A6912E4D7",
    "DataProviderID": 1,
    "OperatorID": 3,
    "OperatorsReference": "PG-81142",
    "UsageTypeID": 6,
    "UsageCost": "Free",
    "AddressInfo": {
        "ID": 90197,
        "Title": "Johnsons Slough-Hyundai",
        "AddressLine1": "748-749 Dover Road",
        "Town": "Slough",
        "Postcode": "SL1 4RF",
        "CountryID": 1,
        "Latitude": 51.521792,
        "Longitude": -0.633846,
        "DistanceUnit": 0
    },
    "Connections": [
        {
            "ID": 127360,
            "ConnectionTypeID": 25,
            "StatusTypeID": 50,
            "LevelID": 2,
            "Amps": 32,
            "Voltage": 230,
            "PowerKW": 7,
            "CurrentTypeID": 10,
            "Quantity": 2
        }
    ],
    "NumberOfPoints": 3,
    "GeneralComments": "This is an open charge unit installed at the Johnsons Slough - Hyundai dealership in Dover Road, Slough",
    "StatusTypeID": 50,
    "DateLastStatusUpdate": "2017-12-20T11:04:00Z",
    "DataQualityLevel": 1,
    "DateCreated": "2017-06-23T05:28:00Z",
    "SubmissionStatusTypeID": 200
}