{
    "IsRecentlyVerified": false,
    "ID": 30647,
    "UUID": "64739A70-9A75-49C4-8875-1C044F4AF7C3",
    "DataProviderID": 1,
    "DataProvidersReference": "1486",
    "AddressInfo": {
        "ID": 30993,
        "Title": "Marmorberget Borettslag, Oslo",
        "AddressLine1": "Antenneveien 28",
        "Town": "OSLO",
        "StateOrProvince": "Oslo",
        "Postcode": "1154",
        "CountryID": 168,
        "Latitude": 59.87486,
        "Longitude": 10.81736,
        "AccessComments": "",
        "DistanceUnit": 0
    },
    "Connections": [
        {
            "ID": 33876,
            "ConnectionTypeID": 0,
            "Reference": "1",
            "LevelID": 2,
            "Amps": 16,
            "Voltage": 230,
            "PowerKW": 3.7,
            "Comments": "Mode 1"
        },
        {
            "ID": 85205,
            "ConnectionTypeID": 0,
            "Reference": "2",
            "LevelID": 2,
            "Amps": 16,
            "Voltage": 230,
            "PowerKW": 3.7,
            "Comments": "Mode 1"
        },
        {
            "ID": 88500,
            "ConnectionTypeID": 0,
            "Reference": "3",
            "LevelID": 2,
            "Amps": 16,
            "Voltage": 230,
            "PowerKW": 3.7,
            "Comments": "Mode 1"
        }
    ],
    "NumberOfPoints": 3,
    "DateLastStatusUpdate": "2020-05-26T08:23:00Z",
    "DataQualityLevel": 2,
    "DateCreated": "2014-12-09T09:00:00Z",
    "SubmissionStatusTypeID": 100
}