{
    "IsRecentlyVerified": false,
    "ID": 132625,
    "UUID": "ACCAB970-953A-4AFE-9B4E-BA266538AD8E",
    "DataProviderID": 1,
    "OperatorID": 3,
    "OperatorsReference": "PG-70086,PG-83632",
    "UsageTypeID": 4,
    "UsageCost": "Free",
    "AddressInfo": {
        "ID": 132971,
        "Title": "Tesco Superstore-South Queensferry",
        "AddressLine1": "Ferrymuir",
        "Town": "Queensferry",
        "StateOrProvince": "South Queensferry",
        "Postcode": "EH30 9QZ",
        "CountryID": 1,
        "Latitude": 55.983462,
        "Longitude": -3.400677,
        "DistanceUnit": 0
    },
    "Connections": [
        {
            "ID": 185672,
            "ConnectionTypeID": 25,
            "StatusTypeID": 50,
            "LevelID": 2,
            "Amps": 32,
            "Voltage": 230,
            "PowerKW": 7,
            "CurrentTypeID": 10,
            "Quantity": 4
        }
    ],
    "NumberOfPoints": 4,
    "GeneralComments": "This is an open charge unit installed at the Tesco superstore at Ferrymuir, Queensferry, South Queensferry",
    "StatusTypeID": 50,
    "DateLastStatusUpdate": "2019-10-05T05:28:00Z",
    "DataQualityLevel": 1,
    "DateCreated": "2019-10-04T05:32:00Z",
    "SubmissionStatusTypeID": 200
}