{
    "IsRecentlyVerified": false,
    "ID": 187671,
    "UUID": "7E75A0AC-DA4F-4BCC-9EEE-F400EBD7D1F8",
    "DataProviderID": 18,
    "DataProvidersReference": "069175e4a72f808aa6d0e2bcea679161",
    "OperatorID": 3345,
    "UsageTypeID": 5,
    "AddressInfo": {
        "ID": 188030,
        "Title": "SE5 0TW",
        "AddressLine1": "",
        "Town": "London",
        "Postcode": "SE5 0TW",
        "CountryID": 1,
        "Latitude": 51.477996,
        "Longitude": -0.101409,
        "AccessComments": "",
        "RelatedURL": "https://char.gy",
        "DistanceUnit": 0
    },
    "Connections": [
        {
            "ID": 302900,
            "ConnectionTypeID": 25,
            "Reference": "498",
            "StatusTypeID": 50,
            "LevelID": 2,
            "Amps": 16,
            "Voltage": 230,
            "PowerKW": 3.7,
            "CurrentTypeID": 10
        }
    ],
    "StatusTypeID": 0,
    "DateLastStatusUpdate": "2021-07-12T03:38:00Z",
    "MetadataValues": [
        {
            "ID": 19911,
            "MetadataFieldID": 4,
            "ItemValue": "Contains public sector information licensed under the Open Government Licence v2.0. http://www.nationalarchives.gov.uk/doc/open-government-licence/version/2/"
        }
    ],
    "DataQualityLevel": 3,
    "DateCreated": "2021-07-12T03:38:00Z",
    "SubmissionStatusTypeID": 100
}