{
    "UserComments": [
        {
            "ID": 20038,
            "ChargePointID": 70464,
            "CommentTypeID": 10,
            "UserName": "Shx",
            "DateCreated": "2018-08-18T11:08:06.373Z",
            "User": {
                "ID": 16071,
                "Username": "Shx"
            },
            "CheckinStatusTypeID": 10
        }
    ],
    "MediaItems": [
        {
            "ID": 16300,
            "ChargePointID": 70464,
            "ItemURL": "https://s3-ap-southeast-2.amazonaws.com/openchargemap/images/DE/OCM70464/OCM-70464.orig.2018081811072259.jpg",
            "ItemThumbnailURL": "https://s3-ap-southeast-2.amazonaws.com/openchargemap/images/DE/OCM70464/OCM-70464.thmb.2018081811072259.jpg",
            "Comment": "",
            "IsEnabled": true,
            "IsVideo": false,
            "IsFeaturedItem": false,
            "IsExternalResource": false,
            "User": {
                "ID": 16071,
                "Username": "Shx"
            },
            "DateCreated": "2018-08-18T11:08:00Z"
        },
        {
            "ID": 16301,
            "ChargePointID": 70464,
            "ItemURL": "https://s3-ap-southeast-2.amazonaws.com/openchargemap/images/DE/OCM70464/OCM-70464.orig.2018081811074017.jpg",
            "ItemThumbnailURL": "https://s3-ap-southeast-2.amazonaws.com/openchargemap/images/DE/OCM70464/OCM-70464.thmb.2018081811074017.jpg",
            "Comment": "",
            "IsEnabled": true,
            "IsVideo": false,
            "IsFeaturedItem": false,
            "IsExternalResource": false,
            "User": {
                "ID": 16071,
                "Username": "Shx"
            },
            "DateCreated": "2018-08-18T11:08:00Z"
        }
    ],
    "IsRecentlyVerified": false,
    "ID": 70464,
    "UUID": "5071B6E8-C37C-40C2-AF27-B7928CF4F332",
    "DataProviderID": 1,
    "OperatorID": 235,
    "UsageTypeID": 4,
    "UsageCost": "0",
    "AddressInfo": {
        "ID": 70810,
        "Title": "SWD ISS Dome",
        "AddressLine1": "Theodorstraße 281",
        "Town": "Düsseldorf",
        "Postcode": "40472",
        "CountryID": 87,
        "Latitude": 51.273128,
        "Longitude": 6.810825,
        "ContactTelephone1": "0211/821-8210",
        "ContactEmail": "elektromobilitaet@swd-ag.de",
        "AccessComments": "Nutzbar mit: \r\nElektronauten-Ladekarte (EnBW) \r\nLadekarte der Stadtwerke Hilden GmbH \r\nLadekarte der Stadtwerke Düsseldorf AG \r\nhttps://www.swd-ag.de/formulare/tankkarte/",
        "RelatedURL": "http://www.swd-ag.de",
        "DistanceUnit": 0
    },
    "Connections": [
        {
            "ID": 100763,
            "ConnectionTypeID": 25,
            "StatusTypeID": 50,
            "LevelID": 2,
            "Amps": 32,
            "Voltage": 400,
            "PowerKW": 22,
            "CurrentTypeID": 10,
            "Quantity": 2
        },
        {
            "ID": 100764,
            "ConnectionTypeID": 28,
            "StatusTypeID": 50,
            "LevelID": 2,
            "Amps": 16,
            "Voltage": 230,
            "PowerKW": 3.7,
            "CurrentTypeID": 10,
            "Quantity": 2
        }
    ],
    "NumberOfPoints": 2,
    "StatusTypeID": 50,
    "DateLastStatusUpdate": "2018-08-18T11:08:00Z",
    "DataQualityLevel": 1,
    "DateCreated": "2016-07-18T09:43:00Z",
    "SubmissionStatusTypeID": 200
}