{
    "IsRecentlyVerified": false,
    "ID": 120949,
    "UUID": "DB086BB0-DF5F-4E5D-89A0-135D30341E02",
    "DataProviderID": 2,
    "DataProvidersReference": "62710",
    "UsageTypeID": 5,
    "AddressInfo": {
        "ID": 121295,
        "Title": "Children's at Egleston Hospital",
        "AddressLine1": "1405 Clifton Rd NE",
        "Town": "Atlanta",
        "StateOrProvince": "GA",
        "Postcode": "30329",
        "CountryID": 2,
        "Latitude": 33.793285,
        "Longitude": -84.320996,
        "ContactTelephone1": "404-785-6000",
        "AccessComments": "24 hours daily\r\nPublic - Credit card at all times",
        "RelatedURL": "",
        "DistanceUnit": 0
    },
    "Connections": [
        {
            "ID": 170357,
            "ConnectionTypeID": 1,
            "LevelID": 2,
            "Amps": 16,
            "Voltage": 230,
            "PowerKW": 3.7,
            "CurrentTypeID": 10,
            "Quantity": 4
        }
    ],
    "DateLastStatusUpdate": "2020-06-26T02:56:00Z",
    "DataQualityLevel": 3,
    "DateCreated": "2019-04-01T04:59:00Z",
    "SubmissionStatusTypeID": 100
}