{
    "IsRecentlyVerified": false,
    "ID": 109182,
    "UUID": "F25CE042-23F4-4647-8B2C-D7D1372788AB",
    "DataProviderID": 1,
    "OperatorID": 23,
    "OperatorsReference": "45838",
    "UsageTypeID": 4,
    "AddressInfo": {
        "ID": 109528,
        "Title": "Chateau Montplaisir",
        "AddressLine1": "1 Chemin des Blagiers",
        "Town": "Valréas",
        "Postcode": "84600",
        "CountryID": 80,
        "Latitude": 44.374708,
        "Longitude": 4.994782,
        "ContactTelephone1": " +33 673 655 538",
        "DistanceUnit": 0
    },
    "Connections": [
        {
            "ID": 154300,
            "ConnectionTypeID": 30,
            "StatusTypeID": 50,
            "LevelID": 2,
            "Amps": 16,
            "Voltage": 400,
            "PowerKW": 11,
            "CurrentTypeID": 20,
            "Quantity": 2
        }
    ],
    "NumberOfPoints": 2,
    "GeneralComments": "2 Tesla Connectors, up to 11kW.Available for customers. Please call ahead.",
    "StatusTypeID": 50,
    "DateLastStatusUpdate": "2018-10-11T13:51:00Z",
    "DataQualityLevel": 1,
    "DateCreated": "2018-10-11T13:51:00Z",
    "SubmissionStatusTypeID": 200
}