{
    "IsRecentlyVerified": false,
    "ID": 142760,
    "UUID": "1650E7CD-005F-4DD5-A1DE-2D331CB9D909",
    "DataProviderID": 2,
    "DataProvidersReference": "72333",
    "OperatorID": 5,
    "UsageTypeID": 1,
    "AddressInfo": {
        "ID": 143112,
        "Title": "BMW DES MOINES",
        "AddressLine1": "Frontage Rd",
        "Town": "Urbandale",
        "StateOrProvince": "IA",
        "Postcode": "50322",
        "CountryID": 2,
        "Latitude": 41.6158304,
        "Longitude": -93.7551692,
        "ContactTelephone1": "888-758-4389",
        "AccessComments": "24 hours daily",
        "RelatedURL": "http://www.chargepoint.com/",
        "DistanceUnit": 0
    },
    "Connections": [
        {
            "ID": 198971,
            "ConnectionTypeID": 1,
            "LevelID": 2,
            "Amps": 16,
            "Voltage": 230,
            "PowerKW": 3.7,
            "CurrentTypeID": 10,
            "Quantity": 2
        }
    ],
    "StatusTypeID": 50,
    "DateLastStatusUpdate": "2020-06-26T03:04:00Z",
    "DataQualityLevel": 3,
    "DateCreated": "2019-12-24T09:18:00Z",
    "SubmissionStatusTypeID": 100
}