{
    "IsRecentlyVerified": false,
    "ID": 132122,
    "UUID": "438A9AAF-BEC7-449B-933F-AD247DDF93A0",
    "DataProviderID": 1,
    "OperatorID": 74,
    "UsageTypeID": 1,
    "AddressInfo": {
        "ID": 132468,
        "Title": "Fastned Plech",
        "AddressLine1": "Gewerbepark Schönthal 1",
        "Town": "Plech",
        "Postcode": "91287",
        "CountryID": 87,
        "Latitude": 49.66416,
        "Longitude": 11.47072,
        "AccessComments": "24/7",
        "RelatedURL": "http://fastned.nl/",
        "DistanceUnit": 0
    },
    "Connections": [
        {
            "ID": 184901,
            "ConnectionTypeID": 33,
            "StatusTypeID": 50,
            "LevelID": 3,
            "PowerKW": 175,
            "CurrentTypeID": 30,
            "Quantity": 3
        },
        {
            "ID": 184902,
            "ConnectionTypeID": 33,
            "StatusTypeID": 50,
            "LevelID": 3,
            "Amps": 125,
            "Voltage": 400,
            "PowerKW": 50,
            "CurrentTypeID": 30,
            "Quantity": 1
        },
        {
            "ID": 184903,
            "ConnectionTypeID": 2,
            "StatusTypeID": 50,
            "LevelID": 3,
            "PowerKW": 50,
            "CurrentTypeID": 30,
            "Quantity": 1
        },
        {
            "ID": 184904,
            "ConnectionTypeID": 25,
            "StatusTypeID": 50,
            "LevelID": 3,
            "PowerKW": 43,
            "CurrentTypeID": 20,
            "Quantity": 1
        }
    ],
    "NumberOfPoints": 1,
    "StatusTypeID": 50,
    "DateLastStatusUpdate": "2019-09-21T14:40:00Z",
    "DataQualityLevel": 1,
    "DateCreated": "2019-09-21T13:30:00Z",
    "SubmissionStatusTypeID": 200
}