{
    "MediaItems": [
        {
            "ID": 27412,
            "ChargePointID": 175100,
            "ItemURL": "https://s3-ap-southeast-2.amazonaws.com/openchargemap/images/RO/OCM175100/OCM-175100.orig.2021042709094076.jpg",
            "ItemThumbnailURL": "https://s3-ap-southeast-2.amazonaws.com/openchargemap/images/RO/OCM175100/OCM-175100.thmb.2021042709094076.jpg",
            "Comment": "",
            "IsEnabled": true,
            "IsVideo": false,
            "IsFeaturedItem": false,
            "IsExternalResource": false,
            "User": {
                "ID": 31841,
                "Username": "Diana's Lovina Lek3C"
            },
            "DateCreated": "2021-04-27T09:10:00Z"
        },
        {
            "ID": 27413,
            "ChargePointID": 175100,
            "ItemURL": "https://s3-ap-southeast-2.amazonaws.com/openchargemap/images/RO/OCM175100/OCM-175100.orig.2021042709102520.jpg",
            "ItemThumbnailURL": "https://s3-ap-southeast-2.amazonaws.com/openchargemap/images/RO/OCM175100/OCM-175100.thmb.2021042709102520.jpg",
            "Comment": "",
            "IsEnabled": true,
            "IsVideo": false,
            "IsFeaturedItem": false,
            "IsExternalResource": false,
            "User": {
                "ID": 31841,
                "Username": "Diana's Lovina Lek3C"
            },
            "DateCreated": "2021-04-27T09:10:00Z"
        },
        {
            "ID": 27406,
            "ChargePointID": 175100,
            "ItemURL": "https://s3-ap-southeast-2.amazonaws.com/openchargemap/images/RO/OCM175100/OCM-175100.orig.2021042706015324.jpg",
            "ItemThumbnailURL": "https://s3-ap-southeast-2.amazonaws.com/openchargemap/images/RO/OCM175100/OCM-175100.thmb.2021042706015324.jpg",
            "Comment": "",
            "IsEnabled": true,
            "IsVideo": false,
            "IsFeaturedItem": false,
            "IsExternalResource": false,
            "User": {
                "ID": 31841,
                "Username": "Diana's Lovina Lek3C"
            },
            "DateCreated": "2021-04-27T06:02:00Z"
        }
    ],
    "IsRecentlyVerified": false,
    "ID": 175100,
    "UUID": "E326FB26-4E91-4696-8B3B-631AD2627751",
    "DataProviderID": 1,
    "OperatorID": 1,
    "UsageTypeID": 4,
    "UsageCost": "1.30RON/kWh",
    "AddressInfo": {
        "ID": 175459,
        "Title": "Diana's Lovina Lektrico",
        "AddressLine1": "Str. Viilor No 17",
        "AddressLine2": "La Fantana",
        "Town": "Jurilovca",
        "StateOrProvince": "Tulcea",
        "Postcode": "827115",
        "CountryID": 184,
        "Latitude": 44.75489925706239,
        "Longitude": 28.864679965433766,
        "AccessComments": "Lektrico",
        "RelatedURL": "https://m.lektri.co/",
        "DistanceUnit": 0
    },
    "Connections": [
        {
            "ID": 271358,
            "ConnectionTypeID": 25,
            "Reference": "https://m.lektri.co/",
            "StatusTypeID": 50,
            "LevelID": 2,
            "Amps": 32,
            "Voltage": 400,
            "PowerKW": 22,
            "CurrentTypeID": 20,
            "Quantity": 1,
            "Comments": "Aditional 1 Triphasic 32A Socket; 1 Triphasic 16A Socket; 1 Monophasic 32A Socket"
        }
    ],
    "NumberOfPoints": 1,
    "GeneralComments": "Aditional 3 Sockets Triphasic 32A and 16A",
    "StatusTypeID": 50,
    "DateLastStatusUpdate": "2021-09-07T11:37:00Z",
    "DataQualityLevel": 1,
    "DateCreated": "2021-04-26T13:44:00Z",
    "SubmissionStatusTypeID": 200
}