{
    "IsRecentlyVerified": false,
    "ID": 48835,
    "UUID": "1B4DC1E0-E4CC-4EC1-8503-E54A23CD36C3",
    "DataProviderID": 1,
    "OperatorID": 20,
    "OperatorsReference": "21189,21190,80242",
    "UsageTypeID": 4,
    "UsageCost": "£1.00/session,Free",
    "AddressInfo": {
        "ID": 49181,
        "Title": "Bowlees Visitor Centre",
        "AddressLine1": "Newbiggin",
        "Town": "Barnard Castle",
        "StateOrProvince": "County Durham",
        "Postcode": "DL12 0XF",
        "CountryID": 1,
        "Latitude": 54.648735,
        "Longitude": -2.145999,
        "DistanceUnit": 0
    },
    "Connections": [
        {
            "ID": 60349,
            "ConnectionTypeID": 25,
            "StatusTypeID": 75,
            "LevelID": 2,
            "Amps": 32,
            "Voltage": 230,
            "PowerKW": 7,
            "CurrentTypeID": 10,
            "Quantity": 3
        }
    ],
    "NumberOfPoints": 4,
    "StatusTypeID": 75,
    "DateLastStatusUpdate": "2019-08-08T05:25:00Z",
    "DataQualityLevel": 1,
    "DateCreated": "2015-07-03T08:01:00Z",
    "SubmissionStatusTypeID": 200
}