{
    "IsRecentlyVerified": false,
    "ID": 122101,
    "UUID": "FE9AE35F-A7A1-40B9-BCC0-E45B15134E6D",
    "DataProviderID": 2,
    "DataProvidersReference": "117748",
    "OperatorID": 9,
    "UsageTypeID": 1,
    "AddressInfo": {
        "ID": 122447,
        "Title": "McDonalds NSN10167 - Cristo, LLC",
        "AddressLine1": "305 Ernest W. Barrett Pkwy. NW",
        "Town": "Kennesaw",
        "StateOrProvince": "GA",
        "Postcode": "30144",
        "CountryID": 2,
        "Latitude": 34.013715,
        "Longitude": -84.560946,
        "ContactTelephone1": "888-998-2546",
        "AccessComments": "MON: 24 hours | TUE: 24 hours | WED: 24 hours | THU: 24 hours | FRI: 24 hours | SAT: 24 hours | SUN: 24 hours",
        "RelatedURL": "http://www.blinkcharging.com/",
        "DistanceUnit": 0
    },
    "Connections": [
        {
            "ID": 171961,
            "ConnectionTypeID": 1,
            "LevelID": 2,
            "Amps": 16,
            "Voltage": 230,
            "PowerKW": 3,
            "CurrentTypeID": 10,
            "Quantity": 2
        }
    ],
    "DateLastStatusUpdate": "2019-12-24T09:11:00Z",
    "DataQualityLevel": 3,
    "DateCreated": "2019-04-06T05:02:00Z",
    "SubmissionStatusTypeID": 100
}