{
    "IsRecentlyVerified": false,
    "ID": 177685,
    "UUID": "8CAF26E7-887C-4E87-A899-3F98A698B96C",
    "DataProviderID": 29,
    "DataProvidersReference": "8133",
    "AddressInfo": {
        "ID": 178044,
        "Title": "Duderstädter Straße",
        "AddressLine1": "Duderstädter Straße",
        "Town": "Teistungen",
        "Postcode": "37339",
        "CountryID": 87,
        "Latitude": 51.480584,
        "Longitude": 10.262239,
        "DistanceUnit": 0
    },
    "Connections": [
        {
            "ID": 277129,
            "ConnectionTypeID": 25,
            "StatusTypeID": 50,
            "LevelID": 2,
            "PowerKW": 22,
            "CurrentTypeID": 20
        },
        {
            "ID": 277130,
            "ConnectionTypeID": 25,
            "StatusTypeID": 50,
            "LevelID": 2,
            "PowerKW": 22,
            "CurrentTypeID": 20
        }
    ],
    "StatusTypeID": 0,
    "DateLastStatusUpdate": "2021-07-12T02:47:00Z",
    "MetadataValues": [
        {
            "ID": 9979,
            "MetadataFieldID": 4,
            "ItemValue": "Data from the German chargepoint registry provided by Bundesnetzagentur.de under the CC-BY 4.0 license"
        }
    ],
    "DataQualityLevel": 3,
    "DateCreated": "2021-07-08T09:49:00Z",
    "SubmissionStatusTypeID": 100
}