{
    "IsRecentlyVerified": false,
    "ID": 91534,
    "UUID": "30543E9C-CBED-472D-9DE1-286148B97E2C",
    "DataProviderID": 1,
    "OperatorID": 32,
    "OperatorsReference": "2069",
    "UsageTypeID": 4,
    "UsageCost": "£0.108/kWh; for Polar Plus subscription members only",
    "AddressInfo": {
        "ID": 91880,
        "Title": "Secklow Gate Car Park",
        "AddressLine1": "Secklow Gate",
        "Town": "Milton Keynes",
        "StateOrProvince": "Buckinghamshire",
        "Postcode": "MK9 3BB",
        "CountryID": 1,
        "Latitude": 52.041916,
        "Longitude": -0.751932,
        "DistanceUnit": 0
    },
    "Connections": [
        {
            "ID": 129744,
            "ConnectionTypeID": 25,
            "StatusTypeID": 50,
            "LevelID": 2,
            "Amps": 32,
            "Voltage": 230,
            "PowerKW": 7,
            "CurrentTypeID": 10,
            "Quantity": 2
        }
    ],
    "NumberOfPoints": 2,
    "GeneralComments": "Outside Speciality Shops",
    "StatusTypeID": 50,
    "DateLastStatusUpdate": "2019-03-08T06:17:00Z",
    "DataQualityLevel": 1,
    "DateCreated": "2017-08-04T16:39:00Z",
    "SubmissionStatusTypeID": 200
}