{
    "IsRecentlyVerified": false,
    "ID": 48182,
    "UUID": "A27567B5-CB5C-4AE7-AA35-34B02F0D796A",
    "DataProviderID": 1,
    "OperatorID": 23,
    "OperatorsReference": "17197",
    "UsageTypeID": 1,
    "UsageCost": "Free",
    "AddressInfo": {
        "ID": 48528,
        "Title": "Solar Energy International",
        "AddressLine1": "39845 Mathews Ln",
        "Town": "Paonia",
        "StateOrProvince": "CO",
        "Postcode": "81428",
        "CountryID": 2,
        "Latitude": 38.8566,
        "Longitude": -107.615,
        "ContactTelephone1": "970-527-7657  877-798-3752",
        "AccessComments": "24 hours daily",
        "RelatedURL": "http://www.teslamotors.com/supercharger",
        "DistanceUnit": 0
    },
    "Connections": [
        {
            "ID": 59587,
            "ConnectionTypeID": 30,
            "StatusTypeID": 50,
            "LevelID": 2,
            "Amps": 16,
            "Voltage": 230,
            "PowerKW": 16,
            "CurrentTypeID": 10,
            "Quantity": 2
        }
    ],
    "NumberOfPoints": 2,
    "StatusTypeID": 50,
    "DateLastStatusUpdate": "2017-02-01T09:52:00Z",
    "DataQualityLevel": 3,
    "DateCreated": "2015-06-24T11:44:00Z",
    "SubmissionStatusTypeID": 100
}