{
    "IsRecentlyVerified": false,
    "ID": 101047,
    "UUID": "1D3878A3-6DBA-48A2-955D-06072B67FDCD",
    "DataProviderID": 1,
    "OperatorID": 23,
    "OperatorsReference": "28921",
    "UsageTypeID": 4,
    "UsageCost": "£0.24/kWh;other tariffs for older cars",
    "AddressInfo": {
        "ID": 101393,
        "Title": "Membury Westbound Supercharger",
        "AddressLine1": "M4 Junction 14/15",
        "Town": "Hungerford",
        "Postcode": "RG17 7TZ",
        "CountryID": 1,
        "Latitude": 51.481232,
        "Longitude": -1.556154,
        "DistanceUnit": 0
    },
    "Connections": [
        {
            "ID": 142670,
            "ConnectionTypeID": 27,
            "StatusTypeID": 50,
            "LevelID": 3,
            "PowerKW": 120,
            "CurrentTypeID": 30,
            "Quantity": 8
        }
    ],
    "NumberOfPoints": 8,
    "GeneralComments": "Charging8 Superchargers, available 24/7, up to 120kW",
    "StatusTypeID": 50,
    "DateLastStatusUpdate": "2019-03-22T17:53:00Z",
    "DataQualityLevel": 1,
    "DateCreated": "2018-03-16T06:43:00Z",
    "SubmissionStatusTypeID": 200
}