{
    "IsRecentlyVerified": false,
    "ID": 50715,
    "UUID": "28077E11-5BC9-4457-B616-8409B588D768",
    "DataProviderID": 26,
    "DataProvidersReference": "62991",
    "OperatorID": 73,
    "OperatorsReference": "EV-Box EVB-P1417022",
    "UsageCost": "0.00 jaarabonnement",
    "AddressInfo": {
        "ID": 51061,
        "Title": "Wipmolen 70",
        "AddressLine1": "Wipmolen 70",
        "Town": "Papendrecht",
        "Postcode": "3352 XR",
        "CountryID": 159,
        "Latitude": 51.83814,
        "Longitude": 4.68777,
        "RelatedURL": "http://www.ev-box.nl",
        "DistanceUnit": 0
    },
    "Connections": [
        {
            "ID": 62524,
            "ConnectionTypeID": 25,
            "LevelID": 2,
            "PowerKW": 5,
            "CurrentTypeID": 10
        }
    ],
    "NumberOfPoints": 1,
    "StatusTypeID": 50,
    "DateLastStatusUpdate": "2016-06-04T02:41:00Z",
    "DataQualityLevel": 3,
    "DateCreated": "2015-07-22T09:53:00Z",
    "SubmissionStatusTypeID": 100
}