{
    "IsRecentlyVerified": false,
    "ID": 182177,
    "UUID": "C3B3044A-B9BB-4B44-9DF9-AF9A6204150F",
    "DataProviderID": 29,
    "DataProvidersReference": "17135",
    "OperatorID": 45,
    "AddressInfo": {
        "ID": 182536,
        "Title": "Hoher Staden 2a",
        "AddressLine1": "Hoher Staden 2a",
        "Town": "Schmelz",
        "Postcode": "66839",
        "CountryID": 87,
        "Latitude": 49.436055,
        "Longitude": 6.846652,
        "DistanceUnit": 0
    },
    "Connections": [
        {
            "ID": 287594,
            "ConnectionTypeID": 25,
            "StatusTypeID": 50,
            "LevelID": 2,
            "PowerKW": 22,
            "CurrentTypeID": 20
        },
        {
            "ID": 287595,
            "ConnectionTypeID": 25,
            "StatusTypeID": 50,
            "LevelID": 2,
            "PowerKW": 22,
            "CurrentTypeID": 20
        }
    ],
    "StatusTypeID": 50,
    "DateLastStatusUpdate": "2021-07-12T02:43:00Z",
    "MetadataValues": [
        {
            "ID": 14471,
            "MetadataFieldID": 4,
            "ItemValue": "Data from the German chargepoint registry provided by Bundesnetzagentur.de under the CC-BY 4.0 license"
        }
    ],
    "DataQualityLevel": 3,
    "DateCreated": "2021-07-08T10:02:00Z",
    "SubmissionStatusTypeID": 100
}