{
    "IsRecentlyVerified": false,
    "ID": 96708,
    "UUID": "B18C0AFE-53E2-4DAA-8073-DA4B76165017",
    "DataProviderID": 2,
    "DataProvidersReference": "88272",
    "OperatorID": 5,
    "UsageTypeID": 1,
    "AddressInfo": {
        "ID": 97054,
        "Title": "FIRST NORTH",
        "AddressLine1": "225 1st St NE",
        "Town": "Massillon",
        "StateOrProvince": "OH",
        "Postcode": "44646",
        "CountryID": 2,
        "Latitude": 40.7988876,
        "Longitude": -81.5234179,
        "ContactTelephone1": "888-758-4389",
        "AccessComments": "24 hours daily",
        "RelatedURL": "http://www.chargepoint.com/",
        "DistanceUnit": 0
    },
    "Connections": [
        {
            "ID": 136984,
            "ConnectionTypeID": 1,
            "LevelID": 2,
            "Amps": 16,
            "Voltage": 230,
            "PowerKW": 3.7,
            "CurrentTypeID": 10,
            "Quantity": 1
        }
    ],
    "DateLastStatusUpdate": "2020-06-26T03:03:00Z",
    "DataQualityLevel": 3,
    "DateCreated": "2017-12-29T21:01:00Z",
    "SubmissionStatusTypeID": 100
}