{
    "IsRecentlyVerified": false,
    "ID": 71905,
    "UUID": "E0C9769B-0594-45F9-B67C-EF15565C00C7",
    "DataProviderID": 1,
    "UsageTypeID": 4,
    "AddressInfo": {
        "ID": 72251,
        "Title": "eborn SDE07 - Parking de la Libération",
        "AddressLine1": "Parking de la Libération",
        "Town": "LE CHEYLARD",
        "Postcode": "07160",
        "CountryID": 80,
        "Latitude": 44.906533,
        "Longitude": 4.422164,
        "RelatedURL": "http://www.sde07.com/",
        "DistanceUnit": 0
    },
    "Connections": [
        {
            "ID": 103032,
            "ConnectionTypeID": 25,
            "StatusTypeID": 50,
            "LevelID": 2,
            "Amps": 32,
            "Voltage": 400,
            "PowerKW": 3,
            "CurrentTypeID": 20,
            "Quantity": 2
        },
        {
            "ID": 103033,
            "ConnectionTypeID": 23,
            "StatusTypeID": 50,
            "LevelID": 2,
            "Amps": 16,
            "Voltage": 230,
            "PowerKW": 3,
            "CurrentTypeID": 10,
            "Quantity": 2
        }
    ],
    "NumberOfPoints": 2,
    "GeneralComments": "Nécessite le badge SDE07.\r\nFormulaire de demande de badge disponible à l'adresse suivante: http://www.sde07.com/communes-collectivites-ardeche/bornes-de-charges-vehicules-hybrides-electriques/",
    "StatusTypeID": 50,
    "DateLastStatusUpdate": "2017-01-08T18:18:00Z",
    "DataQualityLevel": 1,
    "DateCreated": "2016-09-22T13:34:00Z",
    "SubmissionStatusTypeID": 200
}