{
    "IsRecentlyVerified": false,
    "ID": 177277,
    "UUID": "72EC108D-D6EA-4261-9AD4-6EB2F9A5C481",
    "DataProviderID": 29,
    "DataProvidersReference": "20244",
    "AddressInfo": {
        "ID": 177636,
        "Title": "Henkestraße 7",
        "AddressLine1": "Henkestraße 7",
        "Town": "Erlangen",
        "Postcode": "91056",
        "CountryID": 87,
        "Latitude": 49.5947999999999,
        "Longitude": 11.00639,
        "DistanceUnit": 0
    },
    "Connections": [
        {
            "ID": 276243,
            "ConnectionTypeID": 25,
            "StatusTypeID": 50,
            "LevelID": 2,
            "PowerKW": 11,
            "CurrentTypeID": 20
        },
        {
            "ID": 276244,
            "ConnectionTypeID": 25,
            "StatusTypeID": 50,
            "LevelID": 2,
            "PowerKW": 11,
            "CurrentTypeID": 20
        }
    ],
    "StatusTypeID": 0,
    "DateLastStatusUpdate": "2021-07-12T02:43:00Z",
    "MetadataValues": [
        {
            "ID": 9571,
            "MetadataFieldID": 4,
            "ItemValue": "Data from the German chargepoint registry provided by Bundesnetzagentur.de under the CC-BY 4.0 license"
        }
    ],
    "DataQualityLevel": 3,
    "DateCreated": "2021-07-08T09:48:00Z",
    "SubmissionStatusTypeID": 100
}