{
    "IsRecentlyVerified": false,
    "ID": 136052,
    "UUID": "6B15819B-9696-4707-B7C1-B95488048242",
    "DataProviderID": 18,
    "DataProvidersReference": "af88086de6293e886972137a6a53be82",
    "OperatorID": 2244,
    "UsageTypeID": 4,
    "AddressInfo": {
        "ID": 136398,
        "Title": "Elmwood Road",
        "AddressLine1": "Elmwood Road",
        "Town": "London",
        "Postcode": "W4 3DY",
        "CountryID": 1,
        "Latitude": 51.487102,
        "Longitude": -0.269216,
        "AccessComments": "",
        "RelatedURL": "https://www.ubitricity.com",
        "DistanceUnit": 0
    },
    "Connections": [
        {
            "ID": 190479,
            "ConnectionTypeID": 25,
            "Reference": "steob100000732",
            "StatusTypeID": 50,
            "LevelID": 2,
            "Amps": 16,
            "Voltage": 230,
            "PowerKW": 3.7,
            "CurrentTypeID": 10
        }
    ],
    "StatusTypeID": 0,
    "DateLastStatusUpdate": "2021-04-25T05:46:00Z",
    "MetadataValues": [
        {
            "ID": 5904,
            "MetadataFieldID": 4,
            "ItemValue": "Contains public sector information licensed under the Open Government Licence v2.0. http://www.nationalarchives.gov.uk/doc/open-government-licence/version/2/"
        }
    ],
    "DataQualityLevel": 3,
    "DateCreated": "2019-12-24T05:22:00Z",
    "SubmissionStatusTypeID": 100
}