{
    "IsRecentlyVerified": false,
    "ID": 141423,
    "UUID": "83A9BFD8-34B7-4293-ADF3-D72BDDECFEB0",
    "DataProviderID": 2,
    "DataProvidersReference": "87605",
    "OperatorID": 5,
    "UsageTypeID": 1,
    "AddressInfo": {
        "ID": 141775,
        "Title": "EVERGY",
        "AddressLine1": "12343 College Blvd @ Johnson Co. Community College",
        "Town": "Overland Park",
        "StateOrProvince": "KS",
        "Postcode": "66210",
        "CountryID": 2,
        "Latitude": 38.927127,
        "Longitude": -94.731317,
        "ContactTelephone1": "888-758-4389",
        "AccessComments": "24 hours daily",
        "RelatedURL": "http://www.chargepoint.com/",
        "DistanceUnit": 0
    },
    "Connections": [
        {
            "ID": 197350,
            "ConnectionTypeID": 1,
            "LevelID": 2,
            "Amps": 16,
            "Voltage": 230,
            "PowerKW": 3.7,
            "CurrentTypeID": 10,
            "Quantity": 6
        }
    ],
    "StatusTypeID": 50,
    "DateLastStatusUpdate": "2020-06-26T03:00:00Z",
    "DataQualityLevel": 3,
    "DateCreated": "2019-12-24T09:15:00Z",
    "SubmissionStatusTypeID": 100
}