{
    "IsRecentlyVerified": false,
    "ID": 184420,
    "UUID": "B1702257-FEC4-40B1-8B51-62F98A225172",
    "DataProviderID": 29,
    "DataProvidersReference": "13593",
    "OperatorID": 3261,
    "AddressInfo": {
        "ID": 184779,
        "Title": "Landwehrplatz",
        "AddressLine1": "Landwehrplatz",
        "Town": "Saarbrücken",
        "Postcode": "66121",
        "CountryID": 87,
        "Latitude": 49.233468,
        "Longitude": 7.001607,
        "DistanceUnit": 0
    },
    "Connections": [
        {
            "ID": 292684,
            "ConnectionTypeID": 25,
            "StatusTypeID": 50,
            "LevelID": 2,
            "PowerKW": 11,
            "CurrentTypeID": 20
        },
        {
            "ID": 292685,
            "ConnectionTypeID": 25,
            "StatusTypeID": 50,
            "LevelID": 2,
            "PowerKW": 11,
            "CurrentTypeID": 20
        }
    ],
    "StatusTypeID": 50,
    "DateLastStatusUpdate": "2021-07-12T02:42:00Z",
    "MetadataValues": [
        {
            "ID": 16711,
            "MetadataFieldID": 4,
            "ItemValue": "Data from the German chargepoint registry provided by Bundesnetzagentur.de under the CC-BY 4.0 license"
        }
    ],
    "DataQualityLevel": 3,
    "DateCreated": "2021-07-08T10:05:00Z",
    "SubmissionStatusTypeID": 100
}