{
    "IsRecentlyVerified": false,
    "ID": 110270,
    "UUID": "9AECBBB9-7345-41CD-B605-5CD8C85DE934",
    "DataProviderID": 2,
    "DataProvidersReference": "99977",
    "OperatorID": 5,
    "UsageTypeID": 1,
    "AddressInfo": {
        "ID": 110616,
        "Title": "WEINSTEIN",
        "AddressLine1": "8200 Stonebrook Terrace",
        "Town": "Raleigh",
        "StateOrProvince": "NC",
        "Postcode": "27617",
        "CountryID": 2,
        "Latitude": 35.9104975,
        "Longitude": -78.787751,
        "ContactTelephone1": "888-758-4389",
        "AccessComments": "24 hours daily",
        "RelatedURL": "http://www.chargepoint.com/",
        "DistanceUnit": 0
    },
    "Connections": [
        {
            "ID": 155509,
            "ConnectionTypeID": 1,
            "LevelID": 2,
            "Amps": 16,
            "Voltage": 230,
            "PowerKW": 3,
            "CurrentTypeID": 10,
            "Quantity": 2
        }
    ],
    "DateLastStatusUpdate": "2019-04-06T04:02:00Z",
    "DataQualityLevel": 3,
    "DateCreated": "2018-10-18T23:36:00Z",
    "SubmissionStatusTypeID": 100
}