{
    "IsRecentlyVerified": false,
    "ID": 65735,
    "UUID": "EF8FE299-6C9D-4108-AB62-20978A354907",
    "DataProviderID": 26,
    "DataProvidersReference": "84395",
    "OperatorID": 103,
    "OperatorsReference": "Allego NLALLEGO0006242",
    "UsageCost": "0.00 jaarabonnement",
    "AddressInfo": {
        "ID": 66081,
        "Title": "Schönbergweg 80",
        "AddressLine1": "Schönbergweg 80",
        "Town": "Almere",
        "Postcode": "1323 HC",
        "CountryID": 159,
        "Latitude": 52.36297579,
        "Longitude": 5.19075291,
        "ContactTelephone1": "0800-3745337",
        "RelatedURL": "http://www.allego.eu/",
        "DistanceUnit": 0
    },
    "Connections": [
        {
            "ID": 90757,
            "ConnectionTypeID": 25,
            "LevelID": 2,
            "PowerKW": 11,
            "CurrentTypeID": 10
        },
        {
            "ID": 90758,
            "ConnectionTypeID": 25,
            "LevelID": 2,
            "PowerKW": 11,
            "CurrentTypeID": 10
        }
    ],
    "NumberOfPoints": 1,
    "StatusTypeID": 50,
    "DateLastStatusUpdate": "2016-06-04T02:53:00Z",
    "DataQualityLevel": 3,
    "DateCreated": "2016-04-27T09:42:00Z",
    "SubmissionStatusTypeID": 100
}