{
    "IsRecentlyVerified": false,
    "ID": 139947,
    "UUID": "B08408BC-E4A4-4F44-A0DB-3897530DC1FB",
    "DataProviderID": 2,
    "DataProvidersReference": "121225",
    "OperatorID": 5,
    "UsageTypeID": 1,
    "AddressInfo": {
        "ID": 140299,
        "Title": "OAK PARK",
        "AddressLine1": "1002 Doubletree Rd",
        "Town": "Oak Park",
        "StateOrProvince": "CA",
        "Postcode": "91377",
        "CountryID": 2,
        "Latitude": 34.1830945,
        "Longitude": -118.7647814,
        "ContactTelephone1": "888-758-4389",
        "AccessComments": "24 hours daily",
        "RelatedURL": "http://www.chargepoint.com/",
        "DistanceUnit": 0
    },
    "Connections": [
        {
            "ID": 195455,
            "ConnectionTypeID": 1,
            "LevelID": 2,
            "Amps": 16,
            "Voltage": 230,
            "PowerKW": 3,
            "CurrentTypeID": 10,
            "Quantity": 2
        }
    ],
    "StatusTypeID": 50,
    "DateLastStatusUpdate": "2019-12-24T09:11:00Z",
    "DataQualityLevel": 3,
    "DateCreated": "2019-12-24T09:11:00Z",
    "SubmissionStatusTypeID": 100
}