{
    "IsRecentlyVerified": false,
    "ID": 184059,
    "UUID": "F976C358-BB8C-4C0C-BBAB-A370BE17615C",
    "DataProviderID": 29,
    "DataProvidersReference": "20835",
    "AddressInfo": {
        "ID": 184418,
        "Title": "Fichtenstraße 33",
        "AddressLine1": "Fichtenstraße 33",
        "Town": "Brunnthal/Hofolding",
        "Postcode": "85649",
        "CountryID": 87,
        "Latitude": 47.984786,
        "Longitude": 11.709244,
        "DistanceUnit": 0
    },
    "Connections": [
        {
            "ID": 291813,
            "ConnectionTypeID": 25,
            "StatusTypeID": 50,
            "LevelID": 2,
            "PowerKW": 22,
            "CurrentTypeID": 20
        },
        {
            "ID": 291814,
            "ConnectionTypeID": 25,
            "StatusTypeID": 50,
            "LevelID": 2,
            "PowerKW": 22,
            "CurrentTypeID": 20
        }
    ],
    "StatusTypeID": 50,
    "DateLastStatusUpdate": "2021-07-12T02:40:00Z",
    "MetadataValues": [
        {
            "ID": 16351,
            "MetadataFieldID": 4,
            "ItemValue": "Data from the German chargepoint registry provided by Bundesnetzagentur.de under the CC-BY 4.0 license"
        }
    ],
    "DataQualityLevel": 3,
    "DateCreated": "2021-07-08T10:04:00Z",
    "SubmissionStatusTypeID": 100
}