{
    "MediaItems": [
        {
            "ID": 23091,
            "ChargePointID": 161535,
            "ItemURL": "https://s3-ap-southeast-2.amazonaws.com/openchargemap/images/GR/OCM161535/OCM-161535.orig.2020071520283160.jpg",
            "ItemThumbnailURL": "https://s3-ap-southeast-2.amazonaws.com/openchargemap/images/GR/OCM161535/OCM-161535.thmb.2020071520283160.jpg",
            "Comment": "",
            "IsEnabled": true,
            "IsVideo": false,
            "IsFeaturedItem": false,
            "IsExternalResource": false,
            "User": {
                "ID": 18761,
                "Username": "EVentusiast"
            },
            "DateCreated": "2020-07-15T20:29:00Z"
        },
        {
            "ID": 23090,
            "ChargePointID": 161535,
            "ItemURL": "https://s3-ap-southeast-2.amazonaws.com/openchargemap/images/GR/OCM161535/OCM-161535.orig.2020071520280072.jpg",
            "ItemThumbnailURL": "https://s3-ap-southeast-2.amazonaws.com/openchargemap/images/GR/OCM161535/OCM-161535.thmb.2020071520280072.jpg",
            "Comment": "",
            "IsEnabled": true,
            "IsVideo": false,
            "IsFeaturedItem": false,
            "IsExternalResource": false,
            "User": {
                "ID": 18761,
                "Username": "EVentusiast"
            },
            "DateCreated": "2020-07-15T20:28:00Z"
        }
    ],
    "IsRecentlyVerified": false,
    "ID": 161535,
    "UUID": "450EA06B-279D-4D93-B166-8DE7967B0168",
    "DataProviderID": 1,
    "OperatorID": 85,
    "UsageTypeID": 1,
    "UsageCost": "Various rates apply depending on the type of contract",
    "AddressInfo": {
        "ID": 161892,
        "Title": "ECO PROGRESS",
        "AddressLine1": "Πανεπιστημίου 1",
        "AddressLine2": "κ. Πατρέων",
        "Town": "Municipality of Patras",
        "StateOrProvince": "Achaea Regional Unit",
        "Postcode": "26441",
        "CountryID": 90,
        "Latitude": 38.25779893923308,
        "Longitude": 21.748382312757258,
        "ContactTelephone1": "+302613013283",
        "ContactEmail": "info@eco-progress.gr",
        "RelatedURL": "https://eco-progress.gr/el/",
        "DistanceUnit": 0
    },
    "Connections": [
        {
            "ID": 232467,
            "ConnectionTypeID": 25,
            "StatusTypeID": 50,
            "LevelID": 2,
            "Amps": 32,
            "Voltage": 400,
            "PowerKW": 22,
            "CurrentTypeID": 20,
            "Quantity": 1
        }
    ],
    "NumberOfPoints": 1,
    "StatusTypeID": 50,
    "DateLastStatusUpdate": "2020-07-15T22:04:00Z",
    "DataQualityLevel": 1,
    "DateCreated": "2020-07-15T20:27:00Z",
    "SubmissionStatusTypeID": 200
}