{
    "IsRecentlyVerified": false,
    "ID": 102447,
    "UUID": "E0325B39-974F-4E2F-AED1-86D549865355",
    "DataProviderID": 2,
    "DataProvidersReference": "94744",
    "UsageTypeID": 2,
    "AddressInfo": {
        "ID": 102793,
        "Title": "Office Building",
        "AddressLine1": "1960 E Grand Ave",
        "Town": "El Segundo",
        "StateOrProvince": "CA",
        "Postcode": "90245",
        "CountryID": 2,
        "Latitude": 33.918849,
        "Longitude": -118.392951,
        "ContactTelephone1": "",
        "AccessComments": "Employee use only",
        "RelatedURL": "http://evconnect.com/",
        "DistanceUnit": 0
    },
    "Connections": [
        {
            "ID": 144526,
            "ConnectionTypeID": 1,
            "LevelID": 2,
            "Amps": 16,
            "Voltage": 230,
            "PowerKW": 3,
            "CurrentTypeID": 10,
            "Quantity": 6
        }
    ],
    "DateLastStatusUpdate": "2019-04-06T04:01:00Z",
    "DataQualityLevel": 3,
    "DateCreated": "2018-04-21T04:13:00Z",
    "SubmissionStatusTypeID": 100
}