{
    "IsRecentlyVerified": false,
    "ID": 23283,
    "UUID": "306FA9F0-A697-49C8-9B98-C5702900740C",
    "DataProviderID": 1,
    "OperatorID": 45,
    "UsageTypeID": 1,
    "UsageCost": "Free",
    "AddressInfo": {
        "ID": 23628,
        "Title": "Lehn & Vogt Insurance Group",
        "AddressLine1": "2980 South McCall Road",
        "Town": "Englewood",
        "StateOrProvince": "Charlotte County",
        "Postcode": "34224",
        "CountryID": 2,
        "Latitude": 26.9347411161752,
        "Longitude": -82.3088015489044,
        "ContactTelephone1": "9416988877",
        "ContactEmail": "info@lehnandvogt.com",
        "RelatedURL": "http://www.lehnandvogt.com",
        "DistanceUnit": 0
    },
    "Connections": [
        {
            "ID": 25123,
            "ConnectionTypeID": 1,
            "StatusTypeID": 50,
            "LevelID": 2,
            "Amps": 30,
            "Voltage": 240,
            "PowerKW": 7.2,
            "CurrentTypeID": 10,
            "Quantity": 1
        }
    ],
    "NumberOfPoints": 1,
    "StatusTypeID": 50,
    "DateLastStatusUpdate": "2014-05-13T07:54:00Z",
    "DataQualityLevel": 1,
    "DateCreated": "2014-05-12T17:24:00Z",
    "SubmissionStatusTypeID": 200
}