{
    "UserComments": [
        {
            "ID": 20169,
            "ChargePointID": 103104,
            "CommentTypeID": 10,
            "UserName": "markrassell",
            "Comment": "How many chargers are here!! Wow. Charging my Zoe at the max available 22kw. ",
            "Rating": 5,
            "DateCreated": "2018-09-18T12:42:44.94Z",
            "User": {
                "ID": 15812,
                "Username": "markrassell"
            },
            "CheckinStatusTypeID": 10
        }
    ],
    "MediaItems": [
        {
            "ID": 16566,
            "ChargePointID": 103104,
            "ItemURL": "https://s3-ap-southeast-2.amazonaws.com/openchargemap/images/NO/OCM103104/OCM-103104.orig.2018091812434317.jpeg",
            "ItemThumbnailURL": "https://s3-ap-southeast-2.amazonaws.com/openchargemap/images/NO/OCM103104/OCM-103104.thmb.2018091812434317.jpeg",
            "Comment": "",
            "IsEnabled": true,
            "IsVideo": false,
            "IsFeaturedItem": false,
            "IsExternalResource": false,
            "User": {
                "ID": 15812,
                "Username": "markrassell"
            },
            "DateCreated": "2018-09-18T12:44:00Z"
        }
    ],
    "IsRecentlyVerified": false,
    "ID": 103104,
    "UUID": "A927AFA8-86E9-4B02-846E-83A6F62A1F33",
    "DataProviderID": 1,
    "DataProvidersReference": "4698",
    "AddressInfo": {
        "ID": 103450,
        "Title": "Tinghusplassen P-plass",
        "AddressLine1": "Bergsliplassen ",
        "Town": "VOSS",
        "StateOrProvince": "Vestland",
        "Postcode": "5700",
        "CountryID": 168,
        "Latitude": 60.62758,
        "Longitude": 6.41762,
        "AccessComments": "",
        "DistanceUnit": 0
    },
    "Connections": [
        {
            "ID": 145493,
            "ConnectionTypeID": 0,
            "Reference": "13",
            "LevelID": 2,
            "Amps": 100,
            "Voltage": 500,
            "PowerKW": 50,
            "Comments": "Mode 4"
        },
        {
            "ID": 145494,
            "ConnectionTypeID": 0,
            "Reference": "14",
            "LevelID": 2,
            "Amps": 100,
            "Voltage": 500,
            "PowerKW": 50,
            "Comments": "Mode 4"
        },
        {
            "ID": 145495,
            "ConnectionTypeID": 0,
            "Reference": "15",
            "LevelID": 2,
            "Amps": 375,
            "Voltage": 400,
            "PowerKW": 150,
            "Comments": "Mode 4"
        },
        {
            "ID": 145496,
            "ConnectionTypeID": 0,
            "Reference": "16",
            "LevelID": 2,
            "Amps": 100,
            "Voltage": 500,
            "PowerKW": 50,
            "Comments": "Mode 4"
        },
        {
            "ID": 145497,
            "ConnectionTypeID": 0,
            "Reference": "17",
            "LevelID": 2,
            "Amps": 100,
            "Voltage": 500,
            "PowerKW": 50,
            "Comments": "Mode 4"
        },
        {
            "ID": 145498,
            "ConnectionTypeID": 0,
            "Reference": "18",
            "LevelID": 2,
            "Amps": 100,
            "Voltage": 500,
            "PowerKW": 50,
            "Comments": "Mode 4"
        },
        {
            "ID": 145499,
            "ConnectionTypeID": 0,
            "Reference": "19",
            "LevelID": 2,
            "PowerKW": 350,
            "Comments": "Mode 4"
        },
        {
            "ID": 145500,
            "ConnectionTypeID": 0,
            "Reference": "20",
            "LevelID": 2,
            "Amps": 375,
            "Voltage": 400,
            "PowerKW": 150,
            "Comments": "Mode 4"
        },
        {
            "ID": 145501,
            "ConnectionTypeID": 0,
            "Reference": "21",
            "LevelID": 2,
            "Amps": 100,
            "Voltage": 500,
            "PowerKW": 50,
            "Comments": "Mode 4"
        },
        {
            "ID": 145502,
            "ConnectionTypeID": 0,
            "Reference": "22",
            "LevelID": 2,
            "Amps": 375,
            "Voltage": 400,
            "PowerKW": 150,
            "Comments": "Mode 4"
        },
        {
            "ID": 145503,
            "ConnectionTypeID": 0,
            "Reference": "11",
            "LevelID": 2,
            "Amps": 100,
            "Voltage": 500,
            "PowerKW": 50,
            "Comments": "Mode 4"
        },
        {
            "ID": 145504,
            "ConnectionTypeID": 0,
            "Reference": "12",
            "LevelID": 2,
            "Amps": 375,
            "Voltage": 400,
            "PowerKW": 150,
            "Comments": "Mode 4"
        }
    ],
    "NumberOfPoints": 22,
    "DateLastStatusUpdate": "2020-05-26T08:24:00Z",
    "DataQualityLevel": 2,
    "DateCreated": "2018-04-21T06:52:00Z",
    "SubmissionStatusTypeID": 100
}