{
    "IsRecentlyVerified": false,
    "ID": 46066,
    "UUID": "24B9BF4A-963A-4ADB-9136-AF1DDF8F67DB",
    "DataProviderID": 1,
    "DataProvidersReference": "1785",
    "AddressInfo": {
        "ID": 46412,
        "Title": "Blichs gate p-hus",
        "AddressLine1": "Blichs gate 6",
        "Town": "DRAMMEN",
        "StateOrProvince": "Viken",
        "Postcode": "3044",
        "CountryID": 168,
        "Latitude": 59.7378503,
        "Longitude": 10.2026783,
        "AccessComments": "4 ladepunkt på plan 1\r17 ladepunkt på plan U3",
        "DistanceUnit": 0
    },
    "Connections": [
        {
            "ID": 56729,
            "ConnectionTypeID": 0,
            "Reference": "7",
            "LevelID": 2,
            "Amps": 32,
            "Voltage": 230,
            "PowerKW": 7.4,
            "Comments": "Mode 3"
        },
        {
            "ID": 85006,
            "ConnectionTypeID": 0,
            "Reference": "8",
            "LevelID": 2,
            "Amps": 32,
            "Voltage": 230,
            "PowerKW": 7.4,
            "Comments": "Mode 3"
        },
        {
            "ID": 85007,
            "ConnectionTypeID": 0,
            "Reference": "9",
            "LevelID": 2,
            "Amps": 32,
            "Voltage": 230,
            "PowerKW": 7.4,
            "Comments": "Mode 3"
        },
        {
            "ID": 85008,
            "ConnectionTypeID": 0,
            "Reference": "10",
            "LevelID": 2,
            "Amps": 32,
            "Voltage": 230,
            "PowerKW": 7.4,
            "Comments": "Mode 3"
        },
        {
            "ID": 85009,
            "ConnectionTypeID": 0,
            "Reference": "11",
            "LevelID": 2,
            "Amps": 32,
            "Voltage": 230,
            "PowerKW": 7.4,
            "Comments": "Mode 3"
        },
        {
            "ID": 88414,
            "ConnectionTypeID": 0,
            "Reference": "12",
            "LevelID": 2,
            "Amps": 32,
            "Voltage": 230,
            "PowerKW": 7.4,
            "Comments": "Mode 3"
        },
        {
            "ID": 223377,
            "ConnectionTypeID": 0,
            "Reference": "21",
            "LevelID": 2,
            "Amps": 32,
            "Voltage": 230,
            "PowerKW": 7.4,
            "Comments": "Mode 3"
        },
        {
            "ID": 223378,
            "ConnectionTypeID": 0,
            "Reference": "19",
            "LevelID": 2,
            "Amps": 32,
            "Voltage": 230,
            "PowerKW": 7.4,
            "Comments": "Mode 3"
        },
        {
            "ID": 223379,
            "ConnectionTypeID": 0,
            "Reference": "18",
            "LevelID": 2,
            "Amps": 32,
            "Voltage": 230,
            "PowerKW": 7.4,
            "Comments": "Mode 3"
        },
        {
            "ID": 223380,
            "ConnectionTypeID": 0,
            "Reference": "17",
            "LevelID": 2,
            "Amps": 32,
            "Voltage": 230,
            "PowerKW": 7.4,
            "Comments": "Mode 3"
        },
        {
            "ID": 223381,
            "ConnectionTypeID": 0,
            "Reference": "16",
            "LevelID": 2,
            "Amps": 32,
            "Voltage": 230,
            "PowerKW": 7.4,
            "Comments": "Mode 3"
        },
        {
            "ID": 223382,
            "ConnectionTypeID": 0,
            "Reference": "15",
            "LevelID": 2,
            "Amps": 32,
            "Voltage": 230,
            "PowerKW": 7.4,
            "Comments": "Mode 3"
        },
        {
            "ID": 223383,
            "ConnectionTypeID": 0,
            "Reference": "14",
            "LevelID": 2,
            "Amps": 32,
            "Voltage": 230,
            "PowerKW": 7.4,
            "Comments": "Mode 3"
        },
        {
            "ID": 223384,
            "ConnectionTypeID": 0,
            "Reference": "20",
            "LevelID": 2,
            "Amps": 32,
            "Voltage": 230,
            "PowerKW": 7.4,
            "Comments": "Mode 3"
        },
        {
            "ID": 223385,
            "ConnectionTypeID": 0,
            "Reference": "13",
            "LevelID": 2,
            "Amps": 32,
            "Voltage": 230,
            "PowerKW": 7.4,
            "Comments": "Mode 3"
        }
    ],
    "NumberOfPoints": 21,
    "DateLastStatusUpdate": "2020-05-26T08:23:00Z",
    "DataQualityLevel": 2,
    "DateCreated": "2015-05-03T00:54:00Z",
    "SubmissionStatusTypeID": 100
}