{
    "IsRecentlyVerified": false,
    "ID": 36402,
    "UUID": "83BCE9AF-F4EF-44D5-A758-29ABDFFC2B37",
    "DataProviderID": 26,
    "DataProvidersReference": "46208",
    "OperatorID": 73,
    "OperatorsReference": "EV-Box EVB-P1402058",
    "UsageCost": "0.00 jaarabonnement",
    "AddressInfo": {
        "ID": 36748,
        "Title": "Alida de Jongstraat 57",
        "AddressLine1": "Alida de Jongstraat 57",
        "Town": "Alphen aan den Rijn",
        "Postcode": "2401 KS",
        "CountryID": 159,
        "Latitude": 52.15641,
        "Longitude": 4.66233,
        "RelatedURL": "http://www.ev-box.nl",
        "DistanceUnit": 0
    },
    "Connections": [
        {
            "ID": 39913,
            "ConnectionTypeID": 25,
            "LevelID": 2,
            "PowerKW": 5,
            "CurrentTypeID": 10
        }
    ],
    "NumberOfPoints": 1,
    "StatusTypeID": 50,
    "DateLastStatusUpdate": "2016-06-04T02:51:00Z",
    "DataQualityLevel": 3,
    "DateCreated": "2015-01-09T06:05:00Z",
    "SubmissionStatusTypeID": 100
}