{
    "IsRecentlyVerified": false,
    "ID": 19433,
    "UUID": "05175589-D5AB-42B8-90C7-F7BC5940BECD",
    "DataProviderID": 2,
    "DataProvidersReference": "52912",
    "UsageTypeID": 2,
    "AddressInfo": {
        "ID": 19778,
        "Title": "Westar Energy - Lawrence Energy Center",
        "AddressLine1": "1250 N 1800 Rd",
        "Town": "Lawrence",
        "StateOrProvince": "KS",
        "Postcode": "66049",
        "CountryID": 2,
        "Latitude": 39.006795,
        "Longitude": -95.269499,
        "ContactTelephone1": "",
        "AccessComments": "Fleet use only",
        "RelatedURL": "",
        "DistanceUnit": 0
    },
    "Connections": [
        {
            "ID": 19738,
            "ConnectionTypeID": 1,
            "LevelID": 2,
            "Amps": 16,
            "Voltage": 230,
            "PowerKW": 3,
            "CurrentTypeID": 10,
            "Quantity": 1
        },
        {
            "ID": 22355,
            "ConnectionTypeID": 1,
            "LevelID": 2,
            "Quantity": 1
        }
    ],
    "DateLastStatusUpdate": "2019-04-06T04:03:00Z",
    "DataQualityLevel": 3,
    "DateCreated": "2013-09-27T03:45:00Z",
    "SubmissionStatusTypeID": 200
}