{
    "IsRecentlyVerified": false,
    "ID": 74828,
    "UUID": "25213ED5-F052-4E6F-9894-54C634AF82A8",
    "DataProviderID": 1,
    "OperatorID": 3253,
    "OperatorsReference": "AT*SMA*EAT0700738*001AC,AT*SMA*EAT0700738*001DC,AT*SMA*EAT0700738*002DC",
    "UsageTypeID": 4,
    "AddressInfo": {
        "ID": 75174,
        "Title": "OMV, 6574 Pettneu am Arlberg",
        "AddressLine1": "Schnann-Gewerbezone 150",
        "Town": "Pettneu am Arlberg",
        "StateOrProvince": "Landeck",
        "Postcode": "6574",
        "CountryID": 19,
        "Latitude": 47.148886,
        "Longitude": 10.373762,
        "DistanceUnit": 0
    },
    "Connections": [
        {
            "ID": 107956,
            "ConnectionTypeID": 2,
            "StatusTypeID": 0,
            "LevelID": 3,
            "Amps": 125,
            "Voltage": 400,
            "PowerKW": 50,
            "CurrentTypeID": 30,
            "Quantity": 1
        },
        {
            "ID": 107957,
            "ConnectionTypeID": 1036,
            "StatusTypeID": 0,
            "LevelID": 3,
            "Amps": 63,
            "Voltage": 400,
            "PowerKW": 43,
            "CurrentTypeID": 20,
            "Quantity": 1
        },
        {
            "ID": 107958,
            "ConnectionTypeID": 33,
            "StatusTypeID": 0,
            "LevelID": 3,
            "Amps": 125,
            "Voltage": 400,
            "PowerKW": 50,
            "CurrentTypeID": 30,
            "Quantity": 1
        }
    ],
    "NumberOfPoints": 2,
    "StatusTypeID": 0,
    "DateLastStatusUpdate": "2017-01-09T09:39:00Z",
    "DataQualityLevel": 1,
    "DateCreated": "2016-12-04T14:25:00Z",
    "SubmissionStatusTypeID": 200
}