{
    "IsRecentlyVerified": false,
    "ID": 101744,
    "UUID": "964A302F-A02D-4840-9059-EC46F380D532",
    "DataProviderID": 1,
    "OperatorID": 3261,
    "UsageTypeID": 4,
    "UsageCost": "Free",
    "AddressInfo": {
        "ID": 102090,
        "Title": "Gstadter Straße",
        "AddressLine1": "Gstadter Straße 2",
        "Town": "Breitbrunn am Chiemsee",
        "StateOrProvince": "Landkreis Rosenheim",
        "Postcode": "83254",
        "CountryID": 87,
        "Latitude": 47.88967824786108,
        "Longitude": 12.400396003670153,
        "AccessComments": "In der Ortsmitte unmittelbar neben dem Dorfweiher hängt die durchgehend verfügbare Wallbox an der rückwärtigen Hauswand des Gebäudes mit der Hausnummer 2. Gesamtleistung 22kW!",
        "RelatedURL": "http://www.mobilstrom-chiemgau.de/",
        "DistanceUnit": 0
    },
    "Connections": [
        {
            "ID": 143621,
            "ConnectionTypeID": 25,
            "StatusTypeID": 50,
            "LevelID": 2,
            "Amps": 32,
            "Voltage": 400,
            "PowerKW": 22,
            "CurrentTypeID": 20,
            "Quantity": 2
        }
    ],
    "NumberOfPoints": 2,
    "StatusTypeID": 50,
    "DateLastStatusUpdate": "2018-04-06T12:27:00Z",
    "DataQualityLevel": 1,
    "DateCreated": "2018-04-06T12:27:00Z",
    "SubmissionStatusTypeID": 200
}