{
    "IsRecentlyVerified": false,
    "ID": 64815,
    "UUID": "02528EA2-9F9B-4BFA-BAE7-D57D70862CE1",
    "DataProviderID": 1,
    "OperatorID": 45,
    "UsageTypeID": 6,
    "AddressInfo": {
        "ID": 65161,
        "Title": "Hotel Zum Löwen",
        "AddressLine1": "Marktstraße 30",
        "Town": "Duderstadt",
        "StateOrProvince": "Landkreis Göttingen",
        "Postcode": "37115",
        "CountryID": 87,
        "Latitude": 51.5121146598563,
        "Longitude": 10.258748645369,
        "AccessComments": "Ein kostenpflichtiger Parkplatz für Gäste.",
        "RelatedURL": "http://www.hotelzumloewen.de/de/start.html",
        "DistanceUnit": 0
    },
    "Connections": [
        {
            "ID": 83330,
            "ConnectionTypeID": 17,
            "StatusTypeID": 50,
            "LevelID": 2,
            "Amps": 32,
            "Voltage": 400,
            "PowerKW": 22,
            "CurrentTypeID": 20,
            "Quantity": 1
        }
    ],
    "NumberOfPoints": 1,
    "StatusTypeID": 50,
    "DateLastStatusUpdate": "2016-03-23T17:01:00Z",
    "DataQualityLevel": 1,
    "DateCreated": "2016-03-23T09:41:00Z",
    "SubmissionStatusTypeID": 200
}