{
    "IsRecentlyVerified": false,
    "ID": 150549,
    "UUID": "45CE6006-E2D0-4D99-A86D-0D1F10C6953C",
    "DataProviderID": 28,
    "DataProvidersReference": "FR*S11*P11205*001",
    "OperatorID": 3257,
    "UsageTypeID": 5,
    "AddressInfo": {
        "ID": 150902,
        "Title": "LIMOUSIS - Parking Grotte",
        "AddressLine1": "Parking Grotte 11600 LIMOUSIS",
        "CountryID": 80,
        "Latitude": 43.3422222,
        "Longitude": 2.412777778,
        "AccessComments": "24h/24 7j/7",
        "DistanceUnit": 0
    },
    "Connections": [
        {
            "ID": 209422,
            "ConnectionTypeID": 28,
            "StatusTypeID": 50,
            "LevelID": 2,
            "PowerKW": 22,
            "CurrentTypeID": 10
        },
        {
            "ID": 209423,
            "ConnectionTypeID": 1036,
            "StatusTypeID": 50,
            "LevelID": 2,
            "PowerKW": 22,
            "CurrentTypeID": 20
        },
        {
            "ID": 209424,
            "ConnectionTypeID": 26,
            "StatusTypeID": 50,
            "LevelID": 2,
            "PowerKW": 22
        },
        {
            "ID": 238550,
            "ConnectionTypeID": 28,
            "StatusTypeID": 50,
            "LevelID": 2,
            "PowerKW": 22,
            "CurrentTypeID": 10
        },
        {
            "ID": 238551,
            "ConnectionTypeID": 1036,
            "StatusTypeID": 50,
            "LevelID": 2,
            "PowerKW": 22,
            "CurrentTypeID": 20
        },
        {
            "ID": 238552,
            "ConnectionTypeID": 26,
            "StatusTypeID": 50,
            "LevelID": 2,
            "PowerKW": 22
        }
    ],
    "GeneralComments": "Recharge par badge et avec une application smartphone",
    "StatusTypeID": 50,
    "DateLastStatusUpdate": "2020-08-27T05:10:00Z",
    "DataQualityLevel": 2,
    "DateCreated": "2020-03-15T06:17:00Z",
    "SubmissionStatusTypeID": 100
}