{
    "IsRecentlyVerified": false,
    "ID": 113258,
    "UUID": "20FAADBD-4D20-438F-86F2-A078F630F2F4",
    "DataProviderID": 2,
    "DataProvidersReference": "104722",
    "OperatorID": 5,
    "UsageTypeID": 1,
    "AddressInfo": {
        "ID": 113604,
        "Title": "ICBC",
        "AddressLine1": "151 Esplanade W",
        "Town": "North Vancouver",
        "StateOrProvince": "BC",
        "Postcode": "V7M 3H9",
        "CountryID": 44,
        "Latitude": 49.311678,
        "Longitude": -123.081372,
        "ContactTelephone1": "888-758-4389",
        "AccessComments": "24 hours daily",
        "RelatedURL": "http://www.chargepoint.com/",
        "DistanceUnit": 0
    },
    "Connections": [
        {
            "ID": 159452,
            "ConnectionTypeID": 1,
            "LevelID": 2,
            "Amps": 16,
            "Voltage": 230,
            "PowerKW": 3.7,
            "CurrentTypeID": 10,
            "Quantity": 4
        }
    ],
    "DateLastStatusUpdate": "2020-06-26T03:12:00Z",
    "DataQualityLevel": 3,
    "DateCreated": "2018-11-28T02:04:00Z",
    "SubmissionStatusTypeID": 100
}