{
    "IsRecentlyVerified": false,
    "ID": 45177,
    "UUID": "E804448C-1394-4A1E-B32E-C486A24CB386",
    "DataProviderID": 1,
    "OperatorID": 105,
    "UsageTypeID": 1,
    "UsageCost": "0",
    "AddressInfo": {
        "ID": 45523,
        "Title": "E-Bike Station Rathaus",
        "AddressLine1": "Strandallee 42",
        "AddressLine2": "",
        "Town": "Timmendorfer Strand",
        "StateOrProvince": "Kreis Ostholstein",
        "Postcode": "23669",
        "CountryID": 87,
        "Latitude": 54.0045236378036,
        "Longitude": 10.7747023902948,
        "ContactTelephone1": "",
        "ContactTelephone2": "",
        "ContactEmail": "",
        "AccessComments": "Im Rathaus, also wirklich nur für herausnehmbare Akkus von Elektrofahrrädern.",
        "RelatedURL": "http://www.rwe.com/web/cms/de/494436/e-bikes-on-tour/ladestationen/",
        "DistanceUnit": 0
    },
    "Connections": [
        {
            "ID": 55694,
            "ConnectionTypeID": 28,
            "StatusTypeID": 50,
            "LevelID": 1,
            "Amps": 10,
            "Voltage": 230,
            "PowerKW": 2.3,
            "CurrentTypeID": 10,
            "Quantity": 3
        }
    ],
    "NumberOfPoints": 3,
    "GeneralComments": "",
    "StatusTypeID": 50,
    "DateLastStatusUpdate": "2015-08-21T16:22:00Z",
    "DataQualityLevel": 1,
    "DateCreated": "2015-04-28T07:13:00Z",
    "SubmissionStatusTypeID": 200
}