{
    "IsRecentlyVerified": false,
    "ID": 165620,
    "UUID": "A635C01F-0107-4F8D-B554-7F661CBEFAD6",
    "DataProviderID": 28,
    "DataProvidersReference": "FR*S40*PMB40*58",
    "OperatorID": 3407,
    "UsageTypeID": 5,
    "AddressInfo": {
        "ID": 165979,
        "Title": "ESCOURCE - Zone D'Activités",
        "AddressLine1": "Zone D'Activités 40210 ESCOURCE",
        "CountryID": 80,
        "Latitude": 44.14580917,
        "Longitude": -0.972000778,
        "AccessComments": "24h/24 7j/7",
        "DistanceUnit": 0
    },
    "Connections": [
        {
            "ID": 241319,
            "ConnectionTypeID": 33,
            "StatusTypeID": 50,
            "LevelID": 3,
            "PowerKW": 50,
            "CurrentTypeID": 30
        },
        {
            "ID": 241320,
            "ConnectionTypeID": 2,
            "StatusTypeID": 50,
            "LevelID": 3,
            "PowerKW": 50,
            "CurrentTypeID": 30
        },
        {
            "ID": 241321,
            "ConnectionTypeID": 1036,
            "StatusTypeID": 50,
            "LevelID": 2,
            "PowerKW": 36,
            "CurrentTypeID": 20
        },
        {
            "ID": 241322,
            "ConnectionTypeID": 28,
            "StatusTypeID": 50,
            "LevelID": 2,
            "PowerKW": 4,
            "CurrentTypeID": 10
        }
    ],
    "GeneralComments": "Recharge par badge et avec une application smartphone",
    "StatusTypeID": 50,
    "DateLastStatusUpdate": "2020-08-27T05:11:00Z",
    "DataQualityLevel": 2,
    "DateCreated": "2020-08-27T05:11:00Z",
    "SubmissionStatusTypeID": 100
}