{
    "IsRecentlyVerified": false,
    "ID": 61853,
    "UUID": "008D20DC-F0D5-4F89-A178-13712B40B20B",
    "DataProviderID": 2,
    "DataProvidersReference": "73468",
    "UsageTypeID": 1,
    "AddressInfo": {
        "ID": 62199,
        "Title": "Piedmont Triad International Airport",
        "AddressLine1": "1000 A Ted Johnson Pkwy",
        "Town": "Greensboro",
        "StateOrProvince": "NC",
        "Postcode": "27409",
        "CountryID": 2,
        "Latitude": 36.105313,
        "Longitude": -79.938316,
        "ContactTelephone1": "336-665-5657",
        "AccessComments": "24 hours daily",
        "RelatedURL": "",
        "DistanceUnit": 0
    },
    "Connections": [
        {
            "ID": 78746,
            "ConnectionTypeID": 0,
            "LevelID": 1,
            "Amps": 16,
            "Voltage": 120,
            "PowerKW": 1,
            "CurrentTypeID": 10,
            "Quantity": 4
        }
    ],
    "DateLastStatusUpdate": "2019-04-06T04:02:00Z",
    "DataQualityLevel": 3,
    "DateCreated": "2016-03-03T11:38:00Z",
    "SubmissionStatusTypeID": 100
}