{
    "IsRecentlyVerified": false,
    "ID": 107067,
    "UUID": "C4DBC8D9-7555-453F-B497-A143DDA43CEB",
    "DataProviderID": 1,
    "OperatorID": 229,
    "UsageTypeID": 4,
    "UsageCost": "$0.25/kWh + $0.25/min",
    "AddressInfo": {
        "ID": 107413,
        "Title": "The Warehouse Albany",
        "AddressLine1": "186 Don Mckinnon Drive",
        "Town": "Albany",
        "Postcode": "0632",
        "CountryID": 161,
        "Latitude": -36.730292,
        "Longitude": 174.704615,
        "DistanceUnit": 0
    },
    "Connections": [
        {
            "ID": 150950,
            "ConnectionTypeID": 2,
            "StatusTypeID": 50,
            "LevelID": 3,
            "PowerKW": 50,
            "CurrentTypeID": 30,
            "Quantity": 1
        },
        {
            "ID": 150951,
            "ConnectionTypeID": 33,
            "StatusTypeID": 50,
            "LevelID": 3,
            "PowerKW": 50,
            "CurrentTypeID": 30,
            "Quantity": 1
        }
    ],
    "NumberOfPoints": 2,
    "StatusTypeID": 50,
    "DateLastStatusUpdate": "2018-07-16T22:30:00Z",
    "DataQualityLevel": 1,
    "DateCreated": "2018-07-16T17:34:00Z",
    "SubmissionStatusTypeID": 200
}