{
    "IsRecentlyVerified": false,
    "ID": 9889,
    "UUID": "F092CC92-80B1-4AAA-A253-6EC887608D72",
    "DataProviderID": 15,
    "DataProvidersReference": "17289",
    "OperatorID": 5,
    "AddressInfo": {
        "ID": 9786,
        "Title": "765 Portola Road",
        "AddressLine1": "765 Portola Road",
        "Town": "Portola Valley",
        "StateOrProvince": "California",
        "Postcode": "94028",
        "CountryID": 2,
        "Latitude": 37.38200378,
        "Longitude": -122.22995,
        "ContactTelephone1": "",
        "RelatedURL": "http://carstations.com/17289",
        "DistanceUnit": 0
    },
    "Connections": [
        {
            "ID": 7741,
            "ConnectionTypeID": 1,
            "Reference": "J1772",
            "LevelID": 2
        }
    ],
    "StatusTypeID": 0,
    "DateLastStatusUpdate": "2017-11-04T14:04:00Z",
    "DataQualityLevel": 2,
    "DateCreated": "2012-05-01T20:38:00Z",
    "SubmissionStatusTypeID": 100
}