{
    "IsRecentlyVerified": false,
    "ID": 157291,
    "UUID": "4796DF8E-7C9A-43F2-BA83-E16EE163DC56",
    "DataProviderID": 19,
    "DataProvidersReference": "1255",
    "AddressInfo": {
        "ID": 157645,
        "Title": "Fjellet P-hus, Tromsø",
        "AddressLine1": "Fjellet P-hus ",
        "Town": "TROMSØ",
        "StateOrProvince": "Troms og Finnmark",
        "Postcode": "9008",
        "CountryID": 168,
        "Latitude": 69.64913,
        "Longitude": 18.95318,
        "AccessComments": "To innkjøringer fra sentrumsgater og to fra Sentrumstangenten (tunnel forbi byen). Ladepunkt er et stykke inn i storhallen.\rKoordinatene er til inngangen nærmest sentrum.",
        "DistanceUnit": 0
    },
    "Connections": [
        {
            "ID": 226509,
            "ConnectionTypeID": 25,
            "Reference": "1",
            "LevelID": 2,
            "Amps": 32,
            "Voltage": 230,
            "PowerKW": 7.4,
            "CurrentTypeID": 10,
            "Comments": "Mode 3"
        },
        {
            "ID": 226510,
            "ConnectionTypeID": 25,
            "Reference": "2",
            "LevelID": 2,
            "Amps": 32,
            "Voltage": 230,
            "PowerKW": 7.4,
            "CurrentTypeID": 10,
            "Comments": "Mode 3"
        },
        {
            "ID": 226511,
            "ConnectionTypeID": 25,
            "Reference": "3",
            "LevelID": 2,
            "Amps": 32,
            "Voltage": 230,
            "PowerKW": 7.4,
            "CurrentTypeID": 10,
            "Comments": "Mode 3"
        },
        {
            "ID": 226512,
            "ConnectionTypeID": 25,
            "Reference": "4",
            "LevelID": 2,
            "Amps": 32,
            "Voltage": 230,
            "PowerKW": 7.4,
            "CurrentTypeID": 10,
            "Comments": "Mode 3"
        }
    ],
    "NumberOfPoints": 4,
    "StatusTypeID": 0,
    "DateLastStatusUpdate": "2021-03-24T05:12:00Z",
    "DataQualityLevel": 2,
    "DateCreated": "2020-05-26T08:25:00Z",
    "SubmissionStatusTypeID": 100
}