{
    "UserComments": [
        {
            "ID": 20934,
            "ChargePointID": 90066,
            "CommentTypeID": 10,
            "UserName": "ForumElettrico.it",
            "RelatedURL": "https://www.forumelettrico.it/forum/colonnina-comune-di-cattolica-22-kw-cattolica-rn-piazzale-antonio-de-curtis-t5466.html",
            "DateCreated": "2019-04-27T08:51:03.603Z",
            "User": {
                "ID": 11749,
                "Username": "ForumElettrico.it"
            },
            "CheckinStatusTypeID": 10
        }
    ],
    "MediaItems": [
        {
            "ID": 18181,
            "ChargePointID": 90066,
            "ItemURL": "https://s3-ap-southeast-2.amazonaws.com/openchargemap/images/IT/OCM90066/OCM-90066.orig.2019042708512087.jpg",
            "ItemThumbnailURL": "https://s3-ap-southeast-2.amazonaws.com/openchargemap/images/IT/OCM90066/OCM-90066.thmb.2019042708512087.jpg",
            "Comment": "",
            "IsEnabled": true,
            "IsVideo": false,
            "IsFeaturedItem": false,
            "IsExternalResource": false,
            "User": {
                "ID": 11749,
                "Username": "ForumElettrico.it"
            },
            "DateCreated": "2019-04-27T08:52:00Z"
        },
        {
            "ID": 18182,
            "ChargePointID": 90066,
            "ItemURL": "https://s3-ap-southeast-2.amazonaws.com/openchargemap/images/IT/OCM90066/OCM-90066.orig.2019042708512774.jpg",
            "ItemThumbnailURL": "https://s3-ap-southeast-2.amazonaws.com/openchargemap/images/IT/OCM90066/OCM-90066.thmb.2019042708512774.jpg",
            "Comment": "",
            "IsEnabled": true,
            "IsVideo": false,
            "IsFeaturedItem": false,
            "IsExternalResource": false,
            "User": {
                "ID": 11749,
                "Username": "ForumElettrico.it"
            },
            "DateCreated": "2019-04-27T08:52:00Z"
        },
        {
            "ID": 18183,
            "ChargePointID": 90066,
            "ItemURL": "https://s3-ap-southeast-2.amazonaws.com/openchargemap/images/IT/OCM90066/OCM-90066.orig.2019042708513444.jpg",
            "ItemThumbnailURL": "https://s3-ap-southeast-2.amazonaws.com/openchargemap/images/IT/OCM90066/OCM-90066.thmb.2019042708513444.jpg",
            "Comment": "",
            "IsEnabled": true,
            "IsVideo": false,
            "IsFeaturedItem": false,
            "IsExternalResource": false,
            "User": {
                "ID": 11749,
                "Username": "ForumElettrico.it"
            },
            "DateCreated": "2019-04-27T08:52:00Z"
        },
        {
            "ID": 18180,
            "ChargePointID": 90066,
            "ItemURL": "https://s3-ap-southeast-2.amazonaws.com/openchargemap/images/IT/OCM90066/OCM-90066.orig.2019042708511482.jpg",
            "ItemThumbnailURL": "https://s3-ap-southeast-2.amazonaws.com/openchargemap/images/IT/OCM90066/OCM-90066.thmb.2019042708511482.jpg",
            "Comment": "",
            "IsEnabled": true,
            "IsVideo": false,
            "IsFeaturedItem": false,
            "IsExternalResource": false,
            "User": {
                "ID": 11749,
                "Username": "ForumElettrico.it"
            },
            "DateCreated": "2019-04-27T08:51:00Z"
        }
    ],
    "IsRecentlyVerified": false,
    "ID": 90066,
    "UUID": "BBD914FA-47C2-4802-B938-6F6FBB97501F",
    "DataProviderID": 1,
    "OperatorID": 80,
    "UsageTypeID": 4,
    "UsageCost": "0,40 €/kW",
    "AddressInfo": {
        "ID": 90412,
        "Title": "Eneldrive De Curtis",
        "AddressLine1": "Piazzale Antonio De Curtis",
        "Town": "Cattolica ",
        "StateOrProvince": "RN",
        "Postcode": "47841 ",
        "CountryID": 112,
        "Latitude": 43.9642630570311,
        "Longitude": 12.7493019863593,
        "RelatedURL": "http://eneldrive.it",
        "DistanceUnit": 0
    },
    "Connections": [
        {
            "ID": 127674,
            "ConnectionTypeID": 25,
            "StatusTypeID": 50,
            "LevelID": 2,
            "Amps": 32,
            "Voltage": 400,
            "PowerKW": 22,
            "CurrentTypeID": 20,
            "Quantity": 1
        },
        {
            "ID": 127675,
            "ConnectionTypeID": 36,
            "StatusTypeID": 50,
            "LevelID": 2,
            "Amps": 13,
            "Voltage": 240,
            "PowerKW": 3,
            "CurrentTypeID": 10,
            "Quantity": 1
        }
    ],
    "NumberOfPoints": 2,
    "StatusTypeID": 50,
    "DateLastStatusUpdate": "2019-04-27T08:52:00Z",
    "DataQualityLevel": 1,
    "DateCreated": "2017-07-05T13:46:00Z",
    "SubmissionStatusTypeID": 200
}