{
    "IsRecentlyVerified": false,
    "ID": 31927,
    "UUID": "498C79D3-F80C-44CF-8A28-FB93C93F8C7C",
    "DataProviderID": 26,
    "DataProvidersReference": "30284",
    "OperatorID": 86,
    "OperatorsReference": "EnWB Hohenloher Straße ",
    "UsageCost": "0.00 afhankelijk van pas",
    "AddressInfo": {
        "ID": 32273,
        "Title": "Hohenloher Straße 27",
        "AddressLine1": "Hohenloher Straße 27",
        "Town": "Stuttgart",
        "Postcode": "70435",
        "CountryID": 87,
        "Latitude": 48.828836,
        "Longitude": 9.176168,
        "ContactTelephone1": "0800 3629-000",
        "ContactEmail": "-",
        "RelatedURL": "http://www.enbw.com/",
        "DistanceUnit": 0
    },
    "Connections": [
        {
            "ID": 35438,
            "ConnectionTypeID": 25,
            "LevelID": 2,
            "PowerKW": 5,
            "CurrentTypeID": 10
        }
    ],
    "NumberOfPoints": 2,
    "StatusTypeID": 50,
    "DateLastStatusUpdate": "2016-03-03T12:34:00Z",
    "DataQualityLevel": 3,
    "DateCreated": "2015-01-09T06:03:00Z",
    "SubmissionStatusTypeID": 100
}