{
    "IsRecentlyVerified": false,
    "ID": 64996,
    "UUID": "32889266-E228-4449-B1AF-D3405F4D2417",
    "DataProviderID": 1,
    "OperatorID": 100,
    "UsageTypeID": 1,
    "UsageCost": "Free",
    "AddressInfo": {
        "ID": 65342,
        "Title": "Interparking Botanique",
        "AddressLine1": "Boulevard du Jardin Botanique 29",
        "Town": "Brussels",
        "Postcode": "1000",
        "CountryID": 26,
        "Latitude": 50.85446100000001,
        "Longitude": 4.36015969999994,
        "RelatedURL": "http://www.interparking.be/en/find-parking/Botanique%20-%20Saint-Jean/",
        "DistanceUnit": 0
    },
    "Connections": [
        {
            "ID": 83651,
            "ConnectionTypeID": 25,
            "StatusTypeID": 50,
            "LevelID": 2,
            "Voltage": 230,
            "CurrentTypeID": 10,
            "Quantity": 1
        }
    ],
    "NumberOfPoints": 1,
    "GeneralComments": "charge point activated with Interparking P-card. http://prod.interparking.be/en/payment%20products/P-Card/ . Staff can activate charge if you don't have one.",
    "StatusTypeID": 50,
    "DateLastStatusUpdate": "2016-04-04T08:49:00Z",
    "DataQualityLevel": 1,
    "DateCreated": "2016-04-04T08:49:00Z",
    "SubmissionStatusTypeID": 200
}