{
    "IsRecentlyVerified": false,
    "ID": 68696,
    "UUID": "C40A23C7-8B98-422C-B4EE-26869BC01DF8",
    "DataProviderID": 1,
    "OperatorID": 105,
    "UsageTypeID": 1,
    "UsageCost": "Free",
    "AddressInfo": {
        "ID": 69042,
        "Title": "Socar",
        "AddressLine1": "area di servizio",
        "AddressLine2": "",
        "Town": "Bursins",
        "StateOrProvince": "",
        "Postcode": "1183",
        "CountryID": 217,
        "Latitude": 46.818188,
        "Longitude": 8.227511999999999,
        "ContactTelephone1": "",
        "ContactTelephone2": "",
        "ContactEmail": "",
        "AccessComments": "",
        "RelatedURL": "",
        "DistanceUnit": 0
    },
    "Connections": [
        {
            "ID": 96345,
            "ConnectionTypeID": 25,
            "StatusTypeID": 0,
            "LevelID": 2,
            "PowerKW": 43
        }
    ],
    "NumberOfPoints": 1,
    "GeneralComments": "",
    "StatusTypeID": 50,
    "DateLastStatusUpdate": "2016-06-17T19:29:00Z",
    "DataQualityLevel": 1,
    "DateCreated": "2016-06-17T15:25:00Z",
    "SubmissionStatusTypeID": 200
}