{
    "IsRecentlyVerified": false,
    "ID": 35247,
    "UUID": "415F926D-AE20-4182-9DAE-C8E3D0CB23B7",
    "DataProviderID": 26,
    "DataProvidersReference": "37752",
    "OperatorID": 179,
    "OperatorsReference": "Ecotap 1335205",
    "UsageCost": "0.00 afhankelijk van pas",
    "AddressInfo": {
        "ID": 35593,
        "Title": "'s-Gravenzandseweg",
        "AddressLine1": "'s-Gravenzandseweg",
        "Town": "Westland",
        "Postcode": "2291 NB",
        "CountryID": 159,
        "Latitude": 52.017236,
        "Longitude": 4.275338,
        "RelatedURL": "http://www.ecotap.nl",
        "DistanceUnit": 0
    },
    "Connections": [
        {
            "ID": 38758,
            "ConnectionTypeID": 25,
            "LevelID": 2,
            "PowerKW": 11,
            "CurrentTypeID": 10
        }
    ],
    "NumberOfPoints": 2,
    "StatusTypeID": 50,
    "DateLastStatusUpdate": "2016-06-04T02:44:00Z",
    "DataQualityLevel": 3,
    "DateCreated": "2015-01-09T06:04:00Z",
    "SubmissionStatusTypeID": 100
}