{
    "IsRecentlyVerified": false,
    "ID": 174201,
    "UUID": "283F3EE4-FC97-4FD8-BE8F-B672CB521281",
    "DataProviderID": 1,
    "OperatorID": 89,
    "UsageTypeID": 1,
    "AddressInfo": {
        "ID": 174560,
        "Title": "Red Hill Rest Area",
        "AddressLine1": "Red Hill Rest Area",
        "Town": "",
        "StateOrProvince": "BC",
        "Postcode": "",
        "CountryID": 44,
        "Latitude": 50.63997136189087,
        "Longitude": -121.34318933817417,
        "DistanceUnit": 0
    },
    "Connections": [
        {
            "ID": 269297,
            "ConnectionTypeID": 32,
            "StatusTypeID": 50,
            "LevelID": 3,
            "PowerKW": 50,
            "CurrentTypeID": 30,
            "Quantity": 2
        },
        {
            "ID": 269298,
            "ConnectionTypeID": 2,
            "StatusTypeID": 50,
            "LevelID": 3,
            "PowerKW": 50,
            "CurrentTypeID": 30,
            "Quantity": 2
        },
        {
            "ID": 269299,
            "ConnectionTypeID": 1,
            "StatusTypeID": 50,
            "LevelID": 2,
            "PowerKW": 7,
            "CurrentTypeID": 10,
            "Quantity": 1
        }
    ],
    "NumberOfPoints": 3,
    "StatusTypeID": 50,
    "DateLastStatusUpdate": "2021-03-28T12:21:00Z",
    "DataQualityLevel": 1,
    "DateCreated": "2021-03-21T17:46:00Z",
    "SubmissionStatusTypeID": 200
}