{
    "IsRecentlyVerified": false,
    "ID": 179736,
    "UUID": "A5E31205-19C7-4BDB-8582-39B5E42C2E17",
    "DataProviderID": 29,
    "DataProvidersReference": "13567",
    "OperatorID": 3423,
    "AddressInfo": {
        "ID": 180095,
        "Title": "Hauptstraße 2a",
        "AddressLine1": "Hauptstraße 2a",
        "Town": "Salzhemmendorf",
        "Postcode": "31020",
        "CountryID": 87,
        "Latitude": 52.06611,
        "Longitude": 9.58517,
        "DistanceUnit": 0
    },
    "Connections": [
        {
            "ID": 281938,
            "ConnectionTypeID": 25,
            "StatusTypeID": 50,
            "LevelID": 2,
            "PowerKW": 22,
            "CurrentTypeID": 20
        },
        {
            "ID": 281939,
            "ConnectionTypeID": 25,
            "StatusTypeID": 50,
            "LevelID": 2,
            "PowerKW": 22,
            "CurrentTypeID": 20
        }
    ],
    "StatusTypeID": 50,
    "DateLastStatusUpdate": "2021-07-12T02:48:00Z",
    "MetadataValues": [
        {
            "ID": 12030,
            "MetadataFieldID": 4,
            "ItemValue": "Data from the German chargepoint registry provided by Bundesnetzagentur.de under the CC-BY 4.0 license"
        }
    ],
    "DataQualityLevel": 3,
    "DateCreated": "2021-07-08T09:59:00Z",
    "SubmissionStatusTypeID": 100
}