{
    "IsRecentlyVerified": false,
    "ID": 3360,
    "UUID": "9DFE8777-499B-4E37-8F5C-DBFCA830EE92",
    "DataProviderID": 1,
    "OperatorID": 6,
    "UsageTypeID": 6,
    "AddressInfo": {
        "ID": 3361,
        "Title": "Campbell-Nelson Nissan",
        "AddressLine1": "24325 Highway 99",
        "Town": "Edmonds",
        "StateOrProvince": "WA",
        "Postcode": "98026",
        "CountryID": 2,
        "Latitude": 47.778,
        "Longitude": -122.346,
        "ContactTelephone1": "425-774-2174",
        "DistanceUnit": 0
    },
    "Connections": [],
    "NumberOfPoints": 4,
    "GeneralComments": "Cost To Charge: Free Access Hours: 2  - 24hr, Business",
    "DateLastStatusUpdate": "2019-12-15T06:07:00Z",
    "DateCreated": "2010-02-28T00:00:00Z",
    "SubmissionStatusTypeID": 200
}