{
    "IsRecentlyVerified": false,
    "ID": 63805,
    "UUID": "835E48D8-4AC5-4C76-8961-C2867A73482F",
    "DataProviderID": 26,
    "DataProvidersReference": "77991",
    "OperatorID": 73,
    "OperatorsReference": "EV-Box EVB-P1449053",
    "UsageCost": "0.00 jaarabonnement",
    "AddressInfo": {
        "ID": 64151,
        "Title": "Sigarenmaker 8",
        "AddressLine1": "Sigarenmaker 8",
        "Town": "Eersel",
        "Postcode": "5521 DJ",
        "CountryID": 159,
        "Latitude": 52.23781,
        "Longitude": 5.15664,
        "RelatedURL": "http://www.ev-box.nl",
        "DistanceUnit": 0
    },
    "Connections": [
        {
            "ID": 81504,
            "ConnectionTypeID": 25,
            "LevelID": 2,
            "PowerKW": 5,
            "CurrentTypeID": 10
        },
        {
            "ID": 81505,
            "ConnectionTypeID": 25,
            "LevelID": 2,
            "PowerKW": 11,
            "CurrentTypeID": 10
        },
        {
            "ID": 81506,
            "ConnectionTypeID": 25,
            "LevelID": 2,
            "PowerKW": 11,
            "CurrentTypeID": 10
        },
        {
            "ID": 81507,
            "ConnectionTypeID": 25,
            "LevelID": 2,
            "PowerKW": 11,
            "CurrentTypeID": 10
        },
        {
            "ID": 81508,
            "ConnectionTypeID": 25,
            "LevelID": 2,
            "PowerKW": 11,
            "CurrentTypeID": 10
        },
        {
            "ID": 90925,
            "ConnectionTypeID": 25,
            "LevelID": 2,
            "PowerKW": 11,
            "CurrentTypeID": 10
        },
        {
            "ID": 90926,
            "ConnectionTypeID": 25,
            "LevelID": 2,
            "PowerKW": 11,
            "CurrentTypeID": 10
        },
        {
            "ID": 90927,
            "ConnectionTypeID": 25,
            "LevelID": 2,
            "PowerKW": 11
        }
    ],
    "NumberOfPoints": 1,
    "StatusTypeID": 50,
    "DateLastStatusUpdate": "2016-06-04T02:52:00Z",
    "DataQualityLevel": 3,
    "DateCreated": "2016-03-03T12:32:00Z",
    "SubmissionStatusTypeID": 100
}