{
    "IsRecentlyVerified": false,
    "ID": 153048,
    "UUID": "71C4B78C-5B7E-4B7E-B5F5-2C6B4CD8F417",
    "DataProviderID": 28,
    "DataProvidersReference": "FR*S56*P56013*A",
    "OperatorID": 3379,
    "UsageTypeID": 5,
    "AddressInfo": {
        "ID": 153401,
        "Title": "Avenue Général de Gaulle",
        "AddressLine1": "Avenue Général de Gaulle 56550 Belz",
        "CountryID": 80,
        "Latitude": 47.67557,
        "Longitude": -3.167758,
        "AccessComments": "24/24 7/7 jours",
        "DistanceUnit": 0
    },
    "Connections": [
        {
            "ID": 214526,
            "ConnectionTypeID": 1036,
            "StatusTypeID": 50,
            "LevelID": 2,
            "PowerKW": 22,
            "CurrentTypeID": 20
        },
        {
            "ID": 247848,
            "ConnectionTypeID": 33,
            "StatusTypeID": 50,
            "LevelID": 3,
            "PowerKW": 20,
            "CurrentTypeID": 30
        },
        {
            "ID": 247849,
            "ConnectionTypeID": 1036,
            "StatusTypeID": 50,
            "LevelID": 2,
            "PowerKW": 22,
            "CurrentTypeID": 20
        }
    ],
    "GeneralComments": "Recharge Gratuite",
    "StatusTypeID": 50,
    "DateLastStatusUpdate": "2020-08-27T05:14:00Z",
    "DataQualityLevel": 2,
    "DateCreated": "2020-03-15T10:54:00Z",
    "SubmissionStatusTypeID": 100
}