{
    "IsRecentlyVerified": false,
    "ID": 124955,
    "UUID": "2C048BCB-9870-4210-8FD6-7628A993B6C5",
    "DataProviderID": 1,
    "OperatorID": 1,
    "UsageTypeID": 1,
    "AddressInfo": {
        "ID": 125301,
        "Title": "Sphinx Parkeerterrein",
        "AddressLine1": "Frontensingel",
        "AddressLine2": "Maastricht",
        "Town": "Maastricht",
        "StateOrProvince": "Limburg",
        "Postcode": "6211XC",
        "CountryID": 159,
        "Latitude": 50.8554201308655,
        "Longitude": 5.68825694713689,
        "DistanceUnit": 0
    },
    "Connections": [
        {
            "ID": 175140,
            "ConnectionTypeID": 25,
            "StatusTypeID": 50,
            "LevelID": 2,
            "CurrentTypeID": 20,
            "Quantity": 6
        }
    ],
    "NumberOfPoints": 6,
    "StatusTypeID": 50,
    "DateLastStatusUpdate": "2019-04-06T22:18:00Z",
    "DataQualityLevel": 1,
    "DateCreated": "2019-04-06T19:05:00Z",
    "SubmissionStatusTypeID": 200
}