{
    "MediaItems": [
        {
            "ID": 18307,
            "ChargePointID": 125931,
            "ItemURL": "https://s3-ap-southeast-2.amazonaws.com/openchargemap/images/RO/OCM125931/OCM-125931.orig.2019050915075213.jpeg",
            "ItemThumbnailURL": "https://s3-ap-southeast-2.amazonaws.com/openchargemap/images/RO/OCM125931/OCM-125931.thmb.2019050915075213.jpeg",
            "Comment": "",
            "IsEnabled": true,
            "IsVideo": false,
            "IsFeaturedItem": false,
            "IsExternalResource": false,
            "User": {
                "ID": 15707,
                "Username": "AlexCalcan"
            },
            "DateCreated": "2019-05-09T15:08:00Z"
        }
    ],
    "IsRecentlyVerified": false,
    "ID": 125931,
    "UUID": "F6E2D775-5A4E-469F-8F23-360053A05E69",
    "DataProviderID": 1,
    "OperatorID": 1,
    "UsageTypeID": 1,
    "UsageCost": "0",
    "AddressInfo": {
        "ID": 126277,
        "Title": "Hotel Pestera - Birou Targoviste",
        "AddressLine1": "Strada Grigore Alexandrescu 3",
        "Town": "Târgoviște",
        "StateOrProvince": "Dâmbovița",
        "Postcode": "130007",
        "CountryID": 184,
        "Latitude": 44.9259500003228,
        "Longitude": 25.4571279357576,
        "RelatedURL": "http://www.hotelpestera.ro",
        "DistanceUnit": 0
    },
    "Connections": [
        {
            "ID": 176517,
            "ConnectionTypeID": 1036,
            "StatusTypeID": 50,
            "LevelID": 2,
            "Amps": 32,
            "Voltage": 400,
            "PowerKW": 22,
            "CurrentTypeID": 20,
            "Quantity": 1
        }
    ],
    "NumberOfPoints": 1,
    "StatusTypeID": 50,
    "DateLastStatusUpdate": "2019-05-10T13:41:00Z",
    "DataQualityLevel": 1,
    "DateCreated": "2019-05-09T15:06:00Z",
    "SubmissionStatusTypeID": 200
}