{
    "IsRecentlyVerified": false,
    "ID": 141991,
    "UUID": "6C73790E-E146-45C1-86C9-AF948373F2EE",
    "DataProviderID": 2,
    "DataProvidersReference": "145499",
    "OperatorID": 5,
    "UsageTypeID": 1,
    "AddressInfo": {
        "ID": 142343,
        "Title": "BVSD",
        "AddressLine1": "1800 S Indiana St",
        "Town": "Superior",
        "StateOrProvince": "CO",
        "Postcode": "80027",
        "CountryID": 2,
        "Latitude": 39.937073,
        "Longitude": -105.157326,
        "ContactTelephone1": "888-758-4389",
        "AccessComments": "24 hours daily",
        "RelatedURL": "http://www.chargepoint.com/",
        "DistanceUnit": 0
    },
    "Connections": [
        {
            "ID": 198042,
            "ConnectionTypeID": 1,
            "LevelID": 2,
            "Amps": 16,
            "Voltage": 230,
            "PowerKW": 3.7,
            "CurrentTypeID": 10,
            "Quantity": 2
        }
    ],
    "StatusTypeID": 50,
    "DateLastStatusUpdate": "2020-06-26T03:02:00Z",
    "DataQualityLevel": 3,
    "DateCreated": "2019-12-24T09:16:00Z",
    "SubmissionStatusTypeID": 100
}