{
    "IsRecentlyVerified": false,
    "ID": 183205,
    "UUID": "482E87C0-9F5E-4FCD-8839-D9D5CFF8B290",
    "DataProviderID": 29,
    "DataProvidersReference": "19261,9624",
    "AddressInfo": {
        "ID": 183564,
        "Title": "Grafenstraße 25",
        "AddressLine1": "Grafenstraße 25",
        "Town": "Werl",
        "Postcode": "59457",
        "CountryID": 87,
        "Latitude": 51.555989,
        "Longitude": 7.91649,
        "DistanceUnit": 0
    },
    "Connections": [
        {
            "ID": 289899,
            "ConnectionTypeID": 25,
            "StatusTypeID": 50,
            "LevelID": 2,
            "PowerKW": 22,
            "CurrentTypeID": 20
        },
        {
            "ID": 289900,
            "ConnectionTypeID": 25,
            "StatusTypeID": 50,
            "LevelID": 2,
            "PowerKW": 22,
            "CurrentTypeID": 20
        },
        {
            "ID": 289901,
            "ConnectionTypeID": 25,
            "StatusTypeID": 50,
            "LevelID": 2,
            "PowerKW": 22,
            "CurrentTypeID": 20
        },
        {
            "ID": 289902,
            "ConnectionTypeID": 25,
            "StatusTypeID": 50,
            "LevelID": 2,
            "PowerKW": 22,
            "CurrentTypeID": 20
        }
    ],
    "StatusTypeID": 50,
    "DateLastStatusUpdate": "2021-07-09T03:24:00Z",
    "MetadataValues": [
        {
            "ID": 15498,
            "MetadataFieldID": 4,
            "ItemValue": "Data from the German chargepoint registry provided by Bundesnetzagentur.de under the CC-BY 4.0 license"
        }
    ],
    "DataQualityLevel": 3,
    "DateCreated": "2021-07-08T10:03:00Z",
    "SubmissionStatusTypeID": 100
}