{
    "IsRecentlyVerified": false,
    "ID": 46443,
    "UUID": "A9485B42-575B-410B-BC46-7C7C0E8CC728",
    "DataProviderID": 1,
    "DataProvidersReference": "828",
    "AddressInfo": {
        "ID": 46789,
        "Title": "Søfteland skule, Os i Hordaland",
        "AddressLine1": "Lerkevegen 2",
        "Town": "SØFTELAND",
        "StateOrProvince": "Vestland",
        "Postcode": "5212",
        "CountryID": 168,
        "Latitude": 60.23625,
        "Longitude": 5.45258,
        "AccessComments": "",
        "DistanceUnit": 0
    },
    "Connections": [
        {
            "ID": 57106,
            "ConnectionTypeID": 0,
            "Reference": "1",
            "LevelID": 2,
            "Amps": 16,
            "Voltage": 230,
            "PowerKW": 3.7,
            "Comments": "Mode 1"
        },
        {
            "ID": 88926,
            "ConnectionTypeID": 0,
            "Reference": "2",
            "LevelID": 2,
            "Amps": 16,
            "Voltage": 230,
            "PowerKW": 3.7,
            "Comments": "Mode 1"
        }
    ],
    "NumberOfPoints": 2,
    "DateLastStatusUpdate": "2020-05-26T08:24:00Z",
    "DataQualityLevel": 2,
    "DateCreated": "2015-05-03T00:54:00Z",
    "SubmissionStatusTypeID": 100
}