{
    "IsRecentlyVerified": false,
    "ID": 20880,
    "UUID": "8CD89DC1-3D28-469F-BE94-CC2AD2652C94",
    "DataProviderID": 2,
    "DataProvidersReference": "54000",
    "UsageTypeID": 1,
    "AddressInfo": {
        "ID": 21225,
        "Title": "Virginia Tech - Corporate Research Center",
        "AddressLine1": "1861 Pratt Dr",
        "Town": "Blacksburg",
        "StateOrProvince": "VA",
        "Postcode": "24060",
        "CountryID": 2,
        "Latitude": 37.201753,
        "Longitude": -80.411162,
        "ContactTelephone1": "540-961-3600",
        "AccessComments": "24 hours daily",
        "RelatedURL": "",
        "DistanceUnit": 0
    },
    "Connections": [
        {
            "ID": 22747,
            "ConnectionTypeID": 1,
            "LevelID": 2,
            "Amps": 16,
            "Voltage": 230,
            "PowerKW": 3,
            "CurrentTypeID": 10,
            "Quantity": 1
        }
    ],
    "DateLastStatusUpdate": "2019-04-06T04:02:00Z",
    "DataQualityLevel": 3,
    "DateCreated": "2014-01-17T04:54:00Z",
    "SubmissionStatusTypeID": 100
}