{
    "IsRecentlyVerified": false,
    "ID": 143370,
    "UUID": "32C2A73A-9C7E-4F1C-B7A4-B17402D1E6F1",
    "DataProviderID": 2,
    "DataProvidersReference": "98462",
    "OperatorID": 5,
    "UsageTypeID": 1,
    "AddressInfo": {
        "ID": 143722,
        "Title": "JLRL",
        "AddressLine1": "1035 Wharncliffe Rd S",
        "Town": "London",
        "StateOrProvince": "ON",
        "Postcode": "N6L 1J9",
        "CountryID": 44,
        "Latitude": 42.9385076,
        "Longitude": -81.2607453,
        "ContactTelephone1": "888-758-4389",
        "AccessComments": "24 hours daily",
        "RelatedURL": "http://www.chargepoint.com/",
        "DistanceUnit": 0
    },
    "Connections": [
        {
            "ID": 199673,
            "ConnectionTypeID": 1,
            "LevelID": 2,
            "Amps": 16,
            "Voltage": 230,
            "PowerKW": 3.7,
            "CurrentTypeID": 10,
            "Quantity": 2
        }
    ],
    "StatusTypeID": 50,
    "DateLastStatusUpdate": "2020-06-26T03:06:00Z",
    "DataQualityLevel": 3,
    "DateCreated": "2019-12-24T09:21:00Z",
    "SubmissionStatusTypeID": 100
}