{
    "UserComments": [
        {
            "ID": 13862,
            "ChargePointID": 31244,
            "CommentTypeID": 50,
            "UserName": "Bob",
            "Comment": "Charger not accessible due to the car park being closed for the visiting circus!",
            "Rating": 5,
            "DateCreated": "2016-07-21T12:48:42.773Z",
            "User": {
                "ID": 9088,
                "Username": "Bob"
            },
            "CheckinStatusTypeID": 120
        },
        {
            "ID": 8308,
            "ChargePointID": 31244,
            "CommentTypeID": 10,
            "UserName": "Jarvis Tesla",
            "Comment": "Windy! but good charge rate:) cafe in the local garage does a mean cuppa and supplies :) ",
            "Rating": 5,
            "DateCreated": "2015-12-25T22:46:48.493Z",
            "User": {
                "ID": 6749,
                "Username": "Jarvis Tesla"
            },
            "CheckinStatusTypeID": 10
        },
        {
            "ID": 6430,
            "ChargePointID": 31244,
            "CommentTypeID": 10,
            "UserName": "Connor Milligan",
            "Comment": "Fast AC charge. Worked with my Zoe no problem and authenticated with CYC very quickly",
            "Rating": 5,
            "DateCreated": "2015-09-06T14:59:15.797Z",
            "User": {
                "ID": 4468,
                "Username": "Connor Milligan"
            },
            "CheckinStatusTypeID": 15
        },
        {
            "ID": 3609,
            "ChargePointID": 31244,
            "CommentTypeID": 10,
            "UserName": "Matt Beard",
            "Comment": "Charged find using CHAdeMO",
            "Rating": 4,
            "DateCreated": "2015-01-19T11:06:31.703Z",
            "User": {
                "ID": 1032,
                "Username": "Matt Beard"
            },
            "CheckinStatusTypeID": 10
        }
    ],
    "MediaItems": [
        {
            "ID": 757,
            "ChargePointID": 31244,
            "ItemURL": "https://s3-ap-southeast-2.amazonaws.com/openchargemap/images/GB/OCM31244/OCM-31244.orig.2014121814083995.jpg",
            "ItemThumbnailURL": "https://s3-ap-southeast-2.amazonaws.com/openchargemap/images/GB/OCM31244/OCM-31244.thmb.2014121814083995.jpg",
            "Comment": "",
            "IsEnabled": true,
            "IsVideo": false,
            "IsFeaturedItem": false,
            "IsExternalResource": false,
            "User": {
                "ID": 1032,
                "Username": "Matt Beard"
            },
            "DateCreated": "2014-12-18T14:09:00Z"
        }
    ],
    "IsRecentlyVerified": false,
    "ID": 31244,
    "UUID": "DFD4C6C7-ADB2-4F3B-8146-03B39A0501EF",
    "DataProviderID": 1,
    "OperatorID": 3315,
    "OperatorsReference": "50496",
    "UsageTypeID": 4,
    "UsageCost": "Free",
    "AddressInfo": {
        "ID": 31590,
        "Title": "Lido Car Park",
        "AddressLine1": "South Road",
        "Town": "Peterhead",
        "StateOrProvince": "Aberdeenshire",
        "Postcode": "AB42 2UP",
        "CountryID": 1,
        "Latitude": 57.4971322522329,
        "Longitude": -1.79659889785307,
        "DistanceUnit": 0
    },
    "Connections": [
        {
            "ID": 34525,
            "ConnectionTypeID": 2,
            "StatusTypeID": 50,
            "LevelID": 3,
            "Amps": 125,
            "Voltage": 400,
            "PowerKW": 50,
            "CurrentTypeID": 30,
            "Quantity": 1
        },
        {
            "ID": 34526,
            "ConnectionTypeID": 33,
            "StatusTypeID": 50,
            "LevelID": 3,
            "Amps": 125,
            "Voltage": 400,
            "PowerKW": 50,
            "CurrentTypeID": 30,
            "Quantity": 1
        },
        {
            "ID": 34527,
            "ConnectionTypeID": 1036,
            "StatusTypeID": 50,
            "LevelID": 3,
            "Amps": 63,
            "Voltage": 400,
            "PowerKW": 43,
            "CurrentTypeID": 20,
            "Quantity": 1
        }
    ],
    "NumberOfPoints": 1,
    "StatusTypeID": 50,
    "DateLastStatusUpdate": "2020-05-13T05:16:00Z",
    "DataQualityLevel": 1,
    "DateCreated": "2014-12-18T14:06:00Z",
    "SubmissionStatusTypeID": 200
}