{
    "IsRecentlyVerified": false,
    "ID": 114684,
    "UUID": "700198BD-0C91-46DC-A712-BD9BA2AD845A",
    "DataProviderID": 1,
    "OperatorID": 23,
    "OperatorsReference": "48171",
    "UsageTypeID": 4,
    "AddressInfo": {
        "ID": 115030,
        "Title": "Le Dracy Hotel & Spa - Restaurant la Garenne",
        "AddressLine1": "4 Rue du Pressoir",
        "Town": "Dracy-le-Fort",
        "Postcode": "71640",
        "CountryID": 80,
        "Latitude": 46.798656,
        "Longitude": 4.782378,
        "ContactTelephone1": "+33 3 85 87 81 81",
        "DistanceUnit": 0
    },
    "Connections": [
        {
            "ID": 161404,
            "ConnectionTypeID": 30,
            "StatusTypeID": 50,
            "LevelID": 2,
            "PowerKW": 14,
            "CurrentTypeID": 20,
            "Quantity": 2
        }
    ],
    "NumberOfPoints": 2,
    "GeneralComments": "2 Tesla Connectors, up to 14kW.Available for customers. Please see front desk.",
    "StatusTypeID": 50,
    "DateLastStatusUpdate": "2019-01-13T06:45:00Z",
    "DataQualityLevel": 1,
    "DateCreated": "2019-01-13T06:45:00Z",
    "SubmissionStatusTypeID": 200
}