{
    "IsRecentlyVerified": false,
    "ID": 124333,
    "UUID": "0979AAE7-0600-4D44-96C3-B859C61C1415",
    "DataProviderID": 2,
    "DataProvidersReference": "51922",
    "UsageTypeID": 1,
    "AddressInfo": {
        "ID": 124679,
        "Title": "Lodi Downtown Parking Structure",
        "AddressLine1": "50 N Sacramento St",
        "Town": "Lodi",
        "StateOrProvince": "CA",
        "Postcode": "95240",
        "CountryID": 2,
        "Latitude": 38.134789,
        "Longitude": -121.27182,
        "ContactTelephone1": "209-333-6762",
        "AccessComments": "24 hours daily",
        "RelatedURL": "",
        "DistanceUnit": 0
    },
    "Connections": [
        {
            "ID": 174418,
            "ConnectionTypeID": 1,
            "LevelID": 2,
            "Amps": 16,
            "Voltage": 230,
            "PowerKW": 3.7,
            "CurrentTypeID": 10,
            "Quantity": 1
        }
    ],
    "DateLastStatusUpdate": "2020-06-26T02:59:00Z",
    "DataQualityLevel": 3,
    "DateCreated": "2019-04-06T05:03:00Z",
    "SubmissionStatusTypeID": 100
}