{
    "MediaItems": [
        {
            "ID": 12210,
            "ChargePointID": 87932,
            "ItemURL": "https://s3-ap-southeast-2.amazonaws.com/openchargemap/images/NZ/OCM87932/OCM-87932.orig.2017051808243713.jpg",
            "ItemThumbnailURL": "https://s3-ap-southeast-2.amazonaws.com/openchargemap/images/NZ/OCM87932/OCM-87932.thmb.2017051808243713.jpg",
            "Comment": "",
            "IsEnabled": true,
            "IsVideo": false,
            "IsFeaturedItem": false,
            "IsExternalResource": false,
            "User": {
                "ID": 15365,
                "Username": "sliday"
            },
            "DateCreated": "2017-05-18T08:25:00Z"
        }
    ],
    "IsRecentlyVerified": false,
    "ID": 87932,
    "UUID": "03B0B729-24C4-47AE-8C39-89BE770EE558",
    "DataProviderID": 1,
    "UsageCost": "$6",
    "AddressInfo": {
        "ID": 88278,
        "Title": "Rivers Edge Holiday Park",
        "AddressLine1": "Harker Street",
        "Town": "Waipawa ",
        "Postcode": "4210",
        "CountryID": 161,
        "Latitude": -39.945435137092566,
        "Longitude": 176.58864018632596,
        "ContactTelephone1": "068578976",
        "DistanceUnit": 0
    },
    "Connections": [
        {
            "ID": 124743,
            "ConnectionTypeID": 4
        }
    ],
    "NumberOfPoints": 1,
    "GeneralComments": "Reimburse cost (30c/kWh, e.g. $6 for full charge of Nissan Leaf)\r\n100 meters to shops. plenty of room to spread out under the trees and a short walk to the river for safe swimming and fishing. 50 powered sites available for day and overnight charging. http://www.riversedgeholidaypark.co.nz",
    "StatusTypeID": 50,
    "DateLastStatusUpdate": "2017-05-18T08:25:00Z",
    "DataQualityLevel": 1,
    "DateCreated": "2017-05-18T08:24:00Z",
    "SubmissionStatusTypeID": 200
}