{
    "IsRecentlyVerified": false,
    "ID": 117843,
    "UUID": "AF5EBD29-3524-4402-B961-C5B6D9149674",
    "DataProviderID": 1,
    "OperatorID": 3296,
    "UsageTypeID": 5,
    "UsageCost": "35p/kWh",
    "AddressInfo": {
        "ID": 118189,
        "Title": "Grassendale Service Station",
        "AddressLine1": "658 Aigburth Road",
        "Town": "Liverpook",
        "Postcode": "L19 0NJ",
        "CountryID": 1,
        "Latitude": 53.361123,
        "Longitude": -2.913223,
        "DistanceUnit": 0
    },
    "Connections": [
        {
            "ID": 166763,
            "ConnectionTypeID": 2,
            "StatusTypeID": 50,
            "LevelID": 3,
            "PowerKW": 50,
            "CurrentTypeID": 30,
            "Quantity": 2
        },
        {
            "ID": 166764,
            "ConnectionTypeID": 33,
            "StatusTypeID": 50,
            "LevelID": 3,
            "PowerKW": 50,
            "CurrentTypeID": 30,
            "Quantity": 2
        }
    ],
    "NumberOfPoints": 2,
    "StatusTypeID": 50,
    "DateLastStatusUpdate": "2019-03-04T16:39:00Z",
    "DataQualityLevel": 1,
    "DateCreated": "2019-03-04T16:39:00Z",
    "SubmissionStatusTypeID": 200
}