{
    "IsRecentlyVerified": false,
    "ID": 79667,
    "UUID": "AD421589-D5FF-48E8-AC4E-C74B024B72EC",
    "DataProviderID": 1,
    "OperatorID": 23,
    "OperatorsReference": "21561",
    "UsageTypeID": 4,
    "UsageCost": "Free",
    "AddressInfo": {
        "ID": 80013,
        "Title": "Auberge le Pomerol",
        "AddressLine1": "819 Boul. de Maisonneuve Est",
        "Town": "Montreal",
        "StateOrProvince": "Quebec",
        "Postcode": "H2L 1Y7",
        "CountryID": 44,
        "Latitude": 45.516388,
        "Longitude": -73.560316,
        "ContactTelephone1": "(800) 361-6896",
        "DistanceUnit": 0
    },
    "Connections": [
        {
            "ID": 114307,
            "ConnectionTypeID": 30,
            "StatusTypeID": 50,
            "LevelID": 2,
            "PowerKW": 8,
            "CurrentTypeID": 10,
            "Quantity": 1
        }
    ],
    "NumberOfPoints": 1,
    "GeneralComments": "1 Tesla Connector, up to 8kW.Available to the public. Please see front desk.",
    "StatusTypeID": 50,
    "DateLastStatusUpdate": "2017-06-09T12:49:00Z",
    "DataQualityLevel": 1,
    "DateCreated": "2017-01-29T18:21:00Z",
    "SubmissionStatusTypeID": 200
}