{
    "IsRecentlyVerified": false,
    "ID": 85301,
    "UUID": "D287BC5C-302C-4798-9076-06795FF12912",
    "DataProviderID": 1,
    "DataProvidersReference": "3844",
    "AddressInfo": {
        "ID": 85647,
        "Title": "Arena Oskarshamn, Oskarshamn Energi",
        "AddressLine1": "Lindvägen ",
        "Town": "OSKARSHAMN",
        "StateOrProvince": "KALMAR",
        "Postcode": "57231",
        "CountryID": 216,
        "Latitude": 57.264333,
        "Longitude": 16.436661,
        "AccessComments": "",
        "DistanceUnit": 0
    },
    "Connections": [
        {
            "ID": 121135,
            "ConnectionTypeID": 0,
            "Reference": "1",
            "LevelID": 2,
            "Amps": 32,
            "Voltage": 400,
            "PowerKW": 22,
            "Comments": "Mode 3"
        },
        {
            "ID": 121136,
            "ConnectionTypeID": 0,
            "Reference": "2",
            "LevelID": 2,
            "Amps": 32,
            "Voltage": 400,
            "PowerKW": 22,
            "Comments": "Mode 3"
        }
    ],
    "NumberOfPoints": 2,
    "DateLastStatusUpdate": "2020-05-26T08:21:00Z",
    "DataQualityLevel": 2,
    "DateCreated": "2017-04-01T15:08:00Z",
    "SubmissionStatusTypeID": 100
}