{
    "IsRecentlyVerified": false,
    "ID": 35963,
    "UUID": "FF7E7277-3F91-424C-92A2-780213F9D579",
    "DataProviderID": 26,
    "DataProvidersReference": "50503",
    "OperatorID": 180,
    "OperatorsReference": "Alfen GDH0872",
    "UsageCost": "0.00 jaarabonnement",
    "AddressInfo": {
        "ID": 36309,
        "Title": "Balistraat 1A",
        "AddressLine1": "Balistraat 1A",
        "Town": "Den Haag",
        "Postcode": "2585 XK",
        "CountryID": 159,
        "Latitude": 52.089621,
        "Longitude": 4.310408,
        "ContactTelephone1": "036 - 549 34 00",
        "RelatedURL": "http://www.icu-charging-stations.com/",
        "DistanceUnit": 0
    },
    "Connections": [
        {
            "ID": 39474,
            "ConnectionTypeID": 25,
            "LevelID": 2,
            "PowerKW": 11,
            "CurrentTypeID": 10
        },
        {
            "ID": 48153,
            "ConnectionTypeID": 25,
            "LevelID": 2,
            "PowerKW": 11,
            "CurrentTypeID": 10
        }
    ],
    "NumberOfPoints": 1,
    "StatusTypeID": 50,
    "DateLastStatusUpdate": "2016-06-04T02:50:00Z",
    "DataQualityLevel": 3,
    "DateCreated": "2015-01-09T06:05:00Z",
    "SubmissionStatusTypeID": 100
}