{
    "IsRecentlyVerified": false,
    "ID": 182545,
    "UUID": "C1211149-1180-462A-AF46-918262DA320C",
    "DataProviderID": 29,
    "DataProvidersReference": "18439",
    "OperatorID": 45,
    "AddressInfo": {
        "ID": 182904,
        "Title": "Bielefelder Str. 84",
        "AddressLine1": "Bielefelder Str. 84",
        "Town": "Paderborn",
        "Postcode": "33104",
        "CountryID": 87,
        "Latitude": 51.780565,
        "Longitude": 8.710551,
        "DistanceUnit": 0
    },
    "Connections": [
        {
            "ID": 288429,
            "ConnectionTypeID": 33,
            "StatusTypeID": 50,
            "LevelID": 3,
            "PowerKW": 22,
            "CurrentTypeID": 30
        },
        {
            "ID": 288430,
            "ConnectionTypeID": 25,
            "StatusTypeID": 50,
            "LevelID": 2,
            "PowerKW": 11,
            "CurrentTypeID": 20
        }
    ],
    "StatusTypeID": 50,
    "DateLastStatusUpdate": "2021-07-12T02:48:00Z",
    "MetadataValues": [
        {
            "ID": 14838,
            "MetadataFieldID": 4,
            "ItemValue": "Data from the German chargepoint registry provided by Bundesnetzagentur.de under the CC-BY 4.0 license"
        }
    ],
    "DataQualityLevel": 3,
    "DateCreated": "2021-07-08T10:03:00Z",
    "SubmissionStatusTypeID": 100
}