{
    "IsRecentlyVerified": false,
    "ID": 178160,
    "UUID": "00BDF9D0-6581-4FDB-B0DE-21A45E402525",
    "DataProviderID": 29,
    "DataProvidersReference": "20050",
    "OperatorID": 3403,
    "AddressInfo": {
        "ID": 178519,
        "Title": "Rathausplatz 3",
        "AddressLine1": "Rathausplatz 3",
        "Town": "Großburgwedel",
        "Postcode": "30938",
        "CountryID": 87,
        "Latitude": 52.49447,
        "Longitude": 9.85944,
        "DistanceUnit": 0
    },
    "Connections": [
        {
            "ID": 278216,
            "ConnectionTypeID": 25,
            "StatusTypeID": 50,
            "LevelID": 2,
            "PowerKW": 22,
            "CurrentTypeID": 20
        },
        {
            "ID": 278217,
            "ConnectionTypeID": 25,
            "StatusTypeID": 50,
            "LevelID": 2,
            "PowerKW": 22,
            "CurrentTypeID": 20
        }
    ],
    "StatusTypeID": 0,
    "DateLastStatusUpdate": "2021-07-12T02:49:00Z",
    "MetadataValues": [
        {
            "ID": 10454,
            "MetadataFieldID": 4,
            "ItemValue": "Data from the German chargepoint registry provided by Bundesnetzagentur.de under the CC-BY 4.0 license"
        }
    ],
    "DataQualityLevel": 3,
    "DateCreated": "2021-07-08T09:49:00Z",
    "SubmissionStatusTypeID": 100
}