{
    "IsRecentlyVerified": false,
    "ID": 157819,
    "UUID": "EBA3C9D4-71FD-48C7-BC10-D3F11CE17DEF",
    "DataProviderID": 1,
    "OperatorID": 8,
    "UsageTypeID": 2,
    "AddressInfo": {
        "ID": 158173,
        "Title": "7 Market Parade",
        "AddressLine1": "Hampton Road W",
        "Town": "Feltham",
        "Postcode": "TW13 6AW",
        "CountryID": 1,
        "Latitude": 51.440491,
        "Longitude": -0.387877,
        "AccessComments": "",
        "RelatedURL": "https://www.bpchargemaster.com",
        "DistanceUnit": 0
    },
    "Connections": [
        {
            "ID": 227396,
            "ConnectionTypeID": 2,
            "Reference": "1",
            "StatusTypeID": 50,
            "LevelID": 3,
            "Amps": 125,
            "Voltage": 400,
            "PowerKW": 50,
            "CurrentTypeID": 30,
            "Quantity": 1
        },
        {
            "ID": 227397,
            "ConnectionTypeID": 33,
            "Reference": "2",
            "StatusTypeID": 50,
            "LevelID": 3,
            "Amps": 125,
            "Voltage": 400,
            "PowerKW": 50,
            "CurrentTypeID": 30,
            "Quantity": 1
        },
        {
            "ID": 261952,
            "ConnectionTypeID": 1036,
            "StatusTypeID": 50,
            "LevelID": 3,
            "PowerKW": 43,
            "CurrentTypeID": 20,
            "Quantity": 1
        }
    ],
    "GeneralComments": "Charging for taxis only.",
    "StatusTypeID": 50,
    "DateLastStatusUpdate": "2020-12-30T20:57:00Z",
    "MetadataValues": [
        {
            "ID": 7352,
            "MetadataFieldID": 4,
            "ItemValue": "Contains public sector information licensed under the Open Government Licence v2.0. http://www.nationalarchives.gov.uk/doc/open-government-licence/version/2/"
        }
    ],
    "DataQualityLevel": 3,
    "DateCreated": "2020-06-25T10:00:00Z",
    "SubmissionStatusTypeID": 100
}