{
    "UserComments": [
        {
            "ID": 19923,
            "ChargePointID": 101375,
            "CommentTypeID": 10,
            "UserName": "Someone_Just_",
            "Rating": 4,
            "DateCreated": "2018-07-26T20:19:52.78Z",
            "User": {
                "ID": 1107,
                "Username": "Someone_Just_"
            },
            "CheckinStatusTypeID": 140
        },
        {
            "ID": 19346,
            "ChargePointID": 101375,
            "CommentTypeID": 10,
            "UserName": "Someone_Just_",
            "Rating": 3,
            "DateCreated": "2018-03-26T21:07:50.6Z",
            "User": {
                "ID": 1107,
                "Username": "Someone_Just_"
            },
            "CheckinStatusTypeID": 140
        }
    ],
    "MediaItems": [
        {
            "ID": 15217,
            "ChargePointID": 101375,
            "ItemURL": "https://s3-ap-southeast-2.amazonaws.com/openchargemap/images/BE/OCM101375/OCM-101375.orig.2018032621064622.jpg",
            "ItemThumbnailURL": "https://s3-ap-southeast-2.amazonaws.com/openchargemap/images/BE/OCM101375/OCM-101375.thmb.2018032621064622.jpg",
            "Comment": "2 Mennekes connections but only one parking space preserved",
            "IsEnabled": true,
            "IsVideo": false,
            "IsFeaturedItem": false,
            "IsExternalResource": false,
            "User": {
                "ID": 1107,
                "Username": "Someone_Just_"
            },
            "DateCreated": "2018-03-26T21:07:00Z"
        }
    ],
    "IsRecentlyVerified": false,
    "ID": 101375,
    "UUID": "82317CD7-858E-4BD6-B82B-DEB750BEB366",
    "DataProviderID": 1,
    "OperatorID": 36,
    "UsageTypeID": 1,
    "AddressInfo": {
        "ID": 101721,
        "Title": "Paardenmarkt Antwerpen",
        "AddressLine1": "Paardenmarkt 78",
        "Town": "Antwerpen",
        "Postcode": "2000",
        "CountryID": 26,
        "Latitude": 51.2248810733181,
        "Longitude": 4.41220992086676,
        "DistanceUnit": 0
    },
    "Connections": [
        {
            "ID": 143136,
            "ConnectionTypeID": 25,
            "StatusTypeID": 50,
            "LevelID": 2,
            "Amps": 16,
            "Voltage": 400,
            "PowerKW": 11,
            "CurrentTypeID": 20,
            "Quantity": 2
        }
    ],
    "NumberOfPoints": 1,
    "StatusTypeID": 50,
    "DateLastStatusUpdate": "2018-07-26T20:20:00Z",
    "DataQualityLevel": 1,
    "DateCreated": "2018-03-26T21:00:00Z",
    "SubmissionStatusTypeID": 200
}