{
    "UserComments": [
        {
            "ID": 20820,
            "ChargePointID": 93685,
            "CommentTypeID": 10,
            "UserName": "pap",
            "Comment": "you have to surround the building to access the chargers",
            "Rating": 5,
            "DateCreated": "2019-03-22T09:34:37.727Z",
            "User": {
                "ID": 19988,
                "Username": "pap"
            }
        }
    ],
    "MediaItems": [
        {
            "ID": 17820,
            "ChargePointID": 93685,
            "ItemURL": "https://s3-ap-southeast-2.amazonaws.com/openchargemap/images/CH/OCM93685/OCM-93685.orig.2019032209401803.png",
            "ItemThumbnailURL": "https://s3-ap-southeast-2.amazonaws.com/openchargemap/images/CH/OCM93685/OCM-93685.thmb.2019032209401803.png",
            "Comment": "backdoor of the center for a coffee break 😉",
            "IsEnabled": true,
            "IsVideo": false,
            "IsFeaturedItem": false,
            "IsExternalResource": false,
            "User": {
                "ID": 19988,
                "Username": "pap"
            },
            "DateCreated": "2019-03-22T09:41:00Z"
        },
        {
            "ID": 17819,
            "ChargePointID": 93685,
            "ItemURL": "https://s3-ap-southeast-2.amazonaws.com/openchargemap/images/CH/OCM93685/OCM-93685.orig.2019032209330135.png",
            "ItemThumbnailURL": "https://s3-ap-southeast-2.amazonaws.com/openchargemap/images/CH/OCM93685/OCM-93685.thmb.2019032209330135.png",
            "Comment": "14 Stalls, 8 are ready for M3",
            "IsEnabled": true,
            "IsVideo": false,
            "IsFeaturedItem": false,
            "IsExternalResource": false,
            "User": {
                "ID": 19988,
                "Username": "pap"
            },
            "DateCreated": "2019-03-22T09:33:00Z"
        }
    ],
    "IsRecentlyVerified": false,
    "ID": 93685,
    "UUID": "E9B1AAFC-6FC3-42BD-A564-8305C369D55A",
    "DataProviderID": 1,
    "OperatorID": 23,
    "OperatorsReference": "28881",
    "UsageTypeID": 4,
    "UsageCost": "CHF 0.30/kWh; Andere Tarife für ältere Autos/Autres tarifs pour les voitures anciennes/altre tariffe per le auto più vecchie",
    "AddressInfo": {
        "ID": 94031,
        "Title": "Oftringen Supercharger",
        "AddressLine1": "Zürichstrasse 52",
        "Town": "Oftringen",
        "Postcode": "4665",
        "CountryID": 217,
        "Latitude": 47.310734,
        "Longitude": 7.934924,
        "DistanceUnit": 0
    },
    "Connections": [
        {
            "ID": 132643,
            "ConnectionTypeID": 27,
            "StatusTypeID": 50,
            "LevelID": 3,
            "PowerKW": 120,
            "CurrentTypeID": 30,
            "Quantity": 14
        }
    ],
    "NumberOfPoints": 14,
    "GeneralComments": "Charging14 Superchargers, available 24/7, up to 120kW, 8 of them equiped for M3",
    "StatusTypeID": 50,
    "DateLastStatusUpdate": "2019-03-23T06:36:00Z",
    "DataQualityLevel": 1,
    "DateCreated": "2017-10-05T05:35:00Z",
    "SubmissionStatusTypeID": 200
}