{
    "IsRecentlyVerified": false,
    "ID": 34010,
    "UUID": "6224141F-139C-49D3-8C92-658D95A6DAA2",
    "DataProviderID": 26,
    "DataProvidersReference": "34450",
    "OperatorID": 73,
    "OperatorsReference": "EV-Box EVB-P1306035",
    "UsageCost": "0.00 jaarabonnement",
    "AddressInfo": {
        "ID": 34356,
        "Title": "Meerkolstraat 1",
        "AddressLine1": "Meerkolstraat 1",
        "Town": "Nijmegen",
        "Postcode": "6542 TJ",
        "CountryID": 159,
        "Latitude": 51.84378,
        "Longitude": 5.84107,
        "RelatedURL": "http://www.ev-box.nl",
        "DistanceUnit": 0
    },
    "Connections": [
        {
            "ID": 37521,
            "ConnectionTypeID": 25,
            "LevelID": 2,
            "PowerKW": 5,
            "CurrentTypeID": 10
        }
    ],
    "NumberOfPoints": 1,
    "StatusTypeID": 50,
    "DateLastStatusUpdate": "2016-06-04T02:41:00Z",
    "DataQualityLevel": 3,
    "DateCreated": "2015-01-09T06:04:00Z",
    "SubmissionStatusTypeID": 100
}