{
    "IsRecentlyVerified": false,
    "ID": 91031,
    "UUID": "5A8CF873-DEE0-49A8-A53B-3A7CA76BA71E",
    "DataProviderID": 1,
    "OperatorID": 23,
    "OperatorsReference": "24909",
    "UsageTypeID": 4,
    "AddressInfo": {
        "ID": 91377,
        "Title": "Rove Downtown Dubai",
        "AddressLine1": "312 Al Sa'ada Street",
        "Town": "Dubai",
        "CountryID": 235,
        "Latitude": 25.202618,
        "Longitude": 55.279699,
        "ContactTelephone1": "+971 4 561 9999",
        "DistanceUnit": 0
    },
    "Connections": [
        {
            "ID": 129086,
            "ConnectionTypeID": 1036,
            "StatusTypeID": 50,
            "LevelID": 2,
            "PowerKW": 14,
            "CurrentTypeID": 20,
            "Quantity": 1
        }
    ],
    "NumberOfPoints": 1,
    "GeneralComments": "1 Tesla Connector, up to 14kW.Available for customers. Self park.",
    "StatusTypeID": 50,
    "DateLastStatusUpdate": "2017-07-28T05:42:00Z",
    "DataQualityLevel": 1,
    "DateCreated": "2017-07-28T05:42:00Z",
    "SubmissionStatusTypeID": 200
}