{
    "IsRecentlyVerified": false,
    "ID": 17432,
    "UUID": "87AE1ABC-884A-479E-B9BF-76F9E74944BF",
    "DataProviderID": 22,
    "DataProvidersReference": "57574E4F5E30961F96C7E320BF15A5DD",
    "AddressInfo": {
        "ID": 17777,
        "Title": "島根日産自動車益田営業所",
        "AddressLine1": "島根県益田市中吉田町342-1",
        "CountryID": 114,
        "Latitude": 34.68400056,
        "Longitude": 131.8350702,
        "ContactTelephone1": "0856-23-2311",
        "DistanceUnit": 0
    },
    "Connections": [
        {
            "ID": 17673,
            "ConnectionTypeID": 2,
            "LevelID": 2,
            "Amps": 100,
            "Voltage": 480,
            "PowerKW": 48,
            "Quantity": 1
        }
    ],
    "DateLastStatusUpdate": "2013-06-29T08:58:00Z",
    "DataQualityLevel": 2,
    "DateCreated": "2013-06-29T08:58:00Z",
    "SubmissionStatusTypeID": 200
}