{
    "IsRecentlyVerified": false,
    "ID": 73543,
    "UUID": "A73FE9CC-746F-48AA-8DB9-FA02280620C4",
    "DataProviderID": 1,
    "OperatorID": 45,
    "UsageTypeID": 1,
    "UsageCost": "Free",
    "AddressInfo": {
        "ID": 73889,
        "Title": "Rathaus (mit E-Bike Station)",
        "AddressLine1": "Am Kirchplatz",
        "Town": "Beilngries",
        "StateOrProvince": "Landkreis Eichstätt",
        "Postcode": "92339",
        "CountryID": 87,
        "Latitude": 48.9948978,
        "Longitude": 11.4611229,
        "RelatedURL": "http://www.bike-energy.com/",
        "DistanceUnit": 0
    },
    "Connections": [
        {
            "ID": 105806,
            "ConnectionTypeID": 28,
            "StatusTypeID": 50,
            "LevelID": 2,
            "Amps": 10,
            "Voltage": 230,
            "PowerKW": 3.7,
            "CurrentTypeID": 10,
            "Quantity": 1
        },
        {
            "ID": 105807,
            "ConnectionTypeID": 0,
            "StatusTypeID": 50,
            "LevelID": 1,
            "Amps": 6,
            "Voltage": 50,
            "PowerKW": 0.3,
            "CurrentTypeID": 30,
            "Quantity": 2
        },
        {
            "ID": 105808,
            "ConnectionTypeID": 25,
            "StatusTypeID": 50,
            "LevelID": 2,
            "Amps": 16,
            "Voltage": 400,
            "PowerKW": 11,
            "CurrentTypeID": 20,
            "Quantity": 1
        }
    ],
    "NumberOfPoints": 6,
    "GeneralComments": "bike-energy Ladestation TOWER T2B1C – Anschluß für 2 E-Bikes und 1 Elektroauto.",
    "StatusTypeID": 50,
    "DateLastStatusUpdate": "2016-11-23T08:41:00Z",
    "DataQualityLevel": 1,
    "DateCreated": "2016-11-23T08:41:00Z",
    "SubmissionStatusTypeID": 200
}