{
    "IsRecentlyVerified": false,
    "ID": 99914,
    "UUID": "F61D5D1D-0CAA-443E-81EC-7ECCE9D488D6",
    "DataProviderID": 1,
    "OperatorID": 45,
    "UsageTypeID": 1,
    "AddressInfo": {
        "ID": 100260,
        "Title": "Kundenzentrum Stadtwerke",
        "AddressLine1": "Bauernstraße 76/1",
        "Town": "Ditzingen",
        "StateOrProvince": "Landkreis Ludwigsburg",
        "Postcode": "71254",
        "CountryID": 87,
        "Latitude": 48.83327,
        "Longitude": 9.06398999999999,
        "AccessComments": "Kostenlos nutzbar von Mo-Fr 08:30-15:30 ohne Ladekarte.",
        "RelatedURL": "http://www.huber-haustechnik.de/",
        "DistanceUnit": 0
    },
    "Connections": [
        {
            "ID": 141147,
            "ConnectionTypeID": 25,
            "StatusTypeID": 50,
            "LevelID": 2,
            "Amps": 32,
            "Voltage": 400,
            "PowerKW": 22,
            "CurrentTypeID": 20,
            "Quantity": 1
        }
    ],
    "NumberOfPoints": 1,
    "StatusTypeID": 50,
    "DateLastStatusUpdate": "2018-02-08T06:22:00Z",
    "DataQualityLevel": 1,
    "DateCreated": "2018-02-08T06:22:00Z",
    "SubmissionStatusTypeID": 200
}