{
    "MediaItems": [
        {
            "ID": 8124,
            "ChargePointID": 71035,
            "ItemURL": "https://s3-ap-southeast-2.amazonaws.com/openchargemap/images/DE/OCM71035/OCM-71035.orig.2016082310354929.jpg",
            "ItemThumbnailURL": "https://s3-ap-southeast-2.amazonaws.com/openchargemap/images/DE/OCM71035/OCM-71035.thmb.2016082310354929.jpg",
            "Comment": "",
            "IsEnabled": true,
            "IsVideo": false,
            "IsFeaturedItem": false,
            "IsExternalResource": false,
            "User": {
                "ID": 11762,
                "Username": "JonasF"
            },
            "DateCreated": "2016-08-23T10:36:00Z"
        },
        {
            "ID": 8123,
            "ChargePointID": 71035,
            "ItemURL": "https://s3-ap-southeast-2.amazonaws.com/openchargemap/images/DE/OCM71035/OCM-71035.orig.2016082310351520.jpg",
            "ItemThumbnailURL": "https://s3-ap-southeast-2.amazonaws.com/openchargemap/images/DE/OCM71035/OCM-71035.thmb.2016082310351520.jpg",
            "Comment": "",
            "IsEnabled": true,
            "IsVideo": false,
            "IsFeaturedItem": false,
            "IsExternalResource": false,
            "User": {
                "ID": 11762,
                "Username": "JonasF"
            },
            "DateCreated": "2016-08-23T10:35:00Z"
        }
    ],
    "IsRecentlyVerified": false,
    "ID": 71035,
    "UUID": "0CD33596-109F-4914-A57F-D4597FF6EF8A",
    "DataProviderID": 1,
    "OperatorID": 44,
    "UsageTypeID": 1,
    "UsageCost": "0",
    "AddressInfo": {
        "ID": 71381,
        "Title": "Gipsberg Merzig",
        "AddressLine1": "Auf Strützberg 26",
        "Town": "Merzig",
        "StateOrProvince": "Saarland",
        "Postcode": "66663",
        "CountryID": 87,
        "Latitude": 49.44467,
        "Longitude": 6.66347999999994,
        "ContactTelephone1": "+49 6861 9381835",
        "ContactEmail": "jonas.frey@gmx.de",
        "AccessComments": "Public access, 22kW Mennekes Type 2 socket near garage on the wall.",
        "DistanceUnit": 0
    },
    "Connections": [
        {
            "ID": 101782,
            "ConnectionTypeID": 25,
            "StatusTypeID": 50,
            "LevelID": 2,
            "Amps": 32,
            "Voltage": 400,
            "PowerKW": 22,
            "CurrentTypeID": 20,
            "Quantity": 1
        }
    ],
    "NumberOfPoints": 1,
    "GeneralComments": "AC 22kW, Type 2 socket on wall near garage",
    "StatusTypeID": 50,
    "DateLastStatusUpdate": "2016-08-23T13:52:00Z",
    "DataQualityLevel": 1,
    "DateCreated": "2016-08-23T10:30:00Z",
    "SubmissionStatusTypeID": 200
}