{
    "IsRecentlyVerified": false,
    "ID": 181859,
    "UUID": "225E139F-5C5C-4981-A53E-BD14130EA77E",
    "DataProviderID": 29,
    "DataProvidersReference": "4203",
    "OperatorID": 105,
    "AddressInfo": {
        "ID": 182218,
        "Title": "Knaudtstr. 19",
        "AddressLine1": "Knaudtstr. 19",
        "Town": "Essen",
        "Postcode": "45138",
        "CountryID": 87,
        "Latitude": 51.44885,
        "Longitude": 7.043531,
        "DistanceUnit": 0
    },
    "Connections": [
        {
            "ID": 286824,
            "ConnectionTypeID": 25,
            "StatusTypeID": 50,
            "LevelID": 2,
            "PowerKW": 22,
            "CurrentTypeID": 20
        },
        {
            "ID": 286825,
            "ConnectionTypeID": 25,
            "StatusTypeID": 50,
            "LevelID": 2,
            "PowerKW": 22,
            "CurrentTypeID": 20
        }
    ],
    "StatusTypeID": 50,
    "DateLastStatusUpdate": "2021-07-12T02:47:00Z",
    "MetadataValues": [
        {
            "ID": 14153,
            "MetadataFieldID": 4,
            "ItemValue": "Data from the German chargepoint registry provided by Bundesnetzagentur.de under the CC-BY 4.0 license"
        }
    ],
    "DataQualityLevel": 3,
    "DateCreated": "2021-07-08T10:02:00Z",
    "SubmissionStatusTypeID": 100
}