{
    "IsRecentlyVerified": false,
    "ID": 47349,
    "UUID": "AD1BA3BF-CE10-47D2-BD51-5ACF379D4DC1",
    "DataProviderID": 1,
    "OperatorID": 23,
    "OperatorsReference": "7754",
    "UsageTypeID": 1,
    "UsageCost": "Free",
    "AddressInfo": {
        "ID": 47695,
        "Title": "Port d'Hiver Bed & Breakfast - Tesla",
        "AddressLine1": "201 Ocean Blvd",
        "Town": "Melbourne",
        "StateOrProvince": "FL",
        "Postcode": "32951",
        "CountryID": 2,
        "Latitude": 28.06829,
        "Longitude": -80.5577124,
        "ContactTelephone1": "321-722-2727  877-798-3752",
        "AccessComments": "24 hours daily; for Tesla use only; guest use only",
        "RelatedURL": "http://www.teslamotors.com/supercharger",
        "DistanceUnit": 0
    },
    "Connections": [
        {
            "ID": 58386,
            "ConnectionTypeID": 30,
            "StatusTypeID": 50,
            "LevelID": 2,
            "Amps": 16,
            "Voltage": 230,
            "PowerKW": 16,
            "CurrentTypeID": 10,
            "Quantity": 1
        }
    ],
    "NumberOfPoints": 1,
    "StatusTypeID": 50,
    "DateLastStatusUpdate": "2017-01-26T16:50:00Z",
    "DataQualityLevel": 3,
    "DateCreated": "2015-05-27T08:50:00Z",
    "SubmissionStatusTypeID": 100
}