{
    "IsRecentlyVerified": false,
    "ID": 173984,
    "UUID": "BA3CDA48-17D3-4FEB-977A-834DDBC5B053",
    "DataProviderID": 1,
    "OperatorID": 21,
    "UsageTypeID": 4,
    "UsageCost": "Mobi.E compatible card or App",
    "AddressInfo": {
        "ID": 174343,
        "Title": "LRA-00024 - Agriloja",
        "AddressLine1": "Rua dos Casais",
        "Town": "Leiria",
        "StateOrProvince": "Leiria",
        "Postcode": "2400",
        "CountryID": 180,
        "Latitude": 39.729750200571175,
        "Longitude": -8.793237007899052,
        "DistanceUnit": 0
    },
    "Connections": [
        {
            "ID": 268134,
            "ConnectionTypeID": 25,
            "StatusTypeID": 50,
            "LevelID": 2,
            "Amps": 32,
            "Voltage": 400,
            "PowerKW": 22,
            "CurrentTypeID": 20,
            "Quantity": 2
        }
    ],
    "NumberOfPoints": 2,
    "GeneralComments": "Mo-Sa 09:00>20:00",
    "StatusTypeID": 50,
    "DateLastStatusUpdate": "2021-03-08T23:35:00Z",
    "DataQualityLevel": 1,
    "DateCreated": "2021-03-08T23:35:00Z",
    "SubmissionStatusTypeID": 200
}