{
    "IsRecentlyVerified": false,
    "ID": 136483,
    "UUID": "1A0A0C6F-5AD2-4182-89FB-A37848FEF3C8",
    "DataProviderID": 18,
    "DataProvidersReference": "eb8a56e79a90fff26e50196dbc6c9d66",
    "OperatorID": 2244,
    "UsageTypeID": 5,
    "AddressInfo": {
        "ID": 136829,
        "Title": "Lyndhurst Terrace",
        "AddressLine1": "Lyndhurst Terrace",
        "Town": "London",
        "Postcode": "NW3 5QA",
        "CountryID": 1,
        "Latitude": 51.55255,
        "Longitude": -0.174544,
        "AccessComments": "",
        "RelatedURL": "https://www.ubitricity.com",
        "DistanceUnit": 0
    },
    "Connections": [
        {
            "ID": 190933,
            "ConnectionTypeID": 25,
            "Reference": "suby1100002307",
            "StatusTypeID": 50,
            "LevelID": 2,
            "Amps": 16,
            "Voltage": 230,
            "PowerKW": 3.7,
            "CurrentTypeID": 10
        }
    ],
    "StatusTypeID": 0,
    "DateLastStatusUpdate": "2021-04-25T05:46:00Z",
    "MetadataValues": [
        {
            "ID": 6335,
            "MetadataFieldID": 4,
            "ItemValue": "Contains public sector information licensed under the Open Government Licence v2.0. http://www.nationalarchives.gov.uk/doc/open-government-licence/version/2/"
        }
    ],
    "DataQualityLevel": 3,
    "DateCreated": "2019-12-24T05:22:00Z",
    "SubmissionStatusTypeID": 100
}