{
    "IsRecentlyVerified": false,
    "ID": 121648,
    "UUID": "2C637C6A-6A58-43AD-8CA0-4450A32C1561",
    "DataProviderID": 2,
    "DataProvidersReference": "121217",
    "OperatorID": 5,
    "UsageTypeID": 1,
    "AddressInfo": {
        "ID": 121994,
        "Title": "RPI 1",
        "AddressLine1": "77 College Ave",
        "Town": "Troy",
        "StateOrProvince": "NY",
        "Postcode": "12180",
        "CountryID": 2,
        "Latitude": 42.727553,
        "Longitude": -73.681191,
        "ContactTelephone1": "888-758-4389",
        "AccessComments": "24 hours daily",
        "RelatedURL": "http://www.chargepoint.com/",
        "DistanceUnit": 0
    },
    "Connections": [
        {
            "ID": 171437,
            "ConnectionTypeID": 1,
            "LevelID": 2,
            "Amps": 16,
            "Voltage": 230,
            "PowerKW": 3,
            "CurrentTypeID": 10,
            "Quantity": 4
        }
    ],
    "DateLastStatusUpdate": "2019-04-06T04:01:00Z",
    "DataQualityLevel": 3,
    "DateCreated": "2019-04-06T04:01:00Z",
    "SubmissionStatusTypeID": 100
}