{
    "IsRecentlyVerified": false,
    "ID": 149811,
    "UUID": "5442FF98-7456-4484-A1E1-2A48916BAD71",
    "DataProviderID": 1,
    "OperatorID": 1,
    "UsageTypeID": 1,
    "UsageCost": "Free",
    "AddressInfo": {
        "ID": 150164,
        "Title": "Ross King Memorial Public Library",
        "AddressLine1": "65 Olympic Drive",
        "Town": "Mount Pearl",
        "StateOrProvince": "NL",
        "Postcode": "A1N",
        "CountryID": 44,
        "Latitude": 47.50652955129368,
        "Longitude": -52.81798854243897,
        "AccessComments": "To the left of the front door",
        "DistanceUnit": 0
    },
    "Connections": [
        {
            "ID": 208017,
            "ConnectionTypeID": 1,
            "StatusTypeID": 50,
            "Quantity": 1,
            "Comments": "Actually a standard J1772"
        }
    ],
    "NumberOfPoints": 1,
    "StatusTypeID": 50,
    "DateLastStatusUpdate": "2020-03-06T13:20:00Z",
    "DataQualityLevel": 1,
    "DateCreated": "2020-03-06T00:19:00Z",
    "SubmissionStatusTypeID": 200
}