{
    "IsRecentlyVerified": false,
    "ID": 142070,
    "UUID": "4776C0FE-4BA2-4980-AB72-C75BB5DBC12C",
    "DataProviderID": 2,
    "DataProvidersReference": "143880",
    "OperatorID": 5,
    "UsageTypeID": 1,
    "AddressInfo": {
        "ID": 142422,
        "Title": "191 PRES",
        "AddressLine1": "191 Monument Rd",
        "Town": "Bala Cynwyd",
        "StateOrProvince": "PA",
        "Postcode": "19004",
        "CountryID": 2,
        "Latitude": 40.0122481,
        "Longitude": -75.216674,
        "ContactTelephone1": "888-758-4389",
        "AccessComments": "24 hours daily",
        "RelatedURL": "http://www.chargepoint.com/",
        "DistanceUnit": 0
    },
    "Connections": [
        {
            "ID": 198136,
            "ConnectionTypeID": 1,
            "LevelID": 2,
            "Amps": 16,
            "Voltage": 230,
            "PowerKW": 3.7,
            "CurrentTypeID": 10,
            "Quantity": 2
        }
    ],
    "StatusTypeID": 50,
    "DateLastStatusUpdate": "2020-06-26T03:02:00Z",
    "DataQualityLevel": 3,
    "DateCreated": "2019-12-24T09:17:00Z",
    "SubmissionStatusTypeID": 100
}