{
    "IsRecentlyVerified": false,
    "ID": 175712,
    "UUID": "046F87F9-FF41-46BA-82AA-4A9BDA03EA85",
    "DataProviderID": 1,
    "OperatorID": 3311,
    "UsageTypeID": 1,
    "AddressInfo": {
        "ID": 176071,
        "Title": "ELEN Sutivan",
        "AddressLine1": "Ulica Hrvatskih branitelja 5",
        "Town": "Sutivan",
        "Postcode": "21403",
        "CountryID": 60,
        "Latitude": 43.382730714084545,
        "Longitude": 16.478641030039853,
        "ContactTelephone1": "+385 800 300 404",
        "RelatedURL": "http://elen.hep.hr",
        "DistanceUnit": 0
    },
    "Connections": [
        {
            "ID": 272850,
            "ConnectionTypeID": 33,
            "StatusTypeID": 50,
            "LevelID": 3,
            "PowerKW": 50,
            "CurrentTypeID": 30,
            "Quantity": 1
        },
        {
            "ID": 272851,
            "ConnectionTypeID": 2,
            "StatusTypeID": 50,
            "LevelID": 3,
            "PowerKW": 50,
            "CurrentTypeID": 20,
            "Quantity": 1
        },
        {
            "ID": 272852,
            "ConnectionTypeID": 1036,
            "StatusTypeID": 50,
            "LevelID": 3,
            "PowerKW": 43,
            "CurrentTypeID": 20,
            "Quantity": 1
        }
    ],
    "NumberOfPoints": 1,
    "StatusTypeID": 50,
    "DateLastStatusUpdate": "2021-06-09T22:29:00Z",
    "DataQualityLevel": 1,
    "DateCreated": "2021-06-08T11:45:00Z",
    "SubmissionStatusTypeID": 200
}