{
    "IsRecentlyVerified": false,
    "ID": 130106,
    "UUID": "7774EC1B-98C2-4E91-886E-BE497F0E9B89",
    "DataProviderID": 1,
    "OperatorID": 32,
    "UsageTypeID": 5,
    "UsageCost": "£0.30/kWh (Contactless); £0.15/kWh (Polar Plus subscription); £0.25/kWh (Polar Instant app); Overstay £10/hour after 90 minutes ",
    "AddressInfo": {
        "ID": 130452,
        "Title": "Lincolnshire Co-op Albert Street Food Store",
        "AddressLine1": "Albert Street",
        "AddressLine2": "Newark",
        "Town": "Newark and Sherwood",
        "StateOrProvince": "England",
        "Postcode": "NG24 4BQ",
        "CountryID": 1,
        "Latitude": 53.0724721390891,
        "Longitude": -0.813650059893234,
        "ContactTelephone1": "0330 016 5126",
        "AccessComments": "Located Next To B&M (signs warn Driver's not to leave site while Charging).",
        "RelatedURL": "http://www.polar-network.com",
        "DistanceUnit": 0
    },
    "Connections": [
        {
            "ID": 182121,
            "ConnectionTypeID": 33,
            "StatusTypeID": 50,
            "LevelID": 3,
            "PowerKW": 50,
            "CurrentTypeID": 30,
            "Quantity": 1
        },
        {
            "ID": 182148,
            "ConnectionTypeID": 2,
            "StatusTypeID": 50,
            "LevelID": 3,
            "PowerKW": 50,
            "CurrentTypeID": 30,
            "Quantity": 1
        },
        {
            "ID": 182149,
            "ConnectionTypeID": 1036,
            "StatusTypeID": 50,
            "LevelID": 3,
            "Amps": 63,
            "Voltage": 400,
            "PowerKW": 43,
            "CurrentTypeID": 20,
            "Quantity": 1
        }
    ],
    "NumberOfPoints": 1,
    "GeneralComments": "Please note that an overstay fee of £10 per hour after 90 minutes stay applies to this site.",
    "StatusTypeID": 50,
    "DateLastStatusUpdate": "2020-10-02T10:40:00Z",
    "DataQualityLevel": 1,
    "DateCreated": "2019-08-01T12:56:00Z",
    "SubmissionStatusTypeID": 200
}