{
    "IsRecentlyVerified": false,
    "ID": 97412,
    "UUID": "E7C54DE2-E04C-4550-AA4B-B64C12AA6670",
    "DataProviderID": 1,
    "OperatorID": 23,
    "OperatorsReference": "38147",
    "UsageTypeID": 4,
    "AddressInfo": {
        "ID": 97758,
        "Title": "Helenekilde Badehotel",
        "AddressLine1": "Strandvejen 25",
        "Town": "Tisvildeleje",
        "Postcode": "3220",
        "CountryID": 65,
        "Latitude": 56.063563,
        "Longitude": 12.078385,
        "ContactTelephone1": "+45 48707001",
        "DistanceUnit": 0
    },
    "Connections": [
        {
            "ID": 138319,
            "ConnectionTypeID": 30,
            "StatusTypeID": 50,
            "LevelID": 2,
            "Amps": 16,
            "Voltage": 400,
            "PowerKW": 11,
            "CurrentTypeID": 20,
            "Quantity": 1
        }
    ],
    "NumberOfPoints": 1,
    "GeneralComments": "1 Tesla Connector, up to 11kW.Available for customers. Please call ahead.",
    "StatusTypeID": 50,
    "DateLastStatusUpdate": "2018-10-03T18:50:00Z",
    "DataQualityLevel": 1,
    "DateCreated": "2018-01-21T15:21:00Z",
    "SubmissionStatusTypeID": 200
}