{
    "IsRecentlyVerified": false,
    "ID": 88368,
    "UUID": "8E8236AC-FAE1-4EB4-B660-FA080117090D",
    "DataProviderID": 1,
    "OperatorID": 234,
    "UsageTypeID": 4,
    "AddressInfo": {
        "ID": 88714,
        "Title": "Bauhof",
        "AddressLine1": "Bahnhofstraße 5",
        "Town": "Lauterhofen",
        "StateOrProvince": "Landkreis Neumarkt in der Oberpfalz",
        "Postcode": "92283",
        "CountryID": 87,
        "Latitude": 49.36750079999999,
        "Longitude": 11.601275999999984,
        "RelatedURL": "http://www.ladeverbund-frankenplus.de/",
        "DistanceUnit": 0
    },
    "Connections": [
        {
            "ID": 125343,
            "ConnectionTypeID": 25,
            "StatusTypeID": 50,
            "LevelID": 2,
            "Amps": 32,
            "Voltage": 400,
            "PowerKW": 22,
            "CurrentTypeID": 20,
            "Quantity": 2
        }
    ],
    "NumberOfPoints": 2,
    "GeneralComments": "24/7 nutzbare Ladesäule.",
    "StatusTypeID": 50,
    "DateLastStatusUpdate": "2017-05-29T06:18:00Z",
    "DataQualityLevel": 1,
    "DateCreated": "2017-05-29T06:18:00Z",
    "SubmissionStatusTypeID": 200
}