{
    "IsRecentlyVerified": false,
    "ID": 178461,
    "UUID": "AC1BC79F-0DE7-42CF-824A-3F4C90B4FA99",
    "DataProviderID": 29,
    "DataProvidersReference": "3014",
    "OperatorID": 86,
    "AddressInfo": {
        "ID": 178820,
        "Title": "Wilhelm-Pfefferle-Str. 4",
        "AddressLine1": "Wilhelm-Pfefferle-Str. 4",
        "Town": "Endingen am Kaiserstuhl",
        "Postcode": "79346",
        "CountryID": 87,
        "Latitude": 48.148052,
        "Longitude": 7.709592,
        "DistanceUnit": 0
    },
    "Connections": [
        {
            "ID": 278897,
            "ConnectionTypeID": 28,
            "StatusTypeID": 50,
            "LevelID": 2,
            "PowerKW": 22,
            "CurrentTypeID": 20
        },
        {
            "ID": 278898,
            "ConnectionTypeID": 25,
            "StatusTypeID": 50,
            "LevelID": 2,
            "PowerKW": 22,
            "CurrentTypeID": 20
        },
        {
            "ID": 295602,
            "ConnectionTypeID": 28,
            "StatusTypeID": 50,
            "LevelID": 2,
            "PowerKW": 22,
            "CurrentTypeID": 20
        },
        {
            "ID": 295603,
            "ConnectionTypeID": 25,
            "StatusTypeID": 50,
            "LevelID": 2,
            "PowerKW": 22,
            "CurrentTypeID": 20
        }
    ],
    "StatusTypeID": 0,
    "DateLastStatusUpdate": "2021-07-12T02:40:00Z",
    "MetadataValues": [
        {
            "ID": 10755,
            "MetadataFieldID": 4,
            "ItemValue": "Data from the German chargepoint registry provided by Bundesnetzagentur.de under the CC-BY 4.0 license"
        }
    ],
    "DataQualityLevel": 3,
    "DateCreated": "2021-07-08T09:50:00Z",
    "SubmissionStatusTypeID": 100
}