{
    "IsRecentlyVerified": false,
    "ID": 62638,
    "UUID": "8AF36036-62A8-42E8-BC9F-5CCBC5E6C3CF",
    "DataProviderID": 26,
    "DataProvidersReference": "19717",
    "OperatorID": 162,
    "OperatorsReference": "関東三菱自動車販売（株）都筑店",
    "UsageCost": "0.00 onbekend",
    "AddressInfo": {
        "ID": 62984,
        "Title": "中原街道",
        "AddressLine1": "中原街道",
        "Town": "三浦郡",
        "Postcode": "224-0037",
        "CountryID": 114,
        "Latitude": 35.534412,
        "Longitude": 139.585831,
        "DistanceUnit": 0
    },
    "Connections": [
        {
            "ID": 79560,
            "ConnectionTypeID": 2,
            "LevelID": 3,
            "PowerKW": 50,
            "CurrentTypeID": 30
        },
        {
            "ID": 95265,
            "ConnectionTypeID": 2,
            "LevelID": 3,
            "PowerKW": 50,
            "CurrentTypeID": 30
        }
    ],
    "NumberOfPoints": 1,
    "StatusTypeID": 50,
    "DateLastStatusUpdate": "2016-06-04T02:37:00Z",
    "DataQualityLevel": 3,
    "DateCreated": "2016-03-03T12:29:00Z",
    "SubmissionStatusTypeID": 100
}