{
    "UserComments": [
        {
            "ID": 21183,
            "ChargePointID": 39273,
            "CommentTypeID": 10,
            "UserName": "Christopher Cook",
            "Comment": "Zoe and Leaf successfully charging, station starting to look a bit rusty and weathered but still going.",
            "Rating": 4,
            "DateCreated": "2019-07-08T16:01:58.457Z",
            "User": {
                "ID": 1000,
                "Username": "Christopher Cook"
            }
        },
        {
            "ID": 8354,
            "ChargePointID": 39273,
            "CommentTypeID": 10,
            "UserName": "Sandy Ritchie",
            "Comment": "Charged on Sunday while enjoying some post Christmas chips with the family.",
            "Rating": 3,
            "DateCreated": "2015-12-29T15:57:13.683Z",
            "User": {
                "ID": 4778,
                "Username": "Sandy Ritchie"
            },
            "CheckinStatusTypeID": 10
        },
        {
            "ID": 6042,
            "ChargePointID": 39273,
            "CommentTypeID": 50,
            "UserName": "Sandy Ritchie",
            "Comment": "Good charger, stupid location.  Its in the large car park next to the RNLI station, this car park is often used for festivals, car shows etc and during those times the car park is unavailable to normal traffic.  So don't rely on this charger unless you have first confirmed that there isn't any kind of event on it the town.",
            "Rating": 3,
            "DateCreated": "2015-07-27T16:59:56.823Z",
            "User": {
                "ID": 4778,
                "Username": "Sandy Ritchie"
            },
            "CheckinStatusTypeID": 10
        }
    ],
    "MediaItems": [
        {
            "ID": 18836,
            "ChargePointID": 39273,
            "ItemURL": "https://s3-ap-southeast-2.amazonaws.com/openchargemap/images/GB/OCM39273/OCM-39273.orig.2019070817234451.png",
            "ItemThumbnailURL": "https://s3-ap-southeast-2.amazonaws.com/openchargemap/images/GB/OCM39273/OCM-39273.thmb.2019070817234451.png",
            "Comment": "",
            "IsEnabled": true,
            "IsVideo": false,
            "IsFeaturedItem": false,
            "IsExternalResource": false,
            "User": {
                "ID": 1000,
                "Username": "Christopher Cook"
            },
            "DateCreated": "2019-07-08T17:24:00Z"
        },
        {
            "ID": 18835,
            "ChargePointID": 39273,
            "ItemURL": "https://s3-ap-southeast-2.amazonaws.com/openchargemap/images/GB/OCM39273/OCM-39273.orig.2019070817230922.png",
            "ItemThumbnailURL": "https://s3-ap-southeast-2.amazonaws.com/openchargemap/images/GB/OCM39273/OCM-39273.thmb.2019070817230922.png",
            "Comment": "",
            "IsEnabled": true,
            "IsVideo": false,
            "IsFeaturedItem": false,
            "IsExternalResource": false,
            "User": {
                "ID": 1000,
                "Username": "Christopher Cook"
            },
            "DateCreated": "2019-07-08T17:23:00Z"
        }
    ],
    "IsRecentlyVerified": false,
    "ID": 39273,
    "UUID": "74A88661-F3B9-4C11-A89A-DE038CD25433",
    "DataProviderID": 1,
    "OperatorID": 3315,
    "OperatorsReference": "50697",
    "UsageTypeID": 4,
    "UsageCost": "free",
    "AddressInfo": {
        "ID": 39619,
        "Title": "East Basin Car Park",
        "AddressLine1": "East Shore Road",
        "Town": "Anstruther",
        "StateOrProvince": "Fife",
        "Postcode": "KY10 3AB",
        "CountryID": 1,
        "Latitude": 56.2216089271142,
        "Longitude": -2.69715134267539,
        "AccessComments": "Located within East Basin Car Park and adjacent to RNLI building.",
        "DistanceUnit": 0
    },
    "Connections": [
        {
            "ID": 42784,
            "ConnectionTypeID": 25,
            "StatusTypeID": 50,
            "LevelID": 2,
            "Amps": 32,
            "Voltage": 230,
            "PowerKW": 7,
            "CurrentTypeID": 10,
            "Quantity": 2
        }
    ],
    "NumberOfPoints": 2,
    "StatusTypeID": 50,
    "DateLastStatusUpdate": "2019-07-08T17:24:00Z",
    "DataQualityLevel": 1,
    "DateCreated": "2015-01-09T08:55:00Z",
    "SubmissionStatusTypeID": 200
}