{
    "IsRecentlyVerified": false,
    "ID": 68953,
    "UUID": "D885B5F0-EC3C-4267-8018-878CC19BEA71",
    "DataProviderID": 19,
    "DataProvidersReference": "3444",
    "AddressInfo": {
        "ID": 69299,
        "Title": "Kolmårdens Djurpark - Vildmarkshotellet",
        "AddressLine1": "Kolmården ",
        "Town": "KOLMÅRDEN",
        "StateOrProvince": "ÖSTERGÖTLAND",
        "Postcode": "61892",
        "CountryID": 216,
        "Latitude": 58.65915,
        "Longitude": 16.45302,
        "AccessComments": "På Vildmarkshotellets parkering närmast hotellentrén",
        "DistanceUnit": 0
    },
    "Connections": [
        {
            "ID": 96701,
            "ConnectionTypeID": 25,
            "Reference": "1",
            "LevelID": 3,
            "Amps": 32,
            "Voltage": 400,
            "PowerKW": 12,
            "CurrentTypeID": 30,
            "Comments": "Mode 3"
        },
        {
            "ID": 96702,
            "ConnectionTypeID": 25,
            "Reference": "2",
            "LevelID": 3,
            "Amps": 32,
            "Voltage": 400,
            "PowerKW": 12,
            "CurrentTypeID": 30,
            "Comments": "Mode 3"
        },
        {
            "ID": 96703,
            "ConnectionTypeID": 25,
            "Reference": "3",
            "LevelID": 3,
            "Amps": 32,
            "Voltage": 400,
            "PowerKW": 12,
            "CurrentTypeID": 30,
            "Comments": "Mode 3"
        },
        {
            "ID": 96704,
            "ConnectionTypeID": 25,
            "Reference": "4",
            "LevelID": 3,
            "Amps": 32,
            "Voltage": 400,
            "PowerKW": 12,
            "CurrentTypeID": 30,
            "Comments": "Mode 3"
        }
    ],
    "NumberOfPoints": 4,
    "DateLastStatusUpdate": "2019-02-11T09:16:00Z",
    "DataQualityLevel": 2,
    "DateCreated": "2016-06-25T03:52:00Z",
    "SubmissionStatusTypeID": 100
}