{
    "UserComments": [
        {
            "ID": 22546,
            "ChargePointID": 135250,
            "CommentTypeID": 10,
            "UserName": "ForumElettrico.it",
            "Comment": "Accanto alla Superstrada. Leggi la recensione completa qui > \r\nhttps://www.forumelettrico.it/forum/nuove-colonnine-di-ricarica-a-todi-provicia-perugia-t8206.html",
            "RelatedURL": "https://www.forumelettrico.it/forum/nuove-colonnine-di-ricarica-a-todi-provicia-perugia-t8206.html",
            "DateCreated": "2020-05-04T16:37:50.8Z",
            "User": {
                "ID": 11749,
                "Username": "ForumElettrico.it"
            },
            "CheckinStatusTypeID": 10,
            "IsActionedByEditor": false
        }
    ],
    "MediaItems": [
        {
            "ID": 22227,
            "ChargePointID": 135250,
            "ItemURL": "https://s3-ap-southeast-2.amazonaws.com/openchargemap/images/IT/OCM135250/OCM-135250.orig.2020050416380329.jpg",
            "ItemThumbnailURL": "https://s3-ap-southeast-2.amazonaws.com/openchargemap/images/IT/OCM135250/OCM-135250.thmb.2020050416380329.jpg",
            "Comment": "",
            "IsEnabled": true,
            "IsVideo": false,
            "IsFeaturedItem": false,
            "IsExternalResource": false,
            "User": {
                "ID": 11749,
                "Username": "ForumElettrico.it"
            },
            "DateCreated": "2020-05-04T16:38:00Z"
        },
        {
            "ID": 22228,
            "ChargePointID": 135250,
            "ItemURL": "https://s3-ap-southeast-2.amazonaws.com/openchargemap/images/IT/OCM135250/OCM-135250.orig.2020050416381298.jpg",
            "ItemThumbnailURL": "https://s3-ap-southeast-2.amazonaws.com/openchargemap/images/IT/OCM135250/OCM-135250.thmb.2020050416381298.jpg",
            "Comment": "",
            "IsEnabled": true,
            "IsVideo": false,
            "IsFeaturedItem": false,
            "IsExternalResource": false,
            "User": {
                "ID": 11749,
                "Username": "ForumElettrico.it"
            },
            "DateCreated": "2020-05-04T16:38:00Z"
        }
    ],
    "IsRecentlyVerified": false,
    "ID": 135250,
    "UUID": "615FF704-D920-4257-98CE-4D3F2BCF06B9",
    "DataProviderID": 1,
    "OperatorID": 80,
    "UsageTypeID": 4,
    "UsageCost": "0,45 €/kW",
    "AddressInfo": {
        "ID": 135596,
        "Title": "Europalace Hotel Todi | EnelX",
        "AddressLine1": "Via Tiberina",
        "AddressLine2": "Località Pian di Porto",
        "Town": "Todi",
        "StateOrProvince": "PG",
        "Postcode": "06059",
        "CountryID": 112,
        "Latitude": 42.80604621505137,
        "Longitude": 12.408144067148214,
        "RelatedURL": "https://www.enelx.com/it/it/mobilita-elettrica",
        "DistanceUnit": 0
    },
    "Connections": [
        {
            "ID": 189474,
            "ConnectionTypeID": 25,
            "StatusTypeID": 50,
            "LevelID": 2,
            "Amps": 32,
            "Voltage": 400,
            "PowerKW": 22,
            "CurrentTypeID": 20,
            "Quantity": 1
        },
        {
            "ID": 189475,
            "ConnectionTypeID": 36,
            "StatusTypeID": 50,
            "LevelID": 2,
            "Amps": 16,
            "Voltage": 240,
            "PowerKW": 3.7,
            "CurrentTypeID": 10,
            "Quantity": 1
        }
    ],
    "NumberOfPoints": 2,
    "StatusTypeID": 50,
    "DateLastStatusUpdate": "2020-05-04T16:38:00Z",
    "DataQualityLevel": 1,
    "DateCreated": "2019-12-12T14:38:00Z",
    "SubmissionStatusTypeID": 200
}