{
    "IsRecentlyVerified": false,
    "ID": 173658,
    "UUID": "E3500459-0C10-456B-AB63-812006E77E29",
    "DataProviderID": 18,
    "DataProvidersReference": "f35d2ebad72de23e570c4f749d4f62c2",
    "UsageTypeID": 1,
    "AddressInfo": {
        "ID": 174017,
        "Title": "CO10 9SA",
        "AddressLine1": "",
        "Town": "Lavenham",
        "Postcode": "CO10 9SA",
        "CountryID": 1,
        "Latitude": 52.10606,
        "Longitude": 0.793948,
        "AccessComments": "",
        "RelatedURL": "http://www.plug-n-go.com/",
        "DistanceUnit": 0
    },
    "Connections": [
        {
            "ID": 266783,
            "ConnectionTypeID": 25,
            "Reference": "GBR023A",
            "StatusTypeID": 50,
            "LevelID": 2,
            "Amps": 32,
            "Voltage": 400,
            "PowerKW": 22,
            "CurrentTypeID": 20
        },
        {
            "ID": 266784,
            "ConnectionTypeID": 25,
            "Reference": "GBR023B",
            "StatusTypeID": 50,
            "LevelID": 2,
            "Amps": 32,
            "Voltage": 400,
            "PowerKW": 22,
            "CurrentTypeID": 20
        }
    ],
    "StatusTypeID": 0,
    "DateLastStatusUpdate": "2021-03-03T11:25:00Z",
    "MetadataValues": [
        {
            "ID": 8580,
            "MetadataFieldID": 4,
            "ItemValue": "Contains public sector information licensed under the Open Government Licence v2.0. http://www.nationalarchives.gov.uk/doc/open-government-licence/version/2/"
        }
    ],
    "DataQualityLevel": 3,
    "DateCreated": "2021-03-03T11:25:00Z",
    "SubmissionStatusTypeID": 100
}