{
    "IsRecentlyVerified": false,
    "ID": 146034,
    "UUID": "5323EA8A-22D8-4507-B7D8-221FA5930E0F",
    "DataProviderID": 1,
    "OperatorID": 23,
    "OperatorsReference": "52548",
    "UsageTypeID": 4,
    "UsageCost": "$0.44/min >=60kW; $0.22/min <60kW; other tariffs for older cars",
    "AddressInfo": {
        "ID": 146386,
        "Title": "Thunder Bay, on Supercharger",
        "AddressLine1": "1221 Arthur Street West",
        "Town": "Thunder Bay",
        "StateOrProvince": "ON",
        "Postcode": "P7K 1K2",
        "CountryID": 44,
        "Latitude": 48.3808951,
        "Longitude": -89.2476823,
        "DistanceUnit": 0
    },
    "Connections": [
        {
            "ID": 202922,
            "ConnectionTypeID": 27,
            "StatusTypeID": 50,
            "LevelID": 3,
            "PowerKW": 120,
            "CurrentTypeID": 30,
            "Quantity": 6
        }
    ],
    "NumberOfPoints": 6,
    "GeneralComments": "Charging6 Superchargers, available 24/7, up to 250kW",
    "StatusTypeID": 50,
    "DateLastStatusUpdate": "2021-01-04T13:38:00Z",
    "DataQualityLevel": 1,
    "DateCreated": "2019-12-30T21:27:00Z",
    "SubmissionStatusTypeID": 200
}