{
    "IsRecentlyVerified": false,
    "ID": 14591,
    "UUID": "CEAD9726-AFF8-44E8-929A-1DF9DB7BA09F",
    "DataProviderID": 1,
    "OperatorID": 5,
    "UsageTypeID": 1,
    "UsageCost": "Free",
    "AddressInfo": {
        "ID": 14488,
        "Title": "ENTERGY",
        "AddressLine1": "4400 S M L King Jr Pkwy",
        "AddressLine2": "",
        "Town": "Beaumont",
        "StateOrProvince": "TX",
        "Postcode": "77705",
        "CountryID": 2,
        "Latitude": 30.044160683671297,
        "Longitude": -94.07145380973816,
        "ContactTelephone1": "888-758-4389",
        "ContactTelephone2": "",
        "ContactEmail": "",
        "AccessComments": "24 hours daily",
        "RelatedURL": "http://www.chargepoint.com/",
        "DistanceUnit": 0
    },
    "Connections": [
        {
            "ID": 16708,
            "ConnectionTypeID": 9,
            "StatusTypeID": 0,
            "LevelID": 1,
            "Amps": 16,
            "Voltage": 120,
            "PowerKW": 1,
            "CurrentTypeID": 10,
            "Quantity": 1
        },
        {
            "ID": 16709,
            "ConnectionTypeID": 1,
            "StatusTypeID": 0,
            "LevelID": 2,
            "Amps": 16,
            "Voltage": 230,
            "PowerKW": 3,
            "CurrentTypeID": 10,
            "Quantity": 1
        },
        {
            "ID": 21863,
            "ConnectionTypeID": 1,
            "StatusTypeID": 0,
            "LevelID": 2,
            "Quantity": 1
        },
        {
            "ID": 130106,
            "ConnectionTypeID": 11,
            "StatusTypeID": 50,
            "CurrentTypeID": 10
        }
    ],
    "NumberOfPoints": 1,
    "GeneralComments": "",
    "StatusTypeID": 50,
    "DateLastStatusUpdate": "2017-08-17T15:36:00Z",
    "DataQualityLevel": 3,
    "DateCreated": "2012-12-06T16:50:00Z",
    "SubmissionStatusTypeID": 100
}