{
    "IsRecentlyVerified": false,
    "ID": 119909,
    "UUID": "6CFA8119-FF06-4944-8A21-A95207B940AA",
    "DataProviderID": 2,
    "DataProvidersReference": "82723",
    "OperatorID": 39,
    "UsageTypeID": 1,
    "AddressInfo": {
        "ID": 120255,
        "Title": "Royal Floridian Resort Association, Inc.",
        "AddressLine1": "51 South Atlantic Avenue",
        "Town": "Ormond Beach",
        "StateOrProvince": "FL",
        "Postcode": "32176",
        "CountryID": 2,
        "Latitude": 29.2913753,
        "Longitude": -81.039232,
        "ContactTelephone1": "800-663-5633",
        "AccessComments": "MO: Not Specified; TU: Not Specified; WE: Not Specified; TH: Not Specified; FR: Not Specified; SA: Not Specified; SU: Not Specified",
        "RelatedURL": "http://www.semacharge.com/",
        "DistanceUnit": 0
    },
    "Connections": [
        {
            "ID": 169209,
            "ConnectionTypeID": 1,
            "LevelID": 2,
            "Amps": 16,
            "Voltage": 230,
            "PowerKW": 3,
            "CurrentTypeID": 10,
            "Quantity": 1
        }
    ],
    "DateLastStatusUpdate": "2019-04-01T04:59:00Z",
    "DataQualityLevel": 3,
    "DateCreated": "2019-04-01T04:59:00Z",
    "SubmissionStatusTypeID": 100
}