{
    "IsRecentlyVerified": false,
    "ID": 101074,
    "UUID": "A4FC1794-C2D6-4939-9923-08724A55E227",
    "DataProviderID": 1,
    "OperatorID": 23,
    "OperatorsReference": "41538",
    "UsageTypeID": 6,
    "AddressInfo": {
        "ID": 101420,
        "Title": "Vale d'Oliveiras Quinta Resort & Spa",
        "AddressLine1": "Barranco Fundo",
        "Town": "Carvoeiro",
        "Postcode": "8401-904",
        "CountryID": 180,
        "Latitude": 37.120468,
        "Longitude": -8.491412,
        "ContactTelephone1": "+351 282 380 560",
        "DistanceUnit": 0
    },
    "Connections": [
        {
            "ID": 142702,
            "ConnectionTypeID": 30,
            "StatusTypeID": 50,
            "LevelID": 2,
            "Amps": 32,
            "Voltage": 400,
            "PowerKW": 22,
            "CurrentTypeID": 20,
            "Quantity": 1
        }
    ],
    "NumberOfPoints": 1,
    "GeneralComments": "1 Tesla Connector, up to 22kW.Available for customers. Please see front desk.",
    "StatusTypeID": 50,
    "DateLastStatusUpdate": "2020-01-14T21:21:00Z",
    "DataQualityLevel": 1,
    "DateCreated": "2018-03-17T07:04:00Z",
    "SubmissionStatusTypeID": 200
}