{
    "IsRecentlyVerified": false,
    "ID": 160944,
    "UUID": "C66C22E4-0C9C-4359-A5F1-27813BAFC495",
    "DataProviderID": 1,
    "OperatorID": 23,
    "OperatorsReference": "50592",
    "UsageTypeID": 4,
    "UsageCost": "£0.24/kWh;other tariffs for older cars",
    "AddressInfo": {
        "ID": 161301,
        "Title": "Colchester",
        "AddressLine1": "London Road Colchester",
        "Town": "Colchester",
        "Postcode": "CO6 1DU",
        "CountryID": 1,
        "Latitude": 51.88071,
        "Longitude": 0.788574,
        "DistanceUnit": 0
    },
    "Connections": [
        {
            "ID": 231627,
            "ConnectionTypeID": 27,
            "StatusTypeID": 50,
            "LevelID": 3,
            "PowerKW": 120,
            "CurrentTypeID": 30,
            "Quantity": 12
        }
    ],
    "NumberOfPoints": 12,
    "GeneralComments": "Charging12 Superchargers, available 24/7, up to 150kW",
    "StatusTypeID": 50,
    "DateLastStatusUpdate": "2020-07-02T10:04:00Z",
    "DataQualityLevel": 1,
    "DateCreated": "2020-07-02T10:04:00Z",
    "SubmissionStatusTypeID": 200
}