{
    "IsRecentlyVerified": false,
    "ID": 157589,
    "UUID": "9F290228-419F-4854-85BE-572D29A937CA",
    "DataProviderID": 1,
    "OperatorID": 45,
    "UsageTypeID": 1,
    "UsageCost": "Free",
    "AddressInfo": {
        "ID": 157943,
        "Title": "Bunnings Newstead Carpark",
        "AddressLine1": "Breakfast Creek Road",
        "AddressLine2": "Newstead",
        "Town": "Brisbane",
        "StateOrProvince": "Queensland",
        "Postcode": "4006",
        "CountryID": 18,
        "Latitude": -27.44310701845047,
        "Longitude": 153.0430958229631,
        "AccessComments": "The Bunnings carpark has free parking for up to 2 hours. Enter via Ross St through the boom gate.",
        "DistanceUnit": 0
    },
    "Connections": [
        {
            "ID": 227036,
            "ConnectionTypeID": 29,
            "StatusTypeID": 50,
            "LevelID": 2,
            "Amps": 10,
            "Voltage": 240,
            "PowerKW": 2.4,
            "CurrentTypeID": 10,
            "Quantity": 5
        }
    ],
    "NumberOfPoints": 5,
    "GeneralComments": "There are various 10A sockets spread throughout the carpark. The lower level is normally emptier and much easier to find a park next to a socket.",
    "StatusTypeID": 50,
    "DateLastStatusUpdate": "2020-06-19T07:40:00Z",
    "DataQualityLevel": 1,
    "DateCreated": "2020-06-18T09:53:00Z",
    "SubmissionStatusTypeID": 200
}