{
    "IsRecentlyVerified": false,
    "ID": 97186,
    "UUID": "945FE8C1-8CFB-4139-BAE7-16E2B25005CF",
    "DataProviderID": 1,
    "OperatorID": 220,
    "OperatorsReference": "0361,0362,0363",
    "UsageTypeID": 1,
    "UsageCost": "€1.73 + €0.3213/kWh; Andere Tarife möglich",
    "AddressInfo": {
        "ID": 97532,
        "Title": "Traberweg 2",
        "AddressLine1": "Traberweg 2",
        "Town": "Wandsbek",
        "StateOrProvince": "Hamburg",
        "Postcode": "22159",
        "CountryID": 87,
        "Latitude": 53.59762,
        "Longitude": 10.10178,
        "DistanceUnit": 0
    },
    "Connections": [
        {
            "ID": 138004,
            "ConnectionTypeID": 33,
            "StatusTypeID": 50,
            "LevelID": 3,
            "PowerKW": 50,
            "CurrentTypeID": 30,
            "Quantity": 1
        },
        {
            "ID": 138043,
            "ConnectionTypeID": 25,
            "StatusTypeID": 50,
            "LevelID": 2,
            "Amps": 16,
            "Voltage": 400,
            "PowerKW": 11,
            "CurrentTypeID": 20,
            "Quantity": 1
        },
        {
            "ID": 138044,
            "ConnectionTypeID": 2,
            "StatusTypeID": 50,
            "LevelID": 3,
            "PowerKW": 50,
            "CurrentTypeID": 30,
            "Quantity": 1
        }
    ],
    "NumberOfPoints": 1,
    "StatusTypeID": 50,
    "DateLastStatusUpdate": "2018-01-27T06:55:00Z",
    "DataQualityLevel": 1,
    "DateCreated": "2018-01-10T06:33:00Z",
    "SubmissionStatusTypeID": 200
}