{
    "IsRecentlyVerified": false,
    "ID": 157264,
    "UUID": "DDB5359E-2B03-4ECA-8CF6-2A9E5C55D4F4",
    "DataProviderID": 19,
    "DataProvidersReference": "5564",
    "AddressInfo": {
        "ID": 157618,
        "Title": "Icemakers Arjeplog",
        "AddressLine1": "Maskinvägen 11",
        "Town": "ARJEPLOG",
        "StateOrProvince": "NORRBOTTEN",
        "Postcode": "93090",
        "CountryID": 216,
        "Latitude": 66.050323,
        "Longitude": 17.837075,
        "AccessComments": "Icemakers Arjeplog",
        "DistanceUnit": 0
    },
    "Connections": [
        {
            "ID": 226325,
            "ConnectionTypeID": 33,
            "Reference": "1",
            "LevelID": 3,
            "Amps": 100,
            "Voltage": 500,
            "PowerKW": 50,
            "CurrentTypeID": 30,
            "Comments": "Mode 4"
        },
        {
            "ID": 226326,
            "ConnectionTypeID": 2,
            "Reference": "2",
            "LevelID": 3,
            "Amps": 100,
            "Voltage": 500,
            "PowerKW": 50,
            "CurrentTypeID": 30,
            "Comments": "Mode 4"
        },
        {
            "ID": 226327,
            "ConnectionTypeID": 25,
            "Reference": "3",
            "LevelID": 3,
            "Amps": 63,
            "Voltage": 400,
            "PowerKW": 43,
            "CurrentTypeID": 20,
            "Comments": "Mode 3"
        }
    ],
    "NumberOfPoints": 3,
    "StatusTypeID": 0,
    "DateLastStatusUpdate": "2021-03-24T05:12:00Z",
    "DataQualityLevel": 2,
    "DateCreated": "2020-05-26T08:25:00Z",
    "SubmissionStatusTypeID": 100
}