{
    "IsRecentlyVerified": false,
    "ID": 45631,
    "UUID": "26B69B26-D678-4795-B814-95087CF64F93",
    "DataProviderID": 1,
    "DataProvidersReference": "2185",
    "AddressInfo": {
        "ID": 45977,
        "Title": "Fortum McD Kållered",
        "AddressLine1": "Ekenleden 3",
        "Town": "KÅLLERED",
        "StateOrProvince": "VÄSTRA GÖTALAND",
        "Postcode": "42836",
        "CountryID": 216,
        "Latitude": 57.60104,
        "Longitude": 12.04912,
        "AccessComments": "Laddstation på McDonalds parkering i Kållered.",
        "DistanceUnit": 0
    },
    "Connections": [
        {
            "ID": 56294,
            "ConnectionTypeID": 0,
            "Reference": "1",
            "LevelID": 2,
            "Amps": 16,
            "Voltage": 230,
            "PowerKW": 3.7,
            "Comments": "Mode 3"
        },
        {
            "ID": 87849,
            "ConnectionTypeID": 0,
            "Reference": "2",
            "LevelID": 2,
            "Amps": 16,
            "Voltage": 230,
            "PowerKW": 3.7,
            "Comments": "Mode 3"
        }
    ],
    "NumberOfPoints": 2,
    "DateLastStatusUpdate": "2020-05-26T08:21:00Z",
    "DataQualityLevel": 2,
    "DateCreated": "2015-05-03T00:54:00Z",
    "SubmissionStatusTypeID": 100
}