{
    "IsRecentlyVerified": false,
    "ID": 92184,
    "UUID": "177888E9-F9A4-4854-8D7F-A86347EEB8CD",
    "DataProviderID": 1,
    "OperatorID": 25,
    "OperatorsReference": "wandsworth-longwooddrive",
    "UsageTypeID": 4,
    "UsageCost": "£0.059/minute; min £1.18; other tariffs available",
    "AddressInfo": {
        "ID": 92530,
        "Title": "Longwood Drive",
        "AddressLine1": "2 Longwood Drive",
        "Town": "LONDON",
        "Postcode": "SW15 5DL",
        "CountryID": 1,
        "Latitude": 51.4510059088,
        "Longitude": -0.237974847993,
        "DistanceUnit": 0
    },
    "Connections": [
        {
            "ID": 130700,
            "ConnectionTypeID": 25,
            "StatusTypeID": 50,
            "LevelID": 2,
            "Amps": 32,
            "Voltage": 230,
            "PowerKW": 7,
            "CurrentTypeID": 10,
            "Quantity": 3
        },
        {
            "ID": 130701,
            "ConnectionTypeID": 1,
            "StatusTypeID": 50,
            "LevelID": 2,
            "Amps": 16,
            "Voltage": 230,
            "PowerKW": 4,
            "CurrentTypeID": 10,
            "Quantity": 3
        }
    ],
    "NumberOfPoints": 3,
    "StatusTypeID": 50,
    "DateLastStatusUpdate": "2017-11-28T06:33:00Z",
    "DataQualityLevel": 1,
    "DateCreated": "2017-08-30T05:27:00Z",
    "SubmissionStatusTypeID": 200
}