{
    "IsRecentlyVerified": false,
    "ID": 64083,
    "UUID": "BE71A496-B622-407F-B5B4-A1B9A45AE8DF",
    "DataProviderID": 26,
    "DataProvidersReference": "73363",
    "OperatorID": 103,
    "OperatorsReference": "Allego NLALLEGO0004831",
    "UsageCost": "0.00 jaarabonnement",
    "AddressInfo": {
        "ID": 64429,
        "Title": "Bergkristal 1",
        "AddressLine1": "Bergkristal 1",
        "Town": "Heerhugowaard",
        "Postcode": "1703 EA",
        "CountryID": 159,
        "Latitude": 52.66010178,
        "Longitude": 4.82481955,
        "ContactTelephone1": "0800-3745337",
        "RelatedURL": "http://www.allego.eu/",
        "DistanceUnit": 0
    },
    "Connections": [
        {
            "ID": 81953,
            "ConnectionTypeID": 25,
            "LevelID": 2,
            "PowerKW": 11,
            "CurrentTypeID": 10
        },
        {
            "ID": 81954,
            "ConnectionTypeID": 25,
            "LevelID": 2,
            "PowerKW": 11,
            "CurrentTypeID": 10
        }
    ],
    "NumberOfPoints": 1,
    "StatusTypeID": 50,
    "DateLastStatusUpdate": "2016-06-04T02:55:00Z",
    "DataQualityLevel": 3,
    "DateCreated": "2016-03-03T12:33:00Z",
    "SubmissionStatusTypeID": 100
}