{
    "IsRecentlyVerified": false,
    "ID": 96967,
    "UUID": "3BB4B803-3DC3-4CBC-93DF-34B2CDA30F3D",
    "DataProviderID": 2,
    "DataProvidersReference": "89924",
    "UsageTypeID": 1,
    "AddressInfo": {
        "ID": 97313,
        "Title": "Black Bear Inn",
        "AddressLine1": "505 W Ramshorn",
        "Town": "Dubois",
        "StateOrProvince": "WY",
        "Postcode": "82513",
        "CountryID": 2,
        "Latitude": 43.534538,
        "Longitude": -109.639602,
        "ContactTelephone1": "303-842-2315",
        "AccessComments": "24 hours daily",
        "RelatedURL": "",
        "DistanceUnit": 0
    },
    "Connections": [
        {
            "ID": 137356,
            "ConnectionTypeID": 1,
            "LevelID": 2,
            "Amps": 16,
            "Voltage": 230,
            "PowerKW": 3.7,
            "CurrentTypeID": 10,
            "Quantity": 2
        }
    ],
    "DateLastStatusUpdate": "2020-06-26T03:07:00Z",
    "DataQualityLevel": 3,
    "DateCreated": "2018-01-04T06:14:00Z",
    "SubmissionStatusTypeID": 100
}