{
    "IsRecentlyVerified": false,
    "ID": 15736,
    "UUID": "9BCD502B-C368-4092-B310-8CFB6A6C21B4",
    "DataProviderID": 1,
    "OperatorID": 56,
    "UsageTypeID": 4,
    "UsageCost": "Free",
    "AddressInfo": {
        "ID": 16081,
        "Title": "Trachel",
        "AddressLine1": "2 rue Trachel",
        "Town": "NICE",
        "Postcode": "06000",
        "CountryID": 80,
        "Latitude": 43.7065516,
        "Longitude": 7.264150699999959,
        "DistanceUnit": 0
    },
    "Connections": [
        {
            "ID": 14081,
            "ConnectionTypeID": 13,
            "StatusTypeID": 0,
            "LevelID": 2,
            "Amps": 16,
            "Voltage": 220,
            "PowerKW": 4,
            "CurrentTypeID": 20,
            "Quantity": 2
        }
    ],
    "NumberOfPoints": 2,
    "StatusTypeID": 50,
    "DateLastStatusUpdate": "2017-04-21T20:05:00Z",
    "DataQualityLevel": 1,
    "DateCreated": "2013-01-21T15:28:00Z",
    "SubmissionStatusTypeID": 200
}