{
    "IsRecentlyVerified": false,
    "ID": 47929,
    "UUID": "92C5750F-D24C-4026-A174-9210E2474E7B",
    "DataProviderID": 1,
    "OperatorID": 140,
    "UsageTypeID": 1,
    "UsageCost": "0",
    "AddressInfo": {
        "ID": 48275,
        "Title": "Lahn-Dill-Bergland-Therme",
        "AddressLine1": "Am Bewegungsbad 2",
        "Town": "Bad Endbach",
        "StateOrProvince": "Landkreis Marburg-Biedenkopf",
        "Postcode": "35080",
        "CountryID": 87,
        "Latitude": 50.75547,
        "Longitude": 8.48170000000005,
        "ContactTelephone1": "+49-6691-2070",
        "ContactEmail": "info@schwalmstadt.de",
        "AccessComments": "Ladesäule beim Parkplatz der Lahn-Dill-Bergland-Therme. Ladekarte von E.OM oder EAM erforderlich, kann an der Kasse der Lahn-Dill-Bergland-Therme (Öffnungszeiten: Mo.-Fr. 10:00-22:00 Uhr, So. 08:00-20:00 Uhr, an Feiertagen: 08:00-20:00 Uhr) oder bei der Stadtverwaltung Bad Endbach (Öffnungszeiten: Mo.-Fr. 08:30-12:00 Uhr, Do. 13:30-17:30 Uhr) erworben werden.",
        "RelatedURL": "http://www.schwalmstadt.de",
        "DistanceUnit": 0
    },
    "Connections": [
        {
            "ID": 59117,
            "ConnectionTypeID": 28,
            "StatusTypeID": 50,
            "LevelID": 2,
            "Amps": 16,
            "Voltage": 230,
            "PowerKW": 3.7,
            "CurrentTypeID": 10,
            "Quantity": 2
        },
        {
            "ID": 59118,
            "ConnectionTypeID": 25,
            "StatusTypeID": 50,
            "LevelID": 2,
            "Amps": 32,
            "Voltage": 400,
            "PowerKW": 22,
            "CurrentTypeID": 20,
            "Quantity": 2
        }
    ],
    "NumberOfPoints": 2,
    "StatusTypeID": 50,
    "DateLastStatusUpdate": "2015-06-17T08:19:00Z",
    "DataQualityLevel": 1,
    "DateCreated": "2015-06-17T06:56:00Z",
    "SubmissionStatusTypeID": 200
}