{
    "IsRecentlyVerified": false,
    "ID": 183619,
    "UUID": "AB9CD446-43FA-45DA-8097-D80E6D6C6C14",
    "DataProviderID": 29,
    "DataProvidersReference": "18932",
    "OperatorID": 3297,
    "AddressInfo": {
        "ID": 183978,
        "Title": "Hirschhorner Str. 33 bei",
        "AddressLine1": "Hirschhorner Str. 33 bei",
        "Town": "Oberzent",
        "Postcode": "64743",
        "CountryID": 87,
        "Latitude": 49.56579,
        "Longitude": 8.9713,
        "DistanceUnit": 0
    },
    "Connections": [
        {
            "ID": 290821,
            "ConnectionTypeID": 25,
            "StatusTypeID": 50,
            "LevelID": 2,
            "PowerKW": 22,
            "CurrentTypeID": 20
        },
        {
            "ID": 290822,
            "ConnectionTypeID": 25,
            "StatusTypeID": 50,
            "LevelID": 2,
            "PowerKW": 22,
            "CurrentTypeID": 20
        }
    ],
    "StatusTypeID": 50,
    "DateLastStatusUpdate": "2021-07-12T02:43:00Z",
    "MetadataValues": [
        {
            "ID": 15912,
            "MetadataFieldID": 4,
            "ItemValue": "Data from the German chargepoint registry provided by Bundesnetzagentur.de under the CC-BY 4.0 license"
        }
    ],
    "DataQualityLevel": 3,
    "DateCreated": "2021-07-08T10:04:00Z",
    "SubmissionStatusTypeID": 100
}