{
    "IsRecentlyVerified": false,
    "ID": 180336,
    "UUID": "79F24403-888F-4189-8C9F-F60F72AA3C8D",
    "DataProviderID": 29,
    "DataProvidersReference": "11327",
    "OperatorID": 105,
    "AddressInfo": {
        "ID": 180695,
        "Title": "Lindenstraße 4",
        "AddressLine1": "Lindenstraße 4",
        "Town": "Büren",
        "Postcode": "33142",
        "CountryID": 87,
        "Latitude": 51.556011,
        "Longitude": 8.560245,
        "DistanceUnit": 0
    },
    "Connections": [
        {
            "ID": 283287,
            "ConnectionTypeID": 25,
            "StatusTypeID": 50,
            "LevelID": 2,
            "PowerKW": 22,
            "CurrentTypeID": 20
        },
        {
            "ID": 283288,
            "ConnectionTypeID": 25,
            "StatusTypeID": 50,
            "LevelID": 2,
            "PowerKW": 22,
            "CurrentTypeID": 20
        }
    ],
    "StatusTypeID": 50,
    "DateLastStatusUpdate": "2021-07-12T02:48:00Z",
    "MetadataValues": [
        {
            "ID": 12630,
            "MetadataFieldID": 4,
            "ItemValue": "Data from the German chargepoint registry provided by Bundesnetzagentur.de under the CC-BY 4.0 license"
        }
    ],
    "DataQualityLevel": 3,
    "DateCreated": "2021-07-08T10:00:00Z",
    "SubmissionStatusTypeID": 100
}