{
    "IsRecentlyVerified": false,
    "ID": 152632,
    "UUID": "1FDA525A-4D9D-4192-8EE8-1198C1F9B638",
    "DataProviderID": 28,
    "DataProvidersReference": "FR*S49*P49126*001",
    "UsageTypeID": 5,
    "AddressInfo": {
        "ID": 152985,
        "Title": "DRAIN - Salle Des Sports",
        "AddressLine1": "Salle Des Sports 49530 DRAIN",
        "CountryID": 80,
        "Latitude": 47.339675,
        "Longitude": -1.204504,
        "AccessComments": "24h/24 7j/7",
        "DistanceUnit": 0
    },
    "Connections": [
        {
            "ID": 213751,
            "ConnectionTypeID": 25,
            "StatusTypeID": 50,
            "LevelID": 2,
            "PowerKW": 18,
            "CurrentTypeID": 20
        },
        {
            "ID": 213752,
            "ConnectionTypeID": 28,
            "StatusTypeID": 50,
            "LevelID": 2,
            "PowerKW": 18,
            "CurrentTypeID": 10
        },
        {
            "ID": 246888,
            "ConnectionTypeID": 25,
            "StatusTypeID": 50,
            "LevelID": 2,
            "PowerKW": 18,
            "CurrentTypeID": 20
        },
        {
            "ID": 246889,
            "ConnectionTypeID": 28,
            "StatusTypeID": 50,
            "LevelID": 2,
            "PowerKW": 18,
            "CurrentTypeID": 10
        }
    ],
    "GeneralComments": "Recharge par badge et avec une application smartphone",
    "StatusTypeID": 50,
    "DateLastStatusUpdate": "2020-08-27T05:13:00Z",
    "DataQualityLevel": 2,
    "DateCreated": "2020-03-15T10:54:00Z",
    "SubmissionStatusTypeID": 100
}