{
    "UserComments": [
        {
            "ID": 21226,
            "ChargePointID": 107585,
            "CommentTypeID": 10,
            "UserName": "ForumElettrico.it",
            "RelatedURL": "https://www.forumelettrico.it/forum/parcheggio-8-via-piana-61-t4422.html",
            "DateCreated": "2019-07-16T16:05:04.993Z",
            "User": {
                "ID": 11749,
                "Username": "ForumElettrico.it"
            },
            "CheckinStatusTypeID": 10
        }
    ],
    "MediaItems": [
        {
            "ID": 18934,
            "ChargePointID": 107585,
            "ItemURL": "https://s3-ap-southeast-2.amazonaws.com/openchargemap/images/SM/OCM107585/OCM-107585.orig.2019071616052339.jpg",
            "ItemThumbnailURL": "https://s3-ap-southeast-2.amazonaws.com/openchargemap/images/SM/OCM107585/OCM-107585.thmb.2019071616052339.jpg",
            "Comment": "",
            "IsEnabled": true,
            "IsVideo": false,
            "IsFeaturedItem": false,
            "IsExternalResource": false,
            "User": {
                "ID": 11749,
                "Username": "ForumElettrico.it"
            },
            "DateCreated": "2019-07-16T16:06:00Z"
        },
        {
            "ID": 18935,
            "ChargePointID": 107585,
            "ItemURL": "https://s3-ap-southeast-2.amazonaws.com/openchargemap/images/SM/OCM107585/OCM-107585.orig.2019071616053012.jpg",
            "ItemThumbnailURL": "https://s3-ap-southeast-2.amazonaws.com/openchargemap/images/SM/OCM107585/OCM-107585.thmb.2019071616053012.jpg",
            "Comment": "",
            "IsEnabled": true,
            "IsVideo": false,
            "IsFeaturedItem": false,
            "IsExternalResource": false,
            "User": {
                "ID": 11749,
                "Username": "ForumElettrico.it"
            },
            "DateCreated": "2019-07-16T16:06:00Z"
        },
        {
            "ID": 18936,
            "ChargePointID": 107585,
            "ItemURL": "https://s3-ap-southeast-2.amazonaws.com/openchargemap/images/SM/OCM107585/OCM-107585.orig.2019071616053666.jpg",
            "ItemThumbnailURL": "https://s3-ap-southeast-2.amazonaws.com/openchargemap/images/SM/OCM107585/OCM-107585.thmb.2019071616053666.jpg",
            "Comment": "",
            "IsEnabled": true,
            "IsVideo": false,
            "IsFeaturedItem": false,
            "IsExternalResource": false,
            "User": {
                "ID": 11749,
                "Username": "ForumElettrico.it"
            },
            "DateCreated": "2019-07-16T16:06:00Z"
        },
        {
            "ID": 18937,
            "ChargePointID": 107585,
            "ItemURL": "https://s3-ap-southeast-2.amazonaws.com/openchargemap/images/SM/OCM107585/OCM-107585.orig.2019071616054261.jpg",
            "ItemThumbnailURL": "https://s3-ap-southeast-2.amazonaws.com/openchargemap/images/SM/OCM107585/OCM-107585.thmb.2019071616054261.jpg",
            "Comment": "",
            "IsEnabled": true,
            "IsVideo": false,
            "IsFeaturedItem": false,
            "IsExternalResource": false,
            "User": {
                "ID": 11749,
                "Username": "ForumElettrico.it"
            },
            "DateCreated": "2019-07-16T16:06:00Z"
        },
        {
            "ID": 18933,
            "ChargePointID": 107585,
            "ItemURL": "https://s3-ap-southeast-2.amazonaws.com/openchargemap/images/SM/OCM107585/OCM-107585.orig.2019071616051736.jpg",
            "ItemThumbnailURL": "https://s3-ap-southeast-2.amazonaws.com/openchargemap/images/SM/OCM107585/OCM-107585.thmb.2019071616051736.jpg",
            "Comment": "",
            "IsEnabled": true,
            "IsVideo": false,
            "IsFeaturedItem": false,
            "IsExternalResource": false,
            "User": {
                "ID": 11749,
                "Username": "ForumElettrico.it"
            },
            "DateCreated": "2019-07-16T16:05:00Z"
        }
    ],
    "IsRecentlyVerified": false,
    "ID": 107585,
    "UUID": "8AB9C522-0A9C-4D2D-A331-16DE77D72186",
    "DataProviderID": 1,
    "UsageTypeID": 4,
    "AddressInfo": {
        "ID": 107931,
        "Title": "ZapGrid  Orto del Collegio",
        "AddressLine1": " Orto del Collegio",
        "Town": "Città di San Marino",
        "Postcode": "47893",
        "CountryID": 195,
        "Latitude": 43.93792075673542,
        "Longitude": 12.44442775804805,
        "RelatedURL": "https://zapgrid.net/",
        "DistanceUnit": 0
    },
    "Connections": [
        {
            "ID": 151814,
            "ConnectionTypeID": 25,
            "StatusTypeID": 50,
            "LevelID": 2,
            "Amps": 32,
            "Voltage": 400,
            "PowerKW": 22,
            "CurrentTypeID": 20,
            "Quantity": 2
        }
    ],
    "NumberOfPoints": 2,
    "GeneralComments": " APP ZapGrid\r\n https://play.google.com/store/apps/details?id=net.zapgrid.zapgrid ",
    "StatusTypeID": 50,
    "DateLastStatusUpdate": "2019-07-16T16:06:00Z",
    "DataQualityLevel": 1,
    "DateCreated": "2018-08-02T13:33:00Z",
    "SubmissionStatusTypeID": 200
}