{
    "IsRecentlyVerified": false,
    "ID": 153168,
    "UUID": "917ABBE0-EE40-4CBD-AFE8-72390BC5B8DF",
    "DataProviderID": 28,
    "DataProvidersReference": "FR*S89*P89228*A",
    "UsageTypeID": 5,
    "AddressInfo": {
        "ID": 153521,
        "Title": "LINDRY_Place de la Liberte",
        "AddressLine1": "Place de la Liberte 89240 LINDRY",
        "CountryID": 80,
        "Latitude": 47.80005966,
        "Longitude": 3.41763318,
        "AccessComments": "24/24 7/7 jours",
        "DistanceUnit": 0
    },
    "Connections": [
        {
            "ID": 214745,
            "ConnectionTypeID": 28,
            "StatusTypeID": 50,
            "LevelID": 2,
            "PowerKW": 22,
            "CurrentTypeID": 10
        },
        {
            "ID": 214746,
            "ConnectionTypeID": 1036,
            "StatusTypeID": 50,
            "LevelID": 2,
            "PowerKW": 22,
            "CurrentTypeID": 20
        },
        {
            "ID": 248111,
            "ConnectionTypeID": 28,
            "StatusTypeID": 50,
            "LevelID": 2,
            "PowerKW": 22,
            "CurrentTypeID": 10
        },
        {
            "ID": 248112,
            "ConnectionTypeID": 1036,
            "StatusTypeID": 50,
            "LevelID": 2,
            "PowerKW": 22,
            "CurrentTypeID": 20
        }
    ],
    "GeneralComments": "",
    "StatusTypeID": 50,
    "DateLastStatusUpdate": "2020-08-27T05:14:00Z",
    "DataQualityLevel": 2,
    "DateCreated": "2020-03-15T10:54:00Z",
    "SubmissionStatusTypeID": 100
}