{
    "IsRecentlyVerified": false,
    "ID": 174285,
    "UUID": "14D60878-FD0B-423D-BF6A-6246E02AA37D",
    "DataProviderID": 19,
    "DataProvidersReference": "6964",
    "AddressInfo": {
        "ID": 174644,
        "Title": "Kirkjubæjarklaustur (N1)",
        "AddressLine1": "Kirkjubæjarklaustur(N1), Klausturvegur 29",
        "Town": "Kirkjubæjarklaustri",
        "StateOrProvince": "Suðurland",
        "Postcode": "880",
        "CountryID": 105,
        "Latitude": 63.793583,
        "Longitude": -18.03985,
        "AccessComments": "",
        "DistanceUnit": 0
    },
    "Connections": [
        {
            "ID": 269727,
            "ConnectionTypeID": 25,
            "Reference": "1",
            "LevelID": 3,
            "Amps": 32,
            "Voltage": 400,
            "PowerKW": 22,
            "CurrentTypeID": 30,
            "Comments": "Mode 3"
        },
        {
            "ID": 269728,
            "ConnectionTypeID": 2,
            "Reference": "2",
            "LevelID": 3,
            "Amps": 100,
            "Voltage": 500,
            "PowerKW": 50,
            "CurrentTypeID": 30,
            "Comments": "Mode 4"
        },
        {
            "ID": 269729,
            "ConnectionTypeID": 33,
            "Reference": "3",
            "LevelID": 3,
            "Amps": 100,
            "Voltage": 500,
            "PowerKW": 50,
            "CurrentTypeID": 30,
            "Comments": "Mode 4"
        }
    ],
    "NumberOfPoints": 3,
    "StatusTypeID": 0,
    "DateLastStatusUpdate": "2021-03-24T05:12:00Z",
    "DataQualityLevel": 2,
    "DateCreated": "2021-03-24T05:12:00Z",
    "SubmissionStatusTypeID": 100
}