{
    "IsRecentlyVerified": false,
    "ID": 143874,
    "UUID": "595A7D16-0F19-4A40-9E0A-9390DB5FF9D4",
    "DataProviderID": 2,
    "DataProvidersReference": "146971",
    "OperatorID": 5,
    "UsageTypeID": 1,
    "AddressInfo": {
        "ID": 144226,
        "Title": "WILDER CORNER",
        "AddressLine1": "4590 SE Harborton St",
        "Town": "Newport",
        "StateOrProvince": "OR",
        "Postcode": "97366",
        "CountryID": 2,
        "Latitude": 44.6041,
        "Longitude": -124.04342,
        "ContactTelephone1": "888-758-4389",
        "AccessComments": "24 hours daily",
        "RelatedURL": "http://www.chargepoint.com/",
        "DistanceUnit": 0
    },
    "Connections": [
        {
            "ID": 200284,
            "ConnectionTypeID": 1,
            "LevelID": 2,
            "Amps": 16,
            "Voltage": 230,
            "PowerKW": 3.7,
            "CurrentTypeID": 10,
            "Quantity": 2
        }
    ],
    "StatusTypeID": 50,
    "DateLastStatusUpdate": "2020-06-26T03:08:00Z",
    "DataQualityLevel": 3,
    "DateCreated": "2019-12-24T09:22:00Z",
    "SubmissionStatusTypeID": 100
}