{
    "IsRecentlyVerified": false,
    "ID": 133147,
    "UUID": "576841E3-D1DA-4DA6-9539-0C1F8265B271",
    "DataProviderID": 1,
    "OperatorID": 80,
    "UsageTypeID": 4,
    "AddressInfo": {
        "ID": 133493,
        "Title": "Zona Industriale di Guspini | EnelX",
        "AddressLine1": "Zona Industriale S.S. 126 Km 95",
        "Town": "Guspini",
        "StateOrProvince": "VS",
        "Postcode": "09036",
        "CountryID": 112,
        "Latitude": 39.569431011061965,
        "Longitude": 8.65670577825233,
        "RelatedURL": "https://www.enelx.com/it/it/emobility",
        "DistanceUnit": 0
    },
    "Connections": [
        {
            "ID": 186460,
            "ConnectionTypeID": 25,
            "StatusTypeID": 50,
            "LevelID": 2,
            "Amps": 32,
            "Voltage": 400,
            "PowerKW": 22,
            "CurrentTypeID": 20,
            "Quantity": 2
        },
        {
            "ID": 186461,
            "ConnectionTypeID": 25,
            "StatusTypeID": 50,
            "LevelID": 2,
            "Amps": 32,
            "Voltage": 400,
            "PowerKW": 22,
            "CurrentTypeID": 20,
            "Quantity": 2
        }
    ],
    "NumberOfPoints": 4,
    "StatusTypeID": 50,
    "DateLastStatusUpdate": "2019-10-15T15:00:00Z",
    "DataQualityLevel": 1,
    "DateCreated": "2019-10-15T15:00:00Z",
    "SubmissionStatusTypeID": 200
}