{
    "IsRecentlyVerified": false,
    "ID": 180456,
    "UUID": "D129728E-1899-47A1-A33F-B7D6B1F84CE0",
    "DataProviderID": 29,
    "DataProvidersReference": "7060",
    "OperatorID": 103,
    "AddressInfo": {
        "ID": 180815,
        "Title": "Hansestraße 3",
        "AddressLine1": "Hansestraße 3",
        "Town": "Sittensen",
        "Postcode": "27419",
        "CountryID": 87,
        "Latitude": 53.293594,
        "Longitude": 9.505576,
        "DistanceUnit": 0
    },
    "Connections": [
        {
            "ID": 283546,
            "ConnectionTypeID": 33,
            "StatusTypeID": 50,
            "LevelID": 3,
            "PowerKW": 50,
            "CurrentTypeID": 30
        },
        {
            "ID": 283547,
            "ConnectionTypeID": 2,
            "StatusTypeID": 50,
            "LevelID": 3,
            "PowerKW": 50,
            "CurrentTypeID": 30
        },
        {
            "ID": 301224,
            "ConnectionTypeID": 1036,
            "StatusTypeID": 50,
            "LevelID": 3,
            "PowerKW": 43,
            "CurrentTypeID": 20
        }
    ],
    "StatusTypeID": 50,
    "DateLastStatusUpdate": "2021-07-12T02:51:00Z",
    "MetadataValues": [
        {
            "ID": 12750,
            "MetadataFieldID": 4,
            "ItemValue": "Data from the German chargepoint registry provided by Bundesnetzagentur.de under the CC-BY 4.0 license"
        }
    ],
    "DataQualityLevel": 3,
    "DateCreated": "2021-07-08T10:00:00Z",
    "SubmissionStatusTypeID": 100
}