{
    "IsRecentlyVerified": false,
    "ID": 114883,
    "UUID": "22E89FA5-346B-4608-97F5-F495783F4731",
    "DataProviderID": 1,
    "OperatorID": 32,
    "OperatorsReference": "10474",
    "UsageTypeID": 4,
    "UsageCost": "Inclusive; for Polar Plus subscription members only",
    "AddressInfo": {
        "ID": 115229,
        "Title": "BT",
        "AddressLine1": "BT",
        "Postcode": "NW1 5BZ",
        "CountryID": 1,
        "Latitude": 51.5205,
        "Longitude": -0.1699,
        "DistanceUnit": 0
    },
    "Connections": [
        {
            "ID": 161658,
            "ConnectionTypeID": 25,
            "StatusTypeID": 50,
            "LevelID": 2,
            "Amps": 32,
            "Voltage": 400,
            "PowerKW": 22,
            "CurrentTypeID": 20,
            "Quantity": 2
        }
    ],
    "NumberOfPoints": 2,
    "GeneralComments": "bays 32+33 car park",
    "StatusTypeID": 50,
    "DateLastStatusUpdate": "2019-03-08T06:26:00Z",
    "DataQualityLevel": 1,
    "DateCreated": "2019-01-19T06:18:00Z",
    "SubmissionStatusTypeID": 200
}