{
    "MediaItems": [
        {
            "ID": 5881,
            "ChargePointID": 54844,
            "ItemURL": "https://s3-ap-southeast-2.amazonaws.com/openchargemap/images/US/OCM54844/OCM-54844.orig.2016021323330650.jpeg",
            "ItemThumbnailURL": "https://s3-ap-southeast-2.amazonaws.com/openchargemap/images/US/OCM54844/OCM-54844.thmb.2016021323330650.jpeg",
            "Comment": "Charging with ok from valet. Staying in the car. ",
            "IsEnabled": true,
            "IsVideo": false,
            "IsFeaturedItem": false,
            "IsExternalResource": false,
            "User": {
                "ID": 4648,
                "Username": "dennis_p"
            },
            "DateCreated": "2016-02-13T23:33:00Z"
        },
        {
            "ID": 5880,
            "ChargePointID": 54844,
            "ItemURL": "https://s3-ap-southeast-2.amazonaws.com/openchargemap/images/US/OCM54844/OCM-54844.orig.2016021323305241.jpeg",
            "ItemThumbnailURL": "https://s3-ap-southeast-2.amazonaws.com/openchargemap/images/US/OCM54844/OCM-54844.thmb.2016021323305241.jpeg",
            "Comment": "1 Clipper Creek J1772",
            "IsEnabled": true,
            "IsVideo": false,
            "IsFeaturedItem": false,
            "IsExternalResource": false,
            "User": {
                "ID": 4648,
                "Username": "dennis_p"
            },
            "DateCreated": "2016-02-13T23:31:00Z"
        },
        {
            "ID": 5879,
            "ChargePointID": 54844,
            "ItemURL": "https://s3-ap-southeast-2.amazonaws.com/openchargemap/images/US/OCM54844/OCM-54844.orig.2016021323284129.jpeg",
            "ItemThumbnailURL": "https://s3-ap-southeast-2.amazonaws.com/openchargemap/images/US/OCM54844/OCM-54844.thmb.2016021323284129.jpeg",
            "Comment": "2 Tesla Chargers. 204V/63A. Getting 34 miles per hour",
            "IsEnabled": true,
            "IsVideo": false,
            "IsFeaturedItem": false,
            "IsExternalResource": false,
            "User": {
                "ID": 4648,
                "Username": "dennis_p"
            },
            "DateCreated": "2016-02-13T23:29:00Z"
        }
    ],
    "IsRecentlyVerified": false,
    "ID": 54844,
    "UUID": "A5667C60-2A8D-4EF4-9BD2-A40DA6CE0E71",
    "DataProviderID": 1,
    "OperatorID": 23,
    "UsageTypeID": 1,
    "UsageCost": "",
    "AddressInfo": {
        "ID": 55190,
        "Title": "Long Beach Marriott - Tesla",
        "AddressLine1": "4700 Airport Plaza Dr",
        "AddressLine2": "",
        "Town": "Long Beach",
        "StateOrProvince": "CA",
        "Postcode": "90815",
        "CountryID": 2,
        "Latitude": 33.8114504,
        "Longitude": -118.138419,
        "ContactTelephone1": "562-425-5210  877-798-3752",
        "ContactTelephone2": "",
        "ContactEmail": "",
        "AccessComments": "24 hours daily; for Tesla use only; for guest use only; see front desk for access",
        "RelatedURL": "http://www.teslamotors.com/supercharger",
        "DistanceUnit": 0
    },
    "Connections": [
        {
            "ID": 69318,
            "ConnectionTypeID": 30,
            "StatusTypeID": 50,
            "LevelID": 2,
            "Amps": 64,
            "Voltage": 200,
            "PowerKW": 13,
            "CurrentTypeID": 10,
            "Quantity": 2
        },
        {
            "ID": 77855,
            "ConnectionTypeID": 1,
            "StatusTypeID": 50,
            "Quantity": 1
        }
    ],
    "GeneralComments": "",
    "StatusTypeID": 50,
    "DateLastStatusUpdate": "2016-02-14T02:02:00Z",
    "DataQualityLevel": 3,
    "DateCreated": "2015-10-09T07:24:00Z",
    "SubmissionStatusTypeID": 100
}