{
    "IsRecentlyVerified": false,
    "ID": 34867,
    "UUID": "71F0F857-131E-4B30-87D7-21235605122D",
    "DataProviderID": 26,
    "DataProvidersReference": "48591",
    "OperatorID": 178,
    "OperatorsReference": "EVnetNL REE243",
    "UsageCost": "0.00 jaarabonnement",
    "AddressInfo": {
        "ID": 35213,
        "Title": "Mosweg 63",
        "AddressLine1": "Mosweg 63",
        "Town": "Rotterdam",
        "Postcode": "3069 AV",
        "CountryID": 159,
        "Latitude": 51.964177,
        "Longitude": 4.55582,
        "ContactTelephone1": "0800-3522365",
        "RelatedURL": "http://www.evnet.nl",
        "DistanceUnit": 0
    },
    "Connections": [
        {
            "ID": 38378,
            "ConnectionTypeID": 25,
            "LevelID": 2,
            "PowerKW": 11,
            "CurrentTypeID": 10
        }
    ],
    "NumberOfPoints": 2,
    "StatusTypeID": 50,
    "DateLastStatusUpdate": "2016-06-04T02:43:00Z",
    "DataQualityLevel": 3,
    "DateCreated": "2015-01-09T06:04:00Z",
    "SubmissionStatusTypeID": 100
}