{
    "IsRecentlyVerified": false,
    "ID": 129709,
    "UUID": "4E978B16-73E0-477B-8C86-2AE5B54972B2",
    "DataProviderID": 1,
    "OperatorID": 80,
    "UsageTypeID": 4,
    "AddressInfo": {
        "ID": 130055,
        "Title": "Catanzaro Pugliese | EnelX",
        "AddressLine1": "Via V. Pugliese",
        "Town": "Catanzaro",
        "StateOrProvince": "CZ",
        "Postcode": "88100",
        "CountryID": 112,
        "Latitude": 38.9138804040825,
        "Longitude": 16.588944687687,
        "RelatedURL": "https://www.enelx.com/it/it/emobility",
        "DistanceUnit": 0
    },
    "Connections": [
        {
            "ID": 181542,
            "ConnectionTypeID": 25,
            "StatusTypeID": 50,
            "LevelID": 2,
            "Amps": 32,
            "Voltage": 400,
            "PowerKW": 22,
            "CurrentTypeID": 20,
            "Quantity": 1
        },
        {
            "ID": 181543,
            "ConnectionTypeID": 36,
            "StatusTypeID": 50,
            "LevelID": 2,
            "Amps": 16,
            "Voltage": 240,
            "PowerKW": 3.7,
            "CurrentTypeID": 10,
            "Quantity": 1
        }
    ],
    "NumberOfPoints": 2,
    "StatusTypeID": 50,
    "DateLastStatusUpdate": "2019-07-24T10:55:00Z",
    "DataQualityLevel": 1,
    "DateCreated": "2019-07-24T10:55:00Z",
    "SubmissionStatusTypeID": 200
}