{
    "IsRecentlyVerified": false,
    "ID": 57315,
    "UUID": "148564C6-FFBF-4169-B79C-D829F72D891D",
    "DataProviderID": 2,
    "DataProvidersReference": "71160",
    "OperatorID": 39,
    "UsageTypeID": 4,
    "AddressInfo": {
        "ID": 57661,
        "Title": "1001 Pennsylvania",
        "AddressLine1": "1001 Pennsylvania Avenue Northwest",
        "Town": "Washington",
        "StateOrProvince": "DC",
        "Postcode": "20004",
        "CountryID": 2,
        "Latitude": 38.895414,
        "Longitude": -77.0260068,
        "ContactTelephone1": "800-663-5633",
        "AccessComments": "MO: Not Specified; TU: Not Specified; WE: Not Specified; TH: Not Specified; FR: Not Specified; SA: Not Specified; SU: Not Specified",
        "RelatedURL": "http://www.semacharge.com/",
        "DistanceUnit": 0
    },
    "Connections": [
        {
            "ID": 72415,
            "ConnectionTypeID": 1,
            "LevelID": 2,
            "Amps": 16,
            "Voltage": 230,
            "PowerKW": 3,
            "CurrentTypeID": 10,
            "Quantity": 4
        }
    ],
    "DateLastStatusUpdate": "2019-04-06T05:04:00Z",
    "DataQualityLevel": 3,
    "DateCreated": "2015-11-30T11:50:00Z",
    "SubmissionStatusTypeID": 100
}