{
    "IsRecentlyVerified": false,
    "ID": 176675,
    "UUID": "7C97FBCF-9396-4124-9B40-0C47F9F7261E",
    "DataProviderID": 29,
    "DataProvidersReference": "4632",
    "AddressInfo": {
        "ID": 177034,
        "Title": "Neuenhofstr. 160",
        "AddressLine1": "Neuenhofstr. 160",
        "Town": "Aachen",
        "Postcode": "52078",
        "CountryID": 87,
        "Latitude": 50.765745,
        "Longitude": 6.147677,
        "DistanceUnit": 0
    },
    "Connections": [
        {
            "ID": 274870,
            "ConnectionTypeID": 25,
            "StatusTypeID": 50,
            "LevelID": 2,
            "PowerKW": 22,
            "CurrentTypeID": 20
        },
        {
            "ID": 274871,
            "ConnectionTypeID": 25,
            "StatusTypeID": 50,
            "LevelID": 2,
            "PowerKW": 22,
            "CurrentTypeID": 20
        }
    ],
    "StatusTypeID": 0,
    "DateLastStatusUpdate": "2021-07-12T02:45:00Z",
    "MetadataValues": [
        {
            "ID": 8970,
            "MetadataFieldID": 4,
            "ItemValue": "Data from the German chargepoint registry provided by Bundesnetzagentur.de under the CC-BY 4.0 license"
        }
    ],
    "DataQualityLevel": 3,
    "DateCreated": "2021-07-08T09:48:00Z",
    "SubmissionStatusTypeID": 100
}