{
    "IsRecentlyVerified": false,
    "ID": 181906,
    "UUID": "7F999548-153D-4D5E-95AF-99E13289C7C3",
    "DataProviderID": 29,
    "DataProvidersReference": "18967",
    "OperatorID": 105,
    "AddressInfo": {
        "ID": 182265,
        "Title": "Oberaußemer Str. 0",
        "AddressLine1": "Oberaußemer Str. 0",
        "Town": "Bergheim",
        "Postcode": "50129",
        "CountryID": 87,
        "Latitude": 50.9830043,
        "Longitude": 6.6706837,
        "DistanceUnit": 0
    },
    "Connections": [
        {
            "ID": 286924,
            "ConnectionTypeID": 25,
            "StatusTypeID": 50,
            "LevelID": 2,
            "PowerKW": 22,
            "CurrentTypeID": 20
        },
        {
            "ID": 286925,
            "ConnectionTypeID": 25,
            "StatusTypeID": 50,
            "LevelID": 2,
            "PowerKW": 22,
            "CurrentTypeID": 20
        }
    ],
    "StatusTypeID": 50,
    "DateLastStatusUpdate": "2021-07-09T03:21:00Z",
    "MetadataValues": [
        {
            "ID": 14200,
            "MetadataFieldID": 4,
            "ItemValue": "Data from the German chargepoint registry provided by Bundesnetzagentur.de under the CC-BY 4.0 license"
        }
    ],
    "DataQualityLevel": 3,
    "DateCreated": "2021-07-08T10:02:00Z",
    "SubmissionStatusTypeID": 100
}