{
    "IsRecentlyVerified": false,
    "ID": 103373,
    "UUID": "5D5F9CDD-2BE9-4A03-AC7C-2C578B340D6C",
    "DataProviderID": 1,
    "OperatorID": 23,
    "OperatorsReference": "34350",
    "UsageTypeID": 4,
    "UsageCost": "$0.24/kWh; other tariffs for older cars",
    "AddressInfo": {
        "ID": 103719,
        "Title": "Glenview, Il Supercharger",
        "AddressLine1": "1200 Milwaukee Avenue",
        "Town": "Glenview",
        "StateOrProvince": "IL",
        "Postcode": "60025",
        "CountryID": 2,
        "Latitude": 42.0771634,
        "Longitude": -87.860828,
        "DistanceUnit": 0
    },
    "Connections": [
        {
            "ID": 146026,
            "ConnectionTypeID": 27,
            "StatusTypeID": 50,
            "LevelID": 3,
            "PowerKW": 120,
            "CurrentTypeID": 30,
            "Quantity": 10
        }
    ],
    "NumberOfPoints": 10,
    "GeneralComments": "Charging10 Superchargers, available 24/7, up to 72kW",
    "StatusTypeID": 50,
    "DateLastStatusUpdate": "2018-04-29T05:48:00Z",
    "DataQualityLevel": 1,
    "DateCreated": "2018-04-29T05:48:00Z",
    "SubmissionStatusTypeID": 200
}