{
    "IsRecentlyVerified": false,
    "ID": 156607,
    "UUID": "2CC41E73-5641-403E-8CE8-15C85B5A6BF2",
    "DataProviderID": 19,
    "DataProvidersReference": "3908",
    "AddressInfo": {
        "ID": 156961,
        "Title": "Kalmar Bönhasen",
        "AddressLine1": "Fiskaregatan 66",
        "Town": "KALMAR",
        "StateOrProvince": "KALMAR",
        "Postcode": "39231",
        "CountryID": 216,
        "Latitude": 56.6662,
        "Longitude": 16.36843,
        "AccessComments": "Laddarna är placerade på P-Bönhasen",
        "DistanceUnit": 0
    },
    "Connections": [
        {
            "ID": 220749,
            "ConnectionTypeID": 25,
            "Reference": "1",
            "LevelID": 3,
            "Amps": 32,
            "Voltage": 400,
            "PowerKW": 22,
            "CurrentTypeID": 30,
            "Comments": "Mode 3"
        },
        {
            "ID": 220750,
            "ConnectionTypeID": 25,
            "Reference": "2",
            "LevelID": 3,
            "Amps": 32,
            "Voltage": 400,
            "PowerKW": 22,
            "CurrentTypeID": 30,
            "Comments": "Mode 3"
        },
        {
            "ID": 220751,
            "ConnectionTypeID": 25,
            "Reference": "3",
            "LevelID": 3,
            "Amps": 32,
            "Voltage": 400,
            "PowerKW": 22,
            "CurrentTypeID": 30,
            "Comments": "Mode 3"
        },
        {
            "ID": 220752,
            "ConnectionTypeID": 25,
            "Reference": "4",
            "LevelID": 3,
            "Amps": 32,
            "Voltage": 400,
            "PowerKW": 22,
            "CurrentTypeID": 30,
            "Comments": "Mode 3"
        }
    ],
    "NumberOfPoints": 4,
    "StatusTypeID": 0,
    "DateLastStatusUpdate": "2021-03-24T05:10:00Z",
    "DataQualityLevel": 2,
    "DateCreated": "2020-05-26T08:21:00Z",
    "SubmissionStatusTypeID": 100
}