{
    "IsRecentlyVerified": false,
    "ID": 77769,
    "UUID": "6B0C8E03-9211-42A7-92BC-0B56445A079A",
    "DataProviderID": 1,
    "OperatorID": 45,
    "UsageTypeID": 6,
    "AddressInfo": {
        "ID": 78115,
        "Title": "Via Coltura",
        "AddressLine1": "Via Coltura",
        "Town": "Bormio",
        "StateOrProvince": "Lombardy",
        "Postcode": "23032",
        "CountryID": 112,
        "Latitude": 46.464535164811736,
        "Longitude": 10.376798494625518,
        "DistanceUnit": 0
    },
    "Connections": [
        {
            "ID": 112351,
            "ConnectionTypeID": 1036,
            "StatusTypeID": 50,
            "LevelID": 2,
            "Amps": 16,
            "Voltage": 400,
            "PowerKW": 11,
            "CurrentTypeID": 20,
            "Quantity": 2
        }
    ],
    "NumberOfPoints": 2,
    "GeneralComments": "Tesla Destination Charging\r\n",
    "StatusTypeID": 50,
    "DateLastStatusUpdate": "2021-02-06T05:36:00Z",
    "DataQualityLevel": 1,
    "DateCreated": "2017-01-23T16:03:00Z",
    "SubmissionStatusTypeID": 200
}