{
    "IsRecentlyVerified": false,
    "ID": 84879,
    "UUID": "8ECE6673-AE01-4B7F-9830-06A2316ED119",
    "DataProviderID": 1,
    "OperatorID": 45,
    "UsageTypeID": 0,
    "UsageCost": "Free",
    "AddressInfo": {
        "ID": 85225,
        "Title": "UNCG - Oakland Parking Deck",
        "AddressLine1": "617 Stirling St",
        "Town": "Greensboro",
        "StateOrProvince": "NC",
        "Postcode": "27412",
        "CountryID": 2,
        "Latitude": 36.0647286820273,
        "Longitude": -79.8115915060043,
        "ContactTelephone1": "(336) 334-5681",
        "ContactEmail": "parking@uncg.edu",
        "AccessComments": "Enter from Oakland or Kenilworth St. Four Level 2 J1772 (GE) and five 120 V outlets. South West corner of the ground level. There is a fee for parking longer than 30 minutes, no fee to charge.",
        "RelatedURL": "https://parking.uncg.edu",
        "DistanceUnit": 0
    },
    "Connections": [
        {
            "ID": 120613,
            "ConnectionTypeID": 1,
            "StatusTypeID": 50,
            "LevelID": 2,
            "CurrentTypeID": 10,
            "Quantity": 4
        },
        {
            "ID": 120614,
            "ConnectionTypeID": 9,
            "StatusTypeID": 50,
            "LevelID": 1,
            "Voltage": 120,
            "CurrentTypeID": 10,
            "Quantity": 5
        }
    ],
    "NumberOfPoints": 9,
    "GeneralComments": "5 Wall Outlet (120V)s, 4 EV Plug (J1772)s",
    "StatusTypeID": 50,
    "DateLastStatusUpdate": "2017-03-21T18:44:00Z",
    "DataQualityLevel": 1,
    "DateCreated": "2017-03-20T19:15:00Z",
    "SubmissionStatusTypeID": 200
}