{
    "IsRecentlyVerified": false,
    "ID": 143069,
    "UUID": "68FDD5D0-E44F-426C-835C-9F8715EA2650",
    "DataProviderID": 2,
    "DataProvidersReference": "82542",
    "OperatorID": 5,
    "UsageTypeID": 1,
    "AddressInfo": {
        "ID": 143421,
        "Title": "CITY OF NEWTON",
        "AddressLine1": "52 Elliot St",
        "Town": "Newton",
        "StateOrProvince": "MA",
        "Postcode": "02464",
        "CountryID": 2,
        "Latitude": 42.3169287,
        "Longitude": -71.2133752,
        "ContactTelephone1": "888-758-4389",
        "AccessComments": "24 hours daily",
        "RelatedURL": "http://www.chargepoint.com/",
        "DistanceUnit": 0
    },
    "Connections": [
        {
            "ID": 199328,
            "ConnectionTypeID": 1,
            "LevelID": 2,
            "Amps": 16,
            "Voltage": 230,
            "PowerKW": 3,
            "CurrentTypeID": 10,
            "Quantity": 2
        }
    ],
    "StatusTypeID": 50,
    "DateLastStatusUpdate": "2019-12-24T09:20:00Z",
    "DataQualityLevel": 3,
    "DateCreated": "2019-12-24T09:20:00Z",
    "SubmissionStatusTypeID": 100
}