{
    "IsRecentlyVerified": false,
    "ID": 142029,
    "UUID": "45DA6E6A-A96B-4C56-9143-033C5ACA7EF6",
    "DataProviderID": 2,
    "DataProvidersReference": "116907",
    "OperatorID": 5,
    "UsageTypeID": 1,
    "AddressInfo": {
        "ID": 142381,
        "Title": "CAPITAL EV01",
        "AddressLine1": "50 S Young St",
        "Town": "Columbus",
        "StateOrProvince": "OH",
        "Postcode": "43215",
        "CountryID": 2,
        "Latitude": 39.9620246,
        "Longitude": -82.9948761,
        "ContactTelephone1": "888-758-4389",
        "AccessComments": "24 hours daily",
        "RelatedURL": "http://www.chargepoint.com/",
        "DistanceUnit": 0
    },
    "Connections": [
        {
            "ID": 198086,
            "ConnectionTypeID": 1,
            "LevelID": 2,
            "Amps": 16,
            "Voltage": 230,
            "PowerKW": 3.7,
            "CurrentTypeID": 10,
            "Quantity": 2
        }
    ],
    "StatusTypeID": 50,
    "DateLastStatusUpdate": "2020-06-26T03:02:00Z",
    "DataQualityLevel": 3,
    "DateCreated": "2019-12-24T09:16:00Z",
    "SubmissionStatusTypeID": 100
}