{
    "IsRecentlyVerified": false,
    "ID": 138826,
    "UUID": "45238573-4ACC-4DC3-BB5E-785AE541EC38",
    "DataProviderID": 2,
    "DataProvidersReference": "121832",
    "OperatorID": 3318,
    "UsageTypeID": 1,
    "AddressInfo": {
        "ID": 139178,
        "Title": "Walmart 1358 - Walterboro, SC",
        "AddressLine1": "2110 Bells Highway",
        "Town": "Walterboro",
        "StateOrProvince": "SC",
        "Postcode": "29488",
        "CountryID": 2,
        "Latitude": 32.933198,
        "Longitude": -80.689324,
        "ContactTelephone1": "833-632-2778",
        "AccessComments": "24 hours daily",
        "RelatedURL": "https://www.electrifyamerica.com/",
        "DistanceUnit": 0
    },
    "Connections": [
        {
            "ID": 194041,
            "ConnectionTypeID": 2,
            "LevelID": 3,
            "Amps": 100,
            "Voltage": 400,
            "PowerKW": 40,
            "CurrentTypeID": 30,
            "Quantity": 1
        },
        {
            "ID": 194042,
            "ConnectionTypeID": 32,
            "LevelID": 3,
            "Amps": 100,
            "Voltage": 400,
            "PowerKW": 40,
            "CurrentTypeID": 30,
            "Quantity": 1
        }
    ],
    "StatusTypeID": 50,
    "DateLastStatusUpdate": "2020-06-26T02:55:00Z",
    "DataQualityLevel": 3,
    "DateCreated": "2019-12-24T09:09:00Z",
    "SubmissionStatusTypeID": 100
}