{
    "IsRecentlyVerified": false,
    "ID": 185891,
    "UUID": "D0E6A4C2-6CF5-42B5-A0DE-8A5F38C9FD05",
    "DataProviderID": 29,
    "DataProvidersReference": "17093",
    "AddressInfo": {
        "ID": 186250,
        "Title": "Spitalgasse",
        "AddressLine1": "Spitalgasse",
        "Town": "Bad Windsheim",
        "Postcode": "91438",
        "CountryID": 87,
        "Latitude": 49.500858,
        "Longitude": 10.41474,
        "DistanceUnit": 0
    },
    "Connections": [
        {
            "ID": 297116,
            "ConnectionTypeID": 25,
            "StatusTypeID": 50,
            "LevelID": 2,
            "PowerKW": 22,
            "CurrentTypeID": 20
        },
        {
            "ID": 297117,
            "ConnectionTypeID": 25,
            "StatusTypeID": 50,
            "LevelID": 2,
            "PowerKW": 22,
            "CurrentTypeID": 20
        }
    ],
    "StatusTypeID": 50,
    "DateLastStatusUpdate": "2021-07-12T02:43:00Z",
    "MetadataValues": [
        {
            "ID": 18133,
            "MetadataFieldID": 4,
            "ItemValue": "Data from the German chargepoint registry provided by Bundesnetzagentur.de under the CC-BY 4.0 license"
        }
    ],
    "DataQualityLevel": 3,
    "DateCreated": "2021-07-12T02:43:00Z",
    "SubmissionStatusTypeID": 100
}