{
    "IsRecentlyVerified": false,
    "ID": 48287,
    "UUID": "A112387B-6817-4FDE-93C6-C538DAA775D6",
    "DataProviderID": 2,
    "DataProvidersReference": "63715",
    "UsageTypeID": 2,
    "AddressInfo": {
        "ID": 48633,
        "Title": "Huntington Ford",
        "AddressLine1": "2890 S Rochester Rd",
        "Town": "Rochester Hills",
        "StateOrProvince": "MI",
        "Postcode": "48307",
        "CountryID": 2,
        "Latitude": 42.638074,
        "Longitude": -83.132983,
        "ContactTelephone1": "",
        "AccessComments": "Service center use only",
        "RelatedURL": "",
        "DistanceUnit": 0
    },
    "Connections": [
        {
            "ID": 59709,
            "ConnectionTypeID": 1,
            "LevelID": 2,
            "Amps": 16,
            "Voltage": 230,
            "PowerKW": 3.7,
            "CurrentTypeID": 10,
            "Quantity": 2
        }
    ],
    "DateLastStatusUpdate": "2020-06-26T03:06:00Z",
    "DataQualityLevel": 3,
    "DateCreated": "2015-06-24T11:44:00Z",
    "SubmissionStatusTypeID": 100
}