{
    "IsRecentlyVerified": false,
    "ID": 88451,
    "UUID": "59283658-0C35-4040-AB79-61F3F829E775",
    "DataProviderID": 1,
    "OperatorID": 23,
    "OperatorsReference": "30000",
    "UsageTypeID": 4,
    "AddressInfo": {
        "ID": 88797,
        "Title": "Zsámbék, Drivingcamp Hungary",
        "AddressLine1": "Drivingcamp út 1.",
        "Town": "Zsámbék",
        "StateOrProvince": "Pest megye",
        "Postcode": "2072",
        "CountryID": 104,
        "Latitude": 47.517493,
        "Longitude": 18.732786,
        "ContactTelephone1": "+36 2356 5530",
        "DistanceUnit": 0
    },
    "Connections": [
        {
            "ID": 125460,
            "ConnectionTypeID": 1036,
            "StatusTypeID": 50,
            "LevelID": 2,
            "Amps": 32,
            "Voltage": 400,
            "PowerKW": 22,
            "CurrentTypeID": 20,
            "Quantity": 2
        },
        {
            "ID": 127771,
            "ConnectionTypeID": 2,
            "StatusTypeID": 50,
            "LevelID": 3,
            "Amps": 100,
            "Voltage": 500,
            "PowerKW": 50,
            "CurrentTypeID": 30,
            "Quantity": 1
        },
        {
            "ID": 127772,
            "ConnectionTypeID": 1036,
            "StatusTypeID": 50,
            "LevelID": 2,
            "Amps": 32,
            "Voltage": 400,
            "PowerKW": 22,
            "CurrentTypeID": 20,
            "Quantity": 2
        },
        {
            "ID": 147909,
            "ConnectionTypeID": 33,
            "StatusTypeID": 50,
            "LevelID": 3,
            "Amps": 125,
            "Voltage": 500,
            "PowerKW": 50,
            "CurrentTypeID": 30,
            "Quantity": 1
        },
        {
            "ID": 153519,
            "ConnectionTypeID": 30,
            "StatusTypeID": 50,
            "LevelID": 2,
            "Amps": 32,
            "Voltage": 400,
            "PowerKW": 22,
            "CurrentTypeID": 20,
            "Quantity": 2
        }
    ],
    "NumberOfPoints": 2,
    "GeneralComments": "2 Tesla Connectors, up to 22kW.Available to the public. Please see front desk.",
    "StatusTypeID": 50,
    "DateLastStatusUpdate": "2018-10-05T08:16:00Z",
    "DataQualityLevel": 1,
    "DateCreated": "2017-05-30T05:54:00Z",
    "SubmissionStatusTypeID": 200
}