{
    "IsRecentlyVerified": false,
    "ID": 140925,
    "UUID": "C090ABEE-7AEF-4A9E-A783-8628B25C25EB",
    "DataProviderID": 2,
    "DataProvidersReference": "76949",
    "OperatorID": 5,
    "UsageTypeID": 1,
    "AddressInfo": {
        "ID": 141277,
        "Title": "ESSEX",
        "AddressLine1": "1200 4th St",
        "Town": "San Francisco",
        "StateOrProvince": "CA",
        "Postcode": "94158",
        "CountryID": 2,
        "Latitude": 37.772489,
        "Longitude": -122.391835,
        "ContactTelephone1": "888-758-4389",
        "AccessComments": "24 hours daily",
        "RelatedURL": "http://www.chargepoint.com/",
        "DistanceUnit": 0
    },
    "Connections": [
        {
            "ID": 196701,
            "ConnectionTypeID": 1,
            "LevelID": 2,
            "Amps": 16,
            "Voltage": 230,
            "PowerKW": 3,
            "CurrentTypeID": 10,
            "Quantity": 6
        }
    ],
    "StatusTypeID": 50,
    "DateLastStatusUpdate": "2019-12-24T09:14:00Z",
    "DataQualityLevel": 3,
    "DateCreated": "2019-12-24T09:14:00Z",
    "SubmissionStatusTypeID": 100
}