{
    "IsRecentlyVerified": false,
    "ID": 80027,
    "UUID": "F8FDA8F4-B0AB-422C-BED2-EA8112708531",
    "DataProviderID": 1,
    "OperatorID": 23,
    "OperatorsReference": "6377",
    "UsageTypeID": 4,
    "UsageCost": "$0.22/min >=60kW; $0.11/min <60kW; other tariffs for older cars",
    "AddressInfo": {
        "ID": 80373,
        "Title": "Gila Bend Supercharger",
        "AddressLine1": "826 W Pima St.",
        "Town": "Gila Bend",
        "StateOrProvince": "AZ",
        "Postcode": "85337",
        "CountryID": 2,
        "Latitude": 32.943675,
        "Longitude": -112.734081,
        "DistanceUnit": 0
    },
    "Connections": [
        {
            "ID": 114676,
            "ConnectionTypeID": 27,
            "StatusTypeID": 50,
            "LevelID": 3,
            "PowerKW": 120,
            "CurrentTypeID": 30,
            "Quantity": 8
        }
    ],
    "NumberOfPoints": 8,
    "GeneralComments": "8 Superchargers, available 24/7",
    "StatusTypeID": 50,
    "DateLastStatusUpdate": "2018-03-13T08:34:00Z",
    "DataQualityLevel": 1,
    "DateCreated": "2017-01-30T18:20:00Z",
    "SubmissionStatusTypeID": 200
}