{
    "IsRecentlyVerified": false,
    "ID": 60462,
    "UUID": "81B7854A-0A96-48BB-B5CD-4E9216725EE6",
    "DataProviderID": 1,
    "OperatorID": 3,
    "OperatorsReference": "PP-74038",
    "UsageTypeID": 6,
    "UsageCost": "Free",
    "AddressInfo": {
        "ID": 60808,
        "Title": "Energy Coast Utc",
        "AddressLine1": "Blackwood Road",
        "AddressLine2": "Lillyhall",
        "Town": "Workington",
        "StateOrProvince": "Cumbria",
        "Postcode": "CA14 4JW",
        "CountryID": 1,
        "Latitude": 54.614684,
        "Longitude": -3.522703,
        "DistanceUnit": 0
    },
    "Connections": [
        {
            "ID": 76593,
            "ConnectionTypeID": 25,
            "StatusTypeID": 50,
            "LevelID": 2,
            "Amps": 32,
            "Voltage": 400,
            "PowerKW": 22,
            "CurrentTypeID": 20,
            "Quantity": 2
        }
    ],
    "NumberOfPoints": 4,
    "StatusTypeID": 0,
    "DateLastStatusUpdate": "2019-05-02T05:24:00Z",
    "DataQualityLevel": 1,
    "DateCreated": "2016-01-26T10:23:00Z",
    "SubmissionStatusTypeID": 200
}