{
    "IsRecentlyVerified": false,
    "ID": 152376,
    "UUID": "928A4DEA-8FD7-4FF9-834B-CBBB60829470",
    "DataProviderID": 28,
    "DataProvidersReference": "FR*S85*P85151*001",
    "UsageTypeID": 5,
    "AddressInfo": {
        "ID": 152729,
        "Title": "MORTAGNE-SUR-SEVRE - Avenue De La Gare",
        "AddressLine1": "Avenue De La Gare 85290 MORTAGNE-SUR-SEVRE",
        "CountryID": 80,
        "Latitude": 46.995129,
        "Longitude": -0.94492,
        "AccessComments": "24h/24 7j/7",
        "DistanceUnit": 0
    },
    "Connections": [
        {
            "ID": 213300,
            "ConnectionTypeID": 28,
            "StatusTypeID": 50,
            "LevelID": 2,
            "PowerKW": 18,
            "CurrentTypeID": 10
        },
        {
            "ID": 213301,
            "ConnectionTypeID": 26,
            "StatusTypeID": 50,
            "LevelID": 2,
            "PowerKW": 18
        },
        {
            "ID": 246180,
            "ConnectionTypeID": 26,
            "StatusTypeID": 50,
            "LevelID": 2,
            "PowerKW": 18
        },
        {
            "ID": 246181,
            "ConnectionTypeID": 28,
            "StatusTypeID": 50,
            "LevelID": 2,
            "PowerKW": 18,
            "CurrentTypeID": 10
        }
    ],
    "GeneralComments": "Recharge par badge et avec une application smartphone",
    "StatusTypeID": 50,
    "DateLastStatusUpdate": "2020-08-27T05:13:00Z",
    "DataQualityLevel": 2,
    "DateCreated": "2020-03-15T10:53:00Z",
    "SubmissionStatusTypeID": 100
}