{
    "IsRecentlyVerified": false,
    "ID": 178244,
    "UUID": "F925C677-92F9-4625-AEB8-61C4748C52CD",
    "DataProviderID": 29,
    "DataProvidersReference": "2166",
    "AddressInfo": {
        "ID": 178603,
        "Title": "Hauptstraße 70",
        "AddressLine1": "Hauptstraße 70",
        "Town": "Wendlingen",
        "Postcode": "73240",
        "CountryID": 87,
        "Latitude": 48.66566,
        "Longitude": 9.37601,
        "DistanceUnit": 0
    },
    "Connections": [
        {
            "ID": 278397,
            "ConnectionTypeID": 25,
            "StatusTypeID": 50,
            "LevelID": 2,
            "PowerKW": 22,
            "CurrentTypeID": 20
        }
    ],
    "StatusTypeID": 0,
    "DateLastStatusUpdate": "2021-07-09T03:13:00Z",
    "MetadataValues": [
        {
            "ID": 10538,
            "MetadataFieldID": 4,
            "ItemValue": "Data from the German chargepoint registry provided by Bundesnetzagentur.de under the CC-BY 4.0 license"
        }
    ],
    "DataQualityLevel": 3,
    "DateCreated": "2021-07-08T09:49:00Z",
    "SubmissionStatusTypeID": 100
}