{
    "MediaItems": [
        {
            "ID": 7912,
            "ChargePointID": 60503,
            "ItemURL": "https://s3-ap-southeast-2.amazonaws.com/openchargemap/images/GB/OCM60503/OCM-60503.orig.2016080412454465.jpg",
            "ItemThumbnailURL": "https://s3-ap-southeast-2.amazonaws.com/openchargemap/images/GB/OCM60503/OCM-60503.thmb.2016080412454465.jpg",
            "Comment": "Charging at Fred-Ivan both working. Twizy with type 2 cable from evbitz.uk. ",
            "IsEnabled": true,
            "IsVideo": false,
            "IsFeaturedItem": false,
            "IsExternalResource": false,
            "User": {
                "ID": 11654,
                "Username": "IanTwizy"
            },
            "DateCreated": "2016-08-04T12:46:00Z"
        }
    ],
    "IsRecentlyVerified": false,
    "ID": 60503,
    "UUID": "ADBCE3BA-8191-4CB4-9AF6-3D2CC0CEC8B2",
    "DataProviderID": 1,
    "OperatorID": 3,
    "OperatorsReference": "PG-80259,PG-80303,PG-80320",
    "UsageTypeID": 4,
    "UsageCost": "Free",
    "AddressInfo": {
        "ID": 60849,
        "Title": "Lancaster Institute of Contemporary Arts (lica Building)",
        "AddressLine1": "North Drive",
        "Town": "Lancaster",
        "StateOrProvince": "Lancashire",
        "Postcode": "LA1 4YW",
        "CountryID": 1,
        "Latitude": 54.0137925,
        "Longitude": -2.7841158,
        "DistanceUnit": 0
    },
    "Connections": [
        {
            "ID": 76650,
            "ConnectionTypeID": 25,
            "StatusTypeID": 50,
            "LevelID": 2,
            "Amps": 32,
            "Voltage": 230,
            "PowerKW": 7,
            "CurrentTypeID": 10,
            "Quantity": 6
        }
    ],
    "NumberOfPoints": 6,
    "StatusTypeID": 50,
    "DateLastStatusUpdate": "2020-06-02T09:10:00Z",
    "DataQualityLevel": 1,
    "DateCreated": "2016-01-28T23:42:00Z",
    "SubmissionStatusTypeID": 200
}