{
    "IsRecentlyVerified": false,
    "ID": 102897,
    "UUID": "2B1366C2-A5FB-4CB6-81EB-3A55CCA280E0",
    "DataProviderID": 2,
    "DataProvidersReference": "92519",
    "OperatorID": 5,
    "UsageTypeID": 1,
    "AddressInfo": {
        "ID": 103243,
        "Title": "STOP SHOP",
        "AddressLine1": "425 Attucks Ln",
        "Town": "Barnstable",
        "StateOrProvince": "MA",
        "Postcode": "02601",
        "CountryID": 2,
        "Latitude": 41.6758788,
        "Longitude": -70.3071273,
        "ContactTelephone1": "888-758-4389",
        "AccessComments": "24 hours daily",
        "RelatedURL": "http://www.chargepoint.com/",
        "DistanceUnit": 0
    },
    "Connections": [
        {
            "ID": 145042,
            "ConnectionTypeID": 1,
            "LevelID": 2,
            "Amps": 16,
            "Voltage": 230,
            "PowerKW": 3,
            "CurrentTypeID": 10,
            "Quantity": 2
        }
    ],
    "DateLastStatusUpdate": "2019-12-24T09:19:00Z",
    "DataQualityLevel": 3,
    "DateCreated": "2018-04-21T04:13:00Z",
    "SubmissionStatusTypeID": 100
}