{
    "IsRecentlyVerified": false,
    "ID": 141541,
    "UUID": "5349D167-E3D8-45F9-B9C2-BBA6283CD0FF",
    "DataProviderID": 2,
    "DataProvidersReference": "68226",
    "OperatorID": 5,
    "UsageTypeID": 1,
    "AddressInfo": {
        "ID": 141893,
        "Title": "EVERGY",
        "AddressLine1": "4706 Broadway @ Plaza Granada Parking Garage",
        "Town": "Kansas City",
        "StateOrProvince": "MO",
        "Postcode": "64112",
        "CountryID": 2,
        "Latitude": 39.0421137,
        "Longitude": -94.5921382,
        "ContactTelephone1": "888-758-4389",
        "AccessComments": "24 hours daily",
        "RelatedURL": "http://www.chargepoint.com/",
        "DistanceUnit": 0
    },
    "Connections": [
        {
            "ID": 197486,
            "ConnectionTypeID": 2,
            "LevelID": 3,
            "Amps": 100,
            "Voltage": 400,
            "PowerKW": 40,
            "CurrentTypeID": 30,
            "Quantity": 1
        },
        {
            "ID": 197487,
            "ConnectionTypeID": 32,
            "LevelID": 3,
            "Amps": 100,
            "Voltage": 400,
            "PowerKW": 40,
            "CurrentTypeID": 30,
            "Quantity": 1
        }
    ],
    "StatusTypeID": 50,
    "DateLastStatusUpdate": "2019-12-24T09:15:00Z",
    "DataQualityLevel": 3,
    "DateCreated": "2019-12-24T09:15:00Z",
    "SubmissionStatusTypeID": 100
}