{
    "IsRecentlyVerified": false,
    "ID": 152232,
    "UUID": "3EB98084-57FF-4293-94FE-F10D281488D7",
    "DataProviderID": 28,
    "DataProvidersReference": "FR*S86*PSORE*B029",
    "UsageTypeID": 5,
    "AddressInfo": {
        "ID": 152585,
        "Title": "B029",
        "AddressLine1": "Place Saint-Vincent - 86380 - Saint-Martin La Pallue",
        "CountryID": 80,
        "Latitude": 46.73765,
        "Longitude": 0.28073,
        "AccessComments": "24/24 7/7 jours",
        "DistanceUnit": 0
    },
    "Connections": [
        {
            "ID": 213034,
            "ConnectionTypeID": 28,
            "StatusTypeID": 50,
            "LevelID": 2,
            "PowerKW": 18,
            "CurrentTypeID": 10
        },
        {
            "ID": 213035,
            "ConnectionTypeID": 25,
            "StatusTypeID": 50,
            "LevelID": 2,
            "PowerKW": 18,
            "CurrentTypeID": 20
        },
        {
            "ID": 245899,
            "ConnectionTypeID": 28,
            "StatusTypeID": 50,
            "LevelID": 2,
            "PowerKW": 18,
            "CurrentTypeID": 10
        },
        {
            "ID": 245900,
            "ConnectionTypeID": 25,
            "StatusTypeID": 50,
            "LevelID": 2,
            "PowerKW": 18,
            "CurrentTypeID": 20
        }
    ],
    "GeneralComments": "",
    "StatusTypeID": 50,
    "DateLastStatusUpdate": "2020-08-27T05:13:00Z",
    "DataQualityLevel": 2,
    "DateCreated": "2020-03-15T10:53:00Z",
    "SubmissionStatusTypeID": 100
}