{
    "IsRecentlyVerified": false,
    "ID": 114403,
    "UUID": "DE2F8C66-B70B-42CC-84A8-4F5B0C8DE6F6",
    "DataProviderID": 1,
    "OperatorID": 80,
    "UsageTypeID": 4,
    "AddressInfo": {
        "ID": 114749,
        "Title": " Iperal Mandello | EnelX",
        "AddressLine1": "Via Statale, 87",
        "Town": "Mandello del Lario ",
        "StateOrProvince": "LC",
        "Postcode": "23826",
        "CountryID": 112,
        "Latitude": 45.91946622170697,
        "Longitude": 9.314312458917806,
        "RelatedURL": "http://www.iperal.it",
        "DistanceUnit": 0
    },
    "Connections": [
        {
            "ID": 161045,
            "ConnectionTypeID": 25,
            "StatusTypeID": 50,
            "LevelID": 2,
            "Amps": 32,
            "Voltage": 400,
            "PowerKW": 22,
            "CurrentTypeID": 20,
            "Quantity": 1
        },
        {
            "ID": 161046,
            "ConnectionTypeID": 36,
            "StatusTypeID": 50,
            "LevelID": 2,
            "Amps": 16,
            "Voltage": 240,
            "PowerKW": 3.7,
            "CurrentTypeID": 10,
            "Quantity": 1
        }
    ],
    "NumberOfPoints": 2,
    "StatusTypeID": 50,
    "DateLastStatusUpdate": "2019-11-15T16:28:00Z",
    "DataQualityLevel": 1,
    "DateCreated": "2019-01-07T15:58:00Z",
    "SubmissionStatusTypeID": 200
}