{
    "IsRecentlyVerified": false,
    "ID": 121602,
    "UUID": "29EB1E69-6A35-4D4E-87BB-E0D21AD53258",
    "DataProviderID": 2,
    "DataProvidersReference": "121083",
    "UsageTypeID": 1,
    "AddressInfo": {
        "ID": 121948,
        "Title": "Lake Lucerne Resort and Ranch",
        "AddressLine1": "48 CR 317",
        "Town": "Eureka Springs",
        "StateOrProvince": "AR",
        "Postcode": "72632",
        "CountryID": 2,
        "Latitude": 36.3743062274896,
        "Longitude": -93.7331151888161,
        "ContactTelephone1": "479-253-8780",
        "AccessComments": "24 hours daily; for Tesla use only; free for guests; see front desk for access",
        "RelatedURL": "",
        "DistanceUnit": 0
    },
    "Connections": [
        {
            "ID": 171360,
            "ConnectionTypeID": 0,
            "LevelID": 2,
            "Amps": 16,
            "Voltage": 230,
            "PowerKW": 3,
            "CurrentTypeID": 10,
            "Quantity": 1
        }
    ],
    "DateLastStatusUpdate": "2019-04-06T04:01:00Z",
    "DataQualityLevel": 3,
    "DateCreated": "2019-04-06T04:01:00Z",
    "SubmissionStatusTypeID": 100
}