{
    "IsRecentlyVerified": false,
    "ID": 137173,
    "UUID": "DE0BC0BB-1134-4619-B6CC-A7F4CB850CF0",
    "DataProviderID": 2,
    "DataProvidersReference": "81783",
    "OperatorID": 107,
    "UsageTypeID": 2,
    "AddressInfo": {
        "ID": 137519,
        "Title": "One Ala Moana",
        "AddressLine1": "1555 Kapiolani Blvd",
        "Town": "Honolulu",
        "StateOrProvince": "HI",
        "Postcode": "96814",
        "CountryID": 2,
        "Latitude": 21.291967,
        "Longitude": -157.841206,
        "ContactTelephone1": "",
        "AccessComments": "",
        "RelatedURL": "http://www.opconnect.com/",
        "DistanceUnit": 0
    },
    "Connections": [
        {
            "ID": 192033,
            "ConnectionTypeID": 1,
            "LevelID": 2,
            "Amps": 16,
            "Voltage": 230,
            "PowerKW": 3,
            "CurrentTypeID": 10,
            "Quantity": 3
        }
    ],
    "StatusTypeID": 50,
    "DateLastStatusUpdate": "2019-12-24T09:04:00Z",
    "DataQualityLevel": 3,
    "DateCreated": "2019-12-24T09:04:00Z",
    "SubmissionStatusTypeID": 100
}