{
    "IsRecentlyVerified": false,
    "ID": 171072,
    "UUID": "867332F0-92BF-49A4-AC07-9F0122C8C5A2",
    "DataProviderID": 1,
    "OperatorID": 23,
    "OperatorsReference": "55357",
    "UsageTypeID": 4,
    "UsageCost": "$0.24/min >=60kW; $0.12/min <60kW; other tariffs for older cars",
    "AddressInfo": {
        "ID": 171431,
        "Title": "Clarksburg, NJ Supercharger",
        "AddressLine1": "548 Monmouth Road",
        "Town": "Clarksburg",
        "StateOrProvince": "NJ",
        "Postcode": "08510",
        "CountryID": 2,
        "Latitude": 40.157732,
        "Longitude": -74.430077,
        "DistanceUnit": 0
    },
    "Connections": [
        {
            "ID": 261404,
            "ConnectionTypeID": 27,
            "StatusTypeID": 50,
            "LevelID": 3,
            "PowerKW": 120,
            "CurrentTypeID": 30,
            "Quantity": 8
        }
    ],
    "NumberOfPoints": 8,
    "GeneralComments": "Charging8 Superchargers, available 24/7, up to 250kW",
    "StatusTypeID": 50,
    "DateLastStatusUpdate": "2020-12-19T06:30:00Z",
    "DataQualityLevel": 1,
    "DateCreated": "2020-12-19T06:30:00Z",
    "SubmissionStatusTypeID": 200
}