{
    "IsRecentlyVerified": false,
    "ID": 131036,
    "UUID": "0BB49347-688B-4B09-BC2C-2C25C2B95055",
    "DataProviderID": 1,
    "OperatorID": 23,
    "OperatorsReference": "33669",
    "UsageTypeID": 4,
    "AddressInfo": {
        "ID": 131382,
        "Title": "Radisson Blu Hotel Edinburgh",
        "AddressLine1": "80 the High Street",
        "Town": "Edinburgh",
        "StateOrProvince": "Lothian",
        "Postcode": "EH12 9DN",
        "CountryID": 1,
        "Latitude": 55.950078,
        "Longitude": -3.186821,
        "ContactTelephone1": "+44 131 557 9797",
        "DistanceUnit": 0
    },
    "Connections": [
        {
            "ID": 183531,
            "ConnectionTypeID": 30,
            "StatusTypeID": 50,
            "LevelID": 2,
            "PowerKW": 13,
            "CurrentTypeID": 20,
            "Quantity": 2
        }
    ],
    "NumberOfPoints": 2,
    "GeneralComments": "2 Tesla Connectors, up to 13kW.Available to the public. Self park.",
    "StatusTypeID": 50,
    "DateLastStatusUpdate": "2019-08-28T20:01:00Z",
    "DataQualityLevel": 1,
    "DateCreated": "2019-08-28T20:01:00Z",
    "SubmissionStatusTypeID": 200
}