{
    "IsRecentlyVerified": false,
    "ID": 125584,
    "UUID": "1CA83927-B884-445D-9E03-2950A06E9BC7",
    "DataProviderID": 1,
    "OperatorID": 3350,
    "UsageTypeID": 4,
    "AddressInfo": {
        "ID": 125930,
        "Title": "Butik Evita (PP close to)",
        "AddressLine1": "trg cen blok B",
        "Town": "Kochani",
        "CountryID": 134,
        "Latitude": 41.91714,
        "Longitude": 22.4114,
        "RelatedURL": "https://www.elektrodistribucija.mk/Home.aspx?lang=en-us",
        "DistanceUnit": 0
    },
    "Connections": [
        {
            "ID": 175981,
            "ConnectionTypeID": 25,
            "StatusTypeID": 50,
            "LevelID": 2,
            "Amps": 32,
            "Voltage": 400,
            "PowerKW": 22,
            "CurrentTypeID": 20,
            "Quantity": 2
        }
    ],
    "NumberOfPoints": 2,
    "GeneralComments": "Operated by EVN Group\r\nhttps://www.elektrodistribucija.mk/Electromobility/Charger-locations.aspx",
    "StatusTypeID": 50,
    "DateLastStatusUpdate": "2019-04-23T07:42:00Z",
    "DataQualityLevel": 1,
    "DateCreated": "2019-04-21T11:59:00Z",
    "SubmissionStatusTypeID": 200
}