{
    "IsRecentlyVerified": false,
    "ID": 54198,
    "UUID": "EE611DD9-55A6-4F52-9B8F-E5DB941DC808",
    "DataProviderID": 1,
    "OperatorID": 215,
    "UsageTypeID": 4,
    "AddressInfo": {
        "ID": 54544,
        "Title": "Autohaus Wilhelm Graf",
        "AddressLine1": "Schwabacher Straße 382",
        "Town": "Fürth",
        "Postcode": "90763",
        "CountryID": 87,
        "Latitude": 49.4448267,
        "Longitude": 10.988618,
        "ContactTelephone1": "+49 911 997130",
        "AccessComments": "Rund um die Uhr (24/7) nutzbar. Position: rechts neben der Dialog Anahme Nur für VW und Audi Fahrzeuge\r\n",
        "RelatedURL": "https://www.feser-graf.de/unternehmen/standorte/fuerth/volkswagen",
        "DistanceUnit": 0
    },
    "Connections": [
        {
            "ID": 68173,
            "ConnectionTypeID": 25,
            "StatusTypeID": 50,
            "LevelID": 2,
            "PowerKW": 3.7,
            "CurrentTypeID": 10,
            "Quantity": 1
        }
    ],
    "NumberOfPoints": 1,
    "StatusTypeID": 50,
    "DateLastStatusUpdate": "2020-03-17T08:40:00Z",
    "DataQualityLevel": 1,
    "DateCreated": "2015-09-24T18:44:00Z",
    "SubmissionStatusTypeID": 200
}