{
    "IsRecentlyVerified": false,
    "ID": 87433,
    "UUID": "B92196F4-0685-4355-AB5C-2B7056935561",
    "DataProviderID": 1,
    "OperatorID": 69,
    "UsageTypeID": 4,
    "AddressInfo": {
        "ID": 87779,
        "Title": "Autohaus Fischer",
        "AddressLine1": "Damaschkeweg 65",
        "Town": "Jena",
        "StateOrProvince": "Jena",
        "Postcode": "07745",
        "CountryID": 87,
        "Latitude": 50.89922543451461,
        "Longitude": 11.585958551590018,
        "AccessComments": "24/7 nutzbare blaue Wallbox am Gebäude  zwischen 2 Fenstern.",
        "RelatedURL": "http://www.egt-energie.de/stromnetz/elektromobil/egt-ladesaeulen",
        "DistanceUnit": 0
    },
    "Connections": [
        {
            "ID": 123945,
            "ConnectionTypeID": 25,
            "StatusTypeID": 50,
            "LevelID": 2,
            "Amps": 32,
            "Voltage": 400,
            "PowerKW": 22,
            "CurrentTypeID": 20,
            "Quantity": 1
        }
    ],
    "NumberOfPoints": 1,
    "StatusTypeID": 50,
    "DateLastStatusUpdate": "2017-05-08T07:03:00Z",
    "DataQualityLevel": 1,
    "DateCreated": "2017-05-08T07:03:00Z",
    "SubmissionStatusTypeID": 200
}