{
    "IsRecentlyVerified": false,
    "ID": 180568,
    "UUID": "5FFF5544-081A-4B90-B534-FC19036B9158",
    "DataProviderID": 29,
    "DataProvidersReference": "20112",
    "OperatorID": 45,
    "AddressInfo": {
        "ID": 180927,
        "Title": "Dr. Georg-Schaeffler-Straße 9",
        "AddressLine1": "Dr. Georg-Schaeffler-Straße 9",
        "Town": "Lahr",
        "Postcode": "77933",
        "CountryID": 87,
        "Latitude": 48.348917,
        "Longitude": 7.819667,
        "DistanceUnit": 0
    },
    "Connections": [
        {
            "ID": 283798,
            "ConnectionTypeID": 33,
            "StatusTypeID": 50,
            "LevelID": 3,
            "PowerKW": 125,
            "CurrentTypeID": 30
        },
        {
            "ID": 283799,
            "ConnectionTypeID": 33,
            "StatusTypeID": 50,
            "LevelID": 3,
            "PowerKW": 125,
            "CurrentTypeID": 30
        },
        {
            "ID": 295751,
            "ConnectionTypeID": 25,
            "StatusTypeID": 50,
            "LevelID": 2,
            "PowerKW": 22,
            "CurrentTypeID": 20
        }
    ],
    "StatusTypeID": 50,
    "DateLastStatusUpdate": "2021-07-12T02:41:00Z",
    "MetadataValues": [
        {
            "ID": 12862,
            "MetadataFieldID": 4,
            "ItemValue": "Data from the German chargepoint registry provided by Bundesnetzagentur.de under the CC-BY 4.0 license"
        }
    ],
    "DataQualityLevel": 3,
    "DateCreated": "2021-07-08T10:00:00Z",
    "SubmissionStatusTypeID": 100
}