{
    "IsRecentlyVerified": false,
    "ID": 186796,
    "UUID": "4F406703-69E1-41D0-9CFE-8AEF2B5E0580",
    "DataProviderID": 29,
    "DataProvidersReference": "14388",
    "OperatorID": 105,
    "AddressInfo": {
        "ID": 187155,
        "Title": "Elisabethstraße (Parkplatz) 0",
        "AddressLine1": "Elisabethstraße (Parkplatz) 0",
        "Town": "Dissen am Teutoburger Wald",
        "Postcode": "49201",
        "CountryID": 87,
        "Latitude": 52.1139195,
        "Longitude": 8.1975164,
        "DistanceUnit": 0
    },
    "Connections": [
        {
            "ID": 300187,
            "ConnectionTypeID": 25,
            "StatusTypeID": 50,
            "LevelID": 2,
            "PowerKW": 22,
            "CurrentTypeID": 20
        },
        {
            "ID": 300188,
            "ConnectionTypeID": 25,
            "StatusTypeID": 50,
            "LevelID": 2,
            "PowerKW": 22,
            "CurrentTypeID": 20
        }
    ],
    "StatusTypeID": 50,
    "DateLastStatusUpdate": "2021-07-12T02:49:00Z",
    "MetadataValues": [
        {
            "ID": 19037,
            "MetadataFieldID": 4,
            "ItemValue": "Data from the German chargepoint registry provided by Bundesnetzagentur.de under the CC-BY 4.0 license"
        }
    ],
    "DataQualityLevel": 3,
    "DateCreated": "2021-07-12T02:49:00Z",
    "SubmissionStatusTypeID": 100
}