{
    "IsRecentlyVerified": false,
    "ID": 112189,
    "UUID": "72D31E13-B810-4C0A-A3DD-A9295B349496",
    "DataProviderID": 2,
    "DataProvidersReference": "91365",
    "OperatorID": 5,
    "UsageTypeID": 1,
    "AddressInfo": {
        "ID": 112535,
        "Title": "MOUNTAIN EQUIP",
        "AddressLine1": "1624 99 St NW",
        "Town": "Edmonton",
        "StateOrProvince": "AB",
        "Postcode": "T6N 1N5",
        "CountryID": 44,
        "Latitude": 53.4462437,
        "Longitude": -113.4869469,
        "ContactTelephone1": "888-758-4389",
        "AccessComments": "24 hours daily",
        "RelatedURL": "http://www.chargepoint.com/",
        "DistanceUnit": 0
    },
    "Connections": [
        {
            "ID": 157740,
            "ConnectionTypeID": 1,
            "LevelID": 2,
            "Amps": 16,
            "Voltage": 230,
            "PowerKW": 3,
            "CurrentTypeID": 10,
            "Quantity": 2
        }
    ],
    "DateLastStatusUpdate": "2019-04-06T05:07:00Z",
    "DataQualityLevel": 3,
    "DateCreated": "2018-10-18T23:37:00Z",
    "SubmissionStatusTypeID": 100
}