{
    "IsRecentlyVerified": false,
    "ID": 75883,
    "UUID": "2E73AC86-6B73-4114-A259-208E3E806FDA",
    "DataProviderID": 2,
    "DataProvidersReference": "80192",
    "OperatorID": 5,
    "UsageTypeID": 1,
    "AddressInfo": {
        "ID": 76229,
        "Title": "GARAGESTATIONS",
        "AddressLine1": "101 N 14th St",
        "Town": "Lincoln",
        "StateOrProvince": "NE",
        "Postcode": "68508",
        "CountryID": 2,
        "Latitude": 40.8141225,
        "Longitude": -96.7017857,
        "ContactTelephone1": "888-758-4389",
        "AccessComments": "24 hours daily",
        "RelatedURL": "http://www.chargepoint.com/",
        "DistanceUnit": 0
    },
    "Connections": [
        {
            "ID": 109394,
            "ConnectionTypeID": 1,
            "LevelID": 2,
            "Amps": 16,
            "Voltage": 230,
            "PowerKW": 3.7,
            "CurrentTypeID": 10,
            "Quantity": 2
        }
    ],
    "DateLastStatusUpdate": "2020-06-26T03:03:00Z",
    "DataQualityLevel": 3,
    "DateCreated": "2016-12-23T01:25:00Z",
    "SubmissionStatusTypeID": 100
}