{
    "IsRecentlyVerified": false,
    "ID": 56892,
    "UUID": "D1CA9311-D52A-4C64-8B8D-259FD729D051",
    "DataProviderID": 1,
    "OperatorID": 25,
    "OperatorsReference": "PP-5112098",
    "UsageTypeID": 4,
    "UsageCost": "Free",
    "AddressInfo": {
        "ID": 57238,
        "Title": "Wesley Avenue",
        "AddressLine1": "Wesley Avenue",
        "AddressLine2": "Newham",
        "Town": "London",
        "Postcode": "E16 1SW",
        "CountryID": 1,
        "Latitude": 51.504836,
        "Longitude": 0.021194,
        "AccessComments": "Max 4 hours stay while charging, no return within 2 hours",
        "DistanceUnit": 0
    },
    "Connections": [
        {
            "ID": 71822,
            "ConnectionTypeID": 25,
            "StatusTypeID": 100,
            "LevelID": 2,
            "Amps": 32,
            "Voltage": 230,
            "PowerKW": 7,
            "CurrentTypeID": 10,
            "Quantity": 2
        }
    ],
    "NumberOfPoints": 2,
    "GeneralComments": "Pod-Point charging point.",
    "StatusTypeID": 50,
    "DateLastStatusUpdate": "2016-11-12T18:57:00Z",
    "DataQualityLevel": 1,
    "DateCreated": "2015-11-15T17:30:00Z",
    "SubmissionStatusTypeID": 200
}