{
    "IsRecentlyVerified": false,
    "ID": 50675,
    "UUID": "73F65B8D-085B-4FD2-82EA-B5D21A77CB95",
    "DataProviderID": 26,
    "DataProvidersReference": "66208",
    "OperatorID": 73,
    "OperatorsReference": "EV-Box EVB-P1427217",
    "UsageCost": "0.00 jaarabonnement",
    "AddressInfo": {
        "ID": 51021,
        "Title": "Beneden Molendijk 2",
        "AddressLine1": "Beneden Molendijk 2",
        "Town": "Cromstrijen",
        "Postcode": "3281 LP",
        "CountryID": 159,
        "Latitude": 51.72623,
        "Longitude": 4.43571,
        "RelatedURL": "http://www.ev-box.nl",
        "DistanceUnit": 0
    },
    "Connections": [
        {
            "ID": 62460,
            "ConnectionTypeID": 25,
            "LevelID": 2,
            "PowerKW": 11,
            "CurrentTypeID": 10
        },
        {
            "ID": 62461,
            "ConnectionTypeID": 25,
            "LevelID": 2,
            "PowerKW": 11,
            "CurrentTypeID": 10
        }
    ],
    "NumberOfPoints": 1,
    "StatusTypeID": 50,
    "DateLastStatusUpdate": "2016-06-04T02:40:00Z",
    "DataQualityLevel": 3,
    "DateCreated": "2015-07-22T09:53:00Z",
    "SubmissionStatusTypeID": 100
}