{
    "IsRecentlyVerified": false,
    "ID": 180653,
    "UUID": "82CD4C3F-C95F-4706-AE49-C58CC842D280",
    "DataProviderID": 29,
    "DataProvidersReference": "15515",
    "OperatorID": 3403,
    "AddressInfo": {
        "ID": 181012,
        "Title": "Friedrichstraße ggü. Nr. 2",
        "AddressLine1": "Friedrichstraße ggü. Nr. 2",
        "Town": "Würselen",
        "Postcode": "52146",
        "CountryID": 87,
        "Latitude": 50.8183154,
        "Longitude": 6.1330546,
        "DistanceUnit": 0
    },
    "Connections": [
        {
            "ID": 283999,
            "ConnectionTypeID": 25,
            "StatusTypeID": 50,
            "LevelID": 2,
            "PowerKW": 22,
            "CurrentTypeID": 20
        },
        {
            "ID": 284000,
            "ConnectionTypeID": 25,
            "StatusTypeID": 50,
            "LevelID": 2,
            "PowerKW": 22,
            "CurrentTypeID": 20
        }
    ],
    "StatusTypeID": 50,
    "DateLastStatusUpdate": "2021-07-12T02:45:00Z",
    "MetadataValues": [
        {
            "ID": 12947,
            "MetadataFieldID": 4,
            "ItemValue": "Data from the German chargepoint registry provided by Bundesnetzagentur.de under the CC-BY 4.0 license"
        }
    ],
    "DataQualityLevel": 3,
    "DateCreated": "2021-07-08T10:00:00Z",
    "SubmissionStatusTypeID": 100
}