{
    "IsRecentlyVerified": false,
    "ID": 9565,
    "UUID": "0B814B66-23ED-4450-8F6F-B8F985ABF65D",
    "DataProviderID": 1,
    "OperatorID": 5,
    "UsageTypeID": 1,
    "AddressInfo": {
        "ID": 9462,
        "Title": "Green MTN Power @ 39 Main St",
        "AddressLine1": "39 Main St",
        "Town": "Montpelier",
        "StateOrProvince": "Vermont",
        "Postcode": "05602",
        "CountryID": 2,
        "Latitude": 44.2592392,
        "Longitude": -72.57553864,
        "RelatedURL": "http://carstations.com/14935",
        "DistanceUnit": 0
    },
    "Connections": [
        {
            "ID": 7273,
            "ConnectionTypeID": 1,
            "Reference": "J1772",
            "StatusTypeID": 50,
            "LevelID": 2,
            "Amps": 30,
            "Voltage": 240,
            "PowerKW": 6.6,
            "Quantity": 1
        },
        {
            "ID": 8455,
            "ConnectionTypeID": 9,
            "Reference": "NEMA5",
            "LevelID": 1,
            "Quantity": 1
        }
    ],
    "NumberOfPoints": 1,
    "StatusTypeID": 50,
    "DateLastStatusUpdate": "2014-05-23T14:47:00Z",
    "DataQualityLevel": 2,
    "DateCreated": "2012-02-26T15:07:00Z",
    "SubmissionStatusTypeID": 100
}