{
    "IsRecentlyVerified": false,
    "ID": 134993,
    "UUID": "90C4AFCD-ADB3-4102-A740-953D826ED3CB",
    "DataProviderID": 1,
    "OperatorID": 3345,
    "UsageTypeID": 5,
    "AddressInfo": {
        "ID": 135339,
        "Title": "Olive Road",
        "AddressLine1": "Olive Road",
        "Town": "Cricklewood",
        "Postcode": "NW2 6UN",
        "CountryID": 1,
        "Latitude": 51.556592,
        "Longitude": -0.223055,
        "RelatedURL": "https://char.gy",
        "DistanceUnit": 0
    },
    "Connections": [
        {
            "ID": 188921,
            "ConnectionTypeID": 25,
            "Reference": "176",
            "StatusTypeID": 50,
            "LevelID": 2,
            "Amps": 16,
            "Voltage": 230,
            "PowerKW": 3.7,
            "CurrentTypeID": 10
        }
    ],
    "StatusTypeID": 0,
    "DateLastStatusUpdate": "2019-12-04T11:20:00Z",
    "MetadataValues": [
        {
            "ID": 5334,
            "MetadataFieldID": 4,
            "ItemValue": "Contains public sector information licensed under the Open Government Licence v2.0. http://www.nationalarchives.gov.uk/doc/open-government-licence/version/2/"
        }
    ],
    "DataQualityLevel": 3,
    "DateCreated": "2019-12-03T13:42:00Z",
    "SubmissionStatusTypeID": 100
}