{
    "IsRecentlyVerified": false,
    "ID": 61660,
    "UUID": "3259A771-8784-47CC-A6BF-B0BA4272B70D",
    "DataProviderID": 1,
    "OperatorID": 23,
    "OperatorsReference": "12262",
    "UsageTypeID": 1,
    "UsageCost": "Free",
    "AddressInfo": {
        "ID": 62006,
        "Title": "Partridge Inn",
        "AddressLine1": "2110 Walton Way",
        "Town": "Augusta",
        "StateOrProvince": "GA",
        "Postcode": "30904",
        "CountryID": 2,
        "Latitude": 33.4751415,
        "Longitude": -82.0101036,
        "ContactTelephone1": "706-737-8888  877-798-3752",
        "AccessComments": "24 hours daily; for guest use only",
        "RelatedURL": "http://www.teslamotors.com/supercharger",
        "DistanceUnit": 0
    },
    "Connections": [
        {
            "ID": 78549,
            "ConnectionTypeID": 30,
            "StatusTypeID": 50,
            "LevelID": 2,
            "Amps": 16,
            "Voltage": 230,
            "PowerKW": 16,
            "CurrentTypeID": 10,
            "Quantity": 2
        }
    ],
    "NumberOfPoints": 2,
    "StatusTypeID": 50,
    "DateLastStatusUpdate": "2017-01-31T22:32:00Z",
    "DataQualityLevel": 3,
    "DateCreated": "2016-03-03T11:38:00Z",
    "SubmissionStatusTypeID": 100
}