{
    "IsRecentlyVerified": false,
    "ID": 148939,
    "UUID": "C6183E54-294E-447C-8C5E-C14CDD3E6CC6",
    "DataProviderID": 1,
    "OperatorID": 80,
    "UsageTypeID": 4,
    "AddressInfo": {
        "ID": 149292,
        "Title": "Breda di Piave Bersaglieri | EnelX",
        "AddressLine1": "Via dei Bersaglieri",
        "Town": "Breda di Piave",
        "StateOrProvince": "TV",
        "Postcode": "31030 ",
        "CountryID": 112,
        "Latitude": 45.71987011581339,
        "Longitude": 12.332873892260409,
        "ContactTelephone1": "800.069.850",
        "RelatedURL": "https://www.enelx.com/it/it/emobility",
        "DistanceUnit": 0
    },
    "Connections": [
        {
            "ID": 206822,
            "ConnectionTypeID": 25,
            "StatusTypeID": 150,
            "LevelID": 2,
            "Amps": 32,
            "Voltage": 400,
            "PowerKW": 22,
            "CurrentTypeID": 20,
            "Quantity": 2
        }
    ],
    "NumberOfPoints": 2,
    "StatusTypeID": 150,
    "DateLastStatusUpdate": "2020-02-13T15:58:00Z",
    "DataQualityLevel": 1,
    "DateCreated": "2020-02-13T15:52:00Z",
    "SubmissionStatusTypeID": 200
}