{
    "IsRecentlyVerified": false,
    "ID": 177784,
    "UUID": "A8AF7BB5-5E09-4671-B9FF-F330E1A17DE3",
    "DataProviderID": 29,
    "DataProvidersReference": "7762",
    "OperatorID": 69,
    "AddressInfo": {
        "ID": 178143,
        "Title": "Maximilianstr. 16a",
        "AddressLine1": "Maximilianstr. 16a",
        "Town": "München",
        "Postcode": "80539",
        "CountryID": 87,
        "Latitude": 48.138861,
        "Longitude": 11.581028,
        "DistanceUnit": 0
    },
    "Connections": [
        {
            "ID": 277353,
            "ConnectionTypeID": 25,
            "StatusTypeID": 50,
            "LevelID": 2,
            "PowerKW": 22,
            "CurrentTypeID": 20
        },
        {
            "ID": 277354,
            "ConnectionTypeID": 25,
            "StatusTypeID": 50,
            "LevelID": 2,
            "PowerKW": 22,
            "CurrentTypeID": 20
        }
    ],
    "StatusTypeID": 0,
    "DateLastStatusUpdate": "2021-07-12T02:40:00Z",
    "MetadataValues": [
        {
            "ID": 10078,
            "MetadataFieldID": 4,
            "ItemValue": "Data from the German chargepoint registry provided by Bundesnetzagentur.de under the CC-BY 4.0 license"
        }
    ],
    "DataQualityLevel": 3,
    "DateCreated": "2021-07-08T09:49:00Z",
    "SubmissionStatusTypeID": 100
}