{
    "IsRecentlyVerified": false,
    "ID": 103107,
    "UUID": "8EF73FC5-4C9E-492F-B9FA-8ACBCEC0030F",
    "DataProviderID": 1,
    "DataProvidersReference": "4721",
    "AddressInfo": {
        "ID": 103453,
        "Title": "Panoramavegen 893",
        "AddressLine1": "Panoramavegen 893",
        "Town": "RØN",
        "StateOrProvince": "Innlandet",
        "Postcode": "2960",
        "CountryID": 168,
        "Latitude": 60.99643,
        "Longitude": 8.98973,
        "AccessComments": "",
        "DistanceUnit": 0
    },
    "Connections": [
        {
            "ID": 145510,
            "ConnectionTypeID": 0,
            "Reference": "1",
            "LevelID": 2,
            "Amps": 32,
            "Voltage": 230,
            "PowerKW": 7.4,
            "Comments": "Mode 3"
        },
        {
            "ID": 145511,
            "ConnectionTypeID": 0,
            "Reference": "2",
            "LevelID": 2,
            "Amps": 32,
            "Voltage": 230,
            "PowerKW": 7.4,
            "Comments": "Mode 3"
        }
    ],
    "NumberOfPoints": 2,
    "DateLastStatusUpdate": "2020-05-26T08:24:00Z",
    "DataQualityLevel": 2,
    "DateCreated": "2018-04-21T06:52:00Z",
    "SubmissionStatusTypeID": 100
}