{
    "IsRecentlyVerified": false,
    "ID": 159413,
    "UUID": "5E9EC3E2-40AD-4DD1-914C-818D40CFCD9A",
    "DataProviderID": 2,
    "DataProvidersReference": "157950",
    "UsageTypeID": 1,
    "AddressInfo": {
        "ID": 159770,
        "Title": "CarMax - White Marsh, MD",
        "AddressLine1": "10201 Philadelphia Rd",
        "Town": "White Marsh",
        "StateOrProvince": "MD",
        "Postcode": "21162",
        "CountryID": 2,
        "Latitude": 39.367887,
        "Longitude": -76.44597,
        "ContactTelephone1": "410-931-6500",
        "AccessComments": "24 hours daily",
        "RelatedURL": "",
        "DistanceUnit": 0
    },
    "Connections": [
        {
            "ID": 229586,
            "ConnectionTypeID": 1,
            "LevelID": 2,
            "Amps": 16,
            "Voltage": 230,
            "PowerKW": 3.7,
            "CurrentTypeID": 10,
            "Quantity": 2
        }
    ],
    "StatusTypeID": 50,
    "DateLastStatusUpdate": "2020-06-26T03:01:00Z",
    "DataQualityLevel": 3,
    "DateCreated": "2020-06-26T03:01:00Z",
    "SubmissionStatusTypeID": 100
}