{
    "IsRecentlyVerified": false,
    "ID": 75819,
    "UUID": "BD4C0EA4-D89D-4698-86A7-13E21D1D00A4",
    "DataProviderID": 1,
    "OperatorID": 23,
    "OperatorsReference": "22328",
    "UsageTypeID": 7,
    "UsageCost": "Free",
    "AddressInfo": {
        "ID": 76165,
        "Title": "The Mast Farm Inn - Tesla",
        "AddressLine1": "2543 Broadstone Rd",
        "Town": "Banner Elk",
        "StateOrProvince": "NC",
        "Postcode": "28604",
        "CountryID": 2,
        "Latitude": 36.2069972,
        "Longitude": -81.7712958,
        "ContactTelephone1": "828-963-5857  877-798-3752",
        "AccessComments": "24 hours daily; for Tesla use with reservation only",
        "RelatedURL": "http://www.teslamotors.com/supercharger",
        "DistanceUnit": 0
    },
    "Connections": [
        {
            "ID": 109325,
            "ConnectionTypeID": 30,
            "StatusTypeID": 50,
            "LevelID": 2,
            "Amps": 16,
            "Voltage": 230,
            "PowerKW": 8,
            "CurrentTypeID": 10,
            "Quantity": 1
        }
    ],
    "NumberOfPoints": 1,
    "StatusTypeID": 50,
    "DateLastStatusUpdate": "2017-01-26T04:32:00Z",
    "DataQualityLevel": 3,
    "DateCreated": "2016-12-23T01:25:00Z",
    "SubmissionStatusTypeID": 100
}