{
    "IsRecentlyVerified": false,
    "ID": 50654,
    "UUID": "F876ED2D-195C-41B6-8111-4306B17FB977",
    "DataProviderID": 26,
    "DataProvidersReference": "66111",
    "OperatorID": 178,
    "OperatorsReference": "EVnetNL PNB-ENO101",
    "UsageCost": "0.00 jaarabonnement",
    "AddressInfo": {
        "ID": 51000,
        "Title": "Van Dubbelmondestraat 1",
        "AddressLine1": "Van Dubbelmondestraat 1",
        "Town": "Oosterhout",
        "Postcode": "4901 VH",
        "CountryID": 159,
        "Latitude": 51.648113,
        "Longitude": 4.856989,
        "ContactTelephone1": "0800-3522365",
        "RelatedURL": "http://www.evnet.nl",
        "DistanceUnit": 0
    },
    "Connections": [
        {
            "ID": 62436,
            "ConnectionTypeID": 25,
            "LevelID": 2,
            "PowerKW": 11,
            "CurrentTypeID": 10
        }
    ],
    "NumberOfPoints": 2,
    "StatusTypeID": 50,
    "DateLastStatusUpdate": "2016-06-04T02:39:00Z",
    "DataQualityLevel": 3,
    "DateCreated": "2015-07-22T09:53:00Z",
    "SubmissionStatusTypeID": 100
}