{
    "IsRecentlyVerified": false,
    "ID": 95270,
    "UUID": "D6B9C6A1-71B2-4F3A-8088-8F2CF6FA36B6",
    "DataProviderID": 1,
    "OperatorID": 23,
    "OperatorsReference": "37215",
    "UsageTypeID": 4,
    "AddressInfo": {
        "ID": 95616,
        "Title": "Radisson Blu Residence Dubai Marina",
        "AddressLine1": "P.o.box.no.73029 Radisson Blu Residence Dubai Marina",
        "Town": "Dubai Marina",
        "Postcode": "73029",
        "CountryID": 235,
        "Latitude": 25.078449,
        "Longitude": 55.143129,
        "ContactTelephone1": "+97144355000",
        "DistanceUnit": 0
    },
    "Connections": [
        {
            "ID": 134938,
            "ConnectionTypeID": 1036,
            "StatusTypeID": 50,
            "LevelID": 2,
            "Amps": 32,
            "Voltage": 400,
            "PowerKW": 22,
            "CurrentTypeID": 20,
            "Quantity": 1
        }
    ],
    "NumberOfPoints": 1,
    "GeneralComments": "1 Tesla Connector, up to 22kW.Available to the public. Please see front desk.",
    "StatusTypeID": 50,
    "DateLastStatusUpdate": "2017-11-05T07:06:00Z",
    "DataQualityLevel": 1,
    "DateCreated": "2017-11-05T07:06:00Z",
    "SubmissionStatusTypeID": 200
}