{
    "IsRecentlyVerified": false,
    "ID": 139532,
    "UUID": "F8A9B5F4-58EB-4B2A-974E-33617EA4DCEA",
    "DataProviderID": 2,
    "DataProvidersReference": "149703",
    "OperatorID": 5,
    "UsageTypeID": 1,
    "AddressInfo": {
        "ID": 139884,
        "Title": "RIVERSIDE HD",
        "AddressLine1": "7688 Indiana Ave",
        "Town": "Riverside",
        "StateOrProvince": "CA",
        "Postcode": "92504",
        "CountryID": 2,
        "Latitude": 33.932441,
        "Longitude": -117.408054,
        "ContactTelephone1": "888-758-4389",
        "AccessComments": "24 hours daily",
        "RelatedURL": "http://www.chargepoint.com/",
        "DistanceUnit": 0
    },
    "Connections": [
        {
            "ID": 194929,
            "ConnectionTypeID": 1,
            "LevelID": 2,
            "Amps": 16,
            "Voltage": 230,
            "PowerKW": 3,
            "CurrentTypeID": 10,
            "Quantity": 2
        },
        {
            "ID": 194930,
            "ConnectionTypeID": 32,
            "LevelID": 3,
            "Amps": 100,
            "Voltage": 400,
            "PowerKW": 40,
            "CurrentTypeID": 30,
            "Quantity": 1
        }
    ],
    "StatusTypeID": 50,
    "DateLastStatusUpdate": "2019-12-24T09:11:00Z",
    "DataQualityLevel": 3,
    "DateCreated": "2019-12-24T09:11:00Z",
    "SubmissionStatusTypeID": 100
}