{
    "IsRecentlyVerified": false,
    "ID": 132839,
    "UUID": "CD2B7505-CB4A-452C-B0B3-00B840503F83",
    "DataProviderID": 1,
    "OperatorID": 45,
    "UsageTypeID": 4,
    "AddressInfo": {
        "ID": 133185,
        "Title": "Bessines - Centre Commercial La Mude",
        "AddressLine1": "Route de la Rochelle",
        "AddressLine2": "Les Gueringous",
        "Town": "Bessines",
        "StateOrProvince": "Niort",
        "Postcode": "79000",
        "CountryID": 80,
        "Latitude": 46.3055752640546,
        "Longitude": -0.487446604144679,
        "RelatedURL": "https://espaceclient.alterbase.fr/station/index",
        "DistanceUnit": 0
    },
    "Connections": [
        {
            "ID": 186085,
            "ConnectionTypeID": 33,
            "StatusTypeID": 100,
            "LevelID": 3,
            "Amps": 120,
            "Voltage": 400,
            "PowerKW": 50,
            "CurrentTypeID": 30,
            "Quantity": 1
        },
        {
            "ID": 186086,
            "ConnectionTypeID": 1036,
            "StatusTypeID": 100,
            "LevelID": 3,
            "Amps": 63,
            "Voltage": 400,
            "PowerKW": 43,
            "CurrentTypeID": 20,
            "Quantity": 1
        },
        {
            "ID": 186087,
            "ConnectionTypeID": 2,
            "StatusTypeID": 100,
            "LevelID": 3,
            "Amps": 120,
            "Voltage": 400,
            "PowerKW": 50,
            "CurrentTypeID": 30,
            "Quantity": 1
        }
    ],
    "NumberOfPoints": 1,
    "GeneralComments": "AlterBase, c'est le réseau de mobilité électrique made in Deux-Sèvres.",
    "StatusTypeID": 50,
    "DateLastStatusUpdate": "2021-10-04T09:49:00Z",
    "DataQualityLevel": 1,
    "DateCreated": "2019-10-08T21:43:00Z",
    "SubmissionStatusTypeID": 200
}