{
    "IsRecentlyVerified": false,
    "ID": 115614,
    "UUID": "1EF599D7-A1A1-4CC2-B7FC-31D7A3977EDE",
    "DataProviderID": 2,
    "DataProvidersReference": "112836",
    "OperatorID": 23,
    "UsageTypeID": 1,
    "AddressInfo": {
        "ID": 115960,
        "Title": "Sierra Meadows - Tesla Destination",
        "AddressLine1": "46516 Opah Dr",
        "Town": "Ahwahnee",
        "StateOrProvince": "CA",
        "Postcode": "93601",
        "CountryID": 2,
        "Latitude": 37.364482,
        "Longitude": -119.702683,
        "ContactTelephone1": "559-580-8085  877-798-3752",
        "AccessComments": "24 hours daily; for Tesla use only; for guest use only; see front desk for access",
        "RelatedURL": "https://www.tesla.com/destination-charging",
        "DistanceUnit": 0
    },
    "Connections": [
        {
            "ID": 162638,
            "ConnectionTypeID": 0,
            "LevelID": 2,
            "Amps": 16,
            "Voltage": 230,
            "PowerKW": 3,
            "CurrentTypeID": 10,
            "Quantity": 10
        }
    ],
    "DateLastStatusUpdate": "2019-04-06T04:02:00Z",
    "DataQualityLevel": 3,
    "DateCreated": "2019-02-11T07:13:00Z",
    "SubmissionStatusTypeID": 100
}