{
    "IsRecentlyVerified": false,
    "ID": 50714,
    "UUID": "0B419369-D385-4D25-9E80-84908BAE24AA",
    "DataProviderID": 26,
    "DataProvidersReference": "65422",
    "OperatorID": 103,
    "OperatorsReference": "Allego NLALLEGO0002202",
    "UsageCost": "0.00 jaarabonnement",
    "AddressInfo": {
        "ID": 51060,
        "Title": "Laurierhof 3",
        "AddressLine1": "Laurierhof 3",
        "Town": "Papendrecht",
        "Postcode": "3355 RM",
        "CountryID": 159,
        "Latitude": 51.8378945,
        "Longitude": 4.70851246,
        "ContactTelephone1": "0800-3745337",
        "RelatedURL": "http://www.allego.eu/",
        "DistanceUnit": 0
    },
    "Connections": [
        {
            "ID": 62522,
            "ConnectionTypeID": 25,
            "LevelID": 2,
            "PowerKW": 11,
            "CurrentTypeID": 10
        },
        {
            "ID": 62523,
            "ConnectionTypeID": 25,
            "LevelID": 2,
            "PowerKW": 11,
            "CurrentTypeID": 10
        }
    ],
    "NumberOfPoints": 1,
    "StatusTypeID": 50,
    "DateLastStatusUpdate": "2016-06-04T02:41:00Z",
    "DataQualityLevel": 3,
    "DateCreated": "2015-07-22T09:53:00Z",
    "SubmissionStatusTypeID": 100
}