{
    "IsRecentlyVerified": false,
    "ID": 142766,
    "UUID": "7C8D8AAE-7027-4B26-8B94-7B5B16897E9E",
    "DataProviderID": 2,
    "DataProvidersReference": "123274",
    "OperatorID": 5,
    "UsageTypeID": 1,
    "AddressInfo": {
        "ID": 143118,
        "Title": "I-91 Tech Park",
        "AddressLine1": "845 Brook St",
        "Town": "Rocky Hill",
        "StateOrProvince": "CT",
        "Postcode": "06067",
        "CountryID": 2,
        "Latitude": 41.641774,
        "Longitude": -72.676125,
        "ContactTelephone1": "860-563-0015",
        "AccessComments": "24 hours daily; priority for Connecticut Green Bank employees",
        "RelatedURL": "http://www.chargepoint.com/",
        "DistanceUnit": 0
    },
    "Connections": [
        {
            "ID": 198979,
            "ConnectionTypeID": 1,
            "LevelID": 2,
            "Amps": 16,
            "Voltage": 230,
            "PowerKW": 3.7,
            "CurrentTypeID": 10,
            "Quantity": 2
        }
    ],
    "StatusTypeID": 50,
    "DateLastStatusUpdate": "2020-06-26T03:04:00Z",
    "DataQualityLevel": 3,
    "DateCreated": "2019-12-24T09:18:00Z",
    "SubmissionStatusTypeID": 100
}