{
    "IsRecentlyVerified": false,
    "ID": 129989,
    "UUID": "8103085D-E408-472C-8826-BB0AE7797C58",
    "DataProviderID": 1,
    "OperatorID": 23,
    "OperatorsReference": "51177",
    "UsageTypeID": 4,
    "AddressInfo": {
        "ID": 130335,
        "Title": "Banyan Tree Mayakoba",
        "AddressLine1": "Chetumal-Puerto Juarez Riviera Maya KM 298",
        "Town": "Playa del Carmen",
        "StateOrProvince": "Quintana Roo",
        "Postcode": "77710",
        "CountryID": 146,
        "Latitude": 20.679848,
        "Longitude": -87.022146,
        "ContactTelephone1": "+52 001 888 213 4992",
        "DistanceUnit": 0
    },
    "Connections": [
        {
            "ID": 181979,
            "ConnectionTypeID": 30,
            "StatusTypeID": 50,
            "LevelID": 2,
            "PowerKW": 13,
            "CurrentTypeID": 20,
            "Quantity": 2
        }
    ],
    "NumberOfPoints": 2,
    "GeneralComments": "2 Tesla Connectors, up to 13kW.Available for customers. Please see front desk.",
    "StatusTypeID": 50,
    "DateLastStatusUpdate": "2019-07-30T09:33:00Z",
    "DataQualityLevel": 1,
    "DateCreated": "2019-07-30T09:33:00Z",
    "SubmissionStatusTypeID": 200
}