{
    "IsRecentlyVerified": false,
    "ID": 159881,
    "UUID": "FC07D4D4-013E-4003-A97C-C9B339A87168",
    "DataProviderID": 2,
    "DataProvidersReference": "151762",
    "OperatorID": 3293,
    "UsageTypeID": 1,
    "AddressInfo": {
        "ID": 160238,
        "Title": "Baker Hill",
        "AddressLine1": "836 Roosevelt Rd",
        "Town": "Glen Ellyn",
        "StateOrProvince": "IL",
        "Postcode": "60137",
        "CountryID": 2,
        "Latitude": 41.860438,
        "Longitude": -88.049038,
        "ContactTelephone1": "888-264-2208",
        "AccessComments": "6am-12am daily",
        "RelatedURL": "https://voltacharging.com/",
        "DistanceUnit": 0
    },
    "Connections": [
        {
            "ID": 230102,
            "ConnectionTypeID": 1,
            "LevelID": 2,
            "Amps": 16,
            "Voltage": 230,
            "PowerKW": 3.7,
            "CurrentTypeID": 10,
            "Quantity": 2
        }
    ],
    "StatusTypeID": 50,
    "DateLastStatusUpdate": "2020-06-26T03:05:00Z",
    "DataQualityLevel": 3,
    "DateCreated": "2020-06-26T03:05:00Z",
    "SubmissionStatusTypeID": 100
}