{
    "IsRecentlyVerified": false,
    "ID": 181417,
    "UUID": "D3065BB3-8E46-4225-9F2B-8EA9D17DF6D1",
    "DataProviderID": 29,
    "DataProvidersReference": "3546",
    "AddressInfo": {
        "ID": 181776,
        "Title": "Schaffhausenstraße 111",
        "AddressLine1": "Schaffhausenstraße 111",
        "Town": "Tübingen",
        "Postcode": "72072",
        "CountryID": 87,
        "Latitude": 48.518731,
        "Longitude": 9.080367,
        "DistanceUnit": 0
    },
    "Connections": [
        {
            "ID": 285713,
            "ConnectionTypeID": 33,
            "StatusTypeID": 50,
            "LevelID": 3,
            "PowerKW": 22,
            "CurrentTypeID": 30
        },
        {
            "ID": 285714,
            "ConnectionTypeID": 25,
            "StatusTypeID": 50,
            "LevelID": 2,
            "PowerKW": 11,
            "CurrentTypeID": 20
        },
        {
            "ID": 285715,
            "ConnectionTypeID": 25,
            "StatusTypeID": 50,
            "LevelID": 2,
            "PowerKW": 22,
            "CurrentTypeID": 20
        },
        {
            "ID": 285716,
            "ConnectionTypeID": 25,
            "StatusTypeID": 50,
            "LevelID": 2,
            "PowerKW": 22,
            "CurrentTypeID": 20
        }
    ],
    "StatusTypeID": 50,
    "DateLastStatusUpdate": "2021-07-12T02:41:00Z",
    "MetadataValues": [
        {
            "ID": 13711,
            "MetadataFieldID": 4,
            "ItemValue": "Data from the German chargepoint registry provided by Bundesnetzagentur.de under the CC-BY 4.0 license"
        }
    ],
    "DataQualityLevel": 3,
    "DateCreated": "2021-07-08T10:01:00Z",
    "SubmissionStatusTypeID": 100
}