{
    "IsRecentlyVerified": false,
    "ID": 100707,
    "UUID": "805E3D66-E4E9-4739-9FCA-24E1BF3B1F75",
    "DataProviderID": 1,
    "OperatorID": 3297,
    "UsageTypeID": 4,
    "AddressInfo": {
        "ID": 101053,
        "Title": "Müller Licht ",
        "AddressLine1": "Goebelstraße 61-65",
        "Town": "Lilienthal",
        "StateOrProvince": "Landkreis Osterholz",
        "Postcode": "28865",
        "CountryID": 87,
        "Latitude": 53.15977390875017,
        "Longitude": 8.919507161376941,
        "AccessComments": "24/7 nutzbar auf den letzten beiden Parkplätzen direkt vor dem Gebäude",
        "RelatedURL": "http://wwww.eon-drive.de/",
        "DistanceUnit": 0
    },
    "Connections": [
        {
            "ID": 142244,
            "ConnectionTypeID": 25,
            "StatusTypeID": 50,
            "LevelID": 2,
            "Amps": 32,
            "Voltage": 400,
            "PowerKW": 22,
            "CurrentTypeID": 20,
            "Quantity": 2
        }
    ],
    "NumberOfPoints": 2,
    "StatusTypeID": 50,
    "DateLastStatusUpdate": "2018-03-07T10:01:00Z",
    "DataQualityLevel": 1,
    "DateCreated": "2018-03-07T10:01:00Z",
    "SubmissionStatusTypeID": 200
}