{
    "IsRecentlyVerified": false,
    "ID": 79910,
    "UUID": "DBFF425C-BD23-43F4-AD95-04C65C2DD599",
    "DataProviderID": 1,
    "OperatorID": 23,
    "OperatorsReference": "19340",
    "UsageTypeID": 6,
    "UsageCost": "Free",
    "AddressInfo": {
        "ID": 80256,
        "Title": "Seven Stones Winery",
        "AddressLine1": "1143 Hwy 3",
        "Town": "Cawston",
        "StateOrProvince": "British Columbia",
        "Postcode": "V0X 1C3",
        "CountryID": 44,
        "Latitude": 49.09594,
        "Longitude": -119.713563,
        "ContactTelephone1": "(250) 499-2144",
        "DistanceUnit": 0
    },
    "Connections": [
        {
            "ID": 114559,
            "ConnectionTypeID": 30,
            "StatusTypeID": 50,
            "LevelID": 2,
            "PowerKW": 8,
            "CurrentTypeID": 10,
            "Quantity": 1
        }
    ],
    "NumberOfPoints": 1,
    "GeneralComments": "1 Tesla Connector, up to 8kW.Available for patrons only. Please call ahead.",
    "StatusTypeID": 50,
    "DateLastStatusUpdate": "2017-06-09T14:20:00Z",
    "DataQualityLevel": 1,
    "DateCreated": "2017-01-30T17:53:00Z",
    "SubmissionStatusTypeID": 200
}