{
    "IsRecentlyVerified": false,
    "ID": 71625,
    "UUID": "C3B27842-5E1A-4DBA-AAED-27EC2555B760",
    "DataProviderID": 2,
    "DataProvidersReference": "77443",
    "OperatorID": 5,
    "UsageTypeID": 1,
    "AddressInfo": {
        "ID": 71971,
        "Title": "THE SHOPS",
        "AddressLine1": "301 S Central Ave",
        "Town": "Quincy",
        "StateOrProvince": "WA",
        "Postcode": "98848",
        "CountryID": 2,
        "Latitude": 47.2351706,
        "Longitude": -119.8538094,
        "ContactTelephone1": "888-758-4389",
        "AccessComments": "24 hours daily",
        "RelatedURL": "http://www.chargepoint.com/",
        "DistanceUnit": 0
    },
    "Connections": [
        {
            "ID": 102453,
            "ConnectionTypeID": 1,
            "LevelID": 2,
            "Amps": 16,
            "Voltage": 230,
            "PowerKW": 3.7,
            "CurrentTypeID": 10,
            "Quantity": 2
        }
    ],
    "DateLastStatusUpdate": "2020-06-26T03:10:00Z",
    "DataQualityLevel": 3,
    "DateCreated": "2016-09-02T10:15:00Z",
    "SubmissionStatusTypeID": 100
}