{
    "IsRecentlyVerified": false,
    "ID": 134837,
    "UUID": "C2E269D4-1144-457B-81AB-B9ED2EA5AEE8",
    "DataProviderID": 1,
    "OperatorID": 38,
    "UsageTypeID": 1,
    "AddressInfo": {
        "ID": 135183,
        "Title": "Lidl Velika Gorica",
        "AddressLine1": "Ulica kneza Ljudevita Posavskog",
        "AddressLine2": "Podbrežnica",
        "Town": "Zagrebačka županija",
        "StateOrProvince": "Zagrebačka županija",
        "Postcode": "10410",
        "CountryID": 60,
        "Latitude": 45.72033888074279,
        "Longitude": 16.05360917763005,
        "AccessComments": "Lidl opening hours only.",
        "DistanceUnit": 0
    },
    "Connections": [
        {
            "ID": 188653,
            "ConnectionTypeID": 33,
            "StatusTypeID": 50,
            "LevelID": 3,
            "PowerKW": 50,
            "CurrentTypeID": 30,
            "Quantity": 1
        },
        {
            "ID": 188654,
            "ConnectionTypeID": 2,
            "StatusTypeID": 50,
            "LevelID": 3,
            "PowerKW": 50,
            "CurrentTypeID": 30,
            "Quantity": 1
        },
        {
            "ID": 188766,
            "ConnectionTypeID": 1036,
            "StatusTypeID": 50,
            "LevelID": 2,
            "Amps": 63,
            "Voltage": 400,
            "PowerKW": 43,
            "CurrentTypeID": 10,
            "Quantity": 1
        }
    ],
    "NumberOfPoints": 1,
    "GeneralComments": "Free Plug & Charge for LIDL customers",
    "StatusTypeID": 50,
    "DateLastStatusUpdate": "2019-12-01T09:29:00Z",
    "DataQualityLevel": 1,
    "DateCreated": "2019-11-25T09:47:00Z",
    "SubmissionStatusTypeID": 200
}