{
    "IsRecentlyVerified": false,
    "ID": 130058,
    "UUID": "CAF10B60-7BC2-46F6-89E9-E491286ADB55",
    "DataProviderID": 1,
    "OperatorID": 3299,
    "UsageTypeID": 5,
    "UsageCost": "€8,00/session",
    "AddressInfo": {
        "ID": 130404,
        "Title": "IONITY Riedener Wald Ost",
        "AddressLine1": "Rastanlage Riedener Wald Ost, A7, 97262 Hausen bei Würzburg, Deutschland",
        "Town": "Hausen bei Würzburg",
        "Postcode": "97262",
        "CountryID": 87,
        "Latitude": 49.944184,
        "Longitude": 10.019955,
        "DistanceUnit": 0
    },
    "Connections": [
        {
            "ID": 182049,
            "ConnectionTypeID": 33,
            "StatusTypeID": 50,
            "LevelID": 3,
            "PowerKW": 350,
            "CurrentTypeID": 30,
            "Quantity": 4
        }
    ],
    "NumberOfPoints": 4,
    "StatusTypeID": 50,
    "DateLastStatusUpdate": "2019-08-01T21:44:00Z",
    "DataQualityLevel": 1,
    "DateCreated": "2019-07-30T13:03:00Z",
    "SubmissionStatusTypeID": 200
}