{
    "UserComments": [
        {
            "ID": 19693,
            "ChargePointID": 100627,
            "CommentTypeID": 10,
            "UserName": "Nero",
            "Comment": "24/7",
            "Rating": 5,
            "DateCreated": "2018-06-20T17:54:44.473Z",
            "User": {
                "ID": 11655,
                "Username": "Nero"
            },
            "CheckinStatusTypeID": 10
        }
    ],
    "MediaItems": [
        {
            "ID": 15708,
            "ChargePointID": 100627,
            "ItemURL": "https://s3-ap-southeast-2.amazonaws.com/openchargemap/images/GB/OCM100627/OCM-100627.orig.2018062017554230.jpg",
            "ItemThumbnailURL": "https://s3-ap-southeast-2.amazonaws.com/openchargemap/images/GB/OCM100627/OCM-100627.thmb.2018062017554230.jpg",
            "Comment": "",
            "IsEnabled": true,
            "IsVideo": false,
            "IsFeaturedItem": false,
            "IsExternalResource": false,
            "User": {
                "ID": 11655,
                "Username": "Nero"
            },
            "DateCreated": "2018-06-20T17:56:00Z"
        }
    ],
    "IsRecentlyVerified": false,
    "ID": 100627,
    "UUID": "ED9E05FA-D2F5-4B3D-B077-19AAAF7EF93B",
    "DataProviderID": 1,
    "OperatorID": 3,
    "OperatorsReference": "t53_it1_0418_037",
    "UsageTypeID": 4,
    "UsageCost": "£0.25/kWh",
    "AddressInfo": {
        "ID": 100973,
        "Title": "Lidl-Garforth",
        "AddressLine1": "Aberford Road",
        "Town": "Leeds",
        "Postcode": "LS25 2JY",
        "CountryID": 1,
        "Latitude": 53.79762,
        "Longitude": -1.379818,
        "DistanceUnit": 0
    },
    "Connections": [
        {
            "ID": 142136,
            "ConnectionTypeID": 2,
            "StatusTypeID": 50,
            "LevelID": 3,
            "Amps": 125,
            "Voltage": 500,
            "PowerKW": 50,
            "CurrentTypeID": 30,
            "Quantity": 1
        },
        {
            "ID": 142137,
            "ConnectionTypeID": 1036,
            "StatusTypeID": 50,
            "LevelID": 3,
            "Amps": 63,
            "Voltage": 400,
            "PowerKW": 43,
            "CurrentTypeID": 20,
            "Quantity": 1
        },
        {
            "ID": 142279,
            "ConnectionTypeID": 33,
            "StatusTypeID": 50,
            "LevelID": 3,
            "Amps": 125,
            "Voltage": 500,
            "PowerKW": 50,
            "CurrentTypeID": 30,
            "Quantity": 1
        },
        {
            "ID": 176692,
            "ConnectionTypeID": 1036,
            "StatusTypeID": 50,
            "LevelID": 3,
            "PowerKW": 43,
            "CurrentTypeID": 20,
            "Quantity": 1
        }
    ],
    "NumberOfPoints": 6,
    "GeneralComments": "This is a POD Point rapid charge unit installed at the Lidl superstore in Aberford Road, Garforth",
    "StatusTypeID": 50,
    "DateLastStatusUpdate": "2021-03-22T19:38:00Z",
    "DataQualityLevel": 1,
    "DateCreated": "2018-03-03T06:33:00Z",
    "SubmissionStatusTypeID": 200
}