{
    "IsRecentlyVerified": false,
    "ID": 114106,
    "UUID": "DF1BF841-4B99-40A3-873B-89A56E4D03F2",
    "DataProviderID": 1,
    "OperatorID": 23,
    "OperatorsReference": "46872",
    "UsageTypeID": 4,
    "AddressInfo": {
        "ID": 114452,
        "Title": "Pool House",
        "AddressLine1": "A832",
        "AddressLine2": "Poolewe",
        "Town": "Wester Ross",
        "Postcode": "IV22 2LD",
        "CountryID": 1,
        "Latitude": 57.766515,
        "Longitude": -5.602653,
        "ContactTelephone1": "+44 144 578 1272",
        "DistanceUnit": 0
    },
    "Connections": [
        {
            "ID": 160676,
            "ConnectionTypeID": 30,
            "StatusTypeID": 50,
            "LevelID": 2,
            "PowerKW": 5,
            "CurrentTypeID": 10,
            "Quantity": 2
        }
    ],
    "NumberOfPoints": 2,
    "GeneralComments": "2 Tesla Connectors, up to 5kW.Available for customers. Self park.",
    "StatusTypeID": 50,
    "DateLastStatusUpdate": "2019-01-03T08:51:00Z",
    "DataQualityLevel": 1,
    "DateCreated": "2019-01-03T07:53:00Z",
    "SubmissionStatusTypeID": 200
}