{
    "IsRecentlyVerified": false,
    "ID": 33219,
    "UUID": "B97ACAF1-D8F1-4E02-BC47-F367E29CF9D7",
    "DataProviderID": 26,
    "DataProvidersReference": "47651",
    "OperatorID": 178,
    "OperatorsReference": "EVnetNL AL802",
    "UsageCost": "0.00 jaarabonnement",
    "AddressInfo": {
        "ID": 33565,
        "Title": "Nerhoven",
        "AddressLine1": "Nerhoven",
        "Town": "Gilze en Rijen",
        "Postcode": "5126 TN",
        "CountryID": 159,
        "Latitude": 51.552735,
        "Longitude": 4.945841,
        "ContactTelephone1": "0800-3522365",
        "RelatedURL": "http://www.evnet.nl",
        "DistanceUnit": 0
    },
    "Connections": [
        {
            "ID": 36730,
            "ConnectionTypeID": 25,
            "LevelID": 2,
            "PowerKW": 11,
            "CurrentTypeID": 10
        }
    ],
    "NumberOfPoints": 2,
    "StatusTypeID": 50,
    "DateLastStatusUpdate": "2016-06-04T02:39:00Z",
    "DataQualityLevel": 3,
    "DateCreated": "2015-01-09T06:04:00Z",
    "SubmissionStatusTypeID": 100
}