{
    "IsRecentlyVerified": false,
    "ID": 37225,
    "UUID": "3747C98C-F9E4-4311-A25E-7CE545A49B6D",
    "DataProviderID": 26,
    "DataProvidersReference": "47542",
    "OperatorID": 178,
    "OperatorsReference": "EVnetNL AL694",
    "UsageCost": "0.00 jaarabonnement",
    "AddressInfo": {
        "ID": 37571,
        "Title": "Havenhoofd 104",
        "AddressLine1": "Havenhoofd 104",
        "Town": "Almere",
        "Postcode": "1353 PM",
        "CountryID": 159,
        "Latitude": 52.332765,
        "Longitude": 5.218263,
        "ContactTelephone1": "0800-3522365",
        "RelatedURL": "http://www.evnet.nl",
        "DistanceUnit": 0
    },
    "Connections": [
        {
            "ID": 40736,
            "ConnectionTypeID": 25,
            "LevelID": 2,
            "PowerKW": 11,
            "CurrentTypeID": 10
        }
    ],
    "NumberOfPoints": 2,
    "StatusTypeID": 50,
    "DateLastStatusUpdate": "2016-06-04T02:53:00Z",
    "DataQualityLevel": 3,
    "DateCreated": "2015-01-09T06:07:00Z",
    "SubmissionStatusTypeID": 100
}