{
    "IsRecentlyVerified": false,
    "ID": 115516,
    "UUID": "341AC091-4307-422A-BAA0-B74BEE1EE445",
    "DataProviderID": 2,
    "DataProvidersReference": "114697",
    "OperatorID": 23,
    "UsageTypeID": 1,
    "AddressInfo": {
        "ID": 115862,
        "Title": "Carolina Colours Town Centre - Tesla Destination",
        "AddressLine1": "2032 Waterscape Wy",
        "Town": "New Bern",
        "StateOrProvince": "NC",
        "Postcode": "28562",
        "CountryID": 2,
        "Latitude": 35.035162,
        "Longitude": -77.011142,
        "ContactTelephone1": "910-239-5580  877-798-3752",
        "AccessComments": "24 hours daily; for Tesla use only",
        "RelatedURL": "https://www.tesla.com/destination-charging",
        "DistanceUnit": 0
    },
    "Connections": [
        {
            "ID": 162532,
            "ConnectionTypeID": 0,
            "LevelID": 2,
            "Amps": 16,
            "Voltage": 230,
            "PowerKW": 3,
            "CurrentTypeID": 10,
            "Quantity": 2
        }
    ],
    "DateLastStatusUpdate": "2019-04-06T04:02:00Z",
    "DataQualityLevel": 3,
    "DateCreated": "2019-02-11T07:13:00Z",
    "SubmissionStatusTypeID": 100
}