{
    "IsRecentlyVerified": false,
    "ID": 182659,
    "UUID": "5BCEA26D-488F-41A1-AFBD-3899BB4BD0A5",
    "DataProviderID": 29,
    "DataProvidersReference": "16131",
    "OperatorID": 127,
    "AddressInfo": {
        "ID": 183018,
        "Title": "An der Autobahn 7",
        "AddressLine1": "An der Autobahn 7",
        "Town": "Neustadt Glewe",
        "Postcode": "19306",
        "CountryID": 87,
        "Latitude": 53.380506180575,
        "Longitude": 11.628234386444,
        "DistanceUnit": 0
    },
    "Connections": [
        {
            "ID": 288674,
            "ConnectionTypeID": 1036,
            "StatusTypeID": 50,
            "LevelID": 3,
            "PowerKW": 43,
            "CurrentTypeID": 20
        },
        {
            "ID": 288675,
            "ConnectionTypeID": 33,
            "StatusTypeID": 50,
            "LevelID": 3,
            "PowerKW": 50,
            "CurrentTypeID": 30
        },
        {
            "ID": 301273,
            "ConnectionTypeID": 2,
            "StatusTypeID": 50,
            "LevelID": 3,
            "PowerKW": 50,
            "CurrentTypeID": 30
        }
    ],
    "StatusTypeID": 50,
    "DateLastStatusUpdate": "2021-07-12T02:51:00Z",
    "MetadataValues": [
        {
            "ID": 14952,
            "MetadataFieldID": 4,
            "ItemValue": "Data from the German chargepoint registry provided by Bundesnetzagentur.de under the CC-BY 4.0 license"
        }
    ],
    "DataQualityLevel": 3,
    "DateCreated": "2021-07-08T10:03:00Z",
    "SubmissionStatusTypeID": 100
}