{
    "UserComments": [
        {
            "ID": 23098,
            "ChargePointID": 5528,
            "CommentTypeID": 1000,
            "UserName": "Debc",
            "Comment": "No power to unit",
            "DateCreated": "2020-08-17T14:13:37.71Z",
            "User": {
                "ID": 23557,
                "Username": "Debc"
            },
            "CheckinStatusTypeID": 20,
            "IsActionedByEditor": false
        }
    ],
    "IsRecentlyVerified": false,
    "ID": 5528,
    "UUID": "B99CD466-C784-4DEA-9A1B-ED3F10D4823C",
    "DataProviderID": 1,
    "OperatorID": 1,
    "UsageTypeID": 1,
    "AddressInfo": {
        "ID": 5466,
        "Title": "Temple Row",
        "Town": "Birmingham",
        "StateOrProvince": "West Midlands",
        "Postcode": "B2 5NY",
        "CountryID": 1,
        "Latitude": 52.4807294,
        "Longitude": -1.9000957,
        "ContactTelephone1": "02476 183180",
        "RelatedURL": "http://cabled.org.uk/charging-locations/",
        "DistanceUnit": 0
    },
    "Connections": [],
    "NumberOfPoints": 1,
    "StatusTypeID": 50,
    "DateLastStatusUpdate": "2020-08-17T14:14:00Z",
    "DateCreated": "2011-08-29T11:42:00Z",
    "SubmissionStatusTypeID": 200
}