{
    "IsRecentlyVerified": false,
    "ID": 178051,
    "UUID": "AA45306F-2AD2-4F37-84BA-1FD722BEC322",
    "DataProviderID": 29,
    "DataProvidersReference": "11996",
    "AddressInfo": {
        "ID": 178410,
        "Title": "Hoffmannstr. 11",
        "AddressLine1": "Hoffmannstr. 11",
        "Town": "Bad Salzuflen",
        "Postcode": "32105",
        "CountryID": 87,
        "Latitude": 52.078204,
        "Longitude": 8.751014,
        "DistanceUnit": 0
    },
    "Connections": [
        {
            "ID": 277967,
            "ConnectionTypeID": 25,
            "StatusTypeID": 50,
            "LevelID": 2,
            "PowerKW": 22,
            "CurrentTypeID": 20
        },
        {
            "ID": 277968,
            "ConnectionTypeID": 25,
            "StatusTypeID": 50,
            "LevelID": 2,
            "PowerKW": 22,
            "CurrentTypeID": 20
        }
    ],
    "StatusTypeID": 0,
    "DateLastStatusUpdate": "2021-07-12T02:48:00Z",
    "MetadataValues": [
        {
            "ID": 10345,
            "MetadataFieldID": 4,
            "ItemValue": "Data from the German chargepoint registry provided by Bundesnetzagentur.de under the CC-BY 4.0 license"
        }
    ],
    "DataQualityLevel": 3,
    "DateCreated": "2021-07-08T09:49:00Z",
    "SubmissionStatusTypeID": 100
}