{
    "IsRecentlyVerified": false,
    "ID": 187083,
    "UUID": "DA8ACE4B-D8B8-4F03-B5A8-BF6E1E936D7C",
    "DataProviderID": 29,
    "DataProvidersReference": "5845",
    "OperatorID": 124,
    "AddressInfo": {
        "ID": 187442,
        "Title": "An der Ihle 22",
        "AddressLine1": "An der Ihle 22",
        "Town": "Ritterhude",
        "Postcode": "27721",
        "CountryID": 87,
        "Latitude": 53.181143,
        "Longitude": 8.712411,
        "DistanceUnit": 0
    },
    "Connections": [
        {
            "ID": 301173,
            "ConnectionTypeID": 25,
            "StatusTypeID": 50,
            "LevelID": 2,
            "PowerKW": 22,
            "CurrentTypeID": 20
        },
        {
            "ID": 301174,
            "ConnectionTypeID": 25,
            "StatusTypeID": 50,
            "LevelID": 2,
            "PowerKW": 22,
            "CurrentTypeID": 20
        }
    ],
    "StatusTypeID": 50,
    "DateLastStatusUpdate": "2021-07-12T02:50:00Z",
    "MetadataValues": [
        {
            "ID": 19323,
            "MetadataFieldID": 4,
            "ItemValue": "Data from the German chargepoint registry provided by Bundesnetzagentur.de under the CC-BY 4.0 license"
        }
    ],
    "DataQualityLevel": 3,
    "DateCreated": "2021-07-12T02:50:00Z",
    "SubmissionStatusTypeID": 100
}