{
    "IsRecentlyVerified": false,
    "ID": 182437,
    "UUID": "4B8549D2-9D00-45FF-8EC9-DBC04121A4F1",
    "DataProviderID": 29,
    "DataProvidersReference": "12984",
    "AddressInfo": {
        "ID": 182796,
        "Title": "Friedenstraße",
        "AddressLine1": "Friedenstraße",
        "Town": "Meerbusch",
        "Postcode": "40667",
        "CountryID": 87,
        "Latitude": 51.25505,
        "Longitude": 6.68854,
        "DistanceUnit": 0
    },
    "Connections": [
        {
            "ID": 288185,
            "ConnectionTypeID": 25,
            "StatusTypeID": 50,
            "LevelID": 2,
            "PowerKW": 22,
            "CurrentTypeID": 20
        },
        {
            "ID": 288186,
            "ConnectionTypeID": 25,
            "StatusTypeID": 50,
            "LevelID": 2,
            "PowerKW": 22,
            "CurrentTypeID": 20
        }
    ],
    "StatusTypeID": 50,
    "DateLastStatusUpdate": "2021-07-09T03:22:00Z",
    "MetadataValues": [
        {
            "ID": 14730,
            "MetadataFieldID": 4,
            "ItemValue": "Data from the German chargepoint registry provided by Bundesnetzagentur.de under the CC-BY 4.0 license"
        }
    ],
    "DataQualityLevel": 3,
    "DateCreated": "2021-07-08T10:03:00Z",
    "SubmissionStatusTypeID": 100
}