{
    "IsRecentlyVerified": false,
    "ID": 131920,
    "UUID": "AAA2D2CD-41E7-4D00-8ECA-42E8B8D81F61",
    "DataProviderID": 1,
    "OperatorID": 23,
    "OperatorsReference": "51824",
    "UsageTypeID": 4,
    "AddressInfo": {
        "ID": 132266,
        "Title": "Ferienwohnungen Chateau Leukerbad",
        "AddressLine1": "Lichtenstrasse 48",
        "Town": "Leukerbad",
        "Postcode": "3954",
        "CountryID": 217,
        "Latitude": 46.382225,
        "Longitude": 7.624764,
        "ContactTelephone1": "+41 7860 21627",
        "DistanceUnit": 0
    },
    "Connections": [
        {
            "ID": 184596,
            "ConnectionTypeID": 30,
            "StatusTypeID": 50,
            "LevelID": 2,
            "PowerKW": 11,
            "CurrentTypeID": 20,
            "Quantity": 1
        }
    ],
    "NumberOfPoints": 1,
    "GeneralComments": "1 Tesla Connector, up to 11kW.Available for customers. Please call ahead.",
    "StatusTypeID": 50,
    "DateLastStatusUpdate": "2019-09-16T05:29:00Z",
    "DataQualityLevel": 1,
    "DateCreated": "2019-09-16T05:29:00Z",
    "SubmissionStatusTypeID": 200
}