{
    "IsRecentlyVerified": false,
    "ID": 73615,
    "UUID": "42665562-3924-4AA5-AEF8-6F9C57C1795D",
    "DataProviderID": 1,
    "OperatorID": 89,
    "OperatorsReference": "CEA-121",
    "UsageTypeID": 4,
    "UsageCost": "CAD 1.00/hour",
    "AddressInfo": {
        "ID": 73961,
        "Title": "St-Hubert-Shawinigan",
        "AddressLine1": "1515 rue Trudel",
        "Town": "Shawinigan",
        "StateOrProvince": "QC",
        "Postcode": "G9N 8K8",
        "CountryID": 44,
        "Latitude": 46.555585,
        "Longitude": -72.74978,
        "DistanceUnit": 0
    },
    "Connections": [
        {
            "ID": 105908,
            "ConnectionTypeID": 1,
            "StatusTypeID": 50,
            "LevelID": 2,
            "Amps": 32,
            "Voltage": 230,
            "PowerKW": 7,
            "CurrentTypeID": 10,
            "Quantity": 1
        }
    ],
    "NumberOfPoints": 1,
    "StatusTypeID": 50,
    "DateLastStatusUpdate": "2017-03-08T19:59:00Z",
    "DataQualityLevel": 1,
    "DateCreated": "2016-11-23T22:25:00Z",
    "SubmissionStatusTypeID": 200
}