{
    "IsRecentlyVerified": false,
    "ID": 94868,
    "UUID": "3CF373B3-8A8A-4ADE-B468-0B92BF6CDC70",
    "DataProviderID": 1,
    "DataProvidersReference": "4375",
    "AddressInfo": {
        "ID": 95214,
        "Title": "Burlöv Medborgarhus",
        "AddressLine1": "Kärleksgatan 8",
        "Town": "ARLÖV",
        "StateOrProvince": "SKÅNE",
        "Postcode": "23234",
        "CountryID": 216,
        "Latitude": 55.63388,
        "Longitude": 13.07054,
        "AccessComments": "Den stora besöksparkeringen plus p-platser för de anställda vid Medborgarhuset",
        "DistanceUnit": 0
    },
    "Connections": [
        {
            "ID": 134104,
            "ConnectionTypeID": 0,
            "Reference": "1",
            "LevelID": 2,
            "Amps": 32,
            "Voltage": 400,
            "PowerKW": 22,
            "Comments": "Mode 3"
        },
        {
            "ID": 134105,
            "ConnectionTypeID": 0,
            "Reference": "2",
            "LevelID": 2,
            "Amps": 32,
            "Voltage": 400,
            "PowerKW": 22,
            "Comments": "Mode 3"
        }
    ],
    "NumberOfPoints": 2,
    "DateLastStatusUpdate": "2020-05-26T08:21:00Z",
    "DataQualityLevel": 2,
    "DateCreated": "2017-10-28T13:36:00Z",
    "SubmissionStatusTypeID": 100
}