{
    "MediaItems": [
        {
            "ID": 8616,
            "ChargePointID": 73348,
            "ItemURL": "https://s3-ap-southeast-2.amazonaws.com/openchargemap/images/CA/OCM73348/OCM-73348.orig.2016112108033597.jpg",
            "ItemThumbnailURL": "https://s3-ap-southeast-2.amazonaws.com/openchargemap/images/CA/OCM73348/OCM-73348.thmb.2016112108033597.jpg",
            "Comment": "",
            "IsEnabled": true,
            "IsVideo": false,
            "IsFeaturedItem": false,
            "IsExternalResource": false,
            "User": {
                "ID": 12040,
                "Username": "adaviel"
            },
            "DateCreated": "2016-11-21T08:04:00Z"
        }
    ],
    "IsRecentlyVerified": false,
    "ID": 73348,
    "UUID": "21DAEEBA-3A23-4AEC-9AA7-C307F9B6553D",
    "DataProviderID": 1,
    "OperatorID": 5,
    "UsageTypeID": 0,
    "AddressInfo": {
        "ID": 73694,
        "Title": "Richmond Public Works Yard",
        "AddressLine1": "5599 Lynas Lane ",
        "Town": "Richmond",
        "StateOrProvince": "BC",
        "Postcode": " V7C B52",
        "CountryID": 44,
        "Latitude": 49.170927,
        "Longitude": -123.165711,
        "ContactTelephone1": " (604) 270-8721",
        "DistanceUnit": 0
    },
    "Connections": [
        {
            "ID": 105543,
            "ConnectionTypeID": 1,
            "StatusTypeID": 50,
            "LevelID": 2,
            "CurrentTypeID": 10,
            "Quantity": 2
        }
    ],
    "NumberOfPoints": 1,
    "StatusTypeID": 50,
    "DateLastStatusUpdate": "2016-11-21T17:17:00Z",
    "DataQualityLevel": 1,
    "DateCreated": "2016-11-21T08:03:00Z",
    "SubmissionStatusTypeID": 200
}