{
    "IsRecentlyVerified": false,
    "ID": 84413,
    "UUID": "4B4AEA2F-55F2-4D85-A221-B9E30FAB7257",
    "DataProviderID": 1,
    "OperatorID": 103,
    "UsageTypeID": 4,
    "UsageCost": "0",
    "AddressInfo": {
        "ID": 84759,
        "Title": "Total Autohof ",
        "AddressLine1": "Eythstraße 16a",
        "Town": "Vöhringen",
        "StateOrProvince": "Verwaltungsgemeinschaft Sulz am Neckar",
        "Postcode": "72189",
        "CountryID": 87,
        "Latitude": 48.3434696702907,
        "Longitude": 8.663494576721176,
        "AccessComments": "24/7 nutzbar",
        "DistanceUnit": 0
    },
    "Connections": [
        {
            "ID": 119859,
            "ConnectionTypeID": 2,
            "StatusTypeID": 50,
            "LevelID": 3,
            "PowerKW": 50,
            "CurrentTypeID": 30,
            "Quantity": 1
        },
        {
            "ID": 119860,
            "ConnectionTypeID": 33,
            "StatusTypeID": 50,
            "LevelID": 3,
            "PowerKW": 50,
            "CurrentTypeID": 30,
            "Quantity": 1
        },
        {
            "ID": 119861,
            "ConnectionTypeID": 1036,
            "StatusTypeID": 50,
            "LevelID": 3,
            "Amps": 63,
            "Voltage": 400,
            "PowerKW": 43,
            "CurrentTypeID": 20,
            "Quantity": 1
        },
        {
            "ID": 119862,
            "ConnectionTypeID": 25,
            "StatusTypeID": 50,
            "LevelID": 2,
            "Amps": 32,
            "Voltage": 400,
            "PowerKW": 22,
            "CurrentTypeID": 20,
            "Quantity": 1
        }
    ],
    "NumberOfPoints": 4,
    "StatusTypeID": 50,
    "DateLastStatusUpdate": "2017-02-24T06:47:00Z",
    "DataQualityLevel": 1,
    "DateCreated": "2017-02-24T06:47:00Z",
    "SubmissionStatusTypeID": 200
}