{
    "IsRecentlyVerified": false,
    "ID": 165227,
    "UUID": "46CBF445-C9F3-468B-BFE5-7BFB9D90BCBE",
    "DataProviderID": 1,
    "DataProvidersReference": "TR-IST-073",
    "OperatorID": 70,
    "UsageTypeID": 1,
    "AddressInfo": {
        "ID": 165586,
        "Title": "Eşarj - Borusan Oto (JLR), Avcılar",
        "AddressLine1": "Firuzköy Bulvarı, No:21, Avcılar",
        "Town": "İstanbul",
        "StateOrProvince": "İstanbul",
        "Postcode": "34320",
        "CountryID": 229,
        "Latitude": 40.993031,
        "Longitude": 28.716864,
        "ContactTelephone1": "+90 (850) 433 72 75",
        "ContactEmail": "destek@esarj.com",
        "RelatedURL": "https://esarj.com/en/map?s=TR-IST-073",
        "DistanceUnit": 0
    },
    "Connections": [
        {
            "ID": 236890,
            "ConnectionTypeID": 25,
            "LevelID": 2,
            "Amps": 32,
            "Voltage": 220,
            "PowerKW": 7.4,
            "Quantity": 1
        }
    ],
    "GeneralComments": "Eşarj Charging Systems",
    "StatusTypeID": 50,
    "DateLastStatusUpdate": "2020-08-26T08:19:00Z",
    "DataQualityLevel": 3,
    "DateCreated": "2020-08-26T08:19:00Z",
    "SubmissionStatusTypeID": 200
}