{
    "IsRecentlyVerified": false,
    "ID": 148538,
    "UUID": "34EA732C-0A9D-4736-A1B3-7D2007B0628D",
    "DataProviderID": 1,
    "OperatorID": 3315,
    "OperatorsReference": "52050,52051",
    "UsageTypeID": 4,
    "UsageCost": "Free",
    "AddressInfo": {
        "ID": 148890,
        "Title": "Garrison Place (West) Car Park, Falkirk",
        "AddressLine1": "Garrison Place (West) Car Park",
        "Town": "Garrison Place",
        "StateOrProvince": "Falkirk",
        "Postcode": "FK1 1HU",
        "CountryID": 1,
        "Latitude": 56.002248,
        "Longitude": -3.786612,
        "DistanceUnit": 0
    },
    "Connections": [
        {
            "ID": 206267,
            "ConnectionTypeID": 25,
            "StatusTypeID": 50,
            "LevelID": 2,
            "Amps": 32,
            "Voltage": 230,
            "PowerKW": 7,
            "CurrentTypeID": 10,
            "Quantity": 2
        },
        {
            "ID": 206287,
            "ConnectionTypeID": 33,
            "StatusTypeID": 50,
            "LevelID": 3,
            "PowerKW": 50,
            "CurrentTypeID": 30,
            "Quantity": 1
        },
        {
            "ID": 206288,
            "ConnectionTypeID": 2,
            "StatusTypeID": 50,
            "LevelID": 3,
            "PowerKW": 50,
            "CurrentTypeID": 30,
            "Quantity": 1
        },
        {
            "ID": 206289,
            "ConnectionTypeID": 1036,
            "StatusTypeID": 50,
            "LevelID": 3,
            "PowerKW": 43,
            "CurrentTypeID": 20,
            "Quantity": 1
        }
    ],
    "NumberOfPoints": 2,
    "StatusTypeID": 50,
    "DateLastStatusUpdate": "2020-03-14T06:17:00Z",
    "DataQualityLevel": 1,
    "DateCreated": "2020-02-05T06:16:00Z",
    "SubmissionStatusTypeID": 200
}