{
    "IsRecentlyVerified": false,
    "ID": 159523,
    "UUID": "E4BADDB0-72D2-4E5C-9547-EFB40C145F6E",
    "DataProviderID": 2,
    "DataProvidersReference": "163608",
    "OperatorID": 5,
    "UsageTypeID": 1,
    "AddressInfo": {
        "ID": 159880,
        "Title": "MCE N GARAGE -2",
        "AddressLine1": "6005 E Broad St",
        "Town": "Columbus",
        "StateOrProvince": "OH",
        "Postcode": "43213",
        "CountryID": 2,
        "Latitude": 39.9783151,
        "Longitude": -82.8421823,
        "ContactTelephone1": "888-758-4389",
        "AccessComments": "24 hours daily",
        "RelatedURL": "http://www.chargepoint.com/",
        "DistanceUnit": 0
    },
    "Connections": [
        {
            "ID": 229713,
            "ConnectionTypeID": 1,
            "LevelID": 2,
            "Amps": 16,
            "Voltage": 230,
            "PowerKW": 3.7,
            "CurrentTypeID": 10,
            "Quantity": 2
        }
    ],
    "StatusTypeID": 50,
    "DateLastStatusUpdate": "2020-06-26T03:02:00Z",
    "DataQualityLevel": 3,
    "DateCreated": "2020-06-26T03:02:00Z",
    "SubmissionStatusTypeID": 100
}