{
    "IsRecentlyVerified": false,
    "ID": 175655,
    "UUID": "9E84FBF6-36A0-4D28-8C75-F277D785BF6C",
    "DataProviderID": 1,
    "OperatorID": 3453,
    "UsageTypeID": 1,
    "UsageCost": "1.19 PLN/kWh",
    "AddressInfo": {
        "ID": 176014,
        "Title": "Dworzec PKP Opole Główne",
        "AddressLine1": "Krakowska 50",
        "Town": "Opole",
        "StateOrProvince": "Opole Voivodeship",
        "Postcode": "45-071",
        "CountryID": 179,
        "Latitude": 50.662273,
        "Longitude": 17.927589,
        "DistanceUnit": 0
    },
    "Connections": [
        {
            "ID": 272747,
            "ConnectionTypeID": 25,
            "StatusTypeID": 50,
            "LevelID": 2,
            "PowerKW": 22,
            "CurrentTypeID": 20,
            "Quantity": 2
        }
    ],
    "NumberOfPoints": 2,
    "GeneralComments": "",
    "StatusTypeID": 50,
    "DateLastStatusUpdate": "2021-06-04T09:02:00Z",
    "DataQualityLevel": 1,
    "DateCreated": "2021-06-04T09:02:00Z",
    "SubmissionStatusTypeID": 200
}