{
    "IsRecentlyVerified": false,
    "ID": 135169,
    "UUID": "80EC8CB1-FE3C-4BC2-AADC-580EC6B5572B",
    "DataProviderID": 1,
    "OperatorID": 80,
    "UsageTypeID": 4,
    "AddressInfo": {
        "ID": 135515,
        "Title": "Cittadella Sportiva \"Sa Rodia\" Oristano | EnelX",
        "AddressLine1": "Viale Repubblica",
        "Town": "Oristano",
        "StateOrProvince": "OR",
        "Postcode": "09170",
        "CountryID": 112,
        "Latitude": 39.9060980433205,
        "Longitude": 8.57922913692812,
        "RelatedURL": "https://www.enelx.com/it/it/emobility",
        "DistanceUnit": 0
    },
    "Connections": [
        {
            "ID": 189211,
            "ConnectionTypeID": 25,
            "StatusTypeID": 50,
            "LevelID": 2,
            "Amps": 32,
            "Voltage": 400,
            "PowerKW": 22,
            "CurrentTypeID": 20,
            "Quantity": 4
        }
    ],
    "NumberOfPoints": 4,
    "StatusTypeID": 50,
    "DateLastStatusUpdate": "2019-12-09T16:45:00Z",
    "DataQualityLevel": 1,
    "DateCreated": "2019-12-09T16:45:00Z",
    "SubmissionStatusTypeID": 200
}