{
    "IsRecentlyVerified": false,
    "ID": 143850,
    "UUID": "A81BAAEE-FC61-40D2-B1C2-5152D6DB9516",
    "DataProviderID": 2,
    "DataProvidersReference": "123109",
    "OperatorID": 3372,
    "UsageTypeID": 1,
    "AddressInfo": {
        "ID": 144202,
        "Title": "Town of DeKalb",
        "AddressLine1": "4343 US Highway 11",
        "Town": "DeKalb Junction",
        "StateOrProvince": "NY",
        "Postcode": "13630",
        "CountryID": 2,
        "Latitude": 44.505435,
        "Longitude": -75.2738473,
        "ContactTelephone1": "866-816-7584",
        "AccessComments": "24 hours daily",
        "RelatedURL": "http://evconnect.com/",
        "DistanceUnit": 0
    },
    "Connections": [
        {
            "ID": 200257,
            "ConnectionTypeID": 1,
            "LevelID": 2,
            "Amps": 16,
            "Voltage": 230,
            "PowerKW": 3.7,
            "CurrentTypeID": 10,
            "Quantity": 2
        }
    ],
    "StatusTypeID": 50,
    "DateLastStatusUpdate": "2020-06-26T03:08:00Z",
    "DataQualityLevel": 3,
    "DateCreated": "2019-12-24T09:22:00Z",
    "SubmissionStatusTypeID": 100
}