{
    "IsRecentlyVerified": false,
    "ID": 179218,
    "UUID": "2C80932D-A23F-46C9-A66B-9F4772B7EE3D",
    "DataProviderID": 29,
    "DataProvidersReference": "3638",
    "AddressInfo": {
        "ID": 179577,
        "Title": "Theaterplatz 6",
        "AddressLine1": "Theaterplatz 6",
        "Town": "Aachen",
        "Postcode": "52062",
        "CountryID": 87,
        "Latitude": 50.772294,
        "Longitude": 6.087023,
        "DistanceUnit": 0
    },
    "Connections": [
        {
            "ID": 280730,
            "ConnectionTypeID": 28,
            "StatusTypeID": 50,
            "LevelID": 2,
            "PowerKW": 22,
            "CurrentTypeID": 20
        },
        {
            "ID": 280731,
            "ConnectionTypeID": 25,
            "StatusTypeID": 50,
            "LevelID": 2,
            "PowerKW": 22,
            "CurrentTypeID": 20
        },
        {
            "ID": 298135,
            "ConnectionTypeID": 28,
            "StatusTypeID": 50,
            "LevelID": 2,
            "PowerKW": 22,
            "CurrentTypeID": 20
        },
        {
            "ID": 298136,
            "ConnectionTypeID": 25,
            "StatusTypeID": 50,
            "LevelID": 2,
            "PowerKW": 22,
            "CurrentTypeID": 20
        }
    ],
    "StatusTypeID": 50,
    "DateLastStatusUpdate": "2021-07-12T02:45:00Z",
    "MetadataValues": [
        {
            "ID": 11512,
            "MetadataFieldID": 4,
            "ItemValue": "Data from the German chargepoint registry provided by Bundesnetzagentur.de under the CC-BY 4.0 license"
        }
    ],
    "DataQualityLevel": 3,
    "DateCreated": "2021-07-08T09:59:00Z",
    "SubmissionStatusTypeID": 100
}