{
    "IsRecentlyVerified": false,
    "ID": 141336,
    "UUID": "3431EE81-E1EC-4F92-AE5F-8F33B8114ACE",
    "DataProviderID": 2,
    "DataProvidersReference": "150663",
    "OperatorID": 23,
    "UsageTypeID": 1,
    "AddressInfo": {
        "ID": 141688,
        "Title": "Manitou Springs Pool & Fitness Center Lot - Tesla Destination",
        "AddressLine1": "300 Garden of the Gods Pl",
        "Town": "Manitou Springs",
        "StateOrProvince": "CO",
        "Postcode": "80829",
        "CountryID": 2,
        "Latitude": 38.865999,
        "Longitude": -104.895788,
        "ContactTelephone1": "719-685-2601  877-798-3752",
        "AccessComments": "24 hours daily",
        "RelatedURL": "https://www.tesla.com/destination-charging",
        "DistanceUnit": 0
    },
    "Connections": [
        {
            "ID": 197249,
            "ConnectionTypeID": 30,
            "LevelID": 2,
            "Amps": 16,
            "Voltage": 230,
            "PowerKW": 3.7,
            "CurrentTypeID": 10,
            "Quantity": 5
        }
    ],
    "StatusTypeID": 50,
    "DateLastStatusUpdate": "2020-06-26T03:00:00Z",
    "DataQualityLevel": 3,
    "DateCreated": "2019-12-24T09:15:00Z",
    "SubmissionStatusTypeID": 100
}