{
    "IsRecentlyVerified": false,
    "ID": 156508,
    "UUID": "6CF649DB-FBBA-4453-8C69-BE982F00EA2B",
    "DataProviderID": 19,
    "DataProvidersReference": "6363",
    "AddressInfo": {
        "ID": 156862,
        "Title": "P-hus Erika Malmö",
        "AddressLine1": "Östra Varvsgatan 6A",
        "Town": "MALMÖ",
        "StateOrProvince": "SKÅNE",
        "Postcode": "20001",
        "CountryID": 216,
        "Latitude": 55.61319,
        "Longitude": 12.98585,
        "AccessComments": "",
        "DistanceUnit": 0
    },
    "Connections": [
        {
            "ID": 220337,
            "ConnectionTypeID": 25,
            "Reference": "1",
            "LevelID": 3,
            "Amps": 32,
            "Voltage": 400,
            "PowerKW": 22,
            "CurrentTypeID": 30,
            "Comments": "Mode 3"
        },
        {
            "ID": 220338,
            "ConnectionTypeID": 25,
            "Reference": "2",
            "LevelID": 3,
            "Amps": 32,
            "Voltage": 400,
            "PowerKW": 22,
            "CurrentTypeID": 30,
            "Comments": "Mode 3"
        },
        {
            "ID": 220339,
            "ConnectionTypeID": 25,
            "Reference": "3",
            "LevelID": 3,
            "Amps": 32,
            "Voltage": 400,
            "PowerKW": 22,
            "CurrentTypeID": 30,
            "Comments": "Mode 3"
        },
        {
            "ID": 220340,
            "ConnectionTypeID": 25,
            "Reference": "4",
            "LevelID": 3,
            "Amps": 32,
            "Voltage": 400,
            "PowerKW": 22,
            "CurrentTypeID": 30,
            "Comments": "Mode 3"
        },
        {
            "ID": 220341,
            "ConnectionTypeID": 25,
            "Reference": "5",
            "LevelID": 3,
            "Amps": 32,
            "Voltage": 400,
            "PowerKW": 22,
            "CurrentTypeID": 30,
            "Comments": "Mode 3"
        },
        {
            "ID": 220342,
            "ConnectionTypeID": 25,
            "Reference": "6",
            "LevelID": 3,
            "Amps": 32,
            "Voltage": 400,
            "PowerKW": 22,
            "CurrentTypeID": 30,
            "Comments": "Mode 3"
        },
        {
            "ID": 220343,
            "ConnectionTypeID": 25,
            "Reference": "7",
            "LevelID": 3,
            "Amps": 32,
            "Voltage": 400,
            "PowerKW": 22,
            "CurrentTypeID": 30,
            "Comments": "Mode 3"
        },
        {
            "ID": 220344,
            "ConnectionTypeID": 25,
            "Reference": "8",
            "LevelID": 3,
            "Amps": 32,
            "Voltage": 400,
            "PowerKW": 22,
            "CurrentTypeID": 30,
            "Comments": "Mode 3"
        },
        {
            "ID": 220345,
            "ConnectionTypeID": 25,
            "Reference": "9",
            "LevelID": 3,
            "Amps": 32,
            "Voltage": 400,
            "PowerKW": 22,
            "CurrentTypeID": 30,
            "Comments": "Mode 3"
        },
        {
            "ID": 220346,
            "ConnectionTypeID": 25,
            "Reference": "10",
            "LevelID": 3,
            "Amps": 32,
            "Voltage": 400,
            "PowerKW": 22,
            "CurrentTypeID": 30,
            "Comments": "Mode 3"
        }
    ],
    "NumberOfPoints": 10,
    "StatusTypeID": 0,
    "DateLastStatusUpdate": "2021-03-24T05:10:00Z",
    "DataQualityLevel": 2,
    "DateCreated": "2020-05-26T08:21:00Z",
    "SubmissionStatusTypeID": 100
}