{
    "IsRecentlyVerified": false,
    "ID": 138537,
    "UUID": "450760F6-B5DB-4CC7-9072-2690525A3694",
    "DataProviderID": 2,
    "DataProvidersReference": "144224",
    "OperatorID": 5,
    "UsageTypeID": 1,
    "AddressInfo": {
        "ID": 138886,
        "Title": "USA CHARGING",
        "AddressLine1": "5851 USA Dr N",
        "Town": "Mobile",
        "StateOrProvince": "AL",
        "Postcode": "36608",
        "CountryID": 2,
        "Latitude": 30.6979535,
        "Longitude": -88.1831651,
        "ContactTelephone1": "888-758-4389",
        "AccessComments": "24 hours daily",
        "RelatedURL": "http://www.chargepoint.com/",
        "DistanceUnit": 0
    },
    "Connections": [
        {
            "ID": 193676,
            "ConnectionTypeID": 1,
            "LevelID": 2,
            "Amps": 16,
            "Voltage": 230,
            "PowerKW": 3.7,
            "CurrentTypeID": 10,
            "Quantity": 2
        }
    ],
    "StatusTypeID": 50,
    "DateLastStatusUpdate": "2020-06-26T02:54:00Z",
    "DataQualityLevel": 3,
    "DateCreated": "2019-12-24T09:09:00Z",
    "SubmissionStatusTypeID": 100
}