{
    "IsRecentlyVerified": false,
    "ID": 173505,
    "UUID": "7FC76E80-BF8A-47F1-9648-CA1BF01E1E48",
    "DataProviderID": 18,
    "DataProvidersReference": "114e4ae7cbe5b1e5231cce68b53b0266",
    "OperatorID": 3345,
    "UsageTypeID": 5,
    "AddressInfo": {
        "ID": 173864,
        "Title": "SE15 2SW",
        "AddressLine1": "",
        "Town": "London",
        "Postcode": "SE15 2SW",
        "CountryID": 1,
        "Latitude": 51.472734,
        "Longitude": -0.06032,
        "AccessComments": "",
        "RelatedURL": "https://char.gy",
        "DistanceUnit": 0
    },
    "Connections": [
        {
            "ID": 266562,
            "ConnectionTypeID": 25,
            "Reference": "571",
            "StatusTypeID": 50,
            "LevelID": 2,
            "Amps": 16,
            "Voltage": 230,
            "PowerKW": 3.7,
            "CurrentTypeID": 10
        }
    ],
    "StatusTypeID": 0,
    "DateLastStatusUpdate": "2021-03-03T11:25:00Z",
    "MetadataValues": [
        {
            "ID": 8427,
            "MetadataFieldID": 4,
            "ItemValue": "Contains public sector information licensed under the Open Government Licence v2.0. http://www.nationalarchives.gov.uk/doc/open-government-licence/version/2/"
        }
    ],
    "DataQualityLevel": 3,
    "DateCreated": "2021-03-03T11:25:00Z",
    "SubmissionStatusTypeID": 100
}