{
    "IsRecentlyVerified": false,
    "ID": 84422,
    "UUID": "3F95AC8F-014A-4002-867B-F8D3F6F7CC73",
    "DataProviderID": 1,
    "OperatorID": 23,
    "OperatorsReference": "25219",
    "UsageTypeID": 4,
    "AddressInfo": {
        "ID": 84768,
        "Title": "Ipark 1510 Lex Garage Corp.",
        "AddressLine1": "116 E 98th St",
        "Town": "New York",
        "StateOrProvince": "New York",
        "Postcode": "10029",
        "CountryID": 2,
        "Latitude": 40.787402,
        "Longitude": -73.950546,
        "ContactTelephone1": "(212) 289-6257",
        "DistanceUnit": 0
    },
    "Connections": [
        {
            "ID": 119874,
            "ConnectionTypeID": 30,
            "StatusTypeID": 50,
            "LevelID": 2,
            "PowerKW": 16,
            "CurrentTypeID": 20,
            "Quantity": 3
        }
    ],
    "NumberOfPoints": 3,
    "GeneralComments": "3 Tesla Connectors, up to 16kW.Available to the public. Please see valet.",
    "StatusTypeID": 50,
    "DateLastStatusUpdate": "2017-02-25T06:37:00Z",
    "DataQualityLevel": 1,
    "DateCreated": "2017-02-25T06:37:00Z",
    "SubmissionStatusTypeID": 200
}