{
    "IsRecentlyVerified": false,
    "ID": 89700,
    "UUID": "0CBD0D6D-B6B4-447A-8E24-5B12B72EAE51",
    "DataProviderID": 2,
    "DataProvidersReference": "82676",
    "OperatorID": 5,
    "UsageTypeID": 1,
    "AddressInfo": {
        "ID": 90046,
        "Title": "SEAGLASS INN",
        "AddressLine1": "Oppen Lane",
        "Town": "Provincetown",
        "StateOrProvince": "MA",
        "Postcode": "02657",
        "CountryID": 2,
        "Latitude": 42.0420505,
        "Longitude": -70.1974411,
        "ContactTelephone1": "888-758-4389",
        "AccessComments": "24 hours daily",
        "RelatedURL": "http://www.chargepoint.com/",
        "DistanceUnit": 0
    },
    "Connections": [
        {
            "ID": 127130,
            "ConnectionTypeID": 1,
            "LevelID": 2,
            "Amps": 16,
            "Voltage": 230,
            "PowerKW": 3,
            "CurrentTypeID": 10,
            "Quantity": 4
        }
    ],
    "DateLastStatusUpdate": "2019-12-24T09:19:00Z",
    "DataQualityLevel": 3,
    "DateCreated": "2017-06-22T08:16:00Z",
    "SubmissionStatusTypeID": 100
}