{
    "UserComments": [
        {
            "ID": 23407,
            "ChargePointID": 112424,
            "CommentTypeID": 10,
            "UserName": "zedestel",
            "Comment": "",
            "DateCreated": "2020-10-20T20:11:51.343Z",
            "User": {
                "ID": 22207,
                "Username": "zedestel"
            },
            "CheckinStatusTypeID": 10,
            "IsActionedByEditor": false
        }
    ],
    "MediaItems": [
        {
            "ID": 25156,
            "ChargePointID": 112424,
            "ItemURL": "https://s3-ap-southeast-2.amazonaws.com/openchargemap/images/IT/OCM112424/OCM-112424.orig.2020102020114556.jpg",
            "ItemThumbnailURL": "https://s3-ap-southeast-2.amazonaws.com/openchargemap/images/IT/OCM112424/OCM-112424.thmb.2020102020114556.jpg",
            "Comment": "",
            "IsEnabled": true,
            "IsVideo": false,
            "IsFeaturedItem": false,
            "IsExternalResource": false,
            "User": {
                "ID": 22207,
                "Username": "zedestel"
            },
            "DateCreated": "2020-10-20T20:12:00Z"
        }
    ],
    "IsRecentlyVerified": false,
    "ID": 112424,
    "UUID": "52F6CEC4-6E5D-494A-8E11-E61906E4B18D",
    "DataProviderID": 1,
    "OperatorID": 80,
    "UsageTypeID": 4,
    "AddressInfo": {
        "ID": 112770,
        "Title": "Villa di Serio Locatelli | EnelX",
        "AddressLine1": "Via Locatelli",
        "Town": "Villa di Serio",
        "StateOrProvince": "BG",
        "Postcode": "24020 ",
        "CountryID": 112,
        "Latitude": 45.7225072680738,
        "Longitude": 9.73420775840509,
        "ContactTelephone1": "800.069.850",
        "RelatedURL": "https://www.enelx.com/it/it/emobility",
        "DistanceUnit": 0
    },
    "Connections": [
        {
            "ID": 158140,
            "ConnectionTypeID": 25,
            "StatusTypeID": 50,
            "LevelID": 2,
            "Amps": 32,
            "Voltage": 400,
            "PowerKW": 22,
            "CurrentTypeID": 20,
            "Quantity": 2
        }
    ],
    "NumberOfPoints": 2,
    "StatusTypeID": 50,
    "DateLastStatusUpdate": "2020-10-20T20:12:00Z",
    "DataQualityLevel": 1,
    "DateCreated": "2018-10-29T14:41:00Z",
    "SubmissionStatusTypeID": 200
}