{
    "IsRecentlyVerified": true,
    "DateLastVerified": "2021-10-16T04:24:00Z",
    "ID": 189584,
    "UUID": "E2B31088-A691-4D53-8C20-7C71A3E41E35",
    "DataProviderID": 1,
    "OperatorID": 1,
    "UsageTypeID": 1,
    "AddressInfo": {
        "ID": 189943,
        "Title": " Nasto pneumatici",
        "AddressLine1": "via circonvallazione 9",
        "Town": "Scarnafigi",
        "StateOrProvince": "Piemont",
        "Postcode": "",
        "CountryID": 112,
        "Latitude": 44.6763552447396,
        "Longitude": 7.564092121831777,
        "DistanceUnit": 0
    },
    "Connections": [
        {
            "ID": 306684,
            "ConnectionTypeID": 25,
            "StatusTypeID": 50,
            "LevelID": 2,
            "Amps": 32,
            "Voltage": 400,
            "PowerKW": 22,
            "CurrentTypeID": 20,
            "Quantity": 2
        }
    ],
    "NumberOfPoints": 1,
    "StatusTypeID": 50,
    "DateLastStatusUpdate": "2021-10-17T14:55:00Z",
    "DataQualityLevel": 1,
    "DateCreated": "2021-10-16T04:24:00Z",
    "SubmissionStatusTypeID": 200
}