{
    "IsRecentlyVerified": false,
    "ID": 140619,
    "UUID": "08764B9E-B23D-4415-9E58-F90A1F1A22F2",
    "DataProviderID": 2,
    "DataProvidersReference": "78311",
    "UsageTypeID": 2,
    "AddressInfo": {
        "ID": 140971,
        "Title": "Langley Research Center",
        "AddressLine1": "2 E Ames St",
        "Town": "Hampton",
        "StateOrProvince": "VA",
        "Postcode": "23681",
        "CountryID": 2,
        "Latitude": 37.097728,
        "Longitude": -76.383423,
        "ContactTelephone1": "",
        "AccessComments": "Also accessible through chip keys",
        "RelatedURL": "",
        "DistanceUnit": 0
    },
    "Connections": [
        {
            "ID": 196303,
            "ConnectionTypeID": 1,
            "LevelID": 2,
            "Amps": 16,
            "Voltage": 230,
            "PowerKW": 3.7,
            "CurrentTypeID": 10,
            "Quantity": 1
        }
    ],
    "StatusTypeID": 50,
    "DateLastStatusUpdate": "2020-06-26T02:59:00Z",
    "DataQualityLevel": 3,
    "DateCreated": "2019-12-24T09:13:00Z",
    "SubmissionStatusTypeID": 100
}