{
    "IsRecentlyVerified": false,
    "ID": 158835,
    "UUID": "F9FD1680-0839-43A8-A423-F0BC69F08575",
    "DataProviderID": 2,
    "DataProvidersReference": "154256",
    "OperatorID": 89,
    "UsageTypeID": 1,
    "AddressInfo": {
        "ID": 159192,
        "Title": "4940 Paso Robles Ave",
        "AddressLine1": "4940 Paso Robles Ave",
        "Town": "Encino",
        "StateOrProvince": "CA",
        "Postcode": "91316",
        "CountryID": 2,
        "Latitude": 34.16082228,
        "Longitude": -118.5020959,
        "ContactTelephone1": "888-356-8911",
        "AccessComments": "24 hours daily",
        "RelatedURL": "https://flo.ca/",
        "DistanceUnit": 0
    },
    "Connections": [
        {
            "ID": 228869,
            "ConnectionTypeID": 1,
            "LevelID": 2,
            "Amps": 16,
            "Voltage": 230,
            "PowerKW": 3.7,
            "CurrentTypeID": 10,
            "Quantity": 1
        }
    ],
    "StatusTypeID": 50,
    "DateLastStatusUpdate": "2020-06-26T02:57:00Z",
    "DataQualityLevel": 3,
    "DateCreated": "2020-06-26T02:57:00Z",
    "SubmissionStatusTypeID": 100
}