{
    "IsRecentlyVerified": false,
    "ID": 132243,
    "UUID": "1AA1F8E7-B1B7-4204-834B-ACA71320A5BF",
    "DataProviderID": 1,
    "OperatorID": 3,
    "OperatorsReference": "PG-70222,PG-83633",
    "UsageTypeID": 4,
    "UsageCost": "1",
    "AddressInfo": {
        "ID": 132589,
        "Title": "Tesco Superstore-Berwick-Upon-Tweed",
        "AddressLine1": "Ord Road",
        "Town": "Berwick-Upon-Tweed",
        "Postcode": "TD15 2XG",
        "CountryID": 1,
        "Latitude": 55.764006,
        "Longitude": -2.023793,
        "DistanceUnit": 0
    },
    "Connections": [
        {
            "ID": 185105,
            "ConnectionTypeID": 25,
            "StatusTypeID": 50,
            "LevelID": 2,
            "Amps": 32,
            "Voltage": 230,
            "PowerKW": 7,
            "CurrentTypeID": 10,
            "Quantity": 4
        }
    ],
    "NumberOfPoints": 4,
    "GeneralComments": "This is an open charge unit installed at the Tesco superstore at Ord Road, Berwick-upon-Tweed",
    "StatusTypeID": 50,
    "DateLastStatusUpdate": "2020-06-02T09:12:00Z",
    "DataQualityLevel": 1,
    "DateCreated": "2019-09-25T05:30:00Z",
    "SubmissionStatusTypeID": 200
}