{
    "IsRecentlyVerified": false,
    "ID": 123910,
    "UUID": "CA465FF3-1E4D-416F-83A2-C49F0F281667",
    "DataProviderID": 2,
    "DataProvidersReference": "98474",
    "OperatorID": 5,
    "UsageTypeID": 1,
    "AddressInfo": {
        "ID": 124256,
        "Title": "IRVINE  CO  OFC",
        "AddressLine1": "860 N McCarthy Blvd",
        "Town": "Milpitas",
        "StateOrProvince": "CA",
        "Postcode": "95035",
        "CountryID": 2,
        "Latitude": 37.439609,
        "Longitude": -121.923141,
        "ContactTelephone1": "888-758-4389",
        "AccessComments": "24 hours daily",
        "RelatedURL": "http://www.chargepoint.com/",
        "DistanceUnit": 0
    },
    "Connections": [
        {
            "ID": 173943,
            "ConnectionTypeID": 1,
            "LevelID": 2,
            "Amps": 16,
            "Voltage": 230,
            "PowerKW": 3,
            "CurrentTypeID": 10,
            "Quantity": 6
        }
    ],
    "DateLastStatusUpdate": "2019-12-24T09:13:00Z",
    "DataQualityLevel": 3,
    "DateCreated": "2019-04-06T05:03:00Z",
    "SubmissionStatusTypeID": 100
}