{
    "IsRecentlyVerified": false,
    "ID": 11012,
    "UUID": "D49DBE93-B17B-4870-9C02-D7FCE845D7A3",
    "DataProviderID": 1,
    "DataProvidersReference": "929",
    "AddressInfo": {
        "ID": 10909,
        "Title": "Løkkeveien, Alta",
        "AddressLine1": "Løkkeveien ",
        "Town": "ALTA",
        "StateOrProvince": "Troms og Finnmark",
        "Postcode": "9510",
        "CountryID": 168,
        "Latitude": 69.96636,
        "Longitude": 23.26793,
        "AccessComments": "Parkeringsplass mellom Rica Hotell og E6.",
        "DistanceUnit": 0
    },
    "Connections": [
        {
            "ID": 8995,
            "ConnectionTypeID": 0,
            "Reference": "1",
            "LevelID": 2,
            "Amps": 16,
            "Voltage": 230,
            "PowerKW": 3.7,
            "Comments": "Mode 1"
        },
        {
            "ID": 89559,
            "ConnectionTypeID": 0,
            "Reference": "2",
            "LevelID": 2,
            "Amps": 16,
            "Voltage": 230,
            "PowerKW": 3.7,
            "Comments": "Mode 1"
        }
    ],
    "NumberOfPoints": 2,
    "StatusTypeID": 0,
    "DateLastStatusUpdate": "2020-05-26T08:25:00Z",
    "DataQualityLevel": 2,
    "DateCreated": "2012-06-02T11:57:00Z",
    "SubmissionStatusTypeID": 100
}