{
    "IsRecentlyVerified": false,
    "ID": 171303,
    "UUID": "11DD1065-F7EC-41AA-884B-1B6FC6E9D0E3",
    "DataProviderID": 1,
    "OperatorID": 1,
    "UsageTypeID": 5,
    "UsageCost": "DC: €2.5/session + €0.25/min --- AC: free",
    "AddressInfo": {
        "ID": 171662,
        "Title": "Amvrakia, Northbound",
        "AddressLine1": "Motorway 5 (Ionian)",
        "Town": "Άγιος Στέφανος",
        "StateOrProvince": "Peloponnese, West Greece and Ionian Sea Administration",
        "Postcode": "30009",
        "CountryID": 90,
        "Latitude": 38.74615090005361,
        "Longitude": 21.204739687568917,
        "AccessComments": "Northbound only. Have to ask the gas station staff for the charging card.",
        "DistanceUnit": 0
    },
    "Connections": [
        {
            "ID": 261824,
            "ConnectionTypeID": 33,
            "StatusTypeID": 50,
            "LevelID": 3,
            "PowerKW": 50,
            "CurrentTypeID": 30,
            "Quantity": 1
        },
        {
            "ID": 261825,
            "ConnectionTypeID": 2,
            "StatusTypeID": 50,
            "LevelID": 3,
            "PowerKW": 50,
            "CurrentTypeID": 30,
            "Quantity": 1
        },
        {
            "ID": 261826,
            "ConnectionTypeID": 1036,
            "StatusTypeID": 50,
            "LevelID": 3,
            "Amps": 60,
            "Voltage": 230,
            "PowerKW": 43,
            "CurrentTypeID": 20,
            "Quantity": 1
        }
    ],
    "NumberOfPoints": 1,
    "GeneralComments": "ABB T53 CJG charger: DC50kW CCS + DC50kW CHAdeMO + AC43Kw type2 (cable attached)  Northbound.",
    "StatusTypeID": 50,
    "DateLastStatusUpdate": "2020-12-30T13:07:00Z",
    "DataQualityLevel": 1,
    "DateCreated": "2020-12-29T22:51:00Z",
    "SubmissionStatusTypeID": 200
}