{
    "IsRecentlyVerified": false,
    "ID": 94531,
    "UUID": "E5E7FB53-4C37-42AE-B88E-C669A5044A93",
    "DataProviderID": 1,
    "OperatorID": 23,
    "OperatorsReference": "36695",
    "UsageTypeID": 6,
    "AddressInfo": {
        "ID": 94877,
        "Title": "Wellnesshotel Bergland",
        "AddressLine1": "Madseit 690",
        "Town": "Hintertux",
        "StateOrProvince": "Tirol",
        "Postcode": "6294",
        "CountryID": 19,
        "Latitude": 47.127277,
        "Longitude": 11.697768,
        "ContactTelephone1": "+43 5287 8500",
        "DistanceUnit": 0
    },
    "Connections": [
        {
            "ID": 133670,
            "ConnectionTypeID": 30,
            "StatusTypeID": 50,
            "LevelID": 2,
            "Amps": 16,
            "Voltage": 400,
            "PowerKW": 11,
            "CurrentTypeID": 20,
            "Quantity": 2
        }
    ],
    "NumberOfPoints": 2,
    "GeneralComments": "2 Tesla Connectors, up to 11kW.Available for patrons only. Please call ahead.",
    "StatusTypeID": 50,
    "DateLastStatusUpdate": "2018-10-03T17:19:00Z",
    "DataQualityLevel": 1,
    "DateCreated": "2017-10-20T05:36:00Z",
    "SubmissionStatusTypeID": 200
}