{
    "IsRecentlyVerified": false,
    "ID": 155985,
    "UUID": "16E9D45F-75E5-4DF9-AE74-7FDECBB74E81",
    "DataProviderID": 1,
    "OperatorID": 80,
    "UsageTypeID": 4,
    "AddressInfo": {
        "ID": 156339,
        "Title": "ARMENO Parcheggio Cimitero | ENELX",
        "AddressLine1": "Viale Luigi Cadorna",
        "Town": "Armeno",
        "StateOrProvince": "NO",
        "Postcode": "28011",
        "CountryID": 112,
        "Latitude": 45.817760476324,
        "Longitude": 8.438609767483968,
        "RelatedURL": "https://www.enelx.com/it/it/emobility",
        "DistanceUnit": 0
    },
    "Connections": [
        {
            "ID": 219568,
            "ConnectionTypeID": 25,
            "StatusTypeID": 50,
            "LevelID": 2,
            "Amps": 32,
            "Voltage": 400,
            "PowerKW": 22,
            "CurrentTypeID": 20,
            "Quantity": 2
        }
    ],
    "NumberOfPoints": 2,
    "StatusTypeID": 50,
    "DateLastStatusUpdate": "2020-05-01T13:17:00Z",
    "DataQualityLevel": 1,
    "DateCreated": "2020-05-01T13:17:00Z",
    "SubmissionStatusTypeID": 200
}