{
    "IsRecentlyVerified": false,
    "ID": 70754,
    "UUID": "AB570C61-1979-478A-A322-CCEAE9F28812",
    "DataProviderID": 1,
    "OperatorID": 25,
    "OperatorsReference": "hammersmithandfulham-parsonsgreen",
    "UsageTypeID": 4,
    "UsageCost": "£0.036/minute; min £0.72",
    "AddressInfo": {
        "ID": 71100,
        "Title": "Parsons Green",
        "AddressLine1": "Ackmar Road",
        "AddressLine2": "Parson's Green",
        "Town": "London",
        "StateOrProvince": "England",
        "Postcode": "SW6 4UU",
        "CountryID": 1,
        "Latitude": 51.4740871,
        "Longitude": -0.2001262,
        "DistanceUnit": 0
    },
    "Connections": [
        {
            "ID": 101355,
            "ConnectionTypeID": 25,
            "StatusTypeID": 50,
            "LevelID": 2,
            "Amps": 32,
            "Voltage": 230,
            "PowerKW": 7,
            "CurrentTypeID": 10,
            "Quantity": 1
        },
        {
            "ID": 101356,
            "ConnectionTypeID": 1,
            "StatusTypeID": 50,
            "LevelID": 2,
            "Amps": 16,
            "Voltage": 230,
            "PowerKW": 4,
            "CurrentTypeID": 10,
            "Quantity": 1
        }
    ],
    "NumberOfPoints": 5,
    "StatusTypeID": 150,
    "DateLastStatusUpdate": "2016-11-23T19:33:00Z",
    "DataQualityLevel": 1,
    "DateCreated": "2016-08-09T15:25:00Z",
    "SubmissionStatusTypeID": 200
}