{
    "IsRecentlyVerified": false,
    "ID": 106056,
    "UUID": "4D3DCAE3-9F2F-49BB-B3A2-D723C507209E",
    "DataProviderID": 1,
    "OperatorID": 80,
    "UsageTypeID": 4,
    "AddressInfo": {
        "ID": 106402,
        "Title": "EnelX Via dei Mille Porto Garibaldi",
        "AddressLine1": "Via dei Mille",
        "Town": "Porto Garibaldi",
        "StateOrProvince": "FE",
        "Postcode": "44029",
        "CountryID": 112,
        "Latitude": 44.68284911394878,
        "Longitude": 12.240619210197906,
        "ContactTelephone1": "800.069.850",
        "RelatedURL": "https://www.enelx.com/it/it/emobility",
        "DistanceUnit": 0
    },
    "Connections": [
        {
            "ID": 149364,
            "ConnectionTypeID": 25,
            "StatusTypeID": 50,
            "LevelID": 2,
            "Amps": 32,
            "Voltage": 400,
            "PowerKW": 22,
            "CurrentTypeID": 20,
            "Quantity": 1
        },
        {
            "ID": 149365,
            "ConnectionTypeID": 36,
            "StatusTypeID": 50,
            "LevelID": 2,
            "Amps": 16,
            "Voltage": 240,
            "PowerKW": 3.7,
            "CurrentTypeID": 10,
            "Quantity": 1
        }
    ],
    "NumberOfPoints": 2,
    "StatusTypeID": 50,
    "DateLastStatusUpdate": "2018-06-14T13:42:00Z",
    "DataQualityLevel": 1,
    "DateCreated": "2018-06-14T13:42:00Z",
    "SubmissionStatusTypeID": 200
}