{
    "IsRecentlyVerified": false,
    "ID": 167094,
    "UUID": "19CE4AC7-F318-4302-A521-FED308926E13",
    "DataProviderID": 18,
    "DataProvidersReference": "1748d8984b53add08df8a33adfb4028a",
    "OperatorID": 3345,
    "UsageTypeID": 5,
    "AddressInfo": {
        "ID": 167453,
        "Title": "CV2 3GF",
        "AddressLine1": "",
        "Town": "Coventry",
        "Postcode": "CV2 3GF",
        "CountryID": 1,
        "Latitude": 52.419365,
        "Longitude": -1.476096,
        "AccessComments": "",
        "RelatedURL": "https://char.gy",
        "DistanceUnit": 0
    },
    "Connections": [
        {
            "ID": 253008,
            "ConnectionTypeID": 25,
            "Reference": "00466",
            "StatusTypeID": 100,
            "LevelID": 2,
            "Amps": 32,
            "Voltage": 400,
            "PowerKW": 22,
            "CurrentTypeID": 20
        }
    ],
    "StatusTypeID": 0,
    "DateLastStatusUpdate": "2020-08-27T08:10:00Z",
    "MetadataValues": [
        {
            "ID": 7851,
            "MetadataFieldID": 4,
            "ItemValue": "Contains public sector information licensed under the Open Government Licence v2.0. http://www.nationalarchives.gov.uk/doc/open-government-licence/version/2/"
        }
    ],
    "DataQualityLevel": 3,
    "DateCreated": "2020-08-27T08:10:00Z",
    "SubmissionStatusTypeID": 100
}