{
    "IsRecentlyVerified": false,
    "ID": 102035,
    "UUID": "20BD0708-DDFD-4171-886D-FBFACC0A1498",
    "DataProviderID": 1,
    "OperatorID": 23,
    "OperatorsReference": "42230",
    "UsageTypeID": 4,
    "AddressInfo": {
        "ID": 102381,
        "Title": "Culinair",
        "AddressLine1": "Dronckaertstraat 508",
        "Town": "Lauwe",
        "Postcode": "8930",
        "CountryID": 26,
        "Latitude": 50.793104,
        "Longitude": 3.205599,
        "ContactTelephone1": "+32 56 42 67 33",
        "DistanceUnit": 0
    },
    "Connections": [
        {
            "ID": 144018,
            "ConnectionTypeID": 30,
            "StatusTypeID": 50,
            "LevelID": 2,
            "Amps": 32,
            "Voltage": 230,
            "PowerKW": 7,
            "CurrentTypeID": 10,
            "Quantity": 1
        }
    ],
    "NumberOfPoints": 1,
    "GeneralComments": "1 Tesla Connector, up to 7kW.Available for customers. Please call ahead.",
    "StatusTypeID": 50,
    "DateLastStatusUpdate": "2018-10-03T20:57:00Z",
    "DataQualityLevel": 1,
    "DateCreated": "2018-04-16T05:00:00Z",
    "SubmissionStatusTypeID": 200
}