{
    "IsRecentlyVerified": false,
    "ID": 107352,
    "UUID": "4B3F94EB-A14D-4A07-BD32-E77533AF4CC0",
    "DataProviderID": 1,
    "OperatorID": 80,
    "UsageTypeID": 4,
    "AddressInfo": {
        "ID": 107698,
        "Title": "EnelX Catanzaro Lacina",
        "AddressLine1": "Viale della Lacina",
        "Town": "Catanzaro",
        "StateOrProvince": "CZ",
        "Postcode": "88100 ",
        "CountryID": 112,
        "Latitude": 38.90475477616004,
        "Longitude": 16.60534274639724,
        "ContactTelephone1": "800.069.850",
        "RelatedURL": "https://www.enelx.com/it/it/emobility",
        "DistanceUnit": 0
    },
    "Connections": [
        {
            "ID": 151466,
            "ConnectionTypeID": 25,
            "StatusTypeID": 50,
            "LevelID": 2,
            "Amps": 32,
            "Voltage": 400,
            "PowerKW": 22,
            "CurrentTypeID": 20,
            "Quantity": 4
        },
        {
            "ID": 151467,
            "ConnectionTypeID": 36,
            "StatusTypeID": 50,
            "LevelID": 2,
            "Amps": 16,
            "Voltage": 240,
            "PowerKW": 3.7,
            "CurrentTypeID": 10,
            "Quantity": 4
        }
    ],
    "NumberOfPoints": 8,
    "StatusTypeID": 50,
    "DateLastStatusUpdate": "2018-07-25T08:41:00Z",
    "DataQualityLevel": 1,
    "DateCreated": "2018-07-25T08:41:00Z",
    "SubmissionStatusTypeID": 200
}