{
    "IsRecentlyVerified": false,
    "ID": 120673,
    "UUID": "CD135B73-681D-4831-805A-27F09D775424",
    "DataProviderID": 2,
    "DataProvidersReference": "67967",
    "OperatorID": 5,
    "UsageTypeID": 1,
    "AddressInfo": {
        "ID": 121019,
        "Title": "WELCOME CENTER",
        "AddressLine1": "5 Griffin St",
        "Town": "McDonough",
        "StateOrProvince": "GA",
        "Postcode": "30253",
        "CountryID": 2,
        "Latitude": 33.4475053,
        "Longitude": -84.1474403,
        "ContactTelephone1": "888-758-4389",
        "AccessComments": "24 hours daily",
        "RelatedURL": "http://www.chargepoint.com/",
        "DistanceUnit": 0
    },
    "Connections": [
        {
            "ID": 170043,
            "ConnectionTypeID": 1,
            "LevelID": 2,
            "Amps": 16,
            "Voltage": 230,
            "PowerKW": 3,
            "CurrentTypeID": 10,
            "Quantity": 2
        }
    ],
    "DateLastStatusUpdate": "2019-12-24T09:09:00Z",
    "DataQualityLevel": 3,
    "DateCreated": "2019-04-01T04:59:00Z",
    "SubmissionStatusTypeID": 100
}