{
    "IsRecentlyVerified": false,
    "ID": 13975,
    "UUID": "9EE329E9-3F82-435A-9AB4-859F3D4A11F3",
    "DataProviderID": 2,
    "DataProvidersReference": "43455",
    "UsageTypeID": 2,
    "AddressInfo": {
        "ID": 13872,
        "Title": "Minnesota Department of Natural Resources",
        "AddressLine1": "500 Lafayette Rd N",
        "Town": "St. Paul",
        "StateOrProvince": "MN",
        "Postcode": "55155",
        "CountryID": 2,
        "Latitude": 44.956138,
        "Longitude": -93.084209,
        "ContactTelephone1": "",
        "AccessComments": "",
        "RelatedURL": "",
        "DistanceUnit": 0
    },
    "Connections": [
        {
            "ID": 16380,
            "ConnectionTypeID": 1,
            "LevelID": 2,
            "Amps": 16,
            "Voltage": 230,
            "PowerKW": 3.7,
            "CurrentTypeID": 10,
            "Quantity": 2
        },
        {
            "ID": 16381,
            "ConnectionTypeID": 0,
            "LevelID": 2,
            "Quantity": 1
        },
        {
            "ID": 21424,
            "ConnectionTypeID": 1,
            "LevelID": 2,
            "Quantity": 2
        }
    ],
    "DateLastStatusUpdate": "2020-06-26T03:08:00Z",
    "DataQualityLevel": 3,
    "DateCreated": "2012-12-06T16:48:00Z",
    "SubmissionStatusTypeID": 100
}