{
    "UserComments": [
        {
            "ID": 22657,
            "ChargePointID": 148204,
            "CommentTypeID": 10,
            "UserName": "ForumElettrico.it",
            "Comment": "La cittadina con mura medioevali è molto bella, in particolare consiglio la visita del Castello Carrarese. Leggi la recensione completa qui > https://www.forumelettrico.it/forum/colonnina-enelx-este-pd-parcheggio-isidoro-alessi-t8793.html",
            "RelatedURL": "https://www.forumelettrico.it/forum/colonnina-enelx-este-pd-parcheggio-isidoro-alessi-t8793.html",
            "DateCreated": "2020-05-22T16:38:27.4Z",
            "User": {
                "ID": 11749,
                "Username": "ForumElettrico.it"
            },
            "CheckinStatusTypeID": 10,
            "IsActionedByEditor": false
        }
    ],
    "MediaItems": [
        {
            "ID": 22422,
            "ChargePointID": 148204,
            "ItemURL": "https://s3-ap-southeast-2.amazonaws.com/openchargemap/images/IT/OCM148204/OCM-148204.orig.2020052216383969.jpg",
            "ItemThumbnailURL": "https://s3-ap-southeast-2.amazonaws.com/openchargemap/images/IT/OCM148204/OCM-148204.thmb.2020052216383969.jpg",
            "Comment": "",
            "IsEnabled": true,
            "IsVideo": false,
            "IsFeaturedItem": false,
            "IsExternalResource": false,
            "User": {
                "ID": 11749,
                "Username": "ForumElettrico.it"
            },
            "DateCreated": "2020-05-22T16:39:00Z"
        },
        {
            "ID": 22423,
            "ChargePointID": 148204,
            "ItemURL": "https://s3-ap-southeast-2.amazonaws.com/openchargemap/images/IT/OCM148204/OCM-148204.orig.2020052216384498.jpg",
            "ItemThumbnailURL": "https://s3-ap-southeast-2.amazonaws.com/openchargemap/images/IT/OCM148204/OCM-148204.thmb.2020052216384498.jpg",
            "Comment": "",
            "IsEnabled": true,
            "IsVideo": false,
            "IsFeaturedItem": false,
            "IsExternalResource": false,
            "User": {
                "ID": 11749,
                "Username": "ForumElettrico.it"
            },
            "DateCreated": "2020-05-22T16:39:00Z"
        }
    ],
    "IsRecentlyVerified": false,
    "ID": 148204,
    "UUID": "028AEE68-F8AF-40AE-A2AB-FD0028A69985",
    "DataProviderID": 1,
    "OperatorID": 80,
    "UsageTypeID": 4,
    "AddressInfo": {
        "ID": 148556,
        "Title": "Este Alessi | EnelX",
        "AddressLine1": "Via Isidoro Alessi",
        "Town": "Este",
        "StateOrProvince": "PD",
        "Postcode": "35042",
        "CountryID": 112,
        "Latitude": 45.227640821341026,
        "Longitude": 11.65069058470101,
        "ContactTelephone1": "800.069.850",
        "RelatedURL": "https://www.enelx.com/it/it/emobility",
        "DistanceUnit": 0
    },
    "Connections": [
        {
            "ID": 205761,
            "ConnectionTypeID": 25,
            "StatusTypeID": 50,
            "LevelID": 2,
            "Amps": 32,
            "Voltage": 400,
            "PowerKW": 22,
            "CurrentTypeID": 20,
            "Quantity": 2
        }
    ],
    "NumberOfPoints": 2,
    "StatusTypeID": 50,
    "DateLastStatusUpdate": "2020-05-22T16:39:00Z",
    "DataQualityLevel": 1,
    "DateCreated": "2020-01-27T15:45:00Z",
    "SubmissionStatusTypeID": 200
}