{
    "IsRecentlyVerified": false,
    "ID": 17272,
    "UUID": "6CC35DAC-678C-47EE-BB06-575BCAF32F6D",
    "DataProviderID": 22,
    "DataProvidersReference": "5C46DFDE90D27CF400999DED4049F356",
    "AddressInfo": {
        "ID": 17617,
        "Title": "名南三菱中川高杉店",
        "AddressLine1": "愛知県名古屋市中川区昭和橋通9-70",
        "CountryID": 114,
        "Latitude": 35.1237021,
        "Longitude": 136.8424452,
        "ContactTelephone1": "052-383-2085",
        "DistanceUnit": 0
    },
    "Connections": [
        {
            "ID": 17513,
            "ConnectionTypeID": 2,
            "LevelID": 2,
            "Amps": 100,
            "Voltage": 480,
            "PowerKW": 48,
            "Quantity": 1
        }
    ],
    "DateLastStatusUpdate": "2013-06-29T08:56:00Z",
    "DataQualityLevel": 2,
    "DateCreated": "2013-06-29T08:56:00Z",
    "SubmissionStatusTypeID": 200
}