{
    "IsRecentlyVerified": false,
    "ID": 137813,
    "UUID": "E8A6CD42-A0EF-4C94-ACFC-7DEC3E23A186",
    "DataProviderID": 2,
    "DataProvidersReference": "96379",
    "OperatorID": 9,
    "UsageTypeID": 1,
    "AddressInfo": {
        "ID": 138162,
        "Title": "VHA Place",
        "AddressLine1": "220 E Las Colinas Blvd, Suite C-130",
        "Town": "Irving",
        "StateOrProvince": "TX",
        "Postcode": "75039",
        "CountryID": 2,
        "Latitude": 32.866893,
        "Longitude": -96.939559,
        "ContactTelephone1": "888-998-2546",
        "AccessComments": "MON: 24 hours | TUE: 24 hours | WED: 24 hours | THU: 24 hours | FRI: 24 hours | SAT: 24 hours | SUN: 24 hours",
        "RelatedURL": "http://www.blinkcharging.com/",
        "DistanceUnit": 0
    },
    "Connections": [
        {
            "ID": 192820,
            "ConnectionTypeID": 1,
            "LevelID": 2,
            "Amps": 16,
            "Voltage": 230,
            "PowerKW": 3,
            "CurrentTypeID": 10,
            "Quantity": 2
        }
    ],
    "StatusTypeID": 50,
    "DateLastStatusUpdate": "2019-12-24T09:06:00Z",
    "DataQualityLevel": 3,
    "DateCreated": "2019-12-24T09:06:00Z",
    "SubmissionStatusTypeID": 100
}