{
    "IsRecentlyVerified": false,
    "ID": 54263,
    "UUID": "A6345726-AF37-481E-B223-34E5CD174F75",
    "DataProviderID": 1,
    "OperatorID": 173,
    "UsageTypeID": 4,
    "AddressInfo": {
        "ID": 54609,
        "Title": "BMW Werk1.4",
        "AddressLine1": "Lauchstädter Straße 4",
        "Town": "München",
        "Postcode": "80807",
        "CountryID": 87,
        "Latitude": 48.1889937,
        "Longitude": 11.5739999,
        "AccessComments": "Rund um die Uhr (24/7) nutzbar Parkplatz Mo-Fr 8:00-17:00 für Besucher von BMW reserviert\r\n",
        "RelatedURL": "http://www.chargenow.com",
        "DistanceUnit": 0
    },
    "Connections": [
        {
            "ID": 68298,
            "ConnectionTypeID": 25,
            "StatusTypeID": 50,
            "LevelID": 2,
            "PowerKW": 22,
            "CurrentTypeID": 20,
            "Quantity": 2
        },
        {
            "ID": 68299,
            "ConnectionTypeID": 33,
            "StatusTypeID": 50,
            "LevelID": 3,
            "PowerKW": 0,
            "CurrentTypeID": 30,
            "Quantity": 0
        }
    ],
    "NumberOfPoints": 2,
    "StatusTypeID": 50,
    "DateLastStatusUpdate": "2015-09-25T20:26:00Z",
    "DataQualityLevel": 1,
    "DateCreated": "2015-09-25T15:35:00Z",
    "SubmissionStatusTypeID": 200
}