{
    "IsRecentlyVerified": false,
    "ID": 177521,
    "UUID": "C2C73627-F085-4F59-AEAE-604F73415EC9",
    "DataProviderID": 29,
    "DataProvidersReference": "13313",
    "OperatorID": 69,
    "AddressInfo": {
        "ID": 177880,
        "Title": "Floriansmühlstr. 13a",
        "AddressLine1": "Floriansmühlstr. 13a",
        "Town": "München",
        "Postcode": "80939",
        "CountryID": 87,
        "Latitude": 48.191679,
        "Longitude": 11.620515,
        "DistanceUnit": 0
    },
    "Connections": [
        {
            "ID": 276760,
            "ConnectionTypeID": 25,
            "StatusTypeID": 50,
            "LevelID": 2,
            "PowerKW": 22,
            "CurrentTypeID": 20
        },
        {
            "ID": 276761,
            "ConnectionTypeID": 25,
            "StatusTypeID": 50,
            "LevelID": 2,
            "PowerKW": 22,
            "CurrentTypeID": 20
        }
    ],
    "StatusTypeID": 0,
    "DateLastStatusUpdate": "2021-07-09T03:12:00Z",
    "MetadataValues": [
        {
            "ID": 9815,
            "MetadataFieldID": 4,
            "ItemValue": "Data from the German chargepoint registry provided by Bundesnetzagentur.de under the CC-BY 4.0 license"
        }
    ],
    "DataQualityLevel": 3,
    "DateCreated": "2021-07-08T09:49:00Z",
    "SubmissionStatusTypeID": 100
}