{
    "IsRecentlyVerified": false,
    "ID": 144347,
    "UUID": "69DAD5C1-1D26-4BD7-9DE1-8BC82CAE658A",
    "DataProviderID": 2,
    "DataProvidersReference": "149425",
    "OperatorID": 90,
    "UsageTypeID": 1,
    "AddressInfo": {
        "ID": 144699,
        "Title": "BRCC - Caisse Desjardins du Val-Saint-François - Valcourt",
        "AddressLine1": "1120 Avenue des Cascades",
        "Town": "Valcourt",
        "StateOrProvince": "QC",
        "Postcode": "J0E 2L0",
        "CountryID": 44,
        "Latitude": 45.493155,
        "Longitude": -72.3137,
        "ContactTelephone1": "877-505-2674",
        "AccessComments": "24 hours daily",
        "RelatedURL": "https://lecircuitelectrique.com/",
        "DistanceUnit": 0
    },
    "Connections": [
        {
            "ID": 200843,
            "ConnectionTypeID": 2,
            "LevelID": 3,
            "Amps": 100,
            "Voltage": 400,
            "PowerKW": 40,
            "CurrentTypeID": 30,
            "Quantity": 1
        },
        {
            "ID": 200844,
            "ConnectionTypeID": 32,
            "LevelID": 3,
            "Amps": 100,
            "Voltage": 400,
            "PowerKW": 40,
            "CurrentTypeID": 30,
            "Quantity": 1
        }
    ],
    "StatusTypeID": 50,
    "DateLastStatusUpdate": "2020-06-26T03:09:00Z",
    "DataQualityLevel": 3,
    "DateCreated": "2019-12-24T09:23:00Z",
    "SubmissionStatusTypeID": 100
}