{
    "IsRecentlyVerified": false,
    "ID": 101349,
    "UUID": "059010C8-0F39-447A-9CBA-691D25A80B6E",
    "DataProviderID": 1,
    "OperatorID": 103,
    "UsageTypeID": 4,
    "AddressInfo": {
        "ID": 101695,
        "Title": "Marktkauf",
        "AddressLine1": "Nieskyer Straße 100",
        "Town": "Görlitz",
        "StateOrProvince": "Landkreis Görlitz",
        "Postcode": "02828",
        "CountryID": 87,
        "Latitude": 51.17000408133443,
        "Longitude": 14.969772532926982,
        "AccessComments": "24/7 nutzbarer Triplecharger auf dem Parkplatz des Einkaufszentrums ",
        "DistanceUnit": 0
    },
    "Connections": [
        {
            "ID": 143091,
            "ConnectionTypeID": 1036,
            "StatusTypeID": 50,
            "LevelID": 3,
            "Amps": 63,
            "Voltage": 400,
            "PowerKW": 43,
            "CurrentTypeID": 20,
            "Quantity": 1
        },
        {
            "ID": 143092,
            "ConnectionTypeID": 2,
            "StatusTypeID": 50,
            "LevelID": 3,
            "PowerKW": 50,
            "CurrentTypeID": 30,
            "Quantity": 1
        },
        {
            "ID": 143093,
            "ConnectionTypeID": 33,
            "StatusTypeID": 50,
            "LevelID": 3,
            "PowerKW": 50,
            "CurrentTypeID": 30,
            "Quantity": 1
        }
    ],
    "NumberOfPoints": 3,
    "StatusTypeID": 50,
    "DateLastStatusUpdate": "2018-03-26T07:46:00Z",
    "DataQualityLevel": 1,
    "DateCreated": "2018-03-26T07:46:00Z",
    "SubmissionStatusTypeID": 200
}