{
    "IsRecentlyVerified": false,
    "ID": 73208,
    "UUID": "6E4E568E-4E8A-47E1-BBA1-43B1D37A9E1C",
    "DataProviderID": 1,
    "OperatorID": 125,
    "UsageTypeID": 6,
    "AddressInfo": {
        "ID": 73554,
        "Title": "Supermarkt Inkoop",
        "AddressLine1": "Oldenburger Straße 74",
        "Town": "Delmenhorst",
        "StateOrProvince": "Delmenhorst",
        "Postcode": "27753",
        "CountryID": 87,
        "Latitude": 53.0488765,
        "Longitude": 8.608445200000006,
        "ContactTelephone1": "+49 4221 93540",
        "AccessComments": "24/7 nutzbar, Zufahrt über Brauenkamper Straße 120 (das als Navi Adresse eingeben). Freischaltbar mit allen Ladekarten des SWB/EWE Verbundes: EWE, SWB, SUN, The New Motion, Charge&Fuel, WSW SWM, SW Duisburg, SW Metzingen, SW Ludwigsburg, SW Heidelberg, SW Weilheim, SW München, SW Erfurt u.a. sowie auch per SMS für 3,90€/h",
        "RelatedURL": "http://www.inkoop.de/",
        "DistanceUnit": 0
    },
    "Connections": [
        {
            "ID": 105333,
            "ConnectionTypeID": 25,
            "StatusTypeID": 50,
            "LevelID": 2,
            "Amps": 32,
            "Voltage": 400,
            "PowerKW": 22,
            "CurrentTypeID": 20,
            "Quantity": 2
        }
    ],
    "NumberOfPoints": 2,
    "StatusTypeID": 50,
    "DateLastStatusUpdate": "2016-11-14T08:23:00Z",
    "DataQualityLevel": 1,
    "DateCreated": "2016-11-14T08:23:00Z",
    "SubmissionStatusTypeID": 200
}