{
    "IsRecentlyVerified": false,
    "ID": 73415,
    "UUID": "17D8DA7C-54AA-442F-B0CE-20408BBB8ECA",
    "DataProviderID": 1,
    "OperatorID": 89,
    "OperatorsReference": "CEA-10098",
    "UsageTypeID": 4,
    "UsageCost": "CAD 2.50",
    "AddressInfo": {
        "ID": 73761,
        "Title": "Pointe-Claire-Centre Aquatique/aréna Bob Birnie",
        "AddressLine1": "58 Av. Maywood",
        "Town": "Pointe-Claire",
        "StateOrProvince": "QC",
        "Postcode": "H9R 0A7",
        "CountryID": 44,
        "Latitude": 45.4498,
        "Longitude": -73.813858,
        "DistanceUnit": 0
    },
    "Connections": [
        {
            "ID": 105621,
            "ConnectionTypeID": 1,
            "StatusTypeID": 50,
            "LevelID": 2,
            "Amps": 32,
            "Voltage": 230,
            "PowerKW": 7,
            "CurrentTypeID": 10,
            "Quantity": 1
        }
    ],
    "NumberOfPoints": 1,
    "StatusTypeID": 50,
    "DateLastStatusUpdate": "2017-01-22T19:17:00Z",
    "DataQualityLevel": 1,
    "DateCreated": "2016-11-22T08:18:00Z",
    "SubmissionStatusTypeID": 200
}