{
    "IsRecentlyVerified": false,
    "ID": 29820,
    "UUID": "E1168E3B-CDA3-4391-9704-10EABD073C12",
    "DataProviderID": 15,
    "DataProvidersReference": "37255",
    "OperatorID": 1,
    "UsageTypeID": 1,
    "AddressInfo": {
        "ID": 30166,
        "Title": "off East High Street",
        "AddressLine1": "off East High Street",
        "Town": "Shepherdstown",
        "StateOrProvince": "WV",
        "Postcode": "25443",
        "CountryID": 2,
        "Latitude": 39.43086,
        "Longitude": -77.80169,
        "ContactTelephone1": "",
        "RelatedURL": "http://carstations.com/37255",
        "DistanceUnit": 0
    },
    "Connections": [
        {
            "ID": 32805,
            "ConnectionTypeID": 1,
            "Reference": "J1772",
            "LevelID": 2
        }
    ],
    "NumberOfPoints": 3,
    "StatusTypeID": 0,
    "DateLastStatusUpdate": "2017-11-04T14:04:00Z",
    "DataQualityLevel": 2,
    "DateCreated": "2014-11-29T05:39:00Z",
    "SubmissionStatusTypeID": 100
}