{
    "IsRecentlyVerified": false,
    "ID": 161216,
    "UUID": "60B806F4-9626-490F-AFA6-6FC6E638D524",
    "DataProviderID": 1,
    "OperatorID": 80,
    "UsageTypeID": 4,
    "AddressInfo": {
        "ID": 161573,
        "Title": "Enel X - Viaggiator Goloso",
        "AddressLine1": "Via Piemonte 25",
        "AddressLine2": "",
        "Town": "Buccinasco",
        "StateOrProvince": "MI",
        "Postcode": "20090",
        "CountryID": 112,
        "Latitude": 45.41630042064412,
        "Longitude": 9.122455387131822,
        "DistanceUnit": 0
    },
    "Connections": [
        {
            "ID": 231976,
            "ConnectionTypeID": 25,
            "StatusTypeID": 50,
            "Quantity": 4,
            "Comments": "Operative da Agosto 2020"
        }
    ],
    "NumberOfPoints": 4,
    "StatusTypeID": 50,
    "DateLastStatusUpdate": "2020-10-02T05:17:00Z",
    "DataQualityLevel": 1,
    "DateCreated": "2020-07-06T20:13:00Z",
    "SubmissionStatusTypeID": 200
}