{
    "IsRecentlyVerified": false,
    "ID": 143250,
    "UUID": "E2B83A89-00AB-48FB-9BB1-4D68C4A6E29D",
    "DataProviderID": 2,
    "DataProvidersReference": "104303",
    "UsageTypeID": 2,
    "AddressInfo": {
        "ID": 143602,
        "Title": "EBSCO",
        "AddressLine1": "2 Washington St",
        "Town": "Ipswich",
        "StateOrProvince": "MA",
        "Postcode": "01938",
        "CountryID": 2,
        "Latitude": 42.678707,
        "Longitude": -70.841728,
        "ContactTelephone1": "",
        "AccessComments": "Employee use only",
        "RelatedURL": "",
        "DistanceUnit": 0
    },
    "Connections": [
        {
            "ID": 199540,
            "ConnectionTypeID": 1,
            "LevelID": 2,
            "Amps": 16,
            "Voltage": 230,
            "PowerKW": 3.7,
            "CurrentTypeID": 10,
            "Quantity": 1
        }
    ],
    "StatusTypeID": 50,
    "DateLastStatusUpdate": "2020-06-26T03:06:00Z",
    "DataQualityLevel": 3,
    "DateCreated": "2019-12-24T09:20:00Z",
    "SubmissionStatusTypeID": 100
}