{
    "IsRecentlyVerified": false,
    "ID": 59046,
    "UUID": "201DAD56-28E9-40A0-9DDF-8BC8B703727B",
    "DataProviderID": 1,
    "OperatorID": 235,
    "UsageTypeID": 4,
    "UsageCost": "0",
    "AddressInfo": {
        "ID": 59392,
        "Title": "Rathaus Hilden",
        "AddressLine1": "Am Rathaus 1",
        "Town": "Hilden",
        "StateOrProvince": "Düsseldorf",
        "Postcode": "40721",
        "CountryID": 87,
        "Latitude": 51.169912088,
        "Longitude": 6.937053053,
        "ContactTelephone1": "0211/821-8210",
        "ContactTelephone2": "0211/821-4093",
        "ContactEmail": "elektromobilitaet@swd-ag.de",
        "AccessComments": "Rund um die Uhr (24/7) nutzbar. ",
        "RelatedURL": "http://www.emobil-nrw.de",
        "DistanceUnit": 0
    },
    "Connections": [
        {
            "ID": 74905,
            "ConnectionTypeID": 25,
            "StatusTypeID": 50,
            "LevelID": 2,
            "Amps": 16,
            "Voltage": 400,
            "PowerKW": 11,
            "CurrentTypeID": 20,
            "Quantity": 2
        },
        {
            "ID": 74906,
            "ConnectionTypeID": 28,
            "StatusTypeID": 50,
            "LevelID": 2,
            "Amps": 16,
            "Voltage": 230,
            "PowerKW": 3.7,
            "CurrentTypeID": 10,
            "Quantity": 2
        }
    ],
    "NumberOfPoints": 2,
    "GeneralComments": "Nutzbar mit:\r\nElektronauten-Ladekarte (EnBW)\r\nLadekarte der Stadtwerke Hilden GmbH\r\nLadekarte der Stadtwerke Düsseldorf AG\r\nhttps://www.swd-ag.de/formulare/tankkarte/",
    "StatusTypeID": 50,
    "DateLastStatusUpdate": "2016-02-02T11:55:00Z",
    "DataQualityLevel": 1,
    "DateCreated": "2016-01-06T13:07:00Z",
    "SubmissionStatusTypeID": 200
}