{
    "IsRecentlyVerified": false,
    "ID": 139496,
    "UUID": "6813837D-C17C-4F53-870E-11591505EAA2",
    "DataProviderID": 2,
    "DataProvidersReference": "95306",
    "OperatorID": 9,
    "UsageTypeID": 1,
    "AddressInfo": {
        "ID": 139848,
        "Title": "Kaiser Permanente - Downey",
        "AddressLine1": "9449 East Imperial Highway",
        "Town": "Downey",
        "StateOrProvince": "CA",
        "Postcode": "90242",
        "CountryID": 2,
        "Latitude": 33.918241,
        "Longitude": -118.127332,
        "ContactTelephone1": "888-998-2546",
        "AccessComments": "MON: 24 hours | TUE: 24 hours | WED: 24 hours | THU: 24 hours | FRI: 24 hours | SAT: 24 hours | SUN: 24 hours",
        "RelatedURL": "http://www.blinkcharging.com/",
        "DistanceUnit": 0
    },
    "Connections": [
        {
            "ID": 194882,
            "ConnectionTypeID": 1,
            "LevelID": 2,
            "Amps": 16,
            "Voltage": 230,
            "PowerKW": 3.7,
            "CurrentTypeID": 10,
            "Quantity": 4
        }
    ],
    "StatusTypeID": 50,
    "DateLastStatusUpdate": "2020-06-26T02:56:00Z",
    "DataQualityLevel": 3,
    "DateCreated": "2019-12-24T09:11:00Z",
    "SubmissionStatusTypeID": 100
}