{
    "IsRecentlyVerified": false,
    "ID": 174306,
    "UUID": "4A5E4AF9-2ACF-4C68-9CB4-9E5F74238D5D",
    "DataProviderID": 19,
    "DataProvidersReference": "6951",
    "AddressInfo": {
        "ID": 174665,
        "Title": "Vesturlandsvegur (Orkan)",
        "AddressLine1": "Grjóthálsi 8",
        "Town": "Reykjavík",
        "StateOrProvince": "Höfuðborgarsvæði",
        "Postcode": "110",
        "CountryID": 105,
        "Latitude": 64.123665,
        "Longitude": -21.804816,
        "AccessComments": "",
        "DistanceUnit": 0
    },
    "Connections": [
        {
            "ID": 269801,
            "ConnectionTypeID": 2,
            "Reference": "1",
            "LevelID": 3,
            "Amps": 100,
            "Voltage": 500,
            "PowerKW": 50,
            "CurrentTypeID": 30,
            "Comments": "Mode 4"
        },
        {
            "ID": 269802,
            "ConnectionTypeID": 33,
            "Reference": "2",
            "LevelID": 3,
            "Amps": 100,
            "Voltage": 500,
            "PowerKW": 50,
            "CurrentTypeID": 30,
            "Comments": "Mode 4"
        },
        {
            "ID": 269803,
            "ConnectionTypeID": 25,
            "Reference": "3",
            "LevelID": 3,
            "Amps": 32,
            "Voltage": 400,
            "PowerKW": 22,
            "CurrentTypeID": 30,
            "Comments": "Mode 3"
        }
    ],
    "NumberOfPoints": 3,
    "StatusTypeID": 0,
    "DateLastStatusUpdate": "2021-03-24T05:12:00Z",
    "DataQualityLevel": 2,
    "DateCreated": "2021-03-24T05:12:00Z",
    "SubmissionStatusTypeID": 100
}