{
    "IsRecentlyVerified": false,
    "ID": 151939,
    "UUID": "FADA71B2-1D8D-4462-8BD3-C1465E400ADE",
    "DataProviderID": 28,
    "DataProvidersReference": "FRS42P42182A1",
    "UsageTypeID": 5,
    "AddressInfo": {
        "ID": 152292,
        "Title": "Parking rue Robert Barathon",
        "AddressLine1": "1 rue du tacot",
        "CountryID": 80,
        "Latitude": 46.052025,
        "Longitude": 3.930905,
        "AccessComments": "24/24 - 7/7",
        "DistanceUnit": 0
    },
    "Connections": [
        {
            "ID": 212456,
            "ConnectionTypeID": 28,
            "StatusTypeID": 50,
            "LevelID": 2,
            "PowerKW": 22,
            "CurrentTypeID": 10
        },
        {
            "ID": 212457,
            "ConnectionTypeID": 1036,
            "StatusTypeID": 50,
            "LevelID": 2,
            "PowerKW": 22,
            "CurrentTypeID": 20
        },
        {
            "ID": 245294,
            "ConnectionTypeID": 28,
            "StatusTypeID": 50,
            "LevelID": 2,
            "PowerKW": 22,
            "CurrentTypeID": 10
        },
        {
            "ID": 245295,
            "ConnectionTypeID": 1036,
            "StatusTypeID": 50,
            "LevelID": 2,
            "PowerKW": 22,
            "CurrentTypeID": 20
        }
    ],
    "GeneralComments": "En service",
    "StatusTypeID": 50,
    "DateLastStatusUpdate": "2020-08-27T05:12:00Z",
    "DataQualityLevel": 2,
    "DateCreated": "2020-03-15T10:53:00Z",
    "SubmissionStatusTypeID": 100
}