{
    "UserComments": [
        {
            "ID": 6349,
            "ChargePointID": 33250,
            "CommentTypeID": 50,
            "UserName": "dexter",
            "Comment": "NICHT ÖFFENTLICH! Unklare Öffnungszeiten!\nVermutlich sind die Öffnungszeiten des \"Umspannwerk\" und/oder \"Museum Strom und Leben\" relevant: http://www.umspannwerk-recklinghausen.de/\nLaut RWE-App nur Di-Fr 10-17 Uhr, laut Website auch Sa-Mo 10-17 Uhr -- am besten vorher anrufen!",
            "Rating": 1,
            "DateCreated": "2015-08-30T11:58:23.137Z",
            "User": {
                "ID": 4520,
                "Username": "dexter"
            },
            "CheckinStatusTypeID": 200
        },
        {
            "ID": 6348,
            "ChargePointID": 33250,
            "CommentTypeID": 50,
            "UserName": "dexter",
            "Comment": "NICHT ÖFFENTLICH! Unklare Öffnungszeiten!\nVermutlich sind die Öffnungszeiten des \"Umspannwerk\" und/oder \"Museum Strom und Leben\" relevant: http://www.umspannwerk-recklinghausen.de/\nLaut RWE-App nur Di-Fr 10-17 Uhr, laut Website auch Sa-Mo 10-17 Uhr -- am besten vorher anrufen!",
            "Rating": 1,
            "DateCreated": "2015-08-30T11:57:42.027Z",
            "User": {
                "ID": 4520,
                "Username": "dexter"
            },
            "CheckinStatusTypeID": 200
        }
    ],
    "IsRecentlyVerified": false,
    "ID": 33250,
    "UUID": "DB6E189B-7F1F-41EE-96AE-5F468C2B2396",
    "DataProviderID": 1,
    "OperatorID": 105,
    "OperatorsReference": "Essent EM-DE-05562032-02-00001",
    "UsageTypeID": 4,
    "AddressInfo": {
        "ID": 33596,
        "Title": "Uferstraße 2-4",
        "AddressLine1": "Uferstraße 2-4",
        "Town": "Recklinghausen",
        "Postcode": "45661",
        "CountryID": 87,
        "Latitude": 51.561644,
        "Longitude": 7.208236,
        "DistanceUnit": 0
    },
    "Connections": [
        {
            "ID": 36761,
            "ConnectionTypeID": 25,
            "LevelID": 2,
            "PowerKW": 11
        },
        {
            "ID": 46737,
            "ConnectionTypeID": 25,
            "LevelID": 2,
            "PowerKW": 11
        }
    ],
    "NumberOfPoints": 1,
    "StatusTypeID": 50,
    "DateLastStatusUpdate": "2015-08-30T11:58:00Z",
    "DataQualityLevel": 3,
    "DateCreated": "2015-01-09T06:04:00Z",
    "SubmissionStatusTypeID": 200
}