{
    "IsRecentlyVerified": false,
    "ID": 98066,
    "UUID": "33A7BA88-2EF7-48C9-B3C6-4F269A419D7C",
    "DataProviderID": 1,
    "OperatorID": 23,
    "OperatorsReference": "38801",
    "UsageTypeID": 4,
    "AddressInfo": {
        "ID": 98412,
        "Title": "Sport- und Wellnesshotel Bichlhof",
        "AddressLine1": "Bichlnweg 153",
        "Town": "Kitzbuehel",
        "Postcode": "6370",
        "CountryID": 19,
        "Latitude": 47.432478,
        "Longitude": 12.42629,
        "ContactTelephone1": "+43 5356 64022",
        "DistanceUnit": 0
    },
    "Connections": [
        {
            "ID": 138974,
            "ConnectionTypeID": 30,
            "StatusTypeID": 50,
            "LevelID": 2,
            "Amps": 32,
            "Voltage": 400,
            "PowerKW": 22,
            "CurrentTypeID": 20,
            "Quantity": 1
        }
    ],
    "NumberOfPoints": 1,
    "GeneralComments": "1 Tesla Connector, up to 22kW.Available for customers. Please see front desk.",
    "StatusTypeID": 50,
    "DateLastStatusUpdate": "2018-10-03T21:51:00Z",
    "DataQualityLevel": 1,
    "DateCreated": "2018-01-21T17:43:00Z",
    "SubmissionStatusTypeID": 200
}