{
    "IsRecentlyVerified": false,
    "ID": 131149,
    "UUID": "DDF5BC8F-3422-48F5-933D-37675121A0F7",
    "DataProviderID": 2,
    "DataProvidersReference": "139989",
    "OperatorID": 59,
    "UsageTypeID": 1,
    "AddressInfo": {
        "ID": 131495,
        "Title": "Greenlots - 162119",
        "AddressLine1": "195 NeoCity Way",
        "Town": "Kissimmee",
        "StateOrProvince": "FL",
        "Postcode": "34744",
        "CountryID": 2,
        "Latitude": 28.290210723877,
        "Longitude": -81.3716506958008,
        "ContactTelephone1": "855-900-7584",
        "AccessComments": "24 hours daily",
        "RelatedURL": "http://greenlots.com/",
        "DistanceUnit": 0
    },
    "Connections": [
        {
            "ID": 183646,
            "ConnectionTypeID": 1,
            "LevelID": 2,
            "Amps": 16,
            "Voltage": 230,
            "PowerKW": 3.7,
            "CurrentTypeID": 10,
            "Quantity": 2
        }
    ],
    "DateLastStatusUpdate": "2020-06-26T02:52:00Z",
    "DataQualityLevel": 3,
    "DateCreated": "2019-08-29T08:33:00Z",
    "SubmissionStatusTypeID": 100
}