{
    "UserComments": [
        {
            "ID": 22057,
            "ChargePointID": 125827,
            "CommentTypeID": 10,
            "UserName": "ForumElettrico.it",
            "RelatedURL": "https://www.forumelettrico.it/forum/enelx-22-kw-mede-via-rocca-t4993.html",
            "DateCreated": "2020-01-15T17:07:20.947Z",
            "User": {
                "ID": 11749,
                "Username": "ForumElettrico.it"
            },
            "CheckinStatusTypeID": 10,
            "IsActionedByEditor": false
        }
    ],
    "MediaItems": [
        {
            "ID": 20993,
            "ChargePointID": 125827,
            "ItemURL": "https://s3-ap-southeast-2.amazonaws.com/openchargemap/images/IT/OCM125827/OCM-125827.orig.2020011517073122.jpg",
            "ItemThumbnailURL": "https://s3-ap-southeast-2.amazonaws.com/openchargemap/images/IT/OCM125827/OCM-125827.thmb.2020011517073122.jpg",
            "Comment": "",
            "IsEnabled": true,
            "IsVideo": false,
            "IsFeaturedItem": false,
            "IsExternalResource": false,
            "User": {
                "ID": 11749,
                "Username": "ForumElettrico.it"
            },
            "DateCreated": "2020-01-15T17:08:00Z"
        },
        {
            "ID": 20994,
            "ChargePointID": 125827,
            "ItemURL": "https://s3-ap-southeast-2.amazonaws.com/openchargemap/images/IT/OCM125827/OCM-125827.orig.2020011517073839.jpg",
            "ItemThumbnailURL": "https://s3-ap-southeast-2.amazonaws.com/openchargemap/images/IT/OCM125827/OCM-125827.thmb.2020011517073839.jpg",
            "Comment": "",
            "IsEnabled": true,
            "IsVideo": false,
            "IsFeaturedItem": false,
            "IsExternalResource": false,
            "User": {
                "ID": 11749,
                "Username": "ForumElettrico.it"
            },
            "DateCreated": "2020-01-15T17:08:00Z"
        }
    ],
    "IsRecentlyVerified": false,
    "ID": 125827,
    "UUID": "A4BE1C4D-B918-48F6-85A2-9448371B1C58",
    "DataProviderID": 1,
    "OperatorID": 80,
    "UsageTypeID": 4,
    "AddressInfo": {
        "ID": 126173,
        "Title": "Mede Rocca | EnelX",
        "AddressLine1": "Via Professor G. Rocca",
        "Town": "Mede",
        "StateOrProvince": "PV",
        "Postcode": "27035",
        "CountryID": 112,
        "Latitude": 45.10106,
        "Longitude": 8.736962,
        "RelatedURL": "https://www.enelx.com/it/it/emobility",
        "DistanceUnit": 0
    },
    "Connections": [
        {
            "ID": 176339,
            "ConnectionTypeID": 25,
            "StatusTypeID": 50,
            "LevelID": 2,
            "Amps": 32,
            "Voltage": 400,
            "PowerKW": 22,
            "CurrentTypeID": 20,
            "Quantity": 2
        }
    ],
    "NumberOfPoints": 2,
    "StatusTypeID": 50,
    "DateLastStatusUpdate": "2020-01-15T17:11:00Z",
    "DataQualityLevel": 1,
    "DateCreated": "2019-04-29T16:20:00Z",
    "SubmissionStatusTypeID": 200
}