{
    "IsRecentlyVerified": false,
    "ID": 84399,
    "UUID": "A8C8C683-E51A-4B92-8D0D-1A57B2927FF9",
    "DataProviderID": 1,
    "OperatorID": 23,
    "OperatorsReference": "25221",
    "UsageTypeID": 4,
    "AddressInfo": {
        "ID": 84745,
        "Title": "Shenandoah Vineyards",
        "AddressLine1": "12300 Steiner RD",
        "Town": "Plymouth",
        "StateOrProvince": "California",
        "Postcode": "95669",
        "CountryID": 2,
        "Latitude": 38.53681,
        "Longitude": -120.792722,
        "ContactTelephone1": "(209) 245-4455",
        "DistanceUnit": 0
    },
    "Connections": [
        {
            "ID": 119845,
            "ConnectionTypeID": 30,
            "StatusTypeID": 50,
            "LevelID": 2,
            "PowerKW": 16,
            "CurrentTypeID": 20,
            "Quantity": 2
        }
    ],
    "NumberOfPoints": 2,
    "GeneralComments": "2 Tesla Connectors, up to 16kW.Available to the public. Self park.",
    "StatusTypeID": 50,
    "DateLastStatusUpdate": "2017-02-24T06:36:00Z",
    "DataQualityLevel": 1,
    "DateCreated": "2017-02-24T06:36:00Z",
    "SubmissionStatusTypeID": 200
}