{
    "IsRecentlyVerified": false,
    "ID": 135310,
    "UUID": "0001FF87-8B18-4D1C-801A-7D039EA06834",
    "DataProviderID": 1,
    "OperatorID": 105,
    "UsageTypeID": 4,
    "AddressInfo": {
        "ID": 135656,
        "Title": "Nord-Ost-Bad",
        "AddressLine1": "Schonnebeckhöfe 79",
        "AddressLine2": "Schonnebeck",
        "Town": "Essen",
        "StateOrProvince": "Nordrhein-Westfalen",
        "Postcode": "45309",
        "CountryID": 87,
        "Latitude": 51.484967046102724,
        "Longitude": 7.055745326094211,
        "DistanceUnit": 0
    },
    "Connections": [
        {
            "ID": 189571,
            "ConnectionTypeID": 25,
            "StatusTypeID": 50,
            "LevelID": 2,
            "Amps": 32,
            "Voltage": 400,
            "PowerKW": 22,
            "CurrentTypeID": 20,
            "Quantity": 2
        }
    ],
    "NumberOfPoints": 2,
    "StatusTypeID": 50,
    "DateLastStatusUpdate": "2019-12-17T08:40:00Z",
    "DataQualityLevel": 1,
    "DateCreated": "2019-12-17T08:38:00Z",
    "SubmissionStatusTypeID": 200
}