{
    "IsRecentlyVerified": false,
    "ID": 45776,
    "UUID": "8E9C8438-AC6E-40FA-8852-449BE079FBCE",
    "DataProviderID": 1,
    "DataProvidersReference": "2352",
    "AddressInfo": {
        "ID": 46122,
        "Title": "Tesla SC Tystberga",
        "AddressLine1": "Sillekrog 1",
        "Town": "TYSTBERGA",
        "StateOrProvince": "SÖDERMANLAND",
        "Postcode": "61199",
        "CountryID": 216,
        "Latitude": 58.91794,
        "Longitude": 17.36754,
        "AccessComments": "På rastplats Sillekrog längs E4:an, södergående.",
        "DistanceUnit": 0
    },
    "Connections": [
        {
            "ID": 56439,
            "ConnectionTypeID": 0,
            "Reference": "1",
            "LevelID": 2,
            "Amps": 270,
            "Voltage": 480,
            "PowerKW": 135,
            "Comments": "Mode 4"
        },
        {
            "ID": 84188,
            "ConnectionTypeID": 0,
            "Reference": "2",
            "LevelID": 2,
            "Amps": 270,
            "Voltage": 480,
            "PowerKW": 135,
            "Comments": "Mode 4"
        },
        {
            "ID": 84189,
            "ConnectionTypeID": 0,
            "Reference": "3",
            "LevelID": 2,
            "Amps": 270,
            "Voltage": 480,
            "PowerKW": 135,
            "Comments": "Mode 4"
        },
        {
            "ID": 84190,
            "ConnectionTypeID": 0,
            "Reference": "4",
            "LevelID": 2,
            "Amps": 270,
            "Voltage": 480,
            "PowerKW": 135,
            "Comments": "Mode 4"
        },
        {
            "ID": 84191,
            "ConnectionTypeID": 0,
            "Reference": "5",
            "LevelID": 2,
            "Amps": 270,
            "Voltage": 480,
            "PowerKW": 135,
            "Comments": "Mode 4"
        },
        {
            "ID": 88037,
            "ConnectionTypeID": 0,
            "Reference": "6",
            "LevelID": 2,
            "Amps": 270,
            "Voltage": 480,
            "PowerKW": 135,
            "Comments": "Mode 4"
        }
    ],
    "NumberOfPoints": 6,
    "DateLastStatusUpdate": "2020-05-26T08:22:00Z",
    "DataQualityLevel": 2,
    "DateCreated": "2015-05-03T00:54:00Z",
    "SubmissionStatusTypeID": 100
}