{
    "IsRecentlyVerified": false,
    "ID": 57183,
    "UUID": "584648AF-2789-471D-8AD0-1AFB9FF3F0E3",
    "DataProviderID": 1,
    "OperatorID": 45,
    "UsageTypeID": 3,
    "AddressInfo": {
        "ID": 57529,
        "Title": "Kia Autohaus Billwiller",
        "AddressLine1": "Hans-Liebherr-Straße 9",
        "Town": "Biberach",
        "StateOrProvince": "Verwaltungsgemeinschaft Biberach an der Riß",
        "Postcode": "88400",
        "CountryID": 87,
        "Latitude": 48.0916488,
        "Longitude": 9.79651260000003,
        "AccessComments": "Die Säule ist nutzbar: Mo-Fr 8:00-17:30Uhr, Sa: von 09:00 bis 12:30 Uhr ,Mittagspause von 12:15 bis 13:15 Uhr\r\n\r\n\r\n\r\n\r\n\r\n\r\n",
        "RelatedURL": "http://www.kia-billwiller-biberach.de",
        "DistanceUnit": 0
    },
    "Connections": [
        {
            "ID": 72259,
            "ConnectionTypeID": 2,
            "StatusTypeID": 50,
            "LevelID": 3,
            "PowerKW": 50,
            "CurrentTypeID": 30,
            "Quantity": 1
        },
        {
            "ID": 72260,
            "ConnectionTypeID": 33,
            "StatusTypeID": 50,
            "LevelID": 3,
            "PowerKW": 20,
            "CurrentTypeID": 30,
            "Quantity": 1
        }
    ],
    "NumberOfPoints": 2,
    "StatusTypeID": 50,
    "DateLastStatusUpdate": "2015-11-27T18:00:00Z",
    "DataQualityLevel": 1,
    "DateCreated": "2015-11-27T12:22:00Z",
    "SubmissionStatusTypeID": 200
}