{
    "IsRecentlyVerified": false,
    "ID": 173028,
    "UUID": "84C7C416-4A69-47DE-8EFF-5704C7AB6F24",
    "DataProviderID": 1,
    "OperatorID": 150,
    "OperatorsReference": "RV01028",
    "UsageTypeID": 1,
    "UsageCost": "£0.50 + £0.30/kWh",
    "AddressInfo": {
        "ID": 173387,
        "Title": "St Mary Street Car Park",
        "AddressLine1": "St Mary Street",
        "Town": "Thornbury",
        "StateOrProvince": "South Gloucestershire",
        "Postcode": "BS35 2AB",
        "CountryID": 1,
        "Latitude": 51.60675,
        "Longitude": -2.525139,
        "DistanceUnit": 0
    },
    "Connections": [
        {
            "ID": 264741,
            "ConnectionTypeID": 25,
            "Reference": "RV01028",
            "StatusTypeID": 100,
            "LevelID": 2,
            "Amps": 32,
            "Voltage": 400,
            "PowerKW": 22,
            "CurrentTypeID": 20,
            "Quantity": 2
        }
    ],
    "NumberOfPoints": 2,
    "StatusTypeID": 50,
    "DateLastStatusUpdate": "2021-04-04T21:44:00Z",
    "DataQualityLevel": 1,
    "DateCreated": "2021-03-01T13:49:00Z",
    "SubmissionStatusTypeID": 200
}