{
    "IsRecentlyVerified": false,
    "ID": 42713,
    "UUID": "B5C502DB-2E03-4D31-9811-4A53E756F275",
    "DataProviderID": 1,
    "OperatorID": 45,
    "UsageTypeID": 5,
    "UsageCost": "0,50€/kWh",
    "AddressInfo": {
        "ID": 43059,
        "Title": "Wohnmobilstellplatz Remels",
        "AddressLine1": "Schützenstraße 5",
        "Town": "Uplengen",
        "Postcode": "26670",
        "CountryID": 87,
        "Latitude": 53.3072659710169,
        "Longitude": 7.74645509490119,
        "AccessComments": "Den Schildern zum Wohnmobilplatz folgen. Dort sind 6 CEE Steckdosen. Strom kostet 0,50€/kWh. ",
        "DistanceUnit": 0
    },
    "Connections": [
        {
            "ID": 51533,
            "ConnectionTypeID": 16,
            "StatusTypeID": 50,
            "LevelID": 2,
            "Amps": 16,
            "Voltage": 230,
            "PowerKW": 3.7,
            "CurrentTypeID": 10,
            "Quantity": 6
        }
    ],
    "NumberOfPoints": 6,
    "StatusTypeID": 50,
    "DateLastStatusUpdate": "2015-03-21T16:10:00Z",
    "DataQualityLevel": 1,
    "DateCreated": "2015-03-21T14:54:00Z",
    "SubmissionStatusTypeID": 200
}