{
    "IsRecentlyVerified": false,
    "ID": 178862,
    "UUID": "EA55C328-719C-4F58-9B16-79807BC8CC9B",
    "DataProviderID": 1,
    "OperatorID": 45,
    "AddressInfo": {
        "ID": 179221,
        "Title": "Mainzer Landstraße 18",
        "AddressLine1": "Mainzer Landstraße 18",
        "Town": "Nauheim",
        "Postcode": "64569",
        "CountryID": 87,
        "Latitude": 49.9408089,
        "Longitude": 8.4427194,
        "DistanceUnit": 0
    },
    "Connections": [
        {
            "ID": 279846,
            "ConnectionTypeID": 33,
            "StatusTypeID": 50,
            "LevelID": 3,
            "PowerKW": 75,
            "CurrentTypeID": 30
        },
        {
            "ID": 279847,
            "ConnectionTypeID": 33,
            "StatusTypeID": 50,
            "LevelID": 3,
            "PowerKW": 75,
            "CurrentTypeID": 30
        },
        {
            "ID": 279848,
            "ConnectionTypeID": 25,
            "StatusTypeID": 50,
            "LevelID": 2,
            "PowerKW": 22,
            "CurrentTypeID": 20
        }
    ],
    "StatusTypeID": 0,
    "DateLastStatusUpdate": "2021-08-10T05:15:00Z",
    "MetadataValues": [
        {
            "ID": 11156,
            "MetadataFieldID": 4,
            "ItemValue": "Data from the German chargepoint registry provided by Bundesnetzagentur.de under the CC-BY 4.0 license"
        }
    ],
    "DataQualityLevel": 3,
    "DateCreated": "2021-07-08T09:50:00Z",
    "SubmissionStatusTypeID": 100
}