{
    "IsRecentlyVerified": false,
    "ID": 101551,
    "UUID": "389341A1-2A16-4CF6-B19E-3B70FD080ED3",
    "DataProviderID": 1,
    "OperatorID": 23,
    "OperatorsReference": "41782",
    "UsageTypeID": 4,
    "AddressInfo": {
        "ID": 101897,
        "Title": "Best Western Leoso Hotel Ludwigshafen",
        "AddressLine1": "Pasadena Allee 4",
        "Town": "Ludwigshafen am Rhein",
        "Postcode": "67059",
        "CountryID": 87,
        "Latitude": 49.478916,
        "Longitude": 8.435622,
        "ContactTelephone1": "+49 6215 9510",
        "DistanceUnit": 0
    },
    "Connections": [
        {
            "ID": 143360,
            "ConnectionTypeID": 30,
            "StatusTypeID": 50,
            "LevelID": 2,
            "Amps": 32,
            "Voltage": 230,
            "PowerKW": 17,
            "CurrentTypeID": 20,
            "Quantity": 1
        }
    ],
    "NumberOfPoints": 1,
    "GeneralComments": "1 Tesla Connector, up to 17kW.Available for customers. Please see front desk.",
    "StatusTypeID": 50,
    "DateLastStatusUpdate": "2018-10-03T20:24:00Z",
    "DataQualityLevel": 1,
    "DateCreated": "2018-03-30T05:53:00Z",
    "SubmissionStatusTypeID": 200
}