{
    "IsRecentlyVerified": false,
    "ID": 67515,
    "UUID": "200DA4A2-42E6-4E75-A2BB-C199BFCDA335",
    "DataProviderID": 1,
    "OperatorID": 23,
    "OperatorsReference": "14577",
    "UsageTypeID": 1,
    "UsageCost": "Free",
    "AddressInfo": {
        "ID": 67861,
        "Title": "Deerhill Inn - Tesla",
        "AddressLine1": "14 Valley View Dr",
        "Town": "Dover",
        "StateOrProvince": "VT",
        "Postcode": "05356",
        "CountryID": 2,
        "Latitude": 42.939579,
        "Longitude": -72.8490205,
        "ContactTelephone1": "802-464-3100  877-798-3752",
        "AccessComments": "24 hours daily; for Tesla use only; for guest use only",
        "RelatedURL": "http://www.teslamotors.com/supercharger",
        "DistanceUnit": 0
    },
    "Connections": [
        {
            "ID": 93020,
            "ConnectionTypeID": 30,
            "StatusTypeID": 50,
            "LevelID": 2,
            "Amps": 16,
            "Voltage": 230,
            "PowerKW": 8,
            "CurrentTypeID": 10,
            "Quantity": 1
        }
    ],
    "NumberOfPoints": 1,
    "StatusTypeID": 50,
    "DateLastStatusUpdate": "2017-01-26T03:26:00Z",
    "DataQualityLevel": 3,
    "DateCreated": "2016-05-29T02:05:00Z",
    "SubmissionStatusTypeID": 100
}