{
    "IsRecentlyVerified": false,
    "ID": 173494,
    "UUID": "A45E42C4-B8EC-4270-8960-6C76CE7986AD",
    "DataProviderID": 18,
    "DataProvidersReference": "9da04ad6afd30402c7d9d3db73457744",
    "OperatorID": 25,
    "UsageTypeID": 4,
    "AddressInfo": {
        "ID": 173853,
        "Title": "Stanhope Road (Croydon)",
        "AddressLine1": "Stanhope Road (Croydon)",
        "Town": "Croydon",
        "Postcode": "CR0 5NS ",
        "CountryID": 1,
        "Latitude": 51.369109,
        "Longitude": -0.08925,
        "AccessComments": "",
        "RelatedURL": "https://www.sourcelondon.net",
        "DistanceUnit": 0
    },
    "Connections": [
        {
            "ID": 266544,
            "ConnectionTypeID": 1,
            "Reference": "1",
            "StatusTypeID": 50,
            "LevelID": 2,
            "Amps": 13,
            "Voltage": 230,
            "PowerKW": 3,
            "CurrentTypeID": 10
        },
        {
            "ID": 266545,
            "ConnectionTypeID": 25,
            "Reference": "2",
            "StatusTypeID": 50,
            "LevelID": 2,
            "Amps": 32,
            "Voltage": 230,
            "PowerKW": 7,
            "CurrentTypeID": 10
        }
    ],
    "StatusTypeID": 0,
    "DateLastStatusUpdate": "2021-03-03T11:25:00Z",
    "MetadataValues": [
        {
            "ID": 8416,
            "MetadataFieldID": 4,
            "ItemValue": "Contains public sector information licensed under the Open Government Licence v2.0. http://www.nationalarchives.gov.uk/doc/open-government-licence/version/2/"
        }
    ],
    "DataQualityLevel": 3,
    "DateCreated": "2021-03-03T11:25:00Z",
    "SubmissionStatusTypeID": 100
}