{
    "IsRecentlyVerified": false,
    "ID": 64114,
    "UUID": "5E6080FA-3E21-4B26-9B7B-66057F93ED42",
    "DataProviderID": 26,
    "DataProvidersReference": "82393",
    "OperatorID": 73,
    "OperatorsReference": "EV-Box EVB-P1423089",
    "UsageCost": "0.00 jaarabonnement",
    "AddressInfo": {
        "ID": 64460,
        "Title": "Boermarkeweg",
        "AddressLine1": "Boermarkeweg",
        "Town": "Emmen",
        "Postcode": "7824 AA",
        "CountryID": 159,
        "Latitude": 52.78521,
        "Longitude": 6.91476,
        "RelatedURL": "http://www.ev-box.nl",
        "DistanceUnit": 0
    },
    "Connections": [
        {
            "ID": 82004,
            "ConnectionTypeID": 25,
            "LevelID": 2,
            "PowerKW": 11,
            "CurrentTypeID": 10
        },
        {
            "ID": 82005,
            "ConnectionTypeID": 25,
            "LevelID": 2,
            "PowerKW": 11,
            "CurrentTypeID": 10
        }
    ],
    "NumberOfPoints": 1,
    "StatusTypeID": 50,
    "DateLastStatusUpdate": "2016-06-04T02:55:00Z",
    "DataQualityLevel": 3,
    "DateCreated": "2016-03-03T12:33:00Z",
    "SubmissionStatusTypeID": 100
}