{
    "IsRecentlyVerified": false,
    "ID": 8530,
    "UUID": "231E2B08-067C-4A3C-B13C-92B33F869D73",
    "DataProviderID": 15,
    "DataProvidersReference": "10495",
    "OperatorID": 1,
    "AddressInfo": {
        "ID": 8427,
        "Title": "10 E. Union St.",
        "AddressLine1": "10 E. Union St.",
        "Town": "Pasadena",
        "StateOrProvince": "CA",
        "Postcode": "91103",
        "CountryID": 2,
        "Latitude": 34.14665,
        "Longitude": -118.14979,
        "ContactTelephone1": "",
        "RelatedURL": "http://carstations.com/10495",
        "DistanceUnit": 0
    },
    "Connections": [
        {
            "ID": 5954,
            "ConnectionTypeID": 7,
            "Reference": "AVCON"
        }
    ],
    "StatusTypeID": 50,
    "DateLastStatusUpdate": "2017-11-04T14:04:00Z",
    "DataQualityLevel": 1,
    "DateCreated": "2011-11-11T12:06:00Z",
    "SubmissionStatusTypeID": 100
}