{
    "IsRecentlyVerified": false,
    "ID": 111407,
    "UUID": "B478649E-BA7F-4EC1-94A3-82E7EB457813",
    "DataProviderID": 2,
    "DataProvidersReference": "91276",
    "OperatorID": 5,
    "UsageTypeID": 1,
    "AddressInfo": {
        "ID": 111753,
        "Title": "JLR LAVAL",
        "AddressLine1": "2350 Boulevard Chomedey",
        "Town": "Laval",
        "StateOrProvince": "QC",
        "Postcode": "H7T 2K5",
        "CountryID": 44,
        "Latitude": 45.5607087,
        "Longitude": -73.7581086,
        "ContactTelephone1": "888-758-4389",
        "AccessComments": "24 hours daily",
        "RelatedURL": "http://www.chargepoint.com/",
        "DistanceUnit": 0
    },
    "Connections": [
        {
            "ID": 156826,
            "ConnectionTypeID": 1,
            "LevelID": 2,
            "Amps": 16,
            "Voltage": 230,
            "PowerKW": 3,
            "CurrentTypeID": 10,
            "Quantity": 2
        }
    ],
    "DateLastStatusUpdate": "2019-04-06T05:07:00Z",
    "DataQualityLevel": 3,
    "DateCreated": "2018-10-18T23:37:00Z",
    "SubmissionStatusTypeID": 100
}