{
    "UserComments": [
        {
            "ID": 17283,
            "ChargePointID": 19723,
            "CommentTypeID": 10,
            "UserName": "Simon Hewison",
            "Comment": "There's now two cones that can block some of the bays from ICEing. Worked, but now requires Polar network card - old Source East / Source London cards no longer work.",
            "DateCreated": "2017-05-07T16:07:26.053Z",
            "User": {
                "ID": 4575,
                "Username": "Simon Hewison"
            },
            "CheckinStatusTypeID": 10
        },
        {
            "ID": 8155,
            "ChargePointID": 19723,
            "CommentTypeID": 10,
            "UserName": "Jason Hockley",
            "Comment": "I visit this Waitrose fairly frequently. I actually live in Welwyn Garden City so rarely need to use the charger, but I always take a look. They are almost always ICEd. I've pointed this out to the staff, but nothing seems to have been done about it yet.\r\n",
            "Rating": 2,
            "DateCreated": "2015-12-06T23:44:59.897Z",
            "User": {
                "ID": 6275,
                "Username": "Jason Hockley"
            },
            "CheckinStatusTypeID": 200
        },
        {
            "ID": 8153,
            "ChargePointID": 19723,
            "CommentTypeID": 10,
            "UserName": "Simon Hewison",
            "Comment": "7kW worked perfectly with Source Londom card. Two of four bays ICEd",
            "DateCreated": "2015-12-06T13:07:33.173Z",
            "User": {
                "ID": 4575,
                "Username": "Simon Hewison"
            },
            "CheckinStatusTypeID": 10
        },
        {
            "ID": 3681,
            "ChargePointID": 19723,
            "CommentTypeID": 10,
            "UserName": "AlexanderSims",
            "Comment": "Located in far corner of ground floor car park.\nWhen I visited there were two cones restricting access for EVs only.\nAll good with the left charge point.",
            "Rating": 5,
            "DateCreated": "2015-01-31T22:11:45.687Z",
            "User": {
                "ID": 1171,
                "Username": "AlexanderSims"
            },
            "CheckinStatusTypeID": 10
        }
    ],
    "MediaItems": [
        {
            "ID": 3568,
            "ChargePointID": 19723,
            "ItemURL": "https://s3-ap-southeast-2.amazonaws.com/openchargemap/images/GB/OCM19723/OCM-19723.orig.2015120613104621.jpg",
            "ItemThumbnailURL": "https://s3-ap-southeast-2.amazonaws.com/openchargemap/images/GB/OCM19723/OCM-19723.thmb.2015120613104621.jpg",
            "Comment": "",
            "IsEnabled": true,
            "IsVideo": false,
            "IsFeaturedItem": false,
            "IsExternalResource": false,
            "User": {
                "ID": 4575,
                "Username": "Simon Hewison"
            },
            "DateCreated": "2015-12-06T13:11:00Z"
        }
    ],
    "IsRecentlyVerified": false,
    "ID": 19723,
    "UUID": "C5BA65BF-AD86-4F66-9F95-615D46FA6D00",
    "DataProviderID": 1,
    "OperatorID": 32,
    "OperatorsReference": "1851,1854",
    "UsageTypeID": 4,
    "UsageCost": "Inclusive; for Polar Plus subscription members only",
    "AddressInfo": {
        "ID": 20068,
        "Title": "Waitrose Welwyn Garden City",
        "AddressLine1": "Off College Way",
        "Town": "Welwyn Garden City",
        "StateOrProvince": "Hertfordshire",
        "Postcode": "AL8 6UN",
        "CountryID": 1,
        "Latitude": 51.8032315946953,
        "Longitude": -0.202951784377996,
        "AccessComments": "Located in far corner of car park on ground floor.",
        "DistanceUnit": 0
    },
    "Connections": [
        {
            "ID": 45151,
            "ConnectionTypeID": 25,
            "StatusTypeID": 50,
            "LevelID": 2,
            "Amps": 32,
            "Voltage": 240,
            "PowerKW": 7,
            "CurrentTypeID": 10,
            "Quantity": 4
        }
    ],
    "NumberOfPoints": 4,
    "GeneralComments": "Chargemaster posts. Formerly on Formerly on Source East.",
    "StatusTypeID": 50,
    "DateLastStatusUpdate": "2019-03-08T06:16:00Z",
    "MetadataValues": [
        {
            "ID": 292,
            "MetadataFieldID": 4,
            "ItemValue": "Data © OpenStreetMap contributors, ODbL 1.0. http://www.openstreetmap.org/copyright"
        }
    ],
    "DataQualityLevel": 1,
    "DateCreated": "2013-10-12T09:34:00Z",
    "SubmissionStatusTypeID": 200
}