{
    "IsRecentlyVerified": false,
    "ID": 143856,
    "UUID": "F73279BC-CDBB-43DA-815E-66822C0817C4",
    "DataProviderID": 2,
    "DataProvidersReference": "129338",
    "UsageTypeID": 1,
    "AddressInfo": {
        "ID": 144208,
        "Title": "Green Mountain Power",
        "AddressLine1": "163 Acorn Ln",
        "Town": "Colchester",
        "StateOrProvince": "VT",
        "Postcode": "05446",
        "CountryID": 2,
        "Latitude": 44.518112,
        "Longitude": -73.184081,
        "ContactTelephone1": "888-835-4672",
        "AccessComments": "24 hours daily",
        "RelatedURL": "",
        "DistanceUnit": 0
    },
    "Connections": [
        {
            "ID": 200264,
            "ConnectionTypeID": 22,
            "LevelID": 1,
            "Amps": 16,
            "Voltage": 120,
            "PowerKW": 1.9,
            "CurrentTypeID": 10,
            "Quantity": 2
        },
        {
            "ID": 200265,
            "ConnectionTypeID": 1,
            "LevelID": 2,
            "Amps": 16,
            "Voltage": 230,
            "PowerKW": 3.7,
            "CurrentTypeID": 10,
            "Quantity": 2
        }
    ],
    "StatusTypeID": 50,
    "DateLastStatusUpdate": "2020-06-26T03:08:00Z",
    "DataQualityLevel": 3,
    "DateCreated": "2019-12-24T09:22:00Z",
    "SubmissionStatusTypeID": 100
}