{
    "IsRecentlyVerified": false,
    "ID": 155546,
    "UUID": "09A276D3-1EA0-4C99-889F-5CF7293C6357",
    "DataProviderID": 1,
    "OperatorID": 45,
    "UsageTypeID": 1,
    "AddressInfo": {
        "ID": 155900,
        "Title": "Sundance Apartments",
        "AddressLine1": "",
        "CountryID": 18,
        "Latitude": -31.89732867830553,
        "Longitude": 115.7595320223254,
        "DistanceUnit": 0
    },
    "Connections": [
        {
            "ID": 218971,
            "ConnectionTypeID": 1,
            "StatusTypeID": 50,
            "LevelID": 2,
            "PowerKW": 7,
            "Quantity": 1
        }
    ],
    "NumberOfPoints": 1,
    "GeneralComments": "use any rfid to activate",
    "StatusTypeID": 50,
    "DateLastStatusUpdate": "2021-10-13T06:03:00Z",
    "DataQualityLevel": 1,
    "DateCreated": "2020-04-18T04:24:00Z",
    "SubmissionStatusTypeID": 200
}