{
    "IsRecentlyVerified": false,
    "ID": 32192,
    "UUID": "B89083D9-DC92-4B7F-9992-3A26D93DEBA2",
    "DataProviderID": 1,
    "OperatorID": 105,
    "OperatorsReference": "Essent EM-DE-05334024-01-00001",
    "UsageTypeID": 4,
    "AddressInfo": {
        "ID": 32538,
        "Title": "Hauptstr. 55",
        "AddressLine1": "Hauptstr. 55",
        "Town": "Roetgen",
        "Postcode": "52159",
        "CountryID": 87,
        "Latitude": 50.647875,
        "Longitude": 6.195205,
        "DistanceUnit": 0
    },
    "Connections": [
        {
            "ID": 35703,
            "ConnectionTypeID": 25,
            "LevelID": 2,
            "PowerKW": 11
        },
        {
            "ID": 46280,
            "ConnectionTypeID": 25,
            "LevelID": 2,
            "PowerKW": 11
        }
    ],
    "NumberOfPoints": 1,
    "StatusTypeID": 50,
    "DateLastStatusUpdate": "2015-04-13T22:55:00Z",
    "DataQualityLevel": 3,
    "DateCreated": "2015-01-09T06:03:00Z",
    "SubmissionStatusTypeID": 200
}