{
    "IsRecentlyVerified": false,
    "ID": 123852,
    "UUID": "173856D0-8B49-42B2-AFE6-F450E54A2128",
    "DataProviderID": 2,
    "DataProvidersReference": "82567",
    "OperatorID": 5,
    "UsageTypeID": 1,
    "AddressInfo": {
        "ID": 124198,
        "Title": "SANTA CLARA",
        "AddressLine1": "611-695 Moreland Way",
        "Town": "Santa Clara",
        "StateOrProvince": "CA",
        "Postcode": "95054",
        "CountryID": 2,
        "Latitude": 37.396169,
        "Longitude": -121.94559,
        "ContactTelephone1": "888-758-4389",
        "AccessComments": "24 hours daily",
        "RelatedURL": "http://www.chargepoint.com/",
        "DistanceUnit": 0
    },
    "Connections": [
        {
            "ID": 173883,
            "ConnectionTypeID": 1,
            "LevelID": 2,
            "Amps": 16,
            "Voltage": 230,
            "PowerKW": 3,
            "CurrentTypeID": 10,
            "Quantity": 4
        }
    ],
    "DateLastStatusUpdate": "2019-12-24T09:13:00Z",
    "DataQualityLevel": 3,
    "DateCreated": "2019-04-06T05:03:00Z",
    "SubmissionStatusTypeID": 100
}