{
    "IsRecentlyVerified": false,
    "ID": 46949,
    "UUID": "2664FD8F-DC7A-40AC-A48A-A4AE334B58DA",
    "DataProviderID": 1,
    "OperatorID": 157,
    "OperatorsReference": "NewMotion 03000663",
    "UsageCost": "0.00 jaarabonnement",
    "AddressInfo": {
        "ID": 47295,
        "Title": "B 304 13",
        "AddressLine1": "B 304 13",
        "Town": "Nußdorf",
        "Postcode": "83365",
        "CountryID": 87,
        "Latitude": 47.911428,
        "Longitude": 12.609238,
        "ContactTelephone1": "088 0109500",
        "RelatedURL": "http://thenewmotion.nl/",
        "DistanceUnit": 0
    },
    "Connections": [
        {
            "ID": 57770,
            "ConnectionTypeID": 25,
            "LevelID": 2,
            "PowerKW": 22,
            "CurrentTypeID": 10
        }
    ],
    "NumberOfPoints": 1,
    "StatusTypeID": 50,
    "DateLastStatusUpdate": "2021-04-25T05:14:00Z",
    "DataQualityLevel": 3,
    "DateCreated": "2015-05-11T09:12:00Z",
    "SubmissionStatusTypeID": 200
}