{
    "IsRecentlyVerified": false,
    "ID": 74082,
    "UUID": "D41B9B4B-485C-4DF4-8662-32B9E0350A5F",
    "DataProviderID": 1,
    "OperatorID": 89,
    "OperatorsReference": "AAA-532",
    "UsageTypeID": 4,
    "UsageCost": "CAD 1.00/hour",
    "AddressInfo": {
        "ID": 74428,
        "Title": "Csda-École Henri-Bourassa / Soleil de l'Aube",
        "AddressLine1": "283 Boul. d'Iberville",
        "Town": "Repentigny",
        "StateOrProvince": "QC",
        "Postcode": "J6A 2A4",
        "CountryID": 44,
        "Latitude": 45.730355,
        "Longitude": -73.461541,
        "DistanceUnit": 0
    },
    "Connections": [
        {
            "ID": 106406,
            "ConnectionTypeID": 1,
            "StatusTypeID": 50,
            "LevelID": 2,
            "Amps": 32,
            "Voltage": 230,
            "PowerKW": 7,
            "CurrentTypeID": 10,
            "Quantity": 1
        }
    ],
    "NumberOfPoints": 1,
    "StatusTypeID": 50,
    "DateLastStatusUpdate": "2017-04-06T05:35:00Z",
    "DataQualityLevel": 1,
    "DateCreated": "2016-11-24T00:13:00Z",
    "SubmissionStatusTypeID": 200
}