{
    "IsRecentlyVerified": false,
    "ID": 20531,
    "UUID": "5981E72A-C4C1-4521-8405-2C4D19BCBBA7",
    "DataProviderID": 15,
    "DataProvidersReference": "36672",
    "OperatorID": 42,
    "UsageTypeID": 1,
    "AddressInfo": {
        "ID": 20876,
        "Title": "5800 Godfrey Road",
        "AddressLine1": "5800 Godfrey Road",
        "Town": "Godfrey",
        "StateOrProvince": "IL",
        "Postcode": "62035",
        "CountryID": 2,
        "Latitude": 38.94987,
        "Longitude": -90.19501,
        "ContactTelephone1": "618-468-2782",
        "RelatedURL": "http://carstations.com/36672",
        "DistanceUnit": 0
    },
    "Connections": [
        {
            "ID": 20062,
            "ConnectionTypeID": 1,
            "Reference": "J1772",
            "LevelID": 2
        }
    ],
    "NumberOfPoints": 2,
    "StatusTypeID": 50,
    "DateLastStatusUpdate": "2017-11-04T14:04:00Z",
    "DataQualityLevel": 2,
    "DateCreated": "2013-11-26T05:18:00Z",
    "SubmissionStatusTypeID": 100
}