{
    "IsRecentlyVerified": false,
    "ID": 184722,
    "UUID": "030A2D32-255C-49F0-A810-BBDB20100C62",
    "DataProviderID": 29,
    "DataProvidersReference": "20782",
    "OperatorID": 86,
    "AddressInfo": {
        "ID": 185081,
        "Title": "Boschstr. 6",
        "AddressLine1": "Boschstr. 6",
        "Town": "Blaustein",
        "Postcode": "89134",
        "CountryID": 87,
        "Latitude": 48.416998,
        "Longitude": 9.918955,
        "DistanceUnit": 0
    },
    "Connections": [
        {
            "ID": 293335,
            "ConnectionTypeID": 28,
            "StatusTypeID": 50,
            "LevelID": 2,
            "PowerKW": 22,
            "CurrentTypeID": 20
        },
        {
            "ID": 293336,
            "ConnectionTypeID": 25,
            "StatusTypeID": 50,
            "LevelID": 2,
            "PowerKW": 22,
            "CurrentTypeID": 20
        },
        {
            "ID": 295799,
            "ConnectionTypeID": 28,
            "StatusTypeID": 50,
            "LevelID": 2,
            "PowerKW": 22,
            "CurrentTypeID": 20
        },
        {
            "ID": 295800,
            "ConnectionTypeID": 25,
            "StatusTypeID": 50,
            "LevelID": 2,
            "PowerKW": 22,
            "CurrentTypeID": 20
        }
    ],
    "StatusTypeID": 50,
    "DateLastStatusUpdate": "2021-07-12T02:41:00Z",
    "MetadataValues": [
        {
            "ID": 17013,
            "MetadataFieldID": 4,
            "ItemValue": "Data from the German chargepoint registry provided by Bundesnetzagentur.de under the CC-BY 4.0 license"
        }
    ],
    "DataQualityLevel": 3,
    "DateCreated": "2021-07-08T10:05:00Z",
    "SubmissionStatusTypeID": 100
}