{
    "IsRecentlyVerified": false,
    "ID": 149773,
    "UUID": "3CDB84AF-4C69-42F7-8879-3ECAE17069EF",
    "DataProviderID": 18,
    "DataProvidersReference": "a8db5bb878f83a62036d2eb0a0a1af5d",
    "OperatorID": 3391,
    "UsageTypeID": 1,
    "AddressInfo": {
        "ID": 150126,
        "Title": "Norfolk Road",
        "AddressLine1": "Norfolk Road",
        "Town": "Brighton",
        "Postcode": "BN1 3AA",
        "CountryID": 1,
        "Latitude": 50.825364,
        "Longitude": -0.15471,
        "AccessComments": "",
        "RelatedURL": "https://www.electricblueuk.com/",
        "DistanceUnit": 0
    },
    "Connections": [
        {
            "ID": 207946,
            "ConnectionTypeID": 25,
            "Reference": "62196-2 (SINGLE PHASE)",
            "StatusTypeID": 50,
            "LevelID": 2,
            "Amps": 16,
            "Voltage": 230,
            "PowerKW": 3.7,
            "CurrentTypeID": 10
        }
    ],
    "StatusTypeID": 0,
    "DateLastStatusUpdate": "2020-03-17T08:53:00Z",
    "MetadataValues": [
        {
            "ID": 7034,
            "MetadataFieldID": 4,
            "ItemValue": "Contains public sector information licensed under the Open Government Licence v2.0. http://www.nationalarchives.gov.uk/doc/open-government-licence/version/2/"
        }
    ],
    "DataQualityLevel": 3,
    "DateCreated": "2020-03-05T14:22:00Z",
    "SubmissionStatusTypeID": 100
}