{
    "IsRecentlyVerified": false,
    "ID": 180671,
    "UUID": "B024ECB3-1CC6-4410-AF00-9C2B32E3D4FD",
    "DataProviderID": 29,
    "DataProvidersReference": "685",
    "OperatorID": 165,
    "AddressInfo": {
        "ID": 181030,
        "Title": "Oeder Weg 43",
        "AddressLine1": "Oeder Weg 43",
        "Town": "Frankfurt am Main",
        "Postcode": "60318",
        "CountryID": 87,
        "Latitude": 50.121128,
        "Longitude": 8.6801,
        "DistanceUnit": 0
    },
    "Connections": [
        {
            "ID": 284037,
            "ConnectionTypeID": 25,
            "StatusTypeID": 50,
            "LevelID": 2,
            "PowerKW": 22,
            "CurrentTypeID": 20
        },
        {
            "ID": 284038,
            "ConnectionTypeID": 25,
            "StatusTypeID": 50,
            "LevelID": 2,
            "PowerKW": 22,
            "CurrentTypeID": 20
        }
    ],
    "StatusTypeID": 50,
    "DateLastStatusUpdate": "2021-07-12T02:44:00Z",
    "MetadataValues": [
        {
            "ID": 12965,
            "MetadataFieldID": 4,
            "ItemValue": "Data from the German chargepoint registry provided by Bundesnetzagentur.de under the CC-BY 4.0 license"
        }
    ],
    "DataQualityLevel": 3,
    "DateCreated": "2021-07-08T10:00:00Z",
    "SubmissionStatusTypeID": 100
}