{
    "IsRecentlyVerified": false,
    "ID": 81888,
    "UUID": "BE7B78A5-C86D-4406-B9AF-62A48B6548E1",
    "DataProviderID": 1,
    "OperatorID": 23,
    "OperatorsReference": "21420",
    "UsageTypeID": 6,
    "AddressInfo": {
        "ID": 82234,
        "Title": "Le Clervaux Boutique & Design Hotel",
        "AddressLine1": "9 Grand Rue",
        "Town": "Clervaux",
        "StateOrProvince": "Diekirch",
        "Postcode": "9710",
        "CountryID": 132,
        "Latitude": 50.053043,
        "Longitude": 6.030075,
        "ContactTelephone1": "+352 92 11 05",
        "DistanceUnit": 0
    },
    "Connections": [
        {
            "ID": 116647,
            "ConnectionTypeID": 30,
            "StatusTypeID": 50,
            "LevelID": 2,
            "Amps": 16,
            "Voltage": 400,
            "PowerKW": 11,
            "CurrentTypeID": 20,
            "Quantity": 2
        }
    ],
    "NumberOfPoints": 2,
    "GeneralComments": "2 Tesla Connectors, up to 11kW.Available for patrons only. Please call ahead.",
    "StatusTypeID": 50,
    "DateLastStatusUpdate": "2018-10-03T23:46:00Z",
    "DataQualityLevel": 1,
    "DateCreated": "2017-02-03T13:24:00Z",
    "SubmissionStatusTypeID": 200
}