{
    "UserComments": [
        {
            "ID": 17729,
            "ChargePointID": 93175,
            "CommentTypeID": 10,
            "UserName": "Simon Hewison",
            "Comment": "Location does not yet show up on Allego's maps, or their Smoov app",
            "Rating": 2,
            "DateCreated": "2017-09-21T08:53:34.773Z",
            "User": {
                "ID": 4575,
                "Username": "Simon Hewison"
            },
            "CheckinStatusTypeID": 0
        }
    ],
    "IsRecentlyVerified": false,
    "ID": 93175,
    "UUID": "43A1D016-ADA0-48ED-BA3A-6817B48F456F",
    "DataProviderID": 1,
    "OperatorID": 103,
    "OperatorsReference": "UKALLEGO000100",
    "UsageTypeID": 1,
    "UsageCost": "£0.49/kWh",
    "AddressInfo": {
        "ID": 93521,
        "Title": "Shell Recharge Whyteleafe",
        "AddressLine1": "408 Godstone Road",
        "Town": "Whyteleafe",
        "StateOrProvince": "Surrey",
        "Postcode": "CR3 0BB",
        "CountryID": 1,
        "Latitude": 51.3040914412383,
        "Longitude": -0.0770255742049786,
        "RelatedURL": "https://www.smoovapp.eu/en/",
        "DistanceUnit": 0
    },
    "Connections": [
        {
            "ID": 131984,
            "ConnectionTypeID": 2,
            "StatusTypeID": 50,
            "LevelID": 3,
            "PowerKW": 50,
            "CurrentTypeID": 30,
            "Quantity": 1
        },
        {
            "ID": 131985,
            "ConnectionTypeID": 33,
            "StatusTypeID": 50,
            "LevelID": 3,
            "PowerKW": 50,
            "CurrentTypeID": 30,
            "Quantity": 1
        },
        {
            "ID": 131986,
            "ConnectionTypeID": 1036,
            "StatusTypeID": 50,
            "LevelID": 3,
            "Amps": 63,
            "Voltage": 400,
            "PowerKW": 43,
            "CurrentTypeID": 20,
            "Quantity": 1
        }
    ],
    "NumberOfPoints": 1,
    "GeneralComments": "Charging Company is called Allego and the App used to charge is “Smoov” App. Can also use the New Motion or Shell RFID.",
    "StatusTypeID": 50,
    "DateLastStatusUpdate": "2020-12-30T20:14:00Z",
    "DataQualityLevel": 1,
    "DateCreated": "2017-09-21T07:28:00Z",
    "SubmissionStatusTypeID": 200
}