{
    "IsRecentlyVerified": false,
    "ID": 5350,
    "UUID": "ED564693-F141-4AC9-84F5-C2D2486FE1B8",
    "DataProviderID": 1,
    "DataProvidersReference": "STR-00001",
    "OperatorID": 21,
    "UsageTypeID": 4,
    "UsageCost": "Mobi.E compatible card",
    "AddressInfo": {
        "ID": 5289,
        "Title": "STR-00001",
        "AddressLine1": "Praça do Município 19",
        "Town": "Santarém",
        "Postcode": "2005-245",
        "CountryID": 180,
        "Latitude": 39.238945,
        "Longitude": -8.6867353,
        "RelatedURL": "http://www.mobie.pt",
        "DistanceUnit": 0
    },
    "Connections": [
        {
            "ID": 33339,
            "ConnectionTypeID": 25,
            "StatusTypeID": 50,
            "LevelID": 2,
            "Amps": 32,
            "Voltage": 400,
            "PowerKW": 22,
            "CurrentTypeID": 20,
            "Quantity": 2
        }
    ],
    "NumberOfPoints": 2,
    "StatusTypeID": 50,
    "DateLastStatusUpdate": "2020-08-08T14:10:00Z",
    "DataQualityLevel": 1,
    "DateCreated": "2011-08-25T12:48:00Z",
    "SubmissionStatusTypeID": 100
}