{
    "IsRecentlyVerified": false,
    "ID": 113572,
    "UUID": "91FA7F69-5635-47BF-965E-99EFE123A70C",
    "DataProviderID": 1,
    "OperatorID": 80,
    "UsageTypeID": 4,
    "AddressInfo": {
        "ID": 113918,
        "Title": "Fontanile Via Roma | Enelx",
        "AddressLine1": "Via Roma",
        "Town": "Fontanile",
        "StateOrProvince": "AT",
        "Postcode": "14044 ",
        "CountryID": 112,
        "Latitude": 44.75506627715653,
        "Longitude": 8.427383555823432,
        "ContactTelephone1": "800.069.850",
        "RelatedURL": "https://www.enelx.com/it/it/emobility",
        "DistanceUnit": 0
    },
    "Connections": [
        {
            "ID": 160048,
            "ConnectionTypeID": 25,
            "StatusTypeID": 50,
            "LevelID": 2,
            "Amps": 32,
            "Voltage": 400,
            "PowerKW": 22,
            "CurrentTypeID": 20,
            "Quantity": 2
        }
    ],
    "NumberOfPoints": 2,
    "StatusTypeID": 50,
    "DateLastStatusUpdate": "2018-12-20T13:50:00Z",
    "DataQualityLevel": 1,
    "DateCreated": "2018-12-20T13:50:00Z",
    "SubmissionStatusTypeID": 200
}