{
    "IsRecentlyVerified": false,
    "ID": 40319,
    "UUID": "83AF35F0-781E-4222-8A1F-09EF06F13A14",
    "DataProviderID": 2,
    "DataProvidersReference": "64958",
    "UsageTypeID": 1,
    "AddressInfo": {
        "ID": 40665,
        "Title": "Woodbridge Town Hall",
        "AddressLine1": "11 Meetinghouse Ln",
        "Town": "Woodbridge",
        "StateOrProvince": "CT",
        "Postcode": "06525",
        "CountryID": 2,
        "Latitude": 41.354138,
        "Longitude": -73.014176,
        "ContactTelephone1": "203-389-3482",
        "AccessComments": "24 hours daily",
        "RelatedURL": "",
        "DistanceUnit": 0
    },
    "Connections": [
        {
            "ID": 43883,
            "ConnectionTypeID": 1,
            "LevelID": 2,
            "Amps": 16,
            "Voltage": 230,
            "PowerKW": 3.7,
            "CurrentTypeID": 10,
            "Quantity": 2
        }
    ],
    "DateLastStatusUpdate": "2020-06-26T03:04:00Z",
    "DataQualityLevel": 3,
    "DateCreated": "2015-01-10T01:01:00Z",
    "SubmissionStatusTypeID": 100
}