{
    "IsRecentlyVerified": false,
    "ID": 41806,
    "UUID": "73797656-4EA6-4E3D-88F3-70686382F8A4",
    "DataProviderID": 1,
    "OperatorID": 45,
    "UsageTypeID": 4,
    "AddressInfo": {
        "ID": 42152,
        "Title": "Boltenhagener Appartement GmbH",
        "AddressLine1": "Ostseeallee 10",
        "Town": "Boltenhagen",
        "StateOrProvince": "Klützer Winkel",
        "Postcode": "23946",
        "CountryID": 87,
        "Latitude": 53.98707,
        "Longitude": 11.2040303,
        "ContactTelephone1": "0385 7552263",
        "AccessComments": "Bestandteil des Projekts \"WEMAG Energiestraße\". Infos über Ladestationen hier: http://www.speicher-hotel.com/files/upload/files/2013-9_Lokalanzeiger_Energiestrasse.pdf, Betreiber sind die jeweiligen Inhaber.",
        "RelatedURL": "http://wemag.com/ueber_die_wemag/oekostrategie/oekomobilitaet/",
        "DistanceUnit": 0
    },
    "Connections": [
        {
            "ID": 50075,
            "ConnectionTypeID": 28,
            "StatusTypeID": 50,
            "LevelID": 2,
            "Amps": 16,
            "Voltage": 230,
            "PowerKW": 3.7,
            "CurrentTypeID": 10,
            "Quantity": 1
        }
    ],
    "NumberOfPoints": 1,
    "StatusTypeID": 50,
    "DateLastStatusUpdate": "2015-02-12T21:26:00Z",
    "DataQualityLevel": 1,
    "DateCreated": "2015-02-10T11:44:00Z",
    "SubmissionStatusTypeID": 200
}