{
    "IsRecentlyVerified": false,
    "ID": 28080,
    "UUID": "2BE8561F-CAD4-4D56-B212-8EEADAFF81BB",
    "DataProviderID": 2,
    "DataProvidersReference": "61603",
    "OperatorID": 5,
    "UsageTypeID": 1,
    "AddressInfo": {
        "ID": 28426,
        "Title": "TOWSON BMW",
        "AddressLine1": "700 Kenilworth Dr",
        "Town": "Towson",
        "StateOrProvince": "MD",
        "Postcode": "21204",
        "CountryID": 2,
        "Latitude": 39.4103019,
        "Longitude": -76.6166114,
        "ContactTelephone1": "888-758-4389",
        "AccessComments": "24 hours daily",
        "RelatedURL": "http://www.chargepoint.com/",
        "DistanceUnit": 0
    },
    "Connections": [
        {
            "ID": 30859,
            "ConnectionTypeID": 1,
            "LevelID": 2,
            "Amps": 16,
            "Voltage": 230,
            "PowerKW": 3,
            "CurrentTypeID": 10,
            "Quantity": 2
        }
    ],
    "DateLastStatusUpdate": "2019-04-06T04:03:00Z",
    "DataQualityLevel": 3,
    "DateCreated": "2014-11-28T03:38:00Z",
    "SubmissionStatusTypeID": 100
}