{
    "IsRecentlyVerified": false,
    "ID": 144960,
    "UUID": "D8CAE569-61CD-4F03-8334-A8F1CA692F8D",
    "DataProviderID": 2,
    "DataProvidersReference": "131002",
    "OperatorID": 90,
    "UsageTypeID": 1,
    "AddressInfo": {
        "ID": 145312,
        "Title": "Municipalité de Saint-Liguori",
        "AddressLine1": "371 rue Héroux",
        "Town": "Saint-Liguori",
        "StateOrProvince": "QC",
        "Postcode": "J0K 2X0",
        "CountryID": 44,
        "Latitude": 46.010386,
        "Longitude": -73.569419,
        "ContactTelephone1": "877-505-2674",
        "AccessComments": "24 hours daily",
        "RelatedURL": "https://lecircuitelectrique.com/",
        "DistanceUnit": 0
    },
    "Connections": [
        {
            "ID": 201525,
            "ConnectionTypeID": 1,
            "LevelID": 2,
            "Amps": 16,
            "Voltage": 230,
            "PowerKW": 3.7,
            "CurrentTypeID": 10,
            "Quantity": 1
        }
    ],
    "StatusTypeID": 50,
    "DateLastStatusUpdate": "2020-06-26T03:10:00Z",
    "DataQualityLevel": 3,
    "DateCreated": "2019-12-24T09:24:00Z",
    "SubmissionStatusTypeID": 100
}