{
    "IsRecentlyVerified": false,
    "ID": 68204,
    "UUID": "A1DB40AA-0199-45F8-B426-D329D677B7AD",
    "DataProviderID": 26,
    "DataProvidersReference": "91256",
    "OperatorID": 177,
    "OperatorsReference": "Nuon EVB-P1542225",
    "UsageCost": "0.00 jaarabonnement",
    "AddressInfo": {
        "ID": 68550,
        "Title": "President Brandstraat 110",
        "AddressLine1": "President Brandstraat 110",
        "Town": "Amsterdam",
        "Postcode": "1091 WT",
        "CountryID": 159,
        "Latitude": 52.354247,
        "Longitude": 4.917177,
        "RelatedURL": "http://www.nuon.nl/ev",
        "DistanceUnit": 0
    },
    "Connections": [
        {
            "ID": 95049,
            "ConnectionTypeID": 25,
            "LevelID": 2,
            "PowerKW": 11,
            "CurrentTypeID": 10
        },
        {
            "ID": 95050,
            "ConnectionTypeID": 25,
            "LevelID": 2,
            "PowerKW": 11,
            "CurrentTypeID": 10
        }
    ],
    "NumberOfPoints": 1,
    "StatusTypeID": 50,
    "DateLastStatusUpdate": "2016-06-04T02:37:00Z",
    "DataQualityLevel": 3,
    "DateCreated": "2016-06-04T02:37:00Z",
    "SubmissionStatusTypeID": 100
}