{
    "IsRecentlyVerified": false,
    "ID": 176094,
    "UUID": "CE0F5FA2-D779-4FE6-9CDE-4D0EBB722350",
    "DataProviderID": 1,
    "OperatorID": 3,
    "UsageTypeID": 1,
    "UsageCost": "Free",
    "AddressInfo": {
        "ID": 176453,
        "Title": "Tesco Superstore-Uddingston",
        "AddressLine1": "Bothwell Road",
        "Town": "Uddingston",
        "StateOrProvince": "Scotland",
        "Postcode": "G71 7ET",
        "CountryID": 1,
        "Latitude": 55.816235,
        "Longitude": -4.082068,
        "DistanceUnit": 0
    },
    "Connections": [
        {
            "ID": 273584,
            "ConnectionTypeID": 25,
            "Reference": "PG-70417",
            "StatusTypeID": 50,
            "LevelID": 2,
            "Amps": 32,
            "Voltage": 230,
            "PowerKW": 7,
            "CurrentTypeID": 10,
            "Quantity": 2
        },
        {
            "ID": 273585,
            "ConnectionTypeID": 25,
            "Reference": "PG-85948",
            "StatusTypeID": 50,
            "LevelID": 2,
            "Amps": 32,
            "Voltage": 230,
            "PowerKW": 7,
            "CurrentTypeID": 10,
            "Quantity": 2
        }
    ],
    "NumberOfPoints": 4,
    "StatusTypeID": 50,
    "DateLastStatusUpdate": "2021-06-25T07:17:00Z",
    "DataQualityLevel": 1,
    "DateCreated": "2021-06-25T07:17:00Z",
    "SubmissionStatusTypeID": 200
}