{
    "IsRecentlyVerified": false,
    "ID": 41249,
    "UUID": "1DC547B0-964A-4C0D-863B-ECFEAB07C3A0",
    "DataProviderID": 15,
    "DataProvidersReference": "15256",
    "OperatorID": 9,
    "UsageTypeID": 1,
    "AddressInfo": {
        "ID": 41595,
        "Title": "5250 Commercial St SE",
        "AddressLine1": "5250 Commercial St SE",
        "Town": "Salem",
        "StateOrProvince": "OR",
        "Postcode": "US",
        "CountryID": 2,
        "Latitude": 44.87922,
        "Longitude": -123.02686,
        "ContactTelephone1": "(503) 378-1336",
        "RelatedURL": "http://carstations.com/15256",
        "DistanceUnit": 0
    },
    "Connections": [
        {
            "ID": 45037,
            "ConnectionTypeID": 1,
            "Reference": "J1772",
            "LevelID": 2
        }
    ],
    "NumberOfPoints": 1,
    "StatusTypeID": 0,
    "DateLastStatusUpdate": "2017-11-04T14:05:00Z",
    "DataQualityLevel": 2,
    "DateCreated": "2015-01-28T11:44:00Z",
    "SubmissionStatusTypeID": 100
}