{
    "IsRecentlyVerified": false,
    "ID": 169016,
    "UUID": "965C723D-9C31-42C9-8282-827A502E4820",
    "DataProviderID": 1,
    "OperatorID": 3324,
    "UsageTypeID": 1,
    "UsageCost": "0.30€/kWh",
    "AddressInfo": {
        "ID": 169375,
        "Title": "Easycharger Arevalo",
        "AddressLine1": "Easycharger Arevalo",
        "Town": "Arevalo",
        "StateOrProvince": "Avila",
        "Postcode": "05200",
        "CountryID": 210,
        "Latitude": 41.05265727426385,
        "Longitude": -4.699823155145623,
        "DistanceUnit": 0
    },
    "Connections": [
        {
            "ID": 257094,
            "ConnectionTypeID": 33,
            "StatusTypeID": 50,
            "LevelID": 3,
            "PowerKW": 50,
            "CurrentTypeID": 30,
            "Quantity": 2
        },
        {
            "ID": 257095,
            "ConnectionTypeID": 2,
            "StatusTypeID": 50,
            "LevelID": 3,
            "PowerKW": 50,
            "CurrentTypeID": 30,
            "Quantity": 2
        },
        {
            "ID": 257096,
            "ConnectionTypeID": 25,
            "StatusTypeID": 50,
            "LevelID": 2,
            "PowerKW": 22,
            "CurrentTypeID": 20,
            "Quantity": 2
        }
    ],
    "StatusTypeID": 50,
    "DateLastStatusUpdate": "2020-10-12T07:51:00Z",
    "DataQualityLevel": 1,
    "DateCreated": "2020-10-09T16:54:00Z",
    "SubmissionStatusTypeID": 200
}