{
    "IsRecentlyVerified": false,
    "ID": 63094,
    "UUID": "F1AF3710-A219-4C8C-8586-4793AE3531D8",
    "DataProviderID": 26,
    "DataProvidersReference": "73394",
    "OperatorID": 73,
    "OperatorsReference": "EV-Box EVB-P1408066",
    "UsageCost": "0.00 jaarabonnement",
    "AddressInfo": {
        "ID": 63440,
        "Title": "Boezemsingel 32",
        "AddressLine1": "Boezemsingel 32",
        "Town": "Oud-Beijerland",
        "Postcode": "3261 BD",
        "CountryID": 159,
        "Latitude": 51.81742,
        "Longitude": 4.42642,
        "RelatedURL": "http://www.ev-box.nl",
        "DistanceUnit": 0
    },
    "Connections": [
        {
            "ID": 80228,
            "ConnectionTypeID": 25,
            "LevelID": 2,
            "PowerKW": 5,
            "CurrentTypeID": 10
        }
    ],
    "NumberOfPoints": 1,
    "StatusTypeID": 50,
    "DateLastStatusUpdate": "2016-06-04T02:40:00Z",
    "DataQualityLevel": 3,
    "DateCreated": "2016-03-03T12:29:00Z",
    "SubmissionStatusTypeID": 100
}