{
    "IsRecentlyVerified": false,
    "ID": 178766,
    "UUID": "33973125-BA1C-46F9-AD2D-1D99B6A30186",
    "DataProviderID": 29,
    "DataProvidersReference": "8870",
    "OperatorID": 3403,
    "AddressInfo": {
        "ID": 179125,
        "Title": "Peterstraße 3",
        "AddressLine1": "Peterstraße 3",
        "Town": "Baesweiler",
        "Postcode": "52499",
        "CountryID": 87,
        "Latitude": 50.9037424,
        "Longitude": 6.1827365,
        "DistanceUnit": 0
    },
    "Connections": [
        {
            "ID": 279652,
            "ConnectionTypeID": 25,
            "StatusTypeID": 50,
            "LevelID": 2,
            "PowerKW": 22,
            "CurrentTypeID": 20
        },
        {
            "ID": 279653,
            "ConnectionTypeID": 25,
            "StatusTypeID": 50,
            "LevelID": 2,
            "PowerKW": 22,
            "CurrentTypeID": 20
        }
    ],
    "StatusTypeID": 0,
    "DateLastStatusUpdate": "2021-07-12T02:45:00Z",
    "MetadataValues": [
        {
            "ID": 11060,
            "MetadataFieldID": 4,
            "ItemValue": "Data from the German chargepoint registry provided by Bundesnetzagentur.de under the CC-BY 4.0 license"
        }
    ],
    "DataQualityLevel": 3,
    "DateCreated": "2021-07-08T09:50:00Z",
    "SubmissionStatusTypeID": 100
}