{
    "IsRecentlyVerified": false,
    "ID": 110806,
    "UUID": "EE39F421-5324-4F3E-9EEA-99DE89C044AE",
    "DataProviderID": 2,
    "DataProvidersReference": "84914",
    "UsageTypeID": 1,
    "AddressInfo": {
        "ID": 111152,
        "Title": "Brantford Pediatrics",
        "AddressLine1": "379 St Paul Ave",
        "Town": "Brantford",
        "StateOrProvince": "ON",
        "Postcode": "N3R 4N5",
        "CountryID": 44,
        "Latitude": 43.156688,
        "Longitude": -80.273802,
        "ContactTelephone1": "519-512-0030",
        "AccessComments": "24 hours daily",
        "RelatedURL": "",
        "DistanceUnit": 0
    },
    "Connections": [
        {
            "ID": 156101,
            "ConnectionTypeID": 1,
            "LevelID": 2,
            "Amps": 16,
            "Voltage": 230,
            "PowerKW": 3.7,
            "CurrentTypeID": 10,
            "Quantity": 1
        }
    ],
    "DateLastStatusUpdate": "2020-06-26T03:06:00Z",
    "DataQualityLevel": 3,
    "DateCreated": "2018-10-18T23:36:00Z",
    "SubmissionStatusTypeID": 100
}