{
    "IsRecentlyVerified": false,
    "ID": 179765,
    "UUID": "244A3B79-4541-47FC-8138-633BF488A544",
    "DataProviderID": 29,
    "DataProvidersReference": "10517",
    "OperatorID": 127,
    "AddressInfo": {
        "ID": 180124,
        "Title": "Donnerschweer Str. 22-26",
        "AddressLine1": "Donnerschweer Str. 22-26",
        "Town": "Oldenburg",
        "Postcode": "26122",
        "CountryID": 87,
        "Latitude": 53.1462,
        "Longitude": 8.21618999999998,
        "DistanceUnit": 0
    },
    "Connections": [
        {
            "ID": 282012,
            "ConnectionTypeID": 25,
            "StatusTypeID": 50,
            "LevelID": 2,
            "PowerKW": 22,
            "CurrentTypeID": 20
        },
        {
            "ID": 282013,
            "ConnectionTypeID": 25,
            "StatusTypeID": 50,
            "LevelID": 2,
            "PowerKW": 22,
            "CurrentTypeID": 20
        }
    ],
    "StatusTypeID": 50,
    "DateLastStatusUpdate": "2021-07-12T02:50:00Z",
    "MetadataValues": [
        {
            "ID": 12059,
            "MetadataFieldID": 4,
            "ItemValue": "Data from the German chargepoint registry provided by Bundesnetzagentur.de under the CC-BY 4.0 license"
        }
    ],
    "DataQualityLevel": 3,
    "DateCreated": "2021-07-08T09:59:00Z",
    "SubmissionStatusTypeID": 100
}