{
    "IsRecentlyVerified": false,
    "ID": 71029,
    "UUID": "17B0A3F5-9015-4FB1-AFDB-AF78D3C8D2A5",
    "DataProviderID": 1,
    "OperatorID": 45,
    "UsageTypeID": 3,
    "AddressInfo": {
        "ID": 71375,
        "Title": "Marktplatz ",
        "AddressLine1": "Stargarder Straße",
        "AddressLine2": "Innenstadt",
        "Town": "Neubrandenburg",
        "StateOrProvince": "Landkreis Mecklenburgische Seenplatte",
        "Postcode": "17033",
        "CountryID": 87,
        "Latitude": 53.55746483524836,
        "Longitude": 13.260890950262464,
        "AccessComments": "Ladekarte kann im Kundenbüro der Stadtwerke (um die Ecke: Turmstraße 6-8, von Mo-Fr 9-19, Sa 10-16Uhr geöffnet) gegen 20€ Pfand geliehen werden.",
        "DistanceUnit": 0
    },
    "Connections": [
        {
            "ID": 101775,
            "ConnectionTypeID": 25,
            "StatusTypeID": 50,
            "LevelID": 2,
            "Amps": 16,
            "Voltage": 400,
            "PowerKW": 11,
            "CurrentTypeID": 20,
            "Quantity": 1
        }
    ],
    "NumberOfPoints": 1,
    "StatusTypeID": 50,
    "DateLastStatusUpdate": "2016-08-23T05:49:00Z",
    "DataQualityLevel": 1,
    "DateCreated": "2016-08-23T05:49:00Z",
    "SubmissionStatusTypeID": 200
}