{
    "IsRecentlyVerified": false,
    "ID": 39165,
    "UUID": "5CE25E3C-3F2B-4C9E-88E1-D32D976C3248",
    "DataProviderID": 1,
    "OperatorID": 108,
    "OperatorsReference": "Vattenfall Heizwerk HafenCity",
    "UsageTypeID": 4,
    "AddressInfo": {
        "ID": 39511,
        "Title": "Vattenfall Heizwerk HafenCity",
        "AddressLine1": "San-Francisco-Straße 1",
        "Town": "Hamburg",
        "Postcode": "20457",
        "CountryID": 87,
        "Latitude": 53.54105972,
        "Longitude": 9.99641061,
        "ContactTelephone1": "+49(0)800-2 335 335",
        "ContactEmail": "emobility@vattenfall.de",
        "AccessComments": "24/7 nutzbar mit 2 Parkplätzen.",
        "RelatedURL": "http://www.vattenfall.de/de/emobility/ladestationen-hamburg.htm",
        "DistanceUnit": 0
    },
    "Connections": [
        {
            "ID": 42676,
            "ConnectionTypeID": 2,
            "StatusTypeID": 50,
            "LevelID": 3,
            "PowerKW": 20,
            "CurrentTypeID": 30,
            "Quantity": 1
        },
        {
            "ID": 49892,
            "ConnectionTypeID": 33,
            "StatusTypeID": 50,
            "LevelID": 3,
            "PowerKW": 20,
            "CurrentTypeID": 30,
            "Quantity": 1
        },
        {
            "ID": 49893,
            "ConnectionTypeID": 25,
            "StatusTypeID": 50,
            "LevelID": 2,
            "PowerKW": 22,
            "CurrentTypeID": 20,
            "Quantity": 2
        },
        {
            "ID": 49894,
            "ConnectionTypeID": 28,
            "StatusTypeID": 50,
            "LevelID": 2,
            "PowerKW": 3.7,
            "CurrentTypeID": 10,
            "Quantity": 1
        }
    ],
    "NumberOfPoints": 5,
    "StatusTypeID": 50,
    "DateLastStatusUpdate": "2016-03-30T11:20:00Z",
    "DataQualityLevel": 3,
    "DateCreated": "2015-01-09T06:08:00Z",
    "SubmissionStatusTypeID": 200
}