{
    "IsRecentlyVerified": false,
    "ID": 119817,
    "UUID": "C24D15F1-053E-4BC1-A107-6CB6CDED3481",
    "DataProviderID": 2,
    "DataProvidersReference": "113799",
    "OperatorID": 23,
    "UsageTypeID": 1,
    "AddressInfo": {
        "ID": 120163,
        "Title": "Shades of Green on Walt Disney Resort - Tesla Destination",
        "AddressLine1": "1950 W Magnolia Palm Dr",
        "Town": "Lake Buena Vista",
        "StateOrProvince": "FL",
        "Postcode": "32830",
        "CountryID": 2,
        "Latitude": 28.402621,
        "Longitude": -81.591529,
        "ContactTelephone1": "407-824-3400  877-798-3752",
        "AccessComments": "24 hours daily; for Tesla use only; for guest use only; see valet for access",
        "RelatedURL": "https://www.tesla.com/destination-charging",
        "DistanceUnit": 0
    },
    "Connections": [
        {
            "ID": 169107,
            "ConnectionTypeID": 0,
            "LevelID": 2,
            "Amps": 16,
            "Voltage": 230,
            "PowerKW": 3,
            "CurrentTypeID": 10,
            "Quantity": 2
        }
    ],
    "DateLastStatusUpdate": "2019-04-01T04:59:00Z",
    "DataQualityLevel": 3,
    "DateCreated": "2019-04-01T04:59:00Z",
    "SubmissionStatusTypeID": 100
}