{
    "IsRecentlyVerified": false,
    "ID": 167403,
    "UUID": "DD5A560C-E6A1-4342-AB7A-F3879B71A48E",
    "DataProviderID": 18,
    "DataProvidersReference": "eb8c64007b726195df839807c8291819",
    "OperatorID": 25,
    "UsageTypeID": 4,
    "AddressInfo": {
        "ID": 167762,
        "Title": "Hortensia Road",
        "AddressLine1": "Hortensia Road",
        "Town": "K&C",
        "Postcode": "SW10 0QS",
        "CountryID": 1,
        "Latitude": 51.481996,
        "Longitude": -0.18561,
        "AccessComments": "",
        "RelatedURL": "https://www.sourcelondon.net",
        "DistanceUnit": 0
    },
    "Connections": [
        {
            "ID": 253544,
            "ConnectionTypeID": 25,
            "Reference": "1",
            "StatusTypeID": 50,
            "LevelID": 2,
            "Amps": 32,
            "Voltage": 400,
            "PowerKW": 22,
            "CurrentTypeID": 20
        },
        {
            "ID": 253545,
            "ConnectionTypeID": 25,
            "Reference": "2",
            "StatusTypeID": 50,
            "LevelID": 2,
            "Amps": 32,
            "Voltage": 230,
            "PowerKW": 7,
            "CurrentTypeID": 10
        },
        {
            "ID": 253546,
            "ConnectionTypeID": 1,
            "Reference": "3",
            "StatusTypeID": 50,
            "LevelID": 2,
            "Amps": 13,
            "Voltage": 230,
            "PowerKW": 3,
            "CurrentTypeID": 10
        }
    ],
    "StatusTypeID": 0,
    "DateLastStatusUpdate": "2020-09-08T02:47:00Z",
    "MetadataValues": [
        {
            "ID": 7944,
            "MetadataFieldID": 4,
            "ItemValue": "Contains public sector information licensed under the Open Government Licence v2.0. http://www.nationalarchives.gov.uk/doc/open-government-licence/version/2/"
        }
    ],
    "DataQualityLevel": 3,
    "DateCreated": "2020-09-08T02:47:00Z",
    "SubmissionStatusTypeID": 100
}