{
    "IsRecentlyVerified": false,
    "ID": 92789,
    "UUID": "BD3F9026-BC3E-4D14-A2AA-220E8CE4362B",
    "DataProviderID": 1,
    "OperatorID": 220,
    "OperatorsReference": "4394",
    "UsageTypeID": 1,
    "UsageCost": "€1.73 + €0.3213/kWh; Andere Tarife möglich",
    "AddressInfo": {
        "ID": 93135,
        "Title": "Straßburger Straße 65",
        "AddressLine1": "Straßburger Straße 65",
        "Town": "Hamburg Nord",
        "StateOrProvince": "Hamburg",
        "Postcode": "22049",
        "CountryID": 87,
        "Latitude": 53.5828,
        "Longitude": 10.06883,
        "DistanceUnit": 0
    },
    "Connections": [
        {
            "ID": 131425,
            "ConnectionTypeID": 25,
            "StatusTypeID": 50,
            "LevelID": 2,
            "Amps": 32,
            "Voltage": 400,
            "PowerKW": 22,
            "CurrentTypeID": 20,
            "Quantity": 2
        }
    ],
    "NumberOfPoints": 2,
    "StatusTypeID": 50,
    "DateLastStatusUpdate": "2017-09-10T14:22:00Z",
    "DataQualityLevel": 1,
    "DateCreated": "2017-09-10T14:20:00Z",
    "SubmissionStatusTypeID": 200
}