{
    "IsRecentlyVerified": false,
    "ID": 30923,
    "UUID": "C9A57144-FE63-4F05-AC66-6E5CE8CA42C8",
    "DataProviderID": 1,
    "DataProvidersReference": "1857",
    "AddressInfo": {
        "ID": 31269,
        "Title": "Tampereen Huoltoykkönen",
        "AddressLine1": "Sellukatu 1 B",
        "Town": "Tampere Keskus Läntinen",
        "StateOrProvince": "Pirkanmaa",
        "Postcode": "33200",
        "CountryID": 79,
        "Latitude": 61.51762,
        "Longitude": 23.67053,
        "AccessComments": "Tampere Lielahti",
        "DistanceUnit": 0
    },
    "Connections": [
        {
            "ID": 34152,
            "ConnectionTypeID": 0,
            "Reference": "1",
            "LevelID": 2,
            "Amps": 32,
            "Voltage": 230,
            "PowerKW": 7.4,
            "Comments": "Mode 3"
        },
        {
            "ID": 89233,
            "ConnectionTypeID": 0,
            "Reference": "2",
            "LevelID": 2,
            "Amps": 32,
            "Voltage": 230,
            "PowerKW": 7.4,
            "Comments": "Mode 3"
        }
    ],
    "NumberOfPoints": 2,
    "DateLastStatusUpdate": "2020-05-26T08:24:00Z",
    "DataQualityLevel": 2,
    "DateCreated": "2014-12-09T09:01:00Z",
    "SubmissionStatusTypeID": 100
}