{
    "IsRecentlyVerified": false,
    "ID": 40335,
    "UUID": "06E084D0-742E-4FD6-A32A-556F3067864C",
    "DataProviderID": 2,
    "DataProvidersReference": "65015",
    "OperatorID": 5,
    "UsageTypeID": 1,
    "AddressInfo": {
        "ID": 40681,
        "Title": "CFP II, LLC",
        "AddressLine1": "240 E Illinois St",
        "Town": "Chicago",
        "StateOrProvince": "IL",
        "Postcode": "60611",
        "CountryID": 2,
        "Latitude": 41.891119,
        "Longitude": -87.621371,
        "ContactTelephone1": "888-758-4389",
        "AccessComments": "24 hours daily",
        "RelatedURL": "http://www.chargepoint.com/",
        "DistanceUnit": 0
    },
    "Connections": [
        {
            "ID": 43900,
            "ConnectionTypeID": 1,
            "LevelID": 2,
            "Amps": 16,
            "Voltage": 230,
            "PowerKW": 3.7,
            "CurrentTypeID": 10,
            "Quantity": 4
        }
    ],
    "DateLastStatusUpdate": "2020-06-26T03:05:00Z",
    "DataQualityLevel": 3,
    "DateCreated": "2015-01-10T01:01:00Z",
    "SubmissionStatusTypeID": 100
}