{
    "IsRecentlyVerified": false,
    "ID": 36127,
    "UUID": "98DC1239-F9B5-4DB5-B863-F83B271DC70F",
    "DataProviderID": 26,
    "DataProvidersReference": "47688",
    "OperatorID": 178,
    "OperatorsReference": "EVnetNL AL839",
    "UsageCost": "0.00 jaarabonnement",
    "AddressInfo": {
        "ID": 36473,
        "Title": "Van Alkemadelaan 133",
        "AddressLine1": "Van Alkemadelaan 133",
        "Town": "Den Haag",
        "Postcode": "2597 AD",
        "CountryID": 159,
        "Latitude": 52.100442,
        "Longitude": 4.321908,
        "ContactTelephone1": "0800-3522365",
        "RelatedURL": "http://www.evnet.nl",
        "DistanceUnit": 0
    },
    "Connections": [
        {
            "ID": 39638,
            "ConnectionTypeID": 25,
            "LevelID": 2,
            "PowerKW": 11,
            "CurrentTypeID": 10
        }
    ],
    "NumberOfPoints": 2,
    "StatusTypeID": 50,
    "DateLastStatusUpdate": "2016-06-04T02:50:00Z",
    "DataQualityLevel": 3,
    "DateCreated": "2015-01-09T06:05:00Z",
    "SubmissionStatusTypeID": 100
}