{
    "IsRecentlyVerified": false,
    "ID": 180938,
    "UUID": "B0424373-9EFB-44AB-AB13-C48E9FFEE3F5",
    "DataProviderID": 29,
    "DataProvidersReference": "6612",
    "AddressInfo": {
        "ID": 181297,
        "Title": "Münchner Str. 2",
        "AddressLine1": "Münchner Str. 2",
        "Town": "Freising",
        "Postcode": "85354",
        "CountryID": 87,
        "Latitude": 48.394556,
        "Longitude": 11.741956,
        "DistanceUnit": 0
    },
    "Connections": [
        {
            "ID": 284644,
            "ConnectionTypeID": 1036,
            "StatusTypeID": 50,
            "LevelID": 3,
            "PowerKW": 43,
            "CurrentTypeID": 20
        },
        {
            "ID": 284645,
            "ConnectionTypeID": 33,
            "StatusTypeID": 50,
            "LevelID": 3,
            "PowerKW": 50,
            "CurrentTypeID": 30
        },
        {
            "ID": 295780,
            "ConnectionTypeID": 2,
            "StatusTypeID": 50,
            "LevelID": 3,
            "PowerKW": 50,
            "CurrentTypeID": 30
        }
    ],
    "StatusTypeID": 50,
    "DateLastStatusUpdate": "2021-07-12T02:41:00Z",
    "MetadataValues": [
        {
            "ID": 13232,
            "MetadataFieldID": 4,
            "ItemValue": "Data from the German chargepoint registry provided by Bundesnetzagentur.de under the CC-BY 4.0 license"
        }
    ],
    "DataQualityLevel": 3,
    "DateCreated": "2021-07-08T10:01:00Z",
    "SubmissionStatusTypeID": 100
}