{
    "IsRecentlyVerified": false,
    "ID": 101065,
    "UUID": "66AEF0F7-2CAB-4AD3-997D-9B81C72D249C",
    "DataProviderID": 1,
    "OperatorID": 23,
    "OperatorsReference": "41525",
    "UsageTypeID": 4,
    "AddressInfo": {
        "ID": 101411,
        "Title": "Casino Joa Antibes la Siesta",
        "AddressLine1": "Route du Bord de Mer - Pont de la Rivière Brague",
        "Town": "Antibes",
        "Postcode": "6600",
        "CountryID": 80,
        "Latitude": 43.610654,
        "Longitude": 7.126648,
        "ContactTelephone1": "+33 4 93 33 31 31",
        "DistanceUnit": 0
    },
    "Connections": [
        {
            "ID": 142693,
            "ConnectionTypeID": 30,
            "StatusTypeID": 50,
            "LevelID": 2,
            "Amps": 16,
            "Voltage": 400,
            "PowerKW": 11,
            "CurrentTypeID": 20,
            "Quantity": 2
        }
    ],
    "NumberOfPoints": 2,
    "GeneralComments": "2 Tesla Connectors, up to 11kW.Available for customers. Self park.",
    "StatusTypeID": 50,
    "DateLastStatusUpdate": "2018-10-03T18:13:00Z",
    "DataQualityLevel": 1,
    "DateCreated": "2018-03-17T07:03:00Z",
    "SubmissionStatusTypeID": 200
}