{
    "IsRecentlyVerified": false,
    "ID": 45794,
    "UUID": "7C457322-A07C-4BF9-9B4A-A1917EE99748",
    "DataProviderID": 19,
    "DataProvidersReference": "869",
    "AddressInfo": {
        "ID": 46140,
        "Title": "Holmeallmenningen",
        "AddressLine1": "Oskars plass ",
        "Town": "STAVANGER",
        "StateOrProvince": "Rogaland",
        "Postcode": "4006",
        "CountryID": 168,
        "Latitude": 58.97341,
        "Longitude": 5.73209,
        "AccessComments": "",
        "DistanceUnit": 0
    },
    "Connections": [
        {
            "ID": 56457,
            "ConnectionTypeID": 25,
            "Reference": "1",
            "LevelID": 2,
            "Amps": 16,
            "Voltage": 230,
            "PowerKW": 3.7,
            "CurrentTypeID": 10,
            "Comments": "Mode 3"
        },
        {
            "ID": 84273,
            "ConnectionTypeID": 25,
            "Reference": "3",
            "LevelID": 2,
            "Amps": 16,
            "Voltage": 230,
            "PowerKW": 3.7,
            "CurrentTypeID": 10,
            "Comments": "Mode 3"
        },
        {
            "ID": 88064,
            "ConnectionTypeID": 25,
            "Reference": "4",
            "LevelID": 2,
            "Amps": 16,
            "Voltage": 230,
            "PowerKW": 3.7,
            "CurrentTypeID": 10,
            "Comments": "Mode 3"
        }
    ],
    "NumberOfPoints": 4,
    "DateLastStatusUpdate": "2021-03-24T05:11:00Z",
    "DataQualityLevel": 2,
    "DateCreated": "2015-05-03T00:54:00Z",
    "SubmissionStatusTypeID": 100
}