{
    "IsRecentlyVerified": false,
    "ID": 62587,
    "UUID": "79CD24B1-E5C6-4ED1-8ACA-965A0F3372B3",
    "DataProviderID": 26,
    "DataProvidersReference": "19865",
    "OperatorID": 162,
    "OperatorsReference": "東愛知日産自動車㈱豊橋下地店",
    "UsageCost": "0.00 onbekend",
    "AddressInfo": {
        "ID": 62933,
        "Title": "豊橋豊川線",
        "AddressLine1": "豊橋豊川線",
        "Town": "額田郡",
        "Postcode": "4400856",
        "CountryID": 114,
        "Latitude": 34.786415,
        "Longitude": 137.387238,
        "DistanceUnit": 0
    },
    "Connections": [
        {
            "ID": 79508,
            "ConnectionTypeID": 2,
            "LevelID": 3,
            "PowerKW": 50,
            "CurrentTypeID": 30
        }
    ],
    "NumberOfPoints": 1,
    "StatusTypeID": 50,
    "DateLastStatusUpdate": "2016-03-03T12:28:00Z",
    "DataQualityLevel": 3,
    "DateCreated": "2016-03-03T12:28:00Z",
    "SubmissionStatusTypeID": 100
}