{
    "IsRecentlyVerified": false,
    "ID": 65478,
    "UUID": "E41C6432-AFBA-4211-BC94-B01016F5658A",
    "DataProviderID": 26,
    "DataProvidersReference": "86079",
    "OperatorID": 103,
    "OperatorsReference": "Allego NLALLEGO0009842",
    "UsageCost": "0.00 jaarabonnement",
    "AddressInfo": {
        "ID": 65824,
        "Title": "Noordhoveweg 2",
        "AddressLine1": "Noordhoveweg 2",
        "Town": "Dordrecht",
        "Postcode": "3311 DG",
        "CountryID": 159,
        "Latitude": 51.81130076,
        "Longitude": 4.67948994,
        "ContactTelephone1": "0800-3745337",
        "RelatedURL": "http://www.allego.eu/",
        "DistanceUnit": 0
    },
    "Connections": [
        {
            "ID": 90236,
            "ConnectionTypeID": 25,
            "LevelID": 2,
            "PowerKW": 11,
            "CurrentTypeID": 10
        },
        {
            "ID": 90237,
            "ConnectionTypeID": 25,
            "LevelID": 2,
            "PowerKW": 11,
            "CurrentTypeID": 10
        }
    ],
    "NumberOfPoints": 1,
    "StatusTypeID": 50,
    "DateLastStatusUpdate": "2016-06-04T02:40:00Z",
    "DataQualityLevel": 3,
    "DateCreated": "2016-04-27T09:41:00Z",
    "SubmissionStatusTypeID": 100
}