{
    "UserComments": [
        {
            "ID": 21341,
            "ChargePointID": 114594,
            "CommentTypeID": 10,
            "UserName": "Simon Hewison",
            "Comment": "didn't prompt for app authentication. easy peasy",
            "Rating": 4,
            "DateCreated": "2019-08-17T14:20:15.383Z",
            "User": {
                "ID": 4575,
                "Username": "Simon Hewison"
            }
        }
    ],
    "IsRecentlyVerified": false,
    "ID": 114594,
    "UUID": "596FED37-0D9E-4113-8875-7F1B00C4A4CD",
    "DataProviderID": 1,
    "OperatorID": 3,
    "OperatorsReference": "t53_it1_0718_010",
    "UsageTypeID": 4,
    "UsageCost": "£0.25/kWh",
    "AddressInfo": {
        "ID": 114940,
        "Title": "Lidl New Rossington",
        "AddressLine1": "West End Lane",
        "Town": "New Rossington",
        "StateOrProvince": "South Yorkshire",
        "Postcode": "DN12 0TZ",
        "CountryID": 1,
        "Latitude": 53.4835257379879,
        "Longitude": -1.09361171722412,
        "AccessComments": "24hrs",
        "DistanceUnit": 0
    },
    "Connections": [
        {
            "ID": 161297,
            "ConnectionTypeID": 33,
            "StatusTypeID": 50,
            "LevelID": 3,
            "PowerKW": 50,
            "CurrentTypeID": 30,
            "Quantity": 1
        },
        {
            "ID": 161298,
            "ConnectionTypeID": 1036,
            "StatusTypeID": 50,
            "LevelID": 3,
            "Amps": 63,
            "Voltage": 400,
            "PowerKW": 43,
            "CurrentTypeID": 20,
            "Quantity": 1
        },
        {
            "ID": 161299,
            "ConnectionTypeID": 2,
            "StatusTypeID": 50,
            "LevelID": 3,
            "PowerKW": 50,
            "CurrentTypeID": 30,
            "Quantity": 1
        },
        {
            "ID": 178041,
            "ConnectionTypeID": 1036,
            "StatusTypeID": 50,
            "LevelID": 3,
            "PowerKW": 43,
            "CurrentTypeID": 20,
            "Quantity": 1
        }
    ],
    "NumberOfPoints": 3,
    "StatusTypeID": 50,
    "DateLastStatusUpdate": "2021-03-17T06:18:00Z",
    "DataQualityLevel": 1,
    "DateCreated": "2019-01-09T22:04:00Z",
    "SubmissionStatusTypeID": 200
}