{
    "IsRecentlyVerified": false,
    "ID": 157242,
    "UUID": "17AC9B60-606C-47AB-8E30-B320C7220136",
    "DataProviderID": 19,
    "DataProvidersReference": "6183",
    "AddressInfo": {
        "ID": 157596,
        "Title": "E.ON Skellefteå",
        "AddressLine1": "Tjärnvägen 5",
        "Town": "SKELLEFTEÅ",
        "StateOrProvince": "VÄSTERBOTTEN",
        "Postcode": "93130",
        "CountryID": 216,
        "Latitude": 64.73351,
        "Longitude": 20.96765,
        "AccessComments": "",
        "DistanceUnit": 0
    },
    "Connections": [
        {
            "ID": 226209,
            "ConnectionTypeID": 33,
            "Reference": "1",
            "LevelID": 3,
            "Amps": 100,
            "Voltage": 500,
            "PowerKW": 50,
            "CurrentTypeID": 30
        },
        {
            "ID": 226210,
            "ConnectionTypeID": 33,
            "Reference": "2",
            "LevelID": 3,
            "Amps": 100,
            "Voltage": 500,
            "PowerKW": 50,
            "CurrentTypeID": 30
        },
        {
            "ID": 226211,
            "ConnectionTypeID": 25,
            "Reference": "3",
            "LevelID": 3,
            "Amps": 32,
            "Voltage": 400,
            "PowerKW": 22,
            "CurrentTypeID": 30
        },
        {
            "ID": 226212,
            "ConnectionTypeID": 25,
            "Reference": "4",
            "LevelID": 3,
            "Amps": 32,
            "Voltage": 400,
            "PowerKW": 22,
            "CurrentTypeID": 30
        }
    ],
    "NumberOfPoints": 4,
    "StatusTypeID": 0,
    "DateLastStatusUpdate": "2021-03-24T05:12:00Z",
    "DataQualityLevel": 2,
    "DateCreated": "2020-05-26T08:25:00Z",
    "SubmissionStatusTypeID": 100
}