{
    "IsRecentlyVerified": false,
    "ID": 51867,
    "UUID": "E9720B17-1B53-4A1A-9A5A-41BBF1DD126C",
    "DataProviderID": 1,
    "OperatorID": 23,
    "OperatorsReference": "6605",
    "UsageTypeID": 1,
    "UsageCost": "Free",
    "AddressInfo": {
        "ID": 52213,
        "Title": "Hyatt Regency - Tesla",
        "AddressLine1": "1 Old Golf Course Rd",
        "Town": "Monterey",
        "StateOrProvince": "CA",
        "Postcode": "93940",
        "CountryID": 2,
        "Latitude": 36.5928306,
        "Longitude": -121.874181,
        "ContactTelephone1": "831-372-1234  877-798-3752",
        "AccessComments": "24 hours daily; for Tesla use only; for guest use only; see valet for access",
        "RelatedURL": "http://www.teslamotors.com/supercharger",
        "DistanceUnit": 0
    },
    "Connections": [
        {
            "ID": 64346,
            "ConnectionTypeID": 30,
            "StatusTypeID": 50,
            "LevelID": 2,
            "Amps": 16,
            "Voltage": 230,
            "PowerKW": 8,
            "CurrentTypeID": 10,
            "Quantity": 2
        }
    ],
    "NumberOfPoints": 2,
    "StatusTypeID": 50,
    "DateLastStatusUpdate": "2017-01-31T22:52:00Z",
    "DataQualityLevel": 3,
    "DateCreated": "2015-08-13T03:43:00Z",
    "SubmissionStatusTypeID": 100
}