{
    "IsRecentlyVerified": false,
    "ID": 100037,
    "UUID": "779E5B26-0528-480A-8CDA-AD6A6CF98862",
    "DataProviderID": 1,
    "OperatorID": 45,
    "UsageTypeID": 1,
    "AddressInfo": {
        "ID": 100383,
        "Title": "Supermarkt Wasgau",
        "AddressLine1": "Saarbrücker Straße 9",
        "Town": "Lauterecken",
        "StateOrProvince": "Lauterecken-Wolfstein",
        "Postcode": "67742",
        "CountryID": 87,
        "Latitude": 49.656150132127756,
        "Longitude": 7.5908037354431634,
        "ContactTelephone1": "+49 621 585 2882",
        "AccessComments": "24/7 kostenlos nutzbar, Betreiber sind die Pfalzwerke.",
        "RelatedURL": "https://emobilitaet.pfalzwerke.de/",
        "DistanceUnit": 0
    },
    "Connections": [
        {
            "ID": 141294,
            "ConnectionTypeID": 1036,
            "StatusTypeID": 50,
            "LevelID": 2,
            "Amps": 32,
            "Voltage": 400,
            "PowerKW": 22,
            "CurrentTypeID": 20,
            "Quantity": 1
        },
        {
            "ID": 141295,
            "ConnectionTypeID": 2,
            "StatusTypeID": 50,
            "LevelID": 3,
            "PowerKW": 50,
            "CurrentTypeID": 30,
            "Quantity": 1
        },
        {
            "ID": 141296,
            "ConnectionTypeID": 33,
            "StatusTypeID": 50,
            "LevelID": 3,
            "PowerKW": 50,
            "CurrentTypeID": 30,
            "Quantity": 1
        }
    ],
    "NumberOfPoints": 3,
    "StatusTypeID": 50,
    "DateLastStatusUpdate": "2018-02-09T14:54:00Z",
    "DataQualityLevel": 1,
    "DateCreated": "2018-02-09T14:54:00Z",
    "SubmissionStatusTypeID": 200
}