{
    "IsRecentlyVerified": false,
    "ID": 186139,
    "UUID": "44608D45-5C43-4A0E-8B19-1550DF77AE4B",
    "DataProviderID": 29,
    "DataProvidersReference": "2781",
    "OperatorID": 188,
    "AddressInfo": {
        "ID": 186498,
        "Title": "Marktstraße 34",
        "AddressLine1": "Marktstraße 34",
        "Town": "Ulrichstein",
        "Postcode": "35327",
        "CountryID": 87,
        "Latitude": 50.574405,
        "Longitude": 9.195299,
        "DistanceUnit": 0
    },
    "Connections": [
        {
            "ID": 297919,
            "ConnectionTypeID": 28,
            "StatusTypeID": 50,
            "LevelID": 2,
            "PowerKW": 22,
            "CurrentTypeID": 20
        },
        {
            "ID": 297920,
            "ConnectionTypeID": 25,
            "StatusTypeID": 50,
            "LevelID": 2,
            "PowerKW": 22,
            "CurrentTypeID": 20
        },
        {
            "ID": 297921,
            "ConnectionTypeID": 28,
            "StatusTypeID": 50,
            "LevelID": 2,
            "PowerKW": 22,
            "CurrentTypeID": 20
        },
        {
            "ID": 297922,
            "ConnectionTypeID": 25,
            "StatusTypeID": 50,
            "LevelID": 2,
            "PowerKW": 22,
            "CurrentTypeID": 20
        }
    ],
    "StatusTypeID": 50,
    "DateLastStatusUpdate": "2021-07-12T02:45:00Z",
    "MetadataValues": [
        {
            "ID": 18381,
            "MetadataFieldID": 4,
            "ItemValue": "Data from the German chargepoint registry provided by Bundesnetzagentur.de under the CC-BY 4.0 license"
        }
    ],
    "DataQualityLevel": 3,
    "DateCreated": "2021-07-12T02:45:00Z",
    "SubmissionStatusTypeID": 100
}