{
    "IsRecentlyVerified": false,
    "ID": 9245,
    "UUID": "5666785C-EB27-48D2-901B-219311A37B17",
    "DataProviderID": 1,
    "OperatorID": 1,
    "UsageTypeID": 1,
    "UsageCost": "Free",
    "AddressInfo": {
        "ID": 9142,
        "Title": "ANWB Servicecenter Badhoevedorp ",
        "AddressLine1": "Robert Kochstraat 55",
        "AddressLine2": "",
        "Town": "Badhoevedorp ",
        "StateOrProvince": "",
        "Postcode": " 1171 HZ ",
        "CountryID": 159,
        "Latitude": 52.3395039,
        "Longitude": 4.770728200000008,
        "ContactTelephone1": "+31(0)88 – 269 84 20 ",
        "ContactTelephone2": "+31(0)88 – 269 84 19",
        "ContactEmail": "",
        "AccessComments": "Maandag t/m vrijdag- 8.00 tot 23.00 uur Zaterdag en zondag - 10.00 tot 18.30 uur",
        "RelatedURL": "http://www.anwb.nl/elektrisch",
        "DistanceUnit": 0
    },
    "Connections": [
        {
            "ID": 6955,
            "ConnectionTypeID": 2,
            "StatusTypeID": 0,
            "LevelID": 3,
            "Quantity": 1
        }
    ],
    "NumberOfPoints": 1,
    "GeneralComments": "",
    "StatusTypeID": 50,
    "DateLastStatusUpdate": "2012-01-29T10:54:00Z",
    "DataQualityLevel": 1,
    "DateCreated": "2012-01-29T10:53:00Z",
    "SubmissionStatusTypeID": 200
}