{
    "IsRecentlyVerified": false,
    "ID": 129288,
    "UUID": "F4F70BE9-F60C-4A29-99EC-5ECB25C8D6BC",
    "DataProviderID": 1,
    "OperatorID": 80,
    "UsageTypeID": 4,
    "AddressInfo": {
        "ID": 129634,
        "Title": "Sesto San Giovanni Rovani | EnelX",
        "AddressLine1": "Via Giuseppe Rovani",
        "Town": "Sesto San Giovanni",
        "StateOrProvince": "MI",
        "Postcode": "20099",
        "CountryID": 112,
        "Latitude": 45.53571652867032,
        "Longitude": 9.224964861572744,
        "RelatedURL": "https://www.enelx.com/it/it/emobility",
        "DistanceUnit": 0
    },
    "Connections": [
        {
            "ID": 180952,
            "ConnectionTypeID": 25,
            "StatusTypeID": 50,
            "LevelID": 2,
            "Amps": 32,
            "Voltage": 400,
            "PowerKW": 22,
            "CurrentTypeID": 20,
            "Quantity": 2
        }
    ],
    "NumberOfPoints": 2,
    "StatusTypeID": 50,
    "DateLastStatusUpdate": "2019-07-16T13:58:00Z",
    "DataQualityLevel": 1,
    "DateCreated": "2019-07-16T13:58:00Z",
    "SubmissionStatusTypeID": 200
}