{
    "IsRecentlyVerified": false,
    "ID": 90023,
    "UUID": "E95800B5-F24F-4515-8CFE-0121C55EBC4C",
    "DataProviderID": 1,
    "OperatorID": 44,
    "UsageTypeID": 3,
    "AddressInfo": {
        "ID": 90369,
        "Title": "Ladepunkt Bannewitz",
        "AddressLine1": "Börnchener Dorfstraße 5",
        "Town": "Bannewitz",
        "StateOrProvince": "Landkreis Sächsische Schweiz-Osterzgebirge",
        "Postcode": "01728",
        "CountryID": 87,
        "Latitude": 50.9610353,
        "Longitude": 13.69827250000003,
        "ContactTelephone1": "+49 35206 39150",
        "AccessComments": "Auf Anfrage, ca 50m unterhalb vom Gasthof Börnchen.  Wenn der Eigentümer nicht gerade selbst laden muss, steht die Station auf Anfrage zur Verfügung.\r\n",
        "DistanceUnit": 0
    },
    "Connections": [
        {
            "ID": 127618,
            "ConnectionTypeID": 25,
            "StatusTypeID": 50,
            "LevelID": 2,
            "Amps": 16,
            "Voltage": 400,
            "PowerKW": 11,
            "CurrentTypeID": 20,
            "Quantity": 1
        }
    ],
    "NumberOfPoints": 1,
    "StatusTypeID": 50,
    "DateLastStatusUpdate": "2017-07-04T11:13:00Z",
    "DataQualityLevel": 1,
    "DateCreated": "2017-07-04T11:13:00Z",
    "SubmissionStatusTypeID": 200
}