{
    "IsRecentlyVerified": false,
    "ID": 182867,
    "UUID": "990C2388-FBFE-4E75-AB9E-E3FBF0120449",
    "DataProviderID": 29,
    "DataProvidersReference": "2359",
    "OperatorID": 3403,
    "AddressInfo": {
        "ID": 183226,
        "Title": "Moltkestraße 11",
        "AddressLine1": "Moltkestraße 11",
        "Town": "Pinneberg",
        "Postcode": "25421",
        "CountryID": 87,
        "Latitude": 53.658391,
        "Longitude": 9.798222,
        "DistanceUnit": 0
    },
    "Connections": [
        {
            "ID": 289146,
            "ConnectionTypeID": 25,
            "StatusTypeID": 50,
            "LevelID": 2,
            "PowerKW": 22,
            "CurrentTypeID": 20
        },
        {
            "ID": 289147,
            "ConnectionTypeID": 25,
            "StatusTypeID": 50,
            "LevelID": 2,
            "PowerKW": 22,
            "CurrentTypeID": 20
        }
    ],
    "StatusTypeID": 50,
    "DateLastStatusUpdate": "2021-07-12T02:52:00Z",
    "MetadataValues": [
        {
            "ID": 15160,
            "MetadataFieldID": 4,
            "ItemValue": "Data from the German chargepoint registry provided by Bundesnetzagentur.de under the CC-BY 4.0 license"
        }
    ],
    "DataQualityLevel": 3,
    "DateCreated": "2021-07-08T10:03:00Z",
    "SubmissionStatusTypeID": 100
}