{
    "IsRecentlyVerified": false,
    "ID": 115848,
    "UUID": "2822F626-CD7B-4D03-919E-E17288EFFDBC",
    "DataProviderID": 2,
    "DataProvidersReference": "105143",
    "OperatorID": 5,
    "UsageTypeID": 1,
    "AddressInfo": {
        "ID": 116194,
        "Title": "JLR MONMOUTH",
        "AddressLine1": "807 NJ-35",
        "Town": "Wanamassa",
        "StateOrProvince": "NJ",
        "Postcode": "07712",
        "CountryID": 2,
        "Latitude": 40.2317216,
        "Longitude": -74.0381367,
        "ContactTelephone1": "888-758-4389",
        "AccessComments": "24 hours daily",
        "RelatedURL": "http://www.chargepoint.com/",
        "DistanceUnit": 0
    },
    "Connections": [
        {
            "ID": 162890,
            "ConnectionTypeID": 1,
            "LevelID": 2,
            "Amps": 16,
            "Voltage": 230,
            "PowerKW": 3,
            "CurrentTypeID": 10,
            "Quantity": 1
        }
    ],
    "DateLastStatusUpdate": "2019-12-24T09:17:00Z",
    "DataQualityLevel": 3,
    "DateCreated": "2019-02-11T07:13:00Z",
    "SubmissionStatusTypeID": 100
}