{
    "IsRecentlyVerified": false,
    "ID": 138089,
    "UUID": "01EBAA25-EFBF-4085-B3FC-CDFC9176141B",
    "DataProviderID": 2,
    "DataProvidersReference": "144098",
    "OperatorID": 9,
    "UsageTypeID": 2,
    "AddressInfo": {
        "ID": 138438,
        "Title": "Firestone Store - Phoenix - W Van Buren St",
        "AddressLine1": "302 W Van Buren St",
        "Town": "Phoenix",
        "StateOrProvince": "AZ",
        "Postcode": "85003",
        "CountryID": 2,
        "Latitude": 33.451865,
        "Longitude": -112.078013,
        "ContactTelephone1": "888-998-2546",
        "AccessComments": "MON: 7:00am-6:00pm | TUE: 7:00am-6:00pm | WED: 7:00am-6:00pm | THU: 7:00am-6:00pm | FRI: 7:00am-6:00pm | SAT: 8:00am-5:00pm | SUN: 24 hours",
        "RelatedURL": "http://www.blinkcharging.com/",
        "DistanceUnit": 0
    },
    "Connections": [
        {
            "ID": 193141,
            "ConnectionTypeID": 1,
            "LevelID": 2,
            "Amps": 16,
            "Voltage": 230,
            "PowerKW": 3,
            "CurrentTypeID": 10,
            "Quantity": 2
        }
    ],
    "StatusTypeID": 50,
    "DateLastStatusUpdate": "2019-12-24T09:06:00Z",
    "DataQualityLevel": 3,
    "DateCreated": "2019-12-24T09:06:00Z",
    "SubmissionStatusTypeID": 100
}