{
    "MediaItems": [
        {
            "ID": 29226,
            "ChargePointID": 189143,
            "ItemURL": "https://s3-ap-southeast-2.amazonaws.com/openchargemap/images/ES/OCM189143/OCM-189143.orig.2021091019335234.jpg",
            "ItemThumbnailURL": "https://s3-ap-southeast-2.amazonaws.com/openchargemap/images/ES/OCM189143/OCM-189143.thmb.2021091019335234.jpg",
            "Comment": "",
            "IsEnabled": true,
            "IsVideo": false,
            "IsFeaturedItem": false,
            "IsExternalResource": false,
            "User": {
                "ID": 19690,
                "Username": "Raule_19"
            },
            "DateCreated": "2021-09-10T19:34:00Z"
        }
    ],
    "IsRecentlyVerified": true,
    "DateLastVerified": "2021-09-10T14:16:00Z",
    "ID": 189143,
    "UUID": "F18C38CB-1858-4EEC-A43D-F1642499381E",
    "DataProviderID": 1,
    "OperatorID": 1,
    "UsageTypeID": 4,
    "UsageCost": "0.40€ dc y 0.30€ ac",
    "AddressInfo": {
        "ID": 189502,
        "Title": "PDR vertice roomspace",
        "AddressLine1": "Calle de la Laguna Dalga",
        "Town": "Madrid",
        "StateOrProvince": "Community of Madrid",
        "Postcode": "28906",
        "CountryID": 210,
        "Latitude": 40.33202,
        "Longitude": -3.7027363,
        "AccessComments": "app cable energía ",
        "RelatedURL": "http://www.cablenergia.com/",
        "DistanceUnit": 0
    },
    "Connections": [
        {
            "ID": 305785,
            "ConnectionTypeID": 33,
            "StatusTypeID": 50,
            "LevelID": 3,
            "Amps": 108,
            "Voltage": 500,
            "PowerKW": 50,
            "CurrentTypeID": 30,
            "Quantity": 1
        },
        {
            "ID": 305786,
            "ConnectionTypeID": 2,
            "StatusTypeID": 50,
            "LevelID": 3,
            "Amps": 125,
            "Voltage": 500,
            "PowerKW": 50,
            "CurrentTypeID": 30,
            "Quantity": 1
        },
        {
            "ID": 305787,
            "ConnectionTypeID": 25,
            "StatusTypeID": 50,
            "LevelID": 2,
            "PowerKW": 22,
            "CurrentTypeID": 20,
            "Quantity": 1
        }
    ],
    "NumberOfPoints": 2,
    "GeneralComments": "Somos@cablenergia.com",
    "StatusTypeID": 50,
    "DateLastStatusUpdate": "2021-09-10T19:42:00Z",
    "DataQualityLevel": 1,
    "DateCreated": "2021-09-10T14:16:00Z",
    "SubmissionStatusTypeID": 200
}