{
    "IsRecentlyVerified": false,
    "ID": 37246,
    "UUID": "814D70E4-23EA-413C-B17B-D0CE8EFF9BBA",
    "DataProviderID": 26,
    "DataProvidersReference": "48158",
    "OperatorID": 178,
    "OperatorsReference": "EVnetNL EV0039",
    "UsageCost": "0.00 jaarabonnement",
    "AddressInfo": {
        "ID": 37592,
        "Title": "Vlasdonk 11",
        "AddressLine1": "Vlasdonk 11",
        "Town": "Diemen",
        "Postcode": "1112 JD",
        "CountryID": 159,
        "Latitude": 52.33577,
        "Longitude": 4.94978,
        "ContactTelephone1": "0800-3522365",
        "RelatedURL": "http://www.evnet.nl",
        "DistanceUnit": 0
    },
    "Connections": [
        {
            "ID": 40757,
            "ConnectionTypeID": 25,
            "LevelID": 2,
            "PowerKW": 11,
            "CurrentTypeID": 10
        }
    ],
    "NumberOfPoints": 1,
    "StatusTypeID": 50,
    "DateLastStatusUpdate": "2016-06-04T02:53:00Z",
    "DataQualityLevel": 3,
    "DateCreated": "2015-01-09T06:07:00Z",
    "SubmissionStatusTypeID": 100
}