{
    "IsRecentlyVerified": false,
    "ID": 17397,
    "UUID": "7AF93FA2-E7CB-498C-A742-391DF032F5F7",
    "DataProviderID": 22,
    "DataProvidersReference": "57574E4F5E30961F96C7E320BF15A5DD",
    "AddressInfo": {
        "ID": 17742,
        "Title": "兵庫日産自動車鈴蘭台北店",
        "AddressLine1": "兵庫県神戸市北区鳴子2丁目1番1号",
        "CountryID": 114,
        "Latitude": 34.72211233,
        "Longitude": 135.1281366,
        "ContactTelephone1": "078-593-3225",
        "DistanceUnit": 0
    },
    "Connections": [
        {
            "ID": 17638,
            "ConnectionTypeID": 2,
            "LevelID": 2,
            "Amps": 100,
            "Voltage": 480,
            "PowerKW": 48,
            "Quantity": 1
        }
    ],
    "DateLastStatusUpdate": "2013-06-29T08:57:00Z",
    "DataQualityLevel": 2,
    "DateCreated": "2013-06-29T08:57:00Z",
    "SubmissionStatusTypeID": 200
}