{
    "IsRecentlyVerified": false,
    "ID": 163284,
    "UUID": "56C0BF93-AF13-46EF-8763-2B2B48E0452D",
    "DataProviderID": 1,
    "OperatorID": 23,
    "OperatorsReference": "54352",
    "UsageTypeID": 4,
    "AddressInfo": {
        "ID": 163641,
        "Title": "Leister Apparthotel",
        "AddressLine1": "Kurzer Weg 13",
        "Town": "Weyhe",
        "Postcode": "28844",
        "CountryID": 87,
        "Latitude": 52.99439,
        "Longitude": 8.815327,
        "ContactTelephone1": "+49 (0)42 167353883",
        "DistanceUnit": 0
    },
    "Connections": [
        {
            "ID": 234847,
            "ConnectionTypeID": 30,
            "StatusTypeID": 50,
            "LevelID": 2,
            "PowerKW": 22,
            "CurrentTypeID": 20,
            "Quantity": 2
        }
    ],
    "NumberOfPoints": 2,
    "GeneralComments": "Charging2 Tesla Connector, up to 22kW.Available for customers. Please call ahead.",
    "StatusTypeID": 50,
    "DateLastStatusUpdate": "2020-08-21T05:47:00Z",
    "DataQualityLevel": 1,
    "DateCreated": "2020-08-21T05:47:00Z",
    "SubmissionStatusTypeID": 200
}