{
    "IsRecentlyVerified": false,
    "ID": 143096,
    "UUID": "D048A5AF-E56F-496F-8D08-B1C13EA8C01F",
    "DataProviderID": 2,
    "DataProvidersReference": "121285",
    "OperatorID": 3372,
    "UsageTypeID": 1,
    "AddressInfo": {
        "ID": 143448,
        "Title": "Village of Montour Falls",
        "AddressLine1": "300 W Main St",
        "Town": "Montour Falls",
        "StateOrProvince": "NY",
        "Postcode": "14865",
        "CountryID": 2,
        "Latitude": 42.346621,
        "Longitude": -76.848004,
        "ContactTelephone1": "607-535-7367  866-816-7584",
        "AccessComments": "24 hours daily",
        "RelatedURL": "http://evconnect.com/",
        "DistanceUnit": 0
    },
    "Connections": [
        {
            "ID": 199358,
            "ConnectionTypeID": 1,
            "LevelID": 2,
            "Amps": 16,
            "Voltage": 230,
            "PowerKW": 3.7,
            "CurrentTypeID": 10,
            "Quantity": 2
        }
    ],
    "StatusTypeID": 50,
    "DateLastStatusUpdate": "2020-06-26T03:05:00Z",
    "DataQualityLevel": 3,
    "DateCreated": "2019-12-24T09:20:00Z",
    "SubmissionStatusTypeID": 100
}