{
    "IsRecentlyVerified": false,
    "ID": 152509,
    "UUID": "F82EA045-9A0E-4FD3-BCB9-AB1FFFD459F0",
    "DataProviderID": 28,
    "DataProvidersReference": "FR*S49*P49125*003",
    "UsageTypeID": 5,
    "AddressInfo": {
        "ID": 152862,
        "Title": "DOUE LA FONTAINE - Rue Cholet",
        "AddressLine1": "Rue Cholet 49700 DOUE LA FONTAINE",
        "CountryID": 80,
        "Latitude": 47.189978,
        "Longitude": -0.301931,
        "AccessComments": "24h/24 7j/7",
        "DistanceUnit": 0
    },
    "Connections": [
        {
            "ID": 213527,
            "ConnectionTypeID": 33,
            "StatusTypeID": 50,
            "LevelID": 3,
            "PowerKW": 50,
            "CurrentTypeID": 30
        },
        {
            "ID": 246552,
            "ConnectionTypeID": 2,
            "StatusTypeID": 50,
            "LevelID": 3,
            "PowerKW": 50,
            "CurrentTypeID": 30
        },
        {
            "ID": 246553,
            "ConnectionTypeID": 33,
            "StatusTypeID": 50,
            "LevelID": 3,
            "PowerKW": 50,
            "CurrentTypeID": 30
        }
    ],
    "GeneralComments": "Recharge par badge et avec une application smartphone",
    "StatusTypeID": 50,
    "DateLastStatusUpdate": "2020-08-27T05:13:00Z",
    "DataQualityLevel": 2,
    "DateCreated": "2020-03-15T10:53:00Z",
    "SubmissionStatusTypeID": 100
}