{
    "IsRecentlyVerified": false,
    "ID": 96356,
    "UUID": "E228CF12-B5A2-4B2B-A6CD-2BC266F1FC19",
    "DataProviderID": 1,
    "OperatorID": 45,
    "UsageTypeID": 6,
    "AddressInfo": {
        "ID": 96702,
        "Title": "Hotel Ibis Berlin Ostbahnhof",
        "AddressLine1": "An der Schillingbrücke 2",
        "AddressLine2": "Stadtteil Friedrichshain",
        "Town": "Berlin",
        "StateOrProvince": "Berlin",
        "Postcode": "10243",
        "CountryID": 87,
        "Latitude": 52.5099445,
        "Longitude": 13.42956909999998,
        "ContactTelephone1": "+49 30 257 600",
        "AccessComments": "Die Säule befindet sich in der Tiefgarage des Hotels, Einfahrt erreichbar über die Holzmarktstraße. Der Ladeplatz ist Gästen vorbehalten. Um Reservierung wird gebeten.",
        "RelatedURL": "http://www.ibis.com/de/hotel-3108-ibis-berlin-ostbahnhof/index.shtml",
        "DistanceUnit": 0
    },
    "Connections": [
        {
            "ID": 136529,
            "ConnectionTypeID": 25,
            "StatusTypeID": 50,
            "LevelID": 2,
            "Amps": 32,
            "Voltage": 400,
            "PowerKW": 22,
            "CurrentTypeID": 20,
            "Quantity": 1
        }
    ],
    "NumberOfPoints": 1,
    "StatusTypeID": 50,
    "DateLastStatusUpdate": "2017-12-21T13:37:00Z",
    "DataQualityLevel": 1,
    "DateCreated": "2017-12-21T13:37:00Z",
    "SubmissionStatusTypeID": 200
}