{
    "IsRecentlyVerified": false,
    "ID": 100338,
    "UUID": "E6E5BAE9-4BBA-48F9-A6E7-4791D2CE8D3E",
    "DataProviderID": 1,
    "OperatorID": 5,
    "UsageTypeID": 4,
    "UsageCost": "Free",
    "AddressInfo": {
        "ID": 100684,
        "Title": "Organic Market and Cafe",
        "AddressLine1": "5 Druid Avenue",
        "Town": "Stirling East",
        "StateOrProvince": "South Australia",
        "Postcode": "5152",
        "CountryID": 18,
        "Latitude": -35.0055123951571,
        "Longitude": 138.716045022011,
        "ContactTelephone1": "1300300885",
        "ContactTelephone2": "(08) 8339 4835",
        "AccessComments": "Access to station is tight for large cars.",
        "RelatedURL": "https://na.chargepoint.com/charge_point",
        "DistanceUnit": 0
    },
    "Connections": [
        {
            "ID": 141747,
            "ConnectionTypeID": 1,
            "StatusTypeID": 50,
            "LevelID": 2,
            "Amps": 30,
            "Voltage": 240,
            "PowerKW": 6.6,
            "CurrentTypeID": 10,
            "Quantity": 2
        },
        {
            "ID": 141748,
            "ConnectionTypeID": 1036,
            "StatusTypeID": 50,
            "LevelID": 2,
            "Amps": 30,
            "Voltage": 240,
            "PowerKW": 6.6,
            "CurrentTypeID": 10,
            "Quantity": 1
        }
    ],
    "NumberOfPoints": 1,
    "GeneralComments": "1 bay with 2 Chargepoint & 1 Tesla Destination stations.",
    "StatusTypeID": 50,
    "DateLastStatusUpdate": "2018-02-23T23:18:00Z",
    "DataQualityLevel": 1,
    "DateCreated": "2018-02-23T00:17:00Z",
    "SubmissionStatusTypeID": 200
}