{
    "IsRecentlyVerified": false,
    "ID": 77588,
    "UUID": "75116C3B-C8F6-45B1-A2A0-2117E0BE0B70",
    "DataProviderID": 1,
    "OperatorID": 13,
    "UsageTypeID": 4,
    "AddressInfo": {
        "ID": 77934,
        "Title": "Spodnje Dobrenje",
        "AddressLine1": "Sp. Dobrenje 41d",
        "AddressLine2": "Spodnje Dobrenje",
        "Town": "Pesnica",
        "StateOrProvince": "Podravska",
        "Postcode": "2211",
        "CountryID": 205,
        "Latitude": 46.60911774084502,
        "Longitude": 15.662439008598321,
        "DistanceUnit": 0
    },
    "Connections": [
        {
            "ID": 112093,
            "ConnectionTypeID": 2,
            "StatusTypeID": 50,
            "LevelID": 3,
            "PowerKW": 50,
            "CurrentTypeID": 30,
            "Quantity": 1
        },
        {
            "ID": 112094,
            "ConnectionTypeID": 1036,
            "StatusTypeID": 50,
            "LevelID": 3,
            "Amps": 63,
            "Voltage": 400,
            "PowerKW": 43,
            "CurrentTypeID": 20,
            "Quantity": 1
        },
        {
            "ID": 112095,
            "ConnectionTypeID": 33,
            "StatusTypeID": 50,
            "LevelID": 3,
            "PowerKW": 50,
            "CurrentTypeID": 30,
            "Quantity": 1
        }
    ],
    "NumberOfPoints": 1,
    "GeneralComments": "PETROL,SMATRICS RFID",
    "StatusTypeID": 50,
    "DateLastStatusUpdate": "2017-01-19T17:43:00Z",
    "DataQualityLevel": 1,
    "DateCreated": "2017-01-19T17:41:00Z",
    "SubmissionStatusTypeID": 200
}