{
    "IsRecentlyVerified": false,
    "ID": 52294,
    "UUID": "AD7E0652-DE14-4234-BF92-DF1FBCA9E144",
    "DataProviderID": 1,
    "OperatorID": 105,
    "UsageTypeID": 1,
    "AddressInfo": {
        "ID": 52640,
        "Title": "E-Bike-Station Rathaus",
        "AddressLine1": "Schultheißstraße 2",
        "Town": "Eslohe",
        "StateOrProvince": "Hochsauerlandkreis",
        "Postcode": "59889",
        "CountryID": 87,
        "Latitude": 51.25367,
        "Longitude": 8.17089999999996,
        "ContactTelephone1": "0800 99 44 009",
        "RelatedURL": "http://www.rwe.com/web/cms/de/494436/e-bikes-on-tour/ladestationen/",
        "DistanceUnit": 0
    },
    "Connections": [
        {
            "ID": 64945,
            "ConnectionTypeID": 28,
            "StatusTypeID": 50,
            "LevelID": 1,
            "Amps": 10,
            "Voltage": 230,
            "PowerKW": 2.3,
            "CurrentTypeID": 10,
            "Quantity": 3
        }
    ],
    "NumberOfPoints": 3,
    "StatusTypeID": 50,
    "DateLastStatusUpdate": "2015-08-28T09:32:00Z",
    "DataQualityLevel": 1,
    "DateCreated": "2015-08-28T06:49:00Z",
    "SubmissionStatusTypeID": 200
}