{
    "IsRecentlyVerified": false,
    "ID": 77091,
    "UUID": "AC1E2156-2BEF-4698-9A4A-8F58883B6CA2",
    "DataProviderID": 1,
    "OperatorID": 156,
    "UsageTypeID": 4,
    "AddressInfo": {
        "ID": 77437,
        "Title": "Tankstelle Boxenstopp Aschau",
        "AddressLine1": "Frasdorfer Straße",
        "AddressLine2": "Seehaus",
        "Town": "Aschau im Chiemgau",
        "StateOrProvince": "Landkreis Rosenheim",
        "Postcode": "83229",
        "CountryID": 87,
        "Latitude": 47.7808068,
        "Longitude": 12.322172899999941,
        "AccessComments": "Rund um die Uhr (24/7) nutzbare lolo Wallbox an der Gebäusewand in der Ecke neben der Mauer mit transparentem Windschutz.\r\n",
        "DistanceUnit": 0
    },
    "Connections": [
        {
            "ID": 110744,
            "ConnectionTypeID": 25,
            "StatusTypeID": 50,
            "LevelID": 2,
            "Amps": 32,
            "Voltage": 400,
            "PowerKW": 22,
            "CurrentTypeID": 20,
            "Quantity": 1
        }
    ],
    "NumberOfPoints": 1,
    "StatusTypeID": 50,
    "DateLastStatusUpdate": "2016-12-30T22:17:00Z",
    "DataQualityLevel": 1,
    "DateCreated": "2016-12-30T22:17:00Z",
    "SubmissionStatusTypeID": 200
}