{
    "IsRecentlyVerified": false,
    "ID": 68630,
    "UUID": "A9DBB0F5-C65A-4F21-B465-4A459087B804",
    "DataProviderID": 1,
    "OperatorID": 66,
    "UsageTypeID": 3,
    "AddressInfo": {
        "ID": 68976,
        "Title": "LemonTec IT Systems",
        "AddressLine1": "An der Barsbek 2",
        "Town": "Barsbüttel",
        "StateOrProvince": "Kreis Stormarn",
        "Postcode": "22885",
        "CountryID": 87,
        "Latitude": 53.56406,
        "Longitude": 10.168189999999981,
        "ContactTelephone1": "+49 40 6759596-0",
        "AccessComments": "Edelstahlkasten mit CEE Dose an der Hauswand links neben dem Firmeneingang. Vermutlich Drehstromnetz, daher vorher anmelden.",
        "RelatedURL": "http://www.lemontec.de/",
        "DistanceUnit": 0
    },
    "Connections": [
        {
            "ID": 96237,
            "ConnectionTypeID": 17,
            "StatusTypeID": 50,
            "LevelID": 2,
            "Amps": 32,
            "Voltage": 400,
            "PowerKW": 22,
            "CurrentTypeID": 20,
            "Quantity": 1
        }
    ],
    "NumberOfPoints": 1,
    "StatusTypeID": 50,
    "DateLastStatusUpdate": "2016-06-14T07:09:00Z",
    "DataQualityLevel": 1,
    "DateCreated": "2016-06-14T07:09:00Z",
    "SubmissionStatusTypeID": 200
}