{
    "IsRecentlyVerified": false,
    "ID": 124158,
    "UUID": "29FB5FBC-8484-496E-8244-7D3331FE5361",
    "DataProviderID": 2,
    "DataProvidersReference": "80180",
    "OperatorID": 5,
    "UsageTypeID": 1,
    "AddressInfo": {
        "ID": 124504,
        "Title": "360 3RD ST",
        "AddressLine1": "360 3rd St",
        "Town": "San Francisco",
        "StateOrProvince": "CA",
        "Postcode": "94107",
        "CountryID": 2,
        "Latitude": 37.782688,
        "Longitude": -122.398346,
        "ContactTelephone1": "888-758-4389",
        "AccessComments": "24 hours daily",
        "RelatedURL": "http://www.chargepoint.com/",
        "DistanceUnit": 0
    },
    "Connections": [
        {
            "ID": 174220,
            "ConnectionTypeID": 1,
            "LevelID": 2,
            "Amps": 16,
            "Voltage": 230,
            "PowerKW": 3,
            "CurrentTypeID": 10,
            "Quantity": 4
        }
    ],
    "DateLastStatusUpdate": "2019-12-24T09:14:00Z",
    "DataQualityLevel": 3,
    "DateCreated": "2019-04-06T05:03:00Z",
    "SubmissionStatusTypeID": 100
}