{
    "IsRecentlyVerified": false,
    "ID": 107560,
    "UUID": "668A2536-BB96-4FB4-A2E0-8004CD75C1A0",
    "DataProviderID": 1,
    "OperatorID": 229,
    "UsageTypeID": 4,
    "UsageCost": "$0.25/kWh + $0.25/min",
    "AddressInfo": {
        "ID": 107906,
        "Title": "New World Hokitika",
        "AddressLine1": "Revell Street",
        "Town": "Hokitika",
        "Postcode": "7810",
        "CountryID": 161,
        "Latitude": -42.716812,
        "Longitude": 170.96318,
        "DistanceUnit": 0
    },
    "Connections": [
        {
            "ID": 151779,
            "ConnectionTypeID": 2,
            "StatusTypeID": 50,
            "LevelID": 3,
            "PowerKW": 50,
            "CurrentTypeID": 30,
            "Quantity": 1
        },
        {
            "ID": 151780,
            "ConnectionTypeID": 33,
            "StatusTypeID": 50,
            "LevelID": 3,
            "PowerKW": 50,
            "CurrentTypeID": 30,
            "Quantity": 1
        }
    ],
    "NumberOfPoints": 1,
    "StatusTypeID": 50,
    "DateLastStatusUpdate": "2018-08-01T20:15:00Z",
    "DataQualityLevel": 1,
    "DateCreated": "2018-08-01T14:34:00Z",
    "SubmissionStatusTypeID": 200
}