{
    "IsRecentlyVerified": false,
    "ID": 73760,
    "UUID": "8A6A45B0-D208-4178-917B-D87809584F16",
    "DataProviderID": 1,
    "OperatorID": 89,
    "OperatorsReference": "CEA-10205",
    "UsageTypeID": 4,
    "UsageCost": "CAD 2.50",
    "AddressInfo": {
        "ID": 74106,
        "Title": "Rio-Parc Olympique",
        "AddressLine1": "4141 Avenue Pierre-De Coubertin",
        "Town": "Montréal",
        "StateOrProvince": "QC",
        "Postcode": "H1V 3N7",
        "CountryID": 44,
        "Latitude": 45.5554177287515,
        "Longitude": -73.5513811997223,
        "DistanceUnit": 0
    },
    "Connections": [
        {
            "ID": 106062,
            "ConnectionTypeID": 1,
            "StatusTypeID": 50,
            "LevelID": 2,
            "Amps": 32,
            "Voltage": 230,
            "PowerKW": 7,
            "CurrentTypeID": 10,
            "Quantity": 1
        }
    ],
    "NumberOfPoints": 1,
    "StatusTypeID": 50,
    "DateLastStatusUpdate": "2017-01-22T19:27:00Z",
    "DataQualityLevel": 1,
    "DateCreated": "2016-11-23T22:59:00Z",
    "SubmissionStatusTypeID": 200
}