{
    "IsRecentlyVerified": false,
    "ID": 87856,
    "UUID": "71040FD7-CE7B-4968-98A7-40D69D91BD91",
    "DataProviderID": 1,
    "OperatorID": 45,
    "UsageTypeID": 5,
    "UsageCost": "$2.00",
    "AddressInfo": {
        "ID": 88202,
        "Title": "Wellington Kiwi Holiday Park",
        "AddressLine1": "45 Akatarawa Road",
        "Town": "Upper Hutt",
        "Postcode": "5018",
        "CountryID": 161,
        "Latitude": -41.1008066028121,
        "Longitude": 175.091819963572,
        "ContactTelephone1": "045267400",
        "DistanceUnit": 0
    },
    "Connections": [
        {
            "ID": 124650,
            "ConnectionTypeID": 4,
            "StatusTypeID": 50,
            "LevelID": 2,
            "Amps": 16,
            "Voltage": 230,
            "PowerKW": 3.6,
            "CurrentTypeID": 10
        }
    ],
    "NumberOfPoints": 1,
    "GeneralComments": "$2 per hour. Check with Owners : Keith & Kathy Giles\r\nBlue Commando style 16A plug EVSE required. This is a great place to stay overnight for a full charge or a top up during the day at the Holiday Park next to Harcourts Park and Hutt River.",
    "StatusTypeID": 50,
    "DateLastStatusUpdate": "2017-05-17T06:35:00Z",
    "DataQualityLevel": 1,
    "DateCreated": "2017-05-16T11:33:00Z",
    "SubmissionStatusTypeID": 200
}