{
    "IsRecentlyVerified": false,
    "ID": 42886,
    "UUID": "7A31DCF3-178F-4835-AC05-A8C66F602626",
    "DataProviderID": 26,
    "DataProvidersReference": "60129",
    "OperatorID": 157,
    "OperatorsReference": "NewMotion 02008044",
    "UsageCost": "0.00 jaarabonnement",
    "AddressInfo": {
        "ID": 43232,
        "Title": "Cimburgalaan 5",
        "AddressLine1": "Cimburgalaan 5",
        "Town": "Breda",
        "Postcode": "4819 BA",
        "CountryID": 159,
        "Latitude": 51.5722579956055,
        "Longitude": 4.77537155151367,
        "ContactTelephone1": "088 0109500",
        "RelatedURL": "http://thenewmotion.nl/",
        "DistanceUnit": 0
    },
    "Connections": [
        {
            "ID": 51811,
            "ConnectionTypeID": 25,
            "LevelID": 2,
            "PowerKW": 3.7,
            "CurrentTypeID": 10
        }
    ],
    "NumberOfPoints": 1,
    "StatusTypeID": 50,
    "DateLastStatusUpdate": "2016-06-04T02:39:00Z",
    "DataQualityLevel": 3,
    "DateCreated": "2015-03-25T02:49:00Z",
    "SubmissionStatusTypeID": 100
}