{
    "IsRecentlyVerified": false,
    "ID": 143765,
    "UUID": "42C184D9-ED79-439D-B7C5-DE60EAC09880",
    "DataProviderID": 2,
    "DataProvidersReference": "123083",
    "OperatorID": 3372,
    "UsageTypeID": 1,
    "AddressInfo": {
        "ID": 144117,
        "Title": "Town of Westport New York",
        "AddressLine1": "22 Champlain Ave",
        "Town": "Westport",
        "StateOrProvince": "NY",
        "Postcode": "12993",
        "CountryID": 2,
        "Latitude": 44.1858358,
        "Longitude": -73.4355011,
        "ContactTelephone1": "866-816-7584",
        "AccessComments": "24 hours daily",
        "RelatedURL": "http://evconnect.com/",
        "DistanceUnit": 0
    },
    "Connections": [
        {
            "ID": 200157,
            "ConnectionTypeID": 1,
            "LevelID": 2,
            "Amps": 16,
            "Voltage": 230,
            "PowerKW": 3.7,
            "CurrentTypeID": 10,
            "Quantity": 1
        }
    ],
    "StatusTypeID": 50,
    "DateLastStatusUpdate": "2020-06-26T03:07:00Z",
    "DataQualityLevel": 3,
    "DateCreated": "2019-12-24T09:22:00Z",
    "SubmissionStatusTypeID": 100
}