{
    "IsRecentlyVerified": false,
    "ID": 159555,
    "UUID": "88E6FC65-C59A-443D-A889-E1D669C4EFE3",
    "DataProviderID": 2,
    "DataProvidersReference": "153324",
    "OperatorID": 5,
    "UsageTypeID": 1,
    "AddressInfo": {
        "ID": 159912,
        "Title": "PNB",
        "AddressLine1": "22 S 1st St",
        "Town": "Newark",
        "StateOrProvince": "OH",
        "Postcode": "43055",
        "CountryID": 2,
        "Latitude": 40.0577796,
        "Longitude": -82.398208,
        "ContactTelephone1": "888-758-4389",
        "AccessComments": "24 hours daily",
        "RelatedURL": "http://www.chargepoint.com/",
        "DistanceUnit": 0
    },
    "Connections": [
        {
            "ID": 229748,
            "ConnectionTypeID": 1,
            "LevelID": 2,
            "Amps": 16,
            "Voltage": 230,
            "PowerKW": 3.7,
            "CurrentTypeID": 10,
            "Quantity": 2
        }
    ],
    "StatusTypeID": 50,
    "DateLastStatusUpdate": "2020-06-26T03:02:00Z",
    "DataQualityLevel": 3,
    "DateCreated": "2020-06-26T03:02:00Z",
    "SubmissionStatusTypeID": 100
}