{
    "IsRecentlyVerified": false,
    "ID": 62674,
    "UUID": "03E74569-AE3B-402A-B09C-4A5C1A6006B0",
    "DataProviderID": 26,
    "DataProvidersReference": "22421",
    "OperatorID": 162,
    "OperatorsReference": "道の駅　六合（くに）",
    "UsageCost": "0.00 onbekend",
    "AddressInfo": {
        "ID": 63020,
        "Title": "292",
        "AddressLine1": "292",
        "Town": "中之条町",
        "Postcode": "",
        "CountryID": 114,
        "Latitude": 36.607494,
        "Longitude": 138.638474,
        "DistanceUnit": 0
    },
    "Connections": [
        {
            "ID": 79597,
            "ConnectionTypeID": 2,
            "LevelID": 3,
            "PowerKW": 50,
            "CurrentTypeID": 30
        }
    ],
    "NumberOfPoints": 1,
    "StatusTypeID": 50,
    "DateLastStatusUpdate": "2016-03-03T12:29:00Z",
    "DataQualityLevel": 3,
    "DateCreated": "2016-03-03T12:29:00Z",
    "SubmissionStatusTypeID": 100
}