{
    "IsRecentlyVerified": false,
    "ID": 153049,
    "UUID": "E6A5EC09-1C98-4B30-B22D-27342F15D4FF",
    "DataProviderID": 28,
    "DataProvidersReference": "FR*S89*P89426*A",
    "UsageTypeID": 5,
    "AddressInfo": {
        "ID": 153402,
        "Title": "VAL DE MERCY_23 Rue De Vincelles",
        "AddressLine1": "23 Rue De Vincelles 89580 VAL DE MERCY",
        "CountryID": 80,
        "Latitude": 47.67741993,
        "Longitude": 3.59036073,
        "AccessComments": "24/24 7/7 jours",
        "DistanceUnit": 0
    },
    "Connections": [
        {
            "ID": 214527,
            "ConnectionTypeID": 28,
            "StatusTypeID": 50,
            "LevelID": 2,
            "PowerKW": 22,
            "CurrentTypeID": 10
        },
        {
            "ID": 214528,
            "ConnectionTypeID": 1036,
            "StatusTypeID": 50,
            "LevelID": 2,
            "PowerKW": 22,
            "CurrentTypeID": 20
        },
        {
            "ID": 247850,
            "ConnectionTypeID": 28,
            "StatusTypeID": 50,
            "LevelID": 2,
            "PowerKW": 22,
            "CurrentTypeID": 10
        },
        {
            "ID": 247851,
            "ConnectionTypeID": 1036,
            "StatusTypeID": 50,
            "LevelID": 2,
            "PowerKW": 22,
            "CurrentTypeID": 20
        }
    ],
    "GeneralComments": "",
    "StatusTypeID": 50,
    "DateLastStatusUpdate": "2020-08-27T05:14:00Z",
    "DataQualityLevel": 2,
    "DateCreated": "2020-03-15T10:54:00Z",
    "SubmissionStatusTypeID": 100
}