{
    "IsRecentlyVerified": false,
    "ID": 167025,
    "UUID": "34D00824-1C78-44FB-A031-5F0A4FCF600E",
    "DataProviderID": 1,
    "OperatorID": 1,
    "UsageTypeID": 5,
    "AddressInfo": {
        "ID": 167384,
        "Title": "Harrow-On-The-Hill LU Station Car Park, Station Approach, Harrow",
        "AddressLine1": "Harrow-On-The-Hill LU Station Car Park, Station Approach, Harrow",
        "Town": "Harrow",
        "Postcode": "HA1 1BB",
        "CountryID": 1,
        "Latitude": 51.57842,
        "Longitude": -0.334269,
        "AccessComments": "",
        "RelatedURL": "http://www.esb-evsolutions.co.uk/",
        "DistanceUnit": 0
    },
    "Connections": [
        {
            "ID": 252898,
            "ConnectionTypeID": 2,
            "Reference": "CHAdeMO",
            "StatusTypeID": 50,
            "LevelID": 3,
            "Amps": 125,
            "Voltage": 400,
            "PowerKW": 50,
            "CurrentTypeID": 30,
            "Quantity": 1
        },
        {
            "ID": 252899,
            "ConnectionTypeID": 33,
            "Reference": "CCS",
            "StatusTypeID": 50,
            "LevelID": 3,
            "Amps": 125,
            "Voltage": 400,
            "PowerKW": 50,
            "CurrentTypeID": 30,
            "Quantity": 1
        }
    ],
    "StatusTypeID": 50,
    "DateLastStatusUpdate": "2020-12-30T21:29:00Z",
    "MetadataValues": [
        {
            "ID": 7782,
            "MetadataFieldID": 4,
            "ItemValue": "Contains public sector information licensed under the Open Government Licence v2.0. http://www.nationalarchives.gov.uk/doc/open-government-licence/version/2/"
        }
    ],
    "DataQualityLevel": 3,
    "DateCreated": "2020-08-27T08:10:00Z",
    "SubmissionStatusTypeID": 100
}