{
    "IsRecentlyVerified": false,
    "ID": 75151,
    "UUID": "2B2FAA1D-BA53-4774-BCCE-D6B938DE9BE5",
    "DataProviderID": 1,
    "UsageTypeID": 1,
    "AddressInfo": {
        "ID": 75497,
        "Title": "Chalky Car Park",
        "AddressLine1": "South Square",
        "Town": "Boston",
        "StateOrProvince": "Lincolnshire",
        "Postcode": "PE21 6HL",
        "CountryID": 1,
        "Latitude": 52.9751474229857,
        "Longitude": -0.0236039822784817,
        "ContactEmail": "enquiries@chalky.org.uk",
        "RelatedURL": "http://chalky.org.uk/",
        "DistanceUnit": 0
    },
    "Connections": [
        {
            "ID": 108387,
            "ConnectionTypeID": 16,
            "StatusTypeID": 50,
            "LevelID": 2,
            "Amps": 32,
            "Voltage": 230,
            "PowerKW": 7,
            "CurrentTypeID": 10,
            "Quantity": 1
        }
    ],
    "NumberOfPoints": 1,
    "StatusTypeID": 50,
    "DateLastStatusUpdate": "2016-12-12T23:24:00Z",
    "DataQualityLevel": 1,
    "DateCreated": "2016-12-12T22:47:00Z",
    "SubmissionStatusTypeID": 200
}