{
    "IsRecentlyVerified": false,
    "ID": 104489,
    "UUID": "1530C102-86DF-4CAB-ADEF-7A35DDB5EE2F",
    "DataProviderID": 1,
    "OperatorID": 23,
    "OperatorsReference": "43163",
    "UsageTypeID": 4,
    "AddressInfo": {
        "ID": 104835,
        "Title": "Almansor Court",
        "AddressLine1": "700 S Almansor St",
        "Town": "Alhambra",
        "StateOrProvince": "California",
        "Postcode": "91801",
        "CountryID": 2,
        "Latitude": 34.08998,
        "Longitude": -118.116006,
        "ContactTelephone1": "(626) 570-4600",
        "DistanceUnit": 0
    },
    "Connections": [
        {
            "ID": 147484,
            "ConnectionTypeID": 30,
            "StatusTypeID": 50,
            "LevelID": 2,
            "PowerKW": 16,
            "CurrentTypeID": 20,
            "Quantity": 2
        }
    ],
    "NumberOfPoints": 2,
    "GeneralComments": "2 Tesla Connectors, up to 16kW.Available for customers. Please see front desk.",
    "StatusTypeID": 50,
    "DateLastStatusUpdate": "2018-05-20T05:44:00Z",
    "DataQualityLevel": 1,
    "DateCreated": "2018-05-20T05:44:00Z",
    "SubmissionStatusTypeID": 200
}