{
    "IsRecentlyVerified": false,
    "ID": 70273,
    "UUID": "5CB9006C-1319-4C8C-A040-9A189B1EA231",
    "DataProviderID": 2,
    "DataProvidersReference": "76714",
    "OperatorID": 5,
    "UsageTypeID": 1,
    "AddressInfo": {
        "ID": 70619,
        "Title": "REGIONAL EVSES",
        "AddressLine1": "179 E 8th Ave",
        "Town": "Springfield",
        "StateOrProvince": "CO",
        "Postcode": "81073",
        "CountryID": 2,
        "Latitude": 37.4063204,
        "Longitude": -102.6161413,
        "ContactTelephone1": "888-758-4389",
        "AccessComments": "24 hours daily",
        "RelatedURL": "http://www.chargepoint.com/",
        "DistanceUnit": 0
    },
    "Connections": [
        {
            "ID": 100314,
            "ConnectionTypeID": 1,
            "LevelID": 2,
            "Amps": 16,
            "Voltage": 230,
            "PowerKW": 3,
            "CurrentTypeID": 10,
            "Quantity": 2
        }
    ],
    "DateLastStatusUpdate": "2019-04-06T04:02:00Z",
    "DataQualityLevel": 3,
    "DateCreated": "2016-07-14T00:53:00Z",
    "SubmissionStatusTypeID": 100
}