{
    "IsRecentlyVerified": false,
    "ID": 148790,
    "UUID": "8C72A0F5-734D-4802-90EB-6E1380B5BB28",
    "DataProviderID": 1,
    "OperatorID": 23,
    "OperatorsReference": "34719",
    "UsageTypeID": 4,
    "UsageCost": "$0.24/min >=60kW; $0.12/min <60kW; other tariffs for older cars",
    "AddressInfo": {
        "ID": 149142,
        "Title": "Swartz Creek, Mi Supercharger",
        "AddressLine1": "4141 Morrish Road",
        "Town": "Swartz Creek",
        "StateOrProvince": "MI",
        "Postcode": "48473",
        "CountryID": 2,
        "Latitude": 42.967072,
        "Longitude": -83.829044,
        "DistanceUnit": 0
    },
    "Connections": [
        {
            "ID": 206627,
            "ConnectionTypeID": 27,
            "StatusTypeID": 50,
            "LevelID": 3,
            "PowerKW": 120,
            "CurrentTypeID": 30,
            "Quantity": 10
        }
    ],
    "NumberOfPoints": 10,
    "GeneralComments": "Charging10 Superchargers, available 24/7, up to 150kW",
    "StatusTypeID": 50,
    "DateLastStatusUpdate": "2020-02-11T06:39:00Z",
    "DataQualityLevel": 1,
    "DateCreated": "2020-02-11T06:39:00Z",
    "SubmissionStatusTypeID": 200
}