{
    "IsRecentlyVerified": false,
    "ID": 110422,
    "UUID": "84B81F50-4BCA-4397-A441-764EA1A48CE2",
    "DataProviderID": 2,
    "DataProvidersReference": "99435",
    "UsageTypeID": 1,
    "AddressInfo": {
        "ID": 110768,
        "Title": "Studio 3807",
        "AddressLine1": "3807 Rhode Island Ave",
        "Town": "Brentwood",
        "StateOrProvince": "MD",
        "Postcode": "20722",
        "CountryID": 2,
        "Latitude": 38.938966,
        "Longitude": -76.955265,
        "ContactTelephone1": "410-685-1109",
        "AccessComments": "24 hours daily",
        "RelatedURL": "",
        "DistanceUnit": 0
    },
    "Connections": [
        {
            "ID": 155674,
            "ConnectionTypeID": 1,
            "LevelID": 2,
            "Amps": 16,
            "Voltage": 230,
            "PowerKW": 3.7,
            "CurrentTypeID": 10,
            "Quantity": 2
        }
    ],
    "DateLastStatusUpdate": "2020-06-26T03:00:00Z",
    "DataQualityLevel": 3,
    "DateCreated": "2018-10-18T23:36:00Z",
    "SubmissionStatusTypeID": 100
}