{
    "IsRecentlyVerified": false,
    "ID": 29028,
    "UUID": "F9A8C609-F026-4405-8B77-C078599D4137",
    "DataProviderID": 2,
    "DataProvidersReference": "60510",
    "UsageTypeID": 1,
    "AddressInfo": {
        "ID": 29374,
        "Title": "Kwik Trip #766",
        "AddressLine1": "4701 Farwell St",
        "Town": "McFarland",
        "StateOrProvince": "WI",
        "Postcode": "53558",
        "CountryID": 2,
        "Latitude": 43.012994,
        "Longitude": -89.302592,
        "ContactTelephone1": "608-838-9011",
        "AccessComments": "24 hours daily",
        "RelatedURL": "",
        "DistanceUnit": 0
    },
    "Connections": [
        {
            "ID": 31899,
            "ConnectionTypeID": 9,
            "LevelID": 1,
            "Amps": 16,
            "Voltage": 120,
            "PowerKW": 1.9,
            "CurrentTypeID": 10,
            "Quantity": 1
        }
    ],
    "DateLastStatusUpdate": "2020-06-26T03:06:00Z",
    "DataQualityLevel": 3,
    "DateCreated": "2014-11-28T03:38:00Z",
    "SubmissionStatusTypeID": 100
}