{
    "IsRecentlyVerified": false,
    "ID": 30751,
    "UUID": "EA53B964-602C-4F31-9E0D-A0C7AC680998",
    "DataProviderID": 1,
    "DataProvidersReference": "1375",
    "AddressInfo": {
        "ID": 31097,
        "Title": "Oslo Golfklubb",
        "AddressLine1": "Ankerveien 127",
        "Town": "OSLO",
        "StateOrProvince": "Oslo",
        "Postcode": "0766",
        "CountryID": 168,
        "Latitude": 59.9623,
        "Longitude": 10.6388,
        "AccessComments": "Usikker på plasseringen på stedet.",
        "DistanceUnit": 0
    },
    "Connections": [
        {
            "ID": 33980,
            "ConnectionTypeID": 0,
            "Reference": "1",
            "LevelID": 2,
            "Amps": 16,
            "Voltage": 230,
            "PowerKW": 3.7,
            "Comments": "Mode 1"
        },
        {
            "ID": 88812,
            "ConnectionTypeID": 0,
            "Reference": "2",
            "LevelID": 2,
            "Amps": 16,
            "Voltage": 230,
            "PowerKW": 3.7,
            "Comments": "Mode 1"
        }
    ],
    "NumberOfPoints": 2,
    "DateLastStatusUpdate": "2020-05-26T08:23:00Z",
    "DataQualityLevel": 2,
    "DateCreated": "2014-12-09T09:00:00Z",
    "SubmissionStatusTypeID": 100
}