{
    "UserComments": [
        {
            "ID": 19380,
            "ChargePointID": 75578,
            "CommentTypeID": 50,
            "UserName": "Toumal",
            "Comment": "Just like on Westbahnhof, most of the charge points are out of order, and have been broken for a long time. Only two Type 2 cars can charge at any given time. To make matters worse, several hybrid drivers \"charge\" their cars during the day for 8 hours or more. That is, if the nearby car wash doesn't block the charger points with their customer cars. If you arrive after 19:00 in the evening, you're fine. Charging before then is a matter of luck.",
            "Rating": 3,
            "DateCreated": "2018-04-05T18:39:13.343Z",
            "User": {
                "ID": 18187,
                "Username": "Toumal"
            },
            "CheckinStatusTypeID": 25
        }
    ],
    "IsRecentlyVerified": false,
    "ID": 75578,
    "UUID": "9F3B6058-45E6-4FD2-B028-F66CBC3AD598",
    "DataProviderID": 1,
    "OperatorID": 142,
    "OperatorsReference": "3345153",
    "UsageTypeID": 4,
    "AddressInfo": {
        "ID": 75924,
        "Title": "Millenium City Garage Ph 1",
        "AddressLine1": "Handelskai 94-96",
        "Town": "Wien",
        "Postcode": "1200",
        "CountryID": 19,
        "Latitude": 48.2409586,
        "Longitude": 16.3861415,
        "AccessComments": "Details zum Elektrotankstellenort:  Abfahrtsebene links\r\n\r\nZusatz: Gratis-Parken während der ersten 3 Stunden",
        "DistanceUnit": 0
    },
    "Connections": [
        {
            "ID": 108955,
            "ConnectionTypeID": 25,
            "StatusTypeID": 50,
            "LevelID": 2,
            "Amps": 16,
            "Voltage": 400,
            "PowerKW": 11,
            "CurrentTypeID": 20,
            "Quantity": 5
        },
        {
            "ID": 108956,
            "ConnectionTypeID": 28,
            "StatusTypeID": 50,
            "LevelID": 2,
            "Amps": 16,
            "Voltage": 230,
            "PowerKW": 4,
            "CurrentTypeID": 10,
            "Quantity": 6
        }
    ],
    "NumberOfPoints": 6,
    "GeneralComments": "Wien Energie Tanke-Karte; WienMobil-Karte; BMW i-ChargeNow-Karte; intercharge-App",
    "StatusTypeID": 50,
    "DateLastStatusUpdate": "2018-05-31T14:39:00Z",
    "DataQualityLevel": 1,
    "DateCreated": "2016-12-16T19:40:00Z",
    "SubmissionStatusTypeID": 200
}