{
    "IsRecentlyVerified": false,
    "ID": 141145,
    "UUID": "683F45B4-4B75-42B0-9812-AADB2F9807CE",
    "DataProviderID": 2,
    "DataProvidersReference": "113445",
    "OperatorID": 23,
    "UsageTypeID": 1,
    "AddressInfo": {
        "ID": 141497,
        "Title": "Whitehall Lane Winery - Tesla Destination",
        "AddressLine1": "1563 St. Helena Hwy S",
        "Town": "St. Helena",
        "StateOrProvince": "CA",
        "Postcode": "94574",
        "CountryID": 2,
        "Latitude": 38.476174,
        "Longitude": -122.439432,
        "ContactTelephone1": "800-963-9454  877-798-3752",
        "AccessComments": "24 hours daily; for customer use only",
        "RelatedURL": "https://www.tesla.com/destination-charging",
        "DistanceUnit": 0
    },
    "Connections": [
        {
            "ID": 196989,
            "ConnectionTypeID": 30,
            "LevelID": 2,
            "Amps": 16,
            "Voltage": 230,
            "PowerKW": 3.7,
            "CurrentTypeID": 10,
            "Quantity": 2
        }
    ],
    "StatusTypeID": 50,
    "DateLastStatusUpdate": "2020-06-26T03:00:00Z",
    "DataQualityLevel": 3,
    "DateCreated": "2019-12-24T09:14:00Z",
    "SubmissionStatusTypeID": 100
}