{
    "IsRecentlyVerified": false,
    "ID": 157863,
    "UUID": "F7441F04-62AB-4911-89F8-B6B67AAF2B83",
    "DataProviderID": 18,
    "DataProvidersReference": "e0c4ba8f6e02c02ed67cc30334e8c183",
    "UsageTypeID": 1,
    "AddressInfo": {
        "ID": 158217,
        "Title": "Level A – Fulham Broadway Car Park, Fulham Road",
        "AddressLine1": "Level A – Fulham Broadway Car Park, Fulham Road",
        "Town": "London",
        "Postcode": "SW6 1BW",
        "CountryID": 1,
        "Latitude": 51.480804,
        "Longitude": -0.194908,
        "AccessComments": "",
        "RelatedURL": "http://tbc",
        "DistanceUnit": 0
    },
    "Connections": [
        {
            "ID": 227478,
            "ConnectionTypeID": 25,
            "Reference": "4002056",
            "StatusTypeID": 50,
            "LevelID": 2,
            "Amps": 32,
            "Voltage": 400,
            "PowerKW": 22,
            "CurrentTypeID": 20
        }
    ],
    "StatusTypeID": 0,
    "DateLastStatusUpdate": "2021-07-12T03:38:00Z",
    "MetadataValues": [
        {
            "ID": 7396,
            "MetadataFieldID": 4,
            "ItemValue": "Contains public sector information licensed under the Open Government Licence v2.0. http://www.nationalarchives.gov.uk/doc/open-government-licence/version/2/"
        }
    ],
    "DataQualityLevel": 3,
    "DateCreated": "2020-06-25T10:00:00Z",
    "SubmissionStatusTypeID": 100
}