{
    "IsRecentlyVerified": false,
    "ID": 61221,
    "UUID": "310FB8EB-853E-4738-95E8-19186AE2BF0B",
    "DataProviderID": 1,
    "OperatorID": 23,
    "OperatorsReference": "20710",
    "UsageTypeID": 6,
    "UsageCost": "Free",
    "AddressInfo": {
        "ID": 61567,
        "Title": "Hotel Schloss Basthorst",
        "AddressLine1": "Schlossstraße 18",
        "Town": "Crivitz",
        "StateOrProvince": "Crivitz",
        "Postcode": "19089",
        "CountryID": 87,
        "Latitude": 53.6381615,
        "Longitude": 11.6266028,
        "ContactTelephone1": "+49 3863 52 50",
        "AccessComments": "16A-Drehstromsteckdose in der Tiefgarage; jedoch nur mit Zwischenverteiler und 10m Verlängerung anschließbar, da sonst das Tor nicht mehr funktioniert.",
        "RelatedURL": "http://www.schloss-basthorst.de/de",
        "DistanceUnit": 0
    },
    "Connections": [
        {
            "ID": 77930,
            "ConnectionTypeID": 30,
            "StatusTypeID": 50,
            "LevelID": 2,
            "Amps": 16,
            "Voltage": 400,
            "PowerKW": 22,
            "CurrentTypeID": 20,
            "Quantity": 2
        }
    ],
    "NumberOfPoints": 2,
    "StatusTypeID": 50,
    "DateLastStatusUpdate": "2018-10-03T17:48:00Z",
    "DataQualityLevel": 1,
    "DateCreated": "2016-02-16T12:59:00Z",
    "SubmissionStatusTypeID": 200
}