{
    "IsRecentlyVerified": false,
    "ID": 33874,
    "UUID": "BEC6E5B9-94B7-495B-AFA1-7A20D108C593",
    "DataProviderID": 26,
    "DataProvidersReference": "54329",
    "OperatorID": 73,
    "OperatorsReference": "EV-Box EVB-P1423285",
    "UsageCost": "0.00 jaarabonnement",
    "AddressInfo": {
        "ID": 34220,
        "Title": "Baanhoekweg",
        "AddressLine1": "Baanhoekweg",
        "Town": "Dordrecht",
        "Postcode": "3313 LA",
        "CountryID": 159,
        "Latitude": 51.81488,
        "Longitude": 4.73383,
        "RelatedURL": "http://www.ev-box.nl",
        "DistanceUnit": 0
    },
    "Connections": [
        {
            "ID": 37385,
            "ConnectionTypeID": 25,
            "LevelID": 2,
            "PowerKW": 11,
            "CurrentTypeID": 10
        },
        {
            "ID": 46950,
            "ConnectionTypeID": 25,
            "LevelID": 2,
            "PowerKW": 11,
            "CurrentTypeID": 10
        },
        {
            "ID": 46951,
            "ConnectionTypeID": 25,
            "LevelID": 2,
            "PowerKW": 11,
            "CurrentTypeID": 10
        },
        {
            "ID": 46952,
            "ConnectionTypeID": 25,
            "LevelID": 2,
            "PowerKW": 11,
            "CurrentTypeID": 10
        }
    ],
    "NumberOfPoints": 1,
    "StatusTypeID": 50,
    "DateLastStatusUpdate": "2016-06-04T02:40:00Z",
    "DataQualityLevel": 3,
    "DateCreated": "2015-01-09T06:04:00Z",
    "SubmissionStatusTypeID": 100
}