{
    "UserComments": [
        {
            "ID": 1299,
            "ChargePointID": 13473,
            "CommentTypeID": 50,
            "UserName": "",
            "Comment": "",
            "Rating": 1,
            "DateCreated": "2014-10-14T12:28:30.25Z",
            "CheckinStatusTypeID": 20
        }
    ],
    "IsRecentlyVerified": false,
    "ID": 13473,
    "UUID": "5291E80C-D5B9-48AD-BD45-59FE8D4817A7",
    "DataProviderID": 1,
    "OperatorID": 1,
    "UsageTypeID": 5,
    "UsageCost": "Free",
    "AddressInfo": {
        "ID": 13370,
        "Title": "Parking Jolimont",
        "AddressLine1": "",
        "AddressLine2": "",
        "Town": "Toulouse",
        "StateOrProvince": "",
        "Postcode": "31500",
        "CountryID": 80,
        "Latitude": 43.6040202,
        "Longitude": 1.4773113999999623,
        "ContactTelephone1": "",
        "ContactTelephone2": "",
        "ContactEmail": "",
        "AccessComments": "",
        "RelatedURL": "",
        "DistanceUnit": 0
    },
    "Connections": [
        {
            "ID": 10919,
            "ConnectionTypeID": 0,
            "StatusTypeID": 50,
            "LevelID": 2,
            "Amps": 16,
            "Voltage": 230,
            "PowerKW": 3.7,
            "Quantity": 1
        },
        {
            "ID": 10920,
            "ConnectionTypeID": 0,
            "StatusTypeID": 10,
            "LevelID": 2,
            "Amps": 16,
            "Voltage": 230,
            "PowerKW": 3.7,
            "Quantity": 1
        }
    ],
    "NumberOfPoints": 2,
    "GeneralComments": "",
    "StatusTypeID": 50,
    "DateLastStatusUpdate": "2014-10-14T12:29:00Z",
    "DataQualityLevel": 1,
    "DateCreated": "2012-10-19T13:07:00Z",
    "SubmissionStatusTypeID": 200
}