{
    "IsRecentlyVerified": false,
    "ID": 35856,
    "UUID": "651898AE-356B-43BD-B198-94AB34B91773",
    "DataProviderID": 26,
    "DataProvidersReference": "47680",
    "OperatorID": 178,
    "OperatorsReference": "EVnetNL AL831",
    "UsageCost": "0.00 jaarabonnement",
    "AddressInfo": {
        "ID": 36202,
        "Title": "Theresiastraat 47",
        "AddressLine1": "Theresiastraat 47",
        "Town": "Den Haag",
        "Postcode": "2593 AA",
        "CountryID": 159,
        "Latitude": 52.083421,
        "Longitude": 4.331236,
        "ContactTelephone1": "0800-3522365",
        "RelatedURL": "http://www.evnet.nl",
        "DistanceUnit": 0
    },
    "Connections": [
        {
            "ID": 39367,
            "ConnectionTypeID": 25,
            "LevelID": 2,
            "PowerKW": 11,
            "CurrentTypeID": 10
        }
    ],
    "NumberOfPoints": 2,
    "StatusTypeID": 50,
    "DateLastStatusUpdate": "2016-06-04T02:49:00Z",
    "DataQualityLevel": 3,
    "DateCreated": "2015-01-09T06:05:00Z",
    "SubmissionStatusTypeID": 100
}