{
    "IsRecentlyVerified": false,
    "ID": 142831,
    "UUID": "86E5572F-B84E-4643-982C-B38990903790",
    "DataProviderID": 2,
    "DataProvidersReference": "121484",
    "OperatorID": 5,
    "UsageTypeID": 1,
    "AddressInfo": {
        "ID": 143183,
        "Title": "AAMCO EV",
        "AddressLine1": "2020 Ogden Ave",
        "Town": "Lisle",
        "StateOrProvince": "IL",
        "Postcode": "60532",
        "CountryID": 2,
        "Latitude": 41.7994192,
        "Longitude": -88.0931597,
        "ContactTelephone1": "888-758-4389",
        "AccessComments": "24 hours daily",
        "RelatedURL": "http://www.chargepoint.com/",
        "DistanceUnit": 0
    },
    "Connections": [
        {
            "ID": 199057,
            "ConnectionTypeID": 1,
            "LevelID": 2,
            "Amps": 16,
            "Voltage": 230,
            "PowerKW": 3.7,
            "CurrentTypeID": 10,
            "Quantity": 2
        }
    ],
    "StatusTypeID": 50,
    "DateLastStatusUpdate": "2020-06-26T03:05:00Z",
    "DataQualityLevel": 3,
    "DateCreated": "2019-12-24T09:19:00Z",
    "SubmissionStatusTypeID": 100
}