{
    "IsRecentlyVerified": false,
    "ID": 187744,
    "UUID": "AE1EDCFE-E772-4DA6-9916-7EB51DC47CD6",
    "DataProviderID": 18,
    "DataProvidersReference": "b8dfba7fd9a2401218435022f58eb7a5",
    "OperatorID": 2244,
    "UsageTypeID": 5,
    "AddressInfo": {
        "ID": 188103,
        "Title": "19 Nascot Street",
        "AddressLine1": "19 Nascot Street",
        "Town": "London",
        "Postcode": "W12 0HE",
        "CountryID": 1,
        "Latitude": 51.517481,
        "Longitude": -0.225819,
        "AccessComments": "",
        "RelatedURL": "https://www.ubitricity.com",
        "DistanceUnit": 0
    },
    "Connections": [
        {
            "ID": 302984,
            "ConnectionTypeID": 25,
            "Reference": "suby1100003628",
            "StatusTypeID": 50,
            "LevelID": 2,
            "Amps": 16,
            "Voltage": 230,
            "PowerKW": 3.7,
            "CurrentTypeID": 10
        }
    ],
    "StatusTypeID": 0,
    "DateLastStatusUpdate": "2021-07-12T03:38:00Z",
    "MetadataValues": [
        {
            "ID": 19984,
            "MetadataFieldID": 4,
            "ItemValue": "Contains public sector information licensed under the Open Government Licence v2.0. http://www.nationalarchives.gov.uk/doc/open-government-licence/version/2/"
        }
    ],
    "DataQualityLevel": 3,
    "DateCreated": "2021-07-12T03:38:00Z",
    "SubmissionStatusTypeID": 100
}