{
    "UserComments": [
        {
            "ID": 9805,
            "ChargePointID": 24176,
            "CommentTypeID": 10,
            "UserName": "Anon74856763534",
            "Comment": "",
            "DateCreated": "2016-02-27T17:22:36.077Z",
            "User": {
                "ID": 1192,
                "Username": "Anon74856763534"
            },
            "CheckinStatusTypeID": 10
        },
        {
            "ID": 6357,
            "ChargePointID": 24176,
            "CommentTypeID": 10,
            "UserName": "Neil MacLennan",
            "Comment": "",
            "Rating": 4,
            "DateCreated": "2015-08-30T20:36:28.12Z",
            "User": {
                "ID": 6192,
                "Username": "Neil MacLennan"
            },
            "CheckinStatusTypeID": 10
        },
        {
            "ID": 3781,
            "ChargePointID": 24176,
            "CommentTypeID": 10,
            "UserName": "jdsx11",
            "Rating": 5,
            "DateCreated": "2015-02-14T20:30:19.22Z",
            "User": {
                "ID": 4599,
                "Username": "jdsx11"
            },
            "CheckinStatusTypeID": 10
        },
        {
            "ID": 3676,
            "ChargePointID": 24176,
            "CommentTypeID": 10,
            "UserName": "Anon74856763534",
            "Comment": "",
            "DateCreated": "2015-01-31T17:01:49.39Z",
            "User": {
                "ID": 1192,
                "Username": "Anon74856763534"
            },
            "CheckinStatusTypeID": 10
        },
        {
            "ID": 3540,
            "ChargePointID": 24176,
            "CommentTypeID": 10,
            "UserName": "Anon74856763534",
            "Comment": "Successful DC charge last week. Found this charger to be reliable so far.",
            "Rating": 5,
            "DateCreated": "2015-01-08T13:19:33.97Z",
            "User": {
                "ID": 1192,
                "Username": "Anon74856763534"
            },
            "CheckinStatusTypeID": 10
        }
    ],
    "MediaItems": [
        {
            "ID": 872,
            "ChargePointID": 24176,
            "ItemURL": "https://s3-ap-southeast-2.amazonaws.com/openchargemap/images/GB/OCM24176/OCM-24176.orig.2015010816334700.jpg",
            "ItemThumbnailURL": "https://s3-ap-southeast-2.amazonaws.com/openchargemap/images/GB/OCM24176/OCM-24176.thmb.2015010816334700.jpg",
            "Comment": "",
            "IsEnabled": true,
            "IsVideo": false,
            "IsFeaturedItem": false,
            "IsExternalResource": false,
            "User": {
                "ID": 1192,
                "Username": "Anon74856763534"
            },
            "DateCreated": "2015-01-08T16:34:00Z"
        }
    ],
    "IsRecentlyVerified": false,
    "ID": 24176,
    "UUID": "3CE561AC-FC67-42BA-B6BC-A20601591415",
    "DataProviderID": 1,
    "OperatorID": 24,
    "UsageTypeID": 5,
    "UsageCost": "£0.30/kWh",
    "AddressInfo": {
        "ID": 24521,
        "Title": "Hamilton Motorway Services Northbound",
        "AddressLine1": "M74 Northbound",
        "Town": "Hamilton",
        "StateOrProvince": "South Lanarkshire",
        "Postcode": "ML3 6JW",
        "CountryID": 1,
        "Latitude": 55.787293965556,
        "Longitude": -4.03476719801473,
        "AccessComments": "Just turn off M74 and enter the services. ",
        "DistanceUnit": 0
    },
    "Connections": [
        {
            "ID": 26233,
            "ConnectionTypeID": 2,
            "Reference": "GB*GFX*EGS10357*2",
            "StatusTypeID": 50,
            "LevelID": 3,
            "Amps": 200,
            "Voltage": 500,
            "PowerKW": 60,
            "CurrentTypeID": 30,
            "Quantity": 1
        },
        {
            "ID": 26234,
            "ConnectionTypeID": 33,
            "Reference": "GB*GFX*EGS10357*1",
            "StatusTypeID": 50,
            "LevelID": 3,
            "Amps": 200,
            "Voltage": 920,
            "PowerKW": 60,
            "CurrentTypeID": 30,
            "Quantity": 1
        }
    ],
    "NumberOfPoints": 2,
    "StatusTypeID": 50,
    "DateLastStatusUpdate": "2021-10-12T15:09:00Z",
    "DataQualityLevel": 1,
    "DateCreated": "2014-07-09T22:19:00Z",
    "SubmissionStatusTypeID": 200
}