{
    "IsRecentlyVerified": false,
    "ID": 100833,
    "UUID": "E6CD4EE1-F82B-4008-AAAE-A0C06B1B1CF4",
    "DataProviderID": 1,
    "OperatorID": 23,
    "OperatorsReference": "41234",
    "UsageTypeID": 4,
    "AddressInfo": {
        "ID": 101179,
        "Title": "Hilton Garden Inn Reno",
        "AddressLine1": "9920 Double R BLVD",
        "Town": "Reno",
        "StateOrProvince": "Nevada",
        "Postcode": "89521",
        "CountryID": 2,
        "Latitude": 39.44027,
        "Longitude": -119.758341,
        "ContactTelephone1": "(775) 850-9700",
        "DistanceUnit": 0
    },
    "Connections": [
        {
            "ID": 142413,
            "ConnectionTypeID": 30,
            "StatusTypeID": 50,
            "LevelID": 2,
            "PowerKW": 16,
            "CurrentTypeID": 20,
            "Quantity": 3
        }
    ],
    "NumberOfPoints": 3,
    "GeneralComments": "3 Tesla Connectors, up to 16kW.Available for customers. Please see front desk.",
    "StatusTypeID": 50,
    "DateLastStatusUpdate": "2018-03-10T06:56:00Z",
    "DataQualityLevel": 1,
    "DateCreated": "2018-03-10T06:56:00Z",
    "SubmissionStatusTypeID": 200
}