{
    "IsRecentlyVerified": false,
    "ID": 65640,
    "UUID": "3D576E57-B56E-4FE3-938D-2E84936B0464",
    "DataProviderID": 26,
    "DataProvidersReference": "84495",
    "OperatorID": 157,
    "OperatorsReference": "NewMotion 03004932",
    "UsageCost": "0.00 jaarabonnement",
    "AddressInfo": {
        "ID": 65986,
        "Title": "Watertorenpark 3",
        "AddressLine1": "Watertorenpark 3",
        "Town": "Alphen aan den Rijn",
        "Postcode": "2404 HZ",
        "CountryID": 159,
        "Latitude": 52.139388,
        "Longitude": 4.6544577,
        "ContactTelephone1": "088 0109500",
        "RelatedURL": "http://thenewmotion.nl/",
        "DistanceUnit": 0
    },
    "Connections": [
        {
            "ID": 90575,
            "ConnectionTypeID": 25,
            "LevelID": 2,
            "PowerKW": 22,
            "CurrentTypeID": 10
        }
    ],
    "NumberOfPoints": 1,
    "StatusTypeID": 50,
    "DateLastStatusUpdate": "2016-06-04T02:50:00Z",
    "DataQualityLevel": 3,
    "DateCreated": "2016-04-27T09:42:00Z",
    "SubmissionStatusTypeID": 100
}