{
    "IsRecentlyVerified": false,
    "ID": 169723,
    "UUID": "0E044E68-D109-451F-AC98-DD8825261F20",
    "DataProviderID": 1,
    "OperatorID": 3327,
    "UsageTypeID": 4,
    "AddressInfo": {
        "ID": 170082,
        "Title": "Travagliato Mulini BeCharge",
        "AddressLine1": "Via Mulini",
        "Town": "Travagliato",
        "StateOrProvince": "BS",
        "Postcode": "25039",
        "CountryID": 112,
        "Latitude": 45.53013860891983,
        "Longitude": 10.077636635587169,
        "RelatedURL": "https://www.bec.energy/",
        "DistanceUnit": 0
    },
    "Connections": [
        {
            "ID": 258529,
            "ConnectionTypeID": 25,
            "StatusTypeID": 50,
            "LevelID": 2,
            "Amps": 32,
            "Voltage": 240,
            "PowerKW": 22,
            "CurrentTypeID": 20,
            "Quantity": 4
        }
    ],
    "NumberOfPoints": 4,
    "StatusTypeID": 50,
    "DateLastStatusUpdate": "2020-11-06T16:25:00Z",
    "DataQualityLevel": 1,
    "DateCreated": "2020-11-04T13:30:00Z",
    "SubmissionStatusTypeID": 200
}