{
    "IsRecentlyVerified": false,
    "ID": 66127,
    "UUID": "F5244029-4E22-4331-9659-7CD0A127934E",
    "DataProviderID": 1,
    "OperatorID": 1240,
    "UsageTypeID": 1,
    "AddressInfo": {
        "ID": 66473,
        "Title": "E-Bike Stützpunkt Pfalz",
        "AddressLine1": "Luitpoldstraße 3",
        "Town": "Edenkoben",
        "StateOrProvince": "Edenkoben",
        "Postcode": "67480",
        "CountryID": 87,
        "Latitude": 49.2829937,
        "Longitude": 8.128042899999969,
        "RelatedURL": "https://www.pfalzwerke.de/energieberatung/9244.php",
        "DistanceUnit": 0
    },
    "Connections": [
        {
            "ID": 91418,
            "ConnectionTypeID": 28,
            "StatusTypeID": 50,
            "LevelID": 1,
            "Amps": 10,
            "Voltage": 230,
            "PowerKW": 2.3,
            "CurrentTypeID": 10,
            "Quantity": 4
        }
    ],
    "NumberOfPoints": 4,
    "StatusTypeID": 50,
    "DateLastStatusUpdate": "2016-05-12T06:18:00Z",
    "DataQualityLevel": 1,
    "DateCreated": "2016-05-12T06:18:00Z",
    "SubmissionStatusTypeID": 200
}