{
    "IsRecentlyVerified": false,
    "ID": 145841,
    "UUID": "8A13BC42-A10F-4249-9495-D841F04C8F59",
    "DataProviderID": 2,
    "DataProvidersReference": "147375",
    "UsageTypeID": 1,
    "AddressInfo": {
        "ID": 146193,
        "Title": "Village of McBride",
        "AddressLine1": "100 Robson Centre",
        "Town": "McBride",
        "StateOrProvince": "BC",
        "Postcode": "V0J 2E0",
        "CountryID": 44,
        "Latitude": 53.304769,
        "Longitude": -120.163635,
        "ContactTelephone1": "866-338-3369",
        "AccessComments": "24 hours daily",
        "RelatedURL": "",
        "DistanceUnit": 0
    },
    "Connections": [
        {
            "ID": 202612,
            "ConnectionTypeID": 2,
            "LevelID": 3,
            "Amps": 100,
            "Voltage": 400,
            "PowerKW": 40,
            "CurrentTypeID": 30,
            "Quantity": 1
        },
        {
            "ID": 202613,
            "ConnectionTypeID": 32,
            "LevelID": 3,
            "Amps": 100,
            "Voltage": 400,
            "PowerKW": 40,
            "CurrentTypeID": 30,
            "Quantity": 1
        }
    ],
    "StatusTypeID": 50,
    "DateLastStatusUpdate": "2020-06-26T03:12:00Z",
    "DataQualityLevel": 3,
    "DateCreated": "2019-12-24T09:25:00Z",
    "SubmissionStatusTypeID": 100
}