{
    "IsRecentlyVerified": false,
    "ID": 135630,
    "UUID": "53915E6B-5F3F-497B-8679-E63ED2CB541D",
    "DataProviderID": 18,
    "DataProvidersReference": "6666371f68d373799e9a861fdb69717e",
    "OperatorID": 2244,
    "UsageTypeID": 5,
    "AddressInfo": {
        "ID": 135976,
        "Title": "Clive Road",
        "AddressLine1": "Clive Road",
        "Town": "Twickenham",
        "Postcode": "TW1 4SG",
        "CountryID": 1,
        "Latitude": 51.435038,
        "Longitude": -0.331055,
        "AccessComments": "",
        "RelatedURL": "https://www.ubitricity.com",
        "DistanceUnit": 0
    },
    "Connections": [
        {
            "ID": 190038,
            "ConnectionTypeID": 25,
            "Reference": "suby1100003717",
            "StatusTypeID": 50,
            "LevelID": 2,
            "Amps": 16,
            "Voltage": 230,
            "PowerKW": 3.7,
            "CurrentTypeID": 10
        }
    ],
    "StatusTypeID": 0,
    "DateLastStatusUpdate": "2021-04-25T05:46:00Z",
    "MetadataValues": [
        {
            "ID": 5482,
            "MetadataFieldID": 4,
            "ItemValue": "Contains public sector information licensed under the Open Government Licence v2.0. http://www.nationalarchives.gov.uk/doc/open-government-licence/version/2/"
        }
    ],
    "DataQualityLevel": 3,
    "DateCreated": "2019-12-24T05:22:00Z",
    "SubmissionStatusTypeID": 100
}