{
    "IsRecentlyVerified": true,
    "DateLastVerified": "2021-08-19T20:39:00Z",
    "ID": 188834,
    "UUID": "2CAF6551-28B8-490B-98AC-12E878FDD2D8",
    "DataProviderID": 1,
    "OperatorID": 3364,
    "UsageTypeID": 4,
    "UsageCost": "free",
    "AddressInfo": {
        "ID": 189193,
        "Title": "San Javier ",
        "AddressLine1": "Carretera Longitudinal sur km 275,3",
        "Town": "San Javier",
        "StateOrProvince": "Maule Region",
        "Postcode": "",
        "CountryID": 49,
        "Latitude": -35.61587234868556,
        "Longitude": -71.70199304575522,
        "RelatedURL": "https://copecvoltex.cl/",
        "DistanceUnit": 0
    },
    "Connections": [
        {
            "ID": 305113,
            "ConnectionTypeID": 25,
            "StatusTypeID": 50,
            "LevelID": 2,
            "PowerKW": 43,
            "Quantity": 1
        },
        {
            "ID": 305114,
            "ConnectionTypeID": 2,
            "StatusTypeID": 50,
            "LevelID": 2,
            "PowerKW": 50,
            "Quantity": 1
        },
        {
            "ID": 305115,
            "ConnectionTypeID": 33,
            "StatusTypeID": 50,
            "LevelID": 2,
            "PowerKW": 50,
            "Quantity": 1
        }
    ],
    "NumberOfPoints": 1,
    "StatusTypeID": 50,
    "DateLastStatusUpdate": "2021-08-19T20:39:00Z",
    "DataQualityLevel": 1,
    "DateCreated": "2021-08-19T20:39:00Z",
    "SubmissionStatusTypeID": 200
}