{
    "IsRecentlyVerified": false,
    "ID": 161984,
    "UUID": "0153A0F0-B71B-434A-82B0-CED7630FFC86",
    "DataProviderID": 1,
    "OperatorID": 3323,
    "UsageTypeID": 4,
    "AddressInfo": {
        "ID": 162341,
        "Title": "ZES - Akra Barut Hotel DC",
        "AddressLine1": "Lara Caddesi, 24",
        "Town": "Antalya",
        "Postcode": "07200",
        "CountryID": 229,
        "Latitude": 36.86422040803198,
        "Longitude": 30.726462541950127,
        "AccessComments": "Available 7/24 at outdoor parking area, left side after the hotel entrance.",
        "RelatedURL": "http://www.zes.net",
        "DistanceUnit": 0
    },
    "Connections": [
        {
            "ID": 233136,
            "ConnectionTypeID": 25,
            "StatusTypeID": 50,
            "LevelID": 2,
            "Amps": 32,
            "Voltage": 400,
            "PowerKW": 22,
            "CurrentTypeID": 20,
            "Quantity": 1
        },
        {
            "ID": 233137,
            "ConnectionTypeID": 33,
            "StatusTypeID": 50,
            "LevelID": 3,
            "Amps": 200,
            "Voltage": 600,
            "PowerKW": 120,
            "CurrentTypeID": 30,
            "Quantity": 1
        },
        {
            "ID": 233138,
            "ConnectionTypeID": 2,
            "StatusTypeID": 50,
            "LevelID": 3,
            "PowerKW": 60,
            "CurrentTypeID": 30,
            "Quantity": 1
        },
        {
            "ID": 233139,
            "ConnectionTypeID": 1036,
            "StatusTypeID": 50,
            "LevelID": 3,
            "PowerKW": 43,
            "CurrentTypeID": 20,
            "Quantity": 1
        }
    ],
    "NumberOfPoints": 2,
    "GeneralComments": "New, clean, fast energy of the Turkey roads. Download ZES Mobile App to apply and then you can easily find the nearest charging station and get their information.",
    "StatusTypeID": 50,
    "DateLastStatusUpdate": "2020-07-31T06:39:00Z",
    "DataQualityLevel": 1,
    "DateCreated": "2020-07-30T10:55:00Z",
    "SubmissionStatusTypeID": 200
}