{
    "IsRecentlyVerified": false,
    "ID": 127204,
    "UUID": "BF291804-F16F-47FE-94D5-6C5BD6CA5413",
    "DataProviderID": 1,
    "OperatorID": 32,
    "OperatorsReference": "24558",
    "UsageTypeID": 4,
    "UsageCost": "£0.108/kWh; for Polar Plus subscription members only",
    "AddressInfo": {
        "ID": 127550,
        "Title": "Stephens Bakery-Kirkcaldy",
        "AddressLine1": "Stephens Bakery-Kirkcaldy",
        "Town": "Roslyn street",
        "StateOrProvince": "Kircklady",
        "Postcode": "KY1 3HU",
        "CountryID": 1,
        "Latitude": 56.134201,
        "Longitude": -3.1319,
        "DistanceUnit": 0
    },
    "Connections": [
        {
            "ID": 178118,
            "ConnectionTypeID": 33,
            "StatusTypeID": 50,
            "LevelID": 3,
            "PowerKW": 50,
            "CurrentTypeID": 30,
            "Quantity": 1
        },
        {
            "ID": 178119,
            "ConnectionTypeID": 2,
            "StatusTypeID": 50,
            "LevelID": 3,
            "PowerKW": 50,
            "CurrentTypeID": 30,
            "Quantity": 1
        },
        {
            "ID": 178120,
            "ConnectionTypeID": 1036,
            "StatusTypeID": 50,
            "LevelID": 3,
            "PowerKW": 43,
            "CurrentTypeID": 20,
            "Quantity": 1
        }
    ],
    "NumberOfPoints": 1,
    "GeneralComments": "The unit is located outside the Stephens Bakery.",
    "StatusTypeID": 50,
    "DateLastStatusUpdate": "2019-06-20T05:16:00Z",
    "DataQualityLevel": 1,
    "DateCreated": "2019-05-30T05:15:00Z",
    "SubmissionStatusTypeID": 200
}