{
    "UserComments": [
        {
            "ID": 3794,
            "ChargePointID": 4581,
            "CommentTypeID": 1000,
            "UserName": "74pilot",
            "Comment": "Slow chargers already, only 13A (two spots) by CLP. Have used it before, couldn't make it work today. Tried to plug in laptop charger, didn't work either. ",
            "Rating": 1,
            "DateCreated": "2015-02-17T13:16:31.5Z",
            "User": {
                "ID": 3420,
                "Username": "74pilot"
            },
            "CheckinStatusTypeID": 20
        }
    ],
    "IsRecentlyVerified": false,
    "ID": 4581,
    "UUID": "0167F046-3B80-4C23-92BF-E7A1E7BD7CFF",
    "DataProviderID": 1,
    "OperatorID": 1,
    "UsageTypeID": 1,
    "UsageCost": "",
    "AddressInfo": {
        "ID": 4526,
        "Title": "Citygate Mall",
        "AddressLine1": "41 Man Tong Road",
        "AddressLine2": "",
        "Town": "Tung Chung",
        "StateOrProvince": "Lantau",
        "Postcode": "",
        "CountryID": 4,
        "Latitude": 22.29096221923828,
        "Longitude": 113.94283294677734,
        "ContactTelephone1": "",
        "ContactTelephone2": "",
        "ContactEmail": "",
        "AccessComments": "",
        "RelatedURL": "",
        "DistanceUnit": 0
    },
    "Connections": [
        {
            "ID": 241,
            "ConnectionTypeID": 3,
            "StatusTypeID": 0,
            "LevelID": 2,
            "Quantity": 1
        }
    ],
    "NumberOfPoints": 2,
    "GeneralComments": "Couldn't make any of the 13A chargers work today",
    "DateLastConfirmed": "2011-05-21T00:00:00Z",
    "StatusTypeID": 100,
    "DateLastStatusUpdate": "2015-02-17T13:17:00Z",
    "DataQualityLevel": 1,
    "DateCreated": "2011-05-25T11:01:00Z",
    "SubmissionStatusTypeID": 200
}