{
    "IsRecentlyVerified": true,
    "DateLastVerified": "2021-10-28T08:27:00Z",
    "ID": 189708,
    "UUID": "8DF6DD63-7636-4525-8E8D-E263C20FD2B2",
    "DataProviderID": 1,
    "OperatorID": 80,
    "UsageTypeID": 4,
    "AddressInfo": {
        "ID": 190067,
        "Title": "Parco Da Vinci - Fiumicino - Enel x",
        "AddressLine1": "Parco Da Vinci",
        "Town": "Fiumicino",
        "StateOrProvince": "Roma",
        "Postcode": "00119",
        "CountryID": 112,
        "Latitude": 41.8077555761914,
        "Longitude": 12.296390931616656,
        "ContactTelephone1": "800.069.850",
        "RelatedURL": "https://www.enelx.com/it/it/emobility",
        "DistanceUnit": 0
    },
    "Connections": [
        {
            "ID": 306909,
            "ConnectionTypeID": 25,
            "StatusTypeID": 50,
            "LevelID": 2,
            "Amps": 32,
            "Voltage": 400,
            "PowerKW": 22,
            "CurrentTypeID": 20,
            "Quantity": 1
        },
        {
            "ID": 306910,
            "ConnectionTypeID": 36,
            "StatusTypeID": 50,
            "LevelID": 2,
            "Amps": 16,
            "Voltage": 240,
            "PowerKW": 3.7,
            "CurrentTypeID": 10,
            "Quantity": 1
        }
    ],
    "NumberOfPoints": 3,
    "StatusTypeID": 50,
    "DateLastStatusUpdate": "2021-10-28T08:27:00Z",
    "DataQualityLevel": 1,
    "DateCreated": "2021-10-28T08:27:00Z",
    "SubmissionStatusTypeID": 200
}