{
    "IsRecentlyVerified": false,
    "ID": 156829,
    "UUID": "1AC9D766-ABE4-4DDF-87BC-E7715DC89D81",
    "DataProviderID": 19,
    "DataProvidersReference": "6329",
    "AddressInfo": {
        "ID": 157183,
        "Title": "Hallsberg Kommun Allehallen",
        "AddressLine1": "Södra Allen 4",
        "Town": "HALLSBERG",
        "StateOrProvince": "ÖREBRO",
        "Postcode": "69431",
        "CountryID": 216,
        "Latitude": 59.063889,
        "Longitude": 15.104194,
        "AccessComments": "",
        "DistanceUnit": 0
    },
    "Connections": [
        {
            "ID": 222123,
            "ConnectionTypeID": 25,
            "Reference": "1",
            "LevelID": 3,
            "Amps": 32,
            "Voltage": 400,
            "PowerKW": 22,
            "CurrentTypeID": 30,
            "Comments": "Mode 3"
        },
        {
            "ID": 222124,
            "ConnectionTypeID": 25,
            "Reference": "2",
            "LevelID": 3,
            "Amps": 32,
            "Voltage": 400,
            "PowerKW": 22,
            "CurrentTypeID": 30,
            "Comments": "Mode 3"
        }
    ],
    "NumberOfPoints": 2,
    "StatusTypeID": 0,
    "DateLastStatusUpdate": "2021-03-24T05:11:00Z",
    "DataQualityLevel": 2,
    "DateCreated": "2020-05-26T08:22:00Z",
    "SubmissionStatusTypeID": 100
}