{
    "IsRecentlyVerified": false,
    "ID": 62740,
    "UUID": "5AF49B1A-8DB2-4854-AF8A-570086B65D7E",
    "DataProviderID": 1,
    "OperatorID": 45,
    "OperatorsReference": "ENEL Engineering & Research",
    "UsageCost": "0.00 onbekend",
    "AddressInfo": {
        "ID": 63086,
        "Title": "ENEL Engineering & Research",
        "AddressLine1": "Via Salvatore Orlando",
        "Town": "Livorno",
        "Postcode": "57100",
        "CountryID": 112,
        "Latitude": 43.56496,
        "Longitude": 10.31077,
        "DistanceUnit": 0
    },
    "Connections": [
        {
            "ID": 79668,
            "ConnectionTypeID": 2,
            "LevelID": 3,
            "PowerKW": 50,
            "CurrentTypeID": 30
        }
    ],
    "NumberOfPoints": 1,
    "StatusTypeID": 50,
    "DateLastStatusUpdate": "2016-05-14T09:44:00Z",
    "DataQualityLevel": 3,
    "DateCreated": "2016-03-03T12:29:00Z",
    "SubmissionStatusTypeID": 100
}