{
    "IsRecentlyVerified": false,
    "ID": 122403,
    "UUID": "1B1EC116-32E6-4655-A064-06024990061E",
    "DataProviderID": 2,
    "DataProvidersReference": "65501",
    "OperatorID": 5,
    "UsageTypeID": 1,
    "AddressInfo": {
        "ID": 122749,
        "Title": "MARSH PARK",
        "AddressLine1": "2944 Gleneden St",
        "Town": "Los Angeles",
        "StateOrProvince": "CA",
        "Postcode": "90039",
        "CountryID": 2,
        "Latitude": 34.107531,
        "Longitude": -118.247756,
        "ContactTelephone1": "888-758-4389",
        "AccessComments": "24 hours daily",
        "RelatedURL": "http://www.chargepoint.com/",
        "DistanceUnit": 0
    },
    "Connections": [
        {
            "ID": 172291,
            "ConnectionTypeID": 1,
            "LevelID": 2,
            "Amps": 16,
            "Voltage": 230,
            "PowerKW": 3,
            "CurrentTypeID": 10,
            "Quantity": 3
        }
    ],
    "DateLastStatusUpdate": "2019-12-24T09:11:00Z",
    "DataQualityLevel": 3,
    "DateCreated": "2019-04-06T05:03:00Z",
    "SubmissionStatusTypeID": 100
}