{
    "IsRecentlyVerified": false,
    "ID": 131518,
    "UUID": "0ACE9FC2-0AF2-472D-9B73-92D67F13C653",
    "DataProviderID": 1,
    "OperatorID": 23,
    "OperatorsReference": "51726",
    "UsageTypeID": 4,
    "AddressInfo": {
        "ID": 131864,
        "Title": "Savoy Beach Hotel",
        "AddressLine1": "Via Poseidonia",
        "Town": "Paestum",
        "Postcode": "84047",
        "CountryID": 112,
        "Latitude": 40.429221,
        "Longitude": 14.984762,
        "ContactTelephone1": "+39 0828 720100",
        "DistanceUnit": 0
    },
    "Connections": [
        {
            "ID": 184083,
            "ConnectionTypeID": 30,
            "StatusTypeID": 50,
            "LevelID": 2,
            "PowerKW": 22,
            "CurrentTypeID": 20,
            "Quantity": 1
        }
    ],
    "NumberOfPoints": 1,
    "GeneralComments": "1 Tesla Connector, up to 22kW.Available for members only. Please see front desk.",
    "StatusTypeID": 50,
    "DateLastStatusUpdate": "2019-09-08T05:42:00Z",
    "DataQualityLevel": 1,
    "DateCreated": "2019-09-08T05:42:00Z",
    "SubmissionStatusTypeID": 200
}