{
    "IsRecentlyVerified": false,
    "ID": 142705,
    "UUID": "54174FBF-A50F-4D08-A6A9-0B380840DD5C",
    "DataProviderID": 2,
    "DataProvidersReference": "93701",
    "OperatorID": 15,
    "UsageTypeID": 4,
    "AddressInfo": {
        "ID": 143057,
        "Title": "Putnam Plaza Shopping Center",
        "AddressLine1": "1872 Route 6",
        "Town": "Carmel",
        "StateOrProvince": "NY",
        "Postcode": "10512",
        "CountryID": 2,
        "Latitude": 41.412844,
        "Longitude": -73.667098,
        "ContactTelephone1": "877-455-3833",
        "AccessComments": "24 hours daily\r\nPublic - Card key at all times",
        "RelatedURL": "https://www.evgo.com/",
        "DistanceUnit": 0
    },
    "Connections": [
        {
            "ID": 198900,
            "ConnectionTypeID": 2,
            "LevelID": 3,
            "Amps": 100,
            "Voltage": 400,
            "PowerKW": 40,
            "CurrentTypeID": 30,
            "Quantity": 1
        },
        {
            "ID": 198901,
            "ConnectionTypeID": 32,
            "LevelID": 3,
            "Amps": 100,
            "Voltage": 400,
            "PowerKW": 40,
            "CurrentTypeID": 30,
            "Quantity": 1
        }
    ],
    "StatusTypeID": 50,
    "DateLastStatusUpdate": "2020-06-26T03:04:00Z",
    "DataQualityLevel": 3,
    "DateCreated": "2019-12-24T09:18:00Z",
    "SubmissionStatusTypeID": 100
}