{
    "UserComments": [
        {
            "ID": 20546,
            "ChargePointID": 54080,
            "CommentTypeID": 10,
            "UserName": "ForumElettrico.it",
            "RelatedURL": "https://www.forumelettrico.it/forum/colonnina-inrete-distribuzione-energia-22-kw-policlinico-di-modena-mo-via-marzabotto-73-t4406.html",
            "DateCreated": "2018-12-24T08:07:56.51Z",
            "User": {
                "ID": 11749,
                "Username": "ForumElettrico.it"
            },
            "CheckinStatusTypeID": 10
        }
    ],
    "MediaItems": [
        {
            "ID": 17274,
            "ChargePointID": 54080,
            "ItemURL": "https://s3-ap-southeast-2.amazonaws.com/openchargemap/images/IT/OCM54080/OCM-54080.orig.2018122408082500.jpg",
            "ItemThumbnailURL": "https://s3-ap-southeast-2.amazonaws.com/openchargemap/images/IT/OCM54080/OCM-54080.thmb.2018122408082500.jpg",
            "Comment": "",
            "IsEnabled": true,
            "IsVideo": false,
            "IsFeaturedItem": false,
            "IsExternalResource": false,
            "User": {
                "ID": 11749,
                "Username": "ForumElettrico.it"
            },
            "DateCreated": "2018-12-24T08:09:00Z"
        },
        {
            "ID": 17275,
            "ChargePointID": 54080,
            "ItemURL": "https://s3-ap-southeast-2.amazonaws.com/openchargemap/images/IT/OCM54080/OCM-54080.orig.2018122408083079.jpg",
            "ItemThumbnailURL": "https://s3-ap-southeast-2.amazonaws.com/openchargemap/images/IT/OCM54080/OCM-54080.thmb.2018122408083079.jpg",
            "Comment": "",
            "IsEnabled": true,
            "IsVideo": false,
            "IsFeaturedItem": false,
            "IsExternalResource": false,
            "User": {
                "ID": 11749,
                "Username": "ForumElettrico.it"
            },
            "DateCreated": "2018-12-24T08:09:00Z"
        },
        {
            "ID": 17276,
            "ChargePointID": 54080,
            "ItemURL": "https://s3-ap-southeast-2.amazonaws.com/openchargemap/images/IT/OCM54080/OCM-54080.orig.2018122408083672.jpg",
            "ItemThumbnailURL": "https://s3-ap-southeast-2.amazonaws.com/openchargemap/images/IT/OCM54080/OCM-54080.thmb.2018122408083672.jpg",
            "Comment": "",
            "IsEnabled": true,
            "IsVideo": false,
            "IsFeaturedItem": false,
            "IsExternalResource": false,
            "User": {
                "ID": 11749,
                "Username": "ForumElettrico.it"
            },
            "DateCreated": "2018-12-24T08:09:00Z"
        },
        {
            "ID": 17273,
            "ChargePointID": 54080,
            "ItemURL": "https://s3-ap-southeast-2.amazonaws.com/openchargemap/images/IT/OCM54080/OCM-54080.orig.2018122408081784.jpg",
            "ItemThumbnailURL": "https://s3-ap-southeast-2.amazonaws.com/openchargemap/images/IT/OCM54080/OCM-54080.thmb.2018122408081784.jpg",
            "Comment": "",
            "IsEnabled": true,
            "IsVideo": false,
            "IsFeaturedItem": false,
            "IsExternalResource": false,
            "User": {
                "ID": 11749,
                "Username": "ForumElettrico.it"
            },
            "DateCreated": "2018-12-24T08:08:00Z"
        }
    ],
    "IsRecentlyVerified": false,
    "ID": 54080,
    "UUID": "7A30B993-3B80-4DA6-B94C-54C2D83ACFEF",
    "DataProviderID": 1,
    "OperatorID": 80,
    "UsageTypeID": 4,
    "UsageCost": "0,45 €/kW",
    "AddressInfo": {
        "ID": 54426,
        "Title": "Policlinico di Modena | EnelX by Hera",
        "AddressLine1": "Via Marzabotto 73",
        "Town": "Modena",
        "StateOrProvince": "MO",
        "Postcode": "41125",
        "CountryID": 112,
        "Latitude": 44.6355380969644,
        "Longitude": 10.9383985579197,
        "RelatedURL": "https://www.enelx.com/it/it/emobility",
        "DistanceUnit": 0
    },
    "Connections": [
        {
            "ID": 67745,
            "ConnectionTypeID": 25,
            "StatusTypeID": 50,
            "LevelID": 2,
            "Amps": 32,
            "Voltage": 400,
            "PowerKW": 22,
            "CurrentTypeID": 20,
            "Quantity": 1
        },
        {
            "ID": 67746,
            "ConnectionTypeID": 36,
            "StatusTypeID": 50,
            "LevelID": 2,
            "Amps": 13,
            "Voltage": 240,
            "PowerKW": 3,
            "CurrentTypeID": 10,
            "Quantity": 1
        }
    ],
    "NumberOfPoints": 1,
    "StatusTypeID": 50,
    "DateLastStatusUpdate": "2019-12-12T09:53:00Z",
    "DataQualityLevel": 1,
    "DateCreated": "2015-09-22T16:12:00Z",
    "SubmissionStatusTypeID": 200
}