{
    "IsRecentlyVerified": false,
    "ID": 171091,
    "UUID": "43EB004D-5EE5-4D96-B98C-34EA98C8C662",
    "DataProviderID": 1,
    "OperatorID": 23,
    "OperatorsReference": "55367",
    "UsageTypeID": 4,
    "AddressInfo": {
        "ID": 171450,
        "Title": "Sercotel Boulevard",
        "AddressLine1": "Sercotel Boulevard",
        "Postcode": "1013",
        "CountryID": 210,
        "Latitude": 42.860591,
        "Longitude": -2.663331,
        "ContactTelephone1": "+34 945 18 04 00",
        "DistanceUnit": 0
    },
    "Connections": [
        {
            "ID": 261435,
            "ConnectionTypeID": 30,
            "StatusTypeID": 50,
            "LevelID": 2,
            "PowerKW": 11,
            "CurrentTypeID": 20,
            "Quantity": 2
        }
    ],
    "NumberOfPoints": 2,
    "GeneralComments": "2 Tesla Connector, up to 11kW.Available for customers. Please call ahead.",
    "StatusTypeID": 50,
    "DateLastStatusUpdate": "2020-12-20T06:32:00Z",
    "DataQualityLevel": 1,
    "DateCreated": "2020-12-20T06:32:00Z",
    "SubmissionStatusTypeID": 200
}