{
    "IsRecentlyVerified": false,
    "ID": 89463,
    "UUID": "F6C49FF4-DFF6-4187-88DA-F841D5442088",
    "DataProviderID": 2,
    "DataProvidersReference": "42673",
    "OperatorID": 5,
    "UsageTypeID": 1,
    "AddressInfo": {
        "ID": 89809,
        "Title": "COUNTY OF MARIN",
        "AddressLine1": "3501 Civic Center Drive",
        "Town": "San Rafael",
        "StateOrProvince": "CA",
        "Postcode": "94903",
        "CountryID": 2,
        "Latitude": 37.99824,
        "Longitude": -122.532424,
        "ContactTelephone1": "888-758-4389",
        "AccessComments": "24 hours daily",
        "RelatedURL": "http://www.chargepoint.com/",
        "DistanceUnit": 0
    },
    "Connections": [
        {
            "ID": 126861,
            "ConnectionTypeID": 1,
            "LevelID": 2,
            "Amps": 16,
            "Voltage": 230,
            "PowerKW": 3,
            "CurrentTypeID": 10,
            "Quantity": 35
        },
        {
            "ID": 126862,
            "ConnectionTypeID": 1,
            "LevelID": 2,
            "Amps": 16,
            "Voltage": 230,
            "PowerKW": 3,
            "CurrentTypeID": 10,
            "Quantity": 34
        }
    ],
    "DateLastStatusUpdate": "2019-12-24T09:14:00Z",
    "DataQualityLevel": 3,
    "DateCreated": "2017-06-22T08:16:00Z",
    "SubmissionStatusTypeID": 100
}