{
    "IsRecentlyVerified": false,
    "ID": 173371,
    "UUID": "199701D1-083B-4F07-9A7F-7C777D65A07C",
    "DataProviderID": 18,
    "DataProvidersReference": "881863d0a0f6fee7d97c6be6eadb905d",
    "OperatorID": 2244,
    "UsageTypeID": 1,
    "AddressInfo": {
        "ID": 173730,
        "Title": "88 Greencroft Gardens",
        "AddressLine1": "88 Greencroft Gardens",
        "Town": "London",
        "Postcode": "NW6 3JQ",
        "CountryID": 1,
        "Latitude": -0.184668,
        "Longitude": 51.543266,
        "AccessComments": "",
        "RelatedURL": "https://www.ubitricity.com",
        "DistanceUnit": 0
    },
    "Connections": [
        {
            "ID": 266396,
            "ConnectionTypeID": 25,
            "Reference": "suby1100005303",
            "StatusTypeID": 50,
            "LevelID": 2,
            "Amps": 16,
            "Voltage": 230,
            "PowerKW": 3.7,
            "CurrentTypeID": 10
        }
    ],
    "StatusTypeID": 0,
    "DateLastStatusUpdate": "2021-07-12T03:38:00Z",
    "MetadataValues": [
        {
            "ID": 8293,
            "MetadataFieldID": 4,
            "ItemValue": "Contains public sector information licensed under the Open Government Licence v2.0. http://www.nationalarchives.gov.uk/doc/open-government-licence/version/2/"
        }
    ],
    "DataQualityLevel": 3,
    "DateCreated": "2021-03-03T11:24:00Z",
    "SubmissionStatusTypeID": 100
}