{
    "IsRecentlyVerified": false,
    "ID": 48425,
    "UUID": "93EC01B8-024B-4EE9-9B51-3A2DB5BC97D2",
    "DataProviderID": 1,
    "OperatorID": 1,
    "UsageTypeID": 6,
    "AddressInfo": {
        "ID": 48771,
        "Title": "Užnerio g.",
        "AddressLine1": "Užnerio g.",
        "AddressLine2": "Šilainių seniūnija",
        "Town": "Kaunas",
        "StateOrProvince": "Kauno apskritis",
        "Postcode": "LT47490",
        "CountryID": 131,
        "Latitude": 54.940599,
        "Longitude": 23.890931,
        "ContactTelephone1": "+370 37 239 000",
        "ContactEmail": "info@mega.lt",
        "DistanceUnit": 0
    },
    "Connections": [
        {
            "ID": 59875,
            "ConnectionTypeID": 25,
            "LevelID": 2,
            "Amps": 32,
            "Voltage": 380,
            "PowerKW": 22,
            "CurrentTypeID": 20,
            "Quantity": 1
        },
        {
            "ID": 59876,
            "ConnectionTypeID": 0,
            "LevelID": 2,
            "Amps": 13,
            "Voltage": 230,
            "PowerKW": 3,
            "Quantity": 1
        }
    ],
    "NumberOfPoints": 1,
    "StatusTypeID": 50,
    "DateLastStatusUpdate": "2015-06-26T13:16:00Z",
    "DataQualityLevel": 1,
    "DateCreated": "2015-06-26T10:29:00Z",
    "SubmissionStatusTypeID": 200
}