{
    "IsRecentlyVerified": false,
    "ID": 97863,
    "UUID": "53E35312-7C7A-4829-BD9C-CEB40D499496",
    "DataProviderID": 1,
    "OperatorID": 23,
    "OperatorsReference": "39653",
    "UsageTypeID": 4,
    "AddressInfo": {
        "ID": 98209,
        "Title": "Avery Brewing Company",
        "AddressLine1": "4910 Nautilus CT N",
        "Town": "Boulder",
        "StateOrProvince": "Colorado",
        "Postcode": "80301",
        "CountryID": 2,
        "Latitude": 40.062531,
        "Longitude": -105.204787,
        "ContactTelephone1": "(303) 440-4324",
        "DistanceUnit": 0
    },
    "Connections": [
        {
            "ID": 138771,
            "ConnectionTypeID": 30,
            "StatusTypeID": 50,
            "LevelID": 2,
            "PowerKW": 13,
            "CurrentTypeID": 20,
            "Quantity": 5
        }
    ],
    "NumberOfPoints": 5,
    "GeneralComments": "5 Tesla Connectors, up to 13kW.Available for customers. Self park.",
    "StatusTypeID": 50,
    "DateLastStatusUpdate": "2018-01-21T16:51:00Z",
    "DataQualityLevel": 1,
    "DateCreated": "2018-01-21T16:51:00Z",
    "SubmissionStatusTypeID": 200
}