{
    "IsRecentlyVerified": false,
    "ID": 93436,
    "UUID": "B835A1FE-58CF-4AF4-920C-3E33E097DE92",
    "DataProviderID": 1,
    "OperatorID": 23,
    "OperatorsReference": "34452",
    "UsageTypeID": 4,
    "UsageCost": "$0.20/min >=60kW; $0.10/min <60kW; other tariffs for older cars",
    "AddressInfo": {
        "ID": 93782,
        "Title": "Italy, TX Supercharger",
        "AddressLine1": "1021 Dale Evans Drive",
        "Town": "Italy",
        "StateOrProvince": "TX",
        "Postcode": "76651",
        "CountryID": 2,
        "Latitude": 32.194964,
        "Longitude": -96.898765,
        "DistanceUnit": 0
    },
    "Connections": [
        {
            "ID": 132313,
            "ConnectionTypeID": 27,
            "StatusTypeID": 50,
            "LevelID": 3,
            "PowerKW": 120,
            "CurrentTypeID": 30,
            "Quantity": 10
        }
    ],
    "NumberOfPoints": 10,
    "GeneralComments": "Charging10 Superchargers, available 24/7, up to 120kW",
    "StatusTypeID": 50,
    "DateLastStatusUpdate": "2018-03-13T13:41:00Z",
    "DataQualityLevel": 1,
    "DateCreated": "2017-09-27T19:33:00Z",
    "SubmissionStatusTypeID": 200
}