{
    "IsRecentlyVerified": false,
    "ID": 17188,
    "UUID": "4399CDB7-7524-4D91-95E4-21940CA21CD5",
    "DataProviderID": 22,
    "DataProvidersReference": "4AFEA7D073863B9DBE80CFAC0BA75D5A",
    "AddressInfo": {
        "ID": 17533,
        "Title": "柏崎三菱柏崎店・クリーンカー柏崎",
        "AddressLine1": "新潟県柏崎市扇町1-11",
        "CountryID": 114,
        "Latitude": 37.36904209,
        "Longitude": 138.568454,
        "ContactTelephone1": "0120-558-324",
        "DistanceUnit": 0
    },
    "Connections": [
        {
            "ID": 17429,
            "ConnectionTypeID": 2,
            "LevelID": 2,
            "Amps": 100,
            "Voltage": 480,
            "PowerKW": 48,
            "Quantity": 1
        }
    ],
    "DateLastStatusUpdate": "2013-06-29T08:55:00Z",
    "DataQualityLevel": 2,
    "DateCreated": "2013-06-29T08:55:00Z",
    "SubmissionStatusTypeID": 200
}