{
    "IsRecentlyVerified": false,
    "ID": 144583,
    "UUID": "2D24A70F-E635-479A-8BF4-B63D35B15157",
    "DataProviderID": 2,
    "DataProvidersReference": "130660",
    "OperatorID": 90,
    "UsageTypeID": 1,
    "AddressInfo": {
        "ID": 144935,
        "Title": "1315 Bellechasse",
        "AddressLine1": "1315 Bellechasse",
        "Town": "Montréal",
        "StateOrProvince": "QC",
        "Postcode": "H2G 1N8",
        "CountryID": 44,
        "Latitude": 45.538598,
        "Longitude": -73.596221,
        "ContactTelephone1": "877-505-2674",
        "AccessComments": "24 hours daily",
        "RelatedURL": "https://lecircuitelectrique.com/",
        "DistanceUnit": 0
    },
    "Connections": [
        {
            "ID": 201093,
            "ConnectionTypeID": 1,
            "LevelID": 2,
            "Amps": 16,
            "Voltage": 230,
            "PowerKW": 3.7,
            "CurrentTypeID": 10,
            "Quantity": 2
        }
    ],
    "StatusTypeID": 50,
    "DateLastStatusUpdate": "2020-06-26T03:09:00Z",
    "DataQualityLevel": 3,
    "DateCreated": "2019-12-24T09:23:00Z",
    "SubmissionStatusTypeID": 100
}