{
    "IsRecentlyVerified": false,
    "ID": 143245,
    "UUID": "D0BBAF15-0ECD-4D0C-AF9B-848B71C102DF",
    "DataProviderID": 2,
    "DataProvidersReference": "123106",
    "OperatorID": 3372,
    "UsageTypeID": 1,
    "AddressInfo": {
        "ID": 143597,
        "Title": "Nathaniel Quattlebaum Auto Sales",
        "AddressLine1": "395 Sheridan Ave",
        "Town": "Albany",
        "StateOrProvince": "NY",
        "Postcode": "12206",
        "CountryID": 2,
        "Latitude": 42.6623172,
        "Longitude": -73.7668672,
        "ContactTelephone1": "866-816-7584",
        "AccessComments": "24 hours daily",
        "RelatedURL": "http://evconnect.com/",
        "DistanceUnit": 0
    },
    "Connections": [
        {
            "ID": 199535,
            "ConnectionTypeID": 1,
            "LevelID": 2,
            "Amps": 16,
            "Voltage": 230,
            "PowerKW": 3.7,
            "CurrentTypeID": 10,
            "Quantity": 1
        }
    ],
    "StatusTypeID": 50,
    "DateLastStatusUpdate": "2020-06-26T03:06:00Z",
    "DataQualityLevel": 3,
    "DateCreated": "2019-12-24T09:20:00Z",
    "SubmissionStatusTypeID": 100
}