{
    "IsRecentlyVerified": false,
    "ID": 84192,
    "UUID": "16535399-DE05-475B-8404-39B7A47E89A7",
    "DataProviderID": 1,
    "OperatorID": 23,
    "OperatorsReference": "24607",
    "UsageTypeID": 4,
    "AddressInfo": {
        "ID": 84538,
        "Title": "Fiesta Inn Oaxaca",
        "AddressLine1": "Av. Universidad 140 Ex-Hacienda de Candiani",
        "Town": "Oaxaca",
        "StateOrProvince": "Oaxaca",
        "Postcode": "68130",
        "CountryID": 146,
        "Latitude": 17.039312,
        "Longitude": -96.710201,
        "ContactTelephone1": "+52 951 501 6000",
        "DistanceUnit": 0
    },
    "Connections": [
        {
            "ID": 119593,
            "ConnectionTypeID": 30,
            "StatusTypeID": 50,
            "LevelID": 2,
            "PowerKW": 18,
            "CurrentTypeID": 20,
            "Quantity": 2
        }
    ],
    "NumberOfPoints": 2,
    "GeneralComments": "2 Tesla Connectors, up to 18kW.Available for customers. Please see front desk.",
    "StatusTypeID": 50,
    "DateLastStatusUpdate": "2017-02-16T17:11:00Z",
    "DataQualityLevel": 1,
    "DateCreated": "2017-02-16T17:11:00Z",
    "SubmissionStatusTypeID": 200
}