{
    "IsRecentlyVerified": false,
    "ID": 72483,
    "UUID": "BB89B256-6B44-42B0-B4E4-7A0A34B9D860",
    "DataProviderID": 1,
    "OperatorID": 80,
    "UsageTypeID": 4,
    "UsageCost": "0,40 €/kW",
    "AddressInfo": {
        "ID": 72829,
        "Title": "Centro Commerciale Adriatico2",
        "AddressLine1": "Via Prati Guori, 29",
        "Town": "Portogruaro ",
        "StateOrProvince": "VE",
        "Postcode": "30026",
        "CountryID": 112,
        "Latitude": 45.791975935251216,
        "Longitude": 12.81505985463447,
        "RelatedURL": "http://eneldrive.it",
        "DistanceUnit": 0
    },
    "Connections": [
        {
            "ID": 103884,
            "ConnectionTypeID": 25,
            "StatusTypeID": 50,
            "LevelID": 2,
            "Amps": 32,
            "Voltage": 400,
            "PowerKW": 22,
            "CurrentTypeID": 20,
            "Quantity": 1
        },
        {
            "ID": 103885,
            "ConnectionTypeID": 36,
            "StatusTypeID": 50,
            "LevelID": 2,
            "Amps": 13,
            "Voltage": 240,
            "PowerKW": 3,
            "CurrentTypeID": 10,
            "Quantity": 1
        }
    ],
    "NumberOfPoints": 2,
    "StatusTypeID": 50,
    "DateLastStatusUpdate": "2016-10-17T12:29:00Z",
    "DataQualityLevel": 1,
    "DateCreated": "2016-10-17T12:28:00Z",
    "SubmissionStatusTypeID": 200
}