{
    "IsRecentlyVerified": false,
    "ID": 57022,
    "UUID": "CE035902-A189-4D47-816C-CF51DDFC0D1F",
    "DataProviderID": 1,
    "OperatorID": 224,
    "UsageTypeID": 5,
    "AddressInfo": {
        "ID": 57368,
        "Title": "Rathaus II",
        "AddressLine1": "Luisenstraße 7",
        "AddressLine2": "Antonihof",
        "Town": "Bad Dürrheim",
        "StateOrProvince": "Schwarzwald-Baar-Kreis",
        "Postcode": "78073",
        "CountryID": 87,
        "Latitude": 48.0178413,
        "Longitude": 8.53177010000002,
        "ContactTelephone1": "+49 762 392 14 06",
        "AccessComments": "Ladesäule steht auf dem Parkplatz vor dem Haus des Gastes. Rund um die Uhr (24/7) nutzbar, jedoch nicht reserviert .\r\n Freischaltung / Stromkosten müssen mit einer Master oder VISA Kreditkarte mit NFC Funktion paypass/paywave bezahlt werden.\r\nÖffnungszeiten Haus des Gastes Montag bis Freitag 09:00 – 13:00 Uhr, 14:00 – 18:00 Uhr, Samstag 10:00 – 17:00 Uhr, Sonn- und Feiertags 11:00 – 16:00 Uhr",
        "RelatedURL": "http://www.tourismus.badduerrheim.de/index.php?id=180&L=0",
        "DistanceUnit": 0
    },
    "Connections": [
        {
            "ID": 72014,
            "ConnectionTypeID": 28,
            "StatusTypeID": 50,
            "LevelID": 2,
            "Amps": 16,
            "Voltage": 230,
            "PowerKW": 3.7,
            "CurrentTypeID": 10,
            "Quantity": 0
        },
        {
            "ID": 72015,
            "ConnectionTypeID": 25,
            "StatusTypeID": 50,
            "LevelID": 2,
            "Amps": 32,
            "Voltage": 400,
            "PowerKW": 22,
            "CurrentTypeID": 20,
            "Quantity": 2
        }
    ],
    "NumberOfPoints": 2,
    "StatusTypeID": 50,
    "DateLastStatusUpdate": "2015-11-20T16:30:00Z",
    "DataQualityLevel": 1,
    "DateCreated": "2015-11-20T12:44:00Z",
    "SubmissionStatusTypeID": 200
}