{
    "IsRecentlyVerified": false,
    "ID": 30030,
    "UUID": "7194DABA-F459-468C-9EDD-DC9A395E0746",
    "DataProviderID": 1,
    "DataProvidersReference": "ALM-00028",
    "OperatorID": 21,
    "UsageTypeID": 4,
    "UsageCost": "Mobi.E compatible card",
    "AddressInfo": {
        "ID": 30376,
        "Title": "ALM-00028",
        "AddressLine1": "Avenida da Liberdade",
        "Town": "Almada",
        "Postcode": "2825-861",
        "CountryID": 180,
        "Latitude": 38.67295,
        "Longitude": -9.23217,
        "RelatedURL": "http://www.mobie.pt",
        "DistanceUnit": 0
    },
    "Connections": [
        {
            "ID": 33015,
            "ConnectionTypeID": 25,
            "StatusTypeID": 50,
            "LevelID": 2,
            "Amps": 16,
            "Voltage": 230,
            "PowerKW": 3.7,
            "CurrentTypeID": 10,
            "Quantity": 2
        }
    ],
    "NumberOfPoints": 2,
    "StatusTypeID": 50,
    "DateLastStatusUpdate": "2020-08-02T16:40:00Z",
    "DataQualityLevel": 3,
    "DateCreated": "2014-11-29T14:48:00Z",
    "SubmissionStatusTypeID": 100
}