{
    "IsRecentlyVerified": false,
    "ID": 129541,
    "UUID": "6B290B12-3841-4E76-936D-6130E570933E",
    "DataProviderID": 2,
    "DataProvidersReference": "121489",
    "OperatorID": 5,
    "UsageTypeID": 1,
    "AddressInfo": {
        "ID": 129887,
        "Title": "REEDY CREEK",
        "AddressLine1": "1515 Buena Vista Dr",
        "Town": "Lake Buena Vista",
        "StateOrProvince": "FL",
        "Postcode": "32830",
        "CountryID": 2,
        "Latitude": 28.351429,
        "Longitude": -81.578326,
        "ContactTelephone1": "888-758-4389",
        "AccessComments": "24 hours daily",
        "RelatedURL": "http://www.chargepoint.com/",
        "DistanceUnit": 0
    },
    "Connections": [
        {
            "ID": 181280,
            "ConnectionTypeID": 1,
            "LevelID": 2,
            "Amps": 16,
            "Voltage": 230,
            "PowerKW": 3.7,
            "CurrentTypeID": 10,
            "Quantity": 3
        }
    ],
    "DateLastStatusUpdate": "2020-06-26T02:52:00Z",
    "DataQualityLevel": 3,
    "DateCreated": "2019-07-21T11:43:00Z",
    "SubmissionStatusTypeID": 100
}