{
    "IsRecentlyVerified": false,
    "ID": 4740,
    "UUID": "3698E005-D3B0-4302-8162-0EFDA6F27416",
    "DataProviderID": 2,
    "DataProvidersReference": "39782",
    "UsageTypeID": 7,
    "AddressInfo": {
        "ID": 4684,
        "Title": "Campbell-Nelson Nissan",
        "AddressLine1": "24325 Highway 99",
        "Town": "Edmonds",
        "StateOrProvince": "WA",
        "Postcode": "98026",
        "CountryID": 2,
        "Latitude": 47.77861,
        "Longitude": -122.346196,
        "ContactTelephone1": "425-774-2174",
        "AccessComments": "Dealership business hours\r\nPublic - Call ahead",
        "RelatedURL": "",
        "DistanceUnit": 0
    },
    "Connections": [
        {
            "ID": 15798,
            "ConnectionTypeID": 1,
            "LevelID": 2,
            "Amps": 16,
            "Voltage": 230,
            "PowerKW": 3.7,
            "CurrentTypeID": 10,
            "Quantity": 2
        },
        {
            "ID": 20773,
            "ConnectionTypeID": 2,
            "LevelID": 2,
            "Amps": 100,
            "Voltage": 400,
            "PowerKW": 40,
            "CurrentTypeID": 10,
            "Quantity": 1
        }
    ],
    "DateLastConfirmed": "2011-05-31T00:00:00Z",
    "StatusTypeID": 0,
    "DateLastStatusUpdate": "2020-06-26T03:11:00Z",
    "DataQualityLevel": 1,
    "DateCreated": "2011-07-04T18:02:00Z",
    "SubmissionStatusTypeID": 100
}