{
    "IsRecentlyVerified": false,
    "ID": 151667,
    "UUID": "A582A5DC-0328-453D-86E7-115BD8A7E0DE",
    "DataProviderID": 28,
    "DataProvidersReference": "FR*S38*P38433*A",
    "OperatorID": 3408,
    "UsageTypeID": 5,
    "AddressInfo": {
        "ID": 152020,
        "Title": "ST NIZIER DU MOUCHEROTTE_Place du 14 Avril 1929",
        "AddressLine1": "Place du 14 Avril 1929 38250 ST NIZIER DU MOUCHEROTTE",
        "CountryID": 80,
        "Latitude": 45.170753,
        "Longitude": 5.630496,
        "AccessComments": "24/24 7/7 jours",
        "DistanceUnit": 0
    },
    "Connections": [
        {
            "ID": 211911,
            "ConnectionTypeID": 28,
            "StatusTypeID": 50,
            "LevelID": 2,
            "PowerKW": 22,
            "CurrentTypeID": 10
        },
        {
            "ID": 211912,
            "ConnectionTypeID": 1036,
            "StatusTypeID": 50,
            "LevelID": 2,
            "PowerKW": 22,
            "CurrentTypeID": 20
        },
        {
            "ID": 243960,
            "ConnectionTypeID": 28,
            "StatusTypeID": 50,
            "LevelID": 2,
            "PowerKW": 22,
            "CurrentTypeID": 10
        },
        {
            "ID": 243961,
            "ConnectionTypeID": 1036,
            "StatusTypeID": 50,
            "LevelID": 2,
            "PowerKW": 22,
            "CurrentTypeID": 20
        }
    ],
    "GeneralComments": "",
    "StatusTypeID": 50,
    "DateLastStatusUpdate": "2020-08-27T05:12:00Z",
    "DataQualityLevel": 2,
    "DateCreated": "2020-03-15T10:53:00Z",
    "SubmissionStatusTypeID": 100
}