{
    "IsRecentlyVerified": false,
    "ID": 62174,
    "UUID": "C5E49227-8614-4436-80D6-A4CEEB514791",
    "DataProviderID": 2,
    "DataProvidersReference": "72987",
    "OperatorID": 1242,
    "UsageTypeID": 2,
    "AddressInfo": {
        "ID": 62520,
        "Title": "GE WattStation 4",
        "AddressLine1": "11640  Arbor St",
        "Town": "Omaha",
        "StateOrProvince": "NE",
        "Postcode": "68144",
        "CountryID": 2,
        "Latitude": 41.236426,
        "Longitude": -96.09565,
        "ContactTelephone1": "855-443-3873",
        "AccessComments": "",
        "RelatedURL": "https://www.gewattstation.com",
        "DistanceUnit": 0
    },
    "Connections": [
        {
            "ID": 79077,
            "ConnectionTypeID": 1,
            "LevelID": 2,
            "Amps": 16,
            "Voltage": 230,
            "PowerKW": 3.7,
            "CurrentTypeID": 10,
            "Quantity": 1
        }
    ],
    "DateLastStatusUpdate": "2020-06-26T03:04:00Z",
    "DataQualityLevel": 3,
    "DateCreated": "2016-03-03T11:38:00Z",
    "SubmissionStatusTypeID": 100
}