{
    "IsRecentlyVerified": false,
    "ID": 141508,
    "UUID": "BA735A2A-150B-4C26-A1BD-00F932A5A209",
    "DataProviderID": 2,
    "DataProvidersReference": "144041",
    "OperatorID": 5,
    "UsageTypeID": 1,
    "AddressInfo": {
        "ID": 141860,
        "Title": "LOUDOUN METRO",
        "AddressLine1": "43378 Old Ryan Rd",
        "Town": "Ashburn",
        "StateOrProvince": "AL",
        "Postcode": "20148",
        "CountryID": 2,
        "Latitude": 39.002235,
        "Longitude": -77.49985,
        "ContactTelephone1": "888-758-4389",
        "AccessComments": "24 hours daily",
        "RelatedURL": "http://www.chargepoint.com/",
        "DistanceUnit": 0
    },
    "Connections": [
        {
            "ID": 197448,
            "ConnectionTypeID": 1,
            "LevelID": 2,
            "Amps": 16,
            "Voltage": 230,
            "PowerKW": 3,
            "CurrentTypeID": 10,
            "Quantity": 2
        }
    ],
    "StatusTypeID": 50,
    "DateLastStatusUpdate": "2019-12-24T09:15:00Z",
    "DataQualityLevel": 3,
    "DateCreated": "2019-12-24T09:15:00Z",
    "SubmissionStatusTypeID": 100
}