{
    "UserComments": [
        {
            "ID": 24013,
            "ChargePointID": 174117,
            "CommentTypeID": 10,
            "UserName": "ForumElettrico.it",
            "Comment": "Si attiva gratuitamente per due ore entrando nel negozio antistante Globo e chiedendo un voucher. Leggi la recensione completa qui >  https://www.forumelettrico.it/forum/colonnina-7-4-report-a-beinasco-centro-comm-le-le-fornaci-globo-t9685.html",
            "RelatedURL": "https://www.forumelettrico.it/forum/colonnina-7-4-report-a-beinasco-centro-comm-le-le-fornaci-globo-t9685.html",
            "DateCreated": "2021-03-15T17:28:49.343Z",
            "User": {
                "ID": 11749,
                "Username": "ForumElettrico.it"
            },
            "CheckinStatusTypeID": 10,
            "IsActionedByEditor": false
        }
    ],
    "MediaItems": [
        {
            "ID": 26907,
            "ChargePointID": 174117,
            "ItemURL": "https://s3-ap-southeast-2.amazonaws.com/openchargemap/images/IT/OCM174117/OCM-174117.orig.2021031517285925.jpg",
            "ItemThumbnailURL": "https://s3-ap-southeast-2.amazonaws.com/openchargemap/images/IT/OCM174117/OCM-174117.thmb.2021031517285925.jpg",
            "Comment": "",
            "IsEnabled": true,
            "IsVideo": false,
            "IsFeaturedItem": false,
            "IsExternalResource": false,
            "User": {
                "ID": 11749,
                "Username": "ForumElettrico.it"
            },
            "DateCreated": "2021-03-15T17:29:00Z"
        },
        {
            "ID": 26908,
            "ChargePointID": 174117,
            "ItemURL": "https://s3-ap-southeast-2.amazonaws.com/openchargemap/images/IT/OCM174117/OCM-174117.orig.2021031517290543.jpg",
            "ItemThumbnailURL": "https://s3-ap-southeast-2.amazonaws.com/openchargemap/images/IT/OCM174117/OCM-174117.thmb.2021031517290543.jpg",
            "Comment": "",
            "IsEnabled": true,
            "IsVideo": false,
            "IsFeaturedItem": false,
            "IsExternalResource": false,
            "User": {
                "ID": 11749,
                "Username": "ForumElettrico.it"
            },
            "DateCreated": "2021-03-15T17:29:00Z"
        }
    ],
    "IsRecentlyVerified": false,
    "ID": 174117,
    "UUID": "850E4CCC-752A-4F8D-B34E-E02912A55152",
    "DataProviderID": 1,
    "UsageTypeID": 1,
    "AddressInfo": {
        "ID": 174476,
        "Title": "Repower Globo",
        "AddressLine1": "Strada Torino 34",
        "Town": "Beinasco",
        "StateOrProvince": "TO",
        "CountryID": 112,
        "Latitude": 45.024338,
        "Longitude": 7.592007,
        "RelatedURL": "https://www.forumelettrico.it/forum/colonnina-7-4-report-a-beinasco-centro-comm-le-le-fornaci-globo-t9685.html",
        "DistanceUnit": 0
    },
    "Connections": [
        {
            "ID": 268980,
            "ConnectionTypeID": 25,
            "LevelID": 2,
            "PowerKW": 22,
            "Quantity": 2
        }
    ],
    "NumberOfPoints": 1,
    "StatusTypeID": 50,
    "DateLastStatusUpdate": "2021-03-15T17:29:00Z",
    "DataQualityLevel": 1,
    "DateCreated": "2021-03-15T17:28:00Z",
    "SubmissionStatusTypeID": 200
}