{
    "IsRecentlyVerified": false,
    "ID": 119926,
    "UUID": "237A5390-3C8E-409A-B719-88630A7CA2EA",
    "DataProviderID": 2,
    "DataProvidersReference": "77843",
    "UsageTypeID": 2,
    "AddressInfo": {
        "ID": 120272,
        "Title": "Florida Power & Light - Flagler Service Center",
        "AddressLine1": "5910 E Highway 100",
        "Town": "Palm Coast",
        "StateOrProvince": "FL",
        "Postcode": "32164",
        "CountryID": 2,
        "Latitude": 29.477334,
        "Longitude": -81.192473,
        "ContactTelephone1": "",
        "AccessComments": "Fleet use only",
        "RelatedURL": "",
        "DistanceUnit": 0
    },
    "Connections": [
        {
            "ID": 169228,
            "ConnectionTypeID": 9,
            "LevelID": 1,
            "Amps": 16,
            "Voltage": 120,
            "PowerKW": 1.9,
            "CurrentTypeID": 10,
            "Quantity": 1
        },
        {
            "ID": 169229,
            "ConnectionTypeID": 1,
            "LevelID": 2,
            "Amps": 16,
            "Voltage": 230,
            "PowerKW": 3.7,
            "CurrentTypeID": 10,
            "Quantity": 1
        }
    ],
    "DateLastStatusUpdate": "2020-06-26T02:53:00Z",
    "DataQualityLevel": 3,
    "DateCreated": "2019-04-01T04:59:00Z",
    "SubmissionStatusTypeID": 100
}