{
    "IsRecentlyVerified": false,
    "ID": 169035,
    "UUID": "7B0353A6-3169-477F-9763-E7E88378B44E",
    "DataProviderID": 1,
    "OperatorID": 3,
    "OperatorsReference": "PG-70295,PG-84552",
    "UsageTypeID": 4,
    "UsageCost": "Free",
    "AddressInfo": {
        "ID": 169394,
        "Title": "Tesco Metro",
        "AddressLine1": "Tesco Metro",
        "Town": "Cherwell",
        "StateOrProvince": "England",
        "Postcode": "OX5 2BP",
        "CountryID": 1,
        "Latitude": 51.8243626934512,
        "Longitude": -1.28800834330139,
        "AccessComments": "Store: Mon-Fri 7am-10pm, Sat 7am-9pm & Sun 10am-4pm *2HRS MAX PARKING - £70 FINE*",
        "RelatedURL": "http://www.pod-point.com",
        "DistanceUnit": 0
    },
    "Connections": [
        {
            "ID": 257130,
            "ConnectionTypeID": 25,
            "StatusTypeID": 50,
            "LevelID": 2,
            "Amps": 32,
            "Voltage": 230,
            "PowerKW": 7,
            "CurrentTypeID": 10,
            "Quantity": 4
        }
    ],
    "NumberOfPoints": 4,
    "StatusTypeID": 50,
    "DateLastStatusUpdate": "2021-03-16T06:18:00Z",
    "DataQualityLevel": 1,
    "DateCreated": "2020-10-09T20:15:00Z",
    "SubmissionStatusTypeID": 200
}