{
    "IsRecentlyVerified": false,
    "ID": 159556,
    "UUID": "C6C4FABD-C009-4894-BB2E-5105A42BDF87",
    "DataProviderID": 2,
    "DataProvidersReference": "153323",
    "OperatorID": 5,
    "UsageTypeID": 1,
    "AddressInfo": {
        "ID": 159913,
        "Title": "PNB",
        "AddressLine1": "57 N 3rd St",
        "Town": "Newark",
        "StateOrProvince": "OH",
        "Postcode": "43055",
        "CountryID": 2,
        "Latitude": 40.059195,
        "Longitude": -82.4039791,
        "ContactTelephone1": "888-758-4389",
        "AccessComments": "24 hours daily",
        "RelatedURL": "http://www.chargepoint.com/",
        "DistanceUnit": 0
    },
    "Connections": [
        {
            "ID": 229749,
            "ConnectionTypeID": 1,
            "LevelID": 2,
            "Amps": 16,
            "Voltage": 230,
            "PowerKW": 3.7,
            "CurrentTypeID": 10,
            "Quantity": 2
        }
    ],
    "StatusTypeID": 50,
    "DateLastStatusUpdate": "2020-06-26T03:02:00Z",
    "DataQualityLevel": 3,
    "DateCreated": "2020-06-26T03:02:00Z",
    "SubmissionStatusTypeID": 100
}