{
    "IsRecentlyVerified": false,
    "ID": 173097,
    "UUID": "550EC229-E4A9-468F-8B55-84DE9F75F788",
    "DataProviderID": 19,
    "DataProvidersReference": "6838",
    "AddressInfo": {
        "ID": 173456,
        "Title": "Svenstigs Bil Halmstad",
        "AddressLine1": "Olofsdalsvägen 47",
        "Town": "HALMSTAD",
        "StateOrProvince": "HALLAND",
        "Postcode": "30241",
        "CountryID": 216,
        "Latitude": 56.6761,
        "Longitude": 12.79524,
        "AccessComments": "",
        "DistanceUnit": 0
    },
    "Connections": [
        {
            "ID": 265017,
            "ConnectionTypeID": 25,
            "Reference": "1",
            "LevelID": 3,
            "Amps": 32,
            "Voltage": 400,
            "PowerKW": 22,
            "CurrentTypeID": 30,
            "Comments": "Mode 3"
        },
        {
            "ID": 265018,
            "ConnectionTypeID": 33,
            "Reference": "2",
            "LevelID": 3,
            "Amps": 100,
            "Voltage": 500,
            "PowerKW": 50,
            "CurrentTypeID": 30,
            "Comments": "Mode 3"
        }
    ],
    "NumberOfPoints": 2,
    "StatusTypeID": 0,
    "DateLastStatusUpdate": "2021-03-24T05:10:00Z",
    "DataQualityLevel": 2,
    "DateCreated": "2021-03-03T09:01:00Z",
    "SubmissionStatusTypeID": 100
}