{
    "IsRecentlyVerified": false,
    "ID": 61795,
    "UUID": "EFD3808B-3627-4878-BF22-9233E1778F15",
    "DataProviderID": 1,
    "OperatorID": 23,
    "OperatorsReference": "9869",
    "UsageTypeID": 1,
    "UsageCost": "Free",
    "AddressInfo": {
        "ID": 62141,
        "Title": "Sandia Peak Inn",
        "AddressLine1": "4614 Central Ave SW",
        "Town": "Albuquerque",
        "StateOrProvince": "NM",
        "Postcode": "87105",
        "CountryID": 2,
        "Latitude": 35.0841872,
        "Longitude": -106.6899286,
        "ContactTelephone1": "505-831-5036  877-798-3752",
        "AccessComments": "24 hours daily; for guest use only; see front desk for access",
        "RelatedURL": "http://www.teslamotors.com/supercharger",
        "DistanceUnit": 0
    },
    "Connections": [
        {
            "ID": 78687,
            "ConnectionTypeID": 30,
            "StatusTypeID": 50,
            "LevelID": 2,
            "Amps": 16,
            "Voltage": 230,
            "PowerKW": 8,
            "CurrentTypeID": 10,
            "Quantity": 1
        }
    ],
    "NumberOfPoints": 1,
    "StatusTypeID": 50,
    "DateLastStatusUpdate": "2017-01-26T20:10:00Z",
    "DataQualityLevel": 3,
    "DateCreated": "2016-03-03T11:38:00Z",
    "SubmissionStatusTypeID": 100
}