{
    "IsRecentlyVerified": false,
    "ID": 139931,
    "UUID": "2DC8D12B-9A36-483E-B015-A87608B0269C",
    "DataProviderID": 2,
    "DataProvidersReference": "123366",
    "UsageTypeID": 1,
    "AddressInfo": {
        "ID": 140283,
        "Title": "El Camino Real Charter High School - Teacher/Faculty Lot",
        "AddressLine1": "5440 Valley Circle Blvd",
        "Town": "Woodland Hills",
        "StateOrProvince": "CA",
        "Postcode": "91367",
        "CountryID": 2,
        "Latitude": 34.17075,
        "Longitude": -118.642662,
        "ContactTelephone1": "818-595-7500",
        "AccessComments": "4pm-6am M-F, 24 hours Sat-Sun",
        "RelatedURL": "",
        "DistanceUnit": 0
    },
    "Connections": [
        {
            "ID": 195433,
            "ConnectionTypeID": 1,
            "LevelID": 2,
            "Amps": 16,
            "Voltage": 230,
            "PowerKW": 3.7,
            "CurrentTypeID": 10,
            "Quantity": 4
        }
    ],
    "StatusTypeID": 50,
    "DateLastStatusUpdate": "2020-06-26T02:57:00Z",
    "DataQualityLevel": 3,
    "DateCreated": "2019-12-24T09:11:00Z",
    "SubmissionStatusTypeID": 100
}