{
    "IsRecentlyVerified": false,
    "ID": 143943,
    "UUID": "41F06BD2-C0ED-48E1-BC49-EAEDBCBC6C07",
    "DataProviderID": 2,
    "DataProvidersReference": "38887",
    "UsageTypeID": 2,
    "AddressInfo": {
        "ID": 144295,
        "Title": "3M",
        "AddressLine1": "3M Center Dr",
        "Town": "St. Paul",
        "StateOrProvince": "MN",
        "Postcode": "55117",
        "CountryID": 2,
        "Latitude": 44.95121,
        "Longitude": -92.9952,
        "ContactTelephone1": "651-733-1110",
        "AccessComments": "Employee use only",
        "RelatedURL": "",
        "DistanceUnit": 0
    },
    "Connections": [
        {
            "ID": 200373,
            "ConnectionTypeID": 9,
            "LevelID": 1,
            "Amps": 16,
            "Voltage": 120,
            "PowerKW": 1.9,
            "CurrentTypeID": 10,
            "Quantity": 42
        },
        {
            "ID": 200374,
            "ConnectionTypeID": 1,
            "LevelID": 2,
            "Amps": 16,
            "Voltage": 230,
            "PowerKW": 3.7,
            "CurrentTypeID": 10,
            "Quantity": 2
        }
    ],
    "StatusTypeID": 50,
    "DateLastStatusUpdate": "2020-06-26T03:08:00Z",
    "DataQualityLevel": 3,
    "DateCreated": "2019-12-24T09:22:00Z",
    "SubmissionStatusTypeID": 100
}