{
    "UserComments": [
        {
            "ID": 3837,
            "ChargePointID": 31393,
            "CommentTypeID": 10,
            "UserName": "Anon74856763534",
            "Comment": "",
            "DateCreated": "2015-02-21T20:13:48.777Z",
            "User": {
                "ID": 1192,
                "Username": "Anon74856763534"
            },
            "CheckinStatusTypeID": 140
        },
        {
            "ID": 3836,
            "ChargePointID": 31393,
            "CommentTypeID": 50,
            "UserName": "Connor Milligan",
            "Comment": "Point located at the back of the staff park, but staff are happy for public to use facility. Worked fine with CYC card. \n\nPoint is a Chargemaster unit, 7kW on Single phase Type 2 and 22kW on 3 phase if your EV supports it. photos uploaded. \n\nI have been told some staff have EV's and may have a vehicle parked there during shift. if visiting outside office hours both sides should be free.",
            "Rating": 4,
            "DateCreated": "2015-02-21T18:14:35.443Z",
            "User": {
                "ID": 4468,
                "Username": "Connor Milligan"
            },
            "CheckinStatusTypeID": 10
        }
    ],
    "MediaItems": [
        {
            "ID": 1020,
            "ChargePointID": 31393,
            "ItemURL": "https://s3-ap-southeast-2.amazonaws.com/openchargemap/images/GB/OCM31393/OCM-31393.orig.2015022123315753.jpg",
            "ItemThumbnailURL": "https://s3-ap-southeast-2.amazonaws.com/openchargemap/images/GB/OCM31393/OCM-31393.thmb.2015022123315753.jpg",
            "Comment": "Data Plate from rear of unit showing current, phases and model details",
            "IsEnabled": true,
            "IsVideo": false,
            "IsFeaturedItem": false,
            "IsExternalResource": false,
            "User": {
                "ID": 4468,
                "Username": "Connor Milligan"
            },
            "DateCreated": "2015-02-21T23:32:00Z"
        },
        {
            "ID": 1017,
            "ChargePointID": 31393,
            "ItemURL": "https://s3-ap-southeast-2.amazonaws.com/openchargemap/images/GB/OCM31393/OCM-31393.orig.2015022118185575.jpg",
            "ItemThumbnailURL": "https://s3-ap-southeast-2.amazonaws.com/openchargemap/images/GB/OCM31393/OCM-31393.thmb.2015022118185575.jpg",
            "Comment": "Screen of Charge point",
            "IsEnabled": true,
            "IsVideo": false,
            "IsFeaturedItem": false,
            "IsExternalResource": false,
            "User": {
                "ID": 4468,
                "Username": "Connor Milligan"
            },
            "DateCreated": "2015-02-21T18:19:00Z"
        },
        {
            "ID": 1016,
            "ChargePointID": 31393,
            "ItemURL": "https://s3-ap-southeast-2.amazonaws.com/openchargemap/images/GB/OCM31393/OCM-31393.orig.2015022118165347.jpg",
            "ItemThumbnailURL": "https://s3-ap-southeast-2.amazonaws.com/openchargemap/images/GB/OCM31393/OCM-31393.thmb.2015022118165347.jpg",
            "Comment": "Unit shown at night ",
            "IsEnabled": true,
            "IsVideo": false,
            "IsFeaturedItem": false,
            "IsExternalResource": false,
            "User": {
                "ID": 4468,
                "Username": "Connor Milligan"
            },
            "DateCreated": "2015-02-21T18:17:00Z"
        }
    ],
    "IsRecentlyVerified": false,
    "ID": 31393,
    "UUID": "F53BAB4C-59CA-487F-BE06-C34B61D4F401",
    "DataProviderID": 1,
    "OperatorID": 3315,
    "OperatorsReference": "50762",
    "UsageTypeID": 4,
    "UsageCost": "Free",
    "AddressInfo": {
        "ID": 31739,
        "Title": "East Coast Viners",
        "AddressLine1": "Broadwood",
        "AddressLine2": "Glenbervie Road",
        "Town": "Drumlithie",
        "StateOrProvince": "Aberdeenshire",
        "Postcode": "AB39 3XA",
        "CountryID": 1,
        "Latitude": 56.9228214229405,
        "Longitude": -2.33865536634266,
        "DistanceUnit": 0
    },
    "Connections": [
        {
            "ID": 34901,
            "ConnectionTypeID": 25,
            "StatusTypeID": 50,
            "LevelID": 2,
            "Amps": 32,
            "Voltage": 400,
            "PowerKW": 22,
            "CurrentTypeID": 20,
            "Quantity": 2
        }
    ],
    "NumberOfPoints": 2,
    "StatusTypeID": 50,
    "DateLastStatusUpdate": "2020-01-02T08:37:00Z",
    "DataQualityLevel": 1,
    "DateCreated": "2015-01-07T14:56:00Z",
    "SubmissionStatusTypeID": 200
}