{
    "IsRecentlyVerified": false,
    "ID": 18655,
    "UUID": "71C12E93-121A-4594-BB40-43FB74ABB279",
    "DataProviderID": 15,
    "DataProvidersReference": "31681",
    "OperatorID": 5,
    "AddressInfo": {
        "ID": 19000,
        "Title": "330 E Columbia St",
        "AddressLine1": "330 E Columbia St",
        "Town": "New Westminster",
        "StateOrProvince": "British Columbia",
        "Postcode": "V3L 3W7",
        "CountryID": 44,
        "Latitude": 49.22638557,
        "Longitude": -122.8915838,
        "ContactTelephone1": "",
        "RelatedURL": "http://carstations.com/31681",
        "DistanceUnit": 0
    },
    "Connections": [
        {
            "ID": 18888,
            "ConnectionTypeID": 9,
            "Reference": "NEMA5",
            "LevelID": 1,
            "Quantity": 1
        },
        {
            "ID": 19137,
            "ConnectionTypeID": 1,
            "Reference": "J1772",
            "LevelID": 2
        }
    ],
    "StatusTypeID": 0,
    "DateLastStatusUpdate": "2017-11-04T14:05:00Z",
    "DataQualityLevel": 2,
    "DateCreated": "2013-08-25T03:29:00Z",
    "SubmissionStatusTypeID": 200
}