{
    "IsRecentlyVerified": false,
    "ID": 111058,
    "UUID": "A4FD4F03-A960-45A8-8901-8E31D9992536",
    "DataProviderID": 2,
    "DataProvidersReference": "91432",
    "OperatorID": 5,
    "UsageTypeID": 1,
    "AddressInfo": {
        "ID": 111404,
        "Title": "BMW AUTOHAUS",
        "AddressLine1": "452-480 Steeles Ave W",
        "Town": "Vaughan",
        "StateOrProvince": "ON",
        "Postcode": "L4J",
        "CountryID": 44,
        "Latitude": 43.794694,
        "Longitude": -79.436296,
        "ContactTelephone1": "888-758-4389",
        "AccessComments": "24 hours daily",
        "RelatedURL": "http://www.chargepoint.com/",
        "DistanceUnit": 0
    },
    "Connections": [
        {
            "ID": 156409,
            "ConnectionTypeID": 1,
            "LevelID": 2,
            "Amps": 16,
            "Voltage": 230,
            "PowerKW": 3,
            "CurrentTypeID": 10,
            "Quantity": 3
        }
    ],
    "DateLastStatusUpdate": "2019-12-24T09:21:00Z",
    "DataQualityLevel": 3,
    "DateCreated": "2018-10-18T23:36:00Z",
    "SubmissionStatusTypeID": 100
}