{
    "IsRecentlyVerified": false,
    "ID": 96782,
    "UUID": "A76C1C65-F536-4134-B82A-6DD81DD96D87",
    "DataProviderID": 2,
    "DataProvidersReference": "88432",
    "OperatorID": 5,
    "UsageTypeID": 1,
    "AddressInfo": {
        "ID": 97128,
        "Title": "CBW PROPERTIES",
        "AddressLine1": "7196-7274 Colonial St",
        "Town": "Boise",
        "StateOrProvince": "ID",
        "Postcode": "83709",
        "CountryID": 2,
        "Latitude": 43.6014826,
        "Longitude": -116.2722214,
        "ContactTelephone1": "888-758-4389",
        "AccessComments": "24 hours daily",
        "RelatedURL": "http://www.chargepoint.com/",
        "DistanceUnit": 0
    },
    "Connections": [
        {
            "ID": 137061,
            "ConnectionTypeID": 1,
            "LevelID": 2,
            "Amps": 16,
            "Voltage": 230,
            "PowerKW": 3.7,
            "CurrentTypeID": 10,
            "Quantity": 2
        }
    ],
    "DateLastStatusUpdate": "2020-06-26T03:07:00Z",
    "DataQualityLevel": 3,
    "DateCreated": "2017-12-29T21:01:00Z",
    "SubmissionStatusTypeID": 100
}