{
    "IsRecentlyVerified": false,
    "ID": 168527,
    "UUID": "37E8FDB0-1336-4631-99E6-D5141B19A017",
    "DataProviderID": 1,
    "OperatorID": 21,
    "UsageTypeID": 4,
    "UsageCost": "Mobi.E compatible card",
    "AddressInfo": {
        "ID": 168886,
        "Title": "VNF-00009",
        "AddressLine1": "Rua Luís Barroso",
        "Town": "Vila Nova de Famalicão",
        "StateOrProvince": "Braga",
        "Postcode": "4760-153",
        "CountryID": 180,
        "Latitude": 41.405446447218196,
        "Longitude": -8.520686665911171,
        "DistanceUnit": 0
    },
    "Connections": [
        {
            "ID": 255962,
            "ConnectionTypeID": 2,
            "StatusTypeID": 50,
            "LevelID": 3,
            "Amps": 120,
            "Voltage": 500,
            "PowerKW": 50,
            "CurrentTypeID": 30,
            "Quantity": 1
        },
        {
            "ID": 255963,
            "ConnectionTypeID": 33,
            "StatusTypeID": 50,
            "LevelID": 3,
            "Amps": 125,
            "Voltage": 500,
            "PowerKW": 50,
            "CurrentTypeID": 30,
            "Quantity": 1
        },
        {
            "ID": 255964,
            "ConnectionTypeID": 1036,
            "StatusTypeID": 50,
            "LevelID": 3,
            "Amps": 63,
            "Voltage": 400,
            "PowerKW": 43,
            "CurrentTypeID": 20,
            "Quantity": 1
        }
    ],
    "NumberOfPoints": 2,
    "StatusTypeID": 50,
    "DateLastStatusUpdate": "2020-09-30T19:34:00Z",
    "DataQualityLevel": 1,
    "DateCreated": "2020-09-30T19:34:00Z",
    "SubmissionStatusTypeID": 200
}