{
    "MediaItems": [
        {
            "ID": 12685,
            "ChargePointID": 88422,
            "ItemURL": "https://s3-ap-southeast-2.amazonaws.com/openchargemap/images/NZ/OCM88422/OCM-88422.orig.2017052911362981.jpg",
            "ItemThumbnailURL": "https://s3-ap-southeast-2.amazonaws.com/openchargemap/images/NZ/OCM88422/OCM-88422.thmb.2017052911362981.jpg",
            "Comment": "",
            "IsEnabled": true,
            "IsVideo": false,
            "IsFeaturedItem": false,
            "IsExternalResource": false,
            "User": {
                "ID": 15365,
                "Username": "sliday"
            },
            "DateCreated": "2017-05-29T11:37:00Z"
        },
        {
            "ID": 12686,
            "ChargePointID": 88422,
            "ItemURL": "https://s3-ap-southeast-2.amazonaws.com/openchargemap/images/NZ/OCM88422/OCM-88422.orig.2017052911364363.jpg",
            "ItemThumbnailURL": "https://s3-ap-southeast-2.amazonaws.com/openchargemap/images/NZ/OCM88422/OCM-88422.thmb.2017052911364363.jpg",
            "Comment": "",
            "IsEnabled": true,
            "IsVideo": false,
            "IsFeaturedItem": false,
            "IsExternalResource": false,
            "User": {
                "ID": 15365,
                "Username": "sliday"
            },
            "DateCreated": "2017-05-29T11:37:00Z"
        },
        {
            "ID": 12682,
            "ChargePointID": 88422,
            "ItemURL": "https://s3-ap-southeast-2.amazonaws.com/openchargemap/images/NZ/OCM88422/OCM-88422.orig.2017052911355138.jpg",
            "ItemThumbnailURL": "https://s3-ap-southeast-2.amazonaws.com/openchargemap/images/NZ/OCM88422/OCM-88422.thmb.2017052911355138.jpg",
            "Comment": "",
            "IsEnabled": true,
            "IsVideo": false,
            "IsFeaturedItem": false,
            "IsExternalResource": false,
            "User": {
                "ID": 15365,
                "Username": "sliday"
            },
            "DateCreated": "2017-05-29T11:36:00Z"
        },
        {
            "ID": 12683,
            "ChargePointID": 88422,
            "ItemURL": "https://s3-ap-southeast-2.amazonaws.com/openchargemap/images/NZ/OCM88422/OCM-88422.orig.2017052911360253.jpg",
            "ItemThumbnailURL": "https://s3-ap-southeast-2.amazonaws.com/openchargemap/images/NZ/OCM88422/OCM-88422.thmb.2017052911360253.jpg",
            "Comment": "",
            "IsEnabled": true,
            "IsVideo": false,
            "IsFeaturedItem": false,
            "IsExternalResource": false,
            "User": {
                "ID": 15365,
                "Username": "sliday"
            },
            "DateCreated": "2017-05-29T11:36:00Z"
        },
        {
            "ID": 12684,
            "ChargePointID": 88422,
            "ItemURL": "https://s3-ap-southeast-2.amazonaws.com/openchargemap/images/NZ/OCM88422/OCM-88422.orig.2017052911361807.jpg",
            "ItemThumbnailURL": "https://s3-ap-southeast-2.amazonaws.com/openchargemap/images/NZ/OCM88422/OCM-88422.thmb.2017052911361807.jpg",
            "Comment": "",
            "IsEnabled": true,
            "IsVideo": false,
            "IsFeaturedItem": false,
            "IsExternalResource": false,
            "User": {
                "ID": 15365,
                "Username": "sliday"
            },
            "DateCreated": "2017-05-29T11:36:00Z"
        }
    ],
    "IsRecentlyVerified": false,
    "ID": 88422,
    "UUID": "ECA845AC-726A-4660-A59E-B6C2830A6BB6",
    "DataProviderID": 1,
    "OperatorID": 229,
    "UsageTypeID": 4,
    "UsageCost": "Free",
    "AddressInfo": {
        "ID": 88768,
        "Title": "Dickens Street Car Park",
        "AddressLine1": "206 Dickens Street",
        "Town": "Napier South, Napier ",
        "Postcode": "4110",
        "CountryID": 161,
        "Latitude": -39.4923541310665,
        "Longitude": 176.914704750297,
        "ContactTelephone1": "08002864766",
        "DistanceUnit": 0
    },
    "Connections": [
        {
            "ID": 125416,
            "ConnectionTypeID": 2,
            "StatusTypeID": 50,
            "LevelID": 3,
            "PowerKW": 50,
            "CurrentTypeID": 30,
            "Quantity": 1
        },
        {
            "ID": 125417,
            "ConnectionTypeID": 1036,
            "StatusTypeID": 50,
            "LevelID": 3,
            "Amps": 63,
            "Voltage": 400,
            "PowerKW": 43,
            "CurrentTypeID": 20,
            "Quantity": 1
        },
        {
            "ID": 125418,
            "ConnectionTypeID": 33,
            "StatusTypeID": 50,
            "LevelID": 3,
            "PowerKW": 50,
            "CurrentTypeID": 30,
            "Quantity": 1
        }
    ],
    "NumberOfPoints": 3,
    "GeneralComments": "24/7\r\nLocated in the carpark next to the Quest Hotel. Free charging until early May 2017. The CCS plug on this charger is Type 2. Map marker location is precise.",
    "StatusTypeID": 50,
    "DateLastStatusUpdate": "2017-05-31T18:35:00Z",
    "DataQualityLevel": 1,
    "DateCreated": "2017-05-29T11:36:00Z",
    "SubmissionStatusTypeID": 200
}