{
    "UserComments": [
        {
            "ID": 417,
            "ChargePointID": 10497,
            "CommentTypeID": 10,
            "UserName": "Anthony volt",
            "Comment": "Great place. Free charging on level 2. Usually not in use",
            "Rating": 5,
            "DateCreated": "2013-09-03T12:09:42.457Z",
            "CheckinStatusTypeID": 10
        }
    ],
    "MediaItems": [
        {
            "ID": 172,
            "ChargePointID": 10497,
            "ItemURL": "https://s3-ap-southeast-2.amazonaws.com/openchargemap/images/US/OCM10497/OCM-10497.orig.2014010113185658.jpg",
            "ItemThumbnailURL": "https://s3-ap-southeast-2.amazonaws.com/openchargemap/images/US/OCM10497/OCM-10497.thmb.2014010113185658.jpg",
            "Comment": "Great place to charge the Volt",
            "IsEnabled": true,
            "IsVideo": false,
            "IsFeaturedItem": false,
            "IsExternalResource": false,
            "User": {
                "ID": 1109,
                "Username": "AnthonyUPS"
            },
            "DateCreated": "2014-01-01T13:19:00Z"
        }
    ],
    "IsRecentlyVerified": false,
    "ID": 10497,
    "UUID": "97D986D3-7DD9-48C7-A146-F9AB765EE6C1",
    "DataProviderID": 15,
    "DataProvidersReference": "18472",
    "OperatorID": 31,
    "AddressInfo": {
        "ID": 10394,
        "Title": "1059 Silas Deane Highway",
        "AddressLine1": "1059 Silas Deane Highway",
        "Town": "Wethersfield",
        "StateOrProvince": "CT",
        "Postcode": "06109",
        "CountryID": 2,
        "Latitude": 41.691535,
        "Longitude": -72.656739,
        "ContactTelephone1": "860-221-0011",
        "RelatedURL": "http://carstations.com/18472",
        "DistanceUnit": 0
    },
    "Connections": [
        {
            "ID": 8447,
            "ConnectionTypeID": 1,
            "Reference": "J1772",
            "LevelID": 2
        }
    ],
    "StatusTypeID": 0,
    "DateLastStatusUpdate": "2017-11-04T14:04:00Z",
    "DataQualityLevel": 2,
    "DateCreated": "2012-05-28T15:37:00Z",
    "SubmissionStatusTypeID": 100
}