{
    "IsRecentlyVerified": false,
    "ID": 149715,
    "UUID": "AA6371F5-BDA1-44D6-8588-1F72637D1630",
    "DataProviderID": 1,
    "OperatorID": 45,
    "UsageTypeID": 7,
    "AddressInfo": {
        "ID": 150068,
        "Title": "Balkan Tekstil Makina",
        "AddressLine1": "Astim 5. Cadde, No: 4 ",
        "AddressLine2": "Ata OSB",
        "Town": "Aydın",
        "Postcode": "09010",
        "CountryID": 229,
        "Latitude": 37.83770871249952,
        "Longitude": 27.884714132820818,
        "ContactTelephone1": "+90 256 231 04 64",
        "AccessComments": "Call for reservation: +90 256 231 04 64",
        "DistanceUnit": 0
    },
    "Connections": [
        {
            "ID": 207854,
            "ConnectionTypeID": 2,
            "StatusTypeID": 50,
            "LevelID": 3,
            "Amps": 125,
            "Voltage": 500,
            "PowerKW": 45,
            "CurrentTypeID": 30,
            "Quantity": 1
        },
        {
            "ID": 207855,
            "ConnectionTypeID": 25,
            "StatusTypeID": 50,
            "LevelID": 2,
            "Amps": 32,
            "Voltage": 400,
            "PowerKW": 22,
            "CurrentTypeID": 20,
            "Quantity": 1
        },
        {
            "ID": 268812,
            "ConnectionTypeID": 33,
            "StatusTypeID": 50,
            "LevelID": 3,
            "Amps": 125,
            "Voltage": 500,
            "PowerKW": 45,
            "CurrentTypeID": 30,
            "Quantity": 1
        }
    ],
    "NumberOfPoints": 1,
    "StatusTypeID": 50,
    "DateLastStatusUpdate": "2021-03-14T10:05:00Z",
    "DataQualityLevel": 1,
    "DateCreated": "2020-03-04T20:35:00Z",
    "SubmissionStatusTypeID": 200
}