{
    "IsRecentlyVerified": false,
    "ID": 174696,
    "UUID": "3623A078-0384-49D0-81F3-8719E3FA9303",
    "DataProviderID": 1,
    "OperatorID": 125,
    "UsageTypeID": 4,
    "AddressInfo": {
        "ID": 175055,
        "Title": "Benqueplatz",
        "AddressLine1": "Wachmannstraße 101",
        "AddressLine2": "Stadtteil Schwachhausen",
        "Town": "Bremen",
        "StateOrProvince": "Free Hanseatic City of Bremen",
        "Postcode": "28209",
        "CountryID": 87,
        "Latitude": 53.08627373868342,
        "Longitude": 8.833001770398596,
        "DistanceUnit": 0
    },
    "Connections": [
        {
            "ID": 270696,
            "ConnectionTypeID": 25,
            "StatusTypeID": 50,
            "LevelID": 2,
            "Amps": 32,
            "Voltage": 400,
            "PowerKW": 22,
            "CurrentTypeID": 20,
            "Quantity": 2
        }
    ],
    "NumberOfPoints": 2,
    "GeneralComments": "Am Straßenrand steht die durchgehend verfügbare rot-weiße Ladesäule mit 2 nicht reservierten Parkplätzen daneben, hinter den Fahrradbügeln.",
    "StatusTypeID": 50,
    "DateLastStatusUpdate": "2021-04-11T11:38:00Z",
    "DataQualityLevel": 1,
    "DateCreated": "2021-04-11T11:38:00Z",
    "SubmissionStatusTypeID": 200
}