{
    "MediaItems": [
        {
            "ID": 18283,
            "ChargePointID": 125923,
            "ItemURL": "https://s3-ap-southeast-2.amazonaws.com/openchargemap/images/GB/OCM125923/OCM-125923.orig.2019050813061402.jpg",
            "ItemThumbnailURL": "https://s3-ap-southeast-2.amazonaws.com/openchargemap/images/GB/OCM125923/OCM-125923.thmb.2019050813061402.jpg",
            "Comment": "",
            "IsEnabled": true,
            "IsVideo": false,
            "IsFeaturedItem": false,
            "IsExternalResource": false,
            "User": {
                "ID": 15366,
                "Username": "ZCWCara"
            },
            "DateCreated": "2019-05-08T13:06:00Z"
        },
        {
            "ID": 18282,
            "ChargePointID": 125923,
            "ItemURL": "https://s3-ap-southeast-2.amazonaws.com/openchargemap/images/GB/OCM125923/OCM-125923.orig.2019050813044403.jpg",
            "ItemThumbnailURL": "https://s3-ap-southeast-2.amazonaws.com/openchargemap/images/GB/OCM125923/OCM-125923.thmb.2019050813044403.jpg",
            "Comment": "",
            "IsEnabled": true,
            "IsVideo": false,
            "IsFeaturedItem": false,
            "IsExternalResource": false,
            "User": {
                "ID": 15366,
                "Username": "ZCWCara"
            },
            "DateCreated": "2019-05-08T13:05:00Z"
        }
    ],
    "IsRecentlyVerified": false,
    "ID": 125923,
    "UUID": "6FA0E8AB-85FA-4B94-B202-7F13D8957161",
    "DataProviderID": 1,
    "OperatorID": 19,
    "UsageTypeID": 6,
    "UsageCost": "Free",
    "AddressInfo": {
        "ID": 126269,
        "Title": "Heath Farm Holiday Cottages",
        "AddressLine1": "Heath Farm,",
        "AddressLine2": "Swerford",
        "Town": "Chipping Norton",
        "StateOrProvince": "Oxfordshire",
        "Postcode": "OX7 4BN",
        "CountryID": 1,
        "Latitude": 51.984726,
        "Longitude": -1.429766,
        "ContactTelephone1": "01608683270",
        "ContactEmail": "cottages@heathfarm.com",
        "RelatedURL": "http://heathfarm.com",
        "DistanceUnit": 0
    },
    "Connections": [
        {
            "ID": 176497,
            "ConnectionTypeID": 25,
            "StatusTypeID": 50,
            "LevelID": 2,
            "Amps": 32,
            "Voltage": 230,
            "PowerKW": 7,
            "CurrentTypeID": 10,
            "Quantity": 1
        }
    ],
    "NumberOfPoints": 1,
    "StatusTypeID": 50,
    "DateLastStatusUpdate": "2019-05-08T13:06:00Z",
    "DataQualityLevel": 1,
    "DateCreated": "2019-05-08T13:03:00Z",
    "SubmissionStatusTypeID": 200
}