{
    "IsRecentlyVerified": false,
    "ID": 183806,
    "UUID": "C963B9C5-8272-4656-BE78-FA8CDEF889EE",
    "DataProviderID": 29,
    "DataProvidersReference": "1275",
    "AddressInfo": {
        "ID": 184165,
        "Title": "Herforder Str. 534",
        "AddressLine1": "Herforder Str. 534",
        "Town": "Bielefeld",
        "Postcode": "33729",
        "CountryID": 87,
        "Latitude": 52.060028,
        "Longitude": 8.603043,
        "DistanceUnit": 0
    },
    "Connections": [
        {
            "ID": 291251,
            "ConnectionTypeID": 25,
            "StatusTypeID": 50,
            "LevelID": 2,
            "PowerKW": 22,
            "CurrentTypeID": 20
        },
        {
            "ID": 291252,
            "ConnectionTypeID": 25,
            "StatusTypeID": 50,
            "LevelID": 2,
            "PowerKW": 22,
            "CurrentTypeID": 20
        }
    ],
    "StatusTypeID": 50,
    "DateLastStatusUpdate": "2021-07-09T03:25:00Z",
    "MetadataValues": [
        {
            "ID": 16099,
            "MetadataFieldID": 4,
            "ItemValue": "Data from the German chargepoint registry provided by Bundesnetzagentur.de under the CC-BY 4.0 license"
        }
    ],
    "DataQualityLevel": 3,
    "DateCreated": "2021-07-08T10:04:00Z",
    "SubmissionStatusTypeID": 100
}