{
    "IsRecentlyVerified": false,
    "ID": 27261,
    "UUID": "F7C2FF90-7A49-40AA-AF16-F50EE7441468",
    "DataProviderID": 1,
    "OperatorID": 5,
    "UsageTypeID": 1,
    "UsageCost": "$0.75/hour prorated",
    "AddressInfo": {
        "ID": 27607,
        "Title": "Cobb Parking Deck at UNC-Chapel Hill",
        "AddressLine1": "Paul Green Dr",
        "Town": "Chapel Hill",
        "StateOrProvince": "NC",
        "Postcode": "27514",
        "CountryID": 2,
        "Latitude": 35.9114865,
        "Longitude": -79.0452047,
        "ContactTelephone1": "888-758-4389",
        "AccessComments": "Cobb Parking Deck like most decks on campus requires a swipe-in card and permit Mondays-Friday from 7:30am-5:00pm. This is not a pay lot - you need a permit and swipe-in card on weekdays. Gate raises during evenings and on weekends, though this will change in fall 2019 as UNC introduces nighttime parking fees. ",
        "RelatedURL": "http://www.chargepoint.com/",
        "DistanceUnit": 0
    },
    "Connections": [
        {
            "ID": 29860,
            "ConnectionTypeID": 1,
            "StatusTypeID": 50,
            "LevelID": 2,
            "Amps": 16,
            "Voltage": 230,
            "PowerKW": 3,
            "CurrentTypeID": 10,
            "Quantity": 2
        }
    ],
    "NumberOfPoints": 1,
    "GeneralComments": "Two J1772 chargers available at NE corner of Cobb Parking Deck, top floor (level 5). It is an open-air garage although there are an enclosed elevator and stairs very close by. $0.75/hour through ChargePoint, though it's prorated (ie. may be charged less for less time charging).",
    "StatusTypeID": 50,
    "DateLastStatusUpdate": "2018-10-10T13:28:00Z",
    "DataQualityLevel": 3,
    "DateCreated": "2014-11-28T03:37:00Z",
    "SubmissionStatusTypeID": 100
}