{
    "IsRecentlyVerified": false,
    "ID": 187612,
    "UUID": "DA23A147-4D68-4188-A713-827E9127DB85",
    "DataProviderID": 18,
    "DataProvidersReference": "af33de77a048ae7d86b878d2ba7f710a",
    "OperatorID": 3392,
    "UsageTypeID": 5,
    "AddressInfo": {
        "ID": 187971,
        "Title": "Ewell By Pass",
        "AddressLine1": "Ewell By Pass",
        "Town": "Ewell",
        "Postcode": "KT17 2PU",
        "CountryID": 1,
        "Latitude": 51.354308,
        "Longitude": -0.246872,
        "AccessComments": "",
        "RelatedURL": "http://www.shell.co.uk/motorist/welcome-to-shell-recharge.html",
        "DistanceUnit": 0
    },
    "Connections": [
        {
            "ID": 302810,
            "ConnectionTypeID": 1036,
            "Reference": "1",
            "StatusTypeID": 50,
            "LevelID": 3,
            "Amps": 125,
            "Voltage": 400,
            "PowerKW": 50,
            "CurrentTypeID": 30
        },
        {
            "ID": 302811,
            "ConnectionTypeID": 2,
            "Reference": "2",
            "StatusTypeID": 50,
            "LevelID": 3,
            "Amps": 125,
            "Voltage": 400,
            "PowerKW": 50,
            "CurrentTypeID": 30
        }
    ],
    "StatusTypeID": 0,
    "DateLastStatusUpdate": "2021-07-12T03:38:00Z",
    "MetadataValues": [
        {
            "ID": 19852,
            "MetadataFieldID": 4,
            "ItemValue": "Contains public sector information licensed under the Open Government Licence v2.0. http://www.nationalarchives.gov.uk/doc/open-government-licence/version/2/"
        }
    ],
    "DataQualityLevel": 3,
    "DateCreated": "2021-07-12T03:38:00Z",
    "SubmissionStatusTypeID": 100
}