{
    "IsRecentlyVerified": false,
    "ID": 44634,
    "UUID": "26684C7F-7376-4440-8B3E-7AB7F13348B8",
    "DataProviderID": 26,
    "DataProvidersReference": "61143",
    "OperatorID": 73,
    "OperatorsReference": "EV-Box EVB-P1430216",
    "UsageCost": "0.00 jaarabonnement",
    "AddressInfo": {
        "ID": 44980,
        "Title": "Offenbekerweg 4",
        "AddressLine1": "Offenbekerweg 4",
        "Town": "Beesel",
        "Postcode": "5953 NC",
        "CountryID": 159,
        "Latitude": 51.27714,
        "Longitude": 6.09202,
        "RelatedURL": "http://www.ev-box.nl",
        "DistanceUnit": 0
    },
    "Connections": [
        {
            "ID": 54827,
            "ConnectionTypeID": 25,
            "LevelID": 2,
            "PowerKW": 11,
            "CurrentTypeID": 10
        }
    ],
    "NumberOfPoints": 1,
    "StatusTypeID": 50,
    "DateLastStatusUpdate": "2016-06-04T02:38:00Z",
    "DataQualityLevel": 3,
    "DateCreated": "2015-04-18T13:02:00Z",
    "SubmissionStatusTypeID": 100
}