{
    "IsRecentlyVerified": false,
    "ID": 170702,
    "UUID": "FF3E64A6-7EE5-4C18-BB93-8210F9730748",
    "DataProviderID": 1,
    "OperatorID": 1,
    "UsageTypeID": 1,
    "UsageCost": "0",
    "AddressInfo": {
        "ID": 171061,
        "Title": "Carrefour Majadahonda",
        "AddressLine1": "Calle de las Moreras",
        "Town": "Majadahonda",
        "StateOrProvince": "Community of Madrid",
        "Postcode": "28222",
        "CountryID": 210,
        "Latitude": 40.4530962253489,
        "Longitude": -3.869201915484382,
        "AccessComments": "Hay que llamar al guardia de seguridad",
        "DistanceUnit": 0
    },
    "Connections": [
        {
            "ID": 260712,
            "ConnectionTypeID": 25,
            "StatusTypeID": 50,
            "LevelID": 2,
            "Amps": 32,
            "Voltage": 400,
            "PowerKW": 22,
            "CurrentTypeID": 20,
            "Quantity": 1
        },
        {
            "ID": 260713,
            "ConnectionTypeID": 25,
            "StatusTypeID": 50,
            "LevelID": 2,
            "Amps": 32,
            "Voltage": 400,
            "PowerKW": 22,
            "CurrentTypeID": 20,
            "Quantity": 1
        }
    ],
    "NumberOfPoints": 1,
    "StatusTypeID": 50,
    "DateLastStatusUpdate": "2020-12-05T21:58:00Z",
    "DataQualityLevel": 1,
    "DateCreated": "2020-12-05T21:57:00Z",
    "SubmissionStatusTypeID": 200
}