{
    "IsRecentlyVerified": false,
    "ID": 61329,
    "UUID": "045A88F0-8B70-40EC-8903-250D19AB7191",
    "DataProviderID": 1,
    "OperatorID": 82,
    "UsageTypeID": 4,
    "UsageCost": "15,10€ per 3 mesi",
    "AddressInfo": {
        "ID": 61675,
        "Title": "A2A Isola Digitale Pirelli Gioia",
        "AddressLine1": "Via Giovanni Battista Pirelli, 35",
        "AddressLine2": "Accesso da Via Bordoni",
        "Town": "Milano",
        "StateOrProvince": "MI",
        "Postcode": "20121",
        "CountryID": 112,
        "Latitude": 45.48393791925422,
        "Longitude": 9.196116023704336,
        "ContactTelephone1": "800 035151",
        "ContactEmail": "e-moving@a2a.eu",
        "RelatedURL": "http://www.e-moving.it/",
        "DistanceUnit": 0
    },
    "Connections": [
        {
            "ID": 78106,
            "ConnectionTypeID": 36,
            "StatusTypeID": 50,
            "LevelID": 2,
            "Amps": 16,
            "Voltage": 240,
            "PowerKW": 3.4,
            "CurrentTypeID": 10,
            "Quantity": 4
        }
    ],
    "NumberOfPoints": 4,
    "StatusTypeID": 50,
    "DateLastStatusUpdate": "2016-02-24T14:49:00Z",
    "DataQualityLevel": 1,
    "DateCreated": "2016-02-24T14:49:00Z",
    "SubmissionStatusTypeID": 200
}