{
    "IsRecentlyVerified": false,
    "ID": 38932,
    "UUID": "BDE8BA72-63FC-4748-9014-82F8614C8A2B",
    "DataProviderID": 26,
    "DataProvidersReference": "47062",
    "OperatorID": 178,
    "OperatorsReference": "EVnetNL AL202",
    "UsageCost": "0.00 jaarabonnement",
    "AddressInfo": {
        "ID": 39278,
        "Title": "Leeuwarderkade",
        "AddressLine1": "Leeuwarderkade",
        "Town": "Súdwest-Fryslân",
        "Postcode": "8603 CB",
        "CountryID": 159,
        "Latitude": 53.034926,
        "Longitude": 5.666251,
        "ContactTelephone1": "0800-3522365",
        "RelatedURL": "http://www.evnet.nl",
        "DistanceUnit": 0
    },
    "Connections": [
        {
            "ID": 42443,
            "ConnectionTypeID": 25,
            "LevelID": 2,
            "PowerKW": 11,
            "CurrentTypeID": 10
        }
    ],
    "NumberOfPoints": 1,
    "StatusTypeID": 50,
    "DateLastStatusUpdate": "2016-06-04T02:56:00Z",
    "DataQualityLevel": 3,
    "DateCreated": "2015-01-09T06:08:00Z",
    "SubmissionStatusTypeID": 100
}