{
    "MediaItems": [
        {
            "ID": 17951,
            "ChargePointID": 118590,
            "ItemURL": "https://s3-ap-southeast-2.amazonaws.com/openchargemap/images/IT/OCM118590/OCM-118590.orig.2019040216471862.jpg",
            "ItemThumbnailURL": "https://s3-ap-southeast-2.amazonaws.com/openchargemap/images/IT/OCM118590/OCM-118590.thmb.2019040216471862.jpg",
            "Comment": "",
            "IsEnabled": true,
            "IsVideo": false,
            "IsFeaturedItem": false,
            "IsExternalResource": false,
            "User": {
                "ID": 19496,
                "Username": "ECOGY"
            },
            "DateCreated": "2019-04-02T16:47:00Z"
        },
        {
            "ID": 17950,
            "ChargePointID": 118590,
            "ItemURL": "https://s3-ap-southeast-2.amazonaws.com/openchargemap/images/IT/OCM118590/OCM-118590.orig.2019040216445016.jpg",
            "ItemThumbnailURL": "https://s3-ap-southeast-2.amazonaws.com/openchargemap/images/IT/OCM118590/OCM-118590.thmb.2019040216445016.jpg",
            "Comment": "",
            "IsEnabled": true,
            "IsVideo": false,
            "IsFeaturedItem": false,
            "IsExternalResource": false,
            "User": {
                "ID": 19496,
                "Username": "ECOGY"
            },
            "DateCreated": "2019-04-02T16:45:00Z"
        }
    ],
    "IsRecentlyVerified": false,
    "ID": 118590,
    "UUID": "23BF430D-94A0-4AC8-A284-24771C36C8EE",
    "DataProviderID": 1,
    "OperatorID": 45,
    "UsageTypeID": 1,
    "UsageCost": "30 cent /kWh",
    "AddressInfo": {
        "ID": 118936,
        "Title": "Hotel Arvina ***S",
        "AddressLine1": "Patenerweg - Via Paten 4",
        "Town": "Seis",
        "StateOrProvince": "Bozen",
        "Postcode": "39040",
        "CountryID": 112,
        "Latitude": 46.5482048915436,
        "Longitude": 11.5717609856821,
        "ContactTelephone1": " +39 0471 706436 ",
        "ContactEmail": "info@hotelarvina.com",
        "AccessComments": "Für Hotelkunden mittels RFID Karte",
        "RelatedURL": "https://www.hotelarvina.com",
        "DistanceUnit": 0
    },
    "Connections": [
        {
            "ID": 167727,
            "ConnectionTypeID": 25,
            "StatusTypeID": 50,
            "LevelID": 2,
            "Amps": 13,
            "Voltage": 400,
            "PowerKW": 9,
            "CurrentTypeID": 20,
            "Quantity": 1
        }
    ],
    "NumberOfPoints": 1,
    "GeneralComments": "Die Ladestation befindet sich auf dem Kunden Parkplatz",
    "StatusTypeID": 50,
    "DateLastStatusUpdate": "2019-04-02T16:47:00Z",
    "DataQualityLevel": 1,
    "DateCreated": "2019-03-26T14:31:00Z",
    "SubmissionStatusTypeID": 200
}