{
    "IsRecentlyVerified": false,
    "ID": 183676,
    "UUID": "BAF41857-6AFD-49BE-8047-62F36DB986B3",
    "DataProviderID": 29,
    "DataProvidersReference": "11242,4250,343",
    "AddressInfo": {
        "ID": 184035,
        "Title": "Loddenheide 5",
        "AddressLine1": "Loddenheide 5",
        "Town": "Münster",
        "Postcode": "48155",
        "CountryID": 87,
        "Latitude": 51.938871,
        "Longitude": 7.646728,
        "DistanceUnit": 0
    },
    "Connections": [
        {
            "ID": 290946,
            "ConnectionTypeID": 25,
            "StatusTypeID": 50,
            "LevelID": 2,
            "PowerKW": 22,
            "CurrentTypeID": 20
        },
        {
            "ID": 290947,
            "ConnectionTypeID": 25,
            "StatusTypeID": 50,
            "LevelID": 2,
            "PowerKW": 22,
            "CurrentTypeID": 20
        },
        {
            "ID": 290948,
            "ConnectionTypeID": 25,
            "StatusTypeID": 50,
            "LevelID": 2,
            "PowerKW": 22,
            "CurrentTypeID": 20
        },
        {
            "ID": 290949,
            "ConnectionTypeID": 25,
            "StatusTypeID": 50,
            "LevelID": 2,
            "PowerKW": 22,
            "CurrentTypeID": 20
        },
        {
            "ID": 290950,
            "ConnectionTypeID": 25,
            "StatusTypeID": 50,
            "LevelID": 2,
            "PowerKW": 22,
            "CurrentTypeID": 20
        },
        {
            "ID": 290951,
            "ConnectionTypeID": 25,
            "StatusTypeID": 50,
            "LevelID": 2,
            "PowerKW": 22,
            "CurrentTypeID": 20
        }
    ],
    "StatusTypeID": 50,
    "DateLastStatusUpdate": "2021-07-09T03:25:00Z",
    "MetadataValues": [
        {
            "ID": 15969,
            "MetadataFieldID": 4,
            "ItemValue": "Data from the German chargepoint registry provided by Bundesnetzagentur.de under the CC-BY 4.0 license"
        }
    ],
    "DataQualityLevel": 3,
    "DateCreated": "2021-07-08T10:04:00Z",
    "SubmissionStatusTypeID": 100
}