{
    "IsRecentlyVerified": false,
    "ID": 112699,
    "UUID": "7D85D381-355B-40A0-8767-B9A4BEA807A0",
    "DataProviderID": 1,
    "OperatorID": 32,
    "OperatorsReference": "11150",
    "UsageTypeID": 4,
    "UsageCost": "£0.108/kWh; for Polar Plus subscription members only",
    "AddressInfo": {
        "ID": 113045,
        "Title": "Aldi Stores LTD",
        "AddressLine1": "Aldi Stores LTD",
        "Town": "Church Street",
        "StateOrProvince": "Dunstable",
        "Postcode": "LU5 4RP",
        "CountryID": 1,
        "Latitude": 51.887604,
        "Longitude": -0.518672,
        "DistanceUnit": 0
    },
    "Connections": [
        {
            "ID": 158684,
            "ConnectionTypeID": 25,
            "StatusTypeID": 50,
            "LevelID": 2,
            "Amps": 32,
            "Voltage": 230,
            "PowerKW": 7,
            "CurrentTypeID": 10,
            "Quantity": 2
        }
    ],
    "NumberOfPoints": 2,
    "GeneralComments": "Unit located in the car park extension.",
    "StatusTypeID": 50,
    "DateLastStatusUpdate": "2019-06-05T05:19:00Z",
    "DataQualityLevel": 1,
    "DateCreated": "2018-11-10T06:14:00Z",
    "SubmissionStatusTypeID": 200
}