{
    "IsRecentlyVerified": false,
    "ID": 18938,
    "UUID": "E21BEEA0-3FA8-4B19-A2A1-E9DFC96C8E30",
    "DataProviderID": 15,
    "DataProvidersReference": "34610",
    "OperatorID": 1,
    "UsageTypeID": 1,
    "AddressInfo": {
        "ID": 19283,
        "Title": "315 Platte River Drive",
        "AddressLine1": "315 Platte River Drive",
        "Town": "Gothenburg",
        "StateOrProvince": "NE",
        "Postcode": "69138",
        "CountryID": 2,
        "Latitude": 40.91785,
        "Longitude": -100.17048,
        "ContactTelephone1": "(308) 537-7378",
        "RelatedURL": "http://carstations.com/34610",
        "DistanceUnit": 0
    },
    "Connections": [
        {
            "ID": 19196,
            "ConnectionTypeID": 1,
            "Reference": "J1772",
            "LevelID": 2
        }
    ],
    "NumberOfPoints": 1,
    "StatusTypeID": 50,
    "DateLastStatusUpdate": "2017-11-04T14:04:00Z",
    "DataQualityLevel": 2,
    "DateCreated": "2013-09-01T03:34:00Z",
    "SubmissionStatusTypeID": 200
}