{
    "IsRecentlyVerified": false,
    "ID": 4434,
    "UUID": "51ADF95F-58C4-495E-859A-D5F3A40614A6",
    "DataProviderID": 1,
    "OperatorID": 1,
    "AddressInfo": {
        "ID": 4405,
        "Title": "Manchester Square",
        "AddressLine1": "Manchester Square",
        "AddressLine2": "Westminster",
        "Town": "London",
        "Postcode": "W1U 3PB",
        "CountryID": 1,
        "Latitude": 51.517068,
        "Longitude": -0.152821,
        "ContactTelephone1": "020 7402 5916",
        "DistanceUnit": 0
    },
    "Connections": [],
    "GeneralComments": "Register for Eco-mark scheme first - see website for details - Annual fee entitles use of SWELTRAC borough points",
    "StatusTypeID": 50,
    "DateLastStatusUpdate": "2011-05-17T17:23:00Z",
    "DateCreated": "2011-05-17T17:23:00Z",
    "SubmissionStatusTypeID": 200
}