{
    "IsRecentlyVerified": false,
    "ID": 160546,
    "UUID": "45540638-906A-4703-A6C7-47199AB00E1D",
    "DataProviderID": 2,
    "DataProvidersReference": "158320",
    "UsageTypeID": 1,
    "AddressInfo": {
        "ID": 160903,
        "Title": "NB Power Corporation",
        "AddressLine1": "Route 2",
        "Town": "St.André",
        "StateOrProvince": "NB",
        "Postcode": "E3Y 3H7",
        "CountryID": 44,
        "Latitude": 47.08949,
        "Longitude": -67.83122,
        "ContactTelephone1": "",
        "AccessComments": "24 hours daily",
        "RelatedURL": "",
        "DistanceUnit": 0
    },
    "Connections": [
        {
            "ID": 231007,
            "ConnectionTypeID": 2,
            "LevelID": 3,
            "Amps": 100,
            "Voltage": 400,
            "PowerKW": 40,
            "CurrentTypeID": 30,
            "Quantity": 1
        }
    ],
    "StatusTypeID": 50,
    "DateLastStatusUpdate": "2020-06-26T03:10:00Z",
    "DataQualityLevel": 3,
    "DateCreated": "2020-06-26T03:10:00Z",
    "SubmissionStatusTypeID": 100
}