{
    "IsRecentlyVerified": false,
    "ID": 185350,
    "UUID": "BD9F9CF8-9E65-4518-A3F3-D5AF71CD6D77",
    "DataProviderID": 29,
    "DataProvidersReference": "5121",
    "OperatorID": 165,
    "AddressInfo": {
        "ID": 185709,
        "Title": "Rudolf Dieselstraße 16",
        "AddressLine1": "Rudolf Dieselstraße 16",
        "Town": "Neu-Anspach",
        "Postcode": "61267",
        "CountryID": 87,
        "Latitude": 50.307244,
        "Longitude": 8.515749,
        "DistanceUnit": 0
    },
    "Connections": [
        {
            "ID": 294729,
            "ConnectionTypeID": 25,
            "StatusTypeID": 50,
            "LevelID": 2,
            "PowerKW": 22,
            "CurrentTypeID": 20
        },
        {
            "ID": 294730,
            "ConnectionTypeID": 25,
            "StatusTypeID": 50,
            "LevelID": 2,
            "PowerKW": 22,
            "CurrentTypeID": 20
        }
    ],
    "StatusTypeID": 50,
    "DateLastStatusUpdate": "2021-07-12T02:44:00Z",
    "MetadataValues": [
        {
            "ID": 17641,
            "MetadataFieldID": 4,
            "ItemValue": "Data from the German chargepoint registry provided by Bundesnetzagentur.de under the CC-BY 4.0 license"
        }
    ],
    "DataQualityLevel": 3,
    "DateCreated": "2021-07-08T10:06:00Z",
    "SubmissionStatusTypeID": 100
}