{
    "IsRecentlyVerified": false,
    "ID": 173289,
    "UUID": "0D938ADA-AF3B-4092-A935-AD8CF5B57090",
    "DataProviderID": 19,
    "DataProvidersReference": "7336",
    "AddressInfo": {
        "ID": 173648,
        "Title": "Storgata",
        "AddressLine1": "Storgata 13",
        "Town": "RØRVIK",
        "StateOrProvince": "Trøndelag",
        "Postcode": "7900",
        "CountryID": 168,
        "Latitude": 64.86287,
        "Longitude": 11.23773,
        "AccessComments": "",
        "DistanceUnit": 0
    },
    "Connections": [
        {
            "ID": 266180,
            "ConnectionTypeID": 33,
            "Reference": "1",
            "LevelID": 3,
            "Amps": 100,
            "Voltage": 500,
            "PowerKW": 50,
            "CurrentTypeID": 30,
            "Comments": "Mode 3"
        },
        {
            "ID": 266181,
            "ConnectionTypeID": 2,
            "Reference": "2",
            "LevelID": 3,
            "Amps": 100,
            "Voltage": 500,
            "PowerKW": 50,
            "CurrentTypeID": 30
        },
        {
            "ID": 266182,
            "ConnectionTypeID": 25,
            "Reference": "3",
            "LevelID": 3,
            "Amps": 32,
            "Voltage": 400,
            "PowerKW": 22,
            "CurrentTypeID": 30
        }
    ],
    "NumberOfPoints": 3,
    "StatusTypeID": 0,
    "DateLastStatusUpdate": "2021-03-24T05:12:00Z",
    "DataQualityLevel": 2,
    "DateCreated": "2021-03-03T09:03:00Z",
    "SubmissionStatusTypeID": 100
}