{
    "IsRecentlyVerified": false,
    "ID": 182148,
    "UUID": "F6C5352F-A610-4E1C-8929-86DAFA9E0072",
    "DataProviderID": 29,
    "DataProvidersReference": "318",
    "AddressInfo": {
        "ID": 182507,
        "Title": "Röthaer Straße Parkplatz",
        "AddressLine1": "Röthaer Straße Parkplatz",
        "Town": "Borna",
        "Postcode": "04552",
        "CountryID": 87,
        "Latitude": 51.12817,
        "Longitude": 12.49965,
        "DistanceUnit": 0
    },
    "Connections": [
        {
            "ID": 287535,
            "ConnectionTypeID": 25,
            "StatusTypeID": 50,
            "LevelID": 2,
            "PowerKW": 11,
            "CurrentTypeID": 20
        },
        {
            "ID": 287536,
            "ConnectionTypeID": 25,
            "StatusTypeID": 50,
            "LevelID": 2,
            "PowerKW": 11,
            "CurrentTypeID": 20
        }
    ],
    "StatusTypeID": 50,
    "DateLastStatusUpdate": "2021-07-09T03:22:00Z",
    "MetadataValues": [
        {
            "ID": 14442,
            "MetadataFieldID": 4,
            "ItemValue": "Data from the German chargepoint registry provided by Bundesnetzagentur.de under the CC-BY 4.0 license"
        }
    ],
    "DataQualityLevel": 3,
    "DateCreated": "2021-07-08T10:02:00Z",
    "SubmissionStatusTypeID": 100
}