{
    "IsRecentlyVerified": false,
    "ID": 104168,
    "UUID": "8F7F875F-C3D3-4D1A-9A01-F1248E72021C",
    "DataProviderID": 1,
    "OperatorID": 80,
    "UsageTypeID": 4,
    "AddressInfo": {
        "ID": 104514,
        "Title": "EnelX Cefalù Cirincione",
        "AddressLine1": "Via Vincenzo Cirincione",
        "Town": "Cefalù",
        "StateOrProvince": "PA",
        "Postcode": "90015",
        "CountryID": 112,
        "Latitude": 38.0312590164459,
        "Longitude": 14.0206813174981,
        "RelatedURL": "https://www.eneldive.it",
        "DistanceUnit": 0
    },
    "Connections": [
        {
            "ID": 147102,
            "ConnectionTypeID": 25,
            "StatusTypeID": 50,
            "LevelID": 2,
            "Amps": 32,
            "Voltage": 400,
            "PowerKW": 22,
            "CurrentTypeID": 20,
            "Quantity": 2
        }
    ],
    "NumberOfPoints": 2,
    "StatusTypeID": 50,
    "DateLastStatusUpdate": "2018-08-29T12:55:00Z",
    "DataQualityLevel": 1,
    "DateCreated": "2018-05-16T19:34:00Z",
    "SubmissionStatusTypeID": 200
}