{
    "IsRecentlyVerified": false,
    "ID": 177374,
    "UUID": "22E487D3-24D3-4100-BAEF-BC0801831426",
    "DataProviderID": 29,
    "DataProvidersReference": "18578",
    "AddressInfo": {
        "ID": 177733,
        "Title": "Im Königsesch 30",
        "AddressLine1": "Im Königsesch 30",
        "Town": "Bocholt",
        "Postcode": "46395",
        "CountryID": 87,
        "Latitude": 51.827716,
        "Longitude": 6.630303,
        "DistanceUnit": 0
    },
    "Connections": [
        {
            "ID": 276448,
            "ConnectionTypeID": 33,
            "StatusTypeID": 50,
            "LevelID": 3,
            "PowerKW": 22,
            "CurrentTypeID": 30
        },
        {
            "ID": 276449,
            "ConnectionTypeID": 25,
            "StatusTypeID": 50,
            "LevelID": 2,
            "PowerKW": 11,
            "CurrentTypeID": 20
        }
    ],
    "StatusTypeID": 0,
    "DateLastStatusUpdate": "2021-07-12T02:48:00Z",
    "MetadataValues": [
        {
            "ID": 9668,
            "MetadataFieldID": 4,
            "ItemValue": "Data from the German chargepoint registry provided by Bundesnetzagentur.de under the CC-BY 4.0 license"
        }
    ],
    "DataQualityLevel": 3,
    "DateCreated": "2021-07-08T09:49:00Z",
    "SubmissionStatusTypeID": 100
}