{
    "IsRecentlyVerified": false,
    "ID": 38125,
    "UUID": "C709D5A9-584F-4ABF-BE83-F7498008EAE7",
    "DataProviderID": 26,
    "DataProvidersReference": "57877",
    "OperatorID": 73,
    "OperatorsReference": "EV-Box EVB-P1413127",
    "UsageCost": "0.00 jaarabonnement",
    "AddressInfo": {
        "ID": 38471,
        "Title": "Kalkwijk 5",
        "AddressLine1": "Kalkwijk 5",
        "Town": "Twenterand",
        "Postcode": "7681 DV",
        "CountryID": 159,
        "Latitude": 52.44881,
        "Longitude": 6.57768,
        "RelatedURL": "http://www.ev-box.nl",
        "DistanceUnit": 0
    },
    "Connections": [
        {
            "ID": 41636,
            "ConnectionTypeID": 25,
            "LevelID": 2,
            "PowerKW": 11,
            "CurrentTypeID": 10
        },
        {
            "ID": 49486,
            "ConnectionTypeID": 25,
            "LevelID": 2,
            "PowerKW": 11,
            "CurrentTypeID": 10
        }
    ],
    "NumberOfPoints": 1,
    "StatusTypeID": 50,
    "DateLastStatusUpdate": "2016-06-04T02:54:00Z",
    "DataQualityLevel": 3,
    "DateCreated": "2015-01-09T06:07:00Z",
    "SubmissionStatusTypeID": 100
}