{
    "IsRecentlyVerified": false,
    "ID": 109038,
    "UUID": "27032605-7BBA-4EC1-866D-48148347036C",
    "DataProviderID": 1,
    "OperatorID": 23,
    "OperatorsReference": "44582",
    "UsageTypeID": 4,
    "AddressInfo": {
        "ID": 109384,
        "Title": "Weingut Schloss Gobelsburg",
        "AddressLine1": "Schlossstr. 16 16",
        "Town": "Gobelsburg",
        "Postcode": "3550",
        "CountryID": 19,
        "Latitude": 48.461037,
        "Longitude": 15.69598,
        "ContactTelephone1": "+43 2734 2422",
        "DistanceUnit": 0
    },
    "Connections": [
        {
            "ID": 154156,
            "ConnectionTypeID": 30,
            "StatusTypeID": 50,
            "LevelID": 2,
            "Amps": 16,
            "Voltage": 400,
            "PowerKW": 11,
            "CurrentTypeID": 20,
            "Quantity": 1
        }
    ],
    "NumberOfPoints": 1,
    "GeneralComments": "1 Tesla Connector, up to 11kW.Available for customers. Please see front desk.",
    "StatusTypeID": 50,
    "DateLastStatusUpdate": "2018-10-11T13:25:00Z",
    "DataQualityLevel": 1,
    "DateCreated": "2018-10-11T13:25:00Z",
    "SubmissionStatusTypeID": 200
}