{
    "IsRecentlyVerified": false,
    "ID": 135886,
    "UUID": "C4318A8C-8500-4930-8B76-1F02E067E219",
    "DataProviderID": 18,
    "DataProvidersReference": "22872122c6be252e15c87a7da83312a5",
    "OperatorID": 2244,
    "UsageTypeID": 5,
    "AddressInfo": {
        "ID": 136232,
        "Title": "Clapham Manor Street",
        "AddressLine1": "Clapham Manor Street",
        "Town": "London",
        "Postcode": "SW4 6DU",
        "CountryID": 1,
        "Latitude": 51.467161,
        "Longitude": -0.137023,
        "AccessComments": "",
        "RelatedURL": "https://www.ubitricity.com",
        "DistanceUnit": 0
    },
    "Connections": [
        {
            "ID": 190307,
            "ConnectionTypeID": 25,
            "Reference": "suby1100000553",
            "StatusTypeID": 50,
            "LevelID": 2,
            "Amps": 16,
            "Voltage": 230,
            "PowerKW": 3.7,
            "CurrentTypeID": 10
        }
    ],
    "StatusTypeID": 0,
    "DateLastStatusUpdate": "2021-04-25T05:46:00Z",
    "MetadataValues": [
        {
            "ID": 5738,
            "MetadataFieldID": 4,
            "ItemValue": "Contains public sector information licensed under the Open Government Licence v2.0. http://www.nationalarchives.gov.uk/doc/open-government-licence/version/2/"
        }
    ],
    "DataQualityLevel": 3,
    "DateCreated": "2019-12-24T05:22:00Z",
    "SubmissionStatusTypeID": 100
}