{
    "IsRecentlyVerified": false,
    "ID": 153520,
    "UUID": "0980F79F-EA88-4E4A-A26C-C79586B4C3F5",
    "DataProviderID": 28,
    "DataProvidersReference": "FRS29PSDE29FIFI",
    "OperatorID": 3379,
    "UsageTypeID": 5,
    "AddressInfo": {
        "ID": 153873,
        "Title": "Crozon - Morgat",
        "AddressLine1": "Morgat - 29042 Crozon",
        "CountryID": 80,
        "Latitude": 48.225799,
        "Longitude": -4.506578,
        "AccessComments": "24/24_7/7",
        "DistanceUnit": 0
    },
    "Connections": [
        {
            "ID": 215422,
            "ConnectionTypeID": 1036,
            "StatusTypeID": 50,
            "LevelID": 2,
            "PowerKW": 22,
            "CurrentTypeID": 20
        },
        {
            "ID": 215423,
            "ConnectionTypeID": 28,
            "StatusTypeID": 50,
            "LevelID": 2,
            "PowerKW": 22,
            "CurrentTypeID": 10
        },
        {
            "ID": 248909,
            "ConnectionTypeID": 1036,
            "StatusTypeID": 50,
            "LevelID": 2,
            "PowerKW": 22,
            "CurrentTypeID": 20
        },
        {
            "ID": 248910,
            "ConnectionTypeID": 28,
            "StatusTypeID": 50,
            "LevelID": 2,
            "PowerKW": 22,
            "CurrentTypeID": 10
        }
    ],
    "GeneralComments": "",
    "StatusTypeID": 50,
    "DateLastStatusUpdate": "2020-08-27T05:14:00Z",
    "DataQualityLevel": 2,
    "DateCreated": "2020-03-15T10:54:00Z",
    "SubmissionStatusTypeID": 100
}