{
    "IsRecentlyVerified": false,
    "ID": 187029,
    "UUID": "1CD0E9E4-3F3E-419D-A772-30E78BF6D880",
    "DataProviderID": 29,
    "DataProvidersReference": "8780",
    "OperatorID": 189,
    "AddressInfo": {
        "ID": 187388,
        "Title": "Samurerplatz",
        "AddressLine1": "Samurerplatz",
        "Town": "Verden",
        "Postcode": "27283",
        "CountryID": 87,
        "Latitude": 52.923774,
        "Longitude": 9.257297,
        "DistanceUnit": 0
    },
    "Connections": [
        {
            "ID": 300997,
            "ConnectionTypeID": 25,
            "StatusTypeID": 50,
            "LevelID": 2,
            "PowerKW": 22,
            "CurrentTypeID": 20
        },
        {
            "ID": 300998,
            "ConnectionTypeID": 25,
            "StatusTypeID": 50,
            "LevelID": 2,
            "PowerKW": 22,
            "CurrentTypeID": 20
        }
    ],
    "StatusTypeID": 50,
    "DateLastStatusUpdate": "2021-07-12T02:50:00Z",
    "MetadataValues": [
        {
            "ID": 19269,
            "MetadataFieldID": 4,
            "ItemValue": "Data from the German chargepoint registry provided by Bundesnetzagentur.de under the CC-BY 4.0 license"
        }
    ],
    "DataQualityLevel": 3,
    "DateCreated": "2021-07-12T02:50:00Z",
    "SubmissionStatusTypeID": 100
}