{
    "IsRecentlyVerified": false,
    "ID": 100604,
    "UUID": "24379F6D-1085-48D9-8D69-A3C189FF683F",
    "DataProviderID": 1,
    "OperatorID": 23,
    "OperatorsReference": "41125",
    "UsageTypeID": 4,
    "AddressInfo": {
        "ID": 100950,
        "Title": "Alsuper Freshmarket San Patricio",
        "AddressLine1": "Blvd. Eulaliio Gutierrez Trevino 1890 Fracc. San Patricio",
        "Town": "Saltillo",
        "StateOrProvince": "Coahuila",
        "CountryID": 146,
        "Latitude": 25.458202,
        "Longitude": -100.954451,
        "DistanceUnit": 0
    },
    "Connections": [
        {
            "ID": 142096,
            "ConnectionTypeID": 30,
            "StatusTypeID": 50,
            "LevelID": 2,
            "PowerKW": 18,
            "CurrentTypeID": 20,
            "Quantity": 2
        }
    ],
    "NumberOfPoints": 2,
    "GeneralComments": "2 Tesla Connectors, up to 18kW.Available to the public. Self park.",
    "StatusTypeID": 50,
    "DateLastStatusUpdate": "2018-03-02T06:56:00Z",
    "DataQualityLevel": 1,
    "DateCreated": "2018-03-02T06:56:00Z",
    "SubmissionStatusTypeID": 200
}