{
    "IsRecentlyVerified": false,
    "ID": 101958,
    "UUID": "0AD90410-5E6E-4977-8666-48E5D9A6D761",
    "DataProviderID": 1,
    "OperatorID": 23,
    "OperatorsReference": "42179",
    "UsageTypeID": 6,
    "AddressInfo": {
        "ID": 102304,
        "Title": "Hotel Campagnola",
        "AddressLine1": "Via S. Tomaso",
        "Town": "11",
        "StateOrProvince": "Riva del Garda",
        "Postcode": "38066",
        "CountryID": 112,
        "Latitude": 45.902075,
        "Longitude": 10.859299,
        "ContactTelephone1": "+39 046 452 1103",
        "DistanceUnit": 0
    },
    "Connections": [
        {
            "ID": 143941,
            "ConnectionTypeID": 30,
            "StatusTypeID": 50,
            "LevelID": 2,
            "Amps": 32,
            "Voltage": 400,
            "PowerKW": 22,
            "CurrentTypeID": 20,
            "Quantity": 1
        }
    ],
    "NumberOfPoints": 1,
    "GeneralComments": "1 Tesla Connector, up to 22kW.Available for patrons only. Please call ahead.",
    "StatusTypeID": 50,
    "DateLastStatusUpdate": "2018-10-03T23:39:00Z",
    "DataQualityLevel": 1,
    "DateCreated": "2018-04-16T04:43:00Z",
    "SubmissionStatusTypeID": 200
}