{
    "IsRecentlyVerified": false,
    "ID": 17078,
    "UUID": "5E8BE9FA-480C-402F-BE69-91E2E9D9E093",
    "DataProviderID": 22,
    "DataProvidersReference": "57574E4F5E30961F96C7E320BF15A5DD",
    "AddressInfo": {
        "ID": 17423,
        "Title": "日産サティオ千葉　成田店",
        "AddressLine1": "千葉県成田市並木町220-2",
        "CountryID": 114,
        "Latitude": 35.75119552,
        "Longitude": 140.3078979,
        "ContactTelephone1": "0476-22-0193",
        "DistanceUnit": 0
    },
    "Connections": [
        {
            "ID": 17319,
            "ConnectionTypeID": 2,
            "LevelID": 2,
            "Amps": 100,
            "Voltage": 480,
            "PowerKW": 48,
            "Quantity": 1
        }
    ],
    "DateLastStatusUpdate": "2013-06-29T08:53:00Z",
    "DataQualityLevel": 2,
    "DateCreated": "2013-06-29T08:53:00Z",
    "SubmissionStatusTypeID": 200
}