{
    "IsRecentlyVerified": false,
    "ID": 113783,
    "UUID": "7385861D-9F63-4455-929E-69F7CCBD0F8E",
    "DataProviderID": 1,
    "OperatorID": 23,
    "OperatorsReference": "46718",
    "UsageTypeID": 4,
    "AddressInfo": {
        "ID": 114129,
        "Title": "Landhotel Restaurant Krone",
        "AddressLine1": "Hauptstrasse 40 40",
        "Town": "Oberreute",
        "Postcode": "88179",
        "CountryID": 87,
        "Latitude": 47.562351,
        "Longitude": 9.942155,
        "ContactTelephone1": " +49 8387 2536",
        "DistanceUnit": 0
    },
    "Connections": [
        {
            "ID": 160353,
            "ConnectionTypeID": 30,
            "StatusTypeID": 50,
            "LevelID": 2,
            "Amps": 16,
            "Voltage": 400,
            "PowerKW": 11,
            "CurrentTypeID": 20,
            "Quantity": 1
        }
    ],
    "NumberOfPoints": 1,
    "GeneralComments": "1 Tesla Connector, up to 11kW.Available for customers. Please see front desk.",
    "StatusTypeID": 50,
    "DateLastStatusUpdate": "2019-01-02T21:34:00Z",
    "DataQualityLevel": 1,
    "DateCreated": "2019-01-02T21:34:00Z",
    "SubmissionStatusTypeID": 200
}