{
    "IsRecentlyVerified": false,
    "ID": 121191,
    "UUID": "69976CBD-6B13-4007-957A-2D03F5938D0E",
    "DataProviderID": 2,
    "DataProvidersReference": "118431",
    "OperatorID": 39,
    "UsageTypeID": 4,
    "AddressInfo": {
        "ID": 121537,
        "Title": "Crest Condo",
        "AddressLine1": "6107 Fairview Farm Dr",
        "Town": "Alexandria",
        "StateOrProvince": "VA",
        "Postcode": "22315",
        "CountryID": 2,
        "Latitude": 38.7575167,
        "Longitude": -77.1312586,
        "ContactTelephone1": "800-663-5633",
        "AccessComments": "MO: Not Specified; TU: Not Specified; WE: Not Specified; TH: Not Specified; FR: Not Specified; SA: Not Specified; SU: Not Specified",
        "RelatedURL": "http://www.semacharge.com/",
        "DistanceUnit": 0
    },
    "Connections": [
        {
            "ID": 170628,
            "ConnectionTypeID": 1,
            "LevelID": 2,
            "Amps": 16,
            "Voltage": 230,
            "PowerKW": 3,
            "CurrentTypeID": 10,
            "Quantity": 2
        }
    ],
    "DateLastStatusUpdate": "2019-04-01T04:59:00Z",
    "DataQualityLevel": 3,
    "DateCreated": "2019-04-01T04:59:00Z",
    "SubmissionStatusTypeID": 100
}