{
    "IsRecentlyVerified": false,
    "ID": 142644,
    "UUID": "662872EF-5EAE-485A-A133-42F7FD275F16",
    "DataProviderID": 2,
    "DataProvidersReference": "145515",
    "OperatorID": 5,
    "UsageTypeID": 1,
    "AddressInfo": {
        "ID": 142996,
        "Title": "WCL",
        "AddressLine1": "2039 W 4000 S",
        "Town": "Roy",
        "StateOrProvince": "UT",
        "Postcode": "84067",
        "CountryID": 2,
        "Latitude": 41.1900911,
        "Longitude": -112.0291714,
        "ContactTelephone1": "888-758-4389",
        "AccessComments": "24 hours daily",
        "RelatedURL": "http://www.chargepoint.com/",
        "DistanceUnit": 0
    },
    "Connections": [
        {
            "ID": 198822,
            "ConnectionTypeID": 1,
            "LevelID": 2,
            "Amps": 16,
            "Voltage": 230,
            "PowerKW": 3.7,
            "CurrentTypeID": 10,
            "Quantity": 2
        }
    ],
    "StatusTypeID": 50,
    "DateLastStatusUpdate": "2020-06-26T03:04:00Z",
    "DataQualityLevel": 3,
    "DateCreated": "2019-12-24T09:18:00Z",
    "SubmissionStatusTypeID": 100
}