{
    "IsRecentlyVerified": false,
    "ID": 102007,
    "UUID": "D6E7AB1B-8CB3-4C33-A0D8-CD71016B3DDF",
    "DataProviderID": 1,
    "OperatorID": 23,
    "OperatorsReference": "42224",
    "UsageTypeID": 6,
    "AddressInfo": {
        "ID": 102353,
        "Title": "Memmo Baleeira Hotel Sagres",
        "AddressLine1": "Sítio Da Baleeira",
        "Town": "Sagres",
        "StateOrProvince": "Sagres",
        "Postcode": "8650-357",
        "CountryID": 180,
        "Latitude": 37.010962184922974,
        "Longitude": -8.931828762061059,
        "ContactTelephone1": "+351 282 624 212",
        "AccessComments": "Only for customers",
        "DistanceUnit": 0
    },
    "Connections": [
        {
            "ID": 143990,
            "ConnectionTypeID": 30,
            "StatusTypeID": 50,
            "LevelID": 2,
            "Amps": 32,
            "Voltage": 400,
            "PowerKW": 22,
            "CurrentTypeID": 20,
            "Quantity": 1
        }
    ],
    "NumberOfPoints": 1,
    "GeneralComments": "1 Tesla Connector + 1 Type 2 Connector, up to 22kW.Available for customers. Please see front desk.",
    "StatusTypeID": 50,
    "DateLastStatusUpdate": "2020-08-06T18:39:00Z",
    "DataQualityLevel": 1,
    "DateCreated": "2018-04-16T04:54:00Z",
    "SubmissionStatusTypeID": 200
}