{
    "IsRecentlyVerified": false,
    "ID": 158967,
    "UUID": "7855141A-95CB-4ED5-BFE5-54B984FEA5D6",
    "DataProviderID": 2,
    "DataProvidersReference": "155046",
    "OperatorID": 3372,
    "UsageTypeID": 2,
    "AddressInfo": {
        "ID": 159324,
        "Title": "The Commons at Valencia",
        "AddressLine1": "25152 Springfield Ct",
        "Town": "Santa Clarita",
        "StateOrProvince": "CA",
        "Postcode": "91355",
        "CountryID": 2,
        "Latitude": 34.4107635,
        "Longitude": -118.5760594,
        "ContactTelephone1": "",
        "AccessComments": "24 hours daily; Also accepts Paypal",
        "RelatedURL": "http://evconnect.com/",
        "DistanceUnit": 0
    },
    "Connections": [
        {
            "ID": 229006,
            "ConnectionTypeID": 1,
            "LevelID": 2,
            "Amps": 16,
            "Voltage": 230,
            "PowerKW": 3.7,
            "CurrentTypeID": 10,
            "Quantity": 6
        }
    ],
    "StatusTypeID": 50,
    "DateLastStatusUpdate": "2020-06-26T02:57:00Z",
    "DataQualityLevel": 3,
    "DateCreated": "2020-06-26T02:57:00Z",
    "SubmissionStatusTypeID": 100
}