{
    "IsRecentlyVerified": false,
    "ID": 101714,
    "UUID": "E0A8B32C-F0D4-4271-A2AE-22BD235716D0",
    "DataProviderID": 1,
    "OperatorID": 1,
    "UsageTypeID": 0,
    "AddressInfo": {
        "ID": 102060,
        "Title": " Comune di Conegliano - Via Kennedy",
        "AddressLine1": "Via John Fitzgerald Kennedy",
        "Town": "Conegliano ",
        "StateOrProvince": "TV",
        "Postcode": "31015",
        "CountryID": 112,
        "Latitude": 45.89006911131731,
        "Longitude": 12.306495277176396,
        "DistanceUnit": 0
    },
    "Connections": [
        {
            "ID": 143578,
            "ConnectionTypeID": 25,
            "StatusTypeID": 150,
            "LevelID": 2,
            "Quantity": 1
        }
    ],
    "NumberOfPoints": 1,
    "StatusTypeID": 150,
    "DateLastStatusUpdate": "2018-04-05T13:51:00Z",
    "DataQualityLevel": 1,
    "DateCreated": "2018-04-05T13:51:00Z",
    "SubmissionStatusTypeID": 200
}