{
    "IsRecentlyVerified": false,
    "ID": 178492,
    "UUID": "C2908D86-31F1-427C-9004-0DCB4CC3FD17",
    "DataProviderID": 29,
    "DataProvidersReference": "12032",
    "OperatorID": 45,
    "AddressInfo": {
        "ID": 178851,
        "Title": "Aubachstraße 77",
        "AddressLine1": "Aubachstraße 77",
        "Town": "Neuwied-Niederbieber",
        "Postcode": "56567",
        "CountryID": 87,
        "Latitude": 50.463861,
        "Longitude": 7.480491,
        "DistanceUnit": 0
    },
    "Connections": [
        {
            "ID": 278986,
            "ConnectionTypeID": 25,
            "StatusTypeID": 50,
            "LevelID": 2,
            "PowerKW": 22,
            "CurrentTypeID": 20
        },
        {
            "ID": 278987,
            "ConnectionTypeID": 25,
            "StatusTypeID": 50,
            "LevelID": 2,
            "PowerKW": 22,
            "CurrentTypeID": 20
        }
    ],
    "StatusTypeID": 0,
    "DateLastStatusUpdate": "2021-07-12T02:45:00Z",
    "MetadataValues": [
        {
            "ID": 10786,
            "MetadataFieldID": 4,
            "ItemValue": "Data from the German chargepoint registry provided by Bundesnetzagentur.de under the CC-BY 4.0 license"
        }
    ],
    "DataQualityLevel": 3,
    "DateCreated": "2021-07-08T09:50:00Z",
    "SubmissionStatusTypeID": 100
}