{
    "IsRecentlyVerified": false,
    "ID": 123302,
    "UUID": "6DFFFE08-7950-4BDA-8C5B-AA112874FF07",
    "DataProviderID": 2,
    "DataProvidersReference": "60489",
    "OperatorID": 5,
    "UsageTypeID": 1,
    "AddressInfo": {
        "ID": 123648,
        "Title": "SIMON",
        "AddressLine1": "7400 S Las Vegas Blvd",
        "Town": "Las Vegas",
        "StateOrProvince": "NV",
        "Postcode": "89123",
        "CountryID": 2,
        "Latitude": 36.055168,
        "Longitude": -115.172058,
        "ContactTelephone1": "888-758-4389",
        "AccessComments": "24 hours daily",
        "RelatedURL": "http://www.chargepoint.com/",
        "DistanceUnit": 0
    },
    "Connections": [
        {
            "ID": 173265,
            "ConnectionTypeID": 1,
            "LevelID": 2,
            "Amps": 16,
            "Voltage": 230,
            "PowerKW": 3.7,
            "CurrentTypeID": 10,
            "Quantity": 2
        }
    ],
    "DateLastStatusUpdate": "2020-06-26T02:58:00Z",
    "DataQualityLevel": 3,
    "DateCreated": "2019-04-06T05:03:00Z",
    "SubmissionStatusTypeID": 100
}