{
    "IsRecentlyVerified": false,
    "ID": 124702,
    "UUID": "42739C23-6BDF-407D-90B7-54459B663C7A",
    "DataProviderID": 2,
    "DataProvidersReference": "58288",
    "OperatorID": 5,
    "UsageTypeID": 1,
    "AddressInfo": {
        "ID": 125048,
        "Title": "UNR CAMPUS",
        "AddressLine1": "1664 N Virginia St",
        "Town": "Reno",
        "StateOrProvince": "NV",
        "Postcode": "89557",
        "CountryID": 2,
        "Latitude": 39.547056,
        "Longitude": -119.820627,
        "ContactTelephone1": "888-758-4389",
        "AccessComments": "24 hours daily",
        "RelatedURL": "http://www.chargepoint.com/",
        "DistanceUnit": 0
    },
    "Connections": [
        {
            "ID": 174836,
            "ConnectionTypeID": 1,
            "LevelID": 2,
            "Amps": 16,
            "Voltage": 230,
            "PowerKW": 3.7,
            "CurrentTypeID": 10,
            "Quantity": 4
        }
    ],
    "DateLastStatusUpdate": "2020-06-26T03:02:00Z",
    "DataQualityLevel": 3,
    "DateCreated": "2019-04-06T05:04:00Z",
    "SubmissionStatusTypeID": 100
}