{
    "IsRecentlyVerified": false,
    "ID": 161681,
    "UUID": "775E8BBC-0A94-48DC-B3FD-78375A2F383F",
    "DataProviderID": 1,
    "OperatorID": 49,
    "UsageTypeID": 5,
    "AddressInfo": {
        "ID": 162038,
        "Title": "Atomium",
        "AddressLine1": "Witte-Acacialaan",
        "Town": "Brussels",
        "StateOrProvince": "Brussels-Capital",
        "Postcode": "1020",
        "CountryID": 26,
        "Latitude": 50.892687566136914,
        "Longitude": 4.343913660688145,
        "DistanceUnit": 0
    },
    "Connections": [
        {
            "ID": 232661,
            "ConnectionTypeID": 25,
            "StatusTypeID": 50,
            "LevelID": 2,
            "PowerKW": 11,
            "CurrentTypeID": 20
        }
    ],
    "NumberOfPoints": 2,
    "GeneralComments": "Works with shell/newmotion rfid",
    "StatusTypeID": 50,
    "DateLastStatusUpdate": "2020-07-21T08:57:00Z",
    "DataQualityLevel": 1,
    "DateCreated": "2020-07-21T05:35:00Z",
    "SubmissionStatusTypeID": 200
}