{
    "IsRecentlyVerified": false,
    "ID": 186014,
    "UUID": "563873A9-2C31-425D-B505-3A3BD0BDAA68",
    "DataProviderID": 29,
    "DataProvidersReference": "13398",
    "AddressInfo": {
        "ID": 186373,
        "Title": "Gleiwitzerstraße 2",
        "AddressLine1": "Gleiwitzerstraße 2",
        "Town": "Mainz",
        "Postcode": "55131",
        "CountryID": 87,
        "Latitude": 49.986286,
        "Longitude": 8.264547,
        "DistanceUnit": 0
    },
    "Connections": [
        {
            "ID": 297471,
            "ConnectionTypeID": 25,
            "StatusTypeID": 50,
            "LevelID": 2,
            "PowerKW": 22,
            "CurrentTypeID": 20
        },
        {
            "ID": 297472,
            "ConnectionTypeID": 25,
            "StatusTypeID": 50,
            "LevelID": 2,
            "PowerKW": 22,
            "CurrentTypeID": 20
        }
    ],
    "StatusTypeID": 50,
    "DateLastStatusUpdate": "2021-07-12T02:44:00Z",
    "MetadataValues": [
        {
            "ID": 18256,
            "MetadataFieldID": 4,
            "ItemValue": "Data from the German chargepoint registry provided by Bundesnetzagentur.de under the CC-BY 4.0 license"
        }
    ],
    "DataQualityLevel": 3,
    "DateCreated": "2021-07-12T02:44:00Z",
    "SubmissionStatusTypeID": 100
}