{
    "IsRecentlyVerified": false,
    "ID": 168984,
    "UUID": "E3121C3C-1CDA-4ED9-852E-DE72803365E8",
    "DataProviderID": 1,
    "OperatorID": 3390,
    "UsageTypeID": 4,
    "AddressInfo": {
        "ID": 169343,
        "Title": "ElectroUA 10006",
        "AddressLine1": "Воздухофлотский проспект 66-л",
        "AddressLine2": "Чоколовка",
        "Town": "Киев",
        "Postcode": "03152",
        "CountryID": 234,
        "Latitude": 50.419170429129224,
        "Longitude": 30.452388799300593,
        "AccessComments": "Станция на территории салона ElectroUA.",
        "RelatedURL": "https://eua.energy/account/",
        "DistanceUnit": 0
    },
    "Connections": [
        {
            "ID": 257030,
            "ConnectionTypeID": 33,
            "LevelID": 3,
            "PowerKW": 150,
            "CurrentTypeID": 30,
            "Quantity": 1
        },
        {
            "ID": 257031,
            "ConnectionTypeID": 2,
            "LevelID": 3,
            "PowerKW": 50,
            "CurrentTypeID": 30
        }
    ],
    "NumberOfPoints": 1,
    "StatusTypeID": 50,
    "DateLastStatusUpdate": "2020-10-11T10:53:00Z",
    "DataQualityLevel": 1,
    "DateCreated": "2020-10-08T10:45:00Z",
    "SubmissionStatusTypeID": 200
}