{
    "IsRecentlyVerified": false,
    "ID": 144005,
    "UUID": "4C849913-9D3E-4C62-AE3D-84AA87F4EDF1",
    "DataProviderID": 2,
    "DataProvidersReference": "73276",
    "OperatorID": 5,
    "UsageTypeID": 1,
    "AddressInfo": {
        "ID": 144357,
        "Title": "HIGHLANDCHEVRON",
        "AddressLine1": "993 Lawson Ave",
        "Town": "Woodburn",
        "StateOrProvince": "OR",
        "Postcode": "97071",
        "CountryID": 2,
        "Latitude": 45.1506,
        "Longitude": -122.878033,
        "ContactTelephone1": "888-758-4389",
        "AccessComments": "24 hours daily",
        "RelatedURL": "http://www.chargepoint.com/",
        "DistanceUnit": 0
    },
    "Connections": [
        {
            "ID": 200456,
            "ConnectionTypeID": 1,
            "LevelID": 2,
            "Amps": 16,
            "Voltage": 230,
            "PowerKW": 3.7,
            "CurrentTypeID": 10,
            "Quantity": 4
        }
    ],
    "StatusTypeID": 50,
    "DateLastStatusUpdate": "2020-06-26T03:08:00Z",
    "DataQualityLevel": 3,
    "DateCreated": "2019-12-24T09:22:00Z",
    "SubmissionStatusTypeID": 100
}