{
    "IsRecentlyVerified": false,
    "ID": 61150,
    "UUID": "EB8E7006-36BC-4F46-8E20-B6B1D5A32372",
    "DataProviderID": 27,
    "DataProvidersReference": "60",
    "OperatorID": 1237,
    "UsageTypeID": 1,
    "AddressInfo": {
        "ID": 61496,
        "Title": "Pereda",
        "AddressLine1": "Calle José María Pereda, 18",
        "Town": "Torrelavega",
        "StateOrProvince": "Cantabria",
        "Postcode": "39300",
        "CountryID": 210,
        "Latitude": 43.350387,
        "Longitude": -4.049411,
        "DistanceUnit": 0
    },
    "Connections": [
        {
            "ID": 77808,
            "ConnectionTypeID": 28,
            "LevelID": 1,
            "PowerKW": 2.3
        },
        {
            "ID": 77809,
            "ConnectionTypeID": 25,
            "LevelID": 2,
            "PowerKW": 3.7
        }
    ],
    "StatusTypeID": 0,
    "DateLastStatusUpdate": "2016-02-13T00:24:00Z",
    "DataQualityLevel": 3,
    "DateCreated": "2016-02-13T00:24:00Z",
    "SubmissionStatusTypeID": 200
}