{
    "IsRecentlyVerified": false,
    "ID": 148211,
    "UUID": "08B6110F-0C3A-4277-A060-D83A63387F21",
    "DataProviderID": 1,
    "OperatorID": 80,
    "UsageTypeID": 4,
    "AddressInfo": {
        "ID": 148563,
        "Title": "Fermo Piazza Salvanello | EnelX",
        "AddressLine1": "Via Sacco e Vanzetti",
        "Town": "Fermo",
        "StateOrProvince": "FM",
        "Postcode": "63900",
        "CountryID": 112,
        "Latitude": 43.15898640541391,
        "Longitude": 13.782336403461727,
        "RelatedURL": "https://www.enelx.com/it/it/emobility",
        "DistanceUnit": 0
    },
    "Connections": [
        {
            "ID": 205774,
            "ConnectionTypeID": 25,
            "StatusTypeID": 50,
            "LevelID": 2,
            "Amps": 32,
            "Voltage": 400,
            "PowerKW": 22,
            "CurrentTypeID": 20,
            "Quantity": 2
        }
    ],
    "NumberOfPoints": 2,
    "StatusTypeID": 50,
    "DateLastStatusUpdate": "2020-01-27T16:13:00Z",
    "DataQualityLevel": 1,
    "DateCreated": "2020-01-27T16:13:00Z",
    "SubmissionStatusTypeID": 200
}