{
    "IsRecentlyVerified": false,
    "ID": 180392,
    "UUID": "330E267C-A02B-47D2-990F-AF0E7F74C025",
    "DataProviderID": 29,
    "DataProvidersReference": "38",
    "AddressInfo": {
        "ID": 180751,
        "Title": "Dieselstr.3",
        "AddressLine1": "Dieselstr.3",
        "Town": "Dieburg",
        "Postcode": "64807",
        "CountryID": 87,
        "Latitude": 49.9104,
        "Longitude": 8.8619,
        "DistanceUnit": 0
    },
    "Connections": [
        {
            "ID": 283416,
            "ConnectionTypeID": 1036,
            "StatusTypeID": 50,
            "LevelID": 3,
            "PowerKW": 43,
            "CurrentTypeID": 20
        },
        {
            "ID": 283417,
            "ConnectionTypeID": 33,
            "StatusTypeID": 50,
            "LevelID": 3,
            "PowerKW": 50,
            "CurrentTypeID": 30
        },
        {
            "ID": 283418,
            "ConnectionTypeID": 2,
            "StatusTypeID": 50,
            "LevelID": 3,
            "PowerKW": 50,
            "CurrentTypeID": 30
        },
        {
            "ID": 297408,
            "ConnectionTypeID": 33,
            "StatusTypeID": 50,
            "LevelID": 3,
            "PowerKW": 50,
            "CurrentTypeID": 30
        }
    ],
    "StatusTypeID": 50,
    "DateLastStatusUpdate": "2021-07-12T02:44:00Z",
    "MetadataValues": [
        {
            "ID": 12686,
            "MetadataFieldID": 4,
            "ItemValue": "Data from the German chargepoint registry provided by Bundesnetzagentur.de under the CC-BY 4.0 license"
        }
    ],
    "DataQualityLevel": 3,
    "DateCreated": "2021-07-08T10:00:00Z",
    "SubmissionStatusTypeID": 100
}