{
    "IsRecentlyVerified": false,
    "ID": 187581,
    "UUID": "B1D97375-4ED9-4569-AF6D-DF1F4C24027E",
    "DataProviderID": 18,
    "DataProvidersReference": "f09d6b25b818fbd2e561e02f339dadff",
    "OperatorID": 3298,
    "UsageTypeID": 5,
    "AddressInfo": {
        "ID": 187940,
        "Title": "Nadder Close Car Park",
        "AddressLine1": "Nadder Close Car Park",
        "Town": "Tisbury",
        "Postcode": "SP3 6JL",
        "CountryID": 1,
        "Latitude": 51.063789,
        "Longitude": -2.078827,
        "AccessComments": "",
        "RelatedURL": "http://www.eocharging.com",
        "DistanceUnit": 0
    },
    "Connections": [
        {
            "ID": 302756,
            "ConnectionTypeID": 25,
            "Reference": "EG-05043",
            "StatusTypeID": 50,
            "LevelID": 2,
            "Amps": 32,
            "Voltage": 400,
            "PowerKW": 22,
            "CurrentTypeID": 20
        },
        {
            "ID": 302757,
            "ConnectionTypeID": 25,
            "Reference": "EG-03089",
            "StatusTypeID": 50,
            "LevelID": 2,
            "Amps": 32,
            "Voltage": 400,
            "PowerKW": 22,
            "CurrentTypeID": 20
        }
    ],
    "StatusTypeID": 0,
    "DateLastStatusUpdate": "2021-07-12T03:38:00Z",
    "MetadataValues": [
        {
            "ID": 19821,
            "MetadataFieldID": 4,
            "ItemValue": "Contains public sector information licensed under the Open Government Licence v2.0. http://www.nationalarchives.gov.uk/doc/open-government-licence/version/2/"
        }
    ],
    "DataQualityLevel": 3,
    "DateCreated": "2021-07-12T03:38:00Z",
    "SubmissionStatusTypeID": 100
}