{
    "IsRecentlyVerified": false,
    "ID": 116537,
    "UUID": "1B294F2A-C321-46EA-9D17-588F3B5D4545",
    "DataProviderID": 1,
    "DataProvidersReference": "4876",
    "AddressInfo": {
        "ID": 116883,
        "Title": "Marius ladestasjon",
        "AddressLine1": "Thomas Hirsch gate 5",
        "Town": "TRONDHEIM",
        "StateOrProvince": "Trøndelag",
        "Postcode": "7067",
        "CountryID": 168,
        "Latitude": 63.43854,
        "Longitude": 10.44135,
        "AccessComments": "",
        "DistanceUnit": 0
    },
    "Connections": [
        {
            "ID": 164893,
            "ConnectionTypeID": 0,
            "Reference": "1",
            "LevelID": 2,
            "Amps": 16,
            "Voltage": 230,
            "PowerKW": 3.7,
            "Comments": "Mode 1"
        },
        {
            "ID": 164894,
            "ConnectionTypeID": 0,
            "Reference": "2",
            "LevelID": 2,
            "Amps": 16,
            "Voltage": 230,
            "PowerKW": 3.7,
            "Comments": "Mode 1"
        },
        {
            "ID": 164895,
            "ConnectionTypeID": 0,
            "Reference": "3",
            "LevelID": 2,
            "Amps": 16,
            "Voltage": 230,
            "PowerKW": 3.7,
            "Comments": "Mode 3"
        }
    ],
    "NumberOfPoints": 3,
    "DateLastStatusUpdate": "2020-05-26T08:25:00Z",
    "DataQualityLevel": 2,
    "DateCreated": "2019-02-11T09:16:00Z",
    "SubmissionStatusTypeID": 100
}