{
    "IsRecentlyVerified": false,
    "ID": 174395,
    "UUID": "284C4431-B809-4A8B-886F-FE6213403462",
    "DataProviderID": 1,
    "OperatorID": 3404,
    "UsageTypeID": 1,
    "AddressInfo": {
        "ID": 174754,
        "Title": "Ferretería Nosara",
        "AddressLine1": "Ferreteria",
        "AddressLine2": "Nosara",
        "Town": "Playa Garza Nosara",
        "StateOrProvince": "Guanacaste",
        "CountryID": 58,
        "Latitude": 9.960324035305547,
        "Longitude": -85.65616792316553,
        "DistanceUnit": 0
    },
    "Connections": [
        {
            "ID": 270128,
            "ConnectionTypeID": 1,
            "StatusTypeID": 50,
            "LevelID": 2,
            "Amps": 30,
            "Voltage": 240,
            "PowerKW": 7,
            "CurrentTypeID": 10,
            "Quantity": 2
        }
    ],
    "NumberOfPoints": 1,
    "StatusTypeID": 50,
    "DateLastStatusUpdate": "2021-05-06T22:40:00Z",
    "DataQualityLevel": 1,
    "DateCreated": "2021-03-28T01:46:00Z",
    "SubmissionStatusTypeID": 200
}