{
    "IsRecentlyVerified": false,
    "ID": 114747,
    "UUID": "EFDB06A6-6090-48FE-B7DB-B1A26495F184",
    "DataProviderID": 1,
    "OperatorID": 103,
    "OperatorsReference": "BEALLEGO001173",
    "UsageTypeID": 1,
    "AddressInfo": {
        "ID": 115093,
        "Title": "Battmobiel Frère-Orbanlaan",
        "AddressLine1": "Hubert Frère-Orbanlaan 161",
        "Town": "GENT",
        "StateOrProvince": "Oost-Vlaanderen",
        "Postcode": "9000",
        "CountryID": 26,
        "Latitude": 51.0438417,
        "Longitude": 3.7341907,
        "AccessComments": "Eén van de laadpunten is voorbehouden voor klanten van Battmobiel.",
        "DistanceUnit": 0
    },
    "Connections": [
        {
            "ID": 161486,
            "ConnectionTypeID": 25,
            "StatusTypeID": 50,
            "LevelID": 2,
            "Amps": 16,
            "Voltage": 400,
            "PowerKW": 11,
            "CurrentTypeID": 20,
            "Quantity": 2
        }
    ],
    "NumberOfPoints": 2,
    "StatusTypeID": 50,
    "DateLastStatusUpdate": "2019-01-15T15:11:00Z",
    "DataQualityLevel": 1,
    "DateCreated": "2019-01-14T15:45:00Z",
    "SubmissionStatusTypeID": 200
}