{
    "IsRecentlyVerified": false,
    "ID": 102900,
    "UUID": "B4DD5C21-A00C-4A8F-9A25-949D921294E0",
    "DataProviderID": 2,
    "DataProvidersReference": "86255",
    "UsageTypeID": 1,
    "AddressInfo": {
        "ID": 103246,
        "Title": "Town of Glastonbury - Town Hall",
        "AddressLine1": "2155 Main St",
        "Town": "Glastonbury",
        "StateOrProvince": "CT",
        "Postcode": "06033",
        "CountryID": 2,
        "Latitude": 41.706856,
        "Longitude": -72.611655,
        "ContactTelephone1": "860-652-7710",
        "AccessComments": "24 hours daily",
        "RelatedURL": "",
        "DistanceUnit": 0
    },
    "Connections": [
        {
            "ID": 145045,
            "ConnectionTypeID": 1,
            "LevelID": 2,
            "Amps": 16,
            "Voltage": 230,
            "PowerKW": 3.7,
            "CurrentTypeID": 10,
            "Quantity": 1
        }
    ],
    "DateLastStatusUpdate": "2020-06-26T03:04:00Z",
    "DataQualityLevel": 3,
    "DateCreated": "2018-04-21T04:13:00Z",
    "SubmissionStatusTypeID": 100
}