{
    "IsRecentlyVerified": false,
    "ID": 123716,
    "UUID": "EBF81874-83B0-4722-A55E-4F43FE164954",
    "DataProviderID": 2,
    "DataProvidersReference": "89036",
    "UsageTypeID": 7,
    "AddressInfo": {
        "ID": 124062,
        "Title": "Dolces Hayes Mansion",
        "AddressLine1": "200 Edenvale Ave",
        "Town": "San Jose",
        "StateOrProvince": "CA",
        "Postcode": "95136",
        "CountryID": 2,
        "Latitude": 37.262847,
        "Longitude": -121.819343,
        "ContactTelephone1": "408-226-3200",
        "AccessComments": "24 hours daily\r\nPublic - Call ahead",
        "RelatedURL": "",
        "DistanceUnit": 0
    },
    "Connections": [
        {
            "ID": 173738,
            "ConnectionTypeID": 9,
            "LevelID": 1,
            "Amps": 16,
            "Voltage": 120,
            "PowerKW": 1.9,
            "CurrentTypeID": 10,
            "Quantity": 1
        }
    ],
    "DateLastStatusUpdate": "2020-06-26T02:59:00Z",
    "DataQualityLevel": 3,
    "DateCreated": "2019-04-06T05:03:00Z",
    "SubmissionStatusTypeID": 100
}