{
    "IsRecentlyVerified": false,
    "ID": 71670,
    "UUID": "393C6D2D-A1FD-4B76-A1CB-C20179B25961",
    "DataProviderID": 1,
    "DataProvidersReference": "3469",
    "OperatorID": 1,
    "UsageTypeID": 5,
    "AddressInfo": {
        "ID": 72016,
        "Title": "Esso Mosjøen",
        "AddressLine1": "Leira 2",
        "Town": "MOSJØEN",
        "StateOrProvince": "Nordland",
        "Postcode": "8665",
        "CountryID": 168,
        "Latitude": 65.86314,
        "Longitude": 13.19615,
        "AccessComments": "",
        "DistanceUnit": 0
    },
    "Connections": [
        {
            "ID": 102630,
            "ConnectionTypeID": 33,
            "Reference": "1",
            "StatusTypeID": 50,
            "LevelID": 2,
            "Amps": 100,
            "Voltage": 500,
            "PowerKW": 50,
            "Quantity": 2,
            "Comments": "Mode 4"
        },
        {
            "ID": 102631,
            "ConnectionTypeID": 2,
            "Reference": "2",
            "StatusTypeID": 50,
            "LevelID": 3,
            "Amps": 100,
            "Voltage": 500,
            "PowerKW": 50,
            "CurrentTypeID": 30,
            "Quantity": 2,
            "Comments": "Mode 4"
        },
        {
            "ID": 102634,
            "ConnectionTypeID": 25,
            "Reference": "5",
            "StatusTypeID": 50,
            "LevelID": 2,
            "Amps": 32,
            "Voltage": 400,
            "PowerKW": 22,
            "Quantity": 2,
            "Comments": "Mode 3"
        }
    ],
    "NumberOfPoints": 6,
    "StatusTypeID": 50,
    "DateLastStatusUpdate": "2020-08-27T20:03:00Z",
    "DataQualityLevel": 2,
    "DateCreated": "2016-09-02T11:12:00Z",
    "SubmissionStatusTypeID": 100
}