{
    "IsRecentlyVerified": false,
    "ID": 178128,
    "UUID": "BA1BCDA3-F8E2-4854-8080-927F8F9ABBF2",
    "DataProviderID": 29,
    "DataProvidersReference": "15161",
    "OperatorID": 105,
    "AddressInfo": {
        "ID": 178487,
        "Title": "In der Klaus ggü. Nr. 11",
        "AddressLine1": "In der Klaus ggü. Nr. 11",
        "Town": "Oberweis",
        "Postcode": "54636",
        "CountryID": 87,
        "Latitude": 49.9594297,
        "Longitude": 6.4247965,
        "DistanceUnit": 0
    },
    "Connections": [
        {
            "ID": 278148,
            "ConnectionTypeID": 25,
            "StatusTypeID": 50,
            "LevelID": 2,
            "PowerKW": 22,
            "CurrentTypeID": 20
        },
        {
            "ID": 278149,
            "ConnectionTypeID": 25,
            "StatusTypeID": 50,
            "LevelID": 2,
            "PowerKW": 22,
            "CurrentTypeID": 20
        }
    ],
    "StatusTypeID": 0,
    "DateLastStatusUpdate": "2021-07-12T02:44:00Z",
    "MetadataValues": [
        {
            "ID": 10422,
            "MetadataFieldID": 4,
            "ItemValue": "Data from the German chargepoint registry provided by Bundesnetzagentur.de under the CC-BY 4.0 license"
        }
    ],
    "DataQualityLevel": 3,
    "DateCreated": "2021-07-08T09:49:00Z",
    "SubmissionStatusTypeID": 100
}