{
    "MediaItems": [
        {
            "ID": 24657,
            "ChargePointID": 167767,
            "ItemURL": "https://s3-ap-southeast-2.amazonaws.com/openchargemap/images/ES/OCM167767/OCM-167767.orig.2020091210453445.jpg",
            "ItemThumbnailURL": "https://s3-ap-southeast-2.amazonaws.com/openchargemap/images/ES/OCM167767/OCM-167767.thmb.2020091210453445.jpg",
            "Comment": "Need register with QR code",
            "IsEnabled": true,
            "IsVideo": false,
            "IsFeaturedItem": false,
            "IsExternalResource": false,
            "User": {
                "ID": 27427,
                "Username": "Raul_cram"
            },
            "DateCreated": "2020-09-12T10:46:00Z"
        }
    ],
    "IsRecentlyVerified": false,
    "ID": 167767,
    "UUID": "EE322326-2B40-40ED-8A0B-D725F592CEDC",
    "DataProviderID": 1,
    "OperatorID": 209,
    "UsageTypeID": 1,
    "UsageCost": "0",
    "AddressInfo": {
        "ID": 168126,
        "Title": "Carrer de l'Aliança",
        "AddressLine1": "Carrer de l'Aliança",
        "Town": "Lliçà d'Amunt",
        "StateOrProvince": "Barcelona",
        "Postcode": "08186",
        "CountryID": 210,
        "Latitude": 41.61075794334056,
        "Longitude": 2.240075349591052,
        "ContactTelephone1": "900 250 260",
        "AccessComments": "Com puc activar un punt de càrrega? El punt només es pot activar amb el codi QR: Al punt de càrrega hi han dos codis QR (un per cada connector). Amb el teu telèfon intel·ligent o smartphone i un programa lector de codis QR com ara Lector QR, escaneja el codi i t’apareixerà una pantalla; introdueix-hi les teves dades (DNI i el pin assignat en registrar-te) i podràs començar a carregar el vehicle. Com puc aturar la càrrega del meu vehicle? Escaneja el codi i t’apareixerà una pantalla; introdueix-hi les teves dades (DNI i el pin assignat en registrar-te) i la càrrega s’aturarà i s’obrirà la tapa perquè puguis extreure l’endoll. Cal registrar-se a la web: https://www.e-mobilitat.cat No funciona amb targetes RFID",
        "RelatedURL": "https://www.e-mobilitat.cat",
        "DistanceUnit": 0
    },
    "Connections": [
        {
            "ID": 254721,
            "ConnectionTypeID": 25,
            "StatusTypeID": 50,
            "LevelID": 2,
            "PowerKW": 22,
            "CurrentTypeID": 20,
            "Quantity": 2
        }
    ],
    "NumberOfPoints": 2,
    "StatusTypeID": 50,
    "DateLastStatusUpdate": "2020-09-14T07:21:00Z",
    "DataQualityLevel": 1,
    "DateCreated": "2020-09-12T10:44:00Z",
    "SubmissionStatusTypeID": 200
}