{
    "IsRecentlyVerified": false,
    "ID": 141785,
    "UUID": "92C6429A-54F9-4140-9A6B-34DB67675ADB",
    "DataProviderID": 2,
    "DataProvidersReference": "148231",
    "OperatorID": 39,
    "UsageTypeID": 1,
    "AddressInfo": {
        "ID": 142137,
        "Title": "Walgreens - Edgewood, MD #9342 |P772",
        "AddressLine1": "1930 Pulaski Highway",
        "Town": "Edgewood",
        "StateOrProvince": "MD",
        "Postcode": "21040",
        "CountryID": 2,
        "Latitude": 39.4354502,
        "Longitude": -76.3141145,
        "ContactTelephone1": "800-663-5633",
        "AccessComments": "MO: Not Specified; TU: Not Specified; WE: Not Specified; TH: Not Specified; FR: Not Specified; SA: Not Specified; SU: Not Specified",
        "RelatedURL": "http://www.semacharge.com/",
        "DistanceUnit": 0
    },
    "Connections": [
        {
            "ID": 197797,
            "ConnectionTypeID": 1,
            "LevelID": 2,
            "Amps": 16,
            "Voltage": 230,
            "PowerKW": 3.7,
            "CurrentTypeID": 10,
            "Quantity": 1
        }
    ],
    "StatusTypeID": 50,
    "DateLastStatusUpdate": "2020-06-26T03:01:00Z",
    "DataQualityLevel": 3,
    "DateCreated": "2019-12-24T09:16:00Z",
    "SubmissionStatusTypeID": 100
}