{
    "IsRecentlyVerified": false,
    "ID": 67586,
    "UUID": "36CC3784-B4F4-4104-9683-261C683ADE20",
    "DataProviderID": 1,
    "OperatorID": 23,
    "OperatorsReference": "14583",
    "UsageTypeID": 7,
    "UsageCost": "Free",
    "AddressInfo": {
        "ID": 67932,
        "Title": "Dunham Wine Cellars - Tesla",
        "AddressLine1": "150 E Boeing",
        "Town": "Walla Walla",
        "StateOrProvince": "WA",
        "Postcode": "99362",
        "CountryID": 2,
        "Latitude": 46.0890194,
        "Longitude": -118.2782343,
        "ContactTelephone1": "509-529-4685  877-798-3752",
        "AccessComments": "24 hours daily; for Tesla use only; for guest use only",
        "RelatedURL": "http://www.teslamotors.com/supercharger",
        "DistanceUnit": 0
    },
    "Connections": [
        {
            "ID": 93091,
            "ConnectionTypeID": 30,
            "StatusTypeID": 50,
            "LevelID": 2,
            "Amps": 16,
            "Voltage": 230,
            "PowerKW": 8,
            "CurrentTypeID": 10,
            "Quantity": 1
        }
    ],
    "NumberOfPoints": 1,
    "StatusTypeID": 50,
    "DateLastStatusUpdate": "2017-01-26T04:22:00Z",
    "DataQualityLevel": 3,
    "DateCreated": "2016-05-29T02:05:00Z",
    "SubmissionStatusTypeID": 100
}