{
    "UserComments": [
        {
            "ID": 9861,
            "ChargePointID": 61363,
            "CommentTypeID": 10,
            "UserName": "Alan Brown",
            "Comment": "",
            "Rating": 5,
            "DateCreated": "2016-03-04T20:56:06.92Z",
            "User": {
                "ID": 2055,
                "Username": "Alan Brown"
            },
            "CheckinStatusTypeID": 10
        }
    ],
    "IsRecentlyVerified": false,
    "ID": 61363,
    "UUID": "2F47819E-ED90-4160-AD21-212216CA2C03",
    "DataProviderID": 1,
    "OperatorID": 3315,
    "OperatorsReference": "51234",
    "UsageTypeID": 4,
    "UsageCost": "£0.15/kWh;min £1.00. £1.00",
    "AddressInfo": {
        "ID": 61709,
        "Title": "Queens Road",
        "AddressLine1": "10 Queens Road",
        "AddressLine2": "Mannofield",
        "Town": "Aberdeen",
        "Postcode": "AB15 4ZT",
        "CountryID": 1,
        "Latitude": 57.1425502,
        "Longitude": -2.13095380000004,
        "DistanceUnit": 0
    },
    "Connections": [
        {
            "ID": 78157,
            "ConnectionTypeID": 25,
            "StatusTypeID": 50,
            "LevelID": 2,
            "Amps": 32,
            "Voltage": 230,
            "PowerKW": 7,
            "CurrentTypeID": 10,
            "Quantity": 2
        }
    ],
    "NumberOfPoints": 2,
    "StatusTypeID": 50,
    "DateLastStatusUpdate": "2020-01-02T08:27:00Z",
    "DataQualityLevel": 1,
    "DateCreated": "2016-02-26T21:04:00Z",
    "SubmissionStatusTypeID": 200
}