{
    "IsRecentlyVerified": false,
    "ID": 168405,
    "UUID": "B90D86D0-8D91-492F-9F2D-6C07F2C7A6A7",
    "DataProviderID": 1,
    "OperatorID": 21,
    "UsageTypeID": 4,
    "UsageCost": "Mobi.E compatible card",
    "AddressInfo": {
        "ID": 168764,
        "Title": "BRG-00032/33",
        "AddressLine1": "Braga Parque",
        "AddressLine2": "",
        "Town": "Braga",
        "StateOrProvince": "Braga",
        "Postcode": "4710-353",
        "CountryID": 180,
        "Latitude": 41.55777240068491,
        "Longitude": -8.405955181436411,
        "AccessComments": "Underground parking",
        "DistanceUnit": 0
    },
    "Connections": [
        {
            "ID": 255762,
            "ConnectionTypeID": 25,
            "StatusTypeID": 50,
            "LevelID": 2,
            "Amps": 32,
            "Voltage": 400,
            "PowerKW": 22,
            "CurrentTypeID": 20,
            "Quantity": 4
        }
    ],
    "NumberOfPoints": 4,
    "StatusTypeID": 50,
    "DateLastStatusUpdate": "2020-09-24T21:09:00Z",
    "DataQualityLevel": 1,
    "DateCreated": "2020-09-24T21:09:00Z",
    "SubmissionStatusTypeID": 200
}