{
    "UserComments": [
        {
            "ID": 21488,
            "ChargePointID": 115077,
            "CommentTypeID": 10,
            "UserName": "Raule_19",
            "Comment": "Carga y café para clientes nissan",
            "Rating": 5,
            "DateCreated": "2019-09-09T17:02:51.873Z",
            "User": {
                "ID": 19690,
                "Username": "Raule_19"
            },
            "CheckinStatusTypeID": 10
        }
    ],
    "MediaItems": [
        {
            "ID": 19601,
            "ChargePointID": 115077,
            "ItemURL": "https://s3-ap-southeast-2.amazonaws.com/openchargemap/images/ES/OCM115077/OCM-115077.orig.2019091721135619.png",
            "ItemThumbnailURL": "https://s3-ap-southeast-2.amazonaws.com/openchargemap/images/ES/OCM115077/OCM-115077.thmb.2019091721135619.png",
            "Comment": "",
            "IsEnabled": true,
            "IsVideo": false,
            "IsFeaturedItem": false,
            "IsExternalResource": false,
            "User": {
                "ID": 19690,
                "Username": "Raule_19"
            },
            "DateCreated": "2019-09-17T21:14:00Z"
        }
    ],
    "IsRecentlyVerified": false,
    "ID": 115077,
    "UUID": "02EC50A3-F216-4DD2-A7CF-A05018D98AE6",
    "DataProviderID": 1,
    "OperatorID": 1,
    "UsageTypeID": 6,
    "UsageCost": "gratis para clientes nissan",
    "AddressInfo": {
        "ID": 115423,
        "Title": "Nissan figueres",
        "AddressLine1": "Avinguda de Roses",
        "AddressLine2": "Vilatenim",
        "Town": "Alto Ampurdán",
        "StateOrProvince": "Alto Ampurdán",
        "Postcode": "17485",
        "CountryID": 210,
        "Latitude": 42.2676185318252,
        "Longitude": 2.99007653145758,
        "DistanceUnit": 0
    },
    "Connections": [
        {
            "ID": 161923,
            "ConnectionTypeID": 2,
            "StatusTypeID": 50,
            "LevelID": 3,
            "Amps": 80,
            "PowerKW": 55,
            "CurrentTypeID": 30,
            "Quantity": 1
        },
        {
            "ID": 161924,
            "ConnectionTypeID": 1036,
            "StatusTypeID": 50,
            "LevelID": 3,
            "Amps": 63,
            "Voltage": 400,
            "PowerKW": 43,
            "CurrentTypeID": 20,
            "Quantity": 1
        }
    ],
    "NumberOfPoints": 1,
    "StatusTypeID": 50,
    "DateLastStatusUpdate": "2019-09-17T21:14:00Z",
    "DataQualityLevel": 1,
    "DateCreated": "2019-01-28T13:17:00Z",
    "SubmissionStatusTypeID": 200
}