{
    "IsRecentlyVerified": false,
    "ID": 142113,
    "UUID": "BE3D1646-0FA2-48D6-AB31-31E19B26C404",
    "DataProviderID": 2,
    "DataProvidersReference": "47747",
    "UsageTypeID": 7,
    "AddressInfo": {
        "ID": 142465,
        "Title": "Nissan of Devon",
        "AddressLine1": "459 W Lancaster Ave",
        "Town": "Devon",
        "StateOrProvince": "PA",
        "Postcode": "19333",
        "CountryID": 2,
        "Latitude": 40.046627,
        "Longitude": -75.433254,
        "ContactTelephone1": "610-695-2900",
        "AccessComments": "Dealership business hours\r\nPublic - Call ahead",
        "RelatedURL": "",
        "DistanceUnit": 0
    },
    "Connections": [
        {
            "ID": 198184,
            "ConnectionTypeID": 1,
            "LevelID": 2,
            "Amps": 16,
            "Voltage": 230,
            "PowerKW": 3.7,
            "CurrentTypeID": 10,
            "Quantity": 1
        }
    ],
    "StatusTypeID": 50,
    "DateLastStatusUpdate": "2020-06-26T03:02:00Z",
    "DataQualityLevel": 3,
    "DateCreated": "2019-12-24T09:17:00Z",
    "SubmissionStatusTypeID": 100
}