{
    "IsRecentlyVerified": false,
    "ID": 67358,
    "UUID": "925748EA-03B2-4E15-B7A1-B0A6BD4E6F12",
    "DataProviderID": 1,
    "OperatorID": 23,
    "OperatorsReference": "15582",
    "UsageTypeID": 1,
    "UsageCost": "Free",
    "AddressInfo": {
        "ID": 67704,
        "Title": "iPark - Tesla",
        "AddressLine1": "44 Elizabeth St",
        "Town": "New York",
        "StateOrProvince": "NY",
        "Postcode": "10013",
        "CountryID": 2,
        "Latitude": 40.7169064,
        "Longitude": -73.9964708,
        "ContactTelephone1": "855-472-7569  877-798-3752",
        "AccessComments": "24 hours daily; for Tesla use only; see valet for access",
        "RelatedURL": "http://www.teslamotors.com/supercharger",
        "DistanceUnit": 0
    },
    "Connections": [
        {
            "ID": 92862,
            "ConnectionTypeID": 30,
            "StatusTypeID": 50,
            "LevelID": 2,
            "Amps": 16,
            "Voltage": 230,
            "PowerKW": 8,
            "CurrentTypeID": 10,
            "Quantity": 2
        }
    ],
    "NumberOfPoints": 2,
    "StatusTypeID": 50,
    "DateLastStatusUpdate": "2017-01-31T19:59:00Z",
    "DataQualityLevel": 3,
    "DateCreated": "2016-05-29T02:05:00Z",
    "SubmissionStatusTypeID": 100
}