{
    "IsRecentlyVerified": false,
    "ID": 158420,
    "UUID": "56DA1591-931B-4751-9361-891614451B23",
    "DataProviderID": 2,
    "DataProvidersReference": "152994",
    "UsageTypeID": 1,
    "AddressInfo": {
        "ID": 158777,
        "Title": "Publix #1654",
        "AddressLine1": "1720 Shoremeade Rd",
        "Town": "Mount Pleasant",
        "StateOrProvince": "SC",
        "Postcode": "29464",
        "CountryID": 2,
        "Latitude": 32.828026,
        "Longitude": -79.8373,
        "ContactTelephone1": "843-388-9370",
        "AccessComments": "Store business hours; customer use only while shopping at Publix",
        "RelatedURL": "",
        "DistanceUnit": 0
    },
    "Connections": [
        {
            "ID": 228401,
            "ConnectionTypeID": 1,
            "LevelID": 2,
            "Amps": 16,
            "Voltage": 230,
            "PowerKW": 3.7,
            "CurrentTypeID": 10,
            "Quantity": 2
        }
    ],
    "StatusTypeID": 50,
    "DateLastStatusUpdate": "2020-06-26T02:55:00Z",
    "DataQualityLevel": 3,
    "DateCreated": "2020-06-26T02:55:00Z",
    "SubmissionStatusTypeID": 100
}