{
    "IsRecentlyVerified": false,
    "ID": 59066,
    "UUID": "E786AF2B-7EBB-4D95-954C-611C5F8D6783",
    "DataProviderID": 1,
    "OperatorID": 235,
    "UsageTypeID": 4,
    "UsageCost": "0",
    "AddressInfo": {
        "ID": 59412,
        "Title": "SWD TESLA Motors GmbH",
        "AddressLine1": "Bonner Straße 343-345",
        "AddressLine2": "Benrath",
        "Town": "Düsseldorf",
        "Postcode": "40589",
        "CountryID": 87,
        "Latitude": 51.164283272,
        "Longitude": 6.852688339,
        "ContactTelephone1": "0211/821-8210",
        "ContactTelephone2": "0211/821-4093",
        "ContactEmail": "elektromobilitaet@swd-ag.de",
        "AccessComments": "Ladesäule steht vor dem Tesla Service Center. Wenn besetzt dort fragen, ob umgepakt wird wenn man laden möchte.",
        "RelatedURL": "http://www.emobil-nrw.de",
        "DistanceUnit": 0
    },
    "Connections": [
        {
            "ID": 74950,
            "ConnectionTypeID": 25,
            "StatusTypeID": 50,
            "LevelID": 2,
            "Amps": 32,
            "Voltage": 400,
            "PowerKW": 22,
            "CurrentTypeID": 20,
            "Quantity": 2
        },
        {
            "ID": 74951,
            "ConnectionTypeID": 28,
            "StatusTypeID": 50,
            "LevelID": 2,
            "Amps": 16,
            "Voltage": 230,
            "PowerKW": 3.7,
            "CurrentTypeID": 10,
            "Quantity": 2
        }
    ],
    "NumberOfPoints": 2,
    "GeneralComments": "Nutzbar mit:\r\nElektronauten-Ladekarte (EnBW)\r\nLadekarte der Stadtwerke Hilden GmbH\r\nLadekarte der Stadtwerke Düsseldorf AG\r\nhttps://www.swd-ag.de/formulare/tankkarte/",
    "StatusTypeID": 50,
    "DateLastStatusUpdate": "2016-01-12T12:59:00Z",
    "DataQualityLevel": 1,
    "DateCreated": "2016-01-06T14:33:00Z",
    "SubmissionStatusTypeID": 200
}