{
    "IsRecentlyVerified": false,
    "ID": 135290,
    "UUID": "1A0CBFDB-EFEA-49CC-A820-0331C72E8C3B",
    "DataProviderID": 1,
    "OperatorID": 62,
    "UsageTypeID": 1,
    "AddressInfo": {
        "ID": 135636,
        "Title": "Auchan - Mers-les-bains",
        "AddressLine1": "Rue des Ajoncs",
        "Town": "Mers-les-Bains",
        "StateOrProvince": "Abbeville",
        "Postcode": "80350",
        "CountryID": 80,
        "Latitude": 50.062111613521296,
        "Longitude": 1.407005278610086,
        "DistanceUnit": 0
    },
    "Connections": [
        {
            "ID": 189543,
            "ConnectionTypeID": 2,
            "StatusTypeID": 50,
            "LevelID": 3,
            "PowerKW": 50,
            "CurrentTypeID": 30,
            "Quantity": 1
        },
        {
            "ID": 189544,
            "ConnectionTypeID": 1036,
            "StatusTypeID": 50,
            "LevelID": 3,
            "PowerKW": 43,
            "CurrentTypeID": 20,
            "Quantity": 1
        }
    ],
    "NumberOfPoints": 1,
    "StatusTypeID": 50,
    "DateLastStatusUpdate": "2019-12-16T07:50:00Z",
    "DataQualityLevel": 1,
    "DateCreated": "2019-12-15T13:57:00Z",
    "SubmissionStatusTypeID": 200
}