{
    "IsRecentlyVerified": false,
    "ID": 146693,
    "UUID": "4594BD64-92D6-48D2-A36F-13A0A6CADC76",
    "DataProviderID": 1,
    "OperatorID": 3,
    "OperatorsReference": "PG-70131,PG-84267",
    "UsageTypeID": 4,
    "UsageCost": "Free",
    "AddressInfo": {
        "ID": 147045,
        "Title": "Tesco Extra-Abingdon",
        "AddressLine1": "Marcham Road",
        "Town": "Abingdon",
        "Postcode": "OX14 1TU",
        "CountryID": 1,
        "Latitude": 51.666851,
        "Longitude": -1.308468,
        "DistanceUnit": 0
    },
    "Connections": [
        {
            "ID": 203985,
            "ConnectionTypeID": 25,
            "StatusTypeID": 50,
            "LevelID": 2,
            "Amps": 32,
            "Voltage": 230,
            "PowerKW": 7,
            "CurrentTypeID": 10,
            "Quantity": 4
        }
    ],
    "NumberOfPoints": 4,
    "GeneralComments": "This is an open charge unit installed at the Tesco Extra super store at Marcham Road, Abingdon",
    "StatusTypeID": 50,
    "DateLastStatusUpdate": "2020-01-14T09:51:00Z",
    "DataQualityLevel": 1,
    "DateCreated": "2020-01-13T21:12:00Z",
    "SubmissionStatusTypeID": 200
}