{
    "IsRecentlyVerified": false,
    "ID": 54734,
    "UUID": "82A728E3-F5D4-4961-A920-3158303171C5",
    "DataProviderID": 26,
    "DataProvidersReference": "66617",
    "OperatorID": 73,
    "OperatorsReference": "EV-Box EVB-P1413116",
    "UsageCost": "0.00 jaarabonnement",
    "AddressInfo": {
        "ID": 55080,
        "Title": "Zuiderzeelaan 66",
        "AddressLine1": "Zuiderzeelaan 66",
        "Town": "Landsmeer",
        "Postcode": "1121 RA",
        "CountryID": 159,
        "Latitude": 52.42778,
        "Longitude": 4.90415,
        "RelatedURL": "http://www.ev-box.nl",
        "DistanceUnit": 0
    },
    "Connections": [
        {
            "ID": 69144,
            "ConnectionTypeID": 25,
            "LevelID": 2,
            "PowerKW": 5,
            "CurrentTypeID": 10
        }
    ],
    "NumberOfPoints": 1,
    "StatusTypeID": 50,
    "DateLastStatusUpdate": "2016-06-04T02:54:00Z",
    "DataQualityLevel": 3,
    "DateCreated": "2015-10-09T06:18:00Z",
    "SubmissionStatusTypeID": 100
}