{
    "IsRecentlyVerified": false,
    "ID": 124828,
    "UUID": "F3338EA7-C743-494E-8D1B-F6D53B624223",
    "DataProviderID": 2,
    "DataProvidersReference": "121127",
    "OperatorID": 5,
    "UsageTypeID": 1,
    "AddressInfo": {
        "ID": 125174,
        "Title": "JLR CHARGER",
        "AddressLine1": "3780 William Penn Hwy",
        "Town": "Monroeville",
        "StateOrProvince": "PA",
        "Postcode": "15146",
        "CountryID": 2,
        "Latitude": 40.4357124,
        "Longitude": -79.784278,
        "ContactTelephone1": "888-758-4389",
        "AccessComments": "24 hours daily",
        "RelatedURL": "http://www.chargepoint.com/",
        "DistanceUnit": 0
    },
    "Connections": [
        {
            "ID": 174980,
            "ConnectionTypeID": 32,
            "LevelID": 2,
            "Amps": 100,
            "Voltage": 400,
            "PowerKW": 40,
            "CurrentTypeID": 10,
            "Quantity": 1
        }
    ],
    "DateLastStatusUpdate": "2019-04-06T05:04:00Z",
    "DataQualityLevel": 3,
    "DateCreated": "2019-04-06T05:04:00Z",
    "SubmissionStatusTypeID": 100
}