{
    "IsRecentlyVerified": false,
    "ID": 27830,
    "UUID": "AB064C41-4029-4B75-B4E8-53DE2C17B0DD",
    "DataProviderID": 2,
    "DataProvidersReference": "53911",
    "UsageTypeID": 2,
    "AddressInfo": {
        "ID": 28176,
        "Title": "Roseville Buick GMC Cadillac",
        "AddressLine1": "400 Automall Dr",
        "Town": "Roseville",
        "StateOrProvince": "CA",
        "Postcode": "95661",
        "CountryID": 2,
        "Latitude": 38.75073,
        "Longitude": -121.253984,
        "ContactTelephone1": "",
        "AccessComments": "Service center use only",
        "RelatedURL": "",
        "DistanceUnit": 0
    },
    "Connections": [
        {
            "ID": 30555,
            "ConnectionTypeID": 11,
            "LevelID": 1,
            "Amps": 16,
            "Voltage": 120,
            "PowerKW": 1.9,
            "CurrentTypeID": 10,
            "Quantity": 1
        },
        {
            "ID": 30556,
            "ConnectionTypeID": 1,
            "LevelID": 2,
            "Amps": 16,
            "Voltage": 230,
            "PowerKW": 3.7,
            "CurrentTypeID": 10,
            "Quantity": 1
        }
    ],
    "DateLastStatusUpdate": "2020-06-26T03:00:00Z",
    "DataQualityLevel": 3,
    "DateCreated": "2014-11-28T03:38:00Z",
    "SubmissionStatusTypeID": 100
}