{
    "IsRecentlyVerified": false,
    "ID": 35616,
    "UUID": "C7CFAA40-59CF-43A4-A16C-D2493425534E",
    "DataProviderID": 26,
    "DataProvidersReference": "48588",
    "OperatorID": 178,
    "OperatorsReference": "EVnetNL REE240",
    "UsageCost": "0.00 jaarabonnement",
    "AddressInfo": {
        "ID": 35962,
        "Title": "Julianaweg 221",
        "AddressLine1": "Julianaweg 221",
        "Town": "Utrecht",
        "Postcode": "3525 VE",
        "CountryID": 159,
        "Latitude": 52.066079,
        "Longitude": 5.118614,
        "ContactTelephone1": "0800-3522365",
        "RelatedURL": "http://www.evnet.nl",
        "DistanceUnit": 0
    },
    "Connections": [
        {
            "ID": 39127,
            "ConnectionTypeID": 25,
            "LevelID": 2,
            "PowerKW": 11,
            "CurrentTypeID": 10
        }
    ],
    "NumberOfPoints": 2,
    "StatusTypeID": 50,
    "DateLastStatusUpdate": "2016-06-04T02:45:00Z",
    "DataQualityLevel": 3,
    "DateCreated": "2015-01-09T06:05:00Z",
    "SubmissionStatusTypeID": 100
}