{
    "IsRecentlyVerified": false,
    "ID": 103663,
    "UUID": "5B696C0D-1730-4E2F-9F04-FBF75B2E7579",
    "DataProviderID": 1,
    "OperatorID": 23,
    "OperatorsReference": "42473",
    "UsageTypeID": 4,
    "AddressInfo": {
        "ID": 104009,
        "Title": "Station Burgsee GmbH",
        "AddressLine1": "Bahnhof 1",
        "Town": "Gadebusch",
        "Postcode": "19205",
        "CountryID": 87,
        "Latitude": 53.703922,
        "Longitude": 11.121142,
        "ContactTelephone1": "+49 3886 2116566",
        "DistanceUnit": 0
    },
    "Connections": [
        {
            "ID": 146333,
            "ConnectionTypeID": 30,
            "StatusTypeID": 50,
            "LevelID": 2,
            "Amps": 32,
            "Voltage": 230,
            "PowerKW": 14,
            "CurrentTypeID": 20,
            "Quantity": 1
        }
    ],
    "NumberOfPoints": 1,
    "GeneralComments": "1 Tesla Connector, up to 14kW.Available for customers. Self park.",
    "StatusTypeID": 50,
    "DateLastStatusUpdate": "2018-10-03T21:55:00Z",
    "DataQualityLevel": 1,
    "DateCreated": "2018-05-05T05:49:00Z",
    "SubmissionStatusTypeID": 200
}