{
    "IsRecentlyVerified": false,
    "ID": 136036,
    "UUID": "AA07911F-8A05-4C9C-9FD3-7D801440292E",
    "DataProviderID": 18,
    "DataProvidersReference": "6d3a6ac1622c4b985e1331d854db01f6",
    "OperatorID": 2244,
    "UsageTypeID": 5,
    "AddressInfo": {
        "ID": 136382,
        "Title": "Wordsworth Mansions",
        "AddressLine1": "Wordsworth Mansions",
        "Town": "London",
        "Postcode": "W14 9TD",
        "CountryID": 1,
        "Latitude": 51.4858,
        "Longitude": -0.20827,
        "AccessComments": "",
        "RelatedURL": "https://www.ubitricity.com",
        "DistanceUnit": 0
    },
    "Connections": [
        {
            "ID": 190463,
            "ConnectionTypeID": 25,
            "Reference": "suby1100001646",
            "StatusTypeID": 50,
            "LevelID": 2,
            "Amps": 16,
            "Voltage": 230,
            "PowerKW": 3.7,
            "CurrentTypeID": 10
        }
    ],
    "StatusTypeID": 0,
    "DateLastStatusUpdate": "2021-04-25T05:46:00Z",
    "MetadataValues": [
        {
            "ID": 5888,
            "MetadataFieldID": 4,
            "ItemValue": "Contains public sector information licensed under the Open Government Licence v2.0. http://www.nationalarchives.gov.uk/doc/open-government-licence/version/2/"
        }
    ],
    "DataQualityLevel": 3,
    "DateCreated": "2019-12-24T05:22:00Z",
    "SubmissionStatusTypeID": 100
}