{
    "IsRecentlyVerified": false,
    "ID": 181119,
    "UUID": "26598251-4820-49A4-B9D1-64E2977A70E4",
    "DataProviderID": 29,
    "DataProvidersReference": "10766",
    "OperatorID": 86,
    "AddressInfo": {
        "ID": 181478,
        "Title": "Rastplatz Grenzau",
        "AddressLine1": "Rastplatz Grenzau",
        "Town": "Höhr-Grenzhausen",
        "Postcode": "56203",
        "CountryID": 87,
        "Latitude": 50.4391063,
        "Longitude": 7.6474353,
        "DistanceUnit": 0
    },
    "Connections": [
        {
            "ID": 285044,
            "ConnectionTypeID": 33,
            "StatusTypeID": 50,
            "LevelID": 3,
            "PowerKW": 300,
            "CurrentTypeID": 30
        },
        {
            "ID": 285045,
            "ConnectionTypeID": 33,
            "StatusTypeID": 50,
            "LevelID": 3,
            "PowerKW": 300,
            "CurrentTypeID": 30
        }
    ],
    "StatusTypeID": 50,
    "DateLastStatusUpdate": "2021-07-09T03:19:00Z",
    "MetadataValues": [
        {
            "ID": 13413,
            "MetadataFieldID": 4,
            "ItemValue": "Data from the German chargepoint registry provided by Bundesnetzagentur.de under the CC-BY 4.0 license"
        }
    ],
    "DataQualityLevel": 3,
    "DateCreated": "2021-07-08T10:01:00Z",
    "SubmissionStatusTypeID": 100
}