{
    "IsRecentlyVerified": false,
    "ID": 45643,
    "UUID": "A4B57EFE-3613-49AC-8F26-85BE39198307",
    "DataProviderID": 1,
    "DataProvidersReference": "2330",
    "AddressInfo": {
        "ID": 45989,
        "Title": "COOP, Södra Storgatan",
        "AddressLine1": "Södra Storgatan ",
        "Town": "EKSJÖ",
        "StateOrProvince": "JÖNKÖPING",
        "Postcode": "57531",
        "CountryID": 216,
        "Latitude": 57.66442,
        "Longitude": 14.97284,
        "AccessComments": "På COOP Konsums parkering.",
        "DistanceUnit": 0
    },
    "Connections": [
        {
            "ID": 56306,
            "ConnectionTypeID": 0,
            "Reference": "1",
            "LevelID": 2,
            "Amps": 32,
            "Voltage": 400,
            "PowerKW": 22,
            "Comments": "Mode 3"
        },
        {
            "ID": 87863,
            "ConnectionTypeID": 0,
            "Reference": "2",
            "LevelID": 2,
            "Amps": 32,
            "Voltage": 400,
            "PowerKW": 22,
            "Comments": "Mode 3"
        }
    ],
    "NumberOfPoints": 2,
    "DateLastStatusUpdate": "2020-05-26T08:21:00Z",
    "DataQualityLevel": 2,
    "DateCreated": "2015-05-03T00:54:00Z",
    "SubmissionStatusTypeID": 100
}