{
    "IsRecentlyVerified": false,
    "ID": 132391,
    "UUID": "FFA2CFFC-C340-439A-AF78-2E265C5ADDEC",
    "DataProviderID": 1,
    "OperatorID": 74,
    "UsageTypeID": 1,
    "AddressInfo": {
        "ID": 132737,
        "Title": "Fastned Den Ruygen Hoek-Oost",
        "AddressLine1": "Den Ruygen Hoek-Oost A4",
        "Town": "Rijsenhout",
        "Postcode": "2132MA",
        "CountryID": 159,
        "Latitude": 52.25826430677844,
        "Longitude": 4.685957607546129,
        "RelatedURL": "http://fastned.nl/",
        "DistanceUnit": 0
    },
    "Connections": [
        {
            "ID": 185357,
            "ConnectionTypeID": 33,
            "StatusTypeID": 50,
            "LevelID": 3,
            "PowerKW": 175,
            "CurrentTypeID": 30,
            "Quantity": 4
        },
        {
            "ID": 185358,
            "ConnectionTypeID": 33,
            "StatusTypeID": 50,
            "LevelID": 3,
            "Amps": 125,
            "Voltage": 400,
            "PowerKW": 50,
            "CurrentTypeID": 30,
            "Quantity": 2
        },
        {
            "ID": 185359,
            "ConnectionTypeID": 2,
            "StatusTypeID": 50,
            "LevelID": 3,
            "PowerKW": 50,
            "CurrentTypeID": 30,
            "Quantity": 2
        },
        {
            "ID": 185360,
            "ConnectionTypeID": 1036,
            "StatusTypeID": 50,
            "LevelID": 3,
            "Amps": 63,
            "Voltage": 400,
            "PowerKW": 43,
            "CurrentTypeID": 20,
            "Quantity": 2
        }
    ],
    "NumberOfPoints": 8,
    "StatusTypeID": 50,
    "DateLastStatusUpdate": "2019-09-28T11:25:00Z",
    "DataQualityLevel": 1,
    "DateCreated": "2019-09-28T11:25:00Z",
    "SubmissionStatusTypeID": 200
}