{
    "UserComments": [
        {
            "ID": 17839,
            "ChargePointID": 92180,
            "CommentTypeID": 10,
            "UserName": "ForumElettrico.it",
            "Comment": "http://www.forumelettrico.it/forum/burger-king-settimo-cielo-retail-park-t1402.html\r\n",
            "DateCreated": "2017-10-22T08:11:54.247Z",
            "User": {
                "ID": 11749,
                "Username": "ForumElettrico.it"
            },
            "CheckinStatusTypeID": 0
        }
    ],
    "MediaItems": [
        {
            "ID": 13559,
            "ChargePointID": 92180,
            "ItemURL": "https://s3-ap-southeast-2.amazonaws.com/openchargemap/images/IT/OCM92180/OCM-92180.orig.2017102208121624.jpg",
            "ItemThumbnailURL": "https://s3-ap-southeast-2.amazonaws.com/openchargemap/images/IT/OCM92180/OCM-92180.thmb.2017102208121624.jpg",
            "Comment": "",
            "IsEnabled": true,
            "IsVideo": false,
            "IsFeaturedItem": false,
            "IsExternalResource": false,
            "User": {
                "ID": 11749,
                "Username": "ForumElettrico.it"
            },
            "DateCreated": "2017-10-22T08:12:00Z"
        }
    ],
    "IsRecentlyVerified": false,
    "ID": 92180,
    "UUID": "FD29C466-59B5-47AD-85FD-86822EB9F1AC",
    "DataProviderID": 1,
    "OperatorID": 1,
    "UsageTypeID": 0,
    "AddressInfo": {
        "ID": 92526,
        "Title": "Settimo Cielo Retail Park -  Burger King",
        "AddressLine1": "Via Niccolò Paganini",
        "Town": "Settimo Torinese ",
        "StateOrProvince": "TO",
        "Postcode": "10036 ",
        "CountryID": 112,
        "Latitude": 45.1366833681998,
        "Longitude": 7.73497947696592,
        "RelatedURL": "http://www.settimocieloretailpark.it",
        "DistanceUnit": 0
    },
    "Connections": [
        {
            "ID": 130692,
            "ConnectionTypeID": 25,
            "StatusTypeID": 50,
            "LevelID": 2,
            "Quantity": 2
        }
    ],
    "NumberOfPoints": 2,
    "StatusTypeID": 50,
    "DateLastStatusUpdate": "2017-10-22T08:12:00Z",
    "DataQualityLevel": 1,
    "DateCreated": "2017-08-29T15:47:00Z",
    "SubmissionStatusTypeID": 200
}