{
    "MediaItems": [
        {
            "ID": 25358,
            "ChargePointID": 169694,
            "ItemURL": "https://s3-ap-southeast-2.amazonaws.com/openchargemap/images/IT/OCM169694/OCM-169694.orig.2020110320505642.jpg",
            "ItemThumbnailURL": "https://s3-ap-southeast-2.amazonaws.com/openchargemap/images/IT/OCM169694/OCM-169694.thmb.2020110320505642.jpg",
            "Comment": "",
            "IsEnabled": true,
            "IsVideo": false,
            "IsFeaturedItem": false,
            "IsExternalResource": false,
            "User": {
                "ID": 27477,
                "Username": "AndreaL77"
            },
            "DateCreated": "2020-11-03T20:51:00Z"
        },
        {
            "ID": 25359,
            "ChargePointID": 169694,
            "ItemURL": "https://s3-ap-southeast-2.amazonaws.com/openchargemap/images/IT/OCM169694/OCM-169694.orig.2020110320512112.jpg",
            "ItemThumbnailURL": "https://s3-ap-southeast-2.amazonaws.com/openchargemap/images/IT/OCM169694/OCM-169694.thmb.2020110320512112.jpg",
            "Comment": "",
            "IsEnabled": true,
            "IsVideo": false,
            "IsFeaturedItem": false,
            "IsExternalResource": false,
            "User": {
                "ID": 27477,
                "Username": "AndreaL77"
            },
            "DateCreated": "2020-11-03T20:51:00Z"
        },
        {
            "ID": 25357,
            "ChargePointID": 169694,
            "ItemURL": "https://s3-ap-southeast-2.amazonaws.com/openchargemap/images/IT/OCM169694/OCM-169694.orig.2020110320502109.jpg",
            "ItemThumbnailURL": "https://s3-ap-southeast-2.amazonaws.com/openchargemap/images/IT/OCM169694/OCM-169694.thmb.2020110320502109.jpg",
            "Comment": "",
            "IsEnabled": true,
            "IsVideo": false,
            "IsFeaturedItem": false,
            "IsExternalResource": false,
            "User": {
                "ID": 27477,
                "Username": "AndreaL77"
            },
            "DateCreated": "2020-11-03T20:50:00Z"
        }
    ],
    "IsRecentlyVerified": false,
    "ID": 169694,
    "UUID": "E1C8F156-0038-4ECF-8156-186FDA473E16",
    "DataProviderID": 1,
    "OperatorID": 3382,
    "UsageTypeID": 4,
    "UsageCost": "0,35",
    "AddressInfo": {
        "ID": 170053,
        "Title": "Ressolar Somma Lombardo Maspero ",
        "AddressLine1": "Viale Ugo Maspero",
        "AddressLine2": "Piazza Stazione",
        "Town": "Somma Lombardo",
        "StateOrProvince": "VA",
        "Postcode": "21019",
        "CountryID": 112,
        "Latitude": 45.68628882005791,
        "Longitude": 8.712714731033316,
        "DistanceUnit": 0
    },
    "Connections": [
        {
            "ID": 258429,
            "ConnectionTypeID": 25,
            "StatusTypeID": 50,
            "LevelID": 2,
            "Amps": 32,
            "Voltage": 400,
            "PowerKW": 22,
            "CurrentTypeID": 20,
            "Quantity": 2
        }
    ],
    "NumberOfPoints": 2,
    "StatusTypeID": 50,
    "DateLastStatusUpdate": "2020-11-03T20:51:00Z",
    "DataQualityLevel": 1,
    "DateCreated": "2020-11-01T10:42:00Z",
    "SubmissionStatusTypeID": 200
}