{
    "IsRecentlyVerified": false,
    "ID": 182252,
    "UUID": "F6B979D8-224B-48F2-B25C-7730EF7DF66F",
    "DataProviderID": 29,
    "DataProvidersReference": "7871",
    "AddressInfo": {
        "ID": 182611,
        "Title": "Pont-Labbe-Platz",
        "AddressLine1": "Pont-Labbe-Platz",
        "Town": "Schleiden",
        "Postcode": "53937",
        "CountryID": 87,
        "Latitude": 50.528918,
        "Longitude": 6.477087,
        "DistanceUnit": 0
    },
    "Connections": [
        {
            "ID": 287763,
            "ConnectionTypeID": 28,
            "StatusTypeID": 50,
            "LevelID": 2,
            "PowerKW": 22,
            "CurrentTypeID": 20
        },
        {
            "ID": 287764,
            "ConnectionTypeID": 25,
            "StatusTypeID": 50,
            "LevelID": 2,
            "PowerKW": 22,
            "CurrentTypeID": 20
        },
        {
            "ID": 297868,
            "ConnectionTypeID": 28,
            "StatusTypeID": 50,
            "LevelID": 2,
            "PowerKW": 22,
            "CurrentTypeID": 20
        },
        {
            "ID": 297869,
            "ConnectionTypeID": 25,
            "StatusTypeID": 50,
            "LevelID": 2,
            "PowerKW": 22,
            "CurrentTypeID": 20
        }
    ],
    "StatusTypeID": 50,
    "DateLastStatusUpdate": "2021-07-12T02:45:00Z",
    "MetadataValues": [
        {
            "ID": 14546,
            "MetadataFieldID": 4,
            "ItemValue": "Data from the German chargepoint registry provided by Bundesnetzagentur.de under the CC-BY 4.0 license"
        }
    ],
    "DataQualityLevel": 3,
    "DateCreated": "2021-07-08T10:02:00Z",
    "SubmissionStatusTypeID": 100
}