{
    "IsRecentlyVerified": false,
    "ID": 72860,
    "UUID": "FEAF65F9-12CD-425F-A58A-F0F326F2D0EB",
    "DataProviderID": 2,
    "DataProvidersReference": "78968",
    "UsageTypeID": 1,
    "AddressInfo": {
        "ID": 73206,
        "Title": "Hawaii Palm Properties",
        "AddressLine1": "54-3848 Akoni Pule Hwy",
        "Town": "Kapaau",
        "StateOrProvince": "HI",
        "Postcode": "96755",
        "CountryID": 2,
        "Latitude": 20.230873,
        "Longitude": -155.801962,
        "ContactTelephone1": "808-557-0354",
        "AccessComments": "24 hours daily",
        "RelatedURL": "",
        "DistanceUnit": 0
    },
    "Connections": [
        {
            "ID": 104524,
            "ConnectionTypeID": 1,
            "LevelID": 2,
            "Amps": 16,
            "Voltage": 230,
            "PowerKW": 3,
            "CurrentTypeID": 10,
            "Quantity": 1
        }
    ],
    "DateLastStatusUpdate": "2019-04-06T04:01:00Z",
    "DataQualityLevel": 3,
    "DateCreated": "2016-11-01T13:06:00Z",
    "SubmissionStatusTypeID": 100
}