{
    "IsRecentlyVerified": false,
    "ID": 15264,
    "UUID": "44169C2A-9235-4AF7-8A35-AA70F08C9E91",
    "DataProviderID": 1,
    "OperatorID": 1,
    "UsageTypeID": 4,
    "UsageCost": "Free",
    "AddressInfo": {
        "ID": 15610,
        "Title": "Parking Centre Administratif",
        "AddressLine1": "Rue Louis Notari",
        "AddressLine2": "",
        "Town": "la Condamine",
        "StateOrProvince": "",
        "Postcode": "",
        "CountryID": 149,
        "Latitude": 43.73491,
        "Longitude": 7.420411,
        "ContactTelephone1": "+377 98 98 82 92",
        "ContactTelephone2": "",
        "ContactEmail": "",
        "AccessComments": " emplacements sont signalés par un panneau vert apposé sur le mur du parking.",
        "RelatedURL": "https://www.monaco-parkings.mc/",
        "DistanceUnit": 0
    },
    "Connections": [
        {
            "ID": 13570,
            "ConnectionTypeID": 0,
            "StatusTypeID": 0,
            "Amps": 20,
            "Quantity": 1
        }
    ],
    "NumberOfPoints": 1,
    "GeneralComments": " Parking réservé aux abonnés en emplacements réservés, et aux détenteurs de cartes Multiparc à décompte au Self Service",
    "StatusTypeID": 50,
    "DateLastStatusUpdate": "2012-12-29T17:59:00Z",
    "DataQualityLevel": 1,
    "DateCreated": "2012-12-29T17:23:00Z",
    "SubmissionStatusTypeID": 200
}