{
    "IsRecentlyVerified": false,
    "ID": 85050,
    "UUID": "AF13EF8B-7F80-427F-9982-D46D3B2CD2F1",
    "DataProviderID": 1,
    "OperatorID": 189,
    "UsageTypeID": 4,
    "AddressInfo": {
        "ID": 85396,
        "Title": "Marktplatz",
        "AddressLine1": "Marktplatz 25",
        "Town": "Vohenstrauß",
        "StateOrProvince": "Landkreis Neustadt an der Waldnaab",
        "Postcode": "92648",
        "CountryID": 87,
        "Latitude": 49.62422,
        "Longitude": 12.340910000000008,
        "AccessComments": "24/7 open",
        "DistanceUnit": 0
    },
    "Connections": [
        {
            "ID": 120802,
            "ConnectionTypeID": 25,
            "StatusTypeID": 50,
            "LevelID": 2,
            "Amps": 32,
            "Voltage": 400,
            "PowerKW": 22,
            "CurrentTypeID": 20,
            "Quantity": 2
        }
    ],
    "NumberOfPoints": 2,
    "StatusTypeID": 50,
    "DateLastStatusUpdate": "2017-03-24T11:41:00Z",
    "DataQualityLevel": 1,
    "DateCreated": "2017-03-24T11:41:00Z",
    "SubmissionStatusTypeID": 200
}