{
    "IsRecentlyVerified": false,
    "ID": 39202,
    "UUID": "A98628A2-A3B9-4FEA-879E-7FD3644D7748",
    "DataProviderID": 1,
    "OperatorID": 156,
    "OperatorsReference": "NewMotion 02009398",
    "UsageTypeID": 4,
    "UsageCost": "",
    "AddressInfo": {
        "ID": 39548,
        "Title": "Holzmühlenstraße 5A",
        "AddressLine1": "Holzmühlenstraße 5A",
        "AddressLine2": "",
        "Town": "Hamburg",
        "StateOrProvince": "",
        "Postcode": "22041",
        "CountryID": 87,
        "Latitude": 53.5773432,
        "Longitude": 10.0824514999999,
        "ContactTelephone1": "",
        "ContactTelephone2": "",
        "ContactEmail": "",
        "AccessComments": "",
        "RelatedURL": "",
        "DistanceUnit": 0
    },
    "Connections": [
        {
            "ID": 42713,
            "ConnectionTypeID": 25,
            "StatusTypeID": 0,
            "LevelID": 2,
            "PowerKW": 37,
            "CurrentTypeID": 10
        }
    ],
    "NumberOfPoints": 1,
    "GeneralComments": "",
    "StatusTypeID": 50,
    "DateLastStatusUpdate": "2015-06-12T21:51:00Z",
    "DataQualityLevel": 3,
    "DateCreated": "2015-01-09T06:08:00Z",
    "SubmissionStatusTypeID": 200
}