{
    "IsRecentlyVerified": false,
    "ID": 84486,
    "UUID": "872BA133-6B24-4618-9F9A-773CAD73DA76",
    "DataProviderID": 1,
    "OperatorID": 45,
    "UsageTypeID": 6,
    "AddressInfo": {
        "ID": 84832,
        "Title": "Waldhotel Felschbachhof",
        "AddressLine1": "Felschbachhof 1",
        "Town": "Ulmet",
        "StateOrProvince": "Altenglan",
        "Postcode": "66887",
        "CountryID": 87,
        "Latitude": 49.58380400000001,
        "Longitude": 7.446664999999939,
        "ContactTelephone1": "+49 6387 9110",
        "AccessComments": "Tesla Destination Charging Location for guests after hotel reservation.",
        "RelatedURL": "http://www.felschbachhof.de/",
        "DistanceUnit": 0
    },
    "Connections": [
        {
            "ID": 119954,
            "ConnectionTypeID": 25,
            "StatusTypeID": 50,
            "LevelID": 2,
            "Amps": 16,
            "Voltage": 400,
            "PowerKW": 11,
            "CurrentTypeID": 20,
            "Quantity": 2
        }
    ],
    "NumberOfPoints": 2,
    "StatusTypeID": 50,
    "DateLastStatusUpdate": "2017-03-01T07:15:00Z",
    "DataQualityLevel": 1,
    "DateCreated": "2017-03-01T07:15:00Z",
    "SubmissionStatusTypeID": 200
}