{
    "IsRecentlyVerified": false,
    "ID": 120640,
    "UUID": "613A9723-7538-4605-8E3F-5E9DFE59EC0F",
    "DataProviderID": 2,
    "DataProvidersReference": "60707",
    "UsageTypeID": 2,
    "AddressInfo": {
        "ID": 120986,
        "Title": "Alabama Power - Pelham",
        "AddressLine1": "2 Industrial Park Dr",
        "Town": "Pelham",
        "StateOrProvince": "AL",
        "Postcode": "35124",
        "CountryID": 2,
        "Latitude": 33.296045,
        "Longitude": -86.814196,
        "ContactTelephone1": "",
        "AccessComments": "",
        "RelatedURL": "",
        "DistanceUnit": 0
    },
    "Connections": [
        {
            "ID": 170004,
            "ConnectionTypeID": 1,
            "LevelID": 2,
            "Amps": 16,
            "Voltage": 230,
            "PowerKW": 3.7,
            "CurrentTypeID": 10,
            "Quantity": 1
        }
    ],
    "DateLastStatusUpdate": "2020-06-26T02:55:00Z",
    "DataQualityLevel": 3,
    "DateCreated": "2019-04-01T04:59:00Z",
    "SubmissionStatusTypeID": 100
}