{
    "IsRecentlyVerified": false,
    "ID": 104317,
    "UUID": "6B492170-0E05-40A4-AED8-66F19E6194B0",
    "DataProviderID": 1,
    "OperatorID": 105,
    "UsageTypeID": 4,
    "AddressInfo": {
        "ID": 104663,
        "Title": "enviaM",
        "AddressLine1": "Steinkreuzweg 9",
        "Town": "Naumburg (Saale)",
        "StateOrProvince": "Burgenlandkreis",
        "Postcode": "06618",
        "CountryID": 87,
        "Latitude": 51.14315995035943,
        "Longitude": 11.824714083328217,
        "AccessComments": "24/7 verfügbare Ladesäule auf dem Parkplatz westlich vom Gebäude.",
        "DistanceUnit": 0
    },
    "Connections": [
        {
            "ID": 147284,
            "ConnectionTypeID": 1036,
            "StatusTypeID": 50,
            "LevelID": 2,
            "Amps": 32,
            "Voltage": 400,
            "PowerKW": 22,
            "CurrentTypeID": 20,
            "Quantity": 3
        },
        {
            "ID": 147285,
            "ConnectionTypeID": 2,
            "StatusTypeID": 50,
            "LevelID": 3,
            "PowerKW": 50,
            "CurrentTypeID": 30,
            "Quantity": 1
        },
        {
            "ID": 147286,
            "ConnectionTypeID": 33,
            "StatusTypeID": 50,
            "LevelID": 3,
            "PowerKW": 50,
            "CurrentTypeID": 30,
            "Quantity": 1
        }
    ],
    "NumberOfPoints": 5,
    "StatusTypeID": 50,
    "DateLastStatusUpdate": "2018-05-18T07:52:00Z",
    "DataQualityLevel": 1,
    "DateCreated": "2018-05-18T07:52:00Z",
    "SubmissionStatusTypeID": 200
}