{
    "IsRecentlyVerified": false,
    "ID": 87387,
    "UUID": "E33B2D0E-2556-4EA7-89D2-B8A3192C6A79",
    "DataProviderID": 1,
    "OperatorID": 23,
    "OperatorsReference": "29204",
    "UsageTypeID": 4,
    "AddressInfo": {
        "ID": 87733,
        "Title": "Ristorante Piccolo Lago",
        "AddressLine1": "87 Via Turati",
        "Town": "Verbania",
        "Postcode": "28924",
        "CountryID": 112,
        "Latitude": 45.95803,
        "Longitude": 8.47251,
        "ContactTelephone1": "+39 0323 586 792",
        "DistanceUnit": 0
    },
    "Connections": [
        {
            "ID": 123882,
            "ConnectionTypeID": 30,
            "StatusTypeID": 50,
            "LevelID": 2,
            "Amps": 32,
            "Voltage": 400,
            "PowerKW": 22,
            "CurrentTypeID": 20,
            "Quantity": 1
        }
    ],
    "NumberOfPoints": 1,
    "GeneralComments": "1 Tesla Connector, up to 22kW.Available for customers. Please call ahead.Seasonal availability. Please call ahead.",
    "StatusTypeID": 50,
    "DateLastStatusUpdate": "2018-10-03T22:37:00Z",
    "DataQualityLevel": 1,
    "DateCreated": "2017-05-06T05:27:00Z",
    "SubmissionStatusTypeID": 200
}