{
    "IsRecentlyVerified": false,
    "ID": 61408,
    "UUID": "EDF81D42-5724-4D51-820B-D409BE35AFF4",
    "DataProviderID": 1,
    "DataProvidersReference": "3269",
    "AddressInfo": {
        "ID": 61754,
        "Title": "Hiabin toimipiste",
        "AddressLine1": "Nesteentie 36",
        "Town": "Raisio Keskus",
        "StateOrProvince": "Varsinais-Suomi",
        "Postcode": "21200",
        "CountryID": 79,
        "Latitude": 60.4733,
        "Longitude": 22.14921,
        "AccessComments": "Yrityksen tai yhteisön omalla parkkialueella tai -hallissa",
        "DistanceUnit": 0
    },
    "Connections": [
        {
            "ID": 78204,
            "ConnectionTypeID": 0,
            "Reference": "1",
            "LevelID": 2,
            "Amps": 32,
            "Voltage": 400,
            "PowerKW": 22,
            "Comments": "Mode 3"
        },
        {
            "ID": 86967,
            "ConnectionTypeID": 0,
            "Reference": "2",
            "LevelID": 2,
            "Amps": 32,
            "Voltage": 400,
            "PowerKW": 22,
            "Comments": "Mode 3"
        },
        {
            "ID": 86968,
            "ConnectionTypeID": 0,
            "Reference": "3",
            "LevelID": 2,
            "Amps": 32,
            "Voltage": 400,
            "PowerKW": 22,
            "Comments": "Mode 3"
        },
        {
            "ID": 89061,
            "ConnectionTypeID": 0,
            "Reference": "4",
            "LevelID": 2,
            "Amps": 32,
            "Voltage": 400,
            "PowerKW": 22,
            "Comments": "Mode 3"
        }
    ],
    "NumberOfPoints": 4,
    "DateLastStatusUpdate": "2020-05-26T08:24:00Z",
    "DataQualityLevel": 2,
    "DateCreated": "2016-02-27T02:32:00Z",
    "SubmissionStatusTypeID": 100
}