{
    "IsRecentlyVerified": false,
    "ID": 20382,
    "UUID": "1B8CC74F-878F-483A-93E6-1316357AC899",
    "DataProviderID": 1,
    "OperatorID": 1,
    "UsageTypeID": 0,
    "AddressInfo": {
        "ID": 20727,
        "Title": "Centre commercial Nice Etoile",
        "AddressLine1": "Boulevard Dubouchage / rue Lamartine",
        "Town": "Nice",
        "Postcode": "06000",
        "CountryID": 80,
        "Latitude": 43.70366,
        "Longitude": 7.26803,
        "AccessComments": "Ouvert à tous",
        "DistanceUnit": 0
    },
    "Connections": [],
    "StatusTypeID": 50,
    "DateLastStatusUpdate": "2018-03-23T15:55:00Z",
    "DataQualityLevel": 1,
    "DateCreated": "2013-11-13T11:36:00Z",
    "SubmissionStatusTypeID": 200
}