{
    "IsRecentlyVerified": false,
    "ID": 183544,
    "UUID": "AB6CB34A-78F6-4E9C-A2E2-B9D45633A45B",
    "DataProviderID": 29,
    "DataProvidersReference": "7810",
    "OperatorID": 86,
    "AddressInfo": {
        "ID": 183903,
        "Title": "BAB81; Autobahnraststätte Ob der Tauber West",
        "AddressLine1": "BAB81; Autobahnraststätte Ob der Tauber West",
        "Town": "Grünsfeld",
        "Postcode": "97947",
        "CountryID": 87,
        "Latitude": 49.626722,
        "Longitude": 9.728162,
        "DistanceUnit": 0
    },
    "Connections": [
        {
            "ID": 290658,
            "ConnectionTypeID": 1036,
            "StatusTypeID": 50,
            "LevelID": 3,
            "PowerKW": 43,
            "CurrentTypeID": 20
        },
        {
            "ID": 290659,
            "ConnectionTypeID": 33,
            "StatusTypeID": 50,
            "LevelID": 3,
            "PowerKW": 50,
            "CurrentTypeID": 30
        }
    ],
    "StatusTypeID": 50,
    "DateLastStatusUpdate": "2021-07-12T02:43:00Z",
    "MetadataValues": [
        {
            "ID": 15837,
            "MetadataFieldID": 4,
            "ItemValue": "Data from the German chargepoint registry provided by Bundesnetzagentur.de under the CC-BY 4.0 license"
        }
    ],
    "DataQualityLevel": 3,
    "DateCreated": "2021-07-08T10:04:00Z",
    "SubmissionStatusTypeID": 100
}