{
    "IsRecentlyVerified": false,
    "ID": 184926,
    "UUID": "C97088BC-8E57-4559-87DD-C6369F3FFBB9",
    "DataProviderID": 29,
    "DataProvidersReference": "20536",
    "AddressInfo": {
        "ID": 185285,
        "Title": "An der Friedensburg neben 16",
        "AddressLine1": "An der Friedensburg neben 16",
        "Town": "Geilenkirchen",
        "Postcode": "52511",
        "CountryID": 87,
        "Latitude": 50.96181,
        "Longitude": 6.12716,
        "DistanceUnit": 0
    },
    "Connections": [
        {
            "ID": 293796,
            "ConnectionTypeID": 25,
            "StatusTypeID": 50,
            "LevelID": 2,
            "PowerKW": 22,
            "CurrentTypeID": 20
        },
        {
            "ID": 293797,
            "ConnectionTypeID": 25,
            "StatusTypeID": 50,
            "LevelID": 2,
            "PowerKW": 22,
            "CurrentTypeID": 20
        }
    ],
    "StatusTypeID": 50,
    "DateLastStatusUpdate": "2021-07-12T02:46:00Z",
    "MetadataValues": [
        {
            "ID": 17217,
            "MetadataFieldID": 4,
            "ItemValue": "Data from the German chargepoint registry provided by Bundesnetzagentur.de under the CC-BY 4.0 license"
        }
    ],
    "DataQualityLevel": 3,
    "DateCreated": "2021-07-08T10:06:00Z",
    "SubmissionStatusTypeID": 100
}