{
    "IsRecentlyVerified": false,
    "ID": 183996,
    "UUID": "A3BA8602-BA32-4FF3-A30D-D6516B7CEE55",
    "DataProviderID": 29,
    "DataProvidersReference": "18573,841",
    "OperatorID": 3437,
    "AddressInfo": {
        "ID": 184355,
        "Title": "Karmannstraße 1",
        "AddressLine1": "Karmannstraße 1",
        "Town": "Osnabrück",
        "Postcode": "49084",
        "CountryID": 87,
        "Latitude": 52.265467,
        "Longitude": 8.0714,
        "DistanceUnit": 0
    },
    "Connections": [
        {
            "ID": 291671,
            "ConnectionTypeID": 25,
            "StatusTypeID": 50,
            "LevelID": 2,
            "PowerKW": 11,
            "CurrentTypeID": 20
        },
        {
            "ID": 291672,
            "ConnectionTypeID": 25,
            "StatusTypeID": 50,
            "LevelID": 2,
            "PowerKW": 11,
            "CurrentTypeID": 20
        },
        {
            "ID": 291673,
            "ConnectionTypeID": 25,
            "StatusTypeID": 50,
            "LevelID": 2,
            "PowerKW": 11,
            "CurrentTypeID": 20
        },
        {
            "ID": 291674,
            "ConnectionTypeID": 25,
            "StatusTypeID": 50,
            "LevelID": 2,
            "PowerKW": 11,
            "CurrentTypeID": 20
        }
    ],
    "StatusTypeID": 50,
    "DateLastStatusUpdate": "2021-07-09T03:26:00Z",
    "MetadataValues": [
        {
            "ID": 16289,
            "MetadataFieldID": 4,
            "ItemValue": "Data from the German chargepoint registry provided by Bundesnetzagentur.de under the CC-BY 4.0 license"
        }
    ],
    "DataQualityLevel": 3,
    "DateCreated": "2021-07-08T10:04:00Z",
    "SubmissionStatusTypeID": 100
}