{
    "IsRecentlyVerified": false,
    "ID": 60457,
    "UUID": "46457860-94D1-4747-96E0-A9369060F6B0",
    "DataProviderID": 1,
    "OperatorID": 3,
    "OperatorsReference": "PG-80422,PG-90757",
    "UsageTypeID": 2,
    "UsageCost": "Free",
    "AddressInfo": {
        "ID": 60803,
        "Title": "Academic Building, Bath Spa University",
        "AddressLine1": "Bath Spa University",
        "Town": "Newton Saint Loe",
        "StateOrProvince": "Bath & North East Somerset",
        "Postcode": "BA2 9BN",
        "CountryID": 1,
        "Latitude": 51.3778232,
        "Longitude": -2.43764609999994,
        "DistanceUnit": 0
    },
    "Connections": [
        {
            "ID": 76587,
            "ConnectionTypeID": 25,
            "StatusTypeID": 50,
            "LevelID": 2,
            "Amps": 32,
            "Voltage": 230,
            "PowerKW": 7,
            "CurrentTypeID": 10,
            "Quantity": 3
        }
    ],
    "NumberOfPoints": 3,
    "StatusTypeID": 50,
    "DateLastStatusUpdate": "2019-05-13T11:44:00Z",
    "DataQualityLevel": 1,
    "DateCreated": "2016-01-26T09:59:00Z",
    "SubmissionStatusTypeID": 200
}