{
    "IsRecentlyVerified": false,
    "ID": 139622,
    "UUID": "FF6576F6-7C21-49DA-82D3-6549E8E261A6",
    "DataProviderID": 2,
    "DataProvidersReference": "96800",
    "UsageTypeID": 2,
    "AddressInfo": {
        "ID": 139974,
        "Title": "City of Santa Monica - Lot 26",
        "AddressLine1": "2303 Neilson Way",
        "Town": "Santa Monica",
        "StateOrProvince": "CA",
        "Postcode": "90405",
        "CountryID": 2,
        "Latitude": 34,
        "Longitude": -118.49583,
        "ContactTelephone1": "310-458-8529",
        "AccessComments": "24 hours daily; pay lot",
        "RelatedURL": "",
        "DistanceUnit": 0
    },
    "Connections": [
        {
            "ID": 195044,
            "ConnectionTypeID": 1,
            "LevelID": 2,
            "Amps": 16,
            "Voltage": 230,
            "PowerKW": 3.7,
            "CurrentTypeID": 10,
            "Quantity": 1
        }
    ],
    "GeneralComments": "Planned for future date. Not Operational.",
    "DatePlanned": "2019-07-01T00:00:00Z",
    "StatusTypeID": 150,
    "DateLastStatusUpdate": "2020-06-26T02:56:00Z",
    "DataQualityLevel": 3,
    "DateCreated": "2019-12-24T09:11:00Z",
    "SubmissionStatusTypeID": 100
}