{
    "IsRecentlyVerified": false,
    "ID": 136898,
    "UUID": "AC30D2AB-0C57-4245-88C1-9AB6013CECE7",
    "DataProviderID": 18,
    "DataProvidersReference": "f7692655e08cdfa2dc55b19495e34fd7",
    "OperatorID": 20,
    "UsageTypeID": 4,
    "AddressInfo": {
        "ID": 137244,
        "Title": "Newcastle Upon Tyne",
        "AddressLine1": "Blackhall Mill",
        "AddressLine2": "Newcastle Upon Tyne",
        "Town": "Gateshead",
        "Postcode": "NE17 7TQ",
        "CountryID": 1,
        "Latitude": 54.905493,
        "Longitude": -1.815635,
        "AccessComments": "Blackhall Mill Community Centre",
        "RelatedURL": "http://www.chargeyourcar.org.uk",
        "DistanceUnit": 0
    },
    "Connections": [
        {
            "ID": 191587,
            "ConnectionTypeID": 25,
            "Reference": "0",
            "StatusTypeID": 50,
            "LevelID": 2,
            "Amps": 32,
            "Voltage": 230,
            "PowerKW": 7,
            "CurrentTypeID": 10
        },
        {
            "ID": 191588,
            "ConnectionTypeID": 25,
            "Reference": "1",
            "StatusTypeID": 50,
            "LevelID": 2,
            "Amps": 32,
            "Voltage": 230,
            "PowerKW": 7,
            "CurrentTypeID": 10
        }
    ],
    "StatusTypeID": 0,
    "DateLastStatusUpdate": "2019-12-24T05:23:00Z",
    "MetadataValues": [
        {
            "ID": 6750,
            "MetadataFieldID": 4,
            "ItemValue": "Contains public sector information licensed under the Open Government Licence v2.0. http://www.nationalarchives.gov.uk/doc/open-government-licence/version/2/"
        }
    ],
    "DataQualityLevel": 3,
    "DateCreated": "2019-12-24T05:23:00Z",
    "SubmissionStatusTypeID": 100
}