{
    "UserComments": [
        {
            "ID": 17344,
            "ChargePointID": 88337,
            "CommentTypeID": 10,
            "UserName": "polianto",
            "Comment": "Normalmente spenti, si deve chiedere l'attivazione alla reception",
            "Rating": 5,
            "DateCreated": "2017-05-28T18:55:37.403Z",
            "User": {
                "ID": 1606,
                "Username": "polianto"
            },
            "CheckinStatusTypeID": 10
        }
    ],
    "MediaItems": [
        {
            "ID": 12598,
            "ChargePointID": 88337,
            "ItemURL": "https://s3-ap-southeast-2.amazonaws.com/openchargemap/images/IT/OCM88337/OCM-88337.orig.2017052818544525.jpg",
            "ItemThumbnailURL": "https://s3-ap-southeast-2.amazonaws.com/openchargemap/images/IT/OCM88337/OCM-88337.thmb.2017052818544525.jpg",
            "Comment": "",
            "IsEnabled": true,
            "IsVideo": false,
            "IsFeaturedItem": false,
            "IsExternalResource": false,
            "User": {
                "ID": 1606,
                "Username": "polianto"
            },
            "DateCreated": "2017-05-28T18:55:00Z"
        }
    ],
    "IsRecentlyVerified": false,
    "ID": 88337,
    "UUID": "9E2035C4-870D-4733-80E2-807A0DB0A9FF",
    "DataProviderID": 1,
    "OperatorID": 45,
    "UsageTypeID": 6,
    "UsageCost": "free",
    "AddressInfo": {
        "ID": 88683,
        "Title": "Hotel Garni Liberty",
        "AddressLine1": "Vicolo Nord, 1",
        "Town": "Bellinzona",
        "StateOrProvince": "Distretto di Bellinzona",
        "Postcode": "6500",
        "CountryID": 217,
        "Latitude": 46.2147895194582,
        "Longitude": 9.03971574353442,
        "ContactTelephone1": "+41 091 825 19 19",
        "ContactEmail": "info@hotelliberty.ch",
        "RelatedURL": "http://www.hotelliberty.ch/",
        "DistanceUnit": 0
    },
    "Connections": [
        {
            "ID": 125303,
            "ConnectionTypeID": 1036,
            "StatusTypeID": 50,
            "LevelID": 2,
            "Amps": 32,
            "Voltage": 400,
            "PowerKW": 22,
            "CurrentTypeID": 20,
            "Quantity": 2
        }
    ],
    "NumberOfPoints": 2,
    "GeneralComments": "Wallbox Tesla utilizzabili da tutte le auto elettriche",
    "StatusTypeID": 50,
    "DateLastStatusUpdate": "2017-05-29T21:15:00Z",
    "DataQualityLevel": 1,
    "DateCreated": "2017-05-28T18:55:00Z",
    "SubmissionStatusTypeID": 200
}