{
    "IsRecentlyVerified": false,
    "ID": 57441,
    "UUID": "A3038EF2-B3C9-4D6C-AAC2-81CA34FECF0B",
    "DataProviderID": 1,
    "OperatorID": 1,
    "UsageTypeID": 1,
    "AddressInfo": {
        "ID": 57787,
        "Title": "Rathaus",
        "AddressLine1": "Marktplatz",
        "Town": "Weißwasser/O.L.",
        "StateOrProvince": "Weißwasser/O.L.",
        "Postcode": "02943",
        "CountryID": 87,
        "Latitude": 51.5054848,
        "Longitude": 14.6462048999999,
        "AccessComments": "Auf dem neu gestalteten Marktplatz. Details unbekannt.\r\n\r\n\r\n",
        "DistanceUnit": 0
    },
    "Connections": [
        {
            "ID": 72550,
            "ConnectionTypeID": 25,
            "StatusTypeID": 50,
            "LevelID": 2,
            "Amps": 16,
            "Voltage": 230,
            "PowerKW": 3.7,
            "CurrentTypeID": 10,
            "Quantity": 2
        }
    ],
    "NumberOfPoints": 2,
    "StatusTypeID": 50,
    "DateLastStatusUpdate": "2015-11-30T16:53:00Z",
    "DataQualityLevel": 1,
    "DateCreated": "2015-11-30T11:58:00Z",
    "SubmissionStatusTypeID": 200
}