{
    "IsRecentlyVerified": false,
    "ID": 34335,
    "UUID": "4DA407C1-FC72-41B6-8300-9A12D02251CF",
    "DataProviderID": 26,
    "DataProvidersReference": "48051",
    "OperatorID": 178,
    "OperatorsReference": "EVnetNL DB0292",
    "UsageCost": "0.00 jaarabonnement",
    "AddressInfo": {
        "ID": 34681,
        "Title": "Geert Grootelaan 181",
        "AddressLine1": "Geert Grootelaan 181",
        "Town": "Vlaardingen",
        "Postcode": "3132 CC",
        "CountryID": 159,
        "Latitude": 51.906664,
        "Longitude": 4.311424,
        "ContactTelephone1": "0800-3522365",
        "RelatedURL": "http://www.evnet.nl",
        "DistanceUnit": 0
    },
    "Connections": [
        {
            "ID": 37846,
            "ConnectionTypeID": 25,
            "LevelID": 2,
            "PowerKW": 11,
            "CurrentTypeID": 10
        }
    ],
    "NumberOfPoints": 2,
    "StatusTypeID": 50,
    "DateLastStatusUpdate": "2016-06-04T02:42:00Z",
    "DataQualityLevel": 3,
    "DateCreated": "2015-01-09T06:04:00Z",
    "SubmissionStatusTypeID": 100
}