{
    "IsRecentlyVerified": false,
    "ID": 95621,
    "UUID": "D1A27D04-9736-49A3-AB6E-D6E813D59A9D",
    "DataProviderID": 1,
    "OperatorID": 3,
    "OperatorsReference": "PG-81584",
    "UsageTypeID": 6,
    "UsageCost": "Free",
    "AddressInfo": {
        "ID": 95967,
        "Title": "Ken Wilkins Print LTD",
        "AddressLine1": "Private Road Number 1",
        "Town": "Nottingham",
        "Postcode": "NG4 2JQ",
        "CountryID": 1,
        "Latitude": 52.959898,
        "Longitude": -1.079539,
        "DistanceUnit": 0
    },
    "Connections": [
        {
            "ID": 135444,
            "ConnectionTypeID": 25,
            "StatusTypeID": 50,
            "LevelID": 2,
            "Amps": 32,
            "Voltage": 230,
            "PowerKW": 7,
            "CurrentTypeID": 10,
            "Quantity": 2
        }
    ],
    "NumberOfPoints": 2,
    "GeneralComments": "This is an open charge unit installed at the Ken Wilkins Print Ltd site in Colwick Industrial Estate, Netherfield, Nottingham",
    "StatusTypeID": 50,
    "DateLastStatusUpdate": "2017-12-18T06:52:00Z",
    "DataQualityLevel": 1,
    "DateCreated": "2017-11-15T17:59:00Z",
    "SubmissionStatusTypeID": 200
}