{
    "IsRecentlyVerified": false,
    "ID": 80193,
    "UUID": "68C3FD80-B738-4EAC-8054-DFF5D2963777",
    "DataProviderID": 2,
    "DataProvidersReference": "80940",
    "OperatorID": 39,
    "UsageTypeID": 4,
    "AddressInfo": {
        "ID": 80539,
        "Title": "Hanford High",
        "AddressLine1": "120 E. Grangeville Boulevard",
        "Town": "Hanford",
        "StateOrProvince": "CA",
        "Postcode": "93230",
        "CountryID": 2,
        "Latitude": 36.3426862,
        "Longitude": -119.6456724,
        "ContactTelephone1": "800-663-5633",
        "AccessComments": "MO: Not Specified; TU: Not Specified; WE: Not Specified; TH: Not Specified; FR: Not Specified; SA: Not Specified; SU: Not Specified",
        "RelatedURL": "http://www.semacharge.com/",
        "DistanceUnit": 0
    },
    "Connections": [
        {
            "ID": 114859,
            "ConnectionTypeID": 1,
            "LevelID": 2,
            "Amps": 16,
            "Voltage": 230,
            "PowerKW": 3,
            "CurrentTypeID": 10,
            "Quantity": 2
        }
    ],
    "DateLastStatusUpdate": "2019-04-06T04:02:00Z",
    "DataQualityLevel": 3,
    "DateCreated": "2017-01-31T01:05:00Z",
    "SubmissionStatusTypeID": 100
}