{
    "IsRecentlyVerified": false,
    "ID": 87823,
    "UUID": "13040876-2437-45B6-918C-80D9F2586409",
    "DataProviderID": 1,
    "DataProvidersReference": "3995",
    "AddressInfo": {
        "ID": 88169,
        "Title": "Främby Gård 1",
        "AddressLine1": "Torkils väg 1",
        "Town": "FALUN",
        "StateOrProvince": "DALARNA",
        "Postcode": "79152",
        "CountryID": 216,
        "Latitude": 60.58936,
        "Longitude": 15.65298,
        "AccessComments": "",
        "DistanceUnit": 0
    },
    "Connections": [
        {
            "ID": 124544,
            "ConnectionTypeID": 0,
            "Reference": "1",
            "LevelID": 2,
            "Amps": 32,
            "Voltage": 400,
            "PowerKW": 22,
            "Comments": "Mode 3"
        },
        {
            "ID": 124545,
            "ConnectionTypeID": 0,
            "Reference": "2",
            "LevelID": 2,
            "Amps": 32,
            "Voltage": 400,
            "PowerKW": 22,
            "Comments": "Mode 3"
        },
        {
            "ID": 124546,
            "ConnectionTypeID": 0,
            "Reference": "3",
            "LevelID": 2,
            "Amps": 32,
            "Voltage": 230,
            "PowerKW": 7.4,
            "Comments": "Mode 3"
        },
        {
            "ID": 124547,
            "ConnectionTypeID": 0,
            "Reference": "4",
            "LevelID": 2,
            "Amps": 32,
            "Voltage": 230,
            "PowerKW": 7.4,
            "Comments": "Mode 3"
        }
    ],
    "NumberOfPoints": 4,
    "DateLastStatusUpdate": "2020-05-26T08:24:00Z",
    "DataQualityLevel": 2,
    "DateCreated": "2017-05-16T11:07:00Z",
    "SubmissionStatusTypeID": 100
}