{
    "IsRecentlyVerified": false,
    "ID": 141722,
    "UUID": "19F7C833-D80C-4B3A-8244-E8569B6663E3",
    "DataProviderID": 2,
    "DataProvidersReference": "93854",
    "OperatorID": 5,
    "UsageTypeID": 1,
    "AddressInfo": {
        "ID": 142074,
        "Title": "UM PTS",
        "AddressLine1": "220 N Arch St",
        "Town": "Baltimore",
        "StateOrProvince": "MD",
        "Postcode": "21201",
        "CountryID": 2,
        "Latitude": 39.2924908,
        "Longitude": -76.6256572,
        "ContactTelephone1": "888-758-4389",
        "AccessComments": "24 hours daily",
        "RelatedURL": "http://www.chargepoint.com/",
        "DistanceUnit": 0
    },
    "Connections": [
        {
            "ID": 197718,
            "ConnectionTypeID": 1,
            "LevelID": 2,
            "Amps": 16,
            "Voltage": 230,
            "PowerKW": 3.7,
            "CurrentTypeID": 10,
            "Quantity": 2
        }
    ],
    "StatusTypeID": 50,
    "DateLastStatusUpdate": "2020-06-26T03:01:00Z",
    "DataQualityLevel": 3,
    "DateCreated": "2019-12-24T09:16:00Z",
    "SubmissionStatusTypeID": 100
}