{
    "MediaItems": [
        {
            "ID": 23942,
            "ChargePointID": 75949,
            "ItemURL": "https://s3-ap-southeast-2.amazonaws.com/openchargemap/images/AT/OCM75949/OCM-75949.orig.2020080713553048.jpg",
            "ItemThumbnailURL": "https://s3-ap-southeast-2.amazonaws.com/openchargemap/images/AT/OCM75949/OCM-75949.thmb.2020080713553048.jpg",
            "Comment": "",
            "IsEnabled": true,
            "IsVideo": false,
            "IsFeaturedItem": false,
            "IsExternalResource": false,
            "User": {
                "ID": 26760,
                "Username": "interssl.com"
            },
            "DateCreated": "2020-08-07T13:56:00Z"
        },
        {
            "ID": 23943,
            "ChargePointID": 75949,
            "ItemURL": "https://s3-ap-southeast-2.amazonaws.com/openchargemap/images/AT/OCM75949/OCM-75949.orig.2020080713554377.jpg",
            "ItemThumbnailURL": "https://s3-ap-southeast-2.amazonaws.com/openchargemap/images/AT/OCM75949/OCM-75949.thmb.2020080713554377.jpg",
            "Comment": "",
            "IsEnabled": true,
            "IsVideo": false,
            "IsFeaturedItem": false,
            "IsExternalResource": false,
            "User": {
                "ID": 26760,
                "Username": "interssl.com"
            },
            "DateCreated": "2020-08-07T13:56:00Z"
        },
        {
            "ID": 23944,
            "ChargePointID": 75949,
            "ItemURL": "https://s3-ap-southeast-2.amazonaws.com/openchargemap/images/AT/OCM75949/OCM-75949.orig.2020080713555461.jpg",
            "ItemThumbnailURL": "https://s3-ap-southeast-2.amazonaws.com/openchargemap/images/AT/OCM75949/OCM-75949.thmb.2020080713555461.jpg",
            "Comment": "",
            "IsEnabled": true,
            "IsVideo": false,
            "IsFeaturedItem": false,
            "IsExternalResource": false,
            "User": {
                "ID": 26760,
                "Username": "interssl.com"
            },
            "DateCreated": "2020-08-07T13:56:00Z"
        },
        {
            "ID": 23945,
            "ChargePointID": 75949,
            "ItemURL": "https://s3-ap-southeast-2.amazonaws.com/openchargemap/images/AT/OCM75949/OCM-75949.orig.2020080713560502.jpg",
            "ItemThumbnailURL": "https://s3-ap-southeast-2.amazonaws.com/openchargemap/images/AT/OCM75949/OCM-75949.thmb.2020080713560502.jpg",
            "Comment": "",
            "IsEnabled": true,
            "IsVideo": false,
            "IsFeaturedItem": false,
            "IsExternalResource": false,
            "User": {
                "ID": 26760,
                "Username": "interssl.com"
            },
            "DateCreated": "2020-08-07T13:56:00Z"
        },
        {
            "ID": 23941,
            "ChargePointID": 75949,
            "ItemURL": "https://s3-ap-southeast-2.amazonaws.com/openchargemap/images/AT/OCM75949/OCM-75949.orig.2020080713552012.jpg",
            "ItemThumbnailURL": "https://s3-ap-southeast-2.amazonaws.com/openchargemap/images/AT/OCM75949/OCM-75949.thmb.2020080713552012.jpg",
            "Comment": "",
            "IsEnabled": true,
            "IsVideo": false,
            "IsFeaturedItem": false,
            "IsExternalResource": false,
            "User": {
                "ID": 26760,
                "Username": "interssl.com"
            },
            "DateCreated": "2020-08-07T13:55:00Z"
        }
    ],
    "IsRecentlyVerified": false,
    "ID": 75949,
    "UUID": "24DFCA0C-AE34-4DCD-8FC9-19FDE513B4B3",
    "DataProviderID": 1,
    "OperatorID": 18,
    "UsageTypeID": 4,
    "AddressInfo": {
        "ID": 76295,
        "Title": "Parkplatz Feuerwehr Eben/Maurach",
        "AddressLine1": "Dorfstraße 28",
        "Town": "Maurach",
        "StateOrProvince": "Schwaz",
        "Postcode": "6212",
        "CountryID": 19,
        "Latitude": 47.423201,
        "Longitude": 11.749679,
        "ContactEmail": "sc@tiwag.at",
        "DistanceUnit": 0
    },
    "Connections": [
        {
            "ID": 109613,
            "ConnectionTypeID": 25,
            "StatusTypeID": 50,
            "LevelID": 2,
            "Amps": 32,
            "Voltage": 400,
            "PowerKW": 22,
            "CurrentTypeID": 10,
            "Quantity": 2
        },
        {
            "ID": 109614,
            "ConnectionTypeID": 28,
            "StatusTypeID": 50,
            "LevelID": 2,
            "Amps": 16,
            "Voltage": 230,
            "PowerKW": 4,
            "CurrentTypeID": 10,
            "Quantity": 2
        }
    ],
    "NumberOfPoints": 4,
    "StatusTypeID": 50,
    "DateLastStatusUpdate": "2020-08-08T07:08:00Z",
    "DataQualityLevel": 1,
    "DateCreated": "2016-12-23T11:14:00Z",
    "SubmissionStatusTypeID": 200
}