{
    "IsRecentlyVerified": false,
    "ID": 106337,
    "UUID": "971F7B51-2498-4820-958D-132C2943D3D7",
    "DataProviderID": 1,
    "OperatorID": 1,
    "UsageTypeID": 0,
    "UsageCost": "Free",
    "AddressInfo": {
        "ID": 106683,
        "Title": "Level 2 ",
        "AddressLine1": "56 North Ember Drive",
        "Town": "Felton ",
        "StateOrProvince": "Delaware",
        "Postcode": "19904",
        "CountryID": 2,
        "Latitude": 39.0249711322335,
        "Longitude": -75.5606711143264,
        "ContactTelephone1": "3022706942",
        "ContactEmail": "mrladderman@gmail.com",
        "AccessComments": "The charger is on the chair on left side of garage ",
        "DistanceUnit": 0
    },
    "Connections": [
        {
            "ID": 149697,
            "ConnectionTypeID": 1,
            "StatusTypeID": 50,
            "Voltage": 220,
            "CurrentTypeID": 10
        }
    ],
    "NumberOfPoints": 1,
    "GeneralComments": "24 hours ",
    "StatusTypeID": 50,
    "DateLastStatusUpdate": "2018-06-23T08:03:00Z",
    "DataQualityLevel": 1,
    "DateCreated": "2018-06-20T16:00:00Z",
    "SubmissionStatusTypeID": 200
}