{
    "IsRecentlyVerified": false,
    "ID": 102860,
    "UUID": "60704B60-BEB0-4D67-B820-EBAD3E551DD3",
    "DataProviderID": 2,
    "DataProvidersReference": "94733",
    "OperatorID": 3372,
    "UsageTypeID": 7,
    "AddressInfo": {
        "ID": 103206,
        "Title": "Days Inn & Suites",
        "AddressLine1": "4701 Valley West Blvd",
        "Town": "Arcata",
        "StateOrProvince": "CA",
        "Postcode": "95521",
        "CountryID": 2,
        "Latitude": 40.901079,
        "Longitude": -124.084301,
        "ContactTelephone1": "866-816-7584",
        "AccessComments": "24 hours daily; for hotel guest use only\r\nPublic - Call ahead",
        "RelatedURL": "http://evconnect.com/",
        "DistanceUnit": 0
    },
    "Connections": [
        {
            "ID": 145001,
            "ConnectionTypeID": 1,
            "LevelID": 2,
            "Amps": 16,
            "Voltage": 230,
            "PowerKW": 3.7,
            "CurrentTypeID": 10,
            "Quantity": 2
        }
    ],
    "DateLastStatusUpdate": "2020-06-26T03:03:00Z",
    "DataQualityLevel": 3,
    "DateCreated": "2018-04-21T04:13:00Z",
    "SubmissionStatusTypeID": 100
}