{
    "IsRecentlyVerified": false,
    "ID": 128433,
    "UUID": "9D239810-83EF-403F-B6D9-25E2001E9FBF",
    "DataProviderID": 1,
    "OperatorID": 80,
    "UsageTypeID": 4,
    "AddressInfo": {
        "ID": 128779,
        "Title": "Stadio comunale Goffredo Del Buffa | EnelX",
        "AddressLine1": "Piazza della Libertà",
        "Town": "Figline Valdarno",
        "StateOrProvince": "FI",
        "Postcode": "50063",
        "CountryID": 112,
        "Latitude": 43.6231936434407,
        "Longitude": 11.4708167445156,
        "ContactTelephone1": "800.069.850",
        "RelatedURL": "https://www.enelx.com/it/it/emobility",
        "DistanceUnit": 0
    },
    "Connections": [
        {
            "ID": 179799,
            "ConnectionTypeID": 25,
            "StatusTypeID": 50,
            "LevelID": 2,
            "Amps": 32,
            "Voltage": 400,
            "PowerKW": 22,
            "CurrentTypeID": 20,
            "Quantity": 2
        }
    ],
    "NumberOfPoints": 2,
    "StatusTypeID": 50,
    "DateLastStatusUpdate": "2019-06-24T15:27:00Z",
    "DataQualityLevel": 1,
    "DateCreated": "2019-06-24T15:27:00Z",
    "SubmissionStatusTypeID": 200
}