{
    "IsRecentlyVerified": false,
    "ID": 158946,
    "UUID": "7AA573E5-ADBF-4198-871A-3CFA9AA1A6FE",
    "DataProviderID": 2,
    "DataProvidersReference": "159276",
    "OperatorID": 5,
    "UsageTypeID": 1,
    "AddressInfo": {
        "ID": 159303,
        "Title": "VKUMC",
        "AddressLine1": "10408 Balboa Blvd",
        "Town": "Los Angeles",
        "StateOrProvince": "CA",
        "Postcode": "91344",
        "CountryID": 2,
        "Latitude": 34.2591,
        "Longitude": -118.502121,
        "ContactTelephone1": "888-758-4389",
        "AccessComments": "24 hours daily",
        "RelatedURL": "http://www.chargepoint.com/",
        "DistanceUnit": 0
    },
    "Connections": [
        {
            "ID": 228983,
            "ConnectionTypeID": 1,
            "LevelID": 2,
            "Amps": 16,
            "Voltage": 230,
            "PowerKW": 3.7,
            "CurrentTypeID": 10,
            "Quantity": 4
        }
    ],
    "StatusTypeID": 50,
    "DateLastStatusUpdate": "2020-06-26T02:57:00Z",
    "DataQualityLevel": 3,
    "DateCreated": "2020-06-26T02:57:00Z",
    "SubmissionStatusTypeID": 100
}