{
    "UserComments": [
        {
            "ID": 6505,
            "ChargePointID": 36552,
            "CommentTypeID": 50,
            "UserName": "Styno",
            "Comment": "Parking lot gate closes at 19:00 local time.",
            "RelatedURL": "http://www.informatiecentrumecofactorij.nl/",
            "DateCreated": "2015-09-17T08:19:36.027Z",
            "User": {
                "ID": 6368,
                "Username": "Styno"
            },
            "CheckinStatusTypeID": 140
        }
    ],
    "MediaItems": [
        {
            "ID": 3210,
            "ChargePointID": 36552,
            "ItemURL": "https://s3-ap-southeast-2.amazonaws.com/openchargemap/images/NL/OCM36552/OCM-36552.orig.2015091707554598.jpg",
            "ItemThumbnailURL": "https://s3-ap-southeast-2.amazonaws.com/openchargemap/images/NL/OCM36552/OCM-36552.thmb.2015091707554598.jpg",
            "Comment": "",
            "IsEnabled": true,
            "IsVideo": false,
            "IsFeaturedItem": false,
            "IsExternalResource": false,
            "User": {
                "ID": 6368,
                "Username": "Styno"
            },
            "DateCreated": "2015-09-17T07:56:00Z"
        },
        {
            "ID": 3211,
            "ChargePointID": 36552,
            "ItemURL": "https://s3-ap-southeast-2.amazonaws.com/openchargemap/images/NL/OCM36552/OCM-36552.orig.2015091707560232.jpg",
            "ItemThumbnailURL": "https://s3-ap-southeast-2.amazonaws.com/openchargemap/images/NL/OCM36552/OCM-36552.thmb.2015091707560232.jpg",
            "Comment": "",
            "IsEnabled": true,
            "IsVideo": false,
            "IsFeaturedItem": false,
            "IsExternalResource": false,
            "User": {
                "ID": 6368,
                "Username": "Styno"
            },
            "DateCreated": "2015-09-17T07:56:00Z"
        }
    ],
    "IsRecentlyVerified": false,
    "ID": 36552,
    "UUID": "35EB361B-1D46-48D3-BA7F-4FC206676508",
    "DataProviderID": 1,
    "OperatorID": 73,
    "OperatorsReference": "EV-Box EVB-P1339018",
    "UsageCost": "0.00 jaarabonnement",
    "AddressInfo": {
        "ID": 36898,
        "Title": "Ecofactorij 20",
        "AddressLine1": "Ecofactorij 20",
        "Town": "Apeldoorn",
        "Postcode": "7325 WC",
        "CountryID": 159,
        "Latitude": 52.19842,
        "Longitude": 6.02816,
        "AccessComments": "Parking lot gate closes at 19:00",
        "RelatedURL": "http://www.informatiecentrumecofactorij.nl/",
        "DistanceUnit": 0
    },
    "Connections": [
        {
            "ID": 40063,
            "ConnectionTypeID": 25,
            "StatusTypeID": 50,
            "LevelID": 2,
            "Amps": 16,
            "Voltage": 400,
            "PowerKW": 11,
            "CurrentTypeID": 20,
            "Quantity": 6
        }
    ],
    "NumberOfPoints": 1,
    "StatusTypeID": 50,
    "DateLastStatusUpdate": "2015-09-17T13:34:00Z",
    "DataQualityLevel": 3,
    "DateCreated": "2015-01-09T06:05:00Z",
    "SubmissionStatusTypeID": 200
}