{
    "IsRecentlyVerified": false,
    "ID": 20370,
    "UUID": "1A7899F6-2A64-4EA1-8096-4700B5C38C0E",
    "DataProviderID": 1,
    "OperatorID": 56,
    "UsageTypeID": 0,
    "AddressInfo": {
        "ID": 20715,
        "Title": "AutoBleue - Fleurs",
        "AddressLine1": "30 Avenue Fleurs ",
        "Town": "Nice",
        "Postcode": "06000",
        "CountryID": 80,
        "Latitude": 43.69805,
        "Longitude": 7.2519,
        "AccessComments": "Réservé aux clients de l'établissement",
        "DistanceUnit": 0
    },
    "Connections": [],
    "StatusTypeID": 50,
    "DateLastStatusUpdate": "2017-01-08T19:05:00Z",
    "DataQualityLevel": 1,
    "DateCreated": "2013-11-13T11:36:00Z",
    "SubmissionStatusTypeID": 200
}