{
    "IsRecentlyVerified": false,
    "ID": 115492,
    "UUID": "ECDF65ED-08F3-4977-9805-1F543A2479CD",
    "DataProviderID": 2,
    "DataProvidersReference": "105122",
    "OperatorID": 59,
    "UsageTypeID": 1,
    "AddressInfo": {
        "ID": 115838,
        "Title": "Greenlots - 43170",
        "AddressLine1": "2627 N Hollywood Way",
        "Town": "Burbank",
        "StateOrProvince": "CA",
        "Postcode": "91505",
        "CountryID": 2,
        "Latitude": 34.1960487365723,
        "Longitude": -118.352668762207,
        "ContactTelephone1": "855-900-7584",
        "AccessComments": "24 hours daily",
        "RelatedURL": "http://greenlots.com/",
        "DistanceUnit": 0
    },
    "Connections": [
        {
            "ID": 162506,
            "ConnectionTypeID": 2,
            "LevelID": 2,
            "Amps": 100,
            "Voltage": 400,
            "PowerKW": 40,
            "CurrentTypeID": 10,
            "Quantity": 1
        },
        {
            "ID": 162507,
            "ConnectionTypeID": 32,
            "LevelID": 2,
            "Amps": 100,
            "Voltage": 400,
            "PowerKW": 40,
            "CurrentTypeID": 10,
            "Quantity": 1
        }
    ],
    "DateLastStatusUpdate": "2019-04-06T04:02:00Z",
    "DataQualityLevel": 3,
    "DateCreated": "2019-02-11T07:13:00Z",
    "SubmissionStatusTypeID": 100
}