{
    "IsRecentlyVerified": false,
    "ID": 89385,
    "UUID": "FF3E0172-0041-47EC-9A68-3E7A30C3741F",
    "DataProviderID": 2,
    "DataProvidersReference": "85578",
    "UsageTypeID": 1,
    "AddressInfo": {
        "ID": 89731,
        "Title": "Kingsburg Branch Library",
        "AddressLine1": "1399 Draper St",
        "Town": "Kingsburg",
        "StateOrProvince": "CA",
        "Postcode": "93631",
        "CountryID": 2,
        "Latitude": 36.514767,
        "Longitude": -119.55285,
        "ContactTelephone1": "559-263-8019",
        "AccessComments": "8am-5pm daily; maximum session time of 3 hours",
        "RelatedURL": "",
        "DistanceUnit": 0
    },
    "Connections": [
        {
            "ID": 126774,
            "ConnectionTypeID": 1,
            "LevelID": 2,
            "Amps": 16,
            "Voltage": 230,
            "PowerKW": 3,
            "CurrentTypeID": 10,
            "Quantity": 1
        }
    ],
    "DateLastStatusUpdate": "2019-04-06T04:02:00Z",
    "DataQualityLevel": 3,
    "DateCreated": "2017-06-22T08:16:00Z",
    "SubmissionStatusTypeID": 100
}