{
    "UserComments": [
        {
            "ID": 16127,
            "ChargePointID": 45257,
            "CommentTypeID": 10,
            "UserName": "Anon74856763534",
            "Comment": "",
            "DateCreated": "2017-03-25T09:43:21.957Z",
            "User": {
                "ID": 1192,
                "Username": "Anon74856763534"
            },
            "CheckinStatusTypeID": 10
        },
        {
            "ID": 14189,
            "ChargePointID": 45257,
            "CommentTypeID": 10,
            "UserName": "TheScotstounPele",
            "Comment": "Working well.",
            "DateCreated": "2016-08-31T15:06:37.18Z",
            "User": {
                "ID": 6377,
                "Username": "TheScotstounPele"
            },
            "CheckinStatusTypeID": 10
        },
        {
            "ID": 14078,
            "ChargePointID": 45257,
            "CommentTypeID": 10,
            "UserName": "TheScotstounPele",
            "Comment": "Working well, quite fast, maybe because it's a warm night.",
            "DateCreated": "2016-08-15T18:47:42.357Z",
            "User": {
                "ID": 6377,
                "Username": "TheScotstounPele"
            },
            "CheckinStatusTypeID": 10
        },
        {
            "ID": 13959,
            "ChargePointID": 45257,
            "CommentTypeID": 10,
            "UserName": "TheScotstounPele",
            "Comment": "Successful Chademo charge. Appears to be in full working order. 24hr access, no barrier.",
            "Rating": 5,
            "DateCreated": "2016-08-03T20:35:40.79Z",
            "User": {
                "ID": 6377,
                "Username": "TheScotstounPele"
            },
            "CheckinStatusTypeID": 10
        },
        {
            "ID": 10038,
            "ChargePointID": 45257,
            "CommentTypeID": 10,
            "UserName": "shosoloza",
            "Comment": "Chademo working fine",
            "Rating": 5,
            "DateCreated": "2016-03-29T13:43:29.52Z",
            "User": {
                "ID": 6511,
                "Username": "shosoloza"
            },
            "CheckinStatusTypeID": 10
        },
        {
            "ID": 9788,
            "ChargePointID": 45257,
            "CommentTypeID": 10,
            "UserName": "TheScotstounPele",
            "Comment": "",
            "Rating": 4,
            "DateCreated": "2016-02-24T12:09:15.537Z",
            "User": {
                "ID": 6377,
                "Username": "TheScotstounPele"
            },
            "CheckinStatusTypeID": 10
        },
        {
            "ID": 8449,
            "ChargePointID": 45257,
            "CommentTypeID": 10,
            "UserName": "TheScotstounPele",
            "Comment": "Charged successfully using Chademo. All three heads appear to be working.",
            "Rating": 4,
            "DateCreated": "2016-01-07T11:02:00.547Z",
            "User": {
                "ID": 6377,
                "Username": "TheScotstounPele"
            },
            "CheckinStatusTypeID": 10
        },
        {
            "ID": 7919,
            "ChargePointID": 45257,
            "CommentTypeID": 10,
            "UserName": "markdl1969",
            "Comment": "Unable to charge, continues to say card not recognized. I've used the card many times without any problems",
            "Rating": 1,
            "DateCreated": "2015-11-03T08:39:55.107Z",
            "User": {
                "ID": 4634,
                "Username": "markdl1969"
            },
            "CheckinStatusTypeID": 25
        },
        {
            "ID": 4589,
            "ChargePointID": 45257,
            "CommentTypeID": 10,
            "UserName": "Anon74856763534",
            "Comment": "Excellent CHAdeMO charge with new connector. No issues.",
            "Rating": 5,
            "DateCreated": "2015-05-29T19:27:58.85Z",
            "User": {
                "ID": 1192,
                "Username": "Anon74856763534"
            },
            "CheckinStatusTypeID": 10
        },
        {
            "ID": 4588,
            "ChargePointID": 45257,
            "CommentTypeID": 10,
            "UserName": "richard27852",
            "Rating": 5,
            "DateCreated": "2015-05-29T17:30:53.54Z",
            "User": {
                "ID": 4886,
                "Username": "richard27852"
            },
            "CheckinStatusTypeID": 10
        },
        {
            "ID": 4321,
            "ChargePointID": 45257,
            "CommentTypeID": 10,
            "UserName": "",
            "Comment": "",
            "DateCreated": "2015-04-28T19:52:25.27Z",
            "CheckinStatusTypeID": 22
        }
    ],
    "MediaItems": [
        {
            "ID": 1248,
            "ChargePointID": 45257,
            "ItemURL": "https://s3-ap-southeast-2.amazonaws.com/openchargemap/images/GB/OCM45257/OCM-45257.orig.2015042818404672.jpg",
            "ItemThumbnailURL": "https://s3-ap-southeast-2.amazonaws.com/openchargemap/images/GB/OCM45257/OCM-45257.thmb.2015042818404672.jpg",
            "Comment": "",
            "IsEnabled": true,
            "IsVideo": false,
            "IsFeaturedItem": false,
            "IsExternalResource": false,
            "User": {
                "ID": 1192,
                "Username": "Anon74856763534"
            },
            "DateCreated": "2015-04-28T18:41:00Z"
        }
    ],
    "IsRecentlyVerified": false,
    "ID": 45257,
    "UUID": "752711A3-513A-4F54-8E01-70061891619B",
    "DataProviderID": 1,
    "OperatorID": 3315,
    "OperatorsReference": "50749",
    "UsageTypeID": 4,
    "UsageCost": "Free",
    "AddressInfo": {
        "ID": 45603,
        "Title": "Renfrewshire House Car Park",
        "AddressLine1": "Cotton Street",
        "Town": "Paisley",
        "StateOrProvince": "Renfrewshire",
        "Postcode": "PA1 1UJ",
        "CountryID": 1,
        "Latitude": 55.8447291547922,
        "Longitude": -4.41879987716675,
        "AccessComments": "Rapid charger is sited outside car park gate. Informed that type 2 sockets on lower floor are council use only. They are not listed on the CYC website.",
        "DistanceUnit": 0
    },
    "Connections": [
        {
            "ID": 55777,
            "ConnectionTypeID": 33,
            "StatusTypeID": 100,
            "LevelID": 3,
            "PowerKW": 50,
            "CurrentTypeID": 30,
            "Quantity": 1
        },
        {
            "ID": 55778,
            "ConnectionTypeID": 2,
            "StatusTypeID": 50,
            "LevelID": 3,
            "PowerKW": 50,
            "CurrentTypeID": 30,
            "Quantity": 1
        },
        {
            "ID": 55779,
            "ConnectionTypeID": 1036,
            "StatusTypeID": 50,
            "LevelID": 3,
            "Voltage": 400,
            "PowerKW": 43,
            "CurrentTypeID": 20,
            "Quantity": 1
        },
        {
            "ID": 55780,
            "ConnectionTypeID": 25,
            "StatusTypeID": 50,
            "LevelID": 2,
            "Amps": 32,
            "Voltage": 230,
            "PowerKW": 7,
            "CurrentTypeID": 10,
            "Quantity": 1
        }
    ],
    "NumberOfPoints": 4,
    "StatusTypeID": 50,
    "DateLastStatusUpdate": "2019-10-03T12:42:00Z",
    "DataQualityLevel": 1,
    "DateCreated": "2015-04-28T17:30:00Z",
    "SubmissionStatusTypeID": 200
}