{
    "IsRecentlyVerified": false,
    "ID": 81620,
    "UUID": "6692E42B-BA87-49EE-8ADB-7BA89FFC4973",
    "DataProviderID": 1,
    "OperatorID": 23,
    "OperatorsReference": "10148",
    "UsageTypeID": 6,
    "AddressInfo": {
        "ID": 81966,
        "Title": "Litchfield Beach & Golf Resort",
        "AddressLine1": "14276 Ocean Hwy",
        "Town": "Pawleys Island",
        "StateOrProvince": "SC",
        "Postcode": "29585",
        "CountryID": 2,
        "Latitude": 33.484047,
        "Longitude": -79.095578,
        "ContactTelephone1": "(800) 845-1897",
        "DistanceUnit": 0
    },
    "Connections": [
        {
            "ID": 116368,
            "ConnectionTypeID": 30,
            "StatusTypeID": 50,
            "LevelID": 2,
            "PowerKW": 16,
            "CurrentTypeID": 20,
            "Quantity": 2
        }
    ],
    "NumberOfPoints": 2,
    "GeneralComments": "2 Tesla Connectors, up to 16kW.Available for patrons only. Please see front desk.",
    "StatusTypeID": 50,
    "DateLastStatusUpdate": "2017-02-03T09:09:00Z",
    "DataQualityLevel": 1,
    "DateCreated": "2017-02-03T09:09:00Z",
    "SubmissionStatusTypeID": 200
}