{
    "IsRecentlyVerified": false,
    "ID": 173070,
    "UUID": "4862A898-871F-42A0-8D59-5C7341F9C76C",
    "DataProviderID": 1,
    "OperatorID": 3,
    "OperatorsReference": "t54_it1_4720_034",
    "UsageTypeID": 4,
    "UsageCost": "£0.25/kWh",
    "AddressInfo": {
        "ID": 173429,
        "Title": "Lidl-Southend-on-Sea",
        "AddressLine1": "Campfield Road",
        "Town": "The Garrison",
        "StateOrProvince": "Southend-on-Sea",
        "Postcode": "SS3 9BT",
        "CountryID": 1,
        "Latitude": 51.530111,
        "Longitude": 0.784889,
        "DistanceUnit": 0
    },
    "Connections": [
        {
            "ID": 264809,
            "ConnectionTypeID": 25,
            "StatusTypeID": 50,
            "LevelID": 2,
            "Amps": 32,
            "Voltage": 400,
            "PowerKW": 22,
            "CurrentTypeID": 20,
            "Quantity": 1
        },
        {
            "ID": 269990,
            "ConnectionTypeID": 2,
            "StatusTypeID": 50,
            "LevelID": 3,
            "PowerKW": 50,
            "CurrentTypeID": 30,
            "Quantity": 1
        },
        {
            "ID": 270048,
            "ConnectionTypeID": 33,
            "StatusTypeID": 50,
            "LevelID": 3,
            "PowerKW": 50,
            "CurrentTypeID": 30,
            "Quantity": 1
        }
    ],
    "NumberOfPoints": 2,
    "GeneralComments": "This is a Pod Point rapid charge unit installed at the Lidl super store at Campfield Road, The Garrison, Southend-on-Sea",
    "StatusTypeID": 50,
    "DateLastStatusUpdate": "2021-03-25T15:54:00Z",
    "DataQualityLevel": 1,
    "DateCreated": "2021-03-02T21:24:00Z",
    "SubmissionStatusTypeID": 200
}