{
    "IsRecentlyVerified": false,
    "ID": 76958,
    "UUID": "196EF7F9-9897-4CA0-90A5-D2906BA3A1BA",
    "DataProviderID": 1,
    "OperatorID": 156,
    "UsageTypeID": 4,
    "AddressInfo": {
        "ID": 77304,
        "Title": "Kia Autohaus Pieper",
        "AddressLine1": "Oppendorfer Straße 31",
        "Town": "Stemwede",
        "StateOrProvince": "Kreis Minden-Lübbecke",
        "Postcode": "32351",
        "CountryID": 87,
        "Latitude": 52.4543871,
        "Longitude": 8.481736500000011,
        "ContactTelephone1": "+49 577380080",
        "AccessComments": "24/7 nutzbar",
        "RelatedURL": "http://www.autohaus-piper.de/",
        "DistanceUnit": 0
    },
    "Connections": [
        {
            "ID": 110567,
            "ConnectionTypeID": 25,
            "StatusTypeID": 50,
            "LevelID": 2,
            "Amps": 32,
            "Voltage": 400,
            "PowerKW": 22,
            "CurrentTypeID": 20,
            "Quantity": 2
        }
    ],
    "NumberOfPoints": 2,
    "StatusTypeID": 50,
    "DateLastStatusUpdate": "2016-12-26T10:16:00Z",
    "DataQualityLevel": 1,
    "DateCreated": "2016-12-26T10:16:00Z",
    "SubmissionStatusTypeID": 200
}