{
    "IsRecentlyVerified": false,
    "ID": 68105,
    "UUID": "0CA3E0FE-A6F8-4920-958C-352B5062746A",
    "DataProviderID": 26,
    "DataProvidersReference": "91635",
    "OperatorID": 103,
    "OperatorsReference": "Allego NLALLEGO0010481",
    "UsageCost": "0.00 jaarabonnement",
    "AddressInfo": {
        "ID": 68451,
        "Title": "Zijldonk 51",
        "AddressLine1": "Zijldonk 51",
        "Town": "Leiden",
        "Postcode": "2317 ZA",
        "CountryID": 159,
        "Latitude": 52.17311459,
        "Longitude": 4.51081483,
        "ContactTelephone1": "0800-3745337",
        "RelatedURL": "http://www.allego.eu/",
        "DistanceUnit": 0
    },
    "Connections": [
        {
            "ID": 94857,
            "ConnectionTypeID": 25,
            "LevelID": 2,
            "PowerKW": 11,
            "CurrentTypeID": 10
        },
        {
            "ID": 94858,
            "ConnectionTypeID": 25,
            "LevelID": 2,
            "PowerKW": 11,
            "CurrentTypeID": 10
        }
    ],
    "NumberOfPoints": 1,
    "StatusTypeID": 50,
    "DateLastStatusUpdate": "2016-06-04T02:37:00Z",
    "DataQualityLevel": 3,
    "DateCreated": "2016-06-04T02:37:00Z",
    "SubmissionStatusTypeID": 100
}