{
    "IsRecentlyVerified": false,
    "ID": 81902,
    "UUID": "6D535E70-1CDB-428F-AC8A-9BF4135977B3",
    "DataProviderID": 1,
    "OperatorID": 23,
    "OperatorsReference": "24103",
    "UsageTypeID": 6,
    "AddressInfo": {
        "ID": 82248,
        "Title": "Sport und Wellnesshotel Held",
        "AddressLine1": "6 Kleinbodenerstrasse",
        "Town": "Fügen",
        "Postcode": "6263",
        "CountryID": 19,
        "Latitude": 47.334571,
        "Longitude": 11.854946,
        "ContactTelephone1": "+43 5288 62386",
        "DistanceUnit": 0
    },
    "Connections": [
        {
            "ID": 116661,
            "ConnectionTypeID": 30,
            "StatusTypeID": 50,
            "LevelID": 2,
            "Amps": 32,
            "Voltage": 400,
            "PowerKW": 22,
            "CurrentTypeID": 20,
            "Quantity": 2
        }
    ],
    "NumberOfPoints": 2,
    "GeneralComments": "2 Tesla Connectors, up to 22kW.Available for patrons only. Self park.",
    "StatusTypeID": 50,
    "DateLastStatusUpdate": "2018-10-03T19:20:00Z",
    "DataQualityLevel": 1,
    "DateCreated": "2017-02-03T13:26:00Z",
    "SubmissionStatusTypeID": 200
}