{
    "IsRecentlyVerified": false,
    "ID": 101783,
    "UUID": "1E0BB2A2-853A-471C-B5C1-0CB979AE2577",
    "DataProviderID": 1,
    "OperatorID": 214,
    "UsageTypeID": 4,
    "AddressInfo": {
        "ID": 102129,
        "Title": "DRK Kliniken Berlin Westend",
        "AddressLine1": "Spandauer Damm 136",
        "Town": "Berlin",
        "StateOrProvince": "Berlin",
        "Postcode": "14050",
        "CountryID": 87,
        "Latitude": 52.51930803384439,
        "Longitude": 13.274593526458716,
        "AccessComments": "24/7 nutzbar, maximale Parkzeit 4 Stunden von 8-18Uhr. Trotz \"Fast-E\" Beklebung wird die Ladesäule über be emobil abgerechnet.",
        "DistanceUnit": 0
    },
    "Connections": [
        {
            "ID": 143675,
            "ConnectionTypeID": 1036,
            "StatusTypeID": 50,
            "LevelID": 3,
            "Amps": 63,
            "Voltage": 400,
            "PowerKW": 43,
            "CurrentTypeID": 20,
            "Quantity": 1
        },
        {
            "ID": 143676,
            "ConnectionTypeID": 2,
            "StatusTypeID": 50,
            "LevelID": 3,
            "PowerKW": 50,
            "CurrentTypeID": 30,
            "Quantity": 1
        },
        {
            "ID": 143677,
            "ConnectionTypeID": 33,
            "StatusTypeID": 50,
            "LevelID": 3,
            "PowerKW": 50,
            "CurrentTypeID": 30,
            "Quantity": 1
        }
    ],
    "NumberOfPoints": 3,
    "StatusTypeID": 50,
    "DateLastStatusUpdate": "2018-04-09T07:20:00Z",
    "DataQualityLevel": 1,
    "DateCreated": "2018-04-09T07:20:00Z",
    "SubmissionStatusTypeID": 200
}