{
    "IsRecentlyVerified": false,
    "ID": 9422,
    "UUID": "E448850E-CF60-4477-9C57-DCDEF9308658",
    "DataProviderID": 1,
    "DataProvidersReference": "LSB-00053",
    "OperatorID": 21,
    "UsageTypeID": 4,
    "UsageCost": "Mobi.E compatible card",
    "AddressInfo": {
        "ID": 9319,
        "Title": "LSB-00053",
        "AddressLine1": "Azinhaga da Torre do Fato",
        "Town": "Lisboa",
        "Postcode": "1600-774",
        "CountryID": 180,
        "Latitude": 38.769478,
        "Longitude": -9.176647,
        "RelatedURL": "http://www.mobie.pt",
        "DistanceUnit": 0
    },
    "Connections": [
        {
            "ID": 33303,
            "ConnectionTypeID": 25,
            "StatusTypeID": 50,
            "LevelID": 2,
            "Amps": 32,
            "Voltage": 400,
            "PowerKW": 22,
            "CurrentTypeID": 20,
            "Quantity": 2
        }
    ],
    "NumberOfPoints": 2,
    "StatusTypeID": 50,
    "DateLastStatusUpdate": "2020-08-15T19:47:00Z",
    "DataQualityLevel": 3,
    "DateCreated": "2012-02-08T15:16:00Z",
    "SubmissionStatusTypeID": 100
}