{
    "IsRecentlyVerified": false,
    "ID": 8409,
    "UUID": "447DE4E1-F72A-4B67-B801-42641589F85C",
    "DataProviderID": 15,
    "DataProvidersReference": "3866",
    "OperatorID": 26,
    "AddressInfo": {
        "ID": 8306,
        "Title": "2400 W 6TH St",
        "AddressLine1": "2400 W 6TH St",
        "Town": "The Dalles",
        "StateOrProvince": "OR",
        "Postcode": "97058",
        "CountryID": 2,
        "Latitude": 45.61445,
        "Longitude": -121.21038,
        "ContactTelephone1": " (541) 296-4613",
        "RelatedURL": "http://carstations.com/3866",
        "DistanceUnit": 0
    },
    "Connections": [
        {
            "ID": 5837,
            "ConnectionTypeID": 1,
            "Reference": "J1772",
            "LevelID": 2
        }
    ],
    "StatusTypeID": 0,
    "DateLastStatusUpdate": "2017-11-04T14:05:00Z",
    "DataQualityLevel": 1,
    "DateCreated": "2011-11-11T12:06:00Z",
    "SubmissionStatusTypeID": 100
}