{
    "IsRecentlyVerified": false,
    "ID": 38973,
    "UUID": "4E8B2638-49C5-4862-8EE8-2B50FE02A243",
    "DataProviderID": 26,
    "DataProvidersReference": "47875",
    "OperatorID": 178,
    "OperatorsReference": "EVnetNL DB0111",
    "UsageCost": "0.00 jaarabonnement",
    "AddressInfo": {
        "ID": 39319,
        "Title": "Nikadel 75",
        "AddressLine1": "Nikadel 75",
        "Town": "Texel",
        "Postcode": "1796 BR",
        "CountryID": 159,
        "Latitude": 53.098189,
        "Longitude": 4.765003,
        "ContactTelephone1": "0800-3522365",
        "RelatedURL": "http://www.evnet.nl",
        "DistanceUnit": 0
    },
    "Connections": [
        {
            "ID": 42484,
            "ConnectionTypeID": 25,
            "LevelID": 2,
            "PowerKW": 11,
            "CurrentTypeID": 10
        }
    ],
    "NumberOfPoints": 2,
    "StatusTypeID": 50,
    "DateLastStatusUpdate": "2016-06-04T02:56:00Z",
    "DataQualityLevel": 3,
    "DateCreated": "2015-01-09T06:08:00Z",
    "SubmissionStatusTypeID": 100
}