{
    "IsRecentlyVerified": false,
    "ID": 136285,
    "UUID": "7A2E3EDF-77EE-4C8C-9493-5C2AFA1EA7B7",
    "DataProviderID": 18,
    "DataProvidersReference": "6b27cbe5d253f75de939daf7df8e51ae",
    "OperatorID": 2244,
    "UsageTypeID": 5,
    "AddressInfo": {
        "ID": 136631,
        "Title": "Albany Road",
        "AddressLine1": "Albany Road",
        "Town": "London",
        "Postcode": "W13 8PQ",
        "CountryID": 1,
        "Latitude": 51.515695,
        "Longitude": -0.318421,
        "AccessComments": "",
        "RelatedURL": "https://www.ubitricity.com",
        "DistanceUnit": 0
    },
    "Connections": [
        {
            "ID": 190722,
            "ConnectionTypeID": 25,
            "Reference": "suby1100002132",
            "StatusTypeID": 50,
            "LevelID": 2,
            "Amps": 16,
            "Voltage": 230,
            "PowerKW": 3.7,
            "CurrentTypeID": 10
        }
    ],
    "StatusTypeID": 0,
    "DateLastStatusUpdate": "2021-04-25T05:46:00Z",
    "MetadataValues": [
        {
            "ID": 6137,
            "MetadataFieldID": 4,
            "ItemValue": "Contains public sector information licensed under the Open Government Licence v2.0. http://www.nationalarchives.gov.uk/doc/open-government-licence/version/2/"
        }
    ],
    "DataQualityLevel": 3,
    "DateCreated": "2019-12-24T05:22:00Z",
    "SubmissionStatusTypeID": 100
}