{
    "IsRecentlyVerified": false,
    "ID": 73945,
    "UUID": "DBF43B44-8EE7-4F1F-B81A-1201E115A2D6",
    "DataProviderID": 1,
    "OperatorID": 89,
    "OperatorsReference": "CEB-10052",
    "UsageTypeID": 4,
    "UsageCost": "CAD 2.50",
    "AddressInfo": {
        "ID": 74291,
        "Title": "Amt-Gare Saint-Lambert",
        "AddressLine1": "101 rue Mercier",
        "Town": "Saint-Lambert",
        "StateOrProvince": "QC",
        "Postcode": "J4P 2M1",
        "CountryID": 44,
        "Latitude": 45.500171661377,
        "Longitude": -73.505485534668,
        "DistanceUnit": 0
    },
    "Connections": [
        {
            "ID": 106259,
            "ConnectionTypeID": 1,
            "StatusTypeID": 50,
            "LevelID": 2,
            "Amps": 32,
            "Voltage": 230,
            "PowerKW": 7,
            "CurrentTypeID": 10,
            "Quantity": 1
        }
    ],
    "NumberOfPoints": 2,
    "StatusTypeID": 50,
    "DateLastStatusUpdate": "2017-07-20T13:05:00Z",
    "DataQualityLevel": 1,
    "DateCreated": "2016-11-23T23:41:00Z",
    "SubmissionStatusTypeID": 200
}