{
    "IsRecentlyVerified": false,
    "ID": 97564,
    "UUID": "66490339-469F-4F16-B614-A8D968F3C131",
    "DataProviderID": 1,
    "OperatorID": 23,
    "OperatorsReference": "38602",
    "UsageTypeID": 4,
    "AddressInfo": {
        "ID": 97910,
        "Title": "Hotel les Alpes",
        "AddressLine1": "Strada Valiares",
        "Town": "37",
        "StateOrProvince": "San Vigilio di Marebbe",
        "Postcode": "39030",
        "CountryID": 112,
        "Latitude": 46.698038,
        "Longitude": 11.927146,
        "ContactTelephone1": "+39 0474 501 080",
        "DistanceUnit": 0
    },
    "Connections": [
        {
            "ID": 138471,
            "ConnectionTypeID": 30,
            "StatusTypeID": 50,
            "LevelID": 2,
            "Amps": 32,
            "Voltage": 230,
            "PowerKW": 14,
            "CurrentTypeID": 20,
            "Quantity": 1
        }
    ],
    "NumberOfPoints": 1,
    "GeneralComments": "1 Tesla Connector, up to 14kW.Available for customers. Please call ahead.",
    "StatusTypeID": 50,
    "DateLastStatusUpdate": "2018-10-03T16:03:00Z",
    "DataQualityLevel": 1,
    "DateCreated": "2018-01-21T15:46:00Z",
    "SubmissionStatusTypeID": 200
}