{
    "IsRecentlyVerified": false,
    "ID": 61265,
    "UUID": "72F2AA72-89D8-41C1-AD08-B19DBCF8209A",
    "DataProviderID": 1,
    "OperatorID": 156,
    "UsageTypeID": 1,
    "UsageCost": "Free",
    "AddressInfo": {
        "ID": 61611,
        "Title": "EVF in Göppingen",
        "AddressLine1": "Großeislinger Straße 30",
        "Town": "Göppingen",
        "Postcode": "73033",
        "CountryID": 87,
        "Latitude": 48.701597,
        "Longitude": 9.664621,
        "RelatedURL": "http://www.evf.de",
        "DistanceUnit": 0
    },
    "Connections": [
        {
            "ID": 77991,
            "ConnectionTypeID": 25,
            "StatusTypeID": 50,
            "LevelID": 2,
            "Amps": 32,
            "Voltage": 400,
            "PowerKW": 22,
            "CurrentTypeID": 20,
            "Quantity": 2
        },
        {
            "ID": 77992,
            "ConnectionTypeID": 25,
            "StatusTypeID": 0,
            "LevelID": 2,
            "Amps": 32,
            "Voltage": 400,
            "PowerKW": 22,
            "CurrentTypeID": 20
        }
    ],
    "NumberOfPoints": 2,
    "StatusTypeID": 50,
    "DateLastStatusUpdate": "2016-02-22T15:51:00Z",
    "DataQualityLevel": 1,
    "DateCreated": "2016-02-18T17:46:00Z",
    "SubmissionStatusTypeID": 200
}