{
    "IsRecentlyVerified": false,
    "ID": 52259,
    "UUID": "AFBFDEFE-BFEF-43BD-8679-7D9E8FFA4723",
    "DataProviderID": 1,
    "OperatorID": 206,
    "UsageTypeID": 4,
    "AddressInfo": {
        "ID": 52605,
        "Title": "Foix, 86 - LC028",
        "AddressLine1": "Av de José Vicente Foix, 82",
        "Town": "Barcelona",
        "StateOrProvince": "Barcelona",
        "Postcode": "08034",
        "CountryID": 210,
        "Latitude": 41.3943819,
        "Longitude": 2.11311539999997,
        "ContactTelephone1": "+34 932 914 149",
        "ContactEmail": "centraloperacions@bcn.cat",
        "AccessComments": "Tarjeta Live Barcelona ",
        "RelatedURL": "http://www.bcn.cat",
        "DistanceUnit": 0
    },
    "Connections": [
        {
            "ID": 64905,
            "ConnectionTypeID": 28,
            "StatusTypeID": 50,
            "Quantity": 2
        }
    ],
    "NumberOfPoints": 2,
    "StatusTypeID": 50,
    "DateLastStatusUpdate": "2015-09-04T20:20:00Z",
    "DataQualityLevel": 1,
    "DateCreated": "2015-08-27T11:16:00Z",
    "SubmissionStatusTypeID": 200
}