{
    "IsRecentlyVerified": false,
    "ID": 152843,
    "UUID": "E13828B9-5E9E-4A6F-944F-C9A8009ED4C4",
    "DataProviderID": 28,
    "DataProvidersReference": "FR*S49*P49015*002",
    "UsageTypeID": 5,
    "AddressInfo": {
        "ID": 153196,
        "Title": "AVRILLE - Parking Alphonse Loubat",
        "AddressLine1": "Parking Alphonse Loubat 49240 AVRILLE",
        "CountryID": 80,
        "Latitude": 47.505249,
        "Longitude": -0.588673,
        "AccessComments": "24h/24 7j/7",
        "DistanceUnit": 0
    },
    "Connections": [
        {
            "ID": 214159,
            "ConnectionTypeID": 25,
            "StatusTypeID": 50,
            "LevelID": 2,
            "PowerKW": 18,
            "CurrentTypeID": 20
        },
        {
            "ID": 214160,
            "ConnectionTypeID": 28,
            "StatusTypeID": 50,
            "LevelID": 2,
            "PowerKW": 18,
            "CurrentTypeID": 10
        },
        {
            "ID": 247394,
            "ConnectionTypeID": 25,
            "StatusTypeID": 50,
            "LevelID": 2,
            "PowerKW": 18,
            "CurrentTypeID": 20
        },
        {
            "ID": 247395,
            "ConnectionTypeID": 28,
            "StatusTypeID": 50,
            "LevelID": 2,
            "PowerKW": 18,
            "CurrentTypeID": 10
        }
    ],
    "GeneralComments": "Recharge par badge et avec une application smartphone",
    "StatusTypeID": 50,
    "DateLastStatusUpdate": "2020-08-27T05:13:00Z",
    "DataQualityLevel": 2,
    "DateCreated": "2020-03-15T10:54:00Z",
    "SubmissionStatusTypeID": 100
}