{
    "IsRecentlyVerified": false,
    "ID": 179960,
    "UUID": "AEBE2735-92B9-44EA-AAD8-0C972EB54423",
    "DataProviderID": 29,
    "DataProvidersReference": "15519,5183",
    "OperatorID": 86,
    "AddressInfo": {
        "ID": 180319,
        "Title": "Stephan-Cosacchi-Platz 5",
        "AddressLine1": "Stephan-Cosacchi-Platz 5",
        "Town": "Frankenthal",
        "Postcode": "67227",
        "CountryID": 87,
        "Latitude": 49.5301042,
        "Longitude": 8.3522214,
        "DistanceUnit": 0
    },
    "Connections": [
        {
            "ID": 282475,
            "ConnectionTypeID": 33,
            "StatusTypeID": 50,
            "LevelID": 3,
            "PowerKW": 150,
            "CurrentTypeID": 30
        },
        {
            "ID": 282476,
            "ConnectionTypeID": 33,
            "StatusTypeID": 50,
            "LevelID": 3,
            "PowerKW": 75,
            "CurrentTypeID": 30
        },
        {
            "ID": 282477,
            "ConnectionTypeID": 28,
            "StatusTypeID": 50,
            "LevelID": 2,
            "PowerKW": 22,
            "CurrentTypeID": 10
        },
        {
            "ID": 282478,
            "ConnectionTypeID": 28,
            "StatusTypeID": 50,
            "LevelID": 2,
            "PowerKW": 22,
            "CurrentTypeID": 10
        }
    ],
    "StatusTypeID": 50,
    "DateLastStatusUpdate": "2021-07-09T03:17:00Z",
    "MetadataValues": [
        {
            "ID": 12254,
            "MetadataFieldID": 4,
            "ItemValue": "Data from the German chargepoint registry provided by Bundesnetzagentur.de under the CC-BY 4.0 license"
        }
    ],
    "DataQualityLevel": 3,
    "DateCreated": "2021-07-08T10:00:00Z",
    "SubmissionStatusTypeID": 100
}