{
    "IsRecentlyVerified": false,
    "ID": 34105,
    "UUID": "5972834D-35FE-475C-B5A4-1FF9E14F2BC5",
    "DataProviderID": 26,
    "DataProvidersReference": "54309",
    "OperatorID": 73,
    "OperatorsReference": "EV-Box EVB-P1427241",
    "UsageCost": "0.00 jaarabonnement",
    "AddressInfo": {
        "ID": 34451,
        "Title": "De Mérodelaan 2",
        "AddressLine1": "De Mérodelaan 2",
        "Town": "Ridderkerk",
        "Postcode": "2985 BD",
        "CountryID": 159,
        "Latitude": 51.8628,
        "Longitude": 4.60498,
        "RelatedURL": "http://www.ev-box.nl",
        "DistanceUnit": 0
    },
    "Connections": [
        {
            "ID": 37616,
            "ConnectionTypeID": 25,
            "LevelID": 2,
            "PowerKW": 11,
            "CurrentTypeID": 10
        },
        {
            "ID": 47063,
            "ConnectionTypeID": 25,
            "LevelID": 2,
            "PowerKW": 11,
            "CurrentTypeID": 10
        }
    ],
    "NumberOfPoints": 1,
    "StatusTypeID": 50,
    "DateLastStatusUpdate": "2016-06-04T02:41:00Z",
    "DataQualityLevel": 3,
    "DateCreated": "2015-01-09T06:04:00Z",
    "SubmissionStatusTypeID": 100
}