{
    "IsRecentlyVerified": false,
    "ID": 50547,
    "UUID": "9DC8716B-4F6B-4323-8493-7E136C938F4F",
    "DataProviderID": 1,
    "OperatorID": 157,
    "OperatorsReference": "NewMotion 03000245",
    "UsageCost": "0.00 jaarabonnement",
    "AddressInfo": {
        "ID": 50893,
        "Title": "Untere Grub 18",
        "AddressLine1": "Untere Grub 18",
        "Town": "Gutach (Schwarzwaldbahn)",
        "Postcode": "77793",
        "CountryID": 87,
        "Latitude": 48.24526,
        "Longitude": 8.20057,
        "ContactTelephone1": "088 0109500",
        "RelatedURL": "http://thenewmotion.nl/",
        "DistanceUnit": 0
    },
    "Connections": [
        {
            "ID": 62292,
            "ConnectionTypeID": 25,
            "LevelID": 2,
            "PowerKW": 11,
            "CurrentTypeID": 10
        }
    ],
    "NumberOfPoints": 1,
    "StatusTypeID": 50,
    "DateLastStatusUpdate": "2021-04-25T05:14:00Z",
    "DataQualityLevel": 3,
    "DateCreated": "2015-07-22T09:52:00Z",
    "SubmissionStatusTypeID": 200
}