{
    "IsRecentlyVerified": false,
    "ID": 167251,
    "UUID": "68995BBA-09B9-46E1-AC69-39830F653ACD",
    "DataProviderID": 1,
    "OperatorID": 63,
    "UsageTypeID": 5,
    "AddressInfo": {
        "ID": 167610,
        "Title": "IJsvogellaan",
        "AddressLine1": "IJsvogellaan",
        "StateOrProvince": "Brussels-Capital",
        "Postcode": "1170",
        "CountryID": 26,
        "Latitude": 50.8107141944715,
        "Longitude": 4.400563146250988,
        "RelatedURL": "https://www.charge.brussels/",
        "DistanceUnit": 0
    },
    "Connections": [
        {
            "ID": 253281,
            "ConnectionTypeID": 25,
            "StatusTypeID": 50,
            "LevelID": 2,
            "PowerKW": 72,
            "CurrentTypeID": 10,
            "Quantity": 2
        }
    ],
    "NumberOfPoints": 1,
    "GeneralComments": "Regional charging station",
    "StatusTypeID": 50,
    "DateLastStatusUpdate": "2020-09-03T14:06:00Z",
    "DataQualityLevel": 1,
    "DateCreated": "2020-09-02T17:16:00Z",
    "SubmissionStatusTypeID": 200
}