{
    "IsRecentlyVerified": false,
    "ID": 29629,
    "UUID": "5BA4C22C-CB82-4B67-8DD4-FFD0B1AD69D1",
    "DataProviderID": 15,
    "DataProvidersReference": "31826",
    "OperatorID": 1,
    "UsageTypeID": 1,
    "AddressInfo": {
        "ID": 29975,
        "Title": "1100 N Grand Ave",
        "AddressLine1": "1100 N Grand Ave",
        "Town": "Walnut",
        "StateOrProvince": "CA",
        "Postcode": "91789",
        "CountryID": 2,
        "Latitude": 34.04632018,
        "Longitude": -117.84371171,
        "ContactTelephone1": "(909) 274-7500",
        "RelatedURL": "http://carstations.com/31826",
        "DistanceUnit": 0
    },
    "Connections": [
        {
            "ID": 32614,
            "ConnectionTypeID": 9,
            "Reference": "NEMA5",
            "LevelID": 1
        }
    ],
    "NumberOfPoints": 2,
    "StatusTypeID": 0,
    "DateLastStatusUpdate": "2017-11-04T14:04:00Z",
    "DataQualityLevel": 2,
    "DateCreated": "2014-11-29T05:39:00Z",
    "SubmissionStatusTypeID": 100
}