{
    "IsRecentlyVerified": false,
    "ID": 136168,
    "UUID": "9F655D7B-4E56-47A1-AB45-2301A96DC217",
    "DataProviderID": 18,
    "DataProvidersReference": "30ac3fb164060f0b17c6cc119c2d33eb",
    "OperatorID": 2244,
    "UsageTypeID": 5,
    "AddressInfo": {
        "ID": 136514,
        "Title": "Tabard Street",
        "AddressLine1": "Tabard Street",
        "Town": "London",
        "Postcode": "SE1 4UR",
        "CountryID": 1,
        "Latitude": 51.495989,
        "Longitude": -0.087046,
        "AccessComments": "",
        "RelatedURL": "https://www.ubitricity.com",
        "DistanceUnit": 0
    },
    "Connections": [
        {
            "ID": 190597,
            "ConnectionTypeID": 25,
            "Reference": "suby1100001372",
            "StatusTypeID": 50,
            "LevelID": 2,
            "Amps": 16,
            "Voltage": 230,
            "PowerKW": 3.7,
            "CurrentTypeID": 10
        }
    ],
    "StatusTypeID": 0,
    "DateLastStatusUpdate": "2021-04-25T05:46:00Z",
    "MetadataValues": [
        {
            "ID": 6020,
            "MetadataFieldID": 4,
            "ItemValue": "Contains public sector information licensed under the Open Government Licence v2.0. http://www.nationalarchives.gov.uk/doc/open-government-licence/version/2/"
        }
    ],
    "DataQualityLevel": 3,
    "DateCreated": "2019-12-24T05:22:00Z",
    "SubmissionStatusTypeID": 100
}