{
    "IsRecentlyVerified": false,
    "ID": 118262,
    "UUID": "945149A8-DAB3-4C3F-A76C-A1B0B8A8A2AF",
    "DataProviderID": 1,
    "OperatorID": 80,
    "UsageTypeID": 4,
    "AddressInfo": {
        "ID": 118608,
        "Title": "Roma Piazzale Cina 1 | EnelX",
        "AddressLine1": "Piazzale Cina, 1",
        "Town": "Roma",
        "StateOrProvince": "RM",
        "Postcode": "00144",
        "CountryID": 112,
        "Latitude": 41.80778026241404,
        "Longitude": 12.432756556324875,
        "ContactTelephone1": "800.069.850",
        "RelatedURL": "https://www.enelx.com/it/it/emobility",
        "DistanceUnit": 0
    },
    "Connections": [
        {
            "ID": 167329,
            "ConnectionTypeID": 25,
            "StatusTypeID": 50,
            "LevelID": 2,
            "Amps": 32,
            "Voltage": 400,
            "PowerKW": 22,
            "CurrentTypeID": 20,
            "Quantity": 1
        },
        {
            "ID": 167330,
            "ConnectionTypeID": 36,
            "StatusTypeID": 50,
            "LevelID": 2,
            "Amps": 16,
            "Voltage": 240,
            "PowerKW": 3.7,
            "CurrentTypeID": 10,
            "Quantity": 1
        }
    ],
    "NumberOfPoints": 2,
    "StatusTypeID": 50,
    "DateLastStatusUpdate": "2019-03-19T17:51:00Z",
    "DataQualityLevel": 1,
    "DateCreated": "2019-03-19T17:51:00Z",
    "SubmissionStatusTypeID": 200
}