{
    "IsRecentlyVerified": false,
    "ID": 67157,
    "UUID": "9074CA3C-6201-4CE7-92EA-A54BE519492D",
    "DataProviderID": 2,
    "DataProvidersReference": "74277",
    "OperatorID": 5,
    "UsageTypeID": 1,
    "AddressInfo": {
        "ID": 67503,
        "Title": "HOMEWOOD SUITES",
        "AddressLine1": "1103 Embarcadero",
        "Town": "Oakland",
        "StateOrProvince": "CA",
        "Postcode": "94606",
        "CountryID": 2,
        "Latitude": 37.788073,
        "Longitude": -122.252071,
        "ContactTelephone1": "888-758-4389",
        "AccessComments": "24 hours daily",
        "RelatedURL": "http://www.chargepoint.com/",
        "DistanceUnit": 0
    },
    "Connections": [
        {
            "ID": 92653,
            "ConnectionTypeID": 32,
            "LevelID": 2,
            "Amps": 100,
            "Voltage": 400,
            "PowerKW": 40,
            "CurrentTypeID": 10,
            "Quantity": 1
        }
    ],
    "DateLastStatusUpdate": "2019-04-06T04:02:00Z",
    "DataQualityLevel": 3,
    "DateCreated": "2016-05-29T02:04:00Z",
    "SubmissionStatusTypeID": 100
}