{
    "UserComments": [
        {
            "ID": 3690,
            "ChargePointID": 16541,
            "CommentTypeID": 10,
            "UserName": "farmenergy",
            "Comment": "13 amp external socket, just by door to reception desk",
            "DateCreated": "2015-02-02T16:51:59.597Z",
            "User": {
                "ID": 4568,
                "Username": "farmenergy"
            },
            "CheckinStatusTypeID": 10
        }
    ],
    "IsRecentlyVerified": false,
    "ID": 16541,
    "UUID": "5A0B6621-9BCF-4BEB-8213-E62E7F292B28",
    "DataProviderID": 1,
    "OperatorID": 19,
    "UsageTypeID": 1,
    "UsageCost": "Free",
    "AddressInfo": {
        "ID": 16886,
        "Title": "Moorhill House Hotel",
        "AddressLine1": "Shappen Bottom",
        "AddressLine2": "Burley",
        "Town": "Ringwood",
        "StateOrProvince": "Hampshire",
        "Postcode": "BH24 4AH",
        "CountryID": 1,
        "Latitude": 50.8214581,
        "Longitude": -1.70308799999998,
        "ContactTelephone1": "01425 403 285",
        "ContactEmail": "moorhill@newforesthotels.co.uk",
        "RelatedURL": "https://moorhillhouse.newforesthotels.co.uk/",
        "DistanceUnit": 0
    },
    "Connections": [
        {
            "ID": 14986,
            "ConnectionTypeID": 3,
            "StatusTypeID": 50,
            "LevelID": 2,
            "Amps": 13,
            "Voltage": 230,
            "PowerKW": 3,
            "CurrentTypeID": 10,
            "Quantity": 2
        }
    ],
    "NumberOfPoints": 2,
    "StatusTypeID": 50,
    "DateLastStatusUpdate": "2021-04-01T13:56:00Z",
    "DataQualityLevel": 1,
    "DateCreated": "2013-05-13T12:00:00Z",
    "SubmissionStatusTypeID": 200
}