{
    "IsRecentlyVerified": false,
    "ID": 144587,
    "UUID": "001424B8-6357-43DA-AC8D-78E7C949432C",
    "DataProviderID": 2,
    "DataProvidersReference": "130665",
    "OperatorID": 90,
    "UsageTypeID": 1,
    "AddressInfo": {
        "ID": 144939,
        "Title": "1031 St-Zotique",
        "AddressLine1": "1031 Rue Saint-Zotique E",
        "Town": "Montréal",
        "StateOrProvince": "QC",
        "Postcode": "H2S 1N1",
        "CountryID": 44,
        "Latitude": 45.539166,
        "Longitude": -73.605403,
        "ContactTelephone1": "877-505-2674",
        "AccessComments": "24 hours daily",
        "RelatedURL": "https://lecircuitelectrique.com/",
        "DistanceUnit": 0
    },
    "Connections": [
        {
            "ID": 201097,
            "ConnectionTypeID": 1,
            "LevelID": 2,
            "Amps": 16,
            "Voltage": 230,
            "PowerKW": 3.7,
            "CurrentTypeID": 10,
            "Quantity": 2
        }
    ],
    "StatusTypeID": 50,
    "DateLastStatusUpdate": "2020-06-26T03:09:00Z",
    "DataQualityLevel": 3,
    "DateCreated": "2019-12-24T09:23:00Z",
    "SubmissionStatusTypeID": 100
}