{
    "IsRecentlyVerified": false,
    "ID": 54502,
    "UUID": "6E11BA6D-C2A7-481A-B259-F8F7EFA5C5F5",
    "DataProviderID": 1,
    "OperatorID": 125,
    "UsageTypeID": 4,
    "AddressInfo": {
        "ID": 54848,
        "Title": "Avia Tankstelle",
        "AddressLine1": "Dersumer Straße 10",
        "Town": "Heede",
        "StateOrProvince": "Samtgemeinde Dörpen",
        "Postcode": "26892",
        "CountryID": 87,
        "Latitude": 52.9825165311161,
        "Longitude": 7.28963069682004,
        "AccessComments": "Die Säule befindet sich direkt am rechten Shopgebäude der Tankstelle, die täglich von 5:30-23Uhr geöffet ist (Sa erst ab 6:30, So ab 9 Uhr).\r\nAuch Ladekarte der SUN, SW LB, ladeticket oder WSW verwendbar.",
        "RelatedURL": "http://www.ewe.de/",
        "DistanceUnit": 0
    },
    "Connections": [
        {
            "ID": 68768,
            "ConnectionTypeID": 25,
            "StatusTypeID": 50,
            "LevelID": 2,
            "Amps": 32,
            "Voltage": 400,
            "PowerKW": 22,
            "CurrentTypeID": 20,
            "Quantity": 2
        }
    ],
    "NumberOfPoints": 2,
    "StatusTypeID": 50,
    "DateLastStatusUpdate": "2015-10-05T07:09:00Z",
    "DataQualityLevel": 1,
    "DateCreated": "2015-10-05T06:40:00Z",
    "SubmissionStatusTypeID": 200
}