{
    "IsRecentlyVerified": false,
    "ID": 31679,
    "UUID": "80CCF8DC-D084-4F89-AE3D-B978E20AAFA3",
    "DataProviderID": 1,
    "OperatorID": 105,
    "OperatorsReference": "Essent EM-DE-09184139-01-00001",
    "UsageTypeID": 4,
    "AddressInfo": {
        "ID": 32025,
        "Title": "Zugspitzstraße 1",
        "AddressLine1": "Zugspitzstraße 1",
        "Town": "Pullach i.Isartal",
        "Postcode": "82049",
        "CountryID": 87,
        "Latitude": 48.043056,
        "Longitude": 11.509722,
        "DistanceUnit": 0
    },
    "Connections": [
        {
            "ID": 35190,
            "ConnectionTypeID": 25,
            "LevelID": 2,
            "PowerKW": 11
        },
        {
            "ID": 46041,
            "ConnectionTypeID": 25,
            "LevelID": 2,
            "PowerKW": 11
        }
    ],
    "NumberOfPoints": 1,
    "StatusTypeID": 50,
    "DateLastStatusUpdate": "2015-04-13T23:53:00Z",
    "DataQualityLevel": 3,
    "DateCreated": "2015-01-09T06:03:00Z",
    "SubmissionStatusTypeID": 200
}