{
    "IsRecentlyVerified": false,
    "ID": 159786,
    "UUID": "08981B36-B050-4EA8-82AB-DDF139A18FEB",
    "DataProviderID": 2,
    "DataProvidersReference": "154182",
    "OperatorID": 5,
    "UsageTypeID": 1,
    "AddressInfo": {
        "ID": 160143,
        "Title": "STATEOFUTDAS",
        "AddressLine1": "195 W 1100 S",
        "Town": "Brigham City",
        "StateOrProvince": "UT",
        "Postcode": "84302",
        "CountryID": 2,
        "Latitude": 41.48576,
        "Longitude": -112.022078,
        "ContactTelephone1": "888-758-4389",
        "AccessComments": "24 hours daily",
        "RelatedURL": "http://www.chargepoint.com/",
        "DistanceUnit": 0
    },
    "Connections": [
        {
            "ID": 230002,
            "ConnectionTypeID": 1,
            "LevelID": 2,
            "Amps": 16,
            "Voltage": 230,
            "PowerKW": 3.7,
            "CurrentTypeID": 10,
            "Quantity": 4
        }
    ],
    "StatusTypeID": 50,
    "DateLastStatusUpdate": "2020-06-26T03:04:00Z",
    "DataQualityLevel": 3,
    "DateCreated": "2020-06-26T03:04:00Z",
    "SubmissionStatusTypeID": 100
}