{
    "IsRecentlyVerified": false,
    "ID": 141606,
    "UUID": "7C2103AF-8BF8-4E85-986C-8E58DE6D0E0C",
    "DataProviderID": 2,
    "DataProvidersReference": "68123",
    "OperatorID": 5,
    "UsageTypeID": 1,
    "AddressInfo": {
        "ID": 141958,
        "Title": "EVERGY",
        "AddressLine1": "105 W 12th Ave @ Builders Assoc of Mo",
        "Town": "North Kansas City",
        "StateOrProvince": "MO",
        "Postcode": "64116",
        "CountryID": 2,
        "Latitude": 39.129607,
        "Longitude": -94.581422,
        "ContactTelephone1": "888-758-4389",
        "AccessComments": "24 hours daily",
        "RelatedURL": "http://www.chargepoint.com/",
        "DistanceUnit": 0
    },
    "Connections": [
        {
            "ID": 197572,
            "ConnectionTypeID": 1,
            "LevelID": 2,
            "Amps": 16,
            "Voltage": 230,
            "PowerKW": 3.7,
            "CurrentTypeID": 10,
            "Quantity": 4
        }
    ],
    "StatusTypeID": 50,
    "DateLastStatusUpdate": "2020-06-26T03:01:00Z",
    "DataQualityLevel": 3,
    "DateCreated": "2019-12-24T09:15:00Z",
    "SubmissionStatusTypeID": 100
}