{
    "IsRecentlyVerified": false,
    "ID": 179328,
    "UUID": "9B4FBE9E-367B-426B-82CB-939D3F9A387C",
    "DataProviderID": 29,
    "DataProvidersReference": "13372,2318",
    "OperatorID": 189,
    "AddressInfo": {
        "ID": 179687,
        "Title": "St.-Martin-Straße 6",
        "AddressLine1": "St.-Martin-Straße 6",
        "Town": "Velburg",
        "Postcode": "92355",
        "CountryID": 87,
        "Latitude": 49.23684,
        "Longitude": 11.62888,
        "DistanceUnit": 0
    },
    "Connections": [
        {
            "ID": 281000,
            "ConnectionTypeID": 25,
            "StatusTypeID": 50,
            "LevelID": 2,
            "PowerKW": 22,
            "CurrentTypeID": 20
        },
        {
            "ID": 281001,
            "ConnectionTypeID": 25,
            "StatusTypeID": 50,
            "LevelID": 2,
            "PowerKW": 22,
            "CurrentTypeID": 20
        },
        {
            "ID": 281002,
            "ConnectionTypeID": 25,
            "StatusTypeID": 50,
            "LevelID": 2,
            "PowerKW": 22,
            "CurrentTypeID": 20
        },
        {
            "ID": 281003,
            "ConnectionTypeID": 25,
            "StatusTypeID": 50,
            "LevelID": 2,
            "PowerKW": 22,
            "CurrentTypeID": 20
        }
    ],
    "StatusTypeID": 50,
    "DateLastStatusUpdate": "2021-07-09T03:15:00Z",
    "MetadataValues": [
        {
            "ID": 11622,
            "MetadataFieldID": 4,
            "ItemValue": "Data from the German chargepoint registry provided by Bundesnetzagentur.de under the CC-BY 4.0 license"
        }
    ],
    "DataQualityLevel": 3,
    "DateCreated": "2021-07-08T09:59:00Z",
    "SubmissionStatusTypeID": 100
}