{
    "IsRecentlyVerified": false,
    "ID": 105147,
    "UUID": "7BDC0A82-A711-4F40-8C32-106C30B26A60",
    "DataProviderID": 1,
    "OperatorID": 3,
    "OperatorsReference": "PG-81253",
    "UsageTypeID": 4,
    "UsageCost": "£0.25/kWh",
    "AddressInfo": {
        "ID": 105493,
        "Title": "National Trust Baggy Point",
        "AddressLine1": "Moor Lane",
        "AddressLine2": "Georgeham",
        "Town": "North Devon",
        "StateOrProvince": "Devon",
        "Postcode": "EX33 1FF",
        "CountryID": 1,
        "Latitude": 51.1360607583865,
        "Longitude": -4.24539441104503,
        "AccessComments": "Parking free for National Trust members.",
        "DistanceUnit": 0
    },
    "Connections": [
        {
            "ID": 148252,
            "ConnectionTypeID": 25,
            "StatusTypeID": 50,
            "LevelID": 2,
            "Amps": 32,
            "Voltage": 230,
            "PowerKW": 7,
            "CurrentTypeID": 10,
            "Quantity": 2
        }
    ],
    "NumberOfPoints": 2,
    "StatusTypeID": 50,
    "DateLastStatusUpdate": "2019-05-25T05:29:00Z",
    "DataQualityLevel": 1,
    "DateCreated": "2018-05-31T11:19:00Z",
    "SubmissionStatusTypeID": 200
}