{
    "IsRecentlyVerified": false,
    "ID": 102216,
    "UUID": "DCEB18B3-FBB1-436A-A01F-E6742E50A841",
    "DataProviderID": 1,
    "OperatorID": 45,
    "UsageTypeID": 6,
    "AddressInfo": {
        "ID": 102562,
        "Title": "Aircraft Hotel",
        "AddressLine1": "Take-Off Gewerbepark 84",
        "Town": "Neuhausen ob Eck",
        "StateOrProvince": "Verwaltungsgemeinschaft Tuttlingen",
        "Postcode": "78579",
        "CountryID": 87,
        "Latitude": 47.974911,
        "Longitude": 8.90596329999994,
        "ContactTelephone1": "+49 7467 949 180",
        "AccessComments": "Für Gäste nach Reservierung",
        "RelatedURL": "http://www.aircraft-eventhotel.de/",
        "DistanceUnit": 0
    },
    "Connections": [
        {
            "ID": 144261,
            "ConnectionTypeID": 17,
            "StatusTypeID": 50,
            "LevelID": 2,
            "Amps": 16,
            "Voltage": 400,
            "PowerKW": 11,
            "CurrentTypeID": 20,
            "Quantity": 1
        },
        {
            "ID": 144262,
            "ConnectionTypeID": 28,
            "StatusTypeID": 50,
            "LevelID": 2,
            "Amps": 16,
            "Voltage": 230,
            "PowerKW": 3.7,
            "CurrentTypeID": 10,
            "Quantity": 2
        }
    ],
    "NumberOfPoints": 2,
    "StatusTypeID": 50,
    "DateLastStatusUpdate": "2018-04-19T07:39:00Z",
    "DataQualityLevel": 1,
    "DateCreated": "2018-04-19T07:39:00Z",
    "SubmissionStatusTypeID": 200
}