{
    "IsRecentlyVerified": false,
    "ID": 116024,
    "UUID": "BA401A1E-7D67-48B6-A294-35322277574D",
    "DataProviderID": 2,
    "DataProvidersReference": "105142",
    "OperatorID": 5,
    "UsageTypeID": 1,
    "AddressInfo": {
        "ID": 116370,
        "Title": "PORTSMOUTH",
        "AddressLine1": "100 Foundry Pl",
        "Town": "Portsmouth",
        "StateOrProvince": "NH",
        "Postcode": "03801",
        "CountryID": 2,
        "Latitude": 43.0766827,
        "Longitude": -70.7637353,
        "ContactTelephone1": "888-758-4389",
        "AccessComments": "24 hours daily",
        "RelatedURL": "http://www.chargepoint.com/",
        "DistanceUnit": 0
    },
    "Connections": [
        {
            "ID": 163082,
            "ConnectionTypeID": 1,
            "LevelID": 2,
            "Amps": 16,
            "Voltage": 230,
            "PowerKW": 3.7,
            "CurrentTypeID": 10,
            "Quantity": 3
        }
    ],
    "DateLastStatusUpdate": "2020-06-26T03:06:00Z",
    "DataQualityLevel": 3,
    "DateCreated": "2019-02-11T07:13:00Z",
    "SubmissionStatusTypeID": 100
}