{
    "IsRecentlyVerified": false,
    "ID": 135220,
    "UUID": "1D393562-AE23-4FAA-B0F3-4213C778FC35",
    "DataProviderID": 1,
    "OperatorID": 3327,
    "UsageTypeID": 4,
    "AddressInfo": {
        "ID": 135566,
        "Title": "BeCharge Gambettola Lavoro",
        "AddressLine1": "Via del Lavoro",
        "Town": "Gambettola",
        "StateOrProvince": "FC",
        "Postcode": "47035",
        "CountryID": 112,
        "Latitude": 44.10836281705443,
        "Longitude": 12.336020253132233,
        "ContactTelephone1": "02-49527730",
        "ContactEmail": "emobility@buildingenergy.it",
        "RelatedURL": "https://www.bec.energy/",
        "DistanceUnit": 0
    },
    "Connections": [
        {
            "ID": 189321,
            "ConnectionTypeID": 25,
            "StatusTypeID": 50,
            "LevelID": 2,
            "Amps": 32,
            "Voltage": 400,
            "PowerKW": 22,
            "CurrentTypeID": 20,
            "Quantity": 2
        }
    ],
    "NumberOfPoints": 2,
    "StatusTypeID": 50,
    "DateLastStatusUpdate": "2019-12-11T14:51:00Z",
    "DataQualityLevel": 1,
    "DateCreated": "2019-12-11T14:51:00Z",
    "SubmissionStatusTypeID": 200
}