{
    "IsRecentlyVerified": false,
    "ID": 178720,
    "UUID": "25582730-E310-43CC-87C1-296741045BEB",
    "DataProviderID": 29,
    "DataProvidersReference": "7860",
    "AddressInfo": {
        "ID": 179079,
        "Title": "Marienstr. 19",
        "AddressLine1": "Marienstr. 19",
        "Town": "Düren",
        "Postcode": "52351",
        "CountryID": 87,
        "Latitude": 50.805,
        "Longitude": 6.488589,
        "DistanceUnit": 0
    },
    "Connections": [
        {
            "ID": 279515,
            "ConnectionTypeID": 25,
            "StatusTypeID": 50,
            "LevelID": 2,
            "PowerKW": 22,
            "CurrentTypeID": 20
        },
        {
            "ID": 279516,
            "ConnectionTypeID": 25,
            "StatusTypeID": 50,
            "LevelID": 2,
            "PowerKW": 22,
            "CurrentTypeID": 20
        }
    ],
    "StatusTypeID": 0,
    "DateLastStatusUpdate": "2021-07-12T02:45:00Z",
    "MetadataValues": [
        {
            "ID": 11014,
            "MetadataFieldID": 4,
            "ItemValue": "Data from the German chargepoint registry provided by Bundesnetzagentur.de under the CC-BY 4.0 license"
        }
    ],
    "DataQualityLevel": 3,
    "DateCreated": "2021-07-08T09:50:00Z",
    "SubmissionStatusTypeID": 100
}