{
    "IsRecentlyVerified": false,
    "ID": 35679,
    "UUID": "C28DCDAB-291E-472B-B1A3-9671279F4176",
    "DataProviderID": 26,
    "DataProvidersReference": "48325",
    "OperatorID": 178,
    "OperatorsReference": "EVnetNL EV0218",
    "UsageCost": "0.00 jaarabonnement",
    "AddressInfo": {
        "ID": 36025,
        "Title": "Noordenburglaan 21",
        "AddressLine1": "Noordenburglaan 21",
        "Town": "Voorburg",
        "Postcode": "2271 VG",
        "CountryID": 159,
        "Latitude": 52.072409,
        "Longitude": 4.364371,
        "ContactTelephone1": "0800-3522365",
        "RelatedURL": "http://www.evnet.nl",
        "DistanceUnit": 0
    },
    "Connections": [
        {
            "ID": 39190,
            "ConnectionTypeID": 25,
            "LevelID": 2,
            "PowerKW": 11,
            "CurrentTypeID": 10
        }
    ],
    "NumberOfPoints": 1,
    "StatusTypeID": 50,
    "DateLastStatusUpdate": "2016-06-04T02:47:00Z",
    "DataQualityLevel": 3,
    "DateCreated": "2015-01-09T06:05:00Z",
    "SubmissionStatusTypeID": 100
}