{
    "IsRecentlyVerified": false,
    "ID": 166306,
    "UUID": "03B0940D-B64D-4AA7-BF42-61D895300A8F",
    "DataProviderID": 28,
    "DataProvidersReference": "FR*S44*P44037A",
    "OperatorID": 3412,
    "UsageTypeID": 5,
    "AddressInfo": {
        "ID": 166665,
        "Title": "Château-Thébaud | Rue Saint-Thomas",
        "AddressLine1": "Rue Saint-Thomas 44690 Château-Thébaud",
        "CountryID": 80,
        "Latitude": 47.124176,
        "Longitude": -1.422498,
        "AccessComments": "24/24 7/7",
        "DistanceUnit": 0
    },
    "Connections": [
        {
            "ID": 246451,
            "ConnectionTypeID": 25,
            "StatusTypeID": 50,
            "LevelID": 2,
            "PowerKW": 18,
            "CurrentTypeID": 20
        },
        {
            "ID": 246452,
            "ConnectionTypeID": 28,
            "StatusTypeID": 50,
            "LevelID": 2,
            "PowerKW": 18,
            "CurrentTypeID": 10
        },
        {
            "ID": 246453,
            "ConnectionTypeID": 25,
            "StatusTypeID": 50,
            "LevelID": 2,
            "PowerKW": 18,
            "CurrentTypeID": 20
        },
        {
            "ID": 246454,
            "ConnectionTypeID": 28,
            "StatusTypeID": 50,
            "LevelID": 2,
            "PowerKW": 18,
            "CurrentTypeID": 10
        }
    ],
    "GeneralComments": "",
    "StatusTypeID": 50,
    "DateLastStatusUpdate": "2020-08-27T05:13:00Z",
    "DataQualityLevel": 2,
    "DateCreated": "2020-08-27T05:13:00Z",
    "SubmissionStatusTypeID": 100
}