{
    "IsRecentlyVerified": false,
    "ID": 70725,
    "UUID": "96FCE8F6-D460-4C28-B3A7-ACC36A87591D",
    "DataProviderID": 1,
    "OperatorID": 3248,
    "UsageTypeID": 1,
    "AddressInfo": {
        "ID": 71071,
        "Title": "Raststätte Köschinger Forst West",
        "AddressLine1": "A9",
        "Town": "Kösching",
        "StateOrProvince": "Landkreis Eichstätt",
        "Postcode": "85134",
        "CountryID": 87,
        "Latitude": 48.83756981732275,
        "Longitude": 11.469102041558799,
        "AccessComments": "2 kostenlose Parkplätze 24/7 nutzbar (bei den PKW Parkplätzen der Raststätte) . Zur Zeit (08/2016) kostenloses Laden ohne Ladekarte.",
        "DistanceUnit": 0
    },
    "Connections": [
        {
            "ID": 101304,
            "ConnectionTypeID": 2,
            "StatusTypeID": 50,
            "LevelID": 3,
            "PowerKW": 50,
            "CurrentTypeID": 30,
            "Quantity": 1
        },
        {
            "ID": 101305,
            "ConnectionTypeID": 33,
            "StatusTypeID": 50,
            "LevelID": 3,
            "PowerKW": 50,
            "CurrentTypeID": 30,
            "Quantity": 1
        },
        {
            "ID": 101306,
            "ConnectionTypeID": 1036,
            "StatusTypeID": 50,
            "LevelID": 3,
            "Amps": 63,
            "Voltage": 400,
            "PowerKW": 43,
            "CurrentTypeID": 20,
            "Quantity": 1
        }
    ],
    "NumberOfPoints": 2,
    "StatusTypeID": 50,
    "DateLastStatusUpdate": "2016-08-08T06:15:00Z",
    "DataQualityLevel": 1,
    "DateCreated": "2016-08-08T06:15:00Z",
    "SubmissionStatusTypeID": 200
}