{
    "IsRecentlyVerified": false,
    "ID": 111916,
    "UUID": "8FD6D647-06C4-4268-A699-B8112CEC3FF6",
    "DataProviderID": 2,
    "DataProvidersReference": "84359",
    "UsageTypeID": 1,
    "AddressInfo": {
        "ID": 112262,
        "Title": "Madrona Marketplace East",
        "AddressLine1": "500 North Rd",
        "Town": "Gabriola",
        "StateOrProvince": "BC",
        "Postcode": "V0R 1X0",
        "CountryID": 44,
        "Latitude": 49.174128,
        "Longitude": -123.848654,
        "ContactTelephone1": "250-739-0330",
        "AccessComments": "24 hours daily",
        "RelatedURL": "",
        "DistanceUnit": 0
    },
    "Connections": [
        {
            "ID": 157430,
            "ConnectionTypeID": 1,
            "LevelID": 2,
            "Amps": 16,
            "Voltage": 230,
            "PowerKW": 3.7,
            "CurrentTypeID": 10,
            "Quantity": 1
        }
    ],
    "DateLastStatusUpdate": "2020-06-26T03:11:00Z",
    "DataQualityLevel": 3,
    "DateCreated": "2018-10-18T23:37:00Z",
    "SubmissionStatusTypeID": 100
}