{
    "IsRecentlyVerified": false,
    "ID": 88038,
    "UUID": "CA9B51FE-F888-434D-BB32-435DABBC8182",
    "DataProviderID": 1,
    "OperatorID": 23,
    "OperatorsReference": "29603",
    "UsageTypeID": 6,
    "AddressInfo": {
        "ID": 88384,
        "Title": "Alyse Parc Auto",
        "AddressLine1": "Les Blaches",
        "Town": "Grenay",
        "Postcode": "38540",
        "CountryID": 80,
        "Latitude": 45.6716548,
        "Longitude": 5.0793806,
        "ContactTelephone1": "+33 4 72 22 41 16",
        "DistanceUnit": 0
    },
    "Connections": [
        {
            "ID": 124891,
            "ConnectionTypeID": 30,
            "StatusTypeID": 50,
            "LevelID": 2,
            "Amps": 16,
            "Voltage": 400,
            "PowerKW": 11,
            "CurrentTypeID": 20,
            "Quantity": 2
        }
    ],
    "NumberOfPoints": 2,
    "GeneralComments": "2 Tesla Connectors, up to 11kW.Available for patrons only. Please call ahead.",
    "StatusTypeID": 50,
    "DateLastStatusUpdate": "2018-10-03T20:32:00Z",
    "DataQualityLevel": 1,
    "DateCreated": "2017-05-20T05:34:00Z",
    "SubmissionStatusTypeID": 200
}