{
    "IsRecentlyVerified": false,
    "ID": 144867,
    "UUID": "230D307D-C205-4BEA-B121-9283FD13B2FD",
    "DataProviderID": 2,
    "DataProvidersReference": "129786",
    "OperatorID": 89,
    "UsageTypeID": 1,
    "AddressInfo": {
        "ID": 145219,
        "Title": "Municipalité de Saint-Barnabé-Sud",
        "AddressLine1": "251 rang de Michaudville",
        "Town": "Saint-Barnabé-Sud",
        "StateOrProvince": "QC",
        "Postcode": "J0H 1G0",
        "CountryID": 44,
        "Latitude": 45.731576,
        "Longitude": -72.925375,
        "ContactTelephone1": "888-356-8911",
        "AccessComments": "24 hours daily",
        "RelatedURL": "https://flo.ca/",
        "DistanceUnit": 0
    },
    "Connections": [
        {
            "ID": 201413,
            "ConnectionTypeID": 1,
            "LevelID": 2,
            "Amps": 16,
            "Voltage": 230,
            "PowerKW": 3.7,
            "CurrentTypeID": 10,
            "Quantity": 1
        }
    ],
    "StatusTypeID": 50,
    "DateLastStatusUpdate": "2020-06-26T03:09:00Z",
    "DataQualityLevel": 3,
    "DateCreated": "2019-12-24T09:23:00Z",
    "SubmissionStatusTypeID": 100
}