{
    "IsRecentlyVerified": false,
    "ID": 62755,
    "UUID": "27C25850-B167-408F-B94E-209DF2FBBA13",
    "DataProviderID": 26,
    "DataProvidersReference": "19573",
    "OperatorID": 162,
    "OperatorsReference": "旭川日産自動車㈱稚内店",
    "UsageCost": "0.00 onbekend",
    "AddressInfo": {
        "ID": 63101,
        "Title": "40",
        "AddressLine1": "40",
        "Town": "天塩郡 (Teshio District)",
        "Postcode": "",
        "CountryID": 114,
        "Latitude": 45.396557,
        "Longitude": 141.700455,
        "DistanceUnit": 0
    },
    "Connections": [
        {
            "ID": 79688,
            "ConnectionTypeID": 2,
            "LevelID": 3,
            "PowerKW": 50,
            "CurrentTypeID": 30
        }
    ],
    "NumberOfPoints": 1,
    "StatusTypeID": 50,
    "DateLastStatusUpdate": "2016-03-03T12:29:00Z",
    "DataQualityLevel": 3,
    "DateCreated": "2016-03-03T12:29:00Z",
    "SubmissionStatusTypeID": 100
}