{
    "IsRecentlyVerified": false,
    "ID": 16446,
    "UUID": "FB89F6D3-5E6F-4FB5-9ABA-D10C84A92641",
    "DataProviderID": 1,
    "OperatorID": 45,
    "UsageTypeID": 1,
    "UsageCost": "Free",
    "AddressInfo": {
        "ID": 16791,
        "Title": "J.F. Drake State Technical College",
        "AddressLine1": "3421 Meridian St N",
        "AddressLine2": "",
        "Town": "Huntsville",
        "StateOrProvince": "AL",
        "Postcode": "35811",
        "CountryID": 2,
        "Latitude": 34.7707819,
        "Longitude": -86.575943,
        "ContactTelephone1": "(256) 539-8161",
        "ContactTelephone2": "",
        "ContactEmail": "",
        "AccessComments": "Located in the southwest corner of the campus near the solar equipped small building for renewable energy research.",
        "RelatedURL": "http://www.dstc.cc.al.us/",
        "DistanceUnit": 0
    },
    "Connections": [
        {
            "ID": 14869,
            "ConnectionTypeID": 1,
            "StatusTypeID": 10,
            "LevelID": 2,
            "Quantity": 2
        }
    ],
    "NumberOfPoints": 2,
    "GeneralComments": "",
    "StatusTypeID": 50,
    "DateLastStatusUpdate": "2013-04-30T09:22:00Z",
    "DataQualityLevel": 1,
    "DateCreated": "2013-04-22T15:53:00Z",
    "SubmissionStatusTypeID": 200
}