{
    "IsRecentlyVerified": false,
    "ID": 131019,
    "UUID": "3642BEFD-12A5-478B-BD02-B0015AC52BF4",
    "DataProviderID": 1,
    "OperatorID": 23,
    "OperatorsReference": "51508",
    "UsageTypeID": 4,
    "AddressInfo": {
        "ID": 131365,
        "Title": "Best Western Hotel Kregenn",
        "AddressLine1": "13 Rue des Reguaires",
        "Town": "Quimper",
        "Postcode": "29000",
        "CountryID": 80,
        "Latitude": 47.99597,
        "Longitude": -4.097642,
        "ContactTelephone1": "+33 2 98 95 08 70",
        "DistanceUnit": 0
    },
    "Connections": [
        {
            "ID": 183514,
            "ConnectionTypeID": 30,
            "StatusTypeID": 50,
            "LevelID": 2,
            "PowerKW": 11,
            "CurrentTypeID": 20,
            "Quantity": 1
        }
    ],
    "NumberOfPoints": 1,
    "GeneralComments": "1 Tesla Connector, up to 11kW.Available for customers. Please see front desk.",
    "StatusTypeID": 50,
    "DateLastStatusUpdate": "2019-08-28T19:58:00Z",
    "DataQualityLevel": 1,
    "DateCreated": "2019-08-28T19:58:00Z",
    "SubmissionStatusTypeID": 200
}