{
    "IsRecentlyVerified": false,
    "ID": 33849,
    "UUID": "33D6E389-C3D7-423A-87FC-DA9385585D66",
    "DataProviderID": 26,
    "DataProvidersReference": "55973",
    "OperatorID": 157,
    "OperatorsReference": "NewMotion 02010917",
    "UsageCost": "0.00 jaarabonnement",
    "AddressInfo": {
        "ID": 34195,
        "Title": "Aalsburg 3124",
        "AddressLine1": "Aalsburg 3124",
        "Town": "Wijchen",
        "Postcode": "6602 WS",
        "CountryID": 159,
        "Latitude": 51.8077774047852,
        "Longitude": 5.71720504760742,
        "ContactTelephone1": "088 0109500",
        "RelatedURL": "http://thenewmotion.nl/",
        "DistanceUnit": 0
    },
    "Connections": [
        {
            "ID": 37360,
            "ConnectionTypeID": 25,
            "LevelID": 2,
            "PowerKW": 3.7,
            "CurrentTypeID": 10
        }
    ],
    "NumberOfPoints": 1,
    "StatusTypeID": 50,
    "DateLastStatusUpdate": "2016-06-04T02:40:00Z",
    "DataQualityLevel": 3,
    "DateCreated": "2015-01-09T06:04:00Z",
    "SubmissionStatusTypeID": 100
}