{
    "IsRecentlyVerified": false,
    "ID": 186076,
    "UUID": "7FEE2B72-00D4-486E-84A9-E555D94FB1D6",
    "DataProviderID": 29,
    "DataProvidersReference": "10650",
    "AddressInfo": {
        "ID": 186435,
        "Title": "Wilhelm-Bratfisch-Straße 1",
        "AddressLine1": "Wilhelm-Bratfisch-Straße 1",
        "Town": "Bad Soden-Salmünster",
        "Postcode": "63628",
        "CountryID": 87,
        "Latitude": 50.276933,
        "Longitude": 9.377301,
        "DistanceUnit": 0
    },
    "Connections": [
        {
            "ID": 297672,
            "ConnectionTypeID": 25,
            "StatusTypeID": 50,
            "LevelID": 2,
            "PowerKW": 11,
            "CurrentTypeID": 20
        },
        {
            "ID": 297673,
            "ConnectionTypeID": 25,
            "StatusTypeID": 50,
            "LevelID": 2,
            "PowerKW": 11,
            "CurrentTypeID": 20
        }
    ],
    "StatusTypeID": 50,
    "DateLastStatusUpdate": "2021-07-12T02:44:00Z",
    "MetadataValues": [
        {
            "ID": 18318,
            "MetadataFieldID": 4,
            "ItemValue": "Data from the German chargepoint registry provided by Bundesnetzagentur.de under the CC-BY 4.0 license"
        }
    ],
    "DataQualityLevel": 3,
    "DateCreated": "2021-07-12T02:44:00Z",
    "SubmissionStatusTypeID": 100
}