{
    "IsRecentlyVerified": false,
    "ID": 135582,
    "UUID": "1E20B5ED-9968-4250-A7CE-161FF388027D",
    "DataProviderID": 18,
    "DataProvidersReference": "aaa5def453b9de3c49f84c1bf00b8ce5",
    "OperatorID": 2244,
    "UsageTypeID": 5,
    "AddressInfo": {
        "ID": 135928,
        "Title": "Arragon Gardens",
        "AddressLine1": "Arragon Gardens",
        "Town": "London",
        "Postcode": "SW16 5LX",
        "CountryID": 1,
        "Latitude": 51.415938,
        "Longitude": -0.12819,
        "AccessComments": "",
        "RelatedURL": "https://www.ubitricity.com",
        "DistanceUnit": 0
    },
    "Connections": [
        {
            "ID": 189986,
            "ConnectionTypeID": 25,
            "Reference": "suby1100001504",
            "StatusTypeID": 50,
            "LevelID": 2,
            "Amps": 16,
            "Voltage": 230,
            "PowerKW": 3.7,
            "CurrentTypeID": 10
        }
    ],
    "StatusTypeID": 0,
    "DateLastStatusUpdate": "2021-04-25T05:46:00Z",
    "MetadataValues": [
        {
            "ID": 5434,
            "MetadataFieldID": 4,
            "ItemValue": "Contains public sector information licensed under the Open Government Licence v2.0. http://www.nationalarchives.gov.uk/doc/open-government-licence/version/2/"
        }
    ],
    "DataQualityLevel": 3,
    "DateCreated": "2019-12-24T05:22:00Z",
    "SubmissionStatusTypeID": 100
}