{
    "IsRecentlyVerified": false,
    "ID": 17084,
    "UUID": "60DE59AA-91B2-4748-BC67-AE265F66136D",
    "DataProviderID": 22,
    "DataProvidersReference": "4AFEA7D073863B9DBE80CFAC0BA75D5A",
    "AddressInfo": {
        "ID": 17429,
        "Title": "ＥＮＥＯＳ　ＤＤセルフ町田木曽店",
        "AddressLine1": "東京都町田市木曽町22-2474-1",
        "CountryID": 114,
        "Latitude": 35.57209074,
        "Longitude": 139.4149553,
        "ContactTelephone1": "042-793-5999",
        "DistanceUnit": 0
    },
    "Connections": [
        {
            "ID": 17325,
            "ConnectionTypeID": 2,
            "LevelID": 2,
            "Amps": 100,
            "Voltage": 480,
            "PowerKW": 48,
            "Quantity": 1
        }
    ],
    "DateLastStatusUpdate": "2013-06-29T08:53:00Z",
    "DataQualityLevel": 2,
    "DateCreated": "2013-06-29T08:53:00Z",
    "SubmissionStatusTypeID": 200
}