{
    "IsRecentlyVerified": false,
    "ID": 158204,
    "UUID": "5BFF196F-286F-4631-ADB1-BE525239CBAE",
    "DataProviderID": 1,
    "OperatorID": 3315,
    "UsageTypeID": 1,
    "AddressInfo": {
        "ID": 158558,
        "Title": "Slighe Naomh Ronain",
        "AddressLine1": "Slighe Naomh Ronain",
        "Town": "Isle of Lewis",
        "Postcode": "HS2 0XB",
        "CountryID": 1,
        "Latitude": 58.494884,
        "Longitude": -6.254146,
        "DistanceUnit": 0
    },
    "Connections": [
        {
            "ID": 228153,
            "ConnectionTypeID": 25,
            "Reference": "3815-0011/14-2",
            "StatusTypeID": 50,
            "LevelID": 2,
            "Amps": 32,
            "Voltage": 400,
            "PowerKW": 22,
            "CurrentTypeID": 20
        },
        {
            "ID": 228154,
            "ConnectionTypeID": 25,
            "Reference": "3815-0011/14-1",
            "StatusTypeID": 50,
            "LevelID": 2,
            "Amps": 32,
            "Voltage": 400,
            "PowerKW": 22,
            "CurrentTypeID": 20
        }
    ],
    "StatusTypeID": 0,
    "DateLastStatusUpdate": "2021-07-15T11:35:00Z",
    "MetadataValues": [
        {
            "ID": 7737,
            "MetadataFieldID": 4,
            "ItemValue": "Contains public sector information licensed under the Open Government Licence v2.0. http://www.nationalarchives.gov.uk/doc/open-government-licence/version/2/"
        }
    ],
    "DataQualityLevel": 3,
    "DateCreated": "2020-06-25T10:00:00Z",
    "SubmissionStatusTypeID": 100
}