{
    "IsRecentlyVerified": false,
    "ID": 158898,
    "UUID": "7F9EB199-309B-41AB-B87F-BF23B21A1238",
    "DataProviderID": 2,
    "DataProvidersReference": "154136",
    "OperatorID": 5,
    "UsageTypeID": 1,
    "AddressInfo": {
        "ID": 159255,
        "Title": "LCF PARK&RIDE;",
        "AddressLine1": "4491 Cornishon Ave",
        "Town": "La Cañada Flintridge",
        "StateOrProvince": "CA",
        "Postcode": "91011",
        "CountryID": 2,
        "Latitude": 34.2052032,
        "Longitude": -118.2041174,
        "ContactTelephone1": "888-758-4389",
        "AccessComments": "24 hours daily",
        "RelatedURL": "http://www.chargepoint.com/",
        "DistanceUnit": 0
    },
    "Connections": [
        {
            "ID": 228935,
            "ConnectionTypeID": 1,
            "LevelID": 2,
            "Amps": 16,
            "Voltage": 230,
            "PowerKW": 3.7,
            "CurrentTypeID": 10,
            "Quantity": 1
        }
    ],
    "StatusTypeID": 50,
    "DateLastStatusUpdate": "2020-06-26T02:57:00Z",
    "DataQualityLevel": 3,
    "DateCreated": "2020-06-26T02:57:00Z",
    "SubmissionStatusTypeID": 100
}