{
    "IsRecentlyVerified": false,
    "ID": 181482,
    "UUID": "52E3D970-A098-440E-83EE-2C10BAECAFDC",
    "DataProviderID": 29,
    "DataProvidersReference": "1324",
    "OperatorID": 140,
    "AddressInfo": {
        "ID": 181841,
        "Title": "Teichstraße",
        "AddressLine1": "Teichstraße",
        "Town": "Gladenbach",
        "Postcode": "35075",
        "CountryID": 87,
        "Latitude": 50.770434,
        "Longitude": 8.578681,
        "DistanceUnit": 0
    },
    "Connections": [
        {
            "ID": 285856,
            "ConnectionTypeID": 25,
            "StatusTypeID": 50,
            "LevelID": 2,
            "PowerKW": 22,
            "CurrentTypeID": 20
        },
        {
            "ID": 285857,
            "ConnectionTypeID": 25,
            "StatusTypeID": 50,
            "LevelID": 2,
            "PowerKW": 22,
            "CurrentTypeID": 20
        }
    ],
    "StatusTypeID": 50,
    "DateLastStatusUpdate": "2021-07-09T03:20:00Z",
    "MetadataValues": [
        {
            "ID": 13776,
            "MetadataFieldID": 4,
            "ItemValue": "Data from the German chargepoint registry provided by Bundesnetzagentur.de under the CC-BY 4.0 license"
        }
    ],
    "DataQualityLevel": 3,
    "DateCreated": "2021-07-08T10:01:00Z",
    "SubmissionStatusTypeID": 100
}