{
    "MediaItems": [
        {
            "ID": 418,
            "ChargePointID": 24074,
            "ItemURL": "https://s3-ap-southeast-2.amazonaws.com/openchargemap/images/DE/OCM24074/OCM-24074.orig.2014061221580240.jpg",
            "ItemThumbnailURL": "https://s3-ap-southeast-2.amazonaws.com/openchargemap/images/DE/OCM24074/OCM-24074.thmb.2014061221580240.jpg",
            "Comment": "",
            "IsEnabled": true,
            "IsVideo": false,
            "IsFeaturedItem": false,
            "IsExternalResource": false,
            "User": {
                "ID": 1107,
                "Username": "Someone_Just_"
            },
            "DateCreated": "2014-06-12T21:58:00Z"
        }
    ],
    "IsRecentlyVerified": false,
    "ID": 24074,
    "UUID": "3E82B545-24D8-474D-B3BD-529F075E5FF6",
    "DataProviderID": 1,
    "OperatorID": 1,
    "UsageTypeID": 1,
    "UsageCost": "free",
    "AddressInfo": {
        "ID": 24419,
        "Title": "Auto & Technik MUSEUM SINSHEIM",
        "AddressLine1": "Museumsplatz",
        "Town": "Sinsheim",
        "Postcode": "74889 ",
        "CountryID": 87,
        "Latitude": 49.23918263500709,
        "Longitude": 8.896613712282159,
        "ContactTelephone1": "0049 (0) 7261 / 9299-0",
        "RelatedURL": "http://sinsheim.technik-museum.de/",
        "DistanceUnit": 0
    },
    "Connections": [
        {
            "ID": 26085,
            "ConnectionTypeID": 16,
            "StatusTypeID": 50,
            "LevelID": 2,
            "Amps": 16,
            "Voltage": 230,
            "PowerKW": 3.7,
            "CurrentTypeID": 10,
            "Quantity": 2
        }
    ],
    "NumberOfPoints": 1,
    "StatusTypeID": 50,
    "DateLastStatusUpdate": "2014-06-12T21:53:00Z",
    "DataQualityLevel": 1,
    "DateCreated": "2014-06-12T21:50:00Z",
    "SubmissionStatusTypeID": 200
}