{
    "MediaItems": [
        {
            "ID": 13543,
            "ChargePointID": 94150,
            "ItemURL": "https://s3-ap-southeast-2.amazonaws.com/openchargemap/images/HU/OCM94150/OCM-94150.orig.2017101820501920.jpg",
            "ItemThumbnailURL": "https://s3-ap-southeast-2.amazonaws.com/openchargemap/images/HU/OCM94150/OCM-94150.thmb.2017101820501920.jpg",
            "Comment": "",
            "IsEnabled": true,
            "IsVideo": false,
            "IsFeaturedItem": false,
            "IsExternalResource": false,
            "User": {
                "ID": 4438,
                "Username": "tibor.antaloczy"
            },
            "DateCreated": "2017-10-18T20:51:00Z"
        },
        {
            "ID": 13544,
            "ChargePointID": 94150,
            "ItemURL": "https://s3-ap-southeast-2.amazonaws.com/openchargemap/images/HU/OCM94150/OCM-94150.orig.2017101820504163.jpg",
            "ItemThumbnailURL": "https://s3-ap-southeast-2.amazonaws.com/openchargemap/images/HU/OCM94150/OCM-94150.thmb.2017101820504163.jpg",
            "Comment": "",
            "IsEnabled": true,
            "IsVideo": false,
            "IsFeaturedItem": false,
            "IsExternalResource": false,
            "User": {
                "ID": 4438,
                "Username": "tibor.antaloczy"
            },
            "DateCreated": "2017-10-18T20:51:00Z"
        }
    ],
    "IsRecentlyVerified": false,
    "ID": 94150,
    "UUID": "4261CCD9-7FC0-4D9D-B705-4D9B254C65DB",
    "DataProviderID": 1,
    "OperatorID": 45,
    "UsageTypeID": 1,
    "UsageCost": "free",
    "AddressInfo": {
        "ID": 94496,
        "Title": "Budapest, Régi Fóti út Penny Market",
        "AddressLine1": "Régi Fóti út 66-68.",
        "Town": "Budapest",
        "StateOrProvince": "Budapest",
        "Postcode": "1152",
        "CountryID": 104,
        "Latitude": 47.56064592639334,
        "Longitude": 19.121817193548637,
        "AccessComments": "In the parking lot of Penny Market on the gas station side.",
        "DistanceUnit": 0
    },
    "Connections": [
        {
            "ID": 133244,
            "ConnectionTypeID": 25,
            "StatusTypeID": 50,
            "LevelID": 2,
            "Amps": 32,
            "Voltage": 400,
            "PowerKW": 22,
            "CurrentTypeID": 20,
            "Quantity": 2
        }
    ],
    "NumberOfPoints": 2,
    "GeneralComments": "Charger starts automatically after the cable is attached.",
    "StatusTypeID": 50,
    "DateLastStatusUpdate": "2017-10-18T20:51:00Z",
    "DataQualityLevel": 1,
    "DateCreated": "2017-10-18T20:26:00Z",
    "SubmissionStatusTypeID": 200
}