{
    "IsRecentlyVerified": false,
    "ID": 152078,
    "UUID": "4D52378D-06ED-443E-872E-903198924F89",
    "DataProviderID": 28,
    "DataProvidersReference": "FRSEOPAB79191P0229A",
    "OperatorID": 3383,
    "UsageTypeID": 5,
    "AddressInfo": {
        "ID": 152431,
        "Title": "R‚seau Alterbase - St Maixent L'Ecole - Centre commercial E.Leclerc",
        "AddressLine1": "Plaine d'Azia - 79400 AZAY LE BRULE",
        "CountryID": 80,
        "Latitude": 46.4082556,
        "Longitude": -0.2232991,
        "AccessComments": "24/24 7/7 jours",
        "DistanceUnit": 0
    },
    "Connections": [
        {
            "ID": 212738,
            "ConnectionTypeID": 2,
            "StatusTypeID": 50,
            "LevelID": 3,
            "PowerKW": 50,
            "CurrentTypeID": 30
        },
        {
            "ID": 212739,
            "ConnectionTypeID": 33,
            "StatusTypeID": 50,
            "LevelID": 3,
            "PowerKW": 50,
            "CurrentTypeID": 30
        },
        {
            "ID": 245596,
            "ConnectionTypeID": 33,
            "StatusTypeID": 50,
            "LevelID": 3,
            "PowerKW": 50,
            "CurrentTypeID": 30
        }
    ],
    "GeneralComments": "www.alterbase.fr",
    "StatusTypeID": 50,
    "DateLastStatusUpdate": "2020-08-27T05:12:00Z",
    "DataQualityLevel": 2,
    "DateCreated": "2020-03-15T10:53:00Z",
    "SubmissionStatusTypeID": 100
}