{
    "IsRecentlyVerified": false,
    "ID": 176758,
    "UUID": "671DEFE5-F9A0-4A31-BCA6-697601E6652F",
    "DataProviderID": 29,
    "DataProvidersReference": "10918",
    "OperatorID": 3403,
    "AddressInfo": {
        "ID": 177117,
        "Title": "Muldental Nord BAB14 ",
        "AddressLine1": "Muldental Nord BAB14 ",
        "Town": "Grimma",
        "Postcode": "04668",
        "CountryID": 87,
        "Latitude": 51.261952,
        "Longitude": 12.707893,
        "DistanceUnit": 0
    },
    "Connections": [
        {
            "ID": 275038,
            "ConnectionTypeID": 1036,
            "StatusTypeID": 50,
            "LevelID": 3,
            "PowerKW": 43,
            "CurrentTypeID": 20
        },
        {
            "ID": 275039,
            "ConnectionTypeID": 33,
            "StatusTypeID": 50,
            "LevelID": 3,
            "PowerKW": 50,
            "CurrentTypeID": 30
        },
        {
            "ID": 299018,
            "ConnectionTypeID": 2,
            "StatusTypeID": 50,
            "LevelID": 3,
            "PowerKW": 50,
            "CurrentTypeID": 30
        }
    ],
    "StatusTypeID": 0,
    "DateLastStatusUpdate": "2021-07-12T02:47:00Z",
    "MetadataValues": [
        {
            "ID": 9053,
            "MetadataFieldID": 4,
            "ItemValue": "Data from the German chargepoint registry provided by Bundesnetzagentur.de under the CC-BY 4.0 license"
        }
    ],
    "DataQualityLevel": 3,
    "DateCreated": "2021-07-08T09:48:00Z",
    "SubmissionStatusTypeID": 100
}