{
    "IsRecentlyVerified": false,
    "ID": 100542,
    "UUID": "766053CE-AEF4-46CD-A226-B1A8416218C2",
    "DataProviderID": 1,
    "OperatorID": 45,
    "UsageTypeID": 1,
    "AddressInfo": {
        "ID": 100888,
        "Title": "E-Bike Station",
        "AddressLine1": "Hüttenweg 26",
        "Town": "Nordstrand",
        "StateOrProvince": "Nordsee-Treene",
        "Postcode": "25845",
        "CountryID": 87,
        "Latitude": 54.51382,
        "Longitude": 8.895999999999958,
        "AccessComments": "5 Schukodosen - immer an - 24/7 kostenlos nutzbar ",
        "DistanceUnit": 0
    },
    "Connections": [
        {
            "ID": 142019,
            "ConnectionTypeID": 28,
            "StatusTypeID": 50,
            "LevelID": 2,
            "Amps": 16,
            "Voltage": 230,
            "PowerKW": 3.7,
            "CurrentTypeID": 10,
            "Quantity": 5
        }
    ],
    "NumberOfPoints": 5,
    "StatusTypeID": 50,
    "DateLastStatusUpdate": "2018-02-28T15:19:00Z",
    "DataQualityLevel": 1,
    "DateCreated": "2018-02-28T15:19:00Z",
    "SubmissionStatusTypeID": 200
}