{
    "IsRecentlyVerified": false,
    "ID": 177306,
    "UUID": "C4EC7CBE-872A-405C-A6DD-3F4CE508DFCE",
    "DataProviderID": 29,
    "DataProvidersReference": "14548",
    "OperatorID": 103,
    "AddressInfo": {
        "ID": 177665,
        "Title": "Lepsiusstr. 14",
        "AddressLine1": "Lepsiusstr. 14",
        "Town": "Berlin",
        "Postcode": "12163",
        "CountryID": 87,
        "Latitude": 52.465119,
        "Longitude": 13.321319,
        "DistanceUnit": 0
    },
    "Connections": [
        {
            "ID": 276305,
            "ConnectionTypeID": 25,
            "StatusTypeID": 50,
            "LevelID": 2,
            "PowerKW": 11,
            "CurrentTypeID": 20
        },
        {
            "ID": 276306,
            "ConnectionTypeID": 25,
            "StatusTypeID": 50,
            "LevelID": 2,
            "PowerKW": 11,
            "CurrentTypeID": 20
        }
    ],
    "StatusTypeID": 0,
    "DateLastStatusUpdate": "2021-07-12T02:49:00Z",
    "MetadataValues": [
        {
            "ID": 9600,
            "MetadataFieldID": 4,
            "ItemValue": "Data from the German chargepoint registry provided by Bundesnetzagentur.de under the CC-BY 4.0 license"
        }
    ],
    "DataQualityLevel": 3,
    "DateCreated": "2021-07-08T09:48:00Z",
    "SubmissionStatusTypeID": 100
}