{
    "IsRecentlyVerified": false,
    "ID": 46565,
    "UUID": "BFE59806-040B-4A02-A384-E87AC603BCD6",
    "DataProviderID": 1,
    "DataProvidersReference": "46",
    "AddressInfo": {
        "ID": 46911,
        "Title": "Stasjonsveien, Fåvang",
        "AddressLine1": "Stasjonsveien 3",
        "Town": "FÅVANG",
        "StateOrProvince": "Innlandet",
        "Postcode": "2634",
        "CountryID": 168,
        "Latitude": 61.45477,
        "Longitude": 10.19349,
        "AccessComments": "Dobbelt ladepunkt veggmontert på Tromsvang kulturhus til venstre når du kommer innkjøringsveien fra E6 retning sentrum, vis a vis Helsesenteret.",
        "DistanceUnit": 0
    },
    "Connections": [
        {
            "ID": 57228,
            "ConnectionTypeID": 0,
            "Reference": "1",
            "LevelID": 2,
            "Amps": 16,
            "Voltage": 230,
            "PowerKW": 3.7,
            "Comments": "Mode 1"
        },
        {
            "ID": 89224,
            "ConnectionTypeID": 0,
            "Reference": "2",
            "LevelID": 2,
            "Amps": 16,
            "Voltage": 230,
            "PowerKW": 3.7,
            "Comments": "Mode 1"
        }
    ],
    "NumberOfPoints": 2,
    "DateLastStatusUpdate": "2020-05-26T08:24:00Z",
    "DataQualityLevel": 2,
    "DateCreated": "2015-05-03T00:54:00Z",
    "SubmissionStatusTypeID": 100
}