{
    "IsRecentlyVerified": false,
    "ID": 52372,
    "UUID": "A949E141-AF67-4B7A-976D-2CEA3328C6A3",
    "DataProviderID": 1,
    "OperatorID": 105,
    "UsageTypeID": 1,
    "UsageCost": "0",
    "AddressInfo": {
        "ID": 52718,
        "Title": "E-Bike Station Rathaus",
        "AddressLine1": "Herrenstr. 2",
        "Town": "Sonsbeck",
        "Postcode": "47665",
        "CountryID": 87,
        "Latitude": 51.61173,
        "Longitude": 6.37390000000005,
        "RelatedURL": "http://www.rwe.com/web/cms/de/494436/e-bikes-on-tour/ladestationen/",
        "DistanceUnit": 0
    },
    "Connections": [
        {
            "ID": 65025,
            "ConnectionTypeID": 28,
            "StatusTypeID": 50,
            "LevelID": 1,
            "Amps": 10,
            "Voltage": 230,
            "PowerKW": 2.3,
            "CurrentTypeID": 10,
            "Quantity": 3
        }
    ],
    "NumberOfPoints": 3,
    "StatusTypeID": 50,
    "DateLastStatusUpdate": "2015-08-29T07:48:00Z",
    "DataQualityLevel": 1,
    "DateCreated": "2015-08-28T21:01:00Z",
    "SubmissionStatusTypeID": 200
}