{
    "IsRecentlyVerified": false,
    "ID": 36830,
    "UUID": "AD113134-E702-4C8E-8C6E-3AD582E2D7FC",
    "DataProviderID": 26,
    "DataProvidersReference": "47645",
    "OperatorID": 178,
    "OperatorsReference": "EVnetNL AL796",
    "UsageCost": "0.00 jaarabonnement",
    "AddressInfo": {
        "ID": 37176,
        "Title": "Westerhout 2",
        "AddressLine1": "Westerhout 2",
        "Town": "Noordwijkerhout",
        "Postcode": "2211 TV",
        "CountryID": 159,
        "Latitude": 52.261744,
        "Longitude": 4.481794,
        "ContactTelephone1": "0800-3522365",
        "RelatedURL": "http://www.evnet.nl",
        "DistanceUnit": 0
    },
    "Connections": [
        {
            "ID": 40341,
            "ConnectionTypeID": 25,
            "LevelID": 2,
            "PowerKW": 11,
            "CurrentTypeID": 10
        }
    ],
    "NumberOfPoints": 2,
    "StatusTypeID": 50,
    "DateLastStatusUpdate": "2016-06-04T02:52:00Z",
    "DataQualityLevel": 3,
    "DateCreated": "2015-01-09T06:07:00Z",
    "SubmissionStatusTypeID": 100
}