{
    "IsRecentlyVerified": false,
    "ID": 34661,
    "UUID": "EC764290-E82C-4CEB-A69A-BC0DA38A35F3",
    "DataProviderID": 26,
    "DataProvidersReference": "49691",
    "OperatorID": 73,
    "OperatorsReference": "Noorderhavenkade / de Blijberg",
    "UsageCost": "0.00 jaarabonnement",
    "AddressInfo": {
        "ID": 35007,
        "Title": "Noorderhavenkade 5A",
        "AddressLine1": "Noorderhavenkade 5A",
        "Town": "Rotterdam",
        "Postcode": "3039 RB",
        "CountryID": 159,
        "Latitude": 51.935302620773,
        "Longitude": 4.4584469497204,
        "RelatedURL": "http://Onbekend",
        "DistanceUnit": 0
    },
    "Connections": [
        {
            "ID": 38172,
            "ConnectionTypeID": 25,
            "LevelID": 2,
            "PowerKW": 3.7,
            "CurrentTypeID": 10
        }
    ],
    "NumberOfPoints": 2,
    "StatusTypeID": 50,
    "DateLastStatusUpdate": "2016-06-04T02:42:00Z",
    "DataQualityLevel": 3,
    "DateCreated": "2015-01-09T06:04:00Z",
    "SubmissionStatusTypeID": 100
}