{
    "IsRecentlyVerified": false,
    "ID": 45701,
    "UUID": "928F8379-AA3A-48CD-9B8D-CBB8BFAED482",
    "DataProviderID": 1,
    "DataProvidersReference": "2476",
    "AddressInfo": {
        "ID": 46047,
        "Title": "Kiwi Sørlandsparken, Kristiansand",
        "AddressLine1": "Barstølveien 60A",
        "Town": "KRISTIANSAND S",
        "StateOrProvince": "Agder",
        "Postcode": "4636",
        "CountryID": 168,
        "Latitude": 58.17733,
        "Longitude": 8.12998,
        "AccessComments": "Utenfor butikk",
        "DistanceUnit": 0
    },
    "Connections": [
        {
            "ID": 56364,
            "ConnectionTypeID": 0,
            "Reference": "1",
            "LevelID": 2,
            "Amps": 100,
            "Voltage": 500,
            "PowerKW": 50,
            "Comments": "Mode 4"
        },
        {
            "ID": 83987,
            "ConnectionTypeID": 0,
            "Reference": "2",
            "LevelID": 2,
            "Amps": 100,
            "Voltage": 500,
            "PowerKW": 50,
            "Comments": "Mode 4"
        },
        {
            "ID": 87931,
            "ConnectionTypeID": 0,
            "Reference": "3",
            "LevelID": 2,
            "Amps": 32,
            "Voltage": 400,
            "PowerKW": 22,
            "Comments": "Mode 3"
        }
    ],
    "NumberOfPoints": 3,
    "DateLastStatusUpdate": "2020-05-26T08:21:00Z",
    "DataQualityLevel": 2,
    "DateCreated": "2015-05-03T00:54:00Z",
    "SubmissionStatusTypeID": 100
}