{
    "IsRecentlyVerified": false,
    "ID": 175551,
    "UUID": "A054892B-3C4B-42D3-9FF7-9F077CD14A07",
    "DataProviderID": 1,
    "OperatorID": 150,
    "UsageTypeID": 4,
    "UsageCost": "35p per kW",
    "AddressInfo": {
        "ID": 175910,
        "Title": "Asda Otley",
        "AddressLine1": "Cross Green",
        "AddressLine2": "Dennison Hill",
        "Town": "Otley",
        "StateOrProvince": "England",
        "Postcode": "LS21 1SW",
        "CountryID": 1,
        "Latitude": 53.90685923628877,
        "Longitude": -1.6875354229348432,
        "AccessComments": "Engie rapid charger, 50kW DC, AC is a 22 Kw Socket. One bay for general use, one bay for taxis. Both Free to charge. Please register at : https://ev.engie.co.uk",
        "RelatedURL": "https://ev.engie.co.uk",
        "DistanceUnit": 0
    },
    "Connections": [
        {
            "ID": 272520,
            "ConnectionTypeID": 25,
            "StatusTypeID": 50,
            "LevelID": 2,
            "PowerKW": 22,
            "CurrentTypeID": 20,
            "Quantity": 1
        },
        {
            "ID": 272521,
            "ConnectionTypeID": 2,
            "StatusTypeID": 50,
            "LevelID": 3,
            "PowerKW": 50,
            "CurrentTypeID": 30,
            "Quantity": 1
        },
        {
            "ID": 272522,
            "ConnectionTypeID": 33,
            "StatusTypeID": 50,
            "LevelID": 3,
            "PowerKW": 50,
            "CurrentTypeID": 30,
            "Quantity": 1
        }
    ],
    "NumberOfPoints": 1,
    "GeneralComments": "AC is a 22 kW socket",
    "StatusTypeID": 50,
    "DateLastStatusUpdate": "2021-05-28T09:41:00Z",
    "DataQualityLevel": 1,
    "DateCreated": "2021-05-28T09:41:00Z",
    "SubmissionStatusTypeID": 200
}