{
    "IsRecentlyVerified": false,
    "ID": 33742,
    "UUID": "66597B81-862A-40E4-A684-87D7FDE34927",
    "DataProviderID": 26,
    "DataProvidersReference": "34916",
    "OperatorID": 73,
    "OperatorsReference": "EV-Box EVB-P1335121",
    "UsageCost": "0.00 jaarabonnement",
    "AddressInfo": {
        "ID": 34088,
        "Title": "Schenkeldijk 4",
        "AddressLine1": "Schenkeldijk 4",
        "Town": "Binnenmaas",
        "Postcode": "3295 EG",
        "CountryID": 159,
        "Latitude": 51.75289,
        "Longitude": 4.60018,
        "RelatedURL": "http://www.ev-box.nl",
        "DistanceUnit": 0
    },
    "Connections": [
        {
            "ID": 37253,
            "ConnectionTypeID": 25,
            "LevelID": 2,
            "PowerKW": 5,
            "CurrentTypeID": 10
        }
    ],
    "NumberOfPoints": 1,
    "StatusTypeID": 50,
    "DateLastStatusUpdate": "2016-06-04T02:40:00Z",
    "DataQualityLevel": 3,
    "DateCreated": "2015-01-09T06:04:00Z",
    "SubmissionStatusTypeID": 100
}