{
    "IsRecentlyVerified": false,
    "ID": 130359,
    "UUID": "82F6FCB0-3153-4E65-A213-FC5CA3508A44",
    "DataProviderID": 1,
    "OperatorID": 3,
    "OperatorsReference": "PG-83227",
    "UsageTypeID": 4,
    "UsageCost": "Free",
    "AddressInfo": {
        "ID": 130705,
        "Title": "Lewes Station",
        "AddressLine1": "Station Street",
        "Town": "Lewes",
        "Postcode": "BN7 2UP",
        "CountryID": 1,
        "Latitude": 50.871065,
        "Longitude": 0.011575,
        "DistanceUnit": 0
    },
    "Connections": [
        {
            "ID": 182524,
            "ConnectionTypeID": 25,
            "StatusTypeID": 50,
            "LevelID": 2,
            "Amps": 32,
            "Voltage": 230,
            "PowerKW": 3,
            "CurrentTypeID": 10,
            "Quantity": 2
        }
    ],
    "NumberOfPoints": 2,
    "GeneralComments": "This is an open charge unit installed at the Lewes Station car park at Station Street, Lewes",
    "StatusTypeID": 50,
    "DateLastStatusUpdate": "2019-08-05T05:29:00Z",
    "DataQualityLevel": 1,
    "DateCreated": "2019-08-04T05:22:00Z",
    "SubmissionStatusTypeID": 200
}