{
    "IsRecentlyVerified": false,
    "ID": 169812,
    "UUID": "AD7A7870-C69C-41BF-BC8B-A3D7FD9B9049",
    "DataProviderID": 1,
    "OperatorID": 80,
    "UsageTypeID": 4,
    "AddressInfo": {
        "ID": 170171,
        "Title": "GENOVA Biscione | ENELX",
        "AddressLine1": "Via Leonardo Fea",
        "Town": "Genova",
        "StateOrProvince": "GE",
        "Postcode": "16142",
        "CountryID": 112,
        "Latitude": 44.4248264803355,
        "Longitude": 8.960282915563198,
        "RelatedURL": "https://www.enelx.com/it/it/emobility",
        "DistanceUnit": 0
    },
    "Connections": [
        {
            "ID": 258732,
            "ConnectionTypeID": 25,
            "StatusTypeID": 50,
            "LevelID": 2,
            "Amps": 32,
            "Voltage": 400,
            "PowerKW": 22,
            "CurrentTypeID": 20,
            "Quantity": 1
        },
        {
            "ID": 258733,
            "ConnectionTypeID": 36,
            "StatusTypeID": 50,
            "LevelID": 2,
            "Amps": 16,
            "Voltage": 240,
            "PowerKW": 3.7,
            "CurrentTypeID": 10,
            "Quantity": 1
        }
    ],
    "NumberOfPoints": 2,
    "StatusTypeID": 50,
    "DateLastStatusUpdate": "2020-11-10T16:35:00Z",
    "DataQualityLevel": 1,
    "DateCreated": "2020-11-10T16:35:00Z",
    "SubmissionStatusTypeID": 200
}