{
    "IsRecentlyVerified": false,
    "ID": 180119,
    "UUID": "E6D5E47A-2991-41DD-9F44-EAEB177FCDDC",
    "DataProviderID": 29,
    "DataProvidersReference": "18400",
    "OperatorID": 45,
    "AddressInfo": {
        "ID": 180478,
        "Title": "Gießener Str. 28",
        "AddressLine1": "Gießener Str. 28",
        "Town": "Lich",
        "Postcode": "35423",
        "CountryID": 87,
        "Latitude": 50.52321,
        "Longitude": 8.81693,
        "DistanceUnit": 0
    },
    "Connections": [
        {
            "ID": 282810,
            "ConnectionTypeID": 33,
            "StatusTypeID": 50,
            "LevelID": 3,
            "PowerKW": 22,
            "CurrentTypeID": 30
        },
        {
            "ID": 282811,
            "ConnectionTypeID": 25,
            "StatusTypeID": 50,
            "LevelID": 2,
            "PowerKW": 11,
            "CurrentTypeID": 20
        }
    ],
    "StatusTypeID": 50,
    "DateLastStatusUpdate": "2021-07-12T02:45:00Z",
    "MetadataValues": [
        {
            "ID": 12413,
            "MetadataFieldID": 4,
            "ItemValue": "Data from the German chargepoint registry provided by Bundesnetzagentur.de under the CC-BY 4.0 license"
        }
    ],
    "DataQualityLevel": 3,
    "DateCreated": "2021-07-08T10:00:00Z",
    "SubmissionStatusTypeID": 100
}