{
    "IsRecentlyVerified": false,
    "ID": 27331,
    "UUID": "CC014FF1-6BC1-4F31-87E7-01B95C1114A9",
    "DataProviderID": 2,
    "DataProvidersReference": "62858",
    "OperatorID": 5,
    "UsageTypeID": 1,
    "AddressInfo": {
        "ID": 27677,
        "Title": "MOCO AG COMM",
        "AddressLine1": "522 N Second Street",
        "Town": "King City",
        "StateOrProvince": "CA",
        "Postcode": "93930",
        "CountryID": 2,
        "Latitude": 36.2188693,
        "Longitude": -121.1278725,
        "ContactTelephone1": "888-758-4389",
        "AccessComments": "24 hours daily",
        "RelatedURL": "http://www.chargepoint.com/",
        "DistanceUnit": 0
    },
    "Connections": [
        {
            "ID": 29939,
            "ConnectionTypeID": 9,
            "LevelID": 1,
            "Amps": 16,
            "Voltage": 120,
            "PowerKW": 1,
            "CurrentTypeID": 10,
            "Quantity": 1
        },
        {
            "ID": 29940,
            "ConnectionTypeID": 1,
            "LevelID": 2,
            "Amps": 16,
            "Voltage": 230,
            "PowerKW": 3,
            "CurrentTypeID": 10,
            "Quantity": 1
        }
    ],
    "DateLastStatusUpdate": "2019-04-06T04:02:00Z",
    "DataQualityLevel": 3,
    "DateCreated": "2014-11-28T03:37:00Z",
    "SubmissionStatusTypeID": 100
}