{
    "IsRecentlyVerified": false,
    "ID": 106986,
    "UUID": "9BE2B45A-8DBE-4E26-A85A-2162085FE275",
    "DataProviderID": 1,
    "OperatorID": 156,
    "UsageTypeID": 4,
    "AddressInfo": {
        "ID": 107332,
        "Title": "Hotel Goos",
        "AddressLine1": "Große Straße 92",
        "Town": "Jübek",
        "StateOrProvince": "Arensharde",
        "Postcode": "24855",
        "CountryID": 87,
        "Latitude": 54.5564089,
        "Longitude": 9.386187800000016,
        "AccessComments": "Für Restaurant- bzw. Hotelgäste kostenlos, täglich von 07-21Uhr nutzbar",
        "DistanceUnit": 0
    },
    "Connections": [
        {
            "ID": 150821,
            "ConnectionTypeID": 25,
            "StatusTypeID": 50,
            "LevelID": 2,
            "Amps": 32,
            "Voltage": 400,
            "PowerKW": 22,
            "CurrentTypeID": 20,
            "Quantity": 1
        }
    ],
    "NumberOfPoints": 1,
    "StatusTypeID": 50,
    "DateLastStatusUpdate": "2018-07-11T07:48:00Z",
    "DataQualityLevel": 1,
    "DateCreated": "2018-07-11T07:48:00Z",
    "SubmissionStatusTypeID": 200
}