{
    "UserComments": [
        {
            "ID": 18009,
            "ChargePointID": 21295,
            "CommentTypeID": 10,
            "UserName": "ForumElettrico.it",
            "RelatedURL": "https://www.forumelettrico.it/forum/prese-3-7kw-palafiori-sanremo-im-corso-giuseppe-garibaldi-30-t1998.html",
            "DateCreated": "2017-12-07T08:45:38.283Z",
            "User": {
                "ID": 11749,
                "Username": "ForumElettrico.it"
            },
            "CheckinStatusTypeID": 10
        }
    ],
    "IsRecentlyVerified": false,
    "ID": 21295,
    "UUID": "4EBEFFB6-92E8-4E15-BB57-FBB5979C44AD",
    "DataProviderID": 1,
    "OperatorID": 5,
    "UsageTypeID": 1,
    "UsageCost": "free",
    "AddressInfo": {
        "ID": 21640,
        "Title": "SIPROTEC / SANREMO 3",
        "AddressLine1": "Corso Giuseppe Garibaldi",
        "Town": "Sanremo",
        "StateOrProvince": "Imperia",
        "Postcode": "18038",
        "CountryID": 112,
        "Latitude": 43.8195240522445,
        "Longitude": 7.780256060766519,
        "RelatedURL": "https://www.chargepoint.eu",
        "DistanceUnit": 0
    },
    "Connections": [
        {
            "ID": 23143,
            "ConnectionTypeID": 28,
            "StatusTypeID": 50,
            "LevelID": 2,
            "Amps": 16,
            "Voltage": 230,
            "PowerKW": 3,
            "CurrentTypeID": 10,
            "Quantity": 1
        }
    ],
    "NumberOfPoints": 1,
    "StatusTypeID": 50,
    "DateLastStatusUpdate": "2017-12-07T08:46:00Z",
    "DataQualityLevel": 1,
    "DateCreated": "2014-03-20T17:21:00Z",
    "SubmissionStatusTypeID": 200
}