{
    "IsRecentlyVerified": false,
    "ID": 187462,
    "UUID": "9225BFEF-BC3D-408D-9BA5-D16BC6B38EBD",
    "DataProviderID": 18,
    "DataProvidersReference": "32904dc1f0b2421cf3a47ba92d440b17",
    "OperatorID": 2244,
    "UsageTypeID": 5,
    "AddressInfo": {
        "ID": 187821,
        "Title": "45 Mexfield Road South West",
        "AddressLine1": "45 Mexfield Road South West",
        "Town": "London",
        "Postcode": "SW15 2RG",
        "CountryID": 1,
        "Latitude": -0.203009,
        "Longitude": 51.458205,
        "AccessComments": "",
        "RelatedURL": "https://www.ubitricity.com",
        "DistanceUnit": 0
    },
    "Connections": [
        {
            "ID": 302596,
            "ConnectionTypeID": 25,
            "Reference": "suby1100005408",
            "StatusTypeID": 50,
            "LevelID": 2,
            "Amps": 16,
            "Voltage": 230,
            "PowerKW": 3.7,
            "CurrentTypeID": 10
        }
    ],
    "StatusTypeID": 0,
    "DateLastStatusUpdate": "2021-07-12T03:38:00Z",
    "MetadataValues": [
        {
            "ID": 19702,
            "MetadataFieldID": 4,
            "ItemValue": "Contains public sector information licensed under the Open Government Licence v2.0. http://www.nationalarchives.gov.uk/doc/open-government-licence/version/2/"
        }
    ],
    "DataQualityLevel": 3,
    "DateCreated": "2021-07-12T03:38:00Z",
    "SubmissionStatusTypeID": 100
}