{
    "IsRecentlyVerified": false,
    "ID": 8466,
    "UUID": "5BF631B6-06CB-4078-A0EC-AA366E69BFF9",
    "DataProviderID": 15,
    "DataProvidersReference": "10450",
    "OperatorID": 9,
    "AddressInfo": {
        "ID": 8363,
        "Title": "3030 NE Weidler St",
        "AddressLine1": "3030 NE Weidler St",
        "Town": "Portland",
        "StateOrProvince": "OR",
        "Postcode": "US",
        "CountryID": 2,
        "Latitude": 45.53384,
        "Longitude": -122.6346,
        "ContactTelephone1": "(503) 280-1300",
        "RelatedURL": "http://carstations.com/10450",
        "DistanceUnit": 0
    },
    "Connections": [
        {
            "ID": 5893,
            "ConnectionTypeID": 1,
            "Reference": "J1772",
            "LevelID": 2
        },
        {
            "ID": 6652,
            "ConnectionTypeID": 2,
            "Reference": "CHADEMO",
            "LevelID": 3,
            "Quantity": 1
        }
    ],
    "StatusTypeID": 50,
    "DateLastStatusUpdate": "2017-11-04T14:05:00Z",
    "DataQualityLevel": 1,
    "DateCreated": "2011-11-11T12:06:00Z",
    "SubmissionStatusTypeID": 100
}