{
    "IsRecentlyVerified": false,
    "ID": 111268,
    "UUID": "756D523C-1D6E-4DA5-BB56-1AD13F9B5A0A",
    "DataProviderID": 2,
    "DataProvidersReference": "53881",
    "UsageTypeID": 1,
    "AddressInfo": {
        "ID": 111614,
        "Title": "Goodwill",
        "AddressLine1": "100 19th Ave SW",
        "Town": "Willmar",
        "StateOrProvince": "MN",
        "Postcode": "56201",
        "CountryID": 2,
        "Latitude": 45.103817,
        "Longitude": -95.043571,
        "ContactTelephone1": "320-214-9239",
        "AccessComments": "24 hours daily",
        "RelatedURL": "",
        "DistanceUnit": 0
    },
    "Connections": [
        {
            "ID": 156664,
            "ConnectionTypeID": 1,
            "LevelID": 2,
            "Amps": 16,
            "Voltage": 230,
            "PowerKW": 3.7,
            "CurrentTypeID": 10,
            "Quantity": 1
        }
    ],
    "DateLastStatusUpdate": "2020-06-26T03:08:00Z",
    "DataQualityLevel": 3,
    "DateCreated": "2018-10-18T23:36:00Z",
    "SubmissionStatusTypeID": 100
}