{
    "IsRecentlyVerified": false,
    "ID": 141204,
    "UUID": "D9CA6FC6-212A-4B99-8147-970B577B9F66",
    "DataProviderID": 2,
    "DataProvidersReference": "80988",
    "OperatorID": 5,
    "UsageTypeID": 1,
    "AddressInfo": {
        "ID": 141556,
        "Title": "SACRAMENTO",
        "AddressLine1": "300 Richard Street",
        "Town": "Sacramento",
        "StateOrProvince": "CA",
        "Postcode": "95811",
        "CountryID": 2,
        "Latitude": 38.5964811,
        "Longitude": -121.4984991,
        "ContactTelephone1": "888-758-4389",
        "AccessComments": "24 hours daily",
        "RelatedURL": "http://www.chargepoint.com/",
        "DistanceUnit": 0
    },
    "Connections": [
        {
            "ID": 197069,
            "ConnectionTypeID": 1,
            "LevelID": 2,
            "Amps": 16,
            "Voltage": 230,
            "PowerKW": 3,
            "CurrentTypeID": 10,
            "Quantity": 1
        }
    ],
    "StatusTypeID": 50,
    "DateLastStatusUpdate": "2019-12-24T09:15:00Z",
    "DataQualityLevel": 3,
    "DateCreated": "2019-12-24T09:15:00Z",
    "SubmissionStatusTypeID": 100
}