{
    "IsRecentlyVerified": false,
    "ID": 135260,
    "UUID": "EB7813D6-8A33-4D47-B8EB-5515121409C7",
    "DataProviderID": 1,
    "OperatorID": 80,
    "UsageTypeID": 4,
    "AddressInfo": {
        "ID": 135606,
        "Title": "Trivignano Castellana | EnelX",
        "AddressLine1": "Via Castellana, 236",
        "AddressLine2": "Trivignano ",
        "Town": "Venezia",
        "StateOrProvince": "VE",
        "Postcode": "30174",
        "CountryID": 112,
        "Latitude": 45.52866096060313,
        "Longitude": 12.18812689391143,
        "ContactTelephone1": "800.069.850",
        "RelatedURL": "https://www.enelx.com/it/it/emobility",
        "DistanceUnit": 0
    },
    "Connections": [
        {
            "ID": 189491,
            "ConnectionTypeID": 25,
            "StatusTypeID": 50,
            "LevelID": 2,
            "Amps": 32,
            "Voltage": 400,
            "PowerKW": 22,
            "CurrentTypeID": 20,
            "Quantity": 2
        }
    ],
    "NumberOfPoints": 2,
    "StatusTypeID": 50,
    "DateLastStatusUpdate": "2019-12-13T15:06:00Z",
    "DataQualityLevel": 1,
    "DateCreated": "2019-12-13T15:06:00Z",
    "SubmissionStatusTypeID": 200
}