{
    "IsRecentlyVerified": false,
    "ID": 149313,
    "UUID": "020ADDB0-DCFE-4CD5-A97E-AB7DB3A479E3",
    "DataProviderID": 1,
    "DataProvidersReference": "ALB-00002",
    "OperatorID": 21,
    "UsageTypeID": 4,
    "UsageCost": "Mobi.E compatible card",
    "AddressInfo": {
        "ID": 149666,
        "Title": "ALB-00002",
        "AddressLine1": "Rua Dr. Flausino Correia 2",
        "Town": "Albergaria-a-Velha",
        "Postcode": "3850-054",
        "CountryID": 180,
        "Latitude": 40.686902,
        "Longitude": -8.480335,
        "RelatedURL": "http://www.mobie.pt",
        "DistanceUnit": 0
    },
    "Connections": [
        {
            "ID": 207324,
            "ConnectionTypeID": 25,
            "StatusTypeID": 50,
            "LevelID": 2,
            "Amps": 32,
            "Voltage": 400,
            "PowerKW": 22,
            "CurrentTypeID": 20,
            "Quantity": 2
        }
    ],
    "NumberOfPoints": 2,
    "StatusTypeID": 50,
    "DateLastStatusUpdate": "2020-09-12T16:10:00Z",
    "DataQualityLevel": 3,
    "DateCreated": "2020-02-22T15:42:00Z",
    "SubmissionStatusTypeID": 100
}