{
    "IsRecentlyVerified": false,
    "ID": 65132,
    "UUID": "FB7422E1-3E65-4937-9B0F-ACE3C3067C63",
    "DataProviderID": 1,
    "OperatorID": 45,
    "UsageTypeID": 1,
    "AddressInfo": {
        "ID": 65478,
        "Title": "Volksbank",
        "AddressLine1": "Bahnhofstraße 19",
        "Town": "Speyer",
        "StateOrProvince": "Speyer",
        "Postcode": "67346",
        "CountryID": 87,
        "Latitude": 49.319918944277,
        "Longitude": 8.43073596808814,
        "ContactTelephone1": "+496232 618-0",
        "AccessComments": "An der Haupstelle der Volksbank Speyer im unteren Parkdeck an der Einfahrt. Parkgebühren bei mehr als 20 Minuten Parkdauer, Laden (noch) kostenlos. 24/7 nutzbar. Gleichzeitig sind nur Typ2 und Chademo oder Typ2 und CCS nutzbar.",
        "RelatedURL": "http://www.volksbank-krp.de/wir-fuer-sie/filialen-ansprechpartner/filialen/uebersicht-filialen/hauptstelle-speyer-bahnhofstrasse.html",
        "DistanceUnit": 0
    },
    "Connections": [
        {
            "ID": 89647,
            "ConnectionTypeID": 2,
            "StatusTypeID": 50,
            "LevelID": 3,
            "PowerKW": 50,
            "CurrentTypeID": 30,
            "Quantity": 1
        },
        {
            "ID": 89648,
            "ConnectionTypeID": 33,
            "StatusTypeID": 50,
            "LevelID": 3,
            "PowerKW": 50,
            "CurrentTypeID": 30,
            "Quantity": 1
        },
        {
            "ID": 89649,
            "ConnectionTypeID": 25,
            "StatusTypeID": 50,
            "LevelID": 2,
            "Amps": 32,
            "Voltage": 400,
            "PowerKW": 22,
            "CurrentTypeID": 20,
            "Quantity": 1
        }
    ],
    "NumberOfPoints": 2,
    "StatusTypeID": 50,
    "DateLastStatusUpdate": "2016-04-13T07:51:00Z",
    "DataQualityLevel": 1,
    "DateCreated": "2016-04-13T07:50:00Z",
    "SubmissionStatusTypeID": 200
}