{
    "IsRecentlyVerified": false,
    "ID": 34670,
    "UUID": "60EA2CB5-C0F2-4ED7-8BC7-C6B52C2115FC",
    "DataProviderID": 26,
    "DataProvidersReference": "34575",
    "OperatorID": 73,
    "OperatorsReference": "EV-Box EVB-P1309123",
    "UsageCost": "0.00 jaarabonnement",
    "AddressInfo": {
        "ID": 35016,
        "Title": "Hermine Moquettestraat 40",
        "AddressLine1": "Hermine Moquettestraat 40",
        "Town": "Rotterdam",
        "Postcode": "3066 JE",
        "CountryID": 159,
        "Latitude": 51.93666,
        "Longitude": 4.54268,
        "RelatedURL": "http://www.ev-box.nl",
        "DistanceUnit": 0
    },
    "Connections": [
        {
            "ID": 38181,
            "ConnectionTypeID": 25,
            "LevelID": 2,
            "PowerKW": 11,
            "CurrentTypeID": 10
        },
        {
            "ID": 47439,
            "ConnectionTypeID": 25,
            "LevelID": 2,
            "PowerKW": 11,
            "CurrentTypeID": 10
        }
    ],
    "NumberOfPoints": 1,
    "StatusTypeID": 50,
    "DateLastStatusUpdate": "2016-06-04T02:42:00Z",
    "DataQualityLevel": 3,
    "DateCreated": "2015-01-09T06:04:00Z",
    "SubmissionStatusTypeID": 100
}