{
    "IsRecentlyVerified": false,
    "ID": 64430,
    "UUID": "78008028-77A8-4326-8643-BFB174214873",
    "DataProviderID": 1,
    "OperatorID": 213,
    "UsageTypeID": 4,
    "UsageCost": "0",
    "AddressInfo": {
        "ID": 64776,
        "Title": "Havre - Gare",
        "AddressLine1": "Cours du Commandant Fratacci",
        "AddressLine2": "Danton",
        "Town": "Le Havre",
        "StateOrProvince": "Le Havre",
        "Postcode": "76600;76610;76620",
        "CountryID": 80,
        "Latitude": 49.4915144,
        "Longitude": 0.12351190000003953,
        "DistanceUnit": 0
    },
    "Connections": [
        {
            "ID": 82646,
            "ConnectionTypeID": 26,
            "LevelID": 2,
            "Amps": 16,
            "Voltage": 220,
            "PowerKW": 3,
            "CurrentTypeID": 10,
            "Quantity": 1
        },
        {
            "ID": 82647,
            "ConnectionTypeID": 28,
            "LevelID": 2,
            "Amps": 16,
            "Voltage": 220,
            "PowerKW": 3,
            "CurrentTypeID": 10,
            "Quantity": 1
        }
    ],
    "NumberOfPoints": 2,
    "StatusTypeID": 50,
    "DateLastStatusUpdate": "2016-03-06T12:12:00Z",
    "DataQualityLevel": 1,
    "DateCreated": "2016-03-06T12:12:00Z",
    "SubmissionStatusTypeID": 200
}