{
    "IsRecentlyVerified": false,
    "ID": 17265,
    "UUID": "51E184C5-2728-45BE-A983-CFE5378471A0",
    "DataProviderID": 22,
    "DataProvidersReference": "228A37C4A96D1CDC1659B9E2BF4B0000",
    "AddressInfo": {
        "ID": 17610,
        "Title": "日産プリンス名古屋販売阿久比店",
        "AddressLine1": "愛知県知多郡阿久比町大字植大字野崎3番地の4",
        "CountryID": 114,
        "Latitude": 34.91471751,
        "Longitude": 136.9223371,
        "ContactTelephone1": "0569-48-7532",
        "DistanceUnit": 0
    },
    "Connections": [
        {
            "ID": 17506,
            "ConnectionTypeID": 2,
            "LevelID": 2,
            "Amps": 100,
            "Voltage": 480,
            "PowerKW": 48,
            "Quantity": 1
        }
    ],
    "DateLastStatusUpdate": "2013-06-29T08:56:00Z",
    "DataQualityLevel": 2,
    "DateCreated": "2013-06-29T08:56:00Z",
    "SubmissionStatusTypeID": 200
}