{
    "IsRecentlyVerified": false,
    "ID": 152548,
    "UUID": "C8A71C52-A789-4DF9-B149-85317CFD4400",
    "DataProviderID": 28,
    "DataProvidersReference": "",
    "UsageTypeID": 5,
    "AddressInfo": {
        "ID": 152901,
        "Title": "Super Chargeur Sorigny A10 AC plig",
        "AddressLine1": "A 10 PDC 3 -  Super chargeur - 37250 SORIGNY",
        "CountryID": 80,
        "Latitude": 47.254312,
        "Longitude": 0.672126,
        "AccessComments": "24/24 7/7",
        "DistanceUnit": 0
    },
    "Connections": [
        {
            "ID": 213595,
            "ConnectionTypeID": 0,
            "StatusTypeID": 50,
            "LevelID": 2,
            "PowerKW": 43
        }
    ],
    "GeneralComments": "www.virtaev.fr",
    "StatusTypeID": 50,
    "DateLastStatusUpdate": "2020-03-15T10:53:00Z",
    "DataQualityLevel": 2,
    "DateCreated": "2020-03-15T10:53:00Z",
    "SubmissionStatusTypeID": 100
}