{
    "IsRecentlyVerified": false,
    "ID": 84906,
    "UUID": "4EC956CF-B008-402F-9233-E2204E02FD8D",
    "DataProviderID": 1,
    "OperatorID": 23,
    "OperatorsReference": "25854",
    "UsageTypeID": 4,
    "AddressInfo": {
        "ID": 85252,
        "Title": "The Lodge At Torrey Pines",
        "AddressLine1": "11480 N Torrey Pines RD",
        "Town": "San Diego",
        "StateOrProvince": "California",
        "Postcode": "92037",
        "CountryID": 2,
        "Latitude": 32.904137,
        "Longitude": -117.24453,
        "ContactTelephone1": "(858) 453-4420",
        "DistanceUnit": 0
    },
    "Connections": [
        {
            "ID": 120650,
            "ConnectionTypeID": 30,
            "StatusTypeID": 50,
            "LevelID": 2,
            "PowerKW": 8,
            "CurrentTypeID": 10,
            "Quantity": 2
        }
    ],
    "NumberOfPoints": 2,
    "GeneralComments": "2 Tesla Connectors, up to 8kW.Available for customers. Please call ahead.",
    "StatusTypeID": 50,
    "DateLastStatusUpdate": "2017-07-13T15:26:00Z",
    "DataQualityLevel": 1,
    "DateCreated": "2017-03-21T18:52:00Z",
    "SubmissionStatusTypeID": 200
}