{
    "IsRecentlyVerified": false,
    "ID": 107514,
    "UUID": "3BEFE947-342A-413B-AD9E-94D49369F7F5",
    "DataProviderID": 1,
    "OperatorID": 3319,
    "UsageTypeID": 1,
    "UsageCost": "bruttó 80 Ft/kWh",
    "AddressInfo": {
        "ID": 107860,
        "Title": "Veszprém, Muskátli utca",
        "AddressLine1": "Muskátli utca 2-8.",
        "Town": "Veszprém",
        "StateOrProvince": "Veszprém megye",
        "Postcode": "8200",
        "CountryID": 104,
        "Latitude": 47.090085,
        "Longitude": 17.915987,
        "ContactTelephone1": "+36 80 21-00-12",
        "ContactEmail": "kommunikacio@e-mobi.hu",
        "RelatedURL": "https://e-mobi.hu",
        "DistanceUnit": 0
    },
    "Connections": [
        {
            "ID": 151690,
            "ConnectionTypeID": 25,
            "StatusTypeID": 50,
            "LevelID": 2,
            "Amps": 32,
            "Voltage": 400,
            "PowerKW": 22,
            "CurrentTypeID": 20,
            "Quantity": 2
        }
    ],
    "NumberOfPoints": 2,
    "GeneralComments": "",
    "StatusTypeID": 50,
    "DateLastStatusUpdate": "2020-05-09T09:03:00Z",
    "DataQualityLevel": 1,
    "DateCreated": "2018-07-31T13:56:00Z",
    "SubmissionStatusTypeID": 200
}