{
    "IsRecentlyVerified": false,
    "ID": 123366,
    "UUID": "4F953387-FCD6-404F-93FB-F84866091D47",
    "DataProviderID": 2,
    "DataProvidersReference": "62816",
    "OperatorID": 5,
    "UsageTypeID": 1,
    "AddressInfo": {
        "ID": 123712,
        "Title": "METRO NASHVILLE",
        "AddressLine1": "320 Joyner Ave",
        "Town": "Nashville",
        "StateOrProvince": "TN",
        "Postcode": "37210",
        "CountryID": 2,
        "Latitude": 36.116915,
        "Longitude": -86.7470419,
        "ContactTelephone1": "888-758-4389",
        "AccessComments": "24 hours daily",
        "RelatedURL": "http://www.chargepoint.com/",
        "DistanceUnit": 0
    },
    "Connections": [
        {
            "ID": 173334,
            "ConnectionTypeID": 9,
            "LevelID": 1,
            "Amps": 16,
            "Voltage": 120,
            "PowerKW": 1.9,
            "CurrentTypeID": 10,
            "Quantity": 1
        },
        {
            "ID": 173335,
            "ConnectionTypeID": 1,
            "LevelID": 2,
            "Amps": 16,
            "Voltage": 230,
            "PowerKW": 3.7,
            "CurrentTypeID": 10,
            "Quantity": 1
        }
    ],
    "DateLastStatusUpdate": "2020-06-26T02:58:00Z",
    "DataQualityLevel": 3,
    "DateCreated": "2019-04-06T05:03:00Z",
    "SubmissionStatusTypeID": 100
}