{
    "IsRecentlyVerified": false,
    "ID": 67467,
    "UUID": "E4BD8E61-76D6-41B0-B08D-12156E1B7808",
    "DataProviderID": 2,
    "DataProvidersReference": "75783",
    "OperatorID": 5,
    "UsageTypeID": 1,
    "AddressInfo": {
        "ID": 67813,
        "Title": "UNITED AIRLINES",
        "AddressLine1": "Atlantic Parking Lot Frankfurt bus stop",
        "Town": "Chicago",
        "StateOrProvince": "IL",
        "Postcode": "60666",
        "CountryID": 2,
        "Latitude": 41.9915274,
        "Longitude": -87.9236017,
        "ContactTelephone1": "888-758-4389",
        "AccessComments": "24 hours daily",
        "RelatedURL": "http://www.chargepoint.com/",
        "DistanceUnit": 0
    },
    "Connections": [
        {
            "ID": 92971,
            "ConnectionTypeID": 1,
            "LevelID": 2,
            "Amps": 16,
            "Voltage": 230,
            "PowerKW": 3,
            "CurrentTypeID": 10,
            "Quantity": 2
        }
    ],
    "DateLastStatusUpdate": "2019-04-06T05:05:00Z",
    "DataQualityLevel": 3,
    "DateCreated": "2016-05-29T02:05:00Z",
    "SubmissionStatusTypeID": 100
}