{
    "IsRecentlyVerified": false,
    "ID": 186830,
    "UUID": "5BD57744-7EA1-4ADB-9299-0D0041CFC438",
    "DataProviderID": 29,
    "DataProvidersReference": "21464",
    "OperatorID": 3403,
    "AddressInfo": {
        "ID": 187189,
        "Title": "Holzberg 17",
        "AddressLine1": "Holzberg 17",
        "Town": "Helmstedt",
        "Postcode": "38350",
        "CountryID": 87,
        "Latitude": 52.22609,
        "Longitude": 11.0966,
        "DistanceUnit": 0
    },
    "Connections": [
        {
            "ID": 300310,
            "ConnectionTypeID": 25,
            "StatusTypeID": 50,
            "LevelID": 2,
            "PowerKW": 22,
            "CurrentTypeID": 20
        },
        {
            "ID": 300311,
            "ConnectionTypeID": 25,
            "StatusTypeID": 50,
            "LevelID": 2,
            "PowerKW": 22,
            "CurrentTypeID": 20
        }
    ],
    "StatusTypeID": 50,
    "DateLastStatusUpdate": "2021-07-12T02:49:00Z",
    "MetadataValues": [
        {
            "ID": 19071,
            "MetadataFieldID": 4,
            "ItemValue": "Data from the German chargepoint registry provided by Bundesnetzagentur.de under the CC-BY 4.0 license"
        }
    ],
    "DataQualityLevel": 3,
    "DateCreated": "2021-07-12T02:49:00Z",
    "SubmissionStatusTypeID": 100
}