{
    "IsRecentlyVerified": false,
    "ID": 41039,
    "UUID": "B0FD4BBA-F623-46DD-9078-1A4CFF83306A",
    "DataProviderID": 1,
    "OperatorID": 45,
    "UsageTypeID": 7,
    "UsageCost": "0,25€/kWh",
    "AddressInfo": {
        "ID": 41385,
        "Title": "Windpark Druiberg GmbH Regenerative Strom-Tankstelle ",
        "AddressLine1": "Am Kirchplatz 241a",
        "Town": "Dardesheim, ",
        "StateOrProvince": "Landkreis Harz",
        "Postcode": "38836",
        "CountryID": 87,
        "Latitude": 51.97729,
        "Longitude": 10.83392,
        "ContactTelephone1": "039422 95648",
        "ContactTelephone2": "0170 4126384",
        "ContactEmail": "info@energiepark-druiberg.de",
        "AccessComments": "Im Zentrum der Stadt Dardesheim gegenüber dem Rathaus und der Schule. Parkplatz an der Grünflache. Geöffnet zu den Geschäftszeiten Mo-Fr 8-17Uhr, sonst bitte telefonische Voranmeldung. ",
        "RelatedURL": "http://www.energiepark-druiberg.de",
        "DistanceUnit": 0
    },
    "Connections": [
        {
            "ID": 44762,
            "ConnectionTypeID": 28,
            "StatusTypeID": 50,
            "LevelID": 2,
            "Amps": 16,
            "Voltage": 230,
            "PowerKW": 3.7,
            "CurrentTypeID": 10,
            "Quantity": 2
        },
        {
            "ID": 44763,
            "ConnectionTypeID": 16,
            "StatusTypeID": 50,
            "LevelID": 2,
            "Amps": 16,
            "Voltage": 230,
            "PowerKW": 3.7,
            "CurrentTypeID": 10,
            "Quantity": 1
        },
        {
            "ID": 44764,
            "ConnectionTypeID": 17,
            "StatusTypeID": 50,
            "LevelID": 2,
            "Amps": 16,
            "Voltage": 400,
            "PowerKW": 11,
            "CurrentTypeID": 20,
            "Quantity": 1
        }
    ],
    "NumberOfPoints": 4,
    "GeneralComments": "Zur Nutzung der Tankstelle im Geschäftshaus neben der Tanksäule melden. Dort bekommt man den Schlüssel zur Säule sowie den aktuellen Zählerstand. Die Ablesung des Stromverbrauchs erfolgt am Zähler im Gebäude, dort werden auch die Kosten abgerechnet. ",
    "StatusTypeID": 50,
    "DateLastStatusUpdate": "2015-01-23T12:12:00Z",
    "DataQualityLevel": 1,
    "DateCreated": "2015-01-23T10:31:00Z",
    "SubmissionStatusTypeID": 200
}