{
    "IsRecentlyVerified": false,
    "ID": 24568,
    "UUID": "14A9B84F-B013-42BD-8026-61D4188525FF",
    "DataProviderID": 1,
    "OperatorID": 80,
    "UsageTypeID": 4,
    "UsageCost": "0.40€/KWh",
    "AddressInfo": {
        "ID": 24914,
        "Title": "Enel Drive Europa Ovest",
        "AddressLine1": "Viale Europa, 20-22 angolo Largo Apollinare",
        "AddressLine2": "EUR",
        "Town": "Roma",
        "StateOrProvince": "RM",
        "Postcode": "00144",
        "CountryID": 112,
        "Latitude": 41.8326069706929,
        "Longitude": 12.4626154591947,
        "AccessComments": "Davanti al negozio wind, quasi all'incrocio con Largo Apollinare",
        "RelatedURL": "http://eneldrive.it",
        "DistanceUnit": 0
    },
    "Connections": [
        {
            "ID": 26835,
            "ConnectionTypeID": 25,
            "StatusTypeID": 50,
            "LevelID": 2,
            "Amps": 16,
            "Voltage": 240,
            "PowerKW": 3,
            "CurrentTypeID": 10,
            "Quantity": 2
        },
        {
            "ID": 26836,
            "ConnectionTypeID": 36,
            "StatusTypeID": 50,
            "LevelID": 2,
            "Amps": 13,
            "Voltage": 240,
            "PowerKW": 3,
            "CurrentTypeID": 10,
            "Quantity": 2
        }
    ],
    "NumberOfPoints": 2,
    "GeneralComments": "Non compatibile con Renault ZOE ",
    "StatusTypeID": 50,
    "DateLastStatusUpdate": "2016-08-10T11:42:00Z",
    "MetadataValues": [
        {
            "ID": 1032,
            "MetadataFieldID": 4,
            "ItemValue": "Data © OpenStreetMap contributors, ODbL 1.0. http://www.openstreetmap.org/copyright"
        }
    ],
    "DataQualityLevel": 1,
    "DateCreated": "2014-10-13T21:17:00Z",
    "SubmissionStatusTypeID": 200
}