{
    "IsRecentlyVerified": false,
    "ID": 160284,
    "UUID": "2194BFE2-03C0-4951-8B55-8139558443DC",
    "DataProviderID": 2,
    "DataProvidersReference": "158071",
    "UsageTypeID": 2,
    "AddressInfo": {
        "ID": 160641,
        "Title": "Real Canadian Superstore",
        "AddressLine1": "25 45th St S",
        "Town": "Wasaga Beach",
        "StateOrProvince": "ON",
        "Postcode": "L9Z 1A7",
        "CountryID": 44,
        "Latitude": 44.4730007,
        "Longitude": -80.073922,
        "ContactTelephone1": "",
        "AccessComments": "",
        "RelatedURL": "",
        "DistanceUnit": 0
    },
    "Connections": [
        {
            "ID": 230613,
            "ConnectionTypeID": 2,
            "LevelID": 3,
            "Amps": 100,
            "Voltage": 400,
            "PowerKW": 40,
            "CurrentTypeID": 30,
            "Quantity": 1
        },
        {
            "ID": 230614,
            "ConnectionTypeID": 32,
            "LevelID": 3,
            "Amps": 100,
            "Voltage": 400,
            "PowerKW": 40,
            "CurrentTypeID": 30,
            "Quantity": 1
        }
    ],
    "GeneralComments": "Planned for future date. Not Operational.",
    "DatePlanned": "2020-09-01T00:00:00Z",
    "StatusTypeID": 150,
    "DateLastStatusUpdate": "2020-06-26T03:08:00Z",
    "DataQualityLevel": 3,
    "DateCreated": "2020-06-26T03:08:00Z",
    "SubmissionStatusTypeID": 100
}