{
    "IsRecentlyVerified": false,
    "ID": 166586,
    "UUID": "819B4B3F-B938-4039-AFBE-6B5FAFD1C424",
    "DataProviderID": 28,
    "DataProvidersReference": "FR*S61*P61211A",
    "UsageTypeID": 5,
    "AddressInfo": {
        "ID": 166945,
        "Title": "Juvigny Val d'Andaine | Place Saint-Michel",
        "AddressLine1": "Place Saint-Michel 61140 Juvigny Val d'Andaine",
        "CountryID": 80,
        "Latitude": 48.55218,
        "Longitude": -0.50876,
        "AccessComments": "24/24 7/7",
        "DistanceUnit": 0
    },
    "Connections": [
        {
            "ID": 249709,
            "ConnectionTypeID": 26,
            "StatusTypeID": 50,
            "LevelID": 2,
            "PowerKW": 18
        },
        {
            "ID": 249710,
            "ConnectionTypeID": 28,
            "StatusTypeID": 50,
            "LevelID": 2,
            "PowerKW": 18,
            "CurrentTypeID": 10
        },
        {
            "ID": 249711,
            "ConnectionTypeID": 25,
            "StatusTypeID": 50,
            "LevelID": 2,
            "PowerKW": 18,
            "CurrentTypeID": 20
        },
        {
            "ID": 249712,
            "ConnectionTypeID": 28,
            "StatusTypeID": 50,
            "LevelID": 2,
            "PowerKW": 18,
            "CurrentTypeID": 10
        }
    ],
    "GeneralComments": "",
    "StatusTypeID": 50,
    "DateLastStatusUpdate": "2020-08-27T05:15:00Z",
    "DataQualityLevel": 2,
    "DateCreated": "2020-08-27T05:15:00Z",
    "SubmissionStatusTypeID": 100
}