{
    "UserComments": [
        {
            "ID": 17449,
            "ChargePointID": 77573,
            "CommentTypeID": 10,
            "UserName": "Haegar2004",
            "Comment": "",
            "Rating": 5,
            "DateCreated": "2017-07-04T16:59:07.933Z",
            "User": {
                "ID": 12201,
                "Username": "Haegar2004"
            },
            "CheckinStatusTypeID": 10
        },
        {
            "ID": 16218,
            "ChargePointID": 77573,
            "CommentTypeID": 10,
            "UserName": "Daveycee",
            "Comment": "",
            "Rating": 5,
            "DateCreated": "2017-04-16T12:36:50.91Z",
            "User": {
                "ID": 13955,
                "Username": "Daveycee"
            },
            "CheckinStatusTypeID": 10
        },
        {
            "ID": 14841,
            "ChargePointID": 77573,
            "CommentTypeID": 10,
            "UserName": "Haegar2004",
            "Comment": "",
            "Rating": 5,
            "DateCreated": "2017-01-19T12:40:17.187Z",
            "User": {
                "ID": 12201,
                "Username": "Haegar2004"
            },
            "CheckinStatusTypeID": 10
        }
    ],
    "MediaItems": [
        {
            "ID": 9249,
            "ChargePointID": 77573,
            "ItemURL": "https://s3-ap-southeast-2.amazonaws.com/openchargemap/images/DE/OCM77573/OCM-77573.orig.2017011912400644.jpg",
            "ItemThumbnailURL": "https://s3-ap-southeast-2.amazonaws.com/openchargemap/images/DE/OCM77573/OCM-77573.thmb.2017011912400644.jpg",
            "Comment": "",
            "IsEnabled": true,
            "IsVideo": false,
            "IsFeaturedItem": false,
            "IsExternalResource": false,
            "User": {
                "ID": 12201,
                "Username": "Haegar2004"
            },
            "DateCreated": "2017-01-19T12:40:00Z"
        }
    ],
    "IsRecentlyVerified": false,
    "ID": 77573,
    "UUID": "564C811E-0DB1-4C05-9AC4-B66901DBBA37",
    "DataProviderID": 1,
    "OperatorID": 3248,
    "UsageTypeID": 1,
    "UsageCost": "Free",
    "AddressInfo": {
        "ID": 77919,
        "Title": "Rasthof Fernthal West",
        "AddressLine1": "Rasthausstraße",
        "AddressLine2": "A3",
        "Town": "Neustadt (Wied)",
        "StateOrProvince": "",
        "Postcode": "53577",
        "CountryID": 87,
        "Latitude": 50.5991256967831,
        "Longitude": 7.4333781585301,
        "ContactTelephone1": "",
        "ContactTelephone2": "",
        "ContactEmail": "",
        "AccessComments": "Rechts vor dem Rasthof / Motel,  Ladesäule ist 24/7 nutzbar, Parkplätze sind beschildert.",
        "RelatedURL": "",
        "DistanceUnit": 0
    },
    "Connections": [
        {
            "ID": 112051,
            "ConnectionTypeID": 2,
            "StatusTypeID": 50,
            "LevelID": 3,
            "PowerKW": 50,
            "CurrentTypeID": 30,
            "Quantity": 1
        },
        {
            "ID": 112052,
            "ConnectionTypeID": 33,
            "StatusTypeID": 50,
            "LevelID": 3,
            "PowerKW": 50,
            "CurrentTypeID": 30,
            "Quantity": 1
        },
        {
            "ID": 112053,
            "ConnectionTypeID": 1036,
            "StatusTypeID": 50,
            "LevelID": 3,
            "PowerKW": 43,
            "CurrentTypeID": 20,
            "Quantity": 1
        }
    ],
    "NumberOfPoints": 2,
    "GeneralComments": "",
    "StatusTypeID": 50,
    "DateLastStatusUpdate": "2017-07-04T16:59:00Z",
    "DataQualityLevel": 1,
    "DateCreated": "2017-01-18T18:38:00Z",
    "SubmissionStatusTypeID": 200
}