{
    "IsRecentlyVerified": false,
    "ID": 178285,
    "UUID": "688366E2-6991-44E1-AE21-3A7932955C89",
    "DataProviderID": 29,
    "DataProvidersReference": "9620",
    "AddressInfo": {
        "ID": 178644,
        "Title": "Waldäcker 15",
        "AddressLine1": "Waldäcker 15",
        "Town": "Ludwigsburg",
        "Postcode": "71636",
        "CountryID": 87,
        "Latitude": 48.891238183762,
        "Longitude": 9.156916737556,
        "DistanceUnit": 0
    },
    "Connections": [
        {
            "ID": 278483,
            "ConnectionTypeID": 25,
            "StatusTypeID": 50,
            "LevelID": 3,
            "PowerKW": 20,
            "CurrentTypeID": 30
        },
        {
            "ID": 278484,
            "ConnectionTypeID": 2,
            "StatusTypeID": 50,
            "LevelID": 3,
            "PowerKW": 20,
            "CurrentTypeID": 30
        },
        {
            "ID": 296339,
            "ConnectionTypeID": 33,
            "StatusTypeID": 50,
            "LevelID": 3,
            "PowerKW": 20,
            "CurrentTypeID": 30
        }
    ],
    "StatusTypeID": 0,
    "DateLastStatusUpdate": "2021-07-12T02:42:00Z",
    "MetadataValues": [
        {
            "ID": 10579,
            "MetadataFieldID": 4,
            "ItemValue": "Data from the German chargepoint registry provided by Bundesnetzagentur.de under the CC-BY 4.0 license"
        }
    ],
    "DataQualityLevel": 3,
    "DateCreated": "2021-07-08T09:49:00Z",
    "SubmissionStatusTypeID": 100
}