{
    "UserComments": [
        {
            "ID": 24544,
            "ChargePointID": 176082,
            "CommentTypeID": 10,
            "UserName": "עמדות טעינה",
            "Rating": 5,
            "DateCreated": "2021-07-02T00:30:28.27Z",
            "User": {
                "ID": 30531,
                "Username": "עמדות טעינה"
            },
            "CheckinStatusTypeID": 20,
            "IsActionedByEditor": false
        }
    ],
    "MediaItems": [
        {
            "ID": 28797,
            "ChargePointID": 176082,
            "ItemURL": "https://s3-ap-southeast-2.amazonaws.com/openchargemap/images/IL/OCM176082/OCM-176082.orig.2021072709340249.jpg",
            "ItemThumbnailURL": "https://s3-ap-southeast-2.amazonaws.com/openchargemap/images/IL/OCM176082/OCM-176082.thmb.2021072709340249.jpg",
            "Comment": "",
            "IsEnabled": true,
            "IsVideo": false,
            "IsFeaturedItem": false,
            "IsExternalResource": false,
            "User": {
                "ID": 30531,
                "Username": "עמדות טעינה"
            },
            "DateCreated": "2021-07-27T09:34:00Z"
        },
        {
            "ID": 28796,
            "ChargePointID": 176082,
            "ItemURL": "https://s3-ap-southeast-2.amazonaws.com/openchargemap/images/IL/OCM176082/OCM-176082.orig.2021072709324762.jpg",
            "ItemThumbnailURL": "https://s3-ap-southeast-2.amazonaws.com/openchargemap/images/IL/OCM176082/OCM-176082.thmb.2021072709324762.jpg",
            "Comment": "",
            "IsEnabled": true,
            "IsVideo": false,
            "IsFeaturedItem": false,
            "IsExternalResource": false,
            "User": {
                "ID": 30531,
                "Username": "עמדות טעינה"
            },
            "DateCreated": "2021-07-27T09:33:00Z"
        },
        {
            "ID": 28795,
            "ChargePointID": 176082,
            "ItemURL": "https://s3-ap-southeast-2.amazonaws.com/openchargemap/images/IL/OCM176082/OCM-176082.orig.2021072709290880.jpg",
            "ItemThumbnailURL": "https://s3-ap-southeast-2.amazonaws.com/openchargemap/images/IL/OCM176082/OCM-176082.thmb.2021072709290880.jpg",
            "Comment": "",
            "IsEnabled": true,
            "IsVideo": false,
            "IsFeaturedItem": false,
            "IsExternalResource": false,
            "User": {
                "ID": 30531,
                "Username": "עמדות טעינה"
            },
            "DateCreated": "2021-07-27T09:29:00Z"
        }
    ],
    "IsRecentlyVerified": false,
    "ID": 176082,
    "UUID": "2337472F-48A6-4D68-91A4-C6CD97DDD963",
    "DataProviderID": 1,
    "OperatorID": 23,
    "UsageTypeID": 4,
    "UsageCost": "1₪ per kWh",
    "AddressInfo": {
        "ID": 176441,
        "Title": "ביג, עפולה",
        "AddressLine1": "13 השוק",
        "AddressLine2": "HaShuk St 13 Afula, 18291",
        "Town": "עפולה",
        "StateOrProvince": "מחוז הצפון",
        "Postcode": "no",
        "CountryID": 111,
        "Latitude": 32.60515422462113,
        "Longitude": 35.29324533186741,
        "AccessComments": "BIG, Afula ",
        "RelatedURL": "https://www.tesla.com/he_IL/findus/location/supercharger/afulasupercharger",
        "DistanceUnit": 0
    },
    "Connections": [
        {
            "ID": 273562,
            "ConnectionTypeID": 27,
            "StatusTypeID": 50,
            "LevelID": 3,
            "PowerKW": 250,
            "CurrentTypeID": 30,
            "Quantity": 6
        }
    ],
    "NumberOfPoints": 6,
    "StatusTypeID": 50,
    "DateLastStatusUpdate": "2021-08-11T04:59:00Z",
    "DataQualityLevel": 1,
    "DateCreated": "2021-06-24T14:26:00Z",
    "SubmissionStatusTypeID": 200
}