{
    "IsRecentlyVerified": false,
    "ID": 53039,
    "UUID": "F1B151C4-59A2-412C-88C4-78F797041FE9",
    "DataProviderID": 1,
    "OperatorID": 32,
    "OperatorsReference": "2086",
    "UsageTypeID": 4,
    "UsageCost": "£0.108/kWh; for Polar Plus subscription members only",
    "AddressInfo": {
        "ID": 53385,
        "Title": "Upper Second Street",
        "AddressLine1": "Upper Second Street",
        "AddressLine2": "Central Milton Keynes",
        "Town": "Milton Keynes",
        "StateOrProvince": "Milton Keynes",
        "Postcode": "MK9 1EB",
        "CountryID": 1,
        "Latitude": 52.037056,
        "Longitude": -0.76865,
        "DistanceUnit": 0
    },
    "Connections": [
        {
            "ID": 66091,
            "ConnectionTypeID": 25,
            "StatusTypeID": 50,
            "LevelID": 2,
            "Amps": 32,
            "Voltage": 230,
            "PowerKW": 7,
            "CurrentTypeID": 10,
            "Quantity": 2
        }
    ],
    "NumberOfPoints": 4,
    "StatusTypeID": 50,
    "DateLastStatusUpdate": "2019-03-09T06:20:00Z",
    "DataQualityLevel": 1,
    "DateCreated": "2015-09-17T12:58:00Z",
    "SubmissionStatusTypeID": 200
}