{
    "IsRecentlyVerified": false,
    "ID": 47737,
    "UUID": "5340E92D-7612-4873-984F-98021BE881B3",
    "DataProviderID": 1,
    "OperatorID": 44,
    "UsageTypeID": 1,
    "UsageCost": "0",
    "AddressInfo": {
        "ID": 48083,
        "Title": "Ladestation Bräutigam",
        "AddressLine1": "Lamerder Straße 16",
        "Town": "Trendelburg",
        "StateOrProvince": "Landkreis Kassel",
        "Postcode": "34388",
        "CountryID": 87,
        "Latitude": 51.5394391,
        "Longitude": 9.35838999999999,
        "AccessComments": "Durchgehend nutzbare kostenlose private Lademöglichkeit. ",
        "DistanceUnit": 0
    },
    "Connections": [
        {
            "ID": 58860,
            "ConnectionTypeID": 28,
            "StatusTypeID": 50,
            "LevelID": 2,
            "Amps": 16,
            "Voltage": 230,
            "PowerKW": 3.7,
            "CurrentTypeID": 10,
            "Quantity": 1
        }
    ],
    "NumberOfPoints": 1,
    "StatusTypeID": 50,
    "DateLastStatusUpdate": "2015-06-08T15:08:00Z",
    "DataQualityLevel": 1,
    "DateCreated": "2015-06-08T11:02:00Z",
    "SubmissionStatusTypeID": 200
}