{
    "IsRecentlyVerified": false,
    "ID": 38660,
    "UUID": "D778C567-17F5-4715-8309-474707A8CE55",
    "DataProviderID": 26,
    "DataProvidersReference": "34262",
    "OperatorID": 73,
    "OperatorsReference": "EV-Box EVB-P1250041",
    "UsageCost": "0.00 jaarabonnement",
    "AddressInfo": {
        "ID": 39006,
        "Title": "Weidemolen 6",
        "AddressLine1": "Weidemolen 6",
        "Town": "Heerhugowaard",
        "Postcode": "1703 TB",
        "CountryID": 159,
        "Latitude": 52.65958,
        "Longitude": 4.83456,
        "RelatedURL": "http://www.ev-box.nl",
        "DistanceUnit": 0
    },
    "Connections": [
        {
            "ID": 42171,
            "ConnectionTypeID": 25,
            "LevelID": 2,
            "PowerKW": 5,
            "CurrentTypeID": 10
        }
    ],
    "NumberOfPoints": 1,
    "StatusTypeID": 50,
    "DateLastStatusUpdate": "2016-06-04T02:55:00Z",
    "DataQualityLevel": 3,
    "DateCreated": "2015-01-09T06:08:00Z",
    "SubmissionStatusTypeID": 100
}