{
    "IsRecentlyVerified": false,
    "ID": 137334,
    "UUID": "2177E437-4E5D-46AD-951D-5F22DE5EB262",
    "DataProviderID": 2,
    "DataProvidersReference": "146932",
    "OperatorID": 59,
    "UsageTypeID": 1,
    "AddressInfo": {
        "ID": 137680,
        "Title": "Greenlots - 162183",
        "AddressLine1": "29582 US Highway 19 N",
        "Town": "Clearwater",
        "StateOrProvince": "FL",
        "Postcode": "33763",
        "CountryID": 2,
        "Latitude": 28.040757,
        "Longitude": -82.738588,
        "ContactTelephone1": "855-900-7584",
        "AccessComments": "24 hours daily",
        "RelatedURL": "http://greenlots.com/",
        "DistanceUnit": 0
    },
    "Connections": [
        {
            "ID": 192222,
            "ConnectionTypeID": 1,
            "LevelID": 2,
            "Amps": 16,
            "Voltage": 230,
            "PowerKW": 3,
            "CurrentTypeID": 10,
            "Quantity": 2
        }
    ],
    "StatusTypeID": 50,
    "DateLastStatusUpdate": "2019-12-24T09:05:00Z",
    "DataQualityLevel": 3,
    "DateCreated": "2019-12-24T09:05:00Z",
    "SubmissionStatusTypeID": 100
}