{
    "IsRecentlyVerified": false,
    "ID": 135535,
    "UUID": "9EE227E0-CE26-4894-A8EB-C05FC4CEA9AE",
    "DataProviderID": 18,
    "DataProvidersReference": "4c5bc9874d7876f9b7b6959d3c555f45",
    "OperatorID": 20,
    "UsageTypeID": 4,
    "AddressInfo": {
        "ID": 135881,
        "Title": "Littlehampton",
        "AddressLine1": "St Martins Car Park",
        "Town": "Littlehampton",
        "Postcode": "BN17 6EU",
        "CountryID": 1,
        "Latitude": 50.810632,
        "Longitude": -0.5425,
        "AccessComments": "St Martins Car Park",
        "RelatedURL": "http://www.chargeyourcar.org.uk",
        "DistanceUnit": 0
    },
    "Connections": [
        {
            "ID": 189897,
            "ConnectionTypeID": 3,
            "Reference": "0",
            "StatusTypeID": 50,
            "LevelID": 2,
            "Amps": 13,
            "Voltage": 230,
            "PowerKW": 3,
            "CurrentTypeID": 10
        }
    ],
    "StatusTypeID": 0,
    "DateLastStatusUpdate": "2019-12-24T05:22:00Z",
    "MetadataValues": [
        {
            "ID": 5387,
            "MetadataFieldID": 4,
            "ItemValue": "Contains public sector information licensed under the Open Government Licence v2.0. http://www.nationalarchives.gov.uk/doc/open-government-licence/version/2/"
        }
    ],
    "DataQualityLevel": 3,
    "DateCreated": "2019-12-24T05:22:00Z",
    "SubmissionStatusTypeID": 100
}