{
    "IsRecentlyVerified": false,
    "ID": 60739,
    "UUID": "5B1A7877-519C-43CD-A86F-C2EEEFD3C0B2",
    "DataProviderID": 1,
    "OperatorID": 45,
    "UsageTypeID": 4,
    "UsageCost": "Free",
    "AddressInfo": {
        "ID": 61085,
        "Title": "Desira Great Yarmouth",
        "AddressLine1": "Ormond Road",
        "AddressLine2": "North Quay",
        "Town": "Great Yarmouth",
        "StateOrProvince": "Norfolk",
        "Postcode": "NR30 1RD",
        "CountryID": 1,
        "Latitude": 52.615076,
        "Longitude": 1.724017,
        "DistanceUnit": 0
    },
    "Connections": [
        {
            "ID": 77008,
            "ConnectionTypeID": 25,
            "Reference": "1",
            "StatusTypeID": 50,
            "LevelID": 2,
            "Amps": 32,
            "Voltage": 230,
            "PowerKW": 7,
            "CurrentTypeID": 10,
            "Quantity": 1
        }
    ],
    "NumberOfPoints": 1,
    "GeneralComments": "Dealership forecourt charging. APT Charge point. Formerly on Source East. Should now be configured to accept any RFID.",
    "StatusTypeID": 50,
    "DateLastStatusUpdate": "2017-03-31T08:10:00Z",
    "MetadataValues": [
        {
            "ID": 2985,
            "MetadataFieldID": 4,
            "ItemValue": "Contains public sector information licensed under the Open Government Licence v2.0. http://www.nationalarchives.gov.uk/doc/open-government-licence/version/2/"
        }
    ],
    "DataQualityLevel": 3,
    "DateCreated": "2016-02-07T06:21:00Z",
    "SubmissionStatusTypeID": 100
}