{
    "IsRecentlyVerified": false,
    "ID": 81996,
    "UUID": "D9C7012B-FF41-4FF0-B6A9-821A05F0DE41",
    "DataProviderID": 1,
    "OperatorID": 23,
    "OperatorsReference": "23562",
    "UsageTypeID": 4,
    "AddressInfo": {
        "ID": 82342,
        "Title": "The Linen Mill Film & Television Studios",
        "AddressLine1": "245 Castlewellan RD",
        "Town": "Banbridge",
        "Postcode": "BT32 3SG",
        "CountryID": 1,
        "Latitude": 54.339022,
        "Longitude": -7.304325,
        "ContactTelephone1": "+44 284 062 0102",
        "DistanceUnit": 0
    },
    "Connections": [
        {
            "ID": 116756,
            "ConnectionTypeID": 30,
            "StatusTypeID": 50,
            "LevelID": 2,
            "Amps": 32,
            "Voltage": 230,
            "PowerKW": 7,
            "CurrentTypeID": 10,
            "Quantity": 3
        }
    ],
    "NumberOfPoints": 3,
    "GeneralComments": "3 Tesla Connectors, up to 7kW.Available for customers. Self park.",
    "StatusTypeID": 50,
    "DateLastStatusUpdate": "2018-10-03T17:01:00Z",
    "DataQualityLevel": 1,
    "DateCreated": "2017-02-03T13:56:00Z",
    "SubmissionStatusTypeID": 200
}