{
    "IsRecentlyVerified": false,
    "ID": 112195,
    "UUID": "FD6B488C-0E00-487B-978C-967EC746C516",
    "DataProviderID": 2,
    "DataProvidersReference": "83927",
    "UsageTypeID": 1,
    "AddressInfo": {
        "ID": 112541,
        "Title": "Peavey Mart",
        "AddressLine1": "5338 50th Ave",
        "Town": "Vegreville",
        "StateOrProvince": "AB",
        "Postcode": "T9C 1M3",
        "CountryID": 44,
        "Latitude": 53.498559,
        "Longitude": -112.062161,
        "ContactTelephone1": "780-632-6707",
        "AccessComments": "24 hours daily",
        "RelatedURL": "",
        "DistanceUnit": 0
    },
    "Connections": [
        {
            "ID": 157746,
            "ConnectionTypeID": 1,
            "LevelID": 2,
            "Amps": 16,
            "Voltage": 230,
            "PowerKW": 3.7,
            "CurrentTypeID": 10,
            "Quantity": 1
        }
    ],
    "DateLastStatusUpdate": "2020-06-26T03:12:00Z",
    "DataQualityLevel": 3,
    "DateCreated": "2018-10-18T23:37:00Z",
    "SubmissionStatusTypeID": 100
}