{
    "IsRecentlyVerified": false,
    "ID": 39206,
    "UUID": "78491728-9B84-4425-A997-6C351FAF49C8",
    "DataProviderID": 1,
    "OperatorID": 220,
    "OperatorsReference": "2115,2115,2114",
    "UsageTypeID": 1,
    "UsageCost": "€1.73 + €0.3213/kWh; Andere Tarife möglich",
    "AddressInfo": {
        "ID": 39552,
        "Title": "Stein-Hardenberg-Straße 83",
        "AddressLine1": "Stein-Hardenberg-Straße 83",
        "AddressLine2": "Ecke Sonnenweg",
        "Town": "Hamburg",
        "Postcode": "22045",
        "CountryID": 87,
        "Latitude": 53.5878843121517,
        "Longitude": 10.1247720687866,
        "AccessComments": "1 reservierter kostenloser 24/7 verfügbarer Ladeplatz.",
        "DistanceUnit": 0
    },
    "Connections": [
        {
            "ID": 42717,
            "ConnectionTypeID": 25,
            "StatusTypeID": 50,
            "LevelID": 2,
            "Amps": 32,
            "Voltage": 400,
            "PowerKW": 11,
            "CurrentTypeID": 20,
            "Quantity": 1
        },
        {
            "ID": 49956,
            "ConnectionTypeID": 25,
            "StatusTypeID": 50,
            "LevelID": 2,
            "Amps": 32,
            "Voltage": 400,
            "PowerKW": 22,
            "CurrentTypeID": 20,
            "Quantity": 1
        },
        {
            "ID": 83515,
            "ConnectionTypeID": 28,
            "StatusTypeID": 50,
            "LevelID": 2,
            "Amps": 16,
            "Voltage": 230,
            "PowerKW": 3.7,
            "CurrentTypeID": 10,
            "Quantity": 2
        }
    ],
    "NumberOfPoints": 2,
    "StatusTypeID": 50,
    "DateLastStatusUpdate": "2017-06-11T09:41:00Z",
    "DataQualityLevel": 3,
    "DateCreated": "2015-01-09T06:08:00Z",
    "SubmissionStatusTypeID": 200
}