{
    "IsRecentlyVerified": false,
    "ID": 27402,
    "UUID": "4264D5B5-424A-4D03-AD93-5212FA3182BC",
    "DataProviderID": 2,
    "DataProvidersReference": "48706",
    "OperatorID": 5,
    "UsageTypeID": 1,
    "AddressInfo": {
        "ID": 27748,
        "Title": "SARATOGA CITY",
        "AddressLine1": "14493 Big Basin Way",
        "Town": "Saratoga",
        "StateOrProvince": "CA",
        "Postcode": "95070",
        "CountryID": 2,
        "Latitude": 37.2575912,
        "Longitude": -122.0339966,
        "ContactTelephone1": "888-758-4389",
        "AccessComments": "24 hours daily",
        "RelatedURL": "http://www.chargepoint.com/",
        "DistanceUnit": 0
    },
    "Connections": [
        {
            "ID": 30034,
            "ConnectionTypeID": 1,
            "LevelID": 2,
            "Amps": 16,
            "Voltage": 230,
            "PowerKW": 3,
            "CurrentTypeID": 10,
            "Quantity": 1
        }
    ],
    "DateLastStatusUpdate": "2019-04-06T04:02:00Z",
    "DataQualityLevel": 3,
    "DateCreated": "2014-11-28T03:38:00Z",
    "SubmissionStatusTypeID": 100
}