{
    "IsRecentlyVerified": false,
    "ID": 72294,
    "UUID": "7995C903-5C85-4F47-925B-88D596ECE373",
    "DataProviderID": 1,
    "OperatorID": 23,
    "OperatorsReference": "20279",
    "UsageTypeID": 1,
    "UsageCost": "$0.26/kWh; other tariffs for older cars",
    "AddressInfo": {
        "ID": 72640,
        "Title": "Crescent City Downtown Parking - Tesla",
        "AddressLine1": "1000 Front St",
        "Town": "Crescent City",
        "StateOrProvince": "CA",
        "Postcode": "95531",
        "CountryID": 2,
        "Latitude": 41.7518083,
        "Longitude": -124.1947249,
        "ContactTelephone1": "877-798-3752",
        "AccessComments": "24 hours daily; for Tesla use only",
        "RelatedURL": "http://www.teslamotors.com/supercharger",
        "DistanceUnit": 0
    },
    "Connections": [
        {
            "ID": 103599,
            "ConnectionTypeID": 27,
            "StatusTypeID": 50,
            "LevelID": 3,
            "Amps": 100,
            "Voltage": 400,
            "PowerKW": 120,
            "CurrentTypeID": 30,
            "Quantity": 6
        }
    ],
    "NumberOfPoints": 6,
    "StatusTypeID": 50,
    "DateLastStatusUpdate": "2018-03-13T13:54:00Z",
    "DataQualityLevel": 3,
    "DateCreated": "2016-10-09T02:45:00Z",
    "SubmissionStatusTypeID": 100
}