{
    "IsRecentlyVerified": false,
    "ID": 181211,
    "UUID": "0473EAAE-0116-4C71-A87B-6CF2AB9EB342",
    "DataProviderID": 29,
    "DataProvidersReference": "8861",
    "OperatorID": 86,
    "AddressInfo": {
        "ID": 181570,
        "Title": "Kirchgasse 1",
        "AddressLine1": "Kirchgasse 1",
        "Town": "Wimsheim",
        "Postcode": "71299",
        "CountryID": 87,
        "Latitude": 48.852261,
        "Longitude": 8.827149,
        "DistanceUnit": 0
    },
    "Connections": [
        {
            "ID": 285240,
            "ConnectionTypeID": 25,
            "StatusTypeID": 50,
            "LevelID": 2,
            "PowerKW": 22,
            "CurrentTypeID": 20
        },
        {
            "ID": 285241,
            "ConnectionTypeID": 25,
            "StatusTypeID": 50,
            "LevelID": 2,
            "PowerKW": 22,
            "CurrentTypeID": 20
        }
    ],
    "StatusTypeID": 50,
    "DateLastStatusUpdate": "2021-07-12T02:42:00Z",
    "MetadataValues": [
        {
            "ID": 13505,
            "MetadataFieldID": 4,
            "ItemValue": "Data from the German chargepoint registry provided by Bundesnetzagentur.de under the CC-BY 4.0 license"
        }
    ],
    "DataQualityLevel": 3,
    "DateCreated": "2021-07-08T10:01:00Z",
    "SubmissionStatusTypeID": 100
}