{
    "IsRecentlyVerified": false,
    "ID": 149718,
    "UUID": "E5A8F3D3-FDCD-46F9-962E-020ED7BC52C5",
    "DataProviderID": 1,
    "OperatorID": 1,
    "UsageTypeID": 1,
    "UsageCost": "Free",
    "AddressInfo": {
        "ID": 150071,
        "Title": "Tall Grass Liquor",
        "AddressLine1": "1410 Boyer Dr",
        "Town": "Marshall",
        "StateOrProvince": "MN",
        "Postcode": "56258",
        "CountryID": 2,
        "Latitude": 44.43090471381885,
        "Longitude": -95.76887785569318,
        "RelatedURL": "https://www.plugshare.com/location/225438",
        "DistanceUnit": 0
    },
    "Connections": [
        {
            "ID": 207858,
            "ConnectionTypeID": 2,
            "StatusTypeID": 50,
            "LevelID": 3,
            "PowerKW": 50,
            "CurrentTypeID": 30,
            "Quantity": 1
        },
        {
            "ID": 207859,
            "ConnectionTypeID": 32,
            "StatusTypeID": 50,
            "LevelID": 3,
            "PowerKW": 50,
            "CurrentTypeID": 30,
            "Quantity": 1
        },
        {
            "ID": 207860,
            "ConnectionTypeID": 1,
            "StatusTypeID": 50,
            "Quantity": 2
        }
    ],
    "NumberOfPoints": 1,
    "StatusTypeID": 50,
    "DateLastStatusUpdate": "2020-03-05T10:01:00Z",
    "DataQualityLevel": 1,
    "DateCreated": "2020-03-04T20:58:00Z",
    "SubmissionStatusTypeID": 200
}