{
    "IsRecentlyVerified": false,
    "ID": 140791,
    "UUID": "CA81C1BB-57F3-4362-9497-03131BE74FD0",
    "DataProviderID": 2,
    "DataProvidersReference": "96168",
    "OperatorID": 9,
    "UsageTypeID": 1,
    "AddressInfo": {
        "ID": 141143,
        "Title": "CBRE - Seaport Centre",
        "AddressLine1": "700 Chesapeake Dr.",
        "Town": "Redwood City",
        "StateOrProvince": "CA",
        "Postcode": "94063",
        "CountryID": 2,
        "Latitude": 37.500499,
        "Longitude": -122.21345,
        "ContactTelephone1": "888-998-2546",
        "AccessComments": "MON: 24 hours | TUE: 24 hours | WED: 24 hours | THU: 24 hours | FRI: 24 hours | SAT: 24 hours | SUN: 24 hours",
        "RelatedURL": "http://www.blinkcharging.com/",
        "DistanceUnit": 0
    },
    "Connections": [
        {
            "ID": 196521,
            "ConnectionTypeID": 1,
            "LevelID": 2,
            "Amps": 16,
            "Voltage": 230,
            "PowerKW": 3.7,
            "CurrentTypeID": 10,
            "Quantity": 1
        }
    ],
    "StatusTypeID": 50,
    "DateLastStatusUpdate": "2020-06-26T02:59:00Z",
    "DataQualityLevel": 3,
    "DateCreated": "2019-12-24T09:13:00Z",
    "SubmissionStatusTypeID": 100
}