{
    "IsRecentlyVerified": false,
    "ID": 100847,
    "UUID": "F16C683D-339B-4184-98D5-2690A3E33565",
    "DataProviderID": 1,
    "OperatorID": 23,
    "OperatorsReference": "41339",
    "UsageTypeID": 4,
    "AddressInfo": {
        "ID": 101193,
        "Title": "Delta Hotels By Marriott Prince Edward",
        "AddressLine1": "18 Queen St",
        "Town": "Charlottetown",
        "StateOrProvince": "Prince Edward Island",
        "Postcode": "C1A 4A1",
        "CountryID": 44,
        "Latitude": 46.231934,
        "Longitude": -63.124103,
        "ContactTelephone1": "(902) 566-2222",
        "DistanceUnit": 0
    },
    "Connections": [
        {
            "ID": 142427,
            "ConnectionTypeID": 30,
            "StatusTypeID": 50,
            "LevelID": 2,
            "PowerKW": 16,
            "CurrentTypeID": 20,
            "Quantity": 2
        }
    ],
    "NumberOfPoints": 2,
    "GeneralComments": "2 Tesla Connectors, up to 16kW.Available for customers. Please see front desk.",
    "StatusTypeID": 50,
    "DateLastStatusUpdate": "2018-03-10T06:58:00Z",
    "DataQualityLevel": 1,
    "DateCreated": "2018-03-10T06:58:00Z",
    "SubmissionStatusTypeID": 200
}