{
    "IsRecentlyVerified": false,
    "ID": 176360,
    "UUID": "BF000586-60D9-4711-A0BA-5BF0DE6F23E2",
    "DataProviderID": 1,
    "OperatorID": 3455,
    "UsageTypeID": 4,
    "AddressInfo": {
        "ID": 176719,
        "Title": "Aral Nikola-Tesla-Straße",
        "AddressLine1": "Nikola-Tesla-Straße",
        "Town": "Ettenheim",
        "StateOrProvince": "Baden-Württemberg",
        "Postcode": "77955",
        "CountryID": 87,
        "Latitude": 48.27491706689659,
        "Longitude": 7.7852076245773105,
        "DistanceUnit": 0
    },
    "Connections": [
        {
            "ID": 274175,
            "ConnectionTypeID": 33,
            "StatusTypeID": 50,
            "LevelID": 3,
            "Amps": 500,
            "Voltage": 1000,
            "PowerKW": 300,
            "CurrentTypeID": 30,
            "Quantity": 1
        },
        {
            "ID": 274176,
            "ConnectionTypeID": 33,
            "StatusTypeID": 50,
            "LevelID": 3,
            "Amps": 500,
            "Voltage": 1000,
            "PowerKW": 300,
            "CurrentTypeID": 30,
            "Quantity": 1
        },
        {
            "ID": 274177,
            "ConnectionTypeID": 2,
            "StatusTypeID": 50,
            "LevelID": 3,
            "Amps": 500,
            "Voltage": 1000,
            "PowerKW": 300,
            "CurrentTypeID": 30,
            "Quantity": 1
        },
        {
            "ID": 274178,
            "ConnectionTypeID": 33,
            "StatusTypeID": 50,
            "LevelID": 3,
            "Amps": 500,
            "Voltage": 1000,
            "PowerKW": 300,
            "CurrentTypeID": 30,
            "Quantity": 1
        },
        {
            "ID": 274179,
            "ConnectionTypeID": 33,
            "StatusTypeID": 50,
            "LevelID": 3,
            "Amps": 500,
            "Voltage": 1000,
            "PowerKW": 300,
            "CurrentTypeID": 30,
            "Quantity": 1
        },
        {
            "ID": 274180,
            "ConnectionTypeID": 2,
            "StatusTypeID": 50,
            "LevelID": 3,
            "Amps": 500,
            "Voltage": 1000,
            "PowerKW": 300,
            "CurrentTypeID": 30,
            "Quantity": 1
        }
    ],
    "NumberOfPoints": 4,
    "StatusTypeID": 50,
    "DateLastStatusUpdate": "2021-07-07T15:11:00Z",
    "DataQualityLevel": 1,
    "DateCreated": "2021-07-07T15:11:00Z",
    "SubmissionStatusTypeID": 200
}