{
    "IsRecentlyVerified": false,
    "ID": 136710,
    "UUID": "697AD46C-3E1A-4144-A430-80CEFFDEF48F",
    "DataProviderID": 18,
    "DataProvidersReference": "05180a6ec799ff23dabad1f899382570",
    "UsageTypeID": 1,
    "AddressInfo": {
        "ID": 137056,
        "Title": "Next to pay and display meter",
        "AddressLine1": "High Street",
        "AddressLine2": "Kings Heath",
        "Town": "Birmingham",
        "Postcode": "B14 7LB",
        "CountryID": 1,
        "Latitude": 52.436765,
        "Longitude": -1.892486,
        "AccessComments": "Next to pay and display meter. Opposite Argos. Parking fees apply. Fitted under Midlands PiP",
        "RelatedURL": "http://www.national-charge-point-registry.uk/",
        "DistanceUnit": 0
    },
    "Connections": [
        {
            "ID": 191252,
            "ConnectionTypeID": 25,
            "Reference": "0",
            "StatusTypeID": 50,
            "LevelID": 2,
            "Amps": 32,
            "Voltage": 400,
            "PowerKW": 22,
            "CurrentTypeID": 20
        },
        {
            "ID": 191253,
            "ConnectionTypeID": 25,
            "Reference": "1",
            "StatusTypeID": 50,
            "LevelID": 2,
            "Amps": 32,
            "Voltage": 400,
            "PowerKW": 22,
            "CurrentTypeID": 20
        }
    ],
    "StatusTypeID": 0,
    "DateLastStatusUpdate": "2020-06-25T10:00:00Z",
    "MetadataValues": [
        {
            "ID": 6562,
            "MetadataFieldID": 4,
            "ItemValue": "Contains public sector information licensed under the Open Government Licence v2.0. http://www.nationalarchives.gov.uk/doc/open-government-licence/version/2/"
        }
    ],
    "DataQualityLevel": 3,
    "DateCreated": "2019-12-24T05:23:00Z",
    "SubmissionStatusTypeID": 100
}