{
    "IsRecentlyVerified": false,
    "ID": 116142,
    "UUID": "E628A881-AC00-430B-868B-3244BFA97D70",
    "DataProviderID": 2,
    "DataProvidersReference": "105361",
    "UsageTypeID": 7,
    "AddressInfo": {
        "ID": 116488,
        "Title": "Harvest Chevrolet",
        "AddressLine1": "1600 E Yakima Ave",
        "Town": "Yakima",
        "StateOrProvince": "WA",
        "Postcode": "98901",
        "CountryID": 2,
        "Latitude": 46.604239,
        "Longitude": -120.481583,
        "ContactTelephone1": "509-731-3938",
        "AccessComments": "Dealership business hours\r\nPublic - Call ahead",
        "RelatedURL": "",
        "DistanceUnit": 0
    },
    "Connections": [
        {
            "ID": 163206,
            "ConnectionTypeID": 1,
            "LevelID": 2,
            "Amps": 16,
            "Voltage": 230,
            "PowerKW": 3.7,
            "CurrentTypeID": 10,
            "Quantity": 2
        },
        {
            "ID": 163207,
            "ConnectionTypeID": 32,
            "LevelID": 3,
            "Amps": 100,
            "Voltage": 400,
            "PowerKW": 40,
            "CurrentTypeID": 30,
            "Quantity": 1
        }
    ],
    "DateLastStatusUpdate": "2020-06-26T03:10:00Z",
    "DataQualityLevel": 3,
    "DateCreated": "2019-02-11T07:13:00Z",
    "SubmissionStatusTypeID": 100
}