{
    "IsRecentlyVerified": false,
    "ID": 84728,
    "UUID": "04EB32D4-4383-4F12-8199-5EF1FBD4FA96",
    "DataProviderID": 1,
    "OperatorID": 156,
    "UsageTypeID": 4,
    "AddressInfo": {
        "ID": 85074,
        "Title": "Autohaus Michael Raeder ",
        "AddressLine1": "Ernst-Zindel-Straße 18A",
        "Town": "Dessau-Roßlau",
        "StateOrProvince": "Dessau-Roßlau",
        "Postcode": "06847",
        "CountryID": 87,
        "Latitude": 51.8190421553728,
        "Longitude": 12.175121417196682,
        "ContactTelephone1": "+49 340 517423 ",
        "AccessComments": "Laden am Kia Autohaus. Freischaltbar mit New Motion, PlugSurfing, SUN und vielen anderen Ladekarten. ",
        "RelatedURL": "http://www.kia-raeder-dessau.de/",
        "DistanceUnit": 0
    },
    "Connections": [
        {
            "ID": 120361,
            "ConnectionTypeID": 25,
            "StatusTypeID": 50,
            "LevelID": 2,
            "Amps": 32,
            "Voltage": 400,
            "PowerKW": 22,
            "CurrentTypeID": 20,
            "Quantity": 1
        }
    ],
    "NumberOfPoints": 1,
    "StatusTypeID": 50,
    "DateLastStatusUpdate": "2017-03-13T07:13:00Z",
    "DataQualityLevel": 1,
    "DateCreated": "2017-03-13T07:13:00Z",
    "SubmissionStatusTypeID": 200
}