{
    "IsRecentlyVerified": false,
    "ID": 170957,
    "UUID": "25ED5A2A-38A4-494A-A7FA-8652C4FCE359",
    "DataProviderID": 1,
    "OperatorID": 80,
    "UsageTypeID": 4,
    "AddressInfo": {
        "ID": 171316,
        "Title": "San Giovanni Battista in Vallà | EnelX",
        "AddressLine1": "Via Chiesa",
        "AddressLine2": "Vallà",
        "Town": "Riese Pio X",
        "StateOrProvince": "TV",
        "Postcode": "31030",
        "CountryID": 112,
        "Latitude": 45.706583493532236,
        "Longitude": 11.931808742929093,
        "RelatedURL": "https://www.enelx.com/it/it/emobility",
        "DistanceUnit": 0
    },
    "Connections": [
        {
            "ID": 261197,
            "ConnectionTypeID": 25,
            "StatusTypeID": 50,
            "LevelID": 2,
            "Amps": 32,
            "Voltage": 400,
            "PowerKW": 22,
            "CurrentTypeID": 20,
            "Quantity": 1
        },
        {
            "ID": 261198,
            "ConnectionTypeID": 36,
            "StatusTypeID": 50,
            "LevelID": 2,
            "Amps": 16,
            "Voltage": 240,
            "PowerKW": 3.7,
            "CurrentTypeID": 10,
            "Quantity": 1
        }
    ],
    "NumberOfPoints": 2,
    "StatusTypeID": 50,
    "DateLastStatusUpdate": "2020-12-14T16:44:00Z",
    "DataQualityLevel": 1,
    "DateCreated": "2020-12-14T16:44:00Z",
    "SubmissionStatusTypeID": 200
}