{
    "IsRecentlyVerified": false,
    "ID": 19986,
    "UUID": "E05A8B79-B4F3-436C-A7DC-82B46A407932",
    "DataProviderID": 1,
    "OperatorID": 1,
    "UsageTypeID": 0,
    "UsageCost": "",
    "AddressInfo": {
        "ID": 20331,
        "Title": "Parking Saint-Laud",
        "AddressLine1": "place Pierre Semard",
        "AddressLine2": "",
        "Town": "",
        "StateOrProvince": "Angers",
        "Postcode": "49000",
        "CountryID": 80,
        "Latitude": 47.46477,
        "Longitude": -0.55922,
        "ContactTelephone1": "",
        "ContactTelephone2": "",
        "ContactEmail": "",
        "AccessComments": "Réservé aux clients de l'établissement",
        "RelatedURL": "",
        "DistanceUnit": 0
    },
    "Connections": [],
    "GeneralComments": "",
    "StatusTypeID": 50,
    "DateLastStatusUpdate": "2013-10-23T16:51:00Z",
    "DataQualityLevel": 1,
    "DateCreated": "2013-10-23T07:43:00Z",
    "SubmissionStatusTypeID": 200
}