{
    "IsRecentlyVerified": false,
    "ID": 91265,
    "UUID": "BE117230-6172-4D6A-80A3-50930842D77D",
    "DataProviderID": 1,
    "OperatorID": 19,
    "UsageTypeID": 6,
    "UsageCost": "Free to customers of The Bell Inn",
    "AddressInfo": {
        "ID": 91611,
        "Title": "The Bell Inn ",
        "AddressLine1": "Ferry Road",
        "AddressLine2": "Walberswick",
        "Town": "Southwold",
        "StateOrProvince": "Suffolk",
        "Postcode": "IP18 6TN",
        "CountryID": 1,
        "Latitude": 52.3142133730862,
        "Longitude": 1.66554042791472,
        "ContactTelephone1": "01502 723109",
        "ContactEmail": "bellwalberswick@adnams.co.uk",
        "AccessComments": "Located in the car park of The Bell, Walberswick. Pub owned by Adnams plc.\r\nFor guests of The Bell, Walberswick",
        "RelatedURL": "http://www.bellinnwalberswick.co.uk/",
        "DistanceUnit": 0
    },
    "Connections": [
        {
            "ID": 129397,
            "ConnectionTypeID": 25,
            "StatusTypeID": 50,
            "LevelID": 2,
            "Amps": 32,
            "Voltage": 230,
            "PowerKW": 7,
            "CurrentTypeID": 10,
            "Quantity": 1
        }
    ],
    "NumberOfPoints": 1,
    "StatusTypeID": 50,
    "DateLastStatusUpdate": "2019-03-06T14:01:00Z",
    "DataQualityLevel": 1,
    "DateCreated": "2017-08-02T09:42:00Z",
    "SubmissionStatusTypeID": 200
}