{
    "IsRecentlyVerified": false,
    "ID": 122946,
    "UUID": "A39BBC20-5895-4F98-BADE-0C95F2B43BF8",
    "DataProviderID": 2,
    "DataProvidersReference": "50850",
    "UsageTypeID": 2,
    "AddressInfo": {
        "ID": 123292,
        "Title": "Albemarle Corp",
        "AddressLine1": "348 Holiday Inn Dr",
        "Town": "Kings Mountain",
        "StateOrProvince": "NC",
        "Postcode": "28086",
        "CountryID": 2,
        "Latitude": 35.225378,
        "Longitude": -81.337114,
        "ContactTelephone1": "",
        "AccessComments": "Employee and guest use only",
        "RelatedURL": "",
        "DistanceUnit": 0
    },
    "Connections": [
        {
            "ID": 172875,
            "ConnectionTypeID": 1,
            "LevelID": 2,
            "Amps": 16,
            "Voltage": 230,
            "PowerKW": 3,
            "CurrentTypeID": 10,
            "Quantity": 8
        }
    ],
    "DateLastStatusUpdate": "2019-04-06T05:03:00Z",
    "DataQualityLevel": 3,
    "DateCreated": "2019-04-06T05:03:00Z",
    "SubmissionStatusTypeID": 100
}