{
    "IsRecentlyVerified": false,
    "ID": 63124,
    "UUID": "C9D0DE98-64BF-4C2A-A4F2-6AC4128384BF",
    "DataProviderID": 26,
    "DataProvidersReference": "76897",
    "OperatorID": 73,
    "OperatorsReference": "EV-Box EVB-P1423128",
    "UsageCost": "0.00 jaarabonnement",
    "AddressInfo": {
        "ID": 63470,
        "Title": "Marisstraat 1",
        "AddressLine1": "Marisstraat 1",
        "Town": "Sliedrecht",
        "Postcode": "3364 AZ",
        "CountryID": 159,
        "Latitude": 51.83273,
        "Longitude": 4.75578,
        "RelatedURL": "http://www.ev-box.nl",
        "DistanceUnit": 0
    },
    "Connections": [
        {
            "ID": 80274,
            "ConnectionTypeID": 25,
            "LevelID": 2,
            "PowerKW": 5,
            "CurrentTypeID": 10
        },
        {
            "ID": 80275,
            "ConnectionTypeID": 25,
            "LevelID": 2,
            "PowerKW": 5,
            "CurrentTypeID": 10
        }
    ],
    "NumberOfPoints": 1,
    "StatusTypeID": 50,
    "DateLastStatusUpdate": "2016-06-04T02:41:00Z",
    "DataQualityLevel": 3,
    "DateCreated": "2016-03-03T12:29:00Z",
    "SubmissionStatusTypeID": 100
}