{
    "IsRecentlyVerified": false,
    "ID": 108032,
    "UUID": "CCD04D4E-3F5B-4BE7-B645-5B80F42BE8F8",
    "DataProviderID": 1,
    "OperatorID": 69,
    "UsageTypeID": 4,
    "AddressInfo": {
        "ID": 108378,
        "Title": "Parkplatz Deutsches Rotes Kreuz",
        "AddressLine1": "Alfelder Straße 16",
        "Town": "Diekholzen",
        "StateOrProvince": "Landkreis Hildesheim",
        "Postcode": "31199",
        "CountryID": 87,
        "Latitude": 52.094718965671746,
        "Longitude": 9.917527433365308,
        "ContactTelephone1": "+49 5121 508 - 333",
        "AccessComments": "Die Ladesäule befindet sich in der Alfelder Straße 16 auf dem Parkplatz vor dem Deutschen Roten Kreuz, Ortsverein Diekholzen.",
        "RelatedURL": "http://www.evi-hildesheim.de/",
        "DistanceUnit": 0
    },
    "Connections": [
        {
            "ID": 152586,
            "ConnectionTypeID": 25,
            "StatusTypeID": 50,
            "LevelID": 2,
            "Amps": 32,
            "Voltage": 400,
            "PowerKW": 22,
            "CurrentTypeID": 10,
            "Quantity": 2
        },
        {
            "ID": 152886,
            "ConnectionTypeID": 25,
            "StatusTypeID": 50,
            "LevelID": 2,
            "Amps": 32,
            "Voltage": 400,
            "PowerKW": 22,
            "CurrentTypeID": 10,
            "Quantity": 2
        }
    ],
    "NumberOfPoints": 2,
    "GeneralComments": "24/7 nutzbare blauweiße Ladesäule.\r\nBetreiber ist die EVI Energieversorgung Hildesheim.",
    "StatusTypeID": 50,
    "DateLastStatusUpdate": "2018-09-12T20:47:00Z",
    "DataQualityLevel": 1,
    "DateCreated": "2018-08-27T12:37:00Z",
    "SubmissionStatusTypeID": 200
}