{
    "IsRecentlyVerified": false,
    "ID": 135537,
    "UUID": "A8389573-FDDA-4D4D-8EB4-77A0C1DA532E",
    "DataProviderID": 18,
    "DataProvidersReference": "3823cefed5483b5839a2b12a2732395d",
    "OperatorID": 2244,
    "UsageTypeID": 5,
    "AddressInfo": {
        "ID": 135883,
        "Title": "Havant Road",
        "AddressLine1": "Havant Road",
        "Town": "Portsmouth",
        "Postcode": "PO2 0AA",
        "CountryID": 1,
        "Latitude": 50.813797,
        "Longitude": -1.078539,
        "AccessComments": "",
        "RelatedURL": "https://www.ubitricity.com",
        "DistanceUnit": 0
    },
    "Connections": [
        {
            "ID": 189901,
            "ConnectionTypeID": 25,
            "Reference": "suby1100001248",
            "StatusTypeID": 50,
            "LevelID": 2,
            "Amps": 16,
            "Voltage": 230,
            "PowerKW": 3.7,
            "CurrentTypeID": 10
        }
    ],
    "StatusTypeID": 0,
    "DateLastStatusUpdate": "2021-04-25T05:46:00Z",
    "MetadataValues": [
        {
            "ID": 5389,
            "MetadataFieldID": 4,
            "ItemValue": "Contains public sector information licensed under the Open Government Licence v2.0. http://www.nationalarchives.gov.uk/doc/open-government-licence/version/2/"
        }
    ],
    "DataQualityLevel": 3,
    "DateCreated": "2019-12-24T05:22:00Z",
    "SubmissionStatusTypeID": 100
}