{
    "UserComments": [
        {
            "ID": 8285,
            "ChargePointID": 56824,
            "CommentTypeID": 10,
            "UserName": "Sordone",
            "Comment": "Confirmed as 22 KW with Renault Zoe.",
            "Rating": 5,
            "RelatedURL": "http://www.lee-nrw.de/emobil/",
            "DateCreated": "2015-12-21T22:32:38.633Z",
            "User": {
                "ID": 6216,
                "Username": "Sordone"
            },
            "CheckinStatusTypeID": 10
        }
    ],
    "MediaItems": [
        {
            "ID": 3644,
            "ChargePointID": 56824,
            "ItemURL": "https://s3-ap-southeast-2.amazonaws.com/openchargemap/images/DE/OCM56824/OCM-56824.orig.2015122122303223.jpg",
            "ItemThumbnailURL": "https://s3-ap-southeast-2.amazonaws.com/openchargemap/images/DE/OCM56824/OCM-56824.thmb.2015122122303223.jpg",
            "Comment": "Information in German that charging is free of charge.",
            "IsEnabled": true,
            "IsVideo": false,
            "IsFeaturedItem": false,
            "IsExternalResource": false,
            "User": {
                "ID": 6216,
                "Username": "Sordone"
            },
            "DateCreated": "2015-12-21T22:31:00Z"
        },
        {
            "ID": 3643,
            "ChargePointID": 56824,
            "ItemURL": "https://s3-ap-southeast-2.amazonaws.com/openchargemap/images/DE/OCM56824/OCM-56824.orig.2015122122293282.jpg",
            "ItemThumbnailURL": "https://s3-ap-southeast-2.amazonaws.com/openchargemap/images/DE/OCM56824/OCM-56824.thmb.2015122122293282.jpg",
            "Comment": "Location",
            "IsEnabled": true,
            "IsVideo": false,
            "IsFeaturedItem": false,
            "IsExternalResource": false,
            "User": {
                "ID": 6216,
                "Username": "Sordone"
            },
            "DateCreated": "2015-12-21T22:30:00Z"
        }
    ],
    "IsRecentlyVerified": false,
    "ID": 56824,
    "UUID": "D02A3D86-132B-42F8-B93D-409F1A715646",
    "DataProviderID": 1,
    "OperatorID": 45,
    "UsageTypeID": 1,
    "AddressInfo": {
        "ID": 57170,
        "Title": "Bürgerwindpark",
        "AddressLine1": "Vogelstange",
        "Town": "Heiden",
        "StateOrProvince": "Kreis Borken",
        "Postcode": "46359",
        "CountryID": 87,
        "Latitude": 51.807650189457654,
        "Longitude": 6.955534651173374,
        "ContactTelephone1": "+49 2867 90909811",
        "AccessComments": "2 kostenlose 24/7 nutzbare Parkplätze. Alles kostenlos.",
        "RelatedURL": "http://www.buergerwindpark-a31.de/",
        "DistanceUnit": 0
    },
    "Connections": [
        {
            "ID": 71702,
            "ConnectionTypeID": 25,
            "StatusTypeID": 50,
            "LevelID": 2,
            "Amps": 32,
            "Voltage": 400,
            "PowerKW": 22,
            "CurrentTypeID": 20,
            "Quantity": 1
        },
        {
            "ID": 71703,
            "ConnectionTypeID": 28,
            "StatusTypeID": 50,
            "LevelID": 2,
            "Amps": 16,
            "Voltage": 230,
            "PowerKW": 3.7,
            "CurrentTypeID": 10,
            "Quantity": 1
        }
    ],
    "NumberOfPoints": 2,
    "StatusTypeID": 50,
    "DateLastStatusUpdate": "2015-12-22T17:27:00Z",
    "DataQualityLevel": 1,
    "DateCreated": "2015-11-11T16:35:00Z",
    "SubmissionStatusTypeID": 200
}