{
    "IsRecentlyVerified": false,
    "ID": 101923,
    "UUID": "CE03627A-7B95-4311-AFB8-A9066557DADD",
    "DataProviderID": 1,
    "OperatorID": 23,
    "OperatorsReference": "42211",
    "UsageTypeID": 4,
    "AddressInfo": {
        "ID": 102269,
        "Title": "Staniland Marina",
        "AddressLine1": "Staniland Marina Lock Hill",
        "Town": "Thorne",
        "Postcode": "DN8 5EP",
        "CountryID": 1,
        "Latitude": 53.611202,
        "Longitude": -0.971956,
        "ContactTelephone1": "+44 140 581 6992",
        "DistanceUnit": 0
    },
    "Connections": [
        {
            "ID": 143906,
            "ConnectionTypeID": 30,
            "StatusTypeID": 50,
            "LevelID": 2,
            "Amps": 32,
            "Voltage": 400,
            "PowerKW": 22,
            "CurrentTypeID": 20,
            "Quantity": 2
        }
    ],
    "NumberOfPoints": 2,
    "GeneralComments": "2 Tesla Connectors, up to 22kW.Available for customers. Self park.",
    "StatusTypeID": 50,
    "DateLastStatusUpdate": "2018-10-03T17:55:00Z",
    "DataQualityLevel": 1,
    "DateCreated": "2018-04-16T04:36:00Z",
    "SubmissionStatusTypeID": 200
}