{
    "IsRecentlyVerified": false,
    "ID": 184946,
    "UUID": "4BDD2B9C-5F86-4A00-950F-356FDFA6EB9A",
    "DataProviderID": 29,
    "DataProvidersReference": "2206,16315",
    "OperatorID": 127,
    "AddressInfo": {
        "ID": 185305,
        "Title": "Mühlenweg 59",
        "AddressLine1": "Mühlenweg 59",
        "Town": "Schortens",
        "Postcode": "26419",
        "CountryID": 87,
        "Latitude": 53.537836740575,
        "Longitude": 7.940089702606,
        "DistanceUnit": 0
    },
    "Connections": [
        {
            "ID": 293836,
            "ConnectionTypeID": 25,
            "StatusTypeID": 50,
            "LevelID": 2,
            "PowerKW": 22,
            "CurrentTypeID": 20
        },
        {
            "ID": 293837,
            "ConnectionTypeID": 25,
            "StatusTypeID": 50,
            "LevelID": 2,
            "PowerKW": 22,
            "CurrentTypeID": 20
        },
        {
            "ID": 293838,
            "ConnectionTypeID": 25,
            "StatusTypeID": 50,
            "LevelID": 2,
            "PowerKW": 22,
            "CurrentTypeID": 20
        },
        {
            "ID": 293839,
            "ConnectionTypeID": 25,
            "StatusTypeID": 50,
            "LevelID": 2,
            "PowerKW": 22,
            "CurrentTypeID": 20
        }
    ],
    "StatusTypeID": 50,
    "DateLastStatusUpdate": "2021-07-09T03:29:00Z",
    "MetadataValues": [
        {
            "ID": 17237,
            "MetadataFieldID": 4,
            "ItemValue": "Data from the German chargepoint registry provided by Bundesnetzagentur.de under the CC-BY 4.0 license"
        }
    ],
    "DataQualityLevel": 3,
    "DateCreated": "2021-07-08T10:06:00Z",
    "SubmissionStatusTypeID": 100
}