{
    "IsRecentlyVerified": false,
    "ID": 78733,
    "UUID": "DC7E38D1-66AE-4A84-8A09-4B62B9CAF9FB",
    "DataProviderID": 1,
    "OperatorID": 23,
    "OperatorsReference": "13915",
    "UsageTypeID": 6,
    "UsageCost": "Free",
    "AddressInfo": {
        "ID": 79079,
        "Title": "Hampton Inn Washington-Downtown-Convention Center",
        "AddressLine1": "901 6th St NW",
        "Town": "Washington",
        "StateOrProvince": "DC",
        "Postcode": "20001",
        "CountryID": 2,
        "Latitude": 38.901964,
        "Longitude": -77.019837,
        "ContactTelephone1": "(202) 842-2500",
        "DistanceUnit": 0
    },
    "Connections": [
        {
            "ID": 113352,
            "ConnectionTypeID": 30,
            "StatusTypeID": 50,
            "LevelID": 2,
            "PowerKW": 8,
            "CurrentTypeID": 10,
            "Quantity": 1
        }
    ],
    "NumberOfPoints": 1,
    "GeneralComments": "1 Tesla Connector, up to 8kW.Available for patrons only. Please see front desk.",
    "StatusTypeID": 50,
    "DateLastStatusUpdate": "2017-06-09T15:21:00Z",
    "DataQualityLevel": 1,
    "DateCreated": "2017-01-26T15:19:00Z",
    "SubmissionStatusTypeID": 200
}