{
    "IsRecentlyVerified": false,
    "ID": 186312,
    "UUID": "4FE3EC75-A236-474E-B3BE-C78B683F342A",
    "DataProviderID": 29,
    "DataProvidersReference": "14364",
    "AddressInfo": {
        "ID": 186671,
        "Title": "Kuckumer Straße 61",
        "AddressLine1": "Kuckumer Straße 61",
        "Town": "Mönchenladbach",
        "Postcode": "41189",
        "CountryID": 87,
        "Latitude": 51.09344,
        "Longitude": 6.40674,
        "DistanceUnit": 0
    },
    "Connections": [
        {
            "ID": 298696,
            "ConnectionTypeID": 25,
            "StatusTypeID": 50,
            "LevelID": 2,
            "PowerKW": 22,
            "CurrentTypeID": 20
        },
        {
            "ID": 298697,
            "ConnectionTypeID": 25,
            "StatusTypeID": 50,
            "LevelID": 2,
            "PowerKW": 22,
            "CurrentTypeID": 20
        }
    ],
    "StatusTypeID": 50,
    "DateLastStatusUpdate": "2021-07-12T02:46:00Z",
    "MetadataValues": [
        {
            "ID": 18553,
            "MetadataFieldID": 4,
            "ItemValue": "Data from the German chargepoint registry provided by Bundesnetzagentur.de under the CC-BY 4.0 license"
        }
    ],
    "DataQualityLevel": 3,
    "DateCreated": "2021-07-12T02:46:00Z",
    "SubmissionStatusTypeID": 100
}