{
    "IsRecentlyVerified": false,
    "ID": 187118,
    "UUID": "23A03611-3A4B-4531-9B44-500DB74780F5",
    "DataProviderID": 29,
    "DataProvidersReference": "7732",
    "OperatorID": 45,
    "AddressInfo": {
        "ID": 187477,
        "Title": "Walther-Blohm-Str. 19-20",
        "AddressLine1": "Walther-Blohm-Str. 19-20",
        "Town": "Wenzendorf",
        "Postcode": "21279",
        "CountryID": 87,
        "Latitude": 53.3670984,
        "Longitude": 9.8027239,
        "DistanceUnit": 0
    },
    "Connections": [
        {
            "ID": 301268,
            "ConnectionTypeID": 25,
            "StatusTypeID": 50,
            "LevelID": 2,
            "PowerKW": 22,
            "CurrentTypeID": 20
        },
        {
            "ID": 301269,
            "ConnectionTypeID": 25,
            "StatusTypeID": 50,
            "LevelID": 2,
            "PowerKW": 22,
            "CurrentTypeID": 20
        }
    ],
    "StatusTypeID": 50,
    "DateLastStatusUpdate": "2021-07-12T02:51:00Z",
    "MetadataValues": [
        {
            "ID": 19358,
            "MetadataFieldID": 4,
            "ItemValue": "Data from the German chargepoint registry provided by Bundesnetzagentur.de under the CC-BY 4.0 license"
        }
    ],
    "DataQualityLevel": 3,
    "DateCreated": "2021-07-12T02:51:00Z",
    "SubmissionStatusTypeID": 100
}