{
    "IsRecentlyVerified": false,
    "ID": 167257,
    "UUID": "4CB51313-E29D-4A96-9D4B-B845BF6AC875",
    "DataProviderID": 1,
    "OperatorID": 1,
    "UsageTypeID": 4,
    "AddressInfo": {
        "ID": 167616,
        "Title": "25 Fernando Erregea kalea",
        "AddressLine1": "25 Fernando Erregea kalea",
        "Town": "Irun",
        "StateOrProvince": "Basque Country",
        "Postcode": "20301",
        "CountryID": 210,
        "Latitude": 43.33832610335219,
        "Longitude": -1.807901824125679,
        "DistanceUnit": 0
    },
    "Connections": [
        {
            "ID": 253287,
            "ConnectionTypeID": 33,
            "StatusTypeID": 100,
            "LevelID": 3,
            "PowerKW": 50,
            "CurrentTypeID": 30,
            "Quantity": 1
        }
    ],
    "NumberOfPoints": 1,
    "StatusTypeID": 50,
    "DateLastStatusUpdate": "2021-05-07T20:51:00Z",
    "DataQualityLevel": 1,
    "DateCreated": "2020-09-03T08:28:00Z",
    "SubmissionStatusTypeID": 200
}