{
    "IsRecentlyVerified": false,
    "ID": 185574,
    "UUID": "5B413A1A-0836-41C4-BD7E-B83D106DCC39",
    "DataProviderID": 1,
    "OperatorID": 3,
    "UsageTypeID": 4,
    "UsageCost": "27p per kWh",
    "AddressInfo": {
        "ID": 185933,
        "Title": "Tesco Eston",
        "AddressLine1": "Tesco Eston",
        "Town": "Lackenby",
        "StateOrProvince": "England",
        "Postcode": "TS6 6TD",
        "CountryID": 1,
        "Latitude": 54.57359875486651,
        "Longitude": -1.1641300951620224,
        "DistanceUnit": 0
    },
    "Connections": [
        {
            "ID": 295205,
            "ConnectionTypeID": 33,
            "Reference": "NANA-JUNE",
            "StatusTypeID": 50,
            "LevelID": 3,
            "PowerKW": 50,
            "CurrentTypeID": 30,
            "Quantity": 1
        },
        {
            "ID": 295206,
            "ConnectionTypeID": 2,
            "Reference": "NANA-JUNE",
            "StatusTypeID": 50,
            "LevelID": 3,
            "PowerKW": 50,
            "CurrentTypeID": 30,
            "Quantity": 1
        }
    ],
    "NumberOfPoints": 2,
    "StatusTypeID": 50,
    "DateLastStatusUpdate": "2021-07-12T08:42:00Z",
    "DataQualityLevel": 1,
    "DateCreated": "2021-07-11T12:53:00Z",
    "SubmissionStatusTypeID": 200
}