{
    "IsRecentlyVerified": false,
    "ID": 154532,
    "UUID": "E2B74EAA-E1CC-46B6-9565-98C1D502F55E",
    "DataProviderID": 1,
    "OperatorID": 80,
    "UsageTypeID": 4,
    "AddressInfo": {
        "ID": 154885,
        "Title": "Madonna Pozzo Guacito  | EnelX",
        "AddressLine1": "Via delle Croci",
        "AddressLine2": "Madonna Pozzo Guacito ",
        "Town": "Fasano",
        "StateOrProvince": "BR",
        "Postcode": "72015",
        "CountryID": 112,
        "Latitude": 40.80713207233072,
        "Longitude": 17.450791579112092,
        "ContactTelephone1": "800.069.850",
        "RelatedURL": "https://www.enelx.com/it/it/emobility",
        "DistanceUnit": 0
    },
    "Connections": [
        {
            "ID": 217336,
            "ConnectionTypeID": 25,
            "StatusTypeID": 50,
            "LevelID": 2,
            "Amps": 32,
            "Voltage": 400,
            "PowerKW": 22,
            "CurrentTypeID": 20,
            "Quantity": 2
        }
    ],
    "NumberOfPoints": 2,
    "StatusTypeID": 50,
    "DateLastStatusUpdate": "2020-03-16T17:30:00Z",
    "DataQualityLevel": 1,
    "DateCreated": "2020-03-16T17:30:00Z",
    "SubmissionStatusTypeID": 200
}