{
    "IsRecentlyVerified": false,
    "ID": 159264,
    "UUID": "79ECBD73-F499-4F8C-ADBF-B4657EE77777",
    "DataProviderID": 2,
    "DataProvidersReference": "156055",
    "OperatorID": 5,
    "UsageTypeID": 1,
    "AddressInfo": {
        "ID": 159621,
        "Title": "FPB",
        "AddressLine1": "800 Louisville Rd",
        "Town": "Frankfort",
        "StateOrProvince": "KY",
        "Postcode": "40601",
        "CountryID": 2,
        "Latitude": 38.187145,
        "Longitude": -84.889336,
        "ContactTelephone1": "888-758-4389",
        "AccessComments": "24 hours daily",
        "RelatedURL": "http://www.chargepoint.com/",
        "DistanceUnit": 0
    },
    "Connections": [
        {
            "ID": 229400,
            "ConnectionTypeID": 1,
            "LevelID": 2,
            "Amps": 16,
            "Voltage": 230,
            "PowerKW": 3.7,
            "CurrentTypeID": 10,
            "Quantity": 2
        }
    ],
    "StatusTypeID": 50,
    "DateLastStatusUpdate": "2020-06-26T02:59:00Z",
    "DataQualityLevel": 3,
    "DateCreated": "2020-06-26T02:59:00Z",
    "SubmissionStatusTypeID": 100
}