{
    "IsRecentlyVerified": false,
    "ID": 120657,
    "UUID": "7FCB4747-8673-4E21-AD94-FB0795165B4D",
    "DataProviderID": 2,
    "DataProvidersReference": "39856",
    "UsageTypeID": 7,
    "AddressInfo": {
        "ID": 121003,
        "Title": "East Valley Nissan",
        "AddressLine1": "6354 E Test Dr",
        "Town": "Mesa",
        "StateOrProvince": "AZ",
        "Postcode": "85206",
        "CountryID": 2,
        "Latitude": 33.385361,
        "Longitude": -111.695062,
        "ContactTelephone1": "844-834-6297",
        "AccessComments": "Dealership business hours\r\nPublic - Call ahead",
        "RelatedURL": "",
        "DistanceUnit": 0
    },
    "Connections": [
        {
            "ID": 170021,
            "ConnectionTypeID": 1,
            "LevelID": 2,
            "Amps": 16,
            "Voltage": 230,
            "PowerKW": 3.7,
            "CurrentTypeID": 10,
            "Quantity": 1
        }
    ],
    "DateLastStatusUpdate": "2020-06-26T02:55:00Z",
    "DataQualityLevel": 3,
    "DateCreated": "2019-04-01T04:59:00Z",
    "SubmissionStatusTypeID": 100
}