{
    "IsRecentlyVerified": false,
    "ID": 139123,
    "UUID": "6A319276-6DFC-4266-BBC0-DB9F33E47D9F",
    "DataProviderID": 2,
    "DataProvidersReference": "95371",
    "OperatorID": 9,
    "UsageTypeID": 1,
    "AddressInfo": {
        "ID": 139475,
        "Title": "Fry's Store #121 Phoenix",
        "AddressLine1": "4025 E. Thunderbird",
        "Town": "Phoenix",
        "StateOrProvince": "AZ",
        "Postcode": "85032",
        "CountryID": 2,
        "Latitude": 33.611083,
        "Longitude": -111.994636,
        "ContactTelephone1": "888-998-2546",
        "AccessComments": "MON: 24 hours | TUE: 24 hours | WED: 24 hours | THU: 24 hours | FRI: 24 hours | SAT: 24 hours | SUN: 24 hours",
        "RelatedURL": "http://www.blinkcharging.com/",
        "DistanceUnit": 0
    },
    "Connections": [
        {
            "ID": 194386,
            "ConnectionTypeID": 1,
            "LevelID": 2,
            "Amps": 16,
            "Voltage": 230,
            "PowerKW": 3.7,
            "CurrentTypeID": 10,
            "Quantity": 2
        }
    ],
    "StatusTypeID": 50,
    "DateLastStatusUpdate": "2020-06-26T02:55:00Z",
    "DataQualityLevel": 3,
    "DateCreated": "2019-12-24T09:10:00Z",
    "SubmissionStatusTypeID": 100
}