{
    "IsRecentlyVerified": false,
    "ID": 141476,
    "UUID": "7B3A59C9-CDFC-4ABE-BF4B-82888E9D44F5",
    "DataProviderID": 2,
    "DataProvidersReference": "105344",
    "OperatorID": 5,
    "UsageTypeID": 1,
    "AddressInfo": {
        "ID": 141828,
        "Title": "JOHNSON COUNTY",
        "AddressLine1": "9875 W 87th St",
        "Town": "Overland Park",
        "StateOrProvince": "KS",
        "Postcode": "66212",
        "CountryID": 2,
        "Latitude": 38.970384,
        "Longitude": -94.6990754,
        "ContactTelephone1": "888-758-4389",
        "AccessComments": "24 hours daily",
        "RelatedURL": "http://www.chargepoint.com/",
        "DistanceUnit": 0
    },
    "Connections": [
        {
            "ID": 197411,
            "ConnectionTypeID": 1,
            "LevelID": 2,
            "Amps": 16,
            "Voltage": 230,
            "PowerKW": 3.7,
            "CurrentTypeID": 10,
            "Quantity": 2
        }
    ],
    "StatusTypeID": 50,
    "DateLastStatusUpdate": "2020-06-26T03:01:00Z",
    "DataQualityLevel": 3,
    "DateCreated": "2019-12-24T09:15:00Z",
    "SubmissionStatusTypeID": 100
}