{
    "IsRecentlyVerified": false,
    "ID": 110500,
    "UUID": "718894A2-14A6-4DC7-9C3A-4067DA321152",
    "DataProviderID": 2,
    "DataProvidersReference": "98975",
    "OperatorID": 59,
    "UsageTypeID": 1,
    "AddressInfo": {
        "ID": 110846,
        "Title": "Greenlots - 63025",
        "AddressLine1": "1850 E 151st Street",
        "Town": "Indianapolis",
        "StateOrProvince": "IN",
        "Postcode": "46236",
        "CountryID": 2,
        "Latitude": 40.0079879760742,
        "Longitude": -86.1252670288086,
        "ContactTelephone1": "855-900-7584",
        "AccessComments": "24 hours daily",
        "RelatedURL": "http://greenlots.com/",
        "DistanceUnit": 0
    },
    "Connections": [
        {
            "ID": 155756,
            "ConnectionTypeID": 2,
            "LevelID": 2,
            "Amps": 100,
            "Voltage": 400,
            "PowerKW": 40,
            "CurrentTypeID": 10,
            "Quantity": 1
        },
        {
            "ID": 155757,
            "ConnectionTypeID": 32,
            "LevelID": 2,
            "Amps": 100,
            "Voltage": 400,
            "PowerKW": 40,
            "CurrentTypeID": 10,
            "Quantity": 1
        }
    ],
    "DateLastStatusUpdate": "2019-04-06T05:04:00Z",
    "DataQualityLevel": 3,
    "DateCreated": "2018-10-18T23:36:00Z",
    "SubmissionStatusTypeID": 100
}