{
    "IsRecentlyVerified": false,
    "ID": 156909,
    "UUID": "4B541E5C-AB9C-426E-9366-5FA974EA0F95",
    "DataProviderID": 19,
    "DataProvidersReference": "3864",
    "AddressInfo": {
        "ID": 157263,
        "Title": "Kalvshällavägen",
        "AddressLine1": "Kalvshällavägen 8",
        "Town": "JÄRFÄLLA",
        "StateOrProvince": "STOCKHOLM",
        "Postcode": "17742",
        "CountryID": 216,
        "Latitude": 59.413455,
        "Longitude": 17.865337,
        "AccessComments": "Stora torget, barkarby",
        "DistanceUnit": 0
    },
    "Connections": [
        {
            "ID": 222994,
            "ConnectionTypeID": 25,
            "Reference": "1",
            "LevelID": 3,
            "Amps": 32,
            "Voltage": 400,
            "PowerKW": 22,
            "CurrentTypeID": 30,
            "Comments": "Mode 3"
        },
        {
            "ID": 222995,
            "ConnectionTypeID": 25,
            "Reference": "2",
            "LevelID": 3,
            "Amps": 32,
            "Voltage": 400,
            "PowerKW": 22,
            "CurrentTypeID": 30,
            "Comments": "Mode 3"
        }
    ],
    "NumberOfPoints": 2,
    "StatusTypeID": 0,
    "DateLastStatusUpdate": "2021-03-24T05:11:00Z",
    "DataQualityLevel": 2,
    "DateCreated": "2020-05-26T08:23:00Z",
    "SubmissionStatusTypeID": 100
}