{
    "IsRecentlyVerified": false,
    "ID": 142853,
    "UUID": "02DCAC13-4449-474C-80BF-F8AB1552F49A",
    "DataProviderID": 2,
    "DataProvidersReference": "72465",
    "OperatorID": 5,
    "UsageTypeID": 1,
    "AddressInfo": {
        "ID": 143205,
        "Title": "NATIONAL GRID",
        "AddressLine1": "285 Edith St",
        "Town": "Providence",
        "StateOrProvince": "RI",
        "Postcode": "02908",
        "CountryID": 2,
        "Latitude": 41.8299687,
        "Longitude": -71.4202237,
        "ContactTelephone1": "888-758-4389",
        "AccessComments": "24 hours daily",
        "RelatedURL": "http://www.chargepoint.com/",
        "DistanceUnit": 0
    },
    "Connections": [
        {
            "ID": 199080,
            "ConnectionTypeID": 1,
            "LevelID": 2,
            "Amps": 16,
            "Voltage": 230,
            "PowerKW": 3.7,
            "CurrentTypeID": 10,
            "Quantity": 2
        }
    ],
    "StatusTypeID": 50,
    "DateLastStatusUpdate": "2020-06-26T03:05:00Z",
    "DataQualityLevel": 3,
    "DateCreated": "2019-12-24T09:19:00Z",
    "SubmissionStatusTypeID": 100
}