{
    "IsRecentlyVerified": false,
    "ID": 84211,
    "UUID": "69BF36AE-E117-45D4-9A3C-DC2ADEF74C67",
    "DataProviderID": 1,
    "OperatorID": 23,
    "OperatorsReference": "24756",
    "UsageTypeID": 6,
    "AddressInfo": {
        "ID": 84557,
        "Title": "Hotel Adula",
        "AddressLine1": "3 Via Sorts Sut",
        "Town": "Flims Waldhaus",
        "Postcode": "7018",
        "CountryID": 217,
        "Latitude": 46.828082,
        "Longitude": 9.289914,
        "ContactTelephone1": "+41 81 928 28 28",
        "DistanceUnit": 0
    },
    "Connections": [
        {
            "ID": 119612,
            "ConnectionTypeID": 30,
            "StatusTypeID": 50,
            "LevelID": 2,
            "Amps": 32,
            "Voltage": 400,
            "PowerKW": 22,
            "CurrentTypeID": 20,
            "Quantity": 2
        }
    ],
    "NumberOfPoints": 2,
    "GeneralComments": "2 Tesla Connectors, up to 22kW.Available for patrons only. Please see front desk.",
    "StatusTypeID": 50,
    "DateLastStatusUpdate": "2018-10-03T20:48:00Z",
    "DataQualityLevel": 1,
    "DateCreated": "2017-02-16T17:15:00Z",
    "SubmissionStatusTypeID": 200
}