{
    "IsRecentlyVerified": false,
    "ID": 31946,
    "UUID": "481C7990-F215-4C95-B523-13BA0BC35668",
    "DataProviderID": 26,
    "DataProvidersReference": "30324",
    "OperatorID": 86,
    "OperatorsReference": "EnWB Sonatenweg",
    "UsageCost": "0.00 afhankelijk van pas",
    "AddressInfo": {
        "ID": 32292,
        "Title": "Sonatenweg 3",
        "AddressLine1": "Sonatenweg 3",
        "Town": "Stuttgart",
        "Postcode": "70439",
        "CountryID": 87,
        "Latitude": 48.84882,
        "Longitude": 9.1634,
        "ContactTelephone1": "0800 3629-000",
        "ContactEmail": "-",
        "RelatedURL": "http://www.enbw.com/",
        "DistanceUnit": 0
    },
    "Connections": [
        {
            "ID": 35457,
            "ConnectionTypeID": 25,
            "LevelID": 2,
            "PowerKW": 5,
            "CurrentTypeID": 10
        }
    ],
    "NumberOfPoints": 1,
    "StatusTypeID": 50,
    "DateLastStatusUpdate": "2015-01-09T06:03:00Z",
    "DataQualityLevel": 3,
    "DateCreated": "2015-01-09T06:03:00Z",
    "SubmissionStatusTypeID": 100
}