{
    "IsRecentlyVerified": false,
    "ID": 154541,
    "UUID": "D2ACA97C-6162-4093-8000-D867E4DF8EF3",
    "DataProviderID": 1,
    "OperatorID": 45,
    "UsageTypeID": 1,
    "UsageCost": "Free",
    "AddressInfo": {
        "ID": 154894,
        "Title": "Penny Pallady",
        "AddressLine1": "Penny",
        "Town": "Bucharest",
        "StateOrProvince": "",
        "Postcode": "032551",
        "CountryID": 184,
        "Latitude": 44.41026205731865,
        "Longitude": 26.18179166457321,
        "DistanceUnit": 0
    },
    "Connections": [
        {
            "ID": 217352,
            "ConnectionTypeID": 2,
            "StatusTypeID": 50,
            "LevelID": 3,
            "PowerKW": 50,
            "CurrentTypeID": 30,
            "Quantity": 1
        },
        {
            "ID": 217353,
            "ConnectionTypeID": 1036,
            "StatusTypeID": 50,
            "LevelID": 2,
            "Amps": 63,
            "Voltage": 400,
            "PowerKW": 22,
            "CurrentTypeID": 20,
            "Quantity": 1
        },
        {
            "ID": 217354,
            "ConnectionTypeID": 33,
            "StatusTypeID": 50,
            "LevelID": 3,
            "PowerKW": 50,
            "CurrentTypeID": 30,
            "Quantity": 1
        }
    ],
    "NumberOfPoints": 2,
    "StatusTypeID": 50,
    "DateLastStatusUpdate": "2021-06-21T12:06:00Z",
    "DataQualityLevel": 1,
    "DateCreated": "2020-03-17T03:49:00Z",
    "SubmissionStatusTypeID": 200
}