{
    "IsRecentlyVerified": false,
    "ID": 158650,
    "UUID": "8346B7C2-54A9-46AB-BFAA-BFDDBD143B97",
    "DataProviderID": 2,
    "DataProvidersReference": "152916",
    "OperatorID": 89,
    "UsageTypeID": 1,
    "AddressInfo": {
        "ID": 159007,
        "Title": "8923 S Western Ave",
        "AddressLine1": "8923 S Western Ave",
        "Town": "Los Angeles",
        "StateOrProvince": "CA",
        "Postcode": "90047",
        "CountryID": 2,
        "Latitude": 33.95589011,
        "Longitude": -118.3091309,
        "ContactTelephone1": "888-356-8911",
        "AccessComments": "24 hours daily",
        "RelatedURL": "https://flo.ca/",
        "DistanceUnit": 0
    },
    "Connections": [
        {
            "ID": 228668,
            "ConnectionTypeID": 1,
            "LevelID": 2,
            "Amps": 16,
            "Voltage": 230,
            "PowerKW": 3.7,
            "CurrentTypeID": 10,
            "Quantity": 1
        }
    ],
    "StatusTypeID": 50,
    "DateLastStatusUpdate": "2020-06-26T02:56:00Z",
    "DataQualityLevel": 3,
    "DateCreated": "2020-06-26T02:56:00Z",
    "SubmissionStatusTypeID": 100
}