{
    "IsRecentlyVerified": false,
    "ID": 138885,
    "UUID": "A4019519-53E5-4316-B31C-076D9DDC51E5",
    "DataProviderID": 2,
    "DataProvidersReference": "115846",
    "OperatorID": 23,
    "UsageTypeID": 1,
    "AddressInfo": {
        "ID": 139237,
        "Title": "Hampton Inn & Suites Dallas / The Colony - Tesla Destination",
        "AddressLine1": "3650 Plano Pkwy",
        "Town": "The Colony",
        "StateOrProvince": "TX",
        "Postcode": "75056",
        "CountryID": 2,
        "Latitude": 33.069641,
        "Longitude": -96.868844,
        "ContactTelephone1": "469-362-1111  877-798-3752",
        "AccessComments": "24 hours daily",
        "RelatedURL": "https://www.tesla.com/destination-charging",
        "DistanceUnit": 0
    },
    "Connections": [
        {
            "ID": 194110,
            "ConnectionTypeID": 30,
            "LevelID": 2,
            "Amps": 16,
            "Voltage": 230,
            "PowerKW": 3.7,
            "CurrentTypeID": 10,
            "Quantity": 3
        }
    ],
    "StatusTypeID": 50,
    "DateLastStatusUpdate": "2020-06-26T02:55:00Z",
    "DataQualityLevel": 3,
    "DateCreated": "2019-12-24T09:09:00Z",
    "SubmissionStatusTypeID": 100
}