{
    "IsRecentlyVerified": false,
    "ID": 79206,
    "UUID": "BB1BABF7-7BD5-4AFC-A90F-0C6514E5B465",
    "DataProviderID": 1,
    "OperatorID": 23,
    "OperatorsReference": "23418",
    "UsageTypeID": 6,
    "UsageCost": "Free",
    "AddressInfo": {
        "ID": 79552,
        "Title": "Alpin Spa Hotel Tirol",
        "AddressLine1": "77 Dorfstrasse",
        "Town": "Ischgl",
        "Postcode": "6561",
        "CountryID": 19,
        "Latitude": 47.009195,
        "Longitude": 10.28846,
        "ContactTelephone1": "+43 5444 5216",
        "DistanceUnit": 0
    },
    "Connections": [
        {
            "ID": 113825,
            "ConnectionTypeID": 30,
            "StatusTypeID": 50,
            "LevelID": 2,
            "Amps": 16,
            "Voltage": 400,
            "PowerKW": 11,
            "CurrentTypeID": 20,
            "Quantity": 1
        }
    ],
    "NumberOfPoints": 1,
    "GeneralComments": "1 Tesla Connector, up to 11kW.Available for patrons only. Please see front desk.",
    "StatusTypeID": 50,
    "DateLastStatusUpdate": "2018-10-03T17:31:00Z",
    "DataQualityLevel": 1,
    "DateCreated": "2017-01-26T21:06:00Z",
    "SubmissionStatusTypeID": 200
}