{
    "IsRecentlyVerified": false,
    "ID": 92518,
    "UUID": "B9AC940E-A52B-4793-9A0C-9EF4D0059F2E",
    "DataProviderID": 1,
    "OperatorID": 23,
    "OperatorsReference": "33662",
    "UsageTypeID": 4,
    "AddressInfo": {
        "ID": 92864,
        "Title": "Pernilla Wiberg Hotel",
        "AddressLine1": "Gränjesvålen",
        "Town": "Idre",
        "Postcode": "79091",
        "CountryID": 216,
        "Latitude": 61.887069,
        "Longitude": 12.83647,
        "ContactTelephone1": "+46 25 34 00 00",
        "DistanceUnit": 0
    },
    "Connections": [
        {
            "ID": 131119,
            "ConnectionTypeID": 30,
            "StatusTypeID": 50,
            "LevelID": 2,
            "Amps": 32,
            "Voltage": 400,
            "PowerKW": 22,
            "CurrentTypeID": 20,
            "Quantity": 4
        }
    ],
    "NumberOfPoints": 4,
    "GeneralComments": "4 Tesla Connectors, up to 22kW.Available to the public. Self park.",
    "StatusTypeID": 50,
    "DateLastStatusUpdate": "2018-10-03T14:38:00Z",
    "DataQualityLevel": 1,
    "DateCreated": "2017-09-07T05:55:00Z",
    "SubmissionStatusTypeID": 200
}