{
    "IsRecentlyVerified": false,
    "ID": 111364,
    "UUID": "196763E8-7E7F-4024-AFC0-1B0C7D263053",
    "DataProviderID": 2,
    "DataProvidersReference": "82985",
    "UsageTypeID": 2,
    "AddressInfo": {
        "ID": 111710,
        "Title": "Services de distribution IKEA",
        "AddressLine1": "5405 Place de la Couronne",
        "Town": "Brossard",
        "StateOrProvince": "QC",
        "Postcode": "J4Z 3R9",
        "CountryID": 44,
        "Latitude": 45.4529022115488,
        "Longitude": -73.4190189312134,
        "ContactTelephone1": "",
        "AccessComments": "24 hours daily; for fleet use only",
        "RelatedURL": "",
        "DistanceUnit": 0
    },
    "Connections": [
        {
            "ID": 156776,
            "ConnectionTypeID": 1,
            "LevelID": 2,
            "Amps": 16,
            "Voltage": 230,
            "PowerKW": 3.7,
            "CurrentTypeID": 10,
            "Quantity": 1
        }
    ],
    "DateLastStatusUpdate": "2020-06-26T03:09:00Z",
    "DataQualityLevel": 3,
    "DateCreated": "2018-10-18T23:37:00Z",
    "SubmissionStatusTypeID": 100
}