{
    "IsRecentlyVerified": false,
    "ID": 62966,
    "UUID": "3C27E692-2516-456A-B34B-D07D203DB7ED",
    "DataProviderID": 26,
    "DataProvidersReference": "70675",
    "OperatorID": 73,
    "OperatorsReference": "EV-Box EVB-P1447024",
    "UsageCost": "0.00 jaarabonnement",
    "AddressInfo": {
        "ID": 63312,
        "Title": "Heereveldseweg 68",
        "AddressLine1": "Heereveldseweg 68",
        "Town": "Gemert-Bakel",
        "Postcode": "5423 VM",
        "CountryID": 159,
        "Latitude": 51.58539,
        "Longitude": 5.72873,
        "RelatedURL": "http://www.ev-box.nl",
        "DistanceUnit": 0
    },
    "Connections": [
        {
            "ID": 80052,
            "ConnectionTypeID": 25,
            "LevelID": 2,
            "PowerKW": 11,
            "CurrentTypeID": 10
        }
    ],
    "NumberOfPoints": 1,
    "StatusTypeID": 50,
    "DateLastStatusUpdate": "2016-06-04T02:39:00Z",
    "DataQualityLevel": 3,
    "DateCreated": "2016-03-03T12:29:00Z",
    "SubmissionStatusTypeID": 100
}