{
    "IsRecentlyVerified": false,
    "ID": 107550,
    "UUID": "EB41BF99-4F33-4A6B-8A4A-44256AD6514A",
    "DataProviderID": 1,
    "OperatorID": 229,
    "UsageTypeID": 4,
    "UsageCost": "$0.25/kWh + $0.25/min",
    "AddressInfo": {
        "ID": 107896,
        "Title": "Corner Waimarino Tokaanu Road",
        "AddressLine1": "State Highway 4",
        "Town": "National Park",
        "Postcode": "3948",
        "CountryID": 161,
        "Latitude": -39.177219,
        "Longitude": 175.402184,
        "DistanceUnit": 0
    },
    "Connections": [
        {
            "ID": 151762,
            "ConnectionTypeID": 2,
            "StatusTypeID": 50,
            "LevelID": 3,
            "PowerKW": 50,
            "CurrentTypeID": 30,
            "Quantity": 1
        },
        {
            "ID": 151763,
            "ConnectionTypeID": 33,
            "StatusTypeID": 50,
            "LevelID": 3,
            "PowerKW": 50,
            "CurrentTypeID": 30,
            "Quantity": 1
        }
    ],
    "NumberOfPoints": 1,
    "StatusTypeID": 50,
    "DateLastStatusUpdate": "2018-08-01T20:13:00Z",
    "DataQualityLevel": 1,
    "DateCreated": "2018-08-01T13:01:00Z",
    "SubmissionStatusTypeID": 200
}