{
    "IsRecentlyVerified": true,
    "DateLastVerified": "2021-10-19T23:05:00Z",
    "ID": 189621,
    "UUID": "20BE609D-91AA-4271-9C12-4DB6534D212D",
    "DataProviderID": 1,
    "OperatorID": 1,
    "UsageTypeID": 4,
    "AddressInfo": {
        "ID": 189980,
        "Title": "Centra UCD",
        "AddressLine1": "Centra UCD",
        "Town": "Goatstown",
        "StateOrProvince": "",
        "Postcode": "D04",
        "CountryID": 3,
        "Latitude": 53.30439165224874,
        "Longitude": -6.217817226118683,
        "DistanceUnit": 0
    },
    "Connections": [
        {
            "ID": 306751,
            "ConnectionTypeID": 25,
            "StatusTypeID": 50,
            "LevelID": 2,
            "PowerKW": 11,
            "Quantity": 2
        }
    ],
    "NumberOfPoints": 2,
    "StatusTypeID": 50,
    "DateLastStatusUpdate": "2021-10-19T23:05:00Z",
    "DataQualityLevel": 1,
    "DateCreated": "2021-10-19T23:05:00Z",
    "SubmissionStatusTypeID": 200
}