{
    "IsRecentlyVerified": false,
    "ID": 123079,
    "UUID": "A8486DC1-747C-4E6C-9B1E-B2D065CA7224",
    "DataProviderID": 2,
    "DataProvidersReference": "94872",
    "OperatorID": 3372,
    "UsageTypeID": 7,
    "AddressInfo": {
        "ID": 123425,
        "Title": "Hampton Inn",
        "AddressLine1": "11820 N I-35 Service Rd",
        "Town": "Oklahoma City",
        "StateOrProvince": "OK",
        "Postcode": "73131",
        "CountryID": 2,
        "Latitude": 35.590478,
        "Longitude": -97.433864,
        "ContactTelephone1": "866-816-7584",
        "AccessComments": "24 hours daily; for hotel guest use only\r\nPublic - Call ahead",
        "RelatedURL": "http://evconnect.com/",
        "DistanceUnit": 0
    },
    "Connections": [
        {
            "ID": 173016,
            "ConnectionTypeID": 1,
            "LevelID": 2,
            "Amps": 16,
            "Voltage": 230,
            "PowerKW": 3.7,
            "CurrentTypeID": 10,
            "Quantity": 2
        }
    ],
    "DateLastStatusUpdate": "2020-06-26T02:58:00Z",
    "DataQualityLevel": 3,
    "DateCreated": "2019-04-06T05:03:00Z",
    "SubmissionStatusTypeID": 100
}