{
    "IsRecentlyVerified": false,
    "ID": 46472,
    "UUID": "B754544D-29A2-48D2-9B55-D8E0AB3071D4",
    "DataProviderID": 1,
    "DataProvidersReference": "816",
    "AddressInfo": {
        "ID": 46818,
        "Title": "Løvåsen sykehjem",
        "AddressLine1": "Løvåsveien 26",
        "Town": "FYLLINGSDALEN",
        "StateOrProvince": "Vestland",
        "Postcode": "5145",
        "CountryID": 168,
        "Latitude": 60.35654,
        "Longitude": 5.28783,
        "AccessComments": "Innerst forbi hovedinngangen. Ved HC-parkering.",
        "DistanceUnit": 0
    },
    "Connections": [
        {
            "ID": 57135,
            "ConnectionTypeID": 0,
            "Reference": "1",
            "LevelID": 2,
            "Amps": 16,
            "Voltage": 230,
            "PowerKW": 3.7,
            "Comments": "Mode 1"
        },
        {
            "ID": 88985,
            "ConnectionTypeID": 0,
            "Reference": "2",
            "LevelID": 2,
            "Amps": 16,
            "Voltage": 230,
            "PowerKW": 3.7,
            "Comments": "Mode 1"
        }
    ],
    "NumberOfPoints": 2,
    "DateLastStatusUpdate": "2020-05-26T08:24:00Z",
    "DataQualityLevel": 2,
    "DateCreated": "2015-05-03T00:54:00Z",
    "SubmissionStatusTypeID": 100
}