{
    "IsRecentlyVerified": true,
    "DateLastVerified": "2021-09-12T16:52:00Z",
    "ID": 189199,
    "UUID": "AFD44A2C-3DAF-4D96-9CAA-1402C44470C8",
    "DataProviderID": 1,
    "OperatorID": 1,
    "UsageTypeID": 4,
    "AddressInfo": {
        "ID": 189558,
        "Title": "Avenida de la Libertad",
        "AddressLine1": "Avenida de la Libertad",
        "Town": "Castro-Urdiales",
        "StateOrProvince": "Cantabria",
        "Postcode": "39700",
        "CountryID": 210,
        "Latitude": 43.381466229732695,
        "Longitude": -3.22502981546063,
        "DistanceUnit": 0
    },
    "Connections": [
        {
            "ID": 305891,
            "ConnectionTypeID": 0,
            "StatusTypeID": 50,
            "Quantity": 1
        }
    ],
    "NumberOfPoints": 1,
    "StatusTypeID": 100,
    "DateLastStatusUpdate": "2021-09-13T22:26:00Z",
    "DataQualityLevel": 1,
    "DateCreated": "2021-09-12T16:52:00Z",
    "SubmissionStatusTypeID": 200
}