{
    "IsRecentlyVerified": false,
    "ID": 17735,
    "UUID": "5B9CF987-9AB1-4A02-B5E9-2FA1EEE67E4F",
    "DataProviderID": 22,
    "DataProvidersReference": "106D6A60386B448F80D401758C203F54",
    "AddressInfo": {
        "ID": 18080,
        "Title": "町田市役所中町第３庁舎",
        "AddressLine1": "東京都町田市中町1-4-2",
        "CountryID": 114,
        "Latitude": 35.54716337,
        "Longitude": 139.4446901,
        "ContactTelephone1": "0120-335-737　",
        "DistanceUnit": 0
    },
    "Connections": [
        {
            "ID": 17976,
            "ConnectionTypeID": 2,
            "LevelID": 2,
            "Amps": 100,
            "Voltage": 480,
            "PowerKW": 48,
            "Quantity": 1
        }
    ],
    "DateLastStatusUpdate": "2013-06-29T09:02:00Z",
    "DataQualityLevel": 2,
    "DateCreated": "2013-06-29T09:02:00Z",
    "SubmissionStatusTypeID": 200
}