{
    "IsRecentlyVerified": false,
    "ID": 132599,
    "UUID": "C07777DF-6DC5-4437-BC96-9156E02E70F8",
    "DataProviderID": 1,
    "OperatorID": 80,
    "UsageTypeID": 4,
    "AddressInfo": {
        "ID": 132945,
        "Title": "Piazza di Chirignago | EnelX",
        "AddressLine1": "Via Risorgimento",
        "AddressLine2": "Chirignago-Zelarino",
        "Town": "Venezia",
        "StateOrProvince": "VE",
        "Postcode": "30174",
        "CountryID": 112,
        "Latitude": 45.4849826913889,
        "Longitude": 12.1883491426627,
        "ContactTelephone1": "800.069.850",
        "RelatedURL": "https://www.enelx.com/it/it/emobility",
        "DistanceUnit": 0
    },
    "Connections": [
        {
            "ID": 185630,
            "ConnectionTypeID": 25,
            "StatusTypeID": 150,
            "LevelID": 2,
            "Amps": 32,
            "Voltage": 400,
            "PowerKW": 22,
            "CurrentTypeID": 20,
            "Quantity": 4
        }
    ],
    "NumberOfPoints": 4,
    "StatusTypeID": 150,
    "DateLastStatusUpdate": "2019-10-03T10:06:00Z",
    "DataQualityLevel": 1,
    "DateCreated": "2019-10-03T10:04:00Z",
    "SubmissionStatusTypeID": 200
}