{
    "IsRecentlyVerified": false,
    "ID": 184501,
    "UUID": "4E7A5F38-6213-4C90-A49C-BAAC48E29DF1",
    "DataProviderID": 29,
    "DataProvidersReference": "19763",
    "OperatorID": 172,
    "AddressInfo": {
        "ID": 184860,
        "Title": "Heinrich-Sturm-Str 3",
        "AddressLine1": "Heinrich-Sturm-Str 3",
        "Town": "Mönchengladbach",
        "Postcode": "41065",
        "CountryID": 87,
        "Latitude": 51.195946,
        "Longitude": 6.448572,
        "DistanceUnit": 0
    },
    "Connections": [
        {
            "ID": 292863,
            "ConnectionTypeID": 25,
            "StatusTypeID": 50,
            "LevelID": 2,
            "PowerKW": 22,
            "CurrentTypeID": 20
        },
        {
            "ID": 298891,
            "ConnectionTypeID": 25,
            "StatusTypeID": 50,
            "LevelID": 2,
            "PowerKW": 22,
            "CurrentTypeID": 20
        }
    ],
    "StatusTypeID": 50,
    "DateLastStatusUpdate": "2021-07-12T02:46:00Z",
    "MetadataValues": [
        {
            "ID": 16792,
            "MetadataFieldID": 4,
            "ItemValue": "Data from the German chargepoint registry provided by Bundesnetzagentur.de under the CC-BY 4.0 license"
        }
    ],
    "DataQualityLevel": 3,
    "DateCreated": "2021-07-08T10:05:00Z",
    "SubmissionStatusTypeID": 100
}