{
    "IsRecentlyVerified": false,
    "ID": 56789,
    "UUID": "250115E4-211A-495D-8DC7-D8F3B5030195",
    "DataProviderID": 1,
    "OperatorID": 80,
    "UsageTypeID": 4,
    "UsageCost": "0,40 €/kW",
    "AddressInfo": {
        "ID": 57135,
        "Title": "Eneldrive Santa Maria degli Angeli",
        "AddressLine1": "Via Los Angeles",
        "AddressLine2": "frazione Santa Maria degli Angeli",
        "Town": "Assisi",
        "StateOrProvince": "PG",
        "Postcode": "06081",
        "CountryID": 112,
        "Latitude": 43.0565493899478,
        "Longitude": 12.5777367050091,
        "RelatedURL": "http://eneldrive.it",
        "DistanceUnit": 0
    },
    "Connections": [
        {
            "ID": 71639,
            "ConnectionTypeID": 25,
            "StatusTypeID": 50,
            "LevelID": 2,
            "Amps": 32,
            "Voltage": 400,
            "PowerKW": 22,
            "CurrentTypeID": 20,
            "Quantity": 1
        },
        {
            "ID": 71640,
            "ConnectionTypeID": 36,
            "StatusTypeID": 50,
            "LevelID": 2,
            "Amps": 16,
            "Voltage": 240,
            "PowerKW": 3.7,
            "CurrentTypeID": 10,
            "Quantity": 1
        }
    ],
    "NumberOfPoints": 1,
    "GeneralComments": "Attenzione - non accessibile durante il periodo dei Mercatini di Natale",
    "StatusTypeID": 50,
    "DateLastStatusUpdate": "2016-06-03T17:11:00Z",
    "DataQualityLevel": 1,
    "DateCreated": "2015-11-09T14:41:00Z",
    "SubmissionStatusTypeID": 200
}