{
    "IsRecentlyVerified": false,
    "ID": 50799,
    "UUID": "D8E1813D-DF87-4F82-A745-2A229600E260",
    "DataProviderID": 26,
    "DataProvidersReference": "65250",
    "OperatorID": 103,
    "OperatorsReference": "Allego NLALLEGO0002832",
    "UsageCost": "0.00 jaarabonnement",
    "AddressInfo": {
        "ID": 51145,
        "Title": "Sweerts de Landasstraat 83",
        "AddressLine1": "Sweerts de Landasstraat 83",
        "Town": "Arnhem",
        "Postcode": "6814 DC",
        "CountryID": 159,
        "Latitude": 51.9862,
        "Longitude": 5.90179,
        "ContactTelephone1": "0800-3745337",
        "RelatedURL": "http://www.allego.eu/",
        "DistanceUnit": 0
    },
    "Connections": [
        {
            "ID": 62679,
            "ConnectionTypeID": 25,
            "LevelID": 2,
            "PowerKW": 11,
            "CurrentTypeID": 10
        },
        {
            "ID": 62680,
            "ConnectionTypeID": 25,
            "LevelID": 2,
            "PowerKW": 11,
            "CurrentTypeID": 10
        }
    ],
    "NumberOfPoints": 1,
    "StatusTypeID": 50,
    "DateLastStatusUpdate": "2016-06-04T02:43:00Z",
    "DataQualityLevel": 3,
    "DateCreated": "2015-07-22T09:53:00Z",
    "SubmissionStatusTypeID": 100
}