{
    "IsRecentlyVerified": false,
    "ID": 139988,
    "UUID": "FD908147-2396-408B-8480-F6A4FF3EB5AF",
    "DataProviderID": 2,
    "DataProvidersReference": "148777",
    "OperatorID": 39,
    "UsageTypeID": 1,
    "AddressInfo": {
        "ID": 140340,
        "Title": "Kaiser Panorama City |P420",
        "AddressLine1": "13652 Cantara Street",
        "Town": "Panorama City",
        "StateOrProvince": "CA",
        "Postcode": "91402",
        "CountryID": 2,
        "Latitude": 34.2187902,
        "Longitude": -118.4300562,
        "ContactTelephone1": "800-663-5633",
        "AccessComments": "MO: 12:00am-12:00am; TU: 12:00am-12:00am; WE: 12:00am-12:00am; TH: 12:00am-12:00am; FR: 12:00am-12:00am; SA: 12:00am-12:00am; SU: 12:00am-12:00am",
        "RelatedURL": "http://www.semacharge.com/",
        "DistanceUnit": 0
    },
    "Connections": [
        {
            "ID": 195500,
            "ConnectionTypeID": 1,
            "LevelID": 2,
            "Amps": 16,
            "Voltage": 230,
            "PowerKW": 3.7,
            "CurrentTypeID": 10,
            "Quantity": 11
        }
    ],
    "StatusTypeID": 50,
    "DateLastStatusUpdate": "2020-06-26T02:57:00Z",
    "DataQualityLevel": 3,
    "DateCreated": "2019-12-24T09:11:00Z",
    "SubmissionStatusTypeID": 100
}