{
    "UserComments": [
        {
            "ID": 8168,
            "ChargePointID": 18927,
            "CommentTypeID": 10,
            "UserName": "spannermann",
            "Comment": "Great idea poorly executed, 2 charge connections but only enough space for one vehicle when ice cars parked, needs 2 bays clearly marking out.. Apart from that a good effort.. ",
            "Rating": 4,
            "DateCreated": "2015-12-09T00:40:53.47Z",
            "User": {
                "ID": 6682,
                "Username": "spannermann"
            },
            "CheckinStatusTypeID": 10
        },
        {
            "ID": 1179,
            "ChargePointID": 18927,
            "CommentTypeID": 10,
            "UserName": "igsmith.orrery",
            "Comment": "Charged here once. In the entrance to Bedford College. Just wide enough for 2 bays.",
            "Rating": 5,
            "DateCreated": "2014-09-05T09:51:53.453Z",
            "User": {
                "ID": 1927,
                "Username": "igsmith.orrery"
            },
            "CheckinStatusTypeID": 10
        }
    ],
    "MediaItems": [
        {
            "ID": 1126,
            "ChargePointID": 18927,
            "ItemURL": "https://s3-ap-southeast-2.amazonaws.com/openchargemap/images/GB/OCM18927/OCM-18927.orig.2015032209522832.jpg",
            "ItemThumbnailURL": "https://s3-ap-southeast-2.amazonaws.com/openchargemap/images/GB/OCM18927/OCM-18927.thmb.2015032209522832.jpg",
            "Comment": "Worked fine, pulling 32a / 239v....not bad! \r\nQuite close to the town centre and free parking. \r\nA little tight for two cars side by side; one may have to mount the pavement; other than this Bedford College should be commended for installing the charger. ",
            "IsEnabled": true,
            "IsVideo": false,
            "IsFeaturedItem": false,
            "IsExternalResource": false,
            "User": {
                "ID": 4687,
                "Username": "kdc1870"
            },
            "DateCreated": "2015-03-22T09:53:00Z"
        }
    ],
    "IsRecentlyVerified": false,
    "ID": 18927,
    "UUID": "D22AFC57-B54A-4B74-89BA-03CE3010B076",
    "DataProviderID": 1,
    "OperatorID": 32,
    "OperatorsReference": "1823",
    "UsageTypeID": 4,
    "UsageCost": "Inclusive; for Polar Plus subscription members only",
    "AddressInfo": {
        "ID": 19272,
        "Title": "Bedford College",
        "AddressLine1": "Cauldwell St",
        "StateOrProvince": "Bedford",
        "Postcode": "MK42 9AH",
        "CountryID": 1,
        "Latitude": 52.13268,
        "Longitude": -0.467969,
        "DistanceUnit": 0
    },
    "Connections": [
        {
            "ID": 19182,
            "ConnectionTypeID": 25,
            "StatusTypeID": 50,
            "LevelID": 2,
            "Amps": 32,
            "Voltage": 230,
            "PowerKW": 7,
            "CurrentTypeID": 10,
            "Quantity": 2
        }
    ],
    "NumberOfPoints": 2,
    "GeneralComments": "Chargemaster post. Formerly on Source East.",
    "StatusTypeID": 50,
    "DateLastStatusUpdate": "2019-03-06T06:30:00Z",
    "DataQualityLevel": 3,
    "DateCreated": "2013-08-30T03:44:00Z",
    "SubmissionStatusTypeID": 200
}