{
    "IsRecentlyVerified": false,
    "ID": 154548,
    "UUID": "2C0FAB2C-B617-49F2-A59B-B8FF40EBBA72",
    "DataProviderID": 1,
    "OperatorID": 3,
    "OperatorsReference": "PG-70105,PG-84265",
    "UsageTypeID": 4,
    "UsageCost": "Free",
    "AddressInfo": {
        "ID": 154901,
        "Title": "Tesco Superstore-Honiton",
        "AddressLine1": "Battishorne Way",
        "Town": "Honiton",
        "Postcode": "EX14 2XD",
        "CountryID": 1,
        "Latitude": 50.790544,
        "Longitude": -3.202679,
        "DistanceUnit": 0
    },
    "Connections": [
        {
            "ID": 217365,
            "ConnectionTypeID": 25,
            "StatusTypeID": 50,
            "LevelID": 2,
            "Amps": 32,
            "Voltage": 230,
            "PowerKW": 7,
            "CurrentTypeID": 10,
            "Quantity": 4
        }
    ],
    "NumberOfPoints": 4,
    "GeneralComments": "This is an open charge unit installed at the Tesco super store at Battishorne Way, Honiton",
    "StatusTypeID": 50,
    "DateLastStatusUpdate": "2020-03-19T06:43:00Z",
    "DataQualityLevel": 1,
    "DateCreated": "2020-03-17T06:38:00Z",
    "SubmissionStatusTypeID": 200
}