{
    "IsRecentlyVerified": false,
    "ID": 8284,
    "UUID": "1F424E58-5033-4EC5-8156-F98F1491057F",
    "DataProviderID": 15,
    "DataProvidersReference": "9646",
    "OperatorID": 5,
    "AddressInfo": {
        "ID": 8181,
        "Title": "505 Pine Ave",
        "AddressLine1": "505 Pine Ave",
        "Town": "Anna Maria",
        "StateOrProvince": "Florida",
        "Postcode": "34216",
        "CountryID": 2,
        "Latitude": 27.53126907,
        "Longitude": -82.73311615,
        "ContactTelephone1": "941-275-2713",
        "RelatedURL": "http://carstations.com/9646",
        "DistanceUnit": 0
    },
    "Connections": [
        {
            "ID": 5713,
            "ConnectionTypeID": 1,
            "Reference": "J1772",
            "LevelID": 2
        },
        {
            "ID": 7835,
            "ConnectionTypeID": 9,
            "Reference": "NEMA5",
            "LevelID": 1,
            "Quantity": 1
        }
    ],
    "StatusTypeID": 0,
    "DateLastStatusUpdate": "2017-11-04T14:03:00Z",
    "DataQualityLevel": 1,
    "DateCreated": "2011-11-11T12:06:00Z",
    "SubmissionStatusTypeID": 100
}