{
    "UserComments": [
        {
            "ID": 3890,
            "ChargePointID": 32140,
            "CommentTypeID": 10,
            "UserName": "Hubert Savelberg",
            "Comment": "some apps mark it  being in use, while some other say it's free... would be nice if a phone number was provided to check...",
            "Rating": 3,
            "DateCreated": "2015-02-28T08:15:40.92Z",
            "User": {
                "ID": 4632,
                "Username": "Hubert Savelberg"
            },
            "CheckinStatusTypeID": 100
        },
        {
            "ID": 3889,
            "ChargePointID": 32140,
            "CommentTypeID": 10,
            "UserName": "Hubert Savelberg",
            "Rating": 3,
            "DateCreated": "2015-02-28T08:14:23.793Z",
            "User": {
                "ID": 4632,
                "Username": "Hubert Savelberg"
            },
            "CheckinStatusTypeID": 100
        }
    ],
    "MediaItems": [
        {
            "ID": 1038,
            "ChargePointID": 32140,
            "ItemURL": "https://s3-ap-southeast-2.amazonaws.com/openchargemap/images/NL/OCM32140/OCM-32140.orig.2015022808212869.jpg",
            "ItemThumbnailURL": "https://s3-ap-southeast-2.amazonaws.com/openchargemap/images/NL/OCM32140/OCM-32140.thmb.2015022808212869.jpg",
            "Comment": "",
            "IsEnabled": true,
            "IsVideo": false,
            "IsFeaturedItem": false,
            "IsExternalResource": false,
            "User": {
                "ID": 4632,
                "Username": "Hubert Savelberg"
            },
            "DateCreated": "2015-02-28T08:22:00Z"
        },
        {
            "ID": 1039,
            "ChargePointID": 32140,
            "ItemURL": "https://s3-ap-southeast-2.amazonaws.com/openchargemap/images/NL/OCM32140/OCM-32140.orig.2015022808215390.jpg",
            "ItemThumbnailURL": "https://s3-ap-southeast-2.amazonaws.com/openchargemap/images/NL/OCM32140/OCM-32140.thmb.2015022808215390.jpg",
            "Comment": "",
            "IsEnabled": true,
            "IsVideo": false,
            "IsFeaturedItem": false,
            "IsExternalResource": false,
            "User": {
                "ID": 4632,
                "Username": "Hubert Savelberg"
            },
            "DateCreated": "2015-02-28T08:22:00Z"
        },
        {
            "ID": 1037,
            "ChargePointID": 32140,
            "ItemURL": "https://s3-ap-southeast-2.amazonaws.com/openchargemap/images/NL/OCM32140/OCM-32140.orig.2015022808211235.jpg",
            "ItemThumbnailURL": "https://s3-ap-southeast-2.amazonaws.com/openchargemap/images/NL/OCM32140/OCM-32140.thmb.2015022808211235.jpg",
            "Comment": "",
            "IsEnabled": true,
            "IsVideo": false,
            "IsFeaturedItem": false,
            "IsExternalResource": false,
            "User": {
                "ID": 4632,
                "Username": "Hubert Savelberg"
            },
            "DateCreated": "2015-02-28T08:21:00Z"
        }
    ],
    "IsRecentlyVerified": false,
    "ID": 32140,
    "UUID": "E374721D-1543-43F0-AFB3-5F5BC5D80A53",
    "DataProviderID": 1,
    "OperatorID": 156,
    "OperatorsReference": "NewMotion ICUCOMPACT000001",
    "UsageTypeID": 1,
    "UsageCost": "0.00 jaarabonnement",
    "AddressInfo": {
        "ID": 32486,
        "Title": "Tiergartenstraße 28",
        "AddressLine1": "Tiergartenstraße 28",
        "Town": "Jünkerath",
        "Postcode": "54584",
        "CountryID": 87,
        "Latitude": 50.3459587097168,
        "Longitude": 6.58311700820923,
        "ContactTelephone1": "088 0109500",
        "RelatedURL": "http://thenewmotion.nl/",
        "DistanceUnit": 0
    },
    "Connections": [
        {
            "ID": 35651,
            "ConnectionTypeID": 25,
            "StatusTypeID": 50,
            "LevelID": 2,
            "Amps": 16,
            "Voltage": 240,
            "PowerKW": 11,
            "CurrentTypeID": 20,
            "Quantity": 1
        }
    ],
    "NumberOfPoints": 1,
    "GeneralComments": "0,30 € / kWh",
    "StatusTypeID": 50,
    "DateLastStatusUpdate": "2015-02-28T15:54:00Z",
    "DataQualityLevel": 3,
    "DateCreated": "2015-01-09T06:03:00Z",
    "SubmissionStatusTypeID": 100
}