{
    "IsRecentlyVerified": false,
    "ID": 184443,
    "UUID": "8294E7A9-541D-48E8-B337-5509EC34345D",
    "DataProviderID": 29,
    "DataProvidersReference": "9856",
    "AddressInfo": {
        "ID": 184802,
        "Title": "Hauptstraße 9",
        "AddressLine1": "Hauptstraße 9",
        "Town": "Heroldsbach",
        "Postcode": "91336",
        "CountryID": 87,
        "Latitude": 49.692019,
        "Longitude": 11.00026,
        "DistanceUnit": 0
    },
    "Connections": [
        {
            "ID": 292738,
            "ConnectionTypeID": 25,
            "StatusTypeID": 50,
            "LevelID": 2,
            "PowerKW": 22,
            "CurrentTypeID": 20
        },
        {
            "ID": 292739,
            "ConnectionTypeID": 25,
            "StatusTypeID": 50,
            "LevelID": 2,
            "PowerKW": 22,
            "CurrentTypeID": 20
        }
    ],
    "StatusTypeID": 50,
    "DateLastStatusUpdate": "2021-07-12T02:43:00Z",
    "MetadataValues": [
        {
            "ID": 16734,
            "MetadataFieldID": 4,
            "ItemValue": "Data from the German chargepoint registry provided by Bundesnetzagentur.de under the CC-BY 4.0 license"
        }
    ],
    "DataQualityLevel": 3,
    "DateCreated": "2021-07-08T10:05:00Z",
    "SubmissionStatusTypeID": 100
}