{
    "IsRecentlyVerified": false,
    "ID": 61052,
    "UUID": "E5548457-C4FF-4F22-AE76-ACDB9DE17A04",
    "DataProviderID": 27,
    "DataProvidersReference": "17",
    "UsageTypeID": 1,
    "AddressInfo": {
        "ID": 61398,
        "Title": "La Ballena Azul",
        "AddressLine1": "Avda. del Sol 20",
        "AddressLine2": "Pol. Industrial Las Monjas",
        "Town": "Torrejón de Ardoz",
        "StateOrProvince": "Madrid",
        "Postcode": "28850",
        "CountryID": 210,
        "Latitude": 40.449367,
        "Longitude": -3.482243,
        "ContactTelephone1": "+34 916763682",
        "ContactTelephone2": "+34 607233778",
        "ContactEmail": "laballenaazultorrejón@gmail.com",
        "DistanceUnit": 0
    },
    "Connections": [
        {
            "ID": 77583,
            "ConnectionTypeID": 28
        }
    ],
    "StatusTypeID": 0,
    "DateLastStatusUpdate": "2016-02-13T00:23:00Z",
    "DataQualityLevel": 3,
    "DateCreated": "2016-02-13T00:23:00Z",
    "SubmissionStatusTypeID": 200
}