{
    "IsRecentlyVerified": false,
    "ID": 176883,
    "UUID": "EEAEA3C8-EC77-4B09-B5F7-CC358FC1DCD2",
    "DataProviderID": 29,
    "DataProvidersReference": "14674",
    "AddressInfo": {
        "ID": 177242,
        "Title": "Schulstraße 2-20",
        "AddressLine1": "Schulstraße 2-20",
        "Town": "Walldorf",
        "Postcode": "69190",
        "CountryID": 87,
        "Latitude": 49.30237,
        "Longitude": 8.64363,
        "DistanceUnit": 0
    },
    "Connections": [
        {
            "ID": 275343,
            "ConnectionTypeID": 25,
            "StatusTypeID": 50,
            "LevelID": 2,
            "PowerKW": 22,
            "CurrentTypeID": 20
        },
        {
            "ID": 275344,
            "ConnectionTypeID": 25,
            "StatusTypeID": 50,
            "LevelID": 2,
            "PowerKW": 22,
            "CurrentTypeID": 20
        }
    ],
    "StatusTypeID": 0,
    "DateLastStatusUpdate": "2021-07-12T02:43:00Z",
    "MetadataValues": [
        {
            "ID": 9178,
            "MetadataFieldID": 4,
            "ItemValue": "Data from the German chargepoint registry provided by Bundesnetzagentur.de under the CC-BY 4.0 license"
        }
    ],
    "DataQualityLevel": 3,
    "DateCreated": "2021-07-08T09:48:00Z",
    "SubmissionStatusTypeID": 100
}