{
    "IsRecentlyVerified": false,
    "ID": 73628,
    "UUID": "7DAF7016-EA5A-4930-A303-7F2C74ECCA02",
    "DataProviderID": 1,
    "OperatorID": 89,
    "OperatorsReference": "CEA-014",
    "UsageTypeID": 4,
    "UsageCost": "CAD 2.50",
    "AddressInfo": {
        "ID": 73974,
        "Title": "CSRS-Centre du 24-Juin",
        "AddressLine1": "639 rue du 24-Juin",
        "Town": "Sherbrooke",
        "StateOrProvince": "QC",
        "Postcode": "J1E 1H1",
        "CountryID": 44,
        "Latitude": 45.422236,
        "Longitude": -71.876754,
        "DistanceUnit": 0
    },
    "Connections": [
        {
            "ID": 105924,
            "ConnectionTypeID": 1,
            "StatusTypeID": 50,
            "LevelID": 2,
            "Amps": 32,
            "Voltage": 230,
            "PowerKW": 7,
            "CurrentTypeID": 10,
            "Quantity": 1
        }
    ],
    "NumberOfPoints": 1,
    "StatusTypeID": 50,
    "DateLastStatusUpdate": "2017-01-24T09:52:00Z",
    "DataQualityLevel": 1,
    "DateCreated": "2016-11-23T22:28:00Z",
    "SubmissionStatusTypeID": 200
}