{
    "IsRecentlyVerified": false,
    "ID": 84675,
    "UUID": "598C5C6A-F6DE-4F25-8B50-2331B4F527DA",
    "DataProviderID": 1,
    "OperatorID": 1,
    "UsageTypeID": 1,
    "UsageCost": "gratis",
    "AddressInfo": {
        "ID": 85021,
        "Title": "Autostrada Ciclabile Guidi",
        "AddressLine1": "Via Dei Paladini",
        "Town": "Lucca",
        "StateOrProvince": "LU",
        "Postcode": "55060",
        "CountryID": 112,
        "Latitude": 43.842196281524636,
        "Longitude": 10.545120753974757,
        "RelatedURL": "http://www.comune.lucca.it/home",
        "DistanceUnit": 0
    },
    "Connections": [
        {
            "ID": 120281,
            "ConnectionTypeID": 36,
            "StatusTypeID": 50,
            "LevelID": 2,
            "Amps": 16,
            "Voltage": 240,
            "PowerKW": 3.5,
            "CurrentTypeID": 10,
            "Quantity": 2
        }
    ],
    "NumberOfPoints": 2,
    "StatusTypeID": 50,
    "DateLastStatusUpdate": "2017-03-08T11:08:00Z",
    "DataQualityLevel": 1,
    "DateCreated": "2017-03-08T11:08:00Z",
    "SubmissionStatusTypeID": 200
}