{
    "IsRecentlyVerified": false,
    "ID": 62360,
    "UUID": "A80B8A12-347A-424E-B422-98880F7E3D8A",
    "DataProviderID": 2,
    "DataProvidersReference": "72698",
    "OperatorID": 1242,
    "UsageTypeID": 1,
    "AddressInfo": {
        "ID": 62706,
        "Title": "163325G01001010000",
        "AddressLine1": "110  Avenue of the Pines",
        "Town": "Saratoga Springs",
        "StateOrProvince": "NY",
        "Postcode": "12866",
        "CountryID": 2,
        "Latitude": 43.0573481806,
        "Longitude": -73.8047257907,
        "ContactTelephone1": "855-443-3873",
        "AccessComments": "24 hours daily",
        "RelatedURL": "https://www.gewattstation.com",
        "DistanceUnit": 0
    },
    "Connections": [
        {
            "ID": 79265,
            "ConnectionTypeID": 1,
            "LevelID": 2,
            "Amps": 16,
            "Voltage": 230,
            "PowerKW": 3.7,
            "CurrentTypeID": 10,
            "Quantity": 1
        }
    ],
    "DateLastStatusUpdate": "2020-06-26T03:06:00Z",
    "DataQualityLevel": 3,
    "DateCreated": "2016-03-03T11:39:00Z",
    "SubmissionStatusTypeID": 100
}