{
    "MediaItems": [
        {
            "ID": 26723,
            "ChargePointID": 173013,
            "ItemURL": "https://s3-ap-southeast-2.amazonaws.com/openchargemap/images/PT/OCM173013/OCM-173013.orig.2021030116503461.jpg",
            "ItemThumbnailURL": "https://s3-ap-southeast-2.amazonaws.com/openchargemap/images/PT/OCM173013/OCM-173013.thmb.2021030116503461.jpg",
            "Comment": "",
            "IsEnabled": true,
            "IsVideo": false,
            "IsFeaturedItem": false,
            "IsExternalResource": false,
            "User": {
                "ID": 28510,
                "Username": "Filipe Esteves"
            },
            "DateCreated": "2021-03-01T16:51:00Z"
        }
    ],
    "IsRecentlyVerified": false,
    "ID": 173013,
    "UUID": "E8CA8A2A-DA56-49F1-9D2B-A3248EDB583F",
    "DataProviderID": 1,
    "OperatorID": 3431,
    "UsageTypeID": 4,
    "UsageCost": "0.18€ / kWh",
    "AddressInfo": {
        "ID": 173372,
        "Title": "Continente Bom Dia Queluz Paiva Couceiro",
        "AddressLine1": "Rua Comandante Paiva Couceiro",
        "Town": "Belas",
        "StateOrProvince": "Lisboa",
        "Postcode": "2745-059",
        "CountryID": 180,
        "Latitude": 38.75469431573782,
        "Longitude": -9.25325850989293,
        "RelatedURL": "https://plugcharge.continente.pt/",
        "DistanceUnit": 0
    },
    "Connections": [
        {
            "ID": 264705,
            "ConnectionTypeID": 25,
            "StatusTypeID": 50,
            "LevelID": 2,
            "Amps": 32,
            "Voltage": 400,
            "PowerKW": 22,
            "CurrentTypeID": 20,
            "Quantity": 2
        }
    ],
    "NumberOfPoints": 2,
    "GeneralComments": "Plug&Charge App",
    "StatusTypeID": 50,
    "DateLastStatusUpdate": "2021-03-01T16:51:00Z",
    "DataQualityLevel": 1,
    "DateCreated": "2021-02-28T00:10:00Z",
    "SubmissionStatusTypeID": 200
}