{
    "IsRecentlyVerified": false,
    "ID": 104164,
    "UUID": "A916BC0A-8066-49F0-BB8E-6BF4812A3E0C",
    "DataProviderID": 1,
    "OperatorID": 44,
    "UsageTypeID": 3,
    "AddressInfo": {
        "ID": 104510,
        "Title": "Ladepunkt Osttorstraße",
        "AddressLine1": "Osttorstraße 2",
        "Town": "Altenbeken",
        "StateOrProvince": "Kreis Paderborn",
        "Postcode": "33184",
        "CountryID": 87,
        "Latitude": 51.71356,
        "Longitude": 8.935140000000047,
        "ContactTelephone1": "+49 15121277041",
        "AccessComments": "Laden nach telefonischer Anmeldung bei Herrn Berendes möglich.",
        "DistanceUnit": 0
    },
    "Connections": [
        {
            "ID": 147095,
            "ConnectionTypeID": 25,
            "StatusTypeID": 50,
            "LevelID": 2,
            "Amps": 16,
            "Voltage": 400,
            "PowerKW": 11,
            "CurrentTypeID": 20,
            "Quantity": 1
        },
        {
            "ID": 147096,
            "ConnectionTypeID": 28,
            "StatusTypeID": 50,
            "LevelID": 2,
            "Amps": 16,
            "Voltage": 230,
            "PowerKW": 3.7,
            "CurrentTypeID": 10,
            "Quantity": 1
        }
    ],
    "NumberOfPoints": 2,
    "StatusTypeID": 50,
    "DateLastStatusUpdate": "2018-05-16T13:50:00Z",
    "DataQualityLevel": 1,
    "DateCreated": "2018-05-16T13:50:00Z",
    "SubmissionStatusTypeID": 200
}