{
    "IsRecentlyVerified": false,
    "ID": 57529,
    "UUID": "0EB4A259-7FB1-4A59-889D-B36ADEFB6831",
    "DataProviderID": 1,
    "OperatorID": 45,
    "UsageTypeID": 1,
    "AddressInfo": {
        "ID": 57875,
        "Title": "Supermarkt Kaufland",
        "AddressLine1": "Ollenhauerstraße 122",
        "AddressLine2": "Reinickendorf",
        "Town": "Berlin",
        "StateOrProvince": "Berlin",
        "Postcode": "13403",
        "CountryID": 87,
        "Latitude": 52.56807,
        "Longitude": 13.32892,
        "ContactTelephone1": "+49 30 417056690",
        "AccessComments": "Die Säule ist nutzbar von Mo-Fr. von 07:00 bis 23:59 Uhr und Sa: von 07:00 bis 23:30 Uhr So. In 3 Filialen – Kaufland Berlin-Reinickendorf, Berlin-Tempelhof und Dallgow-Döberitz – gibt es eine Ökostromtankstelle für Elektroautos und E-Bikes. Deteils unbekannt, daher erstmal als 2x Schuko und 2xTyp2 11kW eingetragen, bitte ggf. korrigieren.\r\n",
        "DistanceUnit": 0
    },
    "Connections": [
        {
            "ID": 72700,
            "ConnectionTypeID": 25,
            "StatusTypeID": 50,
            "LevelID": 2,
            "Amps": 16,
            "Voltage": 400,
            "PowerKW": 11,
            "CurrentTypeID": 20,
            "Quantity": 2
        },
        {
            "ID": 72701,
            "ConnectionTypeID": 28,
            "StatusTypeID": 50,
            "LevelID": 2,
            "Amps": 16,
            "Voltage": 230,
            "PowerKW": 3.7,
            "CurrentTypeID": 10,
            "Quantity": 2
        }
    ],
    "NumberOfPoints": 2,
    "GeneralComments": "Lademöglichkeit ab 7.12.2015 nutzbar.",
    "StatusTypeID": 50,
    "DateLastStatusUpdate": "2015-12-02T07:55:00Z",
    "DataQualityLevel": 1,
    "DateCreated": "2015-12-02T07:51:00Z",
    "SubmissionStatusTypeID": 200
}