{
    "IsRecentlyVerified": false,
    "ID": 31961,
    "UUID": "1D3D55DB-588E-4C50-B963-4A5B2AF10697",
    "DataProviderID": 26,
    "DataProvidersReference": "30421",
    "OperatorID": 86,
    "OperatorsReference": "EnWBHinterm Hauptbahnhof  (West) ",
    "UsageCost": "0.00 afhankelijk van pas",
    "AddressInfo": {
        "ID": 32307,
        "Title": "Schwarzwaldstraße",
        "AddressLine1": "Schwarzwaldstraße",
        "Town": "Karlsruhe",
        "Postcode": "76137",
        "CountryID": 87,
        "Latitude": 48.991889,
        "Longitude": 8.40181,
        "ContactTelephone1": "0800 3629-000",
        "ContactEmail": "-",
        "RelatedURL": "http://www.enbw.com/",
        "DistanceUnit": 0
    },
    "Connections": [
        {
            "ID": 35472,
            "ConnectionTypeID": 25,
            "LevelID": 2,
            "PowerKW": 5,
            "CurrentTypeID": 10
        }
    ],
    "NumberOfPoints": 2,
    "StatusTypeID": 50,
    "DateLastStatusUpdate": "2016-03-03T12:34:00Z",
    "DataQualityLevel": 3,
    "DateCreated": "2015-01-09T06:03:00Z",
    "SubmissionStatusTypeID": 100
}