{
    "IsRecentlyVerified": false,
    "ID": 149266,
    "UUID": "C2482F17-82F2-4C80-A38D-B0370E4FB420",
    "DataProviderID": 1,
    "OperatorID": 80,
    "UsageTypeID": 4,
    "UsageCost": "0.45€/kWh",
    "AddressInfo": {
        "ID": 149619,
        "Title": "Mentana Zeri | ENELX",
        "AddressLine1": "Piazza Federico Zeri, 2",
        "Town": "Mentana",
        "StateOrProvince": "RM",
        "Postcode": "00013",
        "CountryID": 112,
        "Latitude": 42.024919175608034,
        "Longitude": 12.648537862851299,
        "ContactTelephone1": "800069850",
        "RelatedURL": "https://www.enelx.com/it/it/emobility",
        "DistanceUnit": 0
    },
    "Connections": [
        {
            "ID": 207255,
            "ConnectionTypeID": 25,
            "StatusTypeID": 50,
            "LevelID": 2,
            "Amps": 32,
            "Voltage": 400,
            "PowerKW": 22,
            "CurrentTypeID": 20,
            "Quantity": 1
        },
        {
            "ID": 207256,
            "ConnectionTypeID": 36,
            "StatusTypeID": 50,
            "LevelID": 2,
            "Amps": 16,
            "Voltage": 240,
            "PowerKW": 3.7,
            "CurrentTypeID": 10,
            "Quantity": 1
        }
    ],
    "NumberOfPoints": 2,
    "StatusTypeID": 50,
    "DateLastStatusUpdate": "2020-04-24T15:07:00Z",
    "DataQualityLevel": 1,
    "DateCreated": "2020-02-21T11:23:00Z",
    "SubmissionStatusTypeID": 200
}