{
    "IsRecentlyVerified": false,
    "ID": 59053,
    "UUID": "65B72873-19CC-4A11-BB8C-4DFE6D147014",
    "DataProviderID": 1,
    "OperatorID": 235,
    "UsageTypeID": 4,
    "UsageCost": "0",
    "AddressInfo": {
        "ID": 59399,
        "Title": "SWD Universitätsklinik Düsseldorf, Parkhaus",
        "AddressLine1": "Moorenstraße 5",
        "AddressLine2": "Bilk",
        "Town": "Düsseldorf",
        "Postcode": "40225",
        "CountryID": 87,
        "Latitude": 51.197679936,
        "Longitude": 6.784763718,
        "ContactTelephone1": "0211/821-8210",
        "ContactTelephone2": "0211/821-4093",
        "ContactEmail": "elektromobilitaet@swd-ag.de",
        "RelatedURL": "http://www.emobil-nrw.de",
        "DistanceUnit": 0
    },
    "Connections": [
        {
            "ID": 74924,
            "ConnectionTypeID": 25,
            "StatusTypeID": 50,
            "LevelID": 2,
            "Amps": 32,
            "Voltage": 400,
            "PowerKW": 22,
            "CurrentTypeID": 20,
            "Quantity": 2
        },
        {
            "ID": 74925,
            "ConnectionTypeID": 28,
            "StatusTypeID": 50,
            "LevelID": 2,
            "Amps": 16,
            "Voltage": 230,
            "PowerKW": 3.7,
            "CurrentTypeID": 10,
            "Quantity": 2
        }
    ],
    "NumberOfPoints": 4,
    "GeneralComments": "Nutzbar mit:\r\nElektronauten-Ladekarte (EnBW)\r\nLadekarte der Stadtwerke Hilden GmbH\r\nLadekarte der Stadtwerke Düsseldorf AG\r\nhttps://www.swd-ag.de/formulare/tankkarte/",
    "StatusTypeID": 50,
    "DateLastStatusUpdate": "2016-01-12T12:34:00Z",
    "DataQualityLevel": 1,
    "DateCreated": "2016-01-06T13:32:00Z",
    "SubmissionStatusTypeID": 200
}