{
    "IsRecentlyVerified": false,
    "ID": 142188,
    "UUID": "7277A3E1-A5B2-43BA-9EE6-1A670C7FF5E0",
    "DataProviderID": 2,
    "DataProvidersReference": "122686",
    "OperatorID": 5,
    "UsageTypeID": 1,
    "AddressInfo": {
        "ID": 142540,
        "Title": "ST.VRAIN PARK",
        "AddressLine1": "3525 state highway 119",
        "Town": "Firestone",
        "StateOrProvince": "CO",
        "Postcode": "80504",
        "CountryID": 2,
        "Latitude": 40.1700845,
        "Longitude": -104.9857474,
        "ContactTelephone1": "888-758-4389",
        "AccessComments": "24 hours daily",
        "RelatedURL": "http://www.chargepoint.com/",
        "DistanceUnit": 0
    },
    "Connections": [
        {
            "ID": 198270,
            "ConnectionTypeID": 1,
            "LevelID": 2,
            "Amps": 16,
            "Voltage": 230,
            "PowerKW": 3.7,
            "CurrentTypeID": 10,
            "Quantity": 2
        }
    ],
    "StatusTypeID": 50,
    "DateLastStatusUpdate": "2020-06-26T03:02:00Z",
    "DataQualityLevel": 3,
    "DateCreated": "2019-12-24T09:17:00Z",
    "SubmissionStatusTypeID": 100
}