{
    "IsRecentlyVerified": false,
    "ID": 108650,
    "UUID": "3DAE6F60-D7F8-4FB7-AFFE-3C7A94F6A52B",
    "DataProviderID": 1,
    "OperatorID": 150,
    "OperatorsReference": "Texaco West Moors - Ferndown",
    "UsageTypeID": 4,
    "UsageCost": "Â£1.00 + Â£0.30/kWh",
    "AddressInfo": {
        "ID": 108996,
        "Title": "Esso West Moors - Ferndown",
        "AddressLine1": "Ringwood Road",
        "Town": "Ferndown",
        "Postcode": "BH22 0AD",
        "CountryID": 1,
        "Latitude": 50.815142,
        "Longitude": -1.869049,
        "RelatedURL": "https://www.geniepoint.co.uk/ds",
        "DistanceUnit": 0
    },
    "Connections": [
        {
            "ID": 153742,
            "ConnectionTypeID": 1036,
            "StatusTypeID": 0,
            "LevelID": 3,
            "PowerKW": 43,
            "CurrentTypeID": 20,
            "Quantity": 1
        },
        {
            "ID": 153743,
            "ConnectionTypeID": 2,
            "StatusTypeID": 0,
            "LevelID": 3,
            "PowerKW": 50,
            "CurrentTypeID": 30,
            "Quantity": 1
        },
        {
            "ID": 153744,
            "ConnectionTypeID": 33,
            "StatusTypeID": 0,
            "LevelID": 3,
            "PowerKW": 50,
            "CurrentTypeID": 30,
            "Quantity": 1
        }
    ],
    "NumberOfPoints": 1,
    "StatusTypeID": 50,
    "DateLastStatusUpdate": "2020-10-07T14:41:00Z",
    "DataQualityLevel": 1,
    "DateCreated": "2018-10-09T16:11:00Z",
    "SubmissionStatusTypeID": 200
}