{
    "IsRecentlyVerified": false,
    "ID": 96119,
    "UUID": "CA626D2D-920A-4BC6-8B24-8A8579028325",
    "DataProviderID": 1,
    "OperatorID": 101,
    "UsageTypeID": 4,
    "AddressInfo": {
        "ID": 96465,
        "Title": "Supermarkt Real",
        "AddressLine1": "Gustower Weg 3",
        "Town": "Stralsund",
        "StateOrProvince": "Landkreis Vorpommern-Rügen",
        "Postcode": "18439",
        "CountryID": 87,
        "Latitude": 54.271118837195985,
        "Longitude": 13.114679894056716,
        "AccessComments": "24/7 nutzbare Ladesäule mit 2 markierten Parkplätzen am Rand des Parkplatzes.",
        "RelatedURL": "http://www.stadtwerke-stralsund.de/",
        "DistanceUnit": 0
    },
    "Connections": [
        {
            "ID": 136192,
            "ConnectionTypeID": 25,
            "StatusTypeID": 50,
            "LevelID": 2,
            "Amps": 32,
            "Voltage": 400,
            "PowerKW": 22,
            "CurrentTypeID": 20,
            "Quantity": 2
        }
    ],
    "NumberOfPoints": 2,
    "StatusTypeID": 50,
    "DateLastStatusUpdate": "2017-12-11T07:27:00Z",
    "DataQualityLevel": 1,
    "DateCreated": "2017-12-11T07:27:00Z",
    "SubmissionStatusTypeID": 200
}