{
    "IsRecentlyVerified": false,
    "ID": 148306,
    "UUID": "568C1558-8883-4197-94F0-ED340AE4F95E",
    "DataProviderID": 1,
    "OperatorID": 3,
    "OperatorsReference": "PG-83784,PG-83823",
    "UsageTypeID": 4,
    "UsageCost": "£0.90/kWh",
    "AddressInfo": {
        "ID": 148658,
        "Title": "Tony Levoi Vauxhall-Romford",
        "AddressLine1": "144 London Road",
        "Town": "Romford",
        "Postcode": "RM7 9QL",
        "CountryID": 1,
        "Latitude": 51.574697,
        "Longitude": 0.169778,
        "DistanceUnit": 0
    },
    "Connections": [
        {
            "ID": 205900,
            "ConnectionTypeID": 25,
            "StatusTypeID": 50,
            "LevelID": 2,
            "Amps": 32,
            "Voltage": 230,
            "PowerKW": 7,
            "CurrentTypeID": 10,
            "Quantity": 4
        }
    ],
    "NumberOfPoints": 4,
    "GeneralComments": "This is an open charge unit installed at the Tony LeVoi Vauxhall dealership at London Road, Romford",
    "StatusTypeID": 50,
    "DateLastStatusUpdate": "2020-02-27T06:39:00Z",
    "DataQualityLevel": 1,
    "DateCreated": "2020-01-30T06:32:00Z",
    "SubmissionStatusTypeID": 200
}