{
    "IsRecentlyVerified": false,
    "ID": 41864,
    "UUID": "091F38EA-D719-40CF-9DB6-98E19AA2E22C",
    "DataProviderID": 1,
    "OperatorID": 1,
    "UsageTypeID": 1,
    "UsageCost": "Free",
    "AddressInfo": {
        "ID": 42210,
        "Title": "Straits Quay Carpark",
        "AddressLine1": "Straits Quay",
        "AddressLine2": "Seri Tanjung Pinang",
        "Town": "Tanjung Tokong",
        "StateOrProvince": "Penang",
        "Postcode": "10470",
        "CountryID": 137,
        "Latitude": 5.457148,
        "Longitude": 100.31297,
        "AccessComments": "Carpark entrance on right of mall, first carpark biulding after going through barrier. Second floor, dedicated EV carparking space.",
        "DistanceUnit": 0
    },
    "Connections": [
        {
            "ID": 50186,
            "ConnectionTypeID": 0,
            "StatusTypeID": 50
        }
    ],
    "NumberOfPoints": 1,
    "StatusTypeID": 50,
    "DateLastStatusUpdate": "2015-02-16T20:48:00Z",
    "DataQualityLevel": 1,
    "DateCreated": "2015-02-13T18:23:00Z",
    "SubmissionStatusTypeID": 200
}