{
    "IsRecentlyVerified": false,
    "ID": 176799,
    "UUID": "1997CF47-03E0-44DA-B82D-A5AAFBE1C317",
    "DataProviderID": 29,
    "DataProvidersReference": "15055",
    "AddressInfo": {
        "ID": 177158,
        "Title": "Graf-Zeppelin-Straße 2-10",
        "AddressLine1": "Graf-Zeppelin-Straße 2-10",
        "Town": "Eschborn",
        "Postcode": "65760",
        "CountryID": 87,
        "Latitude": 50.13127,
        "Longitude": 8.56074,
        "DistanceUnit": 0
    },
    "Connections": [
        {
            "ID": 275147,
            "ConnectionTypeID": 25,
            "StatusTypeID": 50,
            "LevelID": 2,
            "PowerKW": 22,
            "CurrentTypeID": 20
        },
        {
            "ID": 275148,
            "ConnectionTypeID": 25,
            "StatusTypeID": 50,
            "LevelID": 2,
            "PowerKW": 22,
            "CurrentTypeID": 20
        }
    ],
    "StatusTypeID": 0,
    "DateLastStatusUpdate": "2021-07-12T02:44:00Z",
    "MetadataValues": [
        {
            "ID": 9094,
            "MetadataFieldID": 4,
            "ItemValue": "Data from the German chargepoint registry provided by Bundesnetzagentur.de under the CC-BY 4.0 license"
        }
    ],
    "DataQualityLevel": 3,
    "DateCreated": "2021-07-08T09:48:00Z",
    "SubmissionStatusTypeID": 100
}