{
    "IsRecentlyVerified": false,
    "ID": 81344,
    "UUID": "03BEFEC2-FA81-4C52-B79E-65E13E0ABE55",
    "DataProviderID": 1,
    "OperatorID": 23,
    "OperatorsReference": "21403",
    "UsageTypeID": 4,
    "UsageCost": "Free",
    "AddressInfo": {
        "ID": 81690,
        "Title": "Icon Parking 30 W 63RD St",
        "AddressLine1": "30 W 63RD St",
        "Town": "Manhattan",
        "StateOrProvince": "New York",
        "Postcode": "10023",
        "CountryID": 2,
        "Latitude": 40.770772,
        "Longitude": -73.981795,
        "ContactTelephone1": "(212) 586-1660",
        "DistanceUnit": 0
    },
    "Connections": [
        {
            "ID": 116060,
            "ConnectionTypeID": 30,
            "StatusTypeID": 50,
            "LevelID": 2,
            "PowerKW": 16,
            "CurrentTypeID": 20,
            "Quantity": 2
        }
    ],
    "NumberOfPoints": 2,
    "GeneralComments": "2 Tesla Connectors, up to 16kW.Available to the public. Please see valet.",
    "StatusTypeID": 50,
    "DateLastStatusUpdate": "2017-02-01T09:33:00Z",
    "DataQualityLevel": 1,
    "DateCreated": "2017-02-01T09:33:00Z",
    "SubmissionStatusTypeID": 200
}