{
    "IsRecentlyVerified": false,
    "ID": 177951,
    "UUID": "00989F09-E3FE-4BB8-84CF-D7520E242D08",
    "DataProviderID": 29,
    "DataProvidersReference": "827",
    "AddressInfo": {
        "ID": 178310,
        "Title": "Dorperstr.",
        "AddressLine1": "Dorperstr.",
        "Town": "Solingen",
        "Postcode": "42651",
        "CountryID": 87,
        "Latitude": 51.171089,
        "Longitude": 7.087057,
        "DistanceUnit": 0
    },
    "Connections": [
        {
            "ID": 277732,
            "ConnectionTypeID": 25,
            "StatusTypeID": 50,
            "LevelID": 2,
            "PowerKW": 22,
            "CurrentTypeID": 20
        },
        {
            "ID": 277733,
            "ConnectionTypeID": 25,
            "StatusTypeID": 50,
            "LevelID": 2,
            "PowerKW": 22,
            "CurrentTypeID": 20
        },
        {
            "ID": 277734,
            "ConnectionTypeID": 1036,
            "StatusTypeID": 50,
            "LevelID": 3,
            "PowerKW": 50,
            "CurrentTypeID": 20
        }
    ],
    "StatusTypeID": 0,
    "DateLastStatusUpdate": "2021-07-12T02:46:00Z",
    "MetadataValues": [
        {
            "ID": 10245,
            "MetadataFieldID": 4,
            "ItemValue": "Data from the German chargepoint registry provided by Bundesnetzagentur.de under the CC-BY 4.0 license"
        }
    ],
    "DataQualityLevel": 3,
    "DateCreated": "2021-07-08T09:49:00Z",
    "SubmissionStatusTypeID": 100
}