{
    "IsRecentlyVerified": false,
    "ID": 12997,
    "UUID": "0BDC92D9-2732-42FA-A896-CF4E7568C8A2",
    "DataProviderID": 15,
    "DataProvidersReference": "22263",
    "OperatorID": 5,
    "UsageTypeID": 1,
    "AddressInfo": {
        "ID": 12894,
        "Title": "875 E Long St",
        "AddressLine1": "875 E Long St",
        "Town": "Carson City",
        "StateOrProvince": "Nevada",
        "Postcode": "89701",
        "CountryID": 2,
        "Latitude": 39.17372513,
        "Longitude": -119.7598267,
        "ContactTelephone1": "",
        "RelatedURL": "http://carstations.com/22263",
        "DistanceUnit": 0
    },
    "Connections": [
        {
            "ID": 10430,
            "ConnectionTypeID": 1,
            "Reference": "J1772",
            "LevelID": 2
        }
    ],
    "NumberOfPoints": 1,
    "StatusTypeID": 0,
    "DateLastStatusUpdate": "2017-11-04T14:04:00Z",
    "DataQualityLevel": 2,
    "DateCreated": "2012-09-07T19:26:00Z",
    "SubmissionStatusTypeID": 100
}