{
    "IsRecentlyVerified": false,
    "ID": 89472,
    "UUID": "FC3C790A-ABA3-4F14-81F4-8265C18A478D",
    "DataProviderID": 2,
    "DataProvidersReference": "85508",
    "OperatorID": 5,
    "UsageTypeID": 1,
    "AddressInfo": {
        "ID": 89818,
        "Title": "LG&E",
        "AddressLine1": "921 W Main St",
        "Town": "Louisville",
        "StateOrProvince": "KY",
        "Postcode": "40202",
        "CountryID": 2,
        "Latitude": 38.2576741,
        "Longitude": -85.7658022,
        "ContactTelephone1": "888-758-4389",
        "AccessComments": "24 hours daily",
        "RelatedURL": "http://www.chargepoint.com/",
        "DistanceUnit": 0
    },
    "Connections": [
        {
            "ID": 126871,
            "ConnectionTypeID": 1,
            "LevelID": 2,
            "Amps": 16,
            "Voltage": 230,
            "PowerKW": 3,
            "CurrentTypeID": 10,
            "Quantity": 2
        }
    ],
    "DateLastStatusUpdate": "2019-04-06T04:02:00Z",
    "DataQualityLevel": 3,
    "DateCreated": "2017-06-22T08:16:00Z",
    "SubmissionStatusTypeID": 100
}