{
    "IsRecentlyVerified": false,
    "ID": 134314,
    "UUID": "A7619A7B-BE50-4462-8C1C-BF136E1033C0",
    "DataProviderID": 1,
    "OperatorID": 150,
    "UsageTypeID": 4,
    "UsageCost": "£1.00+£0.30/kWh; £10.00 overstay fee after 95 mins, then £10.00 every subsequent 95 mins",
    "AddressInfo": {
        "ID": 134660,
        "Title": "Morrisons Bromsgrove",
        "AddressLine1": "Unit 4 Buntsford Park Road",
        "Town": "Bromsgrove",
        "StateOrProvince": "Worcestershire",
        "Postcode": "B60 3DX",
        "CountryID": 1,
        "Latitude": 52.317288,
        "Longitude": -2.062846,
        "RelatedURL": "http://www.chargepointservices.com/",
        "DistanceUnit": 0
    },
    "Connections": [
        {
            "ID": 187962,
            "ConnectionTypeID": 25,
            "Reference": "1",
            "StatusTypeID": 50,
            "LevelID": 2,
            "Amps": 32,
            "Voltage": 400,
            "PowerKW": 22,
            "CurrentTypeID": 20,
            "Quantity": 1
        },
        {
            "ID": 187989,
            "ConnectionTypeID": 2,
            "StatusTypeID": 50,
            "LevelID": 3,
            "Amps": 125,
            "Voltage": 400,
            "PowerKW": 50,
            "CurrentTypeID": 30,
            "Quantity": 1
        },
        {
            "ID": 187990,
            "ConnectionTypeID": 33,
            "StatusTypeID": 50,
            "LevelID": 3,
            "Amps": 125,
            "Voltage": 400,
            "PowerKW": 50,
            "CurrentTypeID": 30,
            "Quantity": 1
        }
    ],
    "NumberOfPoints": 1,
    "StatusTypeID": 50,
    "DateLastStatusUpdate": "2019-11-08T14:34:00Z",
    "MetadataValues": [
        {
            "ID": 5069,
            "MetadataFieldID": 4,
            "ItemValue": "Contains public sector information licensed under the Open Government Licence v2.0. http://www.nationalarchives.gov.uk/doc/open-government-licence/version/2/"
        }
    ],
    "DataQualityLevel": 3,
    "DateCreated": "2019-11-08T08:03:00Z",
    "SubmissionStatusTypeID": 200
}