{
    "IsRecentlyVerified": false,
    "ID": 20365,
    "UUID": "2F388517-7B8D-4318-AA49-06300198B443",
    "DataProviderID": 1,
    "OperatorID": 1,
    "UsageTypeID": 0,
    "UsageCost": "",
    "AddressInfo": {
        "ID": 20710,
        "Title": "AutoBleue Saint Hélène",
        "AddressLine1": "192 Avenue de la Californie",
        "AddressLine2": "",
        "Town": "Nice",
        "StateOrProvince": "",
        "Postcode": "06200",
        "CountryID": 80,
        "Latitude": 43.68248,
        "Longitude": 7.23203,
        "ContactTelephone1": "",
        "ContactTelephone2": "",
        "ContactEmail": "",
        "AccessComments": "Réservé aux clients de l'établissement",
        "RelatedURL": "",
        "DistanceUnit": 0
    },
    "Connections": [],
    "GeneralComments": "",
    "StatusTypeID": 50,
    "DateLastStatusUpdate": "2013-11-12T20:50:00Z",
    "DataQualityLevel": 1,
    "DateCreated": "2013-11-12T09:43:00Z",
    "SubmissionStatusTypeID": 200
}