{
    "IsRecentlyVerified": false,
    "ID": 97719,
    "UUID": "EBF7C2B4-59D3-49A0-B5AF-CF2377DF517B",
    "DataProviderID": 1,
    "OperatorID": 23,
    "OperatorsReference": "38785",
    "UsageTypeID": 4,
    "AddressInfo": {
        "ID": 98065,
        "Title": "Residenz Erschbaum",
        "AddressLine1": "Bad Bergfallweg",
        "Town": "2",
        "StateOrProvince": "Olang",
        "Postcode": "39030",
        "CountryID": 112,
        "Latitude": 46.742473,
        "Longitude": 12.006773,
        "ContactTelephone1": "+39 339 807 2800",
        "DistanceUnit": 0
    },
    "Connections": [
        {
            "ID": 138627,
            "ConnectionTypeID": 30,
            "StatusTypeID": 50,
            "LevelID": 2,
            "Amps": 32,
            "Voltage": 230,
            "PowerKW": 14,
            "CurrentTypeID": 20,
            "Quantity": 1
        }
    ],
    "NumberOfPoints": 1,
    "GeneralComments": "1 Tesla Connector, up to 14kW.Available for customers. Please call ahead.",
    "StatusTypeID": 50,
    "DateLastStatusUpdate": "2018-10-03T23:30:00Z",
    "DataQualityLevel": 1,
    "DateCreated": "2018-01-21T16:28:00Z",
    "SubmissionStatusTypeID": 200
}