{
    "IsRecentlyVerified": false,
    "ID": 123953,
    "UUID": "5F36A7F3-F6DC-4B17-84D1-1CCA467B8464",
    "DataProviderID": 2,
    "DataProvidersReference": "72836",
    "OperatorID": 1242,
    "UsageTypeID": 2,
    "AddressInfo": {
        "ID": 124299,
        "Title": "GE WattStation",
        "AddressLine1": "710  Bair Island Rd",
        "Town": "Redwood City",
        "StateOrProvince": "CA",
        "Postcode": "94063",
        "CountryID": 2,
        "Latitude": 37.4977052,
        "Longitude": -122.2237448,
        "ContactTelephone1": "855-443-3873",
        "AccessComments": "",
        "RelatedURL": "https://www.gewattstation.com",
        "DistanceUnit": 0
    },
    "Connections": [
        {
            "ID": 173992,
            "ConnectionTypeID": 1,
            "LevelID": 2,
            "Amps": 16,
            "Voltage": 230,
            "PowerKW": 3.7,
            "CurrentTypeID": 10,
            "Quantity": 1
        }
    ],
    "DateLastStatusUpdate": "2020-06-26T02:59:00Z",
    "DataQualityLevel": 3,
    "DateCreated": "2019-04-06T05:03:00Z",
    "SubmissionStatusTypeID": 100
}