{
    "IsRecentlyVerified": false,
    "ID": 56571,
    "UUID": "D33E2CB7-7DE2-48DF-B7AA-2E3E5D3082A0",
    "DataProviderID": 2,
    "DataProvidersReference": "70457",
    "UsageTypeID": 7,
    "AddressInfo": {
        "ID": 56917,
        "Title": "Wharton Nissan",
        "AddressLine1": "1237 7th St",
        "Town": "Parkersburg",
        "StateOrProvince": "WV",
        "Postcode": "26102",
        "CountryID": 2,
        "Latitude": 39.264226,
        "Longitude": -81.540657,
        "ContactTelephone1": "304-485-7511",
        "AccessComments": "Dealership business hours\r\nPublic - Call ahead",
        "RelatedURL": "",
        "DistanceUnit": 0
    },
    "Connections": [
        {
            "ID": 71330,
            "ConnectionTypeID": 1,
            "LevelID": 2,
            "Amps": 16,
            "Voltage": 230,
            "PowerKW": 3.7,
            "CurrentTypeID": 10,
            "Quantity": 1
        }
    ],
    "DateLastStatusUpdate": "2020-06-26T03:01:00Z",
    "DataQualityLevel": 3,
    "DateCreated": "2015-11-04T08:42:00Z",
    "SubmissionStatusTypeID": 100
}