{
    "IsRecentlyVerified": false,
    "ID": 33400,
    "UUID": "5CDAE2DD-61D2-460D-8307-123CF2216765",
    "DataProviderID": 26,
    "DataProvidersReference": "38030",
    "OperatorsReference": "ENE-P1002",
    "UsageCost": "0.00 afhankelijk van pas",
    "AddressInfo": {
        "ID": 33746,
        "Title": "Heusing 14A",
        "AddressLine1": "Heusing 14A",
        "Town": "Breda",
        "Postcode": "4817 ZB",
        "CountryID": 159,
        "Latitude": 51.595,
        "Longitude": 4.827,
        "ContactTelephone1": "0900-0201",
        "ContactEmail": "info@eneco.nl",
        "RelatedURL": "http://www.eneco.nl",
        "DistanceUnit": 0
    },
    "Connections": [
        {
            "ID": 36911,
            "ConnectionTypeID": 25,
            "LevelID": 2,
            "PowerKW": 11,
            "CurrentTypeID": 10
        }
    ],
    "NumberOfPoints": 2,
    "StatusTypeID": 50,
    "DateLastStatusUpdate": "2016-06-04T02:39:00Z",
    "DataQualityLevel": 3,
    "DateCreated": "2015-01-09T06:04:00Z",
    "SubmissionStatusTypeID": 100
}