{
    "IsRecentlyVerified": false,
    "ID": 84077,
    "UUID": "634F13DE-C964-4785-8F3B-B297397A633B",
    "DataProviderID": 1,
    "OperatorID": 23,
    "OperatorsReference": "24444",
    "UsageTypeID": 4,
    "AddressInfo": {
        "ID": 84423,
        "Title": "Domaine Serene",
        "AddressLine1": "6555 Ne Hilltop LN",
        "Town": "Dayton",
        "StateOrProvince": "Oregon",
        "Postcode": "97114",
        "CountryID": 2,
        "Latitude": 45.270917,
        "Longitude": -123.070402,
        "ContactTelephone1": "(503) 864-4600",
        "DistanceUnit": 0
    },
    "Connections": [
        {
            "ID": 119478,
            "ConnectionTypeID": 30,
            "StatusTypeID": 50,
            "LevelID": 2,
            "PowerKW": 10,
            "CurrentTypeID": 10,
            "Quantity": 1
        }
    ],
    "NumberOfPoints": 1,
    "GeneralComments": "1 Tesla Connector, up to 10kW.Available for customers. Please call ahead.",
    "StatusTypeID": 50,
    "DateLastStatusUpdate": "2017-07-13T14:53:00Z",
    "DataQualityLevel": 1,
    "DateCreated": "2017-02-16T15:07:00Z",
    "SubmissionStatusTypeID": 200
}