{
    "IsRecentlyVerified": false,
    "ID": 100528,
    "UUID": "AF185872-6BAF-4E54-B3A2-4856FE5DE16D",
    "DataProviderID": 1,
    "OperatorID": 45,
    "UsageTypeID": 5,
    "UsageCost": "8 CZK / 1 kWh",
    "AddressInfo": {
        "ID": 100874,
        "Title": "CGP Parkhaus",
        "AddressLine1": "F.A Gerstera 52",
        "Town": "České Budějovice",
        "Postcode": "37001",
        "CountryID": 64,
        "Latitude": 48.9709529719584,
        "Longitude": 14.4729155302048,
        "ContactTelephone1": "+420735161700",
        "ContactEmail": "info@cbparkhaus.cz",
        "AccessComments": "-1 floor of parking house",
        "RelatedURL": "http://www.citygreenpark.cz",
        "DistanceUnit": 0
    },
    "Connections": [
        {
            "ID": 141991,
            "ConnectionTypeID": 25,
            "StatusTypeID": 50,
            "LevelID": 2,
            "Amps": 32,
            "Voltage": 400,
            "PowerKW": 22,
            "CurrentTypeID": 20,
            "Quantity": 2
        }
    ],
    "NumberOfPoints": 2,
    "StatusTypeID": 50,
    "DateLastStatusUpdate": "2018-03-04T14:34:00Z",
    "DataQualityLevel": 1,
    "DateCreated": "2018-02-28T09:00:00Z",
    "SubmissionStatusTypeID": 200
}