{
    "IsRecentlyVerified": false,
    "ID": 176011,
    "UUID": "F9FBBE40-7084-4879-BBEB-AA67B5D312B1",
    "DataProviderID": 1,
    "OperatorID": 1,
    "UsageTypeID": 6,
    "UsageCost": "10 eur",
    "AddressInfo": {
        "ID": 176370,
        "Title": "Hotel Lido Beach",
        "AddressLine1": "Via Del Leone 65",
        "Town": "bibione ",
        "StateOrProvince": "Ve",
        "Postcode": "30020",
        "CountryID": 112,
        "Latitude": 45.63343511659863,
        "Longitude": 13.046078996248639,
        "ContactTelephone1": "+39 0431 43133",
        "DistanceUnit": 0
    },
    "Connections": [
        {
            "ID": 273418,
            "ConnectionTypeID": 25,
            "StatusTypeID": 50,
            "LevelID": 2,
            "Amps": 32,
            "Voltage": 400,
            "PowerKW": 22,
            "CurrentTypeID": 20,
            "Quantity": 2
        }
    ],
    "NumberOfPoints": 2,
    "StatusTypeID": 50,
    "DateLastStatusUpdate": "2021-06-22T13:54:00Z",
    "DataQualityLevel": 1,
    "DateCreated": "2021-06-22T10:21:00Z",
    "SubmissionStatusTypeID": 200
}