{
    "IsRecentlyVerified": true,
    "DateLastVerified": "2021-08-13T14:32:00Z",
    "ID": 188731,
    "UUID": "F89F8F59-FD31-4550-88CE-74BA3CCE0F99",
    "DataProviderID": 1,
    "OperatorID": 3435,
    "UsageTypeID": 4,
    "UsageCost": "ac - 5 + 1.2 / kwh, dc - 2 / kwh",
    "AddressInfo": {
        "ID": 189090,
        "Title": "טן אילת",
        "AddressLine1": "10TEN",
        "Town": "Eilat",
        "StateOrProvince": "South District",
        "Postcode": "88112",
        "CountryID": 111,
        "Latitude": 29.59583818118884,
        "Longitude": 34.97419895798646,
        "DistanceUnit": 0
    },
    "Connections": [
        {
            "ID": 304925,
            "ConnectionTypeID": 2,
            "StatusTypeID": 50,
            "LevelID": 3,
            "PowerKW": 50,
            "CurrentTypeID": 30,
            "Quantity": 1
        },
        {
            "ID": 304926,
            "ConnectionTypeID": 33,
            "StatusTypeID": 50,
            "LevelID": 3,
            "PowerKW": 50,
            "CurrentTypeID": 30,
            "Quantity": 1
        }
    ],
    "NumberOfPoints": 1,
    "StatusTypeID": 50,
    "DateLastStatusUpdate": "2021-08-13T14:32:00Z",
    "DataQualityLevel": 1,
    "DateCreated": "2021-08-13T14:32:00Z",
    "SubmissionStatusTypeID": 200
}