{
    "IsRecentlyVerified": false,
    "ID": 96854,
    "UUID": "0D832D86-E069-4AB9-B635-25841BE892C8",
    "DataProviderID": 1,
    "OperatorID": 1,
    "UsageTypeID": 1,
    "AddressInfo": {
        "ID": 97200,
        "Title": "E-Bike Station Waldgaststätte",
        "AddressLine1": "Emmerichshütte 3",
        "Town": "Daxweiler",
        "StateOrProvince": "Stromberg",
        "Postcode": "55442",
        "CountryID": 87,
        "Latitude": 49.98948332950118,
        "Longitude": 7.707821254492142,
        "ContactTelephone1": "+49 6132 7801-0",
        "AccessComments": "Rund um die Uhr (24/7) nutzbar.",
        "RelatedURL": "http://www.rheinhessische.de/service/mobilitaet/e-bike-tankstellen.html",
        "DistanceUnit": 0
    },
    "Connections": [
        {
            "ID": 137185,
            "ConnectionTypeID": 28,
            "StatusTypeID": 50,
            "LevelID": 1,
            "Amps": 10,
            "Voltage": 230,
            "PowerKW": 2.3,
            "CurrentTypeID": 10,
            "Quantity": 3
        }
    ],
    "NumberOfPoints": 3,
    "StatusTypeID": 50,
    "DateLastStatusUpdate": "2018-01-02T07:45:00Z",
    "DataQualityLevel": 1,
    "DateCreated": "2018-01-02T07:45:00Z",
    "SubmissionStatusTypeID": 200
}