{
    "IsRecentlyVerified": false,
    "ID": 179550,
    "UUID": "2BE5DB6A-36CC-47B6-AF82-237D4C37E22B",
    "DataProviderID": 29,
    "DataProvidersReference": "6597",
    "AddressInfo": {
        "ID": 179909,
        "Title": "Odilienplatz",
        "AddressLine1": "Odilienplatz",
        "Town": "Dillingen/Saar",
        "Postcode": "66763",
        "CountryID": 87,
        "Latitude": 49.3544,
        "Longitude": 6.72738,
        "DistanceUnit": 0
    },
    "Connections": [
        {
            "ID": 281517,
            "ConnectionTypeID": 25,
            "StatusTypeID": 50,
            "LevelID": 2,
            "PowerKW": 22,
            "CurrentTypeID": 20
        },
        {
            "ID": 281518,
            "ConnectionTypeID": 25,
            "StatusTypeID": 50,
            "LevelID": 2,
            "PowerKW": 22,
            "CurrentTypeID": 20
        }
    ],
    "StatusTypeID": 50,
    "DateLastStatusUpdate": "2021-07-09T03:16:00Z",
    "MetadataValues": [
        {
            "ID": 11844,
            "MetadataFieldID": 4,
            "ItemValue": "Data from the German chargepoint registry provided by Bundesnetzagentur.de under the CC-BY 4.0 license"
        }
    ],
    "DataQualityLevel": 3,
    "DateCreated": "2021-07-08T09:59:00Z",
    "SubmissionStatusTypeID": 100
}