{
    "IsRecentlyVerified": false,
    "ID": 77384,
    "UUID": "5245C2E7-8132-4615-9C29-11FAF81CB65F",
    "DataProviderID": 1,
    "OperatorID": 23,
    "OperatorsReference": "23565",
    "UsageTypeID": 6,
    "UsageCost": "Free",
    "AddressInfo": {
        "ID": 77730,
        "Title": "Castello di Potentino",
        "AddressLine1": "Strada Comunale della Sugherella",
        "AddressLine2": "Località Potentino",
        "Town": "Seggiano",
        "StateOrProvince": "GR",
        "Postcode": "58038",
        "CountryID": 112,
        "Latitude": 42.9237117266072,
        "Longitude": 11.5431981952621,
        "ContactTelephone1": "+39 0564 950014",
        "RelatedURL": "http://www.potentino.com/",
        "DistanceUnit": 0
    },
    "Connections": [
        {
            "ID": 111504,
            "ConnectionTypeID": 30,
            "StatusTypeID": 50,
            "LevelID": 2,
            "Amps": 32,
            "Voltage": 400,
            "PowerKW": 22,
            "CurrentTypeID": 20,
            "Quantity": 1
        }
    ],
    "NumberOfPoints": 1,
    "GeneralComments": "Tesla Destination Charging",
    "StatusTypeID": 50,
    "DateLastStatusUpdate": "2018-10-03T23:29:00Z",
    "DataQualityLevel": 1,
    "DateCreated": "2017-01-13T17:11:00Z",
    "SubmissionStatusTypeID": 200
}