{
    "IsRecentlyVerified": false,
    "ID": 145849,
    "UUID": "2B9370D0-AF3F-46BA-AE86-BB5EFB85CD5A",
    "DataProviderID": 1,
    "OperatorID": 89,
    "UsageTypeID": 1,
    "AddressInfo": {
        "ID": 146201,
        "Title": "Simons - Londonderry",
        "AddressLine1": "100A 1-Londonderry Mall NW",
        "Town": "Edmonton",
        "StateOrProvince": "AB",
        "Postcode": "T5C 3C8",
        "CountryID": 44,
        "Latitude": 53.601725,
        "Longitude": -113.444524,
        "ContactTelephone1": "888-356-8911",
        "AccessComments": "24 hours daily",
        "RelatedURL": "https://flo.ca/",
        "DistanceUnit": 0
    },
    "Connections": [
        {
            "ID": 202623,
            "ConnectionTypeID": 1,
            "LevelID": 2,
            "Amps": 16,
            "Voltage": 230,
            "PowerKW": 3,
            "CurrentTypeID": 10,
            "Quantity": 2
        },
        {
            "ID": 202624,
            "ConnectionTypeID": 2,
            "LevelID": 3,
            "Amps": 120,
            "Voltage": 400,
            "PowerKW": 50,
            "CurrentTypeID": 30,
            "Quantity": 1
        },
        {
            "ID": 202625,
            "ConnectionTypeID": 32,
            "LevelID": 3,
            "Amps": 120,
            "Voltage": 400,
            "PowerKW": 50,
            "CurrentTypeID": 30,
            "Quantity": 1
        }
    ],
    "StatusTypeID": 50,
    "DateLastStatusUpdate": "2020-02-09T18:14:00Z",
    "DataQualityLevel": 3,
    "DateCreated": "2019-12-24T09:25:00Z",
    "SubmissionStatusTypeID": 100
}