{
    "IsRecentlyVerified": false,
    "ID": 148738,
    "UUID": "744FE78B-C84D-4BF4-A40A-2746308ECCE7",
    "DataProviderID": 1,
    "OperatorID": 150,
    "UsageTypeID": 4,
    "UsageCost": "£1.00 + £0.30 / kWh. £10.00 overstay fee after 95 mins, then £10.00 every subsequent 95 mins",
    "AddressInfo": {
        "ID": 149090,
        "Title": "Morrisons St Albans",
        "AddressLine1": "244 Hatfield Road",
        "Town": "St Albans",
        "Postcode": "AL1 4SU",
        "CountryID": 1,
        "Latitude": 51.7513,
        "Longitude": -0.312499,
        "DistanceUnit": 0
    },
    "Connections": [
        {
            "ID": 206531,
            "ConnectionTypeID": 25,
            "Reference": "1",
            "StatusTypeID": 50,
            "LevelID": 2,
            "Amps": 32,
            "Voltage": 400,
            "PowerKW": 22,
            "CurrentTypeID": 20,
            "Quantity": 1
        },
        {
            "ID": 206532,
            "ConnectionTypeID": 2,
            "Reference": "2",
            "StatusTypeID": 50,
            "LevelID": 3,
            "Amps": 125,
            "Voltage": 400,
            "PowerKW": 50,
            "CurrentTypeID": 30,
            "Quantity": 1
        },
        {
            "ID": 206533,
            "ConnectionTypeID": 33,
            "Reference": "3",
            "StatusTypeID": 50,
            "LevelID": 3,
            "Amps": 125,
            "Voltage": 400,
            "PowerKW": 50,
            "CurrentTypeID": 30,
            "Quantity": 1
        }
    ],
    "NumberOfPoints": 2,
    "StatusTypeID": 50,
    "DateLastStatusUpdate": "2020-02-09T23:15:00Z",
    "MetadataValues": [
        {
            "ID": 6996,
            "MetadataFieldID": 4,
            "ItemValue": "Contains public sector information licensed under the Open Government Licence v2.0. http://www.nationalarchives.gov.uk/doc/open-government-licence/version/2/"
        }
    ],
    "DataQualityLevel": 3,
    "DateCreated": "2020-02-09T23:09:00Z",
    "SubmissionStatusTypeID": 100
}