{
    "IsRecentlyVerified": false,
    "ID": 109187,
    "UUID": "AF6BE6A4-4602-434B-A5D1-752C3489516A",
    "DataProviderID": 1,
    "OperatorID": 23,
    "OperatorsReference": "44562",
    "UsageTypeID": 4,
    "AddressInfo": {
        "ID": 109533,
        "Title": "Wiechmanns Weserhotel GBR",
        "AddressLine1": "Mitteldeichstr. 51",
        "Town": "Brake",
        "Postcode": "26919",
        "CountryID": 87,
        "Latitude": 53.326744,
        "Longitude": 8.485892,
        "ContactTelephone1": "+49 4401 85600",
        "DistanceUnit": 0
    },
    "Connections": [
        {
            "ID": 154305,
            "ConnectionTypeID": 30,
            "StatusTypeID": 50,
            "LevelID": 2,
            "Amps": 16,
            "Voltage": 400,
            "PowerKW": 11,
            "CurrentTypeID": 20,
            "Quantity": 1
        }
    ],
    "NumberOfPoints": 1,
    "GeneralComments": "1 Tesla Connector, up to 11kW.Available for customers. Please see front desk.",
    "StatusTypeID": 50,
    "DateLastStatusUpdate": "2018-10-11T13:52:00Z",
    "DataQualityLevel": 1,
    "DateCreated": "2018-10-11T13:52:00Z",
    "SubmissionStatusTypeID": 200
}