{
    "IsRecentlyVerified": false,
    "ID": 60218,
    "UUID": "EC618A18-AC13-401C-9B67-93B2210DA832",
    "DataProviderID": 1,
    "OperatorID": 1,
    "UsageTypeID": 1,
    "UsageCost": "Free",
    "AddressInfo": {
        "ID": 60564,
        "Title": "Viking Ship Museum ",
        "AddressLine1": "Huk Aveny 35",
        "Town": "Oslo",
        "Postcode": "0287",
        "CountryID": 168,
        "Latitude": 59.9052091398157,
        "Longitude": 10.6842209244678,
        "RelatedURL": "http://www.khm.uio.no/",
        "DistanceUnit": 0
    },
    "Connections": [
        {
            "ID": 76216,
            "ConnectionTypeID": 25,
            "StatusTypeID": 0,
            "LevelID": 2,
            "CurrentTypeID": 10,
            "Quantity": 4
        }
    ],
    "NumberOfPoints": 4,
    "GeneralComments": "In the summer you must pay for parking. In the winter, parking is free.",
    "StatusTypeID": 50,
    "DateLastStatusUpdate": "2016-01-15T13:59:00Z",
    "DataQualityLevel": 1,
    "DateCreated": "2016-01-14T09:58:00Z",
    "SubmissionStatusTypeID": 200
}