{
    "IsRecentlyVerified": false,
    "ID": 64702,
    "UUID": "EFE9E6C9-C066-4CEC-AAE1-621F9AB89E2D",
    "DataProviderID": 2,
    "DataProvidersReference": "74014",
    "OperatorID": 1242,
    "UsageTypeID": 2,
    "AddressInfo": {
        "ID": 65048,
        "Title": "GE WattStation - 2",
        "AddressLine1": "1 Village Center Drive",
        "Town": "Van Buren Charter Township",
        "StateOrProvince": "MI",
        "Postcode": "48111",
        "CountryID": 2,
        "Latitude": 42.2415,
        "Longitude": -83.436194,
        "ContactTelephone1": "855-443-3873",
        "AccessComments": "",
        "RelatedURL": "https://www.gewattstation.com",
        "DistanceUnit": 0
    },
    "Connections": [
        {
            "ID": 83154,
            "ConnectionTypeID": 1,
            "LevelID": 2,
            "Amps": 16,
            "Voltage": 230,
            "PowerKW": 3.7,
            "CurrentTypeID": 10,
            "Quantity": 1
        }
    ],
    "DateLastStatusUpdate": "2020-06-26T03:05:00Z",
    "DataQualityLevel": 3,
    "DateCreated": "2016-03-16T09:07:00Z",
    "SubmissionStatusTypeID": 100
}