{
    "IsRecentlyVerified": false,
    "ID": 142367,
    "UUID": "4CECD307-B00F-477C-881F-888CD3497399",
    "DataProviderID": 2,
    "DataProvidersReference": "143379",
    "OperatorID": 5,
    "UsageTypeID": 1,
    "AddressInfo": {
        "ID": 142719,
        "Title": "KIRKLAND VILLAG",
        "AddressLine1": "3200 Kirkland Village Cir",
        "Town": "Bethlehem",
        "StateOrProvince": "PA",
        "Postcode": "18017",
        "CountryID": 2,
        "Latitude": 40.6458697,
        "Longitude": -75.3717886,
        "ContactTelephone1": "888-758-4389",
        "AccessComments": "24 hours daily",
        "RelatedURL": "http://www.chargepoint.com/",
        "DistanceUnit": 0
    },
    "Connections": [
        {
            "ID": 198489,
            "ConnectionTypeID": 1,
            "LevelID": 2,
            "Amps": 16,
            "Voltage": 230,
            "PowerKW": 3.7,
            "CurrentTypeID": 10,
            "Quantity": 2
        }
    ],
    "StatusTypeID": 50,
    "DateLastStatusUpdate": "2020-06-26T03:03:00Z",
    "DataQualityLevel": 3,
    "DateCreated": "2019-12-24T09:17:00Z",
    "SubmissionStatusTypeID": 100
}