{
    "IsRecentlyVerified": false,
    "ID": 124145,
    "UUID": "9CB0A982-BFF6-4EFB-88F0-829BF41C657C",
    "DataProviderID": 2,
    "DataProvidersReference": "92984",
    "OperatorID": 5,
    "UsageTypeID": 1,
    "AddressInfo": {
        "ID": 124491,
        "Title": "EVSP WALGREENS",
        "AddressLine1": "5833 Foothill Blvd",
        "Town": "Oakland",
        "StateOrProvince": "CA",
        "Postcode": "94605",
        "CountryID": 2,
        "Latitude": 37.771432,
        "Longitude": -122.191366,
        "ContactTelephone1": "888-758-4389",
        "AccessComments": "24 hours daily",
        "RelatedURL": "http://www.chargepoint.com/",
        "DistanceUnit": 0
    },
    "Connections": [
        {
            "ID": 174205,
            "ConnectionTypeID": 1,
            "LevelID": 2,
            "Amps": 16,
            "Voltage": 230,
            "PowerKW": 3,
            "CurrentTypeID": 10,
            "Quantity": 4
        }
    ],
    "DateLastStatusUpdate": "2019-12-24T09:14:00Z",
    "DataQualityLevel": 3,
    "DateCreated": "2019-04-06T05:03:00Z",
    "SubmissionStatusTypeID": 100
}