{
    "IsRecentlyVerified": false,
    "ID": 154173,
    "UUID": "A1794C32-6011-4688-A4ED-F3F2A554DD61",
    "DataProviderID": 28,
    "DataProvidersReference": "FR*S27*PVALREUIL*GARE",
    "UsageTypeID": 5,
    "AddressInfo": {
        "ID": 154526,
        "Title": "900108",
        "AddressLine1": "Gare SNCF Val de Reuil",
        "CountryID": 80,
        "Latitude": 49.275684,
        "Longitude": 1.224221,
        "AccessComments": "24/24 7/7 jours",
        "DistanceUnit": 0
    },
    "Connections": [
        {
            "ID": 216692,
            "ConnectionTypeID": 28,
            "StatusTypeID": 50,
            "LevelID": 2,
            "PowerKW": 22,
            "CurrentTypeID": 10
        },
        {
            "ID": 216693,
            "ConnectionTypeID": 26,
            "StatusTypeID": 50,
            "LevelID": 2,
            "PowerKW": 22
        },
        {
            "ID": 251055,
            "ConnectionTypeID": 26,
            "StatusTypeID": 50,
            "LevelID": 2,
            "PowerKW": 22
        },
        {
            "ID": 251056,
            "ConnectionTypeID": 28,
            "StatusTypeID": 50,
            "LevelID": 2,
            "PowerKW": 22,
            "CurrentTypeID": 10
        }
    ],
    "GeneralComments": "Borne hors service",
    "StatusTypeID": 50,
    "DateLastStatusUpdate": "2020-08-27T05:16:00Z",
    "DataQualityLevel": 2,
    "DateCreated": "2020-03-15T10:55:00Z",
    "SubmissionStatusTypeID": 100
}