{
    "IsRecentlyVerified": false,
    "ID": 85920,
    "UUID": "817EB6A0-DDC0-42F5-9FC3-55837E19FDE3",
    "DataProviderID": 1,
    "OperatorID": 154,
    "UsageTypeID": 4,
    "AddressInfo": {
        "ID": 86266,
        "Title": "Gertrudenplatz",
        "AddressLine1": "Gertrudenplatz 2",
        "Town": "Rostock",
        "StateOrProvince": "Rostock",
        "Postcode": "18057",
        "CountryID": 87,
        "Latitude": 54.0879932,
        "Longitude": 12.1243721,
        "AccessComments": "Freischaltung mit Ladekarte der Stadtwerke oder Stromticket Handy App.",
        "RelatedURL": "https://www.swrag.de/privatkunden/mobilitaet/mobil-mit-strom/ladeinfrastruktur.html",
        "DistanceUnit": 0
    },
    "Connections": [
        {
            "ID": 122124,
            "ConnectionTypeID": 25,
            "StatusTypeID": 50,
            "LevelID": 2,
            "Amps": 32,
            "Voltage": 400,
            "PowerKW": 22,
            "CurrentTypeID": 20,
            "Quantity": 2
        }
    ],
    "NumberOfPoints": 2,
    "StatusTypeID": 50,
    "DateLastStatusUpdate": "2017-04-20T07:46:00Z",
    "DataQualityLevel": 1,
    "DateCreated": "2017-04-20T07:39:00Z",
    "SubmissionStatusTypeID": 200
}