{
    "IsRecentlyVerified": false,
    "ID": 129730,
    "UUID": "0F1D0BEE-0A0E-42C0-B74B-796D2B146CEB",
    "DataProviderID": 1,
    "OperatorID": 80,
    "UsageTypeID": 4,
    "AddressInfo": {
        "ID": 130076,
        "Title": "Civitavecchia Repubblica | EnelX",
        "AddressLine1": "Viale della Repubblica",
        "Town": "Civitavecchia",
        "StateOrProvince": "RM",
        "Postcode": "00053",
        "CountryID": 112,
        "Latitude": 42.08857909111754,
        "Longitude": 11.796628448134356,
        "ContactTelephone1": "800.069.850",
        "RelatedURL": "https://www.enelx.com/it/it/emobility",
        "DistanceUnit": 0
    },
    "Connections": [
        {
            "ID": 181595,
            "ConnectionTypeID": 25,
            "StatusTypeID": 50,
            "LevelID": 2,
            "Amps": 32,
            "Voltage": 400,
            "PowerKW": 22,
            "CurrentTypeID": 20,
            "Quantity": 2
        },
        {
            "ID": 181596,
            "ConnectionTypeID": 36,
            "StatusTypeID": 50,
            "LevelID": 2,
            "Amps": 16,
            "Voltage": 240,
            "PowerKW": 3.7,
            "CurrentTypeID": 10,
            "Quantity": 2
        }
    ],
    "NumberOfPoints": 4,
    "StatusTypeID": 50,
    "DateLastStatusUpdate": "2019-07-24T15:42:00Z",
    "DataQualityLevel": 1,
    "DateCreated": "2019-07-24T15:42:00Z",
    "SubmissionStatusTypeID": 200
}