{
    "UserComments": [
        {
            "ID": 641,
            "ChargePointID": 16545,
            "CommentTypeID": 10,
            "UserName": "Paul_Churchley",
            "Comment": "Stayed 1 night and charged successfully overnight. Friendly owner. Nice B&B",
            "Rating": 5,
            "DateCreated": "2014-01-22T00:16:32.827Z",
            "User": {
                "ID": 1099,
                "Username": "Paul_Churchley"
            },
            "CheckinStatusTypeID": 10
        }
    ],
    "MediaItems": [
        {
            "ID": 18399,
            "ChargePointID": 16545,
            "ItemURL": "https://s3-ap-southeast-2.amazonaws.com/openchargemap/images/GB/OCM16545/OCM-16545.orig.2019051512524890.jpeg",
            "ItemThumbnailURL": "https://s3-ap-southeast-2.amazonaws.com/openchargemap/images/GB/OCM16545/OCM-16545.thmb.2019051512524890.jpeg",
            "Comment": "",
            "IsEnabled": true,
            "IsVideo": false,
            "IsFeaturedItem": false,
            "IsExternalResource": false,
            "User": {
                "ID": 15366,
                "Username": "ZCWCara"
            },
            "DateCreated": "2019-05-15T12:53:00Z"
        }
    ],
    "IsRecentlyVerified": false,
    "ID": 16545,
    "UUID": "45917678-B4B1-4683-B18C-20B8DE49A16B",
    "DataProviderID": 1,
    "OperatorID": 19,
    "UsageTypeID": 1,
    "AddressInfo": {
        "ID": 16890,
        "Title": "Beeches Farmhouse B&B & Pig Wig Cottages Self Catering ",
        "AddressLine1": "Holt Road",
        "Town": "Bradford-on-Avon",
        "StateOrProvince": "Wiltshire",
        "Postcode": "BA15 1TS",
        "CountryID": 1,
        "Latitude": 51.348899,
        "Longitude": -2.22747,
        "ContactTelephone1": "01225 865170",
        "ContactEmail": "stay@beeches-farmhouse.co.uk",
        "RelatedURL": "http://www.beeches-farmhouse.co.uk",
        "DistanceUnit": 0
    },
    "Connections": [
        {
            "ID": 14994,
            "ConnectionTypeID": 25,
            "StatusTypeID": 50,
            "LevelID": 2,
            "Amps": 32,
            "Voltage": 230,
            "PowerKW": 7,
            "CurrentTypeID": 10,
            "Quantity": 1
        },
        {
            "ID": 14995,
            "ConnectionTypeID": 3,
            "StatusTypeID": 50,
            "LevelID": 2,
            "Amps": 13,
            "Voltage": 230,
            "PowerKW": 3,
            "CurrentTypeID": 10,
            "Quantity": 1
        }
    ],
    "NumberOfPoints": 2,
    "StatusTypeID": 50,
    "DateLastStatusUpdate": "2019-05-15T12:54:00Z",
    "DataQualityLevel": 1,
    "DateCreated": "2013-05-13T15:32:00Z",
    "SubmissionStatusTypeID": 200
}