{
    "UserComments": [
        {
            "ID": 4761,
            "ChargePointID": 48395,
            "CommentTypeID": 10,
            "UserName": "ZOE-Loki",
            "Comment": "nach Reparatur am 2015-06-18 wieder in Betrieb; bisher 2x dort geladen",
            "Rating": 5,
            "DateCreated": "2015-06-25T12:00:53.607Z",
            "User": {
                "ID": 4990,
                "Username": "ZOE-Loki"
            },
            "CheckinStatusTypeID": 15
        }
    ],
    "IsRecentlyVerified": false,
    "ID": 48395,
    "UUID": "F9DFC215-D8BC-4F78-8C5B-49D3A793B537",
    "DataProviderID": 1,
    "OperatorID": 3260,
    "UsageTypeID": 1,
    "UsageCost": "0,00",
    "AddressInfo": {
        "ID": 48741,
        "Title": "ene (Energie Nordeifel GmbH & Co. KG))",
        "AddressLine1": "Monzenbend",
        "AddressLine2": "B 266 / B 477",
        "Town": "Mechernich-Kommern",
        "StateOrProvince": "NW/Kreis Euskirchen",
        "Postcode": "53894",
        "CountryID": 87,
        "Latitude": 50.6192544951545,
        "Longitude": 6.65151152744441,
        "ContactTelephone1": "+49 2441 82-300",
        "ContactTelephone2": "an der Säule",
        "ContactEmail": "service@ene-eifel.de",
        "AccessComments": "ARAL-Tankstelle \"Monzenbend\" (24/7), nördlich B 266 / B 477, auf dem Tankstellen-Parkplatz rechts neben dem Tankstellen-Gebäude",
        "RelatedURL": "http://www.ene-eifel.de",
        "DistanceUnit": 0
    },
    "Connections": [
        {
            "ID": 59836,
            "ConnectionTypeID": 25,
            "StatusTypeID": 50,
            "LevelID": 2,
            "Amps": 32,
            "Voltage": 400,
            "PowerKW": 22,
            "CurrentTypeID": 20,
            "Quantity": 1
        },
        {
            "ID": 59837,
            "ConnectionTypeID": 28,
            "StatusTypeID": 200,
            "LevelID": 2,
            "Amps": 16,
            "Voltage": 230,
            "PowerKW": 3.7,
            "CurrentTypeID": 10,
            "Quantity": 2
        },
        {
            "ID": 59869,
            "ConnectionTypeID": 25,
            "StatusTypeID": 50,
            "LevelID": 2,
            "Amps": 16,
            "Voltage": 400,
            "PowerKW": 11,
            "CurrentTypeID": 20,
            "Quantity": 1
        }
    ],
    "NumberOfPoints": 1,
    "GeneralComments": "Ladesäule 24/7; Ladekarte ene erforderlich, evtl. roaming möglich; evtl. per SMS an Tel.-Nr. im Display der Ladesäule\r\nDoppel-Parkbucht auf dem Gelände der Tankstelle\r\nLadeleistung: 2x Mennekes Typ 2: links 16A / 11kW, rechts 32A / 22kW + 2x Schuko: 16A",
    "StatusTypeID": 50,
    "DateLastStatusUpdate": "2017-01-25T11:23:00Z",
    "DataQualityLevel": 1,
    "DateCreated": "2015-06-25T11:59:00Z",
    "SubmissionStatusTypeID": 200
}