{
    "UserComments": [
        {
            "ID": 20308,
            "ChargePointID": 109429,
            "CommentTypeID": 10,
            "UserName": "Robert Seemueller",
            "Rating": 5,
            "DateCreated": "2018-10-15T06:38:22.37Z",
            "User": {
                "ID": 19108,
                "Username": "Robert Seemueller"
            },
            "CheckinStatusTypeID": 140
        }
    ],
    "MediaItems": [
        {
            "ID": 16811,
            "ChargePointID": 109429,
            "ItemURL": "https://s3-ap-southeast-2.amazonaws.com/openchargemap/images/US/OCM109429/OCM-109429.orig.2018101506403353.jpg",
            "ItemThumbnailURL": "https://s3-ap-southeast-2.amazonaws.com/openchargemap/images/US/OCM109429/OCM-109429.thmb.2018101506403353.jpg",
            "Comment": "",
            "IsEnabled": true,
            "IsVideo": false,
            "IsFeaturedItem": false,
            "IsExternalResource": false,
            "User": {
                "ID": 19108,
                "Username": "Robert Seemueller"
            },
            "DateCreated": "2018-10-15T06:41:00Z"
        },
        {
            "ID": 16810,
            "ChargePointID": 109429,
            "ItemURL": "https://s3-ap-southeast-2.amazonaws.com/openchargemap/images/US/OCM109429/OCM-109429.orig.2018101506370273.jpg",
            "ItemThumbnailURL": "https://s3-ap-southeast-2.amazonaws.com/openchargemap/images/US/OCM109429/OCM-109429.thmb.2018101506370273.jpg",
            "Comment": "",
            "IsEnabled": true,
            "IsVideo": false,
            "IsFeaturedItem": false,
            "IsExternalResource": false,
            "User": {
                "ID": 19108,
                "Username": "Robert Seemueller"
            },
            "DateCreated": "2018-10-15T06:37:00Z"
        },
        {
            "ID": 16809,
            "ChargePointID": 109429,
            "ItemURL": "https://s3-ap-southeast-2.amazonaws.com/openchargemap/images/US/OCM109429/OCM-109429.orig.2018101506354789.jpg",
            "ItemThumbnailURL": "https://s3-ap-southeast-2.amazonaws.com/openchargemap/images/US/OCM109429/OCM-109429.thmb.2018101506354789.jpg",
            "Comment": "",
            "IsEnabled": true,
            "IsVideo": false,
            "IsFeaturedItem": false,
            "IsExternalResource": false,
            "User": {
                "ID": 19108,
                "Username": "Robert Seemueller"
            },
            "DateCreated": "2018-10-15T06:36:00Z"
        },
        {
            "ID": 16808,
            "ChargePointID": 109429,
            "ItemURL": "https://s3-ap-southeast-2.amazonaws.com/openchargemap/images/US/OCM109429/OCM-109429.orig.2018101506345632.jpg",
            "ItemThumbnailURL": "https://s3-ap-southeast-2.amazonaws.com/openchargemap/images/US/OCM109429/OCM-109429.thmb.2018101506345632.jpg",
            "Comment": "",
            "IsEnabled": true,
            "IsVideo": false,
            "IsFeaturedItem": false,
            "IsExternalResource": false,
            "User": {
                "ID": 19108,
                "Username": "Robert Seemueller"
            },
            "DateCreated": "2018-10-15T06:35:00Z"
        }
    ],
    "IsRecentlyVerified": false,
    "ID": 109429,
    "UUID": "7F617AA1-56E0-454C-AAED-7F852633B353",
    "DataProviderID": 1,
    "OperatorID": 1,
    "UsageTypeID": 1,
    "AddressInfo": {
        "ID": 109775,
        "Title": "Joe Basil Chevrolet",
        "AddressLine1": "5111 Transit Road",
        "Town": "Depew",
        "StateOrProvince": "NY",
        "Postcode": "14043",
        "CountryID": 2,
        "Latitude": 42.890705654132,
        "Longitude": -78.69626715216157,
        "DistanceUnit": 0
    },
    "Connections": [
        {
            "ID": 154590,
            "ConnectionTypeID": 1,
            "StatusTypeID": 50,
            "LevelID": 2,
            "Quantity": 3
        },
        {
            "ID": 154591,
            "ConnectionTypeID": 32,
            "StatusTypeID": 50,
            "LevelID": 3,
            "Quantity": 1
        }
    ],
    "NumberOfPoints": 3,
    "StatusTypeID": 50,
    "DateLastStatusUpdate": "2018-10-15T09:57:00Z",
    "DataQualityLevel": 1,
    "DateCreated": "2018-10-15T06:34:00Z",
    "SubmissionStatusTypeID": 200
}