{
    "IsRecentlyVerified": false,
    "ID": 27681,
    "UUID": "87DF5CE5-EF80-4219-BC95-7B70AE2A600A",
    "DataProviderID": 2,
    "DataProvidersReference": "63968",
    "OperatorID": 5,
    "UsageTypeID": 1,
    "AddressInfo": {
        "ID": 28027,
        "Title": "SDMC  AUX STN",
        "AddressLine1": "3901 Lone Tree Way",
        "Town": "Antioch",
        "StateOrProvince": "CA",
        "Postcode": "94509",
        "CountryID": 2,
        "Latitude": 37.981732,
        "Longitude": -121.8040522,
        "ContactTelephone1": "888-758-4389",
        "AccessComments": "24 hours daily",
        "RelatedURL": "http://www.chargepoint.com/",
        "DistanceUnit": 0
    },
    "Connections": [
        {
            "ID": 30368,
            "ConnectionTypeID": 1,
            "LevelID": 2,
            "Amps": 16,
            "Voltage": 230,
            "PowerKW": 3,
            "CurrentTypeID": 10,
            "Quantity": 2
        }
    ],
    "DateLastStatusUpdate": "2019-04-06T04:02:00Z",
    "DataQualityLevel": 3,
    "DateCreated": "2014-11-28T03:38:00Z",
    "SubmissionStatusTypeID": 100
}