{
    "IsRecentlyVerified": false,
    "ID": 38788,
    "UUID": "B11835AF-0E09-438E-86BD-2D252B3D0412",
    "DataProviderID": 1,
    "OperatorID": 103,
    "OperatorsReference": "Allego NLAMSEEFAC00253",
    "UsageTypeID": 4,
    "AddressInfo": {
        "ID": 39134,
        "Title": "Green Planet Pesse",
        "AddressLine1": "Bultinge 2",
        "Town": "Pesse",
        "Postcode": "7933 TZ",
        "CountryID": 159,
        "Latitude": 52.774342,
        "Longitude": 6.44522,
        "ContactTelephone1": "0800-3745337",
        "RelatedURL": "http://www.allego.eu/",
        "DistanceUnit": 0
    },
    "Connections": [
        {
            "ID": 42299,
            "ConnectionTypeID": 25,
            "StatusTypeID": 50,
            "LevelID": 2,
            "Amps": 32,
            "Voltage": 220,
            "PowerKW": 43,
            "CurrentTypeID": 20,
            "Quantity": 1
        },
        {
            "ID": 49777,
            "ConnectionTypeID": 33,
            "StatusTypeID": 50,
            "LevelID": 3,
            "Amps": 120,
            "Voltage": 400,
            "PowerKW": 50,
            "CurrentTypeID": 30,
            "Quantity": 1
        },
        {
            "ID": 49778,
            "ConnectionTypeID": 2,
            "StatusTypeID": 50,
            "LevelID": 3,
            "Amps": 120,
            "Voltage": 400,
            "PowerKW": 50,
            "CurrentTypeID": 30,
            "Quantity": 1
        }
    ],
    "NumberOfPoints": 1,
    "GeneralComments": "Allego NLAMSEEFAC00253",
    "StatusTypeID": 50,
    "DateLastStatusUpdate": "2015-03-24T16:17:00Z",
    "DataQualityLevel": 3,
    "DateCreated": "2015-01-09T06:08:00Z",
    "SubmissionStatusTypeID": 100
}