{
    "MediaItems": [
        {
            "ID": 17852,
            "ChargePointID": 118569,
            "ItemURL": "https://s3-ap-southeast-2.amazonaws.com/openchargemap/images/UA/OCM118569/OCM-118569.orig.2019032515054566.jpg",
            "ItemThumbnailURL": "https://s3-ap-southeast-2.amazonaws.com/openchargemap/images/UA/OCM118569/OCM-118569.thmb.2019032515054566.jpg",
            "Comment": "",
            "IsEnabled": true,
            "IsVideo": false,
            "IsFeaturedItem": false,
            "IsExternalResource": false,
            "User": {
                "ID": 20255,
                "Username": "STRUM Charging"
            },
            "DateCreated": "2019-03-25T15:06:00Z"
        },
        {
            "ID": 17851,
            "ChargePointID": 118569,
            "ItemURL": "https://s3-ap-southeast-2.amazonaws.com/openchargemap/images/UA/OCM118569/OCM-118569.orig.2019032515005127.jpg",
            "ItemThumbnailURL": "https://s3-ap-southeast-2.amazonaws.com/openchargemap/images/UA/OCM118569/OCM-118569.thmb.2019032515005127.jpg",
            "Comment": "",
            "IsEnabled": true,
            "IsVideo": false,
            "IsFeaturedItem": false,
            "IsExternalResource": false,
            "User": {
                "ID": 20255,
                "Username": "STRUM Charging"
            },
            "DateCreated": "2019-03-25T15:01:00Z"
        }
    ],
    "IsRecentlyVerified": false,
    "ID": 118569,
    "UUID": "618C6598-C4A7-4711-9F99-C9738DA3FC4C",
    "DataProviderID": 1,
    "OperatorID": 3344,
    "UsageTypeID": 4,
    "UsageCost": "DC - 9 UAH/kWh (≈0.30 €/kWh), AC - 4.5 UAH/kWh (≈0.15 €/kWh). No fees for time or session.",
    "AddressInfo": {
        "ID": 118915,
        "Title": "STRUM 50 kW (Prospect Auchan)",
        "AddressLine1": "Gnata Khotkevicha Str. 1B",
        "Town": "Kyiv",
        "StateOrProvince": "Днепровский район",
        "Postcode": "02090",
        "CountryID": 234,
        "Latitude": 50.4543286410646,
        "Longitude": 30.6386094722981,
        "ContactTelephone1": "0-800-212-333",
        "ContactEmail": "support.strum@dtek.com",
        "AccessComments": "Entrance from the parking of AUCHAN from the Magnitogorskiy lane. Parking is free. Working hours - 8:00-23:00.",
        "RelatedURL": "http://strum.dtek.com",
        "DistanceUnit": 0
    },
    "Connections": [
        {
            "ID": 167677,
            "ConnectionTypeID": 2,
            "StatusTypeID": 50,
            "LevelID": 3,
            "Amps": 125,
            "Voltage": 400,
            "PowerKW": 50,
            "CurrentTypeID": 30,
            "Quantity": 1
        },
        {
            "ID": 167678,
            "ConnectionTypeID": 33,
            "StatusTypeID": 50,
            "LevelID": 3,
            "Amps": 125,
            "Voltage": 400,
            "PowerKW": 50,
            "CurrentTypeID": 30,
            "Quantity": 1
        },
        {
            "ID": 167679,
            "ConnectionTypeID": 25,
            "StatusTypeID": 50,
            "LevelID": 2,
            "Amps": 32,
            "Voltage": 400,
            "PowerKW": 22,
            "CurrentTypeID": 20,
            "Quantity": 1
        }
    ],
    "NumberOfPoints": 3,
    "GeneralComments": "Registration, top-up & charging via 'STRUM Charging' mobile app (iOS/Android), at least 25.00 kWh must be available on the account at the start of each charging session. Parking is free. You can book your STRUM card only after registrartion & top-up by sending request to support.strum@dtek.com.\r\n\r\nYou pay only for kWh, no fees for time or session. Price during top up is 9 UAH/KWH (≈ 0.3 €/KWH). While charging on CHAdeMO/CCS, 1 KWH is taken away for each 1 kWh of charging. While charging on Type2, 0.5 KWH is taken away for each 1 kWh of charging (half price). Actual prices at http://strum.dtek.com/en/prices/.\r\n\r\nAndroid App download - https://play.google.com/store/apps/details?id=com.beenergised.chargemobile.dtek&hl=en\r\niOS App download - https://itunes.apple.com/us/app/strum-charging/id1368596475?mt=8",
    "StatusTypeID": 50,
    "DateLastStatusUpdate": "2019-03-25T22:56:00Z",
    "DataQualityLevel": 1,
    "DateCreated": "2019-03-25T14:56:00Z",
    "SubmissionStatusTypeID": 200
}