{
    "IsRecentlyVerified": false,
    "ID": 105949,
    "UUID": "516EA873-469F-4134-BA52-2FDFE4E3CFD8",
    "DataProviderID": 1,
    "OperatorID": 46,
    "UsageTypeID": 4,
    "AddressInfo": {
        "ID": 106295,
        "Title": "Rathaus",
        "AddressLine1": "Hauptstraße 31",
        "Town": "Jandelsbrunn",
        "StateOrProvince": "Landkreis Freyung-Grafenau",
        "Postcode": "94118",
        "CountryID": 87,
        "Latitude": 48.7299827,
        "Longitude": 13.69249949999994,
        "RelatedURL": "http://www.eon-drive.de/",
        "DistanceUnit": 0
    },
    "Connections": [
        {
            "ID": 149192,
            "ConnectionTypeID": 25,
            "StatusTypeID": 50,
            "LevelID": 2,
            "Amps": 32,
            "Voltage": 400,
            "PowerKW": 22,
            "CurrentTypeID": 20,
            "Quantity": 2
        }
    ],
    "NumberOfPoints": 2,
    "StatusTypeID": 50,
    "DateLastStatusUpdate": "2018-06-12T06:38:00Z",
    "DataQualityLevel": 1,
    "DateCreated": "2018-06-12T06:38:00Z",
    "SubmissionStatusTypeID": 200
}