{
    "IsRecentlyVerified": false,
    "ID": 6954,
    "UUID": "5D6F7DA9-0528-4CFA-BC52-ACC0A567AB2F",
    "DataProviderID": 1,
    "UsageTypeID": 1,
    "UsageCost": "Free",
    "AddressInfo": {
        "ID": 6855,
        "Title": "Parking Saint Sever",
        "AddressLine1": "Centre commercial Saint Sever     ",
        "AddressLine2": "",
        "Town": " Rouen",
        "StateOrProvince": "",
        "Postcode": "76100",
        "CountryID": 80,
        "Latitude": 49.4339688,
        "Longitude": 1.0775888000000577,
        "ContactTelephone1": "+33 2 35 63 82 82",
        "ContactTelephone2": "",
        "ContactEmail": "",
        "AccessComments": "",
        "DistanceUnit": 0
    },
    "Connections": [],
    "NumberOfPoints": 1,
    "GeneralComments": "",
    "DateLastConfirmed": "2011-10-10T20:50:00Z",
    "StatusTypeID": 0,
    "DateLastStatusUpdate": "2011-10-11T09:26:00Z",
    "DataQualityLevel": 1,
    "DateCreated": "2011-10-10T20:50:00Z",
    "SubmissionStatusTypeID": 200
}