{
    "IsRecentlyVerified": false,
    "ID": 91203,
    "UUID": "7E1A4BDA-A796-4AC6-99AE-D332F9F2FDD4",
    "DataProviderID": 1,
    "OperatorID": 23,
    "OperatorsReference": "32468",
    "UsageTypeID": 4,
    "AddressInfo": {
        "ID": 91549,
        "Title": "Super 8 Sioux Falls",
        "AddressLine1": "2616 E 10th St",
        "Town": "Sioux Falls",
        "StateOrProvince": "South Dakota",
        "Postcode": "57103",
        "CountryID": 2,
        "Latitude": 43.547096,
        "Longitude": -96.693196,
        "ContactTelephone1": "(605) 338-8881",
        "DistanceUnit": 0
    },
    "Connections": [
        {
            "ID": 129334,
            "ConnectionTypeID": 30,
            "StatusTypeID": 50,
            "LevelID": 2,
            "PowerKW": 16,
            "CurrentTypeID": 20,
            "Quantity": 3
        }
    ],
    "NumberOfPoints": 3,
    "GeneralComments": "3 Tesla Connectors, up to 16kW.Available for customers. Please see front desk.",
    "StatusTypeID": 50,
    "DateLastStatusUpdate": "2017-08-02T05:32:00Z",
    "DataQualityLevel": 1,
    "DateCreated": "2017-08-02T05:32:00Z",
    "SubmissionStatusTypeID": 200
}