{
    "IsRecentlyVerified": false,
    "ID": 180002,
    "UUID": "9B3665E9-0B65-48FD-B01D-6DA850154270",
    "DataProviderID": 29,
    "DataProvidersReference": "14564",
    "OperatorID": 127,
    "AddressInfo": {
        "ID": 180361,
        "Title": "Osterstef",
        "AddressLine1": "Osterstef",
        "Town": "Leer",
        "Postcode": "26789",
        "CountryID": 87,
        "Latitude": 53.230563422008,
        "Longitude": 7.454772198253,
        "DistanceUnit": 0
    },
    "Connections": [
        {
            "ID": 282568,
            "ConnectionTypeID": 25,
            "StatusTypeID": 50,
            "LevelID": 2,
            "PowerKW": 22,
            "CurrentTypeID": 20
        },
        {
            "ID": 282569,
            "ConnectionTypeID": 25,
            "StatusTypeID": 50,
            "LevelID": 2,
            "PowerKW": 22,
            "CurrentTypeID": 20
        }
    ],
    "StatusTypeID": 50,
    "DateLastStatusUpdate": "2021-07-12T02:50:00Z",
    "MetadataValues": [
        {
            "ID": 12296,
            "MetadataFieldID": 4,
            "ItemValue": "Data from the German chargepoint registry provided by Bundesnetzagentur.de under the CC-BY 4.0 license"
        }
    ],
    "DataQualityLevel": 3,
    "DateCreated": "2021-07-08T10:00:00Z",
    "SubmissionStatusTypeID": 100
}