{
    "IsRecentlyVerified": false,
    "ID": 102859,
    "UUID": "DE687D62-924E-4003-8F6F-9F73BDC31D3E",
    "DataProviderID": 2,
    "DataProvidersReference": "94824",
    "UsageTypeID": 1,
    "AddressInfo": {
        "ID": 103205,
        "Title": "ADP - Parsippany",
        "AddressLine1": "15 Waterview Blvd",
        "Town": "Parsippany",
        "StateOrProvince": "NJ",
        "Postcode": "07054",
        "CountryID": 2,
        "Latitude": 40.873017,
        "Longitude": -74.42595,
        "ContactTelephone1": "866-816-7584",
        "AccessComments": "Office business hours; for employee and guest use only",
        "RelatedURL": "http://evconnect.com/",
        "DistanceUnit": 0
    },
    "Connections": [
        {
            "ID": 145000,
            "ConnectionTypeID": 1,
            "LevelID": 2,
            "Amps": 16,
            "Voltage": 230,
            "PowerKW": 3,
            "CurrentTypeID": 10,
            "Quantity": 2
        }
    ],
    "DateLastStatusUpdate": "2019-04-06T05:05:00Z",
    "DataQualityLevel": 3,
    "DateCreated": "2018-04-21T04:13:00Z",
    "SubmissionStatusTypeID": 100
}