{
    "IsRecentlyVerified": false,
    "ID": 42563,
    "UUID": "E6CEE8A2-0FBE-4DA8-B365-7FAD79642ABA",
    "DataProviderID": 1,
    "OperatorID": 45,
    "UsageTypeID": 3,
    "AddressInfo": {
        "ID": 42909,
        "Title": "Baumarkt Bauhaus Wuppertal-Barmen (Lichtscheid)",
        "AddressLine1": "Oberbergische Straße 200",
        "Town": "Wuppertal",
        "StateOrProvince": "Wuppertal",
        "Postcode": "42285",
        "CountryID": 87,
        "Latitude": 51.2445880468569,
        "Longitude": 7.18895988720669,
        "ContactTelephone1": "+49 202 527068 0",
        "ContactEmail": "Service.NL868@bauhaus-ag.de",
        "AccessComments": "Kostenloses Laden auf dem Kundenparkplatz am großen Kreisverkehr. Geöffnet von Mo-Sa 7-20Uhr. Ladekarte im Baumarkt (Pfand: Personalausweis) ausleihen.",
        "RelatedURL": "http://www.bauhaus.info/fachcentren/fachcentrum-wuppertal-barmen%28lichtscheid%29/fc/868",
        "DistanceUnit": 0
    },
    "Connections": [
        {
            "ID": 51274,
            "ConnectionTypeID": 25,
            "StatusTypeID": 50,
            "LevelID": 2,
            "Amps": 16,
            "Voltage": 400,
            "PowerKW": 11,
            "CurrentTypeID": 20,
            "Quantity": 1
        }
    ],
    "NumberOfPoints": 1,
    "StatusTypeID": 50,
    "DateLastStatusUpdate": "2015-03-16T10:37:00Z",
    "DataQualityLevel": 1,
    "DateCreated": "2015-03-16T07:45:00Z",
    "SubmissionStatusTypeID": 200
}