{
    "IsRecentlyVerified": false,
    "ID": 73793,
    "UUID": "83A565B4-BED7-4247-85F3-9B81E0FB2343",
    "DataProviderID": 1,
    "OperatorID": 89,
    "OperatorsReference": "CEA-458",
    "UsageTypeID": 4,
    "UsageCost": "CAD 1.00/hour",
    "AddressInfo": {
        "ID": 74139,
        "Title": "Shawinigan-Centre des Arts",
        "AddressLine1": "2100 boul des Hêtres",
        "Town": "Shawinigan",
        "StateOrProvince": "QC",
        "Postcode": "G9N 8R8",
        "CountryID": 44,
        "Latitude": 46.559439,
        "Longitude": -72.74793,
        "DistanceUnit": 0
    },
    "Connections": [
        {
            "ID": 106098,
            "ConnectionTypeID": 1,
            "StatusTypeID": 50,
            "LevelID": 2,
            "Amps": 32,
            "Voltage": 230,
            "PowerKW": 7,
            "CurrentTypeID": 10,
            "Quantity": 1
        }
    ],
    "NumberOfPoints": 1,
    "StatusTypeID": 50,
    "DateLastStatusUpdate": "2016-11-27T20:02:00Z",
    "DataQualityLevel": 1,
    "DateCreated": "2016-11-23T23:06:00Z",
    "SubmissionStatusTypeID": 200
}