{
    "IsRecentlyVerified": false,
    "ID": 56453,
    "UUID": "2757E650-9AA6-4640-A265-0D1B9A008128",
    "DataProviderID": 1,
    "OperatorID": 23,
    "OperatorsReference": "6803",
    "UsageTypeID": 1,
    "UsageCost": "Free",
    "AddressInfo": {
        "ID": 56799,
        "Title": "The Ritz-Carlton - Tesla",
        "AddressLine1": "4375 Admiralty Way",
        "Town": "Marina del Rey",
        "StateOrProvince": "CA",
        "Postcode": "90292",
        "CountryID": 2,
        "Latitude": 33.9843113,
        "Longitude": -118.450735,
        "ContactTelephone1": "310-823-1700  877-798-3752",
        "AccessComments": "24 hours daily; for Tesla use only; for guest use only; see valet for access",
        "RelatedURL": "http://www.teslamotors.com/supercharger",
        "DistanceUnit": 0
    },
    "Connections": [
        {
            "ID": 71210,
            "ConnectionTypeID": 30,
            "StatusTypeID": 50,
            "LevelID": 2,
            "Amps": 16,
            "Voltage": 230,
            "PowerKW": 16,
            "CurrentTypeID": 10,
            "Quantity": 2
        }
    ],
    "NumberOfPoints": 2,
    "StatusTypeID": 50,
    "DateLastStatusUpdate": "2017-01-31T22:35:00Z",
    "DataQualityLevel": 3,
    "DateCreated": "2015-11-04T08:42:00Z",
    "SubmissionStatusTypeID": 100
}