{
    "IsRecentlyVerified": false,
    "ID": 87911,
    "UUID": "0FA1DBDB-2A38-4B67-AE8C-DDD89797A7E4",
    "DataProviderID": 1,
    "OperatorID": 23,
    "OperatorsReference": "29744",
    "UsageTypeID": 4,
    "AddressInfo": {
        "ID": 88257,
        "Title": "National Athletic Village",
        "AddressLine1": "201 Air Tool DR",
        "Town": "Southern Pines",
        "StateOrProvince": "North Carolina",
        "Postcode": "28387",
        "CountryID": 2,
        "Latitude": 35.194297,
        "Longitude": -79.373228,
        "ContactTelephone1": "(910) 585-3212",
        "DistanceUnit": 0
    },
    "Connections": [
        {
            "ID": 124720,
            "ConnectionTypeID": 30,
            "StatusTypeID": 50,
            "LevelID": 2,
            "PowerKW": 16,
            "CurrentTypeID": 20,
            "Quantity": 2
        }
    ],
    "NumberOfPoints": 2,
    "GeneralComments": "2 Tesla Connectors, up to 16kW.Available to the public. Self park.",
    "StatusTypeID": 50,
    "DateLastStatusUpdate": "2017-05-18T05:40:00Z",
    "DataQualityLevel": 1,
    "DateCreated": "2017-05-18T05:40:00Z",
    "SubmissionStatusTypeID": 200
}