{
    "IsRecentlyVerified": false,
    "ID": 64068,
    "UUID": "DEBB3454-8CC3-4719-ADA6-B495DF7AE4F2",
    "DataProviderID": 26,
    "DataProvidersReference": "82975",
    "OperatorID": 103,
    "OperatorsReference": "Allego NLALLEGO0005012",
    "UsageCost": "0.00 jaarabonnement",
    "AddressInfo": {
        "ID": 64414,
        "Title": "Grote Oost 40",
        "AddressLine1": "Grote Oost 40",
        "Town": "Hoorn",
        "Postcode": "1621 BW",
        "CountryID": 159,
        "Latitude": 52.63946902,
        "Longitude": 5.06209237,
        "ContactTelephone1": "0800-3745337",
        "RelatedURL": "http://www.allego.eu/",
        "DistanceUnit": 0
    },
    "Connections": [
        {
            "ID": 81927,
            "ConnectionTypeID": 25,
            "LevelID": 2,
            "PowerKW": 11,
            "CurrentTypeID": 10
        },
        {
            "ID": 81928,
            "ConnectionTypeID": 25,
            "LevelID": 2,
            "PowerKW": 11,
            "CurrentTypeID": 10
        }
    ],
    "NumberOfPoints": 1,
    "StatusTypeID": 50,
    "DateLastStatusUpdate": "2016-06-04T02:55:00Z",
    "DataQualityLevel": 3,
    "DateCreated": "2016-03-03T12:32:00Z",
    "SubmissionStatusTypeID": 100
}