{
    "IsRecentlyVerified": false,
    "ID": 53623,
    "UUID": "3B4E314C-297C-468B-9EFA-329ECE2572B0",
    "DataProviderID": 1,
    "OperatorID": 105,
    "OperatorsReference": "Essent EM-DE-09572158-01-00002",
    "UsageTypeID": 4,
    "AddressInfo": {
        "ID": 53969,
        "Title": "Marloffsteiner Straße 10a",
        "AddressLine1": "Marloffsteiner Straße 10a",
        "Town": "Uttenreuth",
        "Postcode": "91080",
        "CountryID": 87,
        "Latitude": 49.597333,
        "Longitude": 11.074556,
        "DistanceUnit": 0
    },
    "Connections": [
        {
            "ID": 66801,
            "ConnectionTypeID": 25,
            "StatusTypeID": 50,
            "LevelID": 2,
            "Amps": 32,
            "Voltage": 400,
            "PowerKW": 22,
            "CurrentTypeID": 20,
            "Quantity": 2
        }
    ],
    "NumberOfPoints": 2,
    "StatusTypeID": 50,
    "DateLastStatusUpdate": "2015-09-30T12:44:00Z",
    "DataQualityLevel": 3,
    "DateCreated": "2015-09-20T11:50:00Z",
    "SubmissionStatusTypeID": 200
}