{
    "IsRecentlyVerified": false,
    "ID": 129141,
    "UUID": "745B66F4-27CC-4006-9588-EE354D956297",
    "DataProviderID": 1,
    "OperatorID": 23,
    "OperatorsReference": "51089",
    "UsageTypeID": 4,
    "AddressInfo": {
        "ID": 129487,
        "Title": "Caesars Palace Bluewaters Dubai",
        "AddressLine1": "Bluewaters Island",
        "Town": "Dubai",
        "CountryID": 235,
        "Latitude": 25.08077,
        "Longitude": 55.120719,
        "ContactTelephone1": "+971 (4) 556 6666",
        "DistanceUnit": 0
    },
    "Connections": [
        {
            "ID": 180789,
            "ConnectionTypeID": 30,
            "StatusTypeID": 50,
            "LevelID": 2,
            "PowerKW": 22,
            "CurrentTypeID": 20,
            "Quantity": 2
        }
    ],
    "NumberOfPoints": 2,
    "GeneralComments": "2 Tesla Connectors, up to 22kW.Available for customers. Self park.",
    "StatusTypeID": 50,
    "DateLastStatusUpdate": "2019-07-15T16:05:00Z",
    "DataQualityLevel": 1,
    "DateCreated": "2019-07-15T16:05:00Z",
    "SubmissionStatusTypeID": 200
}