{
    "IsRecentlyVerified": false,
    "ID": 115490,
    "UUID": "7D36D678-4BF0-4854-99F6-35D5FB9189CF",
    "DataProviderID": 2,
    "DataProvidersReference": "113170",
    "OperatorID": 23,
    "UsageTypeID": 2,
    "AddressInfo": {
        "ID": 115836,
        "Title": "Airbnb - Newbury Park - Tesla Destination",
        "AddressLine1": "1323 Kathleen Dr",
        "Town": "Newbury Park",
        "StateOrProvince": "CA",
        "Postcode": "91320",
        "CountryID": 2,
        "Latitude": 34.172184,
        "Longitude": -118.909239,
        "ContactTelephone1": "",
        "AccessComments": "Available for Airbnb patrons only; for Tesla use only",
        "RelatedURL": "https://www.tesla.com/destination-charging",
        "DistanceUnit": 0
    },
    "Connections": [
        {
            "ID": 162504,
            "ConnectionTypeID": 0,
            "LevelID": 2,
            "Amps": 16,
            "Voltage": 230,
            "PowerKW": 3,
            "CurrentTypeID": 10,
            "Quantity": 1
        }
    ],
    "DateLastStatusUpdate": "2019-04-06T04:01:00Z",
    "DataQualityLevel": 3,
    "DateCreated": "2019-02-11T07:13:00Z",
    "SubmissionStatusTypeID": 100
}