{
    "IsRecentlyVerified": false,
    "ID": 72060,
    "UUID": "D47A3153-D59B-446D-B459-D74EA3FD93DF",
    "DataProviderID": 1,
    "OperatorID": 45,
    "UsageTypeID": 3,
    "AddressInfo": {
        "ID": 72406,
        "Title": "Autohaus Ahnefeldt",
        "AddressLine1": "Hagenower Chaussee 1b",
        "Town": "Schwerin",
        "StateOrProvince": "Mecklenburg-Vorpommern",
        "Postcode": "19061",
        "CountryID": 87,
        "Latitude": 53.59504279999999,
        "Longitude": 11.41467739999996,
        "AccessComments": "24/7 zugänglicher (aber oft zugeparkter) CCS Lader vor dem VW/Skoda/Audi Autohaus, Typ 2 Lader hinter dem Autohaus. Laden kostenlos.",
        "RelatedURL": "http://www.autohaus-ahnefeld.de/",
        "DistanceUnit": 0
    },
    "Connections": [
        {
            "ID": 103338,
            "ConnectionTypeID": 33,
            "StatusTypeID": 50,
            "LevelID": 3,
            "PowerKW": 50,
            "CurrentTypeID": 30,
            "Quantity": 1
        },
        {
            "ID": 103339,
            "ConnectionTypeID": 25,
            "StatusTypeID": 50,
            "LevelID": 2,
            "Amps": 32,
            "Voltage": 400,
            "PowerKW": 22,
            "CurrentTypeID": 20,
            "Quantity": 1
        },
        {
            "ID": 103340,
            "ConnectionTypeID": 1036,
            "StatusTypeID": 50,
            "LevelID": 2,
            "Amps": 16,
            "Voltage": 230,
            "PowerKW": 3.7,
            "CurrentTypeID": 10,
            "Quantity": 2
        }
    ],
    "NumberOfPoints": 4,
    "StatusTypeID": 50,
    "DateLastStatusUpdate": "2016-10-04T07:46:00Z",
    "DataQualityLevel": 1,
    "DateCreated": "2016-10-04T07:46:00Z",
    "SubmissionStatusTypeID": 200
}