{
    "IsRecentlyVerified": false,
    "ID": 20356,
    "UUID": "A01AE954-57D6-4CFD-B5E7-2D6D79CF61CC",
    "DataProviderID": 1,
    "OperatorID": 1,
    "UsageTypeID": 0,
    "UsageCost": "",
    "AddressInfo": {
        "ID": 20701,
        "Title": "Rentelectrix - Grasse",
        "AddressLine1": "48 Avenue de la Libération ",
        "AddressLine2": "",
        "Town": "Grasse",
        "StateOrProvince": "",
        "Postcode": "06130 ",
        "CountryID": 80,
        "Latitude": 43.64776,
        "Longitude": 6.91328,
        "ContactTelephone1": "",
        "ContactTelephone2": "",
        "ContactEmail": "",
        "AccessComments": "Ouvert à tous",
        "RelatedURL": "",
        "DistanceUnit": 0
    },
    "Connections": [],
    "GeneralComments": "",
    "StatusTypeID": 50,
    "DateLastStatusUpdate": "2013-11-12T19:37:00Z",
    "DataQualityLevel": 1,
    "DateCreated": "2013-11-12T09:43:00Z",
    "SubmissionStatusTypeID": 200
}