{
    "IsRecentlyVerified": false,
    "ID": 152310,
    "UUID": "EB46E80C-9841-4A6F-AC2D-0A439F683C86",
    "DataProviderID": 28,
    "DataProvidersReference": "FRSEOPAB12002A",
    "OperatorID": 3383,
    "UsageTypeID": 5,
    "AddressInfo": {
        "ID": 152663,
        "Title": "Réseau AlterBase - Geay - Mairie",
        "AddressLine1": "Place de la Mairie - 79330 GEAY",
        "CountryID": 80,
        "Latitude": 46.87922,
        "Longitude": -0.326927,
        "AccessComments": "24/24 7/7 jours",
        "DistanceUnit": 0
    },
    "Connections": [
        {
            "ID": 213183,
            "ConnectionTypeID": 28,
            "StatusTypeID": 50,
            "LevelID": 2,
            "PowerKW": 3.18,
            "CurrentTypeID": 10
        },
        {
            "ID": 213184,
            "ConnectionTypeID": 26,
            "StatusTypeID": 50,
            "LevelID": 2,
            "PowerKW": 3.18
        },
        {
            "ID": 246048,
            "ConnectionTypeID": 26,
            "StatusTypeID": 50,
            "LevelID": 2,
            "PowerKW": 3.18
        },
        {
            "ID": 246049,
            "ConnectionTypeID": 28,
            "StatusTypeID": 50,
            "LevelID": 2,
            "PowerKW": 3.18,
            "CurrentTypeID": 10
        }
    ],
    "GeneralComments": "www.alterbase.fr",
    "StatusTypeID": 50,
    "DateLastStatusUpdate": "2020-08-27T05:13:00Z",
    "DataQualityLevel": 2,
    "DateCreated": "2020-03-15T10:53:00Z",
    "SubmissionStatusTypeID": 100
}