{
    "IsRecentlyVerified": false,
    "ID": 145732,
    "UUID": "9C0C647B-5363-4D31-93D0-252F41A6FA2F",
    "DataProviderID": 2,
    "DataProvidersReference": "137140",
    "OperatorID": 89,
    "UsageTypeID": 1,
    "AddressInfo": {
        "ID": 146084,
        "Title": "980 Howe Street",
        "AddressLine1": "980 Howe Street",
        "Town": "Vancouver",
        "StateOrProvince": "BC",
        "Postcode": "V6Z 0C8",
        "CountryID": 44,
        "Latitude": 49.279945,
        "Longitude": -123.123605,
        "ContactTelephone1": "888-356-8911",
        "AccessComments": "24 hours daily",
        "RelatedURL": "https://flo.ca/",
        "DistanceUnit": 0
    },
    "Connections": [
        {
            "ID": 202459,
            "ConnectionTypeID": 1,
            "LevelID": 2,
            "Amps": 16,
            "Voltage": 230,
            "PowerKW": 3.7,
            "CurrentTypeID": 10,
            "Quantity": 7
        }
    ],
    "StatusTypeID": 50,
    "DateLastStatusUpdate": "2020-06-26T03:12:00Z",
    "DataQualityLevel": 3,
    "DateCreated": "2019-12-24T09:25:00Z",
    "SubmissionStatusTypeID": 100
}