{
    "IsRecentlyVerified": false,
    "ID": 182459,
    "UUID": "B96F64FF-3DC0-465A-8DB9-424A9BB94656",
    "DataProviderID": 29,
    "DataProvidersReference": "16790",
    "AddressInfo": {
        "ID": 182818,
        "Title": "Am Anger 19",
        "AddressLine1": "Am Anger 19",
        "Town": "Wiehe",
        "Postcode": "06571",
        "CountryID": 87,
        "Latitude": 51.261489,
        "Longitude": 11.420223,
        "DistanceUnit": 0
    },
    "Connections": [
        {
            "ID": 288231,
            "ConnectionTypeID": 25,
            "StatusTypeID": 50,
            "LevelID": 2,
            "PowerKW": 22,
            "CurrentTypeID": 20
        },
        {
            "ID": 288232,
            "ConnectionTypeID": 25,
            "StatusTypeID": 50,
            "LevelID": 2,
            "PowerKW": 22,
            "CurrentTypeID": 20
        }
    ],
    "StatusTypeID": 50,
    "DateLastStatusUpdate": "2021-07-09T03:22:00Z",
    "MetadataValues": [
        {
            "ID": 14752,
            "MetadataFieldID": 4,
            "ItemValue": "Data from the German chargepoint registry provided by Bundesnetzagentur.de under the CC-BY 4.0 license"
        }
    ],
    "DataQualityLevel": 3,
    "DateCreated": "2021-07-08T10:03:00Z",
    "SubmissionStatusTypeID": 100
}