{
    "IsRecentlyVerified": false,
    "ID": 179543,
    "UUID": "690AC389-D913-4B5F-A724-CCD2D4B6C4AA",
    "DataProviderID": 29,
    "DataProvidersReference": "14185",
    "OperatorID": 45,
    "AddressInfo": {
        "ID": 179902,
        "Title": "Eisenbahnstraße 24",
        "AddressLine1": "Eisenbahnstraße 24",
        "Town": "Mosbach",
        "Postcode": "74821",
        "CountryID": 87,
        "Latitude": 49.351619,
        "Longitude": 9.140536,
        "DistanceUnit": 0
    },
    "Connections": [
        {
            "ID": 281502,
            "ConnectionTypeID": 25,
            "StatusTypeID": 50,
            "LevelID": 2,
            "PowerKW": 22,
            "CurrentTypeID": 20
        },
        {
            "ID": 281503,
            "ConnectionTypeID": 25,
            "StatusTypeID": 50,
            "LevelID": 2,
            "PowerKW": 22,
            "CurrentTypeID": 20
        }
    ],
    "StatusTypeID": 50,
    "DateLastStatusUpdate": "2021-07-09T03:16:00Z",
    "MetadataValues": [
        {
            "ID": 11837,
            "MetadataFieldID": 4,
            "ItemValue": "Data from the German chargepoint registry provided by Bundesnetzagentur.de under the CC-BY 4.0 license"
        }
    ],
    "DataQualityLevel": 3,
    "DateCreated": "2021-07-08T09:59:00Z",
    "SubmissionStatusTypeID": 100
}