{
    "IsRecentlyVerified": false,
    "ID": 42923,
    "UUID": "B7D51E92-49F1-451B-9EE0-3E2C10DFAE81",
    "DataProviderID": 26,
    "DataProvidersReference": "60372",
    "OperatorID": 73,
    "OperatorsReference": "EV-Box EVB-P1415070",
    "UsageCost": "0.00 jaarabonnement",
    "AddressInfo": {
        "ID": 43269,
        "Title": "Achterweg 91",
        "AddressLine1": "Achterweg 91",
        "Town": "Brielle",
        "Postcode": "3238 AA",
        "CountryID": 159,
        "Latitude": 51.88163,
        "Longitude": 4.22238,
        "RelatedURL": "http://www.ev-box.nl",
        "DistanceUnit": 0
    },
    "Connections": [
        {
            "ID": 51875,
            "ConnectionTypeID": 25,
            "LevelID": 2,
            "PowerKW": 11,
            "CurrentTypeID": 10
        },
        {
            "ID": 51876,
            "ConnectionTypeID": 25,
            "LevelID": 2,
            "PowerKW": 11,
            "CurrentTypeID": 10
        }
    ],
    "NumberOfPoints": 1,
    "StatusTypeID": 50,
    "DateLastStatusUpdate": "2016-06-04T02:41:00Z",
    "DataQualityLevel": 3,
    "DateCreated": "2015-03-25T02:49:00Z",
    "SubmissionStatusTypeID": 100
}