{
    "IsRecentlyVerified": false,
    "ID": 97141,
    "UUID": "3ADB0D5E-9691-4277-ACEA-19EEB4E89D93",
    "DataProviderID": 1,
    "OperatorID": 80,
    "UsageTypeID": 4,
    "UsageCost": "0,40 €/kWh",
    "AddressInfo": {
        "ID": 97487,
        "Title": "Eneldrive Lepore",
        "AddressLine1": "Via Lepore",
        "Town": "Polignano a Mare",
        "StateOrProvince": "BA",
        "Postcode": "70043",
        "CountryID": 112,
        "Latitude": 40.9919400204052,
        "Longitude": 17.2149647174074,
        "RelatedURL": "http://eneldrive.it",
        "DistanceUnit": 0
    },
    "Connections": [
        {
            "ID": 137924,
            "ConnectionTypeID": 25,
            "StatusTypeID": 50,
            "LevelID": 2,
            "Amps": 32,
            "Voltage": 400,
            "PowerKW": 22,
            "CurrentTypeID": 20,
            "Quantity": 1
        },
        {
            "ID": 137925,
            "ConnectionTypeID": 36,
            "StatusTypeID": 50,
            "LevelID": 2,
            "Amps": 16,
            "Voltage": 240,
            "PowerKW": 3,
            "CurrentTypeID": 10,
            "Quantity": 1
        }
    ],
    "NumberOfPoints": 2,
    "StatusTypeID": 50,
    "DateLastStatusUpdate": "2018-01-18T17:21:00Z",
    "DataQualityLevel": 1,
    "DateCreated": "2018-01-07T13:57:00Z",
    "SubmissionStatusTypeID": 200
}