{
    "IsRecentlyVerified": false,
    "ID": 32123,
    "UUID": "CF572EB7-AB43-4729-8F23-49BAD0C15E6B",
    "DataProviderID": 1,
    "OperatorID": 156,
    "OperatorsReference": "NewMotion 02009362",
    "UsageTypeID": 4,
    "UsageCost": "",
    "AddressInfo": {
        "ID": 32469,
        "Title": "Am Aubach 22",
        "AddressLine1": "Am Aubach 22",
        "AddressLine2": "",
        "Town": "Bad Orb",
        "StateOrProvince": "",
        "Postcode": "63619",
        "CountryID": 87,
        "Latitude": 50.233039855957,
        "Longitude": 9.33874034881592,
        "ContactTelephone1": "",
        "ContactTelephone2": "",
        "ContactEmail": "",
        "AccessComments": "",
        "RelatedURL": "",
        "DistanceUnit": 0
    },
    "Connections": [
        {
            "ID": 35634,
            "ConnectionTypeID": 25,
            "StatusTypeID": 0,
            "LevelID": 2,
            "PowerKW": 37,
            "CurrentTypeID": 10
        }
    ],
    "NumberOfPoints": 1,
    "GeneralComments": "",
    "StatusTypeID": 50,
    "DateLastStatusUpdate": "2015-06-12T22:07:00Z",
    "DataQualityLevel": 3,
    "DateCreated": "2015-01-09T06:03:00Z",
    "SubmissionStatusTypeID": 200
}