{
    "UserComments": [
        {
            "ID": 13759,
            "ChargePointID": 19386,
            "CommentTypeID": 10,
            "UserName": "Bss57",
            "Comment": "Just as before",
            "Rating": 4,
            "DateCreated": "2016-07-02T17:40:22.603Z",
            "User": {
                "ID": 6295,
                "Username": "Bss57"
            },
            "CheckinStatusTypeID": 10
        },
        {
            "ID": 8118,
            "ChargePointID": 19386,
            "CommentTypeID": 10,
            "UserName": "Bss57",
            "Comment": "Spaces IMMEDIATELY on the right from the entrance charge points great, spaces tight better fit cars with charge points at the rear",
            "Rating": 4,
            "DateCreated": "2015-11-30T16:04:01.467Z",
            "User": {
                "ID": 6295,
                "Username": "Bss57"
            },
            "CheckinStatusTypeID": 10
        },
        {
            "ID": 4487,
            "ChargePointID": 19386,
            "CommentTypeID": 50,
            "UserName": "Simon Hewison",
            "Comment": "Source London state that this location will be out of service while works take place, starting 19 May 2015.",
            "DateCreated": "2015-05-18T16:19:40.943Z",
            "User": {
                "ID": 4575,
                "Username": "Simon Hewison"
            },
            "CheckinStatusTypeID": 0
        }
    ],
    "IsRecentlyVerified": false,
    "ID": 19386,
    "UUID": "0F1F13F1-78F7-458F-AFCB-CE3D9E5D59C7",
    "DataProviderID": 1,
    "OperatorID": 25,
    "OperatorsReference": "sutton-gibsonroadcarpark",
    "UsageTypeID": 4,
    "UsageCost": "Free",
    "AddressInfo": {
        "ID": 19731,
        "Title": "Gibson Road Car Park",
        "AddressLine1": "Gibson Road",
        "AddressLine2": "Sutton",
        "Town": "London",
        "Postcode": "SM1 2RF",
        "CountryID": 1,
        "Latitude": 51.3620021709811,
        "Longitude": -0.19529918025663,
        "ContactTelephone1": "0845 850 0653",
        "AccessComments": "Charges apply - refer to the owner of the parking bay for details. Hours accessible: 06:30-23:00 Mon-Sat, 09:30-18:00 Sun. Cars and small vans only, height restrictions apply.",
        "RelatedURL": "http://www.sutton.gov.uk/index.aspx?articleid=4229",
        "DistanceUnit": 0
    },
    "Connections": [
        {
            "ID": 19688,
            "ConnectionTypeID": 25,
            "StatusTypeID": 50,
            "LevelID": 2,
            "Amps": 32,
            "Voltage": 230,
            "PowerKW": 7,
            "CurrentTypeID": 10,
            "Quantity": 3
        },
        {
            "ID": 19689,
            "ConnectionTypeID": 1,
            "StatusTypeID": 50,
            "LevelID": 2,
            "Amps": 16,
            "Voltage": 230,
            "PowerKW": 4,
            "CurrentTypeID": 10,
            "Quantity": 3
        }
    ],
    "NumberOfPoints": 3,
    "GeneralComments": "IER986 model charge points.",
    "StatusTypeID": 50,
    "DateLastStatusUpdate": "2017-01-20T06:38:00Z",
    "MetadataValues": [
        {
            "ID": 33,
            "MetadataFieldID": 4,
            "ItemValue": "Data © OpenStreetMap contributors, ODbL 1.0. http://www.openstreetmap.org/copyright"
        }
    ],
    "DataQualityLevel": 1,
    "DateCreated": "2013-09-25T11:13:00Z",
    "SubmissionStatusTypeID": 200
}