{
    "IsRecentlyVerified": false,
    "ID": 108281,
    "UUID": "930B77DA-2A2E-4134-BDE9-BFB144A589B7",
    "DataProviderID": 1,
    "OperatorID": 20,
    "OperatorsReference": "80851..80853",
    "UsageTypeID": 4,
    "UsageCost": "Free",
    "AddressInfo": {
        "ID": 108627,
        "Title": "Evolve Business Centre, Cygnet Way",
        "AddressLine1": "Evolve Business Centre, Cygnet Way",
        "Postcode": "DH4 5QY",
        "CountryID": 1,
        "Latitude": 54.831492,
        "Longitude": -1.482961,
        "DistanceUnit": 0
    },
    "Connections": [
        {
            "ID": 153052,
            "ConnectionTypeID": 25,
            "StatusTypeID": 75,
            "LevelID": 2,
            "Amps": 16,
            "Voltage": 230,
            "PowerKW": 3.6,
            "CurrentTypeID": 10,
            "Quantity": 3
        }
    ],
    "NumberOfPoints": 3,
    "StatusTypeID": 75,
    "DateLastStatusUpdate": "2020-01-13T08:56:00Z",
    "DataQualityLevel": 1,
    "DateCreated": "2018-09-19T05:17:00Z",
    "SubmissionStatusTypeID": 200
}