{
    "IsRecentlyVerified": false,
    "ID": 121087,
    "UUID": "097A1157-D222-4B1F-A1F9-AC2EA0A1B580",
    "DataProviderID": 2,
    "DataProvidersReference": "75527",
    "OperatorID": 5,
    "UsageTypeID": 1,
    "AddressInfo": {
        "ID": 121433,
        "Title": "BEMC",
        "AddressLine1": "44 E 1st St",
        "Town": "Ocean Isle Beach",
        "StateOrProvince": "NC",
        "Postcode": "28469",
        "CountryID": 2,
        "Latitude": 33.8882577,
        "Longitude": -78.4328091,
        "ContactTelephone1": "888-758-4389",
        "AccessComments": "24 hours daily",
        "RelatedURL": "http://www.chargepoint.com/",
        "DistanceUnit": 0
    },
    "Connections": [
        {
            "ID": 170516,
            "ConnectionTypeID": 1,
            "LevelID": 2,
            "Amps": 16,
            "Voltage": 230,
            "PowerKW": 3.7,
            "CurrentTypeID": 10,
            "Quantity": 1
        }
    ],
    "DateLastStatusUpdate": "2020-06-26T02:56:00Z",
    "DataQualityLevel": 3,
    "DateCreated": "2019-04-01T04:59:00Z",
    "SubmissionStatusTypeID": 100
}