{
    "IsRecentlyVerified": false,
    "ID": 101499,
    "UUID": "884C4728-F1D2-4005-824A-09F1A04768F6",
    "DataProviderID": 1,
    "OperatorID": 23,
    "OperatorsReference": "41767",
    "UsageTypeID": 4,
    "AddressInfo": {
        "ID": 101845,
        "Title": "Hilton des Moines Downtown",
        "AddressLine1": "435 Park St",
        "Town": "Des Moines",
        "StateOrProvince": "Iowa",
        "Postcode": "50309",
        "CountryID": 2,
        "Latitude": 41.5904938,
        "Longitude": -93.6233432,
        "ContactTelephone1": "(515) 241-1456",
        "DistanceUnit": 0
    },
    "Connections": [
        {
            "ID": 143308,
            "ConnectionTypeID": 30,
            "StatusTypeID": 50,
            "LevelID": 2,
            "PowerKW": 13,
            "CurrentTypeID": 20,
            "Quantity": 1
        }
    ],
    "NumberOfPoints": 1,
    "GeneralComments": "1 Tesla Connector, up to 13kW.Available for customers. Please see front desk.",
    "StatusTypeID": 50,
    "DateLastStatusUpdate": "2018-03-30T05:44:00Z",
    "DataQualityLevel": 1,
    "DateCreated": "2018-03-30T05:44:00Z",
    "SubmissionStatusTypeID": 200
}