{
    "IsRecentlyVerified": false,
    "ID": 45040,
    "UUID": "86333FB5-A836-485A-8AC0-043DCA698111",
    "DataProviderID": 1,
    "OperatorID": 140,
    "UsageTypeID": 4,
    "AddressInfo": {
        "ID": 45386,
        "Title": "Naturpark Meißner-Kaufunger-Wald",
        "AddressLine1": "L3241",
        "Town": "Meißner",
        "StateOrProvince": "Werra-Meißner-Kreis",
        "Postcode": "37290",
        "CountryID": 87,
        "Latitude": 51.2092389601786,
        "Longitude": 9.85556679086609,
        "ContactTelephone1": "+49 561 9330 9330",
        "AccessComments": "Ladekarte der EAM \"Free\" (gilt auch für SUN) notwendig (http://www.free-e-mobil.de/mit-free-unterwegs/ladestationen/).",
        "RelatedURL": "http://www.eam.de/",
        "DistanceUnit": 0
    },
    "Connections": [
        {
            "ID": 55381,
            "ConnectionTypeID": 28,
            "StatusTypeID": 50,
            "LevelID": 2,
            "Amps": 16,
            "Voltage": 230,
            "PowerKW": 3.7,
            "CurrentTypeID": 10,
            "Quantity": 2
        },
        {
            "ID": 55382,
            "ConnectionTypeID": 25,
            "StatusTypeID": 50,
            "LevelID": 2,
            "Amps": 16,
            "Voltage": 400,
            "PowerKW": 11,
            "CurrentTypeID": 20,
            "Quantity": 2
        }
    ],
    "NumberOfPoints": 4,
    "StatusTypeID": 50,
    "DateLastStatusUpdate": "2015-04-23T20:46:00Z",
    "DataQualityLevel": 1,
    "DateCreated": "2015-04-23T12:38:00Z",
    "SubmissionStatusTypeID": 200
}