{
    "IsRecentlyVerified": false,
    "ID": 96452,
    "UUID": "3B3A7C41-5F2D-4D4C-BAE2-1725E42C2283",
    "DataProviderID": 1,
    "OperatorID": 45,
    "OperatorsReference": "44330,44330",
    "UsageTypeID": 6,
    "UsageCost": "Gratis",
    "AddressInfo": {
        "ID": 96798,
        "Title": "Hotel Augusta Spa Resort",
        "AddressLine1": "Lugar Padriñan, 25, Sanxenxo, Pontevedra.",
        "Town": "Pontevedra",
        "StateOrProvince": "Pontevedra",
        "Postcode": "36960",
        "CountryID": 210,
        "Latitude": 42.405119,
        "Longitude": -8.80593799999997,
        "DistanceUnit": 0
    },
    "Connections": [
        {
            "ID": 140683,
            "ConnectionTypeID": 16,
            "StatusTypeID": 50,
            "LevelID": 2,
            "Amps": 16,
            "Voltage": 230,
            "PowerKW": 3.7,
            "CurrentTypeID": 10,
            "Quantity": 2
        },
        {
            "ID": 140684,
            "ConnectionTypeID": 17,
            "StatusTypeID": 50,
            "LevelID": 2,
            "Amps": 32,
            "Voltage": 400,
            "PowerKW": 22,
            "CurrentTypeID": 20,
            "Quantity": 2
        }
    ],
    "NumberOfPoints": 2,
    "StatusTypeID": 50,
    "DateLastStatusUpdate": "2018-06-17T05:32:00Z",
    "DataQualityLevel": 1,
    "DateCreated": "2017-12-29T03:21:00Z",
    "SubmissionStatusTypeID": 200
}