{
    "IsRecentlyVerified": false,
    "ID": 103225,
    "UUID": "0A770D09-F986-49AC-B430-3F654923E8F8",
    "DataProviderID": 1,
    "OperatorID": 105,
    "UsageTypeID": 1,
    "AddressInfo": {
        "ID": 103571,
        "Title": "E-Bike Station",
        "AddressLine1": "Hauptstraße",
        "Town": "Adenau",
        "StateOrProvince": "Adenau",
        "Postcode": "53520",
        "CountryID": 87,
        "Latitude": 50.44555339999999,
        "Longitude": 6.885498299999995,
        "AccessComments": "Rund um die Uhr (24/7) nutzbar\r\n",
        "DistanceUnit": 0
    },
    "Connections": [
        {
            "ID": 145840,
            "ConnectionTypeID": 28,
            "StatusTypeID": 50,
            "LevelID": 1,
            "Amps": 10,
            "Voltage": 230,
            "PowerKW": 2.3,
            "CurrentTypeID": 10,
            "Quantity": 3
        }
    ],
    "NumberOfPoints": 3,
    "StatusTypeID": 50,
    "DateLastStatusUpdate": "2018-04-24T14:08:00Z",
    "DataQualityLevel": 1,
    "DateCreated": "2018-04-24T14:08:00Z",
    "SubmissionStatusTypeID": 200
}