{
    "IsRecentlyVerified": false,
    "ID": 126217,
    "UUID": "A8B793AE-180F-4D27-B498-4FCF252DDA56",
    "DataProviderID": 1,
    "OperatorID": 3,
    "OperatorsReference": "PG-81972",
    "UsageTypeID": 4,
    "UsageCost": "Free",
    "AddressInfo": {
        "ID": 126563,
        "Title": "Park Road",
        "AddressLine1": "Park Road",
        "Town": "Peterborough",
        "Postcode": "PE1 2TR",
        "CountryID": 1,
        "Latitude": 52.575149,
        "Longitude": -0.243121,
        "DistanceUnit": 0
    },
    "Connections": [
        {
            "ID": 176899,
            "ConnectionTypeID": 25,
            "StatusTypeID": 50,
            "LevelID": 2,
            "Amps": 32,
            "Voltage": 230,
            "PowerKW": 7,
            "CurrentTypeID": 10,
            "Quantity": 2
        }
    ],
    "NumberOfPoints": 2,
    "GeneralComments": "This is an open charge unit installed at Park Road in Peterborough The unit is located at the center of Park Road",
    "StatusTypeID": 50,
    "DateLastStatusUpdate": "2019-05-13T14:51:00Z",
    "DataQualityLevel": 1,
    "DateCreated": "2019-05-13T14:51:00Z",
    "SubmissionStatusTypeID": 200
}