{
    "IsRecentlyVerified": false,
    "ID": 141657,
    "UUID": "082ADAB6-09BB-4967-8A4D-35319B261058",
    "DataProviderID": 2,
    "DataProvidersReference": "147032",
    "UsageTypeID": 2,
    "AddressInfo": {
        "ID": 142009,
        "Title": "Howard Community College",
        "AddressLine1": "5051 Campus Dr",
        "Town": "Columbia",
        "StateOrProvince": "MD",
        "Postcode": "21044",
        "CountryID": 2,
        "Latitude": 39.212347,
        "Longitude": -76.880501,
        "ContactTelephone1": "",
        "AccessComments": "",
        "RelatedURL": "",
        "DistanceUnit": 0
    },
    "Connections": [
        {
            "ID": 197636,
            "ConnectionTypeID": 1,
            "LevelID": 2,
            "Amps": 16,
            "Voltage": 230,
            "PowerKW": 3.7,
            "CurrentTypeID": 10,
            "Quantity": 3
        }
    ],
    "StatusTypeID": 50,
    "DateLastStatusUpdate": "2020-06-26T03:01:00Z",
    "DataQualityLevel": 3,
    "DateCreated": "2019-12-24T09:16:00Z",
    "SubmissionStatusTypeID": 100
}