{
    "IsRecentlyVerified": false,
    "ID": 47017,
    "UUID": "E116D5B4-323B-40FD-B933-01884B237DA3",
    "DataProviderID": 26,
    "DataProvidersReference": "59810",
    "OperatorID": 73,
    "OperatorsReference": "EV-Box EVB-P1446047",
    "UsageCost": "0.00 jaarabonnement",
    "AddressInfo": {
        "ID": 47363,
        "Title": "Lisdoddelaan 84",
        "AddressLine1": "Lisdoddelaan 84",
        "Town": "Amsterdam",
        "Postcode": "1087 KA",
        "CountryID": 159,
        "Latitude": 52.35192,
        "Longitude": 4.99409,
        "RelatedURL": "http://www.ev-box.nl",
        "DistanceUnit": 0
    },
    "Connections": [
        {
            "ID": 57878,
            "ConnectionTypeID": 25,
            "LevelID": 2,
            "PowerKW": 11,
            "CurrentTypeID": 10
        }
    ],
    "NumberOfPoints": 1,
    "StatusTypeID": 50,
    "DateLastStatusUpdate": "2016-06-04T02:53:00Z",
    "DataQualityLevel": 3,
    "DateCreated": "2015-05-11T09:12:00Z",
    "SubmissionStatusTypeID": 100
}