{
    "IsRecentlyVerified": false,
    "ID": 100407,
    "UUID": "9B39E162-7739-439B-8CA9-C29E559FBEBA",
    "DataProviderID": 1,
    "OperatorID": 23,
    "OperatorsReference": "40869",
    "UsageTypeID": 6,
    "AddressInfo": {
        "ID": 100753,
        "Title": "Hotel Cascais Miragem",
        "AddressLine1": "Av. Marginal 8554",
        "Town": "Cascais",
        "Postcode": "2754-536",
        "CountryID": 180,
        "Latitude": 38.702428,
        "Longitude": -9.410853,
        "ContactTelephone1": "+351210060601",
        "AccessComments": "Only for customers",
        "DistanceUnit": 0
    },
    "Connections": [
        {
            "ID": 141826,
            "ConnectionTypeID": 30,
            "StatusTypeID": 50,
            "LevelID": 2,
            "Amps": 32,
            "Voltage": 400,
            "PowerKW": 22,
            "CurrentTypeID": 20,
            "Quantity": 1
        }
    ],
    "NumberOfPoints": 1,
    "GeneralComments": "1 Tesla Connector, up to 22kW.Available for customers. Please see front desk.",
    "StatusTypeID": 50,
    "DateLastStatusUpdate": "2020-08-09T19:43:00Z",
    "DataQualityLevel": 1,
    "DateCreated": "2018-02-23T07:02:00Z",
    "SubmissionStatusTypeID": 200
}