{
    "IsRecentlyVerified": false,
    "ID": 160632,
    "UUID": "C5C7315A-6023-4B3C-9B4B-12AB6E04EAC3",
    "DataProviderID": 2,
    "DataProvidersReference": "157693",
    "UsageTypeID": 2,
    "AddressInfo": {
        "ID": 160989,
        "Title": "Canadian Tire Corporation",
        "AddressLine1": "10200 McDonald Park Rd",
        "Town": "North Saanich",
        "StateOrProvince": "BC",
        "Postcode": "V8L 5X8",
        "CountryID": 44,
        "Latitude": 48.6579188,
        "Longitude": -123.4193403,
        "ContactTelephone1": "",
        "AccessComments": "",
        "RelatedURL": "",
        "DistanceUnit": 0
    },
    "Connections": [
        {
            "ID": 231133,
            "ConnectionTypeID": 2,
            "LevelID": 3,
            "Amps": 100,
            "Voltage": 400,
            "PowerKW": 40,
            "CurrentTypeID": 30,
            "Quantity": 1
        },
        {
            "ID": 231134,
            "ConnectionTypeID": 32,
            "LevelID": 3,
            "Amps": 100,
            "Voltage": 400,
            "PowerKW": 40,
            "CurrentTypeID": 30,
            "Quantity": 1
        }
    ],
    "GeneralComments": "Planned for future date. Not Operational.",
    "DatePlanned": "2020-09-01T00:00:00Z",
    "StatusTypeID": 150,
    "DateLastStatusUpdate": "2020-06-26T03:11:00Z",
    "DataQualityLevel": 3,
    "DateCreated": "2020-06-26T03:11:00Z",
    "SubmissionStatusTypeID": 100
}