{
    "IsRecentlyVerified": false,
    "ID": 70151,
    "UUID": "AB1681C7-7B96-447B-B75E-079E2A09D02B",
    "DataProviderID": 1,
    "OperatorID": 45,
    "UsageTypeID": 1,
    "AddressInfo": {
        "ID": 70497,
        "Title": "Autohaus Wahl",
        "AddressLine1": "Gottlieb-Daimler-Straße 1",
        "AddressLine2": "Kleinlinden",
        "Town": "Gießen",
        "StateOrProvince": "Landkreis Gießen",
        "Postcode": "35398",
        "CountryID": 87,
        "Latitude": 50.5856864,
        "Longitude": 8.650382400000012,
        "ContactTelephone1": "+49 641 61066-0",
        "AccessComments": "24/7 nutzbar am BMW/Mini Autohaus.",
        "RelatedURL": "http://www.wahl-group.de/",
        "DistanceUnit": 0
    },
    "Connections": [
        {
            "ID": 100084,
            "ConnectionTypeID": 25,
            "StatusTypeID": 50,
            "LevelID": 2,
            "Amps": 32,
            "Voltage": 400,
            "PowerKW": 22,
            "CurrentTypeID": 20,
            "Quantity": 2
        }
    ],
    "NumberOfPoints": 2,
    "StatusTypeID": 50,
    "DateLastStatusUpdate": "2016-07-12T05:45:00Z",
    "DataQualityLevel": 1,
    "DateCreated": "2016-07-12T05:45:00Z",
    "SubmissionStatusTypeID": 200
}