{
    "IsRecentlyVerified": false,
    "ID": 93952,
    "UUID": "1AFE079C-4FBA-465E-8C14-14CF875384FE",
    "DataProviderID": 1,
    "OperatorID": 103,
    "UsageTypeID": 4,
    "AddressInfo": {
        "ID": 94298,
        "Title": "Autohaus Hasse",
        "AddressLine1": "Tegelbergstraße 3",
        "Town": "Mindelheim",
        "StateOrProvince": "Landkreis Unterallgäu",
        "Postcode": "87719",
        "CountryID": 87,
        "Latitude": 48.035660873196484,
        "Longitude": 10.501927664032,
        "AccessComments": "24/7 geöffnete Ladestation am BMW Autohaus mit 2 kostenlosen Parkplätzen.",
        "DistanceUnit": 0
    },
    "Connections": [
        {
            "ID": 133004,
            "ConnectionTypeID": 1036,
            "StatusTypeID": 50,
            "LevelID": 3,
            "Amps": 63,
            "Voltage": 400,
            "PowerKW": 43,
            "CurrentTypeID": 20,
            "Quantity": 1
        },
        {
            "ID": 133005,
            "ConnectionTypeID": 33,
            "StatusTypeID": 50,
            "LevelID": 3,
            "PowerKW": 50,
            "CurrentTypeID": 30,
            "Quantity": 1
        },
        {
            "ID": 133006,
            "ConnectionTypeID": 2,
            "StatusTypeID": 50,
            "LevelID": 3,
            "PowerKW": 50,
            "CurrentTypeID": 30,
            "Quantity": 1
        }
    ],
    "NumberOfPoints": 3,
    "StatusTypeID": 50,
    "DateLastStatusUpdate": "2017-10-13T14:05:00Z",
    "DataQualityLevel": 1,
    "DateCreated": "2017-10-13T14:05:00Z",
    "SubmissionStatusTypeID": 200
}