{
    "IsRecentlyVerified": false,
    "ID": 40195,
    "UUID": "8C33AB0F-5B77-4FB9-A2A2-B790D31BDC8D",
    "DataProviderID": 2,
    "DataProvidersReference": "51654",
    "OperatorID": 5,
    "UsageTypeID": 1,
    "AddressInfo": {
        "ID": 40541,
        "Title": "HAYWARD",
        "AddressLine1": "777 B St",
        "Town": "Hayward",
        "StateOrProvince": "CA",
        "Postcode": "94541",
        "CountryID": 2,
        "Latitude": 37.6709579,
        "Longitude": -122.0861479,
        "ContactTelephone1": "888-758-4389",
        "AccessComments": "24 hours daily",
        "RelatedURL": "http://www.chargepoint.com/",
        "DistanceUnit": 0
    },
    "Connections": [
        {
            "ID": 43750,
            "ConnectionTypeID": 9,
            "LevelID": 1,
            "Amps": 16,
            "Voltage": 120,
            "PowerKW": 1,
            "CurrentTypeID": 10,
            "Quantity": 1
        },
        {
            "ID": 43751,
            "ConnectionTypeID": 1,
            "LevelID": 2,
            "Amps": 16,
            "Voltage": 230,
            "PowerKW": 3,
            "CurrentTypeID": 10,
            "Quantity": 1
        }
    ],
    "DateLastStatusUpdate": "2019-12-24T09:14:00Z",
    "DataQualityLevel": 3,
    "DateCreated": "2015-01-10T01:01:00Z",
    "SubmissionStatusTypeID": 100
}