{
    "IsRecentlyVerified": false,
    "ID": 126166,
    "UUID": "352C955B-559A-408E-83F0-D8B72E611A4C",
    "DataProviderID": 1,
    "OperatorID": 3,
    "OperatorsReference": "PG-82059",
    "UsageTypeID": 4,
    "UsageCost": "£0.14/kWh",
    "AddressInfo": {
        "ID": 126512,
        "Title": "The Energy Check",
        "AddressLine1": "4 Waverley Place",
        "Town": "Waverley Business Park",
        "StateOrProvince": "South Shields",
        "Postcode": "NE33 1LE",
        "CountryID": 1,
        "Latitude": 54.999228,
        "Longitude": -1.437588,
        "DistanceUnit": 0
    },
    "Connections": [
        {
            "ID": 176819,
            "ConnectionTypeID": 25,
            "StatusTypeID": 50,
            "LevelID": 2,
            "Amps": 32,
            "Voltage": 230,
            "PowerKW": 7,
            "CurrentTypeID": 10,
            "Quantity": 2
        }
    ],
    "NumberOfPoints": 2,
    "GeneralComments": "This is an open charge unit installed at The Energy Check site in Waverley Place, Waverley Business Park, South Shields",
    "StatusTypeID": 50,
    "DateLastStatusUpdate": "2019-05-13T13:17:00Z",
    "DataQualityLevel": 1,
    "DateCreated": "2019-05-13T13:17:00Z",
    "SubmissionStatusTypeID": 200
}