{
    "IsRecentlyVerified": false,
    "ID": 73157,
    "UUID": "5C639999-8EBB-420F-86CC-A931C2499A1B",
    "DataProviderID": 1,
    "OperatorID": 235,
    "UsageTypeID": 4,
    "UsageCost": "0",
    "AddressInfo": {
        "ID": 73503,
        "Title": "SWD Flughafen Düsseldorf, Parkhaus 8",
        "AddressLine1": "Maritim-Platz",
        "AddressLine2": "Unterrath",
        "Town": "Düsseldorf",
        "StateOrProvince": "Düsseldorf",
        "Postcode": "40474",
        "CountryID": 87,
        "Latitude": 52,
        "Longitude": 6.76926049503708,
        "ContactTelephone1": "49 211 821 821",
        "ContactEmail": "elektromobilitaet@swd-ag.de",
        "AccessComments": "Im Parkhaus P8 auf der Ebene U1. Nach Einfahrt links abbiegen, dann wieder rechts und nochmal rechts. Bis zum Ende durchfahren, dort sind die 8 Parkplätze an den Ladestationen. Das Laden ist kostenlos, Parkgebühren werden erhoben.\r\nLadekarte über https://www.swd-ag.de/privatkunden/strom/",
        "RelatedURL": "http://www.swd-ag.de",
        "DistanceUnit": 0
    },
    "Connections": [
        {
            "ID": 105181,
            "ConnectionTypeID": 25,
            "StatusTypeID": 50,
            "LevelID": 2,
            "Amps": 32,
            "Voltage": 400,
            "PowerKW": 22,
            "CurrentTypeID": 10,
            "Quantity": 6
        },
        {
            "ID": 105366,
            "ConnectionTypeID": 28,
            "StatusTypeID": 50,
            "LevelID": 1,
            "Amps": 230,
            "Voltage": 16,
            "PowerKW": 3.7,
            "CurrentTypeID": 10,
            "Quantity": 6
        }
    ],
    "NumberOfPoints": 6,
    "GeneralComments": "Ladekarte über https://www.swd-ag.de/privatkunden/strom/",
    "StatusTypeID": 50,
    "DateLastStatusUpdate": "2016-12-06T11:38:00Z",
    "DataQualityLevel": 1,
    "DateCreated": "2016-11-11T07:50:00Z",
    "SubmissionStatusTypeID": 200
}