{
    "UserComments": [
        {
            "ID": 20870,
            "ChargePointID": 125072,
            "CommentTypeID": 10,
            "UserName": "ForumElettrico.it",
            "RelatedURL": "https://www.forumelettrico.it/forum/fast-nissan-erzelli-t3539.html",
            "DateCreated": "2019-04-09T07:23:23.857Z",
            "User": {
                "ID": 11749,
                "Username": "ForumElettrico.it"
            },
            "CheckinStatusTypeID": 10
        }
    ],
    "MediaItems": [
        {
            "ID": 17985,
            "ChargePointID": 125072,
            "ItemURL": "https://s3-ap-southeast-2.amazonaws.com/openchargemap/images/IT/OCM125072/OCM-125072.orig.2019040907233515.jpg",
            "ItemThumbnailURL": "https://s3-ap-southeast-2.amazonaws.com/openchargemap/images/IT/OCM125072/OCM-125072.thmb.2019040907233515.jpg",
            "Comment": "",
            "IsEnabled": true,
            "IsVideo": false,
            "IsFeaturedItem": false,
            "IsExternalResource": false,
            "User": {
                "ID": 11749,
                "Username": "ForumElettrico.it"
            },
            "DateCreated": "2019-04-09T07:24:00Z"
        },
        {
            "ID": 17986,
            "ChargePointID": 125072,
            "ItemURL": "https://s3-ap-southeast-2.amazonaws.com/openchargemap/images/IT/OCM125072/OCM-125072.orig.2019040907234141.jpg",
            "ItemThumbnailURL": "https://s3-ap-southeast-2.amazonaws.com/openchargemap/images/IT/OCM125072/OCM-125072.thmb.2019040907234141.jpg",
            "Comment": "",
            "IsEnabled": true,
            "IsVideo": false,
            "IsFeaturedItem": false,
            "IsExternalResource": false,
            "User": {
                "ID": 11749,
                "Username": "ForumElettrico.it"
            },
            "DateCreated": "2019-04-09T07:24:00Z"
        },
        {
            "ID": 17987,
            "ChargePointID": 125072,
            "ItemURL": "https://s3-ap-southeast-2.amazonaws.com/openchargemap/images/IT/OCM125072/OCM-125072.orig.2019040907234780.jpg",
            "ItemThumbnailURL": "https://s3-ap-southeast-2.amazonaws.com/openchargemap/images/IT/OCM125072/OCM-125072.thmb.2019040907234780.jpg",
            "Comment": "",
            "IsEnabled": true,
            "IsVideo": false,
            "IsFeaturedItem": false,
            "IsExternalResource": false,
            "User": {
                "ID": 11749,
                "Username": "ForumElettrico.it"
            },
            "DateCreated": "2019-04-09T07:24:00Z"
        }
    ],
    "IsRecentlyVerified": false,
    "ID": 125072,
    "UUID": "22CFE1F4-4E60-4081-8FB5-28D59404DE73",
    "DataProviderID": 1,
    "OperatorID": 1,
    "UsageTypeID": 6,
    "AddressInfo": {
        "ID": 125418,
        "Title": "Nissan Autoveicoli Erzelli",
        "AddressLine1": "Via Enrico Melen 73",
        "Town": "Genova",
        "StateOrProvince": "GE",
        "Postcode": "16152",
        "CountryID": 112,
        "Latitude": 44.421394,
        "Longitude": 8.865447,
        "RelatedURL": "https://www.forumelettrico.it/forum/fast-nissan-erzelli-t3539.html",
        "DistanceUnit": 0
    },
    "Connections": [
        {
            "ID": 175290,
            "ConnectionTypeID": 2,
            "StatusTypeID": 50,
            "LevelID": 3,
            "Amps": 125,
            "Voltage": 500,
            "PowerKW": 50,
            "CurrentTypeID": 30,
            "Quantity": 1
        }
    ],
    "NumberOfPoints": 1,
    "StatusTypeID": 50,
    "DateLastStatusUpdate": "2019-04-09T09:31:00Z",
    "DataQualityLevel": 1,
    "DateCreated": "2019-04-09T07:23:00Z",
    "SubmissionStatusTypeID": 200
}