{
    "IsRecentlyVerified": false,
    "ID": 122369,
    "UUID": "A0B1FCBB-2053-45CD-8A8D-10EAC0F21E94",
    "DataProviderID": 2,
    "DataProvidersReference": "80446",
    "OperatorID": 5,
    "UsageTypeID": 1,
    "AddressInfo": {
        "ID": 122715,
        "Title": "URBANLUX SUNSET",
        "AddressLine1": "1425 N Alta Vista Blvd",
        "Town": "Los Angeles",
        "StateOrProvince": "CA",
        "Postcode": "90046",
        "CountryID": 2,
        "Latitude": 34.0966446,
        "Longitude": -118.3473661,
        "ContactTelephone1": "888-758-4389",
        "AccessComments": "24 hours daily",
        "RelatedURL": "http://www.chargepoint.com/",
        "DistanceUnit": 0
    },
    "Connections": [
        {
            "ID": 172254,
            "ConnectionTypeID": 1,
            "LevelID": 2,
            "Amps": 16,
            "Voltage": 230,
            "PowerKW": 3,
            "CurrentTypeID": 10,
            "Quantity": 2
        }
    ],
    "DateLastStatusUpdate": "2019-12-24T09:11:00Z",
    "DataQualityLevel": 3,
    "DateCreated": "2019-04-06T05:03:00Z",
    "SubmissionStatusTypeID": 100
}