{
    "UserComments": [
        {
            "ID": 17339,
            "ChargePointID": 88292,
            "CommentTypeID": 10,
            "UserName": "polianto",
            "Comment": "plug & charge, senza nessuna tessera",
            "Rating": 5,
            "DateCreated": "2017-05-28T17:45:32.13Z",
            "User": {
                "ID": 1606,
                "Username": "polianto"
            },
            "CheckinStatusTypeID": 10
        }
    ],
    "MediaItems": [
        {
            "ID": 12584,
            "ChargePointID": 88292,
            "ItemURL": "https://s3-ap-southeast-2.amazonaws.com/openchargemap/images/CH/OCM88292/OCM-88292.orig.2017052817423799.jpg",
            "ItemThumbnailURL": "https://s3-ap-southeast-2.amazonaws.com/openchargemap/images/CH/OCM88292/OCM-88292.thmb.2017052817423799.jpg",
            "Comment": "",
            "IsEnabled": true,
            "IsVideo": false,
            "IsFeaturedItem": false,
            "IsExternalResource": false,
            "User": {
                "ID": 1606,
                "Username": "polianto"
            },
            "DateCreated": "2017-05-28T17:43:00Z"
        },
        {
            "ID": 12585,
            "ChargePointID": 88292,
            "ItemURL": "https://s3-ap-southeast-2.amazonaws.com/openchargemap/images/CH/OCM88292/OCM-88292.orig.2017052817425792.jpg",
            "ItemThumbnailURL": "https://s3-ap-southeast-2.amazonaws.com/openchargemap/images/CH/OCM88292/OCM-88292.thmb.2017052817425792.jpg",
            "Comment": "",
            "IsEnabled": true,
            "IsVideo": false,
            "IsFeaturedItem": false,
            "IsExternalResource": false,
            "User": {
                "ID": 1606,
                "Username": "polianto"
            },
            "DateCreated": "2017-05-28T17:43:00Z"
        },
        {
            "ID": 12586,
            "ChargePointID": 88292,
            "ItemURL": "https://s3-ap-southeast-2.amazonaws.com/openchargemap/images/CH/OCM88292/OCM-88292.orig.2017052817431701.jpg",
            "ItemThumbnailURL": "https://s3-ap-southeast-2.amazonaws.com/openchargemap/images/CH/OCM88292/OCM-88292.thmb.2017052817431701.jpg",
            "Comment": "",
            "IsEnabled": true,
            "IsVideo": false,
            "IsFeaturedItem": false,
            "IsExternalResource": false,
            "User": {
                "ID": 1606,
                "Username": "polianto"
            },
            "DateCreated": "2017-05-28T17:43:00Z"
        }
    ],
    "IsRecentlyVerified": false,
    "ID": 88292,
    "UUID": "8F8264F6-6E96-4B41-859B-2BE1E3A49797",
    "DataProviderID": 1,
    "OperatorID": 45,
    "UsageTypeID": 1,
    "UsageCost": "free",
    "AddressInfo": {
        "ID": 88638,
        "Title": "IKEA SA  Centro Lugano Sud",
        "AddressLine1": "Via Cantonale",
        "Town": "Grancia",
        "StateOrProvince": "Distretto di Lugano",
        "Postcode": "6916",
        "CountryID": 217,
        "Latitude": 45.9726467055901,
        "Longitude": 8.92652588076781,
        "ContactTelephone1": "0848.801.100",
        "RelatedURL": "http://www.ikea.com/ch/it/store/grancia/indexPage",
        "DistanceUnit": 0
    },
    "Connections": [
        {
            "ID": 125248,
            "ConnectionTypeID": 25,
            "StatusTypeID": 50,
            "LevelID": 2,
            "Amps": 32,
            "Voltage": 400,
            "PowerKW": 22,
            "CurrentTypeID": 20,
            "Quantity": 8
        }
    ],
    "NumberOfPoints": 8,
    "StatusTypeID": 50,
    "DateLastStatusUpdate": "2017-05-28T17:46:00Z",
    "DataQualityLevel": 1,
    "DateCreated": "2017-05-26T09:30:00Z",
    "SubmissionStatusTypeID": 200
}