{
    "IsRecentlyVerified": false,
    "ID": 181007,
    "UUID": "4EE55FDD-E5F3-4350-A68F-BD2E2DF45328",
    "DataProviderID": 29,
    "DataProvidersReference": "12010",
    "OperatorID": 86,
    "AddressInfo": {
        "ID": 181366,
        "Title": "Köpfwiesenweg 1",
        "AddressLine1": "Köpfwiesenweg 1",
        "Town": "Vaihingen (Enz)",
        "Postcode": "71665",
        "CountryID": 87,
        "Latitude": 48.931379,
        "Longitude": 8.960295,
        "DistanceUnit": 0
    },
    "Connections": [
        {
            "ID": 284789,
            "ConnectionTypeID": 28,
            "StatusTypeID": 50,
            "LevelID": 2,
            "PowerKW": 22,
            "CurrentTypeID": 20
        },
        {
            "ID": 284790,
            "ConnectionTypeID": 25,
            "StatusTypeID": 50,
            "LevelID": 2,
            "PowerKW": 22,
            "CurrentTypeID": 20
        },
        {
            "ID": 296396,
            "ConnectionTypeID": 28,
            "StatusTypeID": 50,
            "LevelID": 2,
            "PowerKW": 22,
            "CurrentTypeID": 20
        },
        {
            "ID": 296397,
            "ConnectionTypeID": 25,
            "StatusTypeID": 50,
            "LevelID": 2,
            "PowerKW": 22,
            "CurrentTypeID": 20
        }
    ],
    "StatusTypeID": 50,
    "DateLastStatusUpdate": "2021-07-12T02:42:00Z",
    "MetadataValues": [
        {
            "ID": 13301,
            "MetadataFieldID": 4,
            "ItemValue": "Data from the German chargepoint registry provided by Bundesnetzagentur.de under the CC-BY 4.0 license"
        }
    ],
    "DataQualityLevel": 3,
    "DateCreated": "2021-07-08T10:01:00Z",
    "SubmissionStatusTypeID": 100
}