{
    "IsRecentlyVerified": false,
    "ID": 126156,
    "UUID": "AC64322F-46C2-46EA-8432-2A15054A7BF8",
    "DataProviderID": 1,
    "OperatorID": 3,
    "OperatorsReference": "PG-80018",
    "UsageTypeID": 4,
    "UsageCost": "Free",
    "AddressInfo": {
        "ID": 126502,
        "Title": "Alex F Noble & Son",
        "AddressLine1": "Alex F Noble & Son",
        "Postcode": "EH20 9FB",
        "CountryID": 1,
        "Latitude": 55.8750526,
        "Longitude": -3.1733331,
        "DistanceUnit": 0
    },
    "Connections": [
        {
            "ID": 176809,
            "ConnectionTypeID": 25,
            "StatusTypeID": 50,
            "LevelID": 2,
            "Amps": 32,
            "Voltage": 230,
            "PowerKW": 7,
            "CurrentTypeID": 10,
            "Quantity": 2
        }
    ],
    "NumberOfPoints": 2,
    "GeneralComments": "POD Point Open Charge Unit",
    "StatusTypeID": 50,
    "DateLastStatusUpdate": "2019-05-13T13:16:00Z",
    "DataQualityLevel": 1,
    "DateCreated": "2019-05-13T13:16:00Z",
    "SubmissionStatusTypeID": 200
}