{
    "IsRecentlyVerified": false,
    "ID": 114475,
    "UUID": "3950C816-940D-4795-AE51-89DC0B8B5F00",
    "DataProviderID": 1,
    "OperatorID": 80,
    "UsageTypeID": 4,
    "AddressInfo": {
        "ID": 114821,
        "Title": "Cormano Battisti | EnelX",
        "AddressLine1": "Via Cesare Battisti",
        "Town": "Cormano ",
        "StateOrProvince": "MI",
        "Postcode": "20032",
        "CountryID": 112,
        "Latitude": 45.5451684715187,
        "Longitude": 9.17277186178598,
        "ContactTelephone1": "800.069.850",
        "RelatedURL": "https://www.enelx.com/it/it/emobility",
        "DistanceUnit": 0
    },
    "Connections": [
        {
            "ID": 161145,
            "ConnectionTypeID": 25,
            "StatusTypeID": 50,
            "LevelID": 2,
            "Amps": 32,
            "Voltage": 400,
            "PowerKW": 22,
            "CurrentTypeID": 20,
            "Quantity": 4
        }
    ],
    "NumberOfPoints": 4,
    "StatusTypeID": 50,
    "DateLastStatusUpdate": "2019-07-24T15:50:00Z",
    "DataQualityLevel": 1,
    "DateCreated": "2019-01-08T10:50:00Z",
    "SubmissionStatusTypeID": 200
}