{
    "IsRecentlyVerified": false,
    "ID": 121159,
    "UUID": "4BC8E3E1-1D22-400E-BF0B-1EED9345A0E5",
    "DataProviderID": 2,
    "DataProvidersReference": "120977",
    "OperatorID": 5,
    "UsageTypeID": 1,
    "AddressInfo": {
        "ID": 121505,
        "Title": "CITY OF ELIZABE",
        "AddressLine1": "707 E Fearing St",
        "Town": "Elizabeth City",
        "StateOrProvince": "NC",
        "Postcode": "27909",
        "CountryID": 2,
        "Latitude": 36.2987868,
        "Longitude": -76.2187094,
        "ContactTelephone1": "888-758-4389",
        "AccessComments": "24 hours daily",
        "RelatedURL": "http://www.chargepoint.com/",
        "DistanceUnit": 0
    },
    "Connections": [
        {
            "ID": 170596,
            "ConnectionTypeID": 1,
            "LevelID": 2,
            "Amps": 16,
            "Voltage": 230,
            "PowerKW": 3.7,
            "CurrentTypeID": 10,
            "Quantity": 2
        }
    ],
    "DateLastStatusUpdate": "2020-06-26T02:58:00Z",
    "DataQualityLevel": 3,
    "DateCreated": "2019-04-01T04:59:00Z",
    "SubmissionStatusTypeID": 100
}