{
    "IsRecentlyVerified": false,
    "ID": 152196,
    "UUID": "1D13254C-053E-452A-96D3-779328B455EC",
    "DataProviderID": 28,
    "DataProvidersReference": "FR*S85*P85191*014",
    "UsageTypeID": 5,
    "AddressInfo": {
        "ID": 152549,
        "Title": "LA ROCHE SUR YON - Rue La Fayette",
        "AddressLine1": "Rue La Fayette 85000 LA ROCHE SUR YON",
        "CountryID": 80,
        "Latitude": 46.669237,
        "Longitude": -1.429953,
        "AccessComments": "24h/24 7j/7",
        "DistanceUnit": 0
    },
    "Connections": [
        {
            "ID": 212961,
            "ConnectionTypeID": 26,
            "StatusTypeID": 50,
            "LevelID": 2,
            "PowerKW": 4
        },
        {
            "ID": 212962,
            "ConnectionTypeID": 28,
            "StatusTypeID": 50,
            "LevelID": 2,
            "PowerKW": 4,
            "CurrentTypeID": 10
        }
    ],
    "GeneralComments": "Recharge par badge et avec une application smartphone",
    "StatusTypeID": 50,
    "DateLastStatusUpdate": "2020-08-27T05:12:00Z",
    "DataQualityLevel": 2,
    "DateCreated": "2020-03-15T10:53:00Z",
    "SubmissionStatusTypeID": 100
}