{
    "IsRecentlyVerified": false,
    "ID": 163897,
    "UUID": "8D395ABD-4ECE-4D1F-AF67-5EF8D43A6B3B",
    "DataProviderID": 1,
    "OperatorID": 23,
    "OperatorsReference": "39470",
    "UsageTypeID": 4,
    "AddressInfo": {
        "ID": 164256,
        "Title": "El Corte Ingles Sevilla Este",
        "AddressLine1": "Carretera Sevilla - Malaga",
        "Town": "Km 1",
        "StateOrProvince": "Sevilla",
        "Postcode": "41020",
        "CountryID": 210,
        "Latitude": 37.387608,
        "Longitude": -5.93937,
        "ContactTelephone1": "+34 954 269 600",
        "DistanceUnit": 0
    },
    "Connections": [
        {
            "ID": 235495,
            "ConnectionTypeID": 30,
            "StatusTypeID": 50,
            "LevelID": 2,
            "PowerKW": 11,
            "CurrentTypeID": 20,
            "Quantity": 1
        }
    ],
    "NumberOfPoints": 1,
    "GeneralComments": "1 Tesla Connector, up to 11kW.Available for customers. Self park.",
    "StatusTypeID": 50,
    "DateLastStatusUpdate": "2020-08-24T23:04:00Z",
    "DataQualityLevel": 1,
    "DateCreated": "2020-08-24T23:03:00Z",
    "SubmissionStatusTypeID": 200
}