{
    "IsRecentlyVerified": false,
    "ID": 187610,
    "UUID": "99530CB2-7249-4D11-973C-8C1E4BD48121",
    "DataProviderID": 18,
    "DataProvidersReference": "8a7ce9c40b57c10871b9c7913429917c",
    "OperatorID": 3392,
    "UsageTypeID": 5,
    "AddressInfo": {
        "ID": 187969,
        "Title": "A229 Northbound",
        "AddressLine1": "A229 Northbound",
        "Town": "Aylesford",
        "Postcode": "ME20 7EZ",
        "CountryID": 1,
        "Latitude": 51.32012,
        "Longitude": 0.506047,
        "AccessComments": "",
        "RelatedURL": "http://www.shell.co.uk/motorist/welcome-to-shell-recharge.html",
        "DistanceUnit": 0
    },
    "Connections": [
        {
            "ID": 302807,
            "ConnectionTypeID": 1036,
            "Reference": "1",
            "StatusTypeID": 50,
            "LevelID": 3,
            "Amps": 125,
            "Voltage": 400,
            "PowerKW": 50,
            "CurrentTypeID": 30
        },
        {
            "ID": 302808,
            "ConnectionTypeID": 2,
            "Reference": "2",
            "StatusTypeID": 50,
            "LevelID": 3,
            "Amps": 125,
            "Voltage": 400,
            "PowerKW": 50,
            "CurrentTypeID": 30
        }
    ],
    "StatusTypeID": 0,
    "DateLastStatusUpdate": "2021-07-12T03:38:00Z",
    "MetadataValues": [
        {
            "ID": 19850,
            "MetadataFieldID": 4,
            "ItemValue": "Contains public sector information licensed under the Open Government Licence v2.0. http://www.nationalarchives.gov.uk/doc/open-government-licence/version/2/"
        }
    ],
    "DataQualityLevel": 3,
    "DateCreated": "2021-07-12T03:38:00Z",
    "SubmissionStatusTypeID": 100
}