{
    "IsRecentlyVerified": false,
    "ID": 68576,
    "UUID": "012A43A2-14A2-4D30-9A9E-A369E5C57A36",
    "DataProviderID": 1,
    "OperatorID": 2245,
    "UsageTypeID": 4,
    "AddressInfo": {
        "ID": 68922,
        "Title": "Ladesäule",
        "AddressLine1": "Mauerstettenerstr. 6",
        "Town": "Kaufbeuren",
        "Postcode": "87600",
        "CountryID": 87,
        "Latitude": 47.88325,
        "Longitude": 10.635800000000017,
        "ContactTelephone1": "08341/805-455",
        "AccessComments": "Rund um die Uhr (24/7) nutzbar\r\n",
        "RelatedURL": "http://www.vwew-energie.de/",
        "DistanceUnit": 0
    },
    "Connections": [
        {
            "ID": 96054,
            "ConnectionTypeID": 28,
            "StatusTypeID": 50,
            "LevelID": 2,
            "Voltage": 230,
            "PowerKW": 3.7,
            "CurrentTypeID": 10,
            "Quantity": 1
        },
        {
            "ID": 96055,
            "ConnectionTypeID": 25,
            "StatusTypeID": 50,
            "LevelID": 2,
            "PowerKW": 0,
            "CurrentTypeID": 20,
            "Quantity": 0
        },
        {
            "ID": 96056,
            "ConnectionTypeID": 16,
            "StatusTypeID": 50,
            "LevelID": 2,
            "Amps": 16,
            "Voltage": 230,
            "PowerKW": 3.7,
            "CurrentTypeID": 10,
            "Quantity": 1
        },
        {
            "ID": 96057,
            "ConnectionTypeID": 17,
            "Quantity": 0
        }
    ],
    "NumberOfPoints": 2,
    "GeneralComments": "\r\n",
    "StatusTypeID": 50,
    "DateLastStatusUpdate": "2016-06-12T14:43:00Z",
    "DataQualityLevel": 1,
    "DateCreated": "2016-06-12T14:43:00Z",
    "SubmissionStatusTypeID": 200
}