{
    "IsRecentlyVerified": false,
    "ID": 158985,
    "UUID": "82B8E4E2-6444-40B5-B5A0-7123FBD831A0",
    "DataProviderID": 2,
    "DataProvidersReference": "155153",
    "OperatorID": 5,
    "UsageTypeID": 1,
    "AddressInfo": {
        "ID": 159342,
        "Title": "JOEMC",
        "AddressLine1": "259 Western Blvd",
        "Town": "Jacksonville",
        "StateOrProvince": "NC",
        "Postcode": "28546",
        "CountryID": 2,
        "Latitude": 34.7586396,
        "Longitude": -77.3823368,
        "ContactTelephone1": "888-758-4389",
        "AccessComments": "24 hours daily",
        "RelatedURL": "http://www.chargepoint.com/",
        "DistanceUnit": 0
    },
    "Connections": [
        {
            "ID": 229032,
            "ConnectionTypeID": 1,
            "LevelID": 2,
            "Amps": 16,
            "Voltage": 230,
            "PowerKW": 3.7,
            "CurrentTypeID": 10,
            "Quantity": 2
        }
    ],
    "StatusTypeID": 50,
    "DateLastStatusUpdate": "2020-06-26T02:57:00Z",
    "DataQualityLevel": 3,
    "DateCreated": "2020-06-26T02:57:00Z",
    "SubmissionStatusTypeID": 100
}