{
    "IsRecentlyVerified": false,
    "ID": 110254,
    "UUID": "473D75A6-E84D-4AFF-BDB7-33B8F948EBE5",
    "DataProviderID": 2,
    "DataProvidersReference": "100419",
    "OperatorID": 5,
    "UsageTypeID": 1,
    "AddressInfo": {
        "ID": 110600,
        "Title": "BUILDINGB1",
        "AddressLine1": "751 Beaty St",
        "Town": "Davidson",
        "StateOrProvince": "NC",
        "Postcode": "28036",
        "CountryID": 2,
        "Latitude": 35.510364,
        "Longitude": -80.851064,
        "ContactTelephone1": "888-758-4389",
        "AccessComments": "24 hours daily",
        "RelatedURL": "http://www.chargepoint.com/",
        "DistanceUnit": 0
    },
    "Connections": [
        {
            "ID": 155493,
            "ConnectionTypeID": 1,
            "LevelID": 2,
            "Amps": 16,
            "Voltage": 230,
            "PowerKW": 3,
            "CurrentTypeID": 10,
            "Quantity": 4
        }
    ],
    "DateLastStatusUpdate": "2019-04-06T04:02:00Z",
    "DataQualityLevel": 3,
    "DateCreated": "2018-10-18T23:36:00Z",
    "SubmissionStatusTypeID": 100
}