{
    "IsRecentlyVerified": false,
    "ID": 127576,
    "UUID": "A8BBA7B6-E410-4FE8-9B6E-8821531CEC3B",
    "DataProviderID": 1,
    "OperatorID": 23,
    "OperatorsReference": "50493",
    "UsageTypeID": 4,
    "AddressInfo": {
        "ID": 127922,
        "Title": "Hotel le Vouglans",
        "AddressLine1": "12 Rue des Fossés",
        "Town": "Orgelet",
        "Postcode": "39270",
        "CountryID": 80,
        "Latitude": 46.521661,
        "Longitude": 5.610288,
        "ContactTelephone1": " +33 3 84 25 54 80",
        "DistanceUnit": 0
    },
    "Connections": [
        {
            "ID": 178581,
            "ConnectionTypeID": 30,
            "StatusTypeID": 50,
            "LevelID": 2,
            "PowerKW": 22,
            "CurrentTypeID": 20,
            "Quantity": 2
        }
    ],
    "NumberOfPoints": 2,
    "GeneralComments": "2 Tesla Connectors, up to 22kW.Available for customers. Please see front desk.",
    "StatusTypeID": 50,
    "DateLastStatusUpdate": "2019-06-05T11:50:00Z",
    "DataQualityLevel": 1,
    "DateCreated": "2019-06-05T11:50:00Z",
    "SubmissionStatusTypeID": 200
}