{
    "IsRecentlyVerified": false,
    "ID": 63026,
    "UUID": "2206D11D-BF01-4BE6-AA53-5B0573CE19D0",
    "DataProviderID": 26,
    "DataProvidersReference": "75530",
    "OperatorID": 179,
    "OperatorsReference": "Ecotap 1601171",
    "UsageCost": "0.00 afhankelijk van pas",
    "AddressInfo": {
        "ID": 63372,
        "Title": "Graafseweg 294",
        "AddressLine1": "Graafseweg 294",
        "Town": "'s-Hertogenbosch",
        "Postcode": "5213 AS",
        "CountryID": 159,
        "Latitude": 51.698952,
        "Longitude": 5.330384,
        "RelatedURL": "http://www.ecotap.nl",
        "DistanceUnit": 0
    },
    "Connections": [
        {
            "ID": 80135,
            "ConnectionTypeID": 25,
            "LevelID": 2,
            "PowerKW": 22,
            "CurrentTypeID": 10
        }
    ],
    "NumberOfPoints": 2,
    "StatusTypeID": 50,
    "DateLastStatusUpdate": "2016-06-04T02:40:00Z",
    "DataQualityLevel": 3,
    "DateCreated": "2016-03-03T12:29:00Z",
    "SubmissionStatusTypeID": 100
}