{
    "IsRecentlyVerified": false,
    "ID": 4613,
    "UUID": "87D78547-9702-42D8-BF18-48F0C31EB2D1",
    "DataProviderID": 1,
    "OperatorID": 1,
    "UsageTypeID": 1,
    "AddressInfo": {
        "ID": 4558,
        "Title": "McCarthy Olathe Nissan",
        "AddressLine1": "683 N Rawhide Rd",
        "AddressLine2": "",
        "Town": "Olathe",
        "StateOrProvince": "KS",
        "Postcode": "66061",
        "CountryID": 2,
        "Latitude": 38.890301,
        "Longitude": -94.791102,
        "ContactTelephone1": "913.232.2624",
        "ContactEmail": "",
        "AccessComments": "",
        "DistanceUnit": 0
    },
    "Connections": [
        {
            "ID": 268,
            "ConnectionTypeID": 1,
            "LevelID": 2,
            "Quantity": 1
        }
    ],
    "NumberOfPoints": 1,
    "GeneralComments": "",
    "DateLastConfirmed": "2011-06-09T20:03:00Z",
    "StatusTypeID": 100,
    "DateLastStatusUpdate": "2011-06-09T20:03:00Z",
    "DataQualityLevel": 1,
    "DateCreated": "2011-06-09T20:03:00Z",
    "SubmissionStatusTypeID": 200
}