{
    "IsRecentlyVerified": false,
    "ID": 55136,
    "UUID": "875A9451-041C-4ACC-AC52-446104702F44",
    "DataProviderID": 1,
    "OperatorID": 23,
    "UsageTypeID": 1,
    "UsageCost": "Free",
    "AddressInfo": {
        "ID": 55482,
        "Title": "丸の内トラストタワー",
        "AddressLine1": "丸の内 1-8-3",
        "Town": "千代田区",
        "StateOrProvince": "東京都",
        "Postcode": "100-0005",
        "CountryID": 114,
        "Latitude": 35.6825268,
        "Longitude": 139.76942510000003,
        "ContactTelephone1": "03-5511-2366",
        "ContactTelephone2": "0120-975-214",
        "RelatedURL": "http://www.mori-trust.co.jp/office/areamarunouchi/marunouchi_north.html",
        "DistanceUnit": 0
    },
    "Connections": [
        {
            "ID": 69711,
            "ConnectionTypeID": 0,
            "StatusTypeID": 50,
            "LevelID": 2,
            "Amps": 75,
            "CurrentTypeID": 10
        }
    ],
    "NumberOfPoints": 1,
    "StatusTypeID": 50,
    "DateLastStatusUpdate": "2015-10-16T14:06:00Z",
    "DataQualityLevel": 1,
    "DateCreated": "2015-10-16T14:06:00Z",
    "SubmissionStatusTypeID": 200
}