{
    "IsRecentlyVerified": false,
    "ID": 53954,
    "UUID": "A634490C-C4FE-48F1-834D-D33044B0FA65",
    "DataProviderID": 26,
    "DataProvidersReference": "67753",
    "OperatorID": 78,
    "OperatorsReference": "Essent EM-NL-00000363-06-00025",
    "UsageCost": "0.00 jaarabonnement",
    "AddressInfo": {
        "ID": 54300,
        "Title": "Kaneelappelstraat 126",
        "AddressLine1": "Kaneelappelstraat 126",
        "Town": "Amsterdam",
        "Postcode": "1036 LG",
        "CountryID": 159,
        "Latitude": 52.407598,
        "Longitude": 4.90564,
        "RelatedURL": "http://www.essent.nl",
        "DistanceUnit": 0
    },
    "Connections": [
        {
            "ID": 67450,
            "ConnectionTypeID": 25,
            "LevelID": 2,
            "PowerKW": 11,
            "CurrentTypeID": 10
        },
        {
            "ID": 67451,
            "ConnectionTypeID": 25,
            "LevelID": 2,
            "PowerKW": 11,
            "CurrentTypeID": 10
        }
    ],
    "NumberOfPoints": 1,
    "StatusTypeID": 50,
    "DateLastStatusUpdate": "2016-06-04T02:54:00Z",
    "DataQualityLevel": 3,
    "DateCreated": "2015-09-20T11:50:00Z",
    "SubmissionStatusTypeID": 100
}