{
    "IsRecentlyVerified": false,
    "ID": 183513,
    "UUID": "94A6B53F-FD4D-4D50-9967-03CD2C64A5FA",
    "DataProviderID": 29,
    "DataProvidersReference": "19568",
    "AddressInfo": {
        "ID": 183872,
        "Title": "Willy-Rudert-Platz 7",
        "AddressLine1": "Willy-Rudert-Platz 7",
        "Town": "Falkenstein",
        "Postcode": "08223",
        "CountryID": 87,
        "Latitude": 50.4750642,
        "Longitude": 12.3697167,
        "DistanceUnit": 0
    },
    "Connections": [
        {
            "ID": 290595,
            "ConnectionTypeID": 25,
            "StatusTypeID": 50,
            "LevelID": 2,
            "PowerKW": 22,
            "CurrentTypeID": 20
        },
        {
            "ID": 290596,
            "ConnectionTypeID": 25,
            "StatusTypeID": 50,
            "LevelID": 2,
            "PowerKW": 22,
            "CurrentTypeID": 20
        }
    ],
    "StatusTypeID": 50,
    "DateLastStatusUpdate": "2021-07-12T02:45:00Z",
    "MetadataValues": [
        {
            "ID": 15806,
            "MetadataFieldID": 4,
            "ItemValue": "Data from the German chargepoint registry provided by Bundesnetzagentur.de under the CC-BY 4.0 license"
        }
    ],
    "DataQualityLevel": 3,
    "DateCreated": "2021-07-08T10:04:00Z",
    "SubmissionStatusTypeID": 100
}