{
    "IsRecentlyVerified": false,
    "ID": 114982,
    "UUID": "548F49DE-8834-4030-9BF6-96C1BC72E663",
    "DataProviderID": 1,
    "OperatorID": 3333,
    "UsageTypeID": 5,
    "AddressInfo": {
        "ID": 115328,
        "Title": "AAE Naturstrom  (System www.enercharge.at) ",
        "AddressLine1": "Plöckenpaßstraße",
        "Town": "Kötschach-Mauthen",
        "StateOrProvince": "Kärnten/Hermagor",
        "Postcode": "9640",
        "CountryID": 19,
        "Latitude": 46.6711992361765,
        "Longitude": 13.0009200615852,
        "ContactTelephone1": "+43 4715 222",
        "ContactEmail": "info@aae.at",
        "AccessComments": "Operation 24/7\r\nPayment is made directly by credit card or bank card. A payment terminal is installed in the charging station so no charging card is necessary and everyone has access.  \r\n\r\nBetrieb 24/7\r\nZahlung erfolgt direkt mit Kreditkarte oder Bankkarte. In der Ladestation ist ein Zahlungsterminal eingebaut somit ist keine Ladekarte notwändig und jeder hat freien Zugang  ",
        "RelatedURL": "https://www.e-charging.info/show_content.php?sid=269&s2id=0&ets_id=9",
        "DistanceUnit": 0
    },
    "Connections": [
        {
            "ID": 161778,
            "ConnectionTypeID": 25,
            "StatusTypeID": 50,
            "LevelID": 2,
            "Amps": 32,
            "Voltage": 400,
            "PowerKW": 22,
            "CurrentTypeID": 10,
            "Quantity": 5
        },
        {
            "ID": 161779,
            "ConnectionTypeID": 25,
            "StatusTypeID": 50,
            "LevelID": 2,
            "Amps": 64,
            "Voltage": 400,
            "PowerKW": 43,
            "CurrentTypeID": 10,
            "Quantity": 1
        },
        {
            "ID": 161780,
            "ConnectionTypeID": 2,
            "StatusTypeID": 50,
            "LevelID": 3,
            "PowerKW": 50,
            "CurrentTypeID": 30,
            "Quantity": 1
        },
        {
            "ID": 161781,
            "ConnectionTypeID": 33,
            "StatusTypeID": 50,
            "LevelID": 3,
            "PowerKW": 50,
            "CurrentTypeID": 30,
            "Quantity": 1
        }
    ],
    "NumberOfPoints": 8,
    "StatusTypeID": 50,
    "DateLastStatusUpdate": "2019-01-24T16:10:00Z",
    "DataQualityLevel": 1,
    "DateCreated": "2019-01-21T10:11:00Z",
    "SubmissionStatusTypeID": 200
}