{
    "IsRecentlyVerified": false,
    "ID": 179544,
    "UUID": "615C0AFC-D402-4CE2-AE51-C174C62877DC",
    "DataProviderID": 29,
    "DataProvidersReference": "2930",
    "OperatorID": 148,
    "AddressInfo": {
        "ID": 179903,
        "Title": "Gärhof 1",
        "AddressLine1": "Gärhof 1",
        "Town": "Haldensleben",
        "Postcode": "39340",
        "CountryID": 87,
        "Latitude": 52.291582,
        "Longitude": 11.413499,
        "DistanceUnit": 0
    },
    "Connections": [
        {
            "ID": 281504,
            "ConnectionTypeID": 25,
            "StatusTypeID": 50,
            "LevelID": 2,
            "PowerKW": 22,
            "CurrentTypeID": 20
        },
        {
            "ID": 281505,
            "ConnectionTypeID": 16,
            "StatusTypeID": 50,
            "LevelID": 3,
            "PowerKW": 50,
            "CurrentTypeID": 20
        },
        {
            "ID": 300371,
            "ConnectionTypeID": 1036,
            "StatusTypeID": 50,
            "LevelID": 3,
            "PowerKW": 50,
            "CurrentTypeID": 20
        }
    ],
    "StatusTypeID": 50,
    "DateLastStatusUpdate": "2021-07-12T02:49:00Z",
    "MetadataValues": [
        {
            "ID": 11838,
            "MetadataFieldID": 4,
            "ItemValue": "Data from the German chargepoint registry provided by Bundesnetzagentur.de under the CC-BY 4.0 license"
        }
    ],
    "DataQualityLevel": 3,
    "DateCreated": "2021-07-08T09:59:00Z",
    "SubmissionStatusTypeID": 100
}