{
    "UserComments": [
        {
            "ID": 19423,
            "ChargePointID": 92895,
            "CommentTypeID": 10,
            "UserName": "A&A",
            "Comment": "Successful charge of my Leaf",
            "Rating": 5,
            "DateCreated": "2018-04-14T23:00:47.357Z",
            "User": {
                "ID": 18020,
                "Username": "A&A"
            },
            "CheckinStatusTypeID": 10
        }
    ],
    "IsRecentlyVerified": false,
    "ID": 92895,
    "UUID": "739D977F-39DF-4861-B6AD-F196E65E999D",
    "DataProviderID": 1,
    "OperatorID": 32,
    "OperatorsReference": "24052",
    "UsageTypeID": 4,
    "UsageCost": "£0.108/kWh; for Polar Plus subscription members only",
    "AddressInfo": {
        "ID": 93241,
        "Title": "Holiday Inn Huntingdon Racecourse",
        "AddressLine1": "Holiday Inn Huntingdon Racecourse",
        "Town": "Thrapston Road",
        "StateOrProvince": "Brampton",
        "Postcode": "PE28 4NL",
        "CountryID": 1,
        "Latitude": 52.332001,
        "Longitude": -0.2268,
        "DistanceUnit": 0
    },
    "Connections": [
        {
            "ID": 131592,
            "ConnectionTypeID": 33,
            "StatusTypeID": 50,
            "LevelID": 3,
            "PowerKW": 50,
            "CurrentTypeID": 30,
            "Quantity": 1
        },
        {
            "ID": 131593,
            "ConnectionTypeID": 2,
            "StatusTypeID": 50,
            "LevelID": 3,
            "PowerKW": 50,
            "CurrentTypeID": 30,
            "Quantity": 1
        },
        {
            "ID": 131594,
            "ConnectionTypeID": 1036,
            "StatusTypeID": 50,
            "LevelID": 3,
            "PowerKW": 43,
            "CurrentTypeID": 20,
            "Quantity": 1
        }
    ],
    "NumberOfPoints": 1,
    "GeneralComments": "Chargemaster Ultracharger",
    "StatusTypeID": 50,
    "DateLastStatusUpdate": "2019-06-20T05:21:00Z",
    "DataQualityLevel": 1,
    "DateCreated": "2017-09-13T13:52:00Z",
    "SubmissionStatusTypeID": 200
}