{
    "IsRecentlyVerified": false,
    "ID": 187887,
    "UUID": "E90CBE19-B309-441B-9C61-AA424BC68CCE",
    "DataProviderID": 18,
    "DataProvidersReference": "33e9ff669bb529149ab30136547fd1ba",
    "OperatorID": 3345,
    "UsageTypeID": 5,
    "AddressInfo": {
        "ID": 188246,
        "Title": "CV5 8AQ",
        "AddressLine1": "",
        "Town": "Coventry",
        "Postcode": "CV5 8AQ",
        "CountryID": 1,
        "Latitude": 52.40883,
        "Longitude": -1.553506,
        "AccessComments": "",
        "RelatedURL": "https://char.gy",
        "DistanceUnit": 0
    },
    "Connections": [
        {
            "ID": 303215,
            "ConnectionTypeID": 25,
            "Reference": "681",
            "StatusTypeID": 50,
            "LevelID": 2,
            "Amps": 16,
            "Voltage": 230,
            "PowerKW": 3.7,
            "CurrentTypeID": 10
        }
    ],
    "StatusTypeID": 0,
    "DateLastStatusUpdate": "2021-07-12T03:39:00Z",
    "MetadataValues": [
        {
            "ID": 20127,
            "MetadataFieldID": 4,
            "ItemValue": "Contains public sector information licensed under the Open Government Licence v2.0. http://www.nationalarchives.gov.uk/doc/open-government-licence/version/2/"
        }
    ],
    "DataQualityLevel": 3,
    "DateCreated": "2021-07-12T03:39:00Z",
    "SubmissionStatusTypeID": 100
}