{
    "IsRecentlyVerified": false,
    "ID": 180986,
    "UUID": "E231AE91-7668-48B6-89D8-DA85DA89229F",
    "DataProviderID": 29,
    "DataProvidersReference": "13297",
    "OperatorID": 140,
    "AddressInfo": {
        "ID": 181345,
        "Title": "Niederkleiner Straße 7",
        "AddressLine1": "Niederkleiner Straße 7",
        "Town": "Stadtallendorf",
        "Postcode": "35260",
        "CountryID": 87,
        "Latitude": 50.824003,
        "Longitude": 9.01499,
        "DistanceUnit": 0
    },
    "Connections": [
        {
            "ID": 284745,
            "ConnectionTypeID": 1036,
            "StatusTypeID": 50,
            "LevelID": 3,
            "PowerKW": 43,
            "CurrentTypeID": 20
        },
        {
            "ID": 284746,
            "ConnectionTypeID": 33,
            "StatusTypeID": 50,
            "LevelID": 3,
            "PowerKW": 50,
            "CurrentTypeID": 30
        }
    ],
    "StatusTypeID": 50,
    "DateLastStatusUpdate": "2021-07-12T02:45:00Z",
    "MetadataValues": [
        {
            "ID": 13280,
            "MetadataFieldID": 4,
            "ItemValue": "Data from the German chargepoint registry provided by Bundesnetzagentur.de under the CC-BY 4.0 license"
        }
    ],
    "DataQualityLevel": 3,
    "DateCreated": "2021-07-08T10:01:00Z",
    "SubmissionStatusTypeID": 100
}