{
    "IsRecentlyVerified": false,
    "ID": 60596,
    "UUID": "F79A6B69-BB2F-4079-A202-FB6B7B7C382F",
    "DataProviderID": 1,
    "OperatorID": 105,
    "UsageTypeID": 4,
    "AddressInfo": {
        "ID": 60942,
        "Title": "Bahnhof ",
        "AddressLine1": "Bahnhofsallee 5",
        "AddressLine2": "Wintermühlenhof",
        "Town": "Königswinter",
        "StateOrProvince": "Rhein-Sieg-Kreis",
        "Postcode": "53639",
        "CountryID": 87,
        "Latitude": 50.6782966,
        "Longitude": 7.193286199999989,
        "AccessComments": "Rund um die Uhr (24/7) nutzbar.\r\n",
        "RelatedURL": "http://www.extra-blatt.de/rag-vwp/docs/1250205/koenigswinter",
        "DistanceUnit": 0
    },
    "Connections": [
        {
            "ID": 76797,
            "ConnectionTypeID": 25,
            "StatusTypeID": 50,
            "LevelID": 2,
            "Amps": 32,
            "Voltage": 400,
            "PowerKW": 22,
            "CurrentTypeID": 20,
            "Quantity": 2
        }
    ],
    "NumberOfPoints": 2,
    "StatusTypeID": 50,
    "DateLastStatusUpdate": "2016-02-04T06:39:00Z",
    "DataQualityLevel": 1,
    "DateCreated": "2016-02-04T06:39:00Z",
    "SubmissionStatusTypeID": 200
}