{
    "IsRecentlyVerified": false,
    "ID": 119595,
    "UUID": "F71D09C9-FEAF-4877-977B-2BCA49AC1286",
    "DataProviderID": 2,
    "DataProvidersReference": "39966",
    "UsageTypeID": 7,
    "AddressInfo": {
        "ID": 119941,
        "Title": "Fort Lauderdale Nissan",
        "AddressLine1": "1051 S Federal Hwy",
        "Town": "Fort Lauderdale",
        "StateOrProvince": "FL",
        "Postcode": "33316",
        "CountryID": 2,
        "Latitude": 26.109825,
        "Longitude": -80.137099,
        "ContactTelephone1": "954-527-3400",
        "AccessComments": "Dealership business hours\r\nPublic - Call ahead",
        "RelatedURL": "",
        "DistanceUnit": 0
    },
    "Connections": [
        {
            "ID": 168871,
            "ConnectionTypeID": 1,
            "LevelID": 2,
            "Amps": 16,
            "Voltage": 230,
            "PowerKW": 3.7,
            "CurrentTypeID": 10,
            "Quantity": 1
        },
        {
            "ID": 168872,
            "ConnectionTypeID": 2,
            "LevelID": 2,
            "Amps": 100,
            "Voltage": 400,
            "PowerKW": 40,
            "CurrentTypeID": 10,
            "Quantity": 1
        }
    ],
    "DateLastStatusUpdate": "2020-06-26T02:52:00Z",
    "DataQualityLevel": 3,
    "DateCreated": "2019-04-01T04:59:00Z",
    "SubmissionStatusTypeID": 100
}