{
    "IsRecentlyVerified": false,
    "ID": 167603,
    "UUID": "5F5CE955-F47C-4865-B394-D2D6C1F64F27",
    "DataProviderID": 19,
    "DataProvidersReference": "6575",
    "AddressInfo": {
        "ID": 167962,
        "Title": "Hedlundavägen 20",
        "AddressLine1": "Hedlundavägen 20 ",
        "Town": "LYCKSELE",
        "StateOrProvince": "VÄSTERBOTTEN",
        "Postcode": "92137",
        "CountryID": 216,
        "Latitude": 64.5853,
        "Longitude": 18.67863,
        "AccessComments": "Parkering lasarett lycksele",
        "DistanceUnit": 0
    },
    "Connections": [
        {
            "ID": 254453,
            "ConnectionTypeID": 25,
            "Reference": "1",
            "LevelID": 2,
            "Amps": 16,
            "Voltage": 230,
            "PowerKW": 3.7,
            "CurrentTypeID": 10
        },
        {
            "ID": 254454,
            "ConnectionTypeID": 25,
            "Reference": "2",
            "LevelID": 2,
            "Amps": 16,
            "Voltage": 230,
            "PowerKW": 3.7,
            "CurrentTypeID": 10
        },
        {
            "ID": 254455,
            "ConnectionTypeID": 25,
            "Reference": "3",
            "LevelID": 2,
            "Amps": 16,
            "Voltage": 230,
            "PowerKW": 3.7,
            "CurrentTypeID": 10
        },
        {
            "ID": 254456,
            "ConnectionTypeID": 25,
            "Reference": "4",
            "LevelID": 2,
            "Amps": 16,
            "Voltage": 230,
            "PowerKW": 3.7,
            "CurrentTypeID": 10
        }
    ],
    "NumberOfPoints": 4,
    "StatusTypeID": 0,
    "DateLastStatusUpdate": "2020-09-08T04:14:00Z",
    "DataQualityLevel": 2,
    "DateCreated": "2020-09-08T04:14:00Z",
    "SubmissionStatusTypeID": 100
}