{
    "IsRecentlyVerified": false,
    "ID": 18039,
    "UUID": "BE851155-C0A4-4B3D-8946-F550FDA9267A",
    "DataProviderID": 22,
    "DataProvidersReference": "DF64DC2EB4A0B85091DD31EB4923EAAC",
    "AddressInfo": {
        "ID": 18384,
        "Title": "小倉北区役所",
        "AddressLine1": "福岡県北九州市小倉北区大手町1-1",
        "CountryID": 114,
        "Latitude": 33.88055026,
        "Longitude": 130.8737787,
        "ContactTelephone1": "093-582-3311",
        "DistanceUnit": 0
    },
    "Connections": [
        {
            "ID": 18280,
            "ConnectionTypeID": 2,
            "LevelID": 2,
            "Amps": 100,
            "Voltage": 480,
            "PowerKW": 48,
            "Quantity": 1
        }
    ],
    "DateLastStatusUpdate": "2013-06-29T09:06:00Z",
    "DataQualityLevel": 2,
    "DateCreated": "2013-06-29T09:06:00Z",
    "SubmissionStatusTypeID": 200
}