{
    "IsRecentlyVerified": false,
    "ID": 177227,
    "UUID": "5AB29F3E-CA91-4F90-889A-D21F86B4DC58",
    "DataProviderID": 29,
    "DataProvidersReference": "15141",
    "AddressInfo": {
        "ID": 177586,
        "Title": "Ulanenstr. (Vereinshaus Fraulautern)",
        "AddressLine1": "Ulanenstr. (Vereinshaus Fraulautern)",
        "Town": "Saarlouis",
        "Postcode": "66740",
        "CountryID": 87,
        "Latitude": 49.325261,
        "Longitude": 6.768839,
        "DistanceUnit": 0
    },
    "Connections": [
        {
            "ID": 276129,
            "ConnectionTypeID": 25,
            "StatusTypeID": 50,
            "LevelID": 2,
            "PowerKW": 22,
            "CurrentTypeID": 20
        },
        {
            "ID": 276130,
            "ConnectionTypeID": 25,
            "StatusTypeID": 50,
            "LevelID": 2,
            "PowerKW": 22,
            "CurrentTypeID": 20
        }
    ],
    "StatusTypeID": 0,
    "DateLastStatusUpdate": "2021-07-12T02:43:00Z",
    "MetadataValues": [
        {
            "ID": 9521,
            "MetadataFieldID": 4,
            "ItemValue": "Data from the German chargepoint registry provided by Bundesnetzagentur.de under the CC-BY 4.0 license"
        }
    ],
    "DataQualityLevel": 3,
    "DateCreated": "2021-07-08T09:48:00Z",
    "SubmissionStatusTypeID": 100
}