{
    "IsRecentlyVerified": false,
    "ID": 115387,
    "UUID": "115F1792-A8B0-4091-B990-6DF97DDA02D6",
    "DataProviderID": 2,
    "DataProvidersReference": "115788",
    "OperatorID": 23,
    "UsageTypeID": 1,
    "AddressInfo": {
        "ID": 115733,
        "Title": "Pier 121 Marina - Tesla Destination",
        "AddressLine1": "1481 E Hill Park Rd ",
        "Town": "Lewisville",
        "StateOrProvince": "TX",
        "Postcode": "75056",
        "CountryID": 2,
        "Latitude": 33.074881,
        "Longitude": -96.921999,
        "ContactTelephone1": "972-625-2233  877-798-3752",
        "AccessComments": "24 hours daily; for Tesla use only; for member use only ",
        "RelatedURL": "https://www.tesla.com/destination-charging",
        "DistanceUnit": 0
    },
    "Connections": [
        {
            "ID": 162390,
            "ConnectionTypeID": 0,
            "LevelID": 2,
            "Amps": 16,
            "Voltage": 230,
            "PowerKW": 3,
            "CurrentTypeID": 10,
            "Quantity": 4
        }
    ],
    "DateLastStatusUpdate": "2019-04-06T04:01:00Z",
    "DataQualityLevel": 3,
    "DateCreated": "2019-02-11T07:13:00Z",
    "SubmissionStatusTypeID": 100
}