{
    "IsRecentlyVerified": false,
    "ID": 144910,
    "UUID": "451132EE-B4A8-4FE9-8B1C-10FB5C3E8124",
    "DataProviderID": 2,
    "DataProvidersReference": "130967",
    "OperatorID": 90,
    "UsageTypeID": 1,
    "AddressInfo": {
        "ID": 145262,
        "Title": "Desjardins - CdS Saint-Lin-des-Laurentides",
        "AddressLine1": "915 12e Avenue",
        "Town": "Saint-Lin-des-Laurentides",
        "StateOrProvince": "QC",
        "Postcode": "J5M 2W1",
        "CountryID": 44,
        "Latitude": 45.85152,
        "Longitude": -73.75471,
        "ContactTelephone1": "877-505-2674",
        "AccessComments": "24 hours daily",
        "RelatedURL": "https://lecircuitelectrique.com/",
        "DistanceUnit": 0
    },
    "Connections": [
        {
            "ID": 201463,
            "ConnectionTypeID": 1,
            "LevelID": 2,
            "Amps": 16,
            "Voltage": 230,
            "PowerKW": 3.7,
            "CurrentTypeID": 10,
            "Quantity": 1
        }
    ],
    "StatusTypeID": 50,
    "DateLastStatusUpdate": "2020-06-26T03:09:00Z",
    "DataQualityLevel": 3,
    "DateCreated": "2019-12-24T09:24:00Z",
    "SubmissionStatusTypeID": 100
}