{
    "IsRecentlyVerified": false,
    "ID": 29361,
    "UUID": "0260D94C-07D5-46B6-9656-FAC4C7D14143",
    "DataProviderID": 1,
    "OperatorID": 23,
    "OperatorsReference": "28993",
    "UsageTypeID": 2,
    "UsageCost": "$0.25/kWh; other tariffs for older cars",
    "AddressInfo": {
        "ID": 29707,
        "Title": "Best Western Plus Bronco Inn - Tesla",
        "AddressLine1": "105 W Galbreath Way",
        "Town": "Ritzville",
        "StateOrProvince": "WA",
        "Postcode": "99169",
        "CountryID": 2,
        "Latitude": 47.1167458,
        "Longitude": -118.3677762,
        "ContactTelephone1": "877-798-3752",
        "AccessComments": "24 hours daily; for Tesla use only",
        "DistanceUnit": 0
    },
    "Connections": [
        {
            "ID": 32286,
            "ConnectionTypeID": 27,
            "StatusTypeID": 50,
            "LevelID": 3,
            "Amps": 100,
            "Voltage": 400,
            "PowerKW": 120,
            "CurrentTypeID": 30,
            "Quantity": 4
        }
    ],
    "NumberOfPoints": 4,
    "StatusTypeID": 50,
    "DateLastStatusUpdate": "2018-03-13T13:11:00Z",
    "DataQualityLevel": 3,
    "DateCreated": "2014-11-28T03:39:00Z",
    "SubmissionStatusTypeID": 200
}