{
    "IsRecentlyVerified": false,
    "ID": 9223,
    "UUID": "A25B743B-70E1-4B80-A258-5D1CF8424463",
    "DataProviderID": 15,
    "DataProvidersReference": "12962",
    "OperatorID": 5,
    "UsageTypeID": 1,
    "AddressInfo": {
        "ID": 9120,
        "Title": "201 N Magnolia Ave",
        "AddressLine1": "201 N Magnolia Ave",
        "Town": "Burbank",
        "StateOrProvince": "California",
        "Postcode": "91502",
        "CountryID": 2,
        "Latitude": 34.18432,
        "Longitude": -118.31256,
        "ContactTelephone1": "(818) 566-8556",
        "RelatedURL": "http://carstations.com/12962",
        "DistanceUnit": 0
    },
    "Connections": [
        {
            "ID": 6904,
            "ConnectionTypeID": 1,
            "Reference": "J1772",
            "LevelID": 2
        },
        {
            "ID": 9082,
            "ConnectionTypeID": 9,
            "Reference": "NEMA5",
            "LevelID": 1,
            "Quantity": 1
        }
    ],
    "NumberOfPoints": 2,
    "StatusTypeID": 50,
    "DateLastStatusUpdate": "2017-11-04T14:04:00Z",
    "DataQualityLevel": 2,
    "DateCreated": "2012-01-23T15:12:00Z",
    "SubmissionStatusTypeID": 100
}