{
    "IsRecentlyVerified": false,
    "ID": 9203,
    "UUID": "4B1890F0-1D0C-4202-86E0-FB6B805EE0B7",
    "DataProviderID": 15,
    "DataProvidersReference": "13547",
    "OperatorID": 1,
    "UsageTypeID": 1,
    "AddressInfo": {
        "ID": 9100,
        "Title": "780 Chapel Road",
        "AddressLine1": "780 Chapel Road",
        "Town": "Sedona",
        "StateOrProvince": "AZ",
        "Postcode": "86336",
        "CountryID": 2,
        "Latitude": 34.83223,
        "Longitude": -111.7664,
        "ContactTelephone1": "(928) 282-4069",
        "RelatedURL": "http://carstations.com/13547",
        "DistanceUnit": 0
    },
    "Connections": [
        {
            "ID": 6884,
            "ConnectionTypeID": 9,
            "Reference": "NEMA5",
            "LevelID": 1
        }
    ],
    "NumberOfPoints": 1,
    "StatusTypeID": 0,
    "DateLastStatusUpdate": "2017-11-04T14:04:00Z",
    "DataQualityLevel": 2,
    "DateCreated": "2012-01-23T15:12:00Z",
    "SubmissionStatusTypeID": 100
}