{
    "IsRecentlyVerified": false,
    "ID": 93007,
    "UUID": "17A95D86-5978-445B-B36F-CEE038EB8FF2",
    "DataProviderID": 1,
    "OperatorID": 23,
    "OperatorsReference": "34954",
    "UsageTypeID": 4,
    "AddressInfo": {
        "ID": 93353,
        "Title": "St Moritz Hotel",
        "AddressLine1": "St Moritz Hotel",
        "Town": "Trebetherick",
        "StateOrProvince": "Cornwall",
        "Postcode": "PL27 6SD",
        "CountryID": 1,
        "Latitude": 50.567,
        "Longitude": -4.9201,
        "ContactTelephone1": "+44 120 886 2242",
        "DistanceUnit": 0
    },
    "Connections": [
        {
            "ID": 131741,
            "ConnectionTypeID": 30,
            "StatusTypeID": 50,
            "LevelID": 2,
            "Amps": 32,
            "Voltage": 400,
            "PowerKW": 22,
            "CurrentTypeID": 20,
            "Quantity": 2
        }
    ],
    "NumberOfPoints": 2,
    "GeneralComments": "2 Tesla Connectors, up to 22kW.Available for customers. Please see front desk.",
    "StatusTypeID": 50,
    "DateLastStatusUpdate": "2018-10-03T22:08:00Z",
    "DataQualityLevel": 1,
    "DateCreated": "2017-09-15T05:36:00Z",
    "SubmissionStatusTypeID": 200
}