{
    "IsRecentlyVerified": false,
    "ID": 65104,
    "UUID": "9DDF0BE9-1515-4825-8AA2-60FD0635FE37",
    "DataProviderID": 1,
    "OperatorID": 220,
    "OperatorsReference": "0391,0391,0392,0393",
    "UsageTypeID": 1,
    "UsageCost": "€1.73 + €0.3213/kWh; Andere Tarife möglich",
    "AddressInfo": {
        "ID": 65450,
        "Title": "Michaeliskirche",
        "AddressLine1": "Englische Planke 16",
        "AddressLine2": "Neustadt",
        "Town": "Hamburg",
        "StateOrProvince": "Hamburg",
        "Postcode": "20459",
        "CountryID": 87,
        "Latitude": 53.5477515129898,
        "Longitude": 9.97814405159,
        "AccessComments": "24/7 nutzbare Ladesäule am Straßenrand. Laden mit Ladekarte von Stromnetz Hamburg oder Roamingpartnern The New Motion, PlugSurfing, Hamburg Energie, SUN, Charge & Fuel, Vattenfall und vielen anderen möglich.",
        "DistanceUnit": 0
    },
    "Connections": [
        {
            "ID": 89608,
            "ConnectionTypeID": 25,
            "StatusTypeID": 50,
            "LevelID": 2,
            "Amps": 32,
            "Voltage": 400,
            "PowerKW": 11,
            "CurrentTypeID": 20,
            "Quantity": 1
        },
        {
            "ID": 89609,
            "ConnectionTypeID": 28,
            "StatusTypeID": 50,
            "LevelID": 2,
            "Amps": 16,
            "Voltage": 230,
            "PowerKW": 3.7,
            "CurrentTypeID": 10,
            "Quantity": 2
        },
        {
            "ID": 136607,
            "ConnectionTypeID": 33,
            "StatusTypeID": 50,
            "LevelID": 3,
            "PowerKW": 50,
            "CurrentTypeID": 30,
            "Quantity": 1
        },
        {
            "ID": 136608,
            "ConnectionTypeID": 2,
            "StatusTypeID": 50,
            "LevelID": 3,
            "PowerKW": 50,
            "CurrentTypeID": 30,
            "Quantity": 1
        }
    ],
    "NumberOfPoints": 2,
    "StatusTypeID": 50,
    "DateLastStatusUpdate": "2018-03-02T06:58:00Z",
    "DataQualityLevel": 1,
    "DateCreated": "2016-04-11T09:54:00Z",
    "SubmissionStatusTypeID": 200
}