{
    "IsRecentlyVerified": false,
    "ID": 149470,
    "UUID": "9E371521-1562-4555-9035-5430122422E5",
    "DataProviderID": 1,
    "OperatorID": 32,
    "OperatorsReference": "70602",
    "UsageTypeID": 4,
    "UsageCost": "£0.36/kWh",
    "AddressInfo": {
        "ID": 149823,
        "Title": "Wokingham Borough Council Offices",
        "AddressLine1": "Wokingham Borough Council Offices",
        "Postcode": "RG40 1WL",
        "CountryID": 1,
        "Latitude": 51.411205086775,
        "Longitude": -0.838336930580112,
        "RelatedURL": "http://www.polar-network.com",
        "DistanceUnit": 0
    },
    "Connections": [
        {
            "ID": 207538,
            "ConnectionTypeID": 2,
            "StatusTypeID": 50,
            "LevelID": 3,
            "PowerKW": 50,
            "CurrentTypeID": 30,
            "Quantity": 1
        },
        {
            "ID": 207539,
            "ConnectionTypeID": 1036,
            "StatusTypeID": 50,
            "LevelID": 3,
            "PowerKW": 43,
            "CurrentTypeID": 20,
            "Quantity": 1
        },
        {
            "ID": 207540,
            "ConnectionTypeID": 33,
            "StatusTypeID": 50,
            "LevelID": 3,
            "PowerKW": 50,
            "CurrentTypeID": 30,
            "Quantity": 1
        }
    ],
    "NumberOfPoints": 1,
    "StatusTypeID": 50,
    "DateLastStatusUpdate": "2021-03-08T08:50:00Z",
    "DataQualityLevel": 1,
    "DateCreated": "2020-02-27T06:15:00Z",
    "SubmissionStatusTypeID": 200
}