{
    "IsRecentlyVerified": false,
    "ID": 48511,
    "UUID": "7FBF90CE-6A0D-4189-95E8-13A1FDB3EA3E",
    "DataProviderID": 1,
    "OperatorID": 71,
    "OperatorsReference": "APT-0296-0011/13W",
    "UsageTypeID": 6,
    "AddressInfo": {
        "ID": 48857,
        "Title": "Bourneville Village Trust",
        "AddressLine1": "350 Bourneville Lane",
        "Town": "Bourneville",
        "Postcode": "B30 1QY",
        "CountryID": 1,
        "Latitude": 52.4298356,
        "Longitude": -1.94956579999996,
        "ContactTelephone1": "0300 333 6540",
        "AccessComments": "On wall of main building behind ANPR activated barrier. Please call first and provide registration number. Fitted under Midlands PiP\r\nAccess Mo-Fr 09:00-17:00",
        "RelatedURL": "https://www.bvt.org.uk/",
        "DistanceUnit": 0
    },
    "Connections": [
        {
            "ID": 59966,
            "ConnectionTypeID": 25,
            "Reference": "0",
            "StatusTypeID": 50,
            "LevelID": 2,
            "Amps": 32,
            "Voltage": 230,
            "PowerKW": 7,
            "CurrentTypeID": 10
        }
    ],
    "NumberOfPoints": 2,
    "StatusTypeID": 50,
    "DateLastStatusUpdate": "2015-10-07T12:11:00Z",
    "MetadataValues": [
        {
            "ID": 1518,
            "MetadataFieldID": 4,
            "ItemValue": "Contains public sector information licensed under the Open Government Licence v2.0. http://www.nationalarchives.gov.uk/doc/open-government-licence/version/2/"
        }
    ],
    "DataQualityLevel": 3,
    "DateCreated": "2015-06-27T07:22:00Z",
    "SubmissionStatusTypeID": 100
}