{
    "IsRecentlyVerified": false,
    "ID": 127230,
    "UUID": "7C6138B6-48CA-4F35-98F9-C3AE83E57737",
    "DataProviderID": 1,
    "OperatorID": 3318,
    "UsageTypeID": 5,
    "UsageCost": "$0.16/min for up to 90 kW.  $0.32/min up to 350 kW. Move within ten minutes afterward to avoid the $0.40/min idling fee. MC and Visa accepted",
    "AddressInfo": {
        "ID": 127576,
        "Title": "Electrify America - University Park Mall",
        "AddressLine1": "6501 Grape Rd",
        "Town": "Mishawaka",
        "StateOrProvince": "IN",
        "Postcode": "46545",
        "CountryID": 2,
        "Latitude": 41.719434086498694,
        "Longitude": -86.19360349999897,
        "ContactTelephone1": "+1 833-632-2778",
        "ContactEmail": "help@electrifyamerica.com",
        "RelatedURL": "https://www.electrifyamerica.com/",
        "DistanceUnit": 0
    },
    "Connections": [
        {
            "ID": 178153,
            "ConnectionTypeID": 32,
            "StatusTypeID": 50,
            "LevelID": 3,
            "Amps": 350,
            "Voltage": 1000,
            "PowerKW": 350,
            "CurrentTypeID": 30,
            "Quantity": 2
        },
        {
            "ID": 178154,
            "ConnectionTypeID": 2,
            "StatusTypeID": 50,
            "LevelID": 3,
            "PowerKW": 50,
            "CurrentTypeID": 30,
            "Quantity": 1,
            "Comments": "bay shared with a CCS"
        },
        {
            "ID": 273659,
            "ConnectionTypeID": 32,
            "StatusTypeID": 50,
            "LevelID": 3,
            "PowerKW": 150,
            "CurrentTypeID": 30,
            "Quantity": 2,
            "Comments": "one bay shared with a CHAdeMO"
        }
    ],
    "NumberOfPoints": 4,
    "StatusTypeID": 50,
    "DateLastStatusUpdate": "2021-06-28T08:06:00Z",
    "DataQualityLevel": 1,
    "DateCreated": "2019-05-31T03:19:00Z",
    "SubmissionStatusTypeID": 200
}