{
    "IsRecentlyVerified": false,
    "ID": 17914,
    "UUID": "608F7641-B31F-49F5-9607-8759CD69D27A",
    "DataProviderID": 22,
    "DataProvidersReference": "65F675B3CF48B79D1D4FE970F1688C6B",
    "AddressInfo": {
        "ID": 18259,
        "Title": "まちの駅クロスピアくみやま",
        "AddressLine1": "京都府久世郡久御山町森南大内303",
        "CountryID": 114,
        "Latitude": 34.89165501,
        "Longitude": 135.7472329,
        "ContactTelephone1": "075-632-2300",
        "DistanceUnit": 0
    },
    "Connections": [
        {
            "ID": 18155,
            "ConnectionTypeID": 2,
            "LevelID": 2,
            "Amps": 100,
            "Voltage": 480,
            "PowerKW": 48,
            "Quantity": 1
        }
    ],
    "DateLastStatusUpdate": "2013-06-29T09:05:00Z",
    "DataQualityLevel": 2,
    "DateCreated": "2013-06-29T09:05:00Z",
    "SubmissionStatusTypeID": 200
}