{
    "IsRecentlyVerified": false,
    "ID": 120870,
    "UUID": "E73DC869-9096-4F42-BFDE-7FE0C0B55631",
    "DataProviderID": 2,
    "DataProvidersReference": "63552",
    "OperatorID": 5,
    "UsageTypeID": 1,
    "AddressInfo": {
        "ID": 121216,
        "Title": "SPARKY",
        "AddressLine1": "75-181 Mediterranean Ave",
        "Town": "Palm Desert",
        "StateOrProvince": "CA",
        "Postcode": "92211",
        "CountryID": 2,
        "Latitude": 33.7437507,
        "Longitude": -116.353601,
        "ContactTelephone1": "888-758-4389",
        "AccessComments": "24 hours daily",
        "RelatedURL": "http://www.chargepoint.com/",
        "DistanceUnit": 0
    },
    "Connections": [
        {
            "ID": 170273,
            "ConnectionTypeID": 1,
            "LevelID": 2,
            "Amps": 16,
            "Voltage": 230,
            "PowerKW": 3,
            "CurrentTypeID": 10,
            "Quantity": 2
        }
    ],
    "DateLastStatusUpdate": "2019-12-24T09:10:00Z",
    "DataQualityLevel": 3,
    "DateCreated": "2019-04-01T04:59:00Z",
    "SubmissionStatusTypeID": 100
}