{
    "IsRecentlyVerified": false,
    "ID": 99795,
    "UUID": "DFE30158-76ED-496C-BCA7-E5C4B197D919",
    "DataProviderID": 1,
    "OperatorID": 69,
    "UsageTypeID": 4,
    "AddressInfo": {
        "ID": 100141,
        "Title": "Einkaufszentrum A71 Center",
        "AddressLine1": "Industriestraße 4",
        "Town": "Zella Mehlis",
        "StateOrProvince": "Landkreis Schmalkalden-Meiningen",
        "Postcode": "98544",
        "CountryID": 87,
        "Latitude": 50.6439016777499,
        "Longitude": 10.688175026319872,
        "AccessComments": "24/7 nutzbar",
        "DistanceUnit": 0
    },
    "Connections": [
        {
            "ID": 140999,
            "ConnectionTypeID": 25,
            "StatusTypeID": 50,
            "LevelID": 2,
            "Amps": 32,
            "Voltage": 400,
            "PowerKW": 22,
            "CurrentTypeID": 20,
            "Quantity": 2
        }
    ],
    "NumberOfPoints": 2,
    "StatusTypeID": 50,
    "DateLastStatusUpdate": "2018-02-05T15:13:00Z",
    "DataQualityLevel": 1,
    "DateCreated": "2018-02-05T15:13:00Z",
    "SubmissionStatusTypeID": 200
}