{
    "IsRecentlyVerified": false,
    "ID": 185209,
    "UUID": "B295E4B8-E5BA-4338-9D34-BF2C99C53FF7",
    "DataProviderID": 29,
    "DataProvidersReference": "19308",
    "OperatorID": 45,
    "AddressInfo": {
        "ID": 185568,
        "Title": "Siedlerstr.  40-44",
        "AddressLine1": "Siedlerstr.  40-44",
        "Town": "Gäufelden",
        "Postcode": "71126",
        "CountryID": 87,
        "Latitude": 48.5599221723564,
        "Longitude": 8.85752612153573,
        "DistanceUnit": 0
    },
    "Connections": [
        {
            "ID": 294383,
            "ConnectionTypeID": 25,
            "StatusTypeID": 50,
            "LevelID": 2,
            "PowerKW": 22,
            "CurrentTypeID": 20
        },
        {
            "ID": 294384,
            "ConnectionTypeID": 25,
            "StatusTypeID": 50,
            "LevelID": 2,
            "PowerKW": 22,
            "CurrentTypeID": 20
        }
    ],
    "StatusTypeID": 50,
    "DateLastStatusUpdate": "2021-07-12T02:41:00Z",
    "MetadataValues": [
        {
            "ID": 17500,
            "MetadataFieldID": 4,
            "ItemValue": "Data from the German chargepoint registry provided by Bundesnetzagentur.de under the CC-BY 4.0 license"
        }
    ],
    "DataQualityLevel": 3,
    "DateCreated": "2021-07-08T10:06:00Z",
    "SubmissionStatusTypeID": 100
}