{
    "IsRecentlyVerified": false,
    "ID": 114972,
    "UUID": "782FF8D8-0016-44C8-A2F4-C3C9E75FAF58",
    "DataProviderID": 1,
    "OperatorID": 80,
    "UsageTypeID": 4,
    "AddressInfo": {
        "ID": 115318,
        "Title": " Campo Sportivo Saint-Marcel | EnelX",
        "AddressLine1": "Località Lillaz, 8",
        "Town": "Saint-Marcel",
        "StateOrProvince": "AO",
        "Postcode": "11020",
        "CountryID": 112,
        "Latitude": 45.7374345374783,
        "Longitude": 7.440112074177,
        "ContactTelephone1": "800.069.850",
        "RelatedURL": "https://www.enelx.com/it/it/emobility",
        "DistanceUnit": 0
    },
    "Connections": [
        {
            "ID": 161762,
            "ConnectionTypeID": 25,
            "StatusTypeID": 50,
            "LevelID": 2,
            "Amps": 32,
            "Voltage": 400,
            "PowerKW": 22,
            "CurrentTypeID": 20,
            "Quantity": 2
        }
    ],
    "NumberOfPoints": 2,
    "StatusTypeID": 50,
    "DateLastStatusUpdate": "2019-01-20T11:21:00Z",
    "DataQualityLevel": 1,
    "DateCreated": "2019-01-20T11:04:00Z",
    "SubmissionStatusTypeID": 200
}