{
    "IsRecentlyVerified": false,
    "ID": 119779,
    "UUID": "4B40C1DA-098F-4466-B8A4-B2938493C1E4",
    "DataProviderID": 2,
    "DataProvidersReference": "74847",
    "OperatorID": 5,
    "UsageTypeID": 1,
    "AddressInfo": {
        "ID": 120125,
        "Title": "USF",
        "AddressLine1": "11810 USF Alumni Drive",
        "Town": "Tampa",
        "StateOrProvince": "FL",
        "Postcode": "33620",
        "CountryID": 2,
        "Latitude": 28.0558168,
        "Longitude": -82.4082332,
        "ContactTelephone1": "888-758-4389",
        "AccessComments": "24 hours daily",
        "RelatedURL": "http://www.chargepoint.com/",
        "DistanceUnit": 0
    },
    "Connections": [
        {
            "ID": 169068,
            "ConnectionTypeID": 1,
            "LevelID": 2,
            "Amps": 16,
            "Voltage": 230,
            "PowerKW": 3,
            "CurrentTypeID": 10,
            "Quantity": 1
        }
    ],
    "DateLastStatusUpdate": "2019-12-24T09:08:00Z",
    "DataQualityLevel": 3,
    "DateCreated": "2019-04-01T04:59:00Z",
    "SubmissionStatusTypeID": 100
}