{
    "IsRecentlyVerified": false,
    "ID": 170482,
    "UUID": "281FAAEF-5DFE-45C4-A798-7EDF979DB7DE",
    "DataProviderID": 1,
    "OperatorID": 23,
    "OperatorsReference": "54388",
    "UsageTypeID": 4,
    "UsageCost": "£0.24/kWh;other tariffs for older cars",
    "AddressInfo": {
        "ID": 170841,
        "Title": "Birmingham-St Andrews",
        "AddressLine1": "110 Small Heath Highway",
        "Town": "Birmingham",
        "Postcode": "B10 0BW",
        "CountryID": 1,
        "Latitude": 52.471144,
        "Longitude": -1.873503,
        "DistanceUnit": 0
    },
    "Connections": [
        {
            "ID": 260163,
            "ConnectionTypeID": 27,
            "StatusTypeID": 50,
            "LevelID": 3,
            "PowerKW": 120,
            "CurrentTypeID": 30,
            "Quantity": 16
        }
    ],
    "NumberOfPoints": 16,
    "GeneralComments": "16 Superchargers, available 24/7, up to 250 kW ",
    "StatusTypeID": 50,
    "DateLastStatusUpdate": "2020-11-29T08:59:00Z",
    "DataQualityLevel": 1,
    "DateCreated": "2020-11-28T06:58:00Z",
    "SubmissionStatusTypeID": 200
}