{
    "IsRecentlyVerified": false,
    "ID": 182149,
    "UUID": "83F2EB8B-C863-493E-B59D-781ADF3428A2",
    "DataProviderID": 29,
    "DataProvidersReference": "14887",
    "OperatorID": 184,
    "AddressInfo": {
        "ID": 182508,
        "Title": "Otto-Ruhe-Str. 2 Parkplatz Gesamtschule Kierspe",
        "AddressLine1": "Otto-Ruhe-Str. 2 Parkplatz Gesamtschule Kierspe",
        "Town": "Kierspe",
        "Postcode": "58566",
        "CountryID": 87,
        "Latitude": 51.128272,
        "Longitude": 7.595052,
        "DistanceUnit": 0
    },
    "Connections": [
        {
            "ID": 287537,
            "ConnectionTypeID": 25,
            "StatusTypeID": 50,
            "LevelID": 2,
            "PowerKW": 22,
            "CurrentTypeID": 20
        },
        {
            "ID": 287538,
            "ConnectionTypeID": 25,
            "StatusTypeID": 50,
            "LevelID": 2,
            "PowerKW": 22,
            "CurrentTypeID": 20
        }
    ],
    "StatusTypeID": 50,
    "DateLastStatusUpdate": "2021-07-09T03:22:00Z",
    "MetadataValues": [
        {
            "ID": 14443,
            "MetadataFieldID": 4,
            "ItemValue": "Data from the German chargepoint registry provided by Bundesnetzagentur.de under the CC-BY 4.0 license"
        }
    ],
    "DataQualityLevel": 3,
    "DateCreated": "2021-07-08T10:02:00Z",
    "SubmissionStatusTypeID": 100
}