{
    "IsRecentlyVerified": false,
    "ID": 168298,
    "UUID": "73964C5B-3EF0-496B-AA5A-A011F0CE38C4",
    "DataProviderID": 1,
    "OperatorID": 32,
    "UsageTypeID": 4,
    "AddressInfo": {
        "ID": 168657,
        "Title": "Mitchell Road",
        "AddressLine1": "Mitchell Road",
        "Town": "Corby",
        "Postcode": "NN17 5AF",
        "CountryID": 1,
        "Latitude": 52.512779,
        "Longitude": -0.66444,
        "RelatedURL": "https://www.bpchargemaster.com",
        "DistanceUnit": 0
    },
    "Connections": [
        {
            "ID": 255608,
            "ConnectionTypeID": 25,
            "Reference": "1",
            "StatusTypeID": 50,
            "LevelID": 2,
            "Amps": 32,
            "Voltage": 230,
            "PowerKW": 7,
            "CurrentTypeID": 10
        },
        {
            "ID": 255609,
            "ConnectionTypeID": 25,
            "Reference": "2",
            "StatusTypeID": 50,
            "LevelID": 2,
            "Amps": 32,
            "Voltage": 400,
            "PowerKW": 22,
            "CurrentTypeID": 20
        }
    ],
    "StatusTypeID": 0,
    "DateLastStatusUpdate": "2020-12-04T11:45:00Z",
    "MetadataValues": [
        {
            "ID": 8251,
            "MetadataFieldID": 4,
            "ItemValue": "Contains public sector information licensed under the Open Government Licence v2.0. http://www.nationalarchives.gov.uk/doc/open-government-licence/version/2/"
        }
    ],
    "DataQualityLevel": 3,
    "DateCreated": "2020-09-21T16:34:00Z",
    "SubmissionStatusTypeID": 100
}