{
    "IsRecentlyVerified": false,
    "ID": 173587,
    "UUID": "577BC3C9-3477-460A-AA28-D5EC03F89E15",
    "DataProviderID": 18,
    "DataProvidersReference": "74e546885ffb31ea9d7b029f5b37112e",
    "OperatorID": 2244,
    "UsageTypeID": 5,
    "AddressInfo": {
        "ID": 173946,
        "Title": "55 Marlborough Hill",
        "AddressLine1": "55 Marlborough Hill",
        "Town": "London",
        "Postcode": "NW8 0NG",
        "CountryID": 1,
        "Latitude": 51.539209,
        "Longitude": -0.177194,
        "AccessComments": "",
        "RelatedURL": "https://www.ubitricity.com",
        "DistanceUnit": 0
    },
    "Connections": [
        {
            "ID": 266659,
            "ConnectionTypeID": 25,
            "Reference": "suby1100008393",
            "StatusTypeID": 50,
            "LevelID": 2,
            "Amps": 16,
            "Voltage": 230,
            "PowerKW": 3.7,
            "CurrentTypeID": 10
        }
    ],
    "StatusTypeID": 0,
    "DateLastStatusUpdate": "2021-04-25T05:46:00Z",
    "MetadataValues": [
        {
            "ID": 8509,
            "MetadataFieldID": 4,
            "ItemValue": "Contains public sector information licensed under the Open Government Licence v2.0. http://www.nationalarchives.gov.uk/doc/open-government-licence/version/2/"
        }
    ],
    "DataQualityLevel": 3,
    "DateCreated": "2021-03-03T11:25:00Z",
    "SubmissionStatusTypeID": 100
}