{
    "IsRecentlyVerified": false,
    "ID": 57268,
    "UUID": "9FC07FE5-6CFF-4B99-B20E-01DFEBB2623C",
    "DataProviderID": 1,
    "OperatorID": 23,
    "OperatorsReference": "9394",
    "UsageTypeID": 1,
    "UsageCost": "Free",
    "AddressInfo": {
        "ID": 57614,
        "Title": "The Commodore Theatre - Tesla",
        "AddressLine1": "421 High St",
        "Town": "Portsmouth",
        "StateOrProvince": "VA",
        "Postcode": "23704",
        "CountryID": 2,
        "Latitude": 36.834999,
        "Longitude": -76.301816,
        "ContactTelephone1": "757-544-1379  877-798-3752",
        "AccessComments": "24 hours daily; for Tesla use only",
        "RelatedURL": "http://www.teslamotors.com/supercharger",
        "DistanceUnit": 0
    },
    "Connections": [
        {
            "ID": 72366,
            "ConnectionTypeID": 30,
            "StatusTypeID": 50,
            "LevelID": 2,
            "Amps": 16,
            "Voltage": 230,
            "PowerKW": 16,
            "CurrentTypeID": 10,
            "Quantity": 2
        }
    ],
    "NumberOfPoints": 2,
    "StatusTypeID": 50,
    "DateLastStatusUpdate": "2017-01-31T21:49:00Z",
    "DataQualityLevel": 3,
    "DateCreated": "2015-11-30T11:50:00Z",
    "SubmissionStatusTypeID": 100
}