{
    "MediaItems": [
        {
            "ID": 28805,
            "ChargePointID": 169552,
            "ItemURL": "https://s3-ap-southeast-2.amazonaws.com/openchargemap/images/FR/OCM169552/OCM-169552.orig.2021072716025865.jpg",
            "ItemThumbnailURL": "https://s3-ap-southeast-2.amazonaws.com/openchargemap/images/FR/OCM169552/OCM-169552.thmb.2021072716025865.jpg",
            "Comment": "",
            "IsEnabled": true,
            "IsVideo": false,
            "IsFeaturedItem": false,
            "IsExternalResource": false,
            "User": {
                "ID": 18365,
                "Username": "RouteXL"
            },
            "DateCreated": "2021-07-27T16:03:00Z"
        }
    ],
    "IsRecentlyVerified": false,
    "ID": 169552,
    "UUID": "63392A62-D51D-4CF4-A64E-D1DFE05F15A9",
    "DataProviderID": 1,
    "OperatorID": 3299,
    "UsageTypeID": 5,
    "AddressInfo": {
        "ID": 169911,
        "Title": "Ionity Hauconcourt",
        "AddressLine1": "Route de Maizières",
        "StateOrProvince": "Grand Est",
        "Postcode": "57280",
        "CountryID": 80,
        "Latitude": 49.21518403343032,
        "Longitude": 6.171855032034159,
        "DistanceUnit": 0
    },
    "Connections": [
        {
            "ID": 258082,
            "ConnectionTypeID": 33,
            "StatusTypeID": 50,
            "LevelID": 2,
            "PowerKW": 350
        },
        {
            "ID": 258083,
            "ConnectionTypeID": 33,
            "StatusTypeID": 50,
            "LevelID": 2,
            "PowerKW": 350
        },
        {
            "ID": 258084,
            "ConnectionTypeID": 33,
            "StatusTypeID": 50,
            "LevelID": 2,
            "PowerKW": 350
        },
        {
            "ID": 258085,
            "ConnectionTypeID": 33,
            "StatusTypeID": 50,
            "LevelID": 2,
            "PowerKW": 350
        },
        {
            "ID": 258086,
            "ConnectionTypeID": 2,
            "StatusTypeID": 50,
            "LevelID": 3,
            "PowerKW": 50,
            "CurrentTypeID": 30
        },
        {
            "ID": 258087,
            "ConnectionTypeID": 1036,
            "StatusTypeID": 50,
            "LevelID": 3,
            "PowerKW": 43,
            "CurrentTypeID": 20
        },
        {
            "ID": 258088,
            "ConnectionTypeID": 33,
            "StatusTypeID": 50,
            "LevelID": 3,
            "PowerKW": 50,
            "CurrentTypeID": 30,
            "Quantity": 1
        }
    ],
    "NumberOfPoints": 1,
    "StatusTypeID": 50,
    "DateLastStatusUpdate": "2021-07-27T16:03:00Z",
    "DataQualityLevel": 1,
    "DateCreated": "2020-10-22T10:31:00Z",
    "SubmissionStatusTypeID": 200
}