{
    "IsRecentlyVerified": false,
    "ID": 7891,
    "UUID": "B225BF4A-3DB8-440E-A396-84B2F6405DDD",
    "DataProviderID": 15,
    "DataProvidersReference": "6169",
    "OperatorID": 26,
    "AddressInfo": {
        "ID": 7788,
        "Title": "7232 Ritchie Hwy",
        "AddressLine1": "7232 Ritchie Hwy",
        "Town": "Glen Burnie",
        "StateOrProvince": "MD",
        "Postcode": "21061",
        "CountryID": 2,
        "Latitude": 39.17318,
        "Longitude": -76.61912,
        "ContactTelephone1": " (410) 760-3500",
        "RelatedURL": "http://carstations.com/6169",
        "DistanceUnit": 0
    },
    "Connections": [
        {
            "ID": 5320,
            "ConnectionTypeID": 1,
            "Reference": "J1772",
            "LevelID": 2
        }
    ],
    "StatusTypeID": 0,
    "DateLastStatusUpdate": "2017-11-04T14:04:00Z",
    "DataQualityLevel": 1,
    "DateCreated": "2011-11-11T12:05:00Z",
    "SubmissionStatusTypeID": 100
}