{
    "IsRecentlyVerified": false,
    "ID": 186615,
    "UUID": "DD3F7B69-89BE-4778-934F-D2D764020949",
    "DataProviderID": 29,
    "DataProvidersReference": "14995",
    "AddressInfo": {
        "ID": 186974,
        "Title": "Helenenstraße 3",
        "AddressLine1": "Helenenstraße 3",
        "Town": "Dinslaken",
        "Postcode": "46537",
        "CountryID": 87,
        "Latitude": 51.568729,
        "Longitude": 6.723685,
        "DistanceUnit": 0
    },
    "Connections": [
        {
            "ID": 299662,
            "ConnectionTypeID": 25,
            "StatusTypeID": 50,
            "LevelID": 2,
            "PowerKW": 22,
            "CurrentTypeID": 20
        },
        {
            "ID": 299663,
            "ConnectionTypeID": 1036,
            "StatusTypeID": 50,
            "LevelID": 2,
            "PowerKW": 22,
            "CurrentTypeID": 20
        },
        {
            "ID": 299664,
            "ConnectionTypeID": 25,
            "StatusTypeID": 50,
            "LevelID": 2,
            "PowerKW": 22,
            "CurrentTypeID": 20
        },
        {
            "ID": 299665,
            "ConnectionTypeID": 1036,
            "StatusTypeID": 50,
            "LevelID": 2,
            "PowerKW": 22,
            "CurrentTypeID": 20
        }
    ],
    "StatusTypeID": 50,
    "DateLastStatusUpdate": "2021-07-12T02:48:00Z",
    "MetadataValues": [
        {
            "ID": 18856,
            "MetadataFieldID": 4,
            "ItemValue": "Data from the German chargepoint registry provided by Bundesnetzagentur.de under the CC-BY 4.0 license"
        }
    ],
    "DataQualityLevel": 3,
    "DateCreated": "2021-07-12T02:48:00Z",
    "SubmissionStatusTypeID": 100
}