{
    "IsRecentlyVerified": false,
    "ID": 122307,
    "UUID": "F01D8809-FC62-40FA-BAF8-C8A524193149",
    "DataProviderID": 2,
    "DataProvidersReference": "64043",
    "OperatorID": 5,
    "UsageTypeID": 1,
    "AddressInfo": {
        "ID": 122653,
        "Title": "AVALON CHARGE",
        "AddressLine1": "1400 Alpha Ct",
        "Town": "Alpharetta",
        "StateOrProvince": "GA",
        "Postcode": "30009",
        "CountryID": 2,
        "Latitude": 34.0712452,
        "Longitude": -84.2775271,
        "ContactTelephone1": "888-758-4389",
        "AccessComments": "24 hours daily",
        "RelatedURL": "http://www.chargepoint.com/",
        "DistanceUnit": 0
    },
    "Connections": [
        {
            "ID": 172188,
            "ConnectionTypeID": 1,
            "LevelID": 2,
            "Amps": 16,
            "Voltage": 230,
            "PowerKW": 3,
            "CurrentTypeID": 10,
            "Quantity": 4
        }
    ],
    "DateLastStatusUpdate": "2019-12-24T09:11:00Z",
    "DataQualityLevel": 3,
    "DateCreated": "2019-04-06T05:02:00Z",
    "SubmissionStatusTypeID": 100
}