{
    "IsRecentlyVerified": false,
    "ID": 10922,
    "UUID": "D0674CCA-8576-4D18-9EF1-D11CC9D654BF",
    "DataProviderID": 19,
    "DataProvidersReference": "42",
    "AddressInfo": {
        "ID": 10819,
        "Title": "Solheimsviken Næringspark, Damsgårdsvn",
        "AddressLine1": "Damsgårdsveien 14",
        "Town": "BERGEN",
        "StateOrProvince": "Hordaland",
        "Postcode": "5058",
        "CountryID": 168,
        "Latitude": 60.37706,
        "Longitude": 5.33235,
        "AccessComments": "Bak huset.",
        "DistanceUnit": 0
    },
    "Connections": [
        {
            "ID": 8907,
            "ConnectionTypeID": 28,
            "Reference": "1",
            "LevelID": 2,
            "Amps": 16,
            "Voltage": 230,
            "PowerKW": 3.7,
            "CurrentTypeID": 10,
            "Comments": "Mode 1"
        }
    ],
    "NumberOfPoints": 1,
    "StatusTypeID": 0,
    "DateLastStatusUpdate": "2019-02-11T09:17:00Z",
    "DataQualityLevel": 2,
    "DateCreated": "2012-06-02T11:56:00Z",
    "SubmissionStatusTypeID": 100
}