{
    "IsRecentlyVerified": false,
    "ID": 153814,
    "UUID": "C37C0001-9E29-4891-AAAB-8DD3FF4874EF",
    "DataProviderID": 28,
    "DataProvidersReference": "FR*S61*P61491B",
    "UsageTypeID": 5,
    "AddressInfo": {
        "ID": 154167,
        "Title": "Rue Charles de Gaulle",
        "AddressLine1": "Rue Charles de Gaulle, Tourouvre 61190",
        "CountryID": 80,
        "Latitude": 48.586846,
        "Longitude": 0.646968,
        "AccessComments": "24h/24 et 7j/7",
        "DistanceUnit": 0
    },
    "Connections": [
        {
            "ID": 216009,
            "ConnectionTypeID": 25,
            "StatusTypeID": 50,
            "LevelID": 2,
            "PowerKW": 18,
            "CurrentTypeID": 20
        },
        {
            "ID": 216010,
            "ConnectionTypeID": 28,
            "StatusTypeID": 50,
            "LevelID": 2,
            "PowerKW": 18,
            "CurrentTypeID": 10
        },
        {
            "ID": 249801,
            "ConnectionTypeID": 25,
            "StatusTypeID": 50,
            "LevelID": 2,
            "PowerKW": 18,
            "CurrentTypeID": 20
        },
        {
            "ID": 249802,
            "ConnectionTypeID": 28,
            "StatusTypeID": 50,
            "LevelID": 2,
            "PowerKW": 18,
            "CurrentTypeID": 10
        }
    ],
    "GeneralComments": "Identification par badge et application mobile",
    "StatusTypeID": 50,
    "DateLastStatusUpdate": "2020-08-27T05:15:00Z",
    "DataQualityLevel": 2,
    "DateCreated": "2020-03-15T10:54:00Z",
    "SubmissionStatusTypeID": 100
}