{
    "IsRecentlyVerified": false,
    "ID": 146477,
    "UUID": "3369AF9D-4EB8-4613-996A-D4DD3B508CC3",
    "DataProviderID": 1,
    "OperatorID": 3315,
    "OperatorsReference": "52324",
    "UsageTypeID": 4,
    "UsageCost": "Free",
    "AddressInfo": {
        "ID": 146829,
        "Title": "Cambuslang Gate, Cambuslang",
        "AddressLine1": "Allison Drive",
        "Town": "Cambuslang",
        "StateOrProvince": "South Lanarkshire",
        "Postcode": "G72 7EX",
        "CountryID": 1,
        "Latitude": 55.819938,
        "Longitude": -4.167851,
        "DistanceUnit": 0
    },
    "Connections": [
        {
            "ID": 203661,
            "ConnectionTypeID": 25,
            "StatusTypeID": 50,
            "LevelID": 2,
            "Amps": 32,
            "Voltage": 230,
            "PowerKW": 7,
            "CurrentTypeID": 10,
            "Quantity": 2
        }
    ],
    "NumberOfPoints": 2,
    "StatusTypeID": 50,
    "DateLastStatusUpdate": "2020-05-27T05:22:00Z",
    "DataQualityLevel": 1,
    "DateCreated": "2020-01-10T10:02:00Z",
    "SubmissionStatusTypeID": 200
}