{
    "IsRecentlyVerified": false,
    "ID": 21887,
    "UUID": "5B750DC8-8920-4C8E-B035-7E6B9C8A0C5B",
    "DataProviderID": 1,
    "OperatorID": 9,
    "OperatorsReference": "NTk3MTc_3",
    "UsageTypeID": 5,
    "UsageCost": "",
    "AddressInfo": {
        "ID": 22232,
        "Title": "South Lake Union Discovery Center - DCFC",
        "AddressLine1": "101 Westlake Ave N",
        "AddressLine2": "",
        "Town": "Seattle",
        "StateOrProvince": "WA",
        "Postcode": "98109",
        "CountryID": 2,
        "Latitude": 47.61947,
        "Longitude": -122.338948,
        "ContactTelephone1": "",
        "ContactTelephone2": "",
        "ContactEmail": "",
        "AccessComments": "",
        "RelatedURL": "http://www.blinknetwork.com",
        "DistanceUnit": 0
    },
    "Connections": [
        {
            "ID": 34587,
            "ConnectionTypeID": 2,
            "StatusTypeID": 0
        }
    ],
    "NumberOfPoints": 2,
    "GeneralComments": "",
    "StatusTypeID": 50,
    "DateLastStatusUpdate": "2014-12-23T00:21:00Z",
    "DataQualityLevel": 3,
    "DateCreated": "2014-03-22T08:34:00Z",
    "SubmissionStatusTypeID": 100
}