{
    "IsRecentlyVerified": false,
    "ID": 77640,
    "UUID": "FAC57CBA-2985-47D7-9F1D-1969EECE206C",
    "DataProviderID": 1,
    "OperatorID": 45,
    "UsageTypeID": 6,
    "AddressInfo": {
        "ID": 77986,
        "Title": "Hotel Mirabello",
        "AddressLine1": "Via Monte Grappa, 2",
        "Town": "Fiera di Primiero",
        "StateOrProvince": "TN",
        "Postcode": "38054",
        "CountryID": 112,
        "Latitude": 46.17762007708662,
        "Longitude": 11.830774380737935,
        "ContactTelephone1": "0439/64241",
        "ContactEmail": "info@hotelmirabello.it",
        "RelatedURL": "http://www.hotelmirabello.it/",
        "DistanceUnit": 0
    },
    "Connections": [
        {
            "ID": 112160,
            "ConnectionTypeID": 1036,
            "StatusTypeID": 50,
            "LevelID": 2,
            "Amps": 32,
            "Voltage": 400,
            "PowerKW": 22,
            "CurrentTypeID": 20,
            "Quantity": 2
        }
    ],
    "NumberOfPoints": 2,
    "GeneralComments": "Tesla Destination Charging\r\n",
    "StatusTypeID": 50,
    "DateLastStatusUpdate": "2017-01-20T16:50:00Z",
    "DataQualityLevel": 1,
    "DateCreated": "2017-01-20T16:50:00Z",
    "SubmissionStatusTypeID": 200
}