{
    "IsRecentlyVerified": false,
    "ID": 94727,
    "UUID": "A4A31548-F835-4F2C-B155-765774BE366B",
    "DataProviderID": 1,
    "OperatorID": 45,
    "UsageTypeID": 6,
    "AddressInfo": {
        "ID": 95073,
        "Title": "Phoenix Contact - Parkplatz",
        "AddressLine1": "Walter-Köhn Str. 6a",
        "Town": "Leipzig",
        "StateOrProvince": "Sachsen",
        "Postcode": "04356",
        "CountryID": 87,
        "Latitude": 51.4019619548956,
        "Longitude": 12.4024612264587,
        "AccessComments": "Mo. - Fr.   06-21 Uhr ",
        "DistanceUnit": 0
    },
    "Connections": [
        {
            "ID": 133897,
            "ConnectionTypeID": 25,
            "StatusTypeID": 50,
            "LevelID": 2,
            "Amps": 32,
            "Voltage": 230,
            "PowerKW": 22,
            "CurrentTypeID": 10,
            "Quantity": 1
        },
        {
            "ID": 133898,
            "ConnectionTypeID": 25,
            "StatusTypeID": 50,
            "LevelID": 2,
            "Amps": 32,
            "Voltage": 230,
            "PowerKW": 22,
            "CurrentTypeID": 10,
            "Quantity": 1
        }
    ],
    "NumberOfPoints": 2,
    "StatusTypeID": 50,
    "DateLastStatusUpdate": "2017-10-24T19:05:00Z",
    "DataQualityLevel": 1,
    "DateCreated": "2017-10-23T13:23:00Z",
    "SubmissionStatusTypeID": 200
}