{
    "IsRecentlyVerified": false,
    "ID": 116362,
    "UUID": "30608E67-EC28-434A-8778-FC299AF2F9C2",
    "DataProviderID": 1,
    "DataProvidersReference": "5036",
    "AddressInfo": {
        "ID": 116708,
        "Title": "Vegårshei kommune",
        "AddressLine1": "Molandsveien 11",
        "Town": "VEGÅRSHEI",
        "StateOrProvince": "Agder",
        "Postcode": "4985",
        "CountryID": 168,
        "Latitude": 58.75028,
        "Longitude": 8.86366,
        "AccessComments": "",
        "DistanceUnit": 0
    },
    "Connections": [
        {
            "ID": 163960,
            "ConnectionTypeID": 0,
            "Reference": "1",
            "LevelID": 2,
            "Amps": 32,
            "Voltage": 230,
            "PowerKW": 7.4,
            "Comments": "Mode 3"
        },
        {
            "ID": 163961,
            "ConnectionTypeID": 0,
            "Reference": "2",
            "LevelID": 2,
            "Amps": 32,
            "Voltage": 230,
            "PowerKW": 7.4,
            "Comments": "Mode 3"
        },
        {
            "ID": 163962,
            "ConnectionTypeID": 0,
            "Reference": "3",
            "LevelID": 2,
            "Amps": 32,
            "Voltage": 230,
            "PowerKW": 7.4,
            "Comments": "Mode 3"
        },
        {
            "ID": 163963,
            "ConnectionTypeID": 0,
            "Reference": "4",
            "LevelID": 2,
            "Amps": 32,
            "Voltage": 230,
            "PowerKW": 7.4,
            "Comments": "Mode 3"
        }
    ],
    "NumberOfPoints": 4,
    "DateLastStatusUpdate": "2020-05-26T08:22:00Z",
    "DataQualityLevel": 2,
    "DateCreated": "2019-02-11T09:16:00Z",
    "SubmissionStatusTypeID": 100
}