{
    "MediaItems": [
        {
            "ID": 25250,
            "ChargePointID": 31761,
            "ItemURL": "https://s3-ap-southeast-2.amazonaws.com/openchargemap/images/DE/OCM31761/OCM-31761.orig.2020102707065274.jpg",
            "ItemThumbnailURL": "https://s3-ap-southeast-2.amazonaws.com/openchargemap/images/DE/OCM31761/OCM-31761.thmb.2020102707065274.jpg",
            "Comment": "",
            "IsEnabled": true,
            "IsVideo": false,
            "IsFeaturedItem": false,
            "IsExternalResource": false,
            "User": {
                "ID": 27940,
                "Username": "5R-MFT "
            },
            "DateCreated": "2020-10-27T07:07:00Z"
        },
        {
            "ID": 25249,
            "ChargePointID": 31761,
            "ItemURL": "https://s3-ap-southeast-2.amazonaws.com/openchargemap/images/DE/OCM31761/OCM-31761.orig.2020102707032872.jpg",
            "ItemThumbnailURL": "https://s3-ap-southeast-2.amazonaws.com/openchargemap/images/DE/OCM31761/OCM-31761.thmb.2020102707032872.jpg",
            "Comment": "",
            "IsEnabled": true,
            "IsVideo": false,
            "IsFeaturedItem": false,
            "IsExternalResource": false,
            "User": {
                "ID": 27940,
                "Username": "5R-MFT "
            },
            "DateCreated": "2020-10-27T07:04:00Z"
        }
    ],
    "IsRecentlyVerified": false,
    "ID": 31761,
    "UUID": "340B7D78-C6AB-4C72-BC23-7290A49D12AD",
    "DataProviderID": 1,
    "OperatorID": 86,
    "OperatorsReference": "EnWB Osumstraße ",
    "UsageCost": "0.00 afhankelijk van pas",
    "AddressInfo": {
        "ID": 32107,
        "Title": "Osumstraße 1",
        "AddressLine1": "Osumstraße 1",
        "Town": "Stuttgart",
        "Postcode": "70599",
        "CountryID": 87,
        "Latitude": 48.71222289083909,
        "Longitude": 9.201900568131919,
        "ContactTelephone1": "0800 3629-000",
        "ContactEmail": "-",
        "RelatedURL": "http://www.enbw.com/",
        "DistanceUnit": 0
    },
    "Connections": [
        {
            "ID": 35272,
            "ConnectionTypeID": 25,
            "LevelID": 2,
            "PowerKW": 5,
            "CurrentTypeID": 10
        }
    ],
    "NumberOfPoints": 2,
    "StatusTypeID": 50,
    "DateLastStatusUpdate": "2020-10-27T14:53:00Z",
    "DataQualityLevel": 3,
    "DateCreated": "2015-01-09T06:03:00Z",
    "SubmissionStatusTypeID": 100
}