{
    "IsRecentlyVerified": true,
    "DateLastVerified": "2021-08-11T10:35:00Z",
    "ID": 188701,
    "UUID": "51B3BA19-941D-4E17-8ECB-5AC19053F434",
    "DataProviderID": 1,
    "OperatorID": 80,
    "UsageTypeID": 4,
    "UsageCost": "Free",
    "AddressInfo": {
        "ID": 189060,
        "Title": "Long Way Up - San Pedro de Atacama n°2",
        "AddressLine1": "Hotel Diego de Almagro, Toconao 460, San Pedro de Atacama, ",
        "Town": "San Pedro de Atacama",
        "StateOrProvince": "Antofagasta ",
        "Postcode": "1410000",
        "CountryID": 49,
        "Latitude": -22.912907073622506,
        "Longitude": -68.19886524576759,
        "RelatedURL": "https://www.enelx.com/cl/es",
        "DistanceUnit": 0
    },
    "Connections": [
        {
            "ID": 304863,
            "ConnectionTypeID": 0,
            "StatusTypeID": 50,
            "LevelID": 2,
            "PowerKW": 7.4,
            "Quantity": 1
        }
    ],
    "NumberOfPoints": 1,
    "StatusTypeID": 50,
    "DateLastStatusUpdate": "2021-08-11T10:35:00Z",
    "DataQualityLevel": 1,
    "DateCreated": "2021-08-11T10:35:00Z",
    "SubmissionStatusTypeID": 200
}