{
    "IsRecentlyVerified": false,
    "ID": 28544,
    "UUID": "4A9F9E24-DC5B-405B-8D8C-5185BEFB1350",
    "DataProviderID": 2,
    "DataProvidersReference": "53551",
    "UsageTypeID": 1,
    "AddressInfo": {
        "ID": 28890,
        "Title": "The Ridgefield Playhouse",
        "AddressLine1": "80 E Ridge Rd",
        "Town": "Ridgefield",
        "StateOrProvince": "CT",
        "Postcode": "06877",
        "CountryID": 2,
        "Latitude": 41.282264,
        "Longitude": -73.492605,
        "ContactTelephone1": "203-438-5795",
        "AccessComments": "24 hours daily",
        "RelatedURL": "",
        "DistanceUnit": 0
    },
    "Connections": [
        {
            "ID": 31365,
            "ConnectionTypeID": 1,
            "LevelID": 2,
            "Amps": 16,
            "Voltage": 230,
            "PowerKW": 3.7,
            "CurrentTypeID": 10,
            "Quantity": 2
        }
    ],
    "DateLastStatusUpdate": "2020-06-26T03:04:00Z",
    "DataQualityLevel": 3,
    "DateCreated": "2014-11-28T03:38:00Z",
    "SubmissionStatusTypeID": 100
}