{
    "IsRecentlyVerified": false,
    "ID": 100938,
    "UUID": "F3A4118E-6B67-4455-AEFC-EF130529B8D3",
    "DataProviderID": 1,
    "OperatorID": 23,
    "OperatorsReference": "41235",
    "UsageTypeID": 4,
    "AddressInfo": {
        "ID": 101284,
        "Title": "Shangri-la Hotel, Vancouver",
        "AddressLine1": "1128 W Georgia St",
        "Town": "Vancouver",
        "StateOrProvince": "British Columbia",
        "Postcode": "V6E 0A8",
        "CountryID": 44,
        "Latitude": 49.28571,
        "Longitude": -123.123763,
        "ContactTelephone1": "(604) 689-1120",
        "DistanceUnit": 0
    },
    "Connections": [
        {
            "ID": 142533,
            "ConnectionTypeID": 30,
            "StatusTypeID": 50,
            "LevelID": 2,
            "PowerKW": 16,
            "CurrentTypeID": 20,
            "Quantity": 6
        }
    ],
    "NumberOfPoints": 6,
    "GeneralComments": "6 Tesla Connectors, up to 16kW.Available for customers. Please see front desk.",
    "StatusTypeID": 50,
    "DateLastStatusUpdate": "2018-03-13T06:52:00Z",
    "DataQualityLevel": 1,
    "DateCreated": "2018-03-13T06:52:00Z",
    "SubmissionStatusTypeID": 200
}