{
    "IsRecentlyVerified": false,
    "ID": 135167,
    "UUID": "035FEF5A-8A23-49F4-A389-B04375BA1739",
    "DataProviderID": 1,
    "OperatorID": 80,
    "UsageTypeID": 4,
    "AddressInfo": {
        "ID": 135513,
        "Title": "Oristano Martiri del Congo | EnelX",
        "AddressLine1": "Via Martiri del Congo",
        "Town": "Oristano",
        "StateOrProvince": "OR",
        "Postcode": "09170",
        "CountryID": 112,
        "Latitude": 39.918146074288586,
        "Longitude": 8.620107413604046,
        "RelatedURL": "https://www.enelx.com/it/it/emobility",
        "DistanceUnit": 0
    },
    "Connections": [
        {
            "ID": 189209,
            "ConnectionTypeID": 25,
            "StatusTypeID": 50,
            "LevelID": 2,
            "Amps": 32,
            "Voltage": 400,
            "PowerKW": 22,
            "CurrentTypeID": 20,
            "Quantity": 4
        }
    ],
    "NumberOfPoints": 4,
    "StatusTypeID": 50,
    "DateLastStatusUpdate": "2019-12-09T16:40:00Z",
    "DataQualityLevel": 1,
    "DateCreated": "2019-12-09T16:40:00Z",
    "SubmissionStatusTypeID": 200
}