{
    "IsRecentlyVerified": false,
    "ID": 19105,
    "UUID": "9550B713-2662-45E7-BC5C-E3F603340E5F",
    "DataProviderID": 1,
    "OperatorID": 7,
    "UsageTypeID": 1,
    "UsageCost": "Free",
    "AddressInfo": {
        "ID": 19450,
        "Title": "Barlo Nissan - Car Dealer Kilkenny",
        "AddressLine1": "Dublin Road",
        "AddressLine2": "",
        "Town": "Kilkenny",
        "StateOrProvince": "",
        "Postcode": "",
        "CountryID": 3,
        "Latitude": 52.6504937,
        "Longitude": -7.232866699999931,
        "ContactTelephone1": " 056 7722575",
        "ContactTelephone2": "",
        "ContactEmail": "nissansales@barlokilkenny.ie",
        "AccessComments": "",
        "RelatedURL": "http://www.barlo-nissan.com/",
        "DistanceUnit": 0
    },
    "Connections": [
        {
            "ID": 19346,
            "ConnectionTypeID": 2,
            "StatusTypeID": 50,
            "LevelID": 3,
            "Amps": 100,
            "Voltage": 230,
            "PowerKW": 50,
            "CurrentTypeID": 30,
            "Quantity": 1
        }
    ],
    "NumberOfPoints": 1,
    "GeneralComments": "",
    "StatusTypeID": 50,
    "DateLastStatusUpdate": "2013-09-11T20:41:00Z",
    "DataQualityLevel": 1,
    "DateCreated": "2013-09-11T10:40:00Z",
    "SubmissionStatusTypeID": 200
}