{
    "IsRecentlyVerified": false,
    "ID": 32748,
    "UUID": "032E18C8-9A37-4EA2-9DBE-336D25228D73",
    "DataProviderID": 26,
    "DataProvidersReference": "47068",
    "OperatorID": 178,
    "OperatorsReference": "EVnetNL AL214",
    "UsageCost": "0.00 jaarabonnement",
    "AddressInfo": {
        "ID": 33094,
        "Title": "Pastoor Vullinghsplein",
        "AddressLine1": "Pastoor Vullinghsplein",
        "Town": "Horst aan de Maas",
        "Postcode": "5975 DJ",
        "CountryID": 159,
        "Latitude": 51.413254,
        "Longitude": 6.036185,
        "ContactTelephone1": "0800-3522365",
        "RelatedURL": "http://www.evnet.nl",
        "DistanceUnit": 0
    },
    "Connections": [
        {
            "ID": 36259,
            "ConnectionTypeID": 25,
            "LevelID": 2,
            "PowerKW": 11,
            "CurrentTypeID": 10
        }
    ],
    "NumberOfPoints": 2,
    "StatusTypeID": 50,
    "DateLastStatusUpdate": "2016-06-04T02:38:00Z",
    "DataQualityLevel": 3,
    "DateCreated": "2015-01-09T06:03:00Z",
    "SubmissionStatusTypeID": 100
}