{
    "UserComments": [
        {
            "ID": 23402,
            "ChargePointID": 132696,
            "CommentTypeID": 10,
            "UserName": "MauroneRelax",
            "Comment": "by PlugSurfing",
            "Rating": 4,
            "DateCreated": "2020-10-19T17:14:16.51Z",
            "User": {
                "ID": 27925,
                "Username": "MauroneRelax"
            },
            "CheckinStatusTypeID": 10,
            "IsActionedByEditor": false
        }
    ],
    "IsRecentlyVerified": false,
    "ID": 132696,
    "UUID": "55B2DC24-4778-4D13-BBFA-AE528489307C",
    "DataProviderID": 1,
    "OperatorID": 3266,
    "UsageTypeID": 4,
    "AddressInfo": {
        "ID": 133042,
        "Title": "Concessionaria Nissan Victoria Brescia",
        "AddressLine1": " Via Valcamonica, 2",
        "Town": "Brescia",
        "StateOrProvince": "BS",
        "Postcode": "25127",
        "CountryID": 112,
        "Latitude": 45.547682656112414,
        "Longitude": 10.182970705368234,
        "RelatedURL": "https://victoria.concessionarienissan.it/it/homepage",
        "DistanceUnit": 0
    },
    "Connections": [
        {
            "ID": 185772,
            "ConnectionTypeID": 2,
            "StatusTypeID": 50,
            "LevelID": 3,
            "Amps": 120,
            "Voltage": 500,
            "PowerKW": 50,
            "CurrentTypeID": 30,
            "Quantity": 1
        },
        {
            "ID": 185773,
            "ConnectionTypeID": 33,
            "StatusTypeID": 50,
            "LevelID": 3,
            "Amps": 120,
            "Voltage": 500,
            "PowerKW": 50,
            "CurrentTypeID": 30,
            "Quantity": 1
        },
        {
            "ID": 185774,
            "ConnectionTypeID": 1036,
            "StatusTypeID": 50,
            "LevelID": 2,
            "Amps": 32,
            "Voltage": 400,
            "PowerKW": 43,
            "CurrentTypeID": 20,
            "Quantity": 1
        }
    ],
    "NumberOfPoints": 1,
    "StatusTypeID": 50,
    "DateLastStatusUpdate": "2020-11-06T15:25:00Z",
    "DataQualityLevel": 1,
    "DateCreated": "2019-10-05T14:32:00Z",
    "SubmissionStatusTypeID": 200
}