{
    "IsRecentlyVerified": true,
    "DateLastVerified": "2021-09-01T13:43:00Z",
    "ID": 189016,
    "UUID": "C0C5E302-F313-4067-8D87-655338562FB5",
    "DataProviderID": 1,
    "OperatorID": 3448,
    "UsageTypeID": 1,
    "AddressInfo": {
        "ID": 189375,
        "Title": "Proviridis Chalon sur Saone",
        "AddressLine1": "Rue de l'argentique",
        "Town": "Fragnes-la-Loyère",
        "Postcode": "71530",
        "CountryID": 80,
        "Latitude": 46.824796826711406,
        "Longitude": 4.857808300881516,
        "DistanceUnit": 0
    },
    "Connections": [
        {
            "ID": 305513,
            "ConnectionTypeID": 33,
            "StatusTypeID": 50,
            "LevelID": 3,
            "PowerKW": 150,
            "CurrentTypeID": 30,
            "Quantity": 2
        }
    ],
    "NumberOfPoints": 4,
    "StatusTypeID": 150,
    "DateLastStatusUpdate": "2021-09-02T08:12:00Z",
    "DataQualityLevel": 1,
    "DateCreated": "2021-09-01T13:43:00Z",
    "SubmissionStatusTypeID": 200
}