{
    "IsRecentlyVerified": false,
    "ID": 181104,
    "UUID": "2DBB8717-4237-41D2-8131-82D4D9ABBBFB",
    "DataProviderID": 29,
    "DataProvidersReference": "9007",
    "OperatorID": 220,
    "AddressInfo": {
        "ID": 181463,
        "Title": "Julius-Ludowieg-Straße 23",
        "AddressLine1": "Julius-Ludowieg-Straße 23",
        "Town": "Hamburg",
        "Postcode": "21073",
        "CountryID": 87,
        "Latitude": 53.4596,
        "Longitude": 9.97673,
        "DistanceUnit": 0
    },
    "Connections": [
        {
            "ID": 285004,
            "ConnectionTypeID": 28,
            "StatusTypeID": 50,
            "LevelID": 2,
            "PowerKW": 22,
            "CurrentTypeID": 20
        },
        {
            "ID": 285005,
            "ConnectionTypeID": 25,
            "StatusTypeID": 50,
            "LevelID": 2,
            "PowerKW": 22,
            "CurrentTypeID": 20
        },
        {
            "ID": 301331,
            "ConnectionTypeID": 28,
            "StatusTypeID": 50,
            "LevelID": 2,
            "PowerKW": 22,
            "CurrentTypeID": 20
        },
        {
            "ID": 301332,
            "ConnectionTypeID": 25,
            "StatusTypeID": 50,
            "LevelID": 2,
            "PowerKW": 22,
            "CurrentTypeID": 20
        }
    ],
    "StatusTypeID": 50,
    "DateLastStatusUpdate": "2021-07-12T02:51:00Z",
    "MetadataValues": [
        {
            "ID": 13398,
            "MetadataFieldID": 4,
            "ItemValue": "Data from the German chargepoint registry provided by Bundesnetzagentur.de under the CC-BY 4.0 license"
        }
    ],
    "DataQualityLevel": 3,
    "DateCreated": "2021-07-08T10:01:00Z",
    "SubmissionStatusTypeID": 100
}