{
    "UserComments": [
        {
            "ID": 24931,
            "ChargePointID": 107810,
            "CommentTypeID": 10,
            "UserName": "ForumElettrico.it",
            "Comment": "Si attiva con JuicePass, pare a tariffa zero. Leggi la recensione completa qui:  https://www.forumelettrico.it/forum/pan-fast-francavilla-fontana-via-terracini-6-t20112.html",
            "RelatedURL": "https://www.forumelettrico.it/forum/pan-fast-francavilla-fontana-via-terracini-6-t20112.html",
            "DateCreated": "2021-10-04T14:29:58.463Z",
            "User": {
                "ID": 11749,
                "Username": "ForumElettrico.it"
            },
            "CheckinStatusTypeID": 10,
            "IsActionedByEditor": false
        }
    ],
    "MediaItems": [
        {
            "ID": 29465,
            "ChargePointID": 107810,
            "ItemURL": "https://s3-ap-southeast-2.amazonaws.com/openchargemap/images/IT/OCM107810/OCM-107810.orig.2021100414303395.jpg",
            "ItemThumbnailURL": "https://s3-ap-southeast-2.amazonaws.com/openchargemap/images/IT/OCM107810/OCM-107810.thmb.2021100414303395.jpg",
            "Comment": "",
            "IsEnabled": true,
            "IsVideo": false,
            "IsFeaturedItem": false,
            "IsExternalResource": false,
            "User": {
                "ID": 11749,
                "Username": "ForumElettrico.it"
            },
            "DateCreated": "2021-10-04T14:31:00Z"
        },
        {
            "ID": 29466,
            "ChargePointID": 107810,
            "ItemURL": "https://s3-ap-southeast-2.amazonaws.com/openchargemap/images/IT/OCM107810/OCM-107810.orig.2021100414304039.jpg",
            "ItemThumbnailURL": "https://s3-ap-southeast-2.amazonaws.com/openchargemap/images/IT/OCM107810/OCM-107810.thmb.2021100414304039.jpg",
            "Comment": "",
            "IsEnabled": true,
            "IsVideo": false,
            "IsFeaturedItem": false,
            "IsExternalResource": false,
            "User": {
                "ID": 11749,
                "Username": "ForumElettrico.it"
            },
            "DateCreated": "2021-10-04T14:31:00Z"
        },
        {
            "ID": 29461,
            "ChargePointID": 107810,
            "ItemURL": "https://s3-ap-southeast-2.amazonaws.com/openchargemap/images/IT/OCM107810/OCM-107810.orig.2021100414300857.jpg",
            "ItemThumbnailURL": "https://s3-ap-southeast-2.amazonaws.com/openchargemap/images/IT/OCM107810/OCM-107810.thmb.2021100414300857.jpg",
            "Comment": "",
            "IsEnabled": true,
            "IsVideo": false,
            "IsFeaturedItem": false,
            "IsExternalResource": false,
            "User": {
                "ID": 11749,
                "Username": "ForumElettrico.it"
            },
            "DateCreated": "2021-10-04T14:30:00Z"
        },
        {
            "ID": 29462,
            "ChargePointID": 107810,
            "ItemURL": "https://s3-ap-southeast-2.amazonaws.com/openchargemap/images/IT/OCM107810/OCM-107810.orig.2021100414301458.jpg",
            "ItemThumbnailURL": "https://s3-ap-southeast-2.amazonaws.com/openchargemap/images/IT/OCM107810/OCM-107810.thmb.2021100414301458.jpg",
            "Comment": "",
            "IsEnabled": true,
            "IsVideo": false,
            "IsFeaturedItem": false,
            "IsExternalResource": false,
            "User": {
                "ID": 11749,
                "Username": "ForumElettrico.it"
            },
            "DateCreated": "2021-10-04T14:30:00Z"
        },
        {
            "ID": 29463,
            "ChargePointID": 107810,
            "ItemURL": "https://s3-ap-southeast-2.amazonaws.com/openchargemap/images/IT/OCM107810/OCM-107810.orig.2021100414302134.jpg",
            "ItemThumbnailURL": "https://s3-ap-southeast-2.amazonaws.com/openchargemap/images/IT/OCM107810/OCM-107810.thmb.2021100414302134.jpg",
            "Comment": "",
            "IsEnabled": true,
            "IsVideo": false,
            "IsFeaturedItem": false,
            "IsExternalResource": false,
            "User": {
                "ID": 11749,
                "Username": "ForumElettrico.it"
            },
            "DateCreated": "2021-10-04T14:30:00Z"
        },
        {
            "ID": 29464,
            "ChargePointID": 107810,
            "ItemURL": "https://s3-ap-southeast-2.amazonaws.com/openchargemap/images/IT/OCM107810/OCM-107810.orig.2021100414302667.jpg",
            "ItemThumbnailURL": "https://s3-ap-southeast-2.amazonaws.com/openchargemap/images/IT/OCM107810/OCM-107810.thmb.2021100414302667.jpg",
            "Comment": "",
            "IsEnabled": true,
            "IsVideo": false,
            "IsFeaturedItem": false,
            "IsExternalResource": false,
            "User": {
                "ID": 11749,
                "Username": "ForumElettrico.it"
            },
            "DateCreated": "2021-10-04T14:30:00Z"
        }
    ],
    "IsRecentlyVerified": false,
    "ID": 107810,
    "UUID": "1BBBEE52-89E1-4649-94C6-2F9AEDBD4998",
    "DataProviderID": 1,
    "OperatorID": 80,
    "UsageTypeID": 4,
    "UsageCost": "0,40 €/kW",
    "AddressInfo": {
        "ID": 108156,
        "Title": "Enel PAN Francavilla Fontana",
        "AddressLine1": "Via Terracini",
        "Town": "Francavilla Fontana",
        "StateOrProvince": "BR",
        "Postcode": "72021",
        "CountryID": 112,
        "Latitude": 40.5301502204586,
        "Longitude": 17.6053344008752,
        "RelatedURL": "https://www.enelx.com/it/it/emobility",
        "DistanceUnit": 0
    },
    "Connections": [
        {
            "ID": 152228,
            "ConnectionTypeID": 33,
            "StatusTypeID": 150,
            "LevelID": 3,
            "PowerKW": 50,
            "CurrentTypeID": 30,
            "Quantity": 1
        },
        {
            "ID": 152229,
            "ConnectionTypeID": 2,
            "StatusTypeID": 150,
            "LevelID": 3,
            "PowerKW": 50,
            "CurrentTypeID": 30,
            "Quantity": 1
        },
        {
            "ID": 152230,
            "ConnectionTypeID": 1036,
            "StatusTypeID": 150,
            "LevelID": 3,
            "Amps": 64,
            "Voltage": 400,
            "PowerKW": 43,
            "CurrentTypeID": 20,
            "Quantity": 1
        }
    ],
    "NumberOfPoints": 2,
    "StatusTypeID": 150,
    "DateLastStatusUpdate": "2021-10-04T14:31:00Z",
    "DataQualityLevel": 1,
    "DateCreated": "2018-08-10T10:07:00Z",
    "SubmissionStatusTypeID": 200
}