{
    "IsRecentlyVerified": false,
    "ID": 152269,
    "UUID": "468F1E6A-3F0F-4DFF-9AD2-35B28B989061",
    "DataProviderID": 28,
    "DataProvidersReference": "FR*S86*PSORE*B093",
    "UsageTypeID": 5,
    "AddressInfo": {
        "ID": 152622,
        "Title": "B093",
        "AddressLine1": "Parking stade - 86100 - Saint-Sauveur",
        "CountryID": 80,
        "Latitude": 46.80711,
        "Longitude": 0.62647,
        "AccessComments": "24/24 7/7 jours",
        "DistanceUnit": 0
    },
    "Connections": [
        {
            "ID": 213108,
            "ConnectionTypeID": 28,
            "StatusTypeID": 50,
            "LevelID": 2,
            "PowerKW": 18,
            "CurrentTypeID": 10
        },
        {
            "ID": 213109,
            "ConnectionTypeID": 25,
            "StatusTypeID": 50,
            "LevelID": 2,
            "PowerKW": 18,
            "CurrentTypeID": 20
        },
        {
            "ID": 245968,
            "ConnectionTypeID": 28,
            "StatusTypeID": 50,
            "LevelID": 2,
            "PowerKW": 18,
            "CurrentTypeID": 10
        },
        {
            "ID": 245969,
            "ConnectionTypeID": 25,
            "StatusTypeID": 50,
            "LevelID": 2,
            "PowerKW": 18,
            "CurrentTypeID": 20
        }
    ],
    "GeneralComments": "",
    "StatusTypeID": 50,
    "DateLastStatusUpdate": "2020-08-27T05:13:00Z",
    "DataQualityLevel": 2,
    "DateCreated": "2020-03-15T10:53:00Z",
    "SubmissionStatusTypeID": 100
}