{
    "UserComments": [
        {
            "ID": 21530,
            "ChargePointID": 88009,
            "CommentTypeID": 10,
            "UserName": "LEAFspring",
            "Comment": "the polar charger is very modern . i suspect that it is over 50kwh. additionally it was the quickest card recognition ever.",
            "Rating": 5,
            "DateCreated": "2019-09-18T20:50:08.313Z",
            "User": {
                "ID": 21034,
                "Username": "LEAFspring"
            },
            "CheckinStatusTypeID": 10
        }
    ],
    "MediaItems": [
        {
            "ID": 12800,
            "ChargePointID": 88009,
            "ItemURL": "https://s3-ap-southeast-2.amazonaws.com/openchargemap/images/GB/OCM88009/OCM-88009.orig.2017060707303764.jpg",
            "ItemThumbnailURL": "https://s3-ap-southeast-2.amazonaws.com/openchargemap/images/GB/OCM88009/OCM-88009.thmb.2017060707303764.jpg",
            "Comment": "",
            "IsEnabled": true,
            "IsVideo": false,
            "IsFeaturedItem": false,
            "IsExternalResource": false,
            "User": {
                "ID": 4575,
                "Username": "Simon Hewison"
            },
            "DateCreated": "2017-06-07T07:31:00Z"
        }
    ],
    "IsRecentlyVerified": false,
    "ID": 88009,
    "UUID": "F2671FED-4553-45B8-BE13-3B9BAFD4B7C2",
    "DataProviderID": 1,
    "OperatorID": 32,
    "OperatorsReference": "24367",
    "UsageTypeID": 4,
    "UsageCost": "£0.25/kWh minimum £1.20 (Polar Instant App);£0.15/kWh (Polar Plus subscription members)",
    "AddressInfo": {
        "ID": 88355,
        "Title": "Concierge Camping",
        "AddressLine1": "Ratham Lane",
        "AddressLine2": "Funtington",
        "Town": "Chichester",
        "StateOrProvince": "West Sussex",
        "Postcode": "PO18 8DL",
        "CountryID": 1,
        "Latitude": 50.8516624207815,
        "Longitude": -0.84830266496806,
        "DistanceUnit": 0
    },
    "Connections": [
        {
            "ID": 124840,
            "ConnectionTypeID": 2,
            "StatusTypeID": 50,
            "LevelID": 3,
            "Amps": 125,
            "Voltage": 400,
            "PowerKW": 50,
            "CurrentTypeID": 30,
            "Quantity": 1
        },
        {
            "ID": 124841,
            "ConnectionTypeID": 33,
            "StatusTypeID": 50,
            "LevelID": 3,
            "Amps": 125,
            "Voltage": 400,
            "PowerKW": 50,
            "CurrentTypeID": 30,
            "Quantity": 1
        },
        {
            "ID": 124842,
            "ConnectionTypeID": 1036,
            "StatusTypeID": 50,
            "LevelID": 3,
            "Amps": 63,
            "Voltage": 400,
            "PowerKW": 43,
            "CurrentTypeID": 20,
            "Quantity": 1
        }
    ],
    "NumberOfPoints": 2,
    "StatusTypeID": 50,
    "DateLastStatusUpdate": "2019-09-20T08:12:00Z",
    "DataQualityLevel": 1,
    "DateCreated": "2017-05-19T08:05:00Z",
    "SubmissionStatusTypeID": 200
}