{
    "IsRecentlyVerified": false,
    "ID": 163730,
    "UUID": "C683F8E4-F197-44AA-AFDA-88CED62F6789",
    "DataProviderID": 1,
    "OperatorID": 23,
    "OperatorsReference": "37727",
    "UsageTypeID": 4,
    "AddressInfo": {
        "ID": 164087,
        "Title": "Centro Comercial el Mirador de Jinamar",
        "AddressLine1": "Autovia GC-1",
        "Town": "Km 5",
        "StateOrProvince": "Las Palmas de Gran Canaria",
        "Postcode": "35220",
        "CountryID": 210,
        "Latitude": 28.032928,
        "Longitude": -15.403263,
        "ContactTelephone1": "+34 928 686 940",
        "DistanceUnit": 0
    },
    "Connections": [
        {
            "ID": 235327,
            "ConnectionTypeID": 30,
            "StatusTypeID": 50,
            "LevelID": 2,
            "PowerKW": 22,
            "CurrentTypeID": 20,
            "Quantity": 2
        }
    ],
    "NumberOfPoints": 2,
    "GeneralComments": "2 Tesla Connectors, up to 22kW.Available for customers. Self park.",
    "StatusTypeID": 50,
    "DateLastStatusUpdate": "2020-08-24T15:01:00Z",
    "DataQualityLevel": 1,
    "DateCreated": "2020-08-24T15:01:00Z",
    "SubmissionStatusTypeID": 200
}