{
    "IsRecentlyVerified": false,
    "ID": 106764,
    "UUID": "C261BF2B-3661-4AF0-B874-10907876D954",
    "DataProviderID": 1,
    "OperatorID": 89,
    "OperatorsReference": "CEA-018",
    "UsageTypeID": 4,
    "UsageCost": "CAD 1.00/hour",
    "AddressInfo": {
        "ID": 107110,
        "Title": "St-Hubert-Charlemagne",
        "AddressLine1": "135 Boul. Céline Dion",
        "Town": "Charlemagne",
        "StateOrProvince": "QC",
        "Postcode": "J5Z 3L6",
        "CountryID": 44,
        "Latitude": 45.7207421780494,
        "Longitude": -73.4916463252354,
        "DistanceUnit": 0
    },
    "Connections": [
        {
            "ID": 150496,
            "ConnectionTypeID": 1,
            "StatusTypeID": 50,
            "LevelID": 2,
            "Amps": 32,
            "Voltage": 230,
            "PowerKW": 7,
            "CurrentTypeID": 10,
            "Quantity": 1
        }
    ],
    "NumberOfPoints": 1,
    "StatusTypeID": 50,
    "DateLastStatusUpdate": "2018-06-29T05:25:00Z",
    "DataQualityLevel": 1,
    "DateCreated": "2018-06-29T05:25:00Z",
    "SubmissionStatusTypeID": 200
}