{
    "IsRecentlyVerified": false,
    "ID": 183552,
    "UUID": "25E7A5FB-18BC-4A55-9AA2-64B23E8C237D",
    "DataProviderID": 29,
    "DataProvidersReference": "7458,1364",
    "AddressInfo": {
        "ID": 183911,
        "Title": "Max-Planck-Straße 4",
        "AddressLine1": "Max-Planck-Straße 4",
        "Town": "Rhede",
        "Postcode": "46414",
        "CountryID": 87,
        "Latitude": 51.830485,
        "Longitude": 6.718652561,
        "DistanceUnit": 0
    },
    "Connections": [
        {
            "ID": 290674,
            "ConnectionTypeID": 25,
            "StatusTypeID": 50,
            "LevelID": 2,
            "PowerKW": 22,
            "CurrentTypeID": 20
        },
        {
            "ID": 290675,
            "ConnectionTypeID": 25,
            "StatusTypeID": 50,
            "LevelID": 2,
            "PowerKW": 22,
            "CurrentTypeID": 20
        }
    ],
    "StatusTypeID": 50,
    "DateLastStatusUpdate": "2021-07-09T03:25:00Z",
    "MetadataValues": [
        {
            "ID": 15845,
            "MetadataFieldID": 4,
            "ItemValue": "Data from the German chargepoint registry provided by Bundesnetzagentur.de under the CC-BY 4.0 license"
        }
    ],
    "DataQualityLevel": 3,
    "DateCreated": "2021-07-08T10:04:00Z",
    "SubmissionStatusTypeID": 100
}