{
    "IsRecentlyVerified": false,
    "ID": 186415,
    "UUID": "609BBD35-9A78-491E-9530-49E37D2AEA76",
    "DataProviderID": 29,
    "DataProvidersReference": "16899",
    "OperatorID": 184,
    "AddressInfo": {
        "ID": 186774,
        "Title": "Osemundstr. 14-22",
        "AddressLine1": "Osemundstr. 14-22",
        "Town": "Neuenrade",
        "Postcode": "58809",
        "CountryID": 87,
        "Latitude": 51.285506,
        "Longitude": 7.805193,
        "DistanceUnit": 0
    },
    "Connections": [
        {
            "ID": 299075,
            "ConnectionTypeID": 25,
            "StatusTypeID": 50,
            "LevelID": 2,
            "PowerKW": 22,
            "CurrentTypeID": 20
        },
        {
            "ID": 299076,
            "ConnectionTypeID": 1036,
            "StatusTypeID": 50,
            "LevelID": 2,
            "PowerKW": 22,
            "CurrentTypeID": 20
        },
        {
            "ID": 299077,
            "ConnectionTypeID": 25,
            "StatusTypeID": 50,
            "LevelID": 2,
            "PowerKW": 22,
            "CurrentTypeID": 20
        }
    ],
    "StatusTypeID": 50,
    "DateLastStatusUpdate": "2021-07-12T02:47:00Z",
    "MetadataValues": [
        {
            "ID": 18656,
            "MetadataFieldID": 4,
            "ItemValue": "Data from the German chargepoint registry provided by Bundesnetzagentur.de under the CC-BY 4.0 license"
        }
    ],
    "DataQualityLevel": 3,
    "DateCreated": "2021-07-12T02:47:00Z",
    "SubmissionStatusTypeID": 100
}