{
    "IsRecentlyVerified": false,
    "ID": 32550,
    "UUID": "B99C570D-3AC7-48C4-AAA3-F25811DF9239",
    "DataProviderID": 26,
    "DataProvidersReference": "48778",
    "OperatorID": 178,
    "OperatorsReference": "EVnetNL RWE016",
    "UsageCost": "0.00 jaarabonnement",
    "AddressInfo": {
        "ID": 32896,
        "Title": "Keizer Karelplein",
        "AddressLine1": "Keizer Karelplein",
        "Town": "Terneuzen",
        "Postcode": "4551 CJ",
        "CountryID": 159,
        "Latitude": 51.228606,
        "Longitude": 3.801977,
        "ContactTelephone1": "0800-3522365",
        "RelatedURL": "http://www.evnet.nl",
        "DistanceUnit": 0
    },
    "Connections": [
        {
            "ID": 36061,
            "ConnectionTypeID": 25,
            "LevelID": 2,
            "PowerKW": 11,
            "CurrentTypeID": 10
        },
        {
            "ID": 46421,
            "ConnectionTypeID": 25,
            "LevelID": 2,
            "PowerKW": 11,
            "CurrentTypeID": 10
        }
    ],
    "NumberOfPoints": 1,
    "StatusTypeID": 50,
    "DateLastStatusUpdate": "2016-06-04T02:38:00Z",
    "DataQualityLevel": 3,
    "DateCreated": "2015-01-09T06:03:00Z",
    "SubmissionStatusTypeID": 100
}