{
    "IsRecentlyVerified": false,
    "ID": 106808,
    "UUID": "5448E787-BBB3-41F3-9432-7C23F35B985C",
    "DataProviderID": 1,
    "OperatorID": 45,
    "UsageTypeID": 4,
    "AddressInfo": {
        "ID": 107154,
        "Title": "Tiefgarage Lindenplatz P2",
        "AddressLine1": "Lindenstraße 48",
        "Town": "Ehingen (Donau)",
        "StateOrProvince": "Alb-Donau-Kreis",
        "Postcode": "89584",
        "CountryID": 87,
        "Latitude": 48.2813467109071,
        "Longitude": 9.726476397344982,
        "AccessComments": "24/7 ksotenlos nutzbar, mit beliebiger Ladekarte aktivierbar, Parkgebühren werden nach einer Stunde erhoben.",
        "DistanceUnit": 0
    },
    "Connections": [
        {
            "ID": 150559,
            "ConnectionTypeID": 25,
            "StatusTypeID": 50,
            "LevelID": 2,
            "Amps": 32,
            "Voltage": 400,
            "PowerKW": 22,
            "CurrentTypeID": 20,
            "Quantity": 2
        },
        {
            "ID": 150560,
            "ConnectionTypeID": 28,
            "StatusTypeID": 50,
            "LevelID": 2,
            "Amps": 16,
            "Voltage": 230,
            "PowerKW": 3.7,
            "CurrentTypeID": 20,
            "Quantity": 2
        }
    ],
    "NumberOfPoints": 4,
    "StatusTypeID": 50,
    "DateLastStatusUpdate": "2018-07-02T07:40:00Z",
    "DataQualityLevel": 1,
    "DateCreated": "2018-07-02T07:40:00Z",
    "SubmissionStatusTypeID": 200
}