{
    "IsRecentlyVerified": false,
    "ID": 107675,
    "UUID": "9BD4EF1A-3B50-417D-84B9-8174BEAA91A2",
    "DataProviderID": 1,
    "OperatorID": 3289,
    "UsageTypeID": 1,
    "UsageCost": "free",
    "AddressInfo": {
        "ID": 108021,
        "Title": "Sopron, Jereván lakótelep",
        "AddressLine1": "Kodály Zoltán tér",
        "Town": "Sopron",
        "StateOrProvince": "Győr-Moson-Sopron megye",
        "Postcode": "9400",
        "CountryID": 104,
        "Latitude": 47.691175239761414,
        "Longitude": 16.57508601904908,
        "DistanceUnit": 0
    },
    "Connections": [
        {
            "ID": 152017,
            "ConnectionTypeID": 25,
            "StatusTypeID": 50,
            "LevelID": 2,
            "Amps": 32,
            "Voltage": 400,
            "PowerKW": 22,
            "CurrentTypeID": 20,
            "Quantity": 2
        }
    ],
    "NumberOfPoints": 2,
    "StatusTypeID": 50,
    "DateLastStatusUpdate": "2018-08-06T11:36:00Z",
    "DataQualityLevel": 1,
    "DateCreated": "2018-08-06T11:36:00Z",
    "SubmissionStatusTypeID": 200
}