{
    "IsRecentlyVerified": false,
    "ID": 155453,
    "UUID": "D4D4418E-80EF-46CC-83A6-662E6F7D562F",
    "DataProviderID": 1,
    "OperatorID": 1,
    "UsageTypeID": 3,
    "UsageCost": "Parking fee. AC Not known.",
    "AddressInfo": {
        "ID": 155807,
        "Title": "P-Silkkiparkki, Vanha Silkkitehdas",
        "AddressLine1": "Silkkitehtaantie 5",
        "Town": "Vantaa",
        "StateOrProvince": "Southern Finland",
        "Postcode": "01301",
        "CountryID": 79,
        "Latitude": 60.288688177331096,
        "Longitude": 25.03615687430772,
        "DistanceUnit": 0
    },
    "Connections": [
        {
            "ID": 218864,
            "ConnectionTypeID": 25,
            "StatusTypeID": 50,
            "LevelID": 2,
            "Amps": 32,
            "Voltage": 400,
            "PowerKW": 22,
            "CurrentTypeID": 20,
            "Quantity": 4
        }
    ],
    "NumberOfPoints": 4,
    "GeneralComments": "Parking fee: EasyPark",
    "StatusTypeID": 50,
    "DateLastStatusUpdate": "2020-04-13T21:31:00Z",
    "DataQualityLevel": 1,
    "DateCreated": "2020-04-12T09:31:00Z",
    "SubmissionStatusTypeID": 200
}