{
    "IsRecentlyVerified": false,
    "ID": 112841,
    "UUID": "F36C3609-2F81-4E51-9A2D-6F3408E1704E",
    "DataProviderID": 1,
    "OperatorID": 46,
    "UsageTypeID": 4,
    "AddressInfo": {
        "ID": 113187,
        "Title": "A2 Center",
        "AddressLine1": "Opelstraße 5",
        "Town": "Isernhagen",
        "StateOrProvince": "Region Hannover",
        "Postcode": "30916",
        "CountryID": 87,
        "Latitude": 52.4230327002279,
        "Longitude": 9.83506002095441,
        "AccessComments": "24/7 nutzbarer Triplecharger und eine Drehstrom-Ladestation. ",
        "DistanceUnit": 0
    },
    "Connections": [
        {
            "ID": 158920,
            "ConnectionTypeID": 1036,
            "StatusTypeID": 50,
            "LevelID": 3,
            "Amps": 63,
            "Voltage": 400,
            "PowerKW": 43,
            "CurrentTypeID": 20,
            "Quantity": 1
        },
        {
            "ID": 158921,
            "ConnectionTypeID": 2,
            "StatusTypeID": 50,
            "LevelID": 3,
            "PowerKW": 50,
            "CurrentTypeID": 30,
            "Quantity": 1
        },
        {
            "ID": 158922,
            "ConnectionTypeID": 33,
            "StatusTypeID": 50,
            "LevelID": 3,
            "PowerKW": 50,
            "CurrentTypeID": 30,
            "Quantity": 1
        },
        {
            "ID": 166591,
            "ConnectionTypeID": 25,
            "LevelID": 2,
            "Amps": 32,
            "Voltage": 400,
            "PowerKW": 22,
            "CurrentTypeID": 20,
            "Quantity": 2
        }
    ],
    "NumberOfPoints": 3,
    "StatusTypeID": 50,
    "DateLastStatusUpdate": "2019-02-27T16:55:00Z",
    "DataQualityLevel": 1,
    "DateCreated": "2018-11-20T13:56:00Z",
    "SubmissionStatusTypeID": 200
}