{
    "IsRecentlyVerified": false,
    "ID": 176614,
    "UUID": "2C88E71F-8390-4EA1-972B-5B898ED10FC2",
    "DataProviderID": 29,
    "DataProvidersReference": "17950",
    "OperatorID": 45,
    "AddressInfo": {
        "ID": 176973,
        "Title": "Bundesstraße 14",
        "AddressLine1": "Bundesstraße 14",
        "Town": "Stühlingen",
        "Postcode": "79780",
        "CountryID": 87,
        "Latitude": 47.748549,
        "Longitude": 8.454869,
        "DistanceUnit": 0
    },
    "Connections": [
        {
            "ID": 274727,
            "ConnectionTypeID": 33,
            "StatusTypeID": 50,
            "LevelID": 3,
            "PowerKW": 22,
            "CurrentTypeID": 30
        },
        {
            "ID": 274728,
            "ConnectionTypeID": 25,
            "StatusTypeID": 50,
            "LevelID": 2,
            "PowerKW": 11,
            "CurrentTypeID": 20
        }
    ],
    "StatusTypeID": 0,
    "DateLastStatusUpdate": "2021-07-09T03:10:00Z",
    "MetadataValues": [
        {
            "ID": 8909,
            "MetadataFieldID": 4,
            "ItemValue": "Data from the German chargepoint registry provided by Bundesnetzagentur.de under the CC-BY 4.0 license"
        }
    ],
    "DataQualityLevel": 3,
    "DateCreated": "2021-07-08T09:48:00Z",
    "SubmissionStatusTypeID": 100
}