{
    "IsRecentlyVerified": false,
    "ID": 182423,
    "UUID": "796EF67B-6093-447C-AFC6-DEF7C7F6CDBC",
    "DataProviderID": 29,
    "DataProvidersReference": "5015",
    "OperatorID": 45,
    "AddressInfo": {
        "ID": 182782,
        "Title": "Varresbecker Str. 123",
        "AddressLine1": "Varresbecker Str. 123",
        "Town": "Wuppertal",
        "Postcode": "42115",
        "CountryID": 87,
        "Latitude": 51.249489,
        "Longitude": 7.101061,
        "DistanceUnit": 0
    },
    "Connections": [
        {
            "ID": 288145,
            "ConnectionTypeID": 25,
            "StatusTypeID": 50,
            "LevelID": 2,
            "PowerKW": 22,
            "CurrentTypeID": 20
        },
        {
            "ID": 288146,
            "ConnectionTypeID": 25,
            "StatusTypeID": 50,
            "LevelID": 2,
            "PowerKW": 22,
            "CurrentTypeID": 20
        }
    ],
    "StatusTypeID": 50,
    "DateLastStatusUpdate": "2021-07-09T03:22:00Z",
    "MetadataValues": [
        {
            "ID": 14717,
            "MetadataFieldID": 4,
            "ItemValue": "Data from the German chargepoint registry provided by Bundesnetzagentur.de under the CC-BY 4.0 license"
        }
    ],
    "DataQualityLevel": 3,
    "DateCreated": "2021-07-08T10:03:00Z",
    "SubmissionStatusTypeID": 100
}