{
    "IsRecentlyVerified": false,
    "ID": 35184,
    "UUID": "B331383C-5B93-4DB8-906A-F6A20293F864",
    "DataProviderID": 26,
    "DataProvidersReference": "48272",
    "OperatorID": 178,
    "OperatorsReference": "EVnetNL EV0160",
    "UsageCost": "0.00 jaarabonnement",
    "AddressInfo": {
        "ID": 35530,
        "Title": "von Suttnerstraat 2",
        "AddressLine1": "von Suttnerstraat 2",
        "Town": "Gouda",
        "Postcode": "2806 HD",
        "CountryID": 159,
        "Latitude": 52.010046,
        "Longitude": 4.724943,
        "ContactTelephone1": "0800-3522365",
        "RelatedURL": "http://www.evnet.nl",
        "DistanceUnit": 0
    },
    "Connections": [
        {
            "ID": 38695,
            "ConnectionTypeID": 25,
            "LevelID": 2,
            "PowerKW": 11,
            "CurrentTypeID": 10
        }
    ],
    "NumberOfPoints": 1,
    "StatusTypeID": 50,
    "DateLastStatusUpdate": "2016-06-04T02:44:00Z",
    "DataQualityLevel": 3,
    "DateCreated": "2015-01-09T06:04:00Z",
    "SubmissionStatusTypeID": 100
}