{
    "IsRecentlyVerified": false,
    "ID": 141803,
    "UUID": "04B8B05C-BB5B-4286-86A0-AD0F1C7CF0EA",
    "DataProviderID": 2,
    "DataProvidersReference": "143141",
    "OperatorID": 5,
    "UsageTypeID": 1,
    "AddressInfo": {
        "ID": 142155,
        "Title": "RHD",
        "AddressLine1": "2315 Market St",
        "Town": "Reno",
        "StateOrProvince": "NV",
        "Postcode": "89502",
        "CountryID": 2,
        "Latitude": 39.515384,
        "Longitude": -119.783225,
        "ContactTelephone1": "888-758-4389",
        "AccessComments": "24 hours daily",
        "RelatedURL": "http://www.chargepoint.com/",
        "DistanceUnit": 0
    },
    "Connections": [
        {
            "ID": 197819,
            "ConnectionTypeID": 32,
            "LevelID": 3,
            "Amps": 100,
            "Voltage": 400,
            "PowerKW": 40,
            "CurrentTypeID": 30,
            "Quantity": 1
        }
    ],
    "StatusTypeID": 50,
    "DateLastStatusUpdate": "2020-06-26T03:01:00Z",
    "DataQualityLevel": 3,
    "DateCreated": "2019-12-24T09:16:00Z",
    "SubmissionStatusTypeID": 100
}