{
    "IsRecentlyVerified": false,
    "ID": 125857,
    "UUID": "00C732DC-FACD-4CC8-B8CA-D82A5094A5A6",
    "DataProviderID": 1,
    "OperatorID": 150,
    "UsageTypeID": 4,
    "UsageCost": "£1.80 + £0.30/kWh",
    "AddressInfo": {
        "ID": 126203,
        "Title": "Morrisons Watford",
        "AddressLine1": "Ascot Road",
        "Town": "Watford",
        "Postcode": "WD18 8AA",
        "CountryID": 1,
        "Latitude": 51.647893,
        "Longitude": -0.422614,
        "DistanceUnit": 0
    },
    "Connections": [
        {
            "ID": 176379,
            "ConnectionTypeID": 2,
            "StatusTypeID": 50,
            "LevelID": 3,
            "PowerKW": 50,
            "CurrentTypeID": 30,
            "Quantity": 1
        },
        {
            "ID": 176380,
            "ConnectionTypeID": 1036,
            "StatusTypeID": 50,
            "LevelID": 3,
            "PowerKW": 43,
            "CurrentTypeID": 20,
            "Quantity": 1
        },
        {
            "ID": 176381,
            "ConnectionTypeID": 33,
            "StatusTypeID": 50,
            "LevelID": 3,
            "PowerKW": 50,
            "CurrentTypeID": 30,
            "Quantity": 1
        }
    ],
    "NumberOfPoints": 1,
    "StatusTypeID": 50,
    "DateLastStatusUpdate": "2019-05-20T09:46:00Z",
    "DataQualityLevel": 1,
    "DateCreated": "2019-05-01T18:58:00Z",
    "SubmissionStatusTypeID": 200
}