{
    "IsRecentlyVerified": false,
    "ID": 15853,
    "UUID": "2FEE88FD-A43D-4916-BB9F-01E89A17063D",
    "DataProviderID": 1,
    "OperatorID": 1,
    "UsageTypeID": 1,
    "UsageCost": "Free",
    "AddressInfo": {
        "ID": 16198,
        "Title": "Arapahoe Parking",
        "AddressLine1": "105 Lasalle Rd",
        "AddressLine2": "",
        "Town": "West Hartford",
        "StateOrProvince": "CT",
        "Postcode": "06107",
        "CountryID": 2,
        "Latitude": 41.7587486,
        "Longitude": -72.7444863,
        "ContactTelephone1": "",
        "ContactTelephone2": "",
        "ContactEmail": "",
        "AccessComments": "",
        "RelatedURL": "",
        "DistanceUnit": 0
    },
    "Connections": [
        {
            "ID": 14206,
            "ConnectionTypeID": 1,
            "StatusTypeID": 0,
            "LevelID": 2,
            "Quantity": 1
        }
    ],
    "NumberOfPoints": 1,
    "GeneralComments": "",
    "StatusTypeID": 50,
    "DateLastStatusUpdate": "2013-02-01T16:57:00Z",
    "DataQualityLevel": 1,
    "DateCreated": "2013-01-31T20:40:00Z",
    "SubmissionStatusTypeID": 200
}