{
    "IsRecentlyVerified": false,
    "ID": 141816,
    "UUID": "D52C05C0-35E9-40BB-9A4E-B9205D543035",
    "DataProviderID": 2,
    "DataProvidersReference": "143291",
    "OperatorID": 5,
    "UsageTypeID": 1,
    "AddressInfo": {
        "ID": 142168,
        "Title": "RMH-D",
        "AddressLine1": "2885 W County Line Rd",
        "Town": "Littleton",
        "StateOrProvince": "CO",
        "Postcode": "80129",
        "CountryID": 2,
        "Latitude": 39.5667219,
        "Longitude": -105.0240268,
        "ContactTelephone1": "888-758-4389",
        "AccessComments": "24 hours daily",
        "RelatedURL": "http://www.chargepoint.com/",
        "DistanceUnit": 0
    },
    "Connections": [
        {
            "ID": 197838,
            "ConnectionTypeID": 32,
            "LevelID": 3,
            "Amps": 100,
            "Voltage": 400,
            "PowerKW": 40,
            "CurrentTypeID": 30,
            "Quantity": 1
        }
    ],
    "StatusTypeID": 50,
    "DateLastStatusUpdate": "2019-12-24T09:16:00Z",
    "DataQualityLevel": 3,
    "DateCreated": "2019-12-24T09:16:00Z",
    "SubmissionStatusTypeID": 100
}