{
    "UserComments": [
        {
            "ID": 21435,
            "ChargePointID": 131216,
            "CommentTypeID": 10,
            "UserName": "lemont",
            "Comment": "Restaurants (nombreux) tout autour. \r\nProximité immédiate de la sortie d'autoroute",
            "Rating": 5,
            "DateCreated": "2019-08-30T15:12:23.453Z",
            "User": {
                "ID": 22105,
                "Username": "lemont"
            },
            "CheckinStatusTypeID": 10
        }
    ],
    "MediaItems": [
        {
            "ID": 21671,
            "ChargePointID": 131216,
            "ItemURL": "https://s3-ap-southeast-2.amazonaws.com/openchargemap/images/FR/OCM131216/OCM-131216.orig.2020032216423331.jpg",
            "ItemThumbnailURL": "https://s3-ap-southeast-2.amazonaws.com/openchargemap/images/FR/OCM131216/OCM-131216.thmb.2020032216423331.jpg",
            "Comment": "",
            "IsEnabled": true,
            "IsVideo": false,
            "IsFeaturedItem": false,
            "IsExternalResource": false,
            "User": {
                "ID": 22105,
                "Username": "lemont"
            },
            "DateCreated": "2020-03-22T16:43:00Z"
        },
        {
            "ID": 21672,
            "ChargePointID": 131216,
            "ItemURL": "https://s3-ap-southeast-2.amazonaws.com/openchargemap/images/FR/OCM131216/OCM-131216.orig.2020032216425434.jpg",
            "ItemThumbnailURL": "https://s3-ap-southeast-2.amazonaws.com/openchargemap/images/FR/OCM131216/OCM-131216.thmb.2020032216425434.jpg",
            "Comment": "",
            "IsEnabled": true,
            "IsVideo": false,
            "IsFeaturedItem": false,
            "IsExternalResource": false,
            "User": {
                "ID": 22105,
                "Username": "lemont"
            },
            "DateCreated": "2020-03-22T16:43:00Z"
        }
    ],
    "IsRecentlyVerified": false,
    "ID": 131216,
    "UUID": "E8A3A42A-82B5-4768-AC39-D36C86442420",
    "DataProviderID": 1,
    "OperatorID": 55,
    "UsageTypeID": 1,
    "UsageCost": "1€ / 5 minutes",
    "AddressInfo": {
        "ID": 131562,
        "Title": "e-Totem Impasse Saint Exupéry Andrézieux-Bouthéon",
        "AddressLine1": "impasse Saint-Exupéry",
        "Town": "Andrézieux-Bouthéon",
        "StateOrProvince": "Loire",
        "Postcode": "42160",
        "CountryID": 80,
        "Latitude": 45.5234367925676,
        "Longitude": 4.29217796306045,
        "AccessComments": "Sur le parking du Brut Butcher",
        "DistanceUnit": 0
    },
    "Connections": [
        {
            "ID": 183737,
            "ConnectionTypeID": 1036,
            "StatusTypeID": 50,
            "LevelID": 3,
            "Amps": 63,
            "Voltage": 400,
            "PowerKW": 43,
            "CurrentTypeID": 20,
            "Quantity": 1
        },
        {
            "ID": 183738,
            "ConnectionTypeID": 2,
            "StatusTypeID": 50,
            "LevelID": 3,
            "PowerKW": 50,
            "CurrentTypeID": 30,
            "Quantity": 1
        },
        {
            "ID": 183739,
            "ConnectionTypeID": 33,
            "StatusTypeID": 50,
            "LevelID": 3,
            "PowerKW": 50,
            "CurrentTypeID": 30,
            "Quantity": 1
        }
    ],
    "NumberOfPoints": 1,
    "StatusTypeID": 50,
    "DateLastStatusUpdate": "2020-03-22T16:43:00Z",
    "DataQualityLevel": 1,
    "DateCreated": "2019-08-30T14:55:00Z",
    "SubmissionStatusTypeID": 200
}