{
    "IsRecentlyVerified": false,
    "ID": 124409,
    "UUID": "B0CF7932-80E8-45A6-AA33-C3F68BC08976",
    "DataProviderID": 2,
    "DataProvidersReference": "73004",
    "OperatorID": 1242,
    "UsageTypeID": 2,
    "AddressInfo": {
        "ID": 124755,
        "Title": "KTP 1 (QR xxxxxxx)",
        "AddressLine1": "3001  Chamberlain Ln",
        "Town": "Louisville",
        "StateOrProvince": "KY",
        "Postcode": "40241",
        "CountryID": 2,
        "Latitude": 38.2903125584,
        "Longitude": -85.531182019,
        "ContactTelephone1": "855-443-3873",
        "AccessComments": "",
        "RelatedURL": "https://www.gewattstation.com",
        "DistanceUnit": 0
    },
    "Connections": [
        {
            "ID": 174501,
            "ConnectionTypeID": 1,
            "LevelID": 2,
            "Amps": 16,
            "Voltage": 230,
            "PowerKW": 3.7,
            "CurrentTypeID": 10,
            "Quantity": 1
        }
    ],
    "DateLastStatusUpdate": "2020-06-26T02:59:00Z",
    "DataQualityLevel": 3,
    "DateCreated": "2019-04-06T05:03:00Z",
    "SubmissionStatusTypeID": 100
}