{
    "IsRecentlyVerified": false,
    "ID": 15344,
    "UUID": "9789D5A2-FC1A-417F-A5DD-DF6E56830A4E",
    "DataProviderID": 1,
    "OperatorID": 51,
    "UsageTypeID": 1,
    "UsageCost": "Free",
    "AddressInfo": {
        "ID": 15690,
        "Title": "St. Christopher’s Hotel",
        "AddressLine1": "146 Caribou Road",
        "AddressLine2": "",
        "Town": "Channel-Port-aux-Basques",
        "StateOrProvince": "NL",
        "Postcode": "A0M 1C0",
        "CountryID": 44,
        "Latitude": 47.57641839999999,
        "Longitude": -59.14126060000001,
        "ContactTelephone1": "+1 800-563-4779",
        "ContactTelephone2": "",
        "ContactEmail": "info@stchrishotel.com",
        "AccessComments": "",
        "RelatedURL": "http://www.stchrishotel.com",
        "DistanceUnit": 0
    },
    "Connections": [
        {
            "ID": 13648,
            "ConnectionTypeID": 1,
            "StatusTypeID": 0,
            "LevelID": 2,
            "Amps": 72,
            "Voltage": 240,
            "PowerKW": 17.3,
            "Quantity": 1
        }
    ],
    "NumberOfPoints": 1,
    "GeneralComments": "",
    "StatusTypeID": 50,
    "DateLastStatusUpdate": "2013-01-08T14:43:00Z",
    "DataQualityLevel": 1,
    "DateCreated": "2013-01-08T14:43:00Z",
    "SubmissionStatusTypeID": 200
}