{
    "IsRecentlyVerified": false,
    "ID": 149652,
    "UUID": "833C06AA-9AC8-4A00-B458-47A59B1881D1",
    "DataProviderID": 1,
    "OperatorID": 23,
    "OperatorsReference": "53084",
    "UsageTypeID": 4,
    "AddressInfo": {
        "ID": 150005,
        "Title": "Ristorante Fabiano",
        "AddressLine1": "64/10 Libocka Prague",
        "Town": "Prague",
        "Postcode": "162 00",
        "CountryID": 64,
        "Latitude": 50.088872,
        "Longitude": 14.325798,
        "ContactTelephone1": "+971 4438 4664",
        "DistanceUnit": 0
    },
    "Connections": [
        {
            "ID": 207770,
            "ConnectionTypeID": 30,
            "StatusTypeID": 50,
            "LevelID": 2,
            "PowerKW": 11,
            "CurrentTypeID": 20,
            "Quantity": 1
        }
    ],
    "NumberOfPoints": 1,
    "GeneralComments": "1 Tesla Connector, up to 11kW.Available for customers. Please call ahead.",
    "StatusTypeID": 50,
    "DateLastStatusUpdate": "2020-03-02T06:55:00Z",
    "DataQualityLevel": 1,
    "DateCreated": "2020-03-02T06:55:00Z",
    "SubmissionStatusTypeID": 200
}