{
    "IsRecentlyVerified": false,
    "ID": 157423,
    "UUID": "99427AFC-EC49-4F44-A7D4-A0D0DAA89BEB",
    "DataProviderID": 1,
    "UsageTypeID": 1,
    "UsageCost": "No Charge",
    "AddressInfo": {
        "ID": 157777,
        "Title": "Kidd Creek Rest Area",
        "AddressLine1": "Kidd Creek Rest Area",
        "AddressLine2": "\t6725 BC-3,",
        "Town": "Kitchener",
        "StateOrProvince": "British Columbia",
        "Postcode": "V0B 1W1",
        "CountryID": 44,
        "Latitude": 49.161939555024134,
        "Longitude": -116.26508562786216,
        "ContactEmail": "TransportationClimateAction@gov.bc.ca",
        "DistanceUnit": 0
    },
    "Connections": [
        {
            "ID": 226746,
            "ConnectionTypeID": 32,
            "StatusTypeID": 50,
            "LevelID": 3,
            "Amps": 120,
            "Voltage": 480,
            "PowerKW": 50,
            "CurrentTypeID": 30,
            "Quantity": 2
        },
        {
            "ID": 226747,
            "ConnectionTypeID": 1,
            "StatusTypeID": 50,
            "LevelID": 2,
            "Amps": 40,
            "Voltage": 240,
            "PowerKW": 7,
            "CurrentTypeID": 10,
            "Quantity": 1
        }
    ],
    "NumberOfPoints": 3,
    "GeneralComments": "L2 requires Flo app or RFID to authorize. Ne charge. DCFC free and does not require authorization.",
    "StatusTypeID": 50,
    "DateLastStatusUpdate": "2020-06-09T06:30:00Z",
    "DataQualityLevel": 1,
    "DateCreated": "2020-06-03T23:06:00Z",
    "SubmissionStatusTypeID": 200
}