{
    "IsRecentlyVerified": false,
    "ID": 104288,
    "UUID": "768D1786-6826-4792-88DF-32D187CAD797",
    "DataProviderID": 1,
    "OperatorID": 23,
    "OperatorsReference": "43068",
    "UsageTypeID": 6,
    "AddressInfo": {
        "ID": 104634,
        "Title": "Jupiter Algarve Hotel",
        "AddressLine1": "Av. Tomás Cabreira 92",
        "Town": "Portimão",
        "Postcode": "8500-802",
        "CountryID": 180,
        "Latitude": 37.119154,
        "Longitude": -8.536847,
        "ContactTelephone1": "+351 282 470 470",
        "AccessComments": "Only for customers",
        "DistanceUnit": 0
    },
    "Connections": [
        {
            "ID": 147250,
            "ConnectionTypeID": 30,
            "StatusTypeID": 50,
            "LevelID": 2,
            "Amps": 32,
            "Voltage": 400,
            "PowerKW": 22,
            "CurrentTypeID": 20,
            "Quantity": 1
        }
    ],
    "NumberOfPoints": 1,
    "GeneralComments": "1 Tesla Connector, up to 22kW.Available for customers. Please see front desk.",
    "StatusTypeID": 50,
    "DateLastStatusUpdate": "2020-08-06T18:34:00Z",
    "DataQualityLevel": 1,
    "DateCreated": "2018-05-18T05:36:00Z",
    "SubmissionStatusTypeID": 200
}