{
    "UserComments": [
        {
            "ID": 16173,
            "ChargePointID": 77272,
            "CommentTypeID": 100,
            "UserName": "AGLLeaf",
            "Comment": "This charger is fully operational; I have used it twice with my Polar Plus card.  There are two Type 2 sockets either side of this charger, which is located in an area of Aldi's car park marked as \"no customers beyond this point\". There are no barriers and the site is accessible 24/7.",
            "Rating": 5,
            "DateCreated": "2017-04-06T03:29:16.35Z",
            "User": {
                "ID": 12202,
                "Username": "AGLLeaf"
            },
            "CheckinStatusTypeID": 10
        }
    ],
    "IsRecentlyVerified": false,
    "ID": 77272,
    "UUID": "94BC8939-FCF2-4A78-B49B-C5AEE1DBC7CB",
    "DataProviderID": 1,
    "OperatorID": 32,
    "OperatorsReference": "3633",
    "UsageTypeID": 4,
    "UsageCost": "£0.108/kWh; for Polar Plus subscription members only",
    "AddressInfo": {
        "ID": 77618,
        "Title": "Aldi Holmes Chapel ",
        "AddressLine1": "Manor Lane",
        "Town": "Holmes Chapel",
        "StateOrProvince": "Cheshire",
        "Postcode": "CW4 8AB",
        "CountryID": 1,
        "Latitude": 53.200548,
        "Longitude": -2.347658,
        "RelatedURL": "https://www.aldi.co.uk/store/s-uk-E1136",
        "DistanceUnit": 0
    },
    "Connections": [
        {
            "ID": 111191,
            "ConnectionTypeID": 25,
            "StatusTypeID": 50,
            "LevelID": 2,
            "Amps": 32,
            "Voltage": 230,
            "PowerKW": 7,
            "CurrentTypeID": 10,
            "Quantity": 2
        }
    ],
    "NumberOfPoints": 2,
    "StatusTypeID": 50,
    "DateLastStatusUpdate": "2019-03-08T06:41:00Z",
    "DataQualityLevel": 1,
    "DateCreated": "2017-01-07T15:56:00Z",
    "SubmissionStatusTypeID": 200
}