{
    "IsRecentlyVerified": false,
    "ID": 18258,
    "UUID": "AB89E522-E42D-4383-AC90-8EF2623B5269",
    "DataProviderID": 1,
    "OperatorID": 32,
    "OperatorsReference": "2120",
    "UsageTypeID": 4,
    "UsageCost": "£0.108/kWh; for Polar Plus subscription members only",
    "AddressInfo": {
        "ID": 18603,
        "Title": "Midsummer Blvd / Secklow Gate Car Park",
        "AddressLine1": "Midsummer Boulevard - near Seclow Gate Car Park",
        "Town": "Milton Keynes",
        "Postcode": "MK9 3NE",
        "CountryID": 1,
        "Latitude": 52.042858,
        "Longitude": -0.752976,
        "RelatedURL": "http://www.chargemasterplc.com",
        "DistanceUnit": 0
    },
    "Connections": [
        {
            "ID": 18481,
            "ConnectionTypeID": 25,
            "StatusTypeID": 50,
            "LevelID": 2,
            "Amps": 32,
            "Voltage": 230,
            "PowerKW": 7,
            "CurrentTypeID": 10,
            "Quantity": 2
        }
    ],
    "NumberOfPoints": 6,
    "StatusTypeID": 50,
    "DateLastStatusUpdate": "2019-03-07T06:20:00Z",
    "DataQualityLevel": 3,
    "DateCreated": "2013-07-16T03:52:00Z",
    "SubmissionStatusTypeID": 200
}