{
    "IsRecentlyVerified": false,
    "ID": 91454,
    "UUID": "ACCA3BB5-68A6-40AC-804F-4DBA8D247826",
    "DataProviderID": 2,
    "DataProvidersReference": "85973",
    "UsageTypeID": 7,
    "AddressInfo": {
        "ID": 91800,
        "Title": "Coughlin Nissan",
        "AddressLine1": "1459 Hebron Rd",
        "Town": "Heath",
        "StateOrProvince": "OH",
        "Postcode": "43056",
        "CountryID": 2,
        "Latitude": 40.012238,
        "Longitude": -82.458184,
        "ContactTelephone1": "740-915-8501",
        "AccessComments": "Dealership business hours\r\nPublic - Call ahead",
        "RelatedURL": "",
        "DistanceUnit": 0
    },
    "Connections": [
        {
            "ID": 129622,
            "ConnectionTypeID": 1,
            "LevelID": 2,
            "Amps": 16,
            "Voltage": 230,
            "PowerKW": 3.7,
            "CurrentTypeID": 10,
            "Quantity": 2
        }
    ],
    "DateLastStatusUpdate": "2020-06-26T03:02:00Z",
    "DataQualityLevel": 3,
    "DateCreated": "2017-08-03T12:25:00Z",
    "SubmissionStatusTypeID": 100
}