{
    "IsRecentlyVerified": false,
    "ID": 103659,
    "UUID": "4D948DCA-DA25-47A1-B98F-62036169D6EC",
    "DataProviderID": 1,
    "OperatorID": 23,
    "OperatorsReference": "42762",
    "UsageTypeID": 4,
    "AddressInfo": {
        "ID": 104005,
        "Title": "Unique Home",
        "AddressLine1": "Kuormakatu 16",
        "Town": "Turku",
        "Postcode": "20380",
        "CountryID": 79,
        "Latitude": 60.480312,
        "Longitude": 22.327951,
        "ContactTelephone1": "+358 28800160",
        "DistanceUnit": 0
    },
    "Connections": [
        {
            "ID": 146329,
            "ConnectionTypeID": 30,
            "StatusTypeID": 50,
            "LevelID": 2,
            "Amps": 32,
            "Voltage": 230,
            "PowerKW": 17,
            "CurrentTypeID": 20,
            "Quantity": 1
        }
    ],
    "NumberOfPoints": 1,
    "GeneralComments": "1 Tesla Connector, up to 17kW.Available for customers. Self park.",
    "StatusTypeID": 50,
    "DateLastStatusUpdate": "2018-10-03T23:57:00Z",
    "DataQualityLevel": 1,
    "DateCreated": "2018-05-05T05:48:00Z",
    "SubmissionStatusTypeID": 200
}