{
    "IsRecentlyVerified": false,
    "ID": 34076,
    "UUID": "1E4A40E1-118D-4D78-B8BD-BF4175DD6CCE",
    "DataProviderID": 26,
    "DataProvidersReference": "47868",
    "OperatorID": 178,
    "OperatorsReference": "EVnetNL DB0102",
    "UsageCost": "0.00 jaarabonnement",
    "AddressInfo": {
        "ID": 34422,
        "Title": "Nocturnestraat 39",
        "AddressLine1": "Nocturnestraat 39",
        "Town": "Barendrecht",
        "Postcode": "2992 GZ",
        "CountryID": 159,
        "Latitude": 51.857765,
        "Longitude": 4.520008,
        "ContactTelephone1": "0800-3522365",
        "RelatedURL": "http://www.evnet.nl",
        "DistanceUnit": 0
    },
    "Connections": [
        {
            "ID": 37587,
            "ConnectionTypeID": 25,
            "LevelID": 2,
            "PowerKW": 11,
            "CurrentTypeID": 10
        }
    ],
    "NumberOfPoints": 2,
    "StatusTypeID": 50,
    "DateLastStatusUpdate": "2016-06-04T02:41:00Z",
    "DataQualityLevel": 3,
    "DateCreated": "2015-01-09T06:04:00Z",
    "SubmissionStatusTypeID": 100
}