{
    "IsRecentlyVerified": false,
    "ID": 160403,
    "UUID": "EFEFB257-9C9A-419A-A2DA-CD0D3F59C955",
    "DataProviderID": 2,
    "DataProvidersReference": "154547",
    "UsageTypeID": 2,
    "AddressInfo": {
        "ID": 160760,
        "Title": "Nike - Airport",
        "AddressLine1": "4223 NE Penny Way",
        "Town": "Hillsboro",
        "StateOrProvince": "OR",
        "Postcode": "97124",
        "CountryID": 2,
        "Latitude": 45.540462,
        "Longitude": -122.941124,
        "ContactTelephone1": "",
        "AccessComments": "For employee use only",
        "RelatedURL": "",
        "DistanceUnit": 0
    },
    "Connections": [
        {
            "ID": 230789,
            "ConnectionTypeID": 1,
            "LevelID": 2,
            "Amps": 16,
            "Voltage": 230,
            "PowerKW": 3.7,
            "CurrentTypeID": 10,
            "Quantity": 4
        }
    ],
    "StatusTypeID": 50,
    "DateLastStatusUpdate": "2020-06-26T03:09:00Z",
    "DataQualityLevel": 3,
    "DateCreated": "2020-06-26T03:09:00Z",
    "SubmissionStatusTypeID": 100
}