{
    "IsRecentlyVerified": false,
    "ID": 153163,
    "UUID": "AD43D69F-12E7-452C-9B8C-16DABC22274E",
    "DataProviderID": 28,
    "DataProvidersReference": "FR*S41*P41269-90",
    "UsageTypeID": 5,
    "AddressInfo": {
        "ID": 153516,
        "Title": "Vendôme | Rue des États Unis",
        "AddressLine1": "Rue des États Unis 41100 Vendôme",
        "CountryID": 80,
        "Latitude": 47.794548,
        "Longitude": 1.060181,
        "AccessComments": "24/24 7/7",
        "DistanceUnit": 0
    },
    "Connections": [
        {
            "ID": 214735,
            "ConnectionTypeID": 25,
            "StatusTypeID": 50,
            "LevelID": 2,
            "PowerKW": 18,
            "CurrentTypeID": 20
        },
        {
            "ID": 214736,
            "ConnectionTypeID": 28,
            "StatusTypeID": 50,
            "LevelID": 2,
            "PowerKW": 18,
            "CurrentTypeID": 10
        },
        {
            "ID": 248101,
            "ConnectionTypeID": 25,
            "StatusTypeID": 50,
            "LevelID": 2,
            "PowerKW": 18,
            "CurrentTypeID": 20
        },
        {
            "ID": 248102,
            "ConnectionTypeID": 28,
            "StatusTypeID": 50,
            "LevelID": 2,
            "PowerKW": 18,
            "CurrentTypeID": 10
        }
    ],
    "GeneralComments": "",
    "StatusTypeID": 50,
    "DateLastStatusUpdate": "2020-08-27T05:14:00Z",
    "DataQualityLevel": 2,
    "DateCreated": "2020-03-15T10:54:00Z",
    "SubmissionStatusTypeID": 100
}