{
    "IsRecentlyVerified": false,
    "ID": 179424,
    "UUID": "7154E491-EC26-4F68-927A-FE3EF4F36E64",
    "DataProviderID": 29,
    "DataProvidersReference": "12886",
    "OperatorID": 45,
    "AddressInfo": {
        "ID": 179783,
        "Title": "Neues Sträßel 6",
        "AddressLine1": "Neues Sträßel 6",
        "Town": "Wiesloch",
        "Postcode": "69168",
        "CountryID": 87,
        "Latitude": 49.288857,
        "Longitude": 8.677225,
        "DistanceUnit": 0
    },
    "Connections": [
        {
            "ID": 281230,
            "ConnectionTypeID": 25,
            "StatusTypeID": 50,
            "LevelID": 2,
            "PowerKW": 22,
            "CurrentTypeID": 20
        },
        {
            "ID": 281231,
            "ConnectionTypeID": 25,
            "StatusTypeID": 50,
            "LevelID": 2,
            "PowerKW": 22,
            "CurrentTypeID": 20
        }
    ],
    "StatusTypeID": 50,
    "DateLastStatusUpdate": "2021-07-09T03:16:00Z",
    "MetadataValues": [
        {
            "ID": 11718,
            "MetadataFieldID": 4,
            "ItemValue": "Data from the German chargepoint registry provided by Bundesnetzagentur.de under the CC-BY 4.0 license"
        }
    ],
    "DataQualityLevel": 3,
    "DateCreated": "2021-07-08T09:59:00Z",
    "SubmissionStatusTypeID": 100
}