{
    "IsRecentlyVerified": false,
    "ID": 163748,
    "UUID": "0DA758E4-5B9C-4B2A-A3D1-BC71F72BAB54",
    "DataProviderID": 1,
    "OperatorID": 23,
    "OperatorsReference": "51259",
    "UsageTypeID": 4,
    "AddressInfo": {
        "ID": 164105,
        "Title": "Hotel San Sebastian",
        "AddressLine1": "Avenida Zumalacarregui",
        "Town": "San Sebastian",
        "Postcode": "20008",
        "CountryID": 210,
        "Latitude": 43.314385,
        "Longitude": -2.00425,
        "ContactTelephone1": "+34 943 316 250",
        "DistanceUnit": 0
    },
    "Connections": [
        {
            "ID": 235345,
            "ConnectionTypeID": 30,
            "StatusTypeID": 50,
            "LevelID": 2,
            "PowerKW": 22,
            "CurrentTypeID": 20,
            "Quantity": 1
        }
    ],
    "NumberOfPoints": 1,
    "GeneralComments": "1 Tesla Connector, up to 22kW.Available for members only. Please see front desk.",
    "StatusTypeID": 50,
    "DateLastStatusUpdate": "2020-08-24T16:12:00Z",
    "DataQualityLevel": 1,
    "DateCreated": "2020-08-24T16:11:00Z",
    "SubmissionStatusTypeID": 200
}