{
    "IsRecentlyVerified": false,
    "ID": 155793,
    "UUID": "3B9ECB9C-BDAA-47AC-BE11-34EF5764790C",
    "DataProviderID": 1,
    "OperatorID": 187,
    "UsageTypeID": 1,
    "UsageCost": "99 Ft/kWh",
    "AddressInfo": {
        "ID": 156147,
        "Title": "ELMŰ, Ózd, Bolyki főút 52",
        "AddressLine1": "Bolyki főút 52.",
        "Town": "Ózd",
        "Postcode": "3600",
        "CountryID": 104,
        "Latitude": 48.22471121870794,
        "Longitude": 20.261259683962976,
        "ContactTelephone1": "+3612381888",
        "DistanceUnit": 0
    },
    "Connections": [
        {
            "ID": 219356,
            "ConnectionTypeID": 25,
            "StatusTypeID": 50,
            "LevelID": 2,
            "Amps": 32,
            "Voltage": 400,
            "PowerKW": 22,
            "CurrentTypeID": 20,
            "Quantity": 2
        }
    ],
    "NumberOfPoints": 2,
    "GeneralComments": "🇭🇺 2 x 22 kW AC, eCharge+ applikáción keresztüli kártyás fizetés szükséges a töltés indításához.\r\n🇬🇧 2 x 22 kW AC, card payment via eCharge+ application is required to start charging.",
    "StatusTypeID": 50,
    "DateLastStatusUpdate": "2020-05-05T06:09:00Z",
    "DataQualityLevel": 1,
    "DateCreated": "2020-04-24T13:36:00Z",
    "SubmissionStatusTypeID": 200
}