{
    "IsRecentlyVerified": false,
    "ID": 101685,
    "UUID": "7EBE9147-1329-4B08-A1C6-5911F4C4984D",
    "DataProviderID": 1,
    "OperatorID": 45,
    "UsageTypeID": 6,
    "UsageCost": "Free. Parking fees apply.",
    "AddressInfo": {
        "ID": 102031,
        "Title": "King's Mill Hospital",
        "AddressLine1": "Kings Mill Road East",
        "Town": "Ashfield",
        "StateOrProvince": "England",
        "Postcode": "NG17 4HJ",
        "CountryID": 1,
        "Latitude": 53.1338507079818,
        "Longitude": -1.23344344841007,
        "DistanceUnit": 0
    },
    "Connections": [
        {
            "ID": 143542,
            "ConnectionTypeID": 25,
            "StatusTypeID": 50,
            "LevelID": 2,
            "Amps": 32,
            "Voltage": 400,
            "PowerKW": 22,
            "CurrentTypeID": 20,
            "Quantity": 2
        }
    ],
    "NumberOfPoints": 2,
    "GeneralComments": "Token operated Rolec chargepoint. Obtain free token for 1 hour's charging from King's Mill Hospital reception.",
    "StatusTypeID": 50,
    "DateLastStatusUpdate": "2018-04-04T14:54:00Z",
    "DataQualityLevel": 1,
    "DateCreated": "2018-04-04T14:53:00Z",
    "SubmissionStatusTypeID": 200
}