{
    "IsRecentlyVerified": false,
    "ID": 173475,
    "UUID": "ACE81B40-BB06-43CC-AF18-F6D9E6451F88",
    "DataProviderID": 18,
    "DataProvidersReference": "40a2ecb47c6c2d4967ddd80d73e54d4d",
    "OperatorID": 3391,
    "UsageTypeID": 1,
    "AddressInfo": {
        "ID": 173834,
        "Title": "Salisbury Road",
        "AddressLine1": "Salisbury Road",
        "Town": "Hove",
        "Postcode": "BN3 3AB",
        "CountryID": 1,
        "Latitude": 50.827,
        "Longitude": -0.164,
        "AccessComments": "",
        "RelatedURL": "https://www.electricblueuk.com/",
        "DistanceUnit": 0
    },
    "Connections": [
        {
            "ID": 266512,
            "ConnectionTypeID": 25,
            "Reference": "62196-2 (SINGLE PHASE)",
            "StatusTypeID": 50,
            "LevelID": 2,
            "Amps": 16,
            "Voltage": 230,
            "PowerKW": 3.7,
            "CurrentTypeID": 10
        }
    ],
    "StatusTypeID": 0,
    "DateLastStatusUpdate": "2021-03-03T11:25:00Z",
    "MetadataValues": [
        {
            "ID": 8397,
            "MetadataFieldID": 4,
            "ItemValue": "Contains public sector information licensed under the Open Government Licence v2.0. http://www.nationalarchives.gov.uk/doc/open-government-licence/version/2/"
        }
    ],
    "DataQualityLevel": 3,
    "DateCreated": "2021-03-03T11:25:00Z",
    "SubmissionStatusTypeID": 100
}