{
    "IsRecentlyVerified": false,
    "ID": 124143,
    "UUID": "758028BD-AB92-4628-915D-0E3E682CE4FA",
    "DataProviderID": 2,
    "DataProvidersReference": "68400",
    "UsageTypeID": 2,
    "AddressInfo": {
        "ID": 124489,
        "Title": "Steve's Chevrolet Buick",
        "AddressLine1": "1285 E F St",
        "Town": "Oakdale",
        "StateOrProvince": "CA",
        "Postcode": "95361",
        "CountryID": 2,
        "Latitude": 37.770686,
        "Longitude": -120.834766,
        "ContactTelephone1": "",
        "AccessComments": "Limited Use",
        "RelatedURL": "",
        "DistanceUnit": 0
    },
    "Connections": [
        {
            "ID": 174202,
            "ConnectionTypeID": 1,
            "LevelID": 2,
            "Amps": 16,
            "Voltage": 230,
            "PowerKW": 3.7,
            "CurrentTypeID": 10,
            "Quantity": 2
        },
        {
            "ID": 174203,
            "ConnectionTypeID": 32,
            "LevelID": 3,
            "Amps": 100,
            "Voltage": 400,
            "PowerKW": 40,
            "CurrentTypeID": 30,
            "Quantity": 1
        }
    ],
    "DateLastStatusUpdate": "2020-06-26T02:59:00Z",
    "DataQualityLevel": 3,
    "DateCreated": "2019-04-06T05:03:00Z",
    "SubmissionStatusTypeID": 100
}