{
    "IsRecentlyVerified": false,
    "ID": 158732,
    "UUID": "574C636E-0A43-488D-A625-FBA62F2F3A17",
    "DataProviderID": 2,
    "DataProvidersReference": "155255",
    "OperatorID": 89,
    "UsageTypeID": 1,
    "AddressInfo": {
        "ID": 159089,
        "Title": "2442 Marengo St",
        "AddressLine1": "2442 Marengo St",
        "Town": "Los Angeles",
        "StateOrProvince": "CA",
        "Postcode": "90033",
        "CountryID": 2,
        "Latitude": 34.05420745,
        "Longitude": -118.2016653,
        "ContactTelephone1": "888-356-8911",
        "AccessComments": "24 hours daily",
        "RelatedURL": "https://flo.ca/",
        "DistanceUnit": 0
    },
    "Connections": [
        {
            "ID": 228757,
            "ConnectionTypeID": 1,
            "LevelID": 2,
            "Amps": 16,
            "Voltage": 230,
            "PowerKW": 3.7,
            "CurrentTypeID": 10,
            "Quantity": 1
        }
    ],
    "StatusTypeID": 50,
    "DateLastStatusUpdate": "2020-06-26T02:56:00Z",
    "DataQualityLevel": 3,
    "DateCreated": "2020-06-26T02:56:00Z",
    "SubmissionStatusTypeID": 100
}