{
    "IsRecentlyVerified": false,
    "ID": 144233,
    "UUID": "C6EE4DBD-E5A5-4BEA-8A65-8E8DBAA180F7",
    "DataProviderID": 2,
    "DataProvidersReference": "147563",
    "OperatorID": 90,
    "UsageTypeID": 1,
    "AddressInfo": {
        "ID": 144585,
        "Title": "623 Woodland",
        "AddressLine1": "623 Woodland",
        "Town": "Montréal",
        "StateOrProvince": "QC",
        "Postcode": "H4H 1K6",
        "CountryID": 44,
        "Latitude": 45.45263,
        "Longitude": -73.572932,
        "ContactTelephone1": "877-505-2674",
        "AccessComments": "24 hours daily",
        "RelatedURL": "https://lecircuitelectrique.com/",
        "DistanceUnit": 0
    },
    "Connections": [
        {
            "ID": 200722,
            "ConnectionTypeID": 1,
            "LevelID": 2,
            "Amps": 16,
            "Voltage": 230,
            "PowerKW": 3.7,
            "CurrentTypeID": 10,
            "Quantity": 2
        }
    ],
    "StatusTypeID": 50,
    "DateLastStatusUpdate": "2020-06-26T03:09:00Z",
    "DataQualityLevel": 3,
    "DateCreated": "2019-12-24T09:23:00Z",
    "SubmissionStatusTypeID": 100
}