{
    "IsRecentlyVerified": false,
    "ID": 160025,
    "UUID": "3D2850CB-5634-4752-9FE3-EC4BFCB6E710",
    "DataProviderID": 2,
    "DataProvidersReference": "151785",
    "OperatorID": 3293,
    "UsageTypeID": 1,
    "AddressInfo": {
        "ID": 160382,
        "Title": "Shaw's 134 Water Street",
        "AddressLine1": "134 Water St",
        "Town": "Wakefield",
        "StateOrProvince": "MA",
        "Postcode": "01880",
        "CountryID": 2,
        "Latitude": 42.503076,
        "Longitude": -71.064553,
        "ContactTelephone1": "888-264-2208",
        "AccessComments": "6am-12am daily",
        "RelatedURL": "https://voltacharging.com/",
        "DistanceUnit": 0
    },
    "Connections": [
        {
            "ID": 230260,
            "ConnectionTypeID": 1,
            "LevelID": 2,
            "Amps": 16,
            "Voltage": 230,
            "PowerKW": 3.7,
            "CurrentTypeID": 10,
            "Quantity": 2
        }
    ],
    "StatusTypeID": 50,
    "DateLastStatusUpdate": "2020-06-26T03:06:00Z",
    "DataQualityLevel": 3,
    "DateCreated": "2020-06-26T03:06:00Z",
    "SubmissionStatusTypeID": 100
}