{
    "IsRecentlyVerified": false,
    "ID": 139308,
    "UUID": "9F5D3F19-2C61-4948-8375-779ADBEA3538",
    "DataProviderID": 2,
    "DataProvidersReference": "92423",
    "OperatorID": 5,
    "UsageTypeID": 1,
    "AddressInfo": {
        "ID": 139660,
        "Title": "LONG BEACH",
        "AddressLine1": "119 E 3rd St",
        "Town": "Long Beach",
        "StateOrProvince": "CA",
        "Postcode": "90802",
        "CountryID": 2,
        "Latitude": 33.770818,
        "Longitude": -118.191844,
        "ContactTelephone1": "888-758-4389",
        "AccessComments": "24 hours daily",
        "RelatedURL": "http://www.chargepoint.com/",
        "DistanceUnit": 0
    },
    "Connections": [
        {
            "ID": 194620,
            "ConnectionTypeID": 1,
            "LevelID": 2,
            "Amps": 16,
            "Voltage": 230,
            "PowerKW": 3,
            "CurrentTypeID": 10,
            "Quantity": 13
        }
    ],
    "StatusTypeID": 50,
    "DateLastStatusUpdate": "2019-12-24T09:10:00Z",
    "DataQualityLevel": 3,
    "DateCreated": "2019-12-24T09:10:00Z",
    "SubmissionStatusTypeID": 100
}