{
    "IsRecentlyVerified": false,
    "ID": 62227,
    "UUID": "65BD96B6-3946-40FC-8BD7-E17A40D60720",
    "DataProviderID": 2,
    "DataProvidersReference": "72897",
    "OperatorID": 1242,
    "UsageTypeID": 2,
    "AddressInfo": {
        "ID": 62573,
        "Title": "oakbrook terrace tower 2",
        "AddressLine1": "1  Tower Ln",
        "Town": "Oakbrook Terrace",
        "StateOrProvince": "IL",
        "Postcode": "60181",
        "CountryID": 2,
        "Latitude": 41.8579232,
        "Longitude": -87.9546118,
        "ContactTelephone1": "855-443-3873",
        "AccessComments": "",
        "RelatedURL": "https://www.gewattstation.com",
        "DistanceUnit": 0
    },
    "Connections": [
        {
            "ID": 79130,
            "ConnectionTypeID": 1,
            "LevelID": 2,
            "Amps": 16,
            "Voltage": 230,
            "PowerKW": 3.7,
            "CurrentTypeID": 10,
            "Quantity": 1
        }
    ],
    "DateLastStatusUpdate": "2020-06-26T03:05:00Z",
    "DataQualityLevel": 3,
    "DateCreated": "2016-03-03T11:38:00Z",
    "SubmissionStatusTypeID": 100
}