{
    "IsRecentlyVerified": false,
    "ID": 185412,
    "UUID": "15DA4D94-2F7E-46F4-A256-E3C935B2D74F",
    "DataProviderID": 29,
    "DataProvidersReference": "15753",
    "OperatorID": 3403,
    "AddressInfo": {
        "ID": 185771,
        "Title": "Feldstraße 23",
        "AddressLine1": "Feldstraße 23",
        "Town": "Kiel",
        "Postcode": "24105",
        "CountryID": 87,
        "Latitude": 54.333478,
        "Longitude": 10.138621,
        "DistanceUnit": 0
    },
    "Connections": [
        {
            "ID": 294884,
            "ConnectionTypeID": 1036,
            "StatusTypeID": 50,
            "LevelID": 2,
            "PowerKW": 22,
            "CurrentTypeID": 20
        },
        {
            "ID": 294885,
            "ConnectionTypeID": 33,
            "StatusTypeID": 50,
            "LevelID": 3,
            "PowerKW": 50,
            "CurrentTypeID": 30
        }
    ],
    "StatusTypeID": 50,
    "DateLastStatusUpdate": "2021-07-09T03:30:00Z",
    "MetadataValues": [
        {
            "ID": 17703,
            "MetadataFieldID": 4,
            "ItemValue": "Data from the German chargepoint registry provided by Bundesnetzagentur.de under the CC-BY 4.0 license"
        }
    ],
    "DataQualityLevel": 3,
    "DateCreated": "2021-07-08T10:06:00Z",
    "SubmissionStatusTypeID": 100
}