{
    "IsRecentlyVerified": false,
    "ID": 136876,
    "UUID": "D52EC58A-EB19-4325-9E94-E4C6F693F276",
    "DataProviderID": 18,
    "DataProvidersReference": "e87f9feb1c5eaa39c06f57b4e112d171",
    "UsageTypeID": 1,
    "AddressInfo": {
        "ID": 137222,
        "Title": "Shore Road",
        "AddressLine1": "Shore Road",
        "Town": "Newtownabbey",
        "Postcode": "BT37 0PY",
        "CountryID": 1,
        "Latitude": 54.681245,
        "Longitude": -5.884091,
        "AccessComments": "",
        "RelatedURL": "https://www.drdni.gov.uk/",
        "DistanceUnit": 0
    },
    "Connections": [
        {
            "ID": 191549,
            "ConnectionTypeID": 25,
            "Reference": "1",
            "StatusTypeID": 50,
            "LevelID": 2,
            "Amps": 32,
            "Voltage": 230,
            "PowerKW": 7,
            "CurrentTypeID": 10
        },
        {
            "ID": 191550,
            "ConnectionTypeID": 25,
            "Reference": "2",
            "StatusTypeID": 50,
            "LevelID": 2,
            "Amps": 32,
            "Voltage": 230,
            "PowerKW": 7,
            "CurrentTypeID": 10
        }
    ],
    "StatusTypeID": 0,
    "DateLastStatusUpdate": "2020-03-17T08:54:00Z",
    "MetadataValues": [
        {
            "ID": 6728,
            "MetadataFieldID": 4,
            "ItemValue": "Contains public sector information licensed under the Open Government Licence v2.0. http://www.nationalarchives.gov.uk/doc/open-government-licence/version/2/"
        }
    ],
    "DataQualityLevel": 3,
    "DateCreated": "2019-12-24T05:23:00Z",
    "SubmissionStatusTypeID": 100
}