{
    "IsRecentlyVerified": false,
    "ID": 68188,
    "UUID": "93059ED8-D0A9-4B37-A9DF-3343FD775595",
    "DataProviderID": 26,
    "DataProvidersReference": "93106",
    "OperatorID": 177,
    "OperatorsReference": "Nuon EVB-P1607054",
    "UsageCost": "0.00 jaarabonnement",
    "AddressInfo": {
        "ID": 68534,
        "Title": "Waddenland 25",
        "AddressLine1": "Waddenland 25",
        "Town": "Duivendrecht",
        "Postcode": "1115 XC",
        "CountryID": 159,
        "Latitude": 52.332205,
        "Longitude": 4.938159,
        "RelatedURL": "http://www.nuon.nl/ev",
        "DistanceUnit": 0
    },
    "Connections": [
        {
            "ID": 95017,
            "ConnectionTypeID": 25,
            "LevelID": 2,
            "PowerKW": 11,
            "CurrentTypeID": 10
        },
        {
            "ID": 95018,
            "ConnectionTypeID": 25,
            "LevelID": 2,
            "PowerKW": 11,
            "CurrentTypeID": 10
        }
    ],
    "NumberOfPoints": 1,
    "StatusTypeID": 50,
    "DateLastStatusUpdate": "2016-06-04T02:37:00Z",
    "DataQualityLevel": 3,
    "DateCreated": "2016-06-04T02:37:00Z",
    "SubmissionStatusTypeID": 100
}