{
    "IsRecentlyVerified": false,
    "ID": 162663,
    "UUID": "95F2A3C7-DF9C-4ADF-9D65-BD017A44C52B",
    "DataProviderID": 1,
    "OperatorID": 21,
    "UsageTypeID": 4,
    "UsageCost": "Mobi.E compatible card",
    "AddressInfo": {
        "ID": 163020,
        "Title": "SNT-00044",
        "AddressLine1": "Av. Pedro Alvares Cabral",
        "Town": "Linhó",
        "StateOrProvince": "Lisboa",
        "Postcode": "2645",
        "CountryID": 180,
        "Latitude": 38.75833731448259,
        "Longitude": -9.380835415980982,
        "DistanceUnit": 0
    },
    "Connections": [
        {
            "ID": 234113,
            "ConnectionTypeID": 2,
            "StatusTypeID": 50,
            "LevelID": 3,
            "Amps": 120,
            "Voltage": 500,
            "PowerKW": 50,
            "CurrentTypeID": 30,
            "Quantity": 1
        },
        {
            "ID": 234114,
            "ConnectionTypeID": 33,
            "StatusTypeID": 50,
            "LevelID": 3,
            "Amps": 125,
            "Voltage": 500,
            "PowerKW": 50,
            "CurrentTypeID": 30,
            "Quantity": 1
        }
    ],
    "NumberOfPoints": 2,
    "StatusTypeID": 50,
    "DateLastStatusUpdate": "2020-08-13T19:37:00Z",
    "DataQualityLevel": 1,
    "DateCreated": "2020-08-13T19:37:00Z",
    "SubmissionStatusTypeID": 200
}