{
    "IsRecentlyVerified": false,
    "ID": 95510,
    "UUID": "41FCE542-C003-4600-B707-A5D3CF9828F2",
    "DataProviderID": 1,
    "OperatorID": 23,
    "OperatorsReference": "37681",
    "UsageTypeID": 4,
    "AddressInfo": {
        "ID": 95856,
        "Title": "Redstone Winery",
        "AddressLine1": "4245 King St",
        "Town": "Beamsville",
        "StateOrProvince": "Ontario",
        "Postcode": "L0R 1B1",
        "CountryID": 44,
        "Latitude": 43.1596,
        "Longitude": -79.4373321,
        "ContactTelephone1": "(905) 563-9463",
        "DistanceUnit": 0
    },
    "Connections": [
        {
            "ID": 135293,
            "ConnectionTypeID": 30,
            "StatusTypeID": 50,
            "LevelID": 2,
            "PowerKW": 16,
            "CurrentTypeID": 20,
            "Quantity": 4
        }
    ],
    "NumberOfPoints": 4,
    "GeneralComments": "4 Tesla Connectors, up to 16kW.Available for customers. Self park.",
    "StatusTypeID": 50,
    "DateLastStatusUpdate": "2017-11-12T06:54:00Z",
    "DataQualityLevel": 1,
    "DateCreated": "2017-11-12T06:54:00Z",
    "SubmissionStatusTypeID": 200
}