{
    "IsRecentlyVerified": false,
    "ID": 89396,
    "UUID": "6A6ABC73-375C-4DB2-9D4E-D9EC00455A16",
    "DataProviderID": 2,
    "DataProvidersReference": "85579",
    "UsageTypeID": 1,
    "AddressInfo": {
        "ID": 89742,
        "Title": "City of Mendota - City Hall",
        "AddressLine1": "643 Quince St",
        "Town": "Mendota",
        "StateOrProvince": "CA",
        "Postcode": "93640",
        "CountryID": 2,
        "Latitude": 36.753933,
        "Longitude": -120.382469,
        "ContactTelephone1": "559-263-8019",
        "AccessComments": "8am-5pm daily; maximum session time of 3 hours",
        "RelatedURL": "",
        "DistanceUnit": 0
    },
    "Connections": [
        {
            "ID": 126787,
            "ConnectionTypeID": 1,
            "LevelID": 2,
            "Amps": 16,
            "Voltage": 230,
            "PowerKW": 3,
            "CurrentTypeID": 10,
            "Quantity": 1
        }
    ],
    "DateLastStatusUpdate": "2019-04-06T04:02:00Z",
    "DataQualityLevel": 3,
    "DateCreated": "2017-06-22T08:16:00Z",
    "SubmissionStatusTypeID": 100
}