{
    "IsRecentlyVerified": false,
    "ID": 185778,
    "UUID": "1A10AD13-0DE9-4374-BB08-074095A16F9D",
    "DataProviderID": 29,
    "DataProvidersReference": "15887",
    "AddressInfo": {
        "ID": 186137,
        "Title": "Am Brichelberg 2",
        "AddressLine1": "Am Brichelberg 2",
        "Town": "Kleinblittersdorf",
        "Postcode": "66271",
        "CountryID": 87,
        "Latitude": 49.167739,
        "Longitude": 7.03324,
        "DistanceUnit": 0
    },
    "Connections": [
        {
            "ID": 296648,
            "ConnectionTypeID": 33,
            "StatusTypeID": 50,
            "LevelID": 3,
            "PowerKW": 22,
            "CurrentTypeID": 30
        },
        {
            "ID": 296649,
            "ConnectionTypeID": 25,
            "StatusTypeID": 50,
            "LevelID": 2,
            "PowerKW": 11,
            "CurrentTypeID": 20
        }
    ],
    "StatusTypeID": 50,
    "DateLastStatusUpdate": "2021-07-12T02:42:00Z",
    "MetadataValues": [
        {
            "ID": 18022,
            "MetadataFieldID": 4,
            "ItemValue": "Data from the German chargepoint registry provided by Bundesnetzagentur.de under the CC-BY 4.0 license"
        }
    ],
    "DataQualityLevel": 3,
    "DateCreated": "2021-07-12T02:42:00Z",
    "SubmissionStatusTypeID": 100
}