{
    "IsRecentlyVerified": false,
    "ID": 68818,
    "UUID": "D90406A8-D93B-41DF-9BC9-21959FEE7F05",
    "DataProviderID": 2,
    "DataProvidersReference": "76502",
    "OperatorID": 5,
    "UsageTypeID": 1,
    "AddressInfo": {
        "ID": 69164,
        "Title": "CITY OF LA",
        "AddressLine1": "15705 Vanowen St",
        "Town": "Los Angeles",
        "StateOrProvince": "CA",
        "Postcode": "91406",
        "CountryID": 2,
        "Latitude": 34.1943972,
        "Longitude": -118.475069,
        "ContactTelephone1": "888-758-4389",
        "AccessComments": "24 hours daily",
        "RelatedURL": "http://www.chargepoint.com/",
        "DistanceUnit": 0
    },
    "Connections": [
        {
            "ID": 96519,
            "ConnectionTypeID": 1,
            "LevelID": 2,
            "Amps": 16,
            "Voltage": 230,
            "PowerKW": 3,
            "CurrentTypeID": 10,
            "Quantity": 1
        }
    ],
    "DateLastStatusUpdate": "2019-04-06T04:02:00Z",
    "DataQualityLevel": 3,
    "DateCreated": "2016-06-25T03:36:00Z",
    "SubmissionStatusTypeID": 100
}