{
    "IsRecentlyVerified": false,
    "ID": 34261,
    "UUID": "DC1D26E4-5CF7-49B2-9871-E724094022D7",
    "DataProviderID": 26,
    "DataProvidersReference": "31219",
    "OperatorID": 157,
    "OperatorsReference": "NewMotion 02005340",
    "UsageCost": "0.00 jaarabonnement",
    "AddressInfo": {
        "ID": 34607,
        "Title": "Paul Krugerstraat 102",
        "AddressLine1": "Paul Krugerstraat 102",
        "Town": "Ridderkerk",
        "Postcode": "2987 BW",
        "CountryID": 159,
        "Latitude": 51.8954544067383,
        "Longitude": 4.57544755935669,
        "ContactTelephone1": "088 0109500",
        "RelatedURL": "http://thenewmotion.nl/",
        "DistanceUnit": 0
    },
    "Connections": [
        {
            "ID": 37772,
            "ConnectionTypeID": 25,
            "LevelID": 2,
            "PowerKW": 3.7,
            "CurrentTypeID": 10
        }
    ],
    "NumberOfPoints": 1,
    "StatusTypeID": 50,
    "DateLastStatusUpdate": "2016-06-04T02:42:00Z",
    "DataQualityLevel": 3,
    "DateCreated": "2015-01-09T06:04:00Z",
    "SubmissionStatusTypeID": 100
}