{
    "IsRecentlyVerified": false,
    "ID": 80374,
    "UUID": "BF2DAD7F-253D-4A32-BD2F-AF40502A935A",
    "DataProviderID": 1,
    "OperatorID": 3267,
    "UsageTypeID": 4,
    "AddressInfo": {
        "ID": 80720,
        "Title": "Duferco Tschoarde",
        "AddressLine1": "Localita' Tschoarde",
        "AddressLine2": "Strada Regionale 44 della Valle del Lys",
        "Town": "Gressoney-Saint-Jean",
        "StateOrProvince": "AO",
        "Postcode": "11025",
        "CountryID": 112,
        "Latitude": 45.7683709436934,
        "Longitude": 7.83368022929789,
        "ContactTelephone1": "800 93 93 00 / +39 010 27 56 01",
        "ContactEmail": "mobility@dueenergie.com",
        "RelatedURL": "http://mobility.dueenergie.com/",
        "DistanceUnit": 0
    },
    "Connections": [
        {
            "ID": 115064,
            "ConnectionTypeID": 25,
            "StatusTypeID": 50,
            "LevelID": 2,
            "Amps": 32,
            "Voltage": 400,
            "PowerKW": 22,
            "CurrentTypeID": 20,
            "Quantity": 2
        }
    ],
    "NumberOfPoints": 2,
    "StatusTypeID": 50,
    "DateLastStatusUpdate": "2017-05-24T15:11:00Z",
    "DataQualityLevel": 1,
    "DateCreated": "2017-01-31T11:28:00Z",
    "SubmissionStatusTypeID": 200
}