{
    "IsRecentlyVerified": false,
    "ID": 71721,
    "UUID": "BA7B61DE-C88A-4998-8758-C0B7839A2A14",
    "DataProviderID": 1,
    "OperatorID": 1,
    "UsageTypeID": 1,
    "AddressInfo": {
        "ID": 72067,
        "Title": "E-Bike Station Zieglauer Steg",
        "AddressLine1": "Bayernstraße",
        "Town": "Trostberg",
        "StateOrProvince": "Landkreis Traunstein",
        "Postcode": "83308",
        "CountryID": 87,
        "Latitude": 48.02772408622916,
        "Longitude": 12.556497217929872,
        "AccessComments": "24/7 nutzbar",
        "DistanceUnit": 0
    },
    "Connections": [
        {
            "ID": 102726,
            "ConnectionTypeID": 28,
            "StatusTypeID": 50,
            "LevelID": 1,
            "Amps": 10,
            "Voltage": 230,
            "PowerKW": 2.3,
            "CurrentTypeID": 10,
            "Quantity": 2
        }
    ],
    "NumberOfPoints": 2,
    "StatusTypeID": 50,
    "DateLastStatusUpdate": "2016-09-05T07:32:00Z",
    "DataQualityLevel": 1,
    "DateCreated": "2016-09-05T07:32:00Z",
    "SubmissionStatusTypeID": 200
}