{
    "IsRecentlyVerified": false,
    "ID": 140499,
    "UUID": "CF2595DD-CAB1-41EB-AEE9-7E709AB5209E",
    "DataProviderID": 2,
    "DataProvidersReference": "104321",
    "OperatorID": 5,
    "UsageTypeID": 1,
    "AddressInfo": {
        "ID": 140851,
        "Title": "DC SOLAR",
        "AddressLine1": "6 Checkered Flag Ln",
        "Town": "Las Vegas",
        "StateOrProvince": "NV",
        "Postcode": "89115",
        "CountryID": 2,
        "Latitude": 36.2755635,
        "Longitude": -115.0150041,
        "ContactTelephone1": "888-758-4389",
        "AccessComments": "24 hours daily",
        "RelatedURL": "http://www.chargepoint.com/",
        "DistanceUnit": 0
    },
    "Connections": [
        {
            "ID": 196142,
            "ConnectionTypeID": 1,
            "LevelID": 2,
            "Amps": 16,
            "Voltage": 230,
            "PowerKW": 3.7,
            "CurrentTypeID": 10,
            "Quantity": 5
        }
    ],
    "StatusTypeID": 50,
    "DateLastStatusUpdate": "2020-06-26T02:58:00Z",
    "DataQualityLevel": 3,
    "DateCreated": "2019-12-24T09:13:00Z",
    "SubmissionStatusTypeID": 100
}