{
    "IsRecentlyVerified": false,
    "ID": 170359,
    "UUID": "E09F64A3-1B78-48BE-88F8-5C3A2571C3D9",
    "DataProviderID": 1,
    "OperatorID": 32,
    "UsageTypeID": 5,
    "UsageCost": "40p - 20p per kWh",
    "AddressInfo": {
        "ID": 170718,
        "Title": "BP Polar",
        "AddressLine1": "43-47 Godstone Rd",
        "AddressLine2": "Warlingham",
        "Town": "Whyteleafe",
        "StateOrProvince": "England",
        "Postcode": "CR3 0EG",
        "CountryID": 1,
        "Latitude": 51.31341182028439,
        "Longitude": -0.08195022308234456,
        "RelatedURL": "https://polar-network.com/",
        "DistanceUnit": 0
    },
    "Connections": [
        {
            "ID": 259857,
            "ConnectionTypeID": 33,
            "StatusTypeID": 50,
            "LevelID": 3,
            "PowerKW": 150,
            "CurrentTypeID": 30,
            "Quantity": 2
        },
        {
            "ID": 259858,
            "ConnectionTypeID": 2,
            "StatusTypeID": 50,
            "LevelID": 3,
            "PowerKW": 50,
            "CurrentTypeID": 30,
            "Quantity": 2
        }
    ],
    "NumberOfPoints": 1,
    "StatusTypeID": 50,
    "DateLastStatusUpdate": "2020-11-24T16:54:00Z",
    "DataQualityLevel": 1,
    "DateCreated": "2020-11-24T16:54:00Z",
    "SubmissionStatusTypeID": 200
}