{
    "IsRecentlyVerified": false,
    "ID": 166774,
    "UUID": "776DE327-10D5-4D29-9D7F-D45E804FB8BE",
    "DataProviderID": 28,
    "DataProvidersReference": "FR*H07*P59574*002",
    "OperatorID": 3409,
    "UsageTypeID": 5,
    "AddressInfo": {
        "ID": 167133,
        "Title": "SOMAIN - Boulevard Louise Michel",
        "AddressLine1": "Boulevard Louise Michel 59490 SOMAIN",
        "CountryID": 80,
        "Latitude": 50.34763,
        "Longitude": 3.284205,
        "AccessComments": "24h/24 7j/7",
        "DistanceUnit": 0
    },
    "Connections": [
        {
            "ID": 252000,
            "ConnectionTypeID": 28,
            "StatusTypeID": 50,
            "LevelID": 2,
            "PowerKW": 22,
            "CurrentTypeID": 10
        },
        {
            "ID": 252001,
            "ConnectionTypeID": 1036,
            "StatusTypeID": 50,
            "LevelID": 2,
            "PowerKW": 22,
            "CurrentTypeID": 20
        }
    ],
    "GeneralComments": "Recharge par badge et avec une application smartphone",
    "StatusTypeID": 50,
    "DateLastStatusUpdate": "2020-08-27T05:16:00Z",
    "DataQualityLevel": 2,
    "DateCreated": "2020-08-27T05:16:00Z",
    "SubmissionStatusTypeID": 100
}