{
    "IsRecentlyVerified": false,
    "ID": 105431,
    "UUID": "389C042B-DF2A-4860-81DC-B2488AE730B0",
    "DataProviderID": 1,
    "OperatorID": 1,
    "UsageTypeID": 1,
    "AddressInfo": {
        "ID": 105777,
        "Title": "Hülsenbusch ",
        "AddressLine1": "Otto-Gebühr-Platz 6",
        "Town": "Gummersbach",
        "StateOrProvince": "Oberbergischer Kreis",
        "Postcode": "51647",
        "CountryID": 87,
        "Latitude": 51.03511144192019,
        "Longitude": 7.495229153442324,
        "AccessComments": "Am Marktplatz links ist neben den Sitzbänken mit Tisch eine graue Ladesäule, die kostenlos nutzbar ist. Einfach einstecken! Betreiber ist die Aggerenergie",
        "DistanceUnit": 0
    },
    "Connections": [
        {
            "ID": 148598,
            "ConnectionTypeID": 25,
            "StatusTypeID": 50,
            "LevelID": 2,
            "Amps": 16,
            "Voltage": 400,
            "PowerKW": 11,
            "CurrentTypeID": 20,
            "Quantity": 1
        }
    ],
    "NumberOfPoints": 1,
    "StatusTypeID": 50,
    "DateLastStatusUpdate": "2018-06-06T06:47:00Z",
    "DataQualityLevel": 1,
    "DateCreated": "2018-06-06T06:47:00Z",
    "SubmissionStatusTypeID": 200
}