{
    "IsRecentlyVerified": false,
    "ID": 31436,
    "UUID": "1C7A8AED-6E8A-4385-BCC9-97443F2C2FF2",
    "DataProviderID": 26,
    "DataProvidersReference": "57000",
    "OperatorID": 78,
    "OperatorsReference": "Essent EM-MT-00000030-01-00001",
    "UsageCost": "0.00 jaarabonnement",
    "AddressInfo": {
        "ID": 31782,
        "Title": "Triq Salvinu Vella",
        "AddressLine1": "Triq Salvinu Vella",
        "Town": "Mellieha",
        "Postcode": "MLH1022",
        "CountryID": 140,
        "Latitude": 35.961086,
        "Longitude": 14.360597,
        "RelatedURL": "http://www.essent.nl",
        "DistanceUnit": 0
    },
    "Connections": [
        {
            "ID": 34947,
            "ConnectionTypeID": 25,
            "LevelID": 2,
            "PowerKW": 11,
            "CurrentTypeID": 10
        },
        {
            "ID": 45869,
            "ConnectionTypeID": 25,
            "LevelID": 2,
            "PowerKW": 11,
            "CurrentTypeID": 10
        }
    ],
    "NumberOfPoints": 1,
    "StatusTypeID": 50,
    "DateLastStatusUpdate": "2016-06-04T02:37:00Z",
    "DataQualityLevel": 3,
    "DateCreated": "2015-01-09T06:03:00Z",
    "SubmissionStatusTypeID": 100
}