{
    "IsRecentlyVerified": false,
    "ID": 43396,
    "UUID": "3536234B-B0CC-4971-A5A5-3D99DB6CD60F",
    "DataProviderID": 1,
    "OperatorID": 45,
    "UsageTypeID": 5,
    "UsageCost": "0,50€/kWh",
    "AddressInfo": {
        "ID": 43742,
        "Title": "Parkplatz Flügeldeich",
        "AddressLine1": "Herrenweg",
        "AddressLine2": "Ecke Alter Flügeldeich",
        "Town": "Dormagen",
        "StateOrProvince": "Rhein-Kreis Neuss",
        "Postcode": "41541",
        "CountryID": 87,
        "Latitude": 51.1255492837731,
        "Longitude": 6.84941564536679,
        "AccessComments": "Gebührenpflichtiger Parkplatz für PKW und 3 Wohnmobile. Stromsäule kostet 0,50€/kWh.",
        "RelatedURL": "http://www.dormagen.de",
        "DistanceUnit": 0
    },
    "Connections": [
        {
            "ID": 52594,
            "ConnectionTypeID": 16,
            "StatusTypeID": 50,
            "LevelID": 2,
            "Amps": 16,
            "Voltage": 230,
            "PowerKW": 3.7,
            "CurrentTypeID": 10,
            "Quantity": 3
        }
    ],
    "NumberOfPoints": 3,
    "StatusTypeID": 50,
    "DateLastStatusUpdate": "2015-03-30T07:04:00Z",
    "DataQualityLevel": 1,
    "DateCreated": "2015-03-29T15:22:00Z",
    "SubmissionStatusTypeID": 200
}