{
    "IsRecentlyVerified": false,
    "ID": 114837,
    "UUID": "1982A9DE-E6CC-427E-A4B6-05E3A819FE73",
    "DataProviderID": 1,
    "OperatorID": 32,
    "OperatorsReference": "11379,11380",
    "UsageTypeID": 4,
    "UsageCost": "£0.108/kWh; for Polar Plus subscription members only",
    "AddressInfo": {
        "ID": 115183,
        "Title": "Allhallows Car Park",
        "AddressLine1": "Allhallows Car Park",
        "Town": "Brace Street",
        "StateOrProvince": "Bedford",
        "Postcode": "MK40 1LX",
        "CountryID": 1,
        "Latitude": 52.13818,
        "Longitude": -0.471703,
        "DistanceUnit": 0
    },
    "Connections": [
        {
            "ID": 161605,
            "ConnectionTypeID": 25,
            "StatusTypeID": 50,
            "LevelID": 2,
            "Amps": 32,
            "Voltage": 230,
            "PowerKW": 7,
            "CurrentTypeID": 10,
            "Quantity": 4
        }
    ],
    "NumberOfPoints": 4,
    "GeneralComments": "Unit located in the multistory car park.",
    "StatusTypeID": 50,
    "DateLastStatusUpdate": "2019-03-08T06:38:00Z",
    "DataQualityLevel": 1,
    "DateCreated": "2019-01-17T06:15:00Z",
    "SubmissionStatusTypeID": 200
}