{
    "IsRecentlyVerified": false,
    "ID": 184096,
    "UUID": "30C57198-45BD-4000-8BE0-3197497B2D66",
    "DataProviderID": 29,
    "DataProvidersReference": "15722",
    "AddressInfo": {
        "ID": 184455,
        "Title": "Gewerbegebiet Bärndorf 4",
        "AddressLine1": "Gewerbegebiet Bärndorf 4",
        "Town": "Bogen",
        "Postcode": "94327",
        "CountryID": 87,
        "Latitude": 48.917258,
        "Longitude": 12.731573,
        "DistanceUnit": 0
    },
    "Connections": [
        {
            "ID": 291893,
            "ConnectionTypeID": 25,
            "StatusTypeID": 50,
            "LevelID": 2,
            "PowerKW": 22,
            "CurrentTypeID": 20
        },
        {
            "ID": 291894,
            "ConnectionTypeID": 25,
            "StatusTypeID": 50,
            "LevelID": 2,
            "PowerKW": 22,
            "CurrentTypeID": 20
        }
    ],
    "StatusTypeID": 50,
    "DateLastStatusUpdate": "2021-07-12T02:42:00Z",
    "MetadataValues": [
        {
            "ID": 16388,
            "MetadataFieldID": 4,
            "ItemValue": "Data from the German chargepoint registry provided by Bundesnetzagentur.de under the CC-BY 4.0 license"
        }
    ],
    "DataQualityLevel": 3,
    "DateCreated": "2021-07-08T10:05:00Z",
    "SubmissionStatusTypeID": 100
}