{
    "MediaItems": [
        {
            "ID": 23229,
            "ChargePointID": 161138,
            "ItemURL": "https://s3-ap-southeast-2.amazonaws.com/openchargemap/images/UA/OCM161138/OCM-161138.orig.2020072714223892.jpg",
            "ItemThumbnailURL": "https://s3-ap-southeast-2.amazonaws.com/openchargemap/images/UA/OCM161138/OCM-161138.thmb.2020072714223892.jpg",
            "Comment": "",
            "IsEnabled": true,
            "IsVideo": false,
            "IsFeaturedItem": false,
            "IsExternalResource": false,
            "User": {
                "ID": 26318,
                "Username": "EugeneUA"
            },
            "DateCreated": "2020-07-27T14:23:00Z"
        }
    ],
    "IsRecentlyVerified": false,
    "ID": 161138,
    "UUID": "8E60F86F-AF2E-4A70-86FF-2C1D0660B2F6",
    "DataProviderID": 1,
    "OperatorID": 3390,
    "UsageTypeID": 4,
    "AddressInfo": {
        "ID": 161495,
        "Title": "Mykoly Bazhana Avenue",
        "AddressLine1": "Mykoly Bazhana Avenue",
        "Town": "Kyiv",
        "StateOrProvince": "",
        "Postcode": "02140",
        "CountryID": 234,
        "Latitude": 50.39731898527424,
        "Longitude": 30.631646348925415,
        "RelatedURL": "https://quickpower.net",
        "DistanceUnit": 0
    },
    "Connections": [
        {
            "ID": 231849,
            "ConnectionTypeID": 33,
            "StatusTypeID": 50,
            "LevelID": 3,
            "PowerKW": 50,
            "CurrentTypeID": 30,
            "Quantity": 1
        },
        {
            "ID": 231850,
            "ConnectionTypeID": 25,
            "StatusTypeID": 50,
            "LevelID": 2,
            "Amps": 32,
            "Voltage": 400,
            "PowerKW": 22,
            "CurrentTypeID": 20,
            "Quantity": 1
        },
        {
            "ID": 231851,
            "ConnectionTypeID": 2,
            "StatusTypeID": 50,
            "LevelID": 3,
            "PowerKW": 50,
            "CurrentTypeID": 30,
            "Quantity": 1
        }
    ],
    "NumberOfPoints": 1,
    "StatusTypeID": 50,
    "DateLastStatusUpdate": "2020-07-27T14:34:00Z",
    "DataQualityLevel": 1,
    "DateCreated": "2020-07-04T20:17:00Z",
    "SubmissionStatusTypeID": 200
}