{
    "IsRecentlyVerified": false,
    "ID": 142933,
    "UUID": "5745A943-3B55-4488-9D03-6B81D2999126",
    "DataProviderID": 2,
    "DataProvidersReference": "93379",
    "OperatorID": 15,
    "UsageTypeID": 4,
    "AddressInfo": {
        "ID": 143285,
        "Title": "CVS Pharmacy",
        "AddressLine1": "7568 N Broadway",
        "Town": "Red Hook",
        "StateOrProvince": "NY",
        "Postcode": "12571",
        "CountryID": 2,
        "Latitude": 41.997812,
        "Longitude": -73.87331,
        "ContactTelephone1": "877-455-3833",
        "AccessComments": "24 hours daily\r\nPublic - Card key at all times",
        "RelatedURL": "https://www.evgo.com/",
        "DistanceUnit": 0
    },
    "Connections": [
        {
            "ID": 199167,
            "ConnectionTypeID": 2,
            "LevelID": 3,
            "Amps": 100,
            "Voltage": 400,
            "PowerKW": 40,
            "CurrentTypeID": 30,
            "Quantity": 1
        },
        {
            "ID": 199168,
            "ConnectionTypeID": 32,
            "LevelID": 3,
            "Amps": 100,
            "Voltage": 400,
            "PowerKW": 40,
            "CurrentTypeID": 30,
            "Quantity": 1
        }
    ],
    "StatusTypeID": 50,
    "DateLastStatusUpdate": "2020-06-26T03:05:00Z",
    "DataQualityLevel": 3,
    "DateCreated": "2019-12-24T09:19:00Z",
    "SubmissionStatusTypeID": 100
}