{
    "IsRecentlyVerified": false,
    "ID": 84711,
    "UUID": "FA29AF2C-7920-427A-AFCE-0A106743F9F3",
    "DataProviderID": 1,
    "OperatorID": 220,
    "OperatorsReference": "4514,4514,4515",
    "UsageTypeID": 4,
    "UsageCost": "€1.73 + €0.3213/kWh; Andere Tarife möglich",
    "AddressInfo": {
        "ID": 85057,
        "Title": "Lutterothstraße",
        "AddressLine1": "Lutterothstraße 21",
        "AddressLine2": "Eimsbüttel",
        "Town": "Hamburg",
        "StateOrProvince": "Hamburg",
        "Postcode": "20255",
        "CountryID": 87,
        "Latitude": 53.58011,
        "Longitude": 9.954849999999965,
        "AccessComments": "24/7 nutzbar",
        "DistanceUnit": 0
    },
    "Connections": [
        {
            "ID": 120329,
            "ConnectionTypeID": 25,
            "StatusTypeID": 50,
            "LevelID": 2,
            "Amps": 32,
            "Voltage": 400,
            "PowerKW": 22,
            "CurrentTypeID": 20,
            "Quantity": 2
        },
        {
            "ID": 120330,
            "ConnectionTypeID": 28,
            "StatusTypeID": 50,
            "LevelID": 2,
            "Amps": 16,
            "Voltage": 230,
            "PowerKW": 3.7,
            "CurrentTypeID": 10,
            "Quantity": 2
        }
    ],
    "NumberOfPoints": 4,
    "StatusTypeID": 50,
    "DateLastStatusUpdate": "2017-04-20T22:52:00Z",
    "DataQualityLevel": 1,
    "DateCreated": "2017-03-10T06:59:00Z",
    "SubmissionStatusTypeID": 200
}