{
    "IsRecentlyVerified": false,
    "ID": 24489,
    "UUID": "692C4CB4-AD3B-4D82-925A-0CD7055A045C",
    "DataProviderID": 1,
    "OperatorID": 22,
    "OperatorsReference": "C5LWL",
    "UsageTypeID": 4,
    "UsageCost": "Free",
    "AddressInfo": {
        "ID": 24835,
        "Title": "Tobin's Service Station",
        "AddressLine1": "Port Road",
        "AddressLine2": "Gortlee",
        "Town": "Letterkenny",
        "StateOrProvince": "County Donegal",
        "Postcode": "F92 PD92",
        "CountryID": 3,
        "Latitude": 54.952297,
        "Longitude": -7.725607,
        "DistanceUnit": 0
    },
    "Connections": [
        {
            "ID": 26697,
            "ConnectionTypeID": 2,
            "StatusTypeID": 50,
            "LevelID": 3,
            "Amps": 100,
            "Voltage": 480,
            "PowerKW": 50,
            "CurrentTypeID": 30,
            "Quantity": 1
        },
        {
            "ID": 26698,
            "ConnectionTypeID": 1036,
            "StatusTypeID": 50,
            "LevelID": 3,
            "Amps": 63,
            "Voltage": 400,
            "PowerKW": 43,
            "CurrentTypeID": 20,
            "Quantity": 1
        },
        {
            "ID": 161927,
            "ConnectionTypeID": 33,
            "StatusTypeID": 50,
            "LevelID": 3,
            "Amps": 100,
            "Voltage": 480,
            "PowerKW": 50,
            "CurrentTypeID": 30,
            "Quantity": 1
        }
    ],
    "NumberOfPoints": 4,
    "StatusTypeID": 50,
    "DateLastStatusUpdate": "2019-06-03T09:36:00Z",
    "DataQualityLevel": 1,
    "DateCreated": "2014-09-23T14:37:00Z",
    "SubmissionStatusTypeID": 200
}