{
    "IsRecentlyVerified": false,
    "ID": 90358,
    "UUID": "74C9A996-58C2-417F-A1B3-7B9FFA0F1B33",
    "DataProviderID": 1,
    "OperatorID": 23,
    "OperatorsReference": "31520",
    "UsageTypeID": 7,
    "AddressInfo": {
        "ID": 90704,
        "Title": "Strand- Og Badehotel Marienlyst",
        "AddressLine1": "NDR. Strandvej 2",
        "Town": "Helsingør",
        "Postcode": "3000",
        "CountryID": 65,
        "Latitude": 56.045327,
        "Longitude": 12.603641,
        "ContactTelephone1": "+45 49 21 40 00",
        "DistanceUnit": 0
    },
    "Connections": [
        {
            "ID": 128011,
            "ConnectionTypeID": 30,
            "StatusTypeID": 50,
            "LevelID": 2,
            "Amps": 16,
            "Voltage": 400,
            "PowerKW": 11,
            "CurrentTypeID": 20,
            "Quantity": 2
        }
    ],
    "NumberOfPoints": 2,
    "GeneralComments": "2 Tesla Connectors, up to 11kW.Available by reservation only. Please see front desk.",
    "StatusTypeID": 50,
    "DateLastStatusUpdate": "2018-10-03T17:17:00Z",
    "DataQualityLevel": 1,
    "DateCreated": "2017-07-13T14:58:00Z",
    "SubmissionStatusTypeID": 200
}