{
    "IsRecentlyVerified": false,
    "ID": 178875,
    "UUID": "BD7756F7-31DC-4797-B3FE-68D258B02F52",
    "DataProviderID": 29,
    "DataProvidersReference": "11100,1869",
    "OperatorID": 45,
    "AddressInfo": {
        "ID": 179234,
        "Title": "Mörscherstr.3",
        "AddressLine1": "Mörscherstr.3",
        "Town": "Ettlingen",
        "Postcode": "76275",
        "CountryID": 87,
        "Latitude": 48.94782,
        "Longitude": 8.38139,
        "DistanceUnit": 0
    },
    "Connections": [
        {
            "ID": 279874,
            "ConnectionTypeID": 25,
            "StatusTypeID": 50,
            "LevelID": 2,
            "PowerKW": 11,
            "CurrentTypeID": 20
        },
        {
            "ID": 279875,
            "ConnectionTypeID": 33,
            "StatusTypeID": 50,
            "LevelID": 3,
            "PowerKW": 22,
            "CurrentTypeID": 30
        },
        {
            "ID": 279876,
            "ConnectionTypeID": 25,
            "StatusTypeID": 50,
            "LevelID": 2,
            "PowerKW": 11,
            "CurrentTypeID": 20
        },
        {
            "ID": 279877,
            "ConnectionTypeID": 33,
            "StatusTypeID": 50,
            "LevelID": 3,
            "PowerKW": 22,
            "CurrentTypeID": 30
        }
    ],
    "StatusTypeID": 50,
    "DateLastStatusUpdate": "2021-07-09T03:14:00Z",
    "MetadataValues": [
        {
            "ID": 11169,
            "MetadataFieldID": 4,
            "ItemValue": "Data from the German chargepoint registry provided by Bundesnetzagentur.de under the CC-BY 4.0 license"
        }
    ],
    "DataQualityLevel": 3,
    "DateCreated": "2021-07-08T09:58:00Z",
    "SubmissionStatusTypeID": 100
}