{
    "IsRecentlyVerified": false,
    "ID": 140463,
    "UUID": "C83C2C5A-F84A-44C1-88E2-B88497F5DF11",
    "DataProviderID": 2,
    "DataProvidersReference": "95916",
    "OperatorID": 9,
    "UsageTypeID": 1,
    "AddressInfo": {
        "ID": 140815,
        "Title": "The Gulch",
        "AddressLine1": "1101 McGavock Street",
        "Town": "Nashville",
        "StateOrProvince": "TN",
        "Postcode": "37203",
        "CountryID": 2,
        "Latitude": 36.1552,
        "Longitude": -86.7858,
        "ContactTelephone1": "888-998-2546",
        "AccessComments": "MON: 24 hours | TUE: 24 hours | WED: 24 hours | THU: 24 hours | FRI: 24 hours | SAT: 24 hours | SUN: 24 hours",
        "RelatedURL": "http://www.blinkcharging.com/",
        "DistanceUnit": 0
    },
    "Connections": [
        {
            "ID": 196097,
            "ConnectionTypeID": 1,
            "LevelID": 2,
            "Amps": 16,
            "Voltage": 230,
            "PowerKW": 3,
            "CurrentTypeID": 10,
            "Quantity": 1
        }
    ],
    "StatusTypeID": 50,
    "DateLastStatusUpdate": "2019-12-24T09:13:00Z",
    "DataQualityLevel": 3,
    "DateCreated": "2019-12-24T09:13:00Z",
    "SubmissionStatusTypeID": 100
}