{
    "IsRecentlyVerified": false,
    "ID": 140562,
    "UUID": "815C657F-AC28-40D9-9D6E-BC22B7982628",
    "DataProviderID": 2,
    "DataProvidersReference": "117491",
    "UsageTypeID": 1,
    "AddressInfo": {
        "ID": 140914,
        "Title": "Courtyard - Greenbrier Chesapeake",
        "AddressLine1": "1562 Crossways Blvd",
        "Town": "Chesapeake",
        "StateOrProvince": "VA",
        "Postcode": "23320",
        "CountryID": 2,
        "Latitude": 36.781444,
        "Longitude": -76.236776,
        "ContactTelephone1": "757-420-1700",
        "AccessComments": "24 hours daily",
        "RelatedURL": "",
        "DistanceUnit": 0
    },
    "Connections": [
        {
            "ID": 196223,
            "ConnectionTypeID": 2,
            "LevelID": 3,
            "Amps": 100,
            "Voltage": 400,
            "PowerKW": 40,
            "CurrentTypeID": 30,
            "Quantity": 1
        },
        {
            "ID": 196224,
            "ConnectionTypeID": 32,
            "LevelID": 3,
            "Amps": 100,
            "Voltage": 400,
            "PowerKW": 40,
            "CurrentTypeID": 30,
            "Quantity": 1
        }
    ],
    "StatusTypeID": 50,
    "DateLastStatusUpdate": "2020-06-26T02:58:00Z",
    "DataQualityLevel": 3,
    "DateCreated": "2019-12-24T09:13:00Z",
    "SubmissionStatusTypeID": 100
}