{
    "IsRecentlyVerified": false,
    "ID": 183155,
    "UUID": "C5C9A9EC-9F34-46F8-AB9F-AF9DF68DA26D",
    "DataProviderID": 29,
    "DataProvidersReference": "11349",
    "AddressInfo": {
        "ID": 183514,
        "Title": "Rheinstraße 2",
        "AddressLine1": "Rheinstraße 2",
        "Town": "Völklingen",
        "Postcode": "66333",
        "CountryID": 87,
        "Latitude": 49.255342,
        "Longitude": 6.878255,
        "DistanceUnit": 0
    },
    "Connections": [
        {
            "ID": 289785,
            "ConnectionTypeID": 25,
            "StatusTypeID": 50,
            "LevelID": 2,
            "PowerKW": 22,
            "CurrentTypeID": 20
        },
        {
            "ID": 289786,
            "ConnectionTypeID": 1036,
            "StatusTypeID": 50,
            "LevelID": 2,
            "PowerKW": 22,
            "CurrentTypeID": 20
        },
        {
            "ID": 296806,
            "ConnectionTypeID": 25,
            "StatusTypeID": 50,
            "LevelID": 2,
            "PowerKW": 22,
            "CurrentTypeID": 20
        },
        {
            "ID": 296807,
            "ConnectionTypeID": 1036,
            "StatusTypeID": 50,
            "LevelID": 2,
            "PowerKW": 22,
            "CurrentTypeID": 20
        }
    ],
    "StatusTypeID": 50,
    "DateLastStatusUpdate": "2021-07-12T02:43:00Z",
    "MetadataValues": [
        {
            "ID": 15448,
            "MetadataFieldID": 4,
            "ItemValue": "Data from the German chargepoint registry provided by Bundesnetzagentur.de under the CC-BY 4.0 license"
        }
    ],
    "DataQualityLevel": 3,
    "DateCreated": "2021-07-08T10:03:00Z",
    "SubmissionStatusTypeID": 100
}