{
    "IsRecentlyVerified": false,
    "ID": 186848,
    "UUID": "E5055FF4-ACC1-4F72-BB23-FC839427D9DD",
    "DataProviderID": 29,
    "DataProvidersReference": "13606",
    "OperatorID": 86,
    "AddressInfo": {
        "ID": 187207,
        "Title": "Johann-Gottlob-Nathusius-Str. 1",
        "AddressLine1": "Johann-Gottlob-Nathusius-Str. 1",
        "Town": "Haldensleben",
        "Postcode": "39340",
        "CountryID": 87,
        "Latitude": 52.280536,
        "Longitude": 11.432801,
        "DistanceUnit": 0
    },
    "Connections": [
        {
            "ID": 300359,
            "ConnectionTypeID": 1036,
            "StatusTypeID": 50,
            "LevelID": 3,
            "PowerKW": 43,
            "CurrentTypeID": 20
        },
        {
            "ID": 300360,
            "ConnectionTypeID": 33,
            "StatusTypeID": 50,
            "LevelID": 3,
            "PowerKW": 50,
            "CurrentTypeID": 30
        },
        {
            "ID": 300361,
            "ConnectionTypeID": 2,
            "StatusTypeID": 50,
            "LevelID": 3,
            "PowerKW": 50,
            "CurrentTypeID": 30
        }
    ],
    "StatusTypeID": 50,
    "DateLastStatusUpdate": "2021-07-12T02:49:00Z",
    "MetadataValues": [
        {
            "ID": 19089,
            "MetadataFieldID": 4,
            "ItemValue": "Data from the German chargepoint registry provided by Bundesnetzagentur.de under the CC-BY 4.0 license"
        }
    ],
    "DataQualityLevel": 3,
    "DateCreated": "2021-07-12T02:49:00Z",
    "SubmissionStatusTypeID": 100
}