{
    "IsRecentlyVerified": false,
    "ID": 115777,
    "UUID": "70B8EE75-0694-4CDD-851C-3B46057E6380",
    "DataProviderID": 2,
    "DataProvidersReference": "105428",
    "OperatorID": 5,
    "UsageTypeID": 1,
    "AddressInfo": {
        "ID": 116123,
        "Title": "601 N. CALVERT",
        "AddressLine1": "601 N Calvert Street",
        "Town": "Baltimore",
        "StateOrProvince": "MD",
        "Postcode": "21202",
        "CountryID": 2,
        "Latitude": 39.296698,
        "Longitude": -76.612577,
        "ContactTelephone1": "888-758-4389",
        "AccessComments": "24 hours daily",
        "RelatedURL": "http://www.chargepoint.com/",
        "DistanceUnit": 0
    },
    "Connections": [
        {
            "ID": 162814,
            "ConnectionTypeID": 1,
            "LevelID": 2,
            "Amps": 16,
            "Voltage": 230,
            "PowerKW": 3.7,
            "CurrentTypeID": 10,
            "Quantity": 4
        }
    ],
    "DateLastStatusUpdate": "2020-06-26T03:01:00Z",
    "DataQualityLevel": 3,
    "DateCreated": "2019-02-11T07:13:00Z",
    "SubmissionStatusTypeID": 100
}