{
    "IsRecentlyVerified": false,
    "ID": 115784,
    "UUID": "9C522F48-96BF-4E8C-A9A8-4B2444FB0A3B",
    "DataProviderID": 2,
    "DataProvidersReference": "113486",
    "OperatorID": 23,
    "UsageTypeID": 2,
    "AddressInfo": {
        "ID": 116130,
        "Title": "Airbnb - Donner Cabin - Tesla Destination",
        "AddressLine1": "14050 Hansel Ave",
        "Town": "Truckee",
        "StateOrProvince": "CA",
        "Postcode": "96161",
        "CountryID": 2,
        "Latitude": 39.356045,
        "Longitude": -120.222604,
        "ContactTelephone1": "",
        "AccessComments": "Available for Airbnb patrons only; for Tesla use only",
        "RelatedURL": "https://www.tesla.com/destination-charging",
        "DistanceUnit": 0
    },
    "Connections": [
        {
            "ID": 162821,
            "ConnectionTypeID": 0,
            "LevelID": 2,
            "Amps": 16,
            "Voltage": 230,
            "PowerKW": 3,
            "CurrentTypeID": 10,
            "Quantity": 1
        }
    ],
    "DateLastStatusUpdate": "2019-04-06T05:04:00Z",
    "DataQualityLevel": 3,
    "DateCreated": "2019-02-11T07:13:00Z",
    "SubmissionStatusTypeID": 100
}