{
    "IsRecentlyVerified": false,
    "ID": 107669,
    "UUID": "564DBB3D-4392-44F5-B500-E5D5BA29CB53",
    "DataProviderID": 1,
    "OperatorID": 1,
    "UsageTypeID": 6,
    "UsageCost": "Gratuito",
    "AddressInfo": {
        "ID": 108015,
        "Title": "Hotel Sant'Anna del Volterraio ",
        "AddressLine1": "Località Bagnaia",
        "Town": "Portoferraio",
        "StateOrProvince": "Livorno",
        "Postcode": "57037",
        "CountryID": 112,
        "Latitude": 42.8107251920791,
        "Longitude": 10.3686524693115,
        "ContactTelephone1": "00390565961236",
        "ContactEmail": "info@volterraio.it",
        "RelatedURL": "http://www.volterraio.it/",
        "DistanceUnit": 0
    },
    "Connections": [],
    "NumberOfPoints": 1,
    "StatusTypeID": 50,
    "DateLastStatusUpdate": "2018-08-06T14:49:00Z",
    "DataQualityLevel": 1,
    "DateCreated": "2018-08-06T10:08:00Z",
    "SubmissionStatusTypeID": 200
}