{
    "UserComments": [
        {
            "ID": 23782,
            "ChargePointID": 172051,
            "CommentTypeID": 10,
            "UserName": "ForumElettrico.it",
            "Comment": "Comode per una lunga sosta in occasione di visita al centro città. Leggi la recensione completa qui >  https://www.forumelettrico.it/forum/colonnine-enelx-a-viterbo-citta-t9345.html",
            "RelatedURL": "https://www.forumelettrico.it/forum/colonnine-enelx-a-viterbo-citta-t9345.html",
            "DateCreated": "2021-01-13T11:15:36.387Z",
            "User": {
                "ID": 11749,
                "Username": "ForumElettrico.it"
            },
            "CheckinStatusTypeID": 10,
            "IsActionedByEditor": false
        }
    ],
    "MediaItems": [
        {
            "ID": 26181,
            "ChargePointID": 172051,
            "ItemURL": "https://s3-ap-southeast-2.amazonaws.com/openchargemap/images/IT/OCM172051/OCM-172051.orig.2021011311154547.jpg",
            "ItemThumbnailURL": "https://s3-ap-southeast-2.amazonaws.com/openchargemap/images/IT/OCM172051/OCM-172051.thmb.2021011311154547.jpg",
            "Comment": "",
            "IsEnabled": true,
            "IsVideo": false,
            "IsFeaturedItem": false,
            "IsExternalResource": false,
            "User": {
                "ID": 11749,
                "Username": "ForumElettrico.it"
            },
            "DateCreated": "2021-01-13T11:16:00Z"
        },
        {
            "ID": 26182,
            "ChargePointID": 172051,
            "ItemURL": "https://s3-ap-southeast-2.amazonaws.com/openchargemap/images/IT/OCM172051/OCM-172051.orig.2021011311155134.jpg",
            "ItemThumbnailURL": "https://s3-ap-southeast-2.amazonaws.com/openchargemap/images/IT/OCM172051/OCM-172051.thmb.2021011311155134.jpg",
            "Comment": "",
            "IsEnabled": true,
            "IsVideo": false,
            "IsFeaturedItem": false,
            "IsExternalResource": false,
            "User": {
                "ID": 11749,
                "Username": "ForumElettrico.it"
            },
            "DateCreated": "2021-01-13T11:16:00Z"
        }
    ],
    "IsRecentlyVerified": false,
    "ID": 172051,
    "UUID": "4D6DF83C-85FE-42D9-861C-C777A3E8ADFE",
    "DataProviderID": 1,
    "OperatorID": 80,
    "UsageTypeID": 4,
    "AddressInfo": {
        "ID": 172410,
        "Title": "Viterbo Parcheggio del Sacrario | EnelX ",
        "AddressLine1": "Piazza Martiri d'Ungheria",
        "Town": "Viterbo",
        "StateOrProvince": "VT",
        "Postcode": "01100",
        "CountryID": 112,
        "Latitude": 42.417927,
        "Longitude": 12.101368,
        "RelatedURL": "https://www.forumelettrico.it/forum/colonnine-enelx-a-viterbo-citta-t9345.html",
        "DistanceUnit": 0
    },
    "Connections": [
        {
            "ID": 262973,
            "ConnectionTypeID": 25,
            "StatusTypeID": 50,
            "LevelID": 2,
            "Amps": 32,
            "Voltage": 400,
            "PowerKW": 22,
            "CurrentTypeID": 20,
            "Quantity": 2
        },
        {
            "ID": 262974,
            "ConnectionTypeID": 36,
            "StatusTypeID": 50,
            "LevelID": 2,
            "Amps": 16,
            "Voltage": 400,
            "PowerKW": 3,
            "CurrentTypeID": 20,
            "Quantity": 2
        }
    ],
    "NumberOfPoints": 4,
    "StatusTypeID": 50,
    "DateLastStatusUpdate": "2021-01-15T11:21:00Z",
    "DataQualityLevel": 1,
    "DateCreated": "2021-01-13T11:15:00Z",
    "SubmissionStatusTypeID": 200
}