{
    "IsRecentlyVerified": false,
    "ID": 150063,
    "UUID": "04CAA025-BEFF-4636-B3A6-2987DF5324C9",
    "DataProviderID": 18,
    "DataProvidersReference": "39bd515b8dce9d0de8565f8f6bc0463a",
    "OperatorID": 3391,
    "UsageTypeID": 1,
    "AddressInfo": {
        "ID": 150416,
        "Title": "Coleridge Street",
        "AddressLine1": "Coleridge Street",
        "Town": "Brighton",
        "Postcode": "BN3 5AB",
        "CountryID": 1,
        "Latitude": 50.834967,
        "Longitude": -0.178782,
        "AccessComments": "",
        "RelatedURL": "https://www.electricblueuk.com/",
        "DistanceUnit": 0
    },
    "Connections": [
        {
            "ID": 208349,
            "ConnectionTypeID": 25,
            "Reference": "62196-2 (SINGLE PHASE)",
            "StatusTypeID": 50,
            "LevelID": 2,
            "Amps": 16,
            "Voltage": 230,
            "PowerKW": 3.7,
            "CurrentTypeID": 10
        }
    ],
    "StatusTypeID": 0,
    "DateLastStatusUpdate": "2020-03-17T08:53:00Z",
    "MetadataValues": [
        {
            "ID": 7090,
            "MetadataFieldID": 4,
            "ItemValue": "Contains public sector information licensed under the Open Government Licence v2.0. http://www.nationalarchives.gov.uk/doc/open-government-licence/version/2/"
        }
    ],
    "DataQualityLevel": 3,
    "DateCreated": "2020-03-12T15:48:00Z",
    "SubmissionStatusTypeID": 100
}