{
    "IsRecentlyVerified": false,
    "ID": 109094,
    "UUID": "8964BBF9-5F62-49C1-90EF-5DC6667DC710",
    "DataProviderID": 1,
    "OperatorID": 23,
    "OperatorsReference": "44751",
    "UsageTypeID": 4,
    "AddressInfo": {
        "ID": 109440,
        "Title": "Hotel Arcade",
        "AddressLine1": "Luzernerestr. 31",
        "Town": "Sins",
        "Postcode": "5643",
        "CountryID": 217,
        "Latitude": 47.187403,
        "Longitude": 8.396723,
        "ContactTelephone1": " +41 7897 878",
        "DistanceUnit": 0
    },
    "Connections": [
        {
            "ID": 154212,
            "ConnectionTypeID": 30,
            "StatusTypeID": 50,
            "LevelID": 2,
            "Amps": 16,
            "Voltage": 400,
            "PowerKW": 11,
            "CurrentTypeID": 20,
            "Quantity": 1
        }
    ],
    "NumberOfPoints": 1,
    "GeneralComments": "1 Tesla Connector, up to 11kW.Available for customers. Please see front desk.",
    "StatusTypeID": 50,
    "DateLastStatusUpdate": "2018-10-11T13:35:00Z",
    "DataQualityLevel": 1,
    "DateCreated": "2018-10-11T13:35:00Z",
    "SubmissionStatusTypeID": 200
}