{
    "IsRecentlyVerified": false,
    "ID": 152729,
    "UUID": "9BAE40BA-C542-4DE9-99C2-B41320F1FEEA",
    "DataProviderID": 28,
    "DataProvidersReference": "FR*S41*P41059-21",
    "UsageTypeID": 5,
    "AddressInfo": {
        "ID": 153082,
        "Title": "Contres | Route de Pontlevoy",
        "AddressLine1": "Route de Pontlevoy 41700 Le Controis-en-Sologne",
        "CountryID": 80,
        "Latitude": 47.41835,
        "Longitude": 1.425003,
        "AccessComments": "24/24 7/7",
        "DistanceUnit": 0
    },
    "Connections": [
        {
            "ID": 213933,
            "ConnectionTypeID": 25,
            "StatusTypeID": 50,
            "LevelID": 2,
            "PowerKW": 18,
            "CurrentTypeID": 20
        },
        {
            "ID": 213934,
            "ConnectionTypeID": 28,
            "StatusTypeID": 50,
            "LevelID": 2,
            "PowerKW": 18,
            "CurrentTypeID": 10
        },
        {
            "ID": 247130,
            "ConnectionTypeID": 25,
            "StatusTypeID": 50,
            "LevelID": 2,
            "PowerKW": 18,
            "CurrentTypeID": 20
        },
        {
            "ID": 247131,
            "ConnectionTypeID": 28,
            "StatusTypeID": 50,
            "LevelID": 2,
            "PowerKW": 18,
            "CurrentTypeID": 10
        }
    ],
    "GeneralComments": "",
    "StatusTypeID": 50,
    "DateLastStatusUpdate": "2020-08-27T05:13:00Z",
    "DataQualityLevel": 2,
    "DateCreated": "2020-03-15T10:54:00Z",
    "SubmissionStatusTypeID": 100
}