{
    "IsRecentlyVerified": false,
    "ID": 102591,
    "UUID": "B4C138B4-0D98-4DB2-BBDE-3D3E927AC9C5",
    "DataProviderID": 1,
    "OperatorID": 15,
    "UsageTypeID": 4,
    "AddressInfo": {
        "ID": 102937,
        "Title": "Lucky",
        "AddressLine1": "291 McCray St",
        "Town": "Hollister",
        "StateOrProvince": "CA",
        "Postcode": "95023",
        "CountryID": 2,
        "Latitude": 36.852789,
        "Longitude": -121.39725,
        "ContactTelephone1": "877-455-3833",
        "AccessComments": "24 hours daily; EVgo network subscription and key fob required",
        "RelatedURL": "https://www.evgo.com/",
        "DistanceUnit": 0
    },
    "Connections": [
        {
            "ID": 144683,
            "ConnectionTypeID": 2,
            "StatusTypeID": 50,
            "LevelID": 2,
            "Amps": 125,
            "Voltage": 500,
            "PowerKW": 62.5,
            "CurrentTypeID": 10,
            "Quantity": 2
        },
        {
            "ID": 144684,
            "ConnectionTypeID": 32,
            "LevelID": 2,
            "Amps": 125,
            "Voltage": 500,
            "PowerKW": 62.5,
            "CurrentTypeID": 10,
            "Quantity": 2
        }
    ],
    "NumberOfPoints": 2,
    "StatusTypeID": 50,
    "DateLastStatusUpdate": "2018-09-11T13:09:00Z",
    "DataQualityLevel": 3,
    "DateCreated": "2018-04-21T04:13:00Z",
    "SubmissionStatusTypeID": 100
}