{
    "IsRecentlyVerified": false,
    "ID": 90807,
    "UUID": "7FB96EB1-8AED-408C-A3A2-DC55B9D43938",
    "DataProviderID": 1,
    "DataProvidersReference": "4164",
    "AddressInfo": {
        "ID": 91153,
        "Title": "Laddplats Karlshamn Energi på Coops parkering",
        "AddressLine1": "Strömmavägen 1A",
        "Town": "KARLSHAMN",
        "StateOrProvince": "BLEKINGE",
        "Postcode": "37432",
        "CountryID": 216,
        "Latitude": 56.18995,
        "Longitude": 14.84881,
        "AccessComments": "COOPs parkering precis vid infarten",
        "DistanceUnit": 0
    },
    "Connections": [
        {
            "ID": 128550,
            "ConnectionTypeID": 0,
            "Reference": "1",
            "LevelID": 2,
            "Amps": 100,
            "Voltage": 500,
            "PowerKW": 50,
            "Comments": "Mode 4"
        },
        {
            "ID": 128551,
            "ConnectionTypeID": 0,
            "Reference": "2",
            "LevelID": 2,
            "Amps": 100,
            "Voltage": 500,
            "PowerKW": 50,
            "Comments": "Mode 4"
        },
        {
            "ID": 128552,
            "ConnectionTypeID": 0,
            "Reference": "3",
            "LevelID": 2,
            "Amps": 63,
            "Voltage": 400,
            "PowerKW": 43,
            "Comments": "Mode 3"
        },
        {
            "ID": 128553,
            "ConnectionTypeID": 0,
            "Reference": "4",
            "LevelID": 2,
            "Amps": 32,
            "Voltage": 400,
            "PowerKW": 22,
            "Comments": "Mode 3"
        },
        {
            "ID": 128554,
            "ConnectionTypeID": 0,
            "Reference": "5",
            "LevelID": 2,
            "Amps": 16,
            "Voltage": 400,
            "PowerKW": 11,
            "Comments": "Mode 3"
        }
    ],
    "NumberOfPoints": 5,
    "DateLastStatusUpdate": "2020-05-26T08:21:00Z",
    "DataQualityLevel": 2,
    "DateCreated": "2017-07-25T08:28:00Z",
    "SubmissionStatusTypeID": 100
}