{
    "IsRecentlyVerified": false,
    "ID": 82050,
    "UUID": "717D6FA0-E8D4-4EBB-BFD8-F2CD30391702",
    "DataProviderID": 1,
    "OperatorID": 23,
    "OperatorsReference": "10651",
    "UsageTypeID": 6,
    "AddressInfo": {
        "ID": 82396,
        "Title": "Le Germain Hotel Charlevoix",
        "AddressLine1": "50 Rue de la Ferme",
        "Town": "Baie-Saint-Paul",
        "StateOrProvince": "QC",
        "Postcode": "G3Z 0G2",
        "CountryID": 44,
        "Latitude": 47.435815,
        "Longitude": -70.505087,
        "ContactTelephone1": "(844) 240-4700",
        "DistanceUnit": 0
    },
    "Connections": [
        {
            "ID": 116810,
            "ConnectionTypeID": 30,
            "StatusTypeID": 50,
            "LevelID": 2,
            "PowerKW": 13,
            "CurrentTypeID": 20,
            "Quantity": 2
        }
    ],
    "NumberOfPoints": 2,
    "GeneralComments": "2 Tesla Connectors, up to 13kW.Available for patrons only. Self park.",
    "StatusTypeID": 50,
    "DateLastStatusUpdate": "2017-02-16T11:18:00Z",
    "DataQualityLevel": 1,
    "DateCreated": "2017-02-03T14:34:00Z",
    "SubmissionStatusTypeID": 200
}