{
    "IsRecentlyVerified": false,
    "ID": 127255,
    "UUID": "F0B54BAC-474E-4409-A9C3-09247336257E",
    "DataProviderID": 1,
    "OperatorID": 1,
    "UsageTypeID": 1,
    "UsageCost": "Free",
    "AddressInfo": {
        "ID": 127601,
        "Title": "Taylor River Rest Area",
        "AddressLine1": "Highway 4",
        "Town": "Area D (Sproat Lake)",
        "StateOrProvince": "Alberni-Clayoquot Regional District",
        "CountryID": 44,
        "Latitude": 49.2949909391319,
        "Longitude": -125.299565564866,
        "DistanceUnit": 0
    },
    "Connections": [
        {
            "ID": 178188,
            "ConnectionTypeID": 2,
            "StatusTypeID": 50,
            "LevelID": 3,
            "PowerKW": 25,
            "CurrentTypeID": 30,
            "Quantity": 2
        },
        {
            "ID": 178189,
            "ConnectionTypeID": 1,
            "StatusTypeID": 50,
            "LevelID": 2,
            "CurrentTypeID": 10
        },
        {
            "ID": 180356,
            "ConnectionTypeID": 32,
            "StatusTypeID": 50,
            "LevelID": 3,
            "PowerKW": 25,
            "CurrentTypeID": 30,
            "Quantity": 2
        }
    ],
    "NumberOfPoints": 3,
    "StatusTypeID": 50,
    "DateLastStatusUpdate": "2019-08-16T17:31:00Z",
    "DataQualityLevel": 1,
    "DateCreated": "2019-06-02T23:39:00Z",
    "SubmissionStatusTypeID": 200
}