{
    "IsRecentlyVerified": false,
    "ID": 20323,
    "UUID": "E9BBBF83-77B6-40F3-9C72-8EFE8498DE04",
    "DataProviderID": 1,
    "OperatorID": 1,
    "UsageTypeID": 0,
    "UsageCost": "",
    "AddressInfo": {
        "ID": 20668,
        "Title": "Particulier - Roquevaire",
        "AddressLine1": "590 quartier le gare",
        "AddressLine2": "",
        "Town": "",
        "StateOrProvince": "Roquevaire",
        "Postcode": "",
        "CountryID": 80,
        "Latitude": 43.34954,
        "Longitude": 5.604,
        "ContactTelephone1": "",
        "ContactTelephone2": "",
        "ContactEmail": "",
        "AccessComments": "Ouvert à tous",
        "RelatedURL": "",
        "DistanceUnit": 0
    },
    "Connections": [],
    "GeneralComments": "",
    "StatusTypeID": 50,
    "DateLastStatusUpdate": "2013-11-11T19:07:00Z",
    "DataQualityLevel": 1,
    "DateCreated": "2013-11-11T14:23:00Z",
    "SubmissionStatusTypeID": 200
}