{
    "IsRecentlyVerified": false,
    "ID": 122473,
    "UUID": "3B02EE3D-6430-4AF6-8658-85BB2076368D",
    "DataProviderID": 2,
    "DataProvidersReference": "66709",
    "OperatorID": 5,
    "UsageTypeID": 1,
    "AddressInfo": {
        "ID": 122819,
        "Title": "PMB",
        "AddressLine1": "65 N. Madison Ave.",
        "Town": "Pasadena",
        "StateOrProvince": "CA",
        "Postcode": "91101",
        "CountryID": 2,
        "Latitude": 34.1469543,
        "Longitude": -118.1388707,
        "ContactTelephone1": "888-758-4389",
        "AccessComments": "24 hours daily",
        "RelatedURL": "http://www.chargepoint.com/",
        "DistanceUnit": 0
    },
    "Connections": [
        {
            "ID": 172366,
            "ConnectionTypeID": 1,
            "LevelID": 2,
            "Amps": 16,
            "Voltage": 230,
            "PowerKW": 3,
            "CurrentTypeID": 10,
            "Quantity": 2
        }
    ],
    "DateLastStatusUpdate": "2019-12-24T09:11:00Z",
    "DataQualityLevel": 3,
    "DateCreated": "2019-04-06T05:03:00Z",
    "SubmissionStatusTypeID": 100
}