{
    "IsRecentlyVerified": false,
    "ID": 109076,
    "UUID": "750604C8-C53A-4EF8-B879-A78EC58414D0",
    "DataProviderID": 1,
    "OperatorID": 23,
    "OperatorsReference": "34073",
    "UsageTypeID": 4,
    "UsageCost": "$0.22/kWh; other tariffs for older cars",
    "AddressInfo": {
        "ID": 109422,
        "Title": "Aspen, Co Supercharger",
        "AddressLine1": "38750 Highway 82",
        "Town": "Aspen",
        "StateOrProvince": "CO",
        "Postcode": "81611-2506",
        "CountryID": 2,
        "Latitude": 39.204837,
        "Longitude": -106.858507,
        "DistanceUnit": 0
    },
    "Connections": [
        {
            "ID": 154194,
            "ConnectionTypeID": 27,
            "StatusTypeID": 50,
            "LevelID": 3,
            "PowerKW": 120,
            "CurrentTypeID": 30,
            "Quantity": 8
        }
    ],
    "NumberOfPoints": 8,
    "GeneralComments": "Charging8 Superchargers, available 24/7, up to 72kW",
    "StatusTypeID": 50,
    "DateLastStatusUpdate": "2018-10-11T13:32:00Z",
    "DataQualityLevel": 1,
    "DateCreated": "2018-10-11T13:32:00Z",
    "SubmissionStatusTypeID": 200
}