{
    "IsRecentlyVerified": false,
    "ID": 108272,
    "UUID": "F369A041-2291-4620-8FB8-5191818B320B",
    "DataProviderID": 1,
    "OperatorID": 1,
    "UsageTypeID": 1,
    "UsageCost": "free",
    "AddressInfo": {
        "ID": 108618,
        "Title": "Dombóvár, Hunyadi tér",
        "AddressLine1": "Petőfi utca 2.",
        "Town": "Dombóvár",
        "StateOrProvince": "Baranya megye",
        "Postcode": "7200",
        "CountryID": 104,
        "Latitude": 46.374779,
        "Longitude": 18.129964,
        "DistanceUnit": 0
    },
    "Connections": [
        {
            "ID": 153036,
            "ConnectionTypeID": 25,
            "StatusTypeID": 50,
            "LevelID": 2,
            "Amps": 32,
            "Voltage": 400,
            "PowerKW": 22,
            "CurrentTypeID": 20,
            "Quantity": 2
        }
    ],
    "NumberOfPoints": 2,
    "StatusTypeID": 50,
    "DateLastStatusUpdate": "2018-09-18T11:29:00Z",
    "DataQualityLevel": 1,
    "DateCreated": "2018-09-18T11:29:00Z",
    "SubmissionStatusTypeID": 200
}