{
    "IsRecentlyVerified": false,
    "ID": 105612,
    "UUID": "49945F1C-ACAF-4529-B18B-FBAD3516C153",
    "DataProviderID": 2,
    "DataProvidersReference": "98782",
    "OperatorID": 5,
    "UsageTypeID": 1,
    "AddressInfo": {
        "ID": 105958,
        "Title": "SDIA",
        "AddressLine1": "16 Airport Terminal Rd",
        "Town": "San Diego",
        "StateOrProvince": "CA",
        "Postcode": "92101",
        "CountryID": 2,
        "Latitude": 32.7309458,
        "Longitude": -117.2031334,
        "ContactTelephone1": "888-758-4389",
        "AccessComments": "24 hours daily",
        "RelatedURL": "http://www.chargepoint.com/",
        "DistanceUnit": 0
    },
    "Connections": [
        {
            "ID": 148800,
            "ConnectionTypeID": 1,
            "LevelID": 2,
            "Amps": 16,
            "Voltage": 230,
            "PowerKW": 3,
            "CurrentTypeID": 10,
            "Quantity": 16
        }
    ],
    "DateLastStatusUpdate": "2019-12-24T09:09:00Z",
    "DataQualityLevel": 3,
    "DateCreated": "2018-06-09T04:01:00Z",
    "SubmissionStatusTypeID": 100
}