{
    "UserComments": [
        {
            "ID": 17636,
            "ChargePointID": 87220,
            "CommentTypeID": 10,
            "UserName": "markrassell",
            "Comment": "",
            "Rating": 5,
            "DateCreated": "2017-08-26T10:25:21.887Z",
            "User": {
                "ID": 15812,
                "Username": "markrassell"
            },
            "CheckinStatusTypeID": 10
        },
        {
            "ID": 17634,
            "ChargePointID": 87220,
            "CommentTypeID": 10,
            "UserName": "markrassell",
            "Comment": "Snazzy and fast. Loving the new Ultracharge machines. ",
            "Rating": 5,
            "DateCreated": "2017-08-25T22:27:50.51Z",
            "User": {
                "ID": 15812,
                "Username": "markrassell"
            },
            "CheckinStatusTypeID": 10
        }
    ],
    "IsRecentlyVerified": false,
    "ID": 87220,
    "UUID": "2910D49D-7C5B-4205-8B54-FBA0620F414B",
    "DataProviderID": 1,
    "OperatorID": 32,
    "OperatorsReference": "24015",
    "UsageTypeID": 4,
    "UsageCost": "Inclusive; for Polar Plus subscription members only",
    "AddressInfo": {
        "ID": 87566,
        "Title": "Holiday Inn Express, Kettering",
        "AddressLine1": "Weekley Wood Avenue",
        "AddressLine2": "Brambleside",
        "Town": "Kettering",
        "StateOrProvince": "Northamptonshire",
        "Postcode": "NN14 1UD",
        "CountryID": 1,
        "Latitude": 52.423252,
        "Longitude": -0.727698,
        "DistanceUnit": 0
    },
    "Connections": [
        {
            "ID": 123631,
            "ConnectionTypeID": 2,
            "StatusTypeID": 50,
            "LevelID": 3,
            "Amps": 125,
            "Voltage": 400,
            "PowerKW": 50,
            "CurrentTypeID": 30,
            "Quantity": 1
        },
        {
            "ID": 123632,
            "ConnectionTypeID": 1036,
            "StatusTypeID": 50,
            "LevelID": 3,
            "Amps": 63,
            "Voltage": 400,
            "PowerKW": 43,
            "CurrentTypeID": 20,
            "Quantity": 1
        },
        {
            "ID": 123633,
            "ConnectionTypeID": 33,
            "StatusTypeID": 50,
            "LevelID": 3,
            "Amps": 125,
            "Voltage": 400,
            "PowerKW": 50,
            "CurrentTypeID": 30,
            "Quantity": 1
        }
    ],
    "NumberOfPoints": 1,
    "GeneralComments": "Also nearby is an Ecotricity Electric Highway rapid charger.",
    "StatusTypeID": 50,
    "DateLastStatusUpdate": "2019-05-25T05:14:00Z",
    "DataQualityLevel": 1,
    "DateCreated": "2017-05-02T06:14:00Z",
    "SubmissionStatusTypeID": 200
}