{
    "IsRecentlyVerified": false,
    "ID": 138024,
    "UUID": "E176F783-2288-4316-A9C3-E2BEB33E6CCE",
    "DataProviderID": 2,
    "DataProvidersReference": "100347",
    "OperatorID": 5,
    "UsageTypeID": 1,
    "AddressInfo": {
        "ID": 138373,
        "Title": "REALTY SERVCES",
        "AddressLine1": "105 N Beebe St",
        "Town": "Gilbert",
        "StateOrProvince": "AZ",
        "Postcode": "85234",
        "CountryID": 2,
        "Latitude": 33.3521512,
        "Longitude": -111.6968357,
        "ContactTelephone1": "888-758-4389",
        "AccessComments": "24 hours daily",
        "RelatedURL": "http://www.chargepoint.com/",
        "DistanceUnit": 0
    },
    "Connections": [
        {
            "ID": 193068,
            "ConnectionTypeID": 1,
            "LevelID": 2,
            "Amps": 16,
            "Voltage": 230,
            "PowerKW": 3,
            "CurrentTypeID": 10,
            "Quantity": 2
        }
    ],
    "StatusTypeID": 50,
    "DateLastStatusUpdate": "2019-12-24T09:06:00Z",
    "DataQualityLevel": 3,
    "DateCreated": "2019-12-24T09:06:00Z",
    "SubmissionStatusTypeID": 100
}