{
    "IsRecentlyVerified": false,
    "ID": 68168,
    "UUID": "E256A71A-C8BC-43CB-A30E-45089AD6AE33",
    "DataProviderID": 26,
    "DataProvidersReference": "90199",
    "OperatorID": 177,
    "OperatorsReference": "Nuon EVB-P1541081",
    "UsageCost": "0.00 jaarabonnement",
    "AddressInfo": {
        "ID": 68514,
        "Title": "Wijtvliet 12",
        "AddressLine1": "Wijtvliet 12",
        "Town": "Haarlemmermeer",
        "Postcode": "2134 WD",
        "CountryID": 159,
        "Latitude": 52.307592,
        "Longitude": 4.632512,
        "RelatedURL": "http://www.nuon.nl/ev",
        "DistanceUnit": 0
    },
    "Connections": [
        {
            "ID": 94981,
            "ConnectionTypeID": 25,
            "LevelID": 2,
            "PowerKW": 11,
            "CurrentTypeID": 10
        },
        {
            "ID": 94982,
            "ConnectionTypeID": 25,
            "LevelID": 2,
            "PowerKW": 11,
            "CurrentTypeID": 10
        }
    ],
    "NumberOfPoints": 1,
    "StatusTypeID": 50,
    "DateLastStatusUpdate": "2016-06-04T02:37:00Z",
    "DataQualityLevel": 3,
    "DateCreated": "2016-06-04T02:37:00Z",
    "SubmissionStatusTypeID": 100
}