{
    "IsRecentlyVerified": false,
    "ID": 180405,
    "UUID": "28BFE88C-0B22-4876-963C-2CB044D1D412",
    "DataProviderID": 29,
    "DataProvidersReference": "11764",
    "OperatorID": 189,
    "AddressInfo": {
        "ID": 180764,
        "Title": "Raiffeisenplatz 4",
        "AddressLine1": "Raiffeisenplatz 4",
        "Town": "Bergen",
        "Postcode": "83346",
        "CountryID": 87,
        "Latitude": 47.80673,
        "Longitude": 12.591153,
        "DistanceUnit": 0
    },
    "Connections": [
        {
            "ID": 283443,
            "ConnectionTypeID": 25,
            "StatusTypeID": 50,
            "LevelID": 2,
            "PowerKW": 22,
            "CurrentTypeID": 20
        },
        {
            "ID": 283444,
            "ConnectionTypeID": 25,
            "StatusTypeID": 50,
            "LevelID": 2,
            "PowerKW": 22,
            "CurrentTypeID": 20
        }
    ],
    "StatusTypeID": 50,
    "DateLastStatusUpdate": "2021-07-12T02:39:00Z",
    "MetadataValues": [
        {
            "ID": 12699,
            "MetadataFieldID": 4,
            "ItemValue": "Data from the German chargepoint registry provided by Bundesnetzagentur.de under the CC-BY 4.0 license"
        }
    ],
    "DataQualityLevel": 3,
    "DateCreated": "2021-07-08T10:00:00Z",
    "SubmissionStatusTypeID": 100
}