{
    "IsRecentlyVerified": false,
    "ID": 32078,
    "UUID": "76D1E588-A77B-44E2-8320-FE870734082F",
    "DataProviderID": 1,
    "OperatorID": 105,
    "OperatorsReference": "Essent EM-DE-06436004-01-00001",
    "UsageTypeID": 4,
    "AddressInfo": {
        "ID": 32424,
        "Title": "Stadtverwaltung",
        "AddressLine1": "Bahnhofstraße 12",
        "Town": "Flörsheim am Main",
        "Postcode": "65439",
        "CountryID": 87,
        "Latitude": 50.01440687623038,
        "Longitude": 8.430697278434764,
        "AccessComments": "24/7 nutzbar, kostenlose Parkplätze an den Säulen nicht für E-Fahrzeuge reserviert, die Ladesäulen sind jedoch von vier Parkplätzen aus erreichbar. ",
        "DistanceUnit": 0
    },
    "Connections": [
        {
            "ID": 35589,
            "ConnectionTypeID": 25,
            "StatusTypeID": 50,
            "LevelID": 2,
            "Amps": 32,
            "Voltage": 400,
            "PowerKW": 22,
            "CurrentTypeID": 20,
            "Quantity": 6
        }
    ],
    "NumberOfPoints": 6,
    "StatusTypeID": 50,
    "DateLastStatusUpdate": "2018-06-06T06:34:00Z",
    "DataQualityLevel": 3,
    "DateCreated": "2015-01-09T06:03:00Z",
    "SubmissionStatusTypeID": 200
}