{
    "IsRecentlyVerified": false,
    "ID": 113945,
    "UUID": "72B3437F-2BEC-4223-B9AD-B31AB1009B97",
    "DataProviderID": 1,
    "OperatorID": 23,
    "OperatorsReference": "47801",
    "UsageTypeID": 4,
    "AddressInfo": {
        "ID": 114291,
        "Title": "Best Western Watertown Fort Drum",
        "AddressLine1": "300 Washington St",
        "Town": "Watertown",
        "StateOrProvince": "New York",
        "Postcode": "13601",
        "CountryID": 2,
        "Latitude": 43.9717327,
        "Longitude": -75.9118129,
        "ContactTelephone1": "(315) 782-8000",
        "DistanceUnit": 0
    },
    "Connections": [
        {
            "ID": 160515,
            "ConnectionTypeID": 30,
            "StatusTypeID": 50,
            "LevelID": 2,
            "PowerKW": 16,
            "CurrentTypeID": 20,
            "Quantity": 2
        }
    ],
    "NumberOfPoints": 2,
    "GeneralComments": "2 Tesla Connectors, up to 16kW.Available for customers. Please see front desk.",
    "StatusTypeID": 50,
    "DateLastStatusUpdate": "2019-01-02T22:02:00Z",
    "DataQualityLevel": 1,
    "DateCreated": "2019-01-02T22:02:00Z",
    "SubmissionStatusTypeID": 200
}