{
    "IsRecentlyVerified": false,
    "ID": 116488,
    "UUID": "F97C9B67-5073-41E5-8B25-8853125A1A60",
    "DataProviderID": 1,
    "DataProvidersReference": "5076",
    "OperatorID": 1,
    "UsageTypeID": 5,
    "AddressInfo": {
        "ID": 116834,
        "Title": "Kiwi Sjusjøen",
        "AddressLine1": "Sjusjøvegen 2000",
        "Town": "SJUSJØEN",
        "StateOrProvince": "Innlandet",
        "Postcode": "2612",
        "CountryID": 168,
        "Latitude": 61.15232,
        "Longitude": 10.69057,
        "AccessComments": "",
        "DistanceUnit": 0
    },
    "Connections": [
        {
            "ID": 164724,
            "ConnectionTypeID": 33,
            "Reference": "1",
            "StatusTypeID": 50,
            "LevelID": 3,
            "Amps": 100,
            "Voltage": 500,
            "PowerKW": 50,
            "CurrentTypeID": 30,
            "Quantity": 2,
            "Comments": "Mode 4"
        },
        {
            "ID": 164726,
            "ConnectionTypeID": 2,
            "Reference": "3",
            "StatusTypeID": 50,
            "LevelID": 3,
            "Amps": 100,
            "Voltage": 500,
            "PowerKW": 50,
            "CurrentTypeID": 30,
            "Quantity": 2,
            "Comments": "Mode 4"
        },
        {
            "ID": 164728,
            "ConnectionTypeID": 25,
            "Reference": "5",
            "StatusTypeID": 50,
            "LevelID": 2,
            "Amps": 32,
            "Voltage": 400,
            "PowerKW": 22,
            "Quantity": 3,
            "Comments": "Mode 3"
        }
    ],
    "NumberOfPoints": 7,
    "StatusTypeID": 50,
    "DateLastStatusUpdate": "2020-08-27T19:34:00Z",
    "DataQualityLevel": 2,
    "DateCreated": "2019-02-11T09:16:00Z",
    "SubmissionStatusTypeID": 100
}