{
    "IsRecentlyVerified": false,
    "ID": 79487,
    "UUID": "7E81A3C9-8218-4B09-9438-BAC63D73CE1F",
    "DataProviderID": 1,
    "OperatorID": 23,
    "OperatorsReference": "6923",
    "UsageTypeID": 6,
    "UsageCost": "Free",
    "AddressInfo": {
        "ID": 79833,
        "Title": "The Westin Hilton Head Island Resort & Spa",
        "AddressLine1": "2 Grasslawn Ave",
        "Town": "Hilton Head Island",
        "StateOrProvince": "SC",
        "Postcode": "29928",
        "CountryID": 2,
        "Latitude": 32.2089885,
        "Longitude": -80.6815982,
        "ContactTelephone1": "(843) 681-4000",
        "DistanceUnit": 0
    },
    "Connections": [
        {
            "ID": 114126,
            "ConnectionTypeID": 30,
            "StatusTypeID": 50,
            "LevelID": 2,
            "PowerKW": 8,
            "CurrentTypeID": 10,
            "Quantity": 1
        }
    ],
    "NumberOfPoints": 1,
    "GeneralComments": "1 Tesla Connector, up to 8kW.Available for patrons only. Please see front desk.",
    "StatusTypeID": 50,
    "DateLastStatusUpdate": "2017-06-09T14:58:00Z",
    "DataQualityLevel": 1,
    "DateCreated": "2017-01-29T17:29:00Z",
    "SubmissionStatusTypeID": 200
}