{
    "IsRecentlyVerified": false,
    "ID": 74091,
    "UUID": "11B848B7-2ACC-4375-8DB0-FE3F93636207",
    "DataProviderID": 1,
    "OperatorID": 89,
    "OperatorsReference": "AAB-00234",
    "UsageTypeID": 4,
    "UsageCost": "CAD 1.00/hour",
    "AddressInfo": {
        "ID": 74437,
        "Title": "Rta-Édifice de la Sûreté",
        "AddressLine1": "102 rue Oersted",
        "Town": "Jonquière",
        "StateOrProvince": "QC",
        "Postcode": "G7S 2Z1",
        "CountryID": 44,
        "Latitude": 48.429481,
        "Longitude": -71.176,
        "DistanceUnit": 0
    },
    "Connections": [
        {
            "ID": 106415,
            "ConnectionTypeID": 1,
            "StatusTypeID": 50,
            "LevelID": 2,
            "Amps": 32,
            "Voltage": 230,
            "PowerKW": 7,
            "CurrentTypeID": 10,
            "Quantity": 1
        }
    ],
    "NumberOfPoints": 1,
    "StatusTypeID": 50,
    "DateLastStatusUpdate": "2017-01-22T19:35:00Z",
    "DataQualityLevel": 1,
    "DateCreated": "2016-11-24T00:15:00Z",
    "SubmissionStatusTypeID": 200
}