{
    "IsRecentlyVerified": false,
    "ID": 17247,
    "UUID": "4A7FDD5F-F2C1-4303-AB71-46B71DE7B174",
    "DataProviderID": 22,
    "DataProvidersReference": "65F675B3CF48B79D1D4FE970F1688C6B",
    "AddressInfo": {
        "ID": 17592,
        "Title": "日産プリンス静岡販売榛原店",
        "AddressLine1": "静岡県牧之原市細江189-15",
        "CountryID": 114,
        "Latitude": 34.74093402,
        "Longitude": 138.2346639,
        "ContactTelephone1": "0548-22-1532",
        "DistanceUnit": 0
    },
    "Connections": [
        {
            "ID": 17488,
            "ConnectionTypeID": 2,
            "LevelID": 2,
            "Amps": 100,
            "Voltage": 480,
            "PowerKW": 48,
            "Quantity": 1
        }
    ],
    "DateLastStatusUpdate": "2013-06-29T08:55:00Z",
    "DataQualityLevel": 2,
    "DateCreated": "2013-06-29T08:55:00Z",
    "SubmissionStatusTypeID": 200
}