{
    "IsRecentlyVerified": false,
    "ID": 122172,
    "UUID": "2639B421-6C06-4F15-A6F2-3876A6AC45EE",
    "DataProviderID": 2,
    "DataProvidersReference": "94765",
    "OperatorID": 3372,
    "UsageTypeID": 1,
    "AddressInfo": {
        "ID": 122518,
        "Title": "AT MATEO",
        "AddressLine1": "555 Mateo St",
        "Town": "Los Angeles",
        "StateOrProvince": "CA",
        "Postcode": "90013",
        "CountryID": 2,
        "Latitude": 34.03977,
        "Longitude": -118.233078,
        "ContactTelephone1": "866-816-7584",
        "AccessComments": "Office business hours; for employee and guest use only",
        "RelatedURL": "http://evconnect.com/",
        "DistanceUnit": 0
    },
    "Connections": [
        {
            "ID": 172039,
            "ConnectionTypeID": 1,
            "LevelID": 2,
            "Amps": 16,
            "Voltage": 230,
            "PowerKW": 3.7,
            "CurrentTypeID": 10,
            "Quantity": 8
        }
    ],
    "DateLastStatusUpdate": "2020-06-26T02:56:00Z",
    "DataQualityLevel": 3,
    "DateCreated": "2019-04-06T05:02:00Z",
    "SubmissionStatusTypeID": 100
}