{
    "IsRecentlyVerified": false,
    "ID": 183860,
    "UUID": "E7D4B0E7-7607-42AF-A269-2C32FABFF3DE",
    "DataProviderID": 29,
    "DataProvidersReference": "13022",
    "AddressInfo": {
        "ID": 184219,
        "Title": "Am Windmühlenberg 4",
        "AddressLine1": "Am Windmühlenberg 4",
        "Town": "Neuhardenberg",
        "Postcode": "15320",
        "CountryID": 87,
        "Latitude": 52.592029,
        "Longitude": 14.232376,
        "DistanceUnit": 0
    },
    "Connections": [
        {
            "ID": 291366,
            "ConnectionTypeID": 33,
            "StatusTypeID": 50,
            "LevelID": 3,
            "PowerKW": 22,
            "CurrentTypeID": 30
        },
        {
            "ID": 291367,
            "ConnectionTypeID": 25,
            "StatusTypeID": 50,
            "LevelID": 2,
            "PowerKW": 11,
            "CurrentTypeID": 20
        }
    ],
    "StatusTypeID": 50,
    "DateLastStatusUpdate": "2021-07-12T02:50:00Z",
    "MetadataValues": [
        {
            "ID": 16153,
            "MetadataFieldID": 4,
            "ItemValue": "Data from the German chargepoint registry provided by Bundesnetzagentur.de under the CC-BY 4.0 license"
        }
    ],
    "DataQualityLevel": 3,
    "DateCreated": "2021-07-08T10:04:00Z",
    "SubmissionStatusTypeID": 100
}