{
    "IsRecentlyVerified": false,
    "ID": 93252,
    "UUID": "90A53BF3-FB59-4614-BA19-8AB3F0506EFB",
    "DataProviderID": 1,
    "OperatorID": 23,
    "OperatorsReference": "35722",
    "UsageTypeID": 4,
    "AddressInfo": {
        "ID": 93598,
        "Title": "Lodge Tower",
        "AddressLine1": "200 Vail RD",
        "Town": "Vail",
        "StateOrProvince": "Colorado",
        "Postcode": "81657",
        "CountryID": 2,
        "Latitude": 39.639798,
        "Longitude": -106.375328,
        "ContactTelephone1": "(970) 476-9530",
        "DistanceUnit": 0
    },
    "Connections": [
        {
            "ID": 132079,
            "ConnectionTypeID": 30,
            "StatusTypeID": 50,
            "LevelID": 2,
            "PowerKW": 16,
            "CurrentTypeID": 20,
            "Quantity": 3
        }
    ],
    "NumberOfPoints": 3,
    "GeneralComments": "3 Tesla Connectors, up to 16kW.Available for customers. Self park.",
    "StatusTypeID": 50,
    "DateLastStatusUpdate": "2017-09-24T05:32:00Z",
    "DataQualityLevel": 1,
    "DateCreated": "2017-09-24T05:32:00Z",
    "SubmissionStatusTypeID": 200
}