{
    "IsRecentlyVerified": false,
    "ID": 139323,
    "UUID": "3F12E9C0-8E47-4ED8-BFFE-C8D378039DE3",
    "DataProviderID": 2,
    "DataProvidersReference": "96137",
    "OperatorID": 9,
    "UsageTypeID": 2,
    "AddressInfo": {
        "ID": 139675,
        "Title": "WL Gore & Associates",
        "AddressLine1": "32360 N North Valley Pkway",
        "Town": "Phoenix",
        "StateOrProvince": "AZ",
        "Postcode": "85085",
        "CountryID": 2,
        "Latitude": 33.778027,
        "Longitude": -112.115518,
        "ContactTelephone1": "888-998-2546",
        "AccessComments": "MON: 24 hours | TUE: 24 hours | WED: 24 hours | THU: 24 hours | FRI: 24 hours | SAT: 24 hours | SUN: 24 hours",
        "RelatedURL": "http://www.blinkcharging.com/",
        "DistanceUnit": 0
    },
    "Connections": [
        {
            "ID": 194638,
            "ConnectionTypeID": 1,
            "LevelID": 2,
            "Amps": 16,
            "Voltage": 230,
            "PowerKW": 3.7,
            "CurrentTypeID": 10,
            "Quantity": 2
        }
    ],
    "StatusTypeID": 50,
    "DateLastStatusUpdate": "2020-06-26T02:56:00Z",
    "DataQualityLevel": 3,
    "DateCreated": "2019-12-24T09:10:00Z",
    "SubmissionStatusTypeID": 100
}