{
    "UserComments": [
        {
            "ID": 5964,
            "ChargePointID": 37719,
            "CommentTypeID": 50,
            "UserName": "Matthijs Van der Bogt",
            "DateCreated": "2015-07-18T13:46:45.487Z",
            "User": {
                "ID": 5002,
                "Username": "Matthijs Van der Bogt"
            },
            "CheckinStatusTypeID": 140
        }
    ],
    "MediaItems": [
        {
            "ID": 2835,
            "ChargePointID": 37719,
            "ItemURL": "https://s3-ap-southeast-2.amazonaws.com/openchargemap/images/NL/OCM37719/OCM-37719.orig.2015071818002498.jpg",
            "ItemThumbnailURL": "https://s3-ap-southeast-2.amazonaws.com/openchargemap/images/NL/OCM37719/OCM-37719.thmb.2015071818002498.jpg",
            "Comment": "",
            "IsEnabled": true,
            "IsVideo": false,
            "IsFeaturedItem": false,
            "IsExternalResource": false,
            "User": {
                "ID": 5002,
                "Username": "Matthijs Van der Bogt"
            },
            "DateCreated": "2015-07-18T18:01:00Z"
        },
        {
            "ID": 2834,
            "ChargePointID": 37719,
            "ItemURL": "https://s3-ap-southeast-2.amazonaws.com/openchargemap/images/NL/OCM37719/OCM-37719.orig.2015071817594248.jpg",
            "ItemThumbnailURL": "https://s3-ap-southeast-2.amazonaws.com/openchargemap/images/NL/OCM37719/OCM-37719.thmb.2015071817594248.jpg",
            "Comment": "",
            "IsEnabled": true,
            "IsVideo": false,
            "IsFeaturedItem": false,
            "IsExternalResource": false,
            "User": {
                "ID": 5002,
                "Username": "Matthijs Van der Bogt"
            },
            "DateCreated": "2015-07-18T18:00:00Z"
        },
        {
            "ID": 2833,
            "ChargePointID": 37719,
            "ItemURL": "https://s3-ap-southeast-2.amazonaws.com/openchargemap/images/NL/OCM37719/OCM-37719.orig.2015071817590981.jpg",
            "ItemThumbnailURL": "https://s3-ap-southeast-2.amazonaws.com/openchargemap/images/NL/OCM37719/OCM-37719.thmb.2015071817590981.jpg",
            "Comment": "",
            "IsEnabled": true,
            "IsVideo": false,
            "IsFeaturedItem": false,
            "IsExternalResource": false,
            "User": {
                "ID": 5002,
                "Username": "Matthijs Van der Bogt"
            },
            "DateCreated": "2015-07-18T17:59:00Z"
        }
    ],
    "IsRecentlyVerified": false,
    "ID": 37719,
    "UUID": "01C88029-CEDE-4241-ADCA-CB544CA32CDB",
    "DataProviderID": 1,
    "OperatorID": 73,
    "OperatorsReference": "EV-Box EVB-P1402375",
    "UsageTypeID": 4,
    "UsageCost": "0.00 gratis",
    "AddressInfo": {
        "ID": 38065,
        "Title": "Hospitaalgarage",
        "AddressLine1": "Hospitaalgarage",
        "Town": "Almere",
        "StateOrProvince": "Flevoland",
        "Postcode": "1315 XN",
        "CountryID": 159,
        "Latitude": 52.369370962849985,
        "Longitude": 5.22060618147588,
        "RelatedURL": "http://www.ev-box.nl",
        "DistanceUnit": 0
    },
    "Connections": [
        {
            "ID": 41230,
            "ConnectionTypeID": 25,
            "StatusTypeID": 50,
            "LevelID": 2,
            "PowerKW": 11,
            "CurrentTypeID": 20,
            "Quantity": 1
        }
    ],
    "NumberOfPoints": 1,
    "StatusTypeID": 50,
    "DateLastStatusUpdate": "2015-07-18T18:01:00Z",
    "DataQualityLevel": 3,
    "DateCreated": "2015-01-09T06:07:00Z",
    "SubmissionStatusTypeID": 200
}