{
    "IsRecentlyVerified": false,
    "ID": 83972,
    "UUID": "F82EBF26-6BC0-46FB-8B87-D4484745D954",
    "DataProviderID": 1,
    "OperatorID": 45,
    "UsageTypeID": 3,
    "AddressInfo": {
        "ID": 84318,
        "Title": "Hotel Plettenberger Hof",
        "AddressLine1": "Schloßstraße 28",
        "Town": "Nordkirchen",
        "StateOrProvince": "Kreis Coesfeld",
        "Postcode": "59394",
        "CountryID": 87,
        "Latitude": 51.7368198,
        "Longitude": 7.527643000000012,
        "ContactTelephone1": "+49 2596 927-0",
        "AccessComments": "Auf dem Hotelparkplatz für Hotel- und Biergartengäste befindet sich neben dem Hotelschild ein Elektrostromkasten. Hier gibt es CEE rot 16A Drehstromstecker und Schuko Steckdosen. Beim Hotelpersonal anmelden.",
        "RelatedURL": "http://www.plettenberger-hof.de/",
        "DistanceUnit": 0
    },
    "Connections": [
        {
            "ID": 119346,
            "ConnectionTypeID": 28,
            "StatusTypeID": 50,
            "LevelID": 2,
            "Amps": 16,
            "Voltage": 230,
            "PowerKW": 3.7,
            "CurrentTypeID": 10,
            "Quantity": 2
        },
        {
            "ID": 119347,
            "ConnectionTypeID": 17,
            "StatusTypeID": 50,
            "LevelID": 2,
            "Amps": 16,
            "Voltage": 400,
            "PowerKW": 11,
            "CurrentTypeID": 20,
            "Quantity": 1
        }
    ],
    "NumberOfPoints": 3,
    "StatusTypeID": 50,
    "DateLastStatusUpdate": "2017-02-13T07:54:00Z",
    "DataQualityLevel": 1,
    "DateCreated": "2017-02-13T07:54:00Z",
    "SubmissionStatusTypeID": 200
}