{
    "IsRecentlyVerified": false,
    "ID": 120542,
    "UUID": "758B82D4-A933-4396-8BDE-A206B09450A3",
    "DataProviderID": 2,
    "DataProvidersReference": "80980",
    "OperatorID": 5,
    "UsageTypeID": 1,
    "AddressInfo": {
        "ID": 120888,
        "Title": "IRVINE  CO  OFC",
        "AddressLine1": "9779 Towne Center Dr.",
        "Town": "San Diego",
        "StateOrProvince": "CA",
        "Postcode": "92121",
        "CountryID": 2,
        "Latitude": 32.886948,
        "Longitude": -117.210152,
        "ContactTelephone1": "888-758-4389",
        "AccessComments": "24 hours daily",
        "RelatedURL": "http://www.chargepoint.com/",
        "DistanceUnit": 0
    },
    "Connections": [
        {
            "ID": 169896,
            "ConnectionTypeID": 1,
            "LevelID": 2,
            "Amps": 16,
            "Voltage": 230,
            "PowerKW": 3,
            "CurrentTypeID": 10,
            "Quantity": 5
        }
    ],
    "DateLastStatusUpdate": "2019-04-01T04:59:00Z",
    "DataQualityLevel": 3,
    "DateCreated": "2019-04-01T04:59:00Z",
    "SubmissionStatusTypeID": 100
}