{
    "IsRecentlyVerified": false,
    "ID": 155843,
    "UUID": "05BA2891-86E0-44EF-94B5-0D726594262D",
    "DataProviderID": 1,
    "OperatorID": 3,
    "OperatorsReference": "PG-94149,PG-94157,PG-94160,PG-94166,PG-94174",
    "UsageTypeID": 4,
    "UsageCost": "Free",
    "AddressInfo": {
        "ID": 156197,
        "Title": "Trinity Estates-Lancaster Grange",
        "AddressLine1": "Barnes Wallis Way",
        "Town": "Bricket Wood",
        "Postcode": "AL2 3FG",
        "CountryID": 1,
        "Latitude": 51.702963,
        "Longitude": -0.372652,
        "DistanceUnit": 0
    },
    "Connections": [
        {
            "ID": 219410,
            "ConnectionTypeID": 25,
            "StatusTypeID": 50,
            "LevelID": 2,
            "Amps": 32,
            "Voltage": 230,
            "PowerKW": 7,
            "CurrentTypeID": 10,
            "Quantity": 5
        }
    ],
    "NumberOfPoints": 5,
    "GeneralComments": "This is an open charge unit installed at the Trinity Estates residential development at Lancaster Grange, Barnes Wallis Way, Bricket Wood",
    "StatusTypeID": 50,
    "DateLastStatusUpdate": "2020-04-28T05:27:00Z",
    "DataQualityLevel": 1,
    "DateCreated": "2020-04-27T05:41:00Z",
    "SubmissionStatusTypeID": 200
}