{
    "IsRecentlyVerified": false,
    "ID": 103253,
    "UUID": "8C320C04-6BDB-413C-9D85-6061BB32F728",
    "DataProviderID": 1,
    "OperatorID": 45,
    "UsageTypeID": 1,
    "AddressInfo": {
        "ID": 103599,
        "Title": "Jahrhunderthalle ",
        "AddressLine1": "An der Jahrhunderthalle 1",
        "Town": "Bochum",
        "StateOrProvince": "Nordrhein-Westfalen",
        "Postcode": "44793",
        "CountryID": 87,
        "Latitude": 51.481473905651576,
        "Longitude": 7.1979294777710265,
        "AccessComments": "24/7 kostenlos nutzbare Ladesäule  direkt am Wasserturm, in unmittelbarer Nähe zur Gastronomie im Pumpenhaus. Kann mit beliebiger Ladekarte aktiviert werden. Ist die Schranke unten, dann klingeln, der Pförtner öffnet dann die Schranke.",
        "RelatedURL": "http://www.jahrhunderthalle-bochum.de/",
        "DistanceUnit": 0
    },
    "Connections": [
        {
            "ID": 145875,
            "ConnectionTypeID": 25,
            "StatusTypeID": 50,
            "LevelID": 2,
            "Amps": 32,
            "Voltage": 400,
            "PowerKW": 22,
            "CurrentTypeID": 20,
            "Quantity": 2
        }
    ],
    "NumberOfPoints": 2,
    "StatusTypeID": 50,
    "DateLastStatusUpdate": "2018-04-25T07:09:00Z",
    "DataQualityLevel": 1,
    "DateCreated": "2018-04-25T07:09:00Z",
    "SubmissionStatusTypeID": 200
}