{
    "IsRecentlyVerified": false,
    "ID": 140750,
    "UUID": "D193F139-EE35-459D-A6C0-B4357A5F0941",
    "DataProviderID": 2,
    "DataProvidersReference": "148599",
    "OperatorID": 39,
    "UsageTypeID": 1,
    "AddressInfo": {
        "ID": 141102,
        "Title": "Milpitas Library Garage",
        "AddressLine1": "160 North Main Street",
        "Town": "Milpitas",
        "StateOrProvince": "CA",
        "Postcode": "95035",
        "CountryID": 2,
        "Latitude": 37.4327122,
        "Longitude": -121.9068563,
        "ContactTelephone1": "800-663-5633",
        "AccessComments": "MO: Not Specified; TU: Not Specified; WE: Not Specified; TH: Not Specified; FR: Not Specified; SA: Not Specified; SU: Not Specified",
        "RelatedURL": "http://www.semacharge.com/",
        "DistanceUnit": 0
    },
    "Connections": [
        {
            "ID": 196464,
            "ConnectionTypeID": 1,
            "LevelID": 2,
            "Amps": 16,
            "Voltage": 230,
            "PowerKW": 3.7,
            "CurrentTypeID": 10,
            "Quantity": 2
        }
    ],
    "StatusTypeID": 50,
    "DateLastStatusUpdate": "2020-06-26T02:59:00Z",
    "DataQualityLevel": 3,
    "DateCreated": "2019-12-24T09:13:00Z",
    "SubmissionStatusTypeID": 100
}