{
    "IsRecentlyVerified": false,
    "ID": 182870,
    "UUID": "52BA20A3-ABF7-44D0-8253-ED5FBC17AE74",
    "DataProviderID": 29,
    "DataProvidersReference": "3920",
    "OperatorID": 103,
    "AddressInfo": {
        "ID": 183229,
        "Title": "Hufelandstraße 53",
        "AddressLine1": "Hufelandstraße 53",
        "Town": "Essen",
        "Postcode": "45147",
        "CountryID": 87,
        "Latitude": 51.436199,
        "Longitude": 6.991285,
        "DistanceUnit": 0
    },
    "Connections": [
        {
            "ID": 289152,
            "ConnectionTypeID": 25,
            "StatusTypeID": 50,
            "LevelID": 2,
            "PowerKW": 22,
            "CurrentTypeID": 20
        },
        {
            "ID": 289153,
            "ConnectionTypeID": 25,
            "StatusTypeID": 50,
            "LevelID": 2,
            "PowerKW": 22,
            "CurrentTypeID": 20
        }
    ],
    "StatusTypeID": 50,
    "DateLastStatusUpdate": "2021-07-09T03:23:00Z",
    "MetadataValues": [
        {
            "ID": 15163,
            "MetadataFieldID": 4,
            "ItemValue": "Data from the German chargepoint registry provided by Bundesnetzagentur.de under the CC-BY 4.0 license"
        }
    ],
    "DataQualityLevel": 3,
    "DateCreated": "2021-07-08T10:03:00Z",
    "SubmissionStatusTypeID": 100
}