{
    "IsRecentlyVerified": false,
    "ID": 88008,
    "UUID": "A056A463-2DDF-48A9-A6CA-1939D96217AC",
    "DataProviderID": 1,
    "OperatorID": 45,
    "UsageTypeID": 1,
    "AddressInfo": {
        "ID": 88354,
        "Title": "Freibad",
        "AddressLine1": "B 276",
        "Town": "Wächtersbach",
        "StateOrProvince": "Main-Kinzig-Kreis",
        "Postcode": "63607",
        "CountryID": 87,
        "Latitude": 50.263784,
        "Longitude": 9.308626000000004,
        "AccessComments": "24/7 nutzbare Schukodosen; nur für Fahrräder geeignet.",
        "DistanceUnit": 0
    },
    "Connections": [
        {
            "ID": 124839,
            "ConnectionTypeID": 28,
            "StatusTypeID": 50,
            "LevelID": 2,
            "Amps": 16,
            "Voltage": 230,
            "PowerKW": 3.7,
            "CurrentTypeID": 10,
            "Quantity": 4
        }
    ],
    "NumberOfPoints": 4,
    "StatusTypeID": 50,
    "DateLastStatusUpdate": "2017-05-19T05:37:00Z",
    "DataQualityLevel": 1,
    "DateCreated": "2017-05-19T05:37:00Z",
    "SubmissionStatusTypeID": 200
}