{
    "IsRecentlyVerified": false,
    "ID": 175797,
    "UUID": "681650D2-E402-4BCE-9216-423C4E66BD37",
    "DataProviderID": 1,
    "OperatorID": 1,
    "UsageTypeID": 1,
    "AddressInfo": {
        "ID": 176156,
        "Title": "Mitchell Volkswagen",
        "AddressLine1": "51 albany turnpike",
        "Town": "simsbury",
        "Postcode": "06019",
        "CountryID": 2,
        "Latitude": 41.823041499999995,
        "Longitude": -72.8761681,
        "ContactTelephone1": "8606937668",
        "DistanceUnit": 0
    },
    "Connections": [
        {
            "ID": 273005,
            "ConnectionTypeID": 0,
            "StatusTypeID": 50,
            "LevelID": 2,
            "PowerKW": 9.6,
            "Quantity": 1
        }
    ],
    "NumberOfPoints": 1,
    "StatusTypeID": 50,
    "DateLastStatusUpdate": "2021-06-18T12:53:00Z",
    "DataQualityLevel": 1,
    "DateCreated": "2021-06-15T12:45:00Z",
    "SubmissionStatusTypeID": 200
}