{
    "MediaItems": [
        {
            "ID": 18719,
            "ChargePointID": 128428,
            "ItemURL": "https://s3-ap-southeast-2.amazonaws.com/openchargemap/images/GB/OCM128428/OCM-128428.orig.2019062411312763.jpg",
            "ItemThumbnailURL": "https://s3-ap-southeast-2.amazonaws.com/openchargemap/images/GB/OCM128428/OCM-128428.thmb.2019062411312763.jpg",
            "Comment": "",
            "IsEnabled": true,
            "IsVideo": false,
            "IsFeaturedItem": false,
            "IsExternalResource": false,
            "User": {
                "ID": 21088,
                "Username": "wedix"
            },
            "DateCreated": "2019-06-24T11:32:00Z"
        }
    ],
    "IsRecentlyVerified": false,
    "ID": 128428,
    "UUID": "3312892C-FF06-41C2-A84C-B411621BD898",
    "DataProviderID": 1,
    "OperatorID": 2244,
    "UsageTypeID": 1,
    "AddressInfo": {
        "ID": 128774,
        "Title": "Woodwarde Road Lamp Post Charger",
        "AddressLine1": "Woodwarde Road",
        "Town": "London",
        "Postcode": "SE22 8UL",
        "CountryID": 1,
        "Latitude": 51.4496,
        "Longitude": -0.07649,
        "RelatedURL": "https://mysimplesocket.com/phjp",
        "DistanceUnit": 0
    },
    "Connections": [
        {
            "ID": 179787,
            "ConnectionTypeID": 25,
            "StatusTypeID": 50,
            "LevelID": 2,
            "PowerKW": 5.5,
            "Quantity": 1
        }
    ],
    "NumberOfPoints": 1,
    "GeneralComments": "Payment by credit card online or by SmartCable.",
    "StatusTypeID": 50,
    "DateLastStatusUpdate": "2019-06-24T12:32:00Z",
    "DataQualityLevel": 1,
    "DateCreated": "2019-06-24T11:21:00Z",
    "SubmissionStatusTypeID": 200
}