{
    "IsRecentlyVerified": false,
    "ID": 79380,
    "UUID": "5F69C21F-8EB0-4F31-95B9-D2C9728DE945",
    "DataProviderID": 1,
    "OperatorID": 45,
    "UsageTypeID": 6,
    "UsageCost": "Free",
    "AddressInfo": {
        "ID": 79726,
        "Title": "BMW Cedar Isle Auto",
        "AddressLine1": "Cedar Road",
        "Town": "Fourways",
        "StateOrProvince": "Gauteng",
        "Postcode": "2055",
        "CountryID": 208,
        "Latitude": -26.0208456166851,
        "Longitude": 28.0016183853149,
        "ContactTelephone1": "0773671600",
        "AccessComments": "BMW Cedar Isle",
        "RelatedURL": "http://www.bmw-cedarisleauto.co.za",
        "DistanceUnit": 0
    },
    "Connections": [
        {
            "ID": 114015,
            "ConnectionTypeID": 33,
            "StatusTypeID": 50,
            "LevelID": 3,
            "Amps": 125,
            "PowerKW": 125,
            "CurrentTypeID": 30,
            "Quantity": 1
        }
    ],
    "NumberOfPoints": 1,
    "StatusTypeID": 50,
    "DateLastStatusUpdate": "2017-01-29T16:55:00Z",
    "DataQualityLevel": 1,
    "DateCreated": "2017-01-28T13:49:00Z",
    "SubmissionStatusTypeID": 200
}