{
    "IsRecentlyVerified": false,
    "ID": 152079,
    "UUID": "8B3EF360-8102-4591-BAD9-D51389EA4414",
    "DataProviderID": 28,
    "DataProvidersReference": "FR*S86*PSORE*B104",
    "UsageTypeID": 5,
    "AddressInfo": {
        "ID": 152432,
        "Title": "B104",
        "AddressLine1": "Parking route de Bouresse - 86410 - Verrieres",
        "CountryID": 80,
        "Latitude": 46.41083,
        "Longitude": 0.59284,
        "AccessComments": "24/24 7/7 jours",
        "DistanceUnit": 0
    },
    "Connections": [
        {
            "ID": 212740,
            "ConnectionTypeID": 28,
            "StatusTypeID": 50,
            "LevelID": 2,
            "PowerKW": 18,
            "CurrentTypeID": 10
        },
        {
            "ID": 212741,
            "ConnectionTypeID": 25,
            "StatusTypeID": 50,
            "LevelID": 2,
            "PowerKW": 18,
            "CurrentTypeID": 20
        },
        {
            "ID": 245597,
            "ConnectionTypeID": 28,
            "StatusTypeID": 50,
            "LevelID": 2,
            "PowerKW": 18,
            "CurrentTypeID": 10
        },
        {
            "ID": 245598,
            "ConnectionTypeID": 25,
            "StatusTypeID": 50,
            "LevelID": 2,
            "PowerKW": 18,
            "CurrentTypeID": 20
        }
    ],
    "GeneralComments": "",
    "StatusTypeID": 50,
    "DateLastStatusUpdate": "2020-08-27T05:12:00Z",
    "DataQualityLevel": 2,
    "DateCreated": "2020-03-15T10:53:00Z",
    "SubmissionStatusTypeID": 100
}