{
    "IsRecentlyVerified": false,
    "ID": 23061,
    "UUID": "E85CA26F-AC20-4E27-A5D3-D69B0EEF6A68",
    "DataProviderID": 1,
    "OperatorID": 1,
    "UsageTypeID": 0,
    "AddressInfo": {
        "ID": 23406,
        "Title": " Nissan Dealer Leo Peeters Keerbergen NV",
        "AddressLine1": "Tremelobaan 252",
        "Town": "Keerbergen",
        "StateOrProvince": "Leuven",
        "Postcode": "3140",
        "CountryID": 26,
        "Latitude": 50.99410028740908,
        "Longitude": 4.688836141986026,
        "ContactTelephone1": "016/53.33.83",
        "ContactEmail": "leo@keerbergen.leopeeters.be",
        "RelatedURL": "http://www.nissan-leopeeterskeerbergen.be/",
        "DistanceUnit": 0
    },
    "Connections": [
        {
            "ID": 24758,
            "ConnectionTypeID": 2,
            "LevelID": 3,
            "CurrentTypeID": 30,
            "Quantity": 1
        }
    ],
    "NumberOfPoints": 1,
    "StatusTypeID": 50,
    "DateLastStatusUpdate": "2014-04-04T13:17:00Z",
    "DataQualityLevel": 1,
    "DateCreated": "2014-04-04T13:09:00Z",
    "SubmissionStatusTypeID": 200
}