{
    "IsRecentlyVerified": false,
    "ID": 99861,
    "UUID": "954EC264-BCF0-4EB1-82A8-0DEEB2F04FC8",
    "DataProviderID": 1,
    "OperatorID": 23,
    "OperatorsReference": "40397",
    "UsageTypeID": 4,
    "AddressInfo": {
        "ID": 100207,
        "Title": "Tourist-Information Bergen",
        "AddressLine1": "Raiffeisenplatz 4",
        "Town": "Bergen",
        "Postcode": "83346",
        "CountryID": 87,
        "Latitude": 47.806753,
        "Longitude": 12.591203,
        "ContactTelephone1": "+49 8662 8321",
        "DistanceUnit": 0
    },
    "Connections": [
        {
            "ID": 141078,
            "ConnectionTypeID": 30,
            "StatusTypeID": 50,
            "LevelID": 2,
            "Amps": 32,
            "Voltage": 230,
            "PowerKW": 14,
            "CurrentTypeID": 20,
            "Quantity": 1
        }
    ],
    "NumberOfPoints": 1,
    "GeneralComments": "1 Tesla Connector, up to 14kW.Available to the public. Self park.",
    "StatusTypeID": 50,
    "DateLastStatusUpdate": "2018-10-03T17:13:00Z",
    "DataQualityLevel": 1,
    "DateCreated": "2018-02-06T06:47:00Z",
    "SubmissionStatusTypeID": 200
}