{
    "IsRecentlyVerified": false,
    "ID": 166258,
    "UUID": "283F2ED3-474D-4482-8469-3452EFE2AB36",
    "DataProviderID": 28,
    "DataProvidersReference": "FR*S25*P02539092",
    "UsageTypeID": 5,
    "AddressInfo": {
        "ID": 166617,
        "Title": "Abbaye",
        "AddressLine1": "5 Rue du Val Saugeais",
        "CountryID": 80,
        "Latitude": 46.99242,
        "Longitude": 6.46326,
        "AccessComments": "accessible 24h/24 - 7j/7",
        "DistanceUnit": 0
    },
    "Connections": [
        {
            "ID": 246172,
            "ConnectionTypeID": 1036,
            "StatusTypeID": 50,
            "LevelID": 2,
            "PowerKW": 22,
            "CurrentTypeID": 20
        },
        {
            "ID": 246173,
            "ConnectionTypeID": 1036,
            "StatusTypeID": 50,
            "LevelID": 2,
            "PowerKW": 22,
            "CurrentTypeID": 20
        }
    ],
    "GeneralComments": "recharge normale et accélérée accessible par application smartphone/internet et badge - informations site web freshmile.fr",
    "StatusTypeID": 50,
    "DateLastStatusUpdate": "2020-08-27T05:13:00Z",
    "DataQualityLevel": 2,
    "DateCreated": "2020-08-27T05:13:00Z",
    "SubmissionStatusTypeID": 100
}