{
    "IsRecentlyVerified": false,
    "ID": 169949,
    "UUID": "B92F02FF-F545-4664-ABE2-54F45B8ABA7F",
    "DataProviderID": 1,
    "OperatorID": 2247,
    "UsageTypeID": 4,
    "UsageCost": "0.3 € / kWh",
    "AddressInfo": {
        "ID": 170308,
        "Title": "E.S. El Pastor- AVIA",
        "AddressLine1": "avenida de Madrid 57",
        "Town": "Palencia",
        "Postcode": "34004",
        "CountryID": 210,
        "Latitude": 41.990919,
        "Longitude": -4.511122,
        "ContactTelephone1": "034+34979721172",
        "DistanceUnit": 0
    },
    "Connections": [
        {
            "ID": 258991,
            "ConnectionTypeID": 2,
            "StatusTypeID": 50,
            "LevelID": 3,
            "PowerKW": 43.6,
            "CurrentTypeID": 30,
            "Quantity": 1
        },
        {
            "ID": 258992,
            "ConnectionTypeID": 33,
            "StatusTypeID": 50,
            "LevelID": 3,
            "PowerKW": 43.6,
            "CurrentTypeID": 30,
            "Quantity": 1
        },
        {
            "ID": 258993,
            "ConnectionTypeID": 1036,
            "StatusTypeID": 50,
            "LevelID": 2,
            "PowerKW": 43,
            "Quantity": 1
        }
    ],
    "NumberOfPoints": 1,
    "StatusTypeID": 50,
    "DateLastStatusUpdate": "2021-10-20T11:37:00Z",
    "DataQualityLevel": 1,
    "DateCreated": "2020-11-14T19:18:00Z",
    "SubmissionStatusTypeID": 200
}