{
    "IsRecentlyVerified": false,
    "ID": 62158,
    "UUID": "51FE61D5-83D8-46FD-A87A-0FDA8060E1C4",
    "DataProviderID": 1,
    "OperatorID": 23,
    "OperatorsReference": "13113",
    "UsageTypeID": 1,
    "UsageCost": "Free",
    "AddressInfo": {
        "ID": 62504,
        "Title": "Columbia Inn Restaurant - Tesla",
        "AddressLine1": "29 Main Rd",
        "Town": "Montville",
        "StateOrProvince": "NJ",
        "Postcode": "07045",
        "CountryID": 2,
        "Latitude": 40.9132348,
        "Longitude": -74.390008,
        "ContactTelephone1": "973-268-1300  877-798-3752",
        "AccessComments": "24 hours daily; for Tesla use only",
        "RelatedURL": "http://www.teslamotors.com/supercharger",
        "DistanceUnit": 0
    },
    "Connections": [
        {
            "ID": 79061,
            "ConnectionTypeID": 30,
            "StatusTypeID": 50,
            "LevelID": 2,
            "Amps": 16,
            "Voltage": 230,
            "PowerKW": 8,
            "CurrentTypeID": 10,
            "Quantity": 1
        }
    ],
    "NumberOfPoints": 1,
    "StatusTypeID": 50,
    "DateLastStatusUpdate": "2017-01-26T15:06:00Z",
    "DataQualityLevel": 3,
    "DateCreated": "2016-03-03T11:38:00Z",
    "SubmissionStatusTypeID": 100
}