{
    "IsRecentlyVerified": false,
    "ID": 62959,
    "UUID": "5212D688-53C8-4BFD-9C1C-EA02B6576425",
    "DataProviderID": 26,
    "DataProvidersReference": "75904",
    "OperatorID": 73,
    "OperatorsReference": "EV-Box EVB-P1541644",
    "UsageCost": "0.00 jaarabonnement",
    "AddressInfo": {
        "ID": 63305,
        "Title": "Lisstraat 22",
        "AddressLine1": "Lisstraat 22",
        "Town": "Oisterwijk",
        "Postcode": "5062 HE",
        "CountryID": 159,
        "Latitude": 51.57667,
        "Longitude": 5.19145,
        "RelatedURL": "http://www.ev-box.nl",
        "DistanceUnit": 0
    },
    "Connections": [
        {
            "ID": 80030,
            "ConnectionTypeID": 25,
            "LevelID": 2,
            "PowerKW": 5,
            "CurrentTypeID": 10
        }
    ],
    "NumberOfPoints": 1,
    "StatusTypeID": 50,
    "DateLastStatusUpdate": "2016-06-04T02:39:00Z",
    "DataQualityLevel": 3,
    "DateCreated": "2016-03-03T12:29:00Z",
    "SubmissionStatusTypeID": 100
}