{
    "IsRecentlyVerified": false,
    "ID": 68707,
    "UUID": "D47EE43E-2FAA-48BB-93DD-35EB33E04ABF",
    "DataProviderID": 1,
    "OperatorID": 69,
    "UsageTypeID": 4,
    "AddressInfo": {
        "ID": 69053,
        "Title": "Elisenstraße 3",
        "AddressLine1": "Elisenstraße",
        "Town": "München",
        "StateOrProvince": "Bayern",
        "Postcode": "80335",
        "CountryID": 87,
        "Latitude": 48.1412631,
        "Longitude": 11.562178099999983,
        "ContactTelephone1": "+49 89 3810101",
        "AccessComments": "24/7 nutzbar schräg gegenüber Elisenstraße 3, auf der Parkseite an einer Straßenlaterne mit Ladekarte von Ladenetz, EWE,WSW, ladeticket, TNM oder Charge&Fuel oder SWM.\r\n",
        "RelatedURL": "http://www.swm.de/privatkunden/unternehmen/innovation/elektromobilitaet/swm-ladestationen.html",
        "DistanceUnit": 0
    },
    "Connections": [
        {
            "ID": 96362,
            "ConnectionTypeID": 25,
            "StatusTypeID": 50,
            "LevelID": 2,
            "Amps": 32,
            "Voltage": 400,
            "PowerKW": 22,
            "CurrentTypeID": 20,
            "Quantity": 1
        }
    ],
    "NumberOfPoints": 1,
    "StatusTypeID": 50,
    "DateLastStatusUpdate": "2016-06-19T12:12:00Z",
    "DataQualityLevel": 1,
    "DateCreated": "2016-06-19T12:12:00Z",
    "SubmissionStatusTypeID": 200
}