{
    "IsRecentlyVerified": false,
    "ID": 35724,
    "UUID": "2C651352-BBC1-4090-90DF-2016EE3A9CCB",
    "DataProviderID": 26,
    "DataProvidersReference": "50501",
    "OperatorID": 180,
    "OperatorsReference": "Alfen GDH0031",
    "UsageCost": "0.00 jaarabonnement",
    "AddressInfo": {
        "ID": 36070,
        "Title": "Edisonstraat 94A",
        "AddressLine1": "Edisonstraat 94A",
        "Town": "Den Haag",
        "Postcode": "2561 BH",
        "CountryID": 159,
        "Latitude": 52.075929,
        "Longitude": 4.275688,
        "ContactTelephone1": "036 - 549 34 00",
        "RelatedURL": "http://www.icu-charging-stations.com/",
        "DistanceUnit": 0
    },
    "Connections": [
        {
            "ID": 39235,
            "ConnectionTypeID": 25,
            "LevelID": 2,
            "PowerKW": 11,
            "CurrentTypeID": 10
        },
        {
            "ID": 48020,
            "ConnectionTypeID": 25,
            "LevelID": 2,
            "PowerKW": 11,
            "CurrentTypeID": 10
        }
    ],
    "NumberOfPoints": 1,
    "StatusTypeID": 50,
    "DateLastStatusUpdate": "2016-06-04T02:48:00Z",
    "DataQualityLevel": 3,
    "DateCreated": "2015-01-09T06:05:00Z",
    "SubmissionStatusTypeID": 100
}