{
    "IsRecentlyVerified": false,
    "ID": 177355,
    "UUID": "B0B556BE-F4AB-4520-A0B7-072FD604380D",
    "DataProviderID": 29,
    "DataProvidersReference": "15175",
    "OperatorID": 69,
    "AddressInfo": {
        "ID": 177714,
        "Title": "Volmstr. 31",
        "AddressLine1": "Volmstr. 31",
        "Town": "München",
        "Postcode": "81241",
        "CountryID": 87,
        "Latitude": 48.15008,
        "Longitude": 11.453752,
        "DistanceUnit": 0
    },
    "Connections": [
        {
            "ID": 276410,
            "ConnectionTypeID": 25,
            "StatusTypeID": 50,
            "LevelID": 2,
            "PowerKW": 22,
            "CurrentTypeID": 20
        },
        {
            "ID": 276411,
            "ConnectionTypeID": 25,
            "StatusTypeID": 50,
            "LevelID": 2,
            "PowerKW": 22,
            "CurrentTypeID": 20
        }
    ],
    "StatusTypeID": 0,
    "DateLastStatusUpdate": "2021-07-09T03:11:00Z",
    "MetadataValues": [
        {
            "ID": 9649,
            "MetadataFieldID": 4,
            "ItemValue": "Data from the German chargepoint registry provided by Bundesnetzagentur.de under the CC-BY 4.0 license"
        }
    ],
    "DataQualityLevel": 3,
    "DateCreated": "2021-07-08T09:48:00Z",
    "SubmissionStatusTypeID": 100
}