{
    "MediaItems": [
        {
            "ID": 23152,
            "ChargePointID": 161649,
            "ItemURL": "https://s3-ap-southeast-2.amazonaws.com/openchargemap/images/HR/OCM161649/OCM-161649.orig.2020072119433088.jpg",
            "ItemThumbnailURL": "https://s3-ap-southeast-2.amazonaws.com/openchargemap/images/HR/OCM161649/OCM-161649.thmb.2020072119433088.jpg",
            "Comment": "",
            "IsEnabled": true,
            "IsVideo": false,
            "IsFeaturedItem": false,
            "IsExternalResource": false,
            "User": {
                "ID": 22474,
                "Username": "DavorP"
            },
            "DateCreated": "2020-07-21T19:44:00Z"
        }
    ],
    "IsRecentlyVerified": false,
    "ID": 161649,
    "UUID": "CD90CF96-BD62-492D-BC40-8C5B962BB2C9",
    "DataProviderID": 1,
    "OperatorID": 3384,
    "UsageTypeID": 1,
    "UsageCost": "2,44 HRK per kWh",
    "AddressInfo": {
        "ID": 162006,
        "Title": "16 Lakes Hotel",
        "AddressLine1": "Brajdić Selo",
        "Town": "Rakovica",
        "Postcode": "47245",
        "CountryID": 60,
        "Latitude": 44.971369,
        "Longitude": 15.650676,
        "DistanceUnit": 0
    },
    "Connections": [
        {
            "ID": 232611,
            "ConnectionTypeID": 25,
            "StatusTypeID": 50,
            "LevelID": 2,
            "Amps": 32,
            "Voltage": 400,
            "PowerKW": 22,
            "CurrentTypeID": 20,
            "Quantity": 1
        }
    ],
    "NumberOfPoints": 1,
    "GeneralComments": "Activate with plugsurfing app or T-com RFID",
    "StatusTypeID": 50,
    "DateLastStatusUpdate": "2020-07-21T19:44:00Z",
    "DataQualityLevel": 1,
    "DateCreated": "2020-07-19T08:29:00Z",
    "SubmissionStatusTypeID": 200
}