{
    "IsRecentlyVerified": false,
    "ID": 46402,
    "UUID": "BACCB983-9869-438F-9225-48E9288FC9C9",
    "DataProviderID": 1,
    "DataProvidersReference": "1157",
    "AddressInfo": {
        "ID": 46748,
        "Title": "Motor Forum Lillestrøm",
        "AddressLine1": "Jogstadveien 19",
        "Town": "KJELLER",
        "StateOrProvince": "Viken",
        "Postcode": "2007",
        "CountryID": 168,
        "Latitude": 59.98147,
        "Longitude": 11.00936,
        "AccessComments": "Ved siden av hovedinngangen.",
        "DistanceUnit": 0
    },
    "Connections": [
        {
            "ID": 57065,
            "ConnectionTypeID": 0,
            "Reference": "1",
            "LevelID": 2,
            "Amps": 16,
            "Voltage": 230,
            "PowerKW": 3.7,
            "Comments": "Mode 1"
        },
        {
            "ID": 88836,
            "ConnectionTypeID": 0,
            "Reference": "2",
            "LevelID": 2,
            "Amps": 16,
            "Voltage": 230,
            "PowerKW": 3.7,
            "Comments": "Mode 1"
        }
    ],
    "NumberOfPoints": 2,
    "DateLastStatusUpdate": "2020-05-26T08:23:00Z",
    "DataQualityLevel": 2,
    "DateCreated": "2015-05-03T00:54:00Z",
    "SubmissionStatusTypeID": 100
}