{
    "IsRecentlyVerified": false,
    "ID": 87361,
    "UUID": "829068B9-49D0-48B4-B360-53B8F671DF9C",
    "DataProviderID": 1,
    "OperatorID": 23,
    "OperatorsReference": "29201",
    "UsageTypeID": 4,
    "AddressInfo": {
        "ID": 87707,
        "Title": "Domaine de Mialaret",
        "AddressLine1": "Route d'Egletons",
        "Town": "Neuvic",
        "Postcode": "19160",
        "CountryID": 80,
        "Latitude": 45.383336,
        "Longitude": 2.228345,
        "ContactTelephone1": "+33 5 55 46 02 50",
        "DistanceUnit": 0
    },
    "Connections": [
        {
            "ID": 123834,
            "ConnectionTypeID": 30,
            "StatusTypeID": 50,
            "LevelID": 2,
            "Amps": 32,
            "Voltage": 230,
            "PowerKW": 17,
            "CurrentTypeID": 20,
            "Quantity": 1
        }
    ],
    "NumberOfPoints": 1,
    "GeneralComments": "1 Tesla Connector, up to 17kW.Available to the public. Please see front desk.",
    "StatusTypeID": 50,
    "DateLastStatusUpdate": "2018-10-03T14:06:00Z",
    "DataQualityLevel": 1,
    "DateCreated": "2017-05-05T05:34:00Z",
    "SubmissionStatusTypeID": 200
}