{
    "IsRecentlyVerified": false,
    "ID": 182556,
    "UUID": "63EF7DCF-4495-4C5E-B19D-92B7E6733305",
    "DataProviderID": 29,
    "DataProvidersReference": "4273",
    "OperatorID": 127,
    "AddressInfo": {
        "ID": 182915,
        "Title": "Rohdestraße",
        "AddressLine1": "Rohdestraße",
        "Town": "Cuxhaven",
        "Postcode": "27478",
        "CountryID": 87,
        "Latitude": 53.8623163,
        "Longitude": 8.69748509999999,
        "DistanceUnit": 0
    },
    "Connections": [
        {
            "ID": 288455,
            "ConnectionTypeID": 25,
            "StatusTypeID": 50,
            "LevelID": 2,
            "PowerKW": 11,
            "CurrentTypeID": 20
        },
        {
            "ID": 288456,
            "ConnectionTypeID": 25,
            "StatusTypeID": 50,
            "LevelID": 2,
            "PowerKW": 22,
            "CurrentTypeID": 20
        }
    ],
    "StatusTypeID": 50,
    "DateLastStatusUpdate": "2021-07-12T02:52:00Z",
    "MetadataValues": [
        {
            "ID": 14849,
            "MetadataFieldID": 4,
            "ItemValue": "Data from the German chargepoint registry provided by Bundesnetzagentur.de under the CC-BY 4.0 license"
        }
    ],
    "DataQualityLevel": 3,
    "DateCreated": "2021-07-08T10:03:00Z",
    "SubmissionStatusTypeID": 100
}