{
    "IsRecentlyVerified": false,
    "ID": 100599,
    "UUID": "111F88DC-5FDE-4A52-9F00-6C1B87AEFF46",
    "DataProviderID": 1,
    "OperatorID": 23,
    "OperatorsReference": "41111",
    "UsageTypeID": 4,
    "AddressInfo": {
        "ID": 100945,
        "Title": "Royal Sonesta Hotel - Houston, TX",
        "AddressLine1": "2222 W Loop S",
        "Town": "Houston",
        "StateOrProvince": "Texas",
        "Postcode": "77027",
        "CountryID": 2,
        "Latitude": 29.744261,
        "Longitude": -95.458778,
        "ContactTelephone1": "(713) 627-7600",
        "DistanceUnit": 0
    },
    "Connections": [
        {
            "ID": 142091,
            "ConnectionTypeID": 30,
            "StatusTypeID": 50,
            "LevelID": 2,
            "PowerKW": 16,
            "CurrentTypeID": 20,
            "Quantity": 4
        }
    ],
    "NumberOfPoints": 4,
    "GeneralComments": "4 Tesla Connectors, up to 16kW.Available for customers. Please see front desk.",
    "StatusTypeID": 50,
    "DateLastStatusUpdate": "2018-03-02T06:55:00Z",
    "DataQualityLevel": 1,
    "DateCreated": "2018-03-02T06:55:00Z",
    "SubmissionStatusTypeID": 200
}