{
    "IsRecentlyVerified": false,
    "ID": 24669,
    "UUID": "D2601965-F8DD-4AD3-A086-178631CC3D48",
    "DataProviderID": 1,
    "OperatorID": 136,
    "UsageTypeID": 4,
    "UsageCost": "AC 15cnt/kWh + 100cnt/h",
    "AddressInfo": {
        "ID": 25015,
        "Title": "Siilitien Metroasema",
        "AddressLine1": "Siilitie ",
        "AddressLine2": "",
        "Town": "Helsinki",
        "StateOrProvince": "Uusimaa",
        "Postcode": "",
        "CountryID": 79,
        "Latitude": 60.20627543623292,
        "Longitude": 25.044225454330444,
        "ContactTelephone1": "",
        "ContactTelephone2": "",
        "ContactEmail": "",
        "AccessComments": "P-Alue/Parking place",
        "RelatedURL": "http://www.virta.fi",
        "DistanceUnit": 0
    },
    "Connections": [
        {
            "ID": 26967,
            "ConnectionTypeID": 28,
            "StatusTypeID": 50,
            "LevelID": 2,
            "Amps": 16,
            "Voltage": 230,
            "PowerKW": 3,
            "CurrentTypeID": 10,
            "Quantity": 2
        },
        {
            "ID": 50178,
            "ConnectionTypeID": 25,
            "StatusTypeID": 50,
            "LevelID": 2,
            "Amps": 32,
            "Voltage": 400,
            "PowerKW": 22,
            "CurrentTypeID": 20,
            "Quantity": 2
        }
    ],
    "NumberOfPoints": 2,
    "GeneralComments": "",
    "StatusTypeID": 50,
    "DateLastStatusUpdate": "2015-03-27T21:49:00Z",
    "MetadataValues": [
        {
            "ID": 1063,
            "MetadataFieldID": 4,
            "ItemValue": "Data © OpenStreetMap contributors, ODbL 1.0. http://www.openstreetmap.org/copyright"
        }
    ],
    "DataQualityLevel": 1,
    "DateCreated": "2014-10-26T02:00:00Z",
    "SubmissionStatusTypeID": 200
}