{
    "IsRecentlyVerified": false,
    "ID": 154159,
    "UUID": "894B3F33-B691-47A4-AC01-1EB05E2D8827",
    "DataProviderID": 28,
    "DataProvidersReference": "FR*S60*PANDEVILLE",
    "OperatorID": 3379,
    "UsageTypeID": 5,
    "AddressInfo": {
        "ID": 154512,
        "Title": "Andeville, Jean-Jaurès",
        "AddressLine1": "2 Rue Jean Jaurès 60570 Andeville",
        "CountryID": 80,
        "Latitude": 49.2591,
        "Longitude": 2.16567,
        "AccessComments": "24h/24 7j/7",
        "DistanceUnit": 0
    },
    "Connections": [
        {
            "ID": 216673,
            "ConnectionTypeID": 1036,
            "StatusTypeID": 50,
            "LevelID": 2,
            "PowerKW": 22,
            "CurrentTypeID": 20
        },
        {
            "ID": 251034,
            "ConnectionTypeID": 1036,
            "StatusTypeID": 50,
            "LevelID": 2,
            "PowerKW": 22,
            "CurrentTypeID": 20
        }
    ],
    "GeneralComments": "",
    "StatusTypeID": 50,
    "DateLastStatusUpdate": "2020-08-27T05:16:00Z",
    "DataQualityLevel": 2,
    "DateCreated": "2020-03-15T10:55:00Z",
    "SubmissionStatusTypeID": 100
}