{
    "IsRecentlyVerified": false,
    "ID": 116208,
    "UUID": "87DA31CE-8098-4306-B9A4-249C326FAE0A",
    "DataProviderID": 2,
    "DataProvidersReference": "116364",
    "OperatorID": 23,
    "UsageTypeID": 1,
    "AddressInfo": {
        "ID": 116554,
        "Title": "Ramada Revelstoke - Tesla Destination",
        "AddressLine1": "1750  Trans-Canada Hwy",
        "Town": "Revelstoke",
        "StateOrProvince": "BC",
        "Postcode": "V0E 2S0",
        "CountryID": 44,
        "Latitude": 51.007859,
        "Longitude": -118.205719,
        "ContactTelephone1": "250-837-4741  877-798-3752",
        "AccessComments": "24 hours daily; for customer use only; see front desk for access",
        "RelatedURL": "https://www.tesla.com/destination-charging",
        "DistanceUnit": 0
    },
    "Connections": [
        {
            "ID": 163285,
            "ConnectionTypeID": 30,
            "LevelID": 2,
            "Amps": 16,
            "Voltage": 230,
            "PowerKW": 3.7,
            "CurrentTypeID": 10,
            "Quantity": 2
        }
    ],
    "DateLastStatusUpdate": "2020-06-26T03:12:00Z",
    "DataQualityLevel": 3,
    "DateCreated": "2019-02-11T07:13:00Z",
    "SubmissionStatusTypeID": 100
}