{
    "IsRecentlyVerified": false,
    "ID": 181941,
    "UUID": "AE766833-1E85-4852-ACD4-6C734FBB76AF",
    "DataProviderID": 29,
    "DataProvidersReference": "20412",
    "OperatorID": 45,
    "AddressInfo": {
        "ID": 182300,
        "Title": "Sachsendorfer Str. 3",
        "AddressLine1": "Sachsendorfer Str. 3",
        "Town": "Cottbus",
        "Postcode": "03051",
        "CountryID": 87,
        "Latitude": 51.7149182,
        "Longitude": 14.3175221,
        "DistanceUnit": 0
    },
    "Connections": [
        {
            "ID": 287012,
            "ConnectionTypeID": 25,
            "StatusTypeID": 50,
            "LevelID": 2,
            "PowerKW": 22,
            "CurrentTypeID": 20
        },
        {
            "ID": 287013,
            "ConnectionTypeID": 25,
            "StatusTypeID": 50,
            "LevelID": 2,
            "PowerKW": 22,
            "CurrentTypeID": 20
        }
    ],
    "StatusTypeID": 50,
    "DateLastStatusUpdate": "2021-07-12T02:48:00Z",
    "MetadataValues": [
        {
            "ID": 14235,
            "MetadataFieldID": 4,
            "ItemValue": "Data from the German chargepoint registry provided by Bundesnetzagentur.de under the CC-BY 4.0 license"
        }
    ],
    "DataQualityLevel": 3,
    "DateCreated": "2021-07-08T10:02:00Z",
    "SubmissionStatusTypeID": 100
}