{
    "IsRecentlyVerified": false,
    "ID": 4802,
    "UUID": "C54712D5-F643-4949-A2DF-DDA14AB7895C",
    "DataProviderID": 2,
    "DataProvidersReference": "39845",
    "UsageTypeID": 7,
    "AddressInfo": {
        "ID": 4745,
        "Title": "Twin City Nissan",
        "AddressLine1": "3247 Airport Hwy",
        "Town": "Alcoa",
        "StateOrProvince": "TN",
        "Postcode": "37701",
        "CountryID": 2,
        "Latitude": 35.830558,
        "Longitude": -83.97512,
        "ContactTelephone1": "865-970-4132",
        "AccessComments": "Dealership business hours\r\nPublic - Call ahead",
        "RelatedURL": "",
        "DistanceUnit": 0
    },
    "Connections": [
        {
            "ID": 15856,
            "ConnectionTypeID": 1,
            "LevelID": 2,
            "Amps": 16,
            "Voltage": 230,
            "PowerKW": 3.7,
            "CurrentTypeID": 10,
            "Quantity": 1
        },
        {
            "ID": 20829,
            "ConnectionTypeID": 1,
            "LevelID": 2,
            "Quantity": 1
        }
    ],
    "DateLastConfirmed": "2011-05-31T00:00:00Z",
    "StatusTypeID": 0,
    "DateLastStatusUpdate": "2020-06-26T02:58:00Z",
    "DataQualityLevel": 1,
    "DateCreated": "2011-07-04T18:02:00Z",
    "SubmissionStatusTypeID": 100
}