{
    "IsRecentlyVerified": false,
    "ID": 139092,
    "UUID": "6C910B24-E06B-4A03-91B9-068344FF8D8E",
    "DataProviderID": 2,
    "DataProvidersReference": "149639",
    "OperatorID": 3318,
    "UsageTypeID": 1,
    "AddressInfo": {
        "ID": 139444,
        "Title": "Sam's Club 4822 - Murrieta, CA",
        "AddressLine1": "40500 MURRIETA HOT SPRINGS RD.",
        "Town": "Murrieta",
        "StateOrProvince": "CA",
        "Postcode": "92563",
        "CountryID": 2,
        "Latitude": 33.554053,
        "Longitude": -117.176769,
        "ContactTelephone1": "833-632-2778",
        "AccessComments": "24 hours daily",
        "RelatedURL": "https://www.electrifyamerica.com/",
        "DistanceUnit": 0
    },
    "Connections": [
        {
            "ID": 194348,
            "ConnectionTypeID": 2,
            "LevelID": 3,
            "Amps": 100,
            "Voltage": 400,
            "PowerKW": 40,
            "CurrentTypeID": 30,
            "Quantity": 1
        },
        {
            "ID": 194349,
            "ConnectionTypeID": 32,
            "LevelID": 3,
            "Amps": 100,
            "Voltage": 400,
            "PowerKW": 40,
            "CurrentTypeID": 30,
            "Quantity": 1
        }
    ],
    "StatusTypeID": 50,
    "DateLastStatusUpdate": "2020-06-26T02:55:00Z",
    "DataQualityLevel": 3,
    "DateCreated": "2019-12-24T09:10:00Z",
    "SubmissionStatusTypeID": 100
}