{
    "IsRecentlyVerified": false,
    "ID": 135946,
    "UUID": "93D6ACFB-2BA0-4882-9C50-2CEA853D966E",
    "DataProviderID": 18,
    "DataProvidersReference": "46de73801e0fb65f663c45192d9a435a",
    "OperatorID": 2244,
    "UsageTypeID": 5,
    "AddressInfo": {
        "ID": 136292,
        "Title": "Grove Road",
        "AddressLine1": "Grove Road",
        "Town": "Barnes, London",
        "Postcode": "SW13 0HH",
        "CountryID": 1,
        "Latitude": 51.472797,
        "Longitude": -0.250221,
        "AccessComments": "",
        "RelatedURL": "https://www.ubitricity.com",
        "DistanceUnit": 0
    },
    "Connections": [
        {
            "ID": 190372,
            "ConnectionTypeID": 25,
            "Reference": "suby1100000331",
            "StatusTypeID": 50,
            "LevelID": 2,
            "Amps": 16,
            "Voltage": 230,
            "PowerKW": 3.7,
            "CurrentTypeID": 10
        }
    ],
    "StatusTypeID": 0,
    "DateLastStatusUpdate": "2021-04-25T05:46:00Z",
    "MetadataValues": [
        {
            "ID": 5798,
            "MetadataFieldID": 4,
            "ItemValue": "Contains public sector information licensed under the Open Government Licence v2.0. http://www.nationalarchives.gov.uk/doc/open-government-licence/version/2/"
        }
    ],
    "DataQualityLevel": 3,
    "DateCreated": "2019-12-24T05:22:00Z",
    "SubmissionStatusTypeID": 100
}