{
    "IsRecentlyVerified": false,
    "ID": 109039,
    "UUID": "8F8CB2DA-A0AB-4CEC-AF9B-62D9E63531BD",
    "DataProviderID": 1,
    "OperatorID": 23,
    "OperatorsReference": "46162",
    "UsageTypeID": 4,
    "AddressInfo": {
        "ID": 109385,
        "Title": "Parc Hotel Am See",
        "AddressLine1": "Klughammer",
        "Town": "Kaltern",
        "Postcode": "39052",
        "CountryID": 112,
        "Latitude": 46.383819,
        "Longitude": 11.269741,
        "ContactTelephone1": "+39 0471 960 000",
        "DistanceUnit": 0
    },
    "Connections": [
        {
            "ID": 154157,
            "ConnectionTypeID": 30,
            "StatusTypeID": 50,
            "LevelID": 2,
            "Amps": 32,
            "Voltage": 400,
            "PowerKW": 22,
            "CurrentTypeID": 20,
            "Quantity": 2
        }
    ],
    "NumberOfPoints": 2,
    "GeneralComments": "2 Tesla Connectors, up to 22kW.Available for customers. Please call ahead.",
    "StatusTypeID": 50,
    "DateLastStatusUpdate": "2018-10-11T13:26:00Z",
    "DataQualityLevel": 1,
    "DateCreated": "2018-10-11T13:26:00Z",
    "SubmissionStatusTypeID": 200
}