{
    "IsRecentlyVerified": false,
    "ID": 174771,
    "UUID": "10137071-A11F-42AD-B2A3-EB69F5C4BFBD",
    "DataProviderID": 1,
    "OperatorID": 3323,
    "UsageTypeID": 4,
    "AddressInfo": {
        "ID": 175130,
        "Title": "D300",
        "AddressLine1": "D300",
        "AddressLine2": "Dörtyol",
        "Town": "Afyonkarahisar",
        "StateOrProvince": "Afyonkarahisar Merkez",
        "CountryID": 229,
        "Latitude": 38.79031420539073,
        "Longitude": 30.45954508321006,
        "DistanceUnit": 0
    },
    "Connections": [
        {
            "ID": 270806,
            "ConnectionTypeID": 25,
            "StatusTypeID": 50,
            "LevelID": 2,
            "PowerKW": 22,
            "CurrentTypeID": 20,
            "Quantity": 1
        }
    ],
    "NumberOfPoints": 1,
    "StatusTypeID": 50,
    "DateLastStatusUpdate": "2021-10-21T16:27:00Z",
    "DataQualityLevel": 1,
    "DateCreated": "2021-04-11T21:48:00Z",
    "SubmissionStatusTypeID": 200
}