{
    "IsRecentlyVerified": false,
    "ID": 65652,
    "UUID": "9DFFFA2A-C5C0-43D9-862A-DAE9A189E91B",
    "DataProviderID": 26,
    "DataProvidersReference": "83833",
    "OperatorID": 157,
    "OperatorsReference": "NewMotion 03004896",
    "UsageCost": "0.00 jaarabonnement",
    "AddressInfo": {
        "ID": 65998,
        "Title": "Maarsseveensevaart 7A",
        "AddressLine1": "Maarsseveensevaart 7A",
        "Town": "Stichtse Vecht",
        "Postcode": "3601 CC",
        "CountryID": 159,
        "Latitude": 52.1470111,
        "Longitude": 5.0614018,
        "ContactTelephone1": "088 0109500",
        "RelatedURL": "http://thenewmotion.nl/",
        "DistanceUnit": 0
    },
    "Connections": [
        {
            "ID": 90593,
            "ConnectionTypeID": 25,
            "LevelID": 2,
            "PowerKW": 22,
            "CurrentTypeID": 10
        }
    ],
    "NumberOfPoints": 1,
    "StatusTypeID": 50,
    "DateLastStatusUpdate": "2016-06-04T02:50:00Z",
    "DataQualityLevel": 3,
    "DateCreated": "2016-04-27T09:42:00Z",
    "SubmissionStatusTypeID": 100
}