{
    "IsRecentlyVerified": false,
    "ID": 93362,
    "UUID": "5BC5C545-C030-49A8-B8EC-48CB6178F654",
    "DataProviderID": 1,
    "OperatorID": 23,
    "OperatorsReference": "35847",
    "UsageTypeID": 6,
    "AddressInfo": {
        "ID": 93708,
        "Title": "Ai Pozzi Village & Spa",
        "AddressLine1": "Via Silvio Amico",
        "Town": "35/d",
        "StateOrProvince": "Loano",
        "Postcode": "17025",
        "CountryID": 112,
        "Latitude": 44.130548,
        "Longitude": 8.243471,
        "ContactTelephone1": "+39 019 674 159",
        "DistanceUnit": 0
    },
    "Connections": [
        {
            "ID": 132239,
            "ConnectionTypeID": 30,
            "StatusTypeID": 50,
            "LevelID": 2,
            "Amps": 32,
            "Voltage": 230,
            "PowerKW": 17,
            "CurrentTypeID": 20,
            "Quantity": 1
        }
    ],
    "NumberOfPoints": 1,
    "GeneralComments": "1 Tesla Connector, up to 17kW.Available for patrons only. Please call ahead.",
    "StatusTypeID": 50,
    "DateLastStatusUpdate": "2018-10-03T23:21:00Z",
    "DataQualityLevel": 1,
    "DateCreated": "2017-09-27T19:22:00Z",
    "SubmissionStatusTypeID": 200
}