{
    "MediaItems": [
        {
            "ID": 756,
            "ChargePointID": 31241,
            "ItemURL": "https://s3-ap-southeast-2.amazonaws.com/openchargemap/images/HK/OCM31241/OCM-31241.orig.2014121805460013.jpg",
            "ItemThumbnailURL": "https://s3-ap-southeast-2.amazonaws.com/openchargemap/images/HK/OCM31241/OCM-31241.thmb.2014121805460013.jpg",
            "Comment": "A day out in Hong Kong, we parked here for 7 hours while roaming Sham Shui Po / Mong Kok area, and came back to an almost fully charged car. Should have come 10 minutes before, we actually paid for 8 hours (16 HKD/h on weekdays, 13/h on weekends/PH)",
            "IsEnabled": true,
            "IsVideo": false,
            "IsFeaturedItem": false,
            "IsExternalResource": false,
            "User": {
                "ID": 3420,
                "Username": "74pilot"
            },
            "DateCreated": "2014-12-18T05:46:00Z"
        },
        {
            "ID": 755,
            "ChargePointID": 31241,
            "ItemURL": "https://s3-ap-southeast-2.amazonaws.com/openchargemap/images/HK/OCM31241/OCM-31241.orig.2014121805434952.jpg",
            "ItemThumbnailURL": "https://s3-ap-southeast-2.amazonaws.com/openchargemap/images/HK/OCM31241/OCM-31241.thmb.2014121805434952.jpg",
            "Comment": "Despite saying 1st floor is only for monthly parking, it is also where the EV charging spots are. ",
            "IsEnabled": true,
            "IsVideo": false,
            "IsFeaturedItem": false,
            "IsExternalResource": false,
            "User": {
                "ID": 3420,
                "Username": "74pilot"
            },
            "DateCreated": "2014-12-18T05:44:00Z"
        },
        {
            "ID": 754,
            "ChargePointID": 31241,
            "ItemURL": "https://s3-ap-southeast-2.amazonaws.com/openchargemap/images/HK/OCM31241/OCM-31241.orig.2014121805420671.jpg",
            "ItemThumbnailURL": "https://s3-ap-southeast-2.amazonaws.com/openchargemap/images/HK/OCM31241/OCM-31241.thmb.2014121805420671.jpg",
            "Comment": "Note the two parking garage entry signs in this picture. Take the FIRST one, the second one leads to another parking lot with no chargers (that I know of).",
            "IsEnabled": true,
            "IsVideo": false,
            "IsFeaturedItem": false,
            "IsExternalResource": false,
            "User": {
                "ID": 3420,
                "Username": "74pilot"
            },
            "DateCreated": "2014-12-18T05:42:00Z"
        }
    ],
    "IsRecentlyVerified": false,
    "ID": 31241,
    "UUID": "1608C3AB-58BC-4DB3-BC9C-6592F723C2BA",
    "DataProviderID": 1,
    "OperatorID": 111,
    "UsageTypeID": 4,
    "UsageCost": "Free at the moment (Dec 2014)",
    "AddressInfo": {
        "ID": 31587,
        "Title": "Laws Commercial Plaza",
        "AddressLine1": "788 Cheung Sha Wan Road",
        "AddressLine2": "Lai Chi Kok, Cheung Sha Wan",
        "Town": "Sham Shui Po District",
        "StateOrProvince": "Kowloon",
        "Postcode": "",
        "CountryID": 4,
        "Latitude": 22.338138092553034,
        "Longitude": 114.15004134178162,
        "ContactTelephone1": "(852) 2371 1988",
        "ContactTelephone2": "",
        "ContactEmail": "enquire@lawsproperties.com",
        "AccessComments": "Be aware of TWO parking garage entries just next to each other, choose the FIRST one (Laws). See the picture I uploaded. Also be aware you need to keep left, into the off-side separate car lane, in order to access this place. Only one floor up, electric chargers are on the right side. Can be hard to access, especially with a Tesla Model S. NOTE: Requires EV-link",
        "RelatedURL": "http://www.lawsgroup.com/contact.php",
        "DistanceUnit": 0
    },
    "Connections": [
        {
            "ID": 34518,
            "ConnectionTypeID": 25,
            "StatusTypeID": 50,
            "LevelID": 2,
            "Amps": 32,
            "Voltage": 230,
            "PowerKW": 7.2,
            "CurrentTypeID": 10,
            "Quantity": 2
        }
    ],
    "NumberOfPoints": 2,
    "GeneralComments": "32A single phase charging, 3.5 times faster than the usual 13A BS1363. Requires EV-link chip to activate. You need your own Type-2 cable (the thick blue cable that comes with Tesla Model S), and it will lock in the charging station as well - requires the EV-link to unlock the cable again (or using the E-charge app from HK EVpower. Parking is 16HKD/hr on weekdays, 13HKD/h on weekends and public holidays. With 32A charging, it's worth it, take a walk to the Lai Chi Kok MTR near by and leave the car charging while doing your business, charging at around 32 km/h (Tesla Model S). Staff seem very focused on the chargers not being blocked by ICE cars, not even by an EV NOT charging. I wasn't even done parking when a staff member came to ask 1) are you parking and 2) will you be charging. ",
    "StatusTypeID": 50,
    "DateLastStatusUpdate": "2014-12-19T05:00:00Z",
    "DataQualityLevel": 1,
    "DateCreated": "2014-12-18T05:32:00Z",
    "SubmissionStatusTypeID": 200
}