{
    "IsRecentlyVerified": false,
    "ID": 26861,
    "UUID": "084B9778-572A-4411-94B4-FB699A534C9A",
    "DataProviderID": 1,
    "OperatorID": 23,
    "OperatorsReference": "6548",
    "UsageTypeID": 1,
    "UsageCost": "$0.22/min >=60kW; $0.11/min <60kW; other tariffs for older cars",
    "AddressInfo": {
        "ID": 27207,
        "Title": "Wickenburg Town Hall - Tesla",
        "AddressLine1": "155 N Tegner St",
        "Town": "Wickenburg",
        "StateOrProvince": "AZ",
        "Postcode": "85390",
        "CountryID": 2,
        "Latitude": 33.9700056,
        "Longitude": -112.7309542,
        "ContactTelephone1": "877-798-3752",
        "AccessComments": "24 hours daily; for Tesla use only",
        "RelatedURL": "http://www.teslamotors.com/supercharger",
        "DistanceUnit": 0
    },
    "Connections": [
        {
            "ID": 29413,
            "ConnectionTypeID": 27,
            "StatusTypeID": 50,
            "LevelID": 3,
            "Amps": 100,
            "Voltage": 400,
            "PowerKW": 120,
            "CurrentTypeID": 30,
            "Quantity": 8
        }
    ],
    "NumberOfPoints": 8,
    "StatusTypeID": 50,
    "DateLastStatusUpdate": "2019-04-19T06:00:00Z",
    "DataQualityLevel": 3,
    "DateCreated": "2014-11-28T03:37:00Z",
    "SubmissionStatusTypeID": 100
}