{
    "IsRecentlyVerified": false,
    "ID": 18055,
    "UUID": "E259D835-983B-46EC-B437-3774456AFC3D",
    "DataProviderID": 22,
    "DataProvidersReference": "65F675B3CF48B79D1D4FE970F1688C6B",
    "AddressInfo": {
        "ID": 18400,
        "Title": "ファミリーマート唐津佐志店",
        "AddressLine1": "佐賀県唐津市佐志386-5",
        "CountryID": 114,
        "Latitude": 33.46370076,
        "Longitude": 129.9406698,
        "ContactTelephone1": "0955-70-1051",
        "DistanceUnit": 0
    },
    "Connections": [
        {
            "ID": 18296,
            "ConnectionTypeID": 2,
            "LevelID": 2,
            "Amps": 100,
            "Voltage": 480,
            "PowerKW": 48,
            "Quantity": 1
        }
    ],
    "DateLastStatusUpdate": "2013-06-29T09:07:00Z",
    "DataQualityLevel": 2,
    "DateCreated": "2013-06-29T09:07:00Z",
    "SubmissionStatusTypeID": 200
}