{
    "IsRecentlyVerified": false,
    "ID": 123153,
    "UUID": "56641FCE-DE4A-4E55-9B3B-B5B2DA42E3A6",
    "DataProviderID": 2,
    "DataProvidersReference": "87656",
    "OperatorID": 5,
    "UsageTypeID": 1,
    "AddressInfo": {
        "ID": 123499,
        "Title": "TOWN OF CARY",
        "AddressLine1": "801 High House Road Bond Park Boathouse",
        "Town": "Cary",
        "StateOrProvince": "NC",
        "Postcode": "27513",
        "CountryID": 2,
        "Latitude": 35.7813041,
        "Longitude": -78.8255524,
        "ContactTelephone1": "888-758-4389",
        "AccessComments": "24 hours daily",
        "RelatedURL": "http://www.chargepoint.com/",
        "DistanceUnit": 0
    },
    "Connections": [
        {
            "ID": 173102,
            "ConnectionTypeID": 1,
            "LevelID": 2,
            "Amps": 16,
            "Voltage": 230,
            "PowerKW": 3.7,
            "CurrentTypeID": 10,
            "Quantity": 2
        }
    ],
    "DateLastStatusUpdate": "2020-06-26T02:58:00Z",
    "DataQualityLevel": 3,
    "DateCreated": "2019-04-06T05:03:00Z",
    "SubmissionStatusTypeID": 100
}