{
    "IsRecentlyVerified": false,
    "ID": 153128,
    "UUID": "FEB77CAF-AB55-49F1-929C-5EBCD92B0E77",
    "DataProviderID": 28,
    "DataProvidersReference": "FR*S41*P41148-45",
    "UsageTypeID": 5,
    "AddressInfo": {
        "ID": 153481,
        "Title": "Montoire-sur-le-Loir | Place Clemenceau",
        "AddressLine1": "Place Clemenceau 41800 Montoire-sur-le-Loir",
        "CountryID": 80,
        "Latitude": 47.752658,
        "Longitude": 0.862059,
        "AccessComments": "24/24 7/7",
        "DistanceUnit": 0
    },
    "Connections": [
        {
            "ID": 214670,
            "ConnectionTypeID": 25,
            "StatusTypeID": 50,
            "LevelID": 2,
            "PowerKW": 18,
            "CurrentTypeID": 20
        },
        {
            "ID": 214671,
            "ConnectionTypeID": 28,
            "StatusTypeID": 50,
            "LevelID": 2,
            "PowerKW": 18,
            "CurrentTypeID": 10
        },
        {
            "ID": 248027,
            "ConnectionTypeID": 25,
            "StatusTypeID": 50,
            "LevelID": 2,
            "PowerKW": 18,
            "CurrentTypeID": 20
        },
        {
            "ID": 248028,
            "ConnectionTypeID": 28,
            "StatusTypeID": 50,
            "LevelID": 2,
            "PowerKW": 18,
            "CurrentTypeID": 10
        }
    ],
    "GeneralComments": "",
    "StatusTypeID": 50,
    "DateLastStatusUpdate": "2020-08-27T05:14:00Z",
    "DataQualityLevel": 2,
    "DateCreated": "2020-03-15T10:54:00Z",
    "SubmissionStatusTypeID": 100
}