{
    "IsRecentlyVerified": false,
    "ID": 186277,
    "UUID": "D3214C0C-00E5-46DF-8E5B-AB6BC9C7EB1D",
    "DataProviderID": 29,
    "DataProvidersReference": "3196",
    "AddressInfo": {
        "ID": 186636,
        "Title": "Eichenweg 1",
        "AddressLine1": "Eichenweg 1",
        "Town": "Petersberg",
        "Postcode": "07616",
        "CountryID": 87,
        "Latitude": 50.968689,
        "Longitude": 11.85273,
        "DistanceUnit": 0
    },
    "Connections": [
        {
            "ID": 298544,
            "ConnectionTypeID": 33,
            "StatusTypeID": 50,
            "LevelID": 3,
            "PowerKW": 55,
            "CurrentTypeID": 30
        }
    ],
    "StatusTypeID": 50,
    "DateLastStatusUpdate": "2021-07-12T02:46:00Z",
    "MetadataValues": [
        {
            "ID": 18518,
            "MetadataFieldID": 4,
            "ItemValue": "Data from the German chargepoint registry provided by Bundesnetzagentur.de under the CC-BY 4.0 license"
        }
    ],
    "DataQualityLevel": 3,
    "DateCreated": "2021-07-12T02:46:00Z",
    "SubmissionStatusTypeID": 100
}