{
    "IsRecentlyVerified": false,
    "ID": 92526,
    "UUID": "C1C8B346-C7C7-466A-B80C-46462A099F6B",
    "DataProviderID": 1,
    "OperatorID": 23,
    "OperatorsReference": "33612",
    "UsageTypeID": 4,
    "AddressInfo": {
        "ID": 92872,
        "Title": "Timberlake Hotel",
        "AddressLine1": "1212 2ND Ave Ne",
        "Town": "Staples",
        "StateOrProvince": "Minnesota",
        "Postcode": "56479",
        "CountryID": 2,
        "Latitude": 46.355184,
        "Longitude": -94.782643,
        "ContactTelephone1": "(218) 895-1300",
        "DistanceUnit": 0
    },
    "Connections": [
        {
            "ID": 131127,
            "ConnectionTypeID": 30,
            "StatusTypeID": 50,
            "LevelID": 2,
            "PowerKW": 16,
            "CurrentTypeID": 20,
            "Quantity": 2
        }
    ],
    "NumberOfPoints": 2,
    "GeneralComments": "2 Tesla Connectors, up to 16kW.Available for customers. Please see front desk.",
    "StatusTypeID": 50,
    "DateLastStatusUpdate": "2017-09-07T05:56:00Z",
    "DataQualityLevel": 1,
    "DateCreated": "2017-09-07T05:56:00Z",
    "SubmissionStatusTypeID": 200
}