{
    "IsRecentlyVerified": false,
    "ID": 87977,
    "UUID": "90EBC88D-CCDB-434B-82E7-9E3DD1FA48B8",
    "DataProviderID": 1,
    "OperatorID": 23,
    "OperatorsReference": "29512",
    "UsageTypeID": 6,
    "AddressInfo": {
        "ID": 88323,
        "Title": "Hawthorn Suites By Wyndham Naples",
        "AddressLine1": "3557 Pine Ridge RD",
        "Town": "Naples",
        "StateOrProvince": "Florida",
        "Postcode": "34109",
        "CountryID": 2,
        "Latitude": 26.212753,
        "Longitude": -81.746669,
        "ContactTelephone1": "(239) 593-1300",
        "DistanceUnit": 0
    },
    "Connections": [
        {
            "ID": 124805,
            "ConnectionTypeID": 30,
            "StatusTypeID": 50,
            "LevelID": 2,
            "PowerKW": 8,
            "CurrentTypeID": 10,
            "Quantity": 2
        }
    ],
    "NumberOfPoints": 2,
    "GeneralComments": "2 Tesla Connectors, up to 8kW.Available for patrons only. Please see front desk.",
    "StatusTypeID": 50,
    "DateLastStatusUpdate": "2017-06-09T13:20:00Z",
    "DataQualityLevel": 1,
    "DateCreated": "2017-05-19T05:30:00Z",
    "SubmissionStatusTypeID": 200
}