{
    "IsRecentlyVerified": false,
    "ID": 61030,
    "UUID": "FD43EE60-5A89-4CB0-8DA2-B1192538F001",
    "DataProviderID": 27,
    "DataProvidersReference": "147",
    "OperatorID": 210,
    "UsageTypeID": 1,
    "AddressInfo": {
        "ID": 61376,
        "Title": "Cerro de la Plata",
        "AddressLine1": "Calle de Cerro de la Plata, 4",
        "Town": "Madrid",
        "StateOrProvince": "Madrid",
        "Postcode": "28007",
        "CountryID": 210,
        "Latitude": 40.400164,
        "Longitude": -3.675077,
        "ContactTelephone1": "+34 902 103 498",
        "ContactEmail": "info@recargagic.com",
        "RelatedURL": "http://www.recargagic.com/",
        "DistanceUnit": 0
    },
    "Connections": [
        {
            "ID": 77533,
            "ConnectionTypeID": 28
        },
        {
            "ID": 77534,
            "ConnectionTypeID": 25
        }
    ],
    "GeneralComments": "Tarjeta GIC",
    "StatusTypeID": 50,
    "DateLastStatusUpdate": "2016-02-13T00:23:00Z",
    "DataQualityLevel": 3,
    "DateCreated": "2016-02-13T00:23:00Z",
    "SubmissionStatusTypeID": 200
}