{
    "IsRecentlyVerified": false,
    "ID": 29022,
    "UUID": "7B432F04-C2CF-4EAA-BBCA-70C64A813A6E",
    "DataProviderID": 2,
    "DataProvidersReference": "62306",
    "OperatorID": 5,
    "UsageTypeID": 1,
    "AddressInfo": {
        "ID": 29368,
        "Title": "INT. AUTOS BMW",
        "AddressLine1": "2400 S 108th St",
        "Town": "West Allis",
        "StateOrProvince": "WI",
        "Postcode": "53227",
        "CountryID": 2,
        "Latitude": 42.9995334,
        "Longitude": -88.0454009,
        "ContactTelephone1": "888-758-4389",
        "AccessComments": "24 hours daily",
        "RelatedURL": "http://www.chargepoint.com/",
        "DistanceUnit": 0
    },
    "Connections": [
        {
            "ID": 31891,
            "ConnectionTypeID": 1,
            "LevelID": 2,
            "Amps": 16,
            "Voltage": 230,
            "PowerKW": 3,
            "CurrentTypeID": 10,
            "Quantity": 2
        }
    ],
    "DateLastStatusUpdate": "2019-12-24T09:21:00Z",
    "DataQualityLevel": 3,
    "DateCreated": "2014-11-28T03:38:00Z",
    "SubmissionStatusTypeID": 100
}