{
    "IsRecentlyVerified": false,
    "ID": 83459,
    "UUID": "A2C7406F-E5B7-4AF4-8DB3-AFE6D380CB3A",
    "DataProviderID": 1,
    "OperatorID": 45,
    "UsageTypeID": 1,
    "AddressInfo": {
        "ID": 83805,
        "Title": "SKET EDV GmbH",
        "AddressLine1": "Schilfbreite 2",
        "Town": "Magdeburg",
        "StateOrProvince": "Magdeburg",
        "Postcode": "39120",
        "CountryID": 87,
        "Latitude": 52.0950551,
        "Longitude": 11.630199800000014,
        "ContactTelephone1": "+49 391 682784",
        "AccessComments": "Die Ladesäule ist auf dem Kundenparkplatz hinter der Schranke des SKET Gewerbeparks. Die durchgehend besetzte Werkswache öffnet das Tor. Alles kostenlos.",
        "RelatedURL": "http://www.sket.de/",
        "DistanceUnit": 0
    },
    "Connections": [
        {
            "ID": 118267,
            "ConnectionTypeID": 25,
            "StatusTypeID": 50,
            "LevelID": 2,
            "Amps": 32,
            "Voltage": 400,
            "PowerKW": 22,
            "CurrentTypeID": 20,
            "Quantity": 2
        }
    ],
    "NumberOfPoints": 2,
    "StatusTypeID": 50,
    "DateLastStatusUpdate": "2017-02-07T08:29:00Z",
    "DataQualityLevel": 1,
    "DateCreated": "2017-02-07T08:29:00Z",
    "SubmissionStatusTypeID": 200
}