{
    "IsRecentlyVerified": false,
    "ID": 93187,
    "UUID": "AC01D029-A185-4089-87A7-77B84D69B1AC",
    "DataProviderID": 1,
    "OperatorID": 45,
    "UsageTypeID": 3,
    "AddressInfo": {
        "ID": 93533,
        "Title": "Rathaus",
        "AddressLine1": "Marktplatz 3",
        "Town": "Genthin",
        "StateOrProvince": "Landkreis Jerichower Land",
        "Postcode": "39307",
        "CountryID": 87,
        "Latitude": 52.40658476335348,
        "Longitude": 12.156714317791057,
        "ContactTelephone1": "+49 3933 8760",
        "ContactEmail": "stadtverwaltung@stadt-genthin.de",
        "AccessComments": "Avacon Wallbox für Renault Zoe der Verwaltung. Zugang unbekannt, bitte erfragen.",
        "RelatedURL": "https://www.stadt-genthin.de/news/1/405805/nachrichten/405805.html",
        "DistanceUnit": 0
    },
    "Connections": [
        {
            "ID": 132004,
            "ConnectionTypeID": 25,
            "StatusTypeID": 50,
            "LevelID": 2,
            "Amps": 32,
            "Voltage": 400,
            "PowerKW": 22,
            "CurrentTypeID": 20,
            "Quantity": 1
        }
    ],
    "NumberOfPoints": 1,
    "StatusTypeID": 50,
    "DateLastStatusUpdate": "2017-09-21T09:44:00Z",
    "DataQualityLevel": 1,
    "DateCreated": "2017-09-21T09:44:00Z",
    "SubmissionStatusTypeID": 200
}