{
    "IsRecentlyVerified": false,
    "ID": 175842,
    "UUID": "AC4A1C37-A868-464B-BB2B-D492007CC334",
    "DataProviderID": 1,
    "OperatorID": 214,
    "UsageTypeID": 4,
    "AddressInfo": {
        "ID": 176201,
        "Title": "Kracauerplatz",
        "AddressLine1": "Kracauerplatz",
        "Town": "Berlin",
        "StateOrProvince": "Berlin",
        "Postcode": "10629",
        "CountryID": 87,
        "Latitude": 52.502070113229905,
        "Longitude": 13.296340531942178,
        "DistanceUnit": 0
    },
    "Connections": [
        {
            "ID": 273074,
            "ConnectionTypeID": 25,
            "StatusTypeID": 50,
            "LevelID": 2,
            "Amps": 16,
            "Voltage": 400,
            "PowerKW": 11,
            "CurrentTypeID": 20,
            "Quantity": 2
        }
    ],
    "NumberOfPoints": 2,
    "StatusTypeID": 50,
    "DateLastStatusUpdate": "2021-06-19T17:38:00Z",
    "DataQualityLevel": 1,
    "DateCreated": "2021-06-16T17:23:00Z",
    "SubmissionStatusTypeID": 200
}