{
    "IsRecentlyVerified": false,
    "ID": 154174,
    "UUID": "3F12776E-9CA8-4E68-A16E-0598A37F597E",
    "DataProviderID": 28,
    "DataProvidersReference": "FR*S27*PGISORS*INTERMARCHE",
    "UsageTypeID": 5,
    "AddressInfo": {
        "ID": 154527,
        "Title": "900063",
        "AddressLine1": "Parking Intermarché Gisors",
        "CountryID": 80,
        "Latitude": 49.276345,
        "Longitude": 1.761226,
        "AccessComments": "24/24 7/7 jours",
        "DistanceUnit": 0
    },
    "Connections": [
        {
            "ID": 216694,
            "ConnectionTypeID": 28,
            "StatusTypeID": 50,
            "LevelID": 2,
            "PowerKW": 22,
            "CurrentTypeID": 10
        },
        {
            "ID": 216695,
            "ConnectionTypeID": 26,
            "StatusTypeID": 50,
            "LevelID": 2,
            "PowerKW": 22
        },
        {
            "ID": 251057,
            "ConnectionTypeID": 28,
            "StatusTypeID": 50,
            "LevelID": 2,
            "PowerKW": 22,
            "CurrentTypeID": 10
        },
        {
            "ID": 251058,
            "ConnectionTypeID": 26,
            "StatusTypeID": 50,
            "LevelID": 2,
            "PowerKW": 22
        }
    ],
    "GeneralComments": "Borne en service",
    "StatusTypeID": 50,
    "DateLastStatusUpdate": "2020-08-27T05:16:00Z",
    "DataQualityLevel": 2,
    "DateCreated": "2020-03-15T10:55:00Z",
    "SubmissionStatusTypeID": 100
}