{
    "IsRecentlyVerified": false,
    "ID": 111277,
    "UUID": "BD093BD9-9141-42E6-873F-4159C3940CAB",
    "DataProviderID": 2,
    "DataProvidersReference": "84721",
    "UsageTypeID": 1,
    "AddressInfo": {
        "ID": 111623,
        "Title": "Vignoble la Grenouille",
        "AddressLine1": "434 Ch Plouffe",
        "Town": "Cowansville",
        "StateOrProvince": "QC",
        "Postcode": "J2K 3G6",
        "CountryID": 44,
        "Latitude": 45.19728,
        "Longitude": -72.790576,
        "ContactTelephone1": "450-578-6562",
        "AccessComments": "24 hours daily",
        "RelatedURL": "",
        "DistanceUnit": 0
    },
    "Connections": [
        {
            "ID": 156676,
            "ConnectionTypeID": 1,
            "LevelID": 2,
            "Amps": 16,
            "Voltage": 230,
            "PowerKW": 3.7,
            "CurrentTypeID": 10,
            "Quantity": 1
        }
    ],
    "DateLastStatusUpdate": "2020-06-26T03:08:00Z",
    "DataQualityLevel": 3,
    "DateCreated": "2018-10-18T23:36:00Z",
    "SubmissionStatusTypeID": 100
}