{
    "IsRecentlyVerified": false,
    "ID": 172198,
    "UUID": "359A06EF-43AB-4A03-9EB9-914B822E0513",
    "DataProviderID": 1,
    "OperatorID": 3,
    "UsageTypeID": 1,
    "UsageCost": "£0.25 per kWh, use Pod Point app or webpage charge.pod-point.com to co",
    "AddressInfo": {
        "ID": 172557,
        "Title": "Stainforth Car Park",
        "AddressLine1": "",
        "Town": "Stainforth",
        "StateOrProvince": "England",
        "Postcode": "BD24 9PW",
        "CountryID": 1,
        "Latitude": 54.10106089594578,
        "Longitude": -2.2759409010673153,
        "RelatedURL": "https://charge.pod-point.com/",
        "DistanceUnit": 0
    },
    "Connections": [
        {
            "ID": 263212,
            "ConnectionTypeID": 25,
            "StatusTypeID": 50,
            "LevelID": 2,
            "PowerKW": 7,
            "CurrentTypeID": 10,
            "Quantity": 2
        }
    ],
    "NumberOfPoints": 1,
    "GeneralComments": "Twin 7kW Pod Point, Alec-Axel",
    "StatusTypeID": 50,
    "DateLastStatusUpdate": "2021-01-21T12:13:00Z",
    "DataQualityLevel": 1,
    "DateCreated": "2021-01-21T12:10:00Z",
    "SubmissionStatusTypeID": 200
}