{
    "IsRecentlyVerified": false,
    "ID": 169611,
    "UUID": "49B5156B-2231-4C01-A672-78C0163DFA25",
    "DataProviderID": 1,
    "OperatorID": 44,
    "UsageTypeID": 4,
    "UsageCost": "not known",
    "AddressInfo": {
        "ID": 169970,
        "Title": "Ålands Golfclub",
        "AddressLine1": "Kastelhomsnäs 18",
        "StateOrProvince": "Åland",
        "Postcode": "22250",
        "CountryID": 79,
        "Latitude": 60.22584091807528,
        "Longitude": 20.06729325069921,
        "AccessComments": "1st of May to 31st of October",
        "RelatedURL": "http://www.agk.ax",
        "DistanceUnit": 0
    },
    "Connections": [
        {
            "ID": 258198,
            "ConnectionTypeID": 25,
            "StatusTypeID": 50,
            "LevelID": 2,
            "Amps": 16,
            "Voltage": 400,
            "PowerKW": 11,
            "CurrentTypeID": 20,
            "Quantity": 2
        }
    ],
    "NumberOfPoints": 2,
    "StatusTypeID": 50,
    "DateLastStatusUpdate": "2020-10-28T06:38:00Z",
    "DataQualityLevel": 1,
    "DateCreated": "2020-10-25T06:24:00Z",
    "SubmissionStatusTypeID": 200
}