{
    "IsRecentlyVerified": false,
    "ID": 122503,
    "UUID": "A0D95AB0-AFC7-47C7-8064-1567D93C3AC9",
    "DataProviderID": 2,
    "DataProvidersReference": "61061",
    "OperatorID": 39,
    "UsageTypeID": 4,
    "AddressInfo": {
        "ID": 122849,
        "Title": "550 North Brand",
        "AddressLine1": "550 North Brand Blvd.",
        "Town": "Glendale",
        "StateOrProvince": "CA",
        "Postcode": "91203",
        "CountryID": 2,
        "Latitude": 34.1541217,
        "Longitude": -118.2544909,
        "ContactTelephone1": "800-663-5633",
        "AccessComments": "MO: 12:00am-12:00am; TU: 12:00am-12:00am; WE: 12:00am-12:00am; TH: 12:00am-12:00am; FR: 12:00am-12:00am; SA: 12:00am-12:00am; SU: 12:00am-12:00am",
        "RelatedURL": "http://www.semacharge.com/",
        "DistanceUnit": 0
    },
    "Connections": [
        {
            "ID": 172397,
            "ConnectionTypeID": 1,
            "LevelID": 2,
            "Amps": 16,
            "Voltage": 230,
            "PowerKW": 3,
            "CurrentTypeID": 10,
            "Quantity": 2
        }
    ],
    "DateLastStatusUpdate": "2019-04-06T05:03:00Z",
    "DataQualityLevel": 3,
    "DateCreated": "2019-04-06T05:03:00Z",
    "SubmissionStatusTypeID": 100
}