{
    "IsRecentlyVerified": false,
    "ID": 39203,
    "UUID": "073583DB-E5A8-4F6A-810C-A9534A9FFEF8",
    "DataProviderID": 26,
    "DataProvidersReference": "30539",
    "OperatorID": 108,
    "OperatorsReference": "Vattenfall Lehmweg",
    "UsageCost": "0.00 afhankelijk van pas",
    "AddressInfo": {
        "ID": 39549,
        "Title": "Lehmweg",
        "AddressLine1": "Lehmweg",
        "Town": "Hamburg",
        "Postcode": "20251",
        "CountryID": 87,
        "Latitude": 53.578949,
        "Longitude": 9.976058,
        "ContactTelephone1": "+49(0)800-2 335 335",
        "ContactEmail": "emobility@vattenfall.de",
        "RelatedURL": "http://www.vattenfall.de/de/emobility/ladestationen-hamburg.htm",
        "DistanceUnit": 0
    },
    "Connections": [
        {
            "ID": 42714,
            "ConnectionTypeID": 25,
            "LevelID": 2,
            "PowerKW": 5,
            "CurrentTypeID": 10
        },
        {
            "ID": 49954,
            "ConnectionTypeID": 25,
            "LevelID": 2,
            "PowerKW": 5,
            "CurrentTypeID": 10
        }
    ],
    "NumberOfPoints": 2,
    "StatusTypeID": 50,
    "DateLastStatusUpdate": "2016-03-03T12:41:00Z",
    "DataQualityLevel": 3,
    "DateCreated": "2015-01-09T06:08:00Z",
    "SubmissionStatusTypeID": 100
}