{
    "IsRecentlyVerified": false,
    "ID": 97518,
    "UUID": "2FDB2450-451F-478F-9A3A-5B60B717D5B4",
    "DataProviderID": 1,
    "OperatorID": 23,
    "OperatorsReference": "38499",
    "UsageTypeID": 4,
    "AddressInfo": {
        "ID": 97864,
        "Title": "Hampton Inn Selma/Smithfield I-95",
        "AddressLine1": "1695 Outlet Center DR",
        "Town": "Selma",
        "StateOrProvince": "NC",
        "Postcode": "27576",
        "CountryID": 2,
        "Latitude": 35.517803,
        "Longitude": -78.295406,
        "ContactTelephone1": "(919) 965-6151",
        "DistanceUnit": 0
    },
    "Connections": [
        {
            "ID": 138425,
            "ConnectionTypeID": 30,
            "StatusTypeID": 50,
            "LevelID": 2,
            "PowerKW": 16,
            "CurrentTypeID": 20,
            "Quantity": 2
        }
    ],
    "NumberOfPoints": 2,
    "GeneralComments": "2 Tesla Connectors, up to 16kW.Available for customers. Please see front desk.",
    "StatusTypeID": 50,
    "DateLastStatusUpdate": "2019-06-05T11:53:00Z",
    "DataQualityLevel": 1,
    "DateCreated": "2018-01-21T15:39:00Z",
    "SubmissionStatusTypeID": 200
}