{
    "IsRecentlyVerified": false,
    "ID": 34792,
    "UUID": "A228ECCC-9FBB-419D-899B-7CA176C89EF8",
    "DataProviderID": 26,
    "DataProvidersReference": "32864",
    "OperatorsReference": "Cofely ",
    "UsageCost": "0.00 jaarabonnement",
    "AddressInfo": {
        "ID": 35138,
        "Title": "Cypresbaan 3",
        "AddressLine1": "Cypresbaan 3",
        "Town": "Capelle aan den IJssel",
        "Postcode": "2908 LT",
        "CountryID": 159,
        "Latitude": 51.955400106474,
        "Longitude": 4.5723228156567,
        "RelatedURL": "http://www.cofely-gdfsuez.nl/",
        "DistanceUnit": 0
    },
    "Connections": [
        {
            "ID": 38303,
            "ConnectionTypeID": 25,
            "LevelID": 2,
            "PowerKW": 3.7,
            "CurrentTypeID": 10
        }
    ],
    "NumberOfPoints": 2,
    "StatusTypeID": 50,
    "DateLastStatusUpdate": "2016-06-04T02:43:00Z",
    "DataQualityLevel": 3,
    "DateCreated": "2015-01-09T06:04:00Z",
    "SubmissionStatusTypeID": 100
}