{
    "IsRecentlyVerified": false,
    "ID": 104882,
    "UUID": "6F200E1F-CE3F-4475-9354-A7D9AC1046F3",
    "DataProviderID": 1,
    "OperatorID": 1,
    "UsageTypeID": 1,
    "AddressInfo": {
        "ID": 105228,
        "Title": "Bus station",
        "AddressLine1": "Gedimino g. 96",
        "Town": "Kupiškis",
        "StateOrProvince": "Kupiškio rajonas",
        "Postcode": "40130",
        "CountryID": 131,
        "Latitude": 55.8305304593576,
        "Longitude": 24.9871158281171,
        "AccessComments": "Kupiškis bus station. Charging station under construction.",
        "DistanceUnit": 0
    },
    "Connections": [
        {
            "ID": 147937,
            "ConnectionTypeID": 25,
            "StatusTypeID": 150,
            "LevelID": 2,
            "Amps": 63,
            "PowerKW": 22,
            "Quantity": 2
        }
    ],
    "NumberOfPoints": 1,
    "StatusTypeID": 150,
    "DateLastStatusUpdate": "2018-06-09T01:01:00Z",
    "DataQualityLevel": 1,
    "DateCreated": "2018-05-25T06:09:00Z",
    "SubmissionStatusTypeID": 200
}