{
    "IsRecentlyVerified": false,
    "ID": 142356,
    "UUID": "6527A389-4610-45CF-BEE8-01BA5D9C76F6",
    "DataProviderID": 2,
    "DataProvidersReference": "148484",
    "OperatorID": 39,
    "UsageTypeID": 1,
    "AddressInfo": {
        "ID": 142708,
        "Title": "Bear River Hotel",
        "AddressLine1": "11 Bear Paws Way",
        "Town": "Loleta",
        "StateOrProvince": "CA",
        "Postcode": "95551",
        "CountryID": 2,
        "Latitude": 40.627386,
        "Longitude": -124.207966,
        "ContactTelephone1": "800-663-5633",
        "AccessComments": "MO: 12:00am-12:00am; TU: 12:00am-12:00am; WE: 12:00am-12:00am; TH: 12:00am-12:00am; FR: 12:00am-12:00am; SA: 12:00am-12:00am; SU: 12:00am-12:00am",
        "RelatedURL": "http://www.semacharge.com/",
        "DistanceUnit": 0
    },
    "Connections": [
        {
            "ID": 198477,
            "ConnectionTypeID": 1,
            "LevelID": 2,
            "Amps": 16,
            "Voltage": 230,
            "PowerKW": 3.7,
            "CurrentTypeID": 10,
            "Quantity": 2
        }
    ],
    "StatusTypeID": 50,
    "DateLastStatusUpdate": "2020-06-26T03:03:00Z",
    "DataQualityLevel": 3,
    "DateCreated": "2019-12-24T09:17:00Z",
    "SubmissionStatusTypeID": 100
}