{
    "IsRecentlyVerified": false,
    "ID": 100820,
    "UUID": "628F0340-8604-4DF2-BECE-DACC8E7B6570",
    "DataProviderID": 1,
    "OperatorID": 23,
    "OperatorsReference": "41357",
    "UsageTypeID": 7,
    "AddressInfo": {
        "ID": 101166,
        "Title": "Best Western Kampen Hotell",
        "AddressLine1": "Kjølberggata 29",
        "Town": "Oslo",
        "Postcode": "653",
        "CountryID": 168,
        "Latitude": 59.913888,
        "Longitude": 10.777359,
        "ContactTelephone1": "+47 24074000",
        "DistanceUnit": 0
    },
    "Connections": [
        {
            "ID": 142400,
            "ConnectionTypeID": 30,
            "StatusTypeID": 50,
            "LevelID": 2,
            "Amps": 32,
            "Voltage": 230,
            "PowerKW": 13,
            "CurrentTypeID": 20,
            "Quantity": 2
        }
    ],
    "NumberOfPoints": 2,
    "GeneralComments": "2 Tesla Connectors, up to 13kW.Available by reservation only. Please see front desk.",
    "StatusTypeID": 50,
    "DateLastStatusUpdate": "2020-08-25T05:46:00Z",
    "DataQualityLevel": 1,
    "DateCreated": "2018-03-10T06:53:00Z",
    "SubmissionStatusTypeID": 200
}