{
    "IsRecentlyVerified": false,
    "ID": 35819,
    "UUID": "967A2BE1-843F-4F88-A013-926E8441B0AA",
    "DataProviderID": 26,
    "DataProvidersReference": "50849",
    "OperatorID": 180,
    "OperatorsReference": "Alfen GDH1802",
    "UsageCost": "0.00 jaarabonnement",
    "AddressInfo": {
        "ID": 36165,
        "Title": "Van Diemenstraat 132",
        "AddressLine1": "Van Diemenstraat 132",
        "Town": "Den Haag",
        "Postcode": "2518 VG",
        "CountryID": 159,
        "Latitude": 52.081203,
        "Longitude": 4.291259,
        "ContactTelephone1": "036 - 549 34 00",
        "RelatedURL": "http://www.icu-charging-stations.com/",
        "DistanceUnit": 0
    },
    "Connections": [
        {
            "ID": 39330,
            "ConnectionTypeID": 25,
            "LevelID": 2,
            "PowerKW": 11,
            "CurrentTypeID": 10
        },
        {
            "ID": 48074,
            "ConnectionTypeID": 25,
            "LevelID": 2,
            "PowerKW": 11,
            "CurrentTypeID": 10
        }
    ],
    "NumberOfPoints": 1,
    "StatusTypeID": 50,
    "DateLastStatusUpdate": "2016-06-04T02:49:00Z",
    "DataQualityLevel": 3,
    "DateCreated": "2015-01-09T06:05:00Z",
    "SubmissionStatusTypeID": 100
}