{
    "IsRecentlyVerified": false,
    "ID": 181089,
    "UUID": "054C9B6B-28B4-4E27-B317-788074CAB8E2",
    "DataProviderID": 29,
    "DataProvidersReference": "17435,5979",
    "AddressInfo": {
        "ID": 181448,
        "Title": "Mottener Straße 13",
        "AddressLine1": "Mottener Straße 13",
        "Town": "Kalbach",
        "Postcode": "36148",
        "CountryID": 87,
        "Latitude": 50.412241,
        "Longitude": 9.736969,
        "DistanceUnit": 0
    },
    "Connections": [
        {
            "ID": 284966,
            "ConnectionTypeID": 25,
            "StatusTypeID": 50,
            "LevelID": 2,
            "PowerKW": 11,
            "CurrentTypeID": 20
        },
        {
            "ID": 284967,
            "ConnectionTypeID": 25,
            "StatusTypeID": 50,
            "LevelID": 2,
            "PowerKW": 11,
            "CurrentTypeID": 20
        },
        {
            "ID": 284968,
            "ConnectionTypeID": 25,
            "StatusTypeID": 50,
            "LevelID": 2,
            "PowerKW": 11,
            "CurrentTypeID": 20
        },
        {
            "ID": 284969,
            "ConnectionTypeID": 25,
            "StatusTypeID": 50,
            "LevelID": 2,
            "PowerKW": 11,
            "CurrentTypeID": 20
        }
    ],
    "StatusTypeID": 50,
    "DateLastStatusUpdate": "2021-07-09T03:19:00Z",
    "MetadataValues": [
        {
            "ID": 13383,
            "MetadataFieldID": 4,
            "ItemValue": "Data from the German chargepoint registry provided by Bundesnetzagentur.de under the CC-BY 4.0 license"
        }
    ],
    "DataQualityLevel": 3,
    "DateCreated": "2021-07-08T10:01:00Z",
    "SubmissionStatusTypeID": 100
}