{
    "IsRecentlyVerified": false,
    "ID": 173445,
    "UUID": "564800BA-B2CA-4C75-A66E-DF82B50917D8",
    "DataProviderID": 18,
    "DataProvidersReference": "dfd9daa9afec8fc846becb997c324968",
    "OperatorID": 2244,
    "UsageTypeID": 1,
    "AddressInfo": {
        "ID": 173804,
        "Title": "2 Rochester Square",
        "AddressLine1": "2 Rochester Square",
        "Town": "London",
        "Postcode": "NW1 9HS",
        "CountryID": 1,
        "Latitude": -0.134956,
        "Longitude": 51.542861,
        "AccessComments": "",
        "RelatedURL": "https://www.ubitricity.com",
        "DistanceUnit": 0
    },
    "Connections": [
        {
            "ID": 266470,
            "ConnectionTypeID": 25,
            "Reference": "suby1100005006",
            "StatusTypeID": 50,
            "LevelID": 2,
            "Amps": 16,
            "Voltage": 230,
            "PowerKW": 3.7,
            "CurrentTypeID": 10
        }
    ],
    "StatusTypeID": 0,
    "DateLastStatusUpdate": "2021-07-12T03:38:00Z",
    "MetadataValues": [
        {
            "ID": 8367,
            "MetadataFieldID": 4,
            "ItemValue": "Contains public sector information licensed under the Open Government Licence v2.0. http://www.nationalarchives.gov.uk/doc/open-government-licence/version/2/"
        }
    ],
    "DataQualityLevel": 3,
    "DateCreated": "2021-03-03T11:25:00Z",
    "SubmissionStatusTypeID": 100
}