{
    "IsRecentlyVerified": false,
    "ID": 17419,
    "UUID": "01C6460D-0CD0-46E8-8A10-47B6072AFF7F",
    "DataProviderID": 22,
    "DataProvidersReference": "A90218782025C48E09BA0436CF30D029",
    "AddressInfo": {
        "ID": 17764,
        "Title": "高野町役場",
        "AddressLine1": "和歌山県伊都郡高野町大字高野山636",
        "CountryID": 114,
        "Latitude": 34.21613279,
        "Longitude": 135.586508,
        "ContactTelephone1": "0736-56-3000",
        "DistanceUnit": 0
    },
    "Connections": [
        {
            "ID": 17660,
            "ConnectionTypeID": 2,
            "LevelID": 2,
            "Amps": 100,
            "Voltage": 480,
            "PowerKW": 48,
            "Quantity": 1
        }
    ],
    "DateLastStatusUpdate": "2013-06-29T08:58:00Z",
    "DataQualityLevel": 2,
    "DateCreated": "2013-06-29T08:58:00Z",
    "SubmissionStatusTypeID": 200
}