{
    "IsRecentlyVerified": false,
    "ID": 87634,
    "UUID": "5CC688DF-1BA6-45AD-91F1-9B1EE430143E",
    "DataProviderID": 1,
    "OperatorID": 1,
    "UsageTypeID": 4,
    "AddressInfo": {
        "ID": 87980,
        "Title": "H-Tec Education",
        "AddressLine1": "Maria-Goeppert-Straße 9a",
        "Town": "Lübeck",
        "StateOrProvince": "Schleswig-Holstein",
        "Postcode": "23562",
        "CountryID": 87,
        "Latitude": 53.8339846,
        "Longitude": 10.6939208,
        "AccessComments": "24/7 nutzbare Wallboxen neben dem Schild mit Hausnummer \"9a MFC VIII\".",
        "RelatedURL": "http://www.h-tec.com/",
        "DistanceUnit": 0
    },
    "Connections": [
        {
            "ID": 124235,
            "ConnectionTypeID": 25,
            "StatusTypeID": 50,
            "LevelID": 2,
            "Amps": 32,
            "Voltage": 400,
            "PowerKW": 22,
            "CurrentTypeID": 20,
            "Quantity": 2
        }
    ],
    "NumberOfPoints": 2,
    "GeneralComments": "Betreiber ist \"GP Joule\"",
    "StatusTypeID": 50,
    "DateLastStatusUpdate": "2017-05-15T06:54:00Z",
    "DataQualityLevel": 1,
    "DateCreated": "2017-05-15T06:54:00Z",
    "SubmissionStatusTypeID": 200
}