{
    "IsRecentlyVerified": false,
    "ID": 112597,
    "UUID": "5C3B4D82-86AA-485D-9D50-24754CCF48E6",
    "DataProviderID": 1,
    "OperatorID": 150,
    "OperatorsReference": "BP Milton Regis - Sittingbourne,BP Milton Regis - Sittingbourne",
    "UsageTypeID": 4,
    "UsageCost": "£1 connection fee then 30p per kwh",
    "AddressInfo": {
        "ID": 112943,
        "Title": "MFG BP Milton Regis",
        "AddressLine1": "St Paul's Street",
        "Town": "Sittingbourne",
        "StateOrProvince": "Kent",
        "Postcode": "ME10 2LA",
        "CountryID": 1,
        "Latitude": 51.346777,
        "Longitude": 0.732766,
        "ContactTelephone1": "020 3598 4087",
        "AccessComments": "£10 overstay fee after 95 mins, then £10 every subsequent 95 mins",
        "RelatedURL": "https://geniepoint.co.uk/",
        "DistanceUnit": 0
    },
    "Connections": [
        {
            "ID": 158421,
            "ConnectionTypeID": 2,
            "StatusTypeID": 0,
            "LevelID": 3,
            "PowerKW": 50,
            "CurrentTypeID": 30,
            "Quantity": 1
        },
        {
            "ID": 158422,
            "ConnectionTypeID": 33,
            "StatusTypeID": 0,
            "LevelID": 3,
            "PowerKW": 50,
            "CurrentTypeID": 30,
            "Quantity": 1
        },
        {
            "ID": 256603,
            "ConnectionTypeID": 1036,
            "StatusTypeID": 50,
            "LevelID": 3,
            "PowerKW": 43,
            "CurrentTypeID": 20,
            "Quantity": 1
        }
    ],
    "NumberOfPoints": 1,
    "StatusTypeID": 50,
    "DateLastStatusUpdate": "2020-10-06T02:33:00Z",
    "DataQualityLevel": 1,
    "DateCreated": "2018-11-08T20:58:00Z",
    "SubmissionStatusTypeID": 200
}