{
    "IsRecentlyVerified": false,
    "ID": 77579,
    "UUID": "E76D8540-D899-4D25-A346-02E1FE629E70",
    "DataProviderID": 1,
    "OperatorID": 45,
    "UsageTypeID": 7,
    "AddressInfo": {
        "ID": 77925,
        "Title": "Entec spa",
        "AddressLine1": "Via Monte Grappa 2",
        "Town": "Savigliano",
        "StateOrProvince": "CN",
        "Postcode": "12038",
        "CountryID": 112,
        "Latitude": 44.651391330887705,
        "Longitude": 7.660553563315249,
        "DistanceUnit": 0
    },
    "Connections": [
        {
            "ID": 112059,
            "ConnectionTypeID": 25,
            "StatusTypeID": 50,
            "LevelID": 2,
            "Quantity": 1
        }
    ],
    "NumberOfPoints": 1,
    "GeneralComments": "lu-ve 8.30 -18.00 - prenotare ricarica telefonicamente (verificare disponibilità e potenza di carica)",
    "StatusTypeID": 50,
    "DateLastStatusUpdate": "2017-01-19T15:07:00Z",
    "DataQualityLevel": 1,
    "DateCreated": "2017-01-19T09:28:00Z",
    "SubmissionStatusTypeID": 200
}