{
    "IsRecentlyVerified": false,
    "ID": 8086,
    "UUID": "EB8EBB80-71AA-4E58-B934-C7AEB8A59D05",
    "DataProviderID": 15,
    "DataProvidersReference": "6096",
    "OperatorID": 26,
    "AddressInfo": {
        "ID": 7983,
        "Title": "10 Palomba Dr",
        "AddressLine1": "10 Palomba Dr",
        "Town": "Enfield",
        "StateOrProvince": "CT",
        "Postcode": "6082",
        "CountryID": 2,
        "Latitude": 41.99795,
        "Longitude": -72.57421,
        "ContactTelephone1": " (860) 253-6827",
        "RelatedURL": "http://carstations.com/6096",
        "DistanceUnit": 0
    },
    "Connections": [
        {
            "ID": 5515,
            "ConnectionTypeID": 1,
            "Reference": "J1772",
            "LevelID": 2
        }
    ],
    "StatusTypeID": 0,
    "DateLastStatusUpdate": "2017-11-04T14:04:00Z",
    "DataQualityLevel": 1,
    "DateCreated": "2011-11-11T12:05:00Z",
    "SubmissionStatusTypeID": 100
}