{
    "IsRecentlyVerified": false,
    "ID": 126950,
    "UUID": "6DA31EF7-A729-498A-9D69-538FA1F344C4",
    "DataProviderID": 1,
    "OperatorID": 90,
    "UsageTypeID": 1,
    "UsageCost": "10$/h",
    "AddressInfo": {
        "ID": 127296,
        "Title": "BRCC les escoumins",
        "AddressLine1": "147 Rue Saint-Marcellin Ouest",
        "Town": "Les Escoumins",
        "StateOrProvince": "Québec ",
        "Postcode": "G0T 1K0",
        "CountryID": 44,
        "Latitude": 48.3464239300669,
        "Longitude": -69.4052471338581,
        "DistanceUnit": 0
    },
    "Connections": [
        {
            "ID": 177797,
            "ConnectionTypeID": 2,
            "StatusTypeID": 50,
            "LevelID": 3,
            "Amps": 125,
            "Voltage": 480,
            "PowerKW": 50,
            "CurrentTypeID": 30,
            "Quantity": 2
        },
        {
            "ID": 177798,
            "ConnectionTypeID": 32,
            "StatusTypeID": 50,
            "LevelID": 3,
            "Amps": 125,
            "Voltage": 480,
            "PowerKW": 50,
            "CurrentTypeID": 30,
            "Quantity": 2
        }
    ],
    "NumberOfPoints": 2,
    "StatusTypeID": 50,
    "DateLastStatusUpdate": "2019-05-24T09:51:00Z",
    "DataQualityLevel": 1,
    "DateCreated": "2019-05-23T17:28:00Z",
    "SubmissionStatusTypeID": 200
}