{
    "IsRecentlyVerified": false,
    "ID": 96771,
    "UUID": "0F330858-1434-4D83-ABA2-3106D5B45484",
    "DataProviderID": 2,
    "DataProvidersReference": "88838",
    "OperatorID": 5,
    "UsageTypeID": 1,
    "AddressInfo": {
        "ID": 97117,
        "Title": "NATIONAL GRID",
        "AddressLine1": "88 Macy St",
        "Town": "Amesbury",
        "StateOrProvince": "MA",
        "Postcode": "01913",
        "CountryID": 2,
        "Latitude": 42.8467272,
        "Longitude": -70.9117443,
        "ContactTelephone1": "888-758-4389",
        "AccessComments": "24 hours daily",
        "RelatedURL": "http://www.chargepoint.com/",
        "DistanceUnit": 0
    },
    "Connections": [
        {
            "ID": 137049,
            "ConnectionTypeID": 2,
            "LevelID": 3,
            "Amps": 100,
            "Voltage": 400,
            "PowerKW": 40,
            "CurrentTypeID": 30,
            "Quantity": 1
        },
        {
            "ID": 137050,
            "ConnectionTypeID": 32,
            "LevelID": 3,
            "Amps": 100,
            "Voltage": 400,
            "PowerKW": 40,
            "CurrentTypeID": 30,
            "Quantity": 1
        }
    ],
    "DateLastStatusUpdate": "2019-12-24T09:20:00Z",
    "DataQualityLevel": 3,
    "DateCreated": "2017-12-29T21:01:00Z",
    "SubmissionStatusTypeID": 100
}