{
    "UserComments": [
        {
            "ID": 21691,
            "ChargePointID": 105049,
            "CommentTypeID": 10,
            "UserName": "et42",
            "Comment": "",
            "Rating": 5,
            "DateCreated": "2019-10-20T16:07:19.527Z",
            "User": {
                "ID": 21695,
                "Username": "et42"
            },
            "CheckinStatusTypeID": 10
        }
    ],
    "MediaItems": [
        {
            "ID": 20051,
            "ChargePointID": 105049,
            "ItemURL": "https://s3-ap-southeast-2.amazonaws.com/openchargemap/images/DE/OCM105049/OCM-105049.orig.2019102016063130.png",
            "ItemThumbnailURL": "https://s3-ap-southeast-2.amazonaws.com/openchargemap/images/DE/OCM105049/OCM-105049.thmb.2019102016063130.png",
            "Comment": "",
            "IsEnabled": true,
            "IsVideo": false,
            "IsFeaturedItem": false,
            "IsExternalResource": false,
            "User": {
                "ID": 21695,
                "Username": "et42"
            },
            "DateCreated": "2019-10-20T16:07:00Z"
        },
        {
            "ID": 20052,
            "ChargePointID": 105049,
            "ItemURL": "https://s3-ap-southeast-2.amazonaws.com/openchargemap/images/DE/OCM105049/OCM-105049.orig.2019102016064878.png",
            "ItemThumbnailURL": "https://s3-ap-southeast-2.amazonaws.com/openchargemap/images/DE/OCM105049/OCM-105049.thmb.2019102016064878.png",
            "Comment": "",
            "IsEnabled": true,
            "IsVideo": false,
            "IsFeaturedItem": false,
            "IsExternalResource": false,
            "User": {
                "ID": 21695,
                "Username": "et42"
            },
            "DateCreated": "2019-10-20T16:07:00Z"
        },
        {
            "ID": 20053,
            "ChargePointID": 105049,
            "ItemURL": "https://s3-ap-southeast-2.amazonaws.com/openchargemap/images/DE/OCM105049/OCM-105049.orig.2019102016070367.png",
            "ItemThumbnailURL": "https://s3-ap-southeast-2.amazonaws.com/openchargemap/images/DE/OCM105049/OCM-105049.thmb.2019102016070367.png",
            "Comment": "",
            "IsEnabled": true,
            "IsVideo": false,
            "IsFeaturedItem": false,
            "IsExternalResource": false,
            "User": {
                "ID": 21695,
                "Username": "et42"
            },
            "DateCreated": "2019-10-20T16:07:00Z"
        }
    ],
    "IsRecentlyVerified": false,
    "ID": 105049,
    "UUID": "4975414F-A074-4BA6-822C-3EA4EDF24BD0",
    "DataProviderID": 1,
    "OperatorID": 163,
    "UsageTypeID": 4,
    "AddressInfo": {
        "ID": 105395,
        "Title": "Parktheater Bensheim",
        "AddressLine1": "Promenadenstraße 25",
        "Town": "Bensheim",
        "StateOrProvince": "Kreis Bergstraße",
        "Postcode": "64625",
        "CountryID": 87,
        "Latitude": 49.6823914511189,
        "Longitude": 8.61983772984479,
        "AccessComments": "24/7 nutzbare Ladesäule. Laut Aufkleber auf der Säule nur per RFID nutzbar, da Kabel sonst nicht freigegeben wird.",
        "RelatedURL": "http://www.ggew.de/",
        "DistanceUnit": 0
    },
    "Connections": [
        {
            "ID": 148138,
            "ConnectionTypeID": 25,
            "StatusTypeID": 50,
            "LevelID": 2,
            "Amps": 32,
            "Voltage": 400,
            "PowerKW": 22,
            "CurrentTypeID": 20,
            "Quantity": 2
        }
    ],
    "NumberOfPoints": 2,
    "GeneralComments": "Roaming über Ladenetz.",
    "StatusTypeID": 50,
    "DateLastStatusUpdate": "2019-10-23T17:20:00Z",
    "DataQualityLevel": 1,
    "DateCreated": "2018-05-29T06:12:00Z",
    "SubmissionStatusTypeID": 200
}