{
    "UserComments": [
        {
            "ID": 19165,
            "ChargePointID": 41195,
            "CommentTypeID": 10,
            "UserName": "Simon Hewison",
            "Comment": "Blocked by blue city rental car",
            "DateCreated": "2018-02-06T18:23:47.273Z",
            "User": {
                "ID": 4575,
                "Username": "Simon Hewison"
            },
            "CheckinStatusTypeID": 100
        },
        {
            "ID": 4777,
            "ChargePointID": 41195,
            "CommentTypeID": 10,
            "UserName": "Richard Butler ",
            "Comment": "when ever I pass it seams like the same Smart EV is parked in the spot. today is was there from around 9am until 2pm, and when it eventaully moved, I drove around the block, so I could charge, and found a mum had parked her Volvo XC90 in it.\r\nI've been here all day and was hoping I would get my 3 hour to charge at some point, but it looks like I might only get one. parking enforcement come around every hour on their scoters to ticket cars in residents bays, but don't appear to care about the EV spot, or the 3 hour limit.",
            "DateCreated": "2015-06-26T15:23:50.417Z",
            "User": {
                "ID": 4938,
                "Username": "Richard Butler "
            },
            "CheckinStatusTypeID": 110
        }
    ],
    "IsRecentlyVerified": false,
    "ID": 41195,
    "UUID": "51C0CA5D-D7FC-4D9F-B3FB-F888010E06E4",
    "DataProviderID": 1,
    "OperatorID": 25,
    "OperatorsReference": "200-10320",
    "UsageTypeID": 4,
    "UsageCost": "£0.073/minute; min £1.38; other tariffs available",
    "AddressInfo": {
        "ID": 41541,
        "Title": "Junction of Highgate High Street and Bisham Gardens",
        "AddressLine1": "9 Highgate High Street",
        "Town": "London",
        "StateOrProvince": "England",
        "Postcode": "N6 5JR",
        "CountryID": 1,
        "Latitude": 51.5703816253562,
        "Longitude": -0.146338399999999,
        "AccessComments": "Opposite Highgate Bookshop, on Bisham Gardens. Max stay 3 hours",
        "DistanceUnit": 0
    },
    "Connections": [
        {
            "ID": 44978,
            "ConnectionTypeID": 1,
            "StatusTypeID": 50,
            "LevelID": 2,
            "Amps": 16,
            "Voltage": 230,
            "PowerKW": 4,
            "CurrentTypeID": 10,
            "Quantity": 1
        },
        {
            "ID": 135458,
            "ConnectionTypeID": 25,
            "StatusTypeID": 50,
            "LevelID": 2,
            "Amps": 32,
            "Voltage": 230,
            "PowerKW": 7,
            "CurrentTypeID": 10,
            "Quantity": 1
        }
    ],
    "NumberOfPoints": 1,
    "GeneralComments": "right outside Highgate Bookshop on the corner of Bisham Gardens.",
    "StatusTypeID": 50,
    "DateLastStatusUpdate": "2019-05-12T05:25:00Z",
    "DataQualityLevel": 1,
    "DateCreated": "2015-01-27T19:17:00Z",
    "SubmissionStatusTypeID": 200
}