{
    "IsRecentlyVerified": false,
    "ID": 75293,
    "UUID": "5D387ED0-EB0B-4B21-9D45-C3791687618D",
    "DataProviderID": 1,
    "OperatorID": 23,
    "OperatorsReference": "19397",
    "UsageTypeID": 6,
    "UsageCost": "Free",
    "AddressInfo": {
        "ID": 75639,
        "Title": "Bilderberg Landgoed Lauswolt",
        "AddressLine1": "10 Van Harinxmaweg",
        "Town": "Beesterzwaag",
        "Postcode": "9244 CJ",
        "CountryID": 159,
        "Latitude": 53.058133,
        "Longitude": 6.091141,
        "ContactTelephone1": "+31 512 38 12 45",
        "DistanceUnit": 0
    },
    "Connections": [
        {
            "ID": 108598,
            "ConnectionTypeID": 30,
            "StatusTypeID": 50,
            "LevelID": 2,
            "Amps": 32,
            "Voltage": 400,
            "PowerKW": 22,
            "CurrentTypeID": 20,
            "Quantity": 2
        }
    ],
    "NumberOfPoints": 2,
    "GeneralComments": "2 Tesla Connector, up to 22kW.Available for patrons only. Please see front desk.",
    "StatusTypeID": 50,
    "DateLastStatusUpdate": "2018-10-03T23:23:00Z",
    "DataQualityLevel": 1,
    "DateCreated": "2016-12-14T17:00:00Z",
    "SubmissionStatusTypeID": 200
}