{
    "IsRecentlyVerified": false,
    "ID": 52275,
    "UUID": "B1540D70-39A8-4A53-9445-55CE182BEC5C",
    "DataProviderID": 1,
    "OperatorID": 45,
    "UsageTypeID": 1,
    "AddressInfo": {
        "ID": 52621,
        "Title": "Bahnhof",
        "AddressLine1": "Ladestraße 1",
        "Town": "Hofgeismar",
        "StateOrProvince": "Landkreis Kassel",
        "Postcode": "34369",
        "CountryID": 87,
        "Latitude": 51.4988637,
        "Longitude": 9.39507449999996,
        "AccessComments": "Kostenloses Laden 24/7 ohne Ladekarte auf einem markierten Parkplatz (direkt neben dem Behindertenparkplatz) direkt vor dem Bahnhof Hofgeismar.\r\n",
        "DistanceUnit": 0
    },
    "Connections": [
        {
            "ID": 64923,
            "ConnectionTypeID": 25,
            "StatusTypeID": 50,
            "LevelID": 2,
            "Amps": 16,
            "Voltage": 400,
            "PowerKW": 11,
            "CurrentTypeID": 20,
            "Quantity": 2
        }
    ],
    "NumberOfPoints": 1,
    "StatusTypeID": 50,
    "DateLastStatusUpdate": "2015-08-27T15:23:00Z",
    "DataQualityLevel": 1,
    "DateCreated": "2015-08-27T13:24:00Z",
    "SubmissionStatusTypeID": 200
}