{
    "MediaItems": [
        {
            "ID": 19220,
            "ChargePointID": 130754,
            "ItemURL": "https://s3-ap-southeast-2.amazonaws.com/openchargemap/images/PL/OCM130754/OCM-130754.orig.2019081307581991.jpg",
            "ItemThumbnailURL": "https://s3-ap-southeast-2.amazonaws.com/openchargemap/images/PL/OCM130754/OCM-130754.thmb.2019081307581991.jpg",
            "Comment": "",
            "IsEnabled": true,
            "IsVideo": false,
            "IsFeaturedItem": false,
            "IsExternalResource": false,
            "User": {
                "ID": 21853,
                "Username": "Maciek"
            },
            "DateCreated": "2019-08-13T07:59:00Z"
        },
        {
            "ID": 19219,
            "ChargePointID": 130754,
            "ItemURL": "https://s3-ap-southeast-2.amazonaws.com/openchargemap/images/PL/OCM130754/OCM-130754.orig.2019081307575179.jpg",
            "ItemThumbnailURL": "https://s3-ap-southeast-2.amazonaws.com/openchargemap/images/PL/OCM130754/OCM-130754.thmb.2019081307575179.jpg",
            "Comment": "",
            "IsEnabled": true,
            "IsVideo": false,
            "IsFeaturedItem": false,
            "IsExternalResource": false,
            "User": {
                "ID": 21853,
                "Username": "Maciek"
            },
            "DateCreated": "2019-08-13T07:58:00Z"
        }
    ],
    "IsRecentlyVerified": false,
    "ID": 130754,
    "UUID": "36096491-1564-4A03-9A3E-1CE91052A171",
    "DataProviderID": 1,
    "OperatorID": 3368,
    "UsageTypeID": 1,
    "AddressInfo": {
        "ID": 131100,
        "Title": "PowerON Galeria Podolany",
        "AddressLine1": "Strzeszyńska 63",
        "AddressLine2": "Podolany",
        "Town": "Poznań",
        "StateOrProvince": "Poznań",
        "Postcode": "60-479",
        "CountryID": 179,
        "Latitude": 52.4489416699385,
        "Longitude": 16.8942963150782,
        "RelatedURL": "https://elo.city",
        "DistanceUnit": 0
    },
    "Connections": [
        {
            "ID": 183055,
            "ConnectionTypeID": 1036,
            "StatusTypeID": 50,
            "LevelID": 2,
            "Amps": 32,
            "Voltage": 400,
            "PowerKW": 22,
            "CurrentTypeID": 20,
            "Quantity": 1
        }
    ],
    "NumberOfPoints": 1,
    "GeneralComments": "Public charging station. 1x22kW. Required Elocity app. Price list in application",
    "StatusTypeID": 50,
    "DateLastStatusUpdate": "2019-08-13T08:32:00Z",
    "DataQualityLevel": 1,
    "DateCreated": "2019-08-13T07:38:00Z",
    "SubmissionStatusTypeID": 200
}