{
    "UserComments": [
        {
            "ID": 17884,
            "ChargePointID": 90125,
            "CommentTypeID": 10,
            "UserName": "ForumElettrico.it",
            "RelatedURL": "http://www.forumelettrico.it/forum/colonnina-enel-22kw-misano-adriatico-rn-viale-della-stazione-1-t1790.html",
            "DateCreated": "2017-11-02T17:26:16.757Z",
            "User": {
                "ID": 11749,
                "Username": "ForumElettrico.it"
            },
            "CheckinStatusTypeID": 0
        },
        {
            "ID": 17482,
            "ChargePointID": 90125,
            "CommentTypeID": 10,
            "UserName": "ForumElettrico.it",
            "Comment": "http://www.forumelettrico.it/forum/inaugurazione-oggi-di-due-colonnine-a-misano-adriatico-t1193.html?hilit=misano",
            "DateCreated": "2017-07-15T20:48:51.737Z",
            "User": {
                "ID": 11749,
                "Username": "ForumElettrico.it"
            },
            "CheckinStatusTypeID": 10
        }
    ],
    "MediaItems": [
        {
            "ID": 12999,
            "ChargePointID": 90125,
            "ItemURL": "https://s3-ap-southeast-2.amazonaws.com/openchargemap/images/IT/OCM90125/OCM-90125.orig.2017071520492832.jpg",
            "ItemThumbnailURL": "https://s3-ap-southeast-2.amazonaws.com/openchargemap/images/IT/OCM90125/OCM-90125.thmb.2017071520492832.jpg",
            "Comment": "",
            "IsEnabled": true,
            "IsVideo": false,
            "IsFeaturedItem": false,
            "IsExternalResource": false,
            "User": {
                "ID": 11749,
                "Username": "ForumElettrico.it"
            },
            "DateCreated": "2017-07-15T20:50:00Z"
        },
        {
            "ID": 13000,
            "ChargePointID": 90125,
            "ItemURL": "https://s3-ap-southeast-2.amazonaws.com/openchargemap/images/IT/OCM90125/OCM-90125.orig.2017071520494445.jpg",
            "ItemThumbnailURL": "https://s3-ap-southeast-2.amazonaws.com/openchargemap/images/IT/OCM90125/OCM-90125.thmb.2017071520494445.jpg",
            "Comment": "",
            "IsEnabled": true,
            "IsVideo": false,
            "IsFeaturedItem": false,
            "IsExternalResource": false,
            "User": {
                "ID": 11749,
                "Username": "ForumElettrico.it"
            },
            "DateCreated": "2017-07-15T20:50:00Z"
        },
        {
            "ID": 12998,
            "ChargePointID": 90125,
            "ItemURL": "https://s3-ap-southeast-2.amazonaws.com/openchargemap/images/IT/OCM90125/OCM-90125.orig.2017071520491328.jpg",
            "ItemThumbnailURL": "https://s3-ap-southeast-2.amazonaws.com/openchargemap/images/IT/OCM90125/OCM-90125.thmb.2017071520491328.jpg",
            "Comment": "",
            "IsEnabled": true,
            "IsVideo": false,
            "IsFeaturedItem": false,
            "IsExternalResource": false,
            "User": {
                "ID": 11749,
                "Username": "ForumElettrico.it"
            },
            "DateCreated": "2017-07-15T20:49:00Z"
        }
    ],
    "IsRecentlyVerified": false,
    "ID": 90125,
    "UUID": "73A5FF78-41A0-4B88-874E-BBF169A44FD8",
    "DataProviderID": 1,
    "OperatorID": 80,
    "UsageTypeID": 4,
    "UsageCost": "0,40 €/kW",
    "AddressInfo": {
        "ID": 90471,
        "Title": "Eneldrive Stazione FS",
        "AddressLine1": "Viale della Stazione",
        "Town": "Misano Adriatico",
        "StateOrProvince": "RN",
        "CountryID": 112,
        "Latitude": 43.977657,
        "Longitude": 12.697005,
        "RelatedURL": "https://www.eneldrive.it/",
        "DistanceUnit": 0
    },
    "Connections": [
        {
            "ID": 127753,
            "ConnectionTypeID": 25,
            "StatusTypeID": 150,
            "LevelID": 2,
            "Amps": 32,
            "Voltage": 400,
            "PowerKW": 22,
            "CurrentTypeID": 20,
            "Quantity": 1
        },
        {
            "ID": 127754,
            "ConnectionTypeID": 36,
            "StatusTypeID": 150,
            "LevelID": 2,
            "Amps": 16,
            "Voltage": 240,
            "PowerKW": 3.4,
            "CurrentTypeID": 10,
            "Quantity": 1
        }
    ],
    "NumberOfPoints": 1,
    "GeneralComments": "http://www.forumelettrico.it/forum/inaugurazione-oggi-di-due-colonnine-a-misano-adriatico-t1193.html",
    "StatusTypeID": 50,
    "DateLastStatusUpdate": "2017-11-02T17:26:00Z",
    "DataQualityLevel": 1,
    "DateCreated": "2017-07-10T17:00:00Z",
    "SubmissionStatusTypeID": 200
}