{
    "IsRecentlyVerified": false,
    "ID": 60962,
    "UUID": "37367A1A-4704-47F3-B0AD-BB57BE37DB36",
    "DataProviderID": 27,
    "DataProvidersReference": "39",
    "UsageTypeID": 1,
    "AddressInfo": {
        "ID": 61308,
        "Title": "Alcoi",
        "AddressLine1": "Plaza Ramón y Cajal",
        "Town": "Alcoy",
        "StateOrProvince": "Alicante",
        "Postcode": "03801",
        "CountryID": 210,
        "Latitude": 38.695525,
        "Longitude": -0.473412,
        "ContactTelephone1": "+34 965537100",
        "DistanceUnit": 0
    },
    "Connections": [
        {
            "ID": 77379,
            "ConnectionTypeID": 28,
            "LevelID": 2,
            "Amps": 16,
            "Voltage": 230,
            "PowerKW": 3.6
        },
        {
            "ID": 77380,
            "ConnectionTypeID": 25,
            "LevelID": 2,
            "Amps": 16,
            "Voltage": 230,
            "PowerKW": 3.6
        }
    ],
    "StatusTypeID": 50,
    "DateLastStatusUpdate": "2016-02-13T00:23:00Z",
    "DataQualityLevel": 3,
    "DateCreated": "2016-02-13T00:23:00Z",
    "SubmissionStatusTypeID": 200
}