{
    "IsRecentlyVerified": false,
    "ID": 169393,
    "UUID": "B7152D47-59BC-4356-9CB8-642B81251283",
    "DataProviderID": 1,
    "OperatorID": 3,
    "OperatorsReference": "PG-85041",
    "UsageTypeID": 4,
    "UsageCost": "£0.23/kWh",
    "AddressInfo": {
        "ID": 169752,
        "Title": "Westmorland Park-Car Park",
        "AddressLine1": "Westmorland Drive",
        "Town": "Warfield",
        "StateOrProvince": "Bracknell",
        "Postcode": "RG42 3QP",
        "CountryID": 1,
        "Latitude": 51.42936,
        "Longitude": -0.725973,
        "DistanceUnit": 0
    },
    "Connections": [
        {
            "ID": 257718,
            "ConnectionTypeID": 25,
            "StatusTypeID": 50,
            "LevelID": 2,
            "Amps": 32,
            "Voltage": 400,
            "PowerKW": 22,
            "CurrentTypeID": 20,
            "Quantity": 2
        }
    ],
    "NumberOfPoints": 2,
    "GeneralComments": "This is an open charge unit installed at the Westmorland Park Car Park at Westmorland Drive, Warfield, Bracknell",
    "StatusTypeID": 50,
    "DateLastStatusUpdate": "2020-10-15T21:38:00Z",
    "DataQualityLevel": 1,
    "DateCreated": "2020-10-15T21:38:00Z",
    "SubmissionStatusTypeID": 200
}