{
    "IsRecentlyVerified": false,
    "ID": 93370,
    "UUID": "9CDA6D51-2CE4-4684-8CD1-0F9BBCB3FFBD",
    "DataProviderID": 1,
    "OperatorID": 23,
    "OperatorsReference": "35883",
    "UsageTypeID": 4,
    "AddressInfo": {
        "ID": 93716,
        "Title": "Cheddar's Restaurant - Brunswick",
        "AddressLine1": "551 Canal RD",
        "Town": "Brunswick",
        "StateOrProvince": "Georgia",
        "Postcode": "31525",
        "CountryID": 2,
        "Latitude": 31.2348557,
        "Longitude": -81.4962418,
        "ContactTelephone1": "(912) 275-7384",
        "DistanceUnit": 0
    },
    "Connections": [
        {
            "ID": 132247,
            "ConnectionTypeID": 30,
            "StatusTypeID": 50,
            "LevelID": 2,
            "PowerKW": 16,
            "CurrentTypeID": 20,
            "Quantity": 2
        }
    ],
    "NumberOfPoints": 2,
    "GeneralComments": "2 Tesla Connectors, up to 16kW.Available for customers. Please see front desk.",
    "StatusTypeID": 50,
    "DateLastStatusUpdate": "2017-09-27T19:23:00Z",
    "DataQualityLevel": 1,
    "DateCreated": "2017-09-27T19:23:00Z",
    "SubmissionStatusTypeID": 200
}