{
    "IsRecentlyVerified": false,
    "ID": 182346,
    "UUID": "4F1D5B7A-8D3E-4472-8945-51B5D799361D",
    "DataProviderID": 29,
    "DataProvidersReference": "7758,1221",
    "OperatorID": 105,
    "AddressInfo": {
        "ID": 182705,
        "Title": "Sonnenallee 1",
        "AddressLine1": "Sonnenallee 1",
        "Town": "Medebach",
        "Postcode": "59964",
        "CountryID": 87,
        "Latitude": 51.206774,
        "Longitude": 8.689991,
        "DistanceUnit": 0
    },
    "Connections": [
        {
            "ID": 287967,
            "ConnectionTypeID": 25,
            "StatusTypeID": 50,
            "LevelID": 2,
            "PowerKW": 22,
            "CurrentTypeID": 20
        },
        {
            "ID": 287968,
            "ConnectionTypeID": 25,
            "StatusTypeID": 50,
            "LevelID": 2,
            "PowerKW": 22,
            "CurrentTypeID": 20
        },
        {
            "ID": 287969,
            "ConnectionTypeID": 25,
            "StatusTypeID": 50,
            "LevelID": 2,
            "PowerKW": 22,
            "CurrentTypeID": 20
        },
        {
            "ID": 287970,
            "ConnectionTypeID": 25,
            "StatusTypeID": 50,
            "LevelID": 2,
            "PowerKW": 22,
            "CurrentTypeID": 20
        }
    ],
    "StatusTypeID": 50,
    "DateLastStatusUpdate": "2021-07-09T03:22:00Z",
    "MetadataValues": [
        {
            "ID": 14640,
            "MetadataFieldID": 4,
            "ItemValue": "Data from the German chargepoint registry provided by Bundesnetzagentur.de under the CC-BY 4.0 license"
        }
    ],
    "DataQualityLevel": 3,
    "DateCreated": "2021-07-08T10:02:00Z",
    "SubmissionStatusTypeID": 100
}