{
    "IsRecentlyVerified": false,
    "ID": 54177,
    "UUID": "01A1FC65-2B8E-4836-8C6D-096EC053B0D2",
    "DataProviderID": 1,
    "OperatorID": 215,
    "UsageTypeID": 4,
    "AddressInfo": {
        "ID": 54523,
        "Title": "VW Händler Fleischhauer",
        "AddressLine1": "Bornheimer Straße 206",
        "Town": "Bonn",
        "Postcode": "53119",
        "CountryID": 87,
        "Latitude": 50.74031,
        "Longitude": 7.07687999999996,
        "ContactTelephone1": "+49 228 72640",
        "AccessComments": "Die Säule ist nutzbar: Mo: von 08:30 bis 18:30 Uhr Di: von 08:30 bis 18:30 Uhr Mi: von 08:30 bis 18:30 Uhr Do: von 08:30 bis 18:30 Uhr Fr: von 08:30 bis 18:30 Uhr Sa: von 09:00 bis 14:00 Uhr So: geschlossen Die Zufahrt zum Parkplatz kann am Wochenende nach Ende der Öffnungszeiten durch Poller blockiert sein. Der Betreiber möchte auf Nachfrage informiert werden, wenn jemand laden will. Das laden ist rund um die Uhr möglich, wenn nicht blockiert, aber nur während & Öffnungszeiten gewünscht.. Position: Auf dem Hof links am Ende an der Hecke.. Umgebung:Obi, Fitness, Oft von Autohaus-eigenen Verbrennern zugestellt.\r\n",
        "RelatedURL": "http://www.fleischhauer.com/de",
        "DistanceUnit": 0
    },
    "Connections": [
        {
            "ID": 68128,
            "ConnectionTypeID": 28,
            "StatusTypeID": 50,
            "LevelID": 2,
            "PowerKW": 3.7,
            "CurrentTypeID": 10,
            "Quantity": 0
        },
        {
            "ID": 68129,
            "ConnectionTypeID": 0,
            "StatusTypeID": 50,
            "LevelID": 2,
            "CurrentTypeID": 20
        },
        {
            "ID": 68130,
            "ConnectionTypeID": 16,
            "StatusTypeID": 50,
            "LevelID": 2,
            "PowerKW": 3.7,
            "CurrentTypeID": 10,
            "Quantity": 0
        },
        {
            "ID": 68131,
            "ConnectionTypeID": 17,
            "StatusTypeID": 50,
            "LevelID": 2,
            "PowerKW": 0,
            "CurrentTypeID": 20,
            "Quantity": 0
        },
        {
            "ID": 68132,
            "ConnectionTypeID": 2,
            "StatusTypeID": 50,
            "LevelID": 2,
            "PowerKW": 0,
            "CurrentTypeID": 30,
            "Quantity": 0
        },
        {
            "ID": 68133,
            "ConnectionTypeID": 33,
            "StatusTypeID": 50,
            "LevelID": 3,
            "PowerKW": 50,
            "CurrentTypeID": 30,
            "Quantity": 1
        }
    ],
    "NumberOfPoints": 4,
    "StatusTypeID": 50,
    "DateLastStatusUpdate": "2015-09-24T17:18:00Z",
    "DataQualityLevel": 1,
    "DateCreated": "2015-09-24T16:03:00Z",
    "SubmissionStatusTypeID": 200
}