{
    "IsRecentlyVerified": false,
    "ID": 136493,
    "UUID": "11303120-6035-4D6F-8DA4-17BDB65DA9D7",
    "DataProviderID": 18,
    "DataProvidersReference": "a18c683dc35acbddc52d82d74d01672c",
    "OperatorID": 2244,
    "UsageTypeID": 5,
    "AddressInfo": {
        "ID": 136839,
        "Title": "Etchingham Road",
        "AddressLine1": "Etchingham Road",
        "Town": "London",
        "Postcode": "E15 2DF",
        "CountryID": 1,
        "Latitude": 51.553977,
        "Longitude": -0.006342,
        "AccessComments": "",
        "RelatedURL": "https://www.ubitricity.com",
        "DistanceUnit": 0
    },
    "Connections": [
        {
            "ID": 190943,
            "ConnectionTypeID": 25,
            "Reference": "suby1100001349",
            "StatusTypeID": 50,
            "LevelID": 2,
            "Amps": 16,
            "Voltage": 230,
            "PowerKW": 3.7,
            "CurrentTypeID": 10
        }
    ],
    "StatusTypeID": 0,
    "DateLastStatusUpdate": "2021-04-25T05:46:00Z",
    "MetadataValues": [
        {
            "ID": 6345,
            "MetadataFieldID": 4,
            "ItemValue": "Contains public sector information licensed under the Open Government Licence v2.0. http://www.nationalarchives.gov.uk/doc/open-government-licence/version/2/"
        }
    ],
    "DataQualityLevel": 3,
    "DateCreated": "2019-12-24T05:22:00Z",
    "SubmissionStatusTypeID": 100
}