{
    "IsRecentlyVerified": false,
    "ID": 48033,
    "UUID": "BFB2DA74-8781-4F78-87CE-70F3A9365F7F",
    "DataProviderID": 1,
    "OperatorID": 45,
    "UsageTypeID": 5,
    "UsageCost": "0,50€/kWh",
    "AddressInfo": {
        "ID": 48379,
        "Title": "Stellplatz Phoenix Reisemobil-Hafen",
        "AddressLine1": "Bad Windsheimer Straße 7",
        "Town": "Bad Windsheim",
        "Postcode": "91438",
        "CountryID": 87,
        "Latitude": 49.513396480411,
        "Longitude": 10.4186350439026,
        "ContactTelephone1": "09841 685087",
        "AccessComments": "Stromsäulen sind auf dem Wohnmobilstellplatz verteilt. Münzeinwurf 0,50€. ",
        "RelatedURL": "http://www.phoenix-reisemobilhafen.de/",
        "DistanceUnit": 0
    },
    "Connections": [
        {
            "ID": 59318,
            "ConnectionTypeID": 16,
            "StatusTypeID": 50,
            "LevelID": 2,
            "Amps": 16,
            "Voltage": 230,
            "PowerKW": 3.7,
            "CurrentTypeID": 10,
            "Quantity": 90
        },
        {
            "ID": 59319,
            "ConnectionTypeID": 16,
            "StatusTypeID": 50,
            "LevelID": 2,
            "Amps": 16,
            "Voltage": 230,
            "PowerKW": 3.7,
            "CurrentTypeID": 10,
            "Quantity": 90
        }
    ],
    "NumberOfPoints": 100,
    "GeneralComments": "30 Säulen mit 6xCEE blau = 180 Anschlüsse!",
    "StatusTypeID": 50,
    "DateLastStatusUpdate": "2015-06-23T08:52:00Z",
    "DataQualityLevel": 1,
    "DateCreated": "2015-06-23T07:44:00Z",
    "SubmissionStatusTypeID": 200
}