{
    "IsRecentlyVerified": false,
    "ID": 170488,
    "UUID": "7B2B5AA0-D7C1-498C-9DB1-FECFF3235379",
    "DataProviderID": 1,
    "OperatorID": 3,
    "OperatorsReference": "PG-70387,PG-84524",
    "UsageTypeID": 4,
    "UsageCost": "Free",
    "AddressInfo": {
        "ID": 170847,
        "Title": "Tesco Superstore",
        "AddressLine1": "Market Ln",
        "Town": "Penistone",
        "StateOrProvince": "England",
        "Postcode": "S36 6TS",
        "CountryID": 1,
        "Latitude": 53.5258728906199,
        "Longitude": -1.63291606626331,
        "AccessComments": "Store: Mon-Sat 6am-Midnight, Sun 10am-4pm",
        "RelatedURL": "http://www.pod-point.com",
        "DistanceUnit": 0
    },
    "Connections": [
        {
            "ID": 260169,
            "ConnectionTypeID": 25,
            "StatusTypeID": 50,
            "LevelID": 2,
            "Amps": 32,
            "Voltage": 230,
            "PowerKW": 7,
            "CurrentTypeID": 10,
            "Quantity": 4
        }
    ],
    "NumberOfPoints": 4,
    "GeneralComments": "Twin 7kW Pod Points, Elle-Hope & Lois-Noel",
    "StatusTypeID": 50,
    "DateLastStatusUpdate": "2021-03-15T06:35:00Z",
    "DataQualityLevel": 1,
    "DateCreated": "2020-11-28T11:38:00Z",
    "SubmissionStatusTypeID": 200
}