{
    "IsRecentlyVerified": false,
    "ID": 46753,
    "UUID": "F6537B6A-AF46-40EF-8C90-8074CDE51F7B",
    "DataProviderID": 1,
    "OperatorID": 188,
    "UsageTypeID": 4,
    "AddressInfo": {
        "ID": 47099,
        "Title": "Bürgerhaus in Cölbe",
        "AddressLine1": "Am Bürgerhaus 7",
        "Town": "Cölbe",
        "Postcode": "35091",
        "CountryID": 87,
        "Latitude": 50.88385,
        "Longitude": 8.83404999999993,
        "ContactTelephone1": " +49 6421 205-505",
        "AccessComments": "2 durchgehend nutzbare Parkplätze. Ladekarte der Stadtwerke Marburg oder der ovag-Energie erforderlich, kann auch während der Öffnungszeiten bei der Gemeindeverwaltung ausgeliehen werden.\r\n",
        "RelatedURL": "http://www.stadtwerke-marburg.de/elektrotankstellen.html",
        "DistanceUnit": 0
    },
    "Connections": [
        {
            "ID": 57436,
            "ConnectionTypeID": 25,
            "StatusTypeID": 50,
            "LevelID": 2,
            "Amps": 16,
            "Voltage": 400,
            "PowerKW": 11,
            "CurrentTypeID": 20,
            "Quantity": 2
        },
        {
            "ID": 57437,
            "ConnectionTypeID": 28,
            "StatusTypeID": 50,
            "LevelID": 2,
            "Amps": 16,
            "Voltage": 230,
            "PowerKW": 3.7,
            "CurrentTypeID": 10,
            "Quantity": 2
        }
    ],
    "NumberOfPoints": 2,
    "StatusTypeID": 50,
    "DateLastStatusUpdate": "2015-05-07T15:35:00Z",
    "DataQualityLevel": 1,
    "DateCreated": "2015-05-06T08:07:00Z",
    "SubmissionStatusTypeID": 200
}