{
    "IsRecentlyVerified": false,
    "ID": 101915,
    "UUID": "986B5BE9-A89C-4DDF-9E7E-2895C78EABC4",
    "DataProviderID": 1,
    "OperatorID": 23,
    "OperatorsReference": "42197",
    "UsageTypeID": 4,
    "AddressInfo": {
        "ID": 102261,
        "Title": "Hotel Alpenhof",
        "AddressLine1": "Hintertux 750",
        "Town": "Tux",
        "Postcode": "6293",
        "CountryID": 19,
        "Latitude": 46.023387,
        "Longitude": 7.751295,
        "ContactTelephone1": "+43 5287 8550",
        "DistanceUnit": 0
    },
    "Connections": [
        {
            "ID": 143898,
            "ConnectionTypeID": 30,
            "StatusTypeID": 50,
            "LevelID": 2,
            "Amps": 16,
            "Voltage": 400,
            "PowerKW": 11,
            "CurrentTypeID": 20,
            "Quantity": 2
        }
    ],
    "NumberOfPoints": 2,
    "GeneralComments": "2 Tesla Connectors, up to 11kW.Seasonal Availability Please call ahead.Seasonal availability. Please call ahead.",
    "StatusTypeID": 50,
    "DateLastStatusUpdate": "2018-10-03T21:59:00Z",
    "DataQualityLevel": 1,
    "DateCreated": "2018-04-16T04:35:00Z",
    "SubmissionStatusTypeID": 200
}