{
    "IsRecentlyVerified": false,
    "ID": 111933,
    "UUID": "1F47251B-4423-4110-BF49-B6615D690552",
    "DataProviderID": 2,
    "DataProvidersReference": "91620",
    "OperatorID": 5,
    "UsageTypeID": 1,
    "AddressInfo": {
        "ID": 112279,
        "Title": "CITY OF SURREY",
        "AddressLine1": "13450 104 Ave",
        "Town": "Surrey",
        "StateOrProvince": "BC",
        "Postcode": "V3T 1V8",
        "CountryID": 44,
        "Latitude": 49.191442,
        "Longitude": -122.848949,
        "ContactTelephone1": "888-758-4389",
        "AccessComments": "24 hours daily",
        "RelatedURL": "http://www.chargepoint.com/",
        "DistanceUnit": 0
    },
    "Connections": [
        {
            "ID": 157449,
            "ConnectionTypeID": 1,
            "LevelID": 2,
            "Amps": 16,
            "Voltage": 230,
            "PowerKW": 3.7,
            "CurrentTypeID": 10,
            "Quantity": 4
        }
    ],
    "DateLastStatusUpdate": "2020-06-26T03:11:00Z",
    "DataQualityLevel": 3,
    "DateCreated": "2018-10-18T23:37:00Z",
    "SubmissionStatusTypeID": 100
}