{
    "IsRecentlyVerified": false,
    "ID": 182106,
    "UUID": "96B669C9-BAAA-41C3-B0FF-E239F14B0489",
    "DataProviderID": 29,
    "DataProvidersReference": "20792",
    "AddressInfo": {
        "ID": 182465,
        "Title": "An der Linde 41",
        "AddressLine1": "An der Linde 41",
        "Town": "Herne",
        "Postcode": "44627",
        "CountryID": 87,
        "Latitude": 51.547593,
        "Longitude": 7.261292,
        "DistanceUnit": 0
    },
    "Connections": [
        {
            "ID": 287434,
            "ConnectionTypeID": 25,
            "StatusTypeID": 50,
            "LevelID": 2,
            "PowerKW": 22,
            "CurrentTypeID": 20
        },
        {
            "ID": 287435,
            "ConnectionTypeID": 25,
            "StatusTypeID": 50,
            "LevelID": 2,
            "PowerKW": 22,
            "CurrentTypeID": 20
        }
    ],
    "StatusTypeID": 50,
    "DateLastStatusUpdate": "2021-07-12T02:48:00Z",
    "MetadataValues": [
        {
            "ID": 14400,
            "MetadataFieldID": 4,
            "ItemValue": "Data from the German chargepoint registry provided by Bundesnetzagentur.de under the CC-BY 4.0 license"
        }
    ],
    "DataQualityLevel": 3,
    "DateCreated": "2021-07-08T10:02:00Z",
    "SubmissionStatusTypeID": 100
}