{
    "IsRecentlyVerified": false,
    "ID": 34928,
    "UUID": "3F6D4B56-3320-4641-9B96-0DD48D58948F",
    "DataProviderID": 26,
    "DataProvidersReference": "47619",
    "OperatorID": 178,
    "OperatorsReference": "EVnetNL AL770",
    "UsageCost": "0.00 jaarabonnement",
    "AddressInfo": {
        "ID": 35274,
        "Title": "Simon Stevinweg 20",
        "AddressLine1": "Simon Stevinweg 20",
        "Town": "Arnhem",
        "Postcode": "6827 BT",
        "CountryID": 159,
        "Latitude": 51.975409,
        "Longitude": 5.943654,
        "ContactTelephone1": "0800-3522365",
        "RelatedURL": "http://www.evnet.nl",
        "DistanceUnit": 0
    },
    "Connections": [
        {
            "ID": 38439,
            "ConnectionTypeID": 25,
            "LevelID": 2,
            "PowerKW": 11,
            "CurrentTypeID": 10
        }
    ],
    "NumberOfPoints": 2,
    "StatusTypeID": 50,
    "DateLastStatusUpdate": "2016-06-04T02:43:00Z",
    "DataQualityLevel": 3,
    "DateCreated": "2015-01-09T06:04:00Z",
    "SubmissionStatusTypeID": 100
}