{
    "IsRecentlyVerified": false,
    "ID": 181261,
    "UUID": "76ED1C4B-F21F-4006-8784-94BD1ED39605",
    "DataProviderID": 29,
    "DataProvidersReference": "16346",
    "AddressInfo": {
        "ID": 181620,
        "Title": "Seeufer 18",
        "AddressLine1": "Seeufer 18",
        "Town": "Simmerath",
        "Postcode": "52152",
        "CountryID": 87,
        "Latitude": 50.60724,
        "Longitude": 6.380721,
        "DistanceUnit": 0
    },
    "Connections": [
        {
            "ID": 285363,
            "ConnectionTypeID": 28,
            "StatusTypeID": 50,
            "LevelID": 2,
            "PowerKW": 22,
            "CurrentTypeID": 10
        },
        {
            "ID": 285364,
            "ConnectionTypeID": 28,
            "StatusTypeID": 50,
            "LevelID": 2,
            "PowerKW": 22,
            "CurrentTypeID": 10
        }
    ],
    "StatusTypeID": 50,
    "DateLastStatusUpdate": "2021-07-09T03:19:00Z",
    "MetadataValues": [
        {
            "ID": 13555,
            "MetadataFieldID": 4,
            "ItemValue": "Data from the German chargepoint registry provided by Bundesnetzagentur.de under the CC-BY 4.0 license"
        }
    ],
    "DataQualityLevel": 3,
    "DateCreated": "2021-07-08T10:01:00Z",
    "SubmissionStatusTypeID": 100
}