{
    "IsRecentlyVerified": false,
    "ID": 111236,
    "UUID": "4A7754F6-38EC-47F5-B4F0-1A668FEBDA9B",
    "DataProviderID": 2,
    "DataProvidersReference": "99556",
    "OperatorID": 59,
    "UsageTypeID": 1,
    "AddressInfo": {
        "ID": 111582,
        "Title": "Greenlots - 43131",
        "AddressLine1": "Carpool Lot",
        "Town": "Washago",
        "StateOrProvince": "ON",
        "Postcode": "111111",
        "CountryID": 44,
        "Latitude": 44.7529792785645,
        "Longitude": -79.3384170532227,
        "ContactTelephone1": "855-900-7584",
        "AccessComments": "24 hours daily",
        "RelatedURL": "http://greenlots.com/",
        "DistanceUnit": 0
    },
    "Connections": [
        {
            "ID": 156622,
            "ConnectionTypeID": 2,
            "LevelID": 3,
            "Amps": 100,
            "Voltage": 400,
            "PowerKW": 40,
            "CurrentTypeID": 30,
            "Quantity": 1
        },
        {
            "ID": 156623,
            "ConnectionTypeID": 32,
            "LevelID": 3,
            "Amps": 100,
            "Voltage": 400,
            "PowerKW": 40,
            "CurrentTypeID": 30,
            "Quantity": 1
        }
    ],
    "DateLastStatusUpdate": "2020-06-26T03:08:00Z",
    "DataQualityLevel": 3,
    "DateCreated": "2018-10-18T23:36:00Z",
    "SubmissionStatusTypeID": 100
}