{
    "IsRecentlyVerified": false,
    "ID": 103921,
    "UUID": "D04A5DFF-5524-439C-B7F3-61B1E2E44030",
    "DataProviderID": 1,
    "OperatorID": 32,
    "OperatorsReference": "10571,10572",
    "UsageTypeID": 4,
    "UsageCost": "Inclusive; for Polar Plus subscription members only",
    "AddressInfo": {
        "ID": 104267,
        "Title": "ASDA",
        "AddressLine1": "ASDA",
        "Town": "Church street",
        "StateOrProvince": "Biggleswade",
        "Postcode": "SG18 0JS",
        "CountryID": 1,
        "Latitude": 52.088066,
        "Longitude": -0.264523,
        "DistanceUnit": 0
    },
    "Connections": [
        {
            "ID": 146695,
            "ConnectionTypeID": 25,
            "StatusTypeID": 50,
            "LevelID": 2,
            "Amps": 32,
            "Voltage": 230,
            "PowerKW": 7,
            "CurrentTypeID": 10,
            "Quantity": 4
        }
    ],
    "NumberOfPoints": 4,
    "GeneralComments": "GROUND",
    "StatusTypeID": 50,
    "DateLastStatusUpdate": "2019-03-07T06:16:00Z",
    "DataQualityLevel": 1,
    "DateCreated": "2018-05-12T05:14:00Z",
    "SubmissionStatusTypeID": 200
}