{
    "IsRecentlyVerified": false,
    "ID": 161312,
    "UUID": "98278F2C-1397-4D56-9470-09EC8DF6AF58",
    "DataProviderID": 1,
    "OperatorID": 3367,
    "UsageTypeID": 4,
    "AddressInfo": {
        "ID": 161669,
        "Title": "Kumru - Fatsa yolu",
        "AddressLine1": "Kumru - Fatsa yolu",
        "Town": "Kaleönü",
        "StateOrProvince": "Ordu",
        "Postcode": "",
        "CountryID": 229,
        "Latitude": 41.020711717453224,
        "Longitude": 37.476905072820045,
        "ContactTelephone1": "+90 850 811 72 75",
        "RelatedURL": "https://www.sharz.net/nerelerdeyiz/",
        "DistanceUnit": 0
    },
    "Connections": [
        {
            "ID": 232154,
            "ConnectionTypeID": 25,
            "StatusTypeID": 50,
            "LevelID": 2,
            "Amps": 32,
            "Voltage": 400,
            "PowerKW": 22,
            "CurrentTypeID": 20,
            "Quantity": 1
        }
    ],
    "NumberOfPoints": 1,
    "StatusTypeID": 50,
    "DateLastStatusUpdate": "2020-07-14T07:21:00Z",
    "DataQualityLevel": 1,
    "DateCreated": "2020-07-08T14:09:00Z",
    "SubmissionStatusTypeID": 200
}