{
    "IsRecentlyVerified": false,
    "ID": 162214,
    "UUID": "298D66E0-EEA5-4F6E-9314-7FBAD950B060",
    "DataProviderID": 1,
    "OperatorID": 21,
    "UsageTypeID": 4,
    "UsageCost": "Mobi.E compatible card",
    "AddressInfo": {
        "ID": 162571,
        "Title": "GDL-00004",
        "AddressLine1": "LIDL",
        "Town": "Grândola",
        "StateOrProvince": "Alentejo",
        "Postcode": "",
        "CountryID": 180,
        "Latitude": 38.18453894591957,
        "Longitude": -8.568580660931502,
        "DistanceUnit": 0
    },
    "Connections": [
        {
            "ID": 233452,
            "ConnectionTypeID": 2,
            "StatusTypeID": 50,
            "LevelID": 3,
            "Amps": 120,
            "Voltage": 500,
            "PowerKW": 50,
            "CurrentTypeID": 30,
            "Quantity": 1
        },
        {
            "ID": 233453,
            "ConnectionTypeID": 33,
            "StatusTypeID": 50,
            "LevelID": 3,
            "Amps": 125,
            "Voltage": 500,
            "PowerKW": 50,
            "CurrentTypeID": 30,
            "Quantity": 1
        },
        {
            "ID": 233454,
            "ConnectionTypeID": 1036,
            "StatusTypeID": 50,
            "LevelID": 3,
            "Amps": 63,
            "Voltage": 400,
            "PowerKW": 43,
            "CurrentTypeID": 20,
            "Quantity": 1
        }
    ],
    "NumberOfPoints": 2,
    "StatusTypeID": 50,
    "DateLastStatusUpdate": "2020-09-11T10:28:00Z",
    "DataQualityLevel": 1,
    "DateCreated": "2020-08-02T18:58:00Z",
    "SubmissionStatusTypeID": 200
}