{
    "IsRecentlyVerified": false,
    "ID": 152442,
    "UUID": "A0746ED8-3B2E-4C23-BE23-0719C4E53F57",
    "DataProviderID": 28,
    "DataProvidersReference": "FR*S49*P49099*008",
    "UsageTypeID": 5,
    "AddressInfo": {
        "ID": 152795,
        "Title": "CHOLET - Rue Aubance",
        "AddressLine1": "Rue Aubance 49300 CHOLET",
        "CountryID": 80,
        "Latitude": 47.0787,
        "Longitude": -0.83442,
        "AccessComments": "24h/24 7j/7",
        "DistanceUnit": 0
    },
    "Connections": [
        {
            "ID": 213414,
            "ConnectionTypeID": 33,
            "StatusTypeID": 50,
            "LevelID": 3,
            "PowerKW": 50,
            "CurrentTypeID": 30
        },
        {
            "ID": 246342,
            "ConnectionTypeID": 33,
            "StatusTypeID": 50,
            "LevelID": 3,
            "PowerKW": 50,
            "CurrentTypeID": 30
        },
        {
            "ID": 246343,
            "ConnectionTypeID": 2,
            "StatusTypeID": 50,
            "LevelID": 3,
            "PowerKW": 50,
            "CurrentTypeID": 30
        }
    ],
    "GeneralComments": "Recharge par badge et avec une application smartphone",
    "StatusTypeID": 50,
    "DateLastStatusUpdate": "2020-08-27T05:13:00Z",
    "DataQualityLevel": 2,
    "DateCreated": "2020-03-15T10:53:00Z",
    "SubmissionStatusTypeID": 100
}