{
    "IsRecentlyVerified": false,
    "ID": 112156,
    "UUID": "AA45C0AD-6757-4278-AF43-4E8E4C7DC5EF",
    "DataProviderID": 2,
    "DataProvidersReference": "83766",
    "UsageTypeID": 1,
    "AddressInfo": {
        "ID": 112502,
        "Title": "Best Western - Regency Inn",
        "AddressLine1": "121 Edmonton Trail SE",
        "Town": "Airdrie",
        "StateOrProvince": "AB",
        "Postcode": "T4B 1S2",
        "CountryID": 44,
        "Latitude": 51.290673,
        "Longitude": -114.002815,
        "ContactTelephone1": "403-948-3838",
        "AccessComments": "24 hours daily; donations accepted",
        "RelatedURL": "",
        "DistanceUnit": 0
    },
    "Connections": [
        {
            "ID": 157707,
            "ConnectionTypeID": 1,
            "LevelID": 2,
            "Amps": 16,
            "Voltage": 230,
            "PowerKW": 3.7,
            "CurrentTypeID": 10,
            "Quantity": 1
        }
    ],
    "DateLastStatusUpdate": "2020-06-26T03:12:00Z",
    "DataQualityLevel": 3,
    "DateCreated": "2018-10-18T23:37:00Z",
    "SubmissionStatusTypeID": 100
}