{
    "IsRecentlyVerified": false,
    "ID": 148053,
    "UUID": "3B42DA57-CFB7-4932-BB92-C2A3A5B348E6",
    "DataProviderID": 1,
    "OperatorID": 3315,
    "OperatorsReference": "52466,52467",
    "UsageTypeID": 4,
    "UsageCost": "Free",
    "AddressInfo": {
        "ID": 148405,
        "Title": "Kings House Hotel, Ballachulish",
        "AddressLine1": "Glencoe",
        "Town": "Ballachulish",
        "Postcode": "PH49 4HY",
        "CountryID": 1,
        "Latitude": 56.650686,
        "Longitude": -4.83958,
        "DistanceUnit": 0
    },
    "Connections": [
        {
            "ID": 205547,
            "ConnectionTypeID": 25,
            "StatusTypeID": 75,
            "LevelID": 2,
            "Amps": 32,
            "Voltage": 400,
            "PowerKW": 22,
            "CurrentTypeID": 20,
            "Quantity": 4
        }
    ],
    "NumberOfPoints": 4,
    "StatusTypeID": 75,
    "DateLastStatusUpdate": "2020-06-02T05:15:00Z",
    "DataQualityLevel": 1,
    "DateCreated": "2020-01-24T06:24:00Z",
    "SubmissionStatusTypeID": 200
}