{
    "IsRecentlyVerified": false,
    "ID": 81542,
    "UUID": "EBD94137-04CD-4CA9-826A-2B0BAE5E9742",
    "DataProviderID": 1,
    "OperatorID": 23,
    "OperatorsReference": "19042",
    "UsageTypeID": 4,
    "AddressInfo": {
        "ID": 81888,
        "Title": "Icon 80 Riverside BLVD",
        "AddressLine1": "80 Riverside BLVD",
        "Town": "New York",
        "StateOrProvince": "New York",
        "Postcode": "10069",
        "CountryID": 2,
        "Latitude": 40.775374,
        "Longitude": -73.989687,
        "ContactTelephone1": "(212) 245-1840",
        "DistanceUnit": 0
    },
    "Connections": [
        {
            "ID": 116283,
            "ConnectionTypeID": 30,
            "StatusTypeID": 50,
            "LevelID": 2,
            "PowerKW": 8,
            "CurrentTypeID": 10,
            "Quantity": 2
        }
    ],
    "NumberOfPoints": 2,
    "GeneralComments": "2 Tesla Connectors, up to 8kW.Available to the public. Please see valet.",
    "StatusTypeID": 50,
    "DateLastStatusUpdate": "2017-07-13T14:38:00Z",
    "DataQualityLevel": 1,
    "DateCreated": "2017-02-02T22:39:00Z",
    "SubmissionStatusTypeID": 200
}