{
    "IsRecentlyVerified": false,
    "ID": 56591,
    "UUID": "24733211-7C10-4768-B1A9-0B23DBE7FF0D",
    "DataProviderID": 2,
    "DataProvidersReference": "70758",
    "OperatorID": 5,
    "UsageTypeID": 1,
    "AddressInfo": {
        "ID": 56937,
        "Title": "EVERGY",
        "AddressLine1": "1605 S Main St @ Walmart #801",
        "Town": "Maryville",
        "StateOrProvince": "MO",
        "Postcode": "64468",
        "CountryID": 2,
        "Latitude": 40.330076,
        "Longitude": -94.873667,
        "ContactTelephone1": "888-758-4389",
        "AccessComments": "24 hours daily",
        "RelatedURL": "http://www.chargepoint.com/",
        "DistanceUnit": 0
    },
    "Connections": [
        {
            "ID": 71350,
            "ConnectionTypeID": 1,
            "LevelID": 2,
            "Amps": 16,
            "Voltage": 230,
            "PowerKW": 3.7,
            "CurrentTypeID": 10,
            "Quantity": 6
        }
    ],
    "DateLastStatusUpdate": "2020-06-26T03:03:00Z",
    "DataQualityLevel": 3,
    "DateCreated": "2015-11-04T08:42:00Z",
    "SubmissionStatusTypeID": 100
}