{
    "IsRecentlyVerified": false,
    "ID": 134933,
    "UUID": "D0D93169-ADB8-49DF-9CD9-6010DE76F136",
    "DataProviderID": 1,
    "OperatorID": 3345,
    "UsageTypeID": 5,
    "AddressInfo": {
        "ID": 135279,
        "Title": "Lanbury Road",
        "AddressLine1": "Lanbury Road",
        "Town": "Nunhead",
        "Postcode": "SE15 3DB",
        "CountryID": 1,
        "Latitude": 51.459132,
        "Longitude": -0.047873,
        "RelatedURL": "https://char.gy",
        "DistanceUnit": 0
    },
    "Connections": [
        {
            "ID": 188861,
            "ConnectionTypeID": 25,
            "Reference": "00038",
            "StatusTypeID": 50,
            "LevelID": 2,
            "Amps": 16,
            "Voltage": 230,
            "PowerKW": 3.7,
            "CurrentTypeID": 10
        }
    ],
    "StatusTypeID": 0,
    "DateLastStatusUpdate": "2019-12-03T14:27:00Z",
    "MetadataValues": [
        {
            "ID": 5274,
            "MetadataFieldID": 4,
            "ItemValue": "Contains public sector information licensed under the Open Government Licence v2.0. http://www.nationalarchives.gov.uk/doc/open-government-licence/version/2/"
        }
    ],
    "DataQualityLevel": 3,
    "DateCreated": "2019-12-03T13:42:00Z",
    "SubmissionStatusTypeID": 100
}