{
    "MediaItems": [
        {
            "ID": 13152,
            "ChargePointID": 91622,
            "ItemURL": "https://s3-ap-southeast-2.amazonaws.com/openchargemap/images/DE/OCM91622/OCM-91622.orig.2017081110112278.jpeg",
            "ItemThumbnailURL": "https://s3-ap-southeast-2.amazonaws.com/openchargemap/images/DE/OCM91622/OCM-91622.thmb.2017081110112278.jpeg",
            "Comment": "",
            "IsEnabled": true,
            "IsVideo": false,
            "IsFeaturedItem": false,
            "IsExternalResource": false,
            "User": {
                "ID": 15985,
                "Username": "karo2204"
            },
            "DateCreated": "2017-08-11T10:12:00Z"
        }
    ],
    "IsRecentlyVerified": false,
    "ID": 91622,
    "UUID": "0C9F6CFF-C62E-4A48-855F-10B1950A0D87",
    "DataProviderID": 1,
    "OperatorID": 69,
    "UsageTypeID": 4,
    "AddressInfo": {
        "ID": 91968,
        "Title": "Robert-Heger-Straße",
        "AddressLine1": "Robert-Heger-Straße 20",
        "Town": "München",
        "StateOrProvince": "Bayern",
        "Postcode": "81927",
        "CountryID": 87,
        "Latitude": 48.15841,
        "Longitude": 11.642529999999965,
        "AccessComments": "24/7 open",
        "DistanceUnit": 0
    },
    "Connections": [
        {
            "ID": 129891,
            "ConnectionTypeID": 25,
            "StatusTypeID": 50,
            "LevelID": 2,
            "Amps": 32,
            "Voltage": 400,
            "PowerKW": 22,
            "CurrentTypeID": 20,
            "Quantity": 4
        }
    ],
    "NumberOfPoints": 4,
    "StatusTypeID": 50,
    "DateLastStatusUpdate": "2017-08-11T10:12:00Z",
    "DataQualityLevel": 1,
    "DateCreated": "2017-08-09T11:08:00Z",
    "SubmissionStatusTypeID": 200
}