{
    "IsRecentlyVerified": false,
    "ID": 122308,
    "UUID": "9423F1C3-FBF5-4EDE-A3E8-208C923C6299",
    "DataProviderID": 2,
    "DataProvidersReference": "91899",
    "OperatorID": 3293,
    "UsageTypeID": 1,
    "AddressInfo": {
        "ID": 122654,
        "Title": "Plaza West Covina - Lucille's Smokehouse",
        "AddressLine1": "1445 Plaza Dr",
        "Town": "West Covina",
        "StateOrProvince": "CA",
        "Postcode": "91790",
        "CountryID": 2,
        "Latitude": 34.071465,
        "Longitude": -117.931977,
        "ContactTelephone1": "626-338-1227  888-264-2208",
        "AccessComments": "6am-12am daily",
        "RelatedURL": "https://voltacharging.com/",
        "DistanceUnit": 0
    },
    "Connections": [
        {
            "ID": 172189,
            "ConnectionTypeID": 1,
            "LevelID": 2,
            "Amps": 16,
            "Voltage": 230,
            "PowerKW": 3.7,
            "CurrentTypeID": 10,
            "Quantity": 2
        }
    ],
    "DateLastStatusUpdate": "2020-06-26T02:56:00Z",
    "DataQualityLevel": 3,
    "DateCreated": "2019-04-06T05:02:00Z",
    "SubmissionStatusTypeID": 100
}