{
    "IsRecentlyVerified": false,
    "ID": 141601,
    "UUID": "D4E86778-E7CD-4A35-9E91-37B17E25B27F",
    "DataProviderID": 2,
    "DataProvidersReference": "99826",
    "OperatorID": 5,
    "UsageTypeID": 1,
    "AddressInfo": {
        "ID": 141953,
        "Title": "EV CHARGING STA",
        "AddressLine1": "3151 CA-128",
        "Town": "Philo",
        "StateOrProvince": "CA",
        "Postcode": "95466",
        "CountryID": 2,
        "Latitude": 39.1195036,
        "Longitude": -123.5143058,
        "ContactTelephone1": "888-758-4389",
        "AccessComments": "24 hours daily",
        "RelatedURL": "http://www.chargepoint.com/",
        "DistanceUnit": 0
    },
    "Connections": [
        {
            "ID": 197567,
            "ConnectionTypeID": 1,
            "LevelID": 2,
            "Amps": 16,
            "Voltage": 230,
            "PowerKW": 3,
            "CurrentTypeID": 10,
            "Quantity": 2
        }
    ],
    "StatusTypeID": 50,
    "DateLastStatusUpdate": "2019-12-24T09:15:00Z",
    "DataQualityLevel": 3,
    "DateCreated": "2019-12-24T09:15:00Z",
    "SubmissionStatusTypeID": 100
}