{
    "UserComments": [
        {
            "ID": 9598,
            "ChargePointID": 53038,
            "CommentTypeID": 10,
            "UserName": "BarnyDaley",
            "Comment": "Spaces in front of charger now marked out and no longer regularly ICEd",
            "Rating": 4,
            "DateCreated": "2016-01-29T23:30:58.947Z",
            "User": {
                "ID": 1158,
                "Username": "BarnyDaley"
            },
            "CheckinStatusTypeID": 210
        }
    ],
    "IsRecentlyVerified": false,
    "ID": 53038,
    "UUID": "7CF95C7D-6426-411D-943B-DCA60BF68B12",
    "DataProviderID": 1,
    "OperatorID": 32,
    "OperatorsReference": "21008",
    "UsageTypeID": 4,
    "UsageCost": "£0.108/kWh; for Polar Plus subscription members only",
    "AddressInfo": {
        "ID": 53384,
        "Title": "Elder Gate",
        "AddressLine1": "Elder Gate",
        "AddressLine2": "Central Milton Keynes",
        "Town": "Milton Keynes",
        "StateOrProvince": "Buckinghamshire",
        "Postcode": "MK9 1BE",
        "CountryID": 1,
        "Latitude": 52.034247735186,
        "Longitude": -0.770614743232727,
        "DistanceUnit": 0
    },
    "Connections": [
        {
            "ID": 66088,
            "ConnectionTypeID": 2,
            "StatusTypeID": 50,
            "LevelID": 3,
            "PowerKW": 50,
            "CurrentTypeID": 30,
            "Quantity": 1
        },
        {
            "ID": 66089,
            "ConnectionTypeID": 33,
            "StatusTypeID": 50,
            "LevelID": 3,
            "PowerKW": 50,
            "CurrentTypeID": 30,
            "Quantity": 1
        },
        {
            "ID": 66090,
            "ConnectionTypeID": 1036,
            "StatusTypeID": 50,
            "LevelID": 3,
            "Voltage": 400,
            "PowerKW": 43,
            "CurrentTypeID": 20,
            "Quantity": 1
        }
    ],
    "NumberOfPoints": 2,
    "GeneralComments": "DBT Triple-headed charger",
    "StatusTypeID": 50,
    "DateLastStatusUpdate": "2019-06-21T05:15:00Z",
    "DataQualityLevel": 1,
    "DateCreated": "2015-09-17T12:55:00Z",
    "SubmissionStatusTypeID": 200
}