{
    "IsRecentlyVerified": false,
    "ID": 139866,
    "UUID": "3CA785A0-7045-4EA1-814E-FD31E7566EE8",
    "DataProviderID": 2,
    "DataProvidersReference": "48711",
    "UsageTypeID": 2,
    "AddressInfo": {
        "ID": 140218,
        "Title": "Naval Base - Ventura Point Mugu",
        "AddressLine1": "NA",
        "Town": "Point Mugu",
        "StateOrProvince": "CA",
        "Postcode": "93042",
        "CountryID": 2,
        "Latitude": 34.122286,
        "Longitude": -119.110417,
        "ContactTelephone1": "",
        "AccessComments": "",
        "RelatedURL": "",
        "DistanceUnit": 0
    },
    "Connections": [
        {
            "ID": 195350,
            "ConnectionTypeID": 1,
            "LevelID": 2,
            "Amps": 16,
            "Voltage": 230,
            "PowerKW": 3.7,
            "CurrentTypeID": 10,
            "Quantity": 1
        }
    ],
    "StatusTypeID": 50,
    "DateLastStatusUpdate": "2020-06-26T02:57:00Z",
    "DataQualityLevel": 3,
    "DateCreated": "2019-12-24T09:11:00Z",
    "SubmissionStatusTypeID": 100
}