{
    "IsRecentlyVerified": false,
    "ID": 119849,
    "UUID": "368508F4-DF22-4423-A4CB-2F2D798B4B85",
    "DataProviderID": 2,
    "DataProvidersReference": "71925",
    "OperatorID": 5,
    "UsageTypeID": 1,
    "AddressInfo": {
        "ID": 120195,
        "Title": "VALENCIACOLLEGE",
        "AddressLine1": "419 N Econlockhatchee Trail",
        "Town": "Orlando",
        "StateOrProvince": "FL",
        "Postcode": "32825",
        "CountryID": 2,
        "Latitude": 28.5495932,
        "Longitude": -81.2506334,
        "ContactTelephone1": "888-758-4389",
        "AccessComments": "24 hours daily",
        "RelatedURL": "http://www.chargepoint.com/",
        "DistanceUnit": 0
    },
    "Connections": [
        {
            "ID": 169141,
            "ConnectionTypeID": 1,
            "LevelID": 2,
            "Amps": 16,
            "Voltage": 230,
            "PowerKW": 3,
            "CurrentTypeID": 10,
            "Quantity": 2
        }
    ],
    "DateLastStatusUpdate": "2019-12-24T09:08:00Z",
    "DataQualityLevel": 3,
    "DateCreated": "2019-04-01T04:59:00Z",
    "SubmissionStatusTypeID": 100
}