{
    "IsRecentlyVerified": false,
    "ID": 53225,
    "UUID": "5987794E-E507-4AC4-9DF2-BF059EEFC17C",
    "DataProviderID": 2,
    "DataProvidersReference": "69199",
    "OperatorID": 5,
    "UsageTypeID": 1,
    "AddressInfo": {
        "ID": 53571,
        "Title": "GA GWINNETT COL",
        "AddressLine1": "225 Collins Industrial Way",
        "Town": "Lawrenceville",
        "StateOrProvince": "GA",
        "Postcode": "30043",
        "CountryID": 2,
        "Latitude": 33.97728,
        "Longitude": -84.002755,
        "ContactTelephone1": "888-758-4389",
        "AccessComments": "24 hours daily",
        "RelatedURL": "http://www.chargepoint.com/",
        "DistanceUnit": 0
    },
    "Connections": [
        {
            "ID": 66318,
            "ConnectionTypeID": 1,
            "LevelID": 2,
            "Amps": 16,
            "Voltage": 230,
            "PowerKW": 3,
            "CurrentTypeID": 10,
            "Quantity": 2
        }
    ],
    "DateLastStatusUpdate": "2019-04-06T04:01:00Z",
    "DataQualityLevel": 3,
    "DateCreated": "2015-09-20T11:18:00Z",
    "SubmissionStatusTypeID": 100
}