{
    "IsRecentlyVerified": false,
    "ID": 28333,
    "UUID": "42E1D555-17FF-4D5A-A819-70652903D41A",
    "DataProviderID": 2,
    "DataProvidersReference": "64060",
    "UsageTypeID": 1,
    "AddressInfo": {
        "ID": 28679,
        "Title": "Sheetz Store #187",
        "AddressLine1": "400 E Plank Rd",
        "Town": "Altoona",
        "StateOrProvince": "PA",
        "Postcode": "16602",
        "CountryID": 2,
        "Latitude": 40.480442,
        "Longitude": -78.403264,
        "ContactTelephone1": "814-944-6094",
        "AccessComments": "24 hours daily",
        "RelatedURL": "",
        "DistanceUnit": 0
    },
    "Connections": [
        {
            "ID": 31130,
            "ConnectionTypeID": 2,
            "LevelID": 2,
            "Amps": 100,
            "Voltage": 400,
            "PowerKW": 40,
            "CurrentTypeID": 10,
            "Quantity": 1
        },
        {
            "ID": 159457,
            "ConnectionTypeID": 32,
            "LevelID": 2,
            "Amps": 100,
            "Voltage": 400,
            "PowerKW": 40,
            "CurrentTypeID": 10,
            "Quantity": 1
        }
    ],
    "DateLastStatusUpdate": "2019-04-06T04:03:00Z",
    "DataQualityLevel": 3,
    "DateCreated": "2014-11-28T03:38:00Z",
    "SubmissionStatusTypeID": 100
}