{
    "IsRecentlyVerified": false,
    "ID": 142536,
    "UUID": "50E29058-7234-42DD-BBC0-6318EBB4769C",
    "DataProviderID": 2,
    "DataProvidersReference": "121570",
    "OperatorID": 5,
    "UsageTypeID": 1,
    "AddressInfo": {
        "ID": 142888,
        "Title": "BERGEN HARLEY",
        "AddressLine1": "124 Essex St",
        "Town": "Rochelle Park",
        "StateOrProvince": "NJ",
        "Postcode": "07662",
        "CountryID": 2,
        "Latitude": 40.8925056,
        "Longitude": -74.0731379,
        "ContactTelephone1": "888-758-4389",
        "AccessComments": "24 hours daily",
        "RelatedURL": "http://www.chargepoint.com/",
        "DistanceUnit": 0
    },
    "Connections": [
        {
            "ID": 198690,
            "ConnectionTypeID": 32,
            "LevelID": 3,
            "Amps": 100,
            "Voltage": 400,
            "PowerKW": 40,
            "CurrentTypeID": 30,
            "Quantity": 1
        }
    ],
    "StatusTypeID": 50,
    "DateLastStatusUpdate": "2020-06-26T03:03:00Z",
    "DataQualityLevel": 3,
    "DateCreated": "2019-12-24T09:18:00Z",
    "SubmissionStatusTypeID": 100
}