{
    "IsRecentlyVerified": false,
    "ID": 37729,
    "UUID": "BFA41227-FEC5-4F92-AE26-78FBBFEF6044",
    "DataProviderID": 26,
    "DataProvidersReference": "16510",
    "OperatorID": 162,
    "OperatorsReference": "Kadijksplein 16, 1018  AC",
    "UsageCost": "0.00 gratis",
    "AddressInfo": {
        "ID": 38075,
        "Title": "Hoogte Kadijk 8-1",
        "AddressLine1": "Hoogte Kadijk 8-1",
        "Town": "Amsterdam",
        "Postcode": "1018 BL",
        "CountryID": 159,
        "Latitude": 52.370193,
        "Longitude": 4.912662,
        "DistanceUnit": 0
    },
    "Connections": [
        {
            "ID": 41240,
            "ConnectionTypeID": 28,
            "LevelID": 1,
            "PowerKW": 2.3,
            "CurrentTypeID": 10
        }
    ],
    "NumberOfPoints": 1,
    "StatusTypeID": 50,
    "DateLastStatusUpdate": "2016-06-04T02:53:00Z",
    "DataQualityLevel": 3,
    "DateCreated": "2015-01-09T06:07:00Z",
    "SubmissionStatusTypeID": 100
}