{
    "MediaItems": [
        {
            "ID": 3503,
            "ChargePointID": 54118,
            "ItemURL": "https://s3-ap-southeast-2.amazonaws.com/openchargemap/images/CH/OCM54118/OCM-54118.orig.2015111710474852.jpeg",
            "ItemThumbnailURL": "https://s3-ap-southeast-2.amazonaws.com/openchargemap/images/CH/OCM54118/OCM-54118.thmb.2015111710474852.jpeg",
            "Comment": "",
            "IsEnabled": true,
            "IsVideo": false,
            "IsFeaturedItem": false,
            "IsExternalResource": false,
            "User": {
                "ID": 2320,
                "Username": "Christian Schlaepfer"
            },
            "DateCreated": "2015-11-17T10:48:00Z"
        }
    ],
    "IsRecentlyVerified": false,
    "ID": 54118,
    "UUID": "FC9EF20E-398E-47D8-9D87-4DB39F6FC42F",
    "DataProviderID": 1,
    "OperatorID": 1,
    "UsageTypeID": 1,
    "UsageCost": "Free",
    "AddressInfo": {
        "ID": 54464,
        "Title": "La Fonte",
        "AddressLine1": "Alpe del Curil",
        "Town": "San Bernardino ",
        "StateOrProvince": "Svizzera, Grigioni",
        "Postcode": "6565",
        "CountryID": 217,
        "Latitude": 46.4641868183628,
        "Longitude": 9.1916835308075,
        "ContactTelephone1": "+41798221724",
        "ContactEmail": "macchri@bluewin.ch",
        "AccessComments": "Recarsi presso la fonte di San Bernardino",
        "DistanceUnit": 0
    },
    "Connections": [
        {
            "ID": 67952,
            "ConnectionTypeID": 25,
            "StatusTypeID": 50,
            "LevelID": 2,
            "Amps": 16,
            "Voltage": 400,
            "PowerKW": 11,
            "CurrentTypeID": 20,
            "Quantity": 1
        }
    ],
    "NumberOfPoints": 1,
    "StatusTypeID": 50,
    "DateLastStatusUpdate": "2015-11-17T10:48:00Z",
    "DataQualityLevel": 1,
    "DateCreated": "2015-09-22T20:10:00Z",
    "SubmissionStatusTypeID": 200
}