{
    "IsRecentlyVerified": false,
    "ID": 62752,
    "UUID": "022EC710-CF40-43B7-8F1E-268A9CDAA10B",
    "DataProviderID": 26,
    "DataProvidersReference": "79362",
    "OperatorID": 73,
    "OperatorsReference": "EV-Box EVB-P1536073",
    "UsageCost": "0.00 jaarabonnement",
    "AddressInfo": {
        "ID": 63098,
        "Title": "D 710",
        "AddressLine1": "D 710",
        "Town": "Salles-de-Belvès",
        "Postcode": "24170",
        "CountryID": 80,
        "Latitude": 44.76209,
        "Longitude": 1.01542,
        "RelatedURL": "http://www.ev-box.nl",
        "DistanceUnit": 0
    },
    "Connections": [
        {
            "ID": 79682,
            "ConnectionTypeID": 25,
            "LevelID": 2,
            "PowerKW": 5,
            "CurrentTypeID": 10
        },
        {
            "ID": 79683,
            "ConnectionTypeID": 25,
            "LevelID": 2,
            "PowerKW": 5,
            "CurrentTypeID": 10
        },
        {
            "ID": 79684,
            "ConnectionTypeID": 25,
            "LevelID": 2,
            "PowerKW": 11,
            "CurrentTypeID": 10
        },
        {
            "ID": 79685,
            "ConnectionTypeID": 25,
            "LevelID": 2,
            "PowerKW": 11,
            "CurrentTypeID": 10
        }
    ],
    "NumberOfPoints": 1,
    "StatusTypeID": 50,
    "DateLastStatusUpdate": "2016-06-04T02:37:00Z",
    "DataQualityLevel": 3,
    "DateCreated": "2016-03-03T12:29:00Z",
    "SubmissionStatusTypeID": 100
}