{
    "IsRecentlyVerified": false,
    "ID": 123257,
    "UUID": "70E34F1C-41CF-41F6-BD0C-2FEADCFAE4FC",
    "DataProviderID": 2,
    "DataProvidersReference": "65385",
    "OperatorID": 5,
    "UsageTypeID": 1,
    "AddressInfo": {
        "ID": 123603,
        "Title": "THE M RESORT",
        "AddressLine1": "12300 S Las Vegas Blvd",
        "Town": "Henderson",
        "StateOrProvince": "NV",
        "Postcode": "89044",
        "CountryID": 2,
        "Latitude": 35.9652931,
        "Longitude": -115.1683823,
        "ContactTelephone1": "888-758-4389",
        "AccessComments": "24 hours daily",
        "RelatedURL": "http://www.chargepoint.com/",
        "DistanceUnit": 0
    },
    "Connections": [
        {
            "ID": 173216,
            "ConnectionTypeID": 1,
            "LevelID": 2,
            "Amps": 16,
            "Voltage": 230,
            "PowerKW": 3.7,
            "CurrentTypeID": 10,
            "Quantity": 2
        }
    ],
    "DateLastStatusUpdate": "2020-06-26T02:58:00Z",
    "DataQualityLevel": 3,
    "DateCreated": "2019-04-06T05:03:00Z",
    "SubmissionStatusTypeID": 100
}