{
    "IsRecentlyVerified": false,
    "ID": 141913,
    "UUID": "E8D12D5B-3BDB-4F5F-81A8-9A24874A8722",
    "DataProviderID": 2,
    "DataProvidersReference": "145184",
    "OperatorID": 5,
    "UsageTypeID": 1,
    "AddressInfo": {
        "ID": 142265,
        "Title": "FLASHGORDON1",
        "AddressLine1": "16565 E 33rd Dr",
        "Town": "Aurora",
        "StateOrProvince": "CO",
        "Postcode": "80011",
        "CountryID": 2,
        "Latitude": 39.764977,
        "Longitude": -104.79532,
        "ContactTelephone1": "888-758-4389",
        "AccessComments": "24 hours daily",
        "RelatedURL": "http://www.chargepoint.com/",
        "DistanceUnit": 0
    },
    "Connections": [
        {
            "ID": 197953,
            "ConnectionTypeID": 32,
            "LevelID": 3,
            "Amps": 100,
            "Voltage": 400,
            "PowerKW": 40,
            "CurrentTypeID": 30,
            "Quantity": 1
        }
    ],
    "StatusTypeID": 50,
    "DateLastStatusUpdate": "2020-06-26T03:02:00Z",
    "DataQualityLevel": 3,
    "DateCreated": "2019-12-24T09:16:00Z",
    "SubmissionStatusTypeID": 100
}