{
    "IsRecentlyVerified": false,
    "ID": 35336,
    "UUID": "086113B9-5805-4AD1-98F6-65EA77B536A2",
    "DataProviderID": 26,
    "DataProvidersReference": "50975",
    "OperatorID": 180,
    "OperatorsReference": "Alfen RHL02021",
    "UsageCost": "0.00 jaarabonnement",
    "AddressInfo": {
        "ID": 35682,
        "Title": "Rijnweg 226",
        "AddressLine1": "Rijnweg 226",
        "Town": "Westland",
        "Postcode": "2681 SW",
        "CountryID": 159,
        "Latitude": 52.029143,
        "Longitude": 4.172445,
        "ContactTelephone1": "036 - 549 34 00",
        "RelatedURL": "http://www.icu-charging-stations.com/",
        "DistanceUnit": 0
    },
    "Connections": [
        {
            "ID": 38847,
            "ConnectionTypeID": 25,
            "LevelID": 2,
            "PowerKW": 11,
            "CurrentTypeID": 10
        },
        {
            "ID": 47815,
            "ConnectionTypeID": 25,
            "LevelID": 2,
            "PowerKW": 11,
            "CurrentTypeID": 10
        }
    ],
    "NumberOfPoints": 1,
    "StatusTypeID": 50,
    "DateLastStatusUpdate": "2016-06-04T02:44:00Z",
    "DataQualityLevel": 3,
    "DateCreated": "2015-01-09T06:04:00Z",
    "SubmissionStatusTypeID": 100
}