{
    "IsRecentlyVerified": false,
    "ID": 67530,
    "UUID": "02C3E8D6-0761-4934-8237-7EB5FF62FC17",
    "DataProviderID": 1,
    "OperatorID": 23,
    "OperatorsReference": "17767",
    "UsageTypeID": 1,
    "UsageCost": "Free",
    "AddressInfo": {
        "ID": 67876,
        "Title": "Inn at Pleasant Lake - Tesla",
        "AddressLine1": "853 Pleasant St",
        "Town": "New London",
        "StateOrProvince": "NH",
        "Postcode": "03257",
        "CountryID": 2,
        "Latitude": 43.433467,
        "Longitude": -71.969783,
        "ContactTelephone1": "603-526-6271  877-798-37852",
        "AccessComments": "24 hours daily; for Tesla use only",
        "RelatedURL": "http://www.teslamotors.com/supercharger",
        "DistanceUnit": 0
    },
    "Connections": [
        {
            "ID": 93035,
            "ConnectionTypeID": 30,
            "StatusTypeID": 50,
            "LevelID": 2,
            "Amps": 16,
            "Voltage": 230,
            "PowerKW": 8,
            "CurrentTypeID": 10,
            "Quantity": 1
        }
    ],
    "NumberOfPoints": 1,
    "StatusTypeID": 50,
    "DateLastStatusUpdate": "2017-01-26T03:42:00Z",
    "DataQualityLevel": 3,
    "DateCreated": "2016-05-29T02:05:00Z",
    "SubmissionStatusTypeID": 100
}