{
    "IsRecentlyVerified": false,
    "ID": 121956,
    "UUID": "FF48C420-7B33-4163-8800-86FF3E172201",
    "DataProviderID": 2,
    "DataProvidersReference": "79308",
    "OperatorID": 5,
    "UsageTypeID": 1,
    "AddressInfo": {
        "ID": 122302,
        "Title": "RIVERSIDE VW",
        "AddressLine1": "8330 Indiana Ave",
        "Town": "Riverside",
        "StateOrProvince": "CA",
        "Postcode": "92504",
        "CountryID": 2,
        "Latitude": 33.9252548,
        "Longitude": -117.4193756,
        "ContactTelephone1": "888-758-4389",
        "AccessComments": "24 hours daily",
        "RelatedURL": "http://www.chargepoint.com/",
        "DistanceUnit": 0
    },
    "Connections": [
        {
            "ID": 171803,
            "ConnectionTypeID": 1,
            "LevelID": 2,
            "Amps": 16,
            "Voltage": 230,
            "PowerKW": 3,
            "CurrentTypeID": 10,
            "Quantity": 2
        }
    ],
    "DateLastStatusUpdate": "2019-12-24T09:11:00Z",
    "DataQualityLevel": 3,
    "DateCreated": "2019-04-06T05:02:00Z",
    "SubmissionStatusTypeID": 100
}