{
    "IsRecentlyVerified": false,
    "ID": 99395,
    "UUID": "3F03A2CA-7A83-47CD-BAD9-73FFA21C5110",
    "DataProviderID": 1,
    "OperatorID": 23,
    "OperatorsReference": "40019",
    "UsageTypeID": 4,
    "AddressInfo": {
        "ID": 99741,
        "Title": "Fairfield Inn By Marriott Rochester South",
        "AddressLine1": "4695 W Henrietta RD",
        "Town": "Rochester",
        "StateOrProvince": "New York",
        "Postcode": "14623",
        "CountryID": 2,
        "Latitude": 43.059799,
        "Longitude": -77.6526793,
        "ContactTelephone1": "(585) 334-3350",
        "DistanceUnit": 0
    },
    "Connections": [
        {
            "ID": 140484,
            "ConnectionTypeID": 30,
            "StatusTypeID": 50,
            "LevelID": 2,
            "PowerKW": 16,
            "CurrentTypeID": 20,
            "Quantity": 2
        }
    ],
    "NumberOfPoints": 2,
    "GeneralComments": "2 Tesla Connectors, up to 16kW.Available for customers. Please see front desk.",
    "StatusTypeID": 50,
    "DateLastStatusUpdate": "2018-01-26T06:43:00Z",
    "DataQualityLevel": 1,
    "DateCreated": "2018-01-26T06:43:00Z",
    "SubmissionStatusTypeID": 200
}