{
    "IsRecentlyVerified": false,
    "ID": 158619,
    "UUID": "82495AD6-BD94-47BC-A268-1985E0E18ED6",
    "DataProviderID": 2,
    "DataProvidersReference": "155513",
    "UsageTypeID": 1,
    "AddressInfo": {
        "ID": 158976,
        "Title": "City of Manhattan Beach - Parking Lot 4",
        "AddressLine1": "3738 Highland Ave",
        "Town": "Manhattan Beach",
        "StateOrProvince": "CA",
        "Postcode": "90266",
        "CountryID": 2,
        "Latitude": 33.901511,
        "Longitude": -118.417927,
        "ContactTelephone1": "310-802-5000",
        "AccessComments": "24 hours daily; two hour parking limit",
        "RelatedURL": "",
        "DistanceUnit": 0
    },
    "Connections": [
        {
            "ID": 228630,
            "ConnectionTypeID": 1,
            "LevelID": 2,
            "Amps": 16,
            "Voltage": 230,
            "PowerKW": 3.7,
            "CurrentTypeID": 10,
            "Quantity": 2
        }
    ],
    "StatusTypeID": 50,
    "DateLastStatusUpdate": "2020-06-26T02:56:00Z",
    "DataQualityLevel": 3,
    "DateCreated": "2020-06-26T02:56:00Z",
    "SubmissionStatusTypeID": 100
}