{
    "IsRecentlyVerified": false,
    "ID": 30952,
    "UUID": "91766280-190F-421D-B536-E9F8C5503AAE",
    "DataProviderID": 1,
    "AddressInfo": {
        "ID": 31298,
        "Title": "Bee, Hamnplan snabbladdstation",
        "AddressLine1": "Sjögatan 5",
        "Town": "SUNDSVALL",
        "StateOrProvince": "VÄSTERNORRLAND",
        "Postcode": "85229",
        "CountryID": 216,
        "Latitude": 62.39114,
        "Longitude": 17.31345,
        "AccessComments": "Laddstationer på parkeringen utanför Hotell Baltic (Best Western) och i anslutning till gamla E4:an.",
        "DistanceUnit": 0
    },
    "Connections": [
        {
            "ID": 34181,
            "ConnectionTypeID": 2,
            "Reference": "1",
            "LevelID": 3,
            "Amps": 100,
            "Voltage": 500,
            "PowerKW": 50,
            "CurrentTypeID": 30,
            "Comments": "Mode 4"
        },
        {
            "ID": 87230,
            "ConnectionTypeID": 33,
            "Reference": "2",
            "LevelID": 3,
            "Amps": 100,
            "Voltage": 500,
            "PowerKW": 50,
            "CurrentTypeID": 30,
            "Comments": "Mode 4"
        },
        {
            "ID": 87231,
            "ConnectionTypeID": 25,
            "Reference": "3",
            "LevelID": 3,
            "Amps": 32,
            "Voltage": 400,
            "PowerKW": 12,
            "CurrentTypeID": 30,
            "Comments": "Mode 3"
        },
        {
            "ID": 87232,
            "ConnectionTypeID": 25,
            "Reference": "4",
            "LevelID": 3,
            "Amps": 32,
            "Voltage": 400,
            "PowerKW": 12,
            "CurrentTypeID": 30,
            "Comments": "Mode 3"
        },
        {
            "ID": 87233,
            "ConnectionTypeID": 1,
            "Reference": "5",
            "LevelID": 2,
            "Amps": 32,
            "Voltage": 230,
            "PowerKW": 7.4,
            "CurrentTypeID": 10,
            "Comments": "Mode 3"
        },
        {
            "ID": 89282,
            "ConnectionTypeID": 1,
            "Reference": "6",
            "LevelID": 2,
            "Amps": 32,
            "Voltage": 230,
            "PowerKW": 7.4,
            "CurrentTypeID": 10,
            "Comments": "Mode 3"
        }
    ],
    "NumberOfPoints": 6,
    "StatusTypeID": 0,
    "DateLastStatusUpdate": "2019-12-27T10:05:00Z",
    "DataQualityLevel": 2,
    "DateCreated": "2014-12-09T09:01:00Z",
    "SubmissionStatusTypeID": 100
}