{
    "UserComments": [
        {
            "ID": 20217,
            "ChargePointID": 95344,
            "CommentTypeID": 10,
            "UserName": "ForumElettrico.it",
            "RelatedURL": "https://www.forumelettrico.it/forum/colonnine-yess-energy-22-kw-fiera-di-rimini-rn-via-costantino-il-grande-ingresso-est-t3715.html",
            "DateCreated": "2018-09-27T04:46:42.687Z",
            "User": {
                "ID": 11749,
                "Username": "ForumElettrico.it"
            },
            "CheckinStatusTypeID": 10
        }
    ],
    "MediaItems": [
        {
            "ID": 16666,
            "ChargePointID": 95344,
            "ItemURL": "https://s3-ap-southeast-2.amazonaws.com/openchargemap/images/IT/OCM95344/OCM-95344.orig.2018092704472507.jpg",
            "ItemThumbnailURL": "https://s3-ap-southeast-2.amazonaws.com/openchargemap/images/IT/OCM95344/OCM-95344.thmb.2018092704472507.jpg",
            "Comment": "",
            "IsEnabled": true,
            "IsVideo": false,
            "IsFeaturedItem": false,
            "IsExternalResource": false,
            "User": {
                "ID": 11749,
                "Username": "ForumElettrico.it"
            },
            "DateCreated": "2018-09-27T04:48:00Z"
        },
        {
            "ID": 16663,
            "ChargePointID": 95344,
            "ItemURL": "https://s3-ap-southeast-2.amazonaws.com/openchargemap/images/IT/OCM95344/OCM-95344.orig.2018092704470097.jpg",
            "ItemThumbnailURL": "https://s3-ap-southeast-2.amazonaws.com/openchargemap/images/IT/OCM95344/OCM-95344.thmb.2018092704470097.jpg",
            "Comment": "",
            "IsEnabled": true,
            "IsVideo": false,
            "IsFeaturedItem": false,
            "IsExternalResource": false,
            "User": {
                "ID": 11749,
                "Username": "ForumElettrico.it"
            },
            "DateCreated": "2018-09-27T04:47:00Z"
        },
        {
            "ID": 16664,
            "ChargePointID": 95344,
            "ItemURL": "https://s3-ap-southeast-2.amazonaws.com/openchargemap/images/IT/OCM95344/OCM-95344.orig.2018092704470702.jpg",
            "ItemThumbnailURL": "https://s3-ap-southeast-2.amazonaws.com/openchargemap/images/IT/OCM95344/OCM-95344.thmb.2018092704470702.jpg",
            "Comment": "",
            "IsEnabled": true,
            "IsVideo": false,
            "IsFeaturedItem": false,
            "IsExternalResource": false,
            "User": {
                "ID": 11749,
                "Username": "ForumElettrico.it"
            },
            "DateCreated": "2018-09-27T04:47:00Z"
        },
        {
            "ID": 16665,
            "ChargePointID": 95344,
            "ItemURL": "https://s3-ap-southeast-2.amazonaws.com/openchargemap/images/IT/OCM95344/OCM-95344.orig.2018092704471416.jpg",
            "ItemThumbnailURL": "https://s3-ap-southeast-2.amazonaws.com/openchargemap/images/IT/OCM95344/OCM-95344.thmb.2018092704471416.jpg",
            "Comment": "",
            "IsEnabled": true,
            "IsVideo": false,
            "IsFeaturedItem": false,
            "IsExternalResource": false,
            "User": {
                "ID": 11749,
                "Username": "ForumElettrico.it"
            },
            "DateCreated": "2018-09-27T04:47:00Z"
        }
    ],
    "IsRecentlyVerified": false,
    "ID": 95344,
    "UUID": "3241D003-2007-48E9-87AC-BE793DCF2749",
    "DataProviderID": 1,
    "UsageTypeID": 4,
    "AddressInfo": {
        "ID": 95690,
        "Title": " Fiera di Rimini - Parcheggio Est",
        "AddressLine1": "Via Costantino il Grande",
        "Town": "Rimini",
        "StateOrProvince": "RN",
        "Postcode": "47922",
        "CountryID": 112,
        "Latitude": 44.0728889246808,
        "Longitude": 12.5325013155944,
        "ContactTelephone1": "(+39) 0541.744111",
        "ContactEmail": "infovisitatori@riminifiera.it",
        "RelatedURL": "http://www.riminifiera.it/",
        "DistanceUnit": 0
    },
    "Connections": [
        {
            "ID": 135036,
            "ConnectionTypeID": 25,
            "StatusTypeID": 50,
            "LevelID": 2,
            "Amps": 32,
            "Voltage": 400,
            "PowerKW": 22,
            "CurrentTypeID": 20,
            "Quantity": 4
        },
        {
            "ID": 135037,
            "ConnectionTypeID": 36,
            "StatusTypeID": 50,
            "LevelID": 2,
            "Amps": 16,
            "Voltage": 240,
            "PowerKW": 3.7,
            "CurrentTypeID": 10,
            "Quantity": 4
        }
    ],
    "NumberOfPoints": 4,
    "StatusTypeID": 50,
    "DateLastStatusUpdate": "2018-09-28T10:01:00Z",
    "DataQualityLevel": 1,
    "DateCreated": "2017-11-07T15:11:00Z",
    "SubmissionStatusTypeID": 200
}