{
    "IsRecentlyVerified": false,
    "ID": 29626,
    "UUID": "89318D66-5E1C-4D65-8E15-44C0A1AAF025",
    "DataProviderID": 15,
    "DataProvidersReference": "536",
    "OperatorID": 43,
    "AddressInfo": {
        "ID": 29972,
        "Title": "3223 Donald Douglas Loop",
        "AddressLine1": "3223 Donald Douglas Loop",
        "Town": "Santa Monica",
        "StateOrProvince": "California",
        "Postcode": "90405",
        "CountryID": 2,
        "Latitude": 34.01649,
        "Longitude": -118.44769,
        "ContactTelephone1": "",
        "RelatedURL": "http://carstations.com/536",
        "DistanceUnit": 0
    },
    "Connections": [
        {
            "ID": 32611,
            "ConnectionTypeID": 1,
            "Reference": "J1772",
            "LevelID": 2
        }
    ],
    "StatusTypeID": 0,
    "DateLastStatusUpdate": "2017-11-04T14:04:00Z",
    "DataQualityLevel": 2,
    "DateCreated": "2014-11-29T05:39:00Z",
    "SubmissionStatusTypeID": 100
}