{
    "IsRecentlyVerified": false,
    "ID": 137674,
    "UUID": "0A7BEC66-6DB0-42B0-9FC2-D0B02FF5870B",
    "DataProviderID": 2,
    "DataProvidersReference": "93165",
    "OperatorID": 15,
    "UsageTypeID": 4,
    "AddressInfo": {
        "ID": 138020,
        "Title": "Broadway Plaza",
        "AddressLine1": "1142 Broadway",
        "Town": "Chula Vista",
        "StateOrProvince": "CA",
        "Postcode": "91911",
        "CountryID": 2,
        "Latitude": 32.607978,
        "Longitude": -117.080893,
        "ContactTelephone1": "877-455-3833",
        "AccessComments": "24 hours daily\r\nPublic - Card key at all times",
        "RelatedURL": "https://www.evgo.com/",
        "DistanceUnit": 0
    },
    "Connections": [
        {
            "ID": 192631,
            "ConnectionTypeID": 2,
            "LevelID": 3,
            "Amps": 100,
            "Voltage": 400,
            "PowerKW": 40,
            "CurrentTypeID": 30,
            "Quantity": 1
        },
        {
            "ID": 192632,
            "ConnectionTypeID": 32,
            "LevelID": 3,
            "Amps": 100,
            "Voltage": 400,
            "PowerKW": 40,
            "CurrentTypeID": 30,
            "Quantity": 1
        }
    ],
    "StatusTypeID": 50,
    "DateLastStatusUpdate": "2019-12-24T09:06:00Z",
    "DataQualityLevel": 3,
    "DateCreated": "2019-12-24T09:06:00Z",
    "SubmissionStatusTypeID": 100
}