{
    "IsRecentlyVerified": false,
    "ID": 168731,
    "UUID": "DF5E7941-6D4E-498C-A083-AF1EC5973C1F",
    "DataProviderID": 1,
    "OperatorID": 150,
    "UsageTypeID": 4,
    "UsageCost": "completely free to charge until October 2021 / Please register at : ev.engie.co.uk ",
    "AddressInfo": {
        "ID": 169090,
        "Title": "Hawksworth Street Car Park llkey",
        "AddressLine1": "Hawksworth Street",
        "Town": "Ilkley",
        "StateOrProvince": "England",
        "Postcode": "LS29 9DX",
        "CountryID": 1,
        "Latitude": 53.92541301613622,
        "Longitude": -1.8247956932484612,
        "ContactTelephone1": "0333 666 0059",
        "AccessComments": "Parking Fees apply:  Monday to Sunday 8am to 6pm Up to one hour £1  Up to two hours £2 Up to three hours £3  Up to four hours £4",
        "RelatedURL": "https://ev.engie.co.uk/",
        "DistanceUnit": 0
    },
    "Connections": [
        {
            "ID": 256416,
            "ConnectionTypeID": 25,
            "StatusTypeID": 50,
            "LevelID": 2,
            "Amps": 32,
            "Voltage": 400,
            "PowerKW": 22,
            "CurrentTypeID": 20,
            "Quantity": 1
        },
        {
            "ID": 256417,
            "ConnectionTypeID": 2,
            "StatusTypeID": 50,
            "LevelID": 3,
            "Amps": 125,
            "Voltage": 400,
            "PowerKW": 50,
            "CurrentTypeID": 30,
            "Quantity": 1
        },
        {
            "ID": 256418,
            "ConnectionTypeID": 33,
            "StatusTypeID": 50,
            "LevelID": 3,
            "Amps": 125,
            "Voltage": 400,
            "PowerKW": 50,
            "CurrentTypeID": 30,
            "Quantity": 1
        }
    ],
    "NumberOfPoints": 2,
    "GeneralComments": "Engie rapid charger, 50kW DC, AC is a 22 Kw Socket. One bay for general use, one bay for taxis. Both Free to charge. Please register at : ev.engie.co.uk",
    "StatusTypeID": 50,
    "DateLastStatusUpdate": "2020-10-04T11:41:00Z",
    "DataQualityLevel": 1,
    "DateCreated": "2020-10-04T11:39:00Z",
    "SubmissionStatusTypeID": 200
}