{
    "IsRecentlyVerified": false,
    "ID": 167959,
    "UUID": "882F3A00-7332-47BD-A9C4-3E1A733F3295",
    "DataProviderID": 1,
    "OperatorID": 150,
    "UsageTypeID": 4,
    "UsageCost": "Rapid: £1.00 fee + £0.30/kWh AC: £0.50 fee + £0.30/kWh",
    "AddressInfo": {
        "ID": 168318,
        "Title": "Morrisons Saltney",
        "AddressLine1": "High Street",
        "AddressLine2": "Chester",
        "Town": "Saltney",
        "Postcode": "CH4 8RU",
        "CountryID": 1,
        "Latitude": 53.177537,
        "Longitude": -2.935116,
        "AccessComments": "£10.00 overstay fee after 95 mins, then £10.00 every subsequent 95 mins",
        "RelatedURL": "https://www.cpsgenie.com/ds",
        "DistanceUnit": 0
    },
    "Connections": [
        {
            "ID": 254994,
            "ConnectionTypeID": 25,
            "Reference": "1",
            "StatusTypeID": 50,
            "LevelID": 2,
            "Amps": 32,
            "Voltage": 400,
            "PowerKW": 22,
            "CurrentTypeID": 20,
            "Quantity": 1
        },
        {
            "ID": 254995,
            "ConnectionTypeID": 2,
            "Reference": "2",
            "StatusTypeID": 50,
            "LevelID": 3,
            "Amps": 125,
            "Voltage": 400,
            "PowerKW": 50,
            "CurrentTypeID": 30,
            "Quantity": 1,
            "Comments": ""
        },
        {
            "ID": 254996,
            "ConnectionTypeID": 33,
            "Reference": "3",
            "StatusTypeID": 50,
            "LevelID": 3,
            "Amps": 125,
            "Voltage": 400,
            "PowerKW": 50,
            "CurrentTypeID": 30,
            "Quantity": 1
        }
    ],
    "GeneralComments": "Geniepoint Network https://www.cpsgenie.com/ds AC is a 22kW Socket",
    "StatusTypeID": 50,
    "DateLastStatusUpdate": "2020-10-04T22:51:00Z",
    "MetadataValues": [
        {
            "ID": 8003,
            "MetadataFieldID": 4,
            "ItemValue": "Contains public sector information licensed under the Open Government Licence v2.0. http://www.nationalarchives.gov.uk/doc/open-government-licence/version/2/"
        }
    ],
    "DataQualityLevel": 3,
    "DateCreated": "2020-09-17T21:04:00Z",
    "SubmissionStatusTypeID": 100
}