{
    "MediaItems": [
        {
            "ID": 3480,
            "ChargePointID": 24660,
            "ItemURL": "https://s3-ap-southeast-2.amazonaws.com/openchargemap/images/FI/OCM24660/OCM-24660.orig.2015110418363062.jpeg",
            "ItemThumbnailURL": "https://s3-ap-southeast-2.amazonaws.com/openchargemap/images/FI/OCM24660/OCM-24660.thmb.2015110418363062.jpeg",
            "Comment": "",
            "IsEnabled": true,
            "IsVideo": false,
            "IsFeaturedItem": false,
            "IsExternalResource": false,
            "User": {
                "ID": 6565,
                "Username": "Tomasz Bilinski"
            },
            "DateCreated": "2015-11-04T18:37:00Z"
        }
    ],
    "IsRecentlyVerified": false,
    "ID": 24660,
    "UUID": "6B4E9ACB-6F92-4011-B256-13A8468A3A5A",
    "DataProviderID": 1,
    "OperatorID": 1,
    "UsageTypeID": 1,
    "UsageCost": "Free",
    "AddressInfo": {
        "ID": 25006,
        "Title": "McDonalds Tikkurila",
        "AddressLine1": "Aamuruskontie 2",
        "AddressLine2": "",
        "Town": "Helsinki",
        "StateOrProvince": " Uusimaa",
        "Postcode": "",
        "CountryID": 79,
        "Latitude": 60.2839381,
        "Longitude": 25.0292353,
        "ContactTelephone1": "",
        "ContactTelephone2": "",
        "ContactEmail": "",
        "AccessComments": "McDonalds parking",
        "RelatedURL": "",
        "DistanceUnit": 0
    },
    "Connections": [
        {
            "ID": 26958,
            "ConnectionTypeID": 28,
            "StatusTypeID": 50,
            "LevelID": 2,
            "Amps": 16,
            "Voltage": 230,
            "PowerKW": 3,
            "CurrentTypeID": 10,
            "Quantity": 1
        },
        {
            "ID": 26981,
            "ConnectionTypeID": 25,
            "StatusTypeID": 50,
            "LevelID": 2,
            "Amps": 32,
            "Voltage": 400,
            "PowerKW": 22,
            "CurrentTypeID": 20,
            "Quantity": 1
        }
    ],
    "NumberOfPoints": 1,
    "GeneralComments": "",
    "StatusTypeID": 50,
    "DateLastStatusUpdate": "2015-11-04T18:37:00Z",
    "MetadataValues": [
        {
            "ID": 1054,
            "MetadataFieldID": 4,
            "ItemValue": "Data © OpenStreetMap contributors, ODbL 1.0. http://www.openstreetmap.org/copyright"
        }
    ],
    "DataQualityLevel": 1,
    "DateCreated": "2014-10-26T02:00:00Z",
    "SubmissionStatusTypeID": 200
}