{
    "IsRecentlyVerified": false,
    "ID": 38692,
    "UUID": "FD7C6C2F-92BA-420B-8942-F342EC583176",
    "DataProviderID": 1,
    "OperatorID": 156,
    "OperatorsReference": "NewMotion 02009606",
    "UsageTypeID": 4,
    "UsageCost": "",
    "AddressInfo": {
        "ID": 39038,
        "Title": "Zepernicker Chaussee 49",
        "AddressLine1": "Zepernicker Chaussee 49",
        "AddressLine2": "",
        "Town": "Bernau bei Berlin",
        "StateOrProvince": "",
        "Postcode": "16321",
        "CountryID": 87,
        "Latitude": 52.6734580993652,
        "Longitude": 13.5678997039795,
        "ContactTelephone1": "",
        "ContactTelephone2": "",
        "ContactEmail": "",
        "AccessComments": "",
        "RelatedURL": "",
        "DistanceUnit": 0
    },
    "Connections": [
        {
            "ID": 42203,
            "ConnectionTypeID": 25,
            "StatusTypeID": 0,
            "LevelID": 2,
            "PowerKW": 37,
            "CurrentTypeID": 10
        }
    ],
    "NumberOfPoints": 1,
    "GeneralComments": "",
    "StatusTypeID": 50,
    "DateLastStatusUpdate": "2015-06-12T21:37:00Z",
    "DataQualityLevel": 3,
    "DateCreated": "2015-01-09T06:08:00Z",
    "SubmissionStatusTypeID": 200
}