{
    "IsRecentlyVerified": false,
    "ID": 102660,
    "UUID": "6B44FB65-FD84-471E-8A8C-70C7725F2A0B",
    "DataProviderID": 2,
    "DataProvidersReference": "93717",
    "OperatorID": 15,
    "UsageTypeID": 4,
    "AddressInfo": {
        "ID": 103006,
        "Title": "Walmart",
        "AddressLine1": "7011 Main St",
        "Town": "American Canyon",
        "StateOrProvince": "CA",
        "Postcode": "94503",
        "CountryID": 2,
        "Latitude": 38.183008,
        "Longitude": -122.253861,
        "ContactTelephone1": "877-455-3833",
        "AccessComments": "24 hours daily; EVgo network subscription and key fob required",
        "RelatedURL": "https://www.evgo.com/",
        "DistanceUnit": 0
    },
    "Connections": [
        {
            "ID": 144767,
            "ConnectionTypeID": 2,
            "LevelID": 2,
            "Amps": 100,
            "Voltage": 400,
            "PowerKW": 40,
            "CurrentTypeID": 10,
            "Quantity": 1
        },
        {
            "ID": 144768,
            "ConnectionTypeID": 32,
            "LevelID": 2,
            "Amps": 100,
            "Voltage": 400,
            "PowerKW": 40,
            "CurrentTypeID": 10,
            "Quantity": 1
        }
    ],
    "DateLastStatusUpdate": "2019-04-06T04:02:00Z",
    "DataQualityLevel": 3,
    "DateCreated": "2018-04-21T04:13:00Z",
    "SubmissionStatusTypeID": 100
}