{
    "IsRecentlyVerified": false,
    "ID": 159649,
    "UUID": "5BAA3D4F-E3D0-4CED-AD68-3322E4BF8334",
    "DataProviderID": 2,
    "DataProvidersReference": "156645",
    "OperatorID": 5,
    "UsageTypeID": 1,
    "AddressInfo": {
        "ID": 160006,
        "Title": "DRAPER CITY",
        "AddressLine1": "12500 1300 E",
        "Town": "Draper",
        "StateOrProvince": "UT",
        "Postcode": "84020",
        "CountryID": 2,
        "Latitude": 40.523624,
        "Longitude": -111.853451,
        "ContactTelephone1": "888-758-4389",
        "AccessComments": "24 hours daily",
        "RelatedURL": "http://www.chargepoint.com/",
        "DistanceUnit": 0
    },
    "Connections": [
        {
            "ID": 229850,
            "ConnectionTypeID": 1,
            "LevelID": 2,
            "Amps": 16,
            "Voltage": 230,
            "PowerKW": 3.7,
            "CurrentTypeID": 10,
            "Quantity": 4
        }
    ],
    "StatusTypeID": 50,
    "DateLastStatusUpdate": "2020-06-26T03:03:00Z",
    "DataQualityLevel": 3,
    "DateCreated": "2020-06-26T03:03:00Z",
    "SubmissionStatusTypeID": 100
}