{
    "IsRecentlyVerified": false,
    "ID": 50324,
    "UUID": "E5753ECF-219F-4B4A-86B7-6204A0239F8E",
    "DataProviderID": 1,
    "OperatorID": 20,
    "OperatorsReference": "60116,60117",
    "UsageTypeID": 4,
    "UsageCost": "Free",
    "AddressInfo": {
        "ID": 50670,
        "Title": "Crescent House Lay By",
        "AddressLine1": "A6 Crescent",
        "Town": "Manchester",
        "Postcode": "M5 5WT",
        "CountryID": 1,
        "Latitude": 53.48329,
        "Longitude": -2.269729,
        "DistanceUnit": 0
    },
    "Connections": [
        {
            "ID": 61989,
            "ConnectionTypeID": 25,
            "StatusTypeID": 100,
            "LevelID": 2,
            "Amps": 32,
            "Voltage": 230,
            "PowerKW": 7,
            "CurrentTypeID": 10,
            "Quantity": 2
        }
    ],
    "NumberOfPoints": 2,
    "StatusTypeID": 50,
    "DateLastStatusUpdate": "2020-10-14T17:59:00Z",
    "DataQualityLevel": 1,
    "DateCreated": "2015-07-21T10:36:00Z",
    "SubmissionStatusTypeID": 200
}