{
    "IsRecentlyVerified": false,
    "ID": 124316,
    "UUID": "EA108049-7F59-4C9B-A72C-9AF02D263092",
    "DataProviderID": 2,
    "DataProvidersReference": "76220",
    "OperatorID": 5,
    "UsageTypeID": 1,
    "AddressInfo": {
        "ID": 124662,
        "Title": "REGIONAL EVSES",
        "AddressLine1": "Enchanted Forest Rd",
        "Town": "Lamar",
        "StateOrProvince": "CO",
        "Postcode": "81052",
        "CountryID": 2,
        "Latitude": 38.0896782,
        "Longitude": -102.6180397,
        "ContactTelephone1": "888-758-4389",
        "AccessComments": "24 hours daily",
        "RelatedURL": "http://www.chargepoint.com/",
        "DistanceUnit": 0
    },
    "Connections": [
        {
            "ID": 174400,
            "ConnectionTypeID": 1,
            "LevelID": 2,
            "Amps": 16,
            "Voltage": 230,
            "PowerKW": 3.7,
            "CurrentTypeID": 10,
            "Quantity": 2
        }
    ],
    "DateLastStatusUpdate": "2020-06-26T02:59:00Z",
    "DataQualityLevel": 3,
    "DateCreated": "2019-04-06T05:03:00Z",
    "SubmissionStatusTypeID": 100
}