{
    "IsRecentlyVerified": false,
    "ID": 184780,
    "UUID": "A168E402-8EA7-4A2C-BCCC-96960FC48766",
    "DataProviderID": 29,
    "DataProvidersReference": "4578",
    "OperatorID": 86,
    "AddressInfo": {
        "ID": 185139,
        "Title": "Ludwigstr. 1",
        "AddressLine1": "Ludwigstr. 1",
        "Town": "Asperg",
        "Postcode": "71679",
        "CountryID": 87,
        "Latitude": 48.905667,
        "Longitude": 9.133528,
        "DistanceUnit": 0
    },
    "Connections": [
        {
            "ID": 293462,
            "ConnectionTypeID": 28,
            "StatusTypeID": 50,
            "LevelID": 2,
            "PowerKW": 22,
            "CurrentTypeID": 20
        },
        {
            "ID": 293463,
            "ConnectionTypeID": 25,
            "StatusTypeID": 50,
            "LevelID": 2,
            "PowerKW": 22,
            "CurrentTypeID": 20
        },
        {
            "ID": 296365,
            "ConnectionTypeID": 28,
            "StatusTypeID": 50,
            "LevelID": 2,
            "PowerKW": 22,
            "CurrentTypeID": 20
        },
        {
            "ID": 296366,
            "ConnectionTypeID": 25,
            "StatusTypeID": 50,
            "LevelID": 2,
            "PowerKW": 22,
            "CurrentTypeID": 20
        }
    ],
    "StatusTypeID": 50,
    "DateLastStatusUpdate": "2021-07-12T02:42:00Z",
    "MetadataValues": [
        {
            "ID": 17071,
            "MetadataFieldID": 4,
            "ItemValue": "Data from the German chargepoint registry provided by Bundesnetzagentur.de under the CC-BY 4.0 license"
        }
    ],
    "DataQualityLevel": 3,
    "DateCreated": "2021-07-08T10:05:00Z",
    "SubmissionStatusTypeID": 100
}