{
    "UserComments": [
        {
            "ID": 24886,
            "ChargePointID": 175522,
            "CommentTypeID": 10,
            "UserName": "ForumElettrico.it",
            "Comment": "In un parcheggio chiuso dell'Hotel ma utilizzabile anche dai non clienti. Leggi la recensione completa qui: https://www.forumelettrico.it/forum/colonnina-go-eauto-fast-50kw-varsavia-zagorna-1a-00-441-t20004.html",
            "RelatedURL": "https://www.forumelettrico.it/forum/colonnina-go-eauto-fast-50kw-varsavia-zagorna-1a-00-441-t20004.html",
            "DateCreated": "2021-09-24T06:18:54.907Z",
            "User": {
                "ID": 11749,
                "Username": "ForumElettrico.it"
            },
            "CheckinStatusTypeID": 10,
            "IsActionedByEditor": false
        }
    ],
    "MediaItems": [
        {
            "ID": 29328,
            "ChargePointID": 175522,
            "ItemURL": "https://s3-ap-southeast-2.amazonaws.com/openchargemap/images/PL/OCM175522/OCM-175522.orig.2021092406194038.jpg",
            "ItemThumbnailURL": "https://s3-ap-southeast-2.amazonaws.com/openchargemap/images/PL/OCM175522/OCM-175522.thmb.2021092406194038.jpg",
            "Comment": "",
            "IsEnabled": true,
            "IsVideo": false,
            "IsFeaturedItem": false,
            "IsExternalResource": false,
            "User": {
                "ID": 11749,
                "Username": "ForumElettrico.it"
            },
            "DateCreated": "2021-09-24T06:20:00Z"
        }
    ],
    "IsRecentlyVerified": false,
    "ID": 175522,
    "UUID": "9D9EA869-CE31-4A38-A878-8276279C9568",
    "DataProviderID": 1,
    "OperatorID": 3450,
    "UsageTypeID": 1,
    "UsageCost": "1,6 zł/kWh DC 1,15 zł/kWh AC",
    "AddressInfo": {
        "ID": 175881,
        "Title": "IBIS Hotel Zagórna",
        "AddressLine1": "ul. Zagóna 1A",
        "Town": "Warsaw",
        "StateOrProvince": "Mazowieckie",
        "Postcode": "00-441",
        "CountryID": 179,
        "Latitude": 52.22632306434696,
        "Longitude": 21.042567687878773,
        "ContactTelephone1": "+48500800700",
        "RelatedURL": "http://www.gopluseauto.pl/",
        "DistanceUnit": 0
    },
    "Connections": [
        {
            "ID": 272425,
            "ConnectionTypeID": 33,
            "StatusTypeID": 50,
            "LevelID": 3,
            "Amps": 100,
            "Voltage": 450,
            "PowerKW": 40,
            "CurrentTypeID": 30,
            "Quantity": 1
        },
        {
            "ID": 272426,
            "ConnectionTypeID": 2,
            "StatusTypeID": 50,
            "LevelID": 3,
            "Amps": 100,
            "Voltage": 450,
            "PowerKW": 40,
            "CurrentTypeID": 30,
            "Quantity": 1
        },
        {
            "ID": 272427,
            "ConnectionTypeID": 25,
            "StatusTypeID": 50,
            "LevelID": 2,
            "Amps": 32,
            "Voltage": 400,
            "PowerKW": 22,
            "CurrentTypeID": 20,
            "Quantity": 1
        }
    ],
    "NumberOfPoints": 1,
    "GeneralComments": "Operator: GO+EAuto",
    "StatusTypeID": 50,
    "DateLastStatusUpdate": "2021-09-24T06:20:00Z",
    "DataQualityLevel": 1,
    "DateCreated": "2021-05-25T14:54:00Z",
    "SubmissionStatusTypeID": 200
}