{
    "IsRecentlyVerified": false,
    "ID": 163657,
    "UUID": "085ADF55-F32C-4EFF-BCBB-580CED05F62E",
    "DataProviderID": 1,
    "OperatorID": 23,
    "OperatorsReference": "52084",
    "UsageTypeID": 4,
    "AddressInfo": {
        "ID": 164014,
        "Title": "Alla-Fonte Hotel und Tagungshaus",
        "AddressLine1": "Herbert-Hellmann Allee 30",
        "Town": "Bad Krozingen",
        "Postcode": "79189",
        "CountryID": 87,
        "Latitude": 47.921678,
        "Longitude": 7.688518,
        "ContactTelephone1": "+49 7633806910",
        "DistanceUnit": 0
    },
    "Connections": [
        {
            "ID": 235254,
            "ConnectionTypeID": 30,
            "StatusTypeID": 50,
            "LevelID": 2,
            "PowerKW": 6,
            "CurrentTypeID": 20,
            "Quantity": 1
        }
    ],
    "NumberOfPoints": 1,
    "GeneralComments": "1 Tesla Connector, up to 6kW.Available for customers. Please call ahead.",
    "StatusTypeID": 50,
    "DateLastStatusUpdate": "2020-08-24T14:05:00Z",
    "DataQualityLevel": 1,
    "DateCreated": "2020-08-24T14:05:00Z",
    "SubmissionStatusTypeID": 200
}