{
    "IsRecentlyVerified": false,
    "ID": 40931,
    "UUID": "B5B1F9FA-F232-4D6B-9BE8-6F9197C9BAA6",
    "DataProviderID": 1,
    "OperatorID": 127,
    "UsageTypeID": 1,
    "AddressInfo": {
        "ID": 41277,
        "Title": "EWE Servicepunkt Westerstede",
        "AddressLine1": "Zum Stadtpark 2",
        "Town": "Westerstede",
        "Postcode": "26655",
        "CountryID": 87,
        "Latitude": 53.25636,
        "Longitude": 7.92588000000001,
        "ContactTelephone1": "04418030",
        "ContactTelephone2": "08001014432",
        "AccessComments": "Parkplatz zur Straße, immer geöffnet",
        "RelatedURL": "http://www.ewe.de/privatkunden/mobilitaet.php",
        "DistanceUnit": 0
    },
    "Connections": [
        {
            "ID": 44579,
            "ConnectionTypeID": 25,
            "StatusTypeID": 50,
            "Quantity": 2
        }
    ],
    "NumberOfPoints": 2,
    "GeneralComments": "Zugang mit EWE / SWB RFID Karte",
    "StatusTypeID": 50,
    "DateLastStatusUpdate": "2015-01-19T19:34:00Z",
    "DataQualityLevel": 1,
    "DateCreated": "2015-01-17T16:00:00Z",
    "SubmissionStatusTypeID": 200
}