{
    "IsRecentlyVerified": false,
    "ID": 8620,
    "UUID": "7CB88471-77A3-4BF8-8008-626350C15088",
    "DataProviderID": 15,
    "DataProvidersReference": "2116",
    "OperatorID": 31,
    "UsageTypeID": 1,
    "AddressInfo": {
        "ID": 8517,
        "Title": "190 Hickory Lane",
        "AddressLine1": "190 Hickory Lane",
        "Town": "Vacaville",
        "StateOrProvince": "California",
        "Postcode": "95688",
        "CountryID": 2,
        "Latitude": 38.35173,
        "Longitude": -121.98652,
        "ContactTelephone1": "(707) 449-5170",
        "RelatedURL": "http://carstations.com/2116",
        "DistanceUnit": 0
    },
    "Connections": [
        {
            "ID": 6044,
            "ConnectionTypeID": 0,
            "Reference": "SPI"
        },
        {
            "ID": 10970,
            "ConnectionTypeID": 9,
            "Reference": "NEMA5",
            "LevelID": 1,
            "Quantity": 1
        },
        {
            "ID": 11074,
            "ConnectionTypeID": 1,
            "Reference": "J1772",
            "LevelID": 2,
            "Quantity": 1
        }
    ],
    "NumberOfPoints": 4,
    "StatusTypeID": 0,
    "DateLastStatusUpdate": "2017-11-04T14:04:00Z",
    "DataQualityLevel": 1,
    "DateCreated": "2011-11-11T12:07:00Z",
    "SubmissionStatusTypeID": 100
}