{
    "IsRecentlyVerified": false,
    "ID": 186842,
    "UUID": "7F08C9EF-5DFD-42CA-AA9D-0F574BD61E9D",
    "DataProviderID": 29,
    "DataProvidersReference": "6024",
    "OperatorID": 3403,
    "AddressInfo": {
        "ID": 187201,
        "Title": "Am Sonnenkamp -",
        "AddressLine1": "Am Sonnenkamp -",
        "Town": "Sarstedt",
        "Postcode": "31157",
        "CountryID": 87,
        "Latitude": 52.270967,
        "Longitude": 9.871955,
        "DistanceUnit": 0
    },
    "Connections": [
        {
            "ID": 300347,
            "ConnectionTypeID": 25,
            "StatusTypeID": 50,
            "LevelID": 2,
            "PowerKW": 22,
            "CurrentTypeID": 20
        },
        {
            "ID": 300348,
            "ConnectionTypeID": 25,
            "StatusTypeID": 50,
            "LevelID": 2,
            "PowerKW": 22,
            "CurrentTypeID": 20
        }
    ],
    "StatusTypeID": 50,
    "DateLastStatusUpdate": "2021-07-12T02:49:00Z",
    "MetadataValues": [
        {
            "ID": 19083,
            "MetadataFieldID": 4,
            "ItemValue": "Data from the German chargepoint registry provided by Bundesnetzagentur.de under the CC-BY 4.0 license"
        }
    ],
    "DataQualityLevel": 3,
    "DateCreated": "2021-07-12T02:49:00Z",
    "SubmissionStatusTypeID": 100
}