{
    "IsRecentlyVerified": false,
    "ID": 139320,
    "UUID": "30B99B8E-3694-4056-941C-87009A6B3AF1",
    "DataProviderID": 2,
    "DataProvidersReference": "148728",
    "OperatorID": 39,
    "UsageTypeID": 1,
    "AddressInfo": {
        "ID": 139672,
        "Title": "The Place on Ponce",
        "AddressLine1": "220 Ponce de Leon Place",
        "Town": "Decatur",
        "StateOrProvince": "GA",
        "Postcode": "30030",
        "CountryID": 2,
        "Latitude": 33.7760731,
        "Longitude": -84.3000552,
        "ContactTelephone1": "800-663-5633",
        "AccessComments": "MO: Not Specified; TU: Not Specified; WE: Not Specified; TH: Not Specified; FR: Not Specified; SA: Not Specified; SU: Not Specified",
        "RelatedURL": "http://www.semacharge.com/",
        "DistanceUnit": 0
    },
    "Connections": [
        {
            "ID": 194635,
            "ConnectionTypeID": 1,
            "LevelID": 2,
            "Amps": 16,
            "Voltage": 230,
            "PowerKW": 3.7,
            "CurrentTypeID": 10,
            "Quantity": 2
        }
    ],
    "StatusTypeID": 50,
    "DateLastStatusUpdate": "2020-06-26T02:56:00Z",
    "DataQualityLevel": 3,
    "DateCreated": "2019-12-24T09:10:00Z",
    "SubmissionStatusTypeID": 100
}