{
    "IsRecentlyVerified": false,
    "ID": 42620,
    "UUID": "B11148C2-CF5D-4D73-AC1B-08074C91A84E",
    "DataProviderID": 1,
    "OperatorID": 98,
    "UsageTypeID": 1,
    "UsageCost": "0",
    "AddressInfo": {
        "ID": 42966,
        "Title": "GreenTEC Campus",
        "AddressLine1": "Lecker Straße 7",
        "Town": "Ende-Sande",
        "StateOrProvince": "Südtondern",
        "Postcode": "25917",
        "CountryID": 87,
        "Latitude": 54.7405159115666,
        "Longitude": 8.95605382084454,
        "ContactTelephone1": "+49 4662 891270",
        "ContactEmail": "info@greentec-campus.de",
        "AccessComments": "Säule 1: Einfahrt zum Greentec-Campus nehmen, nicht durch das Tor fahren, sondern vor Tor rechts auf Parkplatz. Außerhalb des Campus, daher immer nutzbar.\r\nSäule 2: Nach der Einfahrt durch das Tor links auf den Parkplatz (geöffnet Mo-Fr. 8-18Uhr).\r\nShowroom für Ladeinfrastruktur, E-Mobil-Meile, siehe Webseite.",
        "RelatedURL": "http://www.greentec-campus.de/de/e-mobilitaet.php",
        "DistanceUnit": 0
    },
    "Connections": [
        {
            "ID": 51369,
            "ConnectionTypeID": 17,
            "StatusTypeID": 50,
            "LevelID": 2,
            "Amps": 16,
            "Voltage": 400,
            "PowerKW": 11,
            "CurrentTypeID": 20,
            "Quantity": 2
        },
        {
            "ID": 51370,
            "ConnectionTypeID": 16,
            "StatusTypeID": 50,
            "LevelID": 2,
            "Amps": 16,
            "Voltage": 230,
            "PowerKW": 3.7,
            "CurrentTypeID": 10,
            "Quantity": 2
        },
        {
            "ID": 51371,
            "ConnectionTypeID": 28,
            "StatusTypeID": 50,
            "LevelID": 2,
            "Amps": 16,
            "Voltage": 230,
            "PowerKW": 3.7,
            "CurrentTypeID": 10,
            "Quantity": 2
        }
    ],
    "NumberOfPoints": 6,
    "StatusTypeID": 50,
    "DateLastStatusUpdate": "2015-03-18T15:14:00Z",
    "DataQualityLevel": 1,
    "DateCreated": "2015-03-18T10:04:00Z",
    "SubmissionStatusTypeID": 200
}