{
    "IsRecentlyVerified": false,
    "ID": 117886,
    "UUID": "5D48780B-797E-4043-BC52-DCEF85EB7825",
    "DataProviderID": 1,
    "OperatorID": 32,
    "OperatorsReference": "24570",
    "UsageTypeID": 1,
    "UsageCost": "£0.108/kWh; for Polar Plus subscription members only",
    "AddressInfo": {
        "ID": 118232,
        "Title": "Kelly Clarke Motor Services Ltd",
        "AddressLine1": "1 Cornish Way",
        "Town": "North Walsham",
        "Postcode": "NR28 0FE",
        "CountryID": 1,
        "Latitude": 52.830692,
        "Longitude": 1.382878,
        "RelatedURL": "http://www.polarnetwork.com",
        "DistanceUnit": 0
    },
    "Connections": [
        {
            "ID": 166831,
            "ConnectionTypeID": 33,
            "StatusTypeID": 50,
            "LevelID": 3,
            "PowerKW": 50,
            "CurrentTypeID": 30,
            "Quantity": 1
        },
        {
            "ID": 166832,
            "ConnectionTypeID": 2,
            "StatusTypeID": 50,
            "LevelID": 3,
            "PowerKW": 50,
            "CurrentTypeID": 30,
            "Quantity": 1
        },
        {
            "ID": 166833,
            "ConnectionTypeID": 1036,
            "StatusTypeID": 50,
            "LevelID": 3,
            "PowerKW": 43,
            "CurrentTypeID": 20,
            "Quantity": 1
        }
    ],
    "NumberOfPoints": 1,
    "GeneralComments": "Charger for public use confirmed by BP Chargemaster",
    "StatusTypeID": 50,
    "DateLastStatusUpdate": "2020-10-07T07:08:00Z",
    "DataQualityLevel": 1,
    "DateCreated": "2019-03-07T18:15:00Z",
    "SubmissionStatusTypeID": 200
}