{
    "IsRecentlyVerified": false,
    "ID": 187443,
    "UUID": "9AC5EE4E-DC9D-4CF1-8897-671AEAD45522",
    "DataProviderID": 18,
    "DataProvidersReference": "e647872cd66513c5a027e46cd3d74141",
    "OperatorID": 2244,
    "UsageTypeID": 5,
    "AddressInfo": {
        "ID": 187802,
        "Title": "10 White Hart Lane",
        "AddressLine1": "10 White Hart Lane",
        "Town": "London",
        "Postcode": "SW13 0PY",
        "CountryID": 1,
        "Latitude": -0.25525,
        "Longitude": 51.46996,
        "AccessComments": "",
        "RelatedURL": "https://www.ubitricity.com",
        "DistanceUnit": 0
    },
    "Connections": [
        {
            "ID": 302577,
            "ConnectionTypeID": 25,
            "Reference": "suby1100005375",
            "StatusTypeID": 50,
            "LevelID": 2,
            "Amps": 16,
            "Voltage": 230,
            "PowerKW": 3.7,
            "CurrentTypeID": 10
        }
    ],
    "StatusTypeID": 0,
    "DateLastStatusUpdate": "2021-07-12T03:38:00Z",
    "MetadataValues": [
        {
            "ID": 19683,
            "MetadataFieldID": 4,
            "ItemValue": "Contains public sector information licensed under the Open Government Licence v2.0. http://www.nationalarchives.gov.uk/doc/open-government-licence/version/2/"
        }
    ],
    "DataQualityLevel": 3,
    "DateCreated": "2021-07-12T03:38:00Z",
    "SubmissionStatusTypeID": 100
}