{
    "IsRecentlyVerified": false,
    "ID": 62070,
    "UUID": "33BBF812-F16D-4135-8476-97ECC47F4B95",
    "DataProviderID": 2,
    "DataProvidersReference": "73232",
    "UsageTypeID": 1,
    "AddressInfo": {
        "ID": 62416,
        "Title": "Ohio University - Lot 90",
        "AddressLine1": "24 Race St",
        "Town": "Athens",
        "StateOrProvince": "OH",
        "Postcode": "45701",
        "CountryID": 2,
        "Latitude": 39.324213,
        "Longitude": -82.096586,
        "ContactTelephone1": "740-593-1917",
        "AccessComments": "24 hours daily",
        "RelatedURL": "",
        "DistanceUnit": 0
    },
    "Connections": [
        {
            "ID": 78973,
            "ConnectionTypeID": 1,
            "LevelID": 2,
            "Amps": 16,
            "Voltage": 230,
            "PowerKW": 3.7,
            "CurrentTypeID": 10,
            "Quantity": 2
        }
    ],
    "DateLastStatusUpdate": "2020-06-26T03:01:00Z",
    "DataQualityLevel": 3,
    "DateCreated": "2016-03-03T11:38:00Z",
    "SubmissionStatusTypeID": 100
}