{
    "IsRecentlyVerified": false,
    "ID": 33896,
    "UUID": "5513A6CE-511C-475A-A397-93D8DE6A13B4",
    "DataProviderID": 26,
    "DataProvidersReference": "48575",
    "OperatorID": 178,
    "OperatorsReference": "EVnetNL REE227",
    "UsageCost": "0.00 jaarabonnement",
    "AddressInfo": {
        "ID": 34242,
        "Title": "Zwanenveld 5462",
        "AddressLine1": "Zwanenveld 5462",
        "Town": "Nijmegen",
        "Postcode": "6538 VS",
        "CountryID": 159,
        "Latitude": 51.824148,
        "Longitude": 5.798997,
        "ContactTelephone1": "0800-3522365",
        "RelatedURL": "http://www.evnet.nl",
        "DistanceUnit": 0
    },
    "Connections": [
        {
            "ID": 37407,
            "ConnectionTypeID": 25,
            "LevelID": 2,
            "PowerKW": 11,
            "CurrentTypeID": 10
        }
    ],
    "NumberOfPoints": 2,
    "StatusTypeID": 50,
    "DateLastStatusUpdate": "2016-06-04T02:40:00Z",
    "DataQualityLevel": 3,
    "DateCreated": "2015-01-09T06:04:00Z",
    "SubmissionStatusTypeID": 100
}