{
    "IsRecentlyVerified": false,
    "ID": 113922,
    "UUID": "D9CD26E4-31A1-4B4A-BD3D-3E9015823603",
    "DataProviderID": 1,
    "OperatorID": 23,
    "OperatorsReference": "46702",
    "UsageTypeID": 4,
    "AddressInfo": {
        "ID": 114268,
        "Title": "The Raffles",
        "AddressLine1": "11 Blackall Road",
        "Town": "Exeter",
        "Postcode": "EX4 4HD",
        "CountryID": 1,
        "Latitude": 50.729368,
        "Longitude": -3.527845,
        "ContactTelephone1": " +44 139 227 0200",
        "DistanceUnit": 0
    },
    "Connections": [
        {
            "ID": 160492,
            "ConnectionTypeID": 30,
            "StatusTypeID": 50,
            "LevelID": 2,
            "PowerKW": 6,
            "CurrentTypeID": 10,
            "Quantity": 1
        }
    ],
    "NumberOfPoints": 1,
    "GeneralComments": "1 Tesla Connector, up to 6kW.Available for customers. Please call ahead.",
    "StatusTypeID": 50,
    "DateLastStatusUpdate": "2019-01-02T21:58:00Z",
    "DataQualityLevel": 1,
    "DateCreated": "2019-01-02T21:58:00Z",
    "SubmissionStatusTypeID": 200
}