{
    "IsRecentlyVerified": false,
    "ID": 92394,
    "UUID": "72F15529-DB77-46A7-98C0-79C1E5397121",
    "DataProviderID": 1,
    "OperatorID": 105,
    "UsageTypeID": 4,
    "AddressInfo": {
        "ID": 92740,
        "Title": "Rathaus",
        "AddressLine1": "Kaiserstraße 170",
        "Town": "Wetter",
        "StateOrProvince": "Ennepe-Ruhr-Kreis",
        "Postcode": "58300",
        "CountryID": 87,
        "Latitude": 51.3869421,
        "Longitude": 7.398782100000062,
        "AccessComments": "24/7 nutzbare Säule vom RWE Typ am Rand des Parkplatzes vor dem Rathaus am Rand des Fußweg. Von der Straße aus sichtbar.",
        "DistanceUnit": 0
    },
    "Connections": [
        {
            "ID": 130964,
            "ConnectionTypeID": 25,
            "StatusTypeID": 50,
            "LevelID": 2,
            "Amps": 32,
            "Voltage": 400,
            "PowerKW": 22,
            "CurrentTypeID": 20,
            "Quantity": 2
        }
    ],
    "NumberOfPoints": 2,
    "GeneralComments": "Inbetriebnahme 01.10.2017",
    "StatusTypeID": 50,
    "DateLastStatusUpdate": "2017-09-04T06:47:00Z",
    "DataQualityLevel": 1,
    "DateCreated": "2017-09-04T06:47:00Z",
    "SubmissionStatusTypeID": 200
}