{
    "IsRecentlyVerified": false,
    "ID": 48246,
    "UUID": "0E98B491-0B71-48EB-8B4B-7F071FC9A1F7",
    "DataProviderID": 2,
    "DataProvidersReference": "63983",
    "UsageTypeID": 2,
    "AddressInfo": {
        "ID": 48592,
        "Title": "Park Ford",
        "AddressLine1": "400 W Ave",
        "Town": "Tallmadge",
        "StateOrProvince": "OH",
        "Postcode": "44278",
        "CountryID": 2,
        "Latitude": 41.102337,
        "Longitude": -81.457703,
        "ContactTelephone1": "",
        "AccessComments": "Dealership business hours; for customer use only",
        "RelatedURL": "",
        "DistanceUnit": 0
    },
    "Connections": [
        {
            "ID": 59662,
            "ConnectionTypeID": 1,
            "LevelID": 2,
            "Amps": 16,
            "Voltage": 230,
            "PowerKW": 3.7,
            "CurrentTypeID": 10,
            "Quantity": 2
        }
    ],
    "DateLastStatusUpdate": "2020-06-26T03:04:00Z",
    "DataQualityLevel": 3,
    "DateCreated": "2015-06-24T11:44:00Z",
    "SubmissionStatusTypeID": 100
}