{
    "IsRecentlyVerified": false,
    "ID": 102497,
    "UUID": "9681BC05-6CE3-44EA-8B0F-91AC34D03EC2",
    "DataProviderID": 2,
    "DataProvidersReference": "94763",
    "UsageTypeID": 1,
    "AddressInfo": {
        "ID": 102843,
        "Title": "The Cosmopolitan Brentwood",
        "AddressLine1": "441 S Barrington Ave",
        "Town": "Los Angeles",
        "StateOrProvince": "CA",
        "Postcode": "90049",
        "CountryID": 2,
        "Latitude": 34.059905,
        "Longitude": -118.469622,
        "ContactTelephone1": "866-816-7584",
        "AccessComments": "Business hours",
        "RelatedURL": "http://evconnect.com/",
        "DistanceUnit": 0
    },
    "Connections": [
        {
            "ID": 144579,
            "ConnectionTypeID": 1,
            "LevelID": 2,
            "Amps": 16,
            "Voltage": 230,
            "PowerKW": 3,
            "CurrentTypeID": 10,
            "Quantity": 3
        }
    ],
    "DateLastStatusUpdate": "2019-04-06T04:01:00Z",
    "DataQualityLevel": 3,
    "DateCreated": "2018-04-21T04:13:00Z",
    "SubmissionStatusTypeID": 100
}