{
    "IsRecentlyVerified": false,
    "ID": 184356,
    "UUID": "8B56A9EC-FA8C-4022-926C-B468A478D95A",
    "DataProviderID": 29,
    "DataProvidersReference": "11992",
    "AddressInfo": {
        "ID": 184715,
        "Title": "Am Juliusturm 33",
        "AddressLine1": "Am Juliusturm 33",
        "Town": "Berlin",
        "Postcode": "13599",
        "CountryID": 87,
        "Latitude": 52.53664,
        "Longitude": 13.221625,
        "DistanceUnit": 0
    },
    "Connections": [
        {
            "ID": 292551,
            "ConnectionTypeID": 33,
            "StatusTypeID": 50,
            "LevelID": 3,
            "PowerKW": 175,
            "CurrentTypeID": 30
        },
        {
            "ID": 292552,
            "ConnectionTypeID": 33,
            "StatusTypeID": 50,
            "LevelID": 3,
            "PowerKW": 175,
            "CurrentTypeID": 30
        }
    ],
    "StatusTypeID": 50,
    "DateLastStatusUpdate": "2021-07-09T03:28:00Z",
    "MetadataValues": [
        {
            "ID": 16647,
            "MetadataFieldID": 4,
            "ItemValue": "Data from the German chargepoint registry provided by Bundesnetzagentur.de under the CC-BY 4.0 license"
        }
    ],
    "DataQualityLevel": 3,
    "DateCreated": "2021-07-08T10:05:00Z",
    "SubmissionStatusTypeID": 100
}