{
    "IsRecentlyVerified": false,
    "ID": 39166,
    "UUID": "DE72CCF4-3E0A-4029-A5F7-BF6E4430EDCF",
    "DataProviderID": 1,
    "OperatorID": 105,
    "OperatorsReference": "Essent EM-DE-02000000-11-00001",
    "UsageTypeID": 4,
    "AddressInfo": {
        "ID": 39512,
        "Title": "Kolumbusstraße 8",
        "AddressLine1": "Kolumbusstraße 8",
        "Town": "Hamburg",
        "Postcode": "22113",
        "CountryID": 87,
        "Latitude": 53.543056,
        "Longitude": 10.086667,
        "DistanceUnit": 0
    },
    "Connections": [
        {
            "ID": 42677,
            "ConnectionTypeID": 25,
            "LevelID": 2,
            "PowerKW": 11
        },
        {
            "ID": 49895,
            "ConnectionTypeID": 25,
            "LevelID": 2,
            "PowerKW": 11
        }
    ],
    "NumberOfPoints": 1,
    "StatusTypeID": 50,
    "DateLastStatusUpdate": "2015-04-12T17:44:00Z",
    "DataQualityLevel": 3,
    "DateCreated": "2015-01-09T06:08:00Z",
    "SubmissionStatusTypeID": 200
}