{
    "IsRecentlyVerified": false,
    "ID": 105102,
    "UUID": "5BD996C4-F6BD-411A-850E-0A0F103B68DB",
    "DataProviderID": 1,
    "OperatorID": 86,
    "UsageTypeID": 4,
    "AddressInfo": {
        "ID": 105448,
        "Title": "Supermarkt Edeka",
        "AddressLine1": "Max-Planck-Straße 1",
        "Town": "Dörzbach",
        "StateOrProvince": "Hohenlohekreis",
        "Postcode": "74677",
        "CountryID": 87,
        "Latitude": 49.3844899,
        "Longitude": 9.695274899999959,
        "AccessComments": "24/7 verfügbar",
        "DistanceUnit": 0
    },
    "Connections": [
        {
            "ID": 148214,
            "ConnectionTypeID": 25,
            "StatusTypeID": 50,
            "LevelID": 2,
            "Amps": 32,
            "Voltage": 400,
            "PowerKW": 22,
            "CurrentTypeID": 20,
            "Quantity": 2
        }
    ],
    "NumberOfPoints": 2,
    "StatusTypeID": 50,
    "DateLastStatusUpdate": "2018-05-30T13:57:00Z",
    "DataQualityLevel": 1,
    "DateCreated": "2018-05-30T13:57:00Z",
    "SubmissionStatusTypeID": 200
}