{
    "IsRecentlyVerified": false,
    "ID": 96345,
    "UUID": "8F27A26C-8D20-4EEF-B860-86533C58D62B",
    "DataProviderID": 1,
    "OperatorID": 3261,
    "UsageTypeID": 4,
    "AddressInfo": {
        "ID": 96691,
        "Title": "Wunderhalle",
        "AddressLine1": "Rosenheimer Straße 30b",
        "Town": "Oberaudorf",
        "StateOrProvince": "Landkreis Rosenheim",
        "Postcode": "83080",
        "CountryID": 87,
        "Latitude": 47.6517101564036,
        "Longitude": 12.173396898022938,
        "ContactTelephone1": "+49 8033 2688",
        "AccessComments": "24/7 nutzbare Ladestation auf dem überdachten Parkplatz der Wunderhalle.\r\n",
        "RelatedURL": "http://www.wunderhalle.net/",
        "DistanceUnit": 0
    },
    "Connections": [
        {
            "ID": 136518,
            "ConnectionTypeID": 25,
            "StatusTypeID": 50,
            "LevelID": 2,
            "Amps": 16,
            "Voltage": 400,
            "PowerKW": 11,
            "CurrentTypeID": 20,
            "Quantity": 2
        }
    ],
    "NumberOfPoints": 2,
    "StatusTypeID": 50,
    "DateLastStatusUpdate": "2017-12-21T13:11:00Z",
    "DataQualityLevel": 1,
    "DateCreated": "2017-12-21T13:11:00Z",
    "SubmissionStatusTypeID": 200
}