{
    "IsRecentlyVerified": false,
    "ID": 178127,
    "UUID": "2724DE33-EE30-476B-9C13-8A5F50243A5E",
    "DataProviderID": 29,
    "DataProvidersReference": "10480",
    "OperatorID": 45,
    "AddressInfo": {
        "ID": 178486,
        "Title": "Am Reitweg 10",
        "AddressLine1": "Am Reitweg 10",
        "Town": "Dillingen",
        "Postcode": "89407",
        "CountryID": 87,
        "Latitude": 48.577536,
        "Longitude": 10.499924,
        "DistanceUnit": 0
    },
    "Connections": [
        {
            "ID": 278146,
            "ConnectionTypeID": 25,
            "StatusTypeID": 50,
            "LevelID": 2,
            "PowerKW": 11,
            "CurrentTypeID": 20
        },
        {
            "ID": 278147,
            "ConnectionTypeID": 25,
            "StatusTypeID": 50,
            "LevelID": 2,
            "PowerKW": 11,
            "CurrentTypeID": 20
        }
    ],
    "StatusTypeID": 0,
    "DateLastStatusUpdate": "2021-07-09T03:13:00Z",
    "MetadataValues": [
        {
            "ID": 10421,
            "MetadataFieldID": 4,
            "ItemValue": "Data from the German chargepoint registry provided by Bundesnetzagentur.de under the CC-BY 4.0 license"
        }
    ],
    "DataQualityLevel": 3,
    "DateCreated": "2021-07-08T09:49:00Z",
    "SubmissionStatusTypeID": 100
}