{
    "IsRecentlyVerified": false,
    "ID": 121320,
    "UUID": "4D231497-A333-4D6B-8294-7A504E3137FE",
    "DataProviderID": 2,
    "DataProvidersReference": "120973",
    "OperatorID": 5,
    "UsageTypeID": 1,
    "AddressInfo": {
        "ID": 121666,
        "Title": "BURNS MGT",
        "AddressLine1": "2125 Whistler Ct",
        "Town": "Saratoga Springs",
        "StateOrProvince": "NY",
        "Postcode": "12866",
        "CountryID": 2,
        "Latitude": 43.0935477,
        "Longitude": -73.7551403,
        "ContactTelephone1": "888-758-4389",
        "AccessComments": "24 hours daily",
        "RelatedURL": "http://www.chargepoint.com/",
        "DistanceUnit": 0
    },
    "Connections": [
        {
            "ID": 170763,
            "ConnectionTypeID": 1,
            "LevelID": 2,
            "Amps": 16,
            "Voltage": 230,
            "PowerKW": 3.7,
            "CurrentTypeID": 10,
            "Quantity": 6
        }
    ],
    "DateLastStatusUpdate": "2020-06-26T03:06:00Z",
    "DataQualityLevel": 3,
    "DateCreated": "2019-04-01T05:00:00Z",
    "SubmissionStatusTypeID": 100
}