{
    "IsRecentlyVerified": false,
    "ID": 42282,
    "UUID": "7FD64E08-B6C0-4A86-84B3-E9C7AE562443",
    "DataProviderID": 1,
    "UsageTypeID": 1,
    "UsageCost": "Free",
    "AddressInfo": {
        "ID": 42628,
        "Title": "Gascoyne Way Car Park",
        "AddressLine1": "Gascoyne Way",
        "Town": "Hertford",
        "StateOrProvince": "Hertfordshire",
        "Postcode": "SG13 8AE",
        "CountryID": 1,
        "Latitude": 51.7957441610428,
        "Longitude": -0.0749572713722357,
        "ContactTelephone1": "01279 655261",
        "ContactEmail": "enquiries@eastherts.gov.uk",
        "RelatedURL": "http://www.eastherts.gov.uk/index.jsp?articleid=10369",
        "DistanceUnit": 0
    },
    "Connections": [
        {
            "ID": 50850,
            "ConnectionTypeID": 3,
            "StatusTypeID": 50,
            "LevelID": 2,
            "Amps": 13,
            "Voltage": 240,
            "PowerKW": 3,
            "CurrentTypeID": 10,
            "Quantity": 2
        }
    ],
    "NumberOfPoints": 2,
    "GeneralComments": "There are two bays on the ground floor. Parking fees apply.",
    "StatusTypeID": 50,
    "DateLastStatusUpdate": "2015-03-06T09:06:00Z",
    "DataQualityLevel": 1,
    "DateCreated": "2015-03-05T13:34:00Z",
    "SubmissionStatusTypeID": 200
}