{
    "IsRecentlyVerified": false,
    "ID": 32224,
    "UUID": "10913AAA-C0AE-42AA-A0F0-D4D518499384",
    "DataProviderID": 26,
    "DataProvidersReference": "28986",
    "OperatorID": 69,
    "OperatorsReference": "STAWAG",
    "UsageCost": "0.00 onbekend",
    "AddressInfo": {
        "ID": 32570,
        "Title": "Ungarnstraße 5a",
        "AddressLine1": "Ungarnstraße 5a",
        "Town": "Aachen",
        "Postcode": "52070",
        "CountryID": 87,
        "Latitude": 50.783,
        "Longitude": 6.099,
        "RelatedURL": "http://www.ladenetz.de",
        "DistanceUnit": 0
    },
    "Connections": [
        {
            "ID": 35735,
            "ConnectionTypeID": 25,
            "LevelID": 2,
            "PowerKW": 11,
            "CurrentTypeID": 10
        }
    ],
    "NumberOfPoints": 1,
    "StatusTypeID": 50,
    "DateLastStatusUpdate": "2016-06-04T02:38:00Z",
    "DataQualityLevel": 3,
    "DateCreated": "2015-01-09T06:03:00Z",
    "SubmissionStatusTypeID": 100
}