{
    "IsRecentlyVerified": false,
    "ID": 183343,
    "UUID": "B315B48A-7FE4-41E1-9818-73AC960A7660",
    "DataProviderID": 29,
    "DataProvidersReference": "2684",
    "OperatorID": 121,
    "AddressInfo": {
        "ID": 183702,
        "Title": "Gehrenrode 12",
        "AddressLine1": "Gehrenrode 12",
        "Town": "Bad Gandersheim/Gehrenrode",
        "Postcode": "37581",
        "CountryID": 87,
        "Latitude": 51.93272,
        "Longitude": 10.01519,
        "DistanceUnit": 0
    },
    "Connections": [
        {
            "ID": 290215,
            "ConnectionTypeID": 25,
            "StatusTypeID": 50,
            "LevelID": 2,
            "PowerKW": 22,
            "CurrentTypeID": 20
        },
        {
            "ID": 290216,
            "ConnectionTypeID": 28,
            "StatusTypeID": 50,
            "LevelID": 2,
            "PowerKW": 22,
            "CurrentTypeID": 20
        },
        {
            "ID": 300029,
            "ConnectionTypeID": 25,
            "StatusTypeID": 50,
            "LevelID": 2,
            "PowerKW": 22,
            "CurrentTypeID": 20
        }
    ],
    "StatusTypeID": 50,
    "DateLastStatusUpdate": "2021-07-12T02:48:00Z",
    "MetadataValues": [
        {
            "ID": 15636,
            "MetadataFieldID": 4,
            "ItemValue": "Data from the German chargepoint registry provided by Bundesnetzagentur.de under the CC-BY 4.0 license"
        }
    ],
    "DataQualityLevel": 3,
    "DateCreated": "2021-07-08T10:03:00Z",
    "SubmissionStatusTypeID": 100
}