{
    "UserComments": [
        {
            "ID": 22868,
            "ChargePointID": 108404,
            "CommentTypeID": 10,
            "UserName": "ForumElettrico.it",
            "Comment": "Colonnina accesa e credo perfettamente funzionante, ma a meno di non mettersi li a spostare le transenne... inaccessibile!. Leggi la recensione completa qui > https://www.forumelettrico.it/forum/post117435.html#p117435",
            "RelatedURL": "https://www.forumelettrico.it/forum/post117435.html#p117435",
            "DateCreated": "2020-07-05T15:23:23.487Z",
            "User": {
                "ID": 11749,
                "Username": "ForumElettrico.it"
            },
            "CheckinStatusTypeID": 25,
            "IsActionedByEditor": false
        },
        {
            "ID": 20280,
            "ChargePointID": 108404,
            "CommentTypeID": 10,
            "UserName": "ForumElettrico.it",
            "RelatedURL": "https://www.forumelettrico.it/forum/colonnine-fico-eataly-world-t2214.html",
            "DateCreated": "2018-10-09T16:24:05.427Z",
            "User": {
                "ID": 11749,
                "Username": "ForumElettrico.it"
            },
            "CheckinStatusTypeID": 10
        }
    ],
    "MediaItems": [
        {
            "ID": 22915,
            "ChargePointID": 108404,
            "ItemURL": "https://s3-ap-southeast-2.amazonaws.com/openchargemap/images/IT/OCM108404/OCM-108404.orig.2020070515235537.jpg",
            "ItemThumbnailURL": "https://s3-ap-southeast-2.amazonaws.com/openchargemap/images/IT/OCM108404/OCM-108404.thmb.2020070515235537.jpg",
            "Comment": "",
            "IsEnabled": true,
            "IsVideo": false,
            "IsFeaturedItem": false,
            "IsExternalResource": false,
            "User": {
                "ID": 11749,
                "Username": "ForumElettrico.it"
            },
            "DateCreated": "2020-07-05T15:24:00Z"
        },
        {
            "ID": 22916,
            "ChargePointID": 108404,
            "ItemURL": "https://s3-ap-southeast-2.amazonaws.com/openchargemap/images/IT/OCM108404/OCM-108404.orig.2020070515240171.jpg",
            "ItemThumbnailURL": "https://s3-ap-southeast-2.amazonaws.com/openchargemap/images/IT/OCM108404/OCM-108404.thmb.2020070515240171.jpg",
            "Comment": "",
            "IsEnabled": true,
            "IsVideo": false,
            "IsFeaturedItem": false,
            "IsExternalResource": false,
            "User": {
                "ID": 11749,
                "Username": "ForumElettrico.it"
            },
            "DateCreated": "2020-07-05T15:24:00Z"
        },
        {
            "ID": 22917,
            "ChargePointID": 108404,
            "ItemURL": "https://s3-ap-southeast-2.amazonaws.com/openchargemap/images/IT/OCM108404/OCM-108404.orig.2020070515240816.jpg",
            "ItemThumbnailURL": "https://s3-ap-southeast-2.amazonaws.com/openchargemap/images/IT/OCM108404/OCM-108404.thmb.2020070515240816.jpg",
            "Comment": "",
            "IsEnabled": true,
            "IsVideo": false,
            "IsFeaturedItem": false,
            "IsExternalResource": false,
            "User": {
                "ID": 11749,
                "Username": "ForumElettrico.it"
            },
            "DateCreated": "2020-07-05T15:24:00Z"
        },
        {
            "ID": 22918,
            "ChargePointID": 108404,
            "ItemURL": "https://s3-ap-southeast-2.amazonaws.com/openchargemap/images/IT/OCM108404/OCM-108404.orig.2020070515241548.jpg",
            "ItemThumbnailURL": "https://s3-ap-southeast-2.amazonaws.com/openchargemap/images/IT/OCM108404/OCM-108404.thmb.2020070515241548.jpg",
            "Comment": "",
            "IsEnabled": true,
            "IsVideo": false,
            "IsFeaturedItem": false,
            "IsExternalResource": false,
            "User": {
                "ID": 11749,
                "Username": "ForumElettrico.it"
            },
            "DateCreated": "2020-07-05T15:24:00Z"
        },
        {
            "ID": 22919,
            "ChargePointID": 108404,
            "ItemURL": "https://s3-ap-southeast-2.amazonaws.com/openchargemap/images/IT/OCM108404/OCM-108404.orig.2020070515242145.jpg",
            "ItemThumbnailURL": "https://s3-ap-southeast-2.amazonaws.com/openchargemap/images/IT/OCM108404/OCM-108404.thmb.2020070515242145.jpg",
            "Comment": "",
            "IsEnabled": true,
            "IsVideo": false,
            "IsFeaturedItem": false,
            "IsExternalResource": false,
            "User": {
                "ID": 11749,
                "Username": "ForumElettrico.it"
            },
            "DateCreated": "2020-07-05T15:24:00Z"
        },
        {
            "ID": 16968,
            "ChargePointID": 108404,
            "ItemURL": "https://s3-ap-southeast-2.amazonaws.com/openchargemap/images/IT/OCM108404/OCM-108404.orig.2018110509381301.jpg",
            "ItemThumbnailURL": "https://s3-ap-southeast-2.amazonaws.com/openchargemap/images/IT/OCM108404/OCM-108404.thmb.2018110509381301.jpg",
            "Comment": "",
            "IsEnabled": true,
            "IsVideo": false,
            "IsFeaturedItem": false,
            "IsExternalResource": false,
            "User": {
                "ID": 11749,
                "Username": "ForumElettrico.it"
            },
            "DateCreated": "2018-11-05T09:38:00Z"
        },
        {
            "ID": 16750,
            "ChargePointID": 108404,
            "ItemURL": "https://s3-ap-southeast-2.amazonaws.com/openchargemap/images/IT/OCM108404/OCM-108404.orig.2018100916242194.jpg",
            "ItemThumbnailURL": "https://s3-ap-southeast-2.amazonaws.com/openchargemap/images/IT/OCM108404/OCM-108404.thmb.2018100916242194.jpg",
            "Comment": "",
            "IsEnabled": true,
            "IsVideo": false,
            "IsFeaturedItem": false,
            "IsExternalResource": false,
            "User": {
                "ID": 11749,
                "Username": "ForumElettrico.it"
            },
            "DateCreated": "2018-10-09T16:25:00Z"
        },
        {
            "ID": 16751,
            "ChargePointID": 108404,
            "ItemURL": "https://s3-ap-southeast-2.amazonaws.com/openchargemap/images/IT/OCM108404/OCM-108404.orig.2018100916242846.jpg",
            "ItemThumbnailURL": "https://s3-ap-southeast-2.amazonaws.com/openchargemap/images/IT/OCM108404/OCM-108404.thmb.2018100916242846.jpg",
            "Comment": "",
            "IsEnabled": true,
            "IsVideo": false,
            "IsFeaturedItem": false,
            "IsExternalResource": false,
            "User": {
                "ID": 11749,
                "Username": "ForumElettrico.it"
            },
            "DateCreated": "2018-10-09T16:25:00Z"
        },
        {
            "ID": 16752,
            "ChargePointID": 108404,
            "ItemURL": "https://s3-ap-southeast-2.amazonaws.com/openchargemap/images/IT/OCM108404/OCM-108404.orig.2018100916243456.jpg",
            "ItemThumbnailURL": "https://s3-ap-southeast-2.amazonaws.com/openchargemap/images/IT/OCM108404/OCM-108404.thmb.2018100916243456.jpg",
            "Comment": "",
            "IsEnabled": true,
            "IsVideo": false,
            "IsFeaturedItem": false,
            "IsExternalResource": false,
            "User": {
                "ID": 11749,
                "Username": "ForumElettrico.it"
            },
            "DateCreated": "2018-10-09T16:25:00Z"
        }
    ],
    "IsRecentlyVerified": false,
    "ID": 108404,
    "UUID": "9AEC3E35-75B1-43CE-867F-024B19B33D8B",
    "DataProviderID": 1,
    "OperatorID": 80,
    "UsageTypeID": 4,
    "AddressInfo": {
        "ID": 108750,
        "Title": "FICO Eataly World Parcheggio Ovest | EnelX ",
        "AddressLine1": "Via Paolo Canali, 8",
        "Town": "Bologna",
        "StateOrProvince": "BO",
        "Postcode": "40055",
        "CountryID": 112,
        "Latitude": 44.5175437594474,
        "Longitude": 11.4075662967423,
        "RelatedURL": "https://www.enelx.com/it/it/emobility",
        "DistanceUnit": 0
    },
    "Connections": [
        {
            "ID": 153269,
            "ConnectionTypeID": 33,
            "StatusTypeID": 50,
            "LevelID": 3,
            "PowerKW": 50,
            "CurrentTypeID": 30,
            "Quantity": 1
        },
        {
            "ID": 153270,
            "ConnectionTypeID": 2,
            "StatusTypeID": 50,
            "LevelID": 3,
            "PowerKW": 50,
            "CurrentTypeID": 30,
            "Quantity": 1
        },
        {
            "ID": 153271,
            "ConnectionTypeID": 1036,
            "StatusTypeID": 50,
            "LevelID": 3,
            "Amps": 64,
            "Voltage": 400,
            "PowerKW": 43,
            "CurrentTypeID": 20,
            "Quantity": 1
        },
        {
            "ID": 153272,
            "ConnectionTypeID": 25,
            "StatusTypeID": 50,
            "LevelID": 2,
            "Amps": 32,
            "Voltage": 400,
            "PowerKW": 22,
            "CurrentTypeID": 20,
            "Quantity": 8
        },
        {
            "ID": 153273,
            "ConnectionTypeID": 36,
            "StatusTypeID": 50,
            "LevelID": 1,
            "Amps": 16,
            "Voltage": 32,
            "PowerKW": 3.7,
            "CurrentTypeID": 20,
            "Quantity": 2
        }
    ],
    "NumberOfPoints": 12,
    "GeneralComments": "Parcheggio a pagamento, le prime 2 ore gratis",
    "StatusTypeID": 50,
    "DateLastStatusUpdate": "2020-07-05T15:24:00Z",
    "DataQualityLevel": 1,
    "DateCreated": "2018-09-28T13:11:00Z",
    "SubmissionStatusTypeID": 200
}