{
    "IsRecentlyVerified": false,
    "ID": 167138,
    "UUID": "3DE4B81C-2E8C-4DAD-A80E-56AD3BD0F7D2",
    "DataProviderID": 1,
    "OperatorID": 2247,
    "UsageTypeID": 4,
    "UsageCost": "0",
    "AddressInfo": {
        "ID": 167497,
        "Title": "Avenida País Valencia 9",
        "AddressLine1": "Av. Pais Valencia 9",
        "Town": "la Vila Joiosa",
        "StateOrProvince": "Valencian Community",
        "Postcode": "03570",
        "CountryID": 210,
        "Latitude": 38.50623386765932,
        "Longitude": -0.23159723443893654,
        "DistanceUnit": 0
    },
    "Connections": [
        {
            "ID": 253104,
            "ConnectionTypeID": 25,
            "Reference": "ID5630",
            "StatusTypeID": 50,
            "LevelID": 2,
            "PowerKW": 22,
            "CurrentTypeID": 20,
            "Quantity": 2,
            "Comments": ""
        }
    ],
    "NumberOfPoints": 2,
    "GeneralComments": "Operado por Iberdrola. Gratuito.",
    "StatusTypeID": 50,
    "DateLastStatusUpdate": "2020-08-29T08:46:00Z",
    "DataQualityLevel": 1,
    "DateCreated": "2020-08-27T12:16:00Z",
    "SubmissionStatusTypeID": 200
}