{
    "IsRecentlyVerified": false,
    "ID": 61836,
    "UUID": "B0300C75-EBB5-4015-B5A5-989FCFAECB59",
    "DataProviderID": 1,
    "OperatorID": 23,
    "OperatorsReference": "13137",
    "UsageTypeID": 7,
    "UsageCost": "Free",
    "AddressInfo": {
        "ID": 62182,
        "Title": "The Inn at Governor's Club",
        "AddressLine1": "11470 Club Dr",
        "Town": "Chapel Hill",
        "StateOrProvince": "NC",
        "Postcode": "27517",
        "CountryID": 2,
        "Latitude": 35.846957,
        "Longitude": -79.041618,
        "ContactTelephone1": "919-360-5321  877-798-3752",
        "AccessComments": "24 hours daily; for guest use only",
        "RelatedURL": "http://www.teslamotors.com/supercharger",
        "DistanceUnit": 0
    },
    "Connections": [
        {
            "ID": 78728,
            "ConnectionTypeID": 30,
            "StatusTypeID": 50,
            "LevelID": 2,
            "Amps": 16,
            "Voltage": 230,
            "PowerKW": 16,
            "CurrentTypeID": 10,
            "Quantity": 1
        }
    ],
    "NumberOfPoints": 1,
    "StatusTypeID": 50,
    "DateLastStatusUpdate": "2017-01-26T21:45:00Z",
    "DataQualityLevel": 3,
    "DateCreated": "2016-03-03T11:38:00Z",
    "SubmissionStatusTypeID": 100
}