{
    "IsRecentlyVerified": false,
    "ID": 119689,
    "UUID": "73BABCD3-CC2B-46C1-833A-4222DA4F9C28",
    "DataProviderID": 2,
    "DataProvidersReference": "61157",
    "OperatorID": 5,
    "UsageTypeID": 1,
    "AddressInfo": {
        "ID": 120035,
        "Title": "BMW SARASOTA",
        "AddressLine1": "5680-5776 Rosin Way",
        "Town": "Sarasota",
        "StateOrProvince": "FL",
        "Postcode": "34233",
        "CountryID": 2,
        "Latitude": 27.2700968,
        "Longitude": -82.4669627,
        "ContactTelephone1": "888-758-4389",
        "AccessComments": "24 hours daily",
        "RelatedURL": "http://www.chargepoint.com/",
        "DistanceUnit": 0
    },
    "Connections": [
        {
            "ID": 168969,
            "ConnectionTypeID": 1,
            "LevelID": 2,
            "Amps": 16,
            "Voltage": 230,
            "PowerKW": 3,
            "CurrentTypeID": 10,
            "Quantity": 2
        }
    ],
    "DateLastStatusUpdate": "2019-12-24T09:08:00Z",
    "DataQualityLevel": 3,
    "DateCreated": "2019-04-01T04:59:00Z",
    "SubmissionStatusTypeID": 100
}