{
    "IsRecentlyVerified": false,
    "ID": 17955,
    "UUID": "77B46B20-A3D5-4740-845D-CAAC6A2EBD86",
    "DataProviderID": 22,
    "DataProvidersReference": "5075DC36E6FB5B2F19A38AC28D8A7FCA",
    "AddressInfo": {
        "ID": 18300,
        "Title": "道の駅あらエッサ",
        "AddressLine1": "島根県安来市中海町118-1",
        "CountryID": 114,
        "Latitude": 35.40952653,
        "Longitude": 133.3124335,
        "ContactTelephone1": "0854-23-2510",
        "DistanceUnit": 0
    },
    "Connections": [
        {
            "ID": 18196,
            "ConnectionTypeID": 2,
            "LevelID": 2,
            "Amps": 100,
            "Voltage": 480,
            "PowerKW": 48,
            "Quantity": 1
        }
    ],
    "DateLastStatusUpdate": "2013-06-29T09:05:00Z",
    "DataQualityLevel": 2,
    "DateCreated": "2013-06-29T09:05:00Z",
    "SubmissionStatusTypeID": 200
}