{
    "IsRecentlyVerified": false,
    "ID": 115781,
    "UUID": "64A067E1-433B-45FB-B94F-6C317203AF12",
    "DataProviderID": 2,
    "DataProvidersReference": "117103",
    "UsageTypeID": 7,
    "AddressInfo": {
        "ID": 116127,
        "Title": "Russian Gulch State Park",
        "AddressLine1": "N Highway 1",
        "Town": "Mendocino",
        "StateOrProvince": "CA",
        "Postcode": "95460",
        "CountryID": 2,
        "Latitude": 39.330425,
        "Longitude": -123.801947,
        "ContactTelephone1": "707-937-5804",
        "AccessComments": "24 hours daily; for guest use only\r\nPublic - Call ahead",
        "RelatedURL": "",
        "DistanceUnit": 0
    },
    "Connections": [
        {
            "ID": 162818,
            "ConnectionTypeID": 1,
            "LevelID": 2,
            "Amps": 16,
            "Voltage": 230,
            "PowerKW": 3.7,
            "CurrentTypeID": 10,
            "Quantity": 1
        }
    ],
    "DateLastStatusUpdate": "2020-06-26T03:01:00Z",
    "DataQualityLevel": 3,
    "DateCreated": "2019-02-11T07:13:00Z",
    "SubmissionStatusTypeID": 100
}