{
    "IsRecentlyVerified": false,
    "ID": 46796,
    "UUID": "E7BD58F6-32DB-4FDA-AB04-098B080657C5",
    "DataProviderID": 1,
    "OperatorID": 189,
    "UsageTypeID": 4,
    "AddressInfo": {
        "ID": 47142,
        "Title": "E-Wald Ladesäule in Drachselsried",
        "AddressLine1": "Pointwiese 4",
        "Town": "Drachselsried",
        "Postcode": "94256",
        "CountryID": 87,
        "Latitude": 49.1070754346996,
        "Longitude": 13.0083621172944,
        "DistanceUnit": 0
    },
    "Connections": [
        {
            "ID": 57513,
            "ConnectionTypeID": 25,
            "StatusTypeID": 50,
            "LevelID": 2,
            "Amps": 32,
            "Voltage": 400,
            "PowerKW": 22,
            "CurrentTypeID": 20,
            "Quantity": 2
        },
        {
            "ID": 57514,
            "ConnectionTypeID": 28,
            "StatusTypeID": 50,
            "LevelID": 2,
            "Amps": 16,
            "Voltage": 230,
            "PowerKW": 3.7,
            "CurrentTypeID": 10,
            "Quantity": 2
        }
    ],
    "NumberOfPoints": 2,
    "StatusTypeID": 50,
    "DateLastStatusUpdate": "2015-05-08T07:43:00Z",
    "DataQualityLevel": 1,
    "DateCreated": "2015-05-07T16:20:00Z",
    "SubmissionStatusTypeID": 200
}