{
    "IsRecentlyVerified": false,
    "ID": 136599,
    "UUID": "474064A9-1000-4DF8-847D-9552326D8310",
    "DataProviderID": 18,
    "DataProvidersReference": "7402cb2c21f5494aa4af22a631ca8e22",
    "OperatorID": 25,
    "UsageTypeID": 1,
    "AddressInfo": {
        "ID": 136945,
        "Title": "Cockfosters Road",
        "AddressLine1": "Cockfosters Road",
        "Town": "Hadley Wood",
        "Postcode": "EN4 0DZ",
        "CountryID": 1,
        "Latitude": 51.652024,
        "Longitude": -0.149917,
        "AccessComments": "",
        "RelatedURL": "https://www.sourcelondon.net",
        "DistanceUnit": 0
    },
    "Connections": [
        {
            "ID": 191074,
            "ConnectionTypeID": 25,
            "Reference": "1",
            "StatusTypeID": 50,
            "LevelID": 2,
            "Amps": 32,
            "Voltage": 230,
            "PowerKW": 7,
            "CurrentTypeID": 10
        },
        {
            "ID": 191075,
            "ConnectionTypeID": 25,
            "Reference": "2",
            "StatusTypeID": 50,
            "LevelID": 2,
            "Amps": 32,
            "Voltage": 230,
            "PowerKW": 7,
            "CurrentTypeID": 10
        }
    ],
    "StatusTypeID": 0,
    "DateLastStatusUpdate": "2020-03-17T08:54:00Z",
    "MetadataValues": [
        {
            "ID": 6451,
            "MetadataFieldID": 4,
            "ItemValue": "Contains public sector information licensed under the Open Government Licence v2.0. http://www.nationalarchives.gov.uk/doc/open-government-licence/version/2/"
        }
    ],
    "DataQualityLevel": 3,
    "DateCreated": "2019-12-24T05:22:00Z",
    "SubmissionStatusTypeID": 100
}