{
    "IsRecentlyVerified": false,
    "ID": 8205,
    "UUID": "5EF0D936-5D31-49E6-A747-4598FA22DEF5",
    "DataProviderID": 15,
    "DataProvidersReference": "7158",
    "OperatorID": 26,
    "AddressInfo": {
        "ID": 8102,
        "Title": "800 W Queens St",
        "AddressLine1": "800 W Queens St",
        "Town": "Broken Arrow",
        "StateOrProvince": "OK",
        "Postcode": "74012",
        "CountryID": 2,
        "Latitude": 36.07125,
        "Longitude": -95.80098,
        "ContactTelephone1": " (918) 258-6581",
        "RelatedURL": "http://carstations.com/7158",
        "DistanceUnit": 0
    },
    "Connections": [
        {
            "ID": 5634,
            "ConnectionTypeID": 1,
            "Reference": "J1772",
            "LevelID": 2
        }
    ],
    "StatusTypeID": 0,
    "DateLastStatusUpdate": "2017-11-04T14:04:00Z",
    "DataQualityLevel": 1,
    "DateCreated": "2011-11-11T12:06:00Z",
    "SubmissionStatusTypeID": 100
}