{
    "IsRecentlyVerified": false,
    "ID": 17367,
    "UUID": "9A922C4C-21DF-4E72-9852-355DD2BD0741",
    "DataProviderID": 22,
    "DataProvidersReference": "E94F0BFAB8C987A7437BA4E1697C1CC0",
    "AddressInfo": {
        "ID": 17712,
        "Title": "神戸空港",
        "AddressLine1": "兵庫県神戸市中央区神戸空港1",
        "CountryID": 114,
        "Latitude": 34.63705649,
        "Longitude": 135.2273323,
        "ContactTelephone1": "078-322-5305",
        "DistanceUnit": 0
    },
    "Connections": [
        {
            "ID": 17608,
            "ConnectionTypeID": 2,
            "LevelID": 2,
            "Amps": 100,
            "Voltage": 480,
            "PowerKW": 48,
            "Quantity": 1
        }
    ],
    "DateLastStatusUpdate": "2013-06-29T08:57:00Z",
    "DataQualityLevel": 2,
    "DateCreated": "2013-06-29T08:57:00Z",
    "SubmissionStatusTypeID": 200
}