{
    "IsRecentlyVerified": false,
    "ID": 177655,
    "UUID": "2FBB12B1-AED6-4742-8E0D-BFA7F3F56D50",
    "DataProviderID": 29,
    "DataProvidersReference": "11039",
    "OperatorID": 3403,
    "AddressInfo": {
        "ID": 178014,
        "Title": "Goethestraße 19",
        "AddressLine1": "Goethestraße 19",
        "Town": "Trebbin",
        "Postcode": "14959",
        "CountryID": 87,
        "Latitude": 52.216376,
        "Longitude": 13.216862,
        "DistanceUnit": 0
    },
    "Connections": [
        {
            "ID": 277070,
            "ConnectionTypeID": 25,
            "StatusTypeID": 50,
            "LevelID": 2,
            "PowerKW": 22,
            "CurrentTypeID": 20
        },
        {
            "ID": 277071,
            "ConnectionTypeID": 25,
            "StatusTypeID": 50,
            "LevelID": 2,
            "PowerKW": 22,
            "CurrentTypeID": 20
        }
    ],
    "StatusTypeID": 0,
    "DateLastStatusUpdate": "2021-07-12T02:49:00Z",
    "MetadataValues": [
        {
            "ID": 9949,
            "MetadataFieldID": 4,
            "ItemValue": "Data from the German chargepoint registry provided by Bundesnetzagentur.de under the CC-BY 4.0 license"
        }
    ],
    "DataQualityLevel": 3,
    "DateCreated": "2021-07-08T09:49:00Z",
    "SubmissionStatusTypeID": 100
}