{
    "IsRecentlyVerified": false,
    "ID": 32391,
    "UUID": "A4984347-B694-4F9E-ACD0-8DF5B6E1FD91",
    "DataProviderID": 1,
    "OperatorID": 157,
    "OperatorsReference": "NewMotion 02009178",
    "UsageCost": "0.00 jaarabonnement",
    "AddressInfo": {
        "ID": 32737,
        "Title": "Olefant 14",
        "AddressLine1": "Olefant 14",
        "Town": "Bergisch Gladbach",
        "Postcode": "51427",
        "CountryID": 87,
        "Latitude": 50.9547615051269,
        "Longitude": 7.14757966995239,
        "ContactTelephone1": "088 0109500",
        "RelatedURL": "http://thenewmotion.nl/",
        "DistanceUnit": 0
    },
    "Connections": [
        {
            "ID": 35902,
            "ConnectionTypeID": 25,
            "LevelID": 2,
            "PowerKW": 3.7,
            "CurrentTypeID": 10
        }
    ],
    "NumberOfPoints": 1,
    "StatusTypeID": 50,
    "DateLastStatusUpdate": "2021-04-25T05:14:00Z",
    "DataQualityLevel": 3,
    "DateCreated": "2015-01-09T06:03:00Z",
    "SubmissionStatusTypeID": 200
}