{
    "IsRecentlyVerified": false,
    "ID": 9248,
    "UUID": "AAB46537-4CA9-4115-809F-F46E08AFAA81",
    "DataProviderID": 1,
    "UsageTypeID": 1,
    "UsageCost": "Free",
    "AddressInfo": {
        "ID": 9145,
        "Title": "ANWB Servicecenter Naarden",
        "AddressLine1": "IJsselmeerweg 2 ",
        "AddressLine2": "",
        "Town": "Naarden",
        "StateOrProvince": "",
        "Postcode": "1411 AA ",
        "CountryID": 159,
        "Latitude": 52.3193351,
        "Longitude": 5.140255000000025,
        "ContactTelephone1": "+31(0)35 – 694 29 74",
        "ContactTelephone2": "",
        "ContactEmail": "",
        "AccessComments": "Maandag t/m vrijdag - 8.00 tot 22.00 uur Zaterdag - 9.00 tot 17.30 uur Zondag - 10.00 tot 18.30 uur ",
        "RelatedURL": "http://www.anwb.nl/elektrisch",
        "DistanceUnit": 0
    },
    "Connections": [
        {
            "ID": 6958,
            "ConnectionTypeID": 2,
            "StatusTypeID": 0,
            "LevelID": 3,
            "Quantity": 1
        }
    ],
    "NumberOfPoints": 1,
    "GeneralComments": "",
    "StatusTypeID": 50,
    "DateLastStatusUpdate": "2012-01-29T11:19:00Z",
    "DataQualityLevel": 1,
    "DateCreated": "2012-01-29T11:19:00Z",
    "SubmissionStatusTypeID": 200
}