{
    "UserComments": [
        {
            "ID": 189,
            "ChargePointID": 2883,
            "CommentTypeID": 100,
            "UserName": "Mjondo",
            "Comment": "Now converted to j1722. Still free and no card req. charged Leaf successfully",
            "Rating": 5,
            "DateCreated": "2012-11-04T22:01:32.687Z",
            "IsActionedByEditor": true
        }
    ],
    "IsRecentlyVerified": false,
    "ID": 2883,
    "UUID": "90319C29-276B-4A7A-8963-7F6480F7009E",
    "DataProviderID": 1,
    "UsageTypeID": 1,
    "AddressInfo": {
        "ID": 2884,
        "Title": "Rabobank - Salinas",
        "AddressLine1": "1285 N Davis Rd",
        "Town": "Salinas",
        "StateOrProvince": "CA",
        "Postcode": "93907",
        "CountryID": 2,
        "Latitude": 36.70104,
        "Longitude": -121.6673,
        "ContactTelephone1": "831-784-7700",
        "AccessComments": "24 hours daily",
        "DistanceUnit": 0
    },
    "Connections": [
        {
            "ID": 11061,
            "ConnectionTypeID": 1,
            "LevelID": 2,
            "Amps": 16,
            "Voltage": 230,
            "PowerKW": 3,
            "CurrentTypeID": 10,
            "Quantity": 1
        }
    ],
    "DateLastConfirmed": "2011-06-30T00:00:00Z",
    "StatusTypeID": 50,
    "DateLastStatusUpdate": "2019-12-15T06:07:00Z",
    "DataQualityLevel": 1,
    "DateCreated": "2010-02-28T00:00:00Z",
    "SubmissionStatusTypeID": 200
}