{
    "IsRecentlyVerified": false,
    "ID": 68547,
    "UUID": "DE2F7BBB-799E-441A-AD23-B126972CCC97",
    "DataProviderID": 1,
    "OperatorID": 2245,
    "UsageTypeID": 4,
    "AddressInfo": {
        "ID": 68893,
        "Title": "SWU Ladesäule",
        "AddressLine1": "Erhard-Grözinger-Straße 86",
        "Town": "Ulm",
        "Postcode": "89134",
        "CountryID": 87,
        "Latitude": 48.40989709999999,
        "Longitude": 9.940604099999973,
        "ContactTelephone1": "0731/166-8810",
        "AccessComments": "Rund um die Uhr (24/7) nutzbar\r\n",
        "RelatedURL": "http://www.swu.de/",
        "DistanceUnit": 0
    },
    "Connections": [
        {
            "ID": 95935,
            "ConnectionTypeID": 28,
            "StatusTypeID": 50,
            "LevelID": 2,
            "Amps": 16,
            "Voltage": 230,
            "PowerKW": 3.7,
            "CurrentTypeID": 10,
            "Quantity": 2
        },
        {
            "ID": 95936,
            "ConnectionTypeID": 25,
            "StatusTypeID": 50,
            "LevelID": 2,
            "PowerKW": 11,
            "CurrentTypeID": 20,
            "Quantity": 2
        },
        {
            "ID": 95937,
            "ConnectionTypeID": 16,
            "StatusTypeID": 50,
            "LevelID": 2,
            "Amps": 16,
            "Voltage": 230,
            "PowerKW": 3.7,
            "CurrentTypeID": 10,
            "Quantity": 0
        },
        {
            "ID": 95938,
            "ConnectionTypeID": 17,
            "Quantity": 0
        }
    ],
    "NumberOfPoints": 4,
    "StatusTypeID": 50,
    "DateLastStatusUpdate": "2016-06-12T11:05:00Z",
    "DataQualityLevel": 1,
    "DateCreated": "2016-06-12T11:05:00Z",
    "SubmissionStatusTypeID": 200
}