{
    "UserComments": [
        {
            "ID": 24246,
            "ChargePointID": 172993,
            "CommentTypeID": 10,
            "UserName": "ForumElettrico.it",
            "Comment": "È tutto chiuso e mentre si ricarica non c'è nulla da fare: forse una volta c'era la stazione di servizio ma visto lo scarso traffico che passa lì davanti ha chiuso i battenti (o forse non ha mai aperto?). Leggi la recensione completa qui > https://www.forumelettrico.it/forum/post198265.html#p198265",
            "RelatedURL": "https://www.forumelettrico.it/forum/post198265.html#p198265",
            "DateCreated": "2021-04-27T05:08:47.913Z",
            "User": {
                "ID": 11749,
                "Username": "ForumElettrico.it"
            },
            "CheckinStatusTypeID": 10,
            "IsActionedByEditor": false
        },
        {
            "ID": 23948,
            "ChargePointID": 172993,
            "CommentTypeID": 10,
            "UserName": "ForumElettrico.it",
            "Comment": "4 colonnine ultrafast fino a 350 kW dotate di CCS Combo 2 e CHAdeMO. Leggi la recensione completa qui > https://www.forumelettrico.it/forum/colonnine-hpc-enel-x-bologna-bo-t13922.html",
            "RelatedURL": "https://www.forumelettrico.it/forum/colonnine-hpc-enel-x-bologna-bo-t13922.html",
            "DateCreated": "2021-02-26T15:07:40.897Z",
            "User": {
                "ID": 11749,
                "Username": "ForumElettrico.it"
            },
            "CheckinStatusTypeID": 140,
            "IsActionedByEditor": false
        }
    ],
    "MediaItems": [
        {
            "ID": 27396,
            "ChargePointID": 172993,
            "ItemURL": "https://s3-ap-southeast-2.amazonaws.com/openchargemap/images/IT/OCM172993/OCM-172993.orig.2021042705085962.jpg",
            "ItemThumbnailURL": "https://s3-ap-southeast-2.amazonaws.com/openchargemap/images/IT/OCM172993/OCM-172993.thmb.2021042705085962.jpg",
            "Comment": "",
            "IsEnabled": true,
            "IsVideo": false,
            "IsFeaturedItem": false,
            "IsExternalResource": false,
            "User": {
                "ID": 11749,
                "Username": "ForumElettrico.it"
            },
            "DateCreated": "2021-04-27T05:09:00Z"
        },
        {
            "ID": 27397,
            "ChargePointID": 172993,
            "ItemURL": "https://s3-ap-southeast-2.amazonaws.com/openchargemap/images/IT/OCM172993/OCM-172993.orig.2021042705090716.jpg",
            "ItemThumbnailURL": "https://s3-ap-southeast-2.amazonaws.com/openchargemap/images/IT/OCM172993/OCM-172993.thmb.2021042705090716.jpg",
            "Comment": "",
            "IsEnabled": true,
            "IsVideo": false,
            "IsFeaturedItem": false,
            "IsExternalResource": false,
            "User": {
                "ID": 11749,
                "Username": "ForumElettrico.it"
            },
            "DateCreated": "2021-04-27T05:09:00Z"
        },
        {
            "ID": 27398,
            "ChargePointID": 172993,
            "ItemURL": "https://s3-ap-southeast-2.amazonaws.com/openchargemap/images/IT/OCM172993/OCM-172993.orig.2021042705091320.jpg",
            "ItemThumbnailURL": "https://s3-ap-southeast-2.amazonaws.com/openchargemap/images/IT/OCM172993/OCM-172993.thmb.2021042705091320.jpg",
            "Comment": "",
            "IsEnabled": true,
            "IsVideo": false,
            "IsFeaturedItem": false,
            "IsExternalResource": false,
            "User": {
                "ID": 11749,
                "Username": "ForumElettrico.it"
            },
            "DateCreated": "2021-04-27T05:09:00Z"
        },
        {
            "ID": 27399,
            "ChargePointID": 172993,
            "ItemURL": "https://s3-ap-southeast-2.amazonaws.com/openchargemap/images/IT/OCM172993/OCM-172993.orig.2021042705092048.jpg",
            "ItemThumbnailURL": "https://s3-ap-southeast-2.amazonaws.com/openchargemap/images/IT/OCM172993/OCM-172993.thmb.2021042705092048.jpg",
            "Comment": "",
            "IsEnabled": true,
            "IsVideo": false,
            "IsFeaturedItem": false,
            "IsExternalResource": false,
            "User": {
                "ID": 11749,
                "Username": "ForumElettrico.it"
            },
            "DateCreated": "2021-04-27T05:09:00Z"
        },
        {
            "ID": 27400,
            "ChargePointID": 172993,
            "ItemURL": "https://s3-ap-southeast-2.amazonaws.com/openchargemap/images/IT/OCM172993/OCM-172993.orig.2021042705092762.jpg",
            "ItemThumbnailURL": "https://s3-ap-southeast-2.amazonaws.com/openchargemap/images/IT/OCM172993/OCM-172993.thmb.2021042705092762.jpg",
            "Comment": "",
            "IsEnabled": true,
            "IsVideo": false,
            "IsFeaturedItem": false,
            "IsExternalResource": false,
            "User": {
                "ID": 11749,
                "Username": "ForumElettrico.it"
            },
            "DateCreated": "2021-04-27T05:09:00Z"
        },
        {
            "ID": 26682,
            "ChargePointID": 172993,
            "ItemURL": "https://s3-ap-southeast-2.amazonaws.com/openchargemap/images/IT/OCM172993/OCM-172993.orig.2021022615075275.jpg",
            "ItemThumbnailURL": "https://s3-ap-southeast-2.amazonaws.com/openchargemap/images/IT/OCM172993/OCM-172993.thmb.2021022615075275.jpg",
            "Comment": "",
            "IsEnabled": true,
            "IsVideo": false,
            "IsFeaturedItem": false,
            "IsExternalResource": false,
            "User": {
                "ID": 11749,
                "Username": "ForumElettrico.it"
            },
            "DateCreated": "2021-02-26T15:08:00Z"
        },
        {
            "ID": 26683,
            "ChargePointID": 172993,
            "ItemURL": "https://s3-ap-southeast-2.amazonaws.com/openchargemap/images/IT/OCM172993/OCM-172993.orig.2021022615080054.jpg",
            "ItemThumbnailURL": "https://s3-ap-southeast-2.amazonaws.com/openchargemap/images/IT/OCM172993/OCM-172993.thmb.2021022615080054.jpg",
            "Comment": "",
            "IsEnabled": true,
            "IsVideo": false,
            "IsFeaturedItem": false,
            "IsExternalResource": false,
            "User": {
                "ID": 11749,
                "Username": "ForumElettrico.it"
            },
            "DateCreated": "2021-02-26T15:08:00Z"
        }
    ],
    "IsRecentlyVerified": false,
    "ID": 172993,
    "UUID": "8EB4B6E8-7336-477E-BC07-E83639D07410",
    "DataProviderID": 1,
    "OperatorID": 80,
    "UsageTypeID": 1,
    "AddressInfo": {
        "ID": 173352,
        "Title": "E-Via Flex-E AdS IP",
        "AddressLine1": "Viale Giuseppe Fanin 51",
        "Town": "Bologna",
        "StateOrProvince": "BO",
        "CountryID": 112,
        "Latitude": 44.511846,
        "Longitude": 11.410236,
        "RelatedURL": "https://www.forumelettrico.it/forum/colonnine-hpc-enel-x-bologna-bo-t13922.html",
        "DistanceUnit": 0
    },
    "Connections": [
        {
            "ID": 264658,
            "ConnectionTypeID": 33,
            "LevelID": 2,
            "Voltage": 920,
            "PowerKW": 350,
            "Quantity": 4
        },
        {
            "ID": 264659,
            "ConnectionTypeID": 2,
            "LevelID": 2,
            "PowerKW": 70,
            "Quantity": 4
        }
    ],
    "NumberOfPoints": 4,
    "StatusTypeID": 150,
    "DateLastStatusUpdate": "2021-04-27T05:10:00Z",
    "DataQualityLevel": 1,
    "DateCreated": "2021-02-26T15:07:00Z",
    "SubmissionStatusTypeID": 200
}