{
    "IsRecentlyVerified": false,
    "ID": 91560,
    "UUID": "5684EEE6-3247-478D-A802-E09AD5811DB2",
    "DataProviderID": 1,
    "OperatorID": 3248,
    "UsageTypeID": 1,
    "AddressInfo": {
        "ID": 91906,
        "Title": "Rasthof Remscheid West",
        "AddressLine1": "A1",
        "Town": "Wermelskirchen",
        "StateOrProvince": "Rheinisch-Bergischer Kreis",
        "Postcode": "42929",
        "CountryID": 87,
        "Latitude": 51.157860483525084,
        "Longitude": 7.22679576893916,
        "AccessComments": "24/7 nutzbare Ladesäule hinter der Tankstelle. An der Einfahrt in der mittleren Spur fahren, dann fährt man direkt darauf zu.",
        "DistanceUnit": 0
    },
    "Connections": [
        {
            "ID": 129794,
            "ConnectionTypeID": 2,
            "StatusTypeID": 50,
            "LevelID": 3,
            "PowerKW": 50,
            "CurrentTypeID": 30,
            "Quantity": 1
        },
        {
            "ID": 129795,
            "ConnectionTypeID": 33,
            "StatusTypeID": 50,
            "LevelID": 3,
            "PowerKW": 50,
            "CurrentTypeID": 30,
            "Quantity": 1
        },
        {
            "ID": 129796,
            "ConnectionTypeID": 1036,
            "StatusTypeID": 50,
            "LevelID": 3,
            "Amps": 63,
            "Voltage": 400,
            "PowerKW": 43,
            "CurrentTypeID": 20,
            "Quantity": 1
        }
    ],
    "NumberOfPoints": 3,
    "StatusTypeID": 50,
    "DateLastStatusUpdate": "2017-08-07T05:25:00Z",
    "DataQualityLevel": 1,
    "DateCreated": "2017-08-07T05:25:00Z",
    "SubmissionStatusTypeID": 200
}