{
    "IsRecentlyVerified": false,
    "ID": 84287,
    "UUID": "AE722921-F806-43BF-A160-CD70C1C02695",
    "DataProviderID": 1,
    "OperatorID": 23,
    "OperatorsReference": "24563",
    "UsageTypeID": 6,
    "AddressInfo": {
        "ID": 84633,
        "Title": "Mercure Cherbourg Centre Port",
        "AddressLine1": "13 Quai de l'Entrepôt",
        "Town": "Cherbourg en Cotentin",
        "Postcode": "50100",
        "CountryID": 80,
        "Latitude": 49.637086,
        "Longitude": -1.618097,
        "ContactTelephone1": "+33 2 33 44 01 11",
        "DistanceUnit": 0
    },
    "Connections": [
        {
            "ID": 119688,
            "ConnectionTypeID": 30,
            "StatusTypeID": 50,
            "LevelID": 2,
            "Amps": 32,
            "Voltage": 400,
            "PowerKW": 22,
            "CurrentTypeID": 20,
            "Quantity": 1
        }
    ],
    "NumberOfPoints": 1,
    "GeneralComments": "1 Tesla Connector, up to 22kW.Available for patrons only. Please call ahead.",
    "StatusTypeID": 50,
    "DateLastStatusUpdate": "2018-10-03T17:53:00Z",
    "DataQualityLevel": 1,
    "DateCreated": "2017-02-16T17:32:00Z",
    "SubmissionStatusTypeID": 200
}