{
    "IsRecentlyVerified": false,
    "ID": 155783,
    "UUID": "00941F53-DB67-423B-B56E-301EA8A73893",
    "DataProviderID": 1,
    "OperatorID": 80,
    "UsageTypeID": 4,
    "UsageCost": "0,45 €/kWh",
    "AddressInfo": {
        "ID": 156137,
        "Title": "Fonte Nuova Parcheggio COOP | EnelX",
        "AddressLine1": "Via del Brennero",
        "Town": "Fonte Nuova",
        "StateOrProvince": "RM",
        "Postcode": "00013",
        "CountryID": 112,
        "Latitude": 41.99275624771445,
        "Longitude": 12.619258383290344,
        "ContactTelephone1": "800069850",
        "RelatedURL": "https://www.enelx.com/it/it/emobility",
        "DistanceUnit": 0
    },
    "Connections": [
        {
            "ID": 219346,
            "ConnectionTypeID": 25,
            "StatusTypeID": 50,
            "LevelID": 2,
            "Amps": 32,
            "Voltage": 400,
            "PowerKW": 22,
            "CurrentTypeID": 20,
            "Quantity": 2
        }
    ],
    "NumberOfPoints": 2,
    "StatusTypeID": 50,
    "DateLastStatusUpdate": "2020-04-24T15:22:00Z",
    "DataQualityLevel": 1,
    "DateCreated": "2020-04-24T11:27:00Z",
    "SubmissionStatusTypeID": 200
}