{
    "IsRecentlyVerified": false,
    "ID": 64576,
    "UUID": "4DDA2276-8109-4B29-9F4A-D8B81A61E80E",
    "DataProviderID": 1,
    "OperatorID": 98,
    "UsageTypeID": 4,
    "AddressInfo": {
        "ID": 64922,
        "Title": "Rathaus",
        "AddressLine1": "Rathausplatz 1",
        "Town": "Trautskirchen",
        "StateOrProvince": "Neuhof an der Zenn (VGem)",
        "Postcode": "90619",
        "CountryID": 87,
        "Latitude": 49.45645,
        "Longitude": 10.594529999999963,
        "ContactTelephone1": "09107/997973",
        "ContactEmail": "info@trautskirchen.de",
        "AccessComments": "An der Ortsdurchgangsstraße, direkt nach Bushaltestelle Rathaus  - Durchfahrt (2,30 m breit) zwischen Parkplatz und Sparkasse. Box F-281",
        "DistanceUnit": 0
    },
    "Connections": [
        {
            "ID": 82968,
            "ConnectionTypeID": 17,
            "StatusTypeID": 50,
            "LevelID": 2,
            "Amps": 16,
            "Voltage": 400,
            "PowerKW": 11,
            "CurrentTypeID": 20,
            "Quantity": 1
        },
        {
            "ID": 82969,
            "ConnectionTypeID": 16,
            "StatusTypeID": 50,
            "LevelID": 2,
            "Amps": 16,
            "Voltage": 230,
            "PowerKW": 3.7,
            "CurrentTypeID": 10,
            "Quantity": 1
        },
        {
            "ID": 82970,
            "ConnectionTypeID": 28,
            "StatusTypeID": 50,
            "LevelID": 2,
            "Amps": 16,
            "Voltage": 230,
            "PowerKW": 2.7,
            "CurrentTypeID": 10,
            "Quantity": 1
        }
    ],
    "NumberOfPoints": 1,
    "StatusTypeID": 50,
    "DateLastStatusUpdate": "2016-03-11T11:04:00Z",
    "DataQualityLevel": 1,
    "DateCreated": "2016-03-11T11:04:00Z",
    "SubmissionStatusTypeID": 200
}