{
    "IsRecentlyVerified": false,
    "ID": 73540,
    "UUID": "D80E92EB-EE1A-4221-BEF2-716B8E9FA6B2",
    "DataProviderID": 1,
    "OperatorID": 45,
    "UsageTypeID": 1,
    "UsageCost": "Free",
    "AddressInfo": {
        "ID": 73886,
        "Title": "E-Bike Station Strandhaus Grashof",
        "AddressLine1": "Grashof 10",
        "Town": "Grashof",
        "StateOrProvince": "Landkreis Roth",
        "Postcode": "90584",
        "CountryID": 87,
        "Latitude": 49.2298,
        "Longitude": 11.201329999999984,
        "RelatedURL": "http://www.bike-energy.com/",
        "DistanceUnit": 0
    },
    "Connections": [
        {
            "ID": 105800,
            "ConnectionTypeID": 28,
            "StatusTypeID": 50,
            "LevelID": 1,
            "Amps": 10,
            "Voltage": 230,
            "PowerKW": 2.3,
            "CurrentTypeID": 10,
            "Quantity": 3
        },
        {
            "ID": 105801,
            "ConnectionTypeID": 0,
            "StatusTypeID": 50,
            "LevelID": 1,
            "Amps": 6,
            "Voltage": 50,
            "PowerKW": 0.3,
            "CurrentTypeID": 30,
            "Quantity": 3
        }
    ],
    "NumberOfPoints": 6,
    "GeneralComments": "Bike-energy LINE L3B - Anschluß für 3 E-Bikes & zusätzlich 3 Schukosteckdosen. Gesamtbelastbarkeit 3.7kW.",
    "StatusTypeID": 50,
    "DateLastStatusUpdate": "2016-11-23T08:37:00Z",
    "DataQualityLevel": 1,
    "DateCreated": "2016-11-23T08:37:00Z",
    "SubmissionStatusTypeID": 200
}