{
    "IsRecentlyVerified": false,
    "ID": 135984,
    "UUID": "FD9D5726-1609-411D-91DE-5BC9DAEF7608",
    "DataProviderID": 18,
    "DataProvidersReference": "81e50a7fa265a8449a3e26bacb9d1c88",
    "OperatorID": 2244,
    "UsageTypeID": 5,
    "AddressInfo": {
        "ID": 136330,
        "Title": "Mowll Street",
        "AddressLine1": "Mowll Street",
        "Town": "London",
        "Postcode": "SW9 0EP",
        "CountryID": 1,
        "Latitude": 51.477736,
        "Longitude": -0.114354,
        "AccessComments": "",
        "RelatedURL": "https://www.ubitricity.com",
        "DistanceUnit": 0
    },
    "Connections": [
        {
            "ID": 190411,
            "ConnectionTypeID": 25,
            "Reference": "suby1100001757",
            "StatusTypeID": 50,
            "LevelID": 2,
            "Amps": 16,
            "Voltage": 230,
            "PowerKW": 3.7,
            "CurrentTypeID": 10
        }
    ],
    "StatusTypeID": 0,
    "DateLastStatusUpdate": "2021-04-25T05:46:00Z",
    "MetadataValues": [
        {
            "ID": 5836,
            "MetadataFieldID": 4,
            "ItemValue": "Contains public sector information licensed under the Open Government Licence v2.0. http://www.nationalarchives.gov.uk/doc/open-government-licence/version/2/"
        }
    ],
    "DataQualityLevel": 3,
    "DateCreated": "2019-12-24T05:22:00Z",
    "SubmissionStatusTypeID": 100
}