{
    "IsRecentlyVerified": false,
    "ID": 174888,
    "UUID": "9FED94EC-5F8B-4D75-9A45-1E672C75E0F8",
    "DataProviderID": 1,
    "OperatorID": 3295,
    "OperatorsReference": "UKEV4669,UKEV4670",
    "UsageTypeID": 1,
    "UsageCost": "£0.25/kWh",
    "AddressInfo": {
        "ID": 175247,
        "Title": "The Warren",
        "AddressLine1": "Abersoch",
        "Town": "Pwllhelli",
        "StateOrProvince": "Gwynedd",
        "Postcode": "LL53 7AA",
        "CountryID": 1,
        "Latitude": 52.8414297,
        "Longitude": -4.4967969,
        "DistanceUnit": 0
    },
    "Connections": [
        {
            "ID": 270998,
            "ConnectionTypeID": 25,
            "StatusTypeID": 50,
            "LevelID": 2,
            "Amps": 32,
            "Voltage": 400,
            "PowerKW": 22,
            "CurrentTypeID": 20,
            "Quantity": 2
        }
    ],
    "NumberOfPoints": 2,
    "StatusTypeID": 50,
    "DateLastStatusUpdate": "2021-04-16T20:46:00Z",
    "DataQualityLevel": 1,
    "DateCreated": "2021-04-16T20:43:00Z",
    "SubmissionStatusTypeID": 200
}