{
    "IsRecentlyVerified": false,
    "ID": 36847,
    "UUID": "73C9F374-E7CB-460B-9E00-D5CF8FFDF180",
    "DataProviderID": 26,
    "DataProvidersReference": "31013",
    "OperatorsReference": "Polderman Lisse ",
    "UsageCost": "0.00 jaarabonnement",
    "AddressInfo": {
        "ID": 37193,
        "Title": "Heereweg",
        "AddressLine1": "Heereweg",
        "Town": "Lisse",
        "Postcode": "2161 AD",
        "CountryID": 159,
        "Latitude": 52.265701737655,
        "Longitude": 4.5584142208099,
        "RelatedURL": "http://www.polderman-lisse.nl",
        "DistanceUnit": 0
    },
    "Connections": [
        {
            "ID": 40358,
            "ConnectionTypeID": 25,
            "LevelID": 2,
            "PowerKW": 3.7,
            "CurrentTypeID": 10
        }
    ],
    "NumberOfPoints": 1,
    "StatusTypeID": 50,
    "DateLastStatusUpdate": "2016-06-04T02:52:00Z",
    "DataQualityLevel": 3,
    "DateCreated": "2015-01-09T06:07:00Z",
    "SubmissionStatusTypeID": 100
}