{
    "IsRecentlyVerified": false,
    "ID": 139326,
    "UUID": "71F60DAA-8064-4ED7-B0A8-90BCD29D3E2E",
    "DataProviderID": 2,
    "DataProvidersReference": "144120",
    "OperatorID": 59,
    "UsageTypeID": 1,
    "AddressInfo": {
        "ID": 139678,
        "Title": "Greenlots - 12308A",
        "AddressLine1": "817 N KING AVE",
        "Town": "Los Angeles",
        "StateOrProvince": "CA",
        "Postcode": "90744",
        "CountryID": 2,
        "Latitude": 33.7795104980469,
        "Longitude": -118.275573730469,
        "ContactTelephone1": "855-900-7584",
        "AccessComments": "24 hours daily",
        "RelatedURL": "http://greenlots.com/",
        "DistanceUnit": 0
    },
    "Connections": [
        {
            "ID": 194641,
            "ConnectionTypeID": 1,
            "LevelID": 2,
            "Amps": 16,
            "Voltage": 230,
            "PowerKW": 3.7,
            "CurrentTypeID": 10,
            "Quantity": 1
        }
    ],
    "StatusTypeID": 50,
    "DateLastStatusUpdate": "2020-06-26T02:56:00Z",
    "DataQualityLevel": 3,
    "DateCreated": "2019-12-24T09:10:00Z",
    "SubmissionStatusTypeID": 100
}