{
    "UserComments": [
        {
            "ID": 16045,
            "ChargePointID": 31469,
            "CommentTypeID": 10,
            "UserName": "polianto",
            "Rating": 2,
            "DateCreated": "2017-03-11T17:30:02.73Z",
            "User": {
                "ID": 1606,
                "Username": "polianto"
            },
            "CheckinStatusTypeID": 110
        }
    ],
    "MediaItems": [
        {
            "ID": 10629,
            "ChargePointID": 31469,
            "ItemURL": "https://s3-ap-southeast-2.amazonaws.com/openchargemap/images/IT/OCM31469/OCM-31469.orig.2017031117291833.jpg",
            "ItemThumbnailURL": "https://s3-ap-southeast-2.amazonaws.com/openchargemap/images/IT/OCM31469/OCM-31469.thmb.2017031117291833.jpg",
            "Comment": "",
            "IsEnabled": true,
            "IsVideo": false,
            "IsFeaturedItem": false,
            "IsExternalResource": false,
            "User": {
                "ID": 1606,
                "Username": "polianto"
            },
            "DateCreated": "2017-03-11T17:30:00Z"
        },
        {
            "ID": 10630,
            "ChargePointID": 31469,
            "ItemURL": "https://s3-ap-southeast-2.amazonaws.com/openchargemap/images/IT/OCM31469/OCM-31469.orig.2017031117293072.jpg",
            "ItemThumbnailURL": "https://s3-ap-southeast-2.amazonaws.com/openchargemap/images/IT/OCM31469/OCM-31469.thmb.2017031117293072.jpg",
            "Comment": "",
            "IsEnabled": true,
            "IsVideo": false,
            "IsFeaturedItem": false,
            "IsExternalResource": false,
            "User": {
                "ID": 1606,
                "Username": "polianto"
            },
            "DateCreated": "2017-03-11T17:30:00Z"
        },
        {
            "ID": 9030,
            "ChargePointID": 31469,
            "ItemURL": "https://s3-ap-southeast-2.amazonaws.com/openchargemap/images/IT/OCM31469/OCM-31469.orig.2017011411480154.jpeg",
            "ItemThumbnailURL": "https://s3-ap-southeast-2.amazonaws.com/openchargemap/images/IT/OCM31469/OCM-31469.thmb.2017011411480154.jpeg",
            "Comment": "",
            "IsEnabled": true,
            "IsVideo": false,
            "IsFeaturedItem": false,
            "IsExternalResource": false,
            "User": {
                "ID": 12207,
                "Username": "aldodal"
            },
            "DateCreated": "2017-01-14T11:48:00Z"
        }
    ],
    "IsRecentlyVerified": false,
    "ID": 31469,
    "UUID": "56005543-D713-4632-930B-E74C70E2F812",
    "DataProviderID": 1,
    "OperatorID": 73,
    "OperatorsReference": "EV-Box EVB-P1423201",
    "UsageTypeID": 4,
    "UsageCost": "gratis",
    "AddressInfo": {
        "ID": 31815,
        "Title": "METRO Milano Baranzate",
        "AddressLine1": "Via Milano, 308",
        "Town": "Baranzate",
        "Postcode": "20157",
        "CountryID": 112,
        "Latitude": 45.5201,
        "Longitude": 9.11725,
        "ContactTelephone1": "(+39) 02356781",
        "ContactEmail": "servizio.clienti@metro.it",
        "RelatedURL": "https://www.metro.it/punti-vendita/milano-baranzate",
        "DistanceUnit": 0
    },
    "Connections": [
        {
            "ID": 34980,
            "ConnectionTypeID": 25,
            "StatusTypeID": 50,
            "LevelID": 2,
            "Amps": 16,
            "Voltage": 400,
            "PowerKW": 11,
            "CurrentTypeID": 20,
            "Quantity": 6
        }
    ],
    "NumberOfPoints": 6,
    "StatusTypeID": 50,
    "DateLastStatusUpdate": "2020-03-19T16:07:00Z",
    "DataQualityLevel": 3,
    "DateCreated": "2015-01-09T06:03:00Z",
    "SubmissionStatusTypeID": 200
}