{
    "IsRecentlyVerified": false,
    "ID": 54890,
    "UUID": "1D648A18-9313-466D-879D-8C42BD1483DA",
    "DataProviderID": 1,
    "OperatorID": 23,
    "OperatorsReference": "9399",
    "UsageTypeID": 1,
    "UsageCost": "Free",
    "AddressInfo": {
        "ID": 55236,
        "Title": "Juniper Springs Resort - Tesla",
        "AddressLine1": "4000 Meridian Blvd",
        "Town": "Mammoth Lakes",
        "StateOrProvince": "CA",
        "Postcode": "93546",
        "CountryID": 2,
        "Latitude": 37.635516,
        "Longitude": -118.990168,
        "ContactTelephone1": "760-924-1102  877-798-3752",
        "AccessComments": "24 hours daily; for Tesla use only; for guest use only; see front desk for access",
        "RelatedURL": "http://www.teslamotors.com/supercharger",
        "DistanceUnit": 0
    },
    "Connections": [
        {
            "ID": 69369,
            "ConnectionTypeID": 30,
            "StatusTypeID": 50,
            "LevelID": 2,
            "Amps": 16,
            "Voltage": 230,
            "PowerKW": 16,
            "CurrentTypeID": 10,
            "Quantity": 4
        }
    ],
    "NumberOfPoints": 4,
    "StatusTypeID": 50,
    "DateLastStatusUpdate": "2017-01-31T21:45:00Z",
    "DataQualityLevel": 3,
    "DateCreated": "2015-10-09T07:24:00Z",
    "SubmissionStatusTypeID": 100
}