{
    "IsRecentlyVerified": false,
    "ID": 171973,
    "UUID": "95ACE874-E851-490D-A4E1-10A19486EDEB",
    "DataProviderID": 1,
    "OperatorID": 45,
    "UsageTypeID": 1,
    "UsageCost": "0.8RON/kWh",
    "AddressInfo": {
        "ID": 172332,
        "Title": "ETU Câmpina",
        "AddressLine1": "39C Bulevardul Nicolae Bălcescu",
        "Town": "Câmpina",
        "StateOrProvince": "Prahova",
        "Postcode": "105600",
        "CountryID": 184,
        "Latitude": 45.11325256688892,
        "Longitude": 25.745272736641482,
        "AccessComments": "Behind the gas station building. Station attendant starts the session.",
        "DistanceUnit": 0
    },
    "Connections": [
        {
            "ID": 262824,
            "ConnectionTypeID": 25,
            "StatusTypeID": 50,
            "LevelID": 2,
            "Amps": 32,
            "PowerKW": 22,
            "CurrentTypeID": 20,
            "Quantity": 1
        }
    ],
    "NumberOfPoints": 1,
    "StatusTypeID": 50,
    "DateLastStatusUpdate": "2021-01-11T09:36:00Z",
    "DataQualityLevel": 1,
    "DateCreated": "2021-01-10T08:04:00Z",
    "SubmissionStatusTypeID": 200
}