{
    "IsRecentlyVerified": false,
    "ID": 114447,
    "UUID": "E95CFA1F-F8D0-40C7-8E2C-AB8992D5220C",
    "DataProviderID": 1,
    "OperatorID": 156,
    "UsageTypeID": 4,
    "UsageCost": "AC:4,95€, DC: 8,95€",
    "AddressInfo": {
        "ID": 114793,
        "Title": "Schnellladesäule Holdenstedt",
        "AddressLine1": "Sportweg",
        "AddressLine2": "Ecke Holdenstedter Straße 64",
        "Town": "Uelzen",
        "StateOrProvince": "Uelzen",
        "Postcode": "29525",
        "CountryID": 87,
        "Latitude": 52.92679076804672,
        "Longitude": 10.527905127647372,
        "AccessComments": "24/7 nutzbar mit New Motion oder Ladenetz Ladekarten.",
        "RelatedURL": "https://www.stadtwerke-uelzen.de/E-Mobilitaet/",
        "DistanceUnit": 0
    },
    "Connections": [
        {
            "ID": 161099,
            "ConnectionTypeID": 2,
            "StatusTypeID": 50,
            "LevelID": 3,
            "PowerKW": 63,
            "CurrentTypeID": 30,
            "Quantity": 1
        },
        {
            "ID": 161100,
            "ConnectionTypeID": 33,
            "StatusTypeID": 50,
            "LevelID": 3,
            "PowerKW": 150,
            "CurrentTypeID": 30,
            "Quantity": 1
        },
        {
            "ID": 161101,
            "ConnectionTypeID": 1036,
            "StatusTypeID": 50,
            "LevelID": 3,
            "Amps": 63,
            "Voltage": 400,
            "PowerKW": 43,
            "CurrentTypeID": 20,
            "Quantity": 1
        },
        {
            "ID": 161102,
            "ConnectionTypeID": 25,
            "StatusTypeID": 50,
            "LevelID": 2,
            "Amps": 32,
            "Voltage": 400,
            "PowerKW": 22,
            "CurrentTypeID": 20,
            "Quantity": 1
        }
    ],
    "NumberOfPoints": 4,
    "StatusTypeID": 50,
    "DateLastStatusUpdate": "2019-01-08T06:41:00Z",
    "DataQualityLevel": 1,
    "DateCreated": "2019-01-08T06:41:00Z",
    "SubmissionStatusTypeID": 200
}