{
    "IsRecentlyVerified": false,
    "ID": 41691,
    "UUID": "103294D0-D793-4F74-81AB-95BBF8FD0454",
    "DataProviderID": 26,
    "DataProvidersReference": "48149",
    "OperatorID": 178,
    "OperatorsReference": "EVnetNL EV0030",
    "UsageCost": "0.00 jaarabonnement",
    "AddressInfo": {
        "ID": 42037,
        "Title": "Van der Madeweg 35",
        "AddressLine1": "Van der Madeweg 35",
        "Town": "Ouder-Amstel",
        "Postcode": "1114 AM",
        "CountryID": 159,
        "Latitude": 52.326197,
        "Longitude": 4.923581,
        "ContactTelephone1": "0800-3522365",
        "RelatedURL": "http://www.evnet.nl",
        "DistanceUnit": 0
    },
    "Connections": [
        {
            "ID": 45720,
            "ConnectionTypeID": 25,
            "LevelID": 2,
            "PowerKW": 11,
            "CurrentTypeID": 10
        }
    ],
    "NumberOfPoints": 1,
    "StatusTypeID": 50,
    "DateLastStatusUpdate": "2016-06-04T02:53:00Z",
    "DataQualityLevel": 3,
    "DateCreated": "2015-02-09T03:25:00Z",
    "SubmissionStatusTypeID": 100
}