{
    "IsRecentlyVerified": false,
    "ID": 160714,
    "UUID": "E7B03E90-0599-4F16-A370-2F0FC1B8F617",
    "DataProviderID": 2,
    "DataProvidersReference": "156704",
    "UsageTypeID": 2,
    "AddressInfo": {
        "ID": 161071,
        "Title": "Canadian Tire Corporation",
        "AddressLine1": "131 Provincial Trunk Hwy 12 N",
        "Town": "Steinbach",
        "StateOrProvince": "MB",
        "Postcode": "R5G 1T5",
        "CountryID": 44,
        "Latitude": 49.54288,
        "Longitude": -96.68586,
        "ContactTelephone1": "",
        "AccessComments": "",
        "RelatedURL": "",
        "DistanceUnit": 0
    },
    "Connections": [
        {
            "ID": 231269,
            "ConnectionTypeID": 2,
            "LevelID": 3,
            "Amps": 100,
            "Voltage": 400,
            "PowerKW": 40,
            "CurrentTypeID": 30,
            "Quantity": 1
        },
        {
            "ID": 231270,
            "ConnectionTypeID": 32,
            "LevelID": 3,
            "Amps": 100,
            "Voltage": 400,
            "PowerKW": 40,
            "CurrentTypeID": 30,
            "Quantity": 1
        }
    ],
    "GeneralComments": "Planned for future date. Not Operational.",
    "DatePlanned": "2020-09-01T00:00:00Z",
    "StatusTypeID": 150,
    "DateLastStatusUpdate": "2020-06-26T03:12:00Z",
    "DataQualityLevel": 3,
    "DateCreated": "2020-06-26T03:12:00Z",
    "SubmissionStatusTypeID": 100
}