{
    "IsRecentlyVerified": false,
    "ID": 129840,
    "UUID": "231BE982-956D-42F1-922B-5B23A773313A",
    "DataProviderID": 1,
    "OperatorID": 1,
    "UsageTypeID": 1,
    "UsageCost": "nothing",
    "AddressInfo": {
        "ID": 130186,
        "Title": "Charging station only",
        "AddressLine1": "Sedlice82",
        "Town": "Rozmital pod Tremsinem",
        "StateOrProvince": "Czech Republic",
        "Postcode": "26242",
        "CountryID": 64,
        "Latitude": 49.6275965376723,
        "Longitude": 13.8734945708356,
        "ContactTelephone1": "+420736666522",
        "ContactTelephone2": "+420603208447",
        "ContactEmail": "pepamatejka@gmail.com",
        "DistanceUnit": 0
    },
    "Connections": [
        {
            "ID": 181783,
            "ConnectionTypeID": 1036,
            "StatusTypeID": 50,
            "LevelID": 2,
            "Amps": 32,
            "Voltage": 440,
            "PowerKW": 22,
            "CurrentTypeID": 20,
            "Quantity": 1
        }
    ],
    "NumberOfPoints": 2,
    "GeneralComments": "Just ring a bell and have a coffee during charging. You are always welcome.",
    "StatusTypeID": 50,
    "DateLastStatusUpdate": "2019-07-30T10:32:00Z",
    "DataQualityLevel": 1,
    "DateCreated": "2019-07-28T15:31:00Z",
    "SubmissionStatusTypeID": 200
}