{
    "IsRecentlyVerified": false,
    "ID": 41815,
    "UUID": "C6DF26CF-2B07-4B75-88A3-795D4EA719A4",
    "DataProviderID": 1,
    "OperatorID": 45,
    "UsageTypeID": 1,
    "AddressInfo": {
        "ID": 42161,
        "Title": "McDonalds Restaurant",
        "AddressLine1": "Neckarauer Straße 58-60",
        "Town": "Mannheim",
        "StateOrProvince": "Mannheim",
        "Postcode": "68199",
        "CountryID": 87,
        "Latitude": 49.4610823488617,
        "Longitude": 8.49108344047544,
        "ContactTelephone1": "0621821020",
        "AccessComments": "Durchgehend geöffnet, Ladesäule auf Kundenparkplatz",
        "RelatedURL": "http://www.mcdonalds.de/restaurant?id=286",
        "DistanceUnit": 0
    },
    "Connections": [
        {
            "ID": 50086,
            "ConnectionTypeID": 25,
            "StatusTypeID": 50,
            "LevelID": 2,
            "Amps": 16,
            "Voltage": 400,
            "PowerKW": 11,
            "CurrentTypeID": 20,
            "Quantity": 1
        },
        {
            "ID": 50087,
            "ConnectionTypeID": 28,
            "StatusTypeID": 50,
            "LevelID": 2,
            "Amps": 16,
            "Voltage": 230,
            "PowerKW": 3.7,
            "CurrentTypeID": 10,
            "Quantity": 1
        }
    ],
    "NumberOfPoints": 2,
    "StatusTypeID": 50,
    "DateLastStatusUpdate": "2015-02-12T21:11:00Z",
    "DataQualityLevel": 1,
    "DateCreated": "2015-02-10T14:03:00Z",
    "SubmissionStatusTypeID": 200
}