{
    "IsRecentlyVerified": false,
    "ID": 187105,
    "UUID": "A36477EE-F347-4432-902F-F77DAE74A2F6",
    "DataProviderID": 29,
    "DataProvidersReference": "15711",
    "OperatorID": 3403,
    "AddressInfo": {
        "ID": 187464,
        "Title": "Marktplatz 1",
        "AddressLine1": "Marktplatz 1",
        "Town": "Scharnebek",
        "Postcode": "21379",
        "CountryID": 87,
        "Latitude": 53.29412,
        "Longitude": 10.50446,
        "DistanceUnit": 0
    },
    "Connections": [
        {
            "ID": 301225,
            "ConnectionTypeID": 25,
            "StatusTypeID": 50,
            "LevelID": 2,
            "PowerKW": 22,
            "CurrentTypeID": 20
        },
        {
            "ID": 301226,
            "ConnectionTypeID": 25,
            "StatusTypeID": 50,
            "LevelID": 2,
            "PowerKW": 22,
            "CurrentTypeID": 20
        }
    ],
    "StatusTypeID": 50,
    "DateLastStatusUpdate": "2021-07-12T02:51:00Z",
    "MetadataValues": [
        {
            "ID": 19345,
            "MetadataFieldID": 4,
            "ItemValue": "Data from the German chargepoint registry provided by Bundesnetzagentur.de under the CC-BY 4.0 license"
        }
    ],
    "DataQualityLevel": 3,
    "DateCreated": "2021-07-12T02:51:00Z",
    "SubmissionStatusTypeID": 100
}