{
    "IsRecentlyVerified": false,
    "ID": 152950,
    "UUID": "EE9DECC3-3F48-4001-BD46-6A726DCD7BE7",
    "DataProviderID": 28,
    "DataProvidersReference": "",
    "UsageTypeID": 5,
    "AddressInfo": {
        "ID": 153303,
        "Title": "CHÂTEAU RENAULT 1552 - Avenue du Maine",
        "AddressLine1": "Avenue du Maine - 37110 CHATEAU RENAULT",
        "CountryID": 80,
        "Latitude": 47.58978,
        "Longitude": 0.908191,
        "AccessComments": "24/24 7/7",
        "DistanceUnit": 0
    },
    "Connections": [
        {
            "ID": 214352,
            "ConnectionTypeID": 28,
            "StatusTypeID": 50,
            "LevelID": 2,
            "PowerKW": 18,
            "CurrentTypeID": 10
        },
        {
            "ID": 214353,
            "ConnectionTypeID": 25,
            "StatusTypeID": 50,
            "LevelID": 2,
            "PowerKW": 18,
            "CurrentTypeID": 10
        }
    ],
    "GeneralComments": "www.virtaev.fr",
    "StatusTypeID": 50,
    "DateLastStatusUpdate": "2020-03-15T10:54:00Z",
    "DataQualityLevel": 2,
    "DateCreated": "2020-03-15T10:54:00Z",
    "SubmissionStatusTypeID": 100
}