{
    "IsRecentlyVerified": false,
    "ID": 73798,
    "UUID": "A9CD8DBA-8988-4519-A865-C3FFC67596B2",
    "DataProviderID": 1,
    "OperatorID": 89,
    "OperatorsReference": "CEB-10014",
    "UsageTypeID": 4,
    "UsageCost": "CAD 1.00/hour",
    "AddressInfo": {
        "ID": 74144,
        "Title": "St-Hubert-Lajeunesse",
        "AddressLine1": "10520 rue Lajeunesse",
        "Town": "Montréal",
        "StateOrProvince": "QC",
        "Postcode": "H3L 2E6",
        "CountryID": 44,
        "Latitude": 45.5542526245117,
        "Longitude": -73.66552734375,
        "DistanceUnit": 0
    },
    "Connections": [
        {
            "ID": 106103,
            "ConnectionTypeID": 1,
            "StatusTypeID": 50,
            "LevelID": 2,
            "Amps": 32,
            "Voltage": 230,
            "PowerKW": 7,
            "CurrentTypeID": 10,
            "Quantity": 1
        }
    ],
    "NumberOfPoints": 1,
    "StatusTypeID": 50,
    "DateLastStatusUpdate": "2017-02-01T20:52:00Z",
    "DataQualityLevel": 1,
    "DateCreated": "2016-11-23T23:08:00Z",
    "SubmissionStatusTypeID": 200
}