{
    "IsRecentlyVerified": false,
    "ID": 20342,
    "UUID": "85BBC007-C329-4B4C-B646-79E1E19810E3",
    "DataProviderID": 1,
    "OperatorID": 1,
    "UsageTypeID": 0,
    "UsageCost": "",
    "AddressInfo": {
        "ID": 20687,
        "Title": " La Blaque",
        "AddressLine1": "Quartier Grande Blaque",
        "AddressLine2": "",
        "Town": "Varages",
        "StateOrProvince": "",
        "Postcode": "83670",
        "CountryID": 80,
        "Latitude": 43.59636,
        "Longitude": 5.96053,
        "ContactTelephone1": "+33 4 94 77 86 91",
        "ContactTelephone2": "",
        "ContactEmail": "",
        "AccessComments": "Ouvert à tous",
        "RelatedURL": "",
        "DistanceUnit": 0
    },
    "Connections": [],
    "GeneralComments": "",
    "StatusTypeID": 50,
    "DateLastStatusUpdate": "2013-11-12T11:27:00Z",
    "DataQualityLevel": 1,
    "DateCreated": "2013-11-12T09:43:00Z",
    "SubmissionStatusTypeID": 200
}