{
    "IsRecentlyVerified": false,
    "ID": 174701,
    "UUID": "97BC36B5-B7D0-4102-BC56-01F99D4805F4",
    "DataProviderID": 1,
    "OperatorID": 45,
    "UsageTypeID": 5,
    "AddressInfo": {
        "ID": 175060,
        "Title": "Sauber! Waschstraßen GmbH",
        "AddressLine1": "Haferwende 26",
        "AddressLine2": "Stadtteil Horn-Lehe",
        "Town": "Bremen",
        "StateOrProvince": "Free Hanseatic City of Bremen",
        "Postcode": "28357",
        "CountryID": 87,
        "Latitude": 53.10899226089887,
        "Longitude": 8.884881853979778,
        "ContactTelephone1": "+49 421 33 00 58 48",
        "RelatedURL": "http://sauber-carwash-bremen.de/",
        "DistanceUnit": 0
    },
    "Connections": [
        {
            "ID": 270705,
            "ConnectionTypeID": 1036,
            "StatusTypeID": 50,
            "LevelID": 2,
            "Amps": 32,
            "Voltage": 400,
            "PowerKW": 7.2,
            "CurrentTypeID": 10,
            "Quantity": 2
        }
    ],
    "NumberOfPoints": 2,
    "GeneralComments": "Die Ladesäulen befinden sich in der Saughalle.und werden per Münzeinwurf freigeschaltet. Laut Schild bekommt man die Münzen an der Kasse.\r\n\r\nZitat Sauber Waschstraße: „Wenn Sie Ihr Auto bei uns waschen, bekommen Sie an der Kasse eine kostenlose Wertmünze. Falls unsere Kassiererinnen ein Elektroauto nicht sofort erkennen, können Sie diese gerne darauf ansprechen.\r\nBei den Wallboxen sind zwei Münzautomaten installiert, einer für jede Wallbox. Mit der Wertmünze können Sie Ihr Fahrzeug 20 Minuten beim Saugen laden.“",
    "StatusTypeID": 50,
    "DateLastStatusUpdate": "2021-04-11T11:50:00Z",
    "DataQualityLevel": 1,
    "DateCreated": "2021-04-11T11:50:00Z",
    "SubmissionStatusTypeID": 200
}