{
    "UserComments": [
        {
            "ID": 19551,
            "ChargePointID": 67764,
            "CommentTypeID": 10,
            "UserName": "atari",
            "Comment": "Parkplatz durch Schränke gesichert —> Parkgebühren/ parking rates apply ",
            "Rating": 4,
            "DateCreated": "2018-05-14T11:33:02.45Z",
            "User": {
                "ID": 6422,
                "Username": "atari"
            },
            "CheckinStatusTypeID": 10
        }
    ],
    "MediaItems": [
        {
            "ID": 15477,
            "ChargePointID": 67764,
            "ItemURL": "https://s3-ap-southeast-2.amazonaws.com/openchargemap/images/DE/OCM67764/OCM-67764.orig.2018051508220708.jpeg",
            "ItemThumbnailURL": "https://s3-ap-southeast-2.amazonaws.com/openchargemap/images/DE/OCM67764/OCM-67764.thmb.2018051508220708.jpeg",
            "Comment": "",
            "IsEnabled": true,
            "IsVideo": false,
            "IsFeaturedItem": false,
            "IsExternalResource": false,
            "User": {
                "ID": 6422,
                "Username": "atari"
            },
            "DateCreated": "2018-05-15T08:22:00Z"
        },
        {
            "ID": 15472,
            "ChargePointID": 67764,
            "ItemURL": "https://s3-ap-southeast-2.amazonaws.com/openchargemap/images/DE/OCM67764/OCM-67764.orig.2018051411303382.jpeg",
            "ItemThumbnailURL": "https://s3-ap-southeast-2.amazonaws.com/openchargemap/images/DE/OCM67764/OCM-67764.thmb.2018051411303382.jpeg",
            "Comment": "",
            "IsEnabled": true,
            "IsVideo": false,
            "IsFeaturedItem": false,
            "IsExternalResource": false,
            "User": {
                "ID": 6422,
                "Username": "atari"
            },
            "DateCreated": "2018-05-14T11:31:00Z"
        }
    ],
    "IsRecentlyVerified": false,
    "ID": 67764,
    "UUID": "5FC2D2E3-7BBE-4C51-A524-ECE1DA998B06",
    "DataProviderID": 1,
    "OperatorID": 160,
    "UsageTypeID": 4,
    "AddressInfo": {
        "ID": 68110,
        "Title": "Parkplatz Skilift Altenberg",
        "AddressLine1": "Dresdner Straße 17",
        "Town": "Altenberg",
        "StateOrProvince": "Altenberg",
        "Postcode": "01773",
        "CountryID": 87,
        "Latitude": 50.7647806553614,
        "Longitude": 13.7552679504013,
        "AccessComments": "24/7 nutzbare Ladestation. CCS und Chademo mit festen Kabeln, ansonsten Dosen.",
        "RelatedURL": "http://www.enso.de/",
        "DistanceUnit": 0
    },
    "Connections": [
        {
            "ID": 94283,
            "ConnectionTypeID": 2,
            "StatusTypeID": 50,
            "LevelID": 3,
            "PowerKW": 20,
            "CurrentTypeID": 30,
            "Quantity": 1
        },
        {
            "ID": 94284,
            "ConnectionTypeID": 33,
            "StatusTypeID": 50,
            "LevelID": 3,
            "PowerKW": 20,
            "CurrentTypeID": 30,
            "Quantity": 1
        },
        {
            "ID": 94285,
            "ConnectionTypeID": 25,
            "StatusTypeID": 50,
            "LevelID": 2,
            "PowerKW": 32,
            "CurrentTypeID": 20,
            "Quantity": 1
        },
        {
            "ID": 94286,
            "ConnectionTypeID": 28,
            "StatusTypeID": 50,
            "LevelID": 2,
            "Amps": 16,
            "Voltage": 230,
            "PowerKW": 3.7,
            "CurrentTypeID": 10,
            "Quantity": 1
        }
    ],
    "NumberOfPoints": 2,
    "StatusTypeID": 50,
    "DateLastStatusUpdate": "2018-05-15T08:22:00Z",
    "DataQualityLevel": 1,
    "DateCreated": "2016-05-30T11:16:00Z",
    "SubmissionStatusTypeID": 200
}