{
    "IsRecentlyVerified": false,
    "ID": 97874,
    "UUID": "8ECA5E99-F819-49C9-BE57-3126971ABA70",
    "DataProviderID": 1,
    "OperatorID": 23,
    "OperatorsReference": "38600",
    "UsageTypeID": 4,
    "AddressInfo": {
        "ID": 98220,
        "Title": "Hotel Lucia Damüls",
        "AddressLine1": "Damüls 148",
        "Town": "Damüls",
        "Postcode": "6884",
        "CountryID": 19,
        "Latitude": 47.280335,
        "Longitude": 9.879452,
        "ContactTelephone1": "+43 5510 228",
        "DistanceUnit": 0
    },
    "Connections": [
        {
            "ID": 138782,
            "ConnectionTypeID": 30,
            "StatusTypeID": 50,
            "LevelID": 2,
            "Amps": 32,
            "Voltage": 400,
            "PowerKW": 22,
            "CurrentTypeID": 20,
            "Quantity": 2
        }
    ],
    "NumberOfPoints": 2,
    "GeneralComments": "2 Tesla Connectors, up to 22kW.Available for customers. Please see front desk.",
    "StatusTypeID": 50,
    "DateLastStatusUpdate": "2018-10-03T16:12:00Z",
    "DataQualityLevel": 1,
    "DateCreated": "2018-01-21T16:53:00Z",
    "SubmissionStatusTypeID": 200
}