{
    "IsRecentlyVerified": false,
    "ID": 19052,
    "UUID": "DBA3A59A-8035-42F6-93C7-3BB2019A17EB",
    "DataProviderID": 1,
    "OperatorID": 1,
    "UsageTypeID": 1,
    "UsageCost": "Free",
    "AddressInfo": {
        "ID": 19397,
        "Title": "ICT Automatisering Son",
        "AddressLine1": "Science Park Eindhoven 5006",
        "Town": "Son",
        "Postcode": " 5692 EA",
        "CountryID": 159,
        "Latitude": 51.4985747,
        "Longitude": 5.46054570000001,
        "ContactTelephone1": "31 (0)88 908 2000",
        "RelatedURL": "http://ict.eu/",
        "DistanceUnit": 0
    },
    "Connections": [
        {
            "ID": 19293,
            "ConnectionTypeID": 25,
            "StatusTypeID": 50,
            "LevelID": 2,
            "Amps": 16,
            "Voltage": 220,
            "PowerKW": 11,
            "CurrentTypeID": 20,
            "Quantity": 1
        }
    ],
    "NumberOfPoints": 1,
    "StatusTypeID": 50,
    "DateLastStatusUpdate": "2013-09-19T02:03:00Z",
    "DataQualityLevel": 1,
    "DateCreated": "2013-09-10T14:09:00Z",
    "SubmissionStatusTypeID": 200
}