{
    "IsRecentlyVerified": false,
    "ID": 63547,
    "UUID": "251D6829-DA50-40AC-8754-8C9E17F5EE6E",
    "DataProviderID": 26,
    "DataProvidersReference": "77147",
    "OperatorID": 179,
    "OperatorsReference": "Ecotap 1701142",
    "UsageCost": "0.00 afhankelijk van pas",
    "AddressInfo": {
        "ID": 63893,
        "Title": "Voorstraat 12",
        "AddressLine1": "Voorstraat 12",
        "Town": "Woudenberg",
        "Postcode": "3931 HD",
        "CountryID": 159,
        "Latitude": 52.082528,
        "Longitude": 5.41339,
        "RelatedURL": "http://www.ecotap.nl",
        "DistanceUnit": 0
    },
    "Connections": [
        {
            "ID": 81095,
            "ConnectionTypeID": 25,
            "LevelID": 2,
            "PowerKW": 11,
            "CurrentTypeID": 10
        }
    ],
    "NumberOfPoints": 2,
    "StatusTypeID": 50,
    "DateLastStatusUpdate": "2016-06-04T02:49:00Z",
    "DataQualityLevel": 3,
    "DateCreated": "2016-03-03T12:31:00Z",
    "SubmissionStatusTypeID": 100
}