{
    "IsRecentlyVerified": false,
    "ID": 81369,
    "UUID": "4D9DEBA2-5421-4215-9F61-DEE4B2F20034",
    "DataProviderID": 1,
    "OperatorID": 23,
    "OperatorsReference": "9373",
    "UsageTypeID": 4,
    "UsageCost": "Free",
    "AddressInfo": {
        "ID": 81715,
        "Title": "Hall Wines",
        "AddressLine1": "401 St Helena Hwy",
        "Town": "St Helena",
        "StateOrProvince": "CA",
        "Postcode": "94574",
        "CountryID": 2,
        "Latitude": 38.488989,
        "Longitude": -122.452143,
        "ContactTelephone1": "(707) 967-2626",
        "DistanceUnit": 0
    },
    "Connections": [
        {
            "ID": 116085,
            "ConnectionTypeID": 30,
            "StatusTypeID": 50,
            "LevelID": 2,
            "PowerKW": 16,
            "CurrentTypeID": 20,
            "Quantity": 2
        }
    ],
    "NumberOfPoints": 2,
    "GeneralComments": "2 Tesla Connectors, up to 16kW.Available to the public. Self park.",
    "StatusTypeID": 50,
    "DateLastStatusUpdate": "2017-02-01T09:39:00Z",
    "DataQualityLevel": 1,
    "DateCreated": "2017-02-01T09:39:00Z",
    "SubmissionStatusTypeID": 200
}