{
    "IsRecentlyVerified": false,
    "ID": 44882,
    "UUID": "0D4DBFD2-5F06-4A77-9552-462D920C4FF0",
    "DataProviderID": 1,
    "OperatorID": 184,
    "UsageTypeID": 4,
    "UsageCost": "0",
    "AddressInfo": {
        "ID": 45228,
        "Title": "Bahnhof Herdecke",
        "AddressLine1": "Bahnhofstraße 45",
        "Town": "Herdecke",
        "StateOrProvince": "Ennepe-Ruhr-Kreis",
        "Postcode": "58313",
        "CountryID": 87,
        "Latitude": 51.4045934518312,
        "Longitude": 7.43288694808051,
        "ContactTelephone1": "+49 2331 12322662",
        "AccessComments": "1 kostenpflichtiger Parkplatz Ladekarte von ElectroDrive/Mark-E (einmalig 19,99€) oder Roamingpartner PlugSurfing nötig.",
        "RelatedURL": "http://www.enervie-gruppe.de/",
        "DistanceUnit": 0
    },
    "Connections": [
        {
            "ID": 55190,
            "ConnectionTypeID": 25,
            "StatusTypeID": 50,
            "LevelID": 2,
            "Amps": 32,
            "Voltage": 400,
            "PowerKW": 22,
            "CurrentTypeID": 20,
            "Quantity": 2
        },
        {
            "ID": 55191,
            "ConnectionTypeID": 28,
            "StatusTypeID": 50,
            "LevelID": 2,
            "Amps": 16,
            "Voltage": 230,
            "PowerKW": 3.7,
            "CurrentTypeID": 10,
            "Quantity": 2
        }
    ],
    "NumberOfPoints": 1,
    "StatusTypeID": 50,
    "DateLastStatusUpdate": "2015-04-21T12:14:00Z",
    "DataQualityLevel": 1,
    "DateCreated": "2015-04-21T08:35:00Z",
    "SubmissionStatusTypeID": 200
}