{
    "IsRecentlyVerified": false,
    "ID": 29736,
    "UUID": "F1E2FEE0-B09D-4979-AC28-0A6D2E15D1DC",
    "DataProviderID": 15,
    "DataProvidersReference": "37352",
    "OperatorID": 5,
    "AddressInfo": {
        "ID": 30082,
        "Title": "College Rd",
        "AddressLine1": "College Rd",
        "Town": "San Bruno",
        "StateOrProvince": "California",
        "Postcode": "94066",
        "CountryID": 2,
        "Latitude": 37.6314033998172,
        "Longitude": -122.467531465081,
        "ContactTelephone1": "",
        "RelatedURL": "http://carstations.com/37352",
        "DistanceUnit": 0
    },
    "Connections": [
        {
            "ID": 32721,
            "ConnectionTypeID": 1,
            "Reference": "J1772",
            "LevelID": 2
        }
    ],
    "StatusTypeID": 0,
    "DateLastStatusUpdate": "2017-11-04T14:04:00Z",
    "DataQualityLevel": 2,
    "DateCreated": "2014-11-29T05:39:00Z",
    "SubmissionStatusTypeID": 100
}