{
    "IsRecentlyVerified": false,
    "ID": 179626,
    "UUID": "3FD7BC42-9DC2-447C-8911-361D8BBB25DB",
    "DataProviderID": 29,
    "DataProvidersReference": "18079",
    "AddressInfo": {
        "ID": 179985,
        "Title": "Anne-Frank-Straße 7",
        "AddressLine1": "Anne-Frank-Straße 7",
        "Town": "Schwarzheide",
        "Postcode": "01987",
        "CountryID": 87,
        "Latitude": 51.474618,
        "Longitude": 13.857247,
        "DistanceUnit": 0
    },
    "Connections": [
        {
            "ID": 281690,
            "ConnectionTypeID": 25,
            "StatusTypeID": 50,
            "LevelID": 2,
            "PowerKW": 22,
            "CurrentTypeID": 20
        },
        {
            "ID": 281691,
            "ConnectionTypeID": 25,
            "StatusTypeID": 50,
            "LevelID": 2,
            "PowerKW": 22,
            "CurrentTypeID": 20
        }
    ],
    "StatusTypeID": 50,
    "DateLastStatusUpdate": "2021-07-12T02:47:00Z",
    "MetadataValues": [
        {
            "ID": 11920,
            "MetadataFieldID": 4,
            "ItemValue": "Data from the German chargepoint registry provided by Bundesnetzagentur.de under the CC-BY 4.0 license"
        }
    ],
    "DataQualityLevel": 3,
    "DateCreated": "2021-07-08T09:59:00Z",
    "SubmissionStatusTypeID": 100
}