{
    "IsRecentlyVerified": false,
    "ID": 107235,
    "UUID": "B1D6FB4D-F80E-4578-A7B4-CA977EA63C67",
    "DataProviderID": 1,
    "OperatorID": 45,
    "UsageTypeID": 1,
    "AddressInfo": {
        "ID": 107581,
        "Title": "Stoppustuð Stykkishólmi",
        "AddressLine1": "Borgarbraut 4",
        "Town": "Stykkishólmi",
        "StateOrProvince": "Stykkishólmi",
        "Postcode": "340",
        "CountryID": 105,
        "Latitude": 65.073204,
        "Longitude": -22.729856,
        "DistanceUnit": 0
    },
    "Connections": [
        {
            "ID": 151246,
            "ConnectionTypeID": 25,
            "StatusTypeID": 50,
            "LevelID": 2,
            "Amps": 32,
            "Voltage": 400,
            "PowerKW": 22,
            "CurrentTypeID": 20,
            "Quantity": 1
        }
    ],
    "NumberOfPoints": 1,
    "StatusTypeID": 50,
    "DateLastStatusUpdate": "2018-07-23T10:00:00Z",
    "DataQualityLevel": 1,
    "DateCreated": "2018-07-23T10:00:00Z",
    "SubmissionStatusTypeID": 200
}