{
    "IsRecentlyVerified": false,
    "ID": 41247,
    "UUID": "EF204B16-8314-4A58-9308-D098B34D4EF4",
    "DataProviderID": 15,
    "DataProvidersReference": "15773",
    "OperatorID": 9,
    "UsageTypeID": 1,
    "AddressInfo": {
        "ID": 41593,
        "Title": "850 Tech Center Drive",
        "AddressLine1": "850 Tech Center Drive",
        "Town": "Gahanna",
        "StateOrProvince": "OH",
        "Postcode": "US",
        "CountryID": 2,
        "Latitude": 40.001008,
        "Longitude": -82.853227,
        "ContactTelephone1": "(800) 277-2177",
        "RelatedURL": "http://carstations.com/15773",
        "DistanceUnit": 0
    },
    "Connections": [
        {
            "ID": 45035,
            "ConnectionTypeID": 1,
            "Reference": "J1772",
            "LevelID": 2
        }
    ],
    "NumberOfPoints": 2,
    "StatusTypeID": 0,
    "DateLastStatusUpdate": "2017-11-04T14:04:00Z",
    "DataQualityLevel": 2,
    "DateCreated": "2015-01-28T11:44:00Z",
    "SubmissionStatusTypeID": 100
}