{
    "IsRecentlyVerified": false,
    "ID": 123364,
    "UUID": "0A00468A-41CA-4978-B83C-7904E82EB5FF",
    "DataProviderID": 2,
    "DataProvidersReference": "62226",
    "OperatorID": 5,
    "UsageTypeID": 1,
    "AddressInfo": {
        "ID": 123710,
        "Title": "EV CHARGER",
        "AddressLine1": "64-74 NV-592",
        "Town": "Las Vegas",
        "StateOrProvince": "NV",
        "Postcode": "89109",
        "CountryID": 2,
        "Latitude": 36.1153633,
        "Longitude": -115.1699724,
        "ContactTelephone1": "888-758-4389",
        "AccessComments": "24 hours daily",
        "RelatedURL": "http://www.chargepoint.com/",
        "DistanceUnit": 0
    },
    "Connections": [
        {
            "ID": 173332,
            "ConnectionTypeID": 1,
            "LevelID": 2,
            "Amps": 16,
            "Voltage": 230,
            "PowerKW": 3.7,
            "CurrentTypeID": 10,
            "Quantity": 2
        }
    ],
    "DateLastStatusUpdate": "2020-06-26T02:58:00Z",
    "DataQualityLevel": 3,
    "DateCreated": "2019-04-06T05:03:00Z",
    "SubmissionStatusTypeID": 100
}