{
    "IsRecentlyVerified": false,
    "ID": 67840,
    "UUID": "487958B0-434E-424B-ADE1-94441CDA8448",
    "DataProviderID": 1,
    "OperatorID": 3,
    "OperatorsReference": "PG-90441",
    "UsageTypeID": 6,
    "UsageCost": "Free",
    "AddressInfo": {
        "ID": 68186,
        "Title": "Trenchard House",
        "AddressLine1": "19-25 Broadwick Street",
        "AddressLine2": "Soho",
        "Town": "London",
        "Postcode": "W1F 0DF",
        "CountryID": 1,
        "Latitude": 51.513535,
        "Longitude": -0.135519,
        "DistanceUnit": 0
    },
    "Connections": [
        {
            "ID": 94400,
            "ConnectionTypeID": 25,
            "StatusTypeID": 50,
            "LevelID": 2,
            "Amps": 32,
            "Voltage": 230,
            "PowerKW": 7,
            "CurrentTypeID": 10,
            "Quantity": 1
        }
    ],
    "NumberOfPoints": 4,
    "StatusTypeID": 50,
    "DateLastStatusUpdate": "2017-12-20T11:51:00Z",
    "DataQualityLevel": 1,
    "DateCreated": "2016-06-03T13:14:00Z",
    "SubmissionStatusTypeID": 200
}