{
    "IsRecentlyVerified": false,
    "ID": 66018,
    "UUID": "BD259BA6-C319-4A89-B936-75558CAB3B25",
    "DataProviderID": 1,
    "OperatorID": 3315,
    "OperatorsReference": "51143",
    "UsageTypeID": 4,
    "UsageCost": "Free",
    "AddressInfo": {
        "ID": 66364,
        "Title": "Fionnphort Car Park (The Columba Centre)",
        "AddressLine1": "Monadh Mor",
        "Town": "Fionnphort",
        "StateOrProvince": "Argyll and Bute",
        "Postcode": "PA66 6BL",
        "CountryID": 1,
        "Latitude": 56.32416890747098,
        "Longitude": -6.364377291557844,
        "DistanceUnit": 0
    },
    "Connections": [
        {
            "ID": 91265,
            "ConnectionTypeID": 2,
            "StatusTypeID": 100,
            "LevelID": 3,
            "Amps": 125,
            "Voltage": 400,
            "PowerKW": 50,
            "CurrentTypeID": 30,
            "Quantity": 1
        },
        {
            "ID": 91266,
            "ConnectionTypeID": 1036,
            "StatusTypeID": 50,
            "LevelID": 3,
            "Amps": 63,
            "Voltage": 400,
            "PowerKW": 43,
            "CurrentTypeID": 20,
            "Quantity": 1
        },
        {
            "ID": 91267,
            "ConnectionTypeID": 33,
            "StatusTypeID": 50,
            "LevelID": 3,
            "Amps": 125,
            "Voltage": 400,
            "PowerKW": 50,
            "CurrentTypeID": 30,
            "Quantity": 1
        }
    ],
    "NumberOfPoints": 1,
    "GeneralComments": "APT Evolt rapid charger",
    "StatusTypeID": 0,
    "DateLastStatusUpdate": "2020-10-26T20:53:00Z",
    "DataQualityLevel": 1,
    "DateCreated": "2016-05-09T10:00:00Z",
    "SubmissionStatusTypeID": 200
}