{
    "IsRecentlyVerified": false,
    "ID": 180881,
    "UUID": "CB5B497E-1FBD-491A-B841-2F4595D59A54",
    "DataProviderID": 29,
    "DataProvidersReference": "15622",
    "OperatorID": 86,
    "AddressInfo": {
        "ID": 181240,
        "Title": "Emsstraße 2",
        "AddressLine1": "Emsstraße 2",
        "Town": "Friesoythe",
        "Postcode": "26169",
        "CountryID": 87,
        "Latitude": 53.016136,
        "Longitude": 7.853008,
        "DistanceUnit": 0
    },
    "Connections": [
        {
            "ID": 284523,
            "ConnectionTypeID": 1036,
            "StatusTypeID": 50,
            "LevelID": 3,
            "PowerKW": 43,
            "CurrentTypeID": 20
        },
        {
            "ID": 284524,
            "ConnectionTypeID": 33,
            "StatusTypeID": 50,
            "LevelID": 3,
            "PowerKW": 50,
            "CurrentTypeID": 30
        },
        {
            "ID": 301044,
            "ConnectionTypeID": 2,
            "StatusTypeID": 50,
            "LevelID": 3,
            "PowerKW": 50,
            "CurrentTypeID": 30
        }
    ],
    "StatusTypeID": 50,
    "DateLastStatusUpdate": "2021-07-12T02:50:00Z",
    "MetadataValues": [
        {
            "ID": 13175,
            "MetadataFieldID": 4,
            "ItemValue": "Data from the German chargepoint registry provided by Bundesnetzagentur.de under the CC-BY 4.0 license"
        }
    ],
    "DataQualityLevel": 3,
    "DateCreated": "2021-07-08T10:01:00Z",
    "SubmissionStatusTypeID": 100
}