{
    "UserComments": [
        {
            "ID": 17523,
            "ChargePointID": 85163,
            "CommentTypeID": 10,
            "UserName": "Raul Cruz",
            "Comment": "For tesla cars the 72A or 36MI/hr is fully equipped. Super good because from 0 to 300 Miles is approximate 8 hours. ",
            "Rating": 5,
            "DateCreated": "2017-07-28T17:04:16.647Z",
            "User": {
                "ID": 15933,
                "Username": "Raul Cruz"
            },
            "CheckinStatusTypeID": 10
        }
    ],
    "IsRecentlyVerified": false,
    "ID": 85163,
    "UUID": "3C1869A2-B2B9-4F15-97C2-51019407FBB3",
    "DataProviderID": 1,
    "OperatorID": 23,
    "OperatorsReference": "26025",
    "UsageTypeID": 6,
    "AddressInfo": {
        "ID": 85509,
        "Title": "Holiday Inn Express Naples South I-75",
        "AddressLine1": "3837 Tollgate BLVD",
        "Town": "Naples",
        "StateOrProvince": "Florida",
        "Postcode": "34114",
        "CountryID": 2,
        "Latitude": 26.15593,
        "Longitude": -81.685204,
        "ContactTelephone1": "(239) 348-1700",
        "DistanceUnit": 0
    },
    "Connections": [
        {
            "ID": 120925,
            "ConnectionTypeID": 30,
            "StatusTypeID": 50,
            "LevelID": 2,
            "PowerKW": 16,
            "CurrentTypeID": 20,
            "Quantity": 2
        }
    ],
    "NumberOfPoints": 2,
    "GeneralComments": "2 Tesla Connectors, up to 16kW.Available for patrons only. Please see front desk.",
    "StatusTypeID": 50,
    "DateLastStatusUpdate": "2017-07-28T17:04:00Z",
    "DataQualityLevel": 1,
    "DateCreated": "2017-03-27T05:25:00Z",
    "SubmissionStatusTypeID": 200
}