{
    "IsRecentlyVerified": false,
    "ID": 174997,
    "UUID": "0D29A786-EE96-4CD3-997B-ED77E5030E9F",
    "DataProviderID": 1,
    "OperatorID": 3,
    "OperatorsReference": "t54_it1_3820_066",
    "UsageTypeID": 5,
    "UsageCost": "£0.25/kWh",
    "AddressInfo": {
        "ID": 175356,
        "Title": "Lidl-Oadby",
        "AddressLine1": "36 Harborough Road",
        "Town": "Oadby",
        "Postcode": "LE2 4LA",
        "CountryID": 1,
        "Latitude": 52.59913,
        "Longitude": -1.079587,
        "DistanceUnit": 0
    },
    "Connections": [
        {
            "ID": 271195,
            "ConnectionTypeID": 33,
            "Reference": "t54_it1_3820_066",
            "StatusTypeID": 50,
            "LevelID": 3,
            "PowerKW": 50,
            "CurrentTypeID": 30,
            "Quantity": 1
        },
        {
            "ID": 271196,
            "ConnectionTypeID": 2,
            "Reference": "t54_it1_3820_066",
            "StatusTypeID": 50,
            "LevelID": 3,
            "PowerKW": 50,
            "CurrentTypeID": 30,
            "Quantity": 1
        },
        {
            "ID": 271197,
            "ConnectionTypeID": 25,
            "Reference": "t54_it1_3820_066",
            "StatusTypeID": 50,
            "LevelID": 2,
            "Amps": 32,
            "Voltage": 400,
            "PowerKW": 22,
            "CurrentTypeID": 20,
            "Quantity": 1
        }
    ],
    "NumberOfPoints": 1,
    "StatusTypeID": 50,
    "DateLastStatusUpdate": "2021-05-12T20:56:00Z",
    "DataQualityLevel": 1,
    "DateCreated": "2021-04-23T15:28:00Z",
    "SubmissionStatusTypeID": 200
}