{
    "IsRecentlyVerified": false,
    "ID": 31799,
    "UUID": "78A63A9D-A86F-42D9-978A-ED3EC2FDE2D0",
    "DataProviderID": 26,
    "DataProvidersReference": "30356",
    "OperatorID": 86,
    "OperatorsReference": "EnWB Parkplatz Freibad ",
    "UsageCost": "0.00 afhankelijk van pas",
    "AddressInfo": {
        "ID": 32145,
        "Title": "Rankestraße 54",
        "AddressLine1": "Rankestraße 54",
        "Town": "Stuttgart",
        "Postcode": "70619",
        "CountryID": 87,
        "Latitude": 48.749327,
        "Longitude": 9.215771,
        "ContactTelephone1": "0800 3629-000",
        "ContactEmail": "-",
        "RelatedURL": "http://www.enbw.com/",
        "DistanceUnit": 0
    },
    "Connections": [
        {
            "ID": 35310,
            "ConnectionTypeID": 25,
            "LevelID": 2,
            "PowerKW": 5,
            "CurrentTypeID": 10
        }
    ],
    "NumberOfPoints": 1,
    "StatusTypeID": 50,
    "DateLastStatusUpdate": "2015-01-09T06:03:00Z",
    "DataQualityLevel": 3,
    "DateCreated": "2015-01-09T06:03:00Z",
    "SubmissionStatusTypeID": 100
}