{
    "IsRecentlyVerified": false,
    "ID": 83928,
    "UUID": "2867EFF8-64B2-452C-AECD-167AED067BEE",
    "DataProviderID": 1,
    "DataProvidersReference": "3759",
    "AddressInfo": {
        "ID": 84274,
        "Title": "Circle K Skøyen",
        "AddressLine1": "Drammensveien 161B",
        "Town": "OSLO",
        "StateOrProvince": "Oslo",
        "Postcode": "0277",
        "CountryID": 168,
        "Latitude": 59.92205,
        "Longitude": 10.67504,
        "AccessComments": "",
        "DistanceUnit": 0
    },
    "Connections": [
        {
            "ID": 119170,
            "ConnectionTypeID": 0,
            "Reference": "1",
            "LevelID": 2,
            "Amps": 100,
            "Voltage": 500,
            "PowerKW": 50,
            "Comments": "Mode 4"
        },
        {
            "ID": 119171,
            "ConnectionTypeID": 0,
            "Reference": "2",
            "LevelID": 2,
            "Amps": 100,
            "Voltage": 500,
            "PowerKW": 50,
            "Comments": "Mode 4"
        },
        {
            "ID": 119172,
            "ConnectionTypeID": 0,
            "Reference": "3",
            "LevelID": 2,
            "Amps": 100,
            "Voltage": 500,
            "PowerKW": 50,
            "Comments": "Mode 4"
        },
        {
            "ID": 119173,
            "ConnectionTypeID": 0,
            "Reference": "4",
            "LevelID": 2,
            "Amps": 100,
            "Voltage": 500,
            "PowerKW": 50,
            "Comments": "Mode 4"
        }
    ],
    "NumberOfPoints": 4,
    "DateLastStatusUpdate": "2020-05-26T08:23:00Z",
    "DataQualityLevel": 2,
    "DateCreated": "2017-02-11T22:03:00Z",
    "SubmissionStatusTypeID": 100
}