{
    "IsRecentlyVerified": false,
    "ID": 138377,
    "UUID": "5C0D1274-D697-4CCD-879C-145F47E15642",
    "DataProviderID": 2,
    "DataProvidersReference": "64103",
    "OperatorID": 5,
    "UsageTypeID": 1,
    "AddressInfo": {
        "ID": 138726,
        "Title": "CPSE-SATX",
        "AddressLine1": "600 Soledad St",
        "Town": "San Antonio",
        "StateOrProvince": "TX",
        "Postcode": "78205",
        "CountryID": 2,
        "Latitude": 29.432028,
        "Longitude": -98.492506,
        "ContactTelephone1": "888-758-4389",
        "AccessComments": "24 hours daily",
        "RelatedURL": "http://www.chargepoint.com/",
        "DistanceUnit": 0
    },
    "Connections": [
        {
            "ID": 193486,
            "ConnectionTypeID": 1,
            "LevelID": 2,
            "Amps": 16,
            "Voltage": 230,
            "PowerKW": 3,
            "CurrentTypeID": 10,
            "Quantity": 2
        }
    ],
    "StatusTypeID": 50,
    "DateLastStatusUpdate": "2019-12-24T09:08:00Z",
    "DataQualityLevel": 3,
    "DateCreated": "2019-12-24T09:08:00Z",
    "SubmissionStatusTypeID": 100
}