{
    "IsRecentlyVerified": false,
    "ID": 52664,
    "UUID": "FA57871C-8E82-491A-A752-A6DD82BFDE92",
    "DataProviderID": 1,
    "OperatorID": 206,
    "UsageTypeID": 4,
    "UsageCost": "Free",
    "AddressInfo": {
        "ID": 53010,
        "Title": "B:SM 27 - Plaça Bonanova",
        "AddressLine1": "Plaça de la Bonanova, 12",
        "Town": "Barcelona",
        "StateOrProvince": "Barcelona",
        "Postcode": "08022",
        "CountryID": 210,
        "Latitude": 41.406731,
        "Longitude": 2.133691,
        "ContactTelephone1": "93.418.93.85",
        "AccessComments": "Aparcament públic - Targeta BCN Live / Public parking - BCN Live card",
        "RelatedURL": "http://www.aparcamentsbsm.cat/index.php/fichas-xarxa-03/pl-bonanova-2042-es.html",
        "DistanceUnit": 0
    },
    "Connections": [
        {
            "ID": 65439,
            "ConnectionTypeID": 25,
            "StatusTypeID": 50,
            "LevelID": 2,
            "Amps": 32,
            "Voltage": 230,
            "PowerKW": 7.2,
            "Quantity": 3
        },
        {
            "ID": 65440,
            "ConnectionTypeID": 28,
            "StatusTypeID": 50,
            "LevelID": 2,
            "Amps": 16,
            "Voltage": 230,
            "PowerKW": 3.6,
            "Quantity": 3
        }
    ],
    "NumberOfPoints": 3,
    "GeneralComments": "CIRCUTOR CCL-WB-SL-MIX\r\nThere is an extra bay for motorcycles",
    "StatusTypeID": 50,
    "DateLastStatusUpdate": "2015-09-06T18:48:00Z",
    "DataQualityLevel": 1,
    "DateCreated": "2015-09-06T17:31:00Z",
    "SubmissionStatusTypeID": 200
}