{
    "UserComments": [
        {
            "ID": 17893,
            "ChargePointID": 47937,
            "CommentTypeID": 10,
            "UserName": "Dox",
            "Comment": "Post still out of order. ",
            "DateCreated": "2017-11-04T17:33:53.707Z",
            "User": {
                "ID": 15731,
                "Username": "Dox"
            },
            "CheckinStatusTypeID": 20
        },
        {
            "ID": 17861,
            "ChargePointID": 47937,
            "CommentTypeID": 1000,
            "UserName": "Dox",
            "Comment": "Apology notice on post. Site operators aware. ",
            "DateCreated": "2017-10-26T10:47:20.267Z",
            "User": {
                "ID": 15731,
                "Username": "Dox"
            },
            "CheckinStatusTypeID": 25
        },
        {
            "ID": 9726,
            "ChargePointID": 47937,
            "CommentTypeID": 1000,
            "UserName": "Stuart Wallace",
            "Comment": "Issue with equipment",
            "Rating": 2,
            "DateCreated": "2016-02-15T15:32:56.377Z",
            "User": {
                "ID": 6807,
                "Username": "Stuart Wallace"
            },
            "CheckinStatusTypeID": 200
        },
        {
            "ID": 8109,
            "ChargePointID": 47937,
            "CommentTypeID": 50,
            "UserName": "kdog1997",
            "Comment": "If you arrive on a Sunday you have to wait till 11 to get a token",
            "Rating": 3,
            "DateCreated": "2015-11-29T13:45:52.867Z",
            "User": {
                "ID": 6641,
                "Username": "kdog1997"
            },
            "CheckinStatusTypeID": 10
        }
    ],
    "MediaItems": [
        {
            "ID": 3532,
            "ChargePointID": 47937,
            "ItemURL": "https://s3-ap-southeast-2.amazonaws.com/openchargemap/images/GB/OCM47937/OCM-47937.orig.2015112913445731.jpeg",
            "ItemThumbnailURL": "https://s3-ap-southeast-2.amazonaws.com/openchargemap/images/GB/OCM47937/OCM-47937.thmb.2015112913445731.jpeg",
            "Comment": "",
            "IsEnabled": true,
            "IsVideo": false,
            "IsFeaturedItem": false,
            "IsExternalResource": false,
            "User": {
                "ID": 6641,
                "Username": "kdog1997"
            },
            "DateCreated": "2015-11-29T13:45:00Z"
        }
    ],
    "IsRecentlyVerified": false,
    "ID": 47937,
    "UUID": "B63872E8-4DB3-48A6-8FCB-16B869A64A3C",
    "DataProviderID": 1,
    "OperatorID": 3,
    "UsageTypeID": 1,
    "UsageCost": "Pod Point.  Free to use : but you may need to confirm charge by App.",
    "AddressInfo": {
        "ID": 48283,
        "Title": "Junction 32 Retail Outlet - Orange Car Park",
        "AddressLine1": "Glasshoughton",
        "Town": "Castleford",
        "StateOrProvince": "West Yorkshire",
        "Postcode": "WF10 4FR",
        "CountryID": 1,
        "Latitude": 53.7110277174944,
        "Longitude": -1.3380794519964638,
        "ContactTelephone1": "",
        "AccessComments": "",
        "RelatedURL": "http://www.pod-point.com",
        "DistanceUnit": 0
    },
    "Connections": [
        {
            "ID": 59127,
            "ConnectionTypeID": 25,
            "StatusTypeID": 50,
            "LevelID": 2,
            "Amps": 32,
            "Voltage": 230,
            "PowerKW": 7,
            "CurrentTypeID": 10,
            "Quantity": 4
        }
    ],
    "NumberOfPoints": 1,
    "GeneralComments": "There are 2 car parks at the shopping outlet village. The Orange Car Park is located at the front of the outlet village opposite Next and has a height restriction barrier.",
    "StatusTypeID": 50,
    "DateLastStatusUpdate": "2021-04-23T04:17:00Z",
    "DataQualityLevel": 1,
    "DateCreated": "2015-06-17T08:37:00Z",
    "SubmissionStatusTypeID": 200
}