{
    "IsRecentlyVerified": false,
    "ID": 100189,
    "UUID": "2B7CDC36-412E-4D63-9AC6-F81BD90E47D2",
    "DataProviderID": 1,
    "OperatorID": 1240,
    "UsageTypeID": 5,
    "AddressInfo": {
        "ID": 100535,
        "Title": "Supermarkt Nah und Gut",
        "AddressLine1": "Staatsstraße 40",
        "Town": "Edesheim",
        "StateOrProvince": "Edenkoben",
        "Postcode": "67483",
        "CountryID": 87,
        "Latitude": 49.265269966319664,
        "Longitude": 8.134013975393714,
        "AccessComments": "24/7 nutzbare gut sichtbare grüne ABB Ladesäule an der Kreuzung Staatsstr. und In der Froschau.\r\nKostenlos bis 06/2018, danach Kosten 5€ für Laden CCS/Chademo und 3€ für Laden Typ2 pauschal",
        "RelatedURL": "https://emobilitaet.pfalzwerke.de/",
        "DistanceUnit": 0
    },
    "Connections": [
        {
            "ID": 141531,
            "ConnectionTypeID": 1036,
            "StatusTypeID": 50,
            "LevelID": 2,
            "Amps": 32,
            "Voltage": 400,
            "PowerKW": 22,
            "CurrentTypeID": 20,
            "Quantity": 1
        },
        {
            "ID": 141532,
            "ConnectionTypeID": 2,
            "StatusTypeID": 50,
            "LevelID": 3,
            "PowerKW": 50,
            "CurrentTypeID": 30,
            "Quantity": 1
        },
        {
            "ID": 141533,
            "ConnectionTypeID": 33,
            "StatusTypeID": 50,
            "LevelID": 3,
            "PowerKW": 50,
            "CurrentTypeID": 30,
            "Quantity": 1
        }
    ],
    "NumberOfPoints": 3,
    "StatusTypeID": 50,
    "DateLastStatusUpdate": "2018-02-16T11:01:00Z",
    "DataQualityLevel": 1,
    "DateCreated": "2018-02-16T11:01:00Z",
    "SubmissionStatusTypeID": 200
}