{
    "IsRecentlyVerified": false,
    "ID": 124499,
    "UUID": "DE8524B2-0D41-420A-86E5-97C3B31FD2CE",
    "DataProviderID": 2,
    "DataProvidersReference": "43201",
    "OperatorID": 5,
    "UsageTypeID": 1,
    "AddressInfo": {
        "ID": 124845,
        "Title": "EVSP WALGREENS",
        "AddressLine1": "4051 Douglas Blvd",
        "Town": "Granite Bay",
        "StateOrProvince": "CA",
        "Postcode": "95746",
        "CountryID": 2,
        "Latitude": 38.7440723,
        "Longitude": -121.2244833,
        "ContactTelephone1": "888-758-4389",
        "AccessComments": "24 hours daily",
        "RelatedURL": "http://www.chargepoint.com/",
        "DistanceUnit": 0
    },
    "Connections": [
        {
            "ID": 174606,
            "ConnectionTypeID": 1,
            "LevelID": 2,
            "Amps": 16,
            "Voltage": 230,
            "PowerKW": 3,
            "CurrentTypeID": 10,
            "Quantity": 2
        }
    ],
    "DateLastStatusUpdate": "2019-12-24T09:15:00Z",
    "DataQualityLevel": 3,
    "DateCreated": "2019-04-06T05:03:00Z",
    "SubmissionStatusTypeID": 100
}