{
    "IsRecentlyVerified": false,
    "ID": 18911,
    "UUID": "7A9C6291-01EB-4735-9253-244C3557DEFC",
    "DataProviderID": 15,
    "DataProvidersReference": "34564",
    "OperatorID": 1,
    "UsageTypeID": 1,
    "AddressInfo": {
        "ID": 19256,
        "Title": "36225 Main Road",
        "AddressLine1": "36225 Main Road",
        "Town": "Cutchogue",
        "StateOrProvince": "New York",
        "Postcode": "11935",
        "CountryID": 2,
        "Latitude": 41.02907,
        "Longitude": -72.46877,
        "ContactTelephone1": "5167705513",
        "RelatedURL": "http://carstations.com/34564",
        "DistanceUnit": 0
    },
    "Connections": [
        {
            "ID": 19165,
            "ConnectionTypeID": 1,
            "Reference": "J1772",
            "LevelID": 2
        },
        {
            "ID": 19197,
            "ConnectionTypeID": 9,
            "Reference": "NEMA5",
            "LevelID": 1,
            "Quantity": 1
        }
    ],
    "NumberOfPoints": 1,
    "StatusTypeID": 50,
    "DateLastStatusUpdate": "2017-11-04T14:04:00Z",
    "DataQualityLevel": 2,
    "DateCreated": "2013-08-29T03:34:00Z",
    "SubmissionStatusTypeID": 200
}