{
    "MediaItems": [
        {
            "ID": 23146,
            "ChargePointID": 161672,
            "ItemURL": "https://s3-ap-southeast-2.amazonaws.com/openchargemap/images/IT/OCM161672/OCM-161672.orig.2020072014244057.jpg",
            "ItemThumbnailURL": "https://s3-ap-southeast-2.amazonaws.com/openchargemap/images/IT/OCM161672/OCM-161672.thmb.2020072014244057.jpg",
            "Comment": "",
            "IsEnabled": true,
            "IsVideo": false,
            "IsFeaturedItem": false,
            "IsExternalResource": false,
            "User": {
                "ID": 19496,
                "Username": "ECOGY"
            },
            "DateCreated": "2020-07-20T14:25:00Z"
        },
        {
            "ID": 23147,
            "ChargePointID": 161672,
            "ItemURL": "https://s3-ap-southeast-2.amazonaws.com/openchargemap/images/IT/OCM161672/OCM-161672.orig.2020072014251362.jpg",
            "ItemThumbnailURL": "https://s3-ap-southeast-2.amazonaws.com/openchargemap/images/IT/OCM161672/OCM-161672.thmb.2020072014251362.jpg",
            "Comment": "",
            "IsEnabled": true,
            "IsVideo": false,
            "IsFeaturedItem": false,
            "IsExternalResource": false,
            "User": {
                "ID": 19496,
                "Username": "ECOGY"
            },
            "DateCreated": "2020-07-20T14:25:00Z"
        }
    ],
    "IsRecentlyVerified": false,
    "ID": 161672,
    "UUID": "75B26D58-5D87-4DD3-9494-5EA6E125DADC",
    "DataProviderID": 1,
    "OperatorID": 45,
    "UsageTypeID": 4,
    "UsageCost": "0,30 Euro/ kWh",
    "AddressInfo": {
        "ID": 162029,
        "Title": "Hotel Starkenberg ****",
        "AddressLine1": "Verdinserstraße 10",
        "Town": "Schenna ",
        "StateOrProvince": "Bozen",
        "Postcode": "39017",
        "CountryID": 112,
        "Latitude": 46.69096038627359,
        "Longitude": 11.188987600425776,
        "ContactTelephone1": "+39  0473 945 665",
        "ContactEmail": "info@hotel-starkenberg.com",
        "AccessComments": "Für Hotelkunden mittels RFID Karte\r\nEcogy 22 kW",
        "RelatedURL": "https://www.hotel-starkenberg.com/",
        "DistanceUnit": 0
    },
    "Connections": [
        {
            "ID": 232649,
            "ConnectionTypeID": 25,
            "StatusTypeID": 50,
            "LevelID": 2,
            "Amps": 32,
            "Voltage": 400,
            "PowerKW": 22,
            "CurrentTypeID": 20,
            "Quantity": 1
        }
    ],
    "NumberOfPoints": 1,
    "GeneralComments": "Die Ladestation befindet sich auf dem Kundenparkplatz",
    "StatusTypeID": 50,
    "DateLastStatusUpdate": "2020-07-20T14:25:00Z",
    "DataQualityLevel": 1,
    "DateCreated": "2020-07-20T14:24:00Z",
    "SubmissionStatusTypeID": 200
}