{
    "IsRecentlyVerified": false,
    "ID": 124605,
    "UUID": "1993B2A5-9539-4287-B377-8B3CFA403B01",
    "DataProviderID": 2,
    "DataProvidersReference": "53226",
    "UsageTypeID": 1,
    "AddressInfo": {
        "ID": 124951,
        "Title": "Academy Ford",
        "AddressLine1": "13401 Baltimore Ave",
        "Town": "Laurel",
        "StateOrProvince": "MD",
        "Postcode": "20707",
        "CountryID": 2,
        "Latitude": 39.07394,
        "Longitude": -76.869633,
        "ContactTelephone1": "",
        "AccessComments": "Service center use only",
        "RelatedURL": "",
        "DistanceUnit": 0
    },
    "Connections": [
        {
            "ID": 174727,
            "ConnectionTypeID": 1,
            "LevelID": 2,
            "Amps": 16,
            "Voltage": 230,
            "PowerKW": 3.7,
            "CurrentTypeID": 10,
            "Quantity": 2
        }
    ],
    "DateLastStatusUpdate": "2020-06-26T03:01:00Z",
    "DataQualityLevel": 3,
    "DateCreated": "2019-04-06T05:03:00Z",
    "SubmissionStatusTypeID": 100
}