{
    "IsRecentlyVerified": false,
    "ID": 160488,
    "UUID": "1C9EE293-91ED-45AF-9E7C-0638A3B371A3",
    "DataProviderID": 2,
    "DataProvidersReference": "155354",
    "OperatorID": 90,
    "UsageTypeID": 1,
    "AddressInfo": {
        "ID": 160845,
        "Title": "Mairie de Saint-Justin",
        "AddressLine1": "1281 route Gérin",
        "Town": "Saint-Justin",
        "StateOrProvince": "QC",
        "Postcode": "J0K 2V0",
        "CountryID": 44,
        "Latitude": 46.249526,
        "Longitude": -73.090009,
        "ContactTelephone1": "877-505-2674",
        "AccessComments": "24 hours daily",
        "RelatedURL": "https://lecircuitelectrique.com/",
        "DistanceUnit": 0
    },
    "Connections": [
        {
            "ID": 230914,
            "ConnectionTypeID": 1,
            "LevelID": 2,
            "Amps": 16,
            "Voltage": 230,
            "PowerKW": 3.7,
            "CurrentTypeID": 10,
            "Quantity": 1
        }
    ],
    "StatusTypeID": 50,
    "DateLastStatusUpdate": "2020-06-26T03:10:00Z",
    "DataQualityLevel": 3,
    "DateCreated": "2020-06-26T03:10:00Z",
    "SubmissionStatusTypeID": 100
}