{
    "IsRecentlyVerified": false,
    "ID": 179377,
    "UUID": "FF78321B-3DEE-45B2-B31D-1A4DD40E5651",
    "DataProviderID": 29,
    "DataProvidersReference": "8603",
    "AddressInfo": {
        "ID": 179736,
        "Title": "Kastellauner Str. 16",
        "AddressLine1": "Kastellauner Str. 16",
        "Town": "Mörsdorf",
        "Postcode": "56290",
        "CountryID": 87,
        "Latitude": 50.1033719559384,
        "Longitude": 7.34681660090637,
        "DistanceUnit": 0
    },
    "Connections": [
        {
            "ID": 281123,
            "ConnectionTypeID": 25,
            "StatusTypeID": 50,
            "LevelID": 2,
            "PowerKW": 22,
            "CurrentTypeID": 20
        },
        {
            "ID": 281124,
            "ConnectionTypeID": 25,
            "StatusTypeID": 50,
            "LevelID": 2,
            "PowerKW": 22,
            "CurrentTypeID": 20
        },
        {
            "ID": 297565,
            "ConnectionTypeID": 25,
            "StatusTypeID": 50,
            "LevelID": 2,
            "PowerKW": 22,
            "CurrentTypeID": 20
        },
        {
            "ID": 297566,
            "ConnectionTypeID": 25,
            "StatusTypeID": 50,
            "LevelID": 2,
            "PowerKW": 22,
            "CurrentTypeID": 20
        }
    ],
    "StatusTypeID": 50,
    "DateLastStatusUpdate": "2021-07-12T02:44:00Z",
    "MetadataValues": [
        {
            "ID": 11671,
            "MetadataFieldID": 4,
            "ItemValue": "Data from the German chargepoint registry provided by Bundesnetzagentur.de under the CC-BY 4.0 license"
        }
    ],
    "DataQualityLevel": 3,
    "DateCreated": "2021-07-08T09:59:00Z",
    "SubmissionStatusTypeID": 100
}