{
    "IsRecentlyVerified": false,
    "ID": 79020,
    "UUID": "804CCFA1-A7AB-4A38-8882-09A8A80C1DB7",
    "DataProviderID": 1,
    "OperatorID": 23,
    "OperatorsReference": "7863",
    "UsageTypeID": 4,
    "UsageCost": "$0.22/min >=60kW; $0.11/min <60kW; other tariffs for older cars",
    "AddressInfo": {
        "ID": 79366,
        "Title": "Santa Rosa Supercharger",
        "AddressLine1": "2516 Historic Route 66",
        "Town": "Santa Rosa",
        "StateOrProvince": "NM",
        "Postcode": "88435",
        "CountryID": 2,
        "Latitude": 34.947013,
        "Longitude": -104.647997,
        "DistanceUnit": 0
    },
    "Connections": [
        {
            "ID": 113639,
            "ConnectionTypeID": 27,
            "StatusTypeID": 50,
            "LevelID": 3,
            "PowerKW": 120,
            "CurrentTypeID": 30,
            "Quantity": 6
        }
    ],
    "NumberOfPoints": 6,
    "GeneralComments": "6 Superchargers, available 24/7",
    "StatusTypeID": 50,
    "DateLastStatusUpdate": "2018-03-13T13:39:00Z",
    "DataQualityLevel": 1,
    "DateCreated": "2017-01-26T19:05:00Z",
    "SubmissionStatusTypeID": 200
}