{
    "UserComments": [
        {
            "ID": 4801,
            "ChargePointID": 44500,
            "CommentTypeID": 10,
            "UserName": "David Pye",
            "Comment": "Used it this morning, no ICE cars in sight!",
            "Rating": 5,
            "DateCreated": "2015-06-29T09:23:50.323Z",
            "User": {
                "ID": 4956,
                "Username": "David Pye"
            },
            "CheckinStatusTypeID": 10
        }
    ],
    "IsRecentlyVerified": false,
    "ID": 44500,
    "UUID": "B8FD52C7-F51F-4366-9A41-ED6CE873D7FB",
    "DataProviderID": 1,
    "OperatorID": 20,
    "OperatorsReference": "70093",
    "UsageTypeID": 4,
    "UsageCost": "Free",
    "AddressInfo": {
        "ID": 44846,
        "Title": "Ponteland Leisure Centre",
        "AddressLine1": "Callerton Lane",
        "Town": "Ponteland",
        "Postcode": "NE20 9EG",
        "CountryID": 1,
        "Latitude": 55.048,
        "Longitude": -1.73977,
        "DistanceUnit": 0
    },
    "Connections": [
        {
            "ID": 54663,
            "ConnectionTypeID": 1036,
            "StatusTypeID": 100,
            "LevelID": 3,
            "Amps": 63,
            "Voltage": 400,
            "PowerKW": 43,
            "CurrentTypeID": 20,
            "Quantity": 1
        }
    ],
    "NumberOfPoints": 3,
    "GeneralComments": "CYC post T53-2214-003",
    "StatusTypeID": 100,
    "DateLastStatusUpdate": "2021-09-10T09:07:00Z",
    "DataQualityLevel": 1,
    "DateCreated": "2015-04-13T14:21:00Z",
    "SubmissionStatusTypeID": 200
}