{
    "IsRecentlyVerified": false,
    "ID": 77611,
    "UUID": "25C8074A-6AF4-4DFB-8FD5-CBE28AB13295",
    "DataProviderID": 1,
    "OperatorID": 160,
    "UsageTypeID": 4,
    "AddressInfo": {
        "ID": 77957,
        "Title": "Heizwerk Bohrhügel",
        "AddressLine1": "Fröhliche-Mann-Straße 2",
        "Town": "Suhl",
        "StateOrProvince": "Suhl",
        "Postcode": "98528",
        "CountryID": 87,
        "Latitude": 50.631900266365896,
        "Longitude": 10.697846269836422,
        "AccessComments": "24/7 nutzbar",
        "DistanceUnit": 0
    },
    "Connections": [
        {
            "ID": 112123,
            "ConnectionTypeID": 25,
            "StatusTypeID": 50,
            "LevelID": 2,
            "Amps": 32,
            "Voltage": 400,
            "PowerKW": 22,
            "CurrentTypeID": 20,
            "Quantity": 2
        },
        {
            "ID": 112124,
            "ConnectionTypeID": 28,
            "StatusTypeID": 50,
            "LevelID": 2,
            "Amps": 16,
            "Voltage": 230,
            "PowerKW": 3.7,
            "CurrentTypeID": 10,
            "Quantity": 2
        }
    ],
    "NumberOfPoints": 2,
    "StatusTypeID": 50,
    "DateLastStatusUpdate": "2017-01-20T07:22:00Z",
    "DataQualityLevel": 1,
    "DateCreated": "2017-01-20T07:22:00Z",
    "SubmissionStatusTypeID": 200
}