{
    "IsRecentlyVerified": false,
    "ID": 107627,
    "UUID": "5FE84552-39EF-4CFF-A837-F6829A619C3E",
    "DataProviderID": 1,
    "OperatorID": 45,
    "UsageTypeID": 1,
    "AddressInfo": {
        "ID": 107973,
        "Title": "Hirschmugl Schnelladestation Triple Charger 50kW",
        "AddressLine1": "Gewerbepark Nord 1",
        "Town": "Gralla",
        "StateOrProvince": "Steiermark",
        "Postcode": "8431",
        "CountryID": 19,
        "Latitude": 46.8042965809767,
        "Longitude": 15.5565145552948,
        "DistanceUnit": 0
    },
    "Connections": [
        {
            "ID": 151884,
            "ConnectionTypeID": 2,
            "LevelID": 3,
            "PowerKW": 50,
            "CurrentTypeID": 30,
            "Quantity": 1
        },
        {
            "ID": 151885,
            "ConnectionTypeID": 1036,
            "LevelID": 3,
            "Amps": 63,
            "Voltage": 400,
            "PowerKW": 43,
            "CurrentTypeID": 20,
            "Quantity": 1
        },
        {
            "ID": 151886,
            "ConnectionTypeID": 33,
            "LevelID": 3,
            "PowerKW": 50,
            "CurrentTypeID": 30,
            "Quantity": 1
        }
    ],
    "NumberOfPoints": 1,
    "GeneralComments": "50 Kw Schnellladestation bei der Firma Hirschmugl; CCS, Chademo, AC; befindet sich im Hubject Verbund",
    "StatusTypeID": 50,
    "DateLastStatusUpdate": "2018-08-09T13:11:00Z",
    "DataQualityLevel": 1,
    "DateCreated": "2018-08-03T09:24:00Z",
    "SubmissionStatusTypeID": 200
}