{
    "IsRecentlyVerified": false,
    "ID": 113743,
    "UUID": "A4C2A73A-7BD2-49D2-865C-11AB816A32AE",
    "DataProviderID": 1,
    "OperatorID": 23,
    "OperatorsReference": "47811",
    "UsageTypeID": 4,
    "AddressInfo": {
        "ID": 114089,
        "Title": "Hotel Heidelberg Astoria",
        "AddressLine1": "Rahmengasse 30",
        "Town": "Heidelberg",
        "Postcode": "69120",
        "CountryID": 87,
        "Latitude": 49.415556,
        "Longitude": 8.69081,
        "ContactTelephone1": " +49 6221 7290350",
        "DistanceUnit": 0
    },
    "Connections": [
        {
            "ID": 160313,
            "ConnectionTypeID": 30,
            "StatusTypeID": 50,
            "LevelID": 2,
            "Amps": 32,
            "Voltage": 400,
            "PowerKW": 22,
            "CurrentTypeID": 20,
            "Quantity": 1
        }
    ],
    "NumberOfPoints": 1,
    "GeneralComments": "1 Tesla Connector, up to 22kW.Available for customers. Please see front desk.",
    "StatusTypeID": 50,
    "DateLastStatusUpdate": "2019-01-02T21:28:00Z",
    "DataQualityLevel": 1,
    "DateCreated": "2019-01-02T21:28:00Z",
    "SubmissionStatusTypeID": 200
}