{
    "IsRecentlyVerified": false,
    "ID": 172000,
    "UUID": "F7343890-99B9-4EE8-B55A-656B98026877",
    "DataProviderID": 1,
    "OperatorID": 3341,
    "UsageTypeID": 5,
    "UsageCost": "£0.30/kWh",
    "AddressInfo": {
        "ID": 172359,
        "Title": "Harbour Long Stay Car Park",
        "AddressLine1": "4Wharf Road",
        "Town": "Penzance",
        "StateOrProvince": "England",
        "Postcode": "TR18 2GA",
        "CountryID": 1,
        "Latitude": 50.12040325640541,
        "Longitude": -5.532326025042721,
        "RelatedURL": "https://www.swarcoeconnect.org/",
        "DistanceUnit": 0
    },
    "Connections": [
        {
            "ID": 262877,
            "ConnectionTypeID": 2,
            "StatusTypeID": 50,
            "LevelID": 3,
            "PowerKW": 50,
            "CurrentTypeID": 30,
            "Quantity": 1
        },
        {
            "ID": 262878,
            "ConnectionTypeID": 33,
            "StatusTypeID": 50,
            "LevelID": 3,
            "PowerKW": 50,
            "CurrentTypeID": 30,
            "Quantity": 1
        },
        {
            "ID": 262879,
            "ConnectionTypeID": 1036,
            "StatusTypeID": 50,
            "LevelID": 2,
            "Amps": 63,
            "Voltage": 400,
            "PowerKW": 22,
            "CurrentTypeID": 20,
            "Quantity": 1
        }
    ],
    "NumberOfPoints": 1,
    "GeneralComments": "Installation funded by Highways England",
    "StatusTypeID": 50,
    "DateLastStatusUpdate": "2021-07-22T22:26:00Z",
    "DataQualityLevel": 1,
    "DateCreated": "2021-01-11T07:53:00Z",
    "SubmissionStatusTypeID": 200
}