{
    "IsRecentlyVerified": false,
    "ID": 110443,
    "UUID": "60C4AC40-706B-491D-87A0-3D62FA111E05",
    "DataProviderID": 2,
    "DataProvidersReference": "99951",
    "UsageTypeID": 1,
    "AddressInfo": {
        "ID": 110789,
        "Title": "Columbia Gateway - Medical Center",
        "AddressLine1": "7070 Samuel Morse Dr",
        "Town": "Columbia",
        "StateOrProvince": "MD",
        "Postcode": "21046",
        "CountryID": 2,
        "Latitude": 39.169397,
        "Longitude": -76.811526,
        "ContactTelephone1": "410-685-1109",
        "AccessComments": "24 hours daily",
        "RelatedURL": "",
        "DistanceUnit": 0
    },
    "Connections": [
        {
            "ID": 155696,
            "ConnectionTypeID": 1,
            "LevelID": 2,
            "Amps": 16,
            "Voltage": 230,
            "PowerKW": 3.7,
            "CurrentTypeID": 10,
            "Quantity": 4
        }
    ],
    "DateLastStatusUpdate": "2020-06-26T03:01:00Z",
    "DataQualityLevel": 3,
    "DateCreated": "2018-10-18T23:36:00Z",
    "SubmissionStatusTypeID": 100
}