{
    "IsRecentlyVerified": false,
    "ID": 141347,
    "UUID": "C5066B93-853F-4271-AE07-7D6669E5770A",
    "DataProviderID": 2,
    "DataProvidersReference": "100498",
    "OperatorID": 5,
    "UsageTypeID": 1,
    "AddressInfo": {
        "ID": 141699,
        "Title": "99M",
        "AddressLine1": "99 M St SE",
        "Town": "Washington",
        "StateOrProvince": "DC",
        "Postcode": "20003",
        "CountryID": 2,
        "Latitude": 38.876125,
        "Longitude": -77.0064257,
        "ContactTelephone1": "888-758-4389",
        "AccessComments": "24 hours daily",
        "RelatedURL": "http://www.chargepoint.com/",
        "DistanceUnit": 0
    },
    "Connections": [
        {
            "ID": 197264,
            "ConnectionTypeID": 1,
            "LevelID": 2,
            "Amps": 16,
            "Voltage": 230,
            "PowerKW": 3.7,
            "CurrentTypeID": 10,
            "Quantity": 2
        }
    ],
    "StatusTypeID": 50,
    "DateLastStatusUpdate": "2020-06-26T03:00:00Z",
    "DataQualityLevel": 3,
    "DateCreated": "2019-12-24T09:15:00Z",
    "SubmissionStatusTypeID": 100
}