{
    "IsRecentlyVerified": false,
    "ID": 18726,
    "UUID": "B8559AF3-9F44-458D-9234-306FCC369F49",
    "DataProviderID": 15,
    "DataProvidersReference": "30480",
    "OperatorID": 1,
    "UsageTypeID": 1,
    "AddressInfo": {
        "ID": 19071,
        "Title": "???????",
        "AddressLine1": "???????",
        "Town": "??",
        "StateOrProvince": "",
        "Postcode": "300457",
        "CountryID": 50,
        "Latitude": 39.119407,
        "Longitude": 117.760563,
        "ContactTelephone1": "",
        "RelatedURL": "http://carstations.com/30480",
        "DistanceUnit": 0
    },
    "Connections": [
        {
            "ID": 18959,
            "ConnectionTypeID": 1,
            "Reference": "J1772",
            "LevelID": 2,
            "Quantity": 1
        }
    ],
    "NumberOfPoints": 1,
    "StatusTypeID": 0,
    "DateLastStatusUpdate": "2014-03-22T04:39:00Z",
    "DataQualityLevel": 2,
    "DateCreated": "2013-08-25T03:30:00Z",
    "SubmissionStatusTypeID": 200
}