{
    "IsRecentlyVerified": false,
    "ID": 115661,
    "UUID": "DE012231-42D0-49E9-9F3E-8E97A9829DF6",
    "DataProviderID": 2,
    "DataProvidersReference": "112874",
    "OperatorID": 23,
    "UsageTypeID": 1,
    "AddressInfo": {
        "ID": 116007,
        "Title": "Virginia Creek Settlement - Tesla Destination",
        "AddressLine1": "70847 US-395",
        "Town": "Bridgeport",
        "StateOrProvince": "CA",
        "Postcode": "93517",
        "CountryID": 2,
        "Latitude": 38.187779,
        "Longitude": -119.206381,
        "ContactTelephone1": "760-932-7780  877-798-3752",
        "AccessComments": "24 hours daily; for Tesla use only",
        "RelatedURL": "https://www.tesla.com/destination-charging",
        "DistanceUnit": 0
    },
    "Connections": [
        {
            "ID": 162689,
            "ConnectionTypeID": 0,
            "LevelID": 2,
            "Amps": 16,
            "Voltage": 230,
            "PowerKW": 3,
            "CurrentTypeID": 10,
            "Quantity": 1
        }
    ],
    "DateLastStatusUpdate": "2019-04-06T04:02:00Z",
    "DataQualityLevel": 3,
    "DateCreated": "2019-02-11T07:13:00Z",
    "SubmissionStatusTypeID": 100
}