{
    "IsRecentlyVerified": false,
    "ID": 122213,
    "UUID": "CC82C307-749D-44A7-9075-FDE901F19AD6",
    "DataProviderID": 2,
    "DataProvidersReference": "53910",
    "UsageTypeID": 1,
    "AddressInfo": {
        "ID": 122559,
        "Title": "California State Polytechnic University - Parking Structure 2",
        "AddressLine1": "3801 W Temple Ave",
        "Town": "Pomona",
        "StateOrProvince": "CA",
        "Postcode": "91768",
        "CountryID": 2,
        "Latitude": 34.051634,
        "Longitude": -117.820001,
        "ContactTelephone1": "909-869-7659",
        "AccessComments": "24 hours daily; parking permit required for use",
        "RelatedURL": "",
        "DistanceUnit": 0
    },
    "Connections": [
        {
            "ID": 172084,
            "ConnectionTypeID": 1,
            "LevelID": 2,
            "Amps": 16,
            "Voltage": 230,
            "PowerKW": 3.7,
            "CurrentTypeID": 10,
            "Quantity": 24
        }
    ],
    "DateLastStatusUpdate": "2020-06-26T02:56:00Z",
    "DataQualityLevel": 3,
    "DateCreated": "2019-04-06T05:02:00Z",
    "SubmissionStatusTypeID": 100
}