{
    "MediaItems": [
        {
            "ID": 20092,
            "ChargePointID": 133668,
            "ItemURL": "https://s3-ap-southeast-2.amazonaws.com/openchargemap/images/DE/OCM133668/OCM-133668.orig.2019102307481841.jpeg",
            "ItemThumbnailURL": "https://s3-ap-southeast-2.amazonaws.com/openchargemap/images/DE/OCM133668/OCM-133668.thmb.2019102307481841.jpeg",
            "Comment": "",
            "IsEnabled": true,
            "IsVideo": false,
            "IsFeaturedItem": false,
            "IsExternalResource": false,
            "User": {
                "ID": 21695,
                "Username": "et42"
            },
            "DateCreated": "2019-10-23T07:49:00Z"
        }
    ],
    "IsRecentlyVerified": false,
    "ID": 133668,
    "UUID": "F3586125-806B-48E0-ACA4-581CE61406E0",
    "DataProviderID": 1,
    "OperatorID": 1,
    "UsageTypeID": 1,
    "UsageCost": "Free",
    "AddressInfo": {
        "ID": 134014,
        "Title": "Parkplatz Marktplatz/Hermannshof (D3)",
        "AddressLine1": "Rote Turmstraße 10",
        "Town": "Weinheim",
        "Postcode": "69469",
        "CountryID": 87,
        "Latitude": 49.5469152765597,
        "Longitude": 8.67018927881395,
        "ContactEmail": "emobil@sww.de",
        "RelatedURL": "http://www.sww.de/e-ladestationen",
        "DistanceUnit": 0
    },
    "Connections": [
        {
            "ID": 187081,
            "ConnectionTypeID": 25,
            "StatusTypeID": 50,
            "LevelID": 2,
            "PowerKW": 22,
            "CurrentTypeID": 20,
            "Quantity": 1
        }
    ],
    "NumberOfPoints": 1,
    "GeneralComments": "Ladung lässt sich nur über die POWERJames  eCharge-App freischalten:\r\nhttps://www.sww.de/downloads/service/Flyer_e_ladestation_20190708.pdf",
    "StatusTypeID": 50,
    "DateLastStatusUpdate": "2019-10-23T17:23:00Z",
    "DataQualityLevel": 1,
    "DateCreated": "2019-10-23T07:46:00Z",
    "SubmissionStatusTypeID": 200
}