{
    "IsRecentlyVerified": false,
    "ID": 137912,
    "UUID": "5A9910D0-6123-4CD1-8BAF-580D22BB2A60",
    "DataProviderID": 2,
    "DataProvidersReference": "72856",
    "OperatorID": 1242,
    "UsageTypeID": 1,
    "AddressInfo": {
        "ID": 138261,
        "Title": "GE WattStation 11",
        "AddressLine1": "13400  Sabre Springs Pkwy",
        "Town": "San Diego",
        "StateOrProvince": "CA",
        "Postcode": "92128",
        "CountryID": 2,
        "Latitude": 32.961506,
        "Longitude": -117.092757,
        "ContactTelephone1": "855-443-3873",
        "AccessComments": "24 hours daily",
        "RelatedURL": "https://www.gewattstation.com",
        "DistanceUnit": 0
    },
    "Connections": [
        {
            "ID": 192937,
            "ConnectionTypeID": 1,
            "LevelID": 2,
            "Amps": 16,
            "Voltage": 230,
            "PowerKW": 3,
            "CurrentTypeID": 10,
            "Quantity": 1
        }
    ],
    "StatusTypeID": 50,
    "DateLastStatusUpdate": "2019-12-24T09:06:00Z",
    "DataQualityLevel": 3,
    "DateCreated": "2019-12-24T09:06:00Z",
    "SubmissionStatusTypeID": 100
}