{
    "IsRecentlyVerified": false,
    "ID": 70605,
    "UUID": "F6279F64-1163-4DAC-8E06-70ADF9CD6DC8",
    "DataProviderID": 1,
    "OperatorID": 1,
    "UsageTypeID": 1,
    "AddressInfo": {
        "ID": 70951,
        "Title": "Rathaus",
        "AddressLine1": "Hochfellnstraße 14",
        "Town": "Bergen",
        "StateOrProvince": "Bergen (VGem)",
        "Postcode": "83346",
        "CountryID": 87,
        "Latitude": 47.8049854,
        "Longitude": 12.590334699999971,
        "ContactTelephone1": "+49 8662 419700",
        "AccessComments": "Kostenloses Laden ohne Ladekarte 24/7 möglich.",
        "RelatedURL": "http://landmobile.de/",
        "DistanceUnit": 0
    },
    "Connections": [
        {
            "ID": 101077,
            "ConnectionTypeID": 25,
            "StatusTypeID": 50,
            "LevelID": 2,
            "Amps": 32,
            "Voltage": 400,
            "PowerKW": 22,
            "CurrentTypeID": 20,
            "Quantity": 2
        },
        {
            "ID": 101078,
            "ConnectionTypeID": 28,
            "StatusTypeID": 50,
            "LevelID": 2,
            "Amps": 16,
            "Voltage": 230,
            "PowerKW": 3.7,
            "CurrentTypeID": 10,
            "Quantity": 2
        }
    ],
    "NumberOfPoints": 2,
    "StatusTypeID": 50,
    "DateLastStatusUpdate": "2016-07-28T06:31:00Z",
    "DataQualityLevel": 1,
    "DateCreated": "2016-07-28T06:31:00Z",
    "SubmissionStatusTypeID": 200
}