{
    "IsRecentlyVerified": false,
    "ID": 47180,
    "UUID": "92E24411-FC83-48E5-8441-163FAD8A5B9C",
    "DataProviderID": 1,
    "OperatorID": 45,
    "UsageTypeID": 1,
    "AddressInfo": {
        "ID": 47526,
        "Title": "Volkswagenzentrum Lübeck",
        "AddressLine1": "Berliner Straße 4",
        "Town": "Lübeck",
        "StateOrProvince": "Schleswig-Holstein",
        "Postcode": "23560",
        "CountryID": 87,
        "Latitude": 53.8498385738836,
        "Longitude": 10.6826547415866,
        "ContactTelephone1": "+49 451 88010",
        "AccessComments": "Kostenlos aufladen am VW / BMW / Porsche Autohaus. Wallbox mit Typ2 Kabel (VW e-Station)hinter dem Verkaufsraum rechts und links vom Rolltor. Daneben ist eine weiße ABB Ladesäule (Typ2 Dose, CCS) für mehr Ladeleistung. Durchgehend nutzbar.",
        "RelatedURL": "http://www.auto-senger.de/vw/ueber-uns/standorte/volkswagen-luebeck",
        "DistanceUnit": 0
    },
    "Connections": [
        {
            "ID": 58148,
            "ConnectionTypeID": 1036,
            "StatusTypeID": 50,
            "LevelID": 2,
            "Amps": 16,
            "Voltage": 230,
            "PowerKW": 3.7,
            "CurrentTypeID": 10,
            "Quantity": 2
        },
        {
            "ID": 65423,
            "ConnectionTypeID": 25,
            "StatusTypeID": 50,
            "LevelID": 2,
            "Amps": 32,
            "Voltage": 400,
            "PowerKW": 22,
            "CurrentTypeID": 20,
            "Quantity": 1
        },
        {
            "ID": 65424,
            "ConnectionTypeID": 33,
            "StatusTypeID": 50,
            "LevelID": 3,
            "PowerKW": 50,
            "CurrentTypeID": 30,
            "Quantity": 1
        }
    ],
    "NumberOfPoints": 2,
    "StatusTypeID": 50,
    "DateLastStatusUpdate": "2016-08-23T05:54:00Z",
    "DataQualityLevel": 1,
    "DateCreated": "2015-05-16T10:53:00Z",
    "SubmissionStatusTypeID": 200
}