{
    "IsRecentlyVerified": false,
    "ID": 84967,
    "UUID": "EDBEB2EB-7B09-4397-947F-08FFA5A66450",
    "DataProviderID": 1,
    "OperatorID": 125,
    "UsageTypeID": 4,
    "AddressInfo": {
        "ID": 85313,
        "Title": "Samtgemeinde",
        "AddressLine1": "Lange Straße 47-49",
        "Town": "Horneburg",
        "StateOrProvince": "Samtgemeinde Horneburg",
        "Postcode": "21640",
        "CountryID": 87,
        "Latitude": 53.509395897256205,
        "Longitude": 9.585127094494851,
        "AccessComments": "Anfahrt über Lange Straße (Einbahnstraße!), am rosa Gebäuse dem \"P\" Schild zum Behindertenparkplatz folgen. Auf dem Parkplatz der Gemeindeverwaltung ist die Säule hinter dem blauen Steckdosenschild \"BET Buxtehuder Elektrotechnik\".",
        "RelatedURL": "http://www.wbc-coesfeld.de/gfc-mbh/ladesaeulen-fuer-elektroautos.html",
        "DistanceUnit": 0
    },
    "Connections": [
        {
            "ID": 120711,
            "ConnectionTypeID": 25,
            "StatusTypeID": 50,
            "LevelID": 2,
            "Amps": 32,
            "Voltage": 400,
            "PowerKW": 22,
            "CurrentTypeID": 20,
            "Quantity": 2
        }
    ],
    "NumberOfPoints": 2,
    "StatusTypeID": 50,
    "DateLastStatusUpdate": "2017-03-22T07:18:00Z",
    "DataQualityLevel": 1,
    "DateCreated": "2017-03-22T07:18:00Z",
    "SubmissionStatusTypeID": 200
}