{
    "IsRecentlyVerified": false,
    "ID": 96178,
    "UUID": "38F9DAA4-69E0-43BA-8B47-06983E24CB62",
    "DataProviderID": 1,
    "OperatorID": 3315,
    "OperatorsReference": "52538",
    "UsageTypeID": 4,
    "UsageCost": "Free",
    "AddressInfo": {
        "ID": 96524,
        "Title": "Stewarton Road",
        "AddressLine1": "Newton Mearns",
        "Town": "Glasgow",
        "Postcode": "G77 6NR",
        "CountryID": 1,
        "Latitude": 55.79087,
        "Longitude": -4.33539,
        "DistanceUnit": 0
    },
    "Connections": [
        {
            "ID": 136270,
            "ConnectionTypeID": 25,
            "StatusTypeID": 50,
            "LevelID": 2,
            "Amps": 32,
            "Voltage": 400,
            "PowerKW": 11,
            "CurrentTypeID": 20,
            "Quantity": 2
        }
    ],
    "NumberOfPoints": 2,
    "StatusTypeID": 50,
    "DateLastStatusUpdate": "2020-01-09T16:27:00Z",
    "DataQualityLevel": 1,
    "DateCreated": "2017-12-14T06:15:00Z",
    "SubmissionStatusTypeID": 200
}