{
    "IsRecentlyVerified": false,
    "ID": 54829,
    "UUID": "D80C85AF-E5E5-4597-BB9B-78E03AAACCE2",
    "DataProviderID": 1,
    "OperatorID": 23,
    "OperatorsReference": "7897",
    "UsageTypeID": 6,
    "UsageCost": "Free",
    "AddressInfo": {
        "ID": 55175,
        "Title": "Park Hyatt Aviara - Tesla",
        "AddressLine1": "7100 Aviara Resort Dr",
        "Town": "Carlsbad",
        "StateOrProvince": "CA",
        "Postcode": "92056",
        "CountryID": 2,
        "Latitude": 33.1006044,
        "Longitude": -117.2856923,
        "ContactTelephone1": "760-448-1234  877-798-3752",
        "AccessComments": "24 hours daily; for Tesla use only; for guest use only; see valet for access",
        "RelatedURL": "http://www.teslamotors.com/supercharger",
        "DistanceUnit": 0
    },
    "Connections": [
        {
            "ID": 69303,
            "ConnectionTypeID": 30,
            "StatusTypeID": 50,
            "LevelID": 2,
            "Amps": 16,
            "Voltage": 230,
            "PowerKW": 16,
            "CurrentTypeID": 10,
            "Quantity": 6
        }
    ],
    "NumberOfPoints": 6,
    "StatusTypeID": 50,
    "DateLastStatusUpdate": "2017-07-22T05:39:00Z",
    "DataQualityLevel": 3,
    "DateCreated": "2015-10-09T07:24:00Z",
    "SubmissionStatusTypeID": 100
}