{
    "IsRecentlyVerified": false,
    "ID": 142556,
    "UUID": "55298D82-42D9-49F2-8341-D1A8F4C97502",
    "DataProviderID": 2,
    "DataProvidersReference": "143877",
    "OperatorID": 5,
    "UsageTypeID": 1,
    "AddressInfo": {
        "ID": 142908,
        "Title": "TOM",
        "AddressLine1": "175 myrtle blvd",
        "Town": "Larchmont",
        "StateOrProvince": "NY",
        "Postcode": "10538",
        "CountryID": 2,
        "Latitude": 40.9329172,
        "Longitude": -73.7613634,
        "ContactTelephone1": "888-758-4389",
        "AccessComments": "24 hours daily",
        "RelatedURL": "http://www.chargepoint.com/",
        "DistanceUnit": 0
    },
    "Connections": [
        {
            "ID": 198717,
            "ConnectionTypeID": 1,
            "LevelID": 2,
            "Amps": 16,
            "Voltage": 230,
            "PowerKW": 3.7,
            "CurrentTypeID": 10,
            "Quantity": 2
        }
    ],
    "StatusTypeID": 50,
    "DateLastStatusUpdate": "2020-06-26T03:03:00Z",
    "DataQualityLevel": 3,
    "DateCreated": "2019-12-24T09:18:00Z",
    "SubmissionStatusTypeID": 100
}