{
    "IsRecentlyVerified": false,
    "ID": 113599,
    "UUID": "3B3B7141-96DF-4BAE-A423-AF4328B48C40",
    "DataProviderID": 1,
    "OperatorID": 32,
    "OperatorsReference": "10323",
    "UsageTypeID": 4,
    "UsageCost": "£0.108/kWh; for Polar Plus subscription members only",
    "AddressInfo": {
        "ID": 113945,
        "Title": "Shenley Pavillions",
        "AddressLine1": "Shenley Pavillions",
        "Town": "MK Parks Trust",
        "StateOrProvince": "Milton Keynes",
        "Postcode": "MK5 6LB",
        "CountryID": 1,
        "Latitude": 52.015972,
        "Longitude": -0.794837,
        "DistanceUnit": 0
    },
    "Connections": [
        {
            "ID": 160091,
            "ConnectionTypeID": 25,
            "StatusTypeID": 50,
            "LevelID": 2,
            "Amps": 32,
            "Voltage": 230,
            "PowerKW": 7,
            "CurrentTypeID": 10,
            "Quantity": 2
        }
    ],
    "NumberOfPoints": 2,
    "GeneralComments": "Unit located in the main car park.",
    "StatusTypeID": 50,
    "DateLastStatusUpdate": "2019-03-05T06:32:00Z",
    "DataQualityLevel": 1,
    "DateCreated": "2018-12-22T06:14:00Z",
    "SubmissionStatusTypeID": 200
}