{
    "IsRecentlyVerified": false,
    "ID": 185623,
    "UUID": "9ED21B1A-49AC-4E6C-B5DA-C966AD2345DE",
    "DataProviderID": 29,
    "DataProvidersReference": "7413",
    "AddressInfo": {
        "ID": 185982,
        "Title": "Hauptstraße bei 68",
        "AddressLine1": "Hauptstraße bei 68",
        "Town": "Olching",
        "Postcode": "82140",
        "CountryID": 87,
        "Latitude": 48.2049619727735,
        "Longitude": 11.3244409606307,
        "DistanceUnit": 0
    },
    "Connections": [
        {
            "ID": 295645,
            "ConnectionTypeID": 25,
            "StatusTypeID": 50,
            "LevelID": 2,
            "PowerKW": 22,
            "CurrentTypeID": 20
        },
        {
            "ID": 295646,
            "ConnectionTypeID": 25,
            "StatusTypeID": 50,
            "LevelID": 2,
            "PowerKW": 22,
            "CurrentTypeID": 20
        }
    ],
    "StatusTypeID": 50,
    "DateLastStatusUpdate": "2021-07-12T02:40:00Z",
    "MetadataValues": [
        {
            "ID": 17867,
            "MetadataFieldID": 4,
            "ItemValue": "Data from the German chargepoint registry provided by Bundesnetzagentur.de under the CC-BY 4.0 license"
        }
    ],
    "DataQualityLevel": 3,
    "DateCreated": "2021-07-12T02:40:00Z",
    "SubmissionStatusTypeID": 100
}