{
    "IsRecentlyVerified": false,
    "ID": 93657,
    "UUID": "1689B71D-7A02-4AE4-B80A-3DD0457B698A",
    "DataProviderID": 1,
    "OperatorID": 3,
    "OperatorsReference": "PG-91484",
    "UsageTypeID": 6,
    "UsageCost": "Free",
    "AddressInfo": {
        "ID": 94003,
        "Title": "Hub Architects and Designers LTD",
        "AddressLine1": "Unit 15",
        "Town": "Hoopers Yard",
        "StateOrProvince": "London",
        "Postcode": "NW6 7EJ",
        "CountryID": 1,
        "Latitude": 51.541156,
        "Longitude": -0.206096,
        "DistanceUnit": 0
    },
    "Connections": [
        {
            "ID": 132615,
            "ConnectionTypeID": 25,
            "StatusTypeID": 50,
            "LevelID": 2,
            "Amps": 32,
            "Voltage": 400,
            "PowerKW": 22,
            "CurrentTypeID": 20,
            "Quantity": 1
        }
    ],
    "NumberOfPoints": 1,
    "GeneralComments": "This is an open charge unit installed at the Hub Architects and Designers Ltd site in Hoopers Yard, Kimberley Road, London",
    "StatusTypeID": 50,
    "DateLastStatusUpdate": "2017-10-05T05:18:00Z",
    "DataQualityLevel": 1,
    "DateCreated": "2017-10-05T05:18:00Z",
    "SubmissionStatusTypeID": 200
}