{
    "IsRecentlyVerified": false,
    "ID": 74199,
    "UUID": "E2AF1902-4856-4A8F-857C-D640264FE14F",
    "DataProviderID": 1,
    "OperatorID": 45,
    "UsageTypeID": 3,
    "AddressInfo": {
        "ID": 74545,
        "Title": "Stadtwerke Erding",
        "AddressLine1": "Am Gries",
        "Town": "Erding",
        "StateOrProvince": "Landkreis Erding",
        "Postcode": "85435",
        "CountryID": 87,
        "Latitude": 48.311054752084,
        "Longitude": 11.9088698373649,
        "AccessComments": "Ladesäule links vom Eingang. Ladekarte muss im Kundenzentrum (gleiche Adresse) zur Freischaltung ausgeliehen werden. ",
        "RelatedURL": "http://www.stadtwerke-erding.de/de/Strom/Strom-tanken/Kostenlose-Stromtankstellen-der-Stadtwerke-Erding.html",
        "DistanceUnit": 0
    },
    "Connections": [
        {
            "ID": 106552,
            "ConnectionTypeID": 25,
            "StatusTypeID": 50,
            "LevelID": 2,
            "Amps": 16,
            "Voltage": 400,
            "PowerKW": 11,
            "CurrentTypeID": 20,
            "Quantity": 2
        },
        {
            "ID": 106553,
            "ConnectionTypeID": 28,
            "StatusTypeID": 50,
            "LevelID": 2,
            "Amps": 16,
            "Voltage": 230,
            "PowerKW": 3.7,
            "CurrentTypeID": 10,
            "Quantity": 2
        }
    ],
    "NumberOfPoints": 2,
    "StatusTypeID": 50,
    "DateLastStatusUpdate": "2016-11-25T10:42:00Z",
    "DataQualityLevel": 1,
    "DateCreated": "2016-11-25T10:42:00Z",
    "SubmissionStatusTypeID": 200
}