{
    "IsRecentlyVerified": false,
    "ID": 66131,
    "UUID": "076EF429-82E3-4190-97EC-1A3FB5E12677",
    "DataProviderID": 1,
    "OperatorID": 1240,
    "UsageTypeID": 1,
    "AddressInfo": {
        "ID": 66477,
        "Title": "E-Bike Station Zur Dorfschänke",
        "AddressLine1": "Bahnhofstraße 28",
        "Town": "Lustadt",
        "StateOrProvince": "Lingenfeld",
        "Postcode": "67363",
        "CountryID": 87,
        "Latitude": 49.24314,
        "Longitude": 8.27818000000002,
        "RelatedURL": "https://www.pfalzwerke.de/energieberatung/9244.php",
        "DistanceUnit": 0
    },
    "Connections": [
        {
            "ID": 91422,
            "ConnectionTypeID": 28,
            "StatusTypeID": 50,
            "LevelID": 1,
            "Amps": 10,
            "Voltage": 230,
            "PowerKW": 2.3,
            "CurrentTypeID": 10,
            "Quantity": 4
        }
    ],
    "NumberOfPoints": 4,
    "StatusTypeID": 50,
    "DateLastStatusUpdate": "2016-05-12T06:25:00Z",
    "DataQualityLevel": 1,
    "DateCreated": "2016-05-12T06:25:00Z",
    "SubmissionStatusTypeID": 200
}