{
    "IsRecentlyVerified": false,
    "ID": 33748,
    "UUID": "C0F1ECDA-9969-4582-96C8-EC17C9F5D57E",
    "DataProviderID": 26,
    "DataProvidersReference": "47524",
    "OperatorID": 178,
    "OperatorsReference": "EVnetNL AL676",
    "UsageCost": "0.00 jaarabonnement",
    "AddressInfo": {
        "ID": 34094,
        "Title": "Galliërsweg 51",
        "AddressLine1": "Galliërsweg 51",
        "Town": "Oss",
        "Postcode": "5342 PN",
        "CountryID": 159,
        "Latitude": 51.757005,
        "Longitude": 5.560101,
        "ContactTelephone1": "0800-3522365",
        "RelatedURL": "http://www.evnet.nl",
        "DistanceUnit": 0
    },
    "Connections": [
        {
            "ID": 37259,
            "ConnectionTypeID": 25,
            "LevelID": 2,
            "PowerKW": 11,
            "CurrentTypeID": 10
        }
    ],
    "NumberOfPoints": 2,
    "StatusTypeID": 50,
    "DateLastStatusUpdate": "2016-06-04T02:40:00Z",
    "DataQualityLevel": 3,
    "DateCreated": "2015-01-09T06:04:00Z",
    "SubmissionStatusTypeID": 100
}