{
    "IsRecentlyVerified": false,
    "ID": 119795,
    "UUID": "FFA2C1EB-E49B-4CEE-B2BB-D2C608FCA0AA",
    "DataProviderID": 2,
    "DataProvidersReference": "113812",
    "OperatorID": 23,
    "UsageTypeID": 1,
    "AddressInfo": {
        "ID": 120141,
        "Title": "Brevard Medical City - Tesla Destination",
        "AddressLine1": "6619 N Wickham Rd",
        "Town": "Melbourne",
        "StateOrProvince": "FL",
        "Postcode": "32940",
        "CountryID": 2,
        "Latitude": 28.218611,
        "Longitude": -80.675377,
        "ContactTelephone1": "407-505-9884  877-798-3752",
        "AccessComments": "24 hours daily",
        "RelatedURL": "https://www.tesla.com/destination-charging",
        "DistanceUnit": 0
    },
    "Connections": [
        {
            "ID": 169084,
            "ConnectionTypeID": 30,
            "LevelID": 2,
            "Amps": 16,
            "Voltage": 230,
            "PowerKW": 3.7,
            "CurrentTypeID": 10,
            "Quantity": 9
        }
    ],
    "DateLastStatusUpdate": "2020-06-26T02:52:00Z",
    "DataQualityLevel": 3,
    "DateCreated": "2019-04-01T04:59:00Z",
    "SubmissionStatusTypeID": 100
}