{
    "IsRecentlyVerified": false,
    "ID": 77444,
    "UUID": "D15A963F-10F5-460C-8A2E-3333B1E3A173",
    "DataProviderID": 1,
    "OperatorID": 189,
    "UsageTypeID": 4,
    "AddressInfo": {
        "ID": 77790,
        "Title": "Bayernwerk Netzcenter",
        "AddressLine1": "Lise-Meitner-Straße 2",
        "Town": "Unterschleißheim",
        "StateOrProvince": "Landkreis München",
        "Postcode": "85716",
        "CountryID": 87,
        "Latitude": 48.28617999999999,
        "Longitude": 11.562670000000026,
        "DistanceUnit": 0
    },
    "Connections": [
        {
            "ID": 111589,
            "ConnectionTypeID": 25,
            "StatusTypeID": 50,
            "LevelID": 2,
            "Amps": 32,
            "Voltage": 400,
            "PowerKW": 22,
            "CurrentTypeID": 20,
            "Quantity": 2
        }
    ],
    "NumberOfPoints": 2,
    "GeneralComments": "24/7 verfügbar",
    "StatusTypeID": 50,
    "DateLastStatusUpdate": "2017-01-16T10:54:00Z",
    "DataQualityLevel": 1,
    "DateCreated": "2017-01-16T10:54:00Z",
    "SubmissionStatusTypeID": 200
}