{
    "IsRecentlyVerified": false,
    "ID": 122870,
    "UUID": "977B3E50-422E-4509-8E34-35031BEFD4BF",
    "DataProviderID": 2,
    "DataProvidersReference": "81004",
    "OperatorID": 5,
    "UsageTypeID": 1,
    "AddressInfo": {
        "ID": 123216,
        "Title": "CARTA",
        "AddressLine1": "27 Patten Pkwy",
        "Town": "Chattanooga",
        "StateOrProvince": "TN",
        "Postcode": "37402",
        "CountryID": 2,
        "Latitude": 35.0461267,
        "Longitude": -85.3069484,
        "ContactTelephone1": "888-758-4389",
        "AccessComments": "24 hours daily",
        "RelatedURL": "http://www.chargepoint.com/",
        "DistanceUnit": 0
    },
    "Connections": [
        {
            "ID": 172795,
            "ConnectionTypeID": 1,
            "LevelID": 2,
            "Amps": 16,
            "Voltage": 230,
            "PowerKW": 3.7,
            "CurrentTypeID": 10,
            "Quantity": 2
        }
    ],
    "DateLastStatusUpdate": "2020-06-26T02:57:00Z",
    "DataQualityLevel": 3,
    "DateCreated": "2019-04-06T05:03:00Z",
    "SubmissionStatusTypeID": 100
}