{
    "IsRecentlyVerified": false,
    "ID": 74317,
    "UUID": "B4B06C25-A575-4892-93DA-92CA5FBF2419",
    "DataProviderID": 1,
    "OperatorID": 45,
    "UsageTypeID": 6,
    "AddressInfo": {
        "ID": 74663,
        "Title": "Fideltronik",
        "AddressLine1": "Beniowskiego 1",
        "AddressLine2": "Podksięże",
        "Town": "Sucha Beskidzka",
        "StateOrProvince": "Sucha Beskidzka",
        "Postcode": "34-200",
        "CountryID": 179,
        "Latitude": 49.7437339,
        "Longitude": 19.596011900000008,
        "ContactTelephone1": "+48 33 8749800",
        "AccessComments": "Opening times:     Open 24/7 ",
        "DistanceUnit": 0
    },
    "Connections": [
        {
            "ID": 106871,
            "ConnectionTypeID": 25,
            "StatusTypeID": 50,
            "LevelID": 2,
            "Amps": 32,
            "Voltage": 400,
            "PowerKW": 22,
            "CurrentTypeID": 20,
            "Quantity": 1
        }
    ],
    "NumberOfPoints": 1,
    "StatusTypeID": 50,
    "DateLastStatusUpdate": "2016-12-01T07:17:00Z",
    "DataQualityLevel": 1,
    "DateCreated": "2016-12-01T07:17:00Z",
    "SubmissionStatusTypeID": 200
}