{
    "MediaItems": [
        {
            "ID": 18529,
            "ChargePointID": 127114,
            "ItemURL": "https://s3-ap-southeast-2.amazonaws.com/openchargemap/images/IT/OCM127114/OCM-127114.orig.2019052814013020.jpg",
            "ItemThumbnailURL": "https://s3-ap-southeast-2.amazonaws.com/openchargemap/images/IT/OCM127114/OCM-127114.thmb.2019052814013020.jpg",
            "Comment": "",
            "IsEnabled": true,
            "IsVideo": false,
            "IsFeaturedItem": false,
            "IsExternalResource": false,
            "User": {
                "ID": 19496,
                "Username": "ECOGY"
            },
            "DateCreated": "2019-05-28T14:02:00Z"
        },
        {
            "ID": 18528,
            "ChargePointID": 127114,
            "ItemURL": "https://s3-ap-southeast-2.amazonaws.com/openchargemap/images/IT/OCM127114/OCM-127114.orig.2019052814011081.jpg",
            "ItemThumbnailURL": "https://s3-ap-southeast-2.amazonaws.com/openchargemap/images/IT/OCM127114/OCM-127114.thmb.2019052814011081.jpg",
            "Comment": "",
            "IsEnabled": true,
            "IsVideo": false,
            "IsFeaturedItem": false,
            "IsExternalResource": false,
            "User": {
                "ID": 19496,
                "Username": "ECOGY"
            },
            "DateCreated": "2019-05-28T14:01:00Z"
        }
    ],
    "IsRecentlyVerified": false,
    "ID": 127114,
    "UUID": "D53A1FE6-8780-47FA-A86F-0EDE94F26B57",
    "DataProviderID": 1,
    "OperatorID": 45,
    "UsageTypeID": 4,
    "UsageCost": "0,30 Euro/ kWh",
    "AddressInfo": {
        "ID": 127460,
        "Title": "Hotel Salten ****",
        "AddressLine1": "Falzebnerstraße 79",
        "Town": "Hafling",
        "StateOrProvince": "Bolzano",
        "Postcode": "39010",
        "CountryID": 112,
        "Latitude": 46.6542258904537,
        "Longitude": 11.2214777194822,
        "ContactTelephone1": " +39 0473  279303",
        "ContactEmail": "info@ecogy.it",
        "AccessComments": "Für Hotelkunden mittels RFID Karte\r\necogy 11 kW",
        "RelatedURL": "https://www.salten.it/",
        "DistanceUnit": 0
    },
    "Connections": [
        {
            "ID": 177999,
            "ConnectionTypeID": 25,
            "StatusTypeID": 50,
            "LevelID": 2,
            "Amps": 16,
            "Voltage": 400,
            "PowerKW": 11,
            "CurrentTypeID": 20,
            "Quantity": 1
        }
    ],
    "NumberOfPoints": 1,
    "GeneralComments": "Die Ladestation befindet sich in der Tiefgarage",
    "StatusTypeID": 50,
    "DateLastStatusUpdate": "2019-05-28T14:13:00Z",
    "DataQualityLevel": 1,
    "DateCreated": "2019-05-28T14:00:00Z",
    "SubmissionStatusTypeID": 200
}