{
    "IsRecentlyVerified": false,
    "ID": 89739,
    "UUID": "03AECA66-9D36-4635-9123-8FAB566B976E",
    "DataProviderID": 2,
    "DataProvidersReference": "82078",
    "OperatorID": 5,
    "UsageTypeID": 1,
    "AddressInfo": {
        "ID": 90085,
        "Title": "833 E MICHIGAN",
        "AddressLine1": "833 E Michigan St",
        "Town": "Milwaukee",
        "StateOrProvince": "WI",
        "Postcode": "53202",
        "CountryID": 2,
        "Latitude": 43.0374968,
        "Longitude": -87.9010958,
        "ContactTelephone1": "888-758-4389",
        "AccessComments": "24 hours daily",
        "RelatedURL": "http://www.chargepoint.com/",
        "DistanceUnit": 0
    },
    "Connections": [
        {
            "ID": 127175,
            "ConnectionTypeID": 1,
            "LevelID": 2,
            "Amps": 16,
            "Voltage": 230,
            "PowerKW": 3.7,
            "CurrentTypeID": 10,
            "Quantity": 2
        }
    ],
    "DateLastStatusUpdate": "2020-06-26T03:06:00Z",
    "DataQualityLevel": 3,
    "DateCreated": "2017-06-22T08:16:00Z",
    "SubmissionStatusTypeID": 100
}