{
    "UserComments": [
        {
            "ID": 19970,
            "ChargePointID": 72884,
            "CommentTypeID": 10,
            "UserName": "Hypermile",
            "DateCreated": "2018-08-03T15:08:22.007Z",
            "User": {
                "ID": 11824,
                "Username": "Hypermile"
            },
            "CheckinStatusTypeID": 140
        }
    ],
    "MediaItems": [
        {
            "ID": 16138,
            "ChargePointID": 72884,
            "ItemURL": "https://s3-ap-southeast-2.amazonaws.com/openchargemap/images/US/OCM72884/OCM-72884.orig.2018080315122065.jpeg",
            "ItemThumbnailURL": "https://s3-ap-southeast-2.amazonaws.com/openchargemap/images/US/OCM72884/OCM-72884.thmb.2018080315122065.jpeg",
            "Comment": "",
            "IsEnabled": true,
            "IsVideo": false,
            "IsFeaturedItem": false,
            "IsExternalResource": false,
            "User": {
                "ID": 11824,
                "Username": "Hypermile"
            },
            "DateCreated": "2018-08-03T15:13:00Z"
        },
        {
            "ID": 16139,
            "ChargePointID": 72884,
            "ItemURL": "https://s3-ap-southeast-2.amazonaws.com/openchargemap/images/US/OCM72884/OCM-72884.orig.2018080315124632.jpeg",
            "ItemThumbnailURL": "https://s3-ap-southeast-2.amazonaws.com/openchargemap/images/US/OCM72884/OCM-72884.thmb.2018080315124632.jpeg",
            "Comment": "Only 3 of 8 stalls labeled \"Tesla Only\"",
            "IsEnabled": true,
            "IsVideo": false,
            "IsFeaturedItem": false,
            "IsExternalResource": false,
            "User": {
                "ID": 11824,
                "Username": "Hypermile"
            },
            "DateCreated": "2018-08-03T15:13:00Z"
        },
        {
            "ID": 16136,
            "ChargePointID": 72884,
            "ItemURL": "https://s3-ap-southeast-2.amazonaws.com/openchargemap/images/US/OCM72884/OCM-72884.orig.2018080315114895.jpeg",
            "ItemThumbnailURL": "https://s3-ap-southeast-2.amazonaws.com/openchargemap/images/US/OCM72884/OCM-72884.thmb.2018080315114895.jpeg",
            "Comment": "",
            "IsEnabled": true,
            "IsVideo": false,
            "IsFeaturedItem": false,
            "IsExternalResource": false,
            "User": {
                "ID": 11824,
                "Username": "Hypermile"
            },
            "DateCreated": "2018-08-03T15:12:00Z"
        },
        {
            "ID": 16137,
            "ChargePointID": 72884,
            "ItemURL": "https://s3-ap-southeast-2.amazonaws.com/openchargemap/images/US/OCM72884/OCM-72884.orig.2018080315120709.jpeg",
            "ItemThumbnailURL": "https://s3-ap-southeast-2.amazonaws.com/openchargemap/images/US/OCM72884/OCM-72884.thmb.2018080315120709.jpeg",
            "Comment": "",
            "IsEnabled": true,
            "IsVideo": false,
            "IsFeaturedItem": false,
            "IsExternalResource": false,
            "User": {
                "ID": 11824,
                "Username": "Hypermile"
            },
            "DateCreated": "2018-08-03T15:12:00Z"
        },
        {
            "ID": 16135,
            "ChargePointID": 72884,
            "ItemURL": "https://s3-ap-southeast-2.amazonaws.com/openchargemap/images/US/OCM72884/OCM-72884.orig.2018080315090139.jpg",
            "ItemThumbnailURL": "https://s3-ap-southeast-2.amazonaws.com/openchargemap/images/US/OCM72884/OCM-72884.thmb.2018080315090139.jpg",
            "Comment": "",
            "IsEnabled": true,
            "IsVideo": false,
            "IsFeaturedItem": false,
            "IsExternalResource": false,
            "User": {
                "ID": 11824,
                "Username": "Hypermile"
            },
            "DateCreated": "2018-08-03T15:09:00Z"
        }
    ],
    "IsRecentlyVerified": false,
    "ID": 72884,
    "UUID": "740954A1-7DD7-455B-9450-6F73B54C7874",
    "DataProviderID": 1,
    "OperatorID": 23,
    "OperatorsReference": "20870",
    "UsageTypeID": 1,
    "UsageCost": "$0.20/min >=60kW; $0.10/min <60kW; other tariffs for older cars",
    "AddressInfo": {
        "ID": 73230,
        "Title": "Bonita Lakes Mall - Tesla",
        "AddressLine1": "1210 Bonita Lakes Dr",
        "Town": "Meridian",
        "StateOrProvince": "MS",
        "Postcode": "39301",
        "CountryID": 2,
        "Latitude": 32.35763581624357,
        "Longitude": -88.6710982696249,
        "ContactTelephone1": "877-798-3759",
        "AccessComments": "24 hours daily; for Tesla use only",
        "RelatedURL": "http://www.teslamotors.com/supercharger",
        "DistanceUnit": 0
    },
    "Connections": [
        {
            "ID": 104549,
            "ConnectionTypeID": 27,
            "StatusTypeID": 50,
            "LevelID": 3,
            "Amps": 100,
            "Voltage": 400,
            "PowerKW": 120,
            "CurrentTypeID": 30,
            "Quantity": 8
        }
    ],
    "NumberOfPoints": 8,
    "GeneralComments": "Only three signs in front of stalls that say \"Tesla Only\".  The remainder are either unmarked, or allow for general (ICE) parking).  Two signposts are present that entirely lack any sign.",
    "StatusTypeID": 50,
    "DateLastStatusUpdate": "2018-08-03T19:57:00Z",
    "DataQualityLevel": 3,
    "DateCreated": "2016-11-01T13:06:00Z",
    "SubmissionStatusTypeID": 100
}