{
    "IsRecentlyVerified": false,
    "ID": 36531,
    "UUID": "A88AFB9B-2849-4764-8BEE-1657FB263882",
    "DataProviderID": 26,
    "DataProvidersReference": "23016",
    "OperatorID": 157,
    "OperatorsReference": "NewMotion 02002148",
    "UsageCost": "0.00 jaarabonnement",
    "AddressInfo": {
        "ID": 36877,
        "Title": "Krabbenkreek 43",
        "AddressLine1": "Krabbenkreek 43",
        "Town": "Amersfoort",
        "Postcode": "3823 JD",
        "CountryID": 159,
        "Latitude": 52.1919670104981,
        "Longitude": 5.39775133132935,
        "ContactTelephone1": "088 0109500",
        "RelatedURL": "http://thenewmotion.nl/",
        "DistanceUnit": 0
    },
    "Connections": [
        {
            "ID": 40042,
            "ConnectionTypeID": 25,
            "LevelID": 2,
            "PowerKW": 3.7,
            "CurrentTypeID": 10
        }
    ],
    "NumberOfPoints": 1,
    "StatusTypeID": 50,
    "DateLastStatusUpdate": "2016-06-04T02:51:00Z",
    "DataQualityLevel": 3,
    "DateCreated": "2015-01-09T06:05:00Z",
    "SubmissionStatusTypeID": 100
}