{
    "IsRecentlyVerified": false,
    "ID": 99308,
    "UUID": "B07E970B-C28A-46CE-9DBC-A56F3A026CE3",
    "DataProviderID": 1,
    "OperatorID": 3279,
    "OperatorsReference": "0254",
    "UsageTypeID": 4,
    "UsageCost": "€0/kWh",
    "AddressInfo": {
        "ID": 99654,
        "Title": "Ayuntamiento la Pobla de Vallbona",
        "AddressLine1": "Ayuntamiento la Pobla de Vallbona",
        "Town": "a Pobla de Vallbona",
        "Postcode": "46185",
        "CountryID": 210,
        "Latitude": 39.590623,
        "Longitude": -0.550021,
        "DistanceUnit": 0
    },
    "Connections": [
        {
            "ID": 140316,
            "ConnectionTypeID": 25,
            "StatusTypeID": 50,
            "LevelID": 2,
            "Amps": 32,
            "Voltage": 400,
            "PowerKW": 22,
            "CurrentTypeID": 20,
            "Quantity": 1
        }
    ],
    "NumberOfPoints": 1,
    "GeneralComments": "Uso privado para usuarios del Ayuntamiento de La Pobla De Vallbona.",
    "StatusTypeID": 50,
    "DateLastStatusUpdate": "2019-12-18T20:12:00Z",
    "DataQualityLevel": 1,
    "DateCreated": "2018-01-25T18:56:00Z",
    "SubmissionStatusTypeID": 200
}