{
    "IsRecentlyVerified": false,
    "ID": 156533,
    "UUID": "5F026A57-AAEA-472A-BB1B-3216C8C5EBD4",
    "DataProviderID": 19,
    "DataProvidersReference": "5844",
    "AddressInfo": {
        "ID": 156887,
        "Title": "Storgatan 4",
        "AddressLine1": "Storgatan 4",
        "Town": "HELSINGBORG",
        "StateOrProvince": "SKÅNE",
        "Postcode": "25002",
        "CountryID": 216,
        "Latitude": 56.00245,
        "Longitude": 12.96593,
        "AccessComments": "Du hittar laddstationen på parkeringen framför ingången till Ekeby Möbler.",
        "DistanceUnit": 0
    },
    "Connections": [
        {
            "ID": 220476,
            "ConnectionTypeID": 25,
            "Reference": "1",
            "LevelID": 3,
            "Amps": 32,
            "Voltage": 400,
            "PowerKW": 22,
            "CurrentTypeID": 30
        },
        {
            "ID": 220477,
            "ConnectionTypeID": 25,
            "Reference": "2",
            "LevelID": 3,
            "Amps": 32,
            "Voltage": 400,
            "PowerKW": 22,
            "CurrentTypeID": 30
        }
    ],
    "NumberOfPoints": 2,
    "StatusTypeID": 0,
    "DateLastStatusUpdate": "2021-03-24T05:10:00Z",
    "DataQualityLevel": 2,
    "DateCreated": "2020-05-26T08:21:00Z",
    "SubmissionStatusTypeID": 100
}