{
    "IsRecentlyVerified": false,
    "ID": 68667,
    "UUID": "8FD8F2E7-19F6-4C55-BF60-6A374943BF82",
    "DataProviderID": 1,
    "OperatorID": 2244,
    "UsageTypeID": 4,
    "AddressInfo": {
        "ID": 69013,
        "Title": "ubitricity Ladelaterne",
        "AddressLine1": "Torstraße 65",
        "AddressLine2": "Mitte",
        "Town": "Berlin",
        "StateOrProvince": "Berlin",
        "Postcode": "10119",
        "CountryID": 87,
        "Latitude": 52.52923335329063,
        "Longitude": 13.408170000000025,
        "AccessComments": "Spezielles Ladekabel mit Abrechnungseinheit von ubitricity notwendig, damit 24/7 nutzbar. Kein reservierter Parkplatz!",
        "DistanceUnit": 0
    },
    "Connections": [
        {
            "ID": 96293,
            "ConnectionTypeID": 25,
            "StatusTypeID": 50,
            "LevelID": 2,
            "Amps": 16,
            "Voltage": 230,
            "PowerKW": 3.7,
            "CurrentTypeID": 10,
            "Quantity": 1
        }
    ],
    "NumberOfPoints": 1,
    "StatusTypeID": 50,
    "DateLastStatusUpdate": "2016-06-15T07:01:00Z",
    "DataQualityLevel": 1,
    "DateCreated": "2016-06-15T07:01:00Z",
    "SubmissionStatusTypeID": 200
}