{
    "UserComments": [
        {
            "ID": 17356,
            "ChargePointID": 19401,
            "CommentTypeID": 50,
            "UserName": "Adski",
            "Comment": "Been closed for more than a month as new faster chargers are being installed.",
            "DateCreated": "2017-05-30T23:01:16.24Z",
            "User": {
                "ID": 11569,
                "Username": "Adski"
            },
            "CheckinStatusTypeID": 22
        }
    ],
    "IsRecentlyVerified": false,
    "ID": 19401,
    "UUID": "723C1D5C-10C4-4CC1-9A58-C5F9CEFEE45B",
    "DataProviderID": 1,
    "OperatorID": 25,
    "OperatorsReference": "hounslow-isleworthleisurecentrelibrary",
    "UsageTypeID": 4,
    "UsageCost": "£0.059/minute; min £1.18; other tariffs available",
    "AddressInfo": {
        "ID": 19746,
        "Title": "Isleworth Leisure Centre & Library",
        "AddressLine1": "Twickenham Road",
        "AddressLine2": "Isleworth",
        "Town": "Hounslow",
        "StateOrProvince": "London",
        "Postcode": "TW7 7EU",
        "CountryID": 1,
        "Latitude": 51.4657672736042,
        "Longitude": -0.330404194195577,
        "ContactTelephone1": "0845 850 0653",
        "AccessComments": "Often has Blue City car share blocking. 24 hour access.",
        "RelatedURL": "http://www.sourcelondon.net",
        "DistanceUnit": 0
    },
    "Connections": [
        {
            "ID": 19704,
            "ConnectionTypeID": 1,
            "StatusTypeID": 50,
            "LevelID": 2,
            "Amps": 16,
            "Voltage": 230,
            "PowerKW": 4,
            "CurrentTypeID": 10,
            "Quantity": 2
        },
        {
            "ID": 135516,
            "ConnectionTypeID": 25,
            "StatusTypeID": 50,
            "LevelID": 2,
            "Amps": 32,
            "Voltage": 230,
            "PowerKW": 7,
            "CurrentTypeID": 10,
            "Quantity": 2
        }
    ],
    "NumberOfPoints": 2,
    "StatusTypeID": 50,
    "DateLastStatusUpdate": "2018-02-01T06:49:00Z",
    "MetadataValues": [
        {
            "ID": 48,
            "MetadataFieldID": 4,
            "ItemValue": "Data © OpenStreetMap contributors, ODbL 1.0. http://www.openstreetmap.org/copyright"
        }
    ],
    "DataQualityLevel": 1,
    "DateCreated": "2013-09-25T14:33:00Z",
    "SubmissionStatusTypeID": 200
}