{
    "UserComments": [
        {
            "ID": 24390,
            "ChargePointID": 175477,
            "CommentTypeID": 10,
            "UserName": "ForumElettrico.it",
            "Comment": "A pochi minuti troviamo un centro commerciale ed alcuni bar e ristoranti. Leggi la recensione completa qui > https://www.forumelettrico.it/forum/colonnine-be-charge-22-kw-stadio-di-piacenza-pc-largo-ercole-anguissola-1-t18020.html",
            "RelatedURL": "https://www.forumelettrico.it/forum/colonnine-be-charge-22-kw-stadio-di-piacenza-pc-largo-ercole-anguissola-1-t18020.html",
            "DateCreated": "2021-05-24T16:32:20.973Z",
            "User": {
                "ID": 11749,
                "Username": "ForumElettrico.it"
            },
            "CheckinStatusTypeID": 10,
            "IsActionedByEditor": false
        }
    ],
    "MediaItems": [
        {
            "ID": 27863,
            "ChargePointID": 175477,
            "ItemURL": "https://s3-ap-southeast-2.amazonaws.com/openchargemap/images/IT/OCM175477/OCM-175477.orig.2021052416325383.jpg",
            "ItemThumbnailURL": "https://s3-ap-southeast-2.amazonaws.com/openchargemap/images/IT/OCM175477/OCM-175477.thmb.2021052416325383.jpg",
            "Comment": "",
            "IsEnabled": true,
            "IsVideo": false,
            "IsFeaturedItem": false,
            "IsExternalResource": false,
            "User": {
                "ID": 11749,
                "Username": "ForumElettrico.it"
            },
            "DateCreated": "2021-05-24T16:33:00Z"
        },
        {
            "ID": 27864,
            "ChargePointID": 175477,
            "ItemURL": "https://s3-ap-southeast-2.amazonaws.com/openchargemap/images/IT/OCM175477/OCM-175477.orig.2021052416330123.jpg",
            "ItemThumbnailURL": "https://s3-ap-southeast-2.amazonaws.com/openchargemap/images/IT/OCM175477/OCM-175477.thmb.2021052416330123.jpg",
            "Comment": "",
            "IsEnabled": true,
            "IsVideo": false,
            "IsFeaturedItem": false,
            "IsExternalResource": false,
            "User": {
                "ID": 11749,
                "Username": "ForumElettrico.it"
            },
            "DateCreated": "2021-05-24T16:33:00Z"
        },
        {
            "ID": 27865,
            "ChargePointID": 175477,
            "ItemURL": "https://s3-ap-southeast-2.amazonaws.com/openchargemap/images/IT/OCM175477/OCM-175477.orig.2021052416330952.jpg",
            "ItemThumbnailURL": "https://s3-ap-southeast-2.amazonaws.com/openchargemap/images/IT/OCM175477/OCM-175477.thmb.2021052416330952.jpg",
            "Comment": "",
            "IsEnabled": true,
            "IsVideo": false,
            "IsFeaturedItem": false,
            "IsExternalResource": false,
            "User": {
                "ID": 11749,
                "Username": "ForumElettrico.it"
            },
            "DateCreated": "2021-05-24T16:33:00Z"
        },
        {
            "ID": 27866,
            "ChargePointID": 175477,
            "ItemURL": "https://s3-ap-southeast-2.amazonaws.com/openchargemap/images/IT/OCM175477/OCM-175477.orig.2021052416331856.jpg",
            "ItemThumbnailURL": "https://s3-ap-southeast-2.amazonaws.com/openchargemap/images/IT/OCM175477/OCM-175477.thmb.2021052416331856.jpg",
            "Comment": "",
            "IsEnabled": true,
            "IsVideo": false,
            "IsFeaturedItem": false,
            "IsExternalResource": false,
            "User": {
                "ID": 11749,
                "Username": "ForumElettrico.it"
            },
            "DateCreated": "2021-05-24T16:33:00Z"
        },
        {
            "ID": 27867,
            "ChargePointID": 175477,
            "ItemURL": "https://s3-ap-southeast-2.amazonaws.com/openchargemap/images/IT/OCM175477/OCM-175477.orig.2021052416332543.jpg",
            "ItemThumbnailURL": "https://s3-ap-southeast-2.amazonaws.com/openchargemap/images/IT/OCM175477/OCM-175477.thmb.2021052416332543.jpg",
            "Comment": "",
            "IsEnabled": true,
            "IsVideo": false,
            "IsFeaturedItem": false,
            "IsExternalResource": false,
            "User": {
                "ID": 11749,
                "Username": "ForumElettrico.it"
            },
            "DateCreated": "2021-05-24T16:33:00Z"
        }
    ],
    "IsRecentlyVerified": false,
    "ID": 175477,
    "UUID": "A3C6FDA5-1098-426E-B4DC-2F439E79D049",
    "DataProviderID": 1,
    "OperatorID": 3327,
    "UsageTypeID": 1,
    "AddressInfo": {
        "ID": 175836,
        "Title": "Be Charge Stadio",
        "AddressLine1": "Largo Ercole Anguissola 1",
        "Town": "Piacenza",
        "StateOrProvince": "PC",
        "CountryID": 112,
        "Latitude": 45.02932,
        "Longitude": 9.69162,
        "RelatedURL": "https://www.forumelettrico.it/forum/colonnine-be-charge-22-kw-stadio-di-piacenza-pc-largo-ercole-anguissola-1-t18020.html",
        "DistanceUnit": 0
    },
    "Connections": [
        {
            "ID": 272324,
            "ConnectionTypeID": 25,
            "LevelID": 2,
            "PowerKW": 22,
            "Quantity": 4
        }
    ],
    "NumberOfPoints": 2,
    "StatusTypeID": 50,
    "DateLastStatusUpdate": "2021-05-24T16:33:00Z",
    "DataQualityLevel": 1,
    "DateCreated": "2021-05-22T14:19:00Z",
    "SubmissionStatusTypeID": 200
}