{
    "IsRecentlyVerified": false,
    "ID": 85317,
    "UUID": "EDF77B83-4832-47C2-A269-DC3BED2824FF",
    "DataProviderID": 1,
    "DataProvidersReference": "3836",
    "AddressInfo": {
        "ID": 85663,
        "Title": "HSB Brf Gasellen",
        "AddressLine1": "Klockaregården 16",
        "Town": "LINKÖPING",
        "StateOrProvince": "ÖSTERGÖTLAND",
        "Postcode": "58644",
        "CountryID": 216,
        "Latitude": 58.4240546,
        "Longitude": 15.580488,
        "AccessComments": "På parkeringen",
        "DistanceUnit": 0
    },
    "Connections": [
        {
            "ID": 121228,
            "ConnectionTypeID": 0,
            "Reference": "1",
            "LevelID": 2,
            "Amps": 16,
            "Voltage": 400,
            "PowerKW": 11,
            "Comments": "Mode 3"
        },
        {
            "ID": 121229,
            "ConnectionTypeID": 0,
            "Reference": "2",
            "LevelID": 2,
            "Amps": 16,
            "Voltage": 400,
            "PowerKW": 11,
            "Comments": "Mode 3"
        }
    ],
    "NumberOfPoints": 2,
    "DateLastStatusUpdate": "2020-05-26T08:22:00Z",
    "DataQualityLevel": 2,
    "DateCreated": "2017-04-01T15:08:00Z",
    "SubmissionStatusTypeID": 100
}