{
    "IsRecentlyVerified": false,
    "ID": 142216,
    "UUID": "157C1339-292F-46BB-B277-15E9A84E2D6F",
    "DataProviderID": 2,
    "DataProvidersReference": "145744",
    "OperatorID": 5,
    "UsageTypeID": 1,
    "AddressInfo": {
        "ID": 142568,
        "Title": "HOUK-STATIONS",
        "AddressLine1": "1000 Solomon Sq",
        "Town": "Delaware",
        "StateOrProvince": "OH",
        "Postcode": "43015",
        "CountryID": 2,
        "Latitude": 40.289343,
        "Longitude": -83.113489,
        "ContactTelephone1": "888-758-4389",
        "AccessComments": "24 hours daily",
        "RelatedURL": "http://www.chargepoint.com/",
        "DistanceUnit": 0
    },
    "Connections": [
        {
            "ID": 198305,
            "ConnectionTypeID": 1,
            "LevelID": 2,
            "Amps": 16,
            "Voltage": 230,
            "PowerKW": 3.7,
            "CurrentTypeID": 10,
            "Quantity": 4
        }
    ],
    "StatusTypeID": 50,
    "DateLastStatusUpdate": "2020-06-26T03:02:00Z",
    "DataQualityLevel": 3,
    "DateCreated": "2019-12-24T09:17:00Z",
    "SubmissionStatusTypeID": 100
}