{
    "IsRecentlyVerified": false,
    "ID": 71122,
    "UUID": "DFB8EDEC-EA97-4E23-9630-C78401B92F9A",
    "DataProviderID": 1,
    "OperatorID": 45,
    "UsageTypeID": 3,
    "AddressInfo": {
        "ID": 71468,
        "Title": "Tecklenborg Industriemaschinen",
        "AddressLine1": "Moormannskamp 5",
        "Town": "Ritterhude",
        "StateOrProvince": "Landkreis Osterholz",
        "Postcode": "27721",
        "CountryID": 87,
        "Latitude": 53.18634,
        "Longitude": 8.73334,
        "ContactTelephone1": "+49 4292-1081",
        "AccessComments": "Zu der Öffnungszeiten des Industriemaschinenhandels Mo-Fr 8:00-17:00Uhr kostenlos nutzbar.",
        "RelatedURL": "http://tecklenborg.biz/",
        "DistanceUnit": 0
    },
    "Connections": [
        {
            "ID": 101910,
            "ConnectionTypeID": 25,
            "StatusTypeID": 50,
            "LevelID": 2,
            "Amps": 32,
            "Voltage": 400,
            "PowerKW": 22,
            "CurrentTypeID": 20,
            "Quantity": 1
        }
    ],
    "NumberOfPoints": 1,
    "StatusTypeID": 50,
    "DateLastStatusUpdate": "2016-08-30T05:46:00Z",
    "DataQualityLevel": 1,
    "DateCreated": "2016-08-30T05:45:00Z",
    "SubmissionStatusTypeID": 200
}