{
    "IsRecentlyVerified": false,
    "ID": 31820,
    "UUID": "60A07C52-62DE-4ED1-83D5-AD1AEE9E36E6",
    "DataProviderID": 26,
    "DataProvidersReference": "30431",
    "OperatorID": 86,
    "OperatorsReference": "EnWB Parkplatz Stadtwerke ",
    "UsageCost": "0.00 afhankelijk van pas",
    "AddressInfo": {
        "ID": 32166,
        "Title": "Waldseestraße",
        "AddressLine1": "Waldseestraße",
        "Town": "Oosscheuern",
        "Postcode": "76530",
        "CountryID": 87,
        "Latitude": 48.767,
        "Longitude": 8.22796,
        "ContactTelephone1": "0800 3629-000",
        "ContactEmail": "-",
        "RelatedURL": "http://www.enbw.com/",
        "DistanceUnit": 0
    },
    "Connections": [
        {
            "ID": 35331,
            "ConnectionTypeID": 25,
            "LevelID": 2,
            "PowerKW": 5,
            "CurrentTypeID": 10
        }
    ],
    "NumberOfPoints": 2,
    "StatusTypeID": 50,
    "DateLastStatusUpdate": "2016-03-03T12:34:00Z",
    "DataQualityLevel": 3,
    "DateCreated": "2015-01-09T06:03:00Z",
    "SubmissionStatusTypeID": 100
}