{
    "IsRecentlyVerified": false,
    "ID": 96208,
    "UUID": "5888F1FB-5490-4BBB-A0CB-240B3F9CF734",
    "DataProviderID": 1,
    "OperatorID": 3315,
    "OperatorsReference": "50235",
    "UsageTypeID": 4,
    "UsageCost": "Free",
    "AddressInfo": {
        "ID": 96554,
        "Title": "Alexandra Drive",
        "AddressLine1": "Lenzie Station South Car Park",
        "Town": "Kirkintilloch",
        "StateOrProvince": "Scotland",
        "Postcode": "G66 5BG",
        "CountryID": 1,
        "Latitude": 55.92049,
        "Longitude": -4.15591,
        "DistanceUnit": 0
    },
    "Connections": [
        {
            "ID": 136309,
            "ConnectionTypeID": 25,
            "StatusTypeID": 50,
            "LevelID": 2,
            "Amps": 32,
            "Voltage": 400,
            "PowerKW": 22,
            "CurrentTypeID": 20,
            "Quantity": 2
        }
    ],
    "NumberOfPoints": 2,
    "StatusTypeID": 50,
    "DateLastStatusUpdate": "2018-11-16T16:09:00Z",
    "DataQualityLevel": 1,
    "DateCreated": "2017-12-15T06:17:00Z",
    "SubmissionStatusTypeID": 200
}