{
    "IsRecentlyVerified": false,
    "ID": 141379,
    "UUID": "0EA0A926-85F6-4C8F-8BEA-87CD4687C162",
    "DataProviderID": 2,
    "DataProvidersReference": "148420",
    "OperatorID": 39,
    "UsageTypeID": 1,
    "AddressInfo": {
        "ID": 141731,
        "Title": "Akridge",
        "AddressLine1": "601 Thirteenth Street NW, Suite 300",
        "Town": "Washington",
        "StateOrProvince": "DC",
        "Postcode": "20005",
        "CountryID": 2,
        "Latitude": 38.897813,
        "Longitude": -77.029352,
        "ContactTelephone1": "800-663-5633",
        "AccessComments": "MO: Not Specified; TU: Not Specified; WE: Not Specified; TH: Not Specified; FR: Not Specified; SA: Not Specified; SU: Not Specified",
        "RelatedURL": "http://www.semacharge.com/",
        "DistanceUnit": 0
    },
    "Connections": [
        {
            "ID": 197300,
            "ConnectionTypeID": 1,
            "LevelID": 2,
            "Amps": 16,
            "Voltage": 230,
            "PowerKW": 3.7,
            "CurrentTypeID": 10,
            "Quantity": 2
        }
    ],
    "StatusTypeID": 50,
    "DateLastStatusUpdate": "2020-06-26T03:00:00Z",
    "DataQualityLevel": 3,
    "DateCreated": "2019-12-24T09:15:00Z",
    "SubmissionStatusTypeID": 100
}