{
    "IsRecentlyVerified": false,
    "ID": 33149,
    "UUID": "D034F432-48D0-4540-AC1B-A724DBE76DC8",
    "DataProviderID": 26,
    "DataProvidersReference": "54251",
    "OperatorID": 73,
    "OperatorsReference": "EV-Box EVB-P1430171",
    "UsageCost": "0.00 jaarabonnement",
    "AddressInfo": {
        "ID": 33495,
        "Title": "Bovendonk 29",
        "AddressLine1": "Bovendonk 29",
        "Town": "Roosendaal",
        "Postcode": "4707 ZH",
        "CountryID": 159,
        "Latitude": 51.52505,
        "Longitude": 4.47307,
        "RelatedURL": "http://www.ev-box.nl",
        "DistanceUnit": 0
    },
    "Connections": [
        {
            "ID": 36660,
            "ConnectionTypeID": 25,
            "LevelID": 2,
            "PowerKW": 11,
            "CurrentTypeID": 10
        },
        {
            "ID": 46704,
            "ConnectionTypeID": 25,
            "LevelID": 2,
            "PowerKW": 11,
            "CurrentTypeID": 10
        }
    ],
    "NumberOfPoints": 1,
    "StatusTypeID": 50,
    "DateLastStatusUpdate": "2016-06-04T02:39:00Z",
    "DataQualityLevel": 3,
    "DateCreated": "2015-01-09T06:04:00Z",
    "SubmissionStatusTypeID": 100
}