{
    "IsRecentlyVerified": false,
    "ID": 106045,
    "UUID": "72DB1170-1B9F-41A1-A959-DDD1840F89D8",
    "DataProviderID": 1,
    "OperatorID": 45,
    "UsageTypeID": 6,
    "AddressInfo": {
        "ID": 106391,
        "Title": "Lobacher Hof",
        "AddressLine1": "Kreumaer Dorfstraße 29",
        "Town": "Rackwitz",
        "StateOrProvince": "Landkreis Nordsachsen",
        "Postcode": "04519",
        "CountryID": 87,
        "Latitude": 51.4707843,
        "Longitude": 12.394169899999952,
        "ContactTelephone1": "+493429484393 ",
        "RelatedURL": "http://www.lobacher-hof.de/",
        "DistanceUnit": 0
    },
    "Connections": [
        {
            "ID": 149349,
            "ConnectionTypeID": 28,
            "StatusTypeID": 50,
            "LevelID": 2,
            "Amps": 16,
            "Voltage": 230,
            "PowerKW": 3.7,
            "CurrentTypeID": 10,
            "Quantity": 1
        }
    ],
    "NumberOfPoints": 1,
    "GeneralComments": "Für Übernachtungsgäste in den Ferienwohnungen auf Anfrage.",
    "StatusTypeID": 50,
    "DateLastStatusUpdate": "2018-06-14T07:11:00Z",
    "DataQualityLevel": 1,
    "DateCreated": "2018-06-14T07:11:00Z",
    "SubmissionStatusTypeID": 200
}