{
    "IsRecentlyVerified": false,
    "ID": 143313,
    "UUID": "F385D8B4-A57D-466E-BB79-611AE001E9E5",
    "DataProviderID": 2,
    "DataProvidersReference": "72733",
    "OperatorID": 1242,
    "UsageTypeID": 1,
    "AddressInfo": {
        "ID": 143665,
        "Title": "GE WS - Price Chopper #191 Nisky - Center",
        "AddressLine1": "442  Balltown Rd",
        "Town": "Schenectady",
        "StateOrProvince": "NY",
        "Postcode": "12304",
        "CountryID": 2,
        "Latitude": 42.7753611487,
        "Longitude": -73.8932276772,
        "ContactTelephone1": "855-443-3873",
        "AccessComments": "24 hours daily",
        "RelatedURL": "https://www.gewattstation.com",
        "DistanceUnit": 0
    },
    "Connections": [
        {
            "ID": 199611,
            "ConnectionTypeID": 1,
            "LevelID": 2,
            "Amps": 16,
            "Voltage": 230,
            "PowerKW": 3.7,
            "CurrentTypeID": 10,
            "Quantity": 1
        }
    ],
    "StatusTypeID": 50,
    "DateLastStatusUpdate": "2020-06-26T03:06:00Z",
    "DataQualityLevel": 3,
    "DateCreated": "2019-12-24T09:20:00Z",
    "SubmissionStatusTypeID": 100
}