{
    "IsRecentlyVerified": false,
    "ID": 135744,
    "UUID": "64039F12-227F-4556-BF9F-B5CE06326459",
    "DataProviderID": 18,
    "DataProvidersReference": "0d3886ec9d291a32ec11b30bc031c552",
    "OperatorID": 3393,
    "UsageTypeID": 5,
    "AddressInfo": {
        "ID": 136090,
        "Title": "St. Bartholomews Road",
        "AddressLine1": "St. Bartholomews Road",
        "Town": "Reading",
        "Postcode": "RG1 3QA",
        "CountryID": 1,
        "Latitude": 51.45368,
        "Longitude": -0.94272,
        "AccessComments": "",
        "RelatedURL": "http://www.joju.co.uk/",
        "DistanceUnit": 0
    },
    "Connections": [
        {
            "ID": 190164,
            "ConnectionTypeID": 25,
            "Reference": "05551",
            "StatusTypeID": 50,
            "LevelID": 2,
            "Amps": 16,
            "Voltage": 230,
            "PowerKW": 3.7,
            "CurrentTypeID": 10
        }
    ],
    "StatusTypeID": 0,
    "DateLastStatusUpdate": "2020-03-17T08:53:00Z",
    "MetadataValues": [
        {
            "ID": 5596,
            "MetadataFieldID": 4,
            "ItemValue": "Contains public sector information licensed under the Open Government Licence v2.0. http://www.nationalarchives.gov.uk/doc/open-government-licence/version/2/"
        }
    ],
    "DataQualityLevel": 3,
    "DateCreated": "2019-12-24T05:22:00Z",
    "SubmissionStatusTypeID": 100
}