{
    "IsRecentlyVerified": false,
    "ID": 158873,
    "UUID": "CCE5AC29-819C-4FDE-ABD9-7716FF4307AF",
    "DataProviderID": 2,
    "DataProvidersReference": "152945",
    "OperatorID": 89,
    "UsageTypeID": 1,
    "AddressInfo": {
        "ID": 159230,
        "Title": "19054 N Kittridge St",
        "AddressLine1": "19054 N Kittridge St",
        "Town": "Los Angeles",
        "StateOrProvince": "CA",
        "Postcode": "91335",
        "CountryID": 2,
        "Latitude": 34.19015938,
        "Longitude": -118.5481514,
        "ContactTelephone1": "888-356-8911",
        "AccessComments": "24 hours daily",
        "RelatedURL": "https://flo.ca/",
        "DistanceUnit": 0
    },
    "Connections": [
        {
            "ID": 228908,
            "ConnectionTypeID": 1,
            "LevelID": 2,
            "Amps": 16,
            "Voltage": 230,
            "PowerKW": 3.7,
            "CurrentTypeID": 10,
            "Quantity": 1
        }
    ],
    "StatusTypeID": 50,
    "DateLastStatusUpdate": "2020-06-26T02:57:00Z",
    "DataQualityLevel": 3,
    "DateCreated": "2020-06-26T02:57:00Z",
    "SubmissionStatusTypeID": 100
}