{
    "IsRecentlyVerified": false,
    "ID": 9712,
    "UUID": "9031CB97-CC80-42A5-B595-E4F5CC1DBCBF",
    "DataProviderID": 15,
    "DataProvidersReference": "16784",
    "OperatorID": 1,
    "AddressInfo": {
        "ID": 9609,
        "Title": "3299 Canton Rd",
        "AddressLine1": "3299 Canton Rd",
        "Town": "Marietta",
        "StateOrProvince": "GA",
        "Postcode": "30066",
        "CountryID": 2,
        "Latitude": 34.0321296,
        "Longitude": -84.52779460000001,
        "ContactTelephone1": "(770) 218-8588",
        "RelatedURL": "http://carstations.com/16784",
        "DistanceUnit": 0
    },
    "Connections": [
        {
            "ID": 7519,
            "ConnectionTypeID": 1,
            "Reference": "J1772",
            "LevelID": 2
        }
    ],
    "StatusTypeID": 0,
    "DateLastStatusUpdate": "2017-11-04T14:04:00Z",
    "DataQualityLevel": 2,
    "DateCreated": "2012-04-16T15:46:00Z",
    "SubmissionStatusTypeID": 100
}