{
    "IsRecentlyVerified": false,
    "ID": 8364,
    "UUID": "1DAA01DC-9C94-47C6-A571-CEFB03962D8B",
    "DataProviderID": 15,
    "DataProvidersReference": "7047",
    "OperatorID": 26,
    "AddressInfo": {
        "ID": 8261,
        "Title": "1919 W Main St",
        "AddressLine1": "1919 W Main St",
        "Town": "Bozeman",
        "StateOrProvince": "MT",
        "Postcode": "59718",
        "CountryID": 2,
        "Latitude": 45.68017,
        "Longitude": -111.06297,
        "ContactTelephone1": " (406) 582-7777",
        "RelatedURL": "http://carstations.com/7047",
        "DistanceUnit": 0
    },
    "Connections": [
        {
            "ID": 5792,
            "ConnectionTypeID": 1,
            "Reference": "J1772",
            "LevelID": 2
        }
    ],
    "StatusTypeID": 0,
    "DateLastStatusUpdate": "2017-11-04T14:05:00Z",
    "DataQualityLevel": 1,
    "DateCreated": "2011-11-11T12:06:00Z",
    "SubmissionStatusTypeID": 100
}