{
    "IsRecentlyVerified": false,
    "ID": 45227,
    "UUID": "5C95D8E5-5903-4791-9FB2-4FDEC1D66C8B",
    "DataProviderID": 1,
    "OperatorID": 105,
    "UsageTypeID": 1,
    "UsageCost": "0",
    "AddressInfo": {
        "ID": 45573,
        "Title": "E-Bike Station RWE Niederlassung",
        "AddressLine1": "Bochumer Straße 2",
        "Town": "Recklinghausen",
        "Postcode": "45661",
        "CountryID": 87,
        "Latitude": 51.5827136,
        "Longitude": 7.21198500000003,
        "RelatedURL": "http://www.rwe.com/web/cms/de/494436/e-bikes-on-tour/ladestationen/",
        "DistanceUnit": 0
    },
    "Connections": [
        {
            "ID": 55744,
            "ConnectionTypeID": 28,
            "StatusTypeID": 50,
            "LevelID": 1,
            "Amps": 10,
            "Voltage": 230,
            "PowerKW": 2.3,
            "CurrentTypeID": 10,
            "Quantity": 3
        }
    ],
    "NumberOfPoints": 3,
    "StatusTypeID": 50,
    "DateLastStatusUpdate": "2015-04-28T15:51:00Z",
    "DataQualityLevel": 1,
    "DateCreated": "2015-04-28T08:56:00Z",
    "SubmissionStatusTypeID": 200
}