{
    "IsRecentlyVerified": false,
    "ID": 68302,
    "UUID": "8A2CBA0B-9189-4186-90AD-4937FAEB6692",
    "DataProviderID": 26,
    "DataProvidersReference": "93038",
    "OperatorID": 73,
    "OperatorsReference": "EV-Box EVB-P1409024",
    "UsageCost": "0.00 jaarabonnement",
    "AddressInfo": {
        "ID": 68648,
        "Title": "De Wijmerts 6",
        "AddressLine1": "De Wijmerts 6",
        "Town": "Leeuwarden",
        "Postcode": "8939 AN",
        "CountryID": 159,
        "Latitude": 53.18512,
        "Longitude": 5.82704,
        "RelatedURL": "http://www.ev-box.nl",
        "DistanceUnit": 0
    },
    "Connections": [
        {
            "ID": 95221,
            "ConnectionTypeID": 25,
            "LevelID": 2,
            "PowerKW": 5,
            "CurrentTypeID": 10
        }
    ],
    "NumberOfPoints": 1,
    "StatusTypeID": 50,
    "DateLastStatusUpdate": "2016-06-04T02:37:00Z",
    "DataQualityLevel": 3,
    "DateCreated": "2016-06-04T02:37:00Z",
    "SubmissionStatusTypeID": 100
}