{
    "IsRecentlyVerified": false,
    "ID": 97042,
    "UUID": "6DC77893-D4F2-422C-A73E-DA2461722325",
    "DataProviderID": 19,
    "DataProvidersReference": "4567",
    "AddressInfo": {
        "ID": 97388,
        "Title": "Skedsmo senter",
        "AddressLine1": "Furuveien 1",
        "Town": "SKEDSMOKORSET",
        "StateOrProvince": "Akershus",
        "Postcode": "2020",
        "CountryID": 168,
        "Latitude": 60.00079,
        "Longitude": 11.04038,
        "AccessComments": "",
        "DistanceUnit": 0
    },
    "Connections": [
        {
            "ID": 137671,
            "ConnectionTypeID": 28,
            "Reference": "2",
            "LevelID": 2,
            "Amps": 16,
            "Voltage": 230,
            "PowerKW": 3.7,
            "CurrentTypeID": 10,
            "Comments": "Mode 1"
        },
        {
            "ID": 165060,
            "ConnectionTypeID": 28,
            "Reference": "3",
            "LevelID": 2,
            "Amps": 16,
            "Voltage": 230,
            "PowerKW": 3.7,
            "CurrentTypeID": 10,
            "Comments": "Mode 1"
        },
        {
            "ID": 165061,
            "ConnectionTypeID": 28,
            "Reference": "4",
            "LevelID": 2,
            "Amps": 16,
            "Voltage": 230,
            "PowerKW": 3.7,
            "CurrentTypeID": 10,
            "Comments": "Mode 1"
        },
        {
            "ID": 165062,
            "ConnectionTypeID": 28,
            "Reference": "5",
            "LevelID": 2,
            "Amps": 16,
            "Voltage": 230,
            "PowerKW": 3.7,
            "CurrentTypeID": 10,
            "Comments": "Mode 1"
        },
        {
            "ID": 165063,
            "ConnectionTypeID": 28,
            "Reference": "6",
            "LevelID": 2,
            "Amps": 16,
            "Voltage": 230,
            "PowerKW": 3.7,
            "CurrentTypeID": 10,
            "Comments": "Mode 1"
        },
        {
            "ID": 165064,
            "ConnectionTypeID": 28,
            "Reference": "7",
            "LevelID": 2,
            "Amps": 16,
            "Voltage": 230,
            "PowerKW": 3.7,
            "CurrentTypeID": 10,
            "Comments": "Mode 1"
        },
        {
            "ID": 165065,
            "ConnectionTypeID": 28,
            "Reference": "8",
            "LevelID": 2,
            "Amps": 16,
            "Voltage": 230,
            "PowerKW": 3.7,
            "CurrentTypeID": 10,
            "Comments": "Mode 1"
        },
        {
            "ID": 165066,
            "ConnectionTypeID": 28,
            "Reference": "9",
            "LevelID": 2,
            "Amps": 16,
            "Voltage": 230,
            "PowerKW": 3.7,
            "CurrentTypeID": 10,
            "Comments": "Mode 1"
        },
        {
            "ID": 165067,
            "ConnectionTypeID": 28,
            "Reference": "10",
            "LevelID": 2,
            "Amps": 16,
            "Voltage": 230,
            "PowerKW": 3.7,
            "CurrentTypeID": 10,
            "Comments": "Mode 1"
        },
        {
            "ID": 165068,
            "ConnectionTypeID": 28,
            "Reference": "11",
            "LevelID": 2,
            "Amps": 16,
            "Voltage": 230,
            "PowerKW": 3.7,
            "CurrentTypeID": 10,
            "Comments": "Mode 1"
        },
        {
            "ID": 165069,
            "ConnectionTypeID": 28,
            "Reference": "12",
            "LevelID": 2,
            "Amps": 16,
            "Voltage": 230,
            "PowerKW": 3.7,
            "CurrentTypeID": 10,
            "Comments": "Mode 1"
        },
        {
            "ID": 165070,
            "ConnectionTypeID": 28,
            "Reference": "13",
            "LevelID": 2,
            "Amps": 16,
            "Voltage": 230,
            "PowerKW": 3.7,
            "CurrentTypeID": 10,
            "Comments": "Mode 1"
        },
        {
            "ID": 165071,
            "ConnectionTypeID": 28,
            "Reference": "14",
            "LevelID": 2,
            "Amps": 16,
            "Voltage": 230,
            "PowerKW": 3.7,
            "CurrentTypeID": 10,
            "Comments": "Mode 1"
        },
        {
            "ID": 165072,
            "ConnectionTypeID": 28,
            "Reference": "15",
            "LevelID": 2,
            "Amps": 16,
            "Voltage": 230,
            "PowerKW": 3.7,
            "CurrentTypeID": 10,
            "Comments": "Mode 1"
        },
        {
            "ID": 165073,
            "ConnectionTypeID": 28,
            "Reference": "16",
            "LevelID": 2,
            "Amps": 16,
            "Voltage": 230,
            "PowerKW": 3.7,
            "CurrentTypeID": 10,
            "Comments": "Mode 1"
        },
        {
            "ID": 165074,
            "ConnectionTypeID": 28,
            "Reference": "17",
            "LevelID": 2,
            "Amps": 16,
            "Voltage": 230,
            "PowerKW": 3.7,
            "CurrentTypeID": 10,
            "Comments": "Mode 1"
        },
        {
            "ID": 165075,
            "ConnectionTypeID": 28,
            "Reference": "18",
            "LevelID": 2,
            "Amps": 16,
            "Voltage": 230,
            "PowerKW": 3.7,
            "CurrentTypeID": 10,
            "Comments": "Mode 1"
        }
    ],
    "NumberOfPoints": 18,
    "DateLastStatusUpdate": "2019-02-11T09:17:00Z",
    "DataQualityLevel": 2,
    "DateCreated": "2018-01-04T08:28:00Z",
    "SubmissionStatusTypeID": 100
}