{
    "IsRecentlyVerified": false,
    "ID": 42644,
    "UUID": "91173D18-02F8-4733-B8B9-988BB268248E",
    "DataProviderID": 1,
    "OperatorID": 45,
    "UsageTypeID": 4,
    "UsageCost": "0",
    "AddressInfo": {
        "ID": 42990,
        "Title": "Parkplatz Campingplatz Seeburger See",
        "AddressLine1": "Seestraße 998",
        "Town": "Seeburg",
        "StateOrProvince": "Samtgemeinde Radolfshausen",
        "Postcode": "37136",
        "CountryID": 87,
        "Latitude": 51.5641046243273,
        "Longitude": 10.1543532344627,
        "ContactTelephone1": "+49 550 71 319",
        "ContactEmail": "info@campingseeburgersee.com",
        "AccessComments": "Parken kostenlos. Freischalten der Säule mit Ladekarte der EEW Duderstadt, kostenlos erhältlich beim Campingplatz, bei der Samtgemeinde Radolfshausen, beim  Seeburg sowie beim Campingplatz-Restaurant \"The Old Sailor\" erhältlich. Kostenloses WLAN auf dem Campingplatz. ",
        "RelatedURL": "http://www.campingseeburgersee.com",
        "DistanceUnit": 0
    },
    "Connections": [
        {
            "ID": 51416,
            "ConnectionTypeID": 25,
            "StatusTypeID": 50,
            "LevelID": 2,
            "Amps": 16,
            "Voltage": 400,
            "PowerKW": 11,
            "CurrentTypeID": 20,
            "Quantity": 2
        },
        {
            "ID": 51417,
            "ConnectionTypeID": 28,
            "StatusTypeID": 50,
            "LevelID": 2,
            "Amps": 16,
            "Voltage": 230,
            "PowerKW": 3.7,
            "CurrentTypeID": 10,
            "Quantity": 2
        }
    ],
    "NumberOfPoints": 4,
    "StatusTypeID": 50,
    "DateLastStatusUpdate": "2015-03-18T15:12:00Z",
    "DataQualityLevel": 1,
    "DateCreated": "2015-03-18T14:42:00Z",
    "SubmissionStatusTypeID": 200
}