{
    "IsRecentlyVerified": false,
    "ID": 31769,
    "UUID": "97E3BB90-4ECF-4AFE-94DC-B5B782A57243",
    "DataProviderID": 26,
    "DataProvidersReference": "30317",
    "OperatorID": 86,
    "OperatorsReference": "EnWB Schneewittchenweg",
    "UsageCost": "0.00 afhankelijk van pas",
    "AddressInfo": {
        "ID": 32115,
        "Title": "Schneewittchenweg 50",
        "AddressLine1": "Schneewittchenweg 50",
        "Town": "Stuttgart",
        "Postcode": "70567",
        "CountryID": 87,
        "Latitude": 48.72043,
        "Longitude": 9.148633,
        "ContactTelephone1": "0800 3629-000",
        "ContactEmail": "-",
        "RelatedURL": "http://www.enbw.com/",
        "DistanceUnit": 0
    },
    "Connections": [
        {
            "ID": 35280,
            "ConnectionTypeID": 25,
            "LevelID": 2,
            "PowerKW": 5,
            "CurrentTypeID": 10
        }
    ],
    "NumberOfPoints": 1,
    "StatusTypeID": 50,
    "DateLastStatusUpdate": "2016-03-03T12:34:00Z",
    "DataQualityLevel": 3,
    "DateCreated": "2015-01-09T06:03:00Z",
    "SubmissionStatusTypeID": 100
}