{
    "UserComments": [
        {
            "ID": 11548,
            "ChargePointID": 60628,
            "CommentTypeID": 10,
            "UserName": "Alexander Geweiler",
            "Comment": "Laden unerwünscht😕Die Station ist lt. Aussage der Mitarbeiter nur für die eigenen Fahrzeuge",
            "DateCreated": "2016-06-03T07:12:00.447Z",
            "User": {
                "ID": 9409,
                "Username": "Alexander Geweiler"
            },
            "CheckinStatusTypeID": 120
        }
    ],
    "IsRecentlyVerified": false,
    "ID": 60628,
    "UUID": "37E49D6A-449B-447B-A795-541153B203DC",
    "DataProviderID": 1,
    "OperatorID": 45,
    "UsageTypeID": 3,
    "AddressInfo": {
        "ID": 60974,
        "Title": "Dresdener Auto AG",
        "AddressLine1": "Am Galgenberg 41",
        "AddressLine2": "Lockwitz",
        "Town": "Dresden",
        "StateOrProvince": "Sachsen",
        "Postcode": "01257",
        "CountryID": 87,
        "Latitude": 50.9939358,
        "Longitude": 13.8019274000001,
        "AccessComments": "Kostenlos laden am Renault Autohaus. Geöffnet von Mo - Fr: 07:00 - 19:00, Sa: 09:00 - 13:00. Vor Nutzung einen Mitarbeiter informieren.",
        "DistanceUnit": 0
    },
    "Connections": [
        {
            "ID": 76847,
            "ConnectionTypeID": 25,
            "StatusTypeID": 50,
            "LevelID": 2,
            "Amps": 32,
            "Voltage": 400,
            "PowerKW": 22,
            "CurrentTypeID": 20,
            "Quantity": 2
        }
    ],
    "NumberOfPoints": 2,
    "StatusTypeID": 50,
    "DateLastStatusUpdate": "2016-06-03T07:12:00Z",
    "DataQualityLevel": 1,
    "DateCreated": "2016-02-06T12:51:00Z",
    "SubmissionStatusTypeID": 200
}