{
    "IsRecentlyVerified": false,
    "ID": 33223,
    "UUID": "0B3388FC-786E-4C9E-9C43-D800E1B69366",
    "DataProviderID": 1,
    "OperatorID": 157,
    "OperatorsReference": "NewMotion 02010139",
    "UsageCost": "0.00 jaarabonnement",
    "AddressInfo": {
        "ID": 33569,
        "Title": "Helmutstraße 53",
        "AddressLine1": "Helmutstraße 53",
        "Town": "Gladbeck",
        "Postcode": "45968",
        "CountryID": 87,
        "Latitude": 51.5545310974121,
        "Longitude": 6.99385023117065,
        "ContactTelephone1": "088 0109500",
        "RelatedURL": "http://thenewmotion.nl/",
        "DistanceUnit": 0
    },
    "Connections": [
        {
            "ID": 36734,
            "ConnectionTypeID": 25,
            "LevelID": 2,
            "PowerKW": 3.7,
            "CurrentTypeID": 10
        }
    ],
    "NumberOfPoints": 1,
    "StatusTypeID": 50,
    "DateLastStatusUpdate": "2021-04-25T05:14:00Z",
    "DataQualityLevel": 3,
    "DateCreated": "2015-01-09T06:04:00Z",
    "SubmissionStatusTypeID": 200
}