{
    "MediaItems": [
        {
            "ID": 24453,
            "ChargePointID": 138599,
            "ItemURL": "https://s3-ap-southeast-2.amazonaws.com/openchargemap/images/US/OCM138599/OCM-138599.orig.2020082505554702.jpg",
            "ItemThumbnailURL": "https://s3-ap-southeast-2.amazonaws.com/openchargemap/images/US/OCM138599/OCM-138599.thmb.2020082505554702.jpg",
            "Comment": "",
            "IsEnabled": true,
            "IsVideo": false,
            "IsFeaturedItem": false,
            "IsExternalResource": false,
            "User": {
                "ID": 27134,
                "Username": "GyGeek"
            },
            "DateCreated": "2020-08-25T05:56:00Z"
        }
    ],
    "IsRecentlyVerified": false,
    "ID": 138599,
    "UUID": "83F19AFD-5056-49CD-8094-EB90E68DA056",
    "DataProviderID": 2,
    "DataProvidersReference": "145749",
    "OperatorID": 3318,
    "UsageTypeID": 1,
    "AddressInfo": {
        "ID": 138948,
        "Title": "Tucson Premium Outlets",
        "AddressLine1": "6401 W. Marana Center Blvd",
        "Town": "Tucson",
        "StateOrProvince": "AZ",
        "Postcode": "85742",
        "CountryID": 2,
        "Latitude": 32.374173,
        "Longitude": -111.101523,
        "ContactTelephone1": "833-632-2778",
        "AccessComments": "24 hours daily",
        "RelatedURL": "https://www.electrifyamerica.com/",
        "DistanceUnit": 0
    },
    "Connections": [
        {
            "ID": 193744,
            "ConnectionTypeID": 2,
            "LevelID": 3,
            "Amps": 100,
            "Voltage": 400,
            "PowerKW": 40,
            "CurrentTypeID": 30,
            "Quantity": 1
        },
        {
            "ID": 193745,
            "ConnectionTypeID": 32,
            "LevelID": 3,
            "Amps": 100,
            "Voltage": 400,
            "PowerKW": 40,
            "CurrentTypeID": 30,
            "Quantity": 1
        }
    ],
    "StatusTypeID": 50,
    "DateLastStatusUpdate": "2020-08-25T05:56:00Z",
    "DataQualityLevel": 3,
    "DateCreated": "2019-12-24T09:09:00Z",
    "SubmissionStatusTypeID": 100
}