{
    "IsRecentlyVerified": false,
    "ID": 129002,
    "UUID": "499A9722-01D3-4E09-892C-2E62B95B29E0",
    "DataProviderID": 1,
    "OperatorID": 3345,
    "UsageTypeID": 5,
    "UsageCost": "£0.33/kWh; other tariffs available",
    "AddressInfo": {
        "ID": 129348,
        "Title": "Marefield Road",
        "AddressLine1": "Marefield Road",
        "Town": "Marlow",
        "Postcode": "SL7 2QE",
        "CountryID": 1,
        "Latitude": 51.574559,
        "Longitude": -0.7794,
        "RelatedURL": "https://char.gy",
        "DistanceUnit": 0
    },
    "Connections": [
        {
            "ID": 180585,
            "ConnectionTypeID": 25,
            "Reference": "char.gy/00247",
            "StatusTypeID": 50,
            "LevelID": 2,
            "Amps": 16,
            "Voltage": 230,
            "PowerKW": 3.7,
            "CurrentTypeID": 10,
            "Quantity": 1
        }
    ],
    "NumberOfPoints": 1,
    "StatusTypeID": 50,
    "DateLastStatusUpdate": "2019-07-10T22:20:00Z",
    "MetadataValues": [
        {
            "ID": 4748,
            "MetadataFieldID": 4,
            "ItemValue": "Contains public sector information licensed under the Open Government Licence v2.0. http://www.nationalarchives.gov.uk/doc/open-government-licence/version/2/"
        }
    ],
    "DataQualityLevel": 3,
    "DateCreated": "2019-07-10T14:20:00Z",
    "SubmissionStatusTypeID": 100
}