{
    "IsRecentlyVerified": false,
    "ID": 186567,
    "UUID": "56647399-C5B9-4166-A165-878F5DFFEBA7",
    "DataProviderID": 29,
    "DataProvidersReference": "8255",
    "OperatorID": 140,
    "AddressInfo": {
        "ID": 186926,
        "Title": "Garnisonstraße 6",
        "AddressLine1": "Garnisonstraße 6",
        "Town": "Hofgeismar",
        "Postcode": "34369",
        "CountryID": 87,
        "Latitude": 51.4902057,
        "Longitude": 9.3856106211,
        "DistanceUnit": 0
    },
    "Connections": [
        {
            "ID": 299505,
            "ConnectionTypeID": 25,
            "StatusTypeID": 50,
            "LevelID": 2,
            "PowerKW": 22,
            "CurrentTypeID": 20
        },
        {
            "ID": 299506,
            "ConnectionTypeID": 25,
            "StatusTypeID": 50,
            "LevelID": 2,
            "PowerKW": 22,
            "CurrentTypeID": 20
        }
    ],
    "StatusTypeID": 50,
    "DateLastStatusUpdate": "2021-07-12T02:47:00Z",
    "MetadataValues": [
        {
            "ID": 18808,
            "MetadataFieldID": 4,
            "ItemValue": "Data from the German chargepoint registry provided by Bundesnetzagentur.de under the CC-BY 4.0 license"
        }
    ],
    "DataQualityLevel": 3,
    "DateCreated": "2021-07-12T02:47:00Z",
    "SubmissionStatusTypeID": 100
}