{
    "MediaItems": [
        {
            "ID": 23459,
            "ChargePointID": 77319,
            "ItemURL": "https://s3-ap-southeast-2.amazonaws.com/openchargemap/images/AT/OCM77319/OCM-77319.orig.2020080203502970.jpg",
            "ItemThumbnailURL": "https://s3-ap-southeast-2.amazonaws.com/openchargemap/images/AT/OCM77319/OCM-77319.thmb.2020080203502970.jpg",
            "Comment": "",
            "IsEnabled": true,
            "IsVideo": false,
            "IsFeaturedItem": false,
            "IsExternalResource": false,
            "User": {
                "ID": 26760,
                "Username": "interssl.com"
            },
            "DateCreated": "2020-08-02T03:51:00Z"
        },
        {
            "ID": 23460,
            "ChargePointID": 77319,
            "ItemURL": "https://s3-ap-southeast-2.amazonaws.com/openchargemap/images/AT/OCM77319/OCM-77319.orig.2020080203504653.jpg",
            "ItemThumbnailURL": "https://s3-ap-southeast-2.amazonaws.com/openchargemap/images/AT/OCM77319/OCM-77319.thmb.2020080203504653.jpg",
            "Comment": "",
            "IsEnabled": true,
            "IsVideo": false,
            "IsFeaturedItem": false,
            "IsExternalResource": false,
            "User": {
                "ID": 26760,
                "Username": "interssl.com"
            },
            "DateCreated": "2020-08-02T03:51:00Z"
        },
        {
            "ID": 23456,
            "ChargePointID": 77319,
            "ItemURL": "https://s3-ap-southeast-2.amazonaws.com/openchargemap/images/AT/OCM77319/OCM-77319.orig.2020080203495211.jpg",
            "ItemThumbnailURL": "https://s3-ap-southeast-2.amazonaws.com/openchargemap/images/AT/OCM77319/OCM-77319.thmb.2020080203495211.jpg",
            "Comment": "",
            "IsEnabled": true,
            "IsVideo": false,
            "IsFeaturedItem": false,
            "IsExternalResource": false,
            "User": {
                "ID": 26760,
                "Username": "interssl.com"
            },
            "DateCreated": "2020-08-02T03:50:00Z"
        },
        {
            "ID": 23457,
            "ChargePointID": 77319,
            "ItemURL": "https://s3-ap-southeast-2.amazonaws.com/openchargemap/images/AT/OCM77319/OCM-77319.orig.2020080203500190.jpg",
            "ItemThumbnailURL": "https://s3-ap-southeast-2.amazonaws.com/openchargemap/images/AT/OCM77319/OCM-77319.thmb.2020080203500190.jpg",
            "Comment": "",
            "IsEnabled": true,
            "IsVideo": false,
            "IsFeaturedItem": false,
            "IsExternalResource": false,
            "User": {
                "ID": 26760,
                "Username": "interssl.com"
            },
            "DateCreated": "2020-08-02T03:50:00Z"
        },
        {
            "ID": 23458,
            "ChargePointID": 77319,
            "ItemURL": "https://s3-ap-southeast-2.amazonaws.com/openchargemap/images/AT/OCM77319/OCM-77319.orig.2020080203501565.jpg",
            "ItemThumbnailURL": "https://s3-ap-southeast-2.amazonaws.com/openchargemap/images/AT/OCM77319/OCM-77319.thmb.2020080203501565.jpg",
            "Comment": "",
            "IsEnabled": true,
            "IsVideo": false,
            "IsFeaturedItem": false,
            "IsExternalResource": false,
            "User": {
                "ID": 26760,
                "Username": "interssl.com"
            },
            "DateCreated": "2020-08-02T03:50:00Z"
        }
    ],
    "IsRecentlyVerified": false,
    "ID": 77319,
    "UUID": "FC106FCE-F62D-47A4-9F03-EFF6BBA84CAE",
    "DataProviderID": 1,
    "OperatorID": 3253,
    "OperatorsReference": "AT*SMA*EAT0701706*001AC",
    "UsageTypeID": 1,
    "UsageCost": "€0,15/min ; Andere Tarife möglich",
    "AddressInfo": {
        "ID": 77665,
        "Title": "Ladestation Carcenter",
        "AddressLine1": "Stöcklfeld 61",
        "Town": "Kirchberg",
        "StateOrProvince": "Tirol",
        "Postcode": "6365",
        "CountryID": 19,
        "Latitude": 47.448412,
        "Longitude": 12.304995,
        "DistanceUnit": 0
    },
    "Connections": [
        {
            "ID": 111398,
            "ConnectionTypeID": 25,
            "StatusTypeID": 50,
            "LevelID": 2,
            "Amps": 32,
            "Voltage": 400,
            "PowerKW": 22,
            "CurrentTypeID": 20,
            "Quantity": 1
        }
    ],
    "NumberOfPoints": 12,
    "StatusTypeID": 50,
    "DateLastStatusUpdate": "2020-08-02T03:51:00Z",
    "DataQualityLevel": 1,
    "DateCreated": "2017-01-09T09:42:00Z",
    "SubmissionStatusTypeID": 200
}