{
    "IsRecentlyVerified": false,
    "ID": 160520,
    "UUID": "7B63E92A-B15D-4432-8492-3FF8A31C49BD",
    "DataProviderID": 2,
    "DataProvidersReference": "157788",
    "UsageTypeID": 2,
    "AddressInfo": {
        "ID": 160877,
        "Title": "Hydro-Quebec",
        "AddressLine1": "6377 rue Garneau",
        "Town": "Sainte-Croix",
        "StateOrProvince": "QC",
        "Postcode": "G0S 2H0",
        "CountryID": 44,
        "Latitude": 46.621888,
        "Longitude": -71.742235,
        "ContactTelephone1": "",
        "AccessComments": "",
        "RelatedURL": "",
        "DistanceUnit": 0
    },
    "Connections": [
        {
            "ID": 230963,
            "ConnectionTypeID": 2,
            "LevelID": 3,
            "Amps": 100,
            "Voltage": 400,
            "PowerKW": 40,
            "CurrentTypeID": 30,
            "Quantity": 1
        },
        {
            "ID": 230964,
            "ConnectionTypeID": 32,
            "LevelID": 3,
            "Amps": 100,
            "Voltage": 400,
            "PowerKW": 40,
            "CurrentTypeID": 30,
            "Quantity": 1
        }
    ],
    "GeneralComments": "Planned for future date. Not Operational.",
    "DatePlanned": "2020-09-01T00:00:00Z",
    "StatusTypeID": 150,
    "DateLastStatusUpdate": "2020-06-26T03:10:00Z",
    "DataQualityLevel": 3,
    "DateCreated": "2020-06-26T03:10:00Z",
    "SubmissionStatusTypeID": 100
}