{
    "IsRecentlyVerified": false,
    "ID": 126832,
    "UUID": "3856AD99-460F-4899-8AD8-7FFF24D2BF2E",
    "DataProviderID": 1,
    "OperatorID": 32,
    "OperatorsReference": "11693",
    "UsageTypeID": 4,
    "UsageCost": "Inclusive; for Polar Plus subscription members only",
    "AddressInfo": {
        "ID": 127178,
        "Title": "Auction Mart Car Park",
        "AddressLine1": "Auction Mart Car Park",
        "Town": "28 Thurnham Street",
        "StateOrProvince": "Lancaster",
        "Postcode": "LA1 1XU",
        "CountryID": 1,
        "Latitude": 54.045059,
        "Longitude": -2.798422,
        "DistanceUnit": 0
    },
    "Connections": [
        {
            "ID": 177640,
            "ConnectionTypeID": 25,
            "StatusTypeID": 50,
            "LevelID": 2,
            "Amps": 32,
            "Voltage": 400,
            "PowerKW": 22,
            "CurrentTypeID": 20,
            "Quantity": 2
        }
    ],
    "NumberOfPoints": 2,
    "GeneralComments": "Unit located in the main car park",
    "StatusTypeID": 50,
    "DateLastStatusUpdate": "2019-05-21T05:15:00Z",
    "DataQualityLevel": 1,
    "DateCreated": "2019-05-21T05:15:00Z",
    "SubmissionStatusTypeID": 200
}