{
    "IsRecentlyVerified": false,
    "ID": 15485,
    "UUID": "14820774-71D7-4DA0-8625-94596377DEE1",
    "DataProviderID": 1,
    "OperatorID": 51,
    "UsageTypeID": 0,
    "UsageCost": "Free",
    "AddressInfo": {
        "ID": 15831,
        "Title": "Budweiser Gardens",
        "AddressLine1": "99 Dundas Street",
        "AddressLine2": "",
        "Town": "London",
        "StateOrProvince": "ON ",
        "Postcode": "N6A 6K1",
        "CountryID": 44,
        "Latitude": 42.9826124,
        "Longitude": -81.2516842,
        "ContactTelephone1": "+1 519-667-5700",
        "ContactTelephone2": "",
        "ContactEmail": "",
        "AccessComments": "",
        "RelatedURL": "http://www.budweisergardens.com",
        "DistanceUnit": 0
    },
    "Connections": [
        {
            "ID": 13801,
            "ConnectionTypeID": 1,
            "StatusTypeID": 0,
            "LevelID": 2,
            "Amps": 72,
            "Voltage": 240,
            "PowerKW": 17.3,
            "Quantity": 1
        }
    ],
    "NumberOfPoints": 1,
    "GeneralComments": "",
    "StatusTypeID": 150,
    "DateLastStatusUpdate": "2013-01-10T18:33:00Z",
    "DataQualityLevel": 1,
    "DateCreated": "2013-01-10T18:33:00Z",
    "SubmissionStatusTypeID": 200
}