{
    "IsRecentlyVerified": false,
    "ID": 143925,
    "UUID": "1EEE3C2D-BBB5-496D-9FF3-27ECCA47F768",
    "DataProviderID": 2,
    "DataProvidersReference": "95137",
    "OperatorID": 9,
    "UsageTypeID": 1,
    "AddressInfo": {
        "ID": 144277,
        "Title": "Salem - Central Library",
        "AddressLine1": "585 Liberty Street SE",
        "Town": "Salem",
        "StateOrProvince": "OR",
        "Postcode": "97301",
        "CountryID": 2,
        "Latitude": 44.93486,
        "Longitude": -123.041872,
        "ContactTelephone1": "888-998-2546",
        "AccessComments": "MON: 24 hours | TUE: 24 hours | WED: 24 hours | THU: 24 hours | FRI: 24 hours | SAT: 24 hours | SUN: 24 hours",
        "RelatedURL": "http://www.blinkcharging.com/",
        "DistanceUnit": 0
    },
    "Connections": [
        {
            "ID": 200349,
            "ConnectionTypeID": 1,
            "LevelID": 2,
            "Amps": 16,
            "Voltage": 230,
            "PowerKW": 3.7,
            "CurrentTypeID": 10,
            "Quantity": 2
        }
    ],
    "StatusTypeID": 50,
    "DateLastStatusUpdate": "2020-06-26T03:08:00Z",
    "DataQualityLevel": 3,
    "DateCreated": "2019-12-24T09:22:00Z",
    "SubmissionStatusTypeID": 100
}