{
    "IsRecentlyVerified": false,
    "ID": 101859,
    "UUID": "854BA62A-EB4C-49D3-8908-0A34024DD615",
    "DataProviderID": 1,
    "OperatorID": 45,
    "UsageTypeID": 4,
    "AddressInfo": {
        "ID": 102205,
        "Title": "Supermarkt Kaufland",
        "AddressLine1": "Bühlertalstraße 71",
        "Town": "Bühl",
        "StateOrProvince": "Vereinbarte Verwaltungsgemeinschaft Bühl",
        "Postcode": "77815",
        "CountryID": 87,
        "Latitude": 48.6957759,
        "Longitude": 8.147005000000036,
        "AccessComments": "2 weiß markierte Parkplätze in Eingangsnähe, von Mo-Sa 07-22Uhr nutzbar.",
        "DistanceUnit": 0
    },
    "Connections": [
        {
            "ID": 143790,
            "ConnectionTypeID": 1036,
            "StatusTypeID": 50,
            "LevelID": 3,
            "Amps": 63,
            "Voltage": 400,
            "PowerKW": 43,
            "CurrentTypeID": 20,
            "Quantity": 1
        },
        {
            "ID": 143791,
            "ConnectionTypeID": 2,
            "StatusTypeID": 50,
            "LevelID": 3,
            "PowerKW": 50,
            "CurrentTypeID": 30,
            "Quantity": 1
        },
        {
            "ID": 143792,
            "ConnectionTypeID": 33,
            "StatusTypeID": 50,
            "LevelID": 3,
            "PowerKW": 50,
            "CurrentTypeID": 30,
            "Quantity": 1
        }
    ],
    "NumberOfPoints": 3,
    "StatusTypeID": 50,
    "DateLastStatusUpdate": "2018-04-12T12:43:00Z",
    "DataQualityLevel": 1,
    "DateCreated": "2018-04-12T12:43:00Z",
    "SubmissionStatusTypeID": 200
}