{
    "IsRecentlyVerified": false,
    "ID": 110851,
    "UUID": "DCDF07D6-B5F8-4A34-9BF4-8CC04F587B5C",
    "DataProviderID": 2,
    "DataProvidersReference": "94487",
    "UsageTypeID": 1,
    "AddressInfo": {
        "ID": 111197,
        "Title": "Scotiabank",
        "AddressLine1": "10 Wright Blvd",
        "Town": "Stratford",
        "StateOrProvince": "ON",
        "Postcode": "N4Z 1H3",
        "CountryID": 44,
        "Latitude": 43.360712,
        "Longitude": -81.008414,
        "ContactTelephone1": "800-567-1331",
        "AccessComments": "24 hours daily",
        "RelatedURL": "",
        "DistanceUnit": 0
    },
    "Connections": [
        {
            "ID": 156155,
            "ConnectionTypeID": 2,
            "LevelID": 3,
            "Amps": 100,
            "Voltage": 400,
            "PowerKW": 40,
            "CurrentTypeID": 30,
            "Quantity": 1
        },
        {
            "ID": 156156,
            "ConnectionTypeID": 32,
            "LevelID": 3,
            "Amps": 100,
            "Voltage": 400,
            "PowerKW": 40,
            "CurrentTypeID": 30,
            "Quantity": 1
        }
    ],
    "DateLastStatusUpdate": "2020-06-26T03:07:00Z",
    "DataQualityLevel": 3,
    "DateCreated": "2018-10-18T23:36:00Z",
    "SubmissionStatusTypeID": 100
}