{
    "IsRecentlyVerified": false,
    "ID": 29154,
    "UUID": "699980C4-BD75-4E46-8F91-C45FD5FBFA6A",
    "DataProviderID": 2,
    "DataProvidersReference": "63607",
    "UsageTypeID": 1,
    "AddressInfo": {
        "ID": 29500,
        "Title": "Appalachian Mountain Club - Highland Center at Crawford Notch",
        "AddressLine1": "Route 302",
        "Town": "Bretton Woods",
        "StateOrProvince": "NH",
        "Postcode": "03575",
        "CountryID": 2,
        "Latitude": 44.220181,
        "Longitude": -71.411158,
        "ContactTelephone1": "603-278-4453",
        "AccessComments": "24 hours daily; donations accepted",
        "RelatedURL": "",
        "DistanceUnit": 0
    },
    "Connections": [
        {
            "ID": 32036,
            "ConnectionTypeID": 1,
            "LevelID": 2,
            "Amps": 16,
            "Voltage": 230,
            "PowerKW": 3.7,
            "CurrentTypeID": 10,
            "Quantity": 1
        }
    ],
    "DateLastStatusUpdate": "2020-06-26T03:07:00Z",
    "DataQualityLevel": 3,
    "DateCreated": "2014-11-28T03:39:00Z",
    "SubmissionStatusTypeID": 100
}