{
    "IsRecentlyVerified": false,
    "ID": 119961,
    "UUID": "A7A2CD7D-9EA2-4518-9126-5B786DC71C2E",
    "DataProviderID": 2,
    "DataProvidersReference": "87924",
    "OperatorID": 5,
    "UsageTypeID": 1,
    "AddressInfo": {
        "ID": 120307,
        "Title": "UNIV OF FLORIDA",
        "AddressLine1": "226 Gale Lemerand Dr",
        "Town": "Gainesville",
        "StateOrProvince": "FL",
        "Postcode": "32611",
        "CountryID": 2,
        "Latitude": 29.65017,
        "Longitude": -82.350386,
        "ContactTelephone1": "888-758-4389",
        "AccessComments": "24 hours daily",
        "RelatedURL": "http://www.chargepoint.com/",
        "DistanceUnit": 0
    },
    "Connections": [
        {
            "ID": 169266,
            "ConnectionTypeID": 1,
            "LevelID": 2,
            "Amps": 16,
            "Voltage": 230,
            "PowerKW": 3.7,
            "CurrentTypeID": 10,
            "Quantity": 4
        }
    ],
    "DateLastStatusUpdate": "2020-06-26T02:53:00Z",
    "DataQualityLevel": 3,
    "DateCreated": "2019-04-01T04:59:00Z",
    "SubmissionStatusTypeID": 100
}