{
    "UserComments": [
        {
            "ID": 23362,
            "ChargePointID": 99939,
            "CommentTypeID": 10,
            "UserName": "ForumElettrico.it",
            "Comment": "Testato card Hera su CCS: nessun problema. Leggi la recensione completa qui >  https://www.forumelettrico.it/forum/post144034.html#p144034",
            "RelatedURL": "https://www.forumelettrico.it/forum/post144034.html#p144034",
            "DateCreated": "2020-10-11T15:39:17.897Z",
            "User": {
                "ID": 11749,
                "Username": "ForumElettrico.it"
            },
            "CheckinStatusTypeID": 10,
            "IsActionedByEditor": false
        },
        {
            "ID": 22758,
            "ChargePointID": 99939,
            "CommentTypeID": 10,
            "UserName": "ForumElettrico.it",
            "Comment": "Tutto regolare con card Enel X su CHAdeMO. Leggi la recensione completa qui > https://www.forumelettrico.it/forum/colonnina-evad-coop-castel-san-giovanni-via-emilia-piacentina-t2263-10.html#p111594\r\n",
            "RelatedURL": "https://www.forumelettrico.it/forum/colonnina-evad-coop-castel-san-giovanni-via-emilia-piacentina-t2263-10.html#p111594",
            "DateCreated": "2020-06-07T16:15:33.363Z",
            "User": {
                "ID": 11749,
                "Username": "ForumElettrico.it"
            },
            "CheckinStatusTypeID": 10,
            "IsActionedByEditor": false
        },
        {
            "ID": 19192,
            "ChargePointID": 99939,
            "CommentTypeID": 10,
            "UserName": "ForumElettrico.it",
            "RelatedURL": "https://www.forumelettrico.it/forum/colonnina-evad-coop-castel-san-giovanni-via-emilia-piacentina-t2263.html",
            "DateCreated": "2018-02-14T16:43:10.527Z",
            "User": {
                "ID": 11749,
                "Username": "ForumElettrico.it"
            },
            "CheckinStatusTypeID": 0
        },
        {
            "ID": 19191,
            "ChargePointID": 99939,
            "CommentTypeID": 10,
            "UserName": "ForumElettrico.it",
            "Comment": "https://www.forumelettrico.it/forum/colonnina-evad-coop-castel-san-giovanni-via-emilia-piacentina-t2263.html\n",
            "DateCreated": "2018-02-14T16:42:52.56Z",
            "User": {
                "ID": 11749,
                "Username": "ForumElettrico.it"
            },
            "CheckinStatusTypeID": 10
        }
    ],
    "MediaItems": [
        {
            "ID": 25044,
            "ChargePointID": 99939,
            "ItemURL": "https://s3-ap-southeast-2.amazonaws.com/openchargemap/images/IT/OCM99939/OCM-99939.orig.2020101115392832.jpg",
            "ItemThumbnailURL": "https://s3-ap-southeast-2.amazonaws.com/openchargemap/images/IT/OCM99939/OCM-99939.thmb.2020101115392832.jpg",
            "Comment": "",
            "IsEnabled": true,
            "IsVideo": false,
            "IsFeaturedItem": false,
            "IsExternalResource": false,
            "User": {
                "ID": 11749,
                "Username": "ForumElettrico.it"
            },
            "DateCreated": "2020-10-11T15:40:00Z"
        },
        {
            "ID": 22607,
            "ChargePointID": 99939,
            "ItemURL": "https://s3-ap-southeast-2.amazonaws.com/openchargemap/images/IT/OCM99939/OCM-99939.orig.2020060716154579.jpg",
            "ItemThumbnailURL": "https://s3-ap-southeast-2.amazonaws.com/openchargemap/images/IT/OCM99939/OCM-99939.thmb.2020060716154579.jpg",
            "Comment": "",
            "IsEnabled": true,
            "IsVideo": false,
            "IsFeaturedItem": false,
            "IsExternalResource": false,
            "User": {
                "ID": 11749,
                "Username": "ForumElettrico.it"
            },
            "DateCreated": "2020-06-07T16:16:00Z"
        },
        {
            "ID": 22608,
            "ChargePointID": 99939,
            "ItemURL": "https://s3-ap-southeast-2.amazonaws.com/openchargemap/images/IT/OCM99939/OCM-99939.orig.2020060716155148.jpg",
            "ItemThumbnailURL": "https://s3-ap-southeast-2.amazonaws.com/openchargemap/images/IT/OCM99939/OCM-99939.thmb.2020060716155148.jpg",
            "Comment": "",
            "IsEnabled": true,
            "IsVideo": false,
            "IsFeaturedItem": false,
            "IsExternalResource": false,
            "User": {
                "ID": 11749,
                "Username": "ForumElettrico.it"
            },
            "DateCreated": "2020-06-07T16:16:00Z"
        },
        {
            "ID": 22609,
            "ChargePointID": 99939,
            "ItemURL": "https://s3-ap-southeast-2.amazonaws.com/openchargemap/images/IT/OCM99939/OCM-99939.orig.2020060716155845.jpg",
            "ItemThumbnailURL": "https://s3-ap-southeast-2.amazonaws.com/openchargemap/images/IT/OCM99939/OCM-99939.thmb.2020060716155845.jpg",
            "Comment": "",
            "IsEnabled": true,
            "IsVideo": false,
            "IsFeaturedItem": false,
            "IsExternalResource": false,
            "User": {
                "ID": 11749,
                "Username": "ForumElettrico.it"
            },
            "DateCreated": "2020-06-07T16:16:00Z"
        },
        {
            "ID": 22610,
            "ChargePointID": 99939,
            "ItemURL": "https://s3-ap-southeast-2.amazonaws.com/openchargemap/images/IT/OCM99939/OCM-99939.orig.2020060716160526.jpg",
            "ItemThumbnailURL": "https://s3-ap-southeast-2.amazonaws.com/openchargemap/images/IT/OCM99939/OCM-99939.thmb.2020060716160526.jpg",
            "Comment": "",
            "IsEnabled": true,
            "IsVideo": false,
            "IsFeaturedItem": false,
            "IsExternalResource": false,
            "User": {
                "ID": 11749,
                "Username": "ForumElettrico.it"
            },
            "DateCreated": "2020-06-07T16:16:00Z"
        },
        {
            "ID": 15069,
            "ChargePointID": 99939,
            "ItemURL": "https://s3-ap-southeast-2.amazonaws.com/openchargemap/images/IT/OCM99939/OCM-99939.orig.2018021416434037.jpg",
            "ItemThumbnailURL": "https://s3-ap-southeast-2.amazonaws.com/openchargemap/images/IT/OCM99939/OCM-99939.thmb.2018021416434037.jpg",
            "Comment": "",
            "IsEnabled": true,
            "IsVideo": false,
            "IsFeaturedItem": false,
            "IsExternalResource": false,
            "User": {
                "ID": 11749,
                "Username": "ForumElettrico.it"
            },
            "DateCreated": "2018-02-14T16:44:00Z"
        },
        {
            "ID": 15070,
            "ChargePointID": 99939,
            "ItemURL": "https://s3-ap-southeast-2.amazonaws.com/openchargemap/images/IT/OCM99939/OCM-99939.orig.2018021416434749.jpg",
            "ItemThumbnailURL": "https://s3-ap-southeast-2.amazonaws.com/openchargemap/images/IT/OCM99939/OCM-99939.thmb.2018021416434749.jpg",
            "Comment": "",
            "IsEnabled": true,
            "IsVideo": false,
            "IsFeaturedItem": false,
            "IsExternalResource": false,
            "User": {
                "ID": 11749,
                "Username": "ForumElettrico.it"
            },
            "DateCreated": "2018-02-14T16:44:00Z"
        }
    ],
    "IsRecentlyVerified": false,
    "ID": 99939,
    "UUID": "2DE4D8A1-F1F5-422E-90AA-1A390F0642AB",
    "DataProviderID": 1,
    "OperatorID": 80,
    "UsageTypeID": 4,
    "UsageCost": "0,40 €/kWh",
    "AddressInfo": {
        "ID": 100285,
        "Title": "EnelX EVA+ Castel San Giovanni COOP",
        "AddressLine1": "Viale Emilia Piacentina ang. via Don Mazzocchi",
        "Town": "Castel San Giovanni",
        "StateOrProvince": "PC",
        "Postcode": "29015",
        "CountryID": 112,
        "Latitude": 45.0579360329064,
        "Longitude": 9.44778464755107,
        "RelatedURL": "http://eneldrive.it",
        "DistanceUnit": 0
    },
    "Connections": [
        {
            "ID": 141185,
            "ConnectionTypeID": 33,
            "StatusTypeID": 50,
            "LevelID": 3,
            "PowerKW": 50,
            "CurrentTypeID": 30,
            "Quantity": 1
        },
        {
            "ID": 141186,
            "ConnectionTypeID": 2,
            "StatusTypeID": 50,
            "LevelID": 3,
            "PowerKW": 50,
            "CurrentTypeID": 30,
            "Quantity": 1
        },
        {
            "ID": 141187,
            "ConnectionTypeID": 1036,
            "StatusTypeID": 50,
            "LevelID": 3,
            "Amps": 64,
            "Voltage": 400,
            "PowerKW": 43,
            "CurrentTypeID": 20,
            "Quantity": 1
        }
    ],
    "NumberOfPoints": 2,
    "StatusTypeID": 50,
    "DateLastStatusUpdate": "2020-10-11T15:40:00Z",
    "DataQualityLevel": 1,
    "DateCreated": "2018-02-08T17:38:00Z",
    "SubmissionStatusTypeID": 200
}