{
    "UserComments": [
        {
            "ID": 21563,
            "ChargePointID": 132350,
            "CommentTypeID": 10,
            "UserName": "ForumElettrico.it",
            "RelatedURL": "https://www.forumelettrico.it/forum/colonnine-be-charge-22-kw-talent-garden-calabiana-milano-mi-via-arcivescovo-calabiana-6-t7207.html",
            "DateCreated": "2019-09-27T08:28:10.95Z",
            "User": {
                "ID": 11749,
                "Username": "ForumElettrico.it"
            },
            "CheckinStatusTypeID": 140
        }
    ],
    "MediaItems": [
        {
            "ID": 28078,
            "ChargePointID": 132350,
            "ItemURL": "https://s3-ap-southeast-2.amazonaws.com/openchargemap/images/IT/OCM132350/OCM-132350.orig.2021060817543431.jpg",
            "ItemThumbnailURL": "https://s3-ap-southeast-2.amazonaws.com/openchargemap/images/IT/OCM132350/OCM-132350.thmb.2021060817543431.jpg",
            "Comment": "",
            "IsEnabled": true,
            "IsVideo": false,
            "IsFeaturedItem": false,
            "IsExternalResource": false,
            "User": {
                "ID": 32651,
                "Username": "NicoNiki"
            },
            "DateCreated": "2021-06-08T17:55:00Z"
        },
        {
            "ID": 28079,
            "ChargePointID": 132350,
            "ItemURL": "https://s3-ap-southeast-2.amazonaws.com/openchargemap/images/IT/OCM132350/OCM-132350.orig.2021060817544333.jpg",
            "ItemThumbnailURL": "https://s3-ap-southeast-2.amazonaws.com/openchargemap/images/IT/OCM132350/OCM-132350.thmb.2021060817544333.jpg",
            "Comment": "",
            "IsEnabled": true,
            "IsVideo": false,
            "IsFeaturedItem": false,
            "IsExternalResource": false,
            "User": {
                "ID": 32651,
                "Username": "NicoNiki"
            },
            "DateCreated": "2021-06-08T17:55:00Z"
        },
        {
            "ID": 28080,
            "ChargePointID": 132350,
            "ItemURL": "https://s3-ap-southeast-2.amazonaws.com/openchargemap/images/IT/OCM132350/OCM-132350.orig.2021060817545528.jpg",
            "ItemThumbnailURL": "https://s3-ap-southeast-2.amazonaws.com/openchargemap/images/IT/OCM132350/OCM-132350.thmb.2021060817545528.jpg",
            "Comment": "",
            "IsEnabled": true,
            "IsVideo": false,
            "IsFeaturedItem": false,
            "IsExternalResource": false,
            "User": {
                "ID": 32651,
                "Username": "NicoNiki"
            },
            "DateCreated": "2021-06-08T17:55:00Z"
        },
        {
            "ID": 28081,
            "ChargePointID": 132350,
            "ItemURL": "https://s3-ap-southeast-2.amazonaws.com/openchargemap/images/IT/OCM132350/OCM-132350.orig.2021060817550573.jpg",
            "ItemThumbnailURL": "https://s3-ap-southeast-2.amazonaws.com/openchargemap/images/IT/OCM132350/OCM-132350.thmb.2021060817550573.jpg",
            "Comment": "",
            "IsEnabled": true,
            "IsVideo": false,
            "IsFeaturedItem": false,
            "IsExternalResource": false,
            "User": {
                "ID": 32651,
                "Username": "NicoNiki"
            },
            "DateCreated": "2021-06-08T17:55:00Z"
        },
        {
            "ID": 28077,
            "ChargePointID": 132350,
            "ItemURL": "https://s3-ap-southeast-2.amazonaws.com/openchargemap/images/IT/OCM132350/OCM-132350.orig.2021060817541934.jpg",
            "ItemThumbnailURL": "https://s3-ap-southeast-2.amazonaws.com/openchargemap/images/IT/OCM132350/OCM-132350.thmb.2021060817541934.jpg",
            "Comment": "",
            "IsEnabled": true,
            "IsVideo": false,
            "IsFeaturedItem": false,
            "IsExternalResource": false,
            "User": {
                "ID": 32651,
                "Username": "NicoNiki"
            },
            "DateCreated": "2021-06-08T17:54:00Z"
        },
        {
            "ID": 19714,
            "ChargePointID": 132350,
            "ItemURL": "https://s3-ap-southeast-2.amazonaws.com/openchargemap/images/IT/OCM132350/OCM-132350.orig.2019092708282397.jpg",
            "ItemThumbnailURL": "https://s3-ap-southeast-2.amazonaws.com/openchargemap/images/IT/OCM132350/OCM-132350.thmb.2019092708282397.jpg",
            "Comment": "",
            "IsEnabled": true,
            "IsVideo": false,
            "IsFeaturedItem": false,
            "IsExternalResource": false,
            "User": {
                "ID": 11749,
                "Username": "ForumElettrico.it"
            },
            "DateCreated": "2019-09-27T08:29:00Z"
        },
        {
            "ID": 19715,
            "ChargePointID": 132350,
            "ItemURL": "https://s3-ap-southeast-2.amazonaws.com/openchargemap/images/IT/OCM132350/OCM-132350.orig.2019092708283353.jpg",
            "ItemThumbnailURL": "https://s3-ap-southeast-2.amazonaws.com/openchargemap/images/IT/OCM132350/OCM-132350.thmb.2019092708283353.jpg",
            "Comment": "",
            "IsEnabled": true,
            "IsVideo": false,
            "IsFeaturedItem": false,
            "IsExternalResource": false,
            "User": {
                "ID": 11749,
                "Username": "ForumElettrico.it"
            },
            "DateCreated": "2019-09-27T08:29:00Z"
        }
    ],
    "IsRecentlyVerified": false,
    "ID": 132350,
    "UUID": "DCA63141-E4B4-4BC7-BA88-20C2948A80EF",
    "DataProviderID": 1,
    "OperatorID": 3327,
    "UsageTypeID": 2,
    "AddressInfo": {
        "ID": 132696,
        "Title": "Destination Zero Talent Garden Calabiana",
        "AddressLine1": "Via Arcivescovo Calabiana 6",
        "Town": "Milano",
        "StateOrProvince": "MI",
        "CountryID": 112,
        "Latitude": 45.44422566182919,
        "Longitude": 9.207734679661257,
        "RelatedURL": "https://www.forumelettrico.it/forum/colonnine-be-charge-22-kw-talent-garden-calabiana-milano-mi-via-arcivescovo-calabiana-6-t7207.html",
        "DistanceUnit": 0
    },
    "Connections": [
        {
            "ID": 185239,
            "ConnectionTypeID": 1036,
            "StatusTypeID": 50,
            "LevelID": 2,
            "Quantity": 2
        }
    ],
    "NumberOfPoints": 1,
    "StatusTypeID": 50,
    "DateLastStatusUpdate": "2021-06-09T10:35:00Z",
    "DataQualityLevel": 1,
    "DateCreated": "2019-09-27T08:28:00Z",
    "SubmissionStatusTypeID": 200
}