{
    "IsRecentlyVerified": false,
    "ID": 165243,
    "UUID": "03F712B3-D6F9-415C-9F7A-AADE6C786CCF",
    "DataProviderID": 1,
    "DataProvidersReference": "TR-IST-093",
    "OperatorID": 70,
    "UsageTypeID": 1,
    "AddressInfo": {
        "ID": 165602,
        "Title": "Eşarj - Bi Mola Fenertepe, Eyüp",
        "AddressLine1": "Bi Mola Fenertepe Dinlenme Tesisleri, Kuzey Marmara Otoyolu, Pirinççi Köyü, 34076, Eyüp",
        "Town": "İstanbul",
        "StateOrProvince": "İstanbul",
        "Postcode": "34076",
        "CountryID": 229,
        "Latitude": 41.198738,
        "Longitude": 28.822584,
        "ContactTelephone1": "+90 (850) 433 72 75",
        "ContactEmail": "destek@esarj.com",
        "RelatedURL": "https://esarj.com/en/map?s=TR-IST-093",
        "DistanceUnit": 0
    },
    "Connections": [
        {
            "ID": 236912,
            "ConnectionTypeID": 2,
            "LevelID": 2,
            "Amps": 125,
            "Voltage": 500,
            "PowerKW": 45,
            "Quantity": 1
        },
        {
            "ID": 236913,
            "ConnectionTypeID": 2,
            "LevelID": 2,
            "Amps": 120,
            "Voltage": 500,
            "PowerKW": 45,
            "Quantity": 1
        },
        {
            "ID": 236914,
            "ConnectionTypeID": 2,
            "LevelID": 2,
            "Amps": 32,
            "Voltage": 380,
            "PowerKW": 22,
            "Quantity": 1
        }
    ],
    "GeneralComments": "Eşarj Charging Systems",
    "StatusTypeID": 50,
    "DateLastStatusUpdate": "2020-08-26T08:19:00Z",
    "DataQualityLevel": 3,
    "DateCreated": "2020-08-26T08:19:00Z",
    "SubmissionStatusTypeID": 200
}