{
    "IsRecentlyVerified": false,
    "ID": 85997,
    "UUID": "0CC03AB3-9ED7-46DC-B17B-5D6652AA4216",
    "DataProviderID": 1,
    "OperatorID": 220,
    "OperatorsReference": "2014",
    "UsageTypeID": 1,
    "UsageCost": "€1.73 + €0.3213/kWh; Andere Tarife möglich",
    "AddressInfo": {
        "ID": 86343,
        "Title": "Elbchaussee 139",
        "AddressLine1": "Elbchaussee 139",
        "Town": "Altona",
        "StateOrProvince": "Hamburg",
        "Postcode": "22763",
        "CountryID": 87,
        "Latitude": 53.5460092628143,
        "Longitude": 9.91435244679451,
        "DistanceUnit": 0
    },
    "Connections": [
        {
            "ID": 122171,
            "ConnectionTypeID": 28,
            "StatusTypeID": 50,
            "LevelID": 2,
            "Amps": 16,
            "Voltage": 230,
            "PowerKW": 3.7,
            "CurrentTypeID": 10,
            "Quantity": 2
        },
        {
            "ID": 122172,
            "ConnectionTypeID": 25,
            "StatusTypeID": 50,
            "LevelID": 2,
            "Amps": 32,
            "Voltage": 400,
            "PowerKW": 22,
            "CurrentTypeID": 20,
            "Quantity": 1
        },
        {
            "ID": 122210,
            "ConnectionTypeID": 25,
            "StatusTypeID": 50,
            "LevelID": 2,
            "Amps": 32,
            "Voltage": 400,
            "PowerKW": 11,
            "CurrentTypeID": 20,
            "Quantity": 1
        }
    ],
    "NumberOfPoints": 2,
    "StatusTypeID": 50,
    "DateLastStatusUpdate": "2017-06-09T05:45:00Z",
    "DataQualityLevel": 1,
    "DateCreated": "2017-04-20T16:43:00Z",
    "SubmissionStatusTypeID": 200
}