{
    "IsRecentlyVerified": false,
    "ID": 104480,
    "UUID": "59C4A87B-67AA-449A-84BD-8B840DDDA3D8",
    "DataProviderID": 1,
    "OperatorID": 23,
    "OperatorsReference": "43218",
    "UsageTypeID": 4,
    "AddressInfo": {
        "ID": 104826,
        "Title": "The Idle Rocks Hotel",
        "AddressLine1": "The Idle Rocks Hotel Harbourside",
        "Town": "St Mawes",
        "Postcode": "TR2 5AN",
        "CountryID": 1,
        "Latitude": 50.15914,
        "Longitude": -5.013321,
        "ContactTelephone1": "+44 132 627 0270",
        "DistanceUnit": 0
    },
    "Connections": [
        {
            "ID": 147475,
            "ConnectionTypeID": 30,
            "StatusTypeID": 50,
            "LevelID": 2,
            "Amps": 32,
            "Voltage": 230,
            "PowerKW": 13,
            "CurrentTypeID": 20,
            "Quantity": 2
        }
    ],
    "NumberOfPoints": 2,
    "GeneralComments": "2 Tesla Connectors, up to 13kW.Available for customers. Please see front desk.",
    "StatusTypeID": 50,
    "DateLastStatusUpdate": "2018-10-03T17:47:00Z",
    "DataQualityLevel": 1,
    "DateCreated": "2018-05-20T05:43:00Z",
    "SubmissionStatusTypeID": 200
}