{
    "IsRecentlyVerified": false,
    "ID": 156541,
    "UUID": "39D63374-E83A-4238-B67B-8BBFCB0B9CC2",
    "DataProviderID": 19,
    "DataProvidersReference": "3450",
    "AddressInfo": {
        "ID": 156895,
        "Title": "Bee Helsingborg",
        "AddressLine1": "Stortorget 7",
        "Town": "HELSINGBORG",
        "StateOrProvince": "SKÅNE",
        "Postcode": "25220",
        "CountryID": 216,
        "Latitude": 56.04666,
        "Longitude": 12.69372,
        "AccessComments": "Stortorget Helsingborg",
        "DistanceUnit": 0
    },
    "Connections": [
        {
            "ID": 220520,
            "ConnectionTypeID": 25,
            "Reference": "1",
            "LevelID": 3,
            "Amps": 32,
            "Voltage": 400,
            "PowerKW": 22,
            "CurrentTypeID": 30,
            "Comments": "Mode 3"
        },
        {
            "ID": 220521,
            "ConnectionTypeID": 25,
            "Reference": "2",
            "LevelID": 3,
            "Amps": 32,
            "Voltage": 400,
            "PowerKW": 22,
            "CurrentTypeID": 30,
            "Comments": "Mode 3"
        },
        {
            "ID": 220522,
            "ConnectionTypeID": 25,
            "Reference": "3",
            "LevelID": 3,
            "Amps": 32,
            "Voltage": 400,
            "PowerKW": 22,
            "CurrentTypeID": 30,
            "Comments": "Mode 3"
        },
        {
            "ID": 220523,
            "ConnectionTypeID": 25,
            "Reference": "4",
            "LevelID": 3,
            "Amps": 32,
            "Voltage": 400,
            "PowerKW": 22,
            "CurrentTypeID": 30,
            "Comments": "Mode 3"
        }
    ],
    "NumberOfPoints": 4,
    "StatusTypeID": 0,
    "DateLastStatusUpdate": "2021-03-24T05:10:00Z",
    "DataQualityLevel": 2,
    "DateCreated": "2020-05-26T08:21:00Z",
    "SubmissionStatusTypeID": 100
}