{
    "IsRecentlyVerified": false,
    "ID": 29513,
    "UUID": "1DDB4308-A4C5-43CC-BE93-A3322A37AB53",
    "DataProviderID": 15,
    "DataProvidersReference": "21379",
    "OperatorID": 5,
    "AddressInfo": {
        "ID": 29859,
        "Title": "9801 International Dr",
        "AddressLine1": "9801 International Dr",
        "Town": "Orlando",
        "StateOrProvince": "Florida",
        "Postcode": "32819",
        "CountryID": 2,
        "Latitude": 28.42881584,
        "Longitude": -81.46891785,
        "ContactTelephone1": "",
        "RelatedURL": "http://carstations.com/21379",
        "DistanceUnit": 0
    },
    "Connections": [
        {
            "ID": 32498,
            "ConnectionTypeID": 1,
            "Reference": "J1772",
            "LevelID": 2
        }
    ],
    "StatusTypeID": 0,
    "DateLastStatusUpdate": "2017-11-04T14:03:00Z",
    "DataQualityLevel": 2,
    "DateCreated": "2014-11-29T05:39:00Z",
    "SubmissionStatusTypeID": 100
}