{
    "IsRecentlyVerified": false,
    "ID": 63378,
    "UUID": "173E97CF-ABCD-487D-B627-5EC880F9F1E0",
    "DataProviderID": 26,
    "DataProvidersReference": "76923",
    "OperatorID": 73,
    "OperatorsReference": "EV-Box EVB-P1521089",
    "UsageCost": "0.00 jaarabonnement",
    "AddressInfo": {
        "ID": 63724,
        "Title": "Nieuwstraat 21",
        "AddressLine1": "Nieuwstraat 21",
        "Town": "Rheden",
        "Postcode": "6881 SK",
        "CountryID": 159,
        "Latitude": 51.99413,
        "Longitude": 5.97173,
        "RelatedURL": "http://www.ev-box.nl",
        "DistanceUnit": 0
    },
    "Connections": [
        {
            "ID": 80795,
            "ConnectionTypeID": 25,
            "LevelID": 2,
            "PowerKW": 11,
            "CurrentTypeID": 10
        },
        {
            "ID": 80796,
            "ConnectionTypeID": 25,
            "LevelID": 2,
            "PowerKW": 11,
            "CurrentTypeID": 10
        }
    ],
    "NumberOfPoints": 1,
    "StatusTypeID": 50,
    "DateLastStatusUpdate": "2016-06-04T02:43:00Z",
    "DataQualityLevel": 3,
    "DateCreated": "2016-03-03T12:30:00Z",
    "SubmissionStatusTypeID": 100
}