{
    "IsRecentlyVerified": false,
    "ID": 67185,
    "UUID": "6D6B0310-3A92-4A35-AC16-B44A540F5EFD",
    "DataProviderID": 2,
    "DataProvidersReference": "75314",
    "UsageTypeID": 1,
    "AddressInfo": {
        "ID": 67531,
        "Title": "Brown Harris Wealth Management",
        "AddressLine1": "309 N Main St",
        "Town": "Culpeper",
        "StateOrProvince": "VA",
        "Postcode": "22701",
        "CountryID": 2,
        "Latitude": 38.475325,
        "Longitude": -77.995127,
        "ContactTelephone1": "",
        "AccessComments": "24 hours daily",
        "RelatedURL": "",
        "DistanceUnit": 0
    },
    "Connections": [
        {
            "ID": 92684,
            "ConnectionTypeID": 1,
            "LevelID": 2,
            "Amps": 16,
            "Voltage": 230,
            "PowerKW": 3.7,
            "CurrentTypeID": 10,
            "Quantity": 2
        }
    ],
    "DateLastStatusUpdate": "2020-06-26T03:00:00Z",
    "DataQualityLevel": 3,
    "DateCreated": "2016-05-29T02:04:00Z",
    "SubmissionStatusTypeID": 100
}