{
    "IsRecentlyVerified": false,
    "ID": 45152,
    "UUID": "EC978D58-C787-4E3A-BD3B-CA61AB9B1495",
    "DataProviderID": 1,
    "OperatorID": 45,
    "UsageTypeID": 1,
    "UsageCost": "",
    "AddressInfo": {
        "ID": 45498,
        "Title": "E-Bike Station Energieversorgung Dahlenburg-Bleckede AG",
        "AddressLine1": "Schlossstraße 10",
        "AddressLine2": "",
        "Town": "Bleckede",
        "StateOrProvince": "Landkreis Lüneburg",
        "Postcode": "21354",
        "CountryID": 87,
        "Latitude": 53.295945937257315,
        "Longitude": 10.727575421333311,
        "ContactTelephone1": "+49-5851-955-31",
        "ContactTelephone2": "",
        "ContactEmail": "",
        "AccessComments": "Freier Zugang, 24/7 nutzbare weißgrüne Ladestation am Zaun an den Fahrradbügeln am Zugangsweg zum Schlosshof, der jedoch nur mit dem Fahrrad oder zu Fuß zugänglich ist.",
        "RelatedURL": "https://www.evdbag.de",
        "DistanceUnit": 0
    },
    "Connections": [
        {
            "ID": 55649,
            "ConnectionTypeID": 28,
            "StatusTypeID": 50,
            "LevelID": 2,
            "Amps": 16,
            "Voltage": 230,
            "PowerKW": 3.7,
            "CurrentTypeID": 10,
            "Quantity": 4
        }
    ],
    "NumberOfPoints": 4,
    "GeneralComments": "",
    "StatusTypeID": 50,
    "DateLastStatusUpdate": "2017-02-15T08:31:00Z",
    "DataQualityLevel": 1,
    "DateCreated": "2015-04-26T10:32:00Z",
    "SubmissionStatusTypeID": 200
}