{
    "IsRecentlyVerified": false,
    "ID": 119763,
    "UUID": "D2C8C9DF-F65D-4034-B245-A8E53E171608",
    "DataProviderID": 2,
    "DataProvidersReference": "78363",
    "UsageTypeID": 1,
    "AddressInfo": {
        "ID": 120109,
        "Title": "Tampa International Airport - Short Term Parking Lot",
        "AddressLine1": "4205 Bessie Coleman Blvd",
        "Town": "Tampa",
        "StateOrProvince": "FL",
        "Postcode": "33607",
        "CountryID": 2,
        "Latitude": 27.982585,
        "Longitude": -82.53687,
        "ContactTelephone1": "813-870-8790",
        "AccessComments": "24 hours daily; short term parking rates apply",
        "RelatedURL": "",
        "DistanceUnit": 0
    },
    "Connections": [
        {
            "ID": 169050,
            "ConnectionTypeID": 1,
            "LevelID": 2,
            "Amps": 16,
            "Voltage": 230,
            "PowerKW": 3.7,
            "CurrentTypeID": 10,
            "Quantity": 4
        }
    ],
    "DateLastStatusUpdate": "2020-06-26T02:52:00Z",
    "DataQualityLevel": 3,
    "DateCreated": "2019-04-01T04:59:00Z",
    "SubmissionStatusTypeID": 100
}