{
    "IsRecentlyVerified": false,
    "ID": 19487,
    "UUID": "0A7C3234-3EC6-4304-A9F7-C28BC6B90B41",
    "DataProviderID": 1,
    "OperatorID": 25,
    "OperatorsReference": "southwark-doddingtongrove",
    "UsageTypeID": 4,
    "UsageCost": "£0.059/minute; min £1.18; other tariffs available",
    "AddressInfo": {
        "ID": 19832,
        "Title": "Doddington Grove",
        "AddressLine1": "Doddington Grove",
        "AddressLine2": "Southwark",
        "Town": "London",
        "Postcode": "SE17 3SX",
        "CountryID": 1,
        "Latitude": 51.4863381,
        "Longitude": -0.1035103,
        "ContactTelephone1": "0845 850 0653",
        "AccessComments": "Charges may apply - refer to the owner of the parking bay for details.",
        "RelatedURL": "http://www.southwark.gov.uk/downloads/200072/parking",
        "DistanceUnit": 0
    },
    "Connections": [
        {
            "ID": 19814,
            "ConnectionTypeID": 25,
            "StatusTypeID": 50,
            "LevelID": 2,
            "Amps": 32,
            "Voltage": 230,
            "PowerKW": 7,
            "CurrentTypeID": 10,
            "Quantity": 1
        },
        {
            "ID": 71799,
            "ConnectionTypeID": 1,
            "StatusTypeID": 50,
            "LevelID": 2,
            "Amps": 16,
            "Voltage": 230,
            "PowerKW": 4,
            "CurrentTypeID": 10,
            "Quantity": 1
        }
    ],
    "NumberOfPoints": 1,
    "StatusTypeID": 50,
    "DateLastStatusUpdate": "2017-04-27T14:43:00Z",
    "MetadataValues": [
        {
            "ID": 97,
            "MetadataFieldID": 4,
            "ItemValue": "Data © OpenStreetMap contributors, ODbL 1.0. http://www.openstreetmap.org/copyright"
        }
    ],
    "DataQualityLevel": 1,
    "DateCreated": "2013-10-02T10:40:00Z",
    "SubmissionStatusTypeID": 200
}