{
    "IsRecentlyVerified": false,
    "ID": 11008,
    "UUID": "BD0BFBDB-8803-4BAD-B437-E5DBE2B716B3",
    "DataProviderID": 1,
    "DataProvidersReference": "425",
    "AddressInfo": {
        "ID": 10905,
        "Title": "Best stasjon Kvaløysletta, Tromsø",
        "AddressLine1": "Manetveien 6",
        "Town": "KVALØYSLETTA",
        "StateOrProvince": "Troms og Finnmark",
        "Postcode": "9100",
        "CountryID": 168,
        "Latitude": 69.69094,
        "Longitude": 18.86255,
        "AccessComments": "Ladestasjonen er plassert mellom Best Stasjon og Spar, langs bilvaskehallen. Søylene synes fra veien.",
        "DistanceUnit": 0
    },
    "Connections": [
        {
            "ID": 8991,
            "ConnectionTypeID": 0,
            "Reference": "1",
            "LevelID": 2,
            "Amps": 16,
            "Voltage": 230,
            "PowerKW": 3.7,
            "Comments": "Mode 1"
        },
        {
            "ID": 87718,
            "ConnectionTypeID": 0,
            "Reference": "2",
            "LevelID": 2,
            "Amps": 16,
            "Voltage": 230,
            "PowerKW": 3.7,
            "Comments": "Mode 1"
        },
        {
            "ID": 87719,
            "ConnectionTypeID": 0,
            "Reference": "3",
            "LevelID": 2,
            "Amps": 16,
            "Voltage": 230,
            "PowerKW": 3.7,
            "Comments": "Mode 1"
        },
        {
            "ID": 87720,
            "ConnectionTypeID": 0,
            "Reference": "4",
            "LevelID": 2,
            "Amps": 16,
            "Voltage": 230,
            "PowerKW": 3.7,
            "Comments": "Mode 1"
        },
        {
            "ID": 87721,
            "ConnectionTypeID": 0,
            "Reference": "5",
            "LevelID": 2,
            "Amps": 16,
            "Voltage": 230,
            "PowerKW": 3.7,
            "Comments": "Mode 1"
        },
        {
            "ID": 87722,
            "ConnectionTypeID": 0,
            "Reference": "6",
            "LevelID": 2,
            "Amps": 16,
            "Voltage": 230,
            "PowerKW": 3.7,
            "Comments": "Mode 1"
        },
        {
            "ID": 87723,
            "ConnectionTypeID": 0,
            "Reference": "7",
            "LevelID": 2,
            "Amps": 16,
            "Voltage": 230,
            "PowerKW": 3.7,
            "Comments": "Mode 1"
        },
        {
            "ID": 89555,
            "ConnectionTypeID": 0,
            "Reference": "8",
            "LevelID": 2,
            "Amps": 16,
            "Voltage": 230,
            "PowerKW": 3.7,
            "Comments": "Mode 1"
        }
    ],
    "NumberOfPoints": 8,
    "StatusTypeID": 0,
    "DateLastStatusUpdate": "2020-05-26T08:25:00Z",
    "DataQualityLevel": 2,
    "DateCreated": "2012-06-02T11:57:00Z",
    "SubmissionStatusTypeID": 100
}