{
    "IsRecentlyVerified": false,
    "ID": 157568,
    "UUID": "4B3A1FF0-F147-46D1-83C8-6BE68B2994A6",
    "DataProviderID": 1,
    "OperatorID": 187,
    "UsageTypeID": 1,
    "UsageCost": "Free",
    "AddressInfo": {
        "ID": 157922,
        "Title": "ELMŰ Észak-Budai központ",
        "AddressLine1": "Kunigunda útja 47/A",
        "Town": "Budapest",
        "Postcode": "1037",
        "CountryID": 104,
        "Latitude": 47.562012315901,
        "Longitude": 19.035804134439104,
        "ContactTelephone1": "+36 1 238 1888",
        "AccessComments": "HU 2X22 kW A kábel csatlakoztatása után indul a töltés.\r\nGB 2X22kW After the cable is connected, the charging starts.",
        "RelatedURL": "https://e-autozas.hu/",
        "DistanceUnit": 0
    },
    "Connections": [
        {
            "ID": 226997,
            "ConnectionTypeID": 25,
            "StatusTypeID": 50,
            "LevelID": 2,
            "Amps": 32,
            "Voltage": 400,
            "PowerKW": 22,
            "CurrentTypeID": 20,
            "Quantity": 1
        }
    ],
    "NumberOfPoints": 1,
    "StatusTypeID": 50,
    "DateLastStatusUpdate": "2020-06-19T22:58:00Z",
    "DataQualityLevel": 1,
    "DateCreated": "2020-06-16T10:29:00Z",
    "SubmissionStatusTypeID": 200
}