{
    "IsRecentlyVerified": false,
    "ID": 51313,
    "UUID": "BBA20EAE-2FD3-4E14-A46C-3DFE260E57C4",
    "DataProviderID": 1,
    "OperatorID": 73,
    "OperatorsReference": "EV-Box EVB-P1410234",
    "UsageTypeID": 0,
    "UsageCost": "0.00 jaarabonnement",
    "AddressInfo": {
        "ID": 51659,
        "Title": "Wilgenhoven 2",
        "AddressLine1": "Wilgenhoven 2",
        "AddressLine2": "",
        "Town": "Albrandswaard",
        "StateOrProvince": "",
        "Postcode": "3162 PE",
        "CountryID": 159,
        "Latitude": 51.856675596673064,
        "Longitude": 4.473774433135986,
        "ContactTelephone1": "",
        "ContactTelephone2": "",
        "ContactEmail": "",
        "AccessComments": "",
        "RelatedURL": "http://www.ev-box.nl",
        "DistanceUnit": 0
    },
    "Connections": [
        {
            "ID": 63501,
            "ConnectionTypeID": 25,
            "StatusTypeID": 0,
            "LevelID": 2,
            "PowerKW": 11,
            "CurrentTypeID": 10
        },
        {
            "ID": 63502,
            "ConnectionTypeID": 25,
            "StatusTypeID": 0,
            "LevelID": 2,
            "PowerKW": 11,
            "CurrentTypeID": 10
        }
    ],
    "NumberOfPoints": 1,
    "GeneralComments": "",
    "StatusTypeID": 50,
    "DateLastStatusUpdate": "2016-08-19T21:32:00Z",
    "DataQualityLevel": 3,
    "DateCreated": "2015-07-24T06:28:00Z",
    "SubmissionStatusTypeID": 100
}