{
    "IsRecentlyVerified": false,
    "ID": 141546,
    "UUID": "F1A83DAA-4978-4DB7-A957-ECE42D8E260D",
    "DataProviderID": 2,
    "DataProvidersReference": "143393",
    "OperatorID": 5,
    "UsageTypeID": 1,
    "AddressInfo": {
        "ID": 141898,
        "Title": "MC FLEET",
        "AddressLine1": "11701 Georgia Ave",
        "Town": "Silver Spring",
        "StateOrProvince": "MD",
        "Postcode": "20902",
        "CountryID": 2,
        "Latitude": 39.04776,
        "Longitude": -77.051223,
        "ContactTelephone1": "888-758-4389",
        "AccessComments": "24 hours daily",
        "RelatedURL": "http://www.chargepoint.com/",
        "DistanceUnit": 0
    },
    "Connections": [
        {
            "ID": 197494,
            "ConnectionTypeID": 1,
            "LevelID": 2,
            "Amps": 16,
            "Voltage": 230,
            "PowerKW": 3.7,
            "CurrentTypeID": 10,
            "Quantity": 4
        }
    ],
    "StatusTypeID": 50,
    "DateLastStatusUpdate": "2020-06-26T03:01:00Z",
    "DataQualityLevel": 3,
    "DateCreated": "2019-12-24T09:15:00Z",
    "SubmissionStatusTypeID": 100
}