{
    "IsRecentlyVerified": false,
    "ID": 187705,
    "UUID": "F1F92E36-1825-4AA9-A587-6EFCBFC3C135",
    "DataProviderID": 18,
    "DataProvidersReference": "4820a3ee92565a25590b4b1e2d56eb13",
    "OperatorID": 2244,
    "UsageTypeID": 5,
    "AddressInfo": {
        "ID": 188064,
        "Title": "105 Abingdon Road",
        "AddressLine1": "105 Abingdon Road",
        "Town": "London",
        "Postcode": "W8 6QU",
        "CountryID": 1,
        "Latitude": 51.496634,
        "Longitude": -0.195358,
        "AccessComments": "",
        "RelatedURL": "https://www.ubitricity.com",
        "DistanceUnit": 0
    },
    "Connections": [
        {
            "ID": 302942,
            "ConnectionTypeID": 25,
            "Reference": "suby1100003119",
            "StatusTypeID": 50,
            "LevelID": 2,
            "Amps": 16,
            "Voltage": 230,
            "PowerKW": 3.7,
            "CurrentTypeID": 10
        }
    ],
    "StatusTypeID": 0,
    "DateLastStatusUpdate": "2021-07-12T03:38:00Z",
    "MetadataValues": [
        {
            "ID": 19945,
            "MetadataFieldID": 4,
            "ItemValue": "Contains public sector information licensed under the Open Government Licence v2.0. http://www.nationalarchives.gov.uk/doc/open-government-licence/version/2/"
        }
    ],
    "DataQualityLevel": 3,
    "DateCreated": "2021-07-12T03:38:00Z",
    "SubmissionStatusTypeID": 100
}