{
    "IsRecentlyVerified": false,
    "ID": 33009,
    "UUID": "B537B64A-4847-4D15-959F-CBDDA37EB6FC",
    "DataProviderID": 26,
    "DataProvidersReference": "39556",
    "OperatorID": 157,
    "OperatorsReference": "NewMotion ICUCOMPACT001686",
    "UsageCost": "0.00 jaarabonnement",
    "AddressInfo": {
        "ID": 33355,
        "Title": "Wildeman 52",
        "AddressLine1": "Wildeman 52",
        "Town": "Eindhoven",
        "Postcode": "5629 KH",
        "CountryID": 159,
        "Latitude": 51.4900932312012,
        "Longitude": 5.48429012298584,
        "ContactTelephone1": "088 0109500",
        "RelatedURL": "http://thenewmotion.nl/",
        "DistanceUnit": 0
    },
    "Connections": [
        {
            "ID": 36520,
            "ConnectionTypeID": 25,
            "LevelID": 2,
            "PowerKW": 11,
            "CurrentTypeID": 10
        }
    ],
    "NumberOfPoints": 1,
    "StatusTypeID": 50,
    "DateLastStatusUpdate": "2016-06-04T02:39:00Z",
    "DataQualityLevel": 3,
    "DateCreated": "2015-01-09T06:03:00Z",
    "SubmissionStatusTypeID": 100
}