{
    "IsRecentlyVerified": false,
    "ID": 163678,
    "UUID": "E8D1681C-C965-411E-A1F2-446631E6BF8F",
    "DataProviderID": 1,
    "OperatorID": 23,
    "OperatorsReference": "38593",
    "UsageTypeID": 4,
    "AddressInfo": {
        "ID": 164035,
        "Title": "Scandic Ishavshotel",
        "AddressLine1": "Fredrik Langesgate 2",
        "Town": "Tromso",
        "Postcode": "9008",
        "CountryID": 168,
        "Latitude": 69.649541,
        "Longitude": 18.961981,
        "ContactTelephone1": " +47 77666400",
        "DistanceUnit": 0
    },
    "Connections": [
        {
            "ID": 235275,
            "ConnectionTypeID": 30,
            "StatusTypeID": 50,
            "LevelID": 2,
            "PowerKW": 22,
            "CurrentTypeID": 20,
            "Quantity": 2
        }
    ],
    "NumberOfPoints": 2,
    "GeneralComments": "2 Tesla Connectors, up to 22kW.Available for customers. Please see front desk.",
    "StatusTypeID": 50,
    "DateLastStatusUpdate": "2020-08-24T14:26:00Z",
    "DataQualityLevel": 1,
    "DateCreated": "2020-08-24T14:25:00Z",
    "SubmissionStatusTypeID": 200
}