{
    "IsRecentlyVerified": false,
    "ID": 129844,
    "UUID": "B8D69780-A03B-4EE3-BE7C-1A59057C2EAE",
    "DataProviderID": 1,
    "OperatorID": 2247,
    "UsageTypeID": 4,
    "UsageCost": "0.30€/kWh",
    "AddressInfo": {
        "ID": 130190,
        "Title": "AVIA E.S. Arrasate",
        "AddressLine1": "Barrio de San Andrés, 7",
        "Town": "Mondragón",
        "StateOrProvince": "Gipuzkoa",
        "Postcode": "20500",
        "CountryID": 210,
        "Latitude": 43.0487389303412,
        "Longitude": -2.49738581820361,
        "ContactTelephone1": "+34900224522",
        "DistanceUnit": 0
    },
    "Connections": [
        {
            "ID": 181790,
            "ConnectionTypeID": 1036,
            "StatusTypeID": 50,
            "LevelID": 3,
            "Amps": 63,
            "Voltage": 400,
            "PowerKW": 43,
            "CurrentTypeID": 20,
            "Quantity": 1
        },
        {
            "ID": 181791,
            "ConnectionTypeID": 33,
            "StatusTypeID": 50,
            "LevelID": 3,
            "PowerKW": 50,
            "CurrentTypeID": 30,
            "Quantity": 1
        },
        {
            "ID": 181792,
            "ConnectionTypeID": 2,
            "StatusTypeID": 50,
            "LevelID": 3,
            "PowerKW": 50,
            "CurrentTypeID": 30,
            "Quantity": 1
        }
    ],
    "NumberOfPoints": 1,
    "GeneralComments": "Need to register in the \"Iberdrola Public Charging\" app, all extra information can be found on-site. The charger can be reserved up to 30 minutes in advance with the app for free, with 1€ penalty if you don't start to charge in those 30 minutes.",
    "StatusTypeID": 50,
    "DateLastStatusUpdate": "2019-07-31T21:42:00Z",
    "DataQualityLevel": 1,
    "DateCreated": "2019-07-28T20:54:00Z",
    "SubmissionStatusTypeID": 200
}