{
    "IsRecentlyVerified": false,
    "ID": 26462,
    "UUID": "D437881F-2BFD-489C-9C94-E5750F147908",
    "DataProviderID": 2,
    "DataProvidersReference": "46681",
    "UsageTypeID": 7,
    "AddressInfo": {
        "ID": 26808,
        "Title": "Bondy's Nissan",
        "AddressLine1": "3693 W Main St",
        "Town": "Dothan",
        "StateOrProvince": "AL",
        "Postcode": "36305",
        "CountryID": 2,
        "Latitude": 31.231097,
        "Longitude": -85.447945,
        "ContactTelephone1": "334-794-6736",
        "AccessComments": "Dealership business hours\r\nPublic - Call ahead",
        "RelatedURL": "",
        "DistanceUnit": 0
    },
    "Connections": [
        {
            "ID": 28938,
            "ConnectionTypeID": 1,
            "LevelID": 2,
            "Amps": 16,
            "Voltage": 230,
            "PowerKW": 3.7,
            "CurrentTypeID": 10,
            "Quantity": 1
        }
    ],
    "DateLastStatusUpdate": "2020-06-26T02:54:00Z",
    "DataQualityLevel": 3,
    "DateCreated": "2014-11-28T03:37:00Z",
    "SubmissionStatusTypeID": 100
}