{
    "IsRecentlyVerified": false,
    "ID": 182931,
    "UUID": "701C860E-2DCA-48F1-B578-1E15B1712DA2",
    "DataProviderID": 29,
    "DataProvidersReference": "4185",
    "OperatorID": 103,
    "AddressInfo": {
        "ID": 183290,
        "Title": "Liebigstraße 10",
        "AddressLine1": "Liebigstraße 10",
        "Town": "Essen",
        "Postcode": "45145",
        "CountryID": 87,
        "Latitude": 51.448385,
        "Longitude": 6.981799,
        "DistanceUnit": 0
    },
    "Connections": [
        {
            "ID": 289285,
            "ConnectionTypeID": 25,
            "StatusTypeID": 50,
            "LevelID": 2,
            "PowerKW": 22,
            "CurrentTypeID": 20
        },
        {
            "ID": 289286,
            "ConnectionTypeID": 25,
            "StatusTypeID": 50,
            "LevelID": 2,
            "PowerKW": 22,
            "CurrentTypeID": 20
        }
    ],
    "StatusTypeID": 50,
    "DateLastStatusUpdate": "2021-07-09T03:23:00Z",
    "MetadataValues": [
        {
            "ID": 15224,
            "MetadataFieldID": 4,
            "ItemValue": "Data from the German chargepoint registry provided by Bundesnetzagentur.de under the CC-BY 4.0 license"
        }
    ],
    "DataQualityLevel": 3,
    "DateCreated": "2021-07-08T10:03:00Z",
    "SubmissionStatusTypeID": 100
}