{
    "IsRecentlyVerified": false,
    "ID": 5031,
    "UUID": "DDA3A35F-653E-4590-8704-1E1E94ED2988",
    "DataProviderID": 1,
    "OperatorID": 1,
    "UsageTypeID": 1,
    "AddressInfo": {
        "ID": 4971,
        "Title": "Consumers Energy (Charge Point)",
        "AddressLine1": "One Energy Plaza",
        "AddressLine2": "",
        "Town": "Jackson",
        "StateOrProvince": "MI",
        "Postcode": "49202",
        "CountryID": 2,
        "Latitude": 42.246483,
        "Longitude": -84.403608,
        "ContactTelephone1": "",
        "ContactEmail": "",
        "AccessComments": "",
        "DistanceUnit": 0
    },
    "Connections": [
        {
            "ID": 2932,
            "ConnectionTypeID": 0,
            "LevelID": 2,
            "Quantity": 1
        }
    ],
    "NumberOfPoints": 2,
    "GeneralComments": "",
    "DateLastConfirmed": "2011-07-13T18:26:00Z",
    "StatusTypeID": 50,
    "DateLastStatusUpdate": "2011-07-13T18:26:00Z",
    "DataQualityLevel": 1,
    "DateCreated": "2011-07-13T18:26:00Z",
    "SubmissionStatusTypeID": 200
}