{
    "IsRecentlyVerified": false,
    "ID": 174814,
    "UUID": "25A88C21-58C9-4EAA-990A-1D969ED63799",
    "DataProviderID": 1,
    "OperatorID": 21,
    "UsageTypeID": 4,
    "UsageCost": "Mobi.E compatible card or App",
    "AddressInfo": {
        "ID": 175173,
        "Title": "ARV-00005",
        "AddressLine1": "",
        "Town": "Arranhó",
        "StateOrProvince": "Lisboa",
        "Postcode": "",
        "CountryID": 180,
        "Latitude": 38.95301221227032,
        "Longitude": -9.135818530727647,
        "DistanceUnit": 0
    },
    "Connections": [
        {
            "ID": 270881,
            "ConnectionTypeID": 25,
            "StatusTypeID": 50,
            "LevelID": 2,
            "Amps": 32,
            "Voltage": 400,
            "PowerKW": 22,
            "CurrentTypeID": 20,
            "Quantity": 2
        }
    ],
    "NumberOfPoints": 2,
    "StatusTypeID": 50,
    "DateLastStatusUpdate": "2021-04-13T20:51:00Z",
    "DataQualityLevel": 1,
    "DateCreated": "2021-04-13T20:51:00Z",
    "SubmissionStatusTypeID": 200
}