{
    "IsRecentlyVerified": false,
    "ID": 32917,
    "UUID": "ECE24A19-64F9-43BB-BC56-47C73C08FB66",
    "DataProviderID": 26,
    "DataProvidersReference": "48385",
    "OperatorID": 178,
    "OperatorsReference": "EVnetNL PNB-REE0022",
    "UsageCost": "0.00 jaarabonnement",
    "AddressInfo": {
        "ID": 33263,
        "Title": "Amazonenlaan 37",
        "AddressLine1": "Amazonenlaan 37",
        "Town": "Eindhoven",
        "Postcode": "5631 KX",
        "CountryID": 159,
        "Latitude": 51.463283,
        "Longitude": 5.499864,
        "ContactTelephone1": "0800-3522365",
        "RelatedURL": "http://www.evnet.nl",
        "DistanceUnit": 0
    },
    "Connections": [
        {
            "ID": 36428,
            "ConnectionTypeID": 25,
            "LevelID": 2,
            "PowerKW": 11,
            "CurrentTypeID": 10
        }
    ],
    "NumberOfPoints": 1,
    "StatusTypeID": 50,
    "DateLastStatusUpdate": "2016-06-04T02:39:00Z",
    "DataQualityLevel": 3,
    "DateCreated": "2015-01-09T06:03:00Z",
    "SubmissionStatusTypeID": 100
}