{
    "IsRecentlyVerified": false,
    "ID": 15963,
    "UUID": "2C4A500D-2530-4CA4-951F-3ABFB40E0C80",
    "DataProviderID": 1,
    "OperatorID": 1,
    "UsageTypeID": 0,
    "UsageCost": "Free",
    "AddressInfo": {
        "ID": 16308,
        "Title": "Energyville – KUL/VITO",
        "AddressLine1": "Dennenstraat 7 ",
        "AddressLine2": "",
        "Town": "Genk ",
        "StateOrProvince": "",
        "Postcode": "3600 ",
        "CountryID": 26,
        "Latitude": 50.9972159,
        "Longitude": 5.527807800000005,
        "ContactTelephone1": "",
        "ContactTelephone2": "",
        "ContactEmail": "",
        "AccessComments": "",
        "RelatedURL": "",
        "DistanceUnit": 0
    },
    "Connections": [
        {
            "ID": 14340,
            "ConnectionTypeID": 0,
            "StatusTypeID": 0,
            "LevelID": 2,
            "Amps": 16,
            "Voltage": 230,
            "PowerKW": 3.7,
            "Quantity": 1
        }
    ],
    "NumberOfPoints": 1,
    "GeneralComments": "",
    "StatusTypeID": 50,
    "DateLastStatusUpdate": "2013-02-15T19:31:00Z",
    "DataQualityLevel": 1,
    "DateCreated": "2013-02-15T19:31:00Z",
    "SubmissionStatusTypeID": 200
}