{
    "IsRecentlyVerified": false,
    "ID": 67270,
    "UUID": "4AD11BFC-F0B5-4B27-BD7B-B97DF66A8A43",
    "DataProviderID": 2,
    "DataProvidersReference": "74347",
    "UsageTypeID": 1,
    "AddressInfo": {
        "ID": 67616,
        "Title": "Maryland Center for Veterans Education and Training",
        "AddressLine1": "301 N High St",
        "Town": "Baltimore",
        "StateOrProvince": "MD",
        "Postcode": "21202",
        "CountryID": 2,
        "Latitude": 39.293619,
        "Longitude": -76.606356,
        "ContactTelephone1": "410-685-1109",
        "AccessComments": "24 hours daily",
        "RelatedURL": "",
        "DistanceUnit": 0
    },
    "Connections": [
        {
            "ID": 92771,
            "ConnectionTypeID": 1,
            "LevelID": 2,
            "Amps": 16,
            "Voltage": 230,
            "PowerKW": 3.7,
            "CurrentTypeID": 10,
            "Quantity": 4
        }
    ],
    "DateLastStatusUpdate": "2020-06-26T03:01:00Z",
    "DataQualityLevel": 3,
    "DateCreated": "2016-05-29T02:05:00Z",
    "SubmissionStatusTypeID": 100
}