{
    "IsRecentlyVerified": false,
    "ID": 163501,
    "UUID": "926221C6-F162-48AB-9EBC-C21BF69A123F",
    "DataProviderID": 1,
    "OperatorID": 23,
    "OperatorsReference": "43591",
    "UsageTypeID": 4,
    "UsageCost": "€0.29/kWh; Otras tarifas posibles para los coches antiguos",
    "AddressInfo": {
        "ID": 163858,
        "Title": "Jerez Supercharger",
        "AddressLine1": "Ronda Aurora Boreal",
        "Town": "Cadiz",
        "Postcode": "11408",
        "CountryID": 210,
        "Latitude": 36.692378,
        "Longitude": -6.160246,
        "DistanceUnit": 0
    },
    "Connections": [
        {
            "ID": 235098,
            "ConnectionTypeID": 27,
            "StatusTypeID": 50,
            "LevelID": 3,
            "PowerKW": 120,
            "CurrentTypeID": 30,
            "Quantity": 4
        }
    ],
    "NumberOfPoints": 4,
    "GeneralComments": "Charging4 Superchargers, available 24/7, up to 150kW",
    "StatusTypeID": 50,
    "DateLastStatusUpdate": "2020-08-24T11:32:00Z",
    "DataQualityLevel": 1,
    "DateCreated": "2020-08-24T11:32:00Z",
    "SubmissionStatusTypeID": 200
}