{
    "IsRecentlyVerified": false,
    "ID": 84001,
    "UUID": "29C8F8A0-6E45-4C72-B0F8-B5575A63FBA2",
    "DataProviderID": 1,
    "OperatorID": 45,
    "UsageTypeID": 6,
    "AddressInfo": {
        "ID": 84347,
        "Title": "Hotel Villa Röhl",
        "AddressLine1": "Strandallee 52",
        "Town": "Timmendorfer Strand",
        "StateOrProvince": "Kreis Ostholstein",
        "Postcode": "23669",
        "CountryID": 87,
        "Latitude": 54.00327,
        "Longitude": 10.776029999999992,
        "ContactTelephone1": "+49 4503 888 000",
        "ContactEmail": "info@villaroehl.de",
        "AccessComments": "Laden nach Anmeldung für Gäste möglich. ",
        "RelatedURL": "http://www.villaroehl.de/",
        "DistanceUnit": 0
    },
    "Connections": [
        {
            "ID": 119389,
            "ConnectionTypeID": 28,
            "StatusTypeID": 50,
            "LevelID": 2,
            "Amps": 16,
            "Voltage": 230,
            "PowerKW": 3.7,
            "CurrentTypeID": 10,
            "Quantity": 1
        }
    ],
    "NumberOfPoints": 1,
    "StatusTypeID": 50,
    "DateLastStatusUpdate": "2017-02-15T08:06:00Z",
    "DataQualityLevel": 1,
    "DateCreated": "2017-02-15T08:06:00Z",
    "SubmissionStatusTypeID": 200
}