{
    "IsRecentlyVerified": false,
    "ID": 54953,
    "UUID": "E87625CA-AD18-4869-BEA9-AE6A4BF535E9",
    "DataProviderID": 2,
    "DataProvidersReference": "70251",
    "OperatorID": 5,
    "UsageTypeID": 1,
    "AddressInfo": {
        "ID": 55299,
        "Title": "NMH1-ALUMNI",
        "AddressLine1": "Memorial Grove Rd",
        "Town": "Gill",
        "StateOrProvince": "MA",
        "Postcode": "01354",
        "CountryID": 2,
        "Latitude": 42.6672582,
        "Longitude": -72.4860788,
        "ContactTelephone1": "888-758-4389",
        "AccessComments": "24 hours daily",
        "RelatedURL": "http://www.chargepoint.com/",
        "DistanceUnit": 0
    },
    "Connections": [
        {
            "ID": 69432,
            "ConnectionTypeID": 1,
            "LevelID": 2,
            "Amps": 16,
            "Voltage": 230,
            "PowerKW": 3,
            "CurrentTypeID": 10,
            "Quantity": 2
        }
    ],
    "DateLastStatusUpdate": "2019-12-24T09:20:00Z",
    "DataQualityLevel": 3,
    "DateCreated": "2015-10-09T07:24:00Z",
    "SubmissionStatusTypeID": 100
}