{
    "IsRecentlyVerified": false,
    "ID": 134524,
    "UUID": "A5D1F28C-81CD-4E7A-AC7B-86CFE1712058",
    "DataProviderID": 1,
    "OperatorID": 46,
    "UsageTypeID": 5,
    "UsageCost": "£0.43/kWh",
    "AddressInfo": {
        "ID": 134870,
        "Title": "Powick Road",
        "AddressLine1": "Powick Road",
        "AddressLine2": "Digbeth",
        "Town": "Birmingham",
        "StateOrProvince": "West Midlands Combined Authority",
        "Postcode": "B23 7PG",
        "CountryID": 1,
        "Latitude": 52.51019933024335,
        "Longitude": -1.858835851322965,
        "ContactTelephone1": "0333 202 4417",
        "AccessComments": "Located in the Esso Petrol Station",
        "RelatedURL": "https://www.eonenergy.com/eon-drive-ev-charging.html",
        "DistanceUnit": 0
    },
    "Connections": [
        {
            "ID": 188276,
            "ConnectionTypeID": 33,
            "StatusTypeID": 50,
            "LevelID": 3,
            "PowerKW": 175,
            "CurrentTypeID": 30,
            "Quantity": 2
        },
        {
            "ID": 188277,
            "ConnectionTypeID": 2,
            "StatusTypeID": 50,
            "LevelID": 3,
            "PowerKW": 100,
            "CurrentTypeID": 30,
            "Quantity": 2
        }
    ],
    "NumberOfPoints": 2,
    "GeneralComments": "E.ON Drive UK, two 175kW units, pay by contactless, E.ON Drive app, RFID card or www.eonevpay.co.uk",
    "StatusTypeID": 50,
    "DateLastStatusUpdate": "2019-11-16T10:48:00Z",
    "DataQualityLevel": 1,
    "DateCreated": "2019-11-16T00:03:00Z",
    "SubmissionStatusTypeID": 200
}