{
    "IsRecentlyVerified": false,
    "ID": 18835,
    "UUID": "76D3A3F6-D3FB-47D6-B408-1235DCB49BCB",
    "DataProviderID": 1,
    "OperatorID": 20,
    "OperatorsReference": "70554",
    "UsageTypeID": 4,
    "UsageCost": "£1.00/charge admin fee",
    "AddressInfo": {
        "ID": 19180,
        "Title": "Corby Town Football Club",
        "AddressLine1": "Steel Park, Rockingham Road",
        "Town": "Corby",
        "Postcode": "NN17 2AE",
        "CountryID": 1,
        "Latitude": 52.507014,
        "Longitude": -0.717763,
        "AccessComments": "To RHS of pitch next to grandstand. Public access.  Only accessible outside of match or training times. Please check match schedule. Nearest charger is Sondes Arms LE16 8TG. Fitted under Midlands PiP, ",
        "DistanceUnit": 0
    },
    "Connections": [
        {
            "ID": 19069,
            "ConnectionTypeID": 25,
            "StatusTypeID": 50,
            "LevelID": 2,
            "Amps": 32,
            "Voltage": 230,
            "PowerKW": 7,
            "CurrentTypeID": 10,
            "Quantity": 2
        }
    ],
    "NumberOfPoints": 2,
    "StatusTypeID": 50,
    "DateLastStatusUpdate": "2017-06-14T13:57:00Z",
    "DataQualityLevel": 3,
    "DateCreated": "2013-08-25T04:06:00Z",
    "SubmissionStatusTypeID": 200
}