{
    "IsRecentlyVerified": false,
    "ID": 45901,
    "UUID": "114C320B-7029-4F7B-A797-6A3A84B869B8",
    "DataProviderID": 1,
    "DataProvidersReference": "2686",
    "AddressInfo": {
        "ID": 46247,
        "Title": "Vattenfall InCharge Snabbladdning",
        "AddressLine1": "Nybohovsbacken 11",
        "Town": "STOCKHOLM",
        "StateOrProvince": "STOCKHOLM",
        "Postcode": "11763",
        "CountryID": 216,
        "Latitude": 59.3094,
        "Longitude": 18.02522,
        "AccessComments": "Vid Stockholms stads parkering.",
        "DistanceUnit": 0
    },
    "Connections": [
        {
            "ID": 56564,
            "ConnectionTypeID": 0,
            "Reference": "1",
            "LevelID": 2,
            "Amps": 100,
            "Voltage": 500,
            "PowerKW": 50,
            "Comments": "Mode 4"
        },
        {
            "ID": 84527,
            "ConnectionTypeID": 0,
            "Reference": "2",
            "LevelID": 2,
            "Amps": 100,
            "Voltage": 500,
            "PowerKW": 50,
            "Comments": "Mode 4"
        },
        {
            "ID": 88193,
            "ConnectionTypeID": 0,
            "Reference": "3",
            "LevelID": 2,
            "Amps": 63,
            "Voltage": 400,
            "PowerKW": 43,
            "Comments": "Mode 3"
        }
    ],
    "NumberOfPoints": 3,
    "DateLastStatusUpdate": "2020-05-26T08:22:00Z",
    "DataQualityLevel": 2,
    "DateCreated": "2015-05-03T00:54:00Z",
    "SubmissionStatusTypeID": 100
}