{
    "IsRecentlyVerified": false,
    "ID": 88485,
    "UUID": "12E8FDE9-504C-4D7F-BB7E-3F6BEE8DEEBD",
    "DataProviderID": 1,
    "OperatorID": 156,
    "UsageTypeID": 4,
    "AddressInfo": {
        "ID": 88831,
        "Title": "Am Rehhagen",
        "AddressLine1": "Am Rehhagen 10",
        "Town": "Nienburg/Weser",
        "StateOrProvince": "Landkreis Nienburg/Weser",
        "Postcode": "31582",
        "CountryID": 87,
        "Latitude": 52.6131482,
        "Longitude": 9.253474200000028,
        "AccessComments": "24/7 verfügbar",
        "DistanceUnit": 0
    },
    "Connections": [
        {
            "ID": 125510,
            "ConnectionTypeID": 25,
            "StatusTypeID": 50,
            "LevelID": 2,
            "Amps": 32,
            "Voltage": 400,
            "PowerKW": 22,
            "CurrentTypeID": 20,
            "Quantity": 1
        }
    ],
    "NumberOfPoints": 1,
    "StatusTypeID": 50,
    "DateLastStatusUpdate": "2017-05-31T07:14:00Z",
    "DataQualityLevel": 1,
    "DateCreated": "2017-05-31T07:14:00Z",
    "SubmissionStatusTypeID": 200
}