{
    "IsRecentlyVerified": false,
    "ID": 64930,
    "UUID": "1C57872B-235E-4178-8CE2-608BDC138270",
    "DataProviderID": 1,
    "OperatorID": 1,
    "UsageTypeID": 1,
    "AddressInfo": {
        "ID": 65276,
        "Title": "Eisenbahnmuseum",
        "AddressLine1": "Streifstraße 1",
        "AddressLine2": "Rimlingen",
        "Town": "Losheim am See",
        "StateOrProvince": "Landkreis Merzig-Wadern",
        "Postcode": "66679",
        "CountryID": 87,
        "Latitude": 49.50617426449209,
        "Longitude": 6.745247899475091,
        "AccessComments": "2 kostenlose reservierte durchgehend verfügbare Parkplätze vor der Ladesäule. Betreiber ist e-mobil Saar; Zugang mit EC oder Kreditkarte (kostenlos, keine Abrechnung).",
        "RelatedURL": "http://www.saarland.de/dokumente/thema_elektromobilitaet/e-Mobil_Saar-Zugang_Ladesaeulen.pdf",
        "DistanceUnit": 0
    },
    "Connections": [
        {
            "ID": 83562,
            "ConnectionTypeID": 25,
            "StatusTypeID": 50,
            "LevelID": 2,
            "Amps": 16,
            "Voltage": 400,
            "PowerKW": 11,
            "CurrentTypeID": 20,
            "Quantity": 2
        },
        {
            "ID": 83563,
            "ConnectionTypeID": 28,
            "StatusTypeID": 50,
            "LevelID": 2,
            "Amps": 16,
            "Voltage": 230,
            "PowerKW": 3.7,
            "CurrentTypeID": 10,
            "Quantity": 2
        }
    ],
    "NumberOfPoints": 2,
    "StatusTypeID": 50,
    "DateLastStatusUpdate": "2016-04-01T06:48:00Z",
    "DataQualityLevel": 1,
    "DateCreated": "2016-04-01T06:48:00Z",
    "SubmissionStatusTypeID": 200
}