{
    "IsRecentlyVerified": false,
    "ID": 65342,
    "UUID": "4B002460-6F0B-4C7F-821D-30C7AB5E1E1A",
    "DataProviderID": 1,
    "OperatorID": 73,
    "OperatorsReference": "EV-Box EVB-P1408052",
    "UsageCost": "0.00 jaarabonnement",
    "AddressInfo": {
        "ID": 65688,
        "Title": "Glashaven",
        "AddressLine1": "Glashaven",
        "AddressLine2": "Rotterdam",
        "Town": "Rotterdam",
        "StateOrProvince": "South Holland",
        "Postcode": "3033",
        "CountryID": 159,
        "Latitude": 51.9165,
        "Longitude": 4.48586,
        "RelatedURL": "http://www.ev-box.nl",
        "DistanceUnit": 0
    },
    "Connections": [
        {
            "ID": 90030,
            "ConnectionTypeID": 25,
            "LevelID": 2,
            "PowerKW": 11,
            "CurrentTypeID": 10
        },
        {
            "ID": 90031,
            "ConnectionTypeID": 25,
            "LevelID": 2,
            "PowerKW": 11,
            "CurrentTypeID": 10
        }
    ],
    "NumberOfPoints": 1,
    "StatusTypeID": 50,
    "DateLastStatusUpdate": "2018-03-13T13:18:00Z",
    "DataQualityLevel": 3,
    "DateCreated": "2016-04-27T09:41:00Z",
    "SubmissionStatusTypeID": 100
}