{
    "IsRecentlyVerified": false,
    "ID": 175320,
    "UUID": "48307670-8A50-4051-8EE1-957AFDF1E3E9",
    "DataProviderID": 1,
    "OperatorID": 21,
    "UsageTypeID": 4,
    "UsageCost": "Mobi.E compatible card or App + parking",
    "AddressInfo": {
        "ID": 175679,
        "Title": "AVR-00010 - Parque SABA Praça Marquês de Pombal",
        "AddressLine1": "Parque Marquês de Pombal",
        "Town": "Aveiro",
        "StateOrProvince": "Aveiro",
        "Postcode": "3810-087",
        "CountryID": 180,
        "Latitude": 40.638841045288245,
        "Longitude": -8.652440983461133,
        "AccessComments": "Undeground parking",
        "DistanceUnit": 0
    },
    "Connections": [
        {
            "ID": 271920,
            "ConnectionTypeID": 25,
            "StatusTypeID": 50,
            "LevelID": 2,
            "Amps": 32,
            "Voltage": 400,
            "PowerKW": 22,
            "CurrentTypeID": 20,
            "Quantity": 2
        }
    ],
    "NumberOfPoints": 2,
    "GeneralComments": "Paid parking",
    "StatusTypeID": 50,
    "DateLastStatusUpdate": "2021-05-08T19:04:00Z",
    "DataQualityLevel": 1,
    "DateCreated": "2021-05-08T19:04:00Z",
    "SubmissionStatusTypeID": 200
}