{
    "IsRecentlyVerified": false,
    "ID": 50713,
    "UUID": "CBC8778F-315D-4E26-BA3A-6A4CB5D1DB09",
    "DataProviderID": 26,
    "DataProvidersReference": "66520",
    "OperatorID": 103,
    "OperatorsReference": "Allego NLALLEGO0001552",
    "UsageCost": "0.00 jaarabonnement",
    "AddressInfo": {
        "ID": 51059,
        "Title": "Ring 198",
        "AddressLine1": "Ring 198",
        "Town": "Hendrik-Ido-Ambacht",
        "Postcode": "3343 CR",
        "CountryID": 159,
        "Latitude": 51.837778,
        "Longitude": 4.6274028,
        "ContactTelephone1": "0800-3745337",
        "RelatedURL": "http://www.allego.eu/",
        "DistanceUnit": 0
    },
    "Connections": [
        {
            "ID": 62520,
            "ConnectionTypeID": 25,
            "LevelID": 2,
            "PowerKW": 11,
            "CurrentTypeID": 10
        },
        {
            "ID": 62521,
            "ConnectionTypeID": 25,
            "LevelID": 2,
            "PowerKW": 11,
            "CurrentTypeID": 10
        }
    ],
    "NumberOfPoints": 1,
    "StatusTypeID": 50,
    "DateLastStatusUpdate": "2016-06-04T02:41:00Z",
    "DataQualityLevel": 3,
    "DateCreated": "2015-07-22T09:53:00Z",
    "SubmissionStatusTypeID": 100
}