{
    "MediaItems": [
        {
            "ID": 28277,
            "ChargePointID": 92432,
            "ItemURL": "https://s3-ap-southeast-2.amazonaws.com/openchargemap/images/DE/OCM92432/OCM-92432.orig.2021062322114256.jpg",
            "ItemThumbnailURL": "https://s3-ap-southeast-2.amazonaws.com/openchargemap/images/DE/OCM92432/OCM-92432.thmb.2021062322114256.jpg",
            "Comment": "",
            "IsEnabled": true,
            "IsVideo": false,
            "IsFeaturedItem": false,
            "IsExternalResource": false,
            "User": {
                "ID": 32810,
                "Username": "Tom_Fred"
            },
            "DateCreated": "2021-06-23T22:12:00Z"
        },
        {
            "ID": 28251,
            "ChargePointID": 92432,
            "ItemURL": "https://s3-ap-southeast-2.amazonaws.com/openchargemap/images/DE/OCM92432/OCM-92432.orig.2021062117073317.jpg",
            "ItemThumbnailURL": "https://s3-ap-southeast-2.amazonaws.com/openchargemap/images/DE/OCM92432/OCM-92432.thmb.2021062117073317.jpg",
            "Comment": "",
            "IsEnabled": true,
            "IsVideo": false,
            "IsFeaturedItem": false,
            "IsExternalResource": false,
            "User": {
                "ID": 32810,
                "Username": "Tom_Fred"
            },
            "DateCreated": "2021-06-21T17:08:00Z"
        }
    ],
    "IsRecentlyVerified": false,
    "ID": 92432,
    "UUID": "3031F12D-9A39-4913-93B6-BB6AEBB81B20",
    "DataProviderID": 1,
    "OperatorID": 45,
    "UsageTypeID": 1,
    "AddressInfo": {
        "ID": 92778,
        "Title": "E-Bike Station Baumarkt Bauhaus",
        "AddressLine1": "Kurfürstendamm 129a",
        "Town": "Berlin",
        "StateOrProvince": "Berlin",
        "Postcode": "10711",
        "CountryID": 87,
        "Latitude": 52.495047654014435,
        "Longitude": 13.290357214363903,
        "AccessComments": "Links neben dem Hintereingang ist ein Fahrradständer mit 4 Schukodosen. Gesamtbelastbarkeit 16A!",
        "DistanceUnit": 0
    },
    "Connections": [
        {
            "ID": 131023,
            "ConnectionTypeID": 28,
            "StatusTypeID": 50,
            "LevelID": 1,
            "Amps": 10,
            "Voltage": 230,
            "PowerKW": 2.3,
            "CurrentTypeID": 10,
            "Quantity": 4
        }
    ],
    "NumberOfPoints": 4,
    "StatusTypeID": 50,
    "DateLastStatusUpdate": "2021-06-23T22:12:00Z",
    "DataQualityLevel": 1,
    "DateCreated": "2017-09-06T06:00:00Z",
    "SubmissionStatusTypeID": 200
}