{
    "IsRecentlyVerified": false,
    "ID": 176578,
    "UUID": "97666580-AC2B-4FD9-87AF-89DB2B86A4E6",
    "DataProviderID": 29,
    "DataProvidersReference": "14844",
    "OperatorID": 45,
    "AddressInfo": {
        "ID": 176937,
        "Title": "Alpenstraße 4",
        "AddressLine1": "Alpenstraße 4",
        "Town": "Kempten",
        "Postcode": "87435",
        "CountryID": 87,
        "Latitude": 47.719621,
        "Longitude": 10.313316,
        "DistanceUnit": 0
    },
    "Connections": [
        {
            "ID": 274653,
            "ConnectionTypeID": 25,
            "StatusTypeID": 50,
            "LevelID": 2,
            "PowerKW": 22,
            "CurrentTypeID": 20
        },
        {
            "ID": 274654,
            "ConnectionTypeID": 25,
            "StatusTypeID": 50,
            "LevelID": 2,
            "PowerKW": 22,
            "CurrentTypeID": 20
        }
    ],
    "StatusTypeID": 0,
    "DateLastStatusUpdate": "2021-07-09T03:10:00Z",
    "MetadataValues": [
        {
            "ID": 8873,
            "MetadataFieldID": 4,
            "ItemValue": "Data from the German chargepoint registry provided by Bundesnetzagentur.de under the CC-BY 4.0 license"
        }
    ],
    "DataQualityLevel": 3,
    "DateCreated": "2021-07-08T09:48:00Z",
    "SubmissionStatusTypeID": 100
}