{
    "IsRecentlyVerified": false,
    "ID": 157759,
    "UUID": "21F5FF95-D89A-484F-9360-C419CFE41DD7",
    "DataProviderID": 18,
    "DataProvidersReference": "9147d9126ccf1b3261a9014b9ce98c81",
    "OperatorID": 3391,
    "UsageTypeID": 1,
    "AddressInfo": {
        "ID": 158113,
        "Title": "Leicester Villas",
        "AddressLine1": "Leicester Villas",
        "Town": "Brighton",
        "Postcode": "BN3 5SP",
        "CountryID": 1,
        "Latitude": 50.83303,
        "Longitude": -0.204782,
        "AccessComments": "",
        "RelatedURL": "https://www.electricblueuk.com/",
        "DistanceUnit": 0
    },
    "Connections": [
        {
            "ID": 227287,
            "ConnectionTypeID": 25,
            "Reference": "62196-2 (SINGLE PHASE)",
            "StatusTypeID": 50,
            "LevelID": 2,
            "Amps": 16,
            "Voltage": 230,
            "PowerKW": 3.7,
            "CurrentTypeID": 10
        }
    ],
    "StatusTypeID": 0,
    "DateLastStatusUpdate": "2020-06-25T10:00:00Z",
    "MetadataValues": [
        {
            "ID": 7292,
            "MetadataFieldID": 4,
            "ItemValue": "Contains public sector information licensed under the Open Government Licence v2.0. http://www.nationalarchives.gov.uk/doc/open-government-licence/version/2/"
        }
    ],
    "DataQualityLevel": 3,
    "DateCreated": "2020-06-25T10:00:00Z",
    "SubmissionStatusTypeID": 100
}