{
    "IsRecentlyVerified": false,
    "ID": 13804,
    "UUID": "B6A45D19-C409-4E81-B3DC-0E78E07EF35F",
    "DataProviderID": 15,
    "DataProvidersReference": "25373",
    "OperatorID": 31,
    "UsageTypeID": 1,
    "AddressInfo": {
        "ID": 13701,
        "Title": "221 West Pine St.",
        "AddressLine1": "221 West Pine St.",
        "Town": "Lodi",
        "StateOrProvince": "CA",
        "Postcode": "95240",
        "CountryID": 2,
        "Latitude": 38.13437,
        "Longitude": -121.27595,
        "ContactTelephone1": "(209) 333-6800",
        "RelatedURL": "http://carstations.com/25373",
        "DistanceUnit": 0
    },
    "Connections": [
        {
            "ID": 11251,
            "ConnectionTypeID": 0,
            "Reference": "SPI",
            "Quantity": 1
        },
        {
            "ID": 12751,
            "ConnectionTypeID": 1,
            "Reference": "J1772",
            "LevelID": 2
        }
    ],
    "NumberOfPoints": 3,
    "StatusTypeID": 0,
    "DateLastStatusUpdate": "2017-11-04T14:04:00Z",
    "DataQualityLevel": 2,
    "DateCreated": "2012-12-06T11:08:00Z",
    "SubmissionStatusTypeID": 100
}