{
    "IsRecentlyVerified": false,
    "ID": 135716,
    "UUID": "C96A3B05-12FA-42A9-8C2D-C010527FCCD7",
    "DataProviderID": 18,
    "DataProvidersReference": "e018bea7382b77bf3a2ca8a4088b822c",
    "OperatorID": 2244,
    "UsageTypeID": 5,
    "AddressInfo": {
        "ID": 136062,
        "Title": "St. Ann's Hill",
        "AddressLine1": "St. Ann's Hill",
        "Town": "London",
        "Postcode": "SW18 2SB",
        "CountryID": 1,
        "Latitude": 51.450626,
        "Longitude": -0.184715,
        "AccessComments": "",
        "RelatedURL": "https://www.ubitricity.com",
        "DistanceUnit": 0
    },
    "Connections": [
        {
            "ID": 190131,
            "ConnectionTypeID": 25,
            "Reference": "suby1100001458",
            "StatusTypeID": 50,
            "LevelID": 2,
            "Amps": 16,
            "Voltage": 230,
            "PowerKW": 3.7,
            "CurrentTypeID": 10
        }
    ],
    "StatusTypeID": 0,
    "DateLastStatusUpdate": "2021-04-25T05:46:00Z",
    "MetadataValues": [
        {
            "ID": 5568,
            "MetadataFieldID": 4,
            "ItemValue": "Contains public sector information licensed under the Open Government Licence v2.0. http://www.nationalarchives.gov.uk/doc/open-government-licence/version/2/"
        }
    ],
    "DataQualityLevel": 3,
    "DateCreated": "2019-12-24T05:22:00Z",
    "SubmissionStatusTypeID": 100
}