{
    "IsRecentlyVerified": false,
    "ID": 60381,
    "UUID": "6E3382CA-589F-45E5-87E6-2F18E35B29C7",
    "DataProviderID": 1,
    "OperatorID": 7,
    "OperatorsReference": "PP-74151",
    "UsageTypeID": 6,
    "UsageCost": "Free",
    "AddressInfo": {
        "ID": 60727,
        "Title": "Bassett's Nissan Bridgend",
        "AddressLine1": "South Road",
        "AddressLine2": "Litchard",
        "Town": "Bridgend",
        "Postcode": "CF31 3UL",
        "CountryID": 1,
        "Latitude": 51.4966964,
        "Longitude": -3.56170380000003,
        "DistanceUnit": 0
    },
    "Connections": [
        {
            "ID": 76490,
            "ConnectionTypeID": 25,
            "StatusTypeID": 50,
            "LevelID": 2,
            "Amps": 32,
            "Voltage": 230,
            "PowerKW": 7,
            "CurrentTypeID": 10,
            "Quantity": 2
        }
    ],
    "NumberOfPoints": 2,
    "StatusTypeID": 0,
    "DateLastStatusUpdate": "2016-12-13T11:52:00Z",
    "DataQualityLevel": 1,
    "DateCreated": "2016-01-24T11:20:00Z",
    "SubmissionStatusTypeID": 200
}