{
    "IsRecentlyVerified": false,
    "ID": 104207,
    "UUID": "A0E70DC7-4B80-4E41-B0DF-5462EC85A458",
    "DataProviderID": 1,
    "OperatorID": 45,
    "UsageTypeID": 4,
    "AddressInfo": {
        "ID": 104553,
        "Title": "Klinikum Landau",
        "AddressLine1": "Bodelschwinghstraße 27",
        "Town": "Landau in der Pfalz",
        "StateOrProvince": "Landau in der Pfalz",
        "Postcode": "76829",
        "CountryID": 87,
        "Latitude": 49.20594442567931,
        "Longitude": 8.105667715344225,
        "AccessComments": "24/7 nutzbare Ladesäulen zwischen der Einfahrt zur Klinikum-Verwaltung und den Stadtmobil-Carsharing-Parkplätzen in der Bodelschwinghstraße. Keine Ladegebühren im Jahr 2018.",
        "RelatedURL": "http://www.energie-suedwest.de/",
        "DistanceUnit": 0
    },
    "Connections": [
        {
            "ID": 147155,
            "ConnectionTypeID": 25,
            "StatusTypeID": 50,
            "LevelID": 2,
            "Amps": 32,
            "Voltage": 400,
            "PowerKW": 22,
            "CurrentTypeID": 20,
            "Quantity": 2
        }
    ],
    "NumberOfPoints": 2,
    "StatusTypeID": 50,
    "DateLastStatusUpdate": "2018-05-17T09:17:00Z",
    "DataQualityLevel": 1,
    "DateCreated": "2018-05-17T09:17:00Z",
    "SubmissionStatusTypeID": 200
}