{
    "IsRecentlyVerified": false,
    "ID": 111794,
    "UUID": "6486F7AA-99B8-4B48-9297-8893074A1440",
    "DataProviderID": 2,
    "DataProvidersReference": "84897",
    "UsageTypeID": 2,
    "AddressInfo": {
        "ID": 112140,
        "Title": "Westburne Electric",
        "AddressLine1": "322 John St",
        "Town": "Victoria",
        "StateOrProvince": "BC",
        "Postcode": "V8T 1T3",
        "CountryID": 44,
        "Latitude": 48.435933,
        "Longitude": -123.375695,
        "ContactTelephone1": "",
        "AccessComments": "For private use only",
        "RelatedURL": "",
        "DistanceUnit": 0
    },
    "Connections": [
        {
            "ID": 157293,
            "ConnectionTypeID": 1,
            "LevelID": 2,
            "Amps": 16,
            "Voltage": 230,
            "PowerKW": 3,
            "CurrentTypeID": 10,
            "Quantity": 1
        }
    ],
    "DateLastStatusUpdate": "2019-12-24T09:25:00Z",
    "DataQualityLevel": 3,
    "DateCreated": "2018-10-18T23:37:00Z",
    "SubmissionStatusTypeID": 100
}