{
    "IsRecentlyVerified": false,
    "ID": 134296,
    "UUID": "39263E8D-910D-4AF4-860F-69B0970864DD",
    "DataProviderID": 1,
    "OperatorID": 80,
    "UsageTypeID": 4,
    "UsageCost": "0,45 €/kW",
    "AddressInfo": {
        "ID": 134642,
        "Title": "Roma Due Ponti Sporting Club | EnelX",
        "AddressLine1": "Via dei Due Ponti, 48",
        "Town": "Roma",
        "StateOrProvince": "RM",
        "Postcode": "00189",
        "CountryID": 112,
        "Latitude": 41.9583006139399,
        "Longitude": 12.4799428704847,
        "RelatedURL": "https://www.enelx.com/it/it/emobility",
        "DistanceUnit": 0
    },
    "Connections": [
        {
            "ID": 187938,
            "ConnectionTypeID": 25,
            "StatusTypeID": 50,
            "LevelID": 2,
            "Amps": 16,
            "Voltage": 240,
            "PowerKW": 3,
            "CurrentTypeID": 10,
            "Quantity": 4
        }
    ],
    "NumberOfPoints": 4,
    "GeneralComments": "Lun-Ven 7:00-22:30 Sab-Dom-Fest 7:00-19:30",
    "StatusTypeID": 50,
    "DateLastStatusUpdate": "2019-11-07T15:04:00Z",
    "DataQualityLevel": 1,
    "DateCreated": "2019-11-07T15:04:00Z",
    "SubmissionStatusTypeID": 200
}