{
    "IsRecentlyVerified": false,
    "ID": 169837,
    "UUID": "51FD874D-AE93-4242-A3AD-B1A06A5C1538",
    "DataProviderID": 1,
    "OperatorID": 23,
    "OperatorsReference": "54939",
    "UsageTypeID": 4,
    "UsageCost": "$0.20/min >=60kW; $0.10/min <60kW; other tariffs for older cars",
    "AddressInfo": {
        "ID": 170196,
        "Title": "Hilton Head, SC Supercharger",
        "AddressLine1": "30 Office Park Road",
        "Town": "Hilton Head Island",
        "StateOrProvince": "SC",
        "Postcode": "29928",
        "CountryID": 2,
        "Latitude": 32.153381,
        "Longitude": -80.768104,
        "DistanceUnit": 0
    },
    "Connections": [
        {
            "ID": 258785,
            "ConnectionTypeID": 27,
            "StatusTypeID": 50,
            "LevelID": 3,
            "PowerKW": 120,
            "CurrentTypeID": 30,
            "Quantity": 8
        }
    ],
    "NumberOfPoints": 8,
    "GeneralComments": "Charging8 superchargers, available 24/7, up to 250kW",
    "StatusTypeID": 50,
    "DateLastStatusUpdate": "2020-11-11T06:42:00Z",
    "DataQualityLevel": 1,
    "DateCreated": "2020-11-11T06:42:00Z",
    "SubmissionStatusTypeID": 200
}