{
    "IsRecentlyVerified": false,
    "ID": 49177,
    "UUID": "670BADF9-F987-4281-9B01-5E8C09A439AB",
    "DataProviderID": 1,
    "OperatorID": 196,
    "UsageTypeID": 4,
    "UsageCost": "0",
    "AddressInfo": {
        "ID": 49523,
        "Title": "Secured Truckparking Borchwerf ",
        "AddressLine1": "Borchwerf 25",
        "AddressLine2": "",
        "Town": "Roosendaal",
        "StateOrProvince": "Nordbrabant",
        "Postcode": "4704RG",
        "CountryID": 159,
        "Latitude": 51.54805183646235,
        "Longitude": 4.46101964166407,
        "ContactTelephone1": "",
        "ContactTelephone2": "",
        "ContactEmail": "",
        "AccessComments": "This 24/7 open charging station is intended for coooling trucks but can be used by EV too. Registration at Nomad Power is mandatory. After that charging points can be activated by phone, App oder web. Charging is free at this time (07/2015).",
        "RelatedURL": "http://www.nomadpower.eu/de/chargepoints/27/connector/73",
        "DistanceUnit": 0
    },
    "Connections": [
        {
            "ID": 60771,
            "ConnectionTypeID": 17,
            "StatusTypeID": 50,
            "LevelID": 2,
            "Amps": 32,
            "Voltage": 400,
            "PowerKW": 22,
            "CurrentTypeID": 20,
            "Quantity": 2
        }
    ],
    "NumberOfPoints": 2,
    "GeneralComments": "",
    "StatusTypeID": 50,
    "DateLastStatusUpdate": "2016-01-07T08:09:00Z",
    "DataQualityLevel": 1,
    "DateCreated": "2015-07-12T17:32:00Z",
    "SubmissionStatusTypeID": 200
}