{
    "IsRecentlyVerified": false,
    "ID": 178897,
    "UUID": "D4B8B1E9-76A8-414B-877A-DAE6ABAA3CCE",
    "DataProviderID": 29,
    "DataProvidersReference": "9914",
    "OperatorID": 127,
    "AddressInfo": {
        "ID": 179256,
        "Title": "Rathausplatz",
        "AddressLine1": "Rathausplatz",
        "Town": "Wilhelmshaven",
        "Postcode": "26382",
        "CountryID": 87,
        "Latitude": 53.527962,
        "Longitude": 8.110131,
        "DistanceUnit": 0
    },
    "Connections": [
        {
            "ID": 279924,
            "ConnectionTypeID": 25,
            "StatusTypeID": 50,
            "LevelID": 2,
            "PowerKW": 22,
            "CurrentTypeID": 20
        },
        {
            "ID": 279925,
            "ConnectionTypeID": 25,
            "StatusTypeID": 50,
            "LevelID": 2,
            "PowerKW": 22,
            "CurrentTypeID": 20
        }
    ],
    "StatusTypeID": 50,
    "DateLastStatusUpdate": "2021-07-12T02:51:00Z",
    "MetadataValues": [
        {
            "ID": 11191,
            "MetadataFieldID": 4,
            "ItemValue": "Data from the German chargepoint registry provided by Bundesnetzagentur.de under the CC-BY 4.0 license"
        }
    ],
    "DataQualityLevel": 3,
    "DateCreated": "2021-07-08T09:58:00Z",
    "SubmissionStatusTypeID": 100
}