{
    "IsRecentlyVerified": false,
    "ID": 35757,
    "UUID": "E438375C-EF60-48C4-B009-20535175D529",
    "DataProviderID": 26,
    "DataProvidersReference": "21334",
    "OperatorID": 157,
    "OperatorsReference": "NewMotion 01000557",
    "UsageCost": "0.00 afhankelijk van pas",
    "AddressInfo": {
        "ID": 36103,
        "Title": "Herculesplein",
        "AddressLine1": "Herculesplein",
        "Town": "Utrecht",
        "Postcode": "3584 AB",
        "CountryID": 159,
        "Latitude": 52.0780896,
        "Longitude": 5.14706530000001,
        "ContactTelephone1": "088 0109500",
        "RelatedURL": "http://thenewmotion.nl/",
        "DistanceUnit": 0
    },
    "Connections": [
        {
            "ID": 39268,
            "ConnectionTypeID": 25,
            "LevelID": 2,
            "PowerKW": 3.7,
            "CurrentTypeID": 10
        },
        {
            "ID": 48035,
            "ConnectionTypeID": 25,
            "LevelID": 2,
            "PowerKW": 3.7,
            "CurrentTypeID": 10
        },
        {
            "ID": 48036,
            "ConnectionTypeID": 25,
            "LevelID": 2,
            "PowerKW": 3.7,
            "CurrentTypeID": 10
        },
        {
            "ID": 48037,
            "ConnectionTypeID": 25,
            "LevelID": 2,
            "PowerKW": 3.7,
            "CurrentTypeID": 10
        }
    ],
    "NumberOfPoints": 1,
    "StatusTypeID": 50,
    "DateLastStatusUpdate": "2016-06-04T02:49:00Z",
    "DataQualityLevel": 3,
    "DateCreated": "2015-01-09T06:05:00Z",
    "SubmissionStatusTypeID": 100
}