{
    "IsRecentlyVerified": false,
    "ID": 181456,
    "UUID": "4CF2273A-D526-4D7D-AD5E-B12195FF96FD",
    "DataProviderID": 29,
    "DataProvidersReference": "14296",
    "AddressInfo": {
        "ID": 181815,
        "Title": "Stockheimer Weg 1",
        "AddressLine1": "Stockheimer Weg 1",
        "Town": "Kreuzau",
        "Postcode": "52372",
        "CountryID": 87,
        "Latitude": 50.751429,
        "Longitude": 6.488292,
        "DistanceUnit": 0
    },
    "Connections": [
        {
            "ID": 285796,
            "ConnectionTypeID": 25,
            "StatusTypeID": 50,
            "LevelID": 2,
            "PowerKW": 22,
            "CurrentTypeID": 20
        },
        {
            "ID": 285797,
            "ConnectionTypeID": 25,
            "StatusTypeID": 50,
            "LevelID": 2,
            "PowerKW": 22,
            "CurrentTypeID": 20
        }
    ],
    "StatusTypeID": 50,
    "DateLastStatusUpdate": "2021-07-09T03:20:00Z",
    "MetadataValues": [
        {
            "ID": 13750,
            "MetadataFieldID": 4,
            "ItemValue": "Data from the German chargepoint registry provided by Bundesnetzagentur.de under the CC-BY 4.0 license"
        }
    ],
    "DataQualityLevel": 3,
    "DateCreated": "2021-07-08T10:01:00Z",
    "SubmissionStatusTypeID": 100
}