{
    "IsRecentlyVerified": false,
    "ID": 8185,
    "UUID": "23AEFF3C-36F4-43AF-B591-AE39A7E01B87",
    "DataProviderID": 15,
    "DataProvidersReference": "7369",
    "OperatorID": 26,
    "AddressInfo": {
        "ID": 8082,
        "Title": "3372 N College Ave",
        "AddressLine1": "3372 N College Ave",
        "Town": "Fayetteville",
        "StateOrProvince": "AR",
        "Postcode": "72703",
        "CountryID": 2,
        "Latitude": 36.11276,
        "Longitude": -94.14428,
        "ContactTelephone1": " (479) 442-4251",
        "RelatedURL": "http://carstations.com/7369",
        "DistanceUnit": 0
    },
    "Connections": [
        {
            "ID": 5614,
            "ConnectionTypeID": 1,
            "Reference": "J1772",
            "LevelID": 2
        }
    ],
    "StatusTypeID": 0,
    "DateLastStatusUpdate": "2017-11-04T14:04:00Z",
    "DataQualityLevel": 1,
    "DateCreated": "2011-11-11T12:06:00Z",
    "SubmissionStatusTypeID": 100
}