{
    "IsRecentlyVerified": false,
    "ID": 66753,
    "UUID": "8212A66B-14FD-4D92-A6EE-3269A2557EC3",
    "DataProviderID": 1,
    "OperatorID": 23,
    "OperatorsReference": "13898",
    "UsageTypeID": 1,
    "UsageCost": "Free",
    "AddressInfo": {
        "ID": 67099,
        "Title": "Pierre's Restaurant and Lounge - Tesla",
        "AddressLine1": "81600 Overseas Hwy",
        "Town": "Islamorada",
        "StateOrProvince": "FL",
        "Postcode": "33036",
        "CountryID": 2,
        "Latitude": 24.915959,
        "Longitude": -80.6385584,
        "ContactTelephone1": "305-664-3225  877-798-3752",
        "AccessComments": "24 hours daily; for Tesla use only; for guest use only; see front desk for access",
        "RelatedURL": "http://www.teslamotors.com/supercharger",
        "DistanceUnit": 0
    },
    "Connections": [
        {
            "ID": 92239,
            "ConnectionTypeID": 30,
            "StatusTypeID": 50,
            "LevelID": 2,
            "Amps": 16,
            "Voltage": 230,
            "PowerKW": 16,
            "CurrentTypeID": 10,
            "Quantity": 2
        }
    ],
    "NumberOfPoints": 2,
    "StatusTypeID": 50,
    "DateLastStatusUpdate": "2017-01-31T19:45:00Z",
    "DataQualityLevel": 3,
    "DateCreated": "2016-05-29T02:04:00Z",
    "SubmissionStatusTypeID": 100
}