{
    "IsRecentlyVerified": false,
    "ID": 77498,
    "UUID": "A5D070BB-E38A-4B75-9E04-D47DDD2FEDA6",
    "DataProviderID": 1,
    "OperatorID": 45,
    "UsageTypeID": 3,
    "AddressInfo": {
        "ID": 77844,
        "Title": "Hotel Schloßpalais",
        "AddressLine1": "Johann-Sebastian-Bach-Straße 11",
        "Town": "Wernigerode",
        "StateOrProvince": "Landkreis Harz",
        "Postcode": "38855",
        "CountryID": 87,
        "Latitude": 51.830776511345356,
        "Longitude": 10.786329970569586,
        "ContactTelephone1": "+49 3943 630540",
        "AccessComments": "Laden für Hotelgäste gratis; sonst 5..10€ je nach Strommenge. Doppelbox mit Kabeln vor dem Hotel am Stromkasten, nur nach Anmeldung - dann aber durchgehend -  nutzbar.",
        "RelatedURL": "http://www.schlosspalais.de/",
        "DistanceUnit": 0
    },
    "Connections": [
        {
            "ID": 111659,
            "ConnectionTypeID": 1036,
            "StatusTypeID": 50,
            "LevelID": 2,
            "Amps": 32,
            "Voltage": 400,
            "PowerKW": 22,
            "CurrentTypeID": 20,
            "Quantity": 2
        }
    ],
    "NumberOfPoints": 2,
    "GeneralComments": "Ein Anschluss nur mit Tesla Fahrzeugen nutzbar, der andere kann von allen benutzt werden.",
    "StatusTypeID": 50,
    "DateLastStatusUpdate": "2017-01-18T07:03:00Z",
    "DataQualityLevel": 1,
    "DateCreated": "2017-01-18T07:03:00Z",
    "SubmissionStatusTypeID": 200
}