{
    "IsRecentlyVerified": false,
    "ID": 139770,
    "UUID": "290493A7-CFC8-4632-84EF-AFF36CFB2F0B",
    "DataProviderID": 2,
    "DataProvidersReference": "81489",
    "OperatorID": 5,
    "UsageTypeID": 1,
    "AddressInfo": {
        "ID": 140122,
        "Title": "NORTHWINDS",
        "AddressLine1": "11605 Haynes Bridge Rd",
        "Town": "Alpharetta",
        "StateOrProvince": "GA",
        "Postcode": "30009",
        "CountryID": 2,
        "Latitude": 34.0630678,
        "Longitude": -84.2902897,
        "ContactTelephone1": "888-758-4389",
        "AccessComments": "24 hours daily",
        "RelatedURL": "http://www.chargepoint.com/",
        "DistanceUnit": 0
    },
    "Connections": [
        {
            "ID": 195222,
            "ConnectionTypeID": 1,
            "LevelID": 2,
            "Amps": 16,
            "Voltage": 230,
            "PowerKW": 3,
            "CurrentTypeID": 10,
            "Quantity": 2
        }
    ],
    "StatusTypeID": 50,
    "DateLastStatusUpdate": "2019-12-24T09:11:00Z",
    "DataQualityLevel": 3,
    "DateCreated": "2019-12-24T09:11:00Z",
    "SubmissionStatusTypeID": 100
}