{
    "IsRecentlyVerified": false,
    "ID": 140633,
    "UUID": "861A3F3C-AC9D-4CB9-89D8-8CA439D28987",
    "DataProviderID": 2,
    "DataProvidersReference": "93565",
    "OperatorID": 15,
    "UsageTypeID": 4,
    "AddressInfo": {
        "ID": 140985,
        "Title": "Walmart",
        "AddressLine1": "5095 Almaden Expy",
        "Town": "San Jose",
        "StateOrProvince": "CA",
        "Postcode": "95118",
        "CountryID": 2,
        "Latitude": 37.255725,
        "Longitude": -121.879343,
        "ContactTelephone1": "877-455-3833",
        "AccessComments": "24 hours daily\r\nPublic - Card key at all times",
        "RelatedURL": "https://www.evgo.com/",
        "DistanceUnit": 0
    },
    "Connections": [
        {
            "ID": 196322,
            "ConnectionTypeID": 2,
            "LevelID": 3,
            "Amps": 100,
            "Voltage": 400,
            "PowerKW": 40,
            "CurrentTypeID": 30,
            "Quantity": 1
        },
        {
            "ID": 196323,
            "ConnectionTypeID": 32,
            "LevelID": 3,
            "Amps": 100,
            "Voltage": 400,
            "PowerKW": 40,
            "CurrentTypeID": 30,
            "Quantity": 1
        }
    ],
    "StatusTypeID": 50,
    "DateLastStatusUpdate": "2020-06-26T02:59:00Z",
    "DataQualityLevel": 3,
    "DateCreated": "2019-12-24T09:13:00Z",
    "SubmissionStatusTypeID": 100
}