{
    "IsRecentlyVerified": false,
    "ID": 141535,
    "UUID": "82794FB1-5CCE-4B1E-A3E9-7161AE86399D",
    "DataProviderID": 2,
    "DataProvidersReference": "80281",
    "OperatorID": 5,
    "UsageTypeID": 1,
    "AddressInfo": {
        "ID": 141887,
        "Title": "EVERGY",
        "AddressLine1": "585 W 52nd St @ Loose Park",
        "Town": "Kansas City",
        "StateOrProvince": "MO",
        "Postcode": "64112",
        "CountryID": 2,
        "Latitude": 39.0346986,
        "Longitude": -94.5947335,
        "ContactTelephone1": "888-758-4389",
        "AccessComments": "24 hours daily",
        "RelatedURL": "http://www.chargepoint.com/",
        "DistanceUnit": 0
    },
    "Connections": [
        {
            "ID": 197480,
            "ConnectionTypeID": 1,
            "LevelID": 2,
            "Amps": 16,
            "Voltage": 230,
            "PowerKW": 3.7,
            "CurrentTypeID": 10,
            "Quantity": 6
        }
    ],
    "StatusTypeID": 50,
    "DateLastStatusUpdate": "2020-06-26T03:01:00Z",
    "DataQualityLevel": 3,
    "DateCreated": "2019-12-24T09:15:00Z",
    "SubmissionStatusTypeID": 100
}