{
    "IsRecentlyVerified": false,
    "ID": 173961,
    "UUID": "3BDBDCD9-4BD1-4942-A16A-8EA2C1522DA3",
    "DataProviderID": 1,
    "OperatorID": 3327,
    "UsageTypeID": 1,
    "AddressInfo": {
        "ID": 174320,
        "Title": "Pieve Del Cairo (Via XX settembre)",
        "AddressLine1": "Via XX settembre",
        "Town": "Pieve del Cairo",
        "StateOrProvince": "Pavia",
        "Postcode": "27030",
        "CountryID": 112,
        "Latitude": 45.049007395199936,
        "Longitude": 8.809907952595495,
        "RelatedURL": "https://www.bec.energy/",
        "DistanceUnit": 0
    },
    "Connections": [
        {
            "ID": 267970,
            "ConnectionTypeID": 25,
            "LevelID": 2,
            "PowerKW": 22,
            "Quantity": 2
        },
        {
            "ID": 267971,
            "ConnectionTypeID": 25,
            "LevelID": 2,
            "PowerKW": 22,
            "Quantity": 2
        }
    ],
    "NumberOfPoints": 4,
    "StatusTypeID": 50,
    "DateLastStatusUpdate": "2021-03-08T17:54:00Z",
    "DataQualityLevel": 1,
    "DateCreated": "2021-03-08T13:05:00Z",
    "SubmissionStatusTypeID": 200
}