{
    "IsRecentlyVerified": false,
    "ID": 163670,
    "UUID": "5DF158ED-A5CE-45E4-B418-2145E96BA88A",
    "DataProviderID": 1,
    "OperatorID": 23,
    "OperatorsReference": "34053",
    "UsageTypeID": 4,
    "UsageCost": "NKR 1.70/kWh; andre tariffer for eldre biler",
    "AddressInfo": {
        "ID": 164027,
        "Title": "Vikeså Supercharger",
        "AddressLine1": "Vikesågata 1",
        "Town": "Vikeså",
        "Postcode": "4389",
        "CountryID": 168,
        "Latitude": 58.631861,
        "Longitude": 6.077764,
        "DistanceUnit": 0
    },
    "Connections": [
        {
            "ID": 235267,
            "ConnectionTypeID": 27,
            "StatusTypeID": 50,
            "LevelID": 3,
            "PowerKW": 120,
            "CurrentTypeID": 30,
            "Quantity": 12
        }
    ],
    "NumberOfPoints": 12,
    "GeneralComments": "Charging12 Superchargers, available 24/7, up to 150kW",
    "StatusTypeID": 50,
    "DateLastStatusUpdate": "2020-08-24T14:17:00Z",
    "DataQualityLevel": 1,
    "DateCreated": "2020-08-24T14:17:00Z",
    "SubmissionStatusTypeID": 200
}