{
    "UserComments": [
        {
            "ID": 7828,
            "ChargePointID": 13283,
            "CommentTypeID": 100,
            "UserName": "Edmund Bullingham",
            "Comment": "The Park and Ride now closes at 19:30\nAlso anyone using this charger must use the bus service and will be fined £60 if they do not direct the bus driver to validate the plastic token dispenced by the barrier control panel. \nThe bus driver is under no obligation to volunteer this information.",
            "Rating": 5,
            "DateCreated": "2015-10-20T22:12:05.957Z",
            "User": {
                "ID": 6505,
                "Username": "Edmund Bullingham"
            },
            "CheckinStatusTypeID": 15
        },
        {
            "ID": 3863,
            "ChargePointID": 13283,
            "CommentTypeID": 50,
            "UserName": "alanbarlow7",
            "Comment": "Two identical charge points (total of 4 bays) here. Both type 2 points in use with e-Car club vehicles, alternative point available in park and ride.\nChargemaster points are now/currently free.",
            "DateCreated": "2015-02-22T23:36:00.967Z",
            "User": {
                "ID": 4623,
                "Username": "alanbarlow7"
            },
            "CheckinStatusTypeID": 100
        },
        {
            "ID": 1224,
            "ChargePointID": 13283,
            "CommentTypeID": 50,
            "UserName": "cavallino74",
            "Comment": "This uses ChargeMaster which is far more expensive than running the petrol engine on my Ampera, so having parked up and had a look, I gave up and moved my Ampera to a normal parking slot...",
            "DateCreated": "2014-09-17T08:05:28.47Z",
            "User": {
                "ID": 1855,
                "Username": "cavallino74"
            },
            "CheckinStatusTypeID": 40
        }
    ],
    "IsRecentlyVerified": false,
    "ID": 13283,
    "UUID": "48571B04-2C4C-4A13-BBDB-71B0657D3AD6",
    "DataProviderID": 1,
    "OperatorID": 32,
    "OperatorsReference": "1289,1231,1188",
    "UsageTypeID": 4,
    "UsageCost": "Inclusive; for Polar Plus subscription members only. Bus ride mandatory",
    "AddressInfo": {
        "ID": 13180,
        "Title": " Stratford Park and Ride",
        "AddressLine1": "Bishopston Lane",
        "Town": "Startford upon Avon",
        "StateOrProvince": "Warwickshire",
        "Postcode": "CV37 9QY",
        "CountryID": 1,
        "Latitude": 52.2074,
        "Longitude": -1.7307,
        "AccessComments": "Public access,  bus ride mandatory. Opening Hours Mo-Sa 07:30–23:30. Not available on Sundays",
        "RelatedURL": "https://www.warwickshire.gov.uk/stratfordparkandride",
        "DistanceUnit": 0
    },
    "Connections": [
        {
            "ID": 10702,
            "ConnectionTypeID": 25,
            "StatusTypeID": 50,
            "LevelID": 2,
            "Amps": 32,
            "Voltage": 230,
            "PowerKW": 7,
            "CurrentTypeID": 10,
            "Quantity": 3
        },
        {
            "ID": 19619,
            "ConnectionTypeID": 3,
            "StatusTypeID": 50,
            "LevelID": 2,
            "Amps": 13,
            "Voltage": 230,
            "PowerKW": 3,
            "CurrentTypeID": 10,
            "Quantity": 3
        }
    ],
    "NumberOfPoints": 4,
    "GeneralComments": "One charging point, two sockets, , One three pin BS1363 socket, rated at 3kW (mode 2; standard charge), , One seven pin Type 2 socket rated at 7kW , (mode 3; fast charge), , Fitted under Midlands PiP",
    "StatusTypeID": 50,
    "DateLastStatusUpdate": "2019-03-08T06:32:00Z",
    "DataQualityLevel": 3,
    "DateCreated": "2012-09-08T22:20:00Z",
    "SubmissionStatusTypeID": 200
}