{
    "IsRecentlyVerified": false,
    "ID": 72672,
    "UUID": "C17D50A2-AFE7-4B9D-9EC1-4AA2E4824AAB",
    "DataProviderID": 1,
    "OperatorID": 202,
    "UsageTypeID": 5,
    "UsageCost": "£0.25/kWh; £1.00 min",
    "AddressInfo": {
        "ID": 73018,
        "Title": "EV Driver Darsham Hamper Co-Op",
        "AddressLine1": "London Road",
        "AddressLine2": "Thorington",
        "Town": "Darsham",
        "StateOrProvince": "Suffolk",
        "Postcode": "IP17 3QR",
        "CountryID": 1,
        "Latitude": 52.290163,
        "Longitude": 1.542188,
        "RelatedURL": "https://map.evdriver.co.uk/",
        "DistanceUnit": 0
    },
    "Connections": [
        {
            "ID": 104191,
            "ConnectionTypeID": 25,
            "StatusTypeID": 50,
            "LevelID": 2,
            "Amps": 32,
            "Voltage": 400,
            "PowerKW": 22,
            "CurrentTypeID": 20,
            "Quantity": 2
        }
    ],
    "NumberOfPoints": 2,
    "GeneralComments": "APT EV-WB2M-SMART-3P-3G charge point",
    "StatusTypeID": 50,
    "DateLastStatusUpdate": "2016-10-31T14:44:00Z",
    "DataQualityLevel": 1,
    "DateCreated": "2016-10-31T14:44:00Z",
    "SubmissionStatusTypeID": 200
}