{
    "IsRecentlyVerified": false,
    "ID": 145615,
    "UUID": "1EA4D304-D7B8-4C2B-86A8-DB8200D24197",
    "DataProviderID": 2,
    "DataProvidersReference": "129946",
    "OperatorID": 89,
    "UsageTypeID": 1,
    "AddressInfo": {
        "ID": 145967,
        "Title": "335 Morreault",
        "AddressLine1": "335 Rue Moreault",
        "Town": "Rimouski",
        "StateOrProvince": "QC",
        "Postcode": "G5L 9C8",
        "CountryID": 44,
        "Latitude": 48.46174,
        "Longitude": -68.517001,
        "ContactTelephone1": "888-356-8911",
        "AccessComments": "24 hours daily",
        "RelatedURL": "https://flo.ca/",
        "DistanceUnit": 0
    },
    "Connections": [
        {
            "ID": 202328,
            "ConnectionTypeID": 1,
            "LevelID": 2,
            "Amps": 16,
            "Voltage": 230,
            "PowerKW": 3.7,
            "CurrentTypeID": 10,
            "Quantity": 4
        }
    ],
    "StatusTypeID": 50,
    "DateLastStatusUpdate": "2020-06-26T03:11:00Z",
    "DataQualityLevel": 3,
    "DateCreated": "2019-12-24T09:25:00Z",
    "SubmissionStatusTypeID": 100
}