{
    "IsRecentlyVerified": false,
    "ID": 186157,
    "UUID": "A833D542-05C6-4535-8B2C-D8C6E13C21B2",
    "DataProviderID": 29,
    "DataProvidersReference": "18381",
    "AddressInfo": {
        "ID": 186516,
        "Title": "Untertor 1",
        "AddressLine1": "Untertor 1",
        "Town": "Wasungen",
        "Postcode": "98634",
        "CountryID": 87,
        "Latitude": 50.665056,
        "Longitude": 10.367028,
        "DistanceUnit": 0
    },
    "Connections": [
        {
            "ID": 298004,
            "ConnectionTypeID": 25,
            "StatusTypeID": 50,
            "LevelID": 2,
            "PowerKW": 22,
            "CurrentTypeID": 20
        },
        {
            "ID": 298005,
            "ConnectionTypeID": 25,
            "StatusTypeID": 50,
            "LevelID": 2,
            "PowerKW": 22,
            "CurrentTypeID": 20
        }
    ],
    "StatusTypeID": 50,
    "DateLastStatusUpdate": "2021-07-12T02:45:00Z",
    "MetadataValues": [
        {
            "ID": 18399,
            "MetadataFieldID": 4,
            "ItemValue": "Data from the German chargepoint registry provided by Bundesnetzagentur.de under the CC-BY 4.0 license"
        }
    ],
    "DataQualityLevel": 3,
    "DateCreated": "2021-07-12T02:45:00Z",
    "SubmissionStatusTypeID": 100
}