{
    "IsRecentlyVerified": false,
    "ID": 65893,
    "UUID": "91FF16D0-6029-4DD1-B7A3-64FCE56712E5",
    "DataProviderID": 1,
    "OperatorID": 3315,
    "OperatorsReference": "51213",
    "UsageTypeID": 6,
    "UsageCost": "Free",
    "AddressInfo": {
        "ID": 66239,
        "Title": "University of Stirling  Cottrell Building",
        "AddressLine1": "East Link Road",
        "AddressLine2": "Cornton",
        "Town": "Stirling",
        "Postcode": "FK9 4LA",
        "CountryID": 1,
        "Latitude": 56.1451614,
        "Longitude": -3.92048650000004,
        "DistanceUnit": 0
    },
    "Connections": [
        {
            "ID": 91079,
            "ConnectionTypeID": 25,
            "StatusTypeID": 50,
            "LevelID": 2,
            "Amps": 32,
            "Voltage": 400,
            "PowerKW": 22,
            "CurrentTypeID": 20,
            "Quantity": 2
        }
    ],
    "NumberOfPoints": 2,
    "StatusTypeID": 50,
    "DateLastStatusUpdate": "2019-10-23T05:14:00Z",
    "DataQualityLevel": 1,
    "DateCreated": "2016-05-04T17:27:00Z",
    "SubmissionStatusTypeID": 100
}