{
    "IsRecentlyVerified": false,
    "ID": 28750,
    "UUID": "691FDE52-4345-457D-89C8-D8AC42FFFE8C",
    "DataProviderID": 2,
    "DataProvidersReference": "61587",
    "OperatorID": 5,
    "UsageTypeID": 1,
    "AddressInfo": {
        "ID": 29096,
        "Title": "BMW NORTHFIELD",
        "AddressLine1": "700 Frontage Rd",
        "Town": "Northfield",
        "StateOrProvince": "IL",
        "Postcode": "60093",
        "CountryID": 2,
        "Latitude": 42.1110709,
        "Longitude": -87.7753609,
        "ContactTelephone1": "888-758-4389",
        "AccessComments": "24 hours daily",
        "RelatedURL": "http://www.chargepoint.com/",
        "DistanceUnit": 0
    },
    "Connections": [
        {
            "ID": 31577,
            "ConnectionTypeID": 1,
            "LevelID": 2,
            "Amps": 16,
            "Voltage": 230,
            "PowerKW": 3.7,
            "CurrentTypeID": 10,
            "Quantity": 2
        }
    ],
    "DateLastStatusUpdate": "2020-06-26T03:05:00Z",
    "DataQualityLevel": 3,
    "DateCreated": "2014-11-28T03:38:00Z",
    "SubmissionStatusTypeID": 100
}