{
    "IsRecentlyVerified": false,
    "ID": 62993,
    "UUID": "448CA051-E237-41BA-87E7-7DCD72FC50B8",
    "DataProviderID": 26,
    "DataProvidersReference": "76251",
    "OperatorID": 179,
    "OperatorsReference": "Ecotap 1500523",
    "UsageCost": "0.00 afhankelijk van pas",
    "AddressInfo": {
        "ID": 63339,
        "Title": "Boxtelseweg 58",
        "AddressLine1": "Boxtelseweg 58",
        "Town": "Vught",
        "Postcode": "5261 NE",
        "CountryID": 159,
        "Latitude": 51.638733,
        "Longitude": 5.306912,
        "RelatedURL": "http://www.ecotap.nl",
        "DistanceUnit": 0
    },
    "Connections": [
        {
            "ID": 80091,
            "ConnectionTypeID": 25,
            "LevelID": 2,
            "PowerKW": 22,
            "CurrentTypeID": 10
        }
    ],
    "NumberOfPoints": 2,
    "StatusTypeID": 50,
    "DateLastStatusUpdate": "2016-06-04T02:39:00Z",
    "DataQualityLevel": 3,
    "DateCreated": "2016-03-03T12:29:00Z",
    "SubmissionStatusTypeID": 100
}