{
    "IsRecentlyVerified": false,
    "ID": 84091,
    "UUID": "0394DC90-F231-4303-9377-E5E71D335E0E",
    "DataProviderID": 1,
    "OperatorID": 23,
    "OperatorsReference": "24749",
    "UsageTypeID": 6,
    "AddressInfo": {
        "ID": 84437,
        "Title": "Landhotel & Restaurant Klostermaier",
        "AddressLine1": "9 Mittenwalder Straße",
        "Town": "Icking",
        "Postcode": "82057",
        "CountryID": 87,
        "Latitude": 47.952944,
        "Longitude": 11.437541,
        "ContactTelephone1": "+49 8178 86787 0",
        "DistanceUnit": 0
    },
    "Connections": [
        {
            "ID": 119492,
            "ConnectionTypeID": 30,
            "StatusTypeID": 50,
            "LevelID": 2,
            "Amps": 32,
            "Voltage": 400,
            "PowerKW": 22,
            "CurrentTypeID": 20,
            "Quantity": 1
        }
    ],
    "NumberOfPoints": 1,
    "GeneralComments": "1 Tesla Connector, up to 22kW.Available for patrons only. Please see front desk.",
    "StatusTypeID": 50,
    "DateLastStatusUpdate": "2018-10-03T22:03:00Z",
    "DataQualityLevel": 1,
    "DateCreated": "2017-02-16T15:09:00Z",
    "SubmissionStatusTypeID": 200
}