{
    "IsRecentlyVerified": false,
    "ID": 108785,
    "UUID": "AEFF2752-3C32-40BA-901D-77557AEB09D1",
    "DataProviderID": 1,
    "OperatorID": 23,
    "OperatorsReference": "45287",
    "UsageTypeID": 4,
    "AddressInfo": {
        "ID": 109131,
        "Title": "Norrviken Gardens",
        "AddressLine1": "Kattviksvägen 233",
        "StateOrProvince": "Båstad",
        "Postcode": "26991",
        "CountryID": 216,
        "Latitude": 56.450592,
        "Longitude": 12.788688,
        "ContactTelephone1": " +46 431302100",
        "DistanceUnit": 0
    },
    "Connections": [
        {
            "ID": 153900,
            "ConnectionTypeID": 30,
            "StatusTypeID": 50,
            "LevelID": 2,
            "Amps": 16,
            "Voltage": 400,
            "PowerKW": 11,
            "CurrentTypeID": 20,
            "Quantity": 1
        }
    ],
    "NumberOfPoints": 1,
    "GeneralComments": "1 Tesla Connector, up to 11kW.Available for customers. Please call ahead.",
    "StatusTypeID": 50,
    "DateLastStatusUpdate": "2018-10-11T12:40:00Z",
    "DataQualityLevel": 1,
    "DateCreated": "2018-10-11T12:40:00Z",
    "SubmissionStatusTypeID": 200
}