{
    "IsRecentlyVerified": false,
    "ID": 137240,
    "UUID": "D0CE8763-D0DE-4A0C-8493-DAA3E8B3AD6E",
    "DataProviderID": 2,
    "DataProvidersReference": "149008",
    "OperatorID": 39,
    "UsageTypeID": 1,
    "AddressInfo": {
        "ID": 137586,
        "Title": "The Shoreline at SoLeMia",
        "AddressLine1": "2321 Laguna Circle",
        "Town": "North Miami",
        "StateOrProvince": "FL",
        "Postcode": "33181",
        "CountryID": 2,
        "Latitude": 25.9113722,
        "Longitude": -80.1519746,
        "ContactTelephone1": "800-663-5633",
        "AccessComments": "MO: Not Specified; TU: Not Specified; WE: Not Specified; TH: Not Specified; FR: Not Specified; SA: Not Specified; SU: Not Specified",
        "RelatedURL": "http://www.semacharge.com/",
        "DistanceUnit": 0
    },
    "Connections": [
        {
            "ID": 192108,
            "ConnectionTypeID": 1,
            "LevelID": 2,
            "Amps": 16,
            "Voltage": 230,
            "PowerKW": 3,
            "CurrentTypeID": 10,
            "Quantity": 16
        }
    ],
    "StatusTypeID": 50,
    "DateLastStatusUpdate": "2019-12-24T09:04:00Z",
    "DataQualityLevel": 3,
    "DateCreated": "2019-12-24T09:04:00Z",
    "SubmissionStatusTypeID": 100
}