{
    "IsRecentlyVerified": false,
    "ID": 62057,
    "UUID": "759B2F5C-B595-476B-B590-1E0DCFD6D760",
    "DataProviderID": 1,
    "OperatorID": 23,
    "OperatorsReference": "13147",
    "UsageTypeID": 1,
    "UsageCost": "Free",
    "AddressInfo": {
        "ID": 62403,
        "Title": "Great Oak Manor - Tesla",
        "AddressLine1": "10568 Cliff Rd",
        "Town": "Chestertown",
        "StateOrProvince": "MD",
        "Postcode": "21620",
        "CountryID": 2,
        "Latitude": 39.2687177,
        "Longitude": -76.2025573,
        "ContactTelephone1": "410-778-5943  877-798-3752",
        "AccessComments": "24 hours daily; for Tesla use only",
        "RelatedURL": "http://www.teslamotors.com/supercharger",
        "DistanceUnit": 0
    },
    "Connections": [
        {
            "ID": 78960,
            "ConnectionTypeID": 30,
            "StatusTypeID": 50,
            "LevelID": 2,
            "Amps": 16,
            "Voltage": 230,
            "PowerKW": 16,
            "CurrentTypeID": 10,
            "Quantity": 2
        }
    ],
    "NumberOfPoints": 2,
    "StatusTypeID": 50,
    "DateLastStatusUpdate": "2017-01-31T23:03:00Z",
    "DataQualityLevel": 3,
    "DateCreated": "2016-03-03T11:38:00Z",
    "SubmissionStatusTypeID": 100
}