{
    "IsRecentlyVerified": false,
    "ID": 73292,
    "UUID": "36D0CBF9-62D5-473B-8ECF-2B559340BF65",
    "DataProviderID": 1,
    "OperatorID": 103,
    "UsageTypeID": 4,
    "AddressInfo": {
        "ID": 73638,
        "Title": "Rasthof Wernberg",
        "AddressLine1": "Klaus-Conrad-Straße 2a",
        "AddressLine2": "Autobahn A93",
        "Town": "Wernberg-Köblitz",
        "StateOrProvince": "Landkreis Schwandorf",
        "Postcode": "92533",
        "CountryID": 87,
        "Latitude": 49.532517051159964,
        "Longitude": 12.135792422090148,
        "AccessComments": "24/7 nutzbare mit The New Motion, PlugSurfing, ChargeNow Ladekarten und PlugSurfing App und anderen.",
        "RelatedURL": "http://www.allego.eu/",
        "DistanceUnit": 0
    },
    "Connections": [
        {
            "ID": 105461,
            "ConnectionTypeID": 2,
            "StatusTypeID": 50,
            "LevelID": 3,
            "PowerKW": 50,
            "CurrentTypeID": 30,
            "Quantity": 1
        },
        {
            "ID": 105462,
            "ConnectionTypeID": 33,
            "StatusTypeID": 50,
            "LevelID": 3,
            "PowerKW": 50,
            "CurrentTypeID": 30,
            "Quantity": 1
        },
        {
            "ID": 105463,
            "ConnectionTypeID": 1036,
            "StatusTypeID": 50,
            "LevelID": 3,
            "Amps": 63,
            "Voltage": 400,
            "PowerKW": 43,
            "CurrentTypeID": 20,
            "Quantity": 1
        }
    ],
    "NumberOfPoints": 2,
    "StatusTypeID": 50,
    "DateLastStatusUpdate": "2016-11-17T10:47:00Z",
    "DataQualityLevel": 1,
    "DateCreated": "2016-11-17T10:47:00Z",
    "SubmissionStatusTypeID": 200
}