{
    "IsRecentlyVerified": false,
    "ID": 158355,
    "UUID": "1A10974D-DA7D-4009-92C7-0AD1663A7BE1",
    "DataProviderID": 2,
    "DataProvidersReference": "153040",
    "OperatorID": 39,
    "UsageTypeID": 1,
    "AddressInfo": {
        "ID": 158709,
        "Title": "The Standard Garage",
        "AddressLine1": "315 Boyett Street",
        "Town": "College Station",
        "StateOrProvince": "TX",
        "Postcode": "77840",
        "CountryID": 2,
        "Latitude": 30.6187233,
        "Longitude": -96.3489274,
        "ContactTelephone1": "800-663-5633",
        "AccessComments": "MO: Not Specified; TU: Not Specified; WE: Not Specified; TH: Not Specified; FR: Not Specified; SA: Not Specified; SU: Not Specified",
        "RelatedURL": "http://www.semacharge.com/",
        "DistanceUnit": 0
    },
    "Connections": [
        {
            "ID": 228323,
            "ConnectionTypeID": 1,
            "LevelID": 2,
            "Amps": 16,
            "Voltage": 230,
            "PowerKW": 3.7,
            "CurrentTypeID": 10,
            "Quantity": 4
        }
    ],
    "StatusTypeID": 50,
    "DateLastStatusUpdate": "2020-06-26T02:54:00Z",
    "DataQualityLevel": 3,
    "DateCreated": "2020-06-26T02:54:00Z",
    "SubmissionStatusTypeID": 100
}