{
    "IsRecentlyVerified": false,
    "ID": 85593,
    "UUID": "C622C9D3-3595-4045-8D60-E33CEA5DF291",
    "DataProviderID": 1,
    "OperatorID": 23,
    "OperatorsReference": "26408",
    "UsageTypeID": 6,
    "AddressInfo": {
        "ID": 85939,
        "Title": "Schlosshotel Hohenhaus",
        "AddressLine1": "1 Hohenhaus",
        "Town": "Herleshausen",
        "Postcode": "37293",
        "CountryID": 87,
        "Latitude": 51.041713,
        "Longitude": 10.080935,
        "ContactTelephone1": "+49 5654 9870",
        "DistanceUnit": 0
    },
    "Connections": [
        {
            "ID": 121697,
            "ConnectionTypeID": 30,
            "StatusTypeID": 50,
            "LevelID": 2,
            "Amps": 32,
            "Voltage": 230,
            "PowerKW": 17,
            "CurrentTypeID": 20,
            "Quantity": 2
        }
    ],
    "NumberOfPoints": 2,
    "GeneralComments": "2 Tesla Connectors, up to 17kW.Available for patrons only. Please call ahead.",
    "StatusTypeID": 50,
    "DateLastStatusUpdate": "2018-10-03T19:56:00Z",
    "DataQualityLevel": 1,
    "DateCreated": "2017-04-08T05:42:00Z",
    "SubmissionStatusTypeID": 200
}