{
    "IsRecentlyVerified": false,
    "ID": 120506,
    "UUID": "C87070D2-536B-4D7C-9EE3-CA8644623698",
    "DataProviderID": 2,
    "DataProvidersReference": "82403",
    "OperatorID": 39,
    "UsageTypeID": 4,
    "AddressInfo": {
        "ID": 120852,
        "Title": "Kaiser San Diego MC - Clairemont Mesa",
        "AddressLine1": "9455 Clairemont Mesa Boulevard",
        "Town": "San Diego",
        "StateOrProvince": "CA",
        "Postcode": "92123",
        "CountryID": 2,
        "Latitude": 32.8314027,
        "Longitude": -117.1246357,
        "ContactTelephone1": "800-663-5633",
        "AccessComments": "MO: Not Specified; TU: Not Specified; WE: Not Specified; TH: Not Specified; FR: Not Specified; SA: Not Specified; SU: Not Specified",
        "RelatedURL": "http://www.semacharge.com/",
        "DistanceUnit": 0
    },
    "Connections": [
        {
            "ID": 169859,
            "ConnectionTypeID": 1,
            "LevelID": 2,
            "Amps": 16,
            "Voltage": 230,
            "PowerKW": 3,
            "CurrentTypeID": 10,
            "Quantity": 10
        }
    ],
    "DateLastStatusUpdate": "2019-04-01T04:59:00Z",
    "DataQualityLevel": 3,
    "DateCreated": "2019-04-01T04:59:00Z",
    "SubmissionStatusTypeID": 100
}