{
    "IsRecentlyVerified": false,
    "ID": 35423,
    "UUID": "54E0C641-B816-4990-BBAF-ED81B3F2729D",
    "DataProviderID": 26,
    "DataProvidersReference": "37155",
    "OperatorID": 157,
    "OperatorsReference": "NewMotion 02008073",
    "UsageCost": "0.00 jaarabonnement",
    "AddressInfo": {
        "ID": 35769,
        "Title": "Zilverstraat 1",
        "AddressLine1": "Zilverstraat 1",
        "Town": "Zoetermeer",
        "Postcode": "2718 RP",
        "CountryID": 159,
        "Latitude": 52.0432856,
        "Longitude": 4.50272770000004,
        "ContactTelephone1": "088 0109500",
        "RelatedURL": "http://thenewmotion.nl/",
        "DistanceUnit": 0
    },
    "Connections": [
        {
            "ID": 38934,
            "ConnectionTypeID": 25,
            "LevelID": 2,
            "PowerKW": 3.7,
            "CurrentTypeID": 10
        }
    ],
    "NumberOfPoints": 1,
    "StatusTypeID": 50,
    "DateLastStatusUpdate": "2016-06-04T02:44:00Z",
    "DataQualityLevel": 3,
    "DateCreated": "2015-01-09T06:04:00Z",
    "SubmissionStatusTypeID": 100
}