{
    "IsRecentlyVerified": false,
    "ID": 62734,
    "UUID": "402A3F24-CC40-4491-9BB9-DA5CE0A6E5ED",
    "DataProviderID": 26,
    "DataProvidersReference": "20278",
    "OperatorID": 162,
    "OperatorsReference": "日産プリンス札幌販売㈱小樽支店",
    "UsageCost": "0.00 onbekend",
    "AddressInfo": {
        "ID": 63080,
        "Title": "国道５号",
        "AddressLine1": "国道５号",
        "Town": "小樽市",
        "Postcode": "",
        "CountryID": 114,
        "Latitude": 43.221085,
        "Longitude": 140.957901,
        "DistanceUnit": 0
    },
    "Connections": [
        {
            "ID": 79661,
            "ConnectionTypeID": 2,
            "LevelID": 3,
            "PowerKW": 50,
            "CurrentTypeID": 30
        }
    ],
    "NumberOfPoints": 1,
    "StatusTypeID": 50,
    "DateLastStatusUpdate": "2016-03-03T12:29:00Z",
    "DataQualityLevel": 3,
    "DateCreated": "2016-03-03T12:29:00Z",
    "SubmissionStatusTypeID": 100
}