{
    "IsRecentlyVerified": false,
    "ID": 28710,
    "UUID": "A6D1A2F1-D7C8-421E-8216-D8320BAD021D",
    "DataProviderID": 2,
    "DataProvidersReference": "46789",
    "UsageTypeID": 1,
    "AddressInfo": {
        "ID": 29056,
        "Title": "Paulson Electric",
        "AddressLine1": "3050 12 St SW",
        "Town": "Cedar Rapids",
        "StateOrProvince": "IA",
        "Postcode": "52404",
        "CountryID": 2,
        "Latitude": 41.947533,
        "Longitude": -91.6870579,
        "ContactTelephone1": "855-443-3873",
        "AccessComments": "24 hours daily",
        "RelatedURL": "",
        "DistanceUnit": 0
    },
    "Connections": [
        {
            "ID": 31536,
            "ConnectionTypeID": 1,
            "LevelID": 2,
            "Amps": 16,
            "Voltage": 230,
            "PowerKW": 3.7,
            "CurrentTypeID": 10,
            "Quantity": 1
        }
    ],
    "DateLastStatusUpdate": "2020-06-26T03:05:00Z",
    "DataQualityLevel": 3,
    "DateCreated": "2014-11-28T03:38:00Z",
    "SubmissionStatusTypeID": 100
}