{
    "IsRecentlyVerified": false,
    "ID": 138295,
    "UUID": "98A85E9B-9027-4D08-AEA1-12F8169BA272",
    "DataProviderID": 2,
    "DataProvidersReference": "147139",
    "OperatorID": 9,
    "UsageTypeID": 1,
    "AddressInfo": {
        "ID": 138644,
        "Title": "WALGREENS #6486",
        "AddressLine1": "1111 W Vine St",
        "Town": "Kissimmee",
        "StateOrProvince": "FL",
        "Postcode": "34741",
        "CountryID": 2,
        "Latitude": 28.30452538,
        "Longitude": -81.41508484,
        "ContactTelephone1": "888-998-2546",
        "AccessComments": "MON: 24 hours | TUE: 24 hours | WED: 24 hours | THU: 24 hours | FRI: 24 hours | SAT: 24 hours | SUN: 24 hours",
        "RelatedURL": "http://www.blinkcharging.com/",
        "DistanceUnit": 0
    },
    "Connections": [
        {
            "ID": 193383,
            "ConnectionTypeID": 1,
            "LevelID": 2,
            "Amps": 16,
            "Voltage": 230,
            "PowerKW": 3,
            "CurrentTypeID": 10,
            "Quantity": 1
        }
    ],
    "StatusTypeID": 50,
    "DateLastStatusUpdate": "2019-12-24T09:08:00Z",
    "DataQualityLevel": 3,
    "DateCreated": "2019-12-24T09:08:00Z",
    "SubmissionStatusTypeID": 100
}