{
    "IsRecentlyVerified": false,
    "ID": 177799,
    "UUID": "FD2443EE-D5D9-4FF2-97B7-A1D816B91C94",
    "DataProviderID": 29,
    "DataProvidersReference": "7420",
    "AddressInfo": {
        "ID": 178158,
        "Title": "Lindenstraße 87",
        "AddressLine1": "Lindenstraße 87",
        "Town": "Siegburg",
        "Postcode": "53721",
        "CountryID": 87,
        "Latitude": 50.796868,
        "Longitude": 7.192346,
        "DistanceUnit": 0
    },
    "Connections": [
        {
            "ID": 277411,
            "ConnectionTypeID": 25,
            "StatusTypeID": 50,
            "LevelID": 2,
            "PowerKW": 22,
            "CurrentTypeID": 20
        },
        {
            "ID": 277412,
            "ConnectionTypeID": 25,
            "StatusTypeID": 50,
            "LevelID": 2,
            "PowerKW": 22,
            "CurrentTypeID": 20
        }
    ],
    "StatusTypeID": 0,
    "DateLastStatusUpdate": "2021-07-12T02:45:00Z",
    "MetadataValues": [
        {
            "ID": 10093,
            "MetadataFieldID": 4,
            "ItemValue": "Data from the German chargepoint registry provided by Bundesnetzagentur.de under the CC-BY 4.0 license"
        }
    ],
    "DataQualityLevel": 3,
    "DateCreated": "2021-07-08T09:49:00Z",
    "SubmissionStatusTypeID": 100
}