{
    "IsRecentlyVerified": false,
    "ID": 174004,
    "UUID": "15DBC74A-C4EC-4EF6-ADC4-5B16DB111480",
    "DataProviderID": 1,
    "OperatorID": 31,
    "UsageTypeID": 1,
    "AddressInfo": {
        "ID": 174363,
        "Title": "White Oak Casino",
        "AddressLine1": "45830 US-2",
        "Town": "Deer River",
        "StateOrProvince": "MN",
        "Postcode": "56636",
        "CountryID": 2,
        "Latitude": 47.336780220906064,
        "Longitude": -93.79995075514717,
        "DistanceUnit": 0
    },
    "Connections": [
        {
            "ID": 268242,
            "ConnectionTypeID": 1,
            "StatusTypeID": 50,
            "Quantity": 2
        }
    ],
    "NumberOfPoints": 2,
    "StatusTypeID": 50,
    "DateLastStatusUpdate": "2021-03-10T10:07:00Z",
    "DataQualityLevel": 1,
    "DateCreated": "2021-03-09T22:50:00Z",
    "SubmissionStatusTypeID": 200
}