{
    "IsRecentlyVerified": false,
    "ID": 89744,
    "UUID": "8C651F3C-09CC-40C2-A6EE-29D8C8627EA9",
    "DataProviderID": 2,
    "DataProvidersReference": "82260",
    "OperatorID": 3372,
    "UsageTypeID": 1,
    "AddressInfo": {
        "ID": 90090,
        "Title": "Fairport Electric",
        "AddressLine1": "43 Lift Bridge Ln E",
        "Town": "Fairport",
        "StateOrProvince": "NY",
        "Postcode": "14450",
        "CountryID": 2,
        "Latitude": 43.10187,
        "Longitude": -77.43936,
        "ContactTelephone1": "585-223-9500",
        "AccessComments": "24 hours daily",
        "RelatedURL": "http://evconnect.com/",
        "DistanceUnit": 0
    },
    "Connections": [
        {
            "ID": 127182,
            "ConnectionTypeID": 1,
            "LevelID": 2,
            "Amps": 16,
            "Voltage": 230,
            "PowerKW": 3.7,
            "CurrentTypeID": 10,
            "Quantity": 1
        }
    ],
    "DateLastStatusUpdate": "2020-06-26T03:06:00Z",
    "DataQualityLevel": 3,
    "DateCreated": "2017-06-22T08:16:00Z",
    "SubmissionStatusTypeID": 100
}