{
    "IsRecentlyVerified": false,
    "ID": 32641,
    "UUID": "9E6CFC13-72A8-40F5-BD23-D65EFC5A6992",
    "DataProviderID": 26,
    "DataProvidersReference": "28174",
    "OperatorID": 157,
    "OperatorsReference": "NewMotion 02002832",
    "UsageCost": "0.00 jaarabonnement",
    "AddressInfo": {
        "ID": 32987,
        "Title": "John F. Kennedylaan",
        "AddressLine1": "John F. Kennedylaan",
        "Town": "Peel en Maas",
        "Postcode": "5981 WZ",
        "CountryID": 159,
        "Latitude": 51.3285789489746,
        "Longitude": 5.96983194351196,
        "ContactTelephone1": "088 0109500",
        "RelatedURL": "http://thenewmotion.nl/",
        "DistanceUnit": 0
    },
    "Connections": [
        {
            "ID": 36152,
            "ConnectionTypeID": 25,
            "LevelID": 2,
            "PowerKW": 3.7,
            "CurrentTypeID": 10
        }
    ],
    "NumberOfPoints": 1,
    "StatusTypeID": 50,
    "DateLastStatusUpdate": "2016-06-04T02:38:00Z",
    "DataQualityLevel": 3,
    "DateCreated": "2015-01-09T06:03:00Z",
    "SubmissionStatusTypeID": 100
}