{
    "IsRecentlyVerified": false,
    "ID": 176384,
    "UUID": "1BC5366F-195C-4A3F-92D0-239E310ABE7D",
    "DataProviderID": 29,
    "DataProvidersReference": "17259",
    "AddressInfo": {
        "ID": 176743,
        "Title": "Am Bauernmarkt 1-3",
        "AddressLine1": "Am Bauernmarkt 1-3",
        "Town": "Bad Hindelang",
        "Postcode": "87541",
        "CountryID": 87,
        "Latitude": 47.504931,
        "Longitude": 10.370535,
        "DistanceUnit": 0
    },
    "Connections": [
        {
            "ID": 274230,
            "ConnectionTypeID": 25,
            "StatusTypeID": 50,
            "LevelID": 2,
            "PowerKW": 22,
            "CurrentTypeID": 20
        },
        {
            "ID": 274231,
            "ConnectionTypeID": 25,
            "StatusTypeID": 50,
            "LevelID": 2,
            "PowerKW": 22,
            "CurrentTypeID": 20
        }
    ],
    "StatusTypeID": 0,
    "DateLastStatusUpdate": "2021-07-09T03:10:00Z",
    "MetadataValues": [
        {
            "ID": 8679,
            "MetadataFieldID": 4,
            "ItemValue": "Data from the German chargepoint registry provided by Bundesnetzagentur.de under the CC-BY 4.0 license"
        }
    ],
    "DataQualityLevel": 3,
    "DateCreated": "2021-07-08T09:48:00Z",
    "SubmissionStatusTypeID": 100
}