{
    "IsRecentlyVerified": false,
    "ID": 150481,
    "UUID": "9EB230EF-3BB2-49A4-8EFB-96C0EF1CC359",
    "DataProviderID": 28,
    "DataProvidersReference": "FR*M13*P13206*004",
    "UsageTypeID": 5,
    "AddressInfo": {
        "ID": 150834,
        "Title": "MARSEILLE-6E - Rue Paradis",
        "AddressLine1": "Rue Paradis 13006 MARSEILLE-6E",
        "CountryID": 80,
        "Latitude": 43.287576,
        "Longitude": 5.379221,
        "AccessComments": "24h/24 7j/7",
        "DistanceUnit": 0
    },
    "Connections": [
        {
            "ID": 209262,
            "ConnectionTypeID": 28,
            "StatusTypeID": 50,
            "LevelID": 2,
            "PowerKW": 22,
            "CurrentTypeID": 10
        },
        {
            "ID": 209263,
            "ConnectionTypeID": 1036,
            "StatusTypeID": 50,
            "LevelID": 2,
            "PowerKW": 22,
            "CurrentTypeID": 20
        },
        {
            "ID": 238127,
            "ConnectionTypeID": 28,
            "StatusTypeID": 50,
            "LevelID": 2,
            "PowerKW": 22,
            "CurrentTypeID": 10
        },
        {
            "ID": 238128,
            "ConnectionTypeID": 1036,
            "StatusTypeID": 50,
            "LevelID": 2,
            "PowerKW": 22,
            "CurrentTypeID": 20
        }
    ],
    "GeneralComments": "Recharge par badge et avec une application smartphone",
    "StatusTypeID": 50,
    "DateLastStatusUpdate": "2020-08-27T05:10:00Z",
    "DataQualityLevel": 2,
    "DateCreated": "2020-03-15T06:17:00Z",
    "SubmissionStatusTypeID": 100
}