{
    "IsRecentlyVerified": false,
    "ID": 186150,
    "UUID": "E388BD9A-3039-4EB1-B172-2A1AD80D2F73",
    "DataProviderID": 29,
    "DataProvidersReference": "16665",
    "OperatorID": 86,
    "AddressInfo": {
        "ID": 186509,
        "Title": "Umgehungsstraße 45",
        "AddressLine1": "Umgehungsstraße 45",
        "Town": "Lauterbach",
        "Postcode": "36341",
        "CountryID": 87,
        "Latitude": 50.6415537,
        "Longitude": 9.3923888,
        "DistanceUnit": 0
    },
    "Connections": [
        {
            "ID": 297974,
            "ConnectionTypeID": 1036,
            "StatusTypeID": 50,
            "LevelID": 3,
            "PowerKW": 43,
            "CurrentTypeID": 20
        },
        {
            "ID": 297975,
            "ConnectionTypeID": 33,
            "StatusTypeID": 50,
            "LevelID": 3,
            "PowerKW": 50,
            "CurrentTypeID": 30
        },
        {
            "ID": 297976,
            "ConnectionTypeID": 2,
            "StatusTypeID": 50,
            "LevelID": 3,
            "PowerKW": 50,
            "CurrentTypeID": 30
        }
    ],
    "StatusTypeID": 50,
    "DateLastStatusUpdate": "2021-07-12T02:45:00Z",
    "MetadataValues": [
        {
            "ID": 18392,
            "MetadataFieldID": 4,
            "ItemValue": "Data from the German chargepoint registry provided by Bundesnetzagentur.de under the CC-BY 4.0 license"
        }
    ],
    "DataQualityLevel": 3,
    "DateCreated": "2021-07-12T02:45:00Z",
    "SubmissionStatusTypeID": 100
}