{
    "IsRecentlyVerified": false,
    "ID": 89360,
    "UUID": "DFD17AE0-5AE6-4ABD-A3FA-BF0F8E8F0D3D",
    "DataProviderID": 2,
    "DataProvidersReference": "82601",
    "OperatorID": 5,
    "UsageTypeID": 1,
    "AddressInfo": {
        "ID": 89706,
        "Title": "PIEDMONT EMC",
        "AddressLine1": "2500 NC-86 PEMC Visitor Lot",
        "Town": "Hillsborough",
        "StateOrProvince": "NC",
        "Postcode": "27278",
        "CountryID": 2,
        "Latitude": 36.0455465,
        "Longitude": -79.0807055,
        "ContactTelephone1": "888-758-4389",
        "AccessComments": "24 hours daily",
        "RelatedURL": "http://www.chargepoint.com/",
        "DistanceUnit": 0
    },
    "Connections": [
        {
            "ID": 126747,
            "ConnectionTypeID": 1,
            "LevelID": 2,
            "Amps": 16,
            "Voltage": 230,
            "PowerKW": 3,
            "CurrentTypeID": 10,
            "Quantity": 2
        }
    ],
    "DateLastStatusUpdate": "2019-04-06T04:02:00Z",
    "DataQualityLevel": 3,
    "DateCreated": "2017-06-22T08:16:00Z",
    "SubmissionStatusTypeID": 100
}