{
    "MediaItems": [
        {
            "ID": 19116,
            "ChargePointID": 112634,
            "ItemURL": "https://s3-ap-southeast-2.amazonaws.com/openchargemap/images/LV/OCM112634/OCM-112634.orig.2019080316032246.png",
            "ItemThumbnailURL": "https://s3-ap-southeast-2.amazonaws.com/openchargemap/images/LV/OCM112634/OCM-112634.thmb.2019080316032246.png",
            "Comment": "",
            "IsEnabled": true,
            "IsVideo": false,
            "IsFeaturedItem": false,
            "IsExternalResource": false,
            "User": {
                "ID": 21105,
                "Username": "Karlis"
            },
            "DateCreated": "2019-08-03T16:04:00Z"
        },
        {
            "ID": 19115,
            "ChargePointID": 112634,
            "ItemURL": "https://s3-ap-southeast-2.amazonaws.com/openchargemap/images/LV/OCM112634/OCM-112634.orig.2019080316015557.png",
            "ItemThumbnailURL": "https://s3-ap-southeast-2.amazonaws.com/openchargemap/images/LV/OCM112634/OCM-112634.thmb.2019080316015557.png",
            "Comment": "Cafe and shop are 50m away. ",
            "IsEnabled": true,
            "IsVideo": false,
            "IsFeaturedItem": false,
            "IsExternalResource": false,
            "User": {
                "ID": 21105,
                "Username": "Karlis"
            },
            "DateCreated": "2019-08-03T16:02:00Z"
        }
    ],
    "IsRecentlyVerified": false,
    "ID": 112634,
    "UUID": "976D81C6-58C6-4639-A63A-0386D885B596",
    "DataProviderID": 1,
    "OperatorID": 3319,
    "UsageTypeID": 5,
    "UsageCost": "0.15€/min",
    "AddressInfo": {
        "ID": 112980,
        "Title": "e-mobi - Kalvenes skola",
        "AddressLine1": "Skolas",
        "Town": "Kalvene",
        "Postcode": "LV-3443",
        "CountryID": 125,
        "Latitude": 56.604969779265154,
        "Longitude": 21.738250416593928,
        "ContactTelephone1": "+371 22001859",
        "RelatedURL": "https://portal.e-mobi.lv",
        "DistanceUnit": 0
    },
    "Connections": [
        {
            "ID": 158491,
            "ConnectionTypeID": 2,
            "StatusTypeID": 50,
            "LevelID": 3,
            "PowerKW": 50,
            "CurrentTypeID": 30,
            "Quantity": 1
        },
        {
            "ID": 158492,
            "ConnectionTypeID": 33,
            "StatusTypeID": 50,
            "LevelID": 3,
            "PowerKW": 50,
            "CurrentTypeID": 30,
            "Quantity": 1
        },
        {
            "ID": 158493,
            "ConnectionTypeID": 25,
            "StatusTypeID": 50,
            "LevelID": 3,
            "PowerKW": 43,
            "CurrentTypeID": 20
        }
    ],
    "NumberOfPoints": 2,
    "StatusTypeID": 50,
    "DateLastStatusUpdate": "2019-08-03T16:04:00Z",
    "DataQualityLevel": 1,
    "DateCreated": "2018-11-09T20:02:00Z",
    "SubmissionStatusTypeID": 200
}