{
    "MediaItems": [
        {
            "ID": 26465,
            "ChargePointID": 112163,
            "ItemURL": "https://s3-ap-southeast-2.amazonaws.com/openchargemap/images/CA/OCM112163/OCM-112163.orig.2021020901481693.jpg",
            "ItemThumbnailURL": "https://s3-ap-southeast-2.amazonaws.com/openchargemap/images/CA/OCM112163/OCM-112163.thmb.2021020901481693.jpg",
            "Comment": "",
            "IsEnabled": true,
            "IsVideo": false,
            "IsFeaturedItem": false,
            "IsExternalResource": false,
            "User": {
                "ID": 30533,
                "Username": "cdnjay"
            },
            "DateCreated": "2021-02-09T01:48:00Z"
        }
    ],
    "IsRecentlyVerified": false,
    "ID": 112163,
    "UUID": "E31BB646-B709-4894-B196-B9EB492905D0",
    "DataProviderID": 1,
    "OperatorID": 51,
    "UsageTypeID": 1,
    "AddressInfo": {
        "ID": 112509,
        "Title": "Peavey Mart",
        "AddressLine1": "820C 51st St E",
        "Town": "Saskatoon",
        "StateOrProvince": "SK",
        "Postcode": "S7K 0X8",
        "CountryID": 44,
        "Latitude": 52.175728,
        "Longitude": -106.653121,
        "ContactTelephone1": "306-242-0981",
        "AccessComments": "24 hours daily",
        "RelatedURL": "",
        "DistanceUnit": 0
    },
    "Connections": [
        {
            "ID": 157714,
            "ConnectionTypeID": 1,
            "LevelID": 2,
            "Amps": 70,
            "Voltage": 208,
            "PowerKW": 14.6,
            "CurrentTypeID": 10,
            "Quantity": 1
        }
    ],
    "DateLastStatusUpdate": "2021-02-09T01:48:00Z",
    "DataQualityLevel": 3,
    "DateCreated": "2018-10-18T23:37:00Z",
    "SubmissionStatusTypeID": 100
}