{
    "IsRecentlyVerified": false,
    "ID": 107933,
    "UUID": "239F5158-BCC7-459A-8B70-1BBAAE283DD6",
    "DataProviderID": 1,
    "OperatorID": 23,
    "OperatorsReference": "28928",
    "UsageTypeID": 4,
    "UsageCost": "£0.24/kWh;other tariffs for older cars",
    "AddressInfo": {
        "ID": 108279,
        "Title": "Scotch Corner Supercharger",
        "AddressLine1": "A1 Scotch Corner",
        "Town": "Darlington",
        "Postcode": "DL10 6NT",
        "CountryID": 1,
        "Latitude": 54.442066,
        "Longitude": -1.671229,
        "DistanceUnit": 0
    },
    "Connections": [
        {
            "ID": 152423,
            "ConnectionTypeID": 27,
            "StatusTypeID": 50,
            "LevelID": 3,
            "PowerKW": 120,
            "CurrentTypeID": 30,
            "Quantity": 8
        }
    ],
    "NumberOfPoints": 8,
    "StatusTypeID": 50,
    "DateLastStatusUpdate": "2019-03-22T19:04:00Z",
    "DataQualityLevel": 1,
    "DateCreated": "2018-08-19T20:10:00Z",
    "SubmissionStatusTypeID": 200
}