{
    "IsRecentlyVerified": false,
    "ID": 179126,
    "UUID": "C373B867-6DBA-4E7F-A9AC-438917152032",
    "DataProviderID": 29,
    "DataProvidersReference": "3476",
    "OperatorID": 45,
    "AddressInfo": {
        "ID": 179485,
        "Title": "Alte Rostocker Str. 9",
        "AddressLine1": "Alte Rostocker Str. 9",
        "Town": "Stralsund",
        "Postcode": "18437",
        "CountryID": 87,
        "Latitude": 54.306984,
        "Longitude": 13.075038,
        "DistanceUnit": 0
    },
    "Connections": [
        {
            "ID": 280492,
            "ConnectionTypeID": 33,
            "StatusTypeID": 50,
            "LevelID": 3,
            "PowerKW": 22,
            "CurrentTypeID": 30
        },
        {
            "ID": 280493,
            "ConnectionTypeID": 25,
            "StatusTypeID": 50,
            "LevelID": 2,
            "PowerKW": 11,
            "CurrentTypeID": 20
        }
    ],
    "StatusTypeID": 50,
    "DateLastStatusUpdate": "2021-07-12T02:52:00Z",
    "MetadataValues": [
        {
            "ID": 11420,
            "MetadataFieldID": 4,
            "ItemValue": "Data from the German chargepoint registry provided by Bundesnetzagentur.de under the CC-BY 4.0 license"
        }
    ],
    "DataQualityLevel": 3,
    "DateCreated": "2021-07-08T09:59:00Z",
    "SubmissionStatusTypeID": 100
}