{
    "IsRecentlyVerified": false,
    "ID": 185922,
    "UUID": "265AB1D7-8BA3-41CA-92C4-BB3B7B19AD0D",
    "DataProviderID": 29,
    "DataProvidersReference": "13085",
    "AddressInfo": {
        "ID": 186281,
        "Title": "Wacholderweg 18",
        "AddressLine1": "Wacholderweg 18",
        "Town": "Lampertheim Neuschloss",
        "Postcode": "68623",
        "CountryID": 87,
        "Latitude": 49.601311,
        "Longitude": 8.515609,
        "DistanceUnit": 0
    },
    "Connections": [
        {
            "ID": 297206,
            "ConnectionTypeID": 25,
            "StatusTypeID": 50,
            "LevelID": 2,
            "PowerKW": 22,
            "CurrentTypeID": 20
        },
        {
            "ID": 297207,
            "ConnectionTypeID": 25,
            "StatusTypeID": 50,
            "LevelID": 2,
            "PowerKW": 22,
            "CurrentTypeID": 20
        }
    ],
    "StatusTypeID": 50,
    "DateLastStatusUpdate": "2021-07-12T02:43:00Z",
    "MetadataValues": [
        {
            "ID": 18164,
            "MetadataFieldID": 4,
            "ItemValue": "Data from the German chargepoint registry provided by Bundesnetzagentur.de under the CC-BY 4.0 license"
        }
    ],
    "DataQualityLevel": 3,
    "DateCreated": "2021-07-12T02:43:00Z",
    "SubmissionStatusTypeID": 100
}