{
    "IsRecentlyVerified": false,
    "ID": 35483,
    "UUID": "259DE4CA-3031-4D43-983A-AC2E0936F5C6",
    "DataProviderID": 26,
    "DataProvidersReference": "55613",
    "OperatorID": 180,
    "OperatorsReference": "Alfen RHL03121",
    "UsageCost": "0.00 jaarabonnement",
    "AddressInfo": {
        "ID": 35829,
        "Title": "van der Hagenstraat",
        "AddressLine1": "van der Hagenstraat",
        "Town": "Zoetermeer",
        "Postcode": "2722 NT",
        "CountryID": 159,
        "Latitude": 52.04865,
        "Longitude": 4.524112,
        "ContactTelephone1": "036 - 549 34 00",
        "RelatedURL": "http://www.icu-charging-stations.com/",
        "DistanceUnit": 0
    },
    "Connections": [
        {
            "ID": 38994,
            "ConnectionTypeID": 25,
            "LevelID": 2,
            "PowerKW": 11,
            "CurrentTypeID": 10
        },
        {
            "ID": 47891,
            "ConnectionTypeID": 25,
            "LevelID": 2,
            "PowerKW": 11,
            "CurrentTypeID": 10
        }
    ],
    "NumberOfPoints": 1,
    "StatusTypeID": 50,
    "DateLastStatusUpdate": "2016-06-04T02:44:00Z",
    "DataQualityLevel": 3,
    "DateCreated": "2015-01-09T06:05:00Z",
    "SubmissionStatusTypeID": 100
}