{
    "IsRecentlyVerified": false,
    "ID": 179106,
    "UUID": "7E5C67AA-CB4E-4924-B569-A2B16B121868",
    "DataProviderID": 29,
    "DataProvidersReference": "2095",
    "OperatorID": 3403,
    "AddressInfo": {
        "ID": 179465,
        "Title": "Rausdorfer Straße 29",
        "AddressLine1": "Rausdorfer Straße 29",
        "Town": "Trittau",
        "Postcode": "22946",
        "CountryID": 87,
        "Latitude": 53.605936,
        "Longitude": 10.405233,
        "DistanceUnit": 0
    },
    "Connections": [
        {
            "ID": 280445,
            "ConnectionTypeID": 25,
            "StatusTypeID": 50,
            "LevelID": 2,
            "PowerKW": 22,
            "CurrentTypeID": 20
        },
        {
            "ID": 302008,
            "ConnectionTypeID": 25,
            "StatusTypeID": 50,
            "LevelID": 2,
            "PowerKW": 22,
            "CurrentTypeID": 20
        }
    ],
    "StatusTypeID": 50,
    "DateLastStatusUpdate": "2021-07-12T02:51:00Z",
    "MetadataValues": [
        {
            "ID": 11400,
            "MetadataFieldID": 4,
            "ItemValue": "Data from the German chargepoint registry provided by Bundesnetzagentur.de under the CC-BY 4.0 license"
        }
    ],
    "DataQualityLevel": 3,
    "DateCreated": "2021-07-08T09:59:00Z",
    "SubmissionStatusTypeID": 100
}