{
    "IsRecentlyVerified": false,
    "ID": 64407,
    "UUID": "0F775B63-9B55-4E03-814E-B0C9B16137E6",
    "DataProviderID": 1,
    "OperatorID": 213,
    "UsageTypeID": 4,
    "AddressInfo": {
        "ID": 64753,
        "Title": "Aire de l'Epitre (A16 - km231)                  Sens Abbeville - Calais",
        "AddressLine1": "L'Européenne",
        "Town": "Beuvrequen",
        "StateOrProvince": "Boulogne-sur-Mer",
        "Postcode": "62250",
        "CountryID": 80,
        "Latitude": 50.792871106006594,
        "Longitude": 1.6871733994751192,
        "DistanceUnit": 0
    },
    "Connections": [
        {
            "ID": 82610,
            "ConnectionTypeID": 2,
            "LevelID": 3,
            "Amps": 120,
            "Voltage": 400,
            "PowerKW": 50,
            "CurrentTypeID": 30
        },
        {
            "ID": 82611,
            "ConnectionTypeID": 33,
            "LevelID": 3,
            "Amps": 120,
            "Voltage": 400,
            "PowerKW": 43,
            "CurrentTypeID": 30
        },
        {
            "ID": 82612,
            "ConnectionTypeID": 25,
            "LevelID": 3,
            "Amps": 63,
            "Voltage": 400,
            "PowerKW": 43,
            "CurrentTypeID": 20
        },
        {
            "ID": 82613,
            "ConnectionTypeID": 28,
            "LevelID": 2,
            "Amps": 16,
            "Voltage": 220,
            "PowerKW": 3,
            "CurrentTypeID": 10
        }
    ],
    "NumberOfPoints": 1,
    "StatusTypeID": 100,
    "DateLastStatusUpdate": "2020-03-17T08:41:00Z",
    "DataQualityLevel": 1,
    "DateCreated": "2016-03-05T15:46:00Z",
    "SubmissionStatusTypeID": 200
}