{
    "IsRecentlyVerified": false,
    "ID": 135399,
    "UUID": "42ED91FD-EFB2-444D-B9BF-179464374BD6",
    "DataProviderID": 1,
    "OperatorID": 23,
    "OperatorsReference": "52258",
    "UsageTypeID": 4,
    "AddressInfo": {
        "ID": 135745,
        "Title": "Ibis Budget Saint-Genis-Pouilly Genève",
        "AddressLine1": "40 Rue Henri de France",
        "Town": "Saint-Genis-Pouilly",
        "Postcode": "1630",
        "CountryID": 80,
        "Latitude": 46.236966,
        "Longitude": 6.027621,
        "ContactTelephone1": "+33 8 92 70 02 27",
        "DistanceUnit": 0
    },
    "Connections": [
        {
            "ID": 189702,
            "ConnectionTypeID": 30,
            "StatusTypeID": 50,
            "LevelID": 2,
            "PowerKW": 7,
            "CurrentTypeID": 20,
            "Quantity": 1
        }
    ],
    "NumberOfPoints": 1,
    "GeneralComments": "1 Tesla Connector, up to 7kW.Available for customers. Please call ahead.",
    "StatusTypeID": 50,
    "DateLastStatusUpdate": "2019-12-20T00:01:00Z",
    "DataQualityLevel": 1,
    "DateCreated": "2019-12-20T00:01:00Z",
    "SubmissionStatusTypeID": 200
}