{
    "IsRecentlyVerified": false,
    "ID": 96626,
    "UUID": "66FCEDA9-689B-40BC-A2D8-1BBD62354D07",
    "DataProviderID": 2,
    "DataProvidersReference": "89042",
    "UsageTypeID": 1,
    "AddressInfo": {
        "ID": 96972,
        "Title": "Star One Credit Union",
        "AddressLine1": "1306 Bordeaux Dr",
        "Town": "Sunnyvale",
        "StateOrProvince": "CA",
        "Postcode": "94089",
        "CountryID": 2,
        "Latitude": 37.413479,
        "Longitude": -122.021912,
        "ContactTelephone1": "866-543-5202",
        "AccessComments": "9am-5pm M-T & Th, 10am-5pm W, 9am-6pm F",
        "RelatedURL": "",
        "DistanceUnit": 0
    },
    "Connections": [
        {
            "ID": 136894,
            "ConnectionTypeID": 1,
            "LevelID": 2,
            "Amps": 16,
            "Voltage": 230,
            "PowerKW": 3,
            "CurrentTypeID": 10,
            "Quantity": 1
        }
    ],
    "DateLastStatusUpdate": "2019-04-06T04:02:00Z",
    "DataQualityLevel": 3,
    "DateCreated": "2017-12-29T21:01:00Z",
    "SubmissionStatusTypeID": 100
}