{
    "IsRecentlyVerified": false,
    "ID": 105828,
    "UUID": "7F401134-834D-45C6-99C0-6FC62F86D29F",
    "DataProviderID": 2,
    "DataProvidersReference": "97028",
    "OperatorID": 9,
    "UsageTypeID": 1,
    "AddressInfo": {
        "ID": 106174,
        "Title": "South Clackamas Transportation District",
        "AddressLine1": "807 East Main Street",
        "Town": "Molalla",
        "StateOrProvince": "OR",
        "Postcode": "97038",
        "CountryID": 2,
        "Latitude": 45.145345,
        "Longitude": -122.566024,
        "ContactTelephone1": "888-998-2546",
        "AccessComments": "MON: 24 hours | TUE: 24 hours | WED: 24 hours | THU: 24 hours | FRI: 24 hours | SAT: 24 hours | SUN: 24 hours",
        "RelatedURL": "http://www.blinkcharging.com/",
        "DistanceUnit": 0
    },
    "Connections": [
        {
            "ID": 149036,
            "ConnectionTypeID": 1,
            "LevelID": 2,
            "Amps": 16,
            "Voltage": 230,
            "PowerKW": 3.7,
            "CurrentTypeID": 10,
            "Quantity": 1
        }
    ],
    "DateLastStatusUpdate": "2020-06-26T03:08:00Z",
    "DataQualityLevel": 3,
    "DateCreated": "2018-06-09T04:02:00Z",
    "SubmissionStatusTypeID": 100
}