{
    "IsRecentlyVerified": false,
    "ID": 58031,
    "UUID": "7C495DD3-47DF-435F-910C-8D0610199B63",
    "DataProviderID": 1,
    "OperatorID": 45,
    "UsageTypeID": 5,
    "UsageCost": "0,60€/kWh",
    "AddressInfo": {
        "ID": 58377,
        "Title": "Stellplatz am Sybillenbad",
        "AddressLine1": "Kurallee",
        "Town": "Neualbenreuth",
        "StateOrProvince": "Landkreis Tirschenreuth",
        "Postcode": "95698",
        "CountryID": 87,
        "Latitude": 49.9825289323398,
        "Longitude": 12.4248325846863,
        "ContactTelephone1": " +49 171 1010025",
        "AccessComments": "Auf dem Stellplatz für Wohnmobile P3/P4. ",
        "DistanceUnit": 0
    },
    "Connections": [
        {
            "ID": 73873,
            "ConnectionTypeID": 16,
            "StatusTypeID": 50,
            "LevelID": 2,
            "Amps": 16,
            "Voltage": 230,
            "PowerKW": 3.7,
            "CurrentTypeID": 10,
            "Quantity": 8
        }
    ],
    "NumberOfPoints": 8,
    "StatusTypeID": 50,
    "DateLastStatusUpdate": "2016-01-05T07:35:00Z",
    "DataQualityLevel": 1,
    "DateCreated": "2016-01-05T07:35:00Z",
    "SubmissionStatusTypeID": 200
}