{
    "IsRecentlyVerified": false,
    "ID": 131109,
    "UUID": "FB65F279-965F-4B8F-B7B8-237F8A19A0E6",
    "DataProviderID": 1,
    "OperatorID": 23,
    "OperatorsReference": "34388",
    "UsageTypeID": 4,
    "UsageCost": "$0.24/min >=60kW; $0.12/min <60kW; other tariffs for older cars",
    "AddressInfo": {
        "ID": 131455,
        "Title": "Robbinsville, NJ Supercharger",
        "AddressLine1": "315 Robbinsville-Allentown Road",
        "Town": "Robbinsville",
        "StateOrProvince": "NJ",
        "Postcode": "08691",
        "CountryID": 2,
        "Latitude": 40.193806,
        "Longitude": -74.594546,
        "DistanceUnit": 0
    },
    "Connections": [
        {
            "ID": 183606,
            "ConnectionTypeID": 27,
            "StatusTypeID": 50,
            "LevelID": 3,
            "PowerKW": 120,
            "CurrentTypeID": 30,
            "Quantity": 8
        }
    ],
    "NumberOfPoints": 8,
    "GeneralComments": "Charging8 Superchargers, available 24/7, up to 120kW",
    "StatusTypeID": 50,
    "DateLastStatusUpdate": "2019-08-29T05:37:00Z",
    "DataQualityLevel": 1,
    "DateCreated": "2019-08-29T05:37:00Z",
    "SubmissionStatusTypeID": 200
}