{
    "IsRecentlyVerified": false,
    "ID": 57899,
    "UUID": "20CA9349-7E84-4D48-ABF4-4EC43CA74DAA",
    "DataProviderID": 1,
    "OperatorID": 80,
    "UsageTypeID": 4,
    "UsageCost": "0,45€/kW",
    "AddressInfo": {
        "ID": 58245,
        "Title": "Roma Facoltà di Architettura | EnelX",
        "AddressLine1": "Via Antonio Gramsci, 74",
        "Town": "Roma",
        "StateOrProvince": "RM",
        "Postcode": "00197",
        "CountryID": 112,
        "Latitude": 41.9185828304233,
        "Longitude": 12.4800095423686,
        "RelatedURL": "https://www.enelx.com/it/it/emobility",
        "DistanceUnit": 0
    },
    "Connections": [
        {
            "ID": 73434,
            "ConnectionTypeID": 25,
            "StatusTypeID": 50,
            "LevelID": 2,
            "Amps": 32,
            "Voltage": 400,
            "PowerKW": 22,
            "CurrentTypeID": 20,
            "Quantity": 2
        },
        {
            "ID": 73435,
            "ConnectionTypeID": 36,
            "StatusTypeID": 50,
            "LevelID": 2,
            "Amps": 13,
            "Voltage": 240,
            "PowerKW": 3,
            "CurrentTypeID": 10,
            "Quantity": 2
        }
    ],
    "NumberOfPoints": 2,
    "StatusTypeID": 50,
    "DateLastStatusUpdate": "2019-07-30T08:42:00Z",
    "DataQualityLevel": 1,
    "DateCreated": "2015-12-27T16:39:00Z",
    "SubmissionStatusTypeID": 200
}