{
    "IsRecentlyVerified": false,
    "ID": 160502,
    "UUID": "3958A510-99B4-45EB-8E30-254754DB24ED",
    "DataProviderID": 2,
    "DataProvidersReference": "157726",
    "UsageTypeID": 2,
    "AddressInfo": {
        "ID": 160859,
        "Title": "Hydro-Quebec",
        "AddressLine1": "3800 boul. Bécancour",
        "Town": "Bécancour",
        "StateOrProvince": "QC",
        "Postcode": "G9H 3W4",
        "CountryID": 44,
        "Latitude": 46.395032,
        "Longitude": -72.29367,
        "ContactTelephone1": "",
        "AccessComments": "",
        "RelatedURL": "",
        "DistanceUnit": 0
    },
    "Connections": [
        {
            "ID": 230939,
            "ConnectionTypeID": 2,
            "LevelID": 3,
            "Amps": 100,
            "Voltage": 400,
            "PowerKW": 40,
            "CurrentTypeID": 30,
            "Quantity": 1
        },
        {
            "ID": 230940,
            "ConnectionTypeID": 32,
            "LevelID": 3,
            "Amps": 100,
            "Voltage": 400,
            "PowerKW": 40,
            "CurrentTypeID": 30,
            "Quantity": 1
        }
    ],
    "GeneralComments": "Planned for future date. Not Operational.",
    "DatePlanned": "2020-09-01T00:00:00Z",
    "StatusTypeID": 150,
    "DateLastStatusUpdate": "2020-06-26T03:10:00Z",
    "DataQualityLevel": 3,
    "DateCreated": "2020-06-26T03:10:00Z",
    "SubmissionStatusTypeID": 100
}