{
    "IsRecentlyVerified": false,
    "ID": 122821,
    "UUID": "1AB87ADB-38FC-4015-A2D6-2A4EA833F976",
    "DataProviderID": 2,
    "DataProvidersReference": "49688",
    "UsageTypeID": 7,
    "AddressInfo": {
        "ID": 123167,
        "Title": "Fenton Nissan",
        "AddressLine1": "1441 S George Nigh Expy",
        "Town": "McAlester",
        "StateOrProvince": "OK",
        "Postcode": "74501",
        "CountryID": 2,
        "Latitude": 34.894516,
        "Longitude": -95.775372,
        "ContactTelephone1": "918-423-0964",
        "AccessComments": "Dealership business hours\r\nPublic - Call ahead",
        "RelatedURL": "",
        "DistanceUnit": 0
    },
    "Connections": [
        {
            "ID": 172742,
            "ConnectionTypeID": 1,
            "LevelID": 2,
            "Amps": 16,
            "Voltage": 230,
            "PowerKW": 3.7,
            "CurrentTypeID": 10,
            "Quantity": 1
        }
    ],
    "DateLastStatusUpdate": "2020-06-26T02:57:00Z",
    "DataQualityLevel": 3,
    "DateCreated": "2019-04-06T05:03:00Z",
    "SubmissionStatusTypeID": 100
}