{
    "IsRecentlyVerified": false,
    "ID": 162320,
    "UUID": "328C104D-60C0-401F-909D-9D75378473DB",
    "DataProviderID": 1,
    "OperatorID": 3320,
    "UsageTypeID": 1,
    "UsageCost": "paid charging, free parking",
    "AddressInfo": {
        "ID": 162677,
        "Title": "da-emobil ENI Gutmann",
        "AddressLine1": "Häselgehr 171",
        "Town": "Häselgehr",
        "StateOrProvince": "Bezirk Reutte",
        "Postcode": "6651",
        "CountryID": 19,
        "Latitude": 47.303193,
        "Longitude": 10.484633,
        "RelatedURL": "https://www.da-emobil.com/laden-und-tanken.php#ladenetz",
        "DistanceUnit": 0
    },
    "Connections": [
        {
            "ID": 233620,
            "ConnectionTypeID": 25,
            "StatusTypeID": 50,
            "LevelID": 2,
            "Amps": 32,
            "PowerKW": 22,
            "CurrentTypeID": 20,
            "Quantity": 2
        }
    ],
    "NumberOfPoints": 1,
    "StatusTypeID": 50,
    "DateLastStatusUpdate": "2020-08-05T07:40:00Z",
    "DataQualityLevel": 1,
    "DateCreated": "2020-08-05T06:58:00Z",
    "SubmissionStatusTypeID": 200
}