{
    "IsRecentlyVerified": false,
    "ID": 173508,
    "UUID": "C43CDA53-ECD6-4671-A179-0E6336F96948",
    "DataProviderID": 18,
    "DataProvidersReference": "5942aee7804e91cfa9849ddb5ec2a03b",
    "OperatorID": 3345,
    "UsageTypeID": 5,
    "AddressInfo": {
        "ID": 173867,
        "Title": "SE152LG",
        "AddressLine1": "",
        "Town": "London",
        "Postcode": "SE152LG",
        "CountryID": 1,
        "Latitude": 51.476232,
        "Longitude": -0.054295,
        "AccessComments": "",
        "RelatedURL": "https://char.gy",
        "DistanceUnit": 0
    },
    "Connections": [
        {
            "ID": 266565,
            "ConnectionTypeID": 25,
            "Reference": "578",
            "StatusTypeID": 50,
            "LevelID": 2,
            "Amps": 16,
            "Voltage": 230,
            "PowerKW": 3.7,
            "CurrentTypeID": 10
        }
    ],
    "StatusTypeID": 0,
    "DateLastStatusUpdate": "2021-03-03T11:25:00Z",
    "MetadataValues": [
        {
            "ID": 8430,
            "MetadataFieldID": 4,
            "ItemValue": "Contains public sector information licensed under the Open Government Licence v2.0. http://www.nationalarchives.gov.uk/doc/open-government-licence/version/2/"
        }
    ],
    "DataQualityLevel": 3,
    "DateCreated": "2021-03-03T11:25:00Z",
    "SubmissionStatusTypeID": 100
}