{
    "UserComments": [
        {
            "ID": 23854,
            "ChargePointID": 172474,
            "CommentTypeID": 10,
            "UserName": "ForumElettrico.it",
            "Comment": "A 10 minuti a piedi camminando verso il centro, si arriva ad un bar con accanto un tabacchino. Leggi la recensione completa qui >  https://www.forumelettrico.it/forum/colonnina-fast-be-charge-fornovo-di-taro-pr-via-nazionale-4-t15100.html",
            "RelatedURL": "https://www.forumelettrico.it/forum/colonnina-fast-be-charge-fornovo-di-taro-pr-via-nazionale-4-t15100.html",
            "DateCreated": "2021-02-05T06:12:48.823Z",
            "User": {
                "ID": 11749,
                "Username": "ForumElettrico.it"
            },
            "CheckinStatusTypeID": 10,
            "IsActionedByEditor": false
        }
    ],
    "MediaItems": [
        {
            "ID": 26400,
            "ChargePointID": 172474,
            "ItemURL": "https://s3-ap-southeast-2.amazonaws.com/openchargemap/images/IT/OCM172474/OCM-172474.orig.2021020506130362.jpg",
            "ItemThumbnailURL": "https://s3-ap-southeast-2.amazonaws.com/openchargemap/images/IT/OCM172474/OCM-172474.thmb.2021020506130362.jpg",
            "Comment": "",
            "IsEnabled": true,
            "IsVideo": false,
            "IsFeaturedItem": false,
            "IsExternalResource": false,
            "User": {
                "ID": 11749,
                "Username": "ForumElettrico.it"
            },
            "DateCreated": "2021-02-05T06:13:00Z"
        },
        {
            "ID": 26401,
            "ChargePointID": 172474,
            "ItemURL": "https://s3-ap-southeast-2.amazonaws.com/openchargemap/images/IT/OCM172474/OCM-172474.orig.2021020506131070.jpg",
            "ItemThumbnailURL": "https://s3-ap-southeast-2.amazonaws.com/openchargemap/images/IT/OCM172474/OCM-172474.thmb.2021020506131070.jpg",
            "Comment": "",
            "IsEnabled": true,
            "IsVideo": false,
            "IsFeaturedItem": false,
            "IsExternalResource": false,
            "User": {
                "ID": 11749,
                "Username": "ForumElettrico.it"
            },
            "DateCreated": "2021-02-05T06:13:00Z"
        },
        {
            "ID": 26402,
            "ChargePointID": 172474,
            "ItemURL": "https://s3-ap-southeast-2.amazonaws.com/openchargemap/images/IT/OCM172474/OCM-172474.orig.2021020506131682.jpg",
            "ItemThumbnailURL": "https://s3-ap-southeast-2.amazonaws.com/openchargemap/images/IT/OCM172474/OCM-172474.thmb.2021020506131682.jpg",
            "Comment": "",
            "IsEnabled": true,
            "IsVideo": false,
            "IsFeaturedItem": false,
            "IsExternalResource": false,
            "User": {
                "ID": 11749,
                "Username": "ForumElettrico.it"
            },
            "DateCreated": "2021-02-05T06:13:00Z"
        },
        {
            "ID": 26403,
            "ChargePointID": 172474,
            "ItemURL": "https://s3-ap-southeast-2.amazonaws.com/openchargemap/images/IT/OCM172474/OCM-172474.orig.2021020506132242.jpg",
            "ItemThumbnailURL": "https://s3-ap-southeast-2.amazonaws.com/openchargemap/images/IT/OCM172474/OCM-172474.thmb.2021020506132242.jpg",
            "Comment": "",
            "IsEnabled": true,
            "IsVideo": false,
            "IsFeaturedItem": false,
            "IsExternalResource": false,
            "User": {
                "ID": 11749,
                "Username": "ForumElettrico.it"
            },
            "DateCreated": "2021-02-05T06:13:00Z"
        },
        {
            "ID": 26404,
            "ChargePointID": 172474,
            "ItemURL": "https://s3-ap-southeast-2.amazonaws.com/openchargemap/images/IT/OCM172474/OCM-172474.orig.2021020506132788.jpg",
            "ItemThumbnailURL": "https://s3-ap-southeast-2.amazonaws.com/openchargemap/images/IT/OCM172474/OCM-172474.thmb.2021020506132788.jpg",
            "Comment": "",
            "IsEnabled": true,
            "IsVideo": false,
            "IsFeaturedItem": false,
            "IsExternalResource": false,
            "User": {
                "ID": 11749,
                "Username": "ForumElettrico.it"
            },
            "DateCreated": "2021-02-05T06:13:00Z"
        }
    ],
    "IsRecentlyVerified": false,
    "ID": 172474,
    "UUID": "50CA4DAB-6BDF-43E2-8B50-0FB5B1D37501",
    "DataProviderID": 1,
    "OperatorID": 3327,
    "UsageTypeID": 4,
    "AddressInfo": {
        "ID": 172833,
        "Title": "BeCharge Scuola Carlo Emilio Gadda Fornovo ",
        "AddressLine1": "Via Nazionale 4",
        "Town": "Fornovo di Taro",
        "StateOrProvince": "PR",
        "CountryID": 112,
        "Latitude": 44.693858,
        "Longitude": 10.106354,
        "RelatedURL": "https://www.forumelettrico.it/forum/colonnina-fast-be-charge-fornovo-di-taro-pr-via-nazionale-4-t15100.html",
        "DistanceUnit": 0
    },
    "Connections": [
        {
            "ID": 263724,
            "ConnectionTypeID": 33,
            "StatusTypeID": 50,
            "LevelID": 3,
            "PowerKW": 75,
            "CurrentTypeID": 30,
            "Quantity": 1
        },
        {
            "ID": 263725,
            "ConnectionTypeID": 2,
            "StatusTypeID": 50,
            "LevelID": 3,
            "PowerKW": 51,
            "CurrentTypeID": 30,
            "Quantity": 1
        },
        {
            "ID": 263726,
            "ConnectionTypeID": 25,
            "StatusTypeID": 50,
            "LevelID": 2,
            "Amps": 32,
            "Voltage": 400,
            "PowerKW": 22,
            "CurrentTypeID": 20,
            "Quantity": 1
        }
    ],
    "NumberOfPoints": 2,
    "StatusTypeID": 50,
    "DateLastStatusUpdate": "2021-03-08T16:25:00Z",
    "DataQualityLevel": 1,
    "DateCreated": "2021-02-05T06:12:00Z",
    "SubmissionStatusTypeID": 200
}