{
    "IsRecentlyVerified": false,
    "ID": 65872,
    "UUID": "FB554B35-005D-4546-96CE-5EEF97D6FA54",
    "DataProviderID": 1,
    "OperatorID": 150,
    "OperatorsReference": "EMCOR NATS Whiteley (Fareham)",
    "UsageTypeID": 6,
    "UsageCost": "Â£1.00 for the first 60 minutes then Â£0.02 / min",
    "AddressInfo": {
        "ID": 66218,
        "Title": "NATS Whiteley",
        "AddressLine1": "Parkway",
        "AddressLine2": "Whiteley",
        "Town": "Winchester",
        "StateOrProvince": "Hampshire",
        "Postcode": "PO15 7FL",
        "CountryID": 1,
        "Latitude": 50.8823894,
        "Longitude": -1.23973309999997,
        "DistanceUnit": 0
    },
    "Connections": [
        {
            "ID": 91055,
            "ConnectionTypeID": 25,
            "StatusTypeID": 50,
            "LevelID": 2,
            "Amps": 32,
            "Voltage": 230,
            "PowerKW": 7,
            "CurrentTypeID": 10,
            "Quantity": 4
        },
        {
            "ID": 94260,
            "ConnectionTypeID": 25,
            "StatusTypeID": 50,
            "LevelID": 2,
            "Amps": 32,
            "Voltage": 400,
            "PowerKW": 22,
            "CurrentTypeID": 20,
            "Quantity": 2
        }
    ],
    "NumberOfPoints": 6,
    "StatusTypeID": 0,
    "DateLastStatusUpdate": "2018-11-02T08:53:00Z",
    "DataQualityLevel": 1,
    "DateCreated": "2016-05-03T16:35:00Z",
    "SubmissionStatusTypeID": 200
}