{
    "IsRecentlyVerified": false,
    "ID": 81831,
    "UUID": "30470046-5B22-4D8D-9D10-02BF2202E6D0",
    "DataProviderID": 1,
    "OperatorID": 23,
    "OperatorsReference": "20580",
    "UsageTypeID": 6,
    "AddressInfo": {
        "ID": 82177,
        "Title": "Bruma Valle de Guadalupe",
        "AddressLine1": "Carretera Tecate Ensenada KM. 74 Valle de Guadalupe",
        "Town": "Ensenada",
        "StateOrProvince": "Baja California",
        "Postcode": "22760",
        "CountryID": 146,
        "Latitude": 32.119874,
        "Longitude": -116.534579,
        "ContactTelephone1": "+52 1 646 189 7788",
        "DistanceUnit": 0
    },
    "Connections": [
        {
            "ID": 116589,
            "ConnectionTypeID": 30,
            "StatusTypeID": 50,
            "LevelID": 2,
            "PowerKW": 18,
            "CurrentTypeID": 20,
            "Quantity": 2
        }
    ],
    "NumberOfPoints": 2,
    "GeneralComments": "2 Tesla Connectors, up to 18kW.Available for patrons only. Please see front desk.",
    "StatusTypeID": 50,
    "DateLastStatusUpdate": "2017-02-03T13:05:00Z",
    "DataQualityLevel": 1,
    "DateCreated": "2017-02-03T13:05:00Z",
    "SubmissionStatusTypeID": 200
}