{
    "IsRecentlyVerified": false,
    "ID": 113226,
    "UUID": "EFD0BA0C-EC55-4F4A-B6BA-849B51600F85",
    "DataProviderID": 2,
    "DataProvidersReference": "104326",
    "OperatorID": 5,
    "UsageTypeID": 1,
    "AddressInfo": {
        "ID": 113572,
        "Title": "KRP PROPERTIES",
        "AddressLine1": "301 Terry Fox Dr",
        "Town": "Ottawa",
        "StateOrProvince": "ON",
        "Postcode": "K2K 3J1",
        "CountryID": 44,
        "Latitude": 45.3480724,
        "Longitude": -75.9061389,
        "ContactTelephone1": "888-758-4389",
        "AccessComments": "24 hours daily",
        "RelatedURL": "http://www.chargepoint.com/",
        "DistanceUnit": 0
    },
    "Connections": [
        {
            "ID": 159416,
            "ConnectionTypeID": 1,
            "LevelID": 2,
            "Amps": 16,
            "Voltage": 230,
            "PowerKW": 3.7,
            "CurrentTypeID": 10,
            "Quantity": 2
        }
    ],
    "DateLastStatusUpdate": "2020-06-26T03:08:00Z",
    "DataQualityLevel": 3,
    "DateCreated": "2018-11-28T02:04:00Z",
    "SubmissionStatusTypeID": 100
}