{
    "IsRecentlyVerified": false,
    "ID": 137964,
    "UUID": "411EC937-F22A-4B84-93BA-AA389A61CCD4",
    "DataProviderID": 2,
    "DataProvidersReference": "148843",
    "OperatorID": 39,
    "UsageTypeID": 1,
    "AddressInfo": {
        "ID": 138313,
        "Title": "Makena Medical Buildings - Escondido",
        "AddressLine1": "1955 Citracado Parkway",
        "Town": "Escondido",
        "StateOrProvince": "CA",
        "Postcode": "92029",
        "CountryID": 2,
        "Latitude": 33.1131741,
        "Longitude": -117.1208647,
        "ContactTelephone1": "800-663-5633",
        "AccessComments": "MO: 12:00am-12:00am; TU: 12:00am-12:00am; WE: 12:00am-12:00am; TH: 12:00am-12:00am; FR: 12:00am-12:00am; SA: 12:00am-12:00am; SU: 12:00am-12:00am",
        "RelatedURL": "http://www.semacharge.com/",
        "DistanceUnit": 0
    },
    "Connections": [
        {
            "ID": 192996,
            "ConnectionTypeID": 1,
            "LevelID": 2,
            "Amps": 16,
            "Voltage": 230,
            "PowerKW": 3,
            "CurrentTypeID": 10,
            "Quantity": 1
        }
    ],
    "StatusTypeID": 50,
    "DateLastStatusUpdate": "2019-12-24T09:06:00Z",
    "DataQualityLevel": 3,
    "DateCreated": "2019-12-24T09:06:00Z",
    "SubmissionStatusTypeID": 100
}