{
    "IsRecentlyVerified": false,
    "ID": 90413,
    "UUID": "92528ABE-0E00-4CCF-9EB1-2D40E1E72FC2",
    "DataProviderID": 1,
    "OperatorID": 23,
    "OperatorsReference": "29534",
    "UsageTypeID": 4,
    "AddressInfo": {
        "ID": 90759,
        "Title": "Zialena Winery",
        "AddressLine1": "21112 River RD",
        "Town": "Geyserville",
        "StateOrProvince": "California",
        "Postcode": "95441",
        "CountryID": 2,
        "Latitude": 38.716197,
        "Longitude": -122.893565,
        "ContactTelephone1": "(707) 955-5992",
        "DistanceUnit": 0
    },
    "Connections": [
        {
            "ID": 128066,
            "ConnectionTypeID": 30,
            "StatusTypeID": 50,
            "LevelID": 2,
            "PowerKW": 16,
            "CurrentTypeID": 20,
            "Quantity": 1
        }
    ],
    "NumberOfPoints": 1,
    "GeneralComments": "1 Tesla Connector, up to 16kW.Available for customers. Please call ahead.",
    "StatusTypeID": 50,
    "DateLastStatusUpdate": "2017-07-13T15:12:00Z",
    "DataQualityLevel": 1,
    "DateCreated": "2017-07-13T15:12:00Z",
    "SubmissionStatusTypeID": 200
}