{
    "IsRecentlyVerified": false,
    "ID": 62738,
    "UUID": "C818C398-8D62-4F59-898A-421AD8F1D64D",
    "DataProviderID": 26,
    "DataProvidersReference": "79366",
    "OperatorID": 73,
    "OperatorsReference": "EV-Box EVB-P1536091",
    "UsageCost": "0.00 jaarabonnement",
    "AddressInfo": {
        "ID": 63084,
        "Title": "D N7",
        "AddressLine1": "D N7",
        "Town": "Le Muy",
        "Postcode": "83490",
        "CountryID": 80,
        "Latitude": 43.4683381349693,
        "Longitude": 6.59201145172119,
        "RelatedURL": "http://www.ev-box.nl",
        "DistanceUnit": 0
    },
    "Connections": [
        {
            "ID": 79665,
            "ConnectionTypeID": 25,
            "LevelID": 2,
            "PowerKW": 11,
            "CurrentTypeID": 10
        },
        {
            "ID": 79666,
            "ConnectionTypeID": 25,
            "LevelID": 2,
            "PowerKW": 11,
            "CurrentTypeID": 10
        }
    ],
    "NumberOfPoints": 1,
    "StatusTypeID": 50,
    "DateLastStatusUpdate": "2016-06-04T02:37:00Z",
    "DataQualityLevel": 3,
    "DateCreated": "2016-03-03T12:29:00Z",
    "SubmissionStatusTypeID": 100
}