{
    "IsRecentlyVerified": false,
    "ID": 14262,
    "UUID": "498E437F-DF45-4C96-B2D3-EEA2D56F77A3",
    "DataProviderID": 2,
    "DataProvidersReference": "46649",
    "UsageTypeID": 7,
    "AddressInfo": {
        "ID": 14159,
        "Title": "Nissan Headquarters - Columbus",
        "AddressLine1": "1725 Whittlesey Rd",
        "Town": "Columbus",
        "StateOrProvince": "GA",
        "Postcode": "31904",
        "CountryID": 2,
        "Latitude": 32.539843,
        "Longitude": -84.965676,
        "ContactTelephone1": "706-225-8100",
        "AccessComments": "Dealership business hours\r\nPublic - Call ahead",
        "RelatedURL": "",
        "DistanceUnit": 0
    },
    "Connections": [
        {
            "ID": 16523,
            "ConnectionTypeID": 1,
            "LevelID": 2,
            "Amps": 16,
            "Voltage": 230,
            "PowerKW": 3.7,
            "CurrentTypeID": 10,
            "Quantity": 1
        },
        {
            "ID": 21627,
            "ConnectionTypeID": 2,
            "LevelID": 3,
            "Amps": 100,
            "Voltage": 400,
            "PowerKW": 40,
            "CurrentTypeID": 30,
            "Quantity": 1
        }
    ],
    "DateLastStatusUpdate": "2020-06-26T02:54:00Z",
    "DataQualityLevel": 3,
    "DateCreated": "2012-12-06T16:49:00Z",
    "SubmissionStatusTypeID": 100
}