{
    "IsRecentlyVerified": false,
    "ID": 31827,
    "UUID": "61510891-59C6-4817-A395-AAA3D20D241D",
    "DataProviderID": 26,
    "DataProvidersReference": "30374",
    "OperatorID": 86,
    "OperatorsReference": "EnWB Reinsburgstraße 40",
    "UsageCost": "0.00 afhankelijk van pas",
    "AddressInfo": {
        "ID": 32173,
        "Title": "Reinsburgstraße 40",
        "AddressLine1": "Reinsburgstraße 40",
        "Town": "Stuttgart",
        "Postcode": "70178",
        "CountryID": 87,
        "Latitude": 48.77051,
        "Longitude": 9.16645,
        "ContactTelephone1": "0800 3629-000",
        "ContactEmail": "-",
        "RelatedURL": "http://www.enbw.com/",
        "DistanceUnit": 0
    },
    "Connections": [
        {
            "ID": 35338,
            "ConnectionTypeID": 25,
            "LevelID": 2,
            "PowerKW": 5,
            "CurrentTypeID": 10
        }
    ],
    "NumberOfPoints": 2,
    "StatusTypeID": 50,
    "DateLastStatusUpdate": "2015-01-09T06:03:00Z",
    "DataQualityLevel": 3,
    "DateCreated": "2015-01-09T06:03:00Z",
    "SubmissionStatusTypeID": 100
}