{
    "IsRecentlyVerified": false,
    "ID": 157611,
    "UUID": "D2F22617-0FE0-48C6-8284-866989C766EB",
    "DataProviderID": 1,
    "OperatorID": 136,
    "UsageTypeID": 4,
    "UsageCost": "0,15kWh+ 1,0€/h parking",
    "AddressInfo": {
        "ID": 157965,
        "Title": "Helen Ehrenströmintie 14",
        "AddressLine1": "Ehrenströmintie 14",
        "Town": "Helsinki",
        "StateOrProvince": "Southern Finland",
        "Postcode": "00140",
        "CountryID": 79,
        "Latitude": 60.15873825861769,
        "Longitude": 24.96167601517152,
        "RelatedURL": "http://www.virta.fi",
        "DistanceUnit": 0
    },
    "Connections": [
        {
            "ID": 227090,
            "ConnectionTypeID": 25,
            "StatusTypeID": 50,
            "LevelID": 2,
            "Amps": 32,
            "Voltage": 400,
            "PowerKW": 22,
            "CurrentTypeID": 20,
            "Quantity": 2
        }
    ],
    "NumberOfPoints": 2,
    "StatusTypeID": 50,
    "DateLastStatusUpdate": "2020-06-21T20:02:00Z",
    "DataQualityLevel": 1,
    "DateCreated": "2020-06-20T15:39:00Z",
    "SubmissionStatusTypeID": 200
}