{
    "IsRecentlyVerified": false,
    "ID": 36161,
    "UUID": "A475354E-784C-488A-AD06-7696AD053555",
    "DataProviderID": 26,
    "DataProvidersReference": "47570",
    "OperatorID": 178,
    "OperatorsReference": "EVnetNL AL723",
    "UsageCost": "0.00 jaarabonnement",
    "AddressInfo": {
        "ID": 36507,
        "Title": "Raiffeisenlaan 1",
        "AddressLine1": "Raiffeisenlaan 1",
        "Town": "Utrecht",
        "Postcode": "3571 TA",
        "CountryID": 159,
        "Latitude": 52.105264,
        "Longitude": 5.125735,
        "ContactTelephone1": "0800-3522365",
        "RelatedURL": "http://www.evnet.nl",
        "DistanceUnit": 0
    },
    "Connections": [
        {
            "ID": 39672,
            "ConnectionTypeID": 25,
            "LevelID": 2,
            "PowerKW": 11,
            "CurrentTypeID": 10
        }
    ],
    "NumberOfPoints": 2,
    "StatusTypeID": 50,
    "DateLastStatusUpdate": "2016-06-04T02:50:00Z",
    "DataQualityLevel": 3,
    "DateCreated": "2015-01-09T06:05:00Z",
    "SubmissionStatusTypeID": 100
}