{
    "IsRecentlyVerified": false,
    "ID": 60837,
    "UUID": "5283F042-F730-4D15-B94D-A991A106A61A",
    "DataProviderID": 1,
    "OperatorID": 80,
    "UsageTypeID": 4,
    "UsageCost": "0,40 €/kW",
    "AddressInfo": {
        "ID": 61183,
        "Title": "Eneldrive (ex SILFI) Lambruschini",
        "AddressLine1": "Via Raffaello Lambruschini, 35",
        "Town": "Firenze",
        "StateOrProvince": "FI",
        "Postcode": "50134",
        "CountryID": 112,
        "Latitude": 43.78893236126519,
        "Longitude": 11.251900296851556,
        "RelatedURL": "http://eneldrive.it",
        "DistanceUnit": 0
    },
    "Connections": [
        {
            "ID": 77134,
            "ConnectionTypeID": 36,
            "StatusTypeID": 50,
            "LevelID": 2,
            "Amps": 16,
            "Voltage": 240,
            "PowerKW": 3,
            "CurrentTypeID": 10,
            "Quantity": 3
        },
        {
            "ID": 77135,
            "ConnectionTypeID": 25,
            "StatusTypeID": 50,
            "LevelID": 2,
            "Amps": 32,
            "Voltage": 400,
            "PowerKW": 22,
            "CurrentTypeID": 20,
            "Quantity": 1
        }
    ],
    "NumberOfPoints": 4,
    "StatusTypeID": 50,
    "DateLastStatusUpdate": "2016-02-09T16:45:00Z",
    "DataQualityLevel": 1,
    "DateCreated": "2016-02-09T16:45:00Z",
    "SubmissionStatusTypeID": 200
}