{
    "IsRecentlyVerified": false,
    "ID": 7713,
    "UUID": "7374E2BB-6337-482F-98D0-6BD893083DC8",
    "DataProviderID": 15,
    "DataProvidersReference": "6838",
    "OperatorID": 26,
    "AddressInfo": {
        "ID": 7610,
        "Title": "2500 W Lexington Ave",
        "AddressLine1": "2500 W Lexington Ave",
        "Town": "Elkhart",
        "StateOrProvince": "IN",
        "Postcode": "46514",
        "CountryID": 2,
        "Latitude": 41.68654,
        "Longitude": -86.01318,
        "ContactTelephone1": " (574) 293-8621",
        "RelatedURL": "http://carstations.com/6838",
        "DistanceUnit": 0
    },
    "Connections": [
        {
            "ID": 5145,
            "ConnectionTypeID": 1,
            "Reference": "J1772",
            "LevelID": 2
        }
    ],
    "StatusTypeID": 0,
    "DateLastStatusUpdate": "2017-11-04T14:04:00Z",
    "DataQualityLevel": 1,
    "DateCreated": "2011-11-11T12:05:00Z",
    "SubmissionStatusTypeID": 100
}