{
    "IsRecentlyVerified": false,
    "ID": 113869,
    "UUID": "6708568E-0A92-4CC9-A83D-EFF916275F24",
    "DataProviderID": 1,
    "OperatorID": 23,
    "OperatorsReference": "46795",
    "UsageTypeID": 4,
    "AddressInfo": {
        "ID": 114215,
        "Title": "GMC Parking 420 E 53RD",
        "AddressLine1": "420 E 53RD St",
        "Town": "New York",
        "StateOrProvince": "New York",
        "Postcode": "10022",
        "CountryID": 2,
        "Latitude": 40.755289,
        "Longitude": -73.963804,
        "ContactTelephone1": "(212) 759-5290",
        "DistanceUnit": 0
    },
    "Connections": [
        {
            "ID": 160439,
            "ConnectionTypeID": 30,
            "StatusTypeID": 50,
            "LevelID": 2,
            "PowerKW": 6,
            "CurrentTypeID": 10,
            "Quantity": 1
        }
    ],
    "NumberOfPoints": 1,
    "GeneralComments": "1 Tesla Connector, up to 6kW.Parking fees will apply. Please see valet.",
    "StatusTypeID": 50,
    "DateLastStatusUpdate": "2019-01-02T21:49:00Z",
    "DataQualityLevel": 1,
    "DateCreated": "2019-01-02T21:49:00Z",
    "SubmissionStatusTypeID": 200
}