{
    "IsRecentlyVerified": false,
    "ID": 97340,
    "UUID": "793CB76C-B380-4CC9-A0C9-07E322B6D1D0",
    "DataProviderID": 1,
    "OperatorID": 7,
    "UsageTypeID": 6,
    "UsageCost": "free ",
    "AddressInfo": {
        "ID": 97686,
        "Title": "Wylam Garage Nissan",
        "AddressLine1": "1 Burn Lane",
        "AddressLine2": "Riverside House",
        "Town": "Hexham",
        "StateOrProvince": "Northumberland",
        "Postcode": "NE46 3HN",
        "CountryID": 1,
        "Latitude": 54.9745448708484,
        "Longitude": -2.10477512813759,
        "AccessComments": "Wylam Garage opening hours",
        "DistanceUnit": 0
    },
    "Connections": [
        {
            "ID": 138242,
            "ConnectionTypeID": 25,
            "StatusTypeID": 50,
            "LevelID": 2,
            "Amps": 32,
            "Voltage": 230,
            "PowerKW": 7,
            "CurrentTypeID": 10,
            "Quantity": 3
        }
    ],
    "NumberOfPoints": 2,
    "GeneralComments": "friendly staff always allow me to charge for free",
    "StatusTypeID": 50,
    "DateLastStatusUpdate": "2018-01-19T00:00:00Z",
    "DataQualityLevel": 1,
    "DateCreated": "2018-01-18T17:55:00Z",
    "SubmissionStatusTypeID": 200
}