{
    "IsRecentlyVerified": false,
    "ID": 75415,
    "UUID": "AC90672B-A8CD-4B6B-BBF2-CBFFBDE4780D",
    "DataProviderID": 1,
    "OperatorID": 23,
    "OperatorsReference": "17018",
    "UsageTypeID": 6,
    "UsageCost": "Free",
    "AddressInfo": {
        "ID": 75761,
        "Title": "Sandton Grand Hotel Reylof",
        "AddressLine1": "36 Hoogstraat",
        "Town": "Ghent",
        "Postcode": "9000",
        "CountryID": 26,
        "Latitude": 51.054624,
        "Longitude": 3.715143,
        "ContactTelephone1": "+32 9 235 40 70",
        "DistanceUnit": 0
    },
    "Connections": [
        {
            "ID": 108720,
            "ConnectionTypeID": 30,
            "StatusTypeID": 50,
            "LevelID": 2,
            "Amps": 32,
            "Voltage": 400,
            "PowerKW": 22,
            "CurrentTypeID": 20,
            "Quantity": 2
        }
    ],
    "NumberOfPoints": 2,
    "GeneralComments": "2 Tesla Connector, up to 22kW.Available for patrons only. Please see front desk.",
    "StatusTypeID": 50,
    "DateLastStatusUpdate": "2018-10-03T18:18:00Z",
    "DataQualityLevel": 1,
    "DateCreated": "2016-12-14T19:59:00Z",
    "SubmissionStatusTypeID": 200
}