{
    "IsRecentlyVerified": false,
    "ID": 72136,
    "UUID": "15BD42ED-2284-41F1-B00C-835A5338ACE5",
    "DataProviderID": 1,
    "OperatorID": 23,
    "OperatorsReference": "20442",
    "UsageTypeID": 1,
    "UsageCost": "Free",
    "AddressInfo": {
        "ID": 72482,
        "Title": "Hampton Inn and Suites - Tesla",
        "AddressLine1": "11727 NE 63rd Dr",
        "Town": "Lady Lake",
        "StateOrProvince": "FL",
        "Postcode": "32162",
        "CountryID": 2,
        "Latitude": 28.926518,
        "Longitude": -81.998079,
        "ContactTelephone1": "352-259-8246  877-798-3752",
        "AccessComments": "24 hours daily; for Tesla use only; see front desk for access",
        "RelatedURL": "http://www.teslamotors.com/supercharger",
        "DistanceUnit": 0
    },
    "Connections": [
        {
            "ID": 103432,
            "ConnectionTypeID": 30,
            "StatusTypeID": 50,
            "LevelID": 2,
            "Amps": 16,
            "Voltage": 230,
            "PowerKW": 16,
            "CurrentTypeID": 10,
            "Quantity": 1
        }
    ],
    "NumberOfPoints": 1,
    "StatusTypeID": 50,
    "DateLastStatusUpdate": "2017-01-26T04:31:00Z",
    "DataQualityLevel": 3,
    "DateCreated": "2016-10-09T02:44:00Z",
    "SubmissionStatusTypeID": 100
}