{
    "IsRecentlyVerified": false,
    "ID": 8123,
    "UUID": "D118235E-2E90-4552-90C9-A9AF74B72AFF",
    "DataProviderID": 15,
    "DataProvidersReference": "9528",
    "OperatorID": 1,
    "AddressInfo": {
        "ID": 8020,
        "Title": "165 Courtland Street NE",
        "AddressLine1": "165 Courtland Street NE",
        "Town": "Atlanta",
        "StateOrProvince": "GA",
        "Postcode": "30303",
        "CountryID": 2,
        "Latitude": 33.75909,
        "Longitude": -84.38402,
        "ContactTelephone1": "",
        "RelatedURL": "http://carstations.com/9528",
        "DistanceUnit": 0
    },
    "Connections": [
        {
            "ID": 5552,
            "ConnectionTypeID": 9,
            "Reference": "NEMA5",
            "LevelID": 1
        }
    ],
    "StatusTypeID": 50,
    "DateLastStatusUpdate": "2017-11-04T14:04:00Z",
    "DataQualityLevel": 1,
    "DateCreated": "2011-11-11T12:06:00Z",
    "SubmissionStatusTypeID": 100
}