{
    "IsRecentlyVerified": false,
    "ID": 89386,
    "UUID": "A630D565-3040-40CD-A65E-1E80CDB783E4",
    "DataProviderID": 2,
    "DataProvidersReference": "85582",
    "UsageTypeID": 1,
    "AddressInfo": {
        "ID": 89732,
        "Title": "City of Selma",
        "AddressLine1": "1710 Tucker St",
        "Town": "Selma",
        "StateOrProvince": "CA",
        "Postcode": "93662",
        "CountryID": 2,
        "Latitude": 36.566656,
        "Longitude": -119.61008,
        "ContactTelephone1": "559-263-8019",
        "AccessComments": "8am-5pm daily; maximum session time of 3 hours",
        "RelatedURL": "",
        "DistanceUnit": 0
    },
    "Connections": [
        {
            "ID": 126775,
            "ConnectionTypeID": 1,
            "LevelID": 2,
            "Amps": 16,
            "Voltage": 230,
            "PowerKW": 3,
            "CurrentTypeID": 10,
            "Quantity": 1
        }
    ],
    "DateLastStatusUpdate": "2019-04-06T04:02:00Z",
    "DataQualityLevel": 3,
    "DateCreated": "2017-06-22T08:16:00Z",
    "SubmissionStatusTypeID": 100
}