{
    "UserComments": [
        {
            "ID": 20062,
            "ChargePointID": 95342,
            "CommentTypeID": 10,
            "UserName": "ForumElettrico.it",
            "RelatedURL": "https://www.forumelettrico.it/forum/colonnine-yes-energy-alla-fiera-di-rimini-t1838.html",
            "DateCreated": "2018-08-27T07:41:02.597Z",
            "User": {
                "ID": 11749,
                "Username": "ForumElettrico.it"
            },
            "CheckinStatusTypeID": 10
        }
    ],
    "MediaItems": [
        {
            "ID": 16370,
            "ChargePointID": 95342,
            "ItemURL": "https://s3-ap-southeast-2.amazonaws.com/openchargemap/images/IT/OCM95342/OCM-95342.orig.2018082707412193.jpg",
            "ItemThumbnailURL": "https://s3-ap-southeast-2.amazonaws.com/openchargemap/images/IT/OCM95342/OCM-95342.thmb.2018082707412193.jpg",
            "Comment": "",
            "IsEnabled": true,
            "IsVideo": false,
            "IsFeaturedItem": false,
            "IsExternalResource": false,
            "User": {
                "ID": 11749,
                "Username": "ForumElettrico.it"
            },
            "DateCreated": "2018-08-27T07:42:00Z"
        },
        {
            "ID": 16371,
            "ChargePointID": 95342,
            "ItemURL": "https://s3-ap-southeast-2.amazonaws.com/openchargemap/images/IT/OCM95342/OCM-95342.orig.2018082707412739.jpg",
            "ItemThumbnailURL": "https://s3-ap-southeast-2.amazonaws.com/openchargemap/images/IT/OCM95342/OCM-95342.thmb.2018082707412739.jpg",
            "Comment": "",
            "IsEnabled": true,
            "IsVideo": false,
            "IsFeaturedItem": false,
            "IsExternalResource": false,
            "User": {
                "ID": 11749,
                "Username": "ForumElettrico.it"
            },
            "DateCreated": "2018-08-27T07:42:00Z"
        },
        {
            "ID": 16369,
            "ChargePointID": 95342,
            "ItemURL": "https://s3-ap-southeast-2.amazonaws.com/openchargemap/images/IT/OCM95342/OCM-95342.orig.2018082707411563.jpg",
            "ItemThumbnailURL": "https://s3-ap-southeast-2.amazonaws.com/openchargemap/images/IT/OCM95342/OCM-95342.thmb.2018082707411563.jpg",
            "Comment": "",
            "IsEnabled": true,
            "IsVideo": false,
            "IsFeaturedItem": false,
            "IsExternalResource": false,
            "User": {
                "ID": 11749,
                "Username": "ForumElettrico.it"
            },
            "DateCreated": "2018-08-27T07:41:00Z"
        }
    ],
    "IsRecentlyVerified": false,
    "ID": 95342,
    "UUID": "B73D69D0-208C-45EF-A67B-CE380B4C6347",
    "DataProviderID": 1,
    "UsageTypeID": 4,
    "AddressInfo": {
        "ID": 95688,
        "Title": " Fiera di Rimini - Parcheggio Sud",
        "AddressLine1": "Via Emilia, 155",
        "Town": "Rimini",
        "StateOrProvince": "RN",
        "Postcode": "47921 ",
        "CountryID": 112,
        "Latitude": 44.06980556781905,
        "Longitude": 12.527222728253133,
        "ContactTelephone1": "(+39) 0541.744111",
        "ContactEmail": "infovisitatori@riminifiera.it",
        "RelatedURL": "http://www.riminifiera.it/",
        "DistanceUnit": 0
    },
    "Connections": [
        {
            "ID": 135032,
            "ConnectionTypeID": 25,
            "StatusTypeID": 50,
            "LevelID": 2,
            "Amps": 32,
            "Voltage": 400,
            "PowerKW": 22,
            "CurrentTypeID": 20,
            "Quantity": 4
        },
        {
            "ID": 135033,
            "ConnectionTypeID": 36,
            "StatusTypeID": 50,
            "LevelID": 2,
            "Amps": 16,
            "Voltage": 240,
            "PowerKW": 3.7,
            "CurrentTypeID": 10,
            "Quantity": 4
        }
    ],
    "NumberOfPoints": 4,
    "StatusTypeID": 50,
    "DateLastStatusUpdate": "2018-08-27T07:42:00Z",
    "DataQualityLevel": 1,
    "DateCreated": "2017-11-07T15:09:00Z",
    "SubmissionStatusTypeID": 200
}