{
    "IsRecentlyVerified": false,
    "ID": 159914,
    "UUID": "B60AB5B8-1A06-45A9-8AC2-1F4BE983DDE0",
    "DataProviderID": 2,
    "DataProvidersReference": "151774",
    "OperatorID": 3293,
    "UsageTypeID": 1,
    "AddressInfo": {
        "ID": 160271,
        "Title": "The Arboretum of South Barrington",
        "AddressLine1": "100 W Higgins Rd",
        "Town": "South Barrington",
        "StateOrProvince": "IL",
        "Postcode": "60010",
        "CountryID": 2,
        "Latitude": 42.074841,
        "Longitude": -88.184351,
        "ContactTelephone1": "888-264-2208",
        "AccessComments": "6am-12am daily",
        "RelatedURL": "https://voltacharging.com/",
        "DistanceUnit": 0
    },
    "Connections": [
        {
            "ID": 230135,
            "ConnectionTypeID": 1,
            "LevelID": 2,
            "Amps": 16,
            "Voltage": 230,
            "PowerKW": 3.7,
            "CurrentTypeID": 10,
            "Quantity": 2
        }
    ],
    "StatusTypeID": 50,
    "DateLastStatusUpdate": "2020-06-26T03:05:00Z",
    "DataQualityLevel": 3,
    "DateCreated": "2020-06-26T03:05:00Z",
    "SubmissionStatusTypeID": 100
}