{
    "IsRecentlyVerified": false,
    "ID": 140157,
    "UUID": "4326EADB-0FC2-4881-B847-635C67331D8A",
    "DataProviderID": 2,
    "DataProvidersReference": "122703",
    "OperatorID": 5,
    "UsageTypeID": 1,
    "AddressInfo": {
        "ID": 140509,
        "Title": "HOTELS",
        "AddressLine1": "1007 E Service Rd",
        "Town": "West Memphis",
        "StateOrProvince": "AR",
        "Postcode": "72301",
        "CountryID": 2,
        "Latitude": 35.162953,
        "Longitude": -90.1728566,
        "ContactTelephone1": "888-758-4389",
        "AccessComments": "24 hours daily",
        "RelatedURL": "http://www.chargepoint.com/",
        "DistanceUnit": 0
    },
    "Connections": [
        {
            "ID": 195720,
            "ConnectionTypeID": 1,
            "LevelID": 2,
            "Amps": 16,
            "Voltage": 230,
            "PowerKW": 3.7,
            "CurrentTypeID": 10,
            "Quantity": 2
        }
    ],
    "StatusTypeID": 50,
    "DateLastStatusUpdate": "2020-06-26T02:57:00Z",
    "DataQualityLevel": 3,
    "DateCreated": "2019-12-24T09:12:00Z",
    "SubmissionStatusTypeID": 100
}