{
    "IsRecentlyVerified": false,
    "ID": 71081,
    "UUID": "074743E9-91C7-46FF-BD97-7ED32209035B",
    "DataProviderID": 1,
    "OperatorID": 214,
    "UsageTypeID": 4,
    "AddressInfo": {
        "ID": 71427,
        "Title": "Eisenacher Straße",
        "AddressLine1": "Eisenacher Straße 102",
        "AddressLine2": "Stadtteil Schöneberg",
        "Town": "Berlin",
        "StateOrProvince": "Berlin",
        "Postcode": "10781",
        "CountryID": 87,
        "Latitude": 52.4949216,
        "Longitude": 13.349985800000013,
        "AccessComments": "2 kostenlose 24/7 nutzbare Parkplätze.",
        "DistanceUnit": 0
    },
    "Connections": [
        {
            "ID": 101859,
            "ConnectionTypeID": 25,
            "StatusTypeID": 50,
            "LevelID": 2,
            "Amps": 16,
            "Voltage": 400,
            "PowerKW": 11,
            "CurrentTypeID": 20,
            "Quantity": 2
        }
    ],
    "NumberOfPoints": 2,
    "StatusTypeID": 50,
    "DateLastStatusUpdate": "2016-08-26T11:35:00Z",
    "DataQualityLevel": 1,
    "DateCreated": "2016-08-26T11:35:00Z",
    "SubmissionStatusTypeID": 200
}