{
    "IsRecentlyVerified": false,
    "ID": 157607,
    "UUID": "05EBEAA5-9549-4B33-B1F8-5F579EEFEFED",
    "DataProviderID": 1,
    "OperatorID": 2247,
    "UsageTypeID": 1,
    "UsageCost": "0.30€/kWh",
    "AddressInfo": {
        "ID": 157961,
        "Title": "Iberdrola Ondara",
        "AddressLine1": "Avinguda d'Alacant 85",
        "Town": "Ondara",
        "StateOrProvince": "Alicante",
        "Postcode": "03760",
        "CountryID": 210,
        "Latitude": 38.82214396393704,
        "Longitude": 0.02213400775053742,
        "DistanceUnit": 0
    },
    "Connections": [
        {
            "ID": 227083,
            "ConnectionTypeID": 33,
            "StatusTypeID": 50,
            "LevelID": 3,
            "PowerKW": 50,
            "CurrentTypeID": 30,
            "Quantity": 2
        },
        {
            "ID": 227084,
            "ConnectionTypeID": 2,
            "StatusTypeID": 50,
            "LevelID": 3,
            "PowerKW": 50,
            "CurrentTypeID": 30,
            "Quantity": 2
        },
        {
            "ID": 227085,
            "ConnectionTypeID": 1036,
            "StatusTypeID": 50,
            "LevelID": 3,
            "PowerKW": 43,
            "CurrentTypeID": 20,
            "Quantity": 2
        }
    ],
    "NumberOfPoints": 2,
    "StatusTypeID": 50,
    "DateLastStatusUpdate": "2020-06-21T16:27:00Z",
    "DataQualityLevel": 1,
    "DateCreated": "2020-06-20T11:24:00Z",
    "SubmissionStatusTypeID": 200
}