{
    "IsRecentlyVerified": false,
    "ID": 157748,
    "UUID": "FE5D225D-4AFC-48F6-B8D4-36EC929D7907",
    "DataProviderID": 18,
    "DataProvidersReference": "519471698360d710b3b48cc0bb81bf8c",
    "OperatorID": 3391,
    "UsageTypeID": 1,
    "AddressInfo": {
        "ID": 158102,
        "Title": "Holland Road",
        "AddressLine1": "Holland Road",
        "Town": "Brighton",
        "Postcode": "BN3 1JF",
        "CountryID": 1,
        "Latitude": 50.824063,
        "Longitude": -0.162638,
        "AccessComments": "",
        "RelatedURL": "https://www.electricblueuk.com/",
        "DistanceUnit": 0
    },
    "Connections": [
        {
            "ID": 227276,
            "ConnectionTypeID": 25,
            "Reference": "62196-2 (SINGLE PHASE)",
            "StatusTypeID": 50,
            "LevelID": 2,
            "Amps": 16,
            "Voltage": 230,
            "PowerKW": 3.7,
            "CurrentTypeID": 10
        }
    ],
    "StatusTypeID": 0,
    "DateLastStatusUpdate": "2020-06-25T10:00:00Z",
    "MetadataValues": [
        {
            "ID": 7281,
            "MetadataFieldID": 4,
            "ItemValue": "Contains public sector information licensed under the Open Government Licence v2.0. http://www.nationalarchives.gov.uk/doc/open-government-licence/version/2/"
        }
    ],
    "DataQualityLevel": 3,
    "DateCreated": "2020-06-25T10:00:00Z",
    "SubmissionStatusTypeID": 100
}