{
    "IsRecentlyVerified": false,
    "ID": 53746,
    "UUID": "C14E5E69-7A86-4B88-BB91-F4E418DC0B6B",
    "DataProviderID": 26,
    "DataProvidersReference": "67810",
    "OperatorID": 73,
    "OperatorsReference": "EV-Box EVB-P1521081",
    "UsageCost": "0.00 jaarabonnement",
    "AddressInfo": {
        "ID": 54092,
        "Title": "Beukenwede 134",
        "AddressLine1": "Beukenwede 134",
        "Town": "Barendrecht",
        "Postcode": "2993 TH",
        "CountryID": 159,
        "Latitude": 51.85293,
        "Longitude": 4.49829,
        "RelatedURL": "http://www.ev-box.nl",
        "DistanceUnit": 0
    },
    "Connections": [
        {
            "ID": 67035,
            "ConnectionTypeID": 25,
            "LevelID": 2,
            "PowerKW": 11,
            "CurrentTypeID": 10
        },
        {
            "ID": 67036,
            "ConnectionTypeID": 25,
            "LevelID": 2,
            "PowerKW": 11,
            "CurrentTypeID": 10
        }
    ],
    "NumberOfPoints": 1,
    "StatusTypeID": 50,
    "DateLastStatusUpdate": "2016-06-04T02:41:00Z",
    "DataQualityLevel": 3,
    "DateCreated": "2015-09-20T11:50:00Z",
    "SubmissionStatusTypeID": 100
}