{
    "UserComments": [
        {
            "ID": 16032,
            "ChargePointID": 18551,
            "CommentTypeID": 10,
            "UserName": "Gjsolar",
            "Comment": "All upgraded equipment now. Parking will be chargable from April 1st 2017 but electricity still free so that shold reduce abuse of parking and charging point.So I think that is fair enough.",
            "Rating": 4,
            "DateCreated": "2017-03-08T10:35:46.117Z",
            "User": {
                "ID": 13366,
                "Username": "Gjsolar"
            },
            "CheckinStatusTypeID": 10
        },
        {
            "ID": 6382,
            "ChargePointID": 18551,
            "CommentTypeID": 1000,
            "UserName": "RobinW ",
            "Comment": "The signage and road markings for this site are present, but the equipment itself has been damaged and removed. Only the guard rails and the end of a cable remain, covered in protective tape. Also noted that this site does not currently appear on the Charge-Your -Car Web site; I'll be interested to know whether it is to be renewed or what other plans there are for it, as there are no others for some miles. ",
            "Rating": 1,
            "DateCreated": "2015-09-01T17:02:31.54Z",
            "User": {
                "ID": 6307,
                "Username": "RobinW "
            },
            "CheckinStatusTypeID": 50,
            "IsActionedByEditor": true
        },
        {
            "ID": 4648,
            "ChargePointID": 18551,
            "CommentTypeID": 10,
            "UserName": "ac32amp",
            "Comment": "Had planned to use one of these chargers en- route from the Midlands to mid-Wales. It wasn't our day. The High Street and car park were being used for the annual Town festival😭",
            "DateCreated": "2015-06-06T18:19:19.49Z",
            "User": {
                "ID": 4927,
                "Username": "ac32amp"
            },
            "CheckinStatusTypeID": 120
        }
    ],
    "IsRecentlyVerified": false,
    "ID": 18551,
    "UUID": "9957005D-512B-4DCC-A919-35F9A641DF18",
    "DataProviderID": 1,
    "OperatorID": 32,
    "OperatorsReference": "3841",
    "UsageTypeID": 4,
    "UsageCost": "Inclusive; for Polar Plus subscription members only",
    "AddressInfo": {
        "ID": 18896,
        "Title": "Mill Street Car Park",
        "AddressLine1": "Mill Street",
        "Town": "Kington",
        "Postcode": "HR5 3DP",
        "CountryID": 1,
        "Latitude": 52.202902,
        "Longitude": -3.031862,
        "AccessComments": "LHS of car park near disabled bays. Parking fees apply. In long stay car park. \r\nNo eligibility restrictions. Length of stay = long stay (7 days a week). Free parking for electric vehicles whilst recharging.",
        "DistanceUnit": 0
    },
    "Connections": [
        {
            "ID": 18771,
            "ConnectionTypeID": 25,
            "StatusTypeID": 50,
            "LevelID": 2,
            "Amps": 32,
            "Voltage": 230,
            "PowerKW": 7,
            "CurrentTypeID": 10,
            "Quantity": 2
        }
    ],
    "NumberOfPoints": 2,
    "StatusTypeID": 50,
    "DateLastStatusUpdate": "2019-03-07T06:21:00Z",
    "DataQualityLevel": 3,
    "DateCreated": "2013-08-06T03:50:00Z",
    "SubmissionStatusTypeID": 100
}