{
    "IsRecentlyVerified": false,
    "ID": 160703,
    "UUID": "8F9E899C-6820-4EA4-B8A1-F45F311120D4",
    "DataProviderID": 2,
    "DataProvidersReference": "154540",
    "OperatorID": 90,
    "UsageTypeID": 1,
    "AddressInfo": {
        "ID": 161060,
        "Title": "Municipalité de Franquelin",
        "AddressLine1": "16 rue des Érables",
        "Town": "Franquelin",
        "StateOrProvince": "QC",
        "Postcode": "G0H 1E0",
        "CountryID": 44,
        "Latitude": 49.293128,
        "Longitude": -67.892797,
        "ContactTelephone1": "877-505-2674",
        "AccessComments": "24 hours daily",
        "RelatedURL": "https://lecircuitelectrique.com/",
        "DistanceUnit": 0
    },
    "Connections": [
        {
            "ID": 231251,
            "ConnectionTypeID": 1,
            "LevelID": 2,
            "Amps": 16,
            "Voltage": 230,
            "PowerKW": 3.7,
            "CurrentTypeID": 10,
            "Quantity": 1
        }
    ],
    "StatusTypeID": 50,
    "DateLastStatusUpdate": "2020-06-26T03:12:00Z",
    "DataQualityLevel": 3,
    "DateCreated": "2020-06-26T03:12:00Z",
    "SubmissionStatusTypeID": 100
}