{
    "IsRecentlyVerified": false,
    "ID": 27358,
    "UUID": "2205CBEE-F6F8-42D6-9583-B3F40D80D5F6",
    "DataProviderID": 2,
    "DataProvidersReference": "49336",
    "OperatorID": 5,
    "UsageTypeID": 1,
    "AddressInfo": {
        "ID": 27704,
        "Title": "HARTNELLCOLLEGE",
        "AddressLine1": "411 Central Ave",
        "Town": "Salinas",
        "StateOrProvince": "CA",
        "Postcode": "93901",
        "CountryID": 2,
        "Latitude": 36.6750984,
        "Longitude": -121.6681137,
        "ContactTelephone1": "888-758-4389",
        "AccessComments": "24 hours daily",
        "RelatedURL": "http://www.chargepoint.com/",
        "DistanceUnit": 0
    },
    "Connections": [
        {
            "ID": 29977,
            "ConnectionTypeID": 9,
            "LevelID": 1,
            "Amps": 16,
            "Voltage": 120,
            "PowerKW": 1,
            "CurrentTypeID": 10,
            "Quantity": 1
        },
        {
            "ID": 29978,
            "ConnectionTypeID": 1,
            "LevelID": 2,
            "Amps": 16,
            "Voltage": 230,
            "PowerKW": 3,
            "CurrentTypeID": 10,
            "Quantity": 1
        }
    ],
    "DateLastStatusUpdate": "2019-04-06T04:02:00Z",
    "DataQualityLevel": 3,
    "DateCreated": "2014-11-28T03:37:00Z",
    "SubmissionStatusTypeID": 100
}