{
    "IsRecentlyVerified": false,
    "ID": 181339,
    "UUID": "39CAC5E9-749C-475C-871D-BDE2479750E5",
    "DataProviderID": 29,
    "DataProvidersReference": "9446",
    "OperatorID": 105,
    "AddressInfo": {
        "ID": 181698,
        "Title": "Roetgener Straße 0",
        "AddressLine1": "Roetgener Straße 0",
        "Town": "Roetgen",
        "Postcode": "52159",
        "CountryID": 87,
        "Latitude": 50.676946,
        "Longitude": 6.204269,
        "DistanceUnit": 0
    },
    "Connections": [
        {
            "ID": 285531,
            "ConnectionTypeID": 25,
            "StatusTypeID": 50,
            "LevelID": 2,
            "PowerKW": 22,
            "CurrentTypeID": 20
        },
        {
            "ID": 285532,
            "ConnectionTypeID": 25,
            "StatusTypeID": 50,
            "LevelID": 2,
            "PowerKW": 22,
            "CurrentTypeID": 20
        }
    ],
    "StatusTypeID": 50,
    "DateLastStatusUpdate": "2021-07-09T03:20:00Z",
    "MetadataValues": [
        {
            "ID": 13633,
            "MetadataFieldID": 4,
            "ItemValue": "Data from the German chargepoint registry provided by Bundesnetzagentur.de under the CC-BY 4.0 license"
        }
    ],
    "DataQualityLevel": 3,
    "DateCreated": "2021-07-08T10:01:00Z",
    "SubmissionStatusTypeID": 100
}