{
    "IsRecentlyVerified": false,
    "ID": 122234,
    "UUID": "2B39AC21-15DB-45A5-A892-B63AD7AF85C6",
    "DataProviderID": 2,
    "DataProvidersReference": "39842",
    "UsageTypeID": 7,
    "AddressInfo": {
        "ID": 122580,
        "Title": "Dick Smith Nissan",
        "AddressLine1": "3670 Fernandina Rd",
        "Town": "Columbia",
        "StateOrProvince": "SC",
        "Postcode": "29210",
        "CountryID": 2,
        "Latitude": 34.055164,
        "Longitude": -81.128164,
        "ContactTelephone1": "803-772-8700",
        "AccessComments": "Dealership business hours\r\nPublic - Call ahead",
        "RelatedURL": "",
        "DistanceUnit": 0
    },
    "Connections": [
        {
            "ID": 172107,
            "ConnectionTypeID": 1,
            "LevelID": 2,
            "Amps": 16,
            "Voltage": 230,
            "PowerKW": 3.7,
            "CurrentTypeID": 10,
            "Quantity": 2
        },
        {
            "ID": 172108,
            "ConnectionTypeID": 2,
            "LevelID": 3,
            "Amps": 100,
            "Voltage": 400,
            "PowerKW": 40,
            "CurrentTypeID": 30,
            "Quantity": 1
        }
    ],
    "DateLastStatusUpdate": "2020-06-26T02:56:00Z",
    "DataQualityLevel": 3,
    "DateCreated": "2019-04-06T05:02:00Z",
    "SubmissionStatusTypeID": 100
}