{
    "IsRecentlyVerified": false,
    "ID": 48628,
    "UUID": "240E3267-5A4C-4025-A806-F4060A24F594",
    "DataProviderID": 1,
    "OperatorID": 93,
    "OperatorsReference": "SC74",
    "UsageTypeID": 4,
    "UsageCost": "Free",
    "AddressInfo": {
        "ID": 48974,
        "Title": "Moneymore Recreation Centre",
        "AddressLine1": "Moneyhaw Road",
        "Town": "Magherafelt",
        "StateOrProvince": "Northern Ireland",
        "Postcode": "BT45 7XJ",
        "CountryID": 1,
        "Latitude": 54.688089,
        "Longitude": -6.671085,
        "AccessComments": "Moneymore Recreation Centre, Moneyhaw Rd, Moneymore",
        "RelatedURL": "http://pod-point.com/",
        "DistanceUnit": 0
    },
    "Connections": [
        {
            "ID": 60083,
            "ConnectionTypeID": 25,
            "StatusTypeID": 50,
            "LevelID": 2,
            "Amps": 32,
            "Voltage": 400,
            "PowerKW": 22,
            "CurrentTypeID": 20,
            "Quantity": 2
        }
    ],
    "NumberOfPoints": 2,
    "StatusTypeID": 50,
    "DateLastStatusUpdate": "2019-06-23T05:37:00Z",
    "MetadataValues": [
        {
            "ID": 1635,
            "MetadataFieldID": 4,
            "ItemValue": "Contains public sector information licensed under the Open Government Licence v2.0. http://www.nationalarchives.gov.uk/doc/open-government-licence/version/2/"
        }
    ],
    "DataQualityLevel": 3,
    "DateCreated": "2015-06-27T07:22:00Z",
    "SubmissionStatusTypeID": 100
}