{
    "IsRecentlyVerified": false,
    "ID": 183959,
    "UUID": "7478A113-3D03-4C34-8D9F-BF3EFC890A62",
    "DataProviderID": 29,
    "DataProvidersReference": "16818",
    "OperatorID": 155,
    "AddressInfo": {
        "ID": 184318,
        "Title": "Karl-Liebknecht Straße 52",
        "AddressLine1": "Karl-Liebknecht Straße 52",
        "Town": "Leipzig",
        "Postcode": "04275",
        "CountryID": 87,
        "Latitude": 51.324596,
        "Longitude": 12.373396,
        "DistanceUnit": 0
    },
    "Connections": [
        {
            "ID": 291592,
            "ConnectionTypeID": 25,
            "StatusTypeID": 50,
            "LevelID": 2,
            "PowerKW": 11,
            "CurrentTypeID": 20
        },
        {
            "ID": 291593,
            "ConnectionTypeID": 25,
            "StatusTypeID": 50,
            "LevelID": 2,
            "PowerKW": 11,
            "CurrentTypeID": 20
        }
    ],
    "StatusTypeID": 50,
    "DateLastStatusUpdate": "2021-07-12T02:47:00Z",
    "MetadataValues": [
        {
            "ID": 16252,
            "MetadataFieldID": 4,
            "ItemValue": "Data from the German chargepoint registry provided by Bundesnetzagentur.de under the CC-BY 4.0 license"
        }
    ],
    "DataQualityLevel": 3,
    "DateCreated": "2021-07-08T10:04:00Z",
    "SubmissionStatusTypeID": 100
}