{
    "MediaItems": [
        {
            "ID": 21350,
            "ChargePointID": 149390,
            "ItemURL": "https://s3-ap-southeast-2.amazonaws.com/openchargemap/images/GR/OCM149390/OCM-149390.orig.2020022515233162.jpg",
            "ItemThumbnailURL": "https://s3-ap-southeast-2.amazonaws.com/openchargemap/images/GR/OCM149390/OCM-149390.thmb.2020022515233162.jpg",
            "Comment": "",
            "IsEnabled": true,
            "IsVideo": false,
            "IsFeaturedItem": false,
            "IsExternalResource": false,
            "User": {
                "ID": 25188,
                "Username": "Divani Collection "
            },
            "DateCreated": "2020-02-25T15:24:00Z"
        },
        {
            "ID": 21348,
            "ChargePointID": 149390,
            "ItemURL": "https://s3-ap-southeast-2.amazonaws.com/openchargemap/images/GR/OCM149390/OCM-149390.orig.2020022515225664.jpg",
            "ItemThumbnailURL": "https://s3-ap-southeast-2.amazonaws.com/openchargemap/images/GR/OCM149390/OCM-149390.thmb.2020022515225664.jpg",
            "Comment": "",
            "IsEnabled": true,
            "IsVideo": false,
            "IsFeaturedItem": false,
            "IsExternalResource": false,
            "User": {
                "ID": 25188,
                "Username": "Divani Collection "
            },
            "DateCreated": "2020-02-25T15:23:00Z"
        },
        {
            "ID": 21349,
            "ChargePointID": 149390,
            "ItemURL": "https://s3-ap-southeast-2.amazonaws.com/openchargemap/images/GR/OCM149390/OCM-149390.orig.2020022515230604.jpg",
            "ItemThumbnailURL": "https://s3-ap-southeast-2.amazonaws.com/openchargemap/images/GR/OCM149390/OCM-149390.thmb.2020022515230604.jpg",
            "Comment": "",
            "IsEnabled": true,
            "IsVideo": false,
            "IsFeaturedItem": false,
            "IsExternalResource": false,
            "User": {
                "ID": 25188,
                "Username": "Divani Collection "
            },
            "DateCreated": "2020-02-25T15:23:00Z"
        }
    ],
    "IsRecentlyVerified": false,
    "ID": 149390,
    "UUID": "4918D0F2-CA24-49AF-B93A-0A5DE1C4480C",
    "DataProviderID": 1,
    "UsageTypeID": 6,
    "AddressInfo": {
        "ID": 149743,
        "Title": "Divani Caravel Hotel",
        "AddressLine1": "Βασιλέως Αλεξάνδρου 2",
        "AddressLine2": "Παγκράτι",
        "Town": "Athènes",
        "StateOrProvince": "Δήμος Αθηναίων",
        "Postcode": "16121",
        "CountryID": 90,
        "Latitude": 37.97296033830003,
        "Longitude": 23.751377555011345,
        "ContactTelephone1": "+302107207000",
        "ContactEmail": "info@divanicaravel.gr",
        "RelatedURL": "https://divanicaravelhotel.com/",
        "DistanceUnit": 0
    },
    "Connections": [
        {
            "ID": 207420,
            "ConnectionTypeID": 25,
            "StatusTypeID": 50,
            "LevelID": 2,
            "Amps": 16,
            "Voltage": 380,
            "PowerKW": 22,
            "CurrentTypeID": 20,
            "Quantity": 1
        }
    ],
    "NumberOfPoints": 1,
    "GeneralComments": "Guests of Divani Caravel will find an electric car charging station at the hotel.\r\nThe charging station is offered complimentary to hotel guests that park their car at the property.",
    "StatusTypeID": 50,
    "DateLastStatusUpdate": "2020-02-25T15:24:00Z",
    "DataQualityLevel": 1,
    "DateCreated": "2020-02-24T11:53:00Z",
    "SubmissionStatusTypeID": 200
}