{
    "IsRecentlyVerified": false,
    "ID": 87979,
    "UUID": "B9C2433F-B809-45D6-8F62-3DDF34B5DD36",
    "DataProviderID": 1,
    "OperatorID": 23,
    "OperatorsReference": "29518",
    "UsageTypeID": 4,
    "AddressInfo": {
        "ID": 88325,
        "Title": "Las Casuelas Restaurant",
        "AddressLine1": "3203 Entertainment Wy",
        "Town": "Turlock",
        "StateOrProvince": "California",
        "Postcode": "95380",
        "CountryID": 2,
        "Latitude": 37.523014,
        "Longitude": -120.88445,
        "ContactTelephone1": "(209) 634-0080",
        "DistanceUnit": 0
    },
    "Connections": [
        {
            "ID": 124807,
            "ConnectionTypeID": 30,
            "StatusTypeID": 50,
            "LevelID": 2,
            "PowerKW": 16,
            "CurrentTypeID": 20,
            "Quantity": 3
        }
    ],
    "NumberOfPoints": 3,
    "GeneralComments": "3 Tesla Connectors, up to 16kW.Available for customers. Self park.",
    "StatusTypeID": 50,
    "DateLastStatusUpdate": "2017-05-19T05:31:00Z",
    "DataQualityLevel": 1,
    "DateCreated": "2017-05-19T05:31:00Z",
    "SubmissionStatusTypeID": 200
}