{
    "IsRecentlyVerified": false,
    "ID": 36600,
    "UUID": "DAA18AEE-980E-4EB2-9324-F0A3AA097FB6",
    "DataProviderID": 26,
    "DataProvidersReference": "48031",
    "OperatorID": 178,
    "OperatorsReference": "EVnetNL DB0271",
    "UsageCost": "0.00 jaarabonnement",
    "AddressInfo": {
        "ID": 36946,
        "Title": "Rijksstraatweg 104",
        "AddressLine1": "Rijksstraatweg 104",
        "Town": "Stichtse Vecht",
        "Postcode": "3632 AD",
        "CountryID": 159,
        "Latitude": 52.208497,
        "Longitude": 5.020804,
        "ContactTelephone1": "0800-3522365",
        "RelatedURL": "http://www.evnet.nl",
        "DistanceUnit": 0
    },
    "Connections": [
        {
            "ID": 40111,
            "ConnectionTypeID": 25,
            "LevelID": 2,
            "PowerKW": 11,
            "CurrentTypeID": 10
        }
    ],
    "NumberOfPoints": 2,
    "StatusTypeID": 50,
    "DateLastStatusUpdate": "2016-06-04T02:51:00Z",
    "DataQualityLevel": 3,
    "DateCreated": "2015-01-09T06:05:00Z",
    "SubmissionStatusTypeID": 100
}