{
    "IsRecentlyVerified": false,
    "ID": 187703,
    "UUID": "7DFBFBDA-4399-4FD9-9BF6-AEC06041D582",
    "DataProviderID": 18,
    "DataProvidersReference": "4de13e504962c8f81055bf09363b79de",
    "OperatorID": 2244,
    "UsageTypeID": 5,
    "AddressInfo": {
        "ID": 188062,
        "Title": "41 Ovington Street",
        "AddressLine1": "41 Ovington Street",
        "Town": "London",
        "Postcode": "SW3 2JA",
        "CountryID": 1,
        "Latitude": 51.494806,
        "Longitude": -0.16434,
        "AccessComments": "",
        "RelatedURL": "https://www.ubitricity.com",
        "DistanceUnit": 0
    },
    "Connections": [
        {
            "ID": 302940,
            "ConnectionTypeID": 25,
            "Reference": "suby1100002739",
            "StatusTypeID": 50,
            "LevelID": 2,
            "Amps": 16,
            "Voltage": 230,
            "PowerKW": 3.7,
            "CurrentTypeID": 10
        }
    ],
    "StatusTypeID": 0,
    "DateLastStatusUpdate": "2021-07-12T03:38:00Z",
    "MetadataValues": [
        {
            "ID": 19943,
            "MetadataFieldID": 4,
            "ItemValue": "Contains public sector information licensed under the Open Government Licence v2.0. http://www.nationalarchives.gov.uk/doc/open-government-licence/version/2/"
        }
    ],
    "DataQualityLevel": 3,
    "DateCreated": "2021-07-12T03:38:00Z",
    "SubmissionStatusTypeID": 100
}