{
    "IsRecentlyVerified": false,
    "ID": 153070,
    "UUID": "0F097D8A-2E5D-4A2B-B46A-9FFBC1DF35F5",
    "DataProviderID": 28,
    "DataProvidersReference": "FR*S89*P89046*A",
    "UsageTypeID": 5,
    "AddressInfo": {
        "ID": 153423,
        "Title": "BLENEAU_Place du 11 novembre",
        "AddressLine1": "Place du 11 novembre 89220 BLENEAU",
        "CountryID": 80,
        "Latitude": 47.6989973,
        "Longitude": 2.9467356,
        "AccessComments": "24/24 7/7 jours",
        "DistanceUnit": 0
    },
    "Connections": [
        {
            "ID": 214563,
            "ConnectionTypeID": 28,
            "StatusTypeID": 50,
            "LevelID": 2,
            "PowerKW": 22,
            "CurrentTypeID": 10
        },
        {
            "ID": 214564,
            "ConnectionTypeID": 1036,
            "StatusTypeID": 50,
            "LevelID": 2,
            "PowerKW": 22,
            "CurrentTypeID": 20
        },
        {
            "ID": 247892,
            "ConnectionTypeID": 28,
            "StatusTypeID": 50,
            "LevelID": 2,
            "PowerKW": 22,
            "CurrentTypeID": 10
        },
        {
            "ID": 247893,
            "ConnectionTypeID": 1036,
            "StatusTypeID": 50,
            "LevelID": 2,
            "PowerKW": 22,
            "CurrentTypeID": 20
        }
    ],
    "GeneralComments": "",
    "StatusTypeID": 50,
    "DateLastStatusUpdate": "2020-08-27T05:14:00Z",
    "DataQualityLevel": 2,
    "DateCreated": "2020-03-15T10:54:00Z",
    "SubmissionStatusTypeID": 100
}