{
    "IsRecentlyVerified": false,
    "ID": 176566,
    "UUID": "A604990A-01F5-430B-B0EC-9BB925C5DF08",
    "DataProviderID": 29,
    "DataProvidersReference": "904",
    "OperatorID": 127,
    "AddressInfo": {
        "ID": 176925,
        "Title": "Posthausen 2",
        "AddressLine1": "Posthausen 2",
        "Town": "Ottersberg",
        "Postcode": "28870",
        "CountryID": 87,
        "Latitude": 53.0579599999999,
        "Longitude": 9.16841999999997,
        "DistanceUnit": 0
    },
    "Connections": [
        {
            "ID": 274627,
            "ConnectionTypeID": 25,
            "StatusTypeID": 50,
            "LevelID": 2,
            "PowerKW": 11,
            "CurrentTypeID": 20
        },
        {
            "ID": 274628,
            "ConnectionTypeID": 25,
            "StatusTypeID": 50,
            "LevelID": 2,
            "PowerKW": 22,
            "CurrentTypeID": 20
        },
        {
            "ID": 274629,
            "ConnectionTypeID": 25,
            "StatusTypeID": 50,
            "LevelID": 2,
            "PowerKW": 22,
            "CurrentTypeID": 20
        },
        {
            "ID": 274630,
            "ConnectionTypeID": 25,
            "StatusTypeID": 50,
            "LevelID": 2,
            "PowerKW": 22,
            "CurrentTypeID": 20
        }
    ],
    "StatusTypeID": 0,
    "DateLastStatusUpdate": "2021-07-12T02:50:00Z",
    "MetadataValues": [
        {
            "ID": 8861,
            "MetadataFieldID": 4,
            "ItemValue": "Data from the German chargepoint registry provided by Bundesnetzagentur.de under the CC-BY 4.0 license"
        }
    ],
    "DataQualityLevel": 3,
    "DateCreated": "2021-07-08T09:48:00Z",
    "SubmissionStatusTypeID": 100
}