{
    "IsRecentlyVerified": false,
    "ID": 18547,
    "UUID": "54D47DE3-365F-4BF3-8C78-89276895B804",
    "DataProviderID": 1,
    "OperatorID": 1,
    "UsageTypeID": 2,
    "UsageCost": "",
    "AddressInfo": {
        "ID": 18892,
        "Title": "Off Towers Way. LHS of car park exit",
        "AddressLine1": "Towers Way",
        "AddressLine2": "",
        "Town": "Loughborough",
        "StateOrProvince": "",
        "Postcode": "LE11 3TU",
        "CountryID": 1,
        "Latitude": 52.765531,
        "Longitude": -1.224826,
        "ContactTelephone1": "",
        "ContactTelephone2": "",
        "ContactEmail": "",
        "AccessComments": "LHS of car park exit. Access for staff, students and visitors only. Suitable for charging some E-bikes that can be charged outdoors. Fitted under Midlands PiP",
        "RelatedURL": "http://www.ss3meteronline.co.uk/",
        "DistanceUnit": 0
    },
    "Connections": [
        {
            "ID": 18767,
            "ConnectionTypeID": 25,
            "StatusTypeID": 50,
            "LevelID": 2,
            "Amps": 32,
            "Voltage": 230,
            "PowerKW": 7.4,
            "Quantity": 1
        }
    ],
    "GeneralComments": "",
    "StatusTypeID": 50,
    "DateLastStatusUpdate": "2013-09-20T16:24:00Z",
    "DataQualityLevel": 3,
    "DateCreated": "2013-08-06T03:49:00Z",
    "SubmissionStatusTypeID": 200
}