{
    "IsRecentlyVerified": false,
    "ID": 136938,
    "UUID": "E693CB74-8A19-4D59-87D7-11EB18D59BBB",
    "DataProviderID": 18,
    "DataProvidersReference": "f24ad6f72d6cc4cb51464f2b29ab69d3",
    "UsageTypeID": 4,
    "AddressInfo": {
        "ID": 137284,
        "Title": "Templemore Leisure Centre Car Park",
        "AddressLine1": "Buncrana Road",
        "Town": "Londonderry",
        "Postcode": "BT48 7QL",
        "CountryID": 1,
        "Latitude": 55.024553,
        "Longitude": -7.338951,
        "AccessComments": "Templemore Leisure Centre Car Park. Usual parking restrictions apply (Socket 2)",
        "RelatedURL": "https://www.esb.ie/ecars",
        "DistanceUnit": 0
    },
    "Connections": [
        {
            "ID": 191639,
            "ConnectionTypeID": 25,
            "Reference": "LBBN29001014",
            "StatusTypeID": 50,
            "LevelID": 2,
            "Amps": 32,
            "Voltage": 400,
            "PowerKW": 22,
            "CurrentTypeID": 20
        },
        {
            "ID": 191640,
            "ConnectionTypeID": 25,
            "Reference": "LBBN29001015",
            "StatusTypeID": 50,
            "LevelID": 2,
            "Amps": 32,
            "Voltage": 400,
            "PowerKW": 22,
            "CurrentTypeID": 20
        }
    ],
    "StatusTypeID": 0,
    "DateLastStatusUpdate": "2021-07-12T03:39:00Z",
    "MetadataValues": [
        {
            "ID": 6790,
            "MetadataFieldID": 4,
            "ItemValue": "Contains public sector information licensed under the Open Government Licence v2.0. http://www.nationalarchives.gov.uk/doc/open-government-licence/version/2/"
        }
    ],
    "DataQualityLevel": 3,
    "DateCreated": "2019-12-24T05:23:00Z",
    "SubmissionStatusTypeID": 100
}