{
    "UserComments": [
        {
            "ID": 768,
            "ChargePointID": 15119,
            "CommentTypeID": 10,
            "UserName": "WillyNT",
            "Comment": "We had dinner here. I had to ask staff CP location, as coulnd't find it. Drive up to the main entrance, then go to the lower level",
            "Rating": 4,
            "RelatedURL": "http://www.radissonblu.ie/hotel-sligo",
            "DateCreated": "2014-04-24T07:27:11.89Z",
            "User": {
                "ID": 1785,
                "Username": "WillyNT"
            },
            "CheckinStatusTypeID": 10
        }
    ],
    "MediaItems": [
        {
            "ID": 347,
            "ChargePointID": 15119,
            "ItemURL": "https://s3-ap-southeast-2.amazonaws.com/openchargemap/images/IE/OCM15119/OCM-15119.orig.2014042407291100.jpg",
            "ItemThumbnailURL": "https://s3-ap-southeast-2.amazonaws.com/openchargemap/images/IE/OCM15119/OCM-15119.thmb.2014042407291100.jpg",
            "Comment": "",
            "IsEnabled": true,
            "IsVideo": false,
            "IsFeaturedItem": false,
            "IsExternalResource": false,
            "User": {
                "ID": 1785,
                "Username": "WillyNT"
            },
            "DateCreated": "2014-04-24T07:29:00Z"
        }
    ],
    "IsRecentlyVerified": false,
    "ID": 15119,
    "UUID": "3DCD53FA-134C-48C7-B185-BE3176B62B3E",
    "DataProviderID": 1,
    "OperatorID": 45,
    "OperatorsReference": "Radisson Blu Hotel",
    "UsageTypeID": 7,
    "AddressInfo": {
        "ID": 15465,
        "Title": "Radisson Blu Hotel",
        "AddressLine1": "Ballincar",
        "Town": "Sligo",
        "StateOrProvince": "County Sligo",
        "CountryID": 3,
        "Latitude": 54.298984,
        "Longitude": -8.49977,
        "DistanceUnit": 0
    },
    "Connections": [
        {
            "ID": 91139,
            "ConnectionTypeID": 25,
            "StatusTypeID": 50,
            "LevelID": 2,
            "Amps": 16,
            "Voltage": 230,
            "PowerKW": 3.7,
            "CurrentTypeID": 10,
            "Quantity": 1
        }
    ],
    "NumberOfPoints": 1,
    "StatusTypeID": 50,
    "DateLastStatusUpdate": "2016-06-01T11:33:00Z",
    "DataQualityLevel": 2,
    "DateCreated": "2012-12-11T15:08:00Z",
    "SubmissionStatusTypeID": 100
}