{
    "IsRecentlyVerified": false,
    "ID": 120048,
    "UUID": "BD6A367F-86C2-4AC1-88F6-BAD8C3245EAE",
    "DataProviderID": 2,
    "DataProvidersReference": "53586",
    "OperatorID": 5,
    "UsageTypeID": 1,
    "AddressInfo": {
        "ID": 120394,
        "Title": "KERRVILLE PUB",
        "AddressLine1": "201 Clay St",
        "Town": "Kerrville",
        "StateOrProvince": "TX",
        "Postcode": "78028",
        "CountryID": 2,
        "Latitude": 30.0476268,
        "Longitude": -99.1418551,
        "ContactTelephone1": "888-758-4389",
        "AccessComments": "24 hours daily",
        "RelatedURL": "http://www.chargepoint.com/",
        "DistanceUnit": 0
    },
    "Connections": [
        {
            "ID": 169358,
            "ConnectionTypeID": 1,
            "LevelID": 2,
            "Amps": 16,
            "Voltage": 230,
            "PowerKW": 3,
            "CurrentTypeID": 10,
            "Quantity": 2
        }
    ],
    "DateLastStatusUpdate": "2019-12-24T09:08:00Z",
    "DataQualityLevel": 3,
    "DateCreated": "2019-04-01T04:59:00Z",
    "SubmissionStatusTypeID": 100
}