{
    "UserComments": [
        {
            "ID": 23277,
            "ChargePointID": 167710,
            "CommentTypeID": 10,
            "UserName": "fraser",
            "Comment": "Private House . No Access ",
            "DateCreated": "2020-09-27T08:01:09.66Z",
            "User": {
                "ID": 27415,
                "Username": "fraser"
            },
            "CheckinStatusTypeID": 10,
            "IsActionedByEditor": false
        }
    ],
    "IsRecentlyVerified": false,
    "ID": 167710,
    "UUID": "72E13C25-0B24-4F7A-BF17-C13D94218B98",
    "DataProviderID": 1,
    "OperatorID": 1,
    "UsageTypeID": 3,
    "AddressInfo": {
        "ID": 168069,
        "Title": "Home",
        "AddressLine1": "Willows End ",
        "AddressLine2": "Banbury Rd ",
        "Town": "Banbury",
        "StateOrProvince": "England",
        "Postcode": "OX15 4PD",
        "CountryID": 1,
        "Latitude": 52.023914228519004,
        "Longitude": -1.3737651217179518,
        "DistanceUnit": 0
    },
    "Connections": [
        {
            "ID": 254654,
            "ConnectionTypeID": 1036,
            "StatusTypeID": 50,
            "LevelID": 2,
            "Quantity": 1
        }
    ],
    "NumberOfPoints": 1,
    "StatusTypeID": 50,
    "DateLastStatusUpdate": "2020-12-21T07:15:00Z",
    "DataQualityLevel": 1,
    "DateCreated": "2020-09-11T08:06:00Z",
    "SubmissionStatusTypeID": 200
}