{
    "IsRecentlyVerified": false,
    "ID": 102084,
    "UUID": "9E6FBBC1-EFF3-44F7-AAB3-81158C78C0B3",
    "DataProviderID": 1,
    "OperatorID": 156,
    "UsageTypeID": 4,
    "AddressInfo": {
        "ID": 102430,
        "Title": "Dobler GmbH",
        "AddressLine1": "Robert-Koch-Straße 46",
        "Town": "Stuttgart",
        "StateOrProvince": "Stuttgart",
        "Postcode": "70563",
        "CountryID": 87,
        "Latitude": 48.725973,
        "Longitude": 9.107741199999964,
        "AccessComments": "Zwei Parkplätze direkt vorm Haus, Wallbox am Haus von beide Plätze erreichbar. Parkplätze rund um die Uhr zugänglich, während Geschäftszeiten aber vorrangig für Besucher von der Fa. Dobler",
        "RelatedURL": "https://kennzeichnungen.de/",
        "DistanceUnit": 0
    },
    "Connections": [
        {
            "ID": 144067,
            "ConnectionTypeID": 25,
            "StatusTypeID": 50,
            "LevelID": 2,
            "Amps": 32,
            "Voltage": 400,
            "PowerKW": 22,
            "CurrentTypeID": 20,
            "Quantity": 1
        },
        {
            "ID": 144068,
            "ConnectionTypeID": 28,
            "StatusTypeID": 50,
            "LevelID": 2,
            "Amps": 16,
            "Voltage": 230,
            "PowerKW": 3.7,
            "CurrentTypeID": 10,
            "Quantity": 1
        }
    ],
    "NumberOfPoints": 1,
    "StatusTypeID": 50,
    "DateLastStatusUpdate": "2018-04-16T06:09:00Z",
    "DataQualityLevel": 1,
    "DateCreated": "2018-04-16T06:09:00Z",
    "SubmissionStatusTypeID": 200
}