{
    "IsRecentlyVerified": false,
    "ID": 122809,
    "UUID": "A83F771C-E9D2-4B75-8E10-E16505664E8D",
    "DataProviderID": 2,
    "DataProvidersReference": "75925",
    "OperatorID": 5,
    "UsageTypeID": 1,
    "AddressInfo": {
        "ID": 123155,
        "Title": "HNA MAIN",
        "AddressLine1": "1 Parkway S",
        "Town": "Greenville",
        "StateOrProvince": "SC",
        "Postcode": "29615",
        "CountryID": 2,
        "Latitude": 34.861213,
        "Longitude": -82.2574054,
        "ContactTelephone1": "888-758-4389",
        "AccessComments": "24 hours daily",
        "RelatedURL": "http://www.chargepoint.com/",
        "DistanceUnit": 0
    },
    "Connections": [
        {
            "ID": 172730,
            "ConnectionTypeID": 1,
            "LevelID": 2,
            "Amps": 16,
            "Voltage": 230,
            "PowerKW": 3.7,
            "CurrentTypeID": 10,
            "Quantity": 2
        }
    ],
    "DateLastStatusUpdate": "2020-06-26T02:57:00Z",
    "DataQualityLevel": 3,
    "DateCreated": "2019-04-06T05:03:00Z",
    "SubmissionStatusTypeID": 100
}