{
    "IsRecentlyVerified": false,
    "ID": 70327,
    "UUID": "937C637A-5C7A-419C-932B-EF8371DD08D7",
    "DataProviderID": 2,
    "DataProvidersReference": "76910",
    "UsageTypeID": 1,
    "AddressInfo": {
        "ID": 70673,
        "Title": "ReVision Energy",
        "AddressLine1": "91 W Main St",
        "Town": "Liberty",
        "StateOrProvince": "ME",
        "Postcode": "04949",
        "CountryID": 2,
        "Latitude": 44.397929,
        "Longitude": -69.319015,
        "ContactTelephone1": "207-589-4171",
        "AccessComments": "8am-4pm M-F",
        "RelatedURL": "",
        "DistanceUnit": 0
    },
    "Connections": [
        {
            "ID": 100370,
            "ConnectionTypeID": 1,
            "LevelID": 2,
            "Amps": 16,
            "Voltage": 230,
            "PowerKW": 3.7,
            "CurrentTypeID": 10,
            "Quantity": 2
        }
    ],
    "DateLastStatusUpdate": "2020-06-26T03:08:00Z",
    "DataQualityLevel": 3,
    "DateCreated": "2016-07-14T00:53:00Z",
    "SubmissionStatusTypeID": 100
}