{
    "IsRecentlyVerified": false,
    "ID": 5356,
    "UUID": "4B358A3E-88B1-4B93-A089-E5EF2B046F16",
    "DataProviderID": 1,
    "DataProvidersReference": "ALM-00003",
    "OperatorID": 21,
    "UsageTypeID": 4,
    "UsageCost": "Mobi.E compatible card",
    "AddressInfo": {
        "ID": 5295,
        "Title": "ALM-00003",
        "AddressLine1": "Avenida Dom Nuno Álvares Pereira 35",
        "Town": "Almada",
        "Postcode": "2800-179",
        "CountryID": 180,
        "Latitude": 38.6791,
        "Longitude": -9.15828,
        "RelatedURL": "http://www.mobie.pt",
        "DistanceUnit": 0
    },
    "Connections": [
        {
            "ID": 33201,
            "ConnectionTypeID": 25,
            "StatusTypeID": 50,
            "LevelID": 2,
            "Amps": 32,
            "Voltage": 230,
            "PowerKW": 7,
            "CurrentTypeID": 10,
            "Quantity": 2
        }
    ],
    "NumberOfPoints": 2,
    "StatusTypeID": 50,
    "DateLastStatusUpdate": "2020-08-02T13:52:00Z",
    "DataQualityLevel": 1,
    "DateCreated": "2011-08-25T12:48:00Z",
    "SubmissionStatusTypeID": 100
}