{
    "MediaItems": [
        {
            "ID": 29379,
            "ChargePointID": 188481,
            "ItemURL": "https://s3-ap-southeast-2.amazonaws.com/openchargemap/images/IT/OCM188481/OCM-188481.orig.2021092714263562.jpg",
            "ItemThumbnailURL": "https://s3-ap-southeast-2.amazonaws.com/openchargemap/images/IT/OCM188481/OCM-188481.thmb.2021092714263562.jpg",
            "Comment": "",
            "IsEnabled": true,
            "IsVideo": false,
            "IsFeaturedItem": false,
            "IsExternalResource": false,
            "User": {
                "ID": 19496,
                "Username": "ECOGY"
            },
            "DateCreated": "2021-09-27T14:27:00Z"
        },
        {
            "ID": 29378,
            "ChargePointID": 188481,
            "ItemURL": "https://s3-ap-southeast-2.amazonaws.com/openchargemap/images/IT/OCM188481/OCM-188481.orig.2021092714262299.jpg",
            "ItemThumbnailURL": "https://s3-ap-southeast-2.amazonaws.com/openchargemap/images/IT/OCM188481/OCM-188481.thmb.2021092714262299.jpg",
            "Comment": "",
            "IsEnabled": true,
            "IsVideo": false,
            "IsFeaturedItem": false,
            "IsExternalResource": false,
            "User": {
                "ID": 19496,
                "Username": "ECOGY"
            },
            "DateCreated": "2021-09-27T14:26:00Z"
        }
    ],
    "IsRecentlyVerified": false,
    "ID": 188481,
    "UUID": "6D9CDC62-2D65-45B1-B532-8E7DC2721A5C",
    "DataProviderID": 1,
    "OperatorID": 1,
    "UsageTypeID": 4,
    "UsageCost": "0,35 €/kWh",
    "AddressInfo": {
        "ID": 188840,
        "Title": "Hotel Clubresidence Adler****",
        "AddressLine1": "Via de San Pellegrino 23",
        "Town": "Moena",
        "StateOrProvince": "Trentino-Alto Adige - Südtirol",
        "Postcode": "38035",
        "CountryID": 112,
        "Latitude": 46.37454895569459,
        "Longitude": 11.659091785798068,
        "ContactTelephone1": "+39 0462 574144",
        "AccessComments": "For guest. RFID card available at office",
        "RelatedURL": "https://www.clubres.com/hotel-trentino/hotel-adler-4-stelle-a-moena/",
        "DistanceUnit": 0
    },
    "Connections": [
        {
            "ID": 304390,
            "ConnectionTypeID": 33,
            "StatusTypeID": 50,
            "LevelID": 2,
            "Amps": 16,
            "Voltage": 400,
            "PowerKW": 11,
            "CurrentTypeID": 10,
            "Quantity": 1
        }
    ],
    "NumberOfPoints": 1,
    "GeneralComments": "The charging station is in the parking lot",
    "StatusTypeID": 50,
    "DateLastStatusUpdate": "2021-09-27T14:27:00Z",
    "DataQualityLevel": 1,
    "DateCreated": "2021-07-29T08:14:00Z",
    "SubmissionStatusTypeID": 200
}