{
    "IsRecentlyVerified": false,
    "ID": 145910,
    "UUID": "906C1586-0029-4E7E-A67F-6696B2DA2550",
    "DataProviderID": 1,
    "OperatorID": 3,
    "OperatorsReference": "PG-70148,PG-84266",
    "UsageTypeID": 4,
    "UsageCost": "Free",
    "AddressInfo": {
        "ID": 146262,
        "Title": "Tesco Superstore-Bicester",
        "AddressLine1": "Lakeview Drive",
        "Town": "Bicester",
        "Postcode": "OX26 1DE",
        "CountryID": 1,
        "Latitude": 51.891106,
        "Longitude": -1.159765,
        "DistanceUnit": 0
    },
    "Connections": [
        {
            "ID": 202760,
            "ConnectionTypeID": 25,
            "StatusTypeID": 50,
            "LevelID": 2,
            "Amps": 32,
            "Voltage": 230,
            "PowerKW": 7,
            "CurrentTypeID": 10,
            "Quantity": 4
        }
    ],
    "NumberOfPoints": 4,
    "GeneralComments": "This is an open charge unit installed at the Tesco super store at Lakeview Drive, Bicester",
    "StatusTypeID": 50,
    "DateLastStatusUpdate": "2019-12-30T15:41:00Z",
    "DataQualityLevel": 1,
    "DateCreated": "2019-12-26T23:59:00Z",
    "SubmissionStatusTypeID": 200
}