{
    "IsRecentlyVerified": false,
    "ID": 90678,
    "UUID": "610AC066-A119-4064-8E2E-9A1047A104D0",
    "DataProviderID": 1,
    "OperatorID": 23,
    "OperatorsReference": "32107",
    "UsageTypeID": 4,
    "AddressInfo": {
        "ID": 91024,
        "Title": "Marina Puerto Salina",
        "AddressLine1": "Autopista Tijuana Ensenada KM 73 Abelardo L. Rodriguez",
        "Town": "Ensenada",
        "StateOrProvince": "Baja California",
        "Postcode": "22765",
        "CountryID": 146,
        "Latitude": 32.055835,
        "Longitude": -116.879736,
        "ContactTelephone1": "+52  646 155 4188",
        "DistanceUnit": 0
    },
    "Connections": [
        {
            "ID": 128401,
            "ConnectionTypeID": 30,
            "StatusTypeID": 50,
            "LevelID": 2,
            "PowerKW": 18,
            "CurrentTypeID": 20,
            "Quantity": 2
        }
    ],
    "NumberOfPoints": 2,
    "GeneralComments": "2 Tesla Connectors, up to 18kW.Available for members only. Self park.",
    "StatusTypeID": 50,
    "DateLastStatusUpdate": "2017-07-22T05:32:00Z",
    "DataQualityLevel": 1,
    "DateCreated": "2017-07-22T05:32:00Z",
    "SubmissionStatusTypeID": 200
}