{
    "IsRecentlyVerified": false,
    "ID": 141171,
    "UUID": "0E6722C6-31CB-494E-96F6-8FE4F7619F9F",
    "DataProviderID": 2,
    "DataProvidersReference": "144107",
    "OperatorID": 5,
    "UsageTypeID": 1,
    "AddressInfo": {
        "ID": 141523,
        "Title": "CSUS",
        "AddressLine1": "Atlas Cedar Way",
        "Town": "Sacramento",
        "StateOrProvince": "CA",
        "Postcode": "95826",
        "CountryID": 2,
        "Latitude": 38.559536,
        "Longitude": -121.4202,
        "ContactTelephone1": "888-758-4389",
        "AccessComments": "24 hours daily",
        "RelatedURL": "http://www.chargepoint.com/",
        "DistanceUnit": 0
    },
    "Connections": [
        {
            "ID": 197024,
            "ConnectionTypeID": 1,
            "LevelID": 2,
            "Amps": 16,
            "Voltage": 230,
            "PowerKW": 3,
            "CurrentTypeID": 10,
            "Quantity": 5
        }
    ],
    "StatusTypeID": 50,
    "DateLastStatusUpdate": "2019-12-24T09:14:00Z",
    "DataQualityLevel": 3,
    "DateCreated": "2019-12-24T09:14:00Z",
    "SubmissionStatusTypeID": 100
}