{
    "IsRecentlyVerified": false,
    "ID": 177805,
    "UUID": "B4F7D60F-9543-41E4-8A1A-DA7C06826F89",
    "DataProviderID": 29,
    "DataProvidersReference": "20365",
    "OperatorID": 69,
    "AddressInfo": {
        "ID": 178164,
        "Title": "Mönchstraße 4",
        "AddressLine1": "Mönchstraße 4",
        "Town": "Reutlingen",
        "Postcode": "72766",
        "CountryID": 87,
        "Latitude": 48.5648,
        "Longitude": 9.22844,
        "DistanceUnit": 0
    },
    "Connections": [
        {
            "ID": 277427,
            "ConnectionTypeID": 25,
            "StatusTypeID": 50,
            "LevelID": 2,
            "PowerKW": 22,
            "CurrentTypeID": 20
        },
        {
            "ID": 277428,
            "ConnectionTypeID": 25,
            "StatusTypeID": 50,
            "LevelID": 2,
            "PowerKW": 22,
            "CurrentTypeID": 20
        }
    ],
    "StatusTypeID": 0,
    "DateLastStatusUpdate": "2021-07-12T02:41:00Z",
    "MetadataValues": [
        {
            "ID": 10099,
            "MetadataFieldID": 4,
            "ItemValue": "Data from the German chargepoint registry provided by Bundesnetzagentur.de under the CC-BY 4.0 license"
        }
    ],
    "DataQualityLevel": 3,
    "DateCreated": "2021-07-08T09:49:00Z",
    "SubmissionStatusTypeID": 100
}