{
    "IsRecentlyVerified": false,
    "ID": 8476,
    "UUID": "4132A368-8C98-4176-B9E5-145F667C1142",
    "DataProviderID": 15,
    "DataProvidersReference": "1078",
    "OperatorID": 41,
    "AddressInfo": {
        "ID": 8373,
        "Title": "22633 Savi Ranch Parkway",
        "AddressLine1": "22633 Savi Ranch Parkway",
        "Town": "Yorba Linda",
        "StateOrProvince": "California",
        "Postcode": "92886",
        "CountryID": 2,
        "Latitude": 33.87593,
        "Longitude": -117.74493,
        "ContactTelephone1": "",
        "RelatedURL": "http://carstations.com/1078",
        "DistanceUnit": 0
    },
    "Connections": [
        {
            "ID": 5902,
            "ConnectionTypeID": 0,
            "Reference": "LPI"
        }
    ],
    "StatusTypeID": 0,
    "DateLastStatusUpdate": "2017-11-04T14:04:00Z",
    "DataQualityLevel": 1,
    "DateCreated": "2011-11-11T12:06:00Z",
    "SubmissionStatusTypeID": 100
}