{
    "IsRecentlyVerified": false,
    "ID": 159064,
    "UUID": "5F136507-72D2-4C35-B171-DB68F65B9743",
    "DataProviderID": 2,
    "DataProvidersReference": "153685",
    "OperatorID": 5,
    "UsageTypeID": 1,
    "AddressInfo": {
        "ID": 159421,
        "Title": "CAMERONATFP",
        "AddressLine1": "6300 Tower Cir",
        "Town": "Franklin",
        "StateOrProvince": "TN",
        "Postcode": "37067",
        "CountryID": 2,
        "Latitude": 35.93685,
        "Longitude": -86.811888,
        "ContactTelephone1": "888-758-4389",
        "AccessComments": "24 hours daily",
        "RelatedURL": "http://www.chargepoint.com/",
        "DistanceUnit": 0
    },
    "Connections": [
        {
            "ID": 229138,
            "ConnectionTypeID": 1,
            "LevelID": 2,
            "Amps": 16,
            "Voltage": 230,
            "PowerKW": 3.7,
            "CurrentTypeID": 10,
            "Quantity": 4
        }
    ],
    "StatusTypeID": 50,
    "DateLastStatusUpdate": "2020-06-26T02:58:00Z",
    "DataQualityLevel": 3,
    "DateCreated": "2020-06-26T02:58:00Z",
    "SubmissionStatusTypeID": 100
}