{
    "IsRecentlyVerified": false,
    "ID": 176154,
    "UUID": "F0BF81B5-EBE8-4D1E-8E86-06C6A1627A2E",
    "DataProviderID": 1,
    "OperatorID": 207,
    "UsageTypeID": 4,
    "UsageCost": "0.40€/kWh",
    "AddressInfo": {
        "ID": 176513,
        "Title": "Sant Tomas Iberdrola",
        "AddressLine1": "Sant Tomás 2",
        "Town": "Alcoy",
        "StateOrProvince": "Alicante",
        "CountryID": 210,
        "Latitude": 38.69891285334401,
        "Longitude": -0.4740718166738134,
        "DistanceUnit": 0
    },
    "Connections": [
        {
            "ID": 273707,
            "ConnectionTypeID": 33,
            "StatusTypeID": 50,
            "LevelID": 3,
            "PowerKW": 50,
            "CurrentTypeID": 30,
            "Quantity": 1
        },
        {
            "ID": 273708,
            "ConnectionTypeID": 2,
            "StatusTypeID": 50,
            "LevelID": 3,
            "PowerKW": 50,
            "CurrentTypeID": 30,
            "Quantity": 1
        },
        {
            "ID": 273709,
            "ConnectionTypeID": 1036,
            "StatusTypeID": 50,
            "LevelID": 3,
            "PowerKW": 43,
            "CurrentTypeID": 20,
            "Quantity": 1
        }
    ],
    "NumberOfPoints": 1,
    "StatusTypeID": 50,
    "DateLastStatusUpdate": "2021-06-28T07:10:00Z",
    "DataQualityLevel": 1,
    "DateCreated": "2021-06-27T19:59:00Z",
    "SubmissionStatusTypeID": 200
}