{
    "IsRecentlyVerified": false,
    "ID": 148999,
    "UUID": "C5F1A771-487E-4A00-ABAD-72B5A23C602E",
    "DataProviderID": 1,
    "OperatorID": 3,
    "OperatorsReference": "PG-84199,PG-84200",
    "UsageTypeID": 4,
    "UsageCost": "£0.25/kWh",
    "AddressInfo": {
        "ID": 149352,
        "Title": "Cromwell Tools Limited (employee’s Use Only)",
        "AddressLine1": "65 Chartwell Drive",
        "Town": "Leicester",
        "StateOrProvince": "Wigston",
        "Postcode": "LE18 2FS",
        "CountryID": 1,
        "Latitude": 52.585329,
        "Longitude": -1.125274,
        "DistanceUnit": 0
    },
    "Connections": [
        {
            "ID": 206917,
            "ConnectionTypeID": 25,
            "StatusTypeID": 50,
            "LevelID": 2,
            "Amps": 32,
            "Voltage": 230,
            "PowerKW": 7,
            "CurrentTypeID": 10,
            "Quantity": 4
        }
    ],
    "NumberOfPoints": 4,
    "GeneralComments": "This is an open charge unit installed at the Cromwell Tools Limited site at Chartwell Drive, Leicester, Wigston",
    "StatusTypeID": 50,
    "DateLastStatusUpdate": "2020-02-16T13:58:00Z",
    "DataQualityLevel": 1,
    "DateCreated": "2020-02-15T06:27:00Z",
    "SubmissionStatusTypeID": 200
}