{
    "MediaItems": [
        {
            "ID": 15619,
            "ChargePointID": 105868,
            "ItemURL": "https://s3-ap-southeast-2.amazonaws.com/openchargemap/images/US/OCM105868/OCM-105868.orig.2018060915271623.jpg",
            "ItemThumbnailURL": "https://s3-ap-southeast-2.amazonaws.com/openchargemap/images/US/OCM105868/OCM-105868.thmb.2018060915271623.jpg",
            "Comment": "",
            "IsEnabled": true,
            "IsVideo": false,
            "IsFeaturedItem": false,
            "IsExternalResource": false,
            "User": {
                "ID": 14061,
                "Username": "zeroping"
            },
            "DateCreated": "2018-06-09T15:27:00Z"
        }
    ],
    "IsRecentlyVerified": false,
    "ID": 105868,
    "UUID": "2654C70B-9D0D-4265-84CF-F261231A2D41",
    "DataProviderID": 1,
    "OperatorID": 45,
    "UsageTypeID": 1,
    "UsageCost": "Free",
    "AddressInfo": {
        "ID": 106214,
        "Title": "Pineland Mall",
        "AddressLine1": "430 William Hilton Parkway",
        "Town": "Hilton Head Island",
        "StateOrProvince": "SC",
        "Postcode": "29926",
        "CountryID": 2,
        "Latitude": 32.214823,
        "Longitude": -80.704821,
        "DistanceUnit": 0
    },
    "Connections": [
        {
            "ID": 149094,
            "ConnectionTypeID": 1,
            "StatusTypeID": 50,
            "LevelID": 2,
            "Amps": 40,
            "Voltage": 240,
            "PowerKW": 7.6,
            "CurrentTypeID": 10,
            "Quantity": 1
        }
    ],
    "NumberOfPoints": 1,
    "StatusTypeID": 50,
    "DateLastStatusUpdate": "2018-06-10T01:31:00Z",
    "DataQualityLevel": 1,
    "DateCreated": "2018-06-08T19:39:00Z",
    "SubmissionStatusTypeID": 200
}