{
    "UserComments": [
        {
            "ID": 18037,
            "ChargePointID": 25716,
            "CommentTypeID": 10,
            "UserName": "Simon Hewison",
            "Comment": "Confirmed that it's up and available again after construction work in the car park.",
            "RelatedURL": "https://twitter.com/NTSnowdoniaLlyn/status/942721692467646465",
            "DateCreated": "2017-12-18T21:06:06.353Z",
            "User": {
                "ID": 4575,
                "Username": "Simon Hewison"
            },
            "CheckinStatusTypeID": 0
        }
    ],
    "IsRecentlyVerified": false,
    "ID": 25716,
    "UUID": "7F49E794-7540-4E92-9882-E0AA17236220",
    "DataProviderID": 1,
    "OperatorID": 19,
    "UsageTypeID": 1,
    "AddressInfo": {
        "ID": 26062,
        "Title": "National Trust Coastal Toursim Centre of Excellence (Henfaes Centre Porth y Swnt)",
        "AddressLine1": "Henfaes",
        "AddressLine2": "Aberdaron",
        "Town": "Pwllheli ",
        "StateOrProvince": "Wales",
        "Postcode": "LL53 8BE",
        "CountryID": 1,
        "Latitude": 52.80467033236984,
        "Longitude": -4.712681099544517,
        "ContactTelephone2": "01758 703810",
        "ContactEmail": "porthyswnt@nationaltrust.org.uk",
        "RelatedURL": "https://www.nationaltrust.org.uk/porth-y-swnt",
        "DistanceUnit": 0
    },
    "Connections": [
        {
            "ID": 28040,
            "ConnectionTypeID": 25,
            "StatusTypeID": 50,
            "LevelID": 2,
            "Amps": 32,
            "Voltage": 230,
            "PowerKW": 7,
            "CurrentTypeID": 10,
            "Quantity": 1
        },
        {
            "ID": 28041,
            "ConnectionTypeID": 3,
            "StatusTypeID": 50,
            "LevelID": 2,
            "Amps": 13,
            "Voltage": 230,
            "PowerKW": 3,
            "CurrentTypeID": 10,
            "Quantity": 1
        }
    ],
    "NumberOfPoints": 2,
    "StatusTypeID": 50,
    "DateLastStatusUpdate": "2017-12-18T21:28:00Z",
    "DataQualityLevel": 1,
    "DateCreated": "2014-11-10T20:31:00Z",
    "SubmissionStatusTypeID": 200
}