{
    "IsRecentlyVerified": false,
    "ID": 121521,
    "UUID": "81193631-51AF-460D-8458-79A27DD2A677",
    "DataProviderID": 1,
    "OperatorID": 3341,
    "UsageTypeID": 4,
    "UsageCost": "£0.25/kWh",
    "AddressInfo": {
        "ID": 121867,
        "Title": "Weir Street, Blackburn",
        "AddressLine1": "Weir Street",
        "AddressLine2": "Wensley Fold",
        "Town": "Blackburn",
        "Postcode": "BB2 2AX",
        "CountryID": 1,
        "Latitude": 53.745097248702535,
        "Longitude": -2.4828818192791005,
        "DistanceUnit": 0
    },
    "Connections": [
        {
            "ID": 171229,
            "ConnectionTypeID": 25,
            "StatusTypeID": 50,
            "LevelID": 2,
            "Amps": 32,
            "Voltage": 400,
            "PowerKW": 22,
            "CurrentTypeID": 20,
            "Quantity": 2
        }
    ],
    "NumberOfPoints": 2,
    "StatusTypeID": 50,
    "DateLastStatusUpdate": "2019-04-04T09:28:00Z",
    "DataQualityLevel": 1,
    "DateCreated": "2019-04-04T09:28:00Z",
    "SubmissionStatusTypeID": 200
}