{
    "IsRecentlyVerified": false,
    "ID": 174151,
    "UUID": "A13C981E-3139-4238-B190-5D43E497FD5D",
    "DataProviderID": 1,
    "OperatorID": 3377,
    "UsageTypeID": 4,
    "UsageCost": "Free",
    "AddressInfo": {
        "ID": 174510,
        "Title": "CIRCUTOR EdRSR1 - ETECNIC",
        "AddressLine1": "Calle Víctor Eusa, 1",
        "Town": "Pamplona",
        "StateOrProvince": "Comunidad Foral de Navarra",
        "Postcode": "31012",
        "CountryID": 210,
        "Latitude": 42.82978302522335,
        "Longitude": -1.6689202509726329,
        "RelatedURL": "http://etecnic.es",
        "DistanceUnit": 0
    },
    "Connections": [
        {
            "ID": 269126,
            "ConnectionTypeID": 25,
            "StatusTypeID": 50,
            "LevelID": 2,
            "Amps": 32,
            "Voltage": 400,
            "PowerKW": 22.2,
            "CurrentTypeID": 20,
            "Quantity": 2
        }
    ],
    "NumberOfPoints": 2,
    "StatusTypeID": 50,
    "DateLastStatusUpdate": "2021-03-18T12:49:00Z",
    "DataQualityLevel": 1,
    "DateCreated": "2021-03-18T12:49:00Z",
    "SubmissionStatusTypeID": 200
}