{
    "UserComments": [
        {
            "ID": 10105,
            "ChargePointID": 47635,
            "CommentTypeID": 10,
            "UserName": "stickybit",
            "Comment": "",
            "Rating": 5,
            "DateCreated": "2016-04-06T10:10:58.06Z",
            "User": {
                "ID": 6738,
                "Username": "stickybit"
            },
            "CheckinStatusTypeID": 10
        }
    ],
    "MediaItems": [
        {
            "ID": 6167,
            "ChargePointID": 47635,
            "ItemURL": "https://s3-ap-southeast-2.amazonaws.com/openchargemap/images/NL/OCM47635/OCM-47635.orig.2016040610115705.jpeg",
            "ItemThumbnailURL": "https://s3-ap-southeast-2.amazonaws.com/openchargemap/images/NL/OCM47635/OCM-47635.thmb.2016040610115705.jpeg",
            "Comment": "Snow Tesla Fast charging",
            "IsEnabled": true,
            "IsVideo": false,
            "IsFeaturedItem": false,
            "IsExternalResource": false,
            "User": {
                "ID": 6738,
                "Username": "stickybit"
            },
            "DateCreated": "2016-04-06T10:12:00Z"
        },
        {
            "ID": 1527,
            "ChargePointID": 47635,
            "ItemURL": "https://s3-ap-southeast-2.amazonaws.com/openchargemap/images/NL/OCM47635/OCM-47635.orig.2015060421002193.jpg",
            "ItemThumbnailURL": "https://s3-ap-southeast-2.amazonaws.com/openchargemap/images/NL/OCM47635/OCM-47635.thmb.2015060421002193.jpg",
            "Comment": "Fastned nr 32 33",
            "IsEnabled": true,
            "IsVideo": false,
            "IsFeaturedItem": false,
            "IsExternalResource": false,
            "User": {
                "ID": 4511,
                "Username": "My_Leaf"
            },
            "DateCreated": "2015-06-04T21:01:00Z"
        }
    ],
    "IsRecentlyVerified": false,
    "ID": 47635,
    "UUID": "24C35675-7D0D-4445-986B-385B3B12D717",
    "DataProviderID": 1,
    "OperatorID": 74,
    "UsageTypeID": 1,
    "UsageCost": "",
    "AddressInfo": {
        "ID": 47981,
        "Title": "Fastned De Somp",
        "AddressLine1": "A50 Arnhem-Zwolle HMP 202",
        "AddressLine2": "",
        "Town": "Klarenbeek",
        "StateOrProvince": "",
        "Postcode": "",
        "CountryID": 159,
        "Latitude": 52.168457098861246,
        "Longitude": 6.028103828430176,
        "ContactTelephone1": "",
        "ContactTelephone2": "",
        "ContactEmail": "",
        "AccessComments": "Fastned nr 33",
        "RelatedURL": "http://www.fastned.nl",
        "DistanceUnit": 0
    },
    "Connections": [
        {
            "ID": 58737,
            "ConnectionTypeID": 2,
            "StatusTypeID": 50,
            "LevelID": 3,
            "Amps": 120,
            "Voltage": 400,
            "PowerKW": 50,
            "CurrentTypeID": 30,
            "Quantity": 2
        },
        {
            "ID": 58738,
            "ConnectionTypeID": 33,
            "StatusTypeID": 50,
            "LevelID": 3,
            "Amps": 120,
            "Voltage": 400,
            "PowerKW": 50,
            "CurrentTypeID": 30,
            "Quantity": 2
        },
        {
            "ID": 58739,
            "ConnectionTypeID": 25,
            "StatusTypeID": 50,
            "LevelID": 2,
            "Amps": 80,
            "Voltage": 230,
            "PowerKW": 22,
            "CurrentTypeID": 20,
            "Quantity": 2
        }
    ],
    "NumberOfPoints": 2,
    "GeneralComments": "",
    "StatusTypeID": 50,
    "DateLastStatusUpdate": "2016-04-06T10:12:00Z",
    "DataQualityLevel": 1,
    "DateCreated": "2015-06-04T21:00:00Z",
    "SubmissionStatusTypeID": 200
}