{
    "IsRecentlyVerified": false,
    "ID": 107604,
    "UUID": "26E9305E-131B-4EAB-8093-F768E5AEB0A0",
    "DataProviderID": 1,
    "OperatorID": 229,
    "UsageTypeID": 4,
    "UsageCost": "$0.25/kWh + $0.25/min",
    "AddressInfo": {
        "ID": 107950,
        "Title": "Lincoln New World",
        "AddressLine1": "77 Gerald Street",
        "Town": "Lincoln",
        "Postcode": "7674",
        "CountryID": 161,
        "Latitude": -43.641534,
        "Longitude": 172.474378,
        "DistanceUnit": 0
    },
    "Connections": [
        {
            "ID": 151842,
            "ConnectionTypeID": 2,
            "StatusTypeID": 50,
            "LevelID": 3,
            "PowerKW": 50,
            "CurrentTypeID": 30,
            "Quantity": 1
        },
        {
            "ID": 151843,
            "ConnectionTypeID": 33,
            "StatusTypeID": 50,
            "LevelID": 3,
            "PowerKW": 50,
            "CurrentTypeID": 30,
            "Quantity": 1
        }
    ],
    "NumberOfPoints": 1,
    "StatusTypeID": 50,
    "DateLastStatusUpdate": "2018-08-02T22:13:00Z",
    "DataQualityLevel": 1,
    "DateCreated": "2018-08-02T22:09:00Z",
    "SubmissionStatusTypeID": 200
}