{
    "IsRecentlyVerified": false,
    "ID": 167310,
    "UUID": "4425860A-7C5C-4C95-B4C6-72CF1A547800",
    "DataProviderID": 1,
    "OperatorID": 136,
    "UsageTypeID": 4,
    "UsageCost": "0,15€/kWh",
    "AddressInfo": {
        "ID": 167669,
        "Title": "Vepsäläinen",
        "AddressLine1": "Juvankartanontie 11",
        "Town": "Espoo",
        "StateOrProvince": "Southern Finland",
        "Postcode": "02920",
        "CountryID": 79,
        "Latitude": 60.266115289298625,
        "Longitude": 24.73943019886667,
        "RelatedURL": "http://www.virta.fi",
        "DistanceUnit": 0
    },
    "Connections": [
        {
            "ID": 253367,
            "ConnectionTypeID": 25,
            "StatusTypeID": 50,
            "LevelID": 2,
            "Amps": 32,
            "Voltage": 400,
            "PowerKW": 22,
            "CurrentTypeID": 20,
            "Quantity": 2
        }
    ],
    "NumberOfPoints": 2,
    "StatusTypeID": 50,
    "DateLastStatusUpdate": "2020-09-05T21:32:00Z",
    "DataQualityLevel": 1,
    "DateCreated": "2020-09-05T20:37:00Z",
    "SubmissionStatusTypeID": 200
}