{
    "IsRecentlyVerified": false,
    "ID": 97769,
    "UUID": "FC6701AD-4D3E-48C7-B6B8-9E0A239BA853",
    "DataProviderID": 1,
    "OperatorID": 23,
    "OperatorsReference": "38088",
    "UsageTypeID": 4,
    "AddressInfo": {
        "ID": 98115,
        "Title": "Holiday Inn Chicago-Elk Grove",
        "AddressLine1": "1000 Busse RD",
        "Town": "Elk Grove Village",
        "StateOrProvince": "Illinois",
        "Postcode": "60007",
        "CountryID": 2,
        "Latitude": 42.010468,
        "Longitude": -87.960841,
        "ContactTelephone1": "(847) 437-6010",
        "DistanceUnit": 0
    },
    "Connections": [
        {
            "ID": 138677,
            "ConnectionTypeID": 30,
            "StatusTypeID": 50,
            "LevelID": 2,
            "PowerKW": 10,
            "CurrentTypeID": 10,
            "Quantity": 2
        }
    ],
    "NumberOfPoints": 2,
    "GeneralComments": "2 Tesla Connectors, up to 10kW.Available for customers. Please see front desk.",
    "StatusTypeID": 50,
    "DateLastStatusUpdate": "2018-01-21T16:36:00Z",
    "DataQualityLevel": 1,
    "DateCreated": "2018-01-21T16:36:00Z",
    "SubmissionStatusTypeID": 200
}