{
    "IsRecentlyVerified": false,
    "ID": 138881,
    "UUID": "9882EC9E-07F3-430D-9595-BC5BD1B6D56F",
    "DataProviderID": 2,
    "DataProvidersReference": "72663",
    "OperatorID": 5,
    "UsageTypeID": 1,
    "AddressInfo": {
        "ID": 139233,
        "Title": "CPEX",
        "AddressLine1": "1275 Main St",
        "Town": "Ramona",
        "StateOrProvince": "CA",
        "Postcode": "92065",
        "CountryID": 2,
        "Latitude": 33.0398166,
        "Longitude": -116.8733114,
        "ContactTelephone1": "888-758-4389",
        "AccessComments": "24 hours daily",
        "RelatedURL": "http://www.chargepoint.com/",
        "DistanceUnit": 0
    },
    "Connections": [
        {
            "ID": 194104,
            "ConnectionTypeID": 1,
            "LevelID": 2,
            "Amps": 16,
            "Voltage": 230,
            "PowerKW": 3,
            "CurrentTypeID": 10,
            "Quantity": 2
        }
    ],
    "StatusTypeID": 50,
    "DateLastStatusUpdate": "2019-12-24T09:09:00Z",
    "DataQualityLevel": 3,
    "DateCreated": "2019-12-24T09:09:00Z",
    "SubmissionStatusTypeID": 100
}