{
    "IsRecentlyVerified": false,
    "ID": 136444,
    "UUID": "C55F9641-D905-42D1-AA5C-289759F61DD8",
    "DataProviderID": 18,
    "DataProvidersReference": "05039260bac431bc29c70967d9c485f7",
    "OperatorID": 2244,
    "UsageTypeID": 5,
    "AddressInfo": {
        "ID": 136790,
        "Title": "Meynell Crescent",
        "AddressLine1": "Meynell Crescent",
        "Town": "London",
        "Postcode": "E9 7AS",
        "CountryID": 1,
        "Latitude": 51.541763,
        "Longitude": -0.044482,
        "AccessComments": "",
        "RelatedURL": "https://www.ubitricity.com",
        "DistanceUnit": 0
    },
    "Connections": [
        {
            "ID": 190893,
            "ConnectionTypeID": 25,
            "Reference": "suby1100002640",
            "StatusTypeID": 50,
            "LevelID": 2,
            "Amps": 16,
            "Voltage": 230,
            "PowerKW": 3.7,
            "CurrentTypeID": 10
        }
    ],
    "StatusTypeID": 0,
    "DateLastStatusUpdate": "2021-04-25T05:46:00Z",
    "MetadataValues": [
        {
            "ID": 6296,
            "MetadataFieldID": 4,
            "ItemValue": "Contains public sector information licensed under the Open Government Licence v2.0. http://www.nationalarchives.gov.uk/doc/open-government-licence/version/2/"
        }
    ],
    "DataQualityLevel": 3,
    "DateCreated": "2019-12-24T05:22:00Z",
    "SubmissionStatusTypeID": 100
}