{
    "IsRecentlyVerified": false,
    "ID": 54091,
    "UUID": "0AFF51F8-08CE-4E02-9789-812F0950A551",
    "DataProviderID": 1,
    "OperatorID": 101,
    "UsageTypeID": 4,
    "AddressInfo": {
        "ID": 54437,
        "Title": "EDEKA",
        "AddressLine1": "Nördlinger Straße 44",
        "Town": " Schwabach",
        "Postcode": "91126",
        "CountryID": 87,
        "Latitude": 49.31893,
        "Longitude": 11.01188,
        "ContactTelephone1": "+49 9122 630280",
        "AccessComments": "Die Säule ist nutzbar: Mo: von 07:30 bis 20:00 Uhr Di: von 07:30 bis 20:00 Uhr Mi: von 07:30 bis 20:00 Uhr Do: von 07:30 bis 20:00 Uhr Fr: von 07:30 bis 20:00 Uhr Sa: von 07:30 bis 20:00 Uhr So: geschlossen Die Säule liefert auf der Typ2-Dose dreiphasig 20A, also ca. 14kW.\r\n",
        "RelatedURL": "http://www.edeka-krawczyk.de",
        "DistanceUnit": 0
    },
    "Connections": [
        {
            "ID": 67790,
            "ConnectionTypeID": 28,
            "StatusTypeID": 50,
            "LevelID": 2,
            "PowerKW": 3.7,
            "CurrentTypeID": 10,
            "Quantity": 1
        },
        {
            "ID": 67791,
            "ConnectionTypeID": 25,
            "StatusTypeID": 50,
            "LevelID": 2,
            "PowerKW": 11,
            "CurrentTypeID": 20,
            "Quantity": 1
        },
        {
            "ID": 67792,
            "ConnectionTypeID": 16,
            "StatusTypeID": 50,
            "LevelID": 2,
            "PowerKW": 3.7,
            "CurrentTypeID": 10,
            "Quantity": 0
        },
        {
            "ID": 67793,
            "ConnectionTypeID": 17,
            "StatusTypeID": 50,
            "LevelID": 2,
            "PowerKW": 0,
            "CurrentTypeID": 20,
            "Quantity": 0
        },
        {
            "ID": 67794,
            "ConnectionTypeID": 2,
            "StatusTypeID": 50,
            "LevelID": 2,
            "PowerKW": 0,
            "CurrentTypeID": 30,
            "Quantity": 0
        },
        {
            "ID": 67795,
            "ConnectionTypeID": 33,
            "StatusTypeID": 50,
            "LevelID": 2,
            "PowerKW": 0,
            "CurrentTypeID": 30,
            "Quantity": 0
        }
    ],
    "NumberOfPoints": 2,
    "StatusTypeID": 50,
    "DateLastStatusUpdate": "2015-09-23T19:11:00Z",
    "DataQualityLevel": 1,
    "DateCreated": "2015-09-22T21:06:00Z",
    "SubmissionStatusTypeID": 200
}