{
    "IsRecentlyVerified": false,
    "ID": 152934,
    "UUID": "5368F57F-B316-4AD3-965F-9A868ABE860F",
    "DataProviderID": 28,
    "DataProvidersReference": "FR*S41*P41295-100",
    "UsageTypeID": 5,
    "AddressInfo": {
        "ID": 153287,
        "Title": "Vineuil | Place Gaspard Imbert",
        "AddressLine1": "Place Gaspard Imbert 41350 Vineuil",
        "CountryID": 80,
        "Latitude": 47.5817,
        "Longitude": 1.378137,
        "AccessComments": "24/24 7/7",
        "DistanceUnit": 0
    },
    "Connections": [
        {
            "ID": 214322,
            "ConnectionTypeID": 25,
            "StatusTypeID": 50,
            "LevelID": 2,
            "PowerKW": 18,
            "CurrentTypeID": 20
        },
        {
            "ID": 214323,
            "ConnectionTypeID": 28,
            "StatusTypeID": 50,
            "LevelID": 2,
            "PowerKW": 18,
            "CurrentTypeID": 10
        },
        {
            "ID": 247593,
            "ConnectionTypeID": 25,
            "StatusTypeID": 50,
            "LevelID": 2,
            "PowerKW": 18,
            "CurrentTypeID": 20
        },
        {
            "ID": 247594,
            "ConnectionTypeID": 28,
            "StatusTypeID": 50,
            "LevelID": 2,
            "PowerKW": 18,
            "CurrentTypeID": 10
        }
    ],
    "GeneralComments": "",
    "StatusTypeID": 50,
    "DateLastStatusUpdate": "2020-08-27T05:13:00Z",
    "DataQualityLevel": 2,
    "DateCreated": "2020-03-15T10:54:00Z",
    "SubmissionStatusTypeID": 100
}