{
    "IsRecentlyVerified": false,
    "ID": 168481,
    "UUID": "3794BA50-0168-44F4-A718-C66ABEB6C11F",
    "DataProviderID": 1,
    "OperatorID": 3,
    "OperatorsReference": "t54_it1_2719_015",
    "UsageTypeID": 4,
    "UsageCost": "£0.25/kWh",
    "AddressInfo": {
        "ID": 168840,
        "Title": "Lidl",
        "AddressLine1": "Old Station Way",
        "Town": "Coleford",
        "StateOrProvince": "England",
        "Postcode": "GL16 8RR",
        "CountryID": 1,
        "Latitude": 51.7923692328224,
        "Longitude": -2.61454618966741,
        "AccessComments": "Located immediately on the right as you enter the Lidl car park. ",
        "DistanceUnit": 0
    },
    "Connections": [
        {
            "ID": 255876,
            "ConnectionTypeID": 33,
            "StatusTypeID": 50,
            "LevelID": 3,
            "PowerKW": 50,
            "CurrentTypeID": 30,
            "Quantity": 1
        },
        {
            "ID": 263284,
            "ConnectionTypeID": 25,
            "StatusTypeID": 50,
            "LevelID": 2,
            "Amps": 63,
            "Voltage": 400,
            "PowerKW": 22,
            "CurrentTypeID": 20,
            "Quantity": 1
        },
        {
            "ID": 268198,
            "ConnectionTypeID": 2,
            "StatusTypeID": 50,
            "LevelID": 3,
            "PowerKW": 50,
            "CurrentTypeID": 30,
            "Quantity": 1
        }
    ],
    "NumberOfPoints": 3,
    "GeneralComments": "22kW Type 2, 50kW CCS & CHAdeMO. Pod Point Rapid, Hiro-Tate. AC + 1 DC connector can charge simultaneously",
    "StatusTypeID": 50,
    "DateLastStatusUpdate": "2021-03-20T06:28:00Z",
    "DataQualityLevel": 1,
    "DateCreated": "2020-09-27T18:47:00Z",
    "SubmissionStatusTypeID": 200
}