{
    "IsRecentlyVerified": false,
    "ID": 79274,
    "UUID": "58CA11D5-EFB9-46AA-98A8-6646FA16FCC2",
    "DataProviderID": 1,
    "OperatorID": 23,
    "OperatorsReference": "20577",
    "UsageTypeID": 6,
    "UsageCost": "Free",
    "AddressInfo": {
        "ID": 79620,
        "Title": "Bunn House Boutique Hotel",
        "AddressLine1": "15 Clayton St",
        "Town": "Asheville",
        "StateOrProvince": "North Carolina",
        "Postcode": "28801",
        "CountryID": 2,
        "Latitude": 35.601686,
        "Longitude": -82.549146,
        "ContactTelephone1": "(828) 333-8700",
        "DistanceUnit": 0
    },
    "Connections": [
        {
            "ID": 113900,
            "ConnectionTypeID": 30,
            "StatusTypeID": 50,
            "LevelID": 2,
            "PowerKW": 10,
            "CurrentTypeID": 10,
            "Quantity": 1
        }
    ],
    "NumberOfPoints": 1,
    "GeneralComments": "1 Tesla Connector, up to 10kW.Available for patrons only. Self park.",
    "StatusTypeID": 50,
    "DateLastStatusUpdate": "2017-07-13T14:10:00Z",
    "DataQualityLevel": 1,
    "DateCreated": "2017-01-27T07:56:00Z",
    "SubmissionStatusTypeID": 200
}