{
    "IsRecentlyVerified": false,
    "ID": 42881,
    "UUID": "2B7F9E15-AEED-4160-9E2D-4F31E2E5DE6E",
    "DataProviderID": 26,
    "DataProvidersReference": "60084",
    "OperatorID": 73,
    "OperatorsReference": "EV-Box EVB-P1445005",
    "UsageCost": "0.00 jaarabonnement",
    "AddressInfo": {
        "ID": 43227,
        "Title": "Thorbeckelaan 14",
        "AddressLine1": "Thorbeckelaan 14",
        "Town": "Eindhoven",
        "Postcode": "5631 AT",
        "CountryID": 159,
        "Latitude": 51.45298,
        "Longitude": 5.51025,
        "RelatedURL": "http://www.ev-box.nl",
        "DistanceUnit": 0
    },
    "Connections": [
        {
            "ID": 51802,
            "ConnectionTypeID": 25,
            "LevelID": 2,
            "PowerKW": 11,
            "CurrentTypeID": 10
        }
    ],
    "NumberOfPoints": 1,
    "StatusTypeID": 50,
    "DateLastStatusUpdate": "2016-06-04T02:39:00Z",
    "DataQualityLevel": 3,
    "DateCreated": "2015-03-25T02:49:00Z",
    "SubmissionStatusTypeID": 100
}