{
    "IsRecentlyVerified": false,
    "ID": 93953,
    "UUID": "82D34C08-E3AB-4C56-A382-BBD90BEC0F4E",
    "DataProviderID": 1,
    "OperatorID": 69,
    "UsageTypeID": 4,
    "AddressInfo": {
        "ID": 94299,
        "Title": "Autohaus Käsmann",
        "AddressLine1": "Industriestraße 1a",
        "Town": "Mosbach",
        "StateOrProvince": "Verwaltungsgemeinschaft Mosbach",
        "Postcode": "74821",
        "CountryID": 87,
        "Latitude": 49.34253373320579,
        "Longitude": 9.12177353386848,
        "ContactTelephone1": "+49 6261-8905-0",
        "AccessComments": "24/7 nutzbar",
        "RelatedURL": "http://www.swm-online.de/",
        "DistanceUnit": 0
    },
    "Connections": [
        {
            "ID": 133007,
            "ConnectionTypeID": 25,
            "StatusTypeID": 50,
            "LevelID": 2,
            "Amps": 16,
            "Voltage": 400,
            "PowerKW": 11,
            "CurrentTypeID": 20,
            "Quantity": 2
        }
    ],
    "NumberOfPoints": 2,
    "StatusTypeID": 50,
    "DateLastStatusUpdate": "2017-10-13T14:07:00Z",
    "DataQualityLevel": 1,
    "DateCreated": "2017-10-13T14:07:00Z",
    "SubmissionStatusTypeID": 200
}