{
    "IsRecentlyVerified": false,
    "ID": 35558,
    "UUID": "6A6700DF-5FAE-4721-A733-3520931B5055",
    "DataProviderID": 26,
    "DataProvidersReference": "21168",
    "OperatorsReference": "Winkelcentrum Stadshart",
    "UsageCost": "0.00 gratis",
    "AddressInfo": {
        "ID": 35904,
        "Title": "Onderlangs",
        "AddressLine1": "Onderlangs",
        "Town": "Zoetermeer",
        "Postcode": "2711 AL",
        "CountryID": 159,
        "Latitude": 52.060617958788,
        "Longitude": 4.4876146316528,
        "RelatedURL": "http://www.stadshart.nl",
        "DistanceUnit": 0
    },
    "Connections": [
        {
            "ID": 39069,
            "ConnectionTypeID": 28,
            "LevelID": 1,
            "PowerKW": 2.3,
            "CurrentTypeID": 10
        }
    ],
    "NumberOfPoints": 2,
    "StatusTypeID": 50,
    "DateLastStatusUpdate": "2016-06-04T02:45:00Z",
    "DataQualityLevel": 3,
    "DateCreated": "2015-01-09T06:05:00Z",
    "SubmissionStatusTypeID": 100
}