{
    "IsRecentlyVerified": false,
    "ID": 47214,
    "UUID": "5C7B8B55-24DC-49A9-94CC-FC8E440907B0",
    "DataProviderID": 1,
    "OperatorID": 45,
    "UsageTypeID": 7,
    "UsageCost": "3,50€..6,50€",
    "AddressInfo": {
        "ID": 47560,
        "Title": "Touristinfo Stechlinsee Center",
        "AddressLine1": "Stechlinseestraße 17",
        "Town": "Stechlin",
        "StateOrProvince": "Gransee und Gemeinden",
        "Postcode": "16775",
        "CountryID": 87,
        "Latitude": 53.1478339,
        "Longitude": 13.0489314,
        "ContactTelephone1": "+49 33082 70202",
        "AccessComments": "Schukodosen werden per Schlüssel freigeschaltet. Den gibt's entweder in der Touristinfo (täglich 10-15Uhr geöffnet) oder bei der Kegelbahn (Mi-So 16-22Uhr offen). Parkgebühren 1..4€ plus Stromkosten 2,50€ pauschal fallen an. Keine reservierten Parkplätze! Aktuelle Infos auf der Webseite nachschlagen.",
        "RelatedURL": "http://www.reiseland-brandenburg.de/reiseziele/ruppiner-land/details/id/14166/theme/a-z.html",
        "DistanceUnit": 0
    },
    "Connections": [
        {
            "ID": 58196,
            "ConnectionTypeID": 28,
            "StatusTypeID": 50,
            "LevelID": 2,
            "Amps": 16,
            "Voltage": 230,
            "PowerKW": 2.7,
            "CurrentTypeID": 10,
            "Quantity": 4
        }
    ],
    "NumberOfPoints": 4,
    "StatusTypeID": 50,
    "DateLastStatusUpdate": "2015-05-20T06:52:00Z",
    "DataQualityLevel": 1,
    "DateCreated": "2015-05-19T06:54:00Z",
    "SubmissionStatusTypeID": 200
}