{
    "UserComments": [
        {
            "ID": 10246,
            "ChargePointID": 51311,
            "CommentTypeID": 100,
            "UserName": "Familie van der Heide",
            "Comment": "Current fee depends on your speed of charging from EUR 1,20 per hour for 3.8 kWh up to EUR 7,20 per hour for 22 kWh",
            "Rating": 4,
            "DateCreated": "2016-04-27T06:59:14.867Z",
            "User": {
                "ID": 9294,
                "Username": "Familie van der Heide"
            },
            "CheckinStatusTypeID": 10
        }
    ],
    "IsRecentlyVerified": false,
    "ID": 51311,
    "UUID": "E323CCBD-5A9C-4914-84B9-AEF3C047FDB2",
    "DataProviderID": 1,
    "OperatorID": 103,
    "OperatorsReference": "Allego NLALLEGO0001301",
    "UsageTypeID": 4,
    "UsageCost": "0.00 jaarabonnement",
    "AddressInfo": {
        "ID": 51657,
        "Title": "Gerard Dousingel",
        "AddressLine1": "",
        "AddressLine2": "",
        "Town": "Papendrecht",
        "StateOrProvince": "",
        "Postcode": "3351 JM",
        "CountryID": 159,
        "Latitude": 51.83667249894214,
        "Longitude": 4.685647487640381,
        "ContactTelephone1": "0800-3745337",
        "ContactTelephone2": "",
        "ContactEmail": "",
        "AccessComments": "",
        "RelatedURL": "http://www.allego.eu/",
        "DistanceUnit": 0
    },
    "Connections": [
        {
            "ID": 63497,
            "ConnectionTypeID": 25,
            "StatusTypeID": 50,
            "LevelID": 2,
            "PowerKW": 11
        },
        {
            "ID": 63498,
            "ConnectionTypeID": 25,
            "StatusTypeID": 50,
            "LevelID": 2,
            "PowerKW": 11
        }
    ],
    "NumberOfPoints": 1,
    "GeneralComments": "",
    "StatusTypeID": 50,
    "DateLastStatusUpdate": "2016-04-27T19:56:00Z",
    "DataQualityLevel": 3,
    "DateCreated": "2015-07-24T06:28:00Z",
    "SubmissionStatusTypeID": 100
}