{
    "IsRecentlyVerified": false,
    "ID": 66096,
    "UUID": "80C3483F-3622-4BC0-9298-32323EE28CBC",
    "DataProviderID": 1,
    "OperatorID": 1240,
    "UsageTypeID": 1,
    "AddressInfo": {
        "ID": 66442,
        "Title": "E-Bike Station Westpfalzhalle",
        "AddressLine1": "Sport - und Freizeitzentrum 1",
        "Town": "Niederkirchen",
        "StateOrProvince": "Otterbach-Otterberg",
        "Postcode": "67700",
        "CountryID": 87,
        "Latitude": 49.5768273994066,
        "Longitude": 7.68247811312254,
        "RelatedURL": "https://www.pfalzwerke.de/energieberatung/9244.php",
        "DistanceUnit": 0
    },
    "Connections": [
        {
            "ID": 91386,
            "ConnectionTypeID": 28,
            "StatusTypeID": 50,
            "LevelID": 1,
            "Amps": 10,
            "Voltage": 230,
            "PowerKW": 2.3,
            "CurrentTypeID": 10,
            "Quantity": 4
        }
    ],
    "NumberOfPoints": 4,
    "StatusTypeID": 50,
    "DateLastStatusUpdate": "2016-05-12T06:02:00Z",
    "DataQualityLevel": 1,
    "DateCreated": "2016-05-11T15:06:00Z",
    "SubmissionStatusTypeID": 200
}