{
    "IsRecentlyVerified": false,
    "ID": 40968,
    "UUID": "79E077FB-6B2C-48E9-8480-5148F126DC0C",
    "DataProviderID": 1,
    "OperatorID": 124,
    "UsageTypeID": 1,
    "UsageCost": "0",
    "AddressInfo": {
        "ID": 41314,
        "Title": "E-Ladestation Osterholzer Stadtwerke",
        "AddressLine1": "Riesstraße",
        "AddressLine2": "",
        "Town": "Ritterhude",
        "StateOrProvince": "Landkreis Osterholz",
        "Postcode": "27721",
        "CountryID": 87,
        "Latitude": 53.1813386555961,
        "Longitude": 8.75604613326118,
        "ContactTelephone1": "",
        "ContactTelephone2": "",
        "ContactEmail": "",
        "AccessComments": "Ladesäule immer geöffnet.",
        "RelatedURL": "https://www.swb-gruppe.de",
        "DistanceUnit": 0
    },
    "Connections": [
        {
            "ID": 44639,
            "ConnectionTypeID": 25,
            "StatusTypeID": 50,
            "LevelID": 2,
            "Amps": 32,
            "Voltage": 400,
            "PowerKW": 22,
            "CurrentTypeID": 20,
            "Quantity": 1
        },
        {
            "ID": 44640,
            "ConnectionTypeID": 17,
            "StatusTypeID": 50,
            "LevelID": 2,
            "Amps": 16,
            "Voltage": 400,
            "PowerKW": 11,
            "CurrentTypeID": 20,
            "Quantity": 1
        }
    ],
    "NumberOfPoints": 2,
    "GeneralComments": "Zur Freischaltung SWB / EWE / Stadtwerke Osterholz RFID Karte notwendig.",
    "StatusTypeID": 50,
    "DateLastStatusUpdate": "2015-04-25T15:19:00Z",
    "DataQualityLevel": 1,
    "DateCreated": "2015-01-17T18:02:00Z",
    "SubmissionStatusTypeID": 200
}