{
    "IsRecentlyVerified": false,
    "ID": 139670,
    "UUID": "B2A96B6F-DE8F-436D-8495-1377A464F93F",
    "DataProviderID": 2,
    "DataProvidersReference": "123200",
    "OperatorID": 3372,
    "UsageTypeID": 2,
    "AddressInfo": {
        "ID": 140022,
        "Title": "Untitled No. 1 School",
        "AddressLine1": "2953 Delaware Ave",
        "Town": "Santa Monica",
        "StateOrProvince": "CA",
        "Postcode": "90404",
        "CountryID": 2,
        "Latitude": 34.0283436,
        "Longitude": -118.4606536,
        "ContactTelephone1": "",
        "AccessComments": "",
        "RelatedURL": "http://evconnect.com/",
        "DistanceUnit": 0
    },
    "Connections": [
        {
            "ID": 195105,
            "ConnectionTypeID": 1,
            "LevelID": 2,
            "Amps": 16,
            "Voltage": 230,
            "PowerKW": 3.7,
            "CurrentTypeID": 10,
            "Quantity": 1
        }
    ],
    "StatusTypeID": 50,
    "DateLastStatusUpdate": "2020-06-26T02:56:00Z",
    "DataQualityLevel": 3,
    "DateCreated": "2019-12-24T09:11:00Z",
    "SubmissionStatusTypeID": 100
}