{
    "IsRecentlyVerified": false,
    "ID": 31480,
    "UUID": "2192A2CB-7626-413F-9AB2-FFC4A7780F97",
    "DataProviderID": 26,
    "DataProvidersReference": "58375",
    "OperatorID": 78,
    "OperatorsReference": "Essent EM-CH-00005724-01-00001",
    "UsageCost": "0.00 jaarabonnement",
    "AddressInfo": {
        "ID": 31826,
        "Title": "Route de Duillier 18",
        "AddressLine1": "Route de Duillier 18",
        "Town": "Nyon",
        "Postcode": "1260",
        "CountryID": 217,
        "Latitude": 46.394478,
        "Longitude": 6.236326,
        "RelatedURL": "http://www.essent.nl",
        "DistanceUnit": 0
    },
    "Connections": [
        {
            "ID": 34991,
            "ConnectionTypeID": 25,
            "LevelID": 2,
            "PowerKW": 11,
            "CurrentTypeID": 10
        }
    ],
    "NumberOfPoints": 1,
    "StatusTypeID": 50,
    "DateLastStatusUpdate": "2016-06-04T02:37:00Z",
    "DataQualityLevel": 3,
    "DateCreated": "2015-01-09T06:03:00Z",
    "SubmissionStatusTypeID": 100
}