{
    "IsRecentlyVerified": false,
    "ID": 78730,
    "UUID": "FD710674-A5DF-4DF8-B2CB-427B58667F51",
    "DataProviderID": 1,
    "OperatorID": 23,
    "OperatorsReference": "6989",
    "UsageTypeID": 4,
    "UsageCost": "Free",
    "AddressInfo": {
        "ID": 79076,
        "Title": "Benson's Appliance Center",
        "AddressLine1": "501 N Mckenzie St",
        "Town": "Foley",
        "StateOrProvince": "AL",
        "Postcode": "36535",
        "CountryID": 2,
        "Latitude": 30.410814,
        "Longitude": -87.683956,
        "ContactTelephone1": "(251) 943-5096",
        "DistanceUnit": 0
    },
    "Connections": [
        {
            "ID": 113349,
            "ConnectionTypeID": 30,
            "StatusTypeID": 50,
            "LevelID": 2,
            "PowerKW": 16,
            "CurrentTypeID": 20,
            "Quantity": 1
        }
    ],
    "NumberOfPoints": 1,
    "GeneralComments": "1 Tesla Connector, up to 16kW.Available to the public. Self park.",
    "StatusTypeID": 50,
    "DateLastStatusUpdate": "2017-01-26T15:18:00Z",
    "DataQualityLevel": 1,
    "DateCreated": "2017-01-26T15:18:00Z",
    "SubmissionStatusTypeID": 200
}