{
    "IsRecentlyVerified": false,
    "ID": 94320,
    "UUID": "931A6498-0E39-46AC-AEAD-247CBD715B39",
    "DataProviderID": 2,
    "DataProvidersReference": "87444",
    "OperatorID": 5,
    "UsageTypeID": 1,
    "AddressInfo": {
        "ID": 94666,
        "Title": "EVERGY",
        "AddressLine1": "178 NE St Lukes Blvd @ St Lukes Hospital -  East",
        "Town": "Lees Summit",
        "StateOrProvince": "MO",
        "Postcode": "64086",
        "CountryID": 2,
        "Latitude": 38.9408814,
        "Longitude": -94.3788407,
        "ContactTelephone1": "888-758-4389",
        "AccessComments": "24 hours daily",
        "RelatedURL": "http://www.chargepoint.com/",
        "DistanceUnit": 0
    },
    "Connections": [
        {
            "ID": 133419,
            "ConnectionTypeID": 1,
            "LevelID": 2,
            "Amps": 16,
            "Voltage": 230,
            "PowerKW": 3,
            "CurrentTypeID": 10,
            "Quantity": 6
        }
    ],
    "DateLastStatusUpdate": "2019-12-24T09:15:00Z",
    "DataQualityLevel": 3,
    "DateCreated": "2017-10-19T02:06:00Z",
    "SubmissionStatusTypeID": 100
}