{
    "IsRecentlyVerified": false,
    "ID": 141936,
    "UUID": "BA6FC4DE-E99D-48DF-9721-929F865CF73D",
    "DataProviderID": 2,
    "DataProvidersReference": "147951",
    "OperatorID": 39,
    "UsageTypeID": 1,
    "AddressInfo": {
        "ID": 142288,
        "Title": "Baker School Apartments",
        "AddressLine1": "3555 West 64th Avenue",
        "Town": "Denver",
        "StateOrProvince": "CO",
        "Postcode": "80221",
        "CountryID": 2,
        "Latitude": 39.813303,
        "Longitude": -105.034155,
        "ContactTelephone1": "800-663-5633",
        "AccessComments": "MO: Not Specified; TU: Not Specified; WE: Not Specified; TH: Not Specified; FR: Not Specified; SA: Not Specified; SU: Not Specified",
        "RelatedURL": "http://www.semacharge.com/",
        "DistanceUnit": 0
    },
    "Connections": [
        {
            "ID": 197977,
            "ConnectionTypeID": 1,
            "LevelID": 2,
            "Amps": 16,
            "Voltage": 230,
            "PowerKW": 3.7,
            "CurrentTypeID": 10,
            "Quantity": 1
        }
    ],
    "StatusTypeID": 50,
    "DateLastStatusUpdate": "2020-06-26T03:02:00Z",
    "DataQualityLevel": 3,
    "DateCreated": "2019-12-24T09:16:00Z",
    "SubmissionStatusTypeID": 100
}