{
    "IsRecentlyVerified": false,
    "ID": 100143,
    "UUID": "D791DB3D-E04E-4E78-9B27-F8DF3F36995E",
    "DataProviderID": 1,
    "OperatorID": 46,
    "UsageTypeID": 4,
    "AddressInfo": {
        "ID": 100489,
        "Title": "Charge-On ",
        "AddressLine1": "Beethovenplatz",
        "Town": "Templin",
        "StateOrProvince": "Landkreis Uckermark",
        "Postcode": "17268",
        "CountryID": 87,
        "Latitude": 53.117599038378685,
        "Longitude": 13.498323246557675,
        "AccessComments": "24/7 nutzbar",
        "RelatedURL": "https://www.nordkurier.de/templin/erste-stromzapfsaeule-in-templin-montiert-1231228502.html",
        "DistanceUnit": 0
    },
    "Connections": [
        {
            "ID": 141463,
            "ConnectionTypeID": 25,
            "StatusTypeID": 50,
            "LevelID": 2,
            "Amps": 32,
            "Voltage": 400,
            "PowerKW": 22,
            "CurrentTypeID": 20,
            "Quantity": 2
        }
    ],
    "NumberOfPoints": 2,
    "StatusTypeID": 50,
    "DateLastStatusUpdate": "2018-02-14T14:54:00Z",
    "DataQualityLevel": 1,
    "DateCreated": "2018-02-14T14:54:00Z",
    "SubmissionStatusTypeID": 200
}