{
    "IsRecentlyVerified": false,
    "ID": 54255,
    "UUID": "37303669-CBEB-4B96-A956-02EDE6450190",
    "DataProviderID": 1,
    "OperatorID": 173,
    "UsageTypeID": 4,
    "AddressInfo": {
        "ID": 54601,
        "Title": "BMW Niederlassung",
        "AddressLine1": "Industriestrasse 6",
        "Town": "Dielsdorf",
        "Postcode": "8157",
        "CountryID": 87,
        "Latitude": 47.4843245,
        "Longitude": 8.46306709999999,
        "AccessComments": "Rund um die Uhr (24/7) nutzbar Es gibt wenn Not am Mann ist noch eine CSS-Ausweichsäule gleich nebenan in der Industriestrasse 20 bei BMW Schweiz - zu Büro-Geschäftszeiten), und nach freundlichem Fragen.. Umgebung:Motorradausstellung von BMW / Coop Center, Mc Donald/ Migro Center\r\n",
        "DistanceUnit": 0
    },
    "Connections": [
        {
            "ID": 68284,
            "ConnectionTypeID": 25,
            "StatusTypeID": 50,
            "LevelID": 2,
            "PowerKW": 22,
            "CurrentTypeID": 20,
            "Quantity": 1
        },
        {
            "ID": 68285,
            "ConnectionTypeID": 33,
            "StatusTypeID": 50,
            "LevelID": 3,
            "PowerKW": 50,
            "CurrentTypeID": 30,
            "Quantity": 1
        }
    ],
    "NumberOfPoints": 2,
    "StatusTypeID": 50,
    "DateLastStatusUpdate": "2015-09-25T17:24:00Z",
    "DataQualityLevel": 1,
    "DateCreated": "2015-09-25T14:20:00Z",
    "SubmissionStatusTypeID": 200
}