{
    "IsRecentlyVerified": false,
    "ID": 170323,
    "UUID": "45B50DF7-4798-428E-A22A-5B2DBBBE6EF9",
    "DataProviderID": 1,
    "OperatorID": 38,
    "UsageTypeID": 1,
    "UsageCost": "free",
    "AddressInfo": {
        "ID": 170682,
        "Title": "LIDL Licata",
        "AddressLine1": "Via Palma, 236",
        "Town": "Licata",
        "StateOrProvince": "AG",
        "Postcode": "92027",
        "CountryID": 112,
        "Latitude": 37.11213914814677,
        "Longitude": 13.920140056518903,
        "RelatedURL": "https://www.lidl.it",
        "DistanceUnit": 0
    },
    "Connections": [
        {
            "ID": 259760,
            "ConnectionTypeID": 25,
            "StatusTypeID": 50,
            "LevelID": 2,
            "Amps": 32,
            "Voltage": 400,
            "PowerKW": 22,
            "CurrentTypeID": 20,
            "Quantity": 2
        }
    ],
    "NumberOfPoints": 2,
    "StatusTypeID": 50,
    "DateLastStatusUpdate": "2020-11-23T14:31:00Z",
    "DataQualityLevel": 1,
    "DateCreated": "2020-11-23T14:31:00Z",
    "SubmissionStatusTypeID": 200
}