{
    "IsRecentlyVerified": false,
    "ID": 175649,
    "UUID": "2ABE9BB2-221C-4A2A-9C7A-730EBEF26284",
    "DataProviderID": 1,
    "OperatorID": 3454,
    "UsageTypeID": 1,
    "AddressInfo": {
        "ID": 176008,
        "Title": " Trails Travel Center DCFC ",
        "AddressLine1": "795–821 Happy Trails Ln",
        "Town": "Albert Lea",
        "StateOrProvince": "Minnesota",
        "Postcode": "56007",
        "CountryID": 2,
        "Latitude": 43.65727193544157,
        "Longitude": -93.31863291605862,
        "AccessComments": "At the northwest edge of the parking lot, just beyond the Tesla Superchargers",
        "DistanceUnit": 0
    },
    "Connections": [
        {
            "ID": 272720,
            "ConnectionTypeID": 32,
            "StatusTypeID": 50,
            "LevelID": 2,
            "PowerKW": 150,
            "Quantity": 1
        },
        {
            "ID": 272721,
            "ConnectionTypeID": 2,
            "StatusTypeID": 50,
            "LevelID": 2,
            "PowerKW": 50,
            "Quantity": 1
        },
        {
            "ID": 272722,
            "ConnectionTypeID": 1,
            "StatusTypeID": 50,
            "LevelID": 2,
            "PowerKW": 11.5,
            "Quantity": 2
        }
    ],
    "NumberOfPoints": 1,
    "GeneralComments": "Station provided by ZEF Energy",
    "StatusTypeID": 50,
    "DateLastStatusUpdate": "2021-08-17T11:18:00Z",
    "DataQualityLevel": 1,
    "DateCreated": "2021-06-03T15:35:00Z",
    "SubmissionStatusTypeID": 200
}