{
    "IsRecentlyVerified": false,
    "ID": 159256,
    "UUID": "F1078D05-1C64-4719-B77C-A5495E70C5AD",
    "DataProviderID": 2,
    "DataProvidersReference": "153875",
    "OperatorID": 3318,
    "UsageTypeID": 1,
    "AddressInfo": {
        "ID": 159613,
        "Title": "Walmart 3352 - Stockton, CA",
        "AddressLine1": "10355 Trinity Parkway",
        "Town": "Stockton",
        "StateOrProvince": "CA",
        "Postcode": "95219",
        "CountryID": 2,
        "Latitude": 38.050442,
        "Longitude": -121.376698,
        "ContactTelephone1": "833-632-2778",
        "AccessComments": "24 hours daily",
        "RelatedURL": "https://www.electrifyamerica.com/",
        "DistanceUnit": 0
    },
    "Connections": [
        {
            "ID": 229388,
            "ConnectionTypeID": 2,
            "LevelID": 3,
            "Amps": 100,
            "Voltage": 400,
            "PowerKW": 40,
            "CurrentTypeID": 30,
            "Quantity": 1
        },
        {
            "ID": 229389,
            "ConnectionTypeID": 32,
            "LevelID": 3,
            "Amps": 100,
            "Voltage": 400,
            "PowerKW": 40,
            "CurrentTypeID": 30,
            "Quantity": 1
        }
    ],
    "StatusTypeID": 50,
    "DateLastStatusUpdate": "2020-06-26T02:59:00Z",
    "DataQualityLevel": 3,
    "DateCreated": "2020-06-26T02:59:00Z",
    "SubmissionStatusTypeID": 100
}