{
    "UserComments": [
        {
            "ID": 21728,
            "ChargePointID": 32881,
            "CommentTypeID": 10,
            "UserName": "Kassiopeia",
            "Comment": "",
            "Rating": 5,
            "DateCreated": "2019-10-28T16:03:39Z",
            "User": {
                "ID": 19150,
                "Username": "Kassiopeia"
            },
            "CheckinStatusTypeID": 10
        }
    ],
    "IsRecentlyVerified": false,
    "ID": 32881,
    "UUID": "F16A36C5-4758-4469-8399-D386A4E3EA3F",
    "DataProviderID": 1,
    "OperatorID": 105,
    "OperatorsReference": "Essent EM-DE-05113000-01-00008",
    "UsageTypeID": 4,
    "AddressInfo": {
        "ID": 33227,
        "Title": "Hachestraße 4",
        "AddressLine1": "Hachestraße 4",
        "Town": "Essen",
        "Postcode": "45127",
        "CountryID": 87,
        "Latitude": 51.451925,
        "Longitude": 7.012083,
        "DistanceUnit": 0
    },
    "Connections": [
        {
            "ID": 36392,
            "ConnectionTypeID": 25,
            "StatusTypeID": 50,
            "LevelID": 2,
            "PowerKW": 22,
            "CurrentTypeID": 20,
            "Quantity": 2
        }
    ],
    "NumberOfPoints": 2,
    "StatusTypeID": 50,
    "DateLastStatusUpdate": "2019-10-30T16:53:00Z",
    "DataQualityLevel": 3,
    "DateCreated": "2015-01-09T06:03:00Z",
    "SubmissionStatusTypeID": 200
}