{
    "IsRecentlyVerified": false,
    "ID": 126220,
    "UUID": "951B28CF-C7A8-45F5-BBDE-BD33C3D32ACC",
    "DataProviderID": 1,
    "OperatorID": 3,
    "OperatorsReference": "PG-82527",
    "UsageTypeID": 4,
    "UsageCost": "£0.30/kWh",
    "AddressInfo": {
        "ID": 126566,
        "Title": "English Gate Plaza Car Park",
        "AddressLine1": "English Gate Plaza Car Park",
        "AddressLine2": "Currock",
        "Town": "Carlisle",
        "StateOrProvince": "Cumbria",
        "Postcode": "CA1 1RP",
        "CountryID": 1,
        "Latitude": 54.891601,
        "Longitude": -2.931173,
        "DistanceUnit": 0
    },
    "Connections": [
        {
            "ID": 176902,
            "ConnectionTypeID": 25,
            "StatusTypeID": 50,
            "LevelID": 2,
            "Amps": 32,
            "Voltage": 230,
            "PowerKW": 7,
            "CurrentTypeID": 10,
            "Quantity": 2
        }
    ],
    "NumberOfPoints": 2,
    "GeneralComments": "This is an open charge unit installed at the English Gate Plaza Car Park at Managing Suite, English Gate Plaza, Botchergate, Carlisle",
    "StatusTypeID": 50,
    "DateLastStatusUpdate": "2019-05-13T14:54:00Z",
    "DataQualityLevel": 1,
    "DateCreated": "2019-05-13T14:53:00Z",
    "SubmissionStatusTypeID": 200
}