{
    "IsRecentlyVerified": false,
    "ID": 36166,
    "UUID": "14614B9A-F19C-4CD3-91B7-2683EDCF90F8",
    "DataProviderID": 26,
    "DataProvidersReference": "37441",
    "OperatorID": 157,
    "OperatorsReference": "NewMotion ICUCOMPACT000879",
    "UsageCost": "0.00 jaarabonnement",
    "AddressInfo": {
        "ID": 36512,
        "Title": "Heinrich Bertéstraat 29",
        "AddressLine1": "Heinrich Bertéstraat 29",
        "Town": "Utrecht",
        "Postcode": "3543 JM",
        "CountryID": 159,
        "Latitude": 52.1065330505371,
        "Longitude": 5.03428411483765,
        "ContactTelephone1": "088 0109500",
        "RelatedURL": "http://thenewmotion.nl/",
        "DistanceUnit": 0
    },
    "Connections": [
        {
            "ID": 39677,
            "ConnectionTypeID": 25,
            "LevelID": 2,
            "PowerKW": 11,
            "CurrentTypeID": 10
        }
    ],
    "NumberOfPoints": 1,
    "StatusTypeID": 50,
    "DateLastStatusUpdate": "2016-06-04T02:50:00Z",
    "DataQualityLevel": 3,
    "DateCreated": "2015-01-09T06:05:00Z",
    "SubmissionStatusTypeID": 100
}