{
    "IsRecentlyVerified": false,
    "ID": 15578,
    "UUID": "900CFEE8-8C5C-4C2B-B514-99991E4AA7C3",
    "DataProviderID": 1,
    "OperatorID": 1,
    "UsageTypeID": 1,
    "AddressInfo": {
        "ID": 15923,
        "Title": "Botania Villa",
        "AddressLine1": "Lam Tei Main St",
        "AddressLine2": "",
        "Town": "Lam Tei",
        "StateOrProvince": "New Territories",
        "Postcode": "",
        "CountryID": 4,
        "Latitude": 22.417936325073242,
        "Longitude": 113.98517608642578,
        "ContactTelephone1": "",
        "ContactTelephone2": "",
        "ContactEmail": "",
        "AccessComments": "",
        "RelatedURL": "",
        "DistanceUnit": 0
    },
    "Connections": [
        {
            "ID": 13895,
            "ConnectionTypeID": 3,
            "Quantity": 1
        }
    ],
    "NumberOfPoints": 1,
    "DateLastConfirmed": "2011-05-21T00:00:00Z",
    "StatusTypeID": 50,
    "DateLastStatusUpdate": "2013-01-11T21:07:00Z",
    "DateCreated": "2013-01-11T21:53:00Z",
    "SubmissionStatusTypeID": 200
}