{
    "IsRecentlyVerified": false,
    "ID": 168017,
    "UUID": "DD616D24-4B99-46A9-88BA-8BC897EA903A",
    "DataProviderID": 1,
    "OperatorID": 1,
    "UsageTypeID": 4,
    "AddressInfo": {
        "ID": 168376,
        "Title": "Levdeo Charging Station ",
        "AddressLine1": "Street 334",
        "Town": "Sangkat Boeng Keng Kang Ti Muoy",
        "StateOrProvince": "Phnom Penh",
        "Postcode": "120102",
        "CountryID": 42,
        "Latitude": 11.550318156651002,
        "Longitude": 104.92686248942982,
        "DistanceUnit": 0
    },
    "Connections": [
        {
            "ID": 255080,
            "ConnectionTypeID": 0,
            "StatusTypeID": 50,
            "Quantity": 1
        }
    ],
    "NumberOfPoints": 1,
    "StatusTypeID": 50,
    "DateLastStatusUpdate": "2021-10-24T23:19:00Z",
    "DataQualityLevel": 1,
    "DateCreated": "2020-09-19T03:34:00Z",
    "SubmissionStatusTypeID": 200
}