{
    "IsRecentlyVerified": false,
    "ID": 186148,
    "UUID": "0DFB87BF-66FE-42AE-8FDC-C5C33F26A3D0",
    "DataProviderID": 29,
    "DataProvidersReference": "3927",
    "AddressInfo": {
        "ID": 186507,
        "Title": "Erich-Mühsam-Str. 2",
        "AddressLine1": "Erich-Mühsam-Str. 2",
        "Town": "Reichenbach im Vogtland",
        "Postcode": "08468",
        "CountryID": 87,
        "Latitude": 50.633325,
        "Longitude": 12.315819,
        "DistanceUnit": 0
    },
    "Connections": [
        {
            "ID": 297968,
            "ConnectionTypeID": 25,
            "StatusTypeID": 50,
            "LevelID": 2,
            "PowerKW": 22,
            "CurrentTypeID": 20
        },
        {
            "ID": 297969,
            "ConnectionTypeID": 25,
            "StatusTypeID": 50,
            "LevelID": 2,
            "PowerKW": 22,
            "CurrentTypeID": 20
        }
    ],
    "StatusTypeID": 50,
    "DateLastStatusUpdate": "2021-07-12T02:45:00Z",
    "MetadataValues": [
        {
            "ID": 18390,
            "MetadataFieldID": 4,
            "ItemValue": "Data from the German chargepoint registry provided by Bundesnetzagentur.de under the CC-BY 4.0 license"
        }
    ],
    "DataQualityLevel": 3,
    "DateCreated": "2021-07-12T02:45:00Z",
    "SubmissionStatusTypeID": 100
}