{
    "IsRecentlyVerified": false,
    "ID": 4473,
    "UUID": "341BCDB0-C56E-4328-82A5-E484BA60AC38",
    "DataProviderID": 1,
    "OperatorID": 1,
    "AddressInfo": {
        "ID": 4426,
        "Title": "Clipstone Car Park",
        "AddressLine1": "Clipstone Mews",
        "AddressLine2": "Westminster",
        "Town": "London",
        "Postcode": "W1W 6BB",
        "CountryID": 1,
        "Latitude": 51.521616,
        "Longitude": -0.140827,
        "ContactTelephone1": "",
        "DistanceUnit": 0
    },
    "Connections": [],
    "GeneralComments": "",
    "StatusTypeID": 50,
    "DateLastStatusUpdate": "2011-05-17T17:23:00Z",
    "DateCreated": "2011-05-17T17:23:00Z",
    "SubmissionStatusTypeID": 200
}