{
    "IsRecentlyVerified": false,
    "ID": 97115,
    "UUID": "5CF2CF07-BCDE-4FE3-91C5-9AABF714C55C",
    "DataProviderID": 1,
    "OperatorID": 46,
    "UsageTypeID": 4,
    "AddressInfo": {
        "ID": 97461,
        "Title": "Parkplatz Kirchstraße",
        "AddressLine1": "Kirchstraße 1",
        "Town": "Treffelstein",
        "StateOrProvince": "Tiefenbach (VGem)",
        "Postcode": "93492",
        "CountryID": 87,
        "Latitude": 49.423211493316174,
        "Longitude": 12.615983995770215,
        "AccessComments": "Gegnüber der Kirche auf dem Parkplatz ist eine gelbe Ladesäule.",
        "RelatedURL": "https://www.stwgd.de/",
        "DistanceUnit": 0
    },
    "Connections": [
        {
            "ID": 137879,
            "ConnectionTypeID": 25,
            "StatusTypeID": 50,
            "LevelID": 2,
            "Amps": 32,
            "Voltage": 400,
            "PowerKW": 22,
            "CurrentTypeID": 20,
            "Quantity": 2
        }
    ],
    "NumberOfPoints": 2,
    "StatusTypeID": 50,
    "DateLastStatusUpdate": "2018-01-05T13:37:00Z",
    "DataQualityLevel": 1,
    "DateCreated": "2018-01-05T13:37:00Z",
    "SubmissionStatusTypeID": 200
}