{
    "IsRecentlyVerified": false,
    "ID": 74032,
    "UUID": "8908BC70-2C43-4C6C-A0C4-CCCB461355EF",
    "DataProviderID": 1,
    "OperatorID": 89,
    "OperatorsReference": "CEB-10103",
    "UsageTypeID": 4,
    "UsageCost": "CAD 1.00/hour",
    "AddressInfo": {
        "ID": 74378,
        "Title": "Metro-Boucherville",
        "AddressLine1": "535 rue Samuel-De-Champlain",
        "Town": "Boucherville",
        "StateOrProvince": "QC",
        "Postcode": "J4B 6B6",
        "CountryID": 44,
        "Latitude": 45.6011276245117,
        "Longitude": -73.4444808959961,
        "DistanceUnit": 0
    },
    "Connections": [
        {
            "ID": 106349,
            "ConnectionTypeID": 1,
            "StatusTypeID": 50,
            "LevelID": 2,
            "Amps": 32,
            "Voltage": 230,
            "PowerKW": 7,
            "CurrentTypeID": 10,
            "Quantity": 1
        }
    ],
    "NumberOfPoints": 1,
    "StatusTypeID": 50,
    "DateLastStatusUpdate": "2017-11-09T06:26:00Z",
    "DataQualityLevel": 1,
    "DateCreated": "2016-11-24T00:01:00Z",
    "SubmissionStatusTypeID": 200
}