{
    "IsRecentlyVerified": false,
    "ID": 165976,
    "UUID": "49D2C528-03B9-44DE-BB76-3601D2D05586",
    "DataProviderID": 28,
    "DataProvidersReference": "FR*S33*PMB33*131",
    "OperatorID": 3407,
    "UsageTypeID": 5,
    "AddressInfo": {
        "ID": 166335,
        "Title": "SAINT-ANDRE-DE-CUBZAC - Impasse Du Pas De Monnac",
        "AddressLine1": "Impasse Du Pas De Monnac 33240 SAINT-ANDRE-DE-CUBZAC",
        "CountryID": 80,
        "Latitude": 44.992445,
        "Longitude": -0.430289,
        "AccessComments": "24h/24 7j/7",
        "DistanceUnit": 0
    },
    "Connections": [
        {
            "ID": 243583,
            "ConnectionTypeID": 25,
            "StatusTypeID": 50,
            "LevelID": 2,
            "PowerKW": 18,
            "CurrentTypeID": 20
        },
        {
            "ID": 243584,
            "ConnectionTypeID": 28,
            "StatusTypeID": 50,
            "LevelID": 2,
            "PowerKW": 18,
            "CurrentTypeID": 10
        },
        {
            "ID": 243585,
            "ConnectionTypeID": 25,
            "StatusTypeID": 50,
            "LevelID": 2,
            "PowerKW": 18,
            "CurrentTypeID": 20
        },
        {
            "ID": 243586,
            "ConnectionTypeID": 28,
            "StatusTypeID": 50,
            "LevelID": 2,
            "PowerKW": 18,
            "CurrentTypeID": 10
        }
    ],
    "GeneralComments": "Recharge par badge et avec une application smartphone",
    "StatusTypeID": 50,
    "DateLastStatusUpdate": "2020-08-27T05:12:00Z",
    "DataQualityLevel": 2,
    "DateCreated": "2020-08-27T05:12:00Z",
    "SubmissionStatusTypeID": 100
}