{
    "IsRecentlyVerified": false,
    "ID": 89516,
    "UUID": "97D0DE8E-2148-4160-B4F5-C2C161C5CA47",
    "DataProviderID": 2,
    "DataProvidersReference": "76238",
    "OperatorID": 5,
    "UsageTypeID": 1,
    "AddressInfo": {
        "ID": 89862,
        "Title": "EVERGY",
        "AddressLine1": "8345 Lenexa Dr @ Henderson Engineers",
        "Town": "Lenexa",
        "StateOrProvince": "KS",
        "Postcode": "66214",
        "CountryID": 2,
        "Latitude": 38.977015,
        "Longitude": -94.709738,
        "ContactTelephone1": "888-758-4389",
        "AccessComments": "24 hours daily",
        "RelatedURL": "http://www.chargepoint.com/",
        "DistanceUnit": 0
    },
    "Connections": [
        {
            "ID": 126926,
            "ConnectionTypeID": 1,
            "LevelID": 2,
            "Amps": 16,
            "Voltage": 230,
            "PowerKW": 3.7,
            "CurrentTypeID": 10,
            "Quantity": 6
        }
    ],
    "DateLastStatusUpdate": "2020-06-26T03:01:00Z",
    "DataQualityLevel": 3,
    "DateCreated": "2017-06-22T08:16:00Z",
    "SubmissionStatusTypeID": 100
}