{
    "IsRecentlyVerified": false,
    "ID": 45216,
    "UUID": "C42F6FED-55A8-4D0D-B002-113AA7D6BE63",
    "DataProviderID": 1,
    "OperatorID": 105,
    "UsageTypeID": 1,
    "UsageCost": "0",
    "AddressInfo": {
        "ID": 45562,
        "Title": "E-Bike Station Stadtverwaltung",
        "AddressLine1": "Poststraße 42",
        "Town": "Bad Berleburg",
        "Postcode": "57319",
        "CountryID": 87,
        "Latitude": 51.0541516945276,
        "Longitude": 8.39280782640175,
        "AccessComments": "Am Hinterausgang der Stadtverwaltung",
        "RelatedURL": "http://www.rwe.com/web/cms/de/494436/e-bikes-on-tour/ladestationen/",
        "DistanceUnit": 0
    },
    "Connections": [
        {
            "ID": 55733,
            "ConnectionTypeID": 28,
            "StatusTypeID": 50,
            "LevelID": 1,
            "Amps": 10,
            "Voltage": 230,
            "PowerKW": 2.3,
            "CurrentTypeID": 10,
            "Quantity": 3
        }
    ],
    "NumberOfPoints": 3,
    "StatusTypeID": 50,
    "DateLastStatusUpdate": "2015-04-28T15:58:00Z",
    "DataQualityLevel": 1,
    "DateCreated": "2015-04-28T08:45:00Z",
    "SubmissionStatusTypeID": 200
}