{
    "IsRecentlyVerified": false,
    "ID": 65506,
    "UUID": "18EA3E72-1081-444E-8282-209AE0525A37",
    "DataProviderID": 26,
    "DataProvidersReference": "84607",
    "OperatorID": 73,
    "OperatorsReference": "EV-Box EVB-P1607295",
    "UsageCost": "0.00 jaarabonnement",
    "AddressInfo": {
        "ID": 65852,
        "Title": "Buitendijkweide 40",
        "AddressLine1": "Buitendijkweide 40",
        "Town": "Hellevoetsluis",
        "Postcode": "3223 NJ",
        "CountryID": 159,
        "Latitude": 51.85076,
        "Longitude": 4.16011,
        "RelatedURL": "http://www.ev-box.nl",
        "DistanceUnit": 0
    },
    "Connections": [
        {
            "ID": 90283,
            "ConnectionTypeID": 25,
            "LevelID": 2,
            "PowerKW": 11,
            "CurrentTypeID": 10
        },
        {
            "ID": 90284,
            "ConnectionTypeID": 25,
            "LevelID": 2,
            "PowerKW": 11,
            "CurrentTypeID": 10
        }
    ],
    "NumberOfPoints": 1,
    "StatusTypeID": 50,
    "DateLastStatusUpdate": "2016-06-04T02:41:00Z",
    "DataQualityLevel": 3,
    "DateCreated": "2016-04-27T09:41:00Z",
    "SubmissionStatusTypeID": 100
}