{
    "IsRecentlyVerified": false,
    "ID": 68609,
    "UUID": "83225AA1-3D8C-41BD-A106-33C4370A2B61",
    "DataProviderID": 1,
    "OperatorID": 2243,
    "UsageTypeID": 4,
    "AddressInfo": {
        "ID": 68955,
        "Title": "Parkplatz Autohaus Schloz Wöllenstein",
        "AddressLine1": "Werner-Seelenbinder-Straße 11b",
        "Town": "Chemnitz",
        "Postcode": "09120",
        "CountryID": 87,
        "Latitude": 50.8058804,
        "Longitude": 12.921256399999947,
        "ContactTelephone1": "+49 371 525-5403",
        "AccessComments": "Rund um die Uhr (24/7) nutzbar. Position: Neben der Autogastankstelle\r\n",
        "RelatedURL": "http://www.eins.de/privatkunden/strom/elektromobilitaet",
        "DistanceUnit": 0
    },
    "Connections": [
        {
            "ID": 96184,
            "ConnectionTypeID": 28,
            "StatusTypeID": 50,
            "LevelID": 2,
            "Voltage": 230,
            "PowerKW": 3.7,
            "CurrentTypeID": 10,
            "Quantity": 0
        },
        {
            "ID": 96185,
            "ConnectionTypeID": 25,
            "StatusTypeID": 50,
            "LevelID": 2,
            "PowerKW": 22,
            "CurrentTypeID": 20,
            "Quantity": 2
        },
        {
            "ID": 96186,
            "ConnectionTypeID": 16,
            "StatusTypeID": 50,
            "LevelID": 2,
            "Amps": 16,
            "Voltage": 230,
            "PowerKW": 3.7,
            "CurrentTypeID": 10,
            "Quantity": 0
        },
        {
            "ID": 96187,
            "ConnectionTypeID": 17,
            "StatusTypeID": 50,
            "LevelID": 2,
            "PowerKW": 11,
            "CurrentTypeID": 20,
            "Quantity": 0
        }
    ],
    "NumberOfPoints": 2,
    "GeneralComments": "\r\n",
    "StatusTypeID": 50,
    "DateLastStatusUpdate": "2016-06-12T16:25:00Z",
    "DataQualityLevel": 1,
    "DateCreated": "2016-06-12T16:25:00Z",
    "SubmissionStatusTypeID": 200
}