{
    "IsRecentlyVerified": true,
    "DateLastVerified": "2021-10-02T14:28:00Z",
    "ID": 189465,
    "UUID": "CE2E4E4F-9B47-484F-9A18-05A1BC7030D1",
    "DataProviderID": 1,
    "OperatorID": 136,
    "UsageTypeID": 4,
    "AddressInfo": {
        "ID": 189824,
        "Title": "Ólis Suðurlandsbraut",
        "AddressLine1": "Ólis",
        "Town": "Reykjavik",
        "StateOrProvince": "",
        "Postcode": "104",
        "CountryID": 105,
        "Latitude": 64.13275154638873,
        "Longitude": -21.867199248433167,
        "RelatedURL": "https://isorka.is",
        "DistanceUnit": 0
    },
    "Connections": [
        {
            "ID": 306441,
            "ConnectionTypeID": 33,
            "StatusTypeID": 50,
            "LevelID": 3,
            "PowerKW": 50,
            "CurrentTypeID": 30,
            "Quantity": 1
        },
        {
            "ID": 306442,
            "ConnectionTypeID": 2,
            "StatusTypeID": 50,
            "LevelID": 3,
            "PowerKW": 50,
            "CurrentTypeID": 30,
            "Quantity": 1
        },
        {
            "ID": 306443,
            "ConnectionTypeID": 1036,
            "StatusTypeID": 50,
            "LevelID": 2,
            "PowerKW": 22,
            "CurrentTypeID": 20,
            "Quantity": 1
        }
    ],
    "NumberOfPoints": 3,
    "StatusTypeID": 50,
    "DateLastStatusUpdate": "2021-10-05T14:38:00Z",
    "DataQualityLevel": 1,
    "DateCreated": "2021-10-02T14:28:00Z",
    "SubmissionStatusTypeID": 200
}