{
    "IsRecentlyVerified": false,
    "ID": 176386,
    "UUID": "53FE729A-4575-48E7-A6B2-9DE35F01B489",
    "DataProviderID": 29,
    "DataProvidersReference": "3598",
    "OperatorID": 69,
    "AddressInfo": {
        "ID": 176745,
        "Title": "Große Str. 44 - 46",
        "AddressLine1": "Große Str. 44 - 46",
        "Town": "Vechta",
        "Postcode": "49377",
        "CountryID": 87,
        "Latitude": 52.728773,
        "Longitude": 8.286153,
        "DistanceUnit": 0
    },
    "Connections": [
        {
            "ID": 274234,
            "ConnectionTypeID": 25,
            "StatusTypeID": 50,
            "LevelID": 2,
            "PowerKW": 22,
            "CurrentTypeID": 20
        },
        {
            "ID": 274235,
            "ConnectionTypeID": 25,
            "StatusTypeID": 50,
            "LevelID": 2,
            "PowerKW": 22,
            "CurrentTypeID": 20
        }
    ],
    "StatusTypeID": 0,
    "DateLastStatusUpdate": "2021-07-12T02:50:00Z",
    "MetadataValues": [
        {
            "ID": 8681,
            "MetadataFieldID": 4,
            "ItemValue": "Data from the German chargepoint registry provided by Bundesnetzagentur.de under the CC-BY 4.0 license"
        }
    ],
    "DataQualityLevel": 3,
    "DateCreated": "2021-07-08T09:48:00Z",
    "SubmissionStatusTypeID": 100
}