{
    "IsRecentlyVerified": false,
    "ID": 55093,
    "UUID": "7BBFA997-2A9D-4D70-A116-5884E10FD38D",
    "DataProviderID": 1,
    "OperatorID": 80,
    "UsageTypeID": 4,
    "UsageCost": "0,40 €/kW",
    "AddressInfo": {
        "ID": 55439,
        "Title": "Eneldrive Prosecco",
        "AddressLine1": "Via San Nazario, 5",
        "Town": "Trieste",
        "StateOrProvince": "TS",
        "Postcode": "34151",
        "CountryID": 112,
        "Latitude": 45.7073585849374,
        "Longitude": 13.733948453315,
        "RelatedURL": "http://eneldrive.it",
        "DistanceUnit": 0
    },
    "Connections": [
        {
            "ID": 69647,
            "ConnectionTypeID": 25,
            "StatusTypeID": 50,
            "LevelID": 2,
            "Amps": 32,
            "Voltage": 400,
            "PowerKW": 22,
            "CurrentTypeID": 20,
            "Quantity": 1
        },
        {
            "ID": 69648,
            "ConnectionTypeID": 36,
            "StatusTypeID": 50,
            "LevelID": 2,
            "Amps": 13,
            "Voltage": 240,
            "PowerKW": 3,
            "CurrentTypeID": 10,
            "Quantity": 1
        }
    ],
    "NumberOfPoints": 1,
    "StatusTypeID": 50,
    "DateLastStatusUpdate": "2016-01-28T14:31:00Z",
    "DataQualityLevel": 1,
    "DateCreated": "2015-10-14T15:53:00Z",
    "SubmissionStatusTypeID": 200
}