{
    "IsRecentlyVerified": false,
    "ID": 32069,
    "UUID": "FF13E541-7911-494B-B300-A3A347505AF0",
    "DataProviderID": 1,
    "OperatorID": 105,
    "OperatorsReference": "Essent EM-DE-07231134-01-00001",
    "UsageTypeID": 4,
    "AddressInfo": {
        "ID": 32415,
        "Title": "Schlossstraße 5",
        "AddressLine1": "Schlossstraße 5",
        "Town": "Wittlich",
        "Postcode": "54516",
        "CountryID": 87,
        "Latitude": 49.98505,
        "Longitude": 6.890995,
        "DistanceUnit": 0
    },
    "Connections": [
        {
            "ID": 35580,
            "ConnectionTypeID": 25,
            "LevelID": 2,
            "PowerKW": 11
        },
        {
            "ID": 46176,
            "ConnectionTypeID": 25,
            "LevelID": 2,
            "PowerKW": 11
        }
    ],
    "NumberOfPoints": 1,
    "StatusTypeID": 50,
    "DateLastStatusUpdate": "2015-04-13T21:26:00Z",
    "DataQualityLevel": 3,
    "DateCreated": "2015-01-09T06:03:00Z",
    "SubmissionStatusTypeID": 200
}