{
    "IsRecentlyVerified": false,
    "ID": 186750,
    "UUID": "86751413-62CA-490E-8899-92321E6161EE",
    "DataProviderID": 29,
    "DataProvidersReference": "3310",
    "AddressInfo": {
        "ID": 187109,
        "Title": "Südstraße 3",
        "AddressLine1": "Südstraße 3",
        "Town": "Bad Pyrmont",
        "Postcode": "31812",
        "CountryID": 87,
        "Latitude": 51.9807,
        "Longitude": 9.2576701,
        "DistanceUnit": 0
    },
    "Connections": [
        {
            "ID": 300068,
            "ConnectionTypeID": 25,
            "StatusTypeID": 50,
            "LevelID": 2,
            "PowerKW": 22,
            "CurrentTypeID": 20
        },
        {
            "ID": 300069,
            "ConnectionTypeID": 25,
            "StatusTypeID": 50,
            "LevelID": 2,
            "PowerKW": 22,
            "CurrentTypeID": 20
        }
    ],
    "StatusTypeID": 50,
    "DateLastStatusUpdate": "2021-07-12T02:48:00Z",
    "MetadataValues": [
        {
            "ID": 18991,
            "MetadataFieldID": 4,
            "ItemValue": "Data from the German chargepoint registry provided by Bundesnetzagentur.de under the CC-BY 4.0 license"
        }
    ],
    "DataQualityLevel": 3,
    "DateCreated": "2021-07-12T02:48:00Z",
    "SubmissionStatusTypeID": 100
}