{
    "UserComments": [
        {
            "ID": 22363,
            "ChargePointID": 129858,
            "CommentTypeID": 10,
            "UserName": "ForumElettrico.it",
            "Comment": "Ricarica gratuita gentilmente offerta ai turisti da David e famiglia. Leggi la recensione completa qui > https://www.forumelettrico.it/forum/colonnina-marina-di-loano-sv-lungomare-nazario-sauro-12-t6435.html",
            "RelatedURL": "https://www.forumelettrico.it/forum/colonnina-marina-di-loano-sv-lungomare-nazario-sauro-12-t6435.html",
            "DateCreated": "2020-03-30T12:47:43.157Z",
            "User": {
                "ID": 11749,
                "Username": "ForumElettrico.it"
            },
            "CheckinStatusTypeID": 140,
            "IsActionedByEditor": false
        },
        {
            "ID": 21266,
            "ChargePointID": 129858,
            "CommentTypeID": 10,
            "UserName": "quell_italiano_li",
            "Comment": "https://www.forumelettrico.it/forum/post57178.html#p57178",
            "Rating": 5,
            "DateCreated": "2019-07-30T09:21:03.38Z",
            "User": {
                "ID": 21515,
                "Username": "quell_italiano_li"
            }
        },
        {
            "ID": 21259,
            "ChargePointID": 129858,
            "CommentTypeID": 10,
            "UserName": "quell_italiano_li",
            "Comment": "Talk to David....great person!",
            "Rating": 5,
            "RelatedURL": "http://pp.bukovci.si",
            "DateCreated": "2019-07-29T10:36:14.177Z",
            "User": {
                "ID": 21515,
                "Username": "quell_italiano_li"
            },
            "CheckinStatusTypeID": 10
        }
    ],
    "MediaItems": [
        {
            "ID": 19057,
            "ChargePointID": 129858,
            "ItemURL": "https://s3-ap-southeast-2.amazonaws.com/openchargemap/images/SI/OCM129858/OCM-129858.orig.2019072910363615.jpg",
            "ItemThumbnailURL": "https://s3-ap-southeast-2.amazonaws.com/openchargemap/images/SI/OCM129858/OCM-129858.thmb.2019072910363615.jpg",
            "Comment": "",
            "IsEnabled": true,
            "IsVideo": false,
            "IsFeaturedItem": false,
            "IsExternalResource": false,
            "User": {
                "ID": 21515,
                "Username": "quell_italiano_li"
            },
            "DateCreated": "2019-07-29T10:37:00Z"
        }
    ],
    "IsRecentlyVerified": false,
    "ID": 129858,
    "UUID": "2DE62DFE-0FE9-4712-81C6-CAD0A3A765DF",
    "DataProviderID": 1,
    "OperatorID": 44,
    "UsageTypeID": 1,
    "UsageCost": "free",
    "AddressInfo": {
        "ID": 130204,
        "Title": "Elektro črpalka",
        "AddressLine1": "Kal nad Kanalom 28, 5214 Kal nad Kanalom, Slovenia",
        "Town": "Kal nad Kanalom",
        "StateOrProvince": "Nova Gorica",
        "Postcode": "5214 ",
        "CountryID": 205,
        "Latitude": 46.06521,
        "Longitude": 13.720256,
        "ContactTelephone1": "+386 31 537 551",
        "ContactEmail": "david.ipavec@gmail.com",
        "RelatedURL": "http://pp.bukovci.si",
        "DistanceUnit": 0
    },
    "Connections": [
        {
            "ID": 181826,
            "ConnectionTypeID": 25,
            "StatusTypeID": 50,
            "LevelID": 2,
            "PowerKW": 19,
            "CurrentTypeID": 20,
            "Quantity": 1
        },
        {
            "ID": 181827,
            "ConnectionTypeID": 1041,
            "StatusTypeID": 50,
            "LevelID": 2,
            "PowerKW": 17,
            "CurrentTypeID": 20,
            "Quantity": 1
        },
        {
            "ID": 181828,
            "ConnectionTypeID": 1041,
            "StatusTypeID": 50,
            "LevelID": 2,
            "PowerKW": 11,
            "CurrentTypeID": 20,
            "Quantity": 1
        },
        {
            "ID": 181829,
            "ConnectionTypeID": 28,
            "StatusTypeID": 50,
            "LevelID": 2,
            "PowerKW": 3.7,
            "CurrentTypeID": 10,
            "Quantity": 1
        }
    ],
    "NumberOfPoints": 1,
    "StatusTypeID": 50,
    "DateLastStatusUpdate": "2020-03-30T16:34:00Z",
    "DataQualityLevel": 1,
    "DateCreated": "2019-07-29T10:34:00Z",
    "SubmissionStatusTypeID": 200
}