{
    "IsRecentlyVerified": false,
    "ID": 116232,
    "UUID": "6E88E0CD-D085-4D17-81B5-005297920E97",
    "DataProviderID": 1,
    "DataProvidersReference": "5433",
    "AddressInfo": {
        "ID": 116578,
        "Title": "Lilla Hammrar, Höllviken",
        "AddressLine1": "Falsterbovägen 27",
        "Town": "HÖLLVIKEN",
        "StateOrProvince": "SKÅNE",
        "Postcode": "23651",
        "CountryID": 216,
        "Latitude": 55.42458,
        "Longitude": 12.95998,
        "AccessComments": "",
        "DistanceUnit": 0
    },
    "Connections": [
        {
            "ID": 163330,
            "ConnectionTypeID": 0,
            "Reference": "1",
            "LevelID": 2,
            "Amps": 16,
            "Voltage": 230,
            "PowerKW": 3.7,
            "Comments": "Mode 3"
        },
        {
            "ID": 163331,
            "ConnectionTypeID": 0,
            "Reference": "2",
            "LevelID": 2,
            "Amps": 16,
            "Voltage": 230,
            "PowerKW": 3.7,
            "Comments": "Mode 3"
        },
        {
            "ID": 163332,
            "ConnectionTypeID": 25,
            "Reference": "3",
            "LevelID": 2,
            "Amps": 16,
            "Voltage": 230,
            "PowerKW": 3.7,
            "CurrentTypeID": 10,
            "Comments": "Mode 3"
        },
        {
            "ID": 163333,
            "ConnectionTypeID": 25,
            "Reference": "4",
            "LevelID": 2,
            "Amps": 16,
            "Voltage": 230,
            "PowerKW": 3.7,
            "CurrentTypeID": 10,
            "Comments": "Mode 3"
        }
    ],
    "NumberOfPoints": 2,
    "DateLastStatusUpdate": "2020-05-26T08:21:00Z",
    "DataQualityLevel": 2,
    "DateCreated": "2019-02-11T09:16:00Z",
    "SubmissionStatusTypeID": 100
}