{
    "IsRecentlyVerified": false,
    "ID": 71543,
    "UUID": "53A4A114-372A-41AF-8EB4-79BD7811DC04",
    "DataProviderID": 2,
    "DataProvidersReference": "77065",
    "OperatorID": 5,
    "UsageTypeID": 1,
    "AddressInfo": {
        "ID": 71889,
        "Title": "HY VEE",
        "AddressLine1": "5820 Westown Parkway",
        "Town": "West Des Moines",
        "StateOrProvince": "IA",
        "Postcode": "50266",
        "CountryID": 2,
        "Latitude": 41.593917,
        "Longitude": -93.788136,
        "ContactTelephone1": "888-758-4389",
        "AccessComments": "24 hours daily",
        "RelatedURL": "http://www.chargepoint.com/",
        "DistanceUnit": 0
    },
    "Connections": [
        {
            "ID": 102367,
            "ConnectionTypeID": 1,
            "LevelID": 2,
            "Amps": 16,
            "Voltage": 230,
            "PowerKW": 3.7,
            "CurrentTypeID": 10,
            "Quantity": 4
        }
    ],
    "DateLastStatusUpdate": "2020-06-26T03:04:00Z",
    "DataQualityLevel": 3,
    "DateCreated": "2016-09-02T10:15:00Z",
    "SubmissionStatusTypeID": 100
}