{
    "IsRecentlyVerified": false,
    "ID": 176899,
    "UUID": "89524C0D-CCBE-490E-AB6A-301F4EBFBA77",
    "DataProviderID": 29,
    "DataProvidersReference": "354",
    "OperatorID": 45,
    "AddressInfo": {
        "ID": 177258,
        "Title": "Heckerstraße 4",
        "AddressLine1": "Heckerstraße 4",
        "Town": "Freiburg",
        "Postcode": "79114",
        "CountryID": 87,
        "Latitude": 47.989111,
        "Longitude": 7.800167,
        "DistanceUnit": 0
    },
    "Connections": [
        {
            "ID": 275378,
            "ConnectionTypeID": 33,
            "StatusTypeID": 50,
            "LevelID": 3,
            "PowerKW": 63,
            "CurrentTypeID": 30
        },
        {
            "ID": 275379,
            "ConnectionTypeID": 33,
            "StatusTypeID": 50,
            "LevelID": 3,
            "PowerKW": 63,
            "CurrentTypeID": 30
        },
        {
            "ID": 275380,
            "ConnectionTypeID": 25,
            "StatusTypeID": 50,
            "LevelID": 2,
            "PowerKW": 22,
            "CurrentTypeID": 20
        }
    ],
    "StatusTypeID": 0,
    "DateLastStatusUpdate": "2021-07-09T03:11:00Z",
    "MetadataValues": [
        {
            "ID": 9194,
            "MetadataFieldID": 4,
            "ItemValue": "Data from the German chargepoint registry provided by Bundesnetzagentur.de under the CC-BY 4.0 license"
        }
    ],
    "DataQualityLevel": 3,
    "DateCreated": "2021-07-08T09:48:00Z",
    "SubmissionStatusTypeID": 100
}