{
    "IsRecentlyVerified": false,
    "ID": 174415,
    "UUID": "2EFC54FD-7D24-4005-9102-6BC8E1F14287",
    "DataProviderID": 1,
    "OperatorID": 3,
    "UsageTypeID": 4,
    "UsageCost": "Free",
    "AddressInfo": {
        "ID": 174774,
        "Title": "Grayburn Lane Car Park",
        "AddressLine1": "Grayburn Lane",
        "Town": "Beverley",
        "StateOrProvince": "England",
        "Postcode": "HU17 8JY",
        "CountryID": 1,
        "Latitude": 53.84096958530694,
        "Longitude": -0.4327147834220568,
        "RelatedURL": "http://www.pod-point.com",
        "DistanceUnit": 0
    },
    "Connections": [
        {
            "ID": 270168,
            "ConnectionTypeID": 25,
            "StatusTypeID": 50,
            "LevelID": 2,
            "Amps": 32,
            "Voltage": 230,
            "PowerKW": 7,
            "CurrentTypeID": 10,
            "Quantity": 2
        }
    ],
    "NumberOfPoints": 1,
    "StatusTypeID": 50,
    "DateLastStatusUpdate": "2021-03-28T12:13:00Z",
    "DataQualityLevel": 1,
    "DateCreated": "2021-03-28T12:13:00Z",
    "SubmissionStatusTypeID": 200
}