{
    "IsRecentlyVerified": false,
    "ID": 111992,
    "UUID": "81F961C7-9C37-4F50-996E-ED181791F48A",
    "DataProviderID": 2,
    "DataProvidersReference": "84987",
    "UsageTypeID": 1,
    "AddressInfo": {
        "ID": 112338,
        "Title": "TD Canada Trust",
        "AddressLine1": "1933 Willingdon Ave",
        "Town": "Burnaby",
        "StateOrProvince": "BC",
        "Postcode": "V5C 5J3",
        "CountryID": 44,
        "Latitude": 49.267184,
        "Longitude": -123.003816,
        "ContactTelephone1": "604-654-3939",
        "AccessComments": "24 hours daily",
        "RelatedURL": "",
        "DistanceUnit": 0
    },
    "Connections": [
        {
            "ID": 157518,
            "ConnectionTypeID": 1,
            "LevelID": 2,
            "Amps": 16,
            "Voltage": 230,
            "PowerKW": 3,
            "CurrentTypeID": 10,
            "Quantity": 1
        }
    ],
    "DateLastStatusUpdate": "2019-12-24T09:25:00Z",
    "DataQualityLevel": 3,
    "DateCreated": "2018-10-18T23:37:00Z",
    "SubmissionStatusTypeID": 100
}