{
    "IsRecentlyVerified": false,
    "ID": 97460,
    "UUID": "4E1D8490-2F71-471A-9E9F-841D903ACE84",
    "DataProviderID": 1,
    "OperatorID": 23,
    "OperatorsReference": "38648",
    "UsageTypeID": 4,
    "AddressInfo": {
        "ID": 97806,
        "Title": "Hotel Restaurant Boehlerstern",
        "AddressLine1": "Friedrich Boehlerstrasse 13",
        "Town": "Kapfenberg",
        "Postcode": "8605",
        "CountryID": 19,
        "Latitude": 47.443155,
        "Longitude": 15.287829,
        "ContactTelephone1": "+43 3862 206375",
        "DistanceUnit": 0
    },
    "Connections": [
        {
            "ID": 138367,
            "ConnectionTypeID": 30,
            "StatusTypeID": 50,
            "LevelID": 2,
            "Amps": 32,
            "Voltage": 400,
            "PowerKW": 22,
            "CurrentTypeID": 20,
            "Quantity": 2
        }
    ],
    "NumberOfPoints": 2,
    "GeneralComments": "2 Tesla Connectors, up to 22kW.Available for customers. Please see front desk.",
    "StatusTypeID": 50,
    "DateLastStatusUpdate": "2018-10-03T18:54:00Z",
    "DataQualityLevel": 1,
    "DateCreated": "2018-01-21T15:29:00Z",
    "SubmissionStatusTypeID": 200
}