{
    "IsRecentlyVerified": false,
    "ID": 137919,
    "UUID": "85A2A5F0-254E-4BB5-920E-691203488A91",
    "DataProviderID": 2,
    "DataProvidersReference": "148646",
    "OperatorID": 39,
    "UsageTypeID": 1,
    "AddressInfo": {
        "ID": 138268,
        "Title": "Broadstone 5151",
        "AddressLine1": "5151 Bent Tree Forest Drive",
        "Town": "Dallas",
        "StateOrProvince": "TX",
        "Postcode": "75248",
        "CountryID": 2,
        "Latitude": 32.9651005,
        "Longitude": -96.8199773,
        "ContactTelephone1": "800-663-5633",
        "AccessComments": "MO: Not Specified; TU: Not Specified; WE: Not Specified; TH: Not Specified; FR: Not Specified; SA: Not Specified; SU: Not Specified",
        "RelatedURL": "http://www.semacharge.com/",
        "DistanceUnit": 0
    },
    "Connections": [
        {
            "ID": 192945,
            "ConnectionTypeID": 1,
            "LevelID": 2,
            "Amps": 16,
            "Voltage": 230,
            "PowerKW": 3,
            "CurrentTypeID": 10,
            "Quantity": 2
        }
    ],
    "StatusTypeID": 50,
    "DateLastStatusUpdate": "2019-12-24T09:06:00Z",
    "DataQualityLevel": 3,
    "DateCreated": "2019-12-24T09:06:00Z",
    "SubmissionStatusTypeID": 100
}