{
    "IsRecentlyVerified": false,
    "ID": 79751,
    "UUID": "F266AFFE-0082-4D41-A266-F90B3317C04B",
    "DataProviderID": 1,
    "OperatorID": 23,
    "OperatorsReference": "9259",
    "UsageTypeID": 4,
    "UsageCost": "Free",
    "AddressInfo": {
        "ID": 80097,
        "Title": "Holiday Inn & Suites, Osoyoos",
        "AddressLine1": "7906 Main St",
        "Town": "Osoyoos",
        "StateOrProvince": "BC",
        "Postcode": "V0H 1V0",
        "CountryID": 44,
        "Latitude": 49.028558,
        "Longitude": -119.457127,
        "ContactTelephone1": "(250) 495-7223",
        "DistanceUnit": 0
    },
    "Connections": [
        {
            "ID": 114397,
            "ConnectionTypeID": 30,
            "StatusTypeID": 50,
            "LevelID": 2,
            "PowerKW": 16,
            "CurrentTypeID": 20,
            "Quantity": 1
        }
    ],
    "NumberOfPoints": 1,
    "GeneralComments": "1 Tesla Connector, up to 16kW.Available to the public. Please see front desk.",
    "StatusTypeID": 50,
    "DateLastStatusUpdate": "2017-01-30T13:05:00Z",
    "DataQualityLevel": 1,
    "DateCreated": "2017-01-30T13:05:00Z",
    "SubmissionStatusTypeID": 200
}