{
    "IsRecentlyVerified": false,
    "ID": 37817,
    "UUID": "AB24F461-6640-44A0-9AA4-BACF0836608F",
    "DataProviderID": 1,
    "OperatorID": 105,
    "OperatorsReference": "Essent EM-DE-05770008-01-00002",
    "UsageTypeID": 4,
    "AddressInfo": {
        "ID": 38163,
        "Title": "Rathaus",
        "AddressLine1": "Wilhelm-Kern-Platz 1",
        "Town": "Espelkamp",
        "Postcode": "32339",
        "CountryID": 87,
        "Latitude": 52.37655744543701,
        "Longitude": 8.627623144844048,
        "AccessComments": "Anfahrt: von der Breslauer Str. durch die enge Einfahrt oder Görlitzer Str auf den Parkplatz einfahren. Mitten auf dem Parkplatz neben einem WC.",
        "DistanceUnit": 0
    },
    "Connections": [
        {
            "ID": 41328,
            "ConnectionTypeID": 25,
            "LevelID": 2,
            "PowerKW": 11
        },
        {
            "ID": 49301,
            "ConnectionTypeID": 25,
            "LevelID": 2,
            "PowerKW": 11
        }
    ],
    "NumberOfPoints": 1,
    "StatusTypeID": 50,
    "DateLastStatusUpdate": "2016-01-12T10:59:00Z",
    "DataQualityLevel": 3,
    "DateCreated": "2015-01-09T06:07:00Z",
    "SubmissionStatusTypeID": 200
}