{
    "IsRecentlyVerified": false,
    "ID": 27524,
    "UUID": "BF39FD62-7A74-4BEA-AE86-38236AAA9293",
    "DataProviderID": 2,
    "DataProvidersReference": "52298",
    "OperatorID": 5,
    "UsageTypeID": 1,
    "AddressInfo": {
        "ID": 27870,
        "Title": "ORACLE RWSHORE",
        "AddressLine1": "520 Oracle Pkwy",
        "Town": "Redwood City",
        "StateOrProvince": "CA",
        "Postcode": "94065",
        "CountryID": 2,
        "Latitude": 37.530788,
        "Longitude": -122.261332,
        "ContactTelephone1": "888-758-4389",
        "AccessComments": "24 hours daily",
        "RelatedURL": "http://www.chargepoint.com/",
        "DistanceUnit": 0
    },
    "Connections": [
        {
            "ID": 30172,
            "ConnectionTypeID": 1,
            "LevelID": 2,
            "Amps": 16,
            "Voltage": 230,
            "PowerKW": 3,
            "CurrentTypeID": 10,
            "Quantity": 4
        }
    ],
    "DateLastStatusUpdate": "2019-04-06T04:02:00Z",
    "DataQualityLevel": 3,
    "DateCreated": "2014-11-28T03:38:00Z",
    "SubmissionStatusTypeID": 100
}