{
    "IsRecentlyVerified": false,
    "ID": 31701,
    "UUID": "09E3A4E1-BDBB-4ECD-A1F6-C48BC188DBE0",
    "DataProviderID": 1,
    "OperatorID": 105,
    "OperatorsReference": "Essent EM-DE-09775118-01-00001",
    "UsageTypeID": 4,
    "AddressInfo": {
        "ID": 32047,
        "Title": "Untere Straße 9",
        "AddressLine1": "Untere Straße 9",
        "Town": "Buch",
        "Postcode": "89290",
        "CountryID": 87,
        "Latitude": 48.223334,
        "Longitude": 10.178266,
        "DistanceUnit": 0
    },
    "Connections": [
        {
            "ID": 35212,
            "ConnectionTypeID": 25,
            "LevelID": 2,
            "PowerKW": 11
        },
        {
            "ID": 46068,
            "ConnectionTypeID": 25,
            "LevelID": 2,
            "PowerKW": 11
        }
    ],
    "NumberOfPoints": 1,
    "StatusTypeID": 50,
    "DateLastStatusUpdate": "2015-04-13T21:44:00Z",
    "DataQualityLevel": 3,
    "DateCreated": "2015-01-09T06:03:00Z",
    "SubmissionStatusTypeID": 200
}