{
    "IsRecentlyVerified": false,
    "ID": 115421,
    "UUID": "8C3E6ADA-7748-461D-84BE-318710921C42",
    "DataProviderID": 2,
    "DataProvidersReference": "113053",
    "OperatorID": 23,
    "UsageTypeID": 2,
    "AddressInfo": {
        "ID": 115767,
        "Title": "Airbnb - Quinta - Tesla Destination",
        "AddressLine1": "81375 Golf View Dr",
        "Town": "La Quinta",
        "StateOrProvince": "CA",
        "Postcode": "92253",
        "CountryID": 2,
        "Latitude": 33.639797,
        "Longitude": -116.243698,
        "ContactTelephone1": "",
        "AccessComments": "Available for Airbnb patrons only; for Tesla use only",
        "RelatedURL": "https://www.tesla.com/destination-charging",
        "DistanceUnit": 0
    },
    "Connections": [
        {
            "ID": 162430,
            "ConnectionTypeID": 0,
            "LevelID": 2,
            "Amps": 16,
            "Voltage": 230,
            "PowerKW": 3,
            "CurrentTypeID": 10,
            "Quantity": 1
        }
    ],
    "DateLastStatusUpdate": "2019-04-06T04:01:00Z",
    "DataQualityLevel": 3,
    "DateCreated": "2019-02-11T07:13:00Z",
    "SubmissionStatusTypeID": 100
}