{
    "IsRecentlyVerified": false,
    "ID": 178903,
    "UUID": "D73ED6B7-13AC-4E49-8E4A-B12668A3304A",
    "DataProviderID": 29,
    "DataProvidersReference": "18637",
    "OperatorID": 86,
    "AddressInfo": {
        "ID": 179262,
        "Title": "Sebastiansgraben ggü. Hs. 1",
        "AddressLine1": "Sebastiansgraben ggü. Hs. 1",
        "Town": "Ellwangen",
        "Postcode": "73479",
        "CountryID": 87,
        "Latitude": 48.96266,
        "Longitude": 10.130665,
        "DistanceUnit": 0
    },
    "Connections": [
        {
            "ID": 279936,
            "ConnectionTypeID": 25,
            "StatusTypeID": 50,
            "LevelID": 2,
            "PowerKW": 22,
            "CurrentTypeID": 20
        },
        {
            "ID": 279937,
            "ConnectionTypeID": 25,
            "StatusTypeID": 50,
            "LevelID": 2,
            "PowerKW": 22,
            "CurrentTypeID": 20
        }
    ],
    "StatusTypeID": 50,
    "DateLastStatusUpdate": "2021-07-09T03:14:00Z",
    "MetadataValues": [
        {
            "ID": 11197,
            "MetadataFieldID": 4,
            "ItemValue": "Data from the German chargepoint registry provided by Bundesnetzagentur.de under the CC-BY 4.0 license"
        }
    ],
    "DataQualityLevel": 3,
    "DateCreated": "2021-07-08T09:59:00Z",
    "SubmissionStatusTypeID": 100
}