{
    "IsRecentlyVerified": false,
    "ID": 165779,
    "UUID": "EC13FEEA-2806-4C4A-A5B8-53ED83A6C7BF",
    "DataProviderID": 28,
    "DataProvidersReference": "FR*S33*PMB33*58",
    "OperatorID": 3407,
    "UsageTypeID": 5,
    "AddressInfo": {
        "ID": 166138,
        "Title": "LA TESTE-DE-BUCH - Rue Du Général Gallieni - Parking La Poste",
        "AddressLine1": "Rue Du Général Gallieni - Parking La Poste 33260 LA TESTE-DE-BUCH",
        "CountryID": 80,
        "Latitude": 44.63166634,
        "Longitude": -1.148235574,
        "AccessComments": "24h/24 7j/7",
        "DistanceUnit": 0
    },
    "Connections": [
        {
            "ID": 242462,
            "ConnectionTypeID": 25,
            "StatusTypeID": 50,
            "LevelID": 2,
            "PowerKW": 18,
            "CurrentTypeID": 20
        },
        {
            "ID": 242463,
            "ConnectionTypeID": 28,
            "StatusTypeID": 50,
            "LevelID": 2,
            "PowerKW": 18,
            "CurrentTypeID": 10
        },
        {
            "ID": 242464,
            "ConnectionTypeID": 25,
            "StatusTypeID": 50,
            "LevelID": 2,
            "PowerKW": 18,
            "CurrentTypeID": 20
        },
        {
            "ID": 242465,
            "ConnectionTypeID": 28,
            "StatusTypeID": 50,
            "LevelID": 2,
            "PowerKW": 18,
            "CurrentTypeID": 10
        }
    ],
    "GeneralComments": "Recharge par badge et avec une application smartphone",
    "StatusTypeID": 50,
    "DateLastStatusUpdate": "2020-08-27T05:11:00Z",
    "DataQualityLevel": 2,
    "DateCreated": "2020-08-27T05:11:00Z",
    "SubmissionStatusTypeID": 100
}