{
    "IsRecentlyVerified": false,
    "ID": 93116,
    "UUID": "7FCD5E95-7FDE-4C76-9C88-182F989A9921",
    "DataProviderID": 1,
    "OperatorID": 23,
    "OperatorsReference": "32065",
    "UsageTypeID": 4,
    "AddressInfo": {
        "ID": 93462,
        "Title": "Hideaway Chalet Killington Ski",
        "AddressLine1": "998 Killington RD",
        "Town": "Killington",
        "StateOrProvince": "VT",
        "Postcode": "05751",
        "CountryID": 2,
        "Latitude": 43.657482,
        "Longitude": -72.790207,
        "ContactTelephone1": "(802) 277-0110",
        "DistanceUnit": 0
    },
    "Connections": [
        {
            "ID": 131905,
            "ConnectionTypeID": 30,
            "StatusTypeID": 50,
            "LevelID": 2,
            "PowerKW": 8,
            "CurrentTypeID": 10,
            "Quantity": 1
        }
    ],
    "NumberOfPoints": 1,
    "GeneralComments": "1 Tesla Connector, up to 8kW.Available for customers. Please call ahead.",
    "StatusTypeID": 50,
    "DateLastStatusUpdate": "2017-09-19T05:37:00Z",
    "DataQualityLevel": 1,
    "DateCreated": "2017-09-19T05:37:00Z",
    "SubmissionStatusTypeID": 200
}