{
    "IsRecentlyVerified": false,
    "ID": 84090,
    "UUID": "483ABA08-09FF-4019-B40A-C74CE8380C12",
    "DataProviderID": 1,
    "OperatorID": 23,
    "OperatorsReference": "24603",
    "UsageTypeID": 6,
    "AddressInfo": {
        "ID": 84436,
        "Title": "Best Western Plus Hotel Alize Mouscron",
        "AddressLine1": "Passage St-Pierre 34",
        "Town": "Mouscron",
        "Postcode": "7700",
        "CountryID": 26,
        "Latitude": 50.743155,
        "Longitude": 3.21526,
        "ContactTelephone1": "+32 56 56 15 61",
        "DistanceUnit": 0
    },
    "Connections": [
        {
            "ID": 119491,
            "ConnectionTypeID": 30,
            "StatusTypeID": 50,
            "LevelID": 2,
            "Amps": 32,
            "Voltage": 400,
            "PowerKW": 22,
            "CurrentTypeID": 20,
            "Quantity": 2
        }
    ],
    "NumberOfPoints": 2,
    "GeneralComments": "2 Tesla Connectors, up to 22kW.Available for patrons only. Please see front desk.",
    "StatusTypeID": 50,
    "DateLastStatusUpdate": "2018-10-03T20:01:00Z",
    "DataQualityLevel": 1,
    "DateCreated": "2017-02-16T15:09:00Z",
    "SubmissionStatusTypeID": 200
}