{
    "IsRecentlyVerified": false,
    "ID": 70147,
    "UUID": "03945BC6-CF55-46EE-827E-AB4EFB3997EB",
    "DataProviderID": 1,
    "OperatorID": 1,
    "UsageTypeID": 5,
    "AddressInfo": {
        "ID": 70493,
        "Title": "Borella-Kottawa Road",
        "AddressLine1": "Borella-Kottawa Road",
        "AddressLine2": "Madiwela WP",
        "StateOrProvince": "Western Province",
        "Postcode": "10230",
        "CountryID": 211,
        "Latitude": 6.863983589856287,
        "Longitude": 79.94246098806185,
        "ContactTelephone1": "0768272418",
        "ContactTelephone2": "0773403037",
        "AccessComments": "GOEV Charge Station Solutions Specialist.",
        "RelatedURL": "http://goev.jlanka.com/",
        "DistanceUnit": 0
    },
    "Connections": [
        {
            "ID": 100079,
            "ConnectionTypeID": 2,
            "StatusTypeID": 50,
            "LevelID": 2,
            "Amps": 40,
            "Voltage": 230,
            "PowerKW": 23,
            "CurrentTypeID": 20
        },
        {
            "ID": 117216,
            "ConnectionTypeID": 1,
            "StatusTypeID": 50,
            "LevelID": 1,
            "Amps": 40,
            "Voltage": -230,
            "PowerKW": 10,
            "CurrentTypeID": 10,
            "Quantity": 1
        }
    ],
    "NumberOfPoints": 2,
    "GeneralComments": "customized DC & Level 2 top up charging solutions ",
    "StatusTypeID": 50,
    "DateLastStatusUpdate": "2017-02-04T16:59:00Z",
    "DataQualityLevel": 1,
    "DateCreated": "2016-07-11T02:32:00Z",
    "SubmissionStatusTypeID": 200
}