{
    "IsRecentlyVerified": false,
    "ID": 99683,
    "UUID": "6F096BF5-BC51-47DD-A7EA-E94E9156F5BF",
    "DataProviderID": 1,
    "OperatorID": 23,
    "OperatorsReference": "40209",
    "UsageTypeID": 4,
    "AddressInfo": {
        "ID": 100029,
        "Title": "Grand Hyatt Dubai",
        "AddressLine1": "Sheikh Rashid Road",
        "Town": "Dubai",
        "Postcode": "P.O.Box 7978",
        "CountryID": 235,
        "Latitude": 25.228448,
        "Longitude": 55.327276,
        "ContactTelephone1": "+971 4 317 1234",
        "DistanceUnit": 0
    },
    "Connections": [
        {
            "ID": 140828,
            "ConnectionTypeID": 1036,
            "StatusTypeID": 50,
            "LevelID": 2,
            "Amps": 32,
            "Voltage": 230,
            "PowerKW": 7,
            "CurrentTypeID": 10,
            "Quantity": 1
        }
    ],
    "NumberOfPoints": 1,
    "GeneralComments": "1 Tesla Connector, up to 7kW.Available to the public. Please see valet.",
    "StatusTypeID": 50,
    "DateLastStatusUpdate": "2018-02-01T07:10:00Z",
    "DataQualityLevel": 1,
    "DateCreated": "2018-02-01T07:10:00Z",
    "SubmissionStatusTypeID": 200
}