{
    "IsRecentlyVerified": false,
    "ID": 62375,
    "UUID": "1352D7F7-213B-4436-8D36-FE09CFDEAA7B",
    "DataProviderID": 1,
    "OperatorID": 23,
    "OperatorsReference": "9863",
    "UsageTypeID": 7,
    "UsageCost": "Free",
    "AddressInfo": {
        "ID": 62721,
        "Title": "The Inn at English Meadows - Tesla",
        "AddressLine1": "141 Port Rd",
        "Town": "Kennebunk",
        "StateOrProvince": "ME",
        "Postcode": "04043",
        "CountryID": 2,
        "Latitude": 43.3618989,
        "Longitude": -70.4873972,
        "ContactTelephone1": "207-272-0698  877-798-3752",
        "AccessComments": "24 hours daily; for guest use only",
        "RelatedURL": "http://www.teslamotors.com/supercharger",
        "DistanceUnit": 0
    },
    "Connections": [
        {
            "ID": 79280,
            "ConnectionTypeID": 30,
            "StatusTypeID": 50,
            "LevelID": 2,
            "Amps": 16,
            "Voltage": 230,
            "PowerKW": 16,
            "CurrentTypeID": 10,
            "Quantity": 1
        }
    ],
    "NumberOfPoints": 1,
    "StatusTypeID": 50,
    "DateLastStatusUpdate": "2017-01-26T19:41:00Z",
    "DataQualityLevel": 3,
    "DateCreated": "2016-03-03T11:39:00Z",
    "SubmissionStatusTypeID": 100
}