{
    "IsRecentlyVerified": false,
    "ID": 180895,
    "UUID": "5ACD5F81-B5E7-4930-86E5-328A54DF72EE",
    "DataProviderID": 29,
    "DataProvidersReference": "11494",
    "OperatorID": 86,
    "AddressInfo": {
        "ID": 181254,
        "Title": "Ohrdrufer Str. 34 - 36",
        "AddressLine1": "Ohrdrufer Str. 34 - 36",
        "Town": "Waltershausen",
        "Postcode": "99880",
        "CountryID": 87,
        "Latitude": 50.893901,
        "Longitude": 10.56876,
        "DistanceUnit": 0
    },
    "Connections": [
        {
            "ID": 284553,
            "ConnectionTypeID": 1036,
            "StatusTypeID": 50,
            "LevelID": 3,
            "PowerKW": 43,
            "CurrentTypeID": 20
        },
        {
            "ID": 284554,
            "ConnectionTypeID": 33,
            "StatusTypeID": 50,
            "LevelID": 3,
            "PowerKW": 50,
            "CurrentTypeID": 30
        },
        {
            "ID": 298398,
            "ConnectionTypeID": 2,
            "StatusTypeID": 50,
            "LevelID": 3,
            "PowerKW": 50,
            "CurrentTypeID": 30
        }
    ],
    "StatusTypeID": 50,
    "DateLastStatusUpdate": "2021-07-12T02:45:00Z",
    "MetadataValues": [
        {
            "ID": 13189,
            "MetadataFieldID": 4,
            "ItemValue": "Data from the German chargepoint registry provided by Bundesnetzagentur.de under the CC-BY 4.0 license"
        }
    ],
    "DataQualityLevel": 3,
    "DateCreated": "2021-07-08T10:01:00Z",
    "SubmissionStatusTypeID": 100
}