{
    "IsRecentlyVerified": false,
    "ID": 66336,
    "UUID": "1A24784C-0C55-4E1F-8B19-40E712E08822",
    "DataProviderID": 1,
    "OperatorID": 86,
    "UsageTypeID": 1,
    "AddressInfo": {
        "ID": 66682,
        "Title": "EnBW Regionalzentrum",
        "AddressLine1": "Eltastraße 1",
        "Town": "Tuttlingen",
        "StateOrProvince": "Verwaltungsgemeinschaft Tuttlingen",
        "Postcode": "78532",
        "CountryID": 87,
        "Latitude": 47.98916999999999,
        "Longitude": 8.796370000000024,
        "AccessComments": "24/7 nutzbar mit beliebiger RFID Karte. Kostenloses WLAN. 2 Ladeplätze.",
        "RelatedURL": "http://smight.com/",
        "DistanceUnit": 0
    },
    "Connections": [
        {
            "ID": 91708,
            "ConnectionTypeID": 25,
            "StatusTypeID": 50,
            "LevelID": 2,
            "Amps": 32,
            "Voltage": 400,
            "PowerKW": 22,
            "CurrentTypeID": 20,
            "Quantity": 2
        }
    ],
    "NumberOfPoints": 2,
    "StatusTypeID": 50,
    "DateLastStatusUpdate": "2016-05-18T14:02:00Z",
    "DataQualityLevel": 1,
    "DateCreated": "2016-05-18T14:02:00Z",
    "SubmissionStatusTypeID": 200
}