{
    "IsRecentlyVerified": false,
    "ID": 105550,
    "UUID": "3A3340FD-7365-4B6C-8E69-0B24039C249E",
    "DataProviderID": 1,
    "OperatorID": 23,
    "OperatorsReference": "43277",
    "UsageTypeID": 4,
    "UsageCost": "$0.22/min >=60kW; $0.11/min <60kW; other tariffs for older cars",
    "AddressInfo": {
        "ID": 105896,
        "Title": "Claymont, de Supercharger",
        "AddressLine1": "605 Naamans Road",
        "Town": "Claymont",
        "StateOrProvince": "DE",
        "Postcode": "19703",
        "CountryID": 2,
        "Latitude": 39.817478,
        "Longitude": -75.457259,
        "DistanceUnit": 0
    },
    "Connections": [
        {
            "ID": 148732,
            "ConnectionTypeID": 27,
            "StatusTypeID": 50,
            "LevelID": 3,
            "PowerKW": 120,
            "CurrentTypeID": 30,
            "Quantity": 8
        }
    ],
    "NumberOfPoints": 8,
    "GeneralComments": "Charging8 Superchargers, available 24/7, up to 120kW",
    "StatusTypeID": 50,
    "DateLastStatusUpdate": "2018-06-08T05:38:00Z",
    "DataQualityLevel": 1,
    "DateCreated": "2018-06-08T05:38:00Z",
    "SubmissionStatusTypeID": 200
}