{
    "IsRecentlyVerified": false,
    "ID": 182046,
    "UUID": "3B5CCA39-6E70-40BA-BC16-FF5DBE559846",
    "DataProviderID": 29,
    "DataProvidersReference": "17598",
    "OperatorID": 103,
    "AddressInfo": {
        "ID": 182405,
        "Title": "Washingtonstr. 10",
        "AddressLine1": "Washingtonstr. 10",
        "Town": "Dresden",
        "Postcode": "01139",
        "CountryID": 87,
        "Latitude": 51.07914,
        "Longitude": 13.690989,
        "DistanceUnit": 0
    },
    "Connections": [
        {
            "ID": 287285,
            "ConnectionTypeID": 33,
            "StatusTypeID": 50,
            "LevelID": 3,
            "PowerKW": 50,
            "CurrentTypeID": 30
        },
        {
            "ID": 287286,
            "ConnectionTypeID": 1036,
            "StatusTypeID": 50,
            "LevelID": 3,
            "PowerKW": 43,
            "CurrentTypeID": 20
        }
    ],
    "StatusTypeID": 50,
    "DateLastStatusUpdate": "2021-07-09T03:22:00Z",
    "MetadataValues": [
        {
            "ID": 14340,
            "MetadataFieldID": 4,
            "ItemValue": "Data from the German chargepoint registry provided by Bundesnetzagentur.de under the CC-BY 4.0 license"
        }
    ],
    "DataQualityLevel": 3,
    "DateCreated": "2021-07-08T10:02:00Z",
    "SubmissionStatusTypeID": 100
}