{
    "IsRecentlyVerified": false,
    "ID": 140100,
    "UUID": "77AED993-8AD7-46B3-8AF3-6E1FFC095006",
    "DataProviderID": 2,
    "DataProvidersReference": "95833",
    "OperatorID": 9,
    "UsageTypeID": 1,
    "AddressInfo": {
        "ID": 140452,
        "Title": "Ducktown Chevron",
        "AddressLine1": "5080 Highway 64",
        "Town": "Ducktown",
        "StateOrProvince": "TN",
        "Postcode": "37326",
        "CountryID": 2,
        "Latitude": 35.02887,
        "Longitude": -84.38552,
        "ContactTelephone1": "888-998-2546",
        "AccessComments": "MON: 24 hours | TUE: 24 hours | WED: 24 hours | THU: 24 hours | FRI: 24 hours | SAT: 24 hours | SUN: 24 hours",
        "RelatedURL": "http://www.blinkcharging.com/",
        "DistanceUnit": 0
    },
    "Connections": [
        {
            "ID": 195652,
            "ConnectionTypeID": 1,
            "LevelID": 2,
            "Amps": 16,
            "Voltage": 230,
            "PowerKW": 3.7,
            "CurrentTypeID": 10,
            "Quantity": 1
        }
    ],
    "StatusTypeID": 50,
    "DateLastStatusUpdate": "2020-06-26T02:57:00Z",
    "DataQualityLevel": 3,
    "DateCreated": "2019-12-24T09:12:00Z",
    "SubmissionStatusTypeID": 100
}