{
    "IsRecentlyVerified": false,
    "ID": 32674,
    "UUID": "D0B63960-51F4-4511-94C9-8EB0D85279E5",
    "DataProviderID": 26,
    "DataProvidersReference": "47031",
    "OperatorID": 178,
    "OperatorsReference": "EVnetNL AL170",
    "UsageCost": "0.00 jaarabonnement",
    "AddressInfo": {
        "ID": 33020,
        "Title": "Achter de Hoven 2a",
        "AddressLine1": "Achter de Hoven 2a",
        "Town": "Peel en Maas",
        "Postcode": "5993 CR",
        "CountryID": 159,
        "Latitude": 51.358644,
        "Longitude": 6.047949,
        "ContactTelephone1": "0800-3522365",
        "RelatedURL": "http://www.evnet.nl",
        "DistanceUnit": 0
    },
    "Connections": [
        {
            "ID": 36185,
            "ConnectionTypeID": 25,
            "LevelID": 2,
            "PowerKW": 11,
            "CurrentTypeID": 10
        }
    ],
    "NumberOfPoints": 1,
    "StatusTypeID": 50,
    "DateLastStatusUpdate": "2016-06-04T02:38:00Z",
    "DataQualityLevel": 3,
    "DateCreated": "2015-01-09T06:03:00Z",
    "SubmissionStatusTypeID": 100
}