{
    "IsRecentlyVerified": false,
    "ID": 52264,
    "UUID": "1E4CBE72-5E3C-43D1-9C21-9F987CF44480",
    "DataProviderID": 1,
    "OperatorID": 207,
    "UsageTypeID": 6,
    "AddressInfo": {
        "ID": 52610,
        "Title": "Carrefour de Manresa",
        "AddressLine1": "Carrer d'Alvar Alto, 14-16",
        "Town": "Manresa",
        "StateOrProvince": "Barcelona",
        "Postcode": "08243",
        "CountryID": 210,
        "Latitude": 41.7215599,
        "Longitude": 1.84379999999999,
        "RelatedURL": "http://www.endesa.es",
        "DistanceUnit": 0
    },
    "Connections": [
        {
            "ID": 64911,
            "ConnectionTypeID": 28,
            "StatusTypeID": 0,
            "Quantity": 2
        }
    ],
    "NumberOfPoints": 2,
    "StatusTypeID": 0,
    "DateLastStatusUpdate": "2015-09-04T20:34:00Z",
    "DataQualityLevel": 1,
    "DateCreated": "2015-08-27T11:33:00Z",
    "SubmissionStatusTypeID": 200
}