{
    "IsRecentlyVerified": false,
    "ID": 43469,
    "UUID": "94D50834-E363-4D6F-83D0-CE0AB260717E",
    "DataProviderID": 1,
    "OperatorID": 45,
    "UsageTypeID": 5,
    "UsageCost": "0,50€/kWh",
    "AddressInfo": {
        "ID": 43815,
        "Title": "Hallenbad Badino",
        "AddressLine1": "Probsteistraße 25",
        "Town": "Overath",
        "StateOrProvince": "Rheinisch-Bergischer Kreis",
        "Postcode": "51491",
        "CountryID": 87,
        "Latitude": 50.9295014534584,
        "Longitude": 7.28386361474986,
        "AccessComments": "Auf dem gebührenpflichtigen (wird mit Schwimmbadbesuch verrechnet) Parkplatz des Schwimmbades bei den Wohnmobilplätzen sind 2 Stromanschlüsse. Kosten 0,50€/kWh.",
        "RelatedURL": "http://www.overath.de/",
        "DistanceUnit": 0
    },
    "Connections": [
        {
            "ID": 52694,
            "ConnectionTypeID": 16,
            "StatusTypeID": 50,
            "LevelID": 2,
            "Amps": 16,
            "Voltage": 230,
            "PowerKW": 3.7,
            "CurrentTypeID": 10,
            "Quantity": 2
        }
    ],
    "NumberOfPoints": 2,
    "StatusTypeID": 50,
    "DateLastStatusUpdate": "2015-04-01T10:31:00Z",
    "DataQualityLevel": 1,
    "DateCreated": "2015-04-01T09:58:00Z",
    "SubmissionStatusTypeID": 200
}