{
    "IsRecentlyVerified": false,
    "ID": 183717,
    "UUID": "D311F98D-5591-4CB7-93A7-17E497D11D7E",
    "DataProviderID": 29,
    "DataProvidersReference": "10156",
    "AddressInfo": {
        "ID": 184076,
        "Title": "Drillmakersweg 22",
        "AddressLine1": "Drillmakersweg 22",
        "Town": "Harsewinkel",
        "Postcode": "33428",
        "CountryID": 87,
        "Latitude": 51.977,
        "Longitude": 8.15,
        "DistanceUnit": 0
    },
    "Connections": [
        {
            "ID": 291046,
            "ConnectionTypeID": 25,
            "StatusTypeID": 50,
            "LevelID": 2,
            "PowerKW": 11,
            "CurrentTypeID": 20
        },
        {
            "ID": 291047,
            "ConnectionTypeID": 25,
            "StatusTypeID": 50,
            "LevelID": 2,
            "PowerKW": 11,
            "CurrentTypeID": 20
        }
    ],
    "StatusTypeID": 50,
    "DateLastStatusUpdate": "2021-07-09T03:25:00Z",
    "MetadataValues": [
        {
            "ID": 16010,
            "MetadataFieldID": 4,
            "ItemValue": "Data from the German chargepoint registry provided by Bundesnetzagentur.de under the CC-BY 4.0 license"
        }
    ],
    "DataQualityLevel": 3,
    "DateCreated": "2021-07-08T10:04:00Z",
    "SubmissionStatusTypeID": 100
}