{
    "IsRecentlyVerified": false,
    "ID": 158843,
    "UUID": "ECA230E9-6C0D-49C3-B6CA-A138CF041564",
    "DataProviderID": 2,
    "DataProvidersReference": "156167",
    "OperatorID": 59,
    "UsageTypeID": 1,
    "AddressInfo": {
        "ID": 159200,
        "Title": "Greenlots - 12529A",
        "AddressLine1": "14227 W Magnolia Blvd",
        "Town": "Van Nuys",
        "StateOrProvince": "CA",
        "Postcode": "91423",
        "CountryID": 2,
        "Latitude": 34.1649398803711,
        "Longitude": -118.443046569824,
        "ContactTelephone1": "855-900-7584",
        "AccessComments": "24 hours daily",
        "RelatedURL": "http://greenlots.com/",
        "DistanceUnit": 0
    },
    "Connections": [
        {
            "ID": 228878,
            "ConnectionTypeID": 1,
            "LevelID": 2,
            "Amps": 16,
            "Voltage": 230,
            "PowerKW": 3.7,
            "CurrentTypeID": 10,
            "Quantity": 1
        }
    ],
    "StatusTypeID": 50,
    "DateLastStatusUpdate": "2020-06-26T02:57:00Z",
    "DataQualityLevel": 3,
    "DateCreated": "2020-06-26T02:57:00Z",
    "SubmissionStatusTypeID": 100
}