{
    "IsRecentlyVerified": false,
    "ID": 100916,
    "UUID": "03740A87-3E8B-4F43-BEA2-0C6D993EF21A",
    "DataProviderID": 1,
    "OperatorID": 105,
    "UsageTypeID": 4,
    "AddressInfo": {
        "ID": 101262,
        "Title": "EWB Bünde",
        "AddressLine1": "Osnabrücker Straße 205",
        "Town": "Bünde",
        "StateOrProvince": "Kreis Herford",
        "Postcode": "32257",
        "CountryID": 87,
        "Latitude": 52.193211946810735,
        "Longitude": 8.536796939811666,
        "AccessComments": "Nur zu den Öffnungszeiten von Mo 8-18, Di-Do 8-16:30, Fr 8-13Uhr nutzbar. ",
        "RelatedURL": "https://www.ewb.aov.de/",
        "DistanceUnit": 0
    },
    "Connections": [
        {
            "ID": 142505,
            "ConnectionTypeID": 25,
            "StatusTypeID": 50,
            "LevelID": 2,
            "Amps": 32,
            "Voltage": 400,
            "PowerKW": 22,
            "CurrentTypeID": 20,
            "Quantity": 2
        }
    ],
    "NumberOfPoints": 2,
    "StatusTypeID": 50,
    "DateLastStatusUpdate": "2018-03-12T09:27:00Z",
    "DataQualityLevel": 1,
    "DateCreated": "2018-03-12T09:27:00Z",
    "SubmissionStatusTypeID": 200
}