{
    "IsRecentlyVerified": false,
    "ID": 84995,
    "UUID": "967EC163-ED94-40EB-842F-B7A242F6B2F3",
    "DataProviderID": 1,
    "OperatorID": 23,
    "OperatorsReference": "25921",
    "UsageTypeID": 7,
    "AddressInfo": {
        "ID": 85341,
        "Title": "Chalet Royalp Hotel & Spa",
        "AddressLine1": "23 Domaine de Rochegrise",
        "Town": "Villars-sur-Ollon",
        "Postcode": "1884",
        "CountryID": 217,
        "Latitude": 46.293819,
        "Longitude": 7.061877,
        "ContactTelephone1": "+41 2449 59090",
        "DistanceUnit": 0
    },
    "Connections": [
        {
            "ID": 120744,
            "ConnectionTypeID": 30,
            "StatusTypeID": 50,
            "LevelID": 2,
            "Amps": 32,
            "Voltage": 230,
            "PowerKW": 14,
            "CurrentTypeID": 20,
            "Quantity": 2
        }
    ],
    "NumberOfPoints": 2,
    "GeneralComments": "2 Tesla Connectors, up to 14kW.Available by reservation only. Please see front desk.",
    "StatusTypeID": 50,
    "DateLastStatusUpdate": "2018-10-03T20:19:00Z",
    "DataQualityLevel": 1,
    "DateCreated": "2017-03-23T06:28:00Z",
    "SubmissionStatusTypeID": 200
}