{
    "IsRecentlyVerified": false,
    "ID": 180632,
    "UUID": "14427D82-C5F7-4F78-9AE2-3A27238FA3DD",
    "DataProviderID": 29,
    "DataProvidersReference": "7961",
    "OperatorID": 105,
    "AddressInfo": {
        "ID": 180991,
        "Title": "Neuer Markt 2",
        "AddressLine1": "Neuer Markt 2",
        "Town": "Hermeskeil",
        "Postcode": "54411",
        "CountryID": 87,
        "Latitude": 49.655533,
        "Longitude": 6.942617,
        "DistanceUnit": 0
    },
    "Connections": [
        {
            "ID": 283954,
            "ConnectionTypeID": 25,
            "StatusTypeID": 50,
            "LevelID": 2,
            "PowerKW": 22,
            "CurrentTypeID": 20
        },
        {
            "ID": 283955,
            "ConnectionTypeID": 25,
            "StatusTypeID": 50,
            "LevelID": 2,
            "PowerKW": 22,
            "CurrentTypeID": 20
        }
    ],
    "StatusTypeID": 50,
    "DateLastStatusUpdate": "2021-07-12T02:43:00Z",
    "MetadataValues": [
        {
            "ID": 12926,
            "MetadataFieldID": 4,
            "ItemValue": "Data from the German chargepoint registry provided by Bundesnetzagentur.de under the CC-BY 4.0 license"
        }
    ],
    "DataQualityLevel": 3,
    "DateCreated": "2021-07-08T10:00:00Z",
    "SubmissionStatusTypeID": 100
}