{
    "IsRecentlyVerified": false,
    "ID": 95830,
    "UUID": "CB2A5C4B-4D65-4366-A1E9-9E511908410E",
    "DataProviderID": 1,
    "OperatorID": 3268,
    "UsageTypeID": 5,
    "AddressInfo": {
        "ID": 96176,
        "Title": "Белоруснефть № 52",
        "AddressLine1": "Р87",
        "Town": "Высокое",
        "StateOrProvince": "Orsha District",
        "Postcode": "211024",
        "CountryID": 25,
        "Latitude": 54.62645917692065,
        "Longitude": 30.435440188885526,
        "ContactTelephone1": "(0216) 279508",
        "RelatedURL": "http://www.belorusneft.by/beloil-map/?lang=en",
        "DistanceUnit": 0
    },
    "Connections": [
        {
            "ID": 135739,
            "ConnectionTypeID": 2,
            "StatusTypeID": 50,
            "LevelID": 3,
            "PowerKW": 50,
            "CurrentTypeID": 30,
            "Quantity": 1
        },
        {
            "ID": 135740,
            "ConnectionTypeID": 33,
            "StatusTypeID": 50,
            "LevelID": 3,
            "PowerKW": 50,
            "CurrentTypeID": 30,
            "Quantity": 1
        }
    ],
    "NumberOfPoints": 1,
    "StatusTypeID": 50,
    "DateLastStatusUpdate": "2017-11-26T21:01:00Z",
    "DataQualityLevel": 1,
    "DateCreated": "2017-11-26T21:01:00Z",
    "SubmissionStatusTypeID": 200
}