{
    "IsRecentlyVerified": false,
    "ID": 5399,
    "UUID": "C41E1CDA-AAD5-4317-91A8-1873B484E15E",
    "DataProviderID": 1,
    "DataProvidersReference": "LRS-00024",
    "OperatorID": 21,
    "UsageTypeID": 4,
    "UsageCost": "Mobi.E compatible card",
    "AddressInfo": {
        "ID": 5338,
        "Title": "LRS-00024",
        "AddressLine1": "Avenida Severiano Falcão",
        "Town": "Loures",
        "Postcode": "2685-379",
        "CountryID": 180,
        "Latitude": 38.785233,
        "Longitude": -9.124183,
        "RelatedURL": "http://www.mobie.pt",
        "DistanceUnit": 0
    },
    "Connections": [
        {
            "ID": 33320,
            "ConnectionTypeID": 25,
            "StatusTypeID": 50,
            "LevelID": 2,
            "Amps": 16,
            "Voltage": 230,
            "PowerKW": 3.7,
            "CurrentTypeID": 10,
            "Quantity": 2
        }
    ],
    "NumberOfPoints": 2,
    "StatusTypeID": 50,
    "DateLastStatusUpdate": "2020-08-11T18:34:00Z",
    "DataQualityLevel": 1,
    "DateCreated": "2011-08-25T12:48:00Z",
    "SubmissionStatusTypeID": 100
}