{
    "UserComments": [
        {
            "ID": 14223,
            "ChargePointID": 40734,
            "CommentTypeID": 10,
            "UserName": "hape2",
            "Comment": "",
            "DateCreated": "2016-09-08T21:44:02.4Z",
            "User": {
                "ID": 11742,
                "Username": "hape2"
            },
            "CheckinStatusTypeID": 10
        },
        {
            "ID": 3900,
            "ChargePointID": 40734,
            "CommentTypeID": 10,
            "UserName": "Erna_Schleck",
            "Comment": " Viele Einkaufsmöglichkeiten. Straßenbahnhaltestelle um die Ecke.",
            "Rating": 5,
            "DateCreated": "2015-03-01T10:01:47.93Z",
            "User": {
                "ID": 4573,
                "Username": "Erna_Schleck"
            },
            "CheckinStatusTypeID": 10
        }
    ],
    "MediaItems": [
        {
            "ID": 1042,
            "ChargePointID": 40734,
            "ItemURL": "https://s3-ap-southeast-2.amazonaws.com/openchargemap/images/DE/OCM40734/OCM-40734.orig.2015030109570482.jpg",
            "ItemThumbnailURL": "https://s3-ap-southeast-2.amazonaws.com/openchargemap/images/DE/OCM40734/OCM-40734.thmb.2015030109570482.jpg",
            "Comment": "Vor dem Eingang rechts neben den Einkaufswagen,",
            "IsEnabled": true,
            "IsVideo": false,
            "IsFeaturedItem": false,
            "IsExternalResource": false,
            "User": {
                "ID": 4573,
                "Username": "Erna_Schleck"
            },
            "DateCreated": "2015-03-01T09:57:00Z"
        }
    ],
    "IsRecentlyVerified": false,
    "ID": 40734,
    "UUID": "61B7E908-D21F-431C-81F4-27C04F3264A0",
    "DataProviderID": 1,
    "OperatorID": 45,
    "UsageTypeID": 1,
    "UsageCost": "0",
    "AddressInfo": {
        "ID": 41080,
        "Title": "Edeka Heisenbergstraße",
        "AddressLine1": "Heisenbergstraße 14",
        "Town": "Hannover",
        "StateOrProvince": "Region Hannover",
        "Postcode": "30627",
        "CountryID": 87,
        "Latitude": 52.3852278414239,
        "Longitude": 9.81353762209018,
        "AccessComments": "2 kostenlose Parkplätze an Supermarkt, nur während der Öffnungszeiten (Mo-Sa 8-20 Uhr) nutzbar. Außerhalb der Öffnungszeiten ist der Parkplatz durch Schranken abgesperrt.",
        "RelatedURL": "http://www.edeka-wucherpfennig.de/standorte/roderbruch/unser-markt",
        "DistanceUnit": 0
    },
    "Connections": [
        {
            "ID": 44343,
            "ConnectionTypeID": 28,
            "StatusTypeID": 50,
            "LevelID": 2,
            "Amps": 16,
            "Voltage": 230,
            "PowerKW": 3.7,
            "CurrentTypeID": 10,
            "Quantity": 2
        },
        {
            "ID": 44344,
            "ConnectionTypeID": 25,
            "StatusTypeID": 50,
            "LevelID": 2,
            "PowerKW": 22,
            "CurrentTypeID": 20,
            "Quantity": 2
        }
    ],
    "NumberOfPoints": 4,
    "StatusTypeID": 50,
    "DateLastStatusUpdate": "2016-09-08T21:44:00Z",
    "DataQualityLevel": 1,
    "DateCreated": "2015-01-12T09:24:00Z",
    "SubmissionStatusTypeID": 200
}