{
    "MediaItems": [
        {
            "ID": 12323,
            "ChargePointID": 88123,
            "ItemURL": "https://s3-ap-southeast-2.amazonaws.com/openchargemap/images/NZ/OCM88123/OCM-88123.orig.2017052211533162.jpg",
            "ItemThumbnailURL": "https://s3-ap-southeast-2.amazonaws.com/openchargemap/images/NZ/OCM88123/OCM-88123.thmb.2017052211533162.jpg",
            "Comment": "",
            "IsEnabled": true,
            "IsVideo": false,
            "IsFeaturedItem": false,
            "IsExternalResource": false,
            "User": {
                "ID": 15365,
                "Username": "sliday"
            },
            "DateCreated": "2017-05-22T11:54:00Z"
        },
        {
            "ID": 12324,
            "ChargePointID": 88123,
            "ItemURL": "https://s3-ap-southeast-2.amazonaws.com/openchargemap/images/NZ/OCM88123/OCM-88123.orig.2017052211534544.jpg",
            "ItemThumbnailURL": "https://s3-ap-southeast-2.amazonaws.com/openchargemap/images/NZ/OCM88123/OCM-88123.thmb.2017052211534544.jpg",
            "Comment": "",
            "IsEnabled": true,
            "IsVideo": false,
            "IsFeaturedItem": false,
            "IsExternalResource": false,
            "User": {
                "ID": 15365,
                "Username": "sliday"
            },
            "DateCreated": "2017-05-22T11:54:00Z"
        },
        {
            "ID": 12325,
            "ChargePointID": 88123,
            "ItemURL": "https://s3-ap-southeast-2.amazonaws.com/openchargemap/images/NZ/OCM88123/OCM-88123.orig.2017052211535990.jpg",
            "ItemThumbnailURL": "https://s3-ap-southeast-2.amazonaws.com/openchargemap/images/NZ/OCM88123/OCM-88123.thmb.2017052211535990.jpg",
            "Comment": "",
            "IsEnabled": true,
            "IsVideo": false,
            "IsFeaturedItem": false,
            "IsExternalResource": false,
            "User": {
                "ID": 15365,
                "Username": "sliday"
            },
            "DateCreated": "2017-05-22T11:54:00Z"
        },
        {
            "ID": 12319,
            "ChargePointID": 88123,
            "ItemURL": "https://s3-ap-southeast-2.amazonaws.com/openchargemap/images/NZ/OCM88123/OCM-88123.orig.2017052211523058.jpg",
            "ItemThumbnailURL": "https://s3-ap-southeast-2.amazonaws.com/openchargemap/images/NZ/OCM88123/OCM-88123.thmb.2017052211523058.jpg",
            "Comment": "",
            "IsEnabled": true,
            "IsVideo": false,
            "IsFeaturedItem": false,
            "IsExternalResource": false,
            "User": {
                "ID": 15365,
                "Username": "sliday"
            },
            "DateCreated": "2017-05-22T11:53:00Z"
        },
        {
            "ID": 12320,
            "ChargePointID": 88123,
            "ItemURL": "https://s3-ap-southeast-2.amazonaws.com/openchargemap/images/NZ/OCM88123/OCM-88123.orig.2017052211524963.jpg",
            "ItemThumbnailURL": "https://s3-ap-southeast-2.amazonaws.com/openchargemap/images/NZ/OCM88123/OCM-88123.thmb.2017052211524963.jpg",
            "Comment": "",
            "IsEnabled": true,
            "IsVideo": false,
            "IsFeaturedItem": false,
            "IsExternalResource": false,
            "User": {
                "ID": 15365,
                "Username": "sliday"
            },
            "DateCreated": "2017-05-22T11:53:00Z"
        },
        {
            "ID": 12321,
            "ChargePointID": 88123,
            "ItemURL": "https://s3-ap-southeast-2.amazonaws.com/openchargemap/images/NZ/OCM88123/OCM-88123.orig.2017052211530226.jpg",
            "ItemThumbnailURL": "https://s3-ap-southeast-2.amazonaws.com/openchargemap/images/NZ/OCM88123/OCM-88123.thmb.2017052211530226.jpg",
            "Comment": "",
            "IsEnabled": true,
            "IsVideo": false,
            "IsFeaturedItem": false,
            "IsExternalResource": false,
            "User": {
                "ID": 15365,
                "Username": "sliday"
            },
            "DateCreated": "2017-05-22T11:53:00Z"
        },
        {
            "ID": 12322,
            "ChargePointID": 88123,
            "ItemURL": "https://s3-ap-southeast-2.amazonaws.com/openchargemap/images/NZ/OCM88123/OCM-88123.orig.2017052211531378.jpg",
            "ItemThumbnailURL": "https://s3-ap-southeast-2.amazonaws.com/openchargemap/images/NZ/OCM88123/OCM-88123.thmb.2017052211531378.jpg",
            "Comment": "",
            "IsEnabled": true,
            "IsVideo": false,
            "IsFeaturedItem": false,
            "IsExternalResource": false,
            "User": {
                "ID": 15365,
                "Username": "sliday"
            },
            "DateCreated": "2017-05-22T11:53:00Z"
        },
        {
            "ID": 12317,
            "ChargePointID": 88123,
            "ItemURL": "https://s3-ap-southeast-2.amazonaws.com/openchargemap/images/NZ/OCM88123/OCM-88123.orig.2017052211515926.jpg",
            "ItemThumbnailURL": "https://s3-ap-southeast-2.amazonaws.com/openchargemap/images/NZ/OCM88123/OCM-88123.thmb.2017052211515926.jpg",
            "Comment": "",
            "IsEnabled": true,
            "IsVideo": false,
            "IsFeaturedItem": false,
            "IsExternalResource": false,
            "User": {
                "ID": 15365,
                "Username": "sliday"
            },
            "DateCreated": "2017-05-22T11:52:00Z"
        },
        {
            "ID": 12318,
            "ChargePointID": 88123,
            "ItemURL": "https://s3-ap-southeast-2.amazonaws.com/openchargemap/images/NZ/OCM88123/OCM-88123.orig.2017052211521346.jpg",
            "ItemThumbnailURL": "https://s3-ap-southeast-2.amazonaws.com/openchargemap/images/NZ/OCM88123/OCM-88123.thmb.2017052211521346.jpg",
            "Comment": "",
            "IsEnabled": true,
            "IsVideo": false,
            "IsFeaturedItem": false,
            "IsExternalResource": false,
            "User": {
                "ID": 15365,
                "Username": "sliday"
            },
            "DateCreated": "2017-05-22T11:52:00Z"
        }
    ],
    "IsRecentlyVerified": false,
    "ID": 88123,
    "UUID": "89E0C4A9-6F47-4E12-9975-6269D7825518",
    "DataProviderID": 1,
    "AddressInfo": {
        "ID": 88469,
        "Title": "Silverdale Kings Plant Barn",
        "AddressLine1": "17 Hibiscus Coast Highway",
        "Town": "Silverdale, Auckland",
        "Postcode": "0993",
        "CountryID": 161,
        "Latitude": -36.622294779903996,
        "Longitude": 174.67057294596327,
        "DistanceUnit": 0
    },
    "Connections": [
        {
            "ID": 125004,
            "ConnectionTypeID": 2,
            "LevelID": 2,
            "PowerKW": 50
        },
        {
            "ID": 125005,
            "ConnectionTypeID": 33,
            "LevelID": 2,
            "PowerKW": 50
        }
    ],
    "NumberOfPoints": 2,
    "GeneralComments": "24/7\r\nVector's Silverdale free rapid charging site. Two free parking spaces for EVs while they are charging. Two 50kW chargers, each with a CHAdeMO and a CCS plug. Grab a coffee in Kings Plant Barn.\r\n",
    "StatusTypeID": 50,
    "DateLastStatusUpdate": "2017-05-22T11:54:00Z",
    "DataQualityLevel": 1,
    "DateCreated": "2017-05-22T11:52:00Z",
    "SubmissionStatusTypeID": 200
}