{
    "IsRecentlyVerified": false,
    "ID": 102924,
    "UUID": "253A55D8-25CA-40A0-A502-32AB0938C4E9",
    "DataProviderID": 2,
    "DataProvidersReference": "92260",
    "OperatorID": 5,
    "UsageTypeID": 1,
    "AddressInfo": {
        "ID": 103270,
        "Title": "WHOLE FOODS MKT",
        "AddressLine1": "15 Baker Ave",
        "Town": "Shrewsbury",
        "StateOrProvince": "MA",
        "Postcode": "01545",
        "CountryID": 2,
        "Latitude": 42.2758848,
        "Longitude": -71.7461917,
        "ContactTelephone1": "888-758-4389",
        "AccessComments": "24 hours daily",
        "RelatedURL": "http://www.chargepoint.com/",
        "DistanceUnit": 0
    },
    "Connections": [
        {
            "ID": 145071,
            "ConnectionTypeID": 1,
            "LevelID": 2,
            "Amps": 16,
            "Voltage": 230,
            "PowerKW": 3.7,
            "CurrentTypeID": 10,
            "Quantity": 1
        }
    ],
    "DateLastStatusUpdate": "2020-06-26T03:05:00Z",
    "DataQualityLevel": 3,
    "DateCreated": "2018-04-21T04:13:00Z",
    "SubmissionStatusTypeID": 100
}