{
    "IsRecentlyVerified": false,
    "ID": 107068,
    "UUID": "92EC77E0-E8C2-41B9-9384-D0948B0CA88A",
    "DataProviderID": 1,
    "OperatorID": 229,
    "UsageTypeID": 4,
    "UsageCost": "$0.25/kWh + $0.25/min",
    "AddressInfo": {
        "ID": 107414,
        "Title": "New World",
        "AddressLine1": "11 Moana Avenue",
        "Town": "Orewa",
        "Postcode": "0931",
        "CountryID": 161,
        "Latitude": -36.58647,
        "Longitude": 174.694801,
        "DistanceUnit": 0
    },
    "Connections": [
        {
            "ID": 150952,
            "ConnectionTypeID": 2,
            "StatusTypeID": 50,
            "LevelID": 3,
            "PowerKW": 50,
            "CurrentTypeID": 30,
            "Quantity": 1
        },
        {
            "ID": 150953,
            "ConnectionTypeID": 33,
            "StatusTypeID": 50,
            "LevelID": 3,
            "PowerKW": 50,
            "CurrentTypeID": 30,
            "Quantity": 1
        }
    ],
    "NumberOfPoints": 2,
    "StatusTypeID": 50,
    "DateLastStatusUpdate": "2018-07-16T22:29:00Z",
    "DataQualityLevel": 1,
    "DateCreated": "2018-07-16T17:40:00Z",
    "SubmissionStatusTypeID": 200
}