{
    "IsRecentlyVerified": false,
    "ID": 165363,
    "UUID": "6CF840CB-1A81-41C4-8C37-8C278FC191CA",
    "DataProviderID": 28,
    "DataProvidersReference": "FR*M13*P13201*003",
    "UsageTypeID": 5,
    "AddressInfo": {
        "ID": 165722,
        "Title": "MARSEILLE-1E - 90 Rue Grignan",
        "AddressLine1": "Allée des Coudercs - Parking aire de jeu 0 MARSEILLE-1E",
        "CountryID": 80,
        "Latitude": 43.29145,
        "Longitude": 5.373858,
        "AccessComments": "24h/24 7j/7",
        "DistanceUnit": 0
    },
    "Connections": [
        {
            "ID": 238182,
            "ConnectionTypeID": 28,
            "StatusTypeID": 50,
            "LevelID": 2,
            "PowerKW": 22,
            "CurrentTypeID": 10
        },
        {
            "ID": 238183,
            "ConnectionTypeID": 1036,
            "StatusTypeID": 50,
            "LevelID": 2,
            "PowerKW": 22,
            "CurrentTypeID": 20
        }
    ],
    "GeneralComments": "Recharge par badge et avec une application smartphone",
    "StatusTypeID": 50,
    "DateLastStatusUpdate": "2020-08-27T05:10:00Z",
    "DataQualityLevel": 2,
    "DateCreated": "2020-08-27T05:10:00Z",
    "SubmissionStatusTypeID": 100
}