{
    "IsRecentlyVerified": false,
    "ID": 93635,
    "UUID": "F4BD8C11-90EE-40E6-A78A-E12EF5BD6515",
    "DataProviderID": 1,
    "OperatorID": 45,
    "UsageTypeID": 1,
    "AddressInfo": {
        "ID": 93981,
        "Title": "Supermarkt Aldi",
        "AddressLine1": "Leipziger Straße 116",
        "Town": "Hessisch Lichtenau",
        "StateOrProvince": "Werra-Meißner-Kreis",
        "Postcode": "37235",
        "CountryID": 87,
        "Latitude": 51.1991723,
        "Longitude": 9.728586899999982,
        "AccessComments": "Mo-Sa 8-20Uhr nutzbar, alles kostenlos",
        "DistanceUnit": 0
    },
    "Connections": [
        {
            "ID": 132596,
            "ConnectionTypeID": 25,
            "StatusTypeID": 50,
            "LevelID": 2,
            "Amps": 32,
            "Voltage": 400,
            "PowerKW": 22,
            "CurrentTypeID": 20,
            "Quantity": 1
        }
    ],
    "NumberOfPoints": 1,
    "StatusTypeID": 50,
    "DateLastStatusUpdate": "2017-10-04T09:53:00Z",
    "DataQualityLevel": 1,
    "DateCreated": "2017-10-04T09:53:00Z",
    "SubmissionStatusTypeID": 200
}