{
    "UserComments": [
        {
            "ID": 4844,
            "ChargePointID": 16033,
            "CommentTypeID": 10,
            "UserName": "Harel peretz",
            "Comment": "The post code are SA31PQ",
            "DateCreated": "2015-07-05T11:54:22.463Z",
            "User": {
                "ID": 1572,
                "Username": "Harel peretz"
            },
            "CheckinStatusTypeID": 10
        },
        {
            "ID": 4843,
            "ChargePointID": 16033,
            "CommentTypeID": 10,
            "UserName": "Harel peretz",
            "Comment": "this charge point non exist the post code are no correct",
            "DateCreated": "2015-07-05T11:53:49.62Z",
            "User": {
                "ID": 1572,
                "Username": "Harel peretz"
            },
            "CheckinStatusTypeID": 10
        }
    ],
    "IsRecentlyVerified": false,
    "ID": 16033,
    "UUID": "9C49DDA2-46CE-4196-94A3-4733B504E6A7",
    "DataProviderID": 1,
    "OperatorID": 19,
    "UsageTypeID": 6,
    "AddressInfo": {
        "ID": 16378,
        "Title": "National Trust Office & Holiday Cottage",
        "AddressLine1": "South Pilton Green Farm,",
        "AddressLine2": "Rhossili",
        "Town": "Swansea",
        "StateOrProvince": "Wales",
        "Postcode": "SA13 1PQ",
        "CountryID": 1,
        "Latitude": 51.5956947,
        "Longitude": -3.7840254000000186,
        "ContactTelephone1": "0844 800 20 70",
        "ContactEmail": "cottages@nationaltrust.org.uk",
        "RelatedURL": "http://www.nationaltrustcottages.co.uk/cottage/south-pilton-green-farmhouse-013031",
        "DistanceUnit": 0
    },
    "Connections": [
        {
            "ID": 14435,
            "ConnectionTypeID": 3,
            "StatusTypeID": 50,
            "LevelID": 2,
            "Amps": 13,
            "Voltage": 230,
            "PowerKW": 3,
            "CurrentTypeID": 10,
            "Quantity": 1
        },
        {
            "ID": 14436,
            "ConnectionTypeID": 25,
            "StatusTypeID": 50,
            "LevelID": 2,
            "Amps": 32,
            "Voltage": 230,
            "PowerKW": 7,
            "CurrentTypeID": 20,
            "Quantity": 1
        }
    ],
    "NumberOfPoints": 2,
    "StatusTypeID": 50,
    "DateLastStatusUpdate": "2017-04-21T17:02:00Z",
    "DataQualityLevel": 1,
    "DateCreated": "2013-02-26T13:31:00Z",
    "SubmissionStatusTypeID": 200
}