{
    "IsRecentlyVerified": false,
    "ID": 187805,
    "UUID": "921B1E3F-4D3C-4522-BA28-8BEC621E84D0",
    "DataProviderID": 18,
    "DataProvidersReference": "15c15ec94e3cc4188bef407f1fef4f98",
    "OperatorID": 3345,
    "UsageTypeID": 5,
    "AddressInfo": {
        "ID": 188164,
        "Title": "E18 1PZ",
        "AddressLine1": "",
        "Town": "London",
        "Postcode": "E18 1PZ",
        "CountryID": 1,
        "Latitude": 51.588707,
        "Longitude": 0.027749,
        "AccessComments": "",
        "RelatedURL": "https://char.gy",
        "DistanceUnit": 0
    },
    "Connections": [
        {
            "ID": 303064,
            "ConnectionTypeID": 3,
            "Reference": "645",
            "StatusTypeID": 50,
            "LevelID": 2,
            "Amps": 13,
            "Voltage": 230,
            "PowerKW": 3,
            "CurrentTypeID": 10
        }
    ],
    "StatusTypeID": 0,
    "DateLastStatusUpdate": "2021-07-12T03:39:00Z",
    "MetadataValues": [
        {
            "ID": 20045,
            "MetadataFieldID": 4,
            "ItemValue": "Contains public sector information licensed under the Open Government Licence v2.0. http://www.nationalarchives.gov.uk/doc/open-government-licence/version/2/"
        }
    ],
    "DataQualityLevel": 3,
    "DateCreated": "2021-07-12T03:39:00Z",
    "SubmissionStatusTypeID": 100
}