{
    "IsRecentlyVerified": false,
    "ID": 31830,
    "UUID": "9608DA6E-C50E-4172-9B09-2FB6FB587E09",
    "DataProviderID": 26,
    "DataProvidersReference": "30285",
    "OperatorID": 86,
    "OperatorsReference": "EnWB Warthäuser Straße",
    "UsageCost": "0.00 afhankelijk van pas",
    "AddressInfo": {
        "ID": 32176,
        "Title": "Warthäuser Straße 5",
        "AddressLine1": "Warthäuser Straße 5",
        "Town": "Stuttgart",
        "Postcode": "70327",
        "CountryID": 87,
        "Latitude": 48.77115,
        "Longitude": 9.24546,
        "ContactTelephone1": "0800 3629-000",
        "ContactEmail": "-",
        "RelatedURL": "http://www.enbw.com/",
        "DistanceUnit": 0
    },
    "Connections": [
        {
            "ID": 35341,
            "ConnectionTypeID": 25,
            "LevelID": 2,
            "PowerKW": 5,
            "CurrentTypeID": 10
        }
    ],
    "NumberOfPoints": 2,
    "StatusTypeID": 50,
    "DateLastStatusUpdate": "2015-01-09T06:03:00Z",
    "DataQualityLevel": 3,
    "DateCreated": "2015-01-09T06:03:00Z",
    "SubmissionStatusTypeID": 100
}