{
    "IsRecentlyVerified": false,
    "ID": 181404,
    "UUID": "B9C90243-661B-4277-A3E6-5D1CE913C485",
    "DataProviderID": 29,
    "DataProvidersReference": "10162",
    "AddressInfo": {
        "ID": 181763,
        "Title": "Ernst-Ludwig-Straße 15",
        "AddressLine1": "Ernst-Ludwig-Straße 15",
        "Town": "Buseck",
        "Postcode": "35418",
        "CountryID": 87,
        "Latitude": 50.610506,
        "Longitude": 8.787102,
        "DistanceUnit": 0
    },
    "Connections": [
        {
            "ID": 285682,
            "ConnectionTypeID": 25,
            "StatusTypeID": 50,
            "LevelID": 2,
            "PowerKW": 22,
            "CurrentTypeID": 20
        },
        {
            "ID": 285683,
            "ConnectionTypeID": 25,
            "StatusTypeID": 50,
            "LevelID": 2,
            "PowerKW": 22,
            "CurrentTypeID": 20
        }
    ],
    "StatusTypeID": 50,
    "DateLastStatusUpdate": "2021-07-12T02:45:00Z",
    "MetadataValues": [
        {
            "ID": 13698,
            "MetadataFieldID": 4,
            "ItemValue": "Data from the German chargepoint registry provided by Bundesnetzagentur.de under the CC-BY 4.0 license"
        }
    ],
    "DataQualityLevel": 3,
    "DateCreated": "2021-07-08T10:01:00Z",
    "SubmissionStatusTypeID": 100
}