{
    "IsRecentlyVerified": true,
    "DateLastVerified": "2021-09-19T17:34:00Z",
    "ID": 189296,
    "UUID": "D87847C1-EB5B-4104-82CE-218586F79205",
    "DataProviderID": 1,
    "OperatorID": 21,
    "UsageTypeID": 4,
    "UsageCost": "Mobi.E compatible card or App",
    "AddressInfo": {
        "ID": 189655,
        "Title": "VFR-00008 - Intermarché",
        "AddressLine1": "Rua de Santa Maria",
        "Town": "Santa Maria de Lamas",
        "StateOrProvince": "Aveiro",
        "Postcode": "4535",
        "CountryID": 180,
        "Latitude": 40.97950030818737,
        "Longitude": -8.575680353899088,
        "DistanceUnit": 0
    },
    "Connections": [
        {
            "ID": 306105,
            "ConnectionTypeID": 2,
            "StatusTypeID": 50,
            "LevelID": 3,
            "Amps": 120,
            "Voltage": 500,
            "PowerKW": 50,
            "CurrentTypeID": 30,
            "Quantity": 1
        },
        {
            "ID": 306106,
            "ConnectionTypeID": 33,
            "StatusTypeID": 50,
            "LevelID": 3,
            "Amps": 125,
            "Voltage": 500,
            "PowerKW": 50,
            "CurrentTypeID": 30,
            "Quantity": 1
        },
        {
            "ID": 306107,
            "ConnectionTypeID": 1036,
            "StatusTypeID": 50,
            "LevelID": 3,
            "Amps": 64,
            "Voltage": 400,
            "PowerKW": 43,
            "CurrentTypeID": 20,
            "Quantity": 1
        }
    ],
    "NumberOfPoints": 2,
    "StatusTypeID": 50,
    "DateLastStatusUpdate": "2021-09-19T17:34:00Z",
    "DataQualityLevel": 1,
    "DateCreated": "2021-09-19T17:34:00Z",
    "SubmissionStatusTypeID": 200
}