{
    "IsRecentlyVerified": false,
    "ID": 113358,
    "UUID": "7C79BF0A-CA70-4F5A-A01A-D2208F3E42FA",
    "DataProviderID": 1,
    "OperatorID": 150,
    "UsageTypeID": 4,
    "UsageCost": "£1.00 + £0.30/kWh",
    "AddressInfo": {
        "ID": 113704,
        "Title": "MFG Shell Folkestone",
        "AddressLine1": "336 Cheriton Road",
        "Town": "Folkestone",
        "Postcode": "CT19 4DP",
        "CountryID": 1,
        "Latitude": 51.0869,
        "Longitude": 1.149707,
        "DistanceUnit": 0
    },
    "Connections": [
        {
            "ID": 159647,
            "ConnectionTypeID": 1036,
            "StatusTypeID": 50,
            "LevelID": 3,
            "Amps": 63,
            "Voltage": 400,
            "PowerKW": 43,
            "CurrentTypeID": 20,
            "Quantity": 1
        },
        {
            "ID": 159648,
            "ConnectionTypeID": 2,
            "StatusTypeID": 50,
            "LevelID": 3,
            "PowerKW": 50,
            "CurrentTypeID": 30,
            "Quantity": 1
        },
        {
            "ID": 159649,
            "ConnectionTypeID": 33,
            "StatusTypeID": 50,
            "LevelID": 3,
            "PowerKW": 50,
            "CurrentTypeID": 30,
            "Quantity": 1
        }
    ],
    "NumberOfPoints": 1,
    "StatusTypeID": 50,
    "DateLastStatusUpdate": "2018-12-05T20:02:00Z",
    "DataQualityLevel": 1,
    "DateCreated": "2018-12-05T15:45:00Z",
    "SubmissionStatusTypeID": 200
}