{
    "IsRecentlyVerified": false,
    "ID": 118462,
    "UUID": "3723AC6D-D5D1-4163-B79A-9246C0D2F54C",
    "DataProviderID": 1,
    "UsageTypeID": 5,
    "AddressInfo": {
        "ID": 118808,
        "Title": "The Bluebell Inn",
        "AddressLine1": "Moor Lane",
        "Town": "Ashbourne",
        "StateOrProvince": "Derbyshire",
        "Postcode": "DE6 4LW",
        "CountryID": 1,
        "Latitude": 52.937555,
        "Longitude": -1.567718,
        "RelatedURL": "http://www.alfapower.co.uk/",
        "DistanceUnit": 0
    },
    "Connections": [
        {
            "ID": 167559,
            "ConnectionTypeID": 25,
            "Reference": "A",
            "StatusTypeID": 50,
            "LevelID": 2,
            "Amps": 32,
            "Voltage": 230,
            "PowerKW": 7,
            "CurrentTypeID": 10
        }
    ],
    "StatusTypeID": 0,
    "DateLastStatusUpdate": "2019-03-24T16:16:00Z",
    "MetadataValues": [
        {
            "ID": 4155,
            "MetadataFieldID": 4,
            "ItemValue": "Contains public sector information licensed under the Open Government Licence v2.0. http://www.nationalarchives.gov.uk/doc/open-government-licence/version/2/"
        }
    ],
    "DataQualityLevel": 3,
    "DateCreated": "2019-03-24T12:30:00Z",
    "SubmissionStatusTypeID": 100
}