{
    "IsRecentlyVerified": false,
    "ID": 179771,
    "UUID": "0E274317-C8FA-4B83-BA6E-1AE5FE26C49C",
    "DataProviderID": 29,
    "DataProvidersReference": "9257",
    "OperatorID": 45,
    "AddressInfo": {
        "ID": 180130,
        "Title": "Am Schießanger 14",
        "AddressLine1": "Am Schießanger 14",
        "Town": "Oberviechtach",
        "Postcode": "92526",
        "CountryID": 87,
        "Latitude": 49.4544,
        "Longitude": 12.4113,
        "DistanceUnit": 0
    },
    "Connections": [
        {
            "ID": 282024,
            "ConnectionTypeID": 1036,
            "StatusTypeID": 50,
            "LevelID": 3,
            "PowerKW": 43,
            "CurrentTypeID": 20
        },
        {
            "ID": 282025,
            "ConnectionTypeID": 1036,
            "StatusTypeID": 50,
            "LevelID": 3,
            "PowerKW": 50,
            "CurrentTypeID": 20
        }
    ],
    "StatusTypeID": 50,
    "DateLastStatusUpdate": "2021-07-09T03:17:00Z",
    "MetadataValues": [
        {
            "ID": 12065,
            "MetadataFieldID": 4,
            "ItemValue": "Data from the German chargepoint registry provided by Bundesnetzagentur.de under the CC-BY 4.0 license"
        }
    ],
    "DataQualityLevel": 3,
    "DateCreated": "2021-07-08T09:59:00Z",
    "SubmissionStatusTypeID": 100
}