{
    "IsRecentlyVerified": false,
    "ID": 180493,
    "UUID": "4223BDE0-77EF-48B1-A01D-6E9FCF3D23B2",
    "DataProviderID": 29,
    "DataProvidersReference": "4976",
    "AddressInfo": {
        "ID": 180852,
        "Title": "An der Talle 21",
        "AddressLine1": "An der Talle 21",
        "Town": "Paderborn",
        "Postcode": "33102",
        "CountryID": 87,
        "Latitude": 51.74774,
        "Longitude": 8.75103,
        "DistanceUnit": 0
    },
    "Connections": [
        {
            "ID": 283633,
            "ConnectionTypeID": 25,
            "StatusTypeID": 50,
            "LevelID": 2,
            "PowerKW": 11,
            "CurrentTypeID": 20
        },
        {
            "ID": 283634,
            "ConnectionTypeID": 25,
            "StatusTypeID": 50,
            "LevelID": 2,
            "PowerKW": 11,
            "CurrentTypeID": 20
        }
    ],
    "StatusTypeID": 50,
    "DateLastStatusUpdate": "2021-07-12T02:48:00Z",
    "MetadataValues": [
        {
            "ID": 12787,
            "MetadataFieldID": 4,
            "ItemValue": "Data from the German chargepoint registry provided by Bundesnetzagentur.de under the CC-BY 4.0 license"
        }
    ],
    "DataQualityLevel": 3,
    "DateCreated": "2021-07-08T10:00:00Z",
    "SubmissionStatusTypeID": 100
}