{
    "IsRecentlyVerified": false,
    "ID": 42443,
    "UUID": "4723EA29-9139-4F25-94C9-7244F2495485",
    "DataProviderID": 1,
    "OperatorID": 165,
    "UsageTypeID": 1,
    "UsageCost": "kostenfrei",
    "AddressInfo": {
        "ID": 42789,
        "Title": "Rewe Parkplatz Schwalbach",
        "AddressLine1": "Westring / Ecke Marktplatz",
        "Town": "Schwalbach",
        "StateOrProvince": "Hessen",
        "Postcode": "65824",
        "CountryID": 87,
        "Latitude": 50.15449219051567,
        "Longitude": 8.527131101574703,
        "ContactTelephone1": "0800 1144488",
        "ContactEmail": "online-redaktion@mainova.de",
        "AccessComments": "2 Blau markierte Parkplätze links auf dem Rewe Parkplatz. Zum Laden einfach mit dem Handy die kostenfreie Nummer anrufen und den Ladeprozess starten. Laden zu jeder Zeit möglich.",
        "RelatedURL": "https://www.mainova.de/privatkunden/mobilitaet/stromtankstellen.html",
        "DistanceUnit": 0
    },
    "Connections": [
        {
            "ID": 51090,
            "ConnectionTypeID": 25,
            "StatusTypeID": 50,
            "LevelID": 2,
            "Amps": 32,
            "Voltage": 400,
            "PowerKW": 22,
            "CurrentTypeID": 20,
            "Quantity": 1
        },
        {
            "ID": 51105,
            "ConnectionTypeID": 28,
            "StatusTypeID": 50,
            "LevelID": 2,
            "Amps": 16,
            "Voltage": 230,
            "PowerKW": 3.7,
            "CurrentTypeID": 10,
            "Quantity": 1
        }
    ],
    "NumberOfPoints": 2,
    "StatusTypeID": 50,
    "DateLastStatusUpdate": "2020-11-26T21:37:00Z",
    "DataQualityLevel": 1,
    "DateCreated": "2015-03-11T08:26:00Z",
    "SubmissionStatusTypeID": 200
}