{
    "IsRecentlyVerified": false,
    "ID": 92339,
    "UUID": "644A8965-777F-4804-937B-BECD26817AF6",
    "DataProviderID": 1,
    "OperatorID": 23,
    "OperatorsReference": "33413",
    "UsageTypeID": 4,
    "AddressInfo": {
        "ID": 92685,
        "Title": "Italiana Hotels Florence",
        "AddressLine1": "Italiana Hotels Florence",
        "Postcode": "50126",
        "CountryID": 112,
        "Latitude": 43.757659,
        "Longitude": 11.298544,
        "ContactTelephone1": "+39 055 653 3316",
        "DistanceUnit": 0
    },
    "Connections": [
        {
            "ID": 130882,
            "ConnectionTypeID": 30,
            "StatusTypeID": 50,
            "LevelID": 2,
            "Amps": 32,
            "Voltage": 230,
            "PowerKW": 9,
            "CurrentTypeID": 10,
            "Quantity": 2
        }
    ],
    "NumberOfPoints": 2,
    "GeneralComments": "2 Tesla Connectors, up to 9kW.Available for customers. Please call ahead.",
    "StatusTypeID": 50,
    "DateLastStatusUpdate": "2018-10-03T23:40:00Z",
    "DataQualityLevel": 1,
    "DateCreated": "2017-09-01T05:46:00Z",
    "SubmissionStatusTypeID": 200
}