{
    "IsRecentlyVerified": false,
    "ID": 116227,
    "UUID": "7189561F-F6AD-4AB7-9218-73DCFBF9307F",
    "DataProviderID": 1,
    "DataProvidersReference": "5346",
    "AddressInfo": {
        "ID": 116573,
        "Title": "Pendelstationen Trelleborg",
        "AddressLine1": "Östergatan 50",
        "Town": "TRELLEBORG",
        "StateOrProvince": "SKÅNE",
        "Postcode": "23145",
        "CountryID": 216,
        "Latitude": 55.37077,
        "Longitude": 13.16637,
        "AccessComments": "Pendelstationen i Trelleborg",
        "DistanceUnit": 0
    },
    "Connections": [
        {
            "ID": 163313,
            "ConnectionTypeID": 0,
            "Reference": "1",
            "LevelID": 2,
            "Amps": 32,
            "Voltage": 400,
            "PowerKW": 22,
            "Comments": "Mode 3"
        },
        {
            "ID": 163314,
            "ConnectionTypeID": 0,
            "Reference": "2",
            "LevelID": 2,
            "Amps": 32,
            "Voltage": 400,
            "PowerKW": 22,
            "Comments": "Mode 3"
        },
        {
            "ID": 163315,
            "ConnectionTypeID": 0,
            "Reference": "3",
            "LevelID": 2,
            "Amps": 32,
            "Voltage": 400,
            "PowerKW": 22,
            "Comments": "Mode 3"
        },
        {
            "ID": 163316,
            "ConnectionTypeID": 0,
            "Reference": "4",
            "LevelID": 2,
            "Amps": 32,
            "Voltage": 400,
            "PowerKW": 22,
            "Comments": "Mode 3"
        }
    ],
    "NumberOfPoints": 4,
    "DateLastStatusUpdate": "2020-05-26T08:21:00Z",
    "DataQualityLevel": 2,
    "DateCreated": "2019-02-11T09:16:00Z",
    "SubmissionStatusTypeID": 100
}