{
    "IsRecentlyVerified": false,
    "ID": 173844,
    "UUID": "41A28114-0DAE-4CE9-9349-FF7A82582A48",
    "DataProviderID": 19,
    "DataProvidersReference": "6959",
    "AddressInfo": {
        "ID": 174203,
        "Title": "Ólafsvík (Orkan)",
        "AddressLine1": "Ólafsbraut 27",
        "Town": "Ólafsvík",
        "StateOrProvince": "Vesturland",
        "Postcode": "355",
        "CountryID": 105,
        "Latitude": 64.894332,
        "Longitude": -23.704888,
        "AccessComments": "",
        "DistanceUnit": 0
    },
    "Connections": [
        {
            "ID": 267350,
            "ConnectionTypeID": 25,
            "Reference": "1",
            "LevelID": 3,
            "Amps": 32,
            "Voltage": 400,
            "PowerKW": 22,
            "CurrentTypeID": 30,
            "Comments": "Mode 3"
        },
        {
            "ID": 267351,
            "ConnectionTypeID": 2,
            "Reference": "2",
            "LevelID": 3,
            "Amps": 100,
            "Voltage": 500,
            "PowerKW": 50,
            "CurrentTypeID": 30,
            "Comments": "Mode 4"
        },
        {
            "ID": 267352,
            "ConnectionTypeID": 33,
            "Reference": "3",
            "LevelID": 3,
            "Amps": 100,
            "Voltage": 500,
            "PowerKW": 50,
            "CurrentTypeID": 30,
            "Comments": "Mode 4"
        }
    ],
    "NumberOfPoints": 3,
    "StatusTypeID": 0,
    "DateLastStatusUpdate": "2021-03-04T05:39:00Z",
    "DataQualityLevel": 2,
    "DateCreated": "2021-03-04T05:39:00Z",
    "SubmissionStatusTypeID": 100
}