{
    "IsRecentlyVerified": false,
    "ID": 139288,
    "UUID": "9881EBE7-52F2-4C36-9C27-244DE43E3331",
    "DataProviderID": 2,
    "DataProvidersReference": "143460",
    "OperatorID": 5,
    "UsageTypeID": 1,
    "AddressInfo": {
        "ID": 139640,
        "Title": "LONG BEACH",
        "AddressLine1": "1 Junipero Ave",
        "Town": "Long Beach",
        "StateOrProvince": "CA",
        "Postcode": "90803",
        "CountryID": 2,
        "Latitude": 33.762687,
        "Longitude": -118.164931,
        "ContactTelephone1": "888-758-4389",
        "AccessComments": "24 hours daily",
        "RelatedURL": "http://www.chargepoint.com/",
        "DistanceUnit": 0
    },
    "Connections": [
        {
            "ID": 194594,
            "ConnectionTypeID": 1,
            "LevelID": 2,
            "Amps": 16,
            "Voltage": 230,
            "PowerKW": 3,
            "CurrentTypeID": 10,
            "Quantity": 4
        }
    ],
    "StatusTypeID": 50,
    "DateLastStatusUpdate": "2019-12-24T09:10:00Z",
    "DataQualityLevel": 3,
    "DateCreated": "2019-12-24T09:10:00Z",
    "SubmissionStatusTypeID": 100
}