{
    "IsRecentlyVerified": false,
    "ID": 38296,
    "UUID": "701BC17F-E0C9-4896-81CF-017317E71C51",
    "DataProviderID": 26,
    "DataProvidersReference": "40691",
    "OperatorID": 157,
    "OperatorsReference": "NewMotion 01000355",
    "UsageCost": "0.00 jaarabonnement",
    "AddressInfo": {
        "ID": 38642,
        "Title": "Oosteinde 63",
        "AddressLine1": "Oosteinde 63",
        "Town": "Wormerland",
        "Postcode": "1531 KC",
        "CountryID": 159,
        "Latitude": 52.5020294189453,
        "Longitude": 4.84407758712769,
        "ContactTelephone1": "088 0109500",
        "RelatedURL": "http://thenewmotion.nl/",
        "DistanceUnit": 0
    },
    "Connections": [
        {
            "ID": 41807,
            "ConnectionTypeID": 25,
            "LevelID": 2,
            "PowerKW": 3.7,
            "CurrentTypeID": 10
        }
    ],
    "NumberOfPoints": 1,
    "StatusTypeID": 50,
    "DateLastStatusUpdate": "2016-06-04T02:54:00Z",
    "DataQualityLevel": 3,
    "DateCreated": "2015-01-09T06:07:00Z",
    "SubmissionStatusTypeID": 100
}