{
    "IsRecentlyVerified": false,
    "ID": 20703,
    "UUID": "A1D72D87-61F7-4467-A734-B0A85A325CDE",
    "DataProviderID": 1,
    "OperatorID": 99,
    "UsageTypeID": 1,
    "AddressInfo": {
        "ID": 21048,
        "Title": "Arlbergstrasse",
        "AddressLine1": "Arlbergstrasse 73",
        "Town": "St Anton am Arlberg",
        "Postcode": "6580",
        "CountryID": 19,
        "Latitude": 47.130137,
        "Longitude": 10.269231,
        "DistanceUnit": 0
    },
    "Connections": [
        {
            "ID": 108903,
            "ConnectionTypeID": 25,
            "StatusTypeID": 50,
            "LevelID": 2,
            "Amps": 32,
            "Voltage": 400,
            "PowerKW": 22,
            "CurrentTypeID": 20,
            "Quantity": 1
        }
    ],
    "NumberOfPoints": 1,
    "StatusTypeID": 0,
    "DateLastStatusUpdate": "2016-12-16T12:48:00Z",
    "DataQualityLevel": 2,
    "DateCreated": "2013-12-22T04:37:00Z",
    "SubmissionStatusTypeID": 100
}