{
    "IsRecentlyVerified": false,
    "ID": 89709,
    "UUID": "152A4272-507F-4C92-AF01-E2376901E0DF",
    "DataProviderID": 2,
    "DataProvidersReference": "73143",
    "OperatorID": 5,
    "UsageTypeID": 1,
    "AddressInfo": {
        "ID": 90055,
        "Title": "MASSPORT",
        "AddressLine1": "11 Burr Street Extension",
        "Town": "Framingham",
        "StateOrProvince": "MA",
        "Postcode": "01701",
        "CountryID": 2,
        "Latitude": 42.307357,
        "Longitude": -71.39228,
        "ContactTelephone1": "888-758-4389",
        "AccessComments": "24 hours daily",
        "RelatedURL": "http://www.chargepoint.com/",
        "DistanceUnit": 0
    },
    "Connections": [
        {
            "ID": 127141,
            "ConnectionTypeID": 1,
            "LevelID": 2,
            "Amps": 16,
            "Voltage": 230,
            "PowerKW": 3,
            "CurrentTypeID": 10,
            "Quantity": 4
        }
    ],
    "DateLastStatusUpdate": "2019-12-24T09:20:00Z",
    "DataQualityLevel": 3,
    "DateCreated": "2017-06-22T08:16:00Z",
    "SubmissionStatusTypeID": 100
}