{
    "IsRecentlyVerified": false,
    "ID": 138580,
    "UUID": "8ABD74E8-EB6C-4D0C-8DE4-80BA6BFCB73E",
    "DataProviderID": 2,
    "DataProvidersReference": "96099",
    "OperatorID": 9,
    "UsageTypeID": 1,
    "AddressInfo": {
        "ID": 138929,
        "Title": "Bookmans - Speedway",
        "AddressLine1": "6230 E. Speedway",
        "Town": "Tucson",
        "StateOrProvince": "AZ",
        "Postcode": "85712",
        "CountryID": 2,
        "Latitude": 32.235508,
        "Longitude": -110.859564,
        "ContactTelephone1": "888-998-2546",
        "AccessComments": "MON: 24 hours | TUE: 24 hours | WED: 24 hours | THU: 24 hours | FRI: 24 hours | SAT: 24 hours | SUN: 24 hours",
        "RelatedURL": "http://www.blinkcharging.com/",
        "DistanceUnit": 0
    },
    "Connections": [
        {
            "ID": 193724,
            "ConnectionTypeID": 1,
            "LevelID": 2,
            "Amps": 16,
            "Voltage": 230,
            "PowerKW": 3.7,
            "CurrentTypeID": 10,
            "Quantity": 2
        }
    ],
    "StatusTypeID": 50,
    "DateLastStatusUpdate": "2020-06-26T02:54:00Z",
    "DataQualityLevel": 3,
    "DateCreated": "2019-12-24T09:09:00Z",
    "SubmissionStatusTypeID": 100
}