{
    "IsRecentlyVerified": false,
    "ID": 132380,
    "UUID": "F3C04C2E-4C0F-42ED-9BFE-27E24F1FB34F",
    "DataProviderID": 1,
    "OperatorID": 74,
    "UsageTypeID": 1,
    "AddressInfo": {
        "ID": 132726,
        "Title": "Fastned Prinses Máximaplein",
        "AddressLine1": "Prinses Máximaplein",
        "Town": "Den Haag",
        "Postcode": "2496 XH",
        "CountryID": 159,
        "Latitude": 52.0552053241585,
        "Longitude": 4.39111172879348,
        "RelatedURL": "http://fastned.nl/",
        "DistanceUnit": 0
    },
    "Connections": [
        {
            "ID": 185315,
            "ConnectionTypeID": 33,
            "StatusTypeID": 50,
            "LevelID": 3,
            "PowerKW": 175,
            "CurrentTypeID": 30,
            "Quantity": 2
        },
        {
            "ID": 185316,
            "ConnectionTypeID": 33,
            "StatusTypeID": 50,
            "LevelID": 3,
            "Amps": 125,
            "Voltage": 400,
            "PowerKW": 50,
            "CurrentTypeID": 30,
            "Quantity": 1
        },
        {
            "ID": 185317,
            "ConnectionTypeID": 2,
            "StatusTypeID": 50,
            "LevelID": 3,
            "PowerKW": 50,
            "CurrentTypeID": 30,
            "Quantity": 1
        },
        {
            "ID": 185318,
            "ConnectionTypeID": 1036,
            "StatusTypeID": 50,
            "LevelID": 3,
            "Amps": 63,
            "Voltage": 400,
            "PowerKW": 43,
            "CurrentTypeID": 20,
            "Quantity": 1
        }
    ],
    "NumberOfPoints": 4,
    "StatusTypeID": 50,
    "DateLastStatusUpdate": "2019-09-28T14:22:00Z",
    "DataQualityLevel": 1,
    "DateCreated": "2019-09-28T10:05:00Z",
    "SubmissionStatusTypeID": 200
}