{
    "IsRecentlyVerified": false,
    "ID": 119395,
    "UUID": "644F058E-F6DE-4CFD-BA18-B420732551AB",
    "DataProviderID": 2,
    "DataProvidersReference": "45961",
    "OperatorID": 107,
    "UsageTypeID": 2,
    "AddressInfo": {
        "ID": 119741,
        "Title": "Alamo Rent-A-Car - Kahului Airport",
        "AddressLine1": "905 E Mokuea Pl",
        "Town": "Kahului",
        "StateOrProvince": "HI",
        "Postcode": "96732",
        "CountryID": 2,
        "Latitude": 20.894507,
        "Longitude": -156.440844,
        "ContactTelephone1": "650-845-2869",
        "AccessComments": "Alamo business hours; reserved for Alamo vehicles; open to public as available",
        "RelatedURL": "http://www.opconnect.com/",
        "DistanceUnit": 0
    },
    "Connections": [
        {
            "ID": 168649,
            "ConnectionTypeID": 1,
            "LevelID": 2,
            "Amps": 16,
            "Voltage": 230,
            "PowerKW": 3.7,
            "CurrentTypeID": 10,
            "Quantity": 2
        }
    ],
    "DateLastStatusUpdate": "2020-06-26T02:52:00Z",
    "DataQualityLevel": 3,
    "DateCreated": "2019-04-01T04:59:00Z",
    "SubmissionStatusTypeID": 100
}