{
    "IsRecentlyVerified": false,
    "ID": 119556,
    "UUID": "2CAB9E78-2B7B-40FB-A46A-EE9D466EB788",
    "DataProviderID": 2,
    "DataProvidersReference": "75302",
    "OperatorID": 5,
    "UsageTypeID": 1,
    "AddressInfo": {
        "ID": 119902,
        "Title": "5260 PASEO PKG",
        "AddressLine1": "5252 paseo blvd",
        "Town": "Doral",
        "StateOrProvince": "FL",
        "Postcode": "33166",
        "CountryID": 2,
        "Latitude": 25.8193784,
        "Longitude": -80.3363364,
        "ContactTelephone1": "888-758-4389",
        "AccessComments": "24 hours daily",
        "RelatedURL": "http://www.chargepoint.com/",
        "DistanceUnit": 0
    },
    "Connections": [
        {
            "ID": 168830,
            "ConnectionTypeID": 1,
            "LevelID": 2,
            "Amps": 16,
            "Voltage": 230,
            "PowerKW": 3,
            "CurrentTypeID": 10,
            "Quantity": 2
        }
    ],
    "DateLastStatusUpdate": "2019-12-24T09:08:00Z",
    "DataQualityLevel": 3,
    "DateCreated": "2019-04-01T04:59:00Z",
    "SubmissionStatusTypeID": 100
}