{
    "IsRecentlyVerified": false,
    "ID": 119886,
    "UUID": "4393B0CC-F399-4898-A22D-D0BF253BDC7F",
    "DataProviderID": 2,
    "DataProvidersReference": "70971",
    "OperatorID": 5,
    "UsageTypeID": 1,
    "AddressInfo": {
        "ID": 120232,
        "Title": "LOFTS SAVANNAH",
        "AddressLine1": "5711 Byron Anthony Place",
        "Town": "Sanford",
        "StateOrProvince": "FL",
        "Postcode": "32771",
        "CountryID": 2,
        "Latitude": 28.8040561,
        "Longitude": -81.3488668,
        "ContactTelephone1": "888-758-4389",
        "AccessComments": "24 hours daily",
        "RelatedURL": "http://www.chargepoint.com/",
        "DistanceUnit": 0
    },
    "Connections": [
        {
            "ID": 169183,
            "ConnectionTypeID": 1,
            "LevelID": 2,
            "Amps": 16,
            "Voltage": 230,
            "PowerKW": 3,
            "CurrentTypeID": 10,
            "Quantity": 2
        }
    ],
    "DateLastStatusUpdate": "2019-12-24T09:08:00Z",
    "DataQualityLevel": 3,
    "DateCreated": "2019-04-01T04:59:00Z",
    "SubmissionStatusTypeID": 100
}