{
    "IsRecentlyVerified": false,
    "ID": 158739,
    "UUID": "AD910436-BA07-4414-A4CD-D9B9F1F02725",
    "DataProviderID": 2,
    "DataProvidersReference": "163591",
    "OperatorID": 59,
    "UsageTypeID": 1,
    "AddressInfo": {
        "ID": 159096,
        "Title": "Greenlots - 12513A",
        "AddressLine1": "676 S Rampart Blvd",
        "Town": "Los Angeles",
        "StateOrProvince": "CA",
        "Postcode": "90057",
        "CountryID": 2,
        "Latitude": 34.0599746704102,
        "Longitude": -118.282859802246,
        "ContactTelephone1": "855-900-7584",
        "AccessComments": "24 hours daily",
        "RelatedURL": "http://greenlots.com/",
        "DistanceUnit": 0
    },
    "Connections": [
        {
            "ID": 228764,
            "ConnectionTypeID": 1,
            "LevelID": 2,
            "Amps": 16,
            "Voltage": 230,
            "PowerKW": 3.7,
            "CurrentTypeID": 10,
            "Quantity": 1
        }
    ],
    "StatusTypeID": 50,
    "DateLastStatusUpdate": "2020-06-26T02:56:00Z",
    "DataQualityLevel": 3,
    "DateCreated": "2020-06-26T02:56:00Z",
    "SubmissionStatusTypeID": 100
}