{
    "IsRecentlyVerified": false,
    "ID": 137818,
    "UUID": "CA9E11B9-0E0B-496D-A744-6658C4204D8D",
    "DataProviderID": 2,
    "DataProvidersReference": "121267",
    "OperatorID": 5,
    "UsageTypeID": 1,
    "AddressInfo": {
        "ID": 138167,
        "Title": "TAWS",
        "AddressLine1": "5201 N O'Connor Blvd",
        "Town": "Irving",
        "StateOrProvince": "TX",
        "Postcode": "75039",
        "CountryID": 2,
        "Latitude": 32.8704927,
        "Longitude": -96.9399901,
        "ContactTelephone1": "888-758-4389",
        "AccessComments": "24 hours daily",
        "RelatedURL": "http://www.chargepoint.com/",
        "DistanceUnit": 0
    },
    "Connections": [
        {
            "ID": 192825,
            "ConnectionTypeID": 1,
            "LevelID": 2,
            "Amps": 16,
            "Voltage": 230,
            "PowerKW": 3,
            "CurrentTypeID": 10,
            "Quantity": 2
        }
    ],
    "StatusTypeID": 50,
    "DateLastStatusUpdate": "2019-12-24T09:06:00Z",
    "DataQualityLevel": 3,
    "DateCreated": "2019-12-24T09:06:00Z",
    "SubmissionStatusTypeID": 100
}