{
    "IsRecentlyVerified": false,
    "ID": 17399,
    "UUID": "3D7E9976-7C34-4FA0-A497-BBC3F8AFB568",
    "DataProviderID": 22,
    "DataProvidersReference": "F38575EE8AF23BA6D923C0D98EE767FC",
    "AddressInfo": {
        "ID": 17744,
        "Title": "兵庫日産自動車三木店",
        "AddressLine1": "兵庫県三木市福井2138番地1",
        "CountryID": 114,
        "Latitude": 34.78170636,
        "Longitude": 134.9920618,
        "ContactTelephone1": "0794-82-9232",
        "DistanceUnit": 0
    },
    "Connections": [
        {
            "ID": 17640,
            "ConnectionTypeID": 2,
            "LevelID": 2,
            "Amps": 100,
            "Voltage": 480,
            "PowerKW": 48,
            "Quantity": 1
        }
    ],
    "DateLastStatusUpdate": "2013-06-29T08:57:00Z",
    "DataQualityLevel": 2,
    "DateCreated": "2013-06-29T08:57:00Z",
    "SubmissionStatusTypeID": 200
}