{
    "IsRecentlyVerified": false,
    "ID": 70344,
    "UUID": "C234324F-4E7D-4EDB-BE07-0AEEFA25639C",
    "DataProviderID": 1,
    "DataProvidersReference": "3458",
    "AddressInfo": {
        "ID": 70690,
        "Title": "K-citymarket Mäntsälä",
        "AddressLine1": "Sälinkääntie 2",
        "Town": "Mäntsälä Keskus",
        "StateOrProvince": "Uusimaa",
        "Postcode": "04600",
        "CountryID": 79,
        "Latitude": 60.63753,
        "Longitude": 25.31795,
        "AccessComments": "Parkkihallissa, sisäänajoväylän vieressä",
        "DistanceUnit": 0
    },
    "Connections": [
        {
            "ID": 100430,
            "ConnectionTypeID": 0,
            "Reference": "1",
            "LevelID": 2,
            "Amps": 32,
            "Voltage": 230,
            "PowerKW": 7.4,
            "Comments": "Mode 3"
        },
        {
            "ID": 100431,
            "ConnectionTypeID": 0,
            "Reference": "2",
            "LevelID": 2,
            "Amps": 32,
            "Voltage": 230,
            "PowerKW": 7.4,
            "Comments": "Mode 3"
        },
        {
            "ID": 100432,
            "ConnectionTypeID": 0,
            "Reference": "3",
            "LevelID": 2,
            "Amps": 32,
            "Voltage": 230,
            "PowerKW": 7.4,
            "Comments": "Mode 3"
        },
        {
            "ID": 100433,
            "ConnectionTypeID": 0,
            "Reference": "4",
            "LevelID": 2,
            "Amps": 32,
            "Voltage": 230,
            "PowerKW": 7.4,
            "Comments": "Mode 3"
        }
    ],
    "NumberOfPoints": 4,
    "DateLastStatusUpdate": "2020-05-26T08:24:00Z",
    "DataQualityLevel": 2,
    "DateCreated": "2016-07-14T01:51:00Z",
    "SubmissionStatusTypeID": 100
}