{
    "IsRecentlyVerified": false,
    "ID": 8820,
    "UUID": "DFB9DD4F-B4B1-4DB2-B32B-1397BF54EF5A",
    "DataProviderID": 15,
    "DataProvidersReference": "12214",
    "OperatorID": 5,
    "AddressInfo": {
        "ID": 8717,
        "Title": "930 Elk Grove Town Center",
        "AddressLine1": "930 Elk Grove Town Center",
        "Town": "Elk Grove Village",
        "StateOrProvince": "Illinois",
        "Postcode": "60007",
        "CountryID": 2,
        "Latitude": 42.00311661,
        "Longitude": -88.00589752,
        "ContactTelephone1": "",
        "RelatedURL": "http://carstations.com/12214",
        "DistanceUnit": 0
    },
    "Connections": [
        {
            "ID": 6354,
            "ConnectionTypeID": 1,
            "Reference": "J1772",
            "LevelID": 2
        },
        {
            "ID": 9079,
            "ConnectionTypeID": 9,
            "Reference": "NEMA5",
            "Quantity": 1
        }
    ],
    "StatusTypeID": 0,
    "DateLastStatusUpdate": "2017-11-04T14:04:00Z",
    "DataQualityLevel": 1,
    "DateCreated": "2011-12-02T14:14:00Z",
    "SubmissionStatusTypeID": 100
}