{
    "IsRecentlyVerified": false,
    "ID": 116164,
    "UUID": "F9D60D7B-9C99-45E2-8E27-CD518F2891E2",
    "DataProviderID": 2,
    "DataProvidersReference": "105138",
    "OperatorID": 9,
    "UsageTypeID": 1,
    "AddressInfo": {
        "ID": 116510,
        "Title": "Somerset Gardens Apartments",
        "AddressLine1": "14700 NE 29th Pl",
        "Town": "Bellevue",
        "StateOrProvince": "WA",
        "Postcode": "98007",
        "CountryID": 2,
        "Latitude": 47.636676,
        "Longitude": -122.14,
        "ContactTelephone1": "888-998-2546",
        "AccessComments": "MON: 24 hours | TUE: 24 hours | WED: 24 hours | THU: 24 hours | FRI: 24 hours | SAT: 24 hours | SUN: 24 hours",
        "RelatedURL": "http://www.blinkcharging.com/",
        "DistanceUnit": 0
    },
    "Connections": [
        {
            "ID": 163235,
            "ConnectionTypeID": 1,
            "LevelID": 2,
            "Amps": 16,
            "Voltage": 230,
            "PowerKW": 3.7,
            "CurrentTypeID": 10,
            "Quantity": 1
        }
    ],
    "DateLastStatusUpdate": "2020-06-26T03:11:00Z",
    "DataQualityLevel": 3,
    "DateCreated": "2019-02-11T07:13:00Z",
    "SubmissionStatusTypeID": 100
}