{
    "IsRecentlyVerified": false,
    "ID": 118267,
    "UUID": "4CB6E21F-A82C-4B40-A3A6-483B4D109226",
    "DataProviderID": 1,
    "OperatorID": 3315,
    "OperatorsReference": "51574,51574",
    "UsageTypeID": 4,
    "UsageCost": "Free",
    "AddressInfo": {
        "ID": 118613,
        "Title": "Latheron Lane Car Park",
        "AddressLine1": "Latheron Lane",
        "Town": "Ullapool",
        "Postcode": "IV26 2XB",
        "CountryID": 1,
        "Latitude": 57.897551,
        "Longitude": -5.16565,
        "DistanceUnit": 0
    },
    "Connections": [
        {
            "ID": 167338,
            "ConnectionTypeID": 33,
            "StatusTypeID": 50,
            "LevelID": 3,
            "PowerKW": 50,
            "CurrentTypeID": 30,
            "Quantity": 1
        },
        {
            "ID": 167339,
            "ConnectionTypeID": 2,
            "StatusTypeID": 50,
            "LevelID": 3,
            "PowerKW": 50,
            "CurrentTypeID": 30,
            "Quantity": 1
        },
        {
            "ID": 167340,
            "ConnectionTypeID": 1036,
            "StatusTypeID": 50,
            "LevelID": 3,
            "PowerKW": 43,
            "CurrentTypeID": 20,
            "Quantity": 1
        }
    ],
    "NumberOfPoints": 1,
    "StatusTypeID": 50,
    "DateLastStatusUpdate": "2019-10-03T05:13:00Z",
    "DataQualityLevel": 1,
    "DateCreated": "2019-03-20T11:00:00Z",
    "SubmissionStatusTypeID": 200
}