{
    "IsRecentlyVerified": false,
    "ID": 38511,
    "UUID": "34828408-320B-4877-B433-4A4C0708AF17",
    "DataProviderID": 26,
    "DataProvidersReference": "47738",
    "OperatorID": 178,
    "OperatorsReference": "EVnetNL AL884",
    "UsageCost": "0.00 jaarabonnement",
    "AddressInfo": {
        "ID": 38857,
        "Title": "Burgemeester Berghuisplein",
        "AddressLine1": "Burgemeester Berghuisplein",
        "Town": "Kampen",
        "Postcode": "8261 DB",
        "CountryID": 159,
        "Latitude": 52.5521,
        "Longitude": 5.914074,
        "ContactTelephone1": "0800-3522365",
        "RelatedURL": "http://www.evnet.nl",
        "DistanceUnit": 0
    },
    "Connections": [
        {
            "ID": 42022,
            "ConnectionTypeID": 25,
            "LevelID": 2,
            "PowerKW": 11,
            "CurrentTypeID": 10
        }
    ],
    "NumberOfPoints": 2,
    "StatusTypeID": 50,
    "DateLastStatusUpdate": "2016-06-04T02:55:00Z",
    "DataQualityLevel": 3,
    "DateCreated": "2015-01-09T06:07:00Z",
    "SubmissionStatusTypeID": 100
}