{
    "IsRecentlyVerified": false,
    "ID": 167945,
    "UUID": "6AE370FC-9A16-4159-92B4-0C63BC3F762B",
    "DataProviderID": 18,
    "DataProvidersReference": "966056f41ee26992aa6f06a7d398e4e6",
    "OperatorID": 3391,
    "UsageTypeID": 1,
    "AddressInfo": {
        "ID": 168304,
        "Title": "Luther Street",
        "AddressLine1": "Luther Street",
        "Town": "Brighton",
        "Postcode": "BN2 9XA",
        "CountryID": 1,
        "Latitude": 50.831182,
        "Longitude": -0.123638,
        "AccessComments": "",
        "RelatedURL": "https://www.electricblueuk.com/",
        "DistanceUnit": 0
    },
    "Connections": [
        {
            "ID": 254973,
            "ConnectionTypeID": 25,
            "Reference": "62196-2 (SINGLE PHASE)",
            "StatusTypeID": 50,
            "LevelID": 2,
            "Amps": 16,
            "Voltage": 230,
            "PowerKW": 3.7,
            "CurrentTypeID": 10
        }
    ],
    "StatusTypeID": 0,
    "DateLastStatusUpdate": "2020-09-17T21:03:00Z",
    "MetadataValues": [
        {
            "ID": 7989,
            "MetadataFieldID": 4,
            "ItemValue": "Contains public sector information licensed under the Open Government Licence v2.0. http://www.nationalarchives.gov.uk/doc/open-government-licence/version/2/"
        }
    ],
    "DataQualityLevel": 3,
    "DateCreated": "2020-09-17T21:03:00Z",
    "SubmissionStatusTypeID": 100
}