{
    "IsRecentlyVerified": false,
    "ID": 32477,
    "UUID": "19CE9713-2C49-4BD6-8D20-83584519F351",
    "DataProviderID": 1,
    "OperatorID": 105,
    "OperatorsReference": "Essent EM-DE-05158020-01-00001",
    "UsageTypeID": 4,
    "AddressInfo": {
        "ID": 32823,
        "Title": "Parkplatz Sparkasse",
        "AddressLine1": "Solingerstraße 72",
        "Town": "Langenfeld (Rheinland)",
        "Postcode": "40764",
        "CountryID": 87,
        "Latitude": 51.112778,
        "Longitude": 6.953056,
        "DistanceUnit": 0
    },
    "Connections": [
        {
            "ID": 35988,
            "ConnectionTypeID": 25,
            "LevelID": 2,
            "PowerKW": 22,
            "Quantity": 2
        }
    ],
    "NumberOfPoints": 2,
    "StatusTypeID": 50,
    "DateLastStatusUpdate": "2018-04-24T14:05:00Z",
    "DataQualityLevel": 3,
    "DateCreated": "2015-01-09T06:03:00Z",
    "SubmissionStatusTypeID": 200
}