{
    "IsRecentlyVerified": false,
    "ID": 55010,
    "UUID": "82A49A25-4EB8-45A4-B435-44C607F5D5A7",
    "DataProviderID": 1,
    "OperatorID": 45,
    "UsageTypeID": 1,
    "UsageCost": "0",
    "AddressInfo": {
        "ID": 55356,
        "Title": "Ladestation Wiesent",
        "AddressLine1": "Bachgasse 2",
        "Town": "Wiesent",
        "StateOrProvince": "Landkreis Regensburg",
        "Postcode": "93109",
        "CountryID": 87,
        "Latitude": 49.0063356847488,
        "Longitude": 12.3792189803566,
        "AccessComments": "Auf dem Parkplatz Bürgerhaus, 24/7 nutzbar ohne Ladekarte, für E-Bikes und langsam ladende Elektroautos.",
        "RelatedURL": "http://www.wiesent.de/",
        "DistanceUnit": 0
    },
    "Connections": [
        {
            "ID": 69508,
            "ConnectionTypeID": 16,
            "StatusTypeID": 50,
            "LevelID": 2,
            "Amps": 16,
            "Voltage": 230,
            "PowerKW": 3.7,
            "CurrentTypeID": 10,
            "Quantity": 1
        },
        {
            "ID": 69509,
            "ConnectionTypeID": 28,
            "StatusTypeID": 50,
            "LevelID": 2,
            "Amps": 16,
            "Voltage": 230,
            "PowerKW": 3.7,
            "CurrentTypeID": 10,
            "Quantity": 2
        }
    ],
    "NumberOfPoints": 3,
    "StatusTypeID": 50,
    "DateLastStatusUpdate": "2015-10-12T17:21:00Z",
    "DataQualityLevel": 1,
    "DateCreated": "2015-10-12T06:31:00Z",
    "SubmissionStatusTypeID": 200
}