{
    "IsRecentlyVerified": false,
    "ID": 62616,
    "UUID": "907CDA68-B7E7-4C95-9614-C9D771E8604F",
    "DataProviderID": 26,
    "DataProvidersReference": "19757",
    "OperatorID": 162,
    "OperatorsReference": "ホームズ横須賀店家具センター",
    "UsageCost": "0.00 onbekend",
    "AddressInfo": {
        "ID": 62962,
        "Title": "横須賀海岸通り (Yokosukakaigan-dori); よこすか海岸通り",
        "AddressLine1": "横須賀海岸通り (Yokosukakaigan-dori); よこすか海岸通り",
        "Town": "三浦郡",
        "Postcode": "238-0013",
        "CountryID": 114,
        "Latitude": 35.275303,
        "Longitude": 139.682022,
        "DistanceUnit": 0
    },
    "Connections": [
        {
            "ID": 79538,
            "ConnectionTypeID": 2,
            "LevelID": 3,
            "PowerKW": 50,
            "CurrentTypeID": 30
        }
    ],
    "NumberOfPoints": 1,
    "StatusTypeID": 50,
    "DateLastStatusUpdate": "2016-03-03T12:28:00Z",
    "DataQualityLevel": 3,
    "DateCreated": "2016-03-03T12:28:00Z",
    "SubmissionStatusTypeID": 100
}