{
    "IsRecentlyVerified": false,
    "ID": 183999,
    "UUID": "F13C184A-BE39-4742-A663-36C3A0A537CF",
    "DataProviderID": 29,
    "DataProvidersReference": "2091,11192",
    "OperatorID": 69,
    "AddressInfo": {
        "ID": 184358,
        "Title": "Kommenderiestraße 74",
        "AddressLine1": "Kommenderiestraße 74",
        "Town": "Osnabrück",
        "Postcode": "49074",
        "CountryID": 87,
        "Latitude": 52.268,
        "Longitude": 8.051,
        "DistanceUnit": 0
    },
    "Connections": [
        {
            "ID": 291679,
            "ConnectionTypeID": 25,
            "StatusTypeID": 50,
            "LevelID": 2,
            "PowerKW": 11,
            "CurrentTypeID": 20
        },
        {
            "ID": 291680,
            "ConnectionTypeID": 25,
            "StatusTypeID": 50,
            "LevelID": 2,
            "PowerKW": 22,
            "CurrentTypeID": 20
        }
    ],
    "StatusTypeID": 50,
    "DateLastStatusUpdate": "2021-07-09T03:26:00Z",
    "MetadataValues": [
        {
            "ID": 16292,
            "MetadataFieldID": 4,
            "ItemValue": "Data from the German chargepoint registry provided by Bundesnetzagentur.de under the CC-BY 4.0 license"
        }
    ],
    "DataQualityLevel": 3,
    "DateCreated": "2021-07-08T10:04:00Z",
    "SubmissionStatusTypeID": 100
}