{
    "IsRecentlyVerified": false,
    "ID": 62507,
    "UUID": "8F31B30D-D000-4F5E-8D3A-AA12575E941B",
    "DataProviderID": 1,
    "OperatorID": 23,
    "OperatorsReference": "13081",
    "UsageTypeID": 1,
    "UsageCost": "Free",
    "AddressInfo": {
        "ID": 62853,
        "Title": "Oxford Suites Spokane",
        "AddressLine1": "115 W North River Dr",
        "Town": "Spokane",
        "StateOrProvince": "WA",
        "Postcode": "99201",
        "CountryID": 2,
        "Latitude": 47.6634997,
        "Longitude": -117.412423,
        "ContactTelephone1": "509-353-9000  877-798-3752",
        "AccessComments": "24 hours daily; for guest use only; see front desk for access",
        "RelatedURL": "http://www.teslamotors.com/supercharger",
        "DistanceUnit": 0
    },
    "Connections": [
        {
            "ID": 79413,
            "ConnectionTypeID": 30,
            "StatusTypeID": 50,
            "LevelID": 2,
            "Amps": 16,
            "Voltage": 230,
            "PowerKW": 16,
            "CurrentTypeID": 10,
            "Quantity": 2
        }
    ],
    "NumberOfPoints": 2,
    "StatusTypeID": 50,
    "DateLastStatusUpdate": "2017-01-31T22:25:00Z",
    "DataQualityLevel": 3,
    "DateCreated": "2016-03-03T11:39:00Z",
    "SubmissionStatusTypeID": 100
}