{
    "IsRecentlyVerified": false,
    "ID": 154133,
    "UUID": "53F51553-A759-4D48-8402-C524F5BBAD35",
    "DataProviderID": 28,
    "DataProvidersReference": "FR*S60*PSTMAX8MAI",
    "OperatorID": 3379,
    "UsageTypeID": 5,
    "AddressInfo": {
        "ID": 154486,
        "Title": "Saint-Maximin, 8 Mai 1945",
        "AddressLine1": "4 rue du 8 Mai 1945 60740 Saint-Maximin",
        "CountryID": 80,
        "Latitude": 49.2214,
        "Longitude": 2.44549,
        "AccessComments": "24h/24 7j/7",
        "DistanceUnit": 0
    },
    "Connections": [
        {
            "ID": 216620,
            "ConnectionTypeID": 1036,
            "StatusTypeID": 50,
            "LevelID": 2,
            "PowerKW": 22,
            "CurrentTypeID": 20
        },
        {
            "ID": 250991,
            "ConnectionTypeID": 1036,
            "StatusTypeID": 50,
            "LevelID": 2,
            "PowerKW": 22,
            "CurrentTypeID": 20
        }
    ],
    "GeneralComments": "",
    "StatusTypeID": 50,
    "DateLastStatusUpdate": "2020-08-27T05:16:00Z",
    "DataQualityLevel": 2,
    "DateCreated": "2020-03-15T10:54:00Z",
    "SubmissionStatusTypeID": 100
}