{
    "UserComments": [
        {
            "ID": 3831,
            "ChargePointID": 41207,
            "CommentTypeID": 10,
            "UserName": "Anon74856763534",
            "Comment": "Pool car parked but not plugged in (probably discourages ICE'ing though as it least it's seen to be being used!).",
            "Rating": 4,
            "DateCreated": "2015-02-21T12:54:22.397Z",
            "User": {
                "ID": 1192,
                "Username": "Anon74856763534"
            },
            "CheckinStatusTypeID": 10
        }
    ],
    "MediaItems": [
        {
            "ID": 1014,
            "ChargePointID": 41207,
            "ItemURL": "https://s3-ap-southeast-2.amazonaws.com/openchargemap/images/GB/OCM41207/OCM-41207.orig.2015022112495006.jpg",
            "ItemThumbnailURL": "https://s3-ap-southeast-2.amazonaws.com/openchargemap/images/GB/OCM41207/OCM-41207.thmb.2015022112495006.jpg",
            "Comment": "",
            "IsEnabled": true,
            "IsVideo": false,
            "IsFeaturedItem": false,
            "IsExternalResource": false,
            "User": {
                "ID": 1192,
                "Username": "Anon74856763534"
            },
            "DateCreated": "2015-02-21T12:50:00Z"
        }
    ],
    "IsRecentlyVerified": false,
    "ID": 41207,
    "UUID": "1A60EC4A-3FA3-44B6-8786-6C3A04C16947",
    "DataProviderID": 1,
    "OperatorID": 3315,
    "OperatorsReference": "50748",
    "UsageTypeID": 4,
    "UsageCost": "Free",
    "AddressInfo": {
        "ID": 41553,
        "Title": "McKillop Institute",
        "AddressLine1": "Main Street",
        "Town": "Lochwinnoch",
        "StateOrProvince": "Renfrewshire",
        "Postcode": "PA12 4AJ",
        "CountryID": 1,
        "Latitude": 55.7949413226564,
        "Longitude": -4.63030599668127,
        "ContactTelephone1": "01505 842261",
        "DistanceUnit": 0
    },
    "Connections": [
        {
            "ID": 44995,
            "ConnectionTypeID": 25,
            "StatusTypeID": 50,
            "LevelID": 2,
            "Amps": 32,
            "Voltage": 400,
            "PowerKW": 7,
            "CurrentTypeID": 20,
            "Quantity": 2
        }
    ],
    "NumberOfPoints": 2,
    "StatusTypeID": 50,
    "DateLastStatusUpdate": "2020-01-21T06:17:00Z",
    "DataQualityLevel": 1,
    "DateCreated": "2015-01-28T09:57:00Z",
    "SubmissionStatusTypeID": 200
}