{
    "IsRecentlyVerified": false,
    "ID": 154629,
    "UUID": "D556CBD1-1732-4B73-ADA9-F5A981EE72BA",
    "DataProviderID": 1,
    "OperatorID": 20,
    "UsageTypeID": 4,
    "AddressInfo": {
        "ID": 154982,
        "Title": "RHS of reception entrance",
        "AddressLine1": "Geddington Road",
        "Town": "Corby",
        "Postcode": "NN18 8ET",
        "CountryID": 1,
        "Latitude": 52.482572,
        "Longitude": -0.658863,
        "AccessComments": "RHS of reception entrance. Access for Hotel and Restaurant patrons only. Please report to reception. Fitted under Midlands PiP, ",
        "RelatedURL": "http://www.chargeyourcar.org.uk",
        "DistanceUnit": 0
    },
    "Connections": [
        {
            "ID": 217526,
            "ConnectionTypeID": 25,
            "Reference": "0",
            "StatusTypeID": 50,
            "LevelID": 2,
            "Amps": 32,
            "Voltage": 400,
            "PowerKW": 22,
            "CurrentTypeID": 20,
            "Quantity": 1
        },
        {
            "ID": 217527,
            "ConnectionTypeID": 25,
            "Reference": "1",
            "StatusTypeID": 50,
            "LevelID": 2,
            "Amps": 32,
            "Voltage": 400,
            "PowerKW": 22,
            "CurrentTypeID": 20,
            "Quantity": 1
        }
    ],
    "StatusTypeID": 50,
    "DateLastStatusUpdate": "2020-10-11T03:44:00Z",
    "MetadataValues": [
        {
            "ID": 7181,
            "MetadataFieldID": 4,
            "ItemValue": "Contains public sector information licensed under the Open Government Licence v2.0. http://www.nationalarchives.gov.uk/doc/open-government-licence/version/2/"
        }
    ],
    "DataQualityLevel": 3,
    "DateCreated": "2020-03-17T08:15:00Z",
    "SubmissionStatusTypeID": 100
}