{
    "IsRecentlyVerified": false,
    "ID": 9874,
    "UUID": "7A7FFA94-FEA7-4D28-970C-14D03315293C",
    "DataProviderID": 15,
    "DataProvidersReference": "17356",
    "OperatorID": 5,
    "UsageTypeID": 1,
    "AddressInfo": {
        "ID": 9771,
        "Title": "2560 W Ball Rd",
        "AddressLine1": "2560 W Ball Rd",
        "Town": "Anaheim",
        "StateOrProvince": "California",
        "Postcode": "92804",
        "CountryID": 2,
        "Latitude": 33.81708,
        "Longitude": -117.97463,
        "ContactTelephone1": "(714) 229-9081",
        "RelatedURL": "http://carstations.com/17356",
        "DistanceUnit": 0
    },
    "Connections": [
        {
            "ID": 7726,
            "ConnectionTypeID": 1,
            "Reference": "J1772",
            "LevelID": 2
        }
    ],
    "NumberOfPoints": 1,
    "StatusTypeID": 50,
    "DateLastStatusUpdate": "2017-11-04T14:04:00Z",
    "DataQualityLevel": 2,
    "DateCreated": "2012-05-01T20:37:00Z",
    "SubmissionStatusTypeID": 100
}