{
    "IsRecentlyVerified": false,
    "ID": 142575,
    "UUID": "24E1148B-24E4-4D1F-BDF1-2B75D2049CBF",
    "DataProviderID": 2,
    "DataProvidersReference": "104699",
    "OperatorID": 5,
    "UsageTypeID": 1,
    "AddressInfo": {
        "ID": 142927,
        "Title": "MAIN LOT",
        "AddressLine1": "112 Main St",
        "Town": "Dobbs Ferry",
        "StateOrProvince": "NY",
        "Postcode": "10522",
        "CountryID": 2,
        "Latitude": 41.0156911,
        "Longitude": -73.8745317,
        "ContactTelephone1": "888-758-4389",
        "AccessComments": "24 hours daily",
        "RelatedURL": "http://www.chargepoint.com/",
        "DistanceUnit": 0
    },
    "Connections": [
        {
            "ID": 198740,
            "ConnectionTypeID": 1,
            "LevelID": 2,
            "Amps": 16,
            "Voltage": 230,
            "PowerKW": 3,
            "CurrentTypeID": 10,
            "Quantity": 2
        }
    ],
    "StatusTypeID": 50,
    "DateLastStatusUpdate": "2019-12-24T09:18:00Z",
    "DataQualityLevel": 3,
    "DateCreated": "2019-12-24T09:18:00Z",
    "SubmissionStatusTypeID": 100
}