{
    "IsRecentlyVerified": false,
    "ID": 32412,
    "UUID": "274CC9A6-3DCC-44FF-B821-57A6B8799DDF",
    "DataProviderID": 1,
    "OperatorID": 156,
    "OperatorsReference": "NewMotion 02009415",
    "UsageTypeID": 4,
    "UsageCost": "",
    "AddressInfo": {
        "ID": 32758,
        "Title": "Großlugaer Str. 22",
        "AddressLine1": "Großlugaer Str. 22",
        "AddressLine2": "",
        "Town": "Heidenau",
        "StateOrProvince": "",
        "Postcode": "1809",
        "CountryID": 87,
        "Latitude": 50.9828186035156,
        "Longitude": 13.839469909668,
        "ContactTelephone1": "",
        "ContactTelephone2": "",
        "ContactEmail": "",
        "AccessComments": "",
        "RelatedURL": "",
        "DistanceUnit": 0
    },
    "Connections": [
        {
            "ID": 35923,
            "ConnectionTypeID": 25,
            "StatusTypeID": 0,
            "LevelID": 2,
            "PowerKW": 37,
            "CurrentTypeID": 10
        }
    ],
    "NumberOfPoints": 1,
    "GeneralComments": "",
    "StatusTypeID": 50,
    "DateLastStatusUpdate": "2015-06-12T21:53:00Z",
    "DataQualityLevel": 3,
    "DateCreated": "2015-01-09T06:03:00Z",
    "SubmissionStatusTypeID": 200
}