{
    "IsRecentlyVerified": false,
    "ID": 51146,
    "UUID": "ACC54BFE-F5B2-4509-B1B0-E4CAFAE2D427",
    "DataProviderID": 1,
    "OperatorID": 115,
    "UsageTypeID": 4,
    "AddressInfo": {
        "ID": 51492,
        "Title": "Arkády Pankrác",
        "AddressLine1": "Na Pankráci 86",
        "Town": "Praha",
        "Postcode": "140 00",
        "CountryID": 64,
        "Latitude": 50.0511586,
        "Longitude": 14.4391031,
        "RelatedURL": "http://www.elektromobilita.cz/",
        "DistanceUnit": 0
    },
    "Connections": [
        {
            "ID": 63292,
            "ConnectionTypeID": 25,
            "StatusTypeID": 50,
            "LevelID": 2,
            "Amps": 32,
            "Voltage": 400,
            "PowerKW": 22,
            "CurrentTypeID": 20,
            "Quantity": 1
        },
        {
            "ID": 63293,
            "ConnectionTypeID": 23,
            "StatusTypeID": 50,
            "LevelID": 2,
            "Amps": 16,
            "Voltage": 230,
            "PowerKW": 3.6,
            "CurrentTypeID": 10,
            "Quantity": 1
        }
    ],
    "NumberOfPoints": 1,
    "GeneralComments": "CZ: Placená, je potřebná smlouva pro získání RFID karty od ČEZu (paušální platba) .\r\nEN: Paid, contract needed to get an RFID card from ČEZ (flat payment).",
    "StatusTypeID": 50,
    "DateLastStatusUpdate": "2017-12-01T11:50:00Z",
    "DataQualityLevel": 1,
    "DateCreated": "2015-07-23T04:34:00Z",
    "SubmissionStatusTypeID": 200
}