{
    "IsRecentlyVerified": false,
    "ID": 99763,
    "UUID": "1D2A2508-78A4-4269-9C35-E1BFC09BBB7F",
    "DataProviderID": 1,
    "OperatorID": 3279,
    "OperatorsReference": "0138",
    "UsageTypeID": 4,
    "UsageCost": "€0/kWh",
    "AddressInfo": {
        "ID": 100109,
        "Title": "Jaime Signes S.L.",
        "AddressLine1": "Avinguda de la Marina Alta",
        "AddressLine2": "Marina Alta",
        "Town": "Gata de Gorgos",
        "Postcode": "703740",
        "CountryID": 210,
        "Latitude": 38.775141,
        "Longitude": 0.085907,
        "DistanceUnit": 0
    },
    "Connections": [
        {
            "ID": 140954,
            "ConnectionTypeID": 25,
            "StatusTypeID": 100,
            "LevelID": 2,
            "Amps": 32,
            "Voltage": 230,
            "PowerKW": 7,
            "CurrentTypeID": 10,
            "Quantity": 1
        },
        {
            "ID": 140955,
            "ConnectionTypeID": 28,
            "StatusTypeID": 100,
            "LevelID": 1,
            "Voltage": 230,
            "PowerKW": 2.3,
            "CurrentTypeID": 10,
            "Quantity": 1
        }
    ],
    "NumberOfPoints": 1,
    "GeneralComments": "Solicitar acceso en el mostrador de la tienda",
    "StatusTypeID": 100,
    "DateLastStatusUpdate": "2018-05-08T05:58:00Z",
    "DataQualityLevel": 1,
    "DateCreated": "2018-02-03T15:30:00Z",
    "SubmissionStatusTypeID": 200
}