{
    "IsRecentlyVerified": false,
    "ID": 82197,
    "UUID": "012B0FA0-7135-4044-A26F-1BD7648F8D47",
    "DataProviderID": 1,
    "OperatorID": 23,
    "OperatorsReference": "9874",
    "UsageTypeID": 4,
    "AddressInfo": {
        "ID": 82543,
        "Title": "Champion Parking 230 W 55th Street",
        "AddressLine1": "230 W 55th St",
        "Town": "New York",
        "StateOrProvince": "NY",
        "Postcode": "10019",
        "CountryID": 2,
        "Latitude": 40.764748,
        "Longitude": -73.982676,
        "ContactTelephone1": "(646) 402-6984",
        "DistanceUnit": 0
    },
    "Connections": [
        {
            "ID": 116957,
            "ConnectionTypeID": 30,
            "StatusTypeID": 50,
            "LevelID": 2,
            "PowerKW": 8,
            "CurrentTypeID": 10,
            "Quantity": 2
        }
    ],
    "NumberOfPoints": 2,
    "GeneralComments": "2 Tesla Connectors, up to 8kW.Available to the public. Please see valet.",
    "StatusTypeID": 50,
    "DateLastStatusUpdate": "2017-06-09T15:21:00Z",
    "DataQualityLevel": 1,
    "DateCreated": "2017-02-03T15:07:00Z",
    "SubmissionStatusTypeID": 200
}