{
    "IsRecentlyVerified": false,
    "ID": 180309,
    "UUID": "17946F4B-CB31-412B-961D-C58C55C12DAC",
    "DataProviderID": 29,
    "DataProvidersReference": "20806",
    "AddressInfo": {
        "ID": 180668,
        "Title": "Tullastr. 32",
        "AddressLine1": "Tullastr. 32",
        "Town": "Wyhl am Kaiserstuhl",
        "Postcode": "79369",
        "CountryID": 87,
        "Latitude": 49.85431,
        "Longitude": 8.626177,
        "DistanceUnit": 0
    },
    "Connections": [
        {
            "ID": 283214,
            "ConnectionTypeID": 25,
            "StatusTypeID": 50,
            "LevelID": 2,
            "PowerKW": 22,
            "CurrentTypeID": 20
        },
        {
            "ID": 283215,
            "ConnectionTypeID": 25,
            "StatusTypeID": 50,
            "LevelID": 2,
            "PowerKW": 22,
            "CurrentTypeID": 20
        }
    ],
    "StatusTypeID": 50,
    "DateLastStatusUpdate": "2021-07-09T03:18:00Z",
    "MetadataValues": [
        {
            "ID": 12603,
            "MetadataFieldID": 4,
            "ItemValue": "Data from the German chargepoint registry provided by Bundesnetzagentur.de under the CC-BY 4.0 license"
        }
    ],
    "DataQualityLevel": 3,
    "DateCreated": "2021-07-08T10:00:00Z",
    "SubmissionStatusTypeID": 100
}