{
    "IsRecentlyVerified": true,
    "DateLastVerified": "2021-09-09T19:04:00Z",
    "ID": 189130,
    "UUID": "D2F41404-5C20-4C4C-8C46-EF08C72C33D8",
    "DataProviderID": 1,
    "OperatorID": 1,
    "UsageTypeID": 1,
    "UsageCost": "Цена 10р/минута",
    "AddressInfo": {
        "ID": 189489,
        "Title": "ТАТНЕФТЬ, Р-239, 127 км",
        "AddressLine1": "",
        "Town": "Danaurovka",
        "StateOrProvince": "Tatarstan",
        "Postcode": "422951",
        "CountryID": 185,
        "Latitude": 55.32468429440499,
        "Longitude": 50.624432749398125,
        "AccessComments": "24/7",
        "DistanceUnit": 0
    },
    "Connections": [
        {
            "ID": 305758,
            "ConnectionTypeID": 33,
            "StatusTypeID": 50,
            "LevelID": 2,
            "PowerKW": 50,
            "Quantity": 1
        },
        {
            "ID": 305759,
            "ConnectionTypeID": 2,
            "StatusTypeID": 50,
            "LevelID": 2,
            "PowerKW": 50,
            "Quantity": 1
        },
        {
            "ID": 305760,
            "ConnectionTypeID": 1036,
            "StatusTypeID": 50,
            "LevelID": 2,
            "PowerKW": 22,
            "Quantity": 1
        }
    ],
    "NumberOfPoints": 1,
    "StatusTypeID": 50,
    "DateLastStatusUpdate": "2021-09-09T23:35:00Z",
    "DataQualityLevel": 1,
    "DateCreated": "2021-09-09T19:04:00Z",
    "SubmissionStatusTypeID": 200
}