{
    "IsRecentlyVerified": false,
    "ID": 128761,
    "UUID": "1763C2FB-953C-43BA-A39F-DA84E6C29D33",
    "DataProviderID": 1,
    "OperatorID": 3359,
    "UsageTypeID": 6,
    "AddressInfo": {
        "ID": 129107,
        "Title": "ALDI Pazonyi út #1",
        "AddressLine1": "Pazonyi út 40.",
        "Town": "Nyíregyháza",
        "Postcode": "4400 ",
        "CountryID": 104,
        "Latitude": 47.9706647609367,
        "Longitude": 21.7407152471372,
        "DistanceUnit": 0
    },
    "Connections": [
        {
            "ID": 180457,
            "ConnectionTypeID": 25,
            "StatusTypeID": 50,
            "LevelID": 1,
            "Amps": 32,
            "Voltage": 40,
            "PowerKW": 22,
            "CurrentTypeID": 20,
            "Quantity": 2
        }
    ],
    "NumberOfPoints": 1,
    "StatusTypeID": 50,
    "DateLastStatusUpdate": "2019-07-08T10:04:00Z",
    "DataQualityLevel": 1,
    "DateCreated": "2019-06-27T07:03:00Z",
    "SubmissionStatusTypeID": 200
}