{
    "IsRecentlyVerified": false,
    "ID": 176913,
    "UUID": "D4C79A04-4E63-4AC2-8B7D-897D65987FF9",
    "DataProviderID": 29,
    "DataProvidersReference": "772,14919",
    "OperatorID": 3403,
    "AddressInfo": {
        "ID": 177272,
        "Title": "Nepomueg 19",
        "AddressLine1": "Nepomueg 19",
        "Town": "Starnberg",
        "Postcode": "82319",
        "CountryID": 87,
        "Latitude": 47.99861,
        "Longitude": 11.35243,
        "DistanceUnit": 0
    },
    "Connections": [
        {
            "ID": 275429,
            "ConnectionTypeID": 25,
            "StatusTypeID": 50,
            "LevelID": 2,
            "PowerKW": 11,
            "CurrentTypeID": 20
        },
        {
            "ID": 275430,
            "ConnectionTypeID": 25,
            "StatusTypeID": 50,
            "LevelID": 2,
            "PowerKW": 22,
            "CurrentTypeID": 20
        },
        {
            "ID": 275431,
            "ConnectionTypeID": 25,
            "StatusTypeID": 50,
            "LevelID": 2,
            "PowerKW": 22,
            "CurrentTypeID": 20
        },
        {
            "ID": 275432,
            "ConnectionTypeID": 25,
            "StatusTypeID": 50,
            "LevelID": 2,
            "PowerKW": 11,
            "CurrentTypeID": 20
        }
    ],
    "StatusTypeID": 0,
    "DateLastStatusUpdate": "2021-07-09T03:11:00Z",
    "MetadataValues": [
        {
            "ID": 9208,
            "MetadataFieldID": 4,
            "ItemValue": "Data from the German chargepoint registry provided by Bundesnetzagentur.de under the CC-BY 4.0 license"
        }
    ],
    "DataQualityLevel": 3,
    "DateCreated": "2021-07-08T09:48:00Z",
    "SubmissionStatusTypeID": 100
}