{
    "IsRecentlyVerified": false,
    "ID": 61123,
    "UUID": "55FFCA3A-4F84-43E3-BE2F-C9F17182465D",
    "DataProviderID": 27,
    "DataProvidersReference": "313",
    "UsageTypeID": 1,
    "AddressInfo": {
        "ID": 61469,
        "Title": "Aparcamientos Espolón, S.A.",
        "AddressLine1": "Calle del Muro de Francisco de la Mata, 5",
        "Town": "Logroño",
        "StateOrProvince": "Logroño",
        "Postcode": "26001",
        "CountryID": 210,
        "Latitude": 42.4653738,
        "Longitude": -2.4481028,
        "ContactTelephone1": "941200369",
        "RelatedURL": "http://www.aparcamientosespolon.es",
        "DistanceUnit": 0
    },
    "Connections": [
        {
            "ID": 77750,
            "ConnectionTypeID": 28
        },
        {
            "ID": 77751,
            "ConnectionTypeID": 28
        }
    ],
    "StatusTypeID": 50,
    "DateLastStatusUpdate": "2016-02-13T00:24:00Z",
    "DataQualityLevel": 3,
    "DateCreated": "2016-02-13T00:24:00Z",
    "SubmissionStatusTypeID": 200
}