{
    "UserComments": [
        {
            "ID": 22285,
            "ChargePointID": 88918,
            "CommentTypeID": 10,
            "UserName": "ForumElettrico.it",
            "Comment": "5 Wallbox Scame (con presa Tipo 2) site nel parcheggio sotterraneo, plug&charge gratuite. Leggi la recensione completa qui > https://www.forumelettrico.it/forum/colonnine-pam-torino-to-corso-racconigi-t5453.html",
            "RelatedURL": "https://www.forumelettrico.it/forum/colonnine-pam-torino-to-corso-racconigi-t5453.html",
            "DateCreated": "2020-03-13T08:31:43.417Z",
            "User": {
                "ID": 11749,
                "Username": "ForumElettrico.it"
            },
            "CheckinStatusTypeID": 10,
            "IsActionedByEditor": false
        }
    ],
    "MediaItems": [
        {
            "ID": 21549,
            "ChargePointID": 88918,
            "ItemURL": "https://s3-ap-southeast-2.amazonaws.com/openchargemap/images/IT/OCM88918/OCM-88918.orig.2020031308315399.jpg",
            "ItemThumbnailURL": "https://s3-ap-southeast-2.amazonaws.com/openchargemap/images/IT/OCM88918/OCM-88918.thmb.2020031308315399.jpg",
            "Comment": "",
            "IsEnabled": true,
            "IsVideo": false,
            "IsFeaturedItem": false,
            "IsExternalResource": false,
            "User": {
                "ID": 11749,
                "Username": "ForumElettrico.it"
            },
            "DateCreated": "2020-03-13T08:32:00Z"
        },
        {
            "ID": 21550,
            "ChargePointID": 88918,
            "ItemURL": "https://s3-ap-southeast-2.amazonaws.com/openchargemap/images/IT/OCM88918/OCM-88918.orig.2020031308315985.jpg",
            "ItemThumbnailURL": "https://s3-ap-southeast-2.amazonaws.com/openchargemap/images/IT/OCM88918/OCM-88918.thmb.2020031308315985.jpg",
            "Comment": "",
            "IsEnabled": true,
            "IsVideo": false,
            "IsFeaturedItem": false,
            "IsExternalResource": false,
            "User": {
                "ID": 11749,
                "Username": "ForumElettrico.it"
            },
            "DateCreated": "2020-03-13T08:32:00Z"
        },
        {
            "ID": 21551,
            "ChargePointID": 88918,
            "ItemURL": "https://s3-ap-southeast-2.amazonaws.com/openchargemap/images/IT/OCM88918/OCM-88918.orig.2020031308320531.jpg",
            "ItemThumbnailURL": "https://s3-ap-southeast-2.amazonaws.com/openchargemap/images/IT/OCM88918/OCM-88918.thmb.2020031308320531.jpg",
            "Comment": "",
            "IsEnabled": true,
            "IsVideo": false,
            "IsFeaturedItem": false,
            "IsExternalResource": false,
            "User": {
                "ID": 11749,
                "Username": "ForumElettrico.it"
            },
            "DateCreated": "2020-03-13T08:32:00Z"
        },
        {
            "ID": 21552,
            "ChargePointID": 88918,
            "ItemURL": "https://s3-ap-southeast-2.amazonaws.com/openchargemap/images/IT/OCM88918/OCM-88918.orig.2020031308321091.jpg",
            "ItemThumbnailURL": "https://s3-ap-southeast-2.amazonaws.com/openchargemap/images/IT/OCM88918/OCM-88918.thmb.2020031308321091.jpg",
            "Comment": "",
            "IsEnabled": true,
            "IsVideo": false,
            "IsFeaturedItem": false,
            "IsExternalResource": false,
            "User": {
                "ID": 11749,
                "Username": "ForumElettrico.it"
            },
            "DateCreated": "2020-03-13T08:32:00Z"
        },
        {
            "ID": 21553,
            "ChargePointID": 88918,
            "ItemURL": "https://s3-ap-southeast-2.amazonaws.com/openchargemap/images/IT/OCM88918/OCM-88918.orig.2020031308321783.jpg",
            "ItemThumbnailURL": "https://s3-ap-southeast-2.amazonaws.com/openchargemap/images/IT/OCM88918/OCM-88918.thmb.2020031308321783.jpg",
            "Comment": "",
            "IsEnabled": true,
            "IsVideo": false,
            "IsFeaturedItem": false,
            "IsExternalResource": false,
            "User": {
                "ID": 11749,
                "Username": "ForumElettrico.it"
            },
            "DateCreated": "2020-03-13T08:32:00Z"
        },
        {
            "ID": 21554,
            "ChargePointID": 88918,
            "ItemURL": "https://s3-ap-southeast-2.amazonaws.com/openchargemap/images/IT/OCM88918/OCM-88918.orig.2020031308322459.jpg",
            "ItemThumbnailURL": "https://s3-ap-southeast-2.amazonaws.com/openchargemap/images/IT/OCM88918/OCM-88918.thmb.2020031308322459.jpg",
            "Comment": "",
            "IsEnabled": true,
            "IsVideo": false,
            "IsFeaturedItem": false,
            "IsExternalResource": false,
            "User": {
                "ID": 11749,
                "Username": "ForumElettrico.it"
            },
            "DateCreated": "2020-03-13T08:32:00Z"
        },
        {
            "ID": 15320,
            "ChargePointID": 88918,
            "ItemURL": "https://s3-ap-southeast-2.amazonaws.com/openchargemap/images/IT/OCM88918/OCM-88918.orig.2018042214433864.jpg",
            "ItemThumbnailURL": "https://s3-ap-southeast-2.amazonaws.com/openchargemap/images/IT/OCM88918/OCM-88918.thmb.2018042214433864.jpg",
            "Comment": "Personale gentile e dizponibile",
            "IsEnabled": true,
            "IsVideo": false,
            "IsFeaturedItem": false,
            "IsExternalResource": false,
            "User": {
                "ID": 18244,
                "Username": "Riccardo"
            },
            "DateCreated": "2018-04-22T14:44:00Z"
        }
    ],
    "IsRecentlyVerified": false,
    "ID": 88918,
    "UUID": "A171BFFC-DB3D-45F6-9BDB-8450B89D1443",
    "DataProviderID": 1,
    "OperatorID": 45,
    "UsageTypeID": 6,
    "UsageCost": "free",
    "AddressInfo": {
        "ID": 89264,
        "Title": " Pam Torino Racconigi",
        "AddressLine1": "Corso Racconigi, 236/a",
        "Town": "Torino",
        "StateOrProvince": "TO",
        "Postcode": "10141 ",
        "CountryID": 112,
        "Latitude": 45.052727375542275,
        "Longitude": 7.650042634643572,
        "ContactTelephone1": "011/19697041",
        "RelatedURL": "https://www.pampanorama.it/punti-vendita/torino-racconigi",
        "DistanceUnit": 0
    },
    "Connections": [
        {
            "ID": 126185,
            "ConnectionTypeID": 25,
            "StatusTypeID": 50,
            "LevelID": 2,
            "Quantity": 5
        }
    ],
    "NumberOfPoints": 5,
    "GeneralComments": "Utilizzabili solo nell'orario di apertura del supermercato, richiedere la chiave per aprire lo sportello al punto informazioni",
    "StatusTypeID": 50,
    "DateLastStatusUpdate": "2020-03-13T08:32:00Z",
    "DataQualityLevel": 1,
    "DateCreated": "2017-06-12T09:55:00Z",
    "SubmissionStatusTypeID": 200
}