{
    "IsRecentlyVerified": false,
    "ID": 109435,
    "UUID": "4DA69785-378F-45C5-A902-069C0814475D",
    "DataProviderID": 1,
    "OperatorID": 3282,
    "UsageTypeID": 4,
    "UsageCost": "0,20€/kW",
    "AddressInfo": {
        "ID": 109781,
        "Title": "Gorla Energia",
        "AddressLine1": "Via Milano 100",
        "Town": "Cantù ",
        "StateOrProvince": "CO",
        "Postcode": "22063",
        "CountryID": 112,
        "Latitude": 45.72309999868223,
        "Longitude": 9.146996286661874,
        "RelatedURL": "http://gorlaenergia.com/",
        "DistanceUnit": 0
    },
    "Connections": [
        {
            "ID": 154599,
            "ConnectionTypeID": 25,
            "StatusTypeID": 50,
            "LevelID": 2,
            "Amps": 32,
            "Voltage": 230,
            "PowerKW": 22,
            "CurrentTypeID": 20,
            "Quantity": 2
        }
    ],
    "NumberOfPoints": 2,
    "StatusTypeID": 50,
    "DateLastStatusUpdate": "2018-10-15T09:06:00Z",
    "DataQualityLevel": 1,
    "DateCreated": "2018-10-15T09:06:00Z",
    "SubmissionStatusTypeID": 200
}