{
    "IsRecentlyVerified": false,
    "ID": 4548,
    "UUID": "D0B2C95F-7B00-4AE1-B25E-2E9EE51DF21F",
    "DataProviderID": 1,
    "OperatorID": 1,
    "UsageTypeID": 1,
    "AddressInfo": {
        "ID": 4493,
        "Title": "Citibank Plaza",
        "AddressLine1": "3 Garden Road",
        "AddressLine2": "",
        "Town": "Central",
        "StateOrProvince": "Hong Kong",
        "Postcode": "",
        "CountryID": 4,
        "Latitude": 22.278493881225586,
        "Longitude": 114.1608657836914,
        "ContactTelephone1": "",
        "ContactTelephone2": "",
        "ContactEmail": "",
        "AccessComments": "",
        "RelatedURL": "",
        "DistanceUnit": 0
    },
    "Connections": [
        {
            "ID": 208,
            "ConnectionTypeID": 3,
            "LevelID": 2,
            "Quantity": 1
        }
    ],
    "NumberOfPoints": 2,
    "DateLastConfirmed": "2011-05-21T00:00:00Z",
    "StatusTypeID": 50,
    "DateLastStatusUpdate": "2013-01-11T21:07:00Z",
    "DateCreated": "2011-05-25T11:01:00Z",
    "SubmissionStatusTypeID": 200
}