{
    "IsRecentlyVerified": false,
    "ID": 127970,
    "UUID": "38718FBF-DC5F-402D-98F8-42854989D2AD",
    "DataProviderID": 1,
    "OperatorID": 3253,
    "OperatorsReference": "AT*SMA*EIT2002128*001AC",
    "UsageTypeID": 1,
    "UsageCost": "€0,04/min ; Andere Tarife möglich",
    "AddressInfo": {
        "ID": 128316,
        "Title": "Ladestation Hotel Sport",
        "AddressLine1": "Borgata Fontana 45",
        "Town": "Sappada",
        "StateOrProvince": "Venetien",
        "Postcode": "32047",
        "CountryID": 112,
        "Latitude": 46.568261,
        "Longitude": 12.698119,
        "DistanceUnit": 0
    },
    "Connections": [
        {
            "ID": 179088,
            "ConnectionTypeID": 25,
            "StatusTypeID": 150,
            "LevelID": 2,
            "Amps": 16,
            "Voltage": 400,
            "PowerKW": 11,
            "CurrentTypeID": 20,
            "Quantity": 1
        }
    ],
    "NumberOfPoints": 1,
    "StatusTypeID": 150,
    "DateLastStatusUpdate": "2019-06-12T14:17:00Z",
    "DataQualityLevel": 1,
    "DateCreated": "2019-06-12T14:17:00Z",
    "SubmissionStatusTypeID": 200
}