{
    "MediaItems": [
        {
            "ID": 3474,
            "ChargePointID": 43171,
            "ItemURL": "https://s3-ap-southeast-2.amazonaws.com/openchargemap/images/SE/OCM43171/OCM-43171.orig.2015110215165894.jpg",
            "ItemThumbnailURL": "https://s3-ap-southeast-2.amazonaws.com/openchargemap/images/SE/OCM43171/OCM-43171.thmb.2015110215165894.jpg",
            "Comment": "",
            "IsEnabled": true,
            "IsVideo": false,
            "IsFeaturedItem": false,
            "IsExternalResource": false,
            "User": {
                "ID": 6544,
                "Username": "Excentius"
            },
            "DateCreated": "2015-11-02T15:17:00Z"
        }
    ],
    "IsRecentlyVerified": false,
    "ID": 43171,
    "UUID": "E317F46B-AE79-466A-89DF-8E28DC479B24",
    "DataProviderID": 1,
    "OperatorID": 1,
    "UsageTypeID": 1,
    "UsageCost": "Free",
    "AddressInfo": {
        "ID": 43517,
        "Title": "Lindbergshallen",
        "AddressLine1": "Södra industrivägen 8",
        "AddressLine2": "",
        "Town": "DJURÅS",
        "StateOrProvince": "DALARNA",
        "Postcode": "78561",
        "CountryID": 216,
        "Latitude": 60.559407586606234,
        "Longitude": 15.137290678012505,
        "ContactTelephone1": "",
        "ContactTelephone2": "",
        "ContactEmail": "",
        "AccessComments": "På parkeringen vid Lindbergshallen mot E16/Rv70.",
        "RelatedURL": "",
        "DistanceUnit": 0
    },
    "Connections": [
        {
            "ID": 52339,
            "ConnectionTypeID": 28,
            "Reference": "1",
            "StatusTypeID": 50,
            "LevelID": 2,
            "Amps": 16,
            "Voltage": 230,
            "PowerKW": 3.68,
            "CurrentTypeID": 10,
            "Quantity": 2,
            "Comments": "Mode 1"
        }
    ],
    "NumberOfPoints": 2,
    "GeneralComments": "",
    "StatusTypeID": 50,
    "DateLastStatusUpdate": "2015-11-02T16:08:00Z",
    "DataQualityLevel": 2,
    "DateCreated": "2015-03-25T04:33:00Z",
    "SubmissionStatusTypeID": 100
}