{
    "IsRecentlyVerified": false,
    "ID": 9020,
    "UUID": "93FC1D49-C6A7-4391-B8E9-D639E674AA18",
    "DataProviderID": 15,
    "DataProvidersReference": "12394",
    "OperatorID": 5,
    "AddressInfo": {
        "ID": 8917,
        "Title": "615 12th St W",
        "AddressLine1": "615 12th St W",
        "Town": "Bradenton",
        "StateOrProvince": "Florida",
        "Postcode": "34205",
        "CountryID": 2,
        "Latitude": 27.49327469,
        "Longitude": -82.57324982,
        "ContactTelephone1": "",
        "RelatedURL": "http://carstations.com/12394",
        "DistanceUnit": 0
    },
    "Connections": [
        {
            "ID": 6591,
            "ConnectionTypeID": 1,
            "Reference": "J1772",
            "LevelID": 2
        },
        {
            "ID": 6938,
            "ConnectionTypeID": 9,
            "Reference": "NEMA5",
            "LevelID": 1,
            "Quantity": 1
        }
    ],
    "StatusTypeID": 0,
    "DateLastStatusUpdate": "2017-11-04T14:03:00Z",
    "DataQualityLevel": 1,
    "DateCreated": "2011-12-10T20:50:00Z",
    "SubmissionStatusTypeID": 100
}