{
    "IsRecentlyVerified": false,
    "ID": 165228,
    "UUID": "C235CAC1-99D5-47E5-A7CA-AC0ADD7A43F6",
    "DataProviderID": 1,
    "DataProvidersReference": "TR-IST-074",
    "OperatorID": 70,
    "UsageTypeID": 1,
    "AddressInfo": {
        "ID": 165587,
        "Title": "Eşarj - Kosifler Oto, Bostancı",
        "AddressLine1": "İçerenköy Mah. Askent Sok. 3B D:3-6,  Ataşehir",
        "Town": "İstanbul",
        "StateOrProvince": "İstanbul",
        "Postcode": "34752",
        "CountryID": 229,
        "Latitude": 40.961121,
        "Longitude": 29.11211,
        "ContactTelephone1": "+90 (850) 433 72 75",
        "ContactEmail": "destek@esarj.com",
        "RelatedURL": "https://esarj.com/en/map?s=TR-IST-074",
        "DistanceUnit": 0
    },
    "Connections": [
        {
            "ID": 236891,
            "ConnectionTypeID": 25,
            "LevelID": 2,
            "Amps": 32,
            "Voltage": 220,
            "PowerKW": 7.4,
            "Quantity": 1
        }
    ],
    "GeneralComments": "Eşarj Charging Systems",
    "StatusTypeID": 50,
    "DateLastStatusUpdate": "2020-08-26T08:19:00Z",
    "DataQualityLevel": 3,
    "DateCreated": "2020-08-26T08:19:00Z",
    "SubmissionStatusTypeID": 200
}