{
    "IsRecentlyVerified": false,
    "ID": 8277,
    "UUID": "4AFA0FEA-6E52-4BA5-A837-F2064196EB3E",
    "DataProviderID": 15,
    "DataProvidersReference": "1716",
    "OperatorID": 5,
    "UsageTypeID": 1,
    "AddressInfo": {
        "ID": 8174,
        "Title": "3550 Interstate 635",
        "AddressLine1": "3550 Interstate 635",
        "Town": "Irving",
        "StateOrProvince": "Texas",
        "Postcode": "75063",
        "CountryID": 2,
        "Latitude": 32.92167282,
        "Longitude": -96.99549866,
        "ContactTelephone1": "",
        "RelatedURL": "http://carstations.com/1716",
        "DistanceUnit": 0
    },
    "Connections": [
        {
            "ID": 5706,
            "ConnectionTypeID": 9,
            "Reference": "NEMA5",
            "LevelID": 1
        },
        {
            "ID": 6200,
            "ConnectionTypeID": 1,
            "Reference": "J1772",
            "Quantity": 1
        }
    ],
    "NumberOfPoints": 1,
    "StatusTypeID": 0,
    "DateLastStatusUpdate": "2017-11-04T14:04:00Z",
    "DataQualityLevel": 1,
    "DateCreated": "2011-11-11T12:06:00Z",
    "SubmissionStatusTypeID": 100
}