{
    "MediaItems": [
        {
            "ID": 25834,
            "ChargePointID": 170937,
            "ItemURL": "https://s3-ap-southeast-2.amazonaws.com/openchargemap/images/IT/OCM170937/OCM-170937.orig.2020121708223879.jpg",
            "ItemThumbnailURL": "https://s3-ap-southeast-2.amazonaws.com/openchargemap/images/IT/OCM170937/OCM-170937.thmb.2020121708223879.jpg",
            "Comment": "",
            "IsEnabled": true,
            "IsVideo": false,
            "IsFeaturedItem": false,
            "IsExternalResource": false,
            "User": {
                "ID": 27477,
                "Username": "AndreaL77"
            },
            "DateCreated": "2020-12-17T08:23:00Z"
        },
        {
            "ID": 25833,
            "ChargePointID": 170937,
            "ItemURL": "https://s3-ap-southeast-2.amazonaws.com/openchargemap/images/IT/OCM170937/OCM-170937.orig.2020121708222431.jpg",
            "ItemThumbnailURL": "https://s3-ap-southeast-2.amazonaws.com/openchargemap/images/IT/OCM170937/OCM-170937.thmb.2020121708222431.jpg",
            "Comment": "",
            "IsEnabled": true,
            "IsVideo": false,
            "IsFeaturedItem": false,
            "IsExternalResource": false,
            "User": {
                "ID": 27477,
                "Username": "AndreaL77"
            },
            "DateCreated": "2020-12-17T08:22:00Z"
        }
    ],
    "IsRecentlyVerified": false,
    "ID": 170937,
    "UUID": "E9D0807A-5498-4AC9-AD04-1AAFD23D1579",
    "DataProviderID": 1,
    "OperatorID": 3382,
    "UsageTypeID": 4,
    "UsageCost": "0,35€/kWh",
    "AddressInfo": {
        "ID": 171296,
        "Title": "Ressolar Somma Lombardo Sport",
        "AddressLine1": "Via Carlo Del Prete",
        "Town": "Somma Lombardo",
        "StateOrProvince": "VA",
        "Postcode": "21019",
        "CountryID": 112,
        "Latitude": 45.6889541806579,
        "Longitude": 8.71770391802363,
        "DistanceUnit": 0
    },
    "Connections": [
        {
            "ID": 261152,
            "ConnectionTypeID": 25,
            "StatusTypeID": 150,
            "LevelID": 2,
            "Amps": 32,
            "Voltage": 400,
            "PowerKW": 22,
            "CurrentTypeID": 20,
            "Quantity": 2
        }
    ],
    "NumberOfPoints": 2,
    "StatusTypeID": 150,
    "DateLastStatusUpdate": "2020-12-17T08:23:00Z",
    "DataQualityLevel": 1,
    "DateCreated": "2020-12-12T10:56:00Z",
    "SubmissionStatusTypeID": 200
}