{
    "IsRecentlyVerified": false,
    "ID": 60379,
    "UUID": "8B7363E3-8164-46AD-A969-DEE3AA8425B1",
    "DataProviderID": 1,
    "OperatorID": 23,
    "OperatorsReference": "23362",
    "UsageTypeID": 1,
    "UsageCost": "1.40 PLN/kWh; Możliwe inne taryfy dla starszych samochodów",
    "AddressInfo": {
        "ID": 60725,
        "Title": "Tesla Poznań Superchanger",
        "AddressLine1": "Wyspiańskiego 26a",
        "AddressLine2": "City Park",
        "Town": "Poznań",
        "StateOrProvince": "Greater Poland Voivodeship",
        "Postcode": "60-751",
        "CountryID": 179,
        "Latitude": 52.399723,
        "Longitude": 16.894948,
        "DistanceUnit": 0
    },
    "Connections": [
        {
            "ID": 76488,
            "ConnectionTypeID": 27,
            "StatusTypeID": 50,
            "LevelID": 3,
            "Voltage": 400,
            "PowerKW": 150,
            "CurrentTypeID": 30,
            "Quantity": 6
        }
    ],
    "NumberOfPoints": 6,
    "GeneralComments": "Parking: 5 PLN/h, pierwsze 30 minut darmowe",
    "StatusTypeID": 50,
    "DateLastStatusUpdate": "2021-06-01T18:19:00Z",
    "DataQualityLevel": 1,
    "DateCreated": "2016-01-24T09:44:00Z",
    "SubmissionStatusTypeID": 200
}