{
    "UserComments": [
        {
            "ID": 20463,
            "ChargePointID": 107695,
            "CommentTypeID": 10,
            "UserName": "PowerCruiseControl",
            "Comment": "Good GPS positioning",
            "Rating": 5,
            "DateCreated": "2018-11-29T12:00:16.157Z",
            "User": {
                "ID": 18504,
                "Username": "PowerCruiseControl"
            },
            "CheckinStatusTypeID": 10
        }
    ],
    "MediaItems": [
        {
            "ID": 17117,
            "ChargePointID": 107695,
            "ItemURL": "https://s3-ap-southeast-2.amazonaws.com/openchargemap/images/IT/OCM107695/OCM-107695.orig.2018112912005599.jpg",
            "ItemThumbnailURL": "https://s3-ap-southeast-2.amazonaws.com/openchargemap/images/IT/OCM107695/OCM-107695.thmb.2018112912005599.jpg",
            "Comment": "",
            "IsEnabled": true,
            "IsVideo": false,
            "IsFeaturedItem": false,
            "IsExternalResource": false,
            "User": {
                "ID": 18504,
                "Username": "PowerCruiseControl"
            },
            "DateCreated": "2018-11-29T12:01:00Z"
        }
    ],
    "IsRecentlyVerified": false,
    "ID": 107695,
    "UUID": "2F54B845-852B-4CFE-87F3-94E2AEAD0D62",
    "DataProviderID": 1,
    "OperatorID": 80,
    "UsageTypeID": 4,
    "AddressInfo": {
        "ID": 108041,
        "Title": "Pachino Via Taranto | EnelX ",
        "AddressLine1": "Via Taranto",
        "Town": "Pachino",
        "StateOrProvince": "SR",
        "Postcode": "96018",
        "CountryID": 112,
        "Latitude": 36.720104584195,
        "Longitude": 15.0977934431797,
        "ContactTelephone1": "800.069.850",
        "RelatedURL": "https://www.enelx.com/it/it/emobility",
        "DistanceUnit": 0
    },
    "Connections": [
        {
            "ID": 152047,
            "ConnectionTypeID": 25,
            "StatusTypeID": 50,
            "LevelID": 2,
            "Amps": 32,
            "Voltage": 400,
            "PowerKW": 22,
            "CurrentTypeID": 20,
            "Quantity": 1
        },
        {
            "ID": 152048,
            "ConnectionTypeID": 36,
            "StatusTypeID": 50,
            "LevelID": 2,
            "Amps": 16,
            "Voltage": 240,
            "PowerKW": 3.7,
            "CurrentTypeID": 10,
            "Quantity": 1
        }
    ],
    "NumberOfPoints": 2,
    "StatusTypeID": 50,
    "DateLastStatusUpdate": "2019-07-13T15:48:00Z",
    "DataQualityLevel": 1,
    "DateCreated": "2018-08-07T13:56:00Z",
    "SubmissionStatusTypeID": 200
}