{
    "IsRecentlyVerified": false,
    "ID": 152099,
    "UUID": "8A6C050A-2760-4B30-98C2-B362FB843B9D",
    "DataProviderID": 28,
    "DataProvidersReference": "FR*S86*PSORE*B033",
    "UsageTypeID": 5,
    "AddressInfo": {
        "ID": 152452,
        "Title": "B033",
        "AddressLine1": "4, place de Gromelange - 86320 - Civaux",
        "CountryID": 80,
        "Latitude": 46.44447,
        "Longitude": 0.66512,
        "AccessComments": "24/24 7/7 jours",
        "DistanceUnit": 0
    },
    "Connections": [
        {
            "ID": 212779,
            "ConnectionTypeID": 28,
            "StatusTypeID": 50,
            "LevelID": 2,
            "PowerKW": 18,
            "CurrentTypeID": 10
        },
        {
            "ID": 212780,
            "ConnectionTypeID": 25,
            "StatusTypeID": 50,
            "LevelID": 2,
            "PowerKW": 18,
            "CurrentTypeID": 20
        },
        {
            "ID": 245634,
            "ConnectionTypeID": 28,
            "StatusTypeID": 50,
            "LevelID": 2,
            "PowerKW": 18,
            "CurrentTypeID": 10
        },
        {
            "ID": 245635,
            "ConnectionTypeID": 25,
            "StatusTypeID": 50,
            "LevelID": 2,
            "PowerKW": 18,
            "CurrentTypeID": 20
        }
    ],
    "GeneralComments": "",
    "StatusTypeID": 50,
    "DateLastStatusUpdate": "2020-08-27T05:12:00Z",
    "DataQualityLevel": 2,
    "DateCreated": "2020-03-15T10:53:00Z",
    "SubmissionStatusTypeID": 100
}