{
    "IsRecentlyVerified": false,
    "ID": 149880,
    "UUID": "EF1784BA-88D7-47F0-94FD-3AF9E04FC94C",
    "DataProviderID": 1,
    "OperatorID": 207,
    "UsageTypeID": 4,
    "UsageCost": "0,50 € / kWh",
    "AddressInfo": {
        "ID": 150233,
        "Title": "E. S. Andamur",
        "AddressLine1": "El Ventorro Kalea, 3",
        "Town": "Durruma-San Román de San Millán",
        "StateOrProvince": "Araba",
        "Postcode": "01207",
        "CountryID": 210,
        "Latitude": 42.86415037004397,
        "Longitude": -2.3205562668556468,
        "DistanceUnit": 0
    },
    "Connections": [
        {
            "ID": 208101,
            "ConnectionTypeID": 25,
            "StatusTypeID": 50,
            "LevelID": 2,
            "Amps": 32,
            "Voltage": 400,
            "PowerKW": 22,
            "CurrentTypeID": 20,
            "Quantity": 1
        },
        {
            "ID": 208102,
            "ConnectionTypeID": 33,
            "StatusTypeID": 50,
            "LevelID": 3,
            "PowerKW": 50,
            "CurrentTypeID": 30,
            "Quantity": 1
        },
        {
            "ID": 208103,
            "ConnectionTypeID": 2,
            "StatusTypeID": 50,
            "LevelID": 3,
            "PowerKW": 50,
            "CurrentTypeID": 30,
            "Quantity": 1
        }
    ],
    "NumberOfPoints": 1,
    "GeneralComments": "Available with JuicePass app",
    "StatusTypeID": 50,
    "DateLastStatusUpdate": "2020-03-08T10:52:00Z",
    "DataQualityLevel": 1,
    "DateCreated": "2020-03-08T07:57:00Z",
    "SubmissionStatusTypeID": 200
}