{
    "IsRecentlyVerified": false,
    "ID": 162300,
    "UUID": "11A9E26B-6559-4686-AA3F-73667A7DE2A9",
    "DataProviderID": 1,
    "OperatorID": 23,
    "OperatorsReference": "54253",
    "UsageTypeID": 6,
    "AddressInfo": {
        "ID": 162657,
        "Title": "Real Marina Hotel & Spa",
        "AddressLine1": "Avenida 5 de Outubro",
        "Town": "Olhão",
        "Postcode": "8700-000 ",
        "CountryID": 180,
        "Latitude": 37.023878,
        "Longitude": -7.847187,
        "ContactTelephone1": "+351 289 091 300",
        "AccessComments": "Only for customers",
        "DistanceUnit": 0
    },
    "Connections": [
        {
            "ID": 233598,
            "ConnectionTypeID": 30,
            "StatusTypeID": 50,
            "LevelID": 2,
            "PowerKW": 22,
            "CurrentTypeID": 20,
            "Quantity": 2
        }
    ],
    "NumberOfPoints": 2,
    "GeneralComments": "Charging2 Tesla Connector, up to 22kW.Available for customers. Please see front desk.",
    "StatusTypeID": 50,
    "DateLastStatusUpdate": "2020-11-21T13:51:00Z",
    "DataQualityLevel": 1,
    "DateCreated": "2020-08-05T05:31:00Z",
    "SubmissionStatusTypeID": 200
}