{
    "IsRecentlyVerified": false,
    "ID": 102099,
    "UUID": "E6B6C80B-EAFD-4756-AE03-64D072E3408A",
    "DataProviderID": 1,
    "OperatorID": 69,
    "UsageTypeID": 4,
    "AddressInfo": {
        "ID": 102445,
        "Title": "Hotel Schweizer Hof",
        "AddressLine1": "Wilhelmshöher Allee 288",
        "Town": "Kassel",
        "StateOrProvince": "Hessen",
        "Postcode": "34131",
        "CountryID": 87,
        "Latitude": 51.31400775388022,
        "Longitude": 9.440440729134707,
        "RelatedURL": "https://www.enbw.com/unternehmen/konzern/elektromobilitaet/elektromobilitaet-bei-der-enbw/",
        "DistanceUnit": 0
    },
    "Connections": [
        {
            "ID": 144086,
            "ConnectionTypeID": 25,
            "StatusTypeID": 50,
            "LevelID": 2,
            "Amps": 32,
            "Voltage": 400,
            "PowerKW": 22,
            "CurrentTypeID": 20,
            "Quantity": 2
        },
        {
            "ID": 144087,
            "ConnectionTypeID": 28,
            "StatusTypeID": 50,
            "LevelID": 2,
            "Amps": 16,
            "Voltage": 230,
            "PowerKW": 3.7,
            "CurrentTypeID": 10,
            "Quantity": 2
        }
    ],
    "NumberOfPoints": 4,
    "StatusTypeID": 50,
    "DateLastStatusUpdate": "2018-04-16T07:53:00Z",
    "DataQualityLevel": 1,
    "DateCreated": "2018-04-16T07:53:00Z",
    "SubmissionStatusTypeID": 200
}