{
    "IsRecentlyVerified": false,
    "ID": 52211,
    "UUID": "70B42E8A-5A2B-4964-942F-71C58415BF73",
    "DataProviderID": 1,
    "OperatorID": 8,
    "OperatorsReference": "CM-1799",
    "UsageTypeID": 6,
    "UsageCost": "Free",
    "AddressInfo": {
        "ID": 52557,
        "Title": "College of West Anglia (Cambridge Campus)",
        "AddressLine1": "Landbeach Road",
        "AddressLine2": "Milton",
        "Town": "Cambridge",
        "StateOrProvince": "Cambridgeshire",
        "Postcode": "CB24 6DB",
        "CountryID": 1,
        "Latitude": 52.2478211,
        "Longitude": 0.16375590000006923,
        "ContactTelephone1": "01223860701",
        "AccessComments": "No public access - for staff, student and visitor use only.  Visitors to report to reception for key to locking bollard.",
        "RelatedURL": "https://www.cwa.ac.uk/",
        "DistanceUnit": 0
    },
    "Connections": [
        {
            "ID": 64833,
            "ConnectionTypeID": 25,
            "StatusTypeID": 50,
            "LevelID": 2,
            "Amps": 32,
            "Voltage": 230,
            "PowerKW": 7,
            "CurrentTypeID": 10,
            "Quantity": 2
        }
    ],
    "NumberOfPoints": 2,
    "GeneralComments": "Chargemaster post. ",
    "StatusTypeID": 50,
    "DateLastStatusUpdate": "2017-04-21T21:05:00Z",
    "DataQualityLevel": 1,
    "DateCreated": "2015-08-24T05:55:00Z",
    "SubmissionStatusTypeID": 200
}