{
    "IsRecentlyVerified": false,
    "ID": 133769,
    "UUID": "2F275248-29A5-40B1-B5F7-45C45A5D21D8",
    "DataProviderID": 1,
    "OperatorID": 23,
    "OperatorsReference": "52223",
    "UsageTypeID": 4,
    "UsageCost": "SEK 2.56/kWh; andra taxor möjligt för äldre bilar",
    "AddressInfo": {
        "ID": 134115,
        "Title": "Jäckvik Supercharger",
        "AddressLine1": "10 Byavängen",
        "Town": "Jäckvik",
        "Postcode": "93895",
        "CountryID": 216,
        "Latitude": 66.39067,
        "Longitude": 16.964868,
        "DistanceUnit": 0
    },
    "Connections": [
        {
            "ID": 187212,
            "ConnectionTypeID": 27,
            "StatusTypeID": 50,
            "LevelID": 3,
            "PowerKW": 120,
            "CurrentTypeID": 30,
            "Quantity": 4
        }
    ],
    "NumberOfPoints": 4,
    "GeneralComments": "Charging4 Superchargers, available 24/7, up to 120kW",
    "StatusTypeID": 50,
    "DateLastStatusUpdate": "2019-10-27T06:45:00Z",
    "DataQualityLevel": 1,
    "DateCreated": "2019-10-26T05:53:00Z",
    "SubmissionStatusTypeID": 200
}