{
    "IsRecentlyVerified": false,
    "ID": 95334,
    "UUID": "1CD30494-8482-481F-88E4-B6FAF8844A63",
    "DataProviderID": 1,
    "OperatorID": 220,
    "OperatorsReference": "4874,4875",
    "UsageTypeID": 1,
    "UsageCost": "€1.73 + €0.3213/kWh; Andere Tarife möglich",
    "AddressInfo": {
        "ID": 95680,
        "Title": "Snitgerreihe 38",
        "AddressLine1": "Snitgerreihe 38",
        "Town": "Mitte",
        "StateOrProvince": "Hamburg",
        "Postcode": "22111",
        "CountryID": 87,
        "Latitude": 53.55634,
        "Longitude": 10.0729,
        "DistanceUnit": 0
    },
    "Connections": [
        {
            "ID": 135022,
            "ConnectionTypeID": 25,
            "StatusTypeID": 50,
            "LevelID": 2,
            "Amps": 32,
            "Voltage": 400,
            "PowerKW": 22,
            "CurrentTypeID": 20,
            "Quantity": 2
        },
        {
            "ID": 135057,
            "ConnectionTypeID": 28,
            "StatusTypeID": 50,
            "LevelID": 2,
            "Amps": 16,
            "Voltage": 230,
            "PowerKW": 3.7,
            "CurrentTypeID": 10,
            "Quantity": 2
        }
    ],
    "NumberOfPoints": 2,
    "StatusTypeID": 50,
    "DateLastStatusUpdate": "2017-11-08T06:44:00Z",
    "DataQualityLevel": 1,
    "DateCreated": "2017-11-07T06:59:00Z",
    "SubmissionStatusTypeID": 200
}