{
    "IsRecentlyVerified": false,
    "ID": 100045,
    "UUID": "355F3067-0A10-4DBF-92B6-54C77FB37813",
    "DataProviderID": 1,
    "OperatorID": 3272,
    "UsageTypeID": 4,
    "AddressInfo": {
        "ID": 100391,
        "Title": " Emotì Evpass Stazione di Castione-Arbedo",
        "AddressLine1": "Via Stazione",
        "Town": "Castione",
        "StateOrProvince": "Distretto di Bellinzona",
        "Postcode": "6532",
        "CountryID": 217,
        "Latitude": 46.22355676297264,
        "Longitude": 9.04169789599643,
        "ContactTelephone1": "+41 91 946 39 28",
        "ContactTelephone2": "+41 58 221 96 60",
        "RelatedURL": "https://emoti.evpass.ch/",
        "DistanceUnit": 0
    },
    "Connections": [
        {
            "ID": 141317,
            "ConnectionTypeID": 1036,
            "StatusTypeID": 50,
            "LevelID": 2,
            "Amps": 32,
            "Voltage": 400,
            "PowerKW": 22,
            "CurrentTypeID": 20,
            "Quantity": 6
        },
        {
            "ID": 141318,
            "ConnectionTypeID": 1,
            "StatusTypeID": 50,
            "LevelID": 2,
            "Amps": 32,
            "Voltage": 240,
            "PowerKW": 7,
            "CurrentTypeID": 10,
            "Quantity": 6
        },
        {
            "ID": 141319,
            "ConnectionTypeID": 1037,
            "StatusTypeID": 50,
            "LevelID": 2,
            "Amps": 16,
            "Voltage": 240,
            "PowerKW": 3.7,
            "CurrentTypeID": 10,
            "Quantity": 6
        }
    ],
    "NumberOfPoints": 6,
    "StatusTypeID": 50,
    "DateLastStatusUpdate": "2018-02-09T17:02:00Z",
    "DataQualityLevel": 1,
    "DateCreated": "2018-02-09T17:02:00Z",
    "SubmissionStatusTypeID": 200
}