{
    "IsRecentlyVerified": false,
    "ID": 33238,
    "UUID": "6E177238-4A16-46C0-9EC0-19723913B206",
    "DataProviderID": 26,
    "DataProvidersReference": "21572",
    "OperatorsReference": "Parkeergarage Tivoli",
    "UsageCost": "0.00 gratis",
    "AddressInfo": {
        "ID": 33584,
        "Title": "Achter de Heuvel",
        "AddressLine1": "Achter de Heuvel",
        "Town": "Tilburg",
        "Postcode": "5017 JZ",
        "CountryID": 159,
        "Latitude": 51.558786753181,
        "Longitude": 5.0928336381912,
        "RelatedURL": "http://www.tilburg.com / www.tilburg.nl",
        "DistanceUnit": 0
    },
    "Connections": [
        {
            "ID": 36749,
            "ConnectionTypeID": 25,
            "LevelID": 2,
            "PowerKW": 11,
            "CurrentTypeID": 10
        }
    ],
    "NumberOfPoints": 2,
    "StatusTypeID": 50,
    "DateLastStatusUpdate": "2016-03-03T12:36:00Z",
    "DataQualityLevel": 3,
    "DateCreated": "2015-01-09T06:04:00Z",
    "SubmissionStatusTypeID": 100
}