{
    "MediaItems": [
        {
            "ID": 8849,
            "ChargePointID": 73256,
            "ItemURL": "https://s3-ap-southeast-2.amazonaws.com/openchargemap/images/GB/OCM73256/OCM-73256.orig.2016122409571689.jpg",
            "ItemThumbnailURL": "https://s3-ap-southeast-2.amazonaws.com/openchargemap/images/GB/OCM73256/OCM-73256.thmb.2016122409571689.jpg",
            "Comment": "Located on 3rd Floor of Q Park Car Park.  Pay by Credit Card. Activate by App or Over the phone. ",
            "IsEnabled": true,
            "IsVideo": false,
            "IsFeaturedItem": false,
            "IsExternalResource": false,
            "User": {
                "ID": 4966,
                "Username": "Jeru"
            },
            "DateCreated": "2016-12-24T09:58:00Z"
        },
        {
            "ID": 8848,
            "ChargePointID": 73256,
            "ItemURL": "https://s3-ap-southeast-2.amazonaws.com/openchargemap/images/GB/OCM73256/OCM-73256.orig.2016122409560522.jpg",
            "ItemThumbnailURL": "https://s3-ap-southeast-2.amazonaws.com/openchargemap/images/GB/OCM73256/OCM-73256.thmb.2016122409560522.jpg",
            "Comment": "Located on 3rd Floor of Q Park Car Park.  Pay by Credit Card. Activate by App or Over the phone. ",
            "IsEnabled": true,
            "IsVideo": false,
            "IsFeaturedItem": false,
            "IsExternalResource": false,
            "User": {
                "ID": 4966,
                "Username": "Jeru"
            },
            "DateCreated": "2016-12-24T09:56:00Z"
        }
    ],
    "IsRecentlyVerified": false,
    "ID": 73256,
    "UUID": "886B4BD2-CA73-4522-BD36-CA52334A5AA5",
    "DataProviderID": 1,
    "OperatorID": 202,
    "OperatorsReference": "GB4A,GB4B",
    "UsageTypeID": 4,
    "UsageCost": "£0.30/kWh. Parking fees apply.",
    "AddressInfo": {
        "ID": 73602,
        "Title": "Franklin Energy Q-Park Manchester First Street",
        "AddressLine1": "First Street",
        "AddressLine2": "Central Manchester",
        "Town": "Manchester",
        "Postcode": "M15 4RL",
        "CountryID": 1,
        "Latitude": 53.4728,
        "Longitude": -2.2465,
        "DistanceUnit": 0
    },
    "Connections": [
        {
            "ID": 105415,
            "ConnectionTypeID": 25,
            "StatusTypeID": 50,
            "LevelID": 2,
            "Amps": 32,
            "Voltage": 400,
            "PowerKW": 22,
            "CurrentTypeID": 10,
            "Quantity": 2
        }
    ],
    "NumberOfPoints": 2,
    "GeneralComments": "Ensto EVC100 charge point.",
    "StatusTypeID": 50,
    "DateLastStatusUpdate": "2016-12-24T09:58:00Z",
    "DataQualityLevel": 1,
    "DateCreated": "2016-11-16T12:14:00Z",
    "SubmissionStatusTypeID": 200
}