{
    "IsRecentlyVerified": false,
    "ID": 114159,
    "UUID": "89EB7C57-6E94-482B-9339-07591ABE4637",
    "DataProviderID": 1,
    "OperatorID": 23,
    "OperatorsReference": "47973",
    "UsageTypeID": 4,
    "AddressInfo": {
        "ID": 114505,
        "Title": "Mövenpick Hotel & Apartments Bur Dubai",
        "AddressLine1": "19th Street Oud Metha",
        "Town": "Dubai",
        "Postcode": "32733",
        "CountryID": 235,
        "Latitude": 25.234148,
        "Longitude": 55.311636,
        "ContactTelephone1": " +971 4 336 6000",
        "DistanceUnit": 0
    },
    "Connections": [
        {
            "ID": 160729,
            "ConnectionTypeID": 30,
            "StatusTypeID": 50,
            "LevelID": 2,
            "Amps": 16,
            "Voltage": 400,
            "PowerKW": 11,
            "CurrentTypeID": 20,
            "Quantity": 1
        }
    ],
    "NumberOfPoints": 1,
    "GeneralComments": "1 Tesla Connector, up to 11kW.Available for customers. Self park.",
    "StatusTypeID": 50,
    "DateLastStatusUpdate": "2019-01-03T08:04:00Z",
    "DataQualityLevel": 1,
    "DateCreated": "2019-01-03T08:04:00Z",
    "SubmissionStatusTypeID": 200
}