{
    "IsRecentlyVerified": false,
    "ID": 158426,
    "UUID": "217C6367-BF24-48EB-A6D4-47B1FE7ADD17",
    "DataProviderID": 2,
    "DataProvidersReference": "159712",
    "OperatorID": 5,
    "UsageTypeID": 1,
    "AddressInfo": {
        "ID": 158783,
        "Title": "UCSD",
        "AddressLine1": "Pangea Parking Structure Scholars Dr N",
        "Town": "San Diego",
        "StateOrProvince": "CA",
        "Postcode": "92037",
        "CountryID": 2,
        "Latitude": 32.8843177,
        "Longitude": -117.2427615,
        "ContactTelephone1": "888-758-4389",
        "AccessComments": "24 hours daily",
        "RelatedURL": "http://www.chargepoint.com/",
        "DistanceUnit": 0
    },
    "Connections": [
        {
            "ID": 228408,
            "ConnectionTypeID": 1,
            "LevelID": 2,
            "Amps": 16,
            "Voltage": 230,
            "PowerKW": 3.7,
            "CurrentTypeID": 10,
            "Quantity": 12
        }
    ],
    "StatusTypeID": 50,
    "DateLastStatusUpdate": "2020-06-26T02:55:00Z",
    "DataQualityLevel": 3,
    "DateCreated": "2020-06-26T02:55:00Z",
    "SubmissionStatusTypeID": 100
}