{
    "IsRecentlyVerified": false,
    "ID": 127263,
    "UUID": "BDCCEC4F-F1EF-4C59-B115-6D394321A46F",
    "DataProviderID": 1,
    "OperatorID": 22,
    "OperatorsReference": "C4XK5",
    "UsageTypeID": 4,
    "AddressInfo": {
        "ID": 127609,
        "Title": "Mill Road",
        "AddressLine1": "Blanchardstown Village",
        "Town": "Dublin 15",
        "StateOrProvince": "County Dublin",
        "CountryID": 3,
        "Latitude": 53.386875,
        "Longitude": -6.374254,
        "DistanceUnit": 0
    },
    "Connections": [
        {
            "ID": 178202,
            "ConnectionTypeID": 25,
            "StatusTypeID": 75,
            "LevelID": 2,
            "Amps": 32,
            "Voltage": 400,
            "PowerKW": 22,
            "CurrentTypeID": 20,
            "Quantity": 2
        }
    ],
    "NumberOfPoints": 2,
    "StatusTypeID": 75,
    "DateLastStatusUpdate": "2019-06-22T05:42:00Z",
    "DataQualityLevel": 1,
    "DateCreated": "2019-06-03T07:40:00Z",
    "SubmissionStatusTypeID": 200
}