{
    "IsRecentlyVerified": false,
    "ID": 139908,
    "UUID": "BF5307DF-25D0-4DEA-8470-DFF34270FEF4",
    "DataProviderID": 2,
    "DataProvidersReference": "67788",
    "OperatorID": 3293,
    "UsageTypeID": 1,
    "AddressInfo": {
        "ID": 140260,
        "Title": "Whole Foods Market",
        "AddressLine1": "4520 N Sepulveda Blvd",
        "Town": "Sherman Oaks",
        "StateOrProvince": "CA",
        "Postcode": "91403",
        "CountryID": 2,
        "Latitude": 34.151681,
        "Longitude": -118.466535,
        "ContactTelephone1": "818-382-3700  888-264-2208",
        "AccessComments": "6am-12am daily",
        "RelatedURL": "https://voltacharging.com/",
        "DistanceUnit": 0
    },
    "Connections": [
        {
            "ID": 195402,
            "ConnectionTypeID": 1,
            "LevelID": 2,
            "Amps": 16,
            "Voltage": 230,
            "PowerKW": 3.7,
            "CurrentTypeID": 10,
            "Quantity": 5
        }
    ],
    "StatusTypeID": 50,
    "DateLastStatusUpdate": "2020-06-26T02:57:00Z",
    "DataQualityLevel": 3,
    "DateCreated": "2019-12-24T09:11:00Z",
    "SubmissionStatusTypeID": 100
}