{
    "IsRecentlyVerified": false,
    "ID": 8012,
    "UUID": "0DEFC354-37B8-48A0-8FA0-02355E5C38F7",
    "DataProviderID": 15,
    "DataProvidersReference": "6588",
    "OperatorID": 26,
    "AddressInfo": {
        "ID": 7909,
        "Title": "18615 Statesville Rd",
        "AddressLine1": "18615 Statesville Rd",
        "Town": "Cornelius",
        "StateOrProvince": "NC",
        "Postcode": "28031",
        "CountryID": 2,
        "Latitude": 35.4669,
        "Longitude": -80.87231,
        "ContactTelephone1": " (704) 237-5100",
        "RelatedURL": "http://carstations.com/6588",
        "DistanceUnit": 0
    },
    "Connections": [
        {
            "ID": 5441,
            "ConnectionTypeID": 1,
            "Reference": "J1772",
            "LevelID": 2
        }
    ],
    "StatusTypeID": 0,
    "DateLastStatusUpdate": "2017-11-04T14:04:00Z",
    "DataQualityLevel": 1,
    "DateCreated": "2011-11-11T12:05:00Z",
    "SubmissionStatusTypeID": 100
}