{
    "IsRecentlyVerified": false,
    "ID": 17138,
    "UUID": "CB214FE9-C8E9-4835-86DC-E40BA2F7CE92",
    "DataProviderID": 22,
    "DataProvidersReference": "B91D12ADF38B1A2C446579B64E7C5A7C",
    "AddressInfo": {
        "ID": 17483,
        "Title": "神奈川日産自動車Ｒ１東戸塚店",
        "AddressLine1": "神奈川県横浜市戸塚区前田町36",
        "CountryID": 114,
        "Latitude": 35.42109264,
        "Longitude": 139.5531397,
        "ContactTelephone1": "045-822-2301",
        "DistanceUnit": 0
    },
    "Connections": [
        {
            "ID": 17379,
            "ConnectionTypeID": 2,
            "LevelID": 2,
            "Amps": 100,
            "Voltage": 480,
            "PowerKW": 48,
            "Quantity": 1
        }
    ],
    "DateLastStatusUpdate": "2013-06-29T08:54:00Z",
    "DataQualityLevel": 2,
    "DateCreated": "2013-06-29T08:54:00Z",
    "SubmissionStatusTypeID": 200
}