{
    "UserComments": [
        {
            "ID": 21011,
            "ChargePointID": 97125,
            "CommentTypeID": 10,
            "UserName": "eljohny",
            "Comment": "El punto de carga 4 solo he conseguido que cargue 0'7kW después de 2 horas. Parece que deja de cargar después de unos 15 minutos.",
            "Rating": 1,
            "DateCreated": "2019-05-14T10:36:46.443Z",
            "User": {
                "ID": 20604,
                "Username": "eljohny"
            }
        }
    ],
    "MediaItems": [
        {
            "ID": 19794,
            "ChargePointID": 97125,
            "ItemURL": "https://s3-ap-southeast-2.amazonaws.com/openchargemap/images/ES/OCM97125/OCM-97125.orig.2019100116255121.png",
            "ItemThumbnailURL": "https://s3-ap-southeast-2.amazonaws.com/openchargemap/images/ES/OCM97125/OCM-97125.thmb.2019100116255121.png",
            "Comment": "Estos dos cargadores están en la zona F.",
            "IsEnabled": true,
            "IsVideo": false,
            "IsFeaturedItem": false,
            "IsExternalResource": false,
            "User": {
                "ID": 16782,
                "Username": "Amarre"
            },
            "DateCreated": "2019-10-01T16:26:00Z"
        },
        {
            "ID": 19792,
            "ChargePointID": 97125,
            "ItemURL": "https://s3-ap-southeast-2.amazonaws.com/openchargemap/images/ES/OCM97125/OCM-97125.orig.2019100116240849.png",
            "ItemThumbnailURL": "https://s3-ap-southeast-2.amazonaws.com/openchargemap/images/ES/OCM97125/OCM-97125.thmb.2019100116240849.png",
            "Comment": "Conecto Mennekes Tipo 2.",
            "IsEnabled": true,
            "IsVideo": false,
            "IsFeaturedItem": false,
            "IsExternalResource": false,
            "User": {
                "ID": 16782,
                "Username": "Amarre"
            },
            "DateCreated": "2019-10-01T16:25:00Z"
        },
        {
            "ID": 19793,
            "ChargePointID": 97125,
            "ItemURL": "https://s3-ap-southeast-2.amazonaws.com/openchargemap/images/ES/OCM97125/OCM-97125.orig.2019100116244879.png",
            "ItemThumbnailURL": "https://s3-ap-southeast-2.amazonaws.com/openchargemap/images/ES/OCM97125/OCM-97125.thmb.2019100116244879.png",
            "Comment": "Conector Schuko de 16A.",
            "IsEnabled": true,
            "IsVideo": false,
            "IsFeaturedItem": false,
            "IsExternalResource": false,
            "User": {
                "ID": 16782,
                "Username": "Amarre"
            },
            "DateCreated": "2019-10-01T16:25:00Z"
        },
        {
            "ID": 19791,
            "ChargePointID": 97125,
            "ItemURL": "https://s3-ap-southeast-2.amazonaws.com/openchargemap/images/ES/OCM97125/OCM-97125.orig.2019100116231990.png",
            "ItemThumbnailURL": "https://s3-ap-southeast-2.amazonaws.com/openchargemap/images/ES/OCM97125/OCM-97125.thmb.2019100116231990.png",
            "Comment": "Cada cargador tiene una toma Schuko de 16A y una Mennekes Tipo 2 de 32A.",
            "IsEnabled": true,
            "IsVideo": false,
            "IsFeaturedItem": false,
            "IsExternalResource": false,
            "User": {
                "ID": 16782,
                "Username": "Amarre"
            },
            "DateCreated": "2019-10-01T16:24:00Z"
        },
        {
            "ID": 19790,
            "ChargePointID": 97125,
            "ItemURL": "https://s3-ap-southeast-2.amazonaws.com/openchargemap/images/ES/OCM97125/OCM-97125.orig.2019100116220569.png",
            "ItemThumbnailURL": "https://s3-ap-southeast-2.amazonaws.com/openchargemap/images/ES/OCM97125/OCM-97125.thmb.2019100116220569.png",
            "Comment": "Este cargador funciona con la APP de carga de Iberdrola.",
            "IsEnabled": true,
            "IsVideo": false,
            "IsFeaturedItem": false,
            "IsExternalResource": false,
            "User": {
                "ID": 16782,
                "Username": "Amarre"
            },
            "DateCreated": "2019-10-01T16:22:00Z"
        },
        {
            "ID": 19789,
            "ChargePointID": 97125,
            "ItemURL": "https://s3-ap-southeast-2.amazonaws.com/openchargemap/images/ES/OCM97125/OCM-97125.orig.2019100116204961.png",
            "ItemThumbnailURL": "https://s3-ap-southeast-2.amazonaws.com/openchargemap/images/ES/OCM97125/OCM-97125.thmb.2019100116204961.png",
            "Comment": "Estos cargadores sustituyen a los anteriores. Zona G.",
            "IsEnabled": true,
            "IsVideo": false,
            "IsFeaturedItem": false,
            "IsExternalResource": false,
            "User": {
                "ID": 16782,
                "Username": "Amarre"
            },
            "DateCreated": "2019-10-01T16:21:00Z"
        },
        {
            "ID": 13905,
            "ChargePointID": 97125,
            "ItemURL": "https://s3-ap-southeast-2.amazonaws.com/openchargemap/images/ES/OCM97125/OCM-97125.orig.2018010518483408.jpg",
            "ItemThumbnailURL": "https://s3-ap-southeast-2.amazonaws.com/openchargemap/images/ES/OCM97125/OCM-97125.thmb.2018010518483408.jpg",
            "Comment": "",
            "IsEnabled": true,
            "IsVideo": false,
            "IsFeaturedItem": false,
            "IsExternalResource": false,
            "User": {
                "ID": 16782,
                "Username": "Amarre"
            },
            "DateCreated": "2018-01-05T18:49:00Z"
        },
        {
            "ID": 13906,
            "ChargePointID": 97125,
            "ItemURL": "https://s3-ap-southeast-2.amazonaws.com/openchargemap/images/ES/OCM97125/OCM-97125.orig.2018010518485343.jpg",
            "ItemThumbnailURL": "https://s3-ap-southeast-2.amazonaws.com/openchargemap/images/ES/OCM97125/OCM-97125.thmb.2018010518485343.jpg",
            "Comment": "",
            "IsEnabled": true,
            "IsVideo": false,
            "IsFeaturedItem": false,
            "IsExternalResource": false,
            "User": {
                "ID": 16782,
                "Username": "Amarre"
            },
            "DateCreated": "2018-01-05T18:49:00Z"
        },
        {
            "ID": 13907,
            "ChargePointID": 97125,
            "ItemURL": "https://s3-ap-southeast-2.amazonaws.com/openchargemap/images/ES/OCM97125/OCM-97125.orig.2018010518491195.jpg",
            "ItemThumbnailURL": "https://s3-ap-southeast-2.amazonaws.com/openchargemap/images/ES/OCM97125/OCM-97125.thmb.2018010518491195.jpg",
            "Comment": "",
            "IsEnabled": true,
            "IsVideo": false,
            "IsFeaturedItem": false,
            "IsExternalResource": false,
            "User": {
                "ID": 16782,
                "Username": "Amarre"
            },
            "DateCreated": "2018-01-05T18:49:00Z"
        },
        {
            "ID": 13901,
            "ChargePointID": 97125,
            "ItemURL": "https://s3-ap-southeast-2.amazonaws.com/openchargemap/images/ES/OCM97125/OCM-97125.orig.2018010518471931.jpg",
            "ItemThumbnailURL": "https://s3-ap-southeast-2.amazonaws.com/openchargemap/images/ES/OCM97125/OCM-97125.thmb.2018010518471931.jpg",
            "Comment": "",
            "IsEnabled": true,
            "IsVideo": false,
            "IsFeaturedItem": false,
            "IsExternalResource": false,
            "User": {
                "ID": 16782,
                "Username": "Amarre"
            },
            "DateCreated": "2018-01-05T18:48:00Z"
        },
        {
            "ID": 13902,
            "ChargePointID": 97125,
            "ItemURL": "https://s3-ap-southeast-2.amazonaws.com/openchargemap/images/ES/OCM97125/OCM-97125.orig.2018010518473884.jpg",
            "ItemThumbnailURL": "https://s3-ap-southeast-2.amazonaws.com/openchargemap/images/ES/OCM97125/OCM-97125.thmb.2018010518473884.jpg",
            "Comment": "",
            "IsEnabled": true,
            "IsVideo": false,
            "IsFeaturedItem": false,
            "IsExternalResource": false,
            "User": {
                "ID": 16782,
                "Username": "Amarre"
            },
            "DateCreated": "2018-01-05T18:48:00Z"
        },
        {
            "ID": 13903,
            "ChargePointID": 97125,
            "ItemURL": "https://s3-ap-southeast-2.amazonaws.com/openchargemap/images/ES/OCM97125/OCM-97125.orig.2018010518475671.jpg",
            "ItemThumbnailURL": "https://s3-ap-southeast-2.amazonaws.com/openchargemap/images/ES/OCM97125/OCM-97125.thmb.2018010518475671.jpg",
            "Comment": "",
            "IsEnabled": true,
            "IsVideo": false,
            "IsFeaturedItem": false,
            "IsExternalResource": false,
            "User": {
                "ID": 16782,
                "Username": "Amarre"
            },
            "DateCreated": "2018-01-05T18:48:00Z"
        },
        {
            "ID": 13904,
            "ChargePointID": 97125,
            "ItemURL": "https://s3-ap-southeast-2.amazonaws.com/openchargemap/images/ES/OCM97125/OCM-97125.orig.2018010518481596.jpg",
            "ItemThumbnailURL": "https://s3-ap-southeast-2.amazonaws.com/openchargemap/images/ES/OCM97125/OCM-97125.thmb.2018010518481596.jpg",
            "Comment": "",
            "IsEnabled": true,
            "IsVideo": false,
            "IsFeaturedItem": false,
            "IsExternalResource": false,
            "User": {
                "ID": 16782,
                "Username": "Amarre"
            },
            "DateCreated": "2018-01-05T18:48:00Z"
        },
        {
            "ID": 13899,
            "ChargePointID": 97125,
            "ItemURL": "https://s3-ap-southeast-2.amazonaws.com/openchargemap/images/ES/OCM97125/OCM-97125.orig.2018010518464062.jpg",
            "ItemThumbnailURL": "https://s3-ap-southeast-2.amazonaws.com/openchargemap/images/ES/OCM97125/OCM-97125.thmb.2018010518464062.jpg",
            "Comment": "",
            "IsEnabled": true,
            "IsVideo": false,
            "IsFeaturedItem": false,
            "IsExternalResource": false,
            "User": {
                "ID": 16782,
                "Username": "Amarre"
            },
            "DateCreated": "2018-01-05T18:47:00Z"
        },
        {
            "ID": 13900,
            "ChargePointID": 97125,
            "ItemURL": "https://s3-ap-southeast-2.amazonaws.com/openchargemap/images/ES/OCM97125/OCM-97125.orig.2018010518470321.jpg",
            "ItemThumbnailURL": "https://s3-ap-southeast-2.amazonaws.com/openchargemap/images/ES/OCM97125/OCM-97125.thmb.2018010518470321.jpg",
            "Comment": "",
            "IsEnabled": true,
            "IsVideo": false,
            "IsFeaturedItem": false,
            "IsExternalResource": false,
            "User": {
                "ID": 16782,
                "Username": "Amarre"
            },
            "DateCreated": "2018-01-05T18:47:00Z"
        }
    ],
    "IsRecentlyVerified": false,
    "ID": 97125,
    "UUID": "AA241B18-4F76-4B5E-99CB-809F2850EF6D",
    "DataProviderID": 1,
    "OperatorID": 45,
    "UsageTypeID": 1,
    "UsageCost": "0",
    "AddressInfo": {
        "ID": 97471,
        "Title": "IKEA Puerto Venecia Zaragoza",
        "AddressLine1": "Calle Teatro Malibrán, 30",
        "Town": "Zaragoza",
        "StateOrProvince": "Zaragoza",
        "Postcode": "50021",
        "CountryID": 210,
        "Latitude": 41.6074379471538,
        "Longitude": -0.891445643933138,
        "RelatedURL": "http://www.ikea.com/es/es/store/zaragoza/",
        "DistanceUnit": 0
    },
    "Connections": [
        {
            "ID": 137892,
            "ConnectionTypeID": 25,
            "StatusTypeID": 50,
            "LevelID": 2,
            "Amps": 32,
            "Voltage": 230,
            "PowerKW": 7.6,
            "CurrentTypeID": 10,
            "Quantity": 1
        },
        {
            "ID": 137893,
            "ConnectionTypeID": 28,
            "StatusTypeID": 50,
            "LevelID": 2,
            "Amps": 16,
            "Voltage": 230,
            "PowerKW": 3.7,
            "CurrentTypeID": 10,
            "Quantity": 1
        }
    ],
    "NumberOfPoints": 4,
    "GeneralComments": "Business hours. Horario comercial.  Cargadores ubicados en la zona F y G. Carga hasta 4 horas.",
    "StatusTypeID": 50,
    "DateLastStatusUpdate": "2019-10-02T09:56:00Z",
    "DataQualityLevel": 1,
    "DateCreated": "2018-01-05T18:46:00Z",
    "SubmissionStatusTypeID": 200
}