{
    "IsRecentlyVerified": false,
    "ID": 103014,
    "UUID": "E162173B-336F-4009-8743-6D98A17ACE16",
    "DataProviderID": 2,
    "DataProvidersReference": "94884",
    "OperatorID": 3372,
    "UsageTypeID": 1,
    "AddressInfo": {
        "ID": 103360,
        "Title": "Costco",
        "AddressLine1": "999 Lake Dr",
        "Town": "Issaquah",
        "StateOrProvince": "WA",
        "Postcode": "98027",
        "CountryID": 2,
        "Latitude": 47.54894,
        "Longitude": -122.04991,
        "ContactTelephone1": "866-816-7584",
        "AccessComments": "24 hours daily",
        "RelatedURL": "http://evconnect.com/",
        "DistanceUnit": 0
    },
    "Connections": [
        {
            "ID": 145169,
            "ConnectionTypeID": 1,
            "LevelID": 2,
            "Amps": 16,
            "Voltage": 230,
            "PowerKW": 3.7,
            "CurrentTypeID": 10,
            "Quantity": 2
        }
    ],
    "DateLastStatusUpdate": "2020-06-26T03:11:00Z",
    "DataQualityLevel": 3,
    "DateCreated": "2018-04-21T04:13:00Z",
    "SubmissionStatusTypeID": 100
}