{
    "IsRecentlyVerified": false,
    "ID": 175062,
    "UUID": "0B95B32A-ECD0-4107-A690-803240CE83A3",
    "DataProviderID": 1,
    "OperatorID": 192,
    "UsageTypeID": 1,
    "AddressInfo": {
        "ID": 175421,
        "Title": "Liberecká",
        "AddressLine1": "Liberecká",
        "AddressLine2": "Libeň",
        "StateOrProvince": "Praha",
        "Postcode": "18000",
        "CountryID": 64,
        "Latitude": 50.12125728747526,
        "Longitude": 14.47574526492599,
        "AccessComments": "Zaplatit můžete přes QR kód či web. Na webu zadejte číslo dobíjecího bodu, svůj e-mail a číslo svojí platební karty. Pak už jen potvrďte konektor a dobíjíte.",
        "RelatedURL": "http://nabijeni.eon-drive.cz",
        "DistanceUnit": 0
    },
    "Connections": [
        {
            "ID": 271309,
            "ConnectionTypeID": 2,
            "StatusTypeID": 50,
            "LevelID": 3,
            "PowerKW": 50,
            "CurrentTypeID": 30,
            "Quantity": 1
        },
        {
            "ID": 271310,
            "ConnectionTypeID": 33,
            "StatusTypeID": 50,
            "LevelID": 3,
            "PowerKW": 50,
            "CurrentTypeID": 30,
            "Quantity": 1
        },
        {
            "ID": 271311,
            "ConnectionTypeID": 25,
            "StatusTypeID": 50,
            "LevelID": 3,
            "Amps": 64,
            "Voltage": 400,
            "PowerKW": 43,
            "CurrentTypeID": 20,
            "Quantity": 1
        }
    ],
    "NumberOfPoints": 1,
    "StatusTypeID": 50,
    "DateLastStatusUpdate": "2021-05-15T07:51:00Z",
    "DataQualityLevel": 1,
    "DateCreated": "2021-04-25T16:04:00Z",
    "SubmissionStatusTypeID": 200
}