{
    "UserComments": [
        {
            "ID": 15982,
            "ChargePointID": 84492,
            "CommentTypeID": 10,
            "UserName": "Bert van Sas",
            "Rating": 4,
            "DateCreated": "2017-03-01T15:12:33.07Z",
            "User": {
                "ID": 11617,
                "Username": "Bert van Sas"
            },
            "CheckinStatusTypeID": 140
        }
    ],
    "MediaItems": [
        {
            "ID": 10547,
            "ChargePointID": 84492,
            "ItemURL": "https://s3-ap-southeast-2.amazonaws.com/openchargemap/images/NL/OCM84492/OCM-84492.orig.2017030115115908.jpg",
            "ItemThumbnailURL": "https://s3-ap-southeast-2.amazonaws.com/openchargemap/images/NL/OCM84492/OCM-84492.thmb.2017030115115908.jpg",
            "Comment": "",
            "IsEnabled": true,
            "IsVideo": false,
            "IsFeaturedItem": false,
            "IsExternalResource": false,
            "User": {
                "ID": 11617,
                "Username": "Bert van Sas"
            },
            "DateCreated": "2017-03-01T15:12:00Z"
        },
        {
            "ID": 10548,
            "ChargePointID": 84492,
            "ItemURL": "https://s3-ap-southeast-2.amazonaws.com/openchargemap/images/NL/OCM84492/OCM-84492.orig.2017030115120681.jpg",
            "ItemThumbnailURL": "https://s3-ap-southeast-2.amazonaws.com/openchargemap/images/NL/OCM84492/OCM-84492.thmb.2017030115120681.jpg",
            "Comment": "",
            "IsEnabled": true,
            "IsVideo": false,
            "IsFeaturedItem": false,
            "IsExternalResource": false,
            "User": {
                "ID": 11617,
                "Username": "Bert van Sas"
            },
            "DateCreated": "2017-03-01T15:12:00Z"
        },
        {
            "ID": 10549,
            "ChargePointID": 84492,
            "ItemURL": "https://s3-ap-southeast-2.amazonaws.com/openchargemap/images/NL/OCM84492/OCM-84492.orig.2017030115121542.jpg",
            "ItemThumbnailURL": "https://s3-ap-southeast-2.amazonaws.com/openchargemap/images/NL/OCM84492/OCM-84492.thmb.2017030115121542.jpg",
            "Comment": "",
            "IsEnabled": true,
            "IsVideo": false,
            "IsFeaturedItem": false,
            "IsExternalResource": false,
            "User": {
                "ID": 11617,
                "Username": "Bert van Sas"
            },
            "DateCreated": "2017-03-01T15:12:00Z"
        }
    ],
    "IsRecentlyVerified": false,
    "ID": 84492,
    "UUID": "07215A67-1239-4DA4-AEC4-460F5F146AAA",
    "DataProviderID": 1,
    "OperatorID": 73,
    "UsageTypeID": 1,
    "AddressInfo": {
        "ID": 84838,
        "Title": "Mitsubishi Goes",
        "AddressLine1": "Pearyweg 2",
        "Town": "Goes",
        "StateOrProvince": "Zeeland",
        "CountryID": 159,
        "Latitude": 51.486798817462514,
        "Longitude": 3.8782800730164046,
        "DistanceUnit": 0
    },
    "Connections": [
        {
            "ID": 119966,
            "ConnectionTypeID": 25,
            "StatusTypeID": 50,
            "LevelID": 2,
            "PowerKW": 3,
            "Quantity": 2
        }
    ],
    "NumberOfPoints": 2,
    "StatusTypeID": 50,
    "DateLastStatusUpdate": "2017-03-01T15:13:00Z",
    "DataQualityLevel": 1,
    "DateCreated": "2017-03-01T15:12:00Z",
    "SubmissionStatusTypeID": 200
}