{
    "IsRecentlyVerified": false,
    "ID": 90445,
    "UUID": "BB290C25-1A55-41AB-9389-C42A505E1561",
    "DataProviderID": 1,
    "OperatorID": 23,
    "OperatorsReference": "30041",
    "UsageTypeID": 6,
    "AddressInfo": {
        "ID": 90791,
        "Title": "Château de Chapeau Cornu",
        "AddressLine1": "312 Rue de la Garenne",
        "Town": "Vignieu",
        "Postcode": "38890",
        "CountryID": 80,
        "Latitude": 45.635625,
        "Longitude": 5.404367,
        "ContactTelephone1": "+33 4 74 27 79 00",
        "DistanceUnit": 0
    },
    "Connections": [
        {
            "ID": 128098,
            "ConnectionTypeID": 30,
            "StatusTypeID": 50,
            "LevelID": 2,
            "Amps": 16,
            "Voltage": 400,
            "PowerKW": 11,
            "CurrentTypeID": 20,
            "Quantity": 2
        }
    ],
    "NumberOfPoints": 2,
    "GeneralComments": "2 Tesla Connectors, up to 11kW.Available for patrons only. Please see front desk.",
    "StatusTypeID": 50,
    "DateLastStatusUpdate": "2018-10-03T22:21:00Z",
    "DataQualityLevel": 1,
    "DateCreated": "2017-07-13T15:24:00Z",
    "SubmissionStatusTypeID": 200
}