{
    "IsRecentlyVerified": false,
    "ID": 88550,
    "UUID": "D95FE5B2-CDC1-446F-BE83-D8052BE0B7E6",
    "DataProviderID": 1,
    "OperatorID": 25,
    "OperatorsReference": "hammersmithandfulham-39steventonroad",
    "UsageTypeID": 4,
    "UsageCost": "£0.059/minute; min £1.18; other tariffs available",
    "AddressInfo": {
        "ID": 88896,
        "Title": "39 Steventon Road",
        "AddressLine1": "39 Steventon Road",
        "Town": "LONDON",
        "Postcode": "W12 0TB",
        "CountryID": 1,
        "Latitude": 51.5031715121,
        "Longitude": -0.23083397133,
        "DistanceUnit": 0
    },
    "Connections": [
        {
            "ID": 125612,
            "ConnectionTypeID": 25,
            "StatusTypeID": 50,
            "LevelID": 2,
            "Amps": 32,
            "Voltage": 230,
            "PowerKW": 7,
            "CurrentTypeID": 10,
            "Quantity": 3
        },
        {
            "ID": 125613,
            "ConnectionTypeID": 1,
            "StatusTypeID": 50,
            "LevelID": 2,
            "Amps": 16,
            "Voltage": 230,
            "PowerKW": 4,
            "CurrentTypeID": 10,
            "Quantity": 3
        }
    ],
    "NumberOfPoints": 3,
    "StatusTypeID": 50,
    "DateLastStatusUpdate": "2020-01-10T09:43:00Z",
    "DataQualityLevel": 1,
    "DateCreated": "2017-06-01T13:07:00Z",
    "SubmissionStatusTypeID": 200
}