{
    "IsRecentlyVerified": false,
    "ID": 66840,
    "UUID": "245C21B4-821A-4F30-A3F0-BE1C83C91E84",
    "DataProviderID": 1,
    "OperatorID": 23,
    "OperatorsReference": "17712",
    "UsageTypeID": 1,
    "UsageCost": "Free",
    "AddressInfo": {
        "ID": 67186,
        "Title": "Paragon Design Center - Tesla",
        "AddressLine1": "19103 Interstate 45",
        "Town": "Spring",
        "StateOrProvince": "TX",
        "Postcode": "77388",
        "CountryID": 2,
        "Latitude": 30.0440722,
        "Longitude": -95.4315924,
        "ContactTelephone1": "832-525-6072  877-798-3752",
        "AccessComments": "24 hours daily; for Tesla use only",
        "RelatedURL": "http://www.teslamotors.com/supercharger",
        "DistanceUnit": 0
    },
    "Connections": [
        {
            "ID": 92327,
            "ConnectionTypeID": 30,
            "StatusTypeID": 50,
            "LevelID": 2,
            "Amps": 16,
            "Voltage": 230,
            "PowerKW": 13,
            "CurrentTypeID": 10,
            "Quantity": 2
        }
    ],
    "NumberOfPoints": 2,
    "StatusTypeID": 50,
    "DateLastStatusUpdate": "2017-01-31T18:45:00Z",
    "DataQualityLevel": 3,
    "DateCreated": "2016-05-29T02:04:00Z",
    "SubmissionStatusTypeID": 100
}