{
    "IsRecentlyVerified": false,
    "ID": 139528,
    "UUID": "B4749285-CF25-4D02-99C1-E79FBC8EDA3E",
    "DataProviderID": 2,
    "DataProvidersReference": "85946",
    "OperatorID": 5,
    "UsageTypeID": 1,
    "AddressInfo": {
        "ID": 139880,
        "Title": "KILROY REALTY",
        "AddressLine1": "955 N. Sepulveda Blvd.",
        "Town": "El Segundo",
        "StateOrProvince": "CA",
        "Postcode": "90245",
        "CountryID": 2,
        "Latitude": 33.9299637,
        "Longitude": -118.3970873,
        "ContactTelephone1": "888-758-4389",
        "AccessComments": "24 hours daily",
        "RelatedURL": "http://www.chargepoint.com/",
        "DistanceUnit": 0
    },
    "Connections": [
        {
            "ID": 194925,
            "ConnectionTypeID": 1,
            "LevelID": 2,
            "Amps": 16,
            "Voltage": 230,
            "PowerKW": 3,
            "CurrentTypeID": 10,
            "Quantity": 2
        }
    ],
    "StatusTypeID": 50,
    "DateLastStatusUpdate": "2019-12-24T09:11:00Z",
    "DataQualityLevel": 3,
    "DateCreated": "2019-12-24T09:11:00Z",
    "SubmissionStatusTypeID": 100
}