{
    "IsRecentlyVerified": false,
    "ID": 84839,
    "UUID": "65AE72BD-6E43-4CC1-98BF-5EDD50190D77",
    "DataProviderID": 1,
    "OperatorID": 3315,
    "OperatorsReference": "51340",
    "UsageTypeID": 4,
    "UsageCost": "16p per kWh",
    "AddressInfo": {
        "ID": 85185,
        "Title": "National Mining Museum",
        "AddressLine1": "Newbattle",
        "Town": "Newtongrange",
        "StateOrProvince": "Midlothian",
        "Postcode": "EH22 4QN",
        "CountryID": 1,
        "Latitude": 55.86194,
        "Longitude": -3.0655262,
        "DistanceUnit": 0
    },
    "Connections": [
        {
            "ID": 120551,
            "ConnectionTypeID": 25,
            "StatusTypeID": 50,
            "LevelID": 2,
            "Amps": 32,
            "Voltage": 400,
            "PowerKW": 22,
            "CurrentTypeID": 20,
            "Quantity": 2
        }
    ],
    "NumberOfPoints": 2,
    "StatusTypeID": 50,
    "DateLastStatusUpdate": "2021-10-04T09:24:00Z",
    "DataQualityLevel": 1,
    "DateCreated": "2017-03-17T14:27:00Z",
    "SubmissionStatusTypeID": 200
}