{
    "IsRecentlyVerified": false,
    "ID": 142192,
    "UUID": "5D6746C9-D46B-4AED-A7B5-FAFCCB064992",
    "DataProviderID": 2,
    "DataProvidersReference": "117453",
    "OperatorID": 9,
    "UsageTypeID": 1,
    "AddressInfo": {
        "ID": 142544,
        "Title": "Whole Foods - Springhouse",
        "AddressLine1": "1111 Bethlehem Pike",
        "Town": "Springhouse",
        "StateOrProvince": "PA",
        "Postcode": "19477",
        "CountryID": 2,
        "Latitude": 40.187935,
        "Longitude": -75.227402,
        "ContactTelephone1": "888-998-2546",
        "AccessComments": "MON: 7:00am-11:00pm | TUE: 7:00am-11:00pm | WED: 7:00am-11:00pm | THU: 7:00am-11:00pm | FRI: 7:00am-11:00pm | SAT: 7:00am-11:00pm | SUN: 7:00am-11:00pm",
        "RelatedURL": "http://www.blinkcharging.com/",
        "DistanceUnit": 0
    },
    "Connections": [
        {
            "ID": 198275,
            "ConnectionTypeID": 1,
            "LevelID": 2,
            "Amps": 16,
            "Voltage": 230,
            "PowerKW": 3.7,
            "CurrentTypeID": 10,
            "Quantity": 1
        }
    ],
    "StatusTypeID": 50,
    "DateLastStatusUpdate": "2020-06-26T03:02:00Z",
    "DataQualityLevel": 3,
    "DateCreated": "2019-12-24T09:17:00Z",
    "SubmissionStatusTypeID": 100
}