{
    "MediaItems": [
        {
            "ID": 10638,
            "ChargePointID": 84721,
            "ItemURL": "https://s3-ap-southeast-2.amazonaws.com/openchargemap/images/CZ/OCM84721/OCM-84721.orig.2017031214005913.jpg",
            "ItemThumbnailURL": "https://s3-ap-southeast-2.amazonaws.com/openchargemap/images/CZ/OCM84721/OCM-84721.thmb.2017031214005913.jpg",
            "Comment": "",
            "IsEnabled": true,
            "IsVideo": false,
            "IsFeaturedItem": false,
            "IsExternalResource": false,
            "User": {
                "ID": 6224,
                "Username": "ozana"
            },
            "DateCreated": "2017-03-12T14:01:00Z"
        }
    ],
    "IsRecentlyVerified": false,
    "ID": 84721,
    "UUID": "B4CACA19-FD90-4BB0-8904-751281E2FEE8",
    "DataProviderID": 1,
    "OperatorID": 45,
    "UsageTypeID": 6,
    "AddressInfo": {
        "ID": 85067,
        "Title": "Harmony Club Hotel",
        "AddressLine1": "Bedřichov 106",
        "AddressLine2": "Bedřichov v Krkonoších",
        "Town": "Špindlerův Mlýn",
        "StateOrProvince": "okres Trutnov",
        "Postcode": "54351",
        "CountryID": 64,
        "Latitude": 50.7276681,
        "Longitude": 15.5993188,
        "ContactTelephone1": " +420 499 469 111",
        "ContactEmail": "recepce@harmonyclub.cz",
        "AccessComments": "Po domluvě lze nabíjet i  elektromobily hostů bez ubytování. Cena dle poskytnutého výkonu a času. Přibližně 100Kč za hodinu.",
        "RelatedURL": "http://www.harmonyclub.cz/",
        "DistanceUnit": 0
    },
    "Connections": [
        {
            "ID": 120352,
            "ConnectionTypeID": 25,
            "StatusTypeID": 50,
            "LevelID": 2,
            "Amps": 32,
            "Voltage": 400,
            "PowerKW": 22,
            "CurrentTypeID": 20,
            "Quantity": 1
        }
    ],
    "NumberOfPoints": 1,
    "StatusTypeID": 50,
    "DateLastStatusUpdate": "2017-03-12T19:05:00Z",
    "DataQualityLevel": 1,
    "DateCreated": "2017-03-12T14:00:00Z",
    "SubmissionStatusTypeID": 200
}