{
    "IsRecentlyVerified": false,
    "ID": 108887,
    "UUID": "1F5E9FBC-AC83-41EA-96CF-B6A1F7A2F2D8",
    "DataProviderID": 1,
    "OperatorID": 23,
    "OperatorsReference": "46048",
    "UsageTypeID": 4,
    "AddressInfo": {
        "ID": 109233,
        "Title": "The Fisherman's Retreat",
        "AddressLine1": "Riding Head Lane",
        "Town": "Bye Road",
        "StateOrProvince": "Ramsbottom",
        "Postcode": "BL0 0HH",
        "CountryID": 1,
        "Latitude": 53.655762,
        "Longitude": -2.290255,
        "ContactTelephone1": "+44 170 682 5314",
        "DistanceUnit": 0
    },
    "Connections": [
        {
            "ID": 154004,
            "ConnectionTypeID": 30,
            "StatusTypeID": 50,
            "LevelID": 2,
            "PowerKW": 6,
            "CurrentTypeID": 10,
            "Quantity": 2
        }
    ],
    "NumberOfPoints": 2,
    "GeneralComments": "2 Tesla Connectors, up to 6kW.Available for customers. Please call ahead.",
    "StatusTypeID": 50,
    "DateLastStatusUpdate": "2018-10-11T12:58:00Z",
    "DataQualityLevel": 1,
    "DateCreated": "2018-10-11T12:58:00Z",
    "SubmissionStatusTypeID": 200
}