{
    "IsRecentlyVerified": false,
    "ID": 159809,
    "UUID": "5181B473-B214-4ED5-A8E2-D82239578EC3",
    "DataProviderID": 2,
    "DataProvidersReference": "154031",
    "OperatorID": 5,
    "UsageTypeID": 1,
    "AddressInfo": {
        "ID": 160166,
        "Title": "CCRTA",
        "AddressLine1": "68 Center St",
        "Town": "Barnstable",
        "StateOrProvince": "MA",
        "Postcode": "02601",
        "CountryID": 2,
        "Latitude": 41.6560409,
        "Longitude": -70.2805144,
        "ContactTelephone1": "888-758-4389",
        "AccessComments": "24 hours daily",
        "RelatedURL": "http://www.chargepoint.com/",
        "DistanceUnit": 0
    },
    "Connections": [
        {
            "ID": 230027,
            "ConnectionTypeID": 1,
            "LevelID": 2,
            "Amps": 16,
            "Voltage": 230,
            "PowerKW": 3.7,
            "CurrentTypeID": 10,
            "Quantity": 2
        }
    ],
    "StatusTypeID": 50,
    "DateLastStatusUpdate": "2020-06-26T03:04:00Z",
    "DataQualityLevel": 3,
    "DateCreated": "2020-06-26T03:04:00Z",
    "SubmissionStatusTypeID": 100
}