{
    "IsRecentlyVerified": false,
    "ID": 20349,
    "UUID": "86330BE6-B756-4A9A-A094-90ED836D6887",
    "DataProviderID": 1,
    "OperatorID": 1,
    "UsageTypeID": 0,
    "UsageCost": "",
    "AddressInfo": {
        "ID": 20694,
        "Title": "Renault - Cannes La Bocca",
        "AddressLine1": "219 Avenue Francis Tonner ",
        "AddressLine2": "",
        "Town": "Cannes",
        "StateOrProvince": "",
        "Postcode": "06150",
        "CountryID": 80,
        "Latitude": 43.55,
        "Longitude": 6.96259,
        "ContactTelephone1": "",
        "ContactTelephone2": "",
        "ContactEmail": "",
        "AccessComments": "Réservé aux clients de l'établissement",
        "RelatedURL": "",
        "DistanceUnit": 0
    },
    "Connections": [],
    "GeneralComments": "",
    "StatusTypeID": 50,
    "DateLastStatusUpdate": "2013-11-12T11:56:00Z",
    "DataQualityLevel": 1,
    "DateCreated": "2013-11-12T09:43:00Z",
    "SubmissionStatusTypeID": 200
}