{
    "IsRecentlyVerified": false,
    "ID": 29412,
    "UUID": "9887BC7A-9542-4DD4-BC76-DFA91C40C775",
    "DataProviderID": 2,
    "DataProvidersReference": "49766",
    "OperatorID": 5,
    "UsageTypeID": 1,
    "AddressInfo": {
        "ID": 29758,
        "Title": "CARCHARGING",
        "AddressLine1": "1200 Western Ave",
        "Town": "Seattle",
        "StateOrProvince": "WA",
        "Postcode": "98101",
        "CountryID": 2,
        "Latitude": 47.6059837,
        "Longitude": -122.3387451,
        "ContactTelephone1": "888-758-4389",
        "AccessComments": "24 hours daily",
        "RelatedURL": "http://www.chargepoint.com/",
        "DistanceUnit": 0
    },
    "Connections": [
        {
            "ID": 32348,
            "ConnectionTypeID": 1,
            "LevelID": 2,
            "Amps": 16,
            "Voltage": 230,
            "PowerKW": 3,
            "CurrentTypeID": 10,
            "Quantity": 1
        }
    ],
    "DateLastStatusUpdate": "2019-12-24T09:24:00Z",
    "DataQualityLevel": 3,
    "DateCreated": "2014-11-28T03:39:00Z",
    "SubmissionStatusTypeID": 100
}