{
    "IsRecentlyVerified": false,
    "ID": 99283,
    "UUID": "24D43E07-CB29-4B0C-96DB-8FDBCB72761E",
    "DataProviderID": 1,
    "OperatorID": 3279,
    "OperatorsReference": "0096",
    "UsageTypeID": 4,
    "UsageCost": "€0/kWh",
    "AddressInfo": {
        "ID": 99629,
        "Title": "Ayuntamiento de Son Servera",
        "AddressLine1": "Ayuntamiento de Son Servera",
        "Town": "Cala Millor",
        "Postcode": "07560",
        "CountryID": 210,
        "Latitude": 39.60424,
        "Longitude": 3.379626,
        "DistanceUnit": 0
    },
    "Connections": [
        {
            "ID": 140270,
            "ConnectionTypeID": 25,
            "StatusTypeID": 50,
            "LevelID": 2,
            "Amps": 32,
            "Voltage": 230,
            "PowerKW": 7,
            "CurrentTypeID": 10,
            "Quantity": 1
        },
        {
            "ID": 140271,
            "ConnectionTypeID": 28,
            "StatusTypeID": 50,
            "LevelID": 1,
            "Voltage": 230,
            "PowerKW": 2.3,
            "CurrentTypeID": 10,
            "Quantity": 1
        }
    ],
    "NumberOfPoints": 1,
    "StatusTypeID": 50,
    "DateLastStatusUpdate": "2019-12-18T20:21:00Z",
    "DataQualityLevel": 1,
    "DateCreated": "2018-01-25T18:47:00Z",
    "SubmissionStatusTypeID": 200
}