{
    "IsRecentlyVerified": false,
    "ID": 177474,
    "UUID": "9D918B07-A086-4BFD-9B6E-386303980D7D",
    "DataProviderID": 29,
    "DataProvidersReference": "13262",
    "AddressInfo": {
        "ID": 177833,
        "Title": "Hauptstr. 28",
        "AddressLine1": "Hauptstr. 28",
        "Town": "Kölbingen",
        "Postcode": "56459",
        "CountryID": 87,
        "Latitude": 50.551043,
        "Longitude": 7.934248,
        "DistanceUnit": 0
    },
    "Connections": [
        {
            "ID": 276647,
            "ConnectionTypeID": 25,
            "StatusTypeID": 50,
            "LevelID": 2,
            "PowerKW": 22,
            "CurrentTypeID": 20
        },
        {
            "ID": 276648,
            "ConnectionTypeID": 25,
            "StatusTypeID": 50,
            "LevelID": 2,
            "PowerKW": 22,
            "CurrentTypeID": 20
        }
    ],
    "StatusTypeID": 0,
    "DateLastStatusUpdate": "2021-07-12T02:45:00Z",
    "MetadataValues": [
        {
            "ID": 9768,
            "MetadataFieldID": 4,
            "ItemValue": "Data from the German chargepoint registry provided by Bundesnetzagentur.de under the CC-BY 4.0 license"
        }
    ],
    "DataQualityLevel": 3,
    "DateCreated": "2021-07-08T09:49:00Z",
    "SubmissionStatusTypeID": 100
}