{
    "IsRecentlyVerified": false,
    "ID": 188408,
    "UUID": "993C4031-7251-44D8-B09A-F36DA1E02E58",
    "DataProviderID": 1,
    "OperatorID": 3364,
    "UsageTypeID": 4,
    "UsageCost": "35 CLP/MIN",
    "AddressInfo": {
        "ID": 188767,
        "Title": "Antofagasta",
        "AddressLine1": "Avenida Edmundo Pérez Zujovic 10675",
        "Town": "Antofagasta",
        "StateOrProvince": "Antofagasta Region",
        "Postcode": "",
        "CountryID": 49,
        "Latitude": -23.565091562190744,
        "Longitude": -70.39841768033278,
        "RelatedURL": "https://copecvoltex.cl/",
        "DistanceUnit": 0
    },
    "Connections": [
        {
            "ID": 304205,
            "ConnectionTypeID": 25,
            "StatusTypeID": 50,
            "LevelID": 2,
            "PowerKW": 43,
            "Quantity": 1
        }
    ],
    "NumberOfPoints": 1,
    "StatusTypeID": 50,
    "DateLastStatusUpdate": "2021-07-22T14:56:00Z",
    "DataQualityLevel": 1,
    "DateCreated": "2021-07-22T14:56:00Z",
    "SubmissionStatusTypeID": 200
}