{
    "IsRecentlyVerified": false,
    "ID": 29926,
    "UUID": "E71153D0-ED95-48AA-B602-4F00E408022A",
    "DataProviderID": 15,
    "DataProvidersReference": "30668",
    "OperatorID": 94,
    "UsageTypeID": 1,
    "AddressInfo": {
        "ID": 30272,
        "Title": "943 Ridge Road",
        "AddressLine1": "943 Ridge Road",
        "Town": "Webster",
        "StateOrProvince": "New York",
        "Postcode": "14580",
        "CountryID": 2,
        "Latitude": 43.20771,
        "Longitude": -77.46317,
        "ContactTelephone1": "585-671-3000",
        "RelatedURL": "http://carstations.com/30668",
        "DistanceUnit": 0
    },
    "Connections": [
        {
            "ID": 32911,
            "ConnectionTypeID": 1,
            "Reference": "J1772",
            "LevelID": 2
        }
    ],
    "NumberOfPoints": 1,
    "StatusTypeID": 0,
    "DateLastStatusUpdate": "2017-11-04T14:04:00Z",
    "DataQualityLevel": 2,
    "DateCreated": "2014-11-29T05:39:00Z",
    "SubmissionStatusTypeID": 100
}