{
    "IsRecentlyVerified": false,
    "ID": 170690,
    "UUID": "479E9ECF-78D1-48ED-BDB7-4970B524F461",
    "DataProviderID": 1,
    "OperatorID": 3,
    "OperatorsReference": "PG-91351,PG-91369,PG-91394",
    "UsageTypeID": 4,
    "UsageCost": "Free",
    "AddressInfo": {
        "ID": 171049,
        "Title": "Mcdonald's-North Acton",
        "AddressLine1": "12 Leamington Park",
        "Town": "Acton",
        "StateOrProvince": "Ealing",
        "Postcode": "W3 6TJ",
        "CountryID": 1,
        "Latitude": 51.519785,
        "Longitude": -0.263035,
        "DistanceUnit": 0
    },
    "Connections": [
        {
            "ID": 260676,
            "ConnectionTypeID": 25,
            "StatusTypeID": 50,
            "LevelID": 2,
            "Amps": 32,
            "Voltage": 230,
            "PowerKW": 7,
            "CurrentTypeID": 10,
            "Quantity": 3
        }
    ],
    "NumberOfPoints": 3,
    "GeneralComments": "This is an open charge unit installed at the McDonald's restaurant in Leamington Park, Acton, Ealing",
    "StatusTypeID": 50,
    "DateLastStatusUpdate": "2020-12-05T10:45:00Z",
    "DataQualityLevel": 1,
    "DateCreated": "2020-12-05T10:34:00Z",
    "SubmissionStatusTypeID": 200
}