{
    "IsRecentlyVerified": false,
    "ID": 4570,
    "UUID": "4B915D86-8DB7-4320-B58C-900532754E94",
    "DataProviderID": 1,
    "OperatorID": 1,
    "UsageTypeID": 1,
    "AddressInfo": {
        "ID": 4515,
        "Title": "Remington Centre",
        "AddressLine1": "23 Hung To Road",
        "AddressLine2": "",
        "Town": "Kwun Tong",
        "StateOrProvince": "Kowloon",
        "Postcode": "",
        "CountryID": 4,
        "Latitude": 22.3132266998291,
        "Longitude": 114.21977233886719,
        "ContactTelephone1": "",
        "ContactTelephone2": "",
        "ContactEmail": "",
        "AccessComments": "",
        "RelatedURL": "",
        "DistanceUnit": 0
    },
    "Connections": [
        {
            "ID": 230,
            "ConnectionTypeID": 3,
            "LevelID": 2,
            "Quantity": 1
        }
    ],
    "NumberOfPoints": 1,
    "DateLastConfirmed": "2011-05-21T00:00:00Z",
    "StatusTypeID": 50,
    "DateLastStatusUpdate": "2013-01-11T21:07:00Z",
    "DateCreated": "2011-05-25T11:01:00Z",
    "SubmissionStatusTypeID": 200
}