{
    "IsRecentlyVerified": false,
    "ID": 130500,
    "UUID": "41FFA771-F477-4498-9B1B-7E4FEE96F7F7",
    "DataProviderID": 1,
    "OperatorID": 80,
    "UsageTypeID": 4,
    "AddressInfo": {
        "ID": 130846,
        "Title": "Tricerro Viale Roma | EnelX",
        "AddressLine1": "Viale Roma, 2",
        "Town": "Tricerro",
        "StateOrProvince": "VC",
        "Postcode": "13038",
        "CountryID": 112,
        "Latitude": 45.233205453168466,
        "Longitude": 8.3238629263941,
        "ContactTelephone1": "800.069.850",
        "RelatedURL": "https://www.enelx.com/it/it/emobility",
        "DistanceUnit": 0
    },
    "Connections": [
        {
            "ID": 182687,
            "ConnectionTypeID": 25,
            "StatusTypeID": 50,
            "LevelID": 2,
            "Amps": 32,
            "Voltage": 400,
            "PowerKW": 22,
            "CurrentTypeID": 20,
            "Quantity": 2
        }
    ],
    "NumberOfPoints": 2,
    "StatusTypeID": 50,
    "DateLastStatusUpdate": "2019-08-06T07:54:00Z",
    "DataQualityLevel": 1,
    "DateCreated": "2019-08-06T07:54:00Z",
    "SubmissionStatusTypeID": 200
}