{
    "IsRecentlyVerified": false,
    "ID": 136101,
    "UUID": "CCE01094-B407-4003-9E3F-EF2D91F3FCE4",
    "DataProviderID": 18,
    "DataProvidersReference": "fb5383c3facfd8a6d2448a64854c0c75",
    "OperatorID": 2244,
    "UsageTypeID": 5,
    "AddressInfo": {
        "ID": 136447,
        "Title": "Freemantle Street",
        "AddressLine1": "Freemantle Street",
        "Town": "London",
        "Postcode": "SE17 2JP",
        "CountryID": 1,
        "Latitude": 51.489583,
        "Longitude": -0.08226,
        "AccessComments": "",
        "RelatedURL": "https://www.ubitricity.com",
        "DistanceUnit": 0
    },
    "Connections": [
        {
            "ID": 190528,
            "ConnectionTypeID": 25,
            "Reference": "suby1100001387",
            "StatusTypeID": 50,
            "LevelID": 2,
            "Amps": 16,
            "Voltage": 230,
            "PowerKW": 3.7,
            "CurrentTypeID": 10
        }
    ],
    "StatusTypeID": 0,
    "DateLastStatusUpdate": "2021-04-25T05:46:00Z",
    "MetadataValues": [
        {
            "ID": 5953,
            "MetadataFieldID": 4,
            "ItemValue": "Contains public sector information licensed under the Open Government Licence v2.0. http://www.nationalarchives.gov.uk/doc/open-government-licence/version/2/"
        }
    ],
    "DataQualityLevel": 3,
    "DateCreated": "2019-12-24T05:22:00Z",
    "SubmissionStatusTypeID": 100
}