{
    "MediaItems": [
        {
            "ID": 13364,
            "ChargePointID": 93509,
            "ItemURL": "https://s3-ap-southeast-2.amazonaws.com/openchargemap/images/CZ/OCM93509/OCM-93509.orig.2017092908425902.jpg",
            "ItemThumbnailURL": "https://s3-ap-southeast-2.amazonaws.com/openchargemap/images/CZ/OCM93509/OCM-93509.thmb.2017092908425902.jpg",
            "Comment": "",
            "IsEnabled": true,
            "IsVideo": false,
            "IsFeaturedItem": false,
            "IsExternalResource": false,
            "User": {
                "ID": 6224,
                "Username": "ozana"
            },
            "DateCreated": "2017-09-29T08:43:00Z"
        }
    ],
    "IsRecentlyVerified": false,
    "ID": 93509,
    "UUID": "2D3F2F47-89C0-45A9-8605-6B4E7FAD550C",
    "DataProviderID": 1,
    "OperatorID": 45,
    "UsageTypeID": 7,
    "AddressInfo": {
        "ID": 93855,
        "Title": "TESS CZ spol. s r.o.",
        "AddressLine1": "Dlouhá Ves 187",
        "Town": "Dlouhá Ves",
        "StateOrProvince": "okres Rychnov nad Kněžnou",
        "Postcode": "51601",
        "CountryID": 64,
        "Latitude": 50.1641897,
        "Longitude": 16.303353,
        "ContactTelephone1": "+420 777 269 026",
        "ContactEmail": "chaloupka@tess-cz.cz",
        "AccessComments": "Nabíjení v areálu firmy TESS CZ zatím zdarma. Prosím volat předem. Všední dny po dohodě od 6h do 17h bez problému. Mimo tuto dobu musím vzdáleně otevřít bránu. ",
        "RelatedURL": "http://www.tess-cz.cz",
        "DistanceUnit": 0
    },
    "Connections": [
        {
            "ID": 132416,
            "ConnectionTypeID": 25,
            "StatusTypeID": 50,
            "LevelID": 2,
            "Amps": 32,
            "Voltage": 400,
            "PowerKW": 22,
            "CurrentTypeID": 20,
            "Quantity": 1
        }
    ],
    "NumberOfPoints": 1,
    "StatusTypeID": 50,
    "DateLastStatusUpdate": "2017-09-29T08:44:00Z",
    "DataQualityLevel": 1,
    "DateCreated": "2017-09-29T08:43:00Z",
    "SubmissionStatusTypeID": 200
}