{
    "IsRecentlyVerified": false,
    "ID": 105346,
    "UUID": "C3B0B0EE-C237-4E6D-966D-AF35B0042C29",
    "DataProviderID": 1,
    "OperatorID": 23,
    "OperatorsReference": "43974",
    "UsageTypeID": 4,
    "AddressInfo": {
        "ID": 105692,
        "Title": "Park Plaza Belvedere Medulin",
        "AddressLine1": "Osipovica 33",
        "Town": "Medulin",
        "Postcode": "52203",
        "CountryID": 60,
        "Latitude": 44.812112,
        "Longitude": 13.942412,
        "ContactTelephone1": "+385 (0)52 572 001",
        "DistanceUnit": 0
    },
    "Connections": [
        {
            "ID": 148510,
            "ConnectionTypeID": 30,
            "StatusTypeID": 50,
            "LevelID": 2,
            "Amps": 32,
            "Voltage": 400,
            "PowerKW": 22,
            "CurrentTypeID": 20,
            "Quantity": 1
        }
    ],
    "NumberOfPoints": 1,
    "GeneralComments": "1 Tesla Connector, up to 22kW.Available for customers. Please call ahead.",
    "StatusTypeID": 50,
    "DateLastStatusUpdate": "2018-10-03T22:20:00Z",
    "DataQualityLevel": 1,
    "DateCreated": "2018-06-06T05:29:00Z",
    "SubmissionStatusTypeID": 200
}