{
    "IsRecentlyVerified": false,
    "ID": 108775,
    "UUID": "ADED88A0-A122-405F-998B-0523A131B628",
    "DataProviderID": 1,
    "OperatorID": 23,
    "OperatorsReference": "45107",
    "UsageTypeID": 4,
    "AddressInfo": {
        "ID": 109121,
        "Title": "Restaurace Babiccina Zahrada",
        "AddressLine1": "Tovarni 536",
        "Town": "Pruhonice",
        "Postcode": "252 43",
        "CountryID": 64,
        "Latitude": 49.996309,
        "Longitude": 14.550277,
        "ContactTelephone1": " +420 2726 90865",
        "DistanceUnit": 0
    },
    "Connections": [
        {
            "ID": 153890,
            "ConnectionTypeID": 30,
            "StatusTypeID": 50,
            "LevelID": 2,
            "PowerKW": 17,
            "CurrentTypeID": 20,
            "Quantity": 2
        }
    ],
    "NumberOfPoints": 2,
    "GeneralComments": "2 Tesla Connectors, up to 17kW.Available for customers. Self park.",
    "StatusTypeID": 50,
    "DateLastStatusUpdate": "2018-10-11T12:38:00Z",
    "DataQualityLevel": 1,
    "DateCreated": "2018-10-11T12:38:00Z",
    "SubmissionStatusTypeID": 200
}