{
    "IsRecentlyVerified": false,
    "ID": 179711,
    "UUID": "16C3D02E-2E2A-4550-8902-6DE2BEE3C575",
    "DataProviderID": 29,
    "DataProvidersReference": "16186",
    "OperatorID": 1240,
    "AddressInfo": {
        "ID": 180070,
        "Title": "Ludwigspl. 2",
        "AddressLine1": "Ludwigspl. 2",
        "Town": "Altrip",
        "Postcode": "67122",
        "CountryID": 87,
        "Latitude": 49.432368,
        "Longitude": 8.501812,
        "DistanceUnit": 0
    },
    "Connections": [
        {
            "ID": 281875,
            "ConnectionTypeID": 25,
            "StatusTypeID": 50,
            "LevelID": 2,
            "PowerKW": 22,
            "CurrentTypeID": 20
        },
        {
            "ID": 281876,
            "ConnectionTypeID": 25,
            "StatusTypeID": 50,
            "LevelID": 2,
            "PowerKW": 22,
            "CurrentTypeID": 20
        }
    ],
    "StatusTypeID": 50,
    "DateLastStatusUpdate": "2021-07-09T03:16:00Z",
    "MetadataValues": [
        {
            "ID": 12005,
            "MetadataFieldID": 4,
            "ItemValue": "Data from the German chargepoint registry provided by Bundesnetzagentur.de under the CC-BY 4.0 license"
        }
    ],
    "DataQualityLevel": 3,
    "DateCreated": "2021-07-08T09:59:00Z",
    "SubmissionStatusTypeID": 100
}