{
    "IsRecentlyVerified": false,
    "ID": 117942,
    "UUID": "3E8CCB65-9EE4-4DBE-9EEF-14FFAD767FA7",
    "DataProviderID": 1,
    "OperatorID": 80,
    "UsageTypeID": 4,
    "AddressInfo": {
        "ID": 118288,
        "Title": "Ronciglione Palazzetto Sport | EnelX",
        "AddressLine1": "Via Fratelli Rosselli, 14",
        "Town": "Ronciglione",
        "StateOrProvince": "VT",
        "Postcode": "01037",
        "CountryID": 112,
        "Latitude": 42.288645572044175,
        "Longitude": 12.207345090637546,
        "ContactTelephone1": "800.069.850",
        "RelatedURL": "https://www.enelx.com/it/it/emobility",
        "DistanceUnit": 0
    },
    "Connections": [
        {
            "ID": 166935,
            "ConnectionTypeID": 25,
            "StatusTypeID": 50,
            "LevelID": 2,
            "Amps": 32,
            "Voltage": 400,
            "PowerKW": 22,
            "CurrentTypeID": 20,
            "Quantity": 1
        },
        {
            "ID": 166936,
            "ConnectionTypeID": 36,
            "StatusTypeID": 50,
            "LevelID": 2,
            "Amps": 16,
            "Voltage": 240,
            "PowerKW": 3.7,
            "CurrentTypeID": 10,
            "Quantity": 1
        }
    ],
    "NumberOfPoints": 2,
    "StatusTypeID": 50,
    "DateLastStatusUpdate": "2019-03-12T15:14:00Z",
    "DataQualityLevel": 1,
    "DateCreated": "2019-03-12T15:14:00Z",
    "SubmissionStatusTypeID": 200
}