{
    "IsRecentlyVerified": false,
    "ID": 135159,
    "UUID": "8F1DAC54-5853-42C1-A574-EAF176AC753F",
    "DataProviderID": 1,
    "OperatorID": 80,
    "UsageTypeID": 4,
    "AddressInfo": {
        "ID": 135505,
        "Title": "Morano Calabro Giudea | EnelX",
        "AddressLine1": "Via Giudea",
        "Town": "Morano Calabro",
        "StateOrProvince": "CS",
        "Postcode": "87016",
        "CountryID": 112,
        "Latitude": 39.8449891064063,
        "Longitude": 16.13787803834839,
        "ContactTelephone1": "800.069.850",
        "RelatedURL": "https://www.enelx.com/it/it/emobility",
        "DistanceUnit": 0
    },
    "Connections": [
        {
            "ID": 189201,
            "ConnectionTypeID": 25,
            "StatusTypeID": 50,
            "LevelID": 2,
            "Amps": 32,
            "Voltage": 400,
            "PowerKW": 22,
            "CurrentTypeID": 20,
            "Quantity": 2
        }
    ],
    "NumberOfPoints": 2,
    "StatusTypeID": 50,
    "DateLastStatusUpdate": "2019-12-09T14:42:00Z",
    "DataQualityLevel": 1,
    "DateCreated": "2019-12-09T14:42:00Z",
    "SubmissionStatusTypeID": 200
}