{
    "IsRecentlyVerified": false,
    "ID": 35771,
    "UUID": "F492BAA2-FA95-46AE-AD0A-5E83D78D41F0",
    "DataProviderID": 26,
    "DataProvidersReference": "16362",
    "OperatorID": 162,
    "OperatorsReference": "Business Lease",
    "UsageCost": "0.00 gratis",
    "AddressInfo": {
        "ID": 36117,
        "Title": "Sparrenheuvel",
        "AddressLine1": "Sparrenheuvel",
        "Town": "Zeist",
        "Postcode": "3708 JE",
        "CountryID": 159,
        "Latitude": 52.079082,
        "Longitude": 5.243693,
        "RelatedURL": "http://www.businesslease.nl",
        "DistanceUnit": 0
    },
    "Connections": [
        {
            "ID": 39282,
            "ConnectionTypeID": 28,
            "LevelID": 1,
            "PowerKW": 2.3,
            "CurrentTypeID": 10
        }
    ],
    "NumberOfPoints": 1,
    "StatusTypeID": 50,
    "DateLastStatusUpdate": "2016-06-04T02:49:00Z",
    "DataQualityLevel": 3,
    "DateCreated": "2015-01-09T06:05:00Z",
    "SubmissionStatusTypeID": 100
}