{
    "IsRecentlyVerified": false,
    "ID": 120799,
    "UUID": "322836DD-C65E-4EEC-A035-8FB637B85DEF",
    "DataProviderID": 2,
    "DataProvidersReference": "45777",
    "UsageTypeID": 1,
    "AddressInfo": {
        "ID": 121145,
        "Title": "Horry Georgetown Technical College - Speir Building",
        "AddressLine1": "3500 Pampas Dr",
        "Town": "Myrtle Beach",
        "StateOrProvince": "SC",
        "Postcode": "29577",
        "CountryID": 2,
        "Latitude": 33.661672,
        "Longitude": -78.937739,
        "ContactTelephone1": "843-347-3186",
        "AccessComments": "24 hours daily; visitor pass required",
        "RelatedURL": "",
        "DistanceUnit": 0
    },
    "Connections": [
        {
            "ID": 170192,
            "ConnectionTypeID": 1,
            "LevelID": 2,
            "Amps": 16,
            "Voltage": 230,
            "PowerKW": 3.7,
            "CurrentTypeID": 10,
            "Quantity": 1
        }
    ],
    "DateLastStatusUpdate": "2020-06-26T02:55:00Z",
    "DataQualityLevel": 3,
    "DateCreated": "2019-04-01T04:59:00Z",
    "SubmissionStatusTypeID": 100
}