{
    "IsRecentlyVerified": false,
    "ID": 31902,
    "UUID": "74D8CE65-C7E2-4469-B769-8C9295C3FA76",
    "DataProviderID": 26,
    "DataProvidersReference": "30255",
    "OperatorID": 86,
    "OperatorsReference": "EnWB Beskidenstraße",
    "UsageCost": "0.00 afhankelijk van pas",
    "AddressInfo": {
        "ID": 32248,
        "Title": "Beskidenstraße 9",
        "AddressLine1": "Beskidenstraße 9",
        "Town": "Fellbach",
        "Postcode": "70734",
        "CountryID": 87,
        "Latitude": 48.809106,
        "Longitude": 9.253429,
        "ContactTelephone1": "0800 3629-000",
        "ContactEmail": "-",
        "RelatedURL": "http://www.enbw.com/",
        "DistanceUnit": 0
    },
    "Connections": [
        {
            "ID": 35413,
            "ConnectionTypeID": 25,
            "LevelID": 2,
            "PowerKW": 5,
            "CurrentTypeID": 10
        }
    ],
    "NumberOfPoints": 2,
    "StatusTypeID": 50,
    "DateLastStatusUpdate": "2016-03-03T12:34:00Z",
    "DataQualityLevel": 3,
    "DateCreated": "2015-01-09T06:03:00Z",
    "SubmissionStatusTypeID": 100
}