{
    "IsRecentlyVerified": false,
    "ID": 186572,
    "UUID": "08BF4062-1A71-4B43-8534-98EFFB4B2A99",
    "DataProviderID": 29,
    "DataProvidersReference": "2177",
    "OperatorID": 105,
    "AddressInfo": {
        "ID": 186931,
        "Title": "Antoniusstraße/Ecke Dorfstraße 1",
        "AddressLine1": "Antoniusstraße/Ecke Dorfstraße 1",
        "Town": "Issum",
        "Postcode": "47661",
        "CountryID": 87,
        "Latitude": 51.4932309,
        "Longitude": 6.4306531,
        "DistanceUnit": 0
    },
    "Connections": [
        {
            "ID": 299518,
            "ConnectionTypeID": 25,
            "StatusTypeID": 50,
            "LevelID": 2,
            "PowerKW": 22,
            "CurrentTypeID": 20
        },
        {
            "ID": 299519,
            "ConnectionTypeID": 25,
            "StatusTypeID": 50,
            "LevelID": 2,
            "PowerKW": 22,
            "CurrentTypeID": 20
        }
    ],
    "StatusTypeID": 50,
    "DateLastStatusUpdate": "2021-07-12T02:47:00Z",
    "MetadataValues": [
        {
            "ID": 18813,
            "MetadataFieldID": 4,
            "ItemValue": "Data from the German chargepoint registry provided by Bundesnetzagentur.de under the CC-BY 4.0 license"
        }
    ],
    "DataQualityLevel": 3,
    "DateCreated": "2021-07-12T02:47:00Z",
    "SubmissionStatusTypeID": 100
}