{
    "IsRecentlyVerified": false,
    "ID": 67915,
    "UUID": "DADF6DDF-9DAE-44F1-AEB1-B6E429CE3F98",
    "DataProviderID": 26,
    "DataProvidersReference": "92529",
    "OperatorID": 103,
    "OperatorsReference": "Allego NLALLEGO0009561",
    "UsageCost": "0.00 jaarabonnement",
    "AddressInfo": {
        "ID": 68261,
        "Title": "Schoonhout 158",
        "AddressLine1": "Schoonhout 158",
        "Town": "Etten-Leur",
        "Postcode": "4872 MD",
        "CountryID": 159,
        "Latitude": 51.574882,
        "Longitude": 4.65116,
        "ContactTelephone1": "0800-3745337",
        "RelatedURL": "http://www.allego.eu/",
        "DistanceUnit": 0
    },
    "Connections": [
        {
            "ID": 94517,
            "ConnectionTypeID": 25,
            "LevelID": 2,
            "PowerKW": 11,
            "CurrentTypeID": 10
        },
        {
            "ID": 94518,
            "ConnectionTypeID": 25,
            "LevelID": 2,
            "PowerKW": 11,
            "CurrentTypeID": 10
        }
    ],
    "NumberOfPoints": 1,
    "StatusTypeID": 50,
    "DateLastStatusUpdate": "2016-06-04T02:37:00Z",
    "DataQualityLevel": 3,
    "DateCreated": "2016-06-04T02:37:00Z",
    "SubmissionStatusTypeID": 100
}