{
    "IsRecentlyVerified": false,
    "ID": 114541,
    "UUID": "97E3D702-508A-4ABA-9278-7286EEF5AD04",
    "DataProviderID": 1,
    "OperatorID": 80,
    "UsageTypeID": 4,
    "AddressInfo": {
        "ID": 114887,
        "Title": "Pontassieve Varsavia | EnelX",
        "AddressLine1": "Via Varsavia",
        "Town": "Pontassieve",
        "StateOrProvince": "FI",
        "Postcode": "50065",
        "CountryID": 112,
        "Latitude": 43.770406571242816,
        "Longitude": 11.436804527846082,
        "ContactTelephone1": "800.069.850",
        "RelatedURL": "https://www.enelx.com/it/it/emobility",
        "DistanceUnit": 0
    },
    "Connections": [
        {
            "ID": 161224,
            "ConnectionTypeID": 25,
            "StatusTypeID": 50,
            "LevelID": 2,
            "Amps": 32,
            "Voltage": 400,
            "PowerKW": 22,
            "CurrentTypeID": 20,
            "Quantity": 2
        }
    ],
    "NumberOfPoints": 2,
    "StatusTypeID": 50,
    "DateLastStatusUpdate": "2019-01-09T16:26:00Z",
    "DataQualityLevel": 1,
    "DateCreated": "2019-01-09T16:26:00Z",
    "SubmissionStatusTypeID": 200
}