{
    "IsRecentlyVerified": false,
    "ID": 170158,
    "UUID": "B07E0486-D0A4-4ABC-8A48-B3D12369AC2B",
    "DataProviderID": 1,
    "OperatorID": 45,
    "UsageTypeID": 6,
    "UsageCost": "$2.50 per hour/ max 4 hours",
    "AddressInfo": {
        "ID": 170517,
        "Title": "University of Guelph P48 Parking Lot",
        "AddressLine1": "Parkside Drive",
        "Town": "Guelph",
        "StateOrProvince": "Ontario",
        "Postcode": "N1G 4M4",
        "CountryID": 44,
        "Latitude": 43.5344369065341,
        "Longitude": -80.22810536114162,
        "AccessComments": "Drive down Gordon Street toward the University\r\nTurn left off Gordon Street onto College Avenue\r\nPass Trent Lane, next entrance way turn right.\r\nThis laneway forks, stay to the left\r\nPermitted area on the left is P48\r\nChargers are on Easternmost point of parking lot",
        "RelatedURL": "https://www.parking.uoguelph.ca/find-parking/parking-map/overview-parking-zones/parking-lots-41-70/p48",
        "DistanceUnit": 0
    },
    "Connections": [
        {
            "ID": 259411,
            "ConnectionTypeID": 25,
            "StatusTypeID": 50,
            "Quantity": 3
        }
    ],
    "NumberOfPoints": 3,
    "GeneralComments": "Must have a University of Guelph EV parking pass",
    "StatusTypeID": 50,
    "DateLastStatusUpdate": "2020-11-20T14:19:00Z",
    "DataQualityLevel": 1,
    "DateCreated": "2020-11-19T16:59:00Z",
    "SubmissionStatusTypeID": 200
}