{
    "IsRecentlyVerified": false,
    "ID": 116025,
    "UUID": "9731B1B0-253E-4670-BDA9-95FF9F5B18A8",
    "DataProviderID": 2,
    "DataProvidersReference": "116924",
    "UsageTypeID": 1,
    "AddressInfo": {
        "ID": 116371,
        "Title": "Hickory Park",
        "AddressLine1": "51 S Lake Ave",
        "Town": "Bergen",
        "StateOrProvince": "NY",
        "Postcode": "14416",
        "CountryID": 2,
        "Latitude": 43.080709,
        "Longitude": -77.943679,
        "ContactTelephone1": "585-494-1513",
        "AccessComments": "24 hours daily",
        "RelatedURL": "",
        "DistanceUnit": 0
    },
    "Connections": [
        {
            "ID": 163083,
            "ConnectionTypeID": 1,
            "LevelID": 2,
            "Amps": 16,
            "Voltage": 230,
            "PowerKW": 3.7,
            "CurrentTypeID": 10,
            "Quantity": 2
        }
    ],
    "DateLastStatusUpdate": "2020-06-26T03:06:00Z",
    "DataQualityLevel": 3,
    "DateCreated": "2019-02-11T07:13:00Z",
    "SubmissionStatusTypeID": 100
}