{
    "IsRecentlyVerified": false,
    "ID": 137226,
    "UUID": "FDBF2FA2-2333-447A-837C-734FEBDE9D91",
    "DataProviderID": 2,
    "DataProvidersReference": "149030",
    "OperatorID": 39,
    "UsageTypeID": 1,
    "AddressInfo": {
        "ID": 137572,
        "Title": "CCGI Inventory",
        "AddressLine1": "1691 Michigan Avenue",
        "Town": "Miami Beach",
        "StateOrProvince": "FL",
        "Postcode": "33139",
        "CountryID": 2,
        "Latitude": 25.7914645,
        "Longitude": -80.1383169,
        "ContactTelephone1": "800-663-5633",
        "AccessComments": "MO: Closed; TU: Closed; WE: Closed; TH: Closed; FR: Closed; SA: Closed; SU: Closed",
        "RelatedURL": "http://www.semacharge.com/",
        "DistanceUnit": 0
    },
    "Connections": [
        {
            "ID": 192093,
            "ConnectionTypeID": 1,
            "LevelID": 2,
            "Amps": 16,
            "Voltage": 230,
            "PowerKW": 3,
            "CurrentTypeID": 10,
            "Quantity": 1
        }
    ],
    "StatusTypeID": 50,
    "DateLastStatusUpdate": "2019-12-24T09:04:00Z",
    "DataQualityLevel": 3,
    "DateCreated": "2019-12-24T09:04:00Z",
    "SubmissionStatusTypeID": 100
}