{
    "IsRecentlyVerified": false,
    "ID": 87899,
    "UUID": "DDF5ABE7-7481-48E5-84DB-913C6F75E42A",
    "DataProviderID": 1,
    "OperatorID": 23,
    "OperatorsReference": "29639",
    "UsageTypeID": 6,
    "AddressInfo": {
        "ID": 88245,
        "Title": "Birkenhof - Hotel & Restaurant",
        "AddressLine1": "1 Birkenplatz",
        "Town": "Gols",
        "Postcode": "7122",
        "CountryID": 19,
        "Latitude": 47.892819,
        "Longitude": 16.922812,
        "ContactTelephone1": "+43 2173 23460",
        "DistanceUnit": 0
    },
    "Connections": [
        {
            "ID": 124708,
            "ConnectionTypeID": 30,
            "StatusTypeID": 50,
            "LevelID": 2,
            "Amps": 16,
            "Voltage": 400,
            "PowerKW": 11,
            "CurrentTypeID": 20,
            "Quantity": 1
        }
    ],
    "NumberOfPoints": 1,
    "GeneralComments": "1 Tesla Connector, up to 11kW.Available for patrons only. Please see front desk.",
    "StatusTypeID": 50,
    "DateLastStatusUpdate": "2018-10-03T17:11:00Z",
    "DataQualityLevel": 1,
    "DateCreated": "2017-05-18T05:38:00Z",
    "SubmissionStatusTypeID": 200
}