{
    "IsRecentlyVerified": false,
    "ID": 75170,
    "UUID": "DE87C7E1-9A01-426B-8459-50CB5C1985E2",
    "DataProviderID": 1,
    "OperatorID": 102,
    "UsageTypeID": 1,
    "UsageCost": "Fast-charging (DC 50 kW): 19 ISK per minute + 20 ISK per kWh. Regular charging (AC 22 kW): 2 ISK per minute + 20 ISK per kWh.",
    "AddressInfo": {
        "ID": 75516,
        "Title": "Skeljungur Miklabraut",
        "AddressLine1": "Miklabraut",
        "AddressLine2": "Kringla",
        "Town": "Reykjavik",
        "Postcode": "103",
        "CountryID": 105,
        "Latitude": 64.13209369515877,
        "Longitude": -21.89271411796983,
        "AccessComments": "Use ON key or scan QR code for specific charger.",
        "RelatedURL": "https://www.on.is/rafbilar",
        "DistanceUnit": 0
    },
    "Connections": [
        {
            "ID": 108422,
            "ConnectionTypeID": 2,
            "StatusTypeID": 50,
            "LevelID": 3,
            "Voltage": 500,
            "PowerKW": 50,
            "CurrentTypeID": 30,
            "Quantity": 1
        },
        {
            "ID": 108423,
            "ConnectionTypeID": 33,
            "StatusTypeID": 50,
            "LevelID": 3,
            "Amps": 50,
            "Voltage": 500,
            "PowerKW": 50,
            "CurrentTypeID": 30,
            "Quantity": 1
        },
        {
            "ID": 108424,
            "ConnectionTypeID": 1036,
            "StatusTypeID": 50,
            "LevelID": 3,
            "Amps": 63,
            "Voltage": 400,
            "PowerKW": 43,
            "CurrentTypeID": 20,
            "Quantity": 1
        }
    ],
    "NumberOfPoints": 1,
    "StatusTypeID": 50,
    "DateLastStatusUpdate": "2021-09-20T08:34:00Z",
    "DataQualityLevel": 1,
    "DateCreated": "2016-12-13T20:45:00Z",
    "SubmissionStatusTypeID": 200
}