{
    "IsRecentlyVerified": false,
    "ID": 176535,
    "UUID": "BDD17F5C-902E-45D0-BCB7-0106462BAA06",
    "DataProviderID": 29,
    "DataProvidersReference": "4041",
    "OperatorID": 69,
    "AddressInfo": {
        "ID": 176894,
        "Title": "Beethovenstraße 40",
        "AddressLine1": "Beethovenstraße 40",
        "Town": "Langenau",
        "Postcode": "89129",
        "CountryID": 87,
        "Latitude": 48.493191,
        "Longitude": 10.113215,
        "DistanceUnit": 0
    },
    "Connections": [
        {
            "ID": 274561,
            "ConnectionTypeID": 25,
            "StatusTypeID": 50,
            "LevelID": 2,
            "PowerKW": 22,
            "CurrentTypeID": 20
        },
        {
            "ID": 274562,
            "ConnectionTypeID": 25,
            "StatusTypeID": 50,
            "LevelID": 2,
            "PowerKW": 22,
            "CurrentTypeID": 20
        }
    ],
    "StatusTypeID": 0,
    "DateLastStatusUpdate": "2021-07-12T02:41:00Z",
    "MetadataValues": [
        {
            "ID": 8830,
            "MetadataFieldID": 4,
            "ItemValue": "Data from the German chargepoint registry provided by Bundesnetzagentur.de under the CC-BY 4.0 license"
        }
    ],
    "DataQualityLevel": 3,
    "DateCreated": "2021-07-08T09:48:00Z",
    "SubmissionStatusTypeID": 100
}