{
    "IsRecentlyVerified": false,
    "ID": 79632,
    "UUID": "F0628EE0-96FA-43D2-946C-FB6E3597572D",
    "DataProviderID": 1,
    "OperatorID": 23,
    "OperatorsReference": "24125",
    "UsageTypeID": 6,
    "UsageCost": "Free",
    "AddressInfo": {
        "ID": 79978,
        "Title": "Parador de Turismo de Salamanca",
        "AddressLine1": "2 Calle Teso de la Feria",
        "Town": "Salamanca",
        "Postcode": "37008",
        "CountryID": 210,
        "Latitude": 40.953004,
        "Longitude": -5.67238,
        "ContactTelephone1": "+34 923 192 082",
        "DistanceUnit": 0
    },
    "Connections": [
        {
            "ID": 114272,
            "ConnectionTypeID": 30,
            "StatusTypeID": 50,
            "LevelID": 2,
            "Amps": 32,
            "Voltage": 400,
            "PowerKW": 22,
            "CurrentTypeID": 20,
            "Quantity": 1
        }
    ],
    "NumberOfPoints": 1,
    "GeneralComments": "1 Tesla Connector, up to 22kW.Available for patrons only. Please see front desk.",
    "StatusTypeID": 50,
    "DateLastStatusUpdate": "2020-08-17T12:17:00Z",
    "DataQualityLevel": 1,
    "DateCreated": "2017-01-29T18:13:00Z",
    "SubmissionStatusTypeID": 200
}