{
    "IsRecentlyVerified": false,
    "ID": 56698,
    "UUID": "1FC90B2E-FD1A-4798-9DDE-847C6E9D40C4",
    "DataProviderID": 1,
    "DataProvidersReference": "3044",
    "AddressInfo": {
        "ID": 57044,
        "Title": "Bee Västerås/Circle K",
        "AddressLine1": "Knektgatan 2",
        "Town": "VÄSTERÅS",
        "StateOrProvince": "VÄSTMANLAND",
        "Postcode": "72344",
        "CountryID": 216,
        "Latitude": 59.61468,
        "Longitude": 16.57641,
        "AccessComments": "Circle K Västerås, Klockartorpet",
        "DistanceUnit": 0
    },
    "Connections": [
        {
            "ID": 71497,
            "ConnectionTypeID": 0,
            "Reference": "1",
            "LevelID": 2,
            "Amps": 100,
            "Voltage": 500,
            "PowerKW": 50,
            "Comments": "Mode 4"
        },
        {
            "ID": 84890,
            "ConnectionTypeID": 0,
            "Reference": "2",
            "LevelID": 2,
            "Amps": 100,
            "Voltage": 500,
            "PowerKW": 50,
            "Comments": "Mode 4"
        },
        {
            "ID": 88356,
            "ConnectionTypeID": 0,
            "Reference": "3",
            "LevelID": 2,
            "Amps": 63,
            "Voltage": 400,
            "PowerKW": 43,
            "Comments": "Mode 3"
        }
    ],
    "NumberOfPoints": 3,
    "DateLastStatusUpdate": "2020-05-26T08:23:00Z",
    "DataQualityLevel": 2,
    "DateCreated": "2015-11-06T03:39:00Z",
    "SubmissionStatusTypeID": 100
}