{
    "IsRecentlyVerified": false,
    "ID": 93535,
    "UUID": "06D8BD75-C8C2-419F-BC87-6F0E4FA10835",
    "DataProviderID": 1,
    "OperatorID": 23,
    "OperatorsReference": "35959",
    "UsageTypeID": 6,
    "AddressInfo": {
        "ID": 93881,
        "Title": "Hotel Enzian - Obertauern",
        "AddressLine1": "Gamsleitenstrasse 7",
        "Town": "Obertauern",
        "StateOrProvince": "Salzburg",
        "Postcode": "5562",
        "CountryID": 19,
        "Latitude": 47.147856,
        "Longitude": 10.570381,
        "ContactTelephone1": "+43 6456 72070",
        "DistanceUnit": 0
    },
    "Connections": [
        {
            "ID": 132472,
            "ConnectionTypeID": 30,
            "StatusTypeID": 50,
            "LevelID": 2,
            "Amps": 16,
            "Voltage": 400,
            "PowerKW": 11,
            "CurrentTypeID": 20,
            "Quantity": 1
        }
    ],
    "NumberOfPoints": 1,
    "GeneralComments": "1 Tesla Connector, up to 11kW.Available for patrons only. Please see front desk.",
    "StatusTypeID": 50,
    "DateLastStatusUpdate": "2018-10-03T17:31:00Z",
    "DataQualityLevel": 1,
    "DateCreated": "2017-10-02T05:27:00Z",
    "SubmissionStatusTypeID": 200
}