{
    "IsRecentlyVerified": false,
    "ID": 20402,
    "UUID": "3EB95E44-C2A1-424A-AFB6-DEDD75A3A4BF",
    "DataProviderID": 1,
    "OperatorID": 1,
    "UsageTypeID": 0,
    "UsageCost": "",
    "AddressInfo": {
        "ID": 20747,
        "Title": "Travaillan - Chemin de l'Alcyon",
        "AddressLine1": "Quartier Chemin de l'Alcyon",
        "AddressLine2": "",
        "Town": "Travaillan",
        "StateOrProvince": "",
        "Postcode": "84850",
        "CountryID": 80,
        "Latitude": 44.2011,
        "Longitude": 4.89638,
        "ContactTelephone1": "",
        "ContactTelephone2": "",
        "ContactEmail": "",
        "AccessComments": "Ouvert à tous",
        "RelatedURL": "",
        "DistanceUnit": 0
    },
    "Connections": [],
    "GeneralComments": "",
    "StatusTypeID": 50,
    "DateLastStatusUpdate": "2013-11-13T16:46:00Z",
    "DataQualityLevel": 1,
    "DateCreated": "2013-11-13T11:36:00Z",
    "SubmissionStatusTypeID": 200
}