{
    "IsRecentlyVerified": false,
    "ID": 32013,
    "UUID": "AC554BA8-C619-420A-A3C7-2F2FA1653E9A",
    "DataProviderID": 1,
    "OperatorID": 156,
    "OperatorsReference": "NewMotion 02009158",
    "UsageTypeID": 4,
    "AddressInfo": {
        "ID": 32359,
        "Title": "Autohandel Scholz",
        "AddressLine1": "Schallershofer Straße 104",
        "Town": "Erlangen",
        "Postcode": "91056",
        "CountryID": 87,
        "Latitude": 49.582820892334,
        "Longitude": 10.9734392166138,
        "ContactTelephone1": "+49 9131 481670",
        "AccessComments": "Während der Geschäfttszeiten kann es sein, das wenig Platz zum Hinstellen ist.",
        "RelatedURL": "http://www.autohandel-scholz.de/",
        "DistanceUnit": 0
    },
    "Connections": [
        {
            "ID": 35524,
            "ConnectionTypeID": 25,
            "StatusTypeID": 50,
            "LevelID": 2,
            "Amps": 16,
            "Voltage": 230,
            "PowerKW": 3.7,
            "CurrentTypeID": 10,
            "Quantity": 1
        }
    ],
    "NumberOfPoints": 1,
    "StatusTypeID": 50,
    "DateLastStatusUpdate": "2016-01-18T10:00:00Z",
    "DataQualityLevel": 3,
    "DateCreated": "2015-01-09T06:03:00Z",
    "SubmissionStatusTypeID": 200
}