{
    "IsRecentlyVerified": false,
    "ID": 23268,
    "UUID": "6CA92E9E-5C7E-45C5-A9A7-69CCCCF99DA1",
    "DataProviderID": 1,
    "OperatorID": 62,
    "UsageTypeID": 4,
    "AddressInfo": {
        "ID": 23613,
        "Title": "Auchan PETITE-FORÊT",
        "AddressLine1": "Rue Leleu",
        "Town": "Petite-Forêt",
        "StateOrProvince": "Valenciennes",
        "Postcode": "59494",
        "CountryID": 80,
        "Latitude": 50.375989280405,
        "Longitude": 3.47770783173826,
        "ContactTelephone1": "03.27.28.14.00 ",
        "RelatedURL": "http://www.auchan.fr/magasins/petite-foret/6/informations-pratiques/",
        "DistanceUnit": 0
    },
    "Connections": [
        {
            "ID": 25098,
            "ConnectionTypeID": 2,
            "LevelID": 3,
            "PowerKW": 40,
            "CurrentTypeID": 30,
            "Quantity": 1
        },
        {
            "ID": 25099,
            "ConnectionTypeID": 25,
            "LevelID": 3,
            "PowerKW": 40,
            "CurrentTypeID": 20,
            "Quantity": 1
        }
    ],
    "NumberOfPoints": 1,
    "StatusTypeID": 150,
    "DateLastStatusUpdate": "2016-11-29T17:08:00Z",
    "DataQualityLevel": 1,
    "DateCreated": "2014-05-09T16:24:00Z",
    "SubmissionStatusTypeID": 200
}