{
    "MediaItems": [
        {
            "ID": 9166,
            "ChargePointID": 74344,
            "ItemURL": "https://s3-ap-southeast-2.amazonaws.com/openchargemap/images/IT/OCM74344/OCM-74344.orig.2017011519114987.jpg",
            "ItemThumbnailURL": "https://s3-ap-southeast-2.amazonaws.com/openchargemap/images/IT/OCM74344/OCM-74344.thmb.2017011519114987.jpg",
            "Comment": "",
            "IsEnabled": true,
            "IsVideo": false,
            "IsFeaturedItem": false,
            "IsExternalResource": false,
            "User": {
                "ID": 12207,
                "Username": "aldodal"
            },
            "DateCreated": "2017-01-15T19:12:00Z"
        },
        {
            "ID": 9014,
            "ChargePointID": 74344,
            "ItemURL": "https://s3-ap-southeast-2.amazonaws.com/openchargemap/images/IT/OCM74344/OCM-74344.orig.2017011410221988.jpeg",
            "ItemThumbnailURL": "https://s3-ap-southeast-2.amazonaws.com/openchargemap/images/IT/OCM74344/OCM-74344.thmb.2017011410221988.jpeg",
            "Comment": "",
            "IsEnabled": true,
            "IsVideo": false,
            "IsFeaturedItem": false,
            "IsExternalResource": false,
            "User": {
                "ID": 12207,
                "Username": "aldodal"
            },
            "DateCreated": "2017-01-14T10:23:00Z"
        },
        {
            "ID": 9013,
            "ChargePointID": 74344,
            "ItemURL": "https://s3-ap-southeast-2.amazonaws.com/openchargemap/images/IT/OCM74344/OCM-74344.orig.2017011410214853.jpeg",
            "ItemThumbnailURL": "https://s3-ap-southeast-2.amazonaws.com/openchargemap/images/IT/OCM74344/OCM-74344.thmb.2017011410214853.jpeg",
            "Comment": "",
            "IsEnabled": true,
            "IsVideo": false,
            "IsFeaturedItem": false,
            "IsExternalResource": false,
            "User": {
                "ID": 12207,
                "Username": "aldodal"
            },
            "DateCreated": "2017-01-14T10:22:00Z"
        }
    ],
    "IsRecentlyVerified": false,
    "ID": 74344,
    "UUID": "63F89C47-D08F-4435-A4E0-195D76B422A1",
    "DataProviderID": 1,
    "OperatorID": 45,
    "UsageTypeID": 4,
    "UsageCost": "gratis 90'",
    "AddressInfo": {
        "ID": 74690,
        "Title": "Supermercato Lando",
        "AddressLine1": "Via Manara",
        "Town": "Vigonza",
        "StateOrProvince": "PD",
        "Postcode": "35129",
        "CountryID": 112,
        "Latitude": 45.44080703278827,
        "Longitude": 11.935948169609118,
        "RelatedURL": "http://www.iperlando.it/",
        "DistanceUnit": 0
    },
    "Connections": [
        {
            "ID": 106910,
            "ConnectionTypeID": 25,
            "StatusTypeID": 0,
            "LevelID": 2,
            "Amps": 16,
            "Voltage": 240,
            "PowerKW": 3,
            "CurrentTypeID": 10,
            "Quantity": 24
        }
    ],
    "NumberOfPoints": 24,
    "GeneralComments": "Tessera di richiedere al banco informazioni.",
    "StatusTypeID": 50,
    "DateLastStatusUpdate": "2017-01-15T19:12:00Z",
    "DataQualityLevel": 1,
    "DateCreated": "2016-12-02T13:14:00Z",
    "SubmissionStatusTypeID": 200
}