{
    "IsRecentlyVerified": false,
    "ID": 32404,
    "UUID": "C9C40921-3EA6-4BCB-9E59-A2B793D6F73D",
    "DataProviderID": 26,
    "DataProvidersReference": "16425",
    "OperatorID": 162,
    "OperatorsReference": "Rob Hermans",
    "UsageCost": "0.00 gratis",
    "AddressInfo": {
        "ID": 32750,
        "Title": "Stadhouderslaan",
        "AddressLine1": "Stadhouderslaan",
        "Town": "Stein",
        "Postcode": "6171 ZZ",
        "CountryID": 159,
        "Latitude": 50.967876,
        "Longitude": 5.768225,
        "DistanceUnit": 0
    },
    "Connections": [
        {
            "ID": 35915,
            "ConnectionTypeID": 28,
            "LevelID": 1,
            "PowerKW": 2.3,
            "CurrentTypeID": 10
        }
    ],
    "NumberOfPoints": 1,
    "StatusTypeID": 50,
    "DateLastStatusUpdate": "2016-06-04T02:38:00Z",
    "DataQualityLevel": 3,
    "DateCreated": "2015-01-09T06:03:00Z",
    "SubmissionStatusTypeID": 100
}