{
    "IsRecentlyVerified": false,
    "ID": 177338,
    "UUID": "EC3F9BEE-B70D-4335-BB96-A82DB80BD33A",
    "DataProviderID": 29,
    "DataProvidersReference": "777",
    "AddressInfo": {
        "ID": 177697,
        "Title": "Pflegstraße 2",
        "AddressLine1": "Pflegstraße 2",
        "Town": "Donauwörth",
        "Postcode": "86609",
        "CountryID": 87,
        "Latitude": 48.719369,
        "Longitude": 10.77592,
        "DistanceUnit": 0
    },
    "Connections": [
        {
            "ID": 276374,
            "ConnectionTypeID": 33,
            "StatusTypeID": 50,
            "LevelID": 3,
            "PowerKW": 50,
            "CurrentTypeID": 30
        },
        {
            "ID": 276375,
            "ConnectionTypeID": 2,
            "StatusTypeID": 50,
            "LevelID": 3,
            "PowerKW": 50,
            "CurrentTypeID": 30
        },
        {
            "ID": 296066,
            "ConnectionTypeID": 25,
            "StatusTypeID": 50,
            "LevelID": 2,
            "PowerKW": 22,
            "CurrentTypeID": 20
        }
    ],
    "StatusTypeID": 0,
    "DateLastStatusUpdate": "2021-07-12T02:41:00Z",
    "MetadataValues": [
        {
            "ID": 9632,
            "MetadataFieldID": 4,
            "ItemValue": "Data from the German chargepoint registry provided by Bundesnetzagentur.de under the CC-BY 4.0 license"
        }
    ],
    "DataQualityLevel": 3,
    "DateCreated": "2021-07-08T09:48:00Z",
    "SubmissionStatusTypeID": 100
}