{
    "IsRecentlyVerified": false,
    "ID": 89561,
    "UUID": "B2ABA2A8-CC7A-4E4D-9E64-DD28EB417744",
    "DataProviderID": 2,
    "DataProvidersReference": "82506",
    "OperatorID": 5,
    "UsageTypeID": 1,
    "AddressInfo": {
        "ID": 89907,
        "Title": "ROYAL FARMS",
        "AddressLine1": "304 N DuPont Blvd",
        "Town": "Smyrna",
        "StateOrProvince": "DE",
        "Postcode": "19977",
        "CountryID": 2,
        "Latitude": 39.306261,
        "Longitude": -75.60651,
        "ContactTelephone1": "888-758-4389",
        "AccessComments": "24 hours daily",
        "RelatedURL": "http://www.chargepoint.com/",
        "DistanceUnit": 0
    },
    "Connections": [
        {
            "ID": 126973,
            "ConnectionTypeID": 2,
            "LevelID": 3,
            "Amps": 100,
            "Voltage": 400,
            "PowerKW": 40,
            "CurrentTypeID": 30,
            "Quantity": 1
        },
        {
            "ID": 126974,
            "ConnectionTypeID": 32,
            "LevelID": 3,
            "Amps": 100,
            "Voltage": 400,
            "PowerKW": 40,
            "CurrentTypeID": 30,
            "Quantity": 1
        }
    ],
    "DateLastStatusUpdate": "2020-06-26T03:01:00Z",
    "DataQualityLevel": 3,
    "DateCreated": "2017-06-22T08:16:00Z",
    "SubmissionStatusTypeID": 100
}