{
    "IsRecentlyVerified": false,
    "ID": 73105,
    "UUID": "E1C764ED-08A7-4711-8D82-90B1DA0DF8C6",
    "DataProviderID": 1,
    "OperatorID": 110,
    "UsageTypeID": 1,
    "UsageCost": "Free",
    "AddressInfo": {
        "ID": 73451,
        "Title": "EVite Thurau in Wil",
        "AddressLine1": "Autobahnraststätte Thurau Süd",
        "Town": "Wil",
        "StateOrProvince": "Switzerland",
        "Postcode": "9501",
        "CountryID": 217,
        "Latitude": 47.4598251372912,
        "Longitude": 9.09310698509216,
        "DistanceUnit": 0
    },
    "Connections": [
        {
            "ID": 105103,
            "ConnectionTypeID": 33,
            "StatusTypeID": 50,
            "LevelID": 3,
            "PowerKW": 22,
            "CurrentTypeID": 30,
            "Quantity": 1
        },
        {
            "ID": 105104,
            "ConnectionTypeID": 2,
            "StatusTypeID": 50,
            "LevelID": 3,
            "PowerKW": 22,
            "CurrentTypeID": 30,
            "Quantity": 1
        },
        {
            "ID": 105105,
            "ConnectionTypeID": 25,
            "StatusTypeID": 50,
            "LevelID": 2,
            "PowerKW": 22,
            "CurrentTypeID": 20,
            "Quantity": 1
        }
    ],
    "NumberOfPoints": 1,
    "StatusTypeID": 50,
    "DateLastStatusUpdate": "2016-11-08T09:28:00Z",
    "DataQualityLevel": 1,
    "DateCreated": "2016-11-07T05:15:00Z",
    "SubmissionStatusTypeID": 200
}