{
    "IsRecentlyVerified": false,
    "ID": 81435,
    "UUID": "9263D126-2462-4DAC-9A4D-CC3863B6BA70",
    "DataProviderID": 1,
    "OperatorID": 45,
    "UsageTypeID": 4,
    "UsageCost": "gratis",
    "AddressInfo": {
        "ID": 81781,
        "Title": " OBI San Giuliano Milanese",
        "AddressLine1": "via Po",
        "Town": "San Giuliano Milanese ",
        "StateOrProvince": "MI",
        "Postcode": "20098",
        "CountryID": 112,
        "Latitude": 45.3918477365859,
        "Longitude": 9.26021612529449,
        "ContactTelephone1": "0298255300",
        "AccessComments": "Uscita Tangenziale Est/A1 - San Giuliano M.se",
        "RelatedURL": "http://www.obi-italia.it/it/negozi/obiItaly/San_Giuliano_055/index.html",
        "DistanceUnit": 0
    },
    "Connections": [
        {
            "ID": 116155,
            "ConnectionTypeID": 25,
            "StatusTypeID": 50,
            "LevelID": 2,
            "Quantity": 3
        }
    ],
    "NumberOfPoints": 3,
    "GeneralComments": "Accessibili solo durante gli orari di apertura dell'OBI Da lunedì a sabato 08:00 - 21:00 Domenica: 09:00 - 20:00\r\nTessera in prestito al banco informazioni.",
    "StatusTypeID": 50,
    "DateLastStatusUpdate": "2017-03-24T15:51:00Z",
    "DataQualityLevel": 1,
    "DateCreated": "2017-02-01T15:15:00Z",
    "SubmissionStatusTypeID": 200
}