{
    "IsRecentlyVerified": false,
    "ID": 33392,
    "UUID": "D63BD303-660D-473E-A8C7-919B9FA373C0",
    "DataProviderID": 26,
    "DataProvidersReference": "48392",
    "OperatorID": 178,
    "OperatorsReference": "EVnetNL PNB-REE0029",
    "UsageCost": "0.00 jaarabonnement",
    "AddressInfo": {
        "ID": 33738,
        "Title": "Sint Ignatiusstraat 253",
        "AddressLine1": "Sint Ignatiusstraat 253",
        "Town": "Breda",
        "Postcode": "4817 KK",
        "CountryID": 159,
        "Latitude": 51.592158,
        "Longitude": 4.802504,
        "ContactTelephone1": "0800-3522365",
        "RelatedURL": "http://www.evnet.nl",
        "DistanceUnit": 0
    },
    "Connections": [
        {
            "ID": 36903,
            "ConnectionTypeID": 25,
            "LevelID": 1,
            "PowerKW": 2.3,
            "CurrentTypeID": 10
        }
    ],
    "NumberOfPoints": 1,
    "StatusTypeID": 50,
    "DateLastStatusUpdate": "2016-06-04T02:39:00Z",
    "DataQualityLevel": 3,
    "DateCreated": "2015-01-09T06:04:00Z",
    "SubmissionStatusTypeID": 100
}