{
    "IsRecentlyVerified": false,
    "ID": 114023,
    "UUID": "5E8C2098-8C97-42CD-BB42-520EC866B021",
    "DataProviderID": 1,
    "OperatorID": 23,
    "OperatorsReference": "47477",
    "UsageTypeID": 4,
    "AddressInfo": {
        "ID": 114369,
        "Title": "Château la Fleunie Hôtel/Restaurant",
        "AddressLine1": "La Fleunie Prés Lascaux",
        "Town": "Condat-sur-Vézère",
        "Postcode": "24570",
        "CountryID": 80,
        "Latitude": 45.093162,
        "Longitude": 1.222886,
        "ContactTelephone1": "+33 5 53 51 32 74",
        "DistanceUnit": 0
    },
    "Connections": [
        {
            "ID": 160593,
            "ConnectionTypeID": 30,
            "StatusTypeID": 50,
            "LevelID": 2,
            "Amps": 16,
            "Voltage": 400,
            "PowerKW": 11,
            "CurrentTypeID": 20,
            "Quantity": 2
        }
    ],
    "NumberOfPoints": 2,
    "GeneralComments": "2 Tesla Connectors, up to 11kW.Available for customers. Please see front desk.",
    "StatusTypeID": 50,
    "DateLastStatusUpdate": "2019-06-05T11:42:00Z",
    "DataQualityLevel": 1,
    "DateCreated": "2019-01-03T06:36:00Z",
    "SubmissionStatusTypeID": 200
}