{
    "IsRecentlyVerified": false,
    "ID": 106648,
    "UUID": "20F080F8-39EE-4746-B07D-708BDC8A3CB2",
    "DataProviderID": 1,
    "OperatorID": 69,
    "UsageTypeID": 4,
    "AddressInfo": {
        "ID": 106994,
        "Title": "Parkhaus Löhergraben",
        "AddressLine1": "Löherstraße 21",
        "AddressLine2": "Stadtmitte",
        "Town": "Aschaffenburg",
        "StateOrProvince": "Aschaffenburg",
        "Postcode": "63739",
        "CountryID": 87,
        "Latitude": 49.9723800729943,
        "Longitude": 9.14659890608209,
        "ContactTelephone1": "+49 6021 391 333",
        "AccessComments": "Auf der ersten Ebene sind 2 durchgehend nutzbare Ladepunkte.",
        "RelatedURL": "http://www.stwab.de/emobil",
        "DistanceUnit": 0
    },
    "Connections": [
        {
            "ID": 150064,
            "ConnectionTypeID": 25,
            "StatusTypeID": 50,
            "LevelID": 2,
            "Amps": 16,
            "Voltage": 400,
            "PowerKW": 11,
            "CurrentTypeID": 20,
            "Quantity": 2
        }
    ],
    "NumberOfPoints": 2,
    "StatusTypeID": 50,
    "DateLastStatusUpdate": "2018-06-27T05:47:00Z",
    "DataQualityLevel": 1,
    "DateCreated": "2018-06-27T05:45:00Z",
    "SubmissionStatusTypeID": 200
}