{
    "IsRecentlyVerified": false,
    "ID": 165142,
    "UUID": "F5F1C565-AF9E-49F7-BE22-9CEE4C4C2EF9",
    "DataProviderID": 1,
    "DataProvidersReference": "TR-ANK-003",
    "OperatorID": 70,
    "UsageTypeID": 1,
    "AddressInfo": {
        "ID": 165501,
        "Title": "Eşarj - Kentpark AVM, Ankara",
        "AddressLine1": "Mustafa Kemal Mah., Eskişehir Yolu 7.km, No:164, Çankaya",
        "Town": "Ankara",
        "StateOrProvince": "Ankara",
        "Postcode": "6520",
        "CountryID": 229,
        "Latitude": 39.909901,
        "Longitude": 32.775925,
        "ContactTelephone1": "+90 (850) 433 72 75",
        "ContactEmail": "destek@esarj.com",
        "RelatedURL": "https://esarj.com/en/map?s=TR-ANK-003",
        "DistanceUnit": 0
    },
    "Connections": [
        {
            "ID": 236769,
            "ConnectionTypeID": 25,
            "LevelID": 2,
            "Amps": 32,
            "Voltage": 380,
            "PowerKW": 22,
            "Quantity": 2
        }
    ],
    "GeneralComments": "Eşarj Charging Systems",
    "StatusTypeID": 50,
    "DateLastStatusUpdate": "2020-08-26T08:19:00Z",
    "DataQualityLevel": 3,
    "DateCreated": "2020-08-26T08:19:00Z",
    "SubmissionStatusTypeID": 200
}