{
    "IsRecentlyVerified": false,
    "ID": 28725,
    "UUID": "398BB70E-6EBA-4D0C-BB04-128D4C783D62",
    "DataProviderID": 2,
    "DataProvidersReference": "63670",
    "OperatorID": 5,
    "UsageTypeID": 1,
    "AddressInfo": {
        "ID": 29071,
        "Title": "ADVOCATE",
        "AddressLine1": "1701-1799 Vernon Ave",
        "Town": "Park Ridge",
        "StateOrProvince": "IL",
        "Postcode": "60068",
        "CountryID": 2,
        "Latitude": 42.0382097,
        "Longitude": -87.8507401,
        "ContactTelephone1": "888-758-4389",
        "AccessComments": "24 hours daily",
        "RelatedURL": "http://www.chargepoint.com/",
        "DistanceUnit": 0
    },
    "Connections": [
        {
            "ID": 31551,
            "ConnectionTypeID": 1,
            "LevelID": 2,
            "Amps": 16,
            "Voltage": 230,
            "PowerKW": 3.7,
            "CurrentTypeID": 10,
            "Quantity": 2
        }
    ],
    "DateLastStatusUpdate": "2020-06-26T03:05:00Z",
    "DataQualityLevel": 3,
    "DateCreated": "2014-11-28T03:38:00Z",
    "SubmissionStatusTypeID": 100
}