{
    "IsRecentlyVerified": false,
    "ID": 29811,
    "UUID": "4EB2FBB9-2409-4ACB-8017-FA93029CDB26",
    "DataProviderID": 15,
    "DataProvidersReference": "21554",
    "OperatorID": 5,
    "UsageTypeID": 2,
    "AddressInfo": {
        "ID": 30157,
        "Title": "19901 Germantown Rd",
        "AddressLine1": "19901 Germantown Rd",
        "Town": "Germantown",
        "StateOrProvince": "Maryland",
        "Postcode": "20874",
        "CountryID": 2,
        "Latitude": 39.18099213,
        "Longitude": -77.25610352,
        "ContactTelephone1": "",
        "RelatedURL": "http://carstations.com/21554",
        "DistanceUnit": 0
    },
    "Connections": [
        {
            "ID": 32796,
            "ConnectionTypeID": 9,
            "Reference": "NEMA5",
            "LevelID": 1
        }
    ],
    "NumberOfPoints": 1,
    "StatusTypeID": 0,
    "DateLastStatusUpdate": "2017-11-04T14:04:00Z",
    "DataQualityLevel": 2,
    "DateCreated": "2014-11-29T05:39:00Z",
    "SubmissionStatusTypeID": 100
}