{
    "IsRecentlyVerified": false,
    "ID": 54702,
    "UUID": "E6E2300E-3098-46FF-B0C8-0B334FA6D205",
    "DataProviderID": 26,
    "DataProvidersReference": "71254",
    "OperatorID": 103,
    "OperatorsReference": "Allego NLALLEGO0002061",
    "UsageCost": "0.00 jaarabonnement",
    "AddressInfo": {
        "ID": 55048,
        "Title": "Constantijn Huygenslaan",
        "AddressLine1": "Constantijn Huygenslaan",
        "Town": "Leiden",
        "Postcode": "2332 TR",
        "CountryID": 159,
        "Latitude": 52.16147888,
        "Longitude": 4.46652638,
        "ContactTelephone1": "0800-3745337",
        "RelatedURL": "http://www.allego.eu/",
        "DistanceUnit": 0
    },
    "Connections": [
        {
            "ID": 69085,
            "ConnectionTypeID": 25,
            "LevelID": 2,
            "PowerKW": 11,
            "CurrentTypeID": 10
        },
        {
            "ID": 69086,
            "ConnectionTypeID": 25,
            "LevelID": 2,
            "PowerKW": 11,
            "CurrentTypeID": 10
        }
    ],
    "NumberOfPoints": 1,
    "StatusTypeID": 50,
    "DateLastStatusUpdate": "2016-06-04T02:51:00Z",
    "DataQualityLevel": 3,
    "DateCreated": "2015-10-09T06:18:00Z",
    "SubmissionStatusTypeID": 100
}