{
    "IsRecentlyVerified": false,
    "ID": 29750,
    "UUID": "1D89ED89-F840-4504-8BF5-6C670130CA9B",
    "DataProviderID": 15,
    "DataProvidersReference": "35329",
    "OperatorID": 1,
    "AddressInfo": {
        "ID": 30096,
        "Title": "20450 Old Highway 120",
        "AddressLine1": "20450 Old Highway 120",
        "Town": "Groveland",
        "StateOrProvince": "CA",
        "Postcode": "95321",
        "CountryID": 2,
        "Latitude": 37.82583,
        "Longitude": -120.19566,
        "ContactTelephone1": "(209) 962-7690",
        "RelatedURL": "http://carstations.com/35329",
        "DistanceUnit": 0
    },
    "Connections": [
        {
            "ID": 32735,
            "ConnectionTypeID": 0,
            "Reference": "NEMA1450"
        }
    ],
    "StatusTypeID": 0,
    "DateLastStatusUpdate": "2017-11-04T14:04:00Z",
    "DataQualityLevel": 2,
    "DateCreated": "2014-11-29T05:39:00Z",
    "SubmissionStatusTypeID": 100
}