{
    "IsRecentlyVerified": false,
    "ID": 188521,
    "UUID": "A1EA6B66-3F26-4EE5-A8F4-1FD94F34409F",
    "DataProviderID": 1,
    "OperatorID": 1,
    "UsageTypeID": 1,
    "UsageCost": "Free",
    "AddressInfo": {
        "ID": 188880,
        "Title": "Trafic shop",
        "AddressLine1": "24 Route de Marche",
        "Town": "Barvaux (Durbuy)",
        "Postcode": "6940",
        "CountryID": 26,
        "Latitude": 50.34803443378837,
        "Longitude": 5.488144466553763,
        "AccessComments": "On the wall of the Trafic shop on the parkinglot for Traffic and Carrefour",
        "DistanceUnit": 0
    },
    "Connections": [
        {
            "ID": 304489,
            "ConnectionTypeID": 25,
            "StatusTypeID": 50,
            "LevelID": 2,
            "PowerKW": 11,
            "CurrentTypeID": 20,
            "Quantity": 1
        },
        {
            "ID": 304490,
            "ConnectionTypeID": 25,
            "StatusTypeID": 50,
            "LevelID": 2,
            "PowerKW": 11,
            "CurrentTypeID": 20,
            "Quantity": 1
        }
    ],
    "NumberOfPoints": 2,
    "GeneralComments": "During shop hours ",
    "StatusTypeID": 50,
    "DateLastStatusUpdate": "2021-08-03T12:43:00Z",
    "DataQualityLevel": 1,
    "DateCreated": "2021-07-31T19:48:00Z",
    "SubmissionStatusTypeID": 200
}