{
    "IsRecentlyVerified": false,
    "ID": 57428,
    "UUID": "88DF19F3-D223-4ACF-AACC-ABC371C30D69",
    "DataProviderID": 2,
    "DataProvidersReference": "70949",
    "UsageTypeID": 1,
    "AddressInfo": {
        "ID": 57774,
        "Title": "University of Vermont Medical Center - Fanny Allen Campus",
        "AddressLine1": "802 College Pkwy",
        "Town": "Colchester",
        "StateOrProvince": "VT",
        "Postcode": "05446",
        "CountryID": 2,
        "Latitude": 44.496799,
        "Longitude": -73.155891,
        "ContactTelephone1": "802-847-0000",
        "AccessComments": "24 hours daily; for employee and visitor use only",
        "RelatedURL": "",
        "DistanceUnit": 0
    },
    "Connections": [
        {
            "ID": 72534,
            "ConnectionTypeID": 1,
            "LevelID": 2,
            "Amps": 16,
            "Voltage": 230,
            "PowerKW": 3.7,
            "CurrentTypeID": 10,
            "Quantity": 2
        }
    ],
    "DateLastStatusUpdate": "2020-06-26T03:08:00Z",
    "DataQualityLevel": 3,
    "DateCreated": "2015-11-30T11:50:00Z",
    "SubmissionStatusTypeID": 100
}