{
    "IsRecentlyVerified": false,
    "ID": 85587,
    "UUID": "EC78B795-2D7B-41FB-AC0F-93C76A4B8827",
    "DataProviderID": 1,
    "OperatorID": 23,
    "OperatorsReference": "26371",
    "UsageTypeID": 4,
    "AddressInfo": {
        "ID": 85933,
        "Title": "The White Swan",
        "AddressLine1": "Main Street",
        "Town": "Wighill",
        "StateOrProvince": "North Yorkshire",
        "Postcode": "LS24 8BQ",
        "CountryID": 1,
        "Latitude": 53.916342,
        "Longitude": -1.277242,
        "ContactTelephone1": "+44 193 783 2217",
        "DistanceUnit": 0
    },
    "Connections": [
        {
            "ID": 121691,
            "ConnectionTypeID": 30,
            "StatusTypeID": 50,
            "LevelID": 2,
            "Amps": 32,
            "Voltage": 230,
            "PowerKW": 7,
            "CurrentTypeID": 10,
            "Quantity": 2
        }
    ],
    "NumberOfPoints": 2,
    "GeneralComments": "2 Tesla Connectors, up to 7kW.Available for customers. Please call ahead.",
    "StatusTypeID": 50,
    "DateLastStatusUpdate": "2018-10-03T18:14:00Z",
    "DataQualityLevel": 1,
    "DateCreated": "2017-04-08T05:41:00Z",
    "SubmissionStatusTypeID": 200
}