{
    "IsRecentlyVerified": false,
    "ID": 84186,
    "UUID": "2C5F6466-9D6E-43F5-B88B-0B33567B9AD3",
    "DataProviderID": 1,
    "OperatorID": 23,
    "OperatorsReference": "24822",
    "UsageTypeID": 6,
    "AddressInfo": {
        "ID": 84532,
        "Title": "Fiesta Americana Merida",
        "AddressLine1": "Paseo Montejo No. 451 Centro",
        "Town": "Merida",
        "StateOrProvince": "Yucatan",
        "Postcode": "97000",
        "CountryID": 146,
        "Latitude": 20.986255,
        "Longitude": -89.618614,
        "ContactTelephone1": "+52 999 942 1111",
        "DistanceUnit": 0
    },
    "Connections": [
        {
            "ID": 119587,
            "ConnectionTypeID": 30,
            "StatusTypeID": 50,
            "LevelID": 2,
            "PowerKW": 18,
            "CurrentTypeID": 20,
            "Quantity": 2
        }
    ],
    "NumberOfPoints": 2,
    "GeneralComments": "2 Tesla Connectors, up to 18kW.Available for patrons only. Please see front desk.",
    "StatusTypeID": 50,
    "DateLastStatusUpdate": "2017-02-16T17:10:00Z",
    "DataQualityLevel": 1,
    "DateCreated": "2017-02-16T17:10:00Z",
    "SubmissionStatusTypeID": 200
}