{
    "IsRecentlyVerified": false,
    "ID": 47744,
    "UUID": "621A954A-ECA4-4EB6-A00B-2F27E25B96BD",
    "DataProviderID": 1,
    "OperatorID": 44,
    "UsageTypeID": 1,
    "AddressInfo": {
        "ID": 48090,
        "Title": "Ladestation Siewert",
        "AddressLine1": "Kringskamp",
        "Town": "Wegberg",
        "StateOrProvince": "Kreis Heinsberg",
        "Postcode": "41844",
        "CountryID": 87,
        "Latitude": 51.1479435,
        "Longitude": 6.27453489999994,
        "AccessComments": "Ein durchgehend nutzbar Ladeplatz links am Haus, um Spende wird gebeten. ",
        "DistanceUnit": 0
    },
    "Connections": [
        {
            "ID": 58867,
            "ConnectionTypeID": 25,
            "StatusTypeID": 50,
            "LevelID": 2,
            "Amps": 16,
            "Voltage": 400,
            "PowerKW": 11,
            "CurrentTypeID": 20,
            "Quantity": 1
        }
    ],
    "NumberOfPoints": 1,
    "StatusTypeID": 50,
    "DateLastStatusUpdate": "2015-06-08T15:18:00Z",
    "DataQualityLevel": 1,
    "DateCreated": "2015-06-08T12:00:00Z",
    "SubmissionStatusTypeID": 200
}