{
    "UserComments": [
        {
            "ID": 6005,
            "ChargePointID": 46712,
            "CommentTypeID": 50,
            "UserName": "tibor.antaloczy",
            "Comment": "A töltő ismét üzemel. / The charger is back in business.",
            "Rating": 5,
            "DateCreated": "2015-07-24T09:22:41.393Z",
            "User": {
                "ID": 4438,
                "Username": "tibor.antaloczy"
            },
            "CheckinStatusTypeID": 0
        },
        {
            "ID": 4939,
            "ChargePointID": 46712,
            "CommentTypeID": 1000,
            "UserName": "tibor.antaloczy",
            "Comment": "A töltő meghibásodás miatt nem üzemel. A MOL és az ABB egymásra mutogat, nem tudják megmondani, hogy mikorra lesz megjavítva. / The charger is out of order due to an electrical failure. MOL (operator) and ABB are  pointing to each other, noone can tell when this charger will be repaired.",
            "Rating": 1,
            "DateCreated": "2015-07-14T15:35:08.66Z",
            "User": {
                "ID": 4438,
                "Username": "tibor.antaloczy"
            },
            "CheckinStatusTypeID": 20
        },
        {
            "ID": 4356,
            "ChargePointID": 46712,
            "CommentTypeID": 10,
            "UserName": "tibor.antaloczy",
            "Comment": "A legprofibb hely, ahol eddig töltöttem. Látszott, hogy gyakran járnak oda tölteni és ezt egy szolgáltatásként kezelik (még ha ingyenes is). / The most professional place I have charged so far. It was obvious that EVs charge there often, so they handle that as a service (although still free of charge).",
            "Rating": 5,
            "DateCreated": "2015-05-03T22:50:28.703Z",
            "User": {
                "ID": 4438,
                "Username": "tibor.antaloczy"
            },
            "CheckinStatusTypeID": 10
        }
    ],
    "MediaItems": [
        {
            "ID": 8912,
            "ChargePointID": 46712,
            "ItemURL": "https://s3-ap-southeast-2.amazonaws.com/openchargemap/images/HU/OCM46712/OCM-46712.orig.2016123016503330.jpg",
            "ItemThumbnailURL": "https://s3-ap-southeast-2.amazonaws.com/openchargemap/images/HU/OCM46712/OCM-46712.thmb.2016123016503330.jpg",
            "Comment": "",
            "IsEnabled": true,
            "IsVideo": false,
            "IsFeaturedItem": false,
            "IsExternalResource": false,
            "User": {
                "ID": 4438,
                "Username": "tibor.antaloczy"
            },
            "DateCreated": "2016-12-30T16:51:00Z"
        },
        {
            "ID": 8913,
            "ChargePointID": 46712,
            "ItemURL": "https://s3-ap-southeast-2.amazonaws.com/openchargemap/images/HU/OCM46712/OCM-46712.orig.2016123016504816.jpg",
            "ItemThumbnailURL": "https://s3-ap-southeast-2.amazonaws.com/openchargemap/images/HU/OCM46712/OCM-46712.thmb.2016123016504816.jpg",
            "Comment": "",
            "IsEnabled": true,
            "IsVideo": false,
            "IsFeaturedItem": false,
            "IsExternalResource": false,
            "User": {
                "ID": 4438,
                "Username": "tibor.antaloczy"
            },
            "DateCreated": "2016-12-30T16:51:00Z"
        },
        {
            "ID": 8914,
            "ChargePointID": 46712,
            "ItemURL": "https://s3-ap-southeast-2.amazonaws.com/openchargemap/images/HU/OCM46712/OCM-46712.orig.2016123016511131.jpg",
            "ItemThumbnailURL": "https://s3-ap-southeast-2.amazonaws.com/openchargemap/images/HU/OCM46712/OCM-46712.thmb.2016123016511131.jpg",
            "Comment": "",
            "IsEnabled": true,
            "IsVideo": false,
            "IsFeaturedItem": false,
            "IsExternalResource": false,
            "User": {
                "ID": 4438,
                "Username": "tibor.antaloczy"
            },
            "DateCreated": "2016-12-30T16:51:00Z"
        },
        {
            "ID": 1767,
            "ChargePointID": 46712,
            "ItemURL": "https://s3-ap-southeast-2.amazonaws.com/openchargemap/images/HU/OCM46712/OCM-46712.orig.2015071415315092.jpg",
            "ItemThumbnailURL": "https://s3-ap-southeast-2.amazonaws.com/openchargemap/images/HU/OCM46712/OCM-46712.thmb.2015071415315092.jpg",
            "Comment": "Nem működik. / Out of order.",
            "IsEnabled": true,
            "IsVideo": false,
            "IsFeaturedItem": false,
            "IsExternalResource": false,
            "User": {
                "ID": 4438,
                "Username": "tibor.antaloczy"
            },
            "DateCreated": "2015-07-14T15:32:00Z"
        },
        {
            "ID": 1265,
            "ChargePointID": 46712,
            "ItemURL": "https://s3-ap-southeast-2.amazonaws.com/openchargemap/images/HU/OCM46712/OCM-46712.orig.2015050320443321.jpg",
            "ItemThumbnailURL": "https://s3-ap-southeast-2.amazonaws.com/openchargemap/images/HU/OCM46712/OCM-46712.thmb.2015050320443321.jpg",
            "Comment": "",
            "IsEnabled": true,
            "IsVideo": false,
            "IsFeaturedItem": false,
            "IsExternalResource": false,
            "User": {
                "ID": 4438,
                "Username": "tibor.antaloczy"
            },
            "DateCreated": "2015-05-03T20:45:00Z"
        },
        {
            "ID": 1264,
            "ChargePointID": 46712,
            "ItemURL": "https://s3-ap-southeast-2.amazonaws.com/openchargemap/images/HU/OCM46712/OCM-46712.orig.2015050320435301.jpg",
            "ItemThumbnailURL": "https://s3-ap-southeast-2.amazonaws.com/openchargemap/images/HU/OCM46712/OCM-46712.thmb.2015050320435301.jpg",
            "Comment": "",
            "IsEnabled": true,
            "IsVideo": false,
            "IsFeaturedItem": false,
            "IsExternalResource": false,
            "User": {
                "ID": 4438,
                "Username": "tibor.antaloczy"
            },
            "DateCreated": "2015-05-03T20:44:00Z"
        },
        {
            "ID": 1263,
            "ChargePointID": 46712,
            "ItemURL": "https://s3-ap-southeast-2.amazonaws.com/openchargemap/images/HU/OCM46712/OCM-46712.orig.2015050320430765.jpg",
            "ItemThumbnailURL": "https://s3-ap-southeast-2.amazonaws.com/openchargemap/images/HU/OCM46712/OCM-46712.thmb.2015050320430765.jpg",
            "Comment": "",
            "IsEnabled": true,
            "IsVideo": false,
            "IsFeaturedItem": false,
            "IsExternalResource": false,
            "User": {
                "ID": 4438,
                "Username": "tibor.antaloczy"
            },
            "DateCreated": "2015-05-03T20:43:00Z"
        }
    ],
    "IsRecentlyVerified": false,
    "ID": 46712,
    "UUID": "FC36EE51-6256-4D13-A884-5507B6968420",
    "DataProviderID": 1,
    "OperatorID": 3378,
    "UsageTypeID": 5,
    "AddressInfo": {
        "ID": 47058,
        "Title": "Budapest, Istenhegyi úti (MOL)",
        "AddressLine1": "Istenhegyi út 55.",
        "Town": "Budapest",
        "StateOrProvince": "Budapest",
        "Postcode": "1125",
        "CountryID": 104,
        "Latitude": 47.503567,
        "Longitude": 19.003534,
        "RelatedURL": "https://molplugee.hu/hu/toltoink",
        "DistanceUnit": 0
    },
    "Connections": [
        {
            "ID": 57382,
            "ConnectionTypeID": 2,
            "StatusTypeID": 50,
            "LevelID": 3,
            "Amps": 125,
            "Voltage": 500,
            "PowerKW": 50,
            "CurrentTypeID": 30,
            "Quantity": 2
        },
        {
            "ID": 57383,
            "ConnectionTypeID": 33,
            "StatusTypeID": 50,
            "LevelID": 3,
            "Amps": 125,
            "Voltage": 500,
            "PowerKW": 50,
            "CurrentTypeID": 30,
            "Quantity": 2
        },
        {
            "ID": 110722,
            "ConnectionTypeID": 1036,
            "StatusTypeID": 50,
            "LevelID": 3,
            "Amps": 63,
            "Voltage": 400,
            "PowerKW": 43,
            "CurrentTypeID": 20,
            "Quantity": 2
        }
    ],
    "NumberOfPoints": 4,
    "StatusTypeID": 50,
    "DateLastStatusUpdate": "2020-07-08T15:40:00Z",
    "DataQualityLevel": 1,
    "DateCreated": "2015-05-03T18:09:00Z",
    "SubmissionStatusTypeID": 200
}