{
    "UserComments": [
        {
            "ID": 14907,
            "ChargePointID": 54324,
            "CommentTypeID": 10,
            "UserName": "depi",
            "Comment": "Working properly",
            "Rating": 5,
            "DateCreated": "2017-02-04T12:02:39.727Z",
            "User": {
                "ID": 12116,
                "Username": "depi"
            },
            "CheckinStatusTypeID": 10
        },
        {
            "ID": 14707,
            "ChargePointID": 54324,
            "CommentTypeID": 10,
            "UserName": "depi",
            "Rating": 5,
            "DateCreated": "2016-12-17T15:41:18.163Z",
            "User": {
                "ID": 12116,
                "Username": "depi"
            },
            "CheckinStatusTypeID": 10
        },
        {
            "ID": 6647,
            "ChargePointID": 54324,
            "CommentTypeID": 10,
            "UserName": "tibor.antaloczy",
            "Comment": "The single most important charger of the country at the time of writing this comment. This quick charger connects Budapest with the south and eastern part of the country. It took 1.5 years to install but it is finally up and running.",
            "Rating": 5,
            "DateCreated": "2015-09-29T21:31:13.297Z",
            "User": {
                "ID": 4438,
                "Username": "tibor.antaloczy"
            },
            "CheckinStatusTypeID": 10
        }
    ],
    "MediaItems": [
        {
            "ID": 8388,
            "ChargePointID": 54324,
            "ItemURL": "https://s3-ap-southeast-2.amazonaws.com/openchargemap/images/HU/OCM54324/OCM-54324.orig.2016100513441607.jpg",
            "ItemThumbnailURL": "https://s3-ap-southeast-2.amazonaws.com/openchargemap/images/HU/OCM54324/OCM-54324.thmb.2016100513441607.jpg",
            "Comment": "",
            "IsEnabled": true,
            "IsVideo": false,
            "IsFeaturedItem": false,
            "IsExternalResource": false,
            "User": {
                "ID": 11892,
                "Username": "Matyas.Siska"
            },
            "DateCreated": "2016-10-05T13:44:00Z"
        },
        {
            "ID": 8113,
            "ChargePointID": 54324,
            "ItemURL": "https://s3-ap-southeast-2.amazonaws.com/openchargemap/images/HU/OCM54324/OCM-54324.orig.2016082104410159.jpg",
            "ItemThumbnailURL": "https://s3-ap-southeast-2.amazonaws.com/openchargemap/images/HU/OCM54324/OCM-54324.thmb.2016082104410159.jpg",
            "Comment": "Ok\r\n\r\n",
            "IsEnabled": true,
            "IsVideo": false,
            "IsFeaturedItem": false,
            "IsExternalResource": false,
            "User": {
                "ID": 11748,
                "Username": "Sándor Dániel Sipos"
            },
            "DateCreated": "2016-08-21T04:41:00Z"
        },
        {
            "ID": 8112,
            "ChargePointID": 54324,
            "ItemURL": "https://s3-ap-southeast-2.amazonaws.com/openchargemap/images/HU/OCM54324/OCM-54324.orig.2016082104362424.jpg",
            "ItemThumbnailURL": "https://s3-ap-southeast-2.amazonaws.com/openchargemap/images/HU/OCM54324/OCM-54324.thmb.2016082104362424.jpg",
            "Comment": "",
            "IsEnabled": true,
            "IsVideo": false,
            "IsFeaturedItem": false,
            "IsExternalResource": false,
            "User": {
                "ID": 11748,
                "Username": "Sándor Dániel Sipos"
            },
            "DateCreated": "2016-08-21T04:37:00Z"
        },
        {
            "ID": 6488,
            "ChargePointID": 54324,
            "ItemURL": "https://s3-ap-southeast-2.amazonaws.com/openchargemap/images/HU/OCM54324/OCM-54324.orig.2016052122301667.jpg",
            "ItemThumbnailURL": "https://s3-ap-southeast-2.amazonaws.com/openchargemap/images/HU/OCM54324/OCM-54324.thmb.2016052122301667.jpg",
            "Comment": "",
            "IsEnabled": true,
            "IsVideo": false,
            "IsFeaturedItem": false,
            "IsExternalResource": false,
            "User": {
                "ID": 6718,
                "Username": "Pisti81"
            },
            "DateCreated": "2016-05-21T22:30:00Z"
        },
        {
            "ID": 3481,
            "ChargePointID": 54324,
            "ItemURL": "https://s3-ap-southeast-2.amazonaws.com/openchargemap/images/HU/OCM54324/OCM-54324.orig.2015110505214544.jpg",
            "ItemThumbnailURL": "https://s3-ap-southeast-2.amazonaws.com/openchargemap/images/HU/OCM54324/OCM-54324.thmb.2015110505214544.jpg",
            "Comment": "",
            "IsEnabled": true,
            "IsVideo": false,
            "IsFeaturedItem": false,
            "IsExternalResource": false,
            "User": {
                "ID": 6570,
                "Username": "Lacko"
            },
            "DateCreated": "2015-11-05T05:22:00Z"
        },
        {
            "ID": 3309,
            "ChargePointID": 54324,
            "ItemURL": "https://s3-ap-southeast-2.amazonaws.com/openchargemap/images/HU/OCM54324/OCM-54324.orig.2015092921274203.jpg",
            "ItemThumbnailURL": "https://s3-ap-southeast-2.amazonaws.com/openchargemap/images/HU/OCM54324/OCM-54324.thmb.2015092921274203.jpg",
            "Comment": "",
            "IsEnabled": true,
            "IsVideo": false,
            "IsFeaturedItem": false,
            "IsExternalResource": false,
            "User": {
                "ID": 4438,
                "Username": "tibor.antaloczy"
            },
            "DateCreated": "2015-09-29T21:28:00Z"
        },
        {
            "ID": 3308,
            "ChargePointID": 54324,
            "ItemURL": "https://s3-ap-southeast-2.amazonaws.com/openchargemap/images/HU/OCM54324/OCM-54324.orig.2015092921233649.jpg",
            "ItemThumbnailURL": "https://s3-ap-southeast-2.amazonaws.com/openchargemap/images/HU/OCM54324/OCM-54324.thmb.2015092921233649.jpg",
            "Comment": "",
            "IsEnabled": true,
            "IsVideo": false,
            "IsFeaturedItem": false,
            "IsExternalResource": false,
            "User": {
                "ID": 4438,
                "Username": "tibor.antaloczy"
            },
            "DateCreated": "2015-09-29T21:24:00Z"
        },
        {
            "ID": 3307,
            "ChargePointID": 54324,
            "ItemURL": "https://s3-ap-southeast-2.amazonaws.com/openchargemap/images/HU/OCM54324/OCM-54324.orig.2015092921223583.jpg",
            "ItemThumbnailURL": "https://s3-ap-southeast-2.amazonaws.com/openchargemap/images/HU/OCM54324/OCM-54324.thmb.2015092921223583.jpg",
            "Comment": "",
            "IsEnabled": true,
            "IsVideo": false,
            "IsFeaturedItem": false,
            "IsExternalResource": false,
            "User": {
                "ID": 4438,
                "Username": "tibor.antaloczy"
            },
            "DateCreated": "2015-09-29T21:23:00Z"
        }
    ],
    "IsRecentlyVerified": false,
    "ID": 54324,
    "UUID": "5946E0F6-B68F-4DDC-BF48-F80A67192DC1",
    "DataProviderID": 1,
    "OperatorID": 1,
    "UsageTypeID": 1,
    "UsageCost": "free",
    "AddressInfo": {
        "ID": 54670,
        "Title": "Szolnok, Belváros",
        "AddressLine1": "Sólyom u. 3.",
        "Town": "Szolnok",
        "StateOrProvince": "Jász-Nagykun-Szolnok megye",
        "Postcode": "5000",
        "CountryID": 104,
        "Latitude": 47.1759597726627,
        "Longitude": 20.1958090232788,
        "DistanceUnit": 0
    },
    "Connections": [
        {
            "ID": 68412,
            "ConnectionTypeID": 2,
            "StatusTypeID": 50,
            "LevelID": 3,
            "Amps": 110,
            "Voltage": 400,
            "PowerKW": 40,
            "CurrentTypeID": 30,
            "Quantity": 1
        }
    ],
    "NumberOfPoints": 2,
    "StatusTypeID": 50,
    "DateLastStatusUpdate": "2017-02-04T12:03:00Z",
    "DataQualityLevel": 1,
    "DateCreated": "2015-09-28T13:10:00Z",
    "SubmissionStatusTypeID": 200
}