{
    "MediaItems": [
        {
            "ID": 20165,
            "ChargePointID": 134004,
            "ItemURL": "https://s3-ap-southeast-2.amazonaws.com/openchargemap/images/GR/OCM134004/OCM-134004.orig.2019103111292226.jpg",
            "ItemThumbnailURL": "https://s3-ap-southeast-2.amazonaws.com/openchargemap/images/GR/OCM134004/OCM-134004.thmb.2019103111292226.jpg",
            "Comment": "",
            "IsEnabled": true,
            "IsVideo": false,
            "IsFeaturedItem": false,
            "IsExternalResource": false,
            "User": {
                "ID": 22877,
                "Username": "Hellastron_Malim"
            },
            "DateCreated": "2019-10-31T11:30:00Z"
        }
    ],
    "IsRecentlyVerified": false,
    "ID": 134004,
    "UUID": "6E44D339-005C-4174-8D4E-8F7B9EC56CE7",
    "DataProviderID": 1,
    "OperatorID": 45,
    "UsageTypeID": 1,
    "UsageCost": "free",
    "AddressInfo": {
        "ID": 134350,
        "Title": "Psathopirgos, westbound",
        "AddressLine1": "196km, Athens-Patra",
        "Town": "Patra",
        "StateOrProvince": "Achaia",
        "Postcode": "26504",
        "CountryID": 90,
        "Latitude": 38.32517242307148,
        "Longitude": 21.86654833649743,
        "ContactTelephone1": "+302631038390",
        "DistanceUnit": 0
    },
    "Connections": [
        {
            "ID": 187500,
            "ConnectionTypeID": 2,
            "StatusTypeID": 50,
            "LevelID": 3,
            "Amps": 60,
            "Voltage": 920,
            "PowerKW": 50,
            "CurrentTypeID": 30,
            "Quantity": 1
        },
        {
            "ID": 187501,
            "ConnectionTypeID": 33,
            "StatusTypeID": 50,
            "LevelID": 3,
            "Amps": 60,
            "Voltage": 920,
            "PowerKW": 50,
            "CurrentTypeID": 30,
            "Quantity": 1
        },
        {
            "ID": 262314,
            "ConnectionTypeID": 1036,
            "StatusTypeID": 50,
            "LevelID": 3,
            "PowerKW": 43,
            "CurrentTypeID": 20,
            "Quantity": 1
        }
    ],
    "NumberOfPoints": 1,
    "StatusTypeID": 50,
    "DateLastStatusUpdate": "2021-01-04T11:53:00Z",
    "DataQualityLevel": 1,
    "DateCreated": "2019-10-31T11:23:00Z",
    "SubmissionStatusTypeID": 200
}