{
    "IsRecentlyVerified": false,
    "ID": 119775,
    "UUID": "9B158856-772A-4F09-9757-2124186D9A6C",
    "DataProviderID": 2,
    "DataProvidersReference": "117576",
    "OperatorID": 5,
    "UsageTypeID": 1,
    "AddressInfo": {
        "ID": 120121,
        "Title": "TECO",
        "AddressLine1": "1776 6th St NW",
        "Town": "Winter Haven",
        "StateOrProvince": "FL",
        "Postcode": "33881",
        "CountryID": 2,
        "Latitude": 28.0410766,
        "Longitude": -81.7317151,
        "ContactTelephone1": "888-758-4389",
        "AccessComments": "24 hours daily",
        "RelatedURL": "http://www.chargepoint.com/",
        "DistanceUnit": 0
    },
    "Connections": [
        {
            "ID": 169064,
            "ConnectionTypeID": 1,
            "LevelID": 2,
            "Amps": 16,
            "Voltage": 230,
            "PowerKW": 3,
            "CurrentTypeID": 10,
            "Quantity": 1
        }
    ],
    "DateLastStatusUpdate": "2019-12-24T09:08:00Z",
    "DataQualityLevel": 3,
    "DateCreated": "2019-04-01T04:59:00Z",
    "SubmissionStatusTypeID": 100
}