{
    "IsRecentlyVerified": false,
    "ID": 140334,
    "UUID": "4E39EBFB-EA01-4111-9BFA-F4CECC5F6C22",
    "DataProviderID": 2,
    "DataProvidersReference": "150165",
    "UsageTypeID": 1,
    "AddressInfo": {
        "ID": 140686,
        "Title": "Cherokee Nation W.W. Keeler Complex",
        "AddressLine1": "17675 S Muskogee Ave",
        "Town": "Tahlequah",
        "StateOrProvince": "OK",
        "Postcode": "74464",
        "CountryID": 2,
        "Latitude": 35.852374,
        "Longitude": -94.990706,
        "ContactTelephone1": "918-453-5000",
        "AccessComments": "24 hours daily",
        "RelatedURL": "",
        "DistanceUnit": 0
    },
    "Connections": [
        {
            "ID": 195945,
            "ConnectionTypeID": 1,
            "LevelID": 2,
            "Amps": 16,
            "Voltage": 230,
            "PowerKW": 3.7,
            "CurrentTypeID": 10,
            "Quantity": 8
        }
    ],
    "StatusTypeID": 50,
    "DateLastStatusUpdate": "2020-06-26T02:58:00Z",
    "DataQualityLevel": 3,
    "DateCreated": "2019-12-24T09:12:00Z",
    "SubmissionStatusTypeID": 100
}