{
    "IsRecentlyVerified": false,
    "ID": 136736,
    "UUID": "0504F829-BB4D-407E-AD1B-1EF344A8116A",
    "DataProviderID": 18,
    "DataProvidersReference": "367cc8d9187529f374fde004f70061ff",
    "OperatorID": 8,
    "UsageTypeID": 4,
    "AddressInfo": {
        "ID": 137082,
        "Title": "In showhome car park next to disabled bays",
        "AddressLine1": "Stud Lane",
        "Town": "Oakham",
        "Postcode": "LE15 6US",
        "CountryID": 1,
        "Latitude": 52.678717,
        "Longitude": -0.739405,
        "AccessComments": "In showhome car park next to disabled bays. Please report to the showhome. This site is undergoing an upgrade to dual Type 2. Church Street Oakham is next nearest site LE15 6AA",
        "RelatedURL": "https://www.bpchargemaster.com",
        "DistanceUnit": 0
    },
    "Connections": [
        {
            "ID": 191304,
            "ConnectionTypeID": 25,
            "Reference": "0",
            "StatusTypeID": 50,
            "LevelID": 2,
            "Amps": 32,
            "Voltage": 230,
            "PowerKW": 7,
            "CurrentTypeID": 10
        },
        {
            "ID": 191305,
            "ConnectionTypeID": 25,
            "Reference": "1",
            "StatusTypeID": 50,
            "LevelID": 2,
            "Amps": 32,
            "Voltage": 230,
            "PowerKW": 7,
            "CurrentTypeID": 10
        }
    ],
    "StatusTypeID": 0,
    "DateLastStatusUpdate": "2019-12-24T05:23:00Z",
    "MetadataValues": [
        {
            "ID": 6588,
            "MetadataFieldID": 4,
            "ItemValue": "Contains public sector information licensed under the Open Government Licence v2.0. http://www.nationalarchives.gov.uk/doc/open-government-licence/version/2/"
        }
    ],
    "DataQualityLevel": 3,
    "DateCreated": "2019-12-24T05:23:00Z",
    "SubmissionStatusTypeID": 100
}