{
    "IsRecentlyVerified": false,
    "ID": 179065,
    "UUID": "A822183D-05D8-42FE-9798-2ED032F9F962",
    "DataProviderID": 29,
    "DataProvidersReference": "3226",
    "OperatorID": 103,
    "AddressInfo": {
        "ID": 179424,
        "Title": "Oststraße 46",
        "AddressLine1": "Oststraße 46",
        "Town": "Meinerzhagen",
        "Postcode": "58540",
        "CountryID": 87,
        "Latitude": 51.105805,
        "Longitude": 7.655247,
        "DistanceUnit": 0
    },
    "Connections": [
        {
            "ID": 280326,
            "ConnectionTypeID": 33,
            "StatusTypeID": 50,
            "LevelID": 3,
            "PowerKW": 50,
            "CurrentTypeID": 30
        },
        {
            "ID": 280327,
            "ConnectionTypeID": 2,
            "StatusTypeID": 50,
            "LevelID": 3,
            "PowerKW": 50,
            "CurrentTypeID": 30
        },
        {
            "ID": 298715,
            "ConnectionTypeID": 1036,
            "StatusTypeID": 50,
            "LevelID": 3,
            "PowerKW": 43,
            "CurrentTypeID": 20
        }
    ],
    "StatusTypeID": 50,
    "DateLastStatusUpdate": "2021-07-12T02:46:00Z",
    "MetadataValues": [
        {
            "ID": 11359,
            "MetadataFieldID": 4,
            "ItemValue": "Data from the German chargepoint registry provided by Bundesnetzagentur.de under the CC-BY 4.0 license"
        }
    ],
    "DataQualityLevel": 3,
    "DateCreated": "2021-07-08T09:59:00Z",
    "SubmissionStatusTypeID": 100
}