{
    "IsRecentlyVerified": false,
    "ID": 148233,
    "UUID": "6F3B1572-7817-4136-BD25-B206E348715B",
    "DataProviderID": 1,
    "OperatorID": 3,
    "OperatorsReference": "PG-70155,PG-84173",
    "UsageTypeID": 4,
    "UsageCost": "Free",
    "AddressInfo": {
        "ID": 148585,
        "Title": "Tesco Superstore-Bolton Little Lever",
        "AddressLine1": "Crossley Street",
        "Town": "Little Lever",
        "StateOrProvince": "Bolton",
        "Postcode": "BL3 1RG",
        "CountryID": 1,
        "Latitude": 53.564147,
        "Longitude": -2.373051,
        "DistanceUnit": 0
    },
    "Connections": [
        {
            "ID": 205807,
            "ConnectionTypeID": 25,
            "StatusTypeID": 50,
            "LevelID": 2,
            "Amps": 32,
            "Voltage": 230,
            "PowerKW": 7,
            "CurrentTypeID": 10,
            "Quantity": 4
        }
    ],
    "NumberOfPoints": 4,
    "GeneralComments": "This is an open charge unit installed at the Tesco super store at Crossley Street, Little Lever, Bolton",
    "StatusTypeID": 50,
    "DateLastStatusUpdate": "2020-01-29T06:35:00Z",
    "DataQualityLevel": 1,
    "DateCreated": "2020-01-28T06:26:00Z",
    "SubmissionStatusTypeID": 200
}