{
    "IsRecentlyVerified": false,
    "ID": 60456,
    "UUID": "B3C36094-7E14-4945-A140-7260FBA0E992",
    "DataProviderID": 1,
    "OperatorID": 3,
    "OperatorsReference": "PG-80423,PG-80424,PG-80438,PG-80441,PG-90756",
    "UsageTypeID": 4,
    "UsageCost": "Free",
    "AddressInfo": {
        "ID": 60802,
        "Title": "Bath Spa University",
        "AddressLine1": "Twiverton Courtyard",
        "Town": "Newton Saint Loe",
        "StateOrProvince": "Bath & North East Somerset",
        "Postcode": "BA2 9BN",
        "CountryID": 1,
        "Latitude": 51.3734099,
        "Longitude": -2.44097209999995,
        "DistanceUnit": 0
    },
    "Connections": [
        {
            "ID": 76586,
            "ConnectionTypeID": 25,
            "StatusTypeID": 50,
            "LevelID": 2,
            "Amps": 32,
            "Voltage": 230,
            "PowerKW": 7,
            "CurrentTypeID": 10,
            "Quantity": 9
        }
    ],
    "NumberOfPoints": 9,
    "StatusTypeID": 50,
    "DateLastStatusUpdate": "2020-06-02T09:12:00Z",
    "DataQualityLevel": 1,
    "DateCreated": "2016-01-26T09:57:00Z",
    "SubmissionStatusTypeID": 200
}