{
    "IsRecentlyVerified": false,
    "ID": 187599,
    "UUID": "F7BA6D91-F0C0-4F8C-9B2D-6DE0FE741B9A",
    "DataProviderID": 18,
    "DataProvidersReference": "be60fdee71262160a9c3441f26eb5c8a",
    "UsageTypeID": 5,
    "AddressInfo": {
        "ID": 187958,
        "Title": "CT14 6EA",
        "AddressLine1": "",
        "Town": "Deal",
        "Postcode": "CT14 6EA",
        "CountryID": 1,
        "Latitude": 51.225971,
        "Longitude": 1.40073,
        "AccessComments": "",
        "RelatedURL": "http://www.connectedkerb.com/",
        "DistanceUnit": 0
    },
    "Connections": [
        {
            "ID": 302784,
            "ConnectionTypeID": 25,
            "Reference": "3479",
            "StatusTypeID": 50,
            "LevelID": 2,
            "Amps": 32,
            "Voltage": 230,
            "PowerKW": 7,
            "CurrentTypeID": 10
        },
        {
            "ID": 302785,
            "ConnectionTypeID": 25,
            "Reference": "5275",
            "StatusTypeID": 50,
            "LevelID": 2,
            "Amps": 32,
            "Voltage": 230,
            "PowerKW": 7,
            "CurrentTypeID": 10
        }
    ],
    "StatusTypeID": 0,
    "DateLastStatusUpdate": "2021-07-12T03:38:00Z",
    "MetadataValues": [
        {
            "ID": 19839,
            "MetadataFieldID": 4,
            "ItemValue": "Contains public sector information licensed under the Open Government Licence v2.0. http://www.nationalarchives.gov.uk/doc/open-government-licence/version/2/"
        }
    ],
    "DataQualityLevel": 3,
    "DateCreated": "2021-07-12T03:38:00Z",
    "SubmissionStatusTypeID": 100
}