{
    "UserComments": [
        {
            "ID": 20146,
            "ChargePointID": 90857,
            "CommentTypeID": 10,
            "UserName": "markrassell",
            "Comment": "Working well. 22kw for my Zoe. ",
            "Rating": 5,
            "DateCreated": "2018-09-14T16:26:59.41Z",
            "User": {
                "ID": 15812,
                "Username": "markrassell"
            },
            "CheckinStatusTypeID": 10
        }
    ],
    "IsRecentlyVerified": false,
    "ID": 90857,
    "UUID": "B2F78330-4E9A-4FCC-996D-B31A034396F8",
    "DataProviderID": 1,
    "DataProvidersReference": "4225",
    "AddressInfo": {
        "ID": 91203,
        "Title": "Joker Hjelledalen",
        "AddressLine1": "Joker Hjelledalen ",
        "Town": "HJELLEDALEN",
        "StateOrProvince": "Vestland",
        "Postcode": "6798",
        "CountryID": 168,
        "Latitude": 61.91865,
        "Longitude": 7.16936,
        "AccessComments": "",
        "DistanceUnit": 0
    },
    "Connections": [
        {
            "ID": 128818,
            "ConnectionTypeID": 0,
            "Reference": "1",
            "LevelID": 2,
            "Amps": 100,
            "Voltage": 500,
            "PowerKW": 50,
            "Comments": "Mode 4"
        },
        {
            "ID": 128819,
            "ConnectionTypeID": 0,
            "Reference": "2",
            "LevelID": 2,
            "Amps": 100,
            "Voltage": 500,
            "PowerKW": 50,
            "Comments": "Mode 4"
        },
        {
            "ID": 128820,
            "ConnectionTypeID": 0,
            "Reference": "3",
            "LevelID": 2,
            "Amps": 100,
            "Voltage": 500,
            "PowerKW": 50,
            "Comments": "Mode 4"
        },
        {
            "ID": 128821,
            "ConnectionTypeID": 0,
            "Reference": "4",
            "LevelID": 2,
            "Amps": 100,
            "Voltage": 500,
            "PowerKW": 50,
            "Comments": "Mode 4"
        },
        {
            "ID": 128822,
            "ConnectionTypeID": 0,
            "Reference": "5",
            "LevelID": 2,
            "Amps": 32,
            "Voltage": 400,
            "PowerKW": 22,
            "Comments": "Mode 3"
        },
        {
            "ID": 128823,
            "ConnectionTypeID": 0,
            "Reference": "6",
            "LevelID": 2,
            "Amps": 32,
            "Voltage": 400,
            "PowerKW": 22,
            "Comments": "Mode 3"
        }
    ],
    "NumberOfPoints": 6,
    "DateLastStatusUpdate": "2020-05-26T08:25:00Z",
    "DataQualityLevel": 2,
    "DateCreated": "2017-07-25T08:28:00Z",
    "SubmissionStatusTypeID": 100
}