{
    "IsRecentlyVerified": false,
    "ID": 79047,
    "UUID": "85172DD7-2202-4E1F-909F-C6E20DD028ED",
    "DataProviderID": 1,
    "OperatorID": 23,
    "OperatorsReference": "18368",
    "UsageTypeID": 4,
    "UsageCost": "Free",
    "AddressInfo": {
        "ID": 79393,
        "Title": "Hampton Inn & Suites Dublin",
        "AddressLine1": "103 Travel Venter BLVD",
        "Town": "Dublin",
        "StateOrProvince": "Georgia",
        "Postcode": "31021",
        "CountryID": 2,
        "Latitude": 32.486795,
        "Longitude": -82.937445,
        "ContactTelephone1": "(478) 275-2390",
        "DistanceUnit": 0
    },
    "Connections": [
        {
            "ID": 113666,
            "ConnectionTypeID": 30,
            "StatusTypeID": 50,
            "LevelID": 2,
            "PowerKW": 16,
            "CurrentTypeID": 20,
            "Quantity": 1
        }
    ],
    "NumberOfPoints": 1,
    "GeneralComments": "1 Tesla Connector, up to 16kW.Available to the public. Self park.",
    "StatusTypeID": 50,
    "DateLastStatusUpdate": "2017-01-26T19:13:00Z",
    "DataQualityLevel": 1,
    "DateCreated": "2017-01-26T19:13:00Z",
    "SubmissionStatusTypeID": 200
}