{
    "IsRecentlyVerified": false,
    "ID": 90700,
    "UUID": "64221B4A-470D-41FC-8889-C9DD782CC01B",
    "DataProviderID": 1,
    "OperatorID": 23,
    "OperatorsReference": "32068",
    "UsageTypeID": 4,
    "AddressInfo": {
        "ID": 91046,
        "Title": "Veranda Beach Resort",
        "AddressLine1": "299 Eastlake RD",
        "Town": "Oroville",
        "StateOrProvince": "Washington",
        "Postcode": "98844",
        "CountryID": 2,
        "Latitude": 48.987053,
        "Longitude": -119.425912,
        "ContactTelephone1": "(509) 476-4000",
        "DistanceUnit": 0
    },
    "Connections": [
        {
            "ID": 128423,
            "ConnectionTypeID": 30,
            "StatusTypeID": 50,
            "LevelID": 2,
            "PowerKW": 16,
            "CurrentTypeID": 20,
            "Quantity": 2
        }
    ],
    "NumberOfPoints": 2,
    "GeneralComments": "2 Tesla Connectors, up to 16kW.Available for customers. Please call ahead.",
    "StatusTypeID": 50,
    "DateLastStatusUpdate": "2017-07-22T05:35:00Z",
    "DataQualityLevel": 1,
    "DateCreated": "2017-07-22T05:35:00Z",
    "SubmissionStatusTypeID": 200
}