{
    "IsRecentlyVerified": false,
    "ID": 53989,
    "UUID": "4915FA19-DF29-4774-A643-908EC23E54A6",
    "DataProviderID": 26,
    "DataProvidersReference": "69842",
    "OperatorID": 73,
    "OperatorsReference": "EV-Box EVB-P1420142",
    "UsageCost": "0.00 jaarabonnement",
    "AddressInfo": {
        "ID": 54335,
        "Title": "Jan Eisengastrjitte 1",
        "AddressLine1": "Jan Eisengastrjitte 1",
        "Town": "Opsterland",
        "Postcode": "8401 DW",
        "CountryID": 159,
        "Latitude": 53.00523,
        "Longitude": 6.06351,
        "RelatedURL": "http://www.ev-box.nl",
        "DistanceUnit": 0
    },
    "Connections": [
        {
            "ID": 67503,
            "ConnectionTypeID": 25,
            "LevelID": 2,
            "PowerKW": 11,
            "CurrentTypeID": 10
        },
        {
            "ID": 67504,
            "ConnectionTypeID": 25,
            "LevelID": 2,
            "PowerKW": 11,
            "CurrentTypeID": 10
        }
    ],
    "NumberOfPoints": 1,
    "StatusTypeID": 50,
    "DateLastStatusUpdate": "2016-06-04T02:56:00Z",
    "DataQualityLevel": 3,
    "DateCreated": "2015-09-20T11:50:00Z",
    "SubmissionStatusTypeID": 100
}