{
    "IsRecentlyVerified": false,
    "ID": 49271,
    "UUID": "F573FA30-530A-44F2-AC7F-DE8E612BB4E1",
    "DataProviderID": 1,
    "OperatorID": 20,
    "OperatorsReference": "60233..60248",
    "UsageTypeID": 4,
    "UsageCost": "Free",
    "AddressInfo": {
        "ID": 49617,
        "Title": "Birley Fields Campus",
        "AddressLine1": "Stretford Road",
        "Town": "Manchester",
        "Postcode": "M15 5JH",
        "CountryID": 1,
        "Latitude": 53.4671105,
        "Longitude": -2.2467633,
        "DistanceUnit": 0
    },
    "Connections": [
        {
            "ID": 60908,
            "ConnectionTypeID": 25,
            "StatusTypeID": 75,
            "LevelID": 2,
            "Amps": 32,
            "Voltage": 230,
            "PowerKW": 7,
            "CurrentTypeID": 10,
            "Quantity": 16
        }
    ],
    "NumberOfPoints": 18,
    "StatusTypeID": 75,
    "DateLastStatusUpdate": "2019-05-24T05:16:00Z",
    "DataQualityLevel": 1,
    "DateCreated": "2015-07-16T09:47:00Z",
    "SubmissionStatusTypeID": 200
}