{
    "IsRecentlyVerified": false,
    "ID": 56559,
    "UUID": "2525D4BC-CB53-4D3B-ABF3-A104D0F108B2",
    "DataProviderID": 2,
    "DataProvidersReference": "70782",
    "OperatorID": 5,
    "UsageTypeID": 1,
    "AddressInfo": {
        "ID": 56905,
        "Title": "EVERGY",
        "AddressLine1": "11010 W 74th Ter @ Walmart #5308",
        "Town": "Shawnee",
        "StateOrProvince": "KS",
        "Postcode": "66203",
        "CountryID": 2,
        "Latitude": 38.994414,
        "Longitude": -94.713445,
        "ContactTelephone1": "888-758-4389",
        "AccessComments": "24 hours daily",
        "RelatedURL": "http://www.chargepoint.com/",
        "DistanceUnit": 0
    },
    "Connections": [
        {
            "ID": 71318,
            "ConnectionTypeID": 1,
            "LevelID": 2,
            "Amps": 16,
            "Voltage": 230,
            "PowerKW": 3.7,
            "CurrentTypeID": 10,
            "Quantity": 6
        }
    ],
    "DateLastStatusUpdate": "2020-06-26T03:01:00Z",
    "DataQualityLevel": 3,
    "DateCreated": "2015-11-04T08:42:00Z",
    "SubmissionStatusTypeID": 100
}