{
    "IsRecentlyVerified": false,
    "ID": 133463,
    "UUID": "B4A719FB-BAB8-4068-B402-ADF0AC5610F6",
    "DataProviderID": 1,
    "OperatorID": 105,
    "UsageTypeID": 4,
    "AddressInfo": {
        "ID": 133809,
        "Title": "Gemeindeverwaltung Dörentrup",
        "AddressLine1": "Poststraße 11",
        "Town": "Dörentrup",
        "StateOrProvince": "Kreis Lippe",
        "Postcode": "32694",
        "CountryID": 87,
        "Latitude": 52.03617199932805,
        "Longitude": 9.00657339753036,
        "AccessComments": "24/7 verfügbare Ladesäule auf dem Parkplatz",
        "RelatedURL": "https://www.stadtwerkenergie.de/",
        "DistanceUnit": 0
    },
    "Connections": [
        {
            "ID": 186821,
            "ConnectionTypeID": 25,
            "StatusTypeID": 50,
            "LevelID": 2,
            "Amps": 32,
            "Voltage": 400,
            "PowerKW": 22,
            "CurrentTypeID": 20,
            "Quantity": 2
        }
    ],
    "NumberOfPoints": 2,
    "StatusTypeID": 50,
    "DateLastStatusUpdate": "2019-10-18T06:10:00Z",
    "DataQualityLevel": 1,
    "DateCreated": "2019-10-18T06:10:00Z",
    "SubmissionStatusTypeID": 200
}