{
    "IsRecentlyVerified": false,
    "ID": 33188,
    "UUID": "DE494EFF-BAF4-40EC-B2B1-E9FE408C7E14",
    "DataProviderID": 26,
    "DataProvidersReference": "39277",
    "OperatorID": 157,
    "OperatorsReference": "NewMotion ICUEVE000224",
    "UsageCost": "0.00 jaarabonnement",
    "AddressInfo": {
        "ID": 33534,
        "Title": "Chaamse Baan 2",
        "AddressLine1": "Chaamse Baan 2",
        "Town": "Breda",
        "Postcode": "4851 SN",
        "CountryID": 159,
        "Latitude": 51.5398330688477,
        "Longitude": 4.79463815689087,
        "ContactTelephone1": "088 0109500",
        "RelatedURL": "http://thenewmotion.nl/",
        "DistanceUnit": 0
    },
    "Connections": [
        {
            "ID": 36699,
            "ConnectionTypeID": 25,
            "LevelID": 2,
            "PowerKW": 11,
            "CurrentTypeID": 10
        }
    ],
    "NumberOfPoints": 2,
    "StatusTypeID": 50,
    "DateLastStatusUpdate": "2016-06-04T02:39:00Z",
    "DataQualityLevel": 3,
    "DateCreated": "2015-01-09T06:04:00Z",
    "SubmissionStatusTypeID": 100
}