{
    "IsRecentlyVerified": false,
    "ID": 140604,
    "UUID": "B42E74F4-8224-4A20-9D60-7BE54833A249",
    "DataProviderID": 2,
    "DataProvidersReference": "122441",
    "OperatorID": 23,
    "UsageTypeID": 1,
    "AddressInfo": {
        "ID": 140956,
        "Title": "TRU Hotel by Hilton Bowling Green - Tesla Destination",
        "AddressLine1": "1864 Cave Mill Rd",
        "Town": "Bowling Green",
        "StateOrProvince": "KY",
        "Postcode": "42104",
        "CountryID": 2,
        "Latitude": 36.944263,
        "Longitude": -86.429146,
        "ContactTelephone1": "270-904-2260  877-798-3752",
        "AccessComments": "24 hours daily; for customer use only",
        "RelatedURL": "https://www.tesla.com/destination-charging",
        "DistanceUnit": 0
    },
    "Connections": [
        {
            "ID": 196285,
            "ConnectionTypeID": 30,
            "LevelID": 2,
            "Amps": 16,
            "Voltage": 230,
            "PowerKW": 3.7,
            "CurrentTypeID": 10,
            "Quantity": 2
        }
    ],
    "StatusTypeID": 50,
    "DateLastStatusUpdate": "2020-06-26T02:59:00Z",
    "DataQualityLevel": 3,
    "DateCreated": "2019-12-24T09:13:00Z",
    "SubmissionStatusTypeID": 100
}