{
    "IsRecentlyVerified": false,
    "ID": 100832,
    "UUID": "A307F909-B3EE-44ED-8CC2-AD7E1F16226E",
    "DataProviderID": 1,
    "OperatorID": 23,
    "OperatorsReference": "41274",
    "UsageTypeID": 4,
    "AddressInfo": {
        "ID": 101178,
        "Title": "Al Maha A Luxury Collection Desert Resort",
        "AddressLine1": "Dubai Desert Conservation Reserve Al Ain Road",
        "Town": "Dubai",
        "Postcode": "11887",
        "CountryID": 235,
        "Latitude": 24.823327,
        "Longitude": 55.662537,
        "ContactTelephone1": "+971 4 832 9900",
        "DistanceUnit": 0
    },
    "Connections": [
        {
            "ID": 142412,
            "ConnectionTypeID": 30,
            "StatusTypeID": 50,
            "LevelID": 2,
            "Amps": 32,
            "Voltage": 400,
            "PowerKW": 22,
            "CurrentTypeID": 20,
            "Quantity": 2
        }
    ],
    "NumberOfPoints": 2,
    "GeneralComments": "2 Tesla Connectors, up to 22kW.Available for customers. Please see valet.",
    "StatusTypeID": 50,
    "DateLastStatusUpdate": "2018-10-03T22:21:00Z",
    "DataQualityLevel": 1,
    "DateCreated": "2018-03-10T06:56:00Z",
    "SubmissionStatusTypeID": 200
}