{
    "IsRecentlyVerified": false,
    "ID": 90713,
    "UUID": "1D259D69-515A-44E5-A898-70F5BDE896C8",
    "DataProviderID": 1,
    "OperatorID": 23,
    "OperatorsReference": "32104",
    "UsageTypeID": 4,
    "AddressInfo": {
        "ID": 91059,
        "Title": "Icon 376 Greenwich Street",
        "AddressLine1": "376 Greenwich St",
        "Town": "New York",
        "StateOrProvince": "New York",
        "Postcode": "10013",
        "CountryID": 2,
        "Latitude": 40.719825,
        "Longitude": -74.010137,
        "ContactTelephone1": "(212) 227-7035",
        "DistanceUnit": 0
    },
    "Connections": [
        {
            "ID": 128436,
            "ConnectionTypeID": 30,
            "StatusTypeID": 50,
            "LevelID": 2,
            "PowerKW": 16,
            "CurrentTypeID": 20,
            "Quantity": 2
        }
    ],
    "NumberOfPoints": 2,
    "GeneralComments": "2 Tesla Connectors, up to 16kW.Available for customers. Please see valet.",
    "StatusTypeID": 50,
    "DateLastStatusUpdate": "2017-07-22T05:37:00Z",
    "DataQualityLevel": 1,
    "DateCreated": "2017-07-22T05:37:00Z",
    "SubmissionStatusTypeID": 200
}