{
    "IsRecentlyVerified": false,
    "ID": 77434,
    "UUID": "32160005-C1A0-47C0-A7D4-EDDF37850F2C",
    "DataProviderID": 1,
    "OperatorID": 45,
    "UsageTypeID": 6,
    "AddressInfo": {
        "ID": 77780,
        "Title": " Residence Toblini Torbole ",
        "AddressLine1": "Via al Cor, 2",
        "Town": "Torbole sul Garda",
        "StateOrProvince": "TN",
        "Postcode": "38069",
        "CountryID": 112,
        "Latitude": 45.87257965919437,
        "Longitude": 10.873635841437949,
        "ContactTelephone1": "0464/505123",
        "ContactEmail": "info@toblini.com",
        "RelatedURL": "http://www.toblini.com/",
        "DistanceUnit": 0
    },
    "Connections": [
        {
            "ID": 111577,
            "ConnectionTypeID": 1036,
            "StatusTypeID": 50,
            "LevelID": 2,
            "Quantity": 1
        }
    ],
    "NumberOfPoints": 2,
    "StatusTypeID": 50,
    "DateLastStatusUpdate": "2017-01-16T09:34:00Z",
    "DataQualityLevel": 1,
    "DateCreated": "2017-01-16T09:34:00Z",
    "SubmissionStatusTypeID": 200
}