{
    "IsRecentlyVerified": false,
    "ID": 145139,
    "UUID": "47DDA9CB-9ED9-452B-AC8D-243EF764D8CC",
    "DataProviderID": 2,
    "DataProvidersReference": "147207",
    "OperatorID": 90,
    "UsageTypeID": 1,
    "AddressInfo": {
        "ID": 145491,
        "Title": "St-Roch-de-Mékinac - Camping municipal",
        "AddressLine1": "501 route Ducharme (route 155)",
        "Town": "Saint-Roch-de-Mékinac",
        "StateOrProvince": "QC",
        "Postcode": "G0X 2E0",
        "CountryID": 44,
        "Latitude": 46.78669,
        "Longitude": -72.78408,
        "ContactTelephone1": "877-505-2674",
        "AccessComments": "24 hours daily",
        "RelatedURL": "https://lecircuitelectrique.com/",
        "DistanceUnit": 0
    },
    "Connections": [
        {
            "ID": 201746,
            "ConnectionTypeID": 1,
            "LevelID": 2,
            "Amps": 16,
            "Voltage": 230,
            "PowerKW": 3.7,
            "CurrentTypeID": 10,
            "Quantity": 1
        }
    ],
    "StatusTypeID": 50,
    "DateLastStatusUpdate": "2020-06-26T03:10:00Z",
    "DataQualityLevel": 3,
    "DateCreated": "2019-12-24T09:24:00Z",
    "SubmissionStatusTypeID": 100
}