{
    "IsRecentlyVerified": false,
    "ID": 145386,
    "UUID": "F690D187-BB31-4E3E-96A8-3CA667EFA329",
    "DataProviderID": 2,
    "DataProvidersReference": "96090",
    "OperatorID": 9,
    "UsageTypeID": 1,
    "AddressInfo": {
        "ID": 145738,
        "Title": "Harborview Medical Center",
        "AddressLine1": "908 Jefferson",
        "Town": "Seattle",
        "StateOrProvince": "WA",
        "Postcode": "98104",
        "CountryID": 2,
        "Latitude": 47.605477,
        "Longitude": -122.323427,
        "ContactTelephone1": "888-998-2546",
        "AccessComments": "MON: 24 hours | TUE: 24 hours | WED: 24 hours | THU: 24 hours | FRI: 24 hours | SAT: 24 hours | SUN: 24 hours",
        "RelatedURL": "http://www.blinkcharging.com/",
        "DistanceUnit": 0
    },
    "Connections": [
        {
            "ID": 202050,
            "ConnectionTypeID": 1,
            "LevelID": 2,
            "Amps": 16,
            "Voltage": 230,
            "PowerKW": 3.7,
            "CurrentTypeID": 10,
            "Quantity": 6
        }
    ],
    "StatusTypeID": 50,
    "DateLastStatusUpdate": "2020-06-26T03:11:00Z",
    "DataQualityLevel": 3,
    "DateCreated": "2019-12-24T09:24:00Z",
    "SubmissionStatusTypeID": 100
}