{
    "IsRecentlyVerified": false,
    "ID": 45982,
    "UUID": "609A0DA1-A0A1-484C-9483-A17337EFD3FA",
    "DataProviderID": 1,
    "DataProvidersReference": "209",
    "AddressInfo": {
        "ID": 46328,
        "Title": "Rakkestad Sentrum",
        "AddressLine1": "Rådhusveien 1",
        "Town": "RAKKESTAD",
        "StateOrProvince": "Viken",
        "Postcode": "1890",
        "CountryID": 168,
        "Latitude": 59.42834,
        "Longitude": 11.34215,
        "AccessComments": "To av ladepunktene er plassert på sørvestlige vegg på kommunehuset (venstre side når man ser på hovedinngangen).",
        "DistanceUnit": 0
    },
    "Connections": [
        {
            "ID": 56645,
            "ConnectionTypeID": 0,
            "Reference": "1",
            "LevelID": 2,
            "Amps": 16,
            "Voltage": 400,
            "PowerKW": 11,
            "Comments": "Mode 3"
        },
        {
            "ID": 84813,
            "ConnectionTypeID": 0,
            "Reference": "2",
            "LevelID": 2,
            "Amps": 16,
            "Voltage": 400,
            "PowerKW": 11,
            "Comments": "Mode 3"
        },
        {
            "ID": 88298,
            "ConnectionTypeID": 0,
            "Reference": "3",
            "LevelID": 2,
            "Amps": 16,
            "Voltage": 400,
            "PowerKW": 11,
            "Comments": "Mode 3"
        },
        {
            "ID": 223014,
            "ConnectionTypeID": 0,
            "Reference": "4",
            "LevelID": 2,
            "Amps": 16,
            "Voltage": 400,
            "PowerKW": 11,
            "Comments": "Mode 3"
        },
        {
            "ID": 223015,
            "ConnectionTypeID": 0,
            "Reference": "5",
            "LevelID": 2,
            "Amps": 16,
            "Voltage": 400,
            "PowerKW": 11,
            "Comments": "Mode 3"
        },
        {
            "ID": 223016,
            "ConnectionTypeID": 0,
            "Reference": "6",
            "LevelID": 2,
            "Amps": 16,
            "Voltage": 400,
            "PowerKW": 11,
            "Comments": "Mode 3"
        }
    ],
    "NumberOfPoints": 6,
    "DateLastStatusUpdate": "2020-05-26T08:23:00Z",
    "DataQualityLevel": 2,
    "DateCreated": "2015-05-03T00:54:00Z",
    "SubmissionStatusTypeID": 100
}