{
    "IsRecentlyVerified": false,
    "ID": 122599,
    "UUID": "233083C9-179B-4138-9885-FD5D14EF0E49",
    "DataProviderID": 2,
    "DataProvidersReference": "6405",
    "UsageTypeID": 7,
    "AddressInfo": {
        "ID": 122945,
        "Title": "Galpin Motors",
        "AddressLine1": "15421 Roscoe Blvd",
        "Town": "Sepulveda",
        "StateOrProvince": "CA",
        "Postcode": "91343",
        "CountryID": 2,
        "Latitude": 34.221665,
        "Longitude": -118.468371,
        "ContactTelephone1": "800-256-6219",
        "AccessComments": "Dealership business hours\r\nPublic - Call ahead",
        "RelatedURL": "",
        "DistanceUnit": 0
    },
    "Connections": [
        {
            "ID": 172504,
            "ConnectionTypeID": 1,
            "LevelID": 2,
            "Amps": 16,
            "Voltage": 230,
            "PowerKW": 3.7,
            "CurrentTypeID": 10,
            "Quantity": 2
        }
    ],
    "DateLastStatusUpdate": "2020-06-26T02:57:00Z",
    "DataQualityLevel": 3,
    "DateCreated": "2019-04-06T05:03:00Z",
    "SubmissionStatusTypeID": 100
}