{
    "IsRecentlyVerified": false,
    "ID": 152458,
    "UUID": "A656E7AC-7071-4D34-9F69-6C5BAD4AA85F",
    "DataProviderID": 28,
    "DataProvidersReference": "FRS1821301",
    "UsageTypeID": 5,
    "AddressInfo": {
        "ID": 152811,
        "Title": "St Germain du Puy",
        "AddressLine1": "Place de l Eglise - 18390 ST GERMAIN DU PUY",
        "CountryID": 80,
        "Latitude": 47.1001602,
        "Longitude": 2.4826762,
        "AccessComments": "24h/24h",
        "DistanceUnit": 0
    },
    "Connections": [
        {
            "ID": 213435,
            "ConnectionTypeID": 26,
            "StatusTypeID": 50,
            "LevelID": 2,
            "PowerKW": 18
        },
        {
            "ID": 246398,
            "ConnectionTypeID": 26,
            "StatusTypeID": 50,
            "LevelID": 2,
            "PowerKW": 18
        }
    ],
    "GeneralComments": "Borne en service",
    "StatusTypeID": 50,
    "DateLastStatusUpdate": "2020-08-27T05:13:00Z",
    "DataQualityLevel": 2,
    "DateCreated": "2020-03-15T10:53:00Z",
    "SubmissionStatusTypeID": 100
}