{
    "IsRecentlyVerified": false,
    "ID": 37674,
    "UUID": "94957A5D-B0AE-42A7-AC08-EBF12B2533D5",
    "DataProviderID": 26,
    "DataProvidersReference": "48603",
    "OperatorID": 178,
    "OperatorsReference": "EVnetNL REE402",
    "UsageCost": "0.00 jaarabonnement",
    "AddressInfo": {
        "ID": 38020,
        "Title": "G van der Muelenweg 1-01",
        "AddressLine1": "G van der Muelenweg 1-01",
        "Town": "Hellendoorn",
        "Postcode": "7443 RE",
        "CountryID": 159,
        "Latitude": 52.366825,
        "Longitude": 6.465244,
        "ContactTelephone1": "0800-3522365",
        "RelatedURL": "http://www.evnet.nl",
        "DistanceUnit": 0
    },
    "Connections": [
        {
            "ID": 41185,
            "ConnectionTypeID": 25,
            "LevelID": 1,
            "PowerKW": 2.3,
            "CurrentTypeID": 10
        }
    ],
    "NumberOfPoints": 1,
    "StatusTypeID": 50,
    "DateLastStatusUpdate": "2016-06-04T02:53:00Z",
    "DataQualityLevel": 3,
    "DateCreated": "2015-01-09T06:07:00Z",
    "SubmissionStatusTypeID": 100
}