{
    "MediaItems": [
        {
            "ID": 20203,
            "ChargePointID": 131442,
            "ItemURL": "https://s3-ap-southeast-2.amazonaws.com/openchargemap/images/DE/OCM131442/OCM-131442.orig.2019110315163140.jpg",
            "ItemThumbnailURL": "https://s3-ap-southeast-2.amazonaws.com/openchargemap/images/DE/OCM131442/OCM-131442.thmb.2019110315163140.jpg",
            "Comment": "",
            "IsEnabled": true,
            "IsVideo": false,
            "IsFeaturedItem": false,
            "IsExternalResource": false,
            "User": {
                "ID": 4573,
                "Username": "Erna_Schleck"
            },
            "DateCreated": "2019-11-03T15:17:00Z"
        }
    ],
    "IsRecentlyVerified": false,
    "ID": 131442,
    "UUID": "D3B41146-FD18-4899-B1A0-0732D3C59244",
    "DataProviderID": 1,
    "OperatorID": 121,
    "UsageTypeID": 4,
    "UsageCost": "0,35€/kWh+0,02€/min",
    "AddressInfo": {
        "ID": 131788,
        "Title": "Parkplatz Köbelinger Markt",
        "AddressLine1": "Marktstraße",
        "Town": "Hannover",
        "StateOrProvince": "Region Hannover",
        "Postcode": "30159",
        "CountryID": 87,
        "Latitude": 52.37057702059758,
        "Longitude": 9.737185139801,
        "AccessComments": "24/7 verfügbare Ladestation am Sparkassen Immobiliencenter. ",
        "RelatedURL": "http://www.enercity-contracting.de/alternative-antriebe/elektromobilitaet/ladesaeulen/index.html",
        "DistanceUnit": 0
    },
    "Connections": [
        {
            "ID": 184003,
            "ConnectionTypeID": 25,
            "StatusTypeID": 50,
            "LevelID": 2,
            "Amps": 32,
            "Voltage": 400,
            "PowerKW": 22,
            "CurrentTypeID": 20,
            "Quantity": 2
        }
    ],
    "NumberOfPoints": 2,
    "StatusTypeID": 50,
    "DateLastStatusUpdate": "2021-07-31T06:28:00Z",
    "DataQualityLevel": 1,
    "DateCreated": "2019-09-06T21:21:00Z",
    "SubmissionStatusTypeID": 200
}