{
    "IsRecentlyVerified": false,
    "ID": 107301,
    "UUID": "7D88302C-1DC0-4918-B5EF-E6FA1984610E",
    "DataProviderID": 1,
    "OperatorID": 25,
    "OperatorsReference": "merton-acaciaroad",
    "UsageTypeID": 4,
    "UsageCost": "£0.059/minute; min £1.18; other tariffs available",
    "AddressInfo": {
        "ID": 107647,
        "Title": "Acacia Road",
        "AddressLine1": "Junction Acacia Road Hammond Avenue",
        "Town": "Croydon",
        "Postcode": "CR4 1DA",
        "CountryID": 1,
        "Latitude": 51.40669957,
        "Longitude": -0.152703543299,
        "DistanceUnit": 0
    },
    "Connections": [
        {
            "ID": 151381,
            "ConnectionTypeID": 25,
            "StatusTypeID": 50,
            "LevelID": 2,
            "Amps": 32,
            "Voltage": 230,
            "PowerKW": 7,
            "CurrentTypeID": 10,
            "Quantity": 2
        },
        {
            "ID": 151382,
            "ConnectionTypeID": 1,
            "StatusTypeID": 50,
            "LevelID": 2,
            "Amps": 16,
            "Voltage": 230,
            "PowerKW": 4,
            "CurrentTypeID": 10,
            "Quantity": 2
        }
    ],
    "NumberOfPoints": 2,
    "StatusTypeID": 50,
    "DateLastStatusUpdate": "2019-01-08T08:26:00Z",
    "DataQualityLevel": 1,
    "DateCreated": "2018-07-23T16:02:00Z",
    "SubmissionStatusTypeID": 200
}