{
    "IsRecentlyVerified": false,
    "ID": 165085,
    "UUID": "010797E2-C118-41FC-B4DB-80AA33418004",
    "DataProviderID": 1,
    "OperatorID": 23,
    "OperatorsReference": "34159",
    "UsageTypeID": 4,
    "UsageCost": "€0.33/kWh; Andere Tarife für ältere Autos",
    "AddressInfo": {
        "ID": 165444,
        "Title": "Bruchsal Supercharger",
        "AddressLine1": "17 Kammerforststraße",
        "Town": "Bruchsal",
        "StateOrProvince": "BB",
        "CountryID": 87,
        "Latitude": 49.1384,
        "Longitude": 8.56233,
        "DistanceUnit": 0
    },
    "Connections": [
        {
            "ID": 236685,
            "ConnectionTypeID": 27,
            "StatusTypeID": 50,
            "LevelID": 3,
            "PowerKW": 120,
            "CurrentTypeID": 30,
            "Quantity": 14
        }
    ],
    "NumberOfPoints": 14,
    "GeneralComments": "Charging14 Superchargers, available 24/7, up to 150kW",
    "StatusTypeID": 50,
    "DateLastStatusUpdate": "2020-08-26T05:25:00Z",
    "DataQualityLevel": 1,
    "DateCreated": "2020-08-25T05:56:00Z",
    "SubmissionStatusTypeID": 200
}