{
    "IsRecentlyVerified": false,
    "ID": 71997,
    "UUID": "2FE7E7CD-1AAB-4E8D-A1D9-DC2FC614D76B",
    "DataProviderID": 1,
    "OperatorID": 3,
    "OperatorsReference": "PG-80569",
    "UsageTypeID": 6,
    "UsageCost": "Free",
    "AddressInfo": {
        "ID": 72343,
        "Title": "Newly Weds Foods Limited-Ossett",
        "AddressLine1": "Leeds Road",
        "Town": "Ossett",
        "StateOrProvince": "West Yorkshire",
        "Postcode": "WF5 9AX",
        "CountryID": 1,
        "Latitude": 53.696072,
        "Longitude": -1.594909,
        "DistanceUnit": 0
    },
    "Connections": [
        {
            "ID": 103225,
            "ConnectionTypeID": 25,
            "StatusTypeID": 50,
            "LevelID": 2,
            "Amps": 32,
            "Voltage": 230,
            "PowerKW": 7,
            "CurrentTypeID": 10,
            "Quantity": 2
        }
    ],
    "NumberOfPoints": 3,
    "StatusTypeID": 50,
    "DateLastStatusUpdate": "2017-12-20T11:51:00Z",
    "DataQualityLevel": 1,
    "DateCreated": "2016-09-27T09:55:00Z",
    "SubmissionStatusTypeID": 200
}