{
    "IsRecentlyVerified": false,
    "ID": 77783,
    "UUID": "12A1B04A-3D32-42D5-960B-039AC5D92CE8",
    "DataProviderID": 1,
    "OperatorID": 80,
    "UsageTypeID": 4,
    "UsageCost": "0,40 €/kWh",
    "AddressInfo": {
        "ID": 78129,
        "Title": "INGRID - High-capacity hydrogen-based green-energy storage solutions for grid balancing",
        "AddressLine1": "Strada Esterna Incoronata",
        "AddressLine2": "Contrada La Casina",
        "Town": "Troia",
        "StateOrProvince": "FG",
        "Postcode": "71029 ",
        "CountryID": 112,
        "Latitude": 41.368213855653764,
        "Longitude": 15.341882020564288,
        "RelatedURL": "http://eneldrive.it",
        "DistanceUnit": 0
    },
    "Connections": [
        {
            "ID": 112370,
            "ConnectionTypeID": 25,
            "StatusTypeID": 50,
            "LevelID": 2,
            "Amps": 32,
            "Voltage": 400,
            "PowerKW": 22,
            "CurrentTypeID": 20,
            "Quantity": 2
        }
    ],
    "NumberOfPoints": 2,
    "GeneralComments": "http://www.ingridproject.eu/\r\nhttp://www.arti.puglia.it/progetti-internazionali/ingrid",
    "StatusTypeID": 50,
    "DateLastStatusUpdate": "2017-01-24T14:49:00Z",
    "DataQualityLevel": 1,
    "DateCreated": "2017-01-24T14:49:00Z",
    "SubmissionStatusTypeID": 200
}