{
    "IsRecentlyVerified": false,
    "ID": 92557,
    "UUID": "258EFCBC-4379-4E16-ACF6-22537882E59B",
    "DataProviderID": 1,
    "OperatorID": 23,
    "OperatorsReference": "33672",
    "UsageTypeID": 4,
    "AddressInfo": {
        "ID": 92903,
        "Title": "Bailey Ground Hotel",
        "AddressLine1": "Bailey Ground Hotel Drigg Road",
        "Town": "Seascale",
        "StateOrProvince": "Cumbria",
        "Postcode": "CA20 1NP",
        "CountryID": 1,
        "Latitude": 54.39432,
        "Longitude": -3.483791,
        "ContactTelephone1": "+44 194 672 9786",
        "DistanceUnit": 0
    },
    "Connections": [
        {
            "ID": 131158,
            "ConnectionTypeID": 30,
            "StatusTypeID": 50,
            "LevelID": 2,
            "Amps": 32,
            "Voltage": 230,
            "PowerKW": 13,
            "CurrentTypeID": 20,
            "Quantity": 2
        }
    ],
    "NumberOfPoints": 2,
    "GeneralComments": "2 Tesla Connectors, up to 13kW.Available to the public. Please see front desk.",
    "StatusTypeID": 50,
    "DateLastStatusUpdate": "2018-10-03T14:49:00Z",
    "DataQualityLevel": 1,
    "DateCreated": "2017-09-07T06:01:00Z",
    "SubmissionStatusTypeID": 200
}