{
    "IsRecentlyVerified": false,
    "ID": 113551,
    "UUID": "00DC89B1-16B1-4274-A25B-27334BE3703B",
    "DataProviderID": 1,
    "OperatorID": 229,
    "UsageTypeID": 4,
    "UsageCost": "$0.25/kWh + $0.25/min",
    "AddressInfo": {
        "ID": 113897,
        "Title": "New World Matamata",
        "AddressLine1": "45 Waharoa Road",
        "Town": "Matamata",
        "Postcode": "3400",
        "CountryID": 161,
        "Latitude": -37.803742,
        "Longitude": 175.769937,
        "DistanceUnit": 0
    },
    "Connections": [
        {
            "ID": 160003,
            "ConnectionTypeID": 33,
            "StatusTypeID": 50,
            "LevelID": 3,
            "PowerKW": 50,
            "CurrentTypeID": 30,
            "Quantity": 1
        },
        {
            "ID": 160004,
            "ConnectionTypeID": 2,
            "StatusTypeID": 50,
            "LevelID": 3,
            "PowerKW": 50,
            "CurrentTypeID": 30,
            "Quantity": 1
        }
    ],
    "NumberOfPoints": 2,
    "StatusTypeID": 50,
    "DateLastStatusUpdate": "2018-12-19T09:14:00Z",
    "DataQualityLevel": 1,
    "DateCreated": "2018-12-19T09:14:00Z",
    "SubmissionStatusTypeID": 200
}