{
    "IsRecentlyVerified": false,
    "ID": 132946,
    "UUID": "1723B8A9-60A8-4CFD-A75B-089871A83D8B",
    "DataProviderID": 1,
    "OperatorID": 203,
    "UsageTypeID": 5,
    "UsageCost": "£0.36/kWh",
    "AddressInfo": {
        "ID": 133292,
        "Title": "Golden Eagle Public House",
        "AddressLine1": "Sherwood Avenue",
        "Town": "Mansfield",
        "Postcode": "NG18 4GH",
        "CountryID": 1,
        "Latitude": 53.12647,
        "Longitude": -1.14933,
        "RelatedURL": "http://engenie.co.uk/",
        "DistanceUnit": 0
    },
    "Connections": [
        {
            "ID": 186202,
            "ConnectionTypeID": 25,
            "Reference": "ENG00049-3",
            "StatusTypeID": 50,
            "LevelID": 2,
            "Amps": 32,
            "Voltage": 400,
            "PowerKW": 22,
            "CurrentTypeID": 20,
            "Quantity": 2
        },
        {
            "ID": 186410,
            "ConnectionTypeID": 2,
            "StatusTypeID": 50,
            "LevelID": 3,
            "PowerKW": 50,
            "CurrentTypeID": 30,
            "Quantity": 2
        },
        {
            "ID": 186411,
            "ConnectionTypeID": 33,
            "StatusTypeID": 50,
            "LevelID": 3,
            "PowerKW": 50,
            "CurrentTypeID": 30,
            "Quantity": 2
        }
    ],
    "NumberOfPoints": 2,
    "GeneralComments": "Contactless payment terminal fitted",
    "StatusTypeID": 50,
    "DateLastStatusUpdate": "2019-10-13T17:14:00Z",
    "MetadataValues": [
        {
            "ID": 5035,
            "MetadataFieldID": 4,
            "ItemValue": "Contains public sector information licensed under the Open Government Licence v2.0. http://www.nationalarchives.gov.uk/doc/open-government-licence/version/2/"
        }
    ],
    "DataQualityLevel": 3,
    "DateCreated": "2019-10-09T09:11:00Z",
    "SubmissionStatusTypeID": 200
}