{
    "MediaItems": [
        {
            "ID": 24066,
            "ChargePointID": 162326,
            "ItemURL": "https://s3-ap-southeast-2.amazonaws.com/openchargemap/images/AT/OCM162326/OCM-162326.orig.2020080820023967.jpg",
            "ItemThumbnailURL": "https://s3-ap-southeast-2.amazonaws.com/openchargemap/images/AT/OCM162326/OCM-162326.thmb.2020080820023967.jpg",
            "Comment": "",
            "IsEnabled": true,
            "IsVideo": false,
            "IsFeaturedItem": false,
            "IsExternalResource": false,
            "User": {
                "ID": 26760,
                "Username": "interssl.com"
            },
            "DateCreated": "2020-08-08T20:03:00Z"
        },
        {
            "ID": 24065,
            "ChargePointID": 162326,
            "ItemURL": "https://s3-ap-southeast-2.amazonaws.com/openchargemap/images/AT/OCM162326/OCM-162326.orig.2020080820021467.jpg",
            "ItemThumbnailURL": "https://s3-ap-southeast-2.amazonaws.com/openchargemap/images/AT/OCM162326/OCM-162326.thmb.2020080820021467.jpg",
            "Comment": "",
            "IsEnabled": true,
            "IsVideo": false,
            "IsFeaturedItem": false,
            "IsExternalResource": false,
            "User": {
                "ID": 26760,
                "Username": "interssl.com"
            },
            "DateCreated": "2020-08-08T20:02:00Z"
        },
        {
            "ID": 23958,
            "ChargePointID": 162326,
            "ItemURL": "https://s3-ap-southeast-2.amazonaws.com/openchargemap/images/AT/OCM162326/OCM-162326.orig.2020080718564127.jpg",
            "ItemThumbnailURL": "https://s3-ap-southeast-2.amazonaws.com/openchargemap/images/AT/OCM162326/OCM-162326.thmb.2020080718564127.jpg",
            "Comment": "",
            "IsEnabled": true,
            "IsVideo": false,
            "IsFeaturedItem": false,
            "IsExternalResource": false,
            "User": {
                "ID": 26760,
                "Username": "interssl.com"
            },
            "DateCreated": "2020-08-07T18:57:00Z"
        },
        {
            "ID": 23959,
            "ChargePointID": 162326,
            "ItemURL": "https://s3-ap-southeast-2.amazonaws.com/openchargemap/images/AT/OCM162326/OCM-162326.orig.2020080718565331.jpg",
            "ItemThumbnailURL": "https://s3-ap-southeast-2.amazonaws.com/openchargemap/images/AT/OCM162326/OCM-162326.thmb.2020080718565331.jpg",
            "Comment": "",
            "IsEnabled": true,
            "IsVideo": false,
            "IsFeaturedItem": false,
            "IsExternalResource": false,
            "User": {
                "ID": 26760,
                "Username": "interssl.com"
            },
            "DateCreated": "2020-08-07T18:57:00Z"
        },
        {
            "ID": 23960,
            "ChargePointID": 162326,
            "ItemURL": "https://s3-ap-southeast-2.amazonaws.com/openchargemap/images/AT/OCM162326/OCM-162326.orig.2020080718570373.jpg",
            "ItemThumbnailURL": "https://s3-ap-southeast-2.amazonaws.com/openchargemap/images/AT/OCM162326/OCM-162326.thmb.2020080718570373.jpg",
            "Comment": "",
            "IsEnabled": true,
            "IsVideo": false,
            "IsFeaturedItem": false,
            "IsExternalResource": false,
            "User": {
                "ID": 26760,
                "Username": "interssl.com"
            },
            "DateCreated": "2020-08-07T18:57:00Z"
        },
        {
            "ID": 23961,
            "ChargePointID": 162326,
            "ItemURL": "https://s3-ap-southeast-2.amazonaws.com/openchargemap/images/AT/OCM162326/OCM-162326.orig.2020080718571522.jpg",
            "ItemThumbnailURL": "https://s3-ap-southeast-2.amazonaws.com/openchargemap/images/AT/OCM162326/OCM-162326.thmb.2020080718571522.jpg",
            "Comment": "",
            "IsEnabled": true,
            "IsVideo": false,
            "IsFeaturedItem": false,
            "IsExternalResource": false,
            "User": {
                "ID": 26760,
                "Username": "interssl.com"
            },
            "DateCreated": "2020-08-07T18:57:00Z"
        }
    ],
    "IsRecentlyVerified": false,
    "ID": 162326,
    "UUID": "901D8DA2-00A4-40EE-8C72-BC96D71BC836",
    "DataProviderID": 1,
    "OperatorID": 18,
    "UsageTypeID": 1,
    "UsageCost": "paid charging, free parking",
    "AddressInfo": {
        "ID": 162683,
        "Title": "MPREIS Weer",
        "AddressLine1": "Bundesstraße 10",
        "Town": "Gemeinde Weer",
        "StateOrProvince": "Bezirk Schwaz",
        "Postcode": "6116",
        "CountryID": 19,
        "Latitude": 47.305678293053944,
        "Longitude": 11.6428501208934,
        "RelatedURL": "https://www.tiwag.at/nc/privatkunden/energieeffizienz/mobilitaet/",
        "DistanceUnit": 0
    },
    "Connections": [
        {
            "ID": 233628,
            "ConnectionTypeID": 25,
            "LevelID": 2,
            "Amps": 16,
            "PowerKW": 11,
            "CurrentTypeID": 20,
            "Quantity": 2
        }
    ],
    "NumberOfPoints": 1,
    "StatusTypeID": 50,
    "DateLastStatusUpdate": "2020-08-08T20:03:00Z",
    "DataQualityLevel": 1,
    "DateCreated": "2020-08-05T19:28:00Z",
    "SubmissionStatusTypeID": 200
}