{
    "UserComments": [
        {
            "ID": 10006,
            "ChargePointID": 24208,
            "CommentTypeID": 10,
            "UserName": "stickybit",
            "Comment": "",
            "Rating": 5,
            "DateCreated": "2016-03-27T13:18:38.2Z",
            "User": {
                "ID": 6738,
                "Username": "stickybit"
            },
            "CheckinStatusTypeID": 10
        }
    ],
    "MediaItems": [
        {
            "ID": 6111,
            "ChargePointID": 24208,
            "ItemURL": "https://s3-ap-southeast-2.amazonaws.com/openchargemap/images/DE/OCM24208/OCM-24208.orig.2016032713194604.jpeg",
            "ItemThumbnailURL": "https://s3-ap-southeast-2.amazonaws.com/openchargemap/images/DE/OCM24208/OCM-24208.thmb.2016032713194604.jpeg",
            "Comment": "",
            "IsEnabled": true,
            "IsVideo": false,
            "IsFeaturedItem": false,
            "IsExternalResource": false,
            "User": {
                "ID": 6738,
                "Username": "stickybit"
            },
            "DateCreated": "2016-03-27T13:20:00Z"
        },
        {
            "ID": 6112,
            "ChargePointID": 24208,
            "ItemURL": "https://s3-ap-southeast-2.amazonaws.com/openchargemap/images/DE/OCM24208/OCM-24208.orig.2016032713200463.jpeg",
            "ItemThumbnailURL": "https://s3-ap-southeast-2.amazonaws.com/openchargemap/images/DE/OCM24208/OCM-24208.thmb.2016032713200463.jpeg",
            "Comment": "",
            "IsEnabled": true,
            "IsVideo": false,
            "IsFeaturedItem": false,
            "IsExternalResource": false,
            "User": {
                "ID": 6738,
                "Username": "stickybit"
            },
            "DateCreated": "2016-03-27T13:20:00Z"
        }
    ],
    "IsRecentlyVerified": false,
    "ID": 24208,
    "UUID": "953B73A7-39B5-471D-9D86-64DEB0649C61",
    "DataProviderID": 1,
    "OperatorID": 23,
    "OperatorsReference": "6361",
    "UsageTypeID": 4,
    "UsageCost": "€0.33/kWh; Andere Tarife für ältere Autos",
    "AddressInfo": {
        "ID": 24553,
        "Title": "Emsbüren Supercharger",
        "AddressLine1": "Paxtonstraße 3",
        "Town": "Emsbüren",
        "Postcode": "48488",
        "CountryID": 87,
        "Latitude": 52.3592309662601,
        "Longitude": 7.2645746434082,
        "RelatedURL": "https://www.teslamotors.com/findus/location/supercharger/emsburensupercharger",
        "DistanceUnit": 0
    },
    "Connections": [
        {
            "ID": 26279,
            "ConnectionTypeID": 27,
            "StatusTypeID": 50,
            "LevelID": 3,
            "Amps": 300,
            "Voltage": 400,
            "PowerKW": 120,
            "CurrentTypeID": 30,
            "Quantity": 8
        }
    ],
    "NumberOfPoints": 8,
    "StatusTypeID": 50,
    "DateLastStatusUpdate": "2020-05-29T16:36:00Z",
    "DataQualityLevel": 1,
    "DateCreated": "2014-07-15T06:34:00Z",
    "SubmissionStatusTypeID": 200
}