{
    "UserComments": [
        {
            "ID": 4516,
            "ChargePointID": 47254,
            "CommentTypeID": 10,
            "UserName": "dennis_p",
            "Comment": "Bass Pro closes at 9pm most days and 7pm on others ",
            "DateCreated": "2015-05-22T02:23:31.847Z",
            "User": {
                "ID": 4648,
                "Username": "dennis_p"
            },
            "CheckinStatusTypeID": 10
        }
    ],
    "MediaItems": [
        {
            "ID": 1463,
            "ChargePointID": 47254,
            "ItemURL": "https://s3-ap-southeast-2.amazonaws.com/openchargemap/images/US/OCM47254/OCM-47254.orig.2015052202363422.jpg",
            "ItemThumbnailURL": "https://s3-ap-southeast-2.amazonaws.com/openchargemap/images/US/OCM47254/OCM-47254.thmb.2015052202363422.jpg",
            "Comment": "Bass Pro Shops is an impressive institution dedicated to the American Outdoorsman. Quite impressive in store",
            "IsEnabled": true,
            "IsVideo": false,
            "IsFeaturedItem": false,
            "IsExternalResource": false,
            "User": {
                "ID": 4648,
                "Username": "dennis_p"
            },
            "DateCreated": "2015-05-22T02:37:00Z"
        }
    ],
    "IsRecentlyVerified": false,
    "ID": 47254,
    "UUID": "DFAFA13E-8217-41A6-B83D-4E1091231AA8",
    "DataProviderID": 1,
    "OperatorID": 23,
    "OperatorsReference": "7683",
    "UsageTypeID": 4,
    "UsageCost": "$0.20/min >=60kW; $0.10/min <60kW; other tariffs for older cars",
    "AddressInfo": {
        "ID": 47600,
        "Title": "Tesla Supercharger Independence MO",
        "AddressLine1": "Bass Pro Drive",
        "Town": "Independence",
        "StateOrProvince": "MO",
        "CountryID": 2,
        "Latitude": 39.0407529591565,
        "Longitude": -94.3694365024567,
        "AccessComments": "To the left of the exit to Bass Pro Shops. ",
        "DistanceUnit": 0
    },
    "Connections": [
        {
            "ID": 58255,
            "ConnectionTypeID": 27,
            "StatusTypeID": 50,
            "LevelID": 3,
            "Amps": 240,
            "Voltage": 390,
            "PowerKW": 120,
            "CurrentTypeID": 30,
            "Quantity": 6
        }
    ],
    "NumberOfPoints": 6,
    "StatusTypeID": 50,
    "DateLastStatusUpdate": "2018-03-13T13:59:00Z",
    "DataQualityLevel": 1,
    "DateCreated": "2015-05-21T23:15:00Z",
    "SubmissionStatusTypeID": 200
}