{
    "IsRecentlyVerified": false,
    "ID": 139068,
    "UUID": "F1FD729E-0E09-4CC4-B23C-54A5A0BDEF75",
    "DataProviderID": 2,
    "DataProvidersReference": "95355",
    "OperatorID": 9,
    "UsageTypeID": 1,
    "AddressInfo": {
        "ID": 139420,
        "Title": "GLL Properties Hines",
        "AddressLine1": "2375 E Camelback",
        "Town": "Phoenix",
        "StateOrProvince": "AZ",
        "Postcode": "85016",
        "CountryID": 2,
        "Latitude": 33.508006,
        "Longitude": -112.031942,
        "ContactTelephone1": "888-998-2546",
        "AccessComments": "MON: 24 hours | TUE: 24 hours | WED: 24 hours | THU: 24 hours | FRI: 24 hours | SAT: 24 hours | SUN: 24 hours",
        "RelatedURL": "http://www.blinkcharging.com/",
        "DistanceUnit": 0
    },
    "Connections": [
        {
            "ID": 194319,
            "ConnectionTypeID": 1,
            "LevelID": 2,
            "Amps": 16,
            "Voltage": 230,
            "PowerKW": 3,
            "CurrentTypeID": 10,
            "Quantity": 4
        }
    ],
    "StatusTypeID": 50,
    "DateLastStatusUpdate": "2019-12-24T09:10:00Z",
    "DataQualityLevel": 3,
    "DateCreated": "2019-12-24T09:10:00Z",
    "SubmissionStatusTypeID": 100
}