{
    "UserComments": [
        {
            "ID": 713,
            "ChargePointID": 15886,
            "CommentTypeID": 10,
            "UserName": "Thomas Antony Medd",
            "Comment": "very helpful manager and staff",
            "Rating": 4,
            "DateCreated": "2014-03-26T22:54:02.61Z",
            "User": {
                "ID": 1307,
                "Username": "Thomas Antony Medd"
            },
            "CheckinStatusTypeID": 10
        }
    ],
    "IsRecentlyVerified": false,
    "ID": 15886,
    "UUID": "BDE53F7B-9749-4785-A911-63D2BD7DF4CC",
    "DataProviderID": 1,
    "OperatorID": 19,
    "UsageTypeID": 0,
    "UsageCost": "Free",
    "AddressInfo": {
        "ID": 16231,
        "Title": "Llyndir Hall Hotel",
        "AddressLine1": "Llyndir Lane",
        "AddressLine2": "Rossett",
        "Town": "Chester",
        "StateOrProvince": "Cheshire",
        "Postcode": "LL12 0AY",
        "CountryID": 1,
        "Latitude": 53.118555,
        "Longitude": -2.942367,
        "ContactEmail": "llyndir@feathers.uk.com",
        "RelatedURL": "http://www.feathers.uk.com/llyndir-hall-hotel-spa",
        "DistanceUnit": 0
    },
    "Connections": [
        {
            "ID": 14244,
            "ConnectionTypeID": 25,
            "StatusTypeID": 30,
            "LevelID": 2,
            "Amps": 32,
            "Voltage": 230,
            "PowerKW": 7,
            "CurrentTypeID": 10,
            "Quantity": 1
        },
        {
            "ID": 14245,
            "ConnectionTypeID": 3,
            "StatusTypeID": 50,
            "LevelID": 2,
            "Amps": 13,
            "Voltage": 230,
            "PowerKW": 3,
            "CurrentTypeID": 10,
            "Quantity": 1
        }
    ],
    "NumberOfPoints": 2,
    "StatusTypeID": 50,
    "DateLastStatusUpdate": "2019-05-08T10:24:00Z",
    "DataQualityLevel": 1,
    "DateCreated": "2013-02-13T10:46:00Z",
    "SubmissionStatusTypeID": 200
}