{
    "IsRecentlyVerified": false,
    "ID": 145128,
    "UUID": "DA728342-8C43-45F0-8437-75AE449A93AE",
    "DataProviderID": 2,
    "DataProvidersReference": "149459",
    "UsageTypeID": 1,
    "AddressInfo": {
        "ID": 145480,
        "Title": "Longmire Inn",
        "AddressLine1": "47009 Paradise Rd E",
        "Town": "Ashford",
        "StateOrProvince": "WA",
        "Postcode": "98304",
        "CountryID": 2,
        "Latitude": 46.749419,
        "Longitude": -121.8134089,
        "ContactTelephone1": "360-569-2411",
        "AccessComments": "24 hours daily",
        "RelatedURL": "",
        "DistanceUnit": 0
    },
    "Connections": [
        {
            "ID": 201735,
            "ConnectionTypeID": 1,
            "LevelID": 2,
            "Amps": 16,
            "Voltage": 230,
            "PowerKW": 3.7,
            "CurrentTypeID": 10,
            "Quantity": 2
        }
    ],
    "StatusTypeID": 50,
    "DateLastStatusUpdate": "2020-06-26T03:10:00Z",
    "DataQualityLevel": 3,
    "DateCreated": "2019-12-24T09:24:00Z",
    "SubmissionStatusTypeID": 100
}