{
    "IsRecentlyVerified": false,
    "ID": 132388,
    "UUID": "976BBB62-7A81-407C-AD7C-0E93920CFED2",
    "DataProviderID": 1,
    "OperatorID": 45,
    "UsageTypeID": 4,
    "UsageCost": "0.30€/kWh ",
    "AddressInfo": {
        "ID": 132734,
        "Title": "COBARSA (concesionario Audi)",
        "AddressLine1": "Calle Andalucía, 46",
        "Town": "Palencia",
        "StateOrProvince": "Palencia",
        "Postcode": "34004",
        "CountryID": 210,
        "Latitude": 41.9993333645014,
        "Longitude": -4.51142123930117,
        "DistanceUnit": 0
    },
    "Connections": [
        {
            "ID": 185347,
            "ConnectionTypeID": 1036,
            "StatusTypeID": 50,
            "LevelID": 3,
            "Amps": 63,
            "Voltage": 400,
            "PowerKW": 43,
            "CurrentTypeID": 20,
            "Quantity": 1
        },
        {
            "ID": 185348,
            "ConnectionTypeID": 33,
            "StatusTypeID": 50,
            "LevelID": 3,
            "PowerKW": 50,
            "CurrentTypeID": 30,
            "Quantity": 1
        }
    ],
    "NumberOfPoints": 2,
    "GeneralComments": "Se activa con llavero o APP electromaps ",
    "StatusTypeID": 50,
    "DateLastStatusUpdate": "2019-09-29T08:50:00Z",
    "DataQualityLevel": 1,
    "DateCreated": "2019-09-28T10:48:00Z",
    "SubmissionStatusTypeID": 200
}