{
    "UserComments": [
        {
            "ID": 20409,
            "ChargePointID": 67883,
            "CommentTypeID": 10,
            "UserName": "Someone_Just_",
            "Comment": "1 place iced (with Mc Donalds vehicle)",
            "Rating": 3,
            "DateCreated": "2018-11-11T21:05:38.557Z",
            "User": {
                "ID": 1107,
                "Username": "Someone_Just_"
            },
            "CheckinStatusTypeID": 10
        }
    ],
    "MediaItems": [
        {
            "ID": 16988,
            "ChargePointID": 67883,
            "ItemURL": "https://s3-ap-southeast-2.amazonaws.com/openchargemap/images/BE/OCM67883/OCM-67883.orig.2018111121305552.jpg",
            "ItemThumbnailURL": "https://s3-ap-southeast-2.amazonaws.com/openchargemap/images/BE/OCM67883/OCM-67883.thmb.2018111121305552.jpg",
            "Comment": "On the back parking 2 places for cars",
            "IsEnabled": true,
            "IsVideo": false,
            "IsFeaturedItem": false,
            "IsExternalResource": false,
            "User": {
                "ID": 1107,
                "Username": "Someone_Just_"
            },
            "DateCreated": "2018-11-11T21:31:00Z"
        }
    ],
    "IsRecentlyVerified": false,
    "ID": 67883,
    "UUID": "50B9BC29-0045-4BC7-9C7C-FE96EABD08E2",
    "DataProviderID": 26,
    "DataProvidersReference": "93598",
    "OperatorID": 35,
    "OperatorsReference": "ThePluginCompany 1500511",
    "UsageTypeID": 1,
    "UsageCost": "free",
    "AddressInfo": {
        "ID": 68229,
        "Title": "Mechelsesteenweg",
        "AddressLine1": "Mechelsesteenweg",
        "Town": "Dendermonde",
        "Postcode": "9200",
        "CountryID": 26,
        "Latitude": 51.035428,
        "Longitude": 4.114568,
        "RelatedURL": "http://www.theplugincompany.com",
        "DistanceUnit": 0
    },
    "Connections": [
        {
            "ID": 94455,
            "ConnectionTypeID": 25,
            "StatusTypeID": 50,
            "LevelID": 2,
            "PowerKW": 11,
            "Quantity": 2
        }
    ],
    "NumberOfPoints": 2,
    "StatusTypeID": 50,
    "DateLastStatusUpdate": "2018-11-11T21:31:00Z",
    "DataQualityLevel": 3,
    "DateCreated": "2016-06-04T02:37:00Z",
    "SubmissionStatusTypeID": 100
}