{
    "IsRecentlyVerified": false,
    "ID": 120668,
    "UUID": "62E9B70D-A343-499A-A1BF-2E0BC9C4897C",
    "DataProviderID": 2,
    "DataProvidersReference": "39857",
    "UsageTypeID": 7,
    "AddressInfo": {
        "ID": 121014,
        "Title": "Larry H Miller Nissan - Mesa",
        "AddressLine1": "2025 W Riverview Auto Dr",
        "Town": "Mesa",
        "StateOrProvince": "AZ",
        "Postcode": "85201",
        "CountryID": 2,
        "Latitude": 33.434313,
        "Longitude": -111.872266,
        "ContactTelephone1": "480-655-4000",
        "AccessComments": "Dealership business hours\r\nPublic - Call ahead",
        "RelatedURL": "",
        "DistanceUnit": 0
    },
    "Connections": [
        {
            "ID": 170035,
            "ConnectionTypeID": 1,
            "LevelID": 2,
            "Amps": 16,
            "Voltage": 230,
            "PowerKW": 3.7,
            "CurrentTypeID": 10,
            "Quantity": 2
        },
        {
            "ID": 170036,
            "ConnectionTypeID": 2,
            "LevelID": 3,
            "Amps": 100,
            "Voltage": 400,
            "PowerKW": 40,
            "CurrentTypeID": 30,
            "Quantity": 1
        },
        {
            "ID": 170037,
            "ConnectionTypeID": 32,
            "LevelID": 3,
            "Amps": 100,
            "Voltage": 400,
            "PowerKW": 40,
            "CurrentTypeID": 30,
            "Quantity": 1
        }
    ],
    "DateLastStatusUpdate": "2020-06-26T02:55:00Z",
    "DataQualityLevel": 3,
    "DateCreated": "2019-04-01T04:59:00Z",
    "SubmissionStatusTypeID": 100
}