{
    "IsRecentlyVerified": true,
    "DateLastVerified": "2021-09-25T19:28:00Z",
    "ID": 189401,
    "UUID": "482CDEFA-A9E0-4176-80AA-2CCCF7E9E0FA",
    "DataProviderID": 1,
    "OperatorID": 21,
    "UsageTypeID": 4,
    "UsageCost": "Mobi.E compatible card or App",
    "AddressInfo": {
        "ID": 189760,
        "Title": "TND-00005 - Bricomarché",
        "AddressLine1": "",
        "Town": "Tondela",
        "StateOrProvince": "Viseu",
        "Postcode": "",
        "CountryID": 180,
        "Latitude": 40.52602017268569,
        "Longitude": -8.083492793964979,
        "DistanceUnit": 0
    },
    "Connections": [
        {
            "ID": 306306,
            "ConnectionTypeID": 33,
            "StatusTypeID": 50,
            "LevelID": 3,
            "Amps": 125,
            "Voltage": 500,
            "PowerKW": 50,
            "CurrentTypeID": 30,
            "Quantity": 1
        },
        {
            "ID": 306307,
            "ConnectionTypeID": 2,
            "StatusTypeID": 50,
            "LevelID": 3,
            "Amps": 120,
            "Voltage": 500,
            "PowerKW": 50,
            "CurrentTypeID": 30,
            "Quantity": 1
        }
    ],
    "NumberOfPoints": 1,
    "StatusTypeID": 50,
    "DateLastStatusUpdate": "2021-09-25T19:28:00Z",
    "DataQualityLevel": 1,
    "DateCreated": "2021-09-25T19:28:00Z",
    "SubmissionStatusTypeID": 200
}