{
    "IsRecentlyVerified": false,
    "ID": 150847,
    "UUID": "BC21314D-4AD2-4DC5-8A45-87DF5F2DF8E2",
    "DataProviderID": 28,
    "DataProvidersReference": "FR*M13*P13044*001",
    "UsageTypeID": 5,
    "AddressInfo": {
        "ID": 151200,
        "Title": "GRANS - Rue De L'Egalité - Parking Place Du Souvenir Français",
        "AddressLine1": "Rue De L'Egalité - Parking Place Du Souvenir Français 13450 GRANS",
        "CountryID": 80,
        "Latitude": 43.605489,
        "Longitude": 5.063095,
        "AccessComments": "24h/24 7j/7",
        "DistanceUnit": 0
    },
    "Connections": [
        {
            "ID": 210108,
            "ConnectionTypeID": 28,
            "StatusTypeID": 50,
            "LevelID": 2,
            "PowerKW": 22,
            "CurrentTypeID": 10
        },
        {
            "ID": 210109,
            "ConnectionTypeID": 1036,
            "StatusTypeID": 50,
            "LevelID": 2,
            "PowerKW": 22,
            "CurrentTypeID": 20
        },
        {
            "ID": 239781,
            "ConnectionTypeID": 28,
            "StatusTypeID": 50,
            "LevelID": 2,
            "PowerKW": 22,
            "CurrentTypeID": 10
        },
        {
            "ID": 239782,
            "ConnectionTypeID": 1036,
            "StatusTypeID": 50,
            "LevelID": 2,
            "PowerKW": 22,
            "CurrentTypeID": 20
        }
    ],
    "GeneralComments": "Recharge par badge et avec une application smartphone",
    "StatusTypeID": 50,
    "DateLastStatusUpdate": "2020-08-27T05:10:00Z",
    "DataQualityLevel": 2,
    "DateCreated": "2020-03-15T06:17:00Z",
    "SubmissionStatusTypeID": 100
}