{
    "IsRecentlyVerified": false,
    "ID": 36904,
    "UUID": "94F11791-DBF6-4579-BC49-7D589AA024F8",
    "DataProviderID": 26,
    "DataProvidersReference": "26012",
    "OperatorID": 78,
    "OperatorsReference": "Essent EM-NL-00000394-01-00001",
    "UsageCost": "0.00 jaarabonnement",
    "AddressInfo": {
        "ID": 37250,
        "Title": "Boeingavenue 275",
        "AddressLine1": "Boeingavenue 275",
        "Town": "Haarlemmermeer",
        "Postcode": "1119 PD",
        "CountryID": 159,
        "Latitude": 52.275432,
        "Longitude": 4.751405,
        "RelatedURL": "http://www.essent.nl",
        "DistanceUnit": 0
    },
    "Connections": [
        {
            "ID": 40415,
            "ConnectionTypeID": 25,
            "LevelID": 2,
            "PowerKW": 22,
            "CurrentTypeID": 10
        },
        {
            "ID": 48516,
            "ConnectionTypeID": 25,
            "LevelID": 2,
            "PowerKW": 11,
            "CurrentTypeID": 10
        },
        {
            "ID": 48517,
            "ConnectionTypeID": 25,
            "LevelID": 2,
            "PowerKW": 11,
            "CurrentTypeID": 10
        },
        {
            "ID": 48518,
            "ConnectionTypeID": 25,
            "LevelID": 2,
            "PowerKW": 11,
            "CurrentTypeID": 10
        }
    ],
    "NumberOfPoints": 1,
    "StatusTypeID": 50,
    "DateLastStatusUpdate": "2016-06-04T02:52:00Z",
    "DataQualityLevel": 3,
    "DateCreated": "2015-01-09T06:07:00Z",
    "SubmissionStatusTypeID": 100
}