{
    "MediaItems": [
        {
            "ID": 16035,
            "ChargePointID": 92204,
            "ItemURL": "https://s3-ap-southeast-2.amazonaws.com/openchargemap/images/DE/OCM92204/OCM-92204.orig.2018072520185247.png",
            "ItemThumbnailURL": "https://s3-ap-southeast-2.amazonaws.com/openchargemap/images/DE/OCM92204/OCM-92204.thmb.2018072520185247.png",
            "Comment": "",
            "IsEnabled": true,
            "IsVideo": false,
            "IsFeaturedItem": false,
            "IsExternalResource": false,
            "User": {
                "ID": 18723,
                "Username": "Basti"
            },
            "DateCreated": "2018-07-25T20:19:00Z"
        },
        {
            "ID": 16034,
            "ChargePointID": 92204,
            "ItemURL": "https://s3-ap-southeast-2.amazonaws.com/openchargemap/images/DE/OCM92204/OCM-92204.orig.2018072519495496.png",
            "ItemThumbnailURL": "https://s3-ap-southeast-2.amazonaws.com/openchargemap/images/DE/OCM92204/OCM-92204.thmb.2018072519495496.png",
            "Comment": "",
            "IsEnabled": true,
            "IsVideo": false,
            "IsFeaturedItem": false,
            "IsExternalResource": false,
            "User": {
                "ID": 18723,
                "Username": "Basti"
            },
            "DateCreated": "2018-07-25T19:50:00Z"
        }
    ],
    "IsRecentlyVerified": false,
    "ID": 92204,
    "UUID": "33C829CC-5364-4FE9-9336-62A37BF1554F",
    "DataProviderID": 1,
    "OperatorID": 3266,
    "UsageTypeID": 4,
    "AddressInfo": {
        "ID": 92550,
        "Title": "Danpower Heizzentrale",
        "AddressLine1": "Gabelsberger Straße 3",
        "Town": "Grimma",
        "StateOrProvince": "Landkreis Leipzig",
        "Postcode": "04668",
        "CountryID": 87,
        "Latitude": 51.22585,
        "Longitude": 12.720029999999952,
        "ContactTelephone1": "+49 331 23782-6464",
        "AccessComments": "24/7 nutzbar, Edeka, Lidl, Pizzieria, Schokomanufaktur in der Nähe.",
        "RelatedURL": "http://www.danpower-gruppe.de/home.html",
        "DistanceUnit": 0
    },
    "Connections": [
        {
            "ID": 130726,
            "ConnectionTypeID": 25,
            "StatusTypeID": 50,
            "LevelID": 2,
            "Amps": 32,
            "Voltage": 400,
            "PowerKW": 22,
            "CurrentTypeID": 20,
            "Quantity": 2
        }
    ],
    "NumberOfPoints": 2,
    "StatusTypeID": 50,
    "DateLastStatusUpdate": "2018-07-25T20:19:00Z",
    "DataQualityLevel": 1,
    "DateCreated": "2017-08-31T09:27:00Z",
    "SubmissionStatusTypeID": 200
}