{
    "UserComments": [
        {
            "ID": 17295,
            "ChargePointID": 46896,
            "CommentTypeID": 10,
            "UserName": "Robert Malcolm Kay",
            "Comment": "Balloch is not working again. ",
            "DateCreated": "2017-05-14T13:40:14.72Z",
            "User": {
                "ID": 4751,
                "Username": "Robert Malcolm Kay"
            },
            "CheckinStatusTypeID": 22
        },
        {
            "ID": 14391,
            "ChargePointID": 46896,
            "CommentTypeID": 50,
            "UserName": "jdsx",
            "Comment": "Couldn't use Chademo - handle appears to be broken.  Reported to CYC. They told me that someone had charged on Chademo the day before - maybe there's a knack to it but I couldn't get it to work...",
            "Rating": 1,
            "DateCreated": "2016-10-12T22:00:09.457Z",
            "User": {
                "ID": 6415,
                "Username": "jdsx"
            },
            "CheckinStatusTypeID": 25
        },
        {
            "ID": 11644,
            "ChargePointID": 46896,
            "CommentTypeID": 10,
            "UserName": "TheScotstounPele",
            "Comment": "Chademo and AC working well. Appears fully operational",
            "DateCreated": "2016-06-15T16:08:34.643Z",
            "User": {
                "ID": 6377,
                "Username": "TheScotstounPele"
            },
            "CheckinStatusTypeID": 10
        },
        {
            "ID": 11637,
            "ChargePointID": 46896,
            "CommentTypeID": 10,
            "UserName": "Anon74856763534",
            "Comment": "Dual charging with a Zoe.",
            "DateCreated": "2016-06-15T08:03:56.157Z",
            "User": {
                "ID": 1192,
                "Username": "Anon74856763534"
            },
            "CheckinStatusTypeID": 10
        },
        {
            "ID": 9667,
            "ChargePointID": 46896,
            "CommentTypeID": 10,
            "UserName": "desreid",
            "Comment": "Charged successfully with Chademo 2130 on Friday 5th Feb 2016 and 1830 Sunday 7th Feb 2016",
            "Rating": 5,
            "DateCreated": "2016-02-08T17:15:20.247Z",
            "User": {
                "ID": 2375,
                "Username": "desreid"
            },
            "CheckinStatusTypeID": 10
        },
        {
            "ID": 9557,
            "ChargePointID": 46896,
            "CommentTypeID": 10,
            "UserName": "Anon74856763534",
            "Comment": "",
            "DateCreated": "2016-01-22T11:51:45.507Z",
            "User": {
                "ID": 1192,
                "Username": "Anon74856763534"
            },
            "CheckinStatusTypeID": 10
        },
        {
            "ID": 8087,
            "ChargePointID": 46896,
            "CommentTypeID": 10,
            "UserName": "TheScotstounPele",
            "Comment": "Did not recognise my CYC card either.",
            "DateCreated": "2015-11-27T09:12:31.757Z",
            "User": {
                "ID": 6377,
                "Username": "TheScotstounPele"
            },
            "CheckinStatusTypeID": 200
        },
        {
            "ID": 8081,
            "ChargePointID": 46896,
            "CommentTypeID": 50,
            "UserName": "Robert Malcolm Kay",
            "Comment": "Chademo working fine but refused to accept my CYC card! Had to borrow one from another user to get a charge.",
            "Rating": 3,
            "DateCreated": "2015-11-26T11:02:45.267Z",
            "User": {
                "ID": 4751,
                "Username": "Robert Malcolm Kay"
            },
            "CheckinStatusTypeID": 200
        },
        {
            "ID": 6722,
            "ChargePointID": 46896,
            "CommentTypeID": 10,
            "UserName": "Bob",
            "Comment": "Busy charger. Excellent starting place for a trip to Argyllshire ",
            "Rating": 5,
            "DateCreated": "2015-10-07T22:16:12.187Z",
            "User": {
                "ID": 5013,
                "Username": "Bob"
            },
            "CheckinStatusTypeID": 10
        },
        {
            "ID": 6621,
            "ChargePointID": 46896,
            "CommentTypeID": 10,
            "UserName": "desreid",
            "Comment": "Charged successfully via DC Chademo both on Friday evening, 25th Sept 2015 and about midday on Sunday, 27th Sept 2015",
            "Rating": 5,
            "DateCreated": "2015-09-28T11:45:37.697Z",
            "User": {
                "ID": 2375,
                "Username": "desreid"
            },
            "CheckinStatusTypeID": 10
        },
        {
            "ID": 5982,
            "ChargePointID": 46896,
            "CommentTypeID": 10,
            "UserName": "Anon74856763534",
            "Comment": "",
            "DateCreated": "2015-07-19T18:18:38.637Z",
            "User": {
                "ID": 1192,
                "Username": "Anon74856763534"
            },
            "CheckinStatusTypeID": 10
        },
        {
            "ID": 5962,
            "ChargePointID": 46896,
            "CommentTypeID": 10,
            "UserName": "Anon74856763534",
            "Comment": "Balloch games today but marshall let us into car park!",
            "DateCreated": "2015-07-18T11:16:19.173Z",
            "User": {
                "ID": 1192,
                "Username": "Anon74856763534"
            },
            "CheckinStatusTypeID": 10
        },
        {
            "ID": 4729,
            "ChargePointID": 46896,
            "CommentTypeID": 10,
            "UserName": "Anon74856763534",
            "Comment": "",
            "DateCreated": "2015-06-20T13:43:24.237Z",
            "User": {
                "ID": 1192,
                "Username": "Anon74856763534"
            },
            "CheckinStatusTypeID": 10
        },
        {
            "ID": 4698,
            "ChargePointID": 46896,
            "CommentTypeID": 10,
            "UserName": "desreid",
            "Comment": "Charged a LEAF via DC, early evening Saturday 13th June 2015.",
            "Rating": 5,
            "DateCreated": "2015-06-14T22:41:23.907Z",
            "User": {
                "ID": 2375,
                "Username": "desreid"
            },
            "CheckinStatusTypeID": 10
        },
        {
            "ID": 4690,
            "ChargePointID": 46896,
            "CommentTypeID": 10,
            "UserName": "Simon Hewison",
            "Comment": "CYC report via twitter that this is working agin",
            "RelatedURL": "https://twitter.com/ChargeYourCar/status/609768217666547712",
            "DateCreated": "2015-06-13T21:32:55.997Z",
            "User": {
                "ID": 4575,
                "Username": "Simon Hewison"
            },
            "CheckinStatusTypeID": 0
        },
        {
            "ID": 4661,
            "ChargePointID": 46896,
            "CommentTypeID": 10,
            "UserName": "Anon74856763534",
            "Comment": "Engineer will be on-site within next 7 days to fix CHAdeMO charging.",
            "DateCreated": "2015-06-08T18:16:50.787Z",
            "User": {
                "ID": 1192,
                "Username": "Anon74856763534"
            },
            "CheckinStatusTypeID": 0
        },
        {
            "ID": 4478,
            "ChargePointID": 46896,
            "CommentTypeID": 1000,
            "UserName": "",
            "Comment": "Dc rapid not working ",
            "Rating": 4,
            "DateCreated": "2015-05-18T03:22:34.78Z",
            "CheckinStatusTypeID": 20
        },
        {
            "ID": 4401,
            "ChargePointID": 46896,
            "CommentTypeID": 10,
            "UserName": "Anon74856763534",
            "Comment": "Unable to start CHAdeMO charge but reported that AC side working.",
            "DateCreated": "2015-05-09T20:21:39.3Z",
            "User": {
                "ID": 1192,
                "Username": "Anon74856763534"
            },
            "CheckinStatusTypeID": 20
        }
    ],
    "MediaItems": [
        {
            "ID": 2854,
            "ChargePointID": 46896,
            "ItemURL": "https://s3-ap-southeast-2.amazonaws.com/openchargemap/images/GB/OCM46896/OCM-46896.orig.2015071918181296.jpg",
            "ItemThumbnailURL": "https://s3-ap-southeast-2.amazonaws.com/openchargemap/images/GB/OCM46896/OCM-46896.thmb.2015071918181296.jpg",
            "Comment": "Simultaneous AC/DC charging possible on the APT units.",
            "IsEnabled": true,
            "IsVideo": false,
            "IsFeaturedItem": false,
            "IsExternalResource": false,
            "User": {
                "ID": 1192,
                "Username": "Anon74856763534"
            },
            "DateCreated": "2015-07-19T18:19:00Z"
        },
        {
            "ID": 1343,
            "ChargePointID": 46896,
            "ItemURL": "https://s3-ap-southeast-2.amazonaws.com/openchargemap/images/GB/OCM46896/OCM-46896.orig.2015050920591686.jpg",
            "ItemThumbnailURL": "https://s3-ap-southeast-2.amazonaws.com/openchargemap/images/GB/OCM46896/OCM-46896.thmb.2015050920591686.jpg",
            "Comment": "",
            "IsEnabled": true,
            "IsVideo": false,
            "IsFeaturedItem": false,
            "IsExternalResource": false,
            "User": {
                "ID": 1192,
                "Username": "Anon74856763534"
            },
            "DateCreated": "2015-05-09T20:59:00Z"
        }
    ],
    "IsRecentlyVerified": false,
    "ID": 46896,
    "UUID": "8ED470CF-D931-45D8-9EB0-F4494A498DD7",
    "DataProviderID": 1,
    "OperatorID": 3315,
    "OperatorsReference": "51503",
    "UsageTypeID": 4,
    "UsageCost": "Free",
    "AddressInfo": {
        "ID": 47242,
        "Title": "Drymen Road Public Car Park",
        "AddressLine1": "Drymen Road",
        "Town": "Balloch",
        "StateOrProvince": "West Dunbartonshire",
        "Postcode": "G83 8HS",
        "CountryID": 1,
        "Latitude": 56.00427,
        "Longitude": -4.57623,
        "DistanceUnit": 0
    },
    "Connections": [
        {
            "ID": 57707,
            "ConnectionTypeID": 33,
            "StatusTypeID": 100,
            "LevelID": 3,
            "Amps": 120,
            "Voltage": 500,
            "PowerKW": 50,
            "CurrentTypeID": 30,
            "Quantity": 1
        },
        {
            "ID": 57708,
            "ConnectionTypeID": 2,
            "StatusTypeID": 50,
            "LevelID": 3,
            "Amps": 120,
            "Voltage": 500,
            "PowerKW": 50,
            "CurrentTypeID": 30,
            "Quantity": 1
        },
        {
            "ID": 57709,
            "ConnectionTypeID": 1036,
            "StatusTypeID": 50,
            "LevelID": 3,
            "Amps": 63,
            "Voltage": 400,
            "PowerKW": 43,
            "CurrentTypeID": 20,
            "Quantity": 1
        }
    ],
    "NumberOfPoints": 1,
    "GeneralComments": "RFID access only. APT tri rapid charger",
    "StatusTypeID": 50,
    "DateLastStatusUpdate": "2020-03-12T06:18:00Z",
    "DataQualityLevel": 1,
    "DateCreated": "2015-05-09T17:50:00Z",
    "SubmissionStatusTypeID": 200
}