{
    "IsRecentlyVerified": false,
    "ID": 173610,
    "UUID": "67F52759-36D2-4089-BEE7-6C4B67F0EBDF",
    "DataProviderID": 18,
    "DataProvidersReference": "3fdbfe846a9b58451c9a4803e77336a4",
    "OperatorID": 3345,
    "UsageTypeID": 5,
    "AddressInfo": {
        "ID": 173969,
        "Title": "N10 2LA",
        "AddressLine1": "",
        "Town": "Haringey",
        "Postcode": "N10 2LA",
        "CountryID": 1,
        "Latitude": 51.59477,
        "Longitude": -0.137686,
        "AccessComments": "",
        "RelatedURL": "https://char.gy",
        "DistanceUnit": 0
    },
    "Connections": [
        {
            "ID": 266695,
            "ConnectionTypeID": 25,
            "Reference": "315",
            "StatusTypeID": 50,
            "LevelID": 2,
            "Amps": 16,
            "Voltage": 230,
            "PowerKW": 3.7,
            "CurrentTypeID": 10
        }
    ],
    "StatusTypeID": 0,
    "DateLastStatusUpdate": "2021-03-03T11:25:00Z",
    "MetadataValues": [
        {
            "ID": 8532,
            "MetadataFieldID": 4,
            "ItemValue": "Contains public sector information licensed under the Open Government Licence v2.0. http://www.nationalarchives.gov.uk/doc/open-government-licence/version/2/"
        }
    ],
    "DataQualityLevel": 3,
    "DateCreated": "2021-03-03T11:25:00Z",
    "SubmissionStatusTypeID": 100
}