{
    "MediaItems": [
        {
            "ID": 23240,
            "ChargePointID": 161891,
            "ItemURL": "https://s3-ap-southeast-2.amazonaws.com/openchargemap/images/DE/OCM161891/OCM-161891.orig.2020072717530920.jpg",
            "ItemThumbnailURL": "https://s3-ap-southeast-2.amazonaws.com/openchargemap/images/DE/OCM161891/OCM-161891.thmb.2020072717530920.jpg",
            "Comment": "",
            "IsEnabled": true,
            "IsVideo": false,
            "IsFeaturedItem": false,
            "IsExternalResource": false,
            "User": {
                "ID": 21695,
                "Username": "et42"
            },
            "DateCreated": "2020-07-27T17:53:00Z"
        }
    ],
    "IsRecentlyVerified": false,
    "ID": 161891,
    "UUID": "BC2867AE-783B-4CB2-826B-7733CE2AC326",
    "DataProviderID": 1,
    "OperatorID": 3297,
    "UsageTypeID": 4,
    "AddressInfo": {
        "ID": 162248,
        "Title": "Marienhöhe",
        "AddressLine1": "Auf der Marienhöhe 12",
        "Town": "Darmstadt",
        "StateOrProvince": "Hesse",
        "Postcode": "64297",
        "CountryID": 87,
        "Latitude": 49.83844014328983,
        "Longitude": 8.656132232262848,
        "DistanceUnit": 0
    },
    "Connections": [
        {
            "ID": 232988,
            "ConnectionTypeID": 25,
            "StatusTypeID": 50,
            "LevelID": 2,
            "Amps": 32,
            "Voltage": 400,
            "PowerKW": 22,
            "CurrentTypeID": 20,
            "Quantity": 4
        }
    ],
    "NumberOfPoints": 4,
    "StatusTypeID": 50,
    "DateLastStatusUpdate": "2020-07-27T17:53:00Z",
    "DataQualityLevel": 1,
    "DateCreated": "2020-07-27T17:53:00Z",
    "SubmissionStatusTypeID": 200
}