{
    "IsRecentlyVerified": false,
    "ID": 97861,
    "UUID": "17899BE4-F1AC-463B-AB6F-64425361DEDE",
    "DataProviderID": 1,
    "OperatorID": 23,
    "OperatorsReference": "38770",
    "UsageTypeID": 4,
    "AddressInfo": {
        "ID": 98207,
        "Title": "Cafe Barbera Union",
        "AddressLine1": "Cafe Barbera Union",
        "Postcode": "44150",
        "CountryID": 146,
        "Latitude": 20.66585,
        "Longitude": -103.372982,
        "ContactTelephone1": "+52 333 334 2994",
        "DistanceUnit": 0
    },
    "Connections": [
        {
            "ID": 138769,
            "ConnectionTypeID": 30,
            "StatusTypeID": 50,
            "LevelID": 2,
            "PowerKW": 18,
            "CurrentTypeID": 20,
            "Quantity": 2
        }
    ],
    "NumberOfPoints": 2,
    "GeneralComments": "2 Tesla Connectors, up to 18kW.Available to the public. Self park.",
    "StatusTypeID": 50,
    "DateLastStatusUpdate": "2018-01-21T16:50:00Z",
    "DataQualityLevel": 1,
    "DateCreated": "2018-01-21T16:50:00Z",
    "SubmissionStatusTypeID": 200
}