{
    "IsRecentlyVerified": false,
    "ID": 185974,
    "UUID": "B0F5A781-5DCB-4CC3-B09D-61B34F478C76",
    "DataProviderID": 29,
    "DataProvidersReference": "19202",
    "OperatorID": 105,
    "AddressInfo": {
        "ID": 186333,
        "Title": "Europa-Allee 1",
        "AddressLine1": "Europa-Allee 1",
        "Town": "Föhren",
        "Postcode": "54343",
        "CountryID": 87,
        "Latitude": 49.8585597,
        "Longitude": 6.7851107,
        "DistanceUnit": 0
    },
    "Connections": [
        {
            "ID": 297361,
            "ConnectionTypeID": 25,
            "StatusTypeID": 50,
            "LevelID": 2,
            "PowerKW": 22,
            "CurrentTypeID": 20
        },
        {
            "ID": 297362,
            "ConnectionTypeID": 25,
            "StatusTypeID": 50,
            "LevelID": 2,
            "PowerKW": 22,
            "CurrentTypeID": 20
        }
    ],
    "StatusTypeID": 50,
    "DateLastStatusUpdate": "2021-07-12T02:44:00Z",
    "MetadataValues": [
        {
            "ID": 18216,
            "MetadataFieldID": 4,
            "ItemValue": "Data from the German chargepoint registry provided by Bundesnetzagentur.de under the CC-BY 4.0 license"
        }
    ],
    "DataQualityLevel": 3,
    "DateCreated": "2021-07-12T02:44:00Z",
    "SubmissionStatusTypeID": 100
}