{
    "IsRecentlyVerified": false,
    "ID": 43649,
    "UUID": "9FC8B757-B530-4657-8523-DF3BFB23C343",
    "DataProviderID": 1,
    "OperatorID": 32,
    "OperatorsReference": "1654",
    "UsageTypeID": 4,
    "UsageCost": "Inclusive; for Polar Plus subscription members only",
    "AddressInfo": {
        "ID": 43995,
        "Title": "Lancaster Toyota Cambridge",
        "AddressLine1": "1 Norman Way",
        "Town": "Cambridge",
        "StateOrProvince": "Cambridgeshire",
        "Postcode": "CB1 3LN",
        "CountryID": 1,
        "Latitude": 52.195929167792,
        "Longitude": 0.1696990057826,
        "ContactTelephone1": "+44 1223 964638",
        "RelatedURL": "https://lancastercambridge.toyota.co.uk/",
        "DistanceUnit": 0
    },
    "Connections": [
        {
            "ID": 52954,
            "ConnectionTypeID": 25,
            "StatusTypeID": 50,
            "LevelID": 2,
            "Amps": 16,
            "Voltage": 230,
            "PowerKW": 4,
            "CurrentTypeID": 10,
            "Quantity": 2
        }
    ],
    "NumberOfPoints": 2,
    "GeneralComments": "Chargemaster post 1654. Formerly on Source East",
    "StatusTypeID": 50,
    "DateLastStatusUpdate": "2019-03-08T06:29:00Z",
    "DataQualityLevel": 1,
    "DateCreated": "2015-04-08T23:05:00Z",
    "SubmissionStatusTypeID": 200
}