{
    "UserComments": [
        {
            "ID": 17383,
            "ChargePointID": 88483,
            "CommentTypeID": 10,
            "UserName": "Erna_Schleck",
            "Comment": "Mit New Motion Ladekarte",
            "Rating": 5,
            "DateCreated": "2017-06-08T11:46:19.48Z",
            "User": {
                "ID": 4573,
                "Username": "Erna_Schleck"
            },
            "CheckinStatusTypeID": 10
        }
    ],
    "MediaItems": [
        {
            "ID": 12809,
            "ChargePointID": 88483,
            "ItemURL": "https://s3-ap-southeast-2.amazonaws.com/openchargemap/images/DE/OCM88483/OCM-88483.orig.2017060811450700.jpg",
            "ItemThumbnailURL": "https://s3-ap-southeast-2.amazonaws.com/openchargemap/images/DE/OCM88483/OCM-88483.thmb.2017060811450700.jpg",
            "Comment": "",
            "IsEnabled": true,
            "IsVideo": false,
            "IsFeaturedItem": false,
            "IsExternalResource": false,
            "User": {
                "ID": 4573,
                "Username": "Erna_Schleck"
            },
            "DateCreated": "2017-06-08T11:45:00Z"
        },
        {
            "ID": 12808,
            "ChargePointID": 88483,
            "ItemURL": "https://s3-ap-southeast-2.amazonaws.com/openchargemap/images/DE/OCM88483/OCM-88483.orig.2017060811431758.jpg",
            "ItemThumbnailURL": "https://s3-ap-southeast-2.amazonaws.com/openchargemap/images/DE/OCM88483/OCM-88483.thmb.2017060811431758.jpg",
            "Comment": "",
            "IsEnabled": true,
            "IsVideo": false,
            "IsFeaturedItem": false,
            "IsExternalResource": false,
            "User": {
                "ID": 4573,
                "Username": "Erna_Schleck"
            },
            "DateCreated": "2017-06-08T11:43:00Z"
        }
    ],
    "IsRecentlyVerified": false,
    "ID": 88483,
    "UUID": "BCA453F2-5FF3-48A8-B169-D5A83690C7D8",
    "DataProviderID": 1,
    "OperatorID": 156,
    "UsageTypeID": 4,
    "AddressInfo": {
        "ID": 88829,
        "Title": "G. Liedtke GmbH",
        "AddressLine1": "Daimlerring 6",
        "Town": "Hildesheim",
        "StateOrProvince": "Landkreis Hildesheim",
        "Postcode": "31135",
        "CountryID": 87,
        "Latitude": 52.1634630384498,
        "Longitude": 9.98866579755325,
        "ContactTelephone1": "+49 5121 280580",
        "ContactEmail": "kontakt@liedtke-shk.de",
        "AccessComments": "Lolo Box auf Pfahl am Parkplatz, der direkt am Fußweg liegt. Von der Straße aus gut erkennbar kurz vor/hinter der Kurve. 24/7 Zugang mit New Motion oder PlugSurfing App/ Keyhanger. Kein reservierter Parkplatz; Firmenfahrzeuge parken dort auch. Platz ist jedenfalls genug. Laden ist für Besucher kostenlos.",
        "RelatedURL": "http://www.liedtke-shk.de/",
        "DistanceUnit": 0
    },
    "Connections": [
        {
            "ID": 125508,
            "ConnectionTypeID": 25,
            "StatusTypeID": 50,
            "LevelID": 2,
            "Amps": 16,
            "Voltage": 400,
            "PowerKW": 11,
            "CurrentTypeID": 20,
            "Quantity": 1
        }
    ],
    "NumberOfPoints": 1,
    "StatusTypeID": 50,
    "DateLastStatusUpdate": "2017-07-17T07:15:00Z",
    "DataQualityLevel": 1,
    "DateCreated": "2017-05-31T07:07:00Z",
    "SubmissionStatusTypeID": 200
}