{
    "IsRecentlyVerified": false,
    "ID": 8365,
    "UUID": "601BB38B-18EC-4C73-AA0D-4C9F0AFA5CA1",
    "DataProviderID": 15,
    "DataProvidersReference": "7224",
    "OperatorID": 26,
    "AddressInfo": {
        "ID": 8262,
        "Title": "721 N Jackson Rd",
        "AddressLine1": "721 N Jackson Rd",
        "Town": "McAllen",
        "StateOrProvince": "TX",
        "Postcode": "78501",
        "CountryID": 2,
        "Latitude": 26.20689,
        "Longitude": -98.20403,
        "ContactTelephone1": " (956) 631-6666",
        "RelatedURL": "http://carstations.com/7224",
        "DistanceUnit": 0
    },
    "Connections": [
        {
            "ID": 5793,
            "ConnectionTypeID": 1,
            "Reference": "J1772",
            "LevelID": 2
        }
    ],
    "StatusTypeID": 0,
    "DateLastStatusUpdate": "2017-11-04T14:03:00Z",
    "DataQualityLevel": 1,
    "DateCreated": "2011-11-11T12:06:00Z",
    "SubmissionStatusTypeID": 100
}