{
    "IsRecentlyVerified": false,
    "ID": 170687,
    "UUID": "4D981B6E-BC8D-455D-A537-A69C2D73FCEF",
    "DataProviderID": 1,
    "OperatorID": 3,
    "OperatorsReference": "PG-80775,PG-80783",
    "UsageTypeID": 4,
    "UsageCost": "Free",
    "AddressInfo": {
        "ID": 171046,
        "Title": "Heathrow Airport T5",
        "AddressLine1": "(level 2 Car Park) London Heathrow Airport",
        "Town": "Hounslow",
        "StateOrProvince": "Middlesex",
        "Postcode": "TW6 2GA",
        "CountryID": 1,
        "Latitude": 51.470583,
        "Longitude": -0.489744,
        "DistanceUnit": 0
    },
    "Connections": [
        {
            "ID": 260672,
            "ConnectionTypeID": 25,
            "StatusTypeID": 50,
            "LevelID": 2,
            "Amps": 32,
            "Voltage": 230,
            "PowerKW": 7,
            "CurrentTypeID": 10,
            "Quantity": 4
        }
    ],
    "NumberOfPoints": 4,
    "GeneralComments": "This unit is located in Heathrow Airport Terminal 5.",
    "StatusTypeID": 50,
    "DateLastStatusUpdate": "2020-12-05T10:45:00Z",
    "DataQualityLevel": 1,
    "DateCreated": "2020-12-05T10:33:00Z",
    "SubmissionStatusTypeID": 200
}