{
    "IsRecentlyVerified": false,
    "ID": 143837,
    "UUID": "43DCB260-739C-415D-8EA6-9430A2031105",
    "DataProviderID": 2,
    "DataProvidersReference": "147884",
    "OperatorID": 39,
    "UsageTypeID": 1,
    "AddressInfo": {
        "ID": 144189,
        "Title": "Hannaford Williston",
        "AddressLine1": "78 Marshall Avenue",
        "Town": "Williston",
        "StateOrProvince": "VT",
        "Postcode": "05495",
        "CountryID": 2,
        "Latitude": 44.4459288,
        "Longitude": -73.1136314,
        "ContactTelephone1": "800-663-5633",
        "AccessComments": "MO: Not Specified; TU: Not Specified; WE: Not Specified; TH: Not Specified; FR: Not Specified; SA: Not Specified; SU: Not Specified",
        "RelatedURL": "http://www.semacharge.com/",
        "DistanceUnit": 0
    },
    "Connections": [
        {
            "ID": 200244,
            "ConnectionTypeID": 1,
            "LevelID": 2,
            "Amps": 16,
            "Voltage": 230,
            "PowerKW": 3.7,
            "CurrentTypeID": 10,
            "Quantity": 1
        }
    ],
    "StatusTypeID": 50,
    "DateLastStatusUpdate": "2020-06-26T03:08:00Z",
    "DataQualityLevel": 3,
    "DateCreated": "2019-12-24T09:22:00Z",
    "SubmissionStatusTypeID": 100
}