{
    "IsRecentlyVerified": false,
    "ID": 63104,
    "UUID": "E7A702D1-3543-4D91-B7B7-13E458D45543",
    "DataProviderID": 26,
    "DataProvidersReference": "78338",
    "OperatorID": 73,
    "OperatorsReference": "EV-Box EVB-P1548048",
    "UsageCost": "0.00 jaarabonnement",
    "AddressInfo": {
        "ID": 63450,
        "Title": "Moeraskreek 13",
        "AddressLine1": "Moeraskreek 13",
        "Town": "Nissewaard",
        "Postcode": "3206 GE",
        "CountryID": 159,
        "Latitude": 51.82525,
        "Longitude": 4.33184,
        "RelatedURL": "http://www.ev-box.nl",
        "DistanceUnit": 0
    },
    "Connections": [
        {
            "ID": 80240,
            "ConnectionTypeID": 25,
            "LevelID": 2,
            "PowerKW": 11,
            "CurrentTypeID": 10
        },
        {
            "ID": 80241,
            "ConnectionTypeID": 25,
            "LevelID": 2,
            "PowerKW": 11,
            "CurrentTypeID": 10
        }
    ],
    "NumberOfPoints": 1,
    "StatusTypeID": 50,
    "DateLastStatusUpdate": "2016-06-04T02:40:00Z",
    "DataQualityLevel": 3,
    "DateCreated": "2016-03-03T12:29:00Z",
    "SubmissionStatusTypeID": 100
}