{
    "IsRecentlyVerified": false,
    "ID": 57062,
    "UUID": "3C81DF8A-B1F1-4DF1-80A3-689AC6942BCB",
    "DataProviderID": 1,
    "OperatorID": 45,
    "UsageTypeID": 3,
    "AddressInfo": {
        "ID": 57408,
        "Title": "McDonald's",
        "AddressLine1": "Wasserburger Landstraße  52",
        "AddressLine2": "Bezirksteil Waldtrudering",
        "Town": "München",
        "StateOrProvince": "Bayern",
        "Postcode": "81825",
        "CountryID": 87,
        "Latitude": 48.11904,
        "Longitude": 11.67737,
        "AccessComments": "Geöffnet Mo-Sa 07:00 -2:00 (Fr+Sa - 5Uhr). Freischaltung im Restaurant.",
        "RelatedURL": "http://www.mcdonalds.de",
        "DistanceUnit": 0
    },
    "Connections": [
        {
            "ID": 72087,
            "ConnectionTypeID": 17,
            "StatusTypeID": 50,
            "LevelID": 2,
            "Amps": 32,
            "Voltage": 400,
            "PowerKW": 22,
            "CurrentTypeID": 20,
            "Quantity": 1
        },
        {
            "ID": 72088,
            "ConnectionTypeID": 28,
            "StatusTypeID": 50,
            "LevelID": 2,
            "Amps": 16,
            "Voltage": 230,
            "PowerKW": 3.7,
            "CurrentTypeID": 10,
            "Quantity": 1
        }
    ],
    "NumberOfPoints": 2,
    "GeneralComments": "Säule durch Vandalismus zerstört.",
    "StatusTypeID": 30,
    "DateLastStatusUpdate": "2015-11-21T20:39:00Z",
    "DataQualityLevel": 1,
    "DateCreated": "2015-11-21T20:32:00Z",
    "SubmissionStatusTypeID": 200
}