{
    "IsRecentlyVerified": false,
    "ID": 102891,
    "UUID": "4607F64F-DA4B-408C-9EB9-F52C9AD38F0F",
    "DataProviderID": 2,
    "DataProvidersReference": "73383",
    "UsageTypeID": 2,
    "AddressInfo": {
        "ID": 103237,
        "Title": "ComEd",
        "AddressLine1": "1948 S Briggs St",
        "Town": "Joliet",
        "StateOrProvince": "IL",
        "Postcode": "60433",
        "CountryID": 2,
        "Latitude": 41.491716,
        "Longitude": -88.038121,
        "ContactTelephone1": "",
        "AccessComments": "Employee use only",
        "RelatedURL": "",
        "DistanceUnit": 0
    },
    "Connections": [
        {
            "ID": 145036,
            "ConnectionTypeID": 1,
            "LevelID": 2,
            "Amps": 16,
            "Voltage": 230,
            "PowerKW": 3.7,
            "CurrentTypeID": 10,
            "Quantity": 2
        }
    ],
    "DateLastStatusUpdate": "2020-06-26T03:04:00Z",
    "DataQualityLevel": 3,
    "DateCreated": "2018-04-21T04:13:00Z",
    "SubmissionStatusTypeID": 100
}