{
    "IsRecentlyVerified": false,
    "ID": 23324,
    "UUID": "47E6A575-16FB-46E2-9D33-D6EF8B08310E",
    "DataProviderID": 1,
    "OperatorID": 51,
    "UsageTypeID": 1,
    "UsageCost": "Free",
    "AddressInfo": {
        "ID": 23669,
        "Title": "Ramada Plaza Calgary Airport",
        "AddressLine1": "3515 26 Street NE",
        "Town": "Calgary",
        "StateOrProvince": "Alberta",
        "Postcode": " T1Y 7E3",
        "CountryID": 44,
        "Latitude": 51.0829770461197,
        "Longitude": -113.998260669603,
        "ContactTelephone1": "(403) 250-8855",
        "AccessComments": "Located immediately to the left of the main South entrance",
        "DistanceUnit": 0
    },
    "Connections": [
        {
            "ID": 25201,
            "ConnectionTypeID": 1,
            "StatusTypeID": 50,
            "LevelID": 2,
            "Amps": 72,
            "Voltage": 240,
            "PowerKW": 17.2,
            "Quantity": 1
        }
    ],
    "NumberOfPoints": 1,
    "StatusTypeID": 50,
    "DateLastStatusUpdate": "2014-05-21T18:58:00Z",
    "DataQualityLevel": 1,
    "DateCreated": "2014-05-21T03:57:00Z",
    "SubmissionStatusTypeID": 200
}