{
    "IsRecentlyVerified": false,
    "ID": 180307,
    "UUID": "E12C2575-9812-4150-A5D4-4A025E920B73",
    "DataProviderID": 29,
    "DataProvidersReference": "15915",
    "OperatorID": 69,
    "AddressInfo": {
        "ID": 180666,
        "Title": "Widenmayerstr. 14",
        "AddressLine1": "Widenmayerstr. 14",
        "Town": "München",
        "Postcode": "80538",
        "CountryID": 87,
        "Latitude": 48.140071,
        "Longitude": 11.593543,
        "DistanceUnit": 0
    },
    "Connections": [
        {
            "ID": 283211,
            "ConnectionTypeID": 25,
            "StatusTypeID": 50,
            "LevelID": 2,
            "PowerKW": 22,
            "CurrentTypeID": 20
        },
        {
            "ID": 283212,
            "ConnectionTypeID": 25,
            "StatusTypeID": 50,
            "LevelID": 2,
            "PowerKW": 22,
            "CurrentTypeID": 20
        }
    ],
    "StatusTypeID": 50,
    "DateLastStatusUpdate": "2021-07-12T02:40:00Z",
    "MetadataValues": [
        {
            "ID": 12601,
            "MetadataFieldID": 4,
            "ItemValue": "Data from the German chargepoint registry provided by Bundesnetzagentur.de under the CC-BY 4.0 license"
        }
    ],
    "DataQualityLevel": 3,
    "DateCreated": "2021-07-08T10:00:00Z",
    "SubmissionStatusTypeID": 100
}