{
    "IsRecentlyVerified": false,
    "ID": 81833,
    "UUID": "DD8EF499-F5CC-4AFE-97D4-5A9541C1229A",
    "DataProviderID": 1,
    "OperatorID": 23,
    "OperatorsReference": "20117",
    "UsageTypeID": 6,
    "AddressInfo": {
        "ID": 82179,
        "Title": "Braunwald Standseilbahn",
        "AddressLine1": "2 Stachelbergstraße",
        "Town": "Linthal",
        "Postcode": "8783",
        "CountryID": 217,
        "Latitude": 46.92821,
        "Longitude": 9.001811,
        "ContactTelephone1": "+41 55 653 50 30",
        "DistanceUnit": 0
    },
    "Connections": [
        {
            "ID": 116591,
            "ConnectionTypeID": 30,
            "StatusTypeID": 50,
            "LevelID": 2,
            "Amps": 32,
            "Voltage": 400,
            "PowerKW": 22,
            "CurrentTypeID": 20,
            "Quantity": 3
        }
    ],
    "NumberOfPoints": 3,
    "GeneralComments": "3 Tesla Connectors, up to 22kW.Available for patrons only. Self park.",
    "StatusTypeID": 50,
    "DateLastStatusUpdate": "2018-10-03T19:43:00Z",
    "DataQualityLevel": 1,
    "DateCreated": "2017-02-03T13:05:00Z",
    "SubmissionStatusTypeID": 200
}