{
    "IsRecentlyVerified": false,
    "ID": 177072,
    "UUID": "D49EA2E3-8E0A-4DB2-81B5-7177BE5250C9",
    "DataProviderID": 29,
    "DataProvidersReference": "18705",
    "AddressInfo": {
        "ID": 177431,
        "Title": "Aschaffstr. 1",
        "AddressLine1": "Aschaffstr. 1",
        "Town": "Goldbach",
        "Postcode": "63773",
        "CountryID": 87,
        "Latitude": 49.999584,
        "Longitude": 9.192161,
        "DistanceUnit": 0
    },
    "Connections": [
        {
            "ID": 275782,
            "ConnectionTypeID": 25,
            "StatusTypeID": 50,
            "LevelID": 2,
            "PowerKW": 22,
            "CurrentTypeID": 20
        },
        {
            "ID": 275783,
            "ConnectionTypeID": 25,
            "StatusTypeID": 50,
            "LevelID": 2,
            "PowerKW": 22,
            "CurrentTypeID": 20
        }
    ],
    "StatusTypeID": 0,
    "DateLastStatusUpdate": "2021-07-12T02:44:00Z",
    "MetadataValues": [
        {
            "ID": 9366,
            "MetadataFieldID": 4,
            "ItemValue": "Data from the German chargepoint registry provided by Bundesnetzagentur.de under the CC-BY 4.0 license"
        }
    ],
    "DataQualityLevel": 3,
    "DateCreated": "2021-07-08T09:48:00Z",
    "SubmissionStatusTypeID": 100
}