{
    "IsRecentlyVerified": false,
    "ID": 136337,
    "UUID": "DE6B3FE9-BA4B-41B9-B694-EB3C69135173",
    "DataProviderID": 18,
    "DataProvidersReference": "9d10c28049b6c34215fcfc5d98dffd52",
    "OperatorID": 2244,
    "UsageTypeID": 4,
    "AddressInfo": {
        "ID": 136683,
        "Title": "Maida Avenue",
        "AddressLine1": "Maida Avenue",
        "Town": "London",
        "Postcode": "W2 1TF",
        "CountryID": 1,
        "Latitude": 51.524229,
        "Longitude": -0.177251,
        "AccessComments": "",
        "RelatedURL": "https://www.ubitricity.com",
        "DistanceUnit": 0
    },
    "Connections": [
        {
            "ID": 190777,
            "ConnectionTypeID": 25,
            "Reference": "suby1100000033",
            "StatusTypeID": 50,
            "LevelID": 2,
            "Amps": 16,
            "Voltage": 230,
            "PowerKW": 3.7,
            "CurrentTypeID": 10
        }
    ],
    "StatusTypeID": 0,
    "DateLastStatusUpdate": "2021-04-25T05:46:00Z",
    "MetadataValues": [
        {
            "ID": 6189,
            "MetadataFieldID": 4,
            "ItemValue": "Contains public sector information licensed under the Open Government Licence v2.0. http://www.nationalarchives.gov.uk/doc/open-government-licence/version/2/"
        }
    ],
    "DataQualityLevel": 3,
    "DateCreated": "2019-12-24T05:22:00Z",
    "SubmissionStatusTypeID": 100
}