{
    "UserComments": [
        {
            "ID": 10307,
            "ChargePointID": 51588,
            "CommentTypeID": 10,
            "UserName": "stickybit",
            "Comment": "",
            "Rating": 5,
            "DateCreated": "2016-05-05T15:03:50.017Z",
            "User": {
                "ID": 6738,
                "Username": "stickybit"
            },
            "CheckinStatusTypeID": 10
        }
    ],
    "MediaItems": [
        {
            "ID": 24048,
            "ChargePointID": 51588,
            "ItemURL": "https://s3-ap-southeast-2.amazonaws.com/openchargemap/images/IT/OCM51588/OCM-51588.orig.2020080819341040.jpg",
            "ItemThumbnailURL": "https://s3-ap-southeast-2.amazonaws.com/openchargemap/images/IT/OCM51588/OCM-51588.thmb.2020080819341040.jpg",
            "Comment": "",
            "IsEnabled": true,
            "IsVideo": false,
            "IsFeaturedItem": false,
            "IsExternalResource": false,
            "User": {
                "ID": 26399,
                "Username": "Mitch"
            },
            "DateCreated": "2020-08-08T19:34:00Z"
        },
        {
            "ID": 6356,
            "ChargePointID": 51588,
            "ItemURL": "https://s3-ap-southeast-2.amazonaws.com/openchargemap/images/IT/OCM51588/OCM-51588.orig.2016050515044972.jpeg",
            "ItemThumbnailURL": "https://s3-ap-southeast-2.amazonaws.com/openchargemap/images/IT/OCM51588/OCM-51588.thmb.2016050515044972.jpeg",
            "Comment": "Snow Tesla Supercharging in Tuscany!",
            "IsEnabled": true,
            "IsVideo": false,
            "IsFeaturedItem": false,
            "IsExternalResource": false,
            "User": {
                "ID": 6738,
                "Username": "stickybit"
            },
            "DateCreated": "2016-05-05T15:05:00Z"
        }
    ],
    "IsRecentlyVerified": false,
    "ID": 51588,
    "UUID": "3C355E6C-3406-4156-A2D5-EC01411D8675",
    "DataProviderID": 1,
    "OperatorID": 23,
    "OperatorsReference": "9564",
    "UsageTypeID": 4,
    "UsageCost": "€0.30/kWh; altre tariffe per le auto più vecchie",
    "AddressInfo": {
        "ID": 51934,
        "Title": "Arezzo Supercharger",
        "AddressLine1": "Raccordo Arezzo-Battifolle",
        "AddressLine2": "c/o Arezzo Park Hotel",
        "Town": "Arezzo",
        "StateOrProvince": "AR",
        "Postcode": "52100",
        "CountryID": 112,
        "Latitude": 43.4366070154136,
        "Longitude": 11.7784982268845,
        "RelatedURL": "http://www.teslamotors.com/",
        "DistanceUnit": 0
    },
    "Connections": [
        {
            "ID": 63973,
            "ConnectionTypeID": 27,
            "StatusTypeID": 50,
            "LevelID": 3,
            "Amps": 300,
            "Voltage": 400,
            "PowerKW": 120,
            "CurrentTypeID": 30,
            "Quantity": 8
        }
    ],
    "NumberOfPoints": 8,
    "StatusTypeID": 50,
    "DateLastStatusUpdate": "2020-08-08T19:34:00Z",
    "DataQualityLevel": 1,
    "DateCreated": "2015-08-01T15:38:00Z",
    "SubmissionStatusTypeID": 200
}