{
    "IsRecentlyVerified": false,
    "ID": 184470,
    "UUID": "E8EA0E51-61CC-4957-BEAD-C04CF3C0DF4F",
    "DataProviderID": 29,
    "DataProvidersReference": "20314",
    "OperatorID": 105,
    "AddressInfo": {
        "ID": 184829,
        "Title": "Zur Eibe 12",
        "AddressLine1": "Zur Eibe 12",
        "Town": "Essen",
        "Postcode": "45149",
        "CountryID": 87,
        "Latitude": 51.433328,
        "Longitude": 6.972235,
        "DistanceUnit": 0
    },
    "Connections": [
        {
            "ID": 292798,
            "ConnectionTypeID": 25,
            "StatusTypeID": 50,
            "LevelID": 2,
            "PowerKW": 22,
            "CurrentTypeID": 20
        },
        {
            "ID": 292799,
            "ConnectionTypeID": 25,
            "StatusTypeID": 50,
            "LevelID": 2,
            "PowerKW": 22,
            "CurrentTypeID": 20
        },
        {
            "ID": 292800,
            "ConnectionTypeID": 33,
            "StatusTypeID": 50,
            "LevelID": 3,
            "PowerKW": 43,
            "CurrentTypeID": 30
        }
    ],
    "StatusTypeID": 50,
    "DateLastStatusUpdate": "2021-07-12T02:47:00Z",
    "MetadataValues": [
        {
            "ID": 16761,
            "MetadataFieldID": 4,
            "ItemValue": "Data from the German chargepoint registry provided by Bundesnetzagentur.de under the CC-BY 4.0 license"
        }
    ],
    "DataQualityLevel": 3,
    "DateCreated": "2021-07-08T10:05:00Z",
    "SubmissionStatusTypeID": 100
}