{
    "IsRecentlyVerified": false,
    "ID": 3395,
    "UUID": "95EBE0DA-6E41-48DA-A5A2-632ED44B4B84",
    "DataProviderID": 1,
    "OperatorID": 1,
    "AddressInfo": {
        "ID": 3396,
        "Title": "Andrews Rancho Shopping Center",
        "AddressLine1": "7075 Firestone Blvd",
        "Town": "Downey",
        "StateOrProvince": "CA",
        "Postcode": "90240",
        "CountryID": 2,
        "Latitude": 33.9482,
        "Longitude": -118.156,
        "DistanceUnit": 0
    },
    "Connections": [],
    "NumberOfPoints": 2,
    "GeneralComments": "Cost To Charge: Free Access Hours: 24 hr",
    "DateLastStatusUpdate": "2019-12-15T06:07:00Z",
    "DateCreated": "2010-02-28T00:00:00Z",
    "SubmissionStatusTypeID": 200
}