{
    "IsRecentlyVerified": false,
    "ID": 67960,
    "UUID": "70093699-DB24-4602-BE21-DDD58A5099E6",
    "DataProviderID": 26,
    "DataProvidersReference": "93489",
    "OperatorID": 103,
    "OperatorsReference": "Allego NLALLEGO0013151",
    "UsageCost": "0.00 jaarabonnement",
    "AddressInfo": {
        "ID": 68306,
        "Title": "Roosstraat 6",
        "AddressLine1": "Roosstraat 6",
        "Town": "Zwijndrecht",
        "Postcode": "3333 SL",
        "CountryID": 159,
        "Latitude": 51.81280831,
        "Longitude": 4.63014759,
        "ContactTelephone1": "0800-3745337",
        "RelatedURL": "http://www.allego.eu/",
        "DistanceUnit": 0
    },
    "Connections": [
        {
            "ID": 94593,
            "ConnectionTypeID": 25,
            "LevelID": 2,
            "PowerKW": 11,
            "CurrentTypeID": 10
        },
        {
            "ID": 94594,
            "ConnectionTypeID": 25,
            "LevelID": 2,
            "PowerKW": 11,
            "CurrentTypeID": 10
        }
    ],
    "NumberOfPoints": 1,
    "StatusTypeID": 50,
    "DateLastStatusUpdate": "2016-06-04T02:37:00Z",
    "DataQualityLevel": 3,
    "DateCreated": "2016-06-04T02:37:00Z",
    "SubmissionStatusTypeID": 100
}