{
    "IsRecentlyVerified": false,
    "ID": 38085,
    "UUID": "DCC87BB6-316D-4DE2-9A12-1C9BFC18E49A",
    "DataProviderID": 1,
    "OperatorID": 105,
    "OperatorsReference": "Essent EM-DE-11000000-17-00010",
    "UsageTypeID": 4,
    "AddressInfo": {
        "ID": 38431,
        "Title": "Johannisthaler Chaussee 300",
        "AddressLine1": "Johannisthaler Chaussee 300",
        "Town": "Berlin",
        "Postcode": "12351",
        "CountryID": 87,
        "Latitude": 52.430558,
        "Longitude": 13.455741,
        "DistanceUnit": 0
    },
    "Connections": [
        {
            "ID": 41596,
            "ConnectionTypeID": 25,
            "LevelID": 2,
            "PowerKW": 11
        },
        {
            "ID": 49468,
            "ConnectionTypeID": 25,
            "LevelID": 2,
            "PowerKW": 11
        }
    ],
    "NumberOfPoints": 1,
    "StatusTypeID": 50,
    "DateLastStatusUpdate": "2015-04-12T20:44:00Z",
    "DataQualityLevel": 3,
    "DateCreated": "2015-01-09T06:07:00Z",
    "SubmissionStatusTypeID": 200
}