{
    "IsRecentlyVerified": false,
    "ID": 28853,
    "UUID": "1FB0E84C-DDD2-4D94-A71D-506A521E3F05",
    "DataProviderID": 2,
    "DataProvidersReference": "55674",
    "OperatorID": 5,
    "UsageTypeID": 1,
    "AddressInfo": {
        "ID": 29199,
        "Title": "STATION 800",
        "AddressLine1": "800 Technology Sq.",
        "Town": "Cambridge",
        "StateOrProvince": "MA",
        "Postcode": "02139",
        "CountryID": 2,
        "Latitude": 42.365148,
        "Longitude": -71.091792,
        "ContactTelephone1": "888-758-4389",
        "AccessComments": "24 hours daily",
        "RelatedURL": "http://www.chargepoint.com/",
        "DistanceUnit": 0
    },
    "Connections": [
        {
            "ID": 31702,
            "ConnectionTypeID": 1,
            "LevelID": 2,
            "Amps": 16,
            "Voltage": 230,
            "PowerKW": 3.7,
            "CurrentTypeID": 10,
            "Quantity": 8
        }
    ],
    "DateLastStatusUpdate": "2020-06-26T03:05:00Z",
    "DataQualityLevel": 3,
    "DateCreated": "2014-11-28T03:38:00Z",
    "SubmissionStatusTypeID": 100
}