{
    "IsRecentlyVerified": false,
    "ID": 102571,
    "UUID": "540B4C34-A388-4900-99D8-458DAE219195",
    "DataProviderID": 2,
    "DataProvidersReference": "91904",
    "UsageTypeID": 1,
    "AddressInfo": {
        "ID": 102917,
        "Title": "Ingles Market",
        "AddressLine1": "499 Weaverville Rd",
        "Town": "Asheville",
        "StateOrProvince": "NC",
        "Postcode": "28804",
        "CountryID": 2,
        "Latitude": 35.672325,
        "Longitude": -82.581169,
        "ContactTelephone1": "828-645-4521",
        "AccessComments": "24 hours daily",
        "RelatedURL": "",
        "DistanceUnit": 0
    },
    "Connections": [
        {
            "ID": 144659,
            "ConnectionTypeID": 1,
            "LevelID": 2,
            "Amps": 16,
            "Voltage": 230,
            "PowerKW": 3,
            "CurrentTypeID": 10,
            "Quantity": 2
        }
    ],
    "DateLastStatusUpdate": "2019-04-06T04:02:00Z",
    "DataQualityLevel": 3,
    "DateCreated": "2018-04-21T04:13:00Z",
    "SubmissionStatusTypeID": 100
}