{
    "UserComments": [
        {
            "ID": 17929,
            "ChargePointID": 73570,
            "CommentTypeID": 10,
            "UserName": "normandchoinier",
            "Comment": "Les 2 bornes sont fonctionnelles au 14 novembre 2017. ",
            "Rating": 4,
            "DateCreated": "2017-11-15T14:40:34.6Z",
            "User": {
                "ID": 16262,
                "Username": "normandchoinier"
            },
            "CheckinStatusTypeID": 10
        }
    ],
    "IsRecentlyVerified": false,
    "ID": 73570,
    "UUID": "2A17801B-5741-410D-B66F-02F5276AD1E6",
    "DataProviderID": 1,
    "OperatorID": 89,
    "OperatorsReference": "CEA-10140",
    "UsageTypeID": 4,
    "UsageCost": "CAD 1.00/hour",
    "AddressInfo": {
        "ID": 73916,
        "Title": "Sur Rue-Ville-Marie-Rue St-Laurent",
        "AddressLine1": "1430 rue Saint-Laurent",
        "Town": "Montréal",
        "StateOrProvince": "QC",
        "Postcode": "H2X 2S7",
        "CountryID": 44,
        "Latitude": 45.510413,
        "Longitude": -73.565081,
        "DistanceUnit": 0
    },
    "Connections": [
        {
            "ID": 105858,
            "ConnectionTypeID": 1,
            "StatusTypeID": 50,
            "LevelID": 2,
            "Amps": 32,
            "Voltage": 230,
            "PowerKW": 7,
            "CurrentTypeID": 10,
            "Quantity": 1
        }
    ],
    "NumberOfPoints": 1,
    "StatusTypeID": 50,
    "DateLastStatusUpdate": "2017-11-15T14:41:00Z",
    "DataQualityLevel": 1,
    "DateCreated": "2016-11-23T22:16:00Z",
    "SubmissionStatusTypeID": 200
}