{
    "IsRecentlyVerified": false,
    "ID": 27572,
    "UUID": "16935AB6-784C-4517-80C8-9E55723210F9",
    "DataProviderID": 2,
    "DataProvidersReference": "51247",
    "OperatorID": 5,
    "UsageTypeID": 1,
    "AddressInfo": {
        "ID": 27918,
        "Title": "ALAMEDA",
        "AddressLine1": "2500 Fairmont Dr",
        "Town": "San Leandro",
        "StateOrProvince": "CA",
        "Postcode": "94578",
        "CountryID": 2,
        "Latitude": 37.712737,
        "Longitude": -122.111785,
        "ContactTelephone1": "888-758-4389",
        "AccessComments": "24 hours daily",
        "RelatedURL": "http://www.chargepoint.com/",
        "DistanceUnit": 0
    },
    "Connections": [
        {
            "ID": 30231,
            "ConnectionTypeID": 9,
            "LevelID": 1,
            "Amps": 16,
            "Voltage": 120,
            "PowerKW": 1,
            "CurrentTypeID": 10,
            "Quantity": 5
        },
        {
            "ID": 30232,
            "ConnectionTypeID": 1,
            "LevelID": 2,
            "Amps": 16,
            "Voltage": 230,
            "PowerKW": 3,
            "CurrentTypeID": 10,
            "Quantity": 14
        }
    ],
    "DateLastStatusUpdate": "2019-04-06T04:02:00Z",
    "DataQualityLevel": 3,
    "DateCreated": "2014-11-28T03:38:00Z",
    "SubmissionStatusTypeID": 100
}