{
    "IsRecentlyVerified": false,
    "ID": 27007,
    "UUID": "A1E12B42-6671-474B-9BB6-18D7C5840C9B",
    "DataProviderID": 2,
    "DataProvidersReference": "63171",
    "UsageTypeID": 1,
    "AddressInfo": {
        "ID": 27353,
        "Title": "Los Angeles Metro - Universal and Studio City Station",
        "AddressLine1": "3913 Lankershim Blvd",
        "Town": "Studio City",
        "StateOrProvince": "CA",
        "Postcode": "91604",
        "CountryID": 2,
        "Latitude": 34.139746,
        "Longitude": -118.361851,
        "ContactTelephone1": "213-922-4638",
        "AccessComments": "24 hours daily; pay lot; must have EV Connect account to access, see www.metro.net/projects/ev/ for more information",
        "RelatedURL": "http://evconnect.com/",
        "DistanceUnit": 0
    },
    "Connections": [
        {
            "ID": 29570,
            "ConnectionTypeID": 1,
            "LevelID": 2,
            "Amps": 16,
            "Voltage": 230,
            "PowerKW": 3,
            "CurrentTypeID": 10,
            "Quantity": 4
        }
    ],
    "DateLastStatusUpdate": "2019-04-06T04:01:00Z",
    "DataQualityLevel": 3,
    "DateCreated": "2014-11-28T03:37:00Z",
    "SubmissionStatusTypeID": 100
}