{
    "IsRecentlyVerified": false,
    "ID": 92998,
    "UUID": "746C77CA-08A4-4545-BE01-0EB4E7A77AD1",
    "DataProviderID": 1,
    "OperatorID": 23,
    "OperatorsReference": "34929",
    "UsageTypeID": 6,
    "AddressInfo": {
        "ID": 93344,
        "Title": "Hotel Harmony",
        "AddressLine1": "Hotel Harmony",
        "Postcode": "9000",
        "CountryID": 26,
        "Latitude": 51.057159,
        "Longitude": 3.722805,
        "ContactTelephone1": "+32 932 42680",
        "DistanceUnit": 0
    },
    "Connections": [
        {
            "ID": 131732,
            "ConnectionTypeID": 30,
            "StatusTypeID": 50,
            "LevelID": 2,
            "Amps": 32,
            "Voltage": 400,
            "PowerKW": 22,
            "CurrentTypeID": 20,
            "Quantity": 1
        }
    ],
    "NumberOfPoints": 1,
    "GeneralComments": "1 Tesla Connector, up to 22kW.Available for patrons only. Please see front desk.",
    "StatusTypeID": 50,
    "DateLastStatusUpdate": "2018-10-03T14:44:00Z",
    "DataQualityLevel": 1,
    "DateCreated": "2017-09-15T05:34:00Z",
    "SubmissionStatusTypeID": 200
}