{
    "IsRecentlyVerified": false,
    "ID": 85967,
    "UUID": "A068E554-52C0-465A-BA4E-704493A4C9E9",
    "DataProviderID": 1,
    "OperatorID": 220,
    "OperatorsReference": "0031",
    "UsageTypeID": 1,
    "UsageCost": "€1.73 + €0.3213/kWh; Andere Tarife möglich",
    "AddressInfo": {
        "ID": 86313,
        "Title": "Hammer Landstraße 204",
        "AddressLine1": "Hammer Landstraße 204",
        "Town": "Mitte",
        "StateOrProvince": "Hamburg",
        "Postcode": "20537",
        "CountryID": 87,
        "Latitude": 53.5539475703854,
        "Longitude": 10.0636066496372,
        "DistanceUnit": 0
    },
    "Connections": [
        {
            "ID": 122282,
            "ConnectionTypeID": 2,
            "StatusTypeID": 50,
            "LevelID": 2,
            "PowerKW": 22,
            "CurrentTypeID": 20,
            "Quantity": 1
        },
        {
            "ID": 122283,
            "ConnectionTypeID": 33,
            "StatusTypeID": 50,
            "LevelID": 2,
            "PowerKW": 22,
            "CurrentTypeID": 20,
            "Quantity": 1
        },
        {
            "ID": 122284,
            "ConnectionTypeID": 25,
            "StatusTypeID": 50,
            "LevelID": 2,
            "Amps": 32,
            "Voltage": 400,
            "PowerKW": 22,
            "CurrentTypeID": 20,
            "Quantity": 1
        }
    ],
    "NumberOfPoints": 1,
    "GeneralComments": "Zur Zeit kein DC Laden möglich!",
    "StatusTypeID": 50,
    "DateLastStatusUpdate": "2017-04-21T01:03:00Z",
    "DataQualityLevel": 1,
    "DateCreated": "2017-04-20T16:34:00Z",
    "SubmissionStatusTypeID": 200
}