{
    "IsRecentlyVerified": false,
    "ID": 185346,
    "UUID": "D5A7CE4B-C446-45C6-9C33-821F48717E3F",
    "DataProviderID": 29,
    "DataProvidersReference": "19886",
    "OperatorID": 234,
    "AddressInfo": {
        "ID": 185705,
        "Title": "Bruckenhofer Straße 7",
        "AddressLine1": "Bruckenhofer Straße 7",
        "Town": "Spardorf",
        "Postcode": "91080",
        "CountryID": 87,
        "Latitude": 49.60444,
        "Longitude": 11.055574,
        "DistanceUnit": 0
    },
    "Connections": [
        {
            "ID": 294717,
            "ConnectionTypeID": 25,
            "StatusTypeID": 50,
            "LevelID": 2,
            "PowerKW": 22,
            "CurrentTypeID": 20
        },
        {
            "ID": 294718,
            "ConnectionTypeID": 25,
            "StatusTypeID": 50,
            "LevelID": 2,
            "PowerKW": 22,
            "CurrentTypeID": 20
        }
    ],
    "StatusTypeID": 50,
    "DateLastStatusUpdate": "2021-07-12T02:43:00Z",
    "MetadataValues": [
        {
            "ID": 17637,
            "MetadataFieldID": 4,
            "ItemValue": "Data from the German chargepoint registry provided by Bundesnetzagentur.de under the CC-BY 4.0 license"
        }
    ],
    "DataQualityLevel": 3,
    "DateCreated": "2021-07-08T10:06:00Z",
    "SubmissionStatusTypeID": 100
}