{
    "IsRecentlyVerified": false,
    "ID": 6738,
    "UUID": "9D87944F-D3F4-4FBA-91DA-459714E4D676",
    "DataProviderID": 2,
    "DataProvidersReference": "40689",
    "UsageTypeID": 1,
    "AddressInfo": {
        "ID": 6640,
        "Title": "Annapolis Friends Meeting",
        "AddressLine1": "351 Dubois Ave",
        "Town": "Annapolis",
        "StateOrProvince": "MD",
        "Postcode": "21401",
        "CountryID": 2,
        "Latitude": 39.001676,
        "Longitude": -76.525253,
        "ContactTelephone1": "410-293-6417",
        "AccessComments": "8am-10pm daily; for church members or those in need of a charge",
        "RelatedURL": "",
        "DistanceUnit": 0
    },
    "Connections": [
        {
            "ID": 4102,
            "ConnectionTypeID": 9,
            "LevelID": 1,
            "Amps": 16,
            "Voltage": 120,
            "PowerKW": 1,
            "CurrentTypeID": 10,
            "Quantity": 4
        },
        {
            "ID": 4103,
            "ConnectionTypeID": 1,
            "LevelID": 2,
            "Amps": 16,
            "Voltage": 230,
            "PowerKW": 3,
            "CurrentTypeID": 10,
            "Quantity": 2
        }
    ],
    "DateLastConfirmed": "2011-08-25T00:00:00Z",
    "StatusTypeID": 0,
    "DateLastStatusUpdate": "2019-04-06T04:03:00Z",
    "DataQualityLevel": 1,
    "DateCreated": "2011-10-10T12:26:00Z",
    "SubmissionStatusTypeID": 100
}