{
    "IsRecentlyVerified": false,
    "ID": 105980,
    "UUID": "6FB33FF4-CC07-4E4B-B2F5-1B93F8442680",
    "DataProviderID": 1,
    "OperatorID": 150,
    "OperatorsReference": "Shell Weddington - Nuneaton",
    "UsageTypeID": 4,
    "UsageCost": "Rapid £1.00 fee then £0.30p per kWh AC socket 50p fee then 30p per kWh",
    "AddressInfo": {
        "ID": 106326,
        "Title": "Shell Waddington",
        "AddressLine1": "118 Hinckley Road",
        "Town": "Nuneaton",
        "Postcode": "CV11 6LS",
        "CountryID": 1,
        "Latitude": 52.528801,
        "Longitude": -1.448086,
        "RelatedURL": "https://www.geniepoint.co.uk/ds",
        "DistanceUnit": 0
    },
    "Connections": [
        {
            "ID": 149229,
            "ConnectionTypeID": 33,
            "StatusTypeID": 50,
            "LevelID": 3,
            "PowerKW": 50,
            "CurrentTypeID": 30,
            "Quantity": 1
        },
        {
            "ID": 149230,
            "ConnectionTypeID": 2,
            "StatusTypeID": 50,
            "LevelID": 3,
            "PowerKW": 50,
            "CurrentTypeID": 30,
            "Quantity": 1
        },
        {
            "ID": 149231,
            "ConnectionTypeID": 25,
            "StatusTypeID": 50,
            "LevelID": 2,
            "PowerKW": 22,
            "CurrentTypeID": 20,
            "Quantity": 1
        }
    ],
    "NumberOfPoints": 1,
    "StatusTypeID": 50,
    "DateLastStatusUpdate": "2020-10-07T13:28:00Z",
    "DataQualityLevel": 1,
    "DateCreated": "2018-06-12T20:05:00Z",
    "SubmissionStatusTypeID": 200
}