{
    "IsRecentlyVerified": false,
    "ID": 154456,
    "UUID": "383A108A-E9BA-4512-BC6E-F17779D50FE4",
    "DataProviderID": 28,
    "DataProvidersReference": "FR*SOD*S*NPDC*237*1*_*_",
    "UsageTypeID": 5,
    "AddressInfo": {
        "ID": 154809,
        "Title": "Emmerin - Mairie",
        "AddressLine1": "Rue Auguste Potié, Emmerin",
        "CountryID": 80,
        "Latitude": 50.593388,
        "Longitude": 3.000196,
        "AccessComments": "24/24 7/7 jours",
        "DistanceUnit": 0
    },
    "Connections": [
        {
            "ID": 217218,
            "ConnectionTypeID": 28,
            "StatusTypeID": 50,
            "LevelID": 2,
            "PowerKW": 22,
            "CurrentTypeID": 10
        },
        {
            "ID": 217219,
            "ConnectionTypeID": 25,
            "StatusTypeID": 50,
            "LevelID": 2,
            "PowerKW": 22,
            "CurrentTypeID": 10
        }
    ],
    "GeneralComments": "\"Type charge indiquée selon décret de 2017",
    "StatusTypeID": 50,
    "DateLastStatusUpdate": "2020-03-15T10:55:00Z",
    "DataQualityLevel": 2,
    "DateCreated": "2020-03-15T10:55:00Z",
    "SubmissionStatusTypeID": 100
}