{
    "IsRecentlyVerified": false,
    "ID": 17043,
    "UUID": "10EA3CBB-BB67-4FD7-A96D-9F6E0E299825",
    "DataProviderID": 22,
    "DataProvidersReference": "FB6A4114C5D63FC0BE8286359AFF72CE",
    "AddressInfo": {
        "ID": 17388,
        "Title": "日産プリンス埼玉販売圏央道鶴ヶ島店",
        "AddressLine1": "埼玉県鶴ヶ島市三ﾂ木新町2-4-8",
        "CountryID": 114,
        "Latitude": 35.92200283,
        "Longitude": 139.3871443,
        "ContactTelephone1": "049-279-3023",
        "DistanceUnit": 0
    },
    "Connections": [
        {
            "ID": 17284,
            "ConnectionTypeID": 2,
            "LevelID": 2,
            "Amps": 100,
            "Voltage": 480,
            "PowerKW": 48,
            "Quantity": 1
        }
    ],
    "DateLastStatusUpdate": "2013-06-29T08:53:00Z",
    "DataQualityLevel": 2,
    "DateCreated": "2013-06-29T08:53:00Z",
    "SubmissionStatusTypeID": 200
}