{
    "IsRecentlyVerified": false,
    "ID": 61471,
    "UUID": "C58F2C96-0DAB-4FA0-ABEA-7D29EF61CADB",
    "DataProviderID": 1,
    "OperatorID": 1238,
    "UsageTypeID": 4,
    "AddressInfo": {
        "ID": 61817,
        "Title": "Busbahnhof Wittenhofen",
        "AddressLine1": "Tschasarteter Platz 7",
        "Town": "Deggenhausertal",
        "StateOrProvince": "Bodenseekreis",
        "Postcode": "88693",
        "CountryID": 87,
        "Latitude": 47.7823841449965,
        "Longitude": 9.388852593917818,
        "ContactTelephone1": "+49 7541505124",
        "AccessComments": "Rund um die Uhr (24/7) nutzbar. \r\n",
        "DistanceUnit": 0
    },
    "Connections": [
        {
            "ID": 78295,
            "ConnectionTypeID": 25,
            "StatusTypeID": 50,
            "LevelID": 2,
            "Amps": 32,
            "Voltage": 400,
            "PowerKW": 22,
            "CurrentTypeID": 20,
            "Quantity": 2
        },
        {
            "ID": 78296,
            "ConnectionTypeID": 28,
            "StatusTypeID": 50,
            "LevelID": 2,
            "Amps": 16,
            "Voltage": 230,
            "PowerKW": 3.7,
            "CurrentTypeID": 10,
            "Quantity": 2
        }
    ],
    "NumberOfPoints": 2,
    "StatusTypeID": 50,
    "DateLastStatusUpdate": "2016-03-01T08:21:00Z",
    "DataQualityLevel": 1,
    "DateCreated": "2016-03-01T08:21:00Z",
    "SubmissionStatusTypeID": 200
}