{
    "IsRecentlyVerified": false,
    "ID": 129295,
    "UUID": "7F3ADF5D-54EB-4C1D-B9D8-C8887BF20507",
    "DataProviderID": 1,
    "OperatorID": 80,
    "UsageTypeID": 4,
    "AddressInfo": {
        "ID": 129641,
        "Title": "Sesto San Giovanni Pelucca | EnelX",
        "AddressLine1": "Via Pelucca",
        "Town": "Sesto San Giovanni",
        "StateOrProvince": "MI",
        "Postcode": "20099",
        "CountryID": 112,
        "Latitude": 45.55280100651524,
        "Longitude": 9.259368226554443,
        "RelatedURL": "https://www.enelx.com/it/it/emobility",
        "DistanceUnit": 0
    },
    "Connections": [
        {
            "ID": 180959,
            "ConnectionTypeID": 25,
            "StatusTypeID": 50,
            "LevelID": 2,
            "Amps": 32,
            "Voltage": 400,
            "PowerKW": 22,
            "CurrentTypeID": 20,
            "Quantity": 2
        }
    ],
    "NumberOfPoints": 2,
    "StatusTypeID": 50,
    "DateLastStatusUpdate": "2019-07-16T14:19:00Z",
    "DataQualityLevel": 1,
    "DateCreated": "2019-07-16T14:19:00Z",
    "SubmissionStatusTypeID": 200
}