{
    "IsRecentlyVerified": true,
    "DateLastVerified": "2021-09-19T18:39:00Z",
    "ID": 189306,
    "UUID": "FD2813B3-B1EB-44B2-AD02-136338B49F20",
    "DataProviderID": 1,
    "OperatorID": 21,
    "UsageTypeID": 4,
    "UsageCost": "Mobi.E compatible card or App",
    "AddressInfo": {
        "ID": 189665,
        "Title": "LSB-00379/380 - Colombo (-3)",
        "AddressLine1": "Colombo Shopping, -3",
        "Town": "Lisbon",
        "StateOrProvince": "Lisboa",
        "Postcode": "1500-235",
        "CountryID": 180,
        "Latitude": 38.75487884196119,
        "Longitude": -9.188920860185135,
        "AccessComments": "Level -3",
        "DistanceUnit": 0
    },
    "Connections": [
        {
            "ID": 306129,
            "ConnectionTypeID": 25,
            "StatusTypeID": 50,
            "LevelID": 2,
            "Amps": 32,
            "Voltage": 400,
            "PowerKW": 22,
            "CurrentTypeID": 20,
            "Quantity": 24
        }
    ],
    "NumberOfPoints": 24,
    "GeneralComments": "Paid parking",
    "StatusTypeID": 50,
    "DateLastStatusUpdate": "2021-09-19T18:39:00Z",
    "DataQualityLevel": 1,
    "DateCreated": "2021-09-19T18:39:00Z",
    "SubmissionStatusTypeID": 200
}