{
    "IsRecentlyVerified": false,
    "ID": 90267,
    "UUID": "52C913D7-5033-4BE9-A4CF-EF70D2C9CB4B",
    "DataProviderID": 1,
    "OperatorID": 23,
    "OperatorsReference": "31579",
    "UsageTypeID": 6,
    "AddressInfo": {
        "ID": 90613,
        "Title": "Hilton Garden Inn Tampa/Riverview/Brandon",
        "AddressLine1": "4328 Garden Vista DR",
        "Town": "Riverview",
        "StateOrProvince": "Florida",
        "Postcode": "33578",
        "CountryID": 2,
        "Latitude": 27.909542,
        "Longitude": -82.345613,
        "ContactTelephone1": "(813) 626-6610",
        "DistanceUnit": 0
    },
    "Connections": [
        {
            "ID": 127920,
            "ConnectionTypeID": 30,
            "StatusTypeID": 50,
            "LevelID": 2,
            "PowerKW": 8,
            "CurrentTypeID": 10,
            "Quantity": 2
        }
    ],
    "NumberOfPoints": 2,
    "GeneralComments": "2 Tesla Connectors, up to 8kW.Available for patrons only. Please see front desk.",
    "StatusTypeID": 50,
    "DateLastStatusUpdate": "2019-06-05T11:35:00Z",
    "DataQualityLevel": 1,
    "DateCreated": "2017-07-13T14:34:00Z",
    "SubmissionStatusTypeID": 200
}