{
    "IsRecentlyVerified": false,
    "ID": 15935,
    "UUID": "3A68700F-8176-45D7-9AE8-C6A72D8B1B51",
    "DataProviderID": 1,
    "OperatorID": 1,
    "UsageTypeID": 0,
    "UsageCost": "Free",
    "AddressInfo": {
        "ID": 16280,
        "Title": "Deman Rolbruggen",
        "AddressLine1": "Rollegemkapelsestraat 56 ",
        "AddressLine2": "",
        "Town": "Ledegem ",
        "StateOrProvince": "",
        "Postcode": "8880 ",
        "CountryID": 26,
        "Latitude": 50.8736069,
        "Longitude": 3.174756900000034,
        "ContactTelephone1": " (+32) 56 540 140  ",
        "ContactTelephone2": "",
        "ContactEmail": "info@deman.be",
        "AccessComments": "",
        "RelatedURL": "http://www.deman.be",
        "DistanceUnit": 0
    },
    "Connections": [
        {
            "ID": 14306,
            "ConnectionTypeID": 0,
            "StatusTypeID": 0,
            "LevelID": 2,
            "Amps": 16,
            "Voltage": 230,
            "PowerKW": 3.7,
            "Quantity": 1
        }
    ],
    "NumberOfPoints": 1,
    "GeneralComments": "",
    "StatusTypeID": 50,
    "DateLastStatusUpdate": "2013-02-15T15:07:00Z",
    "DataQualityLevel": 1,
    "DateCreated": "2013-02-15T15:07:00Z",
    "SubmissionStatusTypeID": 200
}