{
    "IsRecentlyVerified": false,
    "ID": 105701,
    "UUID": "5E5F1EF8-AEE9-4788-A537-8BB524508570",
    "DataProviderID": 2,
    "DataProvidersReference": "96927",
    "UsageTypeID": 1,
    "AddressInfo": {
        "ID": 106047,
        "Title": "Monte Vista Small Animal Hospital",
        "AddressLine1": "901 E Monte Vista Ave",
        "Town": "Turlock",
        "StateOrProvince": "CA",
        "Postcode": "95382",
        "CountryID": 2,
        "Latitude": 37.522258,
        "Longitude": -120.838622,
        "ContactTelephone1": "209-634-0023",
        "AccessComments": "24 hours daily",
        "RelatedURL": "",
        "DistanceUnit": 0
    },
    "Connections": [
        {
            "ID": 148896,
            "ConnectionTypeID": 1,
            "LevelID": 2,
            "Amps": 16,
            "Voltage": 230,
            "PowerKW": 3,
            "CurrentTypeID": 10,
            "Quantity": 1
        }
    ],
    "DateLastStatusUpdate": "2019-04-06T04:02:00Z",
    "DataQualityLevel": 3,
    "DateCreated": "2018-06-09T04:01:00Z",
    "SubmissionStatusTypeID": 100
}