{
    "IsRecentlyVerified": false,
    "ID": 34837,
    "UUID": "E08F7A4A-CA6E-432E-ADA3-F48CD688F3C9",
    "DataProviderID": 26,
    "DataProvidersReference": "51594",
    "OperatorID": 73,
    "OperatorsReference": "EV-Box EVB-P1415093",
    "UsageCost": "0.00 jaarabonnement",
    "AddressInfo": {
        "ID": 35183,
        "Title": "Brucknerlaan 29",
        "AddressLine1": "Brucknerlaan 29",
        "Town": "Rotterdam",
        "Postcode": "3055 SC",
        "CountryID": 159,
        "Latitude": 51.96088,
        "Longitude": 4.50833,
        "RelatedURL": "http://www.ev-box.nl",
        "DistanceUnit": 0
    },
    "Connections": [
        {
            "ID": 38348,
            "ConnectionTypeID": 25,
            "LevelID": 2,
            "PowerKW": 11,
            "CurrentTypeID": 10
        },
        {
            "ID": 47542,
            "ConnectionTypeID": 25,
            "LevelID": 2,
            "PowerKW": 11,
            "CurrentTypeID": 10
        }
    ],
    "NumberOfPoints": 1,
    "StatusTypeID": 50,
    "DateLastStatusUpdate": "2016-06-04T02:43:00Z",
    "DataQualityLevel": 3,
    "DateCreated": "2015-01-09T06:04:00Z",
    "SubmissionStatusTypeID": 100
}