{
    "IsRecentlyVerified": false,
    "ID": 64105,
    "UUID": "70031204-E0E0-467C-848F-7A781D1047A9",
    "DataProviderID": 26,
    "DataProvidersReference": "73008",
    "OperatorID": 157,
    "OperatorsReference": "NewMotion 03000480",
    "UsageCost": "0.00 jaarabonnement",
    "AddressInfo": {
        "ID": 64451,
        "Title": "Verlengde Hoogeveense Vaart",
        "AddressLine1": "Verlengde Hoogeveense Vaart",
        "Town": "Coevorden",
        "Postcode": "7861 TA",
        "CountryID": 159,
        "Latitude": 52.7357411,
        "Longitude": 6.7205607,
        "ContactTelephone1": "088 0109500",
        "RelatedURL": "http://thenewmotion.nl/",
        "DistanceUnit": 0
    },
    "Connections": [
        {
            "ID": 81991,
            "ConnectionTypeID": 25,
            "LevelID": 2,
            "PowerKW": 22,
            "CurrentTypeID": 10
        }
    ],
    "NumberOfPoints": 1,
    "StatusTypeID": 50,
    "DateLastStatusUpdate": "2016-06-04T02:55:00Z",
    "DataQualityLevel": 3,
    "DateCreated": "2016-03-03T12:33:00Z",
    "SubmissionStatusTypeID": 100
}