{
    "IsRecentlyVerified": false,
    "ID": 5669,
    "UUID": "9B3AFAD1-DCCC-40CC-AC10-BC2DF920CFDA",
    "DataProviderID": 1,
    "OperatorID": 1,
    "UsageTypeID": 1,
    "AddressInfo": {
        "ID": 5591,
        "Title": "Green Motorsport",
        "AddressLine1": "Woodham Court",
        "AddressLine2": "off Paragon",
        "Town": "Woking",
        "StateOrProvince": "Surrey",
        "Postcode": "GU21 5NJ",
        "CountryID": 1,
        "Latitude": 51.3424519,
        "Longitude": -0.5396808,
        "ContactTelephone1": "01483 763375",
        "DistanceUnit": 0
    },
    "Connections": [],
    "NumberOfPoints": 1,
    "StatusTypeID": 50,
    "DateLastStatusUpdate": "2014-09-13T03:56:00Z",
    "DateCreated": "2011-09-06T09:54:00Z",
    "SubmissionStatusTypeID": 200
}