{
    "IsRecentlyVerified": false,
    "ID": 121289,
    "UUID": "22533C59-BB9B-488F-BDDD-4996E7560497",
    "DataProviderID": 2,
    "DataProvidersReference": "117866",
    "UsageTypeID": 1,
    "AddressInfo": {
        "ID": 121635,
        "Title": "B&B Auto Inc",
        "AddressLine1": "913 Front St",
        "Town": "McHenry",
        "StateOrProvince": "IL",
        "Postcode": "60050",
        "CountryID": 2,
        "Latitude": 42.341617,
        "Longitude": -88.274825,
        "ContactTelephone1": "815-363-7560",
        "AccessComments": "8am-6pm M-F, 8am-3pm Sat",
        "RelatedURL": "",
        "DistanceUnit": 0
    },
    "Connections": [
        {
            "ID": 170729,
            "ConnectionTypeID": 1,
            "LevelID": 2,
            "Amps": 16,
            "Voltage": 230,
            "PowerKW": 3.7,
            "CurrentTypeID": 10,
            "Quantity": 1
        }
    ],
    "DateLastStatusUpdate": "2020-06-26T03:05:00Z",
    "DataQualityLevel": 3,
    "DateCreated": "2019-04-01T05:00:00Z",
    "SubmissionStatusTypeID": 100
}