{
    "IsRecentlyVerified": false,
    "ID": 148696,
    "UUID": "07EF8CBA-59AA-4A3D-9F1D-5FC337B52723",
    "DataProviderID": 1,
    "OperatorID": 136,
    "UsageTypeID": 4,
    "UsageCost": "DC 0,29€/min, AC 0,33€/min, min fee 0,50€ for chg. +parking.",
    "AddressInfo": {
        "ID": 149048,
        "Title": "Helen Grani",
        "AddressLine1": "Kauniaistentie 7",
        "Town": "Kauniainen",
        "StateOrProvince": "Southern Finland",
        "Postcode": "02700",
        "CountryID": 79,
        "Latitude": 60.21019047323912,
        "Longitude": 24.728203242920245,
        "RelatedURL": "http://www.virta.fi",
        "DistanceUnit": 0
    },
    "Connections": [
        {
            "ID": 206467,
            "ConnectionTypeID": 33,
            "StatusTypeID": 50,
            "LevelID": 3,
            "PowerKW": 50,
            "CurrentTypeID": 30,
            "Quantity": 1
        },
        {
            "ID": 206468,
            "ConnectionTypeID": 2,
            "StatusTypeID": 50,
            "LevelID": 3,
            "PowerKW": 50,
            "CurrentTypeID": 30,
            "Quantity": 1
        },
        {
            "ID": 206469,
            "ConnectionTypeID": 25,
            "StatusTypeID": 50,
            "LevelID": 2,
            "Amps": 32,
            "Voltage": 400,
            "PowerKW": 22,
            "CurrentTypeID": 20,
            "Quantity": 2
        }
    ],
    "NumberOfPoints": 1,
    "StatusTypeID": 50,
    "DateLastStatusUpdate": "2020-02-09T17:54:00Z",
    "DataQualityLevel": 1,
    "DateCreated": "2020-02-09T13:45:00Z",
    "SubmissionStatusTypeID": 200
}