{
    "IsRecentlyVerified": false,
    "ID": 160536,
    "UUID": "FFB28AC1-AFCD-4C68-8632-12B5C8E9AFD4",
    "DataProviderID": 2,
    "DataProvidersReference": "83015",
    "UsageTypeID": 1,
    "AddressInfo": {
        "ID": 160893,
        "Title": "Petro-Canada",
        "AddressLine1": "249 Cote Joyeuse",
        "Town": "St.Raymond",
        "StateOrProvince": "QC",
        "Postcode": "G3L 4A8",
        "CountryID": 44,
        "Latitude": 46.883383,
        "Longitude": -71.834105,
        "ContactTelephone1": "418-337-1277",
        "AccessComments": "24 hours daily",
        "RelatedURL": "",
        "DistanceUnit": 0
    },
    "Connections": [
        {
            "ID": 230990,
            "ConnectionTypeID": 1,
            "LevelID": 2,
            "Amps": 16,
            "Voltage": 230,
            "PowerKW": 3.7,
            "CurrentTypeID": 10,
            "Quantity": 1
        }
    ],
    "StatusTypeID": 50,
    "DateLastStatusUpdate": "2020-06-26T03:10:00Z",
    "DataQualityLevel": 3,
    "DateCreated": "2020-06-26T03:10:00Z",
    "SubmissionStatusTypeID": 100
}