{
    "IsRecentlyVerified": false,
    "ID": 179120,
    "UUID": "7F749AB1-E73B-4869-85F3-7DB149D02352",
    "DataProviderID": 1,
    "OperatorID": 3403,
    "AddressInfo": {
        "ID": 179479,
        "Title": "Raststätte Eichelborn Süd",
        "AddressLine1": "Raststätte Eichelborn Süd",
        "Town": "Mönchenholzhausen",
        "Postcode": "99198",
        "CountryID": 87,
        "Latitude": 50.948001,
        "Longitude": 11.196774,
        "DistanceUnit": 0
    },
    "Connections": [
        {
            "ID": 280473,
            "ConnectionTypeID": 1036,
            "StatusTypeID": 50,
            "LevelID": 3,
            "PowerKW": 43,
            "CurrentTypeID": 20
        },
        {
            "ID": 280474,
            "ConnectionTypeID": 33,
            "StatusTypeID": 50,
            "LevelID": 3,
            "PowerKW": 50,
            "CurrentTypeID": 30
        },
        {
            "ID": 298512,
            "ConnectionTypeID": 2,
            "StatusTypeID": 50,
            "LevelID": 3,
            "PowerKW": 50,
            "CurrentTypeID": 30
        }
    ],
    "StatusTypeID": 210,
    "DateLastStatusUpdate": "2021-08-14T20:05:00Z",
    "MetadataValues": [
        {
            "ID": 11414,
            "MetadataFieldID": 4,
            "ItemValue": "Data from the German chargepoint registry provided by Bundesnetzagentur.de under the CC-BY 4.0 license"
        }
    ],
    "DataQualityLevel": 3,
    "DateCreated": "2021-07-08T09:59:00Z",
    "SubmissionStatusTypeID": 100
}