{
    "IsRecentlyVerified": false,
    "ID": 41814,
    "UUID": "5E9DA0E0-7898-4455-94C3-F5C5476ECC15",
    "DataProviderID": 1,
    "OperatorID": 45,
    "UsageTypeID": 1,
    "UsageCost": "0",
    "AddressInfo": {
        "ID": 42160,
        "Title": "McDonald's Restaurant",
        "AddressLine1": "Schlepelsberg 4-6",
        "Town": "Rade / Neu Wulmsdorf",
        "Postcode": "21629",
        "CountryID": 87,
        "Latitude": 53.370132598337,
        "Longitude": 9.80121191500005,
        "ContactTelephone1": "04165 2172820",
        "AccessComments": "Kostenlos auf dem Kundenparkplatz. Öffnungszeiten Mo-Fr 7-24Uhr, Sa 7-24Uhr, So 8-24Uhr.",
        "RelatedURL": "http://www.mcdonalds.de/restaurant?id=1591",
        "DistanceUnit": 0
    },
    "Connections": [
        {
            "ID": 50084,
            "ConnectionTypeID": 25,
            "StatusTypeID": 50,
            "LevelID": 2,
            "Amps": 32,
            "Voltage": 400,
            "PowerKW": 22,
            "CurrentTypeID": 20,
            "Quantity": 1
        },
        {
            "ID": 50085,
            "ConnectionTypeID": 28,
            "StatusTypeID": 50,
            "LevelID": 2,
            "Amps": 16,
            "Voltage": 230,
            "PowerKW": 3.7,
            "CurrentTypeID": 10,
            "Quantity": 1
        }
    ],
    "NumberOfPoints": 2,
    "GeneralComments": "Ökostrom Ladesäule",
    "StatusTypeID": 50,
    "DateLastStatusUpdate": "2015-02-12T21:13:00Z",
    "DataQualityLevel": 1,
    "DateCreated": "2015-02-10T13:58:00Z",
    "SubmissionStatusTypeID": 200
}