{
    "IsRecentlyVerified": true,
    "DateLastVerified": "2021-09-20T13:33:00Z",
    "ID": 189336,
    "UUID": "F2598048-F3B0-462C-B20E-71DEB8A2A7CC",
    "DataProviderID": 1,
    "OperatorID": 3296,
    "UsageTypeID": 5,
    "UsageCost": "£0.40/kWh",
    "AddressInfo": {
        "ID": 189695,
        "Title": "McDonalds Dagenham",
        "AddressLine1": "149 Whalebone Lane South",
        "AddressLine2": "Dagenham",
        "Town": "London",
        "StateOrProvince": "England",
        "Postcode": "RM8 1AL",
        "CountryID": 1,
        "Latitude": 51.5654920298947,
        "Longitude": 0.14535844559168254,
        "DistanceUnit": 0
    },
    "Connections": [
        {
            "ID": 306177,
            "ConnectionTypeID": 33,
            "StatusTypeID": 50,
            "LevelID": 3,
            "PowerKW": 50,
            "CurrentTypeID": 30,
            "Quantity": 2
        },
        {
            "ID": 306178,
            "ConnectionTypeID": 2,
            "StatusTypeID": 50,
            "LevelID": 3,
            "PowerKW": 50,
            "CurrentTypeID": 30,
            "Quantity": 2
        }
    ],
    "NumberOfPoints": 2,
    "StatusTypeID": 50,
    "DateLastStatusUpdate": "2021-09-21T13:32:00Z",
    "DataQualityLevel": 1,
    "DateCreated": "2021-09-20T13:33:00Z",
    "SubmissionStatusTypeID": 200
}