{
    "IsRecentlyVerified": false,
    "ID": 182362,
    "UUID": "686794A3-42D6-4D67-A362-7E8815F21A5B",
    "DataProviderID": 29,
    "DataProvidersReference": "1678",
    "OperatorID": 3261,
    "AddressInfo": {
        "ID": 182721,
        "Title": "Am Kirmesplatz 1",
        "AddressLine1": "Am Kirmesplatz 1",
        "Town": "Marpingen",
        "Postcode": "66646",
        "CountryID": 87,
        "Latitude": 49.452202,
        "Longitude": 7.055122,
        "DistanceUnit": 0
    },
    "Connections": [
        {
            "ID": 288000,
            "ConnectionTypeID": 25,
            "StatusTypeID": 50,
            "LevelID": 2,
            "PowerKW": 22,
            "CurrentTypeID": 20
        },
        {
            "ID": 297024,
            "ConnectionTypeID": 25,
            "StatusTypeID": 50,
            "LevelID": 2,
            "PowerKW": 22,
            "CurrentTypeID": 20
        }
    ],
    "StatusTypeID": 50,
    "DateLastStatusUpdate": "2021-07-12T02:43:00Z",
    "MetadataValues": [
        {
            "ID": 14656,
            "MetadataFieldID": 4,
            "ItemValue": "Data from the German chargepoint registry provided by Bundesnetzagentur.de under the CC-BY 4.0 license"
        }
    ],
    "DataQualityLevel": 3,
    "DateCreated": "2021-07-08T10:02:00Z",
    "SubmissionStatusTypeID": 100
}