{
    "MediaItems": [
        {
            "ID": 12011,
            "ChargePointID": 87513,
            "ItemURL": "https://s3-ap-southeast-2.amazonaws.com/openchargemap/images/NZ/OCM87513/OCM-87513.orig.2017051112042640.jpg",
            "ItemThumbnailURL": "https://s3-ap-southeast-2.amazonaws.com/openchargemap/images/NZ/OCM87513/OCM-87513.thmb.2017051112042640.jpg",
            "Comment": "",
            "IsEnabled": true,
            "IsVideo": false,
            "IsFeaturedItem": false,
            "IsExternalResource": false,
            "User": {
                "ID": 15365,
                "Username": "sliday"
            },
            "DateCreated": "2017-05-11T12:05:00Z"
        }
    ],
    "IsRecentlyVerified": false,
    "ID": 87513,
    "UUID": "1B293F60-0521-4371-BE58-F45FB4101545",
    "DataProviderID": 1,
    "UsageCost": "$2/hr",
    "AddressInfo": {
        "ID": 87859,
        "Title": "Road Runner Tavern & Thirsty Liqour",
        "AddressLine1": "Opua Paihia Main Road SH11",
        "Town": "Opua",
        "StateOrProvince": "Northland",
        "Postcode": "0200",
        "CountryID": 161,
        "Latitude": -35.309732,
        "Longitude": 174.101983,
        "ContactTelephone1": "(649) 402-7199",
        "DistanceUnit": 0
    },
    "Connections": [
        {
            "ID": 124056,
            "ConnectionTypeID": 4
        },
        {
            "ID": 124057,
            "ConnectionTypeID": 29
        }
    ],
    "NumberOfPoints": 2,
    "GeneralComments": "10am - 10pm\r\nGrab a meal and a drink at the Roadie and get a bit of charge while you're there.",
    "StatusTypeID": 50,
    "DateLastStatusUpdate": "2017-05-11T12:16:00Z",
    "DataQualityLevel": 1,
    "DateCreated": "2017-05-11T12:04:00Z",
    "SubmissionStatusTypeID": 200
}