{
    "IsRecentlyVerified": false,
    "ID": 140976,
    "UUID": "8E86272F-9817-477A-8491-7AFB385512B6",
    "DataProviderID": 2,
    "DataProvidersReference": "148539",
    "OperatorID": 39,
    "UsageTypeID": 1,
    "AddressInfo": {
        "ID": 141328,
        "Title": "2100 Powell",
        "AddressLine1": "2100 Powell Street",
        "Town": "Emeryville",
        "StateOrProvince": "CA",
        "Postcode": "94608",
        "CountryID": 2,
        "Latitude": 37.8393639,
        "Longitude": -122.2989698,
        "ContactTelephone1": "800-663-5633",
        "AccessComments": "MO: 12:00am-12:00am; TU: 12:00am-12:00am; WE: 12:00am-12:00am; TH: 12:00am-12:00am; FR: 12:00am-12:00am; SA: 12:00am-12:00am; SU: 12:00am-12:00am",
        "RelatedURL": "http://www.semacharge.com/",
        "DistanceUnit": 0
    },
    "Connections": [
        {
            "ID": 196768,
            "ConnectionTypeID": 1,
            "LevelID": 2,
            "Amps": 16,
            "Voltage": 230,
            "PowerKW": 3.7,
            "CurrentTypeID": 10,
            "Quantity": 8
        }
    ],
    "StatusTypeID": 50,
    "DateLastStatusUpdate": "2020-06-26T02:59:00Z",
    "DataQualityLevel": 3,
    "DateCreated": "2019-12-24T09:14:00Z",
    "SubmissionStatusTypeID": 100
}