{
    "IsRecentlyVerified": false,
    "ID": 35487,
    "UUID": "FD420FAF-A8BA-487A-8D98-7CAAD4AD4C37",
    "DataProviderID": 26,
    "DataProvidersReference": "31628",
    "OperatorsReference": "Hoornwijck",
    "UsageCost": "0.00 jaarabonnement",
    "AddressInfo": {
        "ID": 35833,
        "Title": "Laan van Zuid Hoorn 56",
        "AddressLine1": "Laan van Zuid Hoorn 56",
        "Town": "Rijswijk",
        "Postcode": "2289 DE",
        "CountryID": 159,
        "Latitude": 52.049607239255,
        "Longitude": 4.3498751521111,
        "RelatedURL": "http://www.e-laad.nl",
        "DistanceUnit": 0
    },
    "Connections": [
        {
            "ID": 38998,
            "ConnectionTypeID": 25,
            "LevelID": 2,
            "PowerKW": 11,
            "CurrentTypeID": 10
        }
    ],
    "NumberOfPoints": 1,
    "StatusTypeID": 50,
    "DateLastStatusUpdate": "2016-06-04T02:45:00Z",
    "DataQualityLevel": 3,
    "DateCreated": "2015-01-09T06:05:00Z",
    "SubmissionStatusTypeID": 100
}