{
    "IsRecentlyVerified": false,
    "ID": 175747,
    "UUID": "2F549F70-B757-4E55-844B-6408DEA5A220",
    "DataProviderID": 1,
    "OperatorID": 3435,
    "UsageTypeID": 4,
    "UsageCost": "2₪ per KW",
    "AddressInfo": {
        "ID": 176106,
        "Title": "דור-אלון יסעור",
        "AddressLine1": "יסעור",
        "Town": "דור-אלון יסעור",
        "CountryID": 111,
        "Latitude": 32.900024854995095,
        "Longitude": 35.17024150282509,
        "DistanceUnit": 0
    },
    "Connections": [
        {
            "ID": 272920,
            "ConnectionTypeID": 33,
            "StatusTypeID": 50,
            "LevelID": 3,
            "PowerKW": 175,
            "CurrentTypeID": 30,
            "Quantity": 1
        },
        {
            "ID": 272921,
            "ConnectionTypeID": 2,
            "StatusTypeID": 50,
            "LevelID": 3,
            "PowerKW": 175,
            "CurrentTypeID": 30,
            "Quantity": 1
        }
    ],
    "NumberOfPoints": 1,
    "StatusTypeID": 50,
    "DateLastStatusUpdate": "2021-09-12T19:16:00Z",
    "DataQualityLevel": 1,
    "DateCreated": "2021-06-11T14:14:00Z",
    "SubmissionStatusTypeID": 200
}