{
    "IsRecentlyVerified": false,
    "ID": 102842,
    "UUID": "CE7CB26D-9465-4D2B-B8F1-5E5AFF3A35FC",
    "DataProviderID": 2,
    "DataProvidersReference": "94373",
    "OperatorID": 5,
    "UsageTypeID": 1,
    "AddressInfo": {
        "ID": 103188,
        "Title": "LIBERTY CREST",
        "AddressLine1": "150 S 200 E",
        "Town": "Salt Lake City",
        "StateOrProvince": "UT",
        "Postcode": "84111",
        "CountryID": 2,
        "Latitude": 40.766059,
        "Longitude": -111.885551,
        "ContactTelephone1": "888-758-4389",
        "AccessComments": "24 hours daily",
        "RelatedURL": "http://www.chargepoint.com/",
        "DistanceUnit": 0
    },
    "Connections": [
        {
            "ID": 144983,
            "ConnectionTypeID": 1,
            "LevelID": 2,
            "Amps": 16,
            "Voltage": 230,
            "PowerKW": 3,
            "CurrentTypeID": 10,
            "Quantity": 4
        }
    ],
    "DateLastStatusUpdate": "2019-04-06T05:05:00Z",
    "DataQualityLevel": 3,
    "DateCreated": "2018-04-21T04:13:00Z",
    "SubmissionStatusTypeID": 100
}