{
    "IsRecentlyVerified": false,
    "ID": 174863,
    "UUID": "C845285C-2FFF-47F4-97EA-2C55E913ED46",
    "DataProviderID": 1,
    "OperatorID": 3327,
    "UsageTypeID": 1,
    "UsageCost": "0.45",
    "AddressInfo": {
        "ID": 175222,
        "Title": "Via Castel dell'Alpi",
        "AddressLine1": "Via Castel dell'Alpi",
        "Town": "San Benedetto Val di Sambro",
        "StateOrProvince": "Emilia-Romagna",
        "Postcode": "40048",
        "CountryID": 112,
        "Latitude": 44.18384559297209,
        "Longitude": 11.274735438736002,
        "DistanceUnit": 0
    },
    "Connections": [
        {
            "ID": 270962,
            "ConnectionTypeID": 25,
            "StatusTypeID": 50,
            "LevelID": 2,
            "PowerKW": 22
        }
    ],
    "NumberOfPoints": 2,
    "StatusTypeID": 50,
    "DateLastStatusUpdate": "2021-04-16T09:39:00Z",
    "DataQualityLevel": 1,
    "DateCreated": "2021-04-15T20:59:00Z",
    "SubmissionStatusTypeID": 200
}