{
    "IsRecentlyVerified": false,
    "ID": 19056,
    "UUID": "F150822E-9693-40CC-B799-5253649F8017",
    "DataProviderID": 1,
    "OperatorID": 1,
    "UsageTypeID": 1,
    "UsageCost": "Free",
    "AddressInfo": {
        "ID": 19401,
        "Title": "Boer Vastgoed Groep",
        "AddressLine1": "Rozenburglaan 1",
        "AddressLine2": "",
        "Town": "Groningen",
        "StateOrProvince": "",
        "Postcode": "9727 DL",
        "CountryID": 159,
        "Latitude": 53.19650430000001,
        "Longitude": 6.53255450000006,
        "ContactTelephone1": "0599-859030",
        "ContactTelephone2": "",
        "ContactEmail": "info@boervastgoedgroep.nl",
        "AccessComments": "",
        "RelatedURL": "http://www.boervastgoedgroep.nl/",
        "DistanceUnit": 0
    },
    "Connections": [
        {
            "ID": 19297,
            "ConnectionTypeID": 25,
            "StatusTypeID": 50,
            "LevelID": 2,
            "Amps": 16,
            "Voltage": 220,
            "PowerKW": 11,
            "CurrentTypeID": 20,
            "Quantity": 1
        }
    ],
    "NumberOfPoints": 1,
    "GeneralComments": "",
    "StatusTypeID": 50,
    "DateLastStatusUpdate": "2013-09-11T20:29:00Z",
    "DataQualityLevel": 1,
    "DateCreated": "2013-09-10T14:19:00Z",
    "SubmissionStatusTypeID": 200
}