{
    "IsRecentlyVerified": false,
    "ID": 150740,
    "UUID": "A4E5B3DD-4735-4938-99AA-21791D93A456",
    "DataProviderID": 28,
    "DataProvidersReference": "FR*M13*P13092*001",
    "UsageTypeID": 5,
    "AddressInfo": {
        "ID": 151093,
        "Title": "SAINT-CHAMAS - Rue Victor Ferrier",
        "AddressLine1": "Rue Victor Ferrier 0 SAINT-CHAMAS",
        "CountryID": 80,
        "Latitude": 43.549935,
        "Longitude": 5.030772,
        "AccessComments": "24h/24 7j/7",
        "DistanceUnit": 0
    },
    "Connections": [
        {
            "ID": 209867,
            "ConnectionTypeID": 28,
            "StatusTypeID": 50,
            "LevelID": 2,
            "PowerKW": 22,
            "CurrentTypeID": 10
        },
        {
            "ID": 209868,
            "ConnectionTypeID": 1036,
            "StatusTypeID": 50,
            "LevelID": 2,
            "PowerKW": 22,
            "CurrentTypeID": 20
        },
        {
            "ID": 239458,
            "ConnectionTypeID": 28,
            "StatusTypeID": 50,
            "LevelID": 2,
            "PowerKW": 22,
            "CurrentTypeID": 10
        },
        {
            "ID": 239459,
            "ConnectionTypeID": 1036,
            "StatusTypeID": 50,
            "LevelID": 2,
            "PowerKW": 22,
            "CurrentTypeID": 20
        }
    ],
    "GeneralComments": "Recharge par badge et avec une application smartphone",
    "StatusTypeID": 50,
    "DateLastStatusUpdate": "2020-08-27T05:10:00Z",
    "DataQualityLevel": 2,
    "DateCreated": "2020-03-15T06:17:00Z",
    "SubmissionStatusTypeID": 100
}