{
    "IsRecentlyVerified": false,
    "ID": 136874,
    "UUID": "3114D39C-F07F-4998-AC57-6EF76C3D3E89",
    "DataProviderID": 18,
    "DataProvidersReference": "a6786cd241e6e104b7e183f89d765b9f",
    "UsageTypeID": 1,
    "AddressInfo": {
        "ID": 137220,
        "Title": "Antrim Road",
        "AddressLine1": "Antrim Road",
        "Town": "Newtownabbey",
        "Postcode": "BT36 7PN",
        "CountryID": 1,
        "Latitude": 54.658105,
        "Longitude": -5.943716,
        "AccessComments": "",
        "RelatedURL": "https://www.drdni.gov.uk/",
        "DistanceUnit": 0
    },
    "Connections": [
        {
            "ID": 191545,
            "ConnectionTypeID": 25,
            "Reference": "1",
            "StatusTypeID": 50,
            "LevelID": 2,
            "Amps": 32,
            "Voltage": 230,
            "PowerKW": 7,
            "CurrentTypeID": 10
        },
        {
            "ID": 191546,
            "ConnectionTypeID": 25,
            "Reference": "2",
            "StatusTypeID": 50,
            "LevelID": 2,
            "Amps": 32,
            "Voltage": 230,
            "PowerKW": 7,
            "CurrentTypeID": 10
        }
    ],
    "StatusTypeID": 0,
    "DateLastStatusUpdate": "2020-03-17T08:54:00Z",
    "MetadataValues": [
        {
            "ID": 6726,
            "MetadataFieldID": 4,
            "ItemValue": "Contains public sector information licensed under the Open Government Licence v2.0. http://www.nationalarchives.gov.uk/doc/open-government-licence/version/2/"
        }
    ],
    "DataQualityLevel": 3,
    "DateCreated": "2019-12-24T05:23:00Z",
    "SubmissionStatusTypeID": 100
}