{
    "IsRecentlyVerified": false,
    "ID": 171432,
    "UUID": "08DC518C-5532-4A83-BD86-64F3EA9EB9A5",
    "DataProviderID": 1,
    "OperatorID": 3273,
    "UsageTypeID": 5,
    "AddressInfo": {
        "ID": 171791,
        "Title": "GoFast Horgen",
        "AddressLine1": "Zugerstrasse 231 ",
        "Town": "Horgen",
        "StateOrProvince": "Zurich",
        "Postcode": "8810",
        "CountryID": 217,
        "Latitude": 47.23814142432255,
        "Longitude": 8.611619731644737,
        "RelatedURL": "https://swisschargech.freshdesk.com/de/support/home",
        "DistanceUnit": 0
    },
    "Connections": [
        {
            "ID": 262081,
            "ConnectionTypeID": 33,
            "StatusTypeID": 50,
            "LevelID": 3,
            "PowerKW": 150,
            "CurrentTypeID": 30,
            "Quantity": 2
        },
        {
            "ID": 262082,
            "ConnectionTypeID": 2,
            "StatusTypeID": 50,
            "LevelID": 3,
            "PowerKW": 50,
            "CurrentTypeID": 30,
            "Quantity": 1
        },
        {
            "ID": 262083,
            "ConnectionTypeID": 1036,
            "StatusTypeID": 50,
            "LevelID": 2,
            "PowerKW": 22,
            "Quantity": 1
        }
    ],
    "NumberOfPoints": 2,
    "StatusTypeID": 50,
    "DateLastStatusUpdate": "2021-01-02T19:38:00Z",
    "DataQualityLevel": 1,
    "DateCreated": "2021-01-01T22:03:00Z",
    "SubmissionStatusTypeID": 200
}