{
    "IsRecentlyVerified": false,
    "ID": 178217,
    "UUID": "CFED9DA3-ABA3-4DC2-8C92-C942AFD869B2",
    "DataProviderID": 29,
    "DataProvidersReference": "661,5133",
    "OperatorID": 45,
    "AddressInfo": {
        "ID": 178576,
        "Title": "Stuttgarter Str. 65",
        "AddressLine1": "Stuttgarter Str. 65",
        "Town": "Kirchheim/Teck",
        "Postcode": "73230",
        "CountryID": 87,
        "Latitude": 48.651587,
        "Longitude": 9.439141,
        "DistanceUnit": 0
    },
    "Connections": [
        {
            "ID": 278340,
            "ConnectionTypeID": 25,
            "StatusTypeID": 50,
            "LevelID": 2,
            "PowerKW": 11,
            "CurrentTypeID": 20
        },
        {
            "ID": 278341,
            "ConnectionTypeID": 25,
            "StatusTypeID": 50,
            "LevelID": 2,
            "PowerKW": 11,
            "CurrentTypeID": 20
        },
        {
            "ID": 278342,
            "ConnectionTypeID": 25,
            "StatusTypeID": 50,
            "LevelID": 2,
            "PowerKW": 22,
            "CurrentTypeID": 20
        },
        {
            "ID": 278343,
            "ConnectionTypeID": 25,
            "StatusTypeID": 50,
            "LevelID": 2,
            "PowerKW": 22,
            "CurrentTypeID": 20
        }
    ],
    "StatusTypeID": 0,
    "DateLastStatusUpdate": "2021-07-09T03:13:00Z",
    "MetadataValues": [
        {
            "ID": 10511,
            "MetadataFieldID": 4,
            "ItemValue": "Data from the German chargepoint registry provided by Bundesnetzagentur.de under the CC-BY 4.0 license"
        }
    ],
    "DataQualityLevel": 3,
    "DateCreated": "2021-07-08T09:49:00Z",
    "SubmissionStatusTypeID": 100
}