{
    "IsRecentlyVerified": false,
    "ID": 73711,
    "UUID": "2B0653A4-AAAE-4DA0-8368-73C434D381EC",
    "DataProviderID": 1,
    "OperatorID": 89,
    "OperatorsReference": "AAA-269",
    "UsageTypeID": 4,
    "UsageCost": "Free",
    "AddressInfo": {
        "ID": 74057,
        "Title": "Nanaimo Regional General Hospital",
        "AddressLine1": "1200 Dufferin Crescent",
        "Town": "Nanaimo",
        "StateOrProvince": "BC",
        "Postcode": "V9S 2B7",
        "CountryID": 44,
        "Latitude": 49.184272,
        "Longitude": -123.969497,
        "DistanceUnit": 0
    },
    "Connections": [
        {
            "ID": 106011,
            "ConnectionTypeID": 1,
            "StatusTypeID": 50,
            "LevelID": 2,
            "Amps": 32,
            "Voltage": 230,
            "PowerKW": 7,
            "CurrentTypeID": 10,
            "Quantity": 1
        }
    ],
    "NumberOfPoints": 1,
    "StatusTypeID": 50,
    "DateLastStatusUpdate": "2016-11-27T20:22:00Z",
    "DataQualityLevel": 1,
    "DateCreated": "2016-11-23T22:47:00Z",
    "SubmissionStatusTypeID": 200
}