{
    "IsRecentlyVerified": false,
    "ID": 132698,
    "UUID": "0FFB344D-F57E-439C-B597-89B6C9CE2198",
    "DataProviderID": 1,
    "OperatorID": 3266,
    "UsageTypeID": 4,
    "AddressInfo": {
        "ID": 133044,
        "Title": "Concessionario Nissan Autonord Fioretto",
        "AddressLine1": "Strada delle Saline, 2",
        "Town": "Muggia ",
        "StateOrProvince": "TS",
        "Postcode": "34015",
        "CountryID": 112,
        "Latitude": 45.59330872747054,
        "Longitude": 13.800184362122764,
        "RelatedURL": "https://www.autonordfioretto.it/",
        "DistanceUnit": 0
    },
    "Connections": [
        {
            "ID": 185778,
            "ConnectionTypeID": 2,
            "StatusTypeID": 50,
            "LevelID": 3,
            "Amps": 120,
            "Voltage": 500,
            "PowerKW": 50,
            "CurrentTypeID": 30,
            "Quantity": 1
        },
        {
            "ID": 185779,
            "ConnectionTypeID": 33,
            "StatusTypeID": 50,
            "LevelID": 3,
            "Amps": 120,
            "Voltage": 500,
            "PowerKW": 50,
            "CurrentTypeID": 30,
            "Quantity": 1
        },
        {
            "ID": 185780,
            "ConnectionTypeID": 25,
            "StatusTypeID": 50,
            "LevelID": 2,
            "Amps": 32,
            "Voltage": 400,
            "PowerKW": 22,
            "CurrentTypeID": 20,
            "Quantity": 1
        }
    ],
    "NumberOfPoints": 2,
    "StatusTypeID": 50,
    "DateLastStatusUpdate": "2020-01-21T09:13:00Z",
    "DataQualityLevel": 1,
    "DateCreated": "2019-10-05T14:42:00Z",
    "SubmissionStatusTypeID": 200
}