{
    "IsRecentlyVerified": false,
    "ID": 53936,
    "UUID": "199A0CDC-0D4E-4407-8F8E-A0690A10E4BB",
    "DataProviderID": 26,
    "DataProvidersReference": "69812",
    "OperatorID": 157,
    "OperatorsReference": "NewMotion 02014396",
    "UsageCost": "0.00 jaarabonnement",
    "AddressInfo": {
        "ID": 54282,
        "Title": "Van Leeuwenhoekstraat 26",
        "AddressLine1": "Van Leeuwenhoekstraat 26",
        "Town": "Harderwijk",
        "Postcode": "3846 CB",
        "CountryID": 159,
        "Latitude": 52.3651106,
        "Longitude": 5.6469239,
        "ContactTelephone1": "088 0109500",
        "RelatedURL": "http://thenewmotion.nl/",
        "DistanceUnit": 0
    },
    "Connections": [
        {
            "ID": 67415,
            "ConnectionTypeID": 25,
            "LevelID": 2,
            "PowerKW": 3.7,
            "CurrentTypeID": 10
        }
    ],
    "NumberOfPoints": 1,
    "StatusTypeID": 50,
    "DateLastStatusUpdate": "2016-06-04T02:53:00Z",
    "DataQualityLevel": 3,
    "DateCreated": "2015-09-20T11:50:00Z",
    "SubmissionStatusTypeID": 100
}