{
    "IsRecentlyVerified": false,
    "ID": 7818,
    "UUID": "86DCFCD1-D3BD-4137-8745-A96C1DBCA984",
    "DataProviderID": 15,
    "DataProvidersReference": "6879",
    "OperatorID": 26,
    "AddressInfo": {
        "ID": 7715,
        "Title": "3360 Richmond Rd",
        "AddressLine1": "3360 Richmond Rd",
        "Town": "Lexington",
        "StateOrProvince": "KY",
        "Postcode": "40509",
        "CountryID": 2,
        "Latitude": 37.99753,
        "Longitude": -84.44207,
        "ContactTelephone1": " (859) 263-5020",
        "RelatedURL": "http://carstations.com/6879",
        "DistanceUnit": 0
    },
    "Connections": [
        {
            "ID": 5248,
            "ConnectionTypeID": 1,
            "Reference": "J1772",
            "LevelID": 2
        }
    ],
    "StatusTypeID": 0,
    "DateLastStatusUpdate": "2017-11-04T14:04:00Z",
    "DataQualityLevel": 1,
    "DateCreated": "2011-11-11T12:05:00Z",
    "SubmissionStatusTypeID": 100
}