{
    "UserComments": [
        {
            "ID": 337,
            "ChargePointID": 15235,
            "CommentTypeID": 10,
            "UserName": "Efusco",
            "Comment": "Worked great!",
            "Rating": 5,
            "DateCreated": "2013-05-29T23:42:15.72Z",
            "CheckinStatusTypeID": 0
        }
    ],
    "IsRecentlyVerified": false,
    "ID": 15235,
    "UUID": "F956B79A-5B05-4124-9F3A-70A3DB907A03",
    "DataProviderID": 1,
    "OperatorID": 1,
    "UsageTypeID": 1,
    "UsageCost": "Free",
    "AddressInfo": {
        "ID": 15581,
        "Title": "Springfield Environmental Resource Center",
        "AddressLine1": "290 E. Central St.",
        "AddressLine2": "",
        "Town": "Springfield",
        "StateOrProvince": "MO",
        "Postcode": "65802",
        "CountryID": 2,
        "Latitude": 37.2173579,
        "Longitude": -93.29099459999998,
        "ContactTelephone1": "4178461000",
        "ContactTelephone2": "",
        "ContactEmail": "",
        "AccessComments": "On Back side of building",
        "RelatedURL": "",
        "DistanceUnit": 0
    },
    "Connections": [
        {
            "ID": 13520,
            "ConnectionTypeID": 1,
            "StatusTypeID": 50,
            "LevelID": 2,
            "Amps": 30,
            "Voltage": 240,
            "PowerKW": 7.2,
            "Quantity": 1
        }
    ],
    "NumberOfPoints": 1,
    "GeneralComments": "",
    "StatusTypeID": 50,
    "DateLastStatusUpdate": "2013-01-01T21:12:00Z",
    "DataQualityLevel": 1,
    "DateCreated": "2012-12-26T23:16:00Z",
    "SubmissionStatusTypeID": 200
}