{
    "UserComments": [
        {
            "ID": 9790,
            "ChargePointID": 61321,
            "CommentTypeID": 10,
            "UserName": "Simon Hewison",
            "Comment": "One of the bays has been re-used for a recycling compound. Not publicly accessible.",
            "Rating": 2,
            "DateCreated": "2016-02-24T13:21:54.953Z",
            "User": {
                "ID": 4575,
                "Username": "Simon Hewison"
            },
            "CheckinStatusTypeID": 140
        }
    ],
    "MediaItems": [
        {
            "ID": 5927,
            "ChargePointID": 61321,
            "ItemURL": "https://s3-ap-southeast-2.amazonaws.com/openchargemap/images/GB/OCM61321/OCM-61321.orig.2016022413204359.jpg",
            "ItemThumbnailURL": "https://s3-ap-southeast-2.amazonaws.com/openchargemap/images/GB/OCM61321/OCM-61321.thmb.2016022413204359.jpg",
            "Comment": "One of the electric charging bays has been commandeered for a recycling storage area. In gated private car park for permit holders only.",
            "IsEnabled": true,
            "IsVideo": false,
            "IsFeaturedItem": false,
            "IsExternalResource": false,
            "User": {
                "ID": 4575,
                "Username": "Simon Hewison"
            },
            "DateCreated": "2016-02-24T13:21:00Z"
        }
    ],
    "IsRecentlyVerified": false,
    "ID": 61321,
    "UUID": "0440C1F8-0501-4C92-B41C-7E6A5B5201F5",
    "DataProviderID": 1,
    "OperatorID": 32,
    "OperatorsReference": "636",
    "UsageTypeID": 2,
    "UsageCost": "Inclusive; for Polar Plus subscription members only",
    "AddressInfo": {
        "ID": 61667,
        "Title": "University of Bedfordshire Staff car park",
        "AddressLine1": "Church Street",
        "AddressLine2": "Park Town",
        "Town": "Luton",
        "StateOrProvince": "Luton",
        "Postcode": "LU1 3JU",
        "CountryID": 1,
        "Latitude": 51.8783933521624,
        "Longitude": -0.411353007687356,
        "AccessComments": "Workplace charging in gated car park",
        "DistanceUnit": 0
    },
    "Connections": [
        {
            "ID": 78098,
            "ConnectionTypeID": 25,
            "StatusTypeID": 50,
            "LevelID": 2,
            "Amps": 32,
            "Voltage": 230,
            "PowerKW": 4,
            "CurrentTypeID": 10,
            "Quantity": 2
        },
        {
            "ID": 109068,
            "ConnectionTypeID": 3,
            "StatusTypeID": 50,
            "LevelID": 2,
            "Amps": 13,
            "Voltage": 230,
            "PowerKW": 3,
            "CurrentTypeID": 10,
            "Quantity": 1
        }
    ],
    "NumberOfPoints": 2,
    "StatusTypeID": 50,
    "DateLastStatusUpdate": "2019-03-10T06:16:00Z",
    "DataQualityLevel": 1,
    "DateCreated": "2016-02-24T12:52:00Z",
    "SubmissionStatusTypeID": 200
}