{
    "IsRecentlyVerified": false,
    "ID": 15401,
    "UUID": "16BC3254-B1C8-4AD5-A6B6-50D1D7214C62",
    "DataProviderID": 1,
    "OperatorID": 51,
    "UsageTypeID": 0,
    "UsageCost": "Free",
    "AddressInfo": {
        "ID": 15747,
        "Title": "Oakville Yamaha",
        "AddressLine1": "615 Third Line ",
        "AddressLine2": "",
        "Town": "Oakville",
        "StateOrProvince": "ON",
        "Postcode": "L6L 4A8",
        "CountryID": 44,
        "Latitude": 43.4182829,
        "Longitude": -79.71679080000001,
        "ContactTelephone1": "(905) 465-9555",
        "ContactTelephone2": "",
        "ContactEmail": "info@oakvilleyamaha.com",
        "AccessComments": "Monday\t9:00AM - 6:00PM Tuesday\t9:00AM - 6:00PM Wednesday\t9:00AM - 6:00PM Thursday\t9:00AM - 6:00PM Friday\t9:00AM - 6:00PM Saturday\t9:00AM - 4:00PM Sunday\tClosed",
        "RelatedURL": "http://www.oakvilleyamaha.com",
        "DistanceUnit": 0
    },
    "Connections": [
        {
            "ID": 13709,
            "ConnectionTypeID": 1,
            "StatusTypeID": 0,
            "LevelID": 2,
            "Amps": 48,
            "Voltage": 240,
            "PowerKW": 11.5,
            "Quantity": 1
        }
    ],
    "NumberOfPoints": 1,
    "GeneralComments": "",
    "StatusTypeID": 50,
    "DateLastStatusUpdate": "2013-01-09T14:31:00Z",
    "DataQualityLevel": 1,
    "DateCreated": "2013-01-09T14:31:00Z",
    "SubmissionStatusTypeID": 200
}