{
    "UserComments": [
        {
            "ID": 22905,
            "ChargePointID": 161515,
            "CommentTypeID": 10,
            "UserName": "ForumElettrico.it",
            "Comment": "Gratuita fino a settembre ed attivabile con tessera da richiedere in comune. Leggi la recensione completa qui > https://www.forumelettrico.it/forum/nuova-colonnina-t8558.html",
            "RelatedURL": "https://www.forumelettrico.it/forum/nuova-colonnina-t8558.html",
            "DateCreated": "2020-07-14T14:16:59.953Z",
            "User": {
                "ID": 11749,
                "Username": "ForumElettrico.it"
            },
            "CheckinStatusTypeID": 10,
            "IsActionedByEditor": false
        }
    ],
    "MediaItems": [
        {
            "ID": 23061,
            "ChargePointID": 161515,
            "ItemURL": "https://s3-ap-southeast-2.amazonaws.com/openchargemap/images/IT/OCM161515/OCM-161515.orig.2020071414171154.jpg",
            "ItemThumbnailURL": "https://s3-ap-southeast-2.amazonaws.com/openchargemap/images/IT/OCM161515/OCM-161515.thmb.2020071414171154.jpg",
            "Comment": "",
            "IsEnabled": true,
            "IsVideo": false,
            "IsFeaturedItem": false,
            "IsExternalResource": false,
            "User": {
                "ID": 11749,
                "Username": "ForumElettrico.it"
            },
            "DateCreated": "2020-07-14T14:17:00Z"
        },
        {
            "ID": 23062,
            "ChargePointID": 161515,
            "ItemURL": "https://s3-ap-southeast-2.amazonaws.com/openchargemap/images/IT/OCM161515/OCM-161515.orig.2020071414171786.jpg",
            "ItemThumbnailURL": "https://s3-ap-southeast-2.amazonaws.com/openchargemap/images/IT/OCM161515/OCM-161515.thmb.2020071414171786.jpg",
            "Comment": "",
            "IsEnabled": true,
            "IsVideo": false,
            "IsFeaturedItem": false,
            "IsExternalResource": false,
            "User": {
                "ID": 11749,
                "Username": "ForumElettrico.it"
            },
            "DateCreated": "2020-07-14T14:17:00Z"
        },
        {
            "ID": 23063,
            "ChargePointID": 161515,
            "ItemURL": "https://s3-ap-southeast-2.amazonaws.com/openchargemap/images/IT/OCM161515/OCM-161515.orig.2020071414172496.jpg",
            "ItemThumbnailURL": "https://s3-ap-southeast-2.amazonaws.com/openchargemap/images/IT/OCM161515/OCM-161515.thmb.2020071414172496.jpg",
            "Comment": "",
            "IsEnabled": true,
            "IsVideo": false,
            "IsFeaturedItem": false,
            "IsExternalResource": false,
            "User": {
                "ID": 11749,
                "Username": "ForumElettrico.it"
            },
            "DateCreated": "2020-07-14T14:17:00Z"
        }
    ],
    "IsRecentlyVerified": false,
    "ID": 161515,
    "UUID": "9432A078-C317-4975-978D-892D9C20DE88",
    "DataProviderID": 1,
    "OperatorID": 3328,
    "UsageTypeID": 1,
    "AddressInfo": {
        "ID": 161872,
        "Title": "Interreg Municipio",
        "AddressLine1": "Via Giosuè Carducci 9",
        "Town": "Roveredo in Piano",
        "StateOrProvince": "PN",
        "CountryID": 112,
        "Latitude": 46.009373,
        "Longitude": 12.617616,
        "RelatedURL": "https://www.forumelettrico.it/forum/nuova-colonnina-t8558.html",
        "DistanceUnit": 0
    },
    "Connections": [
        {
            "ID": 232435,
            "ConnectionTypeID": 25,
            "StatusTypeID": 50,
            "LevelID": 2,
            "PowerKW": 22,
            "CurrentTypeID": 20,
            "Quantity": 2
        }
    ],
    "NumberOfPoints": 1,
    "StatusTypeID": 50,
    "DateLastStatusUpdate": "2020-10-20T16:56:00Z",
    "DataQualityLevel": 1,
    "DateCreated": "2020-07-14T14:17:00Z",
    "SubmissionStatusTypeID": 200
}