{
    "IsRecentlyVerified": false,
    "ID": 9297,
    "UUID": "5FBA9FCA-A2BB-474B-9E0F-D57F59081B6A",
    "DataProviderID": 15,
    "DataProvidersReference": "14099",
    "OperatorID": 5,
    "AddressInfo": {
        "ID": 9194,
        "Title": "1621 Broadway",
        "AddressLine1": "1621 Broadway",
        "Town": "Kansas City",
        "StateOrProvince": "Missouri",
        "Postcode": "64105",
        "CountryID": 2,
        "Latitude": 39.09358978,
        "Longitude": -94.58750916,
        "ContactTelephone1": "",
        "RelatedURL": "http://carstations.com/14099",
        "DistanceUnit": 0
    },
    "Connections": [
        {
            "ID": 7011,
            "ConnectionTypeID": 1,
            "Reference": "J1772",
            "LevelID": 2
        },
        {
            "ID": 8418,
            "ConnectionTypeID": 9,
            "Reference": "NEMA5",
            "LevelID": 1,
            "Quantity": 1
        }
    ],
    "StatusTypeID": 0,
    "DateLastStatusUpdate": "2017-11-04T14:04:00Z",
    "DataQualityLevel": 2,
    "DateCreated": "2012-02-08T14:36:00Z",
    "SubmissionStatusTypeID": 100
}