{
    "IsRecentlyVerified": false,
    "ID": 130864,
    "UUID": "ADED7E9C-3162-4B14-BFB2-16D27807F3EF",
    "DataProviderID": 1,
    "OperatorID": 88,
    "UsageTypeID": 4,
    "AddressInfo": {
        "ID": 131210,
        "Title": "Greenway Galeria Metropolia Gdańsk",
        "AddressLine1": "Jana Kilińskiego 4",
        "Town": "Gdańsk",
        "Postcode": "80-452",
        "CountryID": 179,
        "Latitude": 54.383141,
        "Longitude": 18.605038,
        "ContactTelephone1": "+48583251077",
        "AccessComments": "Wjazd na parking Podziemny od ulicy Kilińskiego. Ładowarka znajduje się na poziomie \"0\" w lewej części parkingu naprzeciwko wejścia do Galerii. / Entrance to the underground car park from Kilinskiego street. The charger is located on the \"0\" level in the left part of the car park opposite the entrance to the Gallery.",
        "RelatedURL": "https://greenwaypolska.pl/",
        "DistanceUnit": 0
    },
    "Connections": [
        {
            "ID": 183247,
            "ConnectionTypeID": 2,
            "StatusTypeID": 50,
            "LevelID": 3,
            "PowerKW": 60,
            "CurrentTypeID": 30,
            "Quantity": 1
        },
        {
            "ID": 183248,
            "ConnectionTypeID": 33,
            "StatusTypeID": 50,
            "LevelID": 3,
            "PowerKW": 60,
            "CurrentTypeID": 30,
            "Quantity": 1
        },
        {
            "ID": 183249,
            "ConnectionTypeID": 1036,
            "StatusTypeID": 50,
            "LevelID": 3,
            "Amps": 63,
            "Voltage": 400,
            "PowerKW": 43,
            "CurrentTypeID": 20,
            "Quantity": 1
        }
    ],
    "NumberOfPoints": 3,
    "StatusTypeID": 50,
    "DateLastStatusUpdate": "2019-08-24T09:50:00Z",
    "DataQualityLevel": 1,
    "DateCreated": "2019-08-22T08:11:00Z",
    "SubmissionStatusTypeID": 200
}