{
    "UserComments": [
        {
            "ID": 23555,
            "ChargePointID": 170399,
            "CommentTypeID": 10,
            "UserName": "Robert Seemueller",
            "Rating": 5,
            "DateCreated": "2020-11-26T05:37:47.203Z",
            "User": {
                "ID": 19108,
                "Username": "Robert Seemueller"
            },
            "CheckinStatusTypeID": 140,
            "IsActionedByEditor": false
        },
        {
            "ID": 23554,
            "ChargePointID": 170399,
            "CommentTypeID": 10,
            "UserName": "Robert Seemueller",
            "DateCreated": "2020-11-26T05:37:14.19Z",
            "User": {
                "ID": 19108,
                "Username": "Robert Seemueller"
            },
            "CheckinStatusTypeID": 140,
            "IsActionedByEditor": false
        }
    ],
    "MediaItems": [
        {
            "ID": 25584,
            "ChargePointID": 170399,
            "ItemURL": "https://s3-ap-southeast-2.amazonaws.com/openchargemap/images/US/OCM170399/OCM-170399.orig.2020112605364042.jpg",
            "ItemThumbnailURL": "https://s3-ap-southeast-2.amazonaws.com/openchargemap/images/US/OCM170399/OCM-170399.thmb.2020112605364042.jpg",
            "Comment": "",
            "IsEnabled": true,
            "IsVideo": false,
            "IsFeaturedItem": false,
            "IsExternalResource": false,
            "User": {
                "ID": 19108,
                "Username": "Robert Seemueller"
            },
            "DateCreated": "2020-11-26T05:37:00Z"
        }
    ],
    "IsRecentlyVerified": false,
    "ID": 170399,
    "UUID": "5C85C55A-ABF0-4D1E-8CDC-3318F5CC2988",
    "DataProviderID": 1,
    "OperatorID": 59,
    "UsageTypeID": 1,
    "UsageCost": "$.35kWh ($.01kWh thru December 31,2020)",
    "AddressInfo": {
        "ID": 170758,
        "Title": "Top's Lagrangeville",
        "AddressLine1": "16 John J Wagner Way",
        "Town": "Lagrangeville",
        "StateOrProvince": "NY",
        "Postcode": "12540",
        "CountryID": 2,
        "Latitude": 41.6687875001233,
        "Longitude": -73.79481405472865,
        "AccessComments": "This is a DCFC Level 3 station",
        "DistanceUnit": 0
    },
    "Connections": [
        {
            "ID": 259939,
            "ConnectionTypeID": 32,
            "StatusTypeID": 50,
            "LevelID": 2,
            "Amps": 350,
            "Voltage": 1000,
            "PowerKW": 351,
            "Quantity": 4
        },
        {
            "ID": 259940,
            "ConnectionTypeID": 2,
            "StatusTypeID": 50,
            "LevelID": 2,
            "PowerKW": 100,
            "Quantity": 4
        }
    ],
    "NumberOfPoints": 4,
    "StatusTypeID": 50,
    "DateLastStatusUpdate": "2020-11-26T16:11:00Z",
    "DataQualityLevel": 1,
    "DateCreated": "2020-11-26T05:32:00Z",
    "SubmissionStatusTypeID": 200
}