{
    "IsRecentlyVerified": false,
    "ID": 65295,
    "UUID": "D8FB927D-AFFF-46DA-9E9B-F3CD5A947C69",
    "DataProviderID": 1,
    "OperatorID": 23,
    "OperatorsReference": "17087",
    "UsageTypeID": 1,
    "UsageCost": "Free",
    "AddressInfo": {
        "ID": 65641,
        "Title": "Quality Hotel Friends",
        "AddressLine1": "Råsta strandväg 1",
        "AddressLine2": "Norra Ritorp",
        "Town": "Solna",
        "StateOrProvince": "Solna",
        "Postcode": "169 56",
        "CountryID": 216,
        "Latitude": 59.372219001595,
        "Longitude": 18.0028719395434,
        "ContactTelephone1": "+4687057000",
        "AccessComments": "Tillgänglig för allmänheten! Informationen pa receptionen. Tesla Destination Charging location.",
        "RelatedURL": "http://www.qualityhotelfriends.se/",
        "DistanceUnit": 0
    },
    "Connections": [
        {
            "ID": 89912,
            "ConnectionTypeID": 30,
            "StatusTypeID": 50,
            "LevelID": 2,
            "Amps": 16,
            "Voltage": 400,
            "PowerKW": 11,
            "CurrentTypeID": 20,
            "Quantity": 1
        }
    ],
    "NumberOfPoints": 2,
    "StatusTypeID": 50,
    "DateLastStatusUpdate": "2019-05-22T05:29:00Z",
    "DataQualityLevel": 1,
    "DateCreated": "2016-04-26T09:17:00Z",
    "SubmissionStatusTypeID": 200
}