{
    "IsRecentlyVerified": false,
    "ID": 53325,
    "UUID": "BCAB2DA3-23F2-420E-AAE0-47531505E394",
    "DataProviderID": 2,
    "DataProvidersReference": "69701",
    "OperatorID": 5,
    "UsageTypeID": 1,
    "AddressInfo": {
        "ID": 53671,
        "Title": "RM",
        "AddressLine1": "Reed St",
        "Town": "Basalt",
        "StateOrProvince": "CO",
        "Postcode": "81621",
        "CountryID": 2,
        "Latitude": 39.3867001,
        "Longitude": -107.0827013,
        "ContactTelephone1": "888-758-4389",
        "AccessComments": "24 hours daily",
        "RelatedURL": "http://www.chargepoint.com/",
        "DistanceUnit": 0
    },
    "Connections": [
        {
            "ID": 66438,
            "ConnectionTypeID": 1,
            "LevelID": 2,
            "Amps": 16,
            "Voltage": 230,
            "PowerKW": 3,
            "CurrentTypeID": 10,
            "Quantity": 2
        }
    ],
    "DateLastStatusUpdate": "2019-04-06T05:04:00Z",
    "DataQualityLevel": 3,
    "DateCreated": "2015-09-20T11:18:00Z",
    "SubmissionStatusTypeID": 100
}