{
    "MediaItems": [
        {
            "ID": 26006,
            "ChargePointID": 165297,
            "ItemURL": "https://s3-ap-southeast-2.amazonaws.com/openchargemap/images/GR/OCM165297/OCM-165297.orig.2020122910033106.jpg",
            "ItemThumbnailURL": "https://s3-ap-southeast-2.amazonaws.com/openchargemap/images/GR/OCM165297/OCM-165297.thmb.2020122910033106.jpg",
            "Comment": "",
            "IsEnabled": true,
            "IsVideo": false,
            "IsFeaturedItem": false,
            "IsExternalResource": false,
            "User": {
                "ID": 15962,
                "Username": "thanar"
            },
            "DateCreated": "2020-12-29T10:04:00Z"
        },
        {
            "ID": 26004,
            "ChargePointID": 165297,
            "ItemURL": "https://s3-ap-southeast-2.amazonaws.com/openchargemap/images/GR/OCM165297/OCM-165297.orig.2020122910025389.jpg",
            "ItemThumbnailURL": "https://s3-ap-southeast-2.amazonaws.com/openchargemap/images/GR/OCM165297/OCM-165297.thmb.2020122910025389.jpg",
            "Comment": "",
            "IsEnabled": true,
            "IsVideo": false,
            "IsFeaturedItem": false,
            "IsExternalResource": false,
            "User": {
                "ID": 15962,
                "Username": "thanar"
            },
            "DateCreated": "2020-12-29T10:03:00Z"
        },
        {
            "ID": 26005,
            "ChargePointID": 165297,
            "ItemURL": "https://s3-ap-southeast-2.amazonaws.com/openchargemap/images/GR/OCM165297/OCM-165297.orig.2020122910031341.jpg",
            "ItemThumbnailURL": "https://s3-ap-southeast-2.amazonaws.com/openchargemap/images/GR/OCM165297/OCM-165297.thmb.2020122910031341.jpg",
            "Comment": "",
            "IsEnabled": true,
            "IsVideo": false,
            "IsFeaturedItem": false,
            "IsExternalResource": false,
            "User": {
                "ID": 15962,
                "Username": "thanar"
            },
            "DateCreated": "2020-12-29T10:03:00Z"
        }
    ],
    "IsRecentlyVerified": false,
    "ID": 165297,
    "UUID": "40FCE6D1-DC4C-4677-AB10-14F079886CC7",
    "DataProviderID": 1,
    "OperatorID": 3426,
    "UsageTypeID": 4,
    "UsageCost": "per Blink Charging Europe (free as of Dec 2020)",
    "AddressInfo": {
        "ID": 165656,
        "Title": "KAOIL Derveni",
        "AddressLine1": "",
        "Town": "Thessaloniki",
        "CountryID": 90,
        "Latitude": 40.7114193200583,
        "Longitude": 22.95615413655321,
        "AccessComments": "Blink card or Blink app needed to initiate charge.",
        "RelatedURL": "https://blinkcharging.gr",
        "DistanceUnit": 0
    },
    "Connections": [
        {
            "ID": 236990,
            "ConnectionTypeID": 1036,
            "StatusTypeID": 50,
            "LevelID": 2,
            "Amps": 16,
            "Voltage": 230,
            "PowerKW": 11,
            "CurrentTypeID": 20,
            "Quantity": 2
        }
    ],
    "NumberOfPoints": 1,
    "StatusTypeID": 50,
    "DateLastStatusUpdate": "2021-01-04T20:04:00Z",
    "DataQualityLevel": 1,
    "DateCreated": "2020-08-26T17:11:00Z",
    "SubmissionStatusTypeID": 200
}