{
    "IsRecentlyVerified": false,
    "ID": 137205,
    "UUID": "F75C845C-C235-425B-BF7C-052777BC23DE",
    "DataProviderID": 2,
    "DataProvidersReference": "95387",
    "OperatorID": 9,
    "UsageTypeID": 2,
    "AddressInfo": {
        "ID": 137551,
        "Title": "Soleste West Gables II",
        "AddressLine1": "2001 SW 67th Avenue",
        "Town": "Miami",
        "StateOrProvince": "FL",
        "Postcode": "33155",
        "CountryID": 2,
        "Latitude": 25.751773,
        "Longitude": -80.303556,
        "ContactTelephone1": "888-998-2546",
        "AccessComments": "MON: 24 hours | TUE: 24 hours | WED: 24 hours | THU: 24 hours | FRI: 24 hours | SAT: 24 hours | SUN: 24 hours",
        "RelatedURL": "http://www.blinkcharging.com/",
        "DistanceUnit": 0
    },
    "Connections": [
        {
            "ID": 192072,
            "ConnectionTypeID": 1,
            "LevelID": 2,
            "Amps": 16,
            "Voltage": 230,
            "PowerKW": 3,
            "CurrentTypeID": 10,
            "Quantity": 2
        }
    ],
    "StatusTypeID": 50,
    "DateLastStatusUpdate": "2019-12-24T09:04:00Z",
    "DataQualityLevel": 3,
    "DateCreated": "2019-12-24T09:04:00Z",
    "SubmissionStatusTypeID": 100
}