{
    "IsRecentlyVerified": false,
    "ID": 154823,
    "UUID": "36FE7160-5073-4DCA-A2BF-F0ACEBCBDE2C",
    "DataProviderID": 1,
    "OperatorID": 32,
    "UsageTypeID": 5,
    "UsageCost": "Contactless:£0.30/kWh;min £1.50; Polar Plus:£0.15/kWh",
    "AddressInfo": {
        "ID": 155176,
        "Title": "Frogshole Farm Pub Car-Park",
        "AddressLine1": "Redgrave Drive",
        "Town": "West Sussex",
        "StateOrProvince": "West Sussex",
        "Postcode": "RH10 7QF",
        "CountryID": 1,
        "Latitude": 51.108997,
        "Longitude": -0.147659,
        "DistanceUnit": 0
    },
    "Connections": [
        {
            "ID": 217870,
            "ConnectionTypeID": 33,
            "StatusTypeID": 50,
            "LevelID": 3,
            "PowerKW": 50,
            "CurrentTypeID": 30,
            "Quantity": 1
        },
        {
            "ID": 217871,
            "ConnectionTypeID": 2,
            "StatusTypeID": 50,
            "LevelID": 3,
            "PowerKW": 50,
            "CurrentTypeID": 30,
            "Quantity": 1
        },
        {
            "ID": 217872,
            "ConnectionTypeID": 1036,
            "StatusTypeID": 50,
            "LevelID": 3,
            "Amps": 63,
            "Voltage": 400,
            "PowerKW": 43,
            "CurrentTypeID": 20,
            "Quantity": 1
        }
    ],
    "NumberOfPoints": 1,
    "StatusTypeID": 50,
    "DateLastStatusUpdate": "2020-09-30T09:46:00Z",
    "DataQualityLevel": 1,
    "DateCreated": "2020-03-19T12:16:00Z",
    "SubmissionStatusTypeID": 200
}