{
    "IsRecentlyVerified": false,
    "ID": 30840,
    "UUID": "43751615-FC91-42F7-AA15-654C8EAF9483",
    "DataProviderID": 1,
    "DataProvidersReference": "1259",
    "AddressInfo": {
        "ID": 31186,
        "Title": "Frøland kraftverk, Samnanger",
        "AddressLine1": "Kvitingsvegen 85",
        "Town": "TYSSE",
        "StateOrProvince": "Vestland",
        "Postcode": "5650",
        "CountryID": 168,
        "Latitude": 60.38442,
        "Longitude": 5.80646,
        "AccessComments": "",
        "DistanceUnit": 0
    },
    "Connections": [
        {
            "ID": 34069,
            "ConnectionTypeID": 0,
            "Reference": "1",
            "LevelID": 2,
            "Amps": 16,
            "Voltage": 230,
            "PowerKW": 3.7,
            "Comments": "Mode 1"
        },
        {
            "ID": 89013,
            "ConnectionTypeID": 0,
            "Reference": "2",
            "LevelID": 2,
            "Amps": 16,
            "Voltage": 230,
            "PowerKW": 3.7,
            "Comments": "Mode 1"
        }
    ],
    "NumberOfPoints": 2,
    "DateLastStatusUpdate": "2020-05-26T08:24:00Z",
    "DataQualityLevel": 2,
    "DateCreated": "2014-12-09T09:01:00Z",
    "SubmissionStatusTypeID": 100
}