{
    "IsRecentlyVerified": false,
    "ID": 74309,
    "UUID": "415A18B4-67F2-490B-9DD7-DD6EADD1FAF0",
    "DataProviderID": 1,
    "OperatorID": 105,
    "UsageTypeID": 4,
    "UsageCost": "Free",
    "AddressInfo": {
        "ID": 74655,
        "Title": "Parkplatz Schloß Salder",
        "AddressLine1": "Museumstraße 34",
        "AddressLine2": "",
        "Town": "Salzgitter",
        "StateOrProvince": "Salzgitter",
        "Postcode": "38229",
        "CountryID": 87,
        "Latitude": 52.135981974332445,
        "Longitude": 10.336651283992063,
        "ContactTelephone1": "+49 5341 408111",
        "ContactTelephone2": "",
        "ContactEmail": "",
        "AccessComments": "24/7 nutzbare Ladesäule vor der Toreinfahrt zum Schloß in der Nähe der Bushaltestelle. Zwei nicht reservierte Parkplätze. Freischaltung über RWE ekWh / eCharge App möglich, Ladepunkte BB-9171-8 und BB9183-9.",
        "RelatedURL": "http://www.wevg.com/privatkunden/stromtanken/",
        "DistanceUnit": 0
    },
    "Connections": [
        {
            "ID": 106860,
            "ConnectionTypeID": 25,
            "StatusTypeID": 50,
            "LevelID": 2,
            "Amps": 32,
            "Voltage": 400,
            "PowerKW": 22,
            "CurrentTypeID": 20,
            "Quantity": 2
        }
    ],
    "NumberOfPoints": 2,
    "GeneralComments": "Betreiber ist die WEVG Salzgitter",
    "StatusTypeID": 50,
    "DateLastStatusUpdate": "2017-03-10T09:01:00Z",
    "DataQualityLevel": 1,
    "DateCreated": "2016-11-30T06:51:00Z",
    "SubmissionStatusTypeID": 200
}