{
    "IsRecentlyVerified": false,
    "ID": 107009,
    "UUID": "272234E3-DCCD-4F7E-B128-0236BCB47EC2",
    "DataProviderID": 1,
    "OperatorID": 45,
    "UsageTypeID": 1,
    "AddressInfo": {
        "ID": 107355,
        "Title": "Klindwort",
        "AddressLine1": "Auguststraße",
        "Town": "Bad Schwartau",
        "StateOrProvince": "Ostholstein",
        "Postcode": "23611",
        "CountryID": 87,
        "Latitude": 53.917484745348666,
        "Longitude": 10.697706678210807,
        "ContactTelephone1": "+49 451 2925080",
        "AccessComments": "24/7 nutzbare blaugelbe Ladesäule auf dem Parkplatz beim Reformhaus und Klindwort Sanitätshaus. Daneben Werksverkauf der Schwartauer Marmeladenwerke.",
        "RelatedURL": "http://www.klindwort.de/",
        "DistanceUnit": 0
    },
    "Connections": [
        {
            "ID": 150858,
            "ConnectionTypeID": 25,
            "StatusTypeID": 50,
            "LevelID": 2,
            "Amps": 32,
            "Voltage": 400,
            "PowerKW": 22,
            "CurrentTypeID": 20,
            "Quantity": 2
        }
    ],
    "NumberOfPoints": 2,
    "StatusTypeID": 50,
    "DateLastStatusUpdate": "2018-07-13T06:27:00Z",
    "DataQualityLevel": 1,
    "DateCreated": "2018-07-13T06:27:00Z",
    "SubmissionStatusTypeID": 200
}