{
    "MediaItems": [
        {
            "ID": 23788,
            "ChargePointID": 162234,
            "ItemURL": "https://s3-ap-southeast-2.amazonaws.com/openchargemap/images/AT/OCM162234/OCM-162234.orig.2020080309434005.jpg",
            "ItemThumbnailURL": "https://s3-ap-southeast-2.amazonaws.com/openchargemap/images/AT/OCM162234/OCM-162234.thmb.2020080309434005.jpg",
            "Comment": "",
            "IsEnabled": true,
            "IsVideo": false,
            "IsFeaturedItem": false,
            "IsExternalResource": false,
            "User": {
                "ID": 26760,
                "Username": "interssl.com"
            },
            "DateCreated": "2020-08-03T09:44:00Z"
        },
        {
            "ID": 23789,
            "ChargePointID": 162234,
            "ItemURL": "https://s3-ap-southeast-2.amazonaws.com/openchargemap/images/AT/OCM162234/OCM-162234.orig.2020080309435217.jpg",
            "ItemThumbnailURL": "https://s3-ap-southeast-2.amazonaws.com/openchargemap/images/AT/OCM162234/OCM-162234.thmb.2020080309435217.jpg",
            "Comment": "",
            "IsEnabled": true,
            "IsVideo": false,
            "IsFeaturedItem": false,
            "IsExternalResource": false,
            "User": {
                "ID": 26760,
                "Username": "interssl.com"
            },
            "DateCreated": "2020-08-03T09:44:00Z"
        },
        {
            "ID": 23785,
            "ChargePointID": 162234,
            "ItemURL": "https://s3-ap-southeast-2.amazonaws.com/openchargemap/images/AT/OCM162234/OCM-162234.orig.2020080309430494.jpg",
            "ItemThumbnailURL": "https://s3-ap-southeast-2.amazonaws.com/openchargemap/images/AT/OCM162234/OCM-162234.thmb.2020080309430494.jpg",
            "Comment": "",
            "IsEnabled": true,
            "IsVideo": false,
            "IsFeaturedItem": false,
            "IsExternalResource": false,
            "User": {
                "ID": 26760,
                "Username": "interssl.com"
            },
            "DateCreated": "2020-08-03T09:43:00Z"
        },
        {
            "ID": 23786,
            "ChargePointID": 162234,
            "ItemURL": "https://s3-ap-southeast-2.amazonaws.com/openchargemap/images/AT/OCM162234/OCM-162234.orig.2020080309431537.jpg",
            "ItemThumbnailURL": "https://s3-ap-southeast-2.amazonaws.com/openchargemap/images/AT/OCM162234/OCM-162234.thmb.2020080309431537.jpg",
            "Comment": "",
            "IsEnabled": true,
            "IsVideo": false,
            "IsFeaturedItem": false,
            "IsExternalResource": false,
            "User": {
                "ID": 26760,
                "Username": "interssl.com"
            },
            "DateCreated": "2020-08-03T09:43:00Z"
        },
        {
            "ID": 23787,
            "ChargePointID": 162234,
            "ItemURL": "https://s3-ap-southeast-2.amazonaws.com/openchargemap/images/AT/OCM162234/OCM-162234.orig.2020080309432649.jpg",
            "ItemThumbnailURL": "https://s3-ap-southeast-2.amazonaws.com/openchargemap/images/AT/OCM162234/OCM-162234.thmb.2020080309432649.jpg",
            "Comment": "",
            "IsEnabled": true,
            "IsVideo": false,
            "IsFeaturedItem": false,
            "IsExternalResource": false,
            "User": {
                "ID": 26760,
                "Username": "interssl.com"
            },
            "DateCreated": "2020-08-03T09:43:00Z"
        }
    ],
    "IsRecentlyVerified": false,
    "ID": 162234,
    "UUID": "B0CF9492-FADD-4768-B0B0-F41F33089910",
    "DataProviderID": 1,
    "OperatorID": 3320,
    "UsageTypeID": 1,
    "UsageCost": "paid",
    "AddressInfo": {
        "ID": 162591,
        "Title": "MPREIS",
        "AddressLine1": "Michael-Lung-Weg 1",
        "Town": "Gemeinde Silz",
        "StateOrProvince": "Bezirk Imst",
        "Postcode": "6424",
        "CountryID": 19,
        "Latitude": 47.27002420241925,
        "Longitude": 10.941322016502454,
        "RelatedURL": "https://da-emobil.at/",
        "DistanceUnit": 0
    },
    "Connections": [
        {
            "ID": 233481,
            "ConnectionTypeID": 25,
            "StatusTypeID": 50,
            "LevelID": 2,
            "Amps": 32,
            "PowerKW": 22,
            "CurrentTypeID": 20,
            "Quantity": 2
        }
    ],
    "NumberOfPoints": 2,
    "StatusTypeID": 50,
    "DateLastStatusUpdate": "2020-08-04T09:29:00Z",
    "DataQualityLevel": 1,
    "DateCreated": "2020-08-03T09:43:00Z",
    "SubmissionStatusTypeID": 200
}