{
    "IsRecentlyVerified": false,
    "ID": 35358,
    "UUID": "6B170020-038E-4A15-83AD-F1C9BC383B15",
    "DataProviderID": 26,
    "DataProvidersReference": "55617",
    "OperatorID": 180,
    "OperatorsReference": "Alfen GDH2521",
    "UsageCost": "0.00 jaarabonnement",
    "AddressInfo": {
        "ID": 35704,
        "Title": "Laan van Wateringse Veld 191",
        "AddressLine1": "Laan van Wateringse Veld 191",
        "Town": "Den Haag",
        "Postcode": "2548 BL",
        "CountryID": 159,
        "Latitude": 52.033455,
        "Longitude": 4.284304,
        "ContactTelephone1": "036 - 549 34 00",
        "RelatedURL": "http://www.icu-charging-stations.com/",
        "DistanceUnit": 0
    },
    "Connections": [
        {
            "ID": 38869,
            "ConnectionTypeID": 25,
            "LevelID": 2,
            "PowerKW": 11,
            "CurrentTypeID": 10
        },
        {
            "ID": 47830,
            "ConnectionTypeID": 25,
            "LevelID": 2,
            "PowerKW": 11,
            "CurrentTypeID": 10
        }
    ],
    "NumberOfPoints": 1,
    "StatusTypeID": 50,
    "DateLastStatusUpdate": "2016-06-04T02:44:00Z",
    "DataQualityLevel": 3,
    "DateCreated": "2015-01-09T06:04:00Z",
    "SubmissionStatusTypeID": 100
}