{
    "IsRecentlyVerified": false,
    "ID": 27304,
    "UUID": "F1F41279-0DD9-4AB7-80B3-C5A39FB49BB0",
    "DataProviderID": 2,
    "DataProvidersReference": "62273",
    "OperatorID": 5,
    "UsageTypeID": 1,
    "AddressInfo": {
        "ID": 27650,
        "Title": "BMW NASHVILLE",
        "AddressLine1": "4013 Armory Oaks Dr",
        "Town": "Nashville",
        "StateOrProvince": "TN",
        "Postcode": "37204",
        "CountryID": 2,
        "Latitude": 36.104589,
        "Longitude": -86.7610327,
        "ContactTelephone1": "888-758-4389",
        "AccessComments": "24 hours daily",
        "RelatedURL": "http://www.chargepoint.com/",
        "DistanceUnit": 0
    },
    "Connections": [
        {
            "ID": 29907,
            "ConnectionTypeID": 1,
            "LevelID": 2,
            "Amps": 16,
            "Voltage": 230,
            "PowerKW": 3,
            "CurrentTypeID": 10,
            "Quantity": 2
        }
    ],
    "DateLastStatusUpdate": "2019-04-06T04:02:00Z",
    "DataQualityLevel": 3,
    "DateCreated": "2014-11-28T03:37:00Z",
    "SubmissionStatusTypeID": 100
}