{
    "IsRecentlyVerified": false,
    "ID": 151163,
    "UUID": "3B8B82CB-D3F5-495F-891A-1007A01FE2C5",
    "DataProviderID": 28,
    "DataProvidersReference": "FR*A16*P*WIIZ*78*_*_*_",
    "UsageTypeID": 5,
    "AddressInfo": {
        "ID": 151516,
        "Title": "Collongues Place du Château",
        "AddressLine1": "Place du Château",
        "CountryID": 80,
        "Latitude": 43.888893,
        "Longitude": 6.863265,
        "AccessComments": "24h/24",
        "DistanceUnit": 0
    },
    "Connections": [
        {
            "ID": 210855,
            "ConnectionTypeID": 28,
            "StatusTypeID": 50,
            "LevelID": 2,
            "PowerKW": 22,
            "CurrentTypeID": 10
        },
        {
            "ID": 210856,
            "ConnectionTypeID": 1036,
            "StatusTypeID": 50,
            "LevelID": 2,
            "PowerKW": 22,
            "CurrentTypeID": 20
        },
        {
            "ID": 240862,
            "ConnectionTypeID": 28,
            "StatusTypeID": 50,
            "LevelID": 2,
            "PowerKW": 22,
            "CurrentTypeID": 10
        },
        {
            "ID": 240863,
            "ConnectionTypeID": 1036,
            "StatusTypeID": 50,
            "LevelID": 2,
            "PowerKW": 22,
            "CurrentTypeID": 20
        }
    ],
    "GeneralComments": "badge, appli et QR code",
    "StatusTypeID": 50,
    "DateLastStatusUpdate": "2020-08-27T05:11:00Z",
    "DataQualityLevel": 2,
    "DateCreated": "2020-03-15T10:53:00Z",
    "SubmissionStatusTypeID": 100
}