{
    "IsRecentlyVerified": false,
    "ID": 124360,
    "UUID": "87C274D8-F41E-49BE-8D86-E9764486175C",
    "DataProviderID": 2,
    "DataProvidersReference": "78640",
    "UsageTypeID": 2,
    "AddressInfo": {
        "ID": 124706,
        "Title": "Amy's Kitchen Corporate Office",
        "AddressLine1": "1650 Corporate Cir",
        "Town": "Petaluma",
        "StateOrProvince": "CA",
        "Postcode": "94954",
        "CountryID": 2,
        "Latitude": 38.230909,
        "Longitude": -122.600796,
        "ContactTelephone1": "",
        "AccessComments": "",
        "RelatedURL": "",
        "DistanceUnit": 0
    },
    "Connections": [
        {
            "ID": 174449,
            "ConnectionTypeID": 1,
            "LevelID": 2,
            "Amps": 16,
            "Voltage": 230,
            "PowerKW": 3.7,
            "CurrentTypeID": 10,
            "Quantity": 6
        }
    ],
    "DateLastStatusUpdate": "2020-06-26T02:59:00Z",
    "DataQualityLevel": 3,
    "DateCreated": "2019-04-06T05:03:00Z",
    "SubmissionStatusTypeID": 100
}