{
    "UserComments": [
        {
            "ID": 22926,
            "ChargePointID": 99715,
            "CommentTypeID": 10,
            "UserName": "sdlra1",
            "Comment": "Starbucks and Shell Garage here too ",
            "Rating": 4,
            "DateCreated": "2020-07-18T13:21:09.55Z",
            "User": {
                "ID": 6716,
                "Username": "sdlra1"
            },
            "CheckinStatusTypeID": 10,
            "IsActionedByEditor": false
        },
        {
            "ID": 22925,
            "ChargePointID": 99715,
            "CommentTypeID": 10,
            "UserName": "sdlra1",
            "Comment": "",
            "Rating": 4,
            "DateCreated": "2020-07-18T13:19:48.497Z",
            "User": {
                "ID": 6716,
                "Username": "sdlra1"
            },
            "CheckinStatusTypeID": 10,
            "IsActionedByEditor": false
        }
    ],
    "IsRecentlyVerified": false,
    "ID": 99715,
    "UUID": "76AF4DAF-9625-4664-9662-4EB53E84F502",
    "DataProviderID": 1,
    "OperatorID": 150,
    "OperatorsReference": "A3 Liphook Services Northbound",
    "UsageTypeID": 4,
    "UsageCost": "DC:£1.00 + £0.30/kWh; £10.00 overstay after 65 mins,AC:£0.50 + £0.30/kWh; £10.00 overstay after 245 mins",
    "AddressInfo": {
        "ID": 100061,
        "Title": "A3 Liphook Services Northbound",
        "AddressLine1": "A3 Liphook Services Northbound",
        "Town": "Liphook",
        "StateOrProvince": "Hampshire",
        "Postcode": "GU30 7TU",
        "CountryID": 1,
        "Latitude": 51.084133,
        "Longitude": -0.81948939,
        "DistanceUnit": 0
    },
    "Connections": [
        {
            "ID": 140887,
            "ConnectionTypeID": 25,
            "StatusTypeID": 50,
            "LevelID": 2,
            "Amps": 32,
            "Voltage": 400,
            "PowerKW": 22,
            "CurrentTypeID": 20,
            "Quantity": 1
        },
        {
            "ID": 140888,
            "ConnectionTypeID": 2,
            "StatusTypeID": 50,
            "LevelID": 3,
            "PowerKW": 50,
            "CurrentTypeID": 30,
            "Quantity": 1
        },
        {
            "ID": 140889,
            "ConnectionTypeID": 33,
            "StatusTypeID": 50,
            "LevelID": 3,
            "PowerKW": 50,
            "CurrentTypeID": 30,
            "Quantity": 1
        }
    ],
    "NumberOfPoints": 1,
    "StatusTypeID": 50,
    "DateLastStatusUpdate": "2020-07-18T13:21:00Z",
    "DataQualityLevel": 1,
    "DateCreated": "2018-02-02T06:33:00Z",
    "SubmissionStatusTypeID": 200
}