{
    "IsRecentlyVerified": false,
    "ID": 98079,
    "UUID": "25993A9B-3DA1-4D8B-9986-0318225B5959",
    "DataProviderID": 1,
    "OperatorID": 23,
    "OperatorsReference": "38097",
    "UsageTypeID": 4,
    "AddressInfo": {
        "ID": 98425,
        "Title": "Best Western Corvallis",
        "AddressLine1": "925 NW Garfield Ave",
        "Town": "Corvallis",
        "StateOrProvince": "Oregon",
        "Postcode": "97330",
        "CountryID": 2,
        "Latitude": 44.583596,
        "Longitude": -123.258703,
        "ContactTelephone1": "(541) 758-8571",
        "DistanceUnit": 0
    },
    "Connections": [
        {
            "ID": 138988,
            "ConnectionTypeID": 30,
            "StatusTypeID": 50,
            "LevelID": 2,
            "PowerKW": 16,
            "CurrentTypeID": 20,
            "Quantity": 3
        }
    ],
    "NumberOfPoints": 3,
    "GeneralComments": "3 Tesla Connectors, up to 16kW.Available for customers. Please see front desk.",
    "StatusTypeID": 50,
    "DateLastStatusUpdate": "2018-01-21T17:45:00Z",
    "DataQualityLevel": 1,
    "DateCreated": "2018-01-21T17:45:00Z",
    "SubmissionStatusTypeID": 200
}