{
    "MediaItems": [
        {
            "ID": 8530,
            "ChargePointID": 72671,
            "ItemURL": "https://s3-ap-southeast-2.amazonaws.com/openchargemap/images/GB/OCM72671/OCM-72671.orig.2016103112581452.jpg",
            "ItemThumbnailURL": "https://s3-ap-southeast-2.amazonaws.com/openchargemap/images/GB/OCM72671/OCM-72671.thmb.2016103112581452.jpg",
            "Comment": "",
            "IsEnabled": true,
            "IsVideo": false,
            "IsFeaturedItem": false,
            "IsExternalResource": false,
            "User": {
                "ID": 11980,
                "Username": "Romantic Hotel"
            },
            "DateCreated": "2016-10-31T12:58:00Z"
        },
        {
            "ID": 8529,
            "ChargePointID": 72671,
            "ItemURL": "https://s3-ap-southeast-2.amazonaws.com/openchargemap/images/GB/OCM72671/OCM-72671.orig.2016103112571503.jpg",
            "ItemThumbnailURL": "https://s3-ap-southeast-2.amazonaws.com/openchargemap/images/GB/OCM72671/OCM-72671.thmb.2016103112571503.jpg",
            "Comment": "",
            "IsEnabled": true,
            "IsVideo": false,
            "IsFeaturedItem": false,
            "IsExternalResource": false,
            "User": {
                "ID": 11980,
                "Username": "Romantic Hotel"
            },
            "DateCreated": "2016-10-31T12:57:00Z"
        },
        {
            "ID": 8528,
            "ChargePointID": 72671,
            "ItemURL": "https://s3-ap-southeast-2.amazonaws.com/openchargemap/images/GB/OCM72671/OCM-72671.orig.2016103112552417.jpg",
            "ItemThumbnailURL": "https://s3-ap-southeast-2.amazonaws.com/openchargemap/images/GB/OCM72671/OCM-72671.thmb.2016103112552417.jpg",
            "Comment": "",
            "IsEnabled": true,
            "IsVideo": false,
            "IsFeaturedItem": false,
            "IsExternalResource": false,
            "User": {
                "ID": 11980,
                "Username": "Romantic Hotel"
            },
            "DateCreated": "2016-10-31T12:56:00Z"
        }
    ],
    "IsRecentlyVerified": false,
    "ID": 72671,
    "UUID": "4798F1FD-14B1-4A01-B010-E24342EA80EA",
    "DataProviderID": 1,
    "OperatorID": 1,
    "UsageTypeID": 1,
    "UsageCost": "0",
    "AddressInfo": {
        "ID": 73017,
        "Title": "Hotel \"Romantic\"",
        "AddressLine1": "Kranto g. 24, Panevėžys",
        "Town": "Panevėžys",
        "Postcode": "35173",
        "CountryID": 131,
        "Latitude": 55.7337404,
        "Longitude": 24.3622077,
        "ContactTelephone1": "+370 616 16170",
        "ContactTelephone2": "+370 455 84860",
        "ContactEmail": "hotel@romantic.lt",
        "AccessComments": "Hotel is open 24/7. If you need any assistance please enter the hotel and talk to the reception or call +370 616 16170, +370 455 84860 www.romantic.lt, www.etnospa.lt. ",
        "RelatedURL": "http://www.romantic.lt/",
        "DistanceUnit": 0
    },
    "Connections": [
        {
            "ID": 104190,
            "ConnectionTypeID": 25,
            "StatusTypeID": 50,
            "LevelID": 2,
            "PowerKW": 22,
            "Quantity": 1
        }
    ],
    "NumberOfPoints": 1,
    "GeneralComments": "Hotel Romantic offers a free charging point for our customers. Station: Home Box 22kW, Mode 2/3, Scame (Type 2) and Schuko (220 socket). Hotel is open 24/7. If you need any assistance please enter the hotel and talk to the reception or call +370 616 16170, +370 455 84860 www.romantic.lt, www.etnospa.lt. \r\n\r\n While Your car is charging we offer:\r\n•\tto stay and have a good rest at our 4+ star hotel;\r\n•\thave a delicious meal in our restaurant or a cup of coffee;\r\n•\trelax in our unique ETNO- SPA center;\r\n•\tcharge your own battery in our gym;\r\n•\twalk through the old town of Panevezys and enjoy the beautiful view.  \r\n\r\nFor any additional information visit www.romantic.lt or call +370 616 16170, +370 455 84860\r\n",
    "StatusTypeID": 50,
    "DateLastStatusUpdate": "2016-11-23T19:56:00Z",
    "DataQualityLevel": 1,
    "DateCreated": "2016-10-31T12:48:00Z",
    "SubmissionStatusTypeID": 200
}