{
    "IsRecentlyVerified": false,
    "ID": 185206,
    "UUID": "01CD5945-AB45-44E5-BBB9-65DE26F6BD95",
    "DataProviderID": 29,
    "DataProvidersReference": "17947",
    "OperatorID": 69,
    "AddressInfo": {
        "ID": 185565,
        "Title": "An den Stücken 49",
        "AddressLine1": "An den Stücken 49",
        "Town": "Bargtheide",
        "Postcode": "22941",
        "CountryID": 87,
        "Latitude": 53.727023,
        "Longitude": 10.268763,
        "DistanceUnit": 0
    },
    "Connections": [
        {
            "ID": 294377,
            "ConnectionTypeID": 25,
            "StatusTypeID": 50,
            "LevelID": 2,
            "PowerKW": 22,
            "CurrentTypeID": 20
        },
        {
            "ID": 294378,
            "ConnectionTypeID": 25,
            "StatusTypeID": 50,
            "LevelID": 2,
            "PowerKW": 22,
            "CurrentTypeID": 20
        }
    ],
    "StatusTypeID": 50,
    "DateLastStatusUpdate": "2021-07-09T03:30:00Z",
    "MetadataValues": [
        {
            "ID": 17497,
            "MetadataFieldID": 4,
            "ItemValue": "Data from the German chargepoint registry provided by Bundesnetzagentur.de under the CC-BY 4.0 license"
        }
    ],
    "DataQualityLevel": 3,
    "DateCreated": "2021-07-08T10:06:00Z",
    "SubmissionStatusTypeID": 100
}