{
    "IsRecentlyVerified": false,
    "ID": 3459,
    "UUID": "B3D75F35-8EC6-4010-BB72-2D86932B73AB",
    "DataProviderID": 1,
    "OperatorID": 1,
    "AddressInfo": {
        "ID": 3460,
        "Title": "Spinx",
        "AddressLine1": "426 N US Highway 52",
        "Town": "Moncks Corner",
        "StateOrProvince": "SC",
        "Postcode": "29461",
        "CountryID": 2,
        "Latitude": 33.20432663,
        "Longitude": -79.98672485,
        "ContactTelephone1": "888-758-4389",
        "AccessComments": "Located on left side of building",
        "DistanceUnit": 0
    },
    "Connections": [],
    "NumberOfPoints": 1,
    "GeneralComments": "Cost To Charge: ChargePoint Access Hours: 24 Hr",
    "DateLastStatusUpdate": "2019-12-15T06:07:00Z",
    "DateCreated": "2010-02-28T00:00:00Z",
    "SubmissionStatusTypeID": 200
}