{
    "IsRecentlyVerified": false,
    "ID": 30188,
    "UUID": "50FB2567-2A78-4ABF-BAB0-8C183722FB29",
    "DataProviderID": 1,
    "DataProvidersReference": "VCT-00010",
    "OperatorID": 21,
    "UsageTypeID": 4,
    "UsageCost": "Mobi.E compatible card",
    "AddressInfo": {
        "ID": 30534,
        "Title": "VCT-00010",
        "AddressLine1": "Parque Empresarial de Lanheses",
        "Town": "Viana do Castelo",
        "StateOrProvince": "Viana do Castelo",
        "Postcode": "4925-403",
        "CountryID": 180,
        "Latitude": 41.746638,
        "Longitude": -8.688753,
        "RelatedURL": "http://www.mobie.pt",
        "DistanceUnit": 0
    },
    "Connections": [
        {
            "ID": 33173,
            "ConnectionTypeID": 25,
            "StatusTypeID": 50,
            "LevelID": 2,
            "Amps": 16,
            "Voltage": 230,
            "PowerKW": 3.7,
            "CurrentTypeID": 10,
            "Quantity": 2
        }
    ],
    "NumberOfPoints": 2,
    "StatusTypeID": 50,
    "DateLastStatusUpdate": "2020-09-20T13:45:00Z",
    "DataQualityLevel": 3,
    "DateCreated": "2014-11-29T14:48:00Z",
    "SubmissionStatusTypeID": 100
}