{
    "IsRecentlyVerified": false,
    "ID": 172359,
    "UUID": "B544BAC3-DD5C-4600-A5A0-73C30643F47C",
    "DataProviderID": 1,
    "OperatorID": 59,
    "UsageTypeID": 1,
    "AddressInfo": {
        "ID": 172718,
        "Title": "Elmore Marketplace",
        "AddressLine1": "4215 Elmore Ave, Davenport, Iowa, US, 52807 ",
        "Town": "Davenport",
        "StateOrProvince": "IA",
        "Postcode": "52807",
        "CountryID": 2,
        "Latitude": 41.562886,
        "Longitude": -90.523802,
        "RelatedURL": "https://www.midamericanenergy.com/electric-vehicle-fast-charging-network",
        "DistanceUnit": 0
    },
    "Connections": [
        {
            "ID": 263520,
            "ConnectionTypeID": 32,
            "StatusTypeID": 50,
            "LevelID": 3,
            "CurrentTypeID": 30,
            "Quantity": 1
        },
        {
            "ID": 263521,
            "ConnectionTypeID": 2,
            "StatusTypeID": 50,
            "LevelID": 3,
            "CurrentTypeID": 30,
            "Quantity": 1
        }
    ],
    "NumberOfPoints": 1,
    "StatusTypeID": 50,
    "DateLastStatusUpdate": "2021-07-28T06:51:00Z",
    "DataQualityLevel": 1,
    "DateCreated": "2021-01-31T03:44:00Z",
    "SubmissionStatusTypeID": 200
}