{
    "IsRecentlyVerified": false,
    "ID": 95674,
    "UUID": "A6476CF1-A68E-4C20-A4D9-7ED3B78EE555",
    "DataProviderID": 1,
    "OperatorID": 3301,
    "UsageTypeID": 4,
    "AddressInfo": {
        "ID": 96020,
        "Title": "Измайловское шоссе, д.71 корп.А",
        "AddressLine1": "Измайловское шоссе, д.71 корп.А",
        "Town": "Moscow",
        "Postcode": "105187",
        "CountryID": 185,
        "Latitude": 55.789821,
        "Longitude": 37.749625,
        "DistanceUnit": 0
    },
    "Connections": [
        {
            "ID": 135530,
            "ConnectionTypeID": 25,
            "StatusTypeID": 50,
            "LevelID": 2,
            "Amps": 32,
            "Voltage": 400,
            "PowerKW": 22,
            "CurrentTypeID": 20,
            "Quantity": 1
        },
        {
            "ID": 135531,
            "ConnectionTypeID": 28,
            "StatusTypeID": 50,
            "LevelID": 2,
            "Amps": 16,
            "Voltage": 230,
            "PowerKW": 3.6,
            "CurrentTypeID": 10,
            "Quantity": 1
        }
    ],
    "NumberOfPoints": 1,
    "StatusTypeID": 50,
    "DateLastStatusUpdate": "2017-11-19T11:23:00Z",
    "DataQualityLevel": 1,
    "DateCreated": "2017-11-19T11:22:00Z",
    "SubmissionStatusTypeID": 200
}