{
    "IsRecentlyVerified": false,
    "ID": 180565,
    "UUID": "1B43A998-DEDD-4292-9B58-DD20F776B66F",
    "DataProviderID": 29,
    "DataProvidersReference": "66",
    "AddressInfo": {
        "ID": 180924,
        "Title": "Goethestraße 40",
        "AddressLine1": "Goethestraße 40",
        "Town": "Mainz",
        "Postcode": "55118",
        "CountryID": 87,
        "Latitude": 50.011824,
        "Longitude": 8.255242,
        "DistanceUnit": 0
    },
    "Connections": [
        {
            "ID": 283792,
            "ConnectionTypeID": 25,
            "StatusTypeID": 50,
            "LevelID": 2,
            "PowerKW": 22,
            "CurrentTypeID": 20
        },
        {
            "ID": 283793,
            "ConnectionTypeID": 25,
            "StatusTypeID": 50,
            "LevelID": 2,
            "PowerKW": 22,
            "CurrentTypeID": 20
        }
    ],
    "StatusTypeID": 50,
    "DateLastStatusUpdate": "2021-07-09T03:18:00Z",
    "MetadataValues": [
        {
            "ID": 12859,
            "MetadataFieldID": 4,
            "ItemValue": "Data from the German chargepoint registry provided by Bundesnetzagentur.de under the CC-BY 4.0 license"
        }
    ],
    "DataQualityLevel": 3,
    "DateCreated": "2021-07-08T10:00:00Z",
    "SubmissionStatusTypeID": 100
}