{
    "UserComments": [
        {
            "ID": 10414,
            "ChargePointID": 7660,
            "CommentTypeID": 10,
            "UserName": "Someone_Just_",
            "Rating": 5,
            "DateCreated": "2016-05-14T20:15:46Z",
            "User": {
                "ID": 1107,
                "Username": "Someone_Just_"
            },
            "CheckinStatusTypeID": 10
        },
        {
            "ID": 9987,
            "ChargePointID": 7660,
            "CommentTypeID": 10,
            "UserName": "Someone_Just_",
            "Rating": 5,
            "DateCreated": "2016-03-25T14:48:33.087Z",
            "User": {
                "ID": 1107,
                "Username": "Someone_Just_"
            },
            "CheckinStatusTypeID": 140
        },
        {
            "ID": 4232,
            "ChargePointID": 7660,
            "CommentTypeID": 10,
            "UserName": "Someone_Just_",
            "Comment": "Working fine ( with dongle from the manager)",
            "Rating": 5,
            "DateCreated": "2015-04-13T20:46:14.013Z",
            "User": {
                "ID": 1107,
                "Username": "Someone_Just_"
            },
            "CheckinStatusTypeID": 10
        },
        {
            "ID": 387,
            "ChargePointID": 7660,
            "CommentTypeID": 10,
            "UserName": "Someone_Just_",
            "Comment": "You need a dongle from the manager to open the chargeport",
            "Rating": 4,
            "DateCreated": "2013-07-31T21:11:27.027Z",
            "User": {
                "ID": 1107,
                "Username": "Someone_Just_"
            },
            "CheckinStatusTypeID": 10,
            "IsActionedByEditor": false
        }
    ],
    "MediaItems": [
        {
            "ID": 29,
            "ChargePointID": 7660,
            "ItemURL": "https://s3-ap-southeast-2.amazonaws.com/openchargemap/images/BE/OCM7660/OCM-7660.orig.2013073121080365.jpg",
            "ItemThumbnailURL": "https://s3-ap-southeast-2.amazonaws.com/openchargemap/images/BE/OCM7660/OCM-7660.thmb.2013073121080365.jpg",
            "Comment": "",
            "IsEnabled": true,
            "IsVideo": false,
            "IsFeaturedItem": false,
            "IsExternalResource": false,
            "User": {
                "ID": 1107,
                "Username": "Someone_Just_"
            },
            "DateCreated": "2013-07-31T21:08:00Z"
        }
    ],
    "IsRecentlyVerified": false,
    "ID": 7660,
    "UUID": "7C191787-C952-4D28-BAA3-D2C8D2B0356F",
    "DataProviderID": 1,
    "OperatorID": 35,
    "UsageTypeID": 1,
    "UsageCost": "Free",
    "AddressInfo": {
        "ID": 7557,
        "Title": "McDonald's Burcht",
        "AddressLine1": "Pastoor Coplaan 116 ",
        "Town": "Zwijndrecht",
        "Postcode": "2070 ",
        "CountryID": 26,
        "Latitude": 51.2081699148708,
        "Longitude": 4.338471042915,
        "ContactTelephone1": "+32 (0)3.773.46.48",
        "AccessComments": " Openingsuren Maandag tem Zondag 11:00 AM - 11:00 PM\r\n",
        "RelatedURL": "http://mcdonalds.be/nl/",
        "DistanceUnit": 0
    },
    "Connections": [
        {
            "ID": 34634,
            "ConnectionTypeID": 28,
            "StatusTypeID": 50,
            "LevelID": 2,
            "Amps": 16,
            "Voltage": 230,
            "PowerKW": 3.5,
            "CurrentTypeID": 10,
            "Quantity": 1
        }
    ],
    "NumberOfPoints": 1,
    "GeneralComments": "You need a dongle from the manager to start and stop the charging",
    "DateLastConfirmed": "2011-10-30T20:17:00Z",
    "StatusTypeID": 50,
    "DateLastStatusUpdate": "2016-05-14T20:16:00Z",
    "DataQualityLevel": 1,
    "DateCreated": "2011-10-30T20:17:00Z",
    "SubmissionStatusTypeID": 200
}