{
    "IsRecentlyVerified": false,
    "ID": 65593,
    "UUID": "D03BE61E-A057-4A0B-8CA2-848943E1349C",
    "DataProviderID": 26,
    "DataProvidersReference": "84081",
    "OperatorID": 103,
    "OperatorsReference": "Allego NLALLEGO0006292",
    "UsageCost": "0.00 jaarabonnement",
    "AddressInfo": {
        "ID": 65939,
        "Title": "Vlamoven 15",
        "AddressLine1": "Vlamoven 15",
        "Town": "IJsselstein",
        "Postcode": "3402 SG",
        "CountryID": 159,
        "Latitude": 52.01965693,
        "Longitude": 5.05783822,
        "ContactTelephone1": "0800-3745337",
        "RelatedURL": "http://www.allego.eu/",
        "DistanceUnit": 0
    },
    "Connections": [
        {
            "ID": 90481,
            "ConnectionTypeID": 25,
            "LevelID": 2,
            "PowerKW": 11,
            "CurrentTypeID": 10
        },
        {
            "ID": 90482,
            "ConnectionTypeID": 25,
            "LevelID": 2,
            "PowerKW": 11,
            "CurrentTypeID": 10
        }
    ],
    "NumberOfPoints": 1,
    "StatusTypeID": 50,
    "DateLastStatusUpdate": "2016-06-04T02:44:00Z",
    "DataQualityLevel": 3,
    "DateCreated": "2016-04-27T09:41:00Z",
    "SubmissionStatusTypeID": 100
}