{
    "IsRecentlyVerified": false,
    "ID": 24014,
    "UUID": "42D9451C-57B3-4439-8552-31AA408650C3",
    "DataProviderID": 1,
    "OperatorID": 1,
    "UsageTypeID": 1,
    "AddressInfo": {
        "ID": 24359,
        "Title": "Renault Autopartners Mechelen",
        "AddressLine1": "62 Jubellaan",
        "Town": "Malines",
        "Postcode": "2800",
        "CountryID": 26,
        "Latitude": 51.007932479258,
        "Longitude": 4.4776314493006,
        "ContactTelephone1": "+(32)-(15)-(459999)",
        "AccessComments": "Accès à la borne aux horaires d'ouverture",
        "RelatedURL": "http://www.renault.com",
        "DistanceUnit": 0
    },
    "Connections": [
        {
            "ID": 26009,
            "ConnectionTypeID": 25,
            "StatusTypeID": 50,
            "LevelID": 2,
            "Amps": 32,
            "Voltage": 220,
            "PowerKW": 22,
            "CurrentTypeID": 20,
            "Quantity": 1
        }
    ],
    "NumberOfPoints": 1,
    "StatusTypeID": 50,
    "DateLastStatusUpdate": "2014-06-03T08:03:00Z",
    "DataQualityLevel": 1,
    "DateCreated": "2014-06-03T07:45:00Z",
    "SubmissionStatusTypeID": 200
}