{
    "UserComments": [
        {
            "ID": 16007,
            "ChargePointID": 84395,
            "CommentTypeID": 10,
            "UserName": "polianto",
            "Comment": "Nessuna informazione disponibile sulle modalità di utilizzo e nessun recapito da contattare indicato.",
            "Rating": 1,
            "DateCreated": "2017-03-05T16:55:35.647Z",
            "User": {
                "ID": 1606,
                "Username": "polianto"
            },
            "CheckinStatusTypeID": 40
        }
    ],
    "MediaItems": [
        {
            "ID": 10586,
            "ChargePointID": 84395,
            "ItemURL": "https://s3-ap-southeast-2.amazonaws.com/openchargemap/images/IT/OCM84395/OCM-84395.orig.2017030516532317.jpg",
            "ItemThumbnailURL": "https://s3-ap-southeast-2.amazonaws.com/openchargemap/images/IT/OCM84395/OCM-84395.thmb.2017030516532317.jpg",
            "Comment": "",
            "IsEnabled": true,
            "IsVideo": false,
            "IsFeaturedItem": false,
            "IsExternalResource": false,
            "User": {
                "ID": 1606,
                "Username": "polianto"
            },
            "DateCreated": "2017-03-05T16:54:00Z"
        },
        {
            "ID": 10587,
            "ChargePointID": 84395,
            "ItemURL": "https://s3-ap-southeast-2.amazonaws.com/openchargemap/images/IT/OCM84395/OCM-84395.orig.2017030516533891.jpg",
            "ItemThumbnailURL": "https://s3-ap-southeast-2.amazonaws.com/openchargemap/images/IT/OCM84395/OCM-84395.thmb.2017030516533891.jpg",
            "Comment": "",
            "IsEnabled": true,
            "IsVideo": false,
            "IsFeaturedItem": false,
            "IsExternalResource": false,
            "User": {
                "ID": 1606,
                "Username": "polianto"
            },
            "DateCreated": "2017-03-05T16:54:00Z"
        }
    ],
    "IsRecentlyVerified": false,
    "ID": 84395,
    "UUID": "AD8EA0D2-2ECF-41BA-B0CB-671EA1556581",
    "DataProviderID": 1,
    "OperatorID": 45,
    "UsageTypeID": 0,
    "AddressInfo": {
        "ID": 84741,
        "Title": "Mobility Loft eV-Now! Lab-U",
        "AddressLine1": "Via Pinacoteca, 7",
        "Town": "Lissone ",
        "StateOrProvince": "MB",
        "Postcode": "20851",
        "CountryID": 112,
        "Latitude": 45.60668686616965,
        "Longitude": 9.234677046817511,
        "ContactTelephone1": "+39 02 0061 4149",
        "RelatedURL": "http://www.ev-now.org/",
        "DistanceUnit": 0
    },
    "Connections": [
        {
            "ID": 119838,
            "ConnectionTypeID": 25,
            "StatusTypeID": 50,
            "LevelID": 2,
            "Amps": 16,
            "Voltage": 400,
            "PowerKW": 11,
            "CurrentTypeID": 20,
            "Quantity": 2
        }
    ],
    "NumberOfPoints": 2,
    "StatusTypeID": 50,
    "DateLastStatusUpdate": "2017-03-05T16:56:00Z",
    "DataQualityLevel": 1,
    "DateCreated": "2017-02-23T09:36:00Z",
    "SubmissionStatusTypeID": 200
}