{
    "IsRecentlyVerified": false,
    "ID": 104398,
    "UUID": "EBD3B408-495F-4294-82CE-E36AD642AAD7",
    "DataProviderID": 1,
    "OperatorID": 23,
    "OperatorsReference": "43200",
    "UsageTypeID": 4,
    "AddressInfo": {
        "ID": 104744,
        "Title": "University of Camerino",
        "AddressLine1": "Via A. d'Accorso",
        "Town": "16",
        "StateOrProvince": "Camerino",
        "Postcode": "62022",
        "CountryID": 112,
        "Latitude": 43.146709,
        "Longitude": 13.066367,
        "ContactTelephone1": "+39 345 118 0726",
        "DistanceUnit": 0
    },
    "Connections": [
        {
            "ID": 147393,
            "ConnectionTypeID": 30,
            "StatusTypeID": 50,
            "LevelID": 2,
            "Amps": 16,
            "Voltage": 400,
            "PowerKW": 11,
            "CurrentTypeID": 20,
            "Quantity": 1
        }
    ],
    "NumberOfPoints": 1,
    "GeneralComments": "1 Tesla Connector, up to 11kW.Available to the public. Please call ahead.",
    "StatusTypeID": 50,
    "DateLastStatusUpdate": "2018-10-03T23:42:00Z",
    "DataQualityLevel": 1,
    "DateCreated": "2018-05-20T05:29:00Z",
    "SubmissionStatusTypeID": 200
}