{
    "IsRecentlyVerified": false,
    "ID": 103632,
    "UUID": "8A2EAE3D-69A1-4E93-8426-0651EB516175",
    "DataProviderID": 1,
    "OperatorID": 23,
    "OperatorsReference": "42687",
    "UsageTypeID": 4,
    "AddressInfo": {
        "ID": 103978,
        "Title": "Avancher Hôtel & Lodge, Restaurant & Bar",
        "AddressLine1": "Avenue du Prariond",
        "Town": "Val-d'Isère",
        "Postcode": "73150",
        "CountryID": 80,
        "Latitude": 45.446745,
        "Longitude": 6.986112,
        "ContactTelephone1": "+33 4 79 06 02 00",
        "DistanceUnit": 0
    },
    "Connections": [
        {
            "ID": 146302,
            "ConnectionTypeID": 30,
            "StatusTypeID": 50,
            "LevelID": 2,
            "Amps": 32,
            "Voltage": 230,
            "PowerKW": 14,
            "CurrentTypeID": 20,
            "Quantity": 2
        }
    ],
    "NumberOfPoints": 2,
    "GeneralComments": "2 Tesla Connectors, up to 14kW.Available for customers. Please see front desk.",
    "StatusTypeID": 50,
    "DateLastStatusUpdate": "2018-10-03T14:17:00Z",
    "DataQualityLevel": 1,
    "DateCreated": "2018-05-05T05:45:00Z",
    "SubmissionStatusTypeID": 200
}