{
    "IsRecentlyVerified": false,
    "ID": 118112,
    "UUID": "18D9D0F5-A6DE-4F4A-B798-7B903E642530",
    "DataProviderID": 1,
    "OperatorID": 23,
    "OperatorsReference": "49272",
    "UsageTypeID": 4,
    "AddressInfo": {
        "ID": 118458,
        "Title": "Holiday Village Tatralandia",
        "AddressLine1": "Raztocka 21",
        "Town": "Liptovsky Mikulas",
        "Postcode": "031 05",
        "CountryID": 204,
        "Latitude": 49.107658,
        "Longitude": 19.57362,
        "ContactTelephone1": " +42 1445 561011",
        "DistanceUnit": 0
    },
    "Connections": [
        {
            "ID": 167131,
            "ConnectionTypeID": 30,
            "StatusTypeID": 50,
            "LevelID": 2,
            "Amps": 16,
            "Voltage": 400,
            "PowerKW": 11,
            "CurrentTypeID": 20,
            "Quantity": 1
        }
    ],
    "NumberOfPoints": 1,
    "GeneralComments": "1 Tesla Connector, up to 11kW.Available for customers. Self park.",
    "StatusTypeID": 50,
    "DateLastStatusUpdate": "2019-03-14T23:35:00Z",
    "DataQualityLevel": 1,
    "DateCreated": "2019-03-14T23:35:00Z",
    "SubmissionStatusTypeID": 200
}