{
    "IsRecentlyVerified": false,
    "ID": 59108,
    "UUID": "FAEE7213-8F7C-4E21-9C59-56C7EB6EF3CE",
    "DataProviderID": 1,
    "OperatorID": 235,
    "UsageTypeID": 4,
    "UsageCost": "0",
    "AddressInfo": {
        "ID": 59454,
        "Title": "SWD Hansastern*C / Fritz-Vomfelde-Straße 2",
        "AddressLine1": "Fritz-Vomfelde-Straße 2",
        "AddressLine2": "Lörick",
        "Town": "Düsseldorf",
        "Postcode": "40547",
        "CountryID": 87,
        "Latitude": 51.238444019,
        "Longitude": 6.734123611,
        "ContactTelephone1": "0211/821-8210",
        "ContactTelephone2": "0211/821-4093",
        "ContactEmail": "elektromobilitaet@swd-ag.de",
        "AccessComments": "Parkplatz, rund um die Uhr (24/7) nutzbar. ",
        "RelatedURL": "http://www.emobil-nrw.de",
        "DistanceUnit": 0
    },
    "Connections": [
        {
            "ID": 75005,
            "ConnectionTypeID": 25,
            "StatusTypeID": 50,
            "LevelID": 2,
            "Amps": 32,
            "Voltage": 400,
            "PowerKW": 22,
            "CurrentTypeID": 20,
            "Quantity": 2
        },
        {
            "ID": 75006,
            "ConnectionTypeID": 28,
            "StatusTypeID": 50,
            "LevelID": 2,
            "Amps": 16,
            "Voltage": 230,
            "PowerKW": 3.7,
            "CurrentTypeID": 10,
            "Quantity": 2
        }
    ],
    "NumberOfPoints": 2,
    "GeneralComments": "Nutzbar mit:\r\nElektronauten-Ladekarte (EnBW)\r\nLadekarte der Stadtwerke Hilden GmbH\r\nLadekarte der Stadtwerke Düsseldorf AG\r\nhttps://www.swd-ag.de/formulare/tankkarte/",
    "StatusTypeID": 50,
    "DateLastStatusUpdate": "2016-01-12T12:32:00Z",
    "DataQualityLevel": 1,
    "DateCreated": "2016-01-07T13:30:00Z",
    "SubmissionStatusTypeID": 200
}