{
    "IsRecentlyVerified": false,
    "ID": 139572,
    "UUID": "A3EC2ECD-0658-4360-8AC3-B2B06290ABC3",
    "DataProviderID": 2,
    "DataProvidersReference": "99025",
    "OperatorID": 59,
    "UsageTypeID": 1,
    "AddressInfo": {
        "ID": 139924,
        "Title": "Greenlots - 63108",
        "AddressLine1": "3190 Satellite Blvd.",
        "Town": "Duluth",
        "StateOrProvince": "GA",
        "Postcode": "30096",
        "CountryID": 2,
        "Latitude": 33.960578918457,
        "Longitude": -84.1170425415039,
        "ContactTelephone1": "855-900-7584",
        "AccessComments": "24 hours daily",
        "RelatedURL": "http://greenlots.com/",
        "DistanceUnit": 0
    },
    "Connections": [
        {
            "ID": 194977,
            "ConnectionTypeID": 2,
            "LevelID": 3,
            "Amps": 100,
            "Voltage": 400,
            "PowerKW": 40,
            "CurrentTypeID": 30,
            "Quantity": 1
        },
        {
            "ID": 194978,
            "ConnectionTypeID": 32,
            "LevelID": 3,
            "Amps": 100,
            "Voltage": 400,
            "PowerKW": 40,
            "CurrentTypeID": 30,
            "Quantity": 1
        }
    ],
    "StatusTypeID": 50,
    "DateLastStatusUpdate": "2019-12-24T09:11:00Z",
    "DataQualityLevel": 3,
    "DateCreated": "2019-12-24T09:11:00Z",
    "SubmissionStatusTypeID": 100
}