{
    "UserComments": [
        {
            "ID": 17327,
            "ChargePointID": 21157,
            "CommentTypeID": 10,
            "UserName": "PatrykS",
            "Comment": "",
            "Rating": 4,
            "DateCreated": "2017-05-25T20:03:32.39Z",
            "User": {
                "ID": 6418,
                "Username": "PatrykS"
            },
            "CheckinStatusTypeID": 10
        }
    ],
    "MediaItems": [
        {
            "ID": 12573,
            "ChargePointID": 21157,
            "ItemURL": "https://s3-ap-southeast-2.amazonaws.com/openchargemap/images/IT/OCM21157/OCM-21157.orig.2017052520194106.jpg",
            "ItemThumbnailURL": "https://s3-ap-southeast-2.amazonaws.com/openchargemap/images/IT/OCM21157/OCM-21157.thmb.2017052520194106.jpg",
            "Comment": "Station's screen.",
            "IsEnabled": true,
            "IsVideo": false,
            "IsFeaturedItem": false,
            "IsExternalResource": false,
            "User": {
                "ID": 6418,
                "Username": "PatrykS"
            },
            "DateCreated": "2017-05-25T20:20:00Z"
        },
        {
            "ID": 12571,
            "ChargePointID": 21157,
            "ItemURL": "https://s3-ap-southeast-2.amazonaws.com/openchargemap/images/IT/OCM21157/OCM-21157.orig.2017052520182326.jpg",
            "ItemThumbnailURL": "https://s3-ap-southeast-2.amazonaws.com/openchargemap/images/IT/OCM21157/OCM-21157.thmb.2017052520182326.jpg",
            "Comment": "Renault Twizzy and Citroen C-Zero charging.",
            "IsEnabled": true,
            "IsVideo": false,
            "IsFeaturedItem": false,
            "IsExternalResource": false,
            "User": {
                "ID": 6418,
                "Username": "PatrykS"
            },
            "DateCreated": "2017-05-25T20:19:00Z"
        },
        {
            "ID": 12572,
            "ChargePointID": 21157,
            "ItemURL": "https://s3-ap-southeast-2.amazonaws.com/openchargemap/images/IT/OCM21157/OCM-21157.orig.2017052520191057.jpg",
            "ItemThumbnailURL": "https://s3-ap-southeast-2.amazonaws.com/openchargemap/images/IT/OCM21157/OCM-21157.thmb.2017052520191057.jpg",
            "Comment": "Renault Twizzy charging.",
            "IsEnabled": true,
            "IsVideo": false,
            "IsFeaturedItem": false,
            "IsExternalResource": false,
            "User": {
                "ID": 6418,
                "Username": "PatrykS"
            },
            "DateCreated": "2017-05-25T20:19:00Z"
        },
        {
            "ID": 265,
            "ChargePointID": 21157,
            "ItemURL": "https://s3-ap-southeast-2.amazonaws.com/openchargemap/images/IT/OCM21157/OCM-21157.orig.2014022717192982.jpg",
            "ItemThumbnailURL": "https://s3-ap-southeast-2.amazonaws.com/openchargemap/images/IT/OCM21157/OCM-21157.thmb.2014022717192982.jpg",
            "Comment": "",
            "IsEnabled": true,
            "IsVideo": false,
            "IsFeaturedItem": false,
            "IsExternalResource": false,
            "User": {
                "ID": 1606,
                "Username": "polianto"
            },
            "DateCreated": "2014-02-27T17:20:00Z"
        }
    ],
    "IsRecentlyVerified": false,
    "ID": 21157,
    "UUID": "DF3E3A53-BE8C-488C-AA2B-3B99495ADAAF",
    "DataProviderID": 1,
    "OperatorID": 82,
    "UsageTypeID": 4,
    "UsageCost": "15€ for 3months",
    "AddressInfo": {
        "ID": 21502,
        "Title": "A2A Case Rotte",
        "AddressLine1": "Largo Raffaele Mattioli",
        "Town": "Milano",
        "StateOrProvince": "Milano",
        "Postcode": "20121",
        "CountryID": 112,
        "Latitude": 45.467005046053,
        "Longitude": 9.19166873033121,
        "ContactTelephone1": "800.035.151",
        "RelatedURL": "http://www.e-moving.it/",
        "DistanceUnit": 0
    },
    "Connections": [
        {
            "ID": 23027,
            "ConnectionTypeID": 25,
            "StatusTypeID": 50,
            "LevelID": 2,
            "Amps": 32,
            "Voltage": 400,
            "PowerKW": 22,
            "CurrentTypeID": 20,
            "Quantity": 2
        },
        {
            "ID": 92181,
            "ConnectionTypeID": 36,
            "StatusTypeID": 50,
            "LevelID": 2,
            "Amps": 16,
            "Voltage": 240,
            "PowerKW": 3.7,
            "CurrentTypeID": 10,
            "Quantity": 2
        }
    ],
    "NumberOfPoints": 2,
    "StatusTypeID": 50,
    "DateLastStatusUpdate": "2017-05-25T20:20:00Z",
    "DataQualityLevel": 1,
    "DateCreated": "2014-02-27T16:50:00Z",
    "SubmissionStatusTypeID": 200
}