{
    "IsRecentlyVerified": false,
    "ID": 128238,
    "UUID": "FC07D87C-E3E6-44D0-98BD-1CB5652DAF2F",
    "DataProviderID": 1,
    "OperatorID": 32,
    "OperatorsReference": "24391",
    "UsageTypeID": 4,
    "UsageCost": "£0.108/kWh; for Polar Plus subscription members only",
    "AddressInfo": {
        "ID": 128584,
        "Title": "60-46 King Street",
        "AddressLine1": "60-46 King Street",
        "Town": "Whalley",
        "StateOrProvince": "Clitheroe",
        "Postcode": "BB7 9SP",
        "CountryID": 1,
        "Latitude": 53.820751,
        "Longitude": -2.406547,
        "DistanceUnit": 0
    },
    "Connections": [
        {
            "ID": 179500,
            "ConnectionTypeID": 33,
            "StatusTypeID": 50,
            "LevelID": 3,
            "PowerKW": 50,
            "CurrentTypeID": 30,
            "Quantity": 1
        },
        {
            "ID": 179501,
            "ConnectionTypeID": 2,
            "StatusTypeID": 50,
            "LevelID": 3,
            "PowerKW": 50,
            "CurrentTypeID": 30,
            "Quantity": 1
        },
        {
            "ID": 179502,
            "ConnectionTypeID": 1036,
            "StatusTypeID": 50,
            "LevelID": 3,
            "PowerKW": 43,
            "CurrentTypeID": 20,
            "Quantity": 1
        }
    ],
    "NumberOfPoints": 1,
    "GeneralComments": "Unit located in the car park on the side of the road.",
    "StatusTypeID": 50,
    "DateLastStatusUpdate": "2019-06-20T05:18:00Z",
    "DataQualityLevel": 1,
    "DateCreated": "2019-06-19T05:17:00Z",
    "SubmissionStatusTypeID": 200
}