{
    "IsRecentlyVerified": false,
    "ID": 185275,
    "UUID": "67A9879E-CAF3-43BE-B67B-E3102C8C6F88",
    "DataProviderID": 29,
    "DataProvidersReference": "20444",
    "OperatorID": 3403,
    "AddressInfo": {
        "ID": 185634,
        "Title": "Theodor-Storm-Str. 4",
        "AddressLine1": "Theodor-Storm-Str. 4",
        "Town": "Bad Segeberg",
        "Postcode": "23795",
        "CountryID": 87,
        "Latitude": 53.933546,
        "Longitude": 10.209471,
        "DistanceUnit": 0
    },
    "Connections": [
        {
            "ID": 294557,
            "ConnectionTypeID": 25,
            "StatusTypeID": 50,
            "LevelID": 2,
            "PowerKW": 22,
            "CurrentTypeID": 20
        },
        {
            "ID": 294558,
            "ConnectionTypeID": 25,
            "StatusTypeID": 50,
            "LevelID": 2,
            "PowerKW": 22,
            "CurrentTypeID": 20
        }
    ],
    "StatusTypeID": 50,
    "DateLastStatusUpdate": "2021-07-09T03:30:00Z",
    "MetadataValues": [
        {
            "ID": 17566,
            "MetadataFieldID": 4,
            "ItemValue": "Data from the German chargepoint registry provided by Bundesnetzagentur.de under the CC-BY 4.0 license"
        }
    ],
    "DataQualityLevel": 3,
    "DateCreated": "2021-07-08T10:06:00Z",
    "SubmissionStatusTypeID": 100
}