{
    "IsRecentlyVerified": true,
    "DateLastVerified": "2021-08-21T16:04:00Z",
    "ID": 188866,
    "UUID": "C1A7F3DE-C47A-4579-91CD-F33D820D2B74",
    "DataProviderID": 1,
    "OperatorID": 1,
    "UsageTypeID": 1,
    "AddressInfo": {
        "ID": 189225,
        "Title": "Parking Ayuntamiento de Talarrubias (Planta baja)",
        "AddressLine1": "Calle Pelurera, 13",
        "Town": "Talarrubias",
        "StateOrProvince": "Extremadura",
        "Postcode": "06640",
        "CountryID": 210,
        "Latitude": 39.03953808598865,
        "Longitude": -5.23487101102603,
        "DistanceUnit": 0
    },
    "Connections": [
        {
            "ID": 305185,
            "ConnectionTypeID": 25,
            "Reference": "",
            "StatusTypeID": 50,
            "LevelID": 2,
            "PowerKW": 7.4,
            "Quantity": 2
        }
    ],
    "NumberOfPoints": 2,
    "StatusTypeID": 50,
    "DateLastStatusUpdate": "2021-08-24T19:50:00Z",
    "DataQualityLevel": 1,
    "DateCreated": "2021-08-21T16:04:00Z",
    "SubmissionStatusTypeID": 200
}