{
    "IsRecentlyVerified": false,
    "ID": 62522,
    "UUID": "EC40E84A-83A7-464F-9638-6D463B6B454C",
    "DataProviderID": 26,
    "DataProvidersReference": "79166",
    "OperatorID": 157,
    "OperatorsReference": "NewMotion 02013924",
    "UsageCost": "0.00 jaarabonnement",
    "AddressInfo": {
        "ID": 62868,
        "Title": "Jalan Tun Perak",
        "AddressLine1": "Jalan Tun Perak",
        "Town": "Melaka",
        "Postcode": "75300",
        "CountryID": 137,
        "Latitude": 2.209708,
        "Longitude": 102.243628,
        "ContactTelephone1": "088 0109500",
        "RelatedURL": "http://thenewmotion.nl/",
        "DistanceUnit": 0
    },
    "Connections": [
        {
            "ID": 79437,
            "ConnectionTypeID": 25,
            "LevelID": 2,
            "PowerKW": 3.7,
            "CurrentTypeID": 10
        },
        {
            "ID": 79438,
            "ConnectionTypeID": 25,
            "LevelID": 2,
            "PowerKW": 3.7,
            "CurrentTypeID": 10
        }
    ],
    "NumberOfPoints": 1,
    "StatusTypeID": 50,
    "DateLastStatusUpdate": "2016-06-04T02:37:00Z",
    "DataQualityLevel": 3,
    "DateCreated": "2016-03-03T12:28:00Z",
    "SubmissionStatusTypeID": 100
}