{
    "IsRecentlyVerified": false,
    "ID": 113524,
    "UUID": "D36BDD1C-BC8B-4C21-8222-B0A5A10886AB",
    "DataProviderID": 1,
    "OperatorID": 32,
    "OperatorsReference": "11337",
    "UsageTypeID": 4,
    "UsageCost": "Inclusive; for Polar Plus subscription members only",
    "AddressInfo": {
        "ID": 113870,
        "Title": "Hotel Mavi-Av. de la Cabrera",
        "AddressLine1": "Hotel Mavi-Av. de la Cabrera 8",
        "Town": "La Cabrera",
        "StateOrProvince": "Madrid",
        "Postcode": "28 751",
        "CountryID": 210,
        "Latitude": 40.855923,
        "Longitude": -3.612783,
        "DistanceUnit": 0
    },
    "Connections": [
        {
            "ID": 159958,
            "ConnectionTypeID": 25,
            "StatusTypeID": 50,
            "LevelID": 2,
            "Amps": 32,
            "Voltage": 400,
            "PowerKW": 22,
            "CurrentTypeID": 20,
            "Quantity": 2
        }
    ],
    "NumberOfPoints": 2,
    "GeneralComments": "Punto de recarga RED CARGACOCHES. A-1, salida 57. Cargador situado en la parte izquierda del aparcamiento",
    "StatusTypeID": 50,
    "DateLastStatusUpdate": "2019-12-19T10:40:00Z",
    "DataQualityLevel": 1,
    "DateCreated": "2018-12-18T06:14:00Z",
    "SubmissionStatusTypeID": 200
}