{
    "IsRecentlyVerified": false,
    "ID": 123310,
    "UUID": "E8A34DD3-4C0B-4093-BB05-F1AC1BFA7241",
    "DataProviderID": 2,
    "DataProvidersReference": "52331",
    "UsageTypeID": 1,
    "AddressInfo": {
        "ID": 123656,
        "Title": "City of Fayetteville",
        "AddressLine1": "113 W Mountain St",
        "Town": "Fayetteville",
        "StateOrProvince": "AR",
        "Postcode": "72701",
        "CountryID": 2,
        "Latitude": 36.061611,
        "Longitude": -94.161003,
        "ContactTelephone1": "479-575-8280",
        "AccessComments": "24 hours daily; pay lot 8am-6pm M-F; free after hours",
        "RelatedURL": "",
        "DistanceUnit": 0
    },
    "Connections": [
        {
            "ID": 173274,
            "ConnectionTypeID": 1,
            "LevelID": 2,
            "Amps": 16,
            "Voltage": 230,
            "PowerKW": 3.7,
            "CurrentTypeID": 10,
            "Quantity": 2
        }
    ],
    "DateLastStatusUpdate": "2020-06-26T02:58:00Z",
    "DataQualityLevel": 3,
    "DateCreated": "2019-04-06T05:03:00Z",
    "SubmissionStatusTypeID": 100
}