{
    "IsRecentlyVerified": false,
    "ID": 158454,
    "UUID": "06000C19-0B2B-419E-A39A-59376C49DCF4",
    "DataProviderID": 2,
    "DataProvidersReference": "151051",
    "OperatorID": 3293,
    "UsageTypeID": 1,
    "AddressInfo": {
        "ID": 158811,
        "Title": "Poinsettia Village",
        "AddressLine1": "7130 Avenida Encinas",
        "Town": "Carlsbad",
        "StateOrProvince": "CA",
        "Postcode": "92011",
        "CountryID": 2,
        "Latitude": 33.101208,
        "Longitude": -117.311201,
        "ContactTelephone1": "888-264-2208",
        "AccessComments": "6am-12am daily",
        "RelatedURL": "https://voltacharging.com/",
        "DistanceUnit": 0
    },
    "Connections": [
        {
            "ID": 228438,
            "ConnectionTypeID": 1,
            "LevelID": 2,
            "Amps": 16,
            "Voltage": 230,
            "PowerKW": 3.7,
            "CurrentTypeID": 10,
            "Quantity": 2
        }
    ],
    "StatusTypeID": 50,
    "DateLastStatusUpdate": "2020-06-26T02:55:00Z",
    "DataQualityLevel": 3,
    "DateCreated": "2020-06-26T02:55:00Z",
    "SubmissionStatusTypeID": 100
}