{
    "IsRecentlyVerified": false,
    "ID": 136740,
    "UUID": "49002BCA-56E1-4BB6-BB12-E9FD69E812CF",
    "DataProviderID": 18,
    "DataProvidersReference": "6193850a9398731989b648105c75d321",
    "OperatorID": 8,
    "UsageTypeID": 4,
    "AddressInfo": {
        "ID": 137086,
        "Title": "On wall of dealership",
        "AddressLine1": "Belton Road",
        "Town": "Loughborough",
        "Postcode": "LE11 1ND",
        "CountryID": 1,
        "Latitude": 52.778882,
        "Longitude": -1.210699,
        "AccessComments": "On wall of dealership. Access to Toyota customers only. Please report to reception during working hours. Fitted under Midlands PiP",
        "RelatedURL": "https://www.bpchargemaster.com",
        "DistanceUnit": 0
    },
    "Connections": [
        {
            "ID": 191312,
            "ConnectionTypeID": 25,
            "Reference": "0",
            "StatusTypeID": 50,
            "LevelID": 2,
            "Amps": 32,
            "Voltage": 230,
            "PowerKW": 7,
            "CurrentTypeID": 10
        },
        {
            "ID": 191313,
            "ConnectionTypeID": 25,
            "Reference": "1",
            "StatusTypeID": 50,
            "LevelID": 2,
            "Amps": 32,
            "Voltage": 230,
            "PowerKW": 7,
            "CurrentTypeID": 10
        }
    ],
    "StatusTypeID": 0,
    "DateLastStatusUpdate": "2019-12-24T05:23:00Z",
    "MetadataValues": [
        {
            "ID": 6592,
            "MetadataFieldID": 4,
            "ItemValue": "Contains public sector information licensed under the Open Government Licence v2.0. http://www.nationalarchives.gov.uk/doc/open-government-licence/version/2/"
        }
    ],
    "DataQualityLevel": 3,
    "DateCreated": "2019-12-24T05:23:00Z",
    "SubmissionStatusTypeID": 100
}