{
    "UserComments": [
        {
            "ID": 20039,
            "ChargePointID": 31673,
            "CommentTypeID": 110,
            "UserName": "Daniel",
            "Comment": "Construction site of a new house. Currently no evidence of present or planned charging equipment.",
            "DateCreated": "2018-08-19T17:59:18.97Z",
            "User": {
                "ID": 15698,
                "Username": "Daniel"
            },
            "CheckinStatusTypeID": 50
        }
    ],
    "MediaItems": [
        {
            "ID": 16311,
            "ChargePointID": 31673,
            "ItemURL": "https://s3-ap-southeast-2.amazonaws.com/openchargemap/images/DE/OCM31673/OCM-31673.orig.2018081918014339.jpg",
            "ItemThumbnailURL": "https://s3-ap-southeast-2.amazonaws.com/openchargemap/images/DE/OCM31673/OCM-31673.thmb.2018081918014339.jpg",
            "Comment": "No charging point found",
            "IsEnabled": true,
            "IsVideo": false,
            "IsFeaturedItem": false,
            "IsExternalResource": false,
            "User": {
                "ID": 15698,
                "Username": "Daniel"
            },
            "DateCreated": "2018-08-19T18:02:00Z"
        }
    ],
    "IsRecentlyVerified": false,
    "ID": 31673,
    "UUID": "D9634D0C-2F15-48C6-B851-5A70C8222AAB",
    "DataProviderID": 1,
    "OperatorID": 105,
    "OperatorsReference": "Essent EM-DE-08311000-01-00001",
    "UsageTypeID": 4,
    "AddressInfo": {
        "ID": 32019,
        "Title": "Haslacher Strasse 199",
        "AddressLine1": "Haslacher Strasse 199",
        "Town": "Freiburg im Breisgau",
        "Postcode": "79115",
        "CountryID": 87,
        "Latitude": 48.00036,
        "Longitude": 7.812433,
        "DistanceUnit": 0
    },
    "Connections": [
        {
            "ID": 35184,
            "ConnectionTypeID": 25,
            "LevelID": 2,
            "PowerKW": 11
        },
        {
            "ID": 46036,
            "ConnectionTypeID": 25,
            "LevelID": 2,
            "PowerKW": 11
        }
    ],
    "NumberOfPoints": 1,
    "StatusTypeID": 50,
    "DateLastStatusUpdate": "2018-08-19T18:02:00Z",
    "DataQualityLevel": 3,
    "DateCreated": "2015-01-09T06:03:00Z",
    "SubmissionStatusTypeID": 200
}