{
    "IsRecentlyVerified": false,
    "ID": 27245,
    "UUID": "EA448A8C-C96B-4B0C-957F-45D34FEC260A",
    "DataProviderID": 2,
    "DataProvidersReference": "43088",
    "UsageTypeID": 1,
    "AddressInfo": {
        "ID": 27591,
        "Title": "North Hills",
        "AddressLine1": "4291 The Circle At North Hills St",
        "Town": "Raleigh",
        "StateOrProvince": "NC",
        "Postcode": "27609",
        "CountryID": 2,
        "Latitude": 35.83788,
        "Longitude": -78.642,
        "ContactTelephone1": "919-881-1146",
        "AccessComments": "24 hours daily",
        "RelatedURL": "",
        "DistanceUnit": 0
    },
    "Connections": [
        {
            "ID": 29843,
            "ConnectionTypeID": 1,
            "LevelID": 2,
            "Amps": 16,
            "Voltage": 230,
            "PowerKW": 3,
            "CurrentTypeID": 10,
            "Quantity": 2
        },
        {
            "ID": 29844,
            "ConnectionTypeID": 2,
            "LevelID": 2,
            "Amps": 100,
            "Voltage": 400,
            "PowerKW": 40,
            "CurrentTypeID": 10,
            "Quantity": 1
        }
    ],
    "DateLastStatusUpdate": "2019-04-06T04:02:00Z",
    "DataQualityLevel": 3,
    "DateCreated": "2014-11-28T03:37:00Z",
    "SubmissionStatusTypeID": 100
}