{
    "IsRecentlyVerified": false,
    "ID": 153839,
    "UUID": "2B4C8700-9809-4693-BA52-7242E5C7BDC9",
    "DataProviderID": 28,
    "DataProvidersReference": "FR*S10*P10172A",
    "UsageTypeID": 5,
    "AddressInfo": {
        "ID": 154192,
        "Title": "HERBISSE",
        "AddressLine1": "3 Rue de la Gare 10700 HERBISSE",
        "CountryID": 80,
        "Latitude": 48.624835,
        "Longitude": 4.111696,
        "AccessComments": "",
        "DistanceUnit": 0
    },
    "Connections": [
        {
            "ID": 216057,
            "ConnectionTypeID": 28,
            "StatusTypeID": 50,
            "LevelID": 2,
            "PowerKW": 18,
            "CurrentTypeID": 10
        },
        {
            "ID": 216058,
            "ConnectionTypeID": 25,
            "StatusTypeID": 50,
            "LevelID": 2,
            "PowerKW": 18,
            "CurrentTypeID": 20
        },
        {
            "ID": 249912,
            "ConnectionTypeID": 28,
            "StatusTypeID": 50,
            "LevelID": 2,
            "PowerKW": 18,
            "CurrentTypeID": 10
        },
        {
            "ID": 249913,
            "ConnectionTypeID": 25,
            "StatusTypeID": 50,
            "LevelID": 2,
            "PowerKW": 18,
            "CurrentTypeID": 20
        }
    ],
    "GeneralComments": "\"Une unité = 6kWh de recharge. Utilisateur abonné : 1€/unité",
    "StatusTypeID": 50,
    "DateLastStatusUpdate": "2020-08-27T05:15:00Z",
    "DataQualityLevel": 2,
    "DateCreated": "2020-03-15T10:54:00Z",
    "SubmissionStatusTypeID": 100
}