{
    "IsRecentlyVerified": false,
    "ID": 121964,
    "UUID": "D5382ED5-51FF-4FC2-9E46-8A320956ECE0",
    "DataProviderID": 2,
    "DataProvidersReference": "39990",
    "UsageTypeID": 7,
    "AddressInfo": {
        "ID": 122310,
        "Title": "AutoNation Nissan - Marietta",
        "AddressLine1": "925 Cobb Pkwy SE",
        "Town": "Marietta",
        "StateOrProvince": "GA",
        "Postcode": "30060",
        "CountryID": 2,
        "Latitude": 33.92909,
        "Longitude": -84.50889,
        "ContactTelephone1": "770-674-6081",
        "AccessComments": "Dealership business hours\r\nPublic - Call ahead",
        "RelatedURL": "",
        "DistanceUnit": 0
    },
    "Connections": [
        {
            "ID": 171811,
            "ConnectionTypeID": 1,
            "LevelID": 2,
            "Amps": 16,
            "Voltage": 230,
            "PowerKW": 3.7,
            "CurrentTypeID": 10,
            "Quantity": 1
        },
        {
            "ID": 171812,
            "ConnectionTypeID": 2,
            "LevelID": 3,
            "Amps": 100,
            "Voltage": 400,
            "PowerKW": 40,
            "CurrentTypeID": 30,
            "Quantity": 1
        }
    ],
    "DateLastStatusUpdate": "2020-06-26T02:56:00Z",
    "DataQualityLevel": 3,
    "DateCreated": "2019-04-06T05:02:00Z",
    "SubmissionStatusTypeID": 100
}