{
    "UserComments": [
        {
            "ID": 20539,
            "ChargePointID": 84999,
            "CommentTypeID": 10,
            "UserName": "Zephyros",
            "Comment": "Nicht derOeffentlichkeit zugänglich",
            "DateCreated": "2018-12-22T15:20:23.23Z",
            "User": {
                "ID": 19588,
                "Username": "Zephyros"
            },
            "CheckinStatusTypeID": 0
        }
    ],
    "IsRecentlyVerified": false,
    "ID": 84999,
    "UUID": "53834489-909B-4C2E-A6BC-CC60AC89E18D",
    "DataProviderID": 1,
    "OperatorID": 23,
    "OperatorsReference": "25949",
    "UsageTypeID": 6,
    "AddressInfo": {
        "ID": 85345,
        "Title": "Kurhaus Am Sarnersee",
        "AddressLine1": "35 Wilerstrasse",
        "Town": "Sarnen",
        "Postcode": "6062",
        "CountryID": 217,
        "Latitude": 46.888251,
        "Longitude": 8.232663,
        "ContactTelephone1": "+41 6667 466",
        "DistanceUnit": 0
    },
    "Connections": [
        {
            "ID": 120748,
            "ConnectionTypeID": 30,
            "StatusTypeID": 50,
            "LevelID": 2,
            "Amps": 32,
            "Voltage": 400,
            "PowerKW": 22,
            "CurrentTypeID": 20,
            "Quantity": 1
        }
    ],
    "NumberOfPoints": 1,
    "GeneralComments": "1 Tesla Connector, up to 22kW.Available for patrons only. Please see front desk.",
    "StatusTypeID": 50,
    "DateLastStatusUpdate": "2018-12-22T15:20:00Z",
    "DataQualityLevel": 1,
    "DateCreated": "2017-03-23T06:29:00Z",
    "SubmissionStatusTypeID": 200
}