{
    "IsRecentlyVerified": false,
    "ID": 71485,
    "UUID": "C75F202A-3A2D-46C4-BA0D-C8F0EC2182A9",
    "DataProviderID": 2,
    "DataProvidersReference": "77989",
    "UsageTypeID": 1,
    "AddressInfo": {
        "ID": 71831,
        "Title": "Clarion Inn Conference Center",
        "AddressLine1": "4328 William L Wilson Fwy",
        "Town": "Harpers Ferry",
        "StateOrProvince": "WV",
        "Postcode": "25425",
        "CountryID": 2,
        "Latitude": 39.316635,
        "Longitude": -77.766287,
        "ContactTelephone1": "304-535-6302  304-671-7199",
        "AccessComments": "9am-5pm daily (winter hours 10am-3pm daily)",
        "RelatedURL": "",
        "DistanceUnit": 0
    },
    "Connections": [
        {
            "ID": 102307,
            "ConnectionTypeID": 1,
            "LevelID": 2,
            "Amps": 16,
            "Voltage": 230,
            "PowerKW": 3.7,
            "CurrentTypeID": 10,
            "Quantity": 2
        }
    ],
    "DateLastStatusUpdate": "2020-06-26T03:01:00Z",
    "DataQualityLevel": 3,
    "DateCreated": "2016-09-02T10:15:00Z",
    "SubmissionStatusTypeID": 100
}