{
    "IsRecentlyVerified": false,
    "ID": 57251,
    "UUID": "DF297F17-F488-4536-8ED8-225EB54C1C07",
    "DataProviderID": 2,
    "DataProvidersReference": "70956",
    "OperatorID": 5,
    "UsageTypeID": 1,
    "AddressInfo": {
        "ID": 57597,
        "Title": "VILLA 1",
        "AddressLine1": "8000 River Pointe Dr",
        "Town": "North Little Rock",
        "StateOrProvince": "AR",
        "Postcode": "72113",
        "CountryID": 2,
        "Latitude": 34.8227929,
        "Longitude": -92.3866091,
        "ContactTelephone1": "888-758-4389",
        "AccessComments": "24 hours daily",
        "RelatedURL": "http://www.chargepoint.com/",
        "DistanceUnit": 0
    },
    "Connections": [
        {
            "ID": 72348,
            "ConnectionTypeID": 1,
            "LevelID": 2,
            "Amps": 16,
            "Voltage": 230,
            "PowerKW": 3,
            "CurrentTypeID": 10,
            "Quantity": 2
        }
    ],
    "DateLastStatusUpdate": "2019-04-06T04:02:00Z",
    "DataQualityLevel": 3,
    "DateCreated": "2015-11-30T11:50:00Z",
    "SubmissionStatusTypeID": 100
}