{
    "IsRecentlyVerified": false,
    "ID": 9653,
    "UUID": "2E2CF81A-9D87-4CAC-8AF2-0E5D47FDF894",
    "DataProviderID": 15,
    "DataProvidersReference": "15734",
    "OperatorID": 1,
    "UsageTypeID": 1,
    "AddressInfo": {
        "ID": 9550,
        "Title": "Murai-cho 226",
        "AddressLine1": "Murai-cho 226",
        "Town": "Kanuma-shi",
        "StateOrProvince": "",
        "Postcode": "",
        "CountryID": 114,
        "Latitude": 36.55437,
        "Longitude": 139.74474,
        "ContactTelephone1": "",
        "RelatedURL": "http://carstations.com/15734",
        "DistanceUnit": 0
    },
    "Connections": [],
    "NumberOfPoints": 2,
    "StatusTypeID": 50,
    "DateLastStatusUpdate": "2014-03-22T04:39:00Z",
    "DataQualityLevel": 2,
    "DateCreated": "2012-03-20T12:43:00Z",
    "SubmissionStatusTypeID": 100
}