{
    "IsRecentlyVerified": false,
    "ID": 186764,
    "UUID": "A96232F8-02F6-4857-8266-387DEA5A4B3E",
    "DataProviderID": 29,
    "DataProvidersReference": "17759",
    "AddressInfo": {
        "ID": 187123,
        "Title": "Schlauden 26",
        "AddressLine1": "Schlauden 26",
        "Town": "Bielefeld",
        "Postcode": "33719",
        "CountryID": 87,
        "Latitude": 52.030707,
        "Longitude": 8.59976,
        "DistanceUnit": 0
    },
    "Connections": [
        {
            "ID": 300111,
            "ConnectionTypeID": 25,
            "StatusTypeID": 50,
            "LevelID": 2,
            "PowerKW": 22,
            "CurrentTypeID": 20
        },
        {
            "ID": 300112,
            "ConnectionTypeID": 25,
            "StatusTypeID": 50,
            "LevelID": 2,
            "PowerKW": 22,
            "CurrentTypeID": 20
        }
    ],
    "StatusTypeID": 50,
    "DateLastStatusUpdate": "2021-07-12T02:48:00Z",
    "MetadataValues": [
        {
            "ID": 19005,
            "MetadataFieldID": 4,
            "ItemValue": "Data from the German chargepoint registry provided by Bundesnetzagentur.de under the CC-BY 4.0 license"
        }
    ],
    "DataQualityLevel": 3,
    "DateCreated": "2021-07-12T02:48:00Z",
    "SubmissionStatusTypeID": 100
}