{
    "IsRecentlyVerified": false,
    "ID": 124485,
    "UUID": "A1A54492-D613-4EB5-9F33-582ACC5F69C6",
    "DataProviderID": 2,
    "DataProvidersReference": "41789",
    "OperatorID": 5,
    "UsageTypeID": 1,
    "AddressInfo": {
        "ID": 124831,
        "Title": "EVSP WALGREENS",
        "AddressLine1": "1100 Riley St",
        "Town": "Folsom",
        "StateOrProvince": "CA",
        "Postcode": "95630",
        "CountryID": 2,
        "Latitude": 38.670141,
        "Longitude": -121.1650395,
        "ContactTelephone1": "888-758-4389",
        "AccessComments": "24 hours daily",
        "RelatedURL": "http://www.chargepoint.com/",
        "DistanceUnit": 0
    },
    "Connections": [
        {
            "ID": 174591,
            "ConnectionTypeID": 1,
            "LevelID": 2,
            "Amps": 16,
            "Voltage": 230,
            "PowerKW": 3,
            "CurrentTypeID": 10,
            "Quantity": 1
        }
    ],
    "DateLastStatusUpdate": "2019-12-24T09:15:00Z",
    "DataQualityLevel": 3,
    "DateCreated": "2019-04-06T05:03:00Z",
    "SubmissionStatusTypeID": 100
}