{
    "IsRecentlyVerified": false,
    "ID": 142295,
    "UUID": "9D4A42BC-74D4-42A6-8A08-0F1BB6F0EDA9",
    "DataProviderID": 2,
    "DataProvidersReference": "143447",
    "OperatorID": 5,
    "UsageTypeID": 1,
    "AddressInfo": {
        "ID": 142647,
        "Title": "YVEA STEAMBOAT",
        "AddressLine1": "3715 US-40",
        "Town": "Craig",
        "StateOrProvince": "CO",
        "Postcode": "81625",
        "CountryID": 2,
        "Latitude": 40.511814,
        "Longitude": -107.50514,
        "ContactTelephone1": "888-758-4389",
        "AccessComments": "24 hours daily",
        "RelatedURL": "http://www.chargepoint.com/",
        "DistanceUnit": 0
    },
    "Connections": [
        {
            "ID": 198402,
            "ConnectionTypeID": 1,
            "LevelID": 2,
            "Amps": 16,
            "Voltage": 230,
            "PowerKW": 3.7,
            "CurrentTypeID": 10,
            "Quantity": 2
        }
    ],
    "StatusTypeID": 50,
    "DateLastStatusUpdate": "2020-06-26T03:03:00Z",
    "DataQualityLevel": 3,
    "DateCreated": "2019-12-24T09:17:00Z",
    "SubmissionStatusTypeID": 100
}