{
    "IsRecentlyVerified": false,
    "ID": 179641,
    "UUID": "D38512C3-FCC0-4162-839B-619C7F9E053D",
    "DataProviderID": 29,
    "DataProvidersReference": "12901",
    "AddressInfo": {
        "ID": 180000,
        "Title": "Leibnizstraße 2",
        "AddressLine1": "Leibnizstraße 2",
        "Town": "Magdeburg",
        "Postcode": "39104",
        "CountryID": 87,
        "Latitude": 52.123776,
        "Longitude": 11.632193,
        "DistanceUnit": 0
    },
    "Connections": [
        {
            "ID": 281722,
            "ConnectionTypeID": 25,
            "StatusTypeID": 50,
            "LevelID": 2,
            "PowerKW": 11,
            "CurrentTypeID": 20
        },
        {
            "ID": 281723,
            "ConnectionTypeID": 25,
            "StatusTypeID": 50,
            "LevelID": 2,
            "PowerKW": 11,
            "CurrentTypeID": 20
        },
        {
            "ID": 281724,
            "ConnectionTypeID": 25,
            "StatusTypeID": 50,
            "LevelID": 2,
            "PowerKW": 11,
            "CurrentTypeID": 20
        },
        {
            "ID": 300200,
            "ConnectionTypeID": 25,
            "StatusTypeID": 50,
            "LevelID": 2,
            "PowerKW": 11,
            "CurrentTypeID": 20
        }
    ],
    "StatusTypeID": 50,
    "DateLastStatusUpdate": "2021-07-12T02:49:00Z",
    "MetadataValues": [
        {
            "ID": 11935,
            "MetadataFieldID": 4,
            "ItemValue": "Data from the German chargepoint registry provided by Bundesnetzagentur.de under the CC-BY 4.0 license"
        }
    ],
    "DataQualityLevel": 3,
    "DateCreated": "2021-07-08T09:59:00Z",
    "SubmissionStatusTypeID": 100
}