{
    "UserComments": [
        {
            "ID": 22449,
            "ChargePointID": 132057,
            "CommentTypeID": 10,
            "UserName": "ForumElettrico.it",
            "Comment": "L'attivazione avviene attraverso card ed è completamente gratuita, anche se non mangi da loro. Leggi la recensione qui > https://www.forumelettrico.it/forum/roadhouse-viale-gian-battista-stucchi-20-monza-t7097.html",
            "RelatedURL": "https://www.forumelettrico.it/forum/roadhouse-viale-gian-battista-stucchi-20-monza-t7097.html",
            "DateCreated": "2020-04-17T13:24:19.737Z",
            "User": {
                "ID": 11749,
                "Username": "ForumElettrico.it"
            },
            "CheckinStatusTypeID": 140,
            "IsActionedByEditor": false
        }
    ],
    "MediaItems": [
        {
            "ID": 21985,
            "ChargePointID": 132057,
            "ItemURL": "https://s3-ap-southeast-2.amazonaws.com/openchargemap/images/IT/OCM132057/OCM-132057.orig.2020041713243190.jpg",
            "ItemThumbnailURL": "https://s3-ap-southeast-2.amazonaws.com/openchargemap/images/IT/OCM132057/OCM-132057.thmb.2020041713243190.jpg",
            "Comment": "",
            "IsEnabled": true,
            "IsVideo": false,
            "IsFeaturedItem": false,
            "IsExternalResource": false,
            "User": {
                "ID": 11749,
                "Username": "ForumElettrico.it"
            },
            "DateCreated": "2020-04-17T13:25:00Z"
        },
        {
            "ID": 21986,
            "ChargePointID": 132057,
            "ItemURL": "https://s3-ap-southeast-2.amazonaws.com/openchargemap/images/IT/OCM132057/OCM-132057.orig.2020041713243818.jpg",
            "ItemThumbnailURL": "https://s3-ap-southeast-2.amazonaws.com/openchargemap/images/IT/OCM132057/OCM-132057.thmb.2020041713243818.jpg",
            "Comment": "",
            "IsEnabled": true,
            "IsVideo": false,
            "IsFeaturedItem": false,
            "IsExternalResource": false,
            "User": {
                "ID": 11749,
                "Username": "ForumElettrico.it"
            },
            "DateCreated": "2020-04-17T13:25:00Z"
        },
        {
            "ID": 21987,
            "ChargePointID": 132057,
            "ItemURL": "https://s3-ap-southeast-2.amazonaws.com/openchargemap/images/IT/OCM132057/OCM-132057.orig.2020041713244519.jpg",
            "ItemThumbnailURL": "https://s3-ap-southeast-2.amazonaws.com/openchargemap/images/IT/OCM132057/OCM-132057.thmb.2020041713244519.jpg",
            "Comment": "",
            "IsEnabled": true,
            "IsVideo": false,
            "IsFeaturedItem": false,
            "IsExternalResource": false,
            "User": {
                "ID": 11749,
                "Username": "ForumElettrico.it"
            },
            "DateCreated": "2020-04-17T13:25:00Z"
        }
    ],
    "IsRecentlyVerified": false,
    "ID": 132057,
    "UUID": "CEE6143B-4EEA-4591-A066-51A1F21021A0",
    "DataProviderID": 1,
    "OperatorID": 45,
    "UsageTypeID": 6,
    "UsageCost": "free",
    "AddressInfo": {
        "ID": 132403,
        "Title": "ROADHOUSE RESTAURANT MONZA",
        "AddressLine1": "Viale Gian Battista Stucchi, 20",
        "Town": "Monza",
        "StateOrProvince": "MB",
        "Postcode": "20900",
        "CountryID": 112,
        "Latitude": 45.5748878996586,
        "Longitude": 9.30827853875508,
        "DistanceUnit": 0
    },
    "Connections": [
        {
            "ID": 184776,
            "ConnectionTypeID": 25,
            "StatusTypeID": 50,
            "LevelID": 2,
            "PowerKW": 5,
            "CurrentTypeID": 10,
            "Quantity": 2
        }
    ],
    "NumberOfPoints": 2,
    "StatusTypeID": 50,
    "DateLastStatusUpdate": "2020-04-17T13:25:00Z",
    "DataQualityLevel": 1,
    "DateCreated": "2019-09-19T07:41:00Z",
    "SubmissionStatusTypeID": 200
}