{
    "IsRecentlyVerified": false,
    "ID": 18736,
    "UUID": "BBF6B2F4-CCAE-46B1-BF3A-AB717827AADB",
    "DataProviderID": 15,
    "DataProvidersReference": "30588",
    "OperatorID": 1,
    "UsageTypeID": 1,
    "AddressInfo": {
        "ID": 19081,
        "Title": "?????????????",
        "AddressLine1": "?????????????",
        "Town": "????",
        "StateOrProvince": "",
        "Postcode": "50030",
        "CountryID": 50,
        "Latitude": 38.011701,
        "Longitude": 114.575547,
        "ContactTelephone1": "",
        "RelatedURL": "http://carstations.com/30588",
        "DistanceUnit": 0
    },
    "Connections": [
        {
            "ID": 18969,
            "ConnectionTypeID": 1,
            "Reference": "J1772",
            "LevelID": 2,
            "Quantity": 1
        }
    ],
    "NumberOfPoints": 1,
    "StatusTypeID": 0,
    "DateLastStatusUpdate": "2014-03-22T04:39:00Z",
    "DataQualityLevel": 2,
    "DateCreated": "2013-08-25T03:31:00Z",
    "SubmissionStatusTypeID": 200
}