{
    "IsRecentlyVerified": false,
    "ID": 175221,
    "UUID": "4937933A-3888-4AE8-8CAF-FA8DF28EC8C4",
    "DataProviderID": 1,
    "OperatorID": 3435,
    "UsageTypeID": 4,
    "AddressInfo": {
        "ID": 175580,
        "Title": "Secretariat",
        "AddressLine1": "Haficus Road",
        "Town": "Sde Eliahu",
        "CountryID": 111,
        "Latitude": 32.43883605507969,
        "Longitude": 35.51376334592942,
        "DistanceUnit": 0
    },
    "Connections": [
        {
            "ID": 271680,
            "ConnectionTypeID": 25,
            "Reference": "Afcon",
            "StatusTypeID": 50,
            "LevelID": 2,
            "PowerKW": 22,
            "CurrentTypeID": 20,
            "Quantity": 2
        }
    ],
    "NumberOfPoints": 2,
    "StatusTypeID": 50,
    "DateLastStatusUpdate": "2021-05-02T15:05:00Z",
    "DataQualityLevel": 1,
    "DateCreated": "2021-05-01T23:44:00Z",
    "SubmissionStatusTypeID": 200
}