{
    "IsRecentlyVerified": false,
    "ID": 3434,
    "UUID": "66192E21-26C6-46D5-8E5F-005758AF718F",
    "DataProviderID": 1,
    "OperatorID": 1,
    "AddressInfo": {
        "ID": 3435,
        "Title": "Residence Inn by Marriott - Concord",
        "AddressLine1": "91 Hall St",
        "Town": "Concord",
        "StateOrProvince": "NH",
        "Postcode": "3301",
        "CountryID": 2,
        "Latitude": 43.188116,
        "Longitude": -71.524385,
        "ContactTelephone1": "888-758-4389",
        "DistanceUnit": 0
    },
    "Connections": [],
    "NumberOfPoints": 3,
    "GeneralComments": "Cost To Charge: ChargePoint Access Hours: 24 Hr",
    "DateLastStatusUpdate": "2019-12-15T06:07:00Z",
    "DateCreated": "2010-02-28T00:00:00Z",
    "SubmissionStatusTypeID": 200
}