{
    "IsRecentlyVerified": false,
    "ID": 137119,
    "UUID": "5299F7EE-D91F-4EB0-B9FC-BBB37AAF9CEA",
    "DataProviderID": 1,
    "DataProvidersReference": "LSB-00112",
    "OperatorID": 21,
    "UsageTypeID": 4,
    "UsageCost": "Mobi.E compatible card",
    "AddressInfo": {
        "ID": 137465,
        "Title": "LSB-00112",
        "AddressLine1": "Avenida António José de Almeida 26",
        "Town": "Lisboa",
        "Postcode": "1000-043",
        "CountryID": 180,
        "Latitude": 38.738011,
        "Longitude": -9.140566,
        "RelatedURL": "http://www.mobie.pt",
        "DistanceUnit": 0
    },
    "Connections": [
        {
            "ID": 191976,
            "ConnectionTypeID": 25,
            "StatusTypeID": 50,
            "LevelID": 2,
            "Amps": 16,
            "Voltage": 230,
            "PowerKW": 3.7,
            "CurrentTypeID": 10,
            "Quantity": 4
        }
    ],
    "NumberOfPoints": 4,
    "StatusTypeID": 50,
    "DateLastStatusUpdate": "2020-08-16T11:13:00Z",
    "DataQualityLevel": 3,
    "DateCreated": "2019-12-24T08:08:00Z",
    "SubmissionStatusTypeID": 100
}