{
    "IsRecentlyVerified": false,
    "ID": 74434,
    "UUID": "56AAEAB6-4F9D-423C-BE1C-78D26D762D59",
    "DataProviderID": 2,
    "DataProvidersReference": "67106",
    "OperatorID": 5,
    "UsageTypeID": 1,
    "AddressInfo": {
        "ID": 74780,
        "Title": "UCR",
        "AddressLine1": "Citrus Dr",
        "Town": "Riverside",
        "StateOrProvince": "CA",
        "Postcode": "92507",
        "CountryID": 2,
        "Latitude": 33.9700013,
        "Longitude": -117.3270209,
        "ContactTelephone1": "888-758-4389",
        "AccessComments": "24 hours daily",
        "RelatedURL": "http://www.chargepoint.com/",
        "DistanceUnit": 0
    },
    "Connections": [
        {
            "ID": 107012,
            "ConnectionTypeID": 1,
            "LevelID": 2,
            "Amps": 16,
            "Voltage": 230,
            "PowerKW": 3,
            "CurrentTypeID": 10,
            "Quantity": 2
        }
    ],
    "DateLastStatusUpdate": "2019-04-06T04:01:00Z",
    "DataQualityLevel": 3,
    "DateCreated": "2016-12-03T00:12:00Z",
    "SubmissionStatusTypeID": 100
}