{
    "IsRecentlyVerified": false,
    "ID": 41145,
    "UUID": "69868EA0-0EEE-44F8-91F6-44E55A75126F",
    "DataProviderID": 2,
    "DataProvidersReference": "65274",
    "OperatorID": 3372,
    "UsageTypeID": 1,
    "AddressInfo": {
        "ID": 41491,
        "Title": "Hamilton Parking Garage",
        "AddressLine1": "365 Hamilton Ave",
        "Town": "White Plains",
        "StateOrProvince": "NY",
        "Postcode": "10601",
        "CountryID": 2,
        "Latitude": 41.034121,
        "Longitude": -73.766241,
        "ContactTelephone1": "914-422-1310",
        "AccessComments": "24 hours daily; pay lot",
        "RelatedURL": "http://evconnect.com/",
        "DistanceUnit": 0
    },
    "Connections": [
        {
            "ID": 44923,
            "ConnectionTypeID": 1,
            "LevelID": 2,
            "Amps": 16,
            "Voltage": 230,
            "PowerKW": 3.7,
            "CurrentTypeID": 10,
            "Quantity": 6
        }
    ],
    "DateLastStatusUpdate": "2020-06-26T03:03:00Z",
    "DataQualityLevel": 3,
    "DateCreated": "2015-01-27T05:18:00Z",
    "SubmissionStatusTypeID": 100
}