{
    "IsRecentlyVerified": false,
    "ID": 17254,
    "UUID": "E37B9AB5-AD98-4360-BEE5-172FC85F01A1",
    "DataProviderID": 22,
    "DataProvidersReference": "F38575EE8AF23BA6D923C0D98EE767FC",
    "AddressInfo": {
        "ID": 17599,
        "Title": "浜松日産自動車小笠店",
        "AddressLine1": "静岡県菊川市高橋3943",
        "CountryID": 114,
        "Latitude": 34.68739845,
        "Longitude": 138.0965278,
        "ContactTelephone1": "0537-73-5621",
        "DistanceUnit": 0
    },
    "Connections": [
        {
            "ID": 17495,
            "ConnectionTypeID": 2,
            "LevelID": 2,
            "Amps": 100,
            "Voltage": 480,
            "PowerKW": 48,
            "Quantity": 1
        }
    ],
    "DateLastStatusUpdate": "2013-06-29T08:55:00Z",
    "DataQualityLevel": 2,
    "DateCreated": "2013-06-29T08:55:00Z",
    "SubmissionStatusTypeID": 200
}