{
    "IsRecentlyVerified": false,
    "ID": 174889,
    "UUID": "48BF22C3-A116-4BD0-AFC7-574FB0732146",
    "DataProviderID": 1,
    "OperatorID": 3295,
    "OperatorsReference": "UKEV4772,UKEV4773",
    "UsageTypeID": 1,
    "UsageCost": "£0.26/kWh",
    "AddressInfo": {
        "ID": 175248,
        "Title": "Dinlle Caravan Park",
        "AddressLine1": "Dinas Dinlle",
        "Town": " Caernarfon",
        "StateOrProvince": "Gwynedd",
        "Postcode": "LL54 5TW ",
        "CountryID": 1,
        "Latitude": 53.0861379,
        "Longitude": -4.331357,
        "DistanceUnit": 0
    },
    "Connections": [
        {
            "ID": 270999,
            "ConnectionTypeID": 25,
            "StatusTypeID": 50,
            "LevelID": 2,
            "Amps": 32,
            "Voltage": 230,
            "PowerKW": 7.2,
            "CurrentTypeID": 10,
            "Quantity": 2
        }
    ],
    "NumberOfPoints": 2,
    "StatusTypeID": 50,
    "DateLastStatusUpdate": "2021-04-16T21:01:00Z",
    "DataQualityLevel": 1,
    "DateCreated": "2021-04-16T21:00:00Z",
    "SubmissionStatusTypeID": 200
}