{
    "IsRecentlyVerified": false,
    "ID": 74142,
    "UUID": "1CCFAC94-3A5F-45E3-A9BC-9DC1317A8437",
    "DataProviderID": 1,
    "OperatorID": 45,
    "UsageTypeID": 1,
    "AddressInfo": {
        "ID": 74488,
        "Title": "E-Bike Station Hagebaumarkt",
        "AddressLine1": "Zeppelinstraße 30",
        "Town": "Landkreis Holzminden",
        "StateOrProvince": "Landkreis Holzminden",
        "Postcode": "37603",
        "CountryID": 87,
        "Latitude": 51.843239333692004,
        "Longitude": 9.466974111500566,
        "AccessComments": "24/7 nutzbare Steckdosenleiste an den Fahrradbügeln. Gesamtbelastbarkeit 16A/3.7kW!",
        "DistanceUnit": 0
    },
    "Connections": [
        {
            "ID": 106474,
            "ConnectionTypeID": 28,
            "StatusTypeID": 50,
            "LevelID": 1,
            "Amps": 10,
            "Voltage": 230,
            "PowerKW": 2.3,
            "CurrentTypeID": 10,
            "Quantity": 5
        }
    ],
    "NumberOfPoints": 5,
    "StatusTypeID": 50,
    "DateLastStatusUpdate": "2016-11-24T06:57:00Z",
    "DataQualityLevel": 1,
    "DateCreated": "2016-11-24T06:57:00Z",
    "SubmissionStatusTypeID": 200
}