{
    "IsRecentlyVerified": false,
    "ID": 100384,
    "UUID": "4430B71F-4F2B-4B64-802A-68C1F6229036",
    "DataProviderID": 1,
    "OperatorID": 23,
    "OperatorsReference": "40912",
    "UsageTypeID": 4,
    "AddressInfo": {
        "ID": 100730,
        "Title": "Holiday Inn Morelia",
        "AddressLine1": "Holiday Inn Morelia",
        "Postcode": "58295",
        "CountryID": 146,
        "Latitude": 19.687102,
        "Longitude": -101.156965,
        "ContactTelephone1": "+52 443 314 3111",
        "DistanceUnit": 0
    },
    "Connections": [
        {
            "ID": 141803,
            "ConnectionTypeID": 30,
            "StatusTypeID": 50,
            "LevelID": 2,
            "PowerKW": 18,
            "CurrentTypeID": 20,
            "Quantity": 2
        }
    ],
    "NumberOfPoints": 2,
    "GeneralComments": "2 Tesla Connectors, up to 18kW.Available for customers. Self park.",
    "StatusTypeID": 50,
    "DateLastStatusUpdate": "2018-02-23T06:56:00Z",
    "DataQualityLevel": 1,
    "DateCreated": "2018-02-23T06:56:00Z",
    "SubmissionStatusTypeID": 200
}