{
    "IsRecentlyVerified": false,
    "ID": 141266,
    "UUID": "ECBF356A-A2B5-465A-AC95-BA08C980CFDE",
    "DataProviderID": 2,
    "DataProvidersReference": "112986",
    "OperatorID": 23,
    "UsageTypeID": 1,
    "AddressInfo": {
        "ID": 141618,
        "Title": "Trattore Farms - Tesla Destination",
        "AddressLine1": "7878 Dry Creek Rd",
        "Town": "Geyserville",
        "StateOrProvince": "CA",
        "Postcode": "95441",
        "CountryID": 2,
        "Latitude": 38.709775,
        "Longitude": -122.96543,
        "ContactTelephone1": "707-431-7200  877-798-3752",
        "AccessComments": "24 hours daily; for customer use only",
        "RelatedURL": "https://www.tesla.com/destination-charging",
        "DistanceUnit": 0
    },
    "Connections": [
        {
            "ID": 197154,
            "ConnectionTypeID": 30,
            "LevelID": 2,
            "Amps": 16,
            "Voltage": 230,
            "PowerKW": 3.7,
            "CurrentTypeID": 10,
            "Quantity": 3
        }
    ],
    "StatusTypeID": 50,
    "DateLastStatusUpdate": "2020-06-26T03:00:00Z",
    "DataQualityLevel": 3,
    "DateCreated": "2019-12-24T09:15:00Z",
    "SubmissionStatusTypeID": 100
}