{
    "IsRecentlyVerified": false,
    "ID": 139247,
    "UUID": "335D10A5-3329-4C34-91E1-F394252BFE27",
    "DataProviderID": 2,
    "DataProvidersReference": "95228",
    "OperatorID": 9,
    "UsageTypeID": 1,
    "AddressInfo": {
        "ID": 139599,
        "Title": "Fry's Store #73 Glendale",
        "AddressLine1": "6625 W. Happy Valley Road",
        "Town": "Glendale",
        "StateOrProvince": "AZ",
        "Postcode": "85310",
        "CountryID": 2,
        "Latitude": 33.711116,
        "Longitude": -112.201538,
        "ContactTelephone1": "888-998-2546",
        "AccessComments": "MON: 24 hours | TUE: 24 hours | WED: 24 hours | THU: 24 hours | FRI: 24 hours | SAT: 24 hours | SUN: 24 hours",
        "RelatedURL": "http://www.blinkcharging.com/",
        "DistanceUnit": 0
    },
    "Connections": [
        {
            "ID": 194538,
            "ConnectionTypeID": 1,
            "LevelID": 2,
            "Amps": 16,
            "Voltage": 230,
            "PowerKW": 3.7,
            "CurrentTypeID": 10,
            "Quantity": 1
        }
    ],
    "StatusTypeID": 50,
    "DateLastStatusUpdate": "2020-06-26T02:55:00Z",
    "DataQualityLevel": 3,
    "DateCreated": "2019-12-24T09:10:00Z",
    "SubmissionStatusTypeID": 100
}