{
    "IsRecentlyVerified": false,
    "ID": 180562,
    "UUID": "2C00D540-8BEC-4C2B-AB4C-D5CA07101B85",
    "DataProviderID": 29,
    "DataProvidersReference": "18081",
    "AddressInfo": {
        "ID": 180921,
        "Title": "Liebenaustraße 54 / Hallenbadparkplatz",
        "AddressLine1": "Liebenaustraße 54 / Hallenbadparkplatz",
        "Town": "Waldenbuch",
        "Postcode": "71111",
        "CountryID": 87,
        "Latitude": 48.639312,
        "Longitude": 9.13999,
        "DistanceUnit": 0
    },
    "Connections": [
        {
            "ID": 283786,
            "ConnectionTypeID": 28,
            "StatusTypeID": 50,
            "LevelID": 2,
            "PowerKW": 22,
            "CurrentTypeID": 20
        },
        {
            "ID": 283787,
            "ConnectionTypeID": 25,
            "StatusTypeID": 50,
            "LevelID": 2,
            "PowerKW": 22,
            "CurrentTypeID": 20
        },
        {
            "ID": 295969,
            "ConnectionTypeID": 28,
            "StatusTypeID": 50,
            "LevelID": 2,
            "PowerKW": 22,
            "CurrentTypeID": 20
        },
        {
            "ID": 295970,
            "ConnectionTypeID": 25,
            "StatusTypeID": 50,
            "LevelID": 2,
            "PowerKW": 22,
            "CurrentTypeID": 20
        }
    ],
    "StatusTypeID": 50,
    "DateLastStatusUpdate": "2021-07-12T02:41:00Z",
    "MetadataValues": [
        {
            "ID": 12856,
            "MetadataFieldID": 4,
            "ItemValue": "Data from the German chargepoint registry provided by Bundesnetzagentur.de under the CC-BY 4.0 license"
        }
    ],
    "DataQualityLevel": 3,
    "DateCreated": "2021-07-08T10:00:00Z",
    "SubmissionStatusTypeID": 100
}