{
    "UserComments": [
        {
            "ID": 24693,
            "ChargePointID": 188617,
            "CommentTypeID": 10,
            "UserName": "ForumElettrico.it",
            "Comment": "I 2 cavi CCS sono visivamente diversi (pur avendo teoricamente stessa potenza). Leggi la recensione completa qui > https://www.forumelettrico.it/forum/colonnina-fast-hpc-neogy-perca-via-vila-di-spora-1-t19499.html",
            "RelatedURL": "https://www.forumelettrico.it/forum/colonnina-fast-hpc-neogy-perca-via-vila-di-spora-1-t19499.html",
            "DateCreated": "2021-08-05T06:07:16.033Z",
            "User": {
                "ID": 11749,
                "Username": "ForumElettrico.it"
            },
            "CheckinStatusTypeID": 140,
            "IsActionedByEditor": false
        }
    ],
    "MediaItems": [
        {
            "ID": 28900,
            "ChargePointID": 188617,
            "ItemURL": "https://s3-ap-southeast-2.amazonaws.com/openchargemap/images/IT/OCM188617/OCM-188617.orig.2021080506072912.jpg",
            "ItemThumbnailURL": "https://s3-ap-southeast-2.amazonaws.com/openchargemap/images/IT/OCM188617/OCM-188617.thmb.2021080506072912.jpg",
            "Comment": "",
            "IsEnabled": true,
            "IsVideo": false,
            "IsFeaturedItem": false,
            "IsExternalResource": false,
            "User": {
                "ID": 11749,
                "Username": "ForumElettrico.it"
            },
            "DateCreated": "2021-08-05T06:08:00Z"
        },
        {
            "ID": 28901,
            "ChargePointID": 188617,
            "ItemURL": "https://s3-ap-southeast-2.amazonaws.com/openchargemap/images/IT/OCM188617/OCM-188617.orig.2021080506073710.jpg",
            "ItemThumbnailURL": "https://s3-ap-southeast-2.amazonaws.com/openchargemap/images/IT/OCM188617/OCM-188617.thmb.2021080506073710.jpg",
            "Comment": "",
            "IsEnabled": true,
            "IsVideo": false,
            "IsFeaturedItem": false,
            "IsExternalResource": false,
            "User": {
                "ID": 11749,
                "Username": "ForumElettrico.it"
            },
            "DateCreated": "2021-08-05T06:08:00Z"
        },
        {
            "ID": 28902,
            "ChargePointID": 188617,
            "ItemURL": "https://s3-ap-southeast-2.amazonaws.com/openchargemap/images/IT/OCM188617/OCM-188617.orig.2021080506074346.jpg",
            "ItemThumbnailURL": "https://s3-ap-southeast-2.amazonaws.com/openchargemap/images/IT/OCM188617/OCM-188617.thmb.2021080506074346.jpg",
            "Comment": "",
            "IsEnabled": true,
            "IsVideo": false,
            "IsFeaturedItem": false,
            "IsExternalResource": false,
            "User": {
                "ID": 11749,
                "Username": "ForumElettrico.it"
            },
            "DateCreated": "2021-08-05T06:08:00Z"
        }
    ],
    "IsRecentlyVerified": true,
    "DateLastVerified": "2021-08-05T06:07:00Z",
    "ID": 188617,
    "UUID": "53A21917-C882-400F-82FE-AE3C453F5080",
    "DataProviderID": 1,
    "OperatorID": 164,
    "UsageTypeID": 1,
    "AddressInfo": {
        "ID": 188976,
        "Title": "Neogy Ristorante Koriander",
        "AddressLine1": "Strada Val Pusteria 3",
        "Town": "Perca",
        "StateOrProvince": "BZ",
        "CountryID": 112,
        "Latitude": 46.792467,
        "Longitude": 11.980556,
        "RelatedURL": "https://www.forumelettrico.it/forum/colonnina-fast-hpc-neogy-perca-via-vila-di-spora-1-t19499.html",
        "DistanceUnit": 0
    },
    "Connections": [
        {
            "ID": 304665,
            "ConnectionTypeID": 33,
            "LevelID": 3,
            "PowerKW": 100,
            "CurrentTypeID": 30,
            "Quantity": 2
        },
        {
            "ID": 304666,
            "ConnectionTypeID": 2,
            "LevelID": 3,
            "PowerKW": 85,
            "CurrentTypeID": 30
        }
    ],
    "NumberOfPoints": 1,
    "StatusTypeID": 50,
    "DateLastStatusUpdate": "2021-08-05T08:18:00Z",
    "DataQualityLevel": 1,
    "DateCreated": "2021-08-05T06:07:00Z",
    "SubmissionStatusTypeID": 200
}