{
    "IsRecentlyVerified": false,
    "ID": 63597,
    "UUID": "505B9619-6D87-4E16-B7A3-05EE07EC491B",
    "DataProviderID": 26,
    "DataProvidersReference": "76777",
    "OperatorID": 73,
    "OperatorsReference": "EV-Box EVB-P1536379",
    "UsageCost": "0.00 jaarabonnement",
    "AddressInfo": {
        "ID": 63943,
        "Title": "Nyelantstraat 6",
        "AddressLine1": "Nyelantstraat 6",
        "Town": "Den Haag",
        "Postcode": "2597 TH",
        "CountryID": 159,
        "Latitude": 52.10343,
        "Longitude": 4.32452,
        "RelatedURL": "http://www.ev-box.nl",
        "DistanceUnit": 0
    },
    "Connections": [
        {
            "ID": 81160,
            "ConnectionTypeID": 25,
            "LevelID": 2,
            "PowerKW": 11,
            "CurrentTypeID": 10
        }
    ],
    "NumberOfPoints": 1,
    "StatusTypeID": 50,
    "DateLastStatusUpdate": "2016-06-04T02:50:00Z",
    "DataQualityLevel": 3,
    "DateCreated": "2016-03-03T12:31:00Z",
    "SubmissionStatusTypeID": 100
}