{
    "IsRecentlyVerified": false,
    "ID": 8811,
    "UUID": "7BDE8EBA-B764-4B21-BBD6-668D56C8763B",
    "DataProviderID": 1,
    "UsageTypeID": 1,
    "UsageCost": "Free",
    "AddressInfo": {
        "ID": 8708,
        "Title": "The Venetian ",
        "AddressLine1": "3355 Las Vegas Boulevard South",
        "AddressLine2": "",
        "Town": "Las Vegas",
        "StateOrProvince": "NV",
        "Postcode": "89109",
        "CountryID": 2,
        "Latitude": 36.1213409,
        "Longitude": -115.1696134,
        "ContactTelephone1": "(702) 414-1000",
        "ContactTelephone2": "",
        "ContactEmail": "",
        "AccessComments": "",
        "DistanceUnit": 0
    },
    "Connections": [
        {
            "ID": 6338,
            "ConnectionTypeID": 8,
            "StatusTypeID": 10,
            "LevelID": 2,
            "Amps": 70,
            "Voltage": 230,
            "PowerKW": 16.8,
            "CurrentTypeID": 10,
            "Quantity": 3
        },
        {
            "ID": 6339,
            "ConnectionTypeID": 0,
            "StatusTypeID": 10,
            "LevelID": 3,
            "Quantity": 1
        },
        {
            "ID": 6340,
            "ConnectionTypeID": 0,
            "StatusTypeID": 10,
            "LevelID": 3,
            "Quantity": 1
        },
        {
            "ID": 6341,
            "ConnectionTypeID": 8,
            "StatusTypeID": 10,
            "LevelID": 2,
            "Amps": 70,
            "Voltage": 230,
            "PowerKW": 16.8,
            "CurrentTypeID": 10,
            "Quantity": 1
        }
    ],
    "NumberOfPoints": 1,
    "GeneralComments": "",
    "StatusTypeID": 50,
    "DateLastStatusUpdate": "2011-12-01T00:22:00Z",
    "DataQualityLevel": 1,
    "DateCreated": "2011-12-01T00:22:00Z",
    "SubmissionStatusTypeID": 200
}