{
    "IsRecentlyVerified": false,
    "ID": 152999,
    "UUID": "DB3C816C-4536-45DE-BF3D-0EAF8F7F3FF4",
    "DataProviderID": 28,
    "DataProvidersReference": "",
    "UsageTypeID": 5,
    "AddressInfo": {
        "ID": 153352,
        "Title": "SAINT AUBIN LE DEPEINT 4346",
        "AddressLine1": "Place de la Mairie - 37370 ST AUBIN LE DEPEINT",
        "CountryID": 80,
        "Latitude": 47.63604,
        "Longitude": 0.390409,
        "AccessComments": "24/24 7/7",
        "DistanceUnit": 0
    },
    "Connections": [
        {
            "ID": 214438,
            "ConnectionTypeID": 28,
            "StatusTypeID": 50,
            "LevelID": 2,
            "PowerKW": 18,
            "CurrentTypeID": 10
        },
        {
            "ID": 214439,
            "ConnectionTypeID": 25,
            "StatusTypeID": 50,
            "LevelID": 2,
            "PowerKW": 18,
            "CurrentTypeID": 10
        }
    ],
    "GeneralComments": "www.virtaev.fr",
    "StatusTypeID": 50,
    "DateLastStatusUpdate": "2020-03-15T10:54:00Z",
    "DataQualityLevel": 2,
    "DateCreated": "2020-03-15T10:54:00Z",
    "SubmissionStatusTypeID": 100
}