{
    "UserComments": [
        {
            "ID": 14234,
            "ChargePointID": 21191,
            "CommentTypeID": 10,
            "UserName": "Anon74856763534",
            "Comment": "",
            "DateCreated": "2016-09-11T12:02:38.227Z",
            "User": {
                "ID": 1192,
                "Username": "Anon74856763534"
            },
            "CheckinStatusTypeID": 10
        },
        {
            "ID": 7904,
            "ChargePointID": 21191,
            "CommentTypeID": 50,
            "UserName": "Bob",
            "Comment": "CHAdeMO now seems to be working as well - connector replaced. Well done Ecotricity; this is a real busy charger and was much missed when faulty. ",
            "DateCreated": "2015-11-02T09:55:51.09Z",
            "User": {
                "ID": 5013,
                "Username": "Bob"
            },
            "CheckinStatusTypeID": 10
        },
        {
            "ID": 7873,
            "ChargePointID": 21191,
            "CommentTypeID": 10,
            "UserName": "Margaret K",
            "Comment": "Fault seems to be fixed. ",
            "Rating": 5,
            "DateCreated": "2015-10-30T21:43:48.577Z",
            "User": {
                "ID": 6348,
                "Username": "Margaret K"
            },
            "CheckinStatusTypeID": 10
        },
        {
            "ID": 7868,
            "ChargePointID": 21191,
            "CommentTypeID": 1000,
            "UserName": "Bob",
            "Comment": "",
            "DateCreated": "2015-10-29T22:58:09.477Z",
            "User": {
                "ID": 5013,
                "Username": "Bob"
            },
            "CheckinStatusTypeID": 20
        },
        {
            "ID": 7840,
            "ChargePointID": 21191,
            "CommentTypeID": 1000,
            "UserName": "Alan K",
            "Comment": "Charger still not working - However, the CHAdeMO at Vue Cinema is working",
            "DateCreated": "2015-10-24T09:02:12.907Z",
            "User": {
                "ID": 6515,
                "Username": "Alan K"
            },
            "CheckinStatusTypeID": 25
        },
        {
            "ID": 6753,
            "ChargePointID": 21191,
            "CommentTypeID": 1000,
            "UserName": "Bob",
            "Comment": "Equipment indicates connection problem",
            "DateCreated": "2015-10-11T09:47:56.137Z",
            "User": {
                "ID": 5013,
                "Username": "Bob"
            },
            "CheckinStatusTypeID": 25
        },
        {
            "ID": 6702,
            "ChargePointID": 21191,
            "CommentTypeID": 10,
            "UserName": "Bob",
            "Comment": "Very busy charger",
            "Rating": 5,
            "DateCreated": "2015-10-05T16:53:09.23Z",
            "User": {
                "ID": 5013,
                "Username": "Bob"
            },
            "CheckinStatusTypeID": 10
        },
        {
            "ID": 6623,
            "ChargePointID": 21191,
            "CommentTypeID": 10,
            "UserName": "desreid",
            "Comment": "Charged via Chademo twice, once on Friday 25th Sept (evening) and once one Sunday 27th Sept (evening). ",
            "Rating": 5,
            "DateCreated": "2015-09-28T11:53:04.51Z",
            "User": {
                "ID": 2375,
                "Username": "desreid"
            },
            "CheckinStatusTypeID": 10
        },
        {
            "ID": 6195,
            "ChargePointID": 21191,
            "CommentTypeID": 10,
            "UserName": "Anon74856763534",
            "Comment": "Watch out for large pot hole on exit!",
            "DateCreated": "2015-08-15T15:49:59.517Z",
            "User": {
                "ID": 1192,
                "Username": "Anon74856763534"
            },
            "CheckinStatusTypeID": 10
        },
        {
            "ID": 6182,
            "ChargePointID": 21191,
            "CommentTypeID": 10,
            "UserName": "Anon74856763534",
            "Comment": "Pulled in to see an ENV200 charging. Busy charger!",
            "DateCreated": "2015-08-14T09:05:15.997Z",
            "User": {
                "ID": 1192,
                "Username": "Anon74856763534"
            },
            "CheckinStatusTypeID": 10
        },
        {
            "ID": 6163,
            "ChargePointID": 21191,
            "CommentTypeID": 10,
            "UserName": "Anon74856763534",
            "Comment": "",
            "DateCreated": "2015-08-10T17:40:34.933Z",
            "User": {
                "ID": 1192,
                "Username": "Anon74856763534"
            },
            "CheckinStatusTypeID": 10
        },
        {
            "ID": 6140,
            "ChargePointID": 21191,
            "CommentTypeID": 10,
            "UserName": "Anon74856763534",
            "Comment": "Great charger.",
            "Rating": 5,
            "DateCreated": "2015-08-08T10:30:29.15Z",
            "User": {
                "ID": 1192,
                "Username": "Anon74856763534"
            },
            "CheckinStatusTypeID": 10
        },
        {
            "ID": 4950,
            "ChargePointID": 21191,
            "CommentTypeID": 10,
            "UserName": "James Blair",
            "Comment": "",
            "DateCreated": "2015-07-15T18:33:13.487Z",
            "User": {
                "ID": 5036,
                "Username": "James Blair"
            },
            "CheckinStatusTypeID": 15
        },
        {
            "ID": 4946,
            "ChargePointID": 21191,
            "CommentTypeID": 10,
            "UserName": "James Blair",
            "Comment": "Charged successfully today.",
            "DateCreated": "2015-07-15T16:16:31.22Z",
            "User": {
                "ID": 5036,
                "Username": "James Blair"
            },
            "CheckinStatusTypeID": 10
        },
        {
            "ID": 4891,
            "ChargePointID": 21191,
            "CommentTypeID": 10,
            "UserName": "Anon74856763534",
            "Comment": "",
            "DateCreated": "2015-07-11T12:45:30.65Z",
            "User": {
                "ID": 1192,
                "Username": "Anon74856763534"
            },
            "CheckinStatusTypeID": 10
        },
        {
            "ID": 4868,
            "ChargePointID": 21191,
            "CommentTypeID": 10,
            "UserName": "Anon74856763534",
            "Comment": "",
            "DateCreated": "2015-07-09T11:17:52.713Z",
            "User": {
                "ID": 1192,
                "Username": "Anon74856763534"
            },
            "CheckinStatusTypeID": 10
        },
        {
            "ID": 4831,
            "ChargePointID": 21191,
            "CommentTypeID": 10,
            "UserName": "Anon74856763534",
            "Comment": "",
            "DateCreated": "2015-07-04T14:10:53.697Z",
            "User": {
                "ID": 1192,
                "Username": "Anon74856763534"
            },
            "CheckinStatusTypeID": 10
        },
        {
            "ID": 4787,
            "ChargePointID": 21191,
            "CommentTypeID": 10,
            "UserName": "Stuart McCormick",
            "Comment": "Popular stopping point. Always busy meaning you often have to wait. ",
            "Rating": 5,
            "DateCreated": "2015-06-27T13:48:52.847Z",
            "User": {
                "ID": 4688,
                "Username": "Stuart McCormick"
            },
            "CheckinStatusTypeID": 10
        },
        {
            "ID": 4774,
            "ChargePointID": 21191,
            "CommentTypeID": 10,
            "UserName": "Anon74856763534",
            "Comment": "",
            "DateCreated": "2015-06-26T14:51:24.167Z",
            "User": {
                "ID": 1192,
                "Username": "Anon74856763534"
            },
            "CheckinStatusTypeID": 10
        },
        {
            "ID": 4537,
            "ChargePointID": 21191,
            "CommentTypeID": 10,
            "UserName": "Anon74856763534",
            "Comment": "",
            "DateCreated": "2015-05-24T13:42:59.853Z",
            "User": {
                "ID": 1192,
                "Username": "Anon74856763534"
            },
            "CheckinStatusTypeID": 10
        },
        {
            "ID": 4514,
            "ChargePointID": 21191,
            "CommentTypeID": 10,
            "UserName": "",
            "Comment": "",
            "DateCreated": "2015-05-21T18:11:26.113Z",
            "CheckinStatusTypeID": 10
        },
        {
            "ID": 4372,
            "ChargePointID": 21191,
            "CommentTypeID": 10,
            "UserName": "Jeroen Tirion",
            "Rating": 5,
            "DateCreated": "2015-05-04T20:37:18.037Z",
            "User": {
                "ID": 4608,
                "Username": "Jeroen Tirion"
            },
            "CheckinStatusTypeID": 10
        },
        {
            "ID": 4157,
            "ChargePointID": 21191,
            "CommentTypeID": 10,
            "UserName": "Anon74856763534",
            "Comment": "",
            "Rating": 5,
            "DateCreated": "2015-04-05T11:37:24.66Z",
            "User": {
                "ID": 1192,
                "Username": "Anon74856763534"
            },
            "CheckinStatusTypeID": 10
        },
        {
            "ID": 4045,
            "ChargePointID": 21191,
            "CommentTypeID": 10,
            "UserName": "Stuart McCormick",
            "Comment": "This is a busy charging point. There are so few in the near vicinity. You often have to wait. ",
            "Rating": 5,
            "DateCreated": "2015-03-22T17:33:55.41Z",
            "User": {
                "ID": 4688,
                "Username": "Stuart McCormick"
            },
            "CheckinStatusTypeID": 10
        },
        {
            "ID": 3510,
            "ChargePointID": 21191,
            "CommentTypeID": 10,
            "UserName": "Anon74856763534",
            "Comment": "We use this charger on a regular basis and wanted to comment that it has never failed us. On only one occasion could we not start a DC charge. However, this was due to the previous user ending their (AC) session incorrectly. A call to Electric Highway resolved the problem. It's an ideal location for many central belt journeys and, hopefully, Ecotricity can be encouraged to install a second unit!",
            "Rating": 5,
            "DateCreated": "2015-01-02T17:15:55.147Z",
            "User": {
                "ID": 1192,
                "Username": "Anon74856763534"
            },
            "CheckinStatusTypeID": 0
        },
        {
            "ID": 930,
            "ChargePointID": 21191,
            "CommentTypeID": 50,
            "UserName": "Danny Gallagher",
            "Comment": "Offline...again!!!....couldn't get home...kind people let me use their electricity to do a slow charge for an hour to get home....",
            "Rating": 1,
            "DateCreated": "2014-06-26T09:03:36.66Z",
            "User": {
                "ID": 1919,
                "Username": "Danny Gallagher"
            },
            "CheckinStatusTypeID": 20
        },
        {
            "ID": 904,
            "ChargePointID": 21191,
            "CommentTypeID": 1000,
            "UserName": "Murray Gallagher",
            "Comment": "Fault...",
            "Rating": 2,
            "DateCreated": "2014-06-17T20:05:29Z",
            "User": {
                "ID": 2036,
                "Username": "Murray Gallagher"
            },
            "CheckinStatusTypeID": 20
        },
        {
            "ID": 903,
            "ChargePointID": 21191,
            "CommentTypeID": 1000,
            "UserName": "Murray Gallagher",
            "Comment": "Fault...",
            "Rating": 2,
            "DateCreated": "2014-06-17T20:05:20.843Z",
            "User": {
                "ID": 2036,
                "Username": "Murray Gallagher"
            },
            "CheckinStatusTypeID": 20
        },
        {
            "ID": 836,
            "ChargePointID": 21191,
            "CommentTypeID": 10,
            "UserName": "Danny Gallagher",
            "Comment": "Perfect...no problems...Nissan Leaf...charged there twice",
            "Rating": 5,
            "DateCreated": "2014-05-24T15:11:46.273Z",
            "User": {
                "ID": 1919,
                "Username": "Danny Gallagher"
            },
            "CheckinStatusTypeID": 10
        }
    ],
    "MediaItems": [
        {
            "ID": 1800,
            "ChargePointID": 21191,
            "ItemURL": "https://s3-ap-southeast-2.amazonaws.com/openchargemap/images/GB/OCM21191/OCM-21191.orig.2015071518334012.jpg",
            "ItemThumbnailURL": "https://s3-ap-southeast-2.amazonaws.com/openchargemap/images/GB/OCM21191/OCM-21191.thmb.2015071518334012.jpg",
            "Comment": "",
            "IsEnabled": true,
            "IsVideo": false,
            "IsFeaturedItem": false,
            "IsExternalResource": false,
            "User": {
                "ID": 5036,
                "Username": "James Blair"
            },
            "DateCreated": "2015-07-15T18:34:00Z"
        },
        {
            "ID": 1319,
            "ChargePointID": 21191,
            "ItemURL": "https://s3-ap-southeast-2.amazonaws.com/openchargemap/images/GB/OCM21191/OCM-21191.orig.2015050420364337.png",
            "ItemThumbnailURL": "https://s3-ap-southeast-2.amazonaws.com/openchargemap/images/GB/OCM21191/OCM-21191.thmb.2015050420364337.png",
            "Comment": "",
            "IsEnabled": true,
            "IsVideo": false,
            "IsFeaturedItem": false,
            "IsExternalResource": false,
            "User": {
                "ID": 4608,
                "Username": "Jeroen Tirion"
            },
            "DateCreated": "2015-05-04T20:37:00Z"
        },
        {
            "ID": 1128,
            "ChargePointID": 21191,
            "ItemURL": "https://s3-ap-southeast-2.amazonaws.com/openchargemap/images/GB/OCM21191/OCM-21191.orig.2015032217322922.jpg",
            "ItemThumbnailURL": "https://s3-ap-southeast-2.amazonaws.com/openchargemap/images/GB/OCM21191/OCM-21191.thmb.2015032217322922.jpg",
            "Comment": "",
            "IsEnabled": true,
            "IsVideo": false,
            "IsFeaturedItem": false,
            "IsExternalResource": false,
            "User": {
                "ID": 4688,
                "Username": "Stuart McCormick"
            },
            "DateCreated": "2015-03-22T17:33:00Z"
        }
    ],
    "IsRecentlyVerified": false,
    "ID": 21191,
    "UUID": "032CF4F6-7D91-4D15-B57F-E7D00C7FCC0A",
    "DataProviderID": 1,
    "OperatorID": 24,
    "OperatorsReference": "GB*GFX*EGS10383*1,GB*GFX*EGS10383*2",
    "UsageTypeID": 5,
    "UsageCost": "£0.30/kWh",
    "AddressInfo": {
        "ID": 21536,
        "Title": "Stirling Moto M9/M80 Services",
        "AddressLine1": "M9 J9/M80 J6",
        "AddressLine2": "Pirnhall",
        "Town": "Stirling",
        "Postcode": "FK7 8EU",
        "CountryID": 1,
        "Latitude": 56.0762060980861,
        "Longitude": -3.92229080200195,
        "DistanceUnit": 0
    },
    "Connections": [
        {
            "ID": 23061,
            "ConnectionTypeID": 2,
            "Reference": "GB*GFX*EGS10383*2",
            "StatusTypeID": 50,
            "LevelID": 3,
            "Amps": 200,
            "Voltage": 500,
            "PowerKW": 60,
            "CurrentTypeID": 30,
            "Quantity": 1
        },
        {
            "ID": 26556,
            "ConnectionTypeID": 33,
            "Reference": "GB*GFX*EGS10383*1",
            "StatusTypeID": 50,
            "LevelID": 3,
            "Amps": 200,
            "Voltage": 920,
            "PowerKW": 60,
            "CurrentTypeID": 30,
            "Quantity": 1
        }
    ],
    "NumberOfPoints": 2,
    "StatusTypeID": 50,
    "DateLastStatusUpdate": "2021-08-10T14:20:00Z",
    "DataQualityLevel": 1,
    "DateCreated": "2014-03-05T13:54:00Z",
    "SubmissionStatusTypeID": 200
}