{
    "IsRecentlyVerified": false,
    "ID": 128603,
    "UUID": "EFA5252B-9962-4DF8-A0BF-E1215FCD90BE",
    "DataProviderID": 1,
    "OperatorID": 2244,
    "UsageTypeID": 4,
    "AddressInfo": {
        "ID": 128949,
        "Title": "Asset No. 1",
        "AddressLine1": "Hawarden Grove",
        "Town": "London",
        "Postcode": "SE24 9DH",
        "CountryID": 1,
        "Latitude": 51.448482,
        "Longitude": -0.098884,
        "RelatedURL": "https://www.ubitricity.com",
        "DistanceUnit": 0
    },
    "Connections": [
        {
            "ID": 179996,
            "ConnectionTypeID": 25,
            "Reference": "suby1100000827",
            "StatusTypeID": 50,
            "LevelID": 2,
            "Amps": 16,
            "Voltage": 230,
            "PowerKW": 3.7,
            "CurrentTypeID": 10,
            "Quantity": 1
        }
    ],
    "NumberOfPoints": 1,
    "StatusTypeID": 50,
    "DateLastStatusUpdate": "2019-06-27T17:38:00Z",
    "MetadataValues": [
        {
            "ID": 4550,
            "MetadataFieldID": 4,
            "ItemValue": "Contains public sector information licensed under the Open Government Licence v2.0. http://www.nationalarchives.gov.uk/doc/open-government-licence/version/2/"
        }
    ],
    "DataQualityLevel": 3,
    "DateCreated": "2019-06-26T17:26:00Z",
    "SubmissionStatusTypeID": 100
}