{
    "IsRecentlyVerified": false,
    "ID": 16968,
    "UUID": "2CD46599-65CB-4072-B231-F9AC9FA0D303",
    "DataProviderID": 22,
    "DataProvidersReference": "57574E4F5E30961F96C7E320BF15A5DD",
    "AddressInfo": {
        "ID": 17313,
        "Title": "日産サティオ福島　会津店",
        "AddressLine1": "福島県会津若松市神指町大字黒川字湯川東162",
        "CountryID": 114,
        "Latitude": 37.50745078,
        "Longitude": 139.9136387,
        "ContactTelephone1": "0242-24-2332",
        "DistanceUnit": 0
    },
    "Connections": [
        {
            "ID": 17209,
            "ConnectionTypeID": 2,
            "LevelID": 2,
            "Amps": 100,
            "Voltage": 480,
            "PowerKW": 48,
            "Quantity": 1
        }
    ],
    "DateLastStatusUpdate": "2013-06-29T08:52:00Z",
    "DataQualityLevel": 2,
    "DateCreated": "2013-06-29T08:52:00Z",
    "SubmissionStatusTypeID": 200
}