{
    "IsRecentlyVerified": false,
    "ID": 24608,
    "UUID": "A8698674-BB62-4CEF-B5E3-F0B489EF96AC",
    "DataProviderID": 1,
    "OperatorID": 45,
    "UsageTypeID": 1,
    "UsageCost": "FREE",
    "AddressInfo": {
        "ID": 24954,
        "Title": "Stone Brewing Company",
        "AddressLine1": "1999 Citracado Pkwy",
        "Town": "Escondido",
        "StateOrProvince": "CA",
        "Postcode": "92029",
        "CountryID": 2,
        "Latitude": 33.1159431614644,
        "Longitude": -117.119587606542,
        "RelatedURL": "http://www.stonebrewing.com/",
        "DistanceUnit": 0
    },
    "Connections": [
        {
            "ID": 26891,
            "ConnectionTypeID": 1,
            "StatusTypeID": 50,
            "LevelID": 2,
            "Amps": 30,
            "Voltage": 208,
            "PowerKW": 6.2,
            "CurrentTypeID": 10,
            "Quantity": 2
        }
    ],
    "NumberOfPoints": 2,
    "StatusTypeID": 50,
    "DateLastStatusUpdate": "2014-10-23T14:27:00Z",
    "DataQualityLevel": 1,
    "DateCreated": "2014-10-22T20:37:00Z",
    "SubmissionStatusTypeID": 200
}