{
    "IsRecentlyVerified": false,
    "ID": 42293,
    "UUID": "59244C94-BD71-400A-BFB5-B07696D10A22",
    "DataProviderID": 1,
    "OperatorID": 23,
    "OperatorsReference": "7666",
    "UsageTypeID": 1,
    "UsageCost": "Free",
    "AddressInfo": {
        "ID": 42639,
        "Title": "Four Points by Sheraton - Tesla",
        "AddressLine1": "11 1st St N",
        "Town": "Jacksonville Beach",
        "StateOrProvince": "FL",
        "Postcode": "32250",
        "CountryID": 2,
        "Latitude": 30.289256,
        "Longitude": -81.389119,
        "ContactTelephone1": "904-435-3535  877-798-3752",
        "AccessComments": "24 hours daily; for Tesla use only; for guest use only; see front desk for access",
        "RelatedURL": "http://www.teslamotors.com/supercharger",
        "DistanceUnit": 0
    },
    "Connections": [
        {
            "ID": 50864,
            "ConnectionTypeID": 30,
            "StatusTypeID": 50,
            "LevelID": 2,
            "Amps": 16,
            "Voltage": 230,
            "PowerKW": 16,
            "CurrentTypeID": 10,
            "Quantity": 2
        }
    ],
    "NumberOfPoints": 2,
    "StatusTypeID": 50,
    "DateLastStatusUpdate": "2017-01-31T22:57:00Z",
    "DataQualityLevel": 3,
    "DateCreated": "2015-03-06T06:27:00Z",
    "SubmissionStatusTypeID": 100
}