{
    "IsRecentlyVerified": false,
    "ID": 174984,
    "UUID": "A9110DD6-897C-4E79-AAAD-CE7FD3804F0B",
    "DataProviderID": 1,
    "OperatorID": 1,
    "UsageTypeID": 1,
    "UsageCost": "50p Connection fee then £0.25/kWh",
    "AddressInfo": {
        "ID": 175343,
        "Title": "Wentworth Street car park",
        "AddressLine1": "2 Wentworth St",
        "AddressLine2": "Malton",
        "Town": "Malton",
        "StateOrProvince": "England",
        "Postcode": "YO17 7LT",
        "CountryID": 1,
        "Latitude": 54.13810705073652,
        "Longitude": -0.7978976516285456,
        "ContactTelephone1": "0800 029 1696",
        "RelatedURL": "https://www.connectedkerb.com",
        "DistanceUnit": 0
    },
    "Connections": [
        {
            "ID": 271171,
            "ConnectionTypeID": 25,
            "StatusTypeID": 50,
            "LevelID": 2,
            "PowerKW": 22,
            "CurrentTypeID": 20,
            "Quantity": 2
        }
    ],
    "NumberOfPoints": 1,
    "GeneralComments": "4 x Connected Kerb 22kW https://www.connectedkerb.com",
    "StatusTypeID": 50,
    "DateLastStatusUpdate": "2021-04-23T04:05:00Z",
    "DataQualityLevel": 1,
    "DateCreated": "2021-04-23T04:05:00Z",
    "SubmissionStatusTypeID": 200
}