{
    "IsRecentlyVerified": false,
    "ID": 185639,
    "UUID": "419521DD-47EA-4943-9194-07D5A6A559CC",
    "DataProviderID": 29,
    "DataProvidersReference": "14213",
    "OperatorID": 69,
    "AddressInfo": {
        "ID": 185998,
        "Title": "Füssinger Str.2",
        "AddressLine1": "Füssinger Str.2",
        "Town": "Pocking",
        "Postcode": "94060",
        "CountryID": 87,
        "Latitude": 48.39584,
        "Longitude": 13.31126,
        "DistanceUnit": 0
    },
    "Connections": [
        {
            "ID": 295783,
            "ConnectionTypeID": 25,
            "StatusTypeID": 50,
            "LevelID": 2,
            "PowerKW": 22,
            "CurrentTypeID": 20
        },
        {
            "ID": 295784,
            "ConnectionTypeID": 25,
            "StatusTypeID": 50,
            "LevelID": 2,
            "PowerKW": 22,
            "CurrentTypeID": 20
        }
    ],
    "StatusTypeID": 50,
    "DateLastStatusUpdate": "2021-07-12T02:41:00Z",
    "MetadataValues": [
        {
            "ID": 17883,
            "MetadataFieldID": 4,
            "ItemValue": "Data from the German chargepoint registry provided by Bundesnetzagentur.de under the CC-BY 4.0 license"
        }
    ],
    "DataQualityLevel": 3,
    "DateCreated": "2021-07-12T02:41:00Z",
    "SubmissionStatusTypeID": 100
}