{
    "UserComments": [
        {
            "ID": 11662,
            "ChargePointID": 15923,
            "CommentTypeID": 50,
            "UserName": "Someone_Just_",
            "Comment": "Tijdelijk buiten dienst",
            "Rating": 2,
            "DateCreated": "2016-06-18T20:53:06.097Z",
            "User": {
                "ID": 1107,
                "Username": "Someone_Just_"
            },
            "CheckinStatusTypeID": 200
        },
        {
            "ID": 6547,
            "ChargePointID": 15923,
            "CommentTypeID": 10,
            "UserName": "Someone_Just_",
            "Rating": 4,
            "DateCreated": "2015-09-23T18:41:44.093Z",
            "User": {
                "ID": 1107,
                "Username": "Someone_Just_"
            },
            "CheckinStatusTypeID": 140
        }
    ],
    "MediaItems": [
        {
            "ID": 3234,
            "ChargePointID": 15923,
            "ItemURL": "https://s3-ap-southeast-2.amazonaws.com/openchargemap/images/BE/OCM15923/OCM-15923.orig.2015092118153477.jpg",
            "ItemThumbnailURL": "https://s3-ap-southeast-2.amazonaws.com/openchargemap/images/BE/OCM15923/OCM-15923.thmb.2015092118153477.jpg",
            "Comment": "",
            "IsEnabled": true,
            "IsVideo": false,
            "IsFeaturedItem": false,
            "IsExternalResource": false,
            "User": {
                "ID": 1107,
                "Username": "Someone_Just_"
            },
            "DateCreated": "2015-09-21T18:16:00Z"
        }
    ],
    "IsRecentlyVerified": false,
    "ID": 15923,
    "UUID": "263B3C39-BB52-4D5E-8D28-744FA6413F00",
    "DataProviderID": 1,
    "OperatorID": 36,
    "UsageTypeID": 4,
    "UsageCost": "Free",
    "AddressInfo": {
        "ID": 16268,
        "Title": "EVA Brugge 3",
        "AddressLine1": "Zwijnstraat 17",
        "Town": "Brugge ",
        "Postcode": "8000 ",
        "CountryID": 26,
        "Latitude": 51.2042980284521,
        "Longitude": 3.21608111163937,
        "DistanceUnit": 0
    },
    "Connections": [
        {
            "ID": 14297,
            "ConnectionTypeID": 23,
            "StatusTypeID": 50,
            "LevelID": 2,
            "Amps": 16,
            "Voltage": 230,
            "PowerKW": 3.7,
            "CurrentTypeID": 10,
            "Quantity": 7
        },
        {
            "ID": 14298,
            "ConnectionTypeID": 25,
            "StatusTypeID": 50,
            "LevelID": 2,
            "Amps": 32,
            "Voltage": 400,
            "PowerKW": 22,
            "CurrentTypeID": 20,
            "Quantity": 1
        }
    ],
    "NumberOfPoints": 2,
    "GeneralComments": "2 places for cars, 6 for 2-wheelers",
    "StatusTypeID": 30,
    "DateLastStatusUpdate": "2016-06-18T20:53:00Z",
    "DataQualityLevel": 1,
    "DateCreated": "2013-02-15T14:07:00Z",
    "SubmissionStatusTypeID": 200
}