{
    "IsRecentlyVerified": false,
    "ID": 173772,
    "UUID": "D3519476-F223-4C4D-ABEC-C13C0F5B5D46",
    "DataProviderID": 19,
    "DataProvidersReference": "6974",
    "AddressInfo": {
        "ID": 174131,
        "Title": "Djúpivogur (Við Voginn)",
        "AddressLine1": "Djúpivogur(Við Voginn), Vogaland ",
        "Town": "Djúpavogi",
        "StateOrProvince": "Austurland",
        "Postcode": "765",
        "CountryID": 105,
        "Latitude": 64.65645,
        "Longitude": -14.283496,
        "AccessComments": "",
        "DistanceUnit": 0
    },
    "Connections": [
        {
            "ID": 267090,
            "ConnectionTypeID": 25,
            "Reference": "1",
            "LevelID": 3,
            "Amps": 32,
            "Voltage": 400,
            "PowerKW": 22,
            "CurrentTypeID": 30,
            "Comments": "Mode 3"
        },
        {
            "ID": 267091,
            "ConnectionTypeID": 2,
            "Reference": "2",
            "LevelID": 3,
            "Amps": 100,
            "Voltage": 500,
            "PowerKW": 50,
            "CurrentTypeID": 30,
            "Comments": "Mode 4"
        },
        {
            "ID": 267092,
            "ConnectionTypeID": 33,
            "Reference": "3",
            "LevelID": 3,
            "Amps": 100,
            "Voltage": 500,
            "PowerKW": 50,
            "CurrentTypeID": 30,
            "Comments": "Mode 4"
        }
    ],
    "NumberOfPoints": 3,
    "StatusTypeID": 0,
    "DateLastStatusUpdate": "2021-03-03T11:38:00Z",
    "DataQualityLevel": 2,
    "DateCreated": "2021-03-03T11:38:00Z",
    "SubmissionStatusTypeID": 100
}