{
    "IsRecentlyVerified": false,
    "ID": 152239,
    "UUID": "37478764-BC1D-431F-91A9-9D4303741095",
    "DataProviderID": 28,
    "DataProvidersReference": "FR*S86*PSORE*B038",
    "UsageTypeID": 5,
    "AddressInfo": {
        "ID": 152592,
        "Title": "B038",
        "AddressLine1": "Rue Jules Ferry - 86110 - Cuhon",
        "CountryID": 80,
        "Latitude": 46.7588,
        "Longitude": 0.09682,
        "AccessComments": "24/24 7/7 jours",
        "DistanceUnit": 0
    },
    "Connections": [
        {
            "ID": 213048,
            "ConnectionTypeID": 28,
            "StatusTypeID": 50,
            "LevelID": 2,
            "PowerKW": 18,
            "CurrentTypeID": 10
        },
        {
            "ID": 213049,
            "ConnectionTypeID": 25,
            "StatusTypeID": 50,
            "LevelID": 2,
            "PowerKW": 18,
            "CurrentTypeID": 20
        },
        {
            "ID": 245913,
            "ConnectionTypeID": 28,
            "StatusTypeID": 50,
            "LevelID": 2,
            "PowerKW": 18,
            "CurrentTypeID": 10
        },
        {
            "ID": 245914,
            "ConnectionTypeID": 25,
            "StatusTypeID": 50,
            "LevelID": 2,
            "PowerKW": 18,
            "CurrentTypeID": 20
        }
    ],
    "GeneralComments": "",
    "StatusTypeID": 50,
    "DateLastStatusUpdate": "2020-08-27T05:13:00Z",
    "DataQualityLevel": 2,
    "DateCreated": "2020-03-15T10:53:00Z",
    "SubmissionStatusTypeID": 100
}