{
    "IsRecentlyVerified": false,
    "ID": 64440,
    "UUID": "0F957FE3-C4C8-4629-9813-E640A32CCC48",
    "DataProviderID": 1,
    "OperatorID": 213,
    "UsageTypeID": 4,
    "UsageCost": "0",
    "AddressInfo": {
        "ID": 64786,
        "Title": "Havre - Grand Hameau",
        "AddressLine1": "505 Rue Irène Joliot-Curie",
        "AddressLine2": "Mont-Gaillard",
        "Town": "Le Havre",
        "StateOrProvince": "Le Havre",
        "Postcode": "76600;76610;76620",
        "CountryID": 80,
        "Latitude": 49.52800752762513,
        "Longitude": 0.10387438996574794,
        "DistanceUnit": 0
    },
    "Connections": [
        {
            "ID": 82663,
            "ConnectionTypeID": 28,
            "LevelID": 2,
            "Amps": 16,
            "Voltage": 220,
            "PowerKW": 3,
            "CurrentTypeID": 10,
            "Quantity": 2
        }
    ],
    "NumberOfPoints": 2,
    "StatusTypeID": 0,
    "DateLastStatusUpdate": "2016-03-06T19:09:00Z",
    "DataQualityLevel": 1,
    "DateCreated": "2016-03-06T19:09:00Z",
    "SubmissionStatusTypeID": 200
}