{
    "IsRecentlyVerified": false,
    "ID": 120722,
    "UUID": "5EAC71A7-A138-4A36-A6FD-A85E62FDB34A",
    "DataProviderID": 1,
    "OperatorID": 5,
    "UsageTypeID": 1,
    "UsageCost": "Free for first two hours $3/hr after",
    "AddressInfo": {
        "ID": 121068,
        "Title": "CITY HALL",
        "AddressLine1": "24601 Jefferson Ave",
        "Town": "Murrieta",
        "StateOrProvince": "CA",
        "Postcode": "92590",
        "CountryID": 2,
        "Latitude": 33.56022399010679,
        "Longitude": -117.21025918626691,
        "ContactTelephone1": "888-758-4389",
        "AccessComments": "24 hours daily",
        "RelatedURL": "http://www.chargepoint.com/",
        "DistanceUnit": 0
    },
    "Connections": [
        {
            "ID": 170099,
            "ConnectionTypeID": 1,
            "LevelID": 2,
            "Amps": 16,
            "Voltage": 230,
            "PowerKW": 3,
            "CurrentTypeID": 10,
            "Quantity": 2
        },
        {
            "ID": 271667,
            "ConnectionTypeID": 2,
            "StatusTypeID": 50,
            "LevelID": 3,
            "PowerKW": 62.5,
            "CurrentTypeID": 30,
            "Quantity": 3
        },
        {
            "ID": 271668,
            "ConnectionTypeID": 32,
            "StatusTypeID": 50,
            "LevelID": 3,
            "PowerKW": 62.5,
            "CurrentTypeID": 30,
            "Quantity": 3
        }
    ],
    "DateLastStatusUpdate": "2021-05-01T13:24:00Z",
    "DataQualityLevel": 3,
    "DateCreated": "2019-04-01T04:59:00Z",
    "SubmissionStatusTypeID": 100
}