{
    "IsRecentlyVerified": false,
    "ID": 34442,
    "UUID": "6347D1E9-1BC5-499F-8A83-9776593510CE",
    "DataProviderID": 26,
    "DataProvidersReference": "48253",
    "OperatorID": 178,
    "OperatorsReference": "EVnetNL EV0141",
    "UsageCost": "0.00 jaarabonnement",
    "AddressInfo": {
        "ID": 34788,
        "Title": "Randweg",
        "AddressLine1": "Randweg",
        "Town": "Overbetuwe",
        "Postcode": "6662 DB",
        "CountryID": 159,
        "Latitude": 51.916404,
        "Longitude": 5.844729,
        "ContactTelephone1": "0800-3522365",
        "RelatedURL": "http://www.evnet.nl",
        "DistanceUnit": 0
    },
    "Connections": [
        {
            "ID": 37953,
            "ConnectionTypeID": 25,
            "LevelID": 2,
            "PowerKW": 11,
            "CurrentTypeID": 10
        },
        {
            "ID": 95430,
            "ConnectionTypeID": 25,
            "LevelID": 2,
            "PowerKW": 11,
            "CurrentTypeID": 10
        },
        {
            "ID": 95431,
            "ConnectionTypeID": 25,
            "LevelID": 2,
            "PowerKW": 11,
            "CurrentTypeID": 10
        }
    ],
    "NumberOfPoints": 1,
    "StatusTypeID": 50,
    "DateLastStatusUpdate": "2016-06-04T02:42:00Z",
    "DataQualityLevel": 3,
    "DateCreated": "2015-01-09T06:04:00Z",
    "SubmissionStatusTypeID": 100
}