{
    "IsRecentlyVerified": false,
    "ID": 145334,
    "UUID": "794EFF19-F5E4-4CBE-830A-26B636042E40",
    "DataProviderID": 2,
    "DataProvidersReference": "122929",
    "UsageTypeID": 1,
    "AddressInfo": {
        "ID": 145686,
        "Title": "City of Mount Pearl - City Hall",
        "AddressLine1": "16 Centennial St",
        "Town": "Mount Pearl",
        "StateOrProvince": "NL",
        "Postcode": "A1N 1G5",
        "CountryID": 44,
        "Latitude": 47.5187016266436,
        "Longitude": -52.8060080171966,
        "ContactTelephone1": "709-748-1000",
        "AccessComments": "24 hours daily",
        "RelatedURL": "",
        "DistanceUnit": 0
    },
    "Connections": [
        {
            "ID": 201984,
            "ConnectionTypeID": 1,
            "LevelID": 2,
            "Amps": 16,
            "Voltage": 230,
            "PowerKW": 3.7,
            "CurrentTypeID": 10,
            "Quantity": 1
        }
    ],
    "StatusTypeID": 50,
    "DateLastStatusUpdate": "2020-06-26T03:10:00Z",
    "DataQualityLevel": 3,
    "DateCreated": "2019-12-24T09:24:00Z",
    "SubmissionStatusTypeID": 100
}