{
    "IsRecentlyVerified": false,
    "ID": 177832,
    "UUID": "26BFA513-166A-43EC-9A14-CD09C968BD2A",
    "DataProviderID": 29,
    "DataProvidersReference": "7726",
    "AddressInfo": {
        "ID": 178191,
        "Title": "Wissingkamp 7",
        "AddressLine1": "Wissingkamp 7",
        "Town": "Rhede",
        "Postcode": "46414",
        "CountryID": 87,
        "Latitude": 51.851392,
        "Longitude": 6.69720652,
        "DistanceUnit": 0
    },
    "Connections": [
        {
            "ID": 277491,
            "ConnectionTypeID": 25,
            "StatusTypeID": 50,
            "LevelID": 2,
            "PowerKW": 22,
            "CurrentTypeID": 20
        },
        {
            "ID": 277492,
            "ConnectionTypeID": 25,
            "StatusTypeID": 50,
            "LevelID": 2,
            "PowerKW": 22,
            "CurrentTypeID": 20
        }
    ],
    "StatusTypeID": 0,
    "DateLastStatusUpdate": "2021-07-12T02:48:00Z",
    "MetadataValues": [
        {
            "ID": 10126,
            "MetadataFieldID": 4,
            "ItemValue": "Data from the German chargepoint registry provided by Bundesnetzagentur.de under the CC-BY 4.0 license"
        }
    ],
    "DataQualityLevel": 3,
    "DateCreated": "2021-07-08T09:49:00Z",
    "SubmissionStatusTypeID": 100
}