{
    "UserComments": [
        {
            "ID": 20607,
            "ChargePointID": 114471,
            "CommentTypeID": 10,
            "UserName": "Clara VDS",
            "Comment": "* Charged with charging pass (Mobility+, Blue Corner)\r\n* 1 place preserved for Partago e-car sharing\r\n* Sometimes places taken by fossile cars ==> the owner is often in the pitta shop and removes his car without problem if you ask",
            "Rating": 5,
            "DateCreated": "2019-01-08T10:42:32.847Z",
            "User": {
                "ID": 19714,
                "Username": "Clara VDS"
            },
            "CheckinStatusTypeID": 10
        }
    ],
    "MediaItems": [
        {
            "ID": 17387,
            "ChargePointID": 114471,
            "ItemURL": "https://s3-ap-southeast-2.amazonaws.com/openchargemap/images/BE/OCM114471/OCM-114471.orig.2019010810453980.jpg",
            "ItemThumbnailURL": "https://s3-ap-southeast-2.amazonaws.com/openchargemap/images/BE/OCM114471/OCM-114471.thmb.2019010810453980.jpg",
            "Comment": "",
            "IsEnabled": true,
            "IsVideo": false,
            "IsFeaturedItem": false,
            "IsExternalResource": false,
            "User": {
                "ID": 19714,
                "Username": "Clara VDS"
            },
            "DateCreated": "2019-01-08T10:46:00Z"
        },
        {
            "ID": 17386,
            "ChargePointID": 114471,
            "ItemURL": "https://s3-ap-southeast-2.amazonaws.com/openchargemap/images/BE/OCM114471/OCM-114471.orig.2019010810445877.jpg",
            "ItemThumbnailURL": "https://s3-ap-southeast-2.amazonaws.com/openchargemap/images/BE/OCM114471/OCM-114471.thmb.2019010810445877.jpg",
            "Comment": "1  voorbehouden plaats voor deelauto's van Partago\r\n1 place preserved for Partago shared e-cars",
            "IsEnabled": true,
            "IsVideo": false,
            "IsFeaturedItem": false,
            "IsExternalResource": false,
            "User": {
                "ID": 19714,
                "Username": "Clara VDS"
            },
            "DateCreated": "2019-01-08T10:45:00Z"
        },
        {
            "ID": 17385,
            "ChargePointID": 114471,
            "ItemURL": "https://s3-ap-southeast-2.amazonaws.com/openchargemap/images/BE/OCM114471/OCM-114471.orig.2019010810434987.jpg",
            "ItemThumbnailURL": "https://s3-ap-southeast-2.amazonaws.com/openchargemap/images/BE/OCM114471/OCM-114471.thmb.2019010810434987.jpg",
            "Comment": "In front of pizza-pitta snack bar, close to Proxy Delhaize",
            "IsEnabled": true,
            "IsVideo": false,
            "IsFeaturedItem": false,
            "IsExternalResource": false,
            "User": {
                "ID": 19714,
                "Username": "Clara VDS"
            },
            "DateCreated": "2019-01-08T10:44:00Z"
        }
    ],
    "IsRecentlyVerified": false,
    "ID": 114471,
    "UUID": "75B60A72-B86C-4C14-842C-C5B4B01CCB7D",
    "DataProviderID": 1,
    "OperatorID": 103,
    "UsageTypeID": 1,
    "AddressInfo": {
        "ID": 114817,
        "Title": "Partago Heernisplein",
        "AddressLine1": "Heernisplein",
        "Town": "Ghent",
        "StateOrProvince": "Gent",
        "Postcode": "9040",
        "CountryID": 26,
        "Latitude": 51.0521499215375,
        "Longitude": 3.74837229632566,
        "AccessComments": "1 laadpunt voorbehouden voor Partago autodelers",
        "DistanceUnit": 0
    },
    "Connections": [
        {
            "ID": 161141,
            "ConnectionTypeID": 25,
            "StatusTypeID": 50,
            "LevelID": 2,
            "Amps": 16,
            "Voltage": 230,
            "PowerKW": 11,
            "CurrentTypeID": 10,
            "Quantity": 2
        }
    ],
    "NumberOfPoints": 2,
    "StatusTypeID": 50,
    "DateLastStatusUpdate": "2019-06-05T11:25:00Z",
    "DataQualityLevel": 1,
    "DateCreated": "2019-01-08T10:40:00Z",
    "SubmissionStatusTypeID": 200
}