{
    "IsRecentlyVerified": false,
    "ID": 137751,
    "UUID": "357B936C-39DE-4DE3-9AF9-455C5BF0C41A",
    "DataProviderID": 2,
    "DataProvidersReference": "124571",
    "OperatorID": 9,
    "UsageTypeID": 1,
    "AddressInfo": {
        "ID": 138100,
        "Title": "Motor Court",
        "AddressLine1": "301 S Harwood St.",
        "Town": "Dallas",
        "StateOrProvince": "TX",
        "Postcode": "75201",
        "CountryID": 2,
        "Latitude": 32.779853,
        "Longitude": -96.794503,
        "ContactTelephone1": "888-998-2546",
        "AccessComments": "unknown",
        "RelatedURL": "http://www.blinkcharging.com/",
        "DistanceUnit": 0
    },
    "Connections": [
        {
            "ID": 192740,
            "ConnectionTypeID": 1,
            "LevelID": 2,
            "Amps": 16,
            "Voltage": 230,
            "PowerKW": 3,
            "CurrentTypeID": 10,
            "Quantity": 1
        }
    ],
    "StatusTypeID": 50,
    "DateLastStatusUpdate": "2019-12-24T09:06:00Z",
    "DataQualityLevel": 3,
    "DateCreated": "2019-12-24T09:06:00Z",
    "SubmissionStatusTypeID": 100
}