{
    "UserComments": [
        {
            "ID": 6127,
            "ChargePointID": 51596,
            "CommentTypeID": 50,
            "UserName": "Matthijs Van der Bogt",
            "DateCreated": "2015-08-05T21:13:57.52Z",
            "User": {
                "ID": 5002,
                "Username": "Matthijs Van der Bogt"
            },
            "CheckinStatusTypeID": 140
        }
    ],
    "MediaItems": [
        {
            "ID": 3179,
            "ChargePointID": 51596,
            "ItemURL": "https://s3-ap-southeast-2.amazonaws.com/openchargemap/images/NL/OCM51596/OCM-51596.orig.2015090918001794.jpg",
            "ItemThumbnailURL": "https://s3-ap-southeast-2.amazonaws.com/openchargemap/images/NL/OCM51596/OCM-51596.thmb.2015090918001794.jpg",
            "Comment": "",
            "IsEnabled": true,
            "IsVideo": false,
            "IsFeaturedItem": false,
            "IsExternalResource": false,
            "User": {
                "ID": 5002,
                "Username": "Matthijs Van der Bogt"
            },
            "DateCreated": "2015-09-09T18:01:00Z"
        },
        {
            "ID": 3180,
            "ChargePointID": 51596,
            "ItemURL": "https://s3-ap-southeast-2.amazonaws.com/openchargemap/images/NL/OCM51596/OCM-51596.orig.2015090918004335.jpg",
            "ItemThumbnailURL": "https://s3-ap-southeast-2.amazonaws.com/openchargemap/images/NL/OCM51596/OCM-51596.thmb.2015090918004335.jpg",
            "Comment": "",
            "IsEnabled": true,
            "IsVideo": false,
            "IsFeaturedItem": false,
            "IsExternalResource": false,
            "User": {
                "ID": 5002,
                "Username": "Matthijs Van der Bogt"
            },
            "DateCreated": "2015-09-09T18:01:00Z"
        },
        {
            "ID": 3178,
            "ChargePointID": 51596,
            "ItemURL": "https://s3-ap-southeast-2.amazonaws.com/openchargemap/images/NL/OCM51596/OCM-51596.orig.2015090917594075.jpg",
            "ItemThumbnailURL": "https://s3-ap-southeast-2.amazonaws.com/openchargemap/images/NL/OCM51596/OCM-51596.thmb.2015090917594075.jpg",
            "Comment": "",
            "IsEnabled": true,
            "IsVideo": false,
            "IsFeaturedItem": false,
            "IsExternalResource": false,
            "User": {
                "ID": 5002,
                "Username": "Matthijs Van der Bogt"
            },
            "DateCreated": "2015-09-09T18:00:00Z"
        },
        {
            "ID": 2933,
            "ChargePointID": 51596,
            "ItemURL": "https://s3-ap-southeast-2.amazonaws.com/openchargemap/images/NL/OCM51596/OCM-51596.orig.2015080222395495.jpg",
            "ItemThumbnailURL": "https://s3-ap-southeast-2.amazonaws.com/openchargemap/images/NL/OCM51596/OCM-51596.thmb.2015080222395495.jpg",
            "Comment": "",
            "IsEnabled": true,
            "IsVideo": false,
            "IsFeaturedItem": false,
            "IsExternalResource": false,
            "User": {
                "ID": 5002,
                "Username": "Matthijs Van der Bogt"
            },
            "DateCreated": "2015-08-02T22:40:00Z"
        },
        {
            "ID": 2932,
            "ChargePointID": 51596,
            "ItemURL": "https://s3-ap-southeast-2.amazonaws.com/openchargemap/images/NL/OCM51596/OCM-51596.orig.2015080222390170.jpg",
            "ItemThumbnailURL": "https://s3-ap-southeast-2.amazonaws.com/openchargemap/images/NL/OCM51596/OCM-51596.thmb.2015080222390170.jpg",
            "Comment": "",
            "IsEnabled": true,
            "IsVideo": false,
            "IsFeaturedItem": false,
            "IsExternalResource": false,
            "User": {
                "ID": 5002,
                "Username": "Matthijs Van der Bogt"
            },
            "DateCreated": "2015-08-02T22:39:00Z"
        }
    ],
    "IsRecentlyVerified": false,
    "ID": 51596,
    "UUID": "C40A1297-F5CF-4D22-91B1-9339BEBA9CD3",
    "DataProviderID": 1,
    "OperatorID": 45,
    "UsageTypeID": 6,
    "UsageCost": "0.00",
    "AddressInfo": {
        "ID": 51942,
        "Title": "van Houten Industriepark 1",
        "AddressLine1": "van Houten Industriepark 1",
        "Town": "Weesp",
        "StateOrProvince": "Noord Holland",
        "Postcode": "1381MZ",
        "CountryID": 159,
        "Latitude": 52.30665684109635,
        "Longitude": 5.0350853846557575,
        "RelatedURL": "http://www.pronkjuweel.nl",
        "DistanceUnit": 0
    },
    "Connections": [
        {
            "ID": 63982,
            "ConnectionTypeID": 25,
            "StatusTypeID": 50,
            "LevelID": 2,
            "CurrentTypeID": 20,
            "Quantity": 1
        }
    ],
    "NumberOfPoints": 1,
    "GeneralComments": "Closed off after business hours and on weekends.",
    "StatusTypeID": 50,
    "DateLastStatusUpdate": "2015-09-09T18:01:00Z",
    "DataQualityLevel": 1,
    "DateCreated": "2015-08-02T22:39:00Z",
    "SubmissionStatusTypeID": 200
}