{
    "IsRecentlyVerified": false,
    "ID": 170899,
    "UUID": "B91974CB-DD4B-47A9-9D7E-FF4E538403CC",
    "DataProviderID": 1,
    "OperatorID": 150,
    "UsageTypeID": 4,
    "UsageCost": "£0.35/kWh",
    "AddressInfo": {
        "ID": 171258,
        "Title": "Morrisons Newcastle U Lyme",
        "AddressLine1": "Goose St",
        "Town": "Newcastle-under-Lyme",
        "StateOrProvince": "England",
        "Postcode": "ST5 3HY",
        "CountryID": 1,
        "Latitude": 53.00828027702269,
        "Longitude": -2.227270569848997,
        "ContactTelephone1": "020 3598 4087",
        "AccessComments": "£10 overstay fee after 90 mins, then £10 every subsequent 90 mins",
        "RelatedURL": "https://www.cpsgenie.com/ds",
        "DistanceUnit": 0
    },
    "Connections": [
        {
            "ID": 261109,
            "ConnectionTypeID": 2,
            "StatusTypeID": 50,
            "LevelID": 3,
            "PowerKW": 50,
            "CurrentTypeID": 30,
            "Quantity": 1
        },
        {
            "ID": 261110,
            "ConnectionTypeID": 33,
            "StatusTypeID": 50,
            "LevelID": 3,
            "PowerKW": 50,
            "CurrentTypeID": 30,
            "Quantity": 1
        },
        {
            "ID": 261111,
            "ConnectionTypeID": 25,
            "StatusTypeID": 50,
            "LevelID": 2,
            "Amps": 32,
            "Voltage": 400,
            "PowerKW": 22,
            "CurrentTypeID": 20,
            "Quantity": 1
        }
    ],
    "NumberOfPoints": 1,
    "StatusTypeID": 50,
    "DateLastStatusUpdate": "2021-07-28T15:55:00Z",
    "DataQualityLevel": 1,
    "DateCreated": "2020-12-11T10:29:00Z",
    "SubmissionStatusTypeID": 200
}