{
    "IsRecentlyVerified": false,
    "ID": 186031,
    "UUID": "A6D5F784-C3C4-49A2-9EC0-FD69438A6793",
    "DataProviderID": 29,
    "DataProvidersReference": "2850",
    "AddressInfo": {
        "ID": 186390,
        "Title": "Margarita-Calvary-Straße",
        "AddressLine1": "Margarita-Calvary-Straße",
        "Town": "Schweinfurt",
        "Postcode": "97424",
        "CountryID": 87,
        "Latitude": 50.04756,
        "Longitude": 10.19825,
        "DistanceUnit": 0
    },
    "Connections": [
        {
            "ID": 297523,
            "ConnectionTypeID": 25,
            "StatusTypeID": 50,
            "LevelID": 2,
            "PowerKW": 22,
            "CurrentTypeID": 20
        },
        {
            "ID": 297524,
            "ConnectionTypeID": 25,
            "StatusTypeID": 50,
            "LevelID": 2,
            "PowerKW": 22,
            "CurrentTypeID": 20
        }
    ],
    "StatusTypeID": 50,
    "DateLastStatusUpdate": "2021-07-12T02:44:00Z",
    "MetadataValues": [
        {
            "ID": 18273,
            "MetadataFieldID": 4,
            "ItemValue": "Data from the German chargepoint registry provided by Bundesnetzagentur.de under the CC-BY 4.0 license"
        }
    ],
    "DataQualityLevel": 3,
    "DateCreated": "2021-07-12T02:44:00Z",
    "SubmissionStatusTypeID": 100
}