{
    "IsRecentlyVerified": false,
    "ID": 74601,
    "UUID": "29B0970B-50FF-4FFF-873A-C6A56CAA06B2",
    "DataProviderID": 2,
    "DataProvidersReference": "79980",
    "OperatorID": 5,
    "UsageTypeID": 1,
    "AddressInfo": {
        "ID": 74947,
        "Title": "GVC PARKING G",
        "AddressLine1": "251-299 S Grove Ave",
        "Town": "Elgin",
        "StateOrProvince": "IL",
        "Postcode": "60120",
        "CountryID": 2,
        "Latitude": 42.031453,
        "Longitude": -88.278628,
        "ContactTelephone1": "888-758-4389",
        "AccessComments": "24 hours daily",
        "RelatedURL": "http://www.chargepoint.com/",
        "DistanceUnit": 0
    },
    "Connections": [
        {
            "ID": 107207,
            "ConnectionTypeID": 1,
            "LevelID": 2,
            "Amps": 16,
            "Voltage": 230,
            "PowerKW": 3,
            "CurrentTypeID": 10,
            "Quantity": 4
        }
    ],
    "DateLastStatusUpdate": "2019-04-06T05:05:00Z",
    "DataQualityLevel": 3,
    "DateCreated": "2016-12-03T00:13:00Z",
    "SubmissionStatusTypeID": 100
}