{
    "IsRecentlyVerified": false,
    "ID": 154649,
    "UUID": "BCCD8571-E703-4A45-A2E5-C24A820866D2",
    "DataProviderID": 18,
    "DataProvidersReference": "1fb425070298bc615c24b69845387662",
    "OperatorID": 20,
    "UsageTypeID": 4,
    "AddressInfo": {
        "ID": 155002,
        "Title": "Durham",
        "AddressLine1": "Howlands Park and Ride",
        "Town": "Durham",
        "Postcode": "DH1 3TQ",
        "CountryID": 1,
        "Latitude": 54.76074,
        "Longitude": -1.58177,
        "AccessComments": "Howlands Park and Ride",
        "RelatedURL": "http://www.chargeyourcar.org.uk",
        "DistanceUnit": 0
    },
    "Connections": [
        {
            "ID": 217578,
            "ConnectionTypeID": 25,
            "Reference": "0",
            "StatusTypeID": 50,
            "LevelID": 2,
            "Amps": 32,
            "Voltage": 230,
            "PowerKW": 7,
            "CurrentTypeID": 10
        }
    ],
    "StatusTypeID": 0,
    "DateLastStatusUpdate": "2020-03-17T08:15:00Z",
    "MetadataValues": [
        {
            "ID": 7201,
            "MetadataFieldID": 4,
            "ItemValue": "Contains public sector information licensed under the Open Government Licence v2.0. http://www.nationalarchives.gov.uk/doc/open-government-licence/version/2/"
        }
    ],
    "DataQualityLevel": 3,
    "DateCreated": "2020-03-17T08:15:00Z",
    "SubmissionStatusTypeID": 100
}