{
    "IsRecentlyVerified": false,
    "ID": 46008,
    "UUID": "1FA6E401-0A12-4DB6-8681-E98F9CB13A3D",
    "DataProviderID": 1,
    "DataProvidersReference": "1881",
    "AddressInfo": {
        "ID": 46354,
        "Title": "Birkelands gate, Notodden",
        "AddressLine1": "Birkelands gate 12",
        "Town": "NOTODDEN",
        "StateOrProvince": "Vestfold og Telemark",
        "Postcode": "3674",
        "CountryID": 168,
        "Latitude": 59.55855,
        "Longitude": 9.25961,
        "AccessComments": "Sentrum av Notodden, ved E134, stor parkeringsplass med 2 ladeplasser.",
        "DistanceUnit": 0
    },
    "Connections": [
        {
            "ID": 56671,
            "ConnectionTypeID": 0,
            "Reference": "1",
            "LevelID": 2,
            "Amps": 16,
            "Voltage": 230,
            "PowerKW": 3.7,
            "Comments": "Mode 1"
        },
        {
            "ID": 88333,
            "ConnectionTypeID": 0,
            "Reference": "2",
            "LevelID": 2,
            "Amps": 16,
            "Voltage": 230,
            "PowerKW": 3.7,
            "Comments": "Mode 1"
        }
    ],
    "NumberOfPoints": 2,
    "DateLastStatusUpdate": "2020-05-26T08:23:00Z",
    "DataQualityLevel": 2,
    "DateCreated": "2015-05-03T00:54:00Z",
    "SubmissionStatusTypeID": 100
}