{
    "IsRecentlyVerified": false,
    "ID": 180120,
    "UUID": "110C6D28-1687-4058-A90F-84979A749D75",
    "DataProviderID": 29,
    "DataProvidersReference": "5671",
    "AddressInfo": {
        "ID": 180479,
        "Title": "Markt 39e",
        "AddressLine1": "Markt 39e",
        "Town": "Adorf/Vogtl.",
        "Postcode": "08626",
        "CountryID": 87,
        "Latitude": 50.3208098,
        "Longitude": 12.2533614,
        "DistanceUnit": 0
    },
    "Connections": [
        {
            "ID": 282812,
            "ConnectionTypeID": 25,
            "StatusTypeID": 50,
            "LevelID": 2,
            "PowerKW": 22,
            "CurrentTypeID": 20
        },
        {
            "ID": 282813,
            "ConnectionTypeID": 25,
            "StatusTypeID": 50,
            "LevelID": 2,
            "PowerKW": 22,
            "CurrentTypeID": 20
        }
    ],
    "StatusTypeID": 50,
    "DateLastStatusUpdate": "2021-07-12T02:44:00Z",
    "MetadataValues": [
        {
            "ID": 12414,
            "MetadataFieldID": 4,
            "ItemValue": "Data from the German chargepoint registry provided by Bundesnetzagentur.de under the CC-BY 4.0 license"
        }
    ],
    "DataQualityLevel": 3,
    "DateCreated": "2021-07-08T10:00:00Z",
    "SubmissionStatusTypeID": 100
}