{
    "IsRecentlyVerified": false,
    "ID": 79844,
    "UUID": "8561C902-0753-49CD-AE40-D44EEFC7E300",
    "DataProviderID": 1,
    "OperatorID": 23,
    "OperatorsReference": "8185",
    "UsageTypeID": 4,
    "UsageCost": "Free",
    "AddressInfo": {
        "ID": 80190,
        "Title": "Domaine de l'O, Inc.",
        "AddressLine1": "35 Rue Principale",
        "Town": "Fort-Coulonge",
        "StateOrProvince": "QC",
        "Postcode": "J0X 1V0",
        "CountryID": 44,
        "Latitude": 45.838361,
        "Longitude": -76.703574,
        "ContactTelephone1": "(613) 406-5254",
        "DistanceUnit": 0
    },
    "Connections": [
        {
            "ID": 114491,
            "ConnectionTypeID": 30,
            "StatusTypeID": 50,
            "LevelID": 2,
            "PowerKW": 16,
            "CurrentTypeID": 20,
            "Quantity": 1
        }
    ],
    "NumberOfPoints": 1,
    "GeneralComments": "1 Tesla Connector, up to 16kW.Available to the public. Self park.",
    "StatusTypeID": 50,
    "DateLastStatusUpdate": "2017-01-30T13:32:00Z",
    "DataQualityLevel": 1,
    "DateCreated": "2017-01-30T13:32:00Z",
    "SubmissionStatusTypeID": 200
}