{
    "IsRecentlyVerified": false,
    "ID": 165219,
    "UUID": "09598E06-7A28-4A90-AF89-A65EC3D0ED60",
    "DataProviderID": 1,
    "DataProvidersReference": "TR-IST-063",
    "OperatorID": 70,
    "UsageTypeID": 1,
    "AddressInfo": {
        "ID": 165578,
        "Title": "Eşarj - Aytemiz, Şişli",
        "AddressLine1": "Kaptanpaşa Mah. Darülcaze yanı No:274, Şişli",
        "Town": "İstanbul",
        "StateOrProvince": "İstanbul",
        "Postcode": "34384",
        "CountryID": 229,
        "Latitude": 41.058609,
        "Longitude": 28.965727,
        "ContactTelephone1": "+90 (850) 433 72 75",
        "ContactEmail": "destek@esarj.com",
        "RelatedURL": "https://esarj.com/en/map?s=TR-IST-063",
        "DistanceUnit": 0
    },
    "Connections": [
        {
            "ID": 236872,
            "ConnectionTypeID": 2,
            "LevelID": 2,
            "Amps": 125,
            "Voltage": 500,
            "PowerKW": 45,
            "Quantity": 1
        },
        {
            "ID": 236873,
            "ConnectionTypeID": 2,
            "LevelID": 2,
            "Amps": 120,
            "Voltage": 500,
            "PowerKW": 45,
            "Quantity": 1
        },
        {
            "ID": 236874,
            "ConnectionTypeID": 2,
            "LevelID": 2,
            "Amps": 32,
            "Voltage": 380,
            "PowerKW": 22,
            "Quantity": 1
        }
    ],
    "GeneralComments": "Eşarj Charging Systems",
    "StatusTypeID": 50,
    "DateLastStatusUpdate": "2020-08-26T08:19:00Z",
    "DataQualityLevel": 3,
    "DateCreated": "2020-08-26T08:19:00Z",
    "SubmissionStatusTypeID": 200
}