{
    "IsRecentlyVerified": false,
    "ID": 52972,
    "UUID": "C5A6419C-2912-4AB5-A24C-35846C12570B",
    "DataProviderID": 1,
    "OperatorID": 32,
    "OperatorsReference": "2723,2785",
    "UsageTypeID": 4,
    "UsageCost": "£0.108/kWh; for Polar Plus subscription members only",
    "AddressInfo": {
        "ID": 53318,
        "Title": "Berners Street",
        "AddressLine1": "16-18 Berners Street",
        "AddressLine2": "City of Westminster",
        "Town": "London",
        "Postcode": "W1T 3LN",
        "CountryID": 1,
        "Latitude": 51.517235,
        "Longitude": -0.136815,
        "DistanceUnit": 0
    },
    "Connections": [
        {
            "ID": 65980,
            "ConnectionTypeID": 3,
            "StatusTypeID": 50,
            "LevelID": 2,
            "Amps": 13,
            "Voltage": 230,
            "PowerKW": 3,
            "CurrentTypeID": 10,
            "Quantity": 2
        },
        {
            "ID": 65981,
            "ConnectionTypeID": 25,
            "StatusTypeID": 50,
            "LevelID": 2,
            "Amps": 32,
            "Voltage": 230,
            "PowerKW": 7,
            "CurrentTypeID": 10,
            "Quantity": 2
        }
    ],
    "NumberOfPoints": 2,
    "GeneralComments": "Chargemaster post. Polar Network cards accepted as well as Source London",
    "StatusTypeID": 50,
    "DateLastStatusUpdate": "2019-03-08T06:14:00Z",
    "DataQualityLevel": 1,
    "DateCreated": "2015-09-15T16:02:00Z",
    "SubmissionStatusTypeID": 200
}