{
    "IsRecentlyVerified": false,
    "ID": 121225,
    "UUID": "9573F626-7261-478C-9E29-E75461FFE9BE",
    "DataProviderID": 2,
    "DataProvidersReference": "118891",
    "OperatorID": 5,
    "UsageTypeID": 1,
    "AddressInfo": {
        "ID": 121571,
        "Title": "HUNTINGTON",
        "AddressLine1": "600 S High St",
        "Town": "Columbus",
        "StateOrProvince": "OH",
        "Postcode": "43215",
        "CountryID": 2,
        "Latitude": 39.9496036,
        "Longitude": -82.9977249,
        "ContactTelephone1": "888-758-4389",
        "AccessComments": "24 hours daily",
        "RelatedURL": "http://www.chargepoint.com/",
        "DistanceUnit": 0
    },
    "Connections": [
        {
            "ID": 170665,
            "ConnectionTypeID": 1,
            "LevelID": 2,
            "Amps": 16,
            "Voltage": 230,
            "PowerKW": 3.7,
            "CurrentTypeID": 10,
            "Quantity": 1
        }
    ],
    "DateLastStatusUpdate": "2020-06-26T03:02:00Z",
    "DataQualityLevel": 3,
    "DateCreated": "2019-04-01T05:00:00Z",
    "SubmissionStatusTypeID": 100
}