{
    "IsRecentlyVerified": false,
    "ID": 141805,
    "UUID": "FA868E48-D684-4905-92F9-07FD2EE18C4F",
    "DataProviderID": 2,
    "DataProvidersReference": "114865",
    "OperatorID": 23,
    "UsageTypeID": 1,
    "AddressInfo": {
        "ID": 142157,
        "Title": "Peppermill Resort Hotel - Tesla Destination",
        "AddressLine1": "707 S Virginia St",
        "Town": "Reno",
        "StateOrProvince": "NV",
        "Postcode": "89501",
        "CountryID": 2,
        "Latitude": 39.518128,
        "Longitude": -119.80944,
        "ContactTelephone1": "775-826-2121  877-798-3752",
        "AccessComments": "24 hours daily; for customer use only; see front desk for access",
        "RelatedURL": "https://www.tesla.com/destination-charging",
        "DistanceUnit": 0
    },
    "Connections": [
        {
            "ID": 197821,
            "ConnectionTypeID": 30,
            "LevelID": 2,
            "Amps": 16,
            "Voltage": 230,
            "PowerKW": 3.7,
            "CurrentTypeID": 10,
            "Quantity": 3
        }
    ],
    "StatusTypeID": 50,
    "DateLastStatusUpdate": "2020-06-26T03:01:00Z",
    "DataQualityLevel": 3,
    "DateCreated": "2019-12-24T09:16:00Z",
    "SubmissionStatusTypeID": 100
}