{
    "IsRecentlyVerified": false,
    "ID": 142587,
    "UUID": "02477D5B-22D4-4499-A8CC-1FB2DA1FCCE5",
    "DataProviderID": 1,
    "UsageTypeID": 1,
    "AddressInfo": {
        "ID": 142939,
        "Title": "LaRiche Chevrolet",
        "AddressLine1": "215 E Main Cross St",
        "Town": "Findlay",
        "StateOrProvince": "OH",
        "Postcode": "45840",
        "CountryID": 2,
        "Latitude": 41.038695,
        "Longitude": -83.648025,
        "ContactTelephone1": "419-408-3309",
        "AccessComments": "Dealership business hours",
        "DistanceUnit": 0
    },
    "Connections": [
        {
            "ID": 198756,
            "ConnectionTypeID": 32,
            "LevelID": 3,
            "Amps": 65,
            "Voltage": 400,
            "PowerKW": 25,
            "CurrentTypeID": 30,
            "Quantity": 1
        }
    ],
    "StatusTypeID": 50,
    "DateLastStatusUpdate": "2021-07-16T19:30:00Z",
    "DataQualityLevel": 3,
    "DateCreated": "2019-12-24T09:18:00Z",
    "SubmissionStatusTypeID": 100
}