{
    "IsRecentlyVerified": false,
    "ID": 145735,
    "UUID": "2F2E9115-02FE-46DF-B76B-93FF44281868",
    "DataProviderID": 1,
    "OperatorID": 89,
    "UsageTypeID": 1,
    "AddressInfo": {
        "ID": 146087,
        "Title": "City of Castlegar - Visitor Information Centre",
        "AddressLine1": "1995 6th Ave",
        "Town": "Castlegar",
        "StateOrProvince": "BC",
        "Postcode": "V1N 4B7",
        "CountryID": 44,
        "Latitude": 49.29622727241821,
        "Longitude": -117.65196322863625,
        "ContactTelephone1": "888-356-8911",
        "AccessComments": "24 hours daily",
        "RelatedURL": "https://flo.ca/",
        "DistanceUnit": 0
    },
    "Connections": [
        {
            "ID": 202462,
            "ConnectionTypeID": 1,
            "LevelID": 2,
            "Amps": 16,
            "Voltage": 230,
            "PowerKW": 3.7,
            "CurrentTypeID": 10,
            "Quantity": 1
        },
        {
            "ID": 307031,
            "ConnectionTypeID": 2,
            "LevelID": 2,
            "Amps": 125,
            "Voltage": 400,
            "PowerKW": 50,
            "Quantity": 1
        },
        {
            "ID": 307032,
            "ConnectionTypeID": 32,
            "LevelID": 2,
            "Amps": 125,
            "Voltage": 400,
            "PowerKW": 50,
            "Quantity": 1
        }
    ],
    "NumberOfPoints": 2,
    "StatusTypeID": 50,
    "DateLastStatusUpdate": "2021-11-01T22:08:00Z",
    "DataQualityLevel": 3,
    "DateCreated": "2019-12-24T09:25:00Z",
    "SubmissionStatusTypeID": 100
}