{
    "IsRecentlyVerified": false,
    "ID": 139369,
    "UUID": "066DB5D4-A2A0-486D-9CB6-30AB0C5BDB56",
    "DataProviderID": 2,
    "DataProvidersReference": "123170",
    "OperatorID": 3372,
    "UsageTypeID": 1,
    "AddressInfo": {
        "ID": 139721,
        "Title": "Innovative Food Systems",
        "AddressLine1": "1295 S Lewis St",
        "Town": "Anaheim",
        "StateOrProvince": "CA",
        "Postcode": "92805",
        "CountryID": 2,
        "Latitude": 33.8155758,
        "Longitude": -117.89849,
        "ContactTelephone1": "866-816-7584",
        "AccessComments": "24 hours daily",
        "RelatedURL": "http://evconnect.com/",
        "DistanceUnit": 0
    },
    "Connections": [
        {
            "ID": 194696,
            "ConnectionTypeID": 1,
            "LevelID": 2,
            "Amps": 16,
            "Voltage": 230,
            "PowerKW": 3.7,
            "CurrentTypeID": 10,
            "Quantity": 1
        }
    ],
    "StatusTypeID": 50,
    "DateLastStatusUpdate": "2020-06-26T02:56:00Z",
    "DataQualityLevel": 3,
    "DateCreated": "2019-12-24T09:10:00Z",
    "SubmissionStatusTypeID": 100
}