{
    "IsRecentlyVerified": false,
    "ID": 161520,
    "UUID": "80836FBE-ED7E-47CC-9713-BA6218A17235",
    "DataProviderID": 1,
    "OperatorID": 45,
    "UsageTypeID": 6,
    "UsageCost": "Free for guests",
    "AddressInfo": {
        "ID": 161877,
        "Title": "Pažaislis Park Hotel",
        "AddressLine1": "T. Masiulio g.",
        "AddressLine2": "Petrašiūnų seniūnija",
        "Town": "Kaunas",
        "StateOrProvince": "Kaunas County",
        "Postcode": "52372",
        "CountryID": 131,
        "Latitude": 54.88454688820238,
        "Longitude": 24.006604442471485,
        "ContactTelephone1": "+37061463664",
        "AccessComments": "Charger is just inside of the gate. You need reception to come and start charging.",
        "RelatedURL": "http://www.pazaislisparkhotel.lt/",
        "DistanceUnit": 0
    },
    "Connections": [
        {
            "ID": 232442,
            "ConnectionTypeID": 25,
            "StatusTypeID": 50,
            "LevelID": 2,
            "PowerKW": 17,
            "CurrentTypeID": 20,
            "Quantity": 2
        }
    ],
    "NumberOfPoints": 1,
    "GeneralComments": "For hotel guests, gates are open 7-23 or by request. Reception is 24h. Breakfast is excellent.",
    "StatusTypeID": 50,
    "DateLastStatusUpdate": "2020-07-16T09:08:00Z",
    "DataQualityLevel": 1,
    "DateCreated": "2020-07-14T18:22:00Z",
    "SubmissionStatusTypeID": 200
}