{
    "IsRecentlyVerified": false,
    "ID": 152058,
    "UUID": "23D5390B-01D7-44B2-B255-384876D5DE66",
    "DataProviderID": 28,
    "DataProvidersReference": "FR*S86*PSORE*B011",
    "UsageTypeID": 5,
    "AddressInfo": {
        "ID": 152411,
        "Title": "B011",
        "AddressLine1": "Parking Rue de Guerting - 86410 - Bouresse",
        "CountryID": 80,
        "Latitude": 46.36157,
        "Longitude": 0.61114,
        "AccessComments": "24/24 7/7 jours",
        "DistanceUnit": 0
    },
    "Connections": [
        {
            "ID": 212700,
            "ConnectionTypeID": 28,
            "StatusTypeID": 50,
            "LevelID": 2,
            "PowerKW": 18,
            "CurrentTypeID": 10
        },
        {
            "ID": 212701,
            "ConnectionTypeID": 26,
            "StatusTypeID": 50,
            "LevelID": 2,
            "PowerKW": 18
        },
        {
            "ID": 245556,
            "ConnectionTypeID": 28,
            "StatusTypeID": 50,
            "LevelID": 2,
            "PowerKW": 18,
            "CurrentTypeID": 10
        },
        {
            "ID": 245557,
            "ConnectionTypeID": 26,
            "StatusTypeID": 50,
            "LevelID": 2,
            "PowerKW": 18
        }
    ],
    "GeneralComments": "",
    "StatusTypeID": 50,
    "DateLastStatusUpdate": "2020-08-27T05:12:00Z",
    "DataQualityLevel": 2,
    "DateCreated": "2020-03-15T10:53:00Z",
    "SubmissionStatusTypeID": 100
}