{
    "MediaItems": [
        {
            "ID": 17146,
            "ChargePointID": 108413,
            "ItemURL": "https://s3-ap-southeast-2.amazonaws.com/openchargemap/images/GR/OCM108413/OCM-108413.orig.2018120113135850.jpg",
            "ItemThumbnailURL": "https://s3-ap-southeast-2.amazonaws.com/openchargemap/images/GR/OCM108413/OCM-108413.thmb.2018120113135850.jpg",
            "Comment": "",
            "IsEnabled": true,
            "IsVideo": false,
            "IsFeaturedItem": false,
            "IsExternalResource": false,
            "User": {
                "ID": 18761,
                "Username": "EVentusiast"
            },
            "DateCreated": "2018-12-01T13:14:00Z"
        }
    ],
    "IsRecentlyVerified": false,
    "ID": 108413,
    "UUID": "10FA5E60-6C18-40E7-8AEF-BB8B1431B572",
    "DataProviderID": 1,
    "OperatorID": 85,
    "UsageTypeID": 1,
    "AddressInfo": {
        "ID": 108759,
        "Title": "Domotel Xenia Volos",
        "AddressLine1": "Nikolaou Plastira",
        "Town": "Volos",
        "StateOrProvince": "Volos Municipality",
        "Postcode": "38222",
        "CountryID": 90,
        "Latitude": 39.3533914497401,
        "Longitude": 22.9570872518982,
        "ContactTelephone1": "+30 2421092700",
        "ContactEmail": "xeniavolou@domotel.gr",
        "AccessComments": "RFID card, Web app (https://user.fortizo.gr )",
        "RelatedURL": "https://www.domotel.gr/hotel/4/Xenia-Volos",
        "DistanceUnit": 0
    },
    "Connections": [
        {
            "ID": 153289,
            "ConnectionTypeID": 25,
            "StatusTypeID": 50,
            "LevelID": 2,
            "Amps": 32,
            "Voltage": 400,
            "PowerKW": 22,
            "CurrentTypeID": 20
        }
    ],
    "NumberOfPoints": 1,
    "GeneralComments": "Part of the FORTIZO network.  Various rates apply depending on the type of contract.",
    "StatusTypeID": 50,
    "DateLastStatusUpdate": "2019-01-03T19:34:00Z",
    "DataQualityLevel": 1,
    "DateCreated": "2018-09-30T18:59:00Z",
    "SubmissionStatusTypeID": 200
}