{
    "IsRecentlyVerified": false,
    "ID": 16489,
    "UUID": "3D80AE64-C8B2-45FF-BC43-B0D932F64731",
    "DataProviderID": 2,
    "DataProvidersReference": "51534",
    "UsageTypeID": 1,
    "AddressInfo": {
        "ID": 16834,
        "Title": "Kitchen Associates",
        "AddressLine1": "76 Leominster Rd",
        "Town": "Sterling",
        "StateOrProvince": "MA",
        "Postcode": "01564",
        "CountryID": 2,
        "Latitude": 42.447366,
        "Longitude": -71.750743,
        "ContactTelephone1": "978-422-3322",
        "AccessComments": "24 hours daily; for customer use only",
        "RelatedURL": "",
        "DistanceUnit": 0
    },
    "Connections": [
        {
            "ID": 16969,
            "ConnectionTypeID": 1,
            "LevelID": 2,
            "Amps": 16,
            "Voltage": 230,
            "PowerKW": 3.7,
            "CurrentTypeID": 10,
            "Quantity": 1
        },
        {
            "ID": 22178,
            "ConnectionTypeID": 1,
            "LevelID": 2,
            "Quantity": 1
        }
    ],
    "DateLastStatusUpdate": "2020-06-26T03:06:00Z",
    "DataQualityLevel": 3,
    "DateCreated": "2013-04-29T04:56:00Z",
    "SubmissionStatusTypeID": 100
}