{
    "IsRecentlyVerified": false,
    "ID": 180864,
    "UUID": "B7D83A33-EBA6-4C66-9A1F-E27F62AD5115",
    "DataProviderID": 29,
    "DataProvidersReference": "13818",
    "OperatorID": 45,
    "AddressInfo": {
        "ID": 181223,
        "Title": "Im Lindes 2",
        "AddressLine1": "Im Lindes 2",
        "Town": "Bad Kissingen",
        "Postcode": "97688",
        "CountryID": 87,
        "Latitude": 50.18311,
        "Longitude": 10.07647,
        "DistanceUnit": 0
    },
    "Connections": [
        {
            "ID": 284487,
            "ConnectionTypeID": 25,
            "StatusTypeID": 50,
            "LevelID": 2,
            "PowerKW": 22,
            "CurrentTypeID": 20
        },
        {
            "ID": 284488,
            "ConnectionTypeID": 25,
            "StatusTypeID": 50,
            "LevelID": 2,
            "PowerKW": 22,
            "CurrentTypeID": 20
        }
    ],
    "StatusTypeID": 50,
    "DateLastStatusUpdate": "2021-07-09T03:19:00Z",
    "MetadataValues": [
        {
            "ID": 13158,
            "MetadataFieldID": 4,
            "ItemValue": "Data from the German chargepoint registry provided by Bundesnetzagentur.de under the CC-BY 4.0 license"
        }
    ],
    "DataQualityLevel": 3,
    "DateCreated": "2021-07-08T10:01:00Z",
    "SubmissionStatusTypeID": 100
}