{
    "IsRecentlyVerified": false,
    "ID": 182250,
    "UUID": "3DD76A02-4DA7-4EFF-BCE6-F2038F72C492",
    "DataProviderID": 29,
    "DataProvidersReference": "3397",
    "OperatorID": 1240,
    "AddressInfo": {
        "ID": 182609,
        "Title": "Hauptstr.",
        "AddressLine1": "Hauptstr.",
        "Town": "Herschweiler-Pettersheim",
        "Postcode": "66909",
        "CountryID": 87,
        "Latitude": 49.476413,
        "Longitude": 7.345677,
        "DistanceUnit": 0
    },
    "Connections": [
        {
            "ID": 287759,
            "ConnectionTypeID": 25,
            "StatusTypeID": 50,
            "LevelID": 2,
            "PowerKW": 22,
            "CurrentTypeID": 20
        },
        {
            "ID": 287760,
            "ConnectionTypeID": 25,
            "StatusTypeID": 50,
            "LevelID": 2,
            "PowerKW": 22,
            "CurrentTypeID": 20
        }
    ],
    "StatusTypeID": 50,
    "DateLastStatusUpdate": "2021-07-12T02:43:00Z",
    "MetadataValues": [
        {
            "ID": 14544,
            "MetadataFieldID": 4,
            "ItemValue": "Data from the German chargepoint registry provided by Bundesnetzagentur.de under the CC-BY 4.0 license"
        }
    ],
    "DataQualityLevel": 3,
    "DateCreated": "2021-07-08T10:02:00Z",
    "SubmissionStatusTypeID": 100
}