{
    "IsRecentlyVerified": false,
    "ID": 137534,
    "UUID": "96ED672E-2953-4760-889C-0B6FE064D0EE",
    "DataProviderID": 2,
    "DataProvidersReference": "145335",
    "OperatorID": 5,
    "UsageTypeID": 1,
    "AddressInfo": {
        "ID": 137880,
        "Title": "RCS",
        "AddressLine1": "6651 Gate Pkwy N",
        "Town": "Jacksonville",
        "StateOrProvince": "FL",
        "Postcode": "32256",
        "CountryID": 2,
        "Latitude": 30.24901,
        "Longitude": -81.52055,
        "ContactTelephone1": "888-758-4389",
        "AccessComments": "24 hours daily",
        "RelatedURL": "http://www.chargepoint.com/",
        "DistanceUnit": 0
    },
    "Connections": [
        {
            "ID": 192462,
            "ConnectionTypeID": 1,
            "LevelID": 2,
            "Amps": 16,
            "Voltage": 230,
            "PowerKW": 3,
            "CurrentTypeID": 10,
            "Quantity": 2
        }
    ],
    "StatusTypeID": 50,
    "DateLastStatusUpdate": "2019-12-24T09:05:00Z",
    "DataQualityLevel": 3,
    "DateCreated": "2019-12-24T09:05:00Z",
    "SubmissionStatusTypeID": 100
}