{
    "IsRecentlyVerified": false,
    "ID": 13817,
    "UUID": "40B29B89-3D52-4DE5-B31F-8339DBC51599",
    "DataProviderID": 15,
    "DataProvidersReference": "23531",
    "OperatorID": 5,
    "AddressInfo": {
        "ID": 13714,
        "Title": "750 Gonzalez Dr",
        "AddressLine1": "750 Gonzalez Dr",
        "Town": "San Francisco",
        "StateOrProvince": "California",
        "Postcode": "94132",
        "CountryID": 2,
        "Latitude": 37.71764374,
        "Longitude": -122.4809494,
        "ContactTelephone1": "",
        "RelatedURL": "http://carstations.com/23531",
        "DistanceUnit": 0
    },
    "Connections": [
        {
            "ID": 11264,
            "ConnectionTypeID": 1,
            "Reference": "J1772",
            "LevelID": 2
        }
    ],
    "StatusTypeID": 0,
    "DateLastStatusUpdate": "2017-11-04T14:04:00Z",
    "DataQualityLevel": 2,
    "DateCreated": "2012-12-06T11:08:00Z",
    "SubmissionStatusTypeID": 100
}