{
    "IsRecentlyVerified": false,
    "ID": 136557,
    "UUID": "52C4670E-04BA-4260-B464-B73E1D4082FB",
    "DataProviderID": 18,
    "DataProvidersReference": "a76a25b08df9964728e96bc8c8720e5d",
    "OperatorID": 20,
    "UsageTypeID": 1,
    "AddressInfo": {
        "ID": 136903,
        "Title": "Memorial Woodlands Earthcott Road",
        "AddressLine1": "Memorial Woodlands Earthcott Road",
        "Town": "Alveston",
        "Postcode": "BS35 3TA",
        "CountryID": 1,
        "Latitude": 51.571359,
        "Longitude": -2.498436,
        "AccessComments": "",
        "RelatedURL": "http://www.chargeyourcar.org.uk",
        "DistanceUnit": 0
    },
    "Connections": [
        {
            "ID": 191009,
            "ConnectionTypeID": 2,
            "Reference": "1",
            "StatusTypeID": 50,
            "LevelID": 3,
            "Amps": 125,
            "Voltage": 400,
            "PowerKW": 50,
            "CurrentTypeID": 30
        },
        {
            "ID": 191010,
            "ConnectionTypeID": 1036,
            "Reference": "2",
            "StatusTypeID": 50,
            "LevelID": 3,
            "Amps": 125,
            "Voltage": 400,
            "PowerKW": 50,
            "CurrentTypeID": 30
        },
        {
            "ID": 191011,
            "ConnectionTypeID": 1036,
            "Reference": "3",
            "StatusTypeID": 50,
            "LevelID": 3,
            "Amps": 63,
            "Voltage": 400,
            "PowerKW": 43,
            "CurrentTypeID": 20
        }
    ],
    "StatusTypeID": 0,
    "DateLastStatusUpdate": "2021-07-12T03:38:00Z",
    "MetadataValues": [
        {
            "ID": 6409,
            "MetadataFieldID": 4,
            "ItemValue": "Contains public sector information licensed under the Open Government Licence v2.0. http://www.nationalarchives.gov.uk/doc/open-government-licence/version/2/"
        }
    ],
    "DataQualityLevel": 3,
    "DateCreated": "2019-12-24T05:22:00Z",
    "SubmissionStatusTypeID": 100
}