{
    "IsRecentlyVerified": false,
    "ID": 165380,
    "UUID": "0BFB1E5D-84EE-4ED1-9655-FDD4CF6E8CA3",
    "DataProviderID": 28,
    "DataProvidersReference": "FR*55C*P83120*STM*MERMOZ",
    "UsageTypeID": 5,
    "AddressInfo": {
        "ID": 165739,
        "Title": "Sainte-Maxime",
        "AddressLine1": "Parking Jean Mermoz",
        "CountryID": 80,
        "Latitude": 43.310428,
        "Longitude": 6.634794,
        "AccessComments": "24/24 7/7 jours",
        "DistanceUnit": 0
    },
    "Connections": [
        {
            "ID": 238329,
            "ConnectionTypeID": 1036,
            "StatusTypeID": 50,
            "LevelID": 2,
            "PowerKW": 22,
            "CurrentTypeID": 20
        },
        {
            "ID": 238330,
            "ConnectionTypeID": 1036,
            "StatusTypeID": 50,
            "LevelID": 2,
            "PowerKW": 22,
            "CurrentTypeID": 20
        }
    ],
    "GeneralComments": "Badges et application PlugSurfing, Badges KiWhi et partenaires, Badges Sodetrel (Zen et Premium), Abonnés Plus de Bornes",
    "StatusTypeID": 50,
    "DateLastStatusUpdate": "2020-08-27T05:10:00Z",
    "DataQualityLevel": 2,
    "DateCreated": "2020-08-27T05:10:00Z",
    "SubmissionStatusTypeID": 100
}