{
    "IsRecentlyVerified": false,
    "ID": 115982,
    "UUID": "81BBA6E7-08B1-4648-8725-2C9361C014B9",
    "DataProviderID": 2,
    "DataProvidersReference": "117268",
    "UsageTypeID": 2,
    "AddressInfo": {
        "ID": 116328,
        "Title": "POST",
        "AddressLine1": "200 Smith St",
        "Town": "Waltham",
        "StateOrProvince": "MA",
        "Postcode": "02451",
        "CountryID": 2,
        "Latitude": 42.418168,
        "Longitude": -71.254239,
        "ContactTelephone1": "",
        "AccessComments": "",
        "RelatedURL": "",
        "DistanceUnit": 0
    },
    "Connections": [
        {
            "ID": 163035,
            "ConnectionTypeID": 1,
            "LevelID": 2,
            "Amps": 16,
            "Voltage": 230,
            "PowerKW": 3.7,
            "CurrentTypeID": 10,
            "Quantity": 6
        }
    ],
    "DateLastStatusUpdate": "2020-06-26T03:06:00Z",
    "DataQualityLevel": 3,
    "DateCreated": "2019-02-11T07:13:00Z",
    "SubmissionStatusTypeID": 100
}