{
    "IsRecentlyVerified": false,
    "ID": 79050,
    "UUID": "AAF210D9-62C3-4E15-BF4C-81C67BF51558",
    "DataProviderID": 1,
    "OperatorID": 23,
    "OperatorsReference": "6417",
    "UsageTypeID": 4,
    "UsageCost": "$0.22/min >=60kW; $0.11/min <60kW; other tariffs for older cars",
    "AddressInfo": {
        "ID": 79396,
        "Title": "La Crosse Supercharger",
        "AddressLine1": "2845 Midwest DR",
        "Town": "Onalaska",
        "StateOrProvince": "WI",
        "Postcode": "54650",
        "CountryID": 2,
        "Latitude": 43.879042,
        "Longitude": -91.188428,
        "DistanceUnit": 0
    },
    "Connections": [
        {
            "ID": 113669,
            "ConnectionTypeID": 27,
            "StatusTypeID": 50,
            "LevelID": 3,
            "PowerKW": 120,
            "CurrentTypeID": 30,
            "Quantity": 6
        }
    ],
    "NumberOfPoints": 6,
    "GeneralComments": "6 Superchargers, available 24/7",
    "StatusTypeID": 50,
    "DateLastStatusUpdate": "2018-03-13T13:28:00Z",
    "DataQualityLevel": 1,
    "DateCreated": "2017-01-26T19:14:00Z",
    "SubmissionStatusTypeID": 200
}