{
    "IsRecentlyVerified": false,
    "ID": 91479,
    "UUID": "55F56402-E0CD-4357-8F53-C18DB86BC485",
    "DataProviderID": 2,
    "DataProvidersReference": "86208",
    "OperatorID": 5,
    "UsageTypeID": 1,
    "AddressInfo": {
        "ID": 91825,
        "Title": "HAMPTON INN",
        "AddressLine1": "I-95",
        "Town": "Pawtucket",
        "StateOrProvince": "RI",
        "Postcode": "02860",
        "CountryID": 2,
        "Latitude": 41.8736214,
        "Longitude": -71.3868718,
        "ContactTelephone1": "888-758-4389",
        "AccessComments": "24 hours daily",
        "RelatedURL": "http://www.chargepoint.com/",
        "DistanceUnit": 0
    },
    "Connections": [
        {
            "ID": 129649,
            "ConnectionTypeID": 1,
            "LevelID": 2,
            "Amps": 16,
            "Voltage": 230,
            "PowerKW": 3.7,
            "CurrentTypeID": 10,
            "Quantity": 2
        }
    ],
    "DateLastStatusUpdate": "2020-06-26T03:05:00Z",
    "DataQualityLevel": 3,
    "DateCreated": "2017-08-03T12:25:00Z",
    "SubmissionStatusTypeID": 100
}