{
    "IsRecentlyVerified": false,
    "ID": 71012,
    "UUID": "D7C108E6-E0A0-4F68-930C-AB9776D5DDCE",
    "DataProviderID": 1,
    "OperatorID": 1,
    "UsageTypeID": 4,
    "AddressInfo": {
        "ID": 71358,
        "Title": "EDP Pola de Siero",
        "AddressLine1": "Calle Celleruelo, 7",
        "Town": "Pola de Siero",
        "StateOrProvince": "Asturias",
        "Postcode": "33510",
        "CountryID": 210,
        "Latitude": 43.3931314,
        "Longitude": -5.6617996999999605,
        "DistanceUnit": 0
    },
    "Connections": [
        {
            "ID": 101751,
            "ConnectionTypeID": 25,
            "StatusTypeID": 50,
            "LevelID": 2,
            "Quantity": 1
        },
        {
            "ID": 101752,
            "ConnectionTypeID": 28,
            "StatusTypeID": 50,
            "LevelID": 2,
            "Amps": 16,
            "Voltage": 230,
            "PowerKW": 3.6,
            "CurrentTypeID": 10,
            "Quantity": 1
        }
    ],
    "NumberOfPoints": 2,
    "StatusTypeID": 50,
    "DateLastStatusUpdate": "2016-08-22T16:18:00Z",
    "DataQualityLevel": 1,
    "DateCreated": "2016-08-22T16:18:00Z",
    "SubmissionStatusTypeID": 200
}