{
    "IsRecentlyVerified": false,
    "ID": 154827,
    "UUID": "16788233-20B7-478E-9F9A-B8B42DDCF7CC",
    "DataProviderID": 1,
    "OperatorID": 1,
    "UsageTypeID": 1,
    "UsageCost": "0",
    "AddressInfo": {
        "ID": 155180,
        "Title": "IKEA",
        "AddressLine1": "57 Bulevardul Theodor Pallady",
        "Town": "Bucharest",
        "Postcode": "032266",
        "CountryID": 184,
        "Latitude": 44.40750557894552,
        "Longitude": 26.206436745511837,
        "DistanceUnit": 0
    },
    "Connections": [
        {
            "ID": 217880,
            "ConnectionTypeID": 25,
            "StatusTypeID": 50,
            "LevelID": 2,
            "Amps": 32,
            "Voltage": 400,
            "PowerKW": 22,
            "CurrentTypeID": 20,
            "Quantity": 4
        }
    ],
    "NumberOfPoints": 4,
    "StatusTypeID": 50,
    "DateLastStatusUpdate": "2020-03-20T11:08:00Z",
    "DataQualityLevel": 1,
    "DateCreated": "2020-03-19T16:38:00Z",
    "SubmissionStatusTypeID": 200
}