{
    "IsRecentlyVerified": false,
    "ID": 185087,
    "UUID": "6D48C8F5-C912-4EE2-82FC-F69F50DE6F30",
    "DataProviderID": 29,
    "DataProvidersReference": "20778",
    "OperatorID": 3403,
    "AddressInfo": {
        "ID": 185446,
        "Title": "Bramfelder Chaussee 230",
        "AddressLine1": "Bramfelder Chaussee 230",
        "Town": "Hamburg",
        "Postcode": "22177",
        "CountryID": 87,
        "Latitude": 53.589945,
        "Longitude": 10.076934,
        "DistanceUnit": 0
    },
    "Connections": [
        {
            "ID": 294130,
            "ConnectionTypeID": 25,
            "StatusTypeID": 50,
            "LevelID": 2,
            "PowerKW": 11,
            "CurrentTypeID": 20
        }
    ],
    "StatusTypeID": 50,
    "DateLastStatusUpdate": "2021-07-09T03:30:00Z",
    "MetadataValues": [
        {
            "ID": 17378,
            "MetadataFieldID": 4,
            "ItemValue": "Data from the German chargepoint registry provided by Bundesnetzagentur.de under the CC-BY 4.0 license"
        }
    ],
    "DataQualityLevel": 3,
    "DateCreated": "2021-07-08T10:06:00Z",
    "SubmissionStatusTypeID": 100
}