{
    "IsRecentlyVerified": false,
    "ID": 145225,
    "UUID": "38DE1BCA-5C37-4276-95AE-17B6FB79AFC3",
    "DataProviderID": 2,
    "DataProvidersReference": "147813",
    "OperatorID": 39,
    "UsageTypeID": 1,
    "AddressInfo": {
        "ID": 145577,
        "Title": "Nisqually Red Wind Casino",
        "AddressLine1": "12819 Yelm Hwy SE",
        "Town": "Olympia",
        "StateOrProvince": "WA",
        "Postcode": "98513",
        "CountryID": 2,
        "Latitude": 47.0002897,
        "Longitude": -122.6682861,
        "ContactTelephone1": "800-663-5633",
        "AccessComments": "MO: Not Specified; TU: Not Specified; WE: Not Specified; TH: Not Specified; FR: Not Specified; SA: Not Specified; SU: Not Specified",
        "RelatedURL": "http://www.semacharge.com/",
        "DistanceUnit": 0
    },
    "Connections": [
        {
            "ID": 201845,
            "ConnectionTypeID": 1,
            "LevelID": 2,
            "Amps": 16,
            "Voltage": 230,
            "PowerKW": 3.7,
            "CurrentTypeID": 10,
            "Quantity": 4
        }
    ],
    "StatusTypeID": 50,
    "DateLastStatusUpdate": "2020-06-26T03:10:00Z",
    "DataQualityLevel": 3,
    "DateCreated": "2019-12-24T09:24:00Z",
    "SubmissionStatusTypeID": 100
}