{
    "IsRecentlyVerified": false,
    "ID": 91827,
    "UUID": "98B66D88-40FC-434F-B88D-4765C9AED343",
    "DataProviderID": 1,
    "OperatorID": 23,
    "OperatorsReference": "32850",
    "UsageTypeID": 4,
    "AddressInfo": {
        "ID": 92173,
        "Title": "Empress Hotel",
        "AddressLine1": "7766 Fay Ave",
        "Town": "La Jolla",
        "StateOrProvince": "California",
        "Postcode": "92037",
        "CountryID": 2,
        "Latitude": 32.844475,
        "Longitude": -117.275126,
        "ContactTelephone1": "(858) 454-3001",
        "DistanceUnit": 0
    },
    "Connections": [
        {
            "ID": 130176,
            "ConnectionTypeID": 30,
            "StatusTypeID": 50,
            "LevelID": 2,
            "PowerKW": 16,
            "CurrentTypeID": 20,
            "Quantity": 2
        }
    ],
    "NumberOfPoints": 2,
    "GeneralComments": "2 Tesla Connectors, up to 16kW.Available for customers. Please call ahead.",
    "StatusTypeID": 50,
    "DateLastStatusUpdate": "2017-08-18T07:42:00Z",
    "DataQualityLevel": 1,
    "DateCreated": "2017-08-18T07:42:00Z",
    "SubmissionStatusTypeID": 200
}