{
    "IsRecentlyVerified": false,
    "ID": 72547,
    "UUID": "634017BC-79E1-4150-B464-96E083475676",
    "DataProviderID": 1,
    "OperatorID": 73,
    "UsageTypeID": 4,
    "AddressInfo": {
        "ID": 72893,
        "Title": "EV-Box EVB-P1608444",
        "AddressLine1": "Groesbeekseweg 24",
        "AddressLine2": "Nijmegen",
        "Town": "Nimega",
        "StateOrProvince": "Stadsregio Arnhem Nijmegen",
        "Postcode": "6524DC",
        "CountryID": 159,
        "Latitude": 51.8400776365621,
        "Longitude": 5.86221385918272,
        "DistanceUnit": 0
    },
    "Connections": [
        {
            "ID": 103984,
            "ConnectionTypeID": 25,
            "StatusTypeID": 50,
            "LevelID": 2,
            "PowerKW": 11,
            "CurrentTypeID": 20,
            "Quantity": 1
        }
    ],
    "NumberOfPoints": 2,
    "StatusTypeID": 50,
    "DateLastStatusUpdate": "2016-10-22T23:19:00Z",
    "DataQualityLevel": 1,
    "DateCreated": "2016-10-21T21:41:00Z",
    "SubmissionStatusTypeID": 200
}