{
    "IsRecentlyVerified": false,
    "ID": 99438,
    "UUID": "73A91DD6-7394-4DCB-A617-C5B94BF95A85",
    "DataProviderID": 1,
    "OperatorID": 23,
    "OperatorsReference": "40030",
    "UsageTypeID": 4,
    "AddressInfo": {
        "ID": 99784,
        "Title": "The Murieta Inn & Spa",
        "AddressLine1": "7337 Murieta DR",
        "Town": "Rancho Murieta",
        "StateOrProvince": "California",
        "Postcode": "95683",
        "CountryID": 2,
        "Latitude": 38.491195,
        "Longitude": -121.099724,
        "ContactTelephone1": "(916) 354-3900",
        "DistanceUnit": 0
    },
    "Connections": [
        {
            "ID": 140527,
            "ConnectionTypeID": 30,
            "StatusTypeID": 50,
            "LevelID": 2,
            "PowerKW": 8,
            "CurrentTypeID": 10,
            "Quantity": 1
        }
    ],
    "NumberOfPoints": 1,
    "GeneralComments": "1 Tesla Connector, up to 8kW.Available for customers. Please call ahead.",
    "StatusTypeID": 50,
    "DateLastStatusUpdate": "2018-01-26T06:49:00Z",
    "DataQualityLevel": 1,
    "DateCreated": "2018-01-26T06:49:00Z",
    "SubmissionStatusTypeID": 200
}