{
    "UserComments": [
        {
            "ID": 23686,
            "ChargePointID": 171126,
            "CommentTypeID": 10,
            "UserName": "ForumElettrico.it",
            "Comment": "Si raggiunge dalla superstrada SS76 uscendo a Jesi Est. Leggi la recensione completa qui > https://www.forumelettrico.it/forum/colonnina-evad-fast-jesi-viale-dell-industria-t14661.html",
            "RelatedURL": "https://www.forumelettrico.it/forum/colonnina-evad-fast-jesi-viale-dell-industria-t14661.html",
            "DateCreated": "2020-12-25T14:37:23.123Z",
            "User": {
                "ID": 11749,
                "Username": "ForumElettrico.it"
            },
            "CheckinStatusTypeID": 10,
            "IsActionedByEditor": false
        }
    ],
    "MediaItems": [
        {
            "ID": 25944,
            "ChargePointID": 171126,
            "ItemURL": "https://s3-ap-southeast-2.amazonaws.com/openchargemap/images/IT/OCM171126/OCM-171126.orig.2020122514373239.jpg",
            "ItemThumbnailURL": "https://s3-ap-southeast-2.amazonaws.com/openchargemap/images/IT/OCM171126/OCM-171126.thmb.2020122514373239.jpg",
            "Comment": "",
            "IsEnabled": true,
            "IsVideo": false,
            "IsFeaturedItem": false,
            "IsExternalResource": false,
            "User": {
                "ID": 11749,
                "Username": "ForumElettrico.it"
            },
            "DateCreated": "2020-12-25T14:38:00Z"
        },
        {
            "ID": 25945,
            "ChargePointID": 171126,
            "ItemURL": "https://s3-ap-southeast-2.amazonaws.com/openchargemap/images/IT/OCM171126/OCM-171126.orig.2020122514373919.jpg",
            "ItemThumbnailURL": "https://s3-ap-southeast-2.amazonaws.com/openchargemap/images/IT/OCM171126/OCM-171126.thmb.2020122514373919.jpg",
            "Comment": "",
            "IsEnabled": true,
            "IsVideo": false,
            "IsFeaturedItem": false,
            "IsExternalResource": false,
            "User": {
                "ID": 11749,
                "Username": "ForumElettrico.it"
            },
            "DateCreated": "2020-12-25T14:38:00Z"
        },
        {
            "ID": 25946,
            "ChargePointID": 171126,
            "ItemURL": "https://s3-ap-southeast-2.amazonaws.com/openchargemap/images/IT/OCM171126/OCM-171126.orig.2020122514374453.jpg",
            "ItemThumbnailURL": "https://s3-ap-southeast-2.amazonaws.com/openchargemap/images/IT/OCM171126/OCM-171126.thmb.2020122514374453.jpg",
            "Comment": "",
            "IsEnabled": true,
            "IsVideo": false,
            "IsFeaturedItem": false,
            "IsExternalResource": false,
            "User": {
                "ID": 11749,
                "Username": "ForumElettrico.it"
            },
            "DateCreated": "2020-12-25T14:38:00Z"
        },
        {
            "ID": 25947,
            "ChargePointID": 171126,
            "ItemURL": "https://s3-ap-southeast-2.amazonaws.com/openchargemap/images/IT/OCM171126/OCM-171126.orig.2020122514375122.jpg",
            "ItemThumbnailURL": "https://s3-ap-southeast-2.amazonaws.com/openchargemap/images/IT/OCM171126/OCM-171126.thmb.2020122514375122.jpg",
            "Comment": "",
            "IsEnabled": true,
            "IsVideo": false,
            "IsFeaturedItem": false,
            "IsExternalResource": false,
            "User": {
                "ID": 11749,
                "Username": "ForumElettrico.it"
            },
            "DateCreated": "2020-12-25T14:38:00Z"
        }
    ],
    "IsRecentlyVerified": false,
    "ID": 171126,
    "UUID": "BE225B62-E6E1-442F-95A7-282FC37A7DA1",
    "DataProviderID": 1,
    "OperatorID": 80,
    "UsageTypeID": 4,
    "AddressInfo": {
        "ID": 171485,
        "Title": "JESI Industria | ENELX FAST",
        "AddressLine1": "Viale dell'Industria",
        "Town": "Jesi",
        "StateOrProvince": "AN",
        "Postcode": "60035",
        "CountryID": 112,
        "Latitude": 43.537613621251666,
        "Longitude": 13.267980932749424,
        "RelatedURL": "https://www.enelx.com/it/it/emobility",
        "DistanceUnit": 0
    },
    "Connections": [
        {
            "ID": 261502,
            "ConnectionTypeID": 33,
            "StatusTypeID": 50,
            "LevelID": 3,
            "Amps": 120,
            "Voltage": 500,
            "PowerKW": 50,
            "CurrentTypeID": 30,
            "Quantity": 1
        },
        {
            "ID": 261503,
            "ConnectionTypeID": 2,
            "StatusTypeID": 50,
            "LevelID": 3,
            "Amps": 120,
            "Voltage": 500,
            "PowerKW": 50,
            "CurrentTypeID": 30,
            "Quantity": 1
        },
        {
            "ID": 261504,
            "ConnectionTypeID": 1036,
            "StatusTypeID": 50,
            "LevelID": 3,
            "Amps": 64,
            "Voltage": 400,
            "PowerKW": 43,
            "CurrentTypeID": 20,
            "Quantity": 1
        }
    ],
    "NumberOfPoints": 2,
    "StatusTypeID": 50,
    "DateLastStatusUpdate": "2020-12-25T14:38:00Z",
    "DataQualityLevel": 1,
    "DateCreated": "2020-12-21T13:52:00Z",
    "SubmissionStatusTypeID": 200
}