{
    "IsRecentlyVerified": false,
    "ID": 9195,
    "UUID": "DC781AFA-245E-4E8A-9FF7-3A8DCF0CFBBB",
    "DataProviderID": 15,
    "DataProvidersReference": "12861",
    "OperatorID": 26,
    "UsageTypeID": 2,
    "AddressInfo": {
        "ID": 9092,
        "Title": "8942 West Sam Houston Pkwy N",
        "AddressLine1": "8942 West Sam Houston Pkwy N",
        "Town": "Houston",
        "StateOrProvince": "TX",
        "Postcode": "77064",
        "CountryID": 2,
        "Latitude": 29.902256,
        "Longitude": -95.550445,
        "ContactTelephone1": "877-455-3833",
        "RelatedURL": "http://carstations.com/12861",
        "DistanceUnit": 0
    },
    "Connections": [
        {
            "ID": 6876,
            "ConnectionTypeID": 1,
            "Reference": "J1772",
            "LevelID": 2
        },
        {
            "ID": 7314,
            "ConnectionTypeID": 2,
            "Reference": "CHADEMO",
            "LevelID": 3,
            "Quantity": 1
        }
    ],
    "NumberOfPoints": 2,
    "StatusTypeID": 50,
    "DateLastStatusUpdate": "2017-11-04T14:03:00Z",
    "DataQualityLevel": 2,
    "DateCreated": "2012-01-23T15:12:00Z",
    "SubmissionStatusTypeID": 100
}