{
    "IsRecentlyVerified": false,
    "ID": 161277,
    "UUID": "3A521D3F-B4F4-45CA-BC4D-C8912CF0E9C6",
    "DataProviderID": 1,
    "OperatorID": 3378,
    "UsageTypeID": 5,
    "AddressInfo": {
        "ID": 161634,
        "Title": "Balatonakarattya 71 MOL",
        "AddressLine1": "Enyingi utca, 71.sz. főút",
        "Town": "Balatonakarattya",
        "StateOrProvince": "Veszprém megye",
        "Postcode": "8172",
        "CountryID": 104,
        "Latitude": 47.013495308340595,
        "Longitude": 18.169508655010077,
        "AccessComments": "MOL benzinkúton ",
        "RelatedURL": "https://molplugee.hu/hu/toltoink",
        "DistanceUnit": 0
    },
    "Connections": [
        {
            "ID": 232053,
            "ConnectionTypeID": 33,
            "StatusTypeID": 50,
            "LevelID": 3,
            "PowerKW": 50,
            "CurrentTypeID": 30,
            "Quantity": 1
        },
        {
            "ID": 232054,
            "ConnectionTypeID": 2,
            "StatusTypeID": 50,
            "LevelID": 3,
            "PowerKW": 50,
            "CurrentTypeID": 30,
            "Quantity": 1
        },
        {
            "ID": 232055,
            "ConnectionTypeID": 1036,
            "StatusTypeID": 50,
            "LevelID": 3,
            "PowerKW": 43,
            "CurrentTypeID": 20,
            "Quantity": 1
        }
    ],
    "NumberOfPoints": 1,
    "GeneralComments": "EFACEC QC45",
    "StatusTypeID": 50,
    "DateLastStatusUpdate": "2020-07-16T16:28:00Z",
    "DataQualityLevel": 1,
    "DateCreated": "2020-07-08T07:46:00Z",
    "SubmissionStatusTypeID": 200
}