{
    "IsRecentlyVerified": false,
    "ID": 63776,
    "UUID": "97359CDC-B391-4019-9105-57237C3ADB9B",
    "DataProviderID": 26,
    "DataProvidersReference": "78345",
    "OperatorID": 157,
    "OperatorsReference": "NewMotion 02013069",
    "UsageCost": "0.00 jaarabonnement",
    "AddressInfo": {
        "ID": 64122,
        "Title": "Gronausestraat 710",
        "AddressLine1": "Gronausestraat 710",
        "Town": "Enschede",
        "Postcode": "7534 AM",
        "CountryID": 159,
        "Latitude": 52.2166672,
        "Longitude": 6.94596790000003,
        "ContactTelephone1": "088 0109500",
        "RelatedURL": "http://thenewmotion.nl/",
        "DistanceUnit": 0
    },
    "Connections": [
        {
            "ID": 81463,
            "ConnectionTypeID": 25,
            "LevelID": 2,
            "PowerKW": 3.7,
            "CurrentTypeID": 10
        },
        {
            "ID": 81464,
            "ConnectionTypeID": 25,
            "LevelID": 2,
            "PowerKW": 3.7,
            "CurrentTypeID": 10
        }
    ],
    "NumberOfPoints": 1,
    "StatusTypeID": 50,
    "DateLastStatusUpdate": "2016-06-04T02:51:00Z",
    "DataQualityLevel": 3,
    "DateCreated": "2016-03-03T12:32:00Z",
    "SubmissionStatusTypeID": 100
}