{
    "IsRecentlyVerified": false,
    "ID": 114473,
    "UUID": "BDB45AE4-4120-47B5-BF0A-3E9AD81D69BF",
    "DataProviderID": 1,
    "OperatorID": 80,
    "UsageTypeID": 4,
    "AddressInfo": {
        "ID": 114819,
        "Title": "Cormano Gramsci | EnelX",
        "AddressLine1": "Via Antonio Gramsci",
        "Town": "Cormano",
        "StateOrProvince": "MI",
        "Postcode": "20032",
        "CountryID": 112,
        "Latitude": 45.538935207947084,
        "Longitude": 9.166275714902286,
        "ContactTelephone1": "800.069.850",
        "RelatedURL": "https://www.enelx.com/it/it/emobility",
        "DistanceUnit": 0
    },
    "Connections": [
        {
            "ID": 161143,
            "ConnectionTypeID": 25,
            "StatusTypeID": 150,
            "LevelID": 2,
            "Amps": 32,
            "Voltage": 400,
            "PowerKW": 22,
            "CurrentTypeID": 20,
            "Quantity": 2
        }
    ],
    "NumberOfPoints": 2,
    "StatusTypeID": 150,
    "DateLastStatusUpdate": "2019-01-08T10:46:00Z",
    "DataQualityLevel": 1,
    "DateCreated": "2019-01-08T10:46:00Z",
    "SubmissionStatusTypeID": 200
}