{
    "IsRecentlyVerified": false,
    "ID": 129386,
    "UUID": "562275A5-C298-4F05-947C-5E769F4767AF",
    "DataProviderID": 1,
    "OperatorID": 20,
    "OperatorsReference": "70683-(POLAR)",
    "UsageTypeID": 4,
    "UsageCost": "£0.09/kWh",
    "AddressInfo": {
        "ID": 129732,
        "Title": "St James's Square",
        "AddressLine1": "St James's Square",
        "Postcode": "SW1Y 4PD",
        "CountryID": 1,
        "Latitude": 51.50773,
        "Longitude": -0.13457,
        "DistanceUnit": 0
    },
    "Connections": [
        {
            "ID": 181081,
            "ConnectionTypeID": 25,
            "StatusTypeID": 50,
            "LevelID": 2,
            "Amps": 32,
            "Voltage": 230,
            "PowerKW": 7,
            "CurrentTypeID": 10,
            "Quantity": 1
        }
    ],
    "NumberOfPoints": 1,
    "StatusTypeID": 50,
    "DateLastStatusUpdate": "2019-07-19T05:13:00Z",
    "DataQualityLevel": 1,
    "DateCreated": "2019-07-19T05:13:00Z",
    "SubmissionStatusTypeID": 200
}