{
    "IsRecentlyVerified": false,
    "ID": 15117,
    "UUID": "26FFE6B1-A091-4FC8-B0FB-4549170CA834",
    "DataProviderID": 1,
    "OperatorID": 45,
    "OperatorsReference": "Decoy Country Cottages",
    "UsageTypeID": 7,
    "AddressInfo": {
        "ID": 15463,
        "Title": "Decoy Country Cottages",
        "AddressLine1": "Navan",
        "Town": "Meath",
        "StateOrProvince": "County Meath",
        "CountryID": 3,
        "Latitude": 53.604131,
        "Longitude": -6.585513,
        "DistanceUnit": 0
    },
    "Connections": [
        {
            "ID": 26649,
            "ConnectionTypeID": 25,
            "StatusTypeID": 50,
            "LevelID": 2,
            "Amps": 16,
            "Voltage": 230,
            "PowerKW": 3.7,
            "CurrentTypeID": 10,
            "Quantity": 1
        }
    ],
    "NumberOfPoints": 1,
    "StatusTypeID": 50,
    "DateLastStatusUpdate": "2016-06-01T11:19:00Z",
    "DataQualityLevel": 2,
    "DateCreated": "2012-12-11T15:08:00Z",
    "SubmissionStatusTypeID": 100
}