{
    "IsRecentlyVerified": false,
    "ID": 68958,
    "UUID": "70283944-6385-4218-90CD-A90E5DFAD679",
    "DataProviderID": 1,
    "DataProvidersReference": "3394",
    "AddressInfo": {
        "ID": 69304,
        "Title": "Åslandhellinga 273-449",
        "AddressLine1": "Åslandhellinga 273-449",
        "Town": "OSLO",
        "StateOrProvince": "Oslo",
        "Postcode": "1274",
        "CountryID": 168,
        "Latitude": 59.82371,
        "Longitude": 10.84286,
        "AccessComments": "Innerst i Sameiet",
        "DistanceUnit": 0
    },
    "Connections": [
        {
            "ID": 96723,
            "ConnectionTypeID": 0,
            "Reference": "1",
            "LevelID": 2,
            "Amps": 32,
            "Voltage": 400,
            "PowerKW": 22,
            "Comments": "Mode 3"
        },
        {
            "ID": 96724,
            "ConnectionTypeID": 0,
            "Reference": "2",
            "LevelID": 2,
            "Amps": 32,
            "Voltage": 400,
            "PowerKW": 22,
            "Comments": "Mode 3"
        }
    ],
    "NumberOfPoints": 2,
    "DateLastStatusUpdate": "2020-05-26T08:23:00Z",
    "DataQualityLevel": 2,
    "DateCreated": "2016-06-25T03:52:00Z",
    "SubmissionStatusTypeID": 100
}