{
    "IsRecentlyVerified": false,
    "ID": 23829,
    "UUID": "4BCDB63E-5C16-4E02-8392-4CDF3399E25C",
    "DataProviderID": 1,
    "OperatorID": 206,
    "UsageTypeID": 4,
    "UsageCost": "Free",
    "AddressInfo": {
        "ID": 24174,
        "Title": "B:SM 7 - Ciutat del Teatre",
        "AddressLine1": "Carrer de la França Xica, 35",
        "Town": "BARCELONA",
        "StateOrProvince": "Barcelona",
        "Postcode": "08004",
        "CountryID": 210,
        "Latitude": 41.37212,
        "Longitude": 2.156625,
        "ContactTelephone1": "93.424.61.60",
        "AccessComments": "Aparcament públic - Targeta BCN Live / Public parking - BCN Live card",
        "RelatedURL": "http://www.aparcamentsbsm.cat/index.php/fichas-xarxa-01/ciutat-del-teatre.html",
        "DistanceUnit": 0
    },
    "Connections": [
        {
            "ID": 25850,
            "ConnectionTypeID": 25,
            "StatusTypeID": 50,
            "LevelID": 2,
            "Amps": 32,
            "Voltage": 230,
            "PowerKW": 7.2,
            "Quantity": 3
        },
        {
            "ID": 65446,
            "ConnectionTypeID": 28,
            "StatusTypeID": 50,
            "LevelID": 2,
            "Amps": 16,
            "Voltage": 230,
            "PowerKW": 3.6,
            "Quantity": 3
        }
    ],
    "NumberOfPoints": 3,
    "GeneralComments": "CIRCUTOR CCL-WB-SL-MIX",
    "StatusTypeID": 50,
    "DateLastStatusUpdate": "2015-09-06T18:50:00Z",
    "DataQualityLevel": 1,
    "DateCreated": "2014-06-03T05:18:00Z",
    "SubmissionStatusTypeID": 200
}