{
    "IsRecentlyVerified": false,
    "ID": 149561,
    "UUID": "2B879C70-6A9C-4DD9-8559-427E7B29581A",
    "DataProviderID": 1,
    "OperatorID": 20,
    "OperatorsReference": "70118,70119",
    "UsageTypeID": 4,
    "UsageCost": "£0.36/kWh",
    "AddressInfo": {
        "ID": 149914,
        "Title": "Winnersh Park & Ride",
        "AddressLine1": "Wharfedale Road",
        "AddressLine2": "Winnersh Triangle",
        "Town": "Winnersh",
        "Postcode": "RG41 5TS",
        "CountryID": 1,
        "Latitude": 51.43785,
        "Longitude": -0.8938,
        "DistanceUnit": 0
    },
    "Connections": [
        {
            "ID": 207663,
            "ConnectionTypeID": 2,
            "StatusTypeID": 50,
            "LevelID": 3,
            "PowerKW": 50,
            "CurrentTypeID": 30,
            "Quantity": 2
        },
        {
            "ID": 207664,
            "ConnectionTypeID": 1036,
            "StatusTypeID": 50,
            "LevelID": 3,
            "PowerKW": 43,
            "CurrentTypeID": 20,
            "Quantity": 2
        },
        {
            "ID": 207665,
            "ConnectionTypeID": 33,
            "StatusTypeID": 50,
            "LevelID": 3,
            "PowerKW": 50,
            "CurrentTypeID": 30,
            "Quantity": 2
        }
    ],
    "NumberOfPoints": 2,
    "StatusTypeID": 50,
    "DateLastStatusUpdate": "2020-06-02T15:25:00Z",
    "DataQualityLevel": 1,
    "DateCreated": "2020-02-29T06:16:00Z",
    "SubmissionStatusTypeID": 200
}