{
    "IsRecentlyVerified": false,
    "ID": 42009,
    "UUID": "DBBF7CF5-733A-4194-BCCB-F8622B15DA69",
    "DataProviderID": 2,
    "DataProvidersReference": "65671",
    "UsageTypeID": 1,
    "AddressInfo": {
        "ID": 42355,
        "Title": "New Brunswick Parking Authority",
        "AddressLine1": "95 Patterson St",
        "Town": "New Brunswick",
        "StateOrProvince": "NJ",
        "Postcode": "08901",
        "CountryID": 2,
        "Latitude": 40.494646,
        "Longitude": -74.447516,
        "ContactTelephone1": "732-545-3118",
        "AccessComments": "Restricted to garage hours; pay lot",
        "RelatedURL": "",
        "DistanceUnit": 0
    },
    "Connections": [
        {
            "ID": 50382,
            "ConnectionTypeID": 1,
            "LevelID": 2,
            "Amps": 16,
            "Voltage": 230,
            "PowerKW": 3.7,
            "CurrentTypeID": 10,
            "Quantity": 5
        },
        {
            "ID": 50383,
            "ConnectionTypeID": 1,
            "LevelID": 2,
            "Amps": 16,
            "Voltage": 230,
            "PowerKW": 3,
            "CurrentTypeID": 10,
            "Quantity": 9
        }
    ],
    "DateLastStatusUpdate": "2020-06-26T03:03:00Z",
    "DataQualityLevel": 3,
    "DateCreated": "2015-02-23T02:09:00Z",
    "SubmissionStatusTypeID": 100
}