{
    "MediaItems": [
        {
            "ID": 18404,
            "ChargePointID": 20083,
            "ItemURL": "https://s3-ap-southeast-2.amazonaws.com/openchargemap/images/GB/OCM20083/OCM-20083.orig.2019051516092175.jpg",
            "ItemThumbnailURL": "https://s3-ap-southeast-2.amazonaws.com/openchargemap/images/GB/OCM20083/OCM-20083.thmb.2019051516092175.jpg",
            "Comment": "",
            "IsEnabled": true,
            "IsVideo": false,
            "IsFeaturedItem": false,
            "IsExternalResource": false,
            "User": {
                "ID": 15366,
                "Username": "ZCWCara"
            },
            "DateCreated": "2019-05-15T16:10:00Z"
        }
    ],
    "IsRecentlyVerified": false,
    "ID": 20083,
    "UUID": "1A9CC0EF-CB78-4864-8134-00037DC87A95",
    "DataProviderID": 1,
    "OperatorID": 19,
    "UsageTypeID": 1,
    "UsageCost": "Free for guests, small fee for passing EVs",
    "AddressInfo": {
        "ID": 20428,
        "Title": "The Old Coach House",
        "AddressLine1": "Dolcorsllwyn",
        "AddressLine2": "Aberangell",
        "Town": "Machynlleth",
        "StateOrProvince": "Powys",
        "Postcode": "SY20 9AB",
        "CountryID": 1,
        "Latitude": 52.666035,
        "Longitude": -3.708239,
        "ContactTelephone1": "01650 511 333",
        "RelatedURL": "http://www.theoldcoachhousecottage.co.uk/",
        "DistanceUnit": 0
    },
    "Connections": [
        {
            "ID": 19984,
            "ConnectionTypeID": 25,
            "StatusTypeID": 50,
            "LevelID": 2,
            "Amps": 32,
            "Voltage": 230,
            "PowerKW": 7,
            "CurrentTypeID": 10,
            "Quantity": 1
        }
    ],
    "NumberOfPoints": 1,
    "StatusTypeID": 50,
    "DateLastStatusUpdate": "2019-05-15T16:11:00Z",
    "DataQualityLevel": 1,
    "DateCreated": "2013-10-29T06:28:00Z",
    "SubmissionStatusTypeID": 200
}