{
    "UserComments": [
        {
            "ID": 24987,
            "ChargePointID": 189439,
            "CommentTypeID": 10,
            "UserName": "ForumElettrico.it",
            "Comment": "A 5 m c'è una pasticceria e dall'altra parte della strada un Aldi ed un Lidl. Leggi la recensione completa qui:  https://www.forumelettrico.it/forum/colonnine-40-kw-dc-audi-grand-prix-ferrara-via-eridano-7-t20646.html",
            "RelatedURL": "https://www.forumelettrico.it/forum/colonnine-40-kw-dc-audi-grand-prix-ferrara-via-eridano-7-t20646.html",
            "DateCreated": "2021-10-28T09:50:46.793Z",
            "User": {
                "ID": 11749,
                "Username": "ForumElettrico.it"
            },
            "CheckinStatusTypeID": 10,
            "IsActionedByEditor": false
        }
    ],
    "MediaItems": [
        {
            "ID": 29643,
            "ChargePointID": 189439,
            "ItemURL": "https://s3-ap-southeast-2.amazonaws.com/openchargemap/images/IT/OCM189439/OCM-189439.orig.2021102809505828.jpg",
            "ItemThumbnailURL": "https://s3-ap-southeast-2.amazonaws.com/openchargemap/images/IT/OCM189439/OCM-189439.thmb.2021102809505828.jpg",
            "Comment": "",
            "IsEnabled": true,
            "IsVideo": false,
            "IsFeaturedItem": false,
            "IsExternalResource": false,
            "User": {
                "ID": 11749,
                "Username": "ForumElettrico.it"
            },
            "DateCreated": "2021-10-28T09:51:00Z"
        },
        {
            "ID": 29472,
            "ChargePointID": 189439,
            "ItemURL": "https://s3-ap-southeast-2.amazonaws.com/openchargemap/images/IT/OCM189439/OCM-189439.orig.2021100610473202.jpg",
            "ItemThumbnailURL": "https://s3-ap-southeast-2.amazonaws.com/openchargemap/images/IT/OCM189439/OCM-189439.thmb.2021100610473202.jpg",
            "Comment": "",
            "IsEnabled": true,
            "IsVideo": false,
            "IsFeaturedItem": false,
            "IsExternalResource": false,
            "User": {
                "ID": 27473,
                "Username": "Roberto "
            },
            "DateCreated": "2021-10-06T10:48:00Z"
        },
        {
            "ID": 29473,
            "ChargePointID": 189439,
            "ItemURL": "https://s3-ap-southeast-2.amazonaws.com/openchargemap/images/IT/OCM189439/OCM-189439.orig.2021100610475320.jpg",
            "ItemThumbnailURL": "https://s3-ap-southeast-2.amazonaws.com/openchargemap/images/IT/OCM189439/OCM-189439.thmb.2021100610475320.jpg",
            "Comment": "",
            "IsEnabled": true,
            "IsVideo": false,
            "IsFeaturedItem": false,
            "IsExternalResource": false,
            "User": {
                "ID": 27473,
                "Username": "Roberto "
            },
            "DateCreated": "2021-10-06T10:48:00Z"
        }
    ],
    "IsRecentlyVerified": true,
    "DateLastVerified": "2021-10-01T08:22:00Z",
    "ID": 189439,
    "UUID": "73225177-13FC-4B93-A7E9-20906281E571",
    "DataProviderID": 1,
    "OperatorID": 1,
    "UsageTypeID": 4,
    "UsageCost": "€ 0.44/kWh + € 0.01/minute",
    "AddressInfo": {
        "ID": 189798,
        "Title": "Via Annibale Zucchini AUDI GRAN PRIX",
        "AddressLine1": "Via Annibale Zucchini 7",
        "Town": "Ferrara",
        "StateOrProvince": "Emilia-Romagna",
        "Postcode": "44044",
        "CountryID": 112,
        "Latitude": 44.84996795878013,
        "Longitude": 11.588619829225848,
        "RelatedURL": "http://nextcharge.app",
        "DistanceUnit": 0
    },
    "Connections": [
        {
            "ID": 306393,
            "ConnectionTypeID": 33,
            "Reference": "nextcharge",
            "StatusTypeID": 50,
            "LevelID": 3,
            "PowerKW": 40,
            "CurrentTypeID": 30,
            "Quantity": 1
        }
    ],
    "NumberOfPoints": 3,
    "GeneralComments": "",
    "StatusTypeID": 50,
    "DateLastStatusUpdate": "2021-10-28T09:51:00Z",
    "DataQualityLevel": 1,
    "DateCreated": "2021-10-01T08:22:00Z",
    "SubmissionStatusTypeID": 200
}