{
    "IsRecentlyVerified": false,
    "ID": 95624,
    "UUID": "5039E758-9D45-40C2-B0AE-0491D0C3D2AC",
    "DataProviderID": 1,
    "OperatorID": 3253,
    "OperatorsReference": "*EAT0701762*001AC",
    "UsageTypeID": 1,
    "UsageCost": "€0,04/min ; Andere Tarife möglich",
    "AddressInfo": {
        "ID": 95970,
        "Title": "Ladestation Kuhotel By Rilano",
        "AddressLine1": "Sonnwenstraße 13B",
        "Town": "Waidring",
        "StateOrProvince": "Tirol",
        "Postcode": "6384",
        "CountryID": 19,
        "Latitude": 47.585032,
        "Longitude": 12.575074,
        "DistanceUnit": 0
    },
    "Connections": [
        {
            "ID": 135450,
            "ConnectionTypeID": 1036,
            "StatusTypeID": 50,
            "LevelID": 2,
            "Amps": 32,
            "Voltage": 400,
            "PowerKW": 11,
            "CurrentTypeID": 20,
            "Quantity": 1
        }
    ],
    "NumberOfPoints": 2,
    "StatusTypeID": 50,
    "DateLastStatusUpdate": "2019-06-12T14:24:00Z",
    "DataQualityLevel": 1,
    "DateCreated": "2017-11-15T21:09:00Z",
    "SubmissionStatusTypeID": 200
}