{
    "UserComments": [
        {
            "ID": 14049,
            "ChargePointID": 52840,
            "CommentTypeID": 10,
            "UserName": "TheScotstounPele",
            "Comment": "Successful Chademo charge. Both sides appear fine.",
            "DateCreated": "2016-08-13T11:04:02.287Z",
            "User": {
                "ID": 6377,
                "Username": "TheScotstounPele"
            },
            "CheckinStatusTypeID": 10
        },
        {
            "ID": 13770,
            "ChargePointID": 52840,
            "CommentTypeID": 10,
            "UserName": "Anon74856763534",
            "Comment": "CHAdeMO charge.",
            "DateCreated": "2016-07-03T16:44:55.823Z",
            "User": {
                "ID": 1192,
                "Username": "Anon74856763534"
            },
            "CheckinStatusTypeID": 10
        },
        {
            "ID": 10051,
            "ChargePointID": 52840,
            "CommentTypeID": 10,
            "UserName": "jdsx",
            "Comment": "",
            "DateCreated": "2016-03-31T08:36:47.397Z",
            "User": {
                "ID": 6415,
                "Username": "jdsx"
            },
            "CheckinStatusTypeID": 10
        },
        {
            "ID": 9850,
            "ChargePointID": 52840,
            "CommentTypeID": 10,
            "UserName": "Robert Malcolm Kay",
            "Comment": "No phone signal : refused to authorise my CYC card",
            "Rating": 1,
            "DateCreated": "2016-03-03T15:47:45.273Z",
            "User": {
                "ID": 4751,
                "Username": "Robert Malcolm Kay"
            },
            "CheckinStatusTypeID": 40
        },
        {
            "ID": 9565,
            "ChargePointID": 52840,
            "CommentTypeID": 10,
            "UserName": "Anon74856763534",
            "Comment": "",
            "DateCreated": "2016-01-24T17:06:10.853Z",
            "User": {
                "ID": 1192,
                "Username": "Anon74856763534"
            },
            "CheckinStatusTypeID": 10
        },
        {
            "ID": 7857,
            "ChargePointID": 52840,
            "CommentTypeID": 10,
            "UserName": "Margaret K",
            "Comment": "",
            "DateCreated": "2015-10-26T22:11:35.77Z",
            "User": {
                "ID": 6348,
                "Username": "Margaret K"
            },
            "CheckinStatusTypeID": 10
        },
        {
            "ID": 6481,
            "ChargePointID": 52840,
            "CommentTypeID": 10,
            "UserName": "Anon74856763534",
            "Comment": "Successful DC charge reported.",
            "DateCreated": "2015-09-13T16:19:13.923Z",
            "User": {
                "ID": 1192,
                "Username": "Anon74856763534"
            },
            "CheckinStatusTypeID": 0
        }
    ],
    "IsRecentlyVerified": false,
    "ID": 52840,
    "UUID": "FA1F28BE-E0C1-45A3-BA7E-8DCFD6FD70FC",
    "DataProviderID": 1,
    "OperatorID": 3315,
    "OperatorsReference": "50925",
    "UsageTypeID": 4,
    "UsageCost": "Free",
    "AddressInfo": {
        "ID": 53186,
        "Title": "Riverside Car Park",
        "AddressLine1": "Manse Road",
        "Town": "Aberfoyle",
        "Postcode": "FK8 3UG",
        "CountryID": 1,
        "Latitude": 56.178108,
        "Longitude": -4.384278,
        "DistanceUnit": 0
    },
    "Connections": [
        {
            "ID": 65762,
            "ConnectionTypeID": 33,
            "StatusTypeID": 100,
            "LevelID": 3,
            "PowerKW": 50,
            "CurrentTypeID": 30,
            "Quantity": 1
        },
        {
            "ID": 65763,
            "ConnectionTypeID": 2,
            "StatusTypeID": 50,
            "LevelID": 3,
            "PowerKW": 50,
            "CurrentTypeID": 30,
            "Quantity": 1
        },
        {
            "ID": 65764,
            "ConnectionTypeID": 1036,
            "StatusTypeID": 50,
            "LevelID": 3,
            "Voltage": 400,
            "PowerKW": 43,
            "CurrentTypeID": 20,
            "Quantity": 1
        }
    ],
    "NumberOfPoints": 2,
    "StatusTypeID": 50,
    "DateLastStatusUpdate": "2019-09-23T05:14:00Z",
    "DataQualityLevel": 1,
    "DateCreated": "2015-09-12T16:12:00Z",
    "SubmissionStatusTypeID": 200
}