{
    "IsRecentlyVerified": false,
    "ID": 38152,
    "UUID": "C7D039BC-865C-46EF-9F51-7B5732049A27",
    "DataProviderID": 26,
    "DataProvidersReference": "48632",
    "OperatorID": 178,
    "OperatorsReference": "EVnetNL REE507",
    "UsageCost": "0.00 jaarabonnement",
    "AddressInfo": {
        "ID": 38498,
        "Title": "Jonkerplantsoen 7",
        "AddressLine1": "Jonkerplantsoen 7",
        "Town": "Zaanstad",
        "Postcode": "1508 EE",
        "CountryID": 159,
        "Latitude": 52.459919,
        "Longitude": 4.815903,
        "ContactTelephone1": "0800-3522365",
        "RelatedURL": "http://www.evnet.nl",
        "DistanceUnit": 0
    },
    "Connections": [
        {
            "ID": 41663,
            "ConnectionTypeID": 25,
            "LevelID": 1,
            "PowerKW": 2.3,
            "CurrentTypeID": 10
        }
    ],
    "NumberOfPoints": 1,
    "StatusTypeID": 50,
    "DateLastStatusUpdate": "2016-06-04T02:54:00Z",
    "DataQualityLevel": 3,
    "DateCreated": "2015-01-09T06:07:00Z",
    "SubmissionStatusTypeID": 100
}