{
    "IsRecentlyVerified": false,
    "ID": 175690,
    "UUID": "70F144FA-F13B-4E26-A9F9-B19365472116",
    "DataProviderID": 1,
    "OperatorID": 105,
    "UsageTypeID": 4,
    "AddressInfo": {
        "ID": 176049,
        "Title": "Poststraße",
        "AddressLine1": "Poststraße 74",
        "Town": "Timmendorfer Strand",
        "StateOrProvince": "Schleswig-Holstein",
        "Postcode": "23669",
        "CountryID": 87,
        "Latitude": 53.9926274445215,
        "Longitude": 10.789905937711183,
        "DistanceUnit": 0
    },
    "Connections": [
        {
            "ID": 272804,
            "ConnectionTypeID": 25,
            "StatusTypeID": 50,
            "LevelID": 2,
            "Amps": 32,
            "Voltage": 400,
            "PowerKW": 22,
            "CurrentTypeID": 20,
            "Quantity": 2
        }
    ],
    "NumberOfPoints": 1,
    "GeneralComments": "24/7 verfügbare Ladesäule am Straßenrand",
    "StatusTypeID": 50,
    "DateLastStatusUpdate": "2021-06-07T10:06:00Z",
    "DataQualityLevel": 1,
    "DateCreated": "2021-06-07T10:06:00Z",
    "SubmissionStatusTypeID": 200
}