{
    "IsRecentlyVerified": false,
    "ID": 120333,
    "UUID": "D5A4BEBF-557C-47C4-94BA-DAFC1EB62132",
    "DataProviderID": 2,
    "DataProvidersReference": "95529",
    "OperatorID": 9,
    "UsageTypeID": 1,
    "AddressInfo": {
        "ID": 120679,
        "Title": "Morning Star Properties",
        "AddressLine1": "710 N Echols Ave",
        "Town": "Tucson",
        "StateOrProvince": "AZ",
        "Postcode": "85705",
        "CountryID": 2,
        "Latitude": 32.230671,
        "Longitude": -110.970743,
        "ContactTelephone1": "888-998-2546",
        "AccessComments": "MON: 24 hours | TUE: 24 hours | WED: 24 hours | THU: 24 hours | FRI: 24 hours | SAT: 24 hours | SUN: 24 hours",
        "RelatedURL": "http://www.blinkcharging.com/",
        "DistanceUnit": 0
    },
    "Connections": [
        {
            "ID": 169668,
            "ConnectionTypeID": 1,
            "LevelID": 2,
            "Amps": 16,
            "Voltage": 230,
            "PowerKW": 3,
            "CurrentTypeID": 10,
            "Quantity": 1
        }
    ],
    "DateLastStatusUpdate": "2019-04-01T04:59:00Z",
    "DataQualityLevel": 3,
    "DateCreated": "2019-04-01T04:59:00Z",
    "SubmissionStatusTypeID": 100
}