{
    "IsRecentlyVerified": false,
    "ID": 180066,
    "UUID": "E9FF2545-3682-4AC8-A0FE-5A64377B1F49",
    "DataProviderID": 29,
    "DataProvidersReference": "1987",
    "OperatorID": 234,
    "AddressInfo": {
        "ID": 180425,
        "Title": "Von-Pechmann-Straße 18",
        "AddressLine1": "Von-Pechmann-Straße 18",
        "Town": "Neunkirchen",
        "Postcode": "91077",
        "CountryID": 87,
        "Latitude": 49.6107,
        "Longitude": 11.13082,
        "DistanceUnit": 0
    },
    "Connections": [
        {
            "ID": 282703,
            "ConnectionTypeID": 25,
            "StatusTypeID": 50,
            "LevelID": 2,
            "PowerKW": 22,
            "CurrentTypeID": 20
        },
        {
            "ID": 282704,
            "ConnectionTypeID": 25,
            "StatusTypeID": 50,
            "LevelID": 2,
            "PowerKW": 22,
            "CurrentTypeID": 20
        }
    ],
    "StatusTypeID": 50,
    "DateLastStatusUpdate": "2021-07-09T03:17:00Z",
    "MetadataValues": [
        {
            "ID": 12360,
            "MetadataFieldID": 4,
            "ItemValue": "Data from the German chargepoint registry provided by Bundesnetzagentur.de under the CC-BY 4.0 license"
        }
    ],
    "DataQualityLevel": 3,
    "DateCreated": "2021-07-08T10:00:00Z",
    "SubmissionStatusTypeID": 100
}