{
    "IsRecentlyVerified": false,
    "ID": 31421,
    "UUID": "012E7A93-B671-4D9B-8991-DBCDAD3FBCEE",
    "DataProviderID": 26,
    "DataProvidersReference": "56989",
    "OperatorID": 78,
    "OperatorsReference": "Essent EM-MT-00000002-01-00001",
    "UsageCost": "0.00 jaarabonnement",
    "AddressInfo": {
        "ID": 31767,
        "Title": "Triq il-Kbira",
        "AddressLine1": "Triq il-Kbira",
        "Town": "Balzan",
        "Postcode": "BKR1810",
        "CountryID": 140,
        "Latitude": 35.898511,
        "Longitude": 14.451492,
        "RelatedURL": "http://www.essent.nl",
        "DistanceUnit": 0
    },
    "Connections": [
        {
            "ID": 34932,
            "ConnectionTypeID": 25,
            "LevelID": 2,
            "PowerKW": 11,
            "CurrentTypeID": 10
        },
        {
            "ID": 45856,
            "ConnectionTypeID": 25,
            "LevelID": 2,
            "PowerKW": 11,
            "CurrentTypeID": 10
        }
    ],
    "NumberOfPoints": 1,
    "StatusTypeID": 50,
    "DateLastStatusUpdate": "2016-06-04T02:37:00Z",
    "DataQualityLevel": 3,
    "DateCreated": "2015-01-09T06:03:00Z",
    "SubmissionStatusTypeID": 100
}