{
    "IsRecentlyVerified": false,
    "ID": 111442,
    "UUID": "1ADE7F4E-D97A-46D3-BD45-D93779E80AC1",
    "DataProviderID": 2,
    "DataProvidersReference": "84708",
    "UsageTypeID": 1,
    "AddressInfo": {
        "ID": 111788,
        "Title": "Petro-Canada",
        "AddressLine1": "18215 boul de Versailles",
        "Town": "Mirabel",
        "StateOrProvince": "QC",
        "Postcode": "J7J 0R6",
        "CountryID": 44,
        "Latitude": 45.677297,
        "Longitude": -73.91906,
        "ContactTelephone1": "450-419-8215",
        "AccessComments": "24 hours daily",
        "RelatedURL": "",
        "DistanceUnit": 0
    },
    "Connections": [
        {
            "ID": 156869,
            "ConnectionTypeID": 2,
            "LevelID": 3,
            "Amps": 100,
            "Voltage": 400,
            "PowerKW": 40,
            "CurrentTypeID": 30,
            "Quantity": 1
        },
        {
            "ID": 156870,
            "ConnectionTypeID": 32,
            "LevelID": 3,
            "Amps": 100,
            "Voltage": 400,
            "PowerKW": 40,
            "CurrentTypeID": 30,
            "Quantity": 1
        }
    ],
    "DateLastStatusUpdate": "2019-12-24T09:23:00Z",
    "DataQualityLevel": 3,
    "DateCreated": "2018-10-18T23:37:00Z",
    "SubmissionStatusTypeID": 100
}