{
    "IsRecentlyVerified": false,
    "ID": 107759,
    "UUID": "378E27D6-C100-4306-B2F3-A364F8A82B43",
    "DataProviderID": 1,
    "OperatorID": 3319,
    "UsageTypeID": 1,
    "UsageCost": "bruttó 80 Ft/kWh",
    "AddressInfo": {
        "ID": 108105,
        "Title": "Pécs, Árnyas Liget utca",
        "AddressLine1": "Árnyas Liget utca",
        "Town": "Pécs",
        "StateOrProvince": "Baranya megye",
        "Postcode": "7632",
        "CountryID": 104,
        "Latitude": 46.050605,
        "Longitude": 18.228535,
        "ContactTelephone1": "+36 80 21-00-12",
        "ContactEmail": "kommunikacio@e-mobi.hu",
        "RelatedURL": "https://e-mobi.hu",
        "DistanceUnit": 0
    },
    "Connections": [
        {
            "ID": 152153,
            "ConnectionTypeID": 25,
            "StatusTypeID": 50,
            "LevelID": 2,
            "Amps": 32,
            "Voltage": 400,
            "PowerKW": 22,
            "CurrentTypeID": 20,
            "Quantity": 2
        }
    ],
    "NumberOfPoints": 2,
    "StatusTypeID": 50,
    "DateLastStatusUpdate": "2020-05-09T09:07:00Z",
    "DataQualityLevel": 1,
    "DateCreated": "2018-08-08T19:32:00Z",
    "SubmissionStatusTypeID": 200
}