{
    "IsRecentlyVerified": false,
    "ID": 110046,
    "UUID": "499426D8-2877-4A75-800F-EE4B01276D55",
    "DataProviderID": 2,
    "DataProvidersReference": "104019",
    "OperatorID": 5,
    "UsageTypeID": 1,
    "AddressInfo": {
        "ID": 110392,
        "Title": "23046 AVENIDA",
        "AddressLine1": "23046 Avenida De La Carlota",
        "Town": "Laguna Hills",
        "StateOrProvince": "CA",
        "Postcode": "92653",
        "CountryID": 2,
        "Latitude": 33.627622,
        "Longitude": -117.721924,
        "ContactTelephone1": "888-758-4389",
        "AccessComments": "24 hours daily",
        "RelatedURL": "http://www.chargepoint.com/",
        "DistanceUnit": 0
    },
    "Connections": [
        {
            "ID": 155275,
            "ConnectionTypeID": 1,
            "LevelID": 2,
            "Amps": 16,
            "Voltage": 230,
            "PowerKW": 3,
            "CurrentTypeID": 10,
            "Quantity": 4
        }
    ],
    "DateLastStatusUpdate": "2019-04-06T04:01:00Z",
    "DataQualityLevel": 3,
    "DateCreated": "2018-10-18T23:35:00Z",
    "SubmissionStatusTypeID": 100
}