{
    "IsRecentlyVerified": false,
    "ID": 54581,
    "UUID": "E5E21EA1-0220-4DAF-97F8-B7BD5D575ADA",
    "DataProviderID": 1,
    "DataProvidersReference": "3015",
    "AddressInfo": {
        "ID": 54927,
        "Title": "Katrineåsveien, Røyken",
        "AddressLine1": "Katrineåsveien 20",
        "Town": "RØYKEN",
        "StateOrProvince": "Viken",
        "Postcode": "3440",
        "CountryID": 168,
        "Latitude": 59.73998,
        "Longitude": 10.41331,
        "AccessComments": "Fire parkeringsplasser inntil Røyken rådhus på parkeringsplassen øst for bygget, mellom rådhuset og brannstasjonen.",
        "DistanceUnit": 0
    },
    "Connections": [
        {
            "ID": 68873,
            "ConnectionTypeID": 0,
            "Reference": "1",
            "LevelID": 2,
            "Amps": 16,
            "Voltage": 400,
            "PowerKW": 11,
            "Comments": "Mode 3"
        },
        {
            "ID": 85020,
            "ConnectionTypeID": 0,
            "Reference": "2",
            "LevelID": 2,
            "Amps": 16,
            "Voltage": 400,
            "PowerKW": 11,
            "Comments": "Mode 3"
        },
        {
            "ID": 85021,
            "ConnectionTypeID": 0,
            "Reference": "3",
            "LevelID": 2,
            "Amps": 16,
            "Voltage": 400,
            "PowerKW": 11,
            "Comments": "Mode 3"
        },
        {
            "ID": 85022,
            "ConnectionTypeID": 0,
            "Reference": "4",
            "LevelID": 2,
            "Amps": 16,
            "Voltage": 400,
            "PowerKW": 11,
            "Comments": "Mode 3"
        },
        {
            "ID": 85023,
            "ConnectionTypeID": 25,
            "Reference": "5",
            "LevelID": 2,
            "Amps": 16,
            "Voltage": 230,
            "PowerKW": 3.7,
            "CurrentTypeID": 10,
            "Comments": "Mode 3"
        },
        {
            "ID": 85024,
            "ConnectionTypeID": 25,
            "Reference": "6",
            "LevelID": 2,
            "Amps": 16,
            "Voltage": 230,
            "PowerKW": 3.7,
            "CurrentTypeID": 10,
            "Comments": "Mode 3"
        },
        {
            "ID": 88418,
            "ConnectionTypeID": 25,
            "Reference": "7",
            "LevelID": 2,
            "Amps": 16,
            "Voltage": 230,
            "PowerKW": 3.7,
            "CurrentTypeID": 10,
            "Comments": "Mode 3"
        }
    ],
    "NumberOfPoints": 4,
    "DateLastStatusUpdate": "2020-05-26T08:23:00Z",
    "DataQualityLevel": 2,
    "DateCreated": "2015-10-09T05:51:00Z",
    "SubmissionStatusTypeID": 100
}