{
    "IsRecentlyVerified": false,
    "ID": 150054,
    "UUID": "A864584D-8B31-4FBA-B459-C1A3419521AE",
    "DataProviderID": 18,
    "DataProvidersReference": "f900c61208841a8347dd4ddbea47b173",
    "OperatorID": 3391,
    "UsageTypeID": 1,
    "AddressInfo": {
        "ID": 150407,
        "Title": "Holland Road",
        "AddressLine1": "Holland Road",
        "Town": "Brighton",
        "Postcode": "BN3 1JY",
        "CountryID": 1,
        "Latitude": 50.829532,
        "Longitude": -0.160807,
        "AccessComments": "",
        "RelatedURL": "https://www.electricblueuk.com/",
        "DistanceUnit": 0
    },
    "Connections": [
        {
            "ID": 208340,
            "ConnectionTypeID": 25,
            "Reference": "62196-2 (SINGLE PHASE)",
            "StatusTypeID": 50,
            "LevelID": 2,
            "Amps": 16,
            "Voltage": 230,
            "PowerKW": 3.7,
            "CurrentTypeID": 10
        }
    ],
    "StatusTypeID": 0,
    "DateLastStatusUpdate": "2020-03-17T08:53:00Z",
    "MetadataValues": [
        {
            "ID": 7081,
            "MetadataFieldID": 4,
            "ItemValue": "Contains public sector information licensed under the Open Government Licence v2.0. http://www.nationalarchives.gov.uk/doc/open-government-licence/version/2/"
        }
    ],
    "DataQualityLevel": 3,
    "DateCreated": "2020-03-12T15:48:00Z",
    "SubmissionStatusTypeID": 100
}