{
    "IsRecentlyVerified": false,
    "ID": 61390,
    "UUID": "217249A5-7CB8-4CA3-AF87-AB57928424DA",
    "DataProviderID": 1,
    "DataProvidersReference": "3275",
    "AddressInfo": {
        "ID": 61736,
        "Title": "Bergstien Tannlegesenter, Drammen",
        "AddressLine1": "Bergstien 64",
        "Town": "DRAMMEN",
        "StateOrProvince": "Viken",
        "Postcode": "3016",
        "CountryID": 168,
        "Latitude": 59.74655,
        "Longitude": 10.21171,
        "AccessComments": "Nordsiden av huset, ned alléen.",
        "DistanceUnit": 0
    },
    "Connections": [
        {
            "ID": 78186,
            "ConnectionTypeID": 0,
            "Reference": "1",
            "LevelID": 2,
            "Amps": 16,
            "Voltage": 230,
            "PowerKW": 3.7,
            "Comments": "Mode 1"
        },
        {
            "ID": 85040,
            "ConnectionTypeID": 0,
            "Reference": "2",
            "LevelID": 2,
            "Amps": 16,
            "Voltage": 230,
            "PowerKW": 3.7,
            "Comments": "Mode 1"
        },
        {
            "ID": 88425,
            "ConnectionTypeID": 0,
            "Reference": "3",
            "LevelID": 2,
            "Amps": 16,
            "Voltage": 230,
            "PowerKW": 3.7,
            "Comments": "Mode 1"
        }
    ],
    "NumberOfPoints": 3,
    "DateLastStatusUpdate": "2020-05-26T08:23:00Z",
    "DataQualityLevel": 2,
    "DateCreated": "2016-02-27T02:32:00Z",
    "SubmissionStatusTypeID": 100
}