{
    "IsRecentlyVerified": false,
    "ID": 180876,
    "UUID": "3E47291D-9688-43D3-9EF1-1A5D0AAF58F6",
    "DataProviderID": 29,
    "DataProvidersReference": "14767",
    "OperatorID": 3403,
    "AddressInfo": {
        "ID": 181235,
        "Title": "Am Rathaus 1",
        "AddressLine1": "Am Rathaus 1",
        "Town": "Küps",
        "Postcode": "96328",
        "CountryID": 87,
        "Latitude": 50.191743,
        "Longitude": 11.27618,
        "DistanceUnit": 0
    },
    "Connections": [
        {
            "ID": 284512,
            "ConnectionTypeID": 25,
            "StatusTypeID": 50,
            "LevelID": 2,
            "PowerKW": 22,
            "CurrentTypeID": 20
        },
        {
            "ID": 284513,
            "ConnectionTypeID": 25,
            "StatusTypeID": 50,
            "LevelID": 2,
            "PowerKW": 22,
            "CurrentTypeID": 20
        }
    ],
    "StatusTypeID": 50,
    "DateLastStatusUpdate": "2021-07-09T03:19:00Z",
    "MetadataValues": [
        {
            "ID": 13170,
            "MetadataFieldID": 4,
            "ItemValue": "Data from the German chargepoint registry provided by Bundesnetzagentur.de under the CC-BY 4.0 license"
        }
    ],
    "DataQualityLevel": 3,
    "DateCreated": "2021-07-08T10:01:00Z",
    "SubmissionStatusTypeID": 100
}