{
    "IsRecentlyVerified": false,
    "ID": 174718,
    "UUID": "1E49FC63-CD1A-4D8D-88DD-F1F2A03622C8",
    "DataProviderID": 1,
    "OperatorID": 3323,
    "UsageTypeID": 4,
    "AddressInfo": {
        "ID": 175077,
        "Title": "Zes - Nissara Avm",
        "AddressLine1": "Kayseri C.",
        "Town": "Nevşehir merkez",
        "StateOrProvince": "Nevşehir",
        "Postcode": "",
        "CountryID": 229,
        "Latitude": 38.62491597751381,
        "Longitude": 34.715828946381976,
        "DistanceUnit": 0
    },
    "Connections": [
        {
            "ID": 270740,
            "ConnectionTypeID": 25,
            "StatusTypeID": 50,
            "LevelID": 2,
            "PowerKW": 22,
            "CurrentTypeID": 20,
            "Quantity": 2
        }
    ],
    "NumberOfPoints": 1,
    "StatusTypeID": 50,
    "DateLastStatusUpdate": "2021-04-11T18:53:00Z",
    "DataQualityLevel": 1,
    "DateCreated": "2021-04-11T18:35:00Z",
    "SubmissionStatusTypeID": 200
}