{
    "IsRecentlyVerified": false,
    "ID": 83933,
    "UUID": "DA03F8A5-2D9D-4021-9D89-52D303845767",
    "DataProviderID": 1,
    "DataProvidersReference": "3812",
    "AddressInfo": {
        "ID": 84279,
        "Title": "Autosalpa Porvoo",
        "AddressLine1": "Ratsumestarinkatu 1",
        "Town": "Porvoo Keskus",
        "StateOrProvince": "Uusimaa",
        "Postcode": "06100",
        "CountryID": 79,
        "Latitude": 60.39216,
        "Longitude": 25.60628,
        "AccessComments": "Yrityksen tai yhteisön omalla parkkialueella tai -hallissa",
        "DistanceUnit": 0
    },
    "Connections": [
        {
            "ID": 119187,
            "ConnectionTypeID": 0,
            "Reference": "1",
            "LevelID": 2,
            "Amps": 32,
            "Voltage": 400,
            "PowerKW": 22,
            "Comments": "Mode 3"
        },
        {
            "ID": 119188,
            "ConnectionTypeID": 0,
            "Reference": "2",
            "LevelID": 2,
            "Amps": 32,
            "Voltage": 400,
            "PowerKW": 22,
            "Comments": "Mode 3"
        }
    ],
    "NumberOfPoints": 2,
    "DateLastStatusUpdate": "2020-05-26T08:24:00Z",
    "DataQualityLevel": 2,
    "DateCreated": "2017-02-11T22:03:00Z",
    "SubmissionStatusTypeID": 100
}