{
    "IsRecentlyVerified": false,
    "ID": 160307,
    "UUID": "9DC0C69D-AB44-41C5-A3E7-172ECD4A4066",
    "DataProviderID": 2,
    "DataProvidersReference": "153290",
    "UsageTypeID": 1,
    "AddressInfo": {
        "ID": 160664,
        "Title": "Lubec Library",
        "AddressLine1": "55 Water St",
        "Town": "Lubec",
        "StateOrProvince": "ME",
        "Postcode": "04652",
        "CountryID": 2,
        "Latitude": 44.860246,
        "Longitude": -66.983343,
        "ContactTelephone1": "855-885-9571",
        "AccessComments": "10am-4pm daily",
        "RelatedURL": "",
        "DistanceUnit": 0
    },
    "Connections": [
        {
            "ID": 230652,
            "ConnectionTypeID": 1,
            "LevelID": 2,
            "Amps": 16,
            "Voltage": 230,
            "PowerKW": 3.7,
            "CurrentTypeID": 10,
            "Quantity": 2
        }
    ],
    "StatusTypeID": 50,
    "DateLastStatusUpdate": "2020-06-26T03:08:00Z",
    "DataQualityLevel": 3,
    "DateCreated": "2020-06-26T03:08:00Z",
    "SubmissionStatusTypeID": 100
}