{
    "IsRecentlyVerified": false,
    "ID": 121919,
    "UUID": "0FC7192F-CE34-4AF1-AD4E-E7B500FD6FAF",
    "DataProviderID": 2,
    "DataProvidersReference": "105495",
    "OperatorID": 9,
    "UsageTypeID": 1,
    "AddressInfo": {
        "ID": 122265,
        "Title": "McDonalds NSN9044",
        "AddressLine1": "2929 Peachtree Road",
        "Town": "Atlanta",
        "StateOrProvince": "GA",
        "Postcode": "30305",
        "CountryID": 2,
        "Latitude": 33.83515,
        "Longitude": -84.381725,
        "ContactTelephone1": "888-998-2546",
        "AccessComments": "MON: 24 hours | TUE: 24 hours | WED: 24 hours | THU: 24 hours | FRI: 24 hours | SAT: 24 hours | SUN: 24 hours",
        "RelatedURL": "http://www.blinkcharging.com/",
        "DistanceUnit": 0
    },
    "Connections": [
        {
            "ID": 171759,
            "ConnectionTypeID": 1,
            "LevelID": 2,
            "Amps": 16,
            "Voltage": 230,
            "PowerKW": 3.7,
            "CurrentTypeID": 10,
            "Quantity": 2
        }
    ],
    "DateLastStatusUpdate": "2020-06-26T02:56:00Z",
    "DataQualityLevel": 3,
    "DateCreated": "2019-04-06T05:02:00Z",
    "SubmissionStatusTypeID": 100
}