{
    "IsRecentlyVerified": false,
    "ID": 152740,
    "UUID": "D2605336-6743-45F8-B2EF-981641346415",
    "DataProviderID": 28,
    "DataProvidersReference": "FR*S49*P49035*001",
    "UsageTypeID": 5,
    "AddressInfo": {
        "ID": 153093,
        "Title": "BOUCHEMAINE - Rue Chevriere",
        "AddressLine1": "Rue Chevriere 49080 BOUCHEMAINE",
        "CountryID": 80,
        "Latitude": 47.424319,
        "Longitude": -0.609137,
        "AccessComments": "24h/24 7j/7",
        "DistanceUnit": 0
    },
    "Connections": [
        {
            "ID": 213956,
            "ConnectionTypeID": 25,
            "StatusTypeID": 50,
            "LevelID": 2,
            "PowerKW": 18,
            "CurrentTypeID": 20
        },
        {
            "ID": 213957,
            "ConnectionTypeID": 28,
            "StatusTypeID": 50,
            "LevelID": 2,
            "PowerKW": 18,
            "CurrentTypeID": 10
        },
        {
            "ID": 247143,
            "ConnectionTypeID": 25,
            "StatusTypeID": 50,
            "LevelID": 2,
            "PowerKW": 18,
            "CurrentTypeID": 20
        },
        {
            "ID": 247144,
            "ConnectionTypeID": 28,
            "StatusTypeID": 50,
            "LevelID": 2,
            "PowerKW": 18,
            "CurrentTypeID": 10
        }
    ],
    "GeneralComments": "Recharge par badge et avec une application smartphone",
    "StatusTypeID": 50,
    "DateLastStatusUpdate": "2020-08-27T05:13:00Z",
    "DataQualityLevel": 2,
    "DateCreated": "2020-03-15T10:54:00Z",
    "SubmissionStatusTypeID": 100
}