{
    "IsRecentlyVerified": false,
    "ID": 34196,
    "UUID": "F850F705-83C8-4773-8B9B-376238F7028A",
    "DataProviderID": 1,
    "OperatorID": 5,
    "OperatorsReference": "Chargepoint 1404409",
    "UsageCost": "0.00 afhankelijk van pas",
    "AddressInfo": {
        "ID": 34542,
        "Title": "Zuiderparkplein",
        "AddressLine1": "Zuiderparkplein",
        "Town": "Rotterdam",
        "Postcode": "3084 BD",
        "CountryID": 80,
        "Latitude": 48.758918,
        "Longitude": 2.083634,
        "RelatedURL": "http://www.chargepoint.nl",
        "DistanceUnit": 0
    },
    "Connections": [
        {
            "ID": 37707,
            "ConnectionTypeID": 25,
            "LevelID": 2,
            "PowerKW": 43,
            "CurrentTypeID": 10
        }
    ],
    "NumberOfPoints": 1,
    "StatusTypeID": 50,
    "DateLastStatusUpdate": "2021-04-25T05:14:00Z",
    "DataQualityLevel": 3,
    "DateCreated": "2015-01-09T06:04:00Z",
    "SubmissionStatusTypeID": 200
}