{
    "IsRecentlyVerified": false,
    "ID": 5797,
    "UUID": "FA44AD84-AAAF-4F44-876B-B1986227109D",
    "DataProviderID": 1,
    "OperatorID": 25,
    "OperatorsReference": "lewisham-pearcefieldavenuecarpark",
    "UsageTypeID": 4,
    "UsageCost": "£0.059/minute; min £1.18; other tariffs available. Parking fees apply.",
    "AddressInfo": {
        "ID": 5719,
        "Title": "Pearcefield Avenue Car Park",
        "AddressLine1": "Pearcefield Avenue",
        "AddressLine2": "Lewisham",
        "Town": "London",
        "Postcode": "SE23 3EU",
        "CountryID": 1,
        "Latitude": 51.440645,
        "Longitude": -0.055301,
        "DistanceUnit": 0
    },
    "Connections": [
        {
            "ID": 546,
            "ConnectionTypeID": 1,
            "StatusTypeID": 50,
            "LevelID": 2,
            "Amps": 16,
            "Voltage": 230,
            "PowerKW": 4,
            "CurrentTypeID": 10,
            "Quantity": 4
        },
        {
            "ID": 96327,
            "ConnectionTypeID": 25,
            "StatusTypeID": 50,
            "LevelID": 2,
            "Amps": 32,
            "Voltage": 230,
            "PowerKW": 7,
            "CurrentTypeID": 10,
            "Quantity": 4
        }
    ],
    "NumberOfPoints": 4,
    "StatusTypeID": 50,
    "DateLastStatusUpdate": "2018-03-06T06:33:00Z",
    "DataQualityLevel": 1,
    "DateCreated": "2011-09-12T11:40:00Z",
    "SubmissionStatusTypeID": 200
}