{
    "IsRecentlyVerified": false,
    "ID": 75382,
    "UUID": "5FE928BF-CD0F-40A7-A0AE-D353C22CE0B2",
    "DataProviderID": 1,
    "OperatorID": 23,
    "OperatorsReference": "19206",
    "UsageTypeID": 4,
    "UsageCost": "Free",
    "AddressInfo": {
        "ID": 75728,
        "Title": "La Côte Saint Jacques & Spa",
        "AddressLine1": "14 Faubourg de Paris",
        "Town": "Joigny",
        "Postcode": "89300",
        "CountryID": 80,
        "Latitude": 47.98365,
        "Longitude": 3.385155,
        "ContactTelephone1": "+33 3 86 62 09 70",
        "DistanceUnit": 0
    },
    "Connections": [
        {
            "ID": 108687,
            "ConnectionTypeID": 30,
            "StatusTypeID": 50,
            "LevelID": 2,
            "Amps": 32,
            "Voltage": 400,
            "PowerKW": 22,
            "CurrentTypeID": 20,
            "Quantity": 1
        }
    ],
    "NumberOfPoints": 1,
    "GeneralComments": "1 Tesla Connector, up to 22kW.Available to the public. Please see front desk.",
    "StatusTypeID": 50,
    "DateLastStatusUpdate": "2018-10-03T18:59:00Z",
    "DataQualityLevel": 1,
    "DateCreated": "2016-12-14T17:59:00Z",
    "SubmissionStatusTypeID": 200
}