{
    "IsRecentlyVerified": false,
    "ID": 144256,
    "UUID": "9C1D1972-7C6B-4653-8359-6F3673A9942D",
    "DataProviderID": 2,
    "DataProvidersReference": "130388",
    "OperatorID": 90,
    "UsageTypeID": 1,
    "AddressInfo": {
        "ID": 144608,
        "Title": "5505A Angers",
        "AddressLine1": "5505A rue Angers",
        "Town": "Montréal",
        "StateOrProvince": "QC",
        "Postcode": "H4E 1G5",
        "CountryID": 44,
        "Latitude": 45.463264,
        "Longitude": -73.584853,
        "ContactTelephone1": "877-505-2674",
        "AccessComments": "24 hours daily",
        "RelatedURL": "https://lecircuitelectrique.com/",
        "DistanceUnit": 0
    },
    "Connections": [
        {
            "ID": 200745,
            "ConnectionTypeID": 1,
            "LevelID": 2,
            "Amps": 16,
            "Voltage": 230,
            "PowerKW": 3.7,
            "CurrentTypeID": 10,
            "Quantity": 2
        }
    ],
    "StatusTypeID": 50,
    "DateLastStatusUpdate": "2020-06-26T03:09:00Z",
    "DataQualityLevel": 3,
    "DateCreated": "2019-12-24T09:23:00Z",
    "SubmissionStatusTypeID": 100
}