{
    "UserComments": [
        {
            "ID": 6570,
            "ChargePointID": 19126,
            "CommentTypeID": 10,
            "UserName": "Anon74856763534",
            "Comment": "",
            "Rating": 5,
            "DateCreated": "2015-09-25T18:15:21.687Z",
            "User": {
                "ID": 1192,
                "Username": "Anon74856763534"
            },
            "CheckinStatusTypeID": 10
        },
        {
            "ID": 6116,
            "ChargePointID": 19126,
            "CommentTypeID": 10,
            "UserName": "Mo",
            "Comment": "Have charged three times, though it is supposed to be a Rapid it only charged at 22kw",
            "Rating": 3,
            "DateCreated": "2015-08-04T10:33:35.85Z",
            "User": {
                "ID": 5084,
                "Username": "Mo"
            },
            "CheckinStatusTypeID": 10
        },
        {
            "ID": 4144,
            "ChargePointID": 19126,
            "CommentTypeID": 10,
            "UserName": "Anon74856763534",
            "Comment": "Successful charge although screen was frozen (showing last user's session).",
            "Rating": 4,
            "DateCreated": "2015-04-03T19:58:00.897Z",
            "User": {
                "ID": 1192,
                "Username": "Anon74856763534"
            },
            "CheckinStatusTypeID": 10
        },
        {
            "ID": 1363,
            "ChargePointID": 19126,
            "CommentTypeID": 10,
            "UserName": "",
            "Comment": "Please make sure you have a little extra battery if you use this charger. The rapids are ICE'd more often than not. ",
            "DateCreated": "2014-11-07T13:41:56.53Z",
            "CheckinStatusTypeID": 110
        },
        {
            "ID": 1362,
            "ChargePointID": 19126,
            "CommentTypeID": 10,
            "UserName": "",
            "Comment": "",
            "DateCreated": "2014-11-07T13:40:47Z",
            "CheckinStatusTypeID": 110
        },
        {
            "ID": 1340,
            "ChargePointID": 19126,
            "CommentTypeID": 10,
            "UserName": "",
            "Comment": "I can charge on this charger. It accepted my CYC card and I don't work for the council. Gates seem to be unlocked all day and I charged on the Chademo. ",
            "Rating": 2,
            "DateCreated": "2014-11-01T06:04:56.377Z",
            "CheckinStatusTypeID": 10
        }
    ],
    "MediaItems": [
        {
            "ID": 700,
            "ChargePointID": 19126,
            "ItemURL": "https://s3-ap-southeast-2.amazonaws.com/openchargemap/images/GB/OCM19126/OCM-19126.orig.2014110713440856.jpg",
            "ItemThumbnailURL": "https://s3-ap-southeast-2.amazonaws.com/openchargemap/images/GB/OCM19126/OCM-19126.thmb.2014110713440856.jpg",
            "Comment": "Charging. The bay next to me was ICE'd. Charger seems slower than other rapids but will confirm. ",
            "IsEnabled": true,
            "IsVideo": false,
            "IsFeaturedItem": false,
            "IsExternalResource": false,
            "User": {
                "ID": 2385,
                "Username": "EVchav187"
            },
            "DateCreated": "2014-11-07T13:44:00Z"
        },
        {
            "ID": 229,
            "ChargePointID": 19126,
            "ItemURL": "https://s3-ap-southeast-2.amazonaws.com/openchargemap/images/GB/OCM19126/OCM-19126.orig.2014021608145109.jpg",
            "ItemThumbnailURL": "https://s3-ap-southeast-2.amazonaws.com/openchargemap/images/GB/OCM19126/OCM-19126.thmb.2014021608145109.jpg",
            "Comment": "Response to standard Charge Your Car RFID card",
            "IsEnabled": true,
            "IsVideo": false,
            "IsFeaturedItem": false,
            "IsExternalResource": false,
            "User": {
                "ID": 1032,
                "Username": "Matt Beard"
            },
            "DateCreated": "2014-02-16T08:15:00Z"
        },
        {
            "ID": 228,
            "ChargePointID": 19126,
            "ItemURL": "https://s3-ap-southeast-2.amazonaws.com/openchargemap/images/GB/OCM19126/OCM-19126.orig.2014021608134451.jpg",
            "ItemThumbnailURL": "https://s3-ap-southeast-2.amazonaws.com/openchargemap/images/GB/OCM19126/OCM-19126.thmb.2014021608134451.jpg",
            "Comment": "Location, and ICEing problems!",
            "IsEnabled": true,
            "IsVideo": false,
            "IsFeaturedItem": false,
            "IsExternalResource": false,
            "User": {
                "ID": 1032,
                "Username": "Matt Beard"
            },
            "DateCreated": "2014-02-16T08:14:00Z"
        }
    ],
    "IsRecentlyVerified": false,
    "ID": 19126,
    "UUID": "ED0F9AAC-5F43-4327-AB83-D4C5F66355B6",
    "DataProviderID": 1,
    "OperatorID": 3315,
    "UsageTypeID": 6,
    "UsageCost": "Free",
    "AddressInfo": {
        "ID": 19471,
        "Title": "Clepington Road Council Depot",
        "AddressLine1": "Clepington Road",
        "Town": "Dundee",
        "Postcode": "DD3 8PL",
        "CountryID": 1,
        "Latitude": 56.4788083,
        "Longitude": -2.98523399999999,
        "AccessComments": "Rapid charger accepts CPS cards. Type 2 posts facing out onto Clepington Road respond to CPS cards, but the units directly in front of the building are fenced off for council use only.",
        "DistanceUnit": 0
    },
    "Connections": [
        {
            "ID": 19387,
            "ConnectionTypeID": 25,
            "StatusTypeID": 50,
            "LevelID": 2,
            "Amps": 32,
            "Voltage": 230,
            "PowerKW": 7,
            "CurrentTypeID": 10,
            "Quantity": 8
        },
        {
            "ID": 34737,
            "ConnectionTypeID": 33,
            "StatusTypeID": 50,
            "LevelID": 3,
            "PowerKW": 50,
            "CurrentTypeID": 30,
            "Quantity": 1
        },
        {
            "ID": 34738,
            "ConnectionTypeID": 2,
            "StatusTypeID": 50,
            "LevelID": 3,
            "Voltage": 400,
            "PowerKW": 50,
            "CurrentTypeID": 30,
            "Quantity": 1
        },
        {
            "ID": 34739,
            "ConnectionTypeID": 25,
            "StatusTypeID": 50,
            "LevelID": 2,
            "Amps": 32,
            "Voltage": 400,
            "PowerKW": 22,
            "CurrentTypeID": 20,
            "Quantity": 1
        }
    ],
    "NumberOfPoints": 10,
    "GeneralComments": "2 bays at the rapid charger and 8 at the Type 2 chargers. Despite being part of the rapid unit, the AC side only charges at 22kW.",
    "StatusTypeID": 75,
    "DateLastStatusUpdate": "2021-07-17T12:27:00Z",
    "DataQualityLevel": 1,
    "DateCreated": "2013-09-11T15:06:00Z",
    "SubmissionStatusTypeID": 200
}