{
    "IsRecentlyVerified": false,
    "ID": 70310,
    "UUID": "5BC0023F-536D-46A6-AD5E-3D448D04E06C",
    "DataProviderID": 2,
    "DataProvidersReference": "76732",
    "OperatorID": 5,
    "UsageTypeID": 1,
    "AddressInfo": {
        "ID": 70656,
        "Title": "CITY OF GRETNA3",
        "AddressLine1": "204 N Mc Kenna Ave",
        "Town": "Gretna",
        "StateOrProvince": "NE",
        "Postcode": "68028",
        "CountryID": 2,
        "Latitude": 41.1404452,
        "Longitude": -96.248132,
        "ContactTelephone1": "888-758-4389",
        "AccessComments": "24 hours daily",
        "RelatedURL": "http://www.chargepoint.com/",
        "DistanceUnit": 0
    },
    "Connections": [
        {
            "ID": 100353,
            "ConnectionTypeID": 1,
            "LevelID": 2,
            "Amps": 16,
            "Voltage": 230,
            "PowerKW": 3.7,
            "CurrentTypeID": 10,
            "Quantity": 2
        }
    ],
    "DateLastStatusUpdate": "2020-06-26T03:04:00Z",
    "DataQualityLevel": 3,
    "DateCreated": "2016-07-14T00:53:00Z",
    "SubmissionStatusTypeID": 100
}