{
    "IsRecentlyVerified": false,
    "ID": 57169,
    "UUID": "3532E747-AE80-4830-A8E8-237A0425DDBF",
    "DataProviderID": 1,
    "OperatorID": 3265,
    "UsageTypeID": 4,
    "AddressInfo": {
        "ID": 57515,
        "Title": "Am Protzenweiher",
        "AddressLine1": "Am Protzenweiher 1",
        "AddressLine2": "Stadtamhof",
        "Town": "Regensburg",
        "StateOrProvince": "Regensburg",
        "Postcode": "93059",
        "CountryID": 87,
        "Latitude": 49.0260988,
        "Longitude": 12.0967497,
        "AccessComments": "Direkt gegenüber der historischen Schmalspur-Lok Walhalla Bockerl. 24/7 nutzbar. Ladekarte der REWAG oder Roamingpartnern PlugSurfing, Charge&Pay, ChargeNow etc. erforderlich.\r\n\r\n",
        "DistanceUnit": 0
    },
    "Connections": [
        {
            "ID": 72234,
            "ConnectionTypeID": 25,
            "StatusTypeID": 50,
            "LevelID": 2,
            "Amps": 32,
            "Voltage": 400,
            "PowerKW": 22,
            "CurrentTypeID": 20,
            "Quantity": 2
        },
        {
            "ID": 143584,
            "ConnectionTypeID": 25,
            "StatusTypeID": 50,
            "LevelID": 2,
            "Amps": 32,
            "Voltage": 400,
            "PowerKW": 22,
            "CurrentTypeID": 20,
            "Quantity": 2
        }
    ],
    "NumberOfPoints": 2,
    "GeneralComments": "Betreiber: Regensburger Energie- und Wasserversorgung",
    "StatusTypeID": 50,
    "DateLastStatusUpdate": "2018-04-05T22:59:00Z",
    "DataQualityLevel": 1,
    "DateCreated": "2015-11-27T11:29:00Z",
    "SubmissionStatusTypeID": 200
}