{
    "IsRecentlyVerified": false,
    "ID": 145075,
    "UUID": "ADF23887-3339-4452-BDFB-B5B9586A7CC1",
    "DataProviderID": 2,
    "DataProvidersReference": "131092",
    "OperatorID": 90,
    "UsageTypeID": 1,
    "AddressInfo": {
        "ID": 145427,
        "Title": "Municipalité de Notre-Dame-du-Mont-Carmel - Hôtel de Ville",
        "AddressLine1": "3880 Hôtel-de-Ville",
        "Town": "Notre-Dame-du-Mont-Carmel",
        "StateOrProvince": "QC",
        "Postcode": "G0X 3J0",
        "CountryID": 44,
        "Latitude": 46.472524,
        "Longitude": -72.676287,
        "ContactTelephone1": "877-505-2674",
        "AccessComments": "24 hours daily",
        "RelatedURL": "https://lecircuitelectrique.com/",
        "DistanceUnit": 0
    },
    "Connections": [
        {
            "ID": 201670,
            "ConnectionTypeID": 1,
            "LevelID": 2,
            "Amps": 16,
            "Voltage": 230,
            "PowerKW": 3.7,
            "CurrentTypeID": 10,
            "Quantity": 1
        }
    ],
    "StatusTypeID": 50,
    "DateLastStatusUpdate": "2020-06-26T03:10:00Z",
    "DataQualityLevel": 3,
    "DateCreated": "2019-12-24T09:24:00Z",
    "SubmissionStatusTypeID": 100
}