{
    "IsRecentlyVerified": false,
    "ID": 81983,
    "UUID": "CDE93374-8612-4D11-B95E-DC9E3AA3C103",
    "DataProviderID": 1,
    "OperatorID": 23,
    "OperatorsReference": "8280",
    "UsageTypeID": 6,
    "AddressInfo": {
        "ID": 82329,
        "Title": "Travaasa Austin Resort & Spa",
        "AddressLine1": "13500 Farm to Market RD 2769",
        "Town": "Austin",
        "StateOrProvince": "TX",
        "Postcode": "78726",
        "CountryID": 2,
        "Latitude": 30.44599,
        "Longitude": -97.868845,
        "ContactTelephone1": "(512) 258-7243",
        "DistanceUnit": 0
    },
    "Connections": [
        {
            "ID": 116743,
            "ConnectionTypeID": 30,
            "StatusTypeID": 50,
            "LevelID": 2,
            "PowerKW": 8,
            "CurrentTypeID": 10,
            "Quantity": 2
        }
    ],
    "NumberOfPoints": 2,
    "GeneralComments": "2 Tesla Connectors, up to 8kW.Available for patrons only. Please see front desk.",
    "StatusTypeID": 50,
    "DateLastStatusUpdate": "2017-06-09T13:00:00Z",
    "DataQualityLevel": 1,
    "DateCreated": "2017-02-03T13:54:00Z",
    "SubmissionStatusTypeID": 200
}