{
    "IsRecentlyVerified": false,
    "ID": 97801,
    "UUID": "EDE8F7B9-8E64-431E-9CB3-A44252109823",
    "DataProviderID": 1,
    "OperatorID": 23,
    "OperatorsReference": "38654",
    "UsageTypeID": 4,
    "AddressInfo": {
        "ID": 98147,
        "Title": "Parking François 1er Interparking",
        "AddressLine1": "24 Rue François 1er",
        "Town": "Paris",
        "Postcode": "75008",
        "CountryID": 80,
        "Latitude": 48.867431,
        "Longitude": 2.305575,
        "ContactTelephone1": "+33 9 70 14 01 11",
        "DistanceUnit": 0
    },
    "Connections": [
        {
            "ID": 138709,
            "ConnectionTypeID": 30,
            "StatusTypeID": 50,
            "LevelID": 2,
            "Amps": 32,
            "Voltage": 400,
            "PowerKW": 22,
            "CurrentTypeID": 20,
            "Quantity": 2
        }
    ],
    "NumberOfPoints": 2,
    "GeneralComments": "2 Tesla Connectors, up to 22kW.Available to the public. Self park.",
    "StatusTypeID": 50,
    "DateLastStatusUpdate": "2018-10-03T19:13:00Z",
    "DataQualityLevel": 1,
    "DateCreated": "2018-01-21T16:41:00Z",
    "SubmissionStatusTypeID": 200
}