{
    "IsRecentlyVerified": false,
    "ID": 141518,
    "UUID": "DDEAC225-D73D-4789-BF55-2F99D92C8E59",
    "DataProviderID": 2,
    "DataProvidersReference": "80285",
    "OperatorID": 5,
    "UsageTypeID": 1,
    "AddressInfo": {
        "ID": 141870,
        "Title": "EVERGY",
        "AddressLine1": "6314 Lamar Ave @ Waddell &amp; Reed Park",
        "Town": "Overland Park",
        "StateOrProvince": "KS",
        "Postcode": "66202",
        "CountryID": 2,
        "Latitude": 39.0127162,
        "Longitude": -94.6585936,
        "ContactTelephone1": "888-758-4389",
        "AccessComments": "24 hours daily",
        "RelatedURL": "http://www.chargepoint.com/",
        "DistanceUnit": 0
    },
    "Connections": [
        {
            "ID": 197461,
            "ConnectionTypeID": 1,
            "LevelID": 2,
            "Amps": 16,
            "Voltage": 230,
            "PowerKW": 3.7,
            "CurrentTypeID": 10,
            "Quantity": 6
        }
    ],
    "StatusTypeID": 50,
    "DateLastStatusUpdate": "2020-06-26T03:01:00Z",
    "DataQualityLevel": 3,
    "DateCreated": "2019-12-24T09:15:00Z",
    "SubmissionStatusTypeID": 100
}