{
    "IsRecentlyVerified": false,
    "ID": 183041,
    "UUID": "3A5A5351-5BFC-4C91-8DF4-3CE0D38E2496",
    "DataProviderID": 29,
    "DataProvidersReference": "10483",
    "OperatorID": 3403,
    "AddressInfo": {
        "ID": 183400,
        "Title": "Ewald-Dutschke-Straße 19",
        "AddressLine1": "Ewald-Dutschke-Straße 19",
        "Town": "Essen",
        "Postcode": "45357",
        "CountryID": 87,
        "Latitude": 51.490145,
        "Longitude": 6.941508,
        "DistanceUnit": 0
    },
    "Connections": [
        {
            "ID": 289534,
            "ConnectionTypeID": 25,
            "StatusTypeID": 50,
            "LevelID": 2,
            "PowerKW": 11,
            "CurrentTypeID": 20
        },
        {
            "ID": 289535,
            "ConnectionTypeID": 25,
            "StatusTypeID": 50,
            "LevelID": 2,
            "PowerKW": 11,
            "CurrentTypeID": 20
        }
    ],
    "StatusTypeID": 50,
    "DateLastStatusUpdate": "2021-07-09T03:24:00Z",
    "MetadataValues": [
        {
            "ID": 15334,
            "MetadataFieldID": 4,
            "ItemValue": "Data from the German chargepoint registry provided by Bundesnetzagentur.de under the CC-BY 4.0 license"
        }
    ],
    "DataQualityLevel": 3,
    "DateCreated": "2021-07-08T10:03:00Z",
    "SubmissionStatusTypeID": 100
}