{
    "IsRecentlyVerified": false,
    "ID": 32151,
    "UUID": "230ECBA5-559E-48D0-9FA1-3DCE13B2A3CC",
    "DataProviderID": 1,
    "OperatorID": 156,
    "OperatorsReference": "NewMotion 02010093",
    "UsageTypeID": 4,
    "UsageCost": "",
    "AddressInfo": {
        "ID": 32497,
        "Title": "Kirschgarten 1",
        "AddressLine1": "Kirschgarten 1",
        "AddressLine2": "",
        "Town": "Bastheim",
        "StateOrProvince": "",
        "Postcode": "97654",
        "CountryID": 87,
        "Latitude": 50.4016723632812,
        "Longitude": 10.2054138183594,
        "ContactTelephone1": "",
        "ContactTelephone2": "",
        "ContactEmail": "",
        "AccessComments": "",
        "RelatedURL": "",
        "DistanceUnit": 0
    },
    "Connections": [
        {
            "ID": 35662,
            "ConnectionTypeID": 25,
            "StatusTypeID": 0,
            "LevelID": 2,
            "PowerKW": 37,
            "CurrentTypeID": 10
        }
    ],
    "NumberOfPoints": 1,
    "GeneralComments": "",
    "StatusTypeID": 50,
    "DateLastStatusUpdate": "2015-06-12T21:56:00Z",
    "DataQualityLevel": 3,
    "DateCreated": "2015-01-09T06:03:00Z",
    "SubmissionStatusTypeID": 200
}