{
    "IsRecentlyVerified": false,
    "ID": 87617,
    "UUID": "422DA543-7D06-4588-950B-D90443B3787E",
    "DataProviderID": 1,
    "OperatorID": 23,
    "OperatorsReference": "29540",
    "UsageTypeID": 4,
    "AddressInfo": {
        "ID": 87963,
        "Title": "Torre Optima Ii",
        "AddressLine1": "Avenida de Las Palmas 275 Lomas de Chapultepec V Secc",
        "Town": "Miguel Hidalgo",
        "StateOrProvince": "Ciudad de Mexico",
        "Postcode": "11000",
        "CountryID": 146,
        "Latitude": 19.430276,
        "Longitude": -99.210911,
        "ContactTelephone1": "+52 55 5520 1771",
        "DistanceUnit": 0
    },
    "Connections": [
        {
            "ID": 124210,
            "ConnectionTypeID": 30,
            "StatusTypeID": 50,
            "LevelID": 2,
            "PowerKW": 18,
            "CurrentTypeID": 20,
            "Quantity": 2
        }
    ],
    "NumberOfPoints": 2,
    "GeneralComments": "2 Tesla Connectors, up to 18kW.Available for customers. Please see front desk.",
    "StatusTypeID": 50,
    "DateLastStatusUpdate": "2017-05-15T05:31:00Z",
    "DataQualityLevel": 1,
    "DateCreated": "2017-05-15T05:31:00Z",
    "SubmissionStatusTypeID": 200
}