{
    "IsRecentlyVerified": false,
    "ID": 64206,
    "UUID": "6D327789-B258-431E-86E7-8C7A9CC44243",
    "DataProviderID": 26,
    "DataProvidersReference": "73202",
    "OperatorID": 103,
    "OperatorsReference": "Allego NLALLEGO0000491",
    "UsageCost": "0.00 jaarabonnement",
    "AddressInfo": {
        "ID": 64552,
        "Title": "Kastanjelaan",
        "AddressLine1": "Kastanjelaan",
        "Town": "Groningen",
        "Postcode": "9741 CC",
        "CountryID": 159,
        "Latitude": 53.2310082,
        "Longitude": 6.5543909,
        "ContactTelephone1": "0800-3745337",
        "RelatedURL": "http://www.allego.eu/",
        "DistanceUnit": 0
    },
    "Connections": [
        {
            "ID": 82137,
            "ConnectionTypeID": 25,
            "LevelID": 2,
            "PowerKW": 11,
            "CurrentTypeID": 10
        },
        {
            "ID": 82138,
            "ConnectionTypeID": 25,
            "LevelID": 2,
            "PowerKW": 11,
            "CurrentTypeID": 10
        },
        {
            "ID": 95565,
            "ConnectionTypeID": 25,
            "LevelID": 2,
            "PowerKW": 11,
            "CurrentTypeID": 10
        },
        {
            "ID": 95566,
            "ConnectionTypeID": 25,
            "LevelID": 2,
            "PowerKW": 11,
            "CurrentTypeID": 10
        }
    ],
    "NumberOfPoints": 1,
    "StatusTypeID": 50,
    "DateLastStatusUpdate": "2016-06-04T02:56:00Z",
    "DataQualityLevel": 3,
    "DateCreated": "2016-03-03T12:33:00Z",
    "SubmissionStatusTypeID": 100
}