{
    "IsRecentlyVerified": false,
    "ID": 70160,
    "UUID": "FF7A018C-7C95-427A-A21B-9555629DFEB7",
    "DataProviderID": 1,
    "OperatorID": 103,
    "UsageTypeID": 4,
    "AddressInfo": {
        "ID": 70506,
        "Title": "Supermarkt Rewe",
        "AddressLine1": "Mahlower Straße 142",
        "Town": "Teltow",
        "StateOrProvince": "Landkreis Potsdam-Mittelmark",
        "Postcode": "14513",
        "CountryID": 87,
        "Latitude": 52.395872237180356,
        "Longitude": 13.280142215938575,
        "AccessComments": "Rote Ladesäule an der Einfahrt zum Parkplatz links. 24/7 nutzbar mit The New Motion Ladekarte, PlugSurfing u.a. Karten im Allego Verbund.",
        "DistanceUnit": 0
    },
    "Connections": [
        {
            "ID": 100100,
            "ConnectionTypeID": 25,
            "StatusTypeID": 50,
            "LevelID": 2,
            "Amps": 16,
            "Voltage": 400,
            "PowerKW": 11,
            "CurrentTypeID": 20,
            "Quantity": 2
        }
    ],
    "NumberOfPoints": 2,
    "StatusTypeID": 50,
    "DateLastStatusUpdate": "2016-07-12T06:17:00Z",
    "DataQualityLevel": 1,
    "DateCreated": "2016-07-12T06:17:00Z",
    "SubmissionStatusTypeID": 200
}