{
    "MediaItems": [
        {
            "ID": 19625,
            "ChargePointID": 106830,
            "ItemURL": "https://s3-ap-southeast-2.amazonaws.com/openchargemap/images/DE/OCM106830/OCM-106830.orig.2019092000565580.jpeg",
            "ItemThumbnailURL": "https://s3-ap-southeast-2.amazonaws.com/openchargemap/images/DE/OCM106830/OCM-106830.thmb.2019092000565580.jpeg",
            "Comment": "",
            "IsEnabled": true,
            "IsVideo": false,
            "IsFeaturedItem": false,
            "IsExternalResource": false,
            "User": {
                "ID": 22414,
                "Username": "k_b"
            },
            "DateCreated": "2019-09-20T00:57:00Z"
        },
        {
            "ID": 19624,
            "ChargePointID": 106830,
            "ItemURL": "https://s3-ap-southeast-2.amazonaws.com/openchargemap/images/DE/OCM106830/OCM-106830.orig.2019092000560020.jpeg",
            "ItemThumbnailURL": "https://s3-ap-southeast-2.amazonaws.com/openchargemap/images/DE/OCM106830/OCM-106830.thmb.2019092000560020.jpeg",
            "Comment": "",
            "IsEnabled": true,
            "IsVideo": false,
            "IsFeaturedItem": false,
            "IsExternalResource": false,
            "User": {
                "ID": 22414,
                "Username": "k_b"
            },
            "DateCreated": "2019-09-20T00:56:00Z"
        },
        {
            "ID": 19623,
            "ChargePointID": 106830,
            "ItemURL": "https://s3-ap-southeast-2.amazonaws.com/openchargemap/images/DE/OCM106830/OCM-106830.orig.2019092000545651.jpeg",
            "ItemThumbnailURL": "https://s3-ap-southeast-2.amazonaws.com/openchargemap/images/DE/OCM106830/OCM-106830.thmb.2019092000545651.jpeg",
            "Comment": "",
            "IsEnabled": true,
            "IsVideo": false,
            "IsFeaturedItem": false,
            "IsExternalResource": false,
            "User": {
                "ID": 22414,
                "Username": "k_b"
            },
            "DateCreated": "2019-09-20T00:55:00Z"
        },
        {
            "ID": 19622,
            "ChargePointID": 106830,
            "ItemURL": "https://s3-ap-southeast-2.amazonaws.com/openchargemap/images/DE/OCM106830/OCM-106830.orig.2019092000540691.jpeg",
            "ItemThumbnailURL": "https://s3-ap-southeast-2.amazonaws.com/openchargemap/images/DE/OCM106830/OCM-106830.thmb.2019092000540691.jpeg",
            "Comment": "",
            "IsEnabled": true,
            "IsVideo": false,
            "IsFeaturedItem": false,
            "IsExternalResource": false,
            "User": {
                "ID": 22414,
                "Username": "k_b"
            },
            "DateCreated": "2019-09-20T00:54:00Z"
        }
    ],
    "IsRecentlyVerified": false,
    "ID": 106830,
    "UUID": "FBCD7058-5B05-48E4-A41A-86BC6F8738CF",
    "DataProviderID": 1,
    "OperatorID": 72,
    "UsageTypeID": 4,
    "UsageCost": "Frei",
    "AddressInfo": {
        "ID": 107176,
        "Title": "Stromtankstelle evd",
        "AddressLine1": "Castellstraße 11",
        "Town": "Dormagen",
        "StateOrProvince": "Rhein-Kreis Neuss",
        "Postcode": "41539",
        "CountryID": 87,
        "Latitude": 51.09292168102601,
        "Longitude": 6.840713573016387,
        "AccessComments": "24/7 nutzbar, Aktivierung mit e-regio oder TankE App. Der Ladevorgang ist kostenlos.",
        "DistanceUnit": 0
    },
    "Connections": [
        {
            "ID": 150589,
            "ConnectionTypeID": 25,
            "StatusTypeID": 50,
            "LevelID": 2,
            "Amps": 16,
            "Voltage": 400,
            "PowerKW": 11,
            "CurrentTypeID": 20,
            "Quantity": 2
        }
    ],
    "NumberOfPoints": 2,
    "StatusTypeID": 50,
    "DateLastStatusUpdate": "2019-09-20T00:57:00Z",
    "DataQualityLevel": 1,
    "DateCreated": "2018-07-04T06:35:00Z",
    "SubmissionStatusTypeID": 200
}