{
    "IsRecentlyVerified": false,
    "ID": 54740,
    "UUID": "C3EBE434-A369-46AA-B228-D9F83CA70D11",
    "DataProviderID": 1,
    "OperatorID": 214,
    "OperatorsReference": "Allego DEALLEGO0000421",
    "UsageTypeID": 4,
    "AddressInfo": {
        "ID": 55086,
        "Title": "Friedrichsberger Str. 24",
        "AddressLine1": "Friedrichsberger Str. 24",
        "Town": "Berlin",
        "Postcode": "10243",
        "CountryID": 87,
        "Latitude": 52.521066,
        "Longitude": 13.434841,
        "AccessComments": "Rund um die Uhr (24/7) nutzbar\r\n",
        "DistanceUnit": 0
    },
    "Connections": [
        {
            "ID": 69153,
            "ConnectionTypeID": 25,
            "StatusTypeID": 50,
            "LevelID": 2,
            "Amps": 16,
            "Voltage": 400,
            "PowerKW": 11,
            "CurrentTypeID": 20,
            "Quantity": 2
        }
    ],
    "NumberOfPoints": 1,
    "StatusTypeID": 50,
    "DateLastStatusUpdate": "2015-10-09T07:01:00Z",
    "DataQualityLevel": 3,
    "DateCreated": "2015-10-09T06:18:00Z",
    "SubmissionStatusTypeID": 200
}