{
    "UserComments": [
        {
            "ID": 23780,
            "ChargePointID": 172022,
            "CommentTypeID": 10,
            "UserName": "ForumElettrico.it",
            "Comment": "Nuova installazione in attesa di attivazione presso il Centro Commerciale I Malatesta. Leggi la recensione completa qui > https://www.forumelettrico.it/forum/colonnine-be-charge-fast-i-malatesta-rimini-rn-via-emilia-150-t15009.html",
            "RelatedURL": "https://www.forumelettrico.it/forum/colonnine-be-charge-fast-i-malatesta-rimini-rn-via-emilia-150-t15009.html",
            "DateCreated": "2021-01-12T13:55:24.453Z",
            "User": {
                "ID": 11749,
                "Username": "ForumElettrico.it"
            },
            "CheckinStatusTypeID": 140,
            "IsActionedByEditor": false
        }
    ],
    "MediaItems": [
        {
            "ID": 26180,
            "ChargePointID": 172022,
            "ItemURL": "https://s3-ap-southeast-2.amazonaws.com/openchargemap/images/IT/OCM172022/OCM-172022.orig.2021011213553445.jpg",
            "ItemThumbnailURL": "https://s3-ap-southeast-2.amazonaws.com/openchargemap/images/IT/OCM172022/OCM-172022.thmb.2021011213553445.jpg",
            "Comment": "",
            "IsEnabled": true,
            "IsVideo": false,
            "IsFeaturedItem": false,
            "IsExternalResource": false,
            "User": {
                "ID": 11749,
                "Username": "ForumElettrico.it"
            },
            "DateCreated": "2021-01-12T13:56:00Z"
        }
    ],
    "IsRecentlyVerified": false,
    "ID": 172022,
    "UUID": "E7DE6A4F-127F-438A-A712-DAECF580BD56",
    "DataProviderID": 1,
    "OperatorID": 3327,
    "UsageTypeID": 4,
    "AddressInfo": {
        "ID": 172381,
        "Title": "BeCharge Rimini Malatesta",
        "AddressLine1": "Via Emilia 150",
        "Town": "Rimini",
        "StateOrProvince": "RN",
        "Postcode": "47921",
        "CountryID": 112,
        "Latitude": 44.068564,
        "Longitude": 12.527613,
        "RelatedURL": "https://www.forumelettrico.it/forum/colonnine-be-charge-fast-i-malatesta-rimini-rn-via-emilia-150-t15009.html",
        "DistanceUnit": 0
    },
    "Connections": [
        {
            "ID": 262922,
            "ConnectionTypeID": 33,
            "StatusTypeID": 150,
            "LevelID": 3,
            "PowerKW": 75,
            "CurrentTypeID": 30,
            "Quantity": 1
        },
        {
            "ID": 262923,
            "ConnectionTypeID": 2,
            "StatusTypeID": 150,
            "LevelID": 3,
            "PowerKW": 51,
            "CurrentTypeID": 30,
            "Quantity": 1
        },
        {
            "ID": 262924,
            "ConnectionTypeID": 25,
            "StatusTypeID": 150,
            "LevelID": 2,
            "Amps": 32,
            "Voltage": 400,
            "PowerKW": 22,
            "CurrentTypeID": 20,
            "Quantity": 3
        }
    ],
    "NumberOfPoints": 2,
    "StatusTypeID": 150,
    "DateLastStatusUpdate": "2021-01-15T11:18:00Z",
    "DataQualityLevel": 1,
    "DateCreated": "2021-01-12T13:55:00Z",
    "SubmissionStatusTypeID": 200
}