{
    "IsRecentlyVerified": false,
    "ID": 60736,
    "UUID": "139F823B-21DE-414C-A0CB-83C9CABFA45C",
    "DataProviderID": 1,
    "OperatorID": 45,
    "UsageTypeID": 6,
    "UsageCost": "Free",
    "AddressInfo": {
        "ID": 61082,
        "Title": "Cambridge Regional College",
        "AddressLine1": " Science Park Campus",
        "AddressLine2": "Kings Hedges Road",
        "Town": "Cambridge",
        "Postcode": "CB4 2QT",
        "CountryID": 1,
        "Latitude": 52.23472,
        "Longitude": 0.13375,
        "AccessComments": "Car Park 2 I Block. APT Charge point.",
        "DistanceUnit": 0
    },
    "Connections": [
        {
            "ID": 77005,
            "ConnectionTypeID": 25,
            "Reference": "1",
            "StatusTypeID": 50,
            "LevelID": 2,
            "Amps": 32,
            "Voltage": 230,
            "PowerKW": 7,
            "CurrentTypeID": 10,
            "Quantity": 2
        }
    ],
    "NumberOfPoints": 2,
    "GeneralComments": "Workplace charging.\r\nAPT charge point. Formerly on Source East. Should now be configured to accept any RFID.\r\nDevice owner: Cambridgeshire County Council",
    "StatusTypeID": 50,
    "DateLastStatusUpdate": "2017-03-31T08:08:00Z",
    "MetadataValues": [
        {
            "ID": 2982,
            "MetadataFieldID": 4,
            "ItemValue": "Contains public sector information licensed under the Open Government Licence v2.0. http://www.nationalarchives.gov.uk/doc/open-government-licence/version/2/"
        }
    ],
    "DataQualityLevel": 3,
    "DateCreated": "2016-02-07T06:21:00Z",
    "SubmissionStatusTypeID": 100
}