{
    "IsRecentlyVerified": false,
    "ID": 62994,
    "UUID": "56B99494-0513-4B9C-AFFF-000E7B96C3B5",
    "DataProviderID": 26,
    "DataProvidersReference": "77527",
    "OperatorID": 73,
    "OperatorsReference": "EV-Box EVB-P1427113",
    "UsageCost": "0.00 jaarabonnement",
    "AddressInfo": {
        "ID": 63340,
        "Title": "Hertoglaan 42",
        "AddressLine1": "Hertoglaan 42",
        "Town": "Vught",
        "Postcode": "5262 JP",
        "CountryID": 159,
        "Latitude": 51.63836,
        "Longitude": 5.28282,
        "RelatedURL": "http://www.ev-box.nl",
        "DistanceUnit": 0
    },
    "Connections": [
        {
            "ID": 80092,
            "ConnectionTypeID": 25,
            "LevelID": 2,
            "PowerKW": 5,
            "CurrentTypeID": 10
        }
    ],
    "NumberOfPoints": 1,
    "StatusTypeID": 50,
    "DateLastStatusUpdate": "2016-06-04T02:39:00Z",
    "DataQualityLevel": 3,
    "DateCreated": "2016-03-03T12:29:00Z",
    "SubmissionStatusTypeID": 100
}