{
    "IsRecentlyVerified": false,
    "ID": 79265,
    "UUID": "EED74E00-89B1-462E-995C-A6ED993C6336",
    "DataProviderID": 1,
    "OperatorID": 45,
    "UsageTypeID": 6,
    "AddressInfo": {
        "ID": 79611,
        "Title": "E-Bike Station Weidenhof",
        "AddressLine1": "Weidenstraße",
        "Town": "Wächtersbach",
        "StateOrProvince": "Main-Kinzig-Kreis",
        "Postcode": "63607",
        "CountryID": 87,
        "Latitude": 50.2658954748896,
        "Longitude": 9.31596576560672,
        "DistanceUnit": 0
    },
    "Connections": [
        {
            "ID": 113888,
            "ConnectionTypeID": 28,
            "StatusTypeID": 50,
            "LevelID": 1,
            "Amps": 10,
            "Voltage": 230,
            "PowerKW": 2.3,
            "CurrentTypeID": 10,
            "Quantity": 4
        }
    ],
    "NumberOfPoints": 4,
    "StatusTypeID": 50,
    "DateLastStatusUpdate": "2017-01-27T07:27:00Z",
    "DataQualityLevel": 1,
    "DateCreated": "2017-01-27T07:26:00Z",
    "SubmissionStatusTypeID": 200
}