{
    "IsRecentlyVerified": false,
    "ID": 32896,
    "UUID": "0213DECF-EBC8-49E7-9E76-D3A07DFF99BC",
    "DataProviderID": 1,
    "OperatorID": 105,
    "OperatorsReference": "Essent EM-DE-05113000-01-00016",
    "UsageTypeID": 4,
    "AddressInfo": {
        "ID": 33242,
        "Title": "Ostfeldstraße 1",
        "AddressLine1": "Ostfeldstraße 1",
        "Town": "Essen",
        "Postcode": "45127",
        "CountryID": 87,
        "Latitude": 51.457333,
        "Longitude": 7.004782,
        "DistanceUnit": 0
    },
    "Connections": [
        {
            "ID": 36407,
            "ConnectionTypeID": 25,
            "LevelID": 2,
            "PowerKW": 11
        },
        {
            "ID": 46590,
            "ConnectionTypeID": 25,
            "LevelID": 2,
            "PowerKW": 11
        }
    ],
    "NumberOfPoints": 1,
    "StatusTypeID": 50,
    "DateLastStatusUpdate": "2015-04-13T18:39:00Z",
    "DataQualityLevel": 3,
    "DateCreated": "2015-01-09T06:03:00Z",
    "SubmissionStatusTypeID": 200
}