{
    "IsRecentlyVerified": false,
    "ID": 144888,
    "UUID": "C90E1F34-5C8B-4BE6-AB24-5F1356897353",
    "DataProviderID": 2,
    "DataProvidersReference": "130955",
    "OperatorID": 90,
    "UsageTypeID": 1,
    "AddressInfo": {
        "ID": 145240,
        "Title": "Parc régional du Mont-Ham",
        "AddressLine1": "103 Route 257 Ouest",
        "Town": "Ham-Sud",
        "StateOrProvince": "QC",
        "Postcode": "J0B 3J0",
        "CountryID": 44,
        "Latitude": 45.775279,
        "Longitude": -71.63705,
        "ContactTelephone1": "877-505-2674",
        "AccessComments": "24 hours daily",
        "RelatedURL": "https://lecircuitelectrique.com/",
        "DistanceUnit": 0
    },
    "Connections": [
        {
            "ID": 201438,
            "ConnectionTypeID": 1,
            "LevelID": 2,
            "Amps": 16,
            "Voltage": 230,
            "PowerKW": 3.7,
            "CurrentTypeID": 10,
            "Quantity": 2
        }
    ],
    "StatusTypeID": 50,
    "DateLastStatusUpdate": "2020-06-26T03:09:00Z",
    "DataQualityLevel": 3,
    "DateCreated": "2019-12-24T09:23:00Z",
    "SubmissionStatusTypeID": 100
}