{
    "IsRecentlyVerified": false,
    "ID": 93545,
    "UUID": "F6F88509-07FD-430D-9B65-E44007D68CB8",
    "DataProviderID": 1,
    "OperatorID": 23,
    "OperatorsReference": "35963",
    "UsageTypeID": 6,
    "AddressInfo": {
        "ID": 93891,
        "Title": "Schloss Trebsen",
        "AddressLine1": "Zum Schloss 1",
        "Town": "Trebsen",
        "StateOrProvince": "Sachsen",
        "Postcode": "4687",
        "CountryID": 87,
        "Latitude": 51.290962,
        "Longitude": 12.757031,
        "ContactTelephone1": "+49 34383 631578",
        "DistanceUnit": 0
    },
    "Connections": [
        {
            "ID": 132482,
            "ConnectionTypeID": 30,
            "StatusTypeID": 50,
            "LevelID": 2,
            "Amps": 32,
            "Voltage": 400,
            "PowerKW": 22,
            "CurrentTypeID": 20,
            "Quantity": 2
        }
    ],
    "NumberOfPoints": 2,
    "GeneralComments": "2 Tesla Connectors, up to 22kW.Available for patrons only. Please see front desk.",
    "StatusTypeID": 50,
    "DateLastStatusUpdate": "2018-10-03T14:57:00Z",
    "DataQualityLevel": 1,
    "DateCreated": "2017-10-02T05:28:00Z",
    "SubmissionStatusTypeID": 200
}