{
    "IsRecentlyVerified": false,
    "ID": 93437,
    "UUID": "7303A111-05C9-44E2-9503-FF6009A140B8",
    "DataProviderID": 1,
    "OperatorID": 23,
    "OperatorsReference": "35799",
    "UsageTypeID": 6,
    "AddressInfo": {
        "ID": 93783,
        "Title": "Injoy Sports- and Wellness Club Buedingen",
        "AddressLine1": "Reichardsweide 2",
        "Town": "Buedingen",
        "Postcode": "63654",
        "CountryID": 87,
        "Latitude": 50.274661,
        "Longitude": 9.108035,
        "ContactTelephone1": "+49 6042 7400",
        "DistanceUnit": 0
    },
    "Connections": [
        {
            "ID": 132314,
            "ConnectionTypeID": 1036,
            "StatusTypeID": 50,
            "LevelID": 2,
            "Amps": 32,
            "Voltage": 400,
            "PowerKW": 22,
            "CurrentTypeID": 20,
            "Quantity": 1
        },
        {
            "ID": 143799,
            "ConnectionTypeID": 28,
            "StatusTypeID": 50,
            "LevelID": 2,
            "Amps": 16,
            "Voltage": 230,
            "PowerKW": 3.7,
            "CurrentTypeID": 10,
            "Quantity": 1
        },
        {
            "ID": 153506,
            "ConnectionTypeID": 30,
            "StatusTypeID": 50,
            "LevelID": 2,
            "Amps": 32,
            "Voltage": 400,
            "PowerKW": 22,
            "CurrentTypeID": 20,
            "Quantity": 1
        }
    ],
    "NumberOfPoints": 1,
    "GeneralComments": "1 Tesla Connector, up to 22kW.Available for patrons only. Please see front desk. At the parking ground there is also a Schuko in a metal box ! Coin needed for activation - see Injoy's front desk.",
    "StatusTypeID": 50,
    "DateLastStatusUpdate": "2018-10-04T06:29:00Z",
    "DataQualityLevel": 1,
    "DateCreated": "2017-09-27T19:33:00Z",
    "SubmissionStatusTypeID": 200
}