{
    "IsRecentlyVerified": false,
    "ID": 156243,
    "UUID": "A5DDD845-A672-4F7F-9CFD-B9313E5A25DE",
    "DataProviderID": 1,
    "OperatorID": 45,
    "UsageTypeID": 6,
    "AddressInfo": {
        "ID": 156597,
        "Title": "Supermercato Zizzone - Dorgali",
        "AddressLine1": "Via Baulu Virde, 1",
        "Town": "Dorgali",
        "StateOrProvince": "NU",
        "Postcode": "08022",
        "CountryID": 112,
        "Latitude": 40.2974823941899,
        "Longitude": 9.588765155544479,
        "RelatedURL": "https://www.zizzone.com/",
        "DistanceUnit": 0
    },
    "Connections": [
        {
            "ID": 219877,
            "ConnectionTypeID": 25,
            "StatusTypeID": 50,
            "LevelID": 2,
            "Amps": 16,
            "Voltage": 400,
            "PowerKW": 11,
            "CurrentTypeID": 20,
            "Quantity": 1
        }
    ],
    "NumberOfPoints": 1,
    "StatusTypeID": 50,
    "DateLastStatusUpdate": "2020-05-12T10:22:00Z",
    "DataQualityLevel": 1,
    "DateCreated": "2020-05-12T10:18:00Z",
    "SubmissionStatusTypeID": 200
}