{
    "IsRecentlyVerified": false,
    "ID": 93705,
    "UUID": "0ED800F5-057F-492B-8C95-4F7DDF52F072",
    "DataProviderID": 1,
    "OperatorID": 3248,
    "UsageTypeID": 1,
    "AddressInfo": {
        "ID": 94051,
        "Title": "Rasthof Dammer Berge Ost",
        "AddressLine1": "A1",
        "Town": "Holdorf",
        "StateOrProvince": "Landkreis Vechta",
        "Postcode": "49451",
        "CountryID": 87,
        "Latitude": 52.539228804895096,
        "Longitude": 8.115505867651333,
        "DistanceUnit": 0
    },
    "Connections": [
        {
            "ID": 132667,
            "ConnectionTypeID": 1036,
            "StatusTypeID": 50,
            "LevelID": 3,
            "Amps": 63,
            "Voltage": 400,
            "PowerKW": 43,
            "CurrentTypeID": 20,
            "Quantity": 1
        },
        {
            "ID": 132668,
            "ConnectionTypeID": 2,
            "StatusTypeID": 50,
            "LevelID": 3,
            "PowerKW": 50,
            "CurrentTypeID": 30,
            "Quantity": 1
        },
        {
            "ID": 132669,
            "ConnectionTypeID": 33,
            "StatusTypeID": 50,
            "LevelID": 3,
            "PowerKW": 50,
            "CurrentTypeID": 30,
            "Quantity": 1
        }
    ],
    "NumberOfPoints": 2,
    "GeneralComments": "24/7 geöffnet, nach der Einfahrt rechts halten zum PKW Parkplatz. Im Kreisel dritte Ausfahrt, direkt am Eingang zur Raststätte.",
    "StatusTypeID": 50,
    "DateLastStatusUpdate": "2017-10-05T10:28:00Z",
    "DataQualityLevel": 1,
    "DateCreated": "2017-10-05T10:28:00Z",
    "SubmissionStatusTypeID": 100
}