{
    "IsRecentlyVerified": false,
    "ID": 163403,
    "UUID": "053E0C45-18E3-4A5F-A09F-2D3D3DF9F617",
    "DataProviderID": 1,
    "OperatorID": 21,
    "UsageTypeID": 4,
    "UsageCost": "Mobi.E compatible card",
    "AddressInfo": {
        "ID": 163760,
        "Title": "CLB-00008",
        "AddressLine1": "Intermarché",
        "Town": "Celorico",
        "StateOrProvince": "Centro",
        "Postcode": "",
        "CountryID": 180,
        "Latitude": 40.644139515172014,
        "Longitude": -7.386916638622097,
        "AccessComments": "Intermarché",
        "DistanceUnit": 0
    },
    "Connections": [
        {
            "ID": 234981,
            "ConnectionTypeID": 25,
            "StatusTypeID": 50,
            "LevelID": 2,
            "Amps": 32,
            "Voltage": 400,
            "PowerKW": 22,
            "CurrentTypeID": 20,
            "Quantity": 2
        }
    ],
    "NumberOfPoints": 2,
    "StatusTypeID": 150,
    "DateLastStatusUpdate": "2020-08-23T16:39:00Z",
    "DataQualityLevel": 1,
    "DateCreated": "2020-08-23T16:39:00Z",
    "SubmissionStatusTypeID": 200
}