{
    "IsRecentlyVerified": false,
    "ID": 179249,
    "UUID": "4C655CED-DF44-46CA-9960-C2D8D0372E44",
    "DataProviderID": 29,
    "DataProvidersReference": "1921",
    "AddressInfo": {
        "ID": 179608,
        "Title": "Kleiner Platz 1",
        "AddressLine1": "Kleiner Platz 1",
        "Town": "Landau",
        "Postcode": "76829",
        "CountryID": 87,
        "Latitude": 49.199627,
        "Longitude": 8.113356,
        "DistanceUnit": 0
    },
    "Connections": [
        {
            "ID": 280798,
            "ConnectionTypeID": 25,
            "StatusTypeID": 50,
            "LevelID": 2,
            "PowerKW": 22,
            "CurrentTypeID": 20
        },
        {
            "ID": 280799,
            "ConnectionTypeID": 25,
            "StatusTypeID": 50,
            "LevelID": 2,
            "PowerKW": 22,
            "CurrentTypeID": 20
        }
    ],
    "StatusTypeID": 50,
    "DateLastStatusUpdate": "2021-07-09T03:15:00Z",
    "MetadataValues": [
        {
            "ID": 11543,
            "MetadataFieldID": 4,
            "ItemValue": "Data from the German chargepoint registry provided by Bundesnetzagentur.de under the CC-BY 4.0 license"
        }
    ],
    "DataQualityLevel": 3,
    "DateCreated": "2021-07-08T09:59:00Z",
    "SubmissionStatusTypeID": 100
}