{
    "IsRecentlyVerified": false,
    "ID": 41730,
    "UUID": "5CEDB78F-F4EB-4C5B-B3C2-EAD543B7EEC4",
    "DataProviderID": 26,
    "DataProvidersReference": "58947",
    "OperatorID": 157,
    "OperatorsReference": "NewMotion 02011101",
    "UsageCost": "0.00 jaarabonnement",
    "AddressInfo": {
        "ID": 42076,
        "Title": "De Blieke 42",
        "AddressLine1": "De Blieke 42",
        "Town": "Ameland",
        "Postcode": "9161 CW",
        "CountryID": 159,
        "Latitude": 53.4477596,
        "Longitude": 5.6351052,
        "ContactTelephone1": "088 0109500",
        "RelatedURL": "http://thenewmotion.nl/",
        "DistanceUnit": 0
    },
    "Connections": [
        {
            "ID": 45791,
            "ConnectionTypeID": 25,
            "LevelID": 2,
            "PowerKW": 3.7,
            "CurrentTypeID": 10
        }
    ],
    "NumberOfPoints": 1,
    "StatusTypeID": 50,
    "DateLastStatusUpdate": "2016-06-04T02:56:00Z",
    "DataQualityLevel": 3,
    "DateCreated": "2015-02-09T03:25:00Z",
    "SubmissionStatusTypeID": 100
}