{
    "IsRecentlyVerified": false,
    "ID": 39439,
    "UUID": "14915869-F403-4214-80EE-0D53AB713F6C",
    "DataProviderID": 2,
    "DataProvidersReference": "64818",
    "OperatorID": 5,
    "UsageTypeID": 1,
    "AddressInfo": {
        "ID": 39785,
        "Title": "CPEX",
        "AddressLine1": "1600 Pacific Hwy",
        "Town": "San Diego",
        "StateOrProvince": "CA",
        "Postcode": "92101",
        "CountryID": 2,
        "Latitude": 32.721998,
        "Longitude": -117.172051,
        "ContactTelephone1": "888-758-4389",
        "AccessComments": "24 hours daily",
        "RelatedURL": "http://www.chargepoint.com/",
        "DistanceUnit": 0
    },
    "Connections": [
        {
            "ID": 42956,
            "ConnectionTypeID": 1,
            "LevelID": 2,
            "Amps": 16,
            "Voltage": 230,
            "PowerKW": 3,
            "CurrentTypeID": 10,
            "Quantity": 5
        },
        {
            "ID": 42957,
            "ConnectionTypeID": 32,
            "LevelID": 2,
            "Amps": 100,
            "Voltage": 400,
            "PowerKW": 40,
            "CurrentTypeID": 10,
            "Quantity": 1
        }
    ],
    "DateLastStatusUpdate": "2019-12-24T09:09:00Z",
    "DataQualityLevel": 3,
    "DateCreated": "2015-01-10T01:00:00Z",
    "SubmissionStatusTypeID": 100
}