{
    "UserComments": [
        {
            "ID": 22463,
            "ChargePointID": 155569,
            "CommentTypeID": 10,
            "UserName": "ForumElettrico.it",
            "Comment": "Parcheggio dedicato e gratuite per i clienti. Leggi la recensione completa qui > https://www.forumelettrico.it/forum/due-stazioni-di-ricarica-charge-carrental-22-kw-miramare-the-palace-sanremo-t7189.html\r\n",
            "RelatedURL": "https://www.forumelettrico.it/forum/due-stazioni-di-ricarica-charge-carrental-22-kw-miramare-the-palace-sanremo-t7189.html",
            "DateCreated": "2020-04-19T09:56:27.183Z",
            "User": {
                "ID": 11749,
                "Username": "ForumElettrico.it"
            },
            "CheckinStatusTypeID": 140,
            "IsActionedByEditor": false
        }
    ],
    "MediaItems": [
        {
            "ID": 22015,
            "ChargePointID": 155569,
            "ItemURL": "https://s3-ap-southeast-2.amazonaws.com/openchargemap/images/IT/OCM155569/OCM-155569.orig.2020041909563848.jpg",
            "ItemThumbnailURL": "https://s3-ap-southeast-2.amazonaws.com/openchargemap/images/IT/OCM155569/OCM-155569.thmb.2020041909563848.jpg",
            "Comment": "",
            "IsEnabled": true,
            "IsVideo": false,
            "IsFeaturedItem": false,
            "IsExternalResource": false,
            "User": {
                "ID": 11749,
                "Username": "ForumElettrico.it"
            },
            "DateCreated": "2020-04-19T09:57:00Z"
        },
        {
            "ID": 22016,
            "ChargePointID": 155569,
            "ItemURL": "https://s3-ap-southeast-2.amazonaws.com/openchargemap/images/IT/OCM155569/OCM-155569.orig.2020041909564535.jpg",
            "ItemThumbnailURL": "https://s3-ap-southeast-2.amazonaws.com/openchargemap/images/IT/OCM155569/OCM-155569.thmb.2020041909564535.jpg",
            "Comment": "",
            "IsEnabled": true,
            "IsVideo": false,
            "IsFeaturedItem": false,
            "IsExternalResource": false,
            "User": {
                "ID": 11749,
                "Username": "ForumElettrico.it"
            },
            "DateCreated": "2020-04-19T09:57:00Z"
        },
        {
            "ID": 22017,
            "ChargePointID": 155569,
            "ItemURL": "https://s3-ap-southeast-2.amazonaws.com/openchargemap/images/IT/OCM155569/OCM-155569.orig.2020041909565254.jpg",
            "ItemThumbnailURL": "https://s3-ap-southeast-2.amazonaws.com/openchargemap/images/IT/OCM155569/OCM-155569.thmb.2020041909565254.jpg",
            "Comment": "",
            "IsEnabled": true,
            "IsVideo": false,
            "IsFeaturedItem": false,
            "IsExternalResource": false,
            "User": {
                "ID": 11749,
                "Username": "ForumElettrico.it"
            },
            "DateCreated": "2020-04-19T09:57:00Z"
        }
    ],
    "IsRecentlyVerified": false,
    "ID": 155569,
    "UUID": "984D4416-A0E6-4B2E-A142-E19C22FED77B",
    "DataProviderID": 1,
    "OperatorID": 1,
    "UsageTypeID": 6,
    "AddressInfo": {
        "ID": 155923,
        "Title": "Charge&CarRental Hotel Miramare the Palace",
        "AddressLine1": "Corso Matuzia 9",
        "Town": "Sanremo",
        "StateOrProvince": "IM",
        "CountryID": 112,
        "Latitude": 43.810769,
        "Longitude": 7.763556,
        "RelatedURL": "https://www.forumelettrico.it/forum/due-stazioni-di-ricarica-charge-carrental-22-kw-miramare-the-palace-sanremo-t7189.html",
        "DistanceUnit": 0
    },
    "Connections": [
        {
            "ID": 218998,
            "ConnectionTypeID": 25,
            "LevelID": 2,
            "PowerKW": 22,
            "Quantity": 2
        }
    ],
    "NumberOfPoints": 1,
    "StatusTypeID": 50,
    "DateLastStatusUpdate": "2020-04-19T09:57:00Z",
    "DataQualityLevel": 1,
    "DateCreated": "2020-04-19T09:56:00Z",
    "SubmissionStatusTypeID": 200
}