{
    "MediaItems": [
        {
            "ID": 21944,
            "ChargePointID": 155494,
            "ItemURL": "https://s3-ap-southeast-2.amazonaws.com/openchargemap/images/AT/OCM155494/OCM-155494.orig.2020041414363805.jpg",
            "ItemThumbnailURL": "https://s3-ap-southeast-2.amazonaws.com/openchargemap/images/AT/OCM155494/OCM-155494.thmb.2020041414363805.jpg",
            "Comment": "",
            "IsEnabled": true,
            "IsVideo": false,
            "IsFeaturedItem": false,
            "IsExternalResource": false,
            "User": {
                "ID": 25686,
                "Username": "Stromquelle"
            },
            "DateCreated": "2020-04-14T14:37:00Z"
        }
    ],
    "IsRecentlyVerified": false,
    "ID": 155494,
    "UUID": "2DAB7F06-C8D7-47A6-963C-F6CB00541C46",
    "DataProviderID": 1,
    "OperatorID": 45,
    "UsageTypeID": 5,
    "UsageCost": "Direct Payment AC: 0,32 EUR/kWh & 1,00 EUR/h - Direct Payment DC: 0,32 EUR/kWh & 0,20 EUR/min",
    "AddressInfo": {
        "ID": 155848,
        "Title": "Stromquelle",
        "AddressLine1": "Alfred Feierfeilstrasse 3",
        "Town": "Perchtoldsdorf",
        "Postcode": "2380",
        "CountryID": 19,
        "Latitude": 48.11894840193685,
        "Longitude": 16.288695080365187,
        "ContactTelephone1": "0664 251 3210",
        "ContactTelephone2": "01 90545450",
        "RelatedURL": "http://www.stromquelle.at",
        "DistanceUnit": 0
    },
    "Connections": [
        {
            "ID": 220113,
            "ConnectionTypeID": 25,
            "StatusTypeID": 50,
            "LevelID": 2,
            "Amps": 32,
            "Voltage": 400,
            "PowerKW": 22,
            "CurrentTypeID": 20,
            "Quantity": 1
        },
        {
            "ID": 259828,
            "ConnectionTypeID": 33,
            "StatusTypeID": 50,
            "LevelID": 3,
            "Voltage": 500,
            "PowerKW": 22.5,
            "CurrentTypeID": 30,
            "Quantity": 1
        },
        {
            "ID": 259829,
            "ConnectionTypeID": 33,
            "StatusTypeID": 50,
            "LevelID": 3,
            "Voltage": 900,
            "PowerKW": 50,
            "CurrentTypeID": 30,
            "Quantity": 1
        },
        {
            "ID": 259830,
            "ConnectionTypeID": 2,
            "StatusTypeID": 50,
            "LevelID": 3,
            "Voltage": 500,
            "PowerKW": 50,
            "CurrentTypeID": 30,
            "Quantity": 1
        },
        {
            "ID": 259831,
            "ConnectionTypeID": 1036,
            "StatusTypeID": 50,
            "LevelID": 2,
            "Amps": 32,
            "Voltage": 400,
            "PowerKW": 22,
            "CurrentTypeID": 20,
            "Quantity": 1
        }
    ],
    "NumberOfPoints": 4,
    "GeneralComments": "",
    "StatusTypeID": 50,
    "DateLastStatusUpdate": "2020-11-24T09:58:00Z",
    "DataQualityLevel": 1,
    "DateCreated": "2020-04-14T14:36:00Z",
    "SubmissionStatusTypeID": 200
}