{
    "IsRecentlyVerified": false,
    "ID": 97176,
    "UUID": "6CE62966-46C0-4440-8CC5-EDEB438E19D8",
    "DataProviderID": 1,
    "OperatorID": 1,
    "UsageTypeID": 1,
    "UsageCost": "Frei",
    "AddressInfo": {
        "ID": 97522,
        "Title": "Kloster Hirsau",
        "AddressLine1": "Wildbader Straße 9",
        "Town": "Calw",
        "StateOrProvince": "Verwaltungsgemeinschaft Calw",
        "Postcode": "75365",
        "CountryID": 87,
        "Latitude": 48.73692092134736,
        "Longitude": 8.731444258405308,
        "AccessComments": "24/7 nutzbare Säule direkt hinter der Bushaltestelle Kloster Hirsau, Fahrtrichtung Calw.",
        "DistanceUnit": 0
    },
    "Connections": [
        {
            "ID": 137976,
            "ConnectionTypeID": 25,
            "StatusTypeID": 50,
            "LevelID": 2,
            "Amps": 32,
            "Voltage": 400,
            "PowerKW": 22,
            "CurrentTypeID": 20,
            "Quantity": 2
        },
        {
            "ID": 137977,
            "ConnectionTypeID": 28,
            "StatusTypeID": 50,
            "LevelID": 2,
            "Amps": 16,
            "Voltage": 230,
            "PowerKW": 3.7,
            "CurrentTypeID": 10,
            "Quantity": 1
        }
    ],
    "NumberOfPoints": 2,
    "GeneralComments": "Betreiber sind die EnCW - Energiewerke Calw.",
    "StatusTypeID": 50,
    "DateLastStatusUpdate": "2018-01-09T08:34:00Z",
    "DataQualityLevel": 1,
    "DateCreated": "2018-01-09T08:34:00Z",
    "SubmissionStatusTypeID": 200
}