{
    "IsRecentlyVerified": false,
    "ID": 134009,
    "UUID": "AA9CBF78-DAD4-4BF9-8A83-BD35B0145336",
    "DataProviderID": 1,
    "OperatorID": 3,
    "OperatorsReference": "PG-70098,PG-83884",
    "UsageTypeID": 4,
    "UsageCost": "Free",
    "AddressInfo": {
        "ID": 134355,
        "Title": "Tesco Extra-Cirencester",
        "AddressLine1": "Kings Meadow",
        "Town": "Cricklade Road",
        "StateOrProvince": "Cirencester",
        "Postcode": "GL7 1NP",
        "CountryID": 1,
        "Latitude": 51.705842,
        "Longitude": -1.951557,
        "DistanceUnit": 0
    },
    "Connections": [
        {
            "ID": 187510,
            "ConnectionTypeID": 25,
            "StatusTypeID": 50,
            "LevelID": 2,
            "Amps": 32,
            "Voltage": 230,
            "PowerKW": 7,
            "CurrentTypeID": 10,
            "Quantity": 4
        }
    ],
    "NumberOfPoints": 4,
    "GeneralComments": "This is an open charge unit installed at the Tesco Extra superstore at Kings Meadow, Cricklade Road, Cirencester",
    "StatusTypeID": 50,
    "DateLastStatusUpdate": "2019-11-02T06:56:00Z",
    "DataQualityLevel": 1,
    "DateCreated": "2019-11-01T06:35:00Z",
    "SubmissionStatusTypeID": 200
}