{
    "IsRecentlyVerified": false,
    "ID": 175545,
    "UUID": "216CEB9A-34F7-4D33-A95D-FBCF7EEB5D2B",
    "DataProviderID": 1,
    "OperatorID": 3447,
    "UsageTypeID": 1,
    "AddressInfo": {
        "ID": 175904,
        "Title": "Total - Relais de l'Estalot",
        "AddressLine1": "A10",
        "Town": "Saint-André-de-Cubzac",
        "Postcode": "33240",
        "CountryID": 80,
        "Latitude": 44.97857008609739,
        "Longitude": -0.43170621688318533,
        "RelatedURL": "https://apps.total-ev-charge.com/charge-points/TOTAL-NF078546-001-1",
        "DistanceUnit": 0
    },
    "Connections": [
        {
            "ID": 272488,
            "ConnectionTypeID": 33,
            "StatusTypeID": 50,
            "LevelID": 3,
            "PowerKW": 50,
            "CurrentTypeID": 30,
            "Quantity": 2
        },
        {
            "ID": 272489,
            "ConnectionTypeID": 2,
            "StatusTypeID": 50,
            "LevelID": 3,
            "PowerKW": 50,
            "CurrentTypeID": 30,
            "Quantity": 2
        },
        {
            "ID": 272490,
            "ConnectionTypeID": 1036,
            "StatusTypeID": 50,
            "LevelID": 3,
            "PowerKW": 43,
            "CurrentTypeID": 20,
            "Quantity": 2
        },
        {
            "ID": 272491,
            "ConnectionTypeID": 28,
            "StatusTypeID": 50,
            "CurrentTypeID": 10,
            "Quantity": 2
        },
        {
            "ID": 295198,
            "ConnectionTypeID": 33,
            "StatusTypeID": 50,
            "LevelID": 3,
            "PowerKW": 175,
            "CurrentTypeID": 30,
            "Quantity": 4
        },
        {
            "ID": 295199,
            "ConnectionTypeID": 2,
            "StatusTypeID": 50,
            "LevelID": 3,
            "PowerKW": 100,
            "CurrentTypeID": 30,
            "Quantity": 4
        }
    ],
    "NumberOfPoints": 4,
    "StatusTypeID": 50,
    "DateLastStatusUpdate": "2021-07-11T08:53:00Z",
    "DataQualityLevel": 1,
    "DateCreated": "2021-05-28T07:43:00Z",
    "SubmissionStatusTypeID": 200
}