{
    "IsRecentlyVerified": false,
    "ID": 136111,
    "UUID": "30C2BE30-F0F5-4B5D-9A46-BE8BDAC77765",
    "DataProviderID": 18,
    "DataProvidersReference": "213918481e65dda31a328f2917b9afa5",
    "OperatorID": 2244,
    "UsageTypeID": 4,
    "AddressInfo": {
        "ID": 136457,
        "Title": "Reckitt Road",
        "AddressLine1": "Reckitt Road",
        "Town": "London",
        "Postcode": "W4 2BL",
        "CountryID": 1,
        "Latitude": 51.490325,
        "Longitude": -0.256035,
        "AccessComments": "",
        "RelatedURL": "https://www.ubitricity.com",
        "DistanceUnit": 0
    },
    "Connections": [
        {
            "ID": 190538,
            "ConnectionTypeID": 25,
            "Reference": "suby1100000833",
            "StatusTypeID": 50,
            "LevelID": 2,
            "Amps": 16,
            "Voltage": 230,
            "PowerKW": 3.7,
            "CurrentTypeID": 10
        }
    ],
    "StatusTypeID": 0,
    "DateLastStatusUpdate": "2021-04-25T05:46:00Z",
    "MetadataValues": [
        {
            "ID": 5963,
            "MetadataFieldID": 4,
            "ItemValue": "Contains public sector information licensed under the Open Government Licence v2.0. http://www.nationalarchives.gov.uk/doc/open-government-licence/version/2/"
        }
    ],
    "DataQualityLevel": 3,
    "DateCreated": "2019-12-24T05:22:00Z",
    "SubmissionStatusTypeID": 100
}