{
    "IsRecentlyVerified": false,
    "ID": 108743,
    "UUID": "35189408-95C6-413A-BC47-E2426F41DBF9",
    "DataProviderID": 1,
    "OperatorID": 23,
    "OperatorsReference": "46351",
    "UsageTypeID": 4,
    "AddressInfo": {
        "ID": 109089,
        "Title": "Powderhorn Resort",
        "AddressLine1": "48338 Powderhorn RD",
        "Town": "Mesa",
        "StateOrProvince": "Colorado",
        "Postcode": "81643",
        "CountryID": 2,
        "Latitude": 39.0693962,
        "Longitude": -108.1507337,
        "ContactTelephone1": "(970) 268-5700",
        "DistanceUnit": 0
    },
    "Connections": [
        {
            "ID": 153858,
            "ConnectionTypeID": 30,
            "StatusTypeID": 50,
            "LevelID": 2,
            "PowerKW": 16,
            "CurrentTypeID": 20,
            "Quantity": 4
        }
    ],
    "NumberOfPoints": 4,
    "GeneralComments": "4 Tesla Connectors, up to 16kW.Available for customers. Self park.",
    "StatusTypeID": 50,
    "DateLastStatusUpdate": "2018-10-11T12:33:00Z",
    "DataQualityLevel": 1,
    "DateCreated": "2018-10-11T12:33:00Z",
    "SubmissionStatusTypeID": 200
}