{
    "IsRecentlyVerified": false,
    "ID": 173629,
    "UUID": "B4F2E038-69E8-4F8D-A8E7-3B66A9847288",
    "DataProviderID": 18,
    "DataProvidersReference": "3ccf50b9d73ea11f758bd030e5ac593f",
    "UsageTypeID": 1,
    "AddressInfo": {
        "ID": 173988,
        "Title": "Stepney Place",
        "AddressLine1": "Stepney Place",
        "Town": "Llanelli",
        "Postcode": "SA15 1SE",
        "CountryID": 1,
        "Latitude": 51.683421,
        "Longitude": -4.157256,
        "AccessComments": "",
        "RelatedURL": "http://www.clenerg-ev.com/",
        "DistanceUnit": 0
    },
    "Connections": [
        {
            "ID": 266726,
            "ConnectionTypeID": 25,
            "Reference": "Connector 1",
            "StatusTypeID": 50,
            "LevelID": 2,
            "Amps": 32,
            "Voltage": 400,
            "PowerKW": 22,
            "CurrentTypeID": 20
        },
        {
            "ID": 266727,
            "ConnectionTypeID": 25,
            "Reference": "Connector 2",
            "StatusTypeID": 50,
            "LevelID": 2,
            "Amps": 32,
            "Voltage": 400,
            "PowerKW": 22,
            "CurrentTypeID": 20
        }
    ],
    "StatusTypeID": 0,
    "DateLastStatusUpdate": "2021-03-03T11:25:00Z",
    "MetadataValues": [
        {
            "ID": 8551,
            "MetadataFieldID": 4,
            "ItemValue": "Contains public sector information licensed under the Open Government Licence v2.0. http://www.nationalarchives.gov.uk/doc/open-government-licence/version/2/"
        }
    ],
    "DataQualityLevel": 3,
    "DateCreated": "2021-03-03T11:25:00Z",
    "SubmissionStatusTypeID": 100
}