{
    "IsRecentlyVerified": false,
    "ID": 35739,
    "UUID": "CB596DE9-1076-41CE-8CDD-D9B041C8851F",
    "DataProviderID": 26,
    "DataProvidersReference": "48103",
    "OperatorID": 178,
    "OperatorsReference": "EVnetNL DB0346",
    "UsageCost": "0.00 jaarabonnement",
    "AddressInfo": {
        "ID": 36085,
        "Title": "Pompmolenlaan 2",
        "AddressLine1": "Pompmolenlaan 2",
        "Town": "Woerden",
        "Postcode": "3447 GK",
        "CountryID": 159,
        "Latitude": 52.077007,
        "Longitude": 4.895729,
        "ContactTelephone1": "0800-3522365",
        "RelatedURL": "http://www.evnet.nl",
        "DistanceUnit": 0
    },
    "Connections": [
        {
            "ID": 39250,
            "ConnectionTypeID": 25,
            "LevelID": 2,
            "PowerKW": 11,
            "CurrentTypeID": 10
        }
    ],
    "NumberOfPoints": 2,
    "StatusTypeID": 50,
    "DateLastStatusUpdate": "2016-06-04T02:49:00Z",
    "DataQualityLevel": 3,
    "DateCreated": "2015-01-09T06:05:00Z",
    "SubmissionStatusTypeID": 100
}