{
    "IsRecentlyVerified": false,
    "ID": 17345,
    "UUID": "B3D1800A-63F3-47EE-985F-F06844B9C3C7",
    "DataProviderID": 22,
    "DataProvidersReference": "228A37C4A96D1CDC1659B9E2BF4B0000",
    "AddressInfo": {
        "ID": 17690,
        "Title": "イオン大日ショッピングセンター",
        "AddressLine1": "大阪府守口市大日東町1-18",
        "CountryID": 114,
        "Latitude": 34.75066719,
        "Longitude": 135.5811977,
        "ContactTelephone1": "06-4252-3500",
        "DistanceUnit": 0
    },
    "Connections": [
        {
            "ID": 17586,
            "ConnectionTypeID": 2,
            "LevelID": 2,
            "Amps": 100,
            "Voltage": 480,
            "PowerKW": 48,
            "Quantity": 1
        }
    ],
    "DateLastStatusUpdate": "2013-06-29T08:57:00Z",
    "DataQualityLevel": 2,
    "DateCreated": "2013-06-29T08:57:00Z",
    "SubmissionStatusTypeID": 200
}