{
    "IsRecentlyVerified": false,
    "ID": 153116,
    "UUID": "08DE5920-440C-4B34-9C06-44564BA81818",
    "DataProviderID": 28,
    "DataProvidersReference": "FR*S49*P49220*001",
    "UsageTypeID": 5,
    "AddressInfo": {
        "ID": 153469,
        "Title": "MORANNES - Rue De La Croix Verte",
        "AddressLine1": "Rue De La Croix Verte 49640 MORANNES",
        "CountryID": 80,
        "Latitude": 47.745053,
        "Longitude": -0.417993,
        "AccessComments": "24h/24 7j/7",
        "DistanceUnit": 0
    },
    "Connections": [
        {
            "ID": 214648,
            "ConnectionTypeID": 25,
            "StatusTypeID": 50,
            "LevelID": 2,
            "PowerKW": 18,
            "CurrentTypeID": 20
        },
        {
            "ID": 214649,
            "ConnectionTypeID": 28,
            "StatusTypeID": 50,
            "LevelID": 2,
            "PowerKW": 18,
            "CurrentTypeID": 10
        },
        {
            "ID": 248000,
            "ConnectionTypeID": 25,
            "StatusTypeID": 50,
            "LevelID": 2,
            "PowerKW": 18,
            "CurrentTypeID": 20
        },
        {
            "ID": 248001,
            "ConnectionTypeID": 28,
            "StatusTypeID": 50,
            "LevelID": 2,
            "PowerKW": 18,
            "CurrentTypeID": 10
        }
    ],
    "GeneralComments": "Recharge par badge et avec une application smartphone",
    "StatusTypeID": 50,
    "DateLastStatusUpdate": "2020-08-27T05:14:00Z",
    "DataQualityLevel": 2,
    "DateCreated": "2020-03-15T10:54:00Z",
    "SubmissionStatusTypeID": 100
}