{
    "IsRecentlyVerified": false,
    "ID": 87910,
    "UUID": "ED0C644B-D88B-41B2-8333-687538F45B57",
    "DataProviderID": 1,
    "OperatorID": 23,
    "OperatorsReference": "29629",
    "UsageTypeID": 4,
    "AddressInfo": {
        "ID": 88256,
        "Title": "Erneside Shopping Centre",
        "AddressLine1": "Erneside Shopping Centre",
        "Town": "East Bridge St",
        "StateOrProvince": "Enniskillen",
        "Postcode": "BT74 7BN",
        "CountryID": 1,
        "Latitude": 54.342478,
        "Longitude": -7.635394,
        "ContactTelephone1": "+44 286 632 5705",
        "DistanceUnit": 0
    },
    "Connections": [
        {
            "ID": 124719,
            "ConnectionTypeID": 30,
            "StatusTypeID": 50,
            "LevelID": 2,
            "Amps": 32,
            "Voltage": 230,
            "PowerKW": 7,
            "CurrentTypeID": 10,
            "Quantity": 2
        }
    ],
    "NumberOfPoints": 2,
    "GeneralComments": "2 Tesla Connectors, up to 7kW.Available for customers. Self park.",
    "StatusTypeID": 50,
    "DateLastStatusUpdate": "2018-10-03T15:52:00Z",
    "DataQualityLevel": 1,
    "DateCreated": "2017-05-18T05:39:00Z",
    "SubmissionStatusTypeID": 200
}