{
    "IsRecentlyVerified": false,
    "ID": 54451,
    "UUID": "E13DF0E9-4884-483F-8BF9-E967C848A989",
    "DataProviderID": 1,
    "OperatorID": 32,
    "OperatorsReference": "1445",
    "UsageTypeID": 4,
    "UsageCost": "£0.108/kWh; for Polar Plus subscription members only",
    "AddressInfo": {
        "ID": 54797,
        "Title": "329 Lower 4th Street",
        "AddressLine1": "329 Lower 4th Street",
        "Town": "Milton Keynes",
        "StateOrProvince": "Central Bedfordshire",
        "Postcode": "MK9 3AE",
        "CountryID": 1,
        "Latitude": 52.037277,
        "Longitude": -0.766195,
        "DistanceUnit": 0
    },
    "Connections": [
        {
            "ID": 68669,
            "ConnectionTypeID": 25,
            "StatusTypeID": 50,
            "LevelID": 2,
            "Amps": 32,
            "Voltage": 230,
            "PowerKW": 7,
            "CurrentTypeID": 10,
            "Quantity": 2
        },
        {
            "ID": 110796,
            "ConnectionTypeID": 25,
            "StatusTypeID": 50,
            "LevelID": 2,
            "Amps": 16,
            "Voltage": 230,
            "PowerKW": 4,
            "CurrentTypeID": 10,
            "Quantity": 2
        }
    ],
    "NumberOfPoints": 2,
    "StatusTypeID": 50,
    "DateLastStatusUpdate": "2019-03-09T06:30:00Z",
    "DataQualityLevel": 1,
    "DateCreated": "2015-10-03T08:01:00Z",
    "SubmissionStatusTypeID": 200
}