{
    "IsRecentlyVerified": false,
    "ID": 91181,
    "UUID": "C27F5121-07CB-4C35-BBE4-81274552B719",
    "DataProviderID": 1,
    "OperatorID": 23,
    "OperatorsReference": "32531",
    "UsageTypeID": 6,
    "AddressInfo": {
        "ID": 91527,
        "Title": "Hôtel Logis Châteaudun",
        "AddressLine1": "9 la Varenne Hodier - Donnemain St Mames",
        "Town": "Châteaudun",
        "Postcode": "28200",
        "CountryID": 80,
        "Latitude": 48.097407,
        "Longitude": 1.331154,
        "ContactTelephone1": "+33 2 37 66 30 00",
        "DistanceUnit": 0
    },
    "Connections": [
        {
            "ID": 129309,
            "ConnectionTypeID": 30,
            "StatusTypeID": 50,
            "LevelID": 2,
            "Amps": 16,
            "Voltage": 400,
            "PowerKW": 11,
            "CurrentTypeID": 20,
            "Quantity": 2
        }
    ],
    "NumberOfPoints": 2,
    "GeneralComments": "2 Tesla Connectors, up to 11kW.Available for patrons only. Please see front desk.",
    "StatusTypeID": 50,
    "DateLastStatusUpdate": "2018-10-03T21:43:00Z",
    "DataQualityLevel": 1,
    "DateCreated": "2017-08-02T05:30:00Z",
    "SubmissionStatusTypeID": 200
}