{
    "IsRecentlyVerified": false,
    "ID": 108357,
    "UUID": "001C6879-5AEA-434E-A240-C6BBCBB04635",
    "DataProviderID": 1,
    "OperatorID": 198,
    "UsageTypeID": 4,
    "UsageCost": "£0.30/kWh",
    "AddressInfo": {
        "ID": 108703,
        "Title": "Crown Service Station",
        "AddressLine1": "Wakefield Road",
        "Town": "Brighouse",
        "Postcode": "HD6 1QH",
        "CountryID": 1,
        "Latitude": 53.70126,
        "Longitude": -1.771702,
        "DistanceUnit": 0
    },
    "Connections": [
        {
            "ID": 153192,
            "ConnectionTypeID": 33,
            "StatusTypeID": 50,
            "LevelID": 3,
            "PowerKW": 60,
            "CurrentTypeID": 30,
            "Quantity": 1
        },
        {
            "ID": 153193,
            "ConnectionTypeID": 2,
            "StatusTypeID": 50,
            "LevelID": 3,
            "PowerKW": 60,
            "CurrentTypeID": 30,
            "Quantity": 1
        },
        {
            "ID": 153194,
            "ConnectionTypeID": 1036,
            "StatusTypeID": 50,
            "LevelID": 3,
            "Amps": 63,
            "Voltage": 400,
            "PowerKW": 43,
            "CurrentTypeID": 20,
            "Quantity": 1
        },
        {
            "ID": 153195,
            "ConnectionTypeID": 25,
            "StatusTypeID": 50,
            "LevelID": 2,
            "Amps": 32,
            "Voltage": 400,
            "PowerKW": 22,
            "CurrentTypeID": 20,
            "Quantity": 1
        }
    ],
    "NumberOfPoints": 1,
    "StatusTypeID": 50,
    "DateLastStatusUpdate": "2018-10-05T11:55:00Z",
    "DataQualityLevel": 1,
    "DateCreated": "2018-09-24T18:47:00Z",
    "SubmissionStatusTypeID": 200
}