{
    "IsRecentlyVerified": false,
    "ID": 152661,
    "UUID": "FC42C1AC-625E-4439-B1F7-B0C6C31B7B21",
    "DataProviderID": 28,
    "DataProvidersReference": "FR*S41*P41194-61",
    "UsageTypeID": 5,
    "AddressInfo": {
        "ID": 153014,
        "Title": "Romorantin-Lanthenay | Rue Sabard 3",
        "AddressLine1": "3 Rue Sabard 41200 Romorantin-Lanthenay",
        "CountryID": 80,
        "Latitude": 47.363384,
        "Longitude": 1.74353,
        "AccessComments": "24/24 7/7",
        "DistanceUnit": 0
    },
    "Connections": [
        {
            "ID": 213808,
            "ConnectionTypeID": 25,
            "StatusTypeID": 50,
            "LevelID": 2,
            "PowerKW": 18,
            "CurrentTypeID": 20
        },
        {
            "ID": 213809,
            "ConnectionTypeID": 28,
            "StatusTypeID": 50,
            "LevelID": 2,
            "PowerKW": 18,
            "CurrentTypeID": 10
        },
        {
            "ID": 246963,
            "ConnectionTypeID": 25,
            "StatusTypeID": 50,
            "LevelID": 2,
            "PowerKW": 18,
            "CurrentTypeID": 20
        },
        {
            "ID": 246964,
            "ConnectionTypeID": 28,
            "StatusTypeID": 50,
            "LevelID": 2,
            "PowerKW": 18,
            "CurrentTypeID": 10
        }
    ],
    "GeneralComments": "",
    "StatusTypeID": 50,
    "DateLastStatusUpdate": "2020-08-27T05:13:00Z",
    "DataQualityLevel": 2,
    "DateCreated": "2020-03-15T10:54:00Z",
    "SubmissionStatusTypeID": 100
}