{
    "IsRecentlyVerified": false,
    "ID": 51480,
    "UUID": "43952883-F7A3-4435-807A-CB0537D3EBDF",
    "DataProviderID": 1,
    "OperatorID": 45,
    "UsageTypeID": 1,
    "AddressInfo": {
        "ID": 51826,
        "Title": "Bau-und Gartenmarkt BayWa",
        "AddressLine1": "Gruber Straße 60b",
        "Town": "Poing",
        "StateOrProvince": "Landkreis Ebersberg",
        "Postcode": "85586",
        "CountryID": 87,
        "Latitude": 48.1704626528057,
        "Longitude": 11.797625219574,
        "ContactTelephone1": "+49 8121 9932-70",
        "AccessComments": "Kostenlos Laden von Elektroauto und Pedelecs, mehr ist zur Zeit nicht bekannt. Daher sollte zumindestens eine Schukodose vorhanden sein...",
        "RelatedURL": "http://www.baywa-baumarkt.de/cms/de/Standorte/Poing/Poing.htm",
        "DistanceUnit": 0
    },
    "Connections": [
        {
            "ID": 63775,
            "ConnectionTypeID": 28,
            "StatusTypeID": 50,
            "LevelID": 2,
            "Amps": 16,
            "Voltage": 230,
            "PowerKW": 3.7,
            "CurrentTypeID": 10,
            "Quantity": 1
        }
    ],
    "NumberOfPoints": 1,
    "StatusTypeID": 50,
    "DateLastStatusUpdate": "2017-05-16T05:56:00Z",
    "DataQualityLevel": 1,
    "DateCreated": "2015-07-27T08:06:00Z",
    "SubmissionStatusTypeID": 200
}