{
    "IsRecentlyVerified": false,
    "ID": 177255,
    "UUID": "44717573-37A7-4FD3-ACEA-6B85002D99FF",
    "DataProviderID": 29,
    "DataProvidersReference": "8751",
    "OperatorID": 69,
    "AddressInfo": {
        "ID": 177614,
        "Title": "Beethovenplatz 4",
        "AddressLine1": "Beethovenplatz 4",
        "Town": "München",
        "Postcode": "80336",
        "CountryID": 87,
        "Latitude": 48.132602,
        "Longitude": 11.558156,
        "DistanceUnit": 0
    },
    "Connections": [
        {
            "ID": 276189,
            "ConnectionTypeID": 25,
            "StatusTypeID": 50,
            "LevelID": 2,
            "PowerKW": 22,
            "CurrentTypeID": 20
        },
        {
            "ID": 276190,
            "ConnectionTypeID": 25,
            "StatusTypeID": 50,
            "LevelID": 2,
            "PowerKW": 22,
            "CurrentTypeID": 20
        }
    ],
    "StatusTypeID": 0,
    "DateLastStatusUpdate": "2021-07-09T03:11:00Z",
    "MetadataValues": [
        {
            "ID": 9549,
            "MetadataFieldID": 4,
            "ItemValue": "Data from the German chargepoint registry provided by Bundesnetzagentur.de under the CC-BY 4.0 license"
        }
    ],
    "DataQualityLevel": 3,
    "DateCreated": "2021-07-08T09:48:00Z",
    "SubmissionStatusTypeID": 100
}