{
    "IsRecentlyVerified": false,
    "ID": 112544,
    "UUID": "FE5F8D81-7A93-4BBC-8B0B-B3FAB09CBCB5",
    "DataProviderID": 1,
    "OperatorID": 80,
    "UsageTypeID": 4,
    "AddressInfo": {
        "ID": 112890,
        "Title": "Origgio XXV Aprile | EnelX",
        "AddressLine1": "Piazza XXV Aprile",
        "Town": "Origgio",
        "StateOrProvince": "VA",
        "Postcode": "21040 ",
        "CountryID": 112,
        "Latitude": 45.5940610792903,
        "Longitude": 9.01516467476574,
        "ContactTelephone1": "800.069.850",
        "RelatedURL": "https://www.enelx.com/it/it/emobility",
        "DistanceUnit": 0
    },
    "Connections": [
        {
            "ID": 158332,
            "ConnectionTypeID": 25,
            "StatusTypeID": 50,
            "LevelID": 2,
            "Amps": 32,
            "Voltage": 400,
            "PowerKW": 22,
            "CurrentTypeID": 20,
            "Quantity": 2
        }
    ],
    "NumberOfPoints": 2,
    "StatusTypeID": 50,
    "DateLastStatusUpdate": "2019-01-07T14:39:00Z",
    "DataQualityLevel": 1,
    "DateCreated": "2018-11-06T10:56:00Z",
    "SubmissionStatusTypeID": 200
}