{
    "IsRecentlyVerified": false,
    "ID": 34057,
    "UUID": "1C560BAD-EF6C-4D81-92F7-803CDE9F8D6C",
    "DataProviderID": 26,
    "DataProvidersReference": "48260",
    "OperatorID": 178,
    "OperatorsReference": "EVnetNL EV0148",
    "UsageCost": "0.00 jaarabonnement",
    "AddressInfo": {
        "ID": 34403,
        "Title": "Groene Kruisweg 19A",
        "AddressLine1": "Groene Kruisweg 19A",
        "Town": "Nissewaard",
        "Postcode": "3202 ST",
        "CountryID": 159,
        "Latitude": 51.853737,
        "Longitude": 4.321054,
        "ContactTelephone1": "0800-3522365",
        "RelatedURL": "http://www.evnet.nl",
        "DistanceUnit": 0
    },
    "Connections": [
        {
            "ID": 37568,
            "ConnectionTypeID": 25,
            "LevelID": 2,
            "PowerKW": 11,
            "CurrentTypeID": 10
        }
    ],
    "NumberOfPoints": 1,
    "StatusTypeID": 50,
    "DateLastStatusUpdate": "2016-06-04T02:41:00Z",
    "DataQualityLevel": 3,
    "DateCreated": "2015-01-09T06:04:00Z",
    "SubmissionStatusTypeID": 100
}