{
    "IsRecentlyVerified": false,
    "ID": 6822,
    "UUID": "121074B5-74C0-4439-8DEE-C60E311ED890",
    "DataProviderID": 2,
    "DataProvidersReference": "40840",
    "OperatorID": 5,
    "UsageTypeID": 1,
    "AddressInfo": {
        "ID": 6723,
        "Title": "WATERFORD GROUP",
        "AddressLine1": "70 Constitution Ave",
        "Town": "Concord",
        "StateOrProvince": "NH",
        "Postcode": "03301",
        "CountryID": 2,
        "Latitude": 43.217311,
        "Longitude": -71.53656,
        "ContactTelephone1": "888-758-4389",
        "AccessComments": "24 hours daily",
        "RelatedURL": "http://www.chargepoint.com/",
        "DistanceUnit": 0
    },
    "Connections": [
        {
            "ID": 4270,
            "ConnectionTypeID": 9,
            "LevelID": 1,
            "Amps": 16,
            "Voltage": 120,
            "PowerKW": 1.9,
            "CurrentTypeID": 10,
            "Quantity": 2
        },
        {
            "ID": 4271,
            "ConnectionTypeID": 1,
            "LevelID": 2,
            "Amps": 16,
            "Voltage": 230,
            "PowerKW": 3.7,
            "CurrentTypeID": 10,
            "Quantity": 2
        },
        {
            "ID": 21240,
            "ConnectionTypeID": 1,
            "LevelID": 2,
            "Quantity": 2
        }
    ],
    "DateLastConfirmed": "2011-08-31T00:00:00Z",
    "StatusTypeID": 0,
    "DateLastStatusUpdate": "2020-06-26T03:06:00Z",
    "DataQualityLevel": 1,
    "DateCreated": "2011-10-10T12:26:00Z",
    "SubmissionStatusTypeID": 100
}