{
    "MediaItems": [
        {
            "ID": 13826,
            "ChargePointID": 96403,
            "ItemURL": "https://s3-ap-southeast-2.amazonaws.com/openchargemap/images/HU/OCM96403/OCM-96403.orig.2017122312184285.jpg",
            "ItemThumbnailURL": "https://s3-ap-southeast-2.amazonaws.com/openchargemap/images/HU/OCM96403/OCM-96403.thmb.2017122312184285.jpg",
            "Comment": "",
            "IsEnabled": true,
            "IsVideo": false,
            "IsFeaturedItem": false,
            "IsExternalResource": false,
            "User": {
                "ID": 4438,
                "Username": "tibor.antaloczy"
            },
            "DateCreated": "2017-12-23T12:19:00Z"
        },
        {
            "ID": 13827,
            "ChargePointID": 96403,
            "ItemURL": "https://s3-ap-southeast-2.amazonaws.com/openchargemap/images/HU/OCM96403/OCM-96403.orig.2017122312190761.jpg",
            "ItemThumbnailURL": "https://s3-ap-southeast-2.amazonaws.com/openchargemap/images/HU/OCM96403/OCM-96403.thmb.2017122312190761.jpg",
            "Comment": "",
            "IsEnabled": true,
            "IsVideo": false,
            "IsFeaturedItem": false,
            "IsExternalResource": false,
            "User": {
                "ID": 4438,
                "Username": "tibor.antaloczy"
            },
            "DateCreated": "2017-12-23T12:19:00Z"
        }
    ],
    "IsRecentlyVerified": false,
    "ID": 96403,
    "UUID": "75B49099-83F5-4892-8F1D-DEF988B88EF3",
    "DataProviderID": 1,
    "OperatorID": 45,
    "UsageTypeID": 1,
    "UsageCost": "free",
    "AddressInfo": {
        "ID": 96749,
        "Title": "Budapest, XVIII. kerület, Pestszentimre, Vasút utca",
        "AddressLine1": "Vasút utca 49",
        "AddressLine2": "Újpéteritelep",
        "Town": "Budapest",
        "StateOrProvince": "Budapest",
        "Postcode": "1188",
        "CountryID": 104,
        "Latitude": 47.404126307568,
        "Longitude": 19.1868411159386,
        "DistanceUnit": 0
    },
    "Connections": [
        {
            "ID": 136614,
            "ConnectionTypeID": 25,
            "StatusTypeID": 150,
            "LevelID": 2,
            "Amps": 32,
            "Voltage": 400,
            "PowerKW": 22,
            "CurrentTypeID": 20,
            "Quantity": 1
        },
        {
            "ID": 136615,
            "ConnectionTypeID": 1036,
            "StatusTypeID": 150,
            "LevelID": 2,
            "Amps": 32,
            "Voltage": 400,
            "PowerKW": 22,
            "CurrentTypeID": 20,
            "Quantity": 1
        }
    ],
    "NumberOfPoints": 1,
    "GeneralComments": "A töltés indításához applikáció szükséges (BP18 e-töltő). / Appp is needed to start the charging process (BP18 e-töltő).",
    "StatusTypeID": 50,
    "DateLastStatusUpdate": "2018-05-14T07:01:00Z",
    "DataQualityLevel": 1,
    "DateCreated": "2017-12-23T12:18:00Z",
    "SubmissionStatusTypeID": 200
}