{
    "IsRecentlyVerified": false,
    "ID": 17015,
    "UUID": "318F63BA-52FA-40B0-959D-D90744E139DB",
    "DataProviderID": 22,
    "DataProvidersReference": "57574E4F5E30961F96C7E320BF15A5DD",
    "AddressInfo": {
        "ID": 17360,
        "Title": "日産サティオ群馬　桐生店",
        "AddressLine1": "群馬県桐生市広沢町5-1535",
        "CountryID": 114,
        "Latitude": 36.37881154,
        "Longitude": 139.3434075,
        "ContactTelephone1": "0277-52-7732",
        "DistanceUnit": 0
    },
    "Connections": [
        {
            "ID": 17256,
            "ConnectionTypeID": 2,
            "LevelID": 2,
            "Amps": 100,
            "Voltage": 480,
            "PowerKW": 48,
            "Quantity": 1
        }
    ],
    "DateLastStatusUpdate": "2013-06-29T08:52:00Z",
    "DataQualityLevel": 2,
    "DateCreated": "2013-06-29T08:52:00Z",
    "SubmissionStatusTypeID": 200
}