{
    "IsRecentlyVerified": false,
    "ID": 124017,
    "UUID": "E921605E-D7CA-4BD9-9264-EA3E06CD288E",
    "DataProviderID": 2,
    "DataProvidersReference": "70524",
    "OperatorID": 5,
    "UsageTypeID": 1,
    "AddressInfo": {
        "ID": 124363,
        "Title": "BMW PETER PAN",
        "AddressLine1": "1625 Adrian Rd",
        "Town": "Burlingame",
        "StateOrProvince": "CA",
        "Postcode": "94010",
        "CountryID": 2,
        "Latitude": 37.5969,
        "Longitude": -122.373812,
        "ContactTelephone1": "888-758-4389",
        "AccessComments": "24 hours daily",
        "RelatedURL": "http://www.chargepoint.com/",
        "DistanceUnit": 0
    },
    "Connections": [
        {
            "ID": 174059,
            "ConnectionTypeID": 32,
            "LevelID": 3,
            "Amps": 100,
            "Voltage": 400,
            "PowerKW": 40,
            "CurrentTypeID": 30,
            "Quantity": 1
        }
    ],
    "DateLastStatusUpdate": "2019-12-24T09:14:00Z",
    "DataQualityLevel": 3,
    "DateCreated": "2019-04-06T05:03:00Z",
    "SubmissionStatusTypeID": 100
}