{
    "IsRecentlyVerified": false,
    "ID": 74786,
    "UUID": "32E68D3D-7D19-4714-98B7-374973245329",
    "DataProviderID": 1,
    "OperatorID": 23,
    "OperatorsReference": "20411",
    "UsageTypeID": 6,
    "UsageCost": "Free",
    "AddressInfo": {
        "ID": 75132,
        "Title": "Villa René Lalique",
        "AddressLine1": "18 rue Bellevue",
        "Town": "Wingen-sur-Moder",
        "Postcode": "67290",
        "CountryID": 80,
        "Latitude": 48.918782,
        "Longitude": 7.36506,
        "DistanceUnit": 0
    },
    "Connections": [
        {
            "ID": 107907,
            "ConnectionTypeID": 30,
            "StatusTypeID": 50,
            "LevelID": 2,
            "Amps": 32,
            "Voltage": 400,
            "PowerKW": 22,
            "CurrentTypeID": 20,
            "Quantity": 1
        }
    ],
    "NumberOfPoints": 1,
    "GeneralComments": "1 Tesla Connector, up to 22kW.Available for patrons only. Self park.",
    "StatusTypeID": 50,
    "DateLastStatusUpdate": "2018-10-03T16:37:00Z",
    "DataQualityLevel": 1,
    "DateCreated": "2016-12-03T19:36:00Z",
    "SubmissionStatusTypeID": 200
}