{
    "IsRecentlyVerified": false,
    "ID": 119824,
    "UUID": "F94CFB3B-1092-4A50-9B8D-B13CF12B296C",
    "DataProviderID": 2,
    "DataProvidersReference": "72677",
    "OperatorID": 1242,
    "UsageTypeID": 2,
    "AddressInfo": {
        "ID": 120170,
        "Title": "161650G01001030000",
        "AddressLine1": "1000  Darden Center Dr",
        "Town": "Orlando",
        "StateOrProvince": "FL",
        "Postcode": "32821",
        "CountryID": 2,
        "Latitude": 28.419565435,
        "Longitude": -81.4254565106,
        "ContactTelephone1": "855-443-3873",
        "AccessComments": "",
        "RelatedURL": "https://www.gewattstation.com",
        "DistanceUnit": 0
    },
    "Connections": [
        {
            "ID": 169114,
            "ConnectionTypeID": 1,
            "LevelID": 2,
            "Amps": 16,
            "Voltage": 230,
            "PowerKW": 3.7,
            "CurrentTypeID": 10,
            "Quantity": 1
        }
    ],
    "DateLastStatusUpdate": "2020-06-26T02:52:00Z",
    "DataQualityLevel": 3,
    "DateCreated": "2019-04-01T04:59:00Z",
    "SubmissionStatusTypeID": 100
}