{
    "IsRecentlyVerified": false,
    "ID": 95194,
    "UUID": "28F87AC5-0C2D-4F7D-895F-3A046CDE2E2D",
    "DataProviderID": 1,
    "OperatorID": 23,
    "OperatorsReference": "37246",
    "UsageTypeID": 4,
    "AddressInfo": {
        "ID": 95540,
        "Title": "Calcot Manor Hotel & Spa",
        "AddressLine1": "Near Tetbury",
        "Town": "Tetbury",
        "StateOrProvince": "Gloucestershire",
        "Postcode": "GL8 8YJ",
        "CountryID": 1,
        "Latitude": 51.652471,
        "Longitude": -2.231946,
        "ContactTelephone1": "+44 166 689 0391",
        "DistanceUnit": 0
    },
    "Connections": [
        {
            "ID": 134862,
            "ConnectionTypeID": 30,
            "StatusTypeID": 50,
            "LevelID": 2,
            "Amps": 32,
            "Voltage": 230,
            "PowerKW": 7,
            "CurrentTypeID": 10,
            "Quantity": 2
        }
    ],
    "NumberOfPoints": 2,
    "GeneralComments": "2 Tesla Connectors, up to 7kW.Available for customers. Self park.",
    "StatusTypeID": 50,
    "DateLastStatusUpdate": "2018-10-03T17:46:00Z",
    "DataQualityLevel": 1,
    "DateCreated": "2017-11-05T06:54:00Z",
    "SubmissionStatusTypeID": 200
}