{
    "UserComments": [
        {
            "ID": 11519,
            "ChargePointID": 18843,
            "CommentTypeID": 10,
            "UserName": "CraigT",
            "Comment": "Charger dead ",
            "DateCreated": "2016-05-29T15:17:53.793Z",
            "User": {
                "ID": 6478,
                "Username": "CraigT"
            },
            "CheckinStatusTypeID": 20
        },
        {
            "ID": 1166,
            "ChargePointID": 18843,
            "CommentTypeID": 10,
            "UserName": "Chris Jones",
            "Comment": "Good spot close to the town, along with free parking for 3 hours.",
            "Rating": 4,
            "DateCreated": "2014-08-31T21:37:30.767Z",
            "User": {
                "ID": 2271,
                "Username": "Chris Jones"
            },
            "CheckinStatusTypeID": 10
        }
    ],
    "MediaItems": [
        {
            "ID": 624,
            "ChargePointID": 18843,
            "ItemURL": "https://s3-ap-southeast-2.amazonaws.com/openchargemap/images/GB/OCM18843/OCM-18843.orig.2014083121363082.jpg",
            "ItemThumbnailURL": "https://s3-ap-southeast-2.amazonaws.com/openchargemap/images/GB/OCM18843/OCM-18843.thmb.2014083121363082.jpg",
            "Comment": "",
            "IsEnabled": true,
            "IsVideo": false,
            "IsFeaturedItem": false,
            "IsExternalResource": false,
            "User": {
                "ID": 2271,
                "Username": "Chris Jones"
            },
            "DateCreated": "2014-08-31T21:37:00Z"
        }
    ],
    "IsRecentlyVerified": false,
    "ID": 18843,
    "UUID": "6A97587D-6526-4310-ABA2-7A3B85A2A060",
    "DataProviderID": 1,
    "OperatorID": 32,
    "OperatorsReference": "4172",
    "UsageTypeID": 4,
    "UsageCost": "Inclusive; for Polar Plus subscription members only. Parking fees apply.",
    "AddressInfo": {
        "ID": 19188,
        "Title": "Manor Road Birmingham",
        "AddressLine1": "Manor Road ",
        "Town": "Sutton Coldfield",
        "Postcode": "B72 1SY",
        "CountryID": 1,
        "Latitude": 52.56087,
        "Longitude": -1.82584,
        "AccessComments": "On-street. Fitted under Midlands PiP. Parking fees apply.",
        "RelatedURL": "http://www.aptcontrols.co.uk/apt-technologies/",
        "DistanceUnit": 0
    },
    "Connections": [
        {
            "ID": 19077,
            "ConnectionTypeID": 25,
            "StatusTypeID": 50,
            "LevelID": 2,
            "Amps": 32,
            "Voltage": 400,
            "PowerKW": 22,
            "CurrentTypeID": 20,
            "Quantity": 2
        }
    ],
    "NumberOfPoints": 2,
    "StatusTypeID": 50,
    "DateLastStatusUpdate": "2019-03-08T06:22:00Z",
    "DataQualityLevel": 3,
    "DateCreated": "2013-08-25T04:06:00Z",
    "SubmissionStatusTypeID": 200
}