{
    "MediaItems": [
        {
            "ID": 24621,
            "ChargePointID": 24069,
            "ItemURL": "https://s3-ap-southeast-2.amazonaws.com/openchargemap/images/GB/OCM24069/OCM-24069.orig.2020090810351643.jpg",
            "ItemThumbnailURL": "https://s3-ap-southeast-2.amazonaws.com/openchargemap/images/GB/OCM24069/OCM-24069.thmb.2020090810351643.jpg",
            "Comment": "what operator is it for this post ?",
            "IsEnabled": true,
            "IsVideo": false,
            "IsFeaturedItem": false,
            "IsExternalResource": false,
            "User": {
                "ID": 18299,
                "Username": "Billleaf"
            },
            "DateCreated": "2020-09-08T10:35:00Z"
        }
    ],
    "IsRecentlyVerified": false,
    "ID": 24069,
    "UUID": "02B94A3E-56BC-41B2-899B-7AFD2E0B8BA0",
    "DataProviderID": 1,
    "UsageTypeID": 4,
    "UsageCost": "Free",
    "AddressInfo": {
        "ID": 24414,
        "Title": "Leigh Infirmary",
        "AddressLine1": "Leigh Infirmary",
        "AddressLine2": "The Avenue",
        "Town": "Leigh",
        "StateOrProvince": "Greater Manchester",
        "Postcode": "WN7 1HS",
        "CountryID": 1,
        "Latitude": 53.503164,
        "Longitude": -2.512243,
        "ContactTelephone1": "01942773862",
        "ContactEmail": "sustainability@wwl.nhs.uk",
        "RelatedURL": "http://www.wwl.nhs.uk",
        "DistanceUnit": 0
    },
    "Connections": [
        {
            "ID": 26074,
            "ConnectionTypeID": 25,
            "StatusTypeID": 50,
            "LevelID": 2,
            "Amps": 16,
            "PowerKW": 3,
            "CurrentTypeID": 10,
            "Quantity": 2
        }
    ],
    "NumberOfPoints": 2,
    "GeneralComments": "Operated by Greater Manchester EV Scheme. Parking and Charging for free",
    "StatusTypeID": 50,
    "DateLastStatusUpdate": "2020-09-08T10:35:00Z",
    "DataQualityLevel": 1,
    "DateCreated": "2014-06-11T23:05:00Z",
    "SubmissionStatusTypeID": 200
}