{
    "IsRecentlyVerified": false,
    "ID": 177827,
    "UUID": "B4637BF1-752C-4D61-A377-665FFF583D7D",
    "DataProviderID": 29,
    "DataProvidersReference": "17986",
    "OperatorID": 45,
    "AddressInfo": {
        "ID": 178186,
        "Title": "Lochfelbenstr. 27",
        "AddressLine1": "Lochfelbenstr. 27",
        "Town": "Günzburg",
        "Postcode": "89312",
        "CountryID": 87,
        "Latitude": 48.470105,
        "Longitude": 10.27686,
        "DistanceUnit": 0
    },
    "Connections": [
        {
            "ID": 277479,
            "ConnectionTypeID": 25,
            "StatusTypeID": 50,
            "LevelID": 2,
            "PowerKW": 22,
            "CurrentTypeID": 20
        },
        {
            "ID": 277480,
            "ConnectionTypeID": 25,
            "StatusTypeID": 50,
            "LevelID": 2,
            "PowerKW": 22,
            "CurrentTypeID": 20
        }
    ],
    "StatusTypeID": 0,
    "DateLastStatusUpdate": "2021-07-12T02:41:00Z",
    "MetadataValues": [
        {
            "ID": 10121,
            "MetadataFieldID": 4,
            "ItemValue": "Data from the German chargepoint registry provided by Bundesnetzagentur.de under the CC-BY 4.0 license"
        }
    ],
    "DataQualityLevel": 3,
    "DateCreated": "2021-07-08T09:49:00Z",
    "SubmissionStatusTypeID": 100
}