{
    "IsRecentlyVerified": false,
    "ID": 66405,
    "UUID": "39FA52D7-351C-40FE-8EB7-E4FA9FA4635E",
    "DataProviderID": 1,
    "OperatorID": 234,
    "UsageTypeID": 4,
    "AddressInfo": {
        "ID": 66751,
        "Title": "EBL Naturkost",
        "AddressLine1": "Am Grünen Weg 8",
        "Town": "Fürth",
        "StateOrProvince": "Fürth",
        "Postcode": "90766",
        "CountryID": 87,
        "Latitude": 49.483166863883156,
        "Longitude": 10.948309698811256,
        "AccessComments": "24/7 nutzbar mit Ladekarte E-Mobilität des Ladevebundes Franken+ der N-Ergie.",
        "RelatedURL": "http://www.ladeverbund-frankenplus.de/",
        "DistanceUnit": 0
    },
    "Connections": [
        {
            "ID": 91803,
            "ConnectionTypeID": 25,
            "StatusTypeID": 50,
            "LevelID": 2,
            "Amps": 32,
            "Voltage": 400,
            "PowerKW": 22,
            "CurrentTypeID": 20,
            "Quantity": 2
        }
    ],
    "NumberOfPoints": 2,
    "GeneralComments": "Zur Zeit (Mai 2016) Nutzung auch ohne Ladekarte möglich, da dort noch gebaut wird.",
    "StatusTypeID": 50,
    "DateLastStatusUpdate": "2016-05-20T06:13:00Z",
    "DataQualityLevel": 1,
    "DateCreated": "2016-05-20T06:13:00Z",
    "SubmissionStatusTypeID": 200
}