{
    "IsRecentlyVerified": false,
    "ID": 122829,
    "UUID": "99B06953-3D81-4686-B82B-787C1A1D12D5",
    "DataProviderID": 2,
    "DataProvidersReference": "82352",
    "UsageTypeID": 1,
    "AddressInfo": {
        "ID": 123175,
        "Title": "Santa Maria Chrysler Dodge Jeep RAM Fiat",
        "AddressLine1": "1918 S Broadway",
        "Town": "Santa Maria",
        "StateOrProvince": "CA",
        "Postcode": "93454",
        "CountryID": 2,
        "Latitude": 34.925674,
        "Longitude": -120.435187,
        "ContactTelephone1": "805-925-9545",
        "AccessComments": "7:30am-7pm daily",
        "RelatedURL": "",
        "DistanceUnit": 0
    },
    "Connections": [
        {
            "ID": 172752,
            "ConnectionTypeID": 1,
            "LevelID": 2,
            "Amps": 16,
            "Voltage": 230,
            "PowerKW": 3.7,
            "CurrentTypeID": 10,
            "Quantity": 1
        }
    ],
    "DateLastStatusUpdate": "2020-06-26T02:57:00Z",
    "DataQualityLevel": 3,
    "DateCreated": "2019-04-06T05:03:00Z",
    "SubmissionStatusTypeID": 100
}