{
    "IsRecentlyVerified": false,
    "ID": 113690,
    "UUID": "42E342AA-CE1B-4088-BB7C-987577D32E4D",
    "DataProviderID": 1,
    "OperatorID": 80,
    "UsageTypeID": 4,
    "AddressInfo": {
        "ID": 114036,
        "Title": "Trevignano Via Roma | EnelX",
        "AddressLine1": "Via Roma",
        "Town": "Trevignano Romano",
        "StateOrProvince": "RM",
        "Postcode": "00069",
        "CountryID": 112,
        "Latitude": 42.157730127352465,
        "Longitude": 12.240335860062332,
        "ContactTelephone1": "800.069.850",
        "RelatedURL": "https://www.enelx.com/it/it/emobility",
        "DistanceUnit": 0
    },
    "Connections": [
        {
            "ID": 160238,
            "ConnectionTypeID": 25,
            "StatusTypeID": 50,
            "LevelID": 2,
            "Amps": 32,
            "Voltage": 400,
            "PowerKW": 22,
            "CurrentTypeID": 20,
            "Quantity": 1
        },
        {
            "ID": 160239,
            "ConnectionTypeID": 36,
            "StatusTypeID": 50,
            "LevelID": 2,
            "Amps": 16,
            "Voltage": 240,
            "PowerKW": 3.7,
            "CurrentTypeID": 10,
            "Quantity": 1
        }
    ],
    "NumberOfPoints": 2,
    "StatusTypeID": 50,
    "DateLastStatusUpdate": "2018-12-30T16:01:00Z",
    "DataQualityLevel": 1,
    "DateCreated": "2018-12-30T16:01:00Z",
    "SubmissionStatusTypeID": 200
}