{
    "IsRecentlyVerified": false,
    "ID": 158472,
    "UUID": "96437B42-0391-4290-973F-C8B9570FD28E",
    "DataProviderID": 2,
    "DataProvidersReference": "156631",
    "OperatorID": 5,
    "UsageTypeID": 1,
    "AddressInfo": {
        "ID": 158829,
        "Title": "MORRISON CHAND",
        "AddressLine1": "348 W Chandler Blvd",
        "Town": "Chandler",
        "StateOrProvince": "AZ",
        "Postcode": "85225",
        "CountryID": 2,
        "Latitude": 33.306331,
        "Longitude": -111.846089,
        "ContactTelephone1": "888-758-4389",
        "AccessComments": "24 hours daily",
        "RelatedURL": "http://www.chargepoint.com/",
        "DistanceUnit": 0
    },
    "Connections": [
        {
            "ID": 228458,
            "ConnectionTypeID": 1,
            "LevelID": 2,
            "Amps": 16,
            "Voltage": 230,
            "PowerKW": 3.7,
            "CurrentTypeID": 10,
            "Quantity": 3
        }
    ],
    "StatusTypeID": 50,
    "DateLastStatusUpdate": "2020-06-26T02:55:00Z",
    "DataQualityLevel": 3,
    "DateCreated": "2020-06-26T02:55:00Z",
    "SubmissionStatusTypeID": 100
}