{
    "IsRecentlyVerified": false,
    "ID": 162778,
    "UUID": "F67CD2A4-EFE1-413C-9C69-82794E0B781D",
    "DataProviderID": 1,
    "OperatorID": 3406,
    "UsageTypeID": 1,
    "UsageCost": "25c/kWh + 25c/min",
    "AddressInfo": {
        "ID": 163135,
        "Title": "Derwent Bridge Rest Area",
        "AddressLine1": "Lyell Highway",
        "Town": "Derwent Bridge",
        "StateOrProvince": "Tasmania",
        "CountryID": 18,
        "Latitude": -42.135775,
        "Longitude": 146.229257,
        "DistanceUnit": 0
    },
    "Connections": [
        {
            "ID": 234298,
            "ConnectionTypeID": 33,
            "StatusTypeID": 50,
            "LevelID": 3,
            "PowerKW": 50,
            "CurrentTypeID": 30,
            "Quantity": 1
        },
        {
            "ID": 234299,
            "ConnectionTypeID": 2,
            "StatusTypeID": 50,
            "LevelID": 3,
            "PowerKW": 50,
            "CurrentTypeID": 30,
            "Quantity": 1
        },
        {
            "ID": 263303,
            "ConnectionTypeID": 25,
            "StatusTypeID": 50,
            "LevelID": 2,
            "PowerKW": 22,
            "CurrentTypeID": 20,
            "Quantity": 1
        }
    ],
    "NumberOfPoints": 1,
    "GeneralComments": "Electric Highway Tasmania location.  Supports credit card, EHT or Chargefox account. ",
    "StatusTypeID": 50,
    "DateLastStatusUpdate": "2021-01-24T02:20:00Z",
    "DataQualityLevel": 1,
    "DateCreated": "2020-08-16T09:54:00Z",
    "SubmissionStatusTypeID": 200
}