{
    "UserComments": [
        {
            "ID": 20644,
            "ChargePointID": 114829,
            "CommentTypeID": 10,
            "UserName": "ForumElettrico.it",
            "RelatedURL": "https://www.forumelettrico.it/forum/colonnina-enelx-22kw-tortona-al-frazione-rivalta-scrivia-in-piazza-g-elemento-t4327.html",
            "DateCreated": "2019-01-17T17:19:30.763Z",
            "User": {
                "ID": 11749,
                "Username": "ForumElettrico.it"
            },
            "CheckinStatusTypeID": 140
        }
    ],
    "MediaItems": [
        {
            "ID": 17456,
            "ChargePointID": 114829,
            "ItemURL": "https://s3-ap-southeast-2.amazonaws.com/openchargemap/images/IT/OCM114829/OCM-114829.orig.2019011717194360.jpg",
            "ItemThumbnailURL": "https://s3-ap-southeast-2.amazonaws.com/openchargemap/images/IT/OCM114829/OCM-114829.thmb.2019011717194360.jpg",
            "Comment": "",
            "IsEnabled": true,
            "IsVideo": false,
            "IsFeaturedItem": false,
            "IsExternalResource": false,
            "User": {
                "ID": 11749,
                "Username": "ForumElettrico.it"
            },
            "DateCreated": "2019-01-17T17:20:00Z"
        },
        {
            "ID": 17457,
            "ChargePointID": 114829,
            "ItemURL": "https://s3-ap-southeast-2.amazonaws.com/openchargemap/images/IT/OCM114829/OCM-114829.orig.2019011717195009.jpg",
            "ItemThumbnailURL": "https://s3-ap-southeast-2.amazonaws.com/openchargemap/images/IT/OCM114829/OCM-114829.thmb.2019011717195009.jpg",
            "Comment": "",
            "IsEnabled": true,
            "IsVideo": false,
            "IsFeaturedItem": false,
            "IsExternalResource": false,
            "User": {
                "ID": 11749,
                "Username": "ForumElettrico.it"
            },
            "DateCreated": "2019-01-17T17:20:00Z"
        },
        {
            "ID": 17458,
            "ChargePointID": 114829,
            "ItemURL": "https://s3-ap-southeast-2.amazonaws.com/openchargemap/images/IT/OCM114829/OCM-114829.orig.2019011717195615.jpg",
            "ItemThumbnailURL": "https://s3-ap-southeast-2.amazonaws.com/openchargemap/images/IT/OCM114829/OCM-114829.thmb.2019011717195615.jpg",
            "Comment": "",
            "IsEnabled": true,
            "IsVideo": false,
            "IsFeaturedItem": false,
            "IsExternalResource": false,
            "User": {
                "ID": 11749,
                "Username": "ForumElettrico.it"
            },
            "DateCreated": "2019-01-17T17:20:00Z"
        },
        {
            "ID": 17459,
            "ChargePointID": 114829,
            "ItemURL": "https://s3-ap-southeast-2.amazonaws.com/openchargemap/images/IT/OCM114829/OCM-114829.orig.2019011717200172.jpg",
            "ItemThumbnailURL": "https://s3-ap-southeast-2.amazonaws.com/openchargemap/images/IT/OCM114829/OCM-114829.thmb.2019011717200172.jpg",
            "Comment": "",
            "IsEnabled": true,
            "IsVideo": false,
            "IsFeaturedItem": false,
            "IsExternalResource": false,
            "User": {
                "ID": 11749,
                "Username": "ForumElettrico.it"
            },
            "DateCreated": "2019-01-17T17:20:00Z"
        },
        {
            "ID": 17460,
            "ChargePointID": 114829,
            "ItemURL": "https://s3-ap-southeast-2.amazonaws.com/openchargemap/images/IT/OCM114829/OCM-114829.orig.2019011717200861.jpg",
            "ItemThumbnailURL": "https://s3-ap-southeast-2.amazonaws.com/openchargemap/images/IT/OCM114829/OCM-114829.thmb.2019011717200861.jpg",
            "Comment": "",
            "IsEnabled": true,
            "IsVideo": false,
            "IsFeaturedItem": false,
            "IsExternalResource": false,
            "User": {
                "ID": 11749,
                "Username": "ForumElettrico.it"
            },
            "DateCreated": "2019-01-17T17:20:00Z"
        }
    ],
    "IsRecentlyVerified": false,
    "ID": 114829,
    "UUID": "BABEBF82-C971-4955-A72E-1C16E34EDC3C",
    "DataProviderID": 1,
    "OperatorID": 80,
    "UsageTypeID": 4,
    "AddressInfo": {
        "ID": 115175,
        "Title": "Rivalta Scivia Elemento | EnelX",
        "AddressLine1": "Strada Provinciale per Pozzolo Formigaro - Piazza G. Elemento",
        "AddressLine2": "Rivalta Scivia",
        "Town": "Tortona ",
        "StateOrProvince": "AL",
        "Postcode": "15057 ",
        "CountryID": 112,
        "Latitude": 44.8500824219324,
        "Longitude": 8.81639185448566,
        "ContactTelephone1": "800.069.850",
        "RelatedURL": "https://www.enelx.com/it/it/emobility",
        "DistanceUnit": 0
    },
    "Connections": [
        {
            "ID": 161594,
            "ConnectionTypeID": 25,
            "StatusTypeID": 50,
            "LevelID": 2,
            "Amps": 32,
            "Voltage": 400,
            "PowerKW": 22,
            "CurrentTypeID": 20,
            "Quantity": 2
        }
    ],
    "NumberOfPoints": 2,
    "StatusTypeID": 50,
    "DateLastStatusUpdate": "2019-01-20T11:24:00Z",
    "DataQualityLevel": 1,
    "DateCreated": "2019-01-16T16:39:00Z",
    "SubmissionStatusTypeID": 200
}