{
    "IsRecentlyVerified": false,
    "ID": 83516,
    "UUID": "D27D5AB6-E381-4970-8A5E-6CC4BC3CDEC9",
    "DataProviderID": 1,
    "OperatorID": 46,
    "UsageTypeID": 4,
    "AddressInfo": {
        "ID": 83862,
        "Title": "Hotel IBIS / Novotel Tiefgarage",
        "AddressLine1": "Arnulfstraße 57",
        "Town": "München",
        "Postcode": " 80335",
        "CountryID": 87,
        "Latitude": 48.14541744367056,
        "Longitude": 11.539185089024402,
        "AccessComments": "2 E.ON Ladestationen in der durchgehend geöffneten Tiefgarage, die beide Hotels nutzen.",
        "DistanceUnit": 0
    },
    "Connections": [
        {
            "ID": 118340,
            "ConnectionTypeID": 25,
            "StatusTypeID": 50,
            "LevelID": 2,
            "Amps": 32,
            "Voltage": 400,
            "PowerKW": 22,
            "CurrentTypeID": 20,
            "Quantity": 2
        },
        {
            "ID": 118341,
            "ConnectionTypeID": 28,
            "StatusTypeID": 50,
            "LevelID": 2,
            "Amps": 16,
            "Voltage": 230,
            "PowerKW": 3.7,
            "CurrentTypeID": 10,
            "Quantity": 2
        }
    ],
    "NumberOfPoints": 4,
    "StatusTypeID": 50,
    "DateLastStatusUpdate": "2017-02-09T14:13:00Z",
    "DataQualityLevel": 1,
    "DateCreated": "2017-02-09T14:13:00Z",
    "SubmissionStatusTypeID": 200
}