{
    "IsRecentlyVerified": false,
    "ID": 145325,
    "UUID": "75FF889C-D9C4-4FF1-804C-4F5F07454CC1",
    "DataProviderID": 2,
    "DataProvidersReference": "145121",
    "OperatorID": 90,
    "UsageTypeID": 1,
    "AddressInfo": {
        "ID": 145677,
        "Title": "Desjardins - Transcontinental-Portage",
        "AddressLine1": "1857 rue Principale",
        "Town": "Pohénégamook",
        "StateOrProvince": "QC",
        "Postcode": "G0L 1J0",
        "CountryID": 44,
        "Latitude": 47.48556,
        "Longitude": -69.279349,
        "ContactTelephone1": "877-505-2674",
        "AccessComments": "24 hours daily",
        "RelatedURL": "https://lecircuitelectrique.com/",
        "DistanceUnit": 0
    },
    "Connections": [
        {
            "ID": 201972,
            "ConnectionTypeID": 1,
            "LevelID": 2,
            "Amps": 16,
            "Voltage": 230,
            "PowerKW": 3.7,
            "CurrentTypeID": 10,
            "Quantity": 1
        }
    ],
    "StatusTypeID": 50,
    "DateLastStatusUpdate": "2020-06-26T03:10:00Z",
    "DataQualityLevel": 3,
    "DateCreated": "2019-12-24T09:24:00Z",
    "SubmissionStatusTypeID": 100
}