{
    "IsRecentlyVerified": false,
    "ID": 43053,
    "UUID": "1CC61D95-4FEA-413B-9136-CA8D4F22BD6F",
    "DataProviderID": 1,
    "OperatorID": 156,
    "OperatorsReference": "NewMotion 02009652",
    "UsageTypeID": 4,
    "AddressInfo": {
        "ID": 43399,
        "Title": "CSB Car Service",
        "AddressLine1": "Genslerstraße 69-72",
        "Town": "Berlin",
        "Postcode": "13055",
        "CountryID": 87,
        "Latitude": 52.5433616638184,
        "Longitude": 13.5008735656738,
        "ContactTelephone1": "088 0109500",
        "DistanceUnit": 0
    },
    "Connections": [
        {
            "ID": 52112,
            "ConnectionTypeID": 25,
            "StatusTypeID": 50,
            "LevelID": 2,
            "PowerKW": 3.7,
            "CurrentTypeID": 10,
            "Quantity": 1
        }
    ],
    "NumberOfPoints": 1,
    "StatusTypeID": 50,
    "DateLastStatusUpdate": "2016-01-18T09:12:00Z",
    "DataQualityLevel": 3,
    "DateCreated": "2015-03-25T02:49:00Z",
    "SubmissionStatusTypeID": 200
}