{
    "IsRecentlyVerified": false,
    "ID": 65606,
    "UUID": "2519F78F-E18F-483E-A03B-7A6FC6DD9ABC",
    "DataProviderID": 26,
    "DataProvidersReference": "85133",
    "OperatorID": 180,
    "OperatorsReference": "Alfen GDH3622",
    "UsageCost": "0.00 jaarabonnement",
    "AddressInfo": {
        "ID": 65952,
        "Title": "Valthestraat 1A",
        "AddressLine1": "Valthestraat 1A",
        "Town": "Den Haag",
        "Postcode": "2545 TA",
        "CountryID": 159,
        "Latitude": 52.045355,
        "Longitude": 4.27443,
        "ContactTelephone1": "036 - 549 34 00",
        "RelatedURL": "http://www.icu-charging-stations.com/",
        "DistanceUnit": 0
    },
    "Connections": [
        {
            "ID": 90515,
            "ConnectionTypeID": 25,
            "LevelID": 2,
            "PowerKW": 11,
            "CurrentTypeID": 10
        },
        {
            "ID": 90516,
            "ConnectionTypeID": 25,
            "LevelID": 2,
            "PowerKW": 11,
            "CurrentTypeID": 10
        }
    ],
    "NumberOfPoints": 1,
    "StatusTypeID": 50,
    "DateLastStatusUpdate": "2016-06-04T02:44:00Z",
    "DataQualityLevel": 3,
    "DateCreated": "2016-04-27T09:41:00Z",
    "SubmissionStatusTypeID": 100
}