{
    "IsRecentlyVerified": false,
    "ID": 143512,
    "UUID": "C1167304-CDBB-4719-9B59-905B7FF235AC",
    "DataProviderID": 2,
    "DataProvidersReference": "93201",
    "OperatorID": 15,
    "UsageTypeID": 4,
    "AddressInfo": {
        "ID": 143864,
        "Title": "Northshire Bookstore",
        "AddressLine1": "4869 Main St",
        "Town": "Manchester Center",
        "StateOrProvince": "VT",
        "Postcode": "05255",
        "CountryID": 2,
        "Latitude": 43.177776,
        "Longitude": -73.058053,
        "ContactTelephone1": "877-455-3833",
        "AccessComments": "24 hours daily\r\nPublic - Card key at all times",
        "RelatedURL": "https://www.evgo.com/",
        "DistanceUnit": 0
    },
    "Connections": [
        {
            "ID": 199846,
            "ConnectionTypeID": 2,
            "LevelID": 3,
            "Amps": 100,
            "Voltage": 400,
            "PowerKW": 40,
            "CurrentTypeID": 30,
            "Quantity": 1
        },
        {
            "ID": 199847,
            "ConnectionTypeID": 32,
            "LevelID": 3,
            "Amps": 100,
            "Voltage": 400,
            "PowerKW": 40,
            "CurrentTypeID": 30,
            "Quantity": 1
        }
    ],
    "StatusTypeID": 50,
    "DateLastStatusUpdate": "2020-06-26T03:06:00Z",
    "DataQualityLevel": 3,
    "DateCreated": "2019-12-24T09:21:00Z",
    "SubmissionStatusTypeID": 100
}