{
    "IsRecentlyVerified": false,
    "ID": 188354,
    "UUID": "5BC00395-E987-4B03-B749-E88094320FAF",
    "DataProviderID": 1,
    "OperatorID": 1,
    "UsageTypeID": 1,
    "UsageCost": "free",
    "AddressInfo": {
        "ID": 188713,
        "Title": "Innogy Tábor",
        "AddressLine1": "DATART",
        "AddressLine2": "Soběslavská 3073",
        "Town": "Tábor",
        "StateOrProvince": "Southwest",
        "Postcode": "39005",
        "CountryID": 64,
        "Latitude": 49.38851967064389,
        "Longitude": 14.693150335357245,
        "DistanceUnit": 0
    },
    "Connections": [
        {
            "ID": 304098,
            "ConnectionTypeID": 33,
            "StatusTypeID": 50,
            "LevelID": 3,
            "Amps": 400,
            "Voltage": 1000,
            "PowerKW": 400,
            "CurrentTypeID": 30,
            "Quantity": 1
        },
        {
            "ID": 304099,
            "ConnectionTypeID": 2,
            "StatusTypeID": 50,
            "LevelID": 3,
            "Amps": 125,
            "Voltage": 500,
            "PowerKW": 62.5,
            "CurrentTypeID": 30,
            "Quantity": 1
        },
        {
            "ID": 304100,
            "ConnectionTypeID": 25,
            "StatusTypeID": 50,
            "Quantity": 2
        }
    ],
    "NumberOfPoints": 1,
    "StatusTypeID": 50,
    "DateLastStatusUpdate": "2021-07-20T08:23:00Z",
    "DataQualityLevel": 1,
    "DateCreated": "2021-07-19T09:53:00Z",
    "SubmissionStatusTypeID": 200
}