{
    "IsRecentlyVerified": false,
    "ID": 71954,
    "UUID": "660FDBC9-F648-4A6C-A94A-ACFE587DAD12",
    "DataProviderID": 1,
    "UsageTypeID": 4,
    "AddressInfo": {
        "ID": 72300,
        "Title": "Greeneria",
        "AddressLine1": "Via Regina Margherita, 25",
        "Town": "Guarene",
        "StateOrProvince": "CN",
        "Postcode": "12050",
        "CountryID": 112,
        "Latitude": 44.73565268154322,
        "Longitude": 8.030098029955282,
        "ContactEmail": "info@greeneria.it",
        "RelatedURL": "http://www.greeneria.it/",
        "DistanceUnit": 0
    },
    "Connections": [
        {
            "ID": 103148,
            "ConnectionTypeID": 25,
            "StatusTypeID": 50,
            "LevelID": 2,
            "Amps": 32,
            "Voltage": 400,
            "PowerKW": 22,
            "CurrentTypeID": 20,
            "Quantity": 1
        }
    ],
    "NumberOfPoints": 1,
    "StatusTypeID": 50,
    "DateLastStatusUpdate": "2016-09-26T12:55:00Z",
    "DataQualityLevel": 1,
    "DateCreated": "2016-09-26T12:55:00Z",
    "SubmissionStatusTypeID": 200
}