{
    "MediaItems": [
        {
            "ID": 7739,
            "ChargePointID": 38188,
            "ItemURL": "https://s3-ap-southeast-2.amazonaws.com/openchargemap/images/NL/OCM38188/OCM-38188.orig.2016071013332486.jpg",
            "ItemThumbnailURL": "https://s3-ap-southeast-2.amazonaws.com/openchargemap/images/NL/OCM38188/OCM-38188.thmb.2016071013332486.jpg",
            "Comment": "",
            "IsEnabled": true,
            "IsVideo": false,
            "IsFeaturedItem": false,
            "IsExternalResource": false,
            "User": {
                "ID": 1606,
                "Username": "polianto"
            },
            "DateCreated": "2016-07-10T13:34:00Z"
        }
    ],
    "IsRecentlyVerified": false,
    "ID": 38188,
    "UUID": "8CE21865-9B49-4579-9653-651D4033884E",
    "DataProviderID": 26,
    "DataProvidersReference": "23407",
    "OperatorID": 157,
    "OperatorsReference": "NewMotion 02003580",
    "UsageCost": "0.00 jaarabonnement",
    "AddressInfo": {
        "ID": 38534,
        "Title": "Kraaienpad 1",
        "AddressLine1": "Kraaienpad 1",
        "Town": "Zaanstad",
        "Postcode": "1509 AX",
        "CountryID": 159,
        "Latitude": 52.4728736877441,
        "Longitude": 4.8207106590271,
        "ContactTelephone1": "088 0109500",
        "RelatedURL": "http://thenewmotion.nl/",
        "DistanceUnit": 0
    },
    "Connections": [
        {
            "ID": 41699,
            "ConnectionTypeID": 25,
            "LevelID": 2,
            "PowerKW": 3.7,
            "CurrentTypeID": 10
        }
    ],
    "NumberOfPoints": 1,
    "StatusTypeID": 50,
    "DateLastStatusUpdate": "2016-07-10T13:34:00Z",
    "DataQualityLevel": 3,
    "DateCreated": "2015-01-09T06:07:00Z",
    "SubmissionStatusTypeID": 100
}