{
    "IsRecentlyVerified": false,
    "ID": 97530,
    "UUID": "B1DA7E07-E95B-4DEA-978A-C7DDCC20BA01",
    "DataProviderID": 1,
    "OperatorID": 23,
    "OperatorsReference": "38783",
    "UsageTypeID": 4,
    "AddressInfo": {
        "ID": 97876,
        "Title": "Hotel Mercure Opole",
        "AddressLine1": "Ul. Krakowska 57-59",
        "Town": "Opole",
        "Postcode": "45-018",
        "CountryID": 179,
        "Latitude": 50.66349,
        "Longitude": 17.926058,
        "ContactTelephone1": "+48 7745 18100",
        "DistanceUnit": 0
    },
    "Connections": [
        {
            "ID": 138437,
            "ConnectionTypeID": 30,
            "StatusTypeID": 50,
            "LevelID": 2,
            "Amps": 32,
            "Voltage": 400,
            "PowerKW": 22,
            "CurrentTypeID": 20,
            "Quantity": 2
        }
    ],
    "NumberOfPoints": 2,
    "GeneralComments": "2 Tesla Connectors, up to 22kW.Available for customers. Please see front desk.",
    "StatusTypeID": 50,
    "DateLastStatusUpdate": "2018-10-03T15:26:00Z",
    "DataQualityLevel": 1,
    "DateCreated": "2018-01-21T15:40:00Z",
    "SubmissionStatusTypeID": 200
}