{
    "IsRecentlyVerified": false,
    "ID": 8485,
    "UUID": "A3B2A516-B403-4CDF-A784-BA2F92F490D9",
    "DataProviderID": 15,
    "DataProvidersReference": "9521",
    "OperatorID": 42,
    "AddressInfo": {
        "ID": 8382,
        "Title": "650 SW Montgomery Street",
        "AddressLine1": "650 SW Montgomery Street",
        "Town": "Portland",
        "StateOrProvince": "Oregon",
        "Postcode": "97201",
        "CountryID": 2,
        "Latitude": 45.51185,
        "Longitude": -122.68307,
        "ContactTelephone1": "",
        "RelatedURL": "http://carstations.com/9521",
        "DistanceUnit": 0
    },
    "Connections": [
        {
            "ID": 5910,
            "ConnectionTypeID": 2,
            "Reference": "CHADEMO",
            "LevelID": 3
        },
        {
            "ID": 6322,
            "ConnectionTypeID": 9,
            "Reference": "NEMA5",
            "LevelID": 1,
            "Quantity": 1
        },
        {
            "ID": 6747,
            "ConnectionTypeID": 1,
            "Reference": "J1772",
            "LevelID": 2,
            "Quantity": 1
        }
    ],
    "StatusTypeID": 50,
    "DateLastStatusUpdate": "2017-11-04T14:05:00Z",
    "DataQualityLevel": 1,
    "DateCreated": "2011-11-11T12:06:00Z",
    "SubmissionStatusTypeID": 100
}