{
    "IsRecentlyVerified": false,
    "ID": 53304,
    "UUID": "150EC08E-46B3-4F83-ABD7-C16E834ECA21",
    "DataProviderID": 2,
    "DataProvidersReference": "69198",
    "OperatorID": 5,
    "UsageTypeID": 1,
    "AddressInfo": {
        "ID": 53650,
        "Title": "PARK AND RIDE",
        "AddressLine1": "300 Crawford Way",
        "Town": "Amer Cyn",
        "StateOrProvince": "CA",
        "Postcode": "94503",
        "CountryID": 2,
        "Latitude": 38.1689084,
        "Longitude": -122.2558476,
        "ContactTelephone1": "888-758-4389",
        "AccessComments": "24 hours daily",
        "RelatedURL": "http://www.chargepoint.com/",
        "DistanceUnit": 0
    },
    "Connections": [
        {
            "ID": 66417,
            "ConnectionTypeID": 1,
            "LevelID": 2,
            "Amps": 16,
            "Voltage": 230,
            "PowerKW": 3,
            "CurrentTypeID": 10,
            "Quantity": 2
        }
    ],
    "DateLastStatusUpdate": "2019-04-06T04:02:00Z",
    "DataQualityLevel": 3,
    "DateCreated": "2015-09-20T11:18:00Z",
    "SubmissionStatusTypeID": 100
}