{
    "IsRecentlyVerified": false,
    "ID": 159340,
    "UUID": "F665B317-7A0A-410F-BCE9-A0DE264AB8D0",
    "DataProviderID": 2,
    "DataProvidersReference": "156632",
    "OperatorID": 5,
    "UsageTypeID": 1,
    "AddressInfo": {
        "ID": 159697,
        "Title": "SLTCHARGEPOINT",
        "AddressLine1": "3860 Lake Tahoe Blvd",
        "Town": "South Lake Tahoe",
        "StateOrProvince": "CA",
        "Postcode": "96150",
        "CountryID": 2,
        "Latitude": 38.9517701,
        "Longitude": -119.9496886,
        "ContactTelephone1": "888-758-4389",
        "AccessComments": "24 hours daily",
        "RelatedURL": "http://www.chargepoint.com/",
        "DistanceUnit": 0
    },
    "Connections": [
        {
            "ID": 229492,
            "ConnectionTypeID": 1,
            "LevelID": 2,
            "Amps": 16,
            "Voltage": 230,
            "PowerKW": 3.7,
            "CurrentTypeID": 10,
            "Quantity": 2
        }
    ],
    "StatusTypeID": 50,
    "DateLastStatusUpdate": "2020-06-26T03:00:00Z",
    "DataQualityLevel": 3,
    "DateCreated": "2020-06-26T03:00:00Z",
    "SubmissionStatusTypeID": 100
}