{
    "IsRecentlyVerified": false,
    "ID": 116060,
    "UUID": "15895C68-C816-4C61-9A8D-FA0F12DADBC1",
    "DataProviderID": 2,
    "DataProvidersReference": "116728",
    "OperatorID": 5,
    "UsageTypeID": 1,
    "AddressInfo": {
        "ID": 116406,
        "Title": "LACROSSE CAMPUS",
        "AddressLine1": "3111 Gundersen Dr",
        "Town": "Onalaska",
        "StateOrProvince": "WI",
        "Postcode": "54650",
        "CountryID": 2,
        "Latitude": 43.8741786,
        "Longitude": -91.1830744,
        "ContactTelephone1": "888-758-4389",
        "AccessComments": "24 hours daily",
        "RelatedURL": "http://www.chargepoint.com/",
        "DistanceUnit": 0
    },
    "Connections": [
        {
            "ID": 163120,
            "ConnectionTypeID": 1,
            "LevelID": 2,
            "Amps": 16,
            "Voltage": 230,
            "PowerKW": 3,
            "CurrentTypeID": 10,
            "Quantity": 1
        }
    ],
    "DateLastStatusUpdate": "2019-12-24T09:22:00Z",
    "DataQualityLevel": 3,
    "DateCreated": "2019-02-11T07:13:00Z",
    "SubmissionStatusTypeID": 100
}