{
    "IsRecentlyVerified": false,
    "ID": 8282,
    "UUID": "F09F4D6C-EC5C-4DF7-A226-E9BDC4792179",
    "DataProviderID": 15,
    "DataProvidersReference": "7120",
    "OperatorID": 26,
    "AddressInfo": {
        "ID": 8179,
        "Title": "1700 Siebarth Dr",
        "AddressLine1": "1700 Siebarth Dr",
        "Town": "Lake Charles",
        "StateOrProvince": "LA",
        "Postcode": "70615",
        "CountryID": 2,
        "Latitude": 30.21934,
        "Longitude": -93.1707,
        "ContactTelephone1": " (337) 439-9955",
        "RelatedURL": "http://carstations.com/7120",
        "DistanceUnit": 0
    },
    "Connections": [
        {
            "ID": 5711,
            "ConnectionTypeID": 1,
            "Reference": "J1772",
            "LevelID": 2
        }
    ],
    "StatusTypeID": 0,
    "DateLastStatusUpdate": "2017-11-04T14:03:00Z",
    "DataQualityLevel": 1,
    "DateCreated": "2011-11-11T12:06:00Z",
    "SubmissionStatusTypeID": 100
}