{
    "IsRecentlyVerified": false,
    "ID": 91048,
    "UUID": "CB5C3A42-17E6-4C25-9561-92597B38ECC0",
    "DataProviderID": 1,
    "OperatorID": 23,
    "OperatorsReference": "32310",
    "UsageTypeID": 6,
    "AddressInfo": {
        "ID": 91394,
        "Title": "Schloss Hotel Korb",
        "AddressLine1": "Hocheppaner Weg",
        "Town": "5",
        "StateOrProvince": "Missian - Eppan a.d.W.",
        "Postcode": "39057",
        "CountryID": 112,
        "Latitude": 46.482755,
        "Longitude": 11.24966,
        "ContactTelephone1": "+39 0471 636 000",
        "DistanceUnit": 0
    },
    "Connections": [
        {
            "ID": 129103,
            "ConnectionTypeID": 30,
            "StatusTypeID": 50,
            "LevelID": 2,
            "Amps": 32,
            "Voltage": 400,
            "PowerKW": 22,
            "CurrentTypeID": 20,
            "Quantity": 2
        }
    ],
    "NumberOfPoints": 2,
    "GeneralComments": "2 Tesla Connectors, up to 22kW.Available for patrons only. Please call ahead.Seasonal availability. Please call ahead.",
    "StatusTypeID": 50,
    "DateLastStatusUpdate": "2018-10-04T00:05:00Z",
    "DataQualityLevel": 1,
    "DateCreated": "2017-07-28T05:44:00Z",
    "SubmissionStatusTypeID": 200
}