{
    "IsRecentlyVerified": false,
    "ID": 48834,
    "UUID": "FD4D0900-95B3-482F-BD7C-B8AF5E631FBF",
    "DataProviderID": 1,
    "OperatorID": 20,
    "OperatorsReference": "21179,21180",
    "UsageTypeID": 4,
    "UsageCost": "£1.00/charge admin fee",
    "AddressInfo": {
        "ID": 49180,
        "Title": "Darlington College",
        "AddressLine1": "Vicarage Road",
        "Town": "Darlington",
        "StateOrProvince": "County Durham",
        "Postcode": "DL1 1DR",
        "CountryID": 1,
        "Latitude": 54.528896,
        "Longitude": -1.541578,
        "DistanceUnit": 0
    },
    "Connections": [
        {
            "ID": 60348,
            "ConnectionTypeID": 25,
            "StatusTypeID": 50,
            "LevelID": 2,
            "Amps": 32,
            "Voltage": 230,
            "PowerKW": 7,
            "CurrentTypeID": 10,
            "Quantity": 2
        }
    ],
    "NumberOfPoints": 4,
    "StatusTypeID": 50,
    "DateLastStatusUpdate": "2017-09-04T08:57:00Z",
    "DataQualityLevel": 1,
    "DateCreated": "2015-07-03T07:59:00Z",
    "SubmissionStatusTypeID": 200
}