{
    "IsRecentlyVerified": false,
    "ID": 56655,
    "UUID": "BFB7F3F7-E13D-4303-B259-DE30B7873544",
    "DataProviderID": 1,
    "OperatorID": 80,
    "UsageTypeID": 4,
    "UsageCost": "0,40 €/kW",
    "AddressInfo": {
        "ID": 57001,
        "Title": "Eneldrive Municipio di Pontedera",
        "AddressLine1": "Via Palestro",
        "Town": "Pontedera",
        "StateOrProvince": "PI",
        "Postcode": "56025",
        "CountryID": 112,
        "Latitude": 43.6635803673708,
        "Longitude": 10.634948297389201,
        "RelatedURL": "http://eneldrive.it",
        "DistanceUnit": 0
    },
    "Connections": [
        {
            "ID": 71429,
            "ConnectionTypeID": 25,
            "StatusTypeID": 50,
            "LevelID": 2,
            "Amps": 32,
            "Voltage": 400,
            "PowerKW": 22,
            "CurrentTypeID": 20,
            "Quantity": 1
        },
        {
            "ID": 71430,
            "ConnectionTypeID": 36,
            "StatusTypeID": 50,
            "LevelID": 2,
            "Amps": 16,
            "Voltage": 240,
            "PowerKW": 3.7,
            "CurrentTypeID": 10,
            "Quantity": 1
        }
    ],
    "NumberOfPoints": 1,
    "StatusTypeID": 50,
    "DateLastStatusUpdate": "2016-07-20T08:29:00Z",
    "DataQualityLevel": 1,
    "DateCreated": "2015-11-04T15:23:00Z",
    "SubmissionStatusTypeID": 200
}