{
    "IsRecentlyVerified": true,
    "DateLastVerified": "2021-10-03T14:09:00Z",
    "ID": 189481,
    "UUID": "AA692AA4-83D6-436E-AD7F-82510F24A364",
    "DataProviderID": 1,
    "OperatorID": 21,
    "UsageTypeID": 4,
    "UsageCost": "Mobi.E compatible card or App",
    "AddressInfo": {
        "ID": 189840,
        "Title": "OER-00081 - Mercado de Queijas",
        "AddressLine1": "Rua Gil Vicente",
        "Town": "Queijas",
        "StateOrProvince": "Lisboa",
        "Postcode": "2790-444",
        "CountryID": 180,
        "Latitude": 38.718946632916385,
        "Longitude": -9.262986138353966,
        "DistanceUnit": 0
    },
    "Connections": [
        {
            "ID": 306470,
            "ConnectionTypeID": 33,
            "StatusTypeID": 50,
            "LevelID": 3,
            "Amps": 350,
            "Voltage": 920,
            "PowerKW": 160,
            "CurrentTypeID": 30,
            "Quantity": 1
        },
        {
            "ID": 306471,
            "ConnectionTypeID": 2,
            "StatusTypeID": 50,
            "LevelID": 3,
            "Amps": 120,
            "Voltage": 500,
            "PowerKW": 50,
            "CurrentTypeID": 30,
            "Quantity": 1
        }
    ],
    "NumberOfPoints": 1,
    "StatusTypeID": 50,
    "DateLastStatusUpdate": "2021-10-03T14:09:00Z",
    "DataQualityLevel": 1,
    "DateCreated": "2021-10-03T14:09:00Z",
    "SubmissionStatusTypeID": 200
}