{
    "IsRecentlyVerified": false,
    "ID": 174599,
    "UUID": "CDF6BA5D-9031-4DAB-A5E7-6751F825BC1F",
    "DataProviderID": 1,
    "OperatorID": 3323,
    "UsageTypeID": 4,
    "AddressInfo": {
        "ID": 174958,
        "Title": "Zes Turgutreis D-Marin",
        "AddressLine1": " Gazi Mustafa Kemal Blv. No:24, 48960 ",
        "Town": "Bodrum ",
        "CountryID": 229,
        "Latitude": 37.005333688489415,
        "Longitude": 27.256688319888212,
        "ContactTelephone1": "+90 850 339 9937",
        "DistanceUnit": 0
    },
    "Connections": [
        {
            "ID": 270511,
            "ConnectionTypeID": 25,
            "StatusTypeID": 50,
            "LevelID": 2,
            "PowerKW": 22,
            "CurrentTypeID": 20,
            "Quantity": 2
        }
    ],
    "NumberOfPoints": 1,
    "StatusTypeID": 50,
    "DateLastStatusUpdate": "2021-04-07T22:12:00Z",
    "DataQualityLevel": 1,
    "DateCreated": "2021-04-07T20:48:00Z",
    "SubmissionStatusTypeID": 200
}