{
    "IsRecentlyVerified": false,
    "ID": 89723,
    "UUID": "6959C361-E084-40FF-92B8-2EDD14521AA5",
    "DataProviderID": 2,
    "DataProvidersReference": "82693",
    "OperatorID": 5,
    "UsageTypeID": 1,
    "AddressInfo": {
        "ID": 90069,
        "Title": "WHOLE FOODS MKT",
        "AddressLine1": "1224-1304 Market St",
        "Town": "Lynnfield",
        "StateOrProvince": "MA",
        "Postcode": "01940",
        "CountryID": 2,
        "Latitude": 42.5143673,
        "Longitude": -71.0314858,
        "ContactTelephone1": "888-758-4389",
        "AccessComments": "24 hours daily",
        "RelatedURL": "http://www.chargepoint.com/",
        "DistanceUnit": 0
    },
    "Connections": [
        {
            "ID": 127156,
            "ConnectionTypeID": 1,
            "LevelID": 2,
            "Amps": 16,
            "Voltage": 230,
            "PowerKW": 3,
            "CurrentTypeID": 10,
            "Quantity": 2
        }
    ],
    "DateLastStatusUpdate": "2019-12-24T09:20:00Z",
    "DataQualityLevel": 3,
    "DateCreated": "2017-06-22T08:16:00Z",
    "SubmissionStatusTypeID": 100
}