{
    "IsRecentlyVerified": false,
    "ID": 3457,
    "UUID": "53DF08FC-F165-4E4F-A334-11F8147A24B0",
    "DataProviderID": 1,
    "OperatorID": 1,
    "AddressInfo": {
        "ID": 3458,
        "Title": "Spinx",
        "AddressLine1": "1599 Highway 101 S",
        "Town": "Greer",
        "StateOrProvince": "SC",
        "Postcode": "29334",
        "CountryID": 2,
        "Latitude": 34.89489746,
        "Longitude": -82.16209412,
        "ContactTelephone1": "888-758-4389",
        "AccessComments": "Located at corner of building near restaurant drive thru",
        "DistanceUnit": 0
    },
    "Connections": [],
    "NumberOfPoints": 1,
    "GeneralComments": "Cost To Charge: ChargePoint Access Hours: 24 Hr",
    "DateLastStatusUpdate": "2019-12-15T06:07:00Z",
    "DateCreated": "2010-02-28T00:00:00Z",
    "SubmissionStatusTypeID": 200
}