{
    "IsRecentlyVerified": false,
    "ID": 91763,
    "UUID": "3759F01C-CC64-4FEA-B52D-268538E5E0EF",
    "DataProviderID": 1,
    "OperatorID": 3,
    "OperatorsReference": "PG-81260",
    "UsageTypeID": 6,
    "UsageCost": "Free",
    "AddressInfo": {
        "ID": 92109,
        "Title": "Canterbury Christ Church University",
        "AddressLine1": "North Holmes Road",
        "Town": "Kent",
        "Postcode": "CT1 1QU",
        "CountryID": 1,
        "Latitude": 51.284378,
        "Longitude": 1.049567,
        "DistanceUnit": 0
    },
    "Connections": [
        {
            "ID": 130092,
            "ConnectionTypeID": 25,
            "StatusTypeID": 50,
            "LevelID": 2,
            "Amps": 32,
            "Voltage": 230,
            "PowerKW": 7,
            "CurrentTypeID": 10,
            "Quantity": 2
        }
    ],
    "NumberOfPoints": 2,
    "GeneralComments": "This is an open charge unit installed at the Canterbury Christ Church University site in North Holmes Road, Canterbury, Kent",
    "StatusTypeID": 50,
    "DateLastStatusUpdate": "2017-11-22T12:50:00Z",
    "DataQualityLevel": 1,
    "DateCreated": "2017-08-17T05:18:00Z",
    "SubmissionStatusTypeID": 200
}