{
    "IsRecentlyVerified": false,
    "ID": 4653,
    "UUID": "8846D0ED-F745-4E0F-BEC5-40D377BD0EA5",
    "DataProviderID": 2,
    "DataProvidersReference": "39575",
    "UsageTypeID": 2,
    "AddressInfo": {
        "ID": 4598,
        "Title": "Virginia Commonwealth University (VCU) - N-Deck Parking Deck",
        "AddressLine1": "615 N 10th St",
        "Town": "Richmond",
        "StateOrProvince": "VA",
        "Postcode": "23298",
        "CountryID": 2,
        "Latitude": 37.543387,
        "Longitude": -77.42953,
        "ContactTelephone1": "804-828-2421",
        "AccessComments": "7am-2am daily; students, faculty, and staff may purchase parking permits through VCU",
        "RelatedURL": "",
        "DistanceUnit": 0
    },
    "Connections": [
        {
            "ID": 3035,
            "ConnectionTypeID": 1,
            "LevelID": 2,
            "Amps": 16,
            "Voltage": 230,
            "PowerKW": 3,
            "CurrentTypeID": 10,
            "Quantity": 2
        },
        {
            "ID": 20695,
            "ConnectionTypeID": 1,
            "LevelID": 2,
            "Quantity": 2
        }
    ],
    "DateLastConfirmed": "2011-05-31T00:00:00Z",
    "StatusTypeID": 0,
    "DateLastStatusUpdate": "2019-04-06T04:02:00Z",
    "DataQualityLevel": 1,
    "DateCreated": "2011-07-04T18:02:00Z",
    "SubmissionStatusTypeID": 100
}