{
    "IsRecentlyVerified": false,
    "ID": 96138,
    "UUID": "17757E97-87CF-4615-913E-947D2E18EA1D",
    "DataProviderID": 1,
    "OperatorID": 45,
    "UsageTypeID": 3,
    "AddressInfo": {
        "ID": 96484,
        "Title": "Ingenieurbüro Wenzel",
        "AddressLine1": "Am Köstorfer Busch 6",
        "Town": "Vastorf",
        "StateOrProvince": "Samtgemeinde Ostheide",
        "Postcode": "21397",
        "CountryID": 87,
        "Latitude": 53.20764519999999,
        "Longitude": 10.52895209999997,
        "ContactTelephone1": "+49 171 7713327",
        "ContactTelephone2": "+49 4137 80860",
        "AccessComments": "Laden möglich nach telefonischer Anmeldung.",
        "RelatedURL": "https://www.ingenieurbuero-wenzel.de",
        "DistanceUnit": 0
    },
    "Connections": [
        {
            "ID": 136221,
            "ConnectionTypeID": 25,
            "StatusTypeID": 50,
            "LevelID": 2,
            "Amps": 32,
            "Voltage": 400,
            "PowerKW": 22,
            "CurrentTypeID": 20,
            "Quantity": 1
        }
    ],
    "NumberOfPoints": 1,
    "StatusTypeID": 50,
    "DateLastStatusUpdate": "2017-12-11T15:30:00Z",
    "DataQualityLevel": 1,
    "DateCreated": "2017-12-11T15:30:00Z",
    "SubmissionStatusTypeID": 200
}