{
    "IsRecentlyVerified": false,
    "ID": 38595,
    "UUID": "48309395-B9F6-499F-9A4F-38C8DB6672D4",
    "DataProviderID": 26,
    "DataProvidersReference": "47921",
    "OperatorID": 178,
    "OperatorsReference": "EVnetNL DB0159",
    "UsageCost": "0.00 jaarabonnement",
    "AddressInfo": {
        "ID": 38941,
        "Title": "Herenstraat 30",
        "AddressLine1": "Herenstraat 30",
        "Town": "Hardenberg",
        "Postcode": "7776 AJ",
        "CountryID": 159,
        "Latitude": 52.626631,
        "Longitude": 6.555863,
        "ContactTelephone1": "0800-3522365",
        "RelatedURL": "http://www.evnet.nl",
        "DistanceUnit": 0
    },
    "Connections": [
        {
            "ID": 42106,
            "ConnectionTypeID": 25,
            "LevelID": 2,
            "PowerKW": 11,
            "CurrentTypeID": 10
        }
    ],
    "NumberOfPoints": 2,
    "StatusTypeID": 50,
    "DateLastStatusUpdate": "2016-06-04T02:55:00Z",
    "DataQualityLevel": 3,
    "DateCreated": "2015-01-09T06:08:00Z",
    "SubmissionStatusTypeID": 100
}