{
    "IsRecentlyVerified": false,
    "ID": 94088,
    "UUID": "4FE03DE3-B92D-4919-BAA2-9B59CC50FD0D",
    "DataProviderID": 1,
    "OperatorID": 23,
    "OperatorsReference": "34192",
    "UsageTypeID": 4,
    "UsageCost": "$0.20/min >=60kW; $0.10/min <60kW; other tariffs for older cars",
    "AddressInfo": {
        "ID": 94434,
        "Title": "Oacoma, SD Supercharger",
        "AddressLine1": "1000 E Dakota Highway 16",
        "Town": "Chamberlain",
        "StateOrProvince": "SD",
        "Postcode": "57365-0000",
        "CountryID": 2,
        "Latitude": 43.803197,
        "Longitude": -99.383371,
        "DistanceUnit": 0
    },
    "Connections": [
        {
            "ID": 133170,
            "ConnectionTypeID": 27,
            "StatusTypeID": 50,
            "LevelID": 3,
            "PowerKW": 120,
            "CurrentTypeID": 30,
            "Quantity": 8
        }
    ],
    "NumberOfPoints": 8,
    "GeneralComments": "Charging8 Superchargers, available 24/7, up to 120kW",
    "StatusTypeID": 50,
    "DateLastStatusUpdate": "2018-03-13T13:15:00Z",
    "DataQualityLevel": 1,
    "DateCreated": "2017-10-17T05:35:00Z",
    "SubmissionStatusTypeID": 200
}