{
    "IsRecentlyVerified": false,
    "ID": 170104,
    "UUID": "8ED83888-B03B-438A-A5FE-89B462416D37",
    "DataProviderID": 1,
    "OperatorID": 86,
    "UsageTypeID": 4,
    "AddressInfo": {
        "ID": 170463,
        "Title": "Raststätte Harz West",
        "AddressLine1": "A7 Richtung Süd",
        "Town": "Seesen",
        "StateOrProvince": "Landkreis Goslar",
        "Postcode": "38723",
        "CountryID": 87,
        "Latitude": 51.92799469241149,
        "Longitude": 10.141883656878917,
        "AccessComments": "24/7 verfügbare Ladesäulen von EnBW und Ionity auf dem Parkplatz.",
        "DistanceUnit": 0
    },
    "Connections": [
        {
            "ID": 259323,
            "ConnectionTypeID": 2,
            "StatusTypeID": 50,
            "LevelID": 3,
            "PowerKW": 60,
            "CurrentTypeID": 30,
            "Quantity": 1
        },
        {
            "ID": 259324,
            "ConnectionTypeID": 33,
            "StatusTypeID": 50,
            "LevelID": 3,
            "PowerKW": 300,
            "CurrentTypeID": 30,
            "Quantity": 1
        },
        {
            "ID": 259325,
            "ConnectionTypeID": 1036,
            "StatusTypeID": 50,
            "LevelID": 3,
            "Amps": 63,
            "Voltage": 400,
            "PowerKW": 43,
            "CurrentTypeID": 20,
            "Quantity": 1
        }
    ],
    "NumberOfPoints": 3,
    "StatusTypeID": 50,
    "DateLastStatusUpdate": "2020-11-18T13:40:00Z",
    "DataQualityLevel": 1,
    "DateCreated": "2020-11-18T13:40:00Z",
    "SubmissionStatusTypeID": 200
}