{
    "IsRecentlyVerified": false,
    "ID": 165533,
    "UUID": "4DD5C33D-411C-4814-A6A3-C19A684A3E89",
    "DataProviderID": 28,
    "DataProvidersReference": "FR*A16*P*WIIZ*97*_*_*_",
    "UsageTypeID": 5,
    "AddressInfo": {
        "ID": 165892,
        "Title": "Villeneuve Loubet  Parking Gare",
        "AddressLine1": "RN7",
        "CountryID": 80,
        "Latitude": 43.628931,
        "Longitude": 7.133592,
        "AccessComments": "24h/24",
        "DistanceUnit": 0
    },
    "Connections": [
        {
            "ID": 239948,
            "ConnectionTypeID": 28,
            "StatusTypeID": 50,
            "LevelID": 2,
            "PowerKW": 22,
            "CurrentTypeID": 10
        },
        {
            "ID": 239949,
            "ConnectionTypeID": 1036,
            "StatusTypeID": 50,
            "LevelID": 2,
            "PowerKW": 22,
            "CurrentTypeID": 20
        },
        {
            "ID": 239950,
            "ConnectionTypeID": 28,
            "StatusTypeID": 50,
            "LevelID": 2,
            "PowerKW": 22,
            "CurrentTypeID": 10
        },
        {
            "ID": 239951,
            "ConnectionTypeID": 1036,
            "StatusTypeID": 50,
            "LevelID": 2,
            "PowerKW": 22,
            "CurrentTypeID": 20
        }
    ],
    "GeneralComments": "badge, appli et QR code",
    "StatusTypeID": 50,
    "DateLastStatusUpdate": "2020-08-27T05:10:00Z",
    "DataQualityLevel": 2,
    "DateCreated": "2020-08-27T05:10:00Z",
    "SubmissionStatusTypeID": 100
}