{
    "IsRecentlyVerified": false,
    "ID": 100318,
    "UUID": "6932FF1F-6E82-4EC2-85CE-D378B7EDB868",
    "DataProviderID": 1,
    "OperatorID": 32,
    "OperatorsReference": "24121",
    "UsageTypeID": 4,
    "UsageCost": "£0.108/kWh; for Polar Plus subscription members only",
    "AddressInfo": {
        "ID": 100664,
        "Title": "Holiday Inn Express London-Newbury Park Eastern Avenue 713",
        "AddressLine1": "Royal Crescent",
        "AddressLine2": "Newbury Park",
        "Town": "London",
        "Postcode": "IG2 7RH",
        "CountryID": 1,
        "Latitude": 51.57473,
        "Longitude": 0.085759,
        "DistanceUnit": 0
    },
    "Connections": [
        {
            "ID": 141717,
            "ConnectionTypeID": 33,
            "StatusTypeID": 50,
            "LevelID": 3,
            "PowerKW": 50,
            "CurrentTypeID": 30,
            "Quantity": 1
        },
        {
            "ID": 141718,
            "ConnectionTypeID": 2,
            "StatusTypeID": 50,
            "LevelID": 3,
            "PowerKW": 50,
            "CurrentTypeID": 30,
            "Quantity": 1
        },
        {
            "ID": 141719,
            "ConnectionTypeID": 1036,
            "StatusTypeID": 50,
            "LevelID": 3,
            "PowerKW": 43,
            "CurrentTypeID": 20,
            "Quantity": 1
        }
    ],
    "NumberOfPoints": 1,
    "StatusTypeID": 50,
    "DateLastStatusUpdate": "2019-06-24T05:14:00Z",
    "DataQualityLevel": 1,
    "DateCreated": "2018-02-22T06:15:00Z",
    "SubmissionStatusTypeID": 200
}