{
    "UserComments": [
        {
            "ID": 14712,
            "ChargePointID": 72447,
            "CommentTypeID": 10,
            "UserName": "El_Christo",
            "Comment": "Easy access, easy to use and no charge!",
            "Rating": 5,
            "DateCreated": "2016-12-18T15:33:29.133Z",
            "User": {
                "ID": 12126,
                "Username": "El_Christo"
            },
            "CheckinStatusTypeID": 10
        }
    ],
    "MediaItems": [
        {
            "ID": 8833,
            "ChargePointID": 72447,
            "ItemURL": "https://s3-ap-southeast-2.amazonaws.com/openchargemap/images/DE/OCM72447/OCM-72447.orig.2016121815320102.jpg",
            "ItemThumbnailURL": "https://s3-ap-southeast-2.amazonaws.com/openchargemap/images/DE/OCM72447/OCM-72447.thmb.2016121815320102.jpg",
            "Comment": "Worked perfectly! ",
            "IsEnabled": true,
            "IsVideo": false,
            "IsFeaturedItem": false,
            "IsExternalResource": false,
            "User": {
                "ID": 12126,
                "Username": "El_Christo"
            },
            "DateCreated": "2016-12-18T15:32:00Z"
        },
        {
            "ID": 8432,
            "ChargePointID": 72447,
            "ItemURL": "https://s3-ap-southeast-2.amazonaws.com/openchargemap/images/DE/OCM72447/OCM-72447.orig.2016101613121239.jpg",
            "ItemThumbnailURL": "https://s3-ap-southeast-2.amazonaws.com/openchargemap/images/DE/OCM72447/OCM-72447.thmb.2016101613121239.jpg",
            "Comment": "",
            "IsEnabled": true,
            "IsVideo": false,
            "IsFeaturedItem": false,
            "IsExternalResource": false,
            "User": {
                "ID": 11931,
                "Username": "Easygoing"
            },
            "DateCreated": "2016-10-16T13:12:00Z"
        }
    ],
    "IsRecentlyVerified": false,
    "ID": 72447,
    "UUID": "9705E358-9254-4DE1-9BCF-F8508EC9CBE4",
    "DataProviderID": 1,
    "OperatorID": 105,
    "UsageTypeID": 1,
    "UsageCost": "Free",
    "AddressInfo": {
        "ID": 72793,
        "Title": "LEW Autostrom",
        "AddressLine1": "Brahmsstraße",
        "Town": "Gersthofen",
        "StateOrProvince": "Bayern",
        "Postcode": "86368",
        "CountryID": 87,
        "Latitude": 48.4231813,
        "Longitude": 10.875052,
        "DistanceUnit": 0
    },
    "Connections": [
        {
            "ID": 103822,
            "ConnectionTypeID": 2,
            "StatusTypeID": 0,
            "LevelID": 3,
            "PowerKW": 50,
            "CurrentTypeID": 30,
            "Quantity": 1
        },
        {
            "ID": 103823,
            "ConnectionTypeID": 33,
            "StatusTypeID": 0,
            "LevelID": 3,
            "CurrentTypeID": 30,
            "Quantity": 1
        },
        {
            "ID": 103824,
            "ConnectionTypeID": 25,
            "StatusTypeID": 0
        }
    ],
    "NumberOfPoints": 1,
    "StatusTypeID": 50,
    "DateLastStatusUpdate": "2016-12-23T11:30:00Z",
    "DataQualityLevel": 1,
    "DateCreated": "2016-10-15T10:30:00Z",
    "SubmissionStatusTypeID": 200
}