{
    "IsRecentlyVerified": false,
    "ID": 68612,
    "UUID": "4D477429-40AC-4871-9C9E-F24CD375E618",
    "DataProviderID": 1,
    "OperatorID": 2242,
    "UsageTypeID": 4,
    "AddressInfo": {
        "ID": 68958,
        "Title": "Stadtzentrum",
        "AddressLine1": "Hans-Gutmann-Straße 7",
        "Town": "Gersfeld (Rhön)",
        "Postcode": "36129",
        "CountryID": 87,
        "Latitude": 50.4499589,
        "Longitude": 9.919395099999974,
        "ContactTelephone1": "+49 661 12-100",
        "AccessComments": "Rund um die Uhr (24/7) nutzbar. Position: nahe dem Radsporthaus Rhön. Umgebung:Innenstadt Fussgängerzone, Barockes Schloß Gersfeld - Stellplätze nicht für Elektrofahrzeuge gekennzeichnet, daher Zuparkgefahr - parken max. 1h mit Parkscheibe\r\n",
        "RelatedURL": "http://www.re-fd.de/",
        "DistanceUnit": 0
    },
    "Connections": [
        {
            "ID": 96193,
            "ConnectionTypeID": 28,
            "StatusTypeID": 50,
            "LevelID": 2,
            "Voltage": 230,
            "PowerKW": 3.7,
            "CurrentTypeID": 10,
            "Quantity": 2
        },
        {
            "ID": 96194,
            "ConnectionTypeID": 25,
            "StatusTypeID": 50,
            "LevelID": 2,
            "PowerKW": 22,
            "CurrentTypeID": 20,
            "Quantity": 2
        },
        {
            "ID": 96195,
            "ConnectionTypeID": 16,
            "StatusTypeID": 50,
            "LevelID": 2,
            "Amps": 16,
            "Voltage": 230,
            "PowerKW": 3.7,
            "CurrentTypeID": 10,
            "Quantity": 0
        }
    ],
    "NumberOfPoints": 4,
    "GeneralComments": "\r\n",
    "StatusTypeID": 50,
    "DateLastStatusUpdate": "2016-06-12T17:39:00Z",
    "DataQualityLevel": 1,
    "DateCreated": "2016-06-12T17:39:00Z",
    "SubmissionStatusTypeID": 200
}