{
    "IsRecentlyVerified": false,
    "ID": 185384,
    "UUID": "20853C09-64E0-4C02-A639-33A3D6F3741E",
    "DataProviderID": 29,
    "DataProvidersReference": "4379",
    "AddressInfo": {
        "ID": 185743,
        "Title": "Am Bahnhof",
        "AddressLine1": "Am Bahnhof",
        "Town": "Ludwigsfelde",
        "Postcode": "14974",
        "CountryID": 87,
        "Latitude": 52.29896,
        "Longitude": 13.2667,
        "DistanceUnit": 0
    },
    "Connections": [
        {
            "ID": 294823,
            "ConnectionTypeID": 28,
            "StatusTypeID": 50,
            "LevelID": 2,
            "PowerKW": 11,
            "CurrentTypeID": 20
        },
        {
            "ID": 294824,
            "ConnectionTypeID": 25,
            "StatusTypeID": 50,
            "LevelID": 2,
            "PowerKW": 11,
            "CurrentTypeID": 20
        },
        {
            "ID": 300377,
            "ConnectionTypeID": 28,
            "StatusTypeID": 50,
            "LevelID": 2,
            "PowerKW": 11,
            "CurrentTypeID": 20
        },
        {
            "ID": 300378,
            "ConnectionTypeID": 25,
            "StatusTypeID": 50,
            "LevelID": 2,
            "PowerKW": 11,
            "CurrentTypeID": 20
        }
    ],
    "StatusTypeID": 50,
    "DateLastStatusUpdate": "2021-07-12T02:49:00Z",
    "MetadataValues": [
        {
            "ID": 17675,
            "MetadataFieldID": 4,
            "ItemValue": "Data from the German chargepoint registry provided by Bundesnetzagentur.de under the CC-BY 4.0 license"
        }
    ],
    "DataQualityLevel": 3,
    "DateCreated": "2021-07-08T10:06:00Z",
    "SubmissionStatusTypeID": 100
}