{
    "IsRecentlyVerified": false,
    "ID": 177493,
    "UUID": "6546DED7-F600-48A7-AA50-A7BA0F2D7676",
    "DataProviderID": 29,
    "DataProvidersReference": "18225",
    "AddressInfo": {
        "ID": 177852,
        "Title": "Mohnstraße 0A",
        "AddressLine1": "Mohnstraße 0A",
        "Town": "Dresden",
        "Postcode": "01127",
        "CountryID": 87,
        "Latitude": 51.077799,
        "Longitude": 13.717125,
        "DistanceUnit": 0
    },
    "Connections": [
        {
            "ID": 276687,
            "ConnectionTypeID": 33,
            "StatusTypeID": 50,
            "LevelID": 3,
            "PowerKW": 150,
            "CurrentTypeID": 30
        },
        {
            "ID": 276688,
            "ConnectionTypeID": 2,
            "StatusTypeID": 50,
            "LevelID": 3,
            "PowerKW": 150,
            "CurrentTypeID": 30
        },
        {
            "ID": 298686,
            "ConnectionTypeID": 25,
            "StatusTypeID": 50,
            "LevelID": 2,
            "PowerKW": 22,
            "CurrentTypeID": 20
        }
    ],
    "StatusTypeID": 0,
    "DateLastStatusUpdate": "2021-07-12T02:46:00Z",
    "MetadataValues": [
        {
            "ID": 9787,
            "MetadataFieldID": 4,
            "ItemValue": "Data from the German chargepoint registry provided by Bundesnetzagentur.de under the CC-BY 4.0 license"
        }
    ],
    "DataQualityLevel": 3,
    "DateCreated": "2021-07-08T09:49:00Z",
    "SubmissionStatusTypeID": 100
}