{
    "IsRecentlyVerified": false,
    "ID": 132381,
    "UUID": "D7962D01-FB55-4E95-9214-8F6FDFD18CF1",
    "DataProviderID": 1,
    "OperatorID": 74,
    "UsageTypeID": 1,
    "AddressInfo": {
        "ID": 132727,
        "Title": "Fastned Hoezaar",
        "AddressLine1": "Hoezaar A58",
        "Town": "Rucphen",
        "Postcode": "4735 TX",
        "CountryID": 159,
        "Latitude": 51.54878251803402,
        "Longitude": 4.529013372128929,
        "AccessComments": "24/7",
        "RelatedURL": "http://fastned.nl/",
        "DistanceUnit": 0
    },
    "Connections": [
        {
            "ID": 185319,
            "ConnectionTypeID": 33,
            "StatusTypeID": 50,
            "LevelID": 3,
            "PowerKW": 175,
            "CurrentTypeID": 30,
            "Quantity": 2
        },
        {
            "ID": 185320,
            "ConnectionTypeID": 33,
            "StatusTypeID": 50,
            "LevelID": 3,
            "Amps": 125,
            "Voltage": 400,
            "PowerKW": 50,
            "CurrentTypeID": 30,
            "Quantity": 1
        },
        {
            "ID": 185321,
            "ConnectionTypeID": 2,
            "StatusTypeID": 50,
            "LevelID": 3,
            "PowerKW": 50,
            "CurrentTypeID": 30,
            "Quantity": 1
        },
        {
            "ID": 185322,
            "ConnectionTypeID": 1036,
            "StatusTypeID": 50,
            "LevelID": 3,
            "Amps": 63,
            "Voltage": 400,
            "PowerKW": 43,
            "CurrentTypeID": 20,
            "Quantity": 1
        }
    ],
    "NumberOfPoints": 4,
    "StatusTypeID": 50,
    "DateLastStatusUpdate": "2019-09-28T10:09:00Z",
    "DataQualityLevel": 1,
    "DateCreated": "2019-09-28T10:09:00Z",
    "SubmissionStatusTypeID": 200
}