{
    "IsRecentlyVerified": false,
    "ID": 63064,
    "UUID": "5A02F958-7C58-4C73-B613-82DD57F04FFC",
    "DataProviderID": 26,
    "DataProvidersReference": "72153",
    "OperatorID": 103,
    "OperatorsReference": "Allego NLALLEGO0003742",
    "UsageCost": "0.00 jaarabonnement",
    "AddressInfo": {
        "ID": 63410,
        "Title": "Slangenburg 291",
        "AddressLine1": "Slangenburg 291",
        "Town": "Dordrecht",
        "Postcode": "3328 DZ",
        "CountryID": 159,
        "Latitude": 51.774049,
        "Longitude": 4.676201,
        "ContactTelephone1": "0800-3745337",
        "RelatedURL": "http://www.allego.eu/",
        "DistanceUnit": 0
    },
    "Connections": [
        {
            "ID": 80183,
            "ConnectionTypeID": 25,
            "LevelID": 2,
            "PowerKW": 11,
            "CurrentTypeID": 10
        },
        {
            "ID": 80184,
            "ConnectionTypeID": 25,
            "LevelID": 2,
            "PowerKW": 11,
            "CurrentTypeID": 10
        }
    ],
    "NumberOfPoints": 1,
    "StatusTypeID": 50,
    "DateLastStatusUpdate": "2016-06-04T02:40:00Z",
    "DataQualityLevel": 3,
    "DateCreated": "2016-03-03T12:29:00Z",
    "SubmissionStatusTypeID": 100
}