{
    "IsRecentlyVerified": false,
    "ID": 172744,
    "UUID": "684A64C0-6E99-4B42-85C4-5AFADE1F0D25",
    "DataProviderID": 1,
    "OperatorID": 213,
    "UsageTypeID": 4,
    "AddressInfo": {
        "ID": 173103,
        "Title": "CooriDoor Intermarché Pfastatt",
        "AddressLine1": "Rue de Dornach",
        "Town": "Pfastatt",
        "StateOrProvince": "Alsace–Champagne-Ardenne–Lorraine",
        "Postcode": "68120",
        "CountryID": 80,
        "Latitude": 47.759298596039145,
        "Longitude": 7.29361593923079,
        "DistanceUnit": 0
    },
    "Connections": [
        {
            "ID": 264189,
            "ConnectionTypeID": 33,
            "StatusTypeID": 50,
            "LevelID": 3,
            "Amps": 125,
            "Voltage": 400,
            "PowerKW": 50,
            "CurrentTypeID": 30,
            "Quantity": 1
        },
        {
            "ID": 264190,
            "ConnectionTypeID": 2,
            "StatusTypeID": 50,
            "LevelID": 3,
            "Amps": 125,
            "Voltage": 396,
            "PowerKW": 50,
            "CurrentTypeID": 30,
            "Quantity": 1
        },
        {
            "ID": 264191,
            "ConnectionTypeID": 1036,
            "StatusTypeID": 50,
            "LevelID": 3,
            "Amps": 63,
            "Voltage": 400,
            "PowerKW": 43,
            "CurrentTypeID": 20,
            "Quantity": 1
        }
    ],
    "NumberOfPoints": 1,
    "StatusTypeID": 50,
    "DateLastStatusUpdate": "2021-02-15T17:19:00Z",
    "DataQualityLevel": 1,
    "DateCreated": "2021-02-15T14:23:00Z",
    "SubmissionStatusTypeID": 200
}