{
    "IsRecentlyVerified": false,
    "ID": 90549,
    "UUID": "CBA4B737-167B-4E0C-B2DC-CE990AC3EA6B",
    "DataProviderID": 1,
    "OperatorID": 45,
    "UsageTypeID": 6,
    "AddressInfo": {
        "ID": 90895,
        "Title": "Ringhotel Celler Tor (mit E-Bike Station)",
        "AddressLine1": "Scheuener Straße",
        "Town": "Celle",
        "StateOrProvince": "Landkreis Celle",
        "Postcode": "29229",
        "CountryID": 87,
        "Latitude": 52.6547892660083,
        "Longitude": 10.0638191972755,
        "ContactTelephone1": "+49 5141 590-0",
        "AccessComments": "In der Tiefgarage auf Platz 18. Laden kostenlos für Hotelgäste, die einen kostenpflichtigen Tiefgaragenplatz reserviert haben. Rechts von der Tiefgarageneinfahrt sind zwei weitere Schukodosen.",
        "RelatedURL": "http://www.celler-tor.de/",
        "DistanceUnit": 0
    },
    "Connections": [
        {
            "ID": 128236,
            "ConnectionTypeID": 28,
            "StatusTypeID": 50,
            "LevelID": 2,
            "Amps": 16,
            "Voltage": 230,
            "PowerKW": 3.7,
            "CurrentTypeID": 10,
            "Quantity": 3
        }
    ],
    "NumberOfPoints": 3,
    "StatusTypeID": 50,
    "DateLastStatusUpdate": "2018-07-19T07:09:00Z",
    "DataQualityLevel": 1,
    "DateCreated": "2017-07-17T12:11:00Z",
    "SubmissionStatusTypeID": 200
}