{
    "IsRecentlyVerified": false,
    "ID": 48630,
    "UUID": "6EDC4E13-2771-4BA7-B4B1-26266593180D",
    "DataProviderID": 1,
    "OperatorID": 93,
    "OperatorsReference": "SC147",
    "UsageTypeID": 4,
    "UsageCost": "Free",
    "AddressInfo": {
        "ID": 48976,
        "Title": "Mossley West Park and Ride",
        "AddressLine1": "The Glade",
        "Town": "Newtownabbey",
        "Postcode": "BT36 5NN",
        "CountryID": 1,
        "Latitude": 54.696594,
        "Longitude": -5.951624,
        "RelatedURL": "http://pod-point.com/",
        "DistanceUnit": 0
    },
    "Connections": [
        {
            "ID": 60085,
            "ConnectionTypeID": 25,
            "StatusTypeID": 50,
            "LevelID": 2,
            "Amps": 32,
            "Voltage": 400,
            "PowerKW": 22,
            "CurrentTypeID": 20,
            "Quantity": 2
        }
    ],
    "NumberOfPoints": 2,
    "StatusTypeID": 50,
    "DateLastStatusUpdate": "2016-08-31T05:48:00Z",
    "MetadataValues": [
        {
            "ID": 1637,
            "MetadataFieldID": 4,
            "ItemValue": "Contains public sector information licensed under the Open Government Licence v2.0. http://www.nationalarchives.gov.uk/doc/open-government-licence/version/2/"
        }
    ],
    "DataQualityLevel": 3,
    "DateCreated": "2015-06-27T07:22:00Z",
    "SubmissionStatusTypeID": 100
}