{
    "UserComments": [
        {
            "ID": 3466,
            "ChargePointID": 23088,
            "CommentTypeID": 10,
            "UserName": "filip.vanrickstal",
            "Comment": "Successfully charged my Renault Zoe @22kW on 22/11/2014.\nNo identification needed: Plug and charge!",
            "Rating": 5,
            "DateCreated": "2014-12-21T14:29:42.72Z",
            "User": {
                "ID": 1761,
                "Username": "filip.vanrickstal"
            },
            "CheckinStatusTypeID": 10
        }
    ],
    "MediaItems": [
        {
            "ID": 721,
            "ChargePointID": 23088,
            "ItemURL": "https://s3-ap-southeast-2.amazonaws.com/openchargemap/images/BE/OCM23088/OCM-23088.orig.2014112320343183.jpg",
            "ItemThumbnailURL": "https://s3-ap-southeast-2.amazonaws.com/openchargemap/images/BE/OCM23088/OCM-23088.thmb.2014112320343183.jpg",
            "Comment": "",
            "IsEnabled": true,
            "IsVideo": false,
            "IsFeaturedItem": false,
            "IsExternalResource": false,
            "User": {
                "ID": 1761,
                "Username": "filip.vanrickstal"
            },
            "DateCreated": "2014-11-23T20:35:00Z"
        },
        {
            "ID": 722,
            "ChargePointID": 23088,
            "ItemURL": "https://s3-ap-southeast-2.amazonaws.com/openchargemap/images/BE/OCM23088/OCM-23088.orig.2014112320345355.jpg",
            "ItemThumbnailURL": "https://s3-ap-southeast-2.amazonaws.com/openchargemap/images/BE/OCM23088/OCM-23088.thmb.2014112320345355.jpg",
            "Comment": "",
            "IsEnabled": true,
            "IsVideo": false,
            "IsFeaturedItem": false,
            "IsExternalResource": false,
            "User": {
                "ID": 1761,
                "Username": "filip.vanrickstal"
            },
            "DateCreated": "2014-11-23T20:35:00Z"
        },
        {
            "ID": 720,
            "ChargePointID": 23088,
            "ItemURL": "https://s3-ap-southeast-2.amazonaws.com/openchargemap/images/BE/OCM23088/OCM-23088.orig.2014112320340473.jpg",
            "ItemThumbnailURL": "https://s3-ap-southeast-2.amazonaws.com/openchargemap/images/BE/OCM23088/OCM-23088.thmb.2014112320340473.jpg",
            "Comment": "",
            "IsEnabled": true,
            "IsVideo": false,
            "IsFeaturedItem": false,
            "IsExternalResource": false,
            "User": {
                "ID": 1761,
                "Username": "filip.vanrickstal"
            },
            "DateCreated": "2014-11-23T20:34:00Z"
        }
    ],
    "IsRecentlyVerified": false,
    "ID": 23088,
    "UUID": "BC4E67A3-E97C-4DCD-9C9C-E26749028779",
    "DataProviderID": 1,
    "OperatorID": 47,
    "UsageTypeID": 1,
    "UsageCost": "Free",
    "AddressInfo": {
        "ID": 23433,
        "Title": "  Delhaize Kontich ",
        "AddressLine1": "Antwerpsesteenweg 127",
        "Town": "Kontich",
        "StateOrProvince": "Antwerpen",
        "Postcode": "2550",
        "CountryID": 26,
        "Latitude": 51.1414983,
        "Longitude": 4.45587809963899,
        "ContactTelephone1": " 03/457.33.89 ",
        "DistanceUnit": 0
    },
    "Connections": [
        {
            "ID": 24792,
            "ConnectionTypeID": 25,
            "StatusTypeID": 50,
            "LevelID": 2,
            "Amps": 32,
            "Voltage": 400,
            "PowerKW": 22,
            "CurrentTypeID": 20,
            "Quantity": 2
        }
    ],
    "NumberOfPoints": 2,
    "StatusTypeID": 50,
    "DateLastStatusUpdate": "2014-12-21T14:30:00Z",
    "DataQualityLevel": 1,
    "DateCreated": "2014-04-11T21:11:00Z",
    "SubmissionStatusTypeID": 200
}