{
    "IsRecentlyVerified": false,
    "ID": 73980,
    "UUID": "D14AD016-1C73-4714-8917-048B53FE366E",
    "DataProviderID": 1,
    "OperatorID": 89,
    "OperatorsReference": "AAA-082",
    "UsageTypeID": 4,
    "UsageCost": "CAD 1.00/hour",
    "AddressInfo": {
        "ID": 74326,
        "Title": "Caisse Desjardins Thérèse-de-Blainville",
        "AddressLine1": "201 boul. Labelle",
        "Town": "Ste-Thérèse",
        "StateOrProvince": "QC",
        "Postcode": "J7E 2X6",
        "CountryID": 44,
        "Latitude": 45.644866,
        "Longitude": -73.83677,
        "DistanceUnit": 0
    },
    "Connections": [
        {
            "ID": 106294,
            "ConnectionTypeID": 1,
            "StatusTypeID": 50,
            "LevelID": 2,
            "Amps": 32,
            "Voltage": 230,
            "PowerKW": 7,
            "CurrentTypeID": 10,
            "Quantity": 1
        }
    ],
    "NumberOfPoints": 1,
    "StatusTypeID": 50,
    "DateLastStatusUpdate": "2016-11-27T17:05:00Z",
    "DataQualityLevel": 1,
    "DateCreated": "2016-11-23T23:49:00Z",
    "SubmissionStatusTypeID": 200
}