{
    "IsRecentlyVerified": false,
    "ID": 131190,
    "UUID": "8A0DB850-EA42-404C-9135-833FA46AC51E",
    "DataProviderID": 1,
    "OperatorID": 90,
    "UsageTypeID": 1,
    "UsageCost": "$1,00/h",
    "AddressInfo": {
        "ID": 131536,
        "Title": "Rivière Éternité",
        "AddressLine1": "418 Route Principale",
        "Town": "Rivière-Éternité",
        "StateOrProvince": "Québec",
        "Postcode": "G0V 1P0",
        "CountryID": 44,
        "Latitude": 48.2554031757049,
        "Longitude": -70.4139381729883,
        "DistanceUnit": 0
    },
    "Connections": [
        {
            "ID": 183692,
            "ConnectionTypeID": 1,
            "StatusTypeID": 50,
            "LevelID": 2,
            "Amps": 30,
            "Voltage": 240,
            "PowerKW": 7,
            "CurrentTypeID": 10,
            "Quantity": 1
        }
    ],
    "NumberOfPoints": 1,
    "StatusTypeID": 50,
    "DateLastStatusUpdate": "2019-08-30T07:53:00Z",
    "DataQualityLevel": 1,
    "DateCreated": "2019-08-30T01:41:00Z",
    "SubmissionStatusTypeID": 200
}