{
    "IsRecentlyVerified": false,
    "ID": 68803,
    "UUID": "60775784-66C5-4F13-825A-95509347882C",
    "DataProviderID": 2,
    "DataProvidersReference": "76149",
    "OperatorID": 5,
    "UsageTypeID": 1,
    "AddressInfo": {
        "ID": 69149,
        "Title": "DUN EV CHARGE",
        "AddressLine1": "4770 N Peachtree Rd",
        "Town": "Dunwoody",
        "StateOrProvince": "GA",
        "Postcode": "30338",
        "CountryID": 2,
        "Latitude": 33.9347978,
        "Longitude": -84.2957563,
        "ContactTelephone1": "888-758-4389",
        "AccessComments": "24 hours daily",
        "RelatedURL": "http://www.chargepoint.com/",
        "DistanceUnit": 0
    },
    "Connections": [
        {
            "ID": 96503,
            "ConnectionTypeID": 1,
            "LevelID": 2,
            "Amps": 16,
            "Voltage": 230,
            "PowerKW": 3,
            "CurrentTypeID": 10,
            "Quantity": 2
        }
    ],
    "DateLastStatusUpdate": "2019-04-06T04:01:00Z",
    "DataQualityLevel": 3,
    "DateCreated": "2016-06-25T03:36:00Z",
    "SubmissionStatusTypeID": 100
}