{
    "IsRecentlyVerified": false,
    "ID": 85013,
    "UUID": "AA2E6A28-E143-41FC-A6EC-F24CB0A74F6F",
    "DataProviderID": 1,
    "OperatorID": 105,
    "UsageTypeID": 4,
    "AddressInfo": {
        "ID": 85359,
        "Title": "Seniorenzentrum St. Elisabeth",
        "AddressLine1": "Bücheler Weg 31",
        "Town": "Alfter",
        "StateOrProvince": "Rhein-Sieg-Kreis",
        "Postcode": "53347",
        "CountryID": 87,
        "Latitude": 50.72178085386809,
        "Longitude": 7.024505318863685,
        "AccessComments": "24/7 nutzbar auf dem Parkplatz neben St. Elisabeth Seniorenzentrum",
        "DistanceUnit": 0
    },
    "Connections": [
        {
            "ID": 120764,
            "ConnectionTypeID": 25,
            "StatusTypeID": 50,
            "LevelID": 2,
            "Amps": 32,
            "Voltage": 400,
            "PowerKW": 22,
            "CurrentTypeID": 20,
            "Quantity": 2
        }
    ],
    "NumberOfPoints": 2,
    "StatusTypeID": 50,
    "DateLastStatusUpdate": "2017-03-23T15:16:00Z",
    "DataQualityLevel": 1,
    "DateCreated": "2017-03-23T15:16:00Z",
    "SubmissionStatusTypeID": 200
}