{
    "MediaItems": [
        {
            "ID": 12059,
            "ChargePointID": 87667,
            "ItemURL": "https://s3-ap-southeast-2.amazonaws.com/openchargemap/images/NZ/OCM87667/OCM-87667.orig.2017051509162464.jpg",
            "ItemThumbnailURL": "https://s3-ap-southeast-2.amazonaws.com/openchargemap/images/NZ/OCM87667/OCM-87667.thmb.2017051509162464.jpg",
            "Comment": "",
            "IsEnabled": true,
            "IsVideo": false,
            "IsFeaturedItem": false,
            "IsExternalResource": false,
            "User": {
                "ID": 15365,
                "Username": "sliday"
            },
            "DateCreated": "2017-05-15T09:17:00Z"
        },
        {
            "ID": 12054,
            "ChargePointID": 87667,
            "ItemURL": "https://s3-ap-southeast-2.amazonaws.com/openchargemap/images/NZ/OCM87667/OCM-87667.orig.2017051509152199.jpg",
            "ItemThumbnailURL": "https://s3-ap-southeast-2.amazonaws.com/openchargemap/images/NZ/OCM87667/OCM-87667.thmb.2017051509152199.jpg",
            "Comment": "",
            "IsEnabled": true,
            "IsVideo": false,
            "IsFeaturedItem": false,
            "IsExternalResource": false,
            "User": {
                "ID": 15365,
                "Username": "sliday"
            },
            "DateCreated": "2017-05-15T09:16:00Z"
        },
        {
            "ID": 12055,
            "ChargePointID": 87667,
            "ItemURL": "https://s3-ap-southeast-2.amazonaws.com/openchargemap/images/NZ/OCM87667/OCM-87667.orig.2017051509153340.jpg",
            "ItemThumbnailURL": "https://s3-ap-southeast-2.amazonaws.com/openchargemap/images/NZ/OCM87667/OCM-87667.thmb.2017051509153340.jpg",
            "Comment": "",
            "IsEnabled": true,
            "IsVideo": false,
            "IsFeaturedItem": false,
            "IsExternalResource": false,
            "User": {
                "ID": 15365,
                "Username": "sliday"
            },
            "DateCreated": "2017-05-15T09:16:00Z"
        },
        {
            "ID": 12056,
            "ChargePointID": 87667,
            "ItemURL": "https://s3-ap-southeast-2.amazonaws.com/openchargemap/images/NZ/OCM87667/OCM-87667.orig.2017051509154667.jpg",
            "ItemThumbnailURL": "https://s3-ap-southeast-2.amazonaws.com/openchargemap/images/NZ/OCM87667/OCM-87667.thmb.2017051509154667.jpg",
            "Comment": "",
            "IsEnabled": true,
            "IsVideo": false,
            "IsFeaturedItem": false,
            "IsExternalResource": false,
            "User": {
                "ID": 15365,
                "Username": "sliday"
            },
            "DateCreated": "2017-05-15T09:16:00Z"
        },
        {
            "ID": 12057,
            "ChargePointID": 87667,
            "ItemURL": "https://s3-ap-southeast-2.amazonaws.com/openchargemap/images/NZ/OCM87667/OCM-87667.orig.2017051509155791.jpg",
            "ItemThumbnailURL": "https://s3-ap-southeast-2.amazonaws.com/openchargemap/images/NZ/OCM87667/OCM-87667.thmb.2017051509155791.jpg",
            "Comment": "",
            "IsEnabled": true,
            "IsVideo": false,
            "IsFeaturedItem": false,
            "IsExternalResource": false,
            "User": {
                "ID": 15365,
                "Username": "sliday"
            },
            "DateCreated": "2017-05-15T09:16:00Z"
        },
        {
            "ID": 12058,
            "ChargePointID": 87667,
            "ItemURL": "https://s3-ap-southeast-2.amazonaws.com/openchargemap/images/NZ/OCM87667/OCM-87667.orig.2017051509160904.jpg",
            "ItemThumbnailURL": "https://s3-ap-southeast-2.amazonaws.com/openchargemap/images/NZ/OCM87667/OCM-87667.thmb.2017051509160904.jpg",
            "Comment": "",
            "IsEnabled": true,
            "IsVideo": false,
            "IsFeaturedItem": false,
            "IsExternalResource": false,
            "User": {
                "ID": 15365,
                "Username": "sliday"
            },
            "DateCreated": "2017-05-15T09:16:00Z"
        },
        {
            "ID": 12053,
            "ChargePointID": 87667,
            "ItemURL": "https://s3-ap-southeast-2.amazonaws.com/openchargemap/images/NZ/OCM87667/OCM-87667.orig.2017051509150778.jpg",
            "ItemThumbnailURL": "https://s3-ap-southeast-2.amazonaws.com/openchargemap/images/NZ/OCM87667/OCM-87667.thmb.2017051509150778.jpg",
            "Comment": "",
            "IsEnabled": true,
            "IsVideo": false,
            "IsFeaturedItem": false,
            "IsExternalResource": false,
            "User": {
                "ID": 15365,
                "Username": "sliday"
            },
            "DateCreated": "2017-05-15T09:15:00Z"
        }
    ],
    "IsRecentlyVerified": false,
    "ID": 87667,
    "UUID": "AD8B7DD1-9E26-419A-8349-13B0E8E09A8A",
    "DataProviderID": 1,
    "UsageTypeID": 1,
    "UsageCost": "$3.00/hour",
    "AddressInfo": {
        "ID": 88013,
        "Title": "Auckland Transport Downtown Carpark",
        "AddressLine1": "31 Customs Street West",
        "Town": "Auckland",
        "Postcode": "1010",
        "CountryID": 161,
        "Latitude": -36.8437834393729,
        "Longitude": 174.764266635348,
        "DistanceUnit": 0
    },
    "Connections": [
        {
            "ID": 124272,
            "ConnectionTypeID": 1,
            "StatusTypeID": 50,
            "LevelID": 2,
            "Amps": 32,
            "Voltage": 230,
            "PowerKW": 7,
            "CurrentTypeID": 10,
            "Quantity": 2
        }
    ],
    "NumberOfPoints": 2,
    "GeneralComments": "$3/hr P180 (since recently)\r\nGround Level (inside) near Customs Street exit. Free, but Carpark parking fees apply",
    "StatusTypeID": 50,
    "DateLastStatusUpdate": "2017-05-16T06:40:00Z",
    "DataQualityLevel": 1,
    "DateCreated": "2017-05-15T09:15:00Z",
    "SubmissionStatusTypeID": 200
}