{
    "IsRecentlyVerified": false,
    "ID": 38115,
    "UUID": "9CA128EA-6BD0-49AE-9DB0-58D9DD84FFE3",
    "DataProviderID": 26,
    "DataProvidersReference": "48629",
    "OperatorID": 178,
    "OperatorsReference": "EVnetNL REE504",
    "UsageCost": "0.00 jaarabonnement",
    "AddressInfo": {
        "ID": 38461,
        "Title": "Panneroodstraat 346",
        "AddressLine1": "Panneroodstraat 346",
        "Town": "Zaanstad",
        "Postcode": "1503 XJ",
        "CountryID": 159,
        "Latitude": 52.445229,
        "Longitude": 4.838968,
        "ContactTelephone1": "0800-3522365",
        "RelatedURL": "http://www.evnet.nl",
        "DistanceUnit": 0
    },
    "Connections": [
        {
            "ID": 41626,
            "ConnectionTypeID": 25,
            "LevelID": 1,
            "PowerKW": 2.3,
            "CurrentTypeID": 10
        }
    ],
    "NumberOfPoints": 1,
    "StatusTypeID": 50,
    "DateLastStatusUpdate": "2016-06-04T02:54:00Z",
    "DataQualityLevel": 3,
    "DateCreated": "2015-01-09T06:07:00Z",
    "SubmissionStatusTypeID": 100
}