{
    "IsRecentlyVerified": false,
    "ID": 90688,
    "UUID": "6AE9163A-A55D-4F88-96EA-807E4DACE673",
    "DataProviderID": 1,
    "OperatorID": 23,
    "OperatorsReference": "32067",
    "UsageTypeID": 6,
    "AddressInfo": {
        "ID": 91034,
        "Title": "Clarion Inn - River Riders Family Adventure Resort",
        "AddressLine1": "4328 William L Wilson Fwy",
        "Town": "Harpers Ferry",
        "StateOrProvince": "West Virginia",
        "Postcode": "25424",
        "CountryID": 2,
        "Latitude": 39.31671,
        "Longitude": -77.766491,
        "ContactTelephone1": "(304) 535-6302",
        "DistanceUnit": 0
    },
    "Connections": [
        {
            "ID": 128411,
            "ConnectionTypeID": 30,
            "StatusTypeID": 50,
            "LevelID": 2,
            "PowerKW": 16,
            "CurrentTypeID": 20,
            "Quantity": 2
        }
    ],
    "NumberOfPoints": 2,
    "GeneralComments": "2 Tesla Connectors, up to 16kW.Available for patrons only. Please see front desk.",
    "StatusTypeID": 50,
    "DateLastStatusUpdate": "2017-07-22T05:33:00Z",
    "DataQualityLevel": 1,
    "DateCreated": "2017-07-22T05:33:00Z",
    "SubmissionStatusTypeID": 200
}