{
    "IsRecentlyVerified": false,
    "ID": 9178,
    "UUID": "B4D23AF5-5000-410B-B3EE-D40D066C127D",
    "DataProviderID": 15,
    "DataProvidersReference": "12964",
    "OperatorID": 5,
    "UsageTypeID": 1,
    "AddressInfo": {
        "ID": 9075,
        "Title": "300 N Plano Rd",
        "AddressLine1": "300 N Plano Rd",
        "Town": "Richardson",
        "StateOrProvince": "Texas",
        "Postcode": "75081",
        "CountryID": 2,
        "Latitude": 32.94816,
        "Longitude": -96.69836,
        "ContactTelephone1": "",
        "RelatedURL": "http://carstations.com/12964",
        "DistanceUnit": 0
    },
    "Connections": [
        {
            "ID": 6859,
            "ConnectionTypeID": 1,
            "Reference": "J1772",
            "LevelID": 2
        },
        {
            "ID": 7050,
            "ConnectionTypeID": 9,
            "Reference": "NEMA5",
            "LevelID": 1,
            "Quantity": 1
        }
    ],
    "NumberOfPoints": 4,
    "StatusTypeID": 50,
    "DateLastStatusUpdate": "2017-11-04T14:04:00Z",
    "DataQualityLevel": 2,
    "DateCreated": "2012-01-23T15:12:00Z",
    "SubmissionStatusTypeID": 100
}