{
    "IsRecentlyVerified": false,
    "ID": 36171,
    "UUID": "AD81B326-4273-4DF6-B668-494B43294796",
    "DataProviderID": 26,
    "DataProvidersReference": "55627",
    "OperatorID": 180,
    "OperatorsReference": "Alfen GDH2582",
    "UsageCost": "0.00 jaarabonnement",
    "AddressInfo": {
        "ID": 36517,
        "Title": "Badhuiskade 11",
        "AddressLine1": "Badhuiskade 11",
        "Town": "Den Haag",
        "Postcode": "2586 EN",
        "CountryID": 159,
        "Latitude": 52.107486,
        "Longitude": 4.277469,
        "ContactTelephone1": "036 - 549 34 00",
        "RelatedURL": "http://www.icu-charging-stations.com/",
        "DistanceUnit": 0
    },
    "Connections": [
        {
            "ID": 39682,
            "ConnectionTypeID": 25,
            "LevelID": 2,
            "PowerKW": 11,
            "CurrentTypeID": 10
        },
        {
            "ID": 48262,
            "ConnectionTypeID": 25,
            "LevelID": 2,
            "PowerKW": 11,
            "CurrentTypeID": 10
        }
    ],
    "NumberOfPoints": 1,
    "StatusTypeID": 50,
    "DateLastStatusUpdate": "2016-06-04T02:50:00Z",
    "DataQualityLevel": 3,
    "DateCreated": "2015-01-09T06:05:00Z",
    "SubmissionStatusTypeID": 100
}