{
    "IsRecentlyVerified": false,
    "ID": 122174,
    "UUID": "12EC86D6-F2FB-4D0E-B7E6-E93A50A1F54F",
    "DataProviderID": 2,
    "DataProvidersReference": "104785",
    "OperatorID": 5,
    "UsageTypeID": 1,
    "AddressInfo": {
        "ID": 122520,
        "Title": "WESTCOVINA",
        "AddressLine1": "2100 S Azusa Ave",
        "Town": "West Covina",
        "StateOrProvince": "CA",
        "Postcode": "91792",
        "CountryID": 2,
        "Latitude": 34.0398519,
        "Longitude": -117.9100416,
        "ContactTelephone1": "888-758-4389",
        "AccessComments": "24 hours daily",
        "RelatedURL": "http://www.chargepoint.com/",
        "DistanceUnit": 0
    },
    "Connections": [
        {
            "ID": 172041,
            "ConnectionTypeID": 1,
            "LevelID": 2,
            "Amps": 16,
            "Voltage": 230,
            "PowerKW": 3,
            "CurrentTypeID": 10,
            "Quantity": 2
        }
    ],
    "DateLastStatusUpdate": "2019-12-24T09:11:00Z",
    "DataQualityLevel": 3,
    "DateCreated": "2019-04-06T05:02:00Z",
    "SubmissionStatusTypeID": 100
}