{
    "IsRecentlyVerified": false,
    "ID": 33103,
    "UUID": "CC20580A-6C63-442C-9C48-328105FBA715",
    "DataProviderID": 1,
    "OperatorID": 105,
    "OperatorsReference": "Essent EM-DE-05913000-01-00036",
    "UsageTypeID": 4,
    "UsageCost": "",
    "AddressInfo": {
        "ID": 33449,
        "Title": "Kuhstr. 12",
        "AddressLine1": "Kuhstr. 12",
        "AddressLine2": "Im Parkhaus, Platz 87+88 Ebene 1",
        "Town": "Dortmund",
        "StateOrProvince": "",
        "Postcode": "44137",
        "CountryID": 87,
        "Latitude": 51.5117,
        "Longitude": 7.462412,
        "ContactTelephone1": "",
        "ContactTelephone2": "",
        "ContactEmail": "",
        "AccessComments": "Im Parkhaus, Platz 87+88 Ebene 1",
        "RelatedURL": "",
        "DistanceUnit": 0
    },
    "Connections": [
        {
            "ID": 36614,
            "ConnectionTypeID": 25,
            "StatusTypeID": 0,
            "LevelID": 2,
            "PowerKW": 11
        },
        {
            "ID": 46672,
            "ConnectionTypeID": 25,
            "StatusTypeID": 0,
            "LevelID": 2,
            "PowerKW": 11
        }
    ],
    "NumberOfPoints": 1,
    "GeneralComments": "",
    "StatusTypeID": 50,
    "DateLastStatusUpdate": "2016-04-24T09:20:00Z",
    "DataQualityLevel": 3,
    "DateCreated": "2015-01-09T06:04:00Z",
    "SubmissionStatusTypeID": 200
}