{
    "IsRecentlyVerified": false,
    "ID": 152113,
    "UUID": "4246726C-A149-4FAE-A289-2C30CFD157CB",
    "DataProviderID": 28,
    "DataProvidersReference": "FR*S86*PSORE*B077",
    "UsageTypeID": 5,
    "AddressInfo": {
        "ID": 152466,
        "Title": "B077",
        "AddressLine1": "Place du champs de foire - 86340 - Nieuil l'Espoir",
        "CountryID": 80,
        "Latitude": 46.48322,
        "Longitude": 0.45408,
        "AccessComments": "24/24 7/7 jours",
        "DistanceUnit": 0
    },
    "Connections": [
        {
            "ID": 212805,
            "ConnectionTypeID": 28,
            "StatusTypeID": 50,
            "LevelID": 2,
            "PowerKW": 18,
            "CurrentTypeID": 10
        },
        {
            "ID": 212806,
            "ConnectionTypeID": 26,
            "StatusTypeID": 50,
            "LevelID": 2,
            "PowerKW": 18
        },
        {
            "ID": 245662,
            "ConnectionTypeID": 28,
            "StatusTypeID": 50,
            "LevelID": 2,
            "PowerKW": 18,
            "CurrentTypeID": 10
        },
        {
            "ID": 245663,
            "ConnectionTypeID": 26,
            "StatusTypeID": 50,
            "LevelID": 2,
            "PowerKW": 18
        }
    ],
    "GeneralComments": "",
    "StatusTypeID": 50,
    "DateLastStatusUpdate": "2020-08-27T05:12:00Z",
    "DataQualityLevel": 2,
    "DateCreated": "2020-03-15T10:53:00Z",
    "SubmissionStatusTypeID": 100
}