{
    "IsRecentlyVerified": false,
    "ID": 35552,
    "UUID": "3011617A-28F5-4E90-BC8E-DF2233AF9E6F",
    "DataProviderID": 26,
    "DataProvidersReference": "50535",
    "OperatorID": 180,
    "OperatorsReference": "Alfen GDH0442",
    "UsageCost": "0.00 jaarabonnement",
    "AddressInfo": {
        "ID": 35898,
        "Title": "Lorentzplein 39",
        "AddressLine1": "Lorentzplein 39",
        "Town": "Den Haag",
        "Postcode": "2522 ED",
        "CountryID": 159,
        "Latitude": 52.060319,
        "Longitude": 4.327425,
        "ContactTelephone1": "036 - 549 34 00",
        "RelatedURL": "http://www.icu-charging-stations.com/",
        "DistanceUnit": 0
    },
    "Connections": [
        {
            "ID": 39063,
            "ConnectionTypeID": 25,
            "LevelID": 2,
            "PowerKW": 11,
            "CurrentTypeID": 10
        },
        {
            "ID": 47932,
            "ConnectionTypeID": 25,
            "LevelID": 2,
            "PowerKW": 11,
            "CurrentTypeID": 10
        }
    ],
    "NumberOfPoints": 1,
    "StatusTypeID": 50,
    "DateLastStatusUpdate": "2016-06-04T02:45:00Z",
    "DataQualityLevel": 3,
    "DateCreated": "2015-01-09T06:05:00Z",
    "SubmissionStatusTypeID": 100
}