{
    "IsRecentlyVerified": false,
    "ID": 97370,
    "UUID": "78E1F563-A313-45A3-9181-19AE65E34C28",
    "DataProviderID": 1,
    "OperatorID": 23,
    "OperatorsReference": "28803",
    "UsageTypeID": 4,
    "UsageCost": "CZK 6.31/kWh; ostatní tarify pro starší vozy",
    "AddressInfo": {
        "ID": 97716,
        "Title": "Olomouc Supercharger",
        "AddressLine1": "Dolní Novosadská 421/89",
        "Town": "Olomouc",
        "CountryID": 64,
        "Latitude": 49.560857,
        "Longitude": 17.262377,
        "DistanceUnit": 0
    },
    "Connections": [
        {
            "ID": 138277,
            "ConnectionTypeID": 27,
            "StatusTypeID": 50,
            "LevelID": 3,
            "PowerKW": 120,
            "CurrentTypeID": 30,
            "Quantity": 8
        }
    ],
    "NumberOfPoints": 8,
    "GeneralComments": "Charging8 Superchargers, available 24/7, up to 120kW",
    "StatusTypeID": 50,
    "DateLastStatusUpdate": "2019-03-23T07:51:00Z",
    "DataQualityLevel": 1,
    "DateCreated": "2018-01-21T15:15:00Z",
    "SubmissionStatusTypeID": 200
}