{
    "IsRecentlyVerified": false,
    "ID": 8763,
    "UUID": "F7E4F782-DB7A-4BC1-97B5-AE9A24F5C7E7",
    "DataProviderID": 15,
    "DataProvidersReference": "11773",
    "OperatorID": 5,
    "AddressInfo": {
        "ID": 8660,
        "Title": "500 S Grand Central Pkwy",
        "AddressLine1": "500 S Grand Central Pkwy",
        "Town": "Las Vegas",
        "StateOrProvince": "Nevada",
        "Postcode": "89106",
        "CountryID": 2,
        "Latitude": 36.16444,
        "Longitude": -115.15464,
        "ContactTelephone1": "",
        "RelatedURL": "http://carstations.com/11773",
        "DistanceUnit": 0
    },
    "Connections": [
        {
            "ID": 6172,
            "ConnectionTypeID": 1,
            "Reference": "J1772",
            "LevelID": 2
        },
        {
            "ID": 6616,
            "ConnectionTypeID": 9,
            "Reference": "NEMA5",
            "LevelID": 1,
            "Quantity": 1
        }
    ],
    "StatusTypeID": 0,
    "DateLastStatusUpdate": "2017-11-04T14:04:00Z",
    "DataQualityLevel": 1,
    "DateCreated": "2011-11-19T21:32:00Z",
    "SubmissionStatusTypeID": 100
}