{
    "IsRecentlyVerified": false,
    "ID": 8600,
    "UUID": "D17D5AC5-45F9-488B-9609-7092A807859B",
    "DataProviderID": 15,
    "DataProvidersReference": "10349",
    "OperatorID": 26,
    "AddressInfo": {
        "ID": 8497,
        "Title": "3939 Cross Creek Road",
        "AddressLine1": "3939 Cross Creek Road",
        "Town": "Malibu",
        "StateOrProvince": "California",
        "Postcode": "90265",
        "CountryID": 2,
        "Latitude": 34.0356,
        "Longitude": -118.685558,
        "ContactTelephone1": "",
        "RelatedURL": "http://carstations.com/10349",
        "DistanceUnit": 0
    },
    "Connections": [
        {
            "ID": 6024,
            "ConnectionTypeID": 1,
            "Reference": "J1772",
            "LevelID": 2
        }
    ],
    "StatusTypeID": 50,
    "DateLastStatusUpdate": "2017-11-04T14:04:00Z",
    "DataQualityLevel": 1,
    "DateCreated": "2011-11-11T12:07:00Z",
    "SubmissionStatusTypeID": 100
}