{
    "IsRecentlyVerified": false,
    "ID": 8070,
    "UUID": "58FDA1DB-C515-468C-87CC-12FC1753A99F",
    "DataProviderID": 15,
    "DataProvidersReference": "7439",
    "OperatorID": 1,
    "AddressInfo": {
        "ID": 7967,
        "Title": "260 Crown St",
        "AddressLine1": "260 Crown St",
        "Town": "New Haven",
        "StateOrProvince": "CT",
        "Postcode": "06519",
        "CountryID": 2,
        "Latitude": 41.3063,
        "Longitude": -72.93055,
        "ContactTelephone1": "860-527-2378 ",
        "RelatedURL": "http://carstations.com/7439",
        "DistanceUnit": 0
    },
    "Connections": [
        {
            "ID": 5499,
            "ConnectionTypeID": 9,
            "Reference": "NEMA5",
            "LevelID": 1
        }
    ],
    "StatusTypeID": 0,
    "DateLastStatusUpdate": "2017-11-04T14:04:00Z",
    "DataQualityLevel": 1,
    "DateCreated": "2011-11-11T12:05:00Z",
    "SubmissionStatusTypeID": 100
}