{
    "IsRecentlyVerified": false,
    "ID": 81587,
    "UUID": "1B70D57C-07F8-4C59-8869-31AC58306306",
    "DataProviderID": 1,
    "OperatorID": 23,
    "OperatorsReference": "23212",
    "UsageTypeID": 4,
    "AddressInfo": {
        "ID": 81933,
        "Title": "Aeropuerto Guadalajara",
        "AddressLine1": "Carr. Guadalajara Chapala KM 17.5",
        "Town": "Guadalajara",
        "StateOrProvince": "Jalisco",
        "Postcode": "45659",
        "CountryID": 146,
        "Latitude": 20.525871,
        "Longitude": -103.299674,
        "ContactTelephone1": "+52 33 3688 5248",
        "DistanceUnit": 0
    },
    "Connections": [
        {
            "ID": 116328,
            "ConnectionTypeID": 30,
            "StatusTypeID": 50,
            "LevelID": 2,
            "PowerKW": 18,
            "CurrentTypeID": 20,
            "Quantity": 4
        }
    ],
    "NumberOfPoints": 4,
    "GeneralComments": "4 Tesla Connectors, up to 18kW.Available to the public. Self park.",
    "StatusTypeID": 50,
    "DateLastStatusUpdate": "2017-02-02T22:52:00Z",
    "DataQualityLevel": 1,
    "DateCreated": "2017-02-02T22:52:00Z",
    "SubmissionStatusTypeID": 200
}