{
    "IsRecentlyVerified": false,
    "ID": 73457,
    "UUID": "3129929A-DED7-44FD-B030-D59080117974",
    "DataProviderID": 1,
    "OperatorID": 89,
    "OperatorsReference": "CEA-507",
    "UsageTypeID": 4,
    "UsageCost": "CAD 1.00/hour",
    "AddressInfo": {
        "ID": 73803,
        "Title": "Roberval-Hôtel de Ville-Public",
        "AddressLine1": "851 Boul. St-Joseph",
        "Town": "Roberval",
        "StateOrProvince": "QC",
        "Postcode": "G8H 2L6",
        "CountryID": 44,
        "Latitude": 48.518258,
        "Longitude": -72.222299,
        "DistanceUnit": 0
    },
    "Connections": [
        {
            "ID": 105667,
            "ConnectionTypeID": 1,
            "StatusTypeID": 50,
            "LevelID": 2,
            "Amps": 32,
            "Voltage": 230,
            "PowerKW": 7,
            "CurrentTypeID": 10,
            "Quantity": 1
        }
    ],
    "NumberOfPoints": 1,
    "StatusTypeID": 50,
    "DateLastStatusUpdate": "2016-11-27T12:13:00Z",
    "DataQualityLevel": 1,
    "DateCreated": "2016-11-22T12:30:00Z",
    "SubmissionStatusTypeID": 200
}