{
    "IsRecentlyVerified": false,
    "ID": 63250,
    "UUID": "1F1868C3-22B5-4B74-9C03-FE2023972E84",
    "DataProviderID": 26,
    "DataProvidersReference": "72382",
    "OperatorID": 73,
    "OperatorsReference": "EV-Box EVB-P1512007",
    "UsageCost": "0.00 jaarabonnement",
    "AddressInfo": {
        "ID": 63596,
        "Title": "Gedempte Biersloot 3",
        "AddressLine1": "Gedempte Biersloot 3",
        "Town": "Vlaardingen",
        "Postcode": "3131 HJ",
        "CountryID": 159,
        "Latitude": 51.91283,
        "Longitude": 4.34357,
        "RelatedURL": "http://www.ev-box.nl",
        "DistanceUnit": 0
    },
    "Connections": [
        {
            "ID": 80553,
            "ConnectionTypeID": 25,
            "LevelID": 2,
            "PowerKW": 11,
            "CurrentTypeID": 10
        },
        {
            "ID": 80554,
            "ConnectionTypeID": 25,
            "LevelID": 2,
            "PowerKW": 11,
            "CurrentTypeID": 10
        }
    ],
    "NumberOfPoints": 1,
    "StatusTypeID": 50,
    "DateLastStatusUpdate": "2016-06-04T02:42:00Z",
    "DataQualityLevel": 3,
    "DateCreated": "2016-03-03T12:30:00Z",
    "SubmissionStatusTypeID": 100
}