{
    "IsRecentlyVerified": false,
    "ID": 38549,
    "UUID": "615C08A4-0888-42C0-B303-A3B366330738",
    "DataProviderID": 26,
    "DataProvidersReference": "34379",
    "OperatorID": 73,
    "OperatorsReference": "EV-Box EVB-P1305051",
    "UsageCost": "0.00 jaarabonnement",
    "AddressInfo": {
        "ID": 38895,
        "Title": "IJsselmeerdijk 101",
        "AddressLine1": "IJsselmeerdijk 101",
        "Town": "Lelystad",
        "Postcode": "8221 RC",
        "CountryID": 159,
        "Latitude": 52.57572,
        "Longitude": 5.52969,
        "RelatedURL": "http://www.ev-box.nl",
        "DistanceUnit": 0
    },
    "Connections": [
        {
            "ID": 42060,
            "ConnectionTypeID": 25,
            "LevelID": 2,
            "PowerKW": 5,
            "CurrentTypeID": 10
        },
        {
            "ID": 52221,
            "ConnectionTypeID": 25,
            "LevelID": 2,
            "PowerKW": 5,
            "CurrentTypeID": 10
        }
    ],
    "NumberOfPoints": 1,
    "StatusTypeID": 50,
    "DateLastStatusUpdate": "2016-06-04T02:55:00Z",
    "DataQualityLevel": 3,
    "DateCreated": "2015-01-09T06:07:00Z",
    "SubmissionStatusTypeID": 100
}