{
    "IsRecentlyVerified": false,
    "ID": 153013,
    "UUID": "EB8CFE5F-84D2-4E04-896D-A291C5A7029E",
    "DataProviderID": 28,
    "DataProvidersReference": "FR*S90*P090010110",
    "UsageTypeID": 5,
    "AddressInfo": {
        "ID": 153366,
        "Title": "Parking Général Electrique",
        "AddressLine1": "24 Avenue du Maréchal Juin",
        "CountryID": 80,
        "Latitude": 47.64491,
        "Longitude": 6.84058,
        "AccessComments": "accessible 24h/24 - 7j/7",
        "DistanceUnit": 0
    },
    "Connections": [
        {
            "ID": 214462,
            "ConnectionTypeID": 1036,
            "StatusTypeID": 50,
            "LevelID": 2,
            "PowerKW": 22,
            "CurrentTypeID": 20
        }
    ],
    "GeneralComments": "recharge normale et acceleree accessible par application smartphone/internet et badge - informations site web freshmile.fr",
    "StatusTypeID": 50,
    "DateLastStatusUpdate": "2020-08-27T05:14:00Z",
    "DataQualityLevel": 2,
    "DateCreated": "2020-03-15T10:54:00Z",
    "SubmissionStatusTypeID": 100
}