{
    "IsRecentlyVerified": false,
    "ID": 19206,
    "UUID": "E18E3CBB-CA77-4758-B0E9-9C7F6C8818E3",
    "DataProviderID": 2,
    "DataProvidersReference": "52801",
    "OperatorID": 5,
    "UsageTypeID": 1,
    "AddressInfo": {
        "ID": 19551,
        "Title": "ELON UNIVERSITY",
        "AddressLine1": "314 E Haggard Ave",
        "Town": "Elon",
        "StateOrProvince": "NC",
        "Postcode": "27244",
        "CountryID": 2,
        "Latitude": 36.104127,
        "Longitude": -79.501351,
        "ContactTelephone1": "888-758-4389",
        "AccessComments": "24 hours daily",
        "RelatedURL": "http://www.chargepoint.com/",
        "DistanceUnit": 0
    },
    "Connections": [
        {
            "ID": 19485,
            "ConnectionTypeID": 1,
            "LevelID": 2,
            "Amps": 16,
            "Voltage": 230,
            "PowerKW": 3,
            "CurrentTypeID": 10,
            "Quantity": 2
        },
        {
            "ID": 22337,
            "ConnectionTypeID": 1,
            "LevelID": 2,
            "Quantity": 2
        }
    ],
    "DateLastStatusUpdate": "2019-04-06T04:02:00Z",
    "DataQualityLevel": 3,
    "DateCreated": "2013-09-15T03:45:00Z",
    "SubmissionStatusTypeID": 200
}