{
    "IsRecentlyVerified": false,
    "ID": 145813,
    "UUID": "958367CC-FE97-49D0-9236-802E5AA95A1E",
    "DataProviderID": 2,
    "DataProvidersReference": "83696",
    "UsageTypeID": 7,
    "AddressInfo": {
        "ID": 146165,
        "Title": "Sun Life Financial",
        "AddressLine1": "280 Victoria St W",
        "Town": "Kamloops",
        "StateOrProvince": "BC",
        "Postcode": "V2C 1A4",
        "CountryID": 44,
        "Latitude": 50.678233,
        "Longitude": -120.346423,
        "ContactTelephone1": "250-314-1410",
        "AccessComments": "24 hours daily; see front desk for access\r\nPublic - Call ahead",
        "RelatedURL": "",
        "DistanceUnit": 0
    },
    "Connections": [
        {
            "ID": 202571,
            "ConnectionTypeID": 30,
            "LevelID": 2,
            "Amps": 16,
            "Voltage": 230,
            "PowerKW": 3.7,
            "CurrentTypeID": 10,
            "Quantity": 1
        }
    ],
    "StatusTypeID": 50,
    "DateLastStatusUpdate": "2020-06-26T03:12:00Z",
    "DataQualityLevel": 3,
    "DateCreated": "2019-12-24T09:25:00Z",
    "SubmissionStatusTypeID": 100
}