{
    "IsRecentlyVerified": false,
    "ID": 12996,
    "UUID": "180CA546-2276-4A42-9F28-56EB512B3912",
    "DataProviderID": 15,
    "DataProvidersReference": "20230",
    "OperatorID": 1,
    "AddressInfo": {
        "ID": 12893,
        "Title": "1962 W 1800 N",
        "AddressLine1": "1962 W 1800 N",
        "Town": "Clinton",
        "StateOrProvince": "UT",
        "Postcode": "84041",
        "CountryID": 2,
        "Latitude": 41.145828,
        "Longitude": -112.049904,
        "ContactTelephone1": "(801) 614-1347",
        "RelatedURL": "http://carstations.com/20230",
        "DistanceUnit": 0
    },
    "Connections": [
        {
            "ID": 10429,
            "ConnectionTypeID": 1,
            "Reference": "J1772",
            "LevelID": 2
        }
    ],
    "StatusTypeID": 0,
    "DateLastStatusUpdate": "2017-11-04T14:04:00Z",
    "DataQualityLevel": 2,
    "DateCreated": "2012-09-07T19:26:00Z",
    "SubmissionStatusTypeID": 100
}