{
    "IsRecentlyVerified": false,
    "ID": 144459,
    "UUID": "69981043-EE50-4BC2-B74E-E9AB8407B11B",
    "DataProviderID": 2,
    "DataProvidersReference": "130584",
    "OperatorID": 90,
    "UsageTypeID": 1,
    "AddressInfo": {
        "ID": 144811,
        "Title": "1717 René-Levesque Est",
        "AddressLine1": "1717 Boulevard René-Lévesque E",
        "Town": "Montréal",
        "StateOrProvince": "QC",
        "Postcode": "H2L 2R8",
        "CountryID": 44,
        "Latitude": 45.521235,
        "Longitude": -73.550349,
        "ContactTelephone1": "877-505-2674",
        "AccessComments": "24 hours daily",
        "RelatedURL": "https://lecircuitelectrique.com/",
        "DistanceUnit": 0
    },
    "Connections": [
        {
            "ID": 200964,
            "ConnectionTypeID": 1,
            "LevelID": 2,
            "Amps": 16,
            "Voltage": 230,
            "PowerKW": 3.7,
            "CurrentTypeID": 10,
            "Quantity": 2
        }
    ],
    "StatusTypeID": 50,
    "DateLastStatusUpdate": "2020-06-26T03:09:00Z",
    "DataQualityLevel": 3,
    "DateCreated": "2019-12-24T09:23:00Z",
    "SubmissionStatusTypeID": 100
}