{
    "IsRecentlyVerified": false,
    "ID": 111939,
    "UUID": "4D672289-15A3-4562-8F7E-28136CE578FE",
    "DataProviderID": 2,
    "DataProvidersReference": "92553",
    "OperatorID": 5,
    "UsageTypeID": 1,
    "AddressInfo": {
        "ID": 112285,
        "Title": "VANCOUVER INTL",
        "AddressLine1": "Templeton Station",
        "Town": "Richmond",
        "StateOrProvince": "BC",
        "Postcode": "V7B",
        "CountryID": 44,
        "Latitude": 49.1959597,
        "Longitude": -123.1462262,
        "ContactTelephone1": "888-758-4389",
        "AccessComments": "24 hours daily",
        "RelatedURL": "http://www.chargepoint.com/",
        "DistanceUnit": 0
    },
    "Connections": [
        {
            "ID": 157455,
            "ConnectionTypeID": 1,
            "LevelID": 2,
            "Amps": 16,
            "Voltage": 230,
            "PowerKW": 3.7,
            "CurrentTypeID": 10,
            "Quantity": 20
        }
    ],
    "DateLastStatusUpdate": "2020-06-26T03:11:00Z",
    "DataQualityLevel": 3,
    "DateCreated": "2018-10-18T23:37:00Z",
    "SubmissionStatusTypeID": 100
}