{
    "IsRecentlyVerified": false,
    "ID": 88380,
    "UUID": "D95F8254-538C-47BB-B022-96A63941FD04",
    "DataProviderID": 1,
    "OperatorID": 3297,
    "UsageTypeID": 4,
    "AddressInfo": {
        "ID": 88726,
        "Title": "Gemeindeverwaltung",
        "AddressLine1": "Mainstraße 1",
        "Town": "Lützelbach",
        "StateOrProvince": "Odenwaldkreis",
        "Postcode": "64750",
        "CountryID": 87,
        "Latitude": 49.78793,
        "Longitude": 9.07638999999995,
        "RelatedURL": "https://www.entega.ag",
        "DistanceUnit": 0
    },
    "Connections": [
        {
            "ID": 125355,
            "ConnectionTypeID": 25,
            "StatusTypeID": 50,
            "LevelID": 2,
            "Amps": 32,
            "Voltage": 400,
            "PowerKW": 22,
            "CurrentTypeID": 20,
            "Quantity": 2
        }
    ],
    "NumberOfPoints": 2,
    "GeneralComments": "24/7 nutzbare Ladesäule der Entega AG im Netzwerk LastMileSolutions\r\n",
    "StatusTypeID": 50,
    "DateLastStatusUpdate": "2017-09-27T07:40:00Z",
    "DataQualityLevel": 1,
    "DateCreated": "2017-05-29T06:38:00Z",
    "SubmissionStatusTypeID": 200
}