{
    "IsRecentlyVerified": false,
    "ID": 174995,
    "UUID": "9D143798-C25D-4B8B-AEF1-38D6CDC0E2D5",
    "DataProviderID": 1,
    "OperatorID": 203,
    "UsageTypeID": 5,
    "UsageCost": "£0.36/kWh (contactless) or £0.31/kWh with the Osprey Charging app",
    "AddressInfo": {
        "ID": 175354,
        "Title": "Abbotsinch Retail Park",
        "AddressLine1": "Washington Road",
        "AddressLine2": "Gallowhill",
        "Town": "Paisley",
        "StateOrProvince": "Scotland",
        "Postcode": "PA3 4EP",
        "CountryID": 1,
        "Latitude": 55.86031732622422,
        "Longitude": -4.415609967264572,
        "DistanceUnit": 0
    },
    "Connections": [
        {
            "ID": 271189,
            "ConnectionTypeID": 25,
            "StatusTypeID": 50,
            "LevelID": 2,
            "Amps": 32,
            "Voltage": 400,
            "PowerKW": 22,
            "CurrentTypeID": 20,
            "Quantity": 2
        },
        {
            "ID": 271190,
            "ConnectionTypeID": 2,
            "StatusTypeID": 50,
            "LevelID": 3,
            "Amps": 125,
            "Voltage": 400,
            "PowerKW": 50,
            "CurrentTypeID": 30,
            "Quantity": 2
        },
        {
            "ID": 271191,
            "ConnectionTypeID": 33,
            "StatusTypeID": 50,
            "LevelID": 3,
            "Amps": 125,
            "Voltage": 400,
            "PowerKW": 50,
            "CurrentTypeID": 30,
            "Quantity": 2
        }
    ],
    "NumberOfPoints": 2,
    "StatusTypeID": 50,
    "DateLastStatusUpdate": "2021-04-23T14:43:00Z",
    "DataQualityLevel": 1,
    "DateCreated": "2021-04-23T14:41:00Z",
    "SubmissionStatusTypeID": 200
}