{
    "IsRecentlyVerified": false,
    "ID": 84592,
    "UUID": "FB6D3BFE-6F6F-408D-95DE-39484CAEA643",
    "DataProviderID": 1,
    "OperatorID": 23,
    "OperatorsReference": "25329",
    "UsageTypeID": 4,
    "AddressInfo": {
        "ID": 84938,
        "Title": "Hampton Inn & Suites Dallas / the Colony",
        "AddressLine1": "3650 Plano Pkwy",
        "Town": "The Colony",
        "StateOrProvince": "Texas",
        "Postcode": "75056",
        "CountryID": 2,
        "Latitude": 33.070665,
        "Longitude": -96.865057,
        "ContactTelephone1": "(469) 362-1111",
        "DistanceUnit": 0
    },
    "Connections": [
        {
            "ID": 120158,
            "ConnectionTypeID": 30,
            "StatusTypeID": 50,
            "LevelID": 2,
            "PowerKW": 16,
            "CurrentTypeID": 20,
            "Quantity": 2
        }
    ],
    "NumberOfPoints": 2,
    "GeneralComments": "2 Tesla Connectors, up to 16kW.Available to the public. Self park.",
    "StatusTypeID": 50,
    "DateLastStatusUpdate": "2017-03-04T06:37:00Z",
    "DataQualityLevel": 1,
    "DateCreated": "2017-03-04T06:37:00Z",
    "SubmissionStatusTypeID": 200
}