{
    "IsRecentlyVerified": false,
    "ID": 8373,
    "UUID": "394AA24E-BC12-4C7E-A320-55A7328E466E",
    "DataProviderID": 15,
    "DataProvidersReference": "4828",
    "OperatorID": 1,
    "AddressInfo": {
        "ID": 8270,
        "Title": "876 South 800 East",
        "AddressLine1": "876 South 800 East",
        "Town": "Salt Lake City",
        "StateOrProvince": "UT",
        "Postcode": "84102",
        "CountryID": 2,
        "Latitude": 40.74988,
        "Longitude": -111.86821,
        "ContactTelephone1": "",
        "RelatedURL": "http://carstations.com/4828",
        "DistanceUnit": 0
    },
    "Connections": [
        {
            "ID": 5801,
            "ConnectionTypeID": 9,
            "Reference": "NEMA5",
            "LevelID": 1
        }
    ],
    "StatusTypeID": 0,
    "DateLastStatusUpdate": "2017-11-04T14:04:00Z",
    "DataQualityLevel": 1,
    "DateCreated": "2011-11-11T12:06:00Z",
    "SubmissionStatusTypeID": 100
}