{
    "IsRecentlyVerified": false,
    "ID": 53532,
    "UUID": "A84FC8E3-6E85-4A6B-9AAB-27588CD40642",
    "DataProviderID": 1,
    "DataProvidersReference": "2989",
    "AddressInfo": {
        "ID": 53878,
        "Title": "Gävle Golfklubb",
        "AddressLine1": "Gröna Vägen 8 ",
        "Town": "GÄVLE",
        "StateOrProvince": "GÄVLEBORG",
        "Postcode": "80595",
        "CountryID": 216,
        "Latitude": 60.69976,
        "Longitude": 17.17715,
        "AccessComments": "Parkering till höger vid Gävle Golfklubb",
        "DistanceUnit": 0
    },
    "Connections": [
        {
            "ID": 66653,
            "ConnectionTypeID": 0,
            "Reference": "1",
            "LevelID": 2,
            "Amps": 32,
            "Voltage": 400,
            "PowerKW": 22,
            "Comments": "Mode 3"
        },
        {
            "ID": 89118,
            "ConnectionTypeID": 0,
            "Reference": "2",
            "LevelID": 2,
            "Amps": 16,
            "Voltage": 400,
            "PowerKW": 11,
            "Comments": "Mode 3"
        }
    ],
    "NumberOfPoints": 2,
    "DateLastStatusUpdate": "2020-05-26T08:24:00Z",
    "DataQualityLevel": 2,
    "DateCreated": "2015-09-20T11:33:00Z",
    "SubmissionStatusTypeID": 100
}