{
    "IsRecentlyVerified": false,
    "ID": 81736,
    "UUID": "66284DAD-9335-4A6C-BB33-5C8C82174928",
    "DataProviderID": 1,
    "OperatorID": 23,
    "OperatorsReference": "7899",
    "UsageTypeID": 6,
    "AddressInfo": {
        "ID": 82082,
        "Title": "The Arrabelle At Vail Square",
        "AddressLine1": "675 Lionshead PL",
        "Town": "Vail",
        "StateOrProvince": "CO",
        "Postcode": "81657",
        "CountryID": 2,
        "Latitude": 39.6433049,
        "Longitude": -106.3882985,
        "ContactTelephone1": "(970) 754-7750",
        "DistanceUnit": 0
    },
    "Connections": [
        {
            "ID": 116494,
            "ConnectionTypeID": 30,
            "StatusTypeID": 50,
            "LevelID": 2,
            "PowerKW": 13,
            "CurrentTypeID": 20,
            "Quantity": 4
        }
    ],
    "NumberOfPoints": 4,
    "GeneralComments": "4 Tesla Connectors, up to 13kW.Available for patrons only. Please see front desk.",
    "StatusTypeID": 50,
    "DateLastStatusUpdate": "2017-02-16T10:57:00Z",
    "DataQualityLevel": 1,
    "DateCreated": "2017-02-03T11:52:00Z",
    "SubmissionStatusTypeID": 200
}