{
    "IsRecentlyVerified": false,
    "ID": 136701,
    "UUID": "FB67607D-AD3A-48A1-A2C2-916A426E238B",
    "DataProviderID": 18,
    "DataProvidersReference": "f771411826d0924c724437288664459f",
    "UsageTypeID": 4,
    "AddressInfo": {
        "ID": 137047,
        "Title": "On-street",
        "AddressLine1": "Bristol Road South",
        "Town": "Birmingham",
        "Postcode": "B31 2NN",
        "CountryID": 1,
        "Latitude": 52.415522,
        "Longitude": -1.970484,
        "AccessComments": "On-street. Fitted under Midlands PiP, ",
        "RelatedURL": "http://www.national-charge-point-registry.uk/",
        "DistanceUnit": 0
    },
    "Connections": [
        {
            "ID": 191241,
            "ConnectionTypeID": 25,
            "Reference": "0",
            "StatusTypeID": 50,
            "LevelID": 2,
            "Amps": 32,
            "Voltage": 400,
            "PowerKW": 22,
            "CurrentTypeID": 20
        },
        {
            "ID": 191242,
            "ConnectionTypeID": 25,
            "Reference": "1",
            "StatusTypeID": 50,
            "LevelID": 2,
            "Amps": 32,
            "Voltage": 400,
            "PowerKW": 22,
            "CurrentTypeID": 20
        }
    ],
    "StatusTypeID": 0,
    "DateLastStatusUpdate": "2020-06-25T10:00:00Z",
    "MetadataValues": [
        {
            "ID": 6553,
            "MetadataFieldID": 4,
            "ItemValue": "Contains public sector information licensed under the Open Government Licence v2.0. http://www.nationalarchives.gov.uk/doc/open-government-licence/version/2/"
        }
    ],
    "DataQualityLevel": 3,
    "DateCreated": "2019-12-24T05:22:00Z",
    "SubmissionStatusTypeID": 100
}