{
    "UserComments": [
        {
            "ID": 23873,
            "ChargePointID": 112853,
            "CommentTypeID": 10,
            "UserName": "ForumElettrico.it",
            "Comment": "Tutto ok con card Enel X sulla presa di sinistra. Leggi la recensione completa qui > https://www.forumelettrico.it/forum/post176271.html#p176271",
            "RelatedURL": "https://www.forumelettrico.it/forum/post176271.html#p176271",
            "DateCreated": "2021-02-09T10:30:15.557Z",
            "User": {
                "ID": 11749,
                "Username": "ForumElettrico.it"
            },
            "CheckinStatusTypeID": 10,
            "IsActionedByEditor": false
        },
        {
            "ID": 21021,
            "ChargePointID": 112853,
            "CommentTypeID": 10,
            "UserName": "ForumElettrico.it",
            "RelatedURL": "https://www.forumelettrico.it/forum/colonnina-enel-x-22-kw-correggio-re-piazzale-aldo-moro-9-t5670.html",
            "DateCreated": "2019-05-18T15:08:18.527Z",
            "User": {
                "ID": 11749,
                "Username": "ForumElettrico.it"
            },
            "CheckinStatusTypeID": 10
        }
    ],
    "MediaItems": [
        {
            "ID": 26475,
            "ChargePointID": 112853,
            "ItemURL": "https://s3-ap-southeast-2.amazonaws.com/openchargemap/images/IT/OCM112853/OCM-112853.orig.2021020910302510.jpg",
            "ItemThumbnailURL": "https://s3-ap-southeast-2.amazonaws.com/openchargemap/images/IT/OCM112853/OCM-112853.thmb.2021020910302510.jpg",
            "Comment": "",
            "IsEnabled": true,
            "IsVideo": false,
            "IsFeaturedItem": false,
            "IsExternalResource": false,
            "User": {
                "ID": 11749,
                "Username": "ForumElettrico.it"
            },
            "DateCreated": "2021-02-09T10:30:00Z"
        },
        {
            "ID": 18443,
            "ChargePointID": 112853,
            "ItemURL": "https://s3-ap-southeast-2.amazonaws.com/openchargemap/images/IT/OCM112853/OCM-112853.orig.2019051815083199.jpg",
            "ItemThumbnailURL": "https://s3-ap-southeast-2.amazonaws.com/openchargemap/images/IT/OCM112853/OCM-112853.thmb.2019051815083199.jpg",
            "Comment": "",
            "IsEnabled": true,
            "IsVideo": false,
            "IsFeaturedItem": false,
            "IsExternalResource": false,
            "User": {
                "ID": 11749,
                "Username": "ForumElettrico.it"
            },
            "DateCreated": "2019-05-18T15:09:00Z"
        },
        {
            "ID": 18444,
            "ChargePointID": 112853,
            "ItemURL": "https://s3-ap-southeast-2.amazonaws.com/openchargemap/images/IT/OCM112853/OCM-112853.orig.2019051815083900.jpg",
            "ItemThumbnailURL": "https://s3-ap-southeast-2.amazonaws.com/openchargemap/images/IT/OCM112853/OCM-112853.thmb.2019051815083900.jpg",
            "Comment": "",
            "IsEnabled": true,
            "IsVideo": false,
            "IsFeaturedItem": false,
            "IsExternalResource": false,
            "User": {
                "ID": 11749,
                "Username": "ForumElettrico.it"
            },
            "DateCreated": "2019-05-18T15:09:00Z"
        },
        {
            "ID": 18445,
            "ChargePointID": 112853,
            "ItemURL": "https://s3-ap-southeast-2.amazonaws.com/openchargemap/images/IT/OCM112853/OCM-112853.orig.2019051815084618.jpg",
            "ItemThumbnailURL": "https://s3-ap-southeast-2.amazonaws.com/openchargemap/images/IT/OCM112853/OCM-112853.thmb.2019051815084618.jpg",
            "Comment": "",
            "IsEnabled": true,
            "IsVideo": false,
            "IsFeaturedItem": false,
            "IsExternalResource": false,
            "User": {
                "ID": 11749,
                "Username": "ForumElettrico.it"
            },
            "DateCreated": "2019-05-18T15:09:00Z"
        },
        {
            "ID": 18446,
            "ChargePointID": 112853,
            "ItemURL": "https://s3-ap-southeast-2.amazonaws.com/openchargemap/images/IT/OCM112853/OCM-112853.orig.2019051815085262.jpg",
            "ItemThumbnailURL": "https://s3-ap-southeast-2.amazonaws.com/openchargemap/images/IT/OCM112853/OCM-112853.thmb.2019051815085262.jpg",
            "Comment": "",
            "IsEnabled": true,
            "IsVideo": false,
            "IsFeaturedItem": false,
            "IsExternalResource": false,
            "User": {
                "ID": 11749,
                "Username": "ForumElettrico.it"
            },
            "DateCreated": "2019-05-18T15:09:00Z"
        }
    ],
    "IsRecentlyVerified": false,
    "ID": 112853,
    "UUID": "A60796A6-0B22-4AD8-82A3-3C1E9A5AB64B",
    "DataProviderID": 1,
    "OperatorID": 80,
    "UsageTypeID": 4,
    "AddressInfo": {
        "ID": 113199,
        "Title": "Correggio Manzotti | EnelX",
        "AddressLine1": "Via Manzotti",
        "Town": "Correggio",
        "StateOrProvince": "RE",
        "Postcode": "42015 ",
        "CountryID": 112,
        "Latitude": 44.7608592762125,
        "Longitude": 10.7742206891762,
        "ContactTelephone1": "800.069.850",
        "RelatedURL": "https://www.enelx.com/it/it/emobility",
        "DistanceUnit": 0
    },
    "Connections": [
        {
            "ID": 158944,
            "ConnectionTypeID": 25,
            "StatusTypeID": 50,
            "LevelID": 2,
            "Amps": 32,
            "Voltage": 400,
            "PowerKW": 22,
            "CurrentTypeID": 20,
            "Quantity": 2
        }
    ],
    "NumberOfPoints": 2,
    "StatusTypeID": 50,
    "DateLastStatusUpdate": "2021-02-09T10:30:00Z",
    "DataQualityLevel": 1,
    "DateCreated": "2018-11-21T10:42:00Z",
    "SubmissionStatusTypeID": 200
}