{
    "IsRecentlyVerified": false,
    "ID": 35227,
    "UUID": "A7F4F15A-55B0-4513-BC2F-56A39CAC20E7",
    "DataProviderID": 26,
    "DataProvidersReference": "50939",
    "OperatorID": 180,
    "OperatorsReference": "Alfen RHL01022",
    "UsageCost": "0.00 jaarabonnement",
    "AddressInfo": {
        "ID": 35573,
        "Title": "Vaandelstraat 25",
        "AddressLine1": "Vaandelstraat 25",
        "Town": "Delft",
        "Postcode": "2611 BW",
        "CountryID": 159,
        "Latitude": 52.014676,
        "Longitude": 4.359052,
        "ContactTelephone1": "036 - 549 34 00",
        "RelatedURL": "http://www.icu-charging-stations.com/",
        "DistanceUnit": 0
    },
    "Connections": [
        {
            "ID": 38738,
            "ConnectionTypeID": 25,
            "LevelID": 2,
            "PowerKW": 11,
            "CurrentTypeID": 10
        },
        {
            "ID": 47769,
            "ConnectionTypeID": 25,
            "LevelID": 2,
            "PowerKW": 11,
            "CurrentTypeID": 10
        }
    ],
    "NumberOfPoints": 1,
    "StatusTypeID": 50,
    "DateLastStatusUpdate": "2016-06-04T02:44:00Z",
    "DataQualityLevel": 3,
    "DateCreated": "2015-01-09T06:04:00Z",
    "SubmissionStatusTypeID": 100
}