{
    "IsRecentlyVerified": false,
    "ID": 111098,
    "UUID": "4EB19B5D-0B9C-456C-88C0-5A281906703F",
    "DataProviderID": 2,
    "DataProvidersReference": "85204",
    "UsageTypeID": 5,
    "AddressInfo": {
        "ID": 111444,
        "Title": "Best Western - Oshawa",
        "AddressLine1": "559 Bloor St W",
        "Town": "Oshawa",
        "StateOrProvince": "ON",
        "Postcode": "L1J 5Y6",
        "CountryID": 44,
        "Latitude": 43.874643,
        "Longitude": -78.876826,
        "ContactTelephone1": "905-723-5271",
        "AccessComments": "24 hours daily\r\nPublic - Credit card at all times",
        "RelatedURL": "",
        "DistanceUnit": 0
    },
    "Connections": [
        {
            "ID": 156456,
            "ConnectionTypeID": 2,
            "LevelID": 3,
            "Amps": 100,
            "Voltage": 400,
            "PowerKW": 40,
            "CurrentTypeID": 30,
            "Quantity": 1
        },
        {
            "ID": 156457,
            "ConnectionTypeID": 32,
            "LevelID": 3,
            "Amps": 100,
            "Voltage": 400,
            "PowerKW": 40,
            "CurrentTypeID": 30,
            "Quantity": 1
        }
    ],
    "DateLastStatusUpdate": "2020-06-26T03:07:00Z",
    "DataQualityLevel": 3,
    "DateCreated": "2018-10-18T23:36:00Z",
    "SubmissionStatusTypeID": 100
}