{
    "IsRecentlyVerified": false,
    "ID": 89988,
    "UUID": "58B6D0E0-C22E-43F8-BE7E-F4306D7B1C53",
    "DataProviderID": 1,
    "OperatorID": 86,
    "UsageTypeID": 4,
    "AddressInfo": {
        "ID": 90334,
        "Title": "Rasthof Hegau West",
        "AddressLine1": "Zur Engener Höhe 8",
        "Town": "Engen",
        "StateOrProvince": "Verwaltungsgemeinschaft Engen",
        "Postcode": "78234",
        "CountryID": 87,
        "Latitude": 47.86118,
        "Longitude": 8.785570000000007,
        "AccessComments": "Rund um die Uhr (24/7) nutzbar, genaue Position nicht bekannt\r\n",
        "DistanceUnit": 0
    },
    "Connections": [
        {
            "ID": 127573,
            "ConnectionTypeID": 1036,
            "StatusTypeID": 50,
            "LevelID": 3,
            "Amps": 63,
            "Voltage": 400,
            "PowerKW": 43,
            "CurrentTypeID": 20,
            "Quantity": 2
        },
        {
            "ID": 127574,
            "ConnectionTypeID": 2,
            "StatusTypeID": 50,
            "LevelID": 3,
            "PowerKW": 50,
            "CurrentTypeID": 30,
            "Quantity": 1
        },
        {
            "ID": 127575,
            "ConnectionTypeID": 33,
            "StatusTypeID": 50,
            "LevelID": 3,
            "PowerKW": 50,
            "CurrentTypeID": 30,
            "Quantity": 2
        }
    ],
    "NumberOfPoints": 5,
    "StatusTypeID": 50,
    "DateLastStatusUpdate": "2017-07-03T08:40:00Z",
    "DataQualityLevel": 1,
    "DateCreated": "2017-07-03T08:40:00Z",
    "SubmissionStatusTypeID": 200
}