{
    "IsRecentlyVerified": false,
    "ID": 126666,
    "UUID": "9EBC795C-2DA8-4168-9C53-E5B8B1ED9C1E",
    "DataProviderID": 1,
    "OperatorID": 80,
    "UsageTypeID": 4,
    "AddressInfo": {
        "ID": 127012,
        "Title": "Givoletto Via Torino | EnelX",
        "AddressLine1": "Via Torino",
        "Town": "Givoletto",
        "StateOrProvince": "TO",
        "Postcode": "10040",
        "CountryID": 112,
        "Latitude": 45.152002890057986,
        "Longitude": 7.521687547603619,
        "ContactTelephone1": "800.069.850",
        "RelatedURL": "https://www.enelx.com/it/it/emobility",
        "DistanceUnit": 0
    },
    "Connections": [
        {
            "ID": 177422,
            "ConnectionTypeID": 25,
            "StatusTypeID": 50,
            "LevelID": 2,
            "Amps": 32,
            "Voltage": 400,
            "PowerKW": 22,
            "CurrentTypeID": 20,
            "Quantity": 2
        }
    ],
    "NumberOfPoints": 2,
    "StatusTypeID": 50,
    "DateLastStatusUpdate": "2019-05-16T15:10:00Z",
    "DataQualityLevel": 1,
    "DateCreated": "2019-05-16T15:10:00Z",
    "SubmissionStatusTypeID": 200
}