{
    "UserComments": [
        {
            "ID": 23040,
            "ChargePointID": 75365,
            "CommentTypeID": 10,
            "UserName": "interssl.com",
            "Comment": "Highly recommended: Tomaselli Gelateria at Baggersee, approx. 4 min away (by car!) .. ",
            "DateCreated": "2020-08-07T14:13:56.157Z",
            "User": {
                "ID": 26760,
                "Username": "interssl.com"
            },
            "CheckinStatusTypeID": 10,
            "IsActionedByEditor": false
        }
    ],
    "MediaItems": [
        {
            "ID": 23752,
            "ChargePointID": 75365,
            "ItemURL": "https://s3-ap-southeast-2.amazonaws.com/openchargemap/images/AT/OCM75365/OCM-75365.orig.2020080214404330.jpg",
            "ItemThumbnailURL": "https://s3-ap-southeast-2.amazonaws.com/openchargemap/images/AT/OCM75365/OCM-75365.thmb.2020080214404330.jpg",
            "Comment": "",
            "IsEnabled": true,
            "IsVideo": false,
            "IsFeaturedItem": false,
            "IsExternalResource": false,
            "User": {
                "ID": 26760,
                "Username": "interssl.com"
            },
            "DateCreated": "2020-08-02T14:41:00Z"
        }
    ],
    "IsRecentlyVerified": false,
    "ID": 75365,
    "UUID": "F5A71E50-1FF5-4CCD-A613-2701CA5D55D1",
    "DataProviderID": 1,
    "OperatorID": 23,
    "OperatorsReference": "19276",
    "UsageTypeID": 4,
    "UsageCost": "€0.28/kWh; Andere Tarife für ältere Autos",
    "AddressInfo": {
        "ID": 75711,
        "Title": "Innsbruck Supercharger",
        "AddressLine1": "16 Bernhard-Höfel-Straße",
        "AddressLine2": "Gewerbegebiet Roßau",
        "Town": "Innsbruck",
        "StateOrProvince": "Innsbruck-Stadt",
        "Postcode": "6020",
        "CountryID": 19,
        "Latitude": 47.264861,
        "Longitude": 11.428453,
        "DistanceUnit": 0
    },
    "Connections": [
        {
            "ID": 108670,
            "ConnectionTypeID": 27,
            "StatusTypeID": 50,
            "LevelID": 3,
            "PowerKW": 120,
            "CurrentTypeID": 30,
            "Quantity": 6
        }
    ],
    "NumberOfPoints": 6,
    "StatusTypeID": 50,
    "DateLastStatusUpdate": "2020-08-07T14:14:00Z",
    "DataQualityLevel": 1,
    "DateCreated": "2016-12-14T17:51:00Z",
    "SubmissionStatusTypeID": 200
}