{
    "IsRecentlyVerified": false,
    "ID": 89946,
    "UUID": "5343D995-1458-4DE5-B605-D1F3AF51FA14",
    "DataProviderID": 2,
    "DataProvidersReference": "85683",
    "UsageTypeID": 1,
    "AddressInfo": {
        "ID": 90292,
        "Title": "Sewall Street Garage",
        "AddressLine1": "Sewall St",
        "Town": "Augusta",
        "StateOrProvince": "ME",
        "Postcode": "04330",
        "CountryID": 2,
        "Latitude": 44.308179,
        "Longitude": -69.78326,
        "ContactTelephone1": "207-491-2146",
        "AccessComments": "Garage business hours; Accepts Liberty Hydra phone application",
        "RelatedURL": "",
        "DistanceUnit": 0
    },
    "Connections": [
        {
            "ID": 127484,
            "ConnectionTypeID": 1,
            "LevelID": 2,
            "Amps": 16,
            "Voltage": 230,
            "PowerKW": 3.7,
            "CurrentTypeID": 10,
            "Quantity": 1
        }
    ],
    "DateLastStatusUpdate": "2020-06-26T03:07:00Z",
    "DataQualityLevel": 3,
    "DateCreated": "2017-07-01T03:43:00Z",
    "SubmissionStatusTypeID": 100
}