{
    "IsRecentlyVerified": false,
    "ID": 121805,
    "UUID": "C6965AE8-53CB-475B-82F2-53CFA3DF5540",
    "DataProviderID": 2,
    "DataProvidersReference": "94755",
    "OperatorID": 3372,
    "UsageTypeID": 1,
    "AddressInfo": {
        "ID": 122151,
        "Title": "Office Building",
        "AddressLine1": "15231 Alton Pkwy",
        "Town": "Irvine",
        "StateOrProvince": "CA",
        "Postcode": "92618",
        "CountryID": 2,
        "Latitude": 33.649355,
        "Longitude": -117.733618,
        "ContactTelephone1": "866-816-7584",
        "AccessComments": "Office business hours; for employee and guest use only",
        "RelatedURL": "http://evconnect.com/",
        "DistanceUnit": 0
    },
    "Connections": [
        {
            "ID": 171636,
            "ConnectionTypeID": 1,
            "LevelID": 2,
            "Amps": 16,
            "Voltage": 230,
            "PowerKW": 3.7,
            "CurrentTypeID": 10,
            "Quantity": 2
        }
    ],
    "DateLastStatusUpdate": "2020-06-26T02:55:00Z",
    "DataQualityLevel": 3,
    "DateCreated": "2019-04-06T05:02:00Z",
    "SubmissionStatusTypeID": 100
}