{
    "IsRecentlyVerified": false,
    "ID": 9191,
    "UUID": "A44D5BCF-A340-431B-9426-26447EA27C5F",
    "DataProviderID": 15,
    "DataProvidersReference": "13602",
    "OperatorID": 5,
    "AddressInfo": {
        "ID": 9088,
        "Title": "6220 University Pkwy",
        "AddressLine1": "6220 University Pkwy",
        "Town": "Lakewood Ranch",
        "StateOrProvince": "Florida",
        "Postcode": "34240",
        "CountryID": 2,
        "Latitude": 27.38708496,
        "Longitude": -82.44068146,
        "ContactTelephone1": "",
        "RelatedURL": "http://carstations.com/13602",
        "DistanceUnit": 0
    },
    "Connections": [
        {
            "ID": 6872,
            "ConnectionTypeID": 1,
            "Reference": "J1772",
            "LevelID": 2,
            "Quantity": 1
        },
        {
            "ID": 7617,
            "ConnectionTypeID": 9,
            "Reference": "NEMA5",
            "LevelID": 1
        }
    ],
    "StatusTypeID": 0,
    "DateLastStatusUpdate": "2017-11-04T14:03:00Z",
    "DataQualityLevel": 2,
    "DateCreated": "2012-01-23T15:12:00Z",
    "SubmissionStatusTypeID": 100
}