{
    "IsRecentlyVerified": false,
    "ID": 143723,
    "UUID": "3F6B2530-ED3C-4767-9733-A2109E94BD02",
    "DataProviderID": 2,
    "DataProvidersReference": "122188",
    "UsageTypeID": 1,
    "AddressInfo": {
        "ID": 144075,
        "Title": "The Humble Farmer Bed & Breakfast",
        "AddressLine1": "785 River Rd",
        "Town": "St. George",
        "StateOrProvince": "ME",
        "Postcode": "04860",
        "CountryID": 2,
        "Latitude": 44.012622,
        "Longitude": -69.197946,
        "ContactTelephone1": "207-226-7442",
        "AccessComments": "8am-6pm daily May 1-October 31; free for guests",
        "RelatedURL": "",
        "DistanceUnit": 0
    },
    "Connections": [
        {
            "ID": 200109,
            "ConnectionTypeID": 1,
            "LevelID": 2,
            "Amps": 16,
            "Voltage": 230,
            "PowerKW": 3.7,
            "CurrentTypeID": 10,
            "Quantity": 1
        }
    ],
    "StatusTypeID": 50,
    "DateLastStatusUpdate": "2020-06-26T03:07:00Z",
    "DataQualityLevel": 3,
    "DateCreated": "2019-12-24T09:22:00Z",
    "SubmissionStatusTypeID": 100
}