{
    "IsRecentlyVerified": false,
    "ID": 144366,
    "UUID": "0D7F7528-A1E7-4CF5-B6B4-36FCF26FE4A8",
    "DataProviderID": 2,
    "DataProvidersReference": "130489",
    "OperatorID": 90,
    "UsageTypeID": 1,
    "AddressInfo": {
        "ID": 144718,
        "Title": "Sur Rue - Longueuil - 1985 Gaetan-Boucher",
        "AddressLine1": "1985 boul. Gaetan-Boucher",
        "Town": "Longueuil",
        "StateOrProvince": "QC",
        "Postcode": "J3Y 3R5",
        "CountryID": 44,
        "Latitude": 45.498734,
        "Longitude": -73.40605,
        "ContactTelephone1": "877-505-2674",
        "AccessComments": "24 hours daily",
        "RelatedURL": "https://lecircuitelectrique.com/",
        "DistanceUnit": 0
    },
    "Connections": [
        {
            "ID": 200865,
            "ConnectionTypeID": 1,
            "LevelID": 2,
            "Amps": 16,
            "Voltage": 230,
            "PowerKW": 3.7,
            "CurrentTypeID": 10,
            "Quantity": 2
        }
    ],
    "StatusTypeID": 50,
    "DateLastStatusUpdate": "2020-06-26T03:09:00Z",
    "DataQualityLevel": 3,
    "DateCreated": "2019-12-24T09:23:00Z",
    "SubmissionStatusTypeID": 100
}