{
    "IsRecentlyVerified": false,
    "ID": 185752,
    "UUID": "D128C3A7-642A-46DE-B6F6-28DB05211919",
    "DataProviderID": 29,
    "DataProvidersReference": "1424",
    "OperatorID": 86,
    "AddressInfo": {
        "ID": 186111,
        "Title": "Schlachthausstraße 3",
        "AddressLine1": "Schlachthausstraße 3",
        "Town": "Karlsruhe",
        "Postcode": "76131",
        "CountryID": 87,
        "Latitude": 49.0048,
        "Longitude": 8.4324,
        "DistanceUnit": 0
    },
    "Connections": [
        {
            "ID": 296498,
            "ConnectionTypeID": 33,
            "StatusTypeID": 50,
            "LevelID": 3,
            "PowerKW": 150,
            "CurrentTypeID": 30
        },
        {
            "ID": 296499,
            "ConnectionTypeID": 2,
            "StatusTypeID": 50,
            "LevelID": 3,
            "PowerKW": 150,
            "CurrentTypeID": 30
        },
        {
            "ID": 296500,
            "ConnectionTypeID": 25,
            "StatusTypeID": 50,
            "LevelID": 2,
            "PowerKW": 22,
            "CurrentTypeID": 20
        }
    ],
    "StatusTypeID": 50,
    "DateLastStatusUpdate": "2021-07-12T02:42:00Z",
    "MetadataValues": [
        {
            "ID": 17996,
            "MetadataFieldID": 4,
            "ItemValue": "Data from the German chargepoint registry provided by Bundesnetzagentur.de under the CC-BY 4.0 license"
        }
    ],
    "DataQualityLevel": 3,
    "DateCreated": "2021-07-12T02:42:00Z",
    "SubmissionStatusTypeID": 100
}