{
    "IsRecentlyVerified": false,
    "ID": 132769,
    "UUID": "FDCDB52E-D06B-454C-8B11-584A6E8CBBD3",
    "DataProviderID": 1,
    "OperatorID": 25,
    "OperatorsReference": "camden-swainslane",
    "UsageTypeID": 4,
    "UsageCost": "£0.059/minute; min £1.18; other tariffs available",
    "AddressInfo": {
        "ID": 133115,
        "Title": "Swains Lane",
        "AddressLine1": "65 Swains Lane",
        "Town": "London",
        "Postcode": "N6 6HA",
        "CountryID": 1,
        "Latitude": 51.564231,
        "Longitude": -0.146456,
        "DistanceUnit": 0
    },
    "Connections": [
        {
            "ID": 185915,
            "ConnectionTypeID": 25,
            "StatusTypeID": 50,
            "LevelID": 2,
            "Amps": 32,
            "Voltage": 230,
            "PowerKW": 7,
            "CurrentTypeID": 10,
            "Quantity": 1
        },
        {
            "ID": 185916,
            "ConnectionTypeID": 1,
            "StatusTypeID": 50,
            "LevelID": 2,
            "Voltage": 230,
            "PowerKW": 4,
            "CurrentTypeID": 10,
            "Quantity": 1
        }
    ],
    "NumberOfPoints": 1,
    "StatusTypeID": 50,
    "DateLastStatusUpdate": "2019-10-07T08:06:00Z",
    "DataQualityLevel": 1,
    "DateCreated": "2019-10-07T08:06:00Z",
    "SubmissionStatusTypeID": 200
}