{
    "UserComments": [
        {
            "ID": 22487,
            "ChargePointID": 155776,
            "CommentTypeID": 10,
            "UserName": "ForumElettrico.it",
            "Comment": "Orario apertura dal LU al VE 07:00-19:00 SAB 08:00-12:30. Leggi la recensione completa qui > https://www.forumelettrico.it/forum/colonnina-charge-carrental-22-kw-carrozzeria-o-s-car-crotone-kr-traversa-iv-acquabona-34-t10132.html",
            "RelatedURL": "https://www.forumelettrico.it/forum/colonnina-charge-carrental-22-kw-carrozzeria-o-s-car-crotone-kr-traversa-iv-acquabona-34-t10132.html",
            "DateCreated": "2020-04-24T06:26:20.977Z",
            "User": {
                "ID": 11749,
                "Username": "ForumElettrico.it"
            },
            "CheckinStatusTypeID": 140,
            "IsActionedByEditor": false
        }
    ],
    "MediaItems": [
        {
            "ID": 22096,
            "ChargePointID": 155776,
            "ItemURL": "https://s3-ap-southeast-2.amazonaws.com/openchargemap/images/IT/OCM155776/OCM-155776.orig.2020042406263505.jpg",
            "ItemThumbnailURL": "https://s3-ap-southeast-2.amazonaws.com/openchargemap/images/IT/OCM155776/OCM-155776.thmb.2020042406263505.jpg",
            "Comment": "",
            "IsEnabled": true,
            "IsVideo": false,
            "IsFeaturedItem": false,
            "IsExternalResource": false,
            "User": {
                "ID": 11749,
                "Username": "ForumElettrico.it"
            },
            "DateCreated": "2020-04-24T06:27:00Z"
        },
        {
            "ID": 22097,
            "ChargePointID": 155776,
            "ItemURL": "https://s3-ap-southeast-2.amazonaws.com/openchargemap/images/IT/OCM155776/OCM-155776.orig.2020042406264166.jpg",
            "ItemThumbnailURL": "https://s3-ap-southeast-2.amazonaws.com/openchargemap/images/IT/OCM155776/OCM-155776.thmb.2020042406264166.jpg",
            "Comment": "",
            "IsEnabled": true,
            "IsVideo": false,
            "IsFeaturedItem": false,
            "IsExternalResource": false,
            "User": {
                "ID": 11749,
                "Username": "ForumElettrico.it"
            },
            "DateCreated": "2020-04-24T06:27:00Z"
        },
        {
            "ID": 22098,
            "ChargePointID": 155776,
            "ItemURL": "https://s3-ap-southeast-2.amazonaws.com/openchargemap/images/IT/OCM155776/OCM-155776.orig.2020042406264889.jpg",
            "ItemThumbnailURL": "https://s3-ap-southeast-2.amazonaws.com/openchargemap/images/IT/OCM155776/OCM-155776.thmb.2020042406264889.jpg",
            "Comment": "",
            "IsEnabled": true,
            "IsVideo": false,
            "IsFeaturedItem": false,
            "IsExternalResource": false,
            "User": {
                "ID": 11749,
                "Username": "ForumElettrico.it"
            },
            "DateCreated": "2020-04-24T06:27:00Z"
        }
    ],
    "IsRecentlyVerified": false,
    "ID": 155776,
    "UUID": "FD1ECD76-BFF6-471F-9584-CDB874080AAC",
    "DataProviderID": 1,
    "UsageTypeID": 1,
    "AddressInfo": {
        "ID": 156130,
        "Title": "Charge&CarRental Carrozzeria O.s.car",
        "AddressLine1": "Traversa IV Acquabona 34",
        "Town": "Crotone",
        "StateOrProvince": "KR",
        "CountryID": 112,
        "Latitude": 39.08377,
        "Longitude": 17.118012,
        "RelatedURL": "https://www.forumelettrico.it/forum/colonnina-charge-carrental-22-kw-carrozzeria-o-s-car-crotone-kr-traversa-iv-acquabona-34-t10132.html",
        "DistanceUnit": 0
    },
    "Connections": [
        {
            "ID": 219339,
            "ConnectionTypeID": 25,
            "LevelID": 2,
            "PowerKW": 22
        }
    ],
    "NumberOfPoints": 1,
    "StatusTypeID": 50,
    "DateLastStatusUpdate": "2020-04-24T06:27:00Z",
    "DataQualityLevel": 1,
    "DateCreated": "2020-04-24T06:26:00Z",
    "SubmissionStatusTypeID": 200
}