{
    "IsRecentlyVerified": false,
    "ID": 132084,
    "UUID": "E731A28F-12C6-4AF2-8248-90C0B0130A3E",
    "DataProviderID": 1,
    "OperatorID": 1,
    "UsageTypeID": 7,
    "UsageCost": "free",
    "AddressInfo": {
        "ID": 132430,
        "Title": "Calea Bucureștilor",
        "AddressLine1": "Calea Bucureștilor",
        "Town": "Ilfov",
        "StateOrProvince": "Ilfov",
        "Postcode": "75100",
        "CountryID": 184,
        "Latitude": 44.5507941,
        "Longitude": 26.0729271,
        "DistanceUnit": 0
    },
    "Connections": [
        {
            "ID": 184842,
            "ConnectionTypeID": 2,
            "StatusTypeID": 50,
            "LevelID": 3,
            "PowerKW": 50,
            "CurrentTypeID": 30,
            "Quantity": 1
        },
        {
            "ID": 184843,
            "ConnectionTypeID": 33,
            "StatusTypeID": 50,
            "LevelID": 3,
            "PowerKW": 50,
            "CurrentTypeID": 30,
            "Quantity": 1
        },
        {
            "ID": 184844,
            "ConnectionTypeID": 1036,
            "StatusTypeID": 50,
            "LevelID": 3,
            "Amps": 63,
            "Voltage": 400,
            "PowerKW": 43,
            "CurrentTypeID": 20,
            "Quantity": 1
        }
    ],
    "NumberOfPoints": 1,
    "GeneralComments": "Ask for RFID card as the cashier desk.",
    "StatusTypeID": 50,
    "DateLastStatusUpdate": "2019-09-21T07:35:00Z",
    "DataQualityLevel": 1,
    "DateCreated": "2019-09-20T15:40:00Z",
    "SubmissionStatusTypeID": 200
}