{
    "IsRecentlyVerified": false,
    "ID": 84517,
    "UUID": "8FDDD234-CF3D-4F14-9E02-54E53BA968A1",
    "DataProviderID": 1,
    "OperatorID": 45,
    "UsageTypeID": 3,
    "UsageCost": "0,30€/kWh",
    "AddressInfo": {
        "ID": 84863,
        "Title": "Ingenieurbüro Berdelsmann und Partner",
        "AddressLine1": "Dorfstraße 45",
        "Town": "Hann. Münden",
        "StateOrProvince": "Landkreis Göttingen",
        "Postcode": "34346",
        "CountryID": 87,
        "Latitude": 51.38637,
        "Longitude": 9.747839999999997,
        "ContactTelephone1": "+49 5545 9699048",
        "ContactEmail": "db515@t-online.de",
        "AccessComments": "Durchgehend nutzbare Steckdosen nach Anmeldung. Sicherung ist nicht zugänglich.",
        "RelatedURL": "http://www.3e-ing-berdelsmann-partner.de/",
        "DistanceUnit": 0
    },
    "Connections": [
        {
            "ID": 119995,
            "ConnectionTypeID": 17,
            "StatusTypeID": 50,
            "LevelID": 2,
            "Amps": 16,
            "Voltage": 400,
            "PowerKW": 11,
            "CurrentTypeID": 20,
            "Quantity": 1
        },
        {
            "ID": 119996,
            "ConnectionTypeID": 28,
            "StatusTypeID": 50,
            "LevelID": 2,
            "Amps": 16,
            "Voltage": 230,
            "PowerKW": 3.7,
            "CurrentTypeID": 10,
            "Quantity": 2
        }
    ],
    "NumberOfPoints": 3,
    "StatusTypeID": 50,
    "DateLastStatusUpdate": "2017-03-02T09:09:00Z",
    "DataQualityLevel": 1,
    "DateCreated": "2017-03-02T09:09:00Z",
    "SubmissionStatusTypeID": 200
}