{
    "IsRecentlyVerified": false,
    "ID": 17148,
    "UUID": "21B837EA-DE03-4C95-A85F-8425640E5F76",
    "DataProviderID": 22,
    "DataProvidersReference": "B91D12ADF38B1A2C446579B64E7C5A7C",
    "AddressInfo": {
        "ID": 17493,
        "Title": "日産サティオ湘南　秦野中井店",
        "AddressLine1": "神奈川県足柄上郡中井町井ﾉ口2769-2",
        "CountryID": 114,
        "Latitude": 35.34951696,
        "Longitude": 139.2346556,
        "ContactTelephone1": "0465-81-3938",
        "DistanceUnit": 0
    },
    "Connections": [
        {
            "ID": 17389,
            "ConnectionTypeID": 2,
            "LevelID": 2,
            "Amps": 100,
            "Voltage": 480,
            "PowerKW": 48,
            "Quantity": 1
        }
    ],
    "DateLastStatusUpdate": "2013-06-29T08:54:00Z",
    "DataQualityLevel": 2,
    "DateCreated": "2013-06-29T08:54:00Z",
    "SubmissionStatusTypeID": 200
}