{
    "IsRecentlyVerified": false,
    "ID": 137303,
    "UUID": "1165A7D2-30D9-402F-BED1-2ADAB1DA0465",
    "DataProviderID": 2,
    "DataProvidersReference": "149606",
    "OperatorID": 59,
    "UsageTypeID": 1,
    "AddressInfo": {
        "ID": 137649,
        "Title": "Greenlots - 162181",
        "AddressLine1": "3500 Pinellas Bayway S",
        "Town": "St Petersburg",
        "StateOrProvince": "FL",
        "Postcode": "33715",
        "CountryID": 2,
        "Latitude": 27.628469,
        "Longitude": -82.717346,
        "ContactTelephone1": "855-900-7584",
        "AccessComments": "24 hours daily",
        "RelatedURL": "http://greenlots.com/",
        "DistanceUnit": 0
    },
    "Connections": [
        {
            "ID": 192181,
            "ConnectionTypeID": 1,
            "LevelID": 2,
            "Amps": 16,
            "Voltage": 230,
            "PowerKW": 3,
            "CurrentTypeID": 10,
            "Quantity": 2
        }
    ],
    "StatusTypeID": 50,
    "DateLastStatusUpdate": "2019-12-24T09:04:00Z",
    "DataQualityLevel": 3,
    "DateCreated": "2019-12-24T09:04:00Z",
    "SubmissionStatusTypeID": 100
}