{
    "IsRecentlyVerified": false,
    "ID": 19042,
    "UUID": "8299D962-EBA9-469F-9CC7-40A350BE1E19",
    "DataProviderID": 1,
    "OperatorID": 3,
    "UsageTypeID": 7,
    "UsageCost": "Free",
    "AddressInfo": {
        "ID": 19387,
        "Title": "Wallsend Guest House & Tea Room",
        "AddressLine1": "The Old Rectory",
        "AddressLine2": "Bowness on Solway",
        "Town": "Wigton",
        "StateOrProvince": "Cumbria",
        "Postcode": "CA7 5AF",
        "CountryID": 1,
        "Latitude": 54.9528805,
        "Longitude": -3.2151857000000064,
        "ContactTelephone1": "016973 51055",
        "ContactTelephone2": "",
        "ContactEmail": "bandb@wallsend.net",
        "AccessComments": "",
        "RelatedURL": "http://www.wallsend.net/",
        "DistanceUnit": 0
    },
    "Connections": [
        {
            "ID": 19283,
            "ConnectionTypeID": 1,
            "StatusTypeID": 50,
            "LevelID": 2,
            "Amps": 16,
            "Voltage": 230,
            "PowerKW": 3.6,
            "CurrentTypeID": 10,
            "Quantity": 1
        }
    ],
    "NumberOfPoints": 1,
    "GeneralComments": "",
    "StatusTypeID": 50,
    "DateLastStatusUpdate": "2013-09-11T20:06:00Z",
    "DataQualityLevel": 1,
    "DateCreated": "2013-09-10T11:45:00Z",
    "SubmissionStatusTypeID": 200
}