{
    "IsRecentlyVerified": false,
    "ID": 175633,
    "UUID": "1152B9F7-D0B0-4E19-AD69-F0B185020C4E",
    "DataProviderID": 1,
    "OperatorID": 22,
    "UsageTypeID": 4,
    "UsageCost": "€0.268/kWh (PAYG), €0.23/kWh (membership)",
    "AddressInfo": {
        "ID": 175992,
        "Title": "Tesco Liffey Valley Extra",
        "AddressLine1": "Fonthill Road",
        "AddressLine2": "Liffey Valley",
        "Town": "Dublin",
        "StateOrProvince": "Dublin",
        "CountryID": 3,
        "Latitude": 53.35029434572431,
        "Longitude": -6.388835716329595,
        "DistanceUnit": 0
    },
    "Connections": [
        {
            "ID": 272699,
            "ConnectionTypeID": 25,
            "StatusTypeID": 50,
            "LevelID": 2,
            "Amps": 32,
            "Voltage": 400,
            "PowerKW": 22,
            "CurrentTypeID": 20,
            "Quantity": 4
        }
    ],
    "NumberOfPoints": 4,
    "StatusTypeID": 50,
    "DateLastStatusUpdate": "2021-06-03T02:38:00Z",
    "DataQualityLevel": 1,
    "DateCreated": "2021-06-02T22:46:00Z",
    "SubmissionStatusTypeID": 200
}