{
    "IsRecentlyVerified": false,
    "ID": 174969,
    "UUID": "5341E436-104B-4504-B426-19917A9800F3",
    "DataProviderID": 1,
    "OperatorID": 3329,
    "UsageTypeID": 4,
    "AddressInfo": {
        "ID": 175328,
        "Title": "Spotlink Confartigianato Brescia via Orzinuovi",
        "AddressLine1": "Via Orzinuovi 28",
        "AddressLine2": "",
        "Town": "Brescia",
        "StateOrProvince": "Lombardia",
        "Postcode": "25126",
        "CountryID": 112,
        "Latitude": 45.528567237810876,
        "Longitude": 10.19305912429627,
        "DistanceUnit": 0
    },
    "Connections": [
        {
            "ID": 271141,
            "ConnectionTypeID": 25,
            "StatusTypeID": 50,
            "LevelID": 2,
            "Voltage": 240,
            "PowerKW": 11,
            "CurrentTypeID": 20,
            "Quantity": 2
        }
    ],
    "NumberOfPoints": 2,
    "StatusTypeID": 50,
    "DateLastStatusUpdate": "2021-04-22T21:28:00Z",
    "DataQualityLevel": 1,
    "DateCreated": "2021-04-21T17:24:00Z",
    "SubmissionStatusTypeID": 200
}