{
    "IsRecentlyVerified": false,
    "ID": 85213,
    "UUID": "46A92C1B-B4D1-4FB0-B6CD-93F06AF774A7",
    "DataProviderID": 1,
    "OperatorID": 69,
    "UsageTypeID": 4,
    "AddressInfo": {
        "ID": 85559,
        "Title": "Nymphenburger Straße",
        "AddressLine1": "Nymphenburger Straße 168",
        "Town": "München",
        "StateOrProvince": "Bayern",
        "Postcode": "80634",
        "CountryID": 87,
        "Latitude": 48.15387446828381,
        "Longitude": 11.533304836770641,
        "AccessComments": "24/7 open at the corner Ysenburgstraße",
        "DistanceUnit": 0
    },
    "Connections": [
        {
            "ID": 120990,
            "ConnectionTypeID": 25,
            "StatusTypeID": 50,
            "LevelID": 2,
            "Amps": 32,
            "Voltage": 400,
            "PowerKW": 22,
            "CurrentTypeID": 20,
            "Quantity": 2
        }
    ],
    "NumberOfPoints": 2,
    "StatusTypeID": 50,
    "DateLastStatusUpdate": "2017-03-30T06:14:00Z",
    "DataQualityLevel": 1,
    "DateCreated": "2017-03-30T06:14:00Z",
    "SubmissionStatusTypeID": 200
}