{
    "IsRecentlyVerified": false,
    "ID": 169602,
    "UUID": "DB6D6F93-9D6F-4890-89EE-63FE2EB35C67",
    "DataProviderID": 1,
    "OperatorID": 136,
    "UsageTypeID": 4,
    "UsageCost": "0,15€/kWh",
    "AddressInfo": {
        "ID": 169961,
        "Title": "Museokeskus Vapriikki",
        "AddressLine1": "Alaverstaanraitti 5",
        "Town": "Tampere",
        "CountryID": 79,
        "Latitude": 61.50317098914124,
        "Longitude": 23.760995524961572,
        "RelatedURL": "http://www.virta.fi",
        "DistanceUnit": 0
    },
    "Connections": [
        {
            "ID": 258185,
            "ConnectionTypeID": 25,
            "StatusTypeID": 50,
            "LevelID": 2,
            "Amps": 32,
            "Voltage": 400,
            "PowerKW": 22,
            "CurrentTypeID": 20,
            "Quantity": 2
        },
        {
            "ID": 258186,
            "ConnectionTypeID": 25,
            "StatusTypeID": 50,
            "LevelID": 2,
            "Amps": 32,
            "Voltage": 230,
            "PowerKW": 7.2,
            "CurrentTypeID": 10,
            "Quantity": 2
        }
    ],
    "NumberOfPoints": 4,
    "StatusTypeID": 50,
    "DateLastStatusUpdate": "2020-10-28T05:38:00Z",
    "DataQualityLevel": 1,
    "DateCreated": "2020-10-25T05:27:00Z",
    "SubmissionStatusTypeID": 200
}