{
    "IsRecentlyVerified": false,
    "ID": 34605,
    "UUID": "F93D39E6-24C9-4151-97F2-B53D8A3CF31E",
    "DataProviderID": 26,
    "DataProvidersReference": "46777",
    "OperatorID": 73,
    "OperatorsReference": "EV-Box EVB-P1412116",
    "UsageCost": "0.00 jaarabonnement",
    "AddressInfo": {
        "ID": 34951,
        "Title": "Walenburgerweg 30B",
        "AddressLine1": "Walenburgerweg 30B",
        "Town": "Rotterdam",
        "Postcode": "3033 AC",
        "CountryID": 159,
        "Latitude": 51.93057,
        "Longitude": 4.46763,
        "RelatedURL": "http://www.ev-box.nl",
        "DistanceUnit": 0
    },
    "Connections": [
        {
            "ID": 38116,
            "ConnectionTypeID": 25,
            "LevelID": 2,
            "PowerKW": 11,
            "CurrentTypeID": 10
        },
        {
            "ID": 47402,
            "ConnectionTypeID": 25,
            "LevelID": 2,
            "PowerKW": 11,
            "CurrentTypeID": 10
        }
    ],
    "NumberOfPoints": 1,
    "StatusTypeID": 50,
    "DateLastStatusUpdate": "2016-06-04T02:42:00Z",
    "DataQualityLevel": 3,
    "DateCreated": "2015-01-09T06:04:00Z",
    "SubmissionStatusTypeID": 100
}