{
    "IsRecentlyVerified": false,
    "ID": 181328,
    "UUID": "2D0EEF2C-5C24-446F-ACDA-B0BFE6931D1D",
    "DataProviderID": 29,
    "DataProvidersReference": "18159",
    "OperatorID": 220,
    "AddressInfo": {
        "ID": 181687,
        "Title": "Eva-Rühmkorf-Straße 11",
        "AddressLine1": "Eva-Rühmkorf-Straße 11",
        "Town": "Hamburg",
        "Postcode": "22765",
        "CountryID": 87,
        "Latitude": 53.56168,
        "Longitude": 9.93822,
        "DistanceUnit": 0
    },
    "Connections": [
        {
            "ID": 285505,
            "ConnectionTypeID": 28,
            "StatusTypeID": 50,
            "LevelID": 2,
            "PowerKW": 22,
            "CurrentTypeID": 20
        },
        {
            "ID": 285506,
            "ConnectionTypeID": 25,
            "StatusTypeID": 50,
            "LevelID": 2,
            "PowerKW": 22,
            "CurrentTypeID": 20
        },
        {
            "ID": 301681,
            "ConnectionTypeID": 28,
            "StatusTypeID": 50,
            "LevelID": 2,
            "PowerKW": 22,
            "CurrentTypeID": 20
        },
        {
            "ID": 301682,
            "ConnectionTypeID": 25,
            "StatusTypeID": 50,
            "LevelID": 2,
            "PowerKW": 22,
            "CurrentTypeID": 20
        }
    ],
    "StatusTypeID": 50,
    "DateLastStatusUpdate": "2021-07-12T02:51:00Z",
    "MetadataValues": [
        {
            "ID": 13622,
            "MetadataFieldID": 4,
            "ItemValue": "Data from the German chargepoint registry provided by Bundesnetzagentur.de under the CC-BY 4.0 license"
        }
    ],
    "DataQualityLevel": 3,
    "DateCreated": "2021-07-08T10:01:00Z",
    "SubmissionStatusTypeID": 100
}