{
    "IsRecentlyVerified": false,
    "ID": 25739,
    "UUID": "880C86E9-3FBB-4BCB-8298-98764DB48597",
    "DataProviderID": 1,
    "OperatorID": 1,
    "UsageTypeID": 1,
    "AddressInfo": {
        "ID": 26085,
        "Title": "AELP Office",
        "AddressLine1": "5601 Tonsgard Ct",
        "Town": "Juneau",
        "StateOrProvince": "AK",
        "Postcode": "99801",
        "CountryID": 2,
        "Latitude": 58.354399,
        "Longitude": -134.4975498,
        "ContactTelephone1": "(907) 780-2222",
        "AccessComments": "Local power company, they plug in a Volt regularly and will likely unplug it so you can charge.",
        "RelatedURL": "http://www.aelp.com",
        "DistanceUnit": 0
    },
    "Connections": [],
    "NumberOfPoints": 1,
    "StatusTypeID": 50,
    "DateLastStatusUpdate": "2014-11-17T12:48:00Z",
    "DataQualityLevel": 1,
    "DateCreated": "2014-11-17T08:35:00Z",
    "SubmissionStatusTypeID": 200
}