{
    "IsRecentlyVerified": false,
    "ID": 185013,
    "UUID": "16370838-0754-401A-AC73-F5EB6020E5F6",
    "DataProviderID": 29,
    "DataProvidersReference": "15969",
    "OperatorID": 220,
    "AddressInfo": {
        "ID": 185372,
        "Title": "Oelkersallee 1",
        "AddressLine1": "Oelkersallee 1",
        "Town": "Hamburg",
        "Postcode": "22769",
        "CountryID": 87,
        "Latitude": 53.56183,
        "Longitude": 9.95388,
        "DistanceUnit": 0
    },
    "Connections": [
        {
            "ID": 293975,
            "ConnectionTypeID": 28,
            "StatusTypeID": 50,
            "LevelID": 2,
            "PowerKW": 22,
            "CurrentTypeID": 10
        },
        {
            "ID": 293976,
            "ConnectionTypeID": 28,
            "StatusTypeID": 50,
            "LevelID": 2,
            "PowerKW": 22,
            "CurrentTypeID": 10
        }
    ],
    "StatusTypeID": 50,
    "DateLastStatusUpdate": "2021-07-09T03:30:00Z",
    "MetadataValues": [
        {
            "ID": 17304,
            "MetadataFieldID": 4,
            "ItemValue": "Data from the German chargepoint registry provided by Bundesnetzagentur.de under the CC-BY 4.0 license"
        }
    ],
    "DataQualityLevel": 3,
    "DateCreated": "2021-07-08T10:06:00Z",
    "SubmissionStatusTypeID": 100
}