{
    "IsRecentlyVerified": false,
    "ID": 142736,
    "UUID": "32DDA369-B500-40E4-97F3-93EFD808B14B",
    "DataProviderID": 2,
    "DataProvidersReference": "147221",
    "OperatorID": 5,
    "UsageTypeID": 1,
    "AddressInfo": {
        "ID": 143088,
        "Title": "MIDD TOWN HALL",
        "AddressLine1": "350 E Main Rd",
        "Town": "Middletown",
        "StateOrProvince": "RI",
        "Postcode": "02842",
        "CountryID": 2,
        "Latitude": 41.520687,
        "Longitude": -71.289113,
        "ContactTelephone1": "888-758-4389",
        "AccessComments": "24 hours daily",
        "RelatedURL": "http://www.chargepoint.com/",
        "DistanceUnit": 0
    },
    "Connections": [
        {
            "ID": 198942,
            "ConnectionTypeID": 1,
            "LevelID": 2,
            "Amps": 16,
            "Voltage": 230,
            "PowerKW": 3.7,
            "CurrentTypeID": 10,
            "Quantity": 4
        }
    ],
    "StatusTypeID": 50,
    "DateLastStatusUpdate": "2020-06-26T03:04:00Z",
    "DataQualityLevel": 3,
    "DateCreated": "2019-12-24T09:18:00Z",
    "SubmissionStatusTypeID": 100
}