{
    "IsRecentlyVerified": false,
    "ID": 145587,
    "UUID": "E14842AE-3182-46F8-8001-E4C457F09A30",
    "DataProviderID": 2,
    "DataProvidersReference": "129924",
    "OperatorID": 89,
    "UsageTypeID": 1,
    "AddressInfo": {
        "ID": 145939,
        "Title": "620 Superior St.",
        "AddressLine1": "620 Superior Street",
        "Town": "Victoria",
        "StateOrProvince": "BC",
        "Postcode": "V8V 2P8",
        "CountryID": 44,
        "Latitude": 48.41851,
        "Longitude": -123.367778,
        "ContactTelephone1": "888-356-8911",
        "AccessComments": "24 hours daily",
        "RelatedURL": "https://flo.ca/",
        "DistanceUnit": 0
    },
    "Connections": [
        {
            "ID": 202298,
            "ConnectionTypeID": 1,
            "LevelID": 2,
            "Amps": 16,
            "Voltage": 230,
            "PowerKW": 3.7,
            "CurrentTypeID": 10,
            "Quantity": 4
        }
    ],
    "StatusTypeID": 50,
    "DateLastStatusUpdate": "2020-06-26T03:11:00Z",
    "DataQualityLevel": 3,
    "DateCreated": "2019-12-24T09:25:00Z",
    "SubmissionStatusTypeID": 100
}