{
    "UserComments": [
        {
            "ID": 4816,
            "ChargePointID": 30860,
            "CommentTypeID": 10,
            "UserName": "Pudderjagar",
            "Comment": "Drives av Fortum. Multistandard, Maks 22 kw AC. Lader Renault Zoe",
            "DateCreated": "2015-07-01T20:33:33.58Z",
            "User": {
                "ID": 4803,
                "Username": "Pudderjagar"
            },
            "CheckinStatusTypeID": 10
        }
    ],
    "MediaItems": [
        {
            "ID": 1626,
            "ChargePointID": 30860,
            "ItemURL": "https://s3-ap-southeast-2.amazonaws.com/openchargemap/images/NO/OCM30860/OCM-30860.orig.2015070120284823.jpg",
            "ItemThumbnailURL": "https://s3-ap-southeast-2.amazonaws.com/openchargemap/images/NO/OCM30860/OCM-30860.thmb.2015070120284823.jpg",
            "Comment": "Ladaren sett frå innkjøringa",
            "IsEnabled": true,
            "IsVideo": false,
            "IsFeaturedItem": false,
            "IsExternalResource": false,
            "User": {
                "ID": 4803,
                "Username": "Pudderjagar"
            },
            "DateCreated": "2015-07-01T20:29:00Z"
        }
    ],
    "IsRecentlyVerified": false,
    "ID": 30860,
    "UUID": "365BFCB3-7E28-49E7-B34F-49B9B597CF8C",
    "DataProviderID": 1,
    "DataProvidersReference": "2095",
    "AddressInfo": {
        "ID": 31206,
        "Title": "Møller Bil Bergen",
        "AddressLine1": "Litleåsveien 59",
        "Town": "NYBORG",
        "StateOrProvince": "Vestland",
        "Postcode": "5132",
        "CountryID": 168,
        "Latitude": 60.46666,
        "Longitude": 5.33946,
        "AccessComments": "På p-plassen utenfor Møller Bil",
        "DistanceUnit": 0
    },
    "Connections": [
        {
            "ID": 34089,
            "ConnectionTypeID": 0,
            "Reference": "1",
            "LevelID": 2,
            "Amps": 32,
            "Voltage": 400,
            "PowerKW": 22,
            "Comments": "Mode 3"
        },
        {
            "ID": 89058,
            "ConnectionTypeID": 0,
            "Reference": "2",
            "LevelID": 2,
            "Amps": 100,
            "Voltage": 500,
            "PowerKW": 50,
            "Comments": "Mode 4"
        }
    ],
    "NumberOfPoints": 2,
    "DateLastStatusUpdate": "2020-05-26T08:24:00Z",
    "DataQualityLevel": 2,
    "DateCreated": "2014-12-09T09:01:00Z",
    "SubmissionStatusTypeID": 100
}