{
    "IsRecentlyVerified": false,
    "ID": 36341,
    "UUID": "D0EF89C6-8977-4491-9305-4A2429FF13D7",
    "DataProviderID": 26,
    "DataProvidersReference": "47562",
    "OperatorID": 178,
    "OperatorsReference": "EVnetNL AL715",
    "UsageCost": "0.00 jaarabonnement",
    "AddressInfo": {
        "ID": 36687,
        "Title": "Kooikersplein",
        "AddressLine1": "Kooikersplein",
        "Town": "Zoeterwoude",
        "Postcode": "2382 EG",
        "CountryID": 159,
        "Latitude": 52.143078,
        "Longitude": 4.523053,
        "ContactTelephone1": "0800-3522365",
        "RelatedURL": "http://www.evnet.nl",
        "DistanceUnit": 0
    },
    "Connections": [
        {
            "ID": 39852,
            "ConnectionTypeID": 25,
            "LevelID": 2,
            "PowerKW": 11,
            "CurrentTypeID": 10
        }
    ],
    "NumberOfPoints": 2,
    "StatusTypeID": 50,
    "DateLastStatusUpdate": "2016-06-04T02:50:00Z",
    "DataQualityLevel": 3,
    "DateCreated": "2015-01-09T06:05:00Z",
    "SubmissionStatusTypeID": 100
}