{
    "IsRecentlyVerified": false,
    "ID": 123011,
    "UUID": "A19D8DCE-A64F-4D3F-B21F-6E4969BE334A",
    "DataProviderID": 2,
    "DataProvidersReference": "60418",
    "OperatorID": 5,
    "UsageTypeID": 1,
    "AddressInfo": {
        "ID": 123357,
        "Title": "HENDRICK BMW NL",
        "AddressLine1": "Hendrick Way",
        "Town": "Charlotte",
        "StateOrProvince": "NC",
        "Postcode": "28269",
        "CountryID": 2,
        "Latitude": 35.3686708,
        "Longitude": -80.8319098,
        "ContactTelephone1": "888-758-4389",
        "AccessComments": "24 hours daily",
        "RelatedURL": "http://www.chargepoint.com/",
        "DistanceUnit": 0
    },
    "Connections": [
        {
            "ID": 172946,
            "ConnectionTypeID": 1,
            "LevelID": 2,
            "Amps": 16,
            "Voltage": 230,
            "PowerKW": 3.7,
            "CurrentTypeID": 10,
            "Quantity": 2
        }
    ],
    "DateLastStatusUpdate": "2020-06-26T02:58:00Z",
    "DataQualityLevel": 3,
    "DateCreated": "2019-04-06T05:03:00Z",
    "SubmissionStatusTypeID": 100
}