{
    "IsRecentlyVerified": false,
    "ID": 65253,
    "UUID": "8436E59D-9909-4F09-8617-91C70EEBC99F",
    "DataProviderID": 1,
    "OperatorID": 167,
    "UsageTypeID": 3,
    "AddressInfo": {
        "ID": 65599,
        "Title": "Autohaus Schmidt",
        "AddressLine1": "Industriestraße 4",
        "Town": "Sachsenheim",
        "StateOrProvince": "Vereinbarte Verwaltungsgemeinschaft der Stadt Bietigheim-Bissingen",
        "Postcode": "74321",
        "CountryID": 87,
        "Latitude": 48.9570384,
        "Longitude": 9.085712199999989,
        "ContactTelephone1": "+49 7147 2767720",
        "ContactEmail": "Info@Schmidt-Fahrzeuge.de",
        "AccessComments": "Kostenloses Laden während der Öffnungszeiten. Außerhalb bitte per email anmelden.",
        "RelatedURL": "http://www.schmidt-fahrzeuge.de/",
        "DistanceUnit": 0
    },
    "Connections": [
        {
            "ID": 89858,
            "ConnectionTypeID": 25,
            "StatusTypeID": 50,
            "LevelID": 2,
            "Amps": 16,
            "Voltage": 230,
            "PowerKW": 3.7,
            "CurrentTypeID": 10,
            "Quantity": 1
        },
        {
            "ID": 89859,
            "ConnectionTypeID": 28,
            "StatusTypeID": 50,
            "LevelID": 2,
            "Amps": 16,
            "Voltage": 230,
            "PowerKW": 3.7,
            "CurrentTypeID": 10,
            "Quantity": 1
        }
    ],
    "NumberOfPoints": 2,
    "StatusTypeID": 50,
    "DateLastStatusUpdate": "2016-04-25T05:41:00Z",
    "DataQualityLevel": 1,
    "DateCreated": "2016-04-25T05:41:00Z",
    "SubmissionStatusTypeID": 200
}