{
    "UserComments": [
        {
            "ID": 24174,
            "ChargePointID": 174633,
            "CommentTypeID": 10,
            "UserName": "xester",
            "Rating": 5,
            "DateCreated": "2021-04-09T18:24:24.3Z",
            "User": {
                "ID": 6169,
                "Username": "xester"
            },
            "CheckinStatusTypeID": 10,
            "IsActionedByEditor": false
        }
    ],
    "IsRecentlyVerified": false,
    "ID": 174633,
    "UUID": "FDA4B471-CDEE-4CEE-A379-905CF6521DF3",
    "DataProviderID": 1,
    "OperatorID": 1,
    "UsageTypeID": 6,
    "AddressInfo": {
        "ID": 174992,
        "Title": "Centro Porsche VIGO",
        "AddressLine1": "Carretera de Madrid, 152",
        "Town": "Vigo ",
        "StateOrProvince": "Pontevedra",
        "Postcode": "36318",
        "CountryID": 210,
        "Latitude": 42.21657324321606,
        "Longitude": -8.68761334751025,
        "ContactTelephone1": "98 647 39 35",
        "RelatedURL": "http://www.porsche.es",
        "DistanceUnit": 0
    },
    "Connections": [
        {
            "ID": 270581,
            "ConnectionTypeID": 33,
            "StatusTypeID": 150,
            "LevelID": 3,
            "Voltage": 800,
            "PowerKW": 350,
            "CurrentTypeID": 30,
            "Quantity": 2
        },
        {
            "ID": 270582,
            "ConnectionTypeID": 1036,
            "StatusTypeID": 150,
            "LevelID": 2,
            "Amps": 32,
            "Voltage": 400,
            "PowerKW": 22,
            "CurrentTypeID": 20,
            "Quantity": 2
        }
    ],
    "NumberOfPoints": 4,
    "StatusTypeID": 150,
    "DateLastStatusUpdate": "2021-04-30T18:35:00Z",
    "DataQualityLevel": 1,
    "DateCreated": "2021-04-09T18:24:00Z",
    "SubmissionStatusTypeID": 200
}