{
    "IsRecentlyVerified": false,
    "ID": 88104,
    "UUID": "795E0570-E3F9-42E7-9CD0-F430524236A0",
    "DataProviderID": 1,
    "OperatorID": 45,
    "UsageTypeID": 5,
    "UsageCost": "free",
    "AddressInfo": {
        "ID": 88450,
        "Title": "Parkhaus Gropius Passagen",
        "AddressLine1": "Johannisthaler Chaussee 300",
        "Town": "Berlin",
        "StateOrProvince": "Berlin",
        "Postcode": "12351",
        "CountryID": 87,
        "Latitude": 52.43267703476404,
        "Longitude": 13.458445779901108,
        "ContactTelephone1": "+49 30 670 666 40",
        "AccessComments": "Im Parkhaus 3 auf Parkdeck B. Einfach einstecken; Stromkosten sind in Parkgebühren inklusive.",
        "RelatedURL": "http://www.gropius-passagen.de/services/parken-auto",
        "DistanceUnit": 0
    },
    "Connections": [
        {
            "ID": 124982,
            "ConnectionTypeID": 25,
            "StatusTypeID": 50,
            "LevelID": 2,
            "Amps": 16,
            "Voltage": 400,
            "PowerKW": 11,
            "CurrentTypeID": 20,
            "Quantity": 2
        }
    ],
    "NumberOfPoints": 2,
    "StatusTypeID": 50,
    "DateLastStatusUpdate": "2017-05-22T08:11:00Z",
    "DataQualityLevel": 1,
    "DateCreated": "2017-05-22T08:11:00Z",
    "SubmissionStatusTypeID": 200
}