{
    "IsRecentlyVerified": false,
    "ID": 153367,
    "UUID": "B72A1A51-4472-444A-9060-0D22B115805C",
    "DataProviderID": 28,
    "DataProvidersReference": "FR*S10*P10040A",
    "UsageTypeID": 5,
    "AddressInfo": {
        "ID": 153720,
        "Title": "BERNON",
        "AddressLine1": "13 Rue Grande Rue 10130 BERNON",
        "CountryID": 80,
        "Latitude": 47.988229,
        "Longitude": 3.99599,
        "AccessComments": "",
        "DistanceUnit": 0
    },
    "Connections": [
        {
            "ID": 215124,
            "ConnectionTypeID": 28,
            "StatusTypeID": 50,
            "LevelID": 2,
            "PowerKW": 18,
            "CurrentTypeID": 10
        },
        {
            "ID": 215125,
            "ConnectionTypeID": 25,
            "StatusTypeID": 50,
            "LevelID": 2,
            "PowerKW": 18,
            "CurrentTypeID": 20
        },
        {
            "ID": 248515,
            "ConnectionTypeID": 28,
            "StatusTypeID": 50,
            "LevelID": 2,
            "PowerKW": 18,
            "CurrentTypeID": 10
        },
        {
            "ID": 248516,
            "ConnectionTypeID": 25,
            "StatusTypeID": 50,
            "LevelID": 2,
            "PowerKW": 18,
            "CurrentTypeID": 20
        }
    ],
    "GeneralComments": "\"Une unité = 6kWh de recharge. Utilisateur abonné : 1€/unité",
    "StatusTypeID": 50,
    "DateLastStatusUpdate": "2020-08-27T05:14:00Z",
    "DataQualityLevel": 2,
    "DateCreated": "2020-03-15T10:54:00Z",
    "SubmissionStatusTypeID": 100
}