{
    "IsRecentlyVerified": false,
    "ID": 136100,
    "UUID": "75FEF4A8-FD12-4469-8A99-62449BFC01BA",
    "DataProviderID": 18,
    "DataProvidersReference": "40297b103a00d837cb5a91a9cac23441",
    "OperatorID": 2244,
    "UsageTypeID": 4,
    "AddressInfo": {
        "ID": 136446,
        "Title": "Old Brompton Road",
        "AddressLine1": "Old Brompton Road",
        "Town": "London",
        "Postcode": "SW5 0DA",
        "CountryID": 1,
        "Latitude": 51.489572,
        "Longitude": -0.189545,
        "AccessComments": "",
        "RelatedURL": "https://www.ubitricity.com",
        "DistanceUnit": 0
    },
    "Connections": [
        {
            "ID": 190527,
            "ConnectionTypeID": 25,
            "Reference": "steob100000714",
            "StatusTypeID": 50,
            "LevelID": 2,
            "Amps": 16,
            "Voltage": 230,
            "PowerKW": 3.7,
            "CurrentTypeID": 10
        }
    ],
    "StatusTypeID": 0,
    "DateLastStatusUpdate": "2021-04-25T05:46:00Z",
    "MetadataValues": [
        {
            "ID": 5952,
            "MetadataFieldID": 4,
            "ItemValue": "Contains public sector information licensed under the Open Government Licence v2.0. http://www.nationalarchives.gov.uk/doc/open-government-licence/version/2/"
        }
    ],
    "DataQualityLevel": 3,
    "DateCreated": "2019-12-24T05:22:00Z",
    "SubmissionStatusTypeID": 100
}