{
    "IsRecentlyVerified": false,
    "ID": 125788,
    "UUID": "756CEC2E-341B-4CFA-A7B2-3FFC684CAEE3",
    "DataProviderID": 1,
    "OperatorID": 3266,
    "UsageTypeID": 4,
    "UsageCost": "6,5cent/minute",
    "AddressInfo": {
        "ID": 126134,
        "Title": "Straßburger Platz",
        "AddressLine1": "Straßburger Platz",
        "AddressLine2": "Stadtteil Brink",
        "Town": "Langenhagen",
        "StateOrProvince": "Region Hannover",
        "Postcode": "30853",
        "CountryID": 87,
        "Latitude": 52.4395712214209,
        "Longitude": 9.72702111033664,
        "AccessComments": "24/7 verfügbar",
        "DistanceUnit": 0
    },
    "Connections": [
        {
            "ID": 176273,
            "ConnectionTypeID": 25,
            "StatusTypeID": 50,
            "LevelID": 2,
            "Amps": 32,
            "Voltage": 400,
            "PowerKW": 22,
            "CurrentTypeID": 20,
            "Quantity": 2
        }
    ],
    "NumberOfPoints": 2,
    "StatusTypeID": 50,
    "DateLastStatusUpdate": "2019-04-26T11:32:00Z",
    "DataQualityLevel": 1,
    "DateCreated": "2019-04-26T11:32:00Z",
    "SubmissionStatusTypeID": 200
}