{
    "IsRecentlyVerified": false,
    "ID": 156561,
    "UUID": "6D82207E-EEB5-408C-9BA9-5E6A42FBA053",
    "DataProviderID": 19,
    "DataProvidersReference": "5719",
    "AddressInfo": {
        "ID": 156915,
        "Title": "Klippan Kommunhus",
        "AddressLine1": "Trädgårdsgatan 12",
        "Town": "KLIPPAN",
        "StateOrProvince": "SKÅNE",
        "Postcode": "26480",
        "CountryID": 216,
        "Latitude": 56.13555,
        "Longitude": 13.12796,
        "AccessComments": "Klippan Kommunhus",
        "DistanceUnit": 0
    },
    "Connections": [
        {
            "ID": 220607,
            "ConnectionTypeID": 25,
            "Reference": "1",
            "LevelID": 3,
            "Amps": 32,
            "Voltage": 400,
            "PowerKW": 22,
            "CurrentTypeID": 30
        },
        {
            "ID": 220608,
            "ConnectionTypeID": 25,
            "Reference": "2",
            "LevelID": 3,
            "Amps": 32,
            "Voltage": 400,
            "PowerKW": 22,
            "CurrentTypeID": 30
        }
    ],
    "NumberOfPoints": 2,
    "StatusTypeID": 0,
    "DateLastStatusUpdate": "2021-03-24T05:10:00Z",
    "DataQualityLevel": 2,
    "DateCreated": "2020-05-26T08:21:00Z",
    "SubmissionStatusTypeID": 100
}