{
    "IsRecentlyVerified": false,
    "ID": 33267,
    "UUID": "F5563053-882D-4FAE-B0C4-AB9A16BB336A",
    "DataProviderID": 26,
    "DataProvidersReference": "47310",
    "OperatorID": 178,
    "OperatorsReference": "EVnetNL AL466",
    "UsageCost": "0.00 jaarabonnement",
    "AddressInfo": {
        "ID": 33613,
        "Title": "Domburgseweg 13B",
        "AddressLine1": "Domburgseweg 13B",
        "Town": "Veere",
        "Postcode": "4357 BA",
        "CountryID": 159,
        "Latitude": 51.565061,
        "Longitude": 3.504488,
        "ContactTelephone1": "0800-3522365",
        "RelatedURL": "http://www.evnet.nl",
        "DistanceUnit": 0
    },
    "Connections": [
        {
            "ID": 36778,
            "ConnectionTypeID": 25,
            "LevelID": 2,
            "PowerKW": 11,
            "CurrentTypeID": 10
        }
    ],
    "NumberOfPoints": 2,
    "StatusTypeID": 50,
    "DateLastStatusUpdate": "2016-06-04T02:39:00Z",
    "DataQualityLevel": 3,
    "DateCreated": "2015-01-09T06:04:00Z",
    "SubmissionStatusTypeID": 100
}