{
    "IsRecentlyVerified": false,
    "ID": 130938,
    "UUID": "1BF6126D-3B40-4EEC-966F-195A604DCB2F",
    "DataProviderID": 1,
    "OperatorID": 45,
    "UsageTypeID": 6,
    "UsageCost": "Free for clients of the hotel",
    "AddressInfo": {
        "ID": 131284,
        "Title": "Hotel Italia Palace",
        "AddressLine1": "Viale Italia 7",
        "Town": "Lignano Sabbiadoro",
        "StateOrProvince": "Udine",
        "Postcode": "33054",
        "CountryID": 112,
        "Latitude": 45.6924786894826,
        "Longitude": 13.1491070135772,
        "ContactTelephone1": "+39 0431 71185",
        "ContactTelephone2": "+39 349 0648123",
        "ContactEmail": "info@hotelitaliapalace.it",
        "DistanceUnit": 0
    },
    "Connections": [
        {
            "ID": 183420,
            "ConnectionTypeID": 17,
            "StatusTypeID": 50,
            "LevelID": 2,
            "Amps": 32,
            "Voltage": 380,
            "PowerKW": 20,
            "CurrentTypeID": 20,
            "Quantity": 3
        }
    ],
    "NumberOfPoints": 2,
    "GeneralComments": "Charging point for our clients, booking in advance requested. No fee applied for year 2020.",
    "StatusTypeID": 50,
    "DateLastStatusUpdate": "2019-08-27T08:34:00Z",
    "DataQualityLevel": 1,
    "DateCreated": "2019-08-26T23:42:00Z",
    "SubmissionStatusTypeID": 200
}