{
    "IsRecentlyVerified": false,
    "ID": 17413,
    "UUID": "69BA497C-0333-458D-A834-F18676C10B7A",
    "DataProviderID": 22,
    "DataProvidersReference": "228A37C4A96D1CDC1659B9E2BF4B0000",
    "AddressInfo": {
        "ID": 17758,
        "Title": "日産プリンス和歌山販売田辺支店",
        "AddressLine1": "和歌山県田辺市上の山1-8-16",
        "CountryID": 114,
        "Latitude": 33.73568029,
        "Longitude": 135.3640402,
        "ContactTelephone1": "0739-22-8132",
        "DistanceUnit": 0
    },
    "Connections": [
        {
            "ID": 17654,
            "ConnectionTypeID": 2,
            "LevelID": 2,
            "Amps": 100,
            "Voltage": 480,
            "PowerKW": 48,
            "Quantity": 1
        }
    ],
    "DateLastStatusUpdate": "2013-06-29T08:58:00Z",
    "DataQualityLevel": 2,
    "DateCreated": "2013-06-29T08:58:00Z",
    "SubmissionStatusTypeID": 200
}