{
    "UserComments": [
        {
            "ID": 22513,
            "ChargePointID": 148201,
            "CommentTypeID": 10,
            "UserName": "ForumElettrico.it",
            "Comment": "Orari limitati perchè viene chiuso il cancello, visibili su app Juice Pass. Leggi la recensione completa qui > https://www.forumelettrico.it/forum/colonnina-enel-x-22-22-kw-cremona-via-del-brolo-8a-parcheggio-interno-concessionaria-mercedes-t7906.html\r\n",
            "RelatedURL": "https://www.forumelettrico.it/forum/colonnina-enel-x-22-22-kw-cremona-via-del-brolo-8a-parcheggio-interno-concessionaria-mercedes-t7906.html",
            "DateCreated": "2020-04-29T06:47:35.353Z",
            "User": {
                "ID": 11749,
                "Username": "ForumElettrico.it"
            },
            "CheckinStatusTypeID": 10,
            "IsActionedByEditor": false
        }
    ],
    "MediaItems": [
        {
            "ID": 22155,
            "ChargePointID": 148201,
            "ItemURL": "https://s3-ap-southeast-2.amazonaws.com/openchargemap/images/IT/OCM148201/OCM-148201.orig.2020042906474808.jpg",
            "ItemThumbnailURL": "https://s3-ap-southeast-2.amazonaws.com/openchargemap/images/IT/OCM148201/OCM-148201.thmb.2020042906474808.jpg",
            "Comment": "",
            "IsEnabled": true,
            "IsVideo": false,
            "IsFeaturedItem": false,
            "IsExternalResource": false,
            "User": {
                "ID": 11749,
                "Username": "ForumElettrico.it"
            },
            "DateCreated": "2020-04-29T06:48:00Z"
        },
        {
            "ID": 22156,
            "ChargePointID": 148201,
            "ItemURL": "https://s3-ap-southeast-2.amazonaws.com/openchargemap/images/IT/OCM148201/OCM-148201.orig.2020042906475388.jpg",
            "ItemThumbnailURL": "https://s3-ap-southeast-2.amazonaws.com/openchargemap/images/IT/OCM148201/OCM-148201.thmb.2020042906475388.jpg",
            "Comment": "",
            "IsEnabled": true,
            "IsVideo": false,
            "IsFeaturedItem": false,
            "IsExternalResource": false,
            "User": {
                "ID": 11749,
                "Username": "ForumElettrico.it"
            },
            "DateCreated": "2020-04-29T06:48:00Z"
        },
        {
            "ID": 22157,
            "ChargePointID": 148201,
            "ItemURL": "https://s3-ap-southeast-2.amazonaws.com/openchargemap/images/IT/OCM148201/OCM-148201.orig.2020042906480180.jpg",
            "ItemThumbnailURL": "https://s3-ap-southeast-2.amazonaws.com/openchargemap/images/IT/OCM148201/OCM-148201.thmb.2020042906480180.jpg",
            "Comment": "",
            "IsEnabled": true,
            "IsVideo": false,
            "IsFeaturedItem": false,
            "IsExternalResource": false,
            "User": {
                "ID": 11749,
                "Username": "ForumElettrico.it"
            },
            "DateCreated": "2020-04-29T06:48:00Z"
        },
        {
            "ID": 22158,
            "ChargePointID": 148201,
            "ItemURL": "https://s3-ap-southeast-2.amazonaws.com/openchargemap/images/IT/OCM148201/OCM-148201.orig.2020042906480884.jpg",
            "ItemThumbnailURL": "https://s3-ap-southeast-2.amazonaws.com/openchargemap/images/IT/OCM148201/OCM-148201.thmb.2020042906480884.jpg",
            "Comment": "",
            "IsEnabled": true,
            "IsVideo": false,
            "IsFeaturedItem": false,
            "IsExternalResource": false,
            "User": {
                "ID": 11749,
                "Username": "ForumElettrico.it"
            },
            "DateCreated": "2020-04-29T06:48:00Z"
        }
    ],
    "IsRecentlyVerified": false,
    "ID": 148201,
    "UUID": "D46CBC74-B77D-4D4D-B3F1-F457FAFD4784",
    "DataProviderID": 1,
    "OperatorID": 80,
    "UsageTypeID": 4,
    "AddressInfo": {
        "ID": 148553,
        "Title": "Crema Diesel S.p.A. | EnelX",
        "AddressLine1": "Via del Brolo",
        "AddressLine2": "San Pedrengo",
        "Town": "Cremona",
        "StateOrProvince": "CR",
        "Postcode": "26100",
        "CountryID": 112,
        "Latitude": 45.1640986643867,
        "Longitude": 9.975906085262068,
        "ContactTelephone1": "800.069.850",
        "RelatedURL": "https://www.enelx.com/it/it/emobility",
        "DistanceUnit": 0
    },
    "Connections": [
        {
            "ID": 205757,
            "ConnectionTypeID": 25,
            "StatusTypeID": 50,
            "LevelID": 2,
            "Amps": 32,
            "Voltage": 400,
            "PowerKW": 22,
            "CurrentTypeID": 20,
            "Quantity": 2
        }
    ],
    "NumberOfPoints": 2,
    "GeneralComments": "Lun-Ven 08.00-12.00/14.00-18.00 Sab 08.00-12.00 Dom Chiuso",
    "StatusTypeID": 50,
    "DateLastStatusUpdate": "2020-04-29T06:48:00Z",
    "DataQualityLevel": 1,
    "DateCreated": "2020-01-27T11:52:00Z",
    "SubmissionStatusTypeID": 200
}