{
    "IsRecentlyVerified": false,
    "ID": 182704,
    "UUID": "E23C9E58-ECBF-40CA-B080-50F126C9472A",
    "DataProviderID": 29,
    "DataProvidersReference": "16354,11499",
    "AddressInfo": {
        "ID": 183063,
        "Title": "Borntalstraße Parkplatz EKZ",
        "AddressLine1": "Borntalstraße Parkplatz EKZ",
        "Town": "Sondershausen",
        "Postcode": "99706",
        "CountryID": 87,
        "Latitude": 51.36365,
        "Longitude": 10.87763,
        "DistanceUnit": 0
    },
    "Connections": [
        {
            "ID": 288770,
            "ConnectionTypeID": 25,
            "StatusTypeID": 50,
            "LevelID": 2,
            "PowerKW": 22,
            "CurrentTypeID": 20
        },
        {
            "ID": 288771,
            "ConnectionTypeID": 25,
            "StatusTypeID": 50,
            "LevelID": 2,
            "PowerKW": 22,
            "CurrentTypeID": 20
        },
        {
            "ID": 288772,
            "ConnectionTypeID": 25,
            "StatusTypeID": 50,
            "LevelID": 2,
            "PowerKW": 22,
            "CurrentTypeID": 20
        },
        {
            "ID": 288773,
            "ConnectionTypeID": 25,
            "StatusTypeID": 50,
            "LevelID": 2,
            "PowerKW": 22,
            "CurrentTypeID": 20
        }
    ],
    "StatusTypeID": 50,
    "DateLastStatusUpdate": "2021-07-09T03:23:00Z",
    "MetadataValues": [
        {
            "ID": 14997,
            "MetadataFieldID": 4,
            "ItemValue": "Data from the German chargepoint registry provided by Bundesnetzagentur.de under the CC-BY 4.0 license"
        }
    ],
    "DataQualityLevel": 3,
    "DateCreated": "2021-07-08T10:03:00Z",
    "SubmissionStatusTypeID": 100
}