{
    "IsRecentlyVerified": true,
    "DateLastVerified": "2021-08-31T09:20:00Z",
    "ID": 189000,
    "UUID": "BB3F83B6-4EC9-45DF-989A-9D3739D67480",
    "DataProviderID": 1,
    "OperatorID": 1,
    "UsageTypeID": 1,
    "UsageCost": "0,32EUR/kWh + 1EUR/h",
    "AddressInfo": {
        "ID": 189359,
        "Title": "Stromquelle AM Baugeräte Raasdorf",
        "AddressLine1": "Oberes BNahnfeld 2",
        "Town": "Raasdorf",
        "StateOrProvince": "Austria",
        "Postcode": "2281",
        "CountryID": 19,
        "Latitude": 48.24083983221766,
        "Longitude": 16.591911076690394,
        "ContactTelephone1": "+43 1 9054545 0",
        "ContactTelephone2": "+43 664 2513210",
        "RelatedURL": "http://www.stromquelle.at",
        "DistanceUnit": 0
    },
    "Connections": [
        {
            "ID": 305481,
            "ConnectionTypeID": 25,
            "StatusTypeID": 50,
            "LevelID": 2,
            "Amps": 32,
            "Voltage": 400,
            "PowerKW": 22,
            "CurrentTypeID": 20,
            "Quantity": 4
        }
    ],
    "NumberOfPoints": 4,
    "StatusTypeID": 50,
    "DateLastStatusUpdate": "2021-09-01T07:57:00Z",
    "DataQualityLevel": 1,
    "DateCreated": "2021-08-31T09:20:00Z",
    "SubmissionStatusTypeID": 200
}