{
    "MediaItems": [
        {
            "ID": 12357,
            "ChargePointID": 88207,
            "ItemURL": "https://s3-ap-southeast-2.amazonaws.com/openchargemap/images/NZ/OCM88207/OCM-88207.orig.2017052409074924.jpg",
            "ItemThumbnailURL": "https://s3-ap-southeast-2.amazonaws.com/openchargemap/images/NZ/OCM88207/OCM-88207.thmb.2017052409074924.jpg",
            "Comment": "",
            "IsEnabled": true,
            "IsVideo": false,
            "IsFeaturedItem": false,
            "IsExternalResource": false,
            "User": {
                "ID": 15365,
                "Username": "sliday"
            },
            "DateCreated": "2017-05-24T09:08:00Z"
        }
    ],
    "IsRecentlyVerified": false,
    "ID": 88207,
    "UUID": "DAF46681-D471-49FA-A2F8-CE04D15D633A",
    "DataProviderID": 1,
    "OperatorID": 45,
    "UsageTypeID": 1,
    "AddressInfo": {
        "ID": 88553,
        "Title": "Renault Auckland",
        "AddressLine1": " 492 Great South Road",
        "Town": "Greenlane, Auckland",
        "Postcode": "1051",
        "CountryID": 161,
        "Latitude": -36.8927227,
        "Longitude": 174.797809,
        "DistanceUnit": 0
    },
    "Connections": [
        {
            "ID": 125109,
            "ConnectionTypeID": 25,
            "StatusTypeID": 150,
            "LevelID": 2,
            "Amps": 32,
            "Voltage": 400,
            "PowerKW": 22,
            "CurrentTypeID": 20,
            "Quantity": 2
        }
    ],
    "NumberOfPoints": 2,
    "GeneralComments": "Not ready for use yet due to construction/extension of the showroom\r\nSmall tower with 2 x 22kw Type 2 open socket",
    "StatusTypeID": 150,
    "DateLastStatusUpdate": "2017-05-24T09:14:00Z",
    "DataQualityLevel": 1,
    "DateCreated": "2017-05-24T09:07:00Z",
    "SubmissionStatusTypeID": 200
}