{
    "IsRecentlyVerified": false,
    "ID": 144331,
    "UUID": "E2E96736-6BD9-4FC1-8D8F-AC56A5E244B0",
    "DataProviderID": 2,
    "DataProvidersReference": "150392",
    "OperatorID": 90,
    "UsageTypeID": 1,
    "AddressInfo": {
        "ID": 144683,
        "Title": "Westmount - Stationnement municipal Greene",
        "AddressLine1": "1368 Av. Greene",
        "Town": "Westmount",
        "StateOrProvince": "QC",
        "Postcode": "H3Z 2B1",
        "CountryID": 44,
        "Latitude": 45.487369,
        "Longitude": -73.591274,
        "ContactTelephone1": "877-505-2674",
        "AccessComments": "24 hours daily",
        "RelatedURL": "https://lecircuitelectrique.com/",
        "DistanceUnit": 0
    },
    "Connections": [
        {
            "ID": 200827,
            "ConnectionTypeID": 1,
            "LevelID": 2,
            "Amps": 16,
            "Voltage": 230,
            "PowerKW": 3.7,
            "CurrentTypeID": 10,
            "Quantity": 2
        }
    ],
    "StatusTypeID": 50,
    "DateLastStatusUpdate": "2020-06-26T03:09:00Z",
    "DataQualityLevel": 3,
    "DateCreated": "2019-12-24T09:23:00Z",
    "SubmissionStatusTypeID": 100
}