{
    "IsRecentlyVerified": false,
    "ID": 41078,
    "UUID": "9D4B34C2-B79D-4345-98B3-BA5B786614EF",
    "DataProviderID": 1,
    "OperatorID": 45,
    "UsageTypeID": 7,
    "UsageCost": "0",
    "AddressInfo": {
        "ID": 41424,
        "Title": "Euronics XXL",
        "AddressLine1": "Celler Straße 58",
        "Town": "Hermannsburg",
        "StateOrProvince": "Landkreis Celle",
        "Postcode": "29320",
        "CountryID": 87,
        "Latitude": 52.8234822286053,
        "Longitude": 10.0777602025509,
        "ContactTelephone1": "05052 988033",
        "AccessComments": "Während der Öffnungszeiten (Mo-Fr 8:00-18:30, Sa 8:00-14:00 Uhr) kostenlos nutzbar, sonst ist der Parkplatz durch Tore verschlossen. Durch großen blauen Pfeil nach unten markierter Parkplatz rechts neben den Behindertenparkplätzen rechts neben dem Eingang. An der Info melden, um Strom freizuschalten.",
        "RelatedURL": "http://www.kaiserteam.de/",
        "DistanceUnit": 0
    },
    "Connections": [
        {
            "ID": 44828,
            "ConnectionTypeID": 25,
            "StatusTypeID": 50,
            "LevelID": 2,
            "Amps": 16,
            "Voltage": 230,
            "PowerKW": 11,
            "CurrentTypeID": 20,
            "Quantity": 1
        },
        {
            "ID": 44829,
            "ConnectionTypeID": 28,
            "StatusTypeID": 50,
            "LevelID": 2,
            "Amps": 16,
            "Voltage": 230,
            "PowerKW": 3.7,
            "CurrentTypeID": 20,
            "Quantity": 2
        }
    ],
    "NumberOfPoints": 3,
    "StatusTypeID": 50,
    "DateLastStatusUpdate": "2015-01-27T13:24:00Z",
    "DataQualityLevel": 1,
    "DateCreated": "2015-01-25T17:03:00Z",
    "SubmissionStatusTypeID": 200
}