{
    "IsRecentlyVerified": false,
    "ID": 141874,
    "UUID": "494517BC-B5A2-424D-BB72-E5BCEC4A0ECB",
    "DataProviderID": 2,
    "DataProvidersReference": "147972",
    "OperatorID": 39,
    "UsageTypeID": 1,
    "AddressInfo": {
        "ID": 142226,
        "Title": "530310 : 14201 E. Fourth Ave, LLC",
        "AddressLine1": "14201 E 4th Ave",
        "Town": "Aurora",
        "StateOrProvince": "CO",
        "Postcode": "80011",
        "CountryID": 2,
        "Latitude": 39.7227392,
        "Longitude": -104.8232211,
        "ContactTelephone1": "800-663-5633",
        "AccessComments": "MO: Not Specified; TU: Not Specified; WE: Not Specified; TH: Not Specified; FR: Not Specified; SA: Not Specified; SU: Not Specified",
        "RelatedURL": "http://www.semacharge.com/",
        "DistanceUnit": 0
    },
    "Connections": [
        {
            "ID": 197912,
            "ConnectionTypeID": 1,
            "LevelID": 2,
            "Amps": 16,
            "Voltage": 230,
            "PowerKW": 3.7,
            "CurrentTypeID": 10,
            "Quantity": 4
        }
    ],
    "StatusTypeID": 50,
    "DateLastStatusUpdate": "2020-06-26T03:02:00Z",
    "DataQualityLevel": 3,
    "DateCreated": "2019-12-24T09:16:00Z",
    "SubmissionStatusTypeID": 100
}