{
    "IsRecentlyVerified": false,
    "ID": 141675,
    "UUID": "E886B6C4-0A49-4E75-A560-FA1B32866FA3",
    "DataProviderID": 2,
    "DataProvidersReference": "143480",
    "OperatorID": 5,
    "UsageTypeID": 1,
    "AddressInfo": {
        "ID": 142027,
        "Title": "MDTA",
        "AddressLine1": "1516 Frankfurst Ave",
        "Town": "Baltimore",
        "StateOrProvince": "MD",
        "Postcode": "21226",
        "CountryID": 2,
        "Latitude": 39.240981,
        "Longitude": -76.582914,
        "ContactTelephone1": "888-758-4389",
        "AccessComments": "24 hours daily",
        "RelatedURL": "http://www.chargepoint.com/",
        "DistanceUnit": 0
    },
    "Connections": [
        {
            "ID": 197658,
            "ConnectionTypeID": 2,
            "LevelID": 3,
            "Amps": 100,
            "Voltage": 400,
            "PowerKW": 40,
            "CurrentTypeID": 30,
            "Quantity": 1
        },
        {
            "ID": 197659,
            "ConnectionTypeID": 32,
            "LevelID": 3,
            "Amps": 100,
            "Voltage": 400,
            "PowerKW": 40,
            "CurrentTypeID": 30,
            "Quantity": 1
        }
    ],
    "StatusTypeID": 50,
    "DateLastStatusUpdate": "2020-06-26T03:01:00Z",
    "DataQualityLevel": 3,
    "DateCreated": "2019-12-24T09:16:00Z",
    "SubmissionStatusTypeID": 100
}