{
    "IsRecentlyVerified": false,
    "ID": 92163,
    "UUID": "1AFFE38F-24BA-49F1-ABD5-CAEBFABD7F94",
    "DataProviderID": 1,
    "OperatorID": 45,
    "UsageTypeID": 6,
    "AddressInfo": {
        "ID": 92509,
        "Title": "Gutshaus von Bismarck",
        "AddressLine1": "Heidelbergstraße 1",
        "Town": "Heldrungen",
        "StateOrProvince": "An der Schmücke",
        "Postcode": "06577",
        "CountryID": 87,
        "Latitude": 51.30899389545731,
        "Longitude": 11.247131724853485,
        "AccessComments": "24/7 nutzbar",
        "RelatedURL": "http://www.otz.de/web/zgt/wirtschaft/detail/-/specific/Elektrotankstelle-in-Braunsroda-sorgt-fuer-Mobilitaet-587233653",
        "DistanceUnit": 0
    },
    "Connections": [
        {
            "ID": 130667,
            "ConnectionTypeID": 25,
            "StatusTypeID": 50,
            "LevelID": 2,
            "Amps": 16,
            "Voltage": 400,
            "PowerKW": 11,
            "CurrentTypeID": 20,
            "Quantity": 1
        }
    ],
    "NumberOfPoints": 1,
    "GeneralComments": "Inbetriebnahme 10/2017",
    "StatusTypeID": 50,
    "DateLastStatusUpdate": "2017-08-29T13:14:00Z",
    "DataQualityLevel": 1,
    "DateCreated": "2017-08-29T13:14:00Z",
    "SubmissionStatusTypeID": 200
}