{
    "IsRecentlyVerified": false,
    "ID": 146407,
    "UUID": "71EC2977-EDEC-4DAB-A541-FA0B2FF9FAC5",
    "DataProviderID": 1,
    "OperatorID": 1,
    "UsageTypeID": 4,
    "UsageCost": "70",
    "AddressInfo": {
        "ID": 146759,
        "Title": "Green Frontiers EV Fast Charge",
        "AddressLine1": "High Level Road",
        "AddressLine2": "Kottawa",
        "StateOrProvince": "Western Province",
        "Postcode": "10230",
        "CountryID": 211,
        "Latitude": 6.838634126249687,
        "Longitude": 79.97887803886977,
        "DistanceUnit": 0
    },
    "Connections": [
        {
            "ID": 203536,
            "ConnectionTypeID": 2,
            "StatusTypeID": 50,
            "LevelID": 3,
            "PowerKW": 40,
            "CurrentTypeID": 30
        }
    ],
    "NumberOfPoints": 2,
    "StatusTypeID": 50,
    "DateLastStatusUpdate": "2020-01-09T21:01:00Z",
    "DataQualityLevel": 1,
    "DateCreated": "2020-01-09T18:56:00Z",
    "SubmissionStatusTypeID": 200
}