{
    "UserComments": [
        {
            "ID": 24024,
            "ChargePointID": 149141,
            "CommentTypeID": 10,
            "UserName": "Simon Hewison",
            "DateCreated": "2021-03-18T12:42:07.273Z",
            "User": {
                "ID": 4575,
                "Username": "Simon Hewison"
            },
            "CheckinStatusTypeID": 10,
            "IsActionedByEditor": false
        }
    ],
    "IsRecentlyVerified": false,
    "ID": 149141,
    "UUID": "A1BB4D6F-2116-49DC-A45B-F16E2A32A922",
    "DataProviderID": 1,
    "OperatorID": 3,
    "OperatorsReference": "PG-70173,PG-84108",
    "UsageTypeID": 4,
    "UsageCost": "Free",
    "AddressInfo": {
        "ID": 149494,
        "Title": "Tesco Extra-Andover",
        "AddressLine1": "River Way",
        "Town": "Andover",
        "Postcode": "SP10 1UZ",
        "CountryID": 1,
        "Latitude": 51.216769,
        "Longitude": -1.473453,
        "DistanceUnit": 0
    },
    "Connections": [
        {
            "ID": 207105,
            "ConnectionTypeID": 25,
            "StatusTypeID": 50,
            "LevelID": 2,
            "Amps": 32,
            "Voltage": 230,
            "PowerKW": 7,
            "CurrentTypeID": 10,
            "Quantity": 4
        }
    ],
    "NumberOfPoints": 4,
    "GeneralComments": "This is an open charge unit installed at the Tesco Extra super store at River Way, Andover",
    "StatusTypeID": 50,
    "DateLastStatusUpdate": "2021-03-18T12:42:00Z",
    "DataQualityLevel": 1,
    "DateCreated": "2020-02-19T06:27:00Z",
    "SubmissionStatusTypeID": 200
}