{
    "IsRecentlyVerified": false,
    "ID": 134977,
    "UUID": "738D73F2-3AC9-4147-ABDD-2295140AAB1B",
    "DataProviderID": 1,
    "OperatorID": 3345,
    "UsageTypeID": 5,
    "AddressInfo": {
        "ID": 135323,
        "Title": "Burns Road",
        "AddressLine1": "Burns Road",
        "Town": "Harlesden",
        "Postcode": "NW10 4DT",
        "CountryID": 1,
        "Latitude": 51.539179,
        "Longitude": -0.248241,
        "RelatedURL": "https://char.gy",
        "DistanceUnit": 0
    },
    "Connections": [
        {
            "ID": 188905,
            "ConnectionTypeID": 25,
            "Reference": "238",
            "StatusTypeID": 50,
            "LevelID": 2,
            "Amps": 16,
            "Voltage": 230,
            "PowerKW": 3.7,
            "CurrentTypeID": 10
        }
    ],
    "StatusTypeID": 0,
    "DateLastStatusUpdate": "2019-12-03T14:29:00Z",
    "MetadataValues": [
        {
            "ID": 5318,
            "MetadataFieldID": 4,
            "ItemValue": "Contains public sector information licensed under the Open Government Licence v2.0. http://www.nationalarchives.gov.uk/doc/open-government-licence/version/2/"
        }
    ],
    "DataQualityLevel": 3,
    "DateCreated": "2019-12-03T13:42:00Z",
    "SubmissionStatusTypeID": 100
}