{
    "IsRecentlyVerified": false,
    "ID": 102845,
    "UUID": "DEA35F10-2CC2-4980-A16B-66E2CD03863E",
    "DataProviderID": 2,
    "DataProvidersReference": "92399",
    "OperatorID": 5,
    "UsageTypeID": 1,
    "AddressInfo": {
        "ID": 103191,
        "Title": "GRAPE WAY",
        "AddressLine1": "576 S Foxpointe Dr",
        "Town": "State College",
        "StateOrProvince": "PA",
        "Postcode": "16801",
        "CountryID": 2,
        "Latitude": 40.7684017,
        "Longitude": -77.9013426,
        "ContactTelephone1": "888-758-4389",
        "AccessComments": "24 hours daily",
        "RelatedURL": "http://www.chargepoint.com/",
        "DistanceUnit": 0
    },
    "Connections": [
        {
            "ID": 144986,
            "ConnectionTypeID": 1,
            "LevelID": 2,
            "Amps": 16,
            "Voltage": 230,
            "PowerKW": 3.7,
            "CurrentTypeID": 10,
            "Quantity": 2
        }
    ],
    "DateLastStatusUpdate": "2020-06-26T03:03:00Z",
    "DataQualityLevel": 3,
    "DateCreated": "2018-04-21T04:13:00Z",
    "SubmissionStatusTypeID": 100
}