{
    "IsRecentlyVerified": false,
    "ID": 144857,
    "UUID": "D51F29A1-513B-4AB6-B3A1-C57FE9C53485",
    "DataProviderID": 2,
    "DataProvidersReference": "130923",
    "OperatorID": 90,
    "UsageTypeID": 1,
    "AddressInfo": {
        "ID": 145209,
        "Title": "Mirabel - Centre culturel Patrick-Lepage",
        "AddressLine1": "9950 Boulevard de St Canut",
        "Town": "Mirabel",
        "StateOrProvince": "QC",
        "Postcode": "J7N 1K1",
        "CountryID": 44,
        "Latitude": 45.716447,
        "Longitude": -74.0832,
        "ContactTelephone1": "877-505-2674",
        "AccessComments": "24 hours daily",
        "RelatedURL": "https://lecircuitelectrique.com/",
        "DistanceUnit": 0
    },
    "Connections": [
        {
            "ID": 201402,
            "ConnectionTypeID": 1,
            "LevelID": 2,
            "Amps": 16,
            "Voltage": 230,
            "PowerKW": 3.7,
            "CurrentTypeID": 10,
            "Quantity": 1
        }
    ],
    "StatusTypeID": 50,
    "DateLastStatusUpdate": "2020-06-26T03:09:00Z",
    "DataQualityLevel": 3,
    "DateCreated": "2019-12-24T09:23:00Z",
    "SubmissionStatusTypeID": 100
}