{
    "IsRecentlyVerified": false,
    "ID": 84773,
    "UUID": "7145212F-C7B4-4294-BD47-54D0757C3F4F",
    "DataProviderID": 1,
    "OperatorID": 3266,
    "UsageTypeID": 4,
    "AddressInfo": {
        "ID": 85119,
        "Title": "Bundesministerium für wirtschaftliche Zusammenarbeit ",
        "AddressLine1": "Stresemannstraße 90",
        "AddressLine2": "Stadtteil Kreuzberg",
        "Town": "Berlin",
        "StateOrProvince": "Berlin",
        "Postcode": "10963",
        "CountryID": 87,
        "Latitude": 52.50510999999999,
        "Longitude": 13.381920000000036,
        "AccessComments": "Freischaltung über Webadresse https://www.wallb-e.cloud/",
        "DistanceUnit": 0
    },
    "Connections": [
        {
            "ID": 120435,
            "ConnectionTypeID": 25,
            "StatusTypeID": 50,
            "LevelID": 2,
            "Amps": 32,
            "Voltage": 400,
            "PowerKW": 22,
            "CurrentTypeID": 20,
            "Quantity": 2
        }
    ],
    "NumberOfPoints": 2,
    "StatusTypeID": 50,
    "DateLastStatusUpdate": "2017-03-15T06:47:00Z",
    "DataQualityLevel": 1,
    "DateCreated": "2017-03-15T06:47:00Z",
    "SubmissionStatusTypeID": 200
}