{
    "IsRecentlyVerified": false,
    "ID": 38700,
    "UUID": "79CBB4F0-43CA-46DC-9CD9-2BDEEEBD2A2C",
    "DataProviderID": 26,
    "DataProvidersReference": "52944",
    "OperatorID": 157,
    "OperatorsReference": "NewMotion ICUCOMPACT002074",
    "UsageCost": "0.00 jaarabonnement",
    "AddressInfo": {
        "ID": 39046,
        "Title": "Oude Hoornseweg 21",
        "AddressLine1": "Oude Hoornseweg 21",
        "Town": "Medemblik",
        "Postcode": "1687 NA",
        "CountryID": 159,
        "Latitude": 52.6788940429688,
        "Longitude": 5.02907752990723,
        "ContactTelephone1": "088 0109500",
        "RelatedURL": "http://thenewmotion.nl/",
        "DistanceUnit": 0
    },
    "Connections": [
        {
            "ID": 42211,
            "ConnectionTypeID": 25,
            "LevelID": 2,
            "PowerKW": 11,
            "CurrentTypeID": 10
        }
    ],
    "NumberOfPoints": 1,
    "StatusTypeID": 50,
    "DateLastStatusUpdate": "2016-06-04T02:55:00Z",
    "DataQualityLevel": 3,
    "DateCreated": "2015-01-09T06:08:00Z",
    "SubmissionStatusTypeID": 100
}