{
    "IsRecentlyVerified": false,
    "ID": 178745,
    "UUID": "63C6270F-BA57-45EB-A682-7B2F2176202A",
    "DataProviderID": 29,
    "DataProvidersReference": "19129,13130",
    "AddressInfo": {
        "ID": 179104,
        "Title": "Schwieberdinger Str. 140",
        "AddressLine1": "Schwieberdinger Str. 140",
        "Town": "Ludwigsburg",
        "Postcode": "71636",
        "CountryID": 87,
        "Latitude": 48.8904761477977,
        "Longitude": 9.15821162448481,
        "DistanceUnit": 0
    },
    "Connections": [
        {
            "ID": 279603,
            "ConnectionTypeID": 33,
            "StatusTypeID": 50,
            "LevelID": 3,
            "PowerKW": 62.5,
            "CurrentTypeID": 30
        },
        {
            "ID": 279604,
            "ConnectionTypeID": 25,
            "StatusTypeID": 50,
            "LevelID": 2,
            "PowerKW": 22,
            "CurrentTypeID": 20
        },
        {
            "ID": 279605,
            "ConnectionTypeID": 25,
            "StatusTypeID": 50,
            "LevelID": 2,
            "PowerKW": 22,
            "CurrentTypeID": 20
        }
    ],
    "StatusTypeID": 0,
    "DateLastStatusUpdate": "2021-07-09T03:14:00Z",
    "MetadataValues": [
        {
            "ID": 11039,
            "MetadataFieldID": 4,
            "ItemValue": "Data from the German chargepoint registry provided by Bundesnetzagentur.de under the CC-BY 4.0 license"
        }
    ],
    "DataQualityLevel": 3,
    "DateCreated": "2021-07-08T09:50:00Z",
    "SubmissionStatusTypeID": 100
}