{
    "MediaItems": [
        {
            "ID": 19411,
            "ChargePointID": 131219,
            "ItemURL": "https://s3-ap-southeast-2.amazonaws.com/openchargemap/images/IT/OCM131219/OCM-131219.orig.2019083015483519.jpg",
            "ItemThumbnailURL": "https://s3-ap-southeast-2.amazonaws.com/openchargemap/images/IT/OCM131219/OCM-131219.thmb.2019083015483519.jpg",
            "Comment": "",
            "IsEnabled": true,
            "IsVideo": false,
            "IsFeaturedItem": false,
            "IsExternalResource": false,
            "User": {
                "ID": 19496,
                "Username": "ECOGY"
            },
            "DateCreated": "2019-08-30T15:49:00Z"
        },
        {
            "ID": 19410,
            "ChargePointID": 131219,
            "ItemURL": "https://s3-ap-southeast-2.amazonaws.com/openchargemap/images/IT/OCM131219/OCM-131219.orig.2019083015481093.png",
            "ItemThumbnailURL": "https://s3-ap-southeast-2.amazonaws.com/openchargemap/images/IT/OCM131219/OCM-131219.thmb.2019083015481093.png",
            "Comment": "",
            "IsEnabled": true,
            "IsVideo": false,
            "IsFeaturedItem": false,
            "IsExternalResource": false,
            "User": {
                "ID": 19496,
                "Username": "ECOGY"
            },
            "DateCreated": "2019-08-30T15:48:00Z"
        },
        {
            "ID": 19409,
            "ChargePointID": 131219,
            "ItemURL": "https://s3-ap-southeast-2.amazonaws.com/openchargemap/images/IT/OCM131219/OCM-131219.orig.2019083015470283.png",
            "ItemThumbnailURL": "https://s3-ap-southeast-2.amazonaws.com/openchargemap/images/IT/OCM131219/OCM-131219.thmb.2019083015470283.png",
            "Comment": "",
            "IsEnabled": true,
            "IsVideo": false,
            "IsFeaturedItem": false,
            "IsExternalResource": false,
            "User": {
                "ID": 19496,
                "Username": "ECOGY"
            },
            "DateCreated": "2019-08-30T15:47:00Z"
        }
    ],
    "IsRecentlyVerified": false,
    "ID": 131219,
    "UUID": "A5EE750B-234B-496A-83E2-A7F5032C5F37",
    "DataProviderID": 1,
    "OperatorID": 45,
    "UsageTypeID": 5,
    "UsageCost": "0,30 Euro/ kWh",
    "AddressInfo": {
        "ID": 131565,
        "Title": "Gasthof Laurin ***",
        "AddressLine1": "St.-Georg-Straße 52",
        "Town": "Tiers am Rosengarten",
        "StateOrProvince": "Bozen",
        "Postcode": "39050 ",
        "CountryID": 112,
        "Latitude": 46.4660524257689,
        "Longitude": 11.5305090869315,
        "ContactTelephone1": "+39 0471 642 138",
        "ContactEmail": "info@gasthof-laurin.com",
        "AccessComments": "Für Kunden \r\nEcogy 9 kW\r\nPlugsurfing",
        "RelatedURL": "https://www.gasthof-laurin.com/",
        "DistanceUnit": 0
    },
    "Connections": [
        {
            "ID": 183744,
            "ConnectionTypeID": 25,
            "StatusTypeID": 50,
            "LevelID": 2,
            "Amps": 13,
            "Voltage": 400,
            "PowerKW": 9,
            "CurrentTypeID": 20,
            "Quantity": 1
        }
    ],
    "NumberOfPoints": 1,
    "GeneralComments": "Die Ladestation befindet sich auf dem Kundenparkplatz",
    "StatusTypeID": 50,
    "DateLastStatusUpdate": "2019-08-30T18:42:00Z",
    "DataQualityLevel": 1,
    "DateCreated": "2019-08-30T15:46:00Z",
    "SubmissionStatusTypeID": 200
}