{
    "IsRecentlyVerified": false,
    "ID": 123943,
    "UUID": "21B69F66-1A34-43D0-A882-8BA2F22E5390",
    "DataProviderID": 2,
    "DataProvidersReference": "88524",
    "OperatorID": 5,
    "UsageTypeID": 1,
    "AddressInfo": {
        "ID": 124289,
        "Title": "FACEBOOK",
        "AddressLine1": "164 Jefferson Dr. MPK 28",
        "Town": "Menlo Park",
        "StateOrProvince": "CA",
        "Postcode": "94025",
        "CountryID": 2,
        "Latitude": 37.481634,
        "Longitude": -122.172448,
        "ContactTelephone1": "888-758-4389",
        "AccessComments": "24 hours daily",
        "RelatedURL": "http://www.chargepoint.com/",
        "DistanceUnit": 0
    },
    "Connections": [
        {
            "ID": 173979,
            "ConnectionTypeID": 1,
            "LevelID": 2,
            "Amps": 16,
            "Voltage": 230,
            "PowerKW": 3,
            "CurrentTypeID": 10,
            "Quantity": 10
        }
    ],
    "DateLastStatusUpdate": "2019-12-24T09:13:00Z",
    "DataQualityLevel": 3,
    "DateCreated": "2019-04-06T05:03:00Z",
    "SubmissionStatusTypeID": 100
}