{
    "IsRecentlyVerified": false,
    "ID": 29445,
    "UUID": "920FA6ED-955B-43D9-B986-1F661C117DEE",
    "DataProviderID": 2,
    "DataProvidersReference": "55778",
    "OperatorID": 5,
    "UsageTypeID": 1,
    "AddressInfo": {
        "ID": 29791,
        "Title": "THE NOBLE",
        "AddressLine1": "4301 Stone Way N",
        "Town": "Seattle",
        "StateOrProvince": "WA",
        "Postcode": "98103",
        "CountryID": 2,
        "Latitude": 47.6595352,
        "Longitude": -122.3425815,
        "ContactTelephone1": "888-758-4389",
        "AccessComments": "24 hours daily",
        "RelatedURL": "http://www.chargepoint.com/",
        "DistanceUnit": 0
    },
    "Connections": [
        {
            "ID": 32382,
            "ConnectionTypeID": 1,
            "LevelID": 2,
            "Amps": 16,
            "Voltage": 230,
            "PowerKW": 3,
            "CurrentTypeID": 10,
            "Quantity": 2
        }
    ],
    "DateLastStatusUpdate": "2019-12-24T09:24:00Z",
    "DataQualityLevel": 3,
    "DateCreated": "2014-11-28T03:39:00Z",
    "SubmissionStatusTypeID": 100
}