{
    "IsRecentlyVerified": false,
    "ID": 65309,
    "UUID": "8E6C14C5-BCA5-4565-A836-8038E7596681",
    "DataProviderID": 1,
    "DataProvidersReference": "3120",
    "AddressInfo": {
        "ID": 65655,
        "Title": "Furuvik pendlarparkering",
        "AddressLine1": "Södra Kungsgatan 244 ",
        "Town": "FURUVIK",
        "StateOrProvince": "GÄVLEBORG",
        "Postcode": "81491",
        "CountryID": 216,
        "Latitude": 60.65097,
        "Longitude": 17.33157,
        "AccessComments": "Pendlarparkering Furuvik",
        "DistanceUnit": 0
    },
    "Connections": [
        {
            "ID": 89967,
            "ConnectionTypeID": 0,
            "Reference": "1",
            "LevelID": 2,
            "Amps": 32,
            "Voltage": 400,
            "PowerKW": 22,
            "Comments": "Mode 3"
        },
        {
            "ID": 89968,
            "ConnectionTypeID": 0,
            "Reference": "2",
            "LevelID": 2,
            "Amps": 32,
            "Voltage": 400,
            "PowerKW": 22,
            "Comments": "Mode 3"
        }
    ],
    "NumberOfPoints": 2,
    "DateLastStatusUpdate": "2020-05-26T08:24:00Z",
    "DataQualityLevel": 2,
    "DateCreated": "2016-04-26T12:27:00Z",
    "SubmissionStatusTypeID": 100
}