{
    "IsRecentlyVerified": false,
    "ID": 81473,
    "UUID": "76128AB8-EB62-4143-83D5-EC12AC5C8529",
    "DataProviderID": 1,
    "OperatorID": 23,
    "OperatorsReference": "24191",
    "UsageTypeID": 4,
    "UsageCost": "Free",
    "AddressInfo": {
        "ID": 81819,
        "Title": "Wyndham Garden Hotels Colima",
        "AddressLine1": "1100 Lat. Tercera Anillo Periferico Residencial Esmeralda Nte",
        "Town": "Colima",
        "StateOrProvince": "Colima",
        "Postcode": "28010",
        "CountryID": 146,
        "Latitude": 19.25937,
        "Longitude": -103.690796,
        "ContactTelephone1": "+52 312 323 6666",
        "DistanceUnit": 0
    },
    "Connections": [
        {
            "ID": 116209,
            "ConnectionTypeID": 30,
            "StatusTypeID": 50,
            "LevelID": 2,
            "PowerKW": 18,
            "CurrentTypeID": 20,
            "Quantity": 2
        }
    ],
    "NumberOfPoints": 2,
    "GeneralComments": "2 Tesla Connectors, up to 18kW.Available for customers. Please see front desk.",
    "StatusTypeID": 50,
    "DateLastStatusUpdate": "2017-02-02T17:22:00Z",
    "DataQualityLevel": 1,
    "DateCreated": "2017-02-02T17:22:00Z",
    "SubmissionStatusTypeID": 200
}