{
    "IsRecentlyVerified": false,
    "ID": 112961,
    "UUID": "1370CFD6-52CF-46C8-8C43-48EDF3B21E7E",
    "DataProviderID": 1,
    "OperatorID": 229,
    "UsageTypeID": 4,
    "UsageCost": "$0.25/kWh + $0.25/min",
    "AddressInfo": {
        "ID": 113307,
        "Title": "New World Mosgiel",
        "AddressLine1": "10 Hartstonge Avenue",
        "Town": "Mosgiel",
        "Postcode": "9024",
        "CountryID": 161,
        "Latitude": -45.872211,
        "Longitude": 170.348069,
        "DistanceUnit": 0
    },
    "Connections": [
        {
            "ID": 159103,
            "ConnectionTypeID": 33,
            "StatusTypeID": 50,
            "LevelID": 3,
            "PowerKW": 50,
            "CurrentTypeID": 30,
            "Quantity": 1
        },
        {
            "ID": 159104,
            "ConnectionTypeID": 2,
            "StatusTypeID": 50,
            "LevelID": 3,
            "PowerKW": 50,
            "CurrentTypeID": 30,
            "Quantity": 1
        }
    ],
    "NumberOfPoints": 2,
    "StatusTypeID": 50,
    "DateLastStatusUpdate": "2018-11-27T16:22:00Z",
    "DataQualityLevel": 1,
    "DateCreated": "2018-11-27T16:21:00Z",
    "SubmissionStatusTypeID": 200
}