{
    "IsRecentlyVerified": false,
    "ID": 176908,
    "UUID": "82F7E6BE-20F8-44F1-AFD0-0DC9D9805902",
    "DataProviderID": 29,
    "DataProvidersReference": "19404",
    "AddressInfo": {
        "ID": 177267,
        "Title": "Prälat-Faber-Straße 2-4",
        "AddressLine1": "Prälat-Faber-Straße 2-4",
        "Town": "Nonnweiler6.",
        "Postcode": "66620",
        "CountryID": 87,
        "Latitude": 49.60375,
        "Longitude": 6.91617,
        "DistanceUnit": 0
    },
    "Connections": [
        {
            "ID": 275401,
            "ConnectionTypeID": 25,
            "StatusTypeID": 50,
            "LevelID": 2,
            "PowerKW": 22,
            "CurrentTypeID": 20
        },
        {
            "ID": 275402,
            "ConnectionTypeID": 25,
            "StatusTypeID": 50,
            "LevelID": 2,
            "PowerKW": 22,
            "CurrentTypeID": 20
        }
    ],
    "StatusTypeID": 0,
    "DateLastStatusUpdate": "2021-07-12T02:43:00Z",
    "MetadataValues": [
        {
            "ID": 9203,
            "MetadataFieldID": 4,
            "ItemValue": "Data from the German chargepoint registry provided by Bundesnetzagentur.de under the CC-BY 4.0 license"
        }
    ],
    "DataQualityLevel": 3,
    "DateCreated": "2021-07-08T09:48:00Z",
    "SubmissionStatusTypeID": 100
}