{
    "IsRecentlyVerified": false,
    "ID": 136902,
    "UUID": "3A096A43-8FF0-4B31-B8A8-169F0546F668",
    "DataProviderID": 18,
    "DataProvidersReference": "bf232372187476bd5b8146e467fa85dc",
    "OperatorID": 20,
    "UsageTypeID": 4,
    "AddressInfo": {
        "ID": 137248,
        "Title": "Sunderland",
        "AddressLine1": "Cherry Blossom Way",
        "Town": "Sunderland",
        "Postcode": "SR5 3NT",
        "CountryID": 1,
        "Latitude": 54.918782,
        "Longitude": -1.486737,
        "AccessComments": "Cherry Blossom Way",
        "RelatedURL": "http://www.chargeyourcar.org.uk",
        "DistanceUnit": 0
    },
    "Connections": [
        {
            "ID": 191594,
            "ConnectionTypeID": 25,
            "Reference": "0",
            "StatusTypeID": 50,
            "LevelID": 2,
            "Amps": 32,
            "Voltage": 230,
            "PowerKW": 7,
            "CurrentTypeID": 10
        }
    ],
    "StatusTypeID": 0,
    "DateLastStatusUpdate": "2019-12-24T05:23:00Z",
    "MetadataValues": [
        {
            "ID": 6754,
            "MetadataFieldID": 4,
            "ItemValue": "Contains public sector information licensed under the Open Government Licence v2.0. http://www.nationalarchives.gov.uk/doc/open-government-licence/version/2/"
        }
    ],
    "DataQualityLevel": 3,
    "DateCreated": "2019-12-24T05:23:00Z",
    "SubmissionStatusTypeID": 100
}