{
    "IsRecentlyVerified": false,
    "ID": 84414,
    "UUID": "C95636F4-1982-4AE2-A06F-DC331B8A73AF",
    "DataProviderID": 1,
    "OperatorID": 45,
    "UsageTypeID": 3,
    "AddressInfo": {
        "ID": 84760,
        "Title": "Atech Antriebstechnik",
        "AddressLine1": "Stöcklstraße 9",
        "AddressLine2": "Haid",
        "Town": "Mehring",
        "StateOrProvince": "Emmerting (VGem)",
        "Postcode": "84561",
        "CountryID": 87,
        "Latitude": 48.19144,
        "Longitude": 12.778050000000007,
        "ContactTelephone1": "+49 8677-98090",
        "AccessComments": "Besucher, Kunden und Gäste können kostenlos laden. Um Voanmeldung wird gebeten. Öffnungszeiten Mo-Fr 8-17Uhr.",
        "RelatedURL": "http://www.atech-antriebstechnik.de/",
        "DistanceUnit": 0
    },
    "Connections": [
        {
            "ID": 119863,
            "ConnectionTypeID": 25,
            "StatusTypeID": 50,
            "LevelID": 2,
            "Amps": 32,
            "Voltage": 400,
            "PowerKW": 22,
            "CurrentTypeID": 20,
            "Quantity": 1
        },
        {
            "ID": 119864,
            "ConnectionTypeID": 28,
            "StatusTypeID": 50,
            "LevelID": 2,
            "Amps": 16,
            "Voltage": 230,
            "PowerKW": 3.7,
            "CurrentTypeID": 10,
            "Quantity": 1
        }
    ],
    "NumberOfPoints": 2,
    "StatusTypeID": 50,
    "DateLastStatusUpdate": "2017-02-24T06:50:00Z",
    "DataQualityLevel": 1,
    "DateCreated": "2017-02-24T06:50:00Z",
    "SubmissionStatusTypeID": 200
}