{
    "IsRecentlyVerified": false,
    "ID": 187115,
    "UUID": "B4F2DFC7-39EF-4377-AAA8-7D5ACC9A7630",
    "DataProviderID": 29,
    "DataProvidersReference": "7453",
    "OperatorID": 3403,
    "AddressInfo": {
        "ID": 187474,
        "Title": "Am Sportzentrum 5",
        "AddressLine1": "Am Sportzentrum 5",
        "Town": "Hohnstorf/Elbe",
        "Postcode": "21522",
        "CountryID": 87,
        "Latitude": 53.36395,
        "Longitude": 10.55097,
        "DistanceUnit": 0
    },
    "Connections": [
        {
            "ID": 301260,
            "ConnectionTypeID": 25,
            "StatusTypeID": 50,
            "LevelID": 2,
            "PowerKW": 22,
            "CurrentTypeID": 20
        },
        {
            "ID": 301261,
            "ConnectionTypeID": 25,
            "StatusTypeID": 50,
            "LevelID": 2,
            "PowerKW": 22,
            "CurrentTypeID": 20
        }
    ],
    "StatusTypeID": 50,
    "DateLastStatusUpdate": "2021-07-12T02:51:00Z",
    "MetadataValues": [
        {
            "ID": 19355,
            "MetadataFieldID": 4,
            "ItemValue": "Data from the German chargepoint registry provided by Bundesnetzagentur.de under the CC-BY 4.0 license"
        }
    ],
    "DataQualityLevel": 3,
    "DateCreated": "2021-07-12T02:51:00Z",
    "SubmissionStatusTypeID": 100
}