{
    "IsRecentlyVerified": false,
    "ID": 142477,
    "UUID": "5D165A3D-C0D6-42FA-8503-A1D0F6123315",
    "DataProviderID": 2,
    "DataProvidersReference": "123272",
    "OperatorID": 3372,
    "UsageTypeID": 2,
    "AddressInfo": {
        "ID": 142829,
        "Title": "Shore Towers",
        "AddressLine1": "25-40 Shore Blvd",
        "Town": "Astoria",
        "StateOrProvince": "NY",
        "Postcode": "11102",
        "CountryID": 2,
        "Latitude": 40.7765717,
        "Longitude": -73.9283585,
        "ContactTelephone1": "866-816-7584",
        "AccessComments": "24 hours daily",
        "RelatedURL": "http://evconnect.com/",
        "DistanceUnit": 0
    },
    "Connections": [
        {
            "ID": 198624,
            "ConnectionTypeID": 1,
            "LevelID": 2,
            "Amps": 16,
            "Voltage": 230,
            "PowerKW": 3.7,
            "CurrentTypeID": 10,
            "Quantity": 3
        }
    ],
    "StatusTypeID": 50,
    "DateLastStatusUpdate": "2020-06-26T03:03:00Z",
    "DataQualityLevel": 3,
    "DateCreated": "2019-12-24T09:17:00Z",
    "SubmissionStatusTypeID": 100
}