{
    "IsRecentlyVerified": false,
    "ID": 135641,
    "UUID": "6D59FAFA-DB4B-4B1C-97D4-813B779A2965",
    "DataProviderID": 18,
    "DataProvidersReference": "4a0d270645108a765824cd49bc70e64b",
    "OperatorID": 2244,
    "UsageTypeID": 5,
    "AddressInfo": {
        "ID": 135987,
        "Title": "Waldegrave Gardens",
        "AddressLine1": "Waldegrave Gardens",
        "Town": "Twickenham",
        "Postcode": "TW1 4PQ",
        "CountryID": 1,
        "Latitude": 51.438309,
        "Longitude": -0.336417,
        "AccessComments": "",
        "RelatedURL": "https://www.ubitricity.com",
        "DistanceUnit": 0
    },
    "Connections": [
        {
            "ID": 190049,
            "ConnectionTypeID": 25,
            "Reference": "suby1100001507",
            "StatusTypeID": 50,
            "LevelID": 2,
            "Amps": 16,
            "Voltage": 230,
            "PowerKW": 3.7,
            "CurrentTypeID": 10
        }
    ],
    "StatusTypeID": 0,
    "DateLastStatusUpdate": "2021-04-25T05:46:00Z",
    "MetadataValues": [
        {
            "ID": 5493,
            "MetadataFieldID": 4,
            "ItemValue": "Contains public sector information licensed under the Open Government Licence v2.0. http://www.nationalarchives.gov.uk/doc/open-government-licence/version/2/"
        }
    ],
    "DataQualityLevel": 3,
    "DateCreated": "2019-12-24T05:22:00Z",
    "SubmissionStatusTypeID": 100
}