{
    "IsRecentlyVerified": false,
    "ID": 32341,
    "UUID": "1415CC0A-1F08-42C4-95CE-A9A161C42591",
    "DataProviderID": 1,
    "OperatorID": 105,
    "OperatorsReference": "Essent EM-DE-05362032-01-00006",
    "UsageTypeID": 4,
    "AddressInfo": {
        "ID": 32687,
        "Title": "Hermann Löns Straße 9",
        "AddressLine1": "Hermann Löns Straße 9",
        "Town": "Kerpen",
        "Postcode": "50170",
        "CountryID": 87,
        "Latitude": 50.903783,
        "Longitude": 6.679267,
        "DistanceUnit": 0
    },
    "Connections": [
        {
            "ID": 35852,
            "ConnectionTypeID": 25,
            "LevelID": 2,
            "PowerKW": 11
        },
        {
            "ID": 46346,
            "ConnectionTypeID": 25,
            "LevelID": 2,
            "PowerKW": 11
        }
    ],
    "NumberOfPoints": 1,
    "StatusTypeID": 50,
    "DateLastStatusUpdate": "2015-04-13T17:26:00Z",
    "DataQualityLevel": 3,
    "DateCreated": "2015-01-09T06:03:00Z",
    "SubmissionStatusTypeID": 200
}