{
    "IsRecentlyVerified": false,
    "ID": 8285,
    "UUID": "8CE23C2E-CE41-48EC-B710-4F7A2F890FC2",
    "DataProviderID": 15,
    "DataProvidersReference": "2798",
    "OperatorID": 26,
    "AddressInfo": {
        "ID": 8182,
        "Title": "1611 Cortez Road West",
        "AddressLine1": "1611 Cortez Road West",
        "Town": "Bradenton",
        "StateOrProvince": "Fl",
        "Postcode": "34207",
        "CountryID": 2,
        "Latitude": 27.46203,
        "Longitude": -82.57794,
        "ContactTelephone1": "(941) 755-1571",
        "RelatedURL": "http://carstations.com/2798",
        "DistanceUnit": 0
    },
    "Connections": [
        {
            "ID": 5714,
            "ConnectionTypeID": 1,
            "Reference": "J1772",
            "LevelID": 2
        }
    ],
    "StatusTypeID": 0,
    "DateLastStatusUpdate": "2017-11-04T14:03:00Z",
    "DataQualityLevel": 1,
    "DateCreated": "2011-11-11T12:06:00Z",
    "SubmissionStatusTypeID": 100
}