{
    "IsRecentlyVerified": false,
    "ID": 96676,
    "UUID": "35392124-EEDB-4CBD-9417-E2EDE6AF8697",
    "DataProviderID": 2,
    "DataProvidersReference": "89740",
    "UsageTypeID": 1,
    "AddressInfo": {
        "ID": 97022,
        "Title": "Charles Center",
        "AddressLine1": "36 S Charles St",
        "Town": "Baltimore",
        "StateOrProvince": "MD",
        "Postcode": "21201",
        "CountryID": 2,
        "Latitude": 39.288039,
        "Longitude": -76.615283,
        "ContactTelephone1": "410-244-8666",
        "AccessComments": "6am-10pm M-F, 8am-5pm Sat; 24 hours daily for monthly parkers; please move vehicle after charging",
        "RelatedURL": "",
        "DistanceUnit": 0
    },
    "Connections": [
        {
            "ID": 136948,
            "ConnectionTypeID": 1,
            "LevelID": 2,
            "Amps": 16,
            "Voltage": 230,
            "PowerKW": 3.7,
            "CurrentTypeID": 10,
            "Quantity": 2
        }
    ],
    "DateLastStatusUpdate": "2020-06-26T03:01:00Z",
    "DataQualityLevel": 3,
    "DateCreated": "2017-12-29T21:01:00Z",
    "SubmissionStatusTypeID": 100
}