{
    "IsRecentlyVerified": false,
    "ID": 167995,
    "UUID": "500FAF74-BE14-4264-AB65-F3ABD87046E4",
    "DataProviderID": 1,
    "OperatorID": 1,
    "UsageTypeID": 1,
    "AddressInfo": {
        "ID": 168354,
        "Title": "Motonet Jyväskylä, Seppälä",
        "AddressLine1": "Ahjokatu 6",
        "Town": "Jyväskylä",
        "StateOrProvince": "Central Finland",
        "Postcode": "40320",
        "CountryID": 79,
        "Latitude": 62.255427816963845,
        "Longitude": 25.778407853561703,
        "DistanceUnit": 0
    },
    "Connections": [
        {
            "ID": 255049,
            "ConnectionTypeID": 25,
            "StatusTypeID": 0,
            "LevelID": 2,
            "PowerKW": 11,
            "CurrentTypeID": 20,
            "Quantity": 2
        }
    ],
    "NumberOfPoints": 2,
    "GeneralComments": "Motonet customer account needed to activate charging!",
    "StatusTypeID": 50,
    "DateLastStatusUpdate": "2020-09-19T05:28:00Z",
    "DataQualityLevel": 1,
    "DateCreated": "2020-09-18T13:28:00Z",
    "SubmissionStatusTypeID": 200
}