{
    "IsRecentlyVerified": false,
    "ID": 160595,
    "UUID": "135F3913-7541-4346-9E55-28AF54E0A324",
    "DataProviderID": 2,
    "DataProvidersReference": "151837",
    "OperatorID": 3293,
    "UsageTypeID": 1,
    "AddressInfo": {
        "ID": 160952,
        "Title": "Alderwood Mall - JC Penny",
        "AddressLine1": "3000 184th St SW",
        "Town": "Lynnwood",
        "StateOrProvince": "WA",
        "Postcode": "98037",
        "CountryID": 2,
        "Latitude": 47.830463,
        "Longitude": -122.27525,
        "ContactTelephone1": "888-264-2208",
        "AccessComments": "6am-12am daily",
        "RelatedURL": "https://voltacharging.com/",
        "DistanceUnit": 0
    },
    "Connections": [
        {
            "ID": 231072,
            "ConnectionTypeID": 1,
            "LevelID": 2,
            "Amps": 16,
            "Voltage": 230,
            "PowerKW": 3.7,
            "CurrentTypeID": 10,
            "Quantity": 2
        }
    ],
    "StatusTypeID": 50,
    "DateLastStatusUpdate": "2020-06-26T03:11:00Z",
    "DataQualityLevel": 3,
    "DateCreated": "2020-06-26T03:11:00Z",
    "SubmissionStatusTypeID": 100
}