{
    "IsRecentlyVerified": false,
    "ID": 146404,
    "UUID": "EC061A16-064B-49DF-83E7-A645E96107EB",
    "DataProviderID": 1,
    "OperatorID": 80,
    "UsageTypeID": 4,
    "AddressInfo": {
        "ID": 146756,
        "Title": "Bollengo Cossavella | EnelX",
        "AddressLine1": "Via Cossavella, 44D",
        "Town": "Bollengo",
        "StateOrProvince": "TO",
        "Postcode": "10012",
        "CountryID": 112,
        "Latitude": 45.470274123683396,
        "Longitude": 7.947992169090071,
        "RelatedURL": "https://www.enelx.com/it/it/emobility",
        "DistanceUnit": 0
    },
    "Connections": [
        {
            "ID": 203532,
            "ConnectionTypeID": 25,
            "StatusTypeID": 50,
            "LevelID": 2,
            "Amps": 32,
            "Voltage": 400,
            "PowerKW": 22,
            "CurrentTypeID": 20,
            "Quantity": 2
        }
    ],
    "NumberOfPoints": 2,
    "StatusTypeID": 50,
    "DateLastStatusUpdate": "2020-01-09T17:04:00Z",
    "DataQualityLevel": 1,
    "DateCreated": "2020-01-09T17:04:00Z",
    "SubmissionStatusTypeID": 200
}