{
    "IsRecentlyVerified": false,
    "ID": 99611,
    "UUID": "A993904D-EEE0-4064-83FA-3FBC57EB626A",
    "DataProviderID": 1,
    "OperatorID": 2244,
    "UsageTypeID": 4,
    "AddressInfo": {
        "ID": 99957,
        "Title": "Ubitricity 38-40 Queensdale Road",
        "AddressLine1": "38-40 Queensdale Road",
        "AddressLine2": "Notting Hill",
        "Town": "London",
        "StateOrProvince": "England",
        "Postcode": "W11 4SA",
        "CountryID": 1,
        "Latitude": 51.506912,
        "Longitude": -0.21361341,
        "RelatedURL": "https://www.rbkc.gov.uk/parking-transport-and-streets/parking/visitor-parking/electric-vehicles",
        "DistanceUnit": 0
    },
    "Connections": [
        {
            "ID": 140754,
            "ConnectionTypeID": 25,
            "StatusTypeID": 50,
            "LevelID": 2,
            "Amps": 16,
            "Voltage": 230,
            "PowerKW": 3.6,
            "CurrentTypeID": 10,
            "Quantity": 1
        }
    ],
    "NumberOfPoints": 1,
    "GeneralComments": "Lamp post charger. Ubitricity dongle needed.",
    "StatusTypeID": 50,
    "DateLastStatusUpdate": "2018-01-31T13:39:00Z",
    "DataQualityLevel": 1,
    "DateCreated": "2018-01-31T13:39:00Z",
    "SubmissionStatusTypeID": 200
}