{
    "IsRecentlyVerified": false,
    "ID": 113348,
    "UUID": "CB1FCC3A-F9F1-486A-B15A-906F26BA399D",
    "DataProviderID": 1,
    "OperatorID": 45,
    "UsageTypeID": 1,
    "AddressInfo": {
        "ID": 113694,
        "Title": "On Kleppsspítali",
        "AddressLine1": "Kleppagarðar",
        "Town": "Reykjavík",
        "Postcode": "104",
        "CountryID": 105,
        "Latitude": 64.1461769,
        "Longitude": -21.85047529999997,
        "DistanceUnit": 0
    },
    "Connections": [
        {
            "ID": 159626,
            "ConnectionTypeID": 1036,
            "StatusTypeID": 50,
            "LevelID": 2,
            "Amps": 32,
            "Voltage": 230,
            "PowerKW": 7.4,
            "CurrentTypeID": 10,
            "Quantity": 1
        },
        {
            "ID": 159627,
            "ConnectionTypeID": 1,
            "StatusTypeID": 50,
            "LevelID": 2,
            "Amps": 32,
            "Voltage": 230,
            "PowerKW": 7.4,
            "CurrentTypeID": 10,
            "Quantity": 1
        }
    ],
    "NumberOfPoints": 2,
    "StatusTypeID": 50,
    "DateLastStatusUpdate": "2018-12-05T20:20:00Z",
    "DataQualityLevel": 1,
    "DateCreated": "2018-12-04T10:50:00Z",
    "SubmissionStatusTypeID": 200
}