{
    "IsRecentlyVerified": false,
    "ID": 102403,
    "UUID": "97C4A85D-53E9-4BAA-A601-23C9D989AE68",
    "DataProviderID": 2,
    "DataProvidersReference": "92321",
    "OperatorID": 5,
    "UsageTypeID": 1,
    "AddressInfo": {
        "ID": 102749,
        "Title": "OC FAIR",
        "AddressLine1": "92-94 Fair Dr",
        "Town": "Costa Mesa",
        "StateOrProvince": "CA",
        "Postcode": "92626",
        "CountryID": 2,
        "Latitude": 33.664075,
        "Longitude": -117.901865,
        "ContactTelephone1": "888-758-4389",
        "AccessComments": "24 hours daily",
        "RelatedURL": "http://www.chargepoint.com/",
        "DistanceUnit": 0
    },
    "Connections": [
        {
            "ID": 144474,
            "ConnectionTypeID": 1,
            "LevelID": 2,
            "Amps": 16,
            "Voltage": 230,
            "PowerKW": 3,
            "CurrentTypeID": 10,
            "Quantity": 4
        }
    ],
    "DateLastStatusUpdate": "2019-04-06T04:01:00Z",
    "DataQualityLevel": 3,
    "DateCreated": "2018-04-21T04:13:00Z",
    "SubmissionStatusTypeID": 100
}