{
    "IsRecentlyVerified": false,
    "ID": 97858,
    "UUID": "34D46E8C-F2C8-4299-9D80-4A39BCE83975",
    "DataProviderID": 1,
    "OperatorID": 23,
    "OperatorsReference": "38650",
    "UsageTypeID": 4,
    "AddressInfo": {
        "ID": 98204,
        "Title": "Inter-Hôtel Roanne Hélios",
        "AddressLine1": "55 Route de Paris",
        "Town": "Mably",
        "Postcode": "42300",
        "CountryID": 80,
        "Latitude": 46.068878,
        "Longitude": 4.049142,
        "ContactTelephone1": "+33 4 77 67 29 13",
        "DistanceUnit": 0
    },
    "Connections": [
        {
            "ID": 138766,
            "ConnectionTypeID": 30,
            "StatusTypeID": 50,
            "LevelID": 2,
            "Amps": 32,
            "Voltage": 230,
            "PowerKW": 17,
            "CurrentTypeID": 20,
            "Quantity": 1
        }
    ],
    "NumberOfPoints": 1,
    "GeneralComments": "1 Tesla Connector, up to 17kW.Available to the public. Please see front desk.",
    "StatusTypeID": 50,
    "DateLastStatusUpdate": "2018-10-03T20:41:00Z",
    "DataQualityLevel": 1,
    "DateCreated": "2018-01-21T16:50:00Z",
    "SubmissionStatusTypeID": 200
}