{
    "IsRecentlyVerified": false,
    "ID": 124282,
    "UUID": "10E0BF4C-808C-41AF-BC7F-179B82AD0CD1",
    "DataProviderID": 2,
    "DataProvidersReference": "39870",
    "UsageTypeID": 7,
    "AddressInfo": {
        "ID": 124628,
        "Title": "Antioch Nissan",
        "AddressLine1": "1831 Auto Center Dr",
        "Town": "Antioch",
        "StateOrProvince": "CA",
        "Postcode": "94509",
        "CountryID": 2,
        "Latitude": 38.007799,
        "Longitude": -121.832042,
        "ContactTelephone1": "925-755-2600",
        "AccessComments": "Dealership business hours\r\nPublic - Call ahead",
        "RelatedURL": "",
        "DistanceUnit": 0
    },
    "Connections": [
        {
            "ID": 174362,
            "ConnectionTypeID": 1,
            "LevelID": 2,
            "Amps": 16,
            "Voltage": 230,
            "PowerKW": 3.7,
            "CurrentTypeID": 10,
            "Quantity": 1
        }
    ],
    "DateLastStatusUpdate": "2020-06-26T02:59:00Z",
    "DataQualityLevel": 3,
    "DateCreated": "2019-04-06T05:03:00Z",
    "SubmissionStatusTypeID": 100
}