{
    "UserComments": [
        {
            "ID": 17787,
            "ChargePointID": 87354,
            "CommentTypeID": 10,
            "UserName": "ForumElettrico.it",
            "Comment": "http://www.forumelettrico.it/forum/cervesina-pv-hotel-castello-san-gaudenzio-t1629.html\n",
            "DateCreated": "2017-10-09T13:49:40.837Z",
            "User": {
                "ID": 11749,
                "Username": "ForumElettrico.it"
            },
            "CheckinStatusTypeID": 10
        }
    ],
    "MediaItems": [
        {
            "ID": 13476,
            "ChargePointID": 87354,
            "ItemURL": "https://s3-ap-southeast-2.amazonaws.com/openchargemap/images/IT/OCM87354/OCM-87354.orig.2017100913495863.jpg",
            "ItemThumbnailURL": "https://s3-ap-southeast-2.amazonaws.com/openchargemap/images/IT/OCM87354/OCM-87354.thmb.2017100913495863.jpg",
            "Comment": "",
            "IsEnabled": true,
            "IsVideo": false,
            "IsFeaturedItem": false,
            "IsExternalResource": false,
            "User": {
                "ID": 11749,
                "Username": "ForumElettrico.it"
            },
            "DateCreated": "2017-10-09T13:50:00Z"
        }
    ],
    "IsRecentlyVerified": false,
    "ID": 87354,
    "UUID": "5993D4CC-9CDB-497A-AF89-DDE217F85B0C",
    "DataProviderID": 1,
    "OperatorID": 23,
    "OperatorsReference": "29218",
    "UsageTypeID": 6,
    "UsageCost": "Fre for customer",
    "AddressInfo": {
        "ID": 87700,
        "Title": "Hotel Ristorante Castello San Gaudenzio",
        "AddressLine1": "Via Mulino",
        "Town": "Cervesina",
        "StateOrProvince": "Italy",
        "Postcode": "27050",
        "CountryID": 112,
        "Latitude": 45.046656,
        "Longitude": 9.006074,
        "ContactTelephone1": "+39 0383 3331",
        "ContactEmail": "info@hcsg.it",
        "RelatedURL": "http://www.hcsg.it/it/",
        "DistanceUnit": 0
    },
    "Connections": [
        {
            "ID": 123827,
            "ConnectionTypeID": 30,
            "StatusTypeID": 50,
            "LevelID": 2,
            "Amps": 32,
            "Voltage": 400,
            "PowerKW": 22,
            "CurrentTypeID": 20,
            "Quantity": 1
        }
    ],
    "NumberOfPoints": 2,
    "GeneralComments": "1 Tesla Connector, up to 22kW. + 1 Type2 tethered for all EV. Available for patrons only. Please call ahead.",
    "StatusTypeID": 50,
    "DateLastStatusUpdate": "2018-10-03T22:40:00Z",
    "DataQualityLevel": 1,
    "DateCreated": "2017-05-05T05:33:00Z",
    "SubmissionStatusTypeID": 200
}