{
    "IsRecentlyVerified": false,
    "ID": 118681,
    "UUID": "56DEE1D7-43F3-4C2D-851F-B2E57ECDBED9",
    "DataProviderID": 1,
    "OperatorID": 32,
    "OperatorsReference": "11466",
    "UsageTypeID": 4,
    "UsageCost": "£0.108/kWh; for Polar Plus subscription members only",
    "AddressInfo": {
        "ID": 119027,
        "Title": "The Bain Public Car-Park",
        "AddressLine1": "Cagthorpe",
        "Town": "Horncastle",
        "Postcode": "LN9 5DR",
        "CountryID": 1,
        "Latitude": 53.210674,
        "Longitude": -0.11721,
        "DistanceUnit": 0
    },
    "Connections": [
        {
            "ID": 167851,
            "ConnectionTypeID": 25,
            "StatusTypeID": 50,
            "LevelID": 2,
            "Amps": 32,
            "Voltage": 230,
            "PowerKW": 7,
            "CurrentTypeID": 10,
            "Quantity": 2
        }
    ],
    "NumberOfPoints": 2,
    "GeneralComments": "Unit located in the EV bays within the car park.",
    "StatusTypeID": 50,
    "DateLastStatusUpdate": "2019-03-28T11:49:00Z",
    "DataQualityLevel": 1,
    "DateCreated": "2019-03-28T06:17:00Z",
    "SubmissionStatusTypeID": 200
}