{
    "IsRecentlyVerified": false,
    "ID": 179351,
    "UUID": "682D7731-2901-4302-A238-FB4CA868479A",
    "DataProviderID": 29,
    "DataProvidersReference": "13305",
    "OperatorID": 220,
    "AddressInfo": {
        "ID": 179710,
        "Title": "Manshardtstraße 117",
        "AddressLine1": "Manshardtstraße 117",
        "Town": "Hamburg",
        "Postcode": "22119",
        "CountryID": 87,
        "Latitude": 53.55916,
        "Longitude": 10.10749,
        "DistanceUnit": 0
    },
    "Connections": [
        {
            "ID": 281056,
            "ConnectionTypeID": 28,
            "StatusTypeID": 50,
            "LevelID": 2,
            "PowerKW": 22,
            "CurrentTypeID": 20
        },
        {
            "ID": 281057,
            "ConnectionTypeID": 25,
            "StatusTypeID": 50,
            "LevelID": 2,
            "PowerKW": 22,
            "CurrentTypeID": 20
        },
        {
            "ID": 301646,
            "ConnectionTypeID": 28,
            "StatusTypeID": 50,
            "LevelID": 2,
            "PowerKW": 22,
            "CurrentTypeID": 20
        },
        {
            "ID": 301647,
            "ConnectionTypeID": 25,
            "StatusTypeID": 50,
            "LevelID": 2,
            "PowerKW": 22,
            "CurrentTypeID": 20
        }
    ],
    "StatusTypeID": 50,
    "DateLastStatusUpdate": "2021-07-12T02:51:00Z",
    "MetadataValues": [
        {
            "ID": 11645,
            "MetadataFieldID": 4,
            "ItemValue": "Data from the German chargepoint registry provided by Bundesnetzagentur.de under the CC-BY 4.0 license"
        }
    ],
    "DataQualityLevel": 3,
    "DateCreated": "2021-07-08T09:59:00Z",
    "SubmissionStatusTypeID": 100
}