{
    "IsRecentlyVerified": false,
    "ID": 29101,
    "UUID": "6F4C1057-F16D-443F-BC55-2867A7998F3D",
    "DataProviderID": 2,
    "DataProvidersReference": "63570",
    "OperatorID": 5,
    "UsageTypeID": 1,
    "AddressInfo": {
        "ID": 29447,
        "Title": "LOT 2 DOWNTOWN",
        "AddressLine1": "Jockey Alley / State St",
        "Town": "Mt Pleasant",
        "StateOrProvince": "MI",
        "Postcode": "48858",
        "CountryID": 2,
        "Latitude": 43.6051043,
        "Longitude": -84.7763055,
        "ContactTelephone1": "888-758-4389",
        "AccessComments": "24 hours daily",
        "RelatedURL": "http://www.chargepoint.com/",
        "DistanceUnit": 0
    },
    "Connections": [
        {
            "ID": 31978,
            "ConnectionTypeID": 1,
            "LevelID": 2,
            "Amps": 16,
            "Voltage": 230,
            "PowerKW": 3.7,
            "CurrentTypeID": 10,
            "Quantity": 1
        }
    ],
    "DateLastStatusUpdate": "2020-06-26T03:07:00Z",
    "DataQualityLevel": 3,
    "DateCreated": "2014-11-28T03:39:00Z",
    "SubmissionStatusTypeID": 100
}