{
    "IsRecentlyVerified": false,
    "ID": 141889,
    "UUID": "F927CA73-C5ED-4013-B086-558793A61228",
    "DataProviderID": 2,
    "DataProvidersReference": "147975",
    "OperatorID": 39,
    "UsageTypeID": 1,
    "AddressInfo": {
        "ID": 142241,
        "Title": "Regatta Sloans Lake",
        "AddressLine1": "1550 Raleigh Street",
        "Town": "Denver",
        "StateOrProvince": "CO",
        "Postcode": "80204",
        "CountryID": 2,
        "Latitude": 39.7418252,
        "Longitude": -105.0413725,
        "ContactTelephone1": "800-663-5633",
        "AccessComments": "MO: Not Specified; TU: Not Specified; WE: Not Specified; TH: Not Specified; FR: Not Specified; SA: Not Specified; SU: Not Specified",
        "RelatedURL": "http://www.semacharge.com/",
        "DistanceUnit": 0
    },
    "Connections": [
        {
            "ID": 197927,
            "ConnectionTypeID": 1,
            "LevelID": 2,
            "Amps": 16,
            "Voltage": 230,
            "PowerKW": 3.7,
            "CurrentTypeID": 10,
            "Quantity": 2
        }
    ],
    "StatusTypeID": 50,
    "DateLastStatusUpdate": "2020-06-26T03:02:00Z",
    "DataQualityLevel": 3,
    "DateCreated": "2019-12-24T09:16:00Z",
    "SubmissionStatusTypeID": 100
}