{
    "IsRecentlyVerified": false,
    "ID": 91916,
    "UUID": "DD46737F-A9D7-4F22-81CF-3F9F415FF551",
    "DataProviderID": 1,
    "DataProvidersReference": "4250",
    "AddressInfo": {
        "ID": 92262,
        "Title": "Prisman parkkihalli",
        "AddressLine1": "Ahjokatu 7",
        "Town": "Seppälän Teollisuusalue",
        "StateOrProvince": "Keski-Suomi",
        "Postcode": "40320",
        "CountryID": 79,
        "Latitude": 62.2578,
        "Longitude": 25.77696,
        "AccessComments": "Ostoskeskuksen/tavaratalon parkkialueella tai -hallissa",
        "DistanceUnit": 0
    },
    "Connections": [
        {
            "ID": 130304,
            "ConnectionTypeID": 0,
            "LevelID": 2,
            "Amps": 16,
            "Voltage": 230,
            "PowerKW": 3.68
        },
        {
            "ID": 130305,
            "ConnectionTypeID": 0,
            "Reference": "1",
            "LevelID": 2,
            "Amps": 32,
            "Voltage": 230,
            "PowerKW": 7.4,
            "Comments": "Mode 3"
        },
        {
            "ID": 130306,
            "ConnectionTypeID": 0,
            "LevelID": 2,
            "Amps": 16,
            "Voltage": 230,
            "PowerKW": 3.68
        },
        {
            "ID": 225715,
            "ConnectionTypeID": 0,
            "Reference": "2",
            "LevelID": 2,
            "Amps": 32,
            "Voltage": 230,
            "PowerKW": 7.4,
            "Comments": "Mode 3"
        },
        {
            "ID": 225716,
            "ConnectionTypeID": 0,
            "LevelID": 2,
            "Amps": 16,
            "Voltage": 230,
            "PowerKW": 3.68
        },
        {
            "ID": 225717,
            "ConnectionTypeID": 0,
            "Reference": "3",
            "LevelID": 2,
            "Amps": 32,
            "Voltage": 230,
            "PowerKW": 7.4,
            "Comments": "Mode 3"
        }
    ],
    "NumberOfPoints": 3,
    "DateLastStatusUpdate": "2020-05-26T08:25:00Z",
    "DataQualityLevel": 2,
    "DateCreated": "2017-08-20T15:59:00Z",
    "SubmissionStatusTypeID": 100
}