{
    "IsRecentlyVerified": false,
    "ID": 111418,
    "UUID": "D0D4562C-F445-4A39-94D3-BAC37064DF25",
    "DataProviderID": 2,
    "DataProvidersReference": "83753",
    "UsageTypeID": 2,
    "AddressInfo": {
        "ID": 111764,
        "Title": "Municipalite Regionale de Comete du Granit",
        "AddressLine1": "5600 rue Frontenac",
        "Town": "Lac-Megantic",
        "StateOrProvince": "QC",
        "Postcode": "G6B 1H5",
        "CountryID": 44,
        "Latitude": 45.573531,
        "Longitude": -70.881108,
        "ContactTelephone1": "",
        "AccessComments": "For employee use only",
        "RelatedURL": "",
        "DistanceUnit": 0
    },
    "Connections": [
        {
            "ID": 156839,
            "ConnectionTypeID": 1,
            "LevelID": 2,
            "Amps": 16,
            "Voltage": 230,
            "PowerKW": 3.7,
            "CurrentTypeID": 10,
            "Quantity": 1
        }
    ],
    "DateLastStatusUpdate": "2020-06-26T03:09:00Z",
    "DataQualityLevel": 3,
    "DateCreated": "2018-10-18T23:37:00Z",
    "SubmissionStatusTypeID": 100
}