{
    "IsRecentlyVerified": false,
    "ID": 133896,
    "UUID": "D3A946FB-62A6-4FDB-9BE4-B583628A8CBA",
    "DataProviderID": 1,
    "OperatorID": 105,
    "UsageTypeID": 4,
    "AddressInfo": {
        "ID": 134242,
        "Title": "Olbrichstraße 19",
        "AddressLine1": "Olbrichstraße 19",
        "Town": "Essen",
        "StateOrProvince": "Nordrhein-Westfalen",
        "Postcode": "45138",
        "CountryID": 87,
        "Latitude": 51.442085579863,
        "Longitude": 7.02904284511396,
        "DistanceUnit": 0
    },
    "Connections": [
        {
            "ID": 187366,
            "ConnectionTypeID": 25,
            "StatusTypeID": 50,
            "LevelID": 2,
            "PowerKW": 22,
            "CurrentTypeID": 20,
            "Quantity": 2
        }
    ],
    "NumberOfPoints": 1,
    "StatusTypeID": 50,
    "DateLastStatusUpdate": "2019-10-29T18:50:00Z",
    "DataQualityLevel": 1,
    "DateCreated": "2019-10-29T18:50:00Z",
    "SubmissionStatusTypeID": 200
}