{
    "IsRecentlyVerified": false,
    "ID": 54265,
    "UUID": "F6604E0F-8174-4DFA-B5A3-F8DB4524408D",
    "DataProviderID": 1,
    "OperatorID": 173,
    "UsageTypeID": 4,
    "AddressInfo": {
        "ID": 54611,
        "Title": "Autohaus Rhein Würzburg",
        "AddressLine1": "Louis-Pasteur-Straße 14",
        "Town": "Würzburg",
        "Postcode": "97076",
        "CountryID": 87,
        "Latitude": 49.7936488,
        "Longitude": 9.99822130000007,
        "ContactTelephone1": "+49 931 27885-0",
        "AccessComments": "Rund um die Uhr (24/7) nutzbar. Position: Am Haupteingang. Umgebung:Autohäuser, Baumärkte\r\n",
        "RelatedURL": "http://www.rhein-wuerzburg.de",
        "DistanceUnit": 0
    },
    "Connections": [
        {
            "ID": 68302,
            "ConnectionTypeID": 25,
            "StatusTypeID": 50,
            "LevelID": 2,
            "PowerKW": 22,
            "CurrentTypeID": 20,
            "Quantity": 2
        },
        {
            "ID": 68303,
            "ConnectionTypeID": 33,
            "StatusTypeID": 50,
            "LevelID": 3,
            "PowerKW": 0,
            "CurrentTypeID": 30,
            "Quantity": 0
        }
    ],
    "NumberOfPoints": 2,
    "StatusTypeID": 50,
    "DateLastStatusUpdate": "2015-09-25T20:25:00Z",
    "DataQualityLevel": 1,
    "DateCreated": "2015-09-25T15:43:00Z",
    "SubmissionStatusTypeID": 200
}