{
    "IsRecentlyVerified": false,
    "ID": 31185,
    "UUID": "B185ABED-7183-46FE-8848-1772F3961831",
    "DataProviderID": 1,
    "DataProvidersReference": "1406",
    "AddressInfo": {
        "ID": 31531,
        "Title": "Knarvik Senter 3 (garasje), Lindås",
        "AddressLine1": "Kvernhusmyrane 9",
        "Town": "ISDALSTØ",
        "StateOrProvince": "Vestland",
        "Postcode": "5914",
        "CountryID": 168,
        "Latitude": 60.54731,
        "Longitude": 5.28538,
        "AccessComments": "",
        "DistanceUnit": 0
    },
    "Connections": [
        {
            "ID": 34452,
            "ConnectionTypeID": 0,
            "Reference": "1",
            "LevelID": 2,
            "Amps": 16,
            "Voltage": 230,
            "PowerKW": 3.7,
            "Comments": "Mode 1"
        }
    ],
    "NumberOfPoints": 1,
    "DateLastStatusUpdate": "2020-05-26T08:24:00Z",
    "DataQualityLevel": 2,
    "DateCreated": "2014-12-11T09:03:00Z",
    "SubmissionStatusTypeID": 100
}