{
    "IsRecentlyVerified": false,
    "ID": 90922,
    "UUID": "5B8B7F1B-5E58-456C-9DC6-58B104281FCD",
    "DataProviderID": 1,
    "OperatorID": 23,
    "OperatorsReference": "32297",
    "UsageTypeID": 4,
    "AddressInfo": {
        "ID": 91268,
        "Title": "Hôtel Au Coeur du Village",
        "AddressLine1": "26 Montée du Château",
        "Town": "La Clusaz",
        "Postcode": "74220",
        "CountryID": 80,
        "Latitude": 45.904616,
        "Longitude": 6.422546,
        "ContactTelephone1": "+ 33 4 50 01 50 01   ",
        "DistanceUnit": 0
    },
    "Connections": [
        {
            "ID": 128977,
            "ConnectionTypeID": 30,
            "StatusTypeID": 50,
            "LevelID": 2,
            "Amps": 32,
            "Voltage": 230,
            "PowerKW": 17,
            "CurrentTypeID": 20,
            "Quantity": 1
        }
    ],
    "NumberOfPoints": 1,
    "GeneralComments": "1 Tesla Connector, up to 17kW.Available to the public. Please see front desk.",
    "StatusTypeID": 50,
    "DateLastStatusUpdate": "2018-10-03T17:04:00Z",
    "DataQualityLevel": 1,
    "DateCreated": "2017-07-28T05:26:00Z",
    "SubmissionStatusTypeID": 200
}