{
    "IsRecentlyVerified": false,
    "ID": 61452,
    "UUID": "EBFDD16C-C608-469E-BA28-A2DC764CBD9D",
    "DataProviderID": 1,
    "OperatorID": 1238,
    "UsageTypeID": 4,
    "AddressInfo": {
        "ID": 61798,
        "Title": "Bahnhof",
        "AddressLine1": "Nonnenbacher Weg 1",
        "AddressLine2": "Mittelmühle",
        "Town": "Kressbronn am Bodensee",
        "StateOrProvince": "Bodenseekreis",
        "Postcode": "88079",
        "CountryID": 87,
        "Latitude": 47.5946794,
        "Longitude": 9.598600000000033,
        "AccessComments": "Rund um die Uhr (24/7) nutzbar. Zum Laden mittels Schukostecker ist ein Winkelstecker erforderlich. Ein Stellplatz ist in der Regel mit einem Emma Carsharing Fahrzeug belegt.\r\n",
        "DistanceUnit": 0
    },
    "Connections": [
        {
            "ID": 78257,
            "ConnectionTypeID": 25,
            "StatusTypeID": 50,
            "LevelID": 2,
            "Amps": 32,
            "Voltage": 400,
            "PowerKW": 22,
            "CurrentTypeID": 20,
            "Quantity": 2
        },
        {
            "ID": 78258,
            "ConnectionTypeID": 28,
            "StatusTypeID": 50,
            "LevelID": 2,
            "Amps": 16,
            "Voltage": 230,
            "PowerKW": 3.7,
            "CurrentTypeID": 10,
            "Quantity": 2
        }
    ],
    "NumberOfPoints": 2,
    "GeneralComments": "Inbetriebnahme im März 2016.",
    "StatusTypeID": 50,
    "DateLastStatusUpdate": "2016-03-01T07:10:00Z",
    "DataQualityLevel": 1,
    "DateCreated": "2016-03-01T07:10:00Z",
    "SubmissionStatusTypeID": 200
}