{
    "IsRecentlyVerified": false,
    "ID": 131706,
    "UUID": "9762B184-2D49-4A9E-8A81-EAB3EE528123",
    "DataProviderID": 1,
    "OperatorID": 20,
    "OperatorsReference": "62012",
    "UsageTypeID": 2,
    "UsageCost": "Free",
    "AddressInfo": {
        "ID": 132052,
        "Title": "Interserve Construction - Castleford",
        "AddressLine1": "Interserve Construction",
        "Postcode": "WF10 4UA",
        "CountryID": 1,
        "Latitude": 53.7127,
        "Longitude": -1.34831,
        "DistanceUnit": 0
    },
    "Connections": [
        {
            "ID": 184342,
            "ConnectionTypeID": 25,
            "StatusTypeID": 50,
            "LevelID": 2,
            "Amps": 32,
            "Voltage": 230,
            "PowerKW": 7,
            "CurrentTypeID": 10,
            "Quantity": 2
        }
    ],
    "NumberOfPoints": 2,
    "StatusTypeID": 50,
    "DateLastStatusUpdate": "2021-04-23T04:18:00Z",
    "DataQualityLevel": 1,
    "DateCreated": "2019-09-11T05:15:00Z",
    "SubmissionStatusTypeID": 200
}