{
    "IsRecentlyVerified": false,
    "ID": 96180,
    "UUID": "FB4F06EC-CE34-4105-97DD-9016A84108BF",
    "DataProviderID": 1,
    "OperatorID": 3,
    "OperatorsReference": "PG-92175",
    "UsageTypeID": 6,
    "UsageCost": "1",
    "AddressInfo": {
        "ID": 96526,
        "Title": "Urban Planters-London West",
        "AddressLine1": "Unit 16",
        "Town": "National Works",
        "StateOrProvince": "Middlesex",
        "Postcode": "TW4 7EA",
        "CountryID": 1,
        "Latitude": 51.469713,
        "Longitude": -0.381099,
        "DistanceUnit": 0
    },
    "Connections": [
        {
            "ID": 136272,
            "ConnectionTypeID": 25,
            "StatusTypeID": 50,
            "LevelID": 2,
            "Amps": 32,
            "Voltage": 230,
            "PowerKW": 7,
            "CurrentTypeID": 10,
            "Quantity": 1
        }
    ],
    "NumberOfPoints": 1,
    "GeneralComments": "This is an open charge unit installed at the Urban Planters - London West site in National Works, Bath Road, Hounslow, Middlesex",
    "StatusTypeID": 0,
    "DateLastStatusUpdate": "2020-01-14T17:02:00Z",
    "DataQualityLevel": 1,
    "DateCreated": "2017-12-14T06:39:00Z",
    "SubmissionStatusTypeID": 200
}