{
    "IsRecentlyVerified": false,
    "ID": 106254,
    "UUID": "F0BC67A9-C2E9-45F2-BD26-3321830B25D0",
    "DataProviderID": 1,
    "OperatorID": 103,
    "UsageTypeID": 4,
    "AddressInfo": {
        "ID": 106600,
        "Title": "Baumarkt Bauhaus",
        "AddressLine1": "Rahlstedter Straße 2",
        "Town": "Barsbüttel",
        "StateOrProvince": "Kreis Stormarn",
        "Postcode": "22885",
        "CountryID": 87,
        "Latitude": 53.57673049327784,
        "Longitude": 10.19460814669651,
        "AccessComments": "Nur zu den Öffnungszeiten des Baumarkts nutzbar (Schranke!) von Mo-Sa 7-20Uhr",
        "DistanceUnit": 0
    },
    "Connections": [
        {
            "ID": 149596,
            "ConnectionTypeID": 1036,
            "StatusTypeID": 50,
            "LevelID": 3,
            "Amps": 63,
            "Voltage": 400,
            "PowerKW": 43,
            "CurrentTypeID": 20,
            "Quantity": 1
        },
        {
            "ID": 149597,
            "ConnectionTypeID": 2,
            "StatusTypeID": 50,
            "LevelID": 3,
            "PowerKW": 50,
            "CurrentTypeID": 30,
            "Quantity": 1
        },
        {
            "ID": 149598,
            "ConnectionTypeID": 33,
            "StatusTypeID": 50,
            "LevelID": 3,
            "PowerKW": 50,
            "CurrentTypeID": 30,
            "Quantity": 1
        }
    ],
    "NumberOfPoints": 3,
    "StatusTypeID": 50,
    "DateLastStatusUpdate": "2018-06-18T08:03:00Z",
    "DataQualityLevel": 1,
    "DateCreated": "2018-06-18T08:03:00Z",
    "SubmissionStatusTypeID": 200
}