{
    "UserComments": [
        {
            "ID": 17985,
            "ChargePointID": 85058,
            "CommentTypeID": 10,
            "UserName": "Rumbel",
            "Comment": "Karte von Ladenetz.de",
            "Rating": 5,
            "DateCreated": "2017-12-01T19:17:56.25Z",
            "User": {
                "ID": 16380,
                "Username": "Rumbel"
            },
            "CheckinStatusTypeID": 10
        }
    ],
    "MediaItems": [
        {
            "ID": 13761,
            "ChargePointID": 85058,
            "ItemURL": "https://s3-ap-southeast-2.amazonaws.com/openchargemap/images/DE/OCM85058/OCM-85058.orig.2017120119181942.jpg",
            "ItemThumbnailURL": "https://s3-ap-southeast-2.amazonaws.com/openchargemap/images/DE/OCM85058/OCM-85058.thmb.2017120119181942.jpg",
            "Comment": "",
            "IsEnabled": true,
            "IsVideo": false,
            "IsFeaturedItem": false,
            "IsExternalResource": false,
            "User": {
                "ID": 16380,
                "Username": "Rumbel"
            },
            "DateCreated": "2017-12-01T19:19:00Z"
        }
    ],
    "IsRecentlyVerified": false,
    "ID": 85058,
    "UUID": "B12C5AFB-BDDF-4F21-BD59-461D147546BE",
    "DataProviderID": 1,
    "OperatorID": 156,
    "UsageTypeID": 4,
    "AddressInfo": {
        "ID": 85404,
        "Title": "Parkhaus Unterlinden",
        "AddressLine1": "Fahnenbergplatz 3",
        "Town": "Freiburg im Breisgau",
        "StateOrProvince": "Baden-Württemberg",
        "Postcode": "79098",
        "CountryID": 87,
        "Latitude": 47.99782769999999,
        "Longitude": 7.848826899999949,
        "ContactTelephone1": "+49 711 305 70 305",
        "AccessComments": "Geöffnet täglich 6-24Uhr, Ladesäule direkt vor der Ausfahrt auf der linken Seite Achtung: Die Einfahrt zum Parkhaus ist links! Nur mit RFID Karten nutzbar, kein GSM Empfang!\r\n",
        "RelatedURL": "http://www.apcoa.de/parken-in/freiburg/unterlinden.html",
        "DistanceUnit": 0
    },
    "Connections": [
        {
            "ID": 120810,
            "ConnectionTypeID": 25,
            "StatusTypeID": 50,
            "LevelID": 2,
            "Amps": 16,
            "Voltage": 400,
            "PowerKW": 11,
            "CurrentTypeID": 20,
            "Quantity": 2
        }
    ],
    "NumberOfPoints": 2,
    "StatusTypeID": 50,
    "DateLastStatusUpdate": "2017-12-01T19:19:00Z",
    "DataQualityLevel": 1,
    "DateCreated": "2017-03-24T11:54:00Z",
    "SubmissionStatusTypeID": 200
}