{
    "IsRecentlyVerified": false,
    "ID": 20404,
    "UUID": "1E02DDEE-78C8-4B23-8022-01615A010A8C",
    "DataProviderID": 1,
    "OperatorID": 1,
    "UsageTypeID": 0,
    "UsageCost": "",
    "AddressInfo": {
        "ID": 20749,
        "Title": " Particulier - La Baume de Transit",
        "AddressLine1": "1 allée des pins",
        "AddressLine2": "",
        "Town": "La Baume de Transit",
        "StateOrProvince": "",
        "Postcode": "26790",
        "CountryID": 80,
        "Latitude": 44.33728,
        "Longitude": 4.86282,
        "ContactTelephone1": "",
        "ContactTelephone2": "",
        "ContactEmail": "",
        "AccessComments": "Ouvert à tous",
        "RelatedURL": "",
        "DistanceUnit": 0
    },
    "Connections": [],
    "GeneralComments": "",
    "StatusTypeID": 50,
    "DateLastStatusUpdate": "2013-11-13T16:57:00Z",
    "DataQualityLevel": 1,
    "DateCreated": "2013-11-13T11:36:00Z",
    "SubmissionStatusTypeID": 200
}