{
    "IsRecentlyVerified": false,
    "ID": 45621,
    "UUID": "01C77E7F-87A0-4BCE-A8EA-21BCCB67CD44",
    "DataProviderID": 1,
    "DataProvidersReference": "2382",
    "AddressInfo": {
        "ID": 45967,
        "Title": "Ljugarns Semesterby och Camping",
        "AddressLine1": "Strandvägen 51",
        "Town": "LJUGARN",
        "StateOrProvince": "GOTLAND",
        "Postcode": "62365",
        "CountryID": 216,
        "Latitude": 57.34072,
        "Longitude": 18.71729,
        "AccessComments": "Laddplatsen återfinns till vänster, 40 meter innan receptionen",
        "DistanceUnit": 0
    },
    "Connections": [
        {
            "ID": 56284,
            "ConnectionTypeID": 0,
            "Reference": "1",
            "LevelID": 2,
            "Amps": 16,
            "Voltage": 230,
            "PowerKW": 3.7,
            "Comments": "Mode 3"
        },
        {
            "ID": 83912,
            "ConnectionTypeID": 0,
            "Reference": "2",
            "LevelID": 2,
            "Amps": 16,
            "Voltage": 230,
            "PowerKW": 3.7,
            "Comments": "Mode 1"
        },
        {
            "ID": 87832,
            "ConnectionTypeID": 0,
            "Reference": "3",
            "LevelID": 2,
            "Amps": 16,
            "Voltage": 230,
            "PowerKW": 3.7,
            "Comments": "Mode 1"
        }
    ],
    "NumberOfPoints": 3,
    "DateLastStatusUpdate": "2020-05-26T08:21:00Z",
    "DataQualityLevel": 2,
    "DateCreated": "2015-05-03T00:54:00Z",
    "SubmissionStatusTypeID": 100
}