{
    "IsRecentlyVerified": false,
    "ID": 174473,
    "UUID": "D4F74780-9E8F-45FB-AE79-71B8089AC398",
    "DataProviderID": 1,
    "OperatorID": 1,
    "UsageTypeID": 4,
    "UsageCost": "RM1.20 per minute",
    "AddressInfo": {
        "ID": 174832,
        "Title": "Caltex RnR Bukit Gantang Northbound ",
        "AddressLine1": "RnR Bukit Gantang Northbound ",
        "Town": "Taiping",
        "StateOrProvince": "Perak",
        "Postcode": "",
        "CountryID": 137,
        "Latitude": 4.77283288240514,
        "Longitude": 100.76130194698885,
        "DistanceUnit": 0
    },
    "Connections": [
        {
            "ID": 270285,
            "ConnectionTypeID": 33,
            "StatusTypeID": 50,
            "LevelID": 3,
            "Amps": 125,
            "PowerKW": 50,
            "CurrentTypeID": 30,
            "Quantity": 1
        },
        {
            "ID": 270286,
            "ConnectionTypeID": 2,
            "StatusTypeID": 50,
            "LevelID": 3,
            "Amps": 125,
            "PowerKW": 50,
            "CurrentTypeID": 30,
            "Quantity": 1
        },
        {
            "ID": 270287,
            "ConnectionTypeID": 1036,
            "StatusTypeID": 50,
            "LevelID": 3,
            "Amps": 63,
            "Voltage": 400,
            "PowerKW": 43,
            "CurrentTypeID": 20,
            "Quantity": 1
        }
    ],
    "NumberOfPoints": 1,
    "StatusTypeID": 50,
    "DateLastStatusUpdate": "2021-04-02T12:25:00Z",
    "DataQualityLevel": 1,
    "DateCreated": "2021-04-01T23:11:00Z",
    "SubmissionStatusTypeID": 200
}