{
    "IsRecentlyVerified": false,
    "ID": 178655,
    "UUID": "328D9D4C-E850-4756-9D2E-85000620779B",
    "DataProviderID": 29,
    "DataProvidersReference": "18822,3777",
    "AddressInfo": {
        "ID": 179014,
        "Title": "Albstraße 18-19",
        "AddressLine1": "Albstraße 18-19",
        "Town": "Kornwestheim",
        "Postcode": "70806",
        "CountryID": 87,
        "Latitude": 48.85131,
        "Longitude": 9.18731,
        "DistanceUnit": 0
    },
    "Connections": [
        {
            "ID": 279354,
            "ConnectionTypeID": 25,
            "StatusTypeID": 50,
            "LevelID": 2,
            "PowerKW": 22,
            "CurrentTypeID": 20
        },
        {
            "ID": 279355,
            "ConnectionTypeID": 25,
            "StatusTypeID": 50,
            "LevelID": 2,
            "PowerKW": 22,
            "CurrentTypeID": 20
        },
        {
            "ID": 279356,
            "ConnectionTypeID": 33,
            "StatusTypeID": 50,
            "LevelID": 3,
            "PowerKW": 62.5,
            "CurrentTypeID": 30
        }
    ],
    "StatusTypeID": 0,
    "DateLastStatusUpdate": "2021-07-09T03:13:00Z",
    "MetadataValues": [
        {
            "ID": 10949,
            "MetadataFieldID": 4,
            "ItemValue": "Data from the German chargepoint registry provided by Bundesnetzagentur.de under the CC-BY 4.0 license"
        }
    ],
    "DataQualityLevel": 3,
    "DateCreated": "2021-07-08T09:50:00Z",
    "SubmissionStatusTypeID": 100
}