{
    "IsRecentlyVerified": false,
    "ID": 129102,
    "UUID": "98426706-C04C-4EEB-9E35-5E416FA832A7",
    "DataProviderID": 1,
    "OperatorID": 3282,
    "UsageTypeID": 4,
    "AddressInfo": {
        "ID": 129448,
        "Title": "Euronics Dimo San Salvatore",
        "AddressLine1": "Via Umberto Vittorio Podestà, 1",
        "AddressLine2": " San Salvatore",
        "Town": "Cogorno",
        "StateOrProvince": "GE",
        "Postcode": "16030",
        "CountryID": 112,
        "Latitude": 44.33258754853168,
        "Longitude": 9.351533035633224,
        "RelatedURL": "https://m.emobitaly.it/#/charging/stations",
        "DistanceUnit": 0
    },
    "Connections": [
        {
            "ID": 180729,
            "ConnectionTypeID": 25,
            "StatusTypeID": 50,
            "LevelID": 2,
            "Amps": 32,
            "Voltage": 230,
            "PowerKW": 22,
            "CurrentTypeID": 20,
            "Quantity": 2
        }
    ],
    "NumberOfPoints": 2,
    "StatusTypeID": 50,
    "DateLastStatusUpdate": "2019-07-14T16:04:00Z",
    "DataQualityLevel": 1,
    "DateCreated": "2019-07-14T16:04:00Z",
    "SubmissionStatusTypeID": 200
}