{
    "IsRecentlyVerified": false,
    "ID": 186985,
    "UUID": "774D9886-89EC-4995-8860-7213D6A95FB8",
    "DataProviderID": 29,
    "DataProvidersReference": "17459",
    "OperatorID": 45,
    "AddressInfo": {
        "ID": 187344,
        "Title": "Poppauer Str. 37",
        "AddressLine1": "Poppauer Str. 37",
        "Town": "Klötze",
        "Postcode": "38486",
        "CountryID": 87,
        "Latitude": 52.63319,
        "Longitude": 11.155986,
        "DistanceUnit": 0
    },
    "Connections": [
        {
            "ID": 300873,
            "ConnectionTypeID": 33,
            "StatusTypeID": 50,
            "LevelID": 3,
            "PowerKW": 22,
            "CurrentTypeID": 30
        },
        {
            "ID": 300874,
            "ConnectionTypeID": 25,
            "StatusTypeID": 50,
            "LevelID": 2,
            "PowerKW": 11,
            "CurrentTypeID": 20
        }
    ],
    "StatusTypeID": 50,
    "DateLastStatusUpdate": "2021-07-12T02:50:00Z",
    "MetadataValues": [
        {
            "ID": 19225,
            "MetadataFieldID": 4,
            "ItemValue": "Data from the German chargepoint registry provided by Bundesnetzagentur.de under the CC-BY 4.0 license"
        }
    ],
    "DataQualityLevel": 3,
    "DateCreated": "2021-07-12T02:50:00Z",
    "SubmissionStatusTypeID": 100
}