{
    "IsRecentlyVerified": false,
    "ID": 57797,
    "UUID": "F107A30D-DF5B-48FC-893F-4B9D8F8B6B2A",
    "DataProviderID": 1,
    "OperatorID": 105,
    "UsageTypeID": 4,
    "UsageCost": "0",
    "AddressInfo": {
        "ID": 58143,
        "Title": "LEW Ladesäule",
        "AddressLine1": "Nördliche Hauptstraße 18",
        "Town": "Wehringen",
        "Postcode": "86517",
        "CountryID": 87,
        "Latitude": 48.2465987,
        "Longitude": 10.800957,
        "ContactTelephone1": "+49 800 22 55 793",
        "AccessComments": " Ladesäule ist noch nicht verifiziert\r\n",
        "RelatedURL": "http://www.rwe-mobility.com/",
        "DistanceUnit": 0
    },
    "Connections": [
        {
            "ID": 73208,
            "ConnectionTypeID": 28,
            "StatusTypeID": 50,
            "LevelID": 2,
            "Amps": 16,
            "Voltage": 230,
            "PowerKW": 3.7,
            "CurrentTypeID": 10,
            "Quantity": 0
        },
        {
            "ID": 73209,
            "ConnectionTypeID": 25,
            "StatusTypeID": 50,
            "LevelID": 2,
            "PowerKW": 22,
            "CurrentTypeID": 20,
            "Quantity": 2
        },
        {
            "ID": 73210,
            "ConnectionTypeID": 16,
            "StatusTypeID": 50,
            "LevelID": 2,
            "Amps": 16,
            "Voltage": 230,
            "PowerKW": 3.7,
            "CurrentTypeID": 10,
            "Quantity": 0
        },
        {
            "ID": 73211,
            "ConnectionTypeID": 17,
            "StatusTypeID": 50,
            "LevelID": 2,
            "PowerKW": 0,
            "CurrentTypeID": 20,
            "Quantity": 0
        },
        {
            "ID": 73212,
            "ConnectionTypeID": 2,
            "StatusTypeID": 50,
            "LevelID": 2,
            "PowerKW": 0,
            "CurrentTypeID": 30,
            "Quantity": 0
        },
        {
            "ID": 73213,
            "ConnectionTypeID": 33,
            "StatusTypeID": 50,
            "LevelID": 2,
            "PowerKW": 0,
            "CurrentTypeID": 30,
            "Quantity": 0
        },
        {
            "ID": 73214,
            "ConnectionTypeID": 25,
            "StatusTypeID": 50,
            "LevelID": 2,
            "Amps": 32,
            "Voltage": 400,
            "PowerKW": 22,
            "CurrentTypeID": 20,
            "Quantity": 5
        }
    ],
    "NumberOfPoints": 2,
    "StatusTypeID": 50,
    "DateLastStatusUpdate": "2015-12-25T11:02:00Z",
    "DataQualityLevel": 1,
    "DateCreated": "2015-12-25T09:19:00Z",
    "SubmissionStatusTypeID": 200
}