{
    "IsRecentlyVerified": false,
    "ID": 8339,
    "UUID": "06EF491C-840F-4C82-8C1A-738031C1E4BC",
    "DataProviderID": 15,
    "DataProvidersReference": "6395",
    "OperatorID": 26,
    "AddressInfo": {
        "ID": 8236,
        "Title": "2525 W Us Highway 50",
        "AddressLine1": "2525 W Us Highway 50",
        "Town": "Pueblo",
        "StateOrProvince": "CO",
        "Postcode": "81008",
        "CountryID": 2,
        "Latitude": 38.31174,
        "Longitude": -104.64103,
        "ContactTelephone1": " (719) 545-4145",
        "RelatedURL": "http://carstations.com/6395",
        "DistanceUnit": 0
    },
    "Connections": [
        {
            "ID": 5768,
            "ConnectionTypeID": 1,
            "Reference": "J1772",
            "LevelID": 2
        }
    ],
    "StatusTypeID": 0,
    "DateLastStatusUpdate": "2017-11-04T14:04:00Z",
    "DataQualityLevel": 1,
    "DateCreated": "2011-11-11T12:06:00Z",
    "SubmissionStatusTypeID": 100
}