{
    "IsRecentlyVerified": false,
    "ID": 174766,
    "UUID": "97E81974-BA99-4D8D-9089-1AD9701213A1",
    "DataProviderID": 1,
    "OperatorID": 3323,
    "UsageTypeID": 4,
    "AddressInfo": {
        "ID": 175125,
        "Title": "Kemal Zeytinoğlu Caddesi",
        "AddressLine1": "Kemal Zeytinoğlu Caddesi",
        "AddressLine2": "Çankaya Mah.",
        "Town": "Eskisehir",
        "Postcode": "26026",
        "CountryID": 229,
        "Latitude": 39.75802096883831,
        "Longitude": 30.524133698382684,
        "DistanceUnit": 0
    },
    "Connections": [
        {
            "ID": 270801,
            "ConnectionTypeID": 25,
            "StatusTypeID": 50,
            "LevelID": 2,
            "PowerKW": 22,
            "CurrentTypeID": 20,
            "Quantity": 1
        }
    ],
    "NumberOfPoints": 1,
    "StatusTypeID": 50,
    "DateLastStatusUpdate": "2021-10-21T16:27:00Z",
    "DataQualityLevel": 1,
    "DateCreated": "2021-04-11T21:35:00Z",
    "SubmissionStatusTypeID": 200
}