{
    "IsRecentlyVerified": false,
    "ID": 160076,
    "UUID": "9E0C910E-A598-4D0D-B54C-E12F62FAA056",
    "DataProviderID": 2,
    "DataProvidersReference": "153888",
    "OperatorID": 9,
    "UsageTypeID": 1,
    "AddressInfo": {
        "ID": 160433,
        "Title": "Evergetic, LLC",
        "AddressLine1": "16429 Uptown Rd, Suite 1",
        "Town": "East Lansing",
        "StateOrProvince": "MI",
        "Postcode": "48823",
        "CountryID": 2,
        "Latitude": 42.777785,
        "Longitude": -84.398166,
        "ContactTelephone1": "888-998-2546",
        "AccessComments": "MON: 24 hours | TUE: 24 hours | WED: 24 hours | THU: 24 hours | FRI: 24 hours | SAT: 24 hours | SUN: 24 hours",
        "RelatedURL": "http://www.blinkcharging.com/",
        "DistanceUnit": 0
    },
    "Connections": [
        {
            "ID": 230312,
            "ConnectionTypeID": 1,
            "LevelID": 2,
            "Amps": 16,
            "Voltage": 230,
            "PowerKW": 3.7,
            "CurrentTypeID": 10,
            "Quantity": 2
        }
    ],
    "StatusTypeID": 50,
    "DateLastStatusUpdate": "2020-06-26T03:06:00Z",
    "DataQualityLevel": 3,
    "DateCreated": "2020-06-26T03:06:00Z",
    "SubmissionStatusTypeID": 100
}