{
    "UserComments": [
        {
            "ID": 13852,
            "ChargePointID": 60399,
            "CommentTypeID": 50,
            "UserName": "Knights MiniCabs",
            "Comment": "Impossible to charge here as these bays are constantly being ICE'd!",
            "Rating": 1,
            "DateCreated": "2016-07-19T05:00:25.283Z",
            "User": {
                "ID": 11555,
                "Username": "Knights MiniCabs"
            },
            "CheckinStatusTypeID": 10
        }
    ],
    "MediaItems": [
        {
            "ID": 7798,
            "ChargePointID": 60399,
            "ItemURL": "https://s3-ap-southeast-2.amazonaws.com/openchargemap/images/GB/OCM60399/OCM-60399.orig.2016071904585864.jpg",
            "ItemThumbnailURL": "https://s3-ap-southeast-2.amazonaws.com/openchargemap/images/GB/OCM60399/OCM-60399.thmb.2016071904585864.jpg",
            "Comment": "ICE'd again!",
            "IsEnabled": true,
            "IsVideo": false,
            "IsFeaturedItem": false,
            "IsExternalResource": false,
            "User": {
                "ID": 11555,
                "Username": "Knights MiniCabs"
            },
            "DateCreated": "2016-07-19T04:59:00Z"
        }
    ],
    "IsRecentlyVerified": false,
    "ID": 60399,
    "UUID": "00AE7863-D939-4853-9777-3A3956EAF2DC",
    "DataProviderID": 1,
    "OperatorID": 3,
    "OperatorsReference": "PG-90095",
    "UsageTypeID": 6,
    "UsageCost": "1",
    "AddressInfo": {
        "ID": 60745,
        "Title": "Greenwich Penninsula",
        "AddressLine1": "West Parkside",
        "AddressLine2": "Greenwich",
        "Town": "London",
        "Postcode": "SE10 0BL",
        "CountryID": 1,
        "Latitude": 51.4943726,
        "Longitude": 0.0121186999999736,
        "DistanceUnit": 0
    },
    "Connections": [
        {
            "ID": 76509,
            "ConnectionTypeID": 25,
            "StatusTypeID": 50,
            "LevelID": 2,
            "Amps": 32,
            "Voltage": 230,
            "PowerKW": 7,
            "CurrentTypeID": 10,
            "Quantity": 1
        }
    ],
    "NumberOfPoints": 17,
    "StatusTypeID": 0,
    "DateLastStatusUpdate": "2019-09-11T05:33:00Z",
    "DataQualityLevel": 1,
    "DateCreated": "2016-01-24T17:18:00Z",
    "SubmissionStatusTypeID": 200
}