{
    "MediaItems": [
        {
            "ID": 13643,
            "ChargePointID": 86148,
            "ItemURL": "https://s3-ap-southeast-2.amazonaws.com/openchargemap/images/DE/OCM86148/OCM-86148.orig.2017110511250621.jpeg",
            "ItemThumbnailURL": "https://s3-ap-southeast-2.amazonaws.com/openchargemap/images/DE/OCM86148/OCM-86148.thmb.2017110511250621.jpeg",
            "Comment": "",
            "IsEnabled": true,
            "IsVideo": false,
            "IsFeaturedItem": false,
            "IsExternalResource": false,
            "User": {
                "ID": 13565,
                "Username": "tas"
            },
            "DateCreated": "2017-11-05T11:25:00Z"
        },
        {
            "ID": 13642,
            "ChargePointID": 86148,
            "ItemURL": "https://s3-ap-southeast-2.amazonaws.com/openchargemap/images/DE/OCM86148/OCM-86148.orig.2017110511234373.jpeg",
            "ItemThumbnailURL": "https://s3-ap-southeast-2.amazonaws.com/openchargemap/images/DE/OCM86148/OCM-86148.thmb.2017110511234373.jpeg",
            "Comment": "",
            "IsEnabled": true,
            "IsVideo": false,
            "IsFeaturedItem": false,
            "IsExternalResource": false,
            "User": {
                "ID": 13565,
                "Username": "tas"
            },
            "DateCreated": "2017-11-05T11:24:00Z"
        }
    ],
    "IsRecentlyVerified": false,
    "ID": 86148,
    "UUID": "1525596A-A3B9-4F0F-91B2-75ED37CC34F8",
    "DataProviderID": 1,
    "OperatorID": 125,
    "UsageTypeID": 4,
    "AddressInfo": {
        "ID": 86494,
        "Title": "Supermarkt Edeka",
        "AddressLine1": "Am Neumarkt 1",
        "Town": "Hagen im Bremischen",
        "StateOrProvince": "Landkreis Cuxhaven",
        "Postcode": "27628",
        "CountryID": 87,
        "Latitude": 53.3596587,
        "Longitude": 8.66270510000004,
        "AccessComments": "24/7 nutzbar auf dem Kundenparkplatz",
        "DistanceUnit": 0
    },
    "Connections": [
        {
            "ID": 122512,
            "ConnectionTypeID": 25,
            "StatusTypeID": 50,
            "LevelID": 2,
            "Amps": 32,
            "Voltage": 400,
            "PowerKW": 22,
            "CurrentTypeID": 20,
            "Quantity": 2
        }
    ],
    "NumberOfPoints": 2,
    "StatusTypeID": 50,
    "DateLastStatusUpdate": "2017-11-05T11:25:00Z",
    "DataQualityLevel": 1,
    "DateCreated": "2017-04-27T07:11:00Z",
    "SubmissionStatusTypeID": 200
}