{
    "IsRecentlyVerified": false,
    "ID": 171625,
    "UUID": "385B0D31-E134-45F9-A7A8-0183A1D1AE8B",
    "DataProviderID": 1,
    "OperatorID": 1,
    "UsageTypeID": 4,
    "AddressInfo": {
        "ID": 171984,
        "Title": "Osa Conservation Office",
        "AddressLine1": "Calle 2",
        "Town": "Puerto Jiménez",
        "StateOrProvince": "Puntarenas",
        "Postcode": "60702",
        "CountryID": 58,
        "Latitude": 8.534577196867446,
        "Longitude": -83.3066550457155,
        "ContactTelephone1": "+506 2735 5756",
        "DistanceUnit": 0
    },
    "Connections": [
        {
            "ID": 262441,
            "ConnectionTypeID": 1,
            "StatusTypeID": 50,
            "LevelID": 2,
            "Amps": 32,
            "Voltage": 240,
            "PowerKW": 7.7,
            "CurrentTypeID": 10,
            "Quantity": 1
        }
    ],
    "NumberOfPoints": 1,
    "GeneralComments": "+506 2735 5756",
    "StatusTypeID": 50,
    "DateLastStatusUpdate": "2021-01-07T09:53:00Z",
    "DataQualityLevel": 1,
    "DateCreated": "2021-01-07T01:16:00Z",
    "SubmissionStatusTypeID": 200
}