{
    "IsRecentlyVerified": false,
    "ID": 32105,
    "UUID": "71504904-612D-483F-A128-2EC63F85784C",
    "DataProviderID": 1,
    "OperatorID": 105,
    "OperatorsReference": "Essent EM-DE-06436002-01-00001",
    "UsageTypeID": 4,
    "AddressInfo": {
        "ID": 32451,
        "Title": "Burgstraße 4",
        "AddressLine1": "Burgstraße 4",
        "Town": "Eppstein",
        "Postcode": "65817",
        "CountryID": 87,
        "Latitude": 50.14059,
        "Longitude": 8.388338,
        "DistanceUnit": 0
    },
    "Connections": [
        {
            "ID": 35616,
            "ConnectionTypeID": 25,
            "LevelID": 2,
            "PowerKW": 11
        },
        {
            "ID": 46208,
            "ConnectionTypeID": 25,
            "LevelID": 2,
            "PowerKW": 11
        }
    ],
    "NumberOfPoints": 1,
    "StatusTypeID": 50,
    "DateLastStatusUpdate": "2015-04-13T16:03:00Z",
    "DataQualityLevel": 3,
    "DateCreated": "2015-01-09T06:03:00Z",
    "SubmissionStatusTypeID": 200
}