{
    "IsRecentlyVerified": false,
    "ID": 62713,
    "UUID": "13BC558E-AA48-4F28-9211-BAA60C231985",
    "DataProviderID": 26,
    "DataProvidersReference": "20288",
    "OperatorID": 162,
    "OperatorsReference": "日産プリンス青森販売㈱十和田北店",
    "UsageCost": "0.00 onbekend",
    "AddressInfo": {
        "ID": 63059,
        "Title": "陸羽街道",
        "AddressLine1": "陸羽街道",
        "Town": "十和田市",
        "Postcode": "",
        "CountryID": 114,
        "Latitude": 40.642544,
        "Longitude": 141.200226,
        "DistanceUnit": 0
    },
    "Connections": [
        {
            "ID": 79639,
            "ConnectionTypeID": 2,
            "LevelID": 3,
            "PowerKW": 50,
            "CurrentTypeID": 30
        }
    ],
    "NumberOfPoints": 1,
    "StatusTypeID": 50,
    "DateLastStatusUpdate": "2016-03-03T12:29:00Z",
    "DataQualityLevel": 3,
    "DateCreated": "2016-03-03T12:29:00Z",
    "SubmissionStatusTypeID": 100
}