{
    "IsRecentlyVerified": false,
    "ID": 91730,
    "UUID": "DEE6F4E2-C133-4D09-8ACD-EB5F0FC9C592",
    "DataProviderID": 1,
    "OperatorID": 45,
    "UsageTypeID": 1,
    "UsageCost": "Free",
    "AddressInfo": {
        "ID": 92076,
        "Title": "Stoppustuð Húsavík",
        "AddressLine1": "Vallholtsvegur",
        "Town": "Húsavík",
        "Postcode": "640",
        "CountryID": 105,
        "Latitude": 66.047206,
        "Longitude": -17.341404,
        "ContactEmail": "orkusalan@orkusalan.is",
        "DistanceUnit": 0
    },
    "Connections": [
        {
            "ID": 130058,
            "ConnectionTypeID": 25,
            "StatusTypeID": 50,
            "LevelID": 2,
            "Amps": 32,
            "Voltage": 400,
            "PowerKW": 22,
            "CurrentTypeID": 20,
            "Quantity": 1
        }
    ],
    "NumberOfPoints": 1,
    "StatusTypeID": 50,
    "DateLastStatusUpdate": "2017-08-17T17:16:00Z",
    "DataQualityLevel": 1,
    "DateCreated": "2017-08-15T16:09:00Z",
    "SubmissionStatusTypeID": 200
}