{
    "IsRecentlyVerified": false,
    "ID": 174121,
    "UUID": "7D6A3A9C-2BC7-4457-A43B-404D8B0D2C74",
    "DataProviderID": 1,
    "OperatorID": 3377,
    "UsageTypeID": 4,
    "AddressInfo": {
        "ID": 174480,
        "Title": "LAFON EdRR 1 - ETECNIC",
        "AddressLine1": "Carrer Barcelona 221 - 43518 - Tortosa",
        "Town": "Tortosa",
        "StateOrProvince": "Catalonia",
        "Postcode": "43518",
        "CountryID": 210,
        "Latitude": 40.79467172449782,
        "Longitude": 0.5256309795581728,
        "DistanceUnit": 0
    },
    "Connections": [
        {
            "ID": 269017,
            "ConnectionTypeID": 2,
            "StatusTypeID": 50,
            "LevelID": 3,
            "Amps": 80,
            "Voltage": 400,
            "PowerKW": 55.4,
            "CurrentTypeID": 30,
            "Quantity": 1
        },
        {
            "ID": 269018,
            "ConnectionTypeID": 33,
            "StatusTypeID": 50,
            "LevelID": 3,
            "Amps": 80,
            "Voltage": 397,
            "PowerKW": 55.4,
            "CurrentTypeID": 30,
            "Quantity": 1
        },
        {
            "ID": 269019,
            "ConnectionTypeID": 25,
            "StatusTypeID": 50,
            "LevelID": 3,
            "Amps": 64,
            "Voltage": 400,
            "PowerKW": 44.3,
            "CurrentTypeID": 20,
            "Quantity": 1
        }
    ],
    "NumberOfPoints": 2,
    "StatusTypeID": 50,
    "DateLastStatusUpdate": "2021-03-16T09:20:00Z",
    "DataQualityLevel": 1,
    "DateCreated": "2021-03-16T09:20:00Z",
    "SubmissionStatusTypeID": 200
}