{
    "IsRecentlyVerified": false,
    "ID": 123664,
    "UUID": "3FEAC04F-36A2-4521-96A8-5B1BC14C7264",
    "DataProviderID": 2,
    "DataProvidersReference": "74112",
    "OperatorID": 5,
    "UsageTypeID": 1,
    "AddressInfo": {
        "ID": 124010,
        "Title": "CITY HALL",
        "AddressLine1": "660 W Main Street",
        "Town": "Morgan Hill",
        "StateOrProvince": "CA",
        "Postcode": "95037",
        "CountryID": 2,
        "Latitude": 37.1251532,
        "Longitude": -121.6628168,
        "ContactTelephone1": "888-758-4389",
        "AccessComments": "24 hours daily",
        "RelatedURL": "http://www.chargepoint.com/",
        "DistanceUnit": 0
    },
    "Connections": [
        {
            "ID": 173681,
            "ConnectionTypeID": 1,
            "LevelID": 2,
            "Amps": 16,
            "Voltage": 230,
            "PowerKW": 3,
            "CurrentTypeID": 10,
            "Quantity": 1
        }
    ],
    "DateLastStatusUpdate": "2019-12-24T09:13:00Z",
    "DataQualityLevel": 3,
    "DateCreated": "2019-04-06T05:03:00Z",
    "SubmissionStatusTypeID": 100
}