{
    "IsRecentlyVerified": false,
    "ID": 117850,
    "UUID": "9EA820B1-C003-4DF0-93C9-D5FAB5E1F1D0",
    "DataProviderID": 1,
    "OperatorID": 80,
    "UsageTypeID": 4,
    "AddressInfo": {
        "ID": 118196,
        "Title": "Varallo Parcheggio Funivia Sacro Monte | EnelX",
        "AddressLine1": "Via Mazzola",
        "AddressLine2": "Case Sparse sopra il Sacro Monte",
        "Town": "Varallo",
        "StateOrProvince": "VC",
        "Postcode": "13019",
        "CountryID": 112,
        "Latitude": 45.8184352367963,
        "Longitude": 8.25297538649647,
        "ContactTelephone1": "800.069.850",
        "RelatedURL": "https://www.enelx.com/it/it/emobility",
        "DistanceUnit": 0
    },
    "Connections": [
        {
            "ID": 166775,
            "ConnectionTypeID": 25,
            "StatusTypeID": 50,
            "LevelID": 2,
            "Amps": 32,
            "Voltage": 400,
            "PowerKW": 22,
            "CurrentTypeID": 20,
            "Quantity": 2
        }
    ],
    "NumberOfPoints": 2,
    "StatusTypeID": 50,
    "DateLastStatusUpdate": "2019-03-05T14:39:00Z",
    "DataQualityLevel": 1,
    "DateCreated": "2019-03-05T14:39:00Z",
    "SubmissionStatusTypeID": 200
}