{
    "IsRecentlyVerified": false,
    "ID": 33051,
    "UUID": "7441D7DF-516D-416C-A08C-A380910EB196",
    "DataProviderID": 26,
    "DataProvidersReference": "31101",
    "OperatorsReference": "de Animatie Compagnie",
    "UsageCost": "0.00 jaarabonnement",
    "AddressInfo": {
        "ID": 33397,
        "Title": "Arnesteinweg 63",
        "AddressLine1": "Arnesteinweg 63",
        "Town": "Middelburg",
        "Postcode": "4338 PD",
        "CountryID": 159,
        "Latitude": 51.49849,
        "Longitude": 3.645114,
        "RelatedURL": "http://www.goedesfeer.nl",
        "DistanceUnit": 0
    },
    "Connections": [
        {
            "ID": 36562,
            "ConnectionTypeID": 25,
            "LevelID": 2,
            "PowerKW": 3.7,
            "CurrentTypeID": 10
        }
    ],
    "NumberOfPoints": 1,
    "StatusTypeID": 50,
    "DateLastStatusUpdate": "2016-06-04T02:39:00Z",
    "DataQualityLevel": 3,
    "DateCreated": "2015-01-09T06:03:00Z",
    "SubmissionStatusTypeID": 100
}