{
    "MediaItems": [
        {
            "ID": 13336,
            "ChargePointID": 93213,
            "ItemURL": "https://s3-ap-southeast-2.amazonaws.com/openchargemap/images/DE/OCM93213/OCM-93213.orig.2017092519484412.jpg",
            "ItemThumbnailURL": "https://s3-ap-southeast-2.amazonaws.com/openchargemap/images/DE/OCM93213/OCM-93213.thmb.2017092519484412.jpg",
            "Comment": "",
            "IsEnabled": true,
            "IsVideo": false,
            "IsFeaturedItem": false,
            "IsExternalResource": false,
            "User": {
                "ID": 11914,
                "Username": "Heiko Schmidt"
            },
            "DateCreated": "2017-09-25T19:49:00Z"
        },
        {
            "ID": 13335,
            "ChargePointID": 93213,
            "ItemURL": "https://s3-ap-southeast-2.amazonaws.com/openchargemap/images/DE/OCM93213/OCM-93213.orig.2017092519452531.jpg",
            "ItemThumbnailURL": "https://s3-ap-southeast-2.amazonaws.com/openchargemap/images/DE/OCM93213/OCM-93213.thmb.2017092519452531.jpg",
            "Comment": "",
            "IsEnabled": true,
            "IsVideo": false,
            "IsFeaturedItem": false,
            "IsExternalResource": false,
            "User": {
                "ID": 11914,
                "Username": "Heiko Schmidt"
            },
            "DateCreated": "2017-09-25T19:46:00Z"
        },
        {
            "ID": 13334,
            "ChargePointID": 93213,
            "ItemURL": "https://s3-ap-southeast-2.amazonaws.com/openchargemap/images/DE/OCM93213/OCM-93213.orig.2017092519444839.jpg",
            "ItemThumbnailURL": "https://s3-ap-southeast-2.amazonaws.com/openchargemap/images/DE/OCM93213/OCM-93213.thmb.2017092519444839.jpg",
            "Comment": "",
            "IsEnabled": true,
            "IsVideo": false,
            "IsFeaturedItem": false,
            "IsExternalResource": false,
            "User": {
                "ID": 11914,
                "Username": "Heiko Schmidt"
            },
            "DateCreated": "2017-09-25T19:45:00Z"
        },
        {
            "ID": 13333,
            "ChargePointID": 93213,
            "ItemURL": "https://s3-ap-southeast-2.amazonaws.com/openchargemap/images/DE/OCM93213/OCM-93213.orig.2017092519440505.jpg",
            "ItemThumbnailURL": "https://s3-ap-southeast-2.amazonaws.com/openchargemap/images/DE/OCM93213/OCM-93213.thmb.2017092519440505.jpg",
            "Comment": "",
            "IsEnabled": true,
            "IsVideo": false,
            "IsFeaturedItem": false,
            "IsExternalResource": false,
            "User": {
                "ID": 11914,
                "Username": "Heiko Schmidt"
            },
            "DateCreated": "2017-09-25T19:44:00Z"
        }
    ],
    "IsRecentlyVerified": false,
    "ID": 93213,
    "UUID": "0C8AA031-D5AD-4B3F-831D-FB5A56EC6424",
    "DataProviderID": 1,
    "OperatorID": 86,
    "UsageTypeID": 1,
    "UsageCost": "Free",
    "AddressInfo": {
        "ID": 93559,
        "Title": "Rasthof Siegerland West",
        "AddressLine1": "Rasthaus Siegerland West 1",
        "Town": "Freudenberg",
        "Postcode": "57258",
        "CountryID": 87,
        "Latitude": 50.88029,
        "Longitude": 7.93509,
        "DistanceUnit": 0
    },
    "Connections": [
        {
            "ID": 132033,
            "ConnectionTypeID": 2,
            "StatusTypeID": 150,
            "LevelID": 3,
            "Voltage": 400,
            "PowerKW": 50,
            "CurrentTypeID": 30,
            "Quantity": 1
        },
        {
            "ID": 132034,
            "ConnectionTypeID": 1036,
            "StatusTypeID": 150,
            "LevelID": 3,
            "Amps": 63,
            "Voltage": 400,
            "PowerKW": 43,
            "CurrentTypeID": 20,
            "Quantity": 1
        },
        {
            "ID": 132035,
            "ConnectionTypeID": 33,
            "StatusTypeID": 150,
            "LevelID": 3,
            "Voltage": 400,
            "PowerKW": 50,
            "CurrentTypeID": 30,
            "Quantity": 1
        }
    ],
    "NumberOfPoints": 2,
    "StatusTypeID": 50,
    "DateLastStatusUpdate": "2017-10-09T10:29:00Z",
    "DataQualityLevel": 1,
    "DateCreated": "2017-09-22T11:15:00Z",
    "SubmissionStatusTypeID": 200
}