{
    "IsRecentlyVerified": false,
    "ID": 17050,
    "UUID": "53F2F035-DCEB-4544-AB16-CFC4C0774096",
    "DataProviderID": 22,
    "DataProvidersReference": "106D6A60386B448F80D401758C203F54",
    "AddressInfo": {
        "ID": 17395,
        "Title": "埼玉日産自動車東松山店",
        "AddressLine1": "埼玉県東松山市古凍18-3",
        "CountryID": 114,
        "Latitude": 36.01589633,
        "Longitude": 139.4311224,
        "ContactTelephone1": "0493-24-2525",
        "DistanceUnit": 0
    },
    "Connections": [
        {
            "ID": 17291,
            "ConnectionTypeID": 2,
            "LevelID": 2,
            "Amps": 100,
            "Voltage": 480,
            "PowerKW": 48,
            "Quantity": 1
        }
    ],
    "DateLastStatusUpdate": "2013-06-29T08:53:00Z",
    "DataQualityLevel": 2,
    "DateCreated": "2013-06-29T08:53:00Z",
    "SubmissionStatusTypeID": 200
}