{
    "IsRecentlyVerified": false,
    "ID": 153544,
    "UUID": "8E796EC0-69EF-4BB1-8AC9-CEC03DA3912F",
    "DataProviderID": 28,
    "DataProvidersReference": "FR*S10*P10003C",
    "UsageTypeID": 5,
    "AddressInfo": {
        "ID": 153897,
        "Title": "VILLEMAUR SUR VANNE",
        "AddressLine1": "3 Rue de l'Église 10160 VILLEMAUR SUR VANNE",
        "CountryID": 80,
        "Latitude": 48.257447,
        "Longitude": 3.727224,
        "AccessComments": "",
        "DistanceUnit": 0
    },
    "Connections": [
        {
            "ID": 215470,
            "ConnectionTypeID": 28,
            "StatusTypeID": 50,
            "LevelID": 2,
            "PowerKW": 18,
            "CurrentTypeID": 10
        },
        {
            "ID": 215471,
            "ConnectionTypeID": 25,
            "StatusTypeID": 50,
            "LevelID": 2,
            "PowerKW": 18,
            "CurrentTypeID": 20
        },
        {
            "ID": 248973,
            "ConnectionTypeID": 28,
            "StatusTypeID": 50,
            "LevelID": 2,
            "PowerKW": 18,
            "CurrentTypeID": 10
        },
        {
            "ID": 248974,
            "ConnectionTypeID": 25,
            "StatusTypeID": 50,
            "LevelID": 2,
            "PowerKW": 18,
            "CurrentTypeID": 20
        }
    ],
    "GeneralComments": "\"Une unité = 6kWh de recharge. Utilisateur abonné : 1€/unité",
    "StatusTypeID": 50,
    "DateLastStatusUpdate": "2020-08-27T05:14:00Z",
    "DataQualityLevel": 2,
    "DateCreated": "2020-03-15T10:54:00Z",
    "SubmissionStatusTypeID": 100
}