{
    "IsRecentlyVerified": false,
    "ID": 93121,
    "UUID": "BAD67A21-40C2-4205-AB2F-7A3C98D65EBA",
    "DataProviderID": 1,
    "OperatorID": 80,
    "UsageTypeID": 4,
    "UsageCost": "0,40 €/kW",
    "AddressInfo": {
        "ID": 93467,
        "Title": " Eneldrive Comune di Roccavignale ",
        "AddressLine1": "Via Roma, 20",
        "AddressLine2": "Valzemola ",
        "Town": "Roccavignale",
        "StateOrProvince": "SV",
        "Postcode": "17017 ",
        "CountryID": 112,
        "Latitude": 44.3619439690667,
        "Longitude": 8.19175106245086,
        "RelatedURL": "http://eneldrive.it",
        "DistanceUnit": 0
    },
    "Connections": [
        {
            "ID": 131910,
            "ConnectionTypeID": 25,
            "StatusTypeID": 50,
            "LevelID": 2,
            "Amps": 32,
            "Voltage": 400,
            "PowerKW": 22,
            "CurrentTypeID": 20,
            "Quantity": 1
        },
        {
            "ID": 131911,
            "ConnectionTypeID": 36,
            "StatusTypeID": 50,
            "LevelID": 2,
            "Amps": 16,
            "Voltage": 240,
            "PowerKW": 3,
            "CurrentTypeID": 10,
            "Quantity": 1
        }
    ],
    "NumberOfPoints": 2,
    "GeneralComments": "http://www.forumelettrico.it/forum/nuova-colonnina-enel-a-valzemola-di-roccavignale-sv-t1498.html#p8554",
    "StatusTypeID": 50,
    "DateLastStatusUpdate": "2017-09-21T14:02:00Z",
    "DataQualityLevel": 1,
    "DateCreated": "2017-09-19T10:17:00Z",
    "SubmissionStatusTypeID": 200
}