{
    "IsRecentlyVerified": false,
    "ID": 27874,
    "UUID": "8B2316E5-EF01-4507-8770-85E9EB2B4093",
    "DataProviderID": 2,
    "DataProvidersReference": "43856",
    "OperatorID": 39,
    "UsageTypeID": 4,
    "AddressInfo": {
        "ID": 28220,
        "Title": "Walgreens - Olathe, KS #4183",
        "AddressLine1": "545 E Santa Fe St",
        "Town": "Olathe",
        "StateOrProvince": "KS",
        "Postcode": "66061",
        "CountryID": 2,
        "Latitude": 38.8834724,
        "Longitude": -94.8087324,
        "ContactTelephone1": "800-663-5633",
        "AccessComments": "MO: Not Specified; TU: Not Specified; WE: Not Specified; TH: Not Specified; FR: Not Specified; SA: Not Specified; SU: Not Specified",
        "RelatedURL": "http://www.semacharge.com/",
        "DistanceUnit": 0
    },
    "Connections": [
        {
            "ID": 30610,
            "ConnectionTypeID": 1,
            "LevelID": 2,
            "Amps": 16,
            "Voltage": 230,
            "PowerKW": 3,
            "CurrentTypeID": 10,
            "Quantity": 1
        }
    ],
    "DateLastStatusUpdate": "2019-04-06T04:03:00Z",
    "DataQualityLevel": 3,
    "DateCreated": "2014-11-28T03:38:00Z",
    "SubmissionStatusTypeID": 100
}