{
    "IsRecentlyVerified": false,
    "ID": 158750,
    "UUID": "8D19D1CB-967E-4861-98BA-1867F8559250",
    "DataProviderID": 2,
    "DataProvidersReference": "153236",
    "OperatorID": 59,
    "UsageTypeID": 1,
    "AddressInfo": {
        "ID": 159107,
        "Title": "Greenlots - 12252A",
        "AddressLine1": "1936 N DALY ST",
        "Town": "Los Angeles",
        "StateOrProvince": "CA",
        "Postcode": "90031",
        "CountryID": 2,
        "Latitude": 34.0665626525879,
        "Longitude": -118.215370178223,
        "ContactTelephone1": "855-900-7584",
        "AccessComments": "24 hours daily",
        "RelatedURL": "http://greenlots.com/",
        "DistanceUnit": 0
    },
    "Connections": [
        {
            "ID": 228776,
            "ConnectionTypeID": 1,
            "LevelID": 2,
            "Amps": 16,
            "Voltage": 230,
            "PowerKW": 3.7,
            "CurrentTypeID": 10,
            "Quantity": 1
        }
    ],
    "StatusTypeID": 50,
    "DateLastStatusUpdate": "2020-06-26T02:56:00Z",
    "DataQualityLevel": 3,
    "DateCreated": "2020-06-26T02:56:00Z",
    "SubmissionStatusTypeID": 100
}