{
    "IsRecentlyVerified": false,
    "ID": 145258,
    "UUID": "5965F161-33DD-4562-A1CA-7E8425372493",
    "DataProviderID": 2,
    "DataProvidersReference": "122928",
    "UsageTypeID": 1,
    "AddressInfo": {
        "ID": 145610,
        "Title": "Marystown YMCA",
        "AddressLine1": "55-263 McGettigan Blvd",
        "Town": "Marystown",
        "StateOrProvince": "NL",
        "Postcode": "A0E 2M0",
        "CountryID": 44,
        "Latitude": 47.177431,
        "Longitude": -55.151194,
        "ContactTelephone1": "709-279-9622",
        "AccessComments": "24 hours daily",
        "RelatedURL": "",
        "DistanceUnit": 0
    },
    "Connections": [
        {
            "ID": 201883,
            "ConnectionTypeID": 1,
            "LevelID": 2,
            "Amps": 16,
            "Voltage": 230,
            "PowerKW": 3.7,
            "CurrentTypeID": 10,
            "Quantity": 2
        }
    ],
    "StatusTypeID": 50,
    "DateLastStatusUpdate": "2020-06-26T03:10:00Z",
    "DataQualityLevel": 3,
    "DateCreated": "2019-12-24T09:24:00Z",
    "SubmissionStatusTypeID": 100
}