{
    "IsRecentlyVerified": false,
    "ID": 136779,
    "UUID": "B4642A30-B5E4-457B-9AAC-E2046832F33C",
    "DataProviderID": 18,
    "DataProvidersReference": "891d8ab188d7d739d5566f304a37731a",
    "OperatorID": 2244,
    "UsageTypeID": 5,
    "AddressInfo": {
        "ID": 137125,
        "Title": "Back Sandon Street",
        "AddressLine1": "Back Sandon Street",
        "Town": "Liverpool",
        "Postcode": "L8 7LS",
        "CountryID": 1,
        "Latitude": 53.397608,
        "Longitude": -2.964978,
        "AccessComments": "",
        "RelatedURL": "https://www.ubitricity.com",
        "DistanceUnit": 0
    },
    "Connections": [
        {
            "ID": 191373,
            "ConnectionTypeID": 25,
            "Reference": "suby1100001787",
            "StatusTypeID": 50,
            "LevelID": 2,
            "Amps": 16,
            "Voltage": 230,
            "PowerKW": 3.7,
            "CurrentTypeID": 10
        }
    ],
    "StatusTypeID": 0,
    "DateLastStatusUpdate": "2021-04-25T05:46:00Z",
    "MetadataValues": [
        {
            "ID": 6631,
            "MetadataFieldID": 4,
            "ItemValue": "Contains public sector information licensed under the Open Government Licence v2.0. http://www.nationalarchives.gov.uk/doc/open-government-licence/version/2/"
        }
    ],
    "DataQualityLevel": 3,
    "DateCreated": "2019-12-24T05:23:00Z",
    "SubmissionStatusTypeID": 100
}