{
    "IsRecentlyVerified": false,
    "ID": 71711,
    "UUID": "4BBC0653-FC5B-4400-A475-2E0EB2205568",
    "DataProviderID": 1,
    "OperatorID": 156,
    "UsageTypeID": 4,
    "AddressInfo": {
        "ID": 72057,
        "Title": "Autohaus Fröhlich",
        "AddressLine1": "Ostendstraße 154",
        "Town": "Nürnberg",
        "StateOrProvince": "Bayern",
        "Postcode": "90482",
        "CountryID": 87,
        "Latitude": 49.45684874167368,
        "Longitude": 11.122554228172236,
        "ContactTelephone1": "+49 911 954080",
        "AccessComments": "2 grün markierte Parkplätze am Peugeot / Mitsubishi Autohaus. 24/7 nutzbar mit The New Motion Ladekarte oder von Roamingpartnern.",
        "RelatedURL": "http://www.autohaus-froehlich.de/aktionen/green-mobility.html",
        "DistanceUnit": 0
    },
    "Connections": [
        {
            "ID": 102713,
            "ConnectionTypeID": 25,
            "StatusTypeID": 50,
            "LevelID": 2,
            "Amps": 16,
            "Voltage": 400,
            "PowerKW": 11,
            "CurrentTypeID": 20,
            "Quantity": 2
        }
    ],
    "NumberOfPoints": 2,
    "StatusTypeID": 50,
    "DateLastStatusUpdate": "2016-09-05T07:07:00Z",
    "DataQualityLevel": 1,
    "DateCreated": "2016-09-05T07:07:00Z",
    "SubmissionStatusTypeID": 200
}