{
    "IsRecentlyVerified": false,
    "ID": 141044,
    "UUID": "07B5C0C7-B863-4015-89A8-A9D6091A9F55",
    "DataProviderID": 2,
    "DataProvidersReference": "96331",
    "OperatorID": 9,
    "UsageTypeID": 1,
    "AddressInfo": {
        "ID": 141396,
        "Title": "McDonald's #16318 - Bailey Rd - Bay Point CA",
        "AddressLine1": "220 Bailey Road",
        "Town": "Bay Point",
        "StateOrProvince": "CA",
        "Postcode": "94565",
        "CountryID": 2,
        "Latitude": 38.021149,
        "Longitude": -121.942255,
        "ContactTelephone1": "888-998-2546",
        "AccessComments": "MON: 24 hours | TUE: 24 hours | WED: 24 hours | THU: 24 hours | FRI: 24 hours | SAT: 24 hours | SUN: 24 hours",
        "RelatedURL": "http://www.blinkcharging.com/",
        "DistanceUnit": 0
    },
    "Connections": [
        {
            "ID": 196852,
            "ConnectionTypeID": 1,
            "LevelID": 2,
            "Amps": 16,
            "Voltage": 230,
            "PowerKW": 3.7,
            "CurrentTypeID": 10,
            "Quantity": 3
        }
    ],
    "StatusTypeID": 50,
    "DateLastStatusUpdate": "2020-06-26T02:59:00Z",
    "DataQualityLevel": 3,
    "DateCreated": "2019-12-24T09:14:00Z",
    "SubmissionStatusTypeID": 100
}