{
    "IsRecentlyVerified": false,
    "ID": 35154,
    "UUID": "5425E538-C9EB-4DA1-A2A9-0BEB57A56665",
    "DataProviderID": 26,
    "DataProvidersReference": "31085",
    "OperatorID": 157,
    "OperatorsReference": "NewMotion ICUTULIP000017",
    "UsageCost": "0.00 jaarabonnement",
    "AddressInfo": {
        "ID": 35500,
        "Title": "Sterremos 35",
        "AddressLine1": "Sterremos 35",
        "Town": "Veenendaal",
        "Postcode": "3904 JW",
        "CountryID": 159,
        "Latitude": 52.0055274963379,
        "Longitude": 5.54270029067993,
        "ContactTelephone1": "088 0109500",
        "RelatedURL": "http://thenewmotion.nl/",
        "DistanceUnit": 0
    },
    "Connections": [
        {
            "ID": 38665,
            "ConnectionTypeID": 25,
            "LevelID": 2,
            "PowerKW": 11,
            "CurrentTypeID": 10
        }
    ],
    "NumberOfPoints": 1,
    "StatusTypeID": 50,
    "DateLastStatusUpdate": "2016-06-04T02:43:00Z",
    "DataQualityLevel": 3,
    "DateCreated": "2015-01-09T06:04:00Z",
    "SubmissionStatusTypeID": 100
}