{
    "IsRecentlyVerified": false,
    "ID": 9640,
    "UUID": "1B7F0C3B-3FD4-4428-82E9-BF60537A5900",
    "DataProviderID": 15,
    "DataProvidersReference": "15546",
    "OperatorID": 1,
    "AddressInfo": {
        "ID": 9537,
        "Title": "215 N 2nd St",
        "AddressLine1": "215 N 2nd St",
        "Town": "El Cajon",
        "StateOrProvince": "CA",
        "Postcode": "92021",
        "CountryID": 2,
        "Latitude": 32.7968411,
        "Longitude": -116.9354882,
        "ContactTelephone1": "(619) 401-0761",
        "RelatedURL": "http://carstations.com/15546",
        "DistanceUnit": 0
    },
    "Connections": [
        {
            "ID": 7400,
            "ConnectionTypeID": 1,
            "Reference": "J1772",
            "LevelID": 2
        }
    ],
    "StatusTypeID": 0,
    "DateLastStatusUpdate": "2017-11-04T14:04:00Z",
    "DataQualityLevel": 2,
    "DateCreated": "2012-03-20T12:43:00Z",
    "SubmissionStatusTypeID": 100
}