{
    "UserComments": [
        {
            "ID": 22203,
            "ChargePointID": 148044,
            "CommentTypeID": 10,
            "UserName": "polianto",
            "Comment": "https://www.forumelettrico.it/forum/colonnina-fast-ressolar-caravaggio-via-giuseppe-mazzini-12-t9433.html",
            "Rating": 4,
            "RelatedURL": "https://www.forumelettrico.it/forum/colonnina-fast-ressolar-caravaggio-via-giuseppe-mazzini-12-t9433.html",
            "DateCreated": "2020-02-22T18:13:32.213Z",
            "User": {
                "ID": 1606,
                "Username": "polianto"
            },
            "CheckinStatusTypeID": 10,
            "IsActionedByEditor": false
        }
    ],
    "MediaItems": [
        {
            "ID": 21314,
            "ChargePointID": 148044,
            "ItemURL": "https://s3-ap-southeast-2.amazonaws.com/openchargemap/images/IT/OCM148044/OCM-148044.orig.2020022217524094.jpg",
            "ItemThumbnailURL": "https://s3-ap-southeast-2.amazonaws.com/openchargemap/images/IT/OCM148044/OCM-148044.thmb.2020022217524094.jpg",
            "Comment": "",
            "IsEnabled": true,
            "IsVideo": false,
            "IsFeaturedItem": false,
            "IsExternalResource": false,
            "User": {
                "ID": 1606,
                "Username": "polianto"
            },
            "DateCreated": "2020-02-22T17:53:00Z"
        },
        {
            "ID": 21315,
            "ChargePointID": 148044,
            "ItemURL": "https://s3-ap-southeast-2.amazonaws.com/openchargemap/images/IT/OCM148044/OCM-148044.orig.2020022217530112.jpg",
            "ItemThumbnailURL": "https://s3-ap-southeast-2.amazonaws.com/openchargemap/images/IT/OCM148044/OCM-148044.thmb.2020022217530112.jpg",
            "Comment": "",
            "IsEnabled": true,
            "IsVideo": false,
            "IsFeaturedItem": false,
            "IsExternalResource": false,
            "User": {
                "ID": 1606,
                "Username": "polianto"
            },
            "DateCreated": "2020-02-22T17:53:00Z"
        },
        {
            "ID": 21312,
            "ChargePointID": 148044,
            "ItemURL": "https://s3-ap-southeast-2.amazonaws.com/openchargemap/images/IT/OCM148044/OCM-148044.orig.2020022217520948.jpg",
            "ItemThumbnailURL": "https://s3-ap-southeast-2.amazonaws.com/openchargemap/images/IT/OCM148044/OCM-148044.thmb.2020022217520948.jpg",
            "Comment": "",
            "IsEnabled": true,
            "IsVideo": false,
            "IsFeaturedItem": false,
            "IsExternalResource": false,
            "User": {
                "ID": 1606,
                "Username": "polianto"
            },
            "DateCreated": "2020-02-22T17:52:00Z"
        },
        {
            "ID": 21313,
            "ChargePointID": 148044,
            "ItemURL": "https://s3-ap-southeast-2.amazonaws.com/openchargemap/images/IT/OCM148044/OCM-148044.orig.2020022217522258.jpg",
            "ItemThumbnailURL": "https://s3-ap-southeast-2.amazonaws.com/openchargemap/images/IT/OCM148044/OCM-148044.thmb.2020022217522258.jpg",
            "Comment": "",
            "IsEnabled": true,
            "IsVideo": false,
            "IsFeaturedItem": false,
            "IsExternalResource": false,
            "User": {
                "ID": 1606,
                "Username": "polianto"
            },
            "DateCreated": "2020-02-22T17:52:00Z"
        },
        {
            "ID": 21234,
            "ChargePointID": 148044,
            "ItemURL": "https://s3-ap-southeast-2.amazonaws.com/openchargemap/images/IT/OCM148044/OCM-148044.orig.2020021409583494.jpg",
            "ItemThumbnailURL": "https://s3-ap-southeast-2.amazonaws.com/openchargemap/images/IT/OCM148044/OCM-148044.thmb.2020021409583494.jpg",
            "Comment": "",
            "IsEnabled": true,
            "IsVideo": false,
            "IsFeaturedItem": false,
            "IsExternalResource": false,
            "User": {
                "ID": 25016,
                "Username": "RobSonz"
            },
            "DateCreated": "2020-02-14T09:59:00Z"
        }
    ],
    "IsRecentlyVerified": false,
    "ID": 148044,
    "UUID": "B80A65B6-FAEE-435B-9F01-82D51ADA2671",
    "DataProviderID": 1,
    "OperatorID": 3382,
    "UsageTypeID": 4,
    "AddressInfo": {
        "ID": 148396,
        "Title": "Caravaggio Mazzini Fast | Ressolar",
        "AddressLine1": "Via G. Mazzini, 12",
        "Town": "Caravaggio",
        "StateOrProvince": "BG",
        "Postcode": "24043",
        "CountryID": 112,
        "Latitude": 45.49906139601413,
        "Longitude": 9.639550840314314,
        "ContactTelephone1": "+39 035 36 92 145",
        "ContactEmail": "info@ressolar.it",
        "RelatedURL": "https://www.ressolar.it/mobilita-sostenibile/",
        "DistanceUnit": 0
    },
    "Connections": [
        {
            "ID": 205525,
            "ConnectionTypeID": 33,
            "StatusTypeID": 50,
            "LevelID": 3,
            "Amps": 120,
            "Voltage": 400,
            "PowerKW": 50,
            "CurrentTypeID": 30,
            "Quantity": 1
        },
        {
            "ID": 205526,
            "ConnectionTypeID": 2,
            "StatusTypeID": 50,
            "LevelID": 3,
            "Amps": 120,
            "Voltage": 400,
            "PowerKW": 50,
            "CurrentTypeID": 30,
            "Quantity": 1
        },
        {
            "ID": 205527,
            "ConnectionTypeID": 25,
            "StatusTypeID": 50,
            "LevelID": 2,
            "Amps": 32,
            "Voltage": 400,
            "PowerKW": 22,
            "CurrentTypeID": 20,
            "Quantity": 1
        }
    ],
    "NumberOfPoints": 2,
    "GeneralComments": "Si attiva si attiva con l'app Wroom",
    "StatusTypeID": 50,
    "DateLastStatusUpdate": "2020-02-22T18:14:00Z",
    "DataQualityLevel": 1,
    "DateCreated": "2020-01-23T16:43:00Z",
    "SubmissionStatusTypeID": 200
}