{
    "IsRecentlyVerified": false,
    "ID": 159694,
    "UUID": "52901D5D-5A1F-4ECD-A0AC-EE6C08714B21",
    "DataProviderID": 2,
    "DataProvidersReference": "153870",
    "UsageTypeID": 2,
    "AddressInfo": {
        "ID": 160051,
        "Title": "United Nations",
        "AddressLine1": "405 E 42nd St",
        "Town": "New York",
        "StateOrProvince": "NY",
        "Postcode": "10017",
        "CountryID": 2,
        "Latitude": 40.748965,
        "Longitude": -73.969649,
        "ContactTelephone1": "",
        "AccessComments": "Business Hours",
        "RelatedURL": "",
        "DistanceUnit": 0
    },
    "Connections": [
        {
            "ID": 229899,
            "ConnectionTypeID": 1,
            "LevelID": 2,
            "Amps": 16,
            "Voltage": 230,
            "PowerKW": 3.7,
            "CurrentTypeID": 10,
            "Quantity": 24
        }
    ],
    "StatusTypeID": 50,
    "DateLastStatusUpdate": "2020-06-26T03:03:00Z",
    "DataQualityLevel": 3,
    "DateCreated": "2020-06-26T03:03:00Z",
    "SubmissionStatusTypeID": 100
}