{
    "IsRecentlyVerified": false,
    "ID": 110166,
    "UUID": "48203DBB-29A8-4592-B63A-76FE1B055863",
    "DataProviderID": 2,
    "DataProvidersReference": "103791",
    "UsageTypeID": 1,
    "AddressInfo": {
        "ID": 110512,
        "Title": "LADWP - Fruitland Drive",
        "AddressLine1": "11011 7/8 Fruitland Dr",
        "Town": "Studio City",
        "StateOrProvince": "CA",
        "Postcode": "91604",
        "CountryID": 2,
        "Latitude": 34.139805,
        "Longitude": -118.370659,
        "ContactTelephone1": "800-342-5397",
        "AccessComments": "24 hours daily",
        "RelatedURL": "",
        "DistanceUnit": 0
    },
    "Connections": [
        {
            "ID": 155400,
            "ConnectionTypeID": 1,
            "LevelID": 2,
            "Amps": 16,
            "Voltage": 230,
            "PowerKW": 3,
            "CurrentTypeID": 10,
            "Quantity": 1
        }
    ],
    "DateLastStatusUpdate": "2019-04-06T04:01:00Z",
    "DataQualityLevel": 3,
    "DateCreated": "2018-10-18T23:35:00Z",
    "SubmissionStatusTypeID": 100
}