{
    "IsRecentlyVerified": false,
    "ID": 142532,
    "UUID": "08FEF63E-8D31-4D8C-A252-39CFD90B97BB",
    "DataProviderID": 2,
    "DataProvidersReference": "123094",
    "OperatorID": 3372,
    "UsageTypeID": 1,
    "AddressInfo": {
        "ID": 142884,
        "Title": "Centereach Park",
        "AddressLine1": "284 Hawkins Rd",
        "Town": "Centereach",
        "StateOrProvince": "NY",
        "Postcode": "11720",
        "CountryID": 2,
        "Latitude": 40.8817692999999,
        "Longitude": -73.0758190999999,
        "ContactTelephone1": "866-816-7584",
        "AccessComments": "24 hours daily",
        "RelatedURL": "http://evconnect.com/",
        "DistanceUnit": 0
    },
    "Connections": [
        {
            "ID": 198686,
            "ConnectionTypeID": 1,
            "LevelID": 2,
            "Amps": 16,
            "Voltage": 230,
            "PowerKW": 3.7,
            "CurrentTypeID": 10,
            "Quantity": 2
        }
    ],
    "StatusTypeID": 50,
    "DateLastStatusUpdate": "2020-06-26T03:03:00Z",
    "DataQualityLevel": 3,
    "DateCreated": "2019-12-24T09:18:00Z",
    "SubmissionStatusTypeID": 100
}