{
    "IsRecentlyVerified": false,
    "ID": 18616,
    "UUID": "0914A00A-C764-483D-AF67-6779C2D127F0",
    "DataProviderID": 15,
    "DataProvidersReference": "32910",
    "OperatorID": 1,
    "UsageTypeID": 1,
    "AddressInfo": {
        "ID": 18961,
        "Title": "110 S.W. Washington St",
        "AddressLine1": "110 S.W. Washington St",
        "Town": "Peoria",
        "StateOrProvince": "IL",
        "Postcode": "61602",
        "CountryID": 2,
        "Latitude": 40.68987,
        "Longitude": -89.58865,
        "ContactTelephone1": "866-772-4429",
        "RelatedURL": "http://carstations.com/32910",
        "DistanceUnit": 0
    },
    "Connections": [
        {
            "ID": 18849,
            "ConnectionTypeID": 1,
            "Reference": "J1772",
            "LevelID": 2
        }
    ],
    "NumberOfPoints": 2,
    "StatusTypeID": 50,
    "DateLastStatusUpdate": "2017-11-04T14:04:00Z",
    "DataQualityLevel": 2,
    "DateCreated": "2013-08-25T03:29:00Z",
    "SubmissionStatusTypeID": 200
}