{
    "IsRecentlyVerified": false,
    "ID": 43279,
    "UUID": "46DBD95A-740A-4187-8D9F-1D3EFAAE87E1",
    "DataProviderID": 2,
    "DataProvidersReference": "64797",
    "UsageTypeID": 1,
    "AddressInfo": {
        "ID": 43625,
        "Title": "Moffitt's Ford Lincoln & RV",
        "AddressLine1": "1819 SE Marshall St",
        "Town": "Boone",
        "StateOrProvince": "IA",
        "Postcode": "50036",
        "CountryID": 2,
        "Latitude": 42.035997,
        "Longitude": -93.864963,
        "ContactTelephone1": "515-432-6336",
        "AccessComments": "8am-5pm M-F, 8am-12pm Sat",
        "RelatedURL": "",
        "DistanceUnit": 0
    },
    "Connections": [
        {
            "ID": 52457,
            "ConnectionTypeID": 1,
            "LevelID": 2,
            "Amps": 16,
            "Voltage": 230,
            "PowerKW": 3.7,
            "CurrentTypeID": 10,
            "Quantity": 1
        }
    ],
    "DateLastStatusUpdate": "2020-06-26T03:05:00Z",
    "DataQualityLevel": 3,
    "DateCreated": "2015-03-25T04:44:00Z",
    "SubmissionStatusTypeID": 100
}