{
    "IsRecentlyVerified": false,
    "ID": 70507,
    "UUID": "F2D29D75-F5DD-4147-B50F-41C164692E34",
    "DataProviderID": 1,
    "OperatorID": 32,
    "OperatorsReference": "3528,3529",
    "UsageTypeID": 4,
    "UsageCost": "£0.108/kWh; for Polar Plus subscription members only",
    "AddressInfo": {
        "ID": 70853,
        "Title": "Newbury Place Health Centre",
        "AddressLine1": "Bury New Road",
        "AddressLine2": "Higher Broughton",
        "Town": "Salford",
        "StateOrProvince": "Greater Manchester",
        "Postcode": "M7 4NX",
        "CountryID": 1,
        "Latitude": 53.507153,
        "Longitude": -2.26085,
        "DistanceUnit": 0
    },
    "Connections": [
        {
            "ID": 100911,
            "ConnectionTypeID": 25,
            "StatusTypeID": 50,
            "LevelID": 2,
            "Amps": 16,
            "Voltage": 400,
            "PowerKW": 11,
            "CurrentTypeID": 20,
            "Quantity": 4
        }
    ],
    "NumberOfPoints": 4,
    "StatusTypeID": 50,
    "DateLastStatusUpdate": "2019-03-08T06:31:00Z",
    "DataQualityLevel": 1,
    "DateCreated": "2016-07-20T06:07:00Z",
    "SubmissionStatusTypeID": 200
}