{
    "IsRecentlyVerified": false,
    "ID": 43617,
    "UUID": "0BFCC1A4-9D04-4FDA-B059-026012A51A19",
    "DataProviderID": 1,
    "OperatorID": 45,
    "UsageTypeID": 1,
    "UsageCost": "0",
    "AddressInfo": {
        "ID": 43963,
        "Title": "Einkaufszentrum Ruhr Park",
        "AddressLine1": "Ruhr Park 104",
        "Town": "Bochum",
        "StateOrProvince": "Bochum",
        "Postcode": "44791",
        "CountryID": 87,
        "Latitude": 51.4952888,
        "Longitude": 7.28427769999996,
        "AccessComments": "Ladesäule neben dem Busbahnhof gegenüber der Apotheke. Parken und Laden kostenlos, immer nutzbar. Bei Problemen Centermanagement kontaktieren, Büro direkt hinter der Säule, Mo-Sa 10-20Uhr besetzt",
        "RelatedURL": "http://www.ruhrpark.de/",
        "DistanceUnit": 0
    },
    "Connections": [
        {
            "ID": 52921,
            "ConnectionTypeID": 25,
            "StatusTypeID": 50,
            "LevelID": 2,
            "Amps": 32,
            "Voltage": 400,
            "PowerKW": 22,
            "CurrentTypeID": 20,
            "Quantity": 2
        }
    ],
    "NumberOfPoints": 2,
    "StatusTypeID": 50,
    "DateLastStatusUpdate": "2015-04-08T09:30:00Z",
    "DataQualityLevel": 1,
    "DateCreated": "2015-04-08T09:27:00Z",
    "SubmissionStatusTypeID": 200
}