{
    "IsRecentlyVerified": false,
    "ID": 126635,
    "UUID": "6251BB08-E40A-4088-9824-65C00DF490EA",
    "DataProviderID": 1,
    "OperatorID": 23,
    "OperatorsReference": "26667",
    "UsageTypeID": 4,
    "AddressInfo": {
        "ID": 126981,
        "Title": "The Royal Berkshire Hotel",
        "AddressLine1": "London Road",
        "Town": "Ascot",
        "Postcode": "SL5 0PP",
        "CountryID": 1,
        "Latitude": 51.407508,
        "Longitude": -0.634834,
        "ContactTelephone1": "+44 134 462 3322",
        "DistanceUnit": 0
    },
    "Connections": [
        {
            "ID": 177376,
            "ConnectionTypeID": 30,
            "StatusTypeID": 50,
            "LevelID": 2,
            "PowerKW": 7,
            "CurrentTypeID": 20,
            "Quantity": 1
        }
    ],
    "NumberOfPoints": 1,
    "GeneralComments": "1 Tesla Connector, up to 7kW.Available for customers. Please call ahead.",
    "StatusTypeID": 50,
    "DateLastStatusUpdate": "2019-05-16T05:42:00Z",
    "DataQualityLevel": 1,
    "DateCreated": "2019-05-16T05:42:00Z",
    "SubmissionStatusTypeID": 200
}