{
    "IsRecentlyVerified": false,
    "ID": 133547,
    "UUID": "222EA4BE-5DF7-447B-8B25-073CA16AD01A",
    "DataProviderID": 1,
    "OperatorID": 23,
    "OperatorsReference": "52203",
    "UsageTypeID": 4,
    "AddressInfo": {
        "ID": 133893,
        "Title": "Swiss Diamond Hotel",
        "AddressLine1": "Riva Lago Olivella",
        "Town": "Vico Morcote",
        "Postcode": "6921",
        "CountryID": 217,
        "Latitude": 45.933013,
        "Longitude": 8.929373,
        "ContactTelephone1": "+41 91 735 00 00 ",
        "DistanceUnit": 0
    },
    "Connections": [
        {
            "ID": 186932,
            "ConnectionTypeID": 30,
            "StatusTypeID": 50,
            "LevelID": 2,
            "PowerKW": 11,
            "CurrentTypeID": 20,
            "Quantity": 1
        }
    ],
    "NumberOfPoints": 1,
    "GeneralComments": "1 Tesla Connector, up to 11kW.Available for customers. Please see valet.",
    "StatusTypeID": 50,
    "DateLastStatusUpdate": "2019-10-21T05:44:00Z",
    "DataQualityLevel": 1,
    "DateCreated": "2019-10-21T05:44:00Z",
    "SubmissionStatusTypeID": 200
}