{
    "IsRecentlyVerified": false,
    "ID": 180143,
    "UUID": "7AE3A4B4-C59A-4A8A-98EF-05DCA64503EE",
    "DataProviderID": 29,
    "DataProvidersReference": "3709",
    "OperatorID": 44,
    "AddressInfo": {
        "ID": 180502,
        "Title": "Software Center 1",
        "AddressLine1": "Software Center 1",
        "Town": "Marburg",
        "Postcode": "35037",
        "CountryID": 87,
        "Latitude": 50.80292,
        "Longitude": 8.768025,
        "DistanceUnit": 0
    },
    "Connections": [
        {
            "ID": 282863,
            "ConnectionTypeID": 25,
            "StatusTypeID": 50,
            "LevelID": 2,
            "PowerKW": 22,
            "CurrentTypeID": 20
        },
        {
            "ID": 282864,
            "ConnectionTypeID": 25,
            "StatusTypeID": 50,
            "LevelID": 2,
            "PowerKW": 22,
            "CurrentTypeID": 20
        }
    ],
    "StatusTypeID": 50,
    "DateLastStatusUpdate": "2021-07-12T02:45:00Z",
    "MetadataValues": [
        {
            "ID": 12437,
            "MetadataFieldID": 4,
            "ItemValue": "Data from the German chargepoint registry provided by Bundesnetzagentur.de under the CC-BY 4.0 license"
        }
    ],
    "DataQualityLevel": 3,
    "DateCreated": "2021-07-08T10:00:00Z",
    "SubmissionStatusTypeID": 100
}