{
    "IsRecentlyVerified": false,
    "ID": 184537,
    "UUID": "E5D6D3DB-017F-4DB5-B6F5-3A0217991561",
    "DataProviderID": 29,
    "DataProvidersReference": "4925",
    "OperatorID": 148,
    "AddressInfo": {
        "ID": 184896,
        "Title": "Bahnhofstraße 1",
        "AddressLine1": "Bahnhofstraße 1",
        "Town": "Haldensleben",
        "Postcode": "39340",
        "CountryID": 87,
        "Latitude": 52.288756,
        "Longitude": 11.412099,
        "DistanceUnit": 0
    },
    "Connections": [
        {
            "ID": 292933,
            "ConnectionTypeID": 25,
            "StatusTypeID": 50,
            "LevelID": 2,
            "PowerKW": 22,
            "CurrentTypeID": 20
        },
        {
            "ID": 292934,
            "ConnectionTypeID": 25,
            "StatusTypeID": 50,
            "LevelID": 2,
            "PowerKW": 22,
            "CurrentTypeID": 20
        }
    ],
    "StatusTypeID": 50,
    "DateLastStatusUpdate": "2021-07-12T02:49:00Z",
    "MetadataValues": [
        {
            "ID": 16828,
            "MetadataFieldID": 4,
            "ItemValue": "Data from the German chargepoint registry provided by Bundesnetzagentur.de under the CC-BY 4.0 license"
        }
    ],
    "DataQualityLevel": 3,
    "DateCreated": "2021-07-08T10:05:00Z",
    "SubmissionStatusTypeID": 100
}