{
    "IsRecentlyVerified": false,
    "ID": 36559,
    "UUID": "6AF4CEF3-71C5-4354-8328-810F42FB137D",
    "DataProviderID": 26,
    "DataProvidersReference": "45789",
    "OperatorID": 73,
    "OperatorsReference": "EV-Box EVB-P1348122",
    "UsageCost": "0.00 jaarabonnement",
    "AddressInfo": {
        "ID": 36905,
        "Title": "De Witte Zwaan 2-1",
        "AddressLine1": "De Witte Zwaan 2-1",
        "Town": "Amersfoort",
        "Postcode": "3824 XL",
        "CountryID": 159,
        "Latitude": 52.19921,
        "Longitude": 5.38069,
        "RelatedURL": "http://www.ev-box.nl",
        "DistanceUnit": 0
    },
    "Connections": [
        {
            "ID": 40070,
            "ConnectionTypeID": 25,
            "LevelID": 2,
            "PowerKW": 11,
            "CurrentTypeID": 10
        }
    ],
    "NumberOfPoints": 1,
    "StatusTypeID": 50,
    "DateLastStatusUpdate": "2016-06-04T02:51:00Z",
    "DataQualityLevel": 3,
    "DateCreated": "2015-01-09T06:05:00Z",
    "SubmissionStatusTypeID": 100
}