{
    "IsRecentlyVerified": false,
    "ID": 89871,
    "UUID": "2F4CE0EE-14E3-4D5D-BFE4-0CC080DFE7EC",
    "DataProviderID": 1,
    "OperatorID": 220,
    "OperatorsReference": "4094",
    "UsageTypeID": 1,
    "UsageCost": "€1.73 + €0.3213/kWh; Andere Tarife möglich",
    "AddressInfo": {
        "ID": 90217,
        "Title": "Armgartstraße 14",
        "AddressLine1": "Armgartstraße 14",
        "Town": "Nord",
        "StateOrProvince": "Hamburg",
        "Postcode": "22087",
        "CountryID": 87,
        "Latitude": 53.56522,
        "Longitude": 10.02003,
        "DistanceUnit": 0
    },
    "Connections": [
        {
            "ID": 127397,
            "ConnectionTypeID": 25,
            "StatusTypeID": 50,
            "LevelID": 2,
            "Amps": 32,
            "Voltage": 400,
            "PowerKW": 22,
            "CurrentTypeID": 20,
            "Quantity": 2
        },
        {
            "ID": 127415,
            "ConnectionTypeID": 28,
            "StatusTypeID": 50,
            "LevelID": 2,
            "Amps": 16,
            "Voltage": 230,
            "PowerKW": 3.7,
            "CurrentTypeID": 10,
            "Quantity": 2
        }
    ],
    "NumberOfPoints": 2,
    "StatusTypeID": 50,
    "DateLastStatusUpdate": "2017-06-29T05:49:00Z",
    "DataQualityLevel": 1,
    "DateCreated": "2017-06-28T05:52:00Z",
    "SubmissionStatusTypeID": 200
}