{
    "IsRecentlyVerified": false,
    "ID": 140005,
    "UUID": "17B3D64B-84E7-4DC4-ABA6-945DD9340FB3",
    "DataProviderID": 2,
    "DataProvidersReference": "143318",
    "OperatorID": 5,
    "UsageTypeID": 1,
    "AddressInfo": {
        "ID": 140357,
        "Title": "HQ STATION 5",
        "AddressLine1": "9710 Topanga Canyon Blvd",
        "Town": "Los Angeles",
        "StateOrProvince": "CA",
        "Postcode": "91311",
        "CountryID": 2,
        "Latitude": 34.2464894,
        "Longitude": -118.6067358,
        "ContactTelephone1": "888-758-4389",
        "AccessComments": "24 hours daily",
        "RelatedURL": "http://www.chargepoint.com/",
        "DistanceUnit": 0
    },
    "Connections": [
        {
            "ID": 195522,
            "ConnectionTypeID": 1,
            "LevelID": 2,
            "Amps": 16,
            "Voltage": 230,
            "PowerKW": 3,
            "CurrentTypeID": 10,
            "Quantity": 1
        }
    ],
    "StatusTypeID": 50,
    "DateLastStatusUpdate": "2019-12-24T09:12:00Z",
    "DataQualityLevel": 3,
    "DateCreated": "2019-12-24T09:12:00Z",
    "SubmissionStatusTypeID": 100
}