{
    "MediaItems": [
        {
            "ID": 20520,
            "ChargePointID": 135134,
            "ItemURL": "https://s3-ap-southeast-2.amazonaws.com/openchargemap/images/HR/OCM135134/OCM-135134.orig.2019120718314101.jpeg",
            "ItemThumbnailURL": "https://s3-ap-southeast-2.amazonaws.com/openchargemap/images/HR/OCM135134/OCM-135134.thmb.2019120718314101.jpeg",
            "Comment": "",
            "IsEnabled": true,
            "IsVideo": false,
            "IsFeaturedItem": false,
            "IsExternalResource": false,
            "User": {
                "ID": 22474,
                "Username": "DavorP"
            },
            "DateCreated": "2019-12-07T18:32:00Z"
        }
    ],
    "IsRecentlyVerified": false,
    "ID": 135134,
    "UUID": "DA19724C-80E8-48BA-BB3F-43FF8DBD2022",
    "DataProviderID": 1,
    "UsageTypeID": 1,
    "AddressInfo": {
        "ID": 135480,
        "Title": "IKEA Zagreb",
        "AddressLine1": "Alfreda Nobela 2",
        "Town": "Otok Svibovski",
        "Postcode": "10361",
        "CountryID": 60,
        "Latitude": 45.79374396946372,
        "Longitude": 16.155265094050037,
        "AccessComments": "IKEA Parking lot",
        "DistanceUnit": 0
    },
    "Connections": [
        {
            "ID": 189151,
            "ConnectionTypeID": 33,
            "StatusTypeID": 50,
            "LevelID": 3,
            "PowerKW": 50,
            "CurrentTypeID": 30
        },
        {
            "ID": 189152,
            "ConnectionTypeID": 2,
            "StatusTypeID": 50,
            "LevelID": 3,
            "PowerKW": 50,
            "CurrentTypeID": 30
        },
        {
            "ID": 189153,
            "ConnectionTypeID": 1036,
            "StatusTypeID": 50,
            "LevelID": 3,
            "PowerKW": 43,
            "CurrentTypeID": 20
        }
    ],
    "NumberOfPoints": 2,
    "StatusTypeID": 50,
    "DateLastStatusUpdate": "2019-12-08T18:28:00Z",
    "DataQualityLevel": 1,
    "DateCreated": "2019-12-07T17:51:00Z",
    "SubmissionStatusTypeID": 200
}