{
    "UserComments": [
        {
            "ID": 23631,
            "ChargePointID": 170836,
            "CommentTypeID": 10,
            "UserName": "ForumElettrico.it",
            "Comment": "Andando verso il centro incontriamo subito un paio di bar a pochi minuti a piedi. Leggi la recensione completa qui >  https://www.forumelettrico.it/forum/colonnina-duferco-ospedale-di-comunita-casa-salute-di-castelfranco-emilia-mo-2x22-kw-t14276.html",
            "RelatedURL": "https://www.forumelettrico.it/forum/colonnina-duferco-ospedale-di-comunita-casa-salute-di-castelfranco-emilia-mo-2x22-kw-t14276.html",
            "DateCreated": "2020-12-10T17:59:36.41Z",
            "User": {
                "ID": 11749,
                "Username": "ForumElettrico.it"
            },
            "CheckinStatusTypeID": 10,
            "IsActionedByEditor": false
        }
    ],
    "MediaItems": [
        {
            "ID": 25775,
            "ChargePointID": 170836,
            "ItemURL": "https://s3-ap-southeast-2.amazonaws.com/openchargemap/images/IT/OCM170836/OCM-170836.orig.2020121017594503.jpg",
            "ItemThumbnailURL": "https://s3-ap-southeast-2.amazonaws.com/openchargemap/images/IT/OCM170836/OCM-170836.thmb.2020121017594503.jpg",
            "Comment": "",
            "IsEnabled": true,
            "IsVideo": false,
            "IsFeaturedItem": false,
            "IsExternalResource": false,
            "User": {
                "ID": 11749,
                "Username": "ForumElettrico.it"
            },
            "DateCreated": "2020-12-10T18:00:00Z"
        },
        {
            "ID": 25776,
            "ChargePointID": 170836,
            "ItemURL": "https://s3-ap-southeast-2.amazonaws.com/openchargemap/images/IT/OCM170836/OCM-170836.orig.2020121017595050.jpg",
            "ItemThumbnailURL": "https://s3-ap-southeast-2.amazonaws.com/openchargemap/images/IT/OCM170836/OCM-170836.thmb.2020121017595050.jpg",
            "Comment": "",
            "IsEnabled": true,
            "IsVideo": false,
            "IsFeaturedItem": false,
            "IsExternalResource": false,
            "User": {
                "ID": 11749,
                "Username": "ForumElettrico.it"
            },
            "DateCreated": "2020-12-10T18:00:00Z"
        },
        {
            "ID": 25777,
            "ChargePointID": 170836,
            "ItemURL": "https://s3-ap-southeast-2.amazonaws.com/openchargemap/images/IT/OCM170836/OCM-170836.orig.2020121017595662.jpg",
            "ItemThumbnailURL": "https://s3-ap-southeast-2.amazonaws.com/openchargemap/images/IT/OCM170836/OCM-170836.thmb.2020121017595662.jpg",
            "Comment": "",
            "IsEnabled": true,
            "IsVideo": false,
            "IsFeaturedItem": false,
            "IsExternalResource": false,
            "User": {
                "ID": 11749,
                "Username": "ForumElettrico.it"
            },
            "DateCreated": "2020-12-10T18:00:00Z"
        },
        {
            "ID": 25778,
            "ChargePointID": 170836,
            "ItemURL": "https://s3-ap-southeast-2.amazonaws.com/openchargemap/images/IT/OCM170836/OCM-170836.orig.2020121018000207.jpg",
            "ItemThumbnailURL": "https://s3-ap-southeast-2.amazonaws.com/openchargemap/images/IT/OCM170836/OCM-170836.thmb.2020121018000207.jpg",
            "Comment": "",
            "IsEnabled": true,
            "IsVideo": false,
            "IsFeaturedItem": false,
            "IsExternalResource": false,
            "User": {
                "ID": 11749,
                "Username": "ForumElettrico.it"
            },
            "DateCreated": "2020-12-10T18:00:00Z"
        },
        {
            "ID": 25779,
            "ChargePointID": 170836,
            "ItemURL": "https://s3-ap-southeast-2.amazonaws.com/openchargemap/images/IT/OCM170836/OCM-170836.orig.2020121018000804.jpg",
            "ItemThumbnailURL": "https://s3-ap-southeast-2.amazonaws.com/openchargemap/images/IT/OCM170836/OCM-170836.thmb.2020121018000804.jpg",
            "Comment": "",
            "IsEnabled": true,
            "IsVideo": false,
            "IsFeaturedItem": false,
            "IsExternalResource": false,
            "User": {
                "ID": 11749,
                "Username": "ForumElettrico.it"
            },
            "DateCreated": "2020-12-10T18:00:00Z"
        }
    ],
    "IsRecentlyVerified": false,
    "ID": 170836,
    "UUID": "EBB3D889-24EA-49D6-82ED-82EEF584862A",
    "DataProviderID": 1,
    "OperatorID": 3267,
    "UsageTypeID": 1,
    "AddressInfo": {
        "ID": 171195,
        "Title": "Duferco Casa della Salute",
        "AddressLine1": "Via Dante Alighieri 27",
        "Town": "Castelfranco Emilia",
        "StateOrProvince": "MO",
        "CountryID": 112,
        "Latitude": 44.598456,
        "Longitude": 11.048409,
        "RelatedURL": "https://www.forumelettrico.it/forum/colonnina-duferco-ospedale-di-comunita-casa-salute-di-castelfranco-emilia-mo-2x22-kw-t14276.html",
        "DistanceUnit": 0
    },
    "Connections": [
        {
            "ID": 261028,
            "ConnectionTypeID": 25,
            "LevelID": 2,
            "PowerKW": 22,
            "Quantity": 2
        }
    ],
    "NumberOfPoints": 1,
    "StatusTypeID": 50,
    "DateLastStatusUpdate": "2020-12-10T18:00:00Z",
    "DataQualityLevel": 1,
    "DateCreated": "2020-12-10T17:59:00Z",
    "SubmissionStatusTypeID": 200
}