{
    "IsRecentlyVerified": true,
    "DateLastVerified": "2021-11-02T06:56:00Z",
    "ID": 189774,
    "UUID": "0F75D772-C81B-4EC4-801B-4604E317E59F",
    "DataProviderID": 1,
    "OperatorID": 39,
    "UsageTypeID": 1,
    "UsageCost": "$1.50 per hour + 0.30/kWh",
    "AddressInfo": {
        "ID": 190133,
        "Title": "South Ten Mile Road",
        "AddressLine1": "South Ten Mile Road",
        "Town": "Meridian",
        "StateOrProvince": "ID",
        "Postcode": "83642",
        "CountryID": 2,
        "Latitude": 43.59679152791705,
        "Longitude": -116.43251820417845,
        "DistanceUnit": 0
    },
    "Connections": [
        {
            "ID": 307046,
            "ConnectionTypeID": 1,
            "StatusTypeID": 50,
            "LevelID": 2,
            "Amps": 16,
            "Voltage": 230,
            "PowerKW": 3.7,
            "CurrentTypeID": 10,
            "Quantity": 2
        }
    ],
    "NumberOfPoints": 2,
    "StatusTypeID": 50,
    "DateLastStatusUpdate": "2021-11-02T08:39:00Z",
    "DataQualityLevel": 1,
    "DateCreated": "2021-11-02T06:56:00Z",
    "SubmissionStatusTypeID": 200
}