{
    "IsRecentlyVerified": false,
    "ID": 187904,
    "UUID": "6B2A6486-8E27-47B0-9DA3-20E52FCD095A",
    "DataProviderID": 18,
    "DataProvidersReference": "627a215582734902c7ed4877606e4ec2",
    "OperatorID": 3345,
    "UsageTypeID": 5,
    "AddressInfo": {
        "ID": 188263,
        "Title": "CV5 8FN",
        "AddressLine1": "",
        "Town": "Coventry",
        "Postcode": "CV5 8FN",
        "CountryID": 1,
        "Latitude": 52.409817,
        "Longitude": -1.542642,
        "AccessComments": "",
        "RelatedURL": "https://char.gy",
        "DistanceUnit": 0
    },
    "Connections": [
        {
            "ID": 303232,
            "ConnectionTypeID": 25,
            "Reference": "808",
            "StatusTypeID": 50,
            "LevelID": 2,
            "Amps": 16,
            "Voltage": 230,
            "PowerKW": 3.7,
            "CurrentTypeID": 10
        }
    ],
    "StatusTypeID": 0,
    "DateLastStatusUpdate": "2021-07-12T03:39:00Z",
    "MetadataValues": [
        {
            "ID": 20144,
            "MetadataFieldID": 4,
            "ItemValue": "Contains public sector information licensed under the Open Government Licence v2.0. http://www.nationalarchives.gov.uk/doc/open-government-licence/version/2/"
        }
    ],
    "DataQualityLevel": 3,
    "DateCreated": "2021-07-12T03:39:00Z",
    "SubmissionStatusTypeID": 100
}