{
    "IsRecentlyVerified": false,
    "ID": 132398,
    "UUID": "DB841434-7595-4279-A8A8-F61113EA5A35",
    "DataProviderID": 1,
    "OperatorID": 3247,
    "UsageTypeID": 1,
    "AddressInfo": {
        "ID": 132744,
        "Title": "Burger King Grelland Sørgående",
        "AddressLine1": "Grelland 2",
        "Postcode": "3089",
        "CountryID": 168,
        "Latitude": 59.5136567965356,
        "Longitude": 10.2029024422529,
        "RelatedURL": "https://gronnkontakt.no/ladekart/?id=769",
        "DistanceUnit": 0
    },
    "Connections": [
        {
            "ID": 185378,
            "ConnectionTypeID": 2,
            "StatusTypeID": 50,
            "LevelID": 3,
            "PowerKW": 62,
            "CurrentTypeID": 30,
            "Quantity": 6
        },
        {
            "ID": 185379,
            "ConnectionTypeID": 33,
            "StatusTypeID": 50,
            "LevelID": 3,
            "PowerKW": 150,
            "CurrentTypeID": 30,
            "Quantity": 6
        }
    ],
    "NumberOfPoints": 6,
    "GeneralComments": "Status: https://gronnkontakt.no/ladekart/?id=769",
    "StatusTypeID": 50,
    "DateLastStatusUpdate": "2019-09-28T13:58:00Z",
    "DataQualityLevel": 1,
    "DateCreated": "2019-09-28T13:58:00Z",
    "SubmissionStatusTypeID": 200
}