{
    "IsRecentlyVerified": false,
    "ID": 85343,
    "UUID": "3E89D45E-EB6E-4B28-8A07-67ED200DF7C6",
    "DataProviderID": 1,
    "DataProvidersReference": "3859",
    "AddressInfo": {
        "ID": 85689,
        "Title": "Gjendesheim Turisthytte",
        "AddressLine1": "Gjendevegen 9",
        "Town": "TESSANDEN",
        "StateOrProvince": "Innlandet",
        "Postcode": "2683",
        "CountryID": 168,
        "Latitude": 61.49404,
        "Longitude": 8.81339,
        "AccessComments": "",
        "DistanceUnit": 0
    },
    "Connections": [
        {
            "ID": 121321,
            "ConnectionTypeID": 0,
            "Reference": "1",
            "LevelID": 2,
            "Amps": 16,
            "Voltage": 230,
            "PowerKW": 3.7,
            "Comments": "Mode 3"
        },
        {
            "ID": 121322,
            "ConnectionTypeID": 0,
            "Reference": "2",
            "LevelID": 2,
            "Amps": 16,
            "Voltage": 230,
            "PowerKW": 3.7,
            "Comments": "Mode 3"
        },
        {
            "ID": 121323,
            "ConnectionTypeID": 0,
            "Reference": "3",
            "LevelID": 2,
            "Amps": 16,
            "Voltage": 230,
            "PowerKW": 3.7,
            "Comments": "Mode 3"
        },
        {
            "ID": 121324,
            "ConnectionTypeID": 0,
            "Reference": "4",
            "LevelID": 2,
            "Amps": 16,
            "Voltage": 230,
            "PowerKW": 3.7,
            "Comments": "Mode 3"
        }
    ],
    "NumberOfPoints": 4,
    "DateLastStatusUpdate": "2020-05-26T08:24:00Z",
    "DataQualityLevel": 2,
    "DateCreated": "2017-04-01T15:08:00Z",
    "SubmissionStatusTypeID": 100
}