{
    "IsRecentlyVerified": false,
    "ID": 158528,
    "UUID": "484CF484-572C-4306-AF94-C1DB153C5EF0",
    "DataProviderID": 2,
    "DataProvidersReference": "152317",
    "OperatorID": 39,
    "UsageTypeID": 1,
    "AddressInfo": {
        "ID": 158885,
        "Title": "Marriott's Canyon Villas location",
        "AddressLine1": "5220 E Marriott Drive",
        "Town": "Pheonix",
        "StateOrProvince": "AZ",
        "Postcode": "85054",
        "CountryID": 2,
        "Latitude": 33.6846393,
        "Longitude": -111.9724417,
        "ContactTelephone1": "800-663-5633",
        "AccessComments": "MO: Not Specified; TU: Not Specified; WE: Not Specified; TH: Not Specified; FR: Not Specified; SA: Not Specified; SU: Not Specified",
        "RelatedURL": "http://www.semacharge.com/",
        "DistanceUnit": 0
    },
    "Connections": [
        {
            "ID": 228527,
            "ConnectionTypeID": 1,
            "LevelID": 2,
            "Amps": 16,
            "Voltage": 230,
            "PowerKW": 3.7,
            "CurrentTypeID": 10,
            "Quantity": 2
        }
    ],
    "StatusTypeID": 50,
    "DateLastStatusUpdate": "2020-06-26T02:55:00Z",
    "DataQualityLevel": 3,
    "DateCreated": "2020-06-26T02:55:00Z",
    "SubmissionStatusTypeID": 100
}