{
    "IsRecentlyVerified": false,
    "ID": 107076,
    "UUID": "29038B81-0EEC-43F8-907F-37CE374824B1",
    "DataProviderID": 1,
    "OperatorID": 32,
    "OperatorsReference": "3942",
    "UsageTypeID": 4,
    "UsageCost": "£0.108/kWh; for Polar Plus subscription members only",
    "AddressInfo": {
        "ID": 107422,
        "Title": "Aldi",
        "AddressLine1": "Aldi",
        "Town": "Regent Street",
        "StateOrProvince": "Leeds",
        "Postcode": "LS2 7QA",
        "CountryID": 1,
        "Latitude": 53.801506,
        "Longitude": -1.532965,
        "DistanceUnit": 0
    },
    "Connections": [
        {
            "ID": 150963,
            "ConnectionTypeID": 25,
            "StatusTypeID": 50,
            "LevelID": 2,
            "Amps": 32,
            "Voltage": 400,
            "PowerKW": 22,
            "CurrentTypeID": 20,
            "Quantity": 2
        }
    ],
    "NumberOfPoints": 2,
    "GeneralComments": "Top end of carpark on right",
    "StatusTypeID": 50,
    "DateLastStatusUpdate": "2019-03-06T06:18:00Z",
    "DataQualityLevel": 1,
    "DateCreated": "2018-07-17T05:14:00Z",
    "SubmissionStatusTypeID": 200
}