{
    "IsRecentlyVerified": false,
    "ID": 43623,
    "UUID": "F3421088-C6BD-4BEC-BB06-0E54677B5682",
    "DataProviderID": 1,
    "OperatorID": 45,
    "UsageTypeID": 5,
    "UsageCost": "1€",
    "AddressInfo": {
        "ID": 43969,
        "Title": "Stellplatz am Campingplatz Neuenhainer See",
        "AddressLine1": "Seeblick 14",
        "Town": "Neuental",
        "StateOrProvince": "Schwalm-Eder-Kreis",
        "Postcode": "34599",
        "CountryID": 87,
        "Latitude": 50.996015,
        "Longitude": 9.267046,
        "AccessComments": "Auf dem Stellplatz (außerhalb des Campungplatzes) auf dem Wohnmobilstellplatz sind Münzstromsäulen. Stromkosten 1€/Tag, 24/7 nutzbar.",
        "RelatedURL": "http://www.neuenhainer-see.de",
        "DistanceUnit": 0
    },
    "Connections": [
        {
            "ID": 52930,
            "ConnectionTypeID": 16,
            "StatusTypeID": 50,
            "LevelID": 2,
            "Amps": 16,
            "Voltage": 230,
            "PowerKW": 3.7,
            "CurrentTypeID": 10,
            "Quantity": 12
        }
    ],
    "NumberOfPoints": 12,
    "GeneralComments": "Adapter CEE blau 3 pin auf Schuko kann am Eingang des Campingplatzes gegen 15€ Pfand ausgeliehen werden",
    "StatusTypeID": 50,
    "DateLastStatusUpdate": "2015-04-08T12:19:00Z",
    "DataQualityLevel": 1,
    "DateCreated": "2015-04-08T10:41:00Z",
    "SubmissionStatusTypeID": 200
}