{
    "UserComments": [
        {
            "ID": 23945,
            "ChargePointID": 172988,
            "CommentTypeID": 10,
            "UserName": "ForumElettrico.it",
            "Comment": "Classica colonnina plug&charge che mette a disposizione il Lidl. Leggi la recensione completa qui > https://www.forumelettrico.it/forum/colonnina-lidl-rimini-via-tristano-e-isotta-t5772.html",
            "RelatedURL": "https://www.forumelettrico.it/forum/colonnina-lidl-rimini-via-tristano-e-isotta-t5772.html",
            "DateCreated": "2021-02-26T06:54:08.223Z",
            "User": {
                "ID": 11749,
                "Username": "ForumElettrico.it"
            },
            "CheckinStatusTypeID": 25,
            "IsActionedByEditor": false
        }
    ],
    "MediaItems": [
        {
            "ID": 26679,
            "ChargePointID": 172988,
            "ItemURL": "https://s3-ap-southeast-2.amazonaws.com/openchargemap/images/IT/OCM172988/OCM-172988.orig.2021022606541930.jpg",
            "ItemThumbnailURL": "https://s3-ap-southeast-2.amazonaws.com/openchargemap/images/IT/OCM172988/OCM-172988.thmb.2021022606541930.jpg",
            "Comment": "",
            "IsEnabled": true,
            "IsVideo": false,
            "IsFeaturedItem": false,
            "IsExternalResource": false,
            "User": {
                "ID": 11749,
                "Username": "ForumElettrico.it"
            },
            "DateCreated": "2021-02-26T06:54:00Z"
        },
        {
            "ID": 26680,
            "ChargePointID": 172988,
            "ItemURL": "https://s3-ap-southeast-2.amazonaws.com/openchargemap/images/IT/OCM172988/OCM-172988.orig.2021022606542616.jpg",
            "ItemThumbnailURL": "https://s3-ap-southeast-2.amazonaws.com/openchargemap/images/IT/OCM172988/OCM-172988.thmb.2021022606542616.jpg",
            "Comment": "",
            "IsEnabled": true,
            "IsVideo": false,
            "IsFeaturedItem": false,
            "IsExternalResource": false,
            "User": {
                "ID": 11749,
                "Username": "ForumElettrico.it"
            },
            "DateCreated": "2021-02-26T06:54:00Z"
        }
    ],
    "IsRecentlyVerified": false,
    "ID": 172988,
    "UUID": "66CB4233-246F-487F-8932-BDAC58655C11",
    "DataProviderID": 1,
    "OperatorID": 38,
    "UsageTypeID": 1,
    "AddressInfo": {
        "ID": 173347,
        "Title": "Lidl",
        "AddressLine1": "Via Tristano e Isotta 10/1",
        "Town": "Rimini",
        "StateOrProvince": "RN",
        "CountryID": 112,
        "Latitude": 44.053945,
        "Longitude": 12.540533,
        "RelatedURL": "https://www.forumelettrico.it/forum/colonnina-lidl-rimini-via-tristano-e-isotta-t5772.html",
        "DistanceUnit": 0
    },
    "Connections": [
        {
            "ID": 264649,
            "ConnectionTypeID": 25,
            "LevelID": 2,
            "PowerKW": 22,
            "Quantity": 2
        }
    ],
    "NumberOfPoints": 1,
    "StatusTypeID": 50,
    "DateLastStatusUpdate": "2021-02-26T06:54:00Z",
    "DataQualityLevel": 1,
    "DateCreated": "2021-02-26T06:54:00Z",
    "SubmissionStatusTypeID": 200
}