{
    "IsRecentlyVerified": false,
    "ID": 68505,
    "UUID": "12CA8D43-4243-4AFF-9445-334591DB0904",
    "DataProviderID": 1,
    "OperatorID": 23,
    "UsageTypeID": 1,
    "AddressInfo": {
        "ID": 68851,
        "Title": "Healthy Living Market and Cafe - Tesla Supercharger",
        "AddressLine1": "222 Dorset Street",
        "Town": "So. Burlington",
        "StateOrProvince": "Vermont",
        "Postcode": "05403",
        "CountryID": 2,
        "Latitude": 44.462790798578,
        "Longitude": -73.1793119820839,
        "ContactTelephone1": "802-863-2569",
        "ContactEmail": "feedback@healthylivingmarket.com",
        "RelatedURL": "http://www.healthylivingmarket.com",
        "DistanceUnit": 0
    },
    "Connections": [
        {
            "ID": 95816,
            "ConnectionTypeID": 30,
            "StatusTypeID": 50,
            "LevelID": 3,
            "CurrentTypeID": 30,
            "Quantity": 8
        }
    ],
    "NumberOfPoints": 8,
    "GeneralComments": "Northern Vermont's Only Tesla Supercharger.  Stop in today!",
    "StatusTypeID": 50,
    "DateLastStatusUpdate": "2016-06-10T23:22:00Z",
    "DataQualityLevel": 1,
    "DateCreated": "2016-06-10T16:04:00Z",
    "SubmissionStatusTypeID": 200
}