{
    "IsRecentlyVerified": false,
    "ID": 100939,
    "UUID": "7BE0C145-CE2C-4FDF-94B0-FB47DFC5F831",
    "DataProviderID": 1,
    "OperatorID": 23,
    "OperatorsReference": "41242",
    "UsageTypeID": 4,
    "AddressInfo": {
        "ID": 101285,
        "Title": "Ipark 107 West 13th Street",
        "AddressLine1": "107 W 13th St",
        "Town": "New York",
        "StateOrProvince": "New York",
        "Postcode": "10011",
        "CountryID": 2,
        "Latitude": 40.736973,
        "Longitude": -73.99787,
        "ContactTelephone1": "(646) 870-9022",
        "DistanceUnit": 0
    },
    "Connections": [
        {
            "ID": 142534,
            "ConnectionTypeID": 30,
            "StatusTypeID": 50,
            "LevelID": 2,
            "PowerKW": 6,
            "CurrentTypeID": 10,
            "Quantity": 2
        }
    ],
    "NumberOfPoints": 2,
    "GeneralComments": "2 Tesla Connectors, up to 6kW.Parking fees will apply. Please see valet.",
    "StatusTypeID": 50,
    "DateLastStatusUpdate": "2018-03-13T06:52:00Z",
    "DataQualityLevel": 1,
    "DateCreated": "2018-03-13T06:52:00Z",
    "SubmissionStatusTypeID": 200
}