{
    "IsRecentlyVerified": false,
    "ID": 70158,
    "UUID": "388799CE-ADD8-43A5-8923-B0942C35335B",
    "DataProviderID": 1,
    "OperatorID": 45,
    "UsageTypeID": 0,
    "AddressInfo": {
        "ID": 70504,
        "Title": "Stadtwerke",
        "AddressLine1": "Regensburger Straße 29",
        "Town": "Passau",
        "StateOrProvince": "Passau",
        "Postcode": "94036",
        "CountryID": 87,
        "Latitude": 48.5734824,
        "Longitude": 13.419127500000059,
        "ContactTelephone1": "+49 851 560-0",
        "AccessComments": "Details unbekannt.",
        "RelatedURL": "http://www.stadtwerke-passau.de/",
        "DistanceUnit": 0
    },
    "Connections": [
        {
            "ID": 100096,
            "ConnectionTypeID": 25,
            "StatusTypeID": 50,
            "LevelID": 2,
            "Amps": 16,
            "Voltage": 400,
            "PowerKW": 11,
            "CurrentTypeID": 20,
            "Quantity": 1
        },
        {
            "ID": 100097,
            "ConnectionTypeID": 28,
            "StatusTypeID": 50,
            "LevelID": 2,
            "Amps": 16,
            "Voltage": 230,
            "PowerKW": 3.7,
            "CurrentTypeID": 10,
            "Quantity": 1
        }
    ],
    "NumberOfPoints": 2,
    "StatusTypeID": 50,
    "DateLastStatusUpdate": "2016-07-12T06:13:00Z",
    "DataQualityLevel": 1,
    "DateCreated": "2016-07-12T06:13:00Z",
    "SubmissionStatusTypeID": 200
}