{
    "IsRecentlyVerified": false,
    "ID": 70721,
    "UUID": "5F8D58AD-1F85-44A7-B146-2911118A115C",
    "DataProviderID": 1,
    "OperatorID": 47,
    "OperatorsReference": "ICUEVE900225,ICUEVE900226,ICUEVE900227",
    "UsageTypeID": 4,
    "UsageCost": "£0.20/kWh",
    "AddressInfo": {
        "ID": 71067,
        "Title": "Worle Centre",
        "AddressLine1": "58 New Bristol Road",
        "Town": "Weston-Super-Mare",
        "StateOrProvince": "North Somerset",
        "Postcode": "BS22 6AQ",
        "CountryID": 1,
        "Latitude": 51.35697,
        "Longitude": -2.9283,
        "DistanceUnit": 0
    },
    "Connections": [
        {
            "ID": 101298,
            "ConnectionTypeID": 25,
            "StatusTypeID": 50,
            "LevelID": 2,
            "Amps": 32,
            "Voltage": 230,
            "PowerKW": 7.4,
            "CurrentTypeID": 10,
            "Quantity": 6
        }
    ],
    "NumberOfPoints": 6,
    "GeneralComments": "Powershare may limit available charge.",
    "StatusTypeID": 50,
    "DateLastStatusUpdate": "2017-05-26T15:43:00Z",
    "DataQualityLevel": 1,
    "DateCreated": "2016-08-07T10:52:00Z",
    "SubmissionStatusTypeID": 200
}