{
    "IsRecentlyVerified": false,
    "ID": 65603,
    "UUID": "D0A49F9F-673A-4F92-972A-368070083A9E",
    "DataProviderID": 26,
    "DataProvidersReference": "83746",
    "OperatorID": 73,
    "OperatorsReference": "EV-Box EVB-P1548323",
    "UsageCost": "0.00 jaarabonnement",
    "AddressInfo": {
        "ID": 65949,
        "Title": "Koningsschot 45-07",
        "AddressLine1": "Koningsschot 45-07",
        "Town": "Veenendaal",
        "Postcode": "3905 PR",
        "CountryID": 159,
        "Latitude": 52.04162,
        "Longitude": 5.54302,
        "RelatedURL": "http://www.ev-box.nl",
        "DistanceUnit": 0
    },
    "Connections": [
        {
            "ID": 90509,
            "ConnectionTypeID": 25,
            "LevelID": 2,
            "PowerKW": 11,
            "CurrentTypeID": 10
        },
        {
            "ID": 90510,
            "ConnectionTypeID": 25,
            "LevelID": 2,
            "PowerKW": 11,
            "CurrentTypeID": 10
        }
    ],
    "NumberOfPoints": 1,
    "StatusTypeID": 50,
    "DateLastStatusUpdate": "2016-06-04T02:44:00Z",
    "DataQualityLevel": 3,
    "DateCreated": "2016-04-27T09:41:00Z",
    "SubmissionStatusTypeID": 100
}