{
    "IsRecentlyVerified": false,
    "ID": 134313,
    "UUID": "413745F2-4B22-47E3-B665-3D5DA867C461",
    "DataProviderID": 1,
    "OperatorID": 150,
    "UsageTypeID": 4,
    "UsageCost": "£1.00+£0.30/kWh; £10.00 overstay fee after 95 mins, then £10.00 every subsequent 95 mins",
    "AddressInfo": {
        "ID": 134659,
        "Title": "Morrisons Leamington Spa",
        "AddressLine1": "Old Warwick Road",
        "Town": "Leamington Spa",
        "StateOrProvince": "Warwickshire",
        "Postcode": "CV31 3NT",
        "CountryID": 1,
        "Latitude": 52.283211,
        "Longitude": -1.545267,
        "RelatedURL": "http://www.chargepointservices.com/",
        "DistanceUnit": 0
    },
    "Connections": [
        {
            "ID": 187961,
            "ConnectionTypeID": 25,
            "Reference": "1",
            "StatusTypeID": 50,
            "LevelID": 2,
            "Amps": 32,
            "Voltage": 400,
            "PowerKW": 22,
            "CurrentTypeID": 20
        },
        {
            "ID": 187983,
            "ConnectionTypeID": 2,
            "StatusTypeID": 50,
            "LevelID": 3,
            "Amps": 125,
            "Voltage": 400,
            "PowerKW": 50,
            "CurrentTypeID": 30,
            "Quantity": 1
        },
        {
            "ID": 187984,
            "ConnectionTypeID": 33,
            "StatusTypeID": 50,
            "LevelID": 3,
            "Amps": 125,
            "Voltage": 400,
            "PowerKW": 50,
            "CurrentTypeID": 30,
            "Quantity": 1
        }
    ],
    "NumberOfPoints": 1,
    "StatusTypeID": 50,
    "DateLastStatusUpdate": "2019-11-08T14:30:00Z",
    "MetadataValues": [
        {
            "ID": 5068,
            "MetadataFieldID": 4,
            "ItemValue": "Contains public sector information licensed under the Open Government Licence v2.0. http://www.nationalarchives.gov.uk/doc/open-government-licence/version/2/"
        }
    ],
    "DataQualityLevel": 3,
    "DateCreated": "2019-11-08T08:03:00Z",
    "SubmissionStatusTypeID": 200
}