{
    "IsRecentlyVerified": false,
    "ID": 166114,
    "UUID": "A78EA104-FD9D-4A98-BB33-9782A3DC0E43",
    "DataProviderID": 28,
    "DataProvidersReference": "FR*S24*PMB24*18",
    "OperatorID": 3407,
    "UsageTypeID": 5,
    "AddressInfo": {
        "ID": 166473,
        "Title": "BRANTOME - Chemin Du Vert Galant (Parking Des Reclus)",
        "AddressLine1": "Chemin Du Vert Galant (Parking Des Reclus) 24310 BRANTOME",
        "CountryID": 80,
        "Latitude": 45.36924,
        "Longitude": 0.648179,
        "AccessComments": "24h/24 7j/7",
        "DistanceUnit": 0
    },
    "Connections": [
        {
            "ID": 244322,
            "ConnectionTypeID": 25,
            "StatusTypeID": 50,
            "LevelID": 2,
            "PowerKW": 18,
            "CurrentTypeID": 20
        },
        {
            "ID": 244323,
            "ConnectionTypeID": 28,
            "StatusTypeID": 50,
            "LevelID": 2,
            "PowerKW": 18,
            "CurrentTypeID": 10
        },
        {
            "ID": 244324,
            "ConnectionTypeID": 25,
            "StatusTypeID": 50,
            "LevelID": 2,
            "PowerKW": 18,
            "CurrentTypeID": 20
        },
        {
            "ID": 244325,
            "ConnectionTypeID": 28,
            "StatusTypeID": 50,
            "LevelID": 2,
            "PowerKW": 18,
            "CurrentTypeID": 10
        }
    ],
    "GeneralComments": "Recharge par badge et avec une application smartphone",
    "StatusTypeID": 50,
    "DateLastStatusUpdate": "2020-08-27T05:12:00Z",
    "DataQualityLevel": 2,
    "DateCreated": "2020-08-27T05:12:00Z",
    "SubmissionStatusTypeID": 100
}