{
    "IsRecentlyVerified": false,
    "ID": 187008,
    "UUID": "D35C2D2C-8B91-40AE-8DF4-564C9A5C2350",
    "DataProviderID": 29,
    "DataProvidersReference": "3882",
    "OperatorID": 45,
    "AddressInfo": {
        "ID": 187367,
        "Title": "Ahrendvehn 1",
        "AddressLine1": "Ahrendvehn 1",
        "Town": "Löningen",
        "Postcode": "49624",
        "CountryID": 87,
        "Latitude": 52.733822,
        "Longitude": 7.778474,
        "DistanceUnit": 0
    },
    "Connections": [
        {
            "ID": 300940,
            "ConnectionTypeID": 33,
            "StatusTypeID": 50,
            "LevelID": 3,
            "PowerKW": 22,
            "CurrentTypeID": 30
        },
        {
            "ID": 300941,
            "ConnectionTypeID": 25,
            "StatusTypeID": 50,
            "LevelID": 2,
            "PowerKW": 11,
            "CurrentTypeID": 20
        }
    ],
    "StatusTypeID": 50,
    "DateLastStatusUpdate": "2021-07-12T02:50:00Z",
    "MetadataValues": [
        {
            "ID": 19248,
            "MetadataFieldID": 4,
            "ItemValue": "Data from the German chargepoint registry provided by Bundesnetzagentur.de under the CC-BY 4.0 license"
        }
    ],
    "DataQualityLevel": 3,
    "DateCreated": "2021-07-12T02:50:00Z",
    "SubmissionStatusTypeID": 100
}