{
    "IsRecentlyVerified": false,
    "ID": 5217,
    "UUID": "B316149C-5DBC-4F4F-8D41-476089D51062",
    "DataProviderID": 1,
    "OperatorID": 20,
    "UsageTypeID": 4,
    "AddressInfo": {
        "ID": 5157,
        "Title": "Cargofleet Lane",
        "AddressLine1": "Central Depot",
        "AddressLine2": "Erimus House",
        "Town": "Middlesbrough",
        "StateOrProvince": "North Yorkshire",
        "Postcode": "TS1 9FW",
        "CountryID": 1,
        "Latitude": 54.5746487925206,
        "Longitude": -1.20197296142578,
        "DistanceUnit": 0
    },
    "Connections": [
        {
            "ID": 327,
            "ConnectionTypeID": 3,
            "LevelID": 2,
            "Quantity": 1
        }
    ],
    "NumberOfPoints": 1,
    "StatusTypeID": 50,
    "DateLastStatusUpdate": "2014-09-13T03:56:00Z",
    "DateCreated": "2011-08-24T15:40:00Z",
    "SubmissionStatusTypeID": 200
}