{
    "IsRecentlyVerified": false,
    "ID": 35160,
    "UUID": "E04E0A12-7032-4B75-B5DF-1BF101E69C93",
    "DataProviderID": 26,
    "DataProvidersReference": "48736",
    "OperatorID": 178,
    "OperatorsReference": "EVnetNL REE623",
    "UsageCost": "0.00 jaarabonnement",
    "AddressInfo": {
        "ID": 35506,
        "Title": "Klapwijkseweg",
        "AddressLine1": "Klapwijkseweg",
        "Town": "Pijnacker-Nootdorp",
        "Postcode": "2642 RB",
        "CountryID": 159,
        "Latitude": 52.006416,
        "Longitude": 4.445818,
        "ContactTelephone1": "0800-3522365",
        "RelatedURL": "http://www.evnet.nl",
        "DistanceUnit": 0
    },
    "Connections": [
        {
            "ID": 38671,
            "ConnectionTypeID": 25,
            "LevelID": 1,
            "PowerKW": 2.3,
            "CurrentTypeID": 10
        }
    ],
    "NumberOfPoints": 1,
    "StatusTypeID": 50,
    "DateLastStatusUpdate": "2016-06-04T02:43:00Z",
    "DataQualityLevel": 3,
    "DateCreated": "2015-01-09T06:04:00Z",
    "SubmissionStatusTypeID": 100
}