{
    "UserComments": [
        {
            "ID": 19428,
            "ChargePointID": 101912,
            "CommentTypeID": 10,
            "UserName": "Pedit",
            "Comment": "Noch kostenlos!",
            "Rating": 5,
            "DateCreated": "2018-04-15T18:35:02.217Z",
            "User": {
                "ID": 18177,
                "Username": "Pedit"
            },
            "CheckinStatusTypeID": 10
        }
    ],
    "IsRecentlyVerified": false,
    "ID": 101912,
    "UUID": "669183FF-FBC5-4D72-8349-86ECBE720B13",
    "DataProviderID": 1,
    "OperatorID": 3303,
    "UsageTypeID": 1,
    "UsageCost": "Free",
    "AddressInfo": {
        "ID": 102258,
        "Title": "Ochtum Park",
        "AddressLine1": "Bremer Str. 107",
        "Town": "Stuhr",
        "Postcode": "28816",
        "CountryID": 87,
        "Latitude": 53.028258857237,
        "Longitude": 8.80609488134724,
        "ContactTelephone1": "+498002004411",
        "DistanceUnit": 0
    },
    "Connections": [
        {
            "ID": 143892,
            "ConnectionTypeID": 33,
            "StatusTypeID": 50,
            "LevelID": 3,
            "PowerKW": 50,
            "CurrentTypeID": 30,
            "Quantity": 1
        },
        {
            "ID": 143893,
            "ConnectionTypeID": 2,
            "StatusTypeID": 50,
            "LevelID": 3,
            "PowerKW": 50,
            "CurrentTypeID": 30,
            "Quantity": 1
        },
        {
            "ID": 143894,
            "ConnectionTypeID": 1036,
            "StatusTypeID": 50,
            "LevelID": 3,
            "PowerKW": 43,
            "CurrentTypeID": 20,
            "Quantity": 1
        }
    ],
    "NumberOfPoints": 3,
    "StatusTypeID": 50,
    "DateLastStatusUpdate": "2018-04-15T18:35:00Z",
    "DataQualityLevel": 1,
    "DateCreated": "2018-04-15T10:00:00Z",
    "SubmissionStatusTypeID": 200
}