{
    "IsRecentlyVerified": false,
    "ID": 175037,
    "UUID": "44ED6F10-BEDE-45A7-A50D-EE477BA2E2A6",
    "DataProviderID": 1,
    "OperatorID": 3299,
    "UsageTypeID": 1,
    "AddressInfo": {
        "ID": 175396,
        "Title": "IONITY Wolfsburg Detmeroder Markt",
        "AddressLine1": "Marignanestraße",
        "Town": "Wolfsburg",
        "Postcode": "38444",
        "CountryID": 87,
        "Latitude": 52.392241,
        "Longitude": 10.753713,
        "DistanceUnit": 0
    },
    "Connections": [
        {
            "ID": 271284,
            "ConnectionTypeID": 33,
            "StatusTypeID": 50,
            "LevelID": 2,
            "PowerKW": 350
        }
    ],
    "NumberOfPoints": 4,
    "StatusTypeID": 50,
    "DateLastStatusUpdate": "2021-04-28T14:38:00Z",
    "DataQualityLevel": 1,
    "DateCreated": "2021-04-25T14:23:00Z",
    "SubmissionStatusTypeID": 200
}