{
    "IsRecentlyVerified": false,
    "ID": 117881,
    "UUID": "E79EB2A0-A868-4235-AF3B-358B3D660FCE",
    "DataProviderID": 1,
    "OperatorID": 32,
    "OperatorsReference": "11606,11608",
    "UsageTypeID": 4,
    "UsageCost": "£0.108/kWh; for Polar Plus subscription members only",
    "AddressInfo": {
        "ID": 118227,
        "Title": "MSCP Car Park",
        "AddressLine1": "MSCP Car Park",
        "Town": "Queen Street",
        "StateOrProvince": "Bedford",
        "Postcode": "MK40 2HA",
        "CountryID": 1,
        "Latitude": 52.140842,
        "Longitude": -0.469517,
        "DistanceUnit": 0
    },
    "Connections": [
        {
            "ID": 166822,
            "ConnectionTypeID": 25,
            "StatusTypeID": 50,
            "LevelID": 2,
            "Amps": 32,
            "Voltage": 230,
            "PowerKW": 7,
            "CurrentTypeID": 10,
            "Quantity": 4
        }
    ],
    "NumberOfPoints": 4,
    "GeneralComments": "Unit located on Level G.",
    "StatusTypeID": 50,
    "DateLastStatusUpdate": "2019-03-09T06:41:00Z",
    "DataQualityLevel": 1,
    "DateCreated": "2019-03-07T06:35:00Z",
    "SubmissionStatusTypeID": 200
}