{
    "IsRecentlyVerified": false,
    "ID": 124107,
    "UUID": "F880CB02-7D12-49B4-AA7E-B134BB379C9E",
    "DataProviderID": 2,
    "DataProvidersReference": "77019",
    "OperatorID": 1242,
    "UsageTypeID": 2,
    "AddressInfo": {
        "ID": 124453,
        "Title": "GE DuraStation SL1 P2",
        "AddressLine1": "2661 Alvarado St",
        "Town": "San Leandro",
        "StateOrProvince": "CA",
        "Postcode": "94577",
        "CountryID": 2,
        "Latitude": 37.7095999,
        "Longitude": -122.1550973,
        "ContactTelephone1": "855-443-3873",
        "AccessComments": "",
        "RelatedURL": "https://www.gewattstation.com",
        "DistanceUnit": 0
    },
    "Connections": [
        {
            "ID": 174162,
            "ConnectionTypeID": 1,
            "LevelID": 2,
            "Amps": 16,
            "Voltage": 230,
            "PowerKW": 3.7,
            "CurrentTypeID": 10,
            "Quantity": 1
        }
    ],
    "DateLastStatusUpdate": "2020-06-26T02:59:00Z",
    "DataQualityLevel": 3,
    "DateCreated": "2019-04-06T05:03:00Z",
    "SubmissionStatusTypeID": 100
}