{
    "IsRecentlyVerified": false,
    "ID": 52850,
    "UUID": "ABEE5316-6FEB-43DE-9492-B61BEC62B0DF",
    "DataProviderID": 1,
    "OperatorID": 155,
    "UsageTypeID": 4,
    "UsageCost": "0",
    "AddressInfo": {
        "ID": 53196,
        "Title": "Augustusplatz",
        "AddressLine1": "Augustusplatz 7",
        "Town": "Leipzig",
        "StateOrProvince": "Leipzig",
        "Postcode": "04109",
        "CountryID": 87,
        "Latitude": 51.3374524,
        "Longitude": 12.3815502,
        "ContactTelephone1": "Tel: +49 341 121-6404",
        "AccessComments": "24/7 nutzbar, Zugang mit Ladekarte der Stadtwerke Leipzig, PlugSurfing Keyhanger, Stromticket \"easyGo\" App oder mit Webseite intercharge direct.\r\n",
        "RelatedURL": "https://www.l.de/gruppe/wir-fuer-leipzig/elektromobilitaet",
        "DistanceUnit": 0
    },
    "Connections": [
        {
            "ID": 65774,
            "ConnectionTypeID": 25,
            "StatusTypeID": 50,
            "LevelID": 2,
            "Amps": 16,
            "Voltage": 400,
            "PowerKW": 11,
            "CurrentTypeID": 20,
            "Quantity": 2
        }
    ],
    "NumberOfPoints": 2,
    "StatusTypeID": 50,
    "DateLastStatusUpdate": "2016-05-23T08:09:00Z",
    "DataQualityLevel": 1,
    "DateCreated": "2015-09-13T08:47:00Z",
    "SubmissionStatusTypeID": 200
}