{
    "IsRecentlyVerified": false,
    "ID": 177464,
    "UUID": "BEFFB5C6-32C2-457C-B9D7-BBBAE33F4387",
    "DataProviderID": 29,
    "DataProvidersReference": "8358",
    "AddressInfo": {
        "ID": 177823,
        "Title": "Gustav-Vorsteher-Straße 36",
        "AddressLine1": "Gustav-Vorsteher-Straße 36",
        "Town": "Wetter (Ruhr)",
        "Postcode": "58300",
        "CountryID": 87,
        "Latitude": 51.384538,
        "Longitude": 7.398432,
        "DistanceUnit": 0
    },
    "Connections": [
        {
            "ID": 276628,
            "ConnectionTypeID": 25,
            "StatusTypeID": 50,
            "LevelID": 2,
            "PowerKW": 22,
            "CurrentTypeID": 20
        },
        {
            "ID": 276629,
            "ConnectionTypeID": 25,
            "StatusTypeID": 50,
            "LevelID": 2,
            "PowerKW": 22,
            "CurrentTypeID": 20
        }
    ],
    "StatusTypeID": 0,
    "DateLastStatusUpdate": "2021-07-12T02:47:00Z",
    "MetadataValues": [
        {
            "ID": 9758,
            "MetadataFieldID": 4,
            "ItemValue": "Data from the German chargepoint registry provided by Bundesnetzagentur.de under the CC-BY 4.0 license"
        }
    ],
    "DataQualityLevel": 3,
    "DateCreated": "2021-07-08T09:49:00Z",
    "SubmissionStatusTypeID": 100
}