{
    "IsRecentlyVerified": false,
    "ID": 72099,
    "UUID": "34FB9C61-6333-4889-8356-F9FF05824163",
    "DataProviderID": 1,
    "OperatorID": 1,
    "UsageTypeID": 5,
    "UsageCost": "Free",
    "AddressInfo": {
        "ID": 72445,
        "Title": "Interparking Passage 44 car park",
        "AddressLine1": "Boulevard Pachéco - Pachecolaan",
        "Town": "Stadt Brüssel",
        "StateOrProvince": "Brüssel-Hauptstadt",
        "Postcode": "1000",
        "CountryID": 26,
        "Latitude": 50.852616,
        "Longitude": 4.361769699999968,
        "ContactTelephone1": " 050/44.66.05",
        "ContactEmail": "ZILVERPAND@interparking.com",
        "AccessComments": "Charging is free using \"PCard+\"; parking fees apply",
        "RelatedURL": "http://www.interparking.be/en/find-parking/Zilverpand/",
        "DistanceUnit": 0
    },
    "Connections": [
        {
            "ID": 103388,
            "ConnectionTypeID": 25,
            "StatusTypeID": 50,
            "LevelID": 2,
            "Amps": 16,
            "Voltage": 400,
            "PowerKW": 11,
            "CurrentTypeID": 20,
            "Quantity": 1
        }
    ],
    "NumberOfPoints": 1,
    "GeneralComments": "parking charges apply, charging is free",
    "StatusTypeID": 50,
    "DateLastStatusUpdate": "2016-10-05T13:48:00Z",
    "DataQualityLevel": 1,
    "DateCreated": "2016-10-05T13:48:00Z",
    "SubmissionStatusTypeID": 200
}