{
    "IsRecentlyVerified": false,
    "ID": 57484,
    "UUID": "55FE76EE-28EC-41CD-98B3-3E116FD00F8C",
    "DataProviderID": 1,
    "OperatorID": 80,
    "UsageTypeID": 4,
    "UsageCost": "0,40 €/kW",
    "AddressInfo": {
        "ID": 57830,
        "Title": "Eneldrive Porta Romana",
        "AddressLine1": "Via Enea Silvio Piccolomini",
        "Town": "Siena",
        "StateOrProvince": "SI",
        "Postcode": "53100",
        "CountryID": 112,
        "Latitude": 43.3129415174724,
        "Longitude": 11.3393694210299,
        "RelatedURL": "http://eneldrive.it",
        "DistanceUnit": 0
    },
    "Connections": [
        {
            "ID": 72617,
            "ConnectionTypeID": 25,
            "StatusTypeID": 50,
            "LevelID": 2,
            "Amps": 32,
            "Voltage": 400,
            "PowerKW": 22,
            "CurrentTypeID": 20,
            "Quantity": 2
        },
        {
            "ID": 72618,
            "ConnectionTypeID": 36,
            "StatusTypeID": 50,
            "LevelID": 2,
            "Amps": 16,
            "Voltage": 240,
            "PowerKW": 3.7,
            "CurrentTypeID": 10,
            "Quantity": 2
        }
    ],
    "NumberOfPoints": 2,
    "StatusTypeID": 50,
    "DateLastStatusUpdate": "2016-08-10T10:48:00Z",
    "DataQualityLevel": 1,
    "DateCreated": "2015-11-30T16:27:00Z",
    "SubmissionStatusTypeID": 200
}