{
    "UserComments": [
        {
            "ID": 9785,
            "ChargePointID": 42167,
            "CommentTypeID": 10,
            "UserName": "William Lyno",
            "Comment": "",
            "Rating": 4,
            "DateCreated": "2016-02-23T20:46:31.337Z",
            "User": {
                "ID": 6219,
                "Username": "William Lyno"
            },
            "CheckinStatusTypeID": 10
        },
        {
            "ID": 9520,
            "ChargePointID": 42167,
            "CommentTypeID": 10,
            "UserName": "William Lyno",
            "Comment": "",
            "Rating": 4,
            "DateCreated": "2016-01-14T21:37:24.497Z",
            "User": {
                "ID": 6219,
                "Username": "William Lyno"
            },
            "CheckinStatusTypeID": 10
        },
        {
            "ID": 6781,
            "ChargePointID": 42167,
            "CommentTypeID": 10,
            "UserName": "andrew_debbie",
            "Comment": "This is a busy location with a single rapid serving both direction.   Queues to charge are common here. ",
            "Rating": 5,
            "DateCreated": "2015-10-14T16:37:52.807Z",
            "User": {
                "ID": 1182,
                "Username": "andrew_debbie"
            },
            "CheckinStatusTypeID": 10
        },
        {
            "ID": 6772,
            "ChargePointID": 42167,
            "CommentTypeID": 10,
            "UserName": "William Lyno",
            "Comment": "",
            "DateCreated": "2015-10-13T17:33:22.583Z",
            "User": {
                "ID": 6219,
                "Username": "William Lyno"
            },
            "CheckinStatusTypeID": 10
        },
        {
            "ID": 6711,
            "ChargePointID": 42167,
            "CommentTypeID": 10,
            "UserName": "William Lyno",
            "Comment": "",
            "DateCreated": "2015-10-06T13:51:10.047Z",
            "User": {
                "ID": 6219,
                "Username": "William Lyno"
            },
            "CheckinStatusTypeID": 10
        },
        {
            "ID": 6651,
            "ChargePointID": 42167,
            "CommentTypeID": 10,
            "UserName": "William Lyno",
            "Comment": "Traffic gridlock due to no coach parking provision on sitet. Coaches parked on double yellow lines behind EV charge point and HGV's cant get past.",
            "DateCreated": "2015-09-30T13:24:58.3Z",
            "User": {
                "ID": 6219,
                "Username": "William Lyno"
            },
            "CheckinStatusTypeID": 100
        },
        {
            "ID": 6613,
            "ChargePointID": 42167,
            "CommentTypeID": 10,
            "UserName": "Colin Birchall",
            "Comment": "",
            "Rating": 5,
            "DateCreated": "2015-09-28T06:37:38.297Z",
            "User": {
                "ID": 4646,
                "Username": "Colin Birchall"
            },
            "CheckinStatusTypeID": 10
        },
        {
            "ID": 6511,
            "ChargePointID": 42167,
            "CommentTypeID": 10,
            "UserName": "William Lyno",
            "Comment": "17/09/15",
            "DateCreated": "2015-09-17T20:13:11.567Z",
            "User": {
                "ID": 6219,
                "Username": "William Lyno"
            },
            "CheckinStatusTypeID": 10
        },
        {
            "ID": 6397,
            "ChargePointID": 42167,
            "CommentTypeID": 1000,
            "UserName": "William Lyno",
            "Comment": "Started CHadMO But 5 mins later an error described as temperature detected, check cooling vents are clear. DC NOW UNAVAILABLE AC Showing as available",
            "DateCreated": "2015-09-02T18:56:45.84Z",
            "User": {
                "ID": 6219,
                "Username": "William Lyno"
            },
            "CheckinStatusTypeID": 25
        },
        {
            "ID": 6263,
            "ChargePointID": 42167,
            "CommentTypeID": 10,
            "UserName": "Simon Hewison",
            "Comment": "Confirmed as working today by user on speakev forum.",
            "DateCreated": "2015-08-21T15:45:02.06Z",
            "User": {
                "ID": 4575,
                "Username": "Simon Hewison"
            },
            "CheckinStatusTypeID": 10
        },
        {
            "ID": 6177,
            "ChargePointID": 42167,
            "CommentTypeID": 10,
            "UserName": "William Lyno",
            "Comment": "Park within the bay, it is extremely tight for Articulated HGV's to get around the back of the BP garage after fuelling and avoid charging bay hatched markings !",
            "Rating": 3,
            "DateCreated": "2015-08-13T14:45:07.07Z",
            "User": {
                "ID": 6219,
                "Username": "William Lyno"
            },
            "CheckinStatusTypeID": 10
        },
        {
            "ID": 6146,
            "ChargePointID": 42167,
            "CommentTypeID": 10,
            "UserName": "Simon Hewison",
            "Comment": "Noted as working again on Ecotricity's map, confirmed by posting on speakev forum",
            "DateCreated": "2015-08-09T05:42:15.457Z",
            "User": {
                "ID": 4575,
                "Username": "Simon Hewison"
            },
            "CheckinStatusTypeID": 0
        },
        {
            "ID": 4704,
            "ChargePointID": 42167,
            "CommentTypeID": 1000,
            "UserName": "Simon Hewison",
            "Comment": "Discussion on speakev forum implies that this charger has had a rather catastrophic fault. Currently down on Ecotricity's map.",
            "RelatedURL": "https://speakev.com/threads/singing-kettle-a55-north-wales.9338/",
            "DateCreated": "2015-06-16T13:09:38.79Z",
            "User": {
                "ID": 4575,
                "Username": "Simon Hewison"
            },
            "CheckinStatusTypeID": 0
        },
        {
            "ID": 4201,
            "ChargePointID": 42167,
            "CommentTypeID": 10,
            "UserName": "pwrkiter",
            "Comment": "Located to the right of main petrol station building",
            "Rating": 5,
            "DateCreated": "2015-04-11T22:21:21.227Z",
            "User": {
                "ID": 2071,
                "Username": "pwrkiter"
            },
            "CheckinStatusTypeID": 10
        },
        {
            "ID": 3911,
            "ChargePointID": 42167,
            "CommentTypeID": 50,
            "UserName": "",
            "Comment": "Marked as live by ecotricity as of 02/03/2015",
            "DateCreated": "2015-03-02T22:01:45.513Z",
            "CheckinStatusTypeID": 0
        }
    ],
    "MediaItems": [
        {
            "ID": 3310,
            "ChargePointID": 42167,
            "ItemURL": "https://s3-ap-southeast-2.amazonaws.com/openchargemap/images/GB/OCM42167/OCM-42167.orig.2015093013401038.jpeg",
            "ItemThumbnailURL": "https://s3-ap-southeast-2.amazonaws.com/openchargemap/images/GB/OCM42167/OCM-42167.thmb.2015093013401038.jpeg",
            "Comment": "Gridlock, HGV\"s cant get past EV when any vehicle as parked on the access rd double yellows !",
            "IsEnabled": true,
            "IsVideo": false,
            "IsFeaturedItem": false,
            "IsExternalResource": false,
            "User": {
                "ID": 6219,
                "Username": "William Lyno"
            },
            "DateCreated": "2015-09-30T13:40:00Z"
        },
        {
            "ID": 3206,
            "ChargePointID": 42167,
            "ItemURL": "https://s3-ap-southeast-2.amazonaws.com/openchargemap/images/GB/OCM42167/OCM-42167.orig.2015091313182570.jpg",
            "ItemThumbnailURL": "https://s3-ap-southeast-2.amazonaws.com/openchargemap/images/GB/OCM42167/OCM-42167.thmb.2015091313182570.jpg",
            "Comment": "View of charging bay from McDonalds ",
            "IsEnabled": true,
            "IsVideo": false,
            "IsFeaturedItem": false,
            "IsExternalResource": false,
            "User": {
                "ID": 6219,
                "Username": "William Lyno"
            },
            "DateCreated": "2015-09-13T13:19:00Z"
        },
        {
            "ID": 3154,
            "ChargePointID": 42167,
            "ItemURL": "https://s3-ap-southeast-2.amazonaws.com/openchargemap/images/GB/OCM42167/OCM-42167.orig.2015090218491897.jpg",
            "ItemThumbnailURL": "https://s3-ap-southeast-2.amazonaws.com/openchargemap/images/GB/OCM42167/OCM-42167.thmb.2015090218491897.jpg",
            "Comment": "View of chargepoint from McDonalds",
            "IsEnabled": true,
            "IsVideo": false,
            "IsFeaturedItem": false,
            "IsExternalResource": false,
            "User": {
                "ID": 6219,
                "Username": "William Lyno"
            },
            "DateCreated": "2015-09-02T18:50:00Z"
        },
        {
            "ID": 3153,
            "ChargePointID": 42167,
            "ItemURL": "https://s3-ap-southeast-2.amazonaws.com/openchargemap/images/GB/OCM42167/OCM-42167.orig.2015090218454626.jpg",
            "ItemThumbnailURL": "https://s3-ap-southeast-2.amazonaws.com/openchargemap/images/GB/OCM42167/OCM-42167.thmb.2015090218454626.jpg",
            "Comment": "Started a DC Charge and 5 mins later this error came up",
            "IsEnabled": true,
            "IsVideo": false,
            "IsFeaturedItem": false,
            "IsExternalResource": false,
            "User": {
                "ID": 6219,
                "Username": "William Lyno"
            },
            "DateCreated": "2015-09-02T18:46:00Z"
        }
    ],
    "IsRecentlyVerified": false,
    "ID": 42167,
    "UUID": "46B6EBF8-88A7-4C73-B701-19A56952386A",
    "DataProviderID": 1,
    "OperatorID": 24,
    "OperatorsReference": "1285",
    "UsageTypeID": 4,
    "UsageCost": "£0.30/kWh; £0.15/kWh for Ecotricity energy customers",
    "AddressInfo": {
        "ID": 42513,
        "Title": "Euro Garages Singing Kettle",
        "AddressLine1": "St. Asaph Road",
        "Town": "Holywell",
        "StateOrProvince": "Clwyd",
        "Postcode": "CH8 8RF",
        "CountryID": 1,
        "Latitude": 53.273686,
        "Longitude": -3.305466,
        "AccessComments": "located towards the rear right of main petrol station building. Park tidy - expect lorries coming around the corner.",
        "DistanceUnit": 0
    },
    "Connections": [
        {
            "ID": 50649,
            "ConnectionTypeID": 2,
            "StatusTypeID": 50,
            "LevelID": 3,
            "PowerKW": 50,
            "CurrentTypeID": 30,
            "Quantity": 1
        },
        {
            "ID": 50650,
            "ConnectionTypeID": 33,
            "StatusTypeID": 50,
            "LevelID": 3,
            "PowerKW": 50,
            "CurrentTypeID": 30,
            "Quantity": 1
        },
        {
            "ID": 50851,
            "ConnectionTypeID": 1036,
            "StatusTypeID": 50,
            "LevelID": 3,
            "Voltage": 400,
            "PowerKW": 43,
            "CurrentTypeID": 20,
            "Quantity": 1
        }
    ],
    "NumberOfPoints": 1,
    "StatusTypeID": 50,
    "DateLastStatusUpdate": "2020-03-10T06:14:00Z",
    "DataQualityLevel": 1,
    "DateCreated": "2015-02-23T10:25:00Z",
    "SubmissionStatusTypeID": 200
}