{
    "IsRecentlyVerified": false,
    "ID": 45753,
    "UUID": "96888EBA-738C-47C2-8332-A85429941841",
    "DataProviderID": 1,
    "DataProvidersReference": "2561",
    "AddressInfo": {
        "ID": 46099,
        "Title": "Kiwi Ålgård",
        "AddressLine1": "Sandnesveien 24",
        "Town": "ÅLGÅRD",
        "StateOrProvince": "Rogaland",
        "Postcode": "4330",
        "CountryID": 168,
        "Latitude": 58.76736,
        "Longitude": 5.86083,
        "AccessComments": "Utenfor Kiwi Ålgård",
        "DistanceUnit": 0
    },
    "Connections": [
        {
            "ID": 56416,
            "ConnectionTypeID": 0,
            "Reference": "1",
            "LevelID": 2,
            "Amps": 63,
            "Voltage": 400,
            "PowerKW": 43,
            "Comments": "Mode 3"
        },
        {
            "ID": 84113,
            "ConnectionTypeID": 0,
            "Reference": "2",
            "LevelID": 2,
            "Amps": 100,
            "Voltage": 500,
            "PowerKW": 50,
            "Comments": "Mode 4"
        },
        {
            "ID": 88008,
            "ConnectionTypeID": 0,
            "Reference": "3",
            "LevelID": 2,
            "Amps": 100,
            "Voltage": 500,
            "PowerKW": 50,
            "Comments": "Mode 4"
        }
    ],
    "NumberOfPoints": 3,
    "DateLastStatusUpdate": "2020-05-26T08:22:00Z",
    "DataQualityLevel": 2,
    "DateCreated": "2015-05-03T00:54:00Z",
    "SubmissionStatusTypeID": 100
}