{
    "IsRecentlyVerified": false,
    "ID": 170829,
    "UUID": "B75EB0F3-E149-4AA5-9C1C-44B2F0F7893F",
    "DataProviderID": 1,
    "OperatorID": 3327,
    "UsageTypeID": 4,
    "AddressInfo": {
        "ID": 171188,
        "Title": "BECHARGE Dossena Rigoli",
        "AddressLine1": "Via Rigoli",
        "Town": "Dossena",
        "StateOrProvince": "BG",
        "Postcode": "24010",
        "CountryID": 112,
        "Latitude": 45.87889758499273,
        "Longitude": 9.699641665903982,
        "ContactTelephone1": "02-49527730",
        "ContactEmail": "emobility@buildingenergy.it",
        "RelatedURL": "https://www.bec.energy/",
        "DistanceUnit": 0
    },
    "Connections": [
        {
            "ID": 261021,
            "ConnectionTypeID": 25,
            "StatusTypeID": 50,
            "LevelID": 2,
            "Amps": 32,
            "Voltage": 400,
            "PowerKW": 22,
            "CurrentTypeID": 20,
            "Quantity": 4
        }
    ],
    "NumberOfPoints": 4,
    "StatusTypeID": 50,
    "DateLastStatusUpdate": "2020-12-10T14:21:00Z",
    "DataQualityLevel": 1,
    "DateCreated": "2020-12-10T14:21:00Z",
    "SubmissionStatusTypeID": 200
}