{
    "IsRecentlyVerified": false,
    "ID": 125795,
    "UUID": "C651A459-D864-4BCF-9243-C795E982D9C0",
    "DataProviderID": 1,
    "OperatorID": 198,
    "UsageTypeID": 1,
    "AddressInfo": {
        "ID": 126141,
        "Title": "Liikenneasema Mäntyhovi",
        "AddressLine1": "Kaustisentie 1",
        "Town": "Evijärvi",
        "Postcode": "62500",
        "CountryID": 79,
        "Latitude": 63.3597952026781,
        "Longitude": 23.4673730863767,
        "DistanceUnit": 0
    },
    "Connections": [
        {
            "ID": 176300,
            "ConnectionTypeID": 2,
            "StatusTypeID": 50,
            "LevelID": 3,
            "Amps": 125,
            "Voltage": 500,
            "PowerKW": 50,
            "CurrentTypeID": 30,
            "Quantity": 1
        },
        {
            "ID": 176301,
            "ConnectionTypeID": 33,
            "StatusTypeID": 50,
            "LevelID": 3,
            "Amps": 125,
            "Voltage": 500,
            "PowerKW": 50,
            "CurrentTypeID": 30,
            "Quantity": 1
        },
        {
            "ID": 176302,
            "ConnectionTypeID": 25,
            "StatusTypeID": 50,
            "LevelID": 2,
            "Amps": 32,
            "Voltage": 400,
            "PowerKW": 22,
            "CurrentTypeID": 20,
            "Quantity": 1
        }
    ],
    "NumberOfPoints": 1,
    "StatusTypeID": 50,
    "DateLastStatusUpdate": "2019-04-27T05:43:00Z",
    "DataQualityLevel": 1,
    "DateCreated": "2019-04-26T19:29:00Z",
    "SubmissionStatusTypeID": 200
}