{
    "IsRecentlyVerified": false,
    "ID": 173639,
    "UUID": "A889331F-F8F2-4FEC-AF63-7E3AA7C79007",
    "DataProviderID": 18,
    "DataProvidersReference": "8d0d2b57bdc0fa64bc3348ffcfd5d159",
    "UsageTypeID": 1,
    "AddressInfo": {
        "ID": 173998,
        "Title": "Carregamman Street",
        "AddressLine1": "Carregamman Street",
        "Town": "Ammanford",
        "Postcode": "SA18 2NT",
        "CountryID": 1,
        "Latitude": 51.790556,
        "Longitude": -3.987894,
        "AccessComments": "",
        "RelatedURL": "http://www.clenerg-ev.com/",
        "DistanceUnit": 0
    },
    "Connections": [
        {
            "ID": 266746,
            "ConnectionTypeID": 25,
            "Reference": "Connector 1",
            "StatusTypeID": 50,
            "LevelID": 2,
            "Amps": 32,
            "Voltage": 400,
            "PowerKW": 22,
            "CurrentTypeID": 20
        },
        {
            "ID": 266747,
            "ConnectionTypeID": 25,
            "Reference": "Connector 2",
            "StatusTypeID": 50,
            "LevelID": 2,
            "Amps": 32,
            "Voltage": 400,
            "PowerKW": 22,
            "CurrentTypeID": 20
        }
    ],
    "StatusTypeID": 0,
    "DateLastStatusUpdate": "2021-03-03T11:25:00Z",
    "MetadataValues": [
        {
            "ID": 8561,
            "MetadataFieldID": 4,
            "ItemValue": "Contains public sector information licensed under the Open Government Licence v2.0. http://www.nationalarchives.gov.uk/doc/open-government-licence/version/2/"
        }
    ],
    "DataQualityLevel": 3,
    "DateCreated": "2021-03-03T11:25:00Z",
    "SubmissionStatusTypeID": 100
}