{
    "IsRecentlyVerified": false,
    "ID": 99871,
    "UUID": "E30EE81B-DD55-4902-B3E9-7B5E723E59A8",
    "DataProviderID": 1,
    "OperatorID": 45,
    "UsageTypeID": 1,
    "AddressInfo": {
        "ID": 100217,
        "Title": "Elektrofachmarkt Expert König (mit E-Bike Station)",
        "AddressLine1": "Sankt Pöltner Straße 2",
        "Town": "Rabenstein an der Pielach",
        "StateOrProvince": "Bezirk St. Pölten",
        "Postcode": "3203",
        "CountryID": 19,
        "Latitude": 48.0652582592583,
        "Longitude": 15.46764846316,
        "ContactTelephone1": "+43 2723 2155",
        "AccessComments": "Säule ist am Straßenrand vor dem Markt, nutzbar von Mo-Fr 8-12, 14-18Uhr, Sa 8-12Uhr. Auf der Stationsrückseite sind 2 Schukodosen für E-Bikes.",
        "RelatedURL": "http://www.elektro-koenig.at/",
        "DistanceUnit": 0
    },
    "Connections": [
        {
            "ID": 141088,
            "ConnectionTypeID": 25,
            "StatusTypeID": 50,
            "LevelID": 2,
            "Amps": 16,
            "Voltage": 400,
            "PowerKW": 11,
            "CurrentTypeID": 20,
            "Quantity": 1
        },
        {
            "ID": 141089,
            "ConnectionTypeID": 28,
            "StatusTypeID": 50,
            "LevelID": 2,
            "Amps": 16,
            "Voltage": 230,
            "PowerKW": 3.7,
            "CurrentTypeID": 10,
            "Quantity": 1
        },
        {
            "ID": 141090,
            "ConnectionTypeID": 28,
            "StatusTypeID": 50,
            "LevelID": 1,
            "Amps": 10,
            "Voltage": 230,
            "PowerKW": 2.3,
            "CurrentTypeID": 10,
            "Quantity": 2
        }
    ],
    "NumberOfPoints": 4,
    "StatusTypeID": 50,
    "DateLastStatusUpdate": "2018-02-06T08:02:00Z",
    "DataQualityLevel": 1,
    "DateCreated": "2018-02-06T07:07:00Z",
    "SubmissionStatusTypeID": 200
}