{
    "IsRecentlyVerified": false,
    "ID": 141354,
    "UUID": "ADC4958E-267B-4AF6-97BE-0602C8DE64C4",
    "DataProviderID": 2,
    "DataProvidersReference": "149109",
    "OperatorID": 9,
    "UsageTypeID": 2,
    "AddressInfo": {
        "ID": 141706,
        "Title": "Pershing Square West Garage",
        "AddressLine1": "2201 N Pershing Dr",
        "Town": "Arlington",
        "StateOrProvince": "VA",
        "Postcode": "22201",
        "CountryID": 2,
        "Latitude": 38.881162,
        "Longitude": -77.086082,
        "ContactTelephone1": "888-998-2546",
        "AccessComments": "MON: 24 hours | TUE: 24 hours | WED: 24 hours | THU: 24 hours | FRI: 24 hours | SAT: 24 hours | SUN: 24 hours",
        "RelatedURL": "http://www.blinkcharging.com/",
        "DistanceUnit": 0
    },
    "Connections": [
        {
            "ID": 197272,
            "ConnectionTypeID": 1,
            "LevelID": 2,
            "Amps": 16,
            "Voltage": 230,
            "PowerKW": 3.7,
            "CurrentTypeID": 10,
            "Quantity": 1
        }
    ],
    "StatusTypeID": 50,
    "DateLastStatusUpdate": "2020-06-26T03:00:00Z",
    "DataQualityLevel": 3,
    "DateCreated": "2019-12-24T09:15:00Z",
    "SubmissionStatusTypeID": 100
}