{
    "IsRecentlyVerified": false,
    "ID": 137417,
    "UUID": "F8359EE9-2FEB-43EB-BD13-2A59AC1DD958",
    "DataProviderID": 2,
    "DataProvidersReference": "134745",
    "OperatorID": 59,
    "UsageTypeID": 1,
    "AddressInfo": {
        "ID": 137763,
        "Title": "Greenlots - 162147",
        "AddressLine1": "100 S Rockingham Ave",
        "Town": "Tavares",
        "StateOrProvince": "FL",
        "Postcode": "32778",
        "CountryID": 2,
        "Latitude": 28.8017826080322,
        "Longitude": -81.7270050048828,
        "ContactTelephone1": "855-900-7584",
        "AccessComments": "24 hours daily",
        "RelatedURL": "http://greenlots.com/",
        "DistanceUnit": 0
    },
    "Connections": [
        {
            "ID": 192326,
            "ConnectionTypeID": 1,
            "LevelID": 2,
            "Amps": 16,
            "Voltage": 230,
            "PowerKW": 3,
            "CurrentTypeID": 10,
            "Quantity": 1
        }
    ],
    "StatusTypeID": 50,
    "DateLastStatusUpdate": "2019-12-24T09:05:00Z",
    "DataQualityLevel": 3,
    "DateCreated": "2019-12-24T09:05:00Z",
    "SubmissionStatusTypeID": 100
}