{
    "IsRecentlyVerified": false,
    "ID": 129146,
    "UUID": "B40F7912-9DB0-4369-8D3B-B42D3175689B",
    "DataProviderID": 1,
    "OperatorID": 23,
    "OperatorsReference": "51066",
    "UsageTypeID": 4,
    "AddressInfo": {
        "ID": 129492,
        "Title": "Freemason Garage",
        "AddressLine1": "161 W Freemason St",
        "Town": "Norfolk",
        "Postcode": "23510",
        "CountryID": 2,
        "Latitude": 36.850997,
        "Longitude": -76.291053,
        "ContactTelephone1": "(757) 664-6222",
        "DistanceUnit": 0
    },
    "Connections": [
        {
            "ID": 180794,
            "ConnectionTypeID": 30,
            "StatusTypeID": 50,
            "LevelID": 2,
            "PowerKW": 16,
            "CurrentTypeID": 20,
            "Quantity": 3
        }
    ],
    "NumberOfPoints": 3,
    "GeneralComments": "3 Tesla Connectors, up to 16kW.Available to the public. Self park.",
    "StatusTypeID": 50,
    "DateLastStatusUpdate": "2019-07-15T16:06:00Z",
    "DataQualityLevel": 1,
    "DateCreated": "2019-07-15T16:06:00Z",
    "SubmissionStatusTypeID": 200
}