{
    "IsRecentlyVerified": false,
    "ID": 75321,
    "UUID": "E8BE7338-F4B3-4589-A03A-7800C09C956D",
    "DataProviderID": 1,
    "OperatorID": 23,
    "OperatorsReference": "17121",
    "UsageTypeID": 6,
    "UsageCost": "Free",
    "AddressInfo": {
        "ID": 75667,
        "Title": "Harrods",
        "AddressLine1": "Harrods Car Park",
        "Town": "London",
        "Postcode": "SW3 1BB",
        "CountryID": 1,
        "Latitude": 51.499395,
        "Longitude": -0.163234,
        "ContactTelephone1": "+44 207 730 1234",
        "DistanceUnit": 0
    },
    "Connections": [
        {
            "ID": 108626,
            "ConnectionTypeID": 30,
            "StatusTypeID": 50,
            "LevelID": 2,
            "Amps": 32,
            "Voltage": 400,
            "PowerKW": 22,
            "CurrentTypeID": 20,
            "Quantity": 2
        }
    ],
    "NumberOfPoints": 2,
    "GeneralComments": "2 Tesla Connector, up to 22kW.Available for patrons only. Please see valet.",
    "StatusTypeID": 50,
    "DateLastStatusUpdate": "2018-10-03T18:13:00Z",
    "DataQualityLevel": 1,
    "DateCreated": "2016-12-14T17:25:00Z",
    "SubmissionStatusTypeID": 200
}