{
    "IsRecentlyVerified": false,
    "ID": 110142,
    "UUID": "F291E126-8318-4BFE-8D0C-2C78126BA7C9",
    "DataProviderID": 2,
    "DataProvidersReference": "100209",
    "OperatorID": 59,
    "UsageTypeID": 1,
    "AddressInfo": {
        "ID": 110488,
        "Title": "Greenlots - 12914",
        "AddressLine1": "1547 Westwood Blvd",
        "Town": "Los Angeles",
        "StateOrProvince": "CA",
        "Postcode": "91403",
        "CountryID": 2,
        "Latitude": 34.0533218383789,
        "Longitude": -118.439964294434,
        "ContactTelephone1": "855-900-7584",
        "AccessComments": "24 hours daily",
        "RelatedURL": "http://greenlots.com/",
        "DistanceUnit": 0
    },
    "Connections": [
        {
            "ID": 155375,
            "ConnectionTypeID": 1,
            "LevelID": 2,
            "Amps": 16,
            "Voltage": 230,
            "PowerKW": 3,
            "CurrentTypeID": 10,
            "Quantity": 1
        }
    ],
    "DateLastStatusUpdate": "2019-04-06T04:01:00Z",
    "DataQualityLevel": 3,
    "DateCreated": "2018-10-18T23:35:00Z",
    "SubmissionStatusTypeID": 100
}