{
    "IsRecentlyVerified": false,
    "ID": 33792,
    "UUID": "2A63841B-46F4-444D-828C-FDA030051D93",
    "DataProviderID": 26,
    "DataProvidersReference": "33798",
    "OperatorID": 73,
    "OperatorsReference": "EV-Box EVB-P1228097",
    "UsageCost": "0.00 jaarabonnement",
    "AddressInfo": {
        "ID": 34138,
        "Title": "Calandstraat 14",
        "AddressLine1": "Calandstraat 14",
        "Town": "Dordrecht",
        "Postcode": "3316 EA",
        "CountryID": 159,
        "Latitude": 51.7802368983503,
        "Longitude": 4.64594250793459,
        "RelatedURL": "http://www.ev-box.nl",
        "DistanceUnit": 0
    },
    "Connections": [
        {
            "ID": 37303,
            "ConnectionTypeID": 25,
            "LevelID": 2,
            "PowerKW": 5,
            "CurrentTypeID": 10
        },
        {
            "ID": 46925,
            "ConnectionTypeID": 25,
            "LevelID": 2,
            "PowerKW": 5,
            "CurrentTypeID": 10
        }
    ],
    "NumberOfPoints": 1,
    "StatusTypeID": 50,
    "DateLastStatusUpdate": "2016-03-03T12:36:00Z",
    "DataQualityLevel": 3,
    "DateCreated": "2015-01-09T06:04:00Z",
    "SubmissionStatusTypeID": 100
}