{
    "IsRecentlyVerified": false,
    "ID": 73825,
    "UUID": "925E4207-82B0-4599-BED0-A435AC948209",
    "DataProviderID": 1,
    "OperatorID": 89,
    "OperatorsReference": "CEA-453",
    "UsageTypeID": 4,
    "UsageCost": "CAD 1.00/hour",
    "AddressInfo": {
        "ID": 74171,
        "Title": "Shawinigan-Caserne de St-George",
        "AddressLine1": "509 105e avenue",
        "Town": "St-George-de-Champlain",
        "StateOrProvince": "QC",
        "Postcode": "G9T 5J6",
        "CountryID": 44,
        "Latitude": 46.626005,
        "Longitude": -72.65866,
        "DistanceUnit": 0
    },
    "Connections": [
        {
            "ID": 106132,
            "ConnectionTypeID": 1,
            "StatusTypeID": 50,
            "LevelID": 2,
            "Amps": 32,
            "Voltage": 230,
            "PowerKW": 7,
            "CurrentTypeID": 10,
            "Quantity": 1
        }
    ],
    "NumberOfPoints": 1,
    "StatusTypeID": 50,
    "DateLastStatusUpdate": "2016-11-27T19:55:00Z",
    "DataQualityLevel": 1,
    "DateCreated": "2016-11-23T23:14:00Z",
    "SubmissionStatusTypeID": 200
}