{
    "IsRecentlyVerified": false,
    "ID": 97127,
    "UUID": "44746401-48A7-4907-88B9-DD7003CCD150",
    "DataProviderID": 1,
    "OperatorID": 3,
    "OperatorsReference": "PG-81637",
    "UsageTypeID": 6,
    "UsageCost": "Free",
    "AddressInfo": {
        "ID": 97473,
        "Title": "Boston Ltd",
        "AddressLine1": "Unit 5",
        "AddressLine2": "Curo Park",
        "Town": "St Albans",
        "StateOrProvince": "Hertfordshire",
        "Postcode": "AL2 2DD",
        "CountryID": 1,
        "Latitude": 51.719649,
        "Longitude": -0.33312,
        "DistanceUnit": 0
    },
    "Connections": [
        {
            "ID": 137898,
            "ConnectionTypeID": 25,
            "StatusTypeID": 50,
            "LevelID": 2,
            "Amps": 32,
            "Voltage": 230,
            "PowerKW": 7,
            "CurrentTypeID": 10,
            "Quantity": 2
        }
    ],
    "NumberOfPoints": 2,
    "GeneralComments": "This is an open charge unit installed at the Boston Ltd site in Unit 5, Curo Park, Frogmore, St. Albans, Hertfordshire",
    "StatusTypeID": 50,
    "DateLastStatusUpdate": "2018-01-06T10:29:00Z",
    "DataQualityLevel": 1,
    "DateCreated": "2018-01-05T20:24:00Z",
    "SubmissionStatusTypeID": 200
}