{
    "IsRecentlyVerified": false,
    "ID": 118057,
    "UUID": "3979BC35-76C1-444F-86D2-B080CC73018C",
    "DataProviderID": 1,
    "OperatorID": 23,
    "OperatorsReference": "49305",
    "UsageTypeID": 7,
    "AddressInfo": {
        "ID": 118403,
        "Title": "Hotel Terradets",
        "AddressLine1": "Ctra. Balaguer-Tremp",
        "Town": "Cellers",
        "Postcode": "25631",
        "CountryID": 210,
        "Latitude": 42.068985,
        "Longitude": 0.883274,
        "ContactTelephone1": "+34 973 65 11 20",
        "DistanceUnit": 0
    },
    "Connections": [
        {
            "ID": 167076,
            "ConnectionTypeID": 30,
            "StatusTypeID": 50,
            "LevelID": 2,
            "Amps": 32,
            "Voltage": 400,
            "PowerKW": 22,
            "CurrentTypeID": 20,
            "Quantity": 1
        }
    ],
    "NumberOfPoints": 1,
    "GeneralComments": "1 Tesla Connector, up to 22kW.Available by reservation only. Please see front desk.",
    "StatusTypeID": 50,
    "DateLastStatusUpdate": "2020-08-17T12:03:00Z",
    "DataQualityLevel": 1,
    "DateCreated": "2019-03-14T23:23:00Z",
    "SubmissionStatusTypeID": 200
}