{
    "IsRecentlyVerified": false,
    "ID": 75361,
    "UUID": "49C8D7DF-83B9-4CC8-9EE2-4DC25BF9CC1E",
    "DataProviderID": 1,
    "OperatorID": 23,
    "OperatorsReference": "21945",
    "UsageTypeID": 7,
    "UsageCost": "Free",
    "AddressInfo": {
        "ID": 75707,
        "Title": "Alpenhof Murnau",
        "AddressLine1": "8 Ramsachstrasse 8",
        "Town": "Murnau am Staffelsee",
        "Postcode": "82418",
        "CountryID": 87,
        "Latitude": 47.668576,
        "Longitude": 11.195136,
        "ContactTelephone1": "+49 8841 491 0",
        "DistanceUnit": 0
    },
    "Connections": [
        {
            "ID": 108666,
            "ConnectionTypeID": 30,
            "StatusTypeID": 50,
            "LevelID": 2,
            "Amps": 32,
            "Voltage": 400,
            "PowerKW": 22,
            "CurrentTypeID": 20,
            "Quantity": 1
        }
    ],
    "NumberOfPoints": 1,
    "GeneralComments": "1 Tesla Connector, up to 22kW.Available by reservation only. Please see front desk.",
    "StatusTypeID": 50,
    "DateLastStatusUpdate": "2018-10-03T21:53:00Z",
    "DataQualityLevel": 1,
    "DateCreated": "2016-12-14T17:48:00Z",
    "SubmissionStatusTypeID": 200
}