{
    "IsRecentlyVerified": false,
    "ID": 14556,
    "UUID": "085FE615-43ED-49A9-8762-D2BE6FBFA611",
    "DataProviderID": 2,
    "DataProvidersReference": "48682",
    "UsageTypeID": 1,
    "AddressInfo": {
        "ID": 14453,
        "Title": "Blue Ridge Community College - Spearman Building",
        "AddressLine1": "2 E Campus Dr",
        "Town": "Flat Rock",
        "StateOrProvince": "NC",
        "Postcode": "28731",
        "CountryID": 2,
        "Latitude": 35.306506,
        "Longitude": -82.421425,
        "ContactTelephone1": "828-694-1686",
        "AccessComments": "24 hours daily",
        "RelatedURL": "",
        "DistanceUnit": 0
    },
    "Connections": [
        {
            "ID": 16689,
            "ConnectionTypeID": 1,
            "LevelID": 2,
            "Amps": 16,
            "Voltage": 230,
            "PowerKW": 3,
            "CurrentTypeID": 10,
            "Quantity": 1
        },
        {
            "ID": 21832,
            "ConnectionTypeID": 1,
            "LevelID": 2,
            "Quantity": 1
        }
    ],
    "DateLastStatusUpdate": "2019-04-06T04:02:00Z",
    "DataQualityLevel": 3,
    "DateCreated": "2012-12-06T16:50:00Z",
    "SubmissionStatusTypeID": 100
}