{
    "IsRecentlyVerified": false,
    "ID": 72461,
    "UUID": "EB9CC76E-7FBF-43B1-A55B-0D5FF12759EA",
    "DataProviderID": 1,
    "OperatorID": 2241,
    "UsageTypeID": 6,
    "AddressInfo": {
        "ID": 72807,
        "Title": "Getränkevertrieb Ochs",
        "AddressLine1": "Am Hambiegel 17",
        "AddressLine2": "Liedolsheim",
        "Town": "Dettenheim",
        "StateOrProvince": "Verwaltungsgemeinschaft Graben-Neudorf",
        "Postcode": "76706",
        "CountryID": 87,
        "Latitude": 49.15878,
        "Longitude": 8.410619999999994,
        "AccessComments": "24/7 nutzbar mit EWB Ladekarte oder SMS Freischaltung; einer der beiden Parkplätze ist für Carsharing reserviert.",
        "DistanceUnit": 0
    },
    "Connections": [
        {
            "ID": 103842,
            "ConnectionTypeID": 25,
            "StatusTypeID": 50,
            "LevelID": 2,
            "Amps": 32,
            "Voltage": 400,
            "PowerKW": 22,
            "CurrentTypeID": 20,
            "Quantity": 2
        },
        {
            "ID": 103843,
            "ConnectionTypeID": 28,
            "StatusTypeID": 50,
            "LevelID": 2,
            "Amps": 16,
            "Voltage": 230,
            "PowerKW": 3.7,
            "CurrentTypeID": 10,
            "Quantity": 2
        }
    ],
    "NumberOfPoints": 2,
    "StatusTypeID": 50,
    "DateLastStatusUpdate": "2016-10-17T07:17:00Z",
    "DataQualityLevel": 1,
    "DateCreated": "2016-10-17T07:17:00Z",
    "SubmissionStatusTypeID": 200
}