{
    "IsRecentlyVerified": false,
    "ID": 171110,
    "UUID": "3D1B1AAA-BA33-4A94-8C10-F43FBA67178E",
    "DataProviderID": 1,
    "OperatorID": 136,
    "UsageTypeID": 4,
    "UsageCost": "0.20€/min",
    "AddressInfo": {
        "ID": 171469,
        "Title": "Autotalo Lohja",
        "AddressLine1": "Lehmijärventie 5",
        "Town": "Lohja",
        "StateOrProvince": "Southern Finland",
        "Postcode": "08500",
        "CountryID": 79,
        "Latitude": 60.275709153473855,
        "Longitude": 24.12312958604548,
        "RelatedURL": "http://www.virta.fi",
        "DistanceUnit": 0
    },
    "Connections": [
        {
            "ID": 261458,
            "ConnectionTypeID": 2,
            "Reference": "20581",
            "StatusTypeID": 50,
            "LevelID": 3,
            "Amps": 125,
            "Voltage": 400,
            "PowerKW": 50,
            "CurrentTypeID": 30,
            "Quantity": 1
        },
        {
            "ID": 261459,
            "ConnectionTypeID": 33,
            "Reference": "20581",
            "StatusTypeID": 50,
            "LevelID": 3,
            "Amps": 125,
            "Voltage": 400,
            "PowerKW": 50,
            "CurrentTypeID": 30,
            "Quantity": 1
        }
    ],
    "NumberOfPoints": 2,
    "StatusTypeID": 50,
    "DateLastStatusUpdate": "2020-12-20T18:48:00Z",
    "DataQualityLevel": 1,
    "DateCreated": "2020-12-20T18:28:00Z",
    "SubmissionStatusTypeID": 200
}