{
    "IsRecentlyVerified": false,
    "ID": 171295,
    "UUID": "27AA0FBF-7D28-4A2D-A2E8-A2D17C85DDA4",
    "DataProviderID": 1,
    "OperatorID": 207,
    "UsageTypeID": 4,
    "AddressInfo": {
        "ID": 171654,
        "Title": "EndesaX Torelló",
        "AddressLine1": "Carrer del Pont, 4-6",
        "Town": "Torelló",
        "StateOrProvince": "Barcelona",
        "Postcode": "08570",
        "CountryID": 210,
        "Latitude": 42.04897690940592,
        "Longitude": 2.2627167695284243,
        "AccessComments": "use app juicepass",
        "DistanceUnit": 0
    },
    "Connections": [
        {
            "ID": 261801,
            "ConnectionTypeID": 33,
            "StatusTypeID": 50,
            "LevelID": 3,
            "PowerKW": 50,
            "CurrentTypeID": 30,
            "Quantity": 1
        },
        {
            "ID": 261802,
            "ConnectionTypeID": 2,
            "StatusTypeID": 50,
            "LevelID": 3,
            "PowerKW": 50,
            "CurrentTypeID": 30,
            "Quantity": 1
        },
        {
            "ID": 261803,
            "ConnectionTypeID": 1036,
            "StatusTypeID": 50,
            "LevelID": 2,
            "PowerKW": 22,
            "Quantity": 1
        }
    ],
    "NumberOfPoints": 1,
    "StatusTypeID": 50,
    "DateLastStatusUpdate": "2021-01-02T16:57:00Z",
    "DataQualityLevel": 1,
    "DateCreated": "2020-12-29T19:59:00Z",
    "SubmissionStatusTypeID": 200
}