{
    "IsRecentlyVerified": false,
    "ID": 56256,
    "UUID": "AD2D5330-6F79-441D-A390-D0B33C567C81",
    "DataProviderID": 1,
    "OperatorID": 23,
    "OperatorsReference": "13144",
    "UsageTypeID": 6,
    "UsageCost": "Free",
    "AddressInfo": {
        "ID": 56602,
        "Title": "Hilton Columbus At Easton",
        "AddressLine1": "3900 Chagrin Dr.",
        "Town": "Columbus",
        "StateOrProvince": "Ohio",
        "Postcode": "43219",
        "CountryID": 2,
        "Latitude": 40.0497614,
        "Longitude": -82.9121286,
        "ContactTelephone1": "614-414-5000",
        "AccessComments": "Parking Garage",
        "DistanceUnit": 0
    },
    "Connections": [
        {
            "ID": 70929,
            "ConnectionTypeID": 30,
            "StatusTypeID": 50,
            "LevelID": 2,
            "Amps": 0,
            "PowerKW": 8,
            "CurrentTypeID": 10,
            "Quantity": 1
        },
        {
            "ID": 70930,
            "ConnectionTypeID": 0,
            "StatusTypeID": 50,
            "LevelID": 2,
            "CurrentTypeID": 10,
            "Quantity": 1
        }
    ],
    "NumberOfPoints": 2,
    "GeneralComments": "Two charging stations (1 Tesla / 1 universal) available to guest of the hotel.",
    "StatusTypeID": 50,
    "DateLastStatusUpdate": "2017-06-09T14:50:00Z",
    "DataQualityLevel": 1,
    "DateCreated": "2015-10-25T20:17:00Z",
    "SubmissionStatusTypeID": 200
}