{
    "IsRecentlyVerified": false,
    "ID": 92869,
    "UUID": "F21AF39B-B4C7-45E1-BCEB-CF54098A235A",
    "DataProviderID": 1,
    "OperatorID": 3,
    "OperatorsReference": "PG-91445,PG-91684",
    "UsageTypeID": 4,
    "UsageCost": "Free. Parking Fees apply",
    "AddressInfo": {
        "ID": 93215,
        "Title": "Church Hill Car Park",
        "AddressLine1": "Church Hill",
        "Town": "Solihull",
        "Postcode": "B91 3QS",
        "CountryID": 1,
        "Latitude": 52.410312,
        "Longitude": -1.778197,
        "AccessComments": "in Pay and Display car park",
        "DistanceUnit": 0
    },
    "Connections": [
        {
            "ID": 131542,
            "ConnectionTypeID": 25,
            "StatusTypeID": 50,
            "LevelID": 2,
            "Amps": 32,
            "Voltage": 400,
            "PowerKW": 22,
            "CurrentTypeID": 20,
            "Quantity": 2
        }
    ],
    "NumberOfPoints": 2,
    "GeneralComments": "This is an open charge unit installed at the Church Hill car park in Church Hill Road, Solihull",
    "StatusTypeID": 50,
    "DateLastStatusUpdate": "2017-10-07T05:22:00Z",
    "DataQualityLevel": 1,
    "DateCreated": "2017-09-12T15:19:00Z",
    "SubmissionStatusTypeID": 200
}