{
    "IsRecentlyVerified": false,
    "ID": 72680,
    "UUID": "9826F613-4AF5-4361-BD09-4B8A41C39EB4",
    "DataProviderID": 1,
    "OperatorID": 156,
    "UsageTypeID": 4,
    "UsageCost": "Free",
    "AddressInfo": {
        "ID": 73026,
        "Title": "Dabag - Deutsche Automobilberatung",
        "AddressLine1": "Germendorfer Dorfstraße 33",
        "Town": "Oranienburg",
        "StateOrProvince": "Landkreis Oberhavel",
        "Postcode": "16515",
        "CountryID": 87,
        "Latitude": 52.747886,
        "Longitude": 13.187851499999965,
        "ContactTelephone1": "49 3301 57704-14",
        "AccessComments": "24/7 nutzbar mit The New Motion , PlugSurfing u.a. Ladekarten. Laden bis 11/2017 kostenlos.",
        "RelatedURL": "http://www.dabag.de/",
        "DistanceUnit": 0
    },
    "Connections": [
        {
            "ID": 104200,
            "ConnectionTypeID": 25,
            "StatusTypeID": 50,
            "LevelID": 2,
            "Amps": 32,
            "Voltage": 400,
            "PowerKW": 22,
            "CurrentTypeID": 20,
            "Quantity": 1
        }
    ],
    "NumberOfPoints": 1,
    "StatusTypeID": 50,
    "DateLastStatusUpdate": "2016-11-01T09:48:00Z",
    "DataQualityLevel": 1,
    "DateCreated": "2016-11-01T09:48:00Z",
    "SubmissionStatusTypeID": 200
}