{
    "IsRecentlyVerified": false,
    "ID": 161264,
    "UUID": "EE257E0C-55E7-4AFD-A028-E814194F322D",
    "DataProviderID": 1,
    "OperatorID": 213,
    "UsageTypeID": 1,
    "UsageCost": "0.70€/5 minutes > 3kW; Autres tarifs disponibles",
    "AddressInfo": {
        "ID": 161621,
        "Title": "Intermarché SUPER Calais et Drive",
        "AddressLine1": "54 Avenue Antoine de Saint-Exupéry",
        "Town": "Calais",
        "StateOrProvince": "Nord-Pas-de-Calais and Picardy",
        "Postcode": "62100",
        "CountryID": 80,
        "Latitude": 50.94612305063356,
        "Longitude": 1.8912954831397428,
        "DistanceUnit": 0
    },
    "Connections": [
        {
            "ID": 232032,
            "ConnectionTypeID": 33,
            "StatusTypeID": 50,
            "LevelID": 3,
            "PowerKW": 43,
            "CurrentTypeID": 30,
            "Quantity": 1
        },
        {
            "ID": 232033,
            "ConnectionTypeID": 2,
            "StatusTypeID": 50,
            "LevelID": 3,
            "PowerKW": 43,
            "CurrentTypeID": 30,
            "Quantity": 1
        },
        {
            "ID": 232034,
            "ConnectionTypeID": 1036,
            "StatusTypeID": 50,
            "LevelID": 3,
            "PowerKW": 43,
            "CurrentTypeID": 20,
            "Quantity": 1
        }
    ],
    "NumberOfPoints": 1,
    "StatusTypeID": 50,
    "DateLastStatusUpdate": "2020-07-08T04:47:00Z",
    "DataQualityLevel": 1,
    "DateCreated": "2020-07-07T14:36:00Z",
    "SubmissionStatusTypeID": 200
}