{
    "IsRecentlyVerified": false,
    "ID": 45635,
    "UUID": "DD2B4371-4AA4-41B0-A537-2ADB8473C1E3",
    "DataProviderID": 1,
    "DataProvidersReference": "2718",
    "AddressInfo": {
        "ID": 45981,
        "Title": "Willys - Sisjön",
        "AddressLine1": "Datavägen 15",
        "Town": "ASKIM",
        "StateOrProvince": "VÄSTRA GÖTALAND",
        "Postcode": "43632",
        "CountryID": 216,
        "Latitude": 57.63949,
        "Longitude": 11.95174,
        "AccessComments": "",
        "DistanceUnit": 0
    },
    "Connections": [
        {
            "ID": 56298,
            "ConnectionTypeID": 0,
            "Reference": "1",
            "LevelID": 2,
            "Amps": 16,
            "Voltage": 230,
            "PowerKW": 3.7,
            "Comments": "Mode 1"
        }
    ],
    "NumberOfPoints": 1,
    "DateLastStatusUpdate": "2020-05-26T08:21:00Z",
    "DataQualityLevel": 2,
    "DateCreated": "2015-05-03T00:54:00Z",
    "SubmissionStatusTypeID": 100
}