{
    "IsRecentlyVerified": false,
    "ID": 176150,
    "UUID": "93B81261-E9CA-4652-87F0-4A3C0C4F99BD",
    "DataProviderID": 1,
    "OperatorID": 80,
    "UsageTypeID": 6,
    "UsageCost": "Unclear, to verify",
    "AddressInfo": {
        "ID": 176509,
        "Title": "Onoranze Funebri Maffioli",
        "AddressLine1": "Strada Circonvallazione sud 4",
        "Town": "Curtatone",
        "StateOrProvince": "MN",
        "Postcode": "46010",
        "CountryID": 112,
        "Latitude": 45.13317128176013,
        "Longitude": 10.769254480229392,
        "ContactTelephone1": "037647087",
        "RelatedURL": "https://www.maffiolionoranzefunebri.it/",
        "DistanceUnit": 0
    },
    "Connections": [
        {
            "ID": 273699,
            "ConnectionTypeID": 25,
            "StatusTypeID": 50,
            "Quantity": 1,
            "Comments": "Scame Wallbox"
        }
    ],
    "NumberOfPoints": 1,
    "GeneralComments": "Scame Wallbox either 3 or 7 kW",
    "StatusTypeID": 50,
    "DateLastStatusUpdate": "2021-06-28T07:31:00Z",
    "DataQualityLevel": 1,
    "DateCreated": "2021-06-27T17:02:00Z",
    "SubmissionStatusTypeID": 200
}