{
    "IsRecentlyVerified": false,
    "ID": 180998,
    "UUID": "BB3564E1-1A90-465D-A88E-12796D5C5BF7",
    "DataProviderID": 29,
    "DataProvidersReference": "15363",
    "AddressInfo": {
        "ID": 181357,
        "Title": "Ostring 8",
        "AddressLine1": "Ostring 8",
        "Town": "Wiesbaden",
        "Postcode": "65205",
        "CountryID": 87,
        "Latitude": 50.05954,
        "Longitude": 8.346525417,
        "DistanceUnit": 0
    },
    "Connections": [
        {
            "ID": 284773,
            "ConnectionTypeID": 25,
            "StatusTypeID": 50,
            "LevelID": 2,
            "PowerKW": 11,
            "CurrentTypeID": 20
        },
        {
            "ID": 284774,
            "ConnectionTypeID": 25,
            "StatusTypeID": 50,
            "LevelID": 2,
            "PowerKW": 11,
            "CurrentTypeID": 20
        }
    ],
    "StatusTypeID": 50,
    "DateLastStatusUpdate": "2021-07-12T02:44:00Z",
    "MetadataValues": [
        {
            "ID": 13292,
            "MetadataFieldID": 4,
            "ItemValue": "Data from the German chargepoint registry provided by Bundesnetzagentur.de under the CC-BY 4.0 license"
        }
    ],
    "DataQualityLevel": 3,
    "DateCreated": "2021-07-08T10:01:00Z",
    "SubmissionStatusTypeID": 100
}