{
    "IsRecentlyVerified": false,
    "ID": 131054,
    "UUID": "E62ED423-BCC5-4472-998C-F6A3F8AE5F94",
    "DataProviderID": 1,
    "OperatorID": 23,
    "OperatorsReference": "51496",
    "UsageTypeID": 4,
    "AddressInfo": {
        "ID": 131400,
        "Title": "Boutique Appartements Saalbach",
        "AddressLine1": "Walleggweg 477",
        "Town": "Hinterglemm",
        "Postcode": "5754",
        "CountryID": 19,
        "Latitude": 47.375942,
        "Longitude": 12.546761,
        "ContactTelephone1": "+43 6541 209 00",
        "DistanceUnit": 0
    },
    "Connections": [
        {
            "ID": 183549,
            "ConnectionTypeID": 30,
            "StatusTypeID": 50,
            "LevelID": 2,
            "PowerKW": 17,
            "CurrentTypeID": 20,
            "Quantity": 1
        }
    ],
    "NumberOfPoints": 1,
    "GeneralComments": "1 Tesla Connector, up to 17kW.Available for customers. Self park.",
    "StatusTypeID": 50,
    "DateLastStatusUpdate": "2019-08-28T20:04:00Z",
    "DataQualityLevel": 1,
    "DateCreated": "2019-08-28T20:04:00Z",
    "SubmissionStatusTypeID": 200
}