{
    "IsRecentlyVerified": false,
    "ID": 74174,
    "UUID": "DF1F5E3C-AA08-4B78-A4A4-E49C8ABBBFAE",
    "DataProviderID": 1,
    "OperatorID": 89,
    "OperatorsReference": "CEA-348",
    "UsageTypeID": 4,
    "UsageCost": "CAD 2.50",
    "AddressInfo": {
        "ID": 74520,
        "Title": "Plessisville-Hôtel de Ville",
        "AddressLine1": "1700 rue Saint-Calixte",
        "Town": "Plessisville",
        "StateOrProvince": "QC",
        "Postcode": "G6L 1R3",
        "CountryID": 44,
        "Latitude": 46.2186422337573,
        "Longitude": -71.7714667303657,
        "DistanceUnit": 0
    },
    "Connections": [
        {
            "ID": 106517,
            "ConnectionTypeID": 1,
            "StatusTypeID": 50,
            "LevelID": 2,
            "Amps": 32,
            "Voltage": 230,
            "PowerKW": 7,
            "CurrentTypeID": 10,
            "Quantity": 1
        }
    ],
    "NumberOfPoints": 1,
    "StatusTypeID": 50,
    "DateLastStatusUpdate": "2016-11-29T09:17:00Z",
    "DataQualityLevel": 1,
    "DateCreated": "2016-11-24T14:19:00Z",
    "SubmissionStatusTypeID": 200
}