{
    "IsRecentlyVerified": false,
    "ID": 115701,
    "UUID": "6A350EB9-FC9B-466D-AD66-CB3E84799175",
    "DataProviderID": 2,
    "DataProvidersReference": "112887",
    "OperatorID": 23,
    "UsageTypeID": 1,
    "AddressInfo": {
        "ID": 116047,
        "Title": "Jericho Canyon Vineyard - Tesla Destination",
        "AddressLine1": "3292 Old Lawley Toll Rd",
        "Town": "Calistoga",
        "StateOrProvince": "CA",
        "Postcode": "94515",
        "CountryID": 2,
        "Latitude": 38.616948,
        "Longitude": -122.593873,
        "ContactTelephone1": "707-942-9665  877-798-3752",
        "AccessComments": "24 hours daily; for customer use only; see front desk for access",
        "RelatedURL": "https://www.tesla.com/destination-charging",
        "DistanceUnit": 0
    },
    "Connections": [
        {
            "ID": 162734,
            "ConnectionTypeID": 30,
            "LevelID": 2,
            "Amps": 16,
            "Voltage": 230,
            "PowerKW": 3.7,
            "CurrentTypeID": 10,
            "Quantity": 2
        }
    ],
    "DateLastStatusUpdate": "2020-06-26T03:00:00Z",
    "DataQualityLevel": 3,
    "DateCreated": "2019-02-11T07:13:00Z",
    "SubmissionStatusTypeID": 100
}