{
    "IsRecentlyVerified": false,
    "ID": 102872,
    "UUID": "353E42D1-8E80-49FB-A986-137C82776E92",
    "DataProviderID": 2,
    "DataProvidersReference": "94867",
    "OperatorID": 3372,
    "UsageTypeID": 2,
    "AddressInfo": {
        "ID": 103218,
        "Title": "Office Building",
        "AddressLine1": "50 Haarlem Ave",
        "Town": "White Plains",
        "StateOrProvince": "NY",
        "Postcode": "10603",
        "CountryID": 2,
        "Latitude": 41.051099,
        "Longitude": -73.771738,
        "ContactTelephone1": "",
        "AccessComments": "Office building business hours; for guest and employee use only",
        "RelatedURL": "http://evconnect.com/",
        "DistanceUnit": 0
    },
    "Connections": [
        {
            "ID": 145014,
            "ConnectionTypeID": 1,
            "LevelID": 2,
            "Amps": 16,
            "Voltage": 230,
            "PowerKW": 3.7,
            "CurrentTypeID": 10,
            "Quantity": 7
        }
    ],
    "DateLastStatusUpdate": "2020-06-26T03:03:00Z",
    "DataQualityLevel": 3,
    "DateCreated": "2018-04-21T04:13:00Z",
    "SubmissionStatusTypeID": 100
}