{
    "IsRecentlyVerified": false,
    "ID": 43478,
    "UUID": "96519DDE-794D-4C94-BAAD-8CCFCFCF184B",
    "DataProviderID": 1,
    "OperatorID": 45,
    "UsageTypeID": 5,
    "UsageCost": "1€ für 8 Stunden",
    "AddressInfo": {
        "ID": 43824,
        "Title": "Stellplatz Hallenbad",
        "AddressLine1": "An der Bünte 4",
        "AddressLine2": "",
        "Town": "Nörten-Hardenberg",
        "StateOrProvince": "Landkreis Northeim",
        "Postcode": "37176",
        "CountryID": 87,
        "Latitude": 51.63364564087167,
        "Longitude": 9.939933163368222,
        "ContactTelephone1": "",
        "ContactTelephone2": "",
        "ContactEmail": "",
        "AccessComments": "Auf dem gebührenfreien Hallenbadparkplatz für PKW und 3 Wohnmobile (am Band mit den farbigen Segmenten auf dem Dach orientieren) ist eine Münzstromsäule mit 7 Anschlüssen. ",
        "RelatedURL": "http://www.noerten-hardenberg.de/",
        "DistanceUnit": 0
    },
    "Connections": [
        {
            "ID": 52703,
            "ConnectionTypeID": 16,
            "StatusTypeID": 50,
            "LevelID": 2,
            "Amps": 16,
            "Voltage": 230,
            "PowerKW": 3.7,
            "CurrentTypeID": 10,
            "Quantity": 4
        }
    ],
    "NumberOfPoints": 7,
    "GeneralComments": "",
    "StatusTypeID": 50,
    "DateLastStatusUpdate": "2016-03-07T14:49:00Z",
    "DataQualityLevel": 1,
    "DateCreated": "2015-04-01T11:06:00Z",
    "SubmissionStatusTypeID": 200
}