{
    "IsRecentlyVerified": false,
    "ID": 39236,
    "UUID": "2D86B115-69BE-4F92-905D-8D8791AF07FF",
    "DataProviderID": 1,
    "OperatorID": 156,
    "OperatorsReference": "NewMotion 02009183",
    "UsageTypeID": 3,
    "UsageCost": "",
    "AddressInfo": {
        "ID": 39582,
        "Title": "Autohaus Gebrüder Müller",
        "AddressLine1": "Am Tannenkopp 15",
        "AddressLine2": "",
        "Town": "Tessin",
        "StateOrProvince": "",
        "Postcode": "18195",
        "CountryID": 87,
        "Latitude": 54.0331916809082,
        "Longitude": 12.4387292861938,
        "ContactTelephone1": "+49 38205 7010",
        "ContactTelephone2": "",
        "ContactEmail": "",
        "AccessComments": "",
        "RelatedURL": "http://www.gebr-mueller.de/",
        "DistanceUnit": 0
    },
    "Connections": [
        {
            "ID": 42747,
            "ConnectionTypeID": 25,
            "StatusTypeID": 50,
            "LevelID": 2,
            "Amps": 16,
            "Voltage": 230,
            "PowerKW": 3.7,
            "CurrentTypeID": 10,
            "Quantity": 1
        }
    ],
    "NumberOfPoints": 1,
    "GeneralComments": "Normale Ladekarte funktioniert nicht, nur die des Mitsubishi Autohauses. Daher dort anmelden zum Laden! Öffnungszeiten Montag bis Freitag: 07:30 bis 18:00 Uhr, Samstag: 08:30 bis 12:00 Uhr, Sonntag: 10:00 bis 16:00 Uhr (nur Besichtigung)",
    "StatusTypeID": 50,
    "DateLastStatusUpdate": "2015-06-11T07:29:00Z",
    "DataQualityLevel": 3,
    "DateCreated": "2015-01-09T06:08:00Z",
    "SubmissionStatusTypeID": 200
}