{
    "IsRecentlyVerified": false,
    "ID": 32929,
    "UUID": "6B97E2D6-AD65-4F4E-B365-492D68BA4BA8",
    "DataProviderID": 26,
    "DataProvidersReference": "48608",
    "OperatorID": 178,
    "OperatorsReference": "EVnetNL REE407",
    "UsageCost": "0.00 jaarabonnement",
    "AddressInfo": {
        "ID": 33275,
        "Title": "De Pinckart 49",
        "AddressLine1": "De Pinckart 49",
        "Town": "Nuenen c.a.",
        "Postcode": "5674 CB",
        "CountryID": 159,
        "Latitude": 51.466471,
        "Longitude": 5.53551,
        "ContactTelephone1": "0800-3522365",
        "RelatedURL": "http://www.evnet.nl",
        "DistanceUnit": 0
    },
    "Connections": [
        {
            "ID": 36440,
            "ConnectionTypeID": 25,
            "LevelID": 1,
            "PowerKW": 2.3,
            "CurrentTypeID": 10
        }
    ],
    "NumberOfPoints": 1,
    "StatusTypeID": 50,
    "DateLastStatusUpdate": "2016-06-04T02:39:00Z",
    "DataQualityLevel": 3,
    "DateCreated": "2015-01-09T06:03:00Z",
    "SubmissionStatusTypeID": 100
}