{
    "MediaItems": [
        {
            "ID": 16192,
            "ChargePointID": 101907,
            "ItemURL": "https://s3-ap-southeast-2.amazonaws.com/openchargemap/images/US/OCM101907/OCM-101907.orig.2018080802182731.png",
            "ItemThumbnailURL": "https://s3-ap-southeast-2.amazonaws.com/openchargemap/images/US/OCM101907/OCM-101907.thmb.2018080802182731.png",
            "Comment": "",
            "IsEnabled": true,
            "IsVideo": false,
            "IsFeaturedItem": false,
            "IsExternalResource": false,
            "User": {
                "ID": 11824,
                "Username": "Hypermile"
            },
            "DateCreated": "2018-08-08T02:19:00Z"
        }
    ],
    "IsRecentlyVerified": false,
    "ID": 101907,
    "UUID": "B046D761-DF30-4650-AD51-F0C450A22FA5",
    "DataProviderID": 1,
    "OperatorID": 15,
    "UsageTypeID": 1,
    "UsageCost": "$0.25/min; other tariffs available",
    "AddressInfo": {
        "ID": 102253,
        "Title": "EVGo Walgreens",
        "AddressLine1": "7216 Garth Road",
        "Town": "Baytown",
        "StateOrProvince": "TX",
        "Postcode": "77521",
        "CountryID": 2,
        "Latitude": 29.8063981,
        "Longitude": -94.9814046,
        "RelatedURL": "https://www.evgo.com/",
        "DistanceUnit": 0
    },
    "Connections": [
        {
            "ID": 143878,
            "ConnectionTypeID": 32,
            "StatusTypeID": 50,
            "LevelID": 3,
            "PowerKW": 50,
            "CurrentTypeID": 30,
            "Quantity": 1
        },
        {
            "ID": 143879,
            "ConnectionTypeID": 2,
            "StatusTypeID": 50,
            "LevelID": 3,
            "PowerKW": 50,
            "CurrentTypeID": 30,
            "Quantity": 1
        },
        {
            "ID": 143880,
            "ConnectionTypeID": 1,
            "StatusTypeID": 50,
            "LevelID": 2,
            "PowerKW": 7.2,
            "CurrentTypeID": 10,
            "Quantity": 1
        }
    ],
    "NumberOfPoints": 2,
    "StatusTypeID": 50,
    "DateLastStatusUpdate": "2018-08-08T02:19:00Z",
    "DataQualityLevel": 1,
    "DateCreated": "2018-04-14T20:06:00Z",
    "SubmissionStatusTypeID": 200
}