{
    "IsRecentlyVerified": false,
    "ID": 110285,
    "UUID": "E89233D5-D556-414A-8E67-B1739037CF90",
    "DataProviderID": 2,
    "DataProvidersReference": "100339",
    "OperatorID": 5,
    "UsageTypeID": 1,
    "AddressInfo": {
        "ID": 110631,
        "Title": "DC SOLAR",
        "AddressLine1": "1705 NV-562",
        "Town": "Las Vegas",
        "StateOrProvince": "NV",
        "Postcode": "89119",
        "CountryID": 2,
        "Latitude": 36.0715061,
        "Longitude": -115.1283714,
        "ContactTelephone1": "888-758-4389",
        "AccessComments": "24 hours daily",
        "RelatedURL": "http://www.chargepoint.com/",
        "DistanceUnit": 0
    },
    "Connections": [
        {
            "ID": 155525,
            "ConnectionTypeID": 1,
            "LevelID": 2,
            "Amps": 16,
            "Voltage": 230,
            "PowerKW": 3,
            "CurrentTypeID": 10,
            "Quantity": 1
        }
    ],
    "DateLastStatusUpdate": "2019-04-06T04:02:00Z",
    "DataQualityLevel": 3,
    "DateCreated": "2018-10-18T23:36:00Z",
    "SubmissionStatusTypeID": 100
}