{
    "IsRecentlyVerified": false,
    "ID": 85699,
    "UUID": "6B1CB4D8-8D17-40F5-BA80-497763BE6F17",
    "DataProviderID": 1,
    "OperatorID": 23,
    "OperatorsReference": "26660",
    "UsageTypeID": 6,
    "AddressInfo": {
        "ID": 86045,
        "Title": "Best Western Hotel Rocca",
        "AddressLine1": "105 Via Sferracavalli",
        "Town": "Site - City Cassino",
        "Postcode": "3043",
        "CountryID": 112,
        "Latitude": 41.507541,
        "Longitude": 13.833975,
        "ContactTelephone1": "+39 0776 311 212",
        "DistanceUnit": 0
    },
    "Connections": [
        {
            "ID": 121834,
            "ConnectionTypeID": 30,
            "StatusTypeID": 50,
            "LevelID": 2,
            "Amps": 32,
            "Voltage": 400,
            "PowerKW": 22,
            "CurrentTypeID": 20,
            "Quantity": 1
        }
    ],
    "NumberOfPoints": 1,
    "GeneralComments": "1 Tesla Connector, up to 22kW.Available for patrons only. Please call ahead.",
    "StatusTypeID": 50,
    "DateLastStatusUpdate": "2018-10-03T23:39:00Z",
    "DataQualityLevel": 1,
    "DateCreated": "2017-04-12T05:41:00Z",
    "SubmissionStatusTypeID": 200
}