{
    "IsRecentlyVerified": false,
    "ID": 17376,
    "UUID": "151EAE8F-5DFF-4265-BF90-4BF91C938A69",
    "DataProviderID": 22,
    "DataProvidersReference": "A90218782025C48E09BA0436CF30D029",
    "AddressInfo": {
        "ID": 17721,
        "Title": "六甲山牧場",
        "AddressLine1": "兵庫県神戸市灘区六甲山町中一里山1-1",
        "CountryID": 114,
        "Latitude": 34.75208552,
        "Longitude": 135.2081008,
        "ContactTelephone1": "078-891-0280",
        "DistanceUnit": 0
    },
    "Connections": [
        {
            "ID": 17617,
            "ConnectionTypeID": 2,
            "LevelID": 2,
            "Amps": 100,
            "Voltage": 480,
            "PowerKW": 48,
            "Quantity": 1
        }
    ],
    "DateLastStatusUpdate": "2013-06-29T08:57:00Z",
    "DataQualityLevel": 2,
    "DateCreated": "2013-06-29T08:57:00Z",
    "SubmissionStatusTypeID": 200
}