{
    "IsRecentlyVerified": false,
    "ID": 85884,
    "UUID": "FEF96782-8866-4719-A4B8-51FB1C8E988F",
    "DataProviderID": 1,
    "OperatorID": 150,
    "OperatorsReference": "Churchill Way Car Park, Basingstoke - SSE,Churchill Way Car Park, Basingstoke - SSE",
    "UsageTypeID": 4,
    "UsageCost": "ÃÂ£0.50 + ÃÂ£0.30/kWh. Parking fees apply.",
    "AddressInfo": {
        "ID": 86230,
        "Title": "Churchill Way Car Park",
        "AddressLine1": "Churchill Way",
        "Town": "Basingstoke",
        "StateOrProvince": "Hampshire",
        "Postcode": "RG21 7PP",
        "CountryID": 1,
        "Latitude": 51.265897,
        "Longitude": -1.090743,
        "DistanceUnit": 0
    },
    "Connections": [
        {
            "ID": 122071,
            "ConnectionTypeID": 25,
            "StatusTypeID": 50,
            "LevelID": 2,
            "Amps": 32,
            "Voltage": 230,
            "PowerKW": 7,
            "CurrentTypeID": 10,
            "Quantity": 2
        }
    ],
    "NumberOfPoints": 2,
    "StatusTypeID": 50,
    "DateLastStatusUpdate": "2018-11-14T14:14:00Z",
    "DataQualityLevel": 1,
    "DateCreated": "2017-04-20T05:40:00Z",
    "SubmissionStatusTypeID": 200
}