{
    "IsRecentlyVerified": false,
    "ID": 13735,
    "UUID": "8103220D-FD92-409A-AD26-94DAC5C3DD25",
    "DataProviderID": 15,
    "DataProvidersReference": "24389",
    "OperatorID": 26,
    "AddressInfo": {
        "ID": 13632,
        "Title": "510 W. 49th St.",
        "AddressLine1": "510 W. 49th St.",
        "Town": "Indianapolis",
        "StateOrProvince": "IN",
        "Postcode": "46208",
        "CountryID": 2,
        "Latitude": 39.843216,
        "Longitude": -86.167435,
        "ContactTelephone1": "(317) 940-9375",
        "RelatedURL": "http://carstations.com/24389",
        "DistanceUnit": 0
    },
    "Connections": [
        {
            "ID": 11184,
            "ConnectionTypeID": 1,
            "Reference": "J1772",
            "LevelID": 2
        }
    ],
    "StatusTypeID": 0,
    "DateLastStatusUpdate": "2017-11-04T14:04:00Z",
    "DataQualityLevel": 2,
    "DateCreated": "2012-12-06T11:08:00Z",
    "SubmissionStatusTypeID": 100
}