{
    "IsRecentlyVerified": false,
    "ID": 168802,
    "UUID": "C7E419F9-60F1-4CC4-A5D3-36431E4E0A0B",
    "DataProviderID": 1,
    "OperatorID": 203,
    "UsageTypeID": 5,
    "UsageCost": "35p per kWh Contactless",
    "AddressInfo": {
        "ID": 169161,
        "Title": "The Canterbury Bell",
        "AddressLine1": "481 Margate Road",
        "AddressLine2": "Westwood",
        "Town": "Broadstairs",
        "StateOrProvince": "England",
        "Postcode": "CT10 2QA",
        "CountryID": 1,
        "Latitude": 51.35990239970451,
        "Longitude": 1.3964816568931155,
        "ContactTelephone1": "0330 010 1757",
        "RelatedURL": "https://ospreycharging.co.uk/ev-drivers/",
        "DistanceUnit": 0
    },
    "Connections": [
        {
            "ID": 256588,
            "ConnectionTypeID": 25,
            "StatusTypeID": 50,
            "LevelID": 2,
            "Amps": 32,
            "Voltage": 400,
            "PowerKW": 22,
            "CurrentTypeID": 20,
            "Quantity": 1
        },
        {
            "ID": 256589,
            "ConnectionTypeID": 2,
            "StatusTypeID": 50,
            "LevelID": 3,
            "Amps": 125,
            "Voltage": 400,
            "PowerKW": 50,
            "CurrentTypeID": 30,
            "Quantity": 1
        },
        {
            "ID": 256590,
            "ConnectionTypeID": 33,
            "StatusTypeID": 50,
            "LevelID": 3,
            "Amps": 125,
            "Voltage": 400,
            "PowerKW": 50,
            "CurrentTypeID": 30,
            "Quantity": 1
        }
    ],
    "NumberOfPoints": 2,
    "GeneralComments": "Engenie rapid charger AC is a 22kW Socket",
    "StatusTypeID": 50,
    "DateLastStatusUpdate": "2020-10-06T17:25:00Z",
    "DataQualityLevel": 1,
    "DateCreated": "2020-10-06T02:06:00Z",
    "SubmissionStatusTypeID": 200
}