{
    "IsRecentlyVerified": false,
    "ID": 185581,
    "UUID": "3EDF962E-D762-4A27-B131-8B6A96608CF1",
    "DataProviderID": 1,
    "OperatorID": 3434,
    "UsageTypeID": 4,
    "UsageCost": "•AC: 1.39₪ per KW, •DC: 2₪ per KW",
    "AddressInfo": {
        "ID": 185940,
        "Title": "מתחם הורדוס באר-שבע",
        "AddressLine1": "הנגרים 12 באר שבע",
        "Town": "באר שבע",
        "CountryID": 111,
        "Latitude": 31.244499132116616,
        "Longitude": 34.80456068917306,
        "DistanceUnit": 0
    },
    "Connections": [
        {
            "ID": 295215,
            "ConnectionTypeID": 33,
            "StatusTypeID": 50,
            "LevelID": 3,
            "PowerKW": 50,
            "CurrentTypeID": 30,
            "Quantity": 1
        },
        {
            "ID": 295216,
            "ConnectionTypeID": 2,
            "StatusTypeID": 50,
            "LevelID": 2,
            "PowerKW": 64,
            "Quantity": 1
        },
        {
            "ID": 295217,
            "ConnectionTypeID": 25,
            "StatusTypeID": 50,
            "LevelID": 2,
            "PowerKW": 22,
            "CurrentTypeID": 20,
            "Quantity": 1
        }
    ],
    "NumberOfPoints": 1,
    "StatusTypeID": 50,
    "DateLastStatusUpdate": "2021-08-13T11:24:00Z",
    "DataQualityLevel": 1,
    "DateCreated": "2021-07-11T20:49:00Z",
    "SubmissionStatusTypeID": 200
}