{
    "IsRecentlyVerified": false,
    "ID": 145206,
    "UUID": "78B9E00E-9FB8-4817-894B-66A522975037",
    "DataProviderID": 2,
    "DataProvidersReference": "129911",
    "OperatorID": 89,
    "UsageTypeID": 1,
    "AddressInfo": {
        "ID": 145558,
        "Title": "Pneu Ratté 1",
        "AddressLine1": "437 Boulevard Armand-Paris",
        "Town": "Québec",
        "StateOrProvince": "QC",
        "Postcode": "G1C 7R3",
        "CountryID": 44,
        "Latitude": 46.881899,
        "Longitude": -71.184919,
        "ContactTelephone1": "888-356-8911",
        "AccessComments": "24 hours daily",
        "RelatedURL": "https://flo.ca/",
        "DistanceUnit": 0
    },
    "Connections": [
        {
            "ID": 201821,
            "ConnectionTypeID": 1,
            "LevelID": 2,
            "Amps": 16,
            "Voltage": 230,
            "PowerKW": 3.7,
            "CurrentTypeID": 10,
            "Quantity": 1
        }
    ],
    "StatusTypeID": 50,
    "DateLastStatusUpdate": "2020-06-26T03:10:00Z",
    "DataQualityLevel": 3,
    "DateCreated": "2019-12-24T09:24:00Z",
    "SubmissionStatusTypeID": 100
}