{
    "IsRecentlyVerified": false,
    "ID": 136926,
    "UUID": "58649E05-ADAF-46CF-BEDB-FF8D61C97998",
    "DataProviderID": 18,
    "DataProvidersReference": "3ef430bcac19166ddf205dd8cdf4edca",
    "OperatorID": 20,
    "UsageTypeID": 4,
    "AddressInfo": {
        "ID": 137272,
        "Title": "Bardon Mill",
        "AddressLine1": "Once Brewed Visitor Centre",
        "AddressLine2": "Bardon Mill",
        "Town": "Hexham",
        "Postcode": "NE47 7AN",
        "CountryID": 1,
        "Latitude": 54.995676,
        "Longitude": -2.387882,
        "AccessComments": "Once Brewed Visitor Centre",
        "RelatedURL": "http://www.chargeyourcar.org.uk",
        "DistanceUnit": 0
    },
    "Connections": [
        {
            "ID": 191624,
            "ConnectionTypeID": 3,
            "Reference": "0",
            "StatusTypeID": 50,
            "LevelID": 2,
            "Amps": 13,
            "Voltage": 230,
            "PowerKW": 3,
            "CurrentTypeID": 10
        }
    ],
    "StatusTypeID": 0,
    "DateLastStatusUpdate": "2019-12-24T05:23:00Z",
    "MetadataValues": [
        {
            "ID": 6778,
            "MetadataFieldID": 4,
            "ItemValue": "Contains public sector information licensed under the Open Government Licence v2.0. http://www.nationalarchives.gov.uk/doc/open-government-licence/version/2/"
        }
    ],
    "DataQualityLevel": 3,
    "DateCreated": "2019-12-24T05:23:00Z",
    "SubmissionStatusTypeID": 100
}