{
    "IsRecentlyVerified": false,
    "ID": 187458,
    "UUID": "EB2A3E9D-5EF8-4714-9214-759CD028B181",
    "DataProviderID": 18,
    "DataProvidersReference": "787287629d12a1ec5c5f91f89c3c7c71",
    "OperatorID": 2244,
    "UsageTypeID": 5,
    "AddressInfo": {
        "ID": 187817,
        "Title": "23 Southdean Gardens",
        "AddressLine1": "23 Southdean Gardens",
        "Town": "London",
        "Postcode": "SW19 6NT",
        "CountryID": 1,
        "Latitude": -0.208239,
        "Longitude": 51.441589,
        "AccessComments": "",
        "RelatedURL": "https://www.ubitricity.com",
        "DistanceUnit": 0
    },
    "Connections": [
        {
            "ID": 302592,
            "ConnectionTypeID": 25,
            "Reference": "suby1100005176",
            "StatusTypeID": 50,
            "LevelID": 2,
            "Amps": 16,
            "Voltage": 230,
            "PowerKW": 3.7,
            "CurrentTypeID": 10
        }
    ],
    "StatusTypeID": 0,
    "DateLastStatusUpdate": "2021-07-12T03:38:00Z",
    "MetadataValues": [
        {
            "ID": 19698,
            "MetadataFieldID": 4,
            "ItemValue": "Contains public sector information licensed under the Open Government Licence v2.0. http://www.nationalarchives.gov.uk/doc/open-government-licence/version/2/"
        }
    ],
    "DataQualityLevel": 3,
    "DateCreated": "2021-07-12T03:38:00Z",
    "SubmissionStatusTypeID": 100
}