{
    "IsRecentlyVerified": false,
    "ID": 79495,
    "UUID": "83D64804-C123-431E-A949-CD80C280F632",
    "DataProviderID": 1,
    "OperatorID": 23,
    "OperatorsReference": "6901",
    "UsageTypeID": 6,
    "UsageCost": "Free",
    "AddressInfo": {
        "ID": 79841,
        "Title": "Four Seasons Hotel Atlanta",
        "AddressLine1": "75 14th St Ne",
        "Town": "Atlanta",
        "StateOrProvince": "GA",
        "Postcode": "30309",
        "CountryID": 2,
        "Latitude": 33.786647,
        "Longitude": -84.385533,
        "ContactTelephone1": "(404) 881-9898",
        "DistanceUnit": 0
    },
    "Connections": [
        {
            "ID": 114134,
            "ConnectionTypeID": 30,
            "StatusTypeID": 50,
            "LevelID": 2,
            "PowerKW": 16,
            "CurrentTypeID": 20,
            "Quantity": 1
        }
    ],
    "NumberOfPoints": 1,
    "GeneralComments": "1 Tesla Connector, up to 16kW.Available for patrons only. Please see valet.",
    "StatusTypeID": 50,
    "DateLastStatusUpdate": "2017-01-29T17:31:00Z",
    "DataQualityLevel": 1,
    "DateCreated": "2017-01-29T17:31:00Z",
    "SubmissionStatusTypeID": 200
}