{
    "UserComments": [
        {
            "ID": 19577,
            "ChargePointID": 11701,
            "CommentTypeID": 10,
            "UserName": "Squire330",
            "Comment": "Heritage Chevrolet has two charging station availabile to the public - a Level 2 and a CCS. I have used both in the last month. ",
            "Rating": 5,
            "DateCreated": "2018-05-25T02:16:17.68Z",
            "User": {
                "ID": 18052,
                "Username": "Squire330"
            },
            "CheckinStatusTypeID": 10
        },
        {
            "ID": 19222,
            "ChargePointID": 11701,
            "CommentTypeID": 10,
            "UserName": "Squire330",
            "Comment": "Heritage Chevrolet. Easy access to both level 2 and DC charger. No cost. ",
            "Rating": 5,
            "DateCreated": "2018-02-22T12:53:19.793Z",
            "User": {
                "ID": 18052,
                "Username": "Squire330"
            },
            "CheckinStatusTypeID": 10
        }
    ],
    "IsRecentlyVerified": false,
    "ID": 11701,
    "UUID": "D7A8D181-8E95-4BA9-A518-363FDF361BCD",
    "DataProviderID": 1,
    "OperatorID": 1,
    "UsageTypeID": 1,
    "AddressInfo": {
        "ID": 11598,
        "Title": "12420 Jefferson Davis Hwy",
        "AddressLine1": "12420 Jefferson Davis Hwy",
        "Town": "Chester",
        "CountryID": 2,
        "Latitude": 37.355664638951595,
        "Longitude": -77.41462311084825,
        "RelatedURL": "http://carstations.com/18821",
        "DistanceUnit": 0
    },
    "Connections": [
        {
            "ID": 9042,
            "ConnectionTypeID": 1,
            "Reference": "J1772",
            "LevelID": 2
        },
        {
            "ID": 219296,
            "ConnectionTypeID": 32,
            "StatusTypeID": 50,
            "LevelID": 3,
            "Amps": 50,
            "Voltage": 400,
            "PowerKW": 22,
            "CurrentTypeID": 30,
            "Quantity": 1
        }
    ],
    "NumberOfPoints": 2,
    "StatusTypeID": 0,
    "DateLastStatusUpdate": "2020-07-24T07:58:00Z",
    "DataQualityLevel": 2,
    "DateCreated": "2012-06-14T21:30:00Z",
    "SubmissionStatusTypeID": 100
}