{
    "IsRecentlyVerified": false,
    "ID": 138246,
    "UUID": "E471B031-5240-40D0-B862-124E1CA6DC1A",
    "DataProviderID": 2,
    "DataProvidersReference": "149597",
    "OperatorID": 59,
    "UsageTypeID": 1,
    "AddressInfo": {
        "ID": 138595,
        "Title": "Greenlots - 162250",
        "AddressLine1": "6801 Sunset Way",
        "Town": "St Pete Beach",
        "StateOrProvince": "FL",
        "Postcode": "33706",
        "CountryID": 2,
        "Latitude": 27.737141,
        "Longitude": -82.750053,
        "ContactTelephone1": "855-900-7584",
        "AccessComments": "24 hours daily",
        "RelatedURL": "http://greenlots.com/",
        "DistanceUnit": 0
    },
    "Connections": [
        {
            "ID": 193320,
            "ConnectionTypeID": 1,
            "LevelID": 2,
            "Amps": 16,
            "Voltage": 230,
            "PowerKW": 3.7,
            "CurrentTypeID": 10,
            "Quantity": 4
        }
    ],
    "StatusTypeID": 50,
    "DateLastStatusUpdate": "2020-06-26T02:52:00Z",
    "DataQualityLevel": 3,
    "DateCreated": "2019-12-24T09:08:00Z",
    "SubmissionStatusTypeID": 100
}