{
    "IsRecentlyVerified": false,
    "ID": 152738,
    "UUID": "C6CDEA44-AD11-42F6-B1C5-ABE22D75F763",
    "DataProviderID": 28,
    "DataProvidersReference": "FR*S49*P49278*001",
    "UsageTypeID": 5,
    "AddressInfo": {
        "ID": 153091,
        "Title": "SAINTE GEMMES SUR LOIRE - Place De La Mairie",
        "AddressLine1": "Place De La Mairie 49130 SAINTE GEMMES SUR LOIRE",
        "CountryID": 80,
        "Latitude": 47.422724,
        "Longitude": -0.55671,
        "AccessComments": "24h/24 7j/7",
        "DistanceUnit": 0
    },
    "Connections": [
        {
            "ID": 213953,
            "ConnectionTypeID": 25,
            "StatusTypeID": 50,
            "LevelID": 2,
            "PowerKW": 18,
            "CurrentTypeID": 20
        },
        {
            "ID": 213954,
            "ConnectionTypeID": 28,
            "StatusTypeID": 50,
            "LevelID": 2,
            "PowerKW": 18,
            "CurrentTypeID": 10
        },
        {
            "ID": 247140,
            "ConnectionTypeID": 25,
            "StatusTypeID": 50,
            "LevelID": 2,
            "PowerKW": 18,
            "CurrentTypeID": 20
        },
        {
            "ID": 247141,
            "ConnectionTypeID": 28,
            "StatusTypeID": 50,
            "LevelID": 2,
            "PowerKW": 18,
            "CurrentTypeID": 10
        }
    ],
    "GeneralComments": "Recharge par badge et avec une application smartphone",
    "StatusTypeID": 50,
    "DateLastStatusUpdate": "2020-08-27T05:13:00Z",
    "DataQualityLevel": 2,
    "DateCreated": "2020-03-15T10:54:00Z",
    "SubmissionStatusTypeID": 100
}