{
    "IsRecentlyVerified": false,
    "ID": 167367,
    "UUID": "FF0DF754-BE8C-4C0E-A1F1-D3FA98D9470F",
    "DataProviderID": 18,
    "DataProvidersReference": "359513286e98511b129e2c6b20ce8580",
    "OperatorID": 25,
    "UsageTypeID": 4,
    "AddressInfo": {
        "ID": 167726,
        "Title": "Arthur Road os 168 (Site 2)",
        "AddressLine1": "Arthur Road os 168 (Site 2)",
        "Town": "Merton",
        "Postcode": "SW19 8AQ",
        "CountryID": 1,
        "Latitude": 51.434983,
        "Longitude": -0.197257,
        "AccessComments": "",
        "RelatedURL": "https://www.sourcelondon.net",
        "DistanceUnit": 0
    },
    "Connections": [
        {
            "ID": 253470,
            "ConnectionTypeID": 25,
            "Reference": "1",
            "StatusTypeID": 50,
            "LevelID": 2,
            "Amps": 32,
            "Voltage": 230,
            "PowerKW": 7,
            "CurrentTypeID": 10
        },
        {
            "ID": 253471,
            "ConnectionTypeID": 25,
            "Reference": "2",
            "StatusTypeID": 50,
            "LevelID": 2,
            "Amps": 32,
            "Voltage": 230,
            "PowerKW": 7,
            "CurrentTypeID": 10
        },
        {
            "ID": 253472,
            "ConnectionTypeID": 25,
            "Reference": "3",
            "StatusTypeID": 50,
            "LevelID": 2,
            "Amps": 32,
            "Voltage": 230,
            "PowerKW": 7,
            "CurrentTypeID": 10
        }
    ],
    "StatusTypeID": 0,
    "DateLastStatusUpdate": "2020-09-08T02:47:00Z",
    "MetadataValues": [
        {
            "ID": 7908,
            "MetadataFieldID": 4,
            "ItemValue": "Contains public sector information licensed under the Open Government Licence v2.0. http://www.nationalarchives.gov.uk/doc/open-government-licence/version/2/"
        }
    ],
    "DataQualityLevel": 3,
    "DateCreated": "2020-09-08T02:47:00Z",
    "SubmissionStatusTypeID": 100
}