{
    "IsRecentlyVerified": false,
    "ID": 153991,
    "UUID": "9CD45C4E-B98D-46D5-914A-893031C51F14",
    "DataProviderID": 28,
    "DataProvidersReference": "FR*S77*P77512A",
    "OperatorID": 3413,
    "UsageTypeID": 5,
    "AddressInfo": {
        "ID": 154344,
        "Title": "Villeneuve-sur-Bellot",
        "AddressLine1": "rue du Pont",
        "CountryID": 80,
        "Latitude": 48.861053,
        "Longitude": 3.3430211,
        "AccessComments": "",
        "DistanceUnit": 0
    },
    "Connections": [
        {
            "ID": 216361,
            "ConnectionTypeID": 28,
            "StatusTypeID": 50,
            "LevelID": 2,
            "PowerKW": 18,
            "CurrentTypeID": 10
        },
        {
            "ID": 216362,
            "ConnectionTypeID": 25,
            "StatusTypeID": 50,
            "LevelID": 2,
            "PowerKW": 18,
            "CurrentTypeID": 20
        },
        {
            "ID": 250511,
            "ConnectionTypeID": 28,
            "StatusTypeID": 50,
            "LevelID": 2,
            "PowerKW": 18,
            "CurrentTypeID": 10
        },
        {
            "ID": 250512,
            "ConnectionTypeID": 25,
            "StatusTypeID": 50,
            "LevelID": 2,
            "PowerKW": 18,
            "CurrentTypeID": 20
        }
    ],
    "GeneralComments": "badge, appli et QR code",
    "StatusTypeID": 50,
    "DateLastStatusUpdate": "2020-08-27T05:15:00Z",
    "DataQualityLevel": 2,
    "DateCreated": "2020-03-15T10:54:00Z",
    "SubmissionStatusTypeID": 100
}