{
    "IsRecentlyVerified": false,
    "ID": 36572,
    "UUID": "6523D035-CDC9-4690-A7AA-56D5D2B12969",
    "DataProviderID": 26,
    "DataProvidersReference": "47385",
    "OperatorID": 178,
    "OperatorsReference": "EVnetNL AL543",
    "UsageCost": "0.00 jaarabonnement",
    "AddressInfo": {
        "ID": 36918,
        "Title": "Noordplein 93",
        "AddressLine1": "Noordplein 93",
        "Town": "Kaag en Braassem",
        "Postcode": "2371 DJ",
        "CountryID": 159,
        "Latitude": 52.201365,
        "Longitude": 4.633245,
        "ContactTelephone1": "0800-3522365",
        "RelatedURL": "http://www.evnet.nl",
        "DistanceUnit": 0
    },
    "Connections": [
        {
            "ID": 40083,
            "ConnectionTypeID": 25,
            "LevelID": 2,
            "PowerKW": 11,
            "CurrentTypeID": 10
        }
    ],
    "NumberOfPoints": 2,
    "StatusTypeID": 50,
    "DateLastStatusUpdate": "2016-06-04T02:51:00Z",
    "DataQualityLevel": 3,
    "DateCreated": "2015-01-09T06:05:00Z",
    "SubmissionStatusTypeID": 100
}