{
    "IsRecentlyVerified": false,
    "ID": 9776,
    "UUID": "372DA26A-8965-46D0-A763-E786E6E64A76",
    "DataProviderID": 15,
    "DataProvidersReference": "16570",
    "OperatorID": 1,
    "AddressInfo": {
        "ID": 9673,
        "Title": "859 NE Northgate Way",
        "AddressLine1": "859 NE Northgate Way",
        "Town": "Seattle",
        "StateOrProvince": "WA",
        "Postcode": "98125",
        "CountryID": 2,
        "Latitude": 47.70818,
        "Longitude": -122.318251,
        "ContactTelephone1": "(206) 417-0520",
        "RelatedURL": "http://carstations.com/16570",
        "DistanceUnit": 0
    },
    "Connections": [
        {
            "ID": 7583,
            "ConnectionTypeID": 1,
            "Reference": "J1772",
            "LevelID": 2
        }
    ],
    "StatusTypeID": 0,
    "DateLastStatusUpdate": "2017-11-04T14:05:00Z",
    "DataQualityLevel": 2,
    "DateCreated": "2012-04-16T15:47:00Z",
    "SubmissionStatusTypeID": 100
}