{
    "IsRecentlyVerified": false,
    "ID": 34390,
    "UUID": "4F352CCB-0B11-429F-8625-211BE32FE438",
    "DataProviderID": 26,
    "DataProvidersReference": "47556",
    "OperatorID": 178,
    "OperatorsReference": "EVnetNL AL707",
    "UsageCost": "0.00 jaarabonnement",
    "AddressInfo": {
        "ID": 34736,
        "Title": "Heemraadssingel 267",
        "AddressLine1": "Heemraadssingel 267",
        "Town": "Rotterdam",
        "Postcode": "3023 BE",
        "CountryID": 159,
        "Latitude": 51.912169,
        "Longitude": 4.455523,
        "ContactTelephone1": "0800-3522365",
        "RelatedURL": "http://www.evnet.nl",
        "DistanceUnit": 0
    },
    "Connections": [
        {
            "ID": 37901,
            "ConnectionTypeID": 25,
            "LevelID": 2,
            "PowerKW": 11,
            "CurrentTypeID": 10
        }
    ],
    "NumberOfPoints": 2,
    "StatusTypeID": 50,
    "DateLastStatusUpdate": "2016-06-04T02:42:00Z",
    "DataQualityLevel": 3,
    "DateCreated": "2015-01-09T06:04:00Z",
    "SubmissionStatusTypeID": 100
}