{
    "IsRecentlyVerified": false,
    "ID": 85775,
    "UUID": "8466C761-B378-4C39-8B90-C780B171AE9F",
    "DataProviderID": 1,
    "OperatorID": 3,
    "OperatorsReference": "PG-91080,PG-91712",
    "UsageTypeID": 6,
    "UsageCost": "Free",
    "AddressInfo": {
        "ID": 86121,
        "Title": "Nurture Landscapes LTD",
        "AddressLine1": "Nursery Court",
        "Town": "Windlesham",
        "Postcode": "GU20 6LQ",
        "CountryID": 1,
        "Latitude": 51.386743,
        "Longitude": -0.653616,
        "DistanceUnit": 0
    },
    "Connections": [
        {
            "ID": 121928,
            "ConnectionTypeID": 25,
            "StatusTypeID": 50,
            "LevelID": 2,
            "Amps": 32,
            "Voltage": 230,
            "PowerKW": 7,
            "CurrentTypeID": 10,
            "Quantity": 2
        }
    ],
    "NumberOfPoints": 3,
    "GeneralComments": "This is an open charge unit installed at the Nurture Landscapes Ltd office in Nursery Court, London Road, Windlesham",
    "StatusTypeID": 50,
    "DateLastStatusUpdate": "2017-12-22T06:32:00Z",
    "DataQualityLevel": 1,
    "DateCreated": "2017-04-15T10:09:00Z",
    "SubmissionStatusTypeID": 200
}