{
    "IsRecentlyVerified": false,
    "ID": 177415,
    "UUID": "EF32ED31-9BC9-4129-B912-8C282E44C01B",
    "DataProviderID": 29,
    "DataProvidersReference": "5149",
    "OperatorID": 140,
    "AddressInfo": {
        "ID": 177774,
        "Title": "Hauptstraße 32",
        "AddressLine1": "Hauptstraße 32",
        "Town": "Knüllwald Remsfeld",
        "Postcode": "34593",
        "CountryID": 87,
        "Latitude": 51.0066186,
        "Longitude": 9.47337,
        "DistanceUnit": 0
    },
    "Connections": [
        {
            "ID": 276530,
            "ConnectionTypeID": 25,
            "StatusTypeID": 50,
            "LevelID": 2,
            "PowerKW": 22,
            "CurrentTypeID": 20
        },
        {
            "ID": 276531,
            "ConnectionTypeID": 25,
            "StatusTypeID": 50,
            "LevelID": 2,
            "PowerKW": 22,
            "CurrentTypeID": 20
        }
    ],
    "StatusTypeID": 0,
    "DateLastStatusUpdate": "2021-07-12T02:46:00Z",
    "MetadataValues": [
        {
            "ID": 9709,
            "MetadataFieldID": 4,
            "ItemValue": "Data from the German chargepoint registry provided by Bundesnetzagentur.de under the CC-BY 4.0 license"
        }
    ],
    "DataQualityLevel": 3,
    "DateCreated": "2021-07-08T09:49:00Z",
    "SubmissionStatusTypeID": 100
}