{
    "IsRecentlyVerified": false,
    "ID": 134832,
    "UUID": "AE923843-453A-433D-84AE-A1ACEE8810AD",
    "DataProviderID": 1,
    "OperatorID": 3378,
    "UsageTypeID": 5,
    "AddressInfo": {
        "ID": 135178,
        "Title": "MOL - Logatec",
        "AddressLine1": "Tržaška cesta 74A",
        "Town": "Logatec",
        "StateOrProvince": "Upravna Enota Logatec",
        "Postcode": "1370",
        "CountryID": 205,
        "Latitude": 45.916708,
        "Longitude": 14.218883,
        "AccessComments": "https://www.plugshare.com/location/172732",
        "RelatedURL": "https://molplugee.si/en",
        "DistanceUnit": 0
    },
    "Connections": [
        {
            "ID": 188621,
            "ConnectionTypeID": 33,
            "StatusTypeID": 50,
            "LevelID": 3,
            "PowerKW": 50,
            "CurrentTypeID": 30,
            "Quantity": 1
        },
        {
            "ID": 188622,
            "ConnectionTypeID": 2,
            "StatusTypeID": 50,
            "LevelID": 3,
            "PowerKW": 50,
            "CurrentTypeID": 30,
            "Quantity": 1
        },
        {
            "ID": 188623,
            "ConnectionTypeID": 1036,
            "StatusTypeID": 50,
            "LevelID": 3,
            "PowerKW": 43,
            "CurrentTypeID": 20,
            "Quantity": 1
        }
    ],
    "NumberOfPoints": 1,
    "GeneralComments": "1x50kW CHAdeMO\r\n1x50kW CCS\r\n1x43kW Type2\r\nDC polnjenje: 7,90€ / seja\r\nAC polnjenje: 5,90€ / seja",
    "StatusTypeID": 50,
    "DateLastStatusUpdate": "2019-11-24T19:55:00Z",
    "DataQualityLevel": 1,
    "DateCreated": "2019-11-24T18:08:00Z",
    "SubmissionStatusTypeID": 200
}