{
    "IsRecentlyVerified": false,
    "ID": 3598,
    "UUID": "1502D197-B85B-463A-B145-9E82EA17F8DC",
    "DataProviderID": 1,
    "OperatorID": 5,
    "UsageTypeID": 1,
    "AddressInfo": {
        "ID": 3599,
        "Title": "Spinx",
        "AddressLine1": "507 Bypass 123",
        "Town": "Seneca",
        "StateOrProvince": "SC",
        "Postcode": "29678",
        "CountryID": 2,
        "Latitude": 34.69649506,
        "Longitude": -82.95207977,
        "ContactTelephone1": "888-758-4389",
        "DistanceUnit": 0
    },
    "Connections": [
        {
            "ID": 113,
            "ConnectionTypeID": 1,
            "Quantity": 1
        }
    ],
    "NumberOfPoints": 1,
    "DateLastStatusUpdate": "2019-12-15T06:07:00Z",
    "DateCreated": "2010-02-28T00:00:00Z",
    "SubmissionStatusTypeID": 200
}