{
    "IsRecentlyVerified": false,
    "ID": 176108,
    "UUID": "7DA80ECF-AD18-4FF2-90AB-30931E4C3AAD",
    "DataProviderID": 1,
    "OperatorID": 45,
    "UsageTypeID": 1,
    "UsageCost": "Free",
    "AddressInfo": {
        "ID": 176467,
        "Title": "Parcare Sala Sporturilor",
        "AddressLine1": "Strada Sarmizegetusa",
        "Town": "Constanța",
        "StateOrProvince": "Constanța",
        "Postcode": "900592",
        "CountryID": 184,
        "Latitude": 44.182018264945555,
        "Longitude": 28.648904638446993,
        "DistanceUnit": 0
    },
    "Connections": [
        {
            "ID": 273616,
            "ConnectionTypeID": 25,
            "StatusTypeID": 50,
            "LevelID": 2,
            "PowerKW": 7.2,
            "CurrentTypeID": 10,
            "Quantity": 2
        }
    ],
    "NumberOfPoints": 2,
    "StatusTypeID": 50,
    "DateLastStatusUpdate": "2021-06-25T14:18:00Z",
    "DataQualityLevel": 1,
    "DateCreated": "2021-06-25T14:18:00Z",
    "SubmissionStatusTypeID": 200
}