{
    "IsRecentlyVerified": false,
    "ID": 123835,
    "UUID": "7C4A250E-C67F-4014-9693-F218CEFB52FC",
    "DataProviderID": 2,
    "DataProvidersReference": "89043",
    "UsageTypeID": 1,
    "AddressInfo": {
        "ID": 124181,
        "Title": "Ramada - Sunnyvale",
        "AddressLine1": "1217 Wildwood Ave",
        "Town": "Sunnyvale",
        "StateOrProvince": "CA",
        "Postcode": "94089",
        "CountryID": 2,
        "Latitude": 37.391317,
        "Longitude": -121.99221,
        "ContactTelephone1": "408-738-7473",
        "AccessComments": "24 hours daily",
        "RelatedURL": "",
        "DistanceUnit": 0
    },
    "Connections": [
        {
            "ID": 173866,
            "ConnectionTypeID": 1,
            "LevelID": 2,
            "Amps": 16,
            "Voltage": 230,
            "PowerKW": 3.7,
            "CurrentTypeID": 10,
            "Quantity": 3
        }
    ],
    "DateLastStatusUpdate": "2020-06-26T02:59:00Z",
    "DataQualityLevel": 3,
    "DateCreated": "2019-04-06T05:03:00Z",
    "SubmissionStatusTypeID": 100
}