{
    "IsRecentlyVerified": false,
    "ID": 121338,
    "UUID": "FD5CC9B4-5695-4545-86EC-1654F51A8A1A",
    "DataProviderID": 2,
    "DataProvidersReference": "120897",
    "OperatorID": 5,
    "UsageTypeID": 1,
    "AddressInfo": {
        "ID": 121684,
        "Title": "WENDYSQSR",
        "AddressLine1": "47 Redcastle Crescent",
        "Town": "Georgina",
        "StateOrProvince": "ON",
        "Postcode": "L4P 3M2",
        "CountryID": 44,
        "Latitude": 44.2242321,
        "Longitude": -79.4463197,
        "ContactTelephone1": "888-758-4389",
        "AccessComments": "24 hours daily",
        "RelatedURL": "http://www.chargepoint.com/",
        "DistanceUnit": 0
    },
    "Connections": [
        {
            "ID": 170784,
            "ConnectionTypeID": 1,
            "LevelID": 2,
            "Amps": 16,
            "Voltage": 230,
            "PowerKW": 3.7,
            "CurrentTypeID": 10,
            "Quantity": 2
        }
    ],
    "DateLastStatusUpdate": "2020-06-26T03:07:00Z",
    "DataQualityLevel": 3,
    "DateCreated": "2019-04-01T05:00:00Z",
    "SubmissionStatusTypeID": 100
}