{
    "IsRecentlyVerified": false,
    "ID": 179050,
    "UUID": "D9F9CB30-B422-49A4-BD82-2AE6892E7CF7",
    "DataProviderID": 29,
    "DataProvidersReference": "793",
    "AddressInfo": {
        "ID": 179409,
        "Title": "Ludwig-van-Beethoven-Str. 2",
        "AddressLine1": "Ludwig-van-Beethoven-Str. 2",
        "Town": "Schönwald",
        "Postcode": "78141",
        "CountryID": 87,
        "Latitude": 48.099795,
        "Longitude": 8.200106,
        "DistanceUnit": 0
    },
    "Connections": [
        {
            "ID": 280297,
            "ConnectionTypeID": 25,
            "StatusTypeID": 50,
            "LevelID": 2,
            "PowerKW": 22,
            "CurrentTypeID": 20
        },
        {
            "ID": 280298,
            "ConnectionTypeID": 25,
            "StatusTypeID": 50,
            "LevelID": 2,
            "PowerKW": 22,
            "CurrentTypeID": 20
        }
    ],
    "StatusTypeID": 50,
    "DateLastStatusUpdate": "2021-07-12T02:40:00Z",
    "MetadataValues": [
        {
            "ID": 11344,
            "MetadataFieldID": 4,
            "ItemValue": "Data from the German chargepoint registry provided by Bundesnetzagentur.de under the CC-BY 4.0 license"
        }
    ],
    "DataQualityLevel": 3,
    "DateCreated": "2021-07-08T09:59:00Z",
    "SubmissionStatusTypeID": 100
}