{
    "IsRecentlyVerified": false,
    "ID": 70629,
    "UUID": "7FFA991E-1C8B-4F21-9340-22BD61FA38CB",
    "DataProviderID": 1,
    "OperatorID": 45,
    "UsageTypeID": 1,
    "AddressInfo": {
        "ID": 70975,
        "Title": "Terms Planá",
        "AddressLine1": "Planá 67",
        "Town": "Planá",
        "Postcode": "370 01",
        "CountryID": 64,
        "Latitude": 48.94215546998716,
        "Longitude": 14.451361304754622,
        "ContactTelephone1": "+420777809835",
        "ContactEmail": "terms@terms.eu",
        "RelatedURL": "http://www.terms.eu/",
        "DistanceUnit": 0
    },
    "Connections": [
        {
            "ID": 101119,
            "ConnectionTypeID": 25,
            "StatusTypeID": 50,
            "LevelID": 2,
            "PowerKW": 22,
            "CurrentTypeID": 20
        }
    ],
    "NumberOfPoints": 1,
    "StatusTypeID": 50,
    "DateLastStatusUpdate": "2016-07-31T08:28:00Z",
    "DataQualityLevel": 1,
    "DateCreated": "2016-07-31T08:28:00Z",
    "SubmissionStatusTypeID": 200
}