{
    "IsRecentlyVerified": false,
    "ID": 174851,
    "UUID": "38520040-C237-4AB0-86D8-9526FABE36B7",
    "DataProviderID": 1,
    "OperatorID": 3295,
    "OperatorsReference": "UKEV1088..UKEV1101",
    "UsageTypeID": 6,
    "UsageCost": "£0.30/kWh",
    "AddressInfo": {
        "ID": 175210,
        "Title": "National Trust Headquarters (Heelis)",
        "AddressLine1": "Kemble Drive",
        "AddressLine2": "Rodbourne",
        "Town": "Swindon",
        "StateOrProvince": "Swindon",
        "Postcode": "SN2 2NA",
        "CountryID": 1,
        "Latitude": 51.56420951802539,
        "Longitude": -1.7972215728939318,
        "DistanceUnit": 0
    },
    "Connections": [
        {
            "ID": 270938,
            "ConnectionTypeID": 25,
            "StatusTypeID": 75,
            "LevelID": 2,
            "Amps": 32,
            "Voltage": 230,
            "PowerKW": 7.2,
            "CurrentTypeID": 10,
            "Quantity": 14
        }
    ],
    "NumberOfPoints": 14,
    "StatusTypeID": 75,
    "DateLastStatusUpdate": "2021-04-15T19:24:00Z",
    "DataQualityLevel": 1,
    "DateCreated": "2021-04-15T19:21:00Z",
    "SubmissionStatusTypeID": 200
}