{
    "IsRecentlyVerified": false,
    "ID": 176199,
    "UUID": "8691B678-1B40-4C46-BDBB-C45452EF2F28",
    "DataProviderID": 1,
    "OperatorID": 142,
    "UsageTypeID": 1,
    "AddressInfo": {
        "ID": 176558,
        "Title": "Shopping Centre Nord",
        "AddressLine1": "Ignaz-Köck-Straße",
        "Town": "Neujedlersdorf",
        "StateOrProvince": "Vienna",
        "Postcode": "1210",
        "CountryID": 19,
        "Latitude": 48.26741794522218,
        "Longitude": 16.399491207075243,
        "DistanceUnit": 0
    },
    "Connections": [
        {
            "ID": 273824,
            "ConnectionTypeID": 25,
            "StatusTypeID": 50,
            "LevelID": 2,
            "PowerKW": 22,
            "Quantity": 2
        },
        {
            "ID": 273825,
            "ConnectionTypeID": 25,
            "StatusTypeID": 50,
            "LevelID": 2,
            "PowerKW": 11,
            "Quantity": 2
        }
    ],
    "NumberOfPoints": 1,
    "StatusTypeID": 50,
    "DateLastStatusUpdate": "2021-06-30T22:17:00Z",
    "DataQualityLevel": 1,
    "DateCreated": "2021-06-30T15:31:00Z",
    "SubmissionStatusTypeID": 200
}