{
    "IsRecentlyVerified": false,
    "ID": 73189,
    "UUID": "204BD3C1-0698-4690-8170-97ACF968BB37",
    "DataProviderID": 1,
    "OperatorID": 32,
    "OperatorsReference": "3885,3886,4224,4225",
    "UsageTypeID": 4,
    "UsageCost": "Inclusive; for Polar Plus subscription members only. Bus ride mandatory",
    "AddressInfo": {
        "ID": 73535,
        "Title": "Birstall Park & Ride",
        "AddressLine1": "Loughborough Road",
        "AddressLine2": "Birstall",
        "Town": "Leicester",
        "StateOrProvince": "Leicestershire",
        "Postcode": "LE4 4NP",
        "CountryID": 1,
        "Latitude": 52.6881542531737,
        "Longitude": -1.12378325882606,
        "DistanceUnit": 0
    },
    "Connections": [
        {
            "ID": 105262,
            "ConnectionTypeID": 25,
            "StatusTypeID": 50,
            "LevelID": 2,
            "Amps": 32,
            "Voltage": 230,
            "PowerKW": 7,
            "CurrentTypeID": 10,
            "Quantity": 8
        }
    ],
    "NumberOfPoints": 8,
    "StatusTypeID": 50,
    "DateLastStatusUpdate": "2019-03-05T06:25:00Z",
    "DataQualityLevel": 1,
    "DateCreated": "2016-11-12T21:16:00Z",
    "SubmissionStatusTypeID": 200
}