{
    "IsRecentlyVerified": false,
    "ID": 56328,
    "UUID": "3BBE23B5-9D91-4FD5-9F9B-3192DE9FB72A",
    "DataProviderID": 1,
    "OperatorID": 80,
    "UsageTypeID": 4,
    "UsageCost": "0,40 €/kW",
    "AddressInfo": {
        "ID": 56674,
        "Title": "Eneldrive Via di Corte",
        "AddressLine1": "Via Nazario Sauro, 188",
        "AddressLine2": "Latignano",
        "Town": "Cascina",
        "StateOrProvince": "PI",
        "Postcode": "56021",
        "CountryID": 112,
        "Latitude": 43.6623113804178,
        "Longitude": 10.5423919698078,
        "RelatedURL": "http://eneldrive.it",
        "DistanceUnit": 0
    },
    "Connections": [
        {
            "ID": 71050,
            "ConnectionTypeID": 25,
            "StatusTypeID": 50,
            "LevelID": 2,
            "Amps": 32,
            "Voltage": 400,
            "PowerKW": 22,
            "CurrentTypeID": 20,
            "Quantity": 1
        },
        {
            "ID": 71051,
            "ConnectionTypeID": 36,
            "StatusTypeID": 50,
            "LevelID": 2,
            "Amps": 16,
            "Voltage": 240,
            "PowerKW": 3.7,
            "CurrentTypeID": 10,
            "Quantity": 1
        }
    ],
    "NumberOfPoints": 1,
    "StatusTypeID": 50,
    "DateLastStatusUpdate": "2016-06-28T17:17:00Z",
    "DataQualityLevel": 1,
    "DateCreated": "2015-10-29T16:38:00Z",
    "SubmissionStatusTypeID": 200
}