{
    "IsRecentlyVerified": false,
    "ID": 68209,
    "UUID": "1C8DFF9A-EA31-4D3F-8FA3-CCC7C05F0F9D",
    "DataProviderID": 26,
    "DataProvidersReference": "91150",
    "OperatorID": 177,
    "OperatorsReference": "Nuon EVB-P1542135",
    "UsageCost": "0.00 jaarabonnement",
    "AddressInfo": {
        "ID": 68555,
        "Title": "Tourniairestraat 1",
        "AddressLine1": "Tourniairestraat 1",
        "Town": "Amsterdam",
        "Postcode": "1065 KK",
        "CountryID": 159,
        "Latitude": 52.355798,
        "Longitude": 4.824988,
        "RelatedURL": "http://www.nuon.nl/ev",
        "DistanceUnit": 0
    },
    "Connections": [
        {
            "ID": 95060,
            "ConnectionTypeID": 25,
            "LevelID": 2,
            "PowerKW": 11,
            "CurrentTypeID": 10
        },
        {
            "ID": 95061,
            "ConnectionTypeID": 25,
            "LevelID": 2,
            "PowerKW": 11,
            "CurrentTypeID": 10
        }
    ],
    "NumberOfPoints": 1,
    "StatusTypeID": 50,
    "DateLastStatusUpdate": "2016-06-04T02:37:00Z",
    "DataQualityLevel": 3,
    "DateCreated": "2016-06-04T02:37:00Z",
    "SubmissionStatusTypeID": 100
}