{
    "IsRecentlyVerified": false,
    "ID": 173422,
    "UUID": "817EEC65-DD83-4B91-8EFF-C5124701D850",
    "DataProviderID": 18,
    "DataProvidersReference": "3affcbb957032e3cd1c0c3f8526e5de8",
    "OperatorID": 2244,
    "UsageTypeID": 1,
    "AddressInfo": {
        "ID": 173781,
        "Title": "29 Mornington Terrace",
        "AddressLine1": "29 Mornington Terrace",
        "Town": "London",
        "Postcode": "NW1 7RS",
        "CountryID": 1,
        "Latitude": -0.143487,
        "Longitude": 51.535056,
        "AccessComments": "",
        "RelatedURL": "https://www.ubitricity.com",
        "DistanceUnit": 0
    },
    "Connections": [
        {
            "ID": 266447,
            "ConnectionTypeID": 25,
            "Reference": "suby1100005036",
            "StatusTypeID": 50,
            "LevelID": 2,
            "Amps": 16,
            "Voltage": 230,
            "PowerKW": 3.7,
            "CurrentTypeID": 10
        }
    ],
    "StatusTypeID": 0,
    "DateLastStatusUpdate": "2021-07-12T03:38:00Z",
    "MetadataValues": [
        {
            "ID": 8344,
            "MetadataFieldID": 4,
            "ItemValue": "Contains public sector information licensed under the Open Government Licence v2.0. http://www.nationalarchives.gov.uk/doc/open-government-licence/version/2/"
        }
    ],
    "DataQualityLevel": 3,
    "DateCreated": "2021-03-03T11:25:00Z",
    "SubmissionStatusTypeID": 100
}