{
    "MediaItems": [
        {
            "ID": 29242,
            "ChargePointID": 32113,
            "ItemURL": "https://s3-ap-southeast-2.amazonaws.com/openchargemap/images/DE/OCM32113/OCM-32113.orig.2021091218552963.jpg",
            "ItemThumbnailURL": "https://s3-ap-southeast-2.amazonaws.com/openchargemap/images/DE/OCM32113/OCM-32113.thmb.2021091218552963.jpg",
            "Comment": "",
            "IsEnabled": true,
            "IsVideo": false,
            "IsFeaturedItem": false,
            "IsExternalResource": false,
            "User": {
                "ID": 21695,
                "Username": "et42"
            },
            "DateCreated": "2021-09-12T18:56:00Z"
        }
    ],
    "IsRecentlyVerified": false,
    "ID": 32113,
    "UUID": "8C7AB0D2-1D4D-45EA-AA01-4D17C7C741BE",
    "DataProviderID": 1,
    "OperatorID": 105,
    "OperatorsReference": "Essent EM-DE-06434005-01-00001",
    "UsageTypeID": 4,
    "AddressInfo": {
        "ID": 32459,
        "Title": "Rathaus",
        "AddressLine1": "Burgweg 3",
        "Town": "Königstein im Taunus",
        "Postcode": "61462",
        "CountryID": 87,
        "Latitude": 50.18266,
        "Longitude": 8.46463,
        "DistanceUnit": 0
    },
    "Connections": [
        {
            "ID": 35624,
            "ConnectionTypeID": 25,
            "LevelID": 2,
            "PowerKW": 22
        },
        {
            "ID": 46214,
            "ConnectionTypeID": 25,
            "LevelID": 2,
            "PowerKW": 22
        }
    ],
    "NumberOfPoints": 2,
    "GeneralComments": "App required, no RFID reader!",
    "StatusTypeID": 50,
    "DateLastStatusUpdate": "2021-09-12T18:56:00Z",
    "DataQualityLevel": 3,
    "DateCreated": "2015-01-09T06:03:00Z",
    "SubmissionStatusTypeID": 200
}