{
    "IsRecentlyVerified": false,
    "ID": 115823,
    "UUID": "42A47D8A-D9DD-4B14-8DE8-98B30DBAA996",
    "DataProviderID": 2,
    "DataProvidersReference": "117007",
    "OperatorID": 5,
    "UsageTypeID": 1,
    "AddressInfo": {
        "ID": 116169,
        "Title": "LAZ COLUMBUS OH",
        "AddressLine1": "285 N Front St",
        "Town": "Columbus",
        "StateOrProvince": "OH",
        "Postcode": "43215",
        "CountryID": 2,
        "Latitude": 39.967047,
        "Longitude": -83.004523,
        "ContactTelephone1": "888-758-4389",
        "AccessComments": "24 hours daily",
        "RelatedURL": "http://www.chargepoint.com/",
        "DistanceUnit": 0
    },
    "Connections": [
        {
            "ID": 162864,
            "ConnectionTypeID": 1,
            "LevelID": 2,
            "Amps": 16,
            "Voltage": 230,
            "PowerKW": 3.7,
            "CurrentTypeID": 10,
            "Quantity": 4
        }
    ],
    "DateLastStatusUpdate": "2020-06-26T03:02:00Z",
    "DataQualityLevel": 3,
    "DateCreated": "2019-02-11T07:13:00Z",
    "SubmissionStatusTypeID": 100
}