{
    "IsRecentlyVerified": false,
    "ID": 158495,
    "UUID": "5426AE0A-51C9-4C46-A0A3-2E5029859F19",
    "DataProviderID": 2,
    "DataProvidersReference": "154317",
    "OperatorID": 5,
    "UsageTypeID": 1,
    "AddressInfo": {
        "ID": 158852,
        "Title": "DDC",
        "AddressLine1": "Unnamed Road",
        "Town": "Glendale",
        "StateOrProvince": "AZ",
        "Postcode": "85305",
        "CountryID": 2,
        "Latitude": 33.5488166,
        "Longitude": -112.2628494,
        "ContactTelephone1": "888-758-4389",
        "AccessComments": "24 hours daily",
        "RelatedURL": "http://www.chargepoint.com/",
        "DistanceUnit": 0
    },
    "Connections": [
        {
            "ID": 228483,
            "ConnectionTypeID": 1,
            "LevelID": 2,
            "Amps": 16,
            "Voltage": 230,
            "PowerKW": 3.7,
            "CurrentTypeID": 10,
            "Quantity": 4
        }
    ],
    "StatusTypeID": 50,
    "DateLastStatusUpdate": "2020-06-26T02:55:00Z",
    "DataQualityLevel": 3,
    "DateCreated": "2020-06-26T02:55:00Z",
    "SubmissionStatusTypeID": 100
}