{
    "IsRecentlyVerified": false,
    "ID": 14919,
    "UUID": "3EB023A6-0168-481B-8865-3E200F3E7508",
    "DataProviderID": 1,
    "OperatorID": 22,
    "OperatorsReference": "C95VM",
    "UsageTypeID": 4,
    "UsageCost": "Free",
    "AddressInfo": {
        "ID": 15265,
        "Title": "Macroom Council Car Park",
        "AddressLine1": "Macroom Council Car Park, Fairgreen, Macroom, Co Cork",
        "Town": "Cork",
        "CountryID": 3,
        "Latitude": 51.90491,
        "Longitude": -8.954018,
        "DistanceUnit": 0
    },
    "Connections": [
        {
            "ID": 13321,
            "ConnectionTypeID": 25,
            "StatusTypeID": 50,
            "LevelID": 2,
            "Amps": 32,
            "Voltage": 400,
            "PowerKW": 22,
            "CurrentTypeID": 20,
            "Quantity": 2
        },
        {
            "ID": 26676,
            "ConnectionTypeID": 2,
            "StatusTypeID": 50,
            "LevelID": 3,
            "Amps": 120,
            "Voltage": 500,
            "PowerKW": 50,
            "CurrentTypeID": 30,
            "Quantity": 1
        },
        {
            "ID": 28108,
            "ConnectionTypeID": 33,
            "StatusTypeID": 50,
            "LevelID": 3,
            "Amps": 120,
            "Voltage": 500,
            "PowerKW": 50,
            "CurrentTypeID": 30,
            "Quantity": 1
        },
        {
            "ID": 28109,
            "ConnectionTypeID": 1036,
            "StatusTypeID": 50,
            "LevelID": 3,
            "Voltage": 400,
            "PowerKW": 43,
            "CurrentTypeID": 20,
            "Quantity": 1
        }
    ],
    "NumberOfPoints": 2,
    "GeneralComments": "efacec QC45",
    "StatusTypeID": 50,
    "DateLastStatusUpdate": "2019-06-03T09:37:00Z",
    "DataQualityLevel": 2,
    "DateCreated": "2012-12-11T15:08:00Z",
    "SubmissionStatusTypeID": 100
}