{
    "IsRecentlyVerified": false,
    "ID": 123593,
    "UUID": "895073D9-323F-4849-907A-AB9ADED5C268",
    "DataProviderID": 2,
    "DataProvidersReference": "53952",
    "UsageTypeID": 1,
    "AddressInfo": {
        "ID": 123939,
        "Title": "Marion Automotive Group",
        "AddressLine1": "1025 N Main St",
        "Town": "Marion",
        "StateOrProvince": "VA",
        "Postcode": "24354",
        "CountryID": 2,
        "Latitude": 36.843713,
        "Longitude": -81.503731,
        "ContactTelephone1": "",
        "AccessComments": "Dealership business hours",
        "RelatedURL": "",
        "DistanceUnit": 0
    },
    "Connections": [
        {
            "ID": 173600,
            "ConnectionTypeID": 1,
            "LevelID": 2,
            "Amps": 16,
            "Voltage": 230,
            "PowerKW": 3.7,
            "CurrentTypeID": 10,
            "Quantity": 1
        }
    ],
    "DateLastStatusUpdate": "2020-06-26T02:59:00Z",
    "DataQualityLevel": 3,
    "DateCreated": "2019-04-06T05:03:00Z",
    "SubmissionStatusTypeID": 100
}