{
    "IsRecentlyVerified": false,
    "ID": 131108,
    "UUID": "0AA14AC2-45E6-421B-B465-A46B22A8371E",
    "DataProviderID": 1,
    "OperatorID": 23,
    "OperatorsReference": "28593",
    "UsageTypeID": 4,
    "UsageCost": "$0.26/min >=60kW; $0.13/min <60kW; other tariffs for older cars",
    "AddressInfo": {
        "ID": 131454,
        "Title": "North Stamford, CT Supercharger",
        "AddressLine1": "1145 High Ridge RD",
        "Town": "North Stamford",
        "StateOrProvince": "CT",
        "Postcode": "06905-1215",
        "CountryID": 2,
        "Latitude": 41.107722,
        "Longitude": -73.546669,
        "DistanceUnit": 0
    },
    "Connections": [
        {
            "ID": 183605,
            "ConnectionTypeID": 27,
            "StatusTypeID": 50,
            "LevelID": 3,
            "PowerKW": 120,
            "CurrentTypeID": 30,
            "Quantity": 8
        }
    ],
    "NumberOfPoints": 8,
    "GeneralComments": "Charging8 Superchargers, available 24/7, up to 120kW",
    "StatusTypeID": 50,
    "DateLastStatusUpdate": "2019-08-29T05:37:00Z",
    "DataQualityLevel": 1,
    "DateCreated": "2019-08-29T05:37:00Z",
    "SubmissionStatusTypeID": 200
}