{
    "IsRecentlyVerified": false,
    "ID": 85127,
    "UUID": "090B912C-8A13-4290-B74B-722103FBE211",
    "DataProviderID": 1,
    "OperatorID": 45,
    "UsageTypeID": 1,
    "UsageCost": "free",
    "AddressInfo": {
        "ID": 85473,
        "Title": "Gare Martigny ",
        "AddressLine1": "Rue d'Aoste, 3",
        "Town": "Martigny",
        "StateOrProvince": "Vallese",
        "Postcode": "1920",
        "CountryID": 217,
        "Latitude": 46.1054577690049,
        "Longitude": 7.08011193078846,
        "RelatedURL": "https://sinergy.ch/",
        "DistanceUnit": 0
    },
    "Connections": [
        {
            "ID": 120885,
            "ConnectionTypeID": 1036,
            "StatusTypeID": 50,
            "LevelID": 2,
            "Amps": 32,
            "Voltage": 400,
            "PowerKW": 22,
            "CurrentTypeID": 20,
            "Quantity": 2
        },
        {
            "ID": 120886,
            "ConnectionTypeID": 1,
            "StatusTypeID": 50,
            "LevelID": 2,
            "Amps": 16,
            "Voltage": 240,
            "PowerKW": 3,
            "CurrentTypeID": 10,
            "Quantity": 2
        }
    ],
    "NumberOfPoints": 4,
    "StatusTypeID": 50,
    "DateLastStatusUpdate": "2017-03-26T16:01:00Z",
    "DataQualityLevel": 1,
    "DateCreated": "2017-03-26T14:47:00Z",
    "SubmissionStatusTypeID": 200
}