{
    "IsRecentlyVerified": false,
    "ID": 97741,
    "UUID": "A9B65E96-7C21-46C3-B4AC-0D0A4B3AD6FC",
    "DataProviderID": 1,
    "OperatorID": 23,
    "OperatorsReference": "38705",
    "UsageTypeID": 4,
    "AddressInfo": {
        "ID": 98087,
        "Title": "Hilton Garden Inn Akron/ Canton Airport",
        "AddressLine1": "5251 Landmark BLVD",
        "Town": "North Canton",
        "StateOrProvince": "Ohio",
        "Postcode": "44720",
        "CountryID": 2,
        "Latitude": 40.911037,
        "Longitude": -81.4287081,
        "ContactTelephone1": "(330) 966-4907",
        "DistanceUnit": 0
    },
    "Connections": [
        {
            "ID": 138649,
            "ConnectionTypeID": 30,
            "StatusTypeID": 50,
            "LevelID": 2,
            "PowerKW": 12,
            "CurrentTypeID": 20,
            "Quantity": 2
        }
    ],
    "NumberOfPoints": 2,
    "GeneralComments": "2 Tesla Connectors, up to 12kW.Available for customers. Please see front desk.",
    "StatusTypeID": 50,
    "DateLastStatusUpdate": "2018-01-21T16:32:00Z",
    "DataQualityLevel": 1,
    "DateCreated": "2018-01-21T16:32:00Z",
    "SubmissionStatusTypeID": 200
}