{
    "UserComments": [
        {
            "ID": 577,
            "ChargePointID": 19567,
            "CommentTypeID": 10,
            "UserName": "idealityConsult",
            "Comment": "Great charging point by charge master and connect midlands. 4 spaces and perfect for shopping",
            "DateCreated": "2013-12-15T13:09:43.34Z",
            "User": {
                "ID": 1279,
                "Username": "idealityConsult"
            },
            "CheckinStatusTypeID": 10
        }
    ],
    "IsRecentlyVerified": false,
    "ID": 19567,
    "UUID": "2256A21D-4B4F-4587-91B6-217244CEC74E",
    "DataProviderID": 1,
    "OperatorID": 8,
    "OperatorsReference": "2154,2154",
    "UsageTypeID": 0,
    "AddressInfo": {
        "ID": 19912,
        "Title": "Dover Street Car Park",
        "AddressLine1": "Dover Street Car Park",
        "Town": "Leicester",
        "Postcode": "LE1 6NB",
        "CountryID": 1,
        "Latitude": 52.6311727,
        "Longitude": -1.1282172,
        "DistanceUnit": 0
    },
    "Connections": [
        {
            "ID": 124177,
            "ConnectionTypeID": 25,
            "StatusTypeID": 50,
            "LevelID": 2,
            "Amps": 32,
            "Voltage": 230,
            "PowerKW": 7,
            "CurrentTypeID": 10,
            "Quantity": 4
        }
    ],
    "NumberOfPoints": 4,
    "StatusTypeID": 50,
    "DateLastStatusUpdate": "2017-06-08T15:13:00Z",
    "MetadataValues": [
        {
            "ID": 164,
            "MetadataFieldID": 4,
            "ItemValue": "Data © OpenStreetMap contributors, ODbL 1.0. http://www.openstreetmap.org/copyright"
        }
    ],
    "DataQualityLevel": 1,
    "DateCreated": "2013-10-08T09:51:00Z",
    "SubmissionStatusTypeID": 200
}