{
    "IsRecentlyVerified": false,
    "ID": 5879,
    "UUID": "865D3F13-EBB4-4F1E-B4A4-9639C808FF66",
    "DataProviderID": 1,
    "OperatorID": 1,
    "UsageTypeID": 1,
    "AddressInfo": {
        "ID": 5801,
        "Title": "Van Mall RV Park",
        "Town": "Vancouver",
        "StateOrProvince": "Washington",
        "CountryID": 2,
        "Latitude": 45.6615670009854,
        "Longitude": -122.568626403808,
        "DistanceUnit": 0
    },
    "Connections": [
        {
            "ID": 627,
            "ConnectionTypeID": 11,
            "Quantity": 1
        }
    ],
    "NumberOfPoints": 1,
    "StatusTypeID": 50,
    "DateLastStatusUpdate": "2010-11-28T00:00:00Z",
    "DateCreated": "2011-09-13T12:41:00Z",
    "SubmissionStatusTypeID": 200
}