{
    "IsRecentlyVerified": false,
    "ID": 61307,
    "UUID": "BEF13215-39B4-4EC9-B82E-C22294A3138F",
    "DataProviderID": 1,
    "OperatorID": 3,
    "OperatorsReference": "PG-80110,PG-80548",
    "UsageTypeID": 6,
    "UsageCost": "Free",
    "AddressInfo": {
        "ID": 61653,
        "Title": "Rigid Containers Desborough Plant",
        "AddressLine1": "Stoke Road",
        "Town": "Desborough",
        "StateOrProvince": "Northamptonshire",
        "Postcode": "NN14 2SR",
        "CountryID": 1,
        "Latitude": 52.453079,
        "Longitude": -0.824634500000002,
        "DistanceUnit": 0
    },
    "Connections": [
        {
            "ID": 78069,
            "ConnectionTypeID": 25,
            "StatusTypeID": 50,
            "LevelID": 2,
            "Amps": 32,
            "Voltage": 230,
            "PowerKW": 7,
            "CurrentTypeID": 10,
            "Quantity": 4
        }
    ],
    "NumberOfPoints": 4,
    "GeneralComments": "Pod-Point model T7-S charge point",
    "StatusTypeID": 50,
    "DateLastStatusUpdate": "2018-01-13T06:34:00Z",
    "DataQualityLevel": 1,
    "DateCreated": "2016-02-23T10:47:00Z",
    "SubmissionStatusTypeID": 200
}