{
    "IsRecentlyVerified": false,
    "ID": 91053,
    "UUID": "173E9F51-197C-42B5-BA9F-2B1F2B740837",
    "DataProviderID": 1,
    "OperatorID": 23,
    "OperatorsReference": "31486",
    "UsageTypeID": 4,
    "AddressInfo": {
        "ID": 91399,
        "Title": "St Regis Saadiyat Island Resort",
        "AddressLine1": "Saadiyat Island",
        "Town": "Abu Dhabi",
        "CountryID": 235,
        "Latitude": 24.538398,
        "Longitude": 54.42481,
        "ContactTelephone1": "+971 2 498 8888",
        "DistanceUnit": 0
    },
    "Connections": [
        {
            "ID": 129108,
            "ConnectionTypeID": 30,
            "StatusTypeID": 50,
            "LevelID": 2,
            "Amps": 32,
            "Voltage": 400,
            "PowerKW": 22,
            "CurrentTypeID": 20,
            "Quantity": 1
        }
    ],
    "NumberOfPoints": 1,
    "GeneralComments": "1 Tesla Connector, up to 22kW.Available for customers. Self park.",
    "StatusTypeID": 50,
    "DateLastStatusUpdate": "2018-10-12T08:22:00Z",
    "DataQualityLevel": 1,
    "DateCreated": "2017-07-28T05:45:00Z",
    "SubmissionStatusTypeID": 200
}