{
    "IsRecentlyVerified": false,
    "ID": 72570,
    "UUID": "907E4B54-1A18-478D-8A79-BD4D839C075E",
    "DataProviderID": 1,
    "OperatorID": 2241,
    "UsageTypeID": 4,
    "AddressInfo": {
        "ID": 72916,
        "Title": "Martinskirche",
        "AddressLine1": "Unterdorfstraße 39",
        "AddressLine2": "Zeutern",
        "Town": "Zeutern",
        "StateOrProvince": "Landkreis Karlsruhe",
        "Postcode": "76698",
        "CountryID": 87,
        "Latitude": 49.1767885,
        "Longitude": 8.67361249999999,
        "AccessComments": "24/7 nutzbar",
        "DistanceUnit": 0
    },
    "Connections": [
        {
            "ID": 104019,
            "ConnectionTypeID": 25,
            "StatusTypeID": 50,
            "LevelID": 2,
            "PowerKW": 22,
            "CurrentTypeID": 20,
            "Quantity": 2
        },
        {
            "ID": 104020,
            "ConnectionTypeID": 28,
            "StatusTypeID": 50,
            "LevelID": 2,
            "Amps": 16,
            "Voltage": 230,
            "PowerKW": 3.7,
            "CurrentTypeID": 10,
            "Quantity": 2
        }
    ],
    "NumberOfPoints": 2,
    "StatusTypeID": 50,
    "DateLastStatusUpdate": "2016-10-24T14:02:00Z",
    "DataQualityLevel": 1,
    "DateCreated": "2016-10-24T14:02:00Z",
    "SubmissionStatusTypeID": 200
}