{
    "UserComments": [
        {
            "ID": 21874,
            "ChargePointID": 134841,
            "CommentTypeID": 10,
            "UserName": "ForumElettrico.it",
            "RelatedURL": "https://www.forumelettrico.it/forum/colonnina-be-charge-22-kw-municipio-di-monteveglio-valsamoggia-bo-piazza-liberta-101-t8222.html",
            "DateCreated": "2019-12-08T19:11:11.193Z",
            "User": {
                "ID": 11749,
                "Username": "ForumElettrico.it"
            },
            "CheckinStatusTypeID": 10,
            "IsActionedByEditor": false
        }
    ],
    "MediaItems": [
        {
            "ID": 20531,
            "ChargePointID": 134841,
            "ItemURL": "https://s3-ap-southeast-2.amazonaws.com/openchargemap/images/IT/OCM134841/OCM-134841.orig.2019120819112876.jpg",
            "ItemThumbnailURL": "https://s3-ap-southeast-2.amazonaws.com/openchargemap/images/IT/OCM134841/OCM-134841.thmb.2019120819112876.jpg",
            "Comment": "",
            "IsEnabled": true,
            "IsVideo": false,
            "IsFeaturedItem": false,
            "IsExternalResource": false,
            "User": {
                "ID": 11749,
                "Username": "ForumElettrico.it"
            },
            "DateCreated": "2019-12-08T19:12:00Z"
        },
        {
            "ID": 20532,
            "ChargePointID": 134841,
            "ItemURL": "https://s3-ap-southeast-2.amazonaws.com/openchargemap/images/IT/OCM134841/OCM-134841.orig.2019120819113436.jpg",
            "ItemThumbnailURL": "https://s3-ap-southeast-2.amazonaws.com/openchargemap/images/IT/OCM134841/OCM-134841.thmb.2019120819113436.jpg",
            "Comment": "",
            "IsEnabled": true,
            "IsVideo": false,
            "IsFeaturedItem": false,
            "IsExternalResource": false,
            "User": {
                "ID": 11749,
                "Username": "ForumElettrico.it"
            },
            "DateCreated": "2019-12-08T19:12:00Z"
        },
        {
            "ID": 20533,
            "ChargePointID": 134841,
            "ItemURL": "https://s3-ap-southeast-2.amazonaws.com/openchargemap/images/IT/OCM134841/OCM-134841.orig.2019120819114097.jpg",
            "ItemThumbnailURL": "https://s3-ap-southeast-2.amazonaws.com/openchargemap/images/IT/OCM134841/OCM-134841.thmb.2019120819114097.jpg",
            "Comment": "",
            "IsEnabled": true,
            "IsVideo": false,
            "IsFeaturedItem": false,
            "IsExternalResource": false,
            "User": {
                "ID": 11749,
                "Username": "ForumElettrico.it"
            },
            "DateCreated": "2019-12-08T19:12:00Z"
        },
        {
            "ID": 20530,
            "ChargePointID": 134841,
            "ItemURL": "https://s3-ap-southeast-2.amazonaws.com/openchargemap/images/IT/OCM134841/OCM-134841.orig.2019120819112214.jpg",
            "ItemThumbnailURL": "https://s3-ap-southeast-2.amazonaws.com/openchargemap/images/IT/OCM134841/OCM-134841.thmb.2019120819112214.jpg",
            "Comment": "",
            "IsEnabled": true,
            "IsVideo": false,
            "IsFeaturedItem": false,
            "IsExternalResource": false,
            "User": {
                "ID": 11749,
                "Username": "ForumElettrico.it"
            },
            "DateCreated": "2019-12-08T19:11:00Z"
        }
    ],
    "IsRecentlyVerified": false,
    "ID": 134841,
    "UUID": "A807D26B-AAAF-4D44-B7B1-877B16F8A83C",
    "DataProviderID": 1,
    "OperatorID": 3327,
    "UsageTypeID": 4,
    "AddressInfo": {
        "ID": 135187,
        "Title": "BECHARGE Municipio di Monteveglio",
        "AddressLine1": "Piazza Libertà 2",
        "AddressLine2": "Monteveglio",
        "Town": "Valsamoggia",
        "StateOrProvince": "BO",
        "Postcode": "40053",
        "CountryID": 112,
        "Latitude": 44.47018362249051,
        "Longitude": 11.10046111139502,
        "ContactEmail": "emobility@buildingenergy.it",
        "RelatedURL": "https://www.bec.energy/",
        "DistanceUnit": 0
    },
    "Connections": [
        {
            "ID": 188657,
            "ConnectionTypeID": 25,
            "StatusTypeID": 50,
            "LevelID": 2,
            "Amps": 32,
            "Voltage": 400,
            "PowerKW": 22,
            "CurrentTypeID": 20,
            "Quantity": 2
        }
    ],
    "NumberOfPoints": 2,
    "StatusTypeID": 50,
    "DateLastStatusUpdate": "2019-12-08T19:12:00Z",
    "DataQualityLevel": 1,
    "DateCreated": "2019-11-25T11:11:00Z",
    "SubmissionStatusTypeID": 200
}