{
    "IsRecentlyVerified": false,
    "ID": 45858,
    "UUID": "92EB2125-3512-4656-A8A5-B71D9A632E92",
    "DataProviderID": 1,
    "DataProvidersReference": "1891",
    "AddressInfo": {
        "ID": 46204,
        "Title": "Fredrik II vgs. Fredrikstad",
        "AddressLine1": "Veumveien 18",
        "Town": "FREDRIKSTAD",
        "StateOrProvince": "Viken",
        "Postcode": "1601",
        "CountryID": 168,
        "Latitude": 59.22177,
        "Longitude": 10.93018,
        "AccessComments": "Fredrik II videregående skole, avd. Frydenberg. Befinner seg på nord-vegg ved personalparkering .",
        "DistanceUnit": 0
    },
    "Connections": [
        {
            "ID": 56521,
            "ConnectionTypeID": 0,
            "Reference": "1",
            "LevelID": 2,
            "Amps": 16,
            "Voltage": 230,
            "PowerKW": 3.7,
            "Comments": "Mode 3"
        },
        {
            "ID": 84426,
            "ConnectionTypeID": 0,
            "Reference": "2",
            "LevelID": 2,
            "Amps": 16,
            "Voltage": 230,
            "PowerKW": 3.7,
            "Comments": "Mode 3"
        },
        {
            "ID": 84427,
            "ConnectionTypeID": 0,
            "Reference": "3",
            "LevelID": 2,
            "Amps": 16,
            "Voltage": 230,
            "PowerKW": 3.7,
            "Comments": "Mode 3"
        },
        {
            "ID": 88150,
            "ConnectionTypeID": 0,
            "Reference": "4",
            "LevelID": 2,
            "Amps": 16,
            "Voltage": 230,
            "PowerKW": 3.7,
            "Comments": "Mode 3"
        }
    ],
    "NumberOfPoints": 4,
    "DateLastStatusUpdate": "2020-05-26T08:22:00Z",
    "DataQualityLevel": 2,
    "DateCreated": "2015-05-03T00:54:00Z",
    "SubmissionStatusTypeID": 100
}