{
    "IsRecentlyVerified": false,
    "ID": 162696,
    "UUID": "203CA8DE-E885-4196-BF2D-2DA26276FA7A",
    "DataProviderID": 1,
    "OperatorID": 1,
    "UsageTypeID": 4,
    "AddressInfo": {
        "ID": 163053,
        "Title": "DREWAG Ladestation",
        "AddressLine1": "Hettnerstraße 1",
        "Town": "Dresden",
        "StateOrProvince": "Saxony",
        "Postcode": "01069",
        "CountryID": 87,
        "Latitude": 51.031259848174074,
        "Longitude": 13.72715867706495,
        "ContactTelephone1": "+49351205858686",
        "RelatedURL": "https://www.drewag.de/wps/portal/drewag/cms/menu_main/privatkunden/produkte/energievielfalt/mobilitaet/elektromobilitaet",
        "DistanceUnit": 0
    },
    "Connections": [
        {
            "ID": 234171,
            "ConnectionTypeID": 2,
            "StatusTypeID": 50,
            "LevelID": 3,
            "PowerKW": 50,
            "CurrentTypeID": 30,
            "Quantity": 3
        },
        {
            "ID": 234172,
            "ConnectionTypeID": 33,
            "StatusTypeID": 50,
            "LevelID": 3,
            "PowerKW": 150,
            "CurrentTypeID": 30,
            "Quantity": 3
        },
        {
            "ID": 234173,
            "ConnectionTypeID": 25,
            "StatusTypeID": 50,
            "LevelID": 2,
            "PowerKW": 22,
            "Quantity": 3
        }
    ],
    "NumberOfPoints": 6,
    "StatusTypeID": 50,
    "DateLastStatusUpdate": "2020-08-15T09:58:00Z",
    "DataQualityLevel": 1,
    "DateCreated": "2020-08-14T17:48:00Z",
    "SubmissionStatusTypeID": 200
}