{
    "IsRecentlyVerified": false,
    "ID": 122309,
    "UUID": "4BA2C4E9-B1A5-4B7A-A2AD-DCBA0059B88D",
    "DataProviderID": 2,
    "DataProvidersReference": "64042",
    "OperatorID": 5,
    "UsageTypeID": 1,
    "AddressInfo": {
        "ID": 122655,
        "Title": "AVALON CHARGE",
        "AddressLine1": "Westside Pkwy",
        "Town": "Alpharetta",
        "StateOrProvince": "GA",
        "Postcode": "30009",
        "CountryID": 2,
        "Latitude": 34.0715363,
        "Longitude": -84.2747979,
        "ContactTelephone1": "888-758-4389",
        "AccessComments": "24 hours daily",
        "RelatedURL": "http://www.chargepoint.com/",
        "DistanceUnit": 0
    },
    "Connections": [
        {
            "ID": 172190,
            "ConnectionTypeID": 1,
            "LevelID": 2,
            "Amps": 16,
            "Voltage": 230,
            "PowerKW": 3,
            "CurrentTypeID": 10,
            "Quantity": 2
        }
    ],
    "DateLastStatusUpdate": "2019-04-06T05:02:00Z",
    "DataQualityLevel": 3,
    "DateCreated": "2019-04-06T05:02:00Z",
    "SubmissionStatusTypeID": 100
}