{
    "IsRecentlyVerified": false,
    "ID": 173010,
    "UUID": "EDF484CA-ACCC-43BD-9869-CB5E8D80A6ED",
    "DataProviderID": 1,
    "OperatorID": 21,
    "UsageTypeID": 4,
    "UsageCost": "Mobi.E compatible card or App",
    "AddressInfo": {
        "ID": 173369,
        "Title": "BJA-00009 - Agriloja",
        "AddressLine1": "",
        "Town": "Beja",
        "StateOrProvince": "Beja",
        "Postcode": "7800",
        "CountryID": 180,
        "Latitude": 38.02179323043876,
        "Longitude": -7.84888429930993,
        "AccessComments": "Mo-Sa 09:00-20:00",
        "DistanceUnit": 0
    },
    "Connections": [
        {
            "ID": 264702,
            "ConnectionTypeID": 25,
            "StatusTypeID": 50,
            "LevelID": 2,
            "Amps": 32,
            "Voltage": 400,
            "PowerKW": 22,
            "CurrentTypeID": 20,
            "Quantity": 2
        }
    ],
    "NumberOfPoints": 2,
    "StatusTypeID": 50,
    "DateLastStatusUpdate": "2021-02-27T23:54:00Z",
    "DataQualityLevel": 1,
    "DateCreated": "2021-02-27T23:54:00Z",
    "SubmissionStatusTypeID": 200
}