{
    "IsRecentlyVerified": false,
    "ID": 75234,
    "UUID": "6EAB9DC1-C316-4498-96EC-C31A14B0CA66",
    "DataProviderID": 1,
    "OperatorID": 3,
    "OperatorsReference": "PG-80057",
    "UsageTypeID": 6,
    "UsageCost": "Free",
    "AddressInfo": {
        "ID": 75580,
        "Title": "Nestle UK LTD-Trowbridge",
        "AddressLine1": "Holt",
        "AddressLine2": "Staverton",
        "Town": "Trowbridge",
        "StateOrProvince": "Wiltshire",
        "Postcode": "BA14 6PH",
        "CountryID": 1,
        "Latitude": 51.346726,
        "Longitude": -2.205328,
        "DistanceUnit": 0
    },
    "Connections": [
        {
            "ID": 108537,
            "ConnectionTypeID": 25,
            "StatusTypeID": 50,
            "LevelID": 2,
            "Amps": 32,
            "Voltage": 230,
            "PowerKW": 7,
            "CurrentTypeID": 10,
            "Quantity": 2
        }
    ],
    "NumberOfPoints": 6,
    "StatusTypeID": 50,
    "DateLastStatusUpdate": "2017-12-21T06:36:00Z",
    "DataQualityLevel": 1,
    "DateCreated": "2016-12-14T14:11:00Z",
    "SubmissionStatusTypeID": 200
}