{
    "IsRecentlyVerified": false,
    "ID": 63690,
    "UUID": "6BECA027-4011-4DBE-A178-8FBCD93D1E21",
    "DataProviderID": 26,
    "DataProvidersReference": "72316",
    "OperatorID": 103,
    "OperatorsReference": "Allego NLALLEGO0003872",
    "UsageCost": "0.00 jaarabonnement",
    "AddressInfo": {
        "ID": 64036,
        "Title": "Cauberg 20",
        "AddressLine1": "Cauberg 20",
        "Town": "Alphen aan den Rijn",
        "Postcode": "2402 ZL",
        "CountryID": 159,
        "Latitude": 52.154255,
        "Longitude": 4.66375579,
        "ContactTelephone1": "0800-3745337",
        "RelatedURL": "http://www.allego.eu/",
        "DistanceUnit": 0
    },
    "Connections": [
        {
            "ID": 81311,
            "ConnectionTypeID": 25,
            "LevelID": 2,
            "PowerKW": 11,
            "CurrentTypeID": 10
        },
        {
            "ID": 81312,
            "ConnectionTypeID": 25,
            "LevelID": 2,
            "PowerKW": 11,
            "CurrentTypeID": 10
        }
    ],
    "NumberOfPoints": 1,
    "StatusTypeID": 50,
    "DateLastStatusUpdate": "2016-06-04T02:51:00Z",
    "DataQualityLevel": 3,
    "DateCreated": "2016-03-03T12:31:00Z",
    "SubmissionStatusTypeID": 100
}