{
    "IsRecentlyVerified": false,
    "ID": 119603,
    "UUID": "6C690796-24CC-481F-B626-8C1B72016246",
    "DataProviderID": 2,
    "DataProvidersReference": "66484",
    "OperatorID": 5,
    "UsageTypeID": 1,
    "AddressInfo": {
        "ID": 119949,
        "Title": "ELAN 16FORTY",
        "AddressLine1": "1640 E Sunrise Blvd",
        "Town": "Fort Lauderdale",
        "StateOrProvince": "FL",
        "Postcode": "33304",
        "CountryID": 2,
        "Latitude": 26.1369101,
        "Longitude": -80.1265642,
        "ContactTelephone1": "888-758-4389",
        "AccessComments": "24 hours daily",
        "RelatedURL": "http://www.chargepoint.com/",
        "DistanceUnit": 0
    },
    "Connections": [
        {
            "ID": 168881,
            "ConnectionTypeID": 1,
            "LevelID": 2,
            "Amps": 16,
            "Voltage": 230,
            "PowerKW": 3,
            "CurrentTypeID": 10,
            "Quantity": 2
        }
    ],
    "DateLastStatusUpdate": "2019-12-24T09:08:00Z",
    "DataQualityLevel": 3,
    "DateCreated": "2019-04-01T04:59:00Z",
    "SubmissionStatusTypeID": 100
}