{
    "IsRecentlyVerified": false,
    "ID": 51763,
    "UUID": "4B67351C-C5A7-4C25-9E5B-4020495EFE85",
    "DataProviderID": 1,
    "OperatorID": 23,
    "OperatorsReference": "8528",
    "UsageTypeID": 1,
    "UsageCost": "Free",
    "AddressInfo": {
        "ID": 52109,
        "Title": "Club Intrawest - Sandestin - Tesla",
        "AddressLine1": "8626 Baytowne Ave",
        "Town": "Sandestin",
        "StateOrProvince": "FL",
        "Postcode": "32550",
        "CountryID": 2,
        "Latitude": 30.384828,
        "Longitude": -86.323939,
        "ContactTelephone1": "850-622-3400  877-798-3752",
        "AccessComments": "24 hours daily; for Tesla use only; for guest use only; see front desk for access",
        "RelatedURL": "http://www.teslamotors.com/supercharger",
        "DistanceUnit": 0
    },
    "Connections": [
        {
            "ID": 64239,
            "ConnectionTypeID": 30,
            "StatusTypeID": 50,
            "LevelID": 2,
            "Amps": 16,
            "Voltage": 230,
            "PowerKW": 16,
            "CurrentTypeID": 10,
            "Quantity": 1
        }
    ],
    "NumberOfPoints": 1,
    "StatusTypeID": 50,
    "DateLastStatusUpdate": "2017-01-26T20:43:00Z",
    "DataQualityLevel": 3,
    "DateCreated": "2015-08-13T03:43:00Z",
    "SubmissionStatusTypeID": 100
}