{
    "IsRecentlyVerified": false,
    "ID": 120651,
    "UUID": "A0D5C58D-85CF-46AC-A216-03EFCE2E1E02",
    "DataProviderID": 2,
    "DataProvidersReference": "66906",
    "UsageTypeID": 1,
    "AddressInfo": {
        "ID": 120997,
        "Title": "Carl Miller Park",
        "AddressLine1": "74 Sewell Rd",
        "Town": "Newnan",
        "StateOrProvince": "GA",
        "Postcode": "30263",
        "CountryID": 2,
        "Latitude": 33.359198,
        "Longitude": -84.803283,
        "ContactTelephone1": "770-683-5516",
        "AccessComments": "8am-9pm daily",
        "RelatedURL": "",
        "DistanceUnit": 0
    },
    "Connections": [
        {
            "ID": 170015,
            "ConnectionTypeID": 1,
            "LevelID": 2,
            "Amps": 16,
            "Voltage": 230,
            "PowerKW": 3.7,
            "CurrentTypeID": 10,
            "Quantity": 1
        }
    ],
    "DateLastStatusUpdate": "2020-06-26T02:55:00Z",
    "DataQualityLevel": 3,
    "DateCreated": "2019-04-01T04:59:00Z",
    "SubmissionStatusTypeID": 100
}