{
    "IsRecentlyVerified": false,
    "ID": 47574,
    "UUID": "4F65CA7D-ACE6-4278-B9BD-D43AC9B95426",
    "DataProviderID": 1,
    "DataProvidersReference": "2797",
    "AddressInfo": {
        "ID": 47920,
        "Title": "Farsta Sim- och idrottshall",
        "AddressLine1": "Farstaängsvägen ",
        "Town": "FARSTA",
        "StateOrProvince": "STOCKHOLM",
        "Postcode": "12346",
        "CountryID": 216,
        "Latitude": 59.23999,
        "Longitude": 18.08524,
        "AccessComments": "På parkeringsyta",
        "DistanceUnit": 0
    },
    "Connections": [
        {
            "ID": 58654,
            "ConnectionTypeID": 0,
            "Reference": "1",
            "LevelID": 2,
            "Amps": 16,
            "Voltage": 230,
            "PowerKW": 3.7,
            "Comments": "Mode 3"
        },
        {
            "ID": 84433,
            "ConnectionTypeID": 0,
            "Reference": "2",
            "LevelID": 2,
            "Amps": 16,
            "Voltage": 230,
            "PowerKW": 3.7,
            "Comments": "Mode 3"
        },
        {
            "ID": 84434,
            "ConnectionTypeID": 0,
            "Reference": "3",
            "LevelID": 2,
            "Amps": 16,
            "Voltage": 230,
            "PowerKW": 3.7,
            "Comments": "Mode 3"
        },
        {
            "ID": 84435,
            "ConnectionTypeID": 0,
            "Reference": "4",
            "LevelID": 2,
            "Amps": 16,
            "Voltage": 230,
            "PowerKW": 3.7,
            "Comments": "Mode 3"
        },
        {
            "ID": 84436,
            "ConnectionTypeID": 0,
            "Reference": "5",
            "LevelID": 2,
            "Amps": 16,
            "Voltage": 230,
            "PowerKW": 3.7,
            "Comments": "Mode 3"
        },
        {
            "ID": 88155,
            "ConnectionTypeID": 0,
            "Reference": "6",
            "LevelID": 2,
            "Amps": 16,
            "Voltage": 230,
            "PowerKW": 3.7,
            "Comments": "Mode 3"
        }
    ],
    "NumberOfPoints": 6,
    "DateLastStatusUpdate": "2020-05-26T08:22:00Z",
    "DataQualityLevel": 2,
    "DateCreated": "2015-06-01T10:34:00Z",
    "SubmissionStatusTypeID": 100
}