{
    "IsRecentlyVerified": false,
    "ID": 177881,
    "UUID": "3B5C5479-7917-4D4D-AB4C-133D2643793B",
    "DataProviderID": 29,
    "DataProvidersReference": "17656",
    "OperatorID": 124,
    "AddressInfo": {
        "ID": 178240,
        "Title": "Am Großen Geeren 31-33",
        "AddressLine1": "Am Großen Geeren 31-33",
        "Town": "Ritterhude",
        "Postcode": "27721",
        "CountryID": 87,
        "Latitude": 53.186925,
        "Longitude": 8.751258,
        "DistanceUnit": 0
    },
    "Connections": [
        {
            "ID": 277580,
            "ConnectionTypeID": 25,
            "StatusTypeID": 50,
            "LevelID": 2,
            "PowerKW": 22,
            "CurrentTypeID": 20
        },
        {
            "ID": 301186,
            "ConnectionTypeID": 25,
            "StatusTypeID": 50,
            "LevelID": 2,
            "PowerKW": 22,
            "CurrentTypeID": 20
        }
    ],
    "StatusTypeID": 0,
    "DateLastStatusUpdate": "2021-07-12T02:50:00Z",
    "MetadataValues": [
        {
            "ID": 10175,
            "MetadataFieldID": 4,
            "ItemValue": "Data from the German chargepoint registry provided by Bundesnetzagentur.de under the CC-BY 4.0 license"
        }
    ],
    "DataQualityLevel": 3,
    "DateCreated": "2021-07-08T09:49:00Z",
    "SubmissionStatusTypeID": 100
}