{
    "IsRecentlyVerified": false,
    "ID": 152598,
    "UUID": "47995F55-9381-4944-AEED-3AAE3BD4BF2F",
    "DataProviderID": 28,
    "DataProvidersReference": "FR*S58*P58145*A",
    "UsageTypeID": 5,
    "AddressInfo": {
        "ID": 152951,
        "Title": "LORMES_Parking Vauban",
        "AddressLine1": "Parking Vauban 58140 LORMES",
        "CountryID": 80,
        "Latitude": 47.28995493,
        "Longitude": 3.81879106,
        "AccessComments": "24/24 7/7 jours",
        "DistanceUnit": 0
    },
    "Connections": [
        {
            "ID": 213688,
            "ConnectionTypeID": 28,
            "StatusTypeID": 50,
            "LevelID": 2,
            "PowerKW": 22,
            "CurrentTypeID": 10
        },
        {
            "ID": 213689,
            "ConnectionTypeID": 1036,
            "StatusTypeID": 50,
            "LevelID": 2,
            "PowerKW": 22,
            "CurrentTypeID": 20
        },
        {
            "ID": 246773,
            "ConnectionTypeID": 28,
            "StatusTypeID": 50,
            "LevelID": 2,
            "PowerKW": 22,
            "CurrentTypeID": 10
        },
        {
            "ID": 246774,
            "ConnectionTypeID": 1036,
            "StatusTypeID": 50,
            "LevelID": 2,
            "PowerKW": 22,
            "CurrentTypeID": 20
        }
    ],
    "GeneralComments": "",
    "StatusTypeID": 50,
    "DateLastStatusUpdate": "2020-08-27T05:13:00Z",
    "DataQualityLevel": 2,
    "DateCreated": "2020-03-15T10:53:00Z",
    "SubmissionStatusTypeID": 100
}