{
    "IsRecentlyVerified": false,
    "ID": 174565,
    "UUID": "B1312294-90AA-4E8F-B0DA-A389815CE56A",
    "DataProviderID": 1,
    "OperatorID": 1,
    "UsageTypeID": 6,
    "UsageCost": "FREE for visitors & hotel guests",
    "AddressInfo": {
        "ID": 174924,
        "Title": "Primula Beach Resort",
        "AddressLine1": "Primula Beach Resort",
        "Town": "Kuala Terengganu",
        "StateOrProvince": "Terengganu",
        "Postcode": "20300",
        "CountryID": 137,
        "Latitude": 5.32954210903317,
        "Longitude": 103.15022966055312,
        "DistanceUnit": 0
    },
    "Connections": [
        {
            "ID": 270457,
            "ConnectionTypeID": 25,
            "StatusTypeID": 50,
            "LevelID": 2,
            "Amps": 32,
            "Voltage": 240,
            "PowerKW": 7.4,
            "CurrentTypeID": 10,
            "Quantity": 1
        }
    ],
    "NumberOfPoints": 1,
    "StatusTypeID": 50,
    "DateLastStatusUpdate": "2021-08-03T13:03:00Z",
    "DataQualityLevel": 1,
    "DateCreated": "2021-04-06T03:17:00Z",
    "SubmissionStatusTypeID": 200
}