{
    "UserComments": [
        {
            "ID": 17625,
            "ChargePointID": 40984,
            "CommentTypeID": 10,
            "UserName": "Erna_Schleck",
            "Comment": "Hausmeister kommt mit Ladefachschlüssel, das dauert etwas...",
            "Rating": 3,
            "DateCreated": "2017-08-23T12:07:58.747Z",
            "User": {
                "ID": 4573,
                "Username": "Erna_Schleck"
            },
            "CheckinStatusTypeID": 10
        }
    ],
    "MediaItems": [
        {
            "ID": 13200,
            "ChargePointID": 40984,
            "ItemURL": "https://s3-ap-southeast-2.amazonaws.com/openchargemap/images/DE/OCM40984/OCM-40984.orig.2017082312495313.jpg",
            "ItemThumbnailURL": "https://s3-ap-southeast-2.amazonaws.com/openchargemap/images/DE/OCM40984/OCM-40984.thmb.2017082312495313.jpg",
            "Comment": "",
            "IsEnabled": true,
            "IsVideo": false,
            "IsFeaturedItem": false,
            "IsExternalResource": false,
            "User": {
                "ID": 4573,
                "Username": "Erna_Schleck"
            },
            "DateCreated": "2017-08-23T12:50:00Z"
        },
        {
            "ID": 13199,
            "ChargePointID": 40984,
            "ItemURL": "https://s3-ap-southeast-2.amazonaws.com/openchargemap/images/DE/OCM40984/OCM-40984.orig.2017082312485776.jpg",
            "ItemThumbnailURL": "https://s3-ap-southeast-2.amazonaws.com/openchargemap/images/DE/OCM40984/OCM-40984.thmb.2017082312485776.jpg",
            "Comment": "",
            "IsEnabled": true,
            "IsVideo": false,
            "IsFeaturedItem": false,
            "IsExternalResource": false,
            "User": {
                "ID": 4573,
                "Username": "Erna_Schleck"
            },
            "DateCreated": "2017-08-23T12:49:00Z"
        }
    ],
    "IsRecentlyVerified": false,
    "ID": 40984,
    "UUID": "199BCEE8-0D98-4851-8882-48B7764FD492",
    "DataProviderID": 1,
    "OperatorID": 45,
    "UsageTypeID": 1,
    "UsageCost": "0",
    "AddressInfo": {
        "ID": 41330,
        "Title": "PS Speicher Ausstellungspark",
        "AddressLine1": "Jahnstraße",
        "AddressLine2": "",
        "Town": "Einbeck",
        "StateOrProvince": "Landkreis Northeim",
        "Postcode": "37574",
        "CountryID": 87,
        "Latitude": 51.818887818259455,
        "Longitude": 9.860178894959972,
        "ContactTelephone1": "05561 923200",
        "ContactTelephone2": "",
        "ContactEmail": "entdeckung@ps-speicher.de",
        "AccessComments": "4 kostenlose Parkplätze, immer nutzbar. ",
        "RelatedURL": "http://www.ps-speicher.de/",
        "DistanceUnit": 0
    },
    "Connections": [
        {
            "ID": 44673,
            "ConnectionTypeID": 2,
            "StatusTypeID": 50,
            "LevelID": 3,
            "PowerKW": 20,
            "CurrentTypeID": 30,
            "Quantity": 1
        },
        {
            "ID": 44674,
            "ConnectionTypeID": 33,
            "StatusTypeID": 50,
            "LevelID": 3,
            "PowerKW": 20,
            "CurrentTypeID": 30,
            "Quantity": 1
        },
        {
            "ID": 44675,
            "ConnectionTypeID": 1036,
            "StatusTypeID": 50,
            "LevelID": 2,
            "Amps": 32,
            "Voltage": 400,
            "PowerKW": 22,
            "CurrentTypeID": 20,
            "Quantity": 1
        },
        {
            "ID": 44677,
            "ConnectionTypeID": 28,
            "StatusTypeID": 50,
            "LevelID": 2,
            "Amps": 16,
            "Voltage": 230,
            "PowerKW": 3.7,
            "CurrentTypeID": 10,
            "Quantity": 12
        }
    ],
    "NumberOfPoints": 15,
    "GeneralComments": "Es sind 2 Ladesäulen vorhanden, die eine für Elektroautos (Ladekabel mit Kupplungen an der Säule) auf dem Parkplatz vorne, die andere für E-Bikes (und Renault Twizys) mit Schukodosen auf dem hinteren Parkplatz. Sie ist abschließbar, Schlüssel an der Information ausleihen",
    "StatusTypeID": 50,
    "DateLastStatusUpdate": "2017-08-23T12:50:00Z",
    "DataQualityLevel": 1,
    "DateCreated": "2015-01-20T08:10:00Z",
    "SubmissionStatusTypeID": 200
}