{
    "IsRecentlyVerified": false,
    "ID": 181992,
    "UUID": "D09B21A7-113B-4783-AE71-06ABD558264F",
    "DataProviderID": 29,
    "DataProvidersReference": "13122",
    "OperatorID": 3429,
    "AddressInfo": {
        "ID": 182351,
        "Title": "Osterholzer Heerstraße 161",
        "AddressLine1": "Osterholzer Heerstraße 161",
        "Town": "Bremen",
        "Postcode": "28307",
        "CountryID": 87,
        "Latitude": 53.05777,
        "Longitude": 8.9486,
        "DistanceUnit": 0
    },
    "Connections": [
        {
            "ID": 287145,
            "ConnectionTypeID": 33,
            "StatusTypeID": 50,
            "LevelID": 3,
            "PowerKW": 150,
            "CurrentTypeID": 30
        },
        {
            "ID": 287146,
            "ConnectionTypeID": 33,
            "StatusTypeID": 50,
            "LevelID": 3,
            "PowerKW": 75,
            "CurrentTypeID": 30
        },
        {
            "ID": 301072,
            "ConnectionTypeID": 25,
            "StatusTypeID": 50,
            "LevelID": 2,
            "PowerKW": 22,
            "CurrentTypeID": 20
        }
    ],
    "StatusTypeID": 50,
    "DateLastStatusUpdate": "2021-07-12T02:50:00Z",
    "MetadataValues": [
        {
            "ID": 14286,
            "MetadataFieldID": 4,
            "ItemValue": "Data from the German chargepoint registry provided by Bundesnetzagentur.de under the CC-BY 4.0 license"
        }
    ],
    "DataQualityLevel": 3,
    "DateCreated": "2021-07-08T10:02:00Z",
    "SubmissionStatusTypeID": 100
}