{
    "IsRecentlyVerified": false,
    "ID": 85588,
    "UUID": "CE616242-3CC3-4E49-928A-28CFA3973279",
    "DataProviderID": 1,
    "OperatorID": 23,
    "OperatorsReference": "26384",
    "UsageTypeID": 4,
    "AddressInfo": {
        "ID": 85934,
        "Title": "Hotel Fjordgården A/S",
        "AddressLine1": "28 Vester KÆR",
        "Town": "Ringkøbing",
        "Postcode": "6950",
        "CountryID": 65,
        "Latitude": 56.095343,
        "Longitude": 8.236418,
        "ContactTelephone1": "+45 97 32 14 00",
        "DistanceUnit": 0
    },
    "Connections": [
        {
            "ID": 121692,
            "ConnectionTypeID": 30,
            "StatusTypeID": 50,
            "LevelID": 2,
            "Amps": 16,
            "Voltage": 400,
            "PowerKW": 11,
            "CurrentTypeID": 20,
            "Quantity": 1
        }
    ],
    "NumberOfPoints": 1,
    "GeneralComments": "1 Tesla Connector, up to 11kW.Available to the public. Please see front desk.",
    "StatusTypeID": 50,
    "DateLastStatusUpdate": "2019-06-05T11:55:00Z",
    "DataQualityLevel": 1,
    "DateCreated": "2017-04-08T05:41:00Z",
    "SubmissionStatusTypeID": 200
}