{
    "IsRecentlyVerified": false,
    "ID": 185873,
    "UUID": "1A8487FF-9230-4842-9F2D-C56A382D19AC",
    "DataProviderID": 29,
    "DataProvidersReference": "14591",
    "OperatorID": 1240,
    "AddressInfo": {
        "ID": 186232,
        "Title": "Bahnhofstr.",
        "AddressLine1": "Bahnhofstr.",
        "Town": "Glan-Münchweiler",
        "Postcode": "66907",
        "CountryID": 87,
        "Latitude": 49.470917,
        "Longitude": 7.444556,
        "DistanceUnit": 0
    },
    "Connections": [
        {
            "ID": 297066,
            "ConnectionTypeID": 25,
            "StatusTypeID": 50,
            "LevelID": 2,
            "PowerKW": 22,
            "CurrentTypeID": 20
        },
        {
            "ID": 297067,
            "ConnectionTypeID": 33,
            "StatusTypeID": 50,
            "LevelID": 3,
            "PowerKW": 50,
            "CurrentTypeID": 30
        },
        {
            "ID": 297068,
            "ConnectionTypeID": 2,
            "StatusTypeID": 50,
            "LevelID": 3,
            "PowerKW": 50,
            "CurrentTypeID": 30
        }
    ],
    "StatusTypeID": 50,
    "DateLastStatusUpdate": "2021-07-12T02:43:00Z",
    "MetadataValues": [
        {
            "ID": 18115,
            "MetadataFieldID": 4,
            "ItemValue": "Data from the German chargepoint registry provided by Bundesnetzagentur.de under the CC-BY 4.0 license"
        }
    ],
    "DataQualityLevel": 3,
    "DateCreated": "2021-07-12T02:43:00Z",
    "SubmissionStatusTypeID": 100
}