{
    "IsRecentlyVerified": false,
    "ID": 160432,
    "UUID": "CC68929D-5918-4A4B-B4C4-54CAD8D2D80E",
    "DataProviderID": 2,
    "DataProvidersReference": "153211",
    "OperatorID": 90,
    "UsageTypeID": 1,
    "AddressInfo": {
        "ID": 160789,
        "Title": "8755 4e Croissant",
        "AddressLine1": "8755 4e Croissant",
        "Town": "Montréal",
        "StateOrProvince": "QC",
        "Postcode": "H1J 1M3",
        "CountryID": 44,
        "Latitude": 45.622917,
        "Longitude": -73.572803,
        "ContactTelephone1": "877-505-2674",
        "AccessComments": "24 hours daily",
        "RelatedURL": "https://lecircuitelectrique.com/",
        "DistanceUnit": 0
    },
    "Connections": [
        {
            "ID": 230831,
            "ConnectionTypeID": 1,
            "LevelID": 2,
            "Amps": 16,
            "Voltage": 230,
            "PowerKW": 3.7,
            "CurrentTypeID": 10,
            "Quantity": 2
        }
    ],
    "StatusTypeID": 50,
    "DateLastStatusUpdate": "2020-06-26T03:09:00Z",
    "DataQualityLevel": 3,
    "DateCreated": "2020-06-26T03:09:00Z",
    "SubmissionStatusTypeID": 100
}