{
    "IsRecentlyVerified": false,
    "ID": 165445,
    "UUID": "EC205B10-58C3-49D7-BE4D-BAF01A46D95F",
    "DataProviderID": 28,
    "DataProvidersReference": "FR*S64*PMB64*124",
    "OperatorID": 3407,
    "UsageTypeID": 5,
    "AddressInfo": {
        "ID": 165804,
        "Title": "USTARITZ - Place Du Château",
        "AddressLine1": "Place Du Château 64480 USTARITZ",
        "CountryID": 80,
        "Latitude": 43.397104,
        "Longitude": -1.455624,
        "AccessComments": "24h/24 7j/7",
        "DistanceUnit": 0
    },
    "Connections": [
        {
            "ID": 238795,
            "ConnectionTypeID": 25,
            "StatusTypeID": 50,
            "LevelID": 2,
            "PowerKW": 18,
            "CurrentTypeID": 20
        },
        {
            "ID": 238796,
            "ConnectionTypeID": 28,
            "StatusTypeID": 50,
            "LevelID": 2,
            "PowerKW": 18,
            "CurrentTypeID": 10
        },
        {
            "ID": 238797,
            "ConnectionTypeID": 25,
            "StatusTypeID": 50,
            "LevelID": 2,
            "PowerKW": 18,
            "CurrentTypeID": 20
        },
        {
            "ID": 238798,
            "ConnectionTypeID": 28,
            "StatusTypeID": 50,
            "LevelID": 2,
            "PowerKW": 18,
            "CurrentTypeID": 10
        }
    ],
    "GeneralComments": "Recharge par badge et avec une application smartphone",
    "StatusTypeID": 50,
    "DateLastStatusUpdate": "2020-08-27T05:10:00Z",
    "DataQualityLevel": 2,
    "DateCreated": "2020-08-27T05:10:00Z",
    "SubmissionStatusTypeID": 100
}