{
    "IsRecentlyVerified": false,
    "ID": 75268,
    "UUID": "6DA8D28F-8EBA-4AC0-A3E7-30E18BFF408E",
    "DataProviderID": 1,
    "OperatorID": 23,
    "OperatorsReference": "19718",
    "UsageTypeID": 6,
    "UsageCost": "Free",
    "AddressInfo": {
        "ID": 75614,
        "Title": "Château de la Presle",
        "AddressLine1": "3 Rue Louis Pergaud",
        "Town": "Breurey-les-Faverney",
        "StateOrProvince": "Bourgogne Franche-Comte",
        "Postcode": "70160",
        "CountryID": 80,
        "Latitude": 47.758981,
        "Longitude": 6.125781,
        "ContactTelephone1": "+33 3 84 91 41 70",
        "DistanceUnit": 0
    },
    "Connections": [
        {
            "ID": 108573,
            "ConnectionTypeID": 30,
            "StatusTypeID": 50,
            "LevelID": 2,
            "Amps": 32,
            "Voltage": 230,
            "PowerKW": 7,
            "CurrentTypeID": 10,
            "Quantity": 1
        }
    ],
    "NumberOfPoints": 1,
    "GeneralComments": "1 Tesla Connector, up to 7kW.Available for patrons only. Please call ahead.",
    "StatusTypeID": 50,
    "DateLastStatusUpdate": "2018-10-03T14:09:00Z",
    "DataQualityLevel": 1,
    "DateCreated": "2016-12-14T16:39:00Z",
    "SubmissionStatusTypeID": 200
}