{
    "IsRecentlyVerified": false,
    "ID": 154399,
    "UUID": "90BEA8D7-18A1-468D-8535-E2195FC5F4FD",
    "DataProviderID": 28,
    "DataProvidersReference": "FR*SOD*P*SDE7*25*_*_*_",
    "OperatorID": 3262,
    "UsageTypeID": 5,
    "AddressInfo": {
        "ID": 154752,
        "Title": "FECAMP - VICOMTE",
        "AddressLine1": "Quai de la Vicomté",
        "CountryID": 80,
        "Latitude": 49.761122,
        "Longitude": 0.365779,
        "AccessComments": "24/24 7/7",
        "DistanceUnit": 0
    },
    "Connections": [
        {
            "ID": 217104,
            "ConnectionTypeID": 28,
            "StatusTypeID": 50,
            "LevelID": 2,
            "PowerKW": 22,
            "CurrentTypeID": 10
        },
        {
            "ID": 217105,
            "ConnectionTypeID": 1036,
            "StatusTypeID": 50,
            "LevelID": 2,
            "PowerKW": 22,
            "CurrentTypeID": 20
        }
    ],
    "GeneralComments": "RFID et application",
    "StatusTypeID": 50,
    "DateLastStatusUpdate": "2020-08-27T05:16:00Z",
    "DataQualityLevel": 2,
    "DateCreated": "2020-03-15T10:55:00Z",
    "SubmissionStatusTypeID": 100
}