{
    "IsRecentlyVerified": false,
    "ID": 60873,
    "UUID": "70ECE703-1151-42D9-B7E9-17A2599B29C9",
    "DataProviderID": 1,
    "OperatorID": 45,
    "UsageTypeID": 6,
    "AddressInfo": {
        "ID": 61219,
        "Title": "Hotel Arabella",
        "AddressLine1": "Seeweg 7",
        "AddressLine2": "Bleckstein",
        "Town": "Spitzingsee",
        "StateOrProvince": "Landkreis Miesbach",
        "Postcode": "83727",
        "CountryID": 87,
        "Latitude": 47.663014,
        "Longitude": 11.887481699999967,
        "ContactTelephone1": "+49 8026 7980",
        "AccessComments": "Hinter dem Seehof Gebäude. Ladewunsch bei Reservierung angeben. ",
        "RelatedURL": "http://www.arabella-alpenhotel.com/",
        "DistanceUnit": 0
    },
    "Connections": [
        {
            "ID": 77189,
            "ConnectionTypeID": 17,
            "StatusTypeID": 50,
            "LevelID": 2,
            "Amps": 32,
            "Voltage": 400,
            "PowerKW": 22,
            "CurrentTypeID": 20,
            "Quantity": 1
        },
        {
            "ID": 77190,
            "ConnectionTypeID": 17,
            "StatusTypeID": 50,
            "LevelID": 2,
            "Amps": 16,
            "Voltage": 400,
            "PowerKW": 11,
            "CurrentTypeID": 20,
            "Quantity": 1
        },
        {
            "ID": 77191,
            "ConnectionTypeID": 28,
            "StatusTypeID": 50,
            "LevelID": 2,
            "Amps": 16,
            "Voltage": 230,
            "PowerKW": 3.7,
            "CurrentTypeID": 10,
            "Quantity": 2
        }
    ],
    "NumberOfPoints": 4,
    "StatusTypeID": 50,
    "DateLastStatusUpdate": "2016-02-12T06:37:00Z",
    "DataQualityLevel": 1,
    "DateCreated": "2016-02-12T06:37:00Z",
    "SubmissionStatusTypeID": 200
}