{
    "IsRecentlyVerified": false,
    "ID": 31422,
    "UUID": "7776C575-2793-4177-9F92-BA93C86797F5",
    "DataProviderID": 26,
    "DataProvidersReference": "39232",
    "OperatorID": 78,
    "OperatorsReference": "Essent EM-MT-00000060-01-00001",
    "UsageCost": "0.00 jaarabonnement",
    "AddressInfo": {
        "ID": 31768,
        "Title": "Merchants Street",
        "AddressLine1": "Merchants Street",
        "Town": "Valletta",
        "Postcode": "VLT 05",
        "CountryID": 140,
        "Latitude": 35.900001,
        "Longitude": 14.518298,
        "RelatedURL": "http://www.essent.nl",
        "DistanceUnit": 0
    },
    "Connections": [
        {
            "ID": 34933,
            "ConnectionTypeID": 25,
            "LevelID": 2,
            "PowerKW": 11,
            "CurrentTypeID": 10
        }
    ],
    "NumberOfPoints": 1,
    "StatusTypeID": 50,
    "DateLastStatusUpdate": "2016-06-04T02:37:00Z",
    "DataQualityLevel": 3,
    "DateCreated": "2015-01-09T06:03:00Z",
    "SubmissionStatusTypeID": 100
}