{
    "IsRecentlyVerified": false,
    "ID": 57039,
    "UUID": "F02ACBF2-6C54-4120-9E71-9D568C4762AE",
    "DataProviderID": 1,
    "OperatorID": 167,
    "UsageTypeID": 3,
    "AddressInfo": {
        "ID": 57385,
        "Title": "Autohaus M. Hipf",
        "AddressLine1": "Mühlfeld 6",
        "AddressLine2": "Haargaßalm",
        "Town": "Ruhpolding",
        "StateOrProvince": "Landkreis Traunstein",
        "Postcode": "83324",
        "CountryID": 87,
        "Latitude": 47.75098999999999,
        "Longitude": 12.63149999999996,
        "ContactTelephone1": "+49 8663 2838",
        "AccessComments": "Kostenloses Laden nach Ausfüllen des Anmeldeformulars während der Öffnungszeiten Mo-Do 8-18Uhr, Fr 8-17Uhr, Sa 9-12Uhr.",
        "RelatedURL": "http://www.autohaus-hipf.de/",
        "DistanceUnit": 0
    },
    "Connections": [
        {
            "ID": 72047,
            "ConnectionTypeID": 28,
            "StatusTypeID": 50,
            "LevelID": 2,
            "Amps": 16,
            "Voltage": 230,
            "PowerKW": 3.7,
            "CurrentTypeID": 10,
            "Quantity": 1
        }
    ],
    "NumberOfPoints": 1,
    "StatusTypeID": 50,
    "DateLastStatusUpdate": "2015-11-21T10:00:00Z",
    "DataQualityLevel": 1,
    "DateCreated": "2015-11-21T10:00:00Z",
    "SubmissionStatusTypeID": 200
}