{
    "IsRecentlyVerified": false,
    "ID": 127986,
    "UUID": "FB0402F9-9456-49CE-B7B2-63301F152A1C",
    "DataProviderID": 1,
    "OperatorID": 3253,
    "OperatorsReference": "AT*SMA*EAT0202012*001AC,AT*SMA*EAT0202012*002AC",
    "UsageTypeID": 1,
    "UsageCost": "€0,04/min ; Andere Tarife möglich",
    "AddressInfo": {
        "ID": 128332,
        "Title": "Ladestation Aichlseder Car",
        "AddressLine1": "Völkermarkterstraße 270",
        "Town": "Klagenfurt",
        "StateOrProvince": "Kärnten",
        "Postcode": "9020",
        "CountryID": 19,
        "Latitude": 46.629798,
        "Longitude": 14.355837,
        "DistanceUnit": 0
    },
    "Connections": [
        {
            "ID": 179104,
            "ConnectionTypeID": 25,
            "StatusTypeID": 50,
            "LevelID": 2,
            "Amps": 16,
            "Voltage": 400,
            "PowerKW": 11,
            "CurrentTypeID": 20,
            "Quantity": 1
        }
    ],
    "NumberOfPoints": 1,
    "StatusTypeID": 50,
    "DateLastStatusUpdate": "2019-06-12T14:19:00Z",
    "DataQualityLevel": 1,
    "DateCreated": "2019-06-12T14:19:00Z",
    "SubmissionStatusTypeID": 200
}