{
    "IsRecentlyVerified": false,
    "ID": 80040,
    "UUID": "83B6E294-A426-43EC-A035-5343E516CCD0",
    "DataProviderID": 1,
    "OperatorID": 23,
    "OperatorsReference": "7632",
    "UsageTypeID": 6,
    "UsageCost": "Free",
    "AddressInfo": {
        "ID": 80386,
        "Title": "Semiahmoo Resort & Spa",
        "AddressLine1": "9565 Semiahmoo Pkwy",
        "Town": "Blaine",
        "StateOrProvince": "WA",
        "Postcode": "98230",
        "CountryID": 2,
        "Latitude": 48.990486,
        "Longitude": -122.774447,
        "ContactTelephone1": "(360) 318-2000",
        "DistanceUnit": 0
    },
    "Connections": [
        {
            "ID": 114689,
            "ConnectionTypeID": 30,
            "StatusTypeID": 50,
            "LevelID": 2,
            "PowerKW": 6,
            "CurrentTypeID": 10,
            "Quantity": 1
        }
    ],
    "NumberOfPoints": 1,
    "GeneralComments": "1 Tesla Connector, up to 6kW.Available for patrons only. Ask about a special offer for Tesla owners.",
    "StatusTypeID": 50,
    "DateLastStatusUpdate": "2017-07-13T14:23:00Z",
    "DataQualityLevel": 1,
    "DateCreated": "2017-01-30T18:23:00Z",
    "SubmissionStatusTypeID": 200
}