{
    "IsRecentlyVerified": false,
    "ID": 82089,
    "UUID": "0C2E0F52-9DB6-4C09-A8B4-B615838DBDEF",
    "DataProviderID": 1,
    "OperatorID": 23,
    "OperatorsReference": "21411",
    "UsageTypeID": 6,
    "AddressInfo": {
        "ID": 82435,
        "Title": "Aava Whistler Hotel",
        "AddressLine1": "2005 Whistler Wy",
        "Town": "Whistler",
        "StateOrProvince": "British Columbia",
        "Postcode": "V0N 1B4",
        "CountryID": 44,
        "Latitude": 50.114063,
        "Longitude": -122.957647,
        "ContactTelephone1": "(604) 932-2522",
        "DistanceUnit": 0
    },
    "Connections": [
        {
            "ID": 116849,
            "ConnectionTypeID": 30,
            "StatusTypeID": 50,
            "LevelID": 2,
            "PowerKW": 17,
            "CurrentTypeID": 20,
            "Quantity": 3
        }
    ],
    "NumberOfPoints": 3,
    "GeneralComments": "3 Tesla Connectors, up to 17kW.Available for patrons only. Please call ahead.",
    "StatusTypeID": 50,
    "DateLastStatusUpdate": "2017-02-03T14:42:00Z",
    "DataQualityLevel": 1,
    "DateCreated": "2017-02-03T14:42:00Z",
    "SubmissionStatusTypeID": 200
}