{
    "IsRecentlyVerified": false,
    "ID": 75430,
    "UUID": "CD2CF639-84A7-4E7D-9CE4-1684F9E506FA",
    "DataProviderID": 1,
    "OperatorID": 23,
    "OperatorsReference": "19409",
    "UsageTypeID": 6,
    "UsageCost": "Free",
    "AddressInfo": {
        "ID": 75776,
        "Title": "NH Collection Berlin Friedrichstrasse",
        "AddressLine1": "Friedrichstraße 96",
        "Town": "Berlin",
        "Postcode": "10117",
        "CountryID": 87,
        "Latitude": 52.519711,
        "Longitude": 13.390212,
        "ContactTelephone1": "+49 30 2062660",
        "DistanceUnit": 0
    },
    "Connections": [
        {
            "ID": 108735,
            "ConnectionTypeID": 30,
            "StatusTypeID": 50,
            "LevelID": 2,
            "Amps": 16,
            "Voltage": 400,
            "PowerKW": 11,
            "CurrentTypeID": 20,
            "Quantity": 1
        }
    ],
    "NumberOfPoints": 1,
    "GeneralComments": "1 Tesla Connector, up to 11kW.Available for patrons only. Self park.",
    "StatusTypeID": 50,
    "DateLastStatusUpdate": "2018-10-03T14:58:00Z",
    "DataQualityLevel": 1,
    "DateCreated": "2016-12-14T20:02:00Z",
    "SubmissionStatusTypeID": 200
}