{
    "IsRecentlyVerified": false,
    "ID": 115845,
    "UUID": "41179D03-9FF4-4139-BF57-61CEE6EB105F",
    "DataProviderID": 2,
    "DataProvidersReference": "105314",
    "OperatorID": 5,
    "UsageTypeID": 1,
    "AddressInfo": {
        "ID": 116191,
        "Title": "RI COLLEGEVILLE",
        "AddressLine1": "726 Taylor Way",
        "Town": "Collegeville",
        "StateOrProvince": "PA",
        "Postcode": "19426",
        "CountryID": 2,
        "Latitude": 40.1592265,
        "Longitude": -75.4706249,
        "ContactTelephone1": "888-758-4389",
        "AccessComments": "24 hours daily",
        "RelatedURL": "http://www.chargepoint.com/",
        "DistanceUnit": 0
    },
    "Connections": [
        {
            "ID": 162887,
            "ConnectionTypeID": 1,
            "LevelID": 2,
            "Amps": 16,
            "Voltage": 230,
            "PowerKW": 3,
            "CurrentTypeID": 10,
            "Quantity": 2
        }
    ],
    "DateLastStatusUpdate": "2019-12-24T09:17:00Z",
    "DataQualityLevel": 3,
    "DateCreated": "2019-02-11T07:13:00Z",
    "SubmissionStatusTypeID": 100
}