{
    "IsRecentlyVerified": false,
    "ID": 56462,
    "UUID": "A461C1BA-A56C-420E-9D2D-7369136FD83C",
    "DataProviderID": 1,
    "OperatorID": 23,
    "OperatorsReference": "7050",
    "UsageTypeID": 1,
    "UsageCost": "Free",
    "AddressInfo": {
        "ID": 56808,
        "Title": "Sunset Marquis Hotel -Tesla",
        "AddressLine1": "1200 Alta Loma Rd",
        "Town": "West Hollywood",
        "StateOrProvince": "CA",
        "Postcode": "90069",
        "CountryID": 2,
        "Latitude": 34.0921059,
        "Longitude": -118.3771938,
        "ContactTelephone1": "310-657-1333  877-798-3752",
        "AccessComments": "24 hours daily; for Tesla use only; for guest use only; see front desk for access",
        "RelatedURL": "http://www.teslamotors.com/supercharger",
        "DistanceUnit": 0
    },
    "Connections": [
        {
            "ID": 71219,
            "ConnectionTypeID": 30,
            "StatusTypeID": 50,
            "LevelID": 2,
            "Amps": 16,
            "Voltage": 230,
            "PowerKW": 16,
            "CurrentTypeID": 10,
            "Quantity": 6
        }
    ],
    "NumberOfPoints": 6,
    "StatusTypeID": 50,
    "DateLastStatusUpdate": "2017-01-31T21:49:00Z",
    "DataQualityLevel": 3,
    "DateCreated": "2015-11-04T08:42:00Z",
    "SubmissionStatusTypeID": 100
}