{
    "IsRecentlyVerified": false,
    "ID": 128806,
    "UUID": "AF2BF572-E148-4E07-8594-0C28E2116D5A",
    "DataProviderID": 1,
    "OperatorID": 80,
    "UsageTypeID": 4,
    "UsageCost": "0,50 €/kWh",
    "AddressInfo": {
        "ID": 129152,
        "Title": "Enel PAN Foggia Viale degli Aviatori",
        "AddressLine1": "Viale degli Aviatori",
        "Town": "Foggia",
        "StateOrProvince": "FG",
        "Postcode": "71122",
        "CountryID": 112,
        "Latitude": 41.4485834104937,
        "Longitude": 15.5451098067351,
        "RelatedURL": "https://www.enelx.com/it/it/emobility",
        "DistanceUnit": 0
    },
    "Connections": [
        {
            "ID": 180206,
            "ConnectionTypeID": 33,
            "StatusTypeID": 50,
            "LevelID": 3,
            "Amps": 120,
            "Voltage": 500,
            "PowerKW": 50,
            "CurrentTypeID": 30,
            "Quantity": 1
        },
        {
            "ID": 180207,
            "ConnectionTypeID": 2,
            "StatusTypeID": 50,
            "LevelID": 3,
            "Amps": 120,
            "Voltage": 500,
            "PowerKW": 50,
            "CurrentTypeID": 30,
            "Quantity": 1
        },
        {
            "ID": 180208,
            "ConnectionTypeID": 1036,
            "StatusTypeID": 50,
            "LevelID": 3,
            "Amps": 64,
            "Voltage": 400,
            "PowerKW": 43,
            "CurrentTypeID": 20,
            "Quantity": 1
        },
        {
            "ID": 180209,
            "ConnectionTypeID": 25,
            "StatusTypeID": 50,
            "LevelID": 2,
            "Amps": 32,
            "Voltage": 400,
            "PowerKW": 22,
            "CurrentTypeID": 20,
            "Quantity": 1
        }
    ],
    "NumberOfPoints": 2,
    "GeneralComments": "Posizione esatta da verificare",
    "StatusTypeID": 30,
    "DateLastStatusUpdate": "2020-06-21T16:27:00Z",
    "DataQualityLevel": 1,
    "DateCreated": "2019-06-28T09:53:00Z",
    "SubmissionStatusTypeID": 200
}