{
    "IsRecentlyVerified": false,
    "ID": 37733,
    "UUID": "3B0664DC-2B53-497A-A041-221B58396905",
    "DataProviderID": 26,
    "DataProvidersReference": "57014",
    "OperatorID": 78,
    "OperatorsReference": "Essent EM-NL-00000363-02-00030",
    "UsageCost": "0.00 jaarabonnement",
    "AddressInfo": {
        "ID": 38079,
        "Title": "Marnixstraat 210P",
        "AddressLine1": "Marnixstraat 210P",
        "Town": "Amsterdam",
        "Postcode": "1016 TK",
        "CountryID": 159,
        "Latitude": 52.370658,
        "Longitude": 4.87501,
        "RelatedURL": "http://www.essent.nl",
        "DistanceUnit": 0
    },
    "Connections": [
        {
            "ID": 41244,
            "ConnectionTypeID": 25,
            "LevelID": 2,
            "PowerKW": 5,
            "CurrentTypeID": 10
        },
        {
            "ID": 49234,
            "ConnectionTypeID": 25,
            "LevelID": 2,
            "PowerKW": 5,
            "CurrentTypeID": 10
        }
    ],
    "NumberOfPoints": 1,
    "StatusTypeID": 50,
    "DateLastStatusUpdate": "2016-03-03T12:39:00Z",
    "DataQualityLevel": 3,
    "DateCreated": "2015-01-09T06:07:00Z",
    "SubmissionStatusTypeID": 100
}