{
    "IsRecentlyVerified": false,
    "ID": 152688,
    "UUID": "FB985459-E8B4-41A7-A450-38B707D5A9B7",
    "DataProviderID": 28,
    "DataProvidersReference": "",
    "UsageTypeID": 5,
    "AddressInfo": {
        "ID": 153041,
        "Title": "LA VILLE AUX DAMES 2698 - Place du 8 mai 1945",
        "AddressLine1": "Place du 8 mai 1945 - 37700 LA VILLE AUX DAMES",
        "CountryID": 80,
        "Latitude": 47.387446,
        "Longitude": 0.772235,
        "AccessComments": "24/24 7/7",
        "DistanceUnit": 0
    },
    "Connections": [
        {
            "ID": 213856,
            "ConnectionTypeID": 28,
            "StatusTypeID": 50,
            "LevelID": 2,
            "PowerKW": 18,
            "CurrentTypeID": 10
        },
        {
            "ID": 213857,
            "ConnectionTypeID": 25,
            "StatusTypeID": 50,
            "LevelID": 2,
            "PowerKW": 18,
            "CurrentTypeID": 10
        }
    ],
    "GeneralComments": "www.virtaev.fr",
    "StatusTypeID": 50,
    "DateLastStatusUpdate": "2020-03-15T10:54:00Z",
    "DataQualityLevel": 2,
    "DateCreated": "2020-03-15T10:54:00Z",
    "SubmissionStatusTypeID": 100
}