{
    "IsRecentlyVerified": false,
    "ID": 38134,
    "UUID": "B6F213C9-7F74-47E4-B690-1585CB0EFAF5",
    "DataProviderID": 26,
    "DataProvidersReference": "47747",
    "OperatorID": 178,
    "OperatorsReference": "EVnetNL AL894",
    "UsageCost": "0.00 jaarabonnement",
    "AddressInfo": {
        "ID": 38480,
        "Title": "Minister van Houtenlaan",
        "AddressLine1": "Minister van Houtenlaan",
        "Town": "Velsen",
        "Postcode": "1971 JX",
        "CountryID": 159,
        "Latitude": 52.455316,
        "Longitude": 4.633277,
        "ContactTelephone1": "0800-3522365",
        "RelatedURL": "http://www.evnet.nl",
        "DistanceUnit": 0
    },
    "Connections": [
        {
            "ID": 41645,
            "ConnectionTypeID": 25,
            "LevelID": 2,
            "PowerKW": 11,
            "CurrentTypeID": 10
        }
    ],
    "NumberOfPoints": 1,
    "StatusTypeID": 50,
    "DateLastStatusUpdate": "2016-06-04T02:54:00Z",
    "DataQualityLevel": 3,
    "DateCreated": "2015-01-09T06:07:00Z",
    "SubmissionStatusTypeID": 100
}