{
    "IsRecentlyVerified": false,
    "ID": 106260,
    "UUID": "8A5B8F4C-C527-4991-A14E-F3B812E05522",
    "DataProviderID": 1,
    "OperatorID": 69,
    "UsageTypeID": 4,
    "AddressInfo": {
        "ID": 106606,
        "Title": "Sportplatz",
        "AddressLine1": "Nürtinger Straße 77",
        "Town": "Wolfschlugen",
        "StateOrProvince": "Vereinbarte Verwaltungsgemeinschaft der Stadt Nürtingen",
        "Postcode": "72649",
        "CountryID": 87,
        "Latitude": 48.6499925,
        "Longitude": 9.300086800000031,
        "AccessComments": "24/7 nutzbar, 2 rote Ladesäulen rechts von der Einfahrt",
        "DistanceUnit": 0
    },
    "Connections": [
        {
            "ID": 149605,
            "ConnectionTypeID": 25,
            "StatusTypeID": 50,
            "LevelID": 2,
            "Amps": 32,
            "Voltage": 400,
            "PowerKW": 22,
            "CurrentTypeID": 20,
            "Quantity": 4
        }
    ],
    "NumberOfPoints": 4,
    "StatusTypeID": 50,
    "DateLastStatusUpdate": "2018-06-18T08:25:00Z",
    "DataQualityLevel": 1,
    "DateCreated": "2018-06-18T08:25:00Z",
    "SubmissionStatusTypeID": 200
}