{
    "IsRecentlyVerified": false,
    "ID": 155609,
    "UUID": "2BC350E1-A340-498C-8442-AFEF65B24221",
    "DataProviderID": 1,
    "OperatorID": 3372,
    "UsageTypeID": 1,
    "UsageCost": "per EV Connect App",
    "AddressInfo": {
        "ID": 155963,
        "Title": "Washington High School",
        "AddressLine1": "Kerby Avenue",
        "Town": "Washington",
        "StateOrProvince": "OK",
        "Postcode": "73093",
        "CountryID": 2,
        "Latitude": 35.05543739541409,
        "Longitude": -97.48472551528118,
        "AccessComments": "",
        "DistanceUnit": 0
    },
    "Connections": [
        {
            "ID": 219080,
            "ConnectionTypeID": 32,
            "StatusTypeID": 50,
            "LevelID": 3,
            "PowerKW": 50,
            "CurrentTypeID": 30,
            "Quantity": 2,
            "Comments": "ABB 50kW"
        },
        {
            "ID": 219081,
            "ConnectionTypeID": 2,
            "StatusTypeID": 50,
            "LevelID": 3,
            "PowerKW": 50,
            "CurrentTypeID": 30,
            "Quantity": 2,
            "Comments": "ABB 50kW"
        }
    ],
    "NumberOfPoints": 1,
    "GeneralComments": "Use EV Connect App",
    "StatusTypeID": 50,
    "DateLastStatusUpdate": "2020-04-20T13:49:00Z",
    "DataQualityLevel": 1,
    "DateCreated": "2020-04-19T18:48:00Z",
    "SubmissionStatusTypeID": 200
}