{
    "IsRecentlyVerified": false,
    "ID": 123544,
    "UUID": "53A73EAE-8BE2-4C1F-9C84-4AD06B7D632C",
    "DataProviderID": 2,
    "DataProvidersReference": "99452",
    "OperatorID": 5,
    "UsageTypeID": 1,
    "AddressInfo": {
        "ID": 123890,
        "Title": "CHP FRESNO",
        "AddressLine1": "1380 E Fortune Ave",
        "Town": "Fresno",
        "StateOrProvince": "CA",
        "Postcode": "93725",
        "CountryID": 2,
        "Latitude": 36.689275,
        "Longitude": -119.767661,
        "ContactTelephone1": "888-758-4389",
        "AccessComments": "24 hours daily",
        "RelatedURL": "http://www.chargepoint.com/",
        "DistanceUnit": 0
    },
    "Connections": [
        {
            "ID": 173544,
            "ConnectionTypeID": 1,
            "LevelID": 2,
            "Amps": 16,
            "Voltage": 230,
            "PowerKW": 3,
            "CurrentTypeID": 10,
            "Quantity": 2
        }
    ],
    "DateLastStatusUpdate": "2019-12-24T09:13:00Z",
    "DataQualityLevel": 3,
    "DateCreated": "2019-04-06T05:03:00Z",
    "SubmissionStatusTypeID": 100
}