{
    "IsRecentlyVerified": false,
    "ID": 150901,
    "UUID": "996B44A7-37B3-464C-85D8-672EB8BE20B6",
    "DataProviderID": 28,
    "DataProvidersReference": "FR*S83*P83146*A",
    "UsageTypeID": 5,
    "AddressInfo": {
        "ID": 151254,
        "Title": "LA VERDIERE_Route De Varage",
        "AddressLine1": "Route De Varage 83560 LA VERDIERE",
        "CountryID": 80,
        "Latitude": 43.636472,
        "Longitude": 5.935913,
        "AccessComments": "24/24 7/7 jours",
        "DistanceUnit": 0
    },
    "Connections": [
        {
            "ID": 210234,
            "ConnectionTypeID": 28,
            "StatusTypeID": 50,
            "LevelID": 2,
            "PowerKW": 22,
            "CurrentTypeID": 10
        },
        {
            "ID": 210235,
            "ConnectionTypeID": 1036,
            "StatusTypeID": 50,
            "LevelID": 2,
            "PowerKW": 22,
            "CurrentTypeID": 20
        },
        {
            "ID": 239986,
            "ConnectionTypeID": 28,
            "StatusTypeID": 50,
            "LevelID": 2,
            "PowerKW": 22,
            "CurrentTypeID": 10
        },
        {
            "ID": 239987,
            "ConnectionTypeID": 1036,
            "StatusTypeID": 50,
            "LevelID": 2,
            "PowerKW": 22,
            "CurrentTypeID": 20
        }
    ],
    "GeneralComments": "",
    "StatusTypeID": 50,
    "DateLastStatusUpdate": "2020-08-27T05:11:00Z",
    "DataQualityLevel": 2,
    "DateCreated": "2020-03-15T06:17:00Z",
    "SubmissionStatusTypeID": 100
}