{
    "IsRecentlyVerified": false,
    "ID": 115660,
    "UUID": "A6EE995F-6AC3-4FFC-81AC-35CA761B916E",
    "DataProviderID": 2,
    "DataProvidersReference": "105208",
    "OperatorID": 5,
    "UsageTypeID": 1,
    "AddressInfo": {
        "ID": 116006,
        "Title": "LG&E",
        "AddressLine1": "NA CHENOWETH PARK RD",
        "Town": "Louisville",
        "StateOrProvince": "KY",
        "Postcode": "40299",
        "CountryID": 2,
        "Latitude": 38.1704155,
        "Longitude": -85.562259,
        "ContactTelephone1": "888-758-4389",
        "AccessComments": "24 hours daily",
        "RelatedURL": "http://www.chargepoint.com/",
        "DistanceUnit": 0
    },
    "Connections": [
        {
            "ID": 162688,
            "ConnectionTypeID": 1,
            "LevelID": 2,
            "Amps": 16,
            "Voltage": 230,
            "PowerKW": 3,
            "CurrentTypeID": 10,
            "Quantity": 2
        }
    ],
    "DateLastStatusUpdate": "2019-04-06T04:02:00Z",
    "DataQualityLevel": 3,
    "DateCreated": "2019-02-11T07:13:00Z",
    "SubmissionStatusTypeID": 100
}