{
    "IsRecentlyVerified": false,
    "ID": 139648,
    "UUID": "1F33EBB0-66AE-4773-83BB-BB781B80DB10",
    "DataProviderID": 2,
    "DataProvidersReference": "95679",
    "OperatorID": 9,
    "UsageTypeID": 2,
    "AddressInfo": {
        "ID": 140000,
        "Title": "Autry Rear Lot",
        "AddressLine1": "10202 West Washington Boulevard",
        "Town": "Culver City",
        "StateOrProvince": "CA",
        "Postcode": "90232",
        "CountryID": 2,
        "Latitude": 34.018075,
        "Longitude": -118.399471,
        "ContactTelephone1": "888-998-2546",
        "AccessComments": "MON: 24 hours | TUE: 24 hours | WED: 24 hours | THU: 24 hours | FRI: 24 hours | SAT: 24 hours | SUN: 24 hours",
        "RelatedURL": "http://www.blinkcharging.com/",
        "DistanceUnit": 0
    },
    "Connections": [
        {
            "ID": 195076,
            "ConnectionTypeID": 1,
            "LevelID": 2,
            "Amps": 16,
            "Voltage": 230,
            "PowerKW": 3.7,
            "CurrentTypeID": 10,
            "Quantity": 9
        }
    ],
    "StatusTypeID": 50,
    "DateLastStatusUpdate": "2020-06-26T02:56:00Z",
    "DataQualityLevel": 3,
    "DateCreated": "2019-12-24T09:11:00Z",
    "SubmissionStatusTypeID": 100
}