{
    "IsRecentlyVerified": false,
    "ID": 64574,
    "UUID": "8C178111-3807-420F-89EC-FC62D5A9DE31",
    "DataProviderID": 1,
    "OperatorID": 98,
    "UsageTypeID": 4,
    "AddressInfo": {
        "ID": 64920,
        "Title": "Reitter Wasserkraftanlagen",
        "AddressLine1": "Bahnhofstraße 15",
        "Town": "Rechtenstein",
        "StateOrProvince": "Alb-Donau-Kreis",
        "Postcode": "89611",
        "CountryID": 87,
        "Latitude": 48.2405918,
        "Longitude": 9.552649100000053,
        "ContactTelephone1": "+49 7375 212",
        "ContactEmail": "info@reitter-wasserkraft.de",
        "AccessComments": "Direktleitung vom nahe liegenden Wasserkraftwerk + PV-Anlage zur Box F-274 mit 2 Stellplätzen",
        "DistanceUnit": 0
    },
    "Connections": [
        {
            "ID": 82962,
            "ConnectionTypeID": 17,
            "StatusTypeID": 50,
            "LevelID": 2,
            "Amps": 16,
            "Voltage": 400,
            "PowerKW": 11,
            "CurrentTypeID": 20,
            "Quantity": 1
        },
        {
            "ID": 82963,
            "ConnectionTypeID": 16,
            "StatusTypeID": 50,
            "LevelID": 2,
            "Amps": 16,
            "Voltage": 230,
            "PowerKW": 3.7,
            "CurrentTypeID": 10,
            "Quantity": 1
        },
        {
            "ID": 82964,
            "ConnectionTypeID": 28,
            "StatusTypeID": 50,
            "LevelID": 2,
            "Amps": 16,
            "Voltage": 230,
            "PowerKW": 2.7,
            "CurrentTypeID": 10,
            "Quantity": 1
        }
    ],
    "NumberOfPoints": 2,
    "StatusTypeID": 50,
    "DateLastStatusUpdate": "2016-03-11T11:02:00Z",
    "DataQualityLevel": 1,
    "DateCreated": "2016-03-11T11:02:00Z",
    "SubmissionStatusTypeID": 200
}