{
    "IsRecentlyVerified": false,
    "ID": 144708,
    "UUID": "6EC2EEED-F3D0-4CEA-9B14-A43B2A6A14E1",
    "DataProviderID": 2,
    "DataProvidersReference": "129755",
    "OperatorID": 89,
    "UsageTypeID": 1,
    "AddressInfo": {
        "ID": 145060,
        "Title": "FLO - Cadillac Fairview - Carrefour Laval",
        "AddressLine1": "3003 boul. Le Carrefour",
        "Town": "Laval",
        "StateOrProvince": "QC",
        "Postcode": "H7T 1C7",
        "CountryID": 44,
        "Latitude": 45.569338,
        "Longitude": -73.750055,
        "ContactTelephone1": "888-356-8911",
        "AccessComments": "24 hours daily",
        "RelatedURL": "https://flo.ca/",
        "DistanceUnit": 0
    },
    "Connections": [
        {
            "ID": 201225,
            "ConnectionTypeID": 1,
            "LevelID": 2,
            "Amps": 16,
            "Voltage": 230,
            "PowerKW": 3.7,
            "CurrentTypeID": 10,
            "Quantity": 2
        },
        {
            "ID": 201226,
            "ConnectionTypeID": 2,
            "LevelID": 3,
            "Amps": 100,
            "Voltage": 400,
            "PowerKW": 40,
            "CurrentTypeID": 30,
            "Quantity": 1
        },
        {
            "ID": 201227,
            "ConnectionTypeID": 32,
            "LevelID": 3,
            "Amps": 100,
            "Voltage": 400,
            "PowerKW": 40,
            "CurrentTypeID": 30,
            "Quantity": 1
        }
    ],
    "StatusTypeID": 50,
    "DateLastStatusUpdate": "2020-06-26T03:09:00Z",
    "DataQualityLevel": 3,
    "DateCreated": "2019-12-24T09:23:00Z",
    "SubmissionStatusTypeID": 100
}