{
    "IsRecentlyVerified": false,
    "ID": 177304,
    "UUID": "F7F730BD-3707-41CC-82BE-B475985A152C",
    "DataProviderID": 29,
    "DataProvidersReference": "18887",
    "OperatorID": 45,
    "AddressInfo": {
        "ID": 177663,
        "Title": "Kleine Industriestr. 5",
        "AddressLine1": "Kleine Industriestr. 5",
        "Town": "Bad Hersfeld",
        "Postcode": "36251",
        "CountryID": 87,
        "Latitude": 50.864144,
        "Longitude": 9.717321,
        "DistanceUnit": 0
    },
    "Connections": [
        {
            "ID": 276301,
            "ConnectionTypeID": 25,
            "StatusTypeID": 50,
            "LevelID": 2,
            "PowerKW": 22,
            "CurrentTypeID": 20
        },
        {
            "ID": 276302,
            "ConnectionTypeID": 25,
            "StatusTypeID": 50,
            "LevelID": 2,
            "PowerKW": 22,
            "CurrentTypeID": 20
        }
    ],
    "StatusTypeID": 0,
    "DateLastStatusUpdate": "2021-07-12T02:45:00Z",
    "MetadataValues": [
        {
            "ID": 9598,
            "MetadataFieldID": 4,
            "ItemValue": "Data from the German chargepoint registry provided by Bundesnetzagentur.de under the CC-BY 4.0 license"
        }
    ],
    "DataQualityLevel": 3,
    "DateCreated": "2021-07-08T09:48:00Z",
    "SubmissionStatusTypeID": 100
}