{
    "IsRecentlyVerified": false,
    "ID": 115537,
    "UUID": "D8B1F326-1B4C-4C67-9202-E4BB3D713F6A",
    "DataProviderID": 2,
    "DataProvidersReference": "113233",
    "OperatorID": 23,
    "UsageTypeID": 1,
    "AddressInfo": {
        "ID": 115883,
        "Title": "Booker Vineyard & Winery - Tesla Destination",
        "AddressLine1": "2640 Anderson Rd",
        "Town": "Paso Robles",
        "StateOrProvince": "CA",
        "Postcode": "93446",
        "CountryID": 2,
        "Latitude": 35.584431,
        "Longitude": -120.737259,
        "ContactTelephone1": "805-237-7367  877-798-3752",
        "AccessComments": "24 hours daily; for Tesla use only; for customer use only",
        "RelatedURL": "https://www.tesla.com/destination-charging",
        "DistanceUnit": 0
    },
    "Connections": [
        {
            "ID": 162554,
            "ConnectionTypeID": 0,
            "LevelID": 2,
            "Amps": 16,
            "Voltage": 230,
            "PowerKW": 3,
            "CurrentTypeID": 10,
            "Quantity": 2
        }
    ],
    "DateLastStatusUpdate": "2019-04-06T04:02:00Z",
    "DataQualityLevel": 3,
    "DateCreated": "2019-02-11T07:13:00Z",
    "SubmissionStatusTypeID": 100
}