{
    "UserComments": [
        {
            "ID": 14055,
            "ChargePointID": 33493,
            "CommentTypeID": 10,
            "UserName": "Bert van Sas",
            "Rating": 4,
            "DateCreated": "2016-08-13T21:19:01.2Z",
            "User": {
                "ID": 11617,
                "Username": "Bert van Sas"
            },
            "CheckinStatusTypeID": 140
        }
    ],
    "MediaItems": [
        {
            "ID": 8054,
            "ChargePointID": 33493,
            "ItemURL": "https://s3-ap-southeast-2.amazonaws.com/openchargemap/images/NL/OCM33493/OCM-33493.orig.2016081321403757.jpg",
            "ItemThumbnailURL": "https://s3-ap-southeast-2.amazonaws.com/openchargemap/images/NL/OCM33493/OCM-33493.thmb.2016081321403757.jpg",
            "Comment": "",
            "IsEnabled": true,
            "IsVideo": false,
            "IsFeaturedItem": false,
            "IsExternalResource": false,
            "User": {
                "ID": 11617,
                "Username": "Bert van Sas"
            },
            "DateCreated": "2016-08-13T21:41:00Z"
        },
        {
            "ID": 8055,
            "ChargePointID": 33493,
            "ItemURL": "https://s3-ap-southeast-2.amazonaws.com/openchargemap/images/NL/OCM33493/OCM-33493.orig.2016081321410028.jpg",
            "ItemThumbnailURL": "https://s3-ap-southeast-2.amazonaws.com/openchargemap/images/NL/OCM33493/OCM-33493.thmb.2016081321410028.jpg",
            "Comment": "",
            "IsEnabled": true,
            "IsVideo": false,
            "IsFeaturedItem": false,
            "IsExternalResource": false,
            "User": {
                "ID": 11617,
                "Username": "Bert van Sas"
            },
            "DateCreated": "2016-08-13T21:41:00Z"
        },
        {
            "ID": 8052,
            "ChargePointID": 33493,
            "ItemURL": "https://s3-ap-southeast-2.amazonaws.com/openchargemap/images/NL/OCM33493/OCM-33493.orig.2016081321395601.jpg",
            "ItemThumbnailURL": "https://s3-ap-southeast-2.amazonaws.com/openchargemap/images/NL/OCM33493/OCM-33493.thmb.2016081321395601.jpg",
            "Comment": "",
            "IsEnabled": true,
            "IsVideo": false,
            "IsFeaturedItem": false,
            "IsExternalResource": false,
            "User": {
                "ID": 11617,
                "Username": "Bert van Sas"
            },
            "DateCreated": "2016-08-13T21:40:00Z"
        },
        {
            "ID": 8053,
            "ChargePointID": 33493,
            "ItemURL": "https://s3-ap-southeast-2.amazonaws.com/openchargemap/images/NL/OCM33493/OCM-33493.orig.2016081321401753.jpg",
            "ItemThumbnailURL": "https://s3-ap-southeast-2.amazonaws.com/openchargemap/images/NL/OCM33493/OCM-33493.thmb.2016081321401753.jpg",
            "Comment": "",
            "IsEnabled": true,
            "IsVideo": false,
            "IsFeaturedItem": false,
            "IsExternalResource": false,
            "User": {
                "ID": 11617,
                "Username": "Bert van Sas"
            },
            "DateCreated": "2016-08-13T21:40:00Z"
        }
    ],
    "IsRecentlyVerified": false,
    "ID": 33493,
    "UUID": "627D433D-3A90-49FD-80E8-37B66FB8D2AD",
    "DataProviderID": 1,
    "OperatorID": 178,
    "OperatorsReference": "EVnetNL AL566",
    "UsageCost": "0.00 jaarabonnement",
    "AddressInfo": {
        "ID": 33839,
        "Title": "Parking Hoofdpoortstraat Zierikzee",
        "AddressLine1": "Laan van Sint Hilaire",
        "Town": "Schouwen-Duiveland",
        "Postcode": "4301 AV",
        "CountryID": 159,
        "Latitude": 51.647275,
        "Longitude": 3.915572,
        "ContactTelephone1": "0800-3522365",
        "AccessComments": "Entree parking bij T-splitsing van Laan van St.Hillaire en Hoofdpoortstraat",
        "RelatedURL": "http://www.evnet.nl",
        "DistanceUnit": 0
    },
    "Connections": [
        {
            "ID": 37004,
            "ConnectionTypeID": 25,
            "StatusTypeID": 50,
            "LevelID": 2,
            "PowerKW": 11,
            "CurrentTypeID": 10,
            "Quantity": 2
        }
    ],
    "NumberOfPoints": 2,
    "StatusTypeID": 50,
    "DateLastStatusUpdate": "2016-08-13T22:20:00Z",
    "DataQualityLevel": 3,
    "DateCreated": "2015-01-09T06:04:00Z",
    "SubmissionStatusTypeID": 100
}