{
    "MediaItems": [
        {
            "ID": 1760,
            "ChargePointID": 49212,
            "ItemURL": "https://s3-ap-southeast-2.amazonaws.com/openchargemap/images/NL/OCM49212/OCM-49212.orig.2015071405153853.jpg",
            "ItemThumbnailURL": "https://s3-ap-southeast-2.amazonaws.com/openchargemap/images/NL/OCM49212/OCM-49212.thmb.2015071405153853.jpg",
            "Comment": "",
            "IsEnabled": true,
            "IsVideo": false,
            "IsFeaturedItem": false,
            "IsExternalResource": false,
            "User": {
                "ID": 5002,
                "Username": "Matthijs Van der Bogt"
            },
            "DateCreated": "2015-07-14T05:16:00Z"
        },
        {
            "ID": 1759,
            "ChargePointID": 49212,
            "ItemURL": "https://s3-ap-southeast-2.amazonaws.com/openchargemap/images/NL/OCM49212/OCM-49212.orig.2015071405150508.jpg",
            "ItemThumbnailURL": "https://s3-ap-southeast-2.amazonaws.com/openchargemap/images/NL/OCM49212/OCM-49212.thmb.2015071405150508.jpg",
            "Comment": "",
            "IsEnabled": true,
            "IsVideo": false,
            "IsFeaturedItem": false,
            "IsExternalResource": false,
            "User": {
                "ID": 5002,
                "Username": "Matthijs Van der Bogt"
            },
            "DateCreated": "2015-07-14T05:15:00Z"
        },
        {
            "ID": 1758,
            "ChargePointID": 49212,
            "ItemURL": "https://s3-ap-southeast-2.amazonaws.com/openchargemap/images/NL/OCM49212/OCM-49212.orig.2015071405135336.jpg",
            "ItemThumbnailURL": "https://s3-ap-southeast-2.amazonaws.com/openchargemap/images/NL/OCM49212/OCM-49212.thmb.2015071405135336.jpg",
            "Comment": "",
            "IsEnabled": true,
            "IsVideo": false,
            "IsFeaturedItem": false,
            "IsExternalResource": false,
            "User": {
                "ID": 5002,
                "Username": "Matthijs Van der Bogt"
            },
            "DateCreated": "2015-07-14T05:14:00Z"
        }
    ],
    "IsRecentlyVerified": false,
    "ID": 49212,
    "UUID": "7D118370-E2D3-495B-80E7-7CEFD38E3A58",
    "DataProviderID": 1,
    "OperatorID": 73,
    "UsageTypeID": 6,
    "AddressInfo": {
        "ID": 49558,
        "Title": "Pampuslaan 104",
        "AddressLine1": "Pampuslaan 104",
        "Town": "Weesp",
        "StateOrProvince": "Noord Holland",
        "Postcode": "1382JR",
        "CountryID": 159,
        "Latitude": 52.3127861,
        "Longitude": 5.02522699999997,
        "RelatedURL": "http://www.ev-box.com",
        "DistanceUnit": 0
    },
    "Connections": [
        {
            "ID": 60824,
            "ConnectionTypeID": 25,
            "StatusTypeID": 75,
            "LevelID": 2,
            "PowerKW": 3.7,
            "CurrentTypeID": 10,
            "Quantity": 1
        },
        {
            "ID": 60825,
            "ConnectionTypeID": 25,
            "StatusTypeID": 75,
            "LevelID": 2,
            "PowerKW": 3.7,
            "CurrentTypeID": 10,
            "Quantity": 1
        },
        {
            "ID": 60826,
            "ConnectionTypeID": 25,
            "StatusTypeID": 75,
            "LevelID": 2,
            "PowerKW": 3.7,
            "CurrentTypeID": 10,
            "Quantity": 1
        }
    ],
    "NumberOfPoints": 3,
    "GeneralComments": "Publicly accessible after business hours. Notice required.",
    "StatusTypeID": 50,
    "DateLastStatusUpdate": "2015-07-14T16:48:00Z",
    "DataQualityLevel": 1,
    "DateCreated": "2015-07-14T05:10:00Z",
    "SubmissionStatusTypeID": 200
}