{
    "IsRecentlyVerified": false,
    "ID": 180828,
    "UUID": "23BDB115-AE0F-4D59-AB37-AD4CA729F31E",
    "DataProviderID": 29,
    "DataProvidersReference": "19996",
    "OperatorID": 234,
    "AddressInfo": {
        "ID": 181187,
        "Title": "Stadtsteinacher Straße 1",
        "AddressLine1": "Stadtsteinacher Straße 1",
        "Town": "Presseck",
        "Postcode": "95355",
        "CountryID": 87,
        "Latitude": 50.22687,
        "Longitude": 11.55435,
        "DistanceUnit": 0
    },
    "Connections": [
        {
            "ID": 284414,
            "ConnectionTypeID": 25,
            "StatusTypeID": 50,
            "LevelID": 2,
            "PowerKW": 22,
            "CurrentTypeID": 20
        },
        {
            "ID": 284415,
            "ConnectionTypeID": 25,
            "StatusTypeID": 50,
            "LevelID": 2,
            "PowerKW": 22,
            "CurrentTypeID": 20
        }
    ],
    "StatusTypeID": 50,
    "DateLastStatusUpdate": "2021-07-12T02:44:00Z",
    "MetadataValues": [
        {
            "ID": 13122,
            "MetadataFieldID": 4,
            "ItemValue": "Data from the German chargepoint registry provided by Bundesnetzagentur.de under the CC-BY 4.0 license"
        }
    ],
    "DataQualityLevel": 3,
    "DateCreated": "2021-07-08T10:01:00Z",
    "SubmissionStatusTypeID": 100
}