{
    "IsRecentlyVerified": false,
    "ID": 145784,
    "UUID": "AB49F1F8-0B73-437C-BCFA-F91CF3C0DE4F",
    "DataProviderID": 2,
    "DataProvidersReference": "149650",
    "OperatorID": 90,
    "UsageTypeID": 1,
    "AddressInfo": {
        "ID": 146136,
        "Title": "Bibliothèque municipale de Chibougamau",
        "AddressLine1": "601 3e rue",
        "Town": "Chibougamau",
        "StateOrProvince": "QC",
        "Postcode": "G8P 1N8",
        "CountryID": 44,
        "Latitude": 49.91407,
        "Longitude": -74.367201,
        "ContactTelephone1": "877-505-2674",
        "AccessComments": "24 hours daily",
        "RelatedURL": "https://lecircuitelectrique.com/",
        "DistanceUnit": 0
    },
    "Connections": [
        {
            "ID": 202527,
            "ConnectionTypeID": 1,
            "LevelID": 2,
            "Amps": 16,
            "Voltage": 230,
            "PowerKW": 3.7,
            "CurrentTypeID": 10,
            "Quantity": 4
        }
    ],
    "StatusTypeID": 50,
    "DateLastStatusUpdate": "2020-06-26T03:12:00Z",
    "DataQualityLevel": 3,
    "DateCreated": "2019-12-24T09:25:00Z",
    "SubmissionStatusTypeID": 100
}