{
    "IsRecentlyVerified": false,
    "ID": 120605,
    "UUID": "7E0A539E-927E-4235-9ED2-1EB9169D1718",
    "DataProviderID": 2,
    "DataProvidersReference": "6384",
    "UsageTypeID": 1,
    "AddressInfo": {
        "ID": 120951,
        "Title": "San Diego Wild Animal Park",
        "AddressLine1": "15500 San Pasqual Valley Rd",
        "Town": "Escondido",
        "StateOrProvince": "CA",
        "Postcode": "92027",
        "CountryID": 2,
        "Latitude": 33.098589,
        "Longitude": -117.004433,
        "ContactTelephone1": "760-747-8702",
        "AccessComments": "24 hours daily",
        "RelatedURL": "",
        "DistanceUnit": 0
    },
    "Connections": [
        {
            "ID": 169965,
            "ConnectionTypeID": 1,
            "LevelID": 2,
            "Amps": 16,
            "Voltage": 230,
            "PowerKW": 3.7,
            "CurrentTypeID": 10,
            "Quantity": 2
        }
    ],
    "DateLastStatusUpdate": "2020-06-26T02:55:00Z",
    "DataQualityLevel": 3,
    "DateCreated": "2019-04-01T04:59:00Z",
    "SubmissionStatusTypeID": 100
}