{
    "IsRecentlyVerified": false,
    "ID": 154141,
    "UUID": "D7FFA212-A88A-416C-BE7E-84E2FB070083",
    "DataProviderID": 28,
    "DataProvidersReference": "FR*S27*PAUTHEVERNES*DERLY",
    "UsageTypeID": 5,
    "AddressInfo": {
        "ID": 154494,
        "Title": "900072",
        "AddressLine1": "Parking de Derly Rue du Relais Thilliers en Vexin/Authevernes",
        "CountryID": 80,
        "Latitude": 49.23479,
        "Longitude": 1.612249,
        "AccessComments": "24/24 7/7 jours",
        "DistanceUnit": 0
    },
    "Connections": [
        {
            "ID": 216632,
            "ConnectionTypeID": 28,
            "StatusTypeID": 50,
            "LevelID": 2,
            "PowerKW": 22,
            "CurrentTypeID": 10
        },
        {
            "ID": 216633,
            "ConnectionTypeID": 1036,
            "StatusTypeID": 50,
            "LevelID": 2,
            "PowerKW": 22,
            "CurrentTypeID": 20
        },
        {
            "ID": 251005,
            "ConnectionTypeID": 28,
            "StatusTypeID": 50,
            "LevelID": 2,
            "PowerKW": 22,
            "CurrentTypeID": 10
        },
        {
            "ID": 251006,
            "ConnectionTypeID": 1036,
            "StatusTypeID": 50,
            "LevelID": 2,
            "PowerKW": 22,
            "CurrentTypeID": 20
        }
    ],
    "GeneralComments": "Borne en service",
    "StatusTypeID": 50,
    "DateLastStatusUpdate": "2020-08-27T05:16:00Z",
    "DataQualityLevel": 2,
    "DateCreated": "2020-03-15T10:54:00Z",
    "SubmissionStatusTypeID": 100
}