{
    "IsRecentlyVerified": false,
    "ID": 107522,
    "UUID": "D5DFDD8E-1142-4269-A756-E37AA543A638",
    "DataProviderID": 1,
    "OperatorID": 3378,
    "UsageTypeID": 5,
    "AddressInfo": {
        "ID": 107868,
        "Title": "Budapest, Külső Váci út (MOL)",
        "AddressLine1": "Váci út 84.",
        "Town": "Budapest",
        "StateOrProvince": "Budapest",
        "Postcode": "1044",
        "CountryID": 104,
        "Latitude": 47.574959048441386,
        "Longitude": 19.080711352114804,
        "ContactTelephone1": "+36 1 881-8111",
        "ContactEmail": "info@molplugee.hu",
        "RelatedURL": "https://molplugee.hu/",
        "DistanceUnit": 0
    },
    "Connections": [
        {
            "ID": 151702,
            "ConnectionTypeID": 2,
            "StatusTypeID": 150,
            "LevelID": 3,
            "Amps": 125,
            "Voltage": 500,
            "PowerKW": 50,
            "CurrentTypeID": 30,
            "Quantity": 1
        },
        {
            "ID": 151703,
            "ConnectionTypeID": 33,
            "StatusTypeID": 150,
            "LevelID": 3,
            "Amps": 125,
            "Voltage": 500,
            "PowerKW": 50,
            "CurrentTypeID": 30,
            "Quantity": 1
        },
        {
            "ID": 151704,
            "ConnectionTypeID": 1036,
            "StatusTypeID": 150,
            "LevelID": 2,
            "Amps": 32,
            "Voltage": 400,
            "PowerKW": 22,
            "CurrentTypeID": 20,
            "Quantity": 1
        }
    ],
    "NumberOfPoints": 2,
    "GeneralComments": "ABB_Terra_53",
    "StatusTypeID": 150,
    "DateLastStatusUpdate": "2020-07-08T15:39:00Z",
    "DataQualityLevel": 1,
    "DateCreated": "2018-08-01T02:18:00Z",
    "SubmissionStatusTypeID": 200
}