{
    "IsRecentlyVerified": false,
    "ID": 95860,
    "UUID": "27630C84-4652-4568-9F96-7F63F9E8E53A",
    "DataProviderID": 1,
    "OperatorID": 103,
    "UsageTypeID": 4,
    "AddressInfo": {
        "ID": 96206,
        "Title": "Supermarkt Real",
        "AddressLine1": "Mainzer Straße 6",
        "Town": "Germersheim",
        "StateOrProvince": "Landkreis Germersheim",
        "Postcode": "76726",
        "CountryID": 87,
        "Latitude": 49.228605140671405,
        "Longitude": 8.36753425714722,
        "AccessComments": "24/7 nutzbar",
        "DistanceUnit": 0
    },
    "Connections": [
        {
            "ID": 135790,
            "ConnectionTypeID": 33,
            "StatusTypeID": 50,
            "LevelID": 3,
            "PowerKW": 50,
            "CurrentTypeID": 30,
            "Quantity": 1
        },
        {
            "ID": 135791,
            "ConnectionTypeID": 2,
            "StatusTypeID": 50,
            "LevelID": 3,
            "PowerKW": 50,
            "CurrentTypeID": 30,
            "Quantity": 1
        },
        {
            "ID": 135792,
            "ConnectionTypeID": 1036,
            "StatusTypeID": 50,
            "LevelID": 3,
            "Amps": 63,
            "Voltage": 400,
            "PowerKW": 43,
            "CurrentTypeID": 20,
            "Quantity": 1
        }
    ],
    "NumberOfPoints": 3,
    "StatusTypeID": 50,
    "DateLastStatusUpdate": "2017-11-28T07:28:00Z",
    "DataQualityLevel": 1,
    "DateCreated": "2017-11-28T07:28:00Z",
    "SubmissionStatusTypeID": 200
}