{
    "IsRecentlyVerified": false,
    "ID": 91605,
    "UUID": "3EC5BCB3-06F6-43F6-A221-F5ED5B796091",
    "DataProviderID": 1,
    "OperatorID": 156,
    "UsageTypeID": 4,
    "AddressInfo": {
        "ID": 91951,
        "Title": "Aldi / Neuer Postweg",
        "AddressLine1": "Neuer Postweg",
        "Town": "Großhansdorf",
        "StateOrProvince": "Kreis Stormarn",
        "Postcode": "22927",
        "CountryID": 87,
        "Latitude": 53.6613089316957,
        "Longitude": 10.2853731177215,
        "AccessComments": "Zwei 24/7 verfügbare New Motion lolo Boxen an einem Pfahl am blauen Schild \"Reserviert für ELektrofahrzeuge, Lage ist am Ende des Stichwegs \"Neuer Postweg\", am Penny vorbei.",
        "RelatedURL": "http://www.abendblatt.de/region/stormarn/article211399931/Auch-Grosshansdorf-hat-jetzt-eine-E-Tankstelle.html",
        "DistanceUnit": 0
    },
    "Connections": [
        {
            "ID": 129865,
            "ConnectionTypeID": 25,
            "StatusTypeID": 50,
            "LevelID": 2,
            "Amps": 32,
            "Voltage": 400,
            "PowerKW": 22,
            "CurrentTypeID": 20,
            "Quantity": 2
        }
    ],
    "NumberOfPoints": 2,
    "StatusTypeID": 50,
    "DateLastStatusUpdate": "2017-08-08T10:00:00Z",
    "DataQualityLevel": 1,
    "DateCreated": "2017-08-08T09:59:00Z",
    "SubmissionStatusTypeID": 200
}