{
    "IsRecentlyVerified": false,
    "ID": 88717,
    "UUID": "A5F7D553-F6D6-4E63-B6F5-73D7B4AA1183",
    "DataProviderID": 1,
    "DataProvidersReference": "4111",
    "AddressInfo": {
        "ID": 89063,
        "Title": "Flottiljgatan 61, Västerås",
        "AddressLine1": "Flottiljgatan 61",
        "Town": "VÄSTERÅS",
        "StateOrProvince": "VÄSTMANLAND",
        "Postcode": "72131",
        "CountryID": 216,
        "Latitude": 59.590269,
        "Longitude": 16.622654,
        "AccessComments": "På husväggen vid källaringången",
        "DistanceUnit": 0
    },
    "Connections": [
        {
            "ID": 125924,
            "ConnectionTypeID": 0,
            "Reference": "1",
            "LevelID": 2,
            "Amps": 16,
            "Voltage": 400,
            "PowerKW": 11,
            "Comments": "Mode 3"
        },
        {
            "ID": 125925,
            "ConnectionTypeID": 0,
            "Reference": "2",
            "LevelID": 2,
            "Amps": 16,
            "Voltage": 400,
            "PowerKW": 11,
            "Comments": "Mode 3"
        }
    ],
    "NumberOfPoints": 2,
    "DateLastStatusUpdate": "2020-05-26T08:23:00Z",
    "DataQualityLevel": 2,
    "DateCreated": "2017-06-09T11:08:00Z",
    "SubmissionStatusTypeID": 100
}