{
    "IsRecentlyVerified": false,
    "ID": 101487,
    "UUID": "83E9B5D1-0BA0-4239-A420-7D8F6C58DDA5",
    "DataProviderID": 1,
    "OperatorID": 23,
    "OperatorsReference": "41742",
    "UsageTypeID": 4,
    "AddressInfo": {
        "ID": 101833,
        "Title": "Derby Wine Estates Tasting Room",
        "AddressLine1": "525 Riverside Ave",
        "Town": "Paso Robles",
        "StateOrProvince": "California",
        "Postcode": "93446",
        "CountryID": 2,
        "Latitude": 35.620301,
        "Longitude": -120.686952,
        "ContactTelephone1": "(805) 238-6300",
        "DistanceUnit": 0
    },
    "Connections": [
        {
            "ID": 143296,
            "ConnectionTypeID": 30,
            "StatusTypeID": 50,
            "LevelID": 2,
            "PowerKW": 8,
            "CurrentTypeID": 10,
            "Quantity": 2
        }
    ],
    "NumberOfPoints": 2,
    "GeneralComments": "2 Tesla Connectors, up to 8kW.Available for customers. Please call ahead.",
    "StatusTypeID": 50,
    "DateLastStatusUpdate": "2018-03-30T05:42:00Z",
    "DataQualityLevel": 1,
    "DateCreated": "2018-03-30T05:42:00Z",
    "SubmissionStatusTypeID": 200
}