{
    "IsRecentlyVerified": false,
    "ID": 108838,
    "UUID": "F0C7FD2F-08D9-486F-8E04-8EF478381B95",
    "DataProviderID": 1,
    "OperatorID": 23,
    "OperatorsReference": "44560",
    "UsageTypeID": 4,
    "AddressInfo": {
        "ID": 109184,
        "Title": "Manor By the Lake",
        "AddressLine1": "Hatherley LN",
        "Town": "Cheltenham",
        "Postcode": "GL51 6PN",
        "CountryID": 1,
        "Latitude": 51.892218,
        "Longitude": -2.126606,
        "ContactTelephone1": "+44 124 224 5071",
        "DistanceUnit": 0
    },
    "Connections": [
        {
            "ID": 153955,
            "ConnectionTypeID": 30,
            "StatusTypeID": 50,
            "LevelID": 2,
            "PowerKW": 13,
            "CurrentTypeID": 20,
            "Quantity": 2
        }
    ],
    "NumberOfPoints": 2,
    "GeneralComments": "2 Tesla Connectors, up to 13kW.Available for customers. Self park.",
    "StatusTypeID": 50,
    "DateLastStatusUpdate": "2018-10-11T12:49:00Z",
    "DataQualityLevel": 1,
    "DateCreated": "2018-10-11T12:49:00Z",
    "SubmissionStatusTypeID": 200
}