{
    "IsRecentlyVerified": false,
    "ID": 89887,
    "UUID": "7849A988-591F-49E2-B286-05E42A8B04FB",
    "DataProviderID": 1,
    "OperatorID": 220,
    "OperatorsReference": "4054",
    "UsageTypeID": 1,
    "UsageCost": "€1.73 + €0.3213/kWh; Andere Tarife möglich",
    "AddressInfo": {
        "ID": 90233,
        "Title": "Alsterdorfer Straße 9",
        "AddressLine1": "Alsterdorfer Straße 9",
        "Town": "HH-Nord",
        "StateOrProvince": "Hamburg",
        "Postcode": "22299",
        "CountryID": 87,
        "Latitude": 53.59539,
        "Longitude": 9.99807,
        "DistanceUnit": 0
    },
    "Connections": [
        {
            "ID": 127419,
            "ConnectionTypeID": 25,
            "StatusTypeID": 50,
            "LevelID": 2,
            "Amps": 32,
            "Voltage": 400,
            "PowerKW": 22,
            "CurrentTypeID": 20,
            "Quantity": 2
        },
        {
            "ID": 127422,
            "ConnectionTypeID": 28,
            "StatusTypeID": 50,
            "LevelID": 2,
            "Amps": 16,
            "Voltage": 230,
            "PowerKW": 3.7,
            "CurrentTypeID": 10,
            "Quantity": 2
        }
    ],
    "NumberOfPoints": 2,
    "StatusTypeID": 50,
    "DateLastStatusUpdate": "2017-07-01T05:51:00Z",
    "DataQualityLevel": 1,
    "DateCreated": "2017-06-29T05:51:00Z",
    "SubmissionStatusTypeID": 200
}