{
    "IsRecentlyVerified": false,
    "ID": 157952,
    "UUID": "6398223E-8363-476C-8B80-734F23718CE1",
    "DataProviderID": 1,
    "OperatorID": 32,
    "UsageTypeID": 4,
    "UsageCost": "15p/kWh using Polar Plus 30p/kWh using contactless, minimum fee of £1.50",
    "AddressInfo": {
        "ID": 158306,
        "Title": "Toby Carvery Chelmsford",
        "AddressLine1": "Dukes Ln",
        "Town": "Chelmsford",
        "StateOrProvince": "England",
        "Postcode": "CM2 6AD",
        "CountryID": 1,
        "Latitude": 51.740055205654784,
        "Longitude": 0.4987342079091377,
        "RelatedURL": "http://www.polar-network.com",
        "DistanceUnit": 0
    },
    "Connections": [
        {
            "ID": 227655,
            "ConnectionTypeID": 2,
            "Reference": "1",
            "StatusTypeID": 50,
            "LevelID": 3,
            "Amps": 125,
            "Voltage": 400,
            "PowerKW": 50,
            "CurrentTypeID": 30,
            "Quantity": 1
        },
        {
            "ID": 227656,
            "ConnectionTypeID": 33,
            "Reference": "2",
            "StatusTypeID": 50,
            "LevelID": 3,
            "Amps": 125,
            "Voltage": 400,
            "PowerKW": 50,
            "CurrentTypeID": 30,
            "Quantity": 1
        },
        {
            "ID": 256830,
            "ConnectionTypeID": 1036,
            "StatusTypeID": 50,
            "LevelID": 3,
            "PowerKW": 43,
            "CurrentTypeID": 20,
            "Quantity": 1
        }
    ],
    "GeneralComments": "Charge point operated by Chargemaster. Available on the POLAR network. Visit www.polar-network.com to apply.",
    "StatusTypeID": 50,
    "DateLastStatusUpdate": "2020-10-07T08:11:00Z",
    "MetadataValues": [
        {
            "ID": 7485,
            "MetadataFieldID": 4,
            "ItemValue": "Contains public sector information licensed under the Open Government Licence v2.0. http://www.nationalarchives.gov.uk/doc/open-government-licence/version/2/"
        }
    ],
    "DataQualityLevel": 3,
    "DateCreated": "2020-06-25T10:00:00Z",
    "SubmissionStatusTypeID": 100
}