{
    "IsRecentlyVerified": false,
    "ID": 54117,
    "UUID": "07649F68-272C-4651-8EE3-8BA77A998EA1",
    "DataProviderID": 1,
    "OperatorID": 45,
    "UsageTypeID": 4,
    "AddressInfo": {
        "ID": 54463,
        "Title": "Bad am Stadtwald",
        "AddressLine1": "Hansaring 177",
        "Town": "Neumünster",
        "Postcode": "24534",
        "CountryID": 87,
        "Latitude": 54.08155,
        "Longitude": 9.96018000000004,
        "ContactTelephone1": "+49 4321 202580",
        "AccessComments": "Rund um die Uhr (24/7) nutzbar. Position: Gleich nach dem Auffahren rechts hinter der Fußgänger-Unterführung. Umgebung:Schwimmbad mit Restaurant und Sauna: Täglich Bitte beachten Sie: Dienstags ist das Sportbecken wegen schulischer Ausbildungszwecke erst ab 09:30 Uhr geöffnet. 06:00-21:00 Uhr Samstag und Sonntag 08:00-21:00 Uhr Spätschwimmen (täglich) 19:00-21:00 Uhr Langes Kabel mitnehmen, da eventuell durch Verbrenner zugeparkt.\r\n",
        "RelatedURL": "http://www.stadtwerke-neumuenster.de/data_bad/startseite/startseite.php",
        "DistanceUnit": 0
    },
    "Connections": [
        {
            "ID": 67946,
            "ConnectionTypeID": 28,
            "StatusTypeID": 50,
            "LevelID": 2,
            "Amps": 0,
            "PowerKW": 3.7,
            "CurrentTypeID": 10,
            "Quantity": 0
        },
        {
            "ID": 67947,
            "ConnectionTypeID": 25,
            "StatusTypeID": 50,
            "LevelID": 2,
            "Amps": 1,
            "PowerKW": 22,
            "CurrentTypeID": 20,
            "Quantity": 2
        },
        {
            "ID": 67948,
            "ConnectionTypeID": 16,
            "StatusTypeID": 50,
            "LevelID": 2,
            "Amps": 0,
            "PowerKW": 3.7,
            "CurrentTypeID": 10,
            "Quantity": 0
        },
        {
            "ID": 67949,
            "ConnectionTypeID": 17,
            "StatusTypeID": 50,
            "LevelID": 2,
            "Amps": 0,
            "PowerKW": 0,
            "CurrentTypeID": 20,
            "Quantity": 0
        },
        {
            "ID": 67950,
            "ConnectionTypeID": 2,
            "StatusTypeID": 50,
            "LevelID": 2,
            "Amps": 1,
            "PowerKW": 0,
            "CurrentTypeID": 30,
            "Quantity": 0
        },
        {
            "ID": 67951,
            "ConnectionTypeID": 33,
            "StatusTypeID": 50,
            "LevelID": 2,
            "Amps": 1,
            "PowerKW": 0,
            "CurrentTypeID": 30,
            "Quantity": 0
        }
    ],
    "NumberOfPoints": 2,
    "StatusTypeID": 50,
    "DateLastStatusUpdate": "2015-09-23T18:28:00Z",
    "DataQualityLevel": 1,
    "DateCreated": "2015-09-22T22:00:00Z",
    "SubmissionStatusTypeID": 200
}