{
    "IsRecentlyVerified": false,
    "ID": 113968,
    "UUID": "D1A1D4F7-E246-42F3-BE6A-FE623EFA7663",
    "DataProviderID": 1,
    "OperatorID": 23,
    "OperatorsReference": "46710",
    "UsageTypeID": 4,
    "AddressInfo": {
        "ID": 114314,
        "Title": "Schwarzwald Wein Gut",
        "AddressLine1": "Heimbach 12",
        "Town": "Durbach",
        "Postcode": "77770",
        "CountryID": 87,
        "Latitude": 48.496289,
        "Longitude": 8.037454,
        "ContactTelephone1": " +49 7814 1486",
        "DistanceUnit": 0
    },
    "Connections": [
        {
            "ID": 160538,
            "ConnectionTypeID": 30,
            "StatusTypeID": 50,
            "LevelID": 2,
            "Amps": 32,
            "Voltage": 400,
            "PowerKW": 22,
            "CurrentTypeID": 20,
            "Quantity": 1
        }
    ],
    "NumberOfPoints": 1,
    "GeneralComments": "1 Tesla Connector, up to 22kW.Available for customers. Self park.",
    "StatusTypeID": 50,
    "DateLastStatusUpdate": "2019-01-02T22:06:00Z",
    "DataQualityLevel": 1,
    "DateCreated": "2019-01-02T22:06:00Z",
    "SubmissionStatusTypeID": 200
}