{
    "IsRecentlyVerified": false,
    "ID": 149278,
    "UUID": "9F9645D8-C868-4B83-8B8D-D15949FB07E1",
    "DataProviderID": 1,
    "OperatorID": 150,
    "UsageTypeID": 4,
    "UsageCost": "£1 connection plus 30p per kWh.",
    "AddressInfo": {
        "ID": 149631,
        "Title": "Morrisons Bath",
        "AddressLine1": "London Road",
        "Town": "Bath",
        "Postcode": "BA1 6AE",
        "CountryID": 1,
        "Latitude": 51.391876,
        "Longitude": -2.35154,
        "AccessComments": "",
        "RelatedURL": "https://www.geniepoint.co.uk/ds",
        "DistanceUnit": 0
    },
    "Connections": [
        {
            "ID": 207279,
            "ConnectionTypeID": 25,
            "Reference": "1",
            "StatusTypeID": 50,
            "LevelID": 2,
            "Amps": 32,
            "Voltage": 400,
            "PowerKW": 22,
            "CurrentTypeID": 20,
            "Quantity": 1
        },
        {
            "ID": 207280,
            "ConnectionTypeID": 2,
            "Reference": "2",
            "StatusTypeID": 50,
            "LevelID": 3,
            "Amps": 125,
            "Voltage": 400,
            "PowerKW": 50,
            "CurrentTypeID": 30,
            "Quantity": 1
        },
        {
            "ID": 207281,
            "ConnectionTypeID": 33,
            "Reference": "3",
            "StatusTypeID": 50,
            "LevelID": 3,
            "Amps": 125,
            "Voltage": 400,
            "PowerKW": 50,
            "CurrentTypeID": 30,
            "Quantity": 1
        }
    ],
    "StatusTypeID": 50,
    "DateLastStatusUpdate": "2020-10-07T13:59:00Z",
    "MetadataValues": [
        {
            "ID": 7025,
            "MetadataFieldID": 4,
            "ItemValue": "Contains public sector information licensed under the Open Government Licence v2.0. http://www.nationalarchives.gov.uk/doc/open-government-licence/version/2/"
        }
    ],
    "DataQualityLevel": 3,
    "DateCreated": "2020-02-21T15:15:00Z",
    "SubmissionStatusTypeID": 100
}