{
    "IsRecentlyVerified": false,
    "ID": 100111,
    "UUID": "CA88A781-1D01-44CC-964E-AFC95F051D3B",
    "DataProviderID": 1,
    "OperatorID": 32,
    "OperatorsReference": "4069",
    "UsageTypeID": 4,
    "UsageCost": "£0.108/kWh; for Polar Plus subscription members only",
    "AddressInfo": {
        "ID": 100457,
        "Title": "GB Electrical and Building Services",
        "AddressLine1": "Beech Lane",
        "AddressLine2": "Dinedor",
        "Town": "Hereford",
        "StateOrProvince": "Herefordshire",
        "Postcode": "HR2 6FG",
        "CountryID": 1,
        "Latitude": 52.040771,
        "Longitude": -2.685991,
        "DistanceUnit": 0
    },
    "Connections": [
        {
            "ID": 141430,
            "ConnectionTypeID": 25,
            "StatusTypeID": 50,
            "LevelID": 2,
            "Amps": 32,
            "Voltage": 400,
            "PowerKW": 22,
            "CurrentTypeID": 20,
            "Quantity": 2
        }
    ],
    "NumberOfPoints": 2,
    "StatusTypeID": 50,
    "DateLastStatusUpdate": "2019-03-09T06:21:00Z",
    "DataQualityLevel": 1,
    "DateCreated": "2018-02-13T06:16:00Z",
    "SubmissionStatusTypeID": 200
}