{
    "IsRecentlyVerified": false,
    "ID": 186380,
    "UUID": "A47B4267-94FE-4F9E-917C-456D193946A6",
    "DataProviderID": 29,
    "DataProvidersReference": "2449",
    "AddressInfo": {
        "ID": 186739,
        "Title": "Grabenstr. 12 a",
        "AddressLine1": "Grabenstr. 12 a",
        "Town": "Lüdenscheid",
        "Postcode": "58511",
        "CountryID": 87,
        "Latitude": 51.215057,
        "Longitude": 7.632996,
        "DistanceUnit": 0
    },
    "Connections": [
        {
            "ID": 298929,
            "ConnectionTypeID": 25,
            "StatusTypeID": 50,
            "LevelID": 2,
            "PowerKW": 22,
            "CurrentTypeID": 20
        },
        {
            "ID": 298930,
            "ConnectionTypeID": 25,
            "StatusTypeID": 50,
            "LevelID": 2,
            "PowerKW": 22,
            "CurrentTypeID": 20
        }
    ],
    "StatusTypeID": 50,
    "DateLastStatusUpdate": "2021-07-12T02:46:00Z",
    "MetadataValues": [
        {
            "ID": 18621,
            "MetadataFieldID": 4,
            "ItemValue": "Data from the German chargepoint registry provided by Bundesnetzagentur.de under the CC-BY 4.0 license"
        }
    ],
    "DataQualityLevel": 3,
    "DateCreated": "2021-07-12T02:46:00Z",
    "SubmissionStatusTypeID": 100
}