{
    "IsRecentlyVerified": false,
    "ID": 119866,
    "UUID": "5DF5B76C-B598-4934-91FD-2163C9F8F9FF",
    "DataProviderID": 2,
    "DataProvidersReference": "104787",
    "OperatorID": 5,
    "UsageTypeID": 1,
    "AddressInfo": {
        "ID": 120212,
        "Title": "SEACOAST BANK",
        "AddressLine1": "1031 W Morse Blvd",
        "Town": "Winter Park",
        "StateOrProvince": "FL",
        "Postcode": "32789",
        "CountryID": 2,
        "Latitude": 28.5979389,
        "Longitude": -81.362877,
        "ContactTelephone1": "888-758-4389",
        "AccessComments": "24 hours daily",
        "RelatedURL": "http://www.chargepoint.com/",
        "DistanceUnit": 0
    },
    "Connections": [
        {
            "ID": 169160,
            "ConnectionTypeID": 1,
            "LevelID": 2,
            "Amps": 16,
            "Voltage": 230,
            "PowerKW": 3.7,
            "CurrentTypeID": 10,
            "Quantity": 2
        }
    ],
    "DateLastStatusUpdate": "2020-06-26T02:52:00Z",
    "DataQualityLevel": 3,
    "DateCreated": "2019-04-01T04:59:00Z",
    "SubmissionStatusTypeID": 100
}