{
    "IsRecentlyVerified": false,
    "ID": 144929,
    "UUID": "D9CFAF58-CB8E-4DFE-8FA1-6D43344E1082",
    "DataProviderID": 2,
    "DataProvidersReference": "150328",
    "OperatorID": 89,
    "UsageTypeID": 1,
    "AddressInfo": {
        "ID": 145281,
        "Title": "Mairie de St-Sauveur",
        "AddressLine1": "1 Place de la Mairie",
        "Town": "Saint-Sauveur",
        "StateOrProvince": "QC",
        "Postcode": "J0R 1R6",
        "CountryID": 44,
        "Latitude": 45.896126,
        "Longitude": -74.153712,
        "ContactTelephone1": "888-356-8911",
        "AccessComments": "24 hours daily",
        "RelatedURL": "https://flo.ca/",
        "DistanceUnit": 0
    },
    "Connections": [
        {
            "ID": 201485,
            "ConnectionTypeID": 1,
            "LevelID": 2,
            "Amps": 16,
            "Voltage": 230,
            "PowerKW": 3.7,
            "CurrentTypeID": 10,
            "Quantity": 4
        }
    ],
    "StatusTypeID": 50,
    "DateLastStatusUpdate": "2020-06-26T03:10:00Z",
    "DataQualityLevel": 3,
    "DateCreated": "2019-12-24T09:24:00Z",
    "SubmissionStatusTypeID": 100
}