{
    "IsRecentlyVerified": true,
    "DateLastVerified": "2021-10-01T12:01:00Z",
    "ID": 189454,
    "UUID": "47FFF419-3175-434A-9FE5-E7ADDB34B4FF",
    "DataProviderID": 1,
    "OperatorID": 1,
    "UsageTypeID": 1,
    "UsageCost": "0",
    "AddressInfo": {
        "ID": 189813,
        "Title": "Viña Pedrosa",
        "AddressLine1": "Av. Ribera Del Duero 30",
        "Town": "Pedrosa De Duero",
        "StateOrProvince": "Burgos",
        "Postcode": "09314",
        "CountryID": 210,
        "Latitude": 41.709114069999984,
        "Longitude": -3.9798507599999993,
        "ContactTelephone1": "947530100",
        "DistanceUnit": 0
    },
    "Connections": [
        {
            "ID": 306422,
            "ConnectionTypeID": 25,
            "StatusTypeID": 50,
            "LevelID": 2,
            "Amps": 32,
            "Voltage": 400,
            "PowerKW": 22,
            "CurrentTypeID": 20,
            "Quantity": 2
        }
    ],
    "NumberOfPoints": 2,
    "StatusTypeID": 50,
    "DateLastStatusUpdate": "2021-10-04T12:08:00Z",
    "DataQualityLevel": 1,
    "DateCreated": "2021-10-01T12:01:00Z",
    "SubmissionStatusTypeID": 200
}