{
    "IsRecentlyVerified": false,
    "ID": 166078,
    "UUID": "35FD1883-E39F-4132-8110-0A4BB46F5481",
    "DataProviderID": 28,
    "DataProvidersReference": "FR*S24*PMB24*121",
    "OperatorID": 3407,
    "UsageTypeID": 5,
    "AddressInfo": {
        "ID": 166437,
        "Title": "SARLIAC SUR L'ISLE - Parking Rue Du Stade",
        "AddressLine1": "Parking Rue Du Stade 24420 SARLIAC SUR L'ISLE",
        "CountryID": 80,
        "Latitude": 45.235857,
        "Longitude": 0.873653,
        "AccessComments": "24h/24 7j/7",
        "DistanceUnit": 0
    },
    "Connections": [
        {
            "ID": 244112,
            "ConnectionTypeID": 25,
            "StatusTypeID": 50,
            "LevelID": 2,
            "PowerKW": 18,
            "CurrentTypeID": 20
        },
        {
            "ID": 244113,
            "ConnectionTypeID": 28,
            "StatusTypeID": 50,
            "LevelID": 2,
            "PowerKW": 18,
            "CurrentTypeID": 10
        },
        {
            "ID": 244114,
            "ConnectionTypeID": 25,
            "StatusTypeID": 50,
            "LevelID": 2,
            "PowerKW": 18,
            "CurrentTypeID": 20
        },
        {
            "ID": 244115,
            "ConnectionTypeID": 28,
            "StatusTypeID": 50,
            "LevelID": 2,
            "PowerKW": 18,
            "CurrentTypeID": 10
        }
    ],
    "GeneralComments": "Recharge par badge et avec une application smartphone",
    "StatusTypeID": 50,
    "DateLastStatusUpdate": "2020-08-27T05:12:00Z",
    "DataQualityLevel": 2,
    "DateCreated": "2020-08-27T05:12:00Z",
    "SubmissionStatusTypeID": 100
}