{
    "IsRecentlyVerified": false,
    "ID": 71879,
    "UUID": "ECE894E1-C199-4F0B-920D-844837337F2D",
    "DataProviderID": 1,
    "OperatorID": 45,
    "UsageTypeID": 6,
    "AddressInfo": {
        "ID": 72225,
        "Title": "Hotel Stempferhof",
        "AddressLine1": "Badangerstraße 33",
        "Town": "Gößweinstein",
        "StateOrProvince": "Landkreis Forchheim",
        "Postcode": "91327",
        "CountryID": 87,
        "Latitude": 49.77443,
        "Longitude": 11.339929999999981,
        "AccessComments": "Für Gäste nach Anmeldung.",
        "RelatedURL": "http://www.stempferhof.de/",
        "DistanceUnit": 0
    },
    "Connections": [
        {
            "ID": 102991,
            "ConnectionTypeID": 28,
            "StatusTypeID": 50,
            "LevelID": 2,
            "Amps": 16,
            "Voltage": 230,
            "PowerKW": 3.7,
            "CurrentTypeID": 10,
            "Quantity": 1
        }
    ],
    "NumberOfPoints": 1,
    "StatusTypeID": 50,
    "DateLastStatusUpdate": "2016-09-20T06:26:00Z",
    "DataQualityLevel": 1,
    "DateCreated": "2016-09-20T06:26:00Z",
    "SubmissionStatusTypeID": 200
}