{
    "IsRecentlyVerified": false,
    "ID": 129898,
    "UUID": "86079EC4-77ED-4E4D-B476-74D8A3A63822",
    "DataProviderID": 1,
    "OperatorID": 23,
    "OperatorsReference": "51234",
    "UsageTypeID": 4,
    "AddressInfo": {
        "ID": 130244,
        "Title": "Hotel Colorado Lugano",
        "AddressLine1": "Via Admini 20",
        "Town": "Lugano",
        "Postcode": "6900",
        "CountryID": 217,
        "Latitude": 45.998119,
        "Longitude": 8.944712,
        "ContactTelephone1": "+41 91 994 16 31",
        "DistanceUnit": 0
    },
    "Connections": [
        {
            "ID": 181888,
            "ConnectionTypeID": 30,
            "StatusTypeID": 50,
            "LevelID": 2,
            "PowerKW": 11,
            "CurrentTypeID": 20,
            "Quantity": 1
        }
    ],
    "NumberOfPoints": 1,
    "GeneralComments": "1 Tesla Connector, up to 11kW.Available for customers. Please see front desk.",
    "StatusTypeID": 50,
    "DateLastStatusUpdate": "2019-07-30T09:17:00Z",
    "DataQualityLevel": 1,
    "DateCreated": "2019-07-30T09:17:00Z",
    "SubmissionStatusTypeID": 200
}