{
    "IsRecentlyVerified": false,
    "ID": 175533,
    "UUID": "9524AABD-A39F-4088-8A8F-819EC9FB2499",
    "DataProviderID": 1,
    "OperatorID": 3,
    "UsageTypeID": 1,
    "UsageCost": "Free",
    "AddressInfo": {
        "ID": 175892,
        "Title": "Tesco Superstore-Alfreton",
        "AddressLine1": "Hall Street",
        "Town": "Amber Valley",
        "StateOrProvince": "England",
        "Postcode": "DE55 7BT",
        "CountryID": 1,
        "Latitude": 53.094812,
        "Longitude": -1.389781,
        "DistanceUnit": 0
    },
    "Connections": [
        {
            "ID": 272461,
            "ConnectionTypeID": 25,
            "Reference": "PG-70409",
            "StatusTypeID": 50,
            "LevelID": 2,
            "Amps": 32,
            "Voltage": 230,
            "PowerKW": 7,
            "CurrentTypeID": 10,
            "Quantity": 2
        },
        {
            "ID": 272462,
            "ConnectionTypeID": 25,
            "Reference": "PG-86480",
            "StatusTypeID": 50,
            "LevelID": 2,
            "Amps": 32,
            "Voltage": 230,
            "PowerKW": 7,
            "CurrentTypeID": 10,
            "Quantity": 2
        }
    ],
    "NumberOfPoints": 4,
    "StatusTypeID": 50,
    "DateLastStatusUpdate": "2021-05-27T15:41:00Z",
    "DataQualityLevel": 1,
    "DateCreated": "2021-05-27T15:41:00Z",
    "SubmissionStatusTypeID": 200
}