{
    "IsRecentlyVerified": false,
    "ID": 155180,
    "UUID": "19D7D8D8-9084-4826-BF01-EFFF738FB6A3",
    "DataProviderID": 1,
    "OperatorID": 80,
    "UsageTypeID": 4,
    "AddressInfo": {
        "ID": 155534,
        "Title": "COOP San Giovanni Valdarno | ENELX",
        "AddressLine1": "Via Ubaldino Peruzzi",
        "Town": "San Giovanni Valdarno",
        "StateOrProvince": "AR",
        "Postcode": "52027",
        "CountryID": 112,
        "Latitude": 43.568269123162935,
        "Longitude": 11.527242594831591,
        "ContactTelephone1": "800.069.850",
        "RelatedURL": "https://www.enelx.com/it/it/emobility",
        "DistanceUnit": 0
    },
    "Connections": [
        {
            "ID": 218426,
            "ConnectionTypeID": 25,
            "StatusTypeID": 50,
            "LevelID": 2,
            "Amps": 32,
            "Voltage": 400,
            "PowerKW": 22,
            "CurrentTypeID": 20,
            "Quantity": 4
        }
    ],
    "NumberOfPoints": 4,
    "GeneralComments": "LUN-SAB 7:30/20:30 DOM 8:30-13:00",
    "StatusTypeID": 50,
    "DateLastStatusUpdate": "2020-03-29T14:46:00Z",
    "DataQualityLevel": 1,
    "DateCreated": "2020-03-29T14:46:00Z",
    "SubmissionStatusTypeID": 200
}