{
    "UserComments": [
        {
            "ID": 22796,
            "ChargePointID": 109432,
            "CommentTypeID": 1000,
            "UserName": "Paolo TN",
            "Comment": "This is an excellent service provided by LIDL in an area which offers commercial services and other opportunities. Just wantd to report that on 18th June 2020 one of the two charging stations (the one on the right) did not work; the other was ok.",
            "Rating": 5,
            "DateCreated": "2020-06-19T05:49:47.81Z",
            "User": {
                "ID": 26199,
                "Username": "Paolo TN"
            },
            "CheckinStatusTypeID": 10,
            "IsActionedByEditor": false
        },
        {
            "ID": 22443,
            "ChargePointID": 109432,
            "CommentTypeID": 10,
            "UserName": "ForumElettrico.it",
            "Comment": "Nei dintorni presente negozio OBI, bar, pizza al taglio e altri negozi. Leggi la recensione qui > https://www.forumelettrico.it/forum/colonnina-22-kw-lidl-trento-tn-via-brennero-99-101-t6985.html",
            "RelatedURL": "https://www.forumelettrico.it/forum/colonnina-22-kw-lidl-trento-tn-via-brennero-99-101-t6985.html",
            "DateCreated": "2020-04-16T13:55:50.453Z",
            "User": {
                "ID": 11749,
                "Username": "ForumElettrico.it"
            },
            "CheckinStatusTypeID": 10,
            "IsActionedByEditor": false
        }
    ],
    "MediaItems": [
        {
            "ID": 21967,
            "ChargePointID": 109432,
            "ItemURL": "https://s3-ap-southeast-2.amazonaws.com/openchargemap/images/IT/OCM109432/OCM-109432.orig.2020041613555989.jpg",
            "ItemThumbnailURL": "https://s3-ap-southeast-2.amazonaws.com/openchargemap/images/IT/OCM109432/OCM-109432.thmb.2020041613555989.jpg",
            "Comment": "",
            "IsEnabled": true,
            "IsVideo": false,
            "IsFeaturedItem": false,
            "IsExternalResource": false,
            "User": {
                "ID": 11749,
                "Username": "ForumElettrico.it"
            },
            "DateCreated": "2020-04-16T13:56:00Z"
        },
        {
            "ID": 21968,
            "ChargePointID": 109432,
            "ItemURL": "https://s3-ap-southeast-2.amazonaws.com/openchargemap/images/IT/OCM109432/OCM-109432.orig.2020041613560624.jpg",
            "ItemThumbnailURL": "https://s3-ap-southeast-2.amazonaws.com/openchargemap/images/IT/OCM109432/OCM-109432.thmb.2020041613560624.jpg",
            "Comment": "",
            "IsEnabled": true,
            "IsVideo": false,
            "IsFeaturedItem": false,
            "IsExternalResource": false,
            "User": {
                "ID": 11749,
                "Username": "ForumElettrico.it"
            },
            "DateCreated": "2020-04-16T13:56:00Z"
        },
        {
            "ID": 21969,
            "ChargePointID": 109432,
            "ItemURL": "https://s3-ap-southeast-2.amazonaws.com/openchargemap/images/IT/OCM109432/OCM-109432.orig.2020041613561199.jpg",
            "ItemThumbnailURL": "https://s3-ap-southeast-2.amazonaws.com/openchargemap/images/IT/OCM109432/OCM-109432.thmb.2020041613561199.jpg",
            "Comment": "",
            "IsEnabled": true,
            "IsVideo": false,
            "IsFeaturedItem": false,
            "IsExternalResource": false,
            "User": {
                "ID": 11749,
                "Username": "ForumElettrico.it"
            },
            "DateCreated": "2020-04-16T13:56:00Z"
        },
        {
            "ID": 21970,
            "ChargePointID": 109432,
            "ItemURL": "https://s3-ap-southeast-2.amazonaws.com/openchargemap/images/IT/OCM109432/OCM-109432.orig.2020041613561862.jpg",
            "ItemThumbnailURL": "https://s3-ap-southeast-2.amazonaws.com/openchargemap/images/IT/OCM109432/OCM-109432.thmb.2020041613561862.jpg",
            "Comment": "",
            "IsEnabled": true,
            "IsVideo": false,
            "IsFeaturedItem": false,
            "IsExternalResource": false,
            "User": {
                "ID": 11749,
                "Username": "ForumElettrico.it"
            },
            "DateCreated": "2020-04-16T13:56:00Z"
        }
    ],
    "IsRecentlyVerified": false,
    "ID": 109432,
    "UUID": "65973C1B-87EE-4EB5-9079-BA0DB9156C9E",
    "DataProviderID": 1,
    "OperatorID": 38,
    "UsageTypeID": 1,
    "UsageCost": "free",
    "AddressInfo": {
        "ID": 109778,
        "Title": "LIDL Trento",
        "AddressLine1": "Via del Brennero, 99",
        "AddressLine2": "Cristo Re",
        "Town": "Trento",
        "StateOrProvince": "TN",
        "Postcode": "38121",
        "CountryID": 112,
        "Latitude": 46.08393225450783,
        "Longitude": 11.119625458198811,
        "RelatedURL": "https://www.lidl.it",
        "DistanceUnit": 0
    },
    "Connections": [
        {
            "ID": 154594,
            "ConnectionTypeID": 25,
            "StatusTypeID": 50,
            "LevelID": 2,
            "Amps": 32,
            "Voltage": 400,
            "PowerKW": 22,
            "CurrentTypeID": 20,
            "Quantity": 4
        }
    ],
    "NumberOfPoints": 4,
    "StatusTypeID": 50,
    "DateLastStatusUpdate": "2020-06-19T05:50:00Z",
    "DataQualityLevel": 1,
    "DateCreated": "2018-10-15T08:42:00Z",
    "SubmissionStatusTypeID": 200
}