{
    "IsRecentlyVerified": false,
    "ID": 60928,
    "UUID": "C4EB2761-3E00-4400-A127-874114349A1E",
    "DataProviderID": 27,
    "DataProvidersReference": "235",
    "UsageTypeID": 1,
    "AddressInfo": {
        "ID": 61274,
        "Title": "Hospital Clínico",
        "AddressLine1": "Calle de San Juan Bosco, 11",
        "Town": "Zaragoza",
        "StateOrProvince": "Zaragoza",
        "Postcode": "50009",
        "CountryID": 210,
        "Latitude": 37.182347,
        "Longitude": -5.778133,
        "ContactTelephone1": "976791999",
        "ContactEmail": "clinico.epsa@vincipark.es",
        "RelatedURL": "http://www.vincipark.es/ficha.php?i...",
        "DistanceUnit": 0
    },
    "Connections": [
        {
            "ID": 77312,
            "ConnectionTypeID": 28
        },
        {
            "ID": 77313,
            "ConnectionTypeID": 28
        },
        {
            "ID": 77314,
            "ConnectionTypeID": 28
        },
        {
            "ID": 77315,
            "ConnectionTypeID": 28
        },
        {
            "ID": 77316,
            "ConnectionTypeID": 28
        },
        {
            "ID": 77317,
            "ConnectionTypeID": 28
        }
    ],
    "GeneralComments": "Pedir tarjeta al encargado",
    "StatusTypeID": 0,
    "DateLastStatusUpdate": "2016-02-13T00:23:00Z",
    "DataQualityLevel": 3,
    "DateCreated": "2016-02-13T00:23:00Z",
    "SubmissionStatusTypeID": 200
}