{
    "IsRecentlyVerified": false,
    "ID": 137067,
    "UUID": "70E3D5FD-B218-4DCC-87B8-B65AA310B057",
    "DataProviderID": 1,
    "OperatorID": 3315,
    "UsageTypeID": 1,
    "UsageCost": "£0.30/kWh; minimum fee £1.00",
    "AddressInfo": {
        "ID": 137413,
        "Title": "Vistor Centre",
        "AddressLine1": "Vistor Centre",
        "Town": "Sangomor",
        "StateOrProvince": "Scotland",
        "Postcode": "",
        "CountryID": 1,
        "Latitude": 58.56781469055443,
        "Longitude": -4.7398577779808875,
        "DistanceUnit": 0
    },
    "Connections": [
        {
            "ID": 191908,
            "ConnectionTypeID": 1036,
            "Reference": "50737-1",
            "StatusTypeID": 150,
            "LevelID": 3,
            "Amps": 63,
            "Voltage": 400,
            "PowerKW": 43,
            "CurrentTypeID": 20
        },
        {
            "ID": 191909,
            "ConnectionTypeID": 2,
            "Reference": "50737-2",
            "StatusTypeID": 150,
            "LevelID": 3,
            "Amps": 125,
            "Voltage": 400,
            "PowerKW": 50,
            "CurrentTypeID": 30
        },
        {
            "ID": 191910,
            "ConnectionTypeID": 33,
            "Reference": "50737-3",
            "StatusTypeID": 150,
            "LevelID": 3,
            "Amps": 125,
            "Voltage": 400,
            "PowerKW": 50,
            "CurrentTypeID": 30
        }
    ],
    "StatusTypeID": 150,
    "DateLastStatusUpdate": "2021-05-31T11:12:00Z",
    "MetadataValues": [
        {
            "ID": 6919,
            "MetadataFieldID": 4,
            "ItemValue": "Contains public sector information licensed under the Open Government Licence v2.0. http://www.nationalarchives.gov.uk/doc/open-government-licence/version/2/"
        }
    ],
    "DataQualityLevel": 3,
    "DateCreated": "2019-12-24T05:23:00Z",
    "SubmissionStatusTypeID": 100
}