{
    "IsRecentlyVerified": false,
    "ID": 73817,
    "UUID": "AEC342FD-F55C-4299-8C80-2201047D45B1",
    "DataProviderID": 1,
    "OperatorID": 89,
    "OperatorsReference": "CEA-103",
    "UsageTypeID": 4,
    "UsageCost": "CAD 2.50",
    "AddressInfo": {
        "ID": 74163,
        "Title": "Pierrefonds-Roxboro-Mairie de Pierrefonds-Rox",
        "AddressLine1": "13665 Boul. de Pierrefonds",
        "Town": "Montréal",
        "StateOrProvince": "QC",
        "Postcode": "H9A 2Z4",
        "CountryID": 44,
        "Latitude": 45.49547,
        "Longitude": -73.848823,
        "DistanceUnit": 0
    },
    "Connections": [
        {
            "ID": 106123,
            "ConnectionTypeID": 1,
            "StatusTypeID": 50,
            "LevelID": 2,
            "Amps": 32,
            "Voltage": 230,
            "PowerKW": 7,
            "CurrentTypeID": 10,
            "Quantity": 1
        }
    ],
    "NumberOfPoints": 1,
    "StatusTypeID": 50,
    "DateLastStatusUpdate": "2016-11-27T19:57:00Z",
    "DataQualityLevel": 1,
    "DateCreated": "2016-11-23T23:12:00Z",
    "SubmissionStatusTypeID": 200
}