{
    "IsRecentlyVerified": false,
    "ID": 121614,
    "UUID": "770E36D2-0519-4788-9A0C-0DCAC5939E34",
    "DataProviderID": 2,
    "DataProvidersReference": "121177",
    "OperatorID": 3318,
    "UsageTypeID": 1,
    "AddressInfo": {
        "ID": 121960,
        "Title": "Walmart 820 - Booneville, MO",
        "AddressLine1": "2150 Main St",
        "Town": "Boonville",
        "StateOrProvince": "MO",
        "Postcode": "65233",
        "CountryID": 2,
        "Latitude": 38.9501058,
        "Longitude": -92.7409218,
        "ContactTelephone1": "833-632-2778",
        "AccessComments": "24 hours daily",
        "RelatedURL": "https://www.electrifyamerica.com/",
        "DistanceUnit": 0
    },
    "Connections": [
        {
            "ID": 171380,
            "ConnectionTypeID": 2,
            "LevelID": 2,
            "Amps": 100,
            "Voltage": 400,
            "PowerKW": 40,
            "CurrentTypeID": 10,
            "Quantity": 1
        },
        {
            "ID": 171381,
            "ConnectionTypeID": 32,
            "LevelID": 2,
            "Amps": 100,
            "Voltage": 400,
            "PowerKW": 40,
            "CurrentTypeID": 10,
            "Quantity": 1
        }
    ],
    "DateLastStatusUpdate": "2019-04-06T04:01:00Z",
    "DataQualityLevel": 3,
    "DateCreated": "2019-04-06T04:01:00Z",
    "SubmissionStatusTypeID": 100
}