{
    "IsRecentlyVerified": false,
    "ID": 102417,
    "UUID": "0C61F0E2-E013-48CC-8A59-803324C338D1",
    "DataProviderID": 2,
    "DataProvidersReference": "91859",
    "UsageTypeID": 1,
    "AddressInfo": {
        "ID": 102763,
        "Title": "Apache Family Campground",
        "AddressLine1": "9700 Kings Rd",
        "Town": "Myrtle Beach",
        "StateOrProvince": "SC",
        "Postcode": "29572",
        "CountryID": 2,
        "Latitude": 33.768518,
        "Longitude": -78.789281,
        "ContactTelephone1": "843-449-7323",
        "AccessComments": "24 hours daily; see office for access",
        "RelatedURL": "",
        "DistanceUnit": 0
    },
    "Connections": [
        {
            "ID": 144490,
            "ConnectionTypeID": 0,
            "LevelID": 1,
            "Amps": 16,
            "Voltage": 120,
            "PowerKW": 1,
            "CurrentTypeID": 10,
            "Quantity": 1
        },
        {
            "ID": 144491,
            "ConnectionTypeID": 1,
            "LevelID": 2,
            "Amps": 16,
            "Voltage": 230,
            "PowerKW": 3,
            "CurrentTypeID": 10,
            "Quantity": 1
        }
    ],
    "DateLastStatusUpdate": "2019-04-06T04:01:00Z",
    "DataQualityLevel": 3,
    "DateCreated": "2018-04-21T04:13:00Z",
    "SubmissionStatusTypeID": 100
}