{
    "IsRecentlyVerified": false,
    "ID": 88262,
    "UUID": "7B22AEB0-8B99-4302-BC3B-579F93E97124",
    "DataProviderID": 1,
    "OperatorID": 45,
    "UsageTypeID": 5,
    "UsageCost": "$2.50/hour; included with overnight stay",
    "AddressInfo": {
        "ID": 88608,
        "Title": "Aio Accommodation",
        "AddressLine1": "36 Goffe Drive",
        "Town": "Bay of Islands",
        "Postcode": "0204",
        "CountryID": 161,
        "Latitude": -35.2807374,
        "Longitude": 174.0618786,
        "ContactTelephone1": "64094028562",
        "DistanceUnit": 0
    },
    "Connections": [
        {
            "ID": 125205,
            "ConnectionTypeID": 4,
            "StatusTypeID": 50,
            "LevelID": 2,
            "Amps": 16,
            "Voltage": 230,
            "PowerKW": 3.6,
            "CurrentTypeID": 10,
            "Quantity": 1
        }
    ],
    "NumberOfPoints": 1,
    "GeneralComments": "$2.50/h or free with overnight stay.\r\nCaravan Mains Socket\r\nRunning on Grid-tied solar power and situated in the heart of the Bay of Islands, 4 kms from Paihia and 19 kms from Kerikeri, Āio Accommodation provides a self contained studio with a very comfortable queen sized bed, private bathroom, self contained kitchenette, separate deck.",
    "StatusTypeID": 50,
    "DateLastStatusUpdate": "2017-05-25T11:54:00Z",
    "DataQualityLevel": 1,
    "DateCreated": "2017-05-25T11:50:00Z",
    "SubmissionStatusTypeID": 200
}