{
    "IsRecentlyVerified": false,
    "ID": 54631,
    "UUID": "6EBD2D30-BF2F-4727-B262-C54FB5C7CDEC",
    "DataProviderID": 26,
    "DataProvidersReference": "70684",
    "OperatorID": 103,
    "OperatorsReference": "Allego NLALLEGO0003511",
    "UsageCost": "0.00 jaarabonnement",
    "AddressInfo": {
        "ID": 54977,
        "Title": "Pastoor van Kessellaan 15",
        "AddressLine1": "Pastoor van Kessellaan 15",
        "Town": "Moerdijk",
        "Postcode": "4761 BJ",
        "CountryID": 159,
        "Latitude": 51.641978,
        "Longitude": 4.604825,
        "ContactTelephone1": "0800-3745337",
        "RelatedURL": "http://www.allego.eu/",
        "DistanceUnit": 0
    },
    "Connections": [
        {
            "ID": 68959,
            "ConnectionTypeID": 25,
            "LevelID": 2,
            "PowerKW": 11,
            "CurrentTypeID": 10
        },
        {
            "ID": 68960,
            "ConnectionTypeID": 25,
            "LevelID": 2,
            "PowerKW": 11,
            "CurrentTypeID": 10
        }
    ],
    "NumberOfPoints": 1,
    "StatusTypeID": 50,
    "DateLastStatusUpdate": "2016-06-04T02:39:00Z",
    "DataQualityLevel": 3,
    "DateCreated": "2015-10-09T06:18:00Z",
    "SubmissionStatusTypeID": 100
}