{
    "IsRecentlyVerified": false,
    "ID": 177378,
    "UUID": "41D9E1BA-C0BF-49FF-863A-D33C007811F3",
    "DataProviderID": 29,
    "DataProvidersReference": "9974",
    "OperatorID": 69,
    "AddressInfo": {
        "ID": 177737,
        "Title": "Albrechtstr. 14",
        "AddressLine1": "Albrechtstr. 14",
        "Town": "München",
        "Postcode": "80636",
        "CountryID": 87,
        "Latitude": 48.154122,
        "Longitude": 11.541419,
        "DistanceUnit": 0
    },
    "Connections": [
        {
            "ID": 276457,
            "ConnectionTypeID": 25,
            "StatusTypeID": 50,
            "LevelID": 2,
            "PowerKW": 22,
            "CurrentTypeID": 20
        },
        {
            "ID": 276458,
            "ConnectionTypeID": 25,
            "StatusTypeID": 50,
            "LevelID": 2,
            "PowerKW": 22,
            "CurrentTypeID": 20
        }
    ],
    "StatusTypeID": 0,
    "DateLastStatusUpdate": "2021-07-09T03:11:00Z",
    "MetadataValues": [
        {
            "ID": 9672,
            "MetadataFieldID": 4,
            "ItemValue": "Data from the German chargepoint registry provided by Bundesnetzagentur.de under the CC-BY 4.0 license"
        }
    ],
    "DataQualityLevel": 3,
    "DateCreated": "2021-07-08T09:49:00Z",
    "SubmissionStatusTypeID": 100
}