{
    "IsRecentlyVerified": false,
    "ID": 101875,
    "UUID": "CB5738AD-A630-44E4-8AEF-A362FF56B81A",
    "DataProviderID": 1,
    "OperatorID": 3,
    "OperatorsReference": "PG-80443,PG-90755,PG-90758",
    "UsageTypeID": 6,
    "UsageCost": "Free",
    "AddressInfo": {
        "ID": 102221,
        "Title": "Bath Spa University-Newton Park Campus",
        "AddressLine1": "Newton Park",
        "Town": "Bath",
        "Postcode": "BA2 9BN",
        "CountryID": 1,
        "Latitude": 51.375848,
        "Longitude": -2.438212,
        "DistanceUnit": 0
    },
    "Connections": [
        {
            "ID": 143814,
            "ConnectionTypeID": 25,
            "StatusTypeID": 50,
            "LevelID": 2,
            "Amps": 32,
            "Voltage": 230,
            "PowerKW": 7,
            "CurrentTypeID": 10,
            "Quantity": 4
        }
    ],
    "NumberOfPoints": 4,
    "GeneralComments": "This is an open charge unit installed at the Bath Spa University - Newton Park campus in Newton St Loe, Bath",
    "StatusTypeID": 50,
    "DateLastStatusUpdate": "2018-04-14T05:34:00Z",
    "DataQualityLevel": 1,
    "DateCreated": "2018-04-13T05:54:00Z",
    "SubmissionStatusTypeID": 200
}