{
    "IsRecentlyVerified": false,
    "ID": 179679,
    "UUID": "02678C1B-313C-46B8-81B3-A9306BABCC5B",
    "DataProviderID": 29,
    "DataProvidersReference": "4695",
    "OperatorID": 69,
    "AddressInfo": {
        "ID": 180038,
        "Title": "Bahnhofstraße",
        "AddressLine1": "Bahnhofstraße",
        "Town": "Schefflenz",
        "Postcode": "74850",
        "CountryID": 87,
        "Latitude": 49.4169528,
        "Longitude": 9.2794111,
        "DistanceUnit": 0
    },
    "Connections": [
        {
            "ID": 281801,
            "ConnectionTypeID": 25,
            "StatusTypeID": 50,
            "LevelID": 2,
            "PowerKW": 22,
            "CurrentTypeID": 20
        },
        {
            "ID": 281802,
            "ConnectionTypeID": 25,
            "StatusTypeID": 50,
            "LevelID": 2,
            "PowerKW": 22,
            "CurrentTypeID": 20
        }
    ],
    "StatusTypeID": 50,
    "DateLastStatusUpdate": "2021-07-09T03:16:00Z",
    "MetadataValues": [
        {
            "ID": 11973,
            "MetadataFieldID": 4,
            "ItemValue": "Data from the German chargepoint registry provided by Bundesnetzagentur.de under the CC-BY 4.0 license"
        }
    ],
    "DataQualityLevel": 3,
    "DateCreated": "2021-07-08T09:59:00Z",
    "SubmissionStatusTypeID": 100
}