{
    "IsRecentlyVerified": false,
    "ID": 140769,
    "UUID": "30AEA307-728C-447B-B768-FD48DBC1AA43",
    "DataProviderID": 2,
    "DataProvidersReference": "95638",
    "OperatorID": 9,
    "UsageTypeID": 1,
    "AddressInfo": {
        "ID": 141121,
        "Title": "Four Seasons Hotel Silicon Valley",
        "AddressLine1": "2050 University Ave.",
        "Town": "East Palo Alto",
        "StateOrProvince": "CA",
        "Postcode": "94303",
        "CountryID": 2,
        "Latitude": 37.46038,
        "Longitude": -122.14228,
        "ContactTelephone1": "888-998-2546",
        "AccessComments": "MON: 24 hours | TUE: 24 hours | WED: 24 hours | THU: 24 hours | FRI: 24 hours | SAT: 24 hours | SUN: 24 hours",
        "RelatedURL": "http://www.blinkcharging.com/",
        "DistanceUnit": 0
    },
    "Connections": [
        {
            "ID": 196490,
            "ConnectionTypeID": 1,
            "LevelID": 2,
            "Amps": 16,
            "Voltage": 230,
            "PowerKW": 3.7,
            "CurrentTypeID": 10,
            "Quantity": 1
        }
    ],
    "StatusTypeID": 50,
    "DateLastStatusUpdate": "2020-06-26T02:59:00Z",
    "DataQualityLevel": 3,
    "DateCreated": "2019-12-24T09:13:00Z",
    "SubmissionStatusTypeID": 100
}