{
    "IsRecentlyVerified": false,
    "ID": 43152,
    "UUID": "DC958882-3079-46B0-824A-0C4F06A62F16",
    "DataProviderID": 1,
    "DataProvidersReference": "2671",
    "AddressInfo": {
        "ID": 43498,
        "Title": "AMFI Stord",
        "AddressLine1": "Hamnegata 11",
        "Town": "STORD",
        "StateOrProvince": "Vestland",
        "Postcode": "5401",
        "CountryID": 168,
        "Latitude": 59.7785,
        "Longitude": 5.49929,
        "AccessComments": "Bak kulturhuset i Leirvik 1. etasje",
        "DistanceUnit": 0
    },
    "Connections": [
        {
            "ID": 52320,
            "ConnectionTypeID": 0,
            "Reference": "1",
            "LevelID": 2,
            "Amps": 32,
            "Voltage": 400,
            "PowerKW": 22,
            "Comments": "Mode 3"
        },
        {
            "ID": 85072,
            "ConnectionTypeID": 0,
            "Reference": "2",
            "LevelID": 2,
            "Amps": 32,
            "Voltage": 400,
            "PowerKW": 22,
            "Comments": "Mode 3"
        },
        {
            "ID": 85073,
            "ConnectionTypeID": 0,
            "Reference": "3",
            "LevelID": 2,
            "Amps": 32,
            "Voltage": 400,
            "PowerKW": 22,
            "Comments": "Mode 3"
        },
        {
            "ID": 88447,
            "ConnectionTypeID": 0,
            "Reference": "4",
            "LevelID": 2,
            "Amps": 32,
            "Voltage": 400,
            "PowerKW": 22,
            "Comments": "Mode 3"
        }
    ],
    "NumberOfPoints": 4,
    "DateLastStatusUpdate": "2020-05-26T08:23:00Z",
    "DataQualityLevel": 2,
    "DateCreated": "2015-03-25T04:33:00Z",
    "SubmissionStatusTypeID": 100
}