{
    "IsRecentlyVerified": false,
    "ID": 174218,
    "UUID": "27FAD7E1-7FDE-4473-9E1B-193BAF9E29D0",
    "DataProviderID": 1,
    "OperatorID": 2247,
    "UsageTypeID": 4,
    "UsageCost": "0,30 €/kWh",
    "AddressInfo": {
        "ID": 174577,
        "Title": "Estación de Servicio GLG",
        "AddressLine1": "Carr. de León-Astorga, 12",
        "Town": "Hospital de Órbigo",
        "StateOrProvince": "León",
        "Postcode": "24286",
        "CountryID": 210,
        "Latitude": 42.46229699886865,
        "Longitude": -5.868799049820154,
        "ContactTelephone1": "900 92 92 93",
        "RelatedURL": "https://www.iberdrola.es/servicios/vehiculo-electrico/punto-recarga",
        "DistanceUnit": 0
    },
    "Connections": [
        {
            "ID": 269382,
            "ConnectionTypeID": 33,
            "StatusTypeID": 50,
            "LevelID": 2,
            "PowerKW": 50,
            "Quantity": 2
        },
        {
            "ID": 269383,
            "ConnectionTypeID": 2,
            "StatusTypeID": 50,
            "LevelID": 2,
            "PowerKW": 50,
            "Quantity": 2
        },
        {
            "ID": 269384,
            "ConnectionTypeID": 1036,
            "StatusTypeID": 50,
            "LevelID": 2,
            "PowerKW": 43,
            "Quantity": 1
        }
    ],
    "NumberOfPoints": 4,
    "StatusTypeID": 50,
    "DateLastStatusUpdate": "2021-03-24T09:04:00Z",
    "DataQualityLevel": 1,
    "DateCreated": "2021-03-22T20:47:00Z",
    "SubmissionStatusTypeID": 200
}