{
    "IsRecentlyVerified": false,
    "ID": 167464,
    "UUID": "6D7046E7-1323-4247-B33D-AC9E5F4FC306",
    "DataProviderID": 19,
    "DataProvidersReference": "6603",
    "AddressInfo": {
        "ID": 167823,
        "Title": "Q8 Herlev",
        "AddressLine1": "Herlev Hovedgade 234",
        "Town": "Herlev",
        "StateOrProvince": "Hovedstaden",
        "Postcode": "2730",
        "CountryID": 65,
        "Latitude": 55.72552,
        "Longitude": 12.41697,
        "AccessComments": "",
        "DistanceUnit": 0
    },
    "Connections": [
        {
            "ID": 253738,
            "ConnectionTypeID": 25,
            "Reference": "1",
            "LevelID": 3,
            "Amps": 63,
            "Voltage": 400,
            "PowerKW": 43,
            "CurrentTypeID": 20
        },
        {
            "ID": 253739,
            "ConnectionTypeID": 2,
            "Reference": "2",
            "LevelID": 3,
            "Amps": 100,
            "Voltage": 500,
            "PowerKW": 50,
            "CurrentTypeID": 30
        },
        {
            "ID": 253740,
            "ConnectionTypeID": 33,
            "Reference": "3",
            "LevelID": 3,
            "Amps": 100,
            "Voltage": 500,
            "PowerKW": 50,
            "CurrentTypeID": 30
        }
    ],
    "NumberOfPoints": 3,
    "StatusTypeID": 0,
    "DateLastStatusUpdate": "2021-03-24T05:10:00Z",
    "DataQualityLevel": 2,
    "DateCreated": "2020-09-08T04:14:00Z",
    "SubmissionStatusTypeID": 100
}