{
    "IsRecentlyVerified": false,
    "ID": 51674,
    "UUID": "060B94EF-A548-4363-9135-998C895B7B6B",
    "DataProviderID": 1,
    "OperatorID": 3,
    "OperatorsReference": "PG-80153,PG-80156",
    "UsageTypeID": 4,
    "UsageCost": "£0.25/kWh. Parking fees apply (Pay on foot)",
    "AddressInfo": {
        "ID": 52020,
        "Title": "Regent Street Car Park",
        "AddressLine1": "Regent Street",
        "Town": "Plymouth",
        "Postcode": "PL4 8BA",
        "CountryID": 1,
        "Latitude": 50.373261311768,
        "Longitude": -4.13591444708255,
        "RelatedURL": "http://www.plymouth.gov.uk/homepage/transportandstreets/parking/carparks/regentstreetcarpark.htm",
        "DistanceUnit": 0
    },
    "Connections": [
        {
            "ID": 64130,
            "ConnectionTypeID": 25,
            "StatusTypeID": 50,
            "LevelID": 2,
            "Amps": 32,
            "Voltage": 230,
            "PowerKW": 7,
            "CurrentTypeID": 10,
            "Quantity": 4
        }
    ],
    "NumberOfPoints": 4,
    "StatusTypeID": 50,
    "DateLastStatusUpdate": "2021-03-17T06:19:00Z",
    "DataQualityLevel": 1,
    "DateCreated": "2015-08-12T11:11:00Z",
    "SubmissionStatusTypeID": 200
}