{
    "IsRecentlyVerified": false,
    "ID": 9087,
    "UUID": "4B655894-ABC2-4D66-9CE8-6CA458033C33",
    "DataProviderID": 1,
    "OperatorID": 9,
    "UsageTypeID": 4,
    "UsageCost": "",
    "AddressInfo": {
        "ID": 8984,
        "Title": "Benton County Assessor",
        "AddressLine1": "205 Nw 5th St",
        "AddressLine2": "",
        "Town": "Corvallis",
        "StateOrProvince": "OR",
        "Postcode": "97330",
        "CountryID": 2,
        "Latitude": 44.566152,
        "Longitude": -123.262,
        "ContactTelephone1": "(541) 766-6855",
        "ContactTelephone2": "",
        "ContactEmail": "",
        "AccessComments": "exterior wall of office",
        "RelatedURL": "http://www.co.benton.or.us/assess/",
        "DistanceUnit": 0
    },
    "Connections": [
        {
            "ID": 6763,
            "ConnectionTypeID": 1,
            "StatusTypeID": 30,
            "LevelID": 2,
            "Quantity": 1
        }
    ],
    "NumberOfPoints": 1,
    "GeneralComments": "Blink EVSE is currently frozen with \"please wait...\" message ",
    "StatusTypeID": 100,
    "DateLastStatusUpdate": "2012-01-04T11:20:00Z",
    "DataQualityLevel": 1,
    "DateCreated": "2012-01-04T06:28:00Z",
    "SubmissionStatusTypeID": 200
}