{
    "IsRecentlyVerified": false,
    "ID": 5072,
    "UUID": "F901D7F6-FECF-4159-8D08-CB49AD754037",
    "DataProviderID": 2,
    "DataProvidersReference": "40390",
    "OperatorID": 5,
    "UsageTypeID": 1,
    "AddressInfo": {
        "ID": 5012,
        "Title": "PUBLIC STATIONS",
        "AddressLine1": "7428 Terrace Ave",
        "Town": "Middleton",
        "StateOrProvince": "WI",
        "Postcode": "53562",
        "CountryID": 2,
        "Latitude": 43.0946494,
        "Longitude": -89.5096396,
        "ContactTelephone1": "888-758-4389",
        "AccessComments": "24 hours daily",
        "RelatedURL": "http://www.chargepoint.com/",
        "DistanceUnit": 0
    },
    "Connections": [
        {
            "ID": 3772,
            "ConnectionTypeID": 1,
            "LevelID": 2,
            "Amps": 16,
            "Voltage": 230,
            "PowerKW": 3.7,
            "CurrentTypeID": 10,
            "Quantity": 2
        },
        {
            "ID": 21064,
            "ConnectionTypeID": 1,
            "LevelID": 2,
            "Amps": 16,
            "Voltage": 230,
            "PowerKW": 3,
            "CurrentTypeID": 10,
            "Quantity": 3
        }
    ],
    "DateLastConfirmed": "2011-06-30T00:00:00Z",
    "StatusTypeID": 0,
    "DateLastStatusUpdate": "2020-06-26T03:06:00Z",
    "DataQualityLevel": 1,
    "DateCreated": "2011-07-27T11:31:00Z",
    "SubmissionStatusTypeID": 100
}