{
    "IsRecentlyVerified": false,
    "ID": 119515,
    "UUID": "2A3210E6-C918-40A9-A058-51FA674E37FF",
    "DataProviderID": 2,
    "DataProvidersReference": "52532",
    "UsageTypeID": 1,
    "AddressInfo": {
        "ID": 119861,
        "Title": "Crown Electric",
        "AddressLine1": "9310 S Dadeland Blvd",
        "Town": "Miami",
        "StateOrProvince": "FL",
        "Postcode": "33156",
        "CountryID": 2,
        "Latitude": 25.682201,
        "Longitude": -80.316916,
        "ContactTelephone1": "954-625-6440",
        "AccessComments": "24 hours daily",
        "RelatedURL": "",
        "DistanceUnit": 0
    },
    "Connections": [
        {
            "ID": 168789,
            "ConnectionTypeID": 1,
            "LevelID": 2,
            "Amps": 16,
            "Voltage": 230,
            "PowerKW": 3,
            "CurrentTypeID": 10,
            "Quantity": 1
        }
    ],
    "DateLastStatusUpdate": "2019-12-24T09:08:00Z",
    "DataQualityLevel": 3,
    "DateCreated": "2019-04-01T04:59:00Z",
    "SubmissionStatusTypeID": 100
}