{
    "IsRecentlyVerified": false,
    "ID": 162319,
    "UUID": "7355B735-BEA5-4CEB-977B-45D714B69701",
    "DataProviderID": 1,
    "OperatorID": 3448,
    "UsageTypeID": 1,
    "UsageCost": "charge 0.35€/kWh + fees",
    "AddressInfo": {
        "ID": 162676,
        "Title": "Proviridis Saint-Martin-de-Crau",
        "AddressLine1": "Rue Lavoisier",
        "Town": "Saint-Martin-de-Crau",
        "StateOrProvince": "Provence-Alpes-Côte d'Azur",
        "Postcode": "13310",
        "CountryID": 80,
        "Latitude": 43.62734873484064,
        "Longitude": 4.803403075844244,
        "RelatedURL": "https://z-e-n.fr/",
        "DistanceUnit": 0
    },
    "Connections": [
        {
            "ID": 233617,
            "ConnectionTypeID": 33,
            "StatusTypeID": 50,
            "LevelID": 3,
            "PowerKW": 100,
            "CurrentTypeID": 30,
            "Quantity": 1
        },
        {
            "ID": 233618,
            "ConnectionTypeID": 2,
            "StatusTypeID": 50,
            "LevelID": 3,
            "PowerKW": 60,
            "CurrentTypeID": 30,
            "Quantity": 1
        },
        {
            "ID": 233619,
            "ConnectionTypeID": 33,
            "StatusTypeID": 50,
            "LevelID": 3,
            "PowerKW": 150,
            "CurrentTypeID": 30,
            "Quantity": 1
        }
    ],
    "NumberOfPoints": 2,
    "StatusTypeID": 50,
    "DateLastStatusUpdate": "2021-05-21T20:50:00Z",
    "DataQualityLevel": 1,
    "DateCreated": "2020-08-05T06:39:00Z",
    "SubmissionStatusTypeID": 200
}