{
    "IsRecentlyVerified": false,
    "ID": 97743,
    "UUID": "6F3794B4-9E66-47DC-A580-A446A46DBD98",
    "DataProviderID": 1,
    "OperatorID": 23,
    "OperatorsReference": "39667",
    "UsageTypeID": 4,
    "AddressInfo": {
        "ID": 98089,
        "Title": "Atlanta Chinatown Mall",
        "AddressLine1": "5383 New Peachtree RD",
        "Town": "Chamblee",
        "StateOrProvince": "Georgia",
        "Postcode": "30341",
        "CountryID": 2,
        "Latitude": 33.8903894,
        "Longitude": -84.3001479,
        "ContactTelephone1": "(770) 458-6660",
        "DistanceUnit": 0
    },
    "Connections": [
        {
            "ID": 138651,
            "ConnectionTypeID": 30,
            "StatusTypeID": 50,
            "LevelID": 2,
            "PowerKW": 16,
            "CurrentTypeID": 20,
            "Quantity": 8
        }
    ],
    "NumberOfPoints": 8,
    "GeneralComments": "8 Tesla Connectors, up to 16kW.Available to the public. Self park.",
    "StatusTypeID": 50,
    "DateLastStatusUpdate": "2018-01-21T16:32:00Z",
    "DataQualityLevel": 1,
    "DateCreated": "2018-01-21T16:32:00Z",
    "SubmissionStatusTypeID": 200
}