{
    "IsRecentlyVerified": false,
    "ID": 145112,
    "UUID": "5190B099-FF94-4FE3-BE6B-11074BDC12C1",
    "DataProviderID": 2,
    "DataProvidersReference": "131117",
    "OperatorID": 90,
    "UsageTypeID": 1,
    "AddressInfo": {
        "ID": 145464,
        "Title": "Desjardins - CdS Ferme-Neuve",
        "AddressLine1": "155 12e Rue",
        "Town": "Ferme-Neuve",
        "StateOrProvince": "QC",
        "Postcode": "J0W 1C0",
        "CountryID": 44,
        "Latitude": 46.70085,
        "Longitude": -75.45149,
        "ContactTelephone1": "877-505-2674",
        "AccessComments": "24 hours daily",
        "RelatedURL": "https://lecircuitelectrique.com/",
        "DistanceUnit": 0
    },
    "Connections": [
        {
            "ID": 201717,
            "ConnectionTypeID": 1,
            "LevelID": 2,
            "Amps": 16,
            "Voltage": 230,
            "PowerKW": 3.7,
            "CurrentTypeID": 10,
            "Quantity": 1
        }
    ],
    "StatusTypeID": 50,
    "DateLastStatusUpdate": "2020-06-26T03:10:00Z",
    "DataQualityLevel": 3,
    "DateCreated": "2019-12-24T09:24:00Z",
    "SubmissionStatusTypeID": 100
}