{
    "IsRecentlyVerified": false,
    "ID": 33975,
    "UUID": "1A4DC5FE-2103-459D-A173-E21A0B9AEB1B",
    "DataProviderID": 26,
    "DataProvidersReference": "48339",
    "OperatorID": 178,
    "OperatorsReference": "EVnetNL EV0232",
    "UsageCost": "0.00 jaarabonnement",
    "AddressInfo": {
        "ID": 34321,
        "Title": "Fagotstraat 16",
        "AddressLine1": "Fagotstraat 16",
        "Town": "Nissewaard",
        "Postcode": "3208 DE",
        "CountryID": 159,
        "Latitude": 51.836928,
        "Longitude": 4.306028,
        "ContactTelephone1": "0800-3522365",
        "RelatedURL": "http://www.evnet.nl",
        "DistanceUnit": 0
    },
    "Connections": [
        {
            "ID": 37486,
            "ConnectionTypeID": 25,
            "LevelID": 2,
            "PowerKW": 11,
            "CurrentTypeID": 10
        }
    ],
    "NumberOfPoints": 1,
    "StatusTypeID": 50,
    "DateLastStatusUpdate": "2016-06-04T02:41:00Z",
    "DataQualityLevel": 3,
    "DateCreated": "2015-01-09T06:04:00Z",
    "SubmissionStatusTypeID": 100
}