{
    "IsRecentlyVerified": false,
    "ID": 62454,
    "UUID": "F4A58F2D-8550-4C2B-A40F-8E406B209F89",
    "DataProviderID": 1,
    "OperatorID": 23,
    "OperatorsReference": "10134",
    "UsageTypeID": 1,
    "UsageCost": "Free",
    "AddressInfo": {
        "ID": 62800,
        "Title": "Stafford's Bay View Inn",
        "AddressLine1": "2011 Woodland Ave",
        "Town": "Petoskey",
        "StateOrProvince": "MI",
        "Postcode": "49770",
        "CountryID": 2,
        "Latitude": 45.3862407,
        "Longitude": -84.9277414,
        "ContactTelephone1": "231-347-2771  877-798-3752",
        "AccessComments": "24 hours daily; for guest use only; see front desk for access",
        "RelatedURL": "http://www.teslamotors.com/supercharger",
        "DistanceUnit": 0
    },
    "Connections": [
        {
            "ID": 79360,
            "ConnectionTypeID": 30,
            "StatusTypeID": 50,
            "LevelID": 2,
            "Amps": 16,
            "Voltage": 230,
            "PowerKW": 16,
            "CurrentTypeID": 10,
            "Quantity": 1
        }
    ],
    "NumberOfPoints": 1,
    "StatusTypeID": 50,
    "DateLastStatusUpdate": "2018-05-30T09:26:00Z",
    "DataQualityLevel": 3,
    "DateCreated": "2016-03-03T11:39:00Z",
    "SubmissionStatusTypeID": 100
}