{
    "IsRecentlyVerified": false,
    "ID": 182031,
    "UUID": "574C79BE-69C0-4B7A-AFE6-C727F11BBAF6",
    "DataProviderID": 1,
    "OperatorID": 1,
    "AddressInfo": {
        "ID": 182390,
        "Title": "Luisenstr. 14",
        "AddressLine1": "Luisenstr. 14",
        "Town": "Ettlingen",
        "Postcode": "76275",
        "CountryID": 87,
        "Latitude": 48.938073,
        "Longitude": 8.415697,
        "DistanceUnit": 0
    },
    "Connections": [
        {
            "ID": 287249,
            "ConnectionTypeID": 28,
            "StatusTypeID": 50,
            "LevelID": 2,
            "Amps": 16,
            "Voltage": 230,
            "PowerKW": 3.7,
            "CurrentTypeID": 10
        },
        {
            "ID": 287250,
            "ConnectionTypeID": 25,
            "StatusTypeID": 50,
            "LevelID": 2,
            "PowerKW": 22,
            "CurrentTypeID": 20
        },
        {
            "ID": 296417,
            "ConnectionTypeID": 28,
            "StatusTypeID": 50,
            "LevelID": 2,
            "Amps": 16,
            "Voltage": 230,
            "PowerKW": 3.7,
            "CurrentTypeID": 10
        },
        {
            "ID": 296418,
            "ConnectionTypeID": 25,
            "StatusTypeID": 50,
            "LevelID": 2,
            "PowerKW": 22,
            "CurrentTypeID": 20
        }
    ],
    "StatusTypeID": 50,
    "DateLastStatusUpdate": "2021-08-12T08:07:00Z",
    "MetadataValues": [
        {
            "ID": 14325,
            "MetadataFieldID": 4,
            "ItemValue": "Data from the German chargepoint registry provided by Bundesnetzagentur.de under the CC-BY 4.0 license"
        }
    ],
    "DataQualityLevel": 3,
    "DateCreated": "2021-07-08T10:02:00Z",
    "SubmissionStatusTypeID": 100
}