{
    "IsRecentlyVerified": false,
    "ID": 156247,
    "UUID": "8ACC7294-278A-4F21-8520-115751A0E559",
    "DataProviderID": 1,
    "OperatorID": 45,
    "UsageTypeID": 1,
    "AddressInfo": {
        "ID": 156601,
        "Title": "CPP Mayfair St",
        "AddressLine1": "",
        "CountryID": 18,
        "Latitude": -31.9474687574798,
        "Longitude": 115.84121108698467,
        "DistanceUnit": 0
    },
    "Connections": [
        {
            "ID": 219881,
            "ConnectionTypeID": 29,
            "StatusTypeID": 50,
            "LevelID": 2,
            "PowerKW": 22,
            "CurrentTypeID": 20,
            "Quantity": 2
        }
    ],
    "NumberOfPoints": 2,
    "StatusTypeID": 50,
    "DateLastStatusUpdate": "2021-09-03T01:55:00Z",
    "DataQualityLevel": 1,
    "DateCreated": "2020-05-13T03:14:00Z",
    "SubmissionStatusTypeID": 200
}