{
    "IsRecentlyVerified": false,
    "ID": 188562,
    "UUID": "B47B6BAD-6EA1-45F5-92EA-CFF4709C02BA",
    "DataProviderID": 1,
    "OperatorID": 3400,
    "UsageTypeID": 1,
    "UsageCost": "Pass (Free): (1-90 kW) $0.27/minute, (1-350 kW) $0.57/minute Pass+ ($4.00 Monthly): (1-90 kW) $0.21/minute, (1-350 kW) $0.44/minute",
    "AddressInfo": {
        "ID": 188921,
        "Title": "Golden Village Lodge - Electricy Canada",
        "AddressLine1": "1439 Lafontaine Rd",
        "Town": "Golden",
        "StateOrProvince": "BC",
        "Postcode": "V0A 1H3",
        "CountryID": 44,
        "Latitude": 51.30289796112851,
        "Longitude": -116.95163308230156,
        "ContactTelephone1": "833-231-3226",
        "RelatedURL": "https://www.electrify-canada.ca/pricing",
        "DistanceUnit": 0
    },
    "Connections": [
        {
            "ID": 304567,
            "ConnectionTypeID": 32,
            "StatusTypeID": 50,
            "LevelID": 3,
            "PowerKW": 150,
            "CurrentTypeID": 30,
            "Quantity": 3
        },
        {
            "ID": 304568,
            "ConnectionTypeID": 2,
            "StatusTypeID": 50,
            "LevelID": 2,
            "PowerKW": 80,
            "Quantity": 1
        },
        {
            "ID": 304569,
            "ConnectionTypeID": 32,
            "StatusTypeID": 50,
            "LevelID": 2,
            "PowerKW": 350,
            "Quantity": 1
        }
    ],
    "NumberOfPoints": 1,
    "StatusTypeID": 50,
    "DateLastStatusUpdate": "2021-08-02T23:36:00Z",
    "DataQualityLevel": 1,
    "DateCreated": "2021-08-02T23:36:00Z",
    "SubmissionStatusTypeID": 200
}