{
    "IsRecentlyVerified": false,
    "ID": 60291,
    "UUID": "16D45BEC-B4FC-4100-B55D-E32064537319",
    "DataProviderID": 1,
    "OperatorID": 7,
    "OperatorsReference": "PG-80131",
    "UsageTypeID": 6,
    "UsageCost": "Free",
    "AddressInfo": {
        "ID": 60637,
        "Title": "Harratts Nissan Wakefield",
        "AddressLine1": "Denby Dale Road",
        "AddressLine2": "Thornes",
        "Town": "Wakefield",
        "StateOrProvince": "England",
        "Postcode": "WF4 3BB",
        "CountryID": 1,
        "Latitude": 53.6547687,
        "Longitude": -1.51583129999995,
        "DistanceUnit": 0
    },
    "Connections": [
        {
            "ID": 76327,
            "ConnectionTypeID": 25,
            "StatusTypeID": 50,
            "LevelID": 2,
            "Amps": 32,
            "Voltage": 230,
            "PowerKW": 7,
            "CurrentTypeID": 10,
            "Quantity": 2
        }
    ],
    "NumberOfPoints": 2,
    "StatusTypeID": 50,
    "DateLastStatusUpdate": "2016-12-13T11:51:00Z",
    "DataQualityLevel": 1,
    "DateCreated": "2016-01-19T08:43:00Z",
    "SubmissionStatusTypeID": 200
}