{
    "IsRecentlyVerified": false,
    "ID": 108434,
    "UUID": "EF40FD0F-AB45-4BFC-BB6F-92EBEA9A0059",
    "DataProviderID": 1,
    "OperatorID": 80,
    "UsageTypeID": 4,
    "AddressInfo": {
        "ID": 108780,
        "Title": " Negozio Enel di LODI | EnelX",
        "AddressLine1": "Via Vecchia Cremonese, 18",
        "Town": "Lodi",
        "StateOrProvince": "LO",
        "Postcode": "26900",
        "CountryID": 112,
        "Latitude": 45.304632851967696,
        "Longitude": 9.510529327944482,
        "ContactTelephone1": "800.069.850",
        "RelatedURL": "https://www.enelx.com/it/it/emobility",
        "DistanceUnit": 0
    },
    "Connections": [
        {
            "ID": 153325,
            "ConnectionTypeID": 25,
            "StatusTypeID": 50,
            "LevelID": 2,
            "Amps": 32,
            "Voltage": 400,
            "PowerKW": 22,
            "CurrentTypeID": 20,
            "Quantity": 1
        },
        {
            "ID": 153326,
            "ConnectionTypeID": 36,
            "StatusTypeID": 50,
            "LevelID": 2,
            "Amps": 16,
            "Voltage": 240,
            "PowerKW": 3.7,
            "CurrentTypeID": 10,
            "Quantity": 1
        }
    ],
    "NumberOfPoints": 2,
    "StatusTypeID": 50,
    "DateLastStatusUpdate": "2018-10-01T13:18:00Z",
    "DataQualityLevel": 1,
    "DateCreated": "2018-10-01T13:18:00Z",
    "SubmissionStatusTypeID": 200
}