{
    "IsRecentlyVerified": false,
    "ID": 146517,
    "UUID": "6F863D07-5C60-41D6-909C-892C98F74716",
    "DataProviderID": 1,
    "OperatorID": 3326,
    "UsageTypeID": 5,
    "AddressInfo": {
        "ID": 146869,
        "Title": "Ecofix",
        "AddressLine1": "Millers Road",
        "Town": "Warwick",
        "StateOrProvince": "Warwickshire",
        "Postcode": "CV34 5AN",
        "CountryID": 1,
        "Latitude": 52.291997,
        "Longitude": -1.58955,
        "AccessComments": "Only available during EcoFix opening hours",
        "RelatedURL": "http://www.alfapower.co.uk/",
        "DistanceUnit": 0
    },
    "Connections": [
        {
            "ID": 203712,
            "ConnectionTypeID": 33,
            "Reference": "A",
            "StatusTypeID": 50,
            "LevelID": 3,
            "Amps": 60,
            "Voltage": 400,
            "PowerKW": 22,
            "CurrentTypeID": 30
        },
        {
            "ID": 203713,
            "ConnectionTypeID": 2,
            "Reference": "B",
            "StatusTypeID": 50,
            "LevelID": 3,
            "Amps": 60,
            "Voltage": 400,
            "PowerKW": 22,
            "CurrentTypeID": 30
        }
    ],
    "NumberOfPoints": 1,
    "StatusTypeID": 50,
    "DateLastStatusUpdate": "2020-01-10T12:47:00Z",
    "MetadataValues": [
        {
            "ID": 6962,
            "MetadataFieldID": 4,
            "ItemValue": "Contains public sector information licensed under the Open Government Licence v2.0. http://www.nationalarchives.gov.uk/doc/open-government-licence/version/2/"
        }
    ],
    "DataQualityLevel": 3,
    "DateCreated": "2020-01-10T12:27:00Z",
    "SubmissionStatusTypeID": 100
}