{
    "MediaItems": [
        {
            "ID": 15063,
            "ChargePointID": 100103,
            "ItemURL": "https://s3-ap-southeast-2.amazonaws.com/openchargemap/images/IT/OCM100103/OCM-100103.orig.2018021219563166.jpg",
            "ItemThumbnailURL": "https://s3-ap-southeast-2.amazonaws.com/openchargemap/images/IT/OCM100103/OCM-100103.thmb.2018021219563166.jpg",
            "Comment": "",
            "IsEnabled": true,
            "IsVideo": false,
            "IsFeaturedItem": false,
            "IsExternalResource": false,
            "User": {
                "ID": 1606,
                "Username": "polianto"
            },
            "DateCreated": "2018-02-12T19:57:00Z"
        },
        {
            "ID": 15061,
            "ChargePointID": 100103,
            "ItemURL": "https://s3-ap-southeast-2.amazonaws.com/openchargemap/images/IT/OCM100103/OCM-100103.orig.2018021219555828.jpg",
            "ItemThumbnailURL": "https://s3-ap-southeast-2.amazonaws.com/openchargemap/images/IT/OCM100103/OCM-100103.thmb.2018021219555828.jpg",
            "Comment": "",
            "IsEnabled": true,
            "IsVideo": false,
            "IsFeaturedItem": false,
            "IsExternalResource": false,
            "User": {
                "ID": 1606,
                "Username": "polianto"
            },
            "DateCreated": "2018-02-12T19:56:00Z"
        },
        {
            "ID": 15062,
            "ChargePointID": 100103,
            "ItemURL": "https://s3-ap-southeast-2.amazonaws.com/openchargemap/images/IT/OCM100103/OCM-100103.orig.2018021219561291.jpg",
            "ItemThumbnailURL": "https://s3-ap-southeast-2.amazonaws.com/openchargemap/images/IT/OCM100103/OCM-100103.thmb.2018021219561291.jpg",
            "Comment": "",
            "IsEnabled": true,
            "IsVideo": false,
            "IsFeaturedItem": false,
            "IsExternalResource": false,
            "User": {
                "ID": 1606,
                "Username": "polianto"
            },
            "DateCreated": "2018-02-12T19:56:00Z"
        }
    ],
    "IsRecentlyVerified": false,
    "ID": 100103,
    "UUID": "BF99418B-C39F-4331-85EA-922AE39A02F5",
    "DataProviderID": 1,
    "OperatorID": 45,
    "UsageTypeID": 6,
    "AddressInfo": {
        "ID": 100449,
        "Title": " Pasticceria Balestrini",
        "AddressLine1": "Via Nazionale dei Giovi, 20",
        "AddressLine2": "Entrata da Via Evangelista Torricelli",
        "Town": "Lentate sul Seveso ",
        "StateOrProvince": "MB",
        "Postcode": "20823 ",
        "CountryID": 112,
        "Latitude": 45.66331638268748,
        "Longitude": 9.124880973792656,
        "ContactTelephone1": "0362 542752",
        "RelatedURL": "https://it-it.facebook.com/pasticceriabalestrini/",
        "DistanceUnit": 0
    },
    "Connections": [
        {
            "ID": 141410,
            "ConnectionTypeID": 25,
            "StatusTypeID": 50,
            "LevelID": 2,
            "CurrentTypeID": 10,
            "Quantity": 2
        }
    ],
    "NumberOfPoints": 2,
    "StatusTypeID": 50,
    "DateLastStatusUpdate": "2018-02-12T19:57:00Z",
    "DataQualityLevel": 1,
    "DateCreated": "2018-02-12T19:56:00Z",
    "SubmissionStatusTypeID": 200
}