{
    "IsRecentlyVerified": false,
    "ID": 84239,
    "UUID": "603CB6C8-BD9A-44BB-A6A1-152CB4DDEFF6",
    "DataProviderID": 1,
    "OperatorID": 23,
    "OperatorsReference": "24818",
    "UsageTypeID": 6,
    "AddressInfo": {
        "ID": 84585,
        "Title": "Boot Hill Distillery",
        "AddressLine1": "501 W Spruce St",
        "Town": "Dodge City",
        "StateOrProvince": "Kansas",
        "Postcode": "67801",
        "CountryID": 2,
        "Latitude": 37.754546,
        "Longitude": -100.021371,
        "ContactTelephone1": "(620) 371-6309",
        "DistanceUnit": 0
    },
    "Connections": [
        {
            "ID": 119640,
            "ConnectionTypeID": 30,
            "StatusTypeID": 50,
            "LevelID": 2,
            "PowerKW": 16,
            "CurrentTypeID": 20,
            "Quantity": 3
        }
    ],
    "NumberOfPoints": 3,
    "GeneralComments": "3 Tesla Connectors, up to 16kW.Available for patrons only. Self park.",
    "StatusTypeID": 50,
    "DateLastStatusUpdate": "2017-02-16T17:22:00Z",
    "DataQualityLevel": 1,
    "DateCreated": "2017-02-16T17:22:00Z",
    "SubmissionStatusTypeID": 200
}