{
    "IsRecentlyVerified": false,
    "ID": 113343,
    "UUID": "6DAB5B91-81DB-4795-A57E-6AFF42D5AC9C",
    "DataProviderID": 1,
    "OperatorID": 45,
    "UsageTypeID": 1,
    "AddressInfo": {
        "ID": 113689,
        "Title": "IKEA",
        "AddressLine1": "Henleinstraße 1a",
        "Town": "Stuhr",
        "StateOrProvince": "Landkreis Diepholz",
        "Postcode": "28816",
        "CountryID": 87,
        "Latitude": 53.02660821408123,
        "Longitude": 8.802524268508915,
        "AccessComments": "Während der Öffnungszeiten Mo-Sa 10-20Uhr sind 2 Triplecharger kostenlos nutzbar",
        "RelatedURL": "http://ikea.de/",
        "DistanceUnit": 0
    },
    "Connections": [
        {
            "ID": 159612,
            "ConnectionTypeID": 25,
            "StatusTypeID": 50,
            "LevelID": 2,
            "Amps": 32,
            "Voltage": 400,
            "PowerKW": 22,
            "CurrentTypeID": 20,
            "Quantity": 2
        },
        {
            "ID": 159613,
            "ConnectionTypeID": 2,
            "StatusTypeID": 50,
            "LevelID": 3,
            "PowerKW": 20,
            "CurrentTypeID": 30,
            "Quantity": 2
        },
        {
            "ID": 159614,
            "ConnectionTypeID": 33,
            "StatusTypeID": 50,
            "LevelID": 3,
            "PowerKW": 20,
            "CurrentTypeID": 30,
            "Quantity": 2
        }
    ],
    "NumberOfPoints": 4,
    "GeneralComments": "Stand 1.12.18: Inbetriebnahme erfolgt noch",
    "StatusTypeID": 100,
    "DateLastStatusUpdate": "2018-12-04T08:41:00Z",
    "DataQualityLevel": 1,
    "DateCreated": "2018-12-04T08:41:00Z",
    "SubmissionStatusTypeID": 200
}