{
    "IsRecentlyVerified": false,
    "ID": 178085,
    "UUID": "A3B0A5FF-7F90-4531-A738-40CA1C0B7809",
    "DataProviderID": 29,
    "DataProvidersReference": "20512",
    "AddressInfo": {
        "ID": 178444,
        "Title": "Breslauer Straße 0",
        "AddressLine1": "Breslauer Straße 0",
        "Town": "Landshut",
        "Postcode": "84028",
        "CountryID": 87,
        "Latitude": 48.553257,
        "Longitude": 12.177859,
        "DistanceUnit": 0
    },
    "Connections": [
        {
            "ID": 278043,
            "ConnectionTypeID": 25,
            "StatusTypeID": 50,
            "LevelID": 2,
            "PowerKW": 22,
            "CurrentTypeID": 20
        },
        {
            "ID": 278044,
            "ConnectionTypeID": 25,
            "StatusTypeID": 50,
            "LevelID": 2,
            "PowerKW": 22,
            "CurrentTypeID": 20
        }
    ],
    "StatusTypeID": 0,
    "DateLastStatusUpdate": "2021-07-09T03:12:00Z",
    "MetadataValues": [
        {
            "ID": 10379,
            "MetadataFieldID": 4,
            "ItemValue": "Data from the German chargepoint registry provided by Bundesnetzagentur.de under the CC-BY 4.0 license"
        }
    ],
    "DataQualityLevel": 3,
    "DateCreated": "2021-07-08T09:49:00Z",
    "SubmissionStatusTypeID": 100
}