{
    "IsRecentlyVerified": false,
    "ID": 67455,
    "UUID": "103B4069-6C97-4807-837F-D1BDB7C61DA0",
    "DataProviderID": 2,
    "DataProvidersReference": "74827",
    "OperatorID": 5,
    "UsageTypeID": 1,
    "AddressInfo": {
        "ID": 67801,
        "Title": "DCM COMPLEX",
        "AddressLine1": "107-199 Third St",
        "Town": "Fall River",
        "StateOrProvince": "MA",
        "Postcode": "02721",
        "CountryID": 2,
        "Latitude": 41.6999251,
        "Longitude": -71.1549088,
        "ContactTelephone1": "888-758-4389",
        "AccessComments": "24 hours daily",
        "RelatedURL": "http://www.chargepoint.com/",
        "DistanceUnit": 0
    },
    "Connections": [
        {
            "ID": 92959,
            "ConnectionTypeID": 1,
            "LevelID": 2,
            "Amps": 16,
            "Voltage": 230,
            "PowerKW": 3,
            "CurrentTypeID": 10,
            "Quantity": 2
        }
    ],
    "DateLastStatusUpdate": "2019-12-24T09:19:00Z",
    "DataQualityLevel": 3,
    "DateCreated": "2016-05-29T02:05:00Z",
    "SubmissionStatusTypeID": 100
}