{
    "IsRecentlyVerified": false,
    "ID": 136085,
    "UUID": "A8D3AB10-5DC0-4FA7-AAD8-C7F6A7224EB6",
    "DataProviderID": 18,
    "DataProvidersReference": "65c6f9e287ec3396a9f06843e46e26f8",
    "OperatorID": 2244,
    "UsageTypeID": 4,
    "AddressInfo": {
        "ID": 136431,
        "Title": "Godfrey Street",
        "AddressLine1": "Godfrey Street",
        "Town": "Chelsea",
        "Postcode": "SW3 3SR",
        "CountryID": 1,
        "Latitude": 51.488903,
        "Longitude": -0.166479,
        "AccessComments": "",
        "RelatedURL": "https://www.ubitricity.com",
        "DistanceUnit": 0
    },
    "Connections": [
        {
            "ID": 190512,
            "ConnectionTypeID": 25,
            "Reference": "suby1100000037",
            "StatusTypeID": 50,
            "LevelID": 2,
            "Amps": 16,
            "Voltage": 230,
            "PowerKW": 3.7,
            "CurrentTypeID": 10
        }
    ],
    "StatusTypeID": 0,
    "DateLastStatusUpdate": "2021-07-12T03:38:00Z",
    "MetadataValues": [
        {
            "ID": 5937,
            "MetadataFieldID": 4,
            "ItemValue": "Contains public sector information licensed under the Open Government Licence v2.0. http://www.nationalarchives.gov.uk/doc/open-government-licence/version/2/"
        }
    ],
    "DataQualityLevel": 3,
    "DateCreated": "2019-12-24T05:22:00Z",
    "SubmissionStatusTypeID": 100
}