{
    "IsRecentlyVerified": false,
    "ID": 126296,
    "UUID": "EFB78CEB-BB92-4C20-AB6E-F78473C2476B",
    "DataProviderID": 1,
    "OperatorID": 3,
    "OperatorsReference": "PG-82917",
    "UsageTypeID": 4,
    "UsageCost": "Free",
    "AddressInfo": {
        "ID": 126642,
        "Title": "Robert Pinkus & Co.",
        "AddressLine1": "West Lancs Technology Management Centre",
        "Town": "Moss Lane View",
        "StateOrProvince": "Skelmersdale",
        "Postcode": "WN8 9TN",
        "CountryID": 1,
        "Latitude": 53.538582,
        "Longitude": -2.789794,
        "DistanceUnit": 0
    },
    "Connections": [
        {
            "ID": 177004,
            "ConnectionTypeID": 25,
            "StatusTypeID": 50,
            "LevelID": 2,
            "Amps": 32,
            "Voltage": 230,
            "PowerKW": 7,
            "CurrentTypeID": 10,
            "Quantity": 2
        }
    ],
    "NumberOfPoints": 2,
    "GeneralComments": "This is an open charge unit installed at the Robert Pinkus & Co. site at West Lancs Technology Management Centre, Moss Lane View, Skelmersdale",
    "StatusTypeID": 50,
    "DateLastStatusUpdate": "2019-05-15T05:31:00Z",
    "DataQualityLevel": 1,
    "DateCreated": "2019-05-15T05:31:00Z",
    "SubmissionStatusTypeID": 200
}