{
    "IsRecentlyVerified": true,
    "DateLastVerified": "2021-09-11T06:50:00Z",
    "ID": 189148,
    "UUID": "C8FF02A9-2474-4D5F-B366-69476707309F",
    "DataProviderID": 1,
    "OperatorID": 1,
    "UsageTypeID": 4,
    "AddressInfo": {
        "ID": 189507,
        "Title": "Bangchak",
        "AddressLine1": "Bangchak",
        "Town": "Nakhon Sawan",
        "StateOrProvince": "Nakhon Sawan Province",
        "Postcode": "",
        "CountryID": 222,
        "Latitude": 16.20996609120364,
        "Longitude": 99.70334960988498,
        "RelatedURL": "https://www.pea.co.th/en",
        "DistanceUnit": 0
    },
    "Connections": [
        {
            "ID": 305794,
            "ConnectionTypeID": 33,
            "StatusTypeID": 50,
            "LevelID": 3,
            "Amps": 125,
            "PowerKW": 50,
            "CurrentTypeID": 30,
            "Quantity": 2
        }
    ],
    "NumberOfPoints": 1,
    "StatusTypeID": 50,
    "DateLastStatusUpdate": "2021-09-13T14:09:00Z",
    "DataQualityLevel": 1,
    "DateCreated": "2021-09-11T06:50:00Z",
    "SubmissionStatusTypeID": 200
}