{
    "IsRecentlyVerified": false,
    "ID": 187254,
    "UUID": "9B241C08-56BB-4983-B770-3F2C0790C0F5",
    "DataProviderID": 29,
    "DataProvidersReference": "8042",
    "OperatorID": 127,
    "AddressInfo": {
        "ID": 187613,
        "Title": "Bürgermeister-Becker-Straße 11",
        "AddressLine1": "Bürgermeister-Becker-Straße 11",
        "Town": "Esens",
        "Postcode": "26427",
        "CountryID": 87,
        "Latitude": 53.643597957883,
        "Longitude": 7.609920501709,
        "DistanceUnit": 0
    },
    "Connections": [
        {
            "ID": 302069,
            "ConnectionTypeID": 25,
            "StatusTypeID": 50,
            "LevelID": 2,
            "PowerKW": 22,
            "CurrentTypeID": 20
        },
        {
            "ID": 302070,
            "ConnectionTypeID": 25,
            "StatusTypeID": 50,
            "LevelID": 2,
            "PowerKW": 22,
            "CurrentTypeID": 20
        }
    ],
    "StatusTypeID": 50,
    "DateLastStatusUpdate": "2021-07-12T02:52:00Z",
    "MetadataValues": [
        {
            "ID": 19494,
            "MetadataFieldID": 4,
            "ItemValue": "Data from the German chargepoint registry provided by Bundesnetzagentur.de under the CC-BY 4.0 license"
        }
    ],
    "DataQualityLevel": 3,
    "DateCreated": "2021-07-12T02:52:00Z",
    "SubmissionStatusTypeID": 100
}