{
    "IsRecentlyVerified": false,
    "ID": 114214,
    "UUID": "86367E09-F4B3-46E3-AFA9-6CB0F2AF59EB",
    "DataProviderID": 1,
    "OperatorID": 45,
    "UsageTypeID": 1,
    "AddressInfo": {
        "ID": 114560,
        "Title": "Corfu Residence",
        "AddressLine1": "Nissaki",
        "Town": "Δήμος Κέρκυρας",
        "StateOrProvince": "Δήμος Κέρκυρας",
        "Postcode": "49081",
        "CountryID": 90,
        "Latitude": 39.725652381365,
        "Longitude": 19.892077422229,
        "ContactTelephone1": "+302663091713",
        "ContactEmail": "cfuvacationclub@gmail.com",
        "RelatedURL": "http://www.corfuresidence.gr/en",
        "DistanceUnit": 0
    },
    "Connections": [
        {
            "ID": 160788,
            "ConnectionTypeID": 25,
            "StatusTypeID": 50,
            "LevelID": 2,
            "Amps": 32,
            "Voltage": 400,
            "PowerKW": 22,
            "CurrentTypeID": 20,
            "Quantity": 1
        }
    ],
    "NumberOfPoints": 1,
    "StatusTypeID": 50,
    "DateLastStatusUpdate": "2019-01-03T21:50:00Z",
    "DataQualityLevel": 1,
    "DateCreated": "2019-01-03T21:20:00Z",
    "SubmissionStatusTypeID": 200
}