{
    "IsRecentlyVerified": false,
    "ID": 143055,
    "UUID": "A9D53D78-8F8A-4EA3-81EA-5B98746F1EDA",
    "DataProviderID": 2,
    "DataProvidersReference": "82679",
    "OperatorID": 5,
    "UsageTypeID": 1,
    "AddressInfo": {
        "ID": 143407,
        "Title": "WHOLE FOODS MKT",
        "AddressLine1": "8 State St",
        "Town": "Wellesley",
        "StateOrProvince": "MA",
        "Postcode": "02482",
        "CountryID": 2,
        "Latitude": 42.3020351,
        "Longitude": -71.2856036,
        "ContactTelephone1": "888-758-4389",
        "AccessComments": "24 hours daily",
        "RelatedURL": "http://www.chargepoint.com/",
        "DistanceUnit": 0
    },
    "Connections": [
        {
            "ID": 199312,
            "ConnectionTypeID": 1,
            "LevelID": 2,
            "Amps": 16,
            "Voltage": 230,
            "PowerKW": 3,
            "CurrentTypeID": 10,
            "Quantity": 2
        }
    ],
    "StatusTypeID": 50,
    "DateLastStatusUpdate": "2019-12-24T09:20:00Z",
    "DataQualityLevel": 3,
    "DateCreated": "2019-12-24T09:20:00Z",
    "SubmissionStatusTypeID": 100
}