{
    "IsRecentlyVerified": false,
    "ID": 53668,
    "UUID": "C01971EF-785D-41A9-B5A1-3CF59BAC7715",
    "DataProviderID": 26,
    "DataProvidersReference": "67058",
    "OperatorID": 178,
    "OperatorsReference": "EVnetNL PNB-ENO107",
    "UsageCost": "0.00 jaarabonnement",
    "AddressInfo": {
        "ID": 54014,
        "Title": "Jonker Florislaan 20",
        "AddressLine1": "Jonker Florislaan 20",
        "Town": "Nuenen c.a.",
        "Postcode": "5673 MJ",
        "CountryID": 159,
        "Latitude": 51.471966,
        "Longitude": 5.559655,
        "ContactTelephone1": "0800-3522365",
        "RelatedURL": "http://www.evnet.nl",
        "DistanceUnit": 0
    },
    "Connections": [
        {
            "ID": 66891,
            "ConnectionTypeID": 25,
            "LevelID": 1,
            "PowerKW": 2.3,
            "CurrentTypeID": 10
        }
    ],
    "NumberOfPoints": 1,
    "StatusTypeID": 50,
    "DateLastStatusUpdate": "2016-06-04T02:39:00Z",
    "DataQualityLevel": 3,
    "DateCreated": "2015-09-20T11:50:00Z",
    "SubmissionStatusTypeID": 100
}