{
    "IsRecentlyVerified": false,
    "ID": 187969,
    "UUID": "B4971F7A-AAD9-4D06-9992-97E587FCD37F",
    "DataProviderID": 18,
    "DataProvidersReference": "3ced1f0723c9157c3d9eb2fcec05baff",
    "OperatorID": 3345,
    "UsageTypeID": 5,
    "AddressInfo": {
        "ID": 188328,
        "Title": "CV6 6JJ",
        "AddressLine1": "",
        "Town": "Coventry",
        "Postcode": "CV6 6JJ",
        "CountryID": 1,
        "Latitude": 52.452439,
        "Longitude": -1.473289,
        "AccessComments": "",
        "RelatedURL": "https://char.gy",
        "DistanceUnit": 0
    },
    "Connections": [
        {
            "ID": 303299,
            "ConnectionTypeID": 25,
            "Reference": "779",
            "StatusTypeID": 50,
            "LevelID": 2,
            "Amps": 16,
            "Voltage": 230,
            "PowerKW": 3.7,
            "CurrentTypeID": 10
        }
    ],
    "StatusTypeID": 0,
    "DateLastStatusUpdate": "2021-07-12T03:39:00Z",
    "MetadataValues": [
        {
            "ID": 20209,
            "MetadataFieldID": 4,
            "ItemValue": "Contains public sector information licensed under the Open Government Licence v2.0. http://www.nationalarchives.gov.uk/doc/open-government-licence/version/2/"
        }
    ],
    "DataQualityLevel": 3,
    "DateCreated": "2021-07-12T03:39:00Z",
    "SubmissionStatusTypeID": 100
}