{
    "IsRecentlyVerified": false,
    "ID": 97051,
    "UUID": "AC984601-358C-4431-9B37-F1A98D774D7F",
    "DataProviderID": 1,
    "DataProvidersReference": "4542",
    "AddressInfo": {
        "ID": 97397,
        "Title": "Ovanbrogatan",
        "AddressLine1": "Ovanbrogatan ",
        "Town": "BORLÄNGE",
        "StateOrProvince": "DALARNA",
        "Postcode": "78433",
        "CountryID": 216,
        "Latitude": 60.48566,
        "Longitude": 15.42955,
        "AccessComments": "Mot Ovanbrogatan på Ovanbroparkeringen mellan Stationsgatan och Resecentrum.",
        "DistanceUnit": 0
    },
    "Connections": [
        {
            "ID": 137699,
            "ConnectionTypeID": 0,
            "Reference": "1",
            "LevelID": 2,
            "Amps": 32,
            "Voltage": 400,
            "PowerKW": 22,
            "Comments": "Mode 3"
        },
        {
            "ID": 137700,
            "ConnectionTypeID": 0,
            "Reference": "2",
            "LevelID": 2,
            "Amps": 32,
            "Voltage": 400,
            "PowerKW": 22,
            "Comments": "Mode 3"
        },
        {
            "ID": 137701,
            "ConnectionTypeID": 0,
            "Reference": "3",
            "LevelID": 2,
            "Amps": 32,
            "Voltage": 400,
            "PowerKW": 22,
            "Comments": "Mode 3"
        },
        {
            "ID": 137702,
            "ConnectionTypeID": 0,
            "Reference": "4",
            "LevelID": 2,
            "Amps": 32,
            "Voltage": 400,
            "PowerKW": 22,
            "Comments": "Mode 3"
        }
    ],
    "NumberOfPoints": 4,
    "DateLastStatusUpdate": "2020-05-26T08:24:00Z",
    "DataQualityLevel": 2,
    "DateCreated": "2018-01-04T08:28:00Z",
    "SubmissionStatusTypeID": 100
}