{
    "MediaItems": [
        {
            "ID": 23133,
            "ChargePointID": 148321,
            "ItemURL": "https://s3-ap-southeast-2.amazonaws.com/openchargemap/images/FI/OCM148321/OCM-148321.orig.2020071910192456.jpg",
            "ItemThumbnailURL": "https://s3-ap-southeast-2.amazonaws.com/openchargemap/images/FI/OCM148321/OCM-148321.thmb.2020071910192456.jpg",
            "Comment": "",
            "IsEnabled": true,
            "IsVideo": false,
            "IsFeaturedItem": false,
            "IsExternalResource": false,
            "User": {
                "ID": 26470,
                "Username": "erkkiat"
            },
            "DateCreated": "2020-07-19T10:19:00Z"
        }
    ],
    "IsRecentlyVerified": false,
    "ID": 148321,
    "UUID": "F369225C-6D82-4DCE-9B6F-16C005ABEB96",
    "DataProviderID": 1,
    "OperatorID": 1,
    "UsageTypeID": 5,
    "UsageCost": "DC 0,20€/kWh, with client card 0,10€/kWh, AC 1h free with client card",
    "AddressInfo": {
        "ID": 148673,
        "Title": "Motonet Lommila",
        "AddressLine1": "Motonet Espoo",
        "AddressLine2": "Espoontie",
        "Town": "Espoo",
        "StateOrProvince": "Southern Finland",
        "Postcode": "02740",
        "CountryID": 79,
        "Latitude": 60.221650831575346,
        "Longitude": 24.664243091424737,
        "AccessComments": "Charge cards available at customer service point inside",
        "RelatedURL": "http://www.motonet.fi",
        "DistanceUnit": 0
    },
    "Connections": [
        {
            "ID": 205922,
            "ConnectionTypeID": 33,
            "StatusTypeID": 50,
            "LevelID": 3,
            "PowerKW": 50,
            "CurrentTypeID": 30,
            "Quantity": 1
        },
        {
            "ID": 205923,
            "ConnectionTypeID": 2,
            "StatusTypeID": 50,
            "LevelID": 3,
            "PowerKW": 50,
            "CurrentTypeID": 30,
            "Quantity": 1
        },
        {
            "ID": 205924,
            "ConnectionTypeID": 1036,
            "StatusTypeID": 50,
            "LevelID": 2,
            "Amps": 32,
            "Voltage": 400,
            "PowerKW": 22,
            "CurrentTypeID": 20,
            "Quantity": 1
        }
    ],
    "NumberOfPoints": 3,
    "StatusTypeID": 50,
    "DateLastStatusUpdate": "2020-07-23T09:48:00Z",
    "DataQualityLevel": 1,
    "DateCreated": "2020-01-30T08:07:00Z",
    "SubmissionStatusTypeID": 200
}