{
    "IsRecentlyVerified": false,
    "ID": 177311,
    "UUID": "C0457018-B4F8-4679-BB9A-9C59635A785C",
    "DataProviderID": 29,
    "DataProvidersReference": "6049",
    "OperatorID": 45,
    "AddressInfo": {
        "ID": 177670,
        "Title": "Deutsch-Ritter-Allee 50",
        "AddressLine1": "Deutsch-Ritter-Allee 50",
        "Town": "Grevenbroich",
        "Postcode": "41515",
        "CountryID": 87,
        "Latitude": 51.085798,
        "Longitude": 6.574558,
        "DistanceUnit": 0
    },
    "Connections": [
        {
            "ID": 276314,
            "ConnectionTypeID": 25,
            "StatusTypeID": 50,
            "LevelID": 2,
            "PowerKW": 22,
            "CurrentTypeID": 20
        },
        {
            "ID": 276315,
            "ConnectionTypeID": 25,
            "StatusTypeID": 50,
            "LevelID": 2,
            "PowerKW": 22,
            "CurrentTypeID": 20
        }
    ],
    "StatusTypeID": 0,
    "DateLastStatusUpdate": "2021-07-12T02:46:00Z",
    "MetadataValues": [
        {
            "ID": 9605,
            "MetadataFieldID": 4,
            "ItemValue": "Data from the German chargepoint registry provided by Bundesnetzagentur.de under the CC-BY 4.0 license"
        }
    ],
    "DataQualityLevel": 3,
    "DateCreated": "2021-07-08T09:48:00Z",
    "SubmissionStatusTypeID": 100
}