{
    "IsRecentlyVerified": false,
    "ID": 141043,
    "UUID": "D24777E4-F7FD-4333-AAF9-B89D28B26C8E",
    "DataProviderID": 2,
    "DataProvidersReference": "88596",
    "OperatorID": 5,
    "UsageTypeID": 1,
    "AddressInfo": {
        "ID": 141395,
        "Title": "CITYOFPITTSBURG",
        "AddressLine1": "1005 Center Dr",
        "Town": "Pittsburg",
        "StateOrProvince": "CA",
        "Postcode": "94565",
        "CountryID": 2,
        "Latitude": 38.021078,
        "Longitude": -121.890386,
        "ContactTelephone1": "888-758-4389",
        "AccessComments": "24 hours daily",
        "RelatedURL": "http://www.chargepoint.com/",
        "DistanceUnit": 0
    },
    "Connections": [
        {
            "ID": 196851,
            "ConnectionTypeID": 1,
            "LevelID": 2,
            "Amps": 16,
            "Voltage": 230,
            "PowerKW": 3,
            "CurrentTypeID": 10,
            "Quantity": 2
        }
    ],
    "StatusTypeID": 50,
    "DateLastStatusUpdate": "2019-12-24T09:14:00Z",
    "DataQualityLevel": 3,
    "DateCreated": "2019-12-24T09:14:00Z",
    "SubmissionStatusTypeID": 100
}