{
    "IsRecentlyVerified": false,
    "ID": 111688,
    "UUID": "1A8871B1-B638-4A95-AD04-D0540339D3A0",
    "DataProviderID": 2,
    "DataProvidersReference": "84233",
    "UsageTypeID": 1,
    "AddressInfo": {
        "ID": 112034,
        "Title": "Poissonnerie Lauzier",
        "AddressLine1": "57 Av Morel",
        "Town": "Kamouraska",
        "StateOrProvince": "QC",
        "Postcode": "G0L 1M0",
        "CountryID": 44,
        "Latitude": 47.566077,
        "Longitude": -69.866378,
        "ContactTelephone1": "418-492-7988",
        "AccessComments": "24 hours daily",
        "RelatedURL": "",
        "DistanceUnit": 0
    },
    "Connections": [
        {
            "ID": 157170,
            "ConnectionTypeID": 1,
            "LevelID": 2,
            "Amps": 16,
            "Voltage": 230,
            "PowerKW": 3.7,
            "CurrentTypeID": 10,
            "Quantity": 2
        }
    ],
    "DateLastStatusUpdate": "2020-06-26T03:11:00Z",
    "DataQualityLevel": 3,
    "DateCreated": "2018-10-18T23:37:00Z",
    "SubmissionStatusTypeID": 100
}