{
    "IsRecentlyVerified": false,
    "ID": 17280,
    "UUID": "99EEDE48-9097-4520-953E-01E42413BC7D",
    "DataProviderID": 22,
    "DataProvidersReference": "106D6A60386B448F80D401758C203F54",
    "AddressInfo": {
        "ID": 17625,
        "Title": "愛知日産自動車苅安賀店",
        "AddressLine1": "愛知県一宮市観音寺1-19-7",
        "CountryID": 114,
        "Latitude": 35.28701148,
        "Longitude": 136.7894365,
        "ContactTelephone1": "0586-43-3123",
        "DistanceUnit": 0
    },
    "Connections": [
        {
            "ID": 17521,
            "ConnectionTypeID": 2,
            "LevelID": 2,
            "Amps": 100,
            "Voltage": 480,
            "PowerKW": 48,
            "Quantity": 1
        }
    ],
    "DateLastStatusUpdate": "2013-06-29T08:56:00Z",
    "DataQualityLevel": 2,
    "DateCreated": "2013-06-29T08:56:00Z",
    "SubmissionStatusTypeID": 200
}