{
    "IsRecentlyVerified": false,
    "ID": 123216,
    "UUID": "0FF76CAD-CA33-4C56-800E-93CC28406B2F",
    "DataProviderID": 2,
    "DataProvidersReference": "86098",
    "OperatorID": 5,
    "UsageTypeID": 1,
    "AddressInfo": {
        "ID": 123562,
        "Title": "DOWNTOWN",
        "AddressLine1": "Commerce St Depot Parking Lot",
        "Town": "Thomasville",
        "StateOrProvince": "NC",
        "Postcode": "27360",
        "CountryID": 2,
        "Latitude": 35.8834254,
        "Longitude": -80.0804558,
        "ContactTelephone1": "888-758-4389",
        "AccessComments": "24 hours daily",
        "RelatedURL": "http://www.chargepoint.com/",
        "DistanceUnit": 0
    },
    "Connections": [
        {
            "ID": 173168,
            "ConnectionTypeID": 1,
            "LevelID": 2,
            "Amps": 16,
            "Voltage": 230,
            "PowerKW": 3.7,
            "CurrentTypeID": 10,
            "Quantity": 2
        }
    ],
    "DateLastStatusUpdate": "2020-06-26T02:58:00Z",
    "DataQualityLevel": 3,
    "DateCreated": "2019-04-06T05:03:00Z",
    "SubmissionStatusTypeID": 100
}