{
    "IsRecentlyVerified": false,
    "ID": 120838,
    "UUID": "8C52CAFE-AE41-4E30-8430-8C77591BD3C0",
    "DataProviderID": 2,
    "DataProvidersReference": "48352",
    "UsageTypeID": 2,
    "AddressInfo": {
        "ID": 121184,
        "Title": "AAA - Auto Club of Southern California, Administrative Offices",
        "AddressLine1": "3333 Fairview Rd",
        "Town": "Costa Mesa",
        "StateOrProvince": "CA",
        "Postcode": "92626",
        "CountryID": 2,
        "Latitude": 33.6915,
        "Longitude": -117.9095,
        "ContactTelephone1": "",
        "AccessComments": "Employee use only",
        "RelatedURL": "",
        "DistanceUnit": 0
    },
    "Connections": [
        {
            "ID": 170234,
            "ConnectionTypeID": 1,
            "LevelID": 2,
            "Amps": 16,
            "Voltage": 230,
            "PowerKW": 3.7,
            "CurrentTypeID": 10,
            "Quantity": 4
        }
    ],
    "DateLastStatusUpdate": "2020-06-26T02:55:00Z",
    "DataQualityLevel": 3,
    "DateCreated": "2019-04-01T04:59:00Z",
    "SubmissionStatusTypeID": 100
}