{
    "IsRecentlyVerified": false,
    "ID": 179648,
    "UUID": "9332A6CE-A6C9-485D-99A5-3DAEC4AB6548",
    "DataProviderID": 29,
    "DataProvidersReference": "18863",
    "OperatorID": 105,
    "AddressInfo": {
        "ID": 180007,
        "Title": "Rüttenscheider Pl. 14",
        "AddressLine1": "Rüttenscheider Pl. 14",
        "Town": "Essen",
        "Postcode": "45130",
        "CountryID": 87,
        "Latitude": 51.43834,
        "Longitude": 7.00805,
        "DistanceUnit": 0
    },
    "Connections": [
        {
            "ID": 281736,
            "ConnectionTypeID": 25,
            "StatusTypeID": 50,
            "LevelID": 2,
            "PowerKW": 22,
            "CurrentTypeID": 20
        },
        {
            "ID": 281737,
            "ConnectionTypeID": 25,
            "StatusTypeID": 50,
            "LevelID": 2,
            "PowerKW": 22,
            "CurrentTypeID": 20
        }
    ],
    "StatusTypeID": 50,
    "DateLastStatusUpdate": "2021-07-12T02:47:00Z",
    "MetadataValues": [
        {
            "ID": 11942,
            "MetadataFieldID": 4,
            "ItemValue": "Data from the German chargepoint registry provided by Bundesnetzagentur.de under the CC-BY 4.0 license"
        }
    ],
    "DataQualityLevel": 3,
    "DateCreated": "2021-07-08T09:59:00Z",
    "SubmissionStatusTypeID": 100
}