{
    "IsRecentlyVerified": false,
    "ID": 49158,
    "UUID": "22C001FD-98CA-4EB6-BF9A-DFB7E91E9C8B",
    "DataProviderID": 1,
    "OperatorID": 45,
    "UsageTypeID": 5,
    "AddressInfo": {
        "ID": 49504,
        "Title": "Engelplatz",
        "AddressLine1": "Engelplatz 1",
        "Town": "Lörrach",
        "Postcode": "79539",
        "CountryID": 87,
        "Latitude": 47.6098286085675,
        "Longitude": 7.66626841602475,
        "ContactTelephone1": "+49 762 392 14 06",
        "AccessComments": "Die 24/7 nutzbare Säule kann mit einer NFC-fähigen Kreditkarte genutzt werden (PayPass oder PayWave). Kosten: einmalig € 1,50 + € 2,00/h + € 0,30/kWh",
        "RelatedURL": "http://www.energiedienst.de/cms/unternehmen/verantwortung/e_mobility/elektromobilitaet.php",
        "DistanceUnit": 0
    },
    "Connections": [
        {
            "ID": 60750,
            "ConnectionTypeID": 25,
            "StatusTypeID": 50,
            "LevelID": 2,
            "Amps": 32,
            "Voltage": 400,
            "PowerKW": 22,
            "CurrentTypeID": 20,
            "Quantity": 2
        }
    ],
    "NumberOfPoints": 2,
    "StatusTypeID": 50,
    "DateLastStatusUpdate": "2015-07-12T16:57:00Z",
    "DataQualityLevel": 1,
    "DateCreated": "2015-07-12T16:08:00Z",
    "SubmissionStatusTypeID": 200
}