{
    "IsRecentlyVerified": false,
    "ID": 169733,
    "UUID": "7F6B6E8C-A6E6-461D-BEFA-D6C8E0CCCB52",
    "DataProviderID": 1,
    "OperatorID": 150,
    "UsageTypeID": 4,
    "UsageCost": "completely free to use until 29th October 2021.",
    "AddressInfo": {
        "ID": 170092,
        "Title": "Parsonage Lane Car Park",
        "AddressLine1": "20 Church Ln",
        "Town": "Brighouse",
        "StateOrProvince": "England",
        "Postcode": "HD6 1AT",
        "CountryID": 1,
        "Latitude": 53.70243954239024,
        "Longitude": -1.7831382135070726,
        "AccessComments": "£10 overstay fee after 75 mins, then £10 every subsequent 75 mins.",
        "RelatedURL": "http://ev.engie.co.uk",
        "DistanceUnit": 0
    },
    "Connections": [
        {
            "ID": 258561,
            "ConnectionTypeID": 2,
            "StatusTypeID": 50,
            "LevelID": 3,
            "PowerKW": 50,
            "CurrentTypeID": 30,
            "Quantity": 1
        },
        {
            "ID": 258562,
            "ConnectionTypeID": 33,
            "StatusTypeID": 50,
            "LevelID": 3,
            "PowerKW": 50,
            "CurrentTypeID": 30,
            "Quantity": 1
        },
        {
            "ID": 258563,
            "ConnectionTypeID": 25,
            "StatusTypeID": 50,
            "LevelID": 2,
            "Amps": 32,
            "Voltage": 400,
            "PowerKW": 22,
            "CurrentTypeID": 20,
            "Quantity": 1
        }
    ],
    "NumberOfPoints": 1,
    "GeneralComments": "Parking charges May apply. 08:00 till 18:00 : Monday to Saturday",
    "StatusTypeID": 50,
    "DateLastStatusUpdate": "2021-07-28T16:06:00Z",
    "DataQualityLevel": 1,
    "DateCreated": "2020-11-05T23:51:00Z",
    "SubmissionStatusTypeID": 200
}