{
    "IsRecentlyVerified": false,
    "ID": 72561,
    "UUID": "AD0405C4-DADE-42BF-BBAF-6C95D8A2ED77",
    "DataProviderID": 1,
    "OperatorID": 3,
    "OperatorsReference": "PG-90888",
    "UsageTypeID": 6,
    "UsageCost": "1",
    "AddressInfo": {
        "ID": 72907,
        "Title": "Cheshire Oaks-Hyundai",
        "AddressLine1": "1 Oakland Drive",
        "Town": "Little Stanney",
        "StateOrProvince": "Cheshire",
        "Postcode": "CH65 9LG",
        "CountryID": 1,
        "Latitude": 53.259965,
        "Longitude": -2.887242,
        "DistanceUnit": 0
    },
    "Connections": [
        {
            "ID": 104009,
            "ConnectionTypeID": 25,
            "StatusTypeID": 50,
            "LevelID": 2,
            "Amps": 32,
            "Voltage": 230,
            "PowerKW": 7,
            "CurrentTypeID": 10,
            "Quantity": 1
        }
    ],
    "NumberOfPoints": 3,
    "StatusTypeID": 0,
    "DateLastStatusUpdate": "2020-01-30T06:32:00Z",
    "DataQualityLevel": 1,
    "DateCreated": "2016-10-24T09:03:00Z",
    "SubmissionStatusTypeID": 200
}