{
    "IsRecentlyVerified": false,
    "ID": 180707,
    "UUID": "C91918F9-F155-4A4F-A167-2617203724A6",
    "DataProviderID": 29,
    "DataProvidersReference": "9290",
    "AddressInfo": {
        "ID": 181066,
        "Title": "Am Schlosspark 2",
        "AddressLine1": "Am Schlosspark 2",
        "Town": "Buseck",
        "Postcode": "35418",
        "CountryID": 87,
        "Latitude": 50.60952,
        "Longitude": 8.78824,
        "DistanceUnit": 0
    },
    "Connections": [
        {
            "ID": 284124,
            "ConnectionTypeID": 25,
            "StatusTypeID": 50,
            "LevelID": 2,
            "PowerKW": 22,
            "CurrentTypeID": 20
        },
        {
            "ID": 284125,
            "ConnectionTypeID": 25,
            "StatusTypeID": 50,
            "LevelID": 2,
            "PowerKW": 22,
            "CurrentTypeID": 20
        }
    ],
    "StatusTypeID": 50,
    "DateLastStatusUpdate": "2021-07-12T02:45:00Z",
    "MetadataValues": [
        {
            "ID": 13001,
            "MetadataFieldID": 4,
            "ItemValue": "Data from the German chargepoint registry provided by Bundesnetzagentur.de under the CC-BY 4.0 license"
        }
    ],
    "DataQualityLevel": 3,
    "DateCreated": "2021-07-08T10:00:00Z",
    "SubmissionStatusTypeID": 100
}