{
    "IsRecentlyVerified": false,
    "ID": 145351,
    "UUID": "2A68177A-D0F4-42FA-BA65-EEC4285ABD26",
    "DataProviderID": 2,
    "DataProvidersReference": "150473",
    "OperatorID": 5,
    "UsageTypeID": 1,
    "AddressInfo": {
        "ID": 145703,
        "Title": "BMVA",
        "AddressLine1": "Kelsey Dr at Messenger Drive",
        "Town": "St. John's",
        "StateOrProvince": "NL",
        "Postcode": "A1B 0L2",
        "CountryID": 44,
        "Latitude": 47.5592438,
        "Longitude": -52.7805913,
        "ContactTelephone1": "888-758-4389",
        "AccessComments": "24 hours daily",
        "RelatedURL": "http://www.chargepoint.com/",
        "DistanceUnit": 0
    },
    "Connections": [
        {
            "ID": 202009,
            "ConnectionTypeID": 1,
            "LevelID": 2,
            "Amps": 16,
            "Voltage": 230,
            "PowerKW": 3.7,
            "CurrentTypeID": 10,
            "Quantity": 1
        }
    ],
    "StatusTypeID": 50,
    "DateLastStatusUpdate": "2020-06-26T03:11:00Z",
    "DataQualityLevel": 3,
    "DateCreated": "2019-12-24T09:24:00Z",
    "SubmissionStatusTypeID": 100
}