{
    "IsRecentlyVerified": false,
    "ID": 115391,
    "UUID": "24153D91-D1CE-426F-B680-D59B11BAD84D",
    "DataProviderID": 2,
    "DataProvidersReference": "105274",
    "OperatorID": 5,
    "UsageTypeID": 1,
    "AddressInfo": {
        "ID": 115737,
        "Title": "HONDA",
        "AddressLine1": "1601 Dallas Pkwy",
        "Town": "Frisco",
        "StateOrProvince": "TX",
        "Postcode": "75034",
        "CountryID": 2,
        "Latitude": 33.092599,
        "Longitude": -96.824777,
        "ContactTelephone1": "888-758-4389",
        "AccessComments": "24 hours daily",
        "RelatedURL": "http://www.chargepoint.com/",
        "DistanceUnit": 0
    },
    "Connections": [
        {
            "ID": 162394,
            "ConnectionTypeID": 1,
            "LevelID": 2,
            "Amps": 16,
            "Voltage": 230,
            "PowerKW": 3,
            "CurrentTypeID": 10,
            "Quantity": 2
        }
    ],
    "DateLastStatusUpdate": "2019-04-06T04:01:00Z",
    "DataQualityLevel": 3,
    "DateCreated": "2019-02-11T07:13:00Z",
    "SubmissionStatusTypeID": 100
}