{
    "IsRecentlyVerified": false,
    "ID": 127512,
    "UUID": "37C21F93-1110-4034-9260-465D825567C1",
    "DataProviderID": 1,
    "OperatorID": 3251,
    "UsageTypeID": 1,
    "UsageCost": "Subscription or SMS",
    "AddressInfo": {
        "ID": 127858,
        "Title": "Powered by E.ON & Clever Fredericia ",
        "AddressLine1": "Strevelinsvej",
        "Town": "Fredericia",
        "StateOrProvince": "Fredericia Municipality",
        "Postcode": "7000",
        "CountryID": 65,
        "Latitude": 55.5357293332331,
        "Longitude": 9.71849289367685,
        "DistanceUnit": 0
    },
    "Connections": [
        {
            "ID": 178493,
            "ConnectionTypeID": 2,
            "StatusTypeID": 50,
            "LevelID": 3,
            "PowerKW": 175,
            "CurrentTypeID": 30,
            "Quantity": 2
        },
        {
            "ID": 178494,
            "ConnectionTypeID": 33,
            "StatusTypeID": 50,
            "LevelID": 3,
            "PowerKW": 175,
            "CurrentTypeID": 30,
            "Quantity": 4
        }
    ],
    "NumberOfPoints": 4,
    "GeneralComments": "Joint venture between Clever and E.ON\r\nFor cost please go to the website.",
    "StatusTypeID": 50,
    "DateLastStatusUpdate": "2019-06-04T06:56:00Z",
    "DataQualityLevel": 1,
    "DateCreated": "2019-06-03T15:21:00Z",
    "SubmissionStatusTypeID": 200
}