{
    "IsRecentlyVerified": false,
    "ID": 91441,
    "UUID": "274320F7-6CDB-4184-A636-0AD7A7B648B6",
    "DataProviderID": 2,
    "DataProvidersReference": "60750",
    "OperatorID": 5,
    "UsageTypeID": 1,
    "AddressInfo": {
        "ID": 91787,
        "Title": "IVGID",
        "AddressLine1": "1210 Ski Way",
        "Town": "Incline Village",
        "StateOrProvince": "NV",
        "Postcode": "89451",
        "CountryID": 2,
        "Latitude": 39.253658,
        "Longitude": -119.915598,
        "ContactTelephone1": "888-758-4389",
        "AccessComments": "24 hours daily",
        "RelatedURL": "http://www.chargepoint.com/",
        "DistanceUnit": 0
    },
    "Connections": [
        {
            "ID": 129608,
            "ConnectionTypeID": 1,
            "LevelID": 2,
            "Amps": 16,
            "Voltage": 230,
            "PowerKW": 3.7,
            "CurrentTypeID": 10,
            "Quantity": 2
        }
    ],
    "DateLastStatusUpdate": "2020-06-26T03:01:00Z",
    "DataQualityLevel": 3,
    "DateCreated": "2017-08-03T12:25:00Z",
    "SubmissionStatusTypeID": 100
}