{
    "IsRecentlyVerified": false,
    "ID": 51446,
    "UUID": "1A6284A7-7BCC-409F-8AB4-3E25B3A736F1",
    "DataProviderID": 1,
    "OperatorID": 69,
    "UsageTypeID": 4,
    "UsageCost": "0",
    "AddressInfo": {
        "ID": 51792,
        "Title": "Ladesäule Audi Sportpark 2",
        "AddressLine1": "Audi Sportpark 1b",
        "Town": "Ingolstadt",
        "Postcode": "85049",
        "CountryID": 87,
        "Latitude": 48.7467525454489,
        "Longitude": 11.4862914023179,
        "ContactTelephone1": "0800/8000 230",
        "AccessComments": "24/7 nutzbar. Ladekarte von Ladenetz oder EWE-Karte, WSW Strom eMobil Ladekarte,ladeticket, The New Motion Ladekarte oder Charge & Fuel nötig.",
        "RelatedURL": "http://www.sw-i.de/",
        "DistanceUnit": 0
    },
    "Connections": [
        {
            "ID": 63722,
            "ConnectionTypeID": 25,
            "StatusTypeID": 50,
            "LevelID": 2,
            "Amps": 32,
            "Voltage": 400,
            "PowerKW": 22,
            "CurrentTypeID": 20,
            "Quantity": 2
        },
        {
            "ID": 63723,
            "ConnectionTypeID": 28,
            "StatusTypeID": 50,
            "LevelID": 2,
            "PowerKW": 3.7,
            "CurrentTypeID": 10,
            "Quantity": 1
        }
    ],
    "NumberOfPoints": 2,
    "StatusTypeID": 50,
    "DateLastStatusUpdate": "2015-07-26T17:15:00Z",
    "DataQualityLevel": 1,
    "DateCreated": "2015-07-26T16:40:00Z",
    "SubmissionStatusTypeID": 200
}