{
    "IsRecentlyVerified": false,
    "ID": 45616,
    "UUID": "0AABAF35-74E9-400D-BEDD-FB70176274B5",
    "DataProviderID": 1,
    "DataProvidersReference": "2377",
    "AddressInfo": {
        "ID": 45962,
        "Title": "Gangvide Farm",
        "AddressLine1": "Stånga 540",
        "Town": "STÅNGA",
        "StateOrProvince": "GOTLAND",
        "Postcode": "62348",
        "CountryID": 216,
        "Latitude": 57.2593,
        "Longitude": 18.65491,
        "AccessComments": "Laddplatsen sitter direkt till vänster när man svänger in till gården",
        "DistanceUnit": 0
    },
    "Connections": [
        {
            "ID": 56279,
            "ConnectionTypeID": 0,
            "Reference": "1",
            "LevelID": 2,
            "Amps": 16,
            "Voltage": 230,
            "PowerKW": 3.7,
            "Comments": "Mode 3"
        },
        {
            "ID": 83905,
            "ConnectionTypeID": 0,
            "Reference": "2",
            "LevelID": 2,
            "Amps": 16,
            "Voltage": 230,
            "PowerKW": 3.7,
            "Comments": "Mode 1"
        },
        {
            "ID": 87824,
            "ConnectionTypeID": 0,
            "Reference": "3",
            "LevelID": 2,
            "Amps": 16,
            "Voltage": 230,
            "PowerKW": 3.7,
            "Comments": "Mode 1"
        }
    ],
    "NumberOfPoints": 3,
    "DateLastStatusUpdate": "2020-05-26T08:21:00Z",
    "DataQualityLevel": 2,
    "DateCreated": "2015-05-03T00:54:00Z",
    "SubmissionStatusTypeID": 100
}