{
    "IsRecentlyVerified": false,
    "ID": 174334,
    "UUID": "2DEFFB66-2612-4002-90D3-4F0C2DC7F776",
    "DataProviderID": 19,
    "DataProvidersReference": "6978",
    "AddressInfo": {
        "ID": 174693,
        "Title": "Húsavík (Orkan)",
        "AddressLine1": "Húsavík(Orkan), Héðinsbraut 6",
        "Town": "Húsavík",
        "StateOrProvince": "Norðurland eystra",
        "Postcode": "640",
        "CountryID": 105,
        "Latitude": 66.048441,
        "Longitude": -17.344355,
        "AccessComments": "",
        "DistanceUnit": 0
    },
    "Connections": [
        {
            "ID": 269879,
            "ConnectionTypeID": 25,
            "Reference": "1",
            "LevelID": 3,
            "Amps": 32,
            "Voltage": 400,
            "PowerKW": 22,
            "CurrentTypeID": 30,
            "Comments": "Mode 3"
        },
        {
            "ID": 269880,
            "ConnectionTypeID": 2,
            "Reference": "2",
            "LevelID": 3,
            "Amps": 100,
            "Voltage": 500,
            "PowerKW": 50,
            "CurrentTypeID": 30,
            "Comments": "Mode 4"
        },
        {
            "ID": 269881,
            "ConnectionTypeID": 33,
            "Reference": "3",
            "LevelID": 3,
            "Amps": 100,
            "Voltage": 500,
            "PowerKW": 50,
            "CurrentTypeID": 30,
            "Comments": "Mode 4"
        }
    ],
    "NumberOfPoints": 3,
    "StatusTypeID": 0,
    "DateLastStatusUpdate": "2021-03-24T05:12:00Z",
    "DataQualityLevel": 2,
    "DateCreated": "2021-03-24T05:12:00Z",
    "SubmissionStatusTypeID": 100
}