{
    "IsRecentlyVerified": false,
    "ID": 161308,
    "UUID": "4E058C75-B14D-4398-8761-57CD256C582E",
    "DataProviderID": 1,
    "OperatorID": 3378,
    "UsageTypeID": 5,
    "AddressInfo": {
        "ID": 161665,
        "Title": "BP Golgota tér MOL",
        "AddressLine1": "Golgota tér 1.",
        "Town": "Budapest",
        "StateOrProvince": "Budapest",
        "Postcode": "1089",
        "CountryID": 104,
        "Latitude": 47.485919142374144,
        "Longitude": 19.09366331241108,
        "RelatedURL": "https://molplugee.hu/hu/toltoink",
        "DistanceUnit": 0
    },
    "Connections": [
        {
            "ID": 232144,
            "ConnectionTypeID": 33,
            "StatusTypeID": 50,
            "LevelID": 3,
            "PowerKW": 50,
            "CurrentTypeID": 30,
            "Quantity": 1
        },
        {
            "ID": 232145,
            "ConnectionTypeID": 2,
            "StatusTypeID": 50,
            "LevelID": 3,
            "PowerKW": 50,
            "CurrentTypeID": 30,
            "Quantity": 1
        },
        {
            "ID": 232146,
            "ConnectionTypeID": 1036,
            "StatusTypeID": 50,
            "LevelID": 2,
            "PowerKW": 22,
            "CurrentTypeID": 20,
            "Quantity": 1
        }
    ],
    "NumberOfPoints": 1,
    "GeneralComments": "DBT QC SL 314",
    "StatusTypeID": 50,
    "DateLastStatusUpdate": "2020-07-10T17:10:00Z",
    "DataQualityLevel": 1,
    "DateCreated": "2020-07-08T11:19:00Z",
    "SubmissionStatusTypeID": 200
}