{
    "IsRecentlyVerified": false,
    "ID": 29782,
    "UUID": "3DFDDD54-05BB-4157-A8A3-0EBF7E8BE46E",
    "DataProviderID": 15,
    "DataProvidersReference": "18741",
    "OperatorID": 1,
    "UsageTypeID": 1,
    "AddressInfo": {
        "ID": 30128,
        "Title": "Airport Blvd E",
        "AddressLine1": "Airport Blvd E",
        "Town": "Sacramento",
        "StateOrProvince": "CA",
        "Postcode": "95746",
        "CountryID": 2,
        "Latitude": 38.6919,
        "Longitude": -121.58904,
        "ContactTelephone1": "916467",
        "RelatedURL": "http://carstations.com/18741",
        "DistanceUnit": 0
    },
    "Connections": [
        {
            "ID": 32767,
            "ConnectionTypeID": 0,
            "Reference": "SPI"
        }
    ],
    "NumberOfPoints": 18,
    "StatusTypeID": 50,
    "DateLastStatusUpdate": "2017-11-04T14:04:00Z",
    "DataQualityLevel": 2,
    "DateCreated": "2014-11-29T05:39:00Z",
    "SubmissionStatusTypeID": 100
}