{
    "IsRecentlyVerified": false,
    "ID": 105946,
    "UUID": "0AB78A38-C58E-4E53-8031-1A6DA5BDEA15",
    "DataProviderID": 1,
    "OperatorID": 69,
    "UsageTypeID": 4,
    "AddressInfo": {
        "ID": 106292,
        "Title": "Tiefgarage Stadtverwaltung",
        "AddressLine1": "Löchgauer Straße 23-25",
        "Town": "Bietigheim-Bissingen",
        "StateOrProvince": "Vereinbarte Verwaltungsgemeinschaft der Stadt Bietigheim-Bissingen",
        "Postcode": "74321",
        "CountryID": 87,
        "Latitude": 48.96084,
        "Longitude": 9.12683000000004,
        "AccessComments": "In der Tiefgarage ist sie Stromtankstelle (2 Mennekes Amtron Boxen mit Kabeln) ausgeschildert. Parkgebühren (max. 4 h) 0,10€/h",
        "RelatedURL": "https://www.sw-bb.de/wir-fuer-sie/dienstleistungen/energiedienstleistungen/elektromobilitaet/ladepun",
        "DistanceUnit": 0
    },
    "Connections": [
        {
            "ID": 149189,
            "ConnectionTypeID": 1036,
            "StatusTypeID": 50,
            "LevelID": 2,
            "Amps": 32,
            "Voltage": 400,
            "PowerKW": 22,
            "CurrentTypeID": 20,
            "Quantity": 2
        }
    ],
    "NumberOfPoints": 2,
    "StatusTypeID": 50,
    "DateLastStatusUpdate": "2018-06-12T06:02:00Z",
    "DataQualityLevel": 1,
    "DateCreated": "2018-06-12T06:02:00Z",
    "SubmissionStatusTypeID": 200
}