{
    "IsRecentlyVerified": false,
    "ID": 71381,
    "UUID": "497110B2-2922-429B-94FF-3E77AF36D553",
    "DataProviderID": 2,
    "DataProvidersReference": "77382",
    "OperatorID": 5,
    "UsageTypeID": 1,
    "AddressInfo": {
        "ID": 71727,
        "Title": "HUDSON CONCOURS",
        "AddressLine1": "1735 Technology Dr",
        "Town": "San Jose",
        "StateOrProvince": "CA",
        "Postcode": "95110",
        "CountryID": 2,
        "Latitude": 37.3671671,
        "Longitude": -121.9204154,
        "ContactTelephone1": "888-758-4389",
        "AccessComments": "24 hours daily",
        "RelatedURL": "http://www.chargepoint.com/",
        "DistanceUnit": 0
    },
    "Connections": [
        {
            "ID": 102196,
            "ConnectionTypeID": 1,
            "LevelID": 2,
            "Amps": 16,
            "Voltage": 230,
            "PowerKW": 3,
            "CurrentTypeID": 10,
            "Quantity": 2
        }
    ],
    "DateLastStatusUpdate": "2019-12-24T09:13:00Z",
    "DataQualityLevel": 3,
    "DateCreated": "2016-09-02T10:14:00Z",
    "SubmissionStatusTypeID": 100
}