{
    "IsRecentlyVerified": false,
    "ID": 105426,
    "UUID": "D8F36A81-C5D9-48BD-A34E-C6F9D48C4654",
    "DataProviderID": 1,
    "OperatorID": 105,
    "UsageTypeID": 4,
    "AddressInfo": {
        "ID": 105772,
        "Title": "Anh-Hong",
        "AddressLine1": "Charlottenburger Ring 41",
        "Town": "Bad Iburg",
        "StateOrProvince": "Landkreis Osnabrück",
        "Postcode": "49186",
        "CountryID": 87,
        "Latitude": 52.1558511,
        "Longitude": 8.041853700000047,
        "AccessComments": "24/7 nutzbare Ladesäule vom RWE Typ auf gebührenpflichtigen Parkplatz.",
        "DistanceUnit": 0
    },
    "Connections": [
        {
            "ID": 148591,
            "ConnectionTypeID": 25,
            "StatusTypeID": 50,
            "LevelID": 2,
            "Amps": 32,
            "Voltage": 400,
            "PowerKW": 22,
            "CurrentTypeID": 20,
            "Quantity": 2
        }
    ],
    "NumberOfPoints": 2,
    "StatusTypeID": 50,
    "DateLastStatusUpdate": "2018-06-06T06:32:00Z",
    "DataQualityLevel": 1,
    "DateCreated": "2018-06-06T06:32:00Z",
    "SubmissionStatusTypeID": 200
}