{
    "IsRecentlyVerified": false,
    "ID": 60185,
    "UUID": "951BB867-808A-47FF-AAD0-F0F8FE00D01B",
    "DataProviderID": 1,
    "OperatorID": 235,
    "UsageTypeID": 4,
    "UsageCost": "0",
    "AddressInfo": {
        "ID": 60531,
        "Title": "SWD Ernst-Reuter-Platz E-Bike-Ladestation",
        "AddressLine1": "Adersstraße 44",
        "AddressLine2": "Friedrichstadt",
        "Town": "Düsseldorf",
        "StateOrProvince": "Düsseldorf",
        "Postcode": "40215",
        "CountryID": 87,
        "Latitude": 51.218044649,
        "Longitude": 6.782569671,
        "ContactTelephone1": "0211/821-8210",
        "ContactTelephone2": "0211/821-4093",
        "ContactEmail": "elektromobilitaet@swd-ag.de",
        "AccessComments": "E-Bike-Ladestation",
        "RelatedURL": "http://www.emobil-nrw.de",
        "DistanceUnit": 0
    },
    "Connections": [
        {
            "ID": 76173,
            "ConnectionTypeID": 28,
            "StatusTypeID": 50,
            "LevelID": 2,
            "Amps": 16,
            "Voltage": 230,
            "PowerKW": 3.7,
            "CurrentTypeID": 10,
            "Quantity": 2
        }
    ],
    "NumberOfPoints": 2,
    "GeneralComments": "E-Bike-Ladestation",
    "StatusTypeID": 50,
    "DateLastStatusUpdate": "2017-02-28T13:37:00Z",
    "DataQualityLevel": 1,
    "DateCreated": "2016-01-12T09:24:00Z",
    "SubmissionStatusTypeID": 200
}