{
    "IsRecentlyVerified": false,
    "ID": 167363,
    "UUID": "CB0A987F-B552-46EC-BEDA-89D1A23490AF",
    "DataProviderID": 18,
    "DataProvidersReference": "e13c6a43a8cb99abcaf81716eafd8f0d",
    "OperatorID": 3345,
    "UsageTypeID": 5,
    "AddressInfo": {
        "ID": 167722,
        "Title": "Giles Coppice",
        "AddressLine1": "Giles Coppice",
        "Town": "London",
        "Postcode": "SE218QE",
        "CountryID": 1,
        "Latitude": 51.427988,
        "Longitude": -0.081243,
        "AccessComments": "",
        "RelatedURL": "https://char.gy",
        "DistanceUnit": 0
    },
    "Connections": [
        {
            "ID": 253461,
            "ConnectionTypeID": 25,
            "Reference": "376",
            "StatusTypeID": 50,
            "LevelID": 2,
            "Amps": 16,
            "Voltage": 230,
            "PowerKW": 3.7,
            "CurrentTypeID": 10
        }
    ],
    "StatusTypeID": 0,
    "DateLastStatusUpdate": "2020-09-08T02:47:00Z",
    "MetadataValues": [
        {
            "ID": 7904,
            "MetadataFieldID": 4,
            "ItemValue": "Contains public sector information licensed under the Open Government Licence v2.0. http://www.nationalarchives.gov.uk/doc/open-government-licence/version/2/"
        }
    ],
    "DataQualityLevel": 3,
    "DateCreated": "2020-09-08T02:47:00Z",
    "SubmissionStatusTypeID": 100
}