{
    "IsRecentlyVerified": false,
    "ID": 72039,
    "UUID": "D2FFC450-813E-46D4-8CD2-2FAE7D783AB8",
    "DataProviderID": 1,
    "OperatorID": 32,
    "OperatorsReference": "3679,3704",
    "UsageTypeID": 4,
    "UsageCost": "£0.108/kWh; for Polar Plus subscription members only. Parking fees apply",
    "AddressInfo": {
        "ID": 72385,
        "Title": "Royal Stoke University Hospital",
        "AddressLine1": "Lancaster Crescent",
        "Town": "Staffordshire",
        "StateOrProvince": "Staffordshire",
        "Postcode": "ST4 6BX",
        "CountryID": 1,
        "Latitude": 53.006027,
        "Longitude": -2.212187,
        "AccessComments": "Multistorey car park, Ground floor, to the right hand side of the entrance",
        "DistanceUnit": 0
    },
    "Connections": [
        {
            "ID": 103302,
            "ConnectionTypeID": 25,
            "StatusTypeID": 50,
            "LevelID": 2,
            "Amps": 32,
            "Voltage": 230,
            "PowerKW": 7,
            "CurrentTypeID": 10,
            "Quantity": 4
        }
    ],
    "NumberOfPoints": 4,
    "StatusTypeID": 50,
    "DateLastStatusUpdate": "2019-03-05T06:28:00Z",
    "DataQualityLevel": 1,
    "DateCreated": "2016-10-01T09:08:00Z",
    "SubmissionStatusTypeID": 200
}