{
    "IsRecentlyVerified": false,
    "ID": 8403,
    "UUID": "7EF62569-5909-41C5-9C72-620197BEBD04",
    "DataProviderID": 15,
    "DataProvidersReference": "2938",
    "OperatorID": 26,
    "AddressInfo": {
        "ID": 8300,
        "Title": "928 N 28th Avenue",
        "AddressLine1": "928 N 28th Avenue",
        "Town": "Pasco",
        "StateOrProvince": "WA",
        "Postcode": "99301",
        "CountryID": 2,
        "Latitude": 46.23669,
        "Longitude": -119.12974,
        "ContactTelephone1": "509-492-5381",
        "RelatedURL": "http://carstations.com/2938",
        "DistanceUnit": 0
    },
    "Connections": [
        {
            "ID": 5831,
            "ConnectionTypeID": 1,
            "Reference": "J1772",
            "LevelID": 2
        }
    ],
    "StatusTypeID": 0,
    "DateLastStatusUpdate": "2017-11-04T14:05:00Z",
    "DataQualityLevel": 1,
    "DateCreated": "2011-11-11T12:06:00Z",
    "SubmissionStatusTypeID": 100
}