{
    "IsRecentlyVerified": false,
    "ID": 113867,
    "UUID": "349C1E8C-3FE9-4247-AE67-70FBEFF81644",
    "DataProviderID": 1,
    "OperatorID": 23,
    "OperatorsReference": "47483",
    "UsageTypeID": 4,
    "AddressInfo": {
        "ID": 114213,
        "Title": "Cassovar Business Center I",
        "AddressLine1": "Zriedlova 11",
        "Town": "Kosice",
        "Postcode": "040 01",
        "CountryID": 204,
        "Latitude": 48.718765,
        "Longitude": 21.245829,
        "ContactTelephone1": "+42 1903 787300",
        "DistanceUnit": 0
    },
    "Connections": [
        {
            "ID": 160437,
            "ConnectionTypeID": 30,
            "StatusTypeID": 50,
            "LevelID": 2,
            "PowerKW": 14,
            "CurrentTypeID": 20,
            "Quantity": 2
        }
    ],
    "NumberOfPoints": 2,
    "GeneralComments": "2 Tesla Connectors, up to 14kW.Available to the public. Self park.",
    "StatusTypeID": 50,
    "DateLastStatusUpdate": "2019-01-02T21:49:00Z",
    "DataQualityLevel": 1,
    "DateCreated": "2019-01-02T21:49:00Z",
    "SubmissionStatusTypeID": 200
}