{
    "IsRecentlyVerified": false,
    "ID": 41918,
    "UUID": "911F112C-C687-4FFE-BA91-EB3EC3E527C4",
    "DataProviderID": 1,
    "OperatorID": 19,
    "UsageTypeID": 1,
    "UsageCost": "",
    "AddressInfo": {
        "ID": 42264,
        "Title": "Lane Farm Holiday Cottages ",
        "AddressLine1": "Holme ",
        "AddressLine2": "",
        "Town": "Holmfirth ",
        "StateOrProvince": "West Yorks ",
        "Postcode": "HD9 2QF",
        "CountryID": 1,
        "Latitude": 53.546866,
        "Longitude": -1.84595,
        "ContactTelephone1": "01484682290",
        "ContactTelephone2": "",
        "ContactEmail": "",
        "AccessComments": "",
        "RelatedURL": "http://www.lanefarmcottages.co.uk",
        "DistanceUnit": 0
    },
    "Connections": [
        {
            "ID": 50280,
            "ConnectionTypeID": 25,
            "StatusTypeID": 50,
            "LevelID": 2,
            "Amps": 32,
            "Voltage": 230,
            "PowerKW": 7,
            "CurrentTypeID": 10,
            "Quantity": 1
        }
    ],
    "NumberOfPoints": 1,
    "GeneralComments": "",
    "StatusTypeID": 50,
    "DateLastStatusUpdate": "2015-02-19T17:34:00Z",
    "DataQualityLevel": 1,
    "DateCreated": "2015-02-18T10:43:00Z",
    "SubmissionStatusTypeID": 200
}