{
    "IsRecentlyVerified": false,
    "ID": 112059,
    "UUID": "003F9FB6-F817-4198-9E13-4AFD837978B9",
    "DataProviderID": 2,
    "DataProvidersReference": "100309",
    "OperatorID": 5,
    "UsageTypeID": 1,
    "AddressInfo": {
        "ID": 112405,
        "Title": "LETHBRIDGE MITS",
        "AddressLine1": "3401 4 Ave S",
        "Town": "Lethbridge",
        "StateOrProvince": "AB",
        "Postcode": "T1J 4B5",
        "CountryID": 44,
        "Latitude": 49.695569,
        "Longitude": -112.7894356,
        "ContactTelephone1": "888-758-4389",
        "AccessComments": "24 hours daily",
        "RelatedURL": "http://www.chargepoint.com/",
        "DistanceUnit": 0
    },
    "Connections": [
        {
            "ID": 157599,
            "ConnectionTypeID": 1,
            "LevelID": 2,
            "Amps": 16,
            "Voltage": 230,
            "PowerKW": 3,
            "CurrentTypeID": 10,
            "Quantity": 1
        }
    ],
    "DateLastStatusUpdate": "2019-12-24T09:25:00Z",
    "DataQualityLevel": 3,
    "DateCreated": "2018-10-18T23:37:00Z",
    "SubmissionStatusTypeID": 100
}