{
    "IsRecentlyVerified": false,
    "ID": 64571,
    "UUID": "348DAF86-98C3-495E-96A7-A8617E48EC96",
    "DataProviderID": 1,
    "OperatorID": 214,
    "UsageTypeID": 4,
    "AddressInfo": {
        "ID": 64917,
        "Title": "Ullsteinstraße",
        "AddressLine1": "Ullsteinstraße 141",
        "AddressLine2": "Mariendorf",
        "Town": "Berlin",
        "StateOrProvince": "Berlin",
        "Postcode": "12109",
        "CountryID": 87,
        "Latitude": 52.45242,
        "Longitude": 13.38490999999999,
        "AccessComments": "Rund um die Uhr (24/7) nutzbar. Ladekarte von be eMobil oder Roamingpartnern The New Motion, LichtBlick Fahrstrom Chip oder ACE Ladekarte Power Me erforderlich.",
        "DistanceUnit": 0
    },
    "Connections": [
        {
            "ID": 82955,
            "ConnectionTypeID": 25,
            "StatusTypeID": 50,
            "LevelID": 2,
            "Amps": 16,
            "Voltage": 400,
            "PowerKW": 11,
            "CurrentTypeID": 20,
            "Quantity": 2
        }
    ],
    "NumberOfPoints": 2,
    "StatusTypeID": 50,
    "DateLastStatusUpdate": "2016-03-11T10:49:00Z",
    "DataQualityLevel": 1,
    "DateCreated": "2016-03-11T10:49:00Z",
    "SubmissionStatusTypeID": 200
}