{
    "IsRecentlyVerified": false,
    "ID": 180439,
    "UUID": "BD1CD6EF-EF23-4905-95EB-343442293C47",
    "DataProviderID": 29,
    "DataProvidersReference": "15227",
    "OperatorID": 105,
    "AddressInfo": {
        "ID": 180798,
        "Title": "Resser Weg 20",
        "AddressLine1": "Resser Weg 20",
        "Town": "Herten",
        "Postcode": "45699",
        "CountryID": 87,
        "Latitude": 51.594822,
        "Longitude": 7.129575,
        "DistanceUnit": 0
    },
    "Connections": [
        {
            "ID": 283512,
            "ConnectionTypeID": 25,
            "StatusTypeID": 50,
            "LevelID": 2,
            "PowerKW": 22,
            "CurrentTypeID": 20
        },
        {
            "ID": 283513,
            "ConnectionTypeID": 25,
            "StatusTypeID": 50,
            "LevelID": 2,
            "PowerKW": 22,
            "CurrentTypeID": 20
        }
    ],
    "StatusTypeID": 50,
    "DateLastStatusUpdate": "2021-07-12T02:48:00Z",
    "MetadataValues": [
        {
            "ID": 12733,
            "MetadataFieldID": 4,
            "ItemValue": "Data from the German chargepoint registry provided by Bundesnetzagentur.de under the CC-BY 4.0 license"
        }
    ],
    "DataQualityLevel": 3,
    "DateCreated": "2021-07-08T10:00:00Z",
    "SubmissionStatusTypeID": 100
}