{
    "IsRecentlyVerified": false,
    "ID": 141514,
    "UUID": "9B06C08D-AB7E-470B-BD3D-E7CA3C55B52A",
    "DataProviderID": 2,
    "DataProvidersReference": "80273",
    "OperatorID": 5,
    "UsageTypeID": 1,
    "AddressInfo": {
        "ID": 141866,
        "Title": "EVERGY",
        "AddressLine1": "4600 Starlight Rd @ Starlight Theater",
        "Town": "Kansas City",
        "StateOrProvince": "MO",
        "Postcode": "64132",
        "CountryID": 2,
        "Latitude": 39.009582,
        "Longitude": -94.532512,
        "ContactTelephone1": "888-758-4389",
        "AccessComments": "24 hours daily",
        "RelatedURL": "http://www.chargepoint.com/",
        "DistanceUnit": 0
    },
    "Connections": [
        {
            "ID": 197455,
            "ConnectionTypeID": 1,
            "LevelID": 2,
            "Amps": 16,
            "Voltage": 230,
            "PowerKW": 3.7,
            "CurrentTypeID": 10,
            "Quantity": 4
        }
    ],
    "StatusTypeID": 50,
    "DateLastStatusUpdate": "2020-06-26T03:01:00Z",
    "DataQualityLevel": 3,
    "DateCreated": "2019-12-24T09:15:00Z",
    "SubmissionStatusTypeID": 100
}