{
    "IsRecentlyVerified": false,
    "ID": 63964,
    "UUID": "36E07261-2FB5-41B9-A281-4B1426DB19A8",
    "DataProviderID": 26,
    "DataProvidersReference": "82936",
    "OperatorID": 73,
    "OperatorsReference": "EV-Box EVB-P1541588",
    "UsageCost": "0.00 jaarabonnement",
    "AddressInfo": {
        "ID": 64310,
        "Title": "Emrikweg 6",
        "AddressLine1": "Emrikweg 6",
        "Town": "Haarlem",
        "Postcode": "2031 BT",
        "CountryID": 159,
        "Latitude": 52.39529,
        "Longitude": 4.6649,
        "RelatedURL": "http://www.ev-box.nl",
        "DistanceUnit": 0
    },
    "Connections": [
        {
            "ID": 81756,
            "ConnectionTypeID": 25,
            "LevelID": 2,
            "PowerKW": 5,
            "CurrentTypeID": 10
        },
        {
            "ID": 81757,
            "ConnectionTypeID": 25,
            "LevelID": 2,
            "PowerKW": 5,
            "CurrentTypeID": 10
        }
    ],
    "NumberOfPoints": 1,
    "StatusTypeID": 50,
    "DateLastStatusUpdate": "2016-06-04T02:54:00Z",
    "DataQualityLevel": 3,
    "DateCreated": "2016-03-03T12:32:00Z",
    "SubmissionStatusTypeID": 100
}