{
    "IsRecentlyVerified": false,
    "ID": 187387,
    "UUID": "A6FF6D71-D5CC-4B96-996B-1ACEC065DEF6",
    "DataProviderID": 29,
    "DataProvidersReference": "16251",
    "AddressInfo": {
        "ID": 187746,
        "Title": "Kaydeich 16",
        "AddressLine1": "Kaydeich 16",
        "Town": "Pellworm",
        "Postcode": "25849",
        "CountryID": 87,
        "Latitude": 54.50169,
        "Longitude": 8.65561,
        "DistanceUnit": 0
    },
    "Connections": [
        {
            "ID": 302479,
            "ConnectionTypeID": 25,
            "StatusTypeID": 50,
            "LevelID": 2,
            "PowerKW": 21,
            "CurrentTypeID": 20
        }
    ],
    "StatusTypeID": 50,
    "DateLastStatusUpdate": "2021-07-12T02:52:00Z",
    "MetadataValues": [
        {
            "ID": 19627,
            "MetadataFieldID": 4,
            "ItemValue": "Data from the German chargepoint registry provided by Bundesnetzagentur.de under the CC-BY 4.0 license"
        }
    ],
    "DataQualityLevel": 3,
    "DateCreated": "2021-07-12T02:52:00Z",
    "SubmissionStatusTypeID": 100
}