{
    "IsRecentlyVerified": false,
    "ID": 94984,
    "UUID": "EB3EE24B-645C-43EE-BDDF-ED4E5A75C713",
    "DataProviderID": 1,
    "OperatorID": 23,
    "OperatorsReference": "36988",
    "UsageTypeID": 4,
    "AddressInfo": {
        "ID": 95330,
        "Title": "Universal's Cabana Bay Beach Resort",
        "AddressLine1": "6550 Adventure Wy",
        "Town": "Orlando",
        "StateOrProvince": "Florida",
        "Postcode": "32819",
        "CountryID": 2,
        "Latitude": 28.465525,
        "Longitude": -81.473534,
        "ContactTelephone1": "(407) 503-4000",
        "DistanceUnit": 0
    },
    "Connections": [
        {
            "ID": 134598,
            "ConnectionTypeID": 30,
            "StatusTypeID": 50,
            "LevelID": 2,
            "PowerKW": 8,
            "CurrentTypeID": 10,
            "Quantity": 4
        }
    ],
    "NumberOfPoints": 4,
    "GeneralComments": "4 Tesla Connectors, up to 8kW.Available for customers. Please see front desk.",
    "StatusTypeID": 50,
    "DateLastStatusUpdate": "2017-10-29T07:01:00Z",
    "DataQualityLevel": 1,
    "DateCreated": "2017-10-29T07:01:00Z",
    "SubmissionStatusTypeID": 200
}