{
    "IsRecentlyVerified": false,
    "ID": 159752,
    "UUID": "BCD67B40-59A1-4857-888C-C669D5A5DA36",
    "DataProviderID": 2,
    "DataProvidersReference": "154921",
    "OperatorID": 3372,
    "UsageTypeID": 1,
    "AddressInfo": {
        "ID": 160109,
        "Title": "Phelps Memorial Hospital Northwell Health",
        "AddressLine1": "733 N Broadway Garage",
        "Town": "Sleepy Hollow",
        "StateOrProvince": "NY",
        "Postcode": "10591",
        "CountryID": 2,
        "Latitude": 41.1049976,
        "Longitude": -73.8604228,
        "ContactTelephone1": "866-816-7584",
        "AccessComments": "24 hours daily; Also accepts Paypal",
        "RelatedURL": "http://evconnect.com/",
        "DistanceUnit": 0
    },
    "Connections": [
        {
            "ID": 229966,
            "ConnectionTypeID": 1,
            "LevelID": 2,
            "Amps": 16,
            "Voltage": 230,
            "PowerKW": 3.7,
            "CurrentTypeID": 10,
            "Quantity": 4
        }
    ],
    "StatusTypeID": 50,
    "DateLastStatusUpdate": "2020-06-26T03:04:00Z",
    "DataQualityLevel": 3,
    "DateCreated": "2020-06-26T03:04:00Z",
    "SubmissionStatusTypeID": 100
}