{
    "IsRecentlyVerified": false,
    "ID": 115592,
    "UUID": "9D30DDEA-F9EC-40C7-9810-289724CC912D",
    "DataProviderID": 2,
    "DataProvidersReference": "117610",
    "UsageTypeID": 2,
    "AddressInfo": {
        "ID": 115938,
        "Title": "Norfolk Naval Shipyard",
        "AddressLine1": "Building 237",
        "Town": "Portsmouth",
        "StateOrProvince": "VA",
        "Postcode": "23709",
        "CountryID": 2,
        "Latitude": 36.81,
        "Longitude": -76.31,
        "ContactTelephone1": "",
        "AccessComments": "",
        "RelatedURL": "",
        "DistanceUnit": 0
    },
    "Connections": [
        {
            "ID": 162616,
            "ConnectionTypeID": 1,
            "LevelID": 2,
            "Amps": 16,
            "Voltage": 230,
            "PowerKW": 3,
            "CurrentTypeID": 10,
            "Quantity": 1
        }
    ],
    "DateLastStatusUpdate": "2019-04-06T04:02:00Z",
    "DataQualityLevel": 3,
    "DateCreated": "2019-02-11T07:13:00Z",
    "SubmissionStatusTypeID": 100
}