{
    "IsRecentlyVerified": false,
    "ID": 64194,
    "UUID": "4A1CA23E-EEB1-4BC9-AB9A-E65E97135DBD",
    "DataProviderID": 26,
    "DataProvidersReference": "76837",
    "OperatorID": 103,
    "OperatorsReference": "Allego NLALLEGO0003631",
    "UsageCost": "0.00 jaarabonnement",
    "AddressInfo": {
        "ID": 64540,
        "Title": "Groningerplein 9",
        "AddressLine1": "Groningerplein 9",
        "Town": "Leeuwarden",
        "Postcode": "8921 NL",
        "CountryID": 159,
        "Latitude": 53.2085273,
        "Longitude": 5.80619563,
        "ContactTelephone1": "0800-3745337",
        "RelatedURL": "http://www.allego.eu/",
        "DistanceUnit": 0
    },
    "Connections": [
        {
            "ID": 82116,
            "ConnectionTypeID": 25,
            "LevelID": 2,
            "PowerKW": 11,
            "CurrentTypeID": 10
        },
        {
            "ID": 82117,
            "ConnectionTypeID": 25,
            "LevelID": 2,
            "PowerKW": 11,
            "CurrentTypeID": 10
        }
    ],
    "NumberOfPoints": 1,
    "StatusTypeID": 50,
    "DateLastStatusUpdate": "2016-06-04T02:56:00Z",
    "DataQualityLevel": 3,
    "DateCreated": "2016-03-03T12:33:00Z",
    "SubmissionStatusTypeID": 100
}