{
    "IsRecentlyVerified": false,
    "ID": 166319,
    "UUID": "38421FF3-EC72-437C-9DBF-EBBBFD866A9C",
    "DataProviderID": 28,
    "DataProvidersReference": "FR*S25*P02556193",
    "UsageTypeID": 5,
    "AddressInfo": {
        "ID": 166678,
        "Title": "Mairie",
        "AddressLine1": "4 Rue de Surotte",
        "CountryID": 80,
        "Latitude": 47.17421,
        "Longitude": 5.90226,
        "AccessComments": "accessible 24h/24 - 7j/7",
        "DistanceUnit": 0
    },
    "Connections": [
        {
            "ID": 246523,
            "ConnectionTypeID": 1036,
            "StatusTypeID": 50,
            "LevelID": 2,
            "PowerKW": 22,
            "CurrentTypeID": 20
        },
        {
            "ID": 246524,
            "ConnectionTypeID": 1036,
            "StatusTypeID": 50,
            "LevelID": 2,
            "PowerKW": 22,
            "CurrentTypeID": 20
        }
    ],
    "GeneralComments": "recharge normale et accélérée accessible par application smartphone/internet et badge - informations site web freshmile.fr",
    "StatusTypeID": 50,
    "DateLastStatusUpdate": "2020-08-27T05:13:00Z",
    "DataQualityLevel": 2,
    "DateCreated": "2020-08-27T05:13:00Z",
    "SubmissionStatusTypeID": 100
}