{
    "IsRecentlyVerified": false,
    "ID": 74887,
    "UUID": "CFBFD433-F460-4687-A693-AECD570043CB",
    "DataProviderID": 1,
    "OperatorID": 23,
    "OperatorsReference": "22040",
    "UsageTypeID": 1,
    "UsageCost": "$0.20/min >=60kW; $0.10/min <60kW; other tariffs for older cars",
    "AddressInfo": {
        "ID": 75233,
        "Title": "Springfield Supercharger",
        "AddressLine1": "3050 North Kentwood St",
        "Town": "Springfield",
        "StateOrProvince": "MO",
        "CountryID": 2,
        "Latitude": 37.251836,
        "Longitude": -93.265534,
        "AccessComments": "24/7",
        "DistanceUnit": 0
    },
    "Connections": [
        {
            "ID": 108044,
            "ConnectionTypeID": 27,
            "StatusTypeID": 50,
            "LevelID": 3,
            "Amps": 300,
            "Voltage": 400,
            "PowerKW": 120,
            "CurrentTypeID": 30,
            "Quantity": 8
        }
    ],
    "NumberOfPoints": 8,
    "StatusTypeID": 50,
    "DateLastStatusUpdate": "2018-03-13T08:50:00Z",
    "DataQualityLevel": 1,
    "DateCreated": "2016-12-06T21:14:00Z",
    "SubmissionStatusTypeID": 200
}