{
    "IsRecentlyVerified": false,
    "ID": 155440,
    "UUID": "A5FB2DFA-97F5-4679-ADCA-7E22FA384AC8",
    "DataProviderID": 1,
    "OperatorID": 3339,
    "UsageTypeID": 1,
    "AddressInfo": {
        "ID": 155794,
        "Title": "House of Anvers",
        "AddressLine1": "9025 Bass Highway",
        "Town": "Latrobe",
        "StateOrProvince": "Tasmania",
        "Postcode": "7307",
        "CountryID": 18,
        "Latitude": -41.218329,
        "Longitude": 146.412456,
        "DistanceUnit": 0
    },
    "Connections": [
        {
            "ID": 218842,
            "ConnectionTypeID": 25,
            "StatusTypeID": 50,
            "LevelID": 2,
            "PowerKW": 22,
            "CurrentTypeID": 20,
            "Quantity": 1
        },
        {
            "ID": 218843,
            "ConnectionTypeID": 30,
            "StatusTypeID": 50,
            "LevelID": 2,
            "PowerKW": 22,
            "CurrentTypeID": 20,
            "Quantity": 1
        }
    ],
    "NumberOfPoints": 1,
    "StatusTypeID": 50,
    "DateLastStatusUpdate": "2020-04-13T08:24:00Z",
    "DataQualityLevel": 1,
    "DateCreated": "2020-04-12T02:40:00Z",
    "SubmissionStatusTypeID": 200
}