{
    "IsRecentlyVerified": false,
    "ID": 74095,
    "UUID": "15BBEF2D-9945-42AE-AC9F-6AA66DF9792A",
    "DataProviderID": 1,
    "OperatorID": 89,
    "OperatorsReference": "CEA-10068",
    "UsageTypeID": 4,
    "UsageCost": "CAD 2.50",
    "AddressInfo": {
        "ID": 74441,
        "Title": "Cégep Marie-Victorin",
        "AddressLine1": "7000 Rue Marie-Victorin",
        "Town": "Montréal",
        "StateOrProvince": "QC",
        "Postcode": "H1G 2J6",
        "CountryID": 44,
        "Latitude": 45.618641,
        "Longitude": -73.604986,
        "DistanceUnit": 0
    },
    "Connections": [
        {
            "ID": 106419,
            "ConnectionTypeID": 1,
            "StatusTypeID": 50,
            "LevelID": 2,
            "Amps": 32,
            "Voltage": 230,
            "PowerKW": 7,
            "CurrentTypeID": 10,
            "Quantity": 1
        }
    ],
    "NumberOfPoints": 1,
    "StatusTypeID": 50,
    "DateLastStatusUpdate": "2017-01-22T19:18:00Z",
    "DataQualityLevel": 1,
    "DateCreated": "2016-11-24T00:16:00Z",
    "SubmissionStatusTypeID": 200
}