{
    "IsRecentlyVerified": false,
    "ID": 104436,
    "UUID": "ECC88F95-A339-4C05-B1CF-86AD0CE5125F",
    "DataProviderID": 1,
    "OperatorID": 23,
    "OperatorsReference": "43221",
    "UsageTypeID": 4,
    "AddressInfo": {
        "ID": 104782,
        "Title": "Thon Hotel Brussels Airport",
        "AddressLine1": "Berkenlaan 4",
        "Town": "Diegem",
        "Postcode": "1831",
        "CountryID": 26,
        "Latitude": 50.884647,
        "Longitude": 4.443637,
        "ContactTelephone1": "+32 2 721 77 77",
        "DistanceUnit": 0
    },
    "Connections": [
        {
            "ID": 147431,
            "ConnectionTypeID": 30,
            "StatusTypeID": 50,
            "LevelID": 2,
            "Amps": 16,
            "Voltage": 400,
            "PowerKW": 11,
            "CurrentTypeID": 20,
            "Quantity": 2
        }
    ],
    "NumberOfPoints": 2,
    "GeneralComments": "2 Tesla Connectors, up to 11kW.Available for customers. Self park.",
    "StatusTypeID": 50,
    "DateLastStatusUpdate": "2018-10-03T20:20:00Z",
    "DataQualityLevel": 1,
    "DateCreated": "2018-05-20T05:36:00Z",
    "SubmissionStatusTypeID": 200
}