{
    "IsRecentlyVerified": false,
    "ID": 8521,
    "UUID": "2B8E5904-72A6-4248-BDB9-DA609BEF994F",
    "DataProviderID": 15,
    "DataProvidersReference": "1134",
    "OperatorID": 41,
    "AddressInfo": {
        "ID": 8418,
        "Title": "1000 E. Santa Ana Bl.",
        "AddressLine1": "1000 E. Santa Ana Bl.",
        "Town": "Santa Ana",
        "StateOrProvince": "California",
        "Postcode": "92701",
        "CountryID": 2,
        "Latitude": 33.75169,
        "Longitude": -117.85689,
        "ContactTelephone1": "",
        "RelatedURL": "http://carstations.com/1134",
        "DistanceUnit": 0
    },
    "Connections": [
        {
            "ID": 5945,
            "ConnectionTypeID": 0,
            "Reference": "LPI"
        },
        {
            "ID": 6619,
            "ConnectionTypeID": 7,
            "Reference": "AVCON",
            "Quantity": 1
        }
    ],
    "StatusTypeID": 0,
    "DateLastStatusUpdate": "2017-11-04T14:04:00Z",
    "DataQualityLevel": 1,
    "DateCreated": "2011-11-11T12:06:00Z",
    "SubmissionStatusTypeID": 100
}