{
    "IsRecentlyVerified": false,
    "ID": 57927,
    "UUID": "3F4E6143-2807-402F-91B1-189209BF49F9",
    "DataProviderID": 1,
    "OperatorID": 234,
    "UsageTypeID": 4,
    "UsageCost": "0",
    "AddressInfo": {
        "ID": 58273,
        "Title": "Gemeinde",
        "AddressLine1": "Nürnberger Straße 20",
        "Town": "Reichenschwand",
        "Postcode": "91244",
        "CountryID": 87,
        "Latitude": 49.5136895,
        "Longitude": 11.370941500000072,
        "AccessComments": "Rund um die Uhr (24/7) nutzbar. Position: In mitten des Ortes direkt vor dem Rathaus an der B 14 Richtung Nürnberg. Umgebung:Gasthaus,Metzgerei , Bäckerei alles in 300 m Umkreis\r\n",
        "DistanceUnit": 0
    },
    "Connections": [
        {
            "ID": 73551,
            "ConnectionTypeID": 28,
            "StatusTypeID": 50,
            "LevelID": 2,
            "Amps": 16,
            "Voltage": 230,
            "PowerKW": 3.7,
            "CurrentTypeID": 10,
            "Quantity": 0
        },
        {
            "ID": 73552,
            "ConnectionTypeID": 25,
            "StatusTypeID": 50,
            "LevelID": 2,
            "PowerKW": 22,
            "CurrentTypeID": 20,
            "Quantity": 2
        },
        {
            "ID": 73553,
            "ConnectionTypeID": 16,
            "StatusTypeID": 50,
            "LevelID": 2,
            "Amps": 16,
            "Voltage": 230,
            "PowerKW": 3.7,
            "CurrentTypeID": 10,
            "Quantity": 0
        },
        {
            "ID": 73554,
            "ConnectionTypeID": 17,
            "StatusTypeID": 50,
            "LevelID": 2,
            "PowerKW": 0,
            "CurrentTypeID": 20,
            "Quantity": 0
        },
        {
            "ID": 73555,
            "ConnectionTypeID": 2,
            "StatusTypeID": 50,
            "LevelID": 2,
            "PowerKW": 0,
            "CurrentTypeID": 30,
            "Quantity": 0
        },
        {
            "ID": 73556,
            "ConnectionTypeID": 33,
            "StatusTypeID": 50,
            "LevelID": 2,
            "PowerKW": 0,
            "CurrentTypeID": 30,
            "Quantity": 0
        }
    ],
    "NumberOfPoints": 2,
    "StatusTypeID": 50,
    "DateLastStatusUpdate": "2015-12-29T11:44:00Z",
    "DataQualityLevel": 1,
    "DateCreated": "2015-12-29T11:44:00Z",
    "SubmissionStatusTypeID": 200
}