{
    "UserComments": [
        {
            "ID": 19375,
            "ChargePointID": 24006,
            "CommentTypeID": 10,
            "UserName": "xester",
            "Rating": 4,
            "DateCreated": "2018-04-03T16:45:00.163Z",
            "User": {
                "ID": 6169,
                "Username": "xester"
            },
            "CheckinStatusTypeID": 10
        }
    ],
    "IsRecentlyVerified": false,
    "ID": 24006,
    "UUID": "AB06AC49-926D-42C4-AF2A-DAA8E941A63C",
    "DataProviderID": 1,
    "OperatorID": 91,
    "UsageTypeID": 1,
    "AddressInfo": {
        "ID": 24351,
        "Title": "REPSOL Esparraguera",
        "AddressLine1": "Ctra. A-2, KM 581,5",
        "Town": "Esparreguera",
        "StateOrProvince": "Barcelona",
        "Postcode": "08292",
        "CountryID": 210,
        "Latitude": 41.527848,
        "Longitude": 1.880958,
        "DistanceUnit": 0
    },
    "Connections": [
        {
            "ID": 26113,
            "ConnectionTypeID": 2,
            "StatusTypeID": 50,
            "LevelID": 3,
            "Amps": 125,
            "Voltage": 400,
            "PowerKW": 50,
            "CurrentTypeID": 30,
            "Quantity": 1
        },
        {
            "ID": 143509,
            "ConnectionTypeID": 33,
            "StatusTypeID": 50,
            "LevelID": 3,
            "Amps": 125,
            "Voltage": 400,
            "PowerKW": 50,
            "CurrentTypeID": 30,
            "Quantity": 1
        },
        {
            "ID": 143510,
            "ConnectionTypeID": 25,
            "StatusTypeID": 50,
            "LevelID": 3,
            "Amps": 64,
            "Voltage": 400,
            "PowerKW": 43,
            "CurrentTypeID": 20,
            "Quantity": 1
        }
    ],
    "NumberOfPoints": 1,
    "StatusTypeID": 50,
    "DateLastStatusUpdate": "2018-04-03T16:45:00Z",
    "DataQualityLevel": 1,
    "DateCreated": "2014-06-03T05:20:00Z",
    "SubmissionStatusTypeID": 200
}