{
    "IsRecentlyVerified": false,
    "ID": 177519,
    "UUID": "E506AC89-444B-4763-A55D-AA55284D0CA8",
    "DataProviderID": 29,
    "DataProvidersReference": "5916",
    "OperatorID": 45,
    "AddressInfo": {
        "ID": 177878,
        "Title": "Böcklerallee 4",
        "AddressLine1": "Böcklerallee 4",
        "Town": "Ritterhude",
        "Postcode": "27721",
        "CountryID": 87,
        "Latitude": 53.192464,
        "Longitude": 8.755439,
        "DistanceUnit": 0
    },
    "Connections": [
        {
            "ID": 276757,
            "ConnectionTypeID": 33,
            "StatusTypeID": 50,
            "LevelID": 3,
            "PowerKW": 22,
            "CurrentTypeID": 30
        },
        {
            "ID": 276758,
            "ConnectionTypeID": 25,
            "StatusTypeID": 50,
            "LevelID": 2,
            "PowerKW": 11,
            "CurrentTypeID": 20
        }
    ],
    "StatusTypeID": 0,
    "DateLastStatusUpdate": "2021-07-12T02:50:00Z",
    "MetadataValues": [
        {
            "ID": 9813,
            "MetadataFieldID": 4,
            "ItemValue": "Data from the German chargepoint registry provided by Bundesnetzagentur.de under the CC-BY 4.0 license"
        }
    ],
    "DataQualityLevel": 3,
    "DateCreated": "2021-07-08T09:49:00Z",
    "SubmissionStatusTypeID": 100
}