{
    "IsRecentlyVerified": false,
    "ID": 111989,
    "UUID": "A8D63F13-E538-45E3-952A-C9294617EA38",
    "DataProviderID": 2,
    "DataProvidersReference": "91323",
    "OperatorID": 5,
    "UsageTypeID": 1,
    "AddressInfo": {
        "ID": 112335,
        "Title": "STATION 1",
        "AddressLine1": "3775 BC-7",
        "Town": "Burnaby",
        "StateOrProvince": "BC",
        "Postcode": "V5C 0J4",
        "CountryID": 44,
        "Latitude": 49.266172,
        "Longitude": -123.021436,
        "ContactTelephone1": "888-758-4389",
        "AccessComments": "24 hours daily",
        "RelatedURL": "http://www.chargepoint.com/",
        "DistanceUnit": 0
    },
    "Connections": [
        {
            "ID": 157515,
            "ConnectionTypeID": 1,
            "LevelID": 2,
            "Amps": 16,
            "Voltage": 230,
            "PowerKW": 3,
            "CurrentTypeID": 10,
            "Quantity": 2
        }
    ],
    "DateLastStatusUpdate": "2019-12-24T09:25:00Z",
    "DataQualityLevel": 3,
    "DateCreated": "2018-10-18T23:37:00Z",
    "SubmissionStatusTypeID": 100
}