{
    "IsRecentlyVerified": false,
    "ID": 181157,
    "UUID": "E6F1B434-9F0E-4133-A783-089D8BF4CCBC",
    "DataProviderID": 29,
    "DataProvidersReference": "2964",
    "OperatorID": 103,
    "AddressInfo": {
        "ID": 181516,
        "Title": "Taubenstr. 14",
        "AddressLine1": "Taubenstr. 14",
        "Town": "Berlin",
        "Postcode": "10117",
        "CountryID": 87,
        "Latitude": 52.512969,
        "Longitude": 13.390118,
        "DistanceUnit": 0
    },
    "Connections": [
        {
            "ID": 285118,
            "ConnectionTypeID": 25,
            "StatusTypeID": 50,
            "LevelID": 2,
            "PowerKW": 11,
            "CurrentTypeID": 20
        },
        {
            "ID": 285119,
            "ConnectionTypeID": 25,
            "StatusTypeID": 50,
            "LevelID": 2,
            "PowerKW": 11,
            "CurrentTypeID": 20
        }
    ],
    "StatusTypeID": 50,
    "DateLastStatusUpdate": "2021-07-12T02:49:00Z",
    "MetadataValues": [
        {
            "ID": 13451,
            "MetadataFieldID": 4,
            "ItemValue": "Data from the German chargepoint registry provided by Bundesnetzagentur.de under the CC-BY 4.0 license"
        }
    ],
    "DataQualityLevel": 3,
    "DateCreated": "2021-07-08T10:01:00Z",
    "SubmissionStatusTypeID": 100
}