{
    "IsRecentlyVerified": false,
    "ID": 183161,
    "UUID": "E16F45B1-EBB9-4F40-9299-FF973842EC35",
    "DataProviderID": 29,
    "DataProvidersReference": "14031",
    "OperatorID": 220,
    "AddressInfo": {
        "ID": 183520,
        "Title": "Dehnhaide 111",
        "AddressLine1": "Dehnhaide 111",
        "Town": "Hamburg",
        "Postcode": "22081",
        "CountryID": 87,
        "Latitude": 53.57909,
        "Longitude": 10.05152,
        "DistanceUnit": 0
    },
    "Connections": [
        {
            "ID": 289798,
            "ConnectionTypeID": 28,
            "StatusTypeID": 50,
            "LevelID": 2,
            "PowerKW": 22,
            "CurrentTypeID": 20
        },
        {
            "ID": 289799,
            "ConnectionTypeID": 25,
            "StatusTypeID": 50,
            "LevelID": 2,
            "PowerKW": 22,
            "CurrentTypeID": 20
        },
        {
            "ID": 301819,
            "ConnectionTypeID": 28,
            "StatusTypeID": 50,
            "LevelID": 2,
            "PowerKW": 22,
            "CurrentTypeID": 20
        },
        {
            "ID": 301820,
            "ConnectionTypeID": 25,
            "StatusTypeID": 50,
            "LevelID": 2,
            "PowerKW": 22,
            "CurrentTypeID": 20
        }
    ],
    "StatusTypeID": 50,
    "DateLastStatusUpdate": "2021-07-12T02:51:00Z",
    "MetadataValues": [
        {
            "ID": 15454,
            "MetadataFieldID": 4,
            "ItemValue": "Data from the German chargepoint registry provided by Bundesnetzagentur.de under the CC-BY 4.0 license"
        }
    ],
    "DataQualityLevel": 3,
    "DateCreated": "2021-07-08T10:03:00Z",
    "SubmissionStatusTypeID": 100
}