{
    "IsRecentlyVerified": false,
    "ID": 169392,
    "UUID": "BE63DECC-74ED-470A-B087-53E4F49FC618",
    "DataProviderID": 1,
    "OperatorID": 3,
    "OperatorsReference": "PG-70240,PG-85047",
    "UsageTypeID": 4,
    "UsageCost": "Free",
    "AddressInfo": {
        "ID": 169751,
        "Title": "Tesco Extra-Barnstaple Taw View",
        "AddressLine1": "Barnstaple Retail Park",
        "Town": "Barnstaple",
        "StateOrProvince": "Devon",
        "Postcode": "EX31 2AS",
        "CountryID": 1,
        "Latitude": 51.073375,
        "Longitude": -4.06107,
        "DistanceUnit": 0
    },
    "Connections": [
        {
            "ID": 257717,
            "ConnectionTypeID": 25,
            "StatusTypeID": 50,
            "LevelID": 2,
            "Amps": 32,
            "Voltage": 230,
            "PowerKW": 7,
            "CurrentTypeID": 10,
            "Quantity": 4
        }
    ],
    "NumberOfPoints": 4,
    "GeneralComments": "This is an open charge unit installed at the Tesco Extra super store at Barnstaple Retail Park, Barnstaple, Devon",
    "StatusTypeID": 50,
    "DateLastStatusUpdate": "2020-10-15T21:59:00Z",
    "DataQualityLevel": 1,
    "DateCreated": "2020-10-15T21:38:00Z",
    "SubmissionStatusTypeID": 200
}