{
    "IsRecentlyVerified": false,
    "ID": 102990,
    "UUID": "8904DA80-BCED-4634-8187-5711F8FB5F0F",
    "DataProviderID": 2,
    "DataProvidersReference": "94725",
    "UsageTypeID": 1,
    "AddressInfo": {
        "ID": 103336,
        "Title": "Red Roof PLUS+ & Suites",
        "AddressLine1": "42 Finney Blvd",
        "Town": "Malone",
        "StateOrProvince": "NY",
        "Postcode": "12953",
        "CountryID": 2,
        "Latitude": 44.84866,
        "Longitude": -74.294899,
        "ContactTelephone1": "518-483-8123 x0",
        "AccessComments": "24 hours daily; see front desk for access; free for guests",
        "RelatedURL": "",
        "DistanceUnit": 0
    },
    "Connections": [
        {
            "ID": 145139,
            "ConnectionTypeID": 1,
            "LevelID": 2,
            "Amps": 16,
            "Voltage": 230,
            "PowerKW": 3,
            "CurrentTypeID": 10,
            "Quantity": 1
        }
    ],
    "DateLastStatusUpdate": "2019-04-06T05:06:00Z",
    "DataQualityLevel": 3,
    "DateCreated": "2018-04-21T04:13:00Z",
    "SubmissionStatusTypeID": 100
}