{
    "IsRecentlyVerified": false,
    "ID": 132305,
    "UUID": "951CCB63-19C4-41AB-B68B-EAB390FEF97D",
    "DataProviderID": 1,
    "OperatorID": 80,
    "UsageTypeID": 4,
    "AddressInfo": {
        "ID": 132651,
        "Title": "Catania Europa | EnelX",
        "AddressLine1": "Slargo Maria Grazia Cutuli",
        "AddressLine2": "Piazza Europa",
        "Town": "Catania",
        "StateOrProvince": "CT",
        "Postcode": "95100",
        "CountryID": 112,
        "Latitude": 37.5170502676944,
        "Longitude": 15.1048151202347,
        "RelatedURL": "https://www.enelx.com/it/it/mobilita-elettrica",
        "DistanceUnit": 0
    },
    "Connections": [
        {
            "ID": 185185,
            "ConnectionTypeID": 25,
            "StatusTypeID": 50,
            "LevelID": 2,
            "Amps": 32,
            "Voltage": 400,
            "PowerKW": 22,
            "CurrentTypeID": 20,
            "Quantity": 2
        }
    ],
    "NumberOfPoints": 2,
    "StatusTypeID": 50,
    "DateLastStatusUpdate": "2019-09-26T13:03:00Z",
    "DataQualityLevel": 1,
    "DateCreated": "2019-09-26T13:03:00Z",
    "SubmissionStatusTypeID": 200
}