{
    "IsRecentlyVerified": false,
    "ID": 16212,
    "UUID": "EFEC2622-427E-49B9-8285-89397AB68770",
    "DataProviderID": 1,
    "OperatorID": 1,
    "UsageTypeID": 1,
    "UsageCost": "Free",
    "AddressInfo": {
        "ID": 16557,
        "Title": "Bishop Corners",
        "AddressLine1": "333 N. Main St",
        "AddressLine2": "",
        "Town": "West Hartford",
        "StateOrProvince": "Ct",
        "Postcode": "06117",
        "CountryID": 2,
        "Latitude": 41.783595,
        "Longitude": -72.74804899999998,
        "ContactTelephone1": "8606671819",
        "ContactTelephone2": "",
        "ContactEmail": "",
        "AccessComments": "",
        "RelatedURL": "",
        "DistanceUnit": 0
    },
    "Connections": [
        {
            "ID": 14642,
            "ConnectionTypeID": 1,
            "StatusTypeID": 0,
            "LevelID": 2,
            "Quantity": 1
        }
    ],
    "NumberOfPoints": 1,
    "GeneralComments": "",
    "StatusTypeID": 50,
    "DateLastStatusUpdate": "2013-03-14T11:18:00Z",
    "DataQualityLevel": 1,
    "DateCreated": "2013-03-13T18:50:00Z",
    "SubmissionStatusTypeID": 200
}