{
    "IsRecentlyVerified": false,
    "ID": 75913,
    "UUID": "51FE3BF5-966B-467B-889F-EE372E2D6D46",
    "DataProviderID": 2,
    "DataProvidersReference": "80115",
    "OperatorID": 5,
    "UsageTypeID": 1,
    "AddressInfo": {
        "ID": 76259,
        "Title": "ROSEDALE CENTER",
        "AddressLine1": "10 Rosedale Center",
        "Town": "Roseville",
        "StateOrProvince": "MN",
        "Postcode": "55113",
        "CountryID": 2,
        "Latitude": 45.012724,
        "Longitude": -93.17343,
        "ContactTelephone1": "888-758-4389",
        "AccessComments": "24 hours daily",
        "RelatedURL": "http://www.chargepoint.com/",
        "DistanceUnit": 0
    },
    "Connections": [
        {
            "ID": 109424,
            "ConnectionTypeID": 1,
            "LevelID": 2,
            "Amps": 16,
            "Voltage": 230,
            "PowerKW": 3.7,
            "CurrentTypeID": 10,
            "Quantity": 4
        }
    ],
    "DateLastStatusUpdate": "2020-06-26T03:08:00Z",
    "DataQualityLevel": 3,
    "DateCreated": "2016-12-23T01:25:00Z",
    "SubmissionStatusTypeID": 100
}