{
    "IsRecentlyVerified": false,
    "ID": 187522,
    "UUID": "7AEF2299-DFB9-4186-B215-64030CF8B6D0",
    "DataProviderID": 18,
    "DataProvidersReference": "df7ecf6cc561eb7ef88f188036259c41",
    "OperatorID": 3,
    "UsageTypeID": 1,
    "AddressInfo": {
        "ID": 187881,
        "Title": "Treysa Place",
        "AddressLine1": "Treysa Place",
        "Town": "Cornwall",
        "Postcode": "TR13 9FJ",
        "CountryID": 1,
        "Latitude": 50.091997,
        "Longitude": -5.318722,
        "AccessComments": "",
        "RelatedURL": "http://pod-point.com",
        "DistanceUnit": 0
    },
    "Connections": [
        {
            "ID": 302658,
            "ConnectionTypeID": 25,
            "Reference": "0",
            "StatusTypeID": 50,
            "LevelID": 2,
            "Amps": 32,
            "Voltage": 230,
            "PowerKW": 7,
            "CurrentTypeID": 10
        },
        {
            "ID": 302659,
            "ConnectionTypeID": 25,
            "Reference": "1",
            "StatusTypeID": 50,
            "LevelID": 2,
            "Amps": 32,
            "Voltage": 230,
            "PowerKW": 7,
            "CurrentTypeID": 10
        }
    ],
    "StatusTypeID": 0,
    "DateLastStatusUpdate": "2021-07-12T03:38:00Z",
    "MetadataValues": [
        {
            "ID": 19762,
            "MetadataFieldID": 4,
            "ItemValue": "Contains public sector information licensed under the Open Government Licence v2.0. http://www.nationalarchives.gov.uk/doc/open-government-licence/version/2/"
        }
    ],
    "DataQualityLevel": 3,
    "DateCreated": "2021-07-12T03:38:00Z",
    "SubmissionStatusTypeID": 100
}