{
    "UserComments": [
        {
            "ID": 24911,
            "ChargePointID": 133124,
            "CommentTypeID": 10,
            "UserName": "ForumElettrico.it",
            "Comment": "Situate nella piazza centrale con bar, Lidl e tante attività commerciali. Leggi la recensione completa qui: https://www.forumelettrico.it/forum/leini-fast-enelx-via-ricciolio-t7472.html",
            "RelatedURL": "https://www.forumelettrico.it/forum/leini-fast-enelx-via-ricciolio-t7472.html",
            "DateCreated": "2021-09-30T05:06:16.573Z",
            "User": {
                "ID": 11749,
                "Username": "ForumElettrico.it"
            },
            "CheckinStatusTypeID": 10,
            "IsActionedByEditor": false
        },
        {
            "ID": 24876,
            "ChargePointID": 133124,
            "CommentTypeID": 10,
            "UserName": "Carlomanda",
            "Comment": "",
            "Rating": 4,
            "DateCreated": "2021-09-20T14:17:28.1Z",
            "User": {
                "ID": 30566,
                "Username": "Carlomanda"
            },
            "CheckinStatusTypeID": 10,
            "IsActionedByEditor": false
        }
    ],
    "MediaItems": [
        {
            "ID": 29400,
            "ChargePointID": 133124,
            "ItemURL": "https://s3-ap-southeast-2.amazonaws.com/openchargemap/images/IT/OCM133124/OCM-133124.orig.2021093005063071.jpg",
            "ItemThumbnailURL": "https://s3-ap-southeast-2.amazonaws.com/openchargemap/images/IT/OCM133124/OCM-133124.thmb.2021093005063071.jpg",
            "Comment": "",
            "IsEnabled": true,
            "IsVideo": false,
            "IsFeaturedItem": false,
            "IsExternalResource": false,
            "User": {
                "ID": 11749,
                "Username": "ForumElettrico.it"
            },
            "DateCreated": "2021-09-30T05:07:00Z"
        },
        {
            "ID": 29401,
            "ChargePointID": 133124,
            "ItemURL": "https://s3-ap-southeast-2.amazonaws.com/openchargemap/images/IT/OCM133124/OCM-133124.orig.2021093005063607.jpg",
            "ItemThumbnailURL": "https://s3-ap-southeast-2.amazonaws.com/openchargemap/images/IT/OCM133124/OCM-133124.thmb.2021093005063607.jpg",
            "Comment": "",
            "IsEnabled": true,
            "IsVideo": false,
            "IsFeaturedItem": false,
            "IsExternalResource": false,
            "User": {
                "ID": 11749,
                "Username": "ForumElettrico.it"
            },
            "DateCreated": "2021-09-30T05:07:00Z"
        },
        {
            "ID": 29399,
            "ChargePointID": 133124,
            "ItemURL": "https://s3-ap-southeast-2.amazonaws.com/openchargemap/images/IT/OCM133124/OCM-133124.orig.2021093005062531.jpg",
            "ItemThumbnailURL": "https://s3-ap-southeast-2.amazonaws.com/openchargemap/images/IT/OCM133124/OCM-133124.thmb.2021093005062531.jpg",
            "Comment": "",
            "IsEnabled": true,
            "IsVideo": false,
            "IsFeaturedItem": false,
            "IsExternalResource": false,
            "User": {
                "ID": 11749,
                "Username": "ForumElettrico.it"
            },
            "DateCreated": "2021-09-30T05:06:00Z"
        },
        {
            "ID": 29313,
            "ChargePointID": 133124,
            "ItemURL": "https://s3-ap-southeast-2.amazonaws.com/openchargemap/images/IT/OCM133124/OCM-133124.orig.2021092014175680.jpg",
            "ItemThumbnailURL": "https://s3-ap-southeast-2.amazonaws.com/openchargemap/images/IT/OCM133124/OCM-133124.thmb.2021092014175680.jpg",
            "Comment": "",
            "IsEnabled": true,
            "IsVideo": false,
            "IsFeaturedItem": false,
            "IsExternalResource": false,
            "User": {
                "ID": 30566,
                "Username": "Carlomanda"
            },
            "DateCreated": "2021-09-20T14:18:00Z"
        }
    ],
    "IsRecentlyVerified": false,
    "ID": 133124,
    "UUID": "51A31D46-7E08-41A1-849E-AD73BC9B7043",
    "DataProviderID": 1,
    "OperatorID": 80,
    "UsageTypeID": 4,
    "AddressInfo": {
        "ID": 133470,
        "Title": "Municipio di Leini | EnelX",
        "AddressLine1": "Via Ricciolio",
        "Town": "Leini",
        "StateOrProvince": "TO",
        "Postcode": "10040",
        "CountryID": 112,
        "Latitude": 45.1818537479336,
        "Longitude": 7.71691655606651,
        "RelatedURL": "https://www.enelx.com/it/it/emobility",
        "DistanceUnit": 0
    },
    "Connections": [
        {
            "ID": 186420,
            "ConnectionTypeID": 33,
            "StatusTypeID": 50,
            "LevelID": 3,
            "Amps": 120,
            "Voltage": 500,
            "PowerKW": 50,
            "CurrentTypeID": 30,
            "Quantity": 1
        },
        {
            "ID": 186421,
            "ConnectionTypeID": 2,
            "StatusTypeID": 50,
            "LevelID": 3,
            "Amps": 120,
            "Voltage": 500,
            "PowerKW": 50,
            "CurrentTypeID": 30,
            "Quantity": 1
        },
        {
            "ID": 186422,
            "ConnectionTypeID": 1036,
            "StatusTypeID": 50,
            "LevelID": 3,
            "Amps": 64,
            "Voltage": 400,
            "PowerKW": 43,
            "CurrentTypeID": 20,
            "Quantity": 1
        },
        {
            "ID": 186423,
            "ConnectionTypeID": 25,
            "StatusTypeID": 50,
            "LevelID": 2,
            "Amps": 32,
            "Voltage": 400,
            "PowerKW": 22,
            "CurrentTypeID": 20,
            "Quantity": 4
        }
    ],
    "NumberOfPoints": 6,
    "StatusTypeID": 50,
    "DateLastStatusUpdate": "2021-09-30T05:07:00Z",
    "DataQualityLevel": 1,
    "DateCreated": "2019-10-14T07:47:00Z",
    "SubmissionStatusTypeID": 200
}