{
    "IsRecentlyVerified": false,
    "ID": 36407,
    "UUID": "364AC3A4-AA58-47C6-9719-B7A10F8B1F6E",
    "DataProviderID": 26,
    "DataProvidersReference": "48689",
    "OperatorID": 178,
    "OperatorsReference": "EVnetNL REE568",
    "UsageCost": "0.00 jaarabonnement",
    "AddressInfo": {
        "ID": 36753,
        "Title": "Zijlsingel 73B",
        "AddressLine1": "Zijlsingel 73B",
        "Town": "Leiden",
        "Postcode": "2315 KH",
        "CountryID": 159,
        "Latitude": 52.157064,
        "Longitude": 4.504805,
        "ContactTelephone1": "0800-3522365",
        "RelatedURL": "http://www.evnet.nl",
        "DistanceUnit": 0
    },
    "Connections": [
        {
            "ID": 39918,
            "ConnectionTypeID": 25,
            "LevelID": 1,
            "PowerKW": 2.3,
            "CurrentTypeID": 10
        }
    ],
    "NumberOfPoints": 1,
    "StatusTypeID": 50,
    "DateLastStatusUpdate": "2016-06-04T02:51:00Z",
    "DataQualityLevel": 3,
    "DateCreated": "2015-01-09T06:05:00Z",
    "SubmissionStatusTypeID": 100
}