{
    "IsRecentlyVerified": false,
    "ID": 139547,
    "UUID": "90956097-CED9-4453-9356-AAD008C2AFB2",
    "DataProviderID": 2,
    "DataProvidersReference": "149833",
    "OperatorID": 59,
    "UsageTypeID": 1,
    "AddressInfo": {
        "ID": 139899,
        "Title": "Greenlots - 12312A",
        "AddressLine1": "10719 S WESTERN AVE",
        "Town": "Los Angeles",
        "StateOrProvince": "CA",
        "Postcode": "90047",
        "CountryID": 2,
        "Latitude": 33.9387016296387,
        "Longitude": -118.30899810791,
        "ContactTelephone1": "855-900-7584",
        "AccessComments": "24 hours daily",
        "RelatedURL": "http://greenlots.com/",
        "DistanceUnit": 0
    },
    "Connections": [
        {
            "ID": 194949,
            "ConnectionTypeID": 1,
            "LevelID": 2,
            "Amps": 16,
            "Voltage": 230,
            "PowerKW": 3.7,
            "CurrentTypeID": 10,
            "Quantity": 1
        }
    ],
    "StatusTypeID": 50,
    "DateLastStatusUpdate": "2020-06-26T02:56:00Z",
    "DataQualityLevel": 3,
    "DateCreated": "2019-12-24T09:11:00Z",
    "SubmissionStatusTypeID": 100
}