{
    "IsRecentlyVerified": false,
    "ID": 145480,
    "UUID": "9ACC048A-C0B6-4F3C-8932-6E268FD5A529",
    "DataProviderID": 2,
    "DataProvidersReference": "95259",
    "OperatorID": 9,
    "UsageTypeID": 1,
    "AddressInfo": {
        "ID": 145832,
        "Title": "Port of Poulsbo",
        "AddressLine1": "19133 Jensen Way NE",
        "Town": "Poulsbo",
        "StateOrProvince": "WA",
        "Postcode": "98370",
        "CountryID": 2,
        "Latitude": 47.736632,
        "Longitude": -122.647204,
        "ContactTelephone1": "888-998-2546",
        "AccessComments": "MON: 24 hours | TUE: 24 hours | WED: 24 hours | THU: 24 hours | FRI: 24 hours | SAT: 24 hours | SUN: 24 hours",
        "RelatedURL": "http://www.blinkcharging.com/",
        "DistanceUnit": 0
    },
    "Connections": [
        {
            "ID": 202162,
            "ConnectionTypeID": 1,
            "LevelID": 2,
            "Amps": 16,
            "Voltage": 230,
            "PowerKW": 3.7,
            "CurrentTypeID": 10,
            "Quantity": 4
        }
    ],
    "StatusTypeID": 50,
    "DateLastStatusUpdate": "2020-06-26T03:11:00Z",
    "DataQualityLevel": 3,
    "DateCreated": "2019-12-24T09:25:00Z",
    "SubmissionStatusTypeID": 100
}