{
    "IsRecentlyVerified": false,
    "ID": 9292,
    "UUID": "BC82DA2F-D668-422E-9B72-AD11F2058B82",
    "DataProviderID": 15,
    "DataProvidersReference": "14202",
    "OperatorID": 94,
    "UsageTypeID": 1,
    "AddressInfo": {
        "ID": 9189,
        "Title": "8505 IBM Drive, Suite #100",
        "AddressLine1": "8505 IBM Drive, Suite #100",
        "Town": "Charlotte",
        "StateOrProvince": "NC",
        "Postcode": "28262",
        "CountryID": 2,
        "Latitude": 35.30914,
        "Longitude": -80.76656,
        "ContactTelephone1": "(704) 547-0079",
        "RelatedURL": "http://carstations.com/14202",
        "DistanceUnit": 0
    },
    "Connections": [
        {
            "ID": 7006,
            "ConnectionTypeID": 1,
            "Reference": "J1772",
            "LevelID": 2
        }
    ],
    "NumberOfPoints": 2,
    "StatusTypeID": 50,
    "DateLastStatusUpdate": "2017-11-04T14:04:00Z",
    "DataQualityLevel": 2,
    "DateCreated": "2012-02-08T14:36:00Z",
    "SubmissionStatusTypeID": 100
}