{
    "IsRecentlyVerified": false,
    "ID": 137833,
    "UUID": "36759ED6-DF40-4510-86DC-32296DBE5836",
    "DataProviderID": 2,
    "DataProvidersReference": "149929",
    "OperatorID": 5,
    "UsageTypeID": 1,
    "AddressInfo": {
        "ID": 138182,
        "Title": "UCSD",
        "AddressLine1": "3683 Voigt Dr",
        "Town": "San Diego",
        "StateOrProvince": "CA",
        "Postcode": "92037",
        "CountryID": 2,
        "Latitude": 32.881688,
        "Longitude": -117.222595,
        "ContactTelephone1": "888-758-4389",
        "AccessComments": "24 hours daily",
        "RelatedURL": "http://www.chargepoint.com/",
        "DistanceUnit": 0
    },
    "Connections": [
        {
            "ID": 192844,
            "ConnectionTypeID": 2,
            "LevelID": 3,
            "Amps": 100,
            "Voltage": 400,
            "PowerKW": 40,
            "CurrentTypeID": 30,
            "Quantity": 1
        },
        {
            "ID": 192845,
            "ConnectionTypeID": 32,
            "LevelID": 3,
            "Amps": 100,
            "Voltage": 400,
            "PowerKW": 40,
            "CurrentTypeID": 30,
            "Quantity": 1
        }
    ],
    "StatusTypeID": 50,
    "DateLastStatusUpdate": "2019-12-24T09:06:00Z",
    "DataQualityLevel": 3,
    "DateCreated": "2019-12-24T09:06:00Z",
    "SubmissionStatusTypeID": 100
}