{
    "UserComments": [
        {
            "ID": 21037,
            "ChargePointID": 95024,
            "CommentTypeID": 1000,
            "UserName": "davidp40",
            "Comment": "Jaguar I-Pace CCS. Another Ecotricity site which will not charge my car.",
            "Rating": 1,
            "DateCreated": "2019-05-23T19:28:38.35Z",
            "User": {
                "ID": 20988,
                "Username": "davidp40"
            },
            "CheckinStatusTypeID": 25
        },
        {
            "ID": 20151,
            "ChargePointID": 95024,
            "CommentTypeID": 10,
            "UserName": "Rich",
            "Comment": "Rubbish",
            "DateCreated": "2018-09-15T13:30:06.89Z",
            "User": {
                "ID": 19043,
                "Username": "Rich"
            },
            "CheckinStatusTypeID": 15
        }
    ],
    "IsRecentlyVerified": false,
    "ID": 95024,
    "UUID": "449D1B2D-5E25-42A7-8F8D-F44A4E35E162",
    "DataProviderID": 1,
    "OperatorID": 24,
    "OperatorsReference": "1319",
    "UsageTypeID": 5,
    "UsageCost": "£0.30/kWh",
    "AddressInfo": {
        "ID": 95370,
        "Title": "Roadchef Sutton Scotney Services A34 Southbound",
        "AddressLine1": "A34 Southbound",
        "Town": "Winchester",
        "StateOrProvince": "Hampshire",
        "Postcode": "SO21 3JY",
        "CountryID": 1,
        "Latitude": 51.1567720877935,
        "Longitude": -1.34391050527962,
        "DistanceUnit": 0
    },
    "Connections": [
        {
            "ID": 134645,
            "ConnectionTypeID": 2,
            "StatusTypeID": 50,
            "LevelID": 3,
            "Amps": 200,
            "Voltage": 500,
            "PowerKW": 100,
            "CurrentTypeID": 30,
            "Quantity": 1
        },
        {
            "ID": 134646,
            "ConnectionTypeID": 33,
            "StatusTypeID": 50,
            "LevelID": 3,
            "Amps": 200,
            "Voltage": 920,
            "PowerKW": 120,
            "CurrentTypeID": 30,
            "Quantity": 1
        }
    ],
    "NumberOfPoints": 2,
    "StatusTypeID": 50,
    "DateLastStatusUpdate": "2021-07-05T09:31:00Z",
    "DataQualityLevel": 1,
    "DateCreated": "2017-11-01T09:12:00Z",
    "SubmissionStatusTypeID": 200
}