{
    "IsRecentlyVerified": false,
    "ID": 187518,
    "UUID": "9F74A5CC-6910-4DC1-BF32-BAA29B152C13",
    "DataProviderID": 18,
    "DataProvidersReference": "50d72fef72b59d9717abdfaca017d69c",
    "OperatorID": 2244,
    "UsageTypeID": 5,
    "AddressInfo": {
        "ID": 187877,
        "Title": "90 Fernlea Road",
        "AddressLine1": "90 Fernlea Road",
        "Town": "London",
        "Postcode": "SW12 9RW",
        "CountryID": 1,
        "Latitude": -0.1454,
        "Longitude": 51.44218,
        "AccessComments": "",
        "RelatedURL": "https://www.ubitricity.com",
        "DistanceUnit": 0
    },
    "Connections": [
        {
            "ID": 302652,
            "ConnectionTypeID": 25,
            "Reference": "suby1100005386",
            "StatusTypeID": 50,
            "LevelID": 2,
            "Amps": 16,
            "Voltage": 230,
            "PowerKW": 3.7,
            "CurrentTypeID": 10
        }
    ],
    "StatusTypeID": 0,
    "DateLastStatusUpdate": "2021-07-12T03:38:00Z",
    "MetadataValues": [
        {
            "ID": 19758,
            "MetadataFieldID": 4,
            "ItemValue": "Contains public sector information licensed under the Open Government Licence v2.0. http://www.nationalarchives.gov.uk/doc/open-government-licence/version/2/"
        }
    ],
    "DataQualityLevel": 3,
    "DateCreated": "2021-07-12T03:38:00Z",
    "SubmissionStatusTypeID": 100
}