{
    "IsRecentlyVerified": false,
    "ID": 122021,
    "UUID": "AC0DF6A0-294F-4F45-B95B-E61A7F5ABB66",
    "DataProviderID": 2,
    "DataProvidersReference": "39986",
    "UsageTypeID": 7,
    "AddressInfo": {
        "ID": 122367,
        "Title": "Gwinnett Place Nissan",
        "AddressLine1": "2555 Pleasant Hill Rd",
        "Town": "Duluth",
        "StateOrProvince": "GA",
        "Postcode": "30096",
        "CountryID": 2,
        "Latitude": 33.967935,
        "Longitude": -84.146036,
        "ContactTelephone1": "770-476-7771",
        "AccessComments": "Dealership business hours\r\nPublic - Call ahead",
        "RelatedURL": "",
        "DistanceUnit": 0
    },
    "Connections": [
        {
            "ID": 171871,
            "ConnectionTypeID": 1,
            "LevelID": 2,
            "Amps": 16,
            "Voltage": 230,
            "PowerKW": 3.7,
            "CurrentTypeID": 10,
            "Quantity": 1
        },
        {
            "ID": 171872,
            "ConnectionTypeID": 2,
            "LevelID": 3,
            "Amps": 100,
            "Voltage": 400,
            "PowerKW": 40,
            "CurrentTypeID": 30,
            "Quantity": 1
        }
    ],
    "DateLastStatusUpdate": "2020-06-26T02:56:00Z",
    "DataQualityLevel": 3,
    "DateCreated": "2019-04-06T05:02:00Z",
    "SubmissionStatusTypeID": 100
}