{
    "IsRecentlyVerified": false,
    "ID": 169363,
    "UUID": "ECBD5EDC-0787-458D-88CA-04BBFE64E100",
    "DataProviderID": 1,
    "OperatorID": 3,
    "OperatorsReference": "PG-84491,PG-84527,PG-84605",
    "UsageTypeID": 4,
    "UsageCost": "£0.25/kWh",
    "AddressInfo": {
        "ID": 169722,
        "Title": "Roehampton Club",
        "AddressLine1": "Roehampton Lane",
        "Town": "London",
        "Postcode": "SW15 5LR",
        "CountryID": 1,
        "Latitude": 51.4637558,
        "Longitude": -0.244015,
        "DistanceUnit": 0
    },
    "Connections": [
        {
            "ID": 257683,
            "ConnectionTypeID": 25,
            "StatusTypeID": 50,
            "LevelID": 2,
            "Amps": 32,
            "Voltage": 230,
            "PowerKW": 7,
            "CurrentTypeID": 10,
            "Quantity": 6
        }
    ],
    "NumberOfPoints": 6,
    "GeneralComments": "This is an open charge unit installed at the Roehampton Club at Roehampton Lane, London",
    "StatusTypeID": 50,
    "DateLastStatusUpdate": "2021-03-08T11:48:00Z",
    "DataQualityLevel": 1,
    "DateCreated": "2020-10-15T21:35:00Z",
    "SubmissionStatusTypeID": 200
}