{
    "IsRecentlyVerified": false,
    "ID": 42447,
    "UUID": "48564184-2291-4794-83DC-AE2F0CF119CC",
    "DataProviderID": 1,
    "OperatorID": 165,
    "UsageTypeID": 1,
    "UsageCost": "kostenfrei",
    "AddressInfo": {
        "ID": 42793,
        "Title": "Flörsheim am Main",
        "AddressLine1": "Mainova Stromtankstelle",
        "AddressLine2": "Kapellenstraße 1-6",
        "Town": "Flörsheim am Main",
        "StateOrProvince": "Hessen",
        "Postcode": "65439",
        "CountryID": 87,
        "Latitude": 50.01192,
        "Longitude": 8.42247999999995,
        "ContactTelephone1": "ServiceLine: 0800 11 444 88 (kostenfrei aus dem deutschen Festnetz)",
        "ContactEmail": "online-redaktion@mainova.de",
        "AccessComments": "Stadthalle",
        "RelatedURL": "https://www.mainova.de/privatkunden/mobilitaet/stromtankstellen.html",
        "DistanceUnit": 0
    },
    "Connections": [
        {
            "ID": 51094,
            "ConnectionTypeID": 28,
            "LevelID": 2,
            "Amps": 16,
            "Voltage": 230,
            "PowerKW": 3.7
        },
        {
            "ID": 51129,
            "ConnectionTypeID": 0,
            "LevelID": 2,
            "Amps": 32,
            "Voltage": 400,
            "PowerKW": 12.8
        }
    ],
    "NumberOfPoints": 2,
    "GeneralComments": "2 Steckdosen (1 Schuko-Stecker 230V/16A, 1 Autostrom-Stecker 400V/32A). Zum Laden einfach mit dem Handy die kostenfreie Nummer anrufen und den Ladeprozess starten. Laden zu jeder Zeit möglich.",
    "StatusTypeID": 50,
    "DateLastStatusUpdate": "2015-03-11T15:14:00Z",
    "DataQualityLevel": 1,
    "DateCreated": "2015-03-11T08:35:00Z",
    "SubmissionStatusTypeID": 200
}