{
    "IsRecentlyVerified": true,
    "DateLastVerified": "2021-08-25T21:13:00Z",
    "ID": 188931,
    "UUID": "76800E2F-0578-4052-B07A-4E0C0D88386C",
    "DataProviderID": 1,
    "OperatorID": 5,
    "UsageTypeID": 1,
    "UsageCost": "Free",
    "AddressInfo": {
        "ID": 189290,
        "Title": "82 Floral Parkway",
        "AddressLine1": "82 Floral Parkway",
        "Town": "Toronto",
        "StateOrProvince": "ON",
        "Postcode": "M3J3H6",
        "CountryID": 44,
        "Latitude": 43.72329198385335,
        "Longitude": -79.4739458055265,
        "AccessComments": "Public parking, free access from Floral parkway",
        "DistanceUnit": 0
    },
    "Connections": [
        {
            "ID": 305329,
            "ConnectionTypeID": 1,
            "StatusTypeID": 75,
            "LevelID": 2,
            "PowerKW": 6,
            "CurrentTypeID": 10,
            "Quantity": 2,
            "Comments": "Looks like the left plug doesn’t works."
        }
    ],
    "NumberOfPoints": 2,
    "StatusTypeID": 50,
    "DateLastStatusUpdate": "2021-08-26T13:35:00Z",
    "DataQualityLevel": 1,
    "DateCreated": "2021-08-25T21:13:00Z",
    "SubmissionStatusTypeID": 200
}