{
    "IsRecentlyVerified": false,
    "ID": 47297,
    "UUID": "942584E8-83EC-4156-87F9-2D04EE3000A5",
    "DataProviderID": 1,
    "OperatorID": 45,
    "UsageTypeID": 5,
    "UsageCost": "0,50€/kWh",
    "AddressInfo": {
        "ID": 47643,
        "Title": "Parkhaus Hotel Estrel",
        "AddressLine1": "Sonnenallee 225",
        "AddressLine2": "Neukölln",
        "Town": "Berlin",
        "StateOrProvince": "Berlin",
        "Postcode": "12057",
        "CountryID": 87,
        "Latitude": 52.472890022146196,
        "Longitude": 13.458501590372393,
        "ContactTelephone1": "+49 30 68310",
        "AccessComments": "Einfahrt an der Ecke Ziegrastraße/Sonnenallee. Ladebox auf Parkdeck 1,  gegenüber den Parkplätzen 190/191.\r\nParkgebühren + Stromkosten 0,50€/kWh, durchgehend geöffnet.",
        "RelatedURL": "http://www.estrel.com/de/presse/pressemitteilung/uebernachten-inklusive-auftanken.html",
        "DistanceUnit": 0
    },
    "Connections": [
        {
            "ID": 58311,
            "ConnectionTypeID": 25,
            "StatusTypeID": 50,
            "LevelID": 2,
            "Amps": 16,
            "Voltage": 400,
            "PowerKW": 11,
            "CurrentTypeID": 20,
            "Quantity": 1
        },
        {
            "ID": 58312,
            "ConnectionTypeID": 28,
            "StatusTypeID": 50,
            "LevelID": 2,
            "Amps": 16,
            "Voltage": 230,
            "PowerKW": 3.7,
            "CurrentTypeID": 10,
            "Quantity": 1
        }
    ],
    "NumberOfPoints": 2,
    "StatusTypeID": 50,
    "DateLastStatusUpdate": "2015-05-24T18:32:00Z",
    "DataQualityLevel": 1,
    "DateCreated": "2015-05-24T18:32:00Z",
    "SubmissionStatusTypeID": 200
}