{
    "UserComments": [
        {
            "ID": 14354,
            "ChargePointID": 45674,
            "CommentTypeID": 10,
            "UserName": "Hans Gamborg",
            "Comment": "",
            "Rating": 5,
            "DateCreated": "2016-10-05T17:56:46.163Z",
            "User": {
                "ID": 11846,
                "Username": "Hans Gamborg"
            },
            "CheckinStatusTypeID": 10
        },
        {
            "ID": 14328,
            "ChargePointID": 45674,
            "CommentTypeID": 1000,
            "UserName": "Hans Gamborg",
            "Comment": "Delta charter out of order. The other is ok.",
            "Rating": 5,
            "DateCreated": "2016-09-27T17:42:21.91Z",
            "User": {
                "ID": 11846,
                "Username": "Hans Gamborg"
            },
            "CheckinStatusTypeID": 10
        },
        {
            "ID": 14280,
            "ChargePointID": 45674,
            "CommentTypeID": 10,
            "UserName": "Hans Gamborg",
            "Comment": "",
            "Rating": 5,
            "DateCreated": "2016-09-20T22:16:45.75Z",
            "User": {
                "ID": 11846,
                "Username": "Hans Gamborg"
            },
            "CheckinStatusTypeID": 10
        }
    ],
    "MediaItems": [
        {
            "ID": 8311,
            "ChargePointID": 45674,
            "ItemURL": "https://s3-ap-southeast-2.amazonaws.com/openchargemap/images/SE/OCM45674/OCM-45674.orig.2016092022154781.jpg",
            "ItemThumbnailURL": "https://s3-ap-southeast-2.amazonaws.com/openchargemap/images/SE/OCM45674/OCM-45674.thmb.2016092022154781.jpg",
            "Comment": "",
            "IsEnabled": true,
            "IsVideo": false,
            "IsFeaturedItem": false,
            "IsExternalResource": false,
            "User": {
                "ID": 11846,
                "Username": "Hans Gamborg"
            },
            "DateCreated": "2016-09-20T22:16:00Z"
        }
    ],
    "IsRecentlyVerified": false,
    "ID": 45674,
    "UUID": "37F2C610-4896-4D0D-8D7D-31A9C7495DCC",
    "DataProviderID": 1,
    "UsageTypeID": 1,
    "UsageCost": "Free",
    "AddressInfo": {
        "ID": 46020,
        "Title": "Laddpunkten Kungälv",
        "AddressLine1": "Gymnasiegatan ",
        "Town": "KUNGÄLV",
        "StateOrProvince": "VÄSTRA GÖTALAND",
        "Postcode": "44234",
        "CountryID": 216,
        "Latitude": 57.876001509729,
        "Longitude": 11.9726348825155,
        "AccessComments": "På samma parkering som McDonalds, längst  in.",
        "DistanceUnit": 0
    },
    "Connections": [
        {
            "ID": 56337,
            "ConnectionTypeID": 2,
            "Reference": "1",
            "StatusTypeID": 50,
            "LevelID": 3,
            "Amps": 106,
            "Voltage": 400,
            "PowerKW": 42,
            "CurrentTypeID": 30,
            "Comments": "Mode 4"
        },
        {
            "ID": 83968,
            "ConnectionTypeID": 2,
            "Reference": "2",
            "StatusTypeID": 50,
            "LevelID": 3,
            "Amps": 120,
            "Voltage": 400,
            "PowerKW": 48,
            "CurrentTypeID": 30,
            "Comments": "Mode 4"
        },
        {
            "ID": 83969,
            "ConnectionTypeID": 33,
            "Reference": "3",
            "LevelID": 3,
            "Amps": 100,
            "Voltage": 500,
            "PowerKW": 50,
            "CurrentTypeID": 30,
            "Comments": "Mode 4"
        },
        {
            "ID": 87905,
            "ConnectionTypeID": 25,
            "Reference": "4",
            "LevelID": 2,
            "Amps": 63,
            "Voltage": 400,
            "PowerKW": 25,
            "CurrentTypeID": 20,
            "Comments": "Mode 3"
        }
    ],
    "NumberOfPoints": 4,
    "StatusTypeID": 50,
    "DateLastStatusUpdate": "2019-03-16T07:03:00Z",
    "DataQualityLevel": 2,
    "DateCreated": "2015-05-03T00:54:00Z",
    "SubmissionStatusTypeID": 100
}