{
    "UserComments": [
        {
            "ID": 22286,
            "ChargePointID": 113290,
            "CommentTypeID": 10,
            "UserName": "ForumElettrico.it",
            "Comment": "Notare come il Comune usi lo stallo per il cassonetto della raccolta plastica. Leggi la recensione completa qui > https://www.forumelettrico.it/forum/enelx-rivanazzano-p-za-italia-t5725.html\r\n",
            "RelatedURL": "https://www.forumelettrico.it/forum/enelx-rivanazzano-p-za-italia-t5725.html",
            "DateCreated": "2020-03-13T17:33:19.76Z",
            "User": {
                "ID": 11749,
                "Username": "ForumElettrico.it"
            },
            "CheckinStatusTypeID": 140,
            "IsActionedByEditor": false
        }
    ],
    "MediaItems": [
        {
            "ID": 21555,
            "ChargePointID": 113290,
            "ItemURL": "https://s3-ap-southeast-2.amazonaws.com/openchargemap/images/IT/OCM113290/OCM-113290.orig.2020031317333230.jpg",
            "ItemThumbnailURL": "https://s3-ap-southeast-2.amazonaws.com/openchargemap/images/IT/OCM113290/OCM-113290.thmb.2020031317333230.jpg",
            "Comment": "",
            "IsEnabled": true,
            "IsVideo": false,
            "IsFeaturedItem": false,
            "IsExternalResource": false,
            "User": {
                "ID": 11749,
                "Username": "ForumElettrico.it"
            },
            "DateCreated": "2020-03-13T17:34:00Z"
        },
        {
            "ID": 21556,
            "ChargePointID": 113290,
            "ItemURL": "https://s3-ap-southeast-2.amazonaws.com/openchargemap/images/IT/OCM113290/OCM-113290.orig.2020031317333789.jpg",
            "ItemThumbnailURL": "https://s3-ap-southeast-2.amazonaws.com/openchargemap/images/IT/OCM113290/OCM-113290.thmb.2020031317333789.jpg",
            "Comment": "",
            "IsEnabled": true,
            "IsVideo": false,
            "IsFeaturedItem": false,
            "IsExternalResource": false,
            "User": {
                "ID": 11749,
                "Username": "ForumElettrico.it"
            },
            "DateCreated": "2020-03-13T17:34:00Z"
        }
    ],
    "IsRecentlyVerified": false,
    "ID": 113290,
    "UUID": "4D44915D-30A0-40BA-B798-EB9A2819483E",
    "DataProviderID": 1,
    "OperatorID": 80,
    "UsageTypeID": 4,
    "AddressInfo": {
        "ID": 113636,
        "Title": "Rivanazzano  Piazza Italia | EnelX",
        "AddressLine1": "Piazza Italia",
        "Town": "Rivanazzano Terme",
        "StateOrProvince": "PV",
        "Postcode": "27055",
        "CountryID": 112,
        "Latitude": 44.9309932129894,
        "Longitude": 9.01484178751595,
        "ContactTelephone1": "800.069.850",
        "RelatedURL": "https://www.enelx.com/it/it/emobility",
        "DistanceUnit": 0
    },
    "Connections": [
        {
            "ID": 159505,
            "ConnectionTypeID": 25,
            "StatusTypeID": 50,
            "LevelID": 2,
            "Amps": 32,
            "Voltage": 400,
            "PowerKW": 22,
            "CurrentTypeID": 20,
            "Quantity": 2
        }
    ],
    "NumberOfPoints": 2,
    "StatusTypeID": 50,
    "DateLastStatusUpdate": "2020-03-13T17:34:00Z",
    "DataQualityLevel": 1,
    "DateCreated": "2018-11-29T10:26:00Z",
    "SubmissionStatusTypeID": 200
}