{
    "IsRecentlyVerified": false,
    "ID": 85987,
    "UUID": "AF916665-0E85-424B-88F8-6DF1B3F4BE8D",
    "DataProviderID": 1,
    "OperatorID": 220,
    "OperatorsReference": "3154",
    "UsageTypeID": 1,
    "UsageCost": "€1.73 + €0.3213/kWh; Andere Tarife möglich",
    "AddressInfo": {
        "ID": 86333,
        "Title": "Reinbeker Redder 283",
        "AddressLine1": "Reinbeker Redder 283",
        "Town": "Bergedorf",
        "StateOrProvince": "Hamburg",
        "Postcode": "21031",
        "CountryID": 87,
        "Latitude": 53.5132774087296,
        "Longitude": 10.2112690418721,
        "DistanceUnit": 0
    },
    "Connections": [
        {
            "ID": 122276,
            "ConnectionTypeID": 25,
            "StatusTypeID": 50,
            "LevelID": 2,
            "Amps": 32,
            "Voltage": 400,
            "PowerKW": 22,
            "CurrentTypeID": 20,
            "Quantity": 2
        },
        {
            "ID": 122277,
            "ConnectionTypeID": 28,
            "StatusTypeID": 50,
            "LevelID": 2,
            "Amps": 16,
            "Voltage": 230,
            "PowerKW": 3.7,
            "CurrentTypeID": 10,
            "Quantity": 2
        }
    ],
    "NumberOfPoints": 2,
    "StatusTypeID": 50,
    "DateLastStatusUpdate": "2017-06-11T09:39:00Z",
    "DataQualityLevel": 1,
    "DateCreated": "2017-04-20T16:39:00Z",
    "SubmissionStatusTypeID": 200
}