{
    "IsRecentlyVerified": false,
    "ID": 141943,
    "UUID": "4B7F023F-EC02-4C36-B8BC-EFD8224281D4",
    "DataProviderID": 2,
    "DataProvidersReference": "123571",
    "OperatorID": 5,
    "UsageTypeID": 1,
    "AddressInfo": {
        "ID": 142295,
        "Title": "COW",
        "AddressLine1": "8855 Eaton St",
        "Town": "Westminster",
        "StateOrProvince": "CO",
        "Postcode": "80031",
        "CountryID": 2,
        "Latitude": 39.857774,
        "Longitude": -105.037274,
        "ContactTelephone1": "888-758-4389",
        "AccessComments": "24 hours daily",
        "RelatedURL": "http://www.chargepoint.com/",
        "DistanceUnit": 0
    },
    "Connections": [
        {
            "ID": 197987,
            "ConnectionTypeID": 1,
            "LevelID": 2,
            "Amps": 16,
            "Voltage": 230,
            "PowerKW": 3.7,
            "CurrentTypeID": 10,
            "Quantity": 8
        }
    ],
    "StatusTypeID": 50,
    "DateLastStatusUpdate": "2020-06-26T03:02:00Z",
    "DataQualityLevel": 3,
    "DateCreated": "2019-12-24T09:16:00Z",
    "SubmissionStatusTypeID": 100
}