{
    "IsRecentlyVerified": false,
    "ID": 85619,
    "UUID": "2044F861-39FA-4B84-86FF-37B2DF093AA6",
    "DataProviderID": 1,
    "OperatorID": 3266,
    "UsageTypeID": 4,
    "AddressInfo": {
        "ID": 85965,
        "Title": "Bütjthaarepswai ",
        "AddressLine1": "Bütjthaarepswai ",
        "Town": "Oldsum",
        "StateOrProvince": "Föhr-Amrum",
        "Postcode": "25938",
        "CountryID": 87,
        "Latitude": 54.73299400224582,
        "Longitude": 8.450780924853465,
        "AccessComments": "24/7 nutzbar mit PlugSurfing App. Laden ist kostenlos.",
        "DistanceUnit": 0
    },
    "Connections": [
        {
            "ID": 121732,
            "ConnectionTypeID": 25,
            "StatusTypeID": 50,
            "LevelID": 2,
            "Amps": 32,
            "Voltage": 400,
            "PowerKW": 22,
            "CurrentTypeID": 20,
            "Quantity": 2
        }
    ],
    "NumberOfPoints": 2,
    "StatusTypeID": 50,
    "DateLastStatusUpdate": "2017-04-10T04:47:00Z",
    "DataQualityLevel": 1,
    "DateCreated": "2017-04-10T04:47:00Z",
    "SubmissionStatusTypeID": 200
}