{
    "IsRecentlyVerified": false,
    "ID": 36266,
    "UUID": "F29ED12E-BA15-4C52-8C0E-8B3E5316CFDC",
    "DataProviderID": 26,
    "DataProvidersReference": "47678",
    "OperatorID": 178,
    "OperatorsReference": "EVnetNL AL829",
    "UsageCost": "0.00 jaarabonnement",
    "AddressInfo": {
        "ID": 36612,
        "Title": "Evenaar 1",
        "AddressLine1": "Evenaar 1",
        "Town": "Alphen aan den Rijn",
        "Postcode": "2408 CW",
        "CountryID": 159,
        "Latitude": 52.124608,
        "Longitude": 4.643867,
        "ContactTelephone1": "0800-3522365",
        "RelatedURL": "http://www.evnet.nl",
        "DistanceUnit": 0
    },
    "Connections": [
        {
            "ID": 39777,
            "ConnectionTypeID": 25,
            "LevelID": 2,
            "PowerKW": 11,
            "CurrentTypeID": 10
        }
    ],
    "NumberOfPoints": 2,
    "StatusTypeID": 50,
    "DateLastStatusUpdate": "2016-06-04T02:50:00Z",
    "DataQualityLevel": 3,
    "DateCreated": "2015-01-09T06:05:00Z",
    "SubmissionStatusTypeID": 100
}