{
    "IsRecentlyVerified": false,
    "ID": 183847,
    "UUID": "948B1B12-3A36-4000-B94B-E6AD92387311",
    "DataProviderID": 29,
    "DataProvidersReference": "18820",
    "AddressInfo": {
        "ID": 184206,
        "Title": "Weddemweg 10",
        "AddressLine1": "Weddemweg 10",
        "Town": "Salzgitter",
        "Postcode": "38229",
        "CountryID": 87,
        "Latitude": 52.107161,
        "Longitude": 10.357266,
        "DistanceUnit": 0
    },
    "Connections": [
        {
            "ID": 291336,
            "ConnectionTypeID": 25,
            "StatusTypeID": 50,
            "LevelID": 2,
            "PowerKW": 22,
            "CurrentTypeID": 20
        },
        {
            "ID": 291337,
            "ConnectionTypeID": 25,
            "StatusTypeID": 50,
            "LevelID": 2,
            "PowerKW": 22,
            "CurrentTypeID": 20
        }
    ],
    "StatusTypeID": 50,
    "DateLastStatusUpdate": "2021-07-09T03:25:00Z",
    "MetadataValues": [
        {
            "ID": 16140,
            "MetadataFieldID": 4,
            "ItemValue": "Data from the German chargepoint registry provided by Bundesnetzagentur.de under the CC-BY 4.0 license"
        }
    ],
    "DataQualityLevel": 3,
    "DateCreated": "2021-07-08T10:04:00Z",
    "SubmissionStatusTypeID": 100
}