{
    "IsRecentlyVerified": false,
    "ID": 100951,
    "UUID": "3E024B7B-CB2A-4CA6-88B8-6302B1FE0FEC",
    "DataProviderID": 1,
    "OperatorID": 23,
    "OperatorsReference": "41231",
    "UsageTypeID": 4,
    "AddressInfo": {
        "ID": 101297,
        "Title": "Icon Parking 70 Gold Street",
        "AddressLine1": "80 Gold St",
        "Town": "New York",
        "StateOrProvince": "New York",
        "Postcode": "10038",
        "CountryID": 2,
        "Latitude": 40.710019,
        "Longitude": -74.004385,
        "ContactTelephone1": "(212) 964-5250",
        "DistanceUnit": 0
    },
    "Connections": [
        {
            "ID": 142546,
            "ConnectionTypeID": 30,
            "StatusTypeID": 50,
            "LevelID": 2,
            "PowerKW": 8,
            "CurrentTypeID": 10,
            "Quantity": 2
        }
    ],
    "NumberOfPoints": 2,
    "GeneralComments": "2 Tesla Connectors, up to 8kW.Parking fees will apply. Please see valet.",
    "StatusTypeID": 50,
    "DateLastStatusUpdate": "2018-03-13T06:56:00Z",
    "DataQualityLevel": 1,
    "DateCreated": "2018-03-13T06:56:00Z",
    "SubmissionStatusTypeID": 200
}