{
    "IsRecentlyVerified": false,
    "ID": 180266,
    "UUID": "A04DBC91-93A1-496F-970E-73AA8754AADA",
    "DataProviderID": 29,
    "DataProvidersReference": "17522",
    "AddressInfo": {
        "ID": 180625,
        "Title": "Balthasar-Neumann-Straße 18",
        "AddressLine1": "Balthasar-Neumann-Straße 18",
        "Town": "Wiesentheid",
        "Postcode": "97353",
        "CountryID": 87,
        "Latitude": 49.79408,
        "Longitude": 10.34393,
        "DistanceUnit": 0
    },
    "Connections": [
        {
            "ID": 283127,
            "ConnectionTypeID": 25,
            "StatusTypeID": 50,
            "LevelID": 2,
            "PowerKW": 22,
            "CurrentTypeID": 20
        },
        {
            "ID": 283128,
            "ConnectionTypeID": 25,
            "StatusTypeID": 50,
            "LevelID": 2,
            "PowerKW": 22,
            "CurrentTypeID": 20
        },
        {
            "ID": 297311,
            "ConnectionTypeID": 25,
            "StatusTypeID": 50,
            "LevelID": 2,
            "PowerKW": 22,
            "CurrentTypeID": 20
        },
        {
            "ID": 297312,
            "ConnectionTypeID": 25,
            "StatusTypeID": 50,
            "LevelID": 2,
            "PowerKW": 22,
            "CurrentTypeID": 20
        }
    ],
    "StatusTypeID": 50,
    "DateLastStatusUpdate": "2021-07-12T02:43:00Z",
    "MetadataValues": [
        {
            "ID": 12560,
            "MetadataFieldID": 4,
            "ItemValue": "Data from the German chargepoint registry provided by Bundesnetzagentur.de under the CC-BY 4.0 license"
        }
    ],
    "DataQualityLevel": 3,
    "DateCreated": "2021-07-08T10:00:00Z",
    "SubmissionStatusTypeID": 100
}