{
    "IsRecentlyVerified": false,
    "ID": 86192,
    "UUID": "C18715B7-985C-4CE8-922F-0A69493C4A87",
    "DataProviderID": 1,
    "OperatorID": 23,
    "OperatorsReference": "29125",
    "UsageTypeID": 6,
    "AddressInfo": {
        "ID": 86538,
        "Title": "Wingate By Wyndham Richmond Short Pump",
        "AddressLine1": "13991 N Gayton RD",
        "Town": "Richmond",
        "StateOrProvince": "Virginia",
        "Postcode": "23233",
        "CountryID": 2,
        "Latitude": 37.660164,
        "Longitude": -77.630903,
        "ContactTelephone1": "(804) 421-1600",
        "DistanceUnit": 0
    },
    "Connections": [
        {
            "ID": 122570,
            "ConnectionTypeID": 30,
            "StatusTypeID": 50,
            "LevelID": 2,
            "PowerKW": 16,
            "CurrentTypeID": 20,
            "Quantity": 2
        }
    ],
    "NumberOfPoints": 2,
    "GeneralComments": "2 Tesla Connectors, up to 16kW.Available for patrons only. Self park.",
    "StatusTypeID": 50,
    "DateLastStatusUpdate": "2017-04-30T05:47:00Z",
    "DataQualityLevel": 1,
    "DateCreated": "2017-04-30T05:47:00Z",
    "SubmissionStatusTypeID": 200
}