{
    "IsRecentlyVerified": false,
    "ID": 113663,
    "UUID": "A0624D4E-B0DA-4975-875C-9F3C3E473749",
    "DataProviderID": 1,
    "OperatorID": 80,
    "UsageTypeID": 4,
    "AddressInfo": {
        "ID": 114009,
        "Title": "Reggio Calabria Pellaro | EnelX",
        "AddressLine1": "Via Nazionale Occhio di Pellaro",
        "Town": "Reggio Calabria ",
        "StateOrProvince": "RC",
        "Postcode": "89134",
        "CountryID": 112,
        "Latitude": 38.0446606026359,
        "Longitude": 15.6556236641624,
        "ContactTelephone1": "800.069.850",
        "RelatedURL": "https://www.enelx.com/it/it/emobility",
        "DistanceUnit": 0
    },
    "Connections": [
        {
            "ID": 160194,
            "ConnectionTypeID": 25,
            "StatusTypeID": 150,
            "LevelID": 2,
            "Amps": 32,
            "Voltage": 400,
            "PowerKW": 22,
            "CurrentTypeID": 20,
            "Quantity": 1
        },
        {
            "ID": 160195,
            "ConnectionTypeID": 36,
            "StatusTypeID": 150,
            "LevelID": 2,
            "Amps": 16,
            "Voltage": 240,
            "PowerKW": 3.7,
            "CurrentTypeID": 10,
            "Quantity": 1
        }
    ],
    "NumberOfPoints": 2,
    "StatusTypeID": 150,
    "DateLastStatusUpdate": "2018-12-29T14:54:00Z",
    "DataQualityLevel": 1,
    "DateCreated": "2018-12-29T14:51:00Z",
    "SubmissionStatusTypeID": 200
}