{
    "IsRecentlyVerified": false,
    "ID": 32084,
    "UUID": "ECCD58BB-9AAC-42B0-8BD3-EB438E3906C8",
    "DataProviderID": 1,
    "OperatorID": 105,
    "OperatorsReference": "Essent EM-DE-07140068-01-00002",
    "UsageTypeID": 4,
    "AddressInfo": {
        "ID": 32430,
        "Title": "Hauptstraße 13a",
        "AddressLine1": "Hauptstraße 13a",
        "Town": "Kisselbach",
        "Postcode": "56291",
        "CountryID": 87,
        "Latitude": 50.050883,
        "Longitude": 7.61065,
        "DistanceUnit": 0
    },
    "Connections": [
        {
            "ID": 35595,
            "ConnectionTypeID": 25,
            "LevelID": 2,
            "PowerKW": 11
        },
        {
            "ID": 46187,
            "ConnectionTypeID": 25,
            "LevelID": 2,
            "PowerKW": 11
        }
    ],
    "NumberOfPoints": 1,
    "StatusTypeID": 50,
    "DateLastStatusUpdate": "2015-04-13T16:23:00Z",
    "DataQualityLevel": 3,
    "DateCreated": "2015-01-09T06:03:00Z",
    "SubmissionStatusTypeID": 200
}