{
    "IsRecentlyVerified": false,
    "ID": 40523,
    "UUID": "FA82E0D4-1785-4728-8F12-8897947E8637",
    "DataProviderID": 2,
    "DataProvidersReference": "47885",
    "UsageTypeID": 2,
    "AddressInfo": {
        "ID": 40869,
        "Title": "PeaceHealth",
        "AddressLine1": "1115 SE 164th Ave",
        "Town": "Vancouver",
        "StateOrProvince": "WA",
        "Postcode": "98684",
        "CountryID": 2,
        "Latitude": 45.63017,
        "Longitude": -122.504,
        "ContactTelephone1": "",
        "AccessComments": "Employee and guest use only; non-employee use after hours",
        "RelatedURL": "",
        "DistanceUnit": 0
    },
    "Connections": [
        {
            "ID": 44099,
            "ConnectionTypeID": 1,
            "LevelID": 2,
            "Amps": 16,
            "Voltage": 230,
            "PowerKW": 3.7,
            "CurrentTypeID": 10,
            "Quantity": 2
        }
    ],
    "DateLastStatusUpdate": "2020-06-26T03:09:00Z",
    "DataQualityLevel": 3,
    "DateCreated": "2015-01-10T01:01:00Z",
    "SubmissionStatusTypeID": 100
}