{
    "IsRecentlyVerified": false,
    "ID": 99609,
    "UUID": "243F49C1-5D49-4959-BC82-9958D14BDA47",
    "DataProviderID": 1,
    "OperatorID": 2244,
    "UsageTypeID": 4,
    "AddressInfo": {
        "ID": 99955,
        "Title": "Ubitricity Peel Street",
        "AddressLine1": "7 Peel Street",
        "Town": "London",
        "StateOrProvince": "England",
        "Postcode": "W8 7PA",
        "CountryID": 1,
        "Latitude": 51.507198,
        "Longitude": -0.195287,
        "RelatedURL": "https://www.rbkc.gov.uk/parking-transport-and-streets/parking/visitor-parking/electric-vehicles",
        "DistanceUnit": 0
    },
    "Connections": [
        {
            "ID": 140752,
            "ConnectionTypeID": 25,
            "StatusTypeID": 50,
            "LevelID": 2,
            "Amps": 16,
            "Voltage": 230,
            "PowerKW": 3.6,
            "CurrentTypeID": 10,
            "Quantity": 1
        }
    ],
    "NumberOfPoints": 1,
    "GeneralComments": "Lamp post charger. Ubitricity dongle needed.",
    "StatusTypeID": 50,
    "DateLastStatusUpdate": "2018-01-31T13:36:00Z",
    "DataQualityLevel": 1,
    "DateCreated": "2018-01-31T13:36:00Z",
    "SubmissionStatusTypeID": 200
}