{
    "IsRecentlyVerified": false,
    "ID": 24674,
    "UUID": "7006AD7A-E1CC-4ECB-8A44-098059B7E66A",
    "DataProviderID": 1,
    "OperatorID": 20,
    "OperatorsReference": "70427",
    "UsageTypeID": 4,
    "UsageCost": "£1.00/charge admin fee",
    "AddressInfo": {
        "ID": 25020,
        "Title": "Canterbury City Council Offices",
        "AddressLine1": "Chaucer Wood Court",
        "AddressLine2": "Military Road",
        "Town": "Canterbury",
        "StateOrProvince": "Kent",
        "Postcode": "CT1 9SN",
        "CountryID": 1,
        "Latitude": 51.2832095200739,
        "Longitude": 1.09313629567623,
        "ContactTelephone1": "01912 650 500",
        "AccessComments": "In Council Car park",
        "RelatedURL": "https://www.canterbury.gov.uk/",
        "DistanceUnit": 0
    },
    "Connections": [
        {
            "ID": 26974,
            "ConnectionTypeID": 25,
            "StatusTypeID": 50,
            "LevelID": 2,
            "Amps": 32,
            "Voltage": 230,
            "PowerKW": 7,
            "CurrentTypeID": 10,
            "Quantity": 2
        }
    ],
    "NumberOfPoints": 4,
    "StatusTypeID": 50,
    "DateLastStatusUpdate": "2018-02-23T06:18:00Z",
    "DataQualityLevel": 1,
    "DateCreated": "2014-10-28T14:37:00Z",
    "SubmissionStatusTypeID": 200
}