{
    "IsRecentlyVerified": false,
    "ID": 85035,
    "UUID": "19368DBA-C618-45B7-BBBC-440E2C4E8FED",
    "DataProviderID": 1,
    "OperatorID": 23,
    "OperatorsReference": "25910",
    "UsageTypeID": 6,
    "AddressInfo": {
        "ID": 85381,
        "Title": "Victor's Residenz-Hotel Saarbrucken",
        "AddressLine1": "19 Deutschmuhlental",
        "Town": "66117",
        "Postcode": "Saarbrucken",
        "CountryID": 87,
        "Latitude": 49.225456,
        "Longitude": 6.961137,
        "ContactTelephone1": "+49 6815 88210",
        "DistanceUnit": 0
    },
    "Connections": [
        {
            "ID": 120786,
            "ConnectionTypeID": 30,
            "StatusTypeID": 50,
            "LevelID": 2,
            "Amps": 32,
            "Voltage": 400,
            "PowerKW": 22,
            "CurrentTypeID": 20,
            "Quantity": 1
        }
    ],
    "NumberOfPoints": 1,
    "GeneralComments": "1 Tesla Connector, up to 22kW.Available for patrons only. Please see front desk.",
    "StatusTypeID": 50,
    "DateLastStatusUpdate": "2018-10-03T19:19:00Z",
    "DataQualityLevel": 1,
    "DateCreated": "2017-03-24T06:29:00Z",
    "SubmissionStatusTypeID": 200
}