{
    "IsRecentlyVerified": false,
    "ID": 71809,
    "UUID": "C9F53B24-FC3D-4666-9094-09D0950147FD",
    "DataProviderID": 1,
    "OperatorID": 3,
    "OperatorsReference": "PG-80528",
    "UsageTypeID": 6,
    "UsageCost": "Free",
    "AddressInfo": {
        "ID": 72155,
        "Title": "Hyundai-Berkeley Vale Motors",
        "AddressLine1": "Thornbury Road",
        "Town": "Thornbury",
        "StateOrProvince": "South Gloucestershire",
        "Postcode": "BS35 2LR",
        "CountryID": 1,
        "Latitude": 51.591227,
        "Longitude": -2.52667,
        "DistanceUnit": 0
    },
    "Connections": [
        {
            "ID": 102852,
            "ConnectionTypeID": 25,
            "StatusTypeID": 50,
            "LevelID": 2,
            "Amps": 32,
            "Voltage": 230,
            "PowerKW": 7,
            "CurrentTypeID": 10,
            "Quantity": 2
        }
    ],
    "NumberOfPoints": 3,
    "StatusTypeID": 50,
    "DateLastStatusUpdate": "2017-12-20T11:53:00Z",
    "DataQualityLevel": 1,
    "DateCreated": "2016-09-12T12:28:00Z",
    "SubmissionStatusTypeID": 200
}