{
    "IsRecentlyVerified": false,
    "ID": 96217,
    "UUID": "9E744135-81F9-411D-8EAB-409E00DA0174",
    "DataProviderID": 1,
    "OperatorID": 2241,
    "UsageTypeID": 4,
    "AddressInfo": {
        "ID": 96563,
        "Title": "Rathaus",
        "AddressLine1": "Am Kirchberg 19",
        "Town": "Östringen",
        "StateOrProvince": "Landkreis Karlsruhe",
        "Postcode": "76684",
        "CountryID": 87,
        "Latitude": 49.21929,
        "Longitude": 8.710339999999974,
        "RelatedURL": "http://www.ewb-bruchsal.de/",
        "DistanceUnit": 0
    },
    "Connections": [
        {
            "ID": 136322,
            "ConnectionTypeID": 25,
            "StatusTypeID": 50,
            "LevelID": 2,
            "Amps": 32,
            "Voltage": 400,
            "PowerKW": 22,
            "CurrentTypeID": 20,
            "Quantity": 2
        },
        {
            "ID": 136323,
            "ConnectionTypeID": 28,
            "StatusTypeID": 50,
            "LevelID": 2,
            "Amps": 16,
            "Voltage": 230,
            "PowerKW": 3.7,
            "CurrentTypeID": 10,
            "Quantity": 2
        }
    ],
    "NumberOfPoints": 2,
    "GeneralComments": "Freischaltbar mit der e-laden Ladekarte oder App. Ein Parkplatz ist für Carsharing reserviert.",
    "StatusTypeID": 50,
    "DateLastStatusUpdate": "2017-12-15T07:39:00Z",
    "DataQualityLevel": 1,
    "DateCreated": "2017-12-15T07:39:00Z",
    "SubmissionStatusTypeID": 200
}