{
    "IsRecentlyVerified": false,
    "ID": 36375,
    "UUID": "CAE23FB5-BB83-427B-986D-EBEC147EE357",
    "DataProviderID": 26,
    "DataProvidersReference": "47726",
    "OperatorID": 178,
    "OperatorsReference": "EVnetNL AL873",
    "UsageCost": "0.00 jaarabonnement",
    "AddressInfo": {
        "ID": 36721,
        "Title": "Kappeyne van de Coppellolaan 47",
        "AddressLine1": "Kappeyne van de Coppellolaan 47",
        "Town": "Amersfoort",
        "Postcode": "3818 KV",
        "CountryID": 159,
        "Latitude": 52.149155,
        "Longitude": 5.35997,
        "ContactTelephone1": "0800-3522365",
        "RelatedURL": "http://www.evnet.nl",
        "DistanceUnit": 0
    },
    "Connections": [
        {
            "ID": 39886,
            "ConnectionTypeID": 25,
            "LevelID": 2,
            "PowerKW": 11,
            "CurrentTypeID": 10
        }
    ],
    "NumberOfPoints": 2,
    "StatusTypeID": 50,
    "DateLastStatusUpdate": "2016-06-04T02:50:00Z",
    "DataQualityLevel": 3,
    "DateCreated": "2015-01-09T06:05:00Z",
    "SubmissionStatusTypeID": 100
}