{
    "MediaItems": [
        {
            "ID": 25586,
            "ChargePointID": 142754,
            "ItemURL": "https://s3-ap-southeast-2.amazonaws.com/openchargemap/images/US/OCM142754/OCM-142754.orig.2020112606524007.jpg",
            "ItemThumbnailURL": "https://s3-ap-southeast-2.amazonaws.com/openchargemap/images/US/OCM142754/OCM-142754.thmb.2020112606524007.jpg",
            "Comment": "",
            "IsEnabled": true,
            "IsVideo": false,
            "IsFeaturedItem": false,
            "IsExternalResource": false,
            "User": {
                "ID": 19108,
                "Username": "Robert Seemueller"
            },
            "DateCreated": "2020-11-26T06:53:00Z"
        }
    ],
    "IsRecentlyVerified": false,
    "ID": 142754,
    "UUID": "DF3F1860-B38E-493D-93CE-4246328AB753",
    "DataProviderID": 1,
    "OperatorID": 3372,
    "UsageTypeID": 1,
    "UsageCost": "$.30kWh",
    "AddressInfo": {
        "ID": 143106,
        "Title": "Modena Travel Plaza Southbound I-87 MP 66",
        "AddressLine1": "Milepost 66S",
        "Town": "Modena",
        "StateOrProvince": "NY",
        "Postcode": "12589",
        "CountryID": 2,
        "Latitude": 41.592227935791,
        "Longitude": -74.0886077880859,
        "ContactTelephone1": "",
        "AccessComments": "24 hours daily",
        "RelatedURL": "",
        "DistanceUnit": 0
    },
    "Connections": [
        {
            "ID": 198963,
            "ConnectionTypeID": 2,
            "LevelID": 3,
            "Amps": 100,
            "Voltage": 400,
            "PowerKW": 40,
            "CurrentTypeID": 30,
            "Quantity": 1
        },
        {
            "ID": 198964,
            "ConnectionTypeID": 32,
            "LevelID": 3,
            "Amps": 100,
            "Voltage": 400,
            "PowerKW": 40,
            "CurrentTypeID": 30,
            "Quantity": 1
        }
    ],
    "StatusTypeID": 50,
    "DateLastStatusUpdate": "2020-11-27T04:00:00Z",
    "DataQualityLevel": 3,
    "DateCreated": "2019-12-24T09:18:00Z",
    "SubmissionStatusTypeID": 100
}