{
    "UserComments": [
        {
            "ID": 24327,
            "ChargePointID": 112601,
            "CommentTypeID": 10,
            "UserName": "ForumElettrico.it",
            "Comment": "Di fronte abbiamo una edicola ed un negozio di alimentari e ad un paio di minuti a piedi andando verso sud c'è un ristorante pizzeria, bar ed un tabacchino. Leggi la recensione completa qui > https://www.forumelettrico.it/forum/post203466.html#p203466",
            "RelatedURL": "https://www.forumelettrico.it/forum/post203466.html#p203466",
            "DateCreated": "2021-05-11T18:01:46.24Z",
            "User": {
                "ID": 11749,
                "Username": "ForumElettrico.it"
            },
            "CheckinStatusTypeID": 10,
            "IsActionedByEditor": false
        },
        {
            "ID": 20535,
            "ChargePointID": 112601,
            "CommentTypeID": 10,
            "UserName": "ForumElettrico.it",
            "RelatedURL": "https://www.forumelettrico.it/forum/colonnina-enel-x-22-kw-via-caduti-di-casteldebole-3-40132-bologna-bo-t4372.html",
            "DateCreated": "2018-12-20T17:31:36.733Z",
            "User": {
                "ID": 11749,
                "Username": "ForumElettrico.it"
            },
            "CheckinStatusTypeID": 10
        }
    ],
    "MediaItems": [
        {
            "ID": 27640,
            "ChargePointID": 112601,
            "ItemURL": "https://s3-ap-southeast-2.amazonaws.com/openchargemap/images/IT/OCM112601/OCM-112601.orig.2021051118022930.jpg",
            "ItemThumbnailURL": "https://s3-ap-southeast-2.amazonaws.com/openchargemap/images/IT/OCM112601/OCM-112601.thmb.2021051118022930.jpg",
            "Comment": "",
            "IsEnabled": true,
            "IsVideo": false,
            "IsFeaturedItem": false,
            "IsExternalResource": false,
            "User": {
                "ID": 11749,
                "Username": "ForumElettrico.it"
            },
            "DateCreated": "2021-05-11T18:03:00Z"
        },
        {
            "ID": 27636,
            "ChargePointID": 112601,
            "ItemURL": "https://s3-ap-southeast-2.amazonaws.com/openchargemap/images/IT/OCM112601/OCM-112601.orig.2021051118015746.jpg",
            "ItemThumbnailURL": "https://s3-ap-southeast-2.amazonaws.com/openchargemap/images/IT/OCM112601/OCM-112601.thmb.2021051118015746.jpg",
            "Comment": "",
            "IsEnabled": true,
            "IsVideo": false,
            "IsFeaturedItem": false,
            "IsExternalResource": false,
            "User": {
                "ID": 11749,
                "Username": "ForumElettrico.it"
            },
            "DateCreated": "2021-05-11T18:02:00Z"
        },
        {
            "ID": 27637,
            "ChargePointID": 112601,
            "ItemURL": "https://s3-ap-southeast-2.amazonaws.com/openchargemap/images/IT/OCM112601/OCM-112601.orig.2021051118020428.jpg",
            "ItemThumbnailURL": "https://s3-ap-southeast-2.amazonaws.com/openchargemap/images/IT/OCM112601/OCM-112601.thmb.2021051118020428.jpg",
            "Comment": "",
            "IsEnabled": true,
            "IsVideo": false,
            "IsFeaturedItem": false,
            "IsExternalResource": false,
            "User": {
                "ID": 11749,
                "Username": "ForumElettrico.it"
            },
            "DateCreated": "2021-05-11T18:02:00Z"
        },
        {
            "ID": 27638,
            "ChargePointID": 112601,
            "ItemURL": "https://s3-ap-southeast-2.amazonaws.com/openchargemap/images/IT/OCM112601/OCM-112601.orig.2021051118021105.jpg",
            "ItemThumbnailURL": "https://s3-ap-southeast-2.amazonaws.com/openchargemap/images/IT/OCM112601/OCM-112601.thmb.2021051118021105.jpg",
            "Comment": "",
            "IsEnabled": true,
            "IsVideo": false,
            "IsFeaturedItem": false,
            "IsExternalResource": false,
            "User": {
                "ID": 11749,
                "Username": "ForumElettrico.it"
            },
            "DateCreated": "2021-05-11T18:02:00Z"
        },
        {
            "ID": 27639,
            "ChargePointID": 112601,
            "ItemURL": "https://s3-ap-southeast-2.amazonaws.com/openchargemap/images/IT/OCM112601/OCM-112601.orig.2021051118021761.jpg",
            "ItemThumbnailURL": "https://s3-ap-southeast-2.amazonaws.com/openchargemap/images/IT/OCM112601/OCM-112601.thmb.2021051118021761.jpg",
            "Comment": "",
            "IsEnabled": true,
            "IsVideo": false,
            "IsFeaturedItem": false,
            "IsExternalResource": false,
            "User": {
                "ID": 11749,
                "Username": "ForumElettrico.it"
            },
            "DateCreated": "2021-05-11T18:02:00Z"
        },
        {
            "ID": 17247,
            "ChargePointID": 112601,
            "ItemURL": "https://s3-ap-southeast-2.amazonaws.com/openchargemap/images/IT/OCM112601/OCM-112601.orig.2018122017314919.jpg",
            "ItemThumbnailURL": "https://s3-ap-southeast-2.amazonaws.com/openchargemap/images/IT/OCM112601/OCM-112601.thmb.2018122017314919.jpg",
            "Comment": "",
            "IsEnabled": true,
            "IsVideo": false,
            "IsFeaturedItem": false,
            "IsExternalResource": false,
            "User": {
                "ID": 11749,
                "Username": "ForumElettrico.it"
            },
            "DateCreated": "2018-12-20T17:32:00Z"
        },
        {
            "ID": 17248,
            "ChargePointID": 112601,
            "ItemURL": "https://s3-ap-southeast-2.amazonaws.com/openchargemap/images/IT/OCM112601/OCM-112601.orig.2018122017315573.jpg",
            "ItemThumbnailURL": "https://s3-ap-southeast-2.amazonaws.com/openchargemap/images/IT/OCM112601/OCM-112601.thmb.2018122017315573.jpg",
            "Comment": "",
            "IsEnabled": true,
            "IsVideo": false,
            "IsFeaturedItem": false,
            "IsExternalResource": false,
            "User": {
                "ID": 11749,
                "Username": "ForumElettrico.it"
            },
            "DateCreated": "2018-12-20T17:32:00Z"
        },
        {
            "ID": 17249,
            "ChargePointID": 112601,
            "ItemURL": "https://s3-ap-southeast-2.amazonaws.com/openchargemap/images/IT/OCM112601/OCM-112601.orig.2018122017320122.jpg",
            "ItemThumbnailURL": "https://s3-ap-southeast-2.amazonaws.com/openchargemap/images/IT/OCM112601/OCM-112601.thmb.2018122017320122.jpg",
            "Comment": "",
            "IsEnabled": true,
            "IsVideo": false,
            "IsFeaturedItem": false,
            "IsExternalResource": false,
            "User": {
                "ID": 11749,
                "Username": "ForumElettrico.it"
            },
            "DateCreated": "2018-12-20T17:32:00Z"
        }
    ],
    "IsRecentlyVerified": false,
    "ID": 112601,
    "UUID": "999A40E1-CD71-4DCC-B9FF-28F544379C72",
    "DataProviderID": 1,
    "OperatorID": 80,
    "UsageTypeID": 4,
    "AddressInfo": {
        "ID": 112947,
        "Title": "Bologna Casteldebole | EnelX",
        "AddressLine1": "Via Caduti di Casteldebole, 3",
        "Town": "Bologna",
        "StateOrProvince": "BO",
        "Postcode": "40132",
        "CountryID": 112,
        "Latitude": 44.50246008393141,
        "Longitude": 11.278769366007737,
        "ContactTelephone1": "800.069.850",
        "RelatedURL": "https://www.enelx.com/it/it/emobility",
        "DistanceUnit": 0
    },
    "Connections": [
        {
            "ID": 158428,
            "ConnectionTypeID": 25,
            "StatusTypeID": 50,
            "LevelID": 2,
            "Amps": 32,
            "Voltage": 400,
            "PowerKW": 22,
            "CurrentTypeID": 20,
            "Quantity": 1
        },
        {
            "ID": 158429,
            "ConnectionTypeID": 36,
            "StatusTypeID": 50,
            "LevelID": 2,
            "Amps": 16,
            "Voltage": 240,
            "PowerKW": 3.7,
            "CurrentTypeID": 10,
            "Quantity": 1
        }
    ],
    "NumberOfPoints": 2,
    "StatusTypeID": 50,
    "DateLastStatusUpdate": "2021-05-11T18:03:00Z",
    "DataQualityLevel": 1,
    "DateCreated": "2018-11-09T13:22:00Z",
    "SubmissionStatusTypeID": 200
}