{
    "IsRecentlyVerified": false,
    "ID": 137174,
    "UUID": "F9D33C23-C0B1-488F-B80A-F53A78CCB116",
    "DataProviderID": 2,
    "DataProvidersReference": "66919",
    "UsageTypeID": 1,
    "AddressInfo": {
        "ID": 137520,
        "Title": "Pacific Guardian Tower",
        "AddressLine1": "1440 Kapiolani Blvd",
        "Town": "Honolulu",
        "StateOrProvince": "HI",
        "Postcode": "96814",
        "CountryID": 2,
        "Latitude": 21.29361,
        "Longitude": -157.84262,
        "ContactTelephone1": "808-532-0200",
        "AccessComments": "7am-6pm daily",
        "RelatedURL": "",
        "DistanceUnit": 0
    },
    "Connections": [
        {
            "ID": 192034,
            "ConnectionTypeID": 1,
            "LevelID": 2,
            "Amps": 16,
            "Voltage": 230,
            "PowerKW": 3,
            "CurrentTypeID": 10,
            "Quantity": 1
        }
    ],
    "StatusTypeID": 50,
    "DateLastStatusUpdate": "2019-12-24T09:04:00Z",
    "DataQualityLevel": 3,
    "DateCreated": "2019-12-24T09:04:00Z",
    "SubmissionStatusTypeID": 100
}