{
    "IsRecentlyVerified": false,
    "ID": 182989,
    "UUID": "FAD6D7EC-9CF3-4202-B7FF-5399BC7F323D",
    "DataProviderID": 29,
    "DataProvidersReference": "16076",
    "AddressInfo": {
        "ID": 183348,
        "Title": "Eichendorffstraße 4",
        "AddressLine1": "Eichendorffstraße 4",
        "Town": "Speyer",
        "Postcode": "67346",
        "CountryID": 87,
        "Latitude": 49.319879,
        "Longitude": 8.42134,
        "DistanceUnit": 0
    },
    "Connections": [
        {
            "ID": 289411,
            "ConnectionTypeID": 25,
            "StatusTypeID": 50,
            "LevelID": 2,
            "PowerKW": 22,
            "CurrentTypeID": 20
        },
        {
            "ID": 289412,
            "ConnectionTypeID": 25,
            "StatusTypeID": 50,
            "LevelID": 2,
            "PowerKW": 22,
            "CurrentTypeID": 20
        }
    ],
    "StatusTypeID": 50,
    "DateLastStatusUpdate": "2021-07-12T02:43:00Z",
    "MetadataValues": [
        {
            "ID": 15282,
            "MetadataFieldID": 4,
            "ItemValue": "Data from the German chargepoint registry provided by Bundesnetzagentur.de under the CC-BY 4.0 license"
        }
    ],
    "DataQualityLevel": 3,
    "DateCreated": "2021-07-08T10:03:00Z",
    "SubmissionStatusTypeID": 100
}