{
    "IsRecentlyVerified": false,
    "ID": 141324,
    "UUID": "345E5579-EE14-4E5A-BFE5-C47846948DAB",
    "DataProviderID": 2,
    "DataProvidersReference": "88119",
    "OperatorID": 5,
    "UsageTypeID": 1,
    "AddressInfo": {
        "ID": 141676,
        "Title": "VAS GARAGE",
        "AddressLine1": "4250 Campbell Ave",
        "Town": "Arlington",
        "StateOrProvince": "VA",
        "Postcode": "22206",
        "CountryID": 2,
        "Latitude": 38.8413827,
        "Longitude": -77.0912085,
        "ContactTelephone1": "888-758-4389",
        "AccessComments": "24 hours daily",
        "RelatedURL": "http://www.chargepoint.com/",
        "DistanceUnit": 0
    },
    "Connections": [
        {
            "ID": 197232,
            "ConnectionTypeID": 1,
            "LevelID": 2,
            "Amps": 16,
            "Voltage": 230,
            "PowerKW": 3.7,
            "CurrentTypeID": 10,
            "Quantity": 2
        }
    ],
    "StatusTypeID": 50,
    "DateLastStatusUpdate": "2020-06-26T03:00:00Z",
    "DataQualityLevel": 3,
    "DateCreated": "2019-12-24T09:15:00Z",
    "SubmissionStatusTypeID": 100
}