{
    "IsRecentlyVerified": false,
    "ID": 66237,
    "UUID": "E403956A-9EC9-4499-AFFE-ED86E1E169FE",
    "DataProviderID": 1,
    "OperatorID": 22,
    "OperatorsReference": "C84ND",
    "UsageTypeID": 4,
    "AddressInfo": {
        "ID": 66583,
        "Title": "Wolfe Tone Square",
        "AddressLine1": "Wolfe Tone Square",
        "Town": "Tobercurry",
        "StateOrProvince": "County Sligo",
        "CountryID": 3,
        "Latitude": 54.054302,
        "Longitude": -8.729412,
        "DistanceUnit": 0
    },
    "Connections": [
        {
            "ID": 91546,
            "ConnectionTypeID": 25,
            "StatusTypeID": 75,
            "LevelID": 2,
            "Amps": 32,
            "Voltage": 400,
            "PowerKW": 22,
            "CurrentTypeID": 20,
            "Quantity": 2
        }
    ],
    "NumberOfPoints": 2,
    "StatusTypeID": 75,
    "DateLastStatusUpdate": "2019-06-26T05:31:00Z",
    "DataQualityLevel": 1,
    "DateCreated": "2016-05-14T17:41:00Z",
    "SubmissionStatusTypeID": 200
}