{
    "IsRecentlyVerified": false,
    "ID": 28085,
    "UUID": "AB7A84B1-AF39-46D6-8BA7-79EF948FA93F",
    "DataProviderID": 2,
    "DataProvidersReference": "51982",
    "UsageTypeID": 7,
    "AddressInfo": {
        "ID": 28431,
        "Title": "The Frederick Motor Co - Ford",
        "AddressLine1": "1 Waverley Dr",
        "Town": "Frederick",
        "StateOrProvince": "MD",
        "Postcode": "21702",
        "CountryID": 2,
        "Latitude": 39.421141,
        "Longitude": -77.46074,
        "ContactTelephone1": "301-663-6111",
        "AccessComments": "24 hours daily; for customer use only",
        "RelatedURL": "",
        "DistanceUnit": 0
    },
    "Connections": [
        {
            "ID": 30865,
            "ConnectionTypeID": 1,
            "LevelID": 2,
            "Amps": 16,
            "Voltage": 230,
            "PowerKW": 3,
            "CurrentTypeID": 10,
            "Quantity": 2
        }
    ],
    "DateLastStatusUpdate": "2019-04-06T04:03:00Z",
    "DataQualityLevel": 3,
    "DateCreated": "2014-11-28T03:38:00Z",
    "SubmissionStatusTypeID": 100
}