{
    "IsRecentlyVerified": true,
    "DateLastVerified": "2021-08-20T20:55:00Z",
    "ID": 188853,
    "UUID": "41A5A180-706A-4984-A0C2-28056C80F3F0",
    "DataProviderID": 1,
    "OperatorID": 2247,
    "UsageTypeID": 4,
    "UsageCost": "0,3€/kWh",
    "AddressInfo": {
        "ID": 189212,
        "Title": "Salardu",
        "AddressLine1": "Carrer de Bodigues ",
        "Town": "Salardu, Naut Aran",
        "StateOrProvince": "Lleida",
        "Postcode": "22598",
        "CountryID": 210,
        "Latitude": 42.70865635348625,
        "Longitude": 0.905667731202584,
        "DistanceUnit": 0
    },
    "Connections": [
        {
            "ID": 305159,
            "ConnectionTypeID": 33,
            "StatusTypeID": 50,
            "LevelID": 3,
            "Amps": 125,
            "Voltage": 499,
            "PowerKW": 50,
            "CurrentTypeID": 30,
            "Quantity": 1
        },
        {
            "ID": 305160,
            "ConnectionTypeID": 2,
            "StatusTypeID": 50,
            "LevelID": 3,
            "Amps": 125,
            "Voltage": 499,
            "PowerKW": 50,
            "CurrentTypeID": 30,
            "Quantity": 1
        },
        {
            "ID": 305161,
            "ConnectionTypeID": 1036,
            "StatusTypeID": 50,
            "LevelID": 3,
            "Amps": 63,
            "Voltage": 400,
            "PowerKW": 43,
            "CurrentTypeID": 20,
            "Quantity": 1
        }
    ],
    "NumberOfPoints": 1,
    "GeneralComments": "App. Recarga Publica Iberdrola",
    "StatusTypeID": 50,
    "DateLastStatusUpdate": "2021-08-21T06:20:00Z",
    "DataQualityLevel": 1,
    "DateCreated": "2021-08-20T20:55:00Z",
    "SubmissionStatusTypeID": 200
}