{
    "IsRecentlyVerified": false,
    "ID": 148040,
    "UUID": "B83E9E07-A9F8-401F-B9D2-5E46FB87973B",
    "DataProviderID": 1,
    "OperatorID": 3298,
    "UsageTypeID": 4,
    "UsageCost": "See EO app",
    "AddressInfo": {
        "ID": 148392,
        "Title": "Leederville Memorial Gardens",
        "AddressLine1": "Cambridge Street",
        "Town": "Perth",
        "StateOrProvince": "Western Australia",
        "Postcode": "6007",
        "CountryID": 18,
        "Latitude": -31.94026371815405,
        "Longitude": 115.83768103158661,
        "DistanceUnit": 0
    },
    "Connections": [
        {
            "ID": 205518,
            "ConnectionTypeID": 25,
            "StatusTypeID": 50,
            "LevelID": 2,
            "Amps": 16,
            "Voltage": 230,
            "PowerKW": 11,
            "CurrentTypeID": 20,
            "Quantity": 2
        }
    ],
    "NumberOfPoints": 2,
    "StatusTypeID": 50,
    "DateLastStatusUpdate": "2021-10-13T05:56:00Z",
    "DataQualityLevel": 1,
    "DateCreated": "2020-01-23T13:13:00Z",
    "SubmissionStatusTypeID": 200
}