{
    "IsRecentlyVerified": false,
    "ID": 100590,
    "UUID": "7EF8E767-209A-4273-96D6-CC880E6715A9",
    "DataProviderID": 1,
    "OperatorID": 23,
    "OperatorsReference": "41112",
    "UsageTypeID": 4,
    "AddressInfo": {
        "ID": 100936,
        "Title": "Corportaivo Cinepolis",
        "AddressLine1": "Av. Cumbre de Las Naciones 1200 Tres Marias",
        "Town": "Morelia",
        "StateOrProvince": "Michoacan",
        "Postcode": "58254",
        "CountryID": 146,
        "Latitude": 19.715354,
        "Longitude": -101.118035,
        "ContactTelephone1": "+52  443 322 6200",
        "DistanceUnit": 0
    },
    "Connections": [
        {
            "ID": 142082,
            "ConnectionTypeID": 30,
            "StatusTypeID": 50,
            "LevelID": 2,
            "PowerKW": 16,
            "CurrentTypeID": 20,
            "Quantity": 2
        }
    ],
    "NumberOfPoints": 2,
    "GeneralComments": "2 Tesla Connectors, up to 16kW.Available for customers. Self park.",
    "StatusTypeID": 50,
    "DateLastStatusUpdate": "2018-03-02T06:53:00Z",
    "DataQualityLevel": 1,
    "DateCreated": "2018-03-02T06:53:00Z",
    "SubmissionStatusTypeID": 200
}