{
    "IsRecentlyVerified": false,
    "ID": 145908,
    "UUID": "13010A9A-9A12-40A9-9F3A-114CB32BA951",
    "DataProviderID": 1,
    "OperatorID": 3,
    "OperatorsReference": "PG-70201,PG-83968",
    "UsageTypeID": 4,
    "UsageCost": "1",
    "AddressInfo": {
        "ID": 146260,
        "Title": "Tesco Superstore-Ingleby Barwick",
        "AddressLine1": "Myton Road",
        "Town": "Ingleby Barwick",
        "StateOrProvince": "Ingleby",
        "Postcode": "TS17 0WA",
        "CountryID": 1,
        "Latitude": 54.517397,
        "Longitude": -1.317074,
        "DistanceUnit": 0
    },
    "Connections": [
        {
            "ID": 202758,
            "ConnectionTypeID": 25,
            "StatusTypeID": 50,
            "LevelID": 2,
            "Amps": 32,
            "Voltage": 230,
            "PowerKW": 7,
            "CurrentTypeID": 10,
            "Quantity": 4
        }
    ],
    "NumberOfPoints": 4,
    "GeneralComments": "This is an open charge unit installed at the Tesco super store at Myton Road, Ingleby Barwick, Ingleby",
    "StatusTypeID": 50,
    "DateLastStatusUpdate": "2020-07-03T05:23:00Z",
    "DataQualityLevel": 1,
    "DateCreated": "2019-12-26T23:57:00Z",
    "SubmissionStatusTypeID": 200
}