{
    "IsRecentlyVerified": false,
    "ID": 16517,
    "UUID": "95079524-E41B-4C6B-9B33-6E450CEB7449",
    "DataProviderID": 1,
    "OperatorID": 45,
    "UsageTypeID": 3,
    "UsageCost": "Call for usage cost dependant on generating status of on site energy systems ",
    "AddressInfo": {
        "ID": 16862,
        "Title": "Scroggie Farm",
        "AddressLine1": "Upper Docharty",
        "AddressLine2": "",
        "Town": "Dingwall",
        "StateOrProvince": "Ross-Shire",
        "Postcode": "IV159UF",
        "CountryID": 1,
        "Latitude": 57.613318,
        "Longitude": -4.453993,
        "ContactTelephone1": "07811348975",
        "ContactTelephone2": "01349862005",
        "ContactEmail": "scroggiefarm@hotmail.co.uk",
        "AccessComments": "Follow access towards Gaia Wind Turbine, charge point located on farm building powered by 100% green Hydro/Wind/Solar Energy",
        "RelatedURL": "http://www.flyingfarmer_jfm.co.uk",
        "DistanceUnit": 0
    },
    "Connections": [
        {
            "ID": 14947,
            "ConnectionTypeID": 25,
            "StatusTypeID": 50,
            "LevelID": 2,
            "Quantity": 1
        },
        {
            "ID": 14952,
            "ConnectionTypeID": 3,
            "StatusTypeID": 0,
            "LevelID": 1,
            "Amps": 13,
            "Quantity": 1
        }
    ],
    "NumberOfPoints": 1,
    "GeneralComments": "POD POINT 3 PHASE CHARGER.(13 AMP also Avail)",
    "StatusTypeID": 50,
    "DateLastStatusUpdate": "2013-05-07T14:08:00Z",
    "DataQualityLevel": 1,
    "DateCreated": "2013-05-07T11:13:00Z",
    "SubmissionStatusTypeID": 200
}