{
    "IsRecentlyVerified": false,
    "ID": 37533,
    "UUID": "7A48A48A-2FB7-44BD-8DBB-BEEC9B84D63F",
    "DataProviderID": 26,
    "DataProvidersReference": "52932",
    "OperatorID": 78,
    "OperatorsReference": "Essent EM-NL-00000363-03-00022",
    "UsageCost": "0.00 jaarabonnement",
    "AddressInfo": {
        "ID": 37879,
        "Title": "Terpstraat 35",
        "AddressLine1": "Terpstraat 35",
        "Town": "Amsterdam",
        "Postcode": "1069 TT",
        "CountryID": 159,
        "Latitude": 52.357127,
        "Longitude": 4.778595,
        "RelatedURL": "http://www.essent.nl",
        "DistanceUnit": 0
    },
    "Connections": [
        {
            "ID": 41044,
            "ConnectionTypeID": 25,
            "LevelID": 2,
            "PowerKW": 11,
            "CurrentTypeID": 10
        },
        {
            "ID": 49053,
            "ConnectionTypeID": 25,
            "LevelID": 2,
            "PowerKW": 11,
            "CurrentTypeID": 10
        }
    ],
    "NumberOfPoints": 1,
    "StatusTypeID": 50,
    "DateLastStatusUpdate": "2016-06-04T02:53:00Z",
    "DataQualityLevel": 3,
    "DateCreated": "2015-01-09T06:07:00Z",
    "SubmissionStatusTypeID": 100
}