{
    "IsRecentlyVerified": false,
    "ID": 55077,
    "UUID": "BD2FA4E7-7100-45AA-97C1-157847260E6D",
    "DataProviderID": 1,
    "OperatorID": 80,
    "UsageTypeID": 4,
    "UsageCost": "0,40 €/kW",
    "AddressInfo": {
        "ID": 55423,
        "Title": "Rimini Ponte di  Tiberio | EnelX",
        "AddressLine1": "Viale Tiberio, 6",
        "Town": "Rimini",
        "StateOrProvince": "RN",
        "Postcode": "47921",
        "CountryID": 112,
        "Latitude": 44.064616089614,
        "Longitude": 12.5626698597896,
        "RelatedURL": "https://www.enelx.com/it/en/electric-mobility",
        "DistanceUnit": 0
    },
    "Connections": [
        {
            "ID": 69620,
            "ConnectionTypeID": 25,
            "StatusTypeID": 50,
            "LevelID": 2,
            "Amps": 32,
            "Voltage": 400,
            "PowerKW": 22,
            "CurrentTypeID": 20,
            "Quantity": 1
        },
        {
            "ID": 69621,
            "ConnectionTypeID": 36,
            "StatusTypeID": 50,
            "LevelID": 2,
            "Amps": 13,
            "Voltage": 240,
            "PowerKW": 3,
            "CurrentTypeID": 10,
            "Quantity": 1
        }
    ],
    "NumberOfPoints": 1,
    "StatusTypeID": 50,
    "DateLastStatusUpdate": "2019-03-28T19:53:00Z",
    "DataQualityLevel": 1,
    "DateCreated": "2015-10-13T16:14:00Z",
    "SubmissionStatusTypeID": 200
}