{
    "UserComments": [
        {
            "ID": 20001,
            "ChargePointID": 96089,
            "CommentTypeID": 10,
            "UserName": "Commandatore",
            "Comment": "",
            "Rating": 5,
            "DateCreated": "2018-08-08T18:37:56.753Z",
            "User": {
                "ID": 15983,
                "Username": "Commandatore"
            },
            "CheckinStatusTypeID": 10
        }
    ],
    "MediaItems": [
        {
            "ID": 15009,
            "ChargePointID": 96089,
            "ItemURL": "https://s3-ap-southeast-2.amazonaws.com/openchargemap/images/CA/OCM96089/OCM-96089.orig.2018012421045516.jpg",
            "ItemThumbnailURL": "https://s3-ap-southeast-2.amazonaws.com/openchargemap/images/CA/OCM96089/OCM-96089.thmb.2018012421045516.jpg",
            "Comment": "",
            "IsEnabled": true,
            "IsVideo": false,
            "IsFeaturedItem": false,
            "IsExternalResource": false,
            "User": {
                "ID": 15983,
                "Username": "Commandatore"
            },
            "DateCreated": "2018-01-24T21:05:00Z"
        },
        {
            "ID": 15008,
            "ChargePointID": 96089,
            "ItemURL": "https://s3-ap-southeast-2.amazonaws.com/openchargemap/images/CA/OCM96089/OCM-96089.orig.2018012420002154.jpg",
            "ItemThumbnailURL": "https://s3-ap-southeast-2.amazonaws.com/openchargemap/images/CA/OCM96089/OCM-96089.thmb.2018012420002154.jpg",
            "Comment": "",
            "IsEnabled": true,
            "IsVideo": false,
            "IsFeaturedItem": false,
            "IsExternalResource": false,
            "User": {
                "ID": 15983,
                "Username": "Commandatore"
            },
            "DateCreated": "2018-01-24T20:01:00Z"
        },
        {
            "ID": 15004,
            "ChargePointID": 96089,
            "ItemURL": "https://s3-ap-southeast-2.amazonaws.com/openchargemap/images/CA/OCM96089/OCM-96089.orig.2018012320502795.jpg",
            "ItemThumbnailURL": "https://s3-ap-southeast-2.amazonaws.com/openchargemap/images/CA/OCM96089/OCM-96089.thmb.2018012320502795.jpg",
            "Comment": "",
            "IsEnabled": true,
            "IsVideo": false,
            "IsFeaturedItem": false,
            "IsExternalResource": false,
            "User": {
                "ID": 15983,
                "Username": "Commandatore"
            },
            "DateCreated": "2018-01-23T20:51:00Z"
        },
        {
            "ID": 15005,
            "ChargePointID": 96089,
            "ItemURL": "https://s3-ap-southeast-2.amazonaws.com/openchargemap/images/CA/OCM96089/OCM-96089.orig.2018012320511409.jpg",
            "ItemThumbnailURL": "https://s3-ap-southeast-2.amazonaws.com/openchargemap/images/CA/OCM96089/OCM-96089.thmb.2018012320511409.jpg",
            "Comment": "",
            "IsEnabled": true,
            "IsVideo": false,
            "IsFeaturedItem": false,
            "IsExternalResource": false,
            "User": {
                "ID": 15983,
                "Username": "Commandatore"
            },
            "DateCreated": "2018-01-23T20:51:00Z"
        },
        {
            "ID": 15003,
            "ChargePointID": 96089,
            "ItemURL": "https://s3-ap-southeast-2.amazonaws.com/openchargemap/images/CA/OCM96089/OCM-96089.orig.2018012320491378.jpg",
            "ItemThumbnailURL": "https://s3-ap-southeast-2.amazonaws.com/openchargemap/images/CA/OCM96089/OCM-96089.thmb.2018012320491378.jpg",
            "Comment": "",
            "IsEnabled": true,
            "IsVideo": false,
            "IsFeaturedItem": false,
            "IsExternalResource": false,
            "User": {
                "ID": 15983,
                "Username": "Commandatore"
            },
            "DateCreated": "2018-01-23T20:49:00Z"
        }
    ],
    "IsRecentlyVerified": false,
    "ID": 96089,
    "UUID": "763DDAF1-82CA-4F2B-8385-ED05D7FD589C",
    "DataProviderID": 1,
    "OperatorID": 23,
    "OperatorsReference": "28617",
    "UsageTypeID": 4,
    "UsageCost": "$0.44/min >=60kW; $0.22/min <60kW; other tariffs for older cars",
    "AddressInfo": {
        "ID": 96435,
        "Title": "Tesla Supercharger ",
        "AddressLine1": "1899 Brock Road",
        "Town": "Pickering ",
        "StateOrProvince": "Ontario ",
        "Postcode": "L1V 4H7",
        "CountryID": 44,
        "Latitude": 43.8461111963998,
        "Longitude": -79.0728628635406,
        "DistanceUnit": 0
    },
    "Connections": [
        {
            "ID": 136140,
            "ConnectionTypeID": 27,
            "StatusTypeID": 50,
            "LevelID": 3,
            "Amps": 300,
            "Voltage": 400,
            "PowerKW": 120,
            "CurrentTypeID": 30,
            "Quantity": 20
        }
    ],
    "NumberOfPoints": 20,
    "StatusTypeID": 50,
    "DateLastStatusUpdate": "2021-01-04T13:42:00Z",
    "DataQualityLevel": 1,
    "DateCreated": "2017-12-08T14:44:00Z",
    "SubmissionStatusTypeID": 200
}