{
    "IsRecentlyVerified": false,
    "ID": 145077,
    "UUID": "02CB8BF6-036F-4BB0-A4CC-6BE6CD33DFF2",
    "DataProviderID": 2,
    "DataProvidersReference": "149534",
    "OperatorID": 90,
    "UsageTypeID": 1,
    "AddressInfo": {
        "ID": 145429,
        "Title": "Municipalité de Notre-Dame-du-Mont-Carmel - Salle paroissiale",
        "AddressLine1": "3991 rue Monseigneur-Béliveau",
        "Town": "Notre-Dame-du-Mont-Carmel",
        "StateOrProvince": "QC",
        "Postcode": "G0X 3J0",
        "CountryID": 44,
        "Latitude": 46.489468,
        "Longitude": -72.656638,
        "ContactTelephone1": "877-505-2674",
        "AccessComments": "24 hours daily",
        "RelatedURL": "https://lecircuitelectrique.com/",
        "DistanceUnit": 0
    },
    "Connections": [
        {
            "ID": 201672,
            "ConnectionTypeID": 1,
            "LevelID": 2,
            "Amps": 16,
            "Voltage": 230,
            "PowerKW": 3.7,
            "CurrentTypeID": 10,
            "Quantity": 1
        }
    ],
    "StatusTypeID": 50,
    "DateLastStatusUpdate": "2020-06-26T03:10:00Z",
    "DataQualityLevel": 3,
    "DateCreated": "2019-12-24T09:24:00Z",
    "SubmissionStatusTypeID": 100
}