{
    "IsRecentlyVerified": false,
    "ID": 133061,
    "UUID": "095F367D-1695-4C07-826E-80F87F2B9B8D",
    "DataProviderID": 1,
    "OperatorID": 23,
    "OperatorsReference": "43485",
    "UsageTypeID": 4,
    "UsageCost": "AUD 0.42/kWh;other tariffs for older cars",
    "AddressInfo": {
        "ID": 133407,
        "Title": "Bendigo",
        "AddressLine1": "Bendigo",
        "Postcode": "3550",
        "CountryID": 18,
        "Latitude": -36.774539,
        "Longitude": 144.306478,
        "DistanceUnit": 0
    },
    "Connections": [
        {
            "ID": 186342,
            "ConnectionTypeID": 27,
            "StatusTypeID": 50,
            "LevelID": 3,
            "PowerKW": 120,
            "CurrentTypeID": 30,
            "Quantity": 6
        }
    ],
    "NumberOfPoints": 6,
    "GeneralComments": "Charging6 Superchargers, available 24/7, up to 120kW",
    "StatusTypeID": 50,
    "DateLastStatusUpdate": "2019-10-12T05:49:00Z",
    "DataQualityLevel": 1,
    "DateCreated": "2019-10-12T05:49:00Z",
    "SubmissionStatusTypeID": 200
}