{
    "IsRecentlyVerified": false,
    "ID": 17176,
    "UUID": "0E3170A2-93AE-462D-B832-18871E4D535A",
    "DataProviderID": 22,
    "DataProvidersReference": "B91D12ADF38B1A2C446579B64E7C5A7C",
    "AddressInfo": {
        "ID": 17521,
        "Title": "日産プリンス神奈川販売寒川店",
        "AddressLine1": "神奈川県高座郡寒川町岡田6-6-2",
        "CountryID": 114,
        "Latitude": 35.3720923,
        "Longitude": 139.3928164,
        "ContactTelephone1": "0467-74-1123",
        "DistanceUnit": 0
    },
    "Connections": [
        {
            "ID": 17417,
            "ConnectionTypeID": 2,
            "LevelID": 2,
            "Amps": 100,
            "Voltage": 480,
            "PowerKW": 48,
            "Quantity": 1
        }
    ],
    "DateLastStatusUpdate": "2013-06-29T08:54:00Z",
    "DataQualityLevel": 2,
    "DateCreated": "2013-06-29T08:54:00Z",
    "SubmissionStatusTypeID": 200
}