{
    "UserComments": [
        {
            "ID": 24500,
            "ChargePointID": 105216,
            "CommentTypeID": 10,
            "UserName": "ForumElettrico.it",
            "Comment": "Tutto regolare sulla presa di sinistra: ho infilato il cavo e la ricarica è partita ad 11 kW segnalati dall'auto, e per interrompere mi sono avvicinato all'auto ed ho estratto il cavo prima lato auto e si è sbloccato subito anche lato colonnina. Leggi la recensione completa qui >  https://www.forumelettrico.it/forum/post214000.html#p214000",
            "RelatedURL": "https://www.forumelettrico.it/forum/post214000.html#p214000",
            "DateCreated": "2021-06-17T09:32:38.717Z",
            "User": {
                "ID": 11749,
                "Username": "ForumElettrico.it"
            },
            "CheckinStatusTypeID": 10,
            "IsActionedByEditor": false
        },
        {
            "ID": 20099,
            "ChargePointID": 105216,
            "CommentTypeID": 10,
            "UserName": "ForumElettrico.it",
            "RelatedURL": "https://www.forumelettrico.it/forum/colonnina-22kw-4-madonne-caseificio-dell-emilia-lesignana-mo-str-lesignana-130-t2918.html",
            "DateCreated": "2018-09-01T07:25:06.097Z",
            "User": {
                "ID": 11749,
                "Username": "ForumElettrico.it"
            },
            "CheckinStatusTypeID": 10
        }
    ],
    "MediaItems": [
        {
            "ID": 28180,
            "ChargePointID": 105216,
            "ItemURL": "https://s3-ap-southeast-2.amazonaws.com/openchargemap/images/IT/OCM105216/OCM-105216.orig.2021061709324769.jpg",
            "ItemThumbnailURL": "https://s3-ap-southeast-2.amazonaws.com/openchargemap/images/IT/OCM105216/OCM-105216.thmb.2021061709324769.jpg",
            "Comment": "",
            "IsEnabled": true,
            "IsVideo": false,
            "IsFeaturedItem": false,
            "IsExternalResource": false,
            "User": {
                "ID": 11749,
                "Username": "ForumElettrico.it"
            },
            "DateCreated": "2021-06-17T09:33:00Z"
        },
        {
            "ID": 16446,
            "ChargePointID": 105216,
            "ItemURL": "https://s3-ap-southeast-2.amazonaws.com/openchargemap/images/IT/OCM105216/OCM-105216.orig.2018090107252304.jpg",
            "ItemThumbnailURL": "https://s3-ap-southeast-2.amazonaws.com/openchargemap/images/IT/OCM105216/OCM-105216.thmb.2018090107252304.jpg",
            "Comment": "",
            "IsEnabled": true,
            "IsVideo": false,
            "IsFeaturedItem": false,
            "IsExternalResource": false,
            "User": {
                "ID": 11749,
                "Username": "ForumElettrico.it"
            },
            "DateCreated": "2018-09-01T07:26:00Z"
        },
        {
            "ID": 16447,
            "ChargePointID": 105216,
            "ItemURL": "https://s3-ap-southeast-2.amazonaws.com/openchargemap/images/IT/OCM105216/OCM-105216.orig.2018090107252914.jpg",
            "ItemThumbnailURL": "https://s3-ap-southeast-2.amazonaws.com/openchargemap/images/IT/OCM105216/OCM-105216.thmb.2018090107252914.jpg",
            "Comment": "",
            "IsEnabled": true,
            "IsVideo": false,
            "IsFeaturedItem": false,
            "IsExternalResource": false,
            "User": {
                "ID": 11749,
                "Username": "ForumElettrico.it"
            },
            "DateCreated": "2018-09-01T07:26:00Z"
        },
        {
            "ID": 16448,
            "ChargePointID": 105216,
            "ItemURL": "https://s3-ap-southeast-2.amazonaws.com/openchargemap/images/IT/OCM105216/OCM-105216.orig.2018090107253453.jpg",
            "ItemThumbnailURL": "https://s3-ap-southeast-2.amazonaws.com/openchargemap/images/IT/OCM105216/OCM-105216.thmb.2018090107253453.jpg",
            "Comment": "",
            "IsEnabled": true,
            "IsVideo": false,
            "IsFeaturedItem": false,
            "IsExternalResource": false,
            "User": {
                "ID": 11749,
                "Username": "ForumElettrico.it"
            },
            "DateCreated": "2018-09-01T07:26:00Z"
        },
        {
            "ID": 16449,
            "ChargePointID": 105216,
            "ItemURL": "https://s3-ap-southeast-2.amazonaws.com/openchargemap/images/IT/OCM105216/OCM-105216.orig.2018090107254055.jpg",
            "ItemThumbnailURL": "https://s3-ap-southeast-2.amazonaws.com/openchargemap/images/IT/OCM105216/OCM-105216.thmb.2018090107254055.jpg",
            "Comment": "",
            "IsEnabled": true,
            "IsVideo": false,
            "IsFeaturedItem": false,
            "IsExternalResource": false,
            "User": {
                "ID": 11749,
                "Username": "ForumElettrico.it"
            },
            "DateCreated": "2018-09-01T07:26:00Z"
        }
    ],
    "IsRecentlyVerified": false,
    "ID": 105216,
    "UUID": "352224D8-EC09-4AB0-A8BF-48A24C407793",
    "DataProviderID": 1,
    "OperatorID": 1,
    "UsageTypeID": 0,
    "UsageCost": "Free",
    "AddressInfo": {
        "ID": 105562,
        "Title": "4 Madonne Caseificio dell'Emilia",
        "AddressLine1": "Str. Lesignana 130",
        "Town": "Lesignana MO",
        "CountryID": 112,
        "Latitude": 44.683219,
        "Longitude": 10.881681,
        "RelatedURL": "https://www.forumelettrico.it/forum/colonnina-22kw-4-madonne-caseificio-dell-emilia-lesignana-mo-str-lesignana-130-t2918.html",
        "DistanceUnit": 0
    },
    "Connections": [
        {
            "ID": 148357,
            "ConnectionTypeID": 25,
            "StatusTypeID": 75,
            "LevelID": 2,
            "Amps": 32,
            "Voltage": 400,
            "PowerKW": 22,
            "CurrentTypeID": 20,
            "Quantity": 2
        }
    ],
    "NumberOfPoints": 2,
    "StatusTypeID": 50,
    "DateLastStatusUpdate": "2021-06-17T09:33:00Z",
    "DataQualityLevel": 1,
    "DateCreated": "2018-06-02T15:30:00Z",
    "SubmissionStatusTypeID": 200
}