{
    "IsRecentlyVerified": false,
    "ID": 94408,
    "UUID": "902CC001-8E8C-490C-A6E6-FD534E9AB07E",
    "DataProviderID": 2,
    "DataProvidersReference": "86857",
    "OperatorID": 5,
    "UsageTypeID": 1,
    "AddressInfo": {
        "ID": 94754,
        "Title": "PALMER TOWN HAL",
        "AddressLine1": "4417 Main St",
        "Town": "Palmer",
        "StateOrProvince": "MA",
        "Postcode": "01069",
        "CountryID": 2,
        "Latitude": 42.1860242,
        "Longitude": -72.3470661,
        "ContactTelephone1": "888-758-4389",
        "AccessComments": "24 hours daily",
        "RelatedURL": "http://www.chargepoint.com/",
        "DistanceUnit": 0
    },
    "Connections": [
        {
            "ID": 133515,
            "ConnectionTypeID": 1,
            "LevelID": 2,
            "Amps": 16,
            "Voltage": 230,
            "PowerKW": 3,
            "CurrentTypeID": 10,
            "Quantity": 2
        }
    ],
    "DateLastStatusUpdate": "2019-12-24T09:19:00Z",
    "DataQualityLevel": 3,
    "DateCreated": "2017-10-19T02:06:00Z",
    "SubmissionStatusTypeID": 100
}