{
    "IsRecentlyVerified": false,
    "ID": 175518,
    "UUID": "88F8FB8E-07C3-46A4-9DAB-1105B362883E",
    "DataProviderID": 1,
    "OperatorID": 3315,
    "UsageTypeID": 4,
    "UsageCost": "Free",
    "AddressInfo": {
        "ID": 175877,
        "Title": "Strathaven Park",
        "AddressLine1": "Threestanes Road",
        "Town": "Strathaven",
        "StateOrProvince": "Scotland",
        "Postcode": "ML10 6EB",
        "CountryID": 1,
        "Latitude": 55.68187,
        "Longitude": -4.07254,
        "DistanceUnit": 0
    },
    "Connections": [
        {
            "ID": 272406,
            "ConnectionTypeID": 33,
            "Reference": "54102",
            "StatusTypeID": 50,
            "LevelID": 3,
            "PowerKW": 50,
            "CurrentTypeID": 30,
            "Quantity": 1
        },
        {
            "ID": 272407,
            "ConnectionTypeID": 2,
            "Reference": "54102",
            "StatusTypeID": 50,
            "LevelID": 3,
            "PowerKW": 50,
            "CurrentTypeID": 30,
            "Quantity": 1
        },
        {
            "ID": 272408,
            "ConnectionTypeID": 1036,
            "Reference": "54102",
            "StatusTypeID": 50,
            "LevelID": 3,
            "PowerKW": 43,
            "CurrentTypeID": 20,
            "Quantity": 1
        },
        {
            "ID": 272409,
            "ConnectionTypeID": 33,
            "Reference": "53475",
            "StatusTypeID": 50,
            "LevelID": 3,
            "PowerKW": 50,
            "CurrentTypeID": 30,
            "Quantity": 1
        },
        {
            "ID": 272410,
            "ConnectionTypeID": 2,
            "Reference": "53475",
            "StatusTypeID": 50,
            "LevelID": 3,
            "PowerKW": 50,
            "CurrentTypeID": 30,
            "Quantity": 1
        },
        {
            "ID": 272411,
            "ConnectionTypeID": 1036,
            "Reference": "53475",
            "StatusTypeID": 50,
            "LevelID": 3,
            "Amps": 63,
            "Voltage": 400,
            "PowerKW": 43,
            "CurrentTypeID": 20,
            "Quantity": 1
        },
        {
            "ID": 272412,
            "ConnectionTypeID": 33,
            "Reference": "53474",
            "StatusTypeID": 50,
            "LevelID": 2,
            "PowerKW": 50,
            "Quantity": 1
        },
        {
            "ID": 272413,
            "ConnectionTypeID": 2,
            "Reference": "53474",
            "StatusTypeID": 50,
            "LevelID": 3,
            "PowerKW": 50,
            "CurrentTypeID": 30,
            "Quantity": 1
        },
        {
            "ID": 272414,
            "ConnectionTypeID": 1036,
            "Reference": "53474",
            "StatusTypeID": 50,
            "LevelID": 3,
            "Amps": 63,
            "Voltage": 400,
            "PowerKW": 43,
            "CurrentTypeID": 20,
            "Quantity": 1
        },
        {
            "ID": 272415,
            "ConnectionTypeID": 25,
            "Reference": "53476",
            "StatusTypeID": 50,
            "LevelID": 2,
            "Amps": 32,
            "Voltage": 230,
            "PowerKW": 7,
            "CurrentTypeID": 10,
            "Quantity": 2
        },
        {
            "ID": 272416,
            "ConnectionTypeID": 25,
            "Reference": "53477",
            "StatusTypeID": 50,
            "LevelID": 2,
            "Amps": 32,
            "Voltage": 400,
            "PowerKW": 22,
            "CurrentTypeID": 20,
            "Quantity": 2
        }
    ],
    "NumberOfPoints": 5,
    "StatusTypeID": 50,
    "DateLastStatusUpdate": "2021-05-24T14:19:00Z",
    "DataQualityLevel": 1,
    "DateCreated": "2021-05-24T14:19:00Z",
    "SubmissionStatusTypeID": 200
}