{
    "IsRecentlyVerified": false,
    "ID": 175244,
    "UUID": "347FB958-8DC9-4E33-934C-3C78B9044D9B",
    "DataProviderID": 1,
    "OperatorID": 3,
    "UsageTypeID": 4,
    "UsageCost": "£0.25/kWh",
    "AddressInfo": {
        "ID": 175603,
        "Title": "Lidl Hardingswood",
        "AddressLine1": "Hardingswood Road",
        "Town": "Kidsgrove",
        "StateOrProvince": "England",
        "Postcode": "ST7 1EF",
        "CountryID": 1,
        "Latitude": 53.08906200397328,
        "Longitude": -2.2466433886395407,
        "RelatedURL": "https://charge.pod-point.com/",
        "DistanceUnit": 0
    },
    "Connections": [
        {
            "ID": 271751,
            "ConnectionTypeID": 33,
            "StatusTypeID": 50,
            "LevelID": 3,
            "PowerKW": 50,
            "CurrentTypeID": 30,
            "Quantity": 1
        },
        {
            "ID": 271752,
            "ConnectionTypeID": 2,
            "StatusTypeID": 50,
            "LevelID": 3,
            "PowerKW": 50,
            "CurrentTypeID": 30,
            "Quantity": 1
        },
        {
            "ID": 271753,
            "ConnectionTypeID": 25,
            "StatusTypeID": 50,
            "LevelID": 2,
            "Amps": 32,
            "Voltage": 400,
            "PowerKW": 22,
            "CurrentTypeID": 20,
            "Quantity": 1
        }
    ],
    "NumberOfPoints": 1,
    "GeneralComments": "£0.25 per kWh, use Pod Point app or webpage charge.pod-point.com to confirm charge",
    "StatusTypeID": 50,
    "DateLastStatusUpdate": "2021-05-02T21:54:00Z",
    "DataQualityLevel": 1,
    "DateCreated": "2021-05-02T19:23:00Z",
    "SubmissionStatusTypeID": 200
}