{
    "IsRecentlyVerified": false,
    "ID": 152218,
    "UUID": "6905F353-04C7-42D3-83B1-2E55244898B7",
    "DataProviderID": 28,
    "DataProvidersReference": "FR*S85*P85226*001",
    "UsageTypeID": 5,
    "AddressInfo": {
        "ID": 152571,
        "Title": "SAINT HILAIRE DE RIEZ - Avenue De L'Isle De Riez",
        "AddressLine1": "Avenue De L'Isle De Riez   85270 SAINT HILAIRE DE RIEZ",
        "CountryID": 80,
        "Latitude": 46.711208,
        "Longitude": -1.96324,
        "AccessComments": "24h/24 7j/7",
        "DistanceUnit": 0
    },
    "Connections": [
        {
            "ID": 213006,
            "ConnectionTypeID": 28,
            "StatusTypeID": 50,
            "LevelID": 2,
            "PowerKW": 18,
            "CurrentTypeID": 10
        },
        {
            "ID": 213007,
            "ConnectionTypeID": 26,
            "StatusTypeID": 50,
            "LevelID": 2,
            "PowerKW": 18
        },
        {
            "ID": 245867,
            "ConnectionTypeID": 28,
            "StatusTypeID": 50,
            "LevelID": 2,
            "PowerKW": 18,
            "CurrentTypeID": 10
        },
        {
            "ID": 245868,
            "ConnectionTypeID": 26,
            "StatusTypeID": 50,
            "LevelID": 2,
            "PowerKW": 18
        }
    ],
    "GeneralComments": "Recharge par badge et avec une application smartphone",
    "StatusTypeID": 50,
    "DateLastStatusUpdate": "2020-08-27T05:12:00Z",
    "DataQualityLevel": 2,
    "DateCreated": "2020-03-15T10:53:00Z",
    "SubmissionStatusTypeID": 100
}