{
    "IsRecentlyVerified": false,
    "ID": 170916,
    "UUID": "E5F99AD8-E038-42A5-8001-B417404C1CA1",
    "DataProviderID": 1,
    "OperatorID": 164,
    "UsageTypeID": 4,
    "AddressInfo": {
        "ID": 171275,
        "Title": "Cooperativa Produttori Agricoli Giudicariesi Co.P.A.G. Soc. Coop. Agricola | NEOGY",
        "AddressLine1": "Strada Statale 421 dei Laghi di Molveno e Tenno",
        "AddressLine2": "Via Giovanni Prati, 1",
        "Town": "Dasindo ",
        "StateOrProvince": "TN",
        "Postcode": "38077",
        "CountryID": 112,
        "Latitude": 46.011338151319336,
        "Longitude": 10.862682730343522,
        "DistanceUnit": 0
    },
    "Connections": [
        {
            "ID": 261131,
            "ConnectionTypeID": 25,
            "StatusTypeID": 50,
            "LevelID": 2,
            "Amps": 32,
            "Voltage": 400,
            "PowerKW": 22,
            "CurrentTypeID": 20,
            "Quantity": 2
        }
    ],
    "NumberOfPoints": 2,
    "StatusTypeID": 50,
    "DateLastStatusUpdate": "2020-12-11T14:10:00Z",
    "DataQualityLevel": 1,
    "DateCreated": "2020-12-11T14:10:00Z",
    "SubmissionStatusTypeID": 200
}