{
    "IsRecentlyVerified": false,
    "ID": 136223,
    "UUID": "1E98282C-3EEB-4D63-845C-544DA1217064",
    "DataProviderID": 18,
    "DataProvidersReference": "984852334d07789b395be2f7122d7019",
    "OperatorID": 2244,
    "UsageTypeID": 5,
    "AddressInfo": {
        "ID": 136569,
        "Title": "Clitherow Avenue",
        "AddressLine1": "Clitherow Avenue",
        "Town": "London",
        "Postcode": "W7 2BG",
        "CountryID": 1,
        "Latitude": 51.502218,
        "Longitude": -0.329539,
        "AccessComments": "",
        "RelatedURL": "https://www.ubitricity.com",
        "DistanceUnit": 0
    },
    "Connections": [
        {
            "ID": 190659,
            "ConnectionTypeID": 25,
            "Reference": "suby1100001885",
            "StatusTypeID": 50,
            "LevelID": 2,
            "Amps": 16,
            "Voltage": 230,
            "PowerKW": 3.7,
            "CurrentTypeID": 10
        }
    ],
    "StatusTypeID": 0,
    "DateLastStatusUpdate": "2021-04-25T05:46:00Z",
    "MetadataValues": [
        {
            "ID": 6075,
            "MetadataFieldID": 4,
            "ItemValue": "Contains public sector information licensed under the Open Government Licence v2.0. http://www.nationalarchives.gov.uk/doc/open-government-licence/version/2/"
        }
    ],
    "DataQualityLevel": 3,
    "DateCreated": "2019-12-24T05:22:00Z",
    "SubmissionStatusTypeID": 100
}