{
    "IsRecentlyVerified": false,
    "ID": 188558,
    "UUID": "A2BDDAF7-95B2-427C-8A61-63D28091D4D2",
    "DataProviderID": 1,
    "OperatorID": 89,
    "UsageTypeID": 4,
    "UsageCost": "1$ per hour",
    "AddressInfo": {
        "ID": 188917,
        "Title": "Stationnement Pierre-Olivier-Chauveau",
        "AddressLine1": "10 Rue Pierre-Olivier-Chauveau",
        "Town": "Québec",
        "StateOrProvince": "Québec (Agglomération)",
        "Postcode": "G1R 5Z1",
        "CountryID": 44,
        "Latitude": 46.813942689267265,
        "Longitude": -71.20882741186733,
        "DistanceUnit": 0
    },
    "Connections": [
        {
            "ID": 304563,
            "ConnectionTypeID": 1,
            "StatusTypeID": 50,
            "LevelID": 2,
            "Voltage": 240,
            "PowerKW": 7.2,
            "Quantity": 2
        }
    ],
    "NumberOfPoints": 2,
    "StatusTypeID": 50,
    "DateLastStatusUpdate": "2021-08-03T12:56:00Z",
    "DataQualityLevel": 1,
    "DateCreated": "2021-08-02T09:42:00Z",
    "SubmissionStatusTypeID": 200
}