{
    "IsRecentlyVerified": false,
    "ID": 96328,
    "UUID": "6852D838-3E30-4E94-9BAD-4E4E8A328EDE",
    "DataProviderID": 1,
    "OperatorID": 45,
    "UsageTypeID": 1,
    "AddressInfo": {
        "ID": 96674,
        "Title": "Deutsche Bahn",
        "AddressLine1": "Stephensonstraße 1",
        "Town": "Frankfurt am Main",
        "StateOrProvince": "Frankfurt am Main",
        "Postcode": "60326",
        "CountryID": 87,
        "Latitude": 50.1068429,
        "Longitude": 8.640197199999989,
        "AccessComments": "24/7 nutzbar mit 2 Parkplätze mit dem Schild: Nur für Elektroautos. 3h freies Parken + Laden. Lässt sich einfach mit beliebiger RFID-Karte freischalten.\r\n",
        "DistanceUnit": 0
    },
    "Connections": [
        {
            "ID": 136480,
            "ConnectionTypeID": 25,
            "StatusTypeID": 50,
            "LevelID": 2,
            "Amps": 32,
            "Voltage": 400,
            "PowerKW": 22,
            "CurrentTypeID": 20,
            "Quantity": 2
        }
    ],
    "NumberOfPoints": 2,
    "StatusTypeID": 50,
    "DateLastStatusUpdate": "2017-12-21T08:12:00Z",
    "DataQualityLevel": 1,
    "DateCreated": "2017-12-21T08:12:00Z",
    "SubmissionStatusTypeID": 200
}