{
    "IsRecentlyVerified": false,
    "ID": 51736,
    "UUID": "89D1325D-6069-4D06-987D-BC139D3D1063",
    "DataProviderID": 1,
    "OperatorID": 23,
    "OperatorsReference": "8304",
    "UsageTypeID": 1,
    "UsageCost": "Free",
    "AddressInfo": {
        "ID": 52082,
        "Title": "New Era Automotive - Tesla",
        "AddressLine1": "1240 Brazosport Blvd N",
        "Town": "Richwood",
        "StateOrProvince": "TX",
        "Postcode": "77531",
        "CountryID": 2,
        "Latitude": 29.0439128,
        "Longitude": -95.4013458,
        "ContactTelephone1": "979-265-0434  877-798-3752",
        "AccessComments": "24 hours daily; for Tesla use only",
        "RelatedURL": "http://www.teslamotors.com/supercharger",
        "DistanceUnit": 0
    },
    "Connections": [
        {
            "ID": 64211,
            "ConnectionTypeID": 30,
            "StatusTypeID": 50,
            "LevelID": 2,
            "Amps": 16,
            "Voltage": 230,
            "PowerKW": 16,
            "CurrentTypeID": 10,
            "Quantity": 1
        }
    ],
    "NumberOfPoints": 1,
    "StatusTypeID": 50,
    "DateLastStatusUpdate": "2017-01-26T20:31:00Z",
    "DataQualityLevel": 3,
    "DateCreated": "2015-08-13T03:43:00Z",
    "SubmissionStatusTypeID": 100
}