{
    "IsRecentlyVerified": false,
    "ID": 97075,
    "UUID": "60CC67BD-2F27-4350-99B9-1F8BDACD4B5E",
    "DataProviderID": 1,
    "DataProvidersReference": "4616",
    "AddressInfo": {
        "ID": 97421,
        "Title": "Umeå Energi Storuman",
        "AddressLine1": "Blå Vägen 264",
        "Town": "STORUMAN",
        "StateOrProvince": "VÄSTERBOTTEN",
        "Postcode": "92332",
        "CountryID": 216,
        "Latitude": 65.10472,
        "Longitude": 17.12272,
        "AccessComments": "Vid OKQ8.",
        "DistanceUnit": 0
    },
    "Connections": [
        {
            "ID": 137785,
            "ConnectionTypeID": 0,
            "Reference": "1",
            "LevelID": 2,
            "Amps": 100,
            "Voltage": 500,
            "PowerKW": 50,
            "Comments": "Mode 4"
        },
        {
            "ID": 137786,
            "ConnectionTypeID": 0,
            "Reference": "2",
            "LevelID": 2,
            "Amps": 100,
            "Voltage": 500,
            "PowerKW": 50,
            "Comments": "Mode 4"
        },
        {
            "ID": 137787,
            "ConnectionTypeID": 0,
            "Reference": "3",
            "LevelID": 2,
            "Amps": 32,
            "Voltage": 400,
            "PowerKW": 22,
            "Comments": "Mode 3"
        },
        {
            "ID": 137788,
            "ConnectionTypeID": 0,
            "Reference": "4",
            "LevelID": 2,
            "Amps": 32,
            "Voltage": 400,
            "PowerKW": 22,
            "Comments": "Mode 3"
        }
    ],
    "NumberOfPoints": 4,
    "DateLastStatusUpdate": "2020-05-26T08:25:00Z",
    "DataQualityLevel": 2,
    "DateCreated": "2018-01-04T08:28:00Z",
    "SubmissionStatusTypeID": 100
}