{
    "IsRecentlyVerified": false,
    "ID": 116308,
    "UUID": "5AFA6BC6-F0A5-418D-9E74-56CBB700141A",
    "DataProviderID": 1,
    "DataProvidersReference": "5002",
    "AddressInfo": {
        "ID": 116654,
        "Title": "Langes väg 4",
        "AddressLine1": "Langes väg 4",
        "Town": "ULRICEHAMN",
        "StateOrProvince": "VÄSTRA GÖTALAND",
        "Postcode": "52301",
        "CountryID": 216,
        "Latitude": 57.666311,
        "Longitude": 13.429385,
        "AccessComments": "Besöksparkering",
        "DistanceUnit": 0
    },
    "Connections": [
        {
            "ID": 163648,
            "ConnectionTypeID": 0,
            "Reference": "1",
            "LevelID": 2,
            "Amps": 16,
            "Voltage": 230,
            "PowerKW": 3.7,
            "Comments": "Mode 3"
        },
        {
            "ID": 163649,
            "ConnectionTypeID": 0,
            "Reference": "2",
            "LevelID": 2,
            "Amps": 16,
            "Voltage": 230,
            "PowerKW": 3.7,
            "Comments": "Mode 3"
        }
    ],
    "NumberOfPoints": 2,
    "DateLastStatusUpdate": "2020-05-26T08:21:00Z",
    "DataQualityLevel": 2,
    "DateCreated": "2019-02-11T09:16:00Z",
    "SubmissionStatusTypeID": 100
}