{
    "IsRecentlyVerified": false,
    "ID": 68007,
    "UUID": "20916CAA-879D-4BE0-88FA-9EA46F5E886E",
    "DataProviderID": 26,
    "DataProvidersReference": "91789",
    "OperatorID": 73,
    "OperatorsReference": "EV-Box EVB-P1417160",
    "UsageCost": "0.00 jaarabonnement",
    "AddressInfo": {
        "ID": 68353,
        "Title": "Koestraat 80g",
        "AddressLine1": "Koestraat 80g",
        "Town": "Krimpenerwaard",
        "Postcode": "2871 DS",
        "CountryID": 159,
        "Latitude": 51.94593,
        "Longitude": 4.84928,
        "RelatedURL": "http://www.ev-box.nl",
        "DistanceUnit": 0
    },
    "Connections": [
        {
            "ID": 94682,
            "ConnectionTypeID": 25,
            "LevelID": 2,
            "PowerKW": 11,
            "CurrentTypeID": 10
        },
        {
            "ID": 94683,
            "ConnectionTypeID": 25,
            "LevelID": 2,
            "PowerKW": 11,
            "CurrentTypeID": 10
        }
    ],
    "NumberOfPoints": 1,
    "StatusTypeID": 50,
    "DateLastStatusUpdate": "2016-06-04T02:37:00Z",
    "DataQualityLevel": 3,
    "DateCreated": "2016-06-04T02:37:00Z",
    "SubmissionStatusTypeID": 100
}