{
    "IsRecentlyVerified": false,
    "ID": 177950,
    "UUID": "16AE94F0-0255-4E12-81ED-43D352D3441F",
    "DataProviderID": 29,
    "DataProvidersReference": "13670",
    "OperatorID": 86,
    "AddressInfo": {
        "ID": 178309,
        "Title": "Heuweg 12",
        "AddressLine1": "Heuweg 12",
        "Town": "Beimerstetten",
        "Postcode": "89179",
        "CountryID": 87,
        "Latitude": 48.480387,
        "Longitude": 9.980588,
        "DistanceUnit": 0
    },
    "Connections": [
        {
            "ID": 277730,
            "ConnectionTypeID": 28,
            "StatusTypeID": 50,
            "LevelID": 2,
            "PowerKW": 22,
            "CurrentTypeID": 10
        },
        {
            "ID": 277731,
            "ConnectionTypeID": 28,
            "StatusTypeID": 50,
            "LevelID": 2,
            "PowerKW": 22,
            "CurrentTypeID": 10
        }
    ],
    "StatusTypeID": 0,
    "DateLastStatusUpdate": "2021-07-09T03:12:00Z",
    "MetadataValues": [
        {
            "ID": 10244,
            "MetadataFieldID": 4,
            "ItemValue": "Data from the German chargepoint registry provided by Bundesnetzagentur.de under the CC-BY 4.0 license"
        }
    ],
    "DataQualityLevel": 3,
    "DateCreated": "2021-07-08T09:49:00Z",
    "SubmissionStatusTypeID": 100
}