{
    "IsRecentlyVerified": false,
    "ID": 65098,
    "UUID": "99070811-EA5F-4D87-8DBE-6364857DCEE5",
    "DataProviderID": 1,
    "OperatorID": 45,
    "UsageTypeID": 1,
    "AddressInfo": {
        "ID": 65444,
        "Title": "Marktstraße am Modehaus Schoser",
        "AddressLine1": "Marktstraße 31",
        "Town": "Trochtelfingen",
        "StateOrProvince": "Landkreis Reutlingen",
        "Postcode": "72818",
        "CountryID": 87,
        "Latitude": 48.3082997,
        "Longitude": 9.24458460000005,
        "AccessComments": "Silber/Schwarze Ladesäule (Typ: ENCW) am Parkplatz an der Hauswand. Laden und Parken kostenlos. Mindestens bis Mai 2016 kostenlos.",
        "DistanceUnit": 0
    },
    "Connections": [
        {
            "ID": 89599,
            "ConnectionTypeID": 25,
            "StatusTypeID": 50,
            "LevelID": 2,
            "Amps": 16,
            "Voltage": 400,
            "PowerKW": 11,
            "CurrentTypeID": 20,
            "Quantity": 1
        }
    ],
    "NumberOfPoints": 1,
    "StatusTypeID": 50,
    "DateLastStatusUpdate": "2016-04-11T09:01:00Z",
    "DataQualityLevel": 1,
    "DateCreated": "2016-04-11T07:18:00Z",
    "SubmissionStatusTypeID": 200
}