{
    "IsRecentlyVerified": false,
    "ID": 79829,
    "UUID": "22646272-9D85-4FA0-8B11-8A67C8A9CED4",
    "DataProviderID": 1,
    "OperatorID": 23,
    "OperatorsReference": "7192",
    "UsageTypeID": 6,
    "UsageCost": "Free",
    "AddressInfo": {
        "ID": 80175,
        "Title": "Portland Marriott Downtown Waterfront",
        "AddressLine1": "1401 Southwest Naito Parkway",
        "Town": "Portland",
        "StateOrProvince": "OR",
        "Postcode": "97201",
        "CountryID": 2,
        "Latitude": 45.5123866,
        "Longitude": -122.6756475,
        "ContactTelephone1": "(503) 226-7600",
        "DistanceUnit": 0
    },
    "Connections": [
        {
            "ID": 114476,
            "ConnectionTypeID": 30,
            "StatusTypeID": 50,
            "LevelID": 2,
            "Amps": 32,
            "Voltage": 230,
            "PowerKW": 16,
            "CurrentTypeID": 20,
            "Quantity": 5
        }
    ],
    "NumberOfPoints": 5,
    "GeneralComments": "1 Tesla Connector, up to 13kW.Available for patrons only. Please see valet.",
    "StatusTypeID": 50,
    "DateLastStatusUpdate": "2018-01-21T16:49:00Z",
    "DataQualityLevel": 1,
    "DateCreated": "2017-01-30T13:25:00Z",
    "SubmissionStatusTypeID": 200
}