{
    "IsRecentlyVerified": false,
    "ID": 176735,
    "UUID": "40B4BA26-D5D9-4F4F-89B2-336CC35D3ECE",
    "DataProviderID": 29,
    "DataProvidersReference": "8932,10880,9311",
    "AddressInfo": {
        "ID": 177094,
        "Title": "Friedrich-Ebert-Str. 14",
        "AddressLine1": "Friedrich-Ebert-Str. 14",
        "Town": "Kolbermoor",
        "Postcode": "83059",
        "CountryID": 87,
        "Latitude": 47.849343,
        "Longitude": 12.067473,
        "DistanceUnit": 0
    },
    "Connections": [
        {
            "ID": 274990,
            "ConnectionTypeID": 25,
            "StatusTypeID": 50,
            "LevelID": 2,
            "PowerKW": 11,
            "CurrentTypeID": 20
        },
        {
            "ID": 274991,
            "ConnectionTypeID": 25,
            "StatusTypeID": 50,
            "LevelID": 2,
            "PowerKW": 11,
            "CurrentTypeID": 20
        },
        {
            "ID": 274992,
            "ConnectionTypeID": 25,
            "StatusTypeID": 50,
            "LevelID": 2,
            "PowerKW": 11,
            "CurrentTypeID": 20
        }
    ],
    "StatusTypeID": 0,
    "DateLastStatusUpdate": "2021-07-09T03:10:00Z",
    "MetadataValues": [
        {
            "ID": 9030,
            "MetadataFieldID": 4,
            "ItemValue": "Data from the German chargepoint registry provided by Bundesnetzagentur.de under the CC-BY 4.0 license"
        }
    ],
    "DataQualityLevel": 3,
    "DateCreated": "2021-07-08T09:48:00Z",
    "SubmissionStatusTypeID": 100
}