{
    "IsRecentlyVerified": false,
    "ID": 185846,
    "UUID": "170A066E-6D95-4567-8D4E-406678949FAA",
    "DataProviderID": 29,
    "DataProvidersReference": "5730",
    "OperatorID": 234,
    "AddressInfo": {
        "ID": 186205,
        "Title": "Marktplatz 10",
        "AddressLine1": "Marktplatz 10",
        "Town": "Flachslanden",
        "Postcode": "91604",
        "CountryID": 87,
        "Latitude": 49.39874,
        "Longitude": 10.51324,
        "DistanceUnit": 0
    },
    "Connections": [
        {
            "ID": 296969,
            "ConnectionTypeID": 25,
            "StatusTypeID": 50,
            "LevelID": 2,
            "PowerKW": 22,
            "CurrentTypeID": 20
        },
        {
            "ID": 296970,
            "ConnectionTypeID": 25,
            "StatusTypeID": 50,
            "LevelID": 2,
            "PowerKW": 22,
            "CurrentTypeID": 20
        }
    ],
    "StatusTypeID": 50,
    "DateLastStatusUpdate": "2021-07-12T02:43:00Z",
    "MetadataValues": [
        {
            "ID": 18088,
            "MetadataFieldID": 4,
            "ItemValue": "Data from the German chargepoint registry provided by Bundesnetzagentur.de under the CC-BY 4.0 license"
        }
    ],
    "DataQualityLevel": 3,
    "DateCreated": "2021-07-12T02:43:00Z",
    "SubmissionStatusTypeID": 100
}