{
    "UserComments": [
        {
            "ID": 14209,
            "ChargePointID": 30894,
            "CommentTypeID": 10,
            "UserName": "Zyg0te",
            "Comment": "Fungerer strålende! Lading tiltenkt hotellets gjester regner jeg med. ",
            "Rating": 5,
            "DateCreated": "2016-09-05T20:30:21.953Z",
            "User": {
                "ID": 7885,
                "Username": "Zyg0te"
            }
        }
    ],
    "MediaItems": [
        {
            "ID": 8250,
            "ChargePointID": 30894,
            "ItemURL": "https://s3-ap-southeast-2.amazonaws.com/openchargemap/images/NO/OCM30894/OCM-30894.orig.2016090607063749.jpeg",
            "ItemThumbnailURL": "https://s3-ap-southeast-2.amazonaws.com/openchargemap/images/NO/OCM30894/OCM-30894.thmb.2016090607063749.jpeg",
            "Comment": "",
            "IsEnabled": true,
            "IsVideo": false,
            "IsFeaturedItem": false,
            "IsExternalResource": false,
            "User": {
                "ID": 7885,
                "Username": "Zyg0te"
            },
            "DateCreated": "2016-09-06T07:07:00Z"
        }
    ],
    "IsRecentlyVerified": false,
    "ID": 30894,
    "UUID": "6379ACE3-966F-42F7-A53A-EE01C433DDCA",
    "DataProviderID": 1,
    "OperatorID": 1,
    "UsageTypeID": 6,
    "AddressInfo": {
        "ID": 31240,
        "Title": "Elgstua hotell",
        "AddressLine1": "Trondheimsvegen 9 ",
        "Town": "Elverum",
        "StateOrProvince": "Hedmark",
        "Postcode": "2406",
        "CountryID": 168,
        "Latitude": 60.88323,
        "Longitude": 11.54062,
        "AccessComments": "På hjørnet bak hotellet, ved innkjøring til parkeringsplass bak hotellet. For hotellets gjester.",
        "DistanceUnit": 0
    },
    "Connections": [
        {
            "ID": 34123,
            "ConnectionTypeID": 28,
            "Reference": "1",
            "StatusTypeID": 50,
            "LevelID": 2,
            "Amps": 16,
            "Voltage": 230,
            "PowerKW": 3,
            "CurrentTypeID": 10,
            "Quantity": 4
        }
    ],
    "NumberOfPoints": 4,
    "StatusTypeID": 50,
    "DateLastStatusUpdate": "2016-09-06T07:07:00Z",
    "DataQualityLevel": 2,
    "DateCreated": "2014-12-09T09:01:00Z",
    "SubmissionStatusTypeID": 200
}