{
    "IsRecentlyVerified": false,
    "ID": 79758,
    "UUID": "D1406863-E909-4EE1-ACB8-618878C81579",
    "DataProviderID": 1,
    "OperatorID": 23,
    "OperatorsReference": "12227",
    "UsageTypeID": 4,
    "UsageCost": "Free",
    "AddressInfo": {
        "ID": 80104,
        "Title": "Town of Creston Cook Street Parking Lot",
        "AddressLine1": "1102 Cook St",
        "Town": "Creston",
        "StateOrProvince": "BC",
        "Postcode": "V0B 1G0",
        "CountryID": 44,
        "Latitude": 49.0946109,
        "Longitude": -116.5114286,
        "ContactTelephone1": "(250) 428-2214",
        "DistanceUnit": 0
    },
    "Connections": [
        {
            "ID": 114404,
            "ConnectionTypeID": 30,
            "StatusTypeID": 50,
            "LevelID": 2,
            "PowerKW": 13,
            "CurrentTypeID": 20,
            "Quantity": 1
        }
    ],
    "NumberOfPoints": 1,
    "GeneralComments": "1 Tesla Connector, up to 13kW.Available to the public. Self park.",
    "StatusTypeID": 50,
    "DateLastStatusUpdate": "2017-01-30T13:07:00Z",
    "DataQualityLevel": 1,
    "DateCreated": "2017-01-30T13:07:00Z",
    "SubmissionStatusTypeID": 200
}