{
    "IsRecentlyVerified": false,
    "ID": 181053,
    "UUID": "52AE3CCB-A02D-4E62-9098-1A61E9BB53D4",
    "DataProviderID": 29,
    "DataProvidersReference": "3999",
    "AddressInfo": {
        "ID": 181412,
        "Title": "Sieggrubenstraße 5",
        "AddressLine1": "Sieggrubenstraße 5",
        "Town": "Berg",
        "Postcode": "95180",
        "CountryID": 87,
        "Latitude": 50.371853,
        "Longitude": 11.787816,
        "DistanceUnit": 0
    },
    "Connections": [
        {
            "ID": 284886,
            "ConnectionTypeID": 33,
            "StatusTypeID": 50,
            "LevelID": 3,
            "PowerKW": 175,
            "CurrentTypeID": 30
        },
        {
            "ID": 284887,
            "ConnectionTypeID": 33,
            "StatusTypeID": 50,
            "LevelID": 3,
            "PowerKW": 175,
            "CurrentTypeID": 30
        }
    ],
    "StatusTypeID": 50,
    "DateLastStatusUpdate": "2021-07-09T03:19:00Z",
    "MetadataValues": [
        {
            "ID": 13347,
            "MetadataFieldID": 4,
            "ItemValue": "Data from the German chargepoint registry provided by Bundesnetzagentur.de under the CC-BY 4.0 license"
        }
    ],
    "DataQualityLevel": 3,
    "DateCreated": "2021-07-08T10:01:00Z",
    "SubmissionStatusTypeID": 100
}