{
    "IsRecentlyVerified": false,
    "ID": 177129,
    "UUID": "30605710-DE26-449E-AFAC-A23961B2977A",
    "DataProviderID": 29,
    "DataProvidersReference": "4635",
    "OperatorID": 220,
    "AddressInfo": {
        "ID": 177488,
        "Title": "Saseler Chaussee ggü. 109",
        "AddressLine1": "Saseler Chaussee ggü. 109",
        "Town": "Hamburg",
        "Postcode": "22393",
        "CountryID": 87,
        "Latitude": 53.644017,
        "Longitude": 10.09984,
        "DistanceUnit": 0
    },
    "Connections": [
        {
            "ID": 275903,
            "ConnectionTypeID": 28,
            "StatusTypeID": 50,
            "LevelID": 2,
            "PowerKW": 22,
            "CurrentTypeID": 20
        },
        {
            "ID": 275904,
            "ConnectionTypeID": 25,
            "StatusTypeID": 50,
            "LevelID": 2,
            "PowerKW": 22,
            "CurrentTypeID": 20
        },
        {
            "ID": 302071,
            "ConnectionTypeID": 28,
            "StatusTypeID": 50,
            "LevelID": 2,
            "PowerKW": 22,
            "CurrentTypeID": 20
        },
        {
            "ID": 302072,
            "ConnectionTypeID": 25,
            "StatusTypeID": 50,
            "LevelID": 2,
            "PowerKW": 22,
            "CurrentTypeID": 20
        }
    ],
    "StatusTypeID": 0,
    "DateLastStatusUpdate": "2021-07-12T02:52:00Z",
    "MetadataValues": [
        {
            "ID": 9423,
            "MetadataFieldID": 4,
            "ItemValue": "Data from the German chargepoint registry provided by Bundesnetzagentur.de under the CC-BY 4.0 license"
        }
    ],
    "DataQualityLevel": 3,
    "DateCreated": "2021-07-08T09:48:00Z",
    "SubmissionStatusTypeID": 100
}