{
    "IsRecentlyVerified": false,
    "ID": 167711,
    "UUID": "435F966A-FDA5-429B-A01A-B4BD45827587",
    "DataProviderID": 1,
    "OperatorID": 21,
    "UsageTypeID": 4,
    "UsageCost": "Mobi.E compatible card",
    "AddressInfo": {
        "ID": 168070,
        "Title": "GOI-00001",
        "AddressLine1": "EN 342",
        "Town": "Góis",
        "StateOrProvince": "Centro",
        "Postcode": "",
        "CountryID": 180,
        "Latitude": 40.163357339305435,
        "Longitude": -8.108971189288468,
        "DistanceUnit": 0
    },
    "Connections": [
        {
            "ID": 254656,
            "ConnectionTypeID": 25,
            "StatusTypeID": 50,
            "LevelID": 2,
            "Amps": 32,
            "Voltage": 400,
            "PowerKW": 22,
            "CurrentTypeID": 20,
            "Quantity": 2
        }
    ],
    "NumberOfPoints": 2,
    "StatusTypeID": 50,
    "DateLastStatusUpdate": "2020-11-11T22:47:00Z",
    "DataQualityLevel": 1,
    "DateCreated": "2020-09-11T08:40:00Z",
    "SubmissionStatusTypeID": 200
}