{
    "IsRecentlyVerified": false,
    "ID": 46887,
    "UUID": "D9BA7BE1-8CF9-473E-8A02-0CF651D3AA13",
    "DataProviderID": 1,
    "OperatorID": 189,
    "UsageTypeID": 4,
    "AddressInfo": {
        "ID": 47233,
        "Title": "Landwirtschaftsmuseum",
        "AddressLine1": "Schulgasse 2",
        "Town": "Regen",
        "Postcode": "94209",
        "CountryID": 87,
        "Latitude": 48.970103423645,
        "Longitude": 13.1250593479827,
        "DistanceUnit": 0
    },
    "Connections": [
        {
            "ID": 57689,
            "ConnectionTypeID": 25,
            "StatusTypeID": 50,
            "LevelID": 2,
            "Amps": 32,
            "Voltage": 400,
            "PowerKW": 22,
            "CurrentTypeID": 20,
            "Quantity": 2
        },
        {
            "ID": 57690,
            "ConnectionTypeID": 28,
            "StatusTypeID": 50,
            "LevelID": 2,
            "Amps": 16,
            "Voltage": 230,
            "PowerKW": 3.7,
            "CurrentTypeID": 10,
            "Quantity": 2
        }
    ],
    "NumberOfPoints": 2,
    "StatusTypeID": 50,
    "DateLastStatusUpdate": "2015-05-08T21:35:00Z",
    "DataQualityLevel": 1,
    "DateCreated": "2015-05-08T21:24:00Z",
    "SubmissionStatusTypeID": 200
}