{
    "UserComments": [
        {
            "ID": 22886,
            "ChargePointID": 161389,
            "CommentTypeID": 10,
            "UserName": "Robert Seemueller",
            "Rating": 5,
            "DateCreated": "2020-07-11T02:01:55.917Z",
            "User": {
                "ID": 19108,
                "Username": "Robert Seemueller"
            },
            "CheckinStatusTypeID": 140,
            "IsActionedByEditor": false
        }
    ],
    "MediaItems": [
        {
            "ID": 23026,
            "ChargePointID": 161389,
            "ItemURL": "https://s3-ap-southeast-2.amazonaws.com/openchargemap/images/US/OCM161389/OCM-161389.orig.2020071123273301.jpg",
            "ItemThumbnailURL": "https://s3-ap-southeast-2.amazonaws.com/openchargemap/images/US/OCM161389/OCM-161389.thmb.2020071123273301.jpg",
            "Comment": "",
            "IsEnabled": true,
            "IsVideo": false,
            "IsFeaturedItem": false,
            "IsExternalResource": false,
            "User": {
                "ID": 19108,
                "Username": "Robert Seemueller"
            },
            "DateCreated": "2020-07-11T23:28:00Z"
        }
    ],
    "IsRecentlyVerified": false,
    "ID": 161389,
    "UUID": "03A45051-324F-40BD-8DF6-877DF91FCD5B",
    "DataProviderID": 1,
    "OperatorID": 5,
    "UsageTypeID": 1,
    "UsageCost": "Free",
    "AddressInfo": {
        "ID": 161746,
        "Title": "Bennett Beach. Erie County Parks",
        "AddressLine1": "8276 Lakeshore Blvd",
        "Town": "Angola",
        "StateOrProvince": "NY",
        "Postcode": "14006",
        "CountryID": 2,
        "Latitude": 42.65950374217536,
        "Longitude": -79.05951545409806,
        "DistanceUnit": 0
    },
    "Connections": [
        {
            "ID": 232274,
            "ConnectionTypeID": 1,
            "StatusTypeID": 50,
            "LevelID": 2,
            "Amps": 30,
            "Voltage": 220,
            "PowerKW": 6.6,
            "Quantity": 2
        }
    ],
    "NumberOfPoints": 1,
    "StatusTypeID": 50,
    "DateLastStatusUpdate": "2020-07-13T03:57:00Z",
    "DataQualityLevel": 1,
    "DateCreated": "2020-07-11T01:50:00Z",
    "SubmissionStatusTypeID": 200
}