{
    "MediaItems": [
        {
            "ID": 17255,
            "ChargePointID": 113608,
            "ItemURL": "https://s3-ap-southeast-2.amazonaws.com/openchargemap/images/GR/OCM113608/OCM-113608.orig.2018122311134596.jpg",
            "ItemThumbnailURL": "https://s3-ap-southeast-2.amazonaws.com/openchargemap/images/GR/OCM113608/OCM-113608.thmb.2018122311134596.jpg",
            "Comment": "",
            "IsEnabled": true,
            "IsVideo": false,
            "IsFeaturedItem": false,
            "IsExternalResource": false,
            "User": {
                "ID": 18761,
                "Username": "EVentusiast"
            },
            "DateCreated": "2018-12-23T11:14:00Z"
        }
    ],
    "IsRecentlyVerified": false,
    "ID": 113608,
    "UUID": "6AAC632D-7688-4653-A98A-20427C2C71DD",
    "DataProviderID": 1,
    "OperatorID": 45,
    "UsageTypeID": 6,
    "AddressInfo": {
        "ID": 113954,
        "Title": "Hotel Zafolia",
        "AddressLine1": "Leoforos Alexandras 87-89",
        "Town": "Athens ",
        "Postcode": "114 74",
        "CountryID": 90,
        "Latitude": 37.9894926,
        "Longitude": 23.74670590000005,
        "ContactTelephone1": "+30 2106449 002",
        "ContactEmail": "info@athenszafoliahotel.gr",
        "RelatedURL": "http://www.athenszafoliahotel.gr",
        "DistanceUnit": 0
    },
    "Connections": [
        {
            "ID": 160104,
            "ConnectionTypeID": 25,
            "StatusTypeID": 50,
            "LevelID": 2,
            "Amps": 32,
            "Voltage": 400,
            "PowerKW": 22,
            "CurrentTypeID": 20,
            "Quantity": 1
        }
    ],
    "NumberOfPoints": 1,
    "StatusTypeID": 50,
    "DateLastStatusUpdate": "2018-12-23T16:21:00Z",
    "DataQualityLevel": 1,
    "DateCreated": "2018-12-23T11:12:00Z",
    "SubmissionStatusTypeID": 200
}