{
    "IsRecentlyVerified": false,
    "ID": 182665,
    "UUID": "90AC8C32-7253-4510-B2CC-6F828448D309",
    "DataProviderID": 29,
    "DataProvidersReference": "3104,2823",
    "OperatorID": 3403,
    "AddressInfo": {
        "ID": 183024,
        "Title": "Berliner Straße 26",
        "AddressLine1": "Berliner Straße 26",
        "Town": "Vellmar",
        "Postcode": "34246",
        "CountryID": 87,
        "Latitude": 51.34955,
        "Longitude": 9.47671,
        "DistanceUnit": 0
    },
    "Connections": [
        {
            "ID": 288685,
            "ConnectionTypeID": 25,
            "StatusTypeID": 50,
            "LevelID": 2,
            "PowerKW": 22,
            "CurrentTypeID": 20
        },
        {
            "ID": 288686,
            "ConnectionTypeID": 25,
            "StatusTypeID": 50,
            "LevelID": 2,
            "PowerKW": 22,
            "CurrentTypeID": 20
        },
        {
            "ID": 288687,
            "ConnectionTypeID": 25,
            "StatusTypeID": 50,
            "LevelID": 2,
            "PowerKW": 22,
            "CurrentTypeID": 20
        },
        {
            "ID": 288688,
            "ConnectionTypeID": 25,
            "StatusTypeID": 50,
            "LevelID": 2,
            "PowerKW": 22,
            "CurrentTypeID": 20
        }
    ],
    "StatusTypeID": 50,
    "DateLastStatusUpdate": "2021-07-09T03:23:00Z",
    "MetadataValues": [
        {
            "ID": 14958,
            "MetadataFieldID": 4,
            "ItemValue": "Data from the German chargepoint registry provided by Bundesnetzagentur.de under the CC-BY 4.0 license"
        }
    ],
    "DataQualityLevel": 3,
    "DateCreated": "2021-07-08T10:03:00Z",
    "SubmissionStatusTypeID": 100
}