{
    "IsRecentlyVerified": false,
    "ID": 187431,
    "UUID": "8ED6DB25-0C54-4FBF-BBC4-7FD2AFAE999F",
    "DataProviderID": 18,
    "DataProvidersReference": "cdf506a5b895a98336cfe7d6da236483",
    "OperatorID": 2244,
    "UsageTypeID": 5,
    "AddressInfo": {
        "ID": 187790,
        "Title": "15 St. Margarets Road",
        "AddressLine1": "15 St. Margarets Road",
        "Town": "London",
        "Postcode": "TW1 2LN",
        "CountryID": 1,
        "Latitude": -0.31333,
        "Longitude": 51.45452,
        "AccessComments": "",
        "RelatedURL": "https://www.ubitricity.com",
        "DistanceUnit": 0
    },
    "Connections": [
        {
            "ID": 302565,
            "ConnectionTypeID": 25,
            "Reference": "suby1100005178",
            "StatusTypeID": 50,
            "LevelID": 2,
            "Amps": 16,
            "Voltage": 230,
            "PowerKW": 3.7,
            "CurrentTypeID": 10
        }
    ],
    "StatusTypeID": 0,
    "DateLastStatusUpdate": "2021-07-12T03:38:00Z",
    "MetadataValues": [
        {
            "ID": 19671,
            "MetadataFieldID": 4,
            "ItemValue": "Contains public sector information licensed under the Open Government Licence v2.0. http://www.nationalarchives.gov.uk/doc/open-government-licence/version/2/"
        }
    ],
    "DataQualityLevel": 3,
    "DateCreated": "2021-07-12T03:38:00Z",
    "SubmissionStatusTypeID": 100
}