{
    "IsRecentlyVerified": false,
    "ID": 185953,
    "UUID": "E30C32E2-D136-4F44-8364-4FBC86061D4B",
    "DataProviderID": 29,
    "DataProvidersReference": "13474",
    "AddressInfo": {
        "ID": 186312,
        "Title": "Breitenbacher Str. 10",
        "AddressLine1": "Breitenbacher Str. 10",
        "Town": "Ebermannstadt",
        "Postcode": "91320",
        "CountryID": 87,
        "Latitude": 49.78119,
        "Longitude": 11.18474,
        "DistanceUnit": 0
    },
    "Connections": [
        {
            "ID": 297304,
            "ConnectionTypeID": 25,
            "StatusTypeID": 50,
            "LevelID": 2,
            "PowerKW": 22,
            "CurrentTypeID": 20
        },
        {
            "ID": 297305,
            "ConnectionTypeID": 25,
            "StatusTypeID": 50,
            "LevelID": 2,
            "PowerKW": 22,
            "CurrentTypeID": 20
        }
    ],
    "StatusTypeID": 50,
    "DateLastStatusUpdate": "2021-07-12T02:43:00Z",
    "MetadataValues": [
        {
            "ID": 18195,
            "MetadataFieldID": 4,
            "ItemValue": "Data from the German chargepoint registry provided by Bundesnetzagentur.de under the CC-BY 4.0 license"
        }
    ],
    "DataQualityLevel": 3,
    "DateCreated": "2021-07-12T02:43:00Z",
    "SubmissionStatusTypeID": 100
}