{
    "IsRecentlyVerified": false,
    "ID": 89426,
    "UUID": "BD3D8302-4FD5-4B82-ABBA-C6E6B078E1B8",
    "DataProviderID": 2,
    "DataProvidersReference": "82258",
    "OperatorID": 5,
    "UsageTypeID": 1,
    "AddressInfo": {
        "ID": 89772,
        "Title": "CASTRO MTN VIEW",
        "AddressLine1": "150 W Evelyn Ave",
        "Town": "Mountain View",
        "StateOrProvince": "CA",
        "Postcode": "94041",
        "CountryID": 2,
        "Latitude": 37.392346,
        "Longitude": -122.071719,
        "ContactTelephone1": "888-758-4389",
        "AccessComments": "24 hours daily",
        "RelatedURL": "http://www.chargepoint.com/",
        "DistanceUnit": 0
    },
    "Connections": [
        {
            "ID": 126820,
            "ConnectionTypeID": 1,
            "LevelID": 2,
            "Amps": 16,
            "Voltage": 230,
            "PowerKW": 3,
            "CurrentTypeID": 10,
            "Quantity": 4
        }
    ],
    "DateLastStatusUpdate": "2019-04-06T04:02:00Z",
    "DataQualityLevel": 3,
    "DateCreated": "2017-06-22T08:16:00Z",
    "SubmissionStatusTypeID": 100
}