{
    "IsRecentlyVerified": false,
    "ID": 169300,
    "UUID": "9DE7D0C9-BA77-42B1-8DA4-03B95CFC8A5B",
    "DataProviderID": 1,
    "OperatorID": 23,
    "OperatorsReference": "54678",
    "UsageTypeID": 4,
    "UsageCost": "€0.25/kWh; andere tarieven voor oudere auto's",
    "AddressInfo": {
        "ID": 169659,
        "Title": "Uden Supercharger",
        "AddressLine1": "Rondweg 2",
        "Town": "Uden",
        "CountryID": 159,
        "Latitude": 51.671308,
        "Longitude": 5.60267,
        "DistanceUnit": 0
    },
    "Connections": [
        {
            "ID": 257593,
            "ConnectionTypeID": 27,
            "StatusTypeID": 50,
            "LevelID": 3,
            "PowerKW": 120,
            "CurrentTypeID": 30,
            "Quantity": 12
        }
    ],
    "NumberOfPoints": 12,
    "GeneralComments": "12 Superchargers, 250 kW available 24/7",
    "StatusTypeID": 50,
    "DateLastStatusUpdate": "2020-10-14T05:32:00Z",
    "DataQualityLevel": 1,
    "DateCreated": "2020-10-14T05:32:00Z",
    "SubmissionStatusTypeID": 200
}