{
    "UserComments": [
        {
            "ID": 4074,
            "ChargePointID": 30779,
            "CommentTypeID": 10,
            "UserName": "",
            "Comment": "",
            "Rating": 4,
            "DateCreated": "2015-03-26T15:22:19.88Z",
            "CheckinStatusTypeID": 10
        }
    ],
    "IsRecentlyVerified": false,
    "ID": 30779,
    "UUID": "30A24F82-B8B1-4897-A9A9-5F812C122D70",
    "DataProviderID": 1,
    "DataProvidersReference": "2456",
    "AddressInfo": {
        "ID": 31125,
        "Title": "Kiwi Hønefoss",
        "AddressLine1": "Dronning Åstas gate 10",
        "Town": "HØNEFOSS",
        "StateOrProvince": "Viken",
        "Postcode": "3511",
        "CountryID": 168,
        "Latitude": 60.15278,
        "Longitude": 10.25357,
        "AccessComments": "Utenfor Kiwi Eikliveien",
        "DistanceUnit": 0
    },
    "Connections": [
        {
            "ID": 34008,
            "ConnectionTypeID": 0,
            "Reference": "1",
            "LevelID": 2,
            "Amps": 100,
            "Voltage": 500,
            "PowerKW": 50,
            "Comments": "Mode 4"
        },
        {
            "ID": 86483,
            "ConnectionTypeID": 0,
            "Reference": "2",
            "LevelID": 2,
            "Amps": 100,
            "Voltage": 500,
            "PowerKW": 50,
            "Comments": "Mode 4"
        },
        {
            "ID": 88872,
            "ConnectionTypeID": 0,
            "Reference": "3",
            "LevelID": 2,
            "Amps": 32,
            "Voltage": 400,
            "PowerKW": 22,
            "Comments": "Mode 3"
        }
    ],
    "NumberOfPoints": 3,
    "DateLastStatusUpdate": "2020-05-26T08:23:00Z",
    "DataQualityLevel": 2,
    "DateCreated": "2014-12-09T09:00:00Z",
    "SubmissionStatusTypeID": 100
}