{
    "IsRecentlyVerified": false,
    "ID": 154712,
    "UUID": "57242BDA-C550-4729-9AE5-C0BEA9A26749",
    "DataProviderID": 1,
    "OperatorID": 2244,
    "UsageTypeID": 5,
    "AddressInfo": {
        "ID": 155065,
        "Title": "Hampton Court Road",
        "AddressLine1": "Hampton Court Road",
        "Town": "London",
        "Postcode": "KT8 9BZ",
        "CountryID": 1,
        "Latitude": 51.406427,
        "Longitude": -0.334919,
        "RelatedURL": "https://www.ubitricity.com",
        "DistanceUnit": 0
    },
    "Connections": [
        {
            "ID": 217699,
            "ConnectionTypeID": 25,
            "Reference": "suby1100000440",
            "StatusTypeID": 50,
            "LevelID": 2,
            "Amps": 16,
            "Voltage": 230,
            "PowerKW": 3.7,
            "CurrentTypeID": 10
        }
    ],
    "StatusTypeID": 0,
    "DateLastStatusUpdate": "2020-03-26T10:34:00Z",
    "MetadataValues": [
        {
            "ID": 7251,
            "MetadataFieldID": 4,
            "ItemValue": "Contains public sector information licensed under the Open Government Licence v2.0. http://www.nationalarchives.gov.uk/doc/open-government-licence/version/2/"
        }
    ],
    "DataQualityLevel": 3,
    "DateCreated": "2020-03-17T08:53:00Z",
    "SubmissionStatusTypeID": 100
}