{
    "IsRecentlyVerified": false,
    "ID": 140284,
    "UUID": "A4A97296-DC2D-467F-91E1-89FCC0E5169F",
    "DataProviderID": 1,
    "OperatorID": 15,
    "UsageTypeID": 4,
    "UsageCost": ".35",
    "AddressInfo": {
        "ID": 140636,
        "Title": "Public Parking",
        "AddressLine1": "1764 W Broadway Ave",
        "Town": "Maryville",
        "StateOrProvince": "TN",
        "Postcode": "37801",
        "CountryID": 2,
        "Latitude": 35.731936,
        "Longitude": -83.995494,
        "ContactTelephone1": "877-455-3833",
        "AccessComments": "24 hours daily\r\nPublic - Card key at all times",
        "RelatedURL": "https://www.evgo.com/",
        "DistanceUnit": 0
    },
    "Connections": [
        {
            "ID": 195884,
            "ConnectionTypeID": 2,
            "LevelID": 3,
            "Amps": 100,
            "Voltage": 400,
            "PowerKW": 50,
            "CurrentTypeID": 30,
            "Quantity": 1
        },
        {
            "ID": 195885,
            "ConnectionTypeID": 32,
            "LevelID": 3,
            "Amps": 100,
            "Voltage": 400,
            "PowerKW": 50,
            "CurrentTypeID": 30,
            "Quantity": 1
        }
    ],
    "NumberOfPoints": 1,
    "StatusTypeID": 50,
    "DateLastStatusUpdate": "2021-09-01T08:01:00Z",
    "DataQualityLevel": 3,
    "DateCreated": "2019-12-24T09:12:00Z",
    "SubmissionStatusTypeID": 100
}