{
    "IsRecentlyVerified": false,
    "ID": 155425,
    "UUID": "A8866F62-5F53-4F72-BA67-8C2A0931DBDD",
    "DataProviderID": 1,
    "OperatorID": 80,
    "UsageTypeID": 4,
    "AddressInfo": {
        "ID": 155779,
        "Title": "Eurospin Maddaloni | ENELX",
        "AddressLine1": "Via Campolongo",
        "Town": "Maddaloni",
        "StateOrProvince": "CE",
        "Postcode": "81024",
        "CountryID": 112,
        "Latitude": 41.04360192814974,
        "Longitude": 14.365532735560919,
        "ContactTelephone1": "800.069.850",
        "RelatedURL": "https://www.enelx.com/it/it/emobility",
        "DistanceUnit": 0
    },
    "Connections": [
        {
            "ID": 218821,
            "ConnectionTypeID": 25,
            "StatusTypeID": 50,
            "LevelID": 2,
            "Amps": 32,
            "Voltage": 400,
            "PowerKW": 22,
            "CurrentTypeID": 20,
            "Quantity": 4
        }
    ],
    "NumberOfPoints": 4,
    "StatusTypeID": 50,
    "DateLastStatusUpdate": "2020-04-11T13:31:00Z",
    "DataQualityLevel": 1,
    "DateCreated": "2020-04-11T13:31:00Z",
    "SubmissionStatusTypeID": 200
}