{
    "IsRecentlyVerified": false,
    "ID": 119739,
    "UUID": "21B41889-A8CE-48AD-896B-53D3CC7A6BFA",
    "DataProviderID": 2,
    "DataProvidersReference": "64961",
    "OperatorID": 5,
    "UsageTypeID": 1,
    "AddressInfo": {
        "ID": 120085,
        "Title": "IBIS WALK",
        "AddressLine1": "871 Ibis Walk Place N.",
        "Town": "St Petersburg",
        "StateOrProvince": "FL",
        "Postcode": "33716",
        "CountryID": 2,
        "Latitude": 27.865666,
        "Longitude": -82.6452412,
        "ContactTelephone1": "888-758-4389",
        "AccessComments": "24 hours daily",
        "RelatedURL": "http://www.chargepoint.com/",
        "DistanceUnit": 0
    },
    "Connections": [
        {
            "ID": 169024,
            "ConnectionTypeID": 1,
            "LevelID": 2,
            "Amps": 16,
            "Voltage": 230,
            "PowerKW": 3,
            "CurrentTypeID": 10,
            "Quantity": 2
        }
    ],
    "DateLastStatusUpdate": "2019-12-24T09:08:00Z",
    "DataQualityLevel": 3,
    "DateCreated": "2019-04-01T04:59:00Z",
    "SubmissionStatusTypeID": 100
}