{
    "IsRecentlyVerified": false,
    "ID": 68233,
    "UUID": "BF5F85AC-352F-4CC3-AAE7-3C0E37298635",
    "DataProviderID": 26,
    "DataProvidersReference": "91344",
    "OperatorID": 177,
    "OperatorsReference": "Nuon EVB-P1552122",
    "UsageCost": "0.00 jaarabonnement",
    "AddressInfo": {
        "ID": 68579,
        "Title": "De Wittenkade 91-3",
        "AddressLine1": "De Wittenkade 91-3",
        "Town": "Amsterdam",
        "Postcode": "1052 AE",
        "CountryID": 159,
        "Latitude": 52.383271,
        "Longitude": 4.877731,
        "RelatedURL": "http://www.nuon.nl/ev",
        "DistanceUnit": 0
    },
    "Connections": [
        {
            "ID": 95104,
            "ConnectionTypeID": 25,
            "LevelID": 2,
            "PowerKW": 11,
            "CurrentTypeID": 10
        },
        {
            "ID": 95105,
            "ConnectionTypeID": 25,
            "LevelID": 2,
            "PowerKW": 11,
            "CurrentTypeID": 10
        }
    ],
    "NumberOfPoints": 1,
    "StatusTypeID": 50,
    "DateLastStatusUpdate": "2016-06-04T02:37:00Z",
    "DataQualityLevel": 3,
    "DateCreated": "2016-06-04T02:37:00Z",
    "SubmissionStatusTypeID": 100
}