{
    "IsRecentlyVerified": false,
    "ID": 175695,
    "UUID": "60171B5B-2155-4CA9-B1E6-B6A43D411D4A",
    "DataProviderID": 1,
    "OperatorID": 21,
    "UsageTypeID": 4,
    "UsageCost": "Mobi.E compatible card or App",
    "AddressInfo": {
        "ID": 176054,
        "Title": "SRQ-00001",
        "AddressLine1": "Rua de Santa Luzia",
        "Town": "São Roque",
        "StateOrProvince": "Pico",
        "Postcode": "",
        "CountryID": 180,
        "Latitude": 38.525328621976854,
        "Longitude": -28.31906086140998,
        "DistanceUnit": 0
    },
    "Connections": [
        {
            "ID": 272809,
            "ConnectionTypeID": 25,
            "StatusTypeID": 50,
            "LevelID": 2,
            "Amps": 32,
            "Voltage": 400,
            "PowerKW": 22,
            "CurrentTypeID": 20,
            "Quantity": 2
        }
    ],
    "NumberOfPoints": 2,
    "StatusTypeID": 50,
    "DateLastStatusUpdate": "2021-06-07T10:54:00Z",
    "DataQualityLevel": 1,
    "DateCreated": "2021-06-07T10:54:00Z",
    "SubmissionStatusTypeID": 200
}