{
    "IsRecentlyVerified": false,
    "ID": 163590,
    "UUID": "38D3ACC1-89CF-4338-A6B9-907BD85EA2A7",
    "DataProviderID": 1,
    "OperatorID": 23,
    "OperatorsReference": "45122",
    "UsageTypeID": 4,
    "AddressInfo": {
        "ID": 163947,
        "Title": "Assaona Gastrobeach Club Mallorca",
        "AddressLine1": "Paseo de Portixol",
        "Town": "Palma",
        "Postcode": "7006",
        "CountryID": 210,
        "Latitude": 39.56098,
        "Longitude": 2.66671,
        "ContactTelephone1": " +34 971 359 633",
        "DistanceUnit": 0
    },
    "Connections": [
        {
            "ID": 235187,
            "ConnectionTypeID": 30,
            "StatusTypeID": 50,
            "LevelID": 2,
            "PowerKW": 6,
            "CurrentTypeID": 20,
            "Quantity": 1
        }
    ],
    "NumberOfPoints": 1,
    "GeneralComments": "1 Tesla Connector, up to 6kW.Available for customers. Please see front desk.",
    "StatusTypeID": 50,
    "DateLastStatusUpdate": "2020-08-24T13:01:00Z",
    "DataQualityLevel": 1,
    "DateCreated": "2020-08-24T13:01:00Z",
    "SubmissionStatusTypeID": 200
}