{
    "IsRecentlyVerified": false,
    "ID": 87228,
    "UUID": "ED808722-853D-4123-9FDC-720663C148C1",
    "DataProviderID": 1,
    "OperatorID": 45,
    "UsageTypeID": 3,
    "AddressInfo": {
        "ID": 87574,
        "Title": "Automobile Borna",
        "AddressLine1": "Geschwister-Scholl-Straße 12-14",
        "Town": "Borna",
        "StateOrProvince": "Landkreis Leipzig",
        "Postcode": "04552",
        "CountryID": 87,
        "Latitude": 51.12770640000001,
        "Longitude": 12.506508599999961,
        "ContactTelephone1": "+49 3433 2490",
        "AccessComments": "Laden nach telefonischer Anmeldung möglich; Konditionen bitte erfragen",
        "RelatedURL": "http://www.amb-autowelt.de/volkswagen.html",
        "DistanceUnit": 0
    },
    "Connections": [
        {
            "ID": 123648,
            "ConnectionTypeID": 1036,
            "StatusTypeID": 50,
            "LevelID": 2,
            "Amps": 16,
            "Voltage": 230,
            "PowerKW": 3.7,
            "CurrentTypeID": 10,
            "Quantity": 2
        }
    ],
    "NumberOfPoints": 2,
    "StatusTypeID": 50,
    "DateLastStatusUpdate": "2017-05-02T07:53:00Z",
    "DataQualityLevel": 1,
    "DateCreated": "2017-05-02T07:53:00Z",
    "SubmissionStatusTypeID": 200
}