{
    "IsRecentlyVerified": false,
    "ID": 127218,
    "UUID": "7B9703D3-DB8E-45C8-947D-235FF9FAE7BF",
    "DataProviderID": 1,
    "OperatorID": 177,
    "UsageTypeID": 1,
    "UsageCost": "0.3388",
    "AddressInfo": {
        "ID": 127564,
        "Title": "Maria Austriastraat 722",
        "AddressLine1": "Maria Austriastraat 722",
        "AddressLine2": "Amsterdam",
        "Town": "Amsterdam",
        "StateOrProvince": "North Holland",
        "Postcode": "1087KH",
        "CountryID": 159,
        "Latitude": 52.353330135339,
        "Longitude": 5.00136550966624,
        "DistanceUnit": 0
    },
    "Connections": [
        {
            "ID": 178137,
            "ConnectionTypeID": 25,
            "StatusTypeID": 50,
            "LevelID": 2,
            "PowerKW": 11,
            "CurrentTypeID": 10,
            "Quantity": 2
        }
    ],
    "NumberOfPoints": 1,
    "StatusTypeID": 50,
    "DateLastStatusUpdate": "2019-05-30T19:01:00Z",
    "DataQualityLevel": 1,
    "DateCreated": "2019-05-30T14:33:00Z",
    "SubmissionStatusTypeID": 200
}