{
    "IsRecentlyVerified": false,
    "ID": 99518,
    "UUID": "B85C0FFD-6E0F-484C-A898-6D34CB928B14",
    "DataProviderID": 1,
    "OperatorID": 156,
    "UsageTypeID": 4,
    "UsageCost": "Frei",
    "AddressInfo": {
        "ID": 99864,
        "Title": "Systemhaus KST Moschkau",
        "AddressLine1": "Am Burgholz 36",
        "Town": "Kreuzau",
        "StateOrProvince": "Kreis Düren",
        "Postcode": "52372",
        "CountryID": 87,
        "Latitude": 50.763049117813765,
        "Longitude": 6.518827565606657,
        "AccessComments": "Durchgehend nutzbare New Motion lolo Wallboxen an der Hauswand, die zur Straße zeigt, unter dem Schild \"KST Projekt Systemhaus\". \r\nFür Besucher gibt es eine Ladekarte am Empfang.\r\nDas Gelände wird per Video überwacht! ",
        "RelatedURL": "http://www.kst-moschkau.eu/",
        "DistanceUnit": 0
    },
    "Connections": [
        {
            "ID": 140631,
            "ConnectionTypeID": 25,
            "StatusTypeID": 50,
            "LevelID": 2,
            "Amps": 16,
            "Voltage": 400,
            "PowerKW": 11,
            "CurrentTypeID": 20,
            "Quantity": 2
        }
    ],
    "NumberOfPoints": 2,
    "StatusTypeID": 50,
    "DateLastStatusUpdate": "2018-01-29T07:39:00Z",
    "DataQualityLevel": 1,
    "DateCreated": "2018-01-29T07:39:00Z",
    "SubmissionStatusTypeID": 200
}