{
    "IsRecentlyVerified": false,
    "ID": 53005,
    "UUID": "EDCA5651-62C3-4B4C-8430-28A4E42919C4",
    "DataProviderID": 1,
    "OperatorID": 101,
    "UsageTypeID": 4,
    "AddressInfo": {
        "ID": 53351,
        "Title": "Alte Burgstraße",
        "AddressLine1": "Alte Burgstraße",
        "AddressLine2": "Etwashausen",
        "Town": "Kitzingen",
        "StateOrProvince": "Landkreis Kitzingen",
        "Postcode": "97318",
        "CountryID": 87,
        "Latitude": 49.73974,
        "Longitude": 10.1630700000001,
        "ContactTelephone1": "0800 0670000",
        "AccessComments": "1 kostenloser durchgehend nutzbarer Ladeplatz. Freischaltung auch ohne Roamingpartner möglich per SMS oder per Ladekarte, auszuleihen an der Touristeninformation schräg gegenüber",
        "RelatedURL": "http://www.belectric-drive.de",
        "DistanceUnit": 0
    },
    "Connections": [
        {
            "ID": 66030,
            "ConnectionTypeID": 28,
            "StatusTypeID": 50,
            "LevelID": 2,
            "Amps": 16,
            "Voltage": 230,
            "PowerKW": 3.7,
            "CurrentTypeID": 10,
            "Quantity": 2
        }
    ],
    "NumberOfPoints": 2,
    "StatusTypeID": 50,
    "DateLastStatusUpdate": "2015-09-17T11:40:00Z",
    "DataQualityLevel": 1,
    "DateCreated": "2015-09-17T06:06:00Z",
    "SubmissionStatusTypeID": 200
}