{
    "IsRecentlyVerified": false,
    "ID": 93466,
    "UUID": "A6AF0CE3-A53C-4859-95D7-BD7E232C2603",
    "DataProviderID": 1,
    "OperatorID": 3261,
    "UsageTypeID": 4,
    "AddressInfo": {
        "ID": 93812,
        "Title": "Hauptstraße",
        "AddressLine1": "Hauptstraße 3",
        "Town": "Bosbüll",
        "StateOrProvince": "Südtondern",
        "Postcode": "25923",
        "CountryID": 87,
        "Latitude": 54.82136,
        "Longitude": 8.862930000000006,
        "ContactTelephone1": "+49 4671 6074 650",
        "AccessComments": "24/7 nutzbar. Freischaltung auch mit PlugSurfing, New Motion, Z.E. Pass u.a. Ladekarten möglich.",
        "DistanceUnit": 0
    },
    "Connections": [
        {
            "ID": 132346,
            "ConnectionTypeID": 1036,
            "StatusTypeID": 50,
            "LevelID": 2,
            "Amps": 32,
            "Voltage": 400,
            "PowerKW": 22,
            "CurrentTypeID": 20,
            "Quantity": 1
        }
    ],
    "NumberOfPoints": 1,
    "StatusTypeID": 50,
    "DateLastStatusUpdate": "2017-09-28T05:39:00Z",
    "DataQualityLevel": 1,
    "DateCreated": "2017-09-28T05:39:00Z",
    "SubmissionStatusTypeID": 200
}