{
    "IsRecentlyVerified": false,
    "ID": 184553,
    "UUID": "E33F844A-0268-4363-949F-3CDF8351F673",
    "DataProviderID": 29,
    "DataProvidersReference": "15427",
    "AddressInfo": {
        "ID": 184912,
        "Title": "Uferweg - Seestrasse",
        "AddressLine1": "Uferweg - Seestrasse",
        "Town": "Wusterhausen",
        "Postcode": "16868",
        "CountryID": 87,
        "Latitude": 52.900515,
        "Longitude": 12.45958,
        "DistanceUnit": 0
    },
    "Connections": [
        {
            "ID": 292962,
            "ConnectionTypeID": 25,
            "StatusTypeID": 50,
            "LevelID": 2,
            "PowerKW": 22,
            "CurrentTypeID": 20
        },
        {
            "ID": 292963,
            "ConnectionTypeID": 25,
            "StatusTypeID": 50,
            "LevelID": 2,
            "PowerKW": 22,
            "CurrentTypeID": 20
        }
    ],
    "StatusTypeID": 50,
    "DateLastStatusUpdate": "2021-07-09T03:28:00Z",
    "MetadataValues": [
        {
            "ID": 16844,
            "MetadataFieldID": 4,
            "ItemValue": "Data from the German chargepoint registry provided by Bundesnetzagentur.de under the CC-BY 4.0 license"
        }
    ],
    "DataQualityLevel": 3,
    "DateCreated": "2021-07-08T10:05:00Z",
    "SubmissionStatusTypeID": 100
}