{
    "MediaItems": [
        {
            "ID": 25121,
            "ChargePointID": 53609,
            "ItemURL": "https://s3-ap-southeast-2.amazonaws.com/openchargemap/images/DE/OCM53609/OCM-53609.orig.2020101802390819.jpg",
            "ItemThumbnailURL": "https://s3-ap-southeast-2.amazonaws.com/openchargemap/images/DE/OCM53609/OCM-53609.thmb.2020101802390819.jpg",
            "Comment": "",
            "IsEnabled": true,
            "IsVideo": false,
            "IsFeaturedItem": false,
            "IsExternalResource": false,
            "User": {
                "ID": 27940,
                "Username": "5R-MFT "
            },
            "DateCreated": "2020-10-18T02:39:00Z"
        }
    ],
    "IsRecentlyVerified": false,
    "ID": 53609,
    "UUID": "52847BEB-1D6D-48E9-B04A-B8470A40F8AF",
    "DataProviderID": 1,
    "OperatorID": 105,
    "OperatorsReference": "Essent EM-DE-08116077-01-00003",
    "UsageTypeID": 4,
    "AddressInfo": {
        "ID": 53955,
        "Title": "Karlstraße 42-48",
        "AddressLine1": "Karlstraße 42-48",
        "Town": "Filderstadt",
        "Postcode": "70794",
        "CountryID": 87,
        "Latitude": 48.676281,
        "Longitude": 9.222121,
        "DistanceUnit": 0
    },
    "Connections": [
        {
            "ID": 66774,
            "ConnectionTypeID": 25,
            "StatusTypeID": 50,
            "LevelID": 2,
            "Amps": 32,
            "Voltage": 400,
            "PowerKW": 22,
            "CurrentTypeID": 20,
            "Quantity": 2
        }
    ],
    "NumberOfPoints": 2,
    "StatusTypeID": 50,
    "DateLastStatusUpdate": "2020-10-18T02:39:00Z",
    "DataQualityLevel": 3,
    "DateCreated": "2015-09-20T11:50:00Z",
    "SubmissionStatusTypeID": 200
}