{
    "IsRecentlyVerified": false,
    "ID": 123631,
    "UUID": "06ACBD77-358B-4B22-9549-CC9CB76F507D",
    "DataProviderID": 2,
    "DataProvidersReference": "39897",
    "UsageTypeID": 7,
    "AddressInfo": {
        "ID": 123977,
        "Title": "South County Nissan",
        "AddressLine1": "400 Automall Dr",
        "Town": "Gilroy",
        "StateOrProvince": "CA",
        "Postcode": "95020",
        "CountryID": 2,
        "Latitude": 36.996869,
        "Longitude": -121.558573,
        "ContactTelephone1": "408-842-1777",
        "AccessComments": "Dealership business hours\r\nPublic - Call ahead",
        "RelatedURL": "",
        "DistanceUnit": 0
    },
    "Connections": [
        {
            "ID": 173644,
            "ConnectionTypeID": 1,
            "LevelID": 2,
            "Amps": 16,
            "Voltage": 230,
            "PowerKW": 3.7,
            "CurrentTypeID": 10,
            "Quantity": 1
        }
    ],
    "DateLastStatusUpdate": "2020-06-26T02:59:00Z",
    "DataQualityLevel": 3,
    "DateCreated": "2019-04-06T05:03:00Z",
    "SubmissionStatusTypeID": 100
}