{
    "IsRecentlyVerified": false,
    "ID": 174903,
    "UUID": "EDB213AF-4796-4A5C-A96A-28B6817FC103",
    "DataProviderID": 1,
    "OperatorID": 21,
    "UsageTypeID": 4,
    "UsageCost": "Mobi.E compatible card or App",
    "AddressInfo": {
        "ID": 175262,
        "Title": "LRS-00051/52/53 - LoureShopping",
        "AddressLine1": "Avenida das Descobertas",
        "Town": "Loures",
        "StateOrProvince": "Lisboa",
        "Postcode": "2670-457",
        "CountryID": 180,
        "Latitude": 38.834292939787616,
        "Longitude": -9.156350699367295,
        "DistanceUnit": 0
    },
    "Connections": [
        {
            "ID": 271030,
            "ConnectionTypeID": 2,
            "StatusTypeID": 50,
            "LevelID": 3,
            "Amps": 120,
            "Voltage": 500,
            "PowerKW": 50,
            "CurrentTypeID": 30,
            "Quantity": 1
        },
        {
            "ID": 271031,
            "ConnectionTypeID": 33,
            "StatusTypeID": 50,
            "LevelID": 3,
            "Amps": 125,
            "Voltage": 500,
            "PowerKW": 50,
            "CurrentTypeID": 30,
            "Quantity": 1
        },
        {
            "ID": 271032,
            "ConnectionTypeID": 1036,
            "StatusTypeID": 50,
            "LevelID": 3,
            "Amps": 63,
            "Voltage": 400,
            "PowerKW": 43,
            "CurrentTypeID": 20,
            "Quantity": 1
        },
        {
            "ID": 271033,
            "ConnectionTypeID": 25,
            "StatusTypeID": 50,
            "LevelID": 2,
            "Amps": 32,
            "Voltage": 400,
            "PowerKW": 22,
            "CurrentTypeID": 20,
            "Quantity": 4
        }
    ],
    "NumberOfPoints": 6,
    "GeneralComments": "07:30>23:30",
    "StatusTypeID": 50,
    "DateLastStatusUpdate": "2021-04-18T12:24:00Z",
    "DataQualityLevel": 1,
    "DateCreated": "2021-04-18T12:24:00Z",
    "SubmissionStatusTypeID": 200
}