{
    "IsRecentlyVerified": false,
    "ID": 102419,
    "UUID": "236F4D27-58C4-44C5-ACF8-4FC98C01E17F",
    "DataProviderID": 2,
    "DataProvidersReference": "92340",
    "OperatorID": 5,
    "UsageTypeID": 1,
    "AddressInfo": {
        "ID": 102765,
        "Title": "YOO",
        "AddressLine1": "211 13th St NE",
        "Town": "Atlanta",
        "StateOrProvince": "GA",
        "Postcode": "30309",
        "CountryID": 2,
        "Latitude": 33.785083,
        "Longitude": -84.380364,
        "ContactTelephone1": "888-758-4389",
        "AccessComments": "24 hours daily",
        "RelatedURL": "http://www.chargepoint.com/",
        "DistanceUnit": 0
    },
    "Connections": [
        {
            "ID": 144493,
            "ConnectionTypeID": 1,
            "LevelID": 2,
            "Amps": 16,
            "Voltage": 230,
            "PowerKW": 3,
            "CurrentTypeID": 10,
            "Quantity": 4
        }
    ],
    "DateLastStatusUpdate": "2019-04-06T04:01:00Z",
    "DataQualityLevel": 3,
    "DateCreated": "2018-04-21T04:13:00Z",
    "SubmissionStatusTypeID": 100
}