{
    "IsRecentlyVerified": false,
    "ID": 85385,
    "UUID": "B3431CE6-A708-4948-BBC6-9ECD16C46A21",
    "DataProviderID": 1,
    "OperatorID": 45,
    "UsageTypeID": 3,
    "UsageCost": "0,30€/kWh",
    "AddressInfo": {
        "ID": 85731,
        "Title": "Poetzsch Padborg",
        "AddressLine1": "Industrieweg 40",
        "Town": "Harrislee",
        "StateOrProvince": "Kreis Schleswig-Flensburg",
        "Postcode": "24955",
        "CountryID": 87,
        "Latitude": 54.794346129295135,
        "Longitude": 9.373497584130872,
        "AccessComments": "24/7 kostenlos laden ohne Ladekarte",
        "DistanceUnit": 0
    },
    "Connections": [
        {
            "ID": 121423,
            "ConnectionTypeID": 25,
            "StatusTypeID": 50,
            "LevelID": 2,
            "Amps": 32,
            "Voltage": 400,
            "PowerKW": 22,
            "CurrentTypeID": 20,
            "Quantity": 2
        }
    ],
    "NumberOfPoints": 1,
    "StatusTypeID": 50,
    "DateLastStatusUpdate": "2017-04-03T07:44:00Z",
    "DataQualityLevel": 1,
    "DateCreated": "2017-04-03T07:44:00Z",
    "SubmissionStatusTypeID": 200
}