{
    "IsRecentlyVerified": false,
    "ID": 96763,
    "UUID": "2220B8CB-BC94-400E-A067-DE6C41432777",
    "DataProviderID": 2,
    "DataProvidersReference": "88527",
    "UsageTypeID": 1,
    "AddressInfo": {
        "ID": 97109,
        "Title": "Holiday Inn Express & Suites - University Area",
        "AddressLine1": "2350 Jolly Oak Rd",
        "Town": "Okemos",
        "StateOrProvince": "MI",
        "Postcode": "48864",
        "CountryID": 2,
        "Latitude": 42.685194,
        "Longitude": -84.436167,
        "ContactTelephone1": "517-999-8700",
        "AccessComments": "24 hours daily",
        "RelatedURL": "",
        "DistanceUnit": 0
    },
    "Connections": [
        {
            "ID": 137041,
            "ConnectionTypeID": 1,
            "LevelID": 2,
            "Amps": 16,
            "Voltage": 230,
            "PowerKW": 3.7,
            "CurrentTypeID": 10,
            "Quantity": 1
        }
    ],
    "DateLastStatusUpdate": "2020-06-26T03:06:00Z",
    "DataQualityLevel": 3,
    "DateCreated": "2017-12-29T21:01:00Z",
    "SubmissionStatusTypeID": 100
}