{
    "IsRecentlyVerified": false,
    "ID": 141295,
    "UUID": "EFF1AA88-12CC-48C5-B131-A2A49C47B514",
    "DataProviderID": 2,
    "DataProvidersReference": "127673",
    "OperatorID": 3318,
    "UsageTypeID": 1,
    "AddressInfo": {
        "ID": 141647,
        "Title": "Walmart 1161 - St Charles, MO",
        "AddressLine1": "2897 Veterans Memorial Parkway",
        "Town": "St. Charles",
        "StateOrProvince": "MO",
        "Postcode": "63385",
        "CountryID": 2,
        "Latitude": 38.783635,
        "Longitude": -90.527733,
        "ContactTelephone1": "833-632-2778",
        "AccessComments": "24 hours daily",
        "RelatedURL": "https://www.electrifyamerica.com/",
        "DistanceUnit": 0
    },
    "Connections": [
        {
            "ID": 197194,
            "ConnectionTypeID": 2,
            "LevelID": 3,
            "Amps": 100,
            "Voltage": 400,
            "PowerKW": 40,
            "CurrentTypeID": 30,
            "Quantity": 1
        },
        {
            "ID": 197195,
            "ConnectionTypeID": 32,
            "LevelID": 3,
            "Amps": 100,
            "Voltage": 400,
            "PowerKW": 40,
            "CurrentTypeID": 30,
            "Quantity": 1
        }
    ],
    "StatusTypeID": 50,
    "DateLastStatusUpdate": "2020-06-26T03:00:00Z",
    "DataQualityLevel": 3,
    "DateCreated": "2019-12-24T09:15:00Z",
    "SubmissionStatusTypeID": 100
}