{
    "IsRecentlyVerified": false,
    "ID": 32407,
    "UUID": "52267DE4-1ACD-423A-A716-0012797C242C",
    "DataProviderID": 26,
    "DataProvidersReference": "16800",
    "OperatorID": 162,
    "OperatorsReference": "Drossaert J. van Kesselstraat 6",
    "UsageCost": "0.00 gratis",
    "AddressInfo": {
        "ID": 32753,
        "Title": "Dross J. van Kesselstraat 12",
        "AddressLine1": "Dross J. van Kesselstraat 12",
        "Town": "Stein",
        "Postcode": "6171 KC",
        "CountryID": 159,
        "Latitude": 50.969884,
        "Longitude": 5.768353,
        "DistanceUnit": 0
    },
    "Connections": [
        {
            "ID": 35918,
            "ConnectionTypeID": 28,
            "LevelID": 1,
            "PowerKW": 2.3,
            "CurrentTypeID": 10
        }
    ],
    "NumberOfPoints": 1,
    "StatusTypeID": 50,
    "DateLastStatusUpdate": "2016-06-04T02:38:00Z",
    "DataQualityLevel": 3,
    "DateCreated": "2015-01-09T06:03:00Z",
    "SubmissionStatusTypeID": 100
}