{
    "IsRecentlyVerified": false,
    "ID": 48774,
    "UUID": "37B697E5-8CAD-4407-952C-8A6D9EE04D57",
    "DataProviderID": 1,
    "OperatorID": 45,
    "UsageTypeID": 3,
    "AddressInfo": {
        "ID": 49120,
        "Title": "Landhaus Altmühltal",
        "AddressLine1": "Juraring 6",
        "Town": "Kipfenberg",
        "StateOrProvince": "Landkreis Eichstätt",
        "Postcode": "85110",
        "CountryID": 87,
        "Latitude": 48.96121,
        "Longitude": 11.3311200000001,
        "ContactTelephone1": "+49 8465 9599790",
        "AccessComments": "Laden für Gäste kostenlos, jedoch können nach Anmeldung andere auch aufladen.",
        "RelatedURL": "http://www.naturpark-altmuehltal.de/ferienwohnung/landhaus_altmuehltal-1404",
        "DistanceUnit": 0
    },
    "Connections": [
        {
            "ID": 60249,
            "ConnectionTypeID": 25,
            "StatusTypeID": 50,
            "LevelID": 2,
            "Amps": 16,
            "Voltage": 400,
            "PowerKW": 11,
            "CurrentTypeID": 20,
            "Quantity": 1
        }
    ],
    "NumberOfPoints": 1,
    "StatusTypeID": 50,
    "DateLastStatusUpdate": "2015-07-01T06:25:00Z",
    "DataQualityLevel": 1,
    "DateCreated": "2015-07-01T06:03:00Z",
    "SubmissionStatusTypeID": 200
}