{
    "MediaItems": [
        {
            "ID": 561,
            "ChargePointID": 9420,
            "ItemURL": "https://s3-ap-southeast-2.amazonaws.com/openchargemap/images/PT/OCM9420/OCM-9420.orig.2014080105465243.jpg",
            "ItemThumbnailURL": "https://s3-ap-southeast-2.amazonaws.com/openchargemap/images/PT/OCM9420/OCM-9420.thmb.2014080105465243.jpg",
            "Comment": "",
            "IsEnabled": true,
            "IsVideo": false,
            "IsFeaturedItem": false,
            "IsExternalResource": false,
            "User": {
                "ID": 1606,
                "Username": "polianto"
            },
            "DateCreated": "2014-08-01T05:47:00Z"
        }
    ],
    "IsRecentlyVerified": false,
    "ID": 9420,
    "UUID": "E5F4CCC6-6084-47FF-8F3C-879702A102EA",
    "DataProviderID": 1,
    "DataProvidersReference": "LSB-00038",
    "OperatorID": 21,
    "UsageTypeID": 4,
    "UsageCost": "Mobi.E compatible card",
    "AddressInfo": {
        "ID": 9317,
        "Title": "LSB-00038",
        "AddressLine1": "Avenida da Liberdade 177",
        "Town": "Lisboa",
        "Postcode": "1250-141",
        "CountryID": 180,
        "Latitude": 38.720585,
        "Longitude": -9.146472,
        "RelatedURL": "http://www.mobie.pt",
        "DistanceUnit": 0
    },
    "Connections": [
        {
            "ID": 33239,
            "ConnectionTypeID": 25,
            "StatusTypeID": 50,
            "LevelID": 2,
            "Amps": 32,
            "Voltage": 400,
            "PowerKW": 22,
            "CurrentTypeID": 20,
            "Quantity": 2
        }
    ],
    "NumberOfPoints": 2,
    "StatusTypeID": 50,
    "DateLastStatusUpdate": "2020-08-15T11:08:00Z",
    "DataQualityLevel": 3,
    "DateCreated": "2012-02-08T15:15:00Z",
    "SubmissionStatusTypeID": 100
}