{
    "IsRecentlyVerified": false,
    "ID": 110444,
    "UUID": "95CD51DA-655D-4670-9B22-E99C18FB1946",
    "DataProviderID": 2,
    "DataProvidersReference": "102786",
    "UsageTypeID": 1,
    "AddressInfo": {
        "ID": 110790,
        "Title": "Rankin Upholstery",
        "AddressLine1": "8021 Cessna Ave",
        "Town": "Gaithersburg",
        "StateOrProvince": "MD",
        "Postcode": "20879",
        "CountryID": 2,
        "Latitude": 39.172762,
        "Longitude": -77.164172,
        "ContactTelephone1": "410-685-1109",
        "AccessComments": "24 hours daily",
        "RelatedURL": "",
        "DistanceUnit": 0
    },
    "Connections": [
        {
            "ID": 155697,
            "ConnectionTypeID": 1,
            "LevelID": 2,
            "Amps": 16,
            "Voltage": 230,
            "PowerKW": 3.7,
            "CurrentTypeID": 10,
            "Quantity": 2
        }
    ],
    "DateLastStatusUpdate": "2020-06-26T03:01:00Z",
    "DataQualityLevel": 3,
    "DateCreated": "2018-10-18T23:36:00Z",
    "SubmissionStatusTypeID": 100
}