{
    "IsRecentlyVerified": false,
    "ID": 66156,
    "UUID": "6F29F374-E094-40CD-A564-3F84991B3596",
    "DataProviderID": 1,
    "OperatorID": 1240,
    "UsageTypeID": 1,
    "AddressInfo": {
        "ID": 66502,
        "Title": "E-Bike Station Zur Sulzbachhalle",
        "AddressLine1": "Reichenbacher Straße 66c",
        "Town": "Kottweiler-Schwanden",
        "StateOrProvince": "Ramstein-Miesenbach",
        "Postcode": "66879",
        "CountryID": 87,
        "Latitude": 49.480459348970314,
        "Longitude": 7.538205188989662,
        "RelatedURL": "https://www.pfalzwerke.de/energieberatung/9244.php",
        "DistanceUnit": 0
    },
    "Connections": [
        {
            "ID": 91447,
            "ConnectionTypeID": 28,
            "StatusTypeID": 50,
            "LevelID": 1,
            "Amps": 10,
            "Voltage": 230,
            "PowerKW": 2.3,
            "CurrentTypeID": 10,
            "Quantity": 4
        }
    ],
    "NumberOfPoints": 4,
    "StatusTypeID": 50,
    "DateLastStatusUpdate": "2016-05-12T07:37:00Z",
    "DataQualityLevel": 1,
    "DateCreated": "2016-05-12T07:37:00Z",
    "SubmissionStatusTypeID": 200
}