{
    "IsRecentlyVerified": false,
    "ID": 120081,
    "UUID": "1746111C-9CFC-43F0-A961-E4E7B7C3B95B",
    "DataProviderID": 2,
    "DataProvidersReference": "100555",
    "OperatorID": 5,
    "UsageTypeID": 1,
    "AddressInfo": {
        "ID": 120427,
        "Title": "B AUSTIN",
        "AddressLine1": "6700 Manchaca Rd",
        "Town": "Austin",
        "StateOrProvince": "TX",
        "Postcode": "78745",
        "CountryID": 2,
        "Latitude": 30.2064064,
        "Longitude": -97.8070474,
        "ContactTelephone1": "888-758-4389",
        "AccessComments": "24 hours daily",
        "RelatedURL": "http://www.chargepoint.com/",
        "DistanceUnit": 0
    },
    "Connections": [
        {
            "ID": 169398,
            "ConnectionTypeID": 1,
            "LevelID": 2,
            "Amps": 16,
            "Voltage": 230,
            "PowerKW": 3,
            "CurrentTypeID": 10,
            "Quantity": 2
        }
    ],
    "DateLastStatusUpdate": "2019-12-24T09:08:00Z",
    "DataQualityLevel": 3,
    "DateCreated": "2019-04-01T04:59:00Z",
    "SubmissionStatusTypeID": 100
}