{
    "IsRecentlyVerified": false,
    "ID": 87916,
    "UUID": "8A0C2835-4B4C-4BEB-9CCB-12C0B4536142",
    "DataProviderID": 1,
    "OperatorID": 23,
    "OperatorsReference": "29578",
    "UsageTypeID": 6,
    "AddressInfo": {
        "ID": 88262,
        "Title": "Hotel Garden Terme",
        "AddressLine1": "7 Corso Delle Terme",
        "Town": "Montegrotto Terme",
        "Postcode": "35036",
        "CountryID": 112,
        "Latitude": 45.335642,
        "Longitude": 11.781616,
        "ContactTelephone1": "+39 0498 911 699",
        "DistanceUnit": 0
    },
    "Connections": [
        {
            "ID": 124725,
            "ConnectionTypeID": 30,
            "StatusTypeID": 50,
            "LevelID": 2,
            "Amps": 32,
            "Voltage": 400,
            "PowerKW": 22,
            "CurrentTypeID": 20,
            "Quantity": 1
        }
    ],
    "NumberOfPoints": 1,
    "GeneralComments": "1 Tesla Connector, up to 22kW.Available for patrons only. Please call ahead.Seasonal availability. Please call ahead.",
    "StatusTypeID": 50,
    "DateLastStatusUpdate": "2018-10-03T23:50:00Z",
    "DataQualityLevel": 1,
    "DateCreated": "2017-05-18T05:40:00Z",
    "SubmissionStatusTypeID": 200
}