{
    "IsRecentlyVerified": false,
    "ID": 172989,
    "UUID": "45DFC881-4E12-449B-94C7-179C2A5EC26A",
    "DataProviderID": 1,
    "OperatorID": 1,
    "UsageTypeID": 5,
    "AddressInfo": {
        "ID": 173348,
        "Title": "Thon hotel City Centre",
        "AddressLine1": "Avenue du Boulevard 17, 1210 Bruxelles",
        "Town": "Brussels",
        "Postcode": "1210",
        "CountryID": 26,
        "Latitude": 50.85571951990869,
        "Longitude": 4.35760303949246,
        "DistanceUnit": 0
    },
    "Connections": [
        {
            "ID": 264650,
            "ConnectionTypeID": 30,
            "StatusTypeID": 50,
            "Voltage": 400,
            "CurrentTypeID": 20,
            "Quantity": 3
        }
    ],
    "NumberOfPoints": 1,
    "StatusTypeID": 50,
    "DateLastStatusUpdate": "2021-02-26T08:24:00Z",
    "DataQualityLevel": 1,
    "DateCreated": "2021-02-26T07:34:00Z",
    "SubmissionStatusTypeID": 200
}