{
    "IsRecentlyVerified": false,
    "ID": 54635,
    "UUID": "F6F50B5C-54F0-4848-82DF-B3DF70A4F812",
    "DataProviderID": 26,
    "DataProvidersReference": "71066",
    "OperatorID": 178,
    "OperatorsReference": "EVnetNL AL620",
    "UsageCost": "0.00 jaarabonnement",
    "AddressInfo": {
        "ID": 54981,
        "Title": "De Bossche Pad",
        "AddressLine1": "De Bossche Pad",
        "Town": "'s-Hertogenbosch",
        "Postcode": "5211 NV",
        "CountryID": 159,
        "Latitude": 51.690612,
        "Longitude": 5.316944,
        "ContactTelephone1": "0800-3522365",
        "RelatedURL": "http://www.evnet.nl",
        "DistanceUnit": 0
    },
    "Connections": [
        {
            "ID": 68966,
            "ConnectionTypeID": 25,
            "LevelID": 2,
            "PowerKW": 11,
            "CurrentTypeID": 10
        }
    ],
    "NumberOfPoints": 2,
    "StatusTypeID": 50,
    "DateLastStatusUpdate": "2016-06-04T02:40:00Z",
    "DataQualityLevel": 3,
    "DateCreated": "2015-10-09T06:18:00Z",
    "SubmissionStatusTypeID": 100
}