{
    "IsRecentlyVerified": false,
    "ID": 72374,
    "UUID": "9E0CBC57-FB67-4E43-B9E1-5E35D1823642",
    "DataProviderID": 1,
    "OperatorID": 45,
    "UsageTypeID": 1,
    "AddressInfo": {
        "ID": 72720,
        "Title": "Erlebnispark Steinau an der Straße",
        "AddressLine1": "Thalhof 1",
        "Town": "Steinau an der Straße",
        "StateOrProvince": "Main-Kinzig-Kreis",
        "Postcode": "36396",
        "CountryID": 87,
        "Latitude": 50.295689,
        "Longitude": 9.486973499999976,
        "AccessComments": "Nutzbar während der Öffnungszeiten. 3 Schukodosen an der Hauswand mit den Glasbausteinen auf dem Parkplatz.",
        "RelatedURL": "http://www.erlebnispark-steinau.de/",
        "DistanceUnit": 0
    },
    "Connections": [
        {
            "ID": 103691,
            "ConnectionTypeID": 28,
            "StatusTypeID": 50,
            "LevelID": 2,
            "Amps": 16,
            "Voltage": 230,
            "PowerKW": 3.7,
            "CurrentTypeID": 10,
            "Quantity": 3
        }
    ],
    "NumberOfPoints": 3,
    "StatusTypeID": 50,
    "DateLastStatusUpdate": "2016-10-10T06:38:00Z",
    "DataQualityLevel": 1,
    "DateCreated": "2016-10-10T06:38:00Z",
    "SubmissionStatusTypeID": 200
}