{
    "UserComments": [
        {
            "ID": 23104,
            "ChargePointID": 162841,
            "CommentTypeID": 10,
            "UserName": "Robert Seemueller",
            "Rating": 5,
            "DateCreated": "2020-08-18T01:31:26.64Z",
            "User": {
                "ID": 19108,
                "Username": "Robert Seemueller"
            },
            "CheckinStatusTypeID": 140,
            "IsActionedByEditor": false
        }
    ],
    "MediaItems": [
        {
            "ID": 24299,
            "ChargePointID": 162841,
            "ItemURL": "https://s3-ap-southeast-2.amazonaws.com/openchargemap/images/US/OCM162841/OCM-162841.orig.2020081801345264.jpg",
            "ItemThumbnailURL": "https://s3-ap-southeast-2.amazonaws.com/openchargemap/images/US/OCM162841/OCM-162841.thmb.2020081801345264.jpg",
            "Comment": "",
            "IsEnabled": true,
            "IsVideo": false,
            "IsFeaturedItem": false,
            "IsExternalResource": false,
            "User": {
                "ID": 19108,
                "Username": "Robert Seemueller"
            },
            "DateCreated": "2020-08-18T01:35:00Z"
        },
        {
            "ID": 24298,
            "ChargePointID": 162841,
            "ItemURL": "https://s3-ap-southeast-2.amazonaws.com/openchargemap/images/US/OCM162841/OCM-162841.orig.2020081801321750.jpg",
            "ItemThumbnailURL": "https://s3-ap-southeast-2.amazonaws.com/openchargemap/images/US/OCM162841/OCM-162841.thmb.2020081801321750.jpg",
            "Comment": "",
            "IsEnabled": true,
            "IsVideo": false,
            "IsFeaturedItem": false,
            "IsExternalResource": false,
            "User": {
                "ID": 19108,
                "Username": "Robert Seemueller"
            },
            "DateCreated": "2020-08-18T01:32:00Z"
        }
    ],
    "IsRecentlyVerified": false,
    "ID": 162841,
    "UUID": "28F6FB4F-6322-4A20-AFA8-0D26DFCB2777",
    "DataProviderID": 1,
    "OperatorID": 5,
    "UsageTypeID": 1,
    "UsageCost": "$2 hour",
    "AddressInfo": {
        "ID": 163198,
        "Title": "Shatkin Centre Medical Building",
        "AddressLine1": "2500 Kensington Avenue",
        "Town": "Buffalo",
        "StateOrProvince": "NY",
        "Postcode": "14226",
        "CountryID": 2,
        "Latitude": 42.957556999476765,
        "Longitude": -78.76950014684195,
        "DistanceUnit": 0
    },
    "Connections": [
        {
            "ID": 234373,
            "ConnectionTypeID": 1,
            "StatusTypeID": 50,
            "LevelID": 2,
            "Amps": 30,
            "Voltage": 220,
            "PowerKW": 6.6,
            "Quantity": 2
        }
    ],
    "NumberOfPoints": 1,
    "StatusTypeID": 50,
    "DateLastStatusUpdate": "2020-08-18T01:41:00Z",
    "DataQualityLevel": 1,
    "DateCreated": "2020-08-18T01:31:00Z",
    "SubmissionStatusTypeID": 200
}