{
    "IsRecentlyVerified": false,
    "ID": 3400,
    "UUID": "7A6041B9-E458-4651-8380-E627FA727B65",
    "DataProviderID": 1,
    "OperatorID": 6,
    "UsageTypeID": 6,
    "AddressInfo": {
        "ID": 3401,
        "Title": "Ancira Nissan",
        "AddressLine1": "10835 IH 10 West",
        "Town": "San Antonio",
        "StateOrProvince": "TX",
        "Postcode": "78230",
        "CountryID": 2,
        "Latitude": 29.54316,
        "Longitude": -98.5752,
        "ContactTelephone1": "210-558-5001",
        "DistanceUnit": 0
    },
    "Connections": [],
    "NumberOfPoints": 2,
    "GeneralComments": "Cost To Charge: Free Access Hours: Unknown",
    "DateLastStatusUpdate": "2019-12-15T06:07:00Z",
    "DateCreated": "2010-02-28T00:00:00Z",
    "SubmissionStatusTypeID": 200
}