{
    "UserComments": [
        {
            "ID": 4062,
            "ChargePointID": 33969,
            "CommentTypeID": 10,
            "UserName": "My_Leaf",
            "Comment": "North Bound only",
            "Rating": 4,
            "DateCreated": "2015-03-24T14:21:26.16Z",
            "User": {
                "ID": 4511,
                "Username": "My_Leaf"
            },
            "CheckinStatusTypeID": 10
        }
    ],
    "IsRecentlyVerified": false,
    "ID": 33969,
    "UUID": "DEE65729-DC3B-4BD6-ABE3-8C35EA73EDF3",
    "DataProviderID": 1,
    "OperatorID": 103,
    "OperatorsReference": "Allego NLAMSEEFAC00331",
    "UsageTypeID": 4,
    "AddressInfo": {
        "ID": 34315,
        "Title": "AC Restaurant Hendrik-Ido-Ambacht",
        "AddressLine1": "Rijksweg A16",
        "Town": "Hendrik-Ido-Ambacht",
        "Postcode": "3343 LE",
        "CountryID": 159,
        "Latitude": 51.83526,
        "Longitude": 4.619837,
        "ContactTelephone1": "0800-3745337",
        "AccessComments": "A16 nr 3\r\nA16 Afrit 23 North Bound.",
        "RelatedURL": "http://www.allego.eu/",
        "DistanceUnit": 0
    },
    "Connections": [
        {
            "ID": 37480,
            "ConnectionTypeID": 2,
            "StatusTypeID": 50,
            "LevelID": 3,
            "Amps": 120,
            "Voltage": 400,
            "PowerKW": 50,
            "CurrentTypeID": 30,
            "Quantity": 1
        },
        {
            "ID": 46987,
            "ConnectionTypeID": 25,
            "StatusTypeID": 50,
            "LevelID": 2,
            "Amps": 32,
            "Voltage": 220,
            "PowerKW": 43,
            "CurrentTypeID": 20,
            "Quantity": 1
        },
        {
            "ID": 46988,
            "ConnectionTypeID": 33,
            "StatusTypeID": 50,
            "LevelID": 3,
            "Amps": 120,
            "Voltage": 400,
            "PowerKW": 50,
            "CurrentTypeID": 30,
            "Quantity": 1
        }
    ],
    "NumberOfPoints": 1,
    "StatusTypeID": 50,
    "DateLastStatusUpdate": "2015-03-24T17:10:00Z",
    "DataQualityLevel": 3,
    "DateCreated": "2015-01-09T06:04:00Z",
    "SubmissionStatusTypeID": 100
}