{
    "IsRecentlyVerified": false,
    "ID": 114223,
    "UUID": "F990C784-14B7-418C-B8BE-2BD05FF600C3",
    "DataProviderID": 1,
    "OperatorID": 32,
    "OperatorsReference": "1000",
    "UsageTypeID": 4,
    "UsageCost": "Inclusive; for Polar Plus subscription members only",
    "AddressInfo": {
        "ID": 114569,
        "Title": "Unit K",
        "AddressLine1": "Unit K",
        "Town": "Luton",
        "Postcode": "LU1 3LU",
        "CountryID": 1,
        "Latitude": 51.863983,
        "Longitude": -0.407845,
        "DistanceUnit": 0
    },
    "Connections": [
        {
            "ID": 160797,
            "ConnectionTypeID": 25,
            "StatusTypeID": 50,
            "LevelID": 2,
            "Amps": 32,
            "Voltage": 230,
            "PowerKW": 7,
            "CurrentTypeID": 10,
            "Quantity": 2
        }
    ],
    "NumberOfPoints": 2,
    "StatusTypeID": 50,
    "DateLastStatusUpdate": "2019-06-01T05:18:00Z",
    "DataQualityLevel": 1,
    "DateCreated": "2019-01-04T06:14:00Z",
    "SubmissionStatusTypeID": 200
}