{
    "IsRecentlyVerified": false,
    "ID": 165139,
    "UUID": "5D2CAD08-D967-4065-8759-8491EF97199D",
    "DataProviderID": 1,
    "DataProvidersReference": "TR-AKS-001",
    "OperatorID": 70,
    "UsageTypeID": 1,
    "AddressInfo": {
        "ID": 165498,
        "Title": "Eşarj - Nora City AVM, Aksaray",
        "AddressLine1": "Atatürk Bulvarı, 1301 sokak",
        "Town": "Aksaray",
        "StateOrProvince": "Aksaray",
        "Postcode": "68100",
        "CountryID": 229,
        "Latitude": 38.368372,
        "Longitude": 34.030731,
        "ContactTelephone1": "+90 (850) 433 72 75",
        "ContactEmail": "destek@esarj.com",
        "RelatedURL": "https://esarj.com/en/map?s=TR-AKS-001",
        "DistanceUnit": 0
    },
    "Connections": [
        {
            "ID": 236764,
            "ConnectionTypeID": 2,
            "LevelID": 2,
            "Amps": 125,
            "Voltage": 500,
            "PowerKW": 45,
            "Quantity": 1
        },
        {
            "ID": 236765,
            "ConnectionTypeID": 2,
            "LevelID": 2,
            "Amps": 120,
            "Voltage": 500,
            "PowerKW": 45,
            "Quantity": 1
        },
        {
            "ID": 236766,
            "ConnectionTypeID": 2,
            "LevelID": 2,
            "Amps": 32,
            "Voltage": 380,
            "PowerKW": 22,
            "Quantity": 1
        }
    ],
    "GeneralComments": "Eşarj Charging Systems",
    "StatusTypeID": 50,
    "DateLastStatusUpdate": "2020-08-26T08:19:00Z",
    "DataQualityLevel": 3,
    "DateCreated": "2020-08-26T08:19:00Z",
    "SubmissionStatusTypeID": 200
}