{
    "IsRecentlyVerified": false,
    "ID": 158262,
    "UUID": "062C4E1C-8035-4805-9A22-9B61A3ED20C0",
    "DataProviderID": 2,
    "DataProvidersReference": "156809",
    "OperatorID": 5,
    "UsageTypeID": 1,
    "AddressInfo": {
        "ID": 158616,
        "Title": "LT LOT STATIONS",
        "AddressLine1": "14625 Airport Pkwy",
        "Town": "Clearwater",
        "StateOrProvince": "FL",
        "Postcode": "33762",
        "CountryID": 2,
        "Latitude": 27.905746,
        "Longitude": -82.6913389,
        "ContactTelephone1": "888-758-4389",
        "AccessComments": "24 hours daily",
        "RelatedURL": "http://www.chargepoint.com/",
        "DistanceUnit": 0
    },
    "Connections": [
        {
            "ID": 228218,
            "ConnectionTypeID": 1,
            "LevelID": 2,
            "Amps": 16,
            "Voltage": 230,
            "PowerKW": 3.7,
            "CurrentTypeID": 10,
            "Quantity": 2
        }
    ],
    "StatusTypeID": 50,
    "DateLastStatusUpdate": "2020-06-26T02:52:00Z",
    "DataQualityLevel": 3,
    "DateCreated": "2020-06-26T02:52:00Z",
    "SubmissionStatusTypeID": 100
}