{
    "IsRecentlyVerified": false,
    "ID": 110087,
    "UUID": "82C91593-4898-45DF-8C56-38758027DF3C",
    "DataProviderID": 2,
    "DataProvidersReference": "103799",
    "UsageTypeID": 1,
    "AddressInfo": {
        "ID": 110433,
        "Title": "LADWP - West L Street",
        "AddressLine1": "908 7/8 W L St",
        "Town": "Wilmington",
        "StateOrProvince": "CA",
        "Postcode": "90744",
        "CountryID": 2,
        "Latitude": 33.786251,
        "Longitude": -118.274069,
        "ContactTelephone1": "800-342-5397",
        "AccessComments": "24 hours daily",
        "RelatedURL": "",
        "DistanceUnit": 0
    },
    "Connections": [
        {
            "ID": 155318,
            "ConnectionTypeID": 1,
            "LevelID": 2,
            "Amps": 16,
            "Voltage": 230,
            "PowerKW": 3,
            "CurrentTypeID": 10,
            "Quantity": 1
        }
    ],
    "DateLastStatusUpdate": "2019-04-06T04:01:00Z",
    "DataQualityLevel": 3,
    "DateCreated": "2018-10-18T23:35:00Z",
    "SubmissionStatusTypeID": 100
}