{
    "IsRecentlyVerified": false,
    "ID": 123800,
    "UUID": "B2A0C31E-7C13-4E38-967C-2EA1E82A2811",
    "DataProviderID": 2,
    "DataProvidersReference": "64540",
    "UsageTypeID": 2,
    "AddressInfo": {
        "ID": 124146,
        "Title": "Evergy - Parsons Service Center",
        "AddressLine1": "2605 Flynn Dr",
        "Town": "Parsons",
        "StateOrProvince": "KS",
        "Postcode": "67357",
        "CountryID": 2,
        "Latitude": 37.373189,
        "Longitude": -95.262514,
        "ContactTelephone1": "",
        "AccessComments": "Fleet use only",
        "RelatedURL": "",
        "DistanceUnit": 0
    },
    "Connections": [
        {
            "ID": 173827,
            "ConnectionTypeID": 1,
            "LevelID": 2,
            "Amps": 16,
            "Voltage": 230,
            "PowerKW": 3.7,
            "CurrentTypeID": 10,
            "Quantity": 1
        }
    ],
    "DateLastStatusUpdate": "2020-06-26T02:59:00Z",
    "DataQualityLevel": 3,
    "DateCreated": "2019-04-06T05:03:00Z",
    "SubmissionStatusTypeID": 100
}