{
    "IsRecentlyVerified": false,
    "ID": 75668,
    "UUID": "DBE519D3-0875-4683-9330-C6C9E8BBDD5E",
    "DataProviderID": 1,
    "OperatorID": 101,
    "UsageTypeID": 4,
    "AddressInfo": {
        "ID": 76014,
        "Title": "E-Bike Station",
        "AddressLine1": "Untere Schlachthausgasse",
        "AddressLine2": "Eisenhammer",
        "Town": "Lohr am Main",
        "StateOrProvince": "Landkreis Main-Spessart",
        "Postcode": "97816",
        "CountryID": 87,
        "Latitude": 49.99464469999999,
        "Longitude": 9.574415499999986,
        "AccessComments": "24/7 nutzbar mit The New Motion, Z.E. Pass, PlugSurfing Ladekarte oder PlugSurfing App. Unbekannt ob auch mit Elektroautos nutzbar.",
        "RelatedURL": "http://www.charge-it-mobility.com/de/ueber-uns/ladebox-standorte/",
        "DistanceUnit": 0
    },
    "Connections": [
        {
            "ID": 109127,
            "ConnectionTypeID": 28,
            "StatusTypeID": 50,
            "LevelID": 2,
            "Amps": 16,
            "Voltage": 230,
            "PowerKW": 3.7,
            "CurrentTypeID": 10,
            "Quantity": 10
        }
    ],
    "NumberOfPoints": 10,
    "GeneralComments": "Belectric heißt nun \"chargeIT mobility\".",
    "StatusTypeID": 50,
    "DateLastStatusUpdate": "2016-12-19T09:01:00Z",
    "DataQualityLevel": 1,
    "DateCreated": "2016-12-19T09:01:00Z",
    "SubmissionStatusTypeID": 200
}