{
    "IsRecentlyVerified": false,
    "ID": 74756,
    "UUID": "7BF746D8-0DAC-4321-B546-98BCE1364120",
    "DataProviderID": 1,
    "DataProvidersReference": "3643",
    "OperatorID": 1,
    "AddressInfo": {
        "ID": 75102,
        "Title": "Coop Domus Støren",
        "AddressLine1": "Stasjonsveien 7",
        "Town": "STØREN",
        "StateOrProvince": "Trøndelag",
        "Postcode": "7290",
        "CountryID": 168,
        "Latitude": 63.04915,
        "Longitude": 10.28375,
        "AccessComments": "",
        "DistanceUnit": 0
    },
    "Connections": [
        {
            "ID": 107737,
            "ConnectionTypeID": 33,
            "Reference": "1",
            "StatusTypeID": 50,
            "LevelID": 3,
            "Amps": 100,
            "Voltage": 500,
            "PowerKW": 50,
            "CurrentTypeID": 30,
            "Quantity": 2,
            "Comments": "Mode 4"
        },
        {
            "ID": 107738,
            "ConnectionTypeID": 2,
            "Reference": "2",
            "StatusTypeID": 50,
            "LevelID": 3,
            "Amps": 100,
            "Voltage": 500,
            "PowerKW": 50,
            "CurrentTypeID": 30,
            "Quantity": 2,
            "Comments": "Mode 4"
        },
        {
            "ID": 107741,
            "ConnectionTypeID": 25,
            "Reference": "5",
            "LevelID": 2,
            "Amps": 32,
            "Voltage": 400,
            "PowerKW": 22,
            "CurrentTypeID": 20,
            "Quantity": 2,
            "Comments": "Mode 3"
        }
    ],
    "NumberOfPoints": 6,
    "GeneralComments": "Fortum",
    "StatusTypeID": 50,
    "DateLastStatusUpdate": "2020-08-27T11:03:00Z",
    "DataQualityLevel": 2,
    "DateCreated": "2016-12-03T02:36:00Z",
    "SubmissionStatusTypeID": 100
}