{
    "IsRecentlyVerified": false,
    "ID": 145036,
    "UUID": "D02089BC-81CF-459C-A332-FAE1CDC9BBB8",
    "DataProviderID": 1,
    "OperatorID": 3365,
    "UsageTypeID": 1,
    "AddressInfo": {
        "ID": 145388,
        "Title": "Parc provincial Parlee Beach provincial park",
        "AddressLine1": "45 Parlee Beach Rd",
        "Town": "Pointe du chene",
        "StateOrProvince": "NB",
        "Postcode": "E4P 8V5",
        "CountryID": 44,
        "Latitude": 46.229838,
        "Longitude": -64.508631,
        "ContactTelephone1": "844-661-6272",
        "AccessComments": "24 hours daily",
        "RelatedURL": "https://echargenetwork.com/",
        "DistanceUnit": 0
    },
    "Connections": [
        {
            "ID": 201619,
            "ConnectionTypeID": 1,
            "LevelID": 2,
            "Amps": 16,
            "Voltage": 230,
            "PowerKW": 3.7,
            "CurrentTypeID": 10,
            "Quantity": 2
        }
    ],
    "StatusTypeID": 50,
    "DateLastStatusUpdate": "2020-11-20T14:21:00Z",
    "DataQualityLevel": 3,
    "DateCreated": "2019-12-24T09:24:00Z",
    "SubmissionStatusTypeID": 100
}