{
    "IsRecentlyVerified": false,
    "ID": 123355,
    "UUID": "8E49518A-8B12-4B6E-99DA-F9C0E5B21124",
    "DataProviderID": 2,
    "DataProvidersReference": "104948",
    "OperatorID": 5,
    "UsageTypeID": 1,
    "AddressInfo": {
        "ID": 123701,
        "Title": "JLR TULSA",
        "AddressLine1": "3905 S Memorial Dr",
        "Town": "Tulsa",
        "StateOrProvince": "OK",
        "Postcode": "74145",
        "CountryID": 2,
        "Latitude": 36.107036,
        "Longitude": -95.885946,
        "ContactTelephone1": "888-758-4389",
        "AccessComments": "24 hours daily",
        "RelatedURL": "http://www.chargepoint.com/",
        "DistanceUnit": 0
    },
    "Connections": [
        {
            "ID": 173321,
            "ConnectionTypeID": 1,
            "LevelID": 2,
            "Amps": 16,
            "Voltage": 230,
            "PowerKW": 3,
            "CurrentTypeID": 10,
            "Quantity": 2
        }
    ],
    "DateLastStatusUpdate": "2019-04-06T05:03:00Z",
    "DataQualityLevel": 3,
    "DateCreated": "2019-04-06T05:03:00Z",
    "SubmissionStatusTypeID": 100
}