{
    "IsRecentlyVerified": false,
    "ID": 160558,
    "UUID": "2B4B2E8C-01FD-4B12-AFC3-3FAB8F9AEF4D",
    "DataProviderID": 2,
    "DataProvidersReference": "152263",
    "OperatorID": 9,
    "UsageTypeID": 1,
    "AddressInfo": {
        "ID": 160915,
        "Title": "Riverstone Apartment Homes",
        "AddressLine1": "27314 24th Ave S.",
        "Town": "Federal Way",
        "StateOrProvince": "WA",
        "Postcode": "98003",
        "CountryID": 2,
        "Latitude": 47.357329,
        "Longitude": -122.301971,
        "ContactTelephone1": "888-998-2546",
        "AccessComments": "MON: 24 hours | TUE: 24 hours | WED: 24 hours | THU: 24 hours | FRI: 24 hours | SAT: 24 hours | SUN: 24 hours",
        "RelatedURL": "http://www.blinkcharging.com/",
        "DistanceUnit": 0
    },
    "Connections": [
        {
            "ID": 231024,
            "ConnectionTypeID": 1,
            "LevelID": 2,
            "Amps": 16,
            "Voltage": 230,
            "PowerKW": 3.7,
            "CurrentTypeID": 10,
            "Quantity": 1
        }
    ],
    "StatusTypeID": 50,
    "DateLastStatusUpdate": "2020-06-26T03:10:00Z",
    "DataQualityLevel": 3,
    "DateCreated": "2020-06-26T03:10:00Z",
    "SubmissionStatusTypeID": 100
}