{
    "IsRecentlyVerified": false,
    "ID": 84588,
    "UUID": "4836EEB8-9779-4901-887D-A48FFD2F9B29",
    "DataProviderID": 1,
    "OperatorID": 23,
    "OperatorsReference": "25346",
    "UsageTypeID": 4,
    "AddressInfo": {
        "ID": 84934,
        "Title": "Sparrows Lodge",
        "AddressLine1": "1330 E Palm Canyon DR",
        "Town": "Palm Springs",
        "StateOrProvince": "California",
        "Postcode": "92264",
        "CountryID": 2,
        "Latitude": 33.801901,
        "Longitude": -116.532388,
        "ContactTelephone1": "(760) 327-2300",
        "DistanceUnit": 0
    },
    "Connections": [
        {
            "ID": 120154,
            "ConnectionTypeID": 30,
            "StatusTypeID": 50,
            "LevelID": 2,
            "PowerKW": 8,
            "CurrentTypeID": 10,
            "Quantity": 1
        }
    ],
    "NumberOfPoints": 1,
    "GeneralComments": "1 Tesla Connector, up to 8kW.Available for customers. Self park.",
    "StatusTypeID": 50,
    "DateLastStatusUpdate": "2017-06-09T14:18:00Z",
    "DataQualityLevel": 1,
    "DateCreated": "2017-03-04T06:37:00Z",
    "SubmissionStatusTypeID": 200
}