{
    "IsRecentlyVerified": false,
    "ID": 143898,
    "UUID": "8604361A-A1CA-4921-8651-02D414E534EA",
    "DataProviderID": 2,
    "DataProvidersReference": "122746",
    "UsageTypeID": 1,
    "AddressInfo": {
        "ID": 144250,
        "Title": "Cross Insurance Center",
        "AddressLine1": "515 Main St",
        "Town": "Bangor",
        "StateOrProvince": "ME",
        "Postcode": "04401",
        "CountryID": 2,
        "Latitude": 44.789149,
        "Longitude": -68.778904,
        "ContactTelephone1": "207-561-8300",
        "AccessComments": "24 hours daily",
        "RelatedURL": "",
        "DistanceUnit": 0
    },
    "Connections": [
        {
            "ID": 200320,
            "ConnectionTypeID": 1,
            "LevelID": 2,
            "Amps": 16,
            "Voltage": 230,
            "PowerKW": 3.7,
            "CurrentTypeID": 10,
            "Quantity": 2
        }
    ],
    "StatusTypeID": 50,
    "DateLastStatusUpdate": "2020-06-26T03:08:00Z",
    "DataQualityLevel": 3,
    "DateCreated": "2019-12-24T09:22:00Z",
    "SubmissionStatusTypeID": 100
}