{
    "IsRecentlyVerified": false,
    "ID": 38895,
    "UUID": "EC820F65-41BE-4B29-A01F-02CD17453B76",
    "DataProviderID": 1,
    "OperatorID": 105,
    "OperatorsReference": "Essent EM-DE-03358021-01-00001",
    "UsageTypeID": 4,
    "UsageCost": "",
    "AddressInfo": {
        "ID": 39241,
        "Title": "Blumenstraße 6",
        "AddressLine1": "Blumenstraße 6",
        "AddressLine2": "",
        "Town": "Soltau",
        "StateOrProvince": "",
        "Postcode": "29614",
        "CountryID": 87,
        "Latitude": 52.985262,
        "Longitude": 9.837858,
        "ContactTelephone1": "",
        "ContactTelephone2": "",
        "ContactEmail": "",
        "AccessComments": "Zufahrt über die Nebenstraße, an der auch das Finanzamt liegt. 24/7 nutzbar, Parkverbot ausgenommen Elektrofahrzeuge zum Laden.",
        "RelatedURL": "http://www.sw-soltau.de/",
        "DistanceUnit": 0
    },
    "Connections": [
        {
            "ID": 42406,
            "ConnectionTypeID": 25,
            "StatusTypeID": 50,
            "LevelID": 2,
            "Amps": 32,
            "Voltage": 400,
            "PowerKW": 22,
            "CurrentTypeID": 10,
            "Quantity": 2
        }
    ],
    "NumberOfPoints": 2,
    "GeneralComments": "",
    "StatusTypeID": 50,
    "DateLastStatusUpdate": "2015-10-30T22:07:00Z",
    "DataQualityLevel": 3,
    "DateCreated": "2015-01-09T06:08:00Z",
    "SubmissionStatusTypeID": 200
}