{
    "IsRecentlyVerified": false,
    "ID": 186439,
    "UUID": "8603D44E-198C-4B5B-B1DC-C097370DBBBA",
    "DataProviderID": 29,
    "DataProvidersReference": "15752",
    "AddressInfo": {
        "ID": 186798,
        "Title": "Posadowskyanlagen 7",
        "AddressLine1": "Posadowskyanlagen 7",
        "Town": "Leipzig",
        "Postcode": "04317",
        "CountryID": 87,
        "Latitude": 51.331403,
        "Longitude": 12.415501,
        "DistanceUnit": 0
    },
    "Connections": [
        {
            "ID": 299136,
            "ConnectionTypeID": 25,
            "StatusTypeID": 50,
            "LevelID": 2,
            "PowerKW": 22,
            "CurrentTypeID": 20
        },
        {
            "ID": 299137,
            "ConnectionTypeID": 25,
            "StatusTypeID": 50,
            "LevelID": 2,
            "PowerKW": 22,
            "CurrentTypeID": 20
        }
    ],
    "StatusTypeID": 50,
    "DateLastStatusUpdate": "2021-07-12T02:47:00Z",
    "MetadataValues": [
        {
            "ID": 18680,
            "MetadataFieldID": 4,
            "ItemValue": "Data from the German chargepoint registry provided by Bundesnetzagentur.de under the CC-BY 4.0 license"
        }
    ],
    "DataQualityLevel": 3,
    "DateCreated": "2021-07-12T02:47:00Z",
    "SubmissionStatusTypeID": 100
}