{
    "IsRecentlyVerified": false,
    "ID": 127210,
    "UUID": "F55D0305-87CB-4E3D-9200-0A1F7C1A6C31",
    "DataProviderID": 1,
    "OperatorID": 3,
    "OperatorsReference": "PG-82387,PG-82390,PG-82391",
    "UsageTypeID": 4,
    "UsageCost": "£0.18/kWh",
    "AddressInfo": {
        "ID": 127556,
        "Title": "Ucs Sports Pavillion (main Car Park)",
        "AddressLine1": "Ranulf Road",
        "Town": "Cricklewood",
        "StateOrProvince": "London",
        "Postcode": "NW2 2BS",
        "CountryID": 1,
        "Latitude": 51.557776,
        "Longitude": -0.202472,
        "DistanceUnit": 0
    },
    "Connections": [
        {
            "ID": 178126,
            "ConnectionTypeID": 25,
            "StatusTypeID": 50,
            "LevelID": 2,
            "Amps": 32,
            "Voltage": 230,
            "PowerKW": 7,
            "CurrentTypeID": 10,
            "Quantity": 6
        }
    ],
    "NumberOfPoints": 6,
    "GeneralComments": "This is an open charge unit installed at the UCS Sports Pavillion site at Ranulf Road, Cricklewood, London",
    "StatusTypeID": 50,
    "DateLastStatusUpdate": "2021-03-01T06:22:00Z",
    "DataQualityLevel": 1,
    "DateCreated": "2019-05-30T05:31:00Z",
    "SubmissionStatusTypeID": 200
}