{
    "IsRecentlyVerified": false,
    "ID": 50451,
    "UUID": "217234F3-B22C-4034-8D70-1C79521D2F32",
    "DataProviderID": 2,
    "DataProvidersReference": "68402",
    "UsageTypeID": 1,
    "AddressInfo": {
        "ID": 50797,
        "Title": "California State University - Stanislaus",
        "AddressLine1": "1 University Cir",
        "Town": "Turlock",
        "StateOrProvince": "CA",
        "Postcode": "95382",
        "CountryID": 2,
        "Latitude": 37.522473,
        "Longitude": -120.860467,
        "ContactTelephone1": "209-667-3114",
        "AccessComments": "24 hours daily; parking permit required",
        "RelatedURL": "",
        "DistanceUnit": 0
    },
    "Connections": [
        {
            "ID": 62152,
            "ConnectionTypeID": 1,
            "LevelID": 2,
            "Amps": 16,
            "Voltage": 230,
            "PowerKW": 3.7,
            "CurrentTypeID": 10,
            "Quantity": 2
        }
    ],
    "DateLastStatusUpdate": "2020-06-26T02:59:00Z",
    "DataQualityLevel": 3,
    "DateCreated": "2015-07-22T08:57:00Z",
    "SubmissionStatusTypeID": 100
}