{
    "IsRecentlyVerified": false,
    "ID": 112516,
    "UUID": "B4A0596F-3C25-40E0-A446-866400D08662",
    "DataProviderID": 1,
    "OperatorID": 80,
    "UsageTypeID": 4,
    "AddressInfo": {
        "ID": 112862,
        "Title": "Genova Sampierdarena FS | EnelX",
        "AddressLine1": "Piazza Nicolò Montano, 2",
        "Town": "Genova",
        "StateOrProvince": "GE",
        "Postcode": "16151",
        "CountryID": 112,
        "Latitude": 44.41293232228373,
        "Longitude": 8.88820785248231,
        "ContactTelephone1": "800.069.850",
        "RelatedURL": "https://www.enelx.com/it/it/emobility",
        "DistanceUnit": 0
    },
    "Connections": [
        {
            "ID": 158287,
            "ConnectionTypeID": 25,
            "StatusTypeID": 50,
            "LevelID": 2,
            "Amps": 32,
            "Voltage": 400,
            "PowerKW": 22,
            "CurrentTypeID": 20,
            "Quantity": 1
        },
        {
            "ID": 158288,
            "ConnectionTypeID": 36,
            "StatusTypeID": 50,
            "LevelID": 2,
            "Amps": 16,
            "Voltage": 240,
            "PowerKW": 3.7,
            "CurrentTypeID": 10,
            "Quantity": 1
        }
    ],
    "NumberOfPoints": 2,
    "StatusTypeID": 50,
    "DateLastStatusUpdate": "2018-11-05T13:45:00Z",
    "DataQualityLevel": 1,
    "DateCreated": "2018-11-05T13:45:00Z",
    "SubmissionStatusTypeID": 200
}