{
    "IsRecentlyVerified": false,
    "ID": 187995,
    "UUID": "3E560F52-39B8-456F-AE91-C9321318C334",
    "DataProviderID": 18,
    "DataProvidersReference": "49b483035eca9a38f59812a8f957310c",
    "OperatorID": 150,
    "UsageTypeID": 5,
    "AddressInfo": {
        "ID": 188354,
        "Title": "Springhill, Wellington",
        "AddressLine1": "Springhill, Wellington",
        "Town": "Telford",
        "Postcode": "TF1 1RP",
        "CountryID": 1,
        "Latitude": 52.702351,
        "Longitude": -2.522811,
        "AccessComments": "",
        "RelatedURL": "http://www.chargepointservices.com/",
        "DistanceUnit": 0
    },
    "Connections": [
        {
            "ID": 303343,
            "ConnectionTypeID": 25,
            "Reference": "1",
            "StatusTypeID": 50,
            "LevelID": 2,
            "Amps": 32,
            "Voltage": 400,
            "PowerKW": 22,
            "CurrentTypeID": 20
        },
        {
            "ID": 303344,
            "ConnectionTypeID": 2,
            "Reference": "2",
            "StatusTypeID": 50,
            "LevelID": 3,
            "Amps": 125,
            "Voltage": 400,
            "PowerKW": 50,
            "CurrentTypeID": 30
        },
        {
            "ID": 303345,
            "ConnectionTypeID": 1036,
            "Reference": "3",
            "StatusTypeID": 50,
            "LevelID": 3,
            "Amps": 125,
            "Voltage": 400,
            "PowerKW": 50,
            "CurrentTypeID": 30
        }
    ],
    "StatusTypeID": 0,
    "DateLastStatusUpdate": "2021-07-12T03:39:00Z",
    "MetadataValues": [
        {
            "ID": 20235,
            "MetadataFieldID": 4,
            "ItemValue": "Contains public sector information licensed under the Open Government Licence v2.0. http://www.nationalarchives.gov.uk/doc/open-government-licence/version/2/"
        }
    ],
    "DataQualityLevel": 3,
    "DateCreated": "2021-07-12T03:39:00Z",
    "SubmissionStatusTypeID": 100
}