{
    "IsRecentlyVerified": false,
    "ID": 75119,
    "UUID": "C02D2DB7-1F2A-4A7C-8612-ECDC22027165",
    "DataProviderID": 1,
    "OperatorID": 218,
    "UsageTypeID": 4,
    "AddressInfo": {
        "ID": 75465,
        "Title": "GOVECS",
        "AddressLine1": "Graniczna 8c",
        "AddressLine2": "Osiedle Muchobór Wielki",
        "Town": "Wrocław",
        "StateOrProvince": "Wrocław",
        "Postcode": "54-610",
        "CountryID": 179,
        "Latitude": 51.104915,
        "Longitude": 16.929485,
        "ContactEmail": "kontakt@galactico.pl",
        "AccessComments": "The charge station is run by Galactico.pl and at this time requires a special Galactico member card. During work hours of 7-16 a charge card can be provided by GOVECS employees.",
        "RelatedURL": "http://www.galactico.pl",
        "DistanceUnit": 0
    },
    "Connections": [
        {
            "ID": 108326,
            "ConnectionTypeID": 25,
            "StatusTypeID": 50,
            "LevelID": 2,
            "Amps": 32,
            "Voltage": 400,
            "PowerKW": 22,
            "CurrentTypeID": 20,
            "Quantity": 1
        },
        {
            "ID": 108327,
            "ConnectionTypeID": 23,
            "StatusTypeID": 50,
            "LevelID": 2,
            "Amps": 16,
            "Voltage": 230,
            "PowerKW": 3.5,
            "CurrentTypeID": 10,
            "Quantity": 2
        }
    ],
    "NumberOfPoints": 1,
    "StatusTypeID": 50,
    "DateLastStatusUpdate": "2016-12-11T19:09:00Z",
    "DataQualityLevel": 1,
    "DateCreated": "2016-12-11T19:09:00Z",
    "SubmissionStatusTypeID": 200
}