{
    "IsRecentlyVerified": false,
    "ID": 32304,
    "UUID": "E1653726-5B10-423E-B6E7-0BBC18063424",
    "DataProviderID": 1,
    "OperatorID": 105,
    "OperatorsReference": "Essent EM-DE-05362032-01-00005",
    "UsageTypeID": 4,
    "AddressInfo": {
        "ID": 32650,
        "Title": "Marienstr. 3",
        "AddressLine1": "Marienstr. 3",
        "Town": "Kerpen",
        "Postcode": "50171",
        "CountryID": 87,
        "Latitude": 50.871703,
        "Longitude": 6.693809,
        "DistanceUnit": 0
    },
    "Connections": [
        {
            "ID": 35815,
            "ConnectionTypeID": 25,
            "LevelID": 2,
            "PowerKW": 11
        },
        {
            "ID": 46335,
            "ConnectionTypeID": 25,
            "LevelID": 2,
            "PowerKW": 11
        }
    ],
    "NumberOfPoints": 1,
    "StatusTypeID": 50,
    "DateLastStatusUpdate": "2015-04-14T00:40:00Z",
    "DataQualityLevel": 3,
    "DateCreated": "2015-01-09T06:03:00Z",
    "SubmissionStatusTypeID": 200
}