{
    "IsRecentlyVerified": false,
    "ID": 52567,
    "UUID": "88ECC83B-D4D8-4BE1-A615-B23CA236F26F",
    "DataProviderID": 1,
    "OperatorID": 1,
    "UsageTypeID": 4,
    "AddressInfo": {
        "ID": 52913,
        "Title": "Ripoll",
        "AddressLine1": "Carrer del Doctor Raguer, 2",
        "Town": "Ripoll",
        "StateOrProvince": "Girona",
        "Postcode": "17500",
        "CountryID": 210,
        "Latitude": 42.2009054,
        "Longitude": 2.19107989999998,
        "ContactTelephone1": "972714142",
        "ContactEmail": "sac@ajripoll.cat",
        "AccessComments": "Se necesita tarjeta del ayuntamiento, 30 euros.",
        "DistanceUnit": 0
    },
    "Connections": [
        {
            "ID": 65288,
            "ConnectionTypeID": 25,
            "StatusTypeID": 50,
            "Quantity": 1
        },
        {
            "ID": 65289,
            "ConnectionTypeID": 28,
            "StatusTypeID": 50,
            "Quantity": 1
        }
    ],
    "NumberOfPoints": 2,
    "StatusTypeID": 50,
    "DateLastStatusUpdate": "2015-09-04T19:41:00Z",
    "DataQualityLevel": 1,
    "DateCreated": "2015-09-03T12:03:00Z",
    "SubmissionStatusTypeID": 200
}