{
    "MediaItems": [
        {
            "ID": 15759,
            "ChargePointID": 65250,
            "ItemURL": "https://s3-ap-southeast-2.amazonaws.com/openchargemap/images/IT/OCM65250/OCM-65250.orig.2018062515375176.jpg",
            "ItemThumbnailURL": "https://s3-ap-southeast-2.amazonaws.com/openchargemap/images/IT/OCM65250/OCM-65250.thmb.2018062515375176.jpg",
            "Comment": "",
            "IsEnabled": true,
            "IsVideo": false,
            "IsFeaturedItem": false,
            "IsExternalResource": false,
            "User": {
                "ID": 1606,
                "Username": "polianto"
            },
            "DateCreated": "2018-06-25T15:38:00Z"
        },
        {
            "ID": 15758,
            "ChargePointID": 65250,
            "ItemURL": "https://s3-ap-southeast-2.amazonaws.com/openchargemap/images/IT/OCM65250/OCM-65250.orig.2018062515330770.jpg",
            "ItemThumbnailURL": "https://s3-ap-southeast-2.amazonaws.com/openchargemap/images/IT/OCM65250/OCM-65250.thmb.2018062515330770.jpg",
            "Comment": "",
            "IsEnabled": true,
            "IsVideo": false,
            "IsFeaturedItem": false,
            "IsExternalResource": false,
            "User": {
                "ID": 1606,
                "Username": "polianto"
            },
            "DateCreated": "2018-06-25T15:33:00Z"
        }
    ],
    "IsRecentlyVerified": false,
    "ID": 65250,
    "UUID": "45B708C9-5210-4219-8614-E3B7C46DCDEF",
    "DataProviderID": 1,
    "OperatorID": 82,
    "UsageTypeID": 4,
    "AddressInfo": {
        "ID": 65596,
        "Title": "A2A Q8 Easy",
        "AddressLine1": "viale Serra Ang. Salmoiraghi",
        "Town": "Milano",
        "StateOrProvince": "MI",
        "Postcode": "20148",
        "CountryID": 112,
        "Latitude": 45.48400708645978,
        "Longitude": 9.14294898609171,
        "DistanceUnit": 0
    },
    "Connections": [
        {
            "ID": 149994,
            "ConnectionTypeID": 25,
            "StatusTypeID": 100,
            "LevelID": 2,
            "Quantity": 2
        },
        {
            "ID": 149995,
            "ConnectionTypeID": 36,
            "StatusTypeID": 100,
            "LevelID": 2,
            "Amps": 16,
            "Voltage": 240,
            "PowerKW": 3.7,
            "CurrentTypeID": 10,
            "Quantity": 2
        }
    ],
    "NumberOfPoints": 2,
    "StatusTypeID": 100,
    "DateLastStatusUpdate": "2018-06-25T15:41:00Z",
    "DataQualityLevel": 1,
    "DateCreated": "2016-04-24T14:57:00Z",
    "SubmissionStatusTypeID": 200
}