{
    "IsRecentlyVerified": false,
    "ID": 158367,
    "UUID": "78515C81-BFC6-4B48-8D3F-5B4E1F36162F",
    "DataProviderID": 2,
    "DataProvidersReference": "163388",
    "UsageTypeID": 1,
    "AddressInfo": {
        "ID": 158721,
        "Title": "Renaissance Montgomery Hotel & Spa at the Convention Center",
        "AddressLine1": "201 Tallapoosa St",
        "Town": "Montgomery",
        "StateOrProvince": "AL",
        "Postcode": "36104",
        "CountryID": 2,
        "Latitude": 32.379517,
        "Longitude": -86.312503,
        "ContactTelephone1": "334-481-5000",
        "AccessComments": "24 hours daily; for guest use only; see valet for access",
        "RelatedURL": "",
        "DistanceUnit": 0
    },
    "Connections": [
        {
            "ID": 228336,
            "ConnectionTypeID": 1,
            "LevelID": 2,
            "Amps": 16,
            "Voltage": 230,
            "PowerKW": 3.7,
            "CurrentTypeID": 10,
            "Quantity": 2
        }
    ],
    "StatusTypeID": 50,
    "DateLastStatusUpdate": "2020-06-26T02:54:00Z",
    "DataQualityLevel": 3,
    "DateCreated": "2020-06-26T02:54:00Z",
    "SubmissionStatusTypeID": 100
}