{
    "IsRecentlyVerified": false,
    "ID": 182997,
    "UUID": "A6B83551-CEF1-4488-896A-4846F165D280",
    "DataProviderID": 29,
    "DataProvidersReference": "12819",
    "AddressInfo": {
        "ID": 183356,
        "Title": "Hintergasse 15",
        "AddressLine1": "Hintergasse 15",
        "Town": "Rodgau",
        "Postcode": "63110",
        "CountryID": 87,
        "Latitude": 50.025778,
        "Longitude": 8.884381,
        "DistanceUnit": 0
    },
    "Connections": [
        {
            "ID": 289427,
            "ConnectionTypeID": 25,
            "StatusTypeID": 50,
            "LevelID": 2,
            "PowerKW": 22,
            "CurrentTypeID": 20
        },
        {
            "ID": 289428,
            "ConnectionTypeID": 25,
            "StatusTypeID": 50,
            "LevelID": 2,
            "PowerKW": 22,
            "CurrentTypeID": 20
        }
    ],
    "StatusTypeID": 50,
    "DateLastStatusUpdate": "2021-07-12T02:44:00Z",
    "MetadataValues": [
        {
            "ID": 15290,
            "MetadataFieldID": 4,
            "ItemValue": "Data from the German chargepoint registry provided by Bundesnetzagentur.de under the CC-BY 4.0 license"
        }
    ],
    "DataQualityLevel": 3,
    "DateCreated": "2021-07-08T10:03:00Z",
    "SubmissionStatusTypeID": 100
}