{
    "IsRecentlyVerified": false,
    "ID": 140137,
    "UUID": "9BBD7915-9092-4756-94F0-A7C69FD8A9C7",
    "DataProviderID": 2,
    "DataProvidersReference": "146773",
    "OperatorID": 5,
    "UsageTypeID": 1,
    "AddressInfo": {
        "ID": 140489,
        "Title": "THORNWOOD",
        "AddressLine1": "7794 Kings College Ave",
        "Town": "Germantown",
        "StateOrProvince": "TN",
        "Postcode": "38138",
        "CountryID": 2,
        "Latitude": 35.10303,
        "Longitude": -89.803246,
        "ContactTelephone1": "888-758-4389",
        "AccessComments": "24 hours daily",
        "RelatedURL": "http://www.chargepoint.com/",
        "DistanceUnit": 0
    },
    "Connections": [
        {
            "ID": 195694,
            "ConnectionTypeID": 1,
            "LevelID": 2,
            "Amps": 16,
            "Voltage": 230,
            "PowerKW": 3.7,
            "CurrentTypeID": 10,
            "Quantity": 2
        }
    ],
    "StatusTypeID": 50,
    "DateLastStatusUpdate": "2020-06-26T02:57:00Z",
    "DataQualityLevel": 3,
    "DateCreated": "2019-12-24T09:12:00Z",
    "SubmissionStatusTypeID": 100
}