{
    "IsRecentlyVerified": false,
    "ID": 99286,
    "UUID": "2DAF6B21-1F73-4C6C-B236-89C9DAD436FA",
    "DataProviderID": 1,
    "OperatorID": 3279,
    "OperatorsReference": "0055",
    "UsageTypeID": 4,
    "UsageCost": "€0/kWh",
    "AddressInfo": {
        "ID": 99632,
        "Title": "Electrotecnia Monrabal",
        "AddressLine1": "Pi Blanc Nº3 Valencia",
        "Town": "VALENCIA",
        "StateOrProvince": "Valencia",
        "CountryID": 210,
        "Latitude": 39.431379,
        "Longitude": -0.380577,
        "DistanceUnit": 0
    },
    "Connections": [
        {
            "ID": 140276,
            "ConnectionTypeID": 25,
            "StatusTypeID": 50,
            "LevelID": 2,
            "Amps": 32,
            "Voltage": 230,
            "PowerKW": 7,
            "CurrentTypeID": 10,
            "Quantity": 1
        },
        {
            "ID": 140277,
            "ConnectionTypeID": 28,
            "StatusTypeID": 50,
            "LevelID": 1,
            "Voltage": 230,
            "PowerKW": 2.3,
            "CurrentTypeID": 10,
            "Quantity": 1
        }
    ],
    "NumberOfPoints": 1,
    "StatusTypeID": 50,
    "DateLastStatusUpdate": "2018-07-12T05:36:00Z",
    "DataQualityLevel": 1,
    "DateCreated": "2018-01-25T18:47:00Z",
    "SubmissionStatusTypeID": 200
}