{
    "IsRecentlyVerified": false,
    "ID": 177628,
    "UUID": "F0D12179-EF5E-417A-97D6-7CF175E40BF4",
    "DataProviderID": 29,
    "DataProvidersReference": "6214",
    "AddressInfo": {
        "ID": 177987,
        "Title": "Burgfriedenstr. 36",
        "AddressLine1": "Burgfriedenstr. 36",
        "Town": "Dachau",
        "Postcode": "85221",
        "CountryID": 87,
        "Latitude": 48.259538,
        "Longitude": 11.428902,
        "DistanceUnit": 0
    },
    "Connections": [
        {
            "ID": 276991,
            "ConnectionTypeID": 25,
            "StatusTypeID": 50,
            "LevelID": 2,
            "PowerKW": 22,
            "CurrentTypeID": 20
        },
        {
            "ID": 276992,
            "ConnectionTypeID": 25,
            "StatusTypeID": 50,
            "LevelID": 2,
            "PowerKW": 22,
            "CurrentTypeID": 20
        }
    ],
    "StatusTypeID": 0,
    "DateLastStatusUpdate": "2021-07-09T03:12:00Z",
    "MetadataValues": [
        {
            "ID": 9922,
            "MetadataFieldID": 4,
            "ItemValue": "Data from the German chargepoint registry provided by Bundesnetzagentur.de under the CC-BY 4.0 license"
        }
    ],
    "DataQualityLevel": 3,
    "DateCreated": "2021-07-08T09:49:00Z",
    "SubmissionStatusTypeID": 100
}