{
    "IsRecentlyVerified": false,
    "ID": 56878,
    "UUID": "87F2A386-020C-4746-804A-FA35907A0602",
    "DataProviderID": 1,
    "OperatorID": 25,
    "OperatorsReference": "southwark-eastdulwichgrove",
    "UsageTypeID": 4,
    "UsageCost": "£0.059/minute; min £1.18; other tariffs available",
    "AddressInfo": {
        "ID": 57224,
        "Title": "East Dulwich Grove",
        "AddressLine1": "2 East Dulwich Grove",
        "AddressLine2": "Southwark",
        "Town": "London",
        "Postcode": "SE22 8EW",
        "CountryID": 1,
        "Latitude": 51.459683,
        "Longitude": -0.075509,
        "DistanceUnit": 0
    },
    "Connections": [
        {
            "ID": 71800,
            "ConnectionTypeID": 25,
            "StatusTypeID": 50,
            "LevelID": 2,
            "Amps": 32,
            "Voltage": 230,
            "PowerKW": 7,
            "CurrentTypeID": 10,
            "Quantity": 1
        },
        {
            "ID": 71801,
            "ConnectionTypeID": 1,
            "StatusTypeID": 50,
            "LevelID": 2,
            "Amps": 16,
            "Voltage": 230,
            "PowerKW": 4,
            "CurrentTypeID": 10,
            "Quantity": 1
        }
    ],
    "NumberOfPoints": 1,
    "GeneralComments": "IER model charge point",
    "StatusTypeID": 50,
    "DateLastStatusUpdate": "2017-04-27T14:37:00Z",
    "DataQualityLevel": 1,
    "DateCreated": "2015-11-14T17:29:00Z",
    "SubmissionStatusTypeID": 200
}