{
    "IsRecentlyVerified": false,
    "ID": 167537,
    "UUID": "02F4436A-068E-4B85-863C-B0E5445B934F",
    "DataProviderID": 19,
    "DataProvidersReference": "6776",
    "AddressInfo": {
        "ID": 167896,
        "Title": "Albjerk Bil Drammen",
        "AddressLine1": "Ingeniør Rybergs Gate 100",
        "Town": "DRAMMEN",
        "StateOrProvince": "Viken",
        "Postcode": "3027",
        "CountryID": 168,
        "Latitude": 59.75421,
        "Longitude": 10.13318,
        "AccessComments": "",
        "DistanceUnit": 0
    },
    "Connections": [
        {
            "ID": 254133,
            "ConnectionTypeID": 25,
            "Reference": "1",
            "LevelID": 3,
            "Amps": 32,
            "Voltage": 400,
            "PowerKW": 22,
            "CurrentTypeID": 30,
            "Comments": "Mode 3"
        },
        {
            "ID": 254134,
            "ConnectionTypeID": 33,
            "Reference": "15",
            "LevelID": 3,
            "Amps": 375,
            "Voltage": 400,
            "PowerKW": 150,
            "CurrentTypeID": 30,
            "Comments": "Mode 4"
        },
        {
            "ID": 254135,
            "ConnectionTypeID": 25,
            "Reference": "14",
            "LevelID": 3,
            "Amps": 32,
            "Voltage": 400,
            "PowerKW": 22,
            "CurrentTypeID": 30,
            "Comments": "Mode 3"
        },
        {
            "ID": 254136,
            "ConnectionTypeID": 25,
            "Reference": "13",
            "LevelID": 3,
            "Amps": 32,
            "Voltage": 400,
            "PowerKW": 22,
            "CurrentTypeID": 30,
            "Comments": "Mode 3"
        },
        {
            "ID": 254137,
            "ConnectionTypeID": 25,
            "Reference": "12",
            "LevelID": 3,
            "Amps": 32,
            "Voltage": 400,
            "PowerKW": 22,
            "CurrentTypeID": 30,
            "Comments": "Mode 3"
        },
        {
            "ID": 254138,
            "ConnectionTypeID": 25,
            "Reference": "11",
            "LevelID": 3,
            "Amps": 32,
            "Voltage": 400,
            "PowerKW": 22,
            "CurrentTypeID": 30,
            "Comments": "Mode 3"
        },
        {
            "ID": 254139,
            "ConnectionTypeID": 25,
            "Reference": "10",
            "LevelID": 3,
            "Amps": 32,
            "Voltage": 400,
            "PowerKW": 22,
            "CurrentTypeID": 30,
            "Comments": "Mode 3"
        },
        {
            "ID": 254140,
            "ConnectionTypeID": 33,
            "Reference": "16",
            "LevelID": 3,
            "Amps": 375,
            "Voltage": 400,
            "PowerKW": 150,
            "CurrentTypeID": 30,
            "Comments": "Mode 4"
        },
        {
            "ID": 254141,
            "ConnectionTypeID": 25,
            "Reference": "9",
            "LevelID": 3,
            "Amps": 32,
            "Voltage": 400,
            "PowerKW": 22,
            "CurrentTypeID": 30,
            "Comments": "Mode 3"
        },
        {
            "ID": 254142,
            "ConnectionTypeID": 25,
            "Reference": "7",
            "LevelID": 3,
            "Amps": 32,
            "Voltage": 400,
            "PowerKW": 22,
            "CurrentTypeID": 30,
            "Comments": "Mode 3"
        },
        {
            "ID": 254143,
            "ConnectionTypeID": 25,
            "Reference": "6",
            "LevelID": 3,
            "Amps": 32,
            "Voltage": 400,
            "PowerKW": 22,
            "CurrentTypeID": 30,
            "Comments": "Mode 3"
        },
        {
            "ID": 254144,
            "ConnectionTypeID": 25,
            "Reference": "5",
            "LevelID": 3,
            "Amps": 32,
            "Voltage": 400,
            "PowerKW": 22,
            "CurrentTypeID": 30,
            "Comments": "Mode 3"
        },
        {
            "ID": 254145,
            "ConnectionTypeID": 25,
            "Reference": "4",
            "LevelID": 3,
            "Amps": 32,
            "Voltage": 400,
            "PowerKW": 22,
            "CurrentTypeID": 30,
            "Comments": "Mode 3"
        },
        {
            "ID": 254146,
            "ConnectionTypeID": 25,
            "Reference": "3",
            "LevelID": 3,
            "Amps": 32,
            "Voltage": 400,
            "PowerKW": 22,
            "CurrentTypeID": 30,
            "Comments": "Mode 3"
        },
        {
            "ID": 254147,
            "ConnectionTypeID": 25,
            "Reference": "2",
            "LevelID": 3,
            "Amps": 32,
            "Voltage": 400,
            "PowerKW": 22,
            "CurrentTypeID": 30,
            "Comments": "Mode 3"
        },
        {
            "ID": 254148,
            "ConnectionTypeID": 25,
            "Reference": "8",
            "LevelID": 3,
            "Amps": 32,
            "Voltage": 400,
            "PowerKW": 22,
            "CurrentTypeID": 30,
            "Comments": "Mode 3"
        },
        {
            "ID": 254149,
            "ConnectionTypeID": 25,
            "Reference": "17",
            "LevelID": 3,
            "Amps": 32,
            "Voltage": 400,
            "PowerKW": 22,
            "CurrentTypeID": 30,
            "Comments": "Mode 3"
        }
    ],
    "NumberOfPoints": 17,
    "StatusTypeID": 0,
    "DateLastStatusUpdate": "2021-03-03T09:02:00Z",
    "DataQualityLevel": 2,
    "DateCreated": "2020-09-08T04:14:00Z",
    "SubmissionStatusTypeID": 100
}