{
    "IsRecentlyVerified": false,
    "ID": 53315,
    "UUID": "2CDD7C10-4421-456A-8FBA-CA2E6818E4E6",
    "DataProviderID": 2,
    "DataProvidersReference": "69622",
    "UsageTypeID": 1,
    "AddressInfo": {
        "ID": 53661,
        "Title": "National Mall",
        "AddressLine1": "1398 Madison Dr NW",
        "Town": "Washington",
        "StateOrProvince": "DC",
        "Postcode": "20560",
        "CountryID": 2,
        "Latitude": 38.8904285969338,
        "Longitude": -77.0282293134918,
        "ContactTelephone1": "202-245-4694",
        "AccessComments": "24 hours daily",
        "RelatedURL": "",
        "DistanceUnit": 0
    },
    "Connections": [
        {
            "ID": 66428,
            "ConnectionTypeID": 1,
            "LevelID": 2,
            "Amps": 16,
            "Voltage": 230,
            "PowerKW": 3,
            "CurrentTypeID": 10,
            "Quantity": 1
        }
    ],
    "DateLastStatusUpdate": "2019-04-06T05:04:00Z",
    "DataQualityLevel": 3,
    "DateCreated": "2015-09-20T11:18:00Z",
    "SubmissionStatusTypeID": 100
}