{
    "IsRecentlyVerified": false,
    "ID": 175520,
    "UUID": "5ED9E320-7E08-477A-B642-70642DAD1097",
    "DataProviderID": 1,
    "OperatorID": 3450,
    "UsageTypeID": 1,
    "UsageCost": "1,6 zł/kWh DC 1,15zł/kWh AC",
    "AddressInfo": {
        "ID": 175879,
        "Title": "IBIS Hotel",
        "AddressLine1": "ul. Bulwarowa 35B",
        "Town": "Cracow",
        "StateOrProvince": "malopolskie",
        "Postcode": "31-751",
        "CountryID": 179,
        "Latitude": 50.081651123423796,
        "Longitude": 20.047964762319225,
        "ContactTelephone1": "+48500800700",
        "RelatedURL": "http://www.gopluseauto.pl/",
        "DistanceUnit": 0
    },
    "Connections": [
        {
            "ID": 272419,
            "ConnectionTypeID": 33,
            "StatusTypeID": 50,
            "LevelID": 3,
            "Amps": 100,
            "Voltage": 450,
            "PowerKW": 40,
            "CurrentTypeID": 30,
            "Quantity": 1
        },
        {
            "ID": 272420,
            "ConnectionTypeID": 2,
            "StatusTypeID": 50,
            "LevelID": 3,
            "Amps": 100,
            "Voltage": 450,
            "PowerKW": 40,
            "CurrentTypeID": 30,
            "Quantity": 1
        },
        {
            "ID": 272421,
            "ConnectionTypeID": 25,
            "StatusTypeID": 50,
            "LevelID": 2,
            "Amps": 32,
            "Voltage": 400,
            "PowerKW": 22,
            "CurrentTypeID": 20,
            "Quantity": 1
        }
    ],
    "NumberOfPoints": 1,
    "StatusTypeID": 50,
    "DateLastStatusUpdate": "2021-05-25T22:40:00Z",
    "DataQualityLevel": 1,
    "DateCreated": "2021-05-25T14:29:00Z",
    "SubmissionStatusTypeID": 200
}