{
    "IsRecentlyVerified": false,
    "ID": 98097,
    "UUID": "B6DB7159-FE49-4FB3-BF11-80866CFB73E4",
    "DataProviderID": 1,
    "OperatorID": 23,
    "OperatorsReference": "39819",
    "UsageTypeID": 4,
    "AddressInfo": {
        "ID": 98443,
        "Title": "Homewood Suites By Hilton Allentown Bethlehem",
        "AddressLine1": "3350 Center Valley Pkwy",
        "Town": "Center Valley",
        "StateOrProvince": "Pennsylvania",
        "Postcode": "18034",
        "CountryID": 2,
        "Latitude": 40.555891,
        "Longitude": -75.412824,
        "ContactTelephone1": "(610) 351-6400",
        "DistanceUnit": 0
    },
    "Connections": [
        {
            "ID": 139006,
            "ConnectionTypeID": 30,
            "StatusTypeID": 50,
            "LevelID": 2,
            "PowerKW": 16,
            "CurrentTypeID": 20,
            "Quantity": 2
        }
    ],
    "NumberOfPoints": 2,
    "GeneralComments": "2 Tesla Connectors, up to 16kW.Available for customers. Please see front desk.",
    "StatusTypeID": 50,
    "DateLastStatusUpdate": "2018-01-21T17:49:00Z",
    "DataQualityLevel": 1,
    "DateCreated": "2018-01-21T17:49:00Z",
    "SubmissionStatusTypeID": 200
}