{
    "IsRecentlyVerified": false,
    "ID": 37689,
    "UUID": "7ED64FC7-6286-4EE4-9B76-D3ECF4419615",
    "DataProviderID": 26,
    "DataProvidersReference": "25743",
    "OperatorID": 78,
    "OperatorsReference": "Essent EM-NL-00000363-01-00008",
    "UsageCost": "0.00 jaarabonnement",
    "AddressInfo": {
        "ID": 38035,
        "Title": "Herengracht 393",
        "AddressLine1": "Herengracht 393",
        "Town": "Amsterdam",
        "Postcode": "1016 BC",
        "CountryID": 159,
        "Latitude": 52.368323,
        "Longitude": 4.887097,
        "RelatedURL": "http://www.essent.nl",
        "DistanceUnit": 0
    },
    "Connections": [
        {
            "ID": 41200,
            "ConnectionTypeID": 25,
            "LevelID": 2,
            "PowerKW": 11,
            "CurrentTypeID": 10
        },
        {
            "ID": 49196,
            "ConnectionTypeID": 25,
            "LevelID": 2,
            "PowerKW": 11,
            "CurrentTypeID": 10
        }
    ],
    "NumberOfPoints": 1,
    "StatusTypeID": 50,
    "DateLastStatusUpdate": "2016-06-04T02:53:00Z",
    "DataQualityLevel": 3,
    "DateCreated": "2015-01-09T06:07:00Z",
    "SubmissionStatusTypeID": 100
}