{
    "IsRecentlyVerified": false,
    "ID": 136457,
    "UUID": "A7D413B5-03B9-4810-BD60-6E09DDAF2A32",
    "DataProviderID": 18,
    "DataProvidersReference": "4e1ae9df6190058decb1b8c49dee8af9",
    "OperatorID": 2244,
    "UsageTypeID": 5,
    "AddressInfo": {
        "ID": 136803,
        "Title": "King Henry's Road",
        "AddressLine1": "King Henry's Road",
        "Town": "London",
        "Postcode": "NW3 3RP",
        "CountryID": 1,
        "Latitude": 51.542589,
        "Longitude": -0.159011,
        "AccessComments": "",
        "RelatedURL": "https://www.ubitricity.com",
        "DistanceUnit": 0
    },
    "Connections": [
        {
            "ID": 190906,
            "ConnectionTypeID": 25,
            "Reference": "suby1100001997",
            "StatusTypeID": 50,
            "LevelID": 2,
            "Amps": 16,
            "Voltage": 230,
            "PowerKW": 3.7,
            "CurrentTypeID": 10
        }
    ],
    "StatusTypeID": 0,
    "DateLastStatusUpdate": "2021-04-25T05:46:00Z",
    "MetadataValues": [
        {
            "ID": 6309,
            "MetadataFieldID": 4,
            "ItemValue": "Contains public sector information licensed under the Open Government Licence v2.0. http://www.nationalarchives.gov.uk/doc/open-government-licence/version/2/"
        }
    ],
    "DataQualityLevel": 3,
    "DateCreated": "2019-12-24T05:22:00Z",
    "SubmissionStatusTypeID": 100
}