{
    "IsRecentlyVerified": false,
    "ID": 61960,
    "UUID": "9B6149A8-76B0-4F36-B73F-C4F761948B27",
    "DataProviderID": 2,
    "DataProvidersReference": "71654",
    "UsageTypeID": 1,
    "AddressInfo": {
        "ID": 62306,
        "Title": "Anheuser Busch Brewery",
        "AddressLine1": "3101 Busch Dr",
        "Town": "Fairfield",
        "StateOrProvince": "CA",
        "Postcode": "94534",
        "CountryID": 2,
        "Latitude": 38.236362,
        "Longitude": -122.091866,
        "ContactTelephone1": "707-429-7595",
        "AccessComments": "24 hours daily",
        "RelatedURL": "",
        "DistanceUnit": 0
    },
    "Connections": [
        {
            "ID": 78858,
            "ConnectionTypeID": 1,
            "LevelID": 2,
            "Amps": 16,
            "Voltage": 230,
            "PowerKW": 3,
            "CurrentTypeID": 10,
            "Quantity": 2
        }
    ],
    "DateLastStatusUpdate": "2019-04-06T04:02:00Z",
    "DataQualityLevel": 3,
    "DateCreated": "2016-03-03T11:38:00Z",
    "SubmissionStatusTypeID": 100
}