{
    "MediaItems": [
        {
            "ID": 25640,
            "ChargePointID": 169873,
            "ItemURL": "https://s3-ap-southeast-2.amazonaws.com/openchargemap/images/UA/OCM169873/OCM-169873.orig.2020120218004162.jpg",
            "ItemThumbnailURL": "https://s3-ap-southeast-2.amazonaws.com/openchargemap/images/UA/OCM169873/OCM-169873.thmb.2020120218004162.jpg",
            "Comment": "",
            "IsEnabled": true,
            "IsVideo": false,
            "IsFeaturedItem": false,
            "IsExternalResource": false,
            "User": {
                "ID": 26318,
                "Username": "EugeneUA"
            },
            "DateCreated": "2020-12-02T18:01:00Z"
        }
    ],
    "IsRecentlyVerified": false,
    "ID": 169873,
    "UUID": "58FDFF5F-D994-4C2B-9427-FE5373E9D342",
    "DataProviderID": 1,
    "OperatorID": 3361,
    "UsageTypeID": 4,
    "UsageCost": "4,49 UAH / KWh",
    "AddressInfo": {
        "ID": 170232,
        "Title": "EcoFactor Charge Ukrainka #2",
        "AddressLine1": "Yunosti",
        "Town": "Ukrainka",
        "Postcode": "08720",
        "CountryID": 234,
        "Latitude": 50.14804148238744,
        "Longitude": 30.746391370241327,
        "RelatedURL": "http://ecofactor.eu",
        "DistanceUnit": 0
    },
    "Connections": [
        {
            "ID": 258862,
            "ConnectionTypeID": 25,
            "StatusTypeID": 50,
            "LevelID": 2,
            "PowerKW": 22,
            "CurrentTypeID": 20,
            "Quantity": 1,
            "Comments": "4,49 UAH / KWh"
        },
        {
            "ID": 258863,
            "ConnectionTypeID": 1,
            "StatusTypeID": 50,
            "LevelID": 2,
            "PowerKW": 7,
            "CurrentTypeID": 10,
            "Quantity": 2
        }
    ],
    "NumberOfPoints": 1,
    "StatusTypeID": 50,
    "DateLastStatusUpdate": "2020-12-02T18:01:00Z",
    "DataQualityLevel": 1,
    "DateCreated": "2020-11-11T23:32:00Z",
    "SubmissionStatusTypeID": 200
}