{
    "IsRecentlyVerified": false,
    "ID": 141984,
    "UUID": "C9CB6122-CC05-474C-AF59-44E31669B9A5",
    "DataProviderID": 2,
    "DataProvidersReference": "121611",
    "OperatorID": 5,
    "UsageTypeID": 1,
    "AddressInfo": {
        "ID": 142336,
        "Title": "BVSD",
        "AddressLine1": "1000 W 10th Ave",
        "Town": "Broomfield",
        "StateOrProvince": "CO",
        "Postcode": "80020",
        "CountryID": 2,
        "Latitude": 39.9281453,
        "Longitude": -105.0811111,
        "ContactTelephone1": "888-758-4389",
        "AccessComments": "24 hours daily",
        "RelatedURL": "http://www.chargepoint.com/",
        "DistanceUnit": 0
    },
    "Connections": [
        {
            "ID": 198032,
            "ConnectionTypeID": 1,
            "LevelID": 2,
            "Amps": 16,
            "Voltage": 230,
            "PowerKW": 3.7,
            "CurrentTypeID": 10,
            "Quantity": 2
        }
    ],
    "StatusTypeID": 50,
    "DateLastStatusUpdate": "2020-06-26T03:02:00Z",
    "DataQualityLevel": 3,
    "DateCreated": "2019-12-24T09:16:00Z",
    "SubmissionStatusTypeID": 100
}