{
    "UserComments": [
        {
            "ID": 5975,
            "ChargePointID": 13799,
            "CommentTypeID": 10,
            "UserName": "Eric Stith",
            "Comment": "It's in lot G3, which requires a parking pass, but they are cheap and charging is free from at least one of the chargers.  You can purchase parking passes from a kiosk in the lot, but you may be limited to 2 hours as a visitor.",
            "Rating": 3,
            "DateCreated": "2015-07-19T05:03:50.11Z",
            "User": {
                "ID": 6103,
                "Username": "Eric Stith"
            },
            "CheckinStatusTypeID": 140
        }
    ],
    "IsRecentlyVerified": false,
    "ID": 13799,
    "UUID": "627467F7-EB8F-473A-91F6-CA3EA29ABEE0",
    "DataProviderID": 15,
    "DataProvidersReference": "20669",
    "OperatorID": 5,
    "AddressInfo": {
        "ID": 13696,
        "Title": "18111 Nordhoff Street",
        "AddressLine1": "18111 Nordhoff Street",
        "Town": "Northridge",
        "StateOrProvince": "California",
        "Postcode": "91325",
        "CountryID": 2,
        "Latitude": 34.23760223,
        "Longitude": -118.5244446,
        "ContactTelephone1": "",
        "RelatedURL": "http://carstations.com/20669",
        "DistanceUnit": 0
    },
    "Connections": [
        {
            "ID": 11246,
            "ConnectionTypeID": 1,
            "Reference": "J1772",
            "LevelID": 2
        }
    ],
    "StatusTypeID": 0,
    "DateLastStatusUpdate": "2017-11-04T14:04:00Z",
    "DataQualityLevel": 2,
    "DateCreated": "2012-12-06T11:08:00Z",
    "SubmissionStatusTypeID": 100
}