{
    "IsRecentlyVerified": false,
    "ID": 180455,
    "UUID": "94942AA0-0924-44CB-A897-B5FE518E8B3E",
    "DataProviderID": 29,
    "DataProvidersReference": "7408",
    "AddressInfo": {
        "ID": 180814,
        "Title": "Rudolf-Virchow-Straße 19",
        "AddressLine1": "Rudolf-Virchow-Straße 19",
        "Town": "Eberswalde",
        "Postcode": "16225",
        "CountryID": 87,
        "Latitude": 52.838811,
        "Longitude": 13.816662,
        "DistanceUnit": 0
    },
    "Connections": [
        {
            "ID": 283544,
            "ConnectionTypeID": 25,
            "StatusTypeID": 50,
            "LevelID": 2,
            "PowerKW": 22,
            "CurrentTypeID": 20
        },
        {
            "ID": 283545,
            "ConnectionTypeID": 25,
            "StatusTypeID": 50,
            "LevelID": 2,
            "PowerKW": 22,
            "CurrentTypeID": 20
        }
    ],
    "StatusTypeID": 50,
    "DateLastStatusUpdate": "2021-07-12T02:50:00Z",
    "MetadataValues": [
        {
            "ID": 12749,
            "MetadataFieldID": 4,
            "ItemValue": "Data from the German chargepoint registry provided by Bundesnetzagentur.de under the CC-BY 4.0 license"
        }
    ],
    "DataQualityLevel": 3,
    "DateCreated": "2021-07-08T10:00:00Z",
    "SubmissionStatusTypeID": 100
}