{
    "IsRecentlyVerified": false,
    "ID": 129612,
    "UUID": "8C1FB721-7417-4E58-BE8A-76F7D9355952",
    "DataProviderID": 2,
    "DataProvidersReference": "122064",
    "UsageTypeID": 2,
    "AddressInfo": {
        "ID": 129958,
        "Title": "Naval Facilities Engineering Command - San Diego - Pier 7/1",
        "AddressLine1": "2525 Callagan Hwy",
        "Town": "San Diego",
        "StateOrProvince": "CA",
        "Postcode": "92136",
        "CountryID": 2,
        "Latitude": 32.6735,
        "Longitude": -117.1194,
        "ContactTelephone1": "",
        "AccessComments": "Fleet use only",
        "RelatedURL": "",
        "DistanceUnit": 0
    },
    "Connections": [
        {
            "ID": 181375,
            "ConnectionTypeID": 9,
            "LevelID": 1,
            "Amps": 16,
            "Voltage": 120,
            "PowerKW": 1.9,
            "CurrentTypeID": 10,
            "Quantity": 1
        },
        {
            "ID": 181376,
            "ConnectionTypeID": 1,
            "LevelID": 2,
            "Amps": 16,
            "Voltage": 230,
            "PowerKW": 3.7,
            "CurrentTypeID": 10,
            "Quantity": 1
        }
    ],
    "DateLastStatusUpdate": "2020-06-26T02:54:00Z",
    "DataQualityLevel": 3,
    "DateCreated": "2019-07-21T11:43:00Z",
    "SubmissionStatusTypeID": 100
}