{
    "UserComments": [
        {
            "ID": 1184,
            "ChargePointID": 15486,
            "CommentTypeID": 10,
            "UserName": "filip.vanrickstal",
            "Comment": "Charged my Renault Zoe @ 22 kW",
            "Rating": 5,
            "DateCreated": "2014-09-05T21:11:46.61Z",
            "User": {
                "ID": 1761,
                "Username": "filip.vanrickstal"
            },
            "CheckinStatusTypeID": 10
        }
    ],
    "IsRecentlyVerified": false,
    "ID": 15486,
    "UUID": "AE829DFD-7375-4270-81D5-5B6F35E0C94C",
    "DataProviderID": 1,
    "OperatorID": 54,
    "UsageTypeID": 1,
    "UsageCost": "pay via sms or membershipcard",
    "AddressInfo": {
        "ID": 15832,
        "Title": "Andenne ARENA",
        "AddressLine1": "rue docteur Melin 14",
        "AddressLine2": "",
        "Town": "Andenne",
        "StateOrProvince": "",
        "Postcode": "5300 ",
        "CountryID": 26,
        "Latitude": 50.4889453,
        "Longitude": 5.090982899999972,
        "ContactTelephone1": "085 84 95 20",
        "ContactTelephone2": "",
        "ContactEmail": "",
        "AccessComments": "",
        "RelatedURL": "",
        "DistanceUnit": 0
    },
    "Connections": [
        {
            "ID": 13802,
            "ConnectionTypeID": 25,
            "StatusTypeID": 50,
            "LevelID": 2,
            "Amps": 32,
            "Voltage": 400,
            "PowerKW": 22,
            "CurrentTypeID": 20,
            "Quantity": 1
        },
        {
            "ID": 13803,
            "ConnectionTypeID": 23,
            "StatusTypeID": 50,
            "LevelID": 2,
            "Amps": 16,
            "Voltage": 230,
            "PowerKW": 4,
            "CurrentTypeID": 10,
            "Quantity": 1
        }
    ],
    "NumberOfPoints": 4,
    "GeneralComments": "www.ze-mo.be/",
    "StatusTypeID": 50,
    "DateLastStatusUpdate": "2014-09-05T21:15:00Z",
    "DataQualityLevel": 1,
    "DateCreated": "2013-01-11T17:48:00Z",
    "SubmissionStatusTypeID": 200
}