{
    "IsRecentlyVerified": false,
    "ID": 103651,
    "UUID": "7C84F572-68BE-4CDB-A5F1-5C3D1367AA0F",
    "DataProviderID": 1,
    "OperatorID": 23,
    "OperatorsReference": "42694",
    "UsageTypeID": 4,
    "AddressInfo": {
        "ID": 103997,
        "Title": "Hotel Spa DR Irena Eris Polanica Zdroj",
        "AddressLine1": "Debowa 19B",
        "Town": "Polanica-Zdroj",
        "Postcode": "57-320",
        "CountryID": 179,
        "Latitude": 50.411427,
        "Longitude": 16.503206,
        "ContactTelephone1": "+48 7466 24000",
        "DistanceUnit": 0
    },
    "Connections": [
        {
            "ID": 146321,
            "ConnectionTypeID": 30,
            "StatusTypeID": 50,
            "LevelID": 2,
            "Amps": 32,
            "Voltage": 400,
            "PowerKW": 22,
            "CurrentTypeID": 20,
            "Quantity": 2
        }
    ],
    "NumberOfPoints": 2,
    "GeneralComments": "2 Tesla Connectors, up to 22kW.Available for customers. Please call ahead.",
    "StatusTypeID": 50,
    "DateLastStatusUpdate": "2018-10-03T20:49:00Z",
    "DataQualityLevel": 1,
    "DateCreated": "2018-05-05T05:47:00Z",
    "SubmissionStatusTypeID": 200
}