{
    "IsRecentlyVerified": false,
    "ID": 141105,
    "UUID": "A97B7C66-DD47-4007-85F2-A82023FFDCA2",
    "DataProviderID": 2,
    "DataProvidersReference": "105057",
    "OperatorID": 5,
    "UsageTypeID": 1,
    "AddressInfo": {
        "ID": 141457,
        "Title": "BRIDGEWATER C",
        "AddressLine1": "418 E College St",
        "Town": "Bridgewater",
        "StateOrProvince": "VA",
        "Postcode": "22812",
        "CountryID": 2,
        "Latitude": 38.3768929,
        "Longitude": -78.967766,
        "ContactTelephone1": "888-758-4389",
        "AccessComments": "24 hours daily",
        "RelatedURL": "http://www.chargepoint.com/",
        "DistanceUnit": 0
    },
    "Connections": [
        {
            "ID": 196933,
            "ConnectionTypeID": 1,
            "LevelID": 2,
            "Amps": 16,
            "Voltage": 230,
            "PowerKW": 3.7,
            "CurrentTypeID": 10,
            "Quantity": 1
        }
    ],
    "StatusTypeID": 50,
    "DateLastStatusUpdate": "2020-06-26T02:59:00Z",
    "DataQualityLevel": 3,
    "DateCreated": "2019-12-24T09:14:00Z",
    "SubmissionStatusTypeID": 100
}