{
    "IsRecentlyVerified": false,
    "ID": 158050,
    "UUID": "328BBE7D-7664-457B-89A7-8ACE9F45E3C2",
    "DataProviderID": 18,
    "DataProvidersReference": "1ae867f09c946dbe5a1c0595ac4e97d5",
    "OperatorID": 150,
    "UsageTypeID": 5,
    "AddressInfo": {
        "ID": 158404,
        "Title": "Marsh Road",
        "AddressLine1": "Marsh Road",
        "Town": "Rhyl",
        "Postcode": "LL18 2DF",
        "CountryID": 1,
        "Latitude": 53.317369,
        "Longitude": -3.488348,
        "AccessComments": "",
        "RelatedURL": "http://www.chargepointservices.com/",
        "DistanceUnit": 0
    },
    "Connections": [
        {
            "ID": 227850,
            "ConnectionTypeID": 25,
            "Reference": "1",
            "StatusTypeID": 100,
            "LevelID": 2,
            "Amps": 32,
            "Voltage": 400,
            "PowerKW": 22,
            "CurrentTypeID": 20
        },
        {
            "ID": 227851,
            "ConnectionTypeID": 2,
            "Reference": "2",
            "StatusTypeID": 100,
            "LevelID": 3,
            "Amps": 125,
            "Voltage": 400,
            "PowerKW": 50,
            "CurrentTypeID": 30
        },
        {
            "ID": 227852,
            "ConnectionTypeID": 1036,
            "Reference": "3",
            "StatusTypeID": 100,
            "LevelID": 3,
            "Amps": 125,
            "Voltage": 400,
            "PowerKW": 50,
            "CurrentTypeID": 30
        }
    ],
    "StatusTypeID": 50,
    "DateLastStatusUpdate": "2021-07-12T03:39:00Z",
    "MetadataValues": [
        {
            "ID": 7583,
            "MetadataFieldID": 4,
            "ItemValue": "Contains public sector information licensed under the Open Government Licence v2.0. http://www.nationalarchives.gov.uk/doc/open-government-licence/version/2/"
        }
    ],
    "DataQualityLevel": 3,
    "DateCreated": "2020-06-25T10:00:00Z",
    "SubmissionStatusTypeID": 100
}