{
    "IsRecentlyVerified": false,
    "ID": 106103,
    "UUID": "A1BC3A58-3AF2-4F10-B5FE-CF97BB8920FD",
    "DataProviderID": 1,
    "OperatorID": 3,
    "OperatorsReference": "PG-106510",
    "UsageTypeID": 4,
    "UsageCost": "£0.24/kWh",
    "AddressInfo": {
        "ID": 106449,
        "Title": "Brecon Beacons National Park - Ffrwdgrech Depot",
        "AddressLine1": "Ffrwdgrech Ind. Estate",
        "AddressLine2": "Penoyre",
        "Town": "Brecon",
        "StateOrProvince": "Powys",
        "Postcode": "LD3 8LA",
        "CountryID": 1,
        "Latitude": 51.9423878592609,
        "Longitude": -3.41061470370482,
        "DistanceUnit": 0
    },
    "Connections": [
        {
            "ID": 149429,
            "ConnectionTypeID": 25,
            "StatusTypeID": 50,
            "LevelID": 2,
            "Amps": 32,
            "Voltage": 400,
            "PowerKW": 22,
            "CurrentTypeID": 20,
            "Quantity": 1
        }
    ],
    "NumberOfPoints": 1,
    "StatusTypeID": 50,
    "DateLastStatusUpdate": "2019-05-13T12:42:00Z",
    "DataQualityLevel": 1,
    "DateCreated": "2018-06-15T12:47:00Z",
    "SubmissionStatusTypeID": 200
}