{
    "IsRecentlyVerified": false,
    "ID": 36658,
    "UUID": "A3D995DA-7A0E-483A-9A5D-DD423E03E4CC",
    "DataProviderID": 26,
    "DataProvidersReference": "49285",
    "OperatorID": 73,
    "OperatorsReference": "EV-Box EVB-P1402382",
    "UsageCost": "0.00 jaarabonnement",
    "AddressInfo": {
        "ID": 37004,
        "Title": "Grevenhout 21-51",
        "AddressLine1": "Grevenhout 21-51",
        "Town": "Apeldoorn",
        "Postcode": "3888 NN",
        "CountryID": 159,
        "Latitude": 52.21864,
        "Longitude": 5.78532,
        "RelatedURL": "http://www.ev-box.nl",
        "DistanceUnit": 0
    },
    "Connections": [
        {
            "ID": 40169,
            "ConnectionTypeID": 25,
            "LevelID": 2,
            "PowerKW": 11,
            "CurrentTypeID": 10
        },
        {
            "ID": 48434,
            "ConnectionTypeID": 25,
            "LevelID": 2,
            "PowerKW": 11,
            "CurrentTypeID": 10
        }
    ],
    "NumberOfPoints": 1,
    "StatusTypeID": 50,
    "DateLastStatusUpdate": "2016-06-04T02:51:00Z",
    "DataQualityLevel": 3,
    "DateCreated": "2015-01-09T06:07:00Z",
    "SubmissionStatusTypeID": 100
}