{
    "IsRecentlyVerified": false,
    "ID": 54458,
    "UUID": "6521B8AC-0AA8-4175-A9F1-5C72FE034B7C",
    "DataProviderID": 1,
    "OperatorID": 44,
    "UsageTypeID": 3,
    "AddressInfo": {
        "ID": 54804,
        "Title": "Ladepunkt Eichenzell",
        "AddressLine1": "Buchenweg 12",
        "Town": " Eichenzell",
        "StateOrProvince": "Landkreis Fulda",
        "Postcode": "36124",
        "CountryID": 87,
        "Latitude": 50.49705,
        "Longitude": 9.69832999999994,
        "ContactTelephone1": "+4915253693820",
        "AccessComments": "Freier Zugang, Spende erwünscht! Rechts an der Garage",
        "DistanceUnit": 0
    },
    "Connections": [
        {
            "ID": 68684,
            "ConnectionTypeID": 17,
            "StatusTypeID": 50,
            "LevelID": 2,
            "Amps": 32,
            "Voltage": 400,
            "PowerKW": 22,
            "CurrentTypeID": 20,
            "Quantity": 1
        },
        {
            "ID": 68685,
            "ConnectionTypeID": 17,
            "StatusTypeID": 50,
            "LevelID": 2,
            "Amps": 16,
            "Voltage": 400,
            "PowerKW": 11,
            "CurrentTypeID": 20,
            "Quantity": 1
        },
        {
            "ID": 68686,
            "ConnectionTypeID": 16,
            "StatusTypeID": 50,
            "LevelID": 2,
            "Amps": 16,
            "Voltage": 230,
            "PowerKW": 3.7,
            "CurrentTypeID": 10,
            "Quantity": 1
        },
        {
            "ID": 68687,
            "ConnectionTypeID": 28,
            "StatusTypeID": 50,
            "LevelID": 2,
            "Amps": 16,
            "Voltage": 230,
            "PowerKW": 3.7,
            "CurrentTypeID": 10,
            "Quantity": 2
        }
    ],
    "NumberOfPoints": 2,
    "StatusTypeID": 50,
    "DateLastStatusUpdate": "2015-10-05T07:14:00Z",
    "DataQualityLevel": 1,
    "DateCreated": "2015-10-03T09:42:00Z",
    "SubmissionStatusTypeID": 200
}