{
    "UserComments": [
        {
            "ID": 23462,
            "ChargePointID": 169689,
            "CommentTypeID": 10,
            "UserName": "ForumElettrico.it",
            "Comment": "Li sopra c'è un hotel ristorante che fa anche da bar, oppure si può andare in centro > https://www.forumelettrico.it/forum/colonnine-be-charge-22-kw-fornovo-di-taro-pr-via-achille-tomasi-13-t13676.html",
            "RelatedURL": "https://www.forumelettrico.it/forum/colonnine-be-charge-22-kw-fornovo-di-taro-pr-via-achille-tomasi-13-t13676.html",
            "DateCreated": "2020-10-31T10:58:51.313Z",
            "User": {
                "ID": 11749,
                "Username": "ForumElettrico.it"
            },
            "CheckinStatusTypeID": 10,
            "IsActionedByEditor": false
        }
    ],
    "MediaItems": [
        {
            "ID": 25295,
            "ChargePointID": 169689,
            "ItemURL": "https://s3-ap-southeast-2.amazonaws.com/openchargemap/images/IT/OCM169689/OCM-169689.orig.2020103110590041.jpg",
            "ItemThumbnailURL": "https://s3-ap-southeast-2.amazonaws.com/openchargemap/images/IT/OCM169689/OCM-169689.thmb.2020103110590041.jpg",
            "Comment": "",
            "IsEnabled": true,
            "IsVideo": false,
            "IsFeaturedItem": false,
            "IsExternalResource": false,
            "User": {
                "ID": 11749,
                "Username": "ForumElettrico.it"
            },
            "DateCreated": "2020-10-31T10:59:00Z"
        },
        {
            "ID": 25296,
            "ChargePointID": 169689,
            "ItemURL": "https://s3-ap-southeast-2.amazonaws.com/openchargemap/images/IT/OCM169689/OCM-169689.orig.2020103110590682.jpg",
            "ItemThumbnailURL": "https://s3-ap-southeast-2.amazonaws.com/openchargemap/images/IT/OCM169689/OCM-169689.thmb.2020103110590682.jpg",
            "Comment": "",
            "IsEnabled": true,
            "IsVideo": false,
            "IsFeaturedItem": false,
            "IsExternalResource": false,
            "User": {
                "ID": 11749,
                "Username": "ForumElettrico.it"
            },
            "DateCreated": "2020-10-31T10:59:00Z"
        },
        {
            "ID": 25297,
            "ChargePointID": 169689,
            "ItemURL": "https://s3-ap-southeast-2.amazonaws.com/openchargemap/images/IT/OCM169689/OCM-169689.orig.2020103110591239.jpg",
            "ItemThumbnailURL": "https://s3-ap-southeast-2.amazonaws.com/openchargemap/images/IT/OCM169689/OCM-169689.thmb.2020103110591239.jpg",
            "Comment": "",
            "IsEnabled": true,
            "IsVideo": false,
            "IsFeaturedItem": false,
            "IsExternalResource": false,
            "User": {
                "ID": 11749,
                "Username": "ForumElettrico.it"
            },
            "DateCreated": "2020-10-31T10:59:00Z"
        },
        {
            "ID": 25298,
            "ChargePointID": 169689,
            "ItemURL": "https://s3-ap-southeast-2.amazonaws.com/openchargemap/images/IT/OCM169689/OCM-169689.orig.2020103110591757.jpg",
            "ItemThumbnailURL": "https://s3-ap-southeast-2.amazonaws.com/openchargemap/images/IT/OCM169689/OCM-169689.thmb.2020103110591757.jpg",
            "Comment": "",
            "IsEnabled": true,
            "IsVideo": false,
            "IsFeaturedItem": false,
            "IsExternalResource": false,
            "User": {
                "ID": 11749,
                "Username": "ForumElettrico.it"
            },
            "DateCreated": "2020-10-31T10:59:00Z"
        },
        {
            "ID": 25299,
            "ChargePointID": 169689,
            "ItemURL": "https://s3-ap-southeast-2.amazonaws.com/openchargemap/images/IT/OCM169689/OCM-169689.orig.2020103110592320.jpg",
            "ItemThumbnailURL": "https://s3-ap-southeast-2.amazonaws.com/openchargemap/images/IT/OCM169689/OCM-169689.thmb.2020103110592320.jpg",
            "Comment": "",
            "IsEnabled": true,
            "IsVideo": false,
            "IsFeaturedItem": false,
            "IsExternalResource": false,
            "User": {
                "ID": 11749,
                "Username": "ForumElettrico.it"
            },
            "DateCreated": "2020-10-31T10:59:00Z"
        }
    ],
    "IsRecentlyVerified": false,
    "ID": 169689,
    "UUID": "66033BA3-4834-473E-9E90-992BBFF4026F",
    "DataProviderID": 1,
    "OperatorID": 3327,
    "UsageTypeID": 4,
    "AddressInfo": {
        "ID": 170048,
        "Title": "Fornovo Tomasi |  BeCharge ",
        "AddressLine1": "Via Achille Tomasi 13",
        "Town": "Fornovo di Taro",
        "StateOrProvince": "PR",
        "Postcode": "43045",
        "CountryID": 112,
        "Latitude": 44.692993,
        "Longitude": 10.099147,
        "RelatedURL": "https://www.forumelettrico.it/forum/colonnine-be-charge-22-kw-fornovo-di-taro-pr-via-achille-tomasi-13-t13676.html",
        "DistanceUnit": 0
    },
    "Connections": [
        {
            "ID": 258403,
            "ConnectionTypeID": 25,
            "StatusTypeID": 50,
            "LevelID": 2,
            "Amps": 32,
            "Voltage": 400,
            "PowerKW": 22,
            "CurrentTypeID": 20,
            "Quantity": 2
        }
    ],
    "NumberOfPoints": 2,
    "StatusTypeID": 50,
    "DateLastStatusUpdate": "2020-11-03T17:30:00Z",
    "DataQualityLevel": 1,
    "DateCreated": "2020-10-31T10:59:00Z",
    "SubmissionStatusTypeID": 200
}