{
    "UserComments": [
        {
            "ID": 21462,
            "ChargePointID": 131381,
            "CommentTypeID": 10,
            "UserName": "ForumElettrico.it",
            "RelatedURL": "https://www.forumelettrico.it/forum/colonnina-11-kw-hotel-villa-marina-pietra-ligure-sv-corso-italia-121-t4480.html",
            "DateCreated": "2019-09-04T15:11:22.59Z",
            "User": {
                "ID": 11749,
                "Username": "ForumElettrico.it"
            },
            "CheckinStatusTypeID": 10
        }
    ],
    "MediaItems": [
        {
            "ID": 19465,
            "ChargePointID": 131381,
            "ItemURL": "https://s3-ap-southeast-2.amazonaws.com/openchargemap/images/IT/OCM131381/OCM-131381.orig.2019090415113175.jpg",
            "ItemThumbnailURL": "https://s3-ap-southeast-2.amazonaws.com/openchargemap/images/IT/OCM131381/OCM-131381.thmb.2019090415113175.jpg",
            "Comment": "",
            "IsEnabled": true,
            "IsVideo": false,
            "IsFeaturedItem": false,
            "IsExternalResource": false,
            "User": {
                "ID": 11749,
                "Username": "ForumElettrico.it"
            },
            "DateCreated": "2019-09-04T15:12:00Z"
        },
        {
            "ID": 19466,
            "ChargePointID": 131381,
            "ItemURL": "https://s3-ap-southeast-2.amazonaws.com/openchargemap/images/IT/OCM131381/OCM-131381.orig.2019090415113836.jpg",
            "ItemThumbnailURL": "https://s3-ap-southeast-2.amazonaws.com/openchargemap/images/IT/OCM131381/OCM-131381.thmb.2019090415113836.jpg",
            "Comment": "",
            "IsEnabled": true,
            "IsVideo": false,
            "IsFeaturedItem": false,
            "IsExternalResource": false,
            "User": {
                "ID": 11749,
                "Username": "ForumElettrico.it"
            },
            "DateCreated": "2019-09-04T15:12:00Z"
        },
        {
            "ID": 19467,
            "ChargePointID": 131381,
            "ItemURL": "https://s3-ap-southeast-2.amazonaws.com/openchargemap/images/IT/OCM131381/OCM-131381.orig.2019090415114465.jpg",
            "ItemThumbnailURL": "https://s3-ap-southeast-2.amazonaws.com/openchargemap/images/IT/OCM131381/OCM-131381.thmb.2019090415114465.jpg",
            "Comment": "",
            "IsEnabled": true,
            "IsVideo": false,
            "IsFeaturedItem": false,
            "IsExternalResource": false,
            "User": {
                "ID": 11749,
                "Username": "ForumElettrico.it"
            },
            "DateCreated": "2019-09-04T15:12:00Z"
        },
        {
            "ID": 19468,
            "ChargePointID": 131381,
            "ItemURL": "https://s3-ap-southeast-2.amazonaws.com/openchargemap/images/IT/OCM131381/OCM-131381.orig.2019090415115152.jpg",
            "ItemThumbnailURL": "https://s3-ap-southeast-2.amazonaws.com/openchargemap/images/IT/OCM131381/OCM-131381.thmb.2019090415115152.jpg",
            "Comment": "",
            "IsEnabled": true,
            "IsVideo": false,
            "IsFeaturedItem": false,
            "IsExternalResource": false,
            "User": {
                "ID": 11749,
                "Username": "ForumElettrico.it"
            },
            "DateCreated": "2019-09-04T15:12:00Z"
        },
        {
            "ID": 19469,
            "ChargePointID": 131381,
            "ItemURL": "https://s3-ap-southeast-2.amazonaws.com/openchargemap/images/IT/OCM131381/OCM-131381.orig.2019090415115867.jpg",
            "ItemThumbnailURL": "https://s3-ap-southeast-2.amazonaws.com/openchargemap/images/IT/OCM131381/OCM-131381.thmb.2019090415115867.jpg",
            "Comment": "",
            "IsEnabled": true,
            "IsVideo": false,
            "IsFeaturedItem": false,
            "IsExternalResource": false,
            "User": {
                "ID": 11749,
                "Username": "ForumElettrico.it"
            },
            "DateCreated": "2019-09-04T15:12:00Z"
        },
        {
            "ID": 19470,
            "ChargePointID": 131381,
            "ItemURL": "https://s3-ap-southeast-2.amazonaws.com/openchargemap/images/IT/OCM131381/OCM-131381.orig.2019090415120588.jpg",
            "ItemThumbnailURL": "https://s3-ap-southeast-2.amazonaws.com/openchargemap/images/IT/OCM131381/OCM-131381.thmb.2019090415120588.jpg",
            "Comment": "",
            "IsEnabled": true,
            "IsVideo": false,
            "IsFeaturedItem": false,
            "IsExternalResource": false,
            "User": {
                "ID": 11749,
                "Username": "ForumElettrico.it"
            },
            "DateCreated": "2019-09-04T15:12:00Z"
        },
        {
            "ID": 19471,
            "ChargePointID": 131381,
            "ItemURL": "https://s3-ap-southeast-2.amazonaws.com/openchargemap/images/IT/OCM131381/OCM-131381.orig.2019090415121445.jpg",
            "ItemThumbnailURL": "https://s3-ap-southeast-2.amazonaws.com/openchargemap/images/IT/OCM131381/OCM-131381.thmb.2019090415121445.jpg",
            "Comment": "",
            "IsEnabled": true,
            "IsVideo": false,
            "IsFeaturedItem": false,
            "IsExternalResource": false,
            "User": {
                "ID": 11749,
                "Username": "ForumElettrico.it"
            },
            "DateCreated": "2019-09-04T15:12:00Z"
        }
    ],
    "IsRecentlyVerified": false,
    "ID": 131381,
    "UUID": "7FD41F61-96BB-488D-9BFC-940A484E0138",
    "DataProviderID": 1,
    "OperatorID": 1,
    "UsageTypeID": 6,
    "AddressInfo": {
        "ID": 131727,
        "Title": "Hotel Villa Marina",
        "AddressLine1": "Corso Italia 221",
        "Town": "Pietra Ligure",
        "StateOrProvince": "SV",
        "CountryID": 112,
        "Latitude": 44.152799,
        "Longitude": 8.29195,
        "RelatedURL": "https://www.forumelettrico.it/forum/colonnina-11-kw-hotel-villa-marina-pietra-ligure-sv-corso-italia-121-t4480.html",
        "DistanceUnit": 0
    },
    "Connections": [
        {
            "ID": 183932,
            "ConnectionTypeID": 25,
            "StatusTypeID": 50,
            "LevelID": 2,
            "Amps": 16,
            "Voltage": 400,
            "PowerKW": 11,
            "CurrentTypeID": 20,
            "Quantity": 1
        }
    ],
    "NumberOfPoints": 1,
    "StatusTypeID": 50,
    "DateLastStatusUpdate": "2019-09-04T15:30:00Z",
    "DataQualityLevel": 1,
    "DateCreated": "2019-09-04T15:11:00Z",
    "SubmissionStatusTypeID": 200
}