{
    "IsRecentlyVerified": false,
    "ID": 108161,
    "UUID": "0F8126B4-8AA3-43F8-8DD6-9B925EA43313",
    "DataProviderID": 1,
    "OperatorID": 1,
    "UsageTypeID": 1,
    "UsageCost": "free",
    "AddressInfo": {
        "ID": 108507,
        "Title": " Abita Public Parking ",
        "AddressLine1": "22075 Highway 59",
        "Town": "Abita Springs",
        "StateOrProvince": "LA",
        "Postcode": "70420",
        "CountryID": 2,
        "Latitude": 30.478397151459777,
        "Longitude": -90.03870650478518,
        "ContactTelephone1": "\t+1 985-205-2261",
        "ContactEmail": "kathy.armand@townofabitasprings.com",
        "AccessComments": "Municipal parking lot in center of town. Restaurants, shopping, park, museums nearby.",
        "RelatedURL": "https://www.townofabitasprings.com",
        "DistanceUnit": 0
    },
    "Connections": [
        {
            "ID": 152814,
            "ConnectionTypeID": 30,
            "StatusTypeID": 50,
            "LevelID": 2,
            "Quantity": 2
        }
    ],
    "NumberOfPoints": 2,
    "GeneralComments": "A joint project of Tesla and the Town of Abita Springs. Let us know how we are doing.",
    "StatusTypeID": 50,
    "DateLastStatusUpdate": "2018-10-15T13:07:00Z",
    "DataQualityLevel": 1,
    "DateCreated": "2018-09-10T14:26:00Z",
    "SubmissionStatusTypeID": 200
}