{
    "IsRecentlyVerified": false,
    "ID": 120371,
    "UUID": "5999C62A-224E-4958-85E5-6DBBC2D3D380",
    "DataProviderID": 2,
    "DataProvidersReference": "63022",
    "OperatorID": 5,
    "UsageTypeID": 1,
    "AddressInfo": {
        "ID": 120717,
        "Title": "EV CHARGER",
        "AddressLine1": "5351 Sidney Simons Blvd",
        "Town": "Columbus",
        "StateOrProvince": "GA",
        "Postcode": "31904",
        "CountryID": 2,
        "Latitude": 32.517868,
        "Longitude": -84.9538765,
        "ContactTelephone1": "888-758-4389",
        "AccessComments": "24 hours daily",
        "RelatedURL": "http://www.chargepoint.com/",
        "DistanceUnit": 0
    },
    "Connections": [
        {
            "ID": 169713,
            "ConnectionTypeID": 1,
            "LevelID": 2,
            "Amps": 16,
            "Voltage": 230,
            "PowerKW": 3,
            "CurrentTypeID": 10,
            "Quantity": 2
        }
    ],
    "DateLastStatusUpdate": "2019-12-24T09:09:00Z",
    "DataQualityLevel": 3,
    "DateCreated": "2019-04-01T04:59:00Z",
    "SubmissionStatusTypeID": 100
}