{
    "IsRecentlyVerified": false,
    "ID": 112938,
    "UUID": "E4D194EF-95E8-4758-B076-8DB5425730D7",
    "DataProviderID": 1,
    "OperatorID": 80,
    "UsageTypeID": 5,
    "AddressInfo": {
        "ID": 113284,
        "Title": "Garage Florence Parking | EnelX",
        "AddressLine1": "Via Cimabue, 24",
        "Town": "Firenze",
        "StateOrProvince": "FI",
        "Postcode": "50121",
        "CountryID": 112,
        "Latitude": 43.76943739873926,
        "Longitude": 11.273128947529765,
        "ContactTelephone1": "800.069.850",
        "RelatedURL": "https://www.enelx.com/it/it/emobility",
        "DistanceUnit": 0
    },
    "Connections": [
        {
            "ID": 159076,
            "ConnectionTypeID": 25,
            "StatusTypeID": 150,
            "LevelID": 2,
            "Amps": 32,
            "Voltage": 400,
            "PowerKW": 22,
            "CurrentTypeID": 20,
            "Quantity": 2
        }
    ],
    "NumberOfPoints": 2,
    "GeneralComments": "Garage pubblico a pagamento",
    "StatusTypeID": 50,
    "DateLastStatusUpdate": "2018-11-27T10:56:00Z",
    "DataQualityLevel": 1,
    "DateCreated": "2018-11-27T10:56:00Z",
    "SubmissionStatusTypeID": 200
}