{
    "IsRecentlyVerified": false,
    "ID": 41227,
    "UUID": "61EF454C-42E7-430C-8E20-248192EDC175",
    "DataProviderID": 15,
    "DataProvidersReference": "26178",
    "OperatorID": 9,
    "AddressInfo": {
        "ID": 41573,
        "Title": "20165 N 67th Ave",
        "AddressLine1": "20165 N 67th Ave",
        "Town": "Glendale",
        "StateOrProvince": "AZ",
        "Postcode": "US",
        "CountryID": 2,
        "Latitude": 33.664051,
        "Longitude": -112.202393,
        "ContactTelephone1": "(623) 234-9161",
        "RelatedURL": "http://carstations.com/26178",
        "DistanceUnit": 0
    },
    "Connections": [
        {
            "ID": 45015,
            "ConnectionTypeID": 1,
            "Reference": "J1772",
            "LevelID": 2
        }
    ],
    "StatusTypeID": 0,
    "DateLastStatusUpdate": "2017-11-04T14:04:00Z",
    "DataQualityLevel": 2,
    "DateCreated": "2015-01-28T11:44:00Z",
    "SubmissionStatusTypeID": 100
}