{
    "IsRecentlyVerified": false,
    "ID": 159144,
    "UUID": "38CC4DFE-73FF-441E-A222-56E977CC6682",
    "DataProviderID": 2,
    "DataProvidersReference": "152296",
    "OperatorID": 59,
    "UsageTypeID": 1,
    "AddressInfo": {
        "ID": 159501,
        "Title": "Greenlots - 53221",
        "AddressLine1": "37 US-93",
        "Town": "Alamo",
        "StateOrProvince": "NV",
        "Postcode": "89001",
        "CountryID": 2,
        "Latitude": 37.363883,
        "Longitude": -115.159804,
        "ContactTelephone1": "855-900-7584",
        "AccessComments": "24 hours daily",
        "RelatedURL": "http://greenlots.com/",
        "DistanceUnit": 0
    },
    "Connections": [
        {
            "ID": 229242,
            "ConnectionTypeID": 2,
            "LevelID": 3,
            "Amps": 100,
            "Voltage": 400,
            "PowerKW": 40,
            "CurrentTypeID": 30,
            "Quantity": 1
        },
        {
            "ID": 229243,
            "ConnectionTypeID": 32,
            "LevelID": 3,
            "Amps": 100,
            "Voltage": 400,
            "PowerKW": 40,
            "CurrentTypeID": 30,
            "Quantity": 1
        }
    ],
    "StatusTypeID": 50,
    "DateLastStatusUpdate": "2020-06-26T02:59:00Z",
    "DataQualityLevel": 3,
    "DateCreated": "2020-06-26T02:59:00Z",
    "SubmissionStatusTypeID": 100
}