{
    "IsRecentlyVerified": false,
    "ID": 29512,
    "UUID": "2ACBB33A-2992-432E-9823-06A7D0848B45",
    "DataProviderID": 15,
    "DataProvidersReference": "15967",
    "OperatorID": 5,
    "AddressInfo": {
        "ID": 29858,
        "Title": "6001 Destination Pkwy",
        "AddressLine1": "6001 Destination Pkwy",
        "Town": "Orlando",
        "StateOrProvince": "Florida",
        "Postcode": "32819",
        "CountryID": 2,
        "Latitude": 28.42526436,
        "Longitude": -81.45589447,
        "ContactTelephone1": "(407) 313-4300",
        "RelatedURL": "http://carstations.com/15967",
        "DistanceUnit": 0
    },
    "Connections": [
        {
            "ID": 32497,
            "ConnectionTypeID": 1,
            "Reference": "J1772",
            "LevelID": 2
        }
    ],
    "StatusTypeID": 0,
    "DateLastStatusUpdate": "2017-11-04T14:03:00Z",
    "DataQualityLevel": 2,
    "DateCreated": "2014-11-29T05:39:00Z",
    "SubmissionStatusTypeID": 100
}