{
    "IsRecentlyVerified": false,
    "ID": 100794,
    "UUID": "2EBBC12B-089A-4D01-8FA1-21C8E44616C2",
    "DataProviderID": 1,
    "OperatorID": 23,
    "OperatorsReference": "41288",
    "UsageTypeID": 4,
    "AddressInfo": {
        "ID": 101140,
        "Title": "Novotel Spa Rennes Centre Gare",
        "AddressLine1": "22 Avenue Janvier",
        "Town": "Rennes",
        "Postcode": "35000",
        "CountryID": 80,
        "Latitude": 48.105246,
        "Longitude": -1.673761,
        "ContactTelephone1": "+33 2 99 84 08 08",
        "DistanceUnit": 0
    },
    "Connections": [
        {
            "ID": 142374,
            "ConnectionTypeID": 30,
            "StatusTypeID": 50,
            "LevelID": 2,
            "Amps": 32,
            "Voltage": 230,
            "PowerKW": 17,
            "CurrentTypeID": 20,
            "Quantity": 1
        }
    ],
    "NumberOfPoints": 1,
    "GeneralComments": "1 Tesla Connector, up to 17kW.Available for customers. Self park.",
    "StatusTypeID": 50,
    "DateLastStatusUpdate": "2018-10-03T15:26:00Z",
    "DataQualityLevel": 1,
    "DateCreated": "2018-03-10T06:49:00Z",
    "SubmissionStatusTypeID": 200
}