{
    "IsRecentlyVerified": false,
    "ID": 152213,
    "UUID": "97AB6B87-7170-41B6-A4E9-F018B57AB5B9",
    "DataProviderID": 28,
    "DataProvidersReference": "FR*S85*P85070*001",
    "UsageTypeID": 5,
    "AddressInfo": {
        "ID": 152566,
        "Title": "COËX - Place Du Docteur Brechoteau",
        "AddressLine1": "Place Du Docteur Brechoteau   85220 COËX",
        "CountryID": 80,
        "Latitude": 46.69736,
        "Longitude": -1.76012,
        "AccessComments": "24h/24 7j/7",
        "DistanceUnit": 0
    },
    "Connections": [
        {
            "ID": 212994,
            "ConnectionTypeID": 28,
            "StatusTypeID": 50,
            "LevelID": 2,
            "PowerKW": 18,
            "CurrentTypeID": 10
        },
        {
            "ID": 212995,
            "ConnectionTypeID": 25,
            "StatusTypeID": 50,
            "LevelID": 2,
            "PowerKW": 18,
            "CurrentTypeID": 20
        },
        {
            "ID": 245859,
            "ConnectionTypeID": 28,
            "StatusTypeID": 50,
            "LevelID": 2,
            "PowerKW": 18,
            "CurrentTypeID": 10
        },
        {
            "ID": 245860,
            "ConnectionTypeID": 25,
            "StatusTypeID": 50,
            "LevelID": 2,
            "PowerKW": 18,
            "CurrentTypeID": 20
        }
    ],
    "GeneralComments": "Recharge par badge et avec une application smartphone",
    "StatusTypeID": 50,
    "DateLastStatusUpdate": "2020-08-27T05:12:00Z",
    "DataQualityLevel": 2,
    "DateCreated": "2020-03-15T10:53:00Z",
    "SubmissionStatusTypeID": 100
}