{
    "IsRecentlyVerified": false,
    "ID": 177803,
    "UUID": "9E8D4AAB-FB41-45C2-8D4A-51FCBF43B91E",
    "DataProviderID": 29,
    "DataProvidersReference": "9698",
    "OperatorID": 105,
    "AddressInfo": {
        "ID": 178162,
        "Title": "Höherweg 101",
        "AddressLine1": "Höherweg 101",
        "Town": "Düsseldorf",
        "Postcode": "40233",
        "CountryID": 87,
        "Latitude": 51.220003,
        "Longitude": 6.816114,
        "DistanceUnit": 0
    },
    "Connections": [
        {
            "ID": 277423,
            "ConnectionTypeID": 25,
            "StatusTypeID": 50,
            "LevelID": 2,
            "PowerKW": 22,
            "CurrentTypeID": 20
        },
        {
            "ID": 277424,
            "ConnectionTypeID": 25,
            "StatusTypeID": 50,
            "LevelID": 2,
            "PowerKW": 22,
            "CurrentTypeID": 20
        }
    ],
    "StatusTypeID": 0,
    "DateLastStatusUpdate": "2021-07-12T02:46:00Z",
    "MetadataValues": [
        {
            "ID": 10097,
            "MetadataFieldID": 4,
            "ItemValue": "Data from the German chargepoint registry provided by Bundesnetzagentur.de under the CC-BY 4.0 license"
        }
    ],
    "DataQualityLevel": 3,
    "DateCreated": "2021-07-08T09:49:00Z",
    "SubmissionStatusTypeID": 100
}