{
    "IsRecentlyVerified": false,
    "ID": 54093,
    "UUID": "60D87378-AD3B-4759-9C34-D0A3AB8BEDA3",
    "DataProviderID": 1,
    "OperatorID": 101,
    "UsageTypeID": 4,
    "AddressInfo": {
        "ID": 54439,
        "Title": "Jakob-Preh-Schule",
        "AddressLine1": "Poststraße 31",
        "Town": " Bad Neustadt",
        "Postcode": "97616",
        "CountryID": 87,
        "Latitude": 50.3272452,
        "Longitude": 10.2179422,
        "ContactTelephone1": "+49 (0)9771 636380",
        "AccessComments": "Position / Lage Im Schulhof der Berufsschule. Zufahrt nur von Poststraße möglich, bis zum Ende der Straße ans Tor fahren. Tor ist außerhalb der Schulzeiten nicht verschlossen und kann zur Seite geschoben werden. Nach dem Tor 90 Grad rechts fahren und um die Schule herumfahren. Die drei Typ 2 Anschlüsse liefern 20A, also 14 kW. Daher als 11 kW eingetragen\r\n",
        "RelatedURL": "http://www.bs-nes.de",
        "DistanceUnit": 0
    },
    "Connections": [
        {
            "ID": 67802,
            "ConnectionTypeID": 28,
            "StatusTypeID": 50,
            "LevelID": 2,
            "PowerKW": 3.7,
            "CurrentTypeID": 10,
            "Quantity": 3
        },
        {
            "ID": 67803,
            "ConnectionTypeID": 25,
            "StatusTypeID": 50,
            "LevelID": 2,
            "PowerKW": 11,
            "CurrentTypeID": 20,
            "Quantity": 3
        },
        {
            "ID": 67804,
            "ConnectionTypeID": 16,
            "StatusTypeID": 50,
            "LevelID": 2,
            "PowerKW": 3.7,
            "CurrentTypeID": 10,
            "Quantity": 0
        },
        {
            "ID": 67805,
            "ConnectionTypeID": 17,
            "StatusTypeID": 50,
            "LevelID": 2,
            "PowerKW": 0,
            "CurrentTypeID": 20,
            "Quantity": 0
        },
        {
            "ID": 67806,
            "ConnectionTypeID": 2,
            "StatusTypeID": 50,
            "LevelID": 2,
            "PowerKW": 0,
            "CurrentTypeID": 30,
            "Quantity": 0
        },
        {
            "ID": 67807,
            "ConnectionTypeID": 33,
            "StatusTypeID": 50,
            "LevelID": 2,
            "PowerKW": 0,
            "CurrentTypeID": 30,
            "Quantity": 0
        }
    ],
    "NumberOfPoints": 6,
    "StatusTypeID": 50,
    "DateLastStatusUpdate": "2015-09-23T19:10:00Z",
    "DataQualityLevel": 1,
    "DateCreated": "2015-09-22T21:13:00Z",
    "SubmissionStatusTypeID": 200
}