{
    "IsRecentlyVerified": false,
    "ID": 46400,
    "UUID": "06739FF4-A802-4C90-B50B-D013379FE361",
    "DataProviderID": 1,
    "DataProvidersReference": "293",
    "AddressInfo": {
        "ID": 46746,
        "Title": "Frysjaparken, Oslo",
        "AddressLine1": "Kjelsåsveien 172",
        "Town": "OSLO",
        "StateOrProvince": "Oslo",
        "Postcode": "0884",
        "CountryID": 168,
        "Latitude": 59.96693,
        "Longitude": 10.76845,
        "AccessComments": "Utenfor Kone Heis.",
        "DistanceUnit": 0
    },
    "Connections": [
        {
            "ID": 57063,
            "ConnectionTypeID": 0,
            "Reference": "1",
            "LevelID": 2,
            "Amps": 16,
            "Voltage": 230,
            "PowerKW": 3.7,
            "Comments": "Mode 1"
        },
        {
            "ID": 88823,
            "ConnectionTypeID": 0,
            "Reference": "2",
            "LevelID": 2,
            "Amps": 16,
            "Voltage": 230,
            "PowerKW": 3.7,
            "Comments": "Mode 1"
        }
    ],
    "NumberOfPoints": 2,
    "DateLastStatusUpdate": "2020-05-26T08:23:00Z",
    "DataQualityLevel": 2,
    "DateCreated": "2015-05-03T00:54:00Z",
    "SubmissionStatusTypeID": 100
}