{
    "IsRecentlyVerified": false,
    "ID": 110617,
    "UUID": "6427C10E-56A1-421E-9855-FD3FF4D461BA",
    "DataProviderID": 2,
    "DataProvidersReference": "99444",
    "OperatorID": 5,
    "UsageTypeID": 1,
    "AddressInfo": {
        "ID": 110963,
        "Title": "SUNY NEW PALTZ",
        "AddressLine1": "1 Sojourner Way",
        "Town": "New Paltz",
        "StateOrProvince": "NY",
        "Postcode": "12561",
        "CountryID": 2,
        "Latitude": 41.743938,
        "Longitude": -74.084258,
        "ContactTelephone1": "888-758-4389",
        "AccessComments": "24 hours daily",
        "RelatedURL": "http://www.chargepoint.com/",
        "DistanceUnit": 0
    },
    "Connections": [
        {
            "ID": 155885,
            "ConnectionTypeID": 1,
            "LevelID": 2,
            "Amps": 16,
            "Voltage": 230,
            "PowerKW": 3,
            "CurrentTypeID": 10,
            "Quantity": 4
        }
    ],
    "DateLastStatusUpdate": "2019-12-24T09:19:00Z",
    "DataQualityLevel": 3,
    "DateCreated": "2018-10-18T23:36:00Z",
    "SubmissionStatusTypeID": 100
}