{
    "IsRecentlyVerified": false,
    "ID": 144638,
    "UUID": "271930DA-21DA-49A9-ADD1-6E92B631552B",
    "DataProviderID": 2,
    "DataProvidersReference": "129736",
    "OperatorID": 89,
    "UsageTypeID": 1,
    "AddressInfo": {
        "ID": 144990,
        "Title": "Carrefour Santé Villeray",
        "AddressLine1": "8560 Rue St-Hubert",
        "Town": "Montréal",
        "StateOrProvince": "QC",
        "Postcode": "H2P 1Z7",
        "CountryID": 44,
        "Latitude": 45.548498,
        "Longitude": -73.633716,
        "ContactTelephone1": "888-356-8911",
        "AccessComments": "24 hours daily",
        "RelatedURL": "https://flo.ca/",
        "DistanceUnit": 0
    },
    "Connections": [
        {
            "ID": 201151,
            "ConnectionTypeID": 1,
            "LevelID": 2,
            "Amps": 16,
            "Voltage": 230,
            "PowerKW": 3.7,
            "CurrentTypeID": 10,
            "Quantity": 3
        }
    ],
    "StatusTypeID": 50,
    "DateLastStatusUpdate": "2020-06-26T03:09:00Z",
    "DataQualityLevel": 3,
    "DateCreated": "2019-12-24T09:23:00Z",
    "SubmissionStatusTypeID": 100
}