{
    "UserComments": [
        {
            "ID": 6011,
            "ChargePointID": 43700,
            "CommentTypeID": 50,
            "UserName": "James Blair",
            "Comment": "The point has been damaged and can not be used. The city council are aware and will repair asap ",
            "DateCreated": "2015-07-24T18:18:05.41Z",
            "User": {
                "ID": 5036,
                "Username": "James Blair"
            },
            "CheckinStatusTypeID": 25
        },
        {
            "ID": 4901,
            "ChargePointID": 43700,
            "CommentTypeID": 100,
            "UserName": "Omega Terus",
            "Comment": "Precise location of the charger: 55.955380, -3.287687",
            "DateCreated": "2015-07-12T06:52:31.907Z",
            "User": {
                "ID": 5041,
                "Username": "Omega Terus"
            },
            "CheckinStatusTypeID": 10
        },
        {
            "ID": 4889,
            "ChargePointID": 43700,
            "CommentTypeID": 50,
            "UserName": "Omega Terus",
            "Comment": "Both sockets are at \"disabled drivers only\" parking bays, but with an 8 meter cable I can park in a normal parking spot next to it and still charge, I don't know if you have a shorter cable. ",
            "Rating": 5,
            "DateCreated": "2015-07-11T12:13:21.387Z",
            "User": {
                "ID": 5041,
                "Username": "Omega Terus"
            },
            "CheckinStatusTypeID": 10
        }
    ],
    "MediaItems": [
        {
            "ID": 1695,
            "ChargePointID": 43700,
            "ItemURL": "https://s3-ap-southeast-2.amazonaws.com/openchargemap/images/GB/OCM43700/OCM-43700.orig.2015071206363364.jpeg",
            "ItemThumbnailURL": "https://s3-ap-southeast-2.amazonaws.com/openchargemap/images/GB/OCM43700/OCM-43700.thmb.2015071206363364.jpeg",
            "Comment": "",
            "IsEnabled": true,
            "IsVideo": false,
            "IsFeaturedItem": false,
            "IsExternalResource": false,
            "User": {
                "ID": 5041,
                "Username": "Omega Terus"
            },
            "DateCreated": "2015-07-12T06:37:00Z"
        },
        {
            "ID": 1696,
            "ChargePointID": 43700,
            "ItemURL": "https://s3-ap-southeast-2.amazonaws.com/openchargemap/images/GB/OCM43700/OCM-43700.orig.2015071206365968.jpeg",
            "ItemThumbnailURL": "https://s3-ap-southeast-2.amazonaws.com/openchargemap/images/GB/OCM43700/OCM-43700.thmb.2015071206365968.jpeg",
            "Comment": "",
            "IsEnabled": true,
            "IsVideo": false,
            "IsFeaturedItem": false,
            "IsExternalResource": false,
            "User": {
                "ID": 5041,
                "Username": "Omega Terus"
            },
            "DateCreated": "2015-07-12T06:37:00Z"
        },
        {
            "ID": 1693,
            "ChargePointID": 43700,
            "ItemURL": "https://s3-ap-southeast-2.amazonaws.com/openchargemap/images/GB/OCM43700/OCM-43700.orig.2015071206355226.jpeg",
            "ItemThumbnailURL": "https://s3-ap-southeast-2.amazonaws.com/openchargemap/images/GB/OCM43700/OCM-43700.thmb.2015071206355226.jpeg",
            "Comment": "",
            "IsEnabled": true,
            "IsVideo": false,
            "IsFeaturedItem": false,
            "IsExternalResource": false,
            "User": {
                "ID": 5041,
                "Username": "Omega Terus"
            },
            "DateCreated": "2015-07-12T06:36:00Z"
        },
        {
            "ID": 1694,
            "ChargePointID": 43700,
            "ItemURL": "https://s3-ap-southeast-2.amazonaws.com/openchargemap/images/GB/OCM43700/OCM-43700.orig.2015071206361128.jpeg",
            "ItemThumbnailURL": "https://s3-ap-southeast-2.amazonaws.com/openchargemap/images/GB/OCM43700/OCM-43700.thmb.2015071206361128.jpeg",
            "Comment": "",
            "IsEnabled": true,
            "IsVideo": false,
            "IsFeaturedItem": false,
            "IsExternalResource": false,
            "User": {
                "ID": 5041,
                "Username": "Omega Terus"
            },
            "DateCreated": "2015-07-12T06:36:00Z"
        }
    ],
    "IsRecentlyVerified": false,
    "ID": 43700,
    "UUID": "B6429E4C-B300-4AF1-968F-8BAE04D1A5F0",
    "DataProviderID": 1,
    "OperatorID": 3315,
    "OperatorsReference": "51352,51352",
    "UsageTypeID": 4,
    "UsageCost": "Free",
    "AddressInfo": {
        "ID": 44046,
        "Title": "Drumbrae Library",
        "AddressLine1": "81 Drum Brae Drive",
        "Town": "Edinburgh",
        "Postcode": "EH4 7ES",
        "CountryID": 1,
        "Latitude": 55.95538,
        "Longitude": -3.287687,
        "DistanceUnit": 0
    },
    "Connections": [
        {
            "ID": 53026,
            "ConnectionTypeID": 25,
            "StatusTypeID": 50,
            "LevelID": 2,
            "Amps": 32,
            "Voltage": 230,
            "PowerKW": 7,
            "CurrentTypeID": 10,
            "Quantity": 2
        }
    ],
    "NumberOfPoints": 2,
    "StatusTypeID": 50,
    "DateLastStatusUpdate": "2019-09-19T05:13:00Z",
    "DataQualityLevel": 1,
    "DateCreated": "2015-04-12T13:54:00Z",
    "SubmissionStatusTypeID": 200
}