{
    "IsRecentlyVerified": false,
    "ID": 101904,
    "UUID": "7B3BEAD3-0B16-4DBD-8A66-52E529190651",
    "DataProviderID": 1,
    "OperatorID": 15,
    "UsageTypeID": 1,
    "UsageCost": "$0.25/min; other tariffs available",
    "AddressInfo": {
        "ID": 102250,
        "Title": "EVGo Walgreens",
        "AddressLine1": "19710 Holzwarth Rd, Spring",
        "Town": "Spring",
        "StateOrProvince": "TX",
        "Postcode": "77373",
        "CountryID": 2,
        "Latitude": 30.0536702,
        "Longitude": -95.4330807,
        "RelatedURL": "https://www.evgo.com/",
        "DistanceUnit": 0
    },
    "Connections": [
        {
            "ID": 143869,
            "ConnectionTypeID": 32,
            "StatusTypeID": 50,
            "LevelID": 3,
            "PowerKW": 50,
            "CurrentTypeID": 30,
            "Quantity": 1
        },
        {
            "ID": 143870,
            "ConnectionTypeID": 2,
            "StatusTypeID": 50,
            "LevelID": 3,
            "PowerKW": 50,
            "CurrentTypeID": 30,
            "Quantity": 1
        },
        {
            "ID": 143871,
            "ConnectionTypeID": 1,
            "StatusTypeID": 50,
            "LevelID": 2,
            "PowerKW": 7.2,
            "CurrentTypeID": 10,
            "Quantity": 1
        }
    ],
    "NumberOfPoints": 3,
    "StatusTypeID": 50,
    "DateLastStatusUpdate": "2018-04-19T08:08:00Z",
    "DataQualityLevel": 1,
    "DateCreated": "2018-04-14T19:48:00Z",
    "SubmissionStatusTypeID": 200
}