{
    "IsRecentlyVerified": false,
    "ID": 129148,
    "UUID": "19BA987B-0B43-4619-8B94-C8234CB747C7",
    "DataProviderID": 1,
    "OperatorID": 23,
    "OperatorsReference": "50954",
    "UsageTypeID": 4,
    "AddressInfo": {
        "ID": 129494,
        "Title": "La Quinta Inn By Wyndham Gainesville",
        "AddressLine1": "920 NW 69th Ter",
        "Town": "Gainesville",
        "StateOrProvince": "Florida",
        "Postcode": "32605",
        "CountryID": 2,
        "Latitude": 29.661655,
        "Longitude": -82.417031,
        "ContactTelephone1": "(352) 332-6466",
        "DistanceUnit": 0
    },
    "Connections": [
        {
            "ID": 180796,
            "ConnectionTypeID": 30,
            "StatusTypeID": 50,
            "LevelID": 2,
            "PowerKW": 10,
            "CurrentTypeID": 20,
            "Quantity": 2
        }
    ],
    "NumberOfPoints": 2,
    "GeneralComments": "2 Tesla Connectors, up to 10kW.Available for customers. Self park.",
    "StatusTypeID": 50,
    "DateLastStatusUpdate": "2019-07-15T16:06:00Z",
    "DataQualityLevel": 1,
    "DateCreated": "2019-07-15T16:06:00Z",
    "SubmissionStatusTypeID": 200
}