{
    "IsRecentlyVerified": false,
    "ID": 152243,
    "UUID": "FD0FC22B-2EBB-422C-A55F-581A5B5336CC",
    "DataProviderID": 28,
    "DataProvidersReference": "FR*S86*PSORE*B075",
    "UsageTypeID": 5,
    "AddressInfo": {
        "ID": 152596,
        "Title": "B075",
        "AddressLine1": "Avenue Jean Jaures - 86530 - Naintre",
        "CountryID": 80,
        "Latitude": 46.76305,
        "Longitude": 0.48267,
        "AccessComments": "24/24 7/7 jours",
        "DistanceUnit": 0
    },
    "Connections": [
        {
            "ID": 213056,
            "ConnectionTypeID": 28,
            "StatusTypeID": 50,
            "LevelID": 2,
            "PowerKW": 18,
            "CurrentTypeID": 10
        },
        {
            "ID": 213057,
            "ConnectionTypeID": 26,
            "StatusTypeID": 50,
            "LevelID": 2,
            "PowerKW": 18
        },
        {
            "ID": 245921,
            "ConnectionTypeID": 28,
            "StatusTypeID": 50,
            "LevelID": 2,
            "PowerKW": 18,
            "CurrentTypeID": 10
        },
        {
            "ID": 245922,
            "ConnectionTypeID": 26,
            "StatusTypeID": 50,
            "LevelID": 2,
            "PowerKW": 18
        }
    ],
    "GeneralComments": "",
    "StatusTypeID": 50,
    "DateLastStatusUpdate": "2020-08-27T05:13:00Z",
    "DataQualityLevel": 2,
    "DateCreated": "2020-03-15T10:53:00Z",
    "SubmissionStatusTypeID": 100
}