{
    "UserComments": [
        {
            "ID": 23282,
            "ChargePointID": 93488,
            "CommentTypeID": 10,
            "UserName": "ForumElettrico.it",
            "Comment": "Si può usare solo il CCS perché il touch screen è morto, schiacci e non succede nulla. Leggi la recensione completa qui > https://www.forumelettrico.it/forum/post140399.html#p140399",
            "RelatedURL": "https://www.forumelettrico.it/forum/post140399.html#p140399",
            "DateCreated": "2020-09-27T16:19:51.327Z",
            "User": {
                "ID": 11749,
                "Username": "ForumElettrico.it"
            },
            "CheckinStatusTypeID": 10,
            "IsActionedByEditor": false
        },
        {
            "ID": 22717,
            "ChargePointID": 93488,
            "CommentTypeID": 10,
            "UserName": "ForumElettrico.it",
            "Comment": "Tutto ok con card Hera su CHAdeMO. Leggi la recensione completa qui > https://www.forumelettrico.it/forum/fast-enel-ferrara-t1546.html#p110022",
            "RelatedURL": "https://www.forumelettrico.it/forum/fast-enel-ferrara-t1546.html#p110022",
            "DateCreated": "2020-05-31T16:34:28.58Z",
            "User": {
                "ID": 11749,
                "Username": "ForumElettrico.it"
            },
            "CheckinStatusTypeID": 10,
            "IsActionedByEditor": false
        },
        {
            "ID": 17758,
            "ChargePointID": 93488,
            "CommentTypeID": 10,
            "UserName": "ForumElettrico.it",
            "Comment": "Tutto ok: http://www.forumelettrico.it/forum/fast-enel-ferrara-t1546.html",
            "DateCreated": "2017-10-02T22:33:23.047Z",
            "User": {
                "ID": 11749,
                "Username": "ForumElettrico.it"
            },
            "CheckinStatusTypeID": 10
        }
    ],
    "MediaItems": [
        {
            "ID": 24800,
            "ChargePointID": 93488,
            "ItemURL": "https://s3-ap-southeast-2.amazonaws.com/openchargemap/images/IT/OCM93488/OCM-93488.orig.2020092716200205.jpg",
            "ItemThumbnailURL": "https://s3-ap-southeast-2.amazonaws.com/openchargemap/images/IT/OCM93488/OCM-93488.thmb.2020092716200205.jpg",
            "Comment": "",
            "IsEnabled": true,
            "IsVideo": false,
            "IsFeaturedItem": false,
            "IsExternalResource": false,
            "User": {
                "ID": 11749,
                "Username": "ForumElettrico.it"
            },
            "DateCreated": "2020-09-27T16:20:00Z"
        },
        {
            "ID": 24801,
            "ChargePointID": 93488,
            "ItemURL": "https://s3-ap-southeast-2.amazonaws.com/openchargemap/images/IT/OCM93488/OCM-93488.orig.2020092716200899.jpg",
            "ItemThumbnailURL": "https://s3-ap-southeast-2.amazonaws.com/openchargemap/images/IT/OCM93488/OCM-93488.thmb.2020092716200899.jpg",
            "Comment": "",
            "IsEnabled": true,
            "IsVideo": false,
            "IsFeaturedItem": false,
            "IsExternalResource": false,
            "User": {
                "ID": 11749,
                "Username": "ForumElettrico.it"
            },
            "DateCreated": "2020-09-27T16:20:00Z"
        },
        {
            "ID": 22525,
            "ChargePointID": 93488,
            "ItemURL": "https://s3-ap-southeast-2.amazonaws.com/openchargemap/images/IT/OCM93488/OCM-93488.orig.2020053116344019.jpg",
            "ItemThumbnailURL": "https://s3-ap-southeast-2.amazonaws.com/openchargemap/images/IT/OCM93488/OCM-93488.thmb.2020053116344019.jpg",
            "Comment": "",
            "IsEnabled": true,
            "IsVideo": false,
            "IsFeaturedItem": false,
            "IsExternalResource": false,
            "User": {
                "ID": 11749,
                "Username": "ForumElettrico.it"
            },
            "DateCreated": "2020-05-31T16:35:00Z"
        },
        {
            "ID": 22526,
            "ChargePointID": 93488,
            "ItemURL": "https://s3-ap-southeast-2.amazonaws.com/openchargemap/images/IT/OCM93488/OCM-93488.orig.2020053116344590.jpg",
            "ItemThumbnailURL": "https://s3-ap-southeast-2.amazonaws.com/openchargemap/images/IT/OCM93488/OCM-93488.thmb.2020053116344590.jpg",
            "Comment": "",
            "IsEnabled": true,
            "IsVideo": false,
            "IsFeaturedItem": false,
            "IsExternalResource": false,
            "User": {
                "ID": 11749,
                "Username": "ForumElettrico.it"
            },
            "DateCreated": "2020-05-31T16:35:00Z"
        },
        {
            "ID": 13396,
            "ChargePointID": 93488,
            "ItemURL": "https://s3-ap-southeast-2.amazonaws.com/openchargemap/images/IT/OCM93488/OCM-93488.orig.2017100222333548.jpg",
            "ItemThumbnailURL": "https://s3-ap-southeast-2.amazonaws.com/openchargemap/images/IT/OCM93488/OCM-93488.thmb.2017100222333548.jpg",
            "Comment": "",
            "IsEnabled": true,
            "IsVideo": false,
            "IsFeaturedItem": false,
            "IsExternalResource": false,
            "User": {
                "ID": 11749,
                "Username": "ForumElettrico.it"
            },
            "DateCreated": "2017-10-02T22:34:00Z"
        },
        {
            "ID": 13397,
            "ChargePointID": 93488,
            "ItemURL": "https://s3-ap-southeast-2.amazonaws.com/openchargemap/images/IT/OCM93488/OCM-93488.orig.2017100222334444.jpg",
            "ItemThumbnailURL": "https://s3-ap-southeast-2.amazonaws.com/openchargemap/images/IT/OCM93488/OCM-93488.thmb.2017100222334444.jpg",
            "Comment": "",
            "IsEnabled": true,
            "IsVideo": false,
            "IsFeaturedItem": false,
            "IsExternalResource": false,
            "User": {
                "ID": 11749,
                "Username": "ForumElettrico.it"
            },
            "DateCreated": "2017-10-02T22:34:00Z"
        },
        {
            "ID": 13398,
            "ChargePointID": 93488,
            "ItemURL": "https://s3-ap-southeast-2.amazonaws.com/openchargemap/images/IT/OCM93488/OCM-93488.orig.2017100222335513.jpg",
            "ItemThumbnailURL": "https://s3-ap-southeast-2.amazonaws.com/openchargemap/images/IT/OCM93488/OCM-93488.thmb.2017100222335513.jpg",
            "Comment": "",
            "IsEnabled": true,
            "IsVideo": false,
            "IsFeaturedItem": false,
            "IsExternalResource": false,
            "User": {
                "ID": 11749,
                "Username": "ForumElettrico.it"
            },
            "DateCreated": "2017-10-02T22:34:00Z"
        },
        {
            "ID": 13399,
            "ChargePointID": 93488,
            "ItemURL": "https://s3-ap-southeast-2.amazonaws.com/openchargemap/images/IT/OCM93488/OCM-93488.orig.2017100222340679.jpg",
            "ItemThumbnailURL": "https://s3-ap-southeast-2.amazonaws.com/openchargemap/images/IT/OCM93488/OCM-93488.thmb.2017100222340679.jpg",
            "Comment": "",
            "IsEnabled": true,
            "IsVideo": false,
            "IsFeaturedItem": false,
            "IsExternalResource": false,
            "User": {
                "ID": 11749,
                "Username": "ForumElettrico.it"
            },
            "DateCreated": "2017-10-02T22:34:00Z"
        }
    ],
    "IsRecentlyVerified": false,
    "ID": 93488,
    "UUID": "0D816D0F-3632-4560-9EF0-AA8109457324",
    "DataProviderID": 1,
    "OperatorID": 80,
    "UsageTypeID": 4,
    "UsageCost": "0,40 €/kWh",
    "AddressInfo": {
        "ID": 93834,
        "Title": "EnelX EVA+  ACI Ferrara",
        "AddressLine1": "Viale XVII Novembre",
        "Town": "Ferrara",
        "StateOrProvince": "FE",
        "Postcode": "44122 ",
        "CountryID": 112,
        "Latitude": 44.8489329345881,
        "Longitude": 11.6003644848552,
        "RelatedURL": "http://eneldrive.it",
        "DistanceUnit": 0
    },
    "Connections": [
        {
            "ID": 132392,
            "ConnectionTypeID": 33,
            "StatusTypeID": 50,
            "LevelID": 3,
            "Amps": 120,
            "Voltage": 500,
            "PowerKW": 50,
            "CurrentTypeID": 30,
            "Quantity": 1
        },
        {
            "ID": 132393,
            "ConnectionTypeID": 2,
            "StatusTypeID": 50,
            "LevelID": 3,
            "Amps": 120,
            "Voltage": 500,
            "PowerKW": 50,
            "CurrentTypeID": 30,
            "Quantity": 1
        },
        {
            "ID": 132394,
            "ConnectionTypeID": 1036,
            "StatusTypeID": 50,
            "LevelID": 3,
            "Amps": 64,
            "Voltage": 400,
            "PowerKW": 43,
            "CurrentTypeID": 20,
            "Quantity": 1
        }
    ],
    "NumberOfPoints": 2,
    "GeneralComments": "http://www.forumelettrico.it/forum/fast-enel-ferrara-t1546.html",
    "StatusTypeID": 50,
    "DateLastStatusUpdate": "2020-09-27T16:20:00Z",
    "DataQualityLevel": 1,
    "DateCreated": "2017-09-28T15:16:00Z",
    "SubmissionStatusTypeID": 200
}