{
    "IsRecentlyVerified": false,
    "ID": 124383,
    "UUID": "40C9A121-64C8-459B-A58D-A5D122FF2B09",
    "DataProviderID": 2,
    "DataProvidersReference": "43819",
    "OperatorID": 39,
    "UsageTypeID": 4,
    "AddressInfo": {
        "ID": 124729,
        "Title": "Petaluma Village Premium Outlets",
        "AddressLine1": "2000 Petaluma Blvd. North",
        "Town": "Petaluma",
        "StateOrProvince": "CA",
        "Postcode": "94952",
        "CountryID": 2,
        "Latitude": 38.253652,
        "Longitude": -122.647842,
        "ContactTelephone1": "800-663-5633",
        "AccessComments": "MO: Not Specified; TU: Not Specified; WE: Not Specified; TH: Not Specified; FR: Not Specified; SA: Not Specified; SU: Not Specified",
        "RelatedURL": "http://www.semacharge.com/",
        "DistanceUnit": 0
    },
    "Connections": [
        {
            "ID": 174474,
            "ConnectionTypeID": 1,
            "LevelID": 2,
            "Amps": 16,
            "Voltage": 230,
            "PowerKW": 3,
            "CurrentTypeID": 10,
            "Quantity": 2
        }
    ],
    "DateLastStatusUpdate": "2019-04-06T05:03:00Z",
    "DataQualityLevel": 3,
    "DateCreated": "2019-04-06T05:03:00Z",
    "SubmissionStatusTypeID": 100
}