{
    "IsRecentlyVerified": false,
    "ID": 39005,
    "UUID": "A15A0E30-62A1-48E3-983F-533B76DD884C",
    "DataProviderID": 26,
    "DataProvidersReference": "47468",
    "OperatorID": 178,
    "OperatorsReference": "EVnetNL AL625",
    "UsageCost": "0.00 jaarabonnement",
    "AddressInfo": {
        "ID": 39351,
        "Title": "Hoofdstraat 21K-116",
        "AddressLine1": "Hoofdstraat 21K-116",
        "Town": "Noordenveld",
        "Postcode": "9321 CC",
        "CountryID": 159,
        "Latitude": 53.148955,
        "Longitude": 6.495447,
        "ContactTelephone1": "0800-3522365",
        "RelatedURL": "http://www.evnet.nl",
        "DistanceUnit": 0
    },
    "Connections": [
        {
            "ID": 42516,
            "ConnectionTypeID": 25,
            "LevelID": 2,
            "PowerKW": 11,
            "CurrentTypeID": 10
        }
    ],
    "NumberOfPoints": 2,
    "StatusTypeID": 50,
    "DateLastStatusUpdate": "2016-06-04T02:56:00Z",
    "DataQualityLevel": 3,
    "DateCreated": "2015-01-09T06:08:00Z",
    "SubmissionStatusTypeID": 100
}