{
    "IsRecentlyVerified": false,
    "ID": 30734,
    "UUID": "8F2C6962-42A2-43DA-998C-020F981CB395",
    "DataProviderID": 1,
    "DataProvidersReference": "1896",
    "AddressInfo": {
        "ID": 31080,
        "Title": "Sørkedalsveien, Oslo",
        "AddressLine1": "Sørkedalsveien 150A",
        "Town": "OSLO",
        "StateOrProvince": "Oslo",
        "Postcode": "0754",
        "CountryID": 168,
        "Latitude": 59.94236,
        "Longitude": 10.654927,
        "AccessComments": "Innerst på hovedparkeringen,foran bydel Vestre Aker (FO-byggene).",
        "DistanceUnit": 0
    },
    "Connections": [
        {
            "ID": 33963,
            "ConnectionTypeID": 0,
            "Reference": "1",
            "LevelID": 2,
            "Amps": 16,
            "Voltage": 230,
            "PowerKW": 3.7,
            "Comments": "Mode 2"
        },
        {
            "ID": 86238,
            "ConnectionTypeID": 0,
            "Reference": "2",
            "LevelID": 2,
            "Amps": 16,
            "Voltage": 230,
            "PowerKW": 3.7,
            "Comments": "Mode 2"
        },
        {
            "ID": 86239,
            "ConnectionTypeID": 0,
            "Reference": "3",
            "LevelID": 2,
            "Amps": 16,
            "Voltage": 230,
            "PowerKW": 3.7,
            "Comments": "Mode 2"
        },
        {
            "ID": 86240,
            "ConnectionTypeID": 0,
            "Reference": "4",
            "LevelID": 2,
            "Amps": 16,
            "Voltage": 230,
            "PowerKW": 3.7,
            "Comments": "Mode 2"
        },
        {
            "ID": 86241,
            "ConnectionTypeID": 0,
            "Reference": "5",
            "LevelID": 2,
            "Amps": 16,
            "Voltage": 230,
            "PowerKW": 3.7,
            "Comments": "Mode 2"
        },
        {
            "ID": 86242,
            "ConnectionTypeID": 0,
            "Reference": "6",
            "LevelID": 2,
            "Amps": 16,
            "Voltage": 230,
            "PowerKW": 3.7,
            "Comments": "Mode 2"
        },
        {
            "ID": 86243,
            "ConnectionTypeID": 0,
            "Reference": "7",
            "LevelID": 2,
            "Amps": 16,
            "Voltage": 230,
            "PowerKW": 3.7,
            "Comments": "Mode 2"
        },
        {
            "ID": 88774,
            "ConnectionTypeID": 0,
            "Reference": "8",
            "LevelID": 2,
            "Amps": 16,
            "Voltage": 230,
            "PowerKW": 3.7,
            "Comments": "Mode 2"
        }
    ],
    "NumberOfPoints": 8,
    "DateLastStatusUpdate": "2020-05-26T08:23:00Z",
    "DataQualityLevel": 2,
    "DateCreated": "2014-12-09T09:00:00Z",
    "SubmissionStatusTypeID": 100
}