{
    "IsRecentlyVerified": false,
    "ID": 64005,
    "UUID": "1455489D-81C8-4F77-B37E-5145D0B4BB5F",
    "DataProviderID": 26,
    "DataProvidersReference": "77298",
    "OperatorID": 103,
    "OperatorsReference": "Allego NLALLEGO0006541",
    "UsageCost": "0.00 jaarabonnement",
    "AddressInfo": {
        "ID": 64351,
        "Title": "Wederiklaan 34",
        "AddressLine1": "Wederiklaan 34",
        "Town": "Lelystad",
        "Postcode": "8245 JB",
        "CountryID": 159,
        "Latitude": 52.48994495,
        "Longitude": 5.44858446,
        "ContactTelephone1": "0800-3745337",
        "RelatedURL": "http://www.allego.eu/",
        "DistanceUnit": 0
    },
    "Connections": [
        {
            "ID": 81821,
            "ConnectionTypeID": 25,
            "LevelID": 2,
            "PowerKW": 11,
            "CurrentTypeID": 10
        },
        {
            "ID": 81822,
            "ConnectionTypeID": 25,
            "LevelID": 2,
            "PowerKW": 11,
            "CurrentTypeID": 10
        }
    ],
    "NumberOfPoints": 1,
    "StatusTypeID": 50,
    "DateLastStatusUpdate": "2016-06-04T02:54:00Z",
    "DataQualityLevel": 3,
    "DateCreated": "2016-03-03T12:32:00Z",
    "SubmissionStatusTypeID": 100
}