{
    "IsRecentlyVerified": false,
    "ID": 125949,
    "UUID": "3B8B41CC-55F7-472E-8304-5EEEEAF071F8",
    "DataProviderID": 1,
    "OperatorID": 23,
    "OperatorsReference": "50060",
    "UsageTypeID": 4,
    "AddressInfo": {
        "ID": 126295,
        "Title": "Prince George Street Parking Garage",
        "AddressLine1": "230 N Henry St",
        "Town": "Williamsburg",
        "StateOrProvince": "Virginia",
        "Postcode": "23185",
        "CountryID": 2,
        "Latitude": 37.2728516,
        "Longitude": -76.7068241,
        "ContactTelephone1": "(757) 259-3797",
        "DistanceUnit": 0
    },
    "Connections": [
        {
            "ID": 176542,
            "ConnectionTypeID": 30,
            "StatusTypeID": 50,
            "LevelID": 2,
            "PowerKW": 16,
            "CurrentTypeID": 20,
            "Quantity": 2
        }
    ],
    "NumberOfPoints": 2,
    "GeneralComments": "2 Tesla Connectors, up to 16kW.Parking fees will apply. Self park.",
    "StatusTypeID": 50,
    "DateLastStatusUpdate": "2019-05-10T05:51:00Z",
    "DataQualityLevel": 1,
    "DateCreated": "2019-05-10T05:51:00Z",
    "SubmissionStatusTypeID": 200
}