{
    "IsRecentlyVerified": false,
    "ID": 17199,
    "UUID": "7733BDAA-4B9C-4AE4-9266-881C4000D889",
    "DataProviderID": 22,
    "DataProvidersReference": "57574E4F5E30961F96C7E320BF15A5DD",
    "AddressInfo": {
        "ID": 17544,
        "Title": "日産サティオ富山　魚津店",
        "AddressLine1": "富山県魚津市大光寺1613-1",
        "CountryID": 114,
        "Latitude": 36.81175919,
        "Longitude": 137.4077094,
        "ContactTelephone1": "0765-24-2332",
        "DistanceUnit": 0
    },
    "Connections": [
        {
            "ID": 17440,
            "ConnectionTypeID": 2,
            "LevelID": 2,
            "Amps": 100,
            "Voltage": 480,
            "PowerKW": 48,
            "Quantity": 1
        }
    ],
    "DateLastStatusUpdate": "2013-06-29T08:55:00Z",
    "DataQualityLevel": 2,
    "DateCreated": "2013-06-29T08:55:00Z",
    "SubmissionStatusTypeID": 200
}