{
    "IsRecentlyVerified": false,
    "ID": 122439,
    "UUID": "F6955652-F815-497F-9085-41CB9EA82B50",
    "DataProviderID": 2,
    "DataProvidersReference": "61385",
    "OperatorID": 5,
    "UsageTypeID": 1,
    "AddressInfo": {
        "ID": 122785,
        "Title": "HILTON UNIVERSA",
        "AddressLine1": "555 Universal Hollywood Dr",
        "Town": "Universal City",
        "StateOrProvince": "CA",
        "Postcode": "91608",
        "CountryID": 2,
        "Latitude": 34.137037,
        "Longitude": -118.358402,
        "ContactTelephone1": "888-758-4389",
        "AccessComments": "24 hours daily",
        "RelatedURL": "http://www.chargepoint.com/",
        "DistanceUnit": 0
    },
    "Connections": [
        {
            "ID": 172331,
            "ConnectionTypeID": 1,
            "LevelID": 2,
            "Amps": 16,
            "Voltage": 230,
            "PowerKW": 3,
            "CurrentTypeID": 10,
            "Quantity": 2
        }
    ],
    "DateLastStatusUpdate": "2019-12-24T09:11:00Z",
    "DataQualityLevel": 3,
    "DateCreated": "2019-04-06T05:03:00Z",
    "SubmissionStatusTypeID": 100
}