{
    "IsRecentlyVerified": false,
    "ID": 9117,
    "UUID": "0F173C4A-45B6-4E3D-B76E-7971D84BEC7C",
    "DataProviderID": 1,
    "OperatorID": 1,
    "UsageTypeID": 2,
    "UsageCost": "Free",
    "AddressInfo": {
        "ID": 9014,
        "Title": "Parc automobile Cathédrale",
        "AddressLine1": "Rue d'Estrées",
        "AddressLine2": "",
        "Town": "METZ",
        "StateOrProvince": "",
        "Postcode": "57000 ",
        "CountryID": 80,
        "Latitude": 49.11999770000001,
        "Longitude": 6.174494299999992,
        "ContactTelephone1": "+33(0)3 87 74 49 07 ",
        "ContactTelephone2": "",
        "ContactEmail": "",
        "AccessComments": "Situation géographique  Le parc souterrain de la Cathédrale est situé sous le Marché Couvert, à proximité de la Cathédrale Saint-Etienne. Accès      en voiture :     entrée rue d'Estrées, en arrivant par la place d'Armes ou la place de Chambre.     sortie place de Chambre.     à pied :     accès sur la place du Marché Couvert",
        "RelatedURL": "http://www.mairie-metz.fr/metz2/quotidien/parking/cathedrale.php",
        "DistanceUnit": 0
    },
    "Connections": [
        {
            "ID": 6791,
            "ConnectionTypeID": 0,
            "StatusTypeID": 0,
            "LevelID": 2,
            "Amps": 16,
            "Voltage": 220,
            "PowerKW": 3.5,
            "Quantity": 1
        }
    ],
    "NumberOfPoints": 1,
    "GeneralComments": "Accessible en s'adressant à l'accueil, puisque la place n'est pas signalée",
    "StatusTypeID": 50,
    "DateLastStatusUpdate": "2012-01-19T15:13:00Z",
    "DataQualityLevel": 1,
    "DateCreated": "2012-01-18T16:25:00Z",
    "SubmissionStatusTypeID": 200
}