{
    "IsRecentlyVerified": false,
    "ID": 176734,
    "UUID": "7F2EAC32-BB4B-49CB-8CB3-B80675222227",
    "DataProviderID": 29,
    "DataProvidersReference": "6312",
    "AddressInfo": {
        "ID": 177093,
        "Title": "Bahnhofstr. 55",
        "AddressLine1": "Bahnhofstr. 55",
        "Town": "Leinfelden-Echterdingen",
        "Postcode": "70771",
        "CountryID": 87,
        "Latitude": 48.699255,
        "Longitude": 9.141097,
        "DistanceUnit": 0
    },
    "Connections": [
        {
            "ID": 274988,
            "ConnectionTypeID": 25,
            "StatusTypeID": 50,
            "LevelID": 2,
            "PowerKW": 22,
            "CurrentTypeID": 20
        },
        {
            "ID": 274989,
            "ConnectionTypeID": 25,
            "StatusTypeID": 50,
            "LevelID": 2,
            "PowerKW": 22,
            "CurrentTypeID": 20
        }
    ],
    "StatusTypeID": 0,
    "DateLastStatusUpdate": "2021-07-12T02:41:00Z",
    "MetadataValues": [
        {
            "ID": 9029,
            "MetadataFieldID": 4,
            "ItemValue": "Data from the German chargepoint registry provided by Bundesnetzagentur.de under the CC-BY 4.0 license"
        }
    ],
    "DataQualityLevel": 3,
    "DateCreated": "2021-07-08T09:48:00Z",
    "SubmissionStatusTypeID": 100
}