{
    "IsRecentlyVerified": false,
    "ID": 157107,
    "UUID": "0D3D4417-CE07-470D-8AA4-E60F17FE8A17",
    "DataProviderID": 19,
    "DataProvidersReference": "5629",
    "AddressInfo": {
        "ID": 157461,
        "Title": "Arnatveit Borettslag",
        "AddressLine1": "Stuajordet 11",
        "Town": "ARNATVEIT",
        "StateOrProvince": "Vestland",
        "Postcode": "5262",
        "CountryID": 168,
        "Latitude": 60.40615,
        "Longitude": 5.47972,
        "AccessComments": "Første parkeringsplass på venstre side på \"taket\" av parkeringshuset til Arnatveit Borettslag A-tun.",
        "DistanceUnit": 0
    },
    "Connections": [
        {
            "ID": 225372,
            "ConnectionTypeID": 25,
            "Reference": "1",
            "LevelID": 3,
            "Amps": 32,
            "Voltage": 400,
            "PowerKW": 22,
            "CurrentTypeID": 30
        }
    ],
    "NumberOfPoints": 1,
    "StatusTypeID": 0,
    "DateLastStatusUpdate": "2021-03-24T05:12:00Z",
    "DataQualityLevel": 2,
    "DateCreated": "2020-05-26T08:24:00Z",
    "SubmissionStatusTypeID": 100
}