{
    "IsRecentlyVerified": false,
    "ID": 57974,
    "UUID": "034A38F6-45C3-40F1-8FEA-8CCB01E2BBE2",
    "DataProviderID": 1,
    "OperatorID": 45,
    "UsageTypeID": 5,
    "AddressInfo": {
        "ID": 58320,
        "Title": "Parkhaus Schiedsgraben",
        "AddressLine1": "Schiedgraben 1",
        "AddressLine2": "Tullauer Höhe",
        "Town": "Schwäbisch Hall",
        "StateOrProvince": "Verwaltungsgemeinschaft Schwäbisch Hall",
        "Postcode": "74523",
        "CountryID": 87,
        "Latitude": 49.11037,
        "Longitude": 9.73840999999993,
        "AccessComments": "Rund um die Uhr (24/7) nutzbar. Position: Im Parkhaus P2\r\n",
        "RelatedURL": "http://www.stadtwerke-hall.de/privatkunden/parken/parkmoeglichkeiten.html",
        "DistanceUnit": 0
    },
    "Connections": [
        {
            "ID": 73771,
            "ConnectionTypeID": 25,
            "StatusTypeID": 50,
            "LevelID": 2,
            "Amps": 16,
            "Voltage": 400,
            "PowerKW": 11,
            "CurrentTypeID": 20,
            "Quantity": 2
        }
    ],
    "NumberOfPoints": 2,
    "StatusTypeID": 50,
    "DateLastStatusUpdate": "2015-12-29T15:16:00Z",
    "DataQualityLevel": 1,
    "DateCreated": "2015-12-29T15:16:00Z",
    "SubmissionStatusTypeID": 200
}