{
    "IsRecentlyVerified": false,
    "ID": 51949,
    "UUID": "F6C0BAE0-0ABB-454D-99F3-01E03FD0610D",
    "DataProviderID": 1,
    "OperatorID": 23,
    "OperatorsReference": "7660",
    "UsageTypeID": 1,
    "UsageCost": "Free",
    "AddressInfo": {
        "ID": 52295,
        "Title": "Best Western - Tesla",
        "AddressLine1": "2300 Hilltop Dr",
        "Town": "Redding",
        "StateOrProvince": "CA",
        "Postcode": "96002",
        "CountryID": 2,
        "Latitude": 40.5741544,
        "Longitude": -122.359096,
        "ContactTelephone1": "530-221-6100  877-798-3752",
        "AccessComments": "24 hours daily; for Tesla use only; for guest use only",
        "RelatedURL": "http://www.teslamotors.com/supercharger",
        "DistanceUnit": 0
    },
    "Connections": [
        {
            "ID": 64433,
            "ConnectionTypeID": 30,
            "StatusTypeID": 50,
            "LevelID": 2,
            "Amps": 16,
            "Voltage": 230,
            "PowerKW": 16,
            "CurrentTypeID": 10,
            "Quantity": 2
        }
    ],
    "NumberOfPoints": 2,
    "StatusTypeID": 50,
    "DateLastStatusUpdate": "2017-02-01T10:04:00Z",
    "DataQualityLevel": 3,
    "DateCreated": "2015-08-13T03:43:00Z",
    "SubmissionStatusTypeID": 100
}