{
    "IsRecentlyVerified": false,
    "ID": 49056,
    "UUID": "E7BBE8F1-848F-4E99-A7E7-E9D572EC0458",
    "DataProviderID": 1,
    "OperatorID": 3,
    "OperatorsReference": "PP-12540",
    "UsageTypeID": 6,
    "UsageCost": "Free",
    "AddressInfo": {
        "ID": 49402,
        "Title": "Environment Agency  Lutra House",
        "AddressLine1": "Lutra House, Dodd Way, Off Seedlee Road",
        "AddressLine2": "Walton Summit",
        "Town": "Preston",
        "StateOrProvince": "Lancashire",
        "Postcode": "PR5 8BX",
        "CountryID": 1,
        "Latitude": 53.7188407871923,
        "Longitude": -2.65039249748383,
        "AccessComments": "In Private Carpark",
        "DistanceUnit": 0
    },
    "Connections": [
        {
            "ID": 60622,
            "ConnectionTypeID": 25,
            "StatusTypeID": 50,
            "LevelID": 2,
            "Amps": 32,
            "Voltage": 230,
            "PowerKW": 7,
            "CurrentTypeID": 10,
            "Quantity": 1
        },
        {
            "ID": 105294,
            "ConnectionTypeID": 3,
            "StatusTypeID": 50,
            "LevelID": 2,
            "Amps": 13,
            "Voltage": 230,
            "PowerKW": 3,
            "CurrentTypeID": 10,
            "Quantity": 1
        }
    ],
    "NumberOfPoints": 3,
    "GeneralComments": "Pod-Point T7-S",
    "StatusTypeID": 0,
    "DateLastStatusUpdate": "2019-04-30T05:28:00Z",
    "DataQualityLevel": 1,
    "DateCreated": "2015-07-09T10:11:00Z",
    "SubmissionStatusTypeID": 200
}