{
    "IsRecentlyVerified": false,
    "ID": 160419,
    "UUID": "381B98F4-77DF-49C9-B9C9-07D63C26871A",
    "DataProviderID": 2,
    "DataProvidersReference": "157789",
    "UsageTypeID": 2,
    "AddressInfo": {
        "ID": 160776,
        "Title": "Hydro-Quebec",
        "AddressLine1": "251 25ème Ave",
        "Town": "St-Eustache",
        "StateOrProvince": "QC",
        "Postcode": "J7P 4Y1",
        "CountryID": 44,
        "Latitude": 45.576164,
        "Longitude": -73.87495,
        "ContactTelephone1": "",
        "AccessComments": "",
        "RelatedURL": "",
        "DistanceUnit": 0
    },
    "Connections": [
        {
            "ID": 230813,
            "ConnectionTypeID": 2,
            "LevelID": 3,
            "Amps": 100,
            "Voltage": 400,
            "PowerKW": 40,
            "CurrentTypeID": 30,
            "Quantity": 1
        },
        {
            "ID": 230814,
            "ConnectionTypeID": 32,
            "LevelID": 3,
            "Amps": 100,
            "Voltage": 400,
            "PowerKW": 40,
            "CurrentTypeID": 30,
            "Quantity": 1
        }
    ],
    "GeneralComments": "Planned for future date. Not Operational.",
    "DatePlanned": "2020-09-01T00:00:00Z",
    "StatusTypeID": 150,
    "DateLastStatusUpdate": "2020-06-26T03:09:00Z",
    "DataQualityLevel": 3,
    "DateCreated": "2020-06-26T03:09:00Z",
    "SubmissionStatusTypeID": 100
}