{
    "IsRecentlyVerified": false,
    "ID": 91386,
    "UUID": "621A93F3-FB85-4165-848A-A4ADAB6290DC",
    "DataProviderID": 2,
    "DataProvidersReference": "86121",
    "UsageTypeID": 2,
    "AddressInfo": {
        "ID": 91732,
        "Title": "Duke Energy",
        "AddressLine1": "502 Raleigh St",
        "Town": "Henderson",
        "StateOrProvince": "NC",
        "Postcode": "27536",
        "CountryID": 2,
        "Latitude": 36.339013,
        "Longitude": -78.397746,
        "ContactTelephone1": "",
        "AccessComments": "Employee and fleet vehicle use only",
        "RelatedURL": "",
        "DistanceUnit": 0
    },
    "Connections": [
        {
            "ID": 129539,
            "ConnectionTypeID": 1,
            "LevelID": 2,
            "Amps": 16,
            "Voltage": 230,
            "PowerKW": 3,
            "CurrentTypeID": 10,
            "Quantity": 2
        }
    ],
    "DateLastStatusUpdate": "2019-04-06T04:02:00Z",
    "DataQualityLevel": 3,
    "DateCreated": "2017-08-03T12:25:00Z",
    "SubmissionStatusTypeID": 100
}