{
    "IsRecentlyVerified": false,
    "ID": 40784,
    "UUID": "39F450B1-E3C7-48F6-97F3-13BF29685B86",
    "DataProviderID": 1,
    "OperatorID": 23,
    "OperatorsReference": "6847",
    "UsageTypeID": 1,
    "UsageCost": "$0.23/kWh; other tariffs for older cars",
    "AddressInfo": {
        "ID": 41130,
        "Title": "Dunkin' Donuts - Tesla",
        "AddressLine1": "22 Meetinghouse Ln",
        "Town": "Sagamore Beach",
        "StateOrProvince": "MA",
        "Postcode": "02562",
        "CountryID": 2,
        "Latitude": 41.781195,
        "Longitude": -70.540289,
        "ContactTelephone1": "877-798-3752",
        "AccessComments": "24 hours daily; for Tesla use only",
        "RelatedURL": "http://www.teslamotors.com/supercharger",
        "DistanceUnit": 0
    },
    "Connections": [
        {
            "ID": 44407,
            "ConnectionTypeID": 27,
            "StatusTypeID": 50,
            "LevelID": 3,
            "Amps": 100,
            "Voltage": 400,
            "PowerKW": 120,
            "CurrentTypeID": 30,
            "Quantity": 8
        }
    ],
    "NumberOfPoints": 8,
    "StatusTypeID": 50,
    "DateLastStatusUpdate": "2018-03-13T08:34:00Z",
    "DataQualityLevel": 3,
    "DateCreated": "2015-01-15T07:46:00Z",
    "SubmissionStatusTypeID": 100
}