{
    "IsRecentlyVerified": false,
    "ID": 108377,
    "UUID": "63C0059C-9922-4EB2-91B6-7A22528E0BB6",
    "DataProviderID": 1,
    "OperatorID": 38,
    "UsageTypeID": 1,
    "UsageCost": "free",
    "AddressInfo": {
        "ID": 108723,
        "Title": "LIDL Silvi Marina",
        "AddressLine1": "Via Statale Sud",
        "AddressLine2": "Silvi Marina",
        "Town": "Silvi ",
        "StateOrProvince": "TE",
        "Postcode": "64028",
        "CountryID": 112,
        "Latitude": 42.5398938420202,
        "Longitude": 14.1254462229056,
        "RelatedURL": "https://www.lidl.it",
        "DistanceUnit": 0
    },
    "Connections": [
        {
            "ID": 153229,
            "ConnectionTypeID": 25,
            "StatusTypeID": 50,
            "LevelID": 2,
            "Amps": 22,
            "Voltage": 400,
            "PowerKW": 22,
            "CurrentTypeID": 20,
            "Quantity": 2
        }
    ],
    "NumberOfPoints": 2,
    "StatusTypeID": 50,
    "DateLastStatusUpdate": "2019-09-26T08:42:00Z",
    "DataQualityLevel": 1,
    "DateCreated": "2018-09-26T09:51:00Z",
    "SubmissionStatusTypeID": 200
}