{
    "IsRecentlyVerified": false,
    "ID": 144997,
    "UUID": "F110BD37-EC7E-4319-8F7E-A00BE100CBCD",
    "DataProviderID": 2,
    "DataProvidersReference": "129827",
    "OperatorID": 89,
    "UsageTypeID": 1,
    "AddressInfo": {
        "ID": 145349,
        "Title": "Dieppe - 333 Avenue Acadie",
        "AddressLine1": "333 Avenue Acadie",
        "Town": "Dieppe",
        "StateOrProvince": "NB",
        "Postcode": "E1A 1G9",
        "CountryID": 44,
        "Latitude": 46.095047,
        "Longitude": -64.747472,
        "ContactTelephone1": "888-356-8911",
        "AccessComments": "24 hours daily",
        "RelatedURL": "https://flo.ca/",
        "DistanceUnit": 0
    },
    "Connections": [
        {
            "ID": 201567,
            "ConnectionTypeID": 1,
            "LevelID": 2,
            "Amps": 16,
            "Voltage": 230,
            "PowerKW": 3.7,
            "CurrentTypeID": 10,
            "Quantity": 1
        }
    ],
    "StatusTypeID": 50,
    "DateLastStatusUpdate": "2020-06-26T03:10:00Z",
    "DataQualityLevel": 3,
    "DateCreated": "2019-12-24T09:24:00Z",
    "SubmissionStatusTypeID": 100
}