{
    "IsRecentlyVerified": false,
    "ID": 143323,
    "UUID": "DBDC9293-E87D-48B5-8F6C-706BFB6A0E39",
    "DataProviderID": 2,
    "DataProvidersReference": "147594",
    "OperatorID": 5,
    "UsageTypeID": 1,
    "AddressInfo": {
        "ID": 143675,
        "Title": "COHOES",
        "AddressLine1": "97 N Mohawk St",
        "Town": "Cohoes",
        "StateOrProvince": "NY",
        "Postcode": "12047",
        "CountryID": 2,
        "Latitude": 42.791645,
        "Longitude": -73.71457,
        "ContactTelephone1": "888-758-4389",
        "AccessComments": "24 hours daily",
        "RelatedURL": "http://www.chargepoint.com/",
        "DistanceUnit": 0
    },
    "Connections": [
        {
            "ID": 199622,
            "ConnectionTypeID": 1,
            "LevelID": 2,
            "Amps": 16,
            "Voltage": 230,
            "PowerKW": 3,
            "CurrentTypeID": 10,
            "Quantity": 2
        }
    ],
    "StatusTypeID": 50,
    "DateLastStatusUpdate": "2019-12-24T09:20:00Z",
    "DataQualityLevel": 3,
    "DateCreated": "2019-12-24T09:20:00Z",
    "SubmissionStatusTypeID": 100
}