{
    "IsRecentlyVerified": false,
    "ID": 45615,
    "UUID": "1561E044-440F-4CA7-A13B-68EF7116ABB4",
    "DataProviderID": 1,
    "DataProvidersReference": "2431",
    "AddressInfo": {
        "ID": 45961,
        "Title": "COOP Hemse",
        "AddressLine1": "Järnvägsgatan 9",
        "Town": "HEMSE",
        "StateOrProvince": "GOTLAND",
        "Postcode": "62350",
        "CountryID": 216,
        "Latitude": 57.23893,
        "Longitude": 18.37718,
        "AccessComments": "Laddstationen finns på den östra parkeringen till butiken.",
        "DistanceUnit": 0
    },
    "Connections": [
        {
            "ID": 56278,
            "ConnectionTypeID": 0,
            "Reference": "1",
            "LevelID": 2,
            "Amps": 16,
            "Voltage": 230,
            "PowerKW": 3.7,
            "Comments": "Mode 3"
        },
        {
            "ID": 87823,
            "ConnectionTypeID": 0,
            "Reference": "2",
            "LevelID": 2,
            "Amps": 16,
            "Voltage": 230,
            "PowerKW": 3.7,
            "Comments": "Mode 1"
        }
    ],
    "NumberOfPoints": 2,
    "DateLastStatusUpdate": "2020-05-26T08:21:00Z",
    "DataQualityLevel": 2,
    "DateCreated": "2015-05-03T00:54:00Z",
    "SubmissionStatusTypeID": 100
}