{
    "MediaItems": [
        {
            "ID": 20557,
            "ChargePointID": 2988,
            "ItemURL": "https://s3-ap-southeast-2.amazonaws.com/openchargemap/images/US/OCM2988/OCM-2988.orig.2019121217071903.png",
            "ItemThumbnailURL": "https://s3-ap-southeast-2.amazonaws.com/openchargemap/images/US/OCM2988/OCM-2988.thmb.2019121217071903.png",
            "Comment": "",
            "IsEnabled": true,
            "IsVideo": false,
            "IsFeaturedItem": false,
            "IsExternalResource": false,
            "User": {
                "ID": 23269,
                "Username": "Steve"
            },
            "DateCreated": "2019-12-12T17:08:00Z"
        }
    ],
    "IsRecentlyVerified": false,
    "ID": 2988,
    "UUID": "EBDAD356-93E6-4F27-AB9F-0DCE3D903907",
    "DataProviderID": 2,
    "DataProvidersReference": "36923",
    "UsageTypeID": 1,
    "AddressInfo": {
        "ID": 2989,
        "Title": "Whole Foods Market",
        "AddressLine1": "350 Grasmere Ave",
        "Town": "Fairfield",
        "StateOrProvince": "CT",
        "Postcode": "06824",
        "CountryID": 2,
        "Latitude": 41.157925,
        "Longitude": -73.240315,
        "ContactTelephone1": "203-319-9544",
        "AccessComments": "8am-10pm daily; for customer use only; see inside for access",
        "RelatedURL": "",
        "DistanceUnit": 0
    },
    "Connections": [
        {
            "ID": 3399,
            "ConnectionTypeID": 1,
            "LevelID": 2,
            "Amps": 16,
            "Voltage": 230,
            "PowerKW": 3.7,
            "CurrentTypeID": 10,
            "Quantity": 1
        },
        {
            "ID": 20366,
            "ConnectionTypeID": 1,
            "LevelID": 2,
            "Quantity": 2
        }
    ],
    "DateLastConfirmed": "2011-06-30T00:00:00Z",
    "StatusTypeID": 0,
    "DateLastStatusUpdate": "2020-06-26T03:04:00Z",
    "DataQualityLevel": 1,
    "DateCreated": "2011-01-31T00:00:00Z",
    "SubmissionStatusTypeID": 100
}