{
    "IsRecentlyVerified": false,
    "ID": 157763,
    "UUID": "01D750A5-2946-4B1F-AAFF-4A77F27F27CB",
    "DataProviderID": 1,
    "OperatorID": 32,
    "UsageTypeID": 5,
    "UsageCost": "Polar Plus Card 15p per kWh",
    "AddressInfo": {
        "ID": 158117,
        "Title": "Toby Carvery Worthing ",
        "AddressLine1": "Upper Brighton Road",
        "Town": "Worthing",
        "StateOrProvince": "England",
        "Postcode": "BN14 9JN",
        "CountryID": 1,
        "Latitude": 50.83468231654348,
        "Longitude": -0.367652378776711,
        "RelatedURL": "http://www.polar-network.com",
        "DistanceUnit": 0
    },
    "Connections": [
        {
            "ID": 227291,
            "ConnectionTypeID": 2,
            "Reference": "1",
            "StatusTypeID": 50,
            "LevelID": 3,
            "Amps": 125,
            "Voltage": 400,
            "PowerKW": 50,
            "CurrentTypeID": 30,
            "Quantity": 1
        },
        {
            "ID": 227292,
            "ConnectionTypeID": 33,
            "Reference": "2",
            "StatusTypeID": 50,
            "LevelID": 3,
            "Amps": 125,
            "Voltage": 400,
            "PowerKW": 50,
            "CurrentTypeID": 30,
            "Quantity": 1
        },
        {
            "ID": 256741,
            "ConnectionTypeID": 1036,
            "StatusTypeID": 50,
            "LevelID": 3,
            "PowerKW": 41,
            "CurrentTypeID": 20,
            "Quantity": 1
        }
    ],
    "NumberOfPoints": 2,
    "GeneralComments": "Charge point operated by Chargemaster. Available on the POLAR network. Visit www.polar-network.com to apply.",
    "StatusTypeID": 50,
    "DateLastStatusUpdate": "2020-10-06T23:49:00Z",
    "MetadataValues": [
        {
            "ID": 7296,
            "MetadataFieldID": 4,
            "ItemValue": "Contains public sector information licensed under the Open Government Licence v2.0. http://www.nationalarchives.gov.uk/doc/open-government-licence/version/2/"
        }
    ],
    "DataQualityLevel": 3,
    "DateCreated": "2020-06-25T10:00:00Z",
    "SubmissionStatusTypeID": 100
}