{
    "IsRecentlyVerified": false,
    "ID": 56944,
    "UUID": "CB3F0642-43B9-423E-BE26-3230CAC9A890",
    "DataProviderID": 1,
    "OperatorID": 80,
    "UsageTypeID": 4,
    "UsageCost": "0,40 €/kW",
    "AddressInfo": {
        "ID": 57290,
        "Title": "Eneldrive Break24",
        "AddressLine1": "Strada antica per Villanova – Via Enrico Fermi",
        "Town": "Brindisi",
        "StateOrProvince": "BR",
        "Postcode": "72100",
        "CountryID": 112,
        "Latitude": 40.6266067793339,
        "Longitude": 17.9618909081046,
        "RelatedURL": "http://eneldrive.it",
        "DistanceUnit": 0
    },
    "Connections": [
        {
            "ID": 71891,
            "ConnectionTypeID": 25,
            "StatusTypeID": 50,
            "LevelID": 2,
            "Amps": 32,
            "Voltage": 400,
            "PowerKW": 22,
            "CurrentTypeID": 20,
            "Quantity": 1
        },
        {
            "ID": 71892,
            "ConnectionTypeID": 36,
            "StatusTypeID": 50,
            "LevelID": 2,
            "Amps": 16,
            "Voltage": 240,
            "PowerKW": 3.7,
            "CurrentTypeID": 10,
            "Quantity": 1
        }
    ],
    "NumberOfPoints": 1,
    "StatusTypeID": 50,
    "DateLastStatusUpdate": "2016-05-15T16:35:00Z",
    "DataQualityLevel": 1,
    "DateCreated": "2015-11-17T16:09:00Z",
    "SubmissionStatusTypeID": 200
}