{
    "IsRecentlyVerified": false,
    "ID": 44899,
    "UUID": "9B8A84D0-3AFF-4E0C-912B-9A17BAEF4592",
    "DataProviderID": 1,
    "OperatorID": 32,
    "OperatorsReference": "4070",
    "UsageTypeID": 1,
    "UsageCost": "Inclusive; for Polar Plus subscription members only. No parking fees while charging.",
    "AddressInfo": {
        "ID": 45245,
        "Title": "Lodge Road Car Park",
        "AddressLine1": "Lodge Road",
        "Town": "Daventry",
        "Postcode": "NN11 4FP",
        "CountryID": 1,
        "Latitude": 52.2600611386921,
        "Longitude": -1.15888595581055,
        "AccessComments": "To the left hand side of the main entrance. RFID card can be borrowed from Council’s main reception during opening times.",
        "RelatedURL": "https://www.daventrydc.gov.uk/business/parking/electric-vehicle-charging-point/",
        "DistanceUnit": 0
    },
    "Connections": [
        {
            "ID": 55222,
            "ConnectionTypeID": 25,
            "StatusTypeID": 50,
            "LevelID": 2,
            "Amps": 32,
            "Voltage": 230,
            "PowerKW": 7,
            "CurrentTypeID": 10,
            "Quantity": 2
        }
    ],
    "NumberOfPoints": 4,
    "GeneralComments": "Chargemaster post 2141",
    "StatusTypeID": 50,
    "DateLastStatusUpdate": "2019-03-12T06:14:00Z",
    "DataQualityLevel": 1,
    "DateCreated": "2015-04-21T11:01:00Z",
    "SubmissionStatusTypeID": 200
}