{
    "IsRecentlyVerified": false,
    "ID": 87790,
    "UUID": "2A3C49C2-85BC-463E-97F5-EA792E15C122",
    "DataProviderID": 1,
    "DataProvidersReference": "4043",
    "AddressInfo": {
        "ID": 88136,
        "Title": "Wiredaholm Golf och Konferens",
        "AddressLine1": "Viredaholms Säteri 6E",
        "Town": "ANEBY",
        "StateOrProvince": "JÖNKÖPING",
        "Postcode": "57892",
        "CountryID": 216,
        "Latitude": 57.911485,
        "Longitude": 14.644081,
        "AccessComments": "På parkeringen till Wiredaholm Golf U+0026 Konferens finns fyra offentliga laddpunkter som är tillgänliga året runt.",
        "DistanceUnit": 0
    },
    "Connections": [
        {
            "ID": 124448,
            "ConnectionTypeID": 0,
            "Reference": "1",
            "LevelID": 2,
            "Amps": 16,
            "Voltage": 230,
            "PowerKW": 3.7,
            "Comments": "Mode 3"
        },
        {
            "ID": 124449,
            "ConnectionTypeID": 0,
            "Reference": "2",
            "LevelID": 2,
            "Amps": 16,
            "Voltage": 230,
            "PowerKW": 3.7,
            "Comments": "Mode 3"
        },
        {
            "ID": 124450,
            "ConnectionTypeID": 0,
            "Reference": "3",
            "LevelID": 2,
            "Amps": 16,
            "Voltage": 230,
            "PowerKW": 3.7,
            "Comments": "Mode 3"
        },
        {
            "ID": 124451,
            "ConnectionTypeID": 0,
            "Reference": "4",
            "LevelID": 2,
            "Amps": 16,
            "Voltage": 230,
            "PowerKW": 3.7,
            "Comments": "Mode 3"
        }
    ],
    "NumberOfPoints": 4,
    "DateLastStatusUpdate": "2020-05-26T08:21:00Z",
    "DataQualityLevel": 2,
    "DateCreated": "2017-05-16T11:07:00Z",
    "SubmissionStatusTypeID": 100
}