{
    "IsRecentlyVerified": false,
    "ID": 54983,
    "UUID": "87CE8F96-7A2D-454A-959B-7027D4800B16",
    "DataProviderID": 1,
    "OperatorID": 45,
    "UsageTypeID": 1,
    "AddressInfo": {
        "ID": 55329,
        "Title": "Posto BR Mania",
        "AddressLine1": "Av. Epitácio Pessoa, 2900 - Lagoa",
        "Town": "Rio de Janeiro",
        "StateOrProvince": "Too de Janeiro",
        "Postcode": "22471-0000",
        "CountryID": 36,
        "Latitude": -22.97294,
        "Longitude": -43.20274,
        "ContactTelephone1": "021 93634410",
        "RelatedURL": "http://carstations.com/35949",
        "DistanceUnit": 0
    },
    "Connections": [
        {
            "ID": 69465,
            "ConnectionTypeID": 2,
            "Reference": "CHADEMO",
            "StatusTypeID": 0,
            "LevelID": 3,
            "Amps": 125,
            "Voltage": 400,
            "PowerKW": 50,
            "CurrentTypeID": 30,
            "Quantity": 1
        },
        {
            "ID": 77214,
            "ConnectionTypeID": 1,
            "StatusTypeID": 50,
            "LevelID": 2,
            "Voltage": 240,
            "CurrentTypeID": 10,
            "Quantity": 1
        }
    ],
    "NumberOfPoints": 2,
    "StatusTypeID": 0,
    "DateLastStatusUpdate": "2016-02-12T19:35:00Z",
    "DataQualityLevel": 2,
    "DateCreated": "2015-10-09T07:35:00Z",
    "SubmissionStatusTypeID": 200
}