{
    "IsRecentlyVerified": false,
    "ID": 74323,
    "UUID": "5354FDDC-8D85-4719-9A28-FA1E233C9F3B",
    "DataProviderID": 1,
    "OperatorID": 45,
    "UsageTypeID": 3,
    "AddressInfo": {
        "ID": 74669,
        "Title": "Verkehrs-Institut",
        "AddressLine1": "Furtwänglerstraße 52",
        "AddressLine2": "Mitte",
        "Town": "Bielefeld",
        "StateOrProvince": "Nordrhein-Westfalen",
        "Postcode": "33604",
        "CountryID": 87,
        "Latitude": 52.00366,
        "Longitude": 8.54277000000002,
        "ContactTelephone1": "+49 521 29940",
        "ContactEmail": "info@verkehrs-institut.de",
        "AccessComments": "24/7 nutzbar, Zugangsbedingungen unbekannt. Betreiber ist das Waldhotel, das als Seminarhotel zum Verkehrsinstitut gehört und der Ausbildung von Fahrlehrern dient.",
        "RelatedURL": "http://www.verkehrs-institut.de/",
        "DistanceUnit": 0
    },
    "Connections": [
        {
            "ID": 106878,
            "ConnectionTypeID": 25,
            "StatusTypeID": 50,
            "LevelID": 2,
            "Amps": 16,
            "Voltage": 400,
            "PowerKW": 11,
            "CurrentTypeID": 20,
            "Quantity": 2
        }
    ],
    "NumberOfPoints": 2,
    "StatusTypeID": 50,
    "DateLastStatusUpdate": "2016-12-01T08:05:00Z",
    "DataQualityLevel": 1,
    "DateCreated": "2016-12-01T08:03:00Z",
    "SubmissionStatusTypeID": 200
}