{
    "IsRecentlyVerified": false,
    "ID": 54195,
    "UUID": "921E4BE5-BD4A-4D82-94E7-DF5568398EFC",
    "DataProviderID": 1,
    "OperatorID": 215,
    "UsageTypeID": 4,
    "AddressInfo": {
        "ID": 54541,
        "Title": "Volkswagen Zentrum",
        "AddressLine1": "Marienberg 90",
        "Town": "Nürnberg",
        "Postcode": "90411",
        "CountryID": 87,
        "Latitude": 49.4850936,
        "Longitude": 11.0934409,
        "ContactTelephone1": "+49 911 54 02-0",
        "AccessComments": "Rund um die Uhr (24/7) nutzbar. Umgebung:Tucherland, Airport Nürnberg, U-Bahn Station\r\n",
        "RelatedURL": "http://www.partner.volkswagen.de/p_47970/de.html",
        "DistanceUnit": 0
    },
    "Connections": [
        {
            "ID": 68167,
            "ConnectionTypeID": 25,
            "StatusTypeID": 50,
            "LevelID": 2,
            "PowerKW": 3.7,
            "CurrentTypeID": 10,
            "Quantity": 2
        }
    ],
    "NumberOfPoints": 2,
    "StatusTypeID": 50,
    "DateLastStatusUpdate": "2016-03-23T14:13:00Z",
    "DataQualityLevel": 1,
    "DateCreated": "2015-09-24T17:54:00Z",
    "SubmissionStatusTypeID": 200
}