{
    "UserComments": [
        {
            "ID": 22430,
            "ChargePointID": 56288,
            "CommentTypeID": 10,
            "UserName": "ForumElettrico.it",
            "Comment": "La piazza si trova a meno di 10 minuti a piedi dalla Torre di Pisa. Leggi la recensione qui > https://www.forumelettrico.it/forum/colonnine-enel-x-piazza-caterina-pisa-t6973.html",
            "RelatedURL": "https://www.forumelettrico.it/forum/colonnine-enel-x-piazza-caterina-pisa-t6973.html",
            "DateCreated": "2020-04-14T14:31:24.41Z",
            "User": {
                "ID": 11749,
                "Username": "ForumElettrico.it"
            },
            "CheckinStatusTypeID": 140,
            "IsActionedByEditor": false
        }
    ],
    "MediaItems": [
        {
            "ID": 21939,
            "ChargePointID": 56288,
            "ItemURL": "https://s3-ap-southeast-2.amazonaws.com/openchargemap/images/IT/OCM56288/OCM-56288.orig.2020041414313593.jpg",
            "ItemThumbnailURL": "https://s3-ap-southeast-2.amazonaws.com/openchargemap/images/IT/OCM56288/OCM-56288.thmb.2020041414313593.jpg",
            "Comment": "",
            "IsEnabled": true,
            "IsVideo": false,
            "IsFeaturedItem": false,
            "IsExternalResource": false,
            "User": {
                "ID": 11749,
                "Username": "ForumElettrico.it"
            },
            "DateCreated": "2020-04-14T14:32:00Z"
        },
        {
            "ID": 21940,
            "ChargePointID": 56288,
            "ItemURL": "https://s3-ap-southeast-2.amazonaws.com/openchargemap/images/IT/OCM56288/OCM-56288.orig.2020041414314315.jpg",
            "ItemThumbnailURL": "https://s3-ap-southeast-2.amazonaws.com/openchargemap/images/IT/OCM56288/OCM-56288.thmb.2020041414314315.jpg",
            "Comment": "",
            "IsEnabled": true,
            "IsVideo": false,
            "IsFeaturedItem": false,
            "IsExternalResource": false,
            "User": {
                "ID": 11749,
                "Username": "ForumElettrico.it"
            },
            "DateCreated": "2020-04-14T14:32:00Z"
        },
        {
            "ID": 21941,
            "ChargePointID": 56288,
            "ItemURL": "https://s3-ap-southeast-2.amazonaws.com/openchargemap/images/IT/OCM56288/OCM-56288.orig.2020041414315096.jpg",
            "ItemThumbnailURL": "https://s3-ap-southeast-2.amazonaws.com/openchargemap/images/IT/OCM56288/OCM-56288.thmb.2020041414315096.jpg",
            "Comment": "",
            "IsEnabled": true,
            "IsVideo": false,
            "IsFeaturedItem": false,
            "IsExternalResource": false,
            "User": {
                "ID": 11749,
                "Username": "ForumElettrico.it"
            },
            "DateCreated": "2020-04-14T14:32:00Z"
        },
        {
            "ID": 21942,
            "ChargePointID": 56288,
            "ItemURL": "https://s3-ap-southeast-2.amazonaws.com/openchargemap/images/IT/OCM56288/OCM-56288.orig.2020041414315840.jpg",
            "ItemThumbnailURL": "https://s3-ap-southeast-2.amazonaws.com/openchargemap/images/IT/OCM56288/OCM-56288.thmb.2020041414315840.jpg",
            "Comment": "",
            "IsEnabled": true,
            "IsVideo": false,
            "IsFeaturedItem": false,
            "IsExternalResource": false,
            "User": {
                "ID": 11749,
                "Username": "ForumElettrico.it"
            },
            "DateCreated": "2020-04-14T14:32:00Z"
        },
        {
            "ID": 21943,
            "ChargePointID": 56288,
            "ItemURL": "https://s3-ap-southeast-2.amazonaws.com/openchargemap/images/IT/OCM56288/OCM-56288.orig.2020041414320604.jpg",
            "ItemThumbnailURL": "https://s3-ap-southeast-2.amazonaws.com/openchargemap/images/IT/OCM56288/OCM-56288.thmb.2020041414320604.jpg",
            "Comment": "",
            "IsEnabled": true,
            "IsVideo": false,
            "IsFeaturedItem": false,
            "IsExternalResource": false,
            "User": {
                "ID": 11749,
                "Username": "ForumElettrico.it"
            },
            "DateCreated": "2020-04-14T14:32:00Z"
        }
    ],
    "IsRecentlyVerified": false,
    "ID": 56288,
    "UUID": "14FF5BF0-9DB5-4AD9-A2D7-8F913EFF70CE",
    "DataProviderID": 1,
    "OperatorID": 80,
    "UsageTypeID": 4,
    "UsageCost": "0,45 €/kW",
    "AddressInfo": {
        "ID": 56634,
        "Title": "Santa Caterina d'Alessandria | EnelX",
        "AddressLine1": "Piazza Santa Caterina",
        "Town": "Pisa",
        "StateOrProvince": "PI",
        "Postcode": "56127",
        "CountryID": 112,
        "Latitude": 43.7213913578962,
        "Longitude": 10.403381123193,
        "RelatedURL": "https://www.enelx.com/it/en/electric-mobility",
        "DistanceUnit": 0
    },
    "Connections": [
        {
            "ID": 70984,
            "ConnectionTypeID": 25,
            "StatusTypeID": 50,
            "LevelID": 2,
            "Amps": 32,
            "Voltage": 400,
            "PowerKW": 22,
            "CurrentTypeID": 20,
            "Quantity": 2
        },
        {
            "ID": 70985,
            "ConnectionTypeID": 36,
            "StatusTypeID": 50,
            "LevelID": 2,
            "Amps": 16,
            "Voltage": 240,
            "PowerKW": 3.7,
            "CurrentTypeID": 10,
            "Quantity": 2
        }
    ],
    "NumberOfPoints": 2,
    "StatusTypeID": 50,
    "DateLastStatusUpdate": "2020-04-14T14:32:00Z",
    "DataQualityLevel": 1,
    "DateCreated": "2015-10-27T15:55:00Z",
    "SubmissionStatusTypeID": 200
}