{
    "IsRecentlyVerified": false,
    "ID": 88491,
    "UUID": "CE392984-582C-489F-96A9-FDF7E31DAB31",
    "DataProviderID": 1,
    "OperatorID": 2244,
    "UsageTypeID": 4,
    "AddressInfo": {
        "ID": 88837,
        "Title": "GGEW Netz",
        "AddressLine1": "Dammstraße 68",
        "Town": "Bensheim",
        "StateOrProvince": "Kreis Bergstraße",
        "Postcode": "64625",
        "CountryID": 87,
        "Latitude": 49.68454,
        "Longitude": 8.61572999999999,
        "RelatedURL": "http://www.ggew.de/initiativen/elektromobilitaet",
        "DistanceUnit": 0
    },
    "Connections": [
        {
            "ID": 125518,
            "ConnectionTypeID": 25,
            "StatusTypeID": 50,
            "LevelID": 2,
            "Amps": 16,
            "Voltage": 230,
            "PowerKW": 3.7,
            "CurrentTypeID": 10,
            "Quantity": 1
        }
    ],
    "NumberOfPoints": 1,
    "GeneralComments": "24/7 verfügbar auf dem Parkplatz. Ladepunkt nur mit Ubitricity Smart Cable freischaltbar.",
    "StatusTypeID": 50,
    "DateLastStatusUpdate": "2019-10-21T12:41:00Z",
    "DataQualityLevel": 1,
    "DateCreated": "2017-05-31T10:59:00Z",
    "SubmissionStatusTypeID": 200
}