{
    "IsRecentlyVerified": false,
    "ID": 26135,
    "UUID": "3855DF03-B393-455C-86D1-7C640E7AEFDB",
    "DataProviderID": 2,
    "DataProvidersReference": "45929",
    "OperatorID": 107,
    "UsageTypeID": 1,
    "AddressInfo": {
        "ID": 26481,
        "Title": "Bishop Museum",
        "AddressLine1": "1525 Bernice St",
        "Town": "Honolulu",
        "StateOrProvince": "HI",
        "Postcode": "96817",
        "CountryID": 2,
        "Latitude": 21.333117,
        "Longitude": -157.870771,
        "ContactTelephone1": "650-845-2869",
        "AccessComments": "9am-5pm W-M",
        "RelatedURL": "http://www.opconnect.com/",
        "DistanceUnit": 0
    },
    "Connections": [
        {
            "ID": 28507,
            "ConnectionTypeID": 1,
            "LevelID": 2,
            "Amps": 16,
            "Voltage": 230,
            "PowerKW": 3.7,
            "CurrentTypeID": 10,
            "Quantity": 4
        }
    ],
    "DateLastStatusUpdate": "2020-06-26T02:52:00Z",
    "DataQualityLevel": 3,
    "DateCreated": "2014-11-28T03:37:00Z",
    "SubmissionStatusTypeID": 100
}