{
    "IsRecentlyVerified": false,
    "ID": 35891,
    "UUID": "11F8D23F-2B6F-4606-BB6D-B35FD7AD322E",
    "DataProviderID": 26,
    "DataProvidersReference": "50595",
    "OperatorID": 180,
    "OperatorsReference": "Alfen GDH0191",
    "UsageCost": "0.00 jaarabonnement",
    "AddressInfo": {
        "ID": 36237,
        "Title": "Bazarstraat 5",
        "AddressLine1": "Bazarstraat 5",
        "Town": "Den Haag",
        "Postcode": "2518 AE",
        "CountryID": 159,
        "Latitude": 52.085324,
        "Longitude": 4.301436,
        "ContactTelephone1": "036 - 549 34 00",
        "RelatedURL": "http://www.icu-charging-stations.com/",
        "DistanceUnit": 0
    },
    "Connections": [
        {
            "ID": 39402,
            "ConnectionTypeID": 25,
            "LevelID": 2,
            "PowerKW": 11,
            "CurrentTypeID": 10
        },
        {
            "ID": 48107,
            "ConnectionTypeID": 25,
            "LevelID": 2,
            "PowerKW": 11,
            "CurrentTypeID": 10
        }
    ],
    "NumberOfPoints": 1,
    "StatusTypeID": 50,
    "DateLastStatusUpdate": "2016-06-04T02:50:00Z",
    "DataQualityLevel": 3,
    "DateCreated": "2015-01-09T06:05:00Z",
    "SubmissionStatusTypeID": 100
}