{
    "IsRecentlyVerified": false,
    "ID": 54236,
    "UUID": "665E9730-77C2-4BA8-867B-6BD5D46539B9",
    "DataProviderID": 1,
    "OperatorID": 32,
    "OperatorsReference": "852",
    "UsageTypeID": 4,
    "UsageCost": "Inclusive; for Polar Plus subscription members only",
    "AddressInfo": {
        "ID": 54582,
        "Title": "Crown Road",
        "AddressLine1": "Crown Road",
        "Town": "Grays",
        "Postcode": "RM17 6JD",
        "CountryID": 1,
        "Latitude": 51.476299,
        "Longitude": 0.32598,
        "DistanceUnit": 0
    },
    "Connections": [
        {
            "ID": 68246,
            "ConnectionTypeID": 3,
            "StatusTypeID": 50,
            "LevelID": 2,
            "Amps": 13,
            "Voltage": 230,
            "PowerKW": 3,
            "CurrentTypeID": 10,
            "Quantity": 1
        },
        {
            "ID": 68247,
            "ConnectionTypeID": 25,
            "StatusTypeID": 50,
            "LevelID": 2,
            "Amps": 32,
            "Voltage": 230,
            "PowerKW": 7,
            "CurrentTypeID": 10,
            "Quantity": 1
        }
    ],
    "NumberOfPoints": 1,
    "StatusTypeID": 50,
    "DateLastStatusUpdate": "2019-03-09T06:26:00Z",
    "DataQualityLevel": 1,
    "DateCreated": "2015-09-25T11:20:00Z",
    "SubmissionStatusTypeID": 200
}