{
    "IsRecentlyVerified": false,
    "ID": 152337,
    "UUID": "A72068C6-7528-4C33-9EA0-928E548287C1",
    "DataProviderID": 28,
    "DataProvidersReference": "",
    "UsageTypeID": 5,
    "AddressInfo": {
        "ID": 152690,
        "Title": "LA CELLE GUENAND 1449",
        "AddressLine1": "Place de l'église - 37350 LA CELLE GUENAND",
        "CountryID": 80,
        "Latitude": 46.944576,
        "Longitude": 0.894899,
        "AccessComments": "24/24 7/7",
        "DistanceUnit": 0
    },
    "Connections": [
        {
            "ID": 213229,
            "ConnectionTypeID": 28,
            "StatusTypeID": 50,
            "LevelID": 2,
            "PowerKW": 18,
            "CurrentTypeID": 10
        },
        {
            "ID": 213230,
            "ConnectionTypeID": 25,
            "StatusTypeID": 50,
            "LevelID": 2,
            "PowerKW": 18,
            "CurrentTypeID": 10
        }
    ],
    "GeneralComments": "www.virtaev.fr",
    "StatusTypeID": 50,
    "DateLastStatusUpdate": "2020-03-15T10:53:00Z",
    "DataQualityLevel": 2,
    "DateCreated": "2020-03-15T10:53:00Z",
    "SubmissionStatusTypeID": 100
}