{
    "IsRecentlyVerified": false,
    "ID": 31560,
    "UUID": "B921BFE5-6AF2-49AB-AB20-9A6E38919D1E",
    "DataProviderID": 26,
    "DataProvidersReference": "54265",
    "OperatorID": 78,
    "OperatorsReference": "Essent EM-CH-00002000-01-00004",
    "UsageCost": "0.00 jaarabonnement",
    "AddressInfo": {
        "ID": 31906,
        "Title": "Quai du Port",
        "AddressLine1": "Quai du Port",
        "Town": "Neuchâtel",
        "Postcode": "2000",
        "CountryID": 217,
        "Latitude": 46.991823,
        "Longitude": 6.934156,
        "RelatedURL": "http://www.essent.nl",
        "DistanceUnit": 0
    },
    "Connections": [
        {
            "ID": 35071,
            "ConnectionTypeID": 25,
            "LevelID": 2,
            "PowerKW": 11,
            "CurrentTypeID": 10
        },
        {
            "ID": 45973,
            "ConnectionTypeID": 25,
            "LevelID": 2,
            "PowerKW": 11,
            "CurrentTypeID": 10
        }
    ],
    "NumberOfPoints": 1,
    "StatusTypeID": 50,
    "DateLastStatusUpdate": "2016-06-04T02:37:00Z",
    "DataQualityLevel": 3,
    "DateCreated": "2015-01-09T06:03:00Z",
    "SubmissionStatusTypeID": 100
}