{
    "IsRecentlyVerified": false,
    "ID": 67169,
    "UUID": "67EEE553-FA9F-4614-922E-EC212D82ACEE",
    "DataProviderID": 1,
    "OperatorID": 23,
    "OperatorsReference": "13115",
    "UsageTypeID": 1,
    "UsageCost": "Free",
    "AddressInfo": {
        "ID": 67515,
        "Title": "Sheraton Sonoma County - Tesla",
        "AddressLine1": "745 Baywood Dr",
        "Town": "Petaluma",
        "StateOrProvince": "CA",
        "Postcode": "94954",
        "CountryID": 2,
        "Latitude": 38.2305567,
        "Longitude": -122.6129963,
        "ContactTelephone1": "707-283-2888  877-798-3752",
        "AccessComments": "24 hours daily; for Tesla use only",
        "RelatedURL": "http://www.teslamotors.com/supercharger",
        "DistanceUnit": 0
    },
    "Connections": [
        {
            "ID": 92665,
            "ConnectionTypeID": 30,
            "StatusTypeID": 50,
            "LevelID": 2,
            "Amps": 16,
            "Voltage": 230,
            "PowerKW": 16,
            "CurrentTypeID": 10,
            "Quantity": 2
        }
    ],
    "NumberOfPoints": 2,
    "StatusTypeID": 50,
    "DateLastStatusUpdate": "2017-01-31T19:33:00Z",
    "DataQualityLevel": 3,
    "DateCreated": "2016-05-29T02:04:00Z",
    "SubmissionStatusTypeID": 100
}