{
    "IsRecentlyVerified": false,
    "ID": 136912,
    "UUID": "F47B2A9C-5DEF-4E12-B68B-AC7DBDA704D9",
    "DataProviderID": 18,
    "DataProvidersReference": "01b0a736edebbeb4d272d3836ccca896",
    "OperatorID": 20,
    "UsageTypeID": 1,
    "AddressInfo": {
        "ID": 137258,
        "Title": "Napier Street",
        "AddressLine1": "Napier Street",
        "Town": "Jarrow",
        "Postcode": "NE32 3NE",
        "CountryID": 1,
        "Latitude": 54.977491,
        "Longitude": -1.443943,
        "AccessComments": "",
        "RelatedURL": "http://www.chargeyourcar.org.uk",
        "DistanceUnit": 0
    },
    "Connections": [
        {
            "ID": 191606,
            "ConnectionTypeID": 2,
            "Reference": "1",
            "StatusTypeID": 50,
            "LevelID": 3,
            "Amps": 125,
            "Voltage": 400,
            "PowerKW": 50,
            "CurrentTypeID": 30
        },
        {
            "ID": 191607,
            "ConnectionTypeID": 1036,
            "Reference": "2",
            "StatusTypeID": 50,
            "LevelID": 3,
            "Amps": 125,
            "Voltage": 400,
            "PowerKW": 50,
            "CurrentTypeID": 30
        },
        {
            "ID": 191608,
            "ConnectionTypeID": 1036,
            "Reference": "3",
            "StatusTypeID": 50,
            "LevelID": 3,
            "Amps": 63,
            "Voltage": 400,
            "PowerKW": 43,
            "CurrentTypeID": 20
        }
    ],
    "StatusTypeID": 0,
    "DateLastStatusUpdate": "2021-07-12T03:39:00Z",
    "MetadataValues": [
        {
            "ID": 6764,
            "MetadataFieldID": 4,
            "ItemValue": "Contains public sector information licensed under the Open Government Licence v2.0. http://www.nationalarchives.gov.uk/doc/open-government-licence/version/2/"
        }
    ],
    "DataQualityLevel": 3,
    "DateCreated": "2019-12-24T05:23:00Z",
    "SubmissionStatusTypeID": 100
}