{
    "IsRecentlyVerified": false,
    "ID": 177051,
    "UUID": "F1FB7445-0DE2-4DDF-868B-51C052B5FBE7",
    "DataProviderID": 29,
    "DataProvidersReference": "8553",
    "OperatorID": 103,
    "AddressInfo": {
        "ID": 177410,
        "Title": "Ludwig-Erhard-Ring 2",
        "AddressLine1": "Ludwig-Erhard-Ring 2",
        "Town": "Berg / Neumarkt ",
        "Postcode": "92348",
        "CountryID": 87,
        "Latitude": 49.312984,
        "Longitude": 11.475445,
        "DistanceUnit": 0
    },
    "Connections": [
        {
            "ID": 275733,
            "ConnectionTypeID": 33,
            "StatusTypeID": 50,
            "LevelID": 3,
            "PowerKW": 50,
            "CurrentTypeID": 30
        },
        {
            "ID": 275734,
            "ConnectionTypeID": 2,
            "StatusTypeID": 50,
            "LevelID": 3,
            "PowerKW": 50,
            "CurrentTypeID": 30
        },
        {
            "ID": 296872,
            "ConnectionTypeID": 1036,
            "StatusTypeID": 50,
            "LevelID": 3,
            "PowerKW": 43,
            "CurrentTypeID": 20
        }
    ],
    "StatusTypeID": 0,
    "DateLastStatusUpdate": "2021-07-12T02:43:00Z",
    "MetadataValues": [
        {
            "ID": 9345,
            "MetadataFieldID": 4,
            "ItemValue": "Data from the German chargepoint registry provided by Bundesnetzagentur.de under the CC-BY 4.0 license"
        }
    ],
    "DataQualityLevel": 3,
    "DateCreated": "2021-07-08T09:48:00Z",
    "SubmissionStatusTypeID": 100
}