{
    "IsRecentlyVerified": false,
    "ID": 118725,
    "UUID": "BE72CC4F-BC0B-4CEC-BCE3-311378A67654",
    "DataProviderID": 1,
    "OperatorID": 3327,
    "UsageTypeID": 4,
    "AddressInfo": {
        "ID": 119071,
        "Title": "Cavalleggeri di Treviso | BeCharge",
        "AddressLine1": "Via Cavalleggeri di Treviso",
        "Town": "Treviso",
        "StateOrProvince": "TV",
        "Postcode": "31100",
        "CountryID": 112,
        "Latitude": 45.6745388199516,
        "Longitude": 12.2574917610926,
        "ContactTelephone1": "02-49527730",
        "ContactEmail": "emobility@buildingenergy.it",
        "RelatedURL": "https://www.bec.energy/",
        "DistanceUnit": 0
    },
    "Connections": [
        {
            "ID": 167933,
            "ConnectionTypeID": 25,
            "StatusTypeID": 150,
            "LevelID": 2,
            "Amps": 32,
            "Voltage": 400,
            "PowerKW": 22,
            "CurrentTypeID": 20,
            "Quantity": 4
        }
    ],
    "NumberOfPoints": 4,
    "GeneralComments": "Max 2h\r\n",
    "StatusTypeID": 150,
    "DateLastStatusUpdate": "2019-03-31T14:44:00Z",
    "DataQualityLevel": 1,
    "DateCreated": "2019-03-31T14:36:00Z",
    "SubmissionStatusTypeID": 200
}