{
    "IsRecentlyVerified": false,
    "ID": 172358,
    "UUID": "5193CDA3-14D6-40D6-A81E-97ACC8F506D3",
    "DataProviderID": 1,
    "OperatorID": 5,
    "UsageTypeID": 1,
    "AddressInfo": {
        "ID": 172717,
        "Title": "Community Savings Bank",
        "AddressLine1": "201 E Main St ",
        "Town": "Manchester",
        "StateOrProvince": "IA",
        "Postcode": "52057",
        "CountryID": 2,
        "Latitude": 42.4839,
        "Longitude": -91.456191,
        "DistanceUnit": 0
    },
    "Connections": [
        {
            "ID": 263518,
            "ConnectionTypeID": 1,
            "StatusTypeID": 50,
            "Quantity": 2
        },
        {
            "ID": 263519,
            "ConnectionTypeID": 1,
            "StatusTypeID": 50,
            "Quantity": 2
        }
    ],
    "NumberOfPoints": 2,
    "StatusTypeID": 50,
    "DateLastStatusUpdate": "2021-01-31T11:45:00Z",
    "DataQualityLevel": 1,
    "DateCreated": "2021-01-31T03:38:00Z",
    "SubmissionStatusTypeID": 200
}