{
    "IsRecentlyVerified": false,
    "ID": 107998,
    "UUID": "233A5AA8-F3F8-45FC-8D99-2C4948AE4309",
    "DataProviderID": 1,
    "OperatorID": 125,
    "UsageTypeID": 4,
    "AddressInfo": {
        "ID": 108344,
        "Title": "Supermarkt Edeka",
        "AddressLine1": "Astruper Straße 4",
        "Town": "Hatten",
        "StateOrProvince": "Landkreis Oldenburg",
        "Postcode": "26209",
        "CountryID": 87,
        "Latitude": 53.05375626598852,
        "Longitude": 8.251674890074128,
        "AccessComments": "24/7 nutzbare Ladesäule auf dem Parkplatz",
        "DistanceUnit": 0
    },
    "Connections": [
        {
            "ID": 152538,
            "ConnectionTypeID": 25,
            "StatusTypeID": 50,
            "LevelID": 2,
            "Amps": 32,
            "Voltage": 400,
            "PowerKW": 22,
            "CurrentTypeID": 20,
            "Quantity": 2
        }
    ],
    "NumberOfPoints": 2,
    "StatusTypeID": 50,
    "DateLastStatusUpdate": "2018-08-24T06:03:00Z",
    "DataQualityLevel": 1,
    "DateCreated": "2018-08-24T06:03:00Z",
    "SubmissionStatusTypeID": 200
}