{
    "IsRecentlyVerified": false,
    "ID": 80331,
    "UUID": "20096265-E244-4F0A-A4B7-A04E139FAA9B",
    "DataProviderID": 2,
    "DataProvidersReference": "80592",
    "UsageTypeID": 1,
    "AddressInfo": {
        "ID": 80677,
        "Title": "Toledo Museum of Art",
        "AddressLine1": "2445 Monroe St",
        "Town": "Toledo",
        "StateOrProvince": "OH",
        "Postcode": "43604",
        "CountryID": 2,
        "Latitude": 41.658295,
        "Longitude": -83.559497,
        "ContactTelephone1": "419-255-8000",
        "AccessComments": "10am-4pm T-W, 10am-9pm Th-F, 10am-5pm Sat, 12pm-5pm Sun",
        "RelatedURL": "",
        "DistanceUnit": 0
    },
    "Connections": [
        {
            "ID": 115006,
            "ConnectionTypeID": 1,
            "LevelID": 2,
            "Amps": 16,
            "Voltage": 230,
            "PowerKW": 3.7,
            "CurrentTypeID": 10,
            "Quantity": 1
        }
    ],
    "DateLastStatusUpdate": "2020-06-26T03:04:00Z",
    "DataQualityLevel": 3,
    "DateCreated": "2017-01-31T01:05:00Z",
    "SubmissionStatusTypeID": 100
}