{
    "UserComments": [
        {
            "ID": 14132,
            "ChargePointID": 52441,
            "CommentTypeID": 110,
            "UserName": "Simon Hewison",
            "Comment": "Moved location to suit address. Please confirm location is now correct if possible.",
            "DateCreated": "2016-08-22T17:04:41.453Z",
            "User": {
                "ID": 4575,
                "Username": "Simon Hewison"
            },
            "CheckinStatusTypeID": 0
        },
        {
            "ID": 14131,
            "ChargePointID": 52441,
            "CommentTypeID": 100,
            "UserName": "freeze2000f",
            "Comment": "Wrong geocoding! Station ought to be in Daun, Germany. But it's currently located in the US.\n",
            "DateCreated": "2016-08-22T11:43:58.117Z",
            "User": {
                "ID": 11757,
                "Username": "freeze2000f"
            },
            "CheckinStatusTypeID": 200
        }
    ],
    "IsRecentlyVerified": false,
    "ID": 52441,
    "UUID": "075DE314-DF1F-45AD-A953-3198FCEB062B",
    "DataProviderID": 1,
    "OperatorID": 105,
    "UsageTypeID": 1,
    "AddressInfo": {
        "ID": 52787,
        "Title": "E-Bike Station Marktplatz",
        "AddressLine1": "Wirichplatz 1",
        "Town": "Daun",
        "Postcode": "54550",
        "CountryID": 87,
        "Latitude": 50.194986969949795,
        "Longitude": 6.8311940267753934,
        "RelatedURL": "http://www.rwe.com/web/cms/de/494436/e-bikes-on-tour/ladestationen/",
        "DistanceUnit": 0
    },
    "Connections": [
        {
            "ID": 65094,
            "ConnectionTypeID": 28,
            "StatusTypeID": 50,
            "LevelID": 1,
            "Amps": 10,
            "Voltage": 230,
            "PowerKW": 2.3,
            "CurrentTypeID": 10,
            "Quantity": 3
        }
    ],
    "NumberOfPoints": 3,
    "StatusTypeID": 50,
    "DateLastStatusUpdate": "2016-08-23T05:46:00Z",
    "DataQualityLevel": 1,
    "DateCreated": "2015-08-28T21:59:00Z",
    "SubmissionStatusTypeID": 200
}