{
    "IsRecentlyVerified": false,
    "ID": 165054,
    "UUID": "E0CAB939-E767-492B-B7EB-F96ED6CDA7B9",
    "DataProviderID": 1,
    "OperatorID": 23,
    "OperatorsReference": "45415",
    "UsageTypeID": 4,
    "AddressInfo": {
        "ID": 165413,
        "Title": "Hotell Utsikten Geiranger",
        "AddressLine1": "Hotell Utsikten Geiranger",
        "Postcode": "350",
        "CountryID": 168,
        "Latitude": 62.092607,
        "Longitude": 7.224439,
        "ContactTelephone1": " +47 70269660",
        "DistanceUnit": 0
    },
    "Connections": [
        {
            "ID": 236654,
            "ConnectionTypeID": 30,
            "StatusTypeID": 50,
            "LevelID": 2,
            "PowerKW": 22,
            "CurrentTypeID": 20,
            "Quantity": 1
        }
    ],
    "NumberOfPoints": 1,
    "GeneralComments": "1 Tesla Connector, up to 22kW.Available for customers. Self park.",
    "StatusTypeID": 50,
    "DateLastStatusUpdate": "2020-08-25T05:47:00Z",
    "DataQualityLevel": 1,
    "DateCreated": "2020-08-25T05:47:00Z",
    "SubmissionStatusTypeID": 200
}