{
    "IsRecentlyVerified": false,
    "ID": 32222,
    "UUID": "58A1D00D-891C-4A02-8B25-1A414B198B2E",
    "DataProviderID": 26,
    "DataProvidersReference": "28936",
    "OperatorID": 69,
    "OperatorsReference": "STAWAG - Betriebsgelände",
    "UsageCost": "0.00 afhankelijk van pas",
    "AddressInfo": {
        "ID": 32568,
        "Title": "Lombardenstraße",
        "AddressLine1": "Lombardenstraße",
        "Town": "Aachen",
        "Postcode": "52070",
        "CountryID": 87,
        "Latitude": 50.782,
        "Longitude": 6.101,
        "RelatedURL": "http://ladenetz.de",
        "DistanceUnit": 0
    },
    "Connections": [
        {
            "ID": 35733,
            "ConnectionTypeID": 2,
            "LevelID": 3,
            "PowerKW": 50,
            "CurrentTypeID": 30
        }
    ],
    "NumberOfPoints": 1,
    "StatusTypeID": 50,
    "DateLastStatusUpdate": "2016-03-03T12:35:00Z",
    "DataQualityLevel": 3,
    "DateCreated": "2015-01-09T06:03:00Z",
    "SubmissionStatusTypeID": 100
}