{
    "IsRecentlyVerified": false,
    "ID": 32409,
    "UUID": "B1FC37F9-95A8-4EAC-AA12-68A76814D9B0",
    "DataProviderID": 26,
    "DataProvidersReference": "47334",
    "OperatorID": 178,
    "OperatorsReference": "EVnetNL AL490",
    "UsageCost": "0.00 jaarabonnement",
    "AddressInfo": {
        "ID": 32755,
        "Title": "Borrekuilstraat",
        "AddressLine1": "Borrekuilstraat",
        "Town": "Sittard-Geleen",
        "Postcode": "6162 XK",
        "CountryID": 159,
        "Latitude": 50.975825,
        "Longitude": 5.824309,
        "ContactTelephone1": "0800-3522365",
        "RelatedURL": "http://www.evnet.nl",
        "DistanceUnit": 0
    },
    "Connections": [
        {
            "ID": 35920,
            "ConnectionTypeID": 25,
            "LevelID": 2,
            "PowerKW": 11,
            "CurrentTypeID": 10
        }
    ],
    "NumberOfPoints": 2,
    "StatusTypeID": 50,
    "DateLastStatusUpdate": "2016-06-04T02:38:00Z",
    "DataQualityLevel": 3,
    "DateCreated": "2015-01-09T06:03:00Z",
    "SubmissionStatusTypeID": 100
}