{
    "IsRecentlyVerified": false,
    "ID": 135370,
    "UUID": "BFE3B606-26C5-43AC-BF9B-19BDFF0553FB",
    "DataProviderID": 1,
    "OperatorID": 1,
    "UsageTypeID": 1,
    "AddressInfo": {
        "ID": 135716,
        "Title": "McDonald's Limón",
        "AddressLine1": "Avenida Ismael Pantoja y Ricardo Alvarado",
        "Town": "Limón",
        "StateOrProvince": "Limón",
        "Postcode": "70101",
        "CountryID": 58,
        "Latitude": 9.989621,
        "Longitude": -83.033318,
        "DistanceUnit": 0
    },
    "Connections": [
        {
            "ID": 189672,
            "ConnectionTypeID": 32,
            "StatusTypeID": 50,
            "LevelID": 3,
            "Amps": 50,
            "Voltage": 480,
            "PowerKW": 50,
            "CurrentTypeID": 30,
            "Quantity": 1
        },
        {
            "ID": 189673,
            "ConnectionTypeID": 2,
            "StatusTypeID": 50,
            "LevelID": 3,
            "Amps": 50,
            "Voltage": 480,
            "PowerKW": 50,
            "CurrentTypeID": 30,
            "Quantity": 1
        }
    ],
    "NumberOfPoints": 1,
    "StatusTypeID": 50,
    "DateLastStatusUpdate": "2019-12-19T22:01:00Z",
    "DataQualityLevel": 1,
    "DateCreated": "2019-12-19T22:01:00Z",
    "SubmissionStatusTypeID": 200
}