{
    "IsRecentlyVerified": false,
    "ID": 123384,
    "UUID": "9D2DF560-C3A1-46FB-BA4E-46C2C9608E46",
    "DataProviderID": 2,
    "DataProvidersReference": "80498",
    "OperatorID": 5,
    "UsageTypeID": 1,
    "AddressInfo": {
        "ID": 123730,
        "Title": "HOWARD HUGHES",
        "AddressLine1": "Marketwalk Pl",
        "Town": "Las Vegas",
        "StateOrProvince": "NV",
        "Postcode": "89135",
        "CountryID": 2,
        "Latitude": 36.1499021,
        "Longitude": -115.3342056,
        "ContactTelephone1": "888-758-4389",
        "AccessComments": "24 hours daily",
        "RelatedURL": "http://www.chargepoint.com/",
        "DistanceUnit": 0
    },
    "Connections": [
        {
            "ID": 173355,
            "ConnectionTypeID": 1,
            "LevelID": 2,
            "Amps": 16,
            "Voltage": 230,
            "PowerKW": 3.7,
            "CurrentTypeID": 10,
            "Quantity": 2
        }
    ],
    "DateLastStatusUpdate": "2020-06-26T02:58:00Z",
    "DataQualityLevel": 3,
    "DateCreated": "2019-04-06T05:03:00Z",
    "SubmissionStatusTypeID": 100
}