{
    "IsRecentlyVerified": false,
    "ID": 145743,
    "UUID": "073A4EED-8636-4742-B1AA-5996FDDFD9BA",
    "DataProviderID": 2,
    "DataProvidersReference": "118690",
    "OperatorID": 5,
    "UsageTypeID": 1,
    "AddressInfo": {
        "ID": 146095,
        "Title": "HYL",
        "AddressLine1": "1650 Marine Dr",
        "Town": "West Vancouver",
        "StateOrProvince": "BC",
        "Postcode": "V7V 1J1",
        "CountryID": 44,
        "Latitude": 49.3282252,
        "Longitude": -123.1590678,
        "ContactTelephone1": "888-758-4389",
        "AccessComments": "24 hours daily",
        "RelatedURL": "http://www.chargepoint.com/",
        "DistanceUnit": 0
    },
    "Connections": [
        {
            "ID": 202473,
            "ConnectionTypeID": 1,
            "LevelID": 2,
            "Amps": 16,
            "Voltage": 230,
            "PowerKW": 3.7,
            "CurrentTypeID": 10,
            "Quantity": 1
        }
    ],
    "StatusTypeID": 50,
    "DateLastStatusUpdate": "2020-06-26T03:12:00Z",
    "DataQualityLevel": 3,
    "DateCreated": "2019-12-24T09:25:00Z",
    "SubmissionStatusTypeID": 100
}