{
    "IsRecentlyVerified": false,
    "ID": 116234,
    "UUID": "A21CD86D-0376-4661-88DD-EA4627468DEA",
    "DataProviderID": 1,
    "DataProvidersReference": "5205",
    "AddressInfo": {
        "ID": 116580,
        "Title": "ICA Kvantum Ystad",
        "AddressLine1": "Almelundsvägen 4",
        "Town": "YSTAD",
        "StateOrProvince": "SKÅNE",
        "Postcode": "27199",
        "CountryID": 216,
        "Latitude": 55.44465,
        "Longitude": 13.80846,
        "AccessComments": "ICA Kvantum Ystad",
        "DistanceUnit": 0
    },
    "Connections": [
        {
            "ID": 163338,
            "ConnectionTypeID": 0,
            "Reference": "1",
            "LevelID": 2,
            "Amps": 32,
            "Voltage": 400,
            "PowerKW": 22,
            "Comments": "Mode 3"
        },
        {
            "ID": 163339,
            "ConnectionTypeID": 0,
            "Reference": "2",
            "LevelID": 2,
            "Amps": 32,
            "Voltage": 400,
            "PowerKW": 22,
            "Comments": "Mode 3"
        },
        {
            "ID": 163340,
            "ConnectionTypeID": 0,
            "Reference": "3",
            "LevelID": 2,
            "Amps": 32,
            "Voltage": 400,
            "PowerKW": 22,
            "Comments": "Mode 3"
        },
        {
            "ID": 163341,
            "ConnectionTypeID": 0,
            "Reference": "4",
            "LevelID": 2,
            "Amps": 32,
            "Voltage": 400,
            "PowerKW": 22,
            "Comments": "Mode 3"
        }
    ],
    "NumberOfPoints": 4,
    "DateLastStatusUpdate": "2020-05-26T08:21:00Z",
    "DataQualityLevel": 2,
    "DateCreated": "2019-02-11T09:16:00Z",
    "SubmissionStatusTypeID": 100
}