{
    "UserComments": [
        {
            "ID": 19884,
            "ChargePointID": 78709,
            "CommentTypeID": 10,
            "UserName": "Hypermile",
            "Comment": "",
            "Rating": 5,
            "DateCreated": "2018-07-22T21:21:08.77Z",
            "User": {
                "ID": 11824,
                "Username": "Hypermile"
            },
            "CheckinStatusTypeID": 10
        }
    ],
    "IsRecentlyVerified": false,
    "ID": 78709,
    "UUID": "A4244A22-AB5E-43FB-A42D-6F43563FF543",
    "DataProviderID": 1,
    "OperatorID": 23,
    "OperatorsReference": "23448",
    "UsageTypeID": 4,
    "UsageCost": "$0.20/min >=60kW; $0.10/min <60kW; other tariffs for older cars",
    "AddressInfo": {
        "ID": 79055,
        "Title": "Texarkana Supercharger",
        "AddressLine1": "3101 Mall Drive",
        "Town": "Texarkana",
        "StateOrProvince": "TX",
        "Postcode": "75503-2434",
        "CountryID": 2,
        "Latitude": 33.459926,
        "Longitude": -94.077179,
        "DistanceUnit": 0
    },
    "Connections": [
        {
            "ID": 113328,
            "ConnectionTypeID": 27,
            "StatusTypeID": 50,
            "LevelID": 3,
            "Voltage": 400,
            "PowerKW": 120,
            "CurrentTypeID": 30,
            "Quantity": 8
        }
    ],
    "NumberOfPoints": 8,
    "GeneralComments": "Charging8 Superchargers, available 24/7",
    "StatusTypeID": 50,
    "DateLastStatusUpdate": "2018-07-22T21:21:00Z",
    "DataQualityLevel": 1,
    "DateCreated": "2017-01-26T15:11:00Z",
    "SubmissionStatusTypeID": 200
}