{
    "IsRecentlyVerified": false,
    "ID": 101377,
    "UUID": "49AD1445-0542-43C4-9E50-DF067826D3D1",
    "DataProviderID": 1,
    "OperatorID": 1,
    "UsageTypeID": 1,
    "UsageCost": "Free",
    "AddressInfo": {
        "ID": 101723,
        "Title": "ValMark Chevrolet",
        "AddressLine1": "725 South Interstate 35",
        "Town": "New Braunfels",
        "StateOrProvince": "TX",
        "Postcode": "78130",
        "CountryID": 2,
        "Latitude": 29.6868648,
        "Longitude": -98.1189334,
        "ContactTelephone1": "(830) 606-3451",
        "AccessComments": "There is one Level 2 charger in unlocked metal cabinet on the left side of the dealership by the service bay, avoid blocking traffic. 24 kilowatt fast charger on the south side of the dealership. Available during working hours, M-Sat. 7AM - 7PM. No charge.",
        "DistanceUnit": 0
    },
    "Connections": [
        {
            "ID": 143140,
            "ConnectionTypeID": 32,
            "StatusTypeID": 50,
            "LevelID": 3,
            "Amps": 30,
            "Voltage": 400,
            "PowerKW": 24,
            "CurrentTypeID": 30,
            "Quantity": 1
        },
        {
            "ID": 143141,
            "ConnectionTypeID": 1,
            "StatusTypeID": 50,
            "LevelID": 2,
            "CurrentTypeID": 10,
            "Quantity": 1
        }
    ],
    "NumberOfPoints": 2,
    "StatusTypeID": 50,
    "DateLastStatusUpdate": "2018-07-13T08:39:00Z",
    "DataQualityLevel": 1,
    "DateCreated": "2018-03-26T22:26:00Z",
    "SubmissionStatusTypeID": 200
}