{
    "IsRecentlyVerified": false,
    "ID": 84134,
    "UUID": "D62DDD85-9145-46F9-8EFA-304479C11B70",
    "DataProviderID": 1,
    "OperatorID": 23,
    "OperatorsReference": "29023",
    "UsageTypeID": 4,
    "UsageCost": "HKD 2.90/kWh; /other tariffs for older cars",
    "AddressInfo": {
        "ID": 84480,
        "Title": "E-Max Supercharger",
        "AddressLine1": "Trademart Drive",
        "Town": "Kowloon",
        "StateOrProvince": "Hong Kong",
        "CountryID": 4,
        "Latitude": 22.324074,
        "Longitude": 114.20381,
        "DistanceUnit": 0
    },
    "Connections": [
        {
            "ID": 119535,
            "ConnectionTypeID": 27,
            "StatusTypeID": 50,
            "LevelID": 3,
            "PowerKW": 120,
            "CurrentTypeID": 30,
            "Quantity": 8
        }
    ],
    "NumberOfPoints": 8,
    "GeneralComments": "4 Supercharger spaces and 6 Tesla Wall Connectors on B2.",
    "StatusTypeID": 50,
    "DateLastStatusUpdate": "2019-03-23T07:52:00Z",
    "DataQualityLevel": 1,
    "DateCreated": "2017-02-16T16:59:00Z",
    "SubmissionStatusTypeID": 200
}