{
    "IsRecentlyVerified": false,
    "ID": 113840,
    "UUID": "A0AA2495-A69E-4C94-B4DD-94E69C71D447",
    "DataProviderID": 1,
    "OperatorID": 23,
    "OperatorsReference": "47355",
    "UsageTypeID": 4,
    "AddressInfo": {
        "ID": 114186,
        "Title": "Business Center Tesla 2",
        "AddressLine1": "Moldavska Cesta 8",
        "Town": "Kosice",
        "Postcode": "040 11",
        "CountryID": 204,
        "Latitude": 48.706875,
        "Longitude": 21.245994,
        "ContactTelephone1": " +42 1257 788469",
        "DistanceUnit": 0
    },
    "Connections": [
        {
            "ID": 160410,
            "ConnectionTypeID": 30,
            "StatusTypeID": 50,
            "LevelID": 2,
            "Amps": 32,
            "Voltage": 400,
            "PowerKW": 22,
            "CurrentTypeID": 20,
            "Quantity": 2
        }
    ],
    "NumberOfPoints": 2,
    "GeneralComments": "2 Tesla Connectors, up to 22kW.Available to the public. Self park.",
    "StatusTypeID": 50,
    "DateLastStatusUpdate": "2019-01-02T21:44:00Z",
    "DataQualityLevel": 1,
    "DateCreated": "2019-01-02T21:44:00Z",
    "SubmissionStatusTypeID": 200
}