{
    "IsRecentlyVerified": false,
    "ID": 137118,
    "UUID": "0379613C-05CD-48E3-9BB1-3F84A3956134",
    "DataProviderID": 1,
    "DataProvidersReference": "LSB-00081",
    "OperatorID": 21,
    "UsageTypeID": 4,
    "UsageCost": "Mobi.E compatible card",
    "AddressInfo": {
        "ID": 137464,
        "Title": "LSB-00081",
        "AddressLine1": "Rua da Mesquita 9055",
        "Town": "Lisboa",
        "Postcode": "1070-238",
        "CountryID": 180,
        "Latitude": 38.735367,
        "Longitude": -9.158403,
        "RelatedURL": "http://www.mobie.pt",
        "DistanceUnit": 0
    },
    "Connections": [
        {
            "ID": 191975,
            "ConnectionTypeID": 25,
            "StatusTypeID": 50,
            "LevelID": 2,
            "Amps": 32,
            "Voltage": 230,
            "PowerKW": 7.4,
            "CurrentTypeID": 10,
            "Quantity": 2
        }
    ],
    "NumberOfPoints": 2,
    "StatusTypeID": 50,
    "DateLastStatusUpdate": "2020-08-16T09:34:00Z",
    "DataQualityLevel": 3,
    "DateCreated": "2019-12-24T08:08:00Z",
    "SubmissionStatusTypeID": 100
}