{
    "IsRecentlyVerified": false,
    "ID": 131675,
    "UUID": "22541D8E-4FBE-44C6-BBB7-12417C3584E2",
    "DataProviderID": 1,
    "OperatorID": 20,
    "OperatorsReference": "80706,80707,80708,80709",
    "UsageTypeID": 4,
    "UsageCost": "£0.20/kWh;min £1.00",
    "AddressInfo": {
        "ID": 132021,
        "Title": "Rushcliffe Arena, Rugby Road, Nottingham",
        "AddressLine1": "Rushcliffe Arena, Rugby Road, Nottingham",
        "Postcode": "NG2 7HY",
        "CountryID": 1,
        "Latitude": 52.923608,
        "Longitude": -1.145601,
        "DistanceUnit": 0
    },
    "Connections": [
        {
            "ID": 184291,
            "ConnectionTypeID": 25,
            "StatusTypeID": 50,
            "LevelID": 2,
            "Amps": 32,
            "Voltage": 230,
            "PowerKW": 7,
            "CurrentTypeID": 10,
            "Quantity": 8
        }
    ],
    "NumberOfPoints": 8,
    "StatusTypeID": 50,
    "DateLastStatusUpdate": "2019-09-10T13:52:00Z",
    "DataQualityLevel": 1,
    "DateCreated": "2019-09-10T13:48:00Z",
    "SubmissionStatusTypeID": 200
}