{
    "IsRecentlyVerified": false,
    "ID": 131615,
    "UUID": "86DD9FDE-57F8-48C2-8475-4DF0059CDA05",
    "DataProviderID": 1,
    "OperatorID": 80,
    "UsageTypeID": 4,
    "AddressInfo": {
        "ID": 131961,
        "Title": "CC Malpensa UNO Carrefour | EnelX",
        "AddressLine1": "Via Pietro da Gallarate",
        "Town": "Gallarate",
        "StateOrProvince": "VA",
        "Postcode": "21013",
        "CountryID": 112,
        "Latitude": 45.65175827361432,
        "Longitude": 8.78542407715804,
        "ContactTelephone1": "800.069.850",
        "RelatedURL": "https://www.enelx.com/it/it/emobility",
        "DistanceUnit": 0
    },
    "Connections": [
        {
            "ID": 184198,
            "ConnectionTypeID": 25,
            "StatusTypeID": 50,
            "LevelID": 2,
            "Amps": 32,
            "Voltage": 400,
            "PowerKW": 22,
            "CurrentTypeID": 20,
            "Quantity": 2
        }
    ],
    "NumberOfPoints": 2,
    "StatusTypeID": 50,
    "DateLastStatusUpdate": "2019-09-10T13:32:00Z",
    "DataQualityLevel": 1,
    "DateCreated": "2019-09-10T13:32:00Z",
    "SubmissionStatusTypeID": 200
}