{
    "IsRecentlyVerified": false,
    "ID": 137599,
    "UUID": "87931928-A22E-4F67-93EB-9B44F5A870FC",
    "DataProviderID": 2,
    "DataProvidersReference": "122136",
    "UsageTypeID": 2,
    "AddressInfo": {
        "ID": 137945,
        "Title": "Naval Facilities Engineering Command - Naval Air Station Whiting Field",
        "AddressLine1": "7550 USS Essex St",
        "Town": "Milton",
        "StateOrProvince": "FL",
        "Postcode": "32570",
        "CountryID": 2,
        "Latitude": 30.716265,
        "Longitude": -87.020606,
        "ContactTelephone1": "",
        "AccessComments": "Fleet use only",
        "RelatedURL": "",
        "DistanceUnit": 0
    },
    "Connections": [
        {
            "ID": 192543,
            "ConnectionTypeID": 9,
            "LevelID": 1,
            "Amps": 16,
            "Voltage": 120,
            "PowerKW": 1,
            "CurrentTypeID": 10,
            "Quantity": 3
        }
    ],
    "StatusTypeID": 50,
    "DateLastStatusUpdate": "2019-12-24T09:05:00Z",
    "DataQualityLevel": 3,
    "DateCreated": "2019-12-24T09:05:00Z",
    "SubmissionStatusTypeID": 100
}