{
    "IsRecentlyVerified": false,
    "ID": 166038,
    "UUID": "5F101ABA-2780-48D3-9D1A-CA8F93C3ED13",
    "DataProviderID": 28,
    "DataProvidersReference": "FR*S24*PMB24*148",
    "OperatorID": 3407,
    "UsageTypeID": 5,
    "AddressInfo": {
        "ID": 166397,
        "Title": "LA BACHELLERIE - Aire De Covoiturage",
        "AddressLine1": "Aire De Covoiturage  24210 LA BACHELLERIE",
        "CountryID": 80,
        "Latitude": 45.148058,
        "Longitude": 1.170348,
        "AccessComments": "24h/24 7j/7",
        "DistanceUnit": 0
    },
    "Connections": [
        {
            "ID": 243926,
            "ConnectionTypeID": 28,
            "StatusTypeID": 50,
            "LevelID": 2,
            "PowerKW": 4,
            "CurrentTypeID": 10
        },
        {
            "ID": 243927,
            "ConnectionTypeID": 2,
            "StatusTypeID": 50,
            "LevelID": 3,
            "PowerKW": 50,
            "CurrentTypeID": 30
        }
    ],
    "GeneralComments": "Recharge par badge et avec une application smartphone",
    "StatusTypeID": 50,
    "DateLastStatusUpdate": "2020-08-27T05:12:00Z",
    "DataQualityLevel": 2,
    "DateCreated": "2020-08-27T05:12:00Z",
    "SubmissionStatusTypeID": 100
}