{
    "IsRecentlyVerified": false,
    "ID": 28919,
    "UUID": "3BBF1084-A79D-49CC-A41B-3ECEB41E661F",
    "DataProviderID": 2,
    "DataProvidersReference": "64443",
    "OperatorID": 5,
    "UsageTypeID": 1,
    "AddressInfo": {
        "ID": 29265,
        "Title": "PHILLIPSACADEMY",
        "AddressLine1": "1 Chapel Ave",
        "Town": "Andover",
        "StateOrProvince": "MA",
        "Postcode": "01810",
        "CountryID": 2,
        "Latitude": 42.6496894,
        "Longitude": -71.1336047,
        "ContactTelephone1": "888-758-4389",
        "AccessComments": "24 hours daily",
        "RelatedURL": "http://www.chargepoint.com/",
        "DistanceUnit": 0
    },
    "Connections": [
        {
            "ID": 31778,
            "ConnectionTypeID": 1,
            "LevelID": 2,
            "Amps": 16,
            "Voltage": 230,
            "PowerKW": 3,
            "CurrentTypeID": 10,
            "Quantity": 2
        }
    ],
    "DateLastStatusUpdate": "2019-12-24T09:20:00Z",
    "DataQualityLevel": 3,
    "DateCreated": "2014-11-28T03:38:00Z",
    "SubmissionStatusTypeID": 100
}