{
    "IsRecentlyVerified": false,
    "ID": 28030,
    "UUID": "2F0FB0ED-E6E4-4979-971C-0FFF40B1D4B1",
    "DataProviderID": 2,
    "DataProvidersReference": "61490",
    "OperatorID": 5,
    "UsageTypeID": 1,
    "AddressInfo": {
        "ID": 28376,
        "Title": "SIERRA COLLEGE",
        "AddressLine1": "250 Sierra College Drive",
        "Town": "Grass Valley",
        "StateOrProvince": "CA",
        "Postcode": "95945",
        "CountryID": 2,
        "Latitude": 39.236413,
        "Longitude": -121.045009,
        "ContactTelephone1": "888-758-4389",
        "AccessComments": "24 hours daily",
        "RelatedURL": "http://www.chargepoint.com/",
        "DistanceUnit": 0
    },
    "Connections": [
        {
            "ID": 30794,
            "ConnectionTypeID": 1,
            "LevelID": 2,
            "Amps": 16,
            "Voltage": 230,
            "PowerKW": 3,
            "CurrentTypeID": 10,
            "Quantity": 4
        }
    ],
    "DateLastStatusUpdate": "2019-04-06T04:03:00Z",
    "DataQualityLevel": 3,
    "DateCreated": "2014-11-28T03:38:00Z",
    "SubmissionStatusTypeID": 100
}