{
    "IsRecentlyVerified": true,
    "DateLastVerified": "2021-08-29T13:53:00Z",
    "ID": 188983,
    "UUID": "856BB579-40CA-4FC4-88A4-05AB2B7421D8",
    "DataProviderID": 1,
    "OperatorID": 2247,
    "UsageTypeID": 1,
    "UsageCost": "0.3 €/kWh",
    "AddressInfo": {
        "ID": 189342,
        "Title": "Max Ocio Barakaldo",
        "AddressLine1": "Kareaga",
        "Town": "Barakaldo ",
        "StateOrProvince": "Bizkaia ",
        "CountryID": 210,
        "Latitude": 43.287560412767846,
        "Longitude": -3.0073731941586175,
        "DistanceUnit": 0
    },
    "Connections": [
        {
            "ID": 305441,
            "ConnectionTypeID": 33,
            "StatusTypeID": 50,
            "LevelID": 2,
            "PowerKW": 50,
            "Quantity": 1
        },
        {
            "ID": 305442,
            "ConnectionTypeID": 2,
            "StatusTypeID": 50,
            "LevelID": 2,
            "PowerKW": 50,
            "Quantity": 1
        }
    ],
    "NumberOfPoints": 1,
    "StatusTypeID": 50,
    "DateLastStatusUpdate": "2021-09-01T08:00:00Z",
    "DataQualityLevel": 1,
    "DateCreated": "2021-08-29T13:53:00Z",
    "SubmissionStatusTypeID": 200
}