{
    "IsRecentlyVerified": false,
    "ID": 169894,
    "UUID": "BBC8690F-BECC-428E-9BC1-04F366BBBBBD",
    "DataProviderID": 1,
    "OperatorID": 150,
    "UsageTypeID": 4,
    "UsageCost": "£0.35/kWh",
    "AddressInfo": {
        "ID": 170253,
        "Title": "Morrisons Basingstoke",
        "AddressLine1": "Worting Road",
        "Town": "Basingstoke",
        "StateOrProvince": "England",
        "Postcode": "RG21 8BJ",
        "CountryID": 1,
        "Latitude": 51.26391852277632,
        "Longitude": -1.1035326924247784,
        "ContactTelephone1": "+44 20 3598 4087",
        "AccessComments": "£10.00 overstay fee after 95 mins, then £10.00 every subsequent 95 mins",
        "RelatedURL": "https://www.cpsgenie.com/ds",
        "DistanceUnit": 0
    },
    "Connections": [
        {
            "ID": 258900,
            "ConnectionTypeID": 2,
            "StatusTypeID": 50,
            "LevelID": 3,
            "PowerKW": 50,
            "CurrentTypeID": 30,
            "Quantity": 1
        },
        {
            "ID": 258901,
            "ConnectionTypeID": 33,
            "StatusTypeID": 50,
            "LevelID": 3,
            "PowerKW": 50,
            "CurrentTypeID": 30,
            "Quantity": 1
        },
        {
            "ID": 258902,
            "ConnectionTypeID": 25,
            "StatusTypeID": 50,
            "LevelID": 2,
            "Amps": 32,
            "Voltage": 400,
            "PowerKW": 22,
            "CurrentTypeID": 20,
            "Quantity": 1
        }
    ],
    "NumberOfPoints": 1,
    "StatusTypeID": 50,
    "DateLastStatusUpdate": "2021-07-28T16:01:00Z",
    "DataQualityLevel": 1,
    "DateCreated": "2020-11-12T22:10:00Z",
    "SubmissionStatusTypeID": 200
}