{
    "IsRecentlyVerified": false,
    "ID": 122409,
    "UUID": "28B7B4DD-E021-4B1E-9BEF-1C95B80BC9D4",
    "DataProviderID": 2,
    "DataProvidersReference": "50463",
    "UsageTypeID": 1,
    "AddressInfo": {
        "ID": 122755,
        "Title": "City of Buford - Community Center",
        "AddressLine1": "2200 Buford Hwy NE",
        "Town": "Buford",
        "StateOrProvince": "GA",
        "Postcode": "30518",
        "CountryID": 2,
        "Latitude": 34.11390305,
        "Longitude": -83.99563,
        "ContactTelephone1": "770-945-6762",
        "AccessComments": "24 hours daily",
        "RelatedURL": "",
        "DistanceUnit": 0
    },
    "Connections": [
        {
            "ID": 172297,
            "ConnectionTypeID": 1,
            "LevelID": 2,
            "Amps": 16,
            "Voltage": 230,
            "PowerKW": 3,
            "CurrentTypeID": 10,
            "Quantity": 1
        }
    ],
    "DateLastStatusUpdate": "2019-04-06T05:03:00Z",
    "DataQualityLevel": 3,
    "DateCreated": "2019-04-06T05:03:00Z",
    "SubmissionStatusTypeID": 100
}