{
    "IsRecentlyVerified": false,
    "ID": 125187,
    "UUID": "39541716-F397-4718-9890-E68981825BCB",
    "DataProviderID": 1,
    "OperatorID": 3,
    "OperatorsReference": "PG-82005",
    "UsageTypeID": 6,
    "UsageCost": "Free",
    "AddressInfo": {
        "ID": 125533,
        "Title": "The Fox and Goose Hotel",
        "AddressLine1": "Hanger Lane",
        "Town": "London",
        "StateOrProvince": "England",
        "Postcode": "W5 1DP",
        "CountryID": 1,
        "Latitude": 51.533094,
        "Longitude": -0.295599,
        "DistanceUnit": 0
    },
    "Connections": [
        {
            "ID": 175445,
            "ConnectionTypeID": 25,
            "StatusTypeID": 50,
            "LevelID": 2,
            "Amps": 32,
            "Voltage": 230,
            "PowerKW": 7,
            "CurrentTypeID": 10,
            "Quantity": 2
        }
    ],
    "NumberOfPoints": 2,
    "StatusTypeID": 50,
    "DateLastStatusUpdate": "2019-04-11T13:22:00Z",
    "DataQualityLevel": 1,
    "DateCreated": "2019-04-11T13:22:00Z",
    "SubmissionStatusTypeID": 200
}