{
    "IsRecentlyVerified": false,
    "ID": 152192,
    "UUID": "69290027-3E71-4ABD-91AC-D6E6132614BD",
    "DataProviderID": 28,
    "DataProvidersReference": "FR*S85*P85191*002",
    "UsageTypeID": 5,
    "AddressInfo": {
        "ID": 152545,
        "Title": "LA ROCHE SUR YON - Maison De Quartier, Saint André D'Ornay",
        "AddressLine1": "Maison De Quartier, Saint André D'Ornay 85000 LA ROCHE SUR YON",
        "CountryID": 80,
        "Latitude": 46.66589,
        "Longitude": -1.45374,
        "AccessComments": "24h/24 7j/7",
        "DistanceUnit": 0
    },
    "Connections": [
        {
            "ID": 212953,
            "ConnectionTypeID": 28,
            "StatusTypeID": 50,
            "LevelID": 2,
            "PowerKW": 18,
            "CurrentTypeID": 10
        },
        {
            "ID": 212954,
            "ConnectionTypeID": 25,
            "StatusTypeID": 50,
            "LevelID": 2,
            "PowerKW": 18,
            "CurrentTypeID": 20
        },
        {
            "ID": 245821,
            "ConnectionTypeID": 28,
            "StatusTypeID": 50,
            "LevelID": 2,
            "PowerKW": 18,
            "CurrentTypeID": 10
        },
        {
            "ID": 245822,
            "ConnectionTypeID": 25,
            "StatusTypeID": 50,
            "LevelID": 2,
            "PowerKW": 18,
            "CurrentTypeID": 20
        }
    ],
    "GeneralComments": "Recharge par badge et avec une application smartphone",
    "StatusTypeID": 50,
    "DateLastStatusUpdate": "2020-08-27T05:12:00Z",
    "DataQualityLevel": 2,
    "DateCreated": "2020-03-15T10:53:00Z",
    "SubmissionStatusTypeID": 100
}