{
    "IsRecentlyVerified": false,
    "ID": 158051,
    "UUID": "C725D0B3-0D4F-48AF-9998-7C1B1D488587",
    "DataProviderID": 1,
    "OperatorID": 150,
    "UsageTypeID": 4,
    "UsageCost": "Rapid £1.00 fee then 30p per kWh. AC socket 50p fee then 30p per kWh",
    "AddressInfo": {
        "ID": 158405,
        "Title": "Morrisons Chapel En Le Frith",
        "AddressLine1": "Market Street",
        "Town": "High Peak",
        "Postcode": "SK23 0HZ",
        "CountryID": 1,
        "Latitude": 53.325186,
        "Longitude": -1.911742,
        "ContactTelephone1": "20 3598 4087",
        "AccessComments": "£10 overstay fee after 95 mins, then £10.00 every subsequent 95 mins",
        "RelatedURL": "https://www.cpsgenie.com/ds",
        "DistanceUnit": 0
    },
    "Connections": [
        {
            "ID": 227853,
            "ConnectionTypeID": 25,
            "Reference": "1",
            "StatusTypeID": 50,
            "LevelID": 2,
            "Amps": 32,
            "Voltage": 400,
            "PowerKW": 22,
            "CurrentTypeID": 20,
            "Quantity": 1
        },
        {
            "ID": 227854,
            "ConnectionTypeID": 2,
            "Reference": "2",
            "StatusTypeID": 50,
            "LevelID": 3,
            "Amps": 125,
            "Voltage": 400,
            "PowerKW": 50,
            "CurrentTypeID": 30,
            "Quantity": 1
        },
        {
            "ID": 227855,
            "ConnectionTypeID": 33,
            "Reference": "3",
            "StatusTypeID": 50,
            "LevelID": 3,
            "Amps": 125,
            "Voltage": 400,
            "PowerKW": 50,
            "CurrentTypeID": 30,
            "Quantity": 1
        }
    ],
    "NumberOfPoints": 2,
    "GeneralComments": "Geniepoint 50kw Rapid AC is a 22kw Socket",
    "StatusTypeID": 50,
    "DateLastStatusUpdate": "2020-10-04T22:55:00Z",
    "MetadataValues": [
        {
            "ID": 7584,
            "MetadataFieldID": 4,
            "ItemValue": "Contains public sector information licensed under the Open Government Licence v2.0. http://www.nationalarchives.gov.uk/doc/open-government-licence/version/2/"
        }
    ],
    "DataQualityLevel": 3,
    "DateCreated": "2020-06-25T10:00:00Z",
    "SubmissionStatusTypeID": 100
}