{
    "IsRecentlyVerified": false,
    "ID": 46861,
    "UUID": "2215A5E2-EC13-4646-9C99-CA6A9F2A31AB",
    "DataProviderID": 1,
    "UsageTypeID": 1,
    "UsageCost": "Paid",
    "AddressInfo": {
        "ID": 47207,
        "Title": "Montgermont Decoparc",
        "AddressLine1": "rue Galilée",
        "Town": "Montgermont",
        "StateOrProvince": "France",
        "Postcode": "35",
        "CountryID": 80,
        "Latitude": 48.15561068308219,
        "Longitude": -1.7072457563792796,
        "ContactTelephone1": "+33 2 57 77 00 66",
        "ContactTelephone2": "",
        "RelatedURL": "http://www.sde35.fr/Bea.aspx",
        "DistanceUnit": 0
    },
    "Connections": [
        {
            "ID": 57632,
            "ConnectionTypeID": 2,
            "StatusTypeID": 30,
            "LevelID": 3,
            "PowerKW": 50,
            "CurrentTypeID": 30,
            "Quantity": 1
        },
        {
            "ID": 57633,
            "ConnectionTypeID": 30,
            "StatusTypeID": 50,
            "LevelID": 2,
            "Amps": 32,
            "Voltage": 380,
            "PowerKW": 60,
            "CurrentTypeID": 20,
            "Quantity": 1
        },
        {
            "ID": 57634,
            "ConnectionTypeID": 0,
            "StatusTypeID": 30,
            "LevelID": 3,
            "PowerKW": 50,
            "CurrentTypeID": 30,
            "Quantity": 1
        },
        {
            "ID": 204068,
            "ConnectionTypeID": 33,
            "StatusTypeID": 50,
            "LevelID": 3,
            "PowerKW": 50,
            "CurrentTypeID": 30,
            "Quantity": 1
        },
        {
            "ID": 204069,
            "ConnectionTypeID": 1036,
            "StatusTypeID": 50,
            "LevelID": 3,
            "PowerKW": 43,
            "CurrentTypeID": 20,
            "Quantity": 1
        }
    ],
    "NumberOfPoints": 1,
    "StatusTypeID": 50,
    "DateLastStatusUpdate": "2020-01-15T09:54:00Z",
    "DataQualityLevel": 1,
    "DateCreated": "2015-05-08T10:25:00Z",
    "SubmissionStatusTypeID": 200
}