{
    "IsRecentlyVerified": false,
    "ID": 104266,
    "UUID": "826FE896-38FF-4BF5-AE25-7640C794F643",
    "DataProviderID": 1,
    "OperatorID": 23,
    "OperatorsReference": "43053",
    "UsageTypeID": 4,
    "AddressInfo": {
        "ID": 104612,
        "Title": "Ipark 43-25 Hunter Street",
        "AddressLine1": "43-25 Hunter St",
        "Town": "Long Island City",
        "StateOrProvince": "New York",
        "Postcode": "11101",
        "CountryID": 2,
        "Latitude": 40.747589,
        "Longitude": -73.942612,
        "ContactTelephone1": "(347) 738-6170",
        "DistanceUnit": 0
    },
    "Connections": [
        {
            "ID": 147228,
            "ConnectionTypeID": 30,
            "StatusTypeID": 50,
            "LevelID": 2,
            "PowerKW": 16,
            "CurrentTypeID": 20,
            "Quantity": 8
        }
    ],
    "NumberOfPoints": 8,
    "GeneralComments": "8 Tesla Connectors, up to 16kW.Parking fees will apply. Please see valet.",
    "StatusTypeID": 50,
    "DateLastStatusUpdate": "2018-05-18T05:33:00Z",
    "DataQualityLevel": 1,
    "DateCreated": "2018-05-18T05:33:00Z",
    "SubmissionStatusTypeID": 200
}