{
    "IsRecentlyVerified": false,
    "ID": 94924,
    "UUID": "4939E1BD-200E-42A8-AC88-4130FFA5A0D7",
    "DataProviderID": 1,
    "DataProvidersReference": "4285",
    "AddressInfo": {
        "ID": 95270,
        "Title": "Stora Hamnen",
        "AddressLine1": "Kyrkogatan 14",
        "Town": "SMEDJEBACKEN",
        "StateOrProvince": "DALARNA",
        "Postcode": "77730",
        "CountryID": 216,
        "Latitude": 60.13868,
        "Longitude": 15.41649,
        "AccessComments": "Parkering vid stora hamnen i närheten av toaletter.",
        "DistanceUnit": 0
    },
    "Connections": [
        {
            "ID": 134387,
            "ConnectionTypeID": 0,
            "Reference": "1",
            "LevelID": 2,
            "Amps": 32,
            "Voltage": 400,
            "PowerKW": 22,
            "Comments": "Mode 3"
        },
        {
            "ID": 134388,
            "ConnectionTypeID": 0,
            "Reference": "2",
            "LevelID": 2,
            "Amps": 32,
            "Voltage": 400,
            "PowerKW": 22,
            "Comments": "Mode 3"
        }
    ],
    "NumberOfPoints": 2,
    "DateLastStatusUpdate": "2020-05-26T08:23:00Z",
    "DataQualityLevel": 2,
    "DateCreated": "2017-10-28T13:36:00Z",
    "SubmissionStatusTypeID": 100
}