{
    "IsRecentlyVerified": false,
    "ID": 148266,
    "UUID": "96BEEC57-FBEB-48CF-A0F9-8D1FA08BB3A5",
    "DataProviderID": 1,
    "OperatorID": 3,
    "OperatorsReference": "PG-96733,PG-96749",
    "UsageTypeID": 4,
    "UsageCost": "Free",
    "AddressInfo": {
        "ID": 148618,
        "Title": "Sainsbury's-Olney",
        "AddressLine1": "Lavendon Road",
        "Town": "Olney",
        "Postcode": "MK46 4HH",
        "CountryID": 1,
        "Latitude": 52.162304,
        "Longitude": -0.697265,
        "DistanceUnit": 0
    },
    "Connections": [
        {
            "ID": 205851,
            "ConnectionTypeID": 25,
            "StatusTypeID": 50,
            "LevelID": 2,
            "Amps": 32,
            "Voltage": 230,
            "PowerKW": 7,
            "CurrentTypeID": 10,
            "Quantity": 2
        }
    ],
    "NumberOfPoints": 2,
    "GeneralComments": "This is an open charge unit installed at the Sainsbury's super store at Lavendon Road, Olney",
    "StatusTypeID": 50,
    "DateLastStatusUpdate": "2020-01-30T06:35:00Z",
    "DataQualityLevel": 1,
    "DateCreated": "2020-01-29T06:32:00Z",
    "SubmissionStatusTypeID": 200
}