{
    "IsRecentlyVerified": false,
    "ID": 93854,
    "UUID": "57774B5E-5F21-4ED8-AC6E-AEBF88E78840",
    "DataProviderID": 1,
    "OperatorID": 3,
    "OperatorsReference": "PG-81431",
    "UsageTypeID": 6,
    "UsageCost": "1",
    "AddressInfo": {
        "ID": 94200,
        "Title": "Ecosurety LTD",
        "AddressLine1": "1190 Park Avenue",
        "Town": "Bristol",
        "Postcode": "BS32 4FP",
        "CountryID": 1,
        "Latitude": 51.542087,
        "Longitude": -2.57847,
        "DistanceUnit": 0
    },
    "Connections": [
        {
            "ID": 132861,
            "ConnectionTypeID": 25,
            "StatusTypeID": 50,
            "LevelID": 2,
            "Amps": 32,
            "Voltage": 230,
            "PowerKW": 7,
            "CurrentTypeID": 10,
            "Quantity": 2
        }
    ],
    "NumberOfPoints": 2,
    "GeneralComments": "This is an open charge unit installed at the Ecosurety Ltd site in Park Avenue, Aztec West, Bristol",
    "StatusTypeID": 0,
    "DateLastStatusUpdate": "2020-01-17T09:10:00Z",
    "DataQualityLevel": 1,
    "DateCreated": "2017-10-11T05:19:00Z",
    "SubmissionStatusTypeID": 200
}