{
    "IsRecentlyVerified": false,
    "ID": 71337,
    "UUID": "3392ACEF-E639-4CC9-AE92-49AFE371C03A",
    "DataProviderID": 2,
    "DataProvidersReference": "77365",
    "OperatorID": 5,
    "UsageTypeID": 1,
    "AddressInfo": {
        "ID": 71683,
        "Title": "CARTA",
        "AddressLine1": "301 North Holtzclaw",
        "Town": "Chattanooga",
        "StateOrProvince": "TN",
        "Postcode": "37404",
        "CountryID": 2,
        "Latitude": 35.0437942,
        "Longitude": -85.2805742,
        "ContactTelephone1": "888-758-4389",
        "AccessComments": "24 hours daily",
        "RelatedURL": "http://www.chargepoint.com/",
        "DistanceUnit": 0
    },
    "Connections": [
        {
            "ID": 102148,
            "ConnectionTypeID": 1,
            "LevelID": 2,
            "Amps": 16,
            "Voltage": 230,
            "PowerKW": 3,
            "CurrentTypeID": 10,
            "Quantity": 2
        }
    ],
    "DateLastStatusUpdate": "2019-04-06T04:02:00Z",
    "DataQualityLevel": 3,
    "DateCreated": "2016-09-02T10:14:00Z",
    "SubmissionStatusTypeID": 100
}