{
    "IsRecentlyVerified": false,
    "ID": 23872,
    "UUID": "5F7477BB-6567-4ECB-8521-60D3D418C6A0",
    "DataProviderID": 1,
    "OperatorID": 206,
    "UsageTypeID": 4,
    "UsageCost": "Free",
    "AddressInfo": {
        "ID": 24217,
        "Title": "B:SM 13 - García Fària",
        "AddressLine1": "Pg. de Garcia Fària, 71",
        "Town": "BARCELONA",
        "StateOrProvince": "Barcelona",
        "Postcode": "08019",
        "CountryID": 210,
        "Latitude": 41.404358,
        "Longitude": 2.214861,
        "ContactTelephone1": "93.356.09.17",
        "AccessComments": "Aparcament públic - Targeta BCN Live / Public parking - BCN Live card",
        "RelatedURL": "http://www.aparcamentsbsm.cat/index.php/fichas-xarxa-02/garcia-faria2406-es.html",
        "DistanceUnit": 0
    },
    "Connections": [
        {
            "ID": 25936,
            "ConnectionTypeID": 25,
            "StatusTypeID": 50,
            "LevelID": 2,
            "Amps": 32,
            "Voltage": 230,
            "PowerKW": 7.2,
            "Quantity": 2
        },
        {
            "ID": 65454,
            "ConnectionTypeID": 28,
            "StatusTypeID": 50,
            "LevelID": 2,
            "Amps": 16,
            "Voltage": 230,
            "PowerKW": 3.6,
            "Quantity": 2
        }
    ],
    "NumberOfPoints": 2,
    "GeneralComments": "CIRCUTOR CCL-WB-SL-MIX",
    "StatusTypeID": 50,
    "DateLastStatusUpdate": "2015-09-06T18:53:00Z",
    "DataQualityLevel": 1,
    "DateCreated": "2014-06-03T05:18:00Z",
    "SubmissionStatusTypeID": 200
}