{
    "MediaItems": [
        {
            "ID": 8232,
            "ChargePointID": 71688,
            "ItemURL": "https://s3-ap-southeast-2.amazonaws.com/openchargemap/images/US/OCM71688/OCM-71688.orig.2016090222522253.jpg",
            "ItemThumbnailURL": "https://s3-ap-southeast-2.amazonaws.com/openchargemap/images/US/OCM71688/OCM-71688.thmb.2016090222522253.jpg",
            "Comment": "",
            "IsEnabled": true,
            "IsVideo": false,
            "IsFeaturedItem": false,
            "IsExternalResource": false,
            "User": {
                "ID": 11794,
                "Username": "coffieBeans"
            },
            "DateCreated": "2016-09-02T22:53:00Z"
        }
    ],
    "IsRecentlyVerified": false,
    "ID": 71688,
    "UUID": "FBAF4050-43DB-4DF3-9023-E86A99476002",
    "DataProviderID": 1,
    "OperatorID": 1,
    "UsageTypeID": 5,
    "AddressInfo": {
        "ID": 72034,
        "Title": "Airport Trade Center",
        "AddressLine1": "550 Paiea St",
        "Town": "Honolulu",
        "StateOrProvince": "HI",
        "Postcode": "96819",
        "CountryID": 2,
        "Latitude": 21.3355469,
        "Longitude": -157.9163071,
        "ContactTelephone1": "4157795515",
        "ContactEmail": "info@freewiretech.com",
        "AccessComments": "Download FreeWire app to use stations",
        "RelatedURL": "http://www.freewiretech.com",
        "DistanceUnit": 0
    },
    "Connections": [
        {
            "ID": 102684,
            "ConnectionTypeID": 2,
            "StatusTypeID": 50,
            "LevelID": 3,
            "PowerKW": 50,
            "CurrentTypeID": 30,
            "Quantity": 2
        }
    ],
    "NumberOfPoints": 2,
    "GeneralComments": "Look for blue, box-shaped chargers. ",
    "StatusTypeID": 50,
    "DateLastStatusUpdate": "2016-09-03T19:09:00Z",
    "DataQualityLevel": 1,
    "DateCreated": "2016-09-02T22:51:00Z",
    "SubmissionStatusTypeID": 200
}