{
    "IsRecentlyVerified": false,
    "ID": 159648,
    "UUID": "2F038A7A-C591-48F3-AE91-B9DC02EF4669",
    "DataProviderID": 2,
    "DataProvidersReference": "156252",
    "UsageTypeID": 1,
    "AddressInfo": {
        "ID": 160005,
        "Title": "Rutgers University - CAIT",
        "AddressLine1": "100 Brett Rd",
        "Town": "Piscataway",
        "StateOrProvince": "NJ",
        "Postcode": "08854",
        "CountryID": 2,
        "Latitude": 40.522336,
        "Longitude": -74.459385,
        "ContactTelephone1": "848-445-0579",
        "AccessComments": "24 hours daily; Rutgers University parking permit required",
        "RelatedURL": "",
        "DistanceUnit": 0
    },
    "Connections": [
        {
            "ID": 229849,
            "ConnectionTypeID": 1,
            "LevelID": 2,
            "Amps": 16,
            "Voltage": 230,
            "PowerKW": 3.7,
            "CurrentTypeID": 10,
            "Quantity": 2
        }
    ],
    "StatusTypeID": 50,
    "DateLastStatusUpdate": "2020-06-26T03:03:00Z",
    "DataQualityLevel": 3,
    "DateCreated": "2020-06-26T03:03:00Z",
    "SubmissionStatusTypeID": 100
}