{
    "IsRecentlyVerified": false,
    "ID": 99808,
    "UUID": "1A563B39-6803-4358-8A4D-6078E37BDD30",
    "DataProviderID": 1,
    "OperatorID": 3296,
    "UsageTypeID": 5,
    "UsageCost": "£0.35/kWh",
    "AddressInfo": {
        "ID": 100154,
        "Title": "Bannatyne's Health Club - Livingston",
        "AddressLine1": "Charlesfield Road",
        "Town": "Livingston",
        "Postcode": "EH54 9FD",
        "CountryID": 1,
        "Latitude": 55.873656,
        "Longitude": -3.53863,
        "AccessComments": "Station can be found within the car park of Bannatyne Gym. This station is available for all public use.",
        "DistanceUnit": 0
    },
    "Connections": [
        {
            "ID": 141023,
            "ConnectionTypeID": 2,
            "Reference": "CHA003-024-01",
            "StatusTypeID": 50,
            "LevelID": 3,
            "Amps": 125,
            "Voltage": 400,
            "PowerKW": 50,
            "CurrentTypeID": 30,
            "Quantity": 2
        },
        {
            "ID": 141025,
            "ConnectionTypeID": 33,
            "StatusTypeID": 50,
            "LevelID": 3,
            "Amps": 125,
            "Voltage": 400,
            "PowerKW": 50,
            "CurrentTypeID": 30,
            "Quantity": 2
        }
    ],
    "NumberOfPoints": 2,
    "StatusTypeID": 50,
    "DateLastStatusUpdate": "2018-02-05T22:01:00Z",
    "MetadataValues": [
        {
            "ID": 4083,
            "MetadataFieldID": 4,
            "ItemValue": "Contains public sector information licensed under the Open Government Licence v2.0. http://www.nationalarchives.gov.uk/doc/open-government-licence/version/2/"
        }
    ],
    "DataQualityLevel": 3,
    "DateCreated": "2018-02-05T21:56:00Z",
    "SubmissionStatusTypeID": 200
}