{
    "IsRecentlyVerified": false,
    "ID": 54432,
    "UUID": "839276A3-AAAE-41D1-8348-E9EA684F8730",
    "DataProviderID": 1,
    "OperatorID": 45,
    "UsageTypeID": 3,
    "AddressInfo": {
        "ID": 54778,
        "Title": "Autohaus Gierse & Schöllmann",
        "AddressLine1": "Auf der Lake",
        "AddressLine2": "Wormbacher Mühle",
        "Town": "Schmallenwerg",
        "StateOrProvince": "Hochsauerlandkreis",
        "Postcode": "57392",
        "CountryID": 87,
        "Latitude": 51.1564420188597,
        "Longitude": 8.29325773229368,
        "AccessComments": "Laden am Volkswagen/Audio/Skoda Autohaus. 2 VW eStations mit fest angeschlossenem Typ2 Kabel.",
        "RelatedURL": "http://www.gierse-schoellmann.de",
        "DistanceUnit": 0
    },
    "Connections": [
        {
            "ID": 68634,
            "ConnectionTypeID": 25,
            "StatusTypeID": 50,
            "LevelID": 2,
            "Amps": 16,
            "Voltage": 230,
            "PowerKW": 3.7,
            "CurrentTypeID": 10,
            "Quantity": 2
        }
    ],
    "NumberOfPoints": 2,
    "StatusTypeID": 50,
    "DateLastStatusUpdate": "2015-10-02T11:04:00Z",
    "DataQualityLevel": 1,
    "DateCreated": "2015-10-02T09:33:00Z",
    "SubmissionStatusTypeID": 200
}