{
    "IsRecentlyVerified": false,
    "ID": 21036,
    "UUID": "3FA24B86-2B65-44E2-94E5-EC267453FF62",
    "DataProviderID": 2,
    "DataProvidersReference": "57805",
    "OperatorID": 5,
    "UsageTypeID": 1,
    "AddressInfo": {
        "ID": 21381,
        "Title": "LVVWD",
        "AddressLine1": "333 S. Valley View Blvd.",
        "Town": "Las Vegas",
        "StateOrProvince": "NV",
        "Postcode": "89107",
        "CountryID": 2,
        "Latitude": 36.170154,
        "Longitude": -115.192332,
        "ContactTelephone1": "888-758-4389",
        "AccessComments": "24 hours daily",
        "RelatedURL": "http://www.chargepoint.com/",
        "DistanceUnit": 0
    },
    "Connections": [
        {
            "ID": 22902,
            "ConnectionTypeID": 1,
            "LevelID": 2,
            "Amps": 16,
            "Voltage": 230,
            "PowerKW": 3,
            "CurrentTypeID": 10,
            "Quantity": 4
        }
    ],
    "DateLastStatusUpdate": "2019-04-06T04:02:00Z",
    "DataQualityLevel": 3,
    "DateCreated": "2014-02-06T04:57:00Z",
    "SubmissionStatusTypeID": 100
}