{
    "IsRecentlyVerified": false,
    "ID": 88373,
    "UUID": "0110874B-E14B-4FF4-B359-3C44F33CC495",
    "DataProviderID": 1,
    "OperatorID": 3297,
    "UsageTypeID": 4,
    "AddressInfo": {
        "ID": 88719,
        "Title": "Darmstädter Straße",
        "AddressLine1": "Darmstädter Straße 50",
        "Town": "Fischbachtal",
        "StateOrProvince": "Landkreis Darmstadt-Dieburg",
        "Postcode": "64405",
        "CountryID": 87,
        "Latitude": 49.77295,
        "Longitude": 8.81692999999996,
        "RelatedURL": "https://www.entega.ag",
        "DistanceUnit": 0
    },
    "Connections": [
        {
            "ID": 125348,
            "ConnectionTypeID": 25,
            "StatusTypeID": 50,
            "LevelID": 2,
            "Amps": 32,
            "Voltage": 400,
            "PowerKW": 22,
            "CurrentTypeID": 20,
            "Quantity": 2
        }
    ],
    "NumberOfPoints": 2,
    "GeneralComments": "24/7 nutzbare Ladesäule der Entega AG im Netzwerk LastMileSolutions\r\n",
    "StatusTypeID": 50,
    "DateLastStatusUpdate": "2017-09-27T07:38:00Z",
    "DataQualityLevel": 1,
    "DateCreated": "2017-05-29T06:33:00Z",
    "SubmissionStatusTypeID": 200
}