{
    "IsRecentlyVerified": false,
    "ID": 102499,
    "UUID": "AC195EB8-609D-4D1B-82A5-6B7AEE576D79",
    "DataProviderID": 2,
    "DataProvidersReference": "94736",
    "UsageTypeID": 1,
    "AddressInfo": {
        "ID": 102845,
        "Title": "LA Fitness",
        "AddressLine1": "13822 Garvey Ave",
        "Town": "Baldwin Park",
        "StateOrProvince": "CA",
        "Postcode": "91706",
        "CountryID": 2,
        "Latitude": 34.069363,
        "Longitude": -117.973954,
        "ContactTelephone1": "866-816-7584",
        "AccessComments": "Business hours",
        "RelatedURL": "http://evconnect.com/",
        "DistanceUnit": 0
    },
    "Connections": [
        {
            "ID": 144581,
            "ConnectionTypeID": 1,
            "LevelID": 2,
            "Amps": 16,
            "Voltage": 230,
            "PowerKW": 3,
            "CurrentTypeID": 10,
            "Quantity": 20
        }
    ],
    "DateLastStatusUpdate": "2019-04-06T04:01:00Z",
    "DataQualityLevel": 3,
    "DateCreated": "2018-04-21T04:13:00Z",
    "SubmissionStatusTypeID": 100
}