{
    "IsRecentlyVerified": false,
    "ID": 166173,
    "UUID": "2142402E-7438-46CB-959D-F95A9E1CF644",
    "DataProviderID": 28,
    "DataProvidersReference": "FR*GLY*P*LYON*24*_*_*_",
    "UsageTypeID": 5,
    "AddressInfo": {
        "ID": 166532,
        "Title": "Lyon Joliot Curie - Les Battières",
        "AddressLine1": "96 Rue Joliot Curie, Lyon",
        "CountryID": 80,
        "Latitude": 45.754439,
        "Longitude": 4.782994,
        "AccessComments": "24h/24",
        "DistanceUnit": 0
    },
    "Connections": [
        {
            "ID": 244793,
            "ConnectionTypeID": 28,
            "StatusTypeID": 50,
            "LevelID": 2,
            "PowerKW": 7,
            "CurrentTypeID": 10
        },
        {
            "ID": 244794,
            "ConnectionTypeID": 25,
            "StatusTypeID": 50,
            "LevelID": 2,
            "PowerKW": 7,
            "CurrentTypeID": 10
        },
        {
            "ID": 244795,
            "ConnectionTypeID": 28,
            "StatusTypeID": 50,
            "LevelID": 2,
            "PowerKW": 7,
            "CurrentTypeID": 10
        },
        {
            "ID": 244796,
            "ConnectionTypeID": 25,
            "StatusTypeID": 50,
            "LevelID": 2,
            "PowerKW": 7,
            "CurrentTypeID": 10
        },
        {
            "ID": 244797,
            "ConnectionTypeID": 28,
            "StatusTypeID": 50,
            "LevelID": 2,
            "PowerKW": 7,
            "CurrentTypeID": 10
        },
        {
            "ID": 244798,
            "ConnectionTypeID": 25,
            "StatusTypeID": 50,
            "LevelID": 2,
            "PowerKW": 7,
            "CurrentTypeID": 10
        },
        {
            "ID": 244799,
            "ConnectionTypeID": 28,
            "StatusTypeID": 50,
            "LevelID": 2,
            "PowerKW": 7,
            "CurrentTypeID": 10
        },
        {
            "ID": 244800,
            "ConnectionTypeID": 25,
            "StatusTypeID": 50,
            "LevelID": 2,
            "PowerKW": 7,
            "CurrentTypeID": 10
        }
    ],
    "GeneralComments": "badge, appli et QR code",
    "StatusTypeID": 50,
    "DateLastStatusUpdate": "2020-08-27T05:12:00Z",
    "DataQualityLevel": 2,
    "DateCreated": "2020-08-27T05:12:00Z",
    "SubmissionStatusTypeID": 100
}