{
    "IsRecentlyVerified": false,
    "ID": 148699,
    "UUID": "0C9E6AD7-4307-4EB1-AB7C-3B1F80F83503",
    "DataProviderID": 1,
    "OperatorID": 198,
    "UsageTypeID": 4,
    "UsageCost": "0,33€/kWh",
    "AddressInfo": {
        "ID": 149051,
        "Title": "Suur-Helsingin Golf",
        "AddressLine1": "Klockarsintie",
        "Town": "Espoo",
        "StateOrProvince": "Southern Finland",
        "CountryID": 79,
        "Latitude": 60.32033158646112,
        "Longitude": 24.671045530693505,
        "DistanceUnit": 0
    },
    "Connections": [
        {
            "ID": 206472,
            "ConnectionTypeID": 25,
            "StatusTypeID": 50,
            "LevelID": 2,
            "Amps": 32,
            "PowerKW": 22,
            "CurrentTypeID": 20,
            "Quantity": 2
        }
    ],
    "NumberOfPoints": 2,
    "StatusTypeID": 50,
    "DateLastStatusUpdate": "2020-02-09T17:52:00Z",
    "DataQualityLevel": 1,
    "DateCreated": "2020-02-09T13:59:00Z",
    "SubmissionStatusTypeID": 200
}