{
    "IsRecentlyVerified": false,
    "ID": 116392,
    "UUID": "CEB74213-DD82-4535-B2ED-51B987473C19",
    "DataProviderID": 1,
    "DataProvidersReference": "5288",
    "OperatorID": 1,
    "UsageTypeID": 6,
    "AddressInfo": {
        "ID": 116738,
        "Title": "Kundparkering på ICA Maxi",
        "AddressLine1": "Per Hallströms väg 15",
        "Town": "NACKA",
        "StateOrProvince": "STOCKHOLM",
        "Postcode": "13139",
        "CountryID": 216,
        "Latitude": 59.311393,
        "Longitude": 18.173748,
        "AccessComments": "Kundparkering på ICA Maxi I Nacka",
        "DistanceUnit": 0
    },
    "Connections": [
        {
            "ID": 164135,
            "ConnectionTypeID": 25,
            "Reference": "1",
            "LevelID": 2,
            "Amps": 32,
            "Voltage": 400,
            "PowerKW": 22,
            "CurrentTypeID": 20,
            "Comments": "Mode 3"
        },
        {
            "ID": 164136,
            "ConnectionTypeID": 25,
            "Reference": "2",
            "LevelID": 2,
            "Amps": 32,
            "Voltage": 400,
            "PowerKW": 22,
            "CurrentTypeID": 20,
            "Comments": "Mode 3"
        },
        {
            "ID": 164137,
            "ConnectionTypeID": 25,
            "Reference": "3",
            "LevelID": 2,
            "Amps": 32,
            "Voltage": 400,
            "PowerKW": 22,
            "CurrentTypeID": 20,
            "Comments": "Mode 3"
        },
        {
            "ID": 164138,
            "ConnectionTypeID": 25,
            "Reference": "4",
            "LevelID": 2,
            "Amps": 32,
            "Voltage": 400,
            "PowerKW": 22,
            "CurrentTypeID": 20,
            "Comments": "Mode 3"
        },
        {
            "ID": 164139,
            "ConnectionTypeID": 25,
            "Reference": "5",
            "LevelID": 2,
            "Amps": 32,
            "Voltage": 400,
            "PowerKW": 22,
            "CurrentTypeID": 20,
            "Comments": "Mode 3"
        },
        {
            "ID": 164140,
            "ConnectionTypeID": 25,
            "Reference": "6",
            "LevelID": 2,
            "Amps": 32,
            "Voltage": 400,
            "PowerKW": 22,
            "CurrentTypeID": 20,
            "Comments": "Mode 3"
        }
    ],
    "NumberOfPoints": 6,
    "DateLastStatusUpdate": "2021-02-15T10:28:00Z",
    "DataQualityLevel": 2,
    "DateCreated": "2019-02-11T09:16:00Z",
    "SubmissionStatusTypeID": 100
}