{
    "IsRecentlyVerified": false,
    "ID": 37852,
    "UUID": "F9F6CC32-EC8F-45CA-903A-C153F1216661",
    "DataProviderID": 26,
    "DataProvidersReference": "45726",
    "OperatorID": 73,
    "OperatorsReference": "EV-Box EVB-P1347075",
    "UsageCost": "0.00 jaarabonnement",
    "AddressInfo": {
        "ID": 38198,
        "Title": "Randstad 22 20",
        "AddressLine1": "Randstad 22 20",
        "Town": "Almere",
        "Postcode": "1316 BZ",
        "CountryID": 159,
        "Latitude": 52.37887,
        "Longitude": 5.22654,
        "RelatedURL": "http://www.ev-box.nl",
        "DistanceUnit": 0
    },
    "Connections": [
        {
            "ID": 41363,
            "ConnectionTypeID": 25,
            "LevelID": 2,
            "PowerKW": 5,
            "CurrentTypeID": 10
        }
    ],
    "NumberOfPoints": 1,
    "StatusTypeID": 50,
    "DateLastStatusUpdate": "2016-04-27T09:46:00Z",
    "DataQualityLevel": 3,
    "DateCreated": "2015-01-09T06:07:00Z",
    "SubmissionStatusTypeID": 100
}