{
    "IsRecentlyVerified": false,
    "ID": 36859,
    "UUID": "C564550C-44BA-4043-B4E8-CA58BC2CF8A7",
    "DataProviderID": 26,
    "DataProvidersReference": "56913",
    "OperatorsReference": "ENE-P1437",
    "UsageCost": "0.00 afhankelijk van pas",
    "AddressInfo": {
        "ID": 37205,
        "Title": "Marianne Philipslaan 20",
        "AddressLine1": "Marianne Philipslaan 20",
        "Town": "Bussum",
        "Postcode": "1403 GL",
        "CountryID": 159,
        "Latitude": 52.267,
        "Longitude": 5.188,
        "ContactTelephone1": "0900-0201",
        "ContactEmail": "info@eneco.nl",
        "RelatedURL": "http://www.eneco.nl",
        "DistanceUnit": 0
    },
    "Connections": [
        {
            "ID": 40370,
            "ConnectionTypeID": 25,
            "LevelID": 2,
            "PowerKW": 5,
            "CurrentTypeID": 10
        }
    ],
    "NumberOfPoints": 1,
    "StatusTypeID": 50,
    "DateLastStatusUpdate": "2016-06-04T02:52:00Z",
    "DataQualityLevel": 3,
    "DateCreated": "2015-01-09T06:07:00Z",
    "SubmissionStatusTypeID": 100
}