{
    "IsRecentlyVerified": false,
    "ID": 186855,
    "UUID": "5725E876-C8F0-42D2-9E2C-795754D9BC0A",
    "DataProviderID": 29,
    "DataProvidersReference": "2027",
    "OperatorID": 105,
    "AddressInfo": {
        "ID": 187214,
        "Title": "Heideweg 25",
        "AddressLine1": "Heideweg 25",
        "Town": "Belm",
        "Postcode": "49191",
        "CountryID": 87,
        "Latitude": 52.2999,
        "Longitude": 8.136418,
        "DistanceUnit": 0
    },
    "Connections": [
        {
            "ID": 300381,
            "ConnectionTypeID": 25,
            "StatusTypeID": 50,
            "LevelID": 2,
            "PowerKW": 22,
            "CurrentTypeID": 20
        },
        {
            "ID": 300382,
            "ConnectionTypeID": 25,
            "StatusTypeID": 50,
            "LevelID": 2,
            "PowerKW": 22,
            "CurrentTypeID": 20
        }
    ],
    "StatusTypeID": 50,
    "DateLastStatusUpdate": "2021-07-12T02:49:00Z",
    "MetadataValues": [
        {
            "ID": 19095,
            "MetadataFieldID": 4,
            "ItemValue": "Data from the German chargepoint registry provided by Bundesnetzagentur.de under the CC-BY 4.0 license"
        }
    ],
    "DataQualityLevel": 3,
    "DateCreated": "2021-07-12T02:49:00Z",
    "SubmissionStatusTypeID": 100
}