{
    "MediaItems": [
        {
            "ID": 12689,
            "ChargePointID": 88429,
            "ItemURL": "https://s3-ap-southeast-2.amazonaws.com/openchargemap/images/NZ/OCM88429/OCM-88429.orig.2017052912133414.jpg",
            "ItemThumbnailURL": "https://s3-ap-southeast-2.amazonaws.com/openchargemap/images/NZ/OCM88429/OCM-88429.thmb.2017052912133414.jpg",
            "Comment": "",
            "IsEnabled": true,
            "IsVideo": false,
            "IsFeaturedItem": false,
            "IsExternalResource": false,
            "User": {
                "ID": 15365,
                "Username": "sliday"
            },
            "DateCreated": "2017-05-29T12:14:00Z"
        }
    ],
    "IsRecentlyVerified": false,
    "ID": 88429,
    "UUID": "AE7421DB-4240-42B1-AD17-47CBDDBD563E",
    "DataProviderID": 1,
    "UsageCost": "Cost unknown",
    "AddressInfo": {
        "ID": 88775,
        "Title": "Out In The Styx",
        "AddressLine1": "2117 Arapuni Road",
        "Town": "Pukeatua ",
        "Postcode": "3880",
        "CountryID": 161,
        "Latitude": -38.06384380926752,
        "Longitude": 175.55965628594853,
        "ContactTelephone1": "(07) 872-4505",
        "DistanceUnit": 0
    },
    "Connections": [
        {
            "ID": 125425,
            "ConnectionTypeID": 29,
            "Voltage": 120
        }
    ],
    "NumberOfPoints": 4,
    "GeneralComments": "07:00-20:00\r\nWe have 4 blue commando caravan mains sockets available for customers to use. Reservations can be made by calling 07 8724 505 or emailing info@styx.co.nz",
    "StatusTypeID": 50,
    "DateLastStatusUpdate": "2017-05-29T12:14:00Z",
    "DataQualityLevel": 1,
    "DateCreated": "2017-05-29T12:13:00Z",
    "SubmissionStatusTypeID": 200
}