{
    "IsRecentlyVerified": false,
    "ID": 160173,
    "UUID": "9C2DFCE0-BB8A-4B74-A2D9-36E60C2D77E6",
    "DataProviderID": 2,
    "DataProvidersReference": "158053",
    "UsageTypeID": 2,
    "AddressInfo": {
        "ID": 160530,
        "Title": "Burlington Centre",
        "AddressLine1": "777 Guelph Line",
        "Town": "Burlington",
        "StateOrProvince": "ON",
        "Postcode": "L7R 3N2",
        "CountryID": 44,
        "Latitude": 43.3485131,
        "Longitude": -79.7935979,
        "ContactTelephone1": "",
        "AccessComments": "",
        "RelatedURL": "",
        "DistanceUnit": 0
    },
    "Connections": [
        {
            "ID": 230429,
            "ConnectionTypeID": 2,
            "LevelID": 3,
            "Amps": 100,
            "Voltage": 400,
            "PowerKW": 40,
            "CurrentTypeID": 30,
            "Quantity": 1
        },
        {
            "ID": 230430,
            "ConnectionTypeID": 32,
            "LevelID": 3,
            "Amps": 100,
            "Voltage": 400,
            "PowerKW": 40,
            "CurrentTypeID": 30,
            "Quantity": 1
        }
    ],
    "GeneralComments": "Planned for future date. Not Operational.",
    "DatePlanned": "2020-09-01T00:00:00Z",
    "StatusTypeID": 150,
    "DateLastStatusUpdate": "2020-06-26T03:07:00Z",
    "DataQualityLevel": 3,
    "DateCreated": "2020-06-26T03:07:00Z",
    "SubmissionStatusTypeID": 100
}