{
    "IsRecentlyVerified": false,
    "ID": 30116,
    "UUID": "CB6144C5-9963-4C9F-844A-F9537E620303",
    "DataProviderID": 1,
    "OperatorID": 21,
    "UsageTypeID": 4,
    "UsageCost": "Mobi.E compatible card",
    "AddressInfo": {
        "ID": 30462,
        "Title": "TVD-00006",
        "AddressLine1": "Avenida do Atlântico",
        "Town": "Torres Vedras",
        "Postcode": "2560-451",
        "CountryID": 180,
        "Latitude": 39.136197184,
        "Longitude": -9.380215627,
        "RelatedURL": "http://www.mobie.pt",
        "DistanceUnit": 0
    },
    "Connections": [
        {
            "ID": 33101,
            "ConnectionTypeID": 25,
            "StatusTypeID": 50,
            "LevelID": 2,
            "Amps": 32,
            "Voltage": 400,
            "PowerKW": 22,
            "CurrentTypeID": 20,
            "Quantity": 2
        }
    ],
    "NumberOfPoints": 2,
    "StatusTypeID": 50,
    "DateLastStatusUpdate": "2020-08-14T12:16:00Z",
    "DataQualityLevel": 3,
    "DateCreated": "2014-11-29T14:48:00Z",
    "SubmissionStatusTypeID": 100
}