{
    "IsRecentlyVerified": false,
    "ID": 183538,
    "UUID": "4641B4CF-A515-4EEA-9CE0-8C539496AF23",
    "DataProviderID": 29,
    "DataProvidersReference": "11272",
    "OperatorID": 3423,
    "AddressInfo": {
        "ID": 183897,
        "Title": "Angerberg 24",
        "AddressLine1": "Angerberg 24",
        "Town": "Mareinmünster",
        "Postcode": "37696",
        "CountryID": 87,
        "Latitude": 51.82017,
        "Longitude": 9.229,
        "DistanceUnit": 0
    },
    "Connections": [
        {
            "ID": 290646,
            "ConnectionTypeID": 25,
            "StatusTypeID": 50,
            "LevelID": 2,
            "PowerKW": 22,
            "CurrentTypeID": 20
        },
        {
            "ID": 290647,
            "ConnectionTypeID": 25,
            "StatusTypeID": 50,
            "LevelID": 2,
            "PowerKW": 22,
            "CurrentTypeID": 20
        }
    ],
    "StatusTypeID": 50,
    "DateLastStatusUpdate": "2021-07-09T03:25:00Z",
    "MetadataValues": [
        {
            "ID": 15831,
            "MetadataFieldID": 4,
            "ItemValue": "Data from the German chargepoint registry provided by Bundesnetzagentur.de under the CC-BY 4.0 license"
        }
    ],
    "DataQualityLevel": 3,
    "DateCreated": "2021-07-08T10:04:00Z",
    "SubmissionStatusTypeID": 100
}