{
    "IsRecentlyVerified": false,
    "ID": 46979,
    "UUID": "050202A0-9028-4EBD-98D5-BE2F2CE522E7",
    "DataProviderID": 26,
    "DataProvidersReference": "61618",
    "OperatorID": 73,
    "OperatorsReference": "EV-Box EVB-P1408109",
    "UsageCost": "0.00 jaarabonnement",
    "AddressInfo": {
        "ID": 47325,
        "Title": "Prinses Marijkeweg 1",
        "AddressLine1": "Prinses Marijkeweg 1",
        "Town": "Zederik",
        "Postcode": "4231 BP",
        "CountryID": 159,
        "Latitude": 51.92134,
        "Longitude": 4.99574,
        "RelatedURL": "http://www.ev-box.nl",
        "DistanceUnit": 0
    },
    "Connections": [
        {
            "ID": 57809,
            "ConnectionTypeID": 25,
            "LevelID": 2,
            "PowerKW": 5,
            "CurrentTypeID": 10
        }
    ],
    "NumberOfPoints": 1,
    "StatusTypeID": 50,
    "DateLastStatusUpdate": "2016-06-04T02:42:00Z",
    "DataQualityLevel": 3,
    "DateCreated": "2015-05-11T09:12:00Z",
    "SubmissionStatusTypeID": 100
}