{
    "IsRecentlyVerified": false,
    "ID": 143270,
    "UUID": "D69E47FB-012E-4DF1-B694-C318D1BB46F9",
    "DataProviderID": 2,
    "DataProvidersReference": "131661",
    "UsageTypeID": 1,
    "AddressInfo": {
        "ID": 143622,
        "Title": "Glen Avenue Suites",
        "AddressLine1": "6 Glen Ave",
        "Town": "Cooperstown",
        "StateOrProvince": "NY",
        "Postcode": "13326",
        "CountryID": 2,
        "Latitude": 42.69854,
        "Longitude": -74.93117,
        "ContactTelephone1": "607-547-5054",
        "AccessComments": "8am-6pm daily; for guest use only",
        "RelatedURL": "",
        "DistanceUnit": 0
    },
    "Connections": [
        {
            "ID": 199565,
            "ConnectionTypeID": 1,
            "LevelID": 2,
            "Amps": 16,
            "Voltage": 230,
            "PowerKW": 3.7,
            "CurrentTypeID": 10,
            "Quantity": 1
        }
    ],
    "StatusTypeID": 50,
    "DateLastStatusUpdate": "2020-06-26T03:06:00Z",
    "DataQualityLevel": 3,
    "DateCreated": "2019-12-24T09:20:00Z",
    "SubmissionStatusTypeID": 100
}