{
    "IsRecentlyVerified": false,
    "ID": 35573,
    "UUID": "AB3376B2-8AA0-4827-B6A9-E68BFBE1DE8C",
    "DataProviderID": 26,
    "DataProvidersReference": "57859",
    "OperatorID": 180,
    "OperatorsReference": "Alfen GDH2622",
    "UsageCost": "0.00 jaarabonnement",
    "AddressInfo": {
        "ID": 35919,
        "Title": "Rossinilaan 148",
        "AddressLine1": "Rossinilaan 148",
        "Town": "Den Haag",
        "Postcode": "2551 MK",
        "CountryID": 159,
        "Latitude": 52.061511,
        "Longitude": 4.243061,
        "ContactTelephone1": "036 - 549 34 00",
        "RelatedURL": "http://www.icu-charging-stations.com/",
        "DistanceUnit": 0
    },
    "Connections": [
        {
            "ID": 39084,
            "ConnectionTypeID": 25,
            "LevelID": 2,
            "PowerKW": 11,
            "CurrentTypeID": 10
        },
        {
            "ID": 47947,
            "ConnectionTypeID": 25,
            "LevelID": 2,
            "PowerKW": 11,
            "CurrentTypeID": 10
        }
    ],
    "NumberOfPoints": 1,
    "StatusTypeID": 50,
    "DateLastStatusUpdate": "2016-06-04T02:45:00Z",
    "DataQualityLevel": 3,
    "DateCreated": "2015-01-09T06:05:00Z",
    "SubmissionStatusTypeID": 100
}