{
    "IsRecentlyVerified": false,
    "ID": 116277,
    "UUID": "6E1EB39F-A18F-4ADB-A505-BBE8233A92D2",
    "DataProviderID": 1,
    "DataProvidersReference": "4926",
    "AddressInfo": {
        "ID": 116623,
        "Title": "Österäng",
        "AddressLine1": "Sjövägen 33",
        "Town": "KRISTIANSTAD",
        "StateOrProvince": "SKÅNE",
        "Postcode": "29145",
        "CountryID": 216,
        "Latitude": 56.04334,
        "Longitude": 14.17874,
        "AccessComments": "Parkeringsplatsen bredvid Netto.",
        "DistanceUnit": 0
    },
    "Connections": [
        {
            "ID": 163516,
            "ConnectionTypeID": 0,
            "Reference": "1",
            "LevelID": 2,
            "Amps": 32,
            "Voltage": 400,
            "PowerKW": 22,
            "Comments": "Mode 3"
        },
        {
            "ID": 163517,
            "ConnectionTypeID": 0,
            "Reference": "2",
            "LevelID": 2,
            "Amps": 32,
            "Voltage": 400,
            "PowerKW": 22,
            "Comments": "Mode 3"
        },
        {
            "ID": 163518,
            "ConnectionTypeID": 0,
            "Reference": "3",
            "LevelID": 2,
            "Amps": 32,
            "Voltage": 400,
            "PowerKW": 22,
            "Comments": "Mode 3"
        },
        {
            "ID": 163519,
            "ConnectionTypeID": 0,
            "Reference": "4",
            "LevelID": 2,
            "Amps": 32,
            "Voltage": 400,
            "PowerKW": 22,
            "Comments": "Mode 3"
        }
    ],
    "NumberOfPoints": 4,
    "DateLastStatusUpdate": "2020-05-26T08:21:00Z",
    "DataQualityLevel": 2,
    "DateCreated": "2019-02-11T09:16:00Z",
    "SubmissionStatusTypeID": 100
}