{
    "IsRecentlyVerified": false,
    "ID": 127619,
    "UUID": "A0600D36-E51C-4F35-84B5-EC26D952A876",
    "DataProviderID": 1,
    "OperatorID": 3,
    "OperatorsReference": "PG-83057",
    "UsageTypeID": 4,
    "UsageCost": "Free",
    "AddressInfo": {
        "ID": 127965,
        "Title": "Coulsdon South Train Station",
        "AddressLine1": "Brighton Road",
        "Town": "Coulsdon",
        "Postcode": "CR5 3EA",
        "CountryID": 1,
        "Latitude": 51.316091,
        "Longitude": -0.137881,
        "AccessComments": "In pay-and-display car park. Parking fees apply, parking tickets can be obtained at list price from the railway ticket machine, or with a surcharge pay by phone.",
        "RelatedURL": "http://www.nationalrail.co.uk/stations/CDS/details.html",
        "DistanceUnit": 0
    },
    "Connections": [
        {
            "ID": 178631,
            "ConnectionTypeID": 25,
            "StatusTypeID": 50,
            "LevelID": 2,
            "Amps": 32,
            "Voltage": 230,
            "PowerKW": 7,
            "CurrentTypeID": 10,
            "Quantity": 2
        }
    ],
    "NumberOfPoints": 2,
    "StatusTypeID": 50,
    "DateLastStatusUpdate": "2019-06-06T11:11:00Z",
    "DataQualityLevel": 1,
    "DateCreated": "2019-06-06T05:34:00Z",
    "SubmissionStatusTypeID": 200
}