{
    "IsRecentlyVerified": false,
    "ID": 109053,
    "UUID": "9D197FB8-60DC-48AB-A7CE-601616F710BF",
    "DataProviderID": 1,
    "OperatorID": 23,
    "OperatorsReference": "44595",
    "UsageTypeID": 4,
    "AddressInfo": {
        "ID": 109399,
        "Title": "Gstaad Airport",
        "AddressLine1": "Oeystr. 29",
        "Town": "Saanen",
        "Postcode": "3792",
        "CountryID": 217,
        "Latitude": 46.48701,
        "Longitude": 7.245621,
        "ContactTelephone1": "+41 3374 83322",
        "DistanceUnit": 0
    },
    "Connections": [
        {
            "ID": 154171,
            "ConnectionTypeID": 30,
            "StatusTypeID": 50,
            "LevelID": 2,
            "Amps": 32,
            "Voltage": 400,
            "PowerKW": 22,
            "CurrentTypeID": 20,
            "Quantity": 1
        }
    ],
    "NumberOfPoints": 1,
    "GeneralComments": "1 Tesla Connector, up to 22kW.Available for customers. Self park.",
    "StatusTypeID": 50,
    "DateLastStatusUpdate": "2018-10-11T13:28:00Z",
    "DataQualityLevel": 1,
    "DateCreated": "2018-10-11T13:28:00Z",
    "SubmissionStatusTypeID": 200
}