{
    "IsRecentlyVerified": false,
    "ID": 71522,
    "UUID": "94072AEA-44B4-45DE-915F-E9A0C32823ED",
    "DataProviderID": 2,
    "DataProvidersReference": "77132",
    "OperatorID": 5,
    "UsageTypeID": 1,
    "AddressInfo": {
        "ID": 71868,
        "Title": "ALBANESE ORG",
        "AddressLine1": "95 North End Ave",
        "Town": "New York",
        "StateOrProvince": "NY",
        "Postcode": "10282",
        "CountryID": 2,
        "Latitude": 40.7151023,
        "Longitude": -74.0163292,
        "ContactTelephone1": "888-758-4389",
        "AccessComments": "24 hours daily",
        "RelatedURL": "http://www.chargepoint.com/",
        "DistanceUnit": 0
    },
    "Connections": [
        {
            "ID": 102346,
            "ConnectionTypeID": 1,
            "LevelID": 2,
            "Amps": 16,
            "Voltage": 230,
            "PowerKW": 3,
            "CurrentTypeID": 10,
            "Quantity": 2
        }
    ],
    "DateLastStatusUpdate": "2019-12-24T09:17:00Z",
    "DataQualityLevel": 3,
    "DateCreated": "2016-09-02T10:15:00Z",
    "SubmissionStatusTypeID": 100
}