{
    "IsRecentlyVerified": false,
    "ID": 152210,
    "UUID": "2B5C3C32-D500-4974-87C9-96F02FCA799C",
    "DataProviderID": 28,
    "DataProvidersReference": "FR*S85*P85051*002",
    "UsageTypeID": 5,
    "AddressInfo": {
        "ID": 152563,
        "Title": "CHANTONNAY - Place De La Gare",
        "AddressLine1": "Place De La Gare 85110 CHANTONNAY",
        "CountryID": 80,
        "Latitude": 46.689838,
        "Longitude": -1.05423,
        "AccessComments": "24h/24 7j/7",
        "DistanceUnit": 0
    },
    "Connections": [
        {
            "ID": 212989,
            "ConnectionTypeID": 28,
            "StatusTypeID": 50,
            "LevelID": 2,
            "PowerKW": 18,
            "CurrentTypeID": 10
        },
        {
            "ID": 212990,
            "ConnectionTypeID": 25,
            "StatusTypeID": 50,
            "LevelID": 2,
            "PowerKW": 18,
            "CurrentTypeID": 20
        },
        {
            "ID": 245853,
            "ConnectionTypeID": 28,
            "StatusTypeID": 50,
            "LevelID": 2,
            "PowerKW": 18,
            "CurrentTypeID": 10
        },
        {
            "ID": 245854,
            "ConnectionTypeID": 25,
            "StatusTypeID": 50,
            "LevelID": 2,
            "PowerKW": 18,
            "CurrentTypeID": 20
        }
    ],
    "GeneralComments": "Recharge par badge et avec une application smartphone",
    "StatusTypeID": 50,
    "DateLastStatusUpdate": "2020-08-27T05:12:00Z",
    "DataQualityLevel": 2,
    "DateCreated": "2020-03-15T10:53:00Z",
    "SubmissionStatusTypeID": 100
}