{
    "IsRecentlyVerified": false,
    "ID": 31730,
    "UUID": "6694A4DE-7F1C-4BA8-8F37-572139D3072D",
    "DataProviderID": 1,
    "OperatorID": 157,
    "OperatorsReference": "NewMotion 02009312",
    "UsageCost": "0.00 jaarabonnement",
    "AddressInfo": {
        "ID": 32076,
        "Title": "Dottinger Straße 47",
        "AddressLine1": "Dottinger Straße 47",
        "Town": "Münsingen",
        "Postcode": "72525",
        "CountryID": 87,
        "Latitude": 48.4143218994141,
        "Longitude": 9.48490333557129,
        "ContactTelephone1": "088 0109500",
        "RelatedURL": "http://thenewmotion.nl/",
        "DistanceUnit": 0
    },
    "Connections": [
        {
            "ID": 35241,
            "ConnectionTypeID": 25,
            "LevelID": 2,
            "PowerKW": 3.7,
            "CurrentTypeID": 10
        }
    ],
    "NumberOfPoints": 1,
    "StatusTypeID": 50,
    "DateLastStatusUpdate": "2021-04-25T05:14:00Z",
    "DataQualityLevel": 3,
    "DateCreated": "2015-01-09T06:03:00Z",
    "SubmissionStatusTypeID": 200
}