{
    "IsRecentlyVerified": false,
    "ID": 140480,
    "UUID": "C9DA7473-2084-410D-8147-1FF307BBD77B",
    "DataProviderID": 2,
    "DataProvidersReference": "150303",
    "OperatorID": 5,
    "UsageTypeID": 1,
    "AddressInfo": {
        "ID": 140832,
        "Title": "STATION 1",
        "AddressLine1": "221 N Rampart Blvd",
        "Town": "Las Vegas",
        "StateOrProvince": "NV",
        "Postcode": "89145",
        "CountryID": 2,
        "Latitude": 36.175381,
        "Longitude": -115.287425,
        "ContactTelephone1": "888-758-4389",
        "AccessComments": "24 hours daily",
        "RelatedURL": "http://www.chargepoint.com/",
        "DistanceUnit": 0
    },
    "Connections": [
        {
            "ID": 196117,
            "ConnectionTypeID": 1,
            "LevelID": 2,
            "Amps": 16,
            "Voltage": 230,
            "PowerKW": 3.7,
            "CurrentTypeID": 10,
            "Quantity": 4
        }
    ],
    "StatusTypeID": 50,
    "DateLastStatusUpdate": "2020-06-26T02:58:00Z",
    "DataQualityLevel": 3,
    "DateCreated": "2019-12-24T09:13:00Z",
    "SubmissionStatusTypeID": 100
}