{
    "IsRecentlyVerified": false,
    "ID": 153679,
    "UUID": "FCCCBC22-E908-4AE6-9F2E-2F2174A51F5C",
    "DataProviderID": 28,
    "DataProvidersReference": "FR*S53*P53127*001",
    "UsageTypeID": 5,
    "AddressInfo": {
        "ID": 154032,
        "Title": "LASSAY LES CHATEAUX - Allée Du Haut Perrin",
        "AddressLine1": "Allée Du Haut Perrin  53110 LASSAY LES CHATEAUX",
        "CountryID": 80,
        "Latitude": 48.437096,
        "Longitude": -0.497452,
        "AccessComments": "24h/24 7j/7",
        "DistanceUnit": 0
    },
    "Connections": [
        {
            "ID": 215736,
            "ConnectionTypeID": 26,
            "StatusTypeID": 50,
            "LevelID": 2,
            "PowerKW": 18
        },
        {
            "ID": 215737,
            "ConnectionTypeID": 28,
            "StatusTypeID": 50,
            "LevelID": 2,
            "PowerKW": 18,
            "CurrentTypeID": 10
        },
        {
            "ID": 249390,
            "ConnectionTypeID": 28,
            "StatusTypeID": 50,
            "LevelID": 2,
            "PowerKW": 18,
            "CurrentTypeID": 10
        },
        {
            "ID": 249391,
            "ConnectionTypeID": 26,
            "StatusTypeID": 50,
            "LevelID": 2,
            "PowerKW": 18
        }
    ],
    "GeneralComments": "Recharge par badge et avec une application smartphone",
    "StatusTypeID": 50,
    "DateLastStatusUpdate": "2020-08-27T05:15:00Z",
    "DataQualityLevel": 2,
    "DateCreated": "2020-03-15T10:54:00Z",
    "SubmissionStatusTypeID": 100
}