{
    "IsRecentlyVerified": false,
    "ID": 135675,
    "UUID": "8131E63E-AFAC-4063-9441-2E58EDCC61E7",
    "DataProviderID": 18,
    "DataProvidersReference": "dd5fbbf85c3198ece6dcd86166c58439",
    "OperatorID": 2244,
    "UsageTypeID": 5,
    "AddressInfo": {
        "ID": 136021,
        "Title": "Heath Gardens",
        "AddressLine1": "Heath Gardens",
        "Town": "Twickenham",
        "Postcode": "TW1 4LY",
        "CountryID": 1,
        "Latitude": 51.444605,
        "Longitude": -0.337378,
        "AccessComments": "",
        "RelatedURL": "https://www.ubitricity.com",
        "DistanceUnit": 0
    },
    "Connections": [
        {
            "ID": 190086,
            "ConnectionTypeID": 25,
            "Reference": "suby1100001446",
            "StatusTypeID": 50,
            "LevelID": 2,
            "Amps": 16,
            "Voltage": 230,
            "PowerKW": 3.7,
            "CurrentTypeID": 10
        }
    ],
    "StatusTypeID": 0,
    "DateLastStatusUpdate": "2021-04-25T05:46:00Z",
    "MetadataValues": [
        {
            "ID": 5527,
            "MetadataFieldID": 4,
            "ItemValue": "Contains public sector information licensed under the Open Government Licence v2.0. http://www.nationalarchives.gov.uk/doc/open-government-licence/version/2/"
        }
    ],
    "DataQualityLevel": 3,
    "DateCreated": "2019-12-24T05:22:00Z",
    "SubmissionStatusTypeID": 100
}