{
    "IsRecentlyVerified": false,
    "ID": 97642,
    "UUID": "A3D63C6E-5FA6-469A-AC59-5FDA9FE9694B",
    "DataProviderID": 1,
    "OperatorID": 23,
    "OperatorsReference": "39408",
    "UsageTypeID": 4,
    "AddressInfo": {
        "ID": 97988,
        "Title": "Falkensteiner Therme & Golf Hotel Bad Waltersdorf",
        "AddressLine1": "Buchgreithweg 351",
        "Town": "Bad Waltersdorf",
        "Postcode": "8271",
        "CountryID": 19,
        "Latitude": 47.159686,
        "Longitude": 16.006935,
        "ContactTelephone1": "+43 3333 31065",
        "DistanceUnit": 0
    },
    "Connections": [
        {
            "ID": 138550,
            "ConnectionTypeID": 30,
            "StatusTypeID": 50,
            "LevelID": 2,
            "Amps": 32,
            "Voltage": 400,
            "PowerKW": 22,
            "CurrentTypeID": 20,
            "Quantity": 2
        }
    ],
    "NumberOfPoints": 2,
    "GeneralComments": "2 Tesla Connectors, up to 22kW.Available for customers. Please see front desk.",
    "StatusTypeID": 50,
    "DateLastStatusUpdate": "2018-10-03T15:29:00Z",
    "DataQualityLevel": 1,
    "DateCreated": "2018-01-21T15:58:00Z",
    "SubmissionStatusTypeID": 200
}