{
    "IsRecentlyVerified": false,
    "ID": 123945,
    "UUID": "4383D3EF-C561-45E1-ABC6-69929AE11A6D",
    "DataProviderID": 2,
    "DataProvidersReference": "85851",
    "OperatorID": 5,
    "UsageTypeID": 1,
    "AddressInfo": {
        "ID": 124291,
        "Title": "ELAN MENLO PARK",
        "AddressLine1": "3645 Haven Ave",
        "Town": "Menlo Park",
        "StateOrProvince": "CA",
        "Postcode": "94025",
        "CountryID": 2,
        "Latitude": 37.485718,
        "Longitude": -122.182879,
        "ContactTelephone1": "888-758-4389",
        "AccessComments": "24 hours daily",
        "RelatedURL": "http://www.chargepoint.com/",
        "DistanceUnit": 0
    },
    "Connections": [
        {
            "ID": 173981,
            "ConnectionTypeID": 1,
            "LevelID": 2,
            "Amps": 16,
            "Voltage": 230,
            "PowerKW": 3,
            "CurrentTypeID": 10,
            "Quantity": 3
        }
    ],
    "DateLastStatusUpdate": "2019-12-24T09:13:00Z",
    "DataQualityLevel": 3,
    "DateCreated": "2019-04-06T05:03:00Z",
    "SubmissionStatusTypeID": 100
}