{
    "IsRecentlyVerified": false,
    "ID": 121193,
    "UUID": "7019FDAE-8157-440C-9B96-E16B6BEAD43B",
    "DataProviderID": 2,
    "DataProvidersReference": "120832",
    "OperatorID": 9,
    "UsageTypeID": 1,
    "AddressInfo": {
        "ID": 121539,
        "Title": "Ballston Exchange - 4121 Wilson Blvd",
        "AddressLine1": "4121 Wilson Blvd",
        "Town": "Arlington",
        "StateOrProvince": "VA",
        "Postcode": "22203",
        "CountryID": 2,
        "Latitude": 38.880134,
        "Longitude": -77.10995,
        "ContactTelephone1": "888-998-2546",
        "AccessComments": "MON: 24 hours | TUE: 24 hours | WED: 24 hours | THU: 24 hours | FRI: 24 hours | SAT: 24 hours | SUN: 24 hours",
        "RelatedURL": "http://www.blinkcharging.com/",
        "DistanceUnit": 0
    },
    "Connections": [
        {
            "ID": 170630,
            "ConnectionTypeID": 1,
            "LevelID": 2,
            "Amps": 16,
            "Voltage": 230,
            "PowerKW": 3,
            "CurrentTypeID": 10,
            "Quantity": 2
        }
    ],
    "DateLastStatusUpdate": "2019-12-24T09:15:00Z",
    "DataQualityLevel": 3,
    "DateCreated": "2019-04-01T04:59:00Z",
    "SubmissionStatusTypeID": 100
}