{
    "IsRecentlyVerified": false,
    "ID": 89660,
    "UUID": "302DD11E-4742-42B4-898B-39504BF2D821",
    "DataProviderID": 2,
    "DataProvidersReference": "81527",
    "UsageTypeID": 1,
    "AddressInfo": {
        "ID": 90006,
        "Title": "Kent State University - Student Center",
        "AddressLine1": "1075 Risman Dr",
        "Town": "Kent",
        "StateOrProvince": "OH",
        "Postcode": "44242",
        "CountryID": 2,
        "Latitude": 41.14765,
        "Longitude": -81.343172,
        "ContactTelephone1": "330-672-4432",
        "AccessComments": "24 hours daily; maximum session time of 4 hours",
        "RelatedURL": "",
        "DistanceUnit": 0
    },
    "Connections": [
        {
            "ID": 127086,
            "ConnectionTypeID": 1,
            "LevelID": 2,
            "Amps": 16,
            "Voltage": 230,
            "PowerKW": 3.7,
            "CurrentTypeID": 10,
            "Quantity": 1
        }
    ],
    "DateLastStatusUpdate": "2020-06-26T03:04:00Z",
    "DataQualityLevel": 3,
    "DateCreated": "2017-06-22T08:16:00Z",
    "SubmissionStatusTypeID": 100
}