{
    "IsRecentlyVerified": false,
    "ID": 113116,
    "UUID": "E899377C-C71F-4473-AC4C-67848762EC35",
    "DataProviderID": 2,
    "DataProvidersReference": "104747",
    "UsageTypeID": 7,
    "AddressInfo": {
        "ID": 113462,
        "Title": "Day Chevrolet",
        "AddressLine1": "1600 Golden Mile Hwy",
        "Town": "Monroeville",
        "StateOrProvince": "PA",
        "Postcode": "15146",
        "CountryID": 2,
        "Latitude": 40.432253,
        "Longitude": -79.715796,
        "ContactTelephone1": "724-327-0900",
        "AccessComments": "Dealership business hours\r\nPublic - Call ahead",
        "RelatedURL": "",
        "DistanceUnit": 0
    },
    "Connections": [
        {
            "ID": 159286,
            "ConnectionTypeID": 1,
            "LevelID": 2,
            "Amps": 16,
            "Voltage": 230,
            "PowerKW": 3.7,
            "CurrentTypeID": 10,
            "Quantity": 1
        }
    ],
    "DateLastStatusUpdate": "2020-06-26T03:03:00Z",
    "DataQualityLevel": 3,
    "DateCreated": "2018-11-28T02:04:00Z",
    "SubmissionStatusTypeID": 100
}