{
    "IsRecentlyVerified": false,
    "ID": 174031,
    "UUID": "B5018958-A144-4564-9D73-48F5F4523957",
    "DataProviderID": 1,
    "OperatorID": 3,
    "OperatorsReference": "t54_hu1_4520_020",
    "UsageTypeID": 4,
    "UsageCost": "£0.25/kWh",
    "AddressInfo": {
        "ID": 174390,
        "Title": "Lidl-Slough Farnham",
        "AddressLine1": "360-362 Farnham Road",
        "Town": "Slough",
        "Postcode": "SL2 1BT",
        "CountryID": 1,
        "Latitude": 51.527514,
        "Longitude": -0.615527,
        "DistanceUnit": 0
    },
    "Connections": [
        {
            "ID": 268518,
            "ConnectionTypeID": 25,
            "StatusTypeID": 50,
            "LevelID": 2,
            "Amps": 32,
            "Voltage": 400,
            "PowerKW": 22,
            "CurrentTypeID": 20,
            "Quantity": 1
        },
        {
            "ID": 268519,
            "ConnectionTypeID": 33,
            "StatusTypeID": 50,
            "LevelID": 3,
            "PowerKW": 50,
            "CurrentTypeID": 30,
            "Quantity": 1
        },
        {
            "ID": 268520,
            "ConnectionTypeID": 2,
            "StatusTypeID": 50,
            "LevelID": 3,
            "PowerKW": 50,
            "CurrentTypeID": 30,
            "Quantity": 1
        }
    ],
    "NumberOfPoints": 1,
    "GeneralComments": "This is a Pod Point rapid charge unit installed at the Lidl super store at Farnham Road, Slough",
    "StatusTypeID": 50,
    "DateLastStatusUpdate": "2021-03-16T06:19:00Z",
    "DataQualityLevel": 1,
    "DateCreated": "2021-03-11T06:28:00Z",
    "SubmissionStatusTypeID": 200
}