{
    "IsRecentlyVerified": false,
    "ID": 47513,
    "UUID": "EE9B60A4-A9D4-4200-AFD9-FCC3D2CA01DE",
    "DataProviderID": 1,
    "OperatorID": 5,
    "UsageCost": "Free",
    "AddressInfo": {
        "ID": 47859,
        "Title": "Madeira Park Shopping Centre",
        "AddressLine1": "12887 Madeira Park Road",
        "Town": "Madeira Park",
        "StateOrProvince": "British Columbia",
        "Postcode": "V0N 2H0",
        "CountryID": 44,
        "Latitude": 49.62027489,
        "Longitude": -124.0250871,
        "RelatedURL": "http://carstations.com/32053",
        "DistanceUnit": 0
    },
    "Connections": [
        {
            "ID": 58566,
            "ConnectionTypeID": 1,
            "Reference": "J1772",
            "StatusTypeID": 50,
            "LevelID": 2,
            "CurrentTypeID": 10,
            "Quantity": 1
        }
    ],
    "NumberOfPoints": 1,
    "StatusTypeID": 0,
    "DateLastStatusUpdate": "2015-05-29T17:33:00Z",
    "DataQualityLevel": 2,
    "DateCreated": "2015-05-29T06:23:00Z",
    "SubmissionStatusTypeID": 200
}