{
    "IsRecentlyVerified": false,
    "ID": 124821,
    "UUID": "5D9F8C9A-C493-469D-9DB7-04AC81348942",
    "DataProviderID": 2,
    "DataProvidersReference": "52643",
    "UsageTypeID": 5,
    "AddressInfo": {
        "ID": 125167,
        "Title": "City of Loveland - McKee Medical Center",
        "AddressLine1": "2000 N Boise Ave",
        "Town": "Loveland",
        "StateOrProvince": "CO",
        "Postcode": "80538",
        "CountryID": 2,
        "Latitude": 40.4134,
        "Longitude": -105.05171,
        "ContactTelephone1": "970-962-3000  970-669-4640",
        "AccessComments": "24 hours daily\r\nPublic - Credit card at all times",
        "RelatedURL": "",
        "DistanceUnit": 0
    },
    "Connections": [
        {
            "ID": 174972,
            "ConnectionTypeID": 1,
            "LevelID": 2,
            "Amps": 16,
            "Voltage": 230,
            "PowerKW": 3.7,
            "CurrentTypeID": 10,
            "Quantity": 2
        }
    ],
    "DateLastStatusUpdate": "2020-06-26T03:03:00Z",
    "DataQualityLevel": 3,
    "DateCreated": "2019-04-06T05:04:00Z",
    "SubmissionStatusTypeID": 100
}