{
    "IsRecentlyVerified": false,
    "ID": 70984,
    "UUID": "3726B8E4-1959-487E-B064-4E3BB683CE70",
    "DataProviderID": 1,
    "OperatorID": 1,
    "UsageTypeID": 4,
    "AddressInfo": {
        "ID": 71330,
        "Title": "ENSE CONIL",
        "AddressLine1": "Carretera N-340 km.17 El Colorado",
        "Town": "Conil de la Frontera",
        "StateOrProvince": "Cádiz",
        "Postcode": "11149",
        "CountryID": 210,
        "Latitude": 36.3420081777637,
        "Longitude": -6.095677091601607,
        "ContactTelephone1": "+34 900 215 470",
        "ContactEmail": "info@fenieenergia.es",
        "RelatedURL": "http://recarga.fenieenergia.es/punto-recarga/0064",
        "DistanceUnit": 0
    },
    "Connections": [
        {
            "ID": 101703,
            "ConnectionTypeID": 25,
            "StatusTypeID": 50,
            "LevelID": 2,
            "Amps": 32,
            "Voltage": 230,
            "PowerKW": 22,
            "CurrentTypeID": 20,
            "Quantity": 1
        },
        {
            "ID": 101704,
            "ConnectionTypeID": 28,
            "StatusTypeID": 50,
            "LevelID": 2,
            "Amps": 16,
            "Voltage": 230,
            "PowerKW": 3.6,
            "CurrentTypeID": 10,
            "Quantity": 1
        }
    ],
    "NumberOfPoints": 2,
    "GeneralComments": "App or RFID card Fenie Energia",
    "StatusTypeID": 50,
    "DateLastStatusUpdate": "2016-08-22T11:20:00Z",
    "DataQualityLevel": 1,
    "DateCreated": "2016-08-22T11:20:00Z",
    "SubmissionStatusTypeID": 200
}