{
    "IsRecentlyVerified": false,
    "ID": 137562,
    "UUID": "047745E2-1B8C-4558-839B-A3D79344D65D",
    "DataProviderID": 2,
    "DataProvidersReference": "145175",
    "UsageTypeID": 7,
    "AddressInfo": {
        "ID": 137908,
        "Title": "Navarro Early College High School",
        "AddressLine1": "1201 Payton Gin Rd",
        "Town": "Austin",
        "StateOrProvince": "TX",
        "Postcode": "78758",
        "CountryID": 2,
        "Latitude": 30.361342,
        "Longitude": -97.708505,
        "ContactTelephone1": "512-414-1700",
        "AccessComments": "After school hours only\r\nPublic - Call ahead",
        "RelatedURL": "",
        "DistanceUnit": 0
    },
    "Connections": [
        {
            "ID": 192497,
            "ConnectionTypeID": 1,
            "LevelID": 2,
            "Amps": 16,
            "Voltage": 230,
            "PowerKW": 3,
            "CurrentTypeID": 10,
            "Quantity": 1
        }
    ],
    "StatusTypeID": 50,
    "DateLastStatusUpdate": "2019-12-24T09:05:00Z",
    "DataQualityLevel": 3,
    "DateCreated": "2019-12-24T09:05:00Z",
    "SubmissionStatusTypeID": 100
}