{
    "IsRecentlyVerified": false,
    "ID": 138374,
    "UUID": "0B96B05C-15DB-48D4-A81D-8CF5D83214F4",
    "DataProviderID": 2,
    "DataProvidersReference": "95106",
    "OperatorID": 9,
    "UsageTypeID": 1,
    "AddressInfo": {
        "ID": 138723,
        "Title": "Starbucks/Jimmy John's Parking Lot",
        "AddressLine1": "102 22nd St",
        "Town": "Galveston",
        "StateOrProvince": "TX",
        "Postcode": "77550",
        "CountryID": 2,
        "Latitude": 29.308233,
        "Longitude": -94.79273,
        "ContactTelephone1": "888-998-2546",
        "AccessComments": "MON: 24 hours | TUE: 24 hours | WED: 24 hours | THU: 24 hours | FRI: 24 hours | SAT: 24 hours | SUN: 24 hours",
        "RelatedURL": "http://www.blinkcharging.com/",
        "DistanceUnit": 0
    },
    "Connections": [
        {
            "ID": 193483,
            "ConnectionTypeID": 1,
            "LevelID": 2,
            "Amps": 16,
            "Voltage": 230,
            "PowerKW": 3.7,
            "CurrentTypeID": 10,
            "Quantity": 2
        }
    ],
    "StatusTypeID": 50,
    "DateLastStatusUpdate": "2020-06-26T02:53:00Z",
    "DataQualityLevel": 3,
    "DateCreated": "2019-12-24T09:08:00Z",
    "SubmissionStatusTypeID": 100
}