{
    "IsRecentlyVerified": false,
    "ID": 113740,
    "UUID": "8F94E18D-DB18-442A-84B0-6D0C201BAC34",
    "DataProviderID": 1,
    "OperatorID": 23,
    "OperatorsReference": "47464",
    "UsageTypeID": 4,
    "AddressInfo": {
        "ID": 114086,
        "Title": "Brave & Maiden Estate",
        "AddressLine1": "649 N Refugio RD",
        "Town": "Santa Ynez",
        "StateOrProvince": "California",
        "Postcode": "93460",
        "CountryID": 2,
        "Latitude": 34.600602,
        "Longitude": -120.103033,
        "ContactTelephone1": "(805) 693-2989",
        "DistanceUnit": 0
    },
    "Connections": [
        {
            "ID": 160310,
            "ConnectionTypeID": 30,
            "StatusTypeID": 50,
            "LevelID": 2,
            "PowerKW": 10,
            "CurrentTypeID": 10,
            "Quantity": 1
        }
    ],
    "NumberOfPoints": 1,
    "GeneralComments": "1 Tesla Connector, up to 10kW.Available for customers. Please call ahead.",
    "StatusTypeID": 50,
    "DateLastStatusUpdate": "2019-01-02T21:27:00Z",
    "DataQualityLevel": 1,
    "DateCreated": "2019-01-02T21:27:00Z",
    "SubmissionStatusTypeID": 200
}