{
    "UserComments": [
        {
            "ID": 24953,
            "ChargePointID": 172705,
            "CommentTypeID": 10,
            "UserName": "Roberto ",
            "Comment": "working with nextcharge",
            "Rating": 4,
            "DateCreated": "2021-10-17T14:55:23.317Z",
            "User": {
                "ID": 27473,
                "Username": "Roberto "
            },
            "CheckinStatusTypeID": 10,
            "IsActionedByEditor": false
        }
    ],
    "MediaItems": [
        {
            "ID": 29530,
            "ChargePointID": 172705,
            "ItemURL": "https://s3-ap-southeast-2.amazonaws.com/openchargemap/images/IT/OCM172705/OCM-172705.orig.2021101714555695.jpg",
            "ItemThumbnailURL": "https://s3-ap-southeast-2.amazonaws.com/openchargemap/images/IT/OCM172705/OCM-172705.thmb.2021101714555695.jpg",
            "Comment": "",
            "IsEnabled": true,
            "IsVideo": false,
            "IsFeaturedItem": false,
            "IsExternalResource": false,
            "User": {
                "ID": 27473,
                "Username": "Roberto "
            },
            "DateCreated": "2021-10-17T14:56:00Z"
        }
    ],
    "IsRecentlyVerified": false,
    "ID": 172705,
    "UUID": "F10CE10B-8839-4031-85F6-9CF339C61A76",
    "DataProviderID": 1,
    "OperatorID": 3267,
    "UsageTypeID": 4,
    "AddressInfo": {
        "ID": 173064,
        "Title": "Caseificio Stura",
        "AddressLine1": "Strada Statale 21 della Maddalena",
        "Town": "Demonte",
        "StateOrProvince": "Piemont",
        "Postcode": "",
        "CountryID": 112,
        "Latitude": 44.31612010713138,
        "Longitude": 7.303372780635073,
        "DistanceUnit": 0
    },
    "Connections": [
        {
            "ID": 264106,
            "ConnectionTypeID": 25,
            "StatusTypeID": 50,
            "LevelID": 2,
            "Amps": 32,
            "Voltage": 400,
            "PowerKW": 22,
            "CurrentTypeID": 20,
            "Quantity": 2
        },
        {
            "ID": 264107,
            "ConnectionTypeID": 36,
            "StatusTypeID": 50,
            "LevelID": 2,
            "Amps": 16,
            "Voltage": 240,
            "PowerKW": 3,
            "CurrentTypeID": 10,
            "Quantity": 2
        }
    ],
    "NumberOfPoints": 2,
    "StatusTypeID": 50,
    "DateLastStatusUpdate": "2021-10-17T15:10:00Z",
    "DataQualityLevel": 1,
    "DateCreated": "2021-02-13T13:26:00Z",
    "SubmissionStatusTypeID": 200
}