{
    "IsRecentlyVerified": false,
    "ID": 186749,
    "UUID": "3243E59D-D757-4B8B-A27B-F7EBA29FD6BE",
    "DataProviderID": 29,
    "DataProvidersReference": "3155",
    "AddressInfo": {
        "ID": 187108,
        "Title": "Duisburger Str. 4",
        "AddressLine1": "Duisburger Str. 4",
        "Town": "Bielefeld",
        "Postcode": "33647",
        "CountryID": 87,
        "Latitude": 51.980241,
        "Longitude": 8.497626,
        "DistanceUnit": 0
    },
    "Connections": [
        {
            "ID": 300066,
            "ConnectionTypeID": 25,
            "StatusTypeID": 50,
            "LevelID": 2,
            "PowerKW": 22,
            "CurrentTypeID": 20
        },
        {
            "ID": 300067,
            "ConnectionTypeID": 25,
            "StatusTypeID": 50,
            "LevelID": 2,
            "PowerKW": 22,
            "CurrentTypeID": 20
        }
    ],
    "StatusTypeID": 50,
    "DateLastStatusUpdate": "2021-07-12T02:48:00Z",
    "MetadataValues": [
        {
            "ID": 18990,
            "MetadataFieldID": 4,
            "ItemValue": "Data from the German chargepoint registry provided by Bundesnetzagentur.de under the CC-BY 4.0 license"
        }
    ],
    "DataQualityLevel": 3,
    "DateCreated": "2021-07-12T02:48:00Z",
    "SubmissionStatusTypeID": 100
}