{
    "IsRecentlyVerified": false,
    "ID": 177326,
    "UUID": "B602203B-E800-4537-9808-FDE4A06AC183",
    "DataProviderID": 29,
    "DataProvidersReference": "2559",
    "OperatorID": 69,
    "AddressInfo": {
        "ID": 177685,
        "Title": "Sedlmayrstr. 10b",
        "AddressLine1": "Sedlmayrstr. 10b",
        "Town": "München",
        "Postcode": "80634",
        "CountryID": 87,
        "Latitude": 48.146547,
        "Longitude": 11.531299,
        "DistanceUnit": 0
    },
    "Connections": [
        {
            "ID": 276350,
            "ConnectionTypeID": 25,
            "StatusTypeID": 50,
            "LevelID": 2,
            "PowerKW": 22,
            "CurrentTypeID": 20
        },
        {
            "ID": 276351,
            "ConnectionTypeID": 25,
            "StatusTypeID": 50,
            "LevelID": 2,
            "PowerKW": 22,
            "CurrentTypeID": 20
        }
    ],
    "StatusTypeID": 0,
    "DateLastStatusUpdate": "2021-07-09T03:11:00Z",
    "MetadataValues": [
        {
            "ID": 9620,
            "MetadataFieldID": 4,
            "ItemValue": "Data from the German chargepoint registry provided by Bundesnetzagentur.de under the CC-BY 4.0 license"
        }
    ],
    "DataQualityLevel": 3,
    "DateCreated": "2021-07-08T09:48:00Z",
    "SubmissionStatusTypeID": 100
}