{
    "IsRecentlyVerified": false,
    "ID": 93852,
    "UUID": "6ED25200-1EA9-4694-9EB0-152C64798B39",
    "DataProviderID": 1,
    "OperatorID": 3,
    "OperatorsReference": "PG-92124",
    "UsageTypeID": 6,
    "UsageCost": "Free",
    "AddressInfo": {
        "ID": 94198,
        "Title": "Virgin Atlantic Airways LTD",
        "AddressLine1": "The Base",
        "Town": "West Sussex",
        "Postcode": "RH10 9LX",
        "CountryID": 1,
        "Latitude": 51.135573,
        "Longitude": -0.178064,
        "DistanceUnit": 0
    },
    "Connections": [
        {
            "ID": 132859,
            "ConnectionTypeID": 25,
            "StatusTypeID": 50,
            "LevelID": 2,
            "Amps": 32,
            "Voltage": 230,
            "PowerKW": 7,
            "CurrentTypeID": 10,
            "Quantity": 1
        }
    ],
    "NumberOfPoints": 2,
    "GeneralComments": "This is an open charge unit installed at the Virgin Atlantic Airways Ltd site in The Base, Fleming Way, Crawley",
    "StatusTypeID": 50,
    "DateLastStatusUpdate": "2017-12-20T11:46:00Z",
    "DataQualityLevel": 1,
    "DateCreated": "2017-10-11T05:19:00Z",
    "SubmissionStatusTypeID": 200
}