{
    "IsRecentlyVerified": false,
    "ID": 106380,
    "UUID": "32872888-4A4E-44EE-9D57-18E3F46042EA",
    "DataProviderID": 1,
    "OperatorID": 45,
    "UsageTypeID": 1,
    "AddressInfo": {
        "ID": 106726,
        "Title": "Drogeriemarkt dm",
        "AddressLine1": "Güterstraße 22",
        "Town": "Essen",
        "StateOrProvince": "Nordrhein-Westfalen",
        "Postcode": "45219",
        "CountryID": 87,
        "Latitude": 51.36089,
        "Longitude": 6.947222600000032,
        "AccessComments": "Zu den Öffnungszeiten für max. 2 Stunde nutzbar",
        "DistanceUnit": 0
    },
    "Connections": [
        {
            "ID": 149747,
            "ConnectionTypeID": 25,
            "StatusTypeID": 50,
            "LevelID": 2,
            "Amps": 32,
            "Voltage": 400,
            "PowerKW": 22,
            "CurrentTypeID": 20,
            "Quantity": 2
        }
    ],
    "NumberOfPoints": 2,
    "StatusTypeID": 50,
    "DateLastStatusUpdate": "2018-06-21T08:30:00Z",
    "DataQualityLevel": 1,
    "DateCreated": "2018-06-21T08:30:00Z",
    "SubmissionStatusTypeID": 200
}