{
    "IsRecentlyVerified": false,
    "ID": 116327,
    "UUID": "C1495969-6161-465F-BF0C-CF39ED5DF790",
    "DataProviderID": 1,
    "DataProvidersReference": "4995",
    "AddressInfo": {
        "ID": 116673,
        "Title": "Sanatorievägen 51",
        "AddressLine1": "Sanatorievägen 51",
        "Town": "ULRICEHAMN",
        "StateOrProvince": "VÄSTRA GÖTALAND",
        "Postcode": "52301",
        "CountryID": 216,
        "Latitude": 57.78464,
        "Longitude": 13.43073,
        "AccessComments": "På besöksparkering",
        "DistanceUnit": 0
    },
    "Connections": [
        {
            "ID": 163808,
            "ConnectionTypeID": 0,
            "Reference": "1",
            "LevelID": 2,
            "Amps": 32,
            "Voltage": 230,
            "PowerKW": 7.4,
            "Comments": "Mode 3"
        },
        {
            "ID": 163809,
            "ConnectionTypeID": 0,
            "Reference": "2",
            "LevelID": 2,
            "Amps": 32,
            "Voltage": 230,
            "PowerKW": 7.4,
            "Comments": "Mode 3"
        }
    ],
    "NumberOfPoints": 2,
    "DateLastStatusUpdate": "2020-05-26T08:21:00Z",
    "DataQualityLevel": 2,
    "DateCreated": "2019-02-11T09:16:00Z",
    "SubmissionStatusTypeID": 100
}