{
    "IsRecentlyVerified": false,
    "ID": 73100,
    "UUID": "F4A2BCB2-5335-4B48-9A34-2E260233E49D",
    "DataProviderID": 1,
    "OperatorID": 110,
    "UsageTypeID": 1,
    "UsageCost": "Free",
    "AddressInfo": {
        "ID": 73446,
        "Title": "EVite in Nürensdorf",
        "AddressLine1": "Alte Winterthurerstrasse 45",
        "Town": "Nürensdorf",
        "StateOrProvince": "Switzerland",
        "Postcode": "8309",
        "CountryID": 217,
        "Latitude": 47.4472382163775,
        "Longitude": 8.6486005783081,
        "ContactTelephone1": "+41 044 836 49 00",
        "DistanceUnit": 0
    },
    "Connections": [
        {
            "ID": 105088,
            "ConnectionTypeID": 33,
            "StatusTypeID": 50,
            "LevelID": 3,
            "PowerKW": 20,
            "CurrentTypeID": 30,
            "Quantity": 1
        },
        {
            "ID": 105089,
            "ConnectionTypeID": 2,
            "StatusTypeID": 50,
            "LevelID": 3,
            "PowerKW": 20,
            "CurrentTypeID": 30,
            "Quantity": 1
        },
        {
            "ID": 105090,
            "ConnectionTypeID": 25,
            "StatusTypeID": 50,
            "LevelID": 2,
            "Amps": 32,
            "Voltage": 400,
            "PowerKW": 22,
            "CurrentTypeID": 20,
            "Quantity": 1
        }
    ],
    "NumberOfPoints": 2,
    "GeneralComments": "2 free parking",
    "StatusTypeID": 50,
    "DateLastStatusUpdate": "2016-11-08T09:34:00Z",
    "DataQualityLevel": 1,
    "DateCreated": "2016-11-07T05:15:00Z",
    "SubmissionStatusTypeID": 200
}