{
    "IsRecentlyVerified": false,
    "ID": 169015,
    "UUID": "F8A3E34B-FB03-4B07-B730-A248BC80D300",
    "DataProviderID": 1,
    "OperatorID": 1,
    "UsageTypeID": 1,
    "AddressInfo": {
        "ID": 169374,
        "Title": "Maple Island Park",
        "AddressLine1": "58 3rd Ave SE",
        "Town": "Little Falls",
        "StateOrProvince": "MN",
        "Postcode": "56345",
        "CountryID": 2,
        "Latitude": 45.97393237307014,
        "Longitude": -94.36437143230205,
        "DistanceUnit": 0
    },
    "Connections": [
        {
            "ID": 257091,
            "ConnectionTypeID": 32,
            "StatusTypeID": 50,
            "LevelID": 2,
            "PowerKW": 50,
            "Quantity": 1
        },
        {
            "ID": 257092,
            "ConnectionTypeID": 2,
            "StatusTypeID": 50,
            "LevelID": 2,
            "PowerKW": 50,
            "Quantity": 1
        },
        {
            "ID": 257093,
            "ConnectionTypeID": 1,
            "StatusTypeID": 50,
            "Quantity": 2
        }
    ],
    "NumberOfPoints": 4,
    "StatusTypeID": 50,
    "DateLastStatusUpdate": "2020-10-12T07:51:00Z",
    "DataQualityLevel": 1,
    "DateCreated": "2020-10-09T15:44:00Z",
    "SubmissionStatusTypeID": 200
}