{
    "IsRecentlyVerified": false,
    "ID": 54422,
    "UUID": "D10B4160-B136-4C90-BA08-3CDD22DDAD9A",
    "DataProviderID": 1,
    "OperatorID": 45,
    "UsageTypeID": 5,
    "AddressInfo": {
        "ID": 54768,
        "Title": "Parkhaus Kronenplatz",
        "AddressLine1": "Fritz-Erler-Straße",
        "AddressLine2": "Innenstadt-Ost",
        "Town": "Karlsruhe",
        "StateOrProvince": "Baden-Württemberg",
        "Postcode": "76133",
        "CountryID": 87,
        "Latitude": 49.0087392567376,
        "Longitude": 8.41019782209013,
        "ContactTelephone1": "+49 721 599-0",
        "AccessComments": "Kostenloses Laden, aber Parkgebühren im durchgehend geöffneten Parkhaus.",
        "RelatedURL": "http://www.stadtwerke-karlsruhe.de/",
        "DistanceUnit": 0
    },
    "Connections": [
        {
            "ID": 68613,
            "ConnectionTypeID": 25,
            "StatusTypeID": 50,
            "LevelID": 2,
            "Amps": 16,
            "Voltage": 400,
            "PowerKW": 11,
            "CurrentTypeID": 20,
            "Quantity": 1
        }
    ],
    "NumberOfPoints": 1,
    "StatusTypeID": 50,
    "DateLastStatusUpdate": "2015-10-02T11:06:00Z",
    "DataQualityLevel": 1,
    "DateCreated": "2015-10-02T06:53:00Z",
    "SubmissionStatusTypeID": 200
}