{
    "IsRecentlyVerified": false,
    "ID": 66464,
    "UUID": "05DF3C90-9517-4716-AE0F-47D56D0B0709",
    "DataProviderID": 1,
    "OperatorID": 22,
    "OperatorsReference": "C6RN7",
    "UsageTypeID": 4,
    "AddressInfo": {
        "ID": 66810,
        "Title": "Pery Square",
        "AddressLine1": "Pery Square",
        "Town": "Limerick",
        "StateOrProvince": "County Limerick",
        "CountryID": 3,
        "Latitude": 52.6582,
        "Longitude": -8.6294,
        "DistanceUnit": 0
    },
    "Connections": [
        {
            "ID": 91844,
            "ConnectionTypeID": 25,
            "StatusTypeID": 75,
            "LevelID": 2,
            "Amps": 32,
            "Voltage": 400,
            "PowerKW": 22,
            "CurrentTypeID": 20,
            "Quantity": 2
        }
    ],
    "NumberOfPoints": 2,
    "StatusTypeID": 75,
    "DateLastStatusUpdate": "2019-06-03T10:48:00Z",
    "DataQualityLevel": 1,
    "DateCreated": "2016-05-20T14:01:00Z",
    "SubmissionStatusTypeID": 200
}