{
    "IsRecentlyVerified": false,
    "ID": 188539,
    "UUID": "E2401E09-FC5F-48BA-B79F-1C01247AAC94",
    "DataProviderID": 1,
    "OperatorID": 21,
    "UsageTypeID": 4,
    "UsageCost": "Mobi.E compatible card or App",
    "AddressInfo": {
        "ID": 188898,
        "Title": "ABF-00021",
        "AddressLine1": "",
        "Town": "Paderne",
        "StateOrProvince": "Algarve",
        "Postcode": "",
        "CountryID": 180,
        "Latitude": 37.1754339217601,
        "Longitude": -8.205567289886744,
        "DistanceUnit": 0
    },
    "Connections": [
        {
            "ID": 304526,
            "ConnectionTypeID": 25,
            "StatusTypeID": 50,
            "LevelID": 2,
            "Amps": 32,
            "Voltage": 400,
            "PowerKW": 22,
            "CurrentTypeID": 20,
            "Quantity": 2
        }
    ],
    "NumberOfPoints": 2,
    "StatusTypeID": 50,
    "DateLastStatusUpdate": "2021-08-01T12:00:00Z",
    "DataQualityLevel": 1,
    "DateCreated": "2021-08-01T12:00:00Z",
    "SubmissionStatusTypeID": 200
}