{
    "IsRecentlyVerified": false,
    "ID": 73046,
    "UUID": "C2CC8D82-B05A-4839-BD70-8BBDF6782F05",
    "DataProviderID": 1,
    "OperatorID": 20,
    "OperatorsReference": "70940",
    "UsageTypeID": 4,
    "UsageCost": "£1.00/charge admin fee. Parking fees apply",
    "AddressInfo": {
        "ID": 73392,
        "Title": "Mell Square Multi-Storey Car Park",
        "AddressLine1": "Warwick Road",
        "Town": "Solihull",
        "StateOrProvince": "West Midlands",
        "Postcode": "B91 3DT",
        "CountryID": 1,
        "Latitude": 52.41401,
        "Longitude": -1.77522,
        "AccessComments": "Located on level 1. Not 24 hours",
        "DistanceUnit": 0
    },
    "Connections": [
        {
            "ID": 104962,
            "ConnectionTypeID": 25,
            "StatusTypeID": 50,
            "LevelID": 2,
            "Amps": 32,
            "Voltage": 230,
            "PowerKW": 7,
            "CurrentTypeID": 10,
            "Quantity": 2
        }
    ],
    "NumberOfPoints": 2,
    "StatusTypeID": 50,
    "DateLastStatusUpdate": "2017-08-24T05:39:00Z",
    "DataQualityLevel": 1,
    "DateCreated": "2016-11-03T10:02:00Z",
    "SubmissionStatusTypeID": 200
}