{
    "IsRecentlyVerified": false,
    "ID": 38212,
    "UUID": "5C99B6F3-948D-48C5-9008-A024CC5276B1",
    "DataProviderID": 1,
    "OperatorID": 105,
    "OperatorsReference": "Essent EM-DE-11000000-17-00002",
    "UsageTypeID": 4,
    "AddressInfo": {
        "ID": 38558,
        "Title": "Karl-Marx-Straße 62",
        "AddressLine1": "Karl-Marx-Straße 62",
        "Town": "Berlin",
        "Postcode": "12043",
        "CountryID": 87,
        "Latitude": 52.482664,
        "Longitude": 13.432248,
        "DistanceUnit": 0
    },
    "Connections": [
        {
            "ID": 41723,
            "ConnectionTypeID": 25,
            "LevelID": 2,
            "PowerKW": 11
        },
        {
            "ID": 49530,
            "ConnectionTypeID": 25,
            "LevelID": 2,
            "PowerKW": 11
        }
    ],
    "NumberOfPoints": 1,
    "StatusTypeID": 50,
    "DateLastStatusUpdate": "2015-04-12T18:09:00Z",
    "DataQualityLevel": 3,
    "DateCreated": "2015-01-09T06:07:00Z",
    "SubmissionStatusTypeID": 200
}