{
    "UserComments": [
        {
            "ID": 22832,
            "ChargePointID": 134799,
            "CommentTypeID": 50,
            "UserName": "Now2005",
            "Comment": "CCS is 50kw! this was saying it was 156kw so ABRP was wrong in its suggested charging times!",
            "Rating": 4,
            "DateCreated": "2020-06-28T17:50:36.617Z",
            "User": {
                "ID": 26309,
                "Username": "Now2005"
            },
            "CheckinStatusTypeID": 10,
            "IsActionedByEditor": false
        }
    ],
    "IsRecentlyVerified": false,
    "ID": 134799,
    "UUID": "3B0584B3-4857-4F7B-9F92-E982058643C7",
    "DataProviderID": 1,
    "OperatorID": 3296,
    "UsageTypeID": 5,
    "UsageCost": "£0.40/kWh",
    "AddressInfo": {
        "ID": 135145,
        "Title": "Starbucks Corfe Mullen",
        "AddressLine1": "Dorchester Rd",
        "AddressLine2": "A31 Westbourne",
        "Town": "Wimborne",
        "StateOrProvince": "Dorset",
        "Postcode": "BH21 3HA",
        "CountryID": 1,
        "Latitude": 50.789593468045524,
        "Longitude": -2.012581706301262,
        "ContactTelephone1": "01256 305900",
        "DistanceUnit": 0
    },
    "Connections": [
        {
            "ID": 188614,
            "ConnectionTypeID": 33,
            "StatusTypeID": 50,
            "LevelID": 3,
            "PowerKW": 50,
            "CurrentTypeID": 30,
            "Quantity": 2
        },
        {
            "ID": 188615,
            "ConnectionTypeID": 2,
            "StatusTypeID": 50,
            "LevelID": 3,
            "PowerKW": 50,
            "CurrentTypeID": 30,
            "Quantity": 2
        }
    ],
    "NumberOfPoints": 2,
    "StatusTypeID": 50,
    "DateLastStatusUpdate": "2021-05-26T10:32:00Z",
    "DataQualityLevel": 1,
    "DateCreated": "2019-11-23T07:22:00Z",
    "SubmissionStatusTypeID": 200
}