{
    "IsRecentlyVerified": false,
    "ID": 107052,
    "UUID": "6C1C81DF-0388-433E-A165-ED344E72DA87",
    "DataProviderID": 1,
    "OperatorID": 86,
    "UsageTypeID": 4,
    "AddressInfo": {
        "ID": 107398,
        "Title": "Bahnhofstraße",
        "AddressLine1": "Bahnhofstraße 112",
        "Town": "Gemeindeverwaltungsverband Wendlingen am Neckar",
        "StateOrProvince": "Gemeindeverwaltungsverband Wendlingen am Neckar",
        "Postcode": "73240",
        "CountryID": 87,
        "Latitude": 48.673789924130745,
        "Longitude": 9.375994249737573,
        "AccessComments": "24/7 nutzbar",
        "DistanceUnit": 0
    },
    "Connections": [
        {
            "ID": 150923,
            "ConnectionTypeID": 25,
            "StatusTypeID": 50,
            "LevelID": 2,
            "Amps": 32,
            "Voltage": 400,
            "PowerKW": 22,
            "CurrentTypeID": 20,
            "Quantity": 2
        },
        {
            "ID": 150924,
            "ConnectionTypeID": 28,
            "StatusTypeID": 50,
            "LevelID": 2,
            "Amps": 16,
            "Voltage": 230,
            "PowerKW": 3.7,
            "CurrentTypeID": 10,
            "Quantity": 2
        }
    ],
    "NumberOfPoints": 4,
    "StatusTypeID": 50,
    "DateLastStatusUpdate": "2018-07-16T09:07:00Z",
    "DataQualityLevel": 1,
    "DateCreated": "2018-07-16T09:07:00Z",
    "SubmissionStatusTypeID": 200
}