{
    "IsRecentlyVerified": false,
    "ID": 162386,
    "UUID": "9D06DF37-E1DE-4385-9A87-92DA8C4FC751",
    "DataProviderID": 1,
    "OperatorID": 80,
    "UsageTypeID": 4,
    "AddressInfo": {
        "ID": 162743,
        "Title": "Villarbasse Rocciavrè | ENELX",
        "AddressLine1": "Via Rocciavrè, 14",
        "AddressLine2": "Corbiglia",
        "Town": "Villarbasse",
        "StateOrProvince": "TO",
        "Postcode": "10090",
        "CountryID": 112,
        "Latitude": 45.047473049170094,
        "Longitude": 7.4942102697443715,
        "ContactTelephone1": "800.069.850",
        "RelatedURL": "https://www.enelx.com/it/it/emobility",
        "DistanceUnit": 0
    },
    "Connections": [
        {
            "ID": 233724,
            "ConnectionTypeID": 25,
            "StatusTypeID": 50,
            "LevelID": 2,
            "Amps": 32,
            "Voltage": 400,
            "PowerKW": 22,
            "CurrentTypeID": 20,
            "Quantity": 2
        }
    ],
    "NumberOfPoints": 2,
    "StatusTypeID": 50,
    "DateLastStatusUpdate": "2020-08-07T08:04:00Z",
    "DataQualityLevel": 1,
    "DateCreated": "2020-08-07T08:04:00Z",
    "SubmissionStatusTypeID": 200
}