{
    "IsRecentlyVerified": false,
    "ID": 126241,
    "UUID": "5CE9B8AB-4416-45A7-801E-D334C348871A",
    "DataProviderID": 1,
    "OperatorID": 23,
    "OperatorsReference": "43380",
    "UsageTypeID": 4,
    "AddressInfo": {
        "ID": 126587,
        "Title": "Best Western Hotel Bristol At Newquay",
        "AddressLine1": "Narrowcliff",
        "Town": "Ne",
        "StateOrProvince": "Newquay",
        "Postcode": "TR7 2PQ",
        "CountryID": 1,
        "Latitude": 50.417432,
        "Longitude": -5.071411,
        "ContactTelephone1": "+44 163 787 5181",
        "DistanceUnit": 0
    },
    "Connections": [
        {
            "ID": 176937,
            "ConnectionTypeID": 30,
            "StatusTypeID": 50,
            "LevelID": 2,
            "PowerKW": 13,
            "CurrentTypeID": 20,
            "Quantity": 2
        }
    ],
    "NumberOfPoints": 2,
    "GeneralComments": "2 Tesla Connectors, up to 13kW.Available for customers. Please see front desk.",
    "StatusTypeID": 50,
    "DateLastStatusUpdate": "2019-05-14T05:36:00Z",
    "DataQualityLevel": 1,
    "DateCreated": "2019-05-14T05:36:00Z",
    "SubmissionStatusTypeID": 200
}