{
    "IsRecentlyVerified": false,
    "ID": 63910,
    "UUID": "5B97076F-B712-449B-B09B-C19C2837D9AC",
    "DataProviderID": 26,
    "DataProvidersReference": "79749",
    "OperatorID": 103,
    "OperatorsReference": "Allego NLALLEGO0006561",
    "UsageCost": "0.00 jaarabonnement",
    "AddressInfo": {
        "ID": 64256,
        "Title": "Waddenweg 315",
        "AddressLine1": "Waddenweg 315",
        "Town": "Haarlemmermeer",
        "Postcode": "2134 XL",
        "CountryID": 159,
        "Latitude": 52.32296379,
        "Longitude": 4.65714138,
        "ContactTelephone1": "0800-3745337",
        "RelatedURL": "http://www.allego.eu/",
        "DistanceUnit": 0
    },
    "Connections": [
        {
            "ID": 81671,
            "ConnectionTypeID": 25,
            "LevelID": 2,
            "PowerKW": 11,
            "CurrentTypeID": 10
        },
        {
            "ID": 81672,
            "ConnectionTypeID": 25,
            "LevelID": 2,
            "PowerKW": 11,
            "CurrentTypeID": 10
        }
    ],
    "NumberOfPoints": 1,
    "StatusTypeID": 50,
    "DateLastStatusUpdate": "2016-06-04T02:53:00Z",
    "DataQualityLevel": 3,
    "DateCreated": "2016-03-03T12:32:00Z",
    "SubmissionStatusTypeID": 100
}