{
    "IsRecentlyVerified": false,
    "ID": 117764,
    "UUID": "66E4949E-BDAC-4124-8816-AA5DB64CCBD0",
    "DataProviderID": 1,
    "OperatorID": 3315,
    "OperatorsReference": "51262",
    "UsageTypeID": 4,
    "UsageCost": "Free",
    "AddressInfo": {
        "ID": 118110,
        "Title": "Glasgow Clyde College, Anniesland Campus, Glasgow",
        "AddressLine1": "19 Hatfield Drive",
        "Town": "Glasgow City",
        "Postcode": "G12 0YE",
        "CountryID": 1,
        "Latitude": 55.88586,
        "Longitude": -4.31817,
        "DistanceUnit": 0
    },
    "Connections": [
        {
            "ID": 166627,
            "ConnectionTypeID": 25,
            "StatusTypeID": 50,
            "LevelID": 2,
            "Amps": 32,
            "Voltage": 230,
            "PowerKW": 7,
            "CurrentTypeID": 10,
            "Quantity": 2
        }
    ],
    "NumberOfPoints": 2,
    "StatusTypeID": 50,
    "DateLastStatusUpdate": "2019-03-01T06:22:00Z",
    "DataQualityLevel": 1,
    "DateCreated": "2019-03-01T06:22:00Z",
    "SubmissionStatusTypeID": 200
}