{
    "IsRecentlyVerified": false,
    "ID": 115111,
    "UUID": "17A2B16E-B4A7-4DAB-B7D1-962006AB76E5",
    "DataProviderID": 1,
    "OperatorID": 80,
    "UsageTypeID": 4,
    "AddressInfo": {
        "ID": 115457,
        "Title": "Alzate Brianza IV Novembre | EnelX",
        "AddressLine1": "Via IV Novembre",
        "Town": "Alzate Brianza",
        "StateOrProvince": "CO",
        "Postcode": "22040",
        "CountryID": 112,
        "Latitude": 45.770521361353126,
        "Longitude": 9.179407438522462,
        "RelatedURL": "https://www.enelx.com/it/it/emobility",
        "DistanceUnit": 0
    },
    "Connections": [
        {
            "ID": 161994,
            "ConnectionTypeID": 25,
            "StatusTypeID": 50,
            "LevelID": 2,
            "Amps": 32,
            "Voltage": 400,
            "PowerKW": 22,
            "CurrentTypeID": 20,
            "Quantity": 3
        },
        {
            "ID": 161995,
            "ConnectionTypeID": 36,
            "StatusTypeID": 50,
            "LevelID": 2,
            "Amps": 16,
            "Voltage": 240,
            "PowerKW": 3.7,
            "CurrentTypeID": 10,
            "Quantity": 3
        }
    ],
    "NumberOfPoints": 6,
    "StatusTypeID": 50,
    "DateLastStatusUpdate": "2019-01-30T14:04:00Z",
    "DataQualityLevel": 1,
    "DateCreated": "2019-01-30T14:04:00Z",
    "SubmissionStatusTypeID": 200
}