{
    "IsRecentlyVerified": false,
    "ID": 160748,
    "UUID": "67AE607F-86BC-4402-9206-04726002024C",
    "DataProviderID": 2,
    "DataProvidersReference": "156781",
    "UsageTypeID": 2,
    "AddressInfo": {
        "ID": 161105,
        "Title": "Federated Co-operatives Ltd (FCL)",
        "AddressLine1": "1789 Strachan Rd SE",
        "Town": "Medicine Hat",
        "StateOrProvince": "AB",
        "Postcode": "T1B 0S9",
        "CountryID": 44,
        "Latitude": 49.9995292,
        "Longitude": -110.65433,
        "ContactTelephone1": "",
        "AccessComments": "",
        "RelatedURL": "",
        "DistanceUnit": 0
    },
    "Connections": [
        {
            "ID": 231336,
            "ConnectionTypeID": 2,
            "LevelID": 3,
            "Amps": 100,
            "Voltage": 400,
            "PowerKW": 40,
            "CurrentTypeID": 30,
            "Quantity": 1
        },
        {
            "ID": 231337,
            "ConnectionTypeID": 32,
            "LevelID": 3,
            "Amps": 100,
            "Voltage": 400,
            "PowerKW": 40,
            "CurrentTypeID": 30,
            "Quantity": 1
        }
    ],
    "GeneralComments": "Planned for future date. Not Operational.",
    "DatePlanned": "2020-09-01T00:00:00Z",
    "StatusTypeID": 150,
    "DateLastStatusUpdate": "2020-06-26T03:12:00Z",
    "DataQualityLevel": 3,
    "DateCreated": "2020-06-26T03:12:00Z",
    "SubmissionStatusTypeID": 100
}