{
    "IsRecentlyVerified": false,
    "ID": 142336,
    "UUID": "B2A9B6CC-CC7A-41D8-9CD9-393828F896FE",
    "DataProviderID": 2,
    "DataProvidersReference": "149175",
    "OperatorID": 5,
    "UsageTypeID": 1,
    "AddressInfo": {
        "ID": 142688,
        "Title": "METLIFE",
        "AddressLine1": "501 US-22",
        "Town": "Bridgewater Township",
        "StateOrProvince": "NJ",
        "Postcode": "08807",
        "CountryID": 2,
        "Latitude": 40.592308,
        "Longitude": -74.649635,
        "ContactTelephone1": "888-758-4389",
        "AccessComments": "24 hours daily",
        "RelatedURL": "http://www.chargepoint.com/",
        "DistanceUnit": 0
    },
    "Connections": [
        {
            "ID": 198451,
            "ConnectionTypeID": 1,
            "LevelID": 2,
            "Amps": 16,
            "Voltage": 230,
            "PowerKW": 3.7,
            "CurrentTypeID": 10,
            "Quantity": 2
        }
    ],
    "StatusTypeID": 50,
    "DateLastStatusUpdate": "2020-06-26T03:03:00Z",
    "DataQualityLevel": 3,
    "DateCreated": "2019-12-24T09:17:00Z",
    "SubmissionStatusTypeID": 100
}