{
    "IsRecentlyVerified": false,
    "ID": 97479,
    "UUID": "A682E9B0-53C5-42FF-B33B-D16994B1B52D",
    "DataProviderID": 1,
    "OperatorID": 23,
    "OperatorsReference": "28857",
    "UsageTypeID": 4,
    "UsageCost": "NZD 0.42/kWh;other tariffs for older cars",
    "AddressInfo": {
        "ID": 97825,
        "Title": "Palmerston North Supercharger",
        "AddressLine1": "84 The Square",
        "Town": "Palmerston North",
        "Postcode": "4410",
        "CountryID": 161,
        "Latitude": -40.35845,
        "Longitude": 175.614185,
        "DistanceUnit": 0
    },
    "Connections": [
        {
            "ID": 138386,
            "ConnectionTypeID": 27,
            "StatusTypeID": 50,
            "LevelID": 3,
            "PowerKW": 120,
            "CurrentTypeID": 30,
            "Quantity": 4
        }
    ],
    "NumberOfPoints": 4,
    "GeneralComments": "Charging4 Superchargers, available 24/7, up to 120kW",
    "StatusTypeID": 50,
    "DateLastStatusUpdate": "2019-03-23T07:51:00Z",
    "DataQualityLevel": 1,
    "DateCreated": "2018-01-21T15:32:00Z",
    "SubmissionStatusTypeID": 200
}