{
    "IsRecentlyVerified": false,
    "ID": 18329,
    "UUID": "C31221EB-1A01-4697-8E67-BD798424A81A",
    "DataProviderID": 2,
    "DataProvidersReference": "52260",
    "OperatorID": 5,
    "UsageTypeID": 1,
    "AddressInfo": {
        "ID": 18674,
        "Title": "NATIONAL GRID",
        "AddressLine1": "225 Chapman St",
        "Town": "Providence",
        "StateOrProvince": "RI",
        "Postcode": "02905",
        "CountryID": 2,
        "Latitude": 41.792385,
        "Longitude": -71.402936,
        "ContactTelephone1": "888-758-4389",
        "AccessComments": "24 hours daily",
        "RelatedURL": "http://www.chargepoint.com/",
        "DistanceUnit": 0
    },
    "Connections": [
        {
            "ID": 18547,
            "ConnectionTypeID": 1,
            "LevelID": 2,
            "Amps": 16,
            "Voltage": 230,
            "PowerKW": 3.7,
            "CurrentTypeID": 10,
            "Quantity": 2
        },
        {
            "ID": 22268,
            "ConnectionTypeID": 1,
            "LevelID": 2,
            "Quantity": 2
        }
    ],
    "DateLastStatusUpdate": "2020-06-26T03:05:00Z",
    "DataQualityLevel": 3,
    "DateCreated": "2013-07-18T05:22:00Z",
    "SubmissionStatusTypeID": 200
}