{
    "IsRecentlyVerified": false,
    "ID": 176316,
    "UUID": "4E3126B0-13F0-4C13-ACFC-C64FCD6CA74B",
    "DataProviderID": 1,
    "OperatorID": 3279,
    "UsageTypeID": 4,
    "UsageCost": "Free",
    "AddressInfo": {
        "ID": 176675,
        "Title": "Centro de Salud Infante Don Luis",
        "AddressLine1": "Calle Secundino Zuazo, 7",
        "Town": "Boadilla del Monte",
        "StateOrProvince": "Madrid",
        "Postcode": "28660",
        "CountryID": 210,
        "Latitude": 40.40254738435689,
        "Longitude": -3.894500989336507,
        "DistanceUnit": 0
    },
    "Connections": [
        {
            "ID": 274053,
            "ConnectionTypeID": 25,
            "StatusTypeID": 50,
            "LevelID": 2,
            "Amps": 16,
            "Voltage": 400,
            "PowerKW": 11,
            "CurrentTypeID": 20,
            "Quantity": 2
        }
    ],
    "NumberOfPoints": 2,
    "StatusTypeID": 50,
    "DateLastStatusUpdate": "2021-07-05T11:27:00Z",
    "DataQualityLevel": 1,
    "DateCreated": "2021-07-04T21:01:00Z",
    "SubmissionStatusTypeID": 200
}