{
    "IsRecentlyVerified": false,
    "ID": 136967,
    "UUID": "F26659E1-210C-4206-8EC5-E44DF8AB3538",
    "DataProviderID": 18,
    "DataProvidersReference": "99c21323790ff1b0d80e980918d15f0b",
    "OperatorID": 20,
    "UsageTypeID": 4,
    "AddressInfo": {
        "ID": 137313,
        "Title": "Wooler",
        "AddressLine1": "7-9 South Road",
        "Town": "Wooler",
        "Postcode": "NE716QE",
        "CountryID": 1,
        "Latitude": 55.544775,
        "Longitude": -2.009157,
        "AccessComments": "7-9 South Road, Wooler",
        "RelatedURL": "http://www.chargeyourcar.org.uk",
        "DistanceUnit": 0
    },
    "Connections": [
        {
            "ID": 191692,
            "ConnectionTypeID": 25,
            "Reference": "0",
            "StatusTypeID": 50,
            "LevelID": 2,
            "Amps": 32,
            "Voltage": 230,
            "PowerKW": 7,
            "CurrentTypeID": 10
        }
    ],
    "StatusTypeID": 0,
    "DateLastStatusUpdate": "2019-12-24T05:23:00Z",
    "MetadataValues": [
        {
            "ID": 6819,
            "MetadataFieldID": 4,
            "ItemValue": "Contains public sector information licensed under the Open Government Licence v2.0. http://www.nationalarchives.gov.uk/doc/open-government-licence/version/2/"
        }
    ],
    "DataQualityLevel": 3,
    "DateCreated": "2019-12-24T05:23:00Z",
    "SubmissionStatusTypeID": 100
}