{
    "UserComments": [
        {
            "ID": 9973,
            "ChargePointID": 5233,
            "CommentTypeID": 10,
            "UserName": "GlenTesla",
            "Comment": "Only one out of 2 now available. One post permanently removed.",
            "Rating": 3,
            "DateCreated": "2016-03-22T23:21:01.73Z",
            "User": {
                "ID": 9131,
                "Username": "GlenTesla"
            },
            "CheckinStatusTypeID": 10,
            "IsActionedByEditor": true
        },
        {
            "ID": 893,
            "ChargePointID": 5233,
            "CommentTypeID": 1000,
            "UserName": "002scar",
            "Comment": "There is now only 1 charge point",
            "Rating": 2,
            "DateCreated": "2014-06-10T20:12:17.12Z",
            "User": {
                "ID": 1558,
                "Username": "002scar"
            },
            "CheckinStatusTypeID": 25
        },
        {
            "ID": 831,
            "ChargePointID": 5233,
            "CommentTypeID": 10,
            "UserName": "002scar",
            "Comment": "2 bays, only 1 charge point working, no parking charge",
            "Rating": 5,
            "DateCreated": "2014-05-23T09:20:15.993Z",
            "User": {
                "ID": 1558,
                "Username": "002scar"
            },
            "CheckinStatusTypeID": 10
        }
    ],
    "IsRecentlyVerified": false,
    "ID": 5233,
    "UUID": "6761C7F6-BB49-41F8-8AF6-4DEEB7B9CA59",
    "DataProviderID": 1,
    "OperatorID": 20,
    "OperatorsReference": "41138,41139",
    "UsageTypeID": 4,
    "UsageCost": "£1.00/session",
    "AddressInfo": {
        "ID": 5173,
        "Title": "The Sands Car Park",
        "AddressLine1": "The Sands Car Park",
        "Town": "Durham",
        "StateOrProvince": "County Durham",
        "Postcode": "DH1 1SQ",
        "CountryID": 1,
        "Latitude": 54.7801878514499,
        "Longitude": -1.57546520233154,
        "DistanceUnit": 0
    },
    "Connections": [
        {
            "ID": 343,
            "ConnectionTypeID": 25,
            "StatusTypeID": 75,
            "LevelID": 2,
            "Amps": 32,
            "Voltage": 230,
            "PowerKW": 7,
            "CurrentTypeID": 10,
            "Quantity": 2
        }
    ],
    "NumberOfPoints": 2,
    "StatusTypeID": 75,
    "DateLastStatusUpdate": "2020-06-02T13:56:00Z",
    "DataQualityLevel": 1,
    "DateCreated": "2011-08-24T15:40:00Z",
    "SubmissionStatusTypeID": 200
}