{
    "IsRecentlyVerified": false,
    "ID": 53365,
    "UUID": "65D7C174-1ACE-4E3C-A4B0-48E1DA1D5126",
    "DataProviderID": 2,
    "DataProvidersReference": "69911",
    "OperatorID": 39,
    "UsageTypeID": 4,
    "AddressInfo": {
        "ID": 53711,
        "Title": "Lake Mohonk",
        "AddressLine1": "1000 Mountain Rest Road",
        "Town": "New Paltz",
        "StateOrProvince": "NY",
        "Postcode": "12561",
        "CountryID": 2,
        "Latitude": 41.7682793,
        "Longitude": -74.1560166,
        "ContactTelephone1": "800-663-5633",
        "AccessComments": "MO: 12:00am-12:00am; TU: 12:00am-12:00am; WE: 12:00am-12:00am; TH: 12:00am-12:00am; FR: 12:00am-12:00am; SA: 12:00am-12:00am; SU: 12:00am-12:00am",
        "RelatedURL": "http://www.semacharge.com/",
        "DistanceUnit": 0
    },
    "Connections": [
        {
            "ID": 66480,
            "ConnectionTypeID": 1,
            "LevelID": 2,
            "Amps": 16,
            "Voltage": 230,
            "PowerKW": 3,
            "CurrentTypeID": 10,
            "Quantity": 4
        }
    ],
    "DateLastStatusUpdate": "2019-04-06T05:05:00Z",
    "DataQualityLevel": 3,
    "DateCreated": "2015-09-20T11:18:00Z",
    "SubmissionStatusTypeID": 100
}