{
    "IsRecentlyVerified": false,
    "ID": 31082,
    "UUID": "793F56F0-4FC9-4923-83A4-BF508C9595D6",
    "DataProviderID": 1,
    "DataProvidersReference": "1827",
    "AddressInfo": {
        "ID": 31428,
        "Title": "Mosjøen Hotell",
        "AddressLine1": "Vollanveien 35",
        "Town": "MOSJØEN",
        "StateOrProvince": "Nordland",
        "Postcode": "8657",
        "CountryID": 168,
        "Latitude": 65.84628,
        "Longitude": 13.19937,
        "AccessComments": "Ligger like ved  E6 (nordlig innkjøring) og jernbanestasjonen, kun 10 min gange til Mosjøen sentrum.",
        "DistanceUnit": 0
    },
    "Connections": [
        {
            "ID": 34311,
            "ConnectionTypeID": 0,
            "Reference": "1",
            "LevelID": 2,
            "Amps": 32,
            "Voltage": 230,
            "PowerKW": 7.4,
            "Comments": "Mode 1"
        },
        {
            "ID": 89508,
            "ConnectionTypeID": 0,
            "Reference": "2",
            "LevelID": 2,
            "Amps": 32,
            "Voltage": 230,
            "PowerKW": 7.4,
            "Comments": "Mode 1"
        }
    ],
    "NumberOfPoints": 2,
    "DateLastStatusUpdate": "2020-05-26T08:25:00Z",
    "DataQualityLevel": 2,
    "DateCreated": "2014-12-09T09:01:00Z",
    "SubmissionStatusTypeID": 100
}