{
    "IsRecentlyVerified": false,
    "ID": 68081,
    "UUID": "B8210900-5C07-4F40-AE50-728BBDC983F9",
    "DataProviderID": 26,
    "DataProvidersReference": "93009",
    "OperatorID": 103,
    "OperatorsReference": "Allego NLALLEGO0010302",
    "UsageCost": "0.00 jaarabonnement",
    "AddressInfo": {
        "ID": 68427,
        "Title": "Evenaar 232",
        "AddressLine1": "Evenaar 232",
        "Town": "Alphen aan den Rijn",
        "Postcode": "2408 JT",
        "CountryID": 159,
        "Latitude": 52.1214981,
        "Longitude": 4.64989079,
        "ContactTelephone1": "0800-3745337",
        "RelatedURL": "http://www.allego.eu/",
        "DistanceUnit": 0
    },
    "Connections": [
        {
            "ID": 94812,
            "ConnectionTypeID": 25,
            "LevelID": 2,
            "PowerKW": 11,
            "CurrentTypeID": 10
        },
        {
            "ID": 94813,
            "ConnectionTypeID": 25,
            "LevelID": 2,
            "PowerKW": 11,
            "CurrentTypeID": 10
        }
    ],
    "NumberOfPoints": 1,
    "StatusTypeID": 50,
    "DateLastStatusUpdate": "2016-06-04T02:37:00Z",
    "DataQualityLevel": 3,
    "DateCreated": "2016-06-04T02:37:00Z",
    "SubmissionStatusTypeID": 100
}