{
    "IsRecentlyVerified": false,
    "ID": 72214,
    "UUID": "87601164-A1EF-4976-87EB-6E4A1EACE64E",
    "DataProviderID": 2,
    "DataProvidersReference": "78817",
    "OperatorID": 5,
    "UsageTypeID": 1,
    "AddressInfo": {
        "ID": 72560,
        "Title": "STEINDORF",
        "AddressLine1": "3001 Ross Ave",
        "Town": "San Jose",
        "StateOrProvince": "CA",
        "Postcode": "95124",
        "CountryID": 2,
        "Latitude": 37.267251,
        "Longitude": -121.919461,
        "ContactTelephone1": "888-758-4389",
        "AccessComments": "24 hours daily",
        "RelatedURL": "http://www.chargepoint.com/",
        "DistanceUnit": 0
    },
    "Connections": [
        {
            "ID": 103517,
            "ConnectionTypeID": 1,
            "LevelID": 2,
            "Amps": 16,
            "Voltage": 230,
            "PowerKW": 3,
            "CurrentTypeID": 10,
            "Quantity": 4
        }
    ],
    "DateLastStatusUpdate": "2019-04-06T04:02:00Z",
    "DataQualityLevel": 3,
    "DateCreated": "2016-10-09T02:45:00Z",
    "SubmissionStatusTypeID": 100
}