{
    "UserComments": [
        {
            "ID": 24763,
            "ChargePointID": 188892,
            "CommentTypeID": 10,
            "UserName": "ForumElettrico.it",
            "Comment": "Oltre al supermercato Coop, li accanto troviamo diversi bar, ristoranti e negozi. Leggi la recensione completa qui > https://www.forumelettrico.it/forum/colonnina-ricarica-22-kw-coop-bagni-di-lucca-lu-viale-papa-giovanni-xxiii-21-i-fornoli-t19906.html",
            "RelatedURL": "https://www.forumelettrico.it/forum/colonnina-ricarica-22-kw-coop-bagni-di-lucca-lu-viale-papa-giovanni-xxiii-21-i-fornoli-t19906.html",
            "DateCreated": "2021-08-23T16:36:59.31Z",
            "User": {
                "ID": 11749,
                "Username": "ForumElettrico.it"
            },
            "CheckinStatusTypeID": 140,
            "IsActionedByEditor": false
        }
    ],
    "MediaItems": [
        {
            "ID": 29088,
            "ChargePointID": 188892,
            "ItemURL": "https://s3-ap-southeast-2.amazonaws.com/openchargemap/images/IT/OCM188892/OCM-188892.orig.2021082316372947.jpg",
            "ItemThumbnailURL": "https://s3-ap-southeast-2.amazonaws.com/openchargemap/images/IT/OCM188892/OCM-188892.thmb.2021082316372947.jpg",
            "Comment": "",
            "IsEnabled": true,
            "IsVideo": false,
            "IsFeaturedItem": false,
            "IsExternalResource": false,
            "User": {
                "ID": 11749,
                "Username": "ForumElettrico.it"
            },
            "DateCreated": "2021-08-23T16:38:00Z"
        },
        {
            "ID": 29084,
            "ChargePointID": 188892,
            "ItemURL": "https://s3-ap-southeast-2.amazonaws.com/openchargemap/images/IT/OCM188892/OCM-188892.orig.2021082316370810.jpg",
            "ItemThumbnailURL": "https://s3-ap-southeast-2.amazonaws.com/openchargemap/images/IT/OCM188892/OCM-188892.thmb.2021082316370810.jpg",
            "Comment": "",
            "IsEnabled": true,
            "IsVideo": false,
            "IsFeaturedItem": false,
            "IsExternalResource": false,
            "User": {
                "ID": 11749,
                "Username": "ForumElettrico.it"
            },
            "DateCreated": "2021-08-23T16:37:00Z"
        },
        {
            "ID": 29085,
            "ChargePointID": 188892,
            "ItemURL": "https://s3-ap-southeast-2.amazonaws.com/openchargemap/images/IT/OCM188892/OCM-188892.orig.2021082316371371.jpg",
            "ItemThumbnailURL": "https://s3-ap-southeast-2.amazonaws.com/openchargemap/images/IT/OCM188892/OCM-188892.thmb.2021082316371371.jpg",
            "Comment": "",
            "IsEnabled": true,
            "IsVideo": false,
            "IsFeaturedItem": false,
            "IsExternalResource": false,
            "User": {
                "ID": 11749,
                "Username": "ForumElettrico.it"
            },
            "DateCreated": "2021-08-23T16:37:00Z"
        },
        {
            "ID": 29086,
            "ChargePointID": 188892,
            "ItemURL": "https://s3-ap-southeast-2.amazonaws.com/openchargemap/images/IT/OCM188892/OCM-188892.orig.2021082316371864.jpg",
            "ItemThumbnailURL": "https://s3-ap-southeast-2.amazonaws.com/openchargemap/images/IT/OCM188892/OCM-188892.thmb.2021082316371864.jpg",
            "Comment": "",
            "IsEnabled": true,
            "IsVideo": false,
            "IsFeaturedItem": false,
            "IsExternalResource": false,
            "User": {
                "ID": 11749,
                "Username": "ForumElettrico.it"
            },
            "DateCreated": "2021-08-23T16:37:00Z"
        },
        {
            "ID": 29087,
            "ChargePointID": 188892,
            "ItemURL": "https://s3-ap-southeast-2.amazonaws.com/openchargemap/images/IT/OCM188892/OCM-188892.orig.2021082316372410.jpg",
            "ItemThumbnailURL": "https://s3-ap-southeast-2.amazonaws.com/openchargemap/images/IT/OCM188892/OCM-188892.thmb.2021082316372410.jpg",
            "Comment": "",
            "IsEnabled": true,
            "IsVideo": false,
            "IsFeaturedItem": false,
            "IsExternalResource": false,
            "User": {
                "ID": 11749,
                "Username": "ForumElettrico.it"
            },
            "DateCreated": "2021-08-23T16:37:00Z"
        }
    ],
    "IsRecentlyVerified": true,
    "DateLastVerified": "2021-08-23T16:37:00Z",
    "ID": 188892,
    "UUID": "466A73E4-73A1-4AC7-9F00-FBD886537DAC",
    "DataProviderID": 1,
    "OperatorID": 1,
    "UsageTypeID": 2,
    "AddressInfo": {
        "ID": 189251,
        "Title": "Ricarica Coop Fornoli",
        "AddressLine1": "Viale Papa Giovanni XXIII 21/I",
        "Town": "Bagni di Lucca",
        "StateOrProvince": "LU",
        "CountryID": 112,
        "Latitude": 44.005499,
        "Longitude": 10.559068,
        "RelatedURL": "https://www.forumelettrico.it/forum/colonnina-ricarica-22-kw-coop-bagni-di-lucca-lu-viale-papa-giovanni-xxiii-21-i-fornoli-t19906.html",
        "DistanceUnit": 0
    },
    "Connections": [
        {
            "ID": 305245,
            "ConnectionTypeID": 25,
            "LevelID": 2,
            "PowerKW": 22
        }
    ],
    "NumberOfPoints": 1,
    "StatusTypeID": 50,
    "DateLastStatusUpdate": "2021-08-23T16:38:00Z",
    "DataQualityLevel": 1,
    "DateCreated": "2021-08-23T16:37:00Z",
    "SubmissionStatusTypeID": 200
}