{
    "UserComments": [
        {
            "ID": 22245,
            "ChargePointID": 119745,
            "CommentTypeID": 1000,
            "UserName": "Largo Sustainability",
            "Comment": "City of Largo announcement: Due to West Bay Drive corridor improvements, the electric vehicle (EV) charging station located at the W Bay Dr. / 2nd St. SW parking lot is temporarily out of service. The EV charging station is estimated to be operating again August 2020 when construction is complete. For more information please contact sustainability@largo.com",
            "DateCreated": "2020-03-06T21:36:51.863Z",
            "User": {
                "ID": 25384,
                "Username": "Largo Sustainability"
            },
            "CheckinStatusTypeID": 120,
            "IsActionedByEditor": false
        }
    ],
    "IsRecentlyVerified": false,
    "ID": 119745,
    "UUID": "E332A012-229A-4166-8D8E-719C3BAAB380",
    "DataProviderID": 2,
    "DataProvidersReference": "105491",
    "OperatorID": 59,
    "UsageTypeID": 1,
    "AddressInfo": {
        "ID": 120091,
        "Title": "Greenlots - 112455U",
        "AddressLine1": "301 W Bay Drive",
        "Town": "Largo",
        "StateOrProvince": "FL",
        "Postcode": "33770",
        "CountryID": 2,
        "Latitude": 27.9164123535156,
        "Longitude": -82.7898254394531,
        "ContactTelephone1": "855-900-7584",
        "AccessComments": "24 hours daily",
        "RelatedURL": "http://greenlots.com/",
        "DistanceUnit": 0
    },
    "Connections": [
        {
            "ID": 169030,
            "ConnectionTypeID": 1,
            "LevelID": 2,
            "Amps": 16,
            "Voltage": 230,
            "PowerKW": 3,
            "CurrentTypeID": 10,
            "Quantity": 2
        }
    ],
    "DateLastStatusUpdate": "2020-03-06T21:37:00Z",
    "DataQualityLevel": 3,
    "DateCreated": "2019-04-01T04:59:00Z",
    "SubmissionStatusTypeID": 100
}