{
    "IsRecentlyVerified": false,
    "ID": 92471,
    "UUID": "21694254-E81B-468F-BEB1-BE7B0B4CFE82",
    "DataProviderID": 1,
    "OperatorID": 23,
    "OperatorsReference": "33627",
    "UsageTypeID": 4,
    "AddressInfo": {
        "ID": 92817,
        "Title": "Tempe Mission Palms",
        "AddressLine1": "60 E 5th St",
        "Town": "Tempe",
        "StateOrProvince": "Arizona",
        "Postcode": "85281",
        "CountryID": 2,
        "Latitude": 33.425944,
        "Longitude": -111.938837,
        "ContactTelephone1": "(480) 894-1400",
        "DistanceUnit": 0
    },
    "Connections": [
        {
            "ID": 131072,
            "ConnectionTypeID": 30,
            "StatusTypeID": 50,
            "LevelID": 2,
            "PowerKW": 16,
            "CurrentTypeID": 20,
            "Quantity": 1
        }
    ],
    "NumberOfPoints": 1,
    "GeneralComments": "1 Tesla Connector, up to 16kW.Available for customers. Please see front desk.",
    "StatusTypeID": 50,
    "DateLastStatusUpdate": "2017-09-07T05:46:00Z",
    "DataQualityLevel": 1,
    "DateCreated": "2017-09-07T05:46:00Z",
    "SubmissionStatusTypeID": 200
}