{
    "IsRecentlyVerified": false,
    "ID": 144025,
    "UUID": "95BE8104-C419-4DC5-9215-76AD2217D173",
    "DataProviderID": 2,
    "DataProvidersReference": "99193",
    "OperatorID": 59,
    "UsageTypeID": 1,
    "AddressInfo": {
        "ID": 144377,
        "Title": "Greenlots - 33091",
        "AddressLine1": "6364 Labeaux Ave NE",
        "Town": "Albertville",
        "StateOrProvince": "NM",
        "Postcode": "55301",
        "CountryID": 2,
        "Latitude": 45.2440223693848,
        "Longitude": -93.6627731323242,
        "ContactTelephone1": "855-900-7584",
        "AccessComments": "24 hours daily",
        "RelatedURL": "http://greenlots.com/",
        "DistanceUnit": 0
    },
    "Connections": [
        {
            "ID": 200481,
            "ConnectionTypeID": 2,
            "LevelID": 3,
            "Amps": 100,
            "Voltage": 400,
            "PowerKW": 40,
            "CurrentTypeID": 30,
            "Quantity": 1
        },
        {
            "ID": 200482,
            "ConnectionTypeID": 32,
            "LevelID": 3,
            "Amps": 100,
            "Voltage": 400,
            "PowerKW": 40,
            "CurrentTypeID": 30,
            "Quantity": 1
        }
    ],
    "StatusTypeID": 50,
    "DateLastStatusUpdate": "2020-06-26T03:08:00Z",
    "DataQualityLevel": 3,
    "DateCreated": "2019-12-24T09:22:00Z",
    "SubmissionStatusTypeID": 100
}