{
    "IsRecentlyVerified": false,
    "ID": 187890,
    "UUID": "48DE9306-23DE-4C08-8691-7D1787DFD01A",
    "DataProviderID": 18,
    "DataProvidersReference": "caa7ada7d5108664620d9461b6aa6f1e",
    "OperatorID": 3345,
    "UsageTypeID": 5,
    "AddressInfo": {
        "ID": 188249,
        "Title": "CV5 8FX",
        "AddressLine1": "",
        "Town": "Coventry",
        "Postcode": "CV5 8FX",
        "CountryID": 1,
        "Latitude": 52.408894,
        "Longitude": -1.54288,
        "AccessComments": "",
        "RelatedURL": "https://char.gy",
        "DistanceUnit": 0
    },
    "Connections": [
        {
            "ID": 303218,
            "ConnectionTypeID": 25,
            "Reference": "759",
            "StatusTypeID": 50,
            "LevelID": 2,
            "Amps": 16,
            "Voltage": 230,
            "PowerKW": 3.7,
            "CurrentTypeID": 10
        }
    ],
    "StatusTypeID": 0,
    "DateLastStatusUpdate": "2021-07-12T03:39:00Z",
    "MetadataValues": [
        {
            "ID": 20130,
            "MetadataFieldID": 4,
            "ItemValue": "Contains public sector information licensed under the Open Government Licence v2.0. http://www.nationalarchives.gov.uk/doc/open-government-licence/version/2/"
        }
    ],
    "DataQualityLevel": 3,
    "DateCreated": "2021-07-12T03:39:00Z",
    "SubmissionStatusTypeID": 100
}