{
    "IsRecentlyVerified": false,
    "ID": 179689,
    "UUID": "E2374641-997D-4349-ABA4-6B644C0521DF",
    "DataProviderID": 29,
    "DataProvidersReference": "10150",
    "OperatorID": 72,
    "AddressInfo": {
        "ID": 180048,
        "Title": "Propsteistraße 21",
        "AddressLine1": "Propsteistraße 21",
        "Town": "Overath",
        "Postcode": "51491",
        "CountryID": 87,
        "Latitude": 50.930353,
        "Longitude": 7.283992,
        "DistanceUnit": 0
    },
    "Connections": [
        {
            "ID": 281821,
            "ConnectionTypeID": 25,
            "StatusTypeID": 50,
            "LevelID": 2,
            "PowerKW": 22,
            "CurrentTypeID": 20
        },
        {
            "ID": 281822,
            "ConnectionTypeID": 25,
            "StatusTypeID": 50,
            "LevelID": 2,
            "PowerKW": 22,
            "CurrentTypeID": 20
        }
    ],
    "StatusTypeID": 50,
    "DateLastStatusUpdate": "2021-07-12T02:46:00Z",
    "MetadataValues": [
        {
            "ID": 11983,
            "MetadataFieldID": 4,
            "ItemValue": "Data from the German chargepoint registry provided by Bundesnetzagentur.de under the CC-BY 4.0 license"
        }
    ],
    "DataQualityLevel": 3,
    "DateCreated": "2021-07-08T09:59:00Z",
    "SubmissionStatusTypeID": 100
}