{
    "IsRecentlyVerified": false,
    "ID": 89729,
    "UUID": "533B409F-F468-46BC-9494-B6E5522728D0",
    "DataProviderID": 2,
    "DataProvidersReference": "82512",
    "OperatorID": 5,
    "UsageTypeID": 1,
    "AddressInfo": {
        "ID": 90075,
        "Title": "DOWNTOWN",
        "AddressLine1": "44 S Main St",
        "Town": "Ipswich",
        "StateOrProvince": "MA",
        "Postcode": "01938",
        "CountryID": 2,
        "Latitude": 42.6775409,
        "Longitude": -70.836843,
        "ContactTelephone1": "888-758-4389",
        "AccessComments": "24 hours daily",
        "RelatedURL": "http://www.chargepoint.com/",
        "DistanceUnit": 0
    },
    "Connections": [
        {
            "ID": 127164,
            "ConnectionTypeID": 1,
            "LevelID": 2,
            "Amps": 16,
            "Voltage": 230,
            "PowerKW": 3,
            "CurrentTypeID": 10,
            "Quantity": 2
        }
    ],
    "DateLastStatusUpdate": "2019-12-24T09:20:00Z",
    "DataQualityLevel": 3,
    "DateCreated": "2017-06-22T08:16:00Z",
    "SubmissionStatusTypeID": 100
}