{
    "IsRecentlyVerified": false,
    "ID": 130906,
    "UUID": "425130D9-B5EA-4E67-9A0D-8E8C02D56E9E",
    "DataProviderID": 1,
    "OperatorID": 3,
    "OperatorsReference": "PG-70034,PG-83508",
    "UsageTypeID": 4,
    "UsageCost": "Free",
    "AddressInfo": {
        "ID": 131252,
        "Title": "Tesco Extra - Waterloo Road",
        "AddressLine1": "A35",
        "AddressLine2": "Stanley Green",
        "Town": "Poole",
        "StateOrProvince": "Bournemouth, Christchurch and Poole",
        "Postcode": "BH17 7EJ",
        "CountryID": 1,
        "Latitude": 50.7401,
        "Longitude": -1.988875,
        "DistanceUnit": 0
    },
    "Connections": [
        {
            "ID": 183363,
            "ConnectionTypeID": 25,
            "StatusTypeID": 50,
            "LevelID": 2,
            "Amps": 32,
            "Voltage": 230,
            "PowerKW": 7,
            "CurrentTypeID": 10,
            "Quantity": 4
        }
    ],
    "NumberOfPoints": 4,
    "StatusTypeID": 50,
    "DateLastStatusUpdate": "2019-08-26T05:20:00Z",
    "DataQualityLevel": 1,
    "DateCreated": "2019-08-24T10:56:00Z",
    "SubmissionStatusTypeID": 200
}