{
    "IsRecentlyVerified": false,
    "ID": 176085,
    "UUID": "60DB78F3-E140-4AD0-9FC2-A2C13477A1BA",
    "DataProviderID": 1,
    "OperatorID": 3318,
    "UsageTypeID": 1,
    "UsageCost": "(1-90 kW) $0.16/minute, (1-350 kW) $0.32/minute",
    "AddressInfo": {
        "ID": 176444,
        "Title": "Sheetz",
        "AddressLine1": "1329 Freedom Rd",
        "Town": "Cranberry Twp",
        "StateOrProvince": "PA",
        "Postcode": "16066",
        "CountryID": 2,
        "Latitude": 40.686017333005964,
        "Longitude": -80.10606662585144,
        "ContactTelephone1": "+1 833-632-2778",
        "RelatedURL": "https://www.electrifyamerica.com/",
        "DistanceUnit": 0
    },
    "Connections": [
        {
            "ID": 273565,
            "ConnectionTypeID": 2,
            "StatusTypeID": 50,
            "LevelID": 3,
            "PowerKW": 50,
            "CurrentTypeID": 30,
            "Quantity": 1
        },
        {
            "ID": 273566,
            "ConnectionTypeID": 32,
            "StatusTypeID": 50,
            "LevelID": 3,
            "PowerKW": 150,
            "CurrentTypeID": 30,
            "Quantity": 2,
            "Comments": "One shared with a ChaDeMo"
        },
        {
            "ID": 273567,
            "ConnectionTypeID": 32,
            "StatusTypeID": 50,
            "LevelID": 3,
            "Amps": 350,
            "Voltage": 1000,
            "PowerKW": 350,
            "CurrentTypeID": 30,
            "Quantity": 2
        }
    ],
    "NumberOfPoints": 4,
    "StatusTypeID": 50,
    "DateLastStatusUpdate": "2021-06-28T08:05:00Z",
    "DataQualityLevel": 1,
    "DateCreated": "2021-06-24T16:45:00Z",
    "SubmissionStatusTypeID": 200
}