{
    "IsRecentlyVerified": false,
    "ID": 113064,
    "UUID": "3255E612-D4D3-4A73-9811-682D1EAA543B",
    "DataProviderID": 2,
    "DataProvidersReference": "104399",
    "OperatorID": 5,
    "UsageTypeID": 1,
    "AddressInfo": {
        "ID": 113410,
        "Title": "CITY OF DUBLIN",
        "AddressLine1": "11600 Shannon Ave",
        "Town": "Dublin",
        "StateOrProvince": "CA",
        "Postcode": "94568",
        "CountryID": 2,
        "Latitude": 37.7151447,
        "Longitude": -121.9410449,
        "ContactTelephone1": "888-758-4389",
        "AccessComments": "24 hours daily",
        "RelatedURL": "http://www.chargepoint.com/",
        "DistanceUnit": 0
    },
    "Connections": [
        {
            "ID": 159228,
            "ConnectionTypeID": 1,
            "LevelID": 2,
            "Amps": 16,
            "Voltage": 230,
            "PowerKW": 3,
            "CurrentTypeID": 10,
            "Quantity": 2
        }
    ],
    "DateLastStatusUpdate": "2019-04-06T04:02:00Z",
    "DataQualityLevel": 3,
    "DateCreated": "2018-11-28T02:04:00Z",
    "SubmissionStatusTypeID": 100
}