{
    "IsRecentlyVerified": false,
    "ID": 75251,
    "UUID": "F736AC9B-818B-4AE9-A567-F3E147DE8173",
    "DataProviderID": 1,
    "OperatorID": 23,
    "OperatorsReference": "17076",
    "UsageTypeID": 6,
    "UsageCost": "Free",
    "AddressInfo": {
        "ID": 75597,
        "Title": "Château de Chenonceau",
        "AddressLine1": "rue du Château",
        "Town": "Chenonceaux",
        "Postcode": "37150",
        "CountryID": 80,
        "Latitude": 47.329847,
        "Longitude": 1.066986,
        "ContactTelephone1": "+33 8 20 20 90 90",
        "DistanceUnit": 0
    },
    "Connections": [
        {
            "ID": 108556,
            "ConnectionTypeID": 30,
            "StatusTypeID": 50,
            "LevelID": 2,
            "Amps": 32,
            "Voltage": 400,
            "PowerKW": 22,
            "CurrentTypeID": 20,
            "Quantity": 2
        }
    ],
    "NumberOfPoints": 2,
    "GeneralComments": "2 Tesla Connector, up to 22kW.Available for patrons only. Self park.",
    "StatusTypeID": 50,
    "DateLastStatusUpdate": "2018-10-03T20:00:00Z",
    "DataQualityLevel": 1,
    "DateCreated": "2016-12-14T16:02:00Z",
    "SubmissionStatusTypeID": 200
}