{
    "IsRecentlyVerified": false,
    "ID": 107487,
    "UUID": "7D393694-05C6-48AA-86B0-EA7C63FF6631",
    "DataProviderID": 1,
    "OperatorID": 45,
    "UsageTypeID": 1,
    "UsageCost": "free",
    "AddressInfo": {
        "ID": 107833,
        "Title": "Székesfehérvár, Nissan Fehérvár",
        "AddressLine1": "Szent Flórián krt. 9.",
        "Town": "Székesfehérvár",
        "StateOrProvince": "Fejér megye",
        "Postcode": "8000",
        "CountryID": 104,
        "Latitude": 47.2105316,
        "Longitude": 18.42132570000001,
        "ContactTelephone1": "+36 22 510-072",
        "ContactEmail": "info@nissanfehervar.hu",
        "RelatedURL": "http://www.nissanfehervar.hu",
        "DistanceUnit": 0
    },
    "Connections": [
        {
            "ID": 151646,
            "ConnectionTypeID": 2,
            "StatusTypeID": 50,
            "LevelID": 3,
            "Amps": 100,
            "Voltage": 500,
            "PowerKW": 50,
            "CurrentTypeID": 30,
            "Quantity": 1
        }
    ],
    "NumberOfPoints": 1,
    "GeneralComments": "M-F: 8:00-17:00, Sat: 9:00-12:00 / H-P: 8-17, Sz:  9-12",
    "StatusTypeID": 50,
    "DateLastStatusUpdate": "2018-07-29T23:19:00Z",
    "DataQualityLevel": 1,
    "DateCreated": "2018-07-29T23:19:00Z",
    "SubmissionStatusTypeID": 200
}