{
    "IsRecentlyVerified": false,
    "ID": 159201,
    "UUID": "8CB49E12-83CC-4BAC-AFBC-500C91D202AB",
    "DataProviderID": 2,
    "DataProvidersReference": "155989",
    "OperatorID": 3372,
    "UsageTypeID": 2,
    "AddressInfo": {
        "ID": 159558,
        "Title": "Cherryland Elementary School",
        "AddressLine1": "456 Laurel Ave",
        "Town": "Hayward",
        "StateOrProvince": "CA",
        "Postcode": "94541",
        "CountryID": 2,
        "Latitude": 37.672234,
        "Longitude": -122.095172,
        "ContactTelephone1": "866-816-7584",
        "AccessComments": "24 hours daily\r\nPLANNED - not yet accessible (Public - Credit card at all times)",
        "RelatedURL": "http://evconnect.com/",
        "DistanceUnit": 0
    },
    "Connections": [
        {
            "ID": 229317,
            "ConnectionTypeID": 1,
            "LevelID": 2,
            "Amps": 16,
            "Voltage": 230,
            "PowerKW": 3.7,
            "CurrentTypeID": 10,
            "Quantity": 4
        }
    ],
    "GeneralComments": "Planned for future date. Not Operational.",
    "DatePlanned": "2020-06-27T00:00:00Z",
    "StatusTypeID": 150,
    "DateLastStatusUpdate": "2020-06-26T02:59:00Z",
    "DataQualityLevel": 3,
    "DateCreated": "2020-06-26T02:59:00Z",
    "SubmissionStatusTypeID": 100
}