{
    "IsRecentlyVerified": false,
    "ID": 65358,
    "UUID": "D1E08678-892B-491F-99A1-B0B81C2CDCBA",
    "DataProviderID": 1,
    "OperatorID": 156,
    "OperatorsReference": "NewMotion 03005228",
    "UsageTypeID": 4,
    "AddressInfo": {
        "ID": 65704,
        "Title": "Darmstädter Hof Centrum",
        "AddressLine1": "Fahrtgasse 18",
        "Town": "Heidelberg",
        "Postcode": "69117",
        "CountryID": 87,
        "Latitude": 49.4103327,
        "Longitude": 8.69417569999996,
        "AccessComments": "Rund um die Uhr (24/7) nutzbar. Position: Erdgeschoss, Parklätze 1011 und 1100\r\n",
        "DistanceUnit": 0
    },
    "Connections": [
        {
            "ID": 90051,
            "ConnectionTypeID": 25,
            "StatusTypeID": 50,
            "LevelID": 2,
            "Amps": 32,
            "Voltage": 400,
            "PowerKW": 22,
            "CurrentTypeID": 20,
            "Quantity": 2
        }
    ],
    "NumberOfPoints": 2,
    "StatusTypeID": 50,
    "DateLastStatusUpdate": "2016-07-06T14:57:00Z",
    "DataQualityLevel": 3,
    "DateCreated": "2016-04-27T09:41:00Z",
    "SubmissionStatusTypeID": 200
}