{
    "IsRecentlyVerified": false,
    "ID": 61494,
    "UUID": "74F60C82-1FA2-444B-A8BC-CEC70BC3CEFE",
    "DataProviderID": 1,
    "OperatorID": 98,
    "UsageTypeID": 4,
    "AddressInfo": {
        "ID": 61840,
        "Title": "Bahnhof",
        "AddressLine1": "Verladestraße",
        "AddressLine2": "Medingen",
        "Town": "Bad Bevensen",
        "StateOrProvince": "Samtgemeinde Bevensen-Ebstorf",
        "Postcode": "29549",
        "CountryID": 87,
        "Latitude": 53.0784403,
        "Longitude": 10.57330950000005,
        "ContactTelephone1": "05821 / 89 0",
        "ContactEmail": "verwaltung@bad-bevensen.de",
        "AccessComments": "Die Ladestation befindet sich in der Verladestraße (die Straße heißt so) auf dem Parkplatz. In der Lindenstraße 10 ist die Gemeindeverwaltung, der Ansprechpartner für die Box F-116.",
        "RelatedURL": "http://www.bad-bevensen.de",
        "DistanceUnit": 0
    },
    "Connections": [
        {
            "ID": 78351,
            "ConnectionTypeID": 16,
            "StatusTypeID": 50,
            "LevelID": 2,
            "Amps": 16,
            "Voltage": 230,
            "PowerKW": 3.7,
            "CurrentTypeID": 10,
            "Quantity": 1
        },
        {
            "ID": 78352,
            "ConnectionTypeID": 28,
            "StatusTypeID": 50,
            "LevelID": 2,
            "Amps": 16,
            "Voltage": 230,
            "PowerKW": 3.7,
            "CurrentTypeID": 10,
            "Quantity": 2
        }
    ],
    "NumberOfPoints": 2,
    "StatusTypeID": 50,
    "DateLastStatusUpdate": "2016-03-02T07:18:00Z",
    "DataQualityLevel": 1,
    "DateCreated": "2016-03-02T07:18:00Z",
    "SubmissionStatusTypeID": 200
}