{
    "IsRecentlyVerified": false,
    "ID": 28625,
    "UUID": "A985B720-D30F-43E6-9FDA-52EE5A8B3D49",
    "DataProviderID": 2,
    "DataProvidersReference": "55679",
    "OperatorID": 5,
    "UsageTypeID": 1,
    "AddressInfo": {
        "ID": 28971,
        "Title": "SPRINGBROOK",
        "AddressLine1": "2759 Forgue Drive",
        "Town": "Naperville",
        "StateOrProvince": "IL",
        "Postcode": "60564",
        "CountryID": 2,
        "Latitude": 41.714431,
        "Longitude": -88.2053583,
        "ContactTelephone1": "888-758-4389",
        "AccessComments": "24 hours daily",
        "RelatedURL": "http://www.chargepoint.com/",
        "DistanceUnit": 0
    },
    "Connections": [
        {
            "ID": 31448,
            "ConnectionTypeID": 1,
            "LevelID": 2,
            "Amps": 16,
            "Voltage": 230,
            "PowerKW": 3,
            "CurrentTypeID": 10,
            "Quantity": 2
        }
    ],
    "DateLastStatusUpdate": "2019-04-06T05:05:00Z",
    "DataQualityLevel": 3,
    "DateCreated": "2014-11-28T03:38:00Z",
    "SubmissionStatusTypeID": 100
}