{
    "IsRecentlyVerified": false,
    "ID": 136188,
    "UUID": "AC0CD03F-6435-4178-9756-EBE2F61E30DF",
    "DataProviderID": 18,
    "DataProvidersReference": "70fef3c029c29be2166dbdb2f5ff9464",
    "OperatorID": 2244,
    "UsageTypeID": 5,
    "AddressInfo": {
        "ID": 136534,
        "Title": "Decima Street",
        "AddressLine1": "Decima Street",
        "Town": "London",
        "Postcode": "SE1 4QQ",
        "CountryID": 1,
        "Latitude": 51.49742,
        "Longitude": -0.083497,
        "AccessComments": "",
        "RelatedURL": "https://www.ubitricity.com",
        "DistanceUnit": 0
    },
    "Connections": [
        {
            "ID": 190617,
            "ConnectionTypeID": 25,
            "Reference": "suby1100001296",
            "StatusTypeID": 50,
            "LevelID": 2,
            "Amps": 16,
            "Voltage": 230,
            "PowerKW": 3.7,
            "CurrentTypeID": 10
        }
    ],
    "StatusTypeID": 0,
    "DateLastStatusUpdate": "2021-04-25T05:46:00Z",
    "MetadataValues": [
        {
            "ID": 6040,
            "MetadataFieldID": 4,
            "ItemValue": "Contains public sector information licensed under the Open Government Licence v2.0. http://www.nationalarchives.gov.uk/doc/open-government-licence/version/2/"
        }
    ],
    "DataQualityLevel": 3,
    "DateCreated": "2019-12-24T05:22:00Z",
    "SubmissionStatusTypeID": 100
}