{
    "UserComments": [
        {
            "ID": 8170,
            "ChargePointID": 56180,
            "CommentTypeID": 10,
            "UserName": "spannermann",
            "Comment": "All good, use it fairly regularly.. Only problem recently is there's now quite a few leafs in town & often there's another one plugged in so have to wait if charge needed.. ",
            "Rating": 5,
            "DateCreated": "2015-12-09T00:51:11.683Z",
            "User": {
                "ID": 6682,
                "Username": "spannermann"
            },
            "CheckinStatusTypeID": 10
        }
    ],
    "IsRecentlyVerified": false,
    "ID": 56180,
    "UUID": "670E3A07-C6DE-4919-AD85-38CF5BCDBFE4",
    "DataProviderID": 1,
    "OperatorID": 7,
    "UsageTypeID": 7,
    "UsageCost": "Free",
    "AddressInfo": {
        "ID": 56526,
        "Title": "Glyn Hopkin Nissan",
        "AddressLine1": "Woburn Road",
        "AddressLine2": "Kempston",
        "Town": "Bedford",
        "Postcode": "MK42 7QN",
        "CountryID": 1,
        "Latitude": 52.1091277760111,
        "Longitude": -0.498805046081543,
        "ContactTelephone1": "01234847111",
        "AccessComments": "Intended for Nissan customers only. Suggest check ahead availability in advance. No RFID card required.",
        "DistanceUnit": 0
    },
    "Connections": [
        {
            "ID": 70787,
            "ConnectionTypeID": 2,
            "StatusTypeID": 50,
            "LevelID": 3,
            "Amps": 100,
            "Voltage": 500,
            "PowerKW": 50,
            "CurrentTypeID": 30,
            "Quantity": 1
        }
    ],
    "NumberOfPoints": 1,
    "GeneralComments": "Mon - Fri: 08:30 - 18:00, Sun: 10:00 - 17:00.",
    "StatusTypeID": 50,
    "DateLastStatusUpdate": "2020-01-09T16:18:00Z",
    "DataQualityLevel": 1,
    "DateCreated": "2015-10-19T12:32:00Z",
    "SubmissionStatusTypeID": 200
}