{
    "IsRecentlyVerified": false,
    "ID": 19159,
    "UUID": "CD8C33FC-0738-4113-BE9E-3EB7209C4C11",
    "DataProviderID": 1,
    "OperatorID": 93,
    "OperatorsReference": "SC34",
    "UsageTypeID": 1,
    "AddressInfo": {
        "ID": 19504,
        "Title": "The Diamond on-street",
        "AddressLine1": "The Diamond ",
        "Town": "Londonderry ",
        "StateOrProvince": "Northern Ireland",
        "Postcode": "BT48 6HN",
        "CountryID": 1,
        "Latitude": 54.99559,
        "Longitude": -7.32194,
        "DistanceUnit": 0
    },
    "Connections": [
        {
            "ID": 19430,
            "ConnectionTypeID": 25,
            "StatusTypeID": 100,
            "LevelID": 2,
            "Amps": 32,
            "Voltage": 400,
            "PowerKW": 22,
            "CurrentTypeID": 20,
            "Quantity": 2
        }
    ],
    "NumberOfPoints": 2,
    "GeneralComments": "ECar card needed.",
    "StatusTypeID": 100,
    "DateLastStatusUpdate": "2019-06-03T08:37:00Z",
    "DataQualityLevel": 1,
    "DateCreated": "2013-09-12T18:28:00Z",
    "SubmissionStatusTypeID": 200
}