{
    "IsRecentlyVerified": false,
    "ID": 178570,
    "UUID": "24061E4F-A776-44E1-B103-459FBFB27B54",
    "DataProviderID": 29,
    "DataProvidersReference": "7796",
    "OperatorID": 45,
    "AddressInfo": {
        "ID": 178929,
        "Title": "Hans-Böckler-Straße 19",
        "AddressLine1": "Hans-Böckler-Straße 19",
        "Town": "Dinslaken",
        "Postcode": "46535",
        "CountryID": 87,
        "Latitude": 51.560861,
        "Longitude": 6.741389,
        "DistanceUnit": 0
    },
    "Connections": [
        {
            "ID": 279152,
            "ConnectionTypeID": 33,
            "StatusTypeID": 50,
            "LevelID": 3,
            "PowerKW": 75,
            "CurrentTypeID": 30
        },
        {
            "ID": 279153,
            "ConnectionTypeID": 33,
            "StatusTypeID": 50,
            "LevelID": 3,
            "PowerKW": 75,
            "CurrentTypeID": 30
        },
        {
            "ID": 299653,
            "ConnectionTypeID": 25,
            "StatusTypeID": 50,
            "LevelID": 2,
            "PowerKW": 22,
            "CurrentTypeID": 20
        }
    ],
    "StatusTypeID": 0,
    "DateLastStatusUpdate": "2021-07-12T02:48:00Z",
    "MetadataValues": [
        {
            "ID": 10864,
            "MetadataFieldID": 4,
            "ItemValue": "Data from the German chargepoint registry provided by Bundesnetzagentur.de under the CC-BY 4.0 license"
        }
    ],
    "DataQualityLevel": 3,
    "DateCreated": "2021-07-08T09:50:00Z",
    "SubmissionStatusTypeID": 100
}