{
    "IsRecentlyVerified": false,
    "ID": 47650,
    "UUID": "FE4E9CF4-5D24-40FC-A232-0A0FD6CB8AA6",
    "DataProviderID": 1,
    "OperatorID": 3315,
    "OperatorsReference": "50775",
    "UsageTypeID": 6,
    "UsageCost": "free",
    "AddressInfo": {
        "ID": 47996,
        "Title": "Scotmid  co-operative",
        "AddressLine1": "2 Harvest Drive",
        "Town": "Newbridge",
        "Postcode": "EH28 8QJ",
        "CountryID": 1,
        "Latitude": 55.9358349763874,
        "Longitude": -3.39572504299167,
        "RelatedURL": "http://www.chargeyourcar.org.uk",
        "DistanceUnit": 0
    },
    "Connections": [
        {
            "ID": 58760,
            "ConnectionTypeID": 25,
            "StatusTypeID": 50,
            "LevelID": 2,
            "Amps": 32,
            "Voltage": 230,
            "PowerKW": 7,
            "CurrentTypeID": 10,
            "Quantity": 2
        }
    ],
    "NumberOfPoints": 2,
    "GeneralComments": "Workplace car park",
    "StatusTypeID": 50,
    "DateLastStatusUpdate": "2018-04-09T15:45:00Z",
    "MetadataValues": [
        {
            "ID": 1430,
            "MetadataFieldID": 4,
            "ItemValue": "Contains public sector information licensed under the Open Government Licence v2.0. http://www.nationalarchives.gov.uk/doc/open-government-licence/version/2/"
        }
    ],
    "DataQualityLevel": 3,
    "DateCreated": "2015-06-05T08:10:00Z",
    "SubmissionStatusTypeID": 100
}