{
    "IsRecentlyVerified": false,
    "ID": 52980,
    "UUID": "172D0EDC-A95D-4D52-A5E1-C03EC782F2F5",
    "DataProviderID": 1,
    "OperatorID": 196,
    "UsageTypeID": 4,
    "AddressInfo": {
        "ID": 53326,
        "Title": "Nomadpower - Toddington Moto M1 South",
        "AddressLine1": "M1",
        "Town": "Toddington",
        "StateOrProvince": "Central Bedfordshire",
        "Postcode": "LU5 6HR ",
        "CountryID": 1,
        "Latitude": 51.9474478658878,
        "Longitude": -0.503191591540491,
        "AccessComments": "6 CEE sockets for cooling trucks, but usable for EV charging as well.",
        "RelatedURL": "http://www.nomadpower.eu/de/chargepoints/31/connector/99",
        "DistanceUnit": 0
    },
    "Connections": [
        {
            "ID": 65990,
            "ConnectionTypeID": 17,
            "StatusTypeID": 50,
            "LevelID": 2,
            "Amps": 32,
            "Voltage": 400,
            "PowerKW": 22,
            "CurrentTypeID": 20,
            "Quantity": 6
        }
    ],
    "NumberOfPoints": 6,
    "StatusTypeID": 50,
    "DateLastStatusUpdate": "2015-09-17T14:27:00Z",
    "DataQualityLevel": 1,
    "DateCreated": "2015-09-16T05:11:00Z",
    "SubmissionStatusTypeID": 200
}