{
    "IsRecentlyVerified": false,
    "ID": 20298,
    "UUID": "99652A29-FF26-4077-BE49-746923D98890",
    "DataProviderID": 1,
    "OperatorID": 1,
    "UsageTypeID": 0,
    "UsageCost": "",
    "AddressInfo": {
        "ID": 20643,
        "Title": "Renault Istres",
        "AddressLine1": "Avenue Félix Gouin",
        "AddressLine2": "",
        "Town": "Istres",
        "StateOrProvince": "",
        "Postcode": "13800",
        "CountryID": 80,
        "Latitude": 43.50215,
        "Longitude": 4.98588,
        "ContactTelephone1": "",
        "ContactTelephone2": "",
        "ContactEmail": "",
        "AccessComments": "Réservé aux clients de l'établissement",
        "RelatedURL": "",
        "DistanceUnit": 0
    },
    "Connections": [],
    "GeneralComments": "",
    "StatusTypeID": 50,
    "DateLastStatusUpdate": "2013-11-11T17:01:00Z",
    "DataQualityLevel": 1,
    "DateCreated": "2013-11-11T14:23:00Z",
    "SubmissionStatusTypeID": 200
}