{
    "IsRecentlyVerified": false,
    "ID": 167853,
    "UUID": "829ABAD7-5650-497D-A06A-B353C3C8735B",
    "DataProviderID": 1,
    "OperatorID": 1,
    "UsageTypeID": 4,
    "AddressInfo": {
        "ID": 168212,
        "Title": "La Taverne de l'Arc",
        "AddressLine1": "Parc d'Activités Économiques Arc-Isère",
        "AddressLine2": "Aiton",
        "Town": "Chambéry",
        "Postcode": "73390",
        "CountryID": 80,
        "Latitude": 45.554671795394285,
        "Longitude": 6.254643993822697,
        "DistanceUnit": 0
    },
    "Connections": [
        {
            "ID": 254851,
            "ConnectionTypeID": 25,
            "StatusTypeID": 50,
            "LevelID": 2,
            "Amps": 32,
            "Voltage": 400,
            "PowerKW": 22,
            "CurrentTypeID": 10,
            "Quantity": 2
        },
        {
            "ID": 254894,
            "ConnectionTypeID": 28,
            "StatusTypeID": 50,
            "LevelID": 2,
            "Amps": 16,
            "Voltage": 230,
            "PowerKW": 3,
            "CurrentTypeID": 10,
            "Quantity": 2
        }
    ],
    "NumberOfPoints": 1,
    "StatusTypeID": 50,
    "DateLastStatusUpdate": "2020-09-16T07:26:00Z",
    "DataQualityLevel": 1,
    "DateCreated": "2020-09-15T09:29:00Z",
    "SubmissionStatusTypeID": 200
}