{
    "IsRecentlyVerified": false,
    "ID": 118684,
    "UUID": "11351404-49E6-4ACE-85CB-E2166293B48B",
    "DataProviderID": 1,
    "OperatorID": 22,
    "OperatorsReference": "C5QGX",
    "UsageTypeID": 4,
    "UsageCost": "Free",
    "AddressInfo": {
        "ID": 119030,
        "Title": "eCars, Gorey Services Station",
        "AddressLine1": "M11 Junction 22",
        "Town": "Gorey",
        "StateOrProvince": "County Wexford",
        "CountryID": 3,
        "Latitude": 52.750836801746,
        "Longitude": -6.20223490506589,
        "DistanceUnit": 0
    },
    "Connections": [
        {
            "ID": 167856,
            "ConnectionTypeID": 2,
            "StatusTypeID": 50,
            "LevelID": 3,
            "PowerKW": 50,
            "CurrentTypeID": 30,
            "Quantity": 1
        },
        {
            "ID": 167857,
            "ConnectionTypeID": 33,
            "StatusTypeID": 50,
            "LevelID": 3,
            "PowerKW": 50,
            "CurrentTypeID": 30,
            "Quantity": 1
        },
        {
            "ID": 167858,
            "ConnectionTypeID": 1036,
            "StatusTypeID": 100,
            "LevelID": 3,
            "PowerKW": 43,
            "CurrentTypeID": 20,
            "Quantity": 1
        }
    ],
    "NumberOfPoints": 1,
    "StatusTypeID": 50,
    "DateLastStatusUpdate": "2019-09-22T22:04:00Z",
    "DataQualityLevel": 1,
    "DateCreated": "2019-03-28T13:21:00Z",
    "SubmissionStatusTypeID": 200
}