{
    "IsRecentlyVerified": false,
    "ID": 61133,
    "UUID": "58EEFEB2-6A01-4144-B3D4-B411C4789AE4",
    "DataProviderID": 27,
    "DataProvidersReference": "170",
    "UsageTypeID": 1,
    "AddressInfo": {
        "ID": 61479,
        "Title": "Via pública",
        "AddressLine1": "Av de San Ignacio, 8",
        "Town": "Pamplona",
        "StateOrProvince": "Pamplona",
        "Postcode": "31002",
        "CountryID": 210,
        "Latitude": 42.814634,
        "Longitude": -1.643232,
        "ContactTelephone1": "+34 948 420 991",
        "ContactEmail": "recargaverde@iberdrola.es",
        "RelatedURL": "https://sedeelectronica.pamplona.es...",
        "DistanceUnit": 0
    },
    "Connections": [
        {
            "ID": 77772,
            "ConnectionTypeID": 28,
            "LevelID": 1,
            "Amps": 10,
            "Voltage": 230,
            "PowerKW": 2.3
        },
        {
            "ID": 77773,
            "ConnectionTypeID": 25,
            "LevelID": 2,
            "Amps": 16,
            "Voltage": 230,
            "PowerKW": 3.7
        }
    ],
    "GeneralComments": "Tarjeta Iberdrola",
    "StatusTypeID": 50,
    "DateLastStatusUpdate": "2016-02-13T00:24:00Z",
    "DataQualityLevel": 3,
    "DateCreated": "2016-02-13T00:24:00Z",
    "SubmissionStatusTypeID": 200
}