{
    "IsRecentlyVerified": false,
    "ID": 32892,
    "UUID": "363E5B06-B9F2-48C3-92CC-037AEC8F66B3",
    "DataProviderID": 26,
    "DataProvidersReference": "45466",
    "OperatorID": 157,
    "OperatorsReference": "NewMotion 02004415",
    "UsageCost": "0.00 jaarabonnement",
    "AddressInfo": {
        "ID": 33238,
        "Title": "Waterbeemd 7",
        "AddressLine1": "Waterbeemd 7",
        "Town": "Helmond",
        "Postcode": "5705 DN",
        "CountryID": 159,
        "Latitude": 51.4560317993164,
        "Longitude": 5.68724298477173,
        "ContactTelephone1": "088 0109500",
        "RelatedURL": "http://thenewmotion.nl/",
        "DistanceUnit": 0
    },
    "Connections": [
        {
            "ID": 36403,
            "ConnectionTypeID": 25,
            "LevelID": 2,
            "PowerKW": 3.7,
            "CurrentTypeID": 10
        }
    ],
    "NumberOfPoints": 1,
    "StatusTypeID": 50,
    "DateLastStatusUpdate": "2016-06-04T02:39:00Z",
    "DataQualityLevel": 3,
    "DateCreated": "2015-01-09T06:03:00Z",
    "SubmissionStatusTypeID": 100
}