{
    "IsRecentlyVerified": false,
    "ID": 123054,
    "UUID": "C918D7FB-84D9-420D-91F8-43057D03362F",
    "DataProviderID": 2,
    "DataProvidersReference": "100415",
    "OperatorID": 5,
    "UsageTypeID": 1,
    "AddressInfo": {
        "ID": 123400,
        "Title": "BUILDINGB1",
        "AddressLine1": "800 Beaty St",
        "Town": "Davidson",
        "StateOrProvince": "NC",
        "Postcode": "28036",
        "CountryID": 2,
        "Latitude": 35.5116916,
        "Longitude": -80.8514294,
        "ContactTelephone1": "888-758-4389",
        "AccessComments": "24 hours daily",
        "RelatedURL": "http://www.chargepoint.com/",
        "DistanceUnit": 0
    },
    "Connections": [
        {
            "ID": 172990,
            "ConnectionTypeID": 1,
            "LevelID": 2,
            "Amps": 16,
            "Voltage": 230,
            "PowerKW": 3.7,
            "CurrentTypeID": 10,
            "Quantity": 2
        }
    ],
    "DateLastStatusUpdate": "2020-06-26T02:58:00Z",
    "DataQualityLevel": 3,
    "DateCreated": "2019-04-06T05:03:00Z",
    "SubmissionStatusTypeID": 100
}