{
    "IsRecentlyVerified": false,
    "ID": 45838,
    "UUID": "8D90D69F-316F-460B-ABA2-A1A6DBF9F5E6",
    "DataProviderID": 1,
    "DataProvidersReference": "2390",
    "AddressInfo": {
        "ID": 46184,
        "Title": "Din Bil Södertälje",
        "AddressLine1": "Forskargatan 13",
        "Town": "SÖDERTÄLJE",
        "StateOrProvince": "STOCKHOLM",
        "Postcode": "15136",
        "CountryID": 216,
        "Latitude": 59.20316,
        "Longitude": 17.6144,
        "AccessComments": "Laddstationerna finns utanför entrén till anläggningen.",
        "DistanceUnit": 0
    },
    "Connections": [
        {
            "ID": 56501,
            "ConnectionTypeID": 0,
            "Reference": "1",
            "LevelID": 2,
            "Amps": 50,
            "Voltage": 500,
            "PowerKW": 20,
            "Comments": "Mode 4"
        },
        {
            "ID": 84397,
            "ConnectionTypeID": 0,
            "Reference": "2",
            "LevelID": 2,
            "Amps": 32,
            "Voltage": 230,
            "PowerKW": 7.4,
            "Comments": "Mode 3"
        },
        {
            "ID": 84398,
            "ConnectionTypeID": 0,
            "Reference": "3",
            "LevelID": 2,
            "Amps": 16,
            "Voltage": 230,
            "PowerKW": 3.7,
            "Comments": "Mode 3"
        },
        {
            "ID": 88129,
            "ConnectionTypeID": 0,
            "Reference": "4",
            "LevelID": 2,
            "Amps": 16,
            "Voltage": 230,
            "PowerKW": 3.7,
            "Comments": "Mode 3"
        }
    ],
    "NumberOfPoints": 4,
    "DateLastStatusUpdate": "2020-05-26T08:22:00Z",
    "DataQualityLevel": 2,
    "DateCreated": "2015-05-03T00:54:00Z",
    "SubmissionStatusTypeID": 100
}