{
    "IsRecentlyVerified": false,
    "ID": 141925,
    "UUID": "73B08430-5B0F-439B-8D20-BC9A8E6DAFF2",
    "DataProviderID": 2,
    "DataProvidersReference": "96201",
    "OperatorID": 9,
    "UsageTypeID": 1,
    "AddressInfo": {
        "ID": 142277,
        "Title": "Camden County College - Blackwood Campus Science Bldg.",
        "AddressLine1": "200 College Drive",
        "Town": "Blackwood",
        "StateOrProvince": "NJ",
        "Postcode": "08012",
        "CountryID": 2,
        "Latitude": 39.784055,
        "Longitude": -75.039348,
        "ContactTelephone1": "888-998-2546",
        "AccessComments": "MON: 24 hours | TUE: 24 hours | WED: 24 hours | THU: 24 hours | FRI: 24 hours | SAT: 24 hours | SUN: 24 hours",
        "RelatedURL": "http://www.blinkcharging.com/",
        "DistanceUnit": 0
    },
    "Connections": [
        {
            "ID": 197965,
            "ConnectionTypeID": 1,
            "LevelID": 2,
            "Amps": 16,
            "Voltage": 230,
            "PowerKW": 3.7,
            "CurrentTypeID": 10,
            "Quantity": 1
        }
    ],
    "StatusTypeID": 50,
    "DateLastStatusUpdate": "2020-06-26T03:02:00Z",
    "DataQualityLevel": 3,
    "DateCreated": "2019-12-24T09:16:00Z",
    "SubmissionStatusTypeID": 100
}