{
    "IsRecentlyVerified": false,
    "ID": 95228,
    "UUID": "ACCBC31A-3A6C-4073-8BC1-38109F6BFD23",
    "DataProviderID": 1,
    "OperatorID": 23,
    "OperatorsReference": "37267",
    "UsageTypeID": 4,
    "AddressInfo": {
        "ID": 95574,
        "Title": "Cleydael Golf & Country Club",
        "AddressLine1": "Cleydaellaan 36",
        "Town": "Aartselaar",
        "Postcode": "2630",
        "CountryID": 26,
        "Latitude": 51.139081,
        "Longitude": 4.365273,
        "ContactTelephone1": "+32 3887 0079",
        "DistanceUnit": 0
    },
    "Connections": [
        {
            "ID": 134896,
            "ConnectionTypeID": 30,
            "StatusTypeID": 50,
            "LevelID": 2,
            "Amps": 16,
            "Voltage": 400,
            "PowerKW": 11,
            "CurrentTypeID": 20,
            "Quantity": 2
        }
    ],
    "NumberOfPoints": 2,
    "GeneralComments": "2 Tesla Connectors, up to 11kW.Available to the public. Self park.",
    "StatusTypeID": 50,
    "DateLastStatusUpdate": "2018-10-03T16:47:00Z",
    "DataQualityLevel": 1,
    "DateCreated": "2017-11-05T06:59:00Z",
    "SubmissionStatusTypeID": 200
}