{
    "IsRecentlyVerified": false,
    "ID": 71714,
    "UUID": "60F69240-F8E2-4A19-BEF8-A318F242E19B",
    "DataProviderID": 1,
    "OperatorID": 156,
    "UsageTypeID": 4,
    "AddressInfo": {
        "ID": 72060,
        "Title": "Kreishaus",
        "AddressLine1": "Friedrich-Ebert-Straße 7",
        "Town": "Coesfeld",
        "StateOrProvince": "Kreis Coesfeld",
        "Postcode": "48653",
        "CountryID": 87,
        "Latitude": 51.94421,
        "Longitude": 7.1743999999999915,
        "AccessComments": "24/7 nutzbar.",
        "DistanceUnit": 0
    },
    "Connections": [
        {
            "ID": 102716,
            "ConnectionTypeID": 25,
            "StatusTypeID": 50,
            "LevelID": 2,
            "Amps": 32,
            "Voltage": 400,
            "PowerKW": 22,
            "CurrentTypeID": 20,
            "Quantity": 2
        }
    ],
    "NumberOfPoints": 2,
    "GeneralComments": "Eintrag lt. The New Motion Verzeichnis",
    "StatusTypeID": 50,
    "DateLastStatusUpdate": "2016-09-05T07:11:00Z",
    "DataQualityLevel": 1,
    "DateCreated": "2016-09-05T07:11:00Z",
    "SubmissionStatusTypeID": 200
}