{
    "IsRecentlyVerified": false,
    "ID": 179734,
    "UUID": "AA9CFE5D-4B2E-4A39-982C-89F78ABEDC27",
    "DataProviderID": 29,
    "DataProvidersReference": "7865",
    "OperatorID": 45,
    "AddressInfo": {
        "ID": 180093,
        "Title": "Banderbacher Straße 27",
        "AddressLine1": "Banderbacher Straße 27",
        "Town": "Zirndorf",
        "Postcode": "90513",
        "CountryID": 87,
        "Latitude": 49.442339,
        "Longitude": 10.949842,
        "DistanceUnit": 0
    },
    "Connections": [
        {
            "ID": 281934,
            "ConnectionTypeID": 25,
            "StatusTypeID": 50,
            "LevelID": 2,
            "PowerKW": 22,
            "CurrentTypeID": 20
        },
        {
            "ID": 281935,
            "ConnectionTypeID": 25,
            "StatusTypeID": 50,
            "LevelID": 2,
            "PowerKW": 22,
            "CurrentTypeID": 20
        }
    ],
    "StatusTypeID": 50,
    "DateLastStatusUpdate": "2021-07-09T03:16:00Z",
    "MetadataValues": [
        {
            "ID": 12028,
            "MetadataFieldID": 4,
            "ItemValue": "Data from the German chargepoint registry provided by Bundesnetzagentur.de under the CC-BY 4.0 license"
        }
    ],
    "DataQualityLevel": 3,
    "DateCreated": "2021-07-08T09:59:00Z",
    "SubmissionStatusTypeID": 100
}