{
    "IsRecentlyVerified": false,
    "ID": 37245,
    "UUID": "DAF9961C-18C0-4274-AA43-7F4C532577B4",
    "DataProviderID": 26,
    "DataProvidersReference": "55271",
    "OperatorID": 157,
    "OperatorsReference": "NewMotion 01001023",
    "UsageCost": "0.00 jaarabonnement",
    "AddressInfo": {
        "ID": 37591,
        "Title": "Barbara Strozzilaan 388",
        "AddressLine1": "Barbara Strozzilaan 388",
        "Town": "Amsterdam",
        "Postcode": "1083 HN",
        "CountryID": 159,
        "Latitude": 52.3357391357422,
        "Longitude": 4.88891172409058,
        "ContactTelephone1": "088 0109500",
        "RelatedURL": "http://thenewmotion.nl/",
        "DistanceUnit": 0
    },
    "Connections": [
        {
            "ID": 40756,
            "ConnectionTypeID": 25,
            "LevelID": 2,
            "PowerKW": 3.7,
            "CurrentTypeID": 10
        }
    ],
    "NumberOfPoints": 1,
    "StatusTypeID": 50,
    "DateLastStatusUpdate": "2016-06-04T02:53:00Z",
    "DataQualityLevel": 3,
    "DateCreated": "2015-01-09T06:07:00Z",
    "SubmissionStatusTypeID": 100
}