{
    "IsRecentlyVerified": false,
    "ID": 182926,
    "UUID": "FBADA636-760E-4E12-BD70-63DC93F45C98",
    "DataProviderID": 29,
    "DataProvidersReference": "11886",
    "AddressInfo": {
        "ID": 183285,
        "Title": "Sophienstraße 52-54",
        "AddressLine1": "Sophienstraße 52-54",
        "Town": "Wetzlar",
        "Postcode": "35576",
        "CountryID": 87,
        "Latitude": 50.56274,
        "Longitude": 8.49538000000006,
        "DistanceUnit": 0
    },
    "Connections": [
        {
            "ID": 289275,
            "ConnectionTypeID": 28,
            "StatusTypeID": 50,
            "LevelID": 2,
            "PowerKW": 3.7,
            "CurrentTypeID": 10
        },
        {
            "ID": 289276,
            "ConnectionTypeID": 25,
            "StatusTypeID": 50,
            "LevelID": 2,
            "PowerKW": 3.7,
            "CurrentTypeID": 10
        },
        {
            "ID": 297911,
            "ConnectionTypeID": 1036,
            "StatusTypeID": 50,
            "LevelID": 2,
            "PowerKW": 3.7,
            "CurrentTypeID": 10
        },
        {
            "ID": 297912,
            "ConnectionTypeID": 25,
            "StatusTypeID": 50,
            "LevelID": 2,
            "PowerKW": 3.7,
            "CurrentTypeID": 10
        },
        {
            "ID": 297913,
            "ConnectionTypeID": 1036,
            "StatusTypeID": 50,
            "LevelID": 2,
            "PowerKW": 3.7,
            "CurrentTypeID": 10
        }
    ],
    "StatusTypeID": 50,
    "DateLastStatusUpdate": "2021-07-12T02:45:00Z",
    "MetadataValues": [
        {
            "ID": 15219,
            "MetadataFieldID": 4,
            "ItemValue": "Data from the German chargepoint registry provided by Bundesnetzagentur.de under the CC-BY 4.0 license"
        }
    ],
    "DataQualityLevel": 3,
    "DateCreated": "2021-07-08T10:03:00Z",
    "SubmissionStatusTypeID": 100
}