{
    "IsRecentlyVerified": false,
    "ID": 157442,
    "UUID": "685D505D-BFC6-4069-B0B5-3A462399F72E",
    "DataProviderID": 1,
    "OperatorID": 3377,
    "UsageTypeID": 1,
    "UsageCost": "0",
    "AddressInfo": {
        "ID": 157796,
        "Title": "La pobla de Mafumet",
        "AddressLine1": "Avinguda de la Generalitat 22",
        "Town": "La Pobla de Mafumet",
        "StateOrProvince": "Tarragona",
        "Postcode": "43140",
        "CountryID": 210,
        "Latitude": 41.186842,
        "Longitude": 1.208789,
        "DistanceUnit": 0
    },
    "Connections": [
        {
            "ID": 226788,
            "ConnectionTypeID": 33,
            "StatusTypeID": 50,
            "LevelID": 3,
            "PowerKW": 50,
            "CurrentTypeID": 30,
            "Quantity": 1
        },
        {
            "ID": 226789,
            "ConnectionTypeID": 2,
            "StatusTypeID": 50,
            "LevelID": 3,
            "PowerKW": 50,
            "CurrentTypeID": 30,
            "Quantity": 1
        },
        {
            "ID": 226790,
            "ConnectionTypeID": 1036,
            "StatusTypeID": 50,
            "LevelID": 3,
            "PowerKW": 43,
            "CurrentTypeID": 20,
            "Quantity": 1
        }
    ],
    "NumberOfPoints": 1,
    "GeneralComments": "Electrompas token (Llavero electromaps) / App EVCharge",
    "StatusTypeID": 50,
    "DateLastStatusUpdate": "2021-04-12T11:29:00Z",
    "DataQualityLevel": 1,
    "DateCreated": "2020-06-06T09:19:00Z",
    "SubmissionStatusTypeID": 200
}