{
    "IsRecentlyVerified": false,
    "ID": 43173,
    "UUID": "9A95CA85-D5FB-4DB8-8340-26E4D534F7B0",
    "DataProviderID": 1,
    "DataProvidersReference": "2625",
    "AddressInfo": {
        "ID": 43519,
        "Title": "Ål",
        "AddressLine1": "Sundrejordet 2",
        "Town": "ÅL",
        "StateOrProvince": "Viken",
        "Postcode": "3570",
        "CountryID": 168,
        "Latitude": 60.62883,
        "Longitude": 8.56061,
        "AccessComments": "",
        "DistanceUnit": 0
    },
    "Connections": [
        {
            "ID": 52341,
            "ConnectionTypeID": 0,
            "Reference": "1",
            "LevelID": 2,
            "Amps": 100,
            "Voltage": 500,
            "PowerKW": 50,
            "Comments": "Mode 4"
        },
        {
            "ID": 87021,
            "ConnectionTypeID": 0,
            "Reference": "2",
            "LevelID": 2,
            "Amps": 100,
            "Voltage": 500,
            "PowerKW": 50,
            "Comments": "Mode 4"
        },
        {
            "ID": 87022,
            "ConnectionTypeID": 0,
            "Reference": "3",
            "LevelID": 2,
            "Amps": 32,
            "Voltage": 400,
            "PowerKW": 22,
            "Comments": "Mode 3"
        },
        {
            "ID": 89098,
            "ConnectionTypeID": 0,
            "Reference": "4",
            "LevelID": 2,
            "Amps": 32,
            "Voltage": 400,
            "PowerKW": 22,
            "Comments": "Mode 3"
        }
    ],
    "NumberOfPoints": 4,
    "DateLastStatusUpdate": "2020-05-26T08:24:00Z",
    "DataQualityLevel": 2,
    "DateCreated": "2015-03-25T04:33:00Z",
    "SubmissionStatusTypeID": 100
}