{
    "IsRecentlyVerified": false,
    "ID": 120973,
    "UUID": "DD338118-E315-4C24-96BE-DFFF41B81321",
    "DataProviderID": 2,
    "DataProvidersReference": "39917",
    "UsageTypeID": 7,
    "AddressInfo": {
        "ID": 121319,
        "Title": "Stadium Nissan",
        "AddressLine1": "1140 W Katella Ave",
        "Town": "Orange",
        "StateOrProvince": "CA",
        "Postcode": "92867",
        "CountryID": 2,
        "Latitude": 33.80857,
        "Longitude": -117.864434,
        "ContactTelephone1": "714-633-8430",
        "AccessComments": "Dealership business hours\r\nPublic - Call ahead",
        "RelatedURL": "",
        "DistanceUnit": 0
    },
    "Connections": [
        {
            "ID": 170381,
            "ConnectionTypeID": 1,
            "LevelID": 2,
            "Amps": 16,
            "Voltage": 230,
            "PowerKW": 3.7,
            "CurrentTypeID": 10,
            "Quantity": 2
        },
        {
            "ID": 170382,
            "ConnectionTypeID": 2,
            "LevelID": 3,
            "Amps": 100,
            "Voltage": 400,
            "PowerKW": 40,
            "CurrentTypeID": 30,
            "Quantity": 1
        }
    ],
    "DateLastStatusUpdate": "2020-06-26T02:56:00Z",
    "DataQualityLevel": 3,
    "DateCreated": "2019-04-01T04:59:00Z",
    "SubmissionStatusTypeID": 100
}