{
    "IsRecentlyVerified": false,
    "ID": 134234,
    "UUID": "8508EBDA-210A-4D0B-9F8F-E85ECE4907F9",
    "DataProviderID": 1,
    "OperatorID": 80,
    "UsageTypeID": 4,
    "AddressInfo": {
        "ID": 134580,
        "Title": "Marrubiu Mandrolisai | EnelX",
        "AddressLine1": "Via Mandrolisai",
        "Town": "Marrubiu",
        "StateOrProvince": "OR",
        "Postcode": "09094",
        "CountryID": 112,
        "Latitude": 39.74870436025401,
        "Longitude": 8.628134729412295,
        "RelatedURL": "https://www.enelx.com/it/it/emobility",
        "DistanceUnit": 0
    },
    "Connections": [
        {
            "ID": 187819,
            "ConnectionTypeID": 25,
            "StatusTypeID": 50,
            "LevelID": 2,
            "Amps": 32,
            "Voltage": 400,
            "PowerKW": 22,
            "CurrentTypeID": 20,
            "Quantity": 2
        },
        {
            "ID": 259763,
            "ConnectionTypeID": 25,
            "StatusTypeID": 50,
            "LevelID": 2,
            "Amps": 32,
            "Voltage": 400,
            "PowerKW": 22,
            "CurrentTypeID": 20,
            "Quantity": 2
        }
    ],
    "NumberOfPoints": 4,
    "StatusTypeID": 50,
    "DateLastStatusUpdate": "2020-11-23T16:37:00Z",
    "DataQualityLevel": 1,
    "DateCreated": "2019-11-04T16:21:00Z",
    "SubmissionStatusTypeID": 200
}