{
    "IsRecentlyVerified": false,
    "ID": 74312,
    "UUID": "5BFAF750-1601-4DB3-8646-FC0E2EDA7D2E",
    "DataProviderID": 1,
    "OperatorID": 45,
    "UsageTypeID": 1,
    "AddressInfo": {
        "ID": 74658,
        "Title": "Autohaus Abicht",
        "AddressLine1": "Am Euzenberg 1",
        "Town": "Duderstadt",
        "StateOrProvince": "Landkreis Göttingen",
        "Postcode": "37115",
        "CountryID": 87,
        "Latitude": 51.512075050579895,
        "Longitude": 10.243461250505428,
        "AccessComments": "24/7 aufladen am VW / Hyundai Autohaus.",
        "DistanceUnit": 0
    },
    "Connections": [
        {
            "ID": 106864,
            "ConnectionTypeID": 1036,
            "StatusTypeID": 50,
            "LevelID": 2,
            "Amps": 16,
            "Voltage": 230,
            "PowerKW": 3.7,
            "CurrentTypeID": 10,
            "Quantity": 2
        }
    ],
    "NumberOfPoints": 2,
    "StatusTypeID": 50,
    "DateLastStatusUpdate": "2016-11-30T08:30:00Z",
    "DataQualityLevel": 1,
    "DateCreated": "2016-11-30T08:30:00Z",
    "SubmissionStatusTypeID": 200
}