{
    "IsRecentlyVerified": false,
    "ID": 155762,
    "UUID": "2F759FE8-972C-4E38-B3CC-05B1FA5CC63E",
    "DataProviderID": 1,
    "OperatorID": 80,
    "UsageTypeID": 4,
    "AddressInfo": {
        "ID": 156116,
        "Title": "SASSUOLO Parcheggio Legnago | ENELX",
        "AddressLine1": "Viale Legnago",
        "Town": "Sassuolo",
        "StateOrProvince": "MO",
        "Postcode": "41049",
        "CountryID": 112,
        "Latitude": 44.54228409629053,
        "Longitude": 10.777825890466147,
        "RelatedURL": "https://www.enelx.com/it/it/emobility",
        "DistanceUnit": 0
    },
    "Connections": [
        {
            "ID": 219326,
            "ConnectionTypeID": 25,
            "StatusTypeID": 150,
            "LevelID": 2,
            "Amps": 32,
            "Voltage": 400,
            "PowerKW": 22,
            "CurrentTypeID": 20,
            "Quantity": 2
        }
    ],
    "NumberOfPoints": 2,
    "StatusTypeID": 150,
    "DateLastStatusUpdate": "2020-04-23T15:38:00Z",
    "DataQualityLevel": 1,
    "DateCreated": "2020-04-23T15:38:00Z",
    "SubmissionStatusTypeID": 200
}