{
    "IsRecentlyVerified": false,
    "ID": 121910,
    "UUID": "13098B36-45B0-4ADF-87EA-199A434F80D0",
    "DataProviderID": 2,
    "DataProvidersReference": "104036",
    "OperatorID": 5,
    "UsageTypeID": 1,
    "AddressInfo": {
        "ID": 122256,
        "Title": "LBX",
        "AddressLine1": "3881 N Lakewood Blvd",
        "Town": "Long Beach",
        "StateOrProvince": "CA",
        "Postcode": "90846",
        "CountryID": 2,
        "Latitude": 33.829075,
        "Longitude": -118.142861,
        "ContactTelephone1": "888-758-4389",
        "AccessComments": "24 hours daily",
        "RelatedURL": "http://www.chargepoint.com/",
        "DistanceUnit": 0
    },
    "Connections": [
        {
            "ID": 171750,
            "ConnectionTypeID": 1,
            "LevelID": 2,
            "Amps": 16,
            "Voltage": 230,
            "PowerKW": 3,
            "CurrentTypeID": 10,
            "Quantity": 8
        }
    ],
    "DateLastStatusUpdate": "2019-12-24T09:10:00Z",
    "DataQualityLevel": 3,
    "DateCreated": "2019-04-06T05:02:00Z",
    "SubmissionStatusTypeID": 100
}