{
    "IsRecentlyVerified": false,
    "ID": 87893,
    "UUID": "AAE6350C-7C49-4F9C-AC32-4BDED857B219",
    "DataProviderID": 1,
    "OperatorID": 3,
    "OperatorsReference": "PG-80873",
    "UsageTypeID": 6,
    "UsageCost": "Free",
    "AddressInfo": {
        "ID": 88239,
        "Title": "Sast House",
        "AddressLine1": "Dawes Street",
        "Town": "London",
        "Postcode": "SE17 1EL",
        "CountryID": 1,
        "Latitude": 51.490004,
        "Longitude": -0.088931,
        "DistanceUnit": 0
    },
    "Connections": [
        {
            "ID": 124702,
            "ConnectionTypeID": 25,
            "StatusTypeID": 50,
            "LevelID": 2,
            "Amps": 32,
            "Voltage": 230,
            "PowerKW": 7,
            "CurrentTypeID": 10,
            "Quantity": 2
        }
    ],
    "NumberOfPoints": 2,
    "GeneralComments": "This is an open charge unit installed at SAST House in Dawes Street, London",
    "StatusTypeID": 50,
    "DateLastStatusUpdate": "2018-02-24T06:30:00Z",
    "DataQualityLevel": 1,
    "DateCreated": "2017-05-18T05:28:00Z",
    "SubmissionStatusTypeID": 200
}