{
    "IsRecentlyVerified": false,
    "ID": 77575,
    "UUID": "E940B834-5459-4AB0-B07F-A73E10AB8467",
    "DataProviderID": 1,
    "OperatorID": 3266,
    "UsageTypeID": 4,
    "AddressInfo": {
        "ID": 77921,
        "Title": "Sparkasse Minden-Lübbecke",
        "AddressLine1": "Sparkassenstraße 4",
        "Town": "Petershagen",
        "StateOrProvince": "Kreis Minden-Lübbecke",
        "Postcode": "32469",
        "CountryID": 87,
        "Latitude": 52.3765277640126,
        "Longitude": 8.96574410919264,
        "AccessComments": "24/7 nutzbare türkisfarbener Ladeschrank auf dem Parkplatz der Sparkasse, ausschließlich mit PlugSurfing App freischaltbar!",
        "RelatedURL": "http://www.mt.de/lokales/petershagen/21547674_Erste-Ladesaeule-fuer-E-Autos-in-Petershagen.html",
        "DistanceUnit": 0
    },
    "Connections": [
        {
            "ID": 112054,
            "ConnectionTypeID": 25,
            "StatusTypeID": 50,
            "LevelID": 2,
            "Amps": 32,
            "Voltage": 400,
            "PowerKW": 22,
            "CurrentTypeID": 20,
            "Quantity": 2
        }
    ],
    "NumberOfPoints": 2,
    "StatusTypeID": 50,
    "DateLastStatusUpdate": "2017-03-28T08:30:00Z",
    "DataQualityLevel": 1,
    "DateCreated": "2017-01-19T07:18:00Z",
    "SubmissionStatusTypeID": 200
}