{
    "IsRecentlyVerified": false,
    "ID": 84168,
    "UUID": "080D5D1C-F243-4D78-A085-FABCED616C59",
    "DataProviderID": 1,
    "OperatorID": 23,
    "OperatorsReference": "24608",
    "UsageTypeID": 4,
    "AddressInfo": {
        "ID": 84514,
        "Title": "Fiesta Inn Playa del Carmen",
        "AddressLine1": "10 Avenida Norte 325 Gonzalo Guerrero",
        "Town": "Playa del Carmen",
        "StateOrProvince": "Quintana Roo",
        "Postcode": "77710",
        "CountryID": 146,
        "Latitude": 20.632837,
        "Longitude": -87.069504,
        "ContactTelephone1": "+52 984 206 5200",
        "DistanceUnit": 0
    },
    "Connections": [
        {
            "ID": 119569,
            "ConnectionTypeID": 30,
            "StatusTypeID": 50,
            "LevelID": 2,
            "PowerKW": 18,
            "CurrentTypeID": 20,
            "Quantity": 2
        }
    ],
    "NumberOfPoints": 2,
    "GeneralComments": "2 Tesla Connectors, up to 18kW.Available for customers. Please see front desk.",
    "StatusTypeID": 50,
    "DateLastStatusUpdate": "2017-02-16T17:05:00Z",
    "DataQualityLevel": 1,
    "DateCreated": "2017-02-16T17:05:00Z",
    "SubmissionStatusTypeID": 200
}