{
    "IsRecentlyVerified": false,
    "ID": 116401,
    "UUID": "52B7DB1E-326A-484C-987A-2D914DAFC0B2",
    "DataProviderID": 1,
    "DataProvidersReference": "5376",
    "AddressInfo": {
        "ID": 116747,
        "Title": "Tuna Park Eskilstuna",
        "AddressLine1": "Gunborg Nymans Väg ",
        "Town": "ESKILSTUNA",
        "StateOrProvince": "SÖDERMANLAND",
        "Postcode": "63222",
        "CountryID": 216,
        "Latitude": 59.37147,
        "Longitude": 16.47016,
        "AccessComments": "Tuna Park Eskilstuna.",
        "DistanceUnit": 0
    },
    "Connections": [
        {
            "ID": 164224,
            "ConnectionTypeID": 0,
            "Reference": "1",
            "LevelID": 2,
            "Amps": 32,
            "Voltage": 400,
            "PowerKW": 22,
            "Comments": "Mode 3"
        },
        {
            "ID": 164225,
            "ConnectionTypeID": 0,
            "Reference": "2",
            "LevelID": 2,
            "Amps": 32,
            "Voltage": 400,
            "PowerKW": 22,
            "Comments": "Mode 3"
        },
        {
            "ID": 164226,
            "ConnectionTypeID": 0,
            "Reference": "3",
            "LevelID": 2,
            "Amps": 32,
            "Voltage": 400,
            "PowerKW": 22,
            "Comments": "Mode 3"
        },
        {
            "ID": 164227,
            "ConnectionTypeID": 0,
            "Reference": "4",
            "LevelID": 2,
            "Amps": 32,
            "Voltage": 400,
            "PowerKW": 22,
            "Comments": "Mode 3"
        },
        {
            "ID": 164228,
            "ConnectionTypeID": 0,
            "Reference": "5",
            "LevelID": 2,
            "Amps": 32,
            "Voltage": 400,
            "PowerKW": 22,
            "Comments": "Mode 3"
        },
        {
            "ID": 164229,
            "ConnectionTypeID": 0,
            "Reference": "6",
            "LevelID": 2,
            "Amps": 32,
            "Voltage": 400,
            "PowerKW": 22,
            "Comments": "Mode 3"
        }
    ],
    "NumberOfPoints": 6,
    "DateLastStatusUpdate": "2020-05-26T08:22:00Z",
    "DataQualityLevel": 2,
    "DateCreated": "2019-02-11T09:16:00Z",
    "SubmissionStatusTypeID": 100
}