{
    "IsRecentlyVerified": false,
    "ID": 95757,
    "UUID": "1CB5C3BF-852A-4989-9144-606FD67AA984",
    "DataProviderID": 1,
    "OperatorID": 3,
    "OperatorsReference": "PG-81605",
    "UsageTypeID": 6,
    "UsageCost": "1",
    "AddressInfo": {
        "ID": 96103,
        "Title": "Volvo-Warwick",
        "AddressLine1": "Heathcote Lane",
        "Town": "Warwickshire",
        "Postcode": "CV34 6SP",
        "CountryID": 1,
        "Latitude": 52.272118,
        "Longitude": -1.556073,
        "DistanceUnit": 0
    },
    "Connections": [
        {
            "ID": 135648,
            "ConnectionTypeID": 25,
            "StatusTypeID": 50,
            "LevelID": 2,
            "Amps": 32,
            "Voltage": 230,
            "PowerKW": 7,
            "CurrentTypeID": 10,
            "Quantity": 2
        }
    ],
    "NumberOfPoints": 2,
    "GeneralComments": "This is an open charge unit installed at the Volvo - Warwick dealership in Heathcote Lane, Warwick",
    "StatusTypeID": 0,
    "DateLastStatusUpdate": "2020-01-28T06:26:00Z",
    "DataQualityLevel": 1,
    "DateCreated": "2017-11-23T18:22:00Z",
    "SubmissionStatusTypeID": 200
}