{
    "UserComments": [
        {
            "ID": 20486,
            "ChargePointID": 65108,
            "CommentTypeID": 10,
            "UserName": "ForumElettrico.it",
            "RelatedURL": "https://www.forumelettrico.it/forum/fraccaro-cafe-t4040.html",
            "DateCreated": "2018-12-04T16:59:27.76Z",
            "User": {
                "ID": 11749,
                "Username": "ForumElettrico.it"
            },
            "CheckinStatusTypeID": 10
        }
    ],
    "MediaItems": [
        {
            "ID": 17160,
            "ChargePointID": 65108,
            "ItemURL": "https://s3-ap-southeast-2.amazonaws.com/openchargemap/images/IT/OCM65108/OCM-65108.orig.2018120416594258.jpg",
            "ItemThumbnailURL": "https://s3-ap-southeast-2.amazonaws.com/openchargemap/images/IT/OCM65108/OCM-65108.thmb.2018120416594258.jpg",
            "Comment": "",
            "IsEnabled": true,
            "IsVideo": false,
            "IsFeaturedItem": false,
            "IsExternalResource": false,
            "User": {
                "ID": 11749,
                "Username": "ForumElettrico.it"
            },
            "DateCreated": "2018-12-04T17:00:00Z"
        },
        {
            "ID": 17161,
            "ChargePointID": 65108,
            "ItemURL": "https://s3-ap-southeast-2.amazonaws.com/openchargemap/images/IT/OCM65108/OCM-65108.orig.2018120416595701.jpg",
            "ItemThumbnailURL": "https://s3-ap-southeast-2.amazonaws.com/openchargemap/images/IT/OCM65108/OCM-65108.thmb.2018120416595701.jpg",
            "Comment": "",
            "IsEnabled": true,
            "IsVideo": false,
            "IsFeaturedItem": false,
            "IsExternalResource": false,
            "User": {
                "ID": 11749,
                "Username": "ForumElettrico.it"
            },
            "DateCreated": "2018-12-04T17:00:00Z"
        },
        {
            "ID": 17162,
            "ChargePointID": 65108,
            "ItemURL": "https://s3-ap-southeast-2.amazonaws.com/openchargemap/images/IT/OCM65108/OCM-65108.orig.2018120417000414.jpg",
            "ItemThumbnailURL": "https://s3-ap-southeast-2.amazonaws.com/openchargemap/images/IT/OCM65108/OCM-65108.thmb.2018120417000414.jpg",
            "Comment": "",
            "IsEnabled": true,
            "IsVideo": false,
            "IsFeaturedItem": false,
            "IsExternalResource": false,
            "User": {
                "ID": 11749,
                "Username": "ForumElettrico.it"
            },
            "DateCreated": "2018-12-04T17:00:00Z"
        },
        {
            "ID": 13144,
            "ChargePointID": 65108,
            "ItemURL": "https://s3-ap-southeast-2.amazonaws.com/openchargemap/images/IT/OCM65108/OCM-65108.orig.2017080912233402.jpg",
            "ItemThumbnailURL": "https://s3-ap-southeast-2.amazonaws.com/openchargemap/images/IT/OCM65108/OCM-65108.thmb.2017080912233402.jpg",
            "Comment": "",
            "IsEnabled": true,
            "IsVideo": false,
            "IsFeaturedItem": false,
            "IsExternalResource": false,
            "User": {
                "ID": 1606,
                "Username": "polianto"
            },
            "DateCreated": "2017-08-09T12:24:00Z"
        },
        {
            "ID": 13143,
            "ChargePointID": 65108,
            "ItemURL": "https://s3-ap-southeast-2.amazonaws.com/openchargemap/images/IT/OCM65108/OCM-65108.orig.2017080912231509.jpg",
            "ItemThumbnailURL": "https://s3-ap-southeast-2.amazonaws.com/openchargemap/images/IT/OCM65108/OCM-65108.thmb.2017080912231509.jpg",
            "Comment": "Aggiunti due TDC",
            "IsEnabled": true,
            "IsVideo": false,
            "IsFeaturedItem": false,
            "IsExternalResource": false,
            "User": {
                "ID": 1606,
                "Username": "polianto"
            },
            "DateCreated": "2017-08-09T12:23:00Z"
        },
        {
            "ID": 8155,
            "ChargePointID": 65108,
            "ItemURL": "https://s3-ap-southeast-2.amazonaws.com/openchargemap/images/IT/OCM65108/OCM-65108.orig.2016082717034354.jpg",
            "ItemThumbnailURL": "https://s3-ap-southeast-2.amazonaws.com/openchargemap/images/IT/OCM65108/OCM-65108.thmb.2016082717034354.jpg",
            "Comment": "",
            "IsEnabled": true,
            "IsVideo": false,
            "IsFeaturedItem": false,
            "IsExternalResource": false,
            "User": {
                "ID": 1606,
                "Username": "polianto"
            },
            "DateCreated": "2016-08-27T17:04:00Z"
        },
        {
            "ID": 8156,
            "ChargePointID": 65108,
            "ItemURL": "https://s3-ap-southeast-2.amazonaws.com/openchargemap/images/IT/OCM65108/OCM-65108.orig.2016082717040741.jpg",
            "ItemThumbnailURL": "https://s3-ap-southeast-2.amazonaws.com/openchargemap/images/IT/OCM65108/OCM-65108.thmb.2016082717040741.jpg",
            "Comment": "",
            "IsEnabled": true,
            "IsVideo": false,
            "IsFeaturedItem": false,
            "IsExternalResource": false,
            "User": {
                "ID": 1606,
                "Username": "polianto"
            },
            "DateCreated": "2016-08-27T17:04:00Z"
        }
    ],
    "IsRecentlyVerified": false,
    "ID": 65108,
    "UUID": "3C651A15-4B13-476C-9546-15658BF948F4",
    "DataProviderID": 1,
    "OperatorID": 45,
    "UsageTypeID": 6,
    "UsageCost": "gratis",
    "AddressInfo": {
        "ID": 65454,
        "Title": "Fraccaro Café",
        "AddressLine1": "Via Circonvallazione Ovest, 25/27",
        "Town": "Castelfranco Veneto",
        "StateOrProvince": "TV",
        "Postcode": "31033",
        "CountryID": 112,
        "Latitude": 45.678321325715196,
        "Longitude": 11.916198002024203,
        "ContactTelephone1": "+39 0423.491421 ",
        "ContactEmail": "spumadoro@fraccarospumadoro.it",
        "RelatedURL": "http://www.fraccarospumadoro.it/",
        "DistanceUnit": 0
    },
    "Connections": [
        {
            "ID": 89615,
            "ConnectionTypeID": 25,
            "StatusTypeID": 50,
            "LevelID": 2,
            "Amps": 16,
            "Voltage": 240,
            "PowerKW": 7.4,
            "CurrentTypeID": 10,
            "Quantity": 2
        },
        {
            "ID": 112328,
            "ConnectionTypeID": 1036,
            "StatusTypeID": 50,
            "LevelID": 2,
            "Amps": 32,
            "Voltage": 400,
            "PowerKW": 22,
            "CurrentTypeID": 20,
            "Quantity": 1
        }
    ],
    "NumberOfPoints": 3,
    "GeneralComments": "Tesla Destination Charging",
    "StatusTypeID": 50,
    "DateLastStatusUpdate": "2018-12-04T17:00:00Z",
    "DataQualityLevel": 1,
    "DateCreated": "2016-04-12T07:59:00Z",
    "SubmissionStatusTypeID": 200
}