{
    "IsRecentlyVerified": false,
    "ID": 107755,
    "UUID": "11E492CE-33C5-4300-A429-023B6A218724",
    "DataProviderID": 1,
    "OperatorID": 3319,
    "UsageTypeID": 1,
    "UsageCost": "bruttó 80 Ft/kWh",
    "AddressInfo": {
        "ID": 108101,
        "Title": "Visegrád, Palotaház",
        "AddressLine1": " Dunapart út 1. 11-es út, buszparkoló",
        "Town": "Visegrád",
        "StateOrProvince": "Pest megye",
        "Postcode": "2025",
        "CountryID": 104,
        "Latitude": 47.7897729601275,
        "Longitude": 18.9709883755677,
        "ContactTelephone1": "+36 80 21-00-12",
        "ContactEmail": "kommunikacio@e-mobi.hu",
        "RelatedURL": "https://e-mobi.hu",
        "DistanceUnit": 0
    },
    "Connections": [
        {
            "ID": 152148,
            "ConnectionTypeID": 25,
            "StatusTypeID": 50,
            "LevelID": 2,
            "Amps": 32,
            "Voltage": 400,
            "PowerKW": 22,
            "CurrentTypeID": 10,
            "Quantity": 2
        },
        {
            "ID": 152149,
            "ConnectionTypeID": 25,
            "StatusTypeID": 50,
            "LevelID": 2,
            "Amps": 32,
            "Voltage": 400,
            "PowerKW": 22,
            "CurrentTypeID": 10,
            "Quantity": 2
        }
    ],
    "NumberOfPoints": 2,
    "StatusTypeID": 50,
    "DateLastStatusUpdate": "2020-05-09T09:02:00Z",
    "DataQualityLevel": 1,
    "DateCreated": "2018-08-08T16:00:00Z",
    "SubmissionStatusTypeID": 200
}