{
    "IsRecentlyVerified": false,
    "ID": 16005,
    "UUID": "F23C845A-90FA-4330-A450-7E5E1CA9E031",
    "DataProviderID": 2,
    "DataProvidersReference": "50743",
    "OperatorID": 107,
    "UsageTypeID": 2,
    "AddressInfo": {
        "ID": 16350,
        "Title": "San Diego Naval Base - Columbia",
        "AddressLine1": "1220 Pacific Hwy",
        "Town": "San Diego",
        "StateOrProvince": "CA",
        "Postcode": "92132",
        "CountryID": 2,
        "Latitude": 32.718035,
        "Longitude": -117.171127,
        "ContactTelephone1": "",
        "AccessComments": "",
        "RelatedURL": "http://www.opconnect.com/",
        "DistanceUnit": 0
    },
    "Connections": [
        {
            "ID": 14399,
            "ConnectionTypeID": 9,
            "LevelID": 1,
            "Amps": 16,
            "Voltage": 120,
            "PowerKW": 1,
            "CurrentTypeID": 10,
            "Quantity": 2
        },
        {
            "ID": 14400,
            "ConnectionTypeID": 1,
            "LevelID": 2,
            "Amps": 16,
            "Voltage": 230,
            "PowerKW": 3,
            "CurrentTypeID": 10,
            "Quantity": 2
        },
        {
            "ID": 22109,
            "ConnectionTypeID": 1,
            "LevelID": 2,
            "Quantity": 4
        }
    ],
    "DateLastStatusUpdate": "2019-04-06T04:01:00Z",
    "DataQualityLevel": 3,
    "DateCreated": "2013-02-18T06:15:00Z",
    "SubmissionStatusTypeID": 100
}