{
    "IsRecentlyVerified": false,
    "ID": 33243,
    "UUID": "74CD752D-2454-47C8-88CB-23537677ECB7",
    "DataProviderID": 26,
    "DataProvidersReference": "48785",
    "OperatorID": 178,
    "OperatorsReference": "EVnetNL TIL_003",
    "UsageCost": "0.00 jaarabonnement",
    "AddressInfo": {
        "ID": 33589,
        "Title": "Magazijnstraat 2a",
        "AddressLine1": "Magazijnstraat 2a",
        "Town": "Tilburg",
        "Postcode": "5038 BR",
        "CountryID": 159,
        "Latitude": 51.559157,
        "Longitude": 5.08928,
        "ContactTelephone1": "0800-3522365",
        "RelatedURL": "http://www.evnet.nl",
        "DistanceUnit": 0
    },
    "Connections": [
        {
            "ID": 36754,
            "ConnectionTypeID": 25,
            "LevelID": 2,
            "PowerKW": 11,
            "CurrentTypeID": 10
        }
    ],
    "NumberOfPoints": 2,
    "StatusTypeID": 50,
    "DateLastStatusUpdate": "2016-06-04T02:39:00Z",
    "DataQualityLevel": 3,
    "DateCreated": "2015-01-09T06:04:00Z",
    "SubmissionStatusTypeID": 100
}