{
    "UserComments": [
        {
            "ID": 6410,
            "ChargePointID": 47399,
            "CommentTypeID": 10,
            "UserName": "silvercoinboy",
            "Comment": "Not supportive dealership have restricted ChargeNow station only to themselves.  Had non electric car blocking access.  With support like this, BMW will never catch Tesla",
            "Rating": 4,
            "DateCreated": "2015-09-04T15:16:41.463Z",
            "User": {
                "ID": 6195,
                "Username": "silvercoinboy"
            },
            "CheckinStatusTypeID": 200
        }
    ],
    "MediaItems": [
        {
            "ID": 3161,
            "ChargePointID": 47399,
            "ItemURL": "https://s3-ap-southeast-2.amazonaws.com/openchargemap/images/US/OCM47399/OCM-47399.orig.2015090415181395.jpg",
            "ItemThumbnailURL": "https://s3-ap-southeast-2.amazonaws.com/openchargemap/images/US/OCM47399/OCM-47399.thmb.2015090415181395.jpg",
            "Comment": "",
            "IsEnabled": true,
            "IsVideo": false,
            "IsFeaturedItem": false,
            "IsExternalResource": false,
            "User": {
                "ID": 6195,
                "Username": "silvercoinboy"
            },
            "DateCreated": "2015-09-04T15:19:00Z"
        }
    ],
    "IsRecentlyVerified": false,
    "ID": 47399,
    "UUID": "CB5C16FD-C3D1-4C54-8BB6-A3B96B8C4696",
    "DataProviderID": 2,
    "DataProvidersReference": "67151",
    "UsageTypeID": 2,
    "AddressInfo": {
        "ID": 47745,
        "Title": "BMW of Rockville",
        "AddressLine1": "1300 Rockville Pike",
        "Town": "Rockville",
        "StateOrProvince": "MD",
        "Postcode": "20852",
        "CountryID": 2,
        "Latitude": 39.069543,
        "Longitude": -77.130584,
        "ContactTelephone1": "",
        "AccessComments": "Service center use only",
        "RelatedURL": "",
        "DistanceUnit": 0
    },
    "Connections": [
        {
            "ID": 58437,
            "ConnectionTypeID": 1,
            "LevelID": 2,
            "Amps": 16,
            "Voltage": 230,
            "PowerKW": 3.7,
            "CurrentTypeID": 10,
            "Quantity": 1
        }
    ],
    "DateLastStatusUpdate": "2020-06-26T03:01:00Z",
    "DataQualityLevel": 3,
    "DateCreated": "2015-05-27T08:51:00Z",
    "SubmissionStatusTypeID": 100
}