{
    "IsRecentlyVerified": false,
    "ID": 64792,
    "UUID": "9FFDCA61-C2A4-4E47-A051-0860F724745B",
    "DataProviderID": 1,
    "OperatorID": 80,
    "UsageTypeID": 4,
    "AddressInfo": {
        "ID": 65138,
        "Title": "Centro Commerciale Il Porto",
        "AddressLine1": "C.so Argentina s.n.c.",
        "Town": "Licata",
        "StateOrProvince": "AG",
        "Postcode": "92027",
        "CountryID": 112,
        "Latitude": 37.09886415932189,
        "Longitude": 13.943199273324577,
        "ContactTelephone1": "09221837101",
        "ContactEmail": "centroilporto@project-servicesrl.it",
        "RelatedURL": "http://www.centroilporto.it/",
        "DistanceUnit": 0
    },
    "Connections": [
        {
            "ID": 83303,
            "ConnectionTypeID": 25,
            "StatusTypeID": 50,
            "LevelID": 2,
            "CurrentTypeID": 10,
            "Quantity": 2
        }
    ],
    "NumberOfPoints": 2,
    "GeneralComments": "http://www.centroilporto.it/il-centro/servizi/",
    "StatusTypeID": 50,
    "DateLastStatusUpdate": "2016-03-21T14:44:00Z",
    "DataQualityLevel": 1,
    "DateCreated": "2016-03-21T14:44:00Z",
    "SubmissionStatusTypeID": 200
}