{
    "IsRecentlyVerified": false,
    "ID": 46225,
    "UUID": "92A7004E-6CE5-4E8E-A4E2-1F6F5669641A",
    "DataProviderID": 1,
    "DataProvidersReference": "1655",
    "AddressInfo": {
        "ID": 46571,
        "Title": "Pingvin Klima AS, Oslo",
        "AddressLine1": "Grensesvingen 9",
        "Town": "OSLO",
        "StateOrProvince": "Oslo",
        "Postcode": "0661",
        "CountryID": 168,
        "Latitude": 59.91465,
        "Longitude": 10.79871,
        "AccessComments": "",
        "DistanceUnit": 0
    },
    "Connections": [
        {
            "ID": 56888,
            "ConnectionTypeID": 0,
            "Reference": "1",
            "LevelID": 2,
            "Amps": 16,
            "Voltage": 230,
            "PowerKW": 3.7,
            "Comments": "Mode 1"
        },
        {
            "ID": 88601,
            "ConnectionTypeID": 0,
            "Reference": "2",
            "LevelID": 2,
            "Amps": 16,
            "Voltage": 230,
            "PowerKW": 3.7,
            "Comments": "Mode 1"
        }
    ],
    "NumberOfPoints": 2,
    "DateLastStatusUpdate": "2020-05-26T08:23:00Z",
    "DataQualityLevel": 2,
    "DateCreated": "2015-05-03T00:54:00Z",
    "SubmissionStatusTypeID": 100
}