{
    "UserComments": [
        {
            "ID": 21123,
            "ChargePointID": 118259,
            "CommentTypeID": 10,
            "UserName": "ForumElettrico.it",
            "RelatedURL": "https://www.forumelettrico.it/forum/colonnina-enel-x-22-kw-tredozio-fc-via-vittorio-bachelet-1-t5967.html",
            "DateCreated": "2019-06-19T10:12:32.697Z",
            "User": {
                "ID": 11749,
                "Username": "ForumElettrico.it"
            },
            "CheckinStatusTypeID": 22
        }
    ],
    "MediaItems": [
        {
            "ID": 18670,
            "ChargePointID": 118259,
            "ItemURL": "https://s3-ap-southeast-2.amazonaws.com/openchargemap/images/IT/OCM118259/OCM-118259.orig.2019061910124414.jpg",
            "ItemThumbnailURL": "https://s3-ap-southeast-2.amazonaws.com/openchargemap/images/IT/OCM118259/OCM-118259.thmb.2019061910124414.jpg",
            "Comment": "",
            "IsEnabled": true,
            "IsVideo": false,
            "IsFeaturedItem": false,
            "IsExternalResource": false,
            "User": {
                "ID": 11749,
                "Username": "ForumElettrico.it"
            },
            "DateCreated": "2019-06-19T10:13:00Z"
        },
        {
            "ID": 18671,
            "ChargePointID": 118259,
            "ItemURL": "https://s3-ap-southeast-2.amazonaws.com/openchargemap/images/IT/OCM118259/OCM-118259.orig.2019061910125015.jpg",
            "ItemThumbnailURL": "https://s3-ap-southeast-2.amazonaws.com/openchargemap/images/IT/OCM118259/OCM-118259.thmb.2019061910125015.jpg",
            "Comment": "",
            "IsEnabled": true,
            "IsVideo": false,
            "IsFeaturedItem": false,
            "IsExternalResource": false,
            "User": {
                "ID": 11749,
                "Username": "ForumElettrico.it"
            },
            "DateCreated": "2019-06-19T10:13:00Z"
        },
        {
            "ID": 18672,
            "ChargePointID": 118259,
            "ItemURL": "https://s3-ap-southeast-2.amazonaws.com/openchargemap/images/IT/OCM118259/OCM-118259.orig.2019061910125631.jpg",
            "ItemThumbnailURL": "https://s3-ap-southeast-2.amazonaws.com/openchargemap/images/IT/OCM118259/OCM-118259.thmb.2019061910125631.jpg",
            "Comment": "",
            "IsEnabled": true,
            "IsVideo": false,
            "IsFeaturedItem": false,
            "IsExternalResource": false,
            "User": {
                "ID": 11749,
                "Username": "ForumElettrico.it"
            },
            "DateCreated": "2019-06-19T10:13:00Z"
        },
        {
            "ID": 18673,
            "ChargePointID": 118259,
            "ItemURL": "https://s3-ap-southeast-2.amazonaws.com/openchargemap/images/IT/OCM118259/OCM-118259.orig.2019061910130242.jpg",
            "ItemThumbnailURL": "https://s3-ap-southeast-2.amazonaws.com/openchargemap/images/IT/OCM118259/OCM-118259.thmb.2019061910130242.jpg",
            "Comment": "",
            "IsEnabled": true,
            "IsVideo": false,
            "IsFeaturedItem": false,
            "IsExternalResource": false,
            "User": {
                "ID": 11749,
                "Username": "ForumElettrico.it"
            },
            "DateCreated": "2019-06-19T10:13:00Z"
        },
        {
            "ID": 18674,
            "ChargePointID": 118259,
            "ItemURL": "https://s3-ap-southeast-2.amazonaws.com/openchargemap/images/IT/OCM118259/OCM-118259.orig.2019061910130879.jpg",
            "ItemThumbnailURL": "https://s3-ap-southeast-2.amazonaws.com/openchargemap/images/IT/OCM118259/OCM-118259.thmb.2019061910130879.jpg",
            "Comment": "",
            "IsEnabled": true,
            "IsVideo": false,
            "IsFeaturedItem": false,
            "IsExternalResource": false,
            "User": {
                "ID": 11749,
                "Username": "ForumElettrico.it"
            },
            "DateCreated": "2019-06-19T10:13:00Z"
        }
    ],
    "IsRecentlyVerified": false,
    "ID": 118259,
    "UUID": "6B04AF44-95C2-4783-BFFE-8D5EA9DA73C4",
    "DataProviderID": 1,
    "OperatorID": 80,
    "UsageTypeID": 4,
    "AddressInfo": {
        "ID": 118605,
        "Title": "Tredozio Bachelet | EnelX",
        "AddressLine1": "Via Vittorio Bachelet",
        "Town": "Tredozio",
        "StateOrProvince": "FC",
        "Postcode": "47019",
        "CountryID": 112,
        "Latitude": 44.07372962211517,
        "Longitude": 11.73339757220242,
        "RelatedURL": "https://www.enelx.com/it/it/emobility",
        "DistanceUnit": 0
    },
    "Connections": [
        {
            "ID": 167325,
            "ConnectionTypeID": 25,
            "StatusTypeID": 50,
            "LevelID": 2,
            "Amps": 32,
            "Voltage": 400,
            "PowerKW": 22,
            "CurrentTypeID": 20,
            "Quantity": 1
        },
        {
            "ID": 167326,
            "ConnectionTypeID": 36,
            "StatusTypeID": 50,
            "LevelID": 2,
            "Amps": 16,
            "Voltage": 240,
            "PowerKW": 3.7,
            "CurrentTypeID": 10,
            "Quantity": 1
        }
    ],
    "NumberOfPoints": 2,
    "StatusTypeID": 50,
    "DateLastStatusUpdate": "2019-06-19T10:13:00Z",
    "DataQualityLevel": 1,
    "DateCreated": "2019-03-19T17:34:00Z",
    "SubmissionStatusTypeID": 200
}