{
    "IsRecentlyVerified": false,
    "ID": 175677,
    "UUID": "F89D4C40-27EC-49FD-BA5A-3B58D59E7E9E",
    "DataProviderID": 1,
    "OperatorID": 3447,
    "UsageTypeID": 1,
    "AddressInfo": {
        "ID": 176036,
        "Title": "الطريق الوطنية تونس - المرسى",
        "AddressLine1": "الطريق الوطنية تونس - المرسى",
        "Town": "العوينة",
        "StateOrProvince": "Tunis",
        "Postcode": "2045",
        "CountryID": 228,
        "Latitude": 36.84922376026216,
        "Longitude": 10.265912540199224,
        "DistanceUnit": 0
    },
    "Connections": [
        {
            "ID": 272777,
            "ConnectionTypeID": 1036,
            "StatusTypeID": 50,
            "LevelID": 2,
            "Amps": 32,
            "Voltage": 230,
            "PowerKW": 22,
            "CurrentTypeID": 20,
            "Quantity": 1
        }
    ],
    "NumberOfPoints": 1,
    "StatusTypeID": 50,
    "DateLastStatusUpdate": "2021-06-06T20:47:00Z",
    "DataQualityLevel": 1,
    "DateCreated": "2021-06-06T14:25:00Z",
    "SubmissionStatusTypeID": 200
}