{
    "MediaItems": [
        {
            "ID": 12774,
            "ChargePointID": 88521,
            "ItemURL": "https://s3-ap-southeast-2.amazonaws.com/openchargemap/images/NZ/OCM88521/OCM-88521.orig.2017053116525692.jpg",
            "ItemThumbnailURL": "https://s3-ap-southeast-2.amazonaws.com/openchargemap/images/NZ/OCM88521/OCM-88521.thmb.2017053116525692.jpg",
            "Comment": "",
            "IsEnabled": true,
            "IsVideo": false,
            "IsFeaturedItem": false,
            "IsExternalResource": false,
            "User": {
                "ID": 15365,
                "Username": "sliday"
            },
            "DateCreated": "2017-05-31T16:53:00Z"
        },
        {
            "ID": 12775,
            "ChargePointID": 88521,
            "ItemURL": "https://s3-ap-southeast-2.amazonaws.com/openchargemap/images/NZ/OCM88521/OCM-88521.orig.2017053116531305.jpg",
            "ItemThumbnailURL": "https://s3-ap-southeast-2.amazonaws.com/openchargemap/images/NZ/OCM88521/OCM-88521.thmb.2017053116531305.jpg",
            "Comment": "",
            "IsEnabled": true,
            "IsVideo": false,
            "IsFeaturedItem": false,
            "IsExternalResource": false,
            "User": {
                "ID": 15365,
                "Username": "sliday"
            },
            "DateCreated": "2017-05-31T16:53:00Z"
        }
    ],
    "IsRecentlyVerified": false,
    "ID": 88521,
    "UUID": "2DDCBD51-F046-4D07-B426-82AEB1420A48",
    "DataProviderID": 1,
    "OperatorID": 45,
    "UsageTypeID": 6,
    "UsageCost": "$30 overnight parking fee for customers only",
    "AddressInfo": {
        "ID": 88867,
        "Title": "CQ Hotel Wellington",
        "AddressLine1": "223 Cuba Street",
        "Town": "Te Aro, Wellington",
        "Postcode": "6011",
        "CountryID": 161,
        "Latitude": -41.295404,
        "Longitude": 174.7746879,
        "ContactTelephone1": "04-385 2156",
        "DistanceUnit": 0
    },
    "Connections": [
        {
            "ID": 125569,
            "ConnectionTypeID": 1036,
            "StatusTypeID": 50,
            "LevelID": 2,
            "Amps": 32,
            "Voltage": 400,
            "PowerKW": 22,
            "CurrentTypeID": 20,
            "Quantity": 2
        }
    ],
    "NumberOfPoints": 2,
    "GeneralComments": "24/7\r\n2 x 22kw Tesla Wall Connectors",
    "StatusTypeID": 50,
    "DateLastStatusUpdate": "2017-05-31T17:31:00Z",
    "DataQualityLevel": 1,
    "DateCreated": "2017-05-31T16:53:00Z",
    "SubmissionStatusTypeID": 200
}