{
    "IsRecentlyVerified": false,
    "ID": 162349,
    "UUID": "5471D0AD-690D-4D5E-81D5-A1AE8E37EEEF",
    "DataProviderID": 1,
    "OperatorID": 21,
    "UsageTypeID": 4,
    "UsageCost": "Mobi.E compatible card",
    "AddressInfo": {
        "ID": 162706,
        "Title": "SXL-00005",
        "AddressLine1": "Av. Resistentes Antifascistas",
        "Town": "Quinta da Mimosa",
        "StateOrProvince": "Lisboa",
        "Postcode": "2840-434",
        "CountryID": 180,
        "Latitude": 38.61547206170275,
        "Longitude": -9.108643314487495,
        "DistanceUnit": 0
    },
    "Connections": [
        {
            "ID": 233675,
            "ConnectionTypeID": 2,
            "StatusTypeID": 50,
            "LevelID": 3,
            "Amps": 120,
            "Voltage": 500,
            "PowerKW": 50,
            "CurrentTypeID": 30,
            "Quantity": 1
        },
        {
            "ID": 233676,
            "ConnectionTypeID": 33,
            "StatusTypeID": 50,
            "LevelID": 3,
            "Amps": 125,
            "Voltage": 500,
            "PowerKW": 50,
            "CurrentTypeID": 30,
            "Quantity": 1
        },
        {
            "ID": 233677,
            "ConnectionTypeID": 1036,
            "StatusTypeID": 50,
            "LevelID": 3,
            "Amps": 63,
            "Voltage": 400,
            "PowerKW": 43,
            "CurrentTypeID": 20,
            "Quantity": 1
        }
    ],
    "NumberOfPoints": 2,
    "StatusTypeID": 50,
    "DateLastStatusUpdate": "2020-08-06T19:08:00Z",
    "DataQualityLevel": 1,
    "DateCreated": "2020-08-06T19:08:00Z",
    "SubmissionStatusTypeID": 200
}