{
    "IsRecentlyVerified": false,
    "ID": 181528,
    "UUID": "60FBEF6C-F5F8-4172-B445-3ECA44B5A6C1",
    "DataProviderID": 29,
    "DataProvidersReference": "643",
    "OperatorID": 189,
    "AddressInfo": {
        "ID": 181887,
        "Title": "Eitzer Straße 20",
        "AddressLine1": "Eitzer Straße 20",
        "Town": "Verden",
        "Postcode": "27283",
        "CountryID": 87,
        "Latitude": 52.914572,
        "Longitude": 9.231962,
        "DistanceUnit": 0
    },
    "Connections": [
        {
            "ID": 285987,
            "ConnectionTypeID": 25,
            "StatusTypeID": 50,
            "LevelID": 2,
            "PowerKW": 22,
            "CurrentTypeID": 20
        },
        {
            "ID": 285988,
            "ConnectionTypeID": 25,
            "StatusTypeID": 50,
            "LevelID": 2,
            "PowerKW": 22,
            "CurrentTypeID": 20
        }
    ],
    "StatusTypeID": 50,
    "DateLastStatusUpdate": "2021-07-12T02:50:00Z",
    "MetadataValues": [
        {
            "ID": 13822,
            "MetadataFieldID": 4,
            "ItemValue": "Data from the German chargepoint registry provided by Bundesnetzagentur.de under the CC-BY 4.0 license"
        }
    ],
    "DataQualityLevel": 3,
    "DateCreated": "2021-07-08T10:01:00Z",
    "SubmissionStatusTypeID": 100
}