{
    "IsRecentlyVerified": false,
    "ID": 116459,
    "UUID": "2DB500F9-BBAE-46BC-AB31-D69FE6F7D48D",
    "DataProviderID": 1,
    "DataProvidersReference": "4959",
    "AddressInfo": {
        "ID": 116805,
        "Title": "Hovfjället",
        "AddressLine1": "Hovfjället ",
        "Town": "TORSBY",
        "StateOrProvince": "VÄRMLAND",
        "Postcode": "68594",
        "CountryID": 216,
        "Latitude": 60.29628,
        "Longitude": 12.96496,
        "AccessComments": "På nedre parkering mittemot stugorna",
        "DistanceUnit": 0
    },
    "Connections": [
        {
            "ID": 164567,
            "ConnectionTypeID": 0,
            "Reference": "1",
            "LevelID": 2,
            "Amps": 32,
            "Voltage": 400,
            "PowerKW": 22,
            "Comments": "Mode 3"
        },
        {
            "ID": 164568,
            "ConnectionTypeID": 0,
            "Reference": "2",
            "LevelID": 2,
            "Amps": 32,
            "Voltage": 400,
            "PowerKW": 22,
            "Comments": "Mode 3"
        }
    ],
    "NumberOfPoints": 2,
    "DateLastStatusUpdate": "2020-05-26T08:24:00Z",
    "DataQualityLevel": 2,
    "DateCreated": "2019-02-11T09:16:00Z",
    "SubmissionStatusTypeID": 100
}