{
    "UserComments": [
        {
            "ID": 22913,
            "ChargePointID": 161534,
            "CommentTypeID": 10,
            "UserName": "ForumElettrico.it",
            "Comment": "La ricarica è a pagamento per un massimo di 2 ore a 0,40 €/kWh. Leggi la recensione completa qui > https://www.forumelettrico.it/forum/colonnina-scame-presso-centro-commerciale-ostiglia-camposampiero-pd-t8986.html",
            "RelatedURL": "https://www.forumelettrico.it/forum/colonnina-scame-presso-centro-commerciale-ostiglia-camposampiero-pd-t8986.html",
            "DateCreated": "2020-07-15T16:49:32.053Z",
            "User": {
                "ID": 11749,
                "Username": "ForumElettrico.it"
            },
            "CheckinStatusTypeID": 10,
            "IsActionedByEditor": false
        }
    ],
    "MediaItems": [
        {
            "ID": 23087,
            "ChargePointID": 161534,
            "ItemURL": "https://s3-ap-southeast-2.amazonaws.com/openchargemap/images/IT/OCM161534/OCM-161534.orig.2020071516494329.jpg",
            "ItemThumbnailURL": "https://s3-ap-southeast-2.amazonaws.com/openchargemap/images/IT/OCM161534/OCM-161534.thmb.2020071516494329.jpg",
            "Comment": "",
            "IsEnabled": true,
            "IsVideo": false,
            "IsFeaturedItem": false,
            "IsExternalResource": false,
            "User": {
                "ID": 11749,
                "Username": "ForumElettrico.it"
            },
            "DateCreated": "2020-07-15T16:50:00Z"
        },
        {
            "ID": 23088,
            "ChargePointID": 161534,
            "ItemURL": "https://s3-ap-southeast-2.amazonaws.com/openchargemap/images/IT/OCM161534/OCM-161534.orig.2020071516494924.jpg",
            "ItemThumbnailURL": "https://s3-ap-southeast-2.amazonaws.com/openchargemap/images/IT/OCM161534/OCM-161534.thmb.2020071516494924.jpg",
            "Comment": "",
            "IsEnabled": true,
            "IsVideo": false,
            "IsFeaturedItem": false,
            "IsExternalResource": false,
            "User": {
                "ID": 11749,
                "Username": "ForumElettrico.it"
            },
            "DateCreated": "2020-07-15T16:50:00Z"
        }
    ],
    "IsRecentlyVerified": false,
    "ID": 161534,
    "UUID": "D30263D1-4672-4ADE-B786-3BDC942A6114",
    "DataProviderID": 1,
    "OperatorID": 1,
    "UsageTypeID": 1,
    "AddressInfo": {
        "ID": 161891,
        "Title": "ZapGrid Ostiglia",
        "AddressLine1": "Via Antonio Meucci 3",
        "Town": "Camposampiero",
        "StateOrProvince": "PD",
        "CountryID": 112,
        "Latitude": 45.556111,
        "Longitude": 11.930672,
        "RelatedURL": "https://www.forumelettrico.it/forum/colonnina-scame-presso-centro-commerciale-ostiglia-camposampiero-pd-t8986.html",
        "DistanceUnit": 0
    },
    "Connections": [
        {
            "ID": 232466,
            "ConnectionTypeID": 25,
            "LevelID": 2,
            "PowerKW": 7,
            "Quantity": 2
        }
    ],
    "NumberOfPoints": 1,
    "StatusTypeID": 50,
    "DateLastStatusUpdate": "2020-12-16T16:48:00Z",
    "DataQualityLevel": 1,
    "DateCreated": "2020-07-15T16:49:00Z",
    "SubmissionStatusTypeID": 200
}