{
    "IsRecentlyVerified": false,
    "ID": 38571,
    "UUID": "2C14E072-A599-4B75-AF2B-C329D3DA61A8",
    "DataProviderID": 26,
    "DataProvidersReference": "35112",
    "OperatorID": 73,
    "OperatorsReference": "EV-Box EVB-P1339169",
    "UsageCost": "0.00 jaarabonnement",
    "AddressInfo": {
        "ID": 38917,
        "Title": "Diamantweg 18",
        "AddressLine1": "Diamantweg 18",
        "Town": "Alkmaar",
        "Postcode": "1812 RC",
        "CountryID": 159,
        "Latitude": 52.60321,
        "Longitude": 4.75389,
        "RelatedURL": "http://www.ev-box.nl",
        "DistanceUnit": 0
    },
    "Connections": [
        {
            "ID": 42082,
            "ConnectionTypeID": 25,
            "LevelID": 2,
            "PowerKW": 11,
            "CurrentTypeID": 10
        },
        {
            "ID": 49725,
            "ConnectionTypeID": 25,
            "LevelID": 2,
            "PowerKW": 11,
            "CurrentTypeID": 10
        }
    ],
    "NumberOfPoints": 1,
    "StatusTypeID": 50,
    "DateLastStatusUpdate": "2016-06-04T02:55:00Z",
    "DataQualityLevel": 3,
    "DateCreated": "2015-01-09T06:08:00Z",
    "SubmissionStatusTypeID": 100
}