{
    "IsRecentlyVerified": false,
    "ID": 10913,
    "UUID": "9C1FC822-8CBA-4BFB-B2DE-29EC98BF12ED",
    "DataProviderID": 1,
    "DataProvidersReference": "560",
    "AddressInfo": {
        "ID": 10810,
        "Title": "Vestlien terrasse borettslag Garasje, Fyllingsdalen",
        "AddressLine1": "Klauvsteinen 89",
        "Town": "FYLLINGSDALEN",
        "StateOrProvince": "Vestland",
        "Postcode": "5146",
        "CountryID": 168,
        "Latitude": 60.37247,
        "Longitude": 5.30768,
        "AccessComments": "",
        "DistanceUnit": 0
    },
    "Connections": [
        {
            "ID": 8898,
            "ConnectionTypeID": 0,
            "Reference": "1",
            "LevelID": 2,
            "Amps": 16,
            "Voltage": 230,
            "PowerKW": 3.7,
            "Comments": "Mode 1"
        },
        {
            "ID": 86829,
            "ConnectionTypeID": 0,
            "Reference": "2",
            "LevelID": 2,
            "Amps": 16,
            "Voltage": 230,
            "PowerKW": 3.7,
            "Comments": "Mode 1"
        },
        {
            "ID": 89000,
            "ConnectionTypeID": 0,
            "Reference": "3",
            "LevelID": 2,
            "Amps": 16,
            "Voltage": 230,
            "PowerKW": 3.7,
            "Comments": "Mode 1"
        }
    ],
    "NumberOfPoints": 3,
    "StatusTypeID": 0,
    "DateLastStatusUpdate": "2020-05-26T08:24:00Z",
    "DataQualityLevel": 2,
    "DateCreated": "2012-06-02T11:56:00Z",
    "SubmissionStatusTypeID": 100
}