{
    "IsRecentlyVerified": false,
    "ID": 56166,
    "UUID": "4E21E99C-932D-4DAA-946C-273333D570F9",
    "DataProviderID": 1,
    "OperatorID": 69,
    "UsageTypeID": 4,
    "AddressInfo": {
        "ID": 56512,
        "Title": "Avenida-Therme",
        "AddressLine1": "Am Stausee 1",
        "Town": "Hohenfelden",
        "StateOrProvince": "Kranichfeld",
        "Postcode": "99448",
        "CountryID": 87,
        "Latitude": 50.8783692,
        "Longitude": 11.1860297000001,
        "ContactTelephone1": "+49 3641 688-0",
        "AccessComments": "Zur Nutzung dieser Station benötigen Sie eine Zugangskarte. Diese erhalten Sie an der Information der Avenida-Therme und im Restaurant „See-Terrassen\".  Öffnungszeiten: Avenida-Therme täglich von 10.00–23.00 Uhr, Restaurant „See-Terrassen“ täglich geöffnet ab 11.30 Uhr.\r\n",
        "RelatedURL": "http://www.stadtwerke-jena.de/geschaeftskunden/unternehmen/mobilitaet.html",
        "DistanceUnit": 0
    },
    "Connections": [
        {
            "ID": 70758,
            "ConnectionTypeID": 25,
            "StatusTypeID": 50,
            "LevelID": 2,
            "Amps": 32,
            "Voltage": 400,
            "PowerKW": 22,
            "CurrentTypeID": 20,
            "Quantity": 2
        },
        {
            "ID": 70759,
            "ConnectionTypeID": 28,
            "StatusTypeID": 50,
            "LevelID": 2,
            "Amps": 16,
            "Voltage": 230,
            "PowerKW": 3.7,
            "CurrentTypeID": 10,
            "Quantity": 2
        }
    ],
    "NumberOfPoints": 4,
    "StatusTypeID": 50,
    "DateLastStatusUpdate": "2015-10-21T09:28:00Z",
    "DataQualityLevel": 1,
    "DateCreated": "2015-10-19T11:02:00Z",
    "SubmissionStatusTypeID": 200
}