{
    "IsRecentlyVerified": false,
    "ID": 107234,
    "UUID": "DF7CB9DA-98B2-476B-8985-2712EDC2B39F",
    "DataProviderID": 1,
    "OperatorID": 3253,
    "OperatorsReference": "AT*SMA*EAT0701393*002AC,AT*SMA*EAT0701393*002AC,AT*SMA*EAT0701393*001AC",
    "UsageTypeID": 1,
    "UsageCost": "€0,15/min ; Andere Tarife möglich",
    "AddressInfo": {
        "ID": 107580,
        "Title": "MPREIS Reutte",
        "AddressLine1": "Innsbruckerstraße 22a",
        "Town": "Reutte",
        "Postcode": "6600 ",
        "CountryID": 19,
        "Latitude": 47.4806299593712,
        "Longitude": 10.7257157866436,
        "RelatedURL": "https://smatrics.com/en/charging-network",
        "DistanceUnit": 0
    },
    "Connections": [
        {
            "ID": 151245,
            "ConnectionTypeID": 25,
            "StatusTypeID": 50,
            "LevelID": 2,
            "Amps": 32,
            "Voltage": 400,
            "PowerKW": 22,
            "CurrentTypeID": 20,
            "Quantity": 5
        },
        {
            "ID": 151258,
            "ConnectionTypeID": 1036,
            "StatusTypeID": 50,
            "LevelID": 2,
            "Amps": 32,
            "Voltage": 400,
            "PowerKW": 22,
            "CurrentTypeID": 20,
            "Quantity": 1
        },
        {
            "ID": 151848,
            "ConnectionTypeID": 33,
            "StatusTypeID": 150,
            "LevelID": 3,
            "PowerKW": 50,
            "CurrentTypeID": 30,
            "Quantity": 1
        },
        {
            "ID": 151849,
            "ConnectionTypeID": 2,
            "StatusTypeID": 150,
            "LevelID": 3,
            "PowerKW": 50,
            "CurrentTypeID": 30,
            "Quantity": 1
        },
        {
            "ID": 152211,
            "ConnectionTypeID": 1036,
            "StatusTypeID": 150,
            "LevelID": 3,
            "PowerKW": 43,
            "CurrentTypeID": 20,
            "Quantity": 1
        }
    ],
    "NumberOfPoints": 7,
    "GeneralComments": "OPENING HOURS MON-FRI 08:00 - 19:00 SAT 08:00 - 18:00",
    "StatusTypeID": 50,
    "DateLastStatusUpdate": "2018-08-22T05:41:00Z",
    "DataQualityLevel": 1,
    "DateCreated": "2018-07-23T09:56:00Z",
    "SubmissionStatusTypeID": 200
}