{
    "IsRecentlyVerified": false,
    "ID": 175429,
    "UUID": "3EBB1EEB-22FA-4A03-A097-2628DE010FA5",
    "DataProviderID": 1,
    "OperatorID": 3447,
    "UsageTypeID": 1,
    "AddressInfo": {
        "ID": 175788,
        "Title": "Total - Relais Beuzeville Nord",
        "AddressLine1": "Aire de Beuzeville",
        "AddressLine2": "Sens vers CAEN",
        "Town": "Beuzeville",
        "Postcode": "27210",
        "CountryID": 80,
        "Latitude": 49.325243373690654,
        "Longitude": 0.32792706878944955,
        "RelatedURL": "https://apps.total-ev-charge.com/charge-points/CS-TOTAL-NF078544-001",
        "DistanceUnit": 0
    },
    "Connections": [
        {
            "ID": 272194,
            "ConnectionTypeID": 33,
            "StatusTypeID": 50,
            "LevelID": 3,
            "PowerKW": 50,
            "CurrentTypeID": 30,
            "Quantity": 1
        },
        {
            "ID": 272195,
            "ConnectionTypeID": 2,
            "StatusTypeID": 50,
            "LevelID": 3,
            "PowerKW": 50,
            "CurrentTypeID": 30,
            "Quantity": 1
        },
        {
            "ID": 272196,
            "ConnectionTypeID": 1036,
            "StatusTypeID": 50,
            "LevelID": 3,
            "PowerKW": 43,
            "CurrentTypeID": 20,
            "Quantity": 1
        },
        {
            "ID": 272197,
            "ConnectionTypeID": 28,
            "StatusTypeID": 50,
            "CurrentTypeID": 10,
            "Quantity": 1
        }
    ],
    "NumberOfPoints": 1,
    "StatusTypeID": 50,
    "DateLastStatusUpdate": "2021-05-19T19:55:00Z",
    "DataQualityLevel": 1,
    "DateCreated": "2021-05-19T13:03:00Z",
    "SubmissionStatusTypeID": 200
}