{
    "IsRecentlyVerified": false,
    "ID": 90705,
    "UUID": "A856B52D-A07E-4459-AAA5-BABFB06DFD73",
    "DataProviderID": 1,
    "OperatorID": 23,
    "OperatorsReference": "32098",
    "UsageTypeID": 4,
    "AddressInfo": {
        "ID": 91051,
        "Title": "Wingate By Wyndham Charlotte Airport I-85/I-485",
        "AddressLine1": "4238 Business Center DR",
        "Town": "Charlotte",
        "StateOrProvince": "North Carolina",
        "Postcode": "28214",
        "CountryID": 2,
        "Latitude": 35.242709,
        "Longitude": -80.939556,
        "ContactTelephone1": "(704) 395-3600",
        "DistanceUnit": 0
    },
    "Connections": [
        {
            "ID": 128428,
            "ConnectionTypeID": 30,
            "StatusTypeID": 50,
            "LevelID": 2,
            "PowerKW": 16,
            "CurrentTypeID": 20,
            "Quantity": 2
        }
    ],
    "NumberOfPoints": 2,
    "GeneralComments": "2 Tesla Connectors, up to 16kW.Available for customers. Please call ahead.",
    "StatusTypeID": 50,
    "DateLastStatusUpdate": "2019-06-05T11:36:00Z",
    "DataQualityLevel": 1,
    "DateCreated": "2017-07-22T05:35:00Z",
    "SubmissionStatusTypeID": 200
}