{
    "IsRecentlyVerified": false,
    "ID": 152873,
    "UUID": "1962BA9B-7309-445A-A89D-8FDAE9E53DFE",
    "DataProviderID": 28,
    "DataProvidersReference": "FR*S56*P56126*A",
    "OperatorID": 3379,
    "UsageTypeID": 5,
    "AddressInfo": {
        "ID": 153226,
        "Title": "Aire de Marzan",
        "AddressLine1": "Aire de Marzan 56130 Marzan",
        "CountryID": 80,
        "Latitude": 47.529508,
        "Longitude": -2.305132,
        "AccessComments": "24/24 7/7 jours",
        "DistanceUnit": 0
    },
    "Connections": [
        {
            "ID": 214216,
            "ConnectionTypeID": 2,
            "StatusTypeID": 50,
            "LevelID": 3,
            "PowerKW": 20,
            "CurrentTypeID": 30
        },
        {
            "ID": 247469,
            "ConnectionTypeID": 33,
            "StatusTypeID": 50,
            "LevelID": 3,
            "PowerKW": 20,
            "CurrentTypeID": 30
        },
        {
            "ID": 247470,
            "ConnectionTypeID": 33,
            "StatusTypeID": 50,
            "LevelID": 3,
            "PowerKW": 20,
            "CurrentTypeID": 30
        }
    ],
    "GeneralComments": "Recharge Gratuite",
    "StatusTypeID": 50,
    "DateLastStatusUpdate": "2020-08-27T05:13:00Z",
    "DataQualityLevel": 2,
    "DateCreated": "2020-03-15T10:54:00Z",
    "SubmissionStatusTypeID": 100
}