{
    "IsRecentlyVerified": false,
    "ID": 180252,
    "UUID": "71EBD3B6-7AF6-4E03-A3C9-262DC7636327",
    "DataProviderID": 29,
    "DataProvidersReference": "16906",
    "AddressInfo": {
        "ID": 180611,
        "Title": "Pleicherschulgasse 1",
        "AddressLine1": "Pleicherschulgasse 1",
        "Town": "WÜrzburg",
        "Postcode": "97070",
        "CountryID": 87,
        "Latitude": 49.79657,
        "Longitude": 9.92719,
        "DistanceUnit": 0
    },
    "Connections": [
        {
            "ID": 283098,
            "ConnectionTypeID": 25,
            "StatusTypeID": 50,
            "LevelID": 2,
            "PowerKW": 22,
            "CurrentTypeID": 20
        },
        {
            "ID": 283099,
            "ConnectionTypeID": 25,
            "StatusTypeID": 50,
            "LevelID": 2,
            "PowerKW": 22,
            "CurrentTypeID": 20
        }
    ],
    "StatusTypeID": 50,
    "DateLastStatusUpdate": "2021-07-09T03:18:00Z",
    "MetadataValues": [
        {
            "ID": 12546,
            "MetadataFieldID": 4,
            "ItemValue": "Data from the German chargepoint registry provided by Bundesnetzagentur.de under the CC-BY 4.0 license"
        }
    ],
    "DataQualityLevel": 3,
    "DateCreated": "2021-07-08T10:00:00Z",
    "SubmissionStatusTypeID": 100
}