{
    "IsRecentlyVerified": false,
    "ID": 43389,
    "UUID": "19F6F3D2-9A2C-4598-BF45-E3D21EF2384C",
    "DataProviderID": 1,
    "OperatorID": 105,
    "UsageTypeID": 4,
    "UsageCost": "",
    "AddressInfo": {
        "ID": 43735,
        "Title": "Parkplatz Vogelpark (P4)",
        "AddressLine1": "Bäderrandstraße (B76)",
        "AddressLine2": "Kreuzung Hafenstraße",
        "Town": "Timmendorfer Strand",
        "StateOrProvince": "Kreis Ostholstein",
        "Postcode": "23669",
        "CountryID": 87,
        "Latitude": 53.99040072928176,
        "Longitude": 10.814048810385657,
        "ContactTelephone1": "",
        "AccessComments": "Zur Anfahrt den Hinweisschildern zum Vogelpark bzw. P4 folgen. Gebührenpflichtiger 24/7 nutzbarer Parkplatz für PKW und Wohnmobile. WC an der Zufahrt, von Mai bis Oktober 7-22Uhr geöffnet.",
        "RelatedURL": "http://www.timmendorfer-strand.de/",
        "DistanceUnit": 0
    },
    "Connections": [
        {
            "ID": 52586,
            "ConnectionTypeID": 25,
            "StatusTypeID": 50,
            "LevelID": 2,
            "Amps": 32,
            "Voltage": 400,
            "PowerKW": 22,
            "CurrentTypeID": 20,
            "Quantity": 4
        }
    ],
    "NumberOfPoints": 4,
    "GeneralComments": "Auf der anderen Seite bei den Wohnmobilen sind auch 16 CEE blau Steckdosen, deren Strom am Münzautomaten bezahlt werden muss. Stromkosten 1€/3kWh.",
    "StatusTypeID": 50,
    "DateLastStatusUpdate": "2021-06-07T10:10:00Z",
    "DataQualityLevel": 1,
    "DateCreated": "2015-03-29T14:08:00Z",
    "SubmissionStatusTypeID": 200
}