{
    "UserComments": [
        {
            "ID": 14287,
            "ChargePointID": 52917,
            "CommentTypeID": 10,
            "UserName": "Bss57",
            "Comment": "Immediately inside the carpark. Awkward to park 2 vehicles. Neither socket (13amp only) delivered an electrical current despite everything else working. Swipe card, open flap, plug in Richmond.",
            "Rating": 2,
            "DateCreated": "2016-09-22T11:38:05.63Z",
            "User": {
                "ID": 6295,
                "Username": "Bss57"
            },
            "CheckinStatusTypeID": 20
        }
    ],
    "IsRecentlyVerified": false,
    "ID": 52917,
    "UUID": "CD071773-D3DD-4C61-980A-4B0E393F0E54",
    "DataProviderID": 1,
    "OperatorID": 32,
    "OperatorsReference": "753",
    "UsageTypeID": 4,
    "UsageCost": "Inclusive; for Polar Plus subscription members only. Parking fees apply.",
    "AddressInfo": {
        "ID": 53263,
        "Title": "NCP Allders",
        "AddressLine1": "Dingwall Avenue",
        "Town": "Croydon",
        "Postcode": "CR0 2AA",
        "CountryID": 1,
        "Latitude": 51.375099,
        "Longitude": -0.09881,
        "DistanceUnit": 0
    },
    "Connections": [
        {
            "ID": 65869,
            "ConnectionTypeID": 3,
            "StatusTypeID": 50,
            "LevelID": 2,
            "Amps": 13,
            "Voltage": 230,
            "PowerKW": 3,
            "CurrentTypeID": 10,
            "Quantity": 2
        },
        {
            "ID": 65870,
            "ConnectionTypeID": 25,
            "StatusTypeID": 50,
            "LevelID": 2,
            "Amps": 32,
            "Voltage": 230,
            "PowerKW": 3,
            "CurrentTypeID": 10,
            "Quantity": 2
        }
    ],
    "NumberOfPoints": 2,
    "GeneralComments": "Chargemaster post. Polar Network cards accepted as well as Source London.",
    "StatusTypeID": 50,
    "DateLastStatusUpdate": "2019-03-07T06:35:00Z",
    "DataQualityLevel": 1,
    "DateCreated": "2015-09-14T07:31:00Z",
    "SubmissionStatusTypeID": 200
}