{
    "IsRecentlyVerified": false,
    "ID": 61923,
    "UUID": "0942DC58-FBF4-4BBA-A437-F70B63F30B3C",
    "DataProviderID": 2,
    "DataProvidersReference": "73267",
    "OperatorID": 5,
    "UsageTypeID": 1,
    "AddressInfo": {
        "ID": 62269,
        "Title": "UNITED AIRLINES",
        "AddressLine1": "182-394 N Access Rd",
        "Town": "South San Francisco",
        "StateOrProvince": "CA",
        "Postcode": "94080",
        "CountryID": 2,
        "Latitude": 37.638982,
        "Longitude": -122.398497,
        "ContactTelephone1": "888-758-4389",
        "AccessComments": "24 hours daily",
        "RelatedURL": "http://www.chargepoint.com/",
        "DistanceUnit": 0
    },
    "Connections": [
        {
            "ID": 78818,
            "ConnectionTypeID": 1,
            "LevelID": 2,
            "Amps": 16,
            "Voltage": 230,
            "PowerKW": 3,
            "CurrentTypeID": 10,
            "Quantity": 10
        }
    ],
    "DateLastStatusUpdate": "2019-04-06T04:02:00Z",
    "DataQualityLevel": 3,
    "DateCreated": "2016-03-03T11:38:00Z",
    "SubmissionStatusTypeID": 100
}