{
    "IsRecentlyVerified": false,
    "ID": 115089,
    "UUID": "82A776F9-048E-44D1-978A-E8396BCBDBAA",
    "DataProviderID": 1,
    "OperatorID": 80,
    "UsageTypeID": 4,
    "AddressInfo": {
        "ID": 115435,
        "Title": "Città di Castello Engels Ospedale | EnelX",
        "AddressLine1": "Via Federico Engels",
        "Town": "Città di Castello",
        "StateOrProvince": "PG",
        "Postcode": "06012",
        "CountryID": 112,
        "Latitude": 43.4740200485737,
        "Longitude": 12.2517029047807,
        "RelatedURL": "https://www.enelx.com/it/it/emobility",
        "DistanceUnit": 0
    },
    "Connections": [
        {
            "ID": 161950,
            "ConnectionTypeID": 25,
            "StatusTypeID": 50,
            "LevelID": 2,
            "Amps": 32,
            "Voltage": 400,
            "PowerKW": 22,
            "CurrentTypeID": 20,
            "Quantity": 1
        },
        {
            "ID": 161951,
            "ConnectionTypeID": 36,
            "StatusTypeID": 50,
            "LevelID": 2,
            "Amps": 16,
            "Voltage": 240,
            "PowerKW": 3.7,
            "CurrentTypeID": 10,
            "Quantity": 1
        }
    ],
    "NumberOfPoints": 2,
    "StatusTypeID": 50,
    "DateLastStatusUpdate": "2019-10-01T13:26:00Z",
    "DataQualityLevel": 1,
    "DateCreated": "2019-01-29T11:48:00Z",
    "SubmissionStatusTypeID": 200
}