{
    "IsRecentlyVerified": false,
    "ID": 183595,
    "UUID": "C21B2F5D-CC81-4249-82B3-10F693CC5E3E",
    "DataProviderID": 29,
    "DataProvidersReference": "20205",
    "AddressInfo": {
        "ID": 183954,
        "Title": "Nordring 35-39",
        "AddressLine1": "Nordring 35-39",
        "Town": "Borken",
        "Postcode": "46325",
        "CountryID": 87,
        "Latitude": 51.8450988,
        "Longitude": 6.8446435,
        "DistanceUnit": 0
    },
    "Connections": [
        {
            "ID": 290771,
            "ConnectionTypeID": 25,
            "StatusTypeID": 50,
            "LevelID": 2,
            "PowerKW": 22,
            "CurrentTypeID": 20
        },
        {
            "ID": 290772,
            "ConnectionTypeID": 25,
            "StatusTypeID": 50,
            "LevelID": 2,
            "PowerKW": 22,
            "CurrentTypeID": 20
        }
    ],
    "StatusTypeID": 50,
    "DateLastStatusUpdate": "2021-07-09T03:25:00Z",
    "MetadataValues": [
        {
            "ID": 15888,
            "MetadataFieldID": 4,
            "ItemValue": "Data from the German chargepoint registry provided by Bundesnetzagentur.de under the CC-BY 4.0 license"
        }
    ],
    "DataQualityLevel": 3,
    "DateCreated": "2021-07-08T10:04:00Z",
    "SubmissionStatusTypeID": 100
}