{
    "IsRecentlyVerified": false,
    "ID": 145330,
    "UUID": "5456C75B-D1DE-45D1-81C4-95E596FE676D",
    "DataProviderID": 1,
    "OperatorID": 1,
    "UsageTypeID": 1,
    "AddressInfo": {
        "ID": 145682,
        "Title": "The Glacier Arena",
        "AddressLine1": "45 Olympic Dr",
        "Town": "Mount Pearl",
        "StateOrProvince": "NL",
        "Postcode": "A1N 4K3",
        "CountryID": 44,
        "Latitude": 47.50731923762595,
        "Longitude": -52.81886646788752,
        "ContactTelephone1": "709-748-1100",
        "AccessComments": "24 hours daily",
        "RelatedURL": "",
        "DistanceUnit": 0
    },
    "Connections": [
        {
            "ID": 201980,
            "ConnectionTypeID": 1,
            "LevelID": 2,
            "Amps": 16,
            "Voltage": 230,
            "PowerKW": 3,
            "CurrentTypeID": 10,
            "Quantity": 1
        }
    ],
    "StatusTypeID": 50,
    "DateLastStatusUpdate": "2020-03-06T09:19:00Z",
    "DataQualityLevel": 3,
    "DateCreated": "2019-12-24T09:24:00Z",
    "SubmissionStatusTypeID": 100
}