{
    "IsRecentlyVerified": false,
    "ID": 5065,
    "UUID": "86A071A2-13DC-462F-8976-CF70EC3E506F",
    "DataProviderID": 2,
    "DataProvidersReference": "40383",
    "OperatorID": 5,
    "UsageTypeID": 1,
    "AddressInfo": {
        "ID": 5005,
        "Title": "KEY CENTER",
        "AddressLine1": "601 108th Ave NE",
        "Town": "Bellevue",
        "StateOrProvince": "WA",
        "Postcode": "98004",
        "CountryID": 2,
        "Latitude": 47.615846,
        "Longitude": -122.196881,
        "ContactTelephone1": "888-758-4389",
        "AccessComments": "24 hours daily",
        "RelatedURL": "http://www.chargepoint.com/",
        "DistanceUnit": 0
    },
    "Connections": [
        {
            "ID": 3765,
            "ConnectionTypeID": 1,
            "LevelID": 2,
            "Amps": 16,
            "Voltage": 230,
            "PowerKW": 3.7,
            "CurrentTypeID": 10,
            "Quantity": 12
        },
        {
            "ID": 21057,
            "ConnectionTypeID": 1,
            "LevelID": 2,
            "Amps": 16,
            "Voltage": 230,
            "PowerKW": 3,
            "CurrentTypeID": 10,
            "Quantity": 3
        }
    ],
    "DateLastConfirmed": "2011-06-30T00:00:00Z",
    "StatusTypeID": 0,
    "DateLastStatusUpdate": "2020-06-26T03:11:00Z",
    "DataQualityLevel": 1,
    "DateCreated": "2011-07-27T11:31:00Z",
    "SubmissionStatusTypeID": 100
}