{
    "IsRecentlyVerified": false,
    "ID": 134354,
    "UUID": "BE05DC87-ACBB-41C3-B046-120E01DD3EF8",
    "DataProviderID": 1,
    "OperatorID": 3327,
    "UsageTypeID": 4,
    "AddressInfo": {
        "ID": 134700,
        "Title": "BeCharge Parco Renzo Rivolta Bresso",
        "AddressLine1": "Via Madonnina",
        "Town": "Bresso",
        "StateOrProvince": "MI",
        "Postcode": "20091",
        "CountryID": 112,
        "Latitude": 45.53481184819407,
        "Longitude": 9.191175879672187,
        "ContactTelephone1": "02-49527730",
        "ContactEmail": "emobility@buildingenergy.it",
        "RelatedURL": "https://www.bec.energy/",
        "DistanceUnit": 0
    },
    "Connections": [
        {
            "ID": 188042,
            "ConnectionTypeID": 25,
            "StatusTypeID": 50,
            "LevelID": 2,
            "Amps": 32,
            "Voltage": 400,
            "PowerKW": 22,
            "CurrentTypeID": 20,
            "Quantity": 2
        },
        {
            "ID": 188043,
            "ConnectionTypeID": 25,
            "StatusTypeID": 50,
            "LevelID": 2,
            "Amps": 2,
            "Voltage": 240,
            "PowerKW": 22,
            "CurrentTypeID": 20,
            "Quantity": 2
        }
    ],
    "NumberOfPoints": 4,
    "StatusTypeID": 50,
    "DateLastStatusUpdate": "2019-11-10T16:18:00Z",
    "DataQualityLevel": 1,
    "DateCreated": "2019-11-10T16:18:00Z",
    "SubmissionStatusTypeID": 200
}