{
    "IsRecentlyVerified": false,
    "ID": 152979,
    "UUID": "F4FD6D80-0A1F-41D6-A804-D9A7FC05C3A2",
    "DataProviderID": 28,
    "DataProvidersReference": "FR*S49*P49347*001",
    "UsageTypeID": 5,
    "AddressInfo": {
        "ID": 153332,
        "Title": "TIERCE - Rue Touraine",
        "AddressLine1": "Rue Touraine 49125 TIERCE",
        "CountryID": 80,
        "Latitude": 47.615758,
        "Longitude": -0.468069,
        "AccessComments": "24h/24 7j/7",
        "DistanceUnit": 0
    },
    "Connections": [
        {
            "ID": 214405,
            "ConnectionTypeID": 25,
            "StatusTypeID": 50,
            "LevelID": 2,
            "PowerKW": 18,
            "CurrentTypeID": 20
        },
        {
            "ID": 214406,
            "ConnectionTypeID": 28,
            "StatusTypeID": 50,
            "LevelID": 2,
            "PowerKW": 18,
            "CurrentTypeID": 10
        },
        {
            "ID": 247690,
            "ConnectionTypeID": 25,
            "StatusTypeID": 50,
            "LevelID": 2,
            "PowerKW": 18,
            "CurrentTypeID": 20
        },
        {
            "ID": 247691,
            "ConnectionTypeID": 28,
            "StatusTypeID": 50,
            "LevelID": 2,
            "PowerKW": 18,
            "CurrentTypeID": 10
        }
    ],
    "GeneralComments": "Recharge par badge et avec une application smartphone",
    "StatusTypeID": 50,
    "DateLastStatusUpdate": "2020-08-27T05:13:00Z",
    "DataQualityLevel": 2,
    "DateCreated": "2020-03-15T10:54:00Z",
    "SubmissionStatusTypeID": 100
}