{
    "IsRecentlyVerified": false,
    "ID": 174510,
    "UUID": "291CBB8E-2921-4AA1-9858-B2B75BBDF32B",
    "DataProviderID": 1,
    "OperatorID": 21,
    "UsageTypeID": 4,
    "UsageCost": "Mobi.E compatible card or App",
    "AddressInfo": {
        "ID": 174869,
        "Title": "CSC-00068/69",
        "AddressLine1": "Avenida Engenheiro Adelino Amaro da Costa",
        "Town": "Cascais",
        "StateOrProvince": "Lisboa",
        "Postcode": "",
        "CountryID": 180,
        "Latitude": 38.706621360449304,
        "Longitude": -9.433192666618424,
        "AccessComments": "Bombeiros Voluntários de Cascais",
        "DistanceUnit": 0
    },
    "Connections": [
        {
            "ID": 270355,
            "ConnectionTypeID": 2,
            "StatusTypeID": 50,
            "LevelID": 3,
            "Amps": 120,
            "Voltage": 500,
            "PowerKW": 50,
            "CurrentTypeID": 30,
            "Quantity": 1
        },
        {
            "ID": 270356,
            "ConnectionTypeID": 33,
            "StatusTypeID": 50,
            "LevelID": 3,
            "Amps": 125,
            "Voltage": 500,
            "PowerKW": 50,
            "CurrentTypeID": 30,
            "Quantity": 1
        },
        {
            "ID": 270357,
            "ConnectionTypeID": 1036,
            "StatusTypeID": 50,
            "LevelID": 3,
            "Amps": 63,
            "Voltage": 400,
            "PowerKW": 43,
            "CurrentTypeID": 20,
            "Quantity": 1
        },
        {
            "ID": 270358,
            "ConnectionTypeID": 25,
            "StatusTypeID": 50,
            "LevelID": 2,
            "Amps": 32,
            "Voltage": 230,
            "PowerKW": 7.4,
            "CurrentTypeID": 10,
            "Quantity": 1
        }
    ],
    "NumberOfPoints": 3,
    "StatusTypeID": 50,
    "DateLastStatusUpdate": "2021-04-04T09:17:00Z",
    "DataQualityLevel": 1,
    "DateCreated": "2021-04-04T09:17:00Z",
    "SubmissionStatusTypeID": 200
}