{
    "IsRecentlyVerified": false,
    "ID": 155872,
    "UUID": "5B2F9E05-47D5-42E8-B781-BE6F49F3ABB5",
    "DataProviderID": 1,
    "OperatorID": 23,
    "OperatorsReference": "53419",
    "UsageTypeID": 4,
    "AddressInfo": {
        "ID": 156226,
        "Title": "Hotel Catalonia Playa Maroma",
        "AddressLine1": "Hotel Catalonia Playa Maroma",
        "Postcode": "77710",
        "CountryID": 146,
        "Latitude": 20.73945,
        "Longitude": -86.970293,
        "ContactTelephone1": " +52 984 875 1020",
        "DistanceUnit": 0
    },
    "Connections": [
        {
            "ID": 219439,
            "ConnectionTypeID": 30,
            "StatusTypeID": 50,
            "LevelID": 2,
            "PowerKW": 11,
            "CurrentTypeID": 20,
            "Quantity": 1
        }
    ],
    "NumberOfPoints": 1,
    "GeneralComments": "1 Tesla Connector, up to 11kW.Available for customers. Please see front desk.",
    "StatusTypeID": 50,
    "DateLastStatusUpdate": "2020-04-27T06:01:00Z",
    "DataQualityLevel": 1,
    "DateCreated": "2020-04-27T06:01:00Z",
    "SubmissionStatusTypeID": 200
}