{
    "IsRecentlyVerified": false,
    "ID": 35286,
    "UUID": "C5397AA4-56EB-4436-BF73-0055BDDAA9F8",
    "DataProviderID": 26,
    "DataProvidersReference": "47692",
    "OperatorID": 178,
    "OperatorsReference": "EVnetNL AL842",
    "UsageCost": "0.00 jaarabonnement",
    "AddressInfo": {
        "ID": 35632,
        "Title": "Athenesingel 72",
        "AddressLine1": "Athenesingel 72",
        "Town": "Den Haag",
        "Postcode": "2548 TH",
        "CountryID": 159,
        "Latitude": 52.022998,
        "Longitude": 4.289988,
        "ContactTelephone1": "0800-3522365",
        "RelatedURL": "http://www.evnet.nl",
        "DistanceUnit": 0
    },
    "Connections": [
        {
            "ID": 38797,
            "ConnectionTypeID": 25,
            "LevelID": 2,
            "PowerKW": 11,
            "CurrentTypeID": 10
        }
    ],
    "NumberOfPoints": 2,
    "StatusTypeID": 50,
    "DateLastStatusUpdate": "2016-06-04T02:44:00Z",
    "DataQualityLevel": 3,
    "DateCreated": "2015-01-09T06:04:00Z",
    "SubmissionStatusTypeID": 100
}