{
    "IsRecentlyVerified": false,
    "ID": 102368,
    "UUID": "CEC1C269-20E9-42BB-A7C0-AFAC98BEF6E9",
    "DataProviderID": 2,
    "DataProvidersReference": "85979",
    "UsageTypeID": 7,
    "AddressInfo": {
        "ID": 102714,
        "Title": "Gunn Nissan of Denton",
        "AddressLine1": "5650 S Interstate 35 E",
        "Town": "Corinth",
        "StateOrProvince": "TX",
        "Postcode": "76210",
        "CountryID": 2,
        "Latitude": 33.156886,
        "Longitude": -97.06713,
        "ContactTelephone1": "940-270-9000",
        "AccessComments": "Dealership business hours",
        "RelatedURL": "",
        "DistanceUnit": 0
    },
    "Connections": [
        {
            "ID": 144433,
            "ConnectionTypeID": 1,
            "LevelID": 2,
            "Amps": 16,
            "Voltage": 230,
            "PowerKW": 3,
            "CurrentTypeID": 10,
            "Quantity": 2
        },
        {
            "ID": 144434,
            "ConnectionTypeID": 2,
            "LevelID": 2,
            "Amps": 100,
            "Voltage": 400,
            "PowerKW": 40,
            "CurrentTypeID": 10,
            "Quantity": 1
        },
        {
            "ID": 144435,
            "ConnectionTypeID": 32,
            "LevelID": 2,
            "Amps": 100,
            "Voltage": 400,
            "PowerKW": 40,
            "CurrentTypeID": 10,
            "Quantity": 1
        }
    ],
    "DateLastStatusUpdate": "2019-04-06T04:01:00Z",
    "DataQualityLevel": 3,
    "DateCreated": "2018-04-21T04:13:00Z",
    "SubmissionStatusTypeID": 100
}