{
    "IsRecentlyVerified": false,
    "ID": 52303,
    "UUID": "488719D4-CB5E-45F3-86D6-3080FACD708F",
    "DataProviderID": 1,
    "OperatorID": 105,
    "UsageTypeID": 1,
    "AddressInfo": {
        "ID": 52649,
        "Title": "E-Bike Station Rathaus",
        "AddressLine1": "Bahnhofstraße 7",
        "Town": "Lippetal",
        "StateOrProvince": "Kreis Soest",
        "Postcode": "59510",
        "CountryID": 87,
        "Latitude": 51.65739,
        "Longitude": 8.14184999999998,
        "ContactTelephone1": "0800 99 44 009",
        "RelatedURL": "http://www.rwe.com/web/cms/de/494436/e-bikes-on-tour/ladestationen/",
        "DistanceUnit": 0
    },
    "Connections": [
        {
            "ID": 64954,
            "ConnectionTypeID": 28,
            "StatusTypeID": 50,
            "LevelID": 1,
            "Amps": 10,
            "Voltage": 230,
            "PowerKW": 2.3,
            "CurrentTypeID": 10,
            "Quantity": 3
        }
    ],
    "NumberOfPoints": 3,
    "StatusTypeID": 50,
    "DateLastStatusUpdate": "2015-08-28T09:14:00Z",
    "DataQualityLevel": 1,
    "DateCreated": "2015-08-28T07:00:00Z",
    "SubmissionStatusTypeID": 200
}