{
    "IsRecentlyVerified": false,
    "ID": 184706,
    "UUID": "8BB56F1F-82E2-4B54-AD10-D25FCB3CD756",
    "DataProviderID": 29,
    "DataProvidersReference": "169",
    "AddressInfo": {
        "ID": 185065,
        "Title": "Bockelmannstraße",
        "AddressLine1": "Bockelmannstraße",
        "Town": "Lüneburg",
        "Postcode": "21335",
        "CountryID": 87,
        "Latitude": 53.1517,
        "Longitude": 10.2458,
        "DistanceUnit": 0
    },
    "Connections": [
        {
            "ID": 293301,
            "ConnectionTypeID": 28,
            "StatusTypeID": 50,
            "LevelID": 2,
            "PowerKW": 22,
            "CurrentTypeID": 10
        },
        {
            "ID": 293302,
            "ConnectionTypeID": 25,
            "StatusTypeID": 50,
            "LevelID": 2,
            "PowerKW": 22,
            "CurrentTypeID": 20
        }
    ],
    "StatusTypeID": 50,
    "DateLastStatusUpdate": "2021-07-09T03:29:00Z",
    "MetadataValues": [
        {
            "ID": 16997,
            "MetadataFieldID": 4,
            "ItemValue": "Data from the German chargepoint registry provided by Bundesnetzagentur.de under the CC-BY 4.0 license"
        }
    ],
    "DataQualityLevel": 3,
    "DateCreated": "2021-07-08T10:05:00Z",
    "SubmissionStatusTypeID": 100
}