{
    "IsRecentlyVerified": false,
    "ID": 15648,
    "UUID": "45A4407E-CE1F-45F7-BF38-0FFA488C3105",
    "DataProviderID": 1,
    "OperatorID": 1,
    "UsageTypeID": 0,
    "UsageCost": "Free",
    "AddressInfo": {
        "ID": 15993,
        "Title": "Vinoy Renaissance St. Petersburg Resort & Golf Club",
        "AddressLine1": "501 5th Avenue NE",
        "AddressLine2": "",
        "Town": "St. Petersburg",
        "StateOrProvince": "",
        "Postcode": "\t33701 ",
        "CountryID": 2,
        "Latitude": 27.7776777,
        "Longitude": -82.6300526,
        "ContactTelephone1": "    1-727-894-1000",
        "ContactTelephone2": "    1-888-303-4430",
        "ContactEmail": "",
        "AccessComments": "",
        "RelatedURL": "http://www.marriott.com/hotels/travel/tpasr-vinoy-renaissance-st-petersburg-resort-and-golf-club/",
        "DistanceUnit": 0
    },
    "Connections": [],
    "NumberOfPoints": 2,
    "GeneralComments": "",
    "StatusTypeID": 50,
    "DateLastStatusUpdate": "2013-01-20T14:41:00Z",
    "DataQualityLevel": 1,
    "DateCreated": "2013-01-20T14:41:00Z",
    "SubmissionStatusTypeID": 200
}