{
    "UserComments": [
        {
            "ID": 16230,
            "ChargePointID": 38892,
            "CommentTypeID": 10,
            "UserName": "Erna_Schleck",
            "Rating": 4,
            "DateCreated": "2017-04-19T15:06:47.447Z",
            "User": {
                "ID": 4573,
                "Username": "Erna_Schleck"
            },
            "CheckinStatusTypeID": 140
        }
    ],
    "IsRecentlyVerified": false,
    "ID": 38892,
    "UUID": "BFFABA26-1C6D-482D-9CB2-CC9F9F1A24B0",
    "DataProviderID": 1,
    "OperatorID": 105,
    "OperatorsReference": "Essent EM-DE-03358021-01-00004",
    "UsageTypeID": 1,
    "AddressInfo": {
        "ID": 39238,
        "Title": "Designer Outlet",
        "AddressLine1": "Rahrsberg 7",
        "Town": "Soltau",
        "Postcode": "29614",
        "CountryID": 87,
        "Latitude": 52.98301069251599,
        "Longitude": 9.925258360821529,
        "AccessComments": "Auf dem Parkplatz vom Designer Outlet, offen von Mo-Sa 10-20Uhr. Zufahrt: Am der Einfahrt die erste rechts und dann geradeaus. Man fährt auf den \"Marco Polo\" Shop zu. Vor der Shop ist die Ladesäule vom RWE Typ; der Parkplatz ist für Elektroautos reserviert.",
        "DistanceUnit": 0
    },
    "Connections": [
        {
            "ID": 42403,
            "ConnectionTypeID": 25,
            "StatusTypeID": 50,
            "LevelID": 2,
            "PowerKW": 11,
            "Quantity": 2
        }
    ],
    "NumberOfPoints": 2,
    "StatusTypeID": 50,
    "DateLastStatusUpdate": "2017-04-19T15:07:00Z",
    "DataQualityLevel": 3,
    "DateCreated": "2015-01-09T06:08:00Z",
    "SubmissionStatusTypeID": 200
}