{
    "IsRecentlyVerified": false,
    "ID": 144762,
    "UUID": "B1E714A3-B3E6-4A19-B682-A8A162D91AEC",
    "DataProviderID": 2,
    "DataProvidersReference": "130846",
    "OperatorID": 90,
    "UsageTypeID": 1,
    "AddressInfo": {
        "ID": 145114,
        "Title": "369 Contrecoeur",
        "AddressLine1": "369 Rue de Contrecoeur",
        "Town": "Montréal",
        "StateOrProvince": "QC",
        "Postcode": "H1L 3Y4",
        "CountryID": 44,
        "Latitude": 45.609293,
        "Longitude": -73.510792,
        "ContactTelephone1": "877-505-2674",
        "AccessComments": "24 hours daily",
        "RelatedURL": "https://lecircuitelectrique.com/",
        "DistanceUnit": 0
    },
    "Connections": [
        {
            "ID": 201287,
            "ConnectionTypeID": 1,
            "LevelID": 2,
            "Amps": 16,
            "Voltage": 230,
            "PowerKW": 3.7,
            "CurrentTypeID": 10,
            "Quantity": 2
        }
    ],
    "StatusTypeID": 50,
    "DateLastStatusUpdate": "2020-06-26T03:09:00Z",
    "DataQualityLevel": 3,
    "DateCreated": "2019-12-24T09:23:00Z",
    "SubmissionStatusTypeID": 100
}