{
    "MediaItems": [
        {
            "ID": 16156,
            "ChargePointID": 107638,
            "ItemURL": "https://s3-ap-southeast-2.amazonaws.com/openchargemap/images/ES/OCM107638/OCM-107638.orig.2018080317323361.jpg",
            "ItemThumbnailURL": "https://s3-ap-southeast-2.amazonaws.com/openchargemap/images/ES/OCM107638/OCM-107638.thmb.2018080317323361.jpg",
            "Comment": "El acceso de los coches se realiza desde la plaza del Portillo.",
            "IsEnabled": true,
            "IsVideo": false,
            "IsFeaturedItem": false,
            "IsExternalResource": false,
            "User": {
                "ID": 16782,
                "Username": "Amarre"
            },
            "DateCreated": "2018-08-03T17:33:00Z"
        },
        {
            "ID": 16155,
            "ChargePointID": 107638,
            "ItemURL": "https://s3-ap-southeast-2.amazonaws.com/openchargemap/images/ES/OCM107638/OCM-107638.orig.2018080317312057.jpg",
            "ItemThumbnailURL": "https://s3-ap-southeast-2.amazonaws.com/openchargemap/images/ES/OCM107638/OCM-107638.thmb.2018080317312057.jpg",
            "Comment": "2 tomas monofásicas de 32 A Mennekes.",
            "IsEnabled": true,
            "IsVideo": false,
            "IsFeaturedItem": false,
            "IsExternalResource": false,
            "User": {
                "ID": 16782,
                "Username": "Amarre"
            },
            "DateCreated": "2018-08-03T17:32:00Z"
        },
        {
            "ID": 16154,
            "ChargePointID": 107638,
            "ItemURL": "https://s3-ap-southeast-2.amazonaws.com/openchargemap/images/ES/OCM107638/OCM-107638.orig.2018080317301955.jpg",
            "ItemThumbnailURL": "https://s3-ap-southeast-2.amazonaws.com/openchargemap/images/ES/OCM107638/OCM-107638.thmb.2018080317301955.jpg",
            "Comment": "Precisa tarjeta Ibil o alta en la APP de Ibil. Instrucciones de uso.",
            "IsEnabled": true,
            "IsVideo": false,
            "IsFeaturedItem": false,
            "IsExternalResource": false,
            "User": {
                "ID": 16782,
                "Username": "Amarre"
            },
            "DateCreated": "2018-08-03T17:31:00Z"
        },
        {
            "ID": 16153,
            "ChargePointID": 107638,
            "ItemURL": "https://s3-ap-southeast-2.amazonaws.com/openchargemap/images/ES/OCM107638/OCM-107638.orig.2018080317294320.jpg",
            "ItemThumbnailURL": "https://s3-ap-southeast-2.amazonaws.com/openchargemap/images/ES/OCM107638/OCM-107638.thmb.2018080317294320.jpg",
            "Comment": "Toma Mennekes.",
            "IsEnabled": true,
            "IsVideo": false,
            "IsFeaturedItem": false,
            "IsExternalResource": false,
            "User": {
                "ID": 16782,
                "Username": "Amarre"
            },
            "DateCreated": "2018-08-03T17:30:00Z"
        },
        {
            "ID": 16151,
            "ChargePointID": 107638,
            "ItemURL": "https://s3-ap-southeast-2.amazonaws.com/openchargemap/images/ES/OCM107638/OCM-107638.orig.2018080317281982.jpg",
            "ItemThumbnailURL": "https://s3-ap-southeast-2.amazonaws.com/openchargemap/images/ES/OCM107638/OCM-107638.thmb.2018080317281982.jpg",
            "Comment": "8 tomas Schuko para motos eléctricas.",
            "IsEnabled": true,
            "IsVideo": false,
            "IsFeaturedItem": false,
            "IsExternalResource": false,
            "User": {
                "ID": 16782,
                "Username": "Amarre"
            },
            "DateCreated": "2018-08-03T17:29:00Z"
        },
        {
            "ID": 16152,
            "ChargePointID": 107638,
            "ItemURL": "https://s3-ap-southeast-2.amazonaws.com/openchargemap/images/ES/OCM107638/OCM-107638.orig.2018080317290264.jpg",
            "ItemThumbnailURL": "https://s3-ap-southeast-2.amazonaws.com/openchargemap/images/ES/OCM107638/OCM-107638.thmb.2018080317290264.jpg",
            "Comment": "Toma Mennekes.",
            "IsEnabled": true,
            "IsVideo": false,
            "IsFeaturedItem": false,
            "IsExternalResource": false,
            "User": {
                "ID": 16782,
                "Username": "Amarre"
            },
            "DateCreated": "2018-08-03T17:29:00Z"
        },
        {
            "ID": 16150,
            "ChargePointID": 107638,
            "ItemURL": "https://s3-ap-southeast-2.amazonaws.com/openchargemap/images/ES/OCM107638/OCM-107638.orig.2018080317274060.jpg",
            "ItemThumbnailURL": "https://s3-ap-southeast-2.amazonaws.com/openchargemap/images/ES/OCM107638/OCM-107638.thmb.2018080317274060.jpg",
            "Comment": "8 tomas Schuko para motos eléctricas.",
            "IsEnabled": true,
            "IsVideo": false,
            "IsFeaturedItem": false,
            "IsExternalResource": false,
            "User": {
                "ID": 16782,
                "Username": "Amarre"
            },
            "DateCreated": "2018-08-03T17:28:00Z"
        },
        {
            "ID": 16149,
            "ChargePointID": 107638,
            "ItemURL": "https://s3-ap-southeast-2.amazonaws.com/openchargemap/images/ES/OCM107638/OCM-107638.orig.2018080317264767.jpg",
            "ItemThumbnailURL": "https://s3-ap-southeast-2.amazonaws.com/openchargemap/images/ES/OCM107638/OCM-107638.thmb.2018080317264767.jpg",
            "Comment": "Toma Schuko.",
            "IsEnabled": true,
            "IsVideo": false,
            "IsFeaturedItem": false,
            "IsExternalResource": false,
            "User": {
                "ID": 16782,
                "Username": "Amarre"
            },
            "DateCreated": "2018-08-03T17:27:00Z"
        },
        {
            "ID": 16148,
            "ChargePointID": 107638,
            "ItemURL": "https://s3-ap-southeast-2.amazonaws.com/openchargemap/images/ES/OCM107638/OCM-107638.orig.2018080317254279.jpg",
            "ItemThumbnailURL": "https://s3-ap-southeast-2.amazonaws.com/openchargemap/images/ES/OCM107638/OCM-107638.thmb.2018080317254279.jpg",
            "Comment": "Poste para la carga Mennekes.",
            "IsEnabled": true,
            "IsVideo": false,
            "IsFeaturedItem": false,
            "IsExternalResource": false,
            "User": {
                "ID": 16782,
                "Username": "Amarre"
            },
            "DateCreated": "2018-08-03T17:26:00Z"
        },
        {
            "ID": 16147,
            "ChargePointID": 107638,
            "ItemURL": "https://s3-ap-southeast-2.amazonaws.com/openchargemap/images/ES/OCM107638/OCM-107638.orig.2018080317245228.jpg",
            "ItemThumbnailURL": "https://s3-ap-southeast-2.amazonaws.com/openchargemap/images/ES/OCM107638/OCM-107638.thmb.2018080317245228.jpg",
            "Comment": "",
            "IsEnabled": true,
            "IsVideo": false,
            "IsFeaturedItem": false,
            "IsExternalResource": false,
            "User": {
                "ID": 16782,
                "Username": "Amarre"
            },
            "DateCreated": "2018-08-03T17:25:00Z"
        },
        {
            "ID": 16146,
            "ChargePointID": 107638,
            "ItemURL": "https://s3-ap-southeast-2.amazonaws.com/openchargemap/images/ES/OCM107638/OCM-107638.orig.2018080317225858.jpg",
            "ItemThumbnailURL": "https://s3-ap-southeast-2.amazonaws.com/openchargemap/images/ES/OCM107638/OCM-107638.thmb.2018080317225858.jpg",
            "Comment": "Precisa tarjeta Ibil o alta en la APP de Ibil. Instrucciones de uso.",
            "IsEnabled": true,
            "IsVideo": false,
            "IsFeaturedItem": false,
            "IsExternalResource": false,
            "User": {
                "ID": 16782,
                "Username": "Amarre"
            },
            "DateCreated": "2018-08-03T17:23:00Z"
        },
        {
            "ID": 16144,
            "ChargePointID": 107638,
            "ItemURL": "https://s3-ap-southeast-2.amazonaws.com/openchargemap/images/ES/OCM107638/OCM-107638.orig.2018080317212545.jpg",
            "ItemThumbnailURL": "https://s3-ap-southeast-2.amazonaws.com/openchargemap/images/ES/OCM107638/OCM-107638.thmb.2018080317212545.jpg",
            "Comment": "",
            "IsEnabled": true,
            "IsVideo": false,
            "IsFeaturedItem": false,
            "IsExternalResource": false,
            "User": {
                "ID": 16782,
                "Username": "Amarre"
            },
            "DateCreated": "2018-08-03T17:22:00Z"
        },
        {
            "ID": 16145,
            "ChargePointID": 107638,
            "ItemURL": "https://s3-ap-southeast-2.amazonaws.com/openchargemap/images/ES/OCM107638/OCM-107638.orig.2018080317221221.jpg",
            "ItemThumbnailURL": "https://s3-ap-southeast-2.amazonaws.com/openchargemap/images/ES/OCM107638/OCM-107638.thmb.2018080317221221.jpg",
            "Comment": "Toma Mennekes sin cable.",
            "IsEnabled": true,
            "IsVideo": false,
            "IsFeaturedItem": false,
            "IsExternalResource": false,
            "User": {
                "ID": 16782,
                "Username": "Amarre"
            },
            "DateCreated": "2018-08-03T17:22:00Z"
        }
    ],
    "IsRecentlyVerified": false,
    "ID": 107638,
    "UUID": "9B391B3E-3073-43B0-B8B5-A7FB2415E4CC",
    "DataProviderID": 1,
    "OperatorID": 91,
    "UsageTypeID": 4,
    "AddressInfo": {
        "ID": 107984,
        "Title": "Ibil Plaza de Toros Zaragoza",
        "AddressLine1": "Glorieta José Aznárez",
        "Town": "Zaragoza",
        "Postcode": "50004",
        "CountryID": 210,
        "Latitude": 41.6546273295467,
        "Longitude": -0.890720266120752,
        "ContactTelephone1": "902 540 810 ",
        "ContactEmail": "atencionalcliente@ibil.es",
        "AccessComments": "Esquina de la calle Gómez Salvo, Glorieta José Aznárez y la calle Ramón Pignatelli. Junto a la plaza de Toros de la Misericordia.",
        "RelatedURL": "https://www.ibil.es",
        "DistanceUnit": 0
    },
    "Connections": [
        {
            "ID": 151905,
            "ConnectionTypeID": 25,
            "StatusTypeID": 50,
            "LevelID": 2,
            "Amps": 32,
            "Voltage": 230,
            "PowerKW": 7,
            "CurrentTypeID": 10,
            "Quantity": 2
        },
        {
            "ID": 151906,
            "ConnectionTypeID": 28,
            "StatusTypeID": 50,
            "LevelID": 1,
            "Amps": 10,
            "Voltage": 230,
            "PowerKW": 2.3,
            "CurrentTypeID": 10,
            "Quantity": 8
        }
    ],
    "NumberOfPoints": 2,
    "GeneralComments": "Precisa tarjeta Ibil o alta en la APP de Ibil.",
    "StatusTypeID": 50,
    "DateLastStatusUpdate": "2018-08-03T19:54:00Z",
    "DataQualityLevel": 1,
    "DateCreated": "2018-08-03T17:20:00Z",
    "SubmissionStatusTypeID": 200
}