{
    "IsRecentlyVerified": false,
    "ID": 43585,
    "UUID": "7431E0B3-C7BD-4E03-B096-D8D04913F941",
    "DataProviderID": 1,
    "OperatorID": 160,
    "UsageTypeID": 4,
    "UsageCost": "0",
    "AddressInfo": {
        "ID": 43931,
        "Title": "Bahnhof Radebeul",
        "AddressLine1": "Sidonienstraße 1c",
        "Town": "Radebeul",
        "StateOrProvince": "Landkreis Meißen",
        "Postcode": "01445",
        "CountryID": 87,
        "Latitude": 51.0988822005164,
        "Longitude": 13.6800012222291,
        "AccessComments": "Ein kostenloser Parkplatz am Vorplatz der Eingänge zum Bahnhof neben den überdachten Fahrradstellplätzen. 24/7 nutzbar im Verbund StromTicket.",
        "RelatedURL": "http://www.stadtwerke-elbtal.de/",
        "DistanceUnit": 0
    },
    "Connections": [
        {
            "ID": 52872,
            "ConnectionTypeID": 25,
            "StatusTypeID": 50,
            "LevelID": 2,
            "Amps": 16,
            "Voltage": 400,
            "PowerKW": 11,
            "CurrentTypeID": 20,
            "Quantity": 2
        },
        {
            "ID": 52873,
            "ConnectionTypeID": 28,
            "StatusTypeID": 50,
            "LevelID": 2,
            "Amps": 16,
            "Voltage": 230,
            "PowerKW": 3.7,
            "CurrentTypeID": 10,
            "Quantity": 2
        }
    ],
    "NumberOfPoints": 1,
    "StatusTypeID": 50,
    "DateLastStatusUpdate": "2015-04-07T19:59:00Z",
    "DataQualityLevel": 1,
    "DateCreated": "2015-04-07T14:24:00Z",
    "SubmissionStatusTypeID": 200
}