{
    "IsRecentlyVerified": false,
    "ID": 82342,
    "UUID": "E59E25E5-50D0-4F3D-B3D0-18032D437050",
    "DataProviderID": 1,
    "OperatorID": 23,
    "OperatorsReference": "6798",
    "UsageTypeID": 6,
    "AddressInfo": {
        "ID": 82688,
        "Title": "The Ritz-Carlton, Rancho Mirage",
        "AddressLine1": "68900 Frank Sinatra DR",
        "Town": "Rancho Mirage",
        "StateOrProvince": "CA",
        "Postcode": "92270",
        "CountryID": 2,
        "Latitude": 33.766815,
        "Longitude": -116.45826,
        "ContactTelephone1": "(760) 321-8282",
        "DistanceUnit": 0
    },
    "Connections": [
        {
            "ID": 117108,
            "ConnectionTypeID": 30,
            "StatusTypeID": 50,
            "LevelID": 2,
            "PowerKW": 13,
            "CurrentTypeID": 20,
            "Quantity": 4
        }
    ],
    "NumberOfPoints": 4,
    "GeneralComments": "4 Tesla Connectors, up to 13kW.Available for patrons only. Please see valet.",
    "StatusTypeID": 50,
    "DateLastStatusUpdate": "2017-02-16T11:07:00Z",
    "DataQualityLevel": 1,
    "DateCreated": "2017-02-03T15:38:00Z",
    "SubmissionStatusTypeID": 200
}