{
    "IsRecentlyVerified": false,
    "ID": 111899,
    "UUID": "795EDE35-8CF8-4D9C-9EBF-B178D8BC007E",
    "DataProviderID": 2,
    "DataProvidersReference": "103580",
    "OperatorID": 59,
    "UsageTypeID": 1,
    "AddressInfo": {
        "ID": 112245,
        "Title": "Greenlots - 33109",
        "AddressLine1": "32136 Lougheed",
        "Town": "Mission",
        "StateOrProvince": "BC",
        "Postcode": "V2V 1A4",
        "CountryID": 44,
        "Latitude": 49.1311683654785,
        "Longitude": -122.333671569824,
        "ContactTelephone1": "855-900-7584",
        "AccessComments": "24 hours daily",
        "RelatedURL": "http://greenlots.com/",
        "DistanceUnit": 0
    },
    "Connections": [
        {
            "ID": 157410,
            "ConnectionTypeID": 2,
            "LevelID": 3,
            "Amps": 100,
            "Voltage": 400,
            "PowerKW": 40,
            "CurrentTypeID": 30,
            "Quantity": 1
        },
        {
            "ID": 157411,
            "ConnectionTypeID": 32,
            "LevelID": 3,
            "Amps": 100,
            "Voltage": 400,
            "PowerKW": 40,
            "CurrentTypeID": 30,
            "Quantity": 1
        }
    ],
    "StatusTypeID": 0,
    "DateLastStatusUpdate": "2019-12-24T09:25:00Z",
    "DataQualityLevel": 3,
    "DateCreated": "2018-10-18T23:37:00Z",
    "SubmissionStatusTypeID": 100
}