{
    "IsRecentlyVerified": false,
    "ID": 116262,
    "UUID": "FB14322A-BAD0-43E7-9599-165E91E97914",
    "DataProviderID": 1,
    "DataProvidersReference": "5281",
    "AddressInfo": {
        "ID": 116608,
        "Title": "Kävlinge Kommun Fastigheten Porten 14",
        "AddressLine1": "Mårtensgatan 11",
        "Town": "KÄVLINGE",
        "StateOrProvince": "SKÅNE",
        "Postcode": "24430",
        "CountryID": 216,
        "Latitude": 55.790571,
        "Longitude": 13.109975,
        "AccessComments": "Kävlinge Kommun Fastigheten Porten 14",
        "DistanceUnit": 0
    },
    "Connections": [
        {
            "ID": 163459,
            "ConnectionTypeID": 0,
            "Reference": "1",
            "LevelID": 2,
            "Amps": 32,
            "Voltage": 400,
            "PowerKW": 22,
            "Comments": "Mode 3"
        },
        {
            "ID": 163460,
            "ConnectionTypeID": 0,
            "Reference": "2",
            "LevelID": 2,
            "Amps": 32,
            "Voltage": 400,
            "PowerKW": 22,
            "Comments": "Mode 3"
        }
    ],
    "NumberOfPoints": 2,
    "DateLastStatusUpdate": "2020-05-26T08:21:00Z",
    "DataQualityLevel": 2,
    "DateCreated": "2019-02-11T09:16:00Z",
    "SubmissionStatusTypeID": 100
}