{
    "IsRecentlyVerified": false,
    "ID": 139577,
    "UUID": "8391183C-CB9E-45D1-A8F7-2AA506C8EB90",
    "DataProviderID": 2,
    "DataProvidersReference": "82539",
    "OperatorID": 5,
    "UsageTypeID": 1,
    "AddressInfo": {
        "ID": 139929,
        "Title": "COBB COUNTY",
        "AddressLine1": "4400 Lower Roswell Rd",
        "Town": "Marietta",
        "StateOrProvince": "GA",
        "Postcode": "30068",
        "CountryID": 2,
        "Latitude": 33.9631847,
        "Longitude": -84.4235447,
        "ContactTelephone1": "888-758-4389",
        "AccessComments": "24 hours daily",
        "RelatedURL": "http://www.chargepoint.com/",
        "DistanceUnit": 0
    },
    "Connections": [
        {
            "ID": 194984,
            "ConnectionTypeID": 1,
            "LevelID": 2,
            "Amps": 16,
            "Voltage": 230,
            "PowerKW": 3,
            "CurrentTypeID": 10,
            "Quantity": 2
        }
    ],
    "StatusTypeID": 50,
    "DateLastStatusUpdate": "2019-12-24T09:11:00Z",
    "DataQualityLevel": 3,
    "DateCreated": "2019-12-24T09:11:00Z",
    "SubmissionStatusTypeID": 100
}