{
    "IsRecentlyVerified": false,
    "ID": 63666,
    "UUID": "467B4358-FC6D-48A0-91F0-405586BC302B",
    "DataProviderID": 26,
    "DataProvidersReference": "82445",
    "OperatorID": 157,
    "OperatorsReference": "NewMotion 03990541",
    "UsageCost": "0.00 jaarabonnement",
    "AddressInfo": {
        "ID": 64012,
        "Title": "Snoeckgensheuvel 56",
        "AddressLine1": "Snoeckgensheuvel 56",
        "Town": "Amersfoort",
        "Postcode": "3817 HN",
        "CountryID": 159,
        "Latitude": 52.1436584,
        "Longitude": 5.3950922,
        "ContactTelephone1": "088 0109500",
        "RelatedURL": "http://thenewmotion.nl/",
        "DistanceUnit": 0
    },
    "Connections": [
        {
            "ID": 81265,
            "ConnectionTypeID": 25,
            "LevelID": 2,
            "PowerKW": 3.7,
            "CurrentTypeID": 10
        }
    ],
    "NumberOfPoints": 1,
    "StatusTypeID": 50,
    "DateLastStatusUpdate": "2016-06-04T02:50:00Z",
    "DataQualityLevel": 3,
    "DateCreated": "2016-03-03T12:31:00Z",
    "SubmissionStatusTypeID": 100
}