{
    "IsRecentlyVerified": false,
    "ID": 120300,
    "UUID": "BB1D1148-595C-4882-9240-C050813916FE",
    "DataProviderID": 2,
    "DataProvidersReference": "39760",
    "UsageTypeID": 7,
    "AddressInfo": {
        "ID": 120646,
        "Title": "Douglas Nissan",
        "AddressLine1": "5605 Legendlake Pkwy",
        "Town": "Waco",
        "StateOrProvince": "TX",
        "Postcode": "76712",
        "CountryID": 2,
        "Latitude": 31.495348,
        "Longitude": -97.160226,
        "ContactTelephone1": "254-776-8016",
        "AccessComments": "Dealership business hours\r\nPublic - Call ahead",
        "RelatedURL": "",
        "DistanceUnit": 0
    },
    "Connections": [
        {
            "ID": 169634,
            "ConnectionTypeID": 1,
            "LevelID": 2,
            "Amps": 16,
            "Voltage": 230,
            "PowerKW": 3.7,
            "CurrentTypeID": 10,
            "Quantity": 1
        }
    ],
    "DateLastStatusUpdate": "2020-06-26T02:54:00Z",
    "DataQualityLevel": 3,
    "DateCreated": "2019-04-01T04:59:00Z",
    "SubmissionStatusTypeID": 100
}