{
    "IsRecentlyVerified": false,
    "ID": 56576,
    "UUID": "4B9EF83E-93C8-40D3-9C87-27ECEFE8D6B8",
    "DataProviderID": 1,
    "OperatorID": 23,
    "OperatorsReference": "27523",
    "UsageTypeID": 1,
    "AddressInfo": {
        "ID": 56922,
        "Title": "Park Hyatt Beaver Creek Resort and Spa - Tesla",
        "AddressLine1": "50 W Thomas Pl",
        "Town": "Beaver Creek",
        "StateOrProvince": "CO",
        "Postcode": "81620",
        "CountryID": 2,
        "Latitude": 39.6030452,
        "Longitude": -106.5179766,
        "ContactTelephone1": "970-949-1234  877-798-3752",
        "AccessComments": "24 hours daily; for Tesla use only; for patron use only; see valet for access",
        "RelatedURL": "http://www.teslamotors.com/supercharger",
        "DistanceUnit": 0
    },
    "Connections": [
        {
            "ID": 71335,
            "ConnectionTypeID": 30,
            "StatusTypeID": 50,
            "LevelID": 2,
            "Amps": 16,
            "Voltage": 230,
            "PowerKW": 16,
            "CurrentTypeID": 10,
            "Quantity": 2
        }
    ],
    "NumberOfPoints": 2,
    "StatusTypeID": 50,
    "DateLastStatusUpdate": "2017-04-22T05:24:00Z",
    "DataQualityLevel": 3,
    "DateCreated": "2015-11-04T08:42:00Z",
    "SubmissionStatusTypeID": 100
}