{
    "IsRecentlyVerified": false,
    "ID": 182533,
    "UUID": "244022DF-DFCA-4A1D-9ECD-85131CDBA8A0",
    "DataProviderID": 29,
    "DataProvidersReference": "16643",
    "OperatorID": 159,
    "AddressInfo": {
        "ID": 182892,
        "Title": "Herdecker Str. 66",
        "AddressLine1": "Herdecker Str. 66",
        "Town": "Witten",
        "Postcode": "58453",
        "CountryID": 87,
        "Latitude": 51.43828072,
        "Longitude": 7.385804235,
        "DistanceUnit": 0
    },
    "Connections": [
        {
            "ID": 288394,
            "ConnectionTypeID": 25,
            "StatusTypeID": 50,
            "LevelID": 2,
            "PowerKW": 22,
            "CurrentTypeID": 20
        },
        {
            "ID": 288395,
            "ConnectionTypeID": 25,
            "StatusTypeID": 50,
            "LevelID": 2,
            "PowerKW": 22,
            "CurrentTypeID": 20
        }
    ],
    "StatusTypeID": 50,
    "DateLastStatusUpdate": "2021-07-12T02:47:00Z",
    "MetadataValues": [
        {
            "ID": 14826,
            "MetadataFieldID": 4,
            "ItemValue": "Data from the German chargepoint registry provided by Bundesnetzagentur.de under the CC-BY 4.0 license"
        }
    ],
    "DataQualityLevel": 3,
    "DateCreated": "2021-07-08T10:03:00Z",
    "SubmissionStatusTypeID": 100
}