{
    "IsRecentlyVerified": false,
    "ID": 186327,
    "UUID": "2EE56FC5-ACFC-461C-A0F5-E359C4983E25",
    "DataProviderID": 29,
    "DataProvidersReference": "17974",
    "OperatorID": 140,
    "AddressInfo": {
        "ID": 186686,
        "Title": "Evesham-Allee 4",
        "AddressLine1": "Evesham-Allee 4",
        "Town": "Melsungen",
        "Postcode": "34212",
        "CountryID": 87,
        "Latitude": 51.122287,
        "Longitude": 9.550713,
        "DistanceUnit": 0
    },
    "Connections": [
        {
            "ID": 298749,
            "ConnectionTypeID": 25,
            "StatusTypeID": 50,
            "LevelID": 2,
            "PowerKW": 22,
            "CurrentTypeID": 20
        },
        {
            "ID": 298750,
            "ConnectionTypeID": 25,
            "StatusTypeID": 50,
            "LevelID": 2,
            "PowerKW": 22,
            "CurrentTypeID": 20
        }
    ],
    "StatusTypeID": 50,
    "DateLastStatusUpdate": "2021-07-12T02:46:00Z",
    "MetadataValues": [
        {
            "ID": 18568,
            "MetadataFieldID": 4,
            "ItemValue": "Data from the German chargepoint registry provided by Bundesnetzagentur.de under the CC-BY 4.0 license"
        }
    ],
    "DataQualityLevel": 3,
    "DateCreated": "2021-07-12T02:46:00Z",
    "SubmissionStatusTypeID": 100
}