{
    "IsRecentlyVerified": false,
    "ID": 138098,
    "UUID": "D91A654C-E9A7-4CF9-B72C-CB5225ED7E33",
    "DataProviderID": 2,
    "DataProvidersReference": "82387",
    "OperatorID": 5,
    "UsageTypeID": 1,
    "AddressInfo": {
        "ID": 138447,
        "Title": "Target Corp",
        "AddressLine1": "74-5455 Makala Blvd",
        "Town": "Kailua-Kona",
        "StateOrProvince": "HI",
        "Postcode": "96740",
        "CountryID": 2,
        "Latitude": 19.647969,
        "Longitude": -156.003624,
        "ContactTelephone1": "888-758-4389  808-334-4020",
        "AccessComments": "6am-11pm daily",
        "RelatedURL": "http://www.chargepoint.com/",
        "DistanceUnit": 0
    },
    "Connections": [
        {
            "ID": 193153,
            "ConnectionTypeID": 1,
            "LevelID": 2,
            "Amps": 16,
            "Voltage": 230,
            "PowerKW": 3.7,
            "CurrentTypeID": 10,
            "Quantity": 4
        }
    ],
    "StatusTypeID": 50,
    "DateLastStatusUpdate": "2020-06-26T02:52:00Z",
    "DataQualityLevel": 3,
    "DateCreated": "2019-12-24T09:07:00Z",
    "SubmissionStatusTypeID": 100
}