{
    "IsRecentlyVerified": false,
    "ID": 82356,
    "UUID": "DA87FF1A-1D16-4A89-8664-62E27DB52E12",
    "DataProviderID": 1,
    "OperatorID": 23,
    "OperatorsReference": "20136",
    "UsageTypeID": 6,
    "AddressInfo": {
        "ID": 82702,
        "Title": "Hotel Christiansminde",
        "AddressLine1": "16 Christiansmindevej",
        "Town": "Svendborg",
        "Postcode": "5700",
        "CountryID": 65,
        "Latitude": 55.060427,
        "Longitude": 10.635765,
        "ContactTelephone1": "+45 62 21 90 00",
        "DistanceUnit": 0
    },
    "Connections": [
        {
            "ID": 117122,
            "ConnectionTypeID": 30,
            "StatusTypeID": 50,
            "LevelID": 2,
            "Amps": 32,
            "Voltage": 400,
            "PowerKW": 22,
            "CurrentTypeID": 20,
            "Quantity": 3
        }
    ],
    "NumberOfPoints": 3,
    "GeneralComments": "3 Tesla Connectors, up to 22kW.Available for patrons only. Please see front desk.",
    "StatusTypeID": 50,
    "DateLastStatusUpdate": "2018-10-03T14:20:00Z",
    "DataQualityLevel": 1,
    "DateCreated": "2017-02-03T15:41:00Z",
    "SubmissionStatusTypeID": 200
}