{
    "IsRecentlyVerified": false,
    "ID": 159143,
    "UUID": "D6F3C50B-4CAC-4198-B582-2741673708B3",
    "DataProviderID": 2,
    "DataProvidersReference": "153123",
    "OperatorID": 5,
    "UsageTypeID": 1,
    "AddressInfo": {
        "ID": 159500,
        "Title": "CITY OF CORTEZ",
        "AddressLine1": "803 E Montezuma Ave",
        "Town": "Cortez",
        "StateOrProvince": "CO",
        "Postcode": "81321",
        "CountryID": 2,
        "Latitude": 37.350136,
        "Longitude": -108.57313,
        "ContactTelephone1": "888-758-4389",
        "AccessComments": "24 hours daily",
        "RelatedURL": "http://www.chargepoint.com/",
        "DistanceUnit": 0
    },
    "Connections": [
        {
            "ID": 229241,
            "ConnectionTypeID": 1,
            "LevelID": 2,
            "Amps": 16,
            "Voltage": 230,
            "PowerKW": 3.7,
            "CurrentTypeID": 10,
            "Quantity": 2
        }
    ],
    "StatusTypeID": 50,
    "DateLastStatusUpdate": "2020-06-26T02:59:00Z",
    "DataQualityLevel": 3,
    "DateCreated": "2020-06-26T02:59:00Z",
    "SubmissionStatusTypeID": 100
}