{
    "IsRecentlyVerified": false,
    "ID": 116515,
    "UUID": "EF3EE486-0F0F-47E9-9641-9E7E50A615E8",
    "DataProviderID": 19,
    "DataProvidersReference": "5085",
    "AddressInfo": {
        "ID": 116861,
        "Title": "Kälarne Hälsocentral",
        "AddressLine1": "Tallgläntan 1D",
        "Town": "KÄLARNE",
        "StateOrProvince": "JÄMTLAND",
        "Postcode": "84064",
        "CountryID": 216,
        "Latitude": 62.97892,
        "Longitude": 16.08345,
        "AccessComments": "För Region JHs elbilar och laddhybrider samt för besökare\r0696-166 60",
        "DistanceUnit": 0
    },
    "Connections": [
        {
            "ID": 164821,
            "ConnectionTypeID": 25,
            "Reference": "1",
            "LevelID": 2,
            "Amps": 16,
            "Voltage": 400,
            "PowerKW": 11.1,
            "CurrentTypeID": 20,
            "Comments": "Mode 3"
        },
        {
            "ID": 164822,
            "ConnectionTypeID": 25,
            "Reference": "2",
            "LevelID": 2,
            "Amps": 16,
            "Voltage": 400,
            "PowerKW": 11.1,
            "CurrentTypeID": 20,
            "Comments": "Mode 3"
        }
    ],
    "NumberOfPoints": 2,
    "DateLastStatusUpdate": "2019-02-11T09:16:00Z",
    "DataQualityLevel": 2,
    "DateCreated": "2019-02-11T09:16:00Z",
    "SubmissionStatusTypeID": 100
}