{
    "IsRecentlyVerified": false,
    "ID": 103531,
    "UUID": "BD449438-015C-415A-BEF2-69B5D1A51024",
    "DataProviderID": 1,
    "OperatorID": 23,
    "OperatorsReference": "42737",
    "UsageTypeID": 4,
    "AddressInfo": {
        "ID": 103877,
        "Title": "Courtyard Paris Roissy CDG",
        "AddressLine1": "1 Rue de la Chapelle",
        "Town": "Le Mesnil Amelot",
        "Postcode": "77990",
        "CountryID": 80,
        "Latitude": 49.02226,
        "Longitude": 2.599887,
        "ContactTelephone1": "+33 1 60 03 63 00",
        "DistanceUnit": 0
    },
    "Connections": [
        {
            "ID": 146198,
            "ConnectionTypeID": 30,
            "StatusTypeID": 50,
            "LevelID": 2,
            "Amps": 32,
            "Voltage": 230,
            "PowerKW": 17,
            "CurrentTypeID": 20,
            "Quantity": 1
        }
    ],
    "NumberOfPoints": 1,
    "GeneralComments": "1 Tesla Connector, up to 17kW.Available for customers. Self park.",
    "StatusTypeID": 50,
    "DateLastStatusUpdate": "2018-10-03T21:28:00Z",
    "DataQualityLevel": 1,
    "DateCreated": "2018-05-04T05:35:00Z",
    "SubmissionStatusTypeID": 200
}