{
    "MediaItems": [
        {
            "ID": 18102,
            "ChargePointID": 125395,
            "ItemURL": "https://s3-ap-southeast-2.amazonaws.com/openchargemap/images/CR/OCM125395/OCM-125395.orig.2019041618163859.jpg",
            "ItemThumbnailURL": "https://s3-ap-southeast-2.amazonaws.com/openchargemap/images/CR/OCM125395/OCM-125395.thmb.2019041618163859.jpg",
            "Comment": "",
            "IsEnabled": true,
            "IsVideo": false,
            "IsFeaturedItem": false,
            "IsExternalResource": false,
            "User": {
                "ID": 20203,
                "Username": "Carloswlkr"
            },
            "DateCreated": "2019-04-16T18:17:00Z"
        }
    ],
    "IsRecentlyVerified": false,
    "ID": 125395,
    "UUID": "8EC04276-7465-4DC7-86A9-4A3C2BE16A16",
    "DataProviderID": 1,
    "OperatorID": 1,
    "UsageTypeID": 1,
    "AddressInfo": {
        "ID": 125741,
        "Title": "Centro Plaza Liberia",
        "AddressLine1": "Dentro del Mall Centro Plaza Liberia",
        "Town": "Liberia",
        "StateOrProvince": "Guanacaste",
        "CountryID": 58,
        "Latitude": 10.6176702210248,
        "Longitude": -85.4375126897481,
        "DistanceUnit": 0
    },
    "Connections": [
        {
            "ID": 175715,
            "ConnectionTypeID": 1,
            "StatusTypeID": 50,
            "LevelID": 2,
            "Amps": 32,
            "Voltage": 240,
            "PowerKW": 7,
            "CurrentTypeID": 10,
            "Quantity": 1
        }
    ],
    "NumberOfPoints": 1,
    "GeneralComments": "Utiliza tarjeta ICE",
    "StatusTypeID": 50,
    "DateLastStatusUpdate": "2019-05-12T19:07:00Z",
    "DataQualityLevel": 1,
    "DateCreated": "2019-04-16T18:16:00Z",
    "SubmissionStatusTypeID": 200
}