{
    "IsRecentlyVerified": false,
    "ID": 17848,
    "UUID": "874EE758-0FB1-4A8D-9D82-F3F39F1B0DAA",
    "DataProviderID": 22,
    "DataProvidersReference": "5075DC36E6FB5B2F19A38AC28D8A7FCA",
    "AddressInfo": {
        "ID": 18193,
        "Title": "セルフ２４岡谷店",
        "AddressLine1": "長野県岡谷市長地権現町3-2-5",
        "CountryID": 114,
        "Latitude": 36.06602001,
        "Longitude": 138.0721163,
        "ContactTelephone1": "0266-26-4777",
        "DistanceUnit": 0
    },
    "Connections": [
        {
            "ID": 18089,
            "ConnectionTypeID": 2,
            "LevelID": 2,
            "Amps": 100,
            "Voltage": 480,
            "PowerKW": 48,
            "Quantity": 1
        }
    ],
    "DateLastStatusUpdate": "2013-06-29T09:04:00Z",
    "DataQualityLevel": 2,
    "DateCreated": "2013-06-29T09:04:00Z",
    "SubmissionStatusTypeID": 200
}