{
    "IsRecentlyVerified": false,
    "ID": 142081,
    "UUID": "54E3E76F-6BD0-4C69-8ECC-AF9140B80594",
    "DataProviderID": 2,
    "DataProvidersReference": "149271",
    "OperatorID": 5,
    "UsageTypeID": 1,
    "AddressInfo": {
        "ID": 142433,
        "Title": "POND PATH",
        "AddressLine1": "1715 38th St",
        "Town": "Boulder",
        "StateOrProvince": "CO",
        "Postcode": "80301",
        "CountryID": 2,
        "Latitude": 40.016878,
        "Longitude": -105.2446,
        "ContactTelephone1": "888-758-4389",
        "AccessComments": "24 hours daily",
        "RelatedURL": "http://www.chargepoint.com/",
        "DistanceUnit": 0
    },
    "Connections": [
        {
            "ID": 198147,
            "ConnectionTypeID": 1,
            "LevelID": 2,
            "Amps": 16,
            "Voltage": 230,
            "PowerKW": 3.7,
            "CurrentTypeID": 10,
            "Quantity": 4
        }
    ],
    "StatusTypeID": 50,
    "DateLastStatusUpdate": "2020-06-26T03:02:00Z",
    "DataQualityLevel": 3,
    "DateCreated": "2019-12-24T09:17:00Z",
    "SubmissionStatusTypeID": 100
}