{
    "IsRecentlyVerified": false,
    "ID": 141696,
    "UUID": "68CB69D6-0FB4-4F77-A325-6758BEA916C0",
    "DataProviderID": 2,
    "DataProvidersReference": "95714",
    "OperatorID": 9,
    "UsageTypeID": 2,
    "AddressInfo": {
        "ID": 142048,
        "Title": "Kroger Blue Ash Technical Center",
        "AddressLine1": "11450 Grooms Road",
        "Town": "Cincinnati",
        "StateOrProvince": "OH",
        "Postcode": "45252",
        "CountryID": 2,
        "Latitude": 39.275191,
        "Longitude": -84.364774,
        "ContactTelephone1": "888-998-2546",
        "AccessComments": "MON: 24 hours | TUE: 24 hours | WED: 24 hours | THU: 24 hours | FRI: 24 hours | SAT: 24 hours | SUN: 24 hours",
        "RelatedURL": "http://www.blinkcharging.com/",
        "DistanceUnit": 0
    },
    "Connections": [
        {
            "ID": 197686,
            "ConnectionTypeID": 1,
            "LevelID": 2,
            "Amps": 16,
            "Voltage": 230,
            "PowerKW": 3.7,
            "CurrentTypeID": 10,
            "Quantity": 2
        }
    ],
    "StatusTypeID": 50,
    "DateLastStatusUpdate": "2020-06-26T03:01:00Z",
    "DataQualityLevel": 3,
    "DateCreated": "2019-12-24T09:16:00Z",
    "SubmissionStatusTypeID": 100
}