{
    "IsRecentlyVerified": false,
    "ID": 125166,
    "UUID": "E478AF09-91A9-4573-9ECC-7BDD969327B3",
    "DataProviderID": 1,
    "OperatorID": 23,
    "OperatorsReference": "49682",
    "UsageTypeID": 4,
    "AddressInfo": {
        "ID": 125512,
        "Title": "Longhouse Reserve",
        "AddressLine1": "133 Hands Creek RD",
        "Town": "East Hampton",
        "StateOrProvince": "New York",
        "Postcode": "11937",
        "CountryID": 2,
        "Latitude": 40.982212,
        "Longitude": -72.200115,
        "ContactTelephone1": "(631) 329-3568",
        "DistanceUnit": 0
    },
    "Connections": [
        {
            "ID": 175422,
            "ConnectionTypeID": 30,
            "StatusTypeID": 50,
            "LevelID": 2,
            "PowerKW": 10,
            "CurrentTypeID": 10,
            "Quantity": 4
        }
    ],
    "NumberOfPoints": 4,
    "GeneralComments": "4 Tesla Connectors, up to 10kW.Available to the public. Self park.",
    "StatusTypeID": 50,
    "DateLastStatusUpdate": "2019-04-11T06:04:00Z",
    "DataQualityLevel": 1,
    "DateCreated": "2019-04-11T06:04:00Z",
    "SubmissionStatusTypeID": 200
}