{
    "IsRecentlyVerified": false,
    "ID": 140263,
    "UUID": "61275106-5E7A-4B20-A1CB-789DA58B7DAB",
    "DataProviderID": 2,
    "DataProvidersReference": "113248",
    "OperatorID": 23,
    "UsageTypeID": 1,
    "AddressInfo": {
        "ID": 140615,
        "Title": "Adelaida Cellars - Tesla Destination",
        "AddressLine1": "5805 Adelaida Rd",
        "Town": "Paso Robles",
        "StateOrProvince": "CA",
        "Postcode": "93446",
        "CountryID": 2,
        "Latitude": 35.649893,
        "Longitude": -120.806556,
        "ContactTelephone1": "800-676-1232  877-798-3752",
        "AccessComments": "24 hours daily; for customer use only; see front desk for access",
        "RelatedURL": "https://www.tesla.com/destination-charging",
        "DistanceUnit": 0
    },
    "Connections": [
        {
            "ID": 195860,
            "ConnectionTypeID": 30,
            "LevelID": 2,
            "Amps": 16,
            "Voltage": 230,
            "PowerKW": 3.7,
            "CurrentTypeID": 10,
            "Quantity": 3
        }
    ],
    "StatusTypeID": 50,
    "DateLastStatusUpdate": "2020-06-26T02:58:00Z",
    "DataQualityLevel": 3,
    "DateCreated": "2019-12-24T09:12:00Z",
    "SubmissionStatusTypeID": 100
}