{
    "IsRecentlyVerified": false,
    "ID": 106667,
    "UUID": "A2F7BFD4-DAAF-4C02-B47F-FE61115B94F4",
    "DataProviderID": 1,
    "DataProvidersReference": "4799",
    "AddressInfo": {
        "ID": 107013,
        "Title": "Familjebadet",
        "AddressLine1": "Hägnevägen ",
        "Town": "SÄVSJÖ",
        "StateOrProvince": "JÖNKÖPING",
        "Postcode": "57633",
        "CountryID": 216,
        "Latitude": 57.394229,
        "Longitude": 14.67713,
        "AccessComments": "På parkeringen vid Familjebadet i Sävsjö.",
        "DistanceUnit": 0
    },
    "Connections": [
        {
            "ID": 150115,
            "ConnectionTypeID": 0,
            "Reference": "1",
            "LevelID": 2,
            "Amps": 32,
            "Voltage": 400,
            "PowerKW": 22,
            "Comments": "Mode 3"
        },
        {
            "ID": 150116,
            "ConnectionTypeID": 0,
            "Reference": "2",
            "LevelID": 2,
            "Amps": 32,
            "Voltage": 400,
            "PowerKW": 22,
            "Comments": "Mode 3"
        }
    ],
    "NumberOfPoints": 2,
    "DateLastStatusUpdate": "2020-05-26T08:21:00Z",
    "DataQualityLevel": 2,
    "DateCreated": "2018-06-27T12:11:00Z",
    "SubmissionStatusTypeID": 100
}