{
    "IsRecentlyVerified": false,
    "ID": 118035,
    "UUID": "5173284B-291B-4EC2-BA92-7C2C1AB62737",
    "DataProviderID": 1,
    "OperatorID": 23,
    "OperatorsReference": "28663",
    "UsageTypeID": 4,
    "UsageCost": "$0.26/kWh; other tariffs for older cars",
    "AddressInfo": {
        "ID": 118381,
        "Title": "Santa Monica, Ca - Santa Monica Place Supercharger",
        "AddressLine1": "395 Santa Monica Place",
        "Town": "Santa Monica",
        "StateOrProvince": "CA",
        "Postcode": "90401",
        "CountryID": 2,
        "Latitude": 34.014763,
        "Longitude": -118.49364,
        "DistanceUnit": 0
    },
    "Connections": [
        {
            "ID": 167054,
            "ConnectionTypeID": 27,
            "StatusTypeID": 50,
            "LevelID": 3,
            "PowerKW": 120,
            "CurrentTypeID": 30,
            "Quantity": 10
        }
    ],
    "NumberOfPoints": 10,
    "GeneralComments": "Charging10 Superchargers, available 24/7, up to 72kW",
    "StatusTypeID": 50,
    "DateLastStatusUpdate": "2019-03-14T23:18:00Z",
    "DataQualityLevel": 1,
    "DateCreated": "2019-03-14T23:18:00Z",
    "SubmissionStatusTypeID": 200
}