{
    "UserComments": [
        {
            "ID": 21906,
            "ChargePointID": 15872,
            "CommentTypeID": 1000,
            "UserName": "Jan R",
            "Comment": "",
            "DateCreated": "2019-12-15T15:51:15.29Z",
            "User": {
                "ID": 23294,
                "Username": "Jan R"
            },
            "CheckinStatusTypeID": 20,
            "IsActionedByEditor": false
        },
        {
            "ID": 10410,
            "ChargePointID": 15872,
            "CommentTypeID": 10,
            "UserName": "Someone_Just_",
            "Rating": 4,
            "DateCreated": "2016-05-14T20:01:45.247Z",
            "User": {
                "ID": 1107,
                "Username": "Someone_Just_"
            },
            "CheckinStatusTypeID": 10
        },
        {
            "ID": 9991,
            "ChargePointID": 15872,
            "CommentTypeID": 10,
            "UserName": "Someone_Just_",
            "Comment": "1 place in use (BMW I3)",
            "Rating": 5,
            "DateCreated": "2016-03-25T14:52:32.227Z",
            "User": {
                "ID": 1107,
                "Username": "Someone_Just_"
            },
            "CheckinStatusTypeID": 100
        }
    ],
    "MediaItems": [
        {
            "ID": 198,
            "ChargePointID": 15872,
            "ItemURL": "https://s3-ap-southeast-2.amazonaws.com/openchargemap/images/BE/OCM15872/OCM-15872.orig.2014011920420004.jpg",
            "ItemThumbnailURL": "https://s3-ap-southeast-2.amazonaws.com/openchargemap/images/BE/OCM15872/OCM-15872.thmb.2014011920420004.jpg",
            "Comment": "2 places for cars",
            "IsEnabled": true,
            "IsVideo": false,
            "IsFeaturedItem": false,
            "IsExternalResource": false,
            "User": {
                "ID": 1107,
                "Username": "Someone_Just_"
            },
            "DateCreated": "2014-01-19T20:42:00Z"
        }
    ],
    "IsRecentlyVerified": false,
    "ID": 15872,
    "UUID": "E431006A-00BA-417B-A757-6CFE6418D56B",
    "DataProviderID": 1,
    "OperatorID": 44,
    "UsageTypeID": 1,
    "UsageCost": "Free",
    "AddressInfo": {
        "ID": 16217,
        "Title": "Waasland Shopping Center",
        "AddressLine1": "Kapelstraat 100",
        "Town": "Sint-Niklaas ",
        "Postcode": "9100 ",
        "CountryID": 26,
        "Latitude": 51.151926879100486,
        "Longitude": 4.154241691333582,
        "ContactTelephone1": "03/776.73.71",
        "ContactEmail": "info@waaslandshoppingcenter.be",
        "AccessComments": "Buiten gebruik",
        "RelatedURL": "http://www.waaslandshoppingcenter.com",
        "DistanceUnit": 0
    },
    "Connections": [
        {
            "ID": 14229,
            "ConnectionTypeID": 23,
            "StatusTypeID": 50,
            "LevelID": 2,
            "Amps": 16,
            "Voltage": 220,
            "PowerKW": 3.5,
            "CurrentTypeID": 10,
            "Quantity": 2
        }
    ],
    "NumberOfPoints": 2,
    "GeneralComments": "Out of use",
    "StatusTypeID": 100,
    "DateLastStatusUpdate": "2019-12-16T06:14:00Z",
    "DataQualityLevel": 1,
    "DateCreated": "2013-02-07T16:35:00Z",
    "SubmissionStatusTypeID": 200
}