{
    "IsRecentlyVerified": false,
    "ID": 51498,
    "UUID": "E09ABAF8-1AE6-4A56-9AFD-B8A1014D702B",
    "DataProviderID": 1,
    "OperatorID": 69,
    "UsageTypeID": 4,
    "AddressInfo": {
        "ID": 51844,
        "Title": "Blumenstraße",
        "AddressLine1": "Blumenstraße 19",
        "Town": "München",
        "StateOrProvince": "Bayern",
        "Postcode": "80331",
        "CountryID": 87,
        "Latitude": 48.13238,
        "Longitude": 11.57237,
        "ContactTelephone1": "+49 89 3810101",
        "AccessComments": "Mehrere kostenlose Parkplätze am Schild \"SWM Öko Strom Ladestation\", 24/7 Laden mit Ladekarte von Ladenetz, EWE, WSW, ladeticket, TNM oder Charge&Fuel. ",
        "RelatedURL": "http://www.swm.de/privatkunden/unternehmen/innovation/elektromobilitaet/swm-ladestationen.html",
        "DistanceUnit": 0
    },
    "Connections": [],
    "NumberOfPoints": 8,
    "StatusTypeID": 50,
    "DateLastStatusUpdate": "2018-11-21T10:07:00Z",
    "DataQualityLevel": 1,
    "DateCreated": "2015-07-27T09:09:00Z",
    "SubmissionStatusTypeID": 200
}