{
    "IsRecentlyVerified": false,
    "ID": 123739,
    "UUID": "66EBD2CC-17BB-430D-92CF-3D1A36F29182",
    "DataProviderID": 2,
    "DataProvidersReference": "61380",
    "OperatorID": 5,
    "UsageTypeID": 1,
    "AddressInfo": {
        "ID": 124085,
        "Title": "LHS #1",
        "AddressLine1": "1280 Johnson Ave",
        "Town": "San Jose",
        "StateOrProvince": "CA",
        "Postcode": "95129",
        "CountryID": 2,
        "Latitude": 37.3000851,
        "Longitude": -122.0062201,
        "ContactTelephone1": "888-758-4389",
        "AccessComments": "24 hours daily",
        "RelatedURL": "http://www.chargepoint.com/",
        "DistanceUnit": 0
    },
    "Connections": [
        {
            "ID": 173762,
            "ConnectionTypeID": 1,
            "LevelID": 2,
            "Amps": 16,
            "Voltage": 230,
            "PowerKW": 3,
            "CurrentTypeID": 10,
            "Quantity": 2
        }
    ],
    "DateLastStatusUpdate": "2019-12-24T09:13:00Z",
    "DataQualityLevel": 3,
    "DateCreated": "2019-04-06T05:03:00Z",
    "SubmissionStatusTypeID": 100
}