{
    "IsRecentlyVerified": false,
    "ID": 148708,
    "UUID": "81E8E35D-B8E3-4B1C-93A7-29E77067E246",
    "DataProviderID": 1,
    "OperatorID": 198,
    "UsageTypeID": 4,
    "UsageCost": "0,30€/kWh, free parking 2h",
    "AddressInfo": {
        "ID": 149060,
        "Title": "Riihimäen Osuuspankki",
        "AddressLine1": "Välikatu 3",
        "Town": "Riihimäki",
        "StateOrProvince": "Southern Finland",
        "Postcode": "11100",
        "CountryID": 79,
        "Latitude": 60.73848920866578,
        "Longitude": 24.77500757758628,
        "DistanceUnit": 0
    },
    "Connections": [
        {
            "ID": 206485,
            "ConnectionTypeID": 25,
            "StatusTypeID": 50,
            "LevelID": 2,
            "Amps": 32,
            "PowerKW": 22,
            "CurrentTypeID": 20,
            "Quantity": 2
        }
    ],
    "NumberOfPoints": 2,
    "StatusTypeID": 50,
    "DateLastStatusUpdate": "2020-09-21T10:23:00Z",
    "DataQualityLevel": 1,
    "DateCreated": "2020-02-09T14:41:00Z",
    "SubmissionStatusTypeID": 200
}