{
    "IsRecentlyVerified": false,
    "ID": 187707,
    "UUID": "C97E5161-34D1-48AC-9B6C-6DF5DE1198C6",
    "DataProviderID": 18,
    "DataProvidersReference": "9772b7ba951a7ba095b34845e2c75632",
    "OperatorID": 2244,
    "UsageTypeID": 5,
    "AddressInfo": {
        "ID": 188066,
        "Title": "34 Brompton Square",
        "AddressLine1": "34 Brompton Square",
        "Town": "London",
        "Postcode": "SW3 2AE",
        "CountryID": 1,
        "Latitude": 51.498628,
        "Longitude": -0.1691,
        "AccessComments": "",
        "RelatedURL": "https://www.ubitricity.com",
        "DistanceUnit": 0
    },
    "Connections": [
        {
            "ID": 302944,
            "ConnectionTypeID": 25,
            "Reference": "suby1100007827",
            "StatusTypeID": 50,
            "LevelID": 2,
            "Amps": 16,
            "Voltage": 230,
            "PowerKW": 3.7,
            "CurrentTypeID": 10
        }
    ],
    "StatusTypeID": 0,
    "DateLastStatusUpdate": "2021-07-12T03:38:00Z",
    "MetadataValues": [
        {
            "ID": 19947,
            "MetadataFieldID": 4,
            "ItemValue": "Contains public sector information licensed under the Open Government Licence v2.0. http://www.nationalarchives.gov.uk/doc/open-government-licence/version/2/"
        }
    ],
    "DataQualityLevel": 3,
    "DateCreated": "2021-07-12T03:38:00Z",
    "SubmissionStatusTypeID": 100
}