{
    "IsRecentlyVerified": false,
    "ID": 32824,
    "UUID": "540149D7-F589-4112-B65B-AAED3E9FBE80",
    "DataProviderID": 26,
    "DataProvidersReference": "29044",
    "OperatorID": 69,
    "OperatorsReference": "SW Duisburg - Innenhafen",
    "UsageCost": "0.00 onbekend",
    "AddressInfo": {
        "ID": 33170,
        "Title": "Philosophenweg",
        "AddressLine1": "Philosophenweg",
        "Town": "Duisburg",
        "Postcode": "47051",
        "CountryID": 87,
        "Latitude": 51.439697,
        "Longitude": 6.767,
        "RelatedURL": "http://www.ladenetz.de",
        "DistanceUnit": 0
    },
    "Connections": [
        {
            "ID": 36335,
            "ConnectionTypeID": 25,
            "LevelID": 2,
            "PowerKW": 11,
            "CurrentTypeID": 10
        }
    ],
    "NumberOfPoints": 2,
    "StatusTypeID": 50,
    "DateLastStatusUpdate": "2016-06-04T02:39:00Z",
    "DataQualityLevel": 3,
    "DateCreated": "2015-01-09T06:03:00Z",
    "SubmissionStatusTypeID": 100
}