{
    "IsRecentlyVerified": false,
    "ID": 142053,
    "UUID": "74FEAA6D-C910-4014-859C-65DBF7B546DA",
    "DataProviderID": 2,
    "DataProvidersReference": "147430",
    "OperatorID": 5,
    "UsageTypeID": 1,
    "AddressInfo": {
        "ID": 142405,
        "Title": "HARLEY-DAVIDSON",
        "AddressLine1": "1425 Eden Road",
        "Town": "York",
        "StateOrProvince": "PA",
        "Postcode": "17402",
        "CountryID": 2,
        "Latitude": 39.985376,
        "Longitude": -76.713223,
        "ContactTelephone1": "888-758-4389",
        "AccessComments": "24 hours daily",
        "RelatedURL": "http://www.chargepoint.com/",
        "DistanceUnit": 0
    },
    "Connections": [
        {
            "ID": 198114,
            "ConnectionTypeID": 1,
            "LevelID": 2,
            "Amps": 16,
            "Voltage": 230,
            "PowerKW": 3.7,
            "CurrentTypeID": 10,
            "Quantity": 2
        },
        {
            "ID": 198115,
            "ConnectionTypeID": 32,
            "LevelID": 3,
            "Amps": 100,
            "Voltage": 400,
            "PowerKW": 40,
            "CurrentTypeID": 30,
            "Quantity": 2
        }
    ],
    "StatusTypeID": 50,
    "DateLastStatusUpdate": "2020-06-26T03:02:00Z",
    "DataQualityLevel": 3,
    "DateCreated": "2019-12-24T09:16:00Z",
    "SubmissionStatusTypeID": 100
}