{
    "IsRecentlyVerified": false,
    "ID": 35380,
    "UUID": "50845EE0-7DC7-41EF-9AC3-0196F81AF349",
    "DataProviderID": 26,
    "DataProvidersReference": "48022",
    "OperatorID": 178,
    "OperatorsReference": "EVnetNL DB0262",
    "UsageCost": "0.00 jaarabonnement",
    "AddressInfo": {
        "ID": 35726,
        "Title": "Kampweg 32",
        "AddressLine1": "Kampweg 32",
        "Town": "Utrechtse Heuvelrug",
        "Postcode": "3941 HH",
        "CountryID": 159,
        "Latitude": 52.036416,
        "Longitude": 5.343464,
        "ContactTelephone1": "0800-3522365",
        "RelatedURL": "http://www.evnet.nl",
        "DistanceUnit": 0
    },
    "Connections": [
        {
            "ID": 38891,
            "ConnectionTypeID": 25,
            "LevelID": 2,
            "PowerKW": 11,
            "CurrentTypeID": 10
        }
    ],
    "NumberOfPoints": 2,
    "StatusTypeID": 50,
    "DateLastStatusUpdate": "2016-06-04T02:44:00Z",
    "DataQualityLevel": 3,
    "DateCreated": "2015-01-09T06:04:00Z",
    "SubmissionStatusTypeID": 100
}