{
    "IsRecentlyVerified": false,
    "ID": 95500,
    "UUID": "73964495-DF38-4B1C-AA0A-1B28242B531F",
    "DataProviderID": 1,
    "OperatorID": 23,
    "OperatorsReference": "37670",
    "UsageTypeID": 4,
    "AddressInfo": {
        "ID": 95846,
        "Title": "Patio Claveria",
        "AddressLine1": "Calle Egipto 142 Claveria",
        "Town": "Azcapotzalco",
        "StateOrProvince": "Ciudad de Mexico",
        "Postcode": "02080",
        "CountryID": 146,
        "Latitude": 19.464028,
        "Longitude": -99.181805,
        "ContactTelephone1": "+52 55 4170 7070",
        "DistanceUnit": 0
    },
    "Connections": [
        {
            "ID": 135283,
            "ConnectionTypeID": 30,
            "StatusTypeID": 50,
            "LevelID": 2,
            "PowerKW": 18,
            "CurrentTypeID": 20,
            "Quantity": 2
        }
    ],
    "NumberOfPoints": 2,
    "GeneralComments": "2 Tesla Connectors, up to 18kW.Available to the public. Self park.",
    "StatusTypeID": 50,
    "DateLastStatusUpdate": "2017-11-12T06:52:00Z",
    "DataQualityLevel": 1,
    "DateCreated": "2017-11-12T06:52:00Z",
    "SubmissionStatusTypeID": 200
}