{
    "UserComments": [
        {
            "ID": 23772,
            "ChargePointID": 171528,
            "CommentTypeID": 10,
            "UserName": "Evan Pasqual",
            "Rating": 4,
            "DateCreated": "2021-01-11T08:42:26.603Z",
            "User": {
                "ID": 29066,
                "Username": "Evan Pasqual"
            },
            "CheckinStatusTypeID": 10,
            "IsActionedByEditor": false
        }
    ],
    "IsRecentlyVerified": false,
    "ID": 171528,
    "UUID": "B8F20D6E-9200-417F-9EFF-698D97A811E2",
    "DataProviderID": 1,
    "OperatorID": 3426,
    "UsageTypeID": 4,
    "UsageCost": "Free for now (Blink rates)",
    "AddressInfo": {
        "ID": 171887,
        "Title": "Plateia Eleftherias (Eleftherias Sqr)",
        "AddressLine1": "Αθηνάς",
        "Town": "korydallos",
        "StateOrProvince": "Decentralized Administration of Attica",
        "Postcode": "18120",
        "CountryID": 90,
        "Latitude": 37.97755021281209,
        "Longitude": 23.649729579391078,
        "DistanceUnit": 0
    },
    "Connections": [
        {
            "ID": 262307,
            "ConnectionTypeID": 25,
            "StatusTypeID": 50,
            "LevelID": 2,
            "PowerKW": 22,
            "Quantity": 2
        }
    ],
    "NumberOfPoints": 1,
    "StatusTypeID": 50,
    "DateLastStatusUpdate": "2021-01-11T08:42:00Z",
    "DataQualityLevel": 1,
    "DateCreated": "2021-01-04T09:02:00Z",
    "SubmissionStatusTypeID": 200
}