{
    "IsRecentlyVerified": false,
    "ID": 95655,
    "UUID": "2C077D84-9E1C-41FE-A85E-2CB4C534396D",
    "DataProviderID": 1,
    "OperatorID": 125,
    "UsageTypeID": 4,
    "AddressInfo": {
        "ID": 96001,
        "Title": "Kraftfahrzeug Zulassungsstelle",
        "AddressLine1": "Fischteichweg 7-13",
        "Town": "Aurich",
        "StateOrProvince": "Landkreis Aurich",
        "Postcode": "26603",
        "CountryID": 87,
        "Latitude": 53.46738321584284,
        "Longitude": 7.484596183258869,
        "AccessComments": "24/7 nutzbar",
        "DistanceUnit": 0
    },
    "Connections": [
        {
            "ID": 135500,
            "ConnectionTypeID": 33,
            "StatusTypeID": 50,
            "LevelID": 3,
            "PowerKW": 50,
            "CurrentTypeID": 30,
            "Quantity": 1
        },
        {
            "ID": 135501,
            "ConnectionTypeID": 2,
            "StatusTypeID": 50,
            "LevelID": 3,
            "PowerKW": 50,
            "CurrentTypeID": 30,
            "Quantity": 1
        },
        {
            "ID": 135502,
            "ConnectionTypeID": 1036,
            "StatusTypeID": 50,
            "LevelID": 3,
            "Amps": 63,
            "Voltage": 400,
            "PowerKW": 43,
            "CurrentTypeID": 20,
            "Quantity": 1
        }
    ],
    "NumberOfPoints": 3,
    "StatusTypeID": 50,
    "DateLastStatusUpdate": "2017-11-17T06:33:00Z",
    "DataQualityLevel": 1,
    "DateCreated": "2017-11-17T06:33:00Z",
    "SubmissionStatusTypeID": 200
}