{
    "IsRecentlyVerified": false,
    "ID": 92923,
    "UUID": "5EDD5907-DD3A-4CF2-9840-605560D5279C",
    "DataProviderID": 1,
    "OperatorID": 3291,
    "UsageTypeID": 4,
    "AddressInfo": {
        "ID": 93269,
        "Title": "evway TO Vittorio Emanuele II",
        "AddressLine1": "Corso Vittorio Emanuele II",
        "Town": "Torino",
        "StateOrProvince": "TO",
        "Postcode": "10121",
        "CountryID": 112,
        "Latitude": 45.063940087675654,
        "Longitude": 7.675840120948809,
        "ContactTelephone1": "+39 02 35954219",
        "ContactEmail": "info@evway.net",
        "RelatedURL": "https://evway.net",
        "DistanceUnit": 0
    },
    "Connections": [
        {
            "ID": 131634,
            "ConnectionTypeID": 25,
            "StatusTypeID": 50,
            "LevelID": 2,
            "Amps": 16,
            "Voltage": 400,
            "PowerKW": 11,
            "CurrentTypeID": 20,
            "Quantity": 2
        }
    ],
    "NumberOfPoints": 2,
    "GeneralComments": "Per utilizzare la colonnina è necessaria la App o il Kay Hanger evway o Plugsurfing",
    "StatusTypeID": 50,
    "DateLastStatusUpdate": "2017-09-13T16:28:00Z",
    "DataQualityLevel": 1,
    "DateCreated": "2017-09-13T16:28:00Z",
    "SubmissionStatusTypeID": 200
}