{
    "UserComments": [
        {
            "ID": 9976,
            "ChargePointID": 54203,
            "CommentTypeID": 10,
            "UserName": "Matthias Mav Böttger",
            "Rating": 1,
            "DateCreated": "2016-03-23T11:50:33.43Z",
            "User": {
                "ID": 4824,
                "Username": "Matthias Mav Böttger"
            },
            "CheckinStatusTypeID": 10
        }
    ],
    "IsRecentlyVerified": false,
    "ID": 54203,
    "UUID": "8B7A19CF-D62E-4DC6-8F82-B3878D9D3DFD",
    "DataProviderID": 1,
    "OperatorID": 215,
    "UsageTypeID": 4,
    "AddressInfo": {
        "ID": 54549,
        "Title": "VW Feser-Biemann",
        "AddressLine1": "Felix-Klein-Straße 76",
        "Town": "Erlangen",
        "Postcode": "91058",
        "CountryID": 87,
        "Latitude": 49.5722475,
        "Longitude": 11.0000805,
        "ContactTelephone1": "+49 9131 686 0",
        "AccessComments": "Rund um die Uhr (24/7) nutzbar. Position: Neben der Einfahrt von der Bunsenstraße aus Nur für Audi/VW\r\n",
        "RelatedURL": "https://www.feser-graf.de/unternehmen/standorte/erlangen",
        "DistanceUnit": 0
    },
    "Connections": [
        {
            "ID": 68182,
            "ConnectionTypeID": 25,
            "StatusTypeID": 50,
            "LevelID": 2,
            "Amps": 16,
            "Voltage": 230,
            "PowerKW": 3.7,
            "CurrentTypeID": 10,
            "Quantity": 2
        }
    ],
    "NumberOfPoints": 2,
    "StatusTypeID": 50,
    "DateLastStatusUpdate": "2020-03-17T08:40:00Z",
    "DataQualityLevel": 1,
    "DateCreated": "2015-09-24T19:12:00Z",
    "SubmissionStatusTypeID": 200
}