{
    "IsRecentlyVerified": false,
    "ID": 74531,
    "UUID": "5833767A-0F1B-41EC-A313-2D70A9F21C31",
    "DataProviderID": 2,
    "DataProvidersReference": "79428",
    "OperatorID": 5,
    "UsageTypeID": 1,
    "AddressInfo": {
        "ID": 74877,
        "Title": "EVERGY",
        "AddressLine1": "5100 Wornall Rd @ Loose Park",
        "Town": "Kansas City",
        "StateOrProvince": "MO",
        "Postcode": "64112",
        "CountryID": 2,
        "Latitude": 39.0343726,
        "Longitude": -94.5923195,
        "ContactTelephone1": "888-758-4389",
        "AccessComments": "24 hours daily",
        "RelatedURL": "http://www.chargepoint.com/",
        "DistanceUnit": 0
    },
    "Connections": [
        {
            "ID": 107133,
            "ConnectionTypeID": 1,
            "LevelID": 2,
            "Amps": 16,
            "Voltage": 230,
            "PowerKW": 3,
            "CurrentTypeID": 10,
            "Quantity": 6
        }
    ],
    "DateLastStatusUpdate": "2019-12-24T09:15:00Z",
    "DataQualityLevel": 3,
    "DateCreated": "2016-12-03T00:12:00Z",
    "SubmissionStatusTypeID": 100
}