{
    "IsRecentlyVerified": false,
    "ID": 132693,
    "UUID": "77D9BCA5-EE28-44B0-ACF2-FB1FE43B0920",
    "DataProviderID": 1,
    "OperatorID": 3266,
    "UsageTypeID": 4,
    "AddressInfo": {
        "ID": 133039,
        "Title": "Concessionario Nissan Rotalnord Auto",
        "AddressLine1": "S.S. 12 del Brennero, Km 400",
        "AddressLine2": "Cadino",
        "Town": "Faedo",
        "StateOrProvince": "TN",
        "Postcode": "38010",
        "CountryID": 112,
        "Latitude": 46.22712195786167,
        "Longitude": 11.171146892695788,
        "RelatedURL": "https://www.rotalnord.com/",
        "DistanceUnit": 0
    },
    "Connections": [
        {
            "ID": 185763,
            "ConnectionTypeID": 2,
            "StatusTypeID": 50,
            "LevelID": 3,
            "Amps": 120,
            "Voltage": 500,
            "PowerKW": 50,
            "CurrentTypeID": 30,
            "Quantity": 1
        },
        {
            "ID": 185764,
            "ConnectionTypeID": 33,
            "StatusTypeID": 50,
            "LevelID": 3,
            "Amps": 120,
            "Voltage": 500,
            "PowerKW": 50,
            "CurrentTypeID": 30,
            "Quantity": 1
        },
        {
            "ID": 185765,
            "ConnectionTypeID": 25,
            "StatusTypeID": 50,
            "LevelID": 2,
            "Amps": 32,
            "Voltage": 400,
            "PowerKW": 22,
            "CurrentTypeID": 20,
            "Quantity": 1
        }
    ],
    "NumberOfPoints": 1,
    "StatusTypeID": 50,
    "DateLastStatusUpdate": "2019-10-05T14:16:00Z",
    "DataQualityLevel": 1,
    "DateCreated": "2019-10-05T14:16:00Z",
    "SubmissionStatusTypeID": 200
}