{
    "IsRecentlyVerified": false,
    "ID": 120909,
    "UUID": "A5AE7C20-9A35-4039-8443-EDC50DDE461F",
    "DataProviderID": 2,
    "DataProvidersReference": "66231",
    "OperatorID": 5,
    "UsageTypeID": 1,
    "AddressInfo": {
        "ID": 121255,
        "Title": "GA TECH",
        "AddressLine1": "770 State St NW",
        "Town": "Atlanta",
        "StateOrProvince": "GA",
        "Postcode": "30318",
        "CountryID": 2,
        "Latitude": 33.7746873,
        "Longitude": -84.4003441,
        "ContactTelephone1": "888-758-4389",
        "AccessComments": "24 hours daily",
        "RelatedURL": "http://www.chargepoint.com/",
        "DistanceUnit": 0
    },
    "Connections": [
        {
            "ID": 170314,
            "ConnectionTypeID": 1,
            "LevelID": 2,
            "Amps": 16,
            "Voltage": 230,
            "PowerKW": 3,
            "CurrentTypeID": 10,
            "Quantity": 2
        }
    ],
    "DateLastStatusUpdate": "2019-04-01T04:59:00Z",
    "DataQualityLevel": 3,
    "DateCreated": "2019-04-01T04:59:00Z",
    "SubmissionStatusTypeID": 100
}