{
    "IsRecentlyVerified": false,
    "ID": 62274,
    "UUID": "F45F8837-9BA9-40EA-9D78-9687E821CE37",
    "DataProviderID": 1,
    "OperatorID": 23,
    "OperatorsReference": "9125",
    "UsageTypeID": 1,
    "UsageCost": "Free",
    "AddressInfo": {
        "ID": 62620,
        "Title": "Devonfield Inn - Tesla",
        "AddressLine1": "85 Stockbridge Rd",
        "Town": "Lee",
        "StateOrProvince": "MA",
        "Postcode": "01238",
        "CountryID": 2,
        "Latitude": 42.3009362,
        "Longitude": -73.2642587,
        "ContactTelephone1": "413-243-3298  877-798-3752",
        "AccessComments": "24 hours daily; for Tesla use only; for guest use only; see front desk for access",
        "RelatedURL": "http://www.teslamotors.com/supercharger",
        "DistanceUnit": 0
    },
    "Connections": [
        {
            "ID": 79177,
            "ConnectionTypeID": 30,
            "StatusTypeID": 50,
            "LevelID": 2,
            "Amps": 16,
            "Voltage": 230,
            "PowerKW": 6,
            "CurrentTypeID": 10,
            "Quantity": 1
        }
    ],
    "NumberOfPoints": 1,
    "StatusTypeID": 50,
    "DateLastStatusUpdate": "2017-01-26T19:36:00Z",
    "DataQualityLevel": 3,
    "DateCreated": "2016-03-03T11:38:00Z",
    "SubmissionStatusTypeID": 100
}