{
    "IsRecentlyVerified": false,
    "ID": 102890,
    "UUID": "EFBEC420-E603-41EE-963C-C53606FCAFF0",
    "DataProviderID": 2,
    "DataProvidersReference": "86723",
    "OperatorID": 39,
    "UsageTypeID": 1,
    "AddressInfo": {
        "ID": 103236,
        "Title": "Campus at Greenhill",
        "AddressLine1": "108 Leigus Road",
        "Town": "Wallingford",
        "StateOrProvince": "CT",
        "Postcode": "06492",
        "CountryID": 2,
        "Latitude": 41.478889,
        "Longitude": -72.775522,
        "ContactTelephone1": "800-663-5633",
        "AccessComments": "MO: 12:00am-12:00am; TU: 12:00am-12:00am; WE: 12:00am-12:00am; TH: 12:00am-12:00am; FR: 12:00am-12:00am; SA: 12:00am-12:00am; SU: 12:00am-12:00am",
        "RelatedURL": "http://www.semacharge.com/",
        "DistanceUnit": 0
    },
    "Connections": [
        {
            "ID": 145035,
            "ConnectionTypeID": 1,
            "LevelID": 2,
            "Amps": 16,
            "Voltage": 230,
            "PowerKW": 3,
            "CurrentTypeID": 10,
            "Quantity": 4
        }
    ],
    "DateLastStatusUpdate": "2019-04-06T05:05:00Z",
    "DataQualityLevel": 3,
    "DateCreated": "2018-04-21T04:13:00Z",
    "SubmissionStatusTypeID": 100
}