{
    "IsRecentlyVerified": false,
    "ID": 94494,
    "UUID": "DEC5E383-903C-473D-B59C-C304C09BD9C4",
    "DataProviderID": 1,
    "OperatorID": 1,
    "UsageTypeID": 7,
    "AddressInfo": {
        "ID": 94840,
        "Title": "Parkplatz Bäderwelt Bretten",
        "AddressLine1": "Sportzentrum 4",
        "Town": "Bretten",
        "StateOrProvince": "Verwaltungsgemeinschaft Bretten",
        "Postcode": "75015",
        "CountryID": 87,
        "Latitude": 49.031134412256634,
        "Longitude": 8.71795128570556,
        "ContactTelephone1": "+497252913133",
        "AccessComments": "24/7 nutzbare Ladesäule auf dem Parkplatz vor dem Schwimmbad, die über die App \"e-Laden\" ohne Vertragsbindung aktivierbar sind. Betreiber sind die Stadtwerke Bretten.",
        "RelatedURL": "https://www.kraichgau-energie.de/privatkunden/strom/e-laden/",
        "DistanceUnit": 0
    },
    "Connections": [
        {
            "ID": 133617,
            "ConnectionTypeID": 25,
            "StatusTypeID": 50,
            "LevelID": 2,
            "Amps": 32,
            "Voltage": 400,
            "PowerKW": 22,
            "CurrentTypeID": 20,
            "Quantity": 2
        }
    ],
    "NumberOfPoints": 2,
    "StatusTypeID": 50,
    "DateLastStatusUpdate": "2017-10-19T06:11:00Z",
    "DataQualityLevel": 1,
    "DateCreated": "2017-10-19T06:11:00Z",
    "SubmissionStatusTypeID": 200
}