{
    "IsRecentlyVerified": false,
    "ID": 140107,
    "UUID": "392FF09C-8957-4E7D-B537-EF1905D735BD",
    "DataProviderID": 2,
    "DataProvidersReference": "96356",
    "OperatorID": 9,
    "UsageTypeID": 1,
    "AddressInfo": {
        "ID": 140459,
        "Title": "Hilton Garden Inn Chattanooga",
        "AddressLine1": "2343 Shallowford Village Dr.",
        "Town": "Chattanooga",
        "StateOrProvince": "TN",
        "Postcode": "37421",
        "CountryID": 2,
        "Latitude": 35.044827,
        "Longitude": -85.156238,
        "ContactTelephone1": "888-998-2546",
        "AccessComments": "MON: 24 hours | TUE: 24 hours | WED: 24 hours | THU: 24 hours | FRI: 24 hours | SAT: 24 hours | SUN: 24 hours",
        "RelatedURL": "http://www.blinkcharging.com/",
        "DistanceUnit": 0
    },
    "Connections": [
        {
            "ID": 195660,
            "ConnectionTypeID": 1,
            "LevelID": 2,
            "Amps": 16,
            "Voltage": 230,
            "PowerKW": 3.7,
            "CurrentTypeID": 10,
            "Quantity": 1
        }
    ],
    "StatusTypeID": 50,
    "DateLastStatusUpdate": "2020-06-26T02:57:00Z",
    "DataQualityLevel": 3,
    "DateCreated": "2019-12-24T09:12:00Z",
    "SubmissionStatusTypeID": 100
}