{
    "IsRecentlyVerified": false,
    "ID": 38110,
    "UUID": "9BFA204D-2CF4-4C65-83E8-60695C53BC19",
    "DataProviderID": 26,
    "DataProvidersReference": "45511",
    "OperatorID": 73,
    "OperatorsReference": "EV-Box EVB-P1343035",
    "UsageCost": "0.00 jaarabonnement",
    "AddressInfo": {
        "ID": 38456,
        "Title": "Duin- en Kruidbergerweg 1",
        "AddressLine1": "Duin- en Kruidbergerweg 1",
        "Town": "Velsen",
        "Postcode": "1985 HG",
        "CountryID": 159,
        "Latitude": 52.43951,
        "Longitude": 4.63094,
        "RelatedURL": "http://www.ev-box.nl",
        "DistanceUnit": 0
    },
    "Connections": [
        {
            "ID": 41621,
            "ConnectionTypeID": 25,
            "LevelID": 2,
            "PowerKW": 11,
            "CurrentTypeID": 10
        },
        {
            "ID": 52215,
            "ConnectionTypeID": 25,
            "LevelID": 2,
            "PowerKW": 11,
            "CurrentTypeID": 10
        }
    ],
    "NumberOfPoints": 1,
    "StatusTypeID": 50,
    "DateLastStatusUpdate": "2016-06-04T02:54:00Z",
    "DataQualityLevel": 3,
    "DateCreated": "2015-01-09T06:07:00Z",
    "SubmissionStatusTypeID": 100
}