{
    "IsRecentlyVerified": false,
    "ID": 144015,
    "UUID": "7EE46B5F-1777-4C4E-893E-248DCE9F90C3",
    "DataProviderID": 2,
    "DataProvidersReference": "130198",
    "OperatorID": 90,
    "UsageTypeID": 1,
    "AddressInfo": {
        "ID": 144367,
        "Title": "Municipalité de Bolton-Est",
        "AddressLine1": "858 rue Missisquoi",
        "Town": "Bolton-Est",
        "StateOrProvince": "QC",
        "Postcode": "J0E 1G0",
        "CountryID": 44,
        "Latitude": 45.20283,
        "Longitude": -72.356242,
        "ContactTelephone1": "877-505-2674",
        "AccessComments": "24 hours daily",
        "RelatedURL": "https://lecircuitelectrique.com/",
        "DistanceUnit": 0
    },
    "Connections": [
        {
            "ID": 200469,
            "ConnectionTypeID": 1,
            "LevelID": 2,
            "Amps": 16,
            "Voltage": 230,
            "PowerKW": 3.7,
            "CurrentTypeID": 10,
            "Quantity": 1
        }
    ],
    "StatusTypeID": 50,
    "DateLastStatusUpdate": "2020-06-26T03:08:00Z",
    "DataQualityLevel": 3,
    "DateCreated": "2019-12-24T09:22:00Z",
    "SubmissionStatusTypeID": 100
}