{
    "IsRecentlyVerified": false,
    "ID": 123811,
    "UUID": "1A271F30-985B-49D3-9C82-AA19FCE8B108",
    "DataProviderID": 2,
    "DataProvidersReference": "117540",
    "OperatorID": 5,
    "UsageTypeID": 1,
    "AddressInfo": {
        "ID": 124157,
        "Title": "IRVINE  CO  OFC",
        "AddressLine1": "2635 Augustine Dr",
        "Town": "Santa Clara",
        "StateOrProvince": "CA",
        "Postcode": "95054",
        "CountryID": 2,
        "Latitude": 37.382542,
        "Longitude": -121.975041,
        "ContactTelephone1": "888-758-4389",
        "AccessComments": "24 hours daily",
        "RelatedURL": "http://www.chargepoint.com/",
        "DistanceUnit": 0
    },
    "Connections": [
        {
            "ID": 173840,
            "ConnectionTypeID": 1,
            "LevelID": 2,
            "Amps": 16,
            "Voltage": 230,
            "PowerKW": 3,
            "CurrentTypeID": 10,
            "Quantity": 14
        }
    ],
    "DateLastStatusUpdate": "2019-12-24T09:13:00Z",
    "DataQualityLevel": 3,
    "DateCreated": "2019-04-06T05:03:00Z",
    "SubmissionStatusTypeID": 100
}