{
    "UserComments": [
        {
            "ID": 24983,
            "ChargePointID": 189638,
            "CommentTypeID": 10,
            "UserName": "tr6tevens",
            "Comment": "",
            "Rating": 4,
            "DateCreated": "2021-10-26T21:23:58.963Z",
            "User": {
                "ID": 35091,
                "Username": "tr6tevens"
            },
            "CheckinStatusTypeID": 10,
            "IsActionedByEditor": false
        }
    ],
    "IsRecentlyVerified": true,
    "DateLastVerified": "2021-10-21T16:00:00Z",
    "ID": 189638,
    "UUID": "525452B3-EC95-4FAC-9EAB-5CFD0D781604",
    "DataProviderID": 1,
    "OperatorID": 50,
    "UsageTypeID": 1,
    "UsageCost": "Free",
    "AddressInfo": {
        "ID": 189997,
        "Title": "Giant Food, Gaithersburg Square",
        "AddressLine1": "38 Bureau Drive",
        "Town": "Gaithersburg",
        "StateOrProvince": "MD",
        "Postcode": "20878",
        "CountryID": 2,
        "Latitude": 39.14399286716761,
        "Longitude": -77.21786375842274,
        "ContactTelephone1": "+1 888-264-2208",
        "DistanceUnit": 0
    },
    "Connections": [
        {
            "ID": 306775,
            "ConnectionTypeID": 1,
            "StatusTypeID": 50,
            "LevelID": 2,
            "PowerKW": 7.2,
            "Quantity": 2,
            "Comments": "2 bays near Giant front entrance"
        }
    ],
    "NumberOfPoints": 2,
    "StatusTypeID": 50,
    "DateLastStatusUpdate": "2021-10-26T21:24:00Z",
    "DataQualityLevel": 1,
    "DateCreated": "2021-10-21T16:00:00Z",
    "SubmissionStatusTypeID": 200
}