{
    "IsRecentlyVerified": false,
    "ID": 140722,
    "UUID": "1B468304-E2AD-4B59-9F82-EC6DC104A8E3",
    "DataProviderID": 2,
    "DataProvidersReference": "125126",
    "OperatorID": 59,
    "UsageTypeID": 1,
    "AddressInfo": {
        "ID": 141074,
        "Title": "Greenlots - 112258U",
        "AddressLine1": "500 W. Middlefield Rd",
        "Town": "Mountain View",
        "StateOrProvince": "CA",
        "Postcode": "94043",
        "CountryID": 2,
        "Latitude": 37.400558,
        "Longitude": -122.071149,
        "ContactTelephone1": "855-900-7584",
        "AccessComments": "24 hours daily",
        "RelatedURL": "http://greenlots.com/",
        "DistanceUnit": 0
    },
    "Connections": [
        {
            "ID": 196432,
            "ConnectionTypeID": 1,
            "LevelID": 2,
            "Amps": 16,
            "Voltage": 230,
            "PowerKW": 3.7,
            "CurrentTypeID": 10,
            "Quantity": 17
        }
    ],
    "StatusTypeID": 50,
    "DateLastStatusUpdate": "2020-06-26T02:59:00Z",
    "DataQualityLevel": 3,
    "DateCreated": "2019-12-24T09:13:00Z",
    "SubmissionStatusTypeID": 100
}