{
    "IsRecentlyVerified": false,
    "ID": 109118,
    "UUID": "846003F8-DC8B-4A89-A511-D6F56FDB98EF",
    "DataProviderID": 1,
    "OperatorID": 23,
    "OperatorsReference": "44978",
    "UsageTypeID": 4,
    "AddressInfo": {
        "ID": 109464,
        "Title": "Iin Sillat",
        "AddressLine1": "Haminantie 32",
        "Town": "Ii",
        "Postcode": "91100",
        "CountryID": 79,
        "Latitude": 65.326699,
        "Longitude": 25.375006,
        "ContactTelephone1": " +358 88173300",
        "DistanceUnit": 0
    },
    "Connections": [
        {
            "ID": 154236,
            "ConnectionTypeID": 30,
            "StatusTypeID": 50,
            "LevelID": 2,
            "PowerKW": 17,
            "CurrentTypeID": 20,
            "Quantity": 2
        }
    ],
    "NumberOfPoints": 2,
    "GeneralComments": "2 Tesla Connectors, up to 17kW.Available for customers. Self park.",
    "StatusTypeID": 50,
    "DateLastStatusUpdate": "2018-10-11T13:40:00Z",
    "DataQualityLevel": 1,
    "DateCreated": "2018-10-11T13:40:00Z",
    "SubmissionStatusTypeID": 200
}