{
    "IsRecentlyVerified": false,
    "ID": 187369,
    "UUID": "BF1952B0-E8FD-43B1-97DF-CA7C6DD21C24",
    "DataProviderID": 29,
    "DataProvidersReference": "12551",
    "OperatorID": 3403,
    "AddressInfo": {
        "ID": 187728,
        "Title": "Mühlenkamp 61",
        "AddressLine1": "Mühlenkamp 61",
        "Town": "Barsbek",
        "Postcode": "24217",
        "CountryID": 87,
        "Latitude": 54.403871544039,
        "Longitude": 10.321047103205,
        "DistanceUnit": 0
    },
    "Connections": [
        {
            "ID": 302432,
            "ConnectionTypeID": 25,
            "StatusTypeID": 50,
            "LevelID": 2,
            "PowerKW": 22,
            "CurrentTypeID": 20
        },
        {
            "ID": 302433,
            "ConnectionTypeID": 25,
            "StatusTypeID": 50,
            "LevelID": 2,
            "PowerKW": 22,
            "CurrentTypeID": 20
        }
    ],
    "StatusTypeID": 50,
    "DateLastStatusUpdate": "2021-07-12T02:52:00Z",
    "MetadataValues": [
        {
            "ID": 19609,
            "MetadataFieldID": 4,
            "ItemValue": "Data from the German chargepoint registry provided by Bundesnetzagentur.de under the CC-BY 4.0 license"
        }
    ],
    "DataQualityLevel": 3,
    "DateCreated": "2021-07-12T02:52:00Z",
    "SubmissionStatusTypeID": 100
}