{
    "IsRecentlyVerified": false,
    "ID": 170238,
    "UUID": "07FBF84B-12FD-4906-AC0A-FBA4A211BBAB",
    "DataProviderID": 1,
    "OperatorID": 3448,
    "UsageTypeID": 1,
    "UsageCost": "0.35 €/kWh + eMSP fee",
    "AddressInfo": {
        "ID": 170597,
        "Title": "Proviridis Puget-sur-Argens",
        "AddressLine1": "577 Boulevard du Commerce",
        "Town": "Puget-sur-Argens",
        "StateOrProvince": "Provence-Alpes-Côte d'Azur",
        "Postcode": "83480",
        "CountryID": 80,
        "Latitude": 43.450880835687855,
        "Longitude": 6.696361366109841,
        "DistanceUnit": 0
    },
    "Connections": [
        {
            "ID": 259580,
            "ConnectionTypeID": 33,
            "StatusTypeID": 50,
            "LevelID": 3,
            "PowerKW": 150,
            "CurrentTypeID": 30,
            "Quantity": 1
        },
        {
            "ID": 259581,
            "ConnectionTypeID": 33,
            "StatusTypeID": 50,
            "LevelID": 3,
            "PowerKW": 150,
            "CurrentTypeID": 30,
            "Quantity": 1
        },
        {
            "ID": 259582,
            "ConnectionTypeID": 2,
            "StatusTypeID": 50,
            "LevelID": 3,
            "PowerKW": 60,
            "CurrentTypeID": 30,
            "Quantity": 1
        }
    ],
    "NumberOfPoints": 1,
    "StatusTypeID": 50,
    "DateLastStatusUpdate": "2021-05-24T20:08:00Z",
    "DataQualityLevel": 1,
    "DateCreated": "2020-11-21T08:51:00Z",
    "SubmissionStatusTypeID": 200
}