{
    "IsRecentlyVerified": false,
    "ID": 160540,
    "UUID": "E1F048DC-BAD3-429F-A457-627807608D0A",
    "DataProviderID": 2,
    "DataProvidersReference": "157784",
    "UsageTypeID": 2,
    "AddressInfo": {
        "ID": 160897,
        "Title": "Hydro-Quebec",
        "AddressLine1": "550 Elgin Nord",
        "Town": "St-Pamphile",
        "StateOrProvince": "QC",
        "Postcode": "G0R 3X0",
        "CountryID": 44,
        "Latitude": 46.970912,
        "Longitude": -69.793371,
        "ContactTelephone1": "",
        "AccessComments": "",
        "RelatedURL": "",
        "DistanceUnit": 0
    },
    "Connections": [
        {
            "ID": 230996,
            "ConnectionTypeID": 2,
            "LevelID": 3,
            "Amps": 100,
            "Voltage": 400,
            "PowerKW": 40,
            "CurrentTypeID": 30,
            "Quantity": 1
        },
        {
            "ID": 230997,
            "ConnectionTypeID": 32,
            "LevelID": 3,
            "Amps": 100,
            "Voltage": 400,
            "PowerKW": 40,
            "CurrentTypeID": 30,
            "Quantity": 1
        }
    ],
    "GeneralComments": "Planned for future date. Not Operational.",
    "DatePlanned": "2020-09-01T00:00:00Z",
    "StatusTypeID": 150,
    "DateLastStatusUpdate": "2020-06-26T03:10:00Z",
    "DataQualityLevel": 3,
    "DateCreated": "2020-06-26T03:10:00Z",
    "SubmissionStatusTypeID": 100
}