{
    "IsRecentlyVerified": false,
    "ID": 90503,
    "UUID": "4FD2892A-5818-4676-A298-5ABE3B843E1C",
    "DataProviderID": 1,
    "OperatorID": 45,
    "UsageTypeID": 1,
    "UsageCost": "Free",
    "AddressInfo": {
        "ID": 90849,
        "Title": " McDonald's Firenze Nenni",
        "AddressLine1": "Viale Pietro Nenni, 16/3",
        "Town": "Firenze",
        "StateOrProvince": "FI",
        "Postcode": "50143",
        "CountryID": 112,
        "Latitude": 43.7658869605087,
        "Longitude": 11.206486435111621,
        "ContactTelephone1": "055 7320245",
        "RelatedURL": "https://www.mcdonalds.it",
        "DistanceUnit": 0
    },
    "Connections": [
        {
            "ID": 128169,
            "ConnectionTypeID": 25,
            "StatusTypeID": 50,
            "LevelID": 2,
            "Quantity": 2
        }
    ],
    "NumberOfPoints": 2,
    "StatusTypeID": 50,
    "DateLastStatusUpdate": "2017-07-14T13:14:00Z",
    "DataQualityLevel": 1,
    "DateCreated": "2017-07-14T13:14:00Z",
    "SubmissionStatusTypeID": 200
}