{
    "IsRecentlyVerified": false,
    "ID": 15606,
    "UUID": "A072B2C6-9441-44A8-8C89-1744EC67F414",
    "DataProviderID": 1,
    "OperatorID": 1,
    "UsageTypeID": 1,
    "UsageCost": "Free",
    "AddressInfo": {
        "ID": 15951,
        "Title": "Sonne2go",
        "AddressLine1": "Heidmühlstrasse 122",
        "AddressLine2": "",
        "Town": "Bopfingen",
        "StateOrProvince": "",
        "Postcode": "73441 ",
        "CountryID": 87,
        "Latitude": 48.8484425,
        "Longitude": 10.371590999999967,
        "ContactTelephone1": " 07362 802020",
        "ContactTelephone2": " 0177 5818343",
        "ContactEmail": " info@HANDELundVERTRIEB.de",
        "AccessComments": "Zugang ist 24/7 möglich.  Bei Fragen bitte mit Herr zu Hohenlohe-Oehringen kontaktieren:",
        "RelatedURL": "http://www.sonne2go.de",
        "DistanceUnit": 0
    },
    "Connections": [
        {
            "ID": 13928,
            "ConnectionTypeID": 8,
            "StatusTypeID": 0,
            "LevelID": 2,
            "Amps": 70,
            "Voltage": 240,
            "PowerKW": 16.8,
            "CurrentTypeID": 10,
            "Quantity": 1
        }
    ],
    "NumberOfPoints": 1,
    "GeneralComments": "roadsterconnector",
    "StatusTypeID": 50,
    "DateLastStatusUpdate": "2013-01-14T17:18:00Z",
    "DataQualityLevel": 1,
    "DateCreated": "2013-01-14T17:18:00Z",
    "SubmissionStatusTypeID": 200
}