{
    "IsRecentlyVerified": false,
    "ID": 12932,
    "UUID": "A1E10996-729E-4C7D-9499-D8E8D8DD1A5B",
    "DataProviderID": 15,
    "DataProvidersReference": "22240",
    "OperatorID": 1,
    "UsageTypeID": 1,
    "AddressInfo": {
        "ID": 12829,
        "Title": "498 Tsali BLVD",
        "AddressLine1": "498 Tsali BLVD",
        "Town": "Cherokee",
        "StateOrProvince": "NC",
        "Postcode": "28719",
        "CountryID": 2,
        "Latitude": 35.48347,
        "Longitude": -83.316203,
        "ContactTelephone1": "828-554-6480",
        "RelatedURL": "http://carstations.com/22240",
        "DistanceUnit": 0
    },
    "Connections": [
        {
            "ID": 10365,
            "ConnectionTypeID": 1,
            "Reference": "J1772",
            "LevelID": 2
        }
    ],
    "NumberOfPoints": 1,
    "StatusTypeID": 50,
    "DateLastStatusUpdate": "2017-11-04T14:04:00Z",
    "DataQualityLevel": 2,
    "DateCreated": "2012-09-07T19:25:00Z",
    "SubmissionStatusTypeID": 100
}