{
    "IsRecentlyVerified": false,
    "ID": 68627,
    "UUID": "1E1D6A79-BE43-49C0-A39B-7B114AF61750",
    "DataProviderID": 1,
    "OperatorID": 45,
    "UsageTypeID": 1,
    "AddressInfo": {
        "ID": 68973,
        "Title": "Supermarkt Edeka",
        "AddressLine1": "Beim Bunten Mantel",
        "Town": "Erfurt",
        "StateOrProvince": "Erfurt",
        "Postcode": "99092",
        "CountryID": 87,
        "Latitude": 50.97500055511054,
        "Longitude": 11.007594676721153,
        "ContactTelephone1": "+49 361 65312900",
        "AccessComments": "Ladesäule an der Gebäudeecke rechts, Zufahrt am Besten über dritte Parkplatzeinfahrt. Kostenloses Laden und Parken auf 2 Plätzen, Säule ist aktiv von Mo-Fr 7-21Uhr, Sa 7-20Uhr.",
        "RelatedURL": "http://www.koch-edeka.de/",
        "DistanceUnit": 0
    },
    "Connections": [
        {
            "ID": 96233,
            "ConnectionTypeID": 25,
            "StatusTypeID": 50,
            "LevelID": 2,
            "Amps": 16,
            "Voltage": 400,
            "PowerKW": 11,
            "CurrentTypeID": 20,
            "Quantity": 2
        }
    ],
    "NumberOfPoints": 2,
    "StatusTypeID": 50,
    "DateLastStatusUpdate": "2016-06-14T06:58:00Z",
    "DataQualityLevel": 1,
    "DateCreated": "2016-06-14T06:58:00Z",
    "SubmissionStatusTypeID": 200
}