{
    "IsRecentlyVerified": false,
    "ID": 61171,
    "UUID": "CCAC062F-BB11-4079-A043-911FF7A68AF3",
    "DataProviderID": 27,
    "DataProvidersReference": "59",
    "UsageTypeID": 1,
    "AddressInfo": {
        "ID": 61517,
        "Title": "Antigua Pescaderia Municipal",
        "AddressLine1": "Calle Ventura Alrez Sala, 6",
        "Town": "Gijón",
        "StateOrProvince": "Asturias",
        "Postcode": "33201",
        "CountryID": 210,
        "Latitude": 43.544436,
        "Longitude": -5.662169,
        "ContactTelephone1": "+34 900 907 005",
        "RelatedURL": "http://tc.gijon.es/",
        "DistanceUnit": 0
    },
    "Connections": [
        {
            "ID": 77850,
            "ConnectionTypeID": 28
        }
    ],
    "GeneralComments": "Tarjeta ayuntamiento de Gijón",
    "StatusTypeID": 50,
    "DateLastStatusUpdate": "2016-02-13T00:24:00Z",
    "DataQualityLevel": 3,
    "DateCreated": "2016-02-13T00:24:00Z",
    "SubmissionStatusTypeID": 200
}