{
    "IsRecentlyVerified": false,
    "ID": 113670,
    "UUID": "BABEC5FE-5DF2-4B32-A01D-7D9D83BAD3C7",
    "DataProviderID": 1,
    "OperatorID": 80,
    "UsageTypeID": 4,
    "AddressInfo": {
        "ID": 114016,
        "Title": "Reggio Calabria Ospedale Morelli | EnelX",
        "AddressLine1": "Via Francesco Crucitti",
        "Town": "Reggio Calabria",
        "StateOrProvince": "RC",
        "Postcode": "89133 ",
        "CountryID": 112,
        "Latitude": 38.09647001819675,
        "Longitude": 15.646966256306388,
        "ContactTelephone1": "800.069.850",
        "RelatedURL": "https://www.enelx.com/it/it/emobility",
        "DistanceUnit": 0
    },
    "Connections": [
        {
            "ID": 160206,
            "ConnectionTypeID": 25,
            "StatusTypeID": 150,
            "LevelID": 2,
            "Amps": 32,
            "Voltage": 400,
            "PowerKW": 22,
            "CurrentTypeID": 20,
            "Quantity": 1
        },
        {
            "ID": 160207,
            "ConnectionTypeID": 36,
            "StatusTypeID": 150,
            "LevelID": 2,
            "Amps": 16,
            "Voltage": 240,
            "PowerKW": 3.7,
            "CurrentTypeID": 10,
            "Quantity": 1
        }
    ],
    "NumberOfPoints": 2,
    "StatusTypeID": 150,
    "DateLastStatusUpdate": "2018-12-29T15:18:00Z",
    "DataQualityLevel": 1,
    "DateCreated": "2018-12-29T15:18:00Z",
    "SubmissionStatusTypeID": 200
}