{
    "IsRecentlyVerified": false,
    "ID": 142543,
    "UUID": "CE9619E9-F0BD-482B-8749-4F60F2C00CA6",
    "DataProviderID": 2,
    "DataProvidersReference": "67086",
    "OperatorID": 5,
    "UsageTypeID": 1,
    "AddressInfo": {
        "ID": 142895,
        "Title": "SEWARD",
        "AddressLine1": "233 S. 5th St.",
        "Town": "Seward",
        "StateOrProvince": "NE",
        "Postcode": "68434",
        "CountryID": 2,
        "Latitude": 40.9060986,
        "Longitude": -97.098946,
        "ContactTelephone1": "888-758-4389",
        "AccessComments": "24 hours daily",
        "RelatedURL": "http://www.chargepoint.com/",
        "DistanceUnit": 0
    },
    "Connections": [
        {
            "ID": 198697,
            "ConnectionTypeID": 9,
            "LevelID": 1,
            "Amps": 16,
            "Voltage": 120,
            "PowerKW": 1.9,
            "CurrentTypeID": 10,
            "Quantity": 1
        },
        {
            "ID": 198698,
            "ConnectionTypeID": 1,
            "LevelID": 2,
            "Amps": 16,
            "Voltage": 230,
            "PowerKW": 3.7,
            "CurrentTypeID": 10,
            "Quantity": 1
        }
    ],
    "StatusTypeID": 50,
    "DateLastStatusUpdate": "2020-06-26T03:03:00Z",
    "DataQualityLevel": 3,
    "DateCreated": "2019-12-24T09:18:00Z",
    "SubmissionStatusTypeID": 100
}