{
    "IsRecentlyVerified": false,
    "ID": 29483,
    "UUID": "9AB500B1-CDFB-4681-8BAA-526BD9CEAF22",
    "DataProviderID": 1,
    "OperatorID": 1,
    "UsageTypeID": 0,
    "UsageCost": "Free",
    "AddressInfo": {
        "ID": 29829,
        "Title": "Rauhankatu 27",
        "AddressLine1": "",
        "AddressLine2": "",
        "Town": "Porvoo",
        "StateOrProvince": "",
        "Postcode": "",
        "CountryID": 79,
        "Latitude": 60.3953913,
        "Longitude": 25.6604862,
        "ContactTelephone1": "",
        "ContactTelephone2": "",
        "ContactEmail": "",
        "AccessComments": "",
        "RelatedURL": "",
        "DistanceUnit": 0
    },
    "Connections": [],
    "NumberOfPoints": 1,
    "GeneralComments": "",
    "StatusTypeID": 50,
    "DateLastStatusUpdate": "2014-11-28T14:05:00Z",
    "MetadataValues": [
        {
            "ID": 1273,
            "MetadataFieldID": 4,
            "ItemValue": "Data © OpenStreetMap contributors, ODbL 1.0. http://www.openstreetmap.org/copyright"
        }
    ],
    "DataQualityLevel": 1,
    "DateCreated": "2014-11-27T11:00:00Z",
    "SubmissionStatusTypeID": 200
}