{
    "IsRecentlyVerified": false,
    "ID": 41246,
    "UUID": "F108D7D5-FD6D-4C09-8FCB-642361AA73D1",
    "DataProviderID": 15,
    "DataProvidersReference": "31011",
    "OperatorID": 9,
    "UsageTypeID": 1,
    "AddressInfo": {
        "ID": 41592,
        "Title": "210 Lakeville Street",
        "AddressLine1": "210 Lakeville Street",
        "Town": "Petaluma",
        "StateOrProvince": "CA",
        "Postcode": "94952",
        "CountryID": 2,
        "Latitude": 38.23673,
        "Longitude": -122.63477,
        "ContactTelephone1": "(707) 769-0429",
        "RelatedURL": "http://carstations.com/31011",
        "DistanceUnit": 0
    },
    "Connections": [
        {
            "ID": 45034,
            "ConnectionTypeID": 2,
            "Reference": "CHADEMO",
            "LevelID": 3
        }
    ],
    "NumberOfPoints": 2,
    "StatusTypeID": 0,
    "DateLastStatusUpdate": "2017-11-04T14:04:00Z",
    "DataQualityLevel": 2,
    "DateCreated": "2015-01-28T11:44:00Z",
    "SubmissionStatusTypeID": 100
}