{
    "IsRecentlyVerified": false,
    "ID": 120569,
    "UUID": "0C66B048-C17A-4BA7-9A46-657962796E0B",
    "DataProviderID": 2,
    "DataProvidersReference": "120840",
    "OperatorID": 5,
    "UsageTypeID": 1,
    "AddressInfo": {
        "ID": 120915,
        "Title": "ONE PASEO",
        "AddressLine1": "3703 Caminito Court",
        "Town": "San Diego",
        "StateOrProvince": "CA",
        "Postcode": "92130",
        "CountryID": 2,
        "Latitude": 32.952242,
        "Longitude": -117.2353549,
        "ContactTelephone1": "888-758-4389",
        "AccessComments": "24 hours daily",
        "RelatedURL": "http://www.chargepoint.com/",
        "DistanceUnit": 0
    },
    "Connections": [
        {
            "ID": 169924,
            "ConnectionTypeID": 1,
            "LevelID": 2,
            "Amps": 16,
            "Voltage": 230,
            "PowerKW": 3,
            "CurrentTypeID": 10,
            "Quantity": 2
        }
    ],
    "DateLastStatusUpdate": "2019-12-24T09:09:00Z",
    "DataQualityLevel": 3,
    "DateCreated": "2019-04-01T04:59:00Z",
    "SubmissionStatusTypeID": 100
}