{
    "IsRecentlyVerified": false,
    "ID": 5237,
    "UUID": "605A1784-67C7-46CC-83BA-7269FBEFA435",
    "DataProviderID": 1,
    "OperatorID": 20,
    "OperatorsReference": "10050,10051,10053",
    "UsageTypeID": 6,
    "UsageCost": "£1.00 + £0.50/hour",
    "AddressInfo": {
        "ID": 5177,
        "Title": "Cygnet Way",
        "AddressLine1": "Cygnet Way",
        "AddressLine2": "Rainton",
        "Town": "Houghton-le-Spring",
        "StateOrProvince": "Tyne and Wear",
        "Postcode": "DH4 5QY",
        "CountryID": 1,
        "Latitude": 54.8314156,
        "Longitude": -1.4824252,
        "DistanceUnit": 0
    },
    "Connections": [
        {
            "ID": 347,
            "ConnectionTypeID": 3,
            "StatusTypeID": 50,
            "LevelID": 2,
            "Amps": 13,
            "Voltage": 230,
            "PowerKW": 3,
            "CurrentTypeID": 10,
            "Quantity": 1
        },
        {
            "ID": 68597,
            "ConnectionTypeID": 25,
            "StatusTypeID": 75,
            "LevelID": 2,
            "Amps": 32,
            "Voltage": 230,
            "PowerKW": 7,
            "CurrentTypeID": 10,
            "Quantity": 2
        }
    ],
    "NumberOfPoints": 2,
    "StatusTypeID": 75,
    "DateLastStatusUpdate": "2017-09-04T09:12:00Z",
    "DataQualityLevel": 1,
    "DateCreated": "2011-08-24T15:40:00Z",
    "SubmissionStatusTypeID": 200
}