{
    "IsRecentlyVerified": false,
    "ID": 48152,
    "UUID": "063E320A-5E27-4D47-9F4A-7A65B5859167",
    "DataProviderID": 1,
    "OperatorID": 5,
    "UsageTypeID": 1,
    "UsageCost": "$0.25/kWh; after 30 minutes an extra $0.10/min.",
    "AddressInfo": {
        "ID": 48498,
        "Title": "Holiday Inn Chargepoint 25KW station",
        "AddressLine1": "17035 Condit Rd",
        "Town": "Morgan Hill",
        "StateOrProvince": "CA",
        "Postcode": "95037",
        "CountryID": 2,
        "Latitude": 37.133701618513754,
        "Longitude": -121.6319291241939,
        "ContactTelephone1": "+1 844-547-8641",
        "RelatedURL": "https://www.plugshare.com/location/84459",
        "DistanceUnit": 0
    },
    "Connections": [
        {
            "ID": 59544,
            "ConnectionTypeID": 32,
            "StatusTypeID": 50,
            "LevelID": 3,
            "Amps": 55,
            "Voltage": 208,
            "PowerKW": 22,
            "CurrentTypeID": 30,
            "Quantity": 1
        },
        {
            "ID": 304409,
            "ConnectionTypeID": 32,
            "StatusTypeID": 50,
            "LevelID": 3,
            "Amps": 55,
            "Voltage": 208,
            "PowerKW": 22,
            "CurrentTypeID": 30,
            "Quantity": 1
        }
    ],
    "NumberOfPoints": 2,
    "GeneralComments": "Chargers on north Hotel wall. Two 55A (~22 kW) CCS DCFCs.",
    "StatusTypeID": 50,
    "DateLastStatusUpdate": "2021-07-29T09:54:00Z",
    "DataQualityLevel": 3,
    "DateCreated": "2015-06-24T11:44:00Z",
    "SubmissionStatusTypeID": 100
}