{
    "IsRecentlyVerified": false,
    "ID": 46335,
    "UUID": "84E35A1F-4DD8-4B41-8573-8726CBA58182",
    "DataProviderID": 1,
    "DataProvidersReference": "1286",
    "AddressInfo": {
        "ID": 46681,
        "Title": "T. Gran Eiendomsselskap, Lørenskog",
        "AddressLine1": "Solheimveien 50",
        "Town": "LØRENSKOG",
        "StateOrProvince": "Viken",
        "Postcode": "1473",
        "CountryID": 168,
        "Latitude": 59.93172,
        "Longitude": 10.94285,
        "AccessComments": "",
        "DistanceUnit": 0
    },
    "Connections": [
        {
            "ID": 56998,
            "ConnectionTypeID": 0,
            "Reference": "1",
            "LevelID": 2,
            "Amps": 16,
            "Voltage": 230,
            "PowerKW": 3.7,
            "Comments": "Mode 1"
        },
        {
            "ID": 88733,
            "ConnectionTypeID": 0,
            "Reference": "2",
            "LevelID": 2,
            "Amps": 16,
            "Voltage": 230,
            "PowerKW": 3.7,
            "Comments": "Mode 1"
        }
    ],
    "NumberOfPoints": 2,
    "DateLastStatusUpdate": "2020-05-26T08:23:00Z",
    "DataQualityLevel": 2,
    "DateCreated": "2015-05-03T00:54:00Z",
    "SubmissionStatusTypeID": 100
}