{
    "IsRecentlyVerified": false,
    "ID": 175802,
    "UUID": "8E91F85F-79DB-4656-BA05-8E1D36A629F5",
    "DataProviderID": 1,
    "OperatorID": 1,
    "UsageTypeID": 4,
    "AddressInfo": {
        "ID": 176161,
        "Title": "Two Rivers Mall Nairobi",
        "AddressLine1": "Limuru Road",
        "Town": "Nairobi",
        "StateOrProvince": "Nairobi",
        "Postcode": "00606",
        "CountryID": 118,
        "Latitude": -1.2114489743082117,
        "Longitude": 36.795807619887796,
        "DistanceUnit": 0
    },
    "Connections": [
        {
            "ID": 273010,
            "ConnectionTypeID": 25,
            "StatusTypeID": 50,
            "LevelID": 2,
            "PowerKW": 11,
            "CurrentTypeID": 20,
            "Quantity": 1
        },
        {
            "ID": 304304,
            "ConnectionTypeID": 2,
            "StatusTypeID": 50,
            "LevelID": 3,
            "PowerKW": 22,
            "CurrentTypeID": 30,
            "Quantity": 1
        }
    ],
    "NumberOfPoints": 1,
    "StatusTypeID": 50,
    "DateLastStatusUpdate": "2021-07-26T14:22:00Z",
    "DataQualityLevel": 1,
    "DateCreated": "2021-06-15T16:24:00Z",
    "SubmissionStatusTypeID": 200
}