{
    "IsRecentlyVerified": false,
    "ID": 162322,
    "UUID": "E9F5768D-239D-49F8-9E2A-8ED540D6E5A2",
    "DataProviderID": 1,
    "OperatorID": 45,
    "UsageTypeID": 4,
    "UsageCost": "ISK 2 per minute / ISK 20 per kWh",
    "AddressInfo": {
        "ID": 162679,
        "Title": "Laugar Reykjadal",
        "AddressLine1": " Kjarni",
        "Town": "Laugar",
        "Postcode": " 650 ",
        "CountryID": 105,
        "Latitude": 65.72161929129791,
        "Longitude": -17.372705358363305,
        "DistanceUnit": 0
    },
    "Connections": [
        {
            "ID": 233624,
            "ConnectionTypeID": 25,
            "StatusTypeID": 50,
            "LevelID": 2,
            "Amps": 32,
            "Voltage": 400,
            "PowerKW": 22,
            "CurrentTypeID": 20,
            "Quantity": 2
        }
    ],
    "NumberOfPoints": 1,
    "GeneralComments": "ON - Orka Náttúrunnar",
    "StatusTypeID": 50,
    "DateLastStatusUpdate": "2020-08-06T11:32:00Z",
    "DataQualityLevel": 1,
    "DateCreated": "2020-08-05T09:55:00Z",
    "SubmissionStatusTypeID": 200
}