{
    "IsRecentlyVerified": false,
    "ID": 167617,
    "UUID": "9C34329A-5874-4E30-8DDA-FF2D77CA609D",
    "DataProviderID": 19,
    "DataProvidersReference": "6749",
    "AddressInfo": {
        "ID": 167976,
        "Title": "Hamn",
        "AddressLine1": "Hamnveien 1125-1131",
        "Town": "SKALAND",
        "StateOrProvince": "Troms og Finnmark",
        "Postcode": "9385",
        "CountryID": 168,
        "Latitude": 69.41698,
        "Longitude": 17.16816,
        "AccessComments": "",
        "DistanceUnit": 0
    },
    "Connections": [
        {
            "ID": 254501,
            "ConnectionTypeID": 25,
            "Reference": "1",
            "LevelID": 3,
            "Amps": 32,
            "Voltage": 400,
            "PowerKW": 22,
            "CurrentTypeID": 30,
            "Comments": "Mode 3"
        },
        {
            "ID": 254502,
            "ConnectionTypeID": 25,
            "Reference": "2",
            "LevelID": 3,
            "Amps": 32,
            "Voltage": 400,
            "PowerKW": 22,
            "CurrentTypeID": 30,
            "Comments": "Mode 3"
        },
        {
            "ID": 254503,
            "ConnectionTypeID": 25,
            "Reference": "3",
            "LevelID": 3,
            "Amps": 32,
            "Voltage": 400,
            "PowerKW": 22,
            "CurrentTypeID": 30,
            "Comments": "Mode 3"
        },
        {
            "ID": 254504,
            "ConnectionTypeID": 25,
            "Reference": "4",
            "LevelID": 3,
            "Amps": 32,
            "Voltage": 400,
            "PowerKW": 22,
            "CurrentTypeID": 30,
            "Comments": "Mode 3"
        }
    ],
    "NumberOfPoints": 4,
    "StatusTypeID": 0,
    "DateLastStatusUpdate": "2021-03-24T05:12:00Z",
    "DataQualityLevel": 2,
    "DateCreated": "2020-09-08T04:14:00Z",
    "SubmissionStatusTypeID": 100
}