{
    "IsRecentlyVerified": false,
    "ID": 91199,
    "UUID": "7E52CD93-B012-4E12-A03F-6D4353AC9464",
    "DataProviderID": 1,
    "OperatorID": 23,
    "OperatorsReference": "32494",
    "UsageTypeID": 6,
    "AddressInfo": {
        "ID": 91545,
        "Title": "Argentario Golf Resort & Spa",
        "AddressLine1": "Via Acquedotto Leopoldino",
        "Town": "Porto Ercole",
        "Postcode": "58018",
        "CountryID": 112,
        "Latitude": 42.416837,
        "Longitude": 11.184957,
        "ContactTelephone1": "+39 0564 888 512",
        "DistanceUnit": 0
    },
    "Connections": [
        {
            "ID": 129330,
            "ConnectionTypeID": 30,
            "StatusTypeID": 50,
            "LevelID": 2,
            "Amps": 32,
            "Voltage": 400,
            "PowerKW": 22,
            "CurrentTypeID": 20,
            "Quantity": 1
        }
    ],
    "NumberOfPoints": 1,
    "GeneralComments": "1 Tesla Connector, up to 22kW.Available for patrons only. Please call ahead.",
    "StatusTypeID": 50,
    "DateLastStatusUpdate": "2018-10-03T23:48:00Z",
    "DataQualityLevel": 1,
    "DateCreated": "2017-08-02T05:32:00Z",
    "SubmissionStatusTypeID": 200
}