{
    "IsRecentlyVerified": false,
    "ID": 174155,
    "UUID": "9DEF080E-C60C-4BFF-9854-C6D63AF461C2",
    "DataProviderID": 1,
    "OperatorID": 73,
    "UsageTypeID": 6,
    "AddressInfo": {
        "ID": 174514,
        "Title": "Park Hotel La Grave",
        "AddressLine1": "Via S.C. Chiancud, 1, 70013 Castellana Grotte BA",
        "Town": "Castellana Grotte",
        "StateOrProvince": "Bari",
        "Postcode": "70013",
        "CountryID": 112,
        "Latitude": 40.87909,
        "Longitude": 17.1431,
        "ContactTelephone1": "+390804968122",
        "DistanceUnit": 0
    },
    "Connections": [
        {
            "ID": 269130,
            "ConnectionTypeID": 25,
            "StatusTypeID": 50,
            "LevelID": 2,
            "PowerKW": 11,
            "CurrentTypeID": 20,
            "Quantity": 1
        }
    ],
    "NumberOfPoints": 1,
    "StatusTypeID": 50,
    "DateLastStatusUpdate": "2021-03-18T22:01:00Z",
    "DataQualityLevel": 1,
    "DateCreated": "2021-03-18T13:54:00Z",
    "SubmissionStatusTypeID": 200
}