{
    "IsRecentlyVerified": false,
    "ID": 62642,
    "UUID": "205355B3-2718-40D6-95DD-0E8CD0A821D2",
    "DataProviderID": 26,
    "DataProvidersReference": "19697",
    "OperatorID": 162,
    "OperatorsReference": "日産フリート（株） 東京サービス工場",
    "UsageCost": "0.00 onbekend",
    "AddressInfo": {
        "ID": 62988,
        "Title": "海岸通り",
        "AddressLine1": "海岸通り",
        "Town": "港区",
        "Postcode": "105-0022",
        "CountryID": 114,
        "Latitude": 35.643322,
        "Longitude": 139.756592,
        "DistanceUnit": 0
    },
    "Connections": [
        {
            "ID": 79564,
            "ConnectionTypeID": 2,
            "LevelID": 3,
            "PowerKW": 50,
            "CurrentTypeID": 30
        },
        {
            "ID": 95266,
            "ConnectionTypeID": 2,
            "LevelID": 3,
            "PowerKW": 50,
            "CurrentTypeID": 30
        }
    ],
    "NumberOfPoints": 1,
    "StatusTypeID": 50,
    "DateLastStatusUpdate": "2016-06-04T02:37:00Z",
    "DataQualityLevel": 3,
    "DateCreated": "2016-03-03T12:29:00Z",
    "SubmissionStatusTypeID": 100
}