{
    "IsRecentlyVerified": false,
    "ID": 33625,
    "UUID": "8FF1EB05-183C-4E8D-BA42-927443FB44BF",
    "DataProviderID": 26,
    "DataProvidersReference": "51879",
    "OperatorID": 157,
    "OperatorsReference": "NewMotion 02009668",
    "UsageCost": "0.00 jaarabonnement",
    "AddressInfo": {
        "ID": 33971,
        "Title": "Koenendelseweg 29",
        "AddressLine1": "Koenendelseweg 29",
        "Town": "'s-Hertogenbosch",
        "Postcode": "5222 BG",
        "CountryID": 159,
        "Latitude": 51.6984062194824,
        "Longitude": 5.27287244796753,
        "ContactTelephone1": "088 0109500",
        "RelatedURL": "http://thenewmotion.nl/",
        "DistanceUnit": 0
    },
    "Connections": [
        {
            "ID": 37136,
            "ConnectionTypeID": 25,
            "LevelID": 2,
            "PowerKW": 3.7,
            "CurrentTypeID": 10
        }
    ],
    "NumberOfPoints": 1,
    "StatusTypeID": 50,
    "DateLastStatusUpdate": "2016-06-04T02:40:00Z",
    "DataQualityLevel": 3,
    "DateCreated": "2015-01-09T06:04:00Z",
    "SubmissionStatusTypeID": 100
}