{
    "IsRecentlyVerified": false,
    "ID": 151754,
    "UUID": "A3AC7436-0218-4D64-9FA7-B0B5CB898188",
    "DataProviderID": 28,
    "DataProvidersReference": "FRS42P42210A1",
    "UsageTypeID": 5,
    "AddressInfo": {
        "ID": 152107,
        "Title": "Parking aux portes",
        "AddressLine1": "place des portes",
        "CountryID": 80,
        "Latitude": 45.479275,
        "Longitude": 4.6473,
        "AccessComments": "24/24 - 7/7",
        "DistanceUnit": 0
    },
    "Connections": [
        {
            "ID": 212090,
            "ConnectionTypeID": 28,
            "StatusTypeID": 50,
            "LevelID": 2,
            "PowerKW": 22,
            "CurrentTypeID": 10
        },
        {
            "ID": 212091,
            "ConnectionTypeID": 1036,
            "StatusTypeID": 50,
            "LevelID": 2,
            "PowerKW": 22,
            "CurrentTypeID": 20
        },
        {
            "ID": 244478,
            "ConnectionTypeID": 28,
            "StatusTypeID": 50,
            "LevelID": 2,
            "PowerKW": 22,
            "CurrentTypeID": 10
        },
        {
            "ID": 244479,
            "ConnectionTypeID": 1036,
            "StatusTypeID": 50,
            "LevelID": 2,
            "PowerKW": 22,
            "CurrentTypeID": 20
        }
    ],
    "GeneralComments": "En service",
    "StatusTypeID": 50,
    "DateLastStatusUpdate": "2020-08-27T05:12:00Z",
    "DataQualityLevel": 2,
    "DateCreated": "2020-03-15T10:53:00Z",
    "SubmissionStatusTypeID": 100
}