{
    "IsRecentlyVerified": false,
    "ID": 138551,
    "UUID": "441928A2-73C6-4EC8-8BEA-312BC28D5648",
    "DataProviderID": 2,
    "DataProvidersReference": "123458",
    "OperatorID": 9,
    "UsageTypeID": 1,
    "AddressInfo": {
        "ID": 138900,
        "Title": "HACEP- Central Office Guard Shack",
        "AddressLine1": "5301 East Paisano Drive",
        "Town": "El Paso",
        "StateOrProvince": "TX",
        "Postcode": "79905",
        "CountryID": 2,
        "Latitude": 31.766515,
        "Longitude": -106.426877,
        "ContactTelephone1": "888-998-2546",
        "AccessComments": "MON: 24 hours | TUE: 24 hours | WED: 24 hours | THU: 24 hours | FRI: 24 hours | SAT: 24 hours | SUN: 24 hours",
        "RelatedURL": "http://www.blinkcharging.com/",
        "DistanceUnit": 0
    },
    "Connections": [
        {
            "ID": 193692,
            "ConnectionTypeID": 1,
            "LevelID": 2,
            "Amps": 16,
            "Voltage": 230,
            "PowerKW": 3.7,
            "CurrentTypeID": 10,
            "Quantity": 1
        }
    ],
    "StatusTypeID": 50,
    "DateLastStatusUpdate": "2020-06-26T02:54:00Z",
    "DataQualityLevel": 3,
    "DateCreated": "2019-12-24T09:09:00Z",
    "SubmissionStatusTypeID": 100
}