{
    "IsRecentlyVerified": false,
    "ID": 165048,
    "UUID": "D942C852-3FE9-423A-AAD1-FC9F1D3F21FB",
    "DataProviderID": 1,
    "OperatorID": 23,
    "OperatorsReference": "50562",
    "UsageTypeID": 4,
    "UsageCost": "€0.33/kWh; Andere Tarife für ältere Autos",
    "AddressInfo": {
        "ID": 165407,
        "Title": "Gützkow Supercharger",
        "AddressLine1": "3 Am Kleinbahnhof",
        "Town": "Gützkow",
        "StateOrProvince": "MV",
        "Postcode": "17506",
        "CountryID": 87,
        "Latitude": 53.943943,
        "Longitude": 13.396739,
        "DistanceUnit": 0
    },
    "Connections": [
        {
            "ID": 236648,
            "ConnectionTypeID": 27,
            "StatusTypeID": 50,
            "LevelID": 3,
            "PowerKW": 120,
            "CurrentTypeID": 30,
            "Quantity": 10
        }
    ],
    "NumberOfPoints": 10,
    "GeneralComments": "10 Superchargers, available 24/7, up to 150kW",
    "StatusTypeID": 50,
    "DateLastStatusUpdate": "2020-08-27T05:35:00Z",
    "DataQualityLevel": 1,
    "DateCreated": "2020-08-25T05:47:00Z",
    "SubmissionStatusTypeID": 200
}