{
    "IsRecentlyVerified": false,
    "ID": 34774,
    "UUID": "36A0C29D-C590-4D05-A28F-1DD130861B77",
    "DataProviderID": 26,
    "DataProvidersReference": "39502",
    "OperatorsReference": "ENE-P1003",
    "UsageCost": "0.00 afhankelijk van pas",
    "AddressInfo": {
        "ID": 35120,
        "Title": "Marten Meesweg",
        "AddressLine1": "Marten Meesweg",
        "Town": "Rotterdam",
        "Postcode": "3068 AZ",
        "CountryID": 159,
        "Latitude": 51.953,
        "Longitude": 4.557,
        "ContactTelephone1": "0900-0201",
        "ContactEmail": "info@eneco.nl",
        "RelatedURL": "http://www.eneco.nl",
        "DistanceUnit": 0
    },
    "Connections": [
        {
            "ID": 38285,
            "ConnectionTypeID": 25,
            "LevelID": 2,
            "PowerKW": 5,
            "CurrentTypeID": 10
        },
        {
            "ID": 47497,
            "ConnectionTypeID": 25,
            "LevelID": 2,
            "PowerKW": 5,
            "CurrentTypeID": 10
        },
        {
            "ID": 47498,
            "ConnectionTypeID": 25,
            "LevelID": 2,
            "PowerKW": 5,
            "CurrentTypeID": 10
        },
        {
            "ID": 47499,
            "ConnectionTypeID": 25,
            "LevelID": 2,
            "PowerKW": 5,
            "CurrentTypeID": 10
        },
        {
            "ID": 47500,
            "ConnectionTypeID": 25,
            "LevelID": 2,
            "PowerKW": 11,
            "CurrentTypeID": 10
        },
        {
            "ID": 82272,
            "ConnectionTypeID": 25,
            "LevelID": 2,
            "PowerKW": 11,
            "CurrentTypeID": 10
        },
        {
            "ID": 82273,
            "ConnectionTypeID": 25,
            "LevelID": 2,
            "PowerKW": 11,
            "CurrentTypeID": 10
        },
        {
            "ID": 82274,
            "ConnectionTypeID": 25,
            "LevelID": 2,
            "PowerKW": 11,
            "CurrentTypeID": 10
        },
        {
            "ID": 82275,
            "ConnectionTypeID": 25,
            "LevelID": 2,
            "PowerKW": 11,
            "CurrentTypeID": 10
        }
    ],
    "NumberOfPoints": 2,
    "StatusTypeID": 50,
    "DateLastStatusUpdate": "2016-06-04T02:43:00Z",
    "DataQualityLevel": 3,
    "DateCreated": "2015-01-09T06:04:00Z",
    "SubmissionStatusTypeID": 100
}