{
    "IsRecentlyVerified": false,
    "ID": 77090,
    "UUID": "46D5FA82-7ED8-4F3D-8733-5AF111EEAE58",
    "DataProviderID": 1,
    "OperatorID": 156,
    "UsageTypeID": 4,
    "AddressInfo": {
        "ID": 77436,
        "Title": "Ladepunkt Kötitzer Straße",
        "AddressLine1": "Kötitzer Straße 21",
        "Town": "Coswig",
        "StateOrProvince": "Landkreis Meißen",
        "Postcode": "01640",
        "CountryID": 87,
        "Latitude": 51.12119999999999,
        "Longitude": 13.575559999999996,
        "AccessComments": "Laden nur nach Anmeldung. Wallbox auf abgeschlossenem Grundstück; wird auch für eigenes Elektroauto verwendet.\r\n",
        "DistanceUnit": 0
    },
    "Connections": [
        {
            "ID": 110743,
            "ConnectionTypeID": 25,
            "StatusTypeID": 50,
            "LevelID": 2,
            "Amps": 32,
            "Voltage": 400,
            "PowerKW": 22,
            "CurrentTypeID": 20,
            "Quantity": 1
        }
    ],
    "NumberOfPoints": 1,
    "StatusTypeID": 50,
    "DateLastStatusUpdate": "2016-12-30T22:15:00Z",
    "DataQualityLevel": 1,
    "DateCreated": "2016-12-30T22:15:00Z",
    "SubmissionStatusTypeID": 200
}