{
    "IsRecentlyVerified": false,
    "ID": 26125,
    "UUID": "9A5B704A-7927-4986-B278-E6F37E18704E",
    "DataProviderID": 2,
    "DataProvidersReference": "45955",
    "OperatorID": 107,
    "UsageTypeID": 1,
    "AddressInfo": {
        "ID": 26471,
        "Title": "HawaiiUSA Federal Credit Union",
        "AddressLine1": "1226 College Walk",
        "Town": "Honolulu",
        "StateOrProvince": "HI",
        "Postcode": "96817",
        "CountryID": 2,
        "Latitude": 21.314801,
        "Longitude": -157.861726,
        "ContactTelephone1": "650-845-2869",
        "AccessComments": "Restricted to garage hours; pay lot",
        "RelatedURL": "http://www.opconnect.com/",
        "DistanceUnit": 0
    },
    "Connections": [
        {
            "ID": 28497,
            "ConnectionTypeID": 1,
            "LevelID": 2,
            "Amps": 16,
            "Voltage": 230,
            "PowerKW": 3.7,
            "CurrentTypeID": 10,
            "Quantity": 4
        }
    ],
    "DateLastStatusUpdate": "2020-06-26T02:52:00Z",
    "DataQualityLevel": 3,
    "DateCreated": "2014-11-28T03:37:00Z",
    "SubmissionStatusTypeID": 100
}