{
    "IsRecentlyVerified": false,
    "ID": 111934,
    "UUID": "BCBB07C8-20EA-4325-912A-4A59819B82B5",
    "DataProviderID": 2,
    "DataProvidersReference": "83055",
    "UsageTypeID": 1,
    "AddressInfo": {
        "ID": 112280,
        "Title": "Days Inn",
        "AddressLine1": "395 Boundary Trail",
        "Town": "Winkler",
        "StateOrProvince": "MB",
        "Postcode": "R6W 4B1",
        "CountryID": 44,
        "Latitude": 49.19354,
        "Longitude": -97.937771,
        "ContactTelephone1": "204-325-8888",
        "AccessComments": "24 hours daily; for guests and non-guests",
        "RelatedURL": "",
        "DistanceUnit": 0
    },
    "Connections": [
        {
            "ID": 157450,
            "ConnectionTypeID": 1,
            "LevelID": 2,
            "Amps": 16,
            "Voltage": 230,
            "PowerKW": 3.7,
            "CurrentTypeID": 10,
            "Quantity": 1
        }
    ],
    "DateLastStatusUpdate": "2020-06-26T03:11:00Z",
    "DataQualityLevel": 3,
    "DateCreated": "2018-10-18T23:37:00Z",
    "SubmissionStatusTypeID": 100
}