{
    "IsRecentlyVerified": false,
    "ID": 105690,
    "UUID": "6561A4B9-388B-476E-9603-657DF7854246",
    "DataProviderID": 2,
    "DataProvidersReference": "98550",
    "UsageTypeID": 1,
    "AddressInfo": {
        "ID": 106036,
        "Title": "Liberty Utilities - Joplin Public Library",
        "AddressLine1": "1901 E 20th St",
        "Town": "Joplin",
        "StateOrProvince": "MO",
        "Postcode": "64801",
        "CountryID": 2,
        "Latitude": 37.069544,
        "Longitude": -94.494073,
        "ContactTelephone1": "800-206-2300",
        "AccessComments": "24 hours daily",
        "RelatedURL": "",
        "DistanceUnit": 0
    },
    "Connections": [
        {
            "ID": 148883,
            "ConnectionTypeID": 1,
            "LevelID": 2,
            "Amps": 16,
            "Voltage": 230,
            "PowerKW": 3,
            "CurrentTypeID": 10,
            "Quantity": 1
        }
    ],
    "DateLastStatusUpdate": "2019-04-06T04:02:00Z",
    "DataQualityLevel": 3,
    "DateCreated": "2018-06-09T04:01:00Z",
    "SubmissionStatusTypeID": 100
}