{
    "IsRecentlyVerified": false,
    "ID": 132197,
    "UUID": "053832F6-932D-4A92-8D31-75EF8C3A2827",
    "DataProviderID": 1,
    "UsageTypeID": 1,
    "AddressInfo": {
        "ID": 132543,
        "Title": "Avenida Ismael Valerio",
        "AddressLine1": "Grecia, Alajuela",
        "AddressLine2": "Frente al Mercado Municipal",
        "Town": "Grecia",
        "StateOrProvince": "Alajuela",
        "Postcode": "20301",
        "CountryID": 58,
        "Latitude": 10.0719966254285,
        "Longitude": -84.313267232445,
        "DistanceUnit": 0
    },
    "Connections": [
        {
            "ID": 185023,
            "ConnectionTypeID": 1,
            "StatusTypeID": 50,
            "LevelID": 2,
            "CurrentTypeID": 10,
            "Quantity": 2
        }
    ],
    "NumberOfPoints": 2,
    "StatusTypeID": 50,
    "DateLastStatusUpdate": "2019-12-11T18:09:00Z",
    "DataQualityLevel": 1,
    "DateCreated": "2019-09-23T16:58:00Z",
    "SubmissionStatusTypeID": 200
}