{
    "IsRecentlyVerified": false,
    "ID": 139166,
    "UUID": "FD956B01-2AD4-4504-BE0A-A9A452CAFB32",
    "DataProviderID": 2,
    "DataProvidersReference": "104954",
    "OperatorID": 5,
    "UsageTypeID": 1,
    "AddressInfo": {
        "ID": 139518,
        "Title": "JLRNS",
        "AddressLine1": "7111 E Chauncey Ln",
        "Town": "Phoenix",
        "StateOrProvince": "AZ",
        "Postcode": "85054",
        "CountryID": 2,
        "Latitude": 33.6504193,
        "Longitude": -111.9260306,
        "ContactTelephone1": "888-758-4389",
        "AccessComments": "24 hours daily",
        "RelatedURL": "http://www.chargepoint.com/",
        "DistanceUnit": 0
    },
    "Connections": [
        {
            "ID": 194433,
            "ConnectionTypeID": 32,
            "LevelID": 3,
            "Amps": 100,
            "Voltage": 400,
            "PowerKW": 40,
            "CurrentTypeID": 30,
            "Quantity": 1
        }
    ],
    "StatusTypeID": 50,
    "DateLastStatusUpdate": "2020-06-26T02:55:00Z",
    "DataQualityLevel": 3,
    "DateCreated": "2019-12-24T09:10:00Z",
    "SubmissionStatusTypeID": 100
}