{
    "IsRecentlyVerified": false,
    "ID": 132514,
    "UUID": "2D7A2174-6ACC-47A7-9E4F-F0FA449D05CC",
    "DataProviderID": 1,
    "OperatorID": 80,
    "UsageTypeID": 4,
    "AddressInfo": {
        "ID": 132860,
        "Title": "PENNY Market Catanzaro | EnelX",
        "AddressLine1": "Viale Magna Grecia SS19q",
        "Town": "Catanzaro",
        "StateOrProvince": "CZ",
        "Postcode": "88063",
        "CountryID": 112,
        "Latitude": 38.828994609669365,
        "Longitude": 16.609362818306636,
        "RelatedURL": "https://www.enelx.com/it/it/emobility",
        "DistanceUnit": 0
    },
    "Connections": [
        {
            "ID": 185520,
            "ConnectionTypeID": 25,
            "StatusTypeID": 50,
            "LevelID": 2,
            "Amps": 32,
            "Voltage": 400,
            "PowerKW": 22,
            "CurrentTypeID": 20,
            "Quantity": 2
        }
    ],
    "NumberOfPoints": 2,
    "GeneralComments": "LUN - SAB 08- 21; DOM 08:30 -13.30 /16- 20",
    "StatusTypeID": 50,
    "DateLastStatusUpdate": "2019-10-01T12:48:00Z",
    "DataQualityLevel": 1,
    "DateCreated": "2019-10-01T12:48:00Z",
    "SubmissionStatusTypeID": 200
}