{
    "IsRecentlyVerified": false,
    "ID": 122908,
    "UUID": "3C424713-7614-4062-8AF8-ACAA39E29D7B",
    "DataProviderID": 2,
    "DataProvidersReference": "61216",
    "OperatorID": 5,
    "UsageTypeID": 1,
    "AddressInfo": {
        "ID": 123254,
        "Title": "ROADSHOW BMW",
        "AddressLine1": "397 N Germantown Pkwy",
        "Town": "Memphis",
        "StateOrProvince": "TN",
        "Postcode": "38018",
        "CountryID": 2,
        "Latitude": 35.136529,
        "Longitude": -89.7968759,
        "ContactTelephone1": "888-758-4389",
        "AccessComments": "24 hours daily",
        "RelatedURL": "http://www.chargepoint.com/",
        "DistanceUnit": 0
    },
    "Connections": [
        {
            "ID": 172836,
            "ConnectionTypeID": 1,
            "LevelID": 2,
            "Amps": 16,
            "Voltage": 230,
            "PowerKW": 3.7,
            "CurrentTypeID": 10,
            "Quantity": 2
        }
    ],
    "DateLastStatusUpdate": "2020-06-26T02:57:00Z",
    "DataQualityLevel": 3,
    "DateCreated": "2019-04-06T05:03:00Z",
    "SubmissionStatusTypeID": 100
}