{
    "MediaItems": [
        {
            "ID": 25854,
            "ChargePointID": 57894,
            "ItemURL": "https://s3-ap-southeast-2.amazonaws.com/openchargemap/images/IT/OCM57894/OCM-57894.orig.2020121909455671.jpg",
            "ItemThumbnailURL": "https://s3-ap-southeast-2.amazonaws.com/openchargemap/images/IT/OCM57894/OCM-57894.thmb.2020121909455671.jpg",
            "Comment": "",
            "IsEnabled": true,
            "IsVideo": false,
            "IsFeaturedItem": false,
            "IsExternalResource": false,
            "User": {
                "ID": 28827,
                "Username": "Logi"
            },
            "DateCreated": "2020-12-19T09:46:00Z"
        }
    ],
    "IsRecentlyVerified": false,
    "ID": 57894,
    "UUID": "E5DBF5CF-C52E-4B73-8705-9E53EE129BBD",
    "DataProviderID": 1,
    "OperatorID": 80,
    "UsageTypeID": 4,
    "UsageCost": "0,45 €/kW",
    "AddressInfo": {
        "ID": 58240,
        "Title": "LUISS University | EnelX",
        "AddressLine1": "Viale Pola, 25",
        "Town": "Roma",
        "StateOrProvince": "RM",
        "Postcode": "00161",
        "CountryID": 112,
        "Latitude": 41.9184351397126,
        "Longitude": 12.5115603670108,
        "RelatedURL": "http://eneldrive.it",
        "DistanceUnit": 0
    },
    "Connections": [
        {
            "ID": 73424,
            "ConnectionTypeID": 25,
            "StatusTypeID": 50,
            "LevelID": 2,
            "Amps": 32,
            "Voltage": 400,
            "PowerKW": 22,
            "CurrentTypeID": 20,
            "Quantity": 2
        },
        {
            "ID": 73425,
            "ConnectionTypeID": 36,
            "StatusTypeID": 50,
            "LevelID": 2,
            "Amps": 13,
            "Voltage": 240,
            "PowerKW": 3,
            "CurrentTypeID": 10,
            "Quantity": 2
        }
    ],
    "NumberOfPoints": 4,
    "StatusTypeID": 50,
    "DateLastStatusUpdate": "2020-12-19T09:46:00Z",
    "DataQualityLevel": 1,
    "DateCreated": "2015-12-27T16:25:00Z",
    "SubmissionStatusTypeID": 200
}