{
    "IsRecentlyVerified": false,
    "ID": 163629,
    "UUID": "FE79B2CC-9315-41F9-8FFE-54DD6AE5395E",
    "DataProviderID": 1,
    "OperatorID": 23,
    "OperatorsReference": "25373",
    "UsageTypeID": 4,
    "AddressInfo": {
        "ID": 163986,
        "Title": "Hotel Vincci Maritimo",
        "AddressLine1": "Carrer de Llull",
        "Town": "340",
        "StateOrProvince": "Barcelona",
        "Postcode": "8019",
        "CountryID": 210,
        "Latitude": 41.408258,
        "Longitude": 2.21174,
        "ContactTelephone1": "+34 933 562 600",
        "DistanceUnit": 0
    },
    "Connections": [
        {
            "ID": 235226,
            "ConnectionTypeID": 30,
            "StatusTypeID": 50,
            "LevelID": 2,
            "PowerKW": 11,
            "CurrentTypeID": 20,
            "Quantity": 1
        }
    ],
    "NumberOfPoints": 1,
    "GeneralComments": "1 Tesla Connector, up to 11kW.Available for customers. Please see front desk.",
    "StatusTypeID": 50,
    "DateLastStatusUpdate": "2020-08-24T13:40:00Z",
    "DataQualityLevel": 1,
    "DateCreated": "2020-08-24T13:39:00Z",
    "SubmissionStatusTypeID": 200
}