{
    "IsRecentlyVerified": false,
    "ID": 81327,
    "UUID": "A575AD36-55A1-4A05-9D18-3936C991BA7C",
    "DataProviderID": 1,
    "OperatorID": 45,
    "UsageTypeID": 1,
    "AddressInfo": {
        "ID": 81673,
        "Title": "Autohaus Conny Jenschewski",
        "AddressLine1": "Leipziger Straße 113",
        "Town": "Zwickau",
        "StateOrProvince": "Landkreis Zwickau",
        "Postcode": "08058",
        "CountryID": 87,
        "Latitude": 50.73581600046529,
        "Longitude": 12.490054685319482,
        "ContactTelephone1": "+49 375390290",
        "AccessComments": "24/7 kostenlos nutzbar.",
        "RelatedURL": "http://www.jenschewski.com/",
        "DistanceUnit": 0
    },
    "Connections": [
        {
            "ID": 116042,
            "ConnectionTypeID": 25,
            "StatusTypeID": 50,
            "LevelID": 2,
            "Amps": 32,
            "Voltage": 400,
            "PowerKW": 22,
            "CurrentTypeID": 20,
            "Quantity": 1
        }
    ],
    "NumberOfPoints": 1,
    "StatusTypeID": 50,
    "DateLastStatusUpdate": "2017-02-01T07:42:00Z",
    "DataQualityLevel": 1,
    "DateCreated": "2017-02-01T07:42:00Z",
    "SubmissionStatusTypeID": 200
}