{
    "IsRecentlyVerified": false,
    "ID": 113895,
    "UUID": "11E96157-DA2F-444A-9125-E7901209B981",
    "DataProviderID": 1,
    "OperatorID": 23,
    "OperatorsReference": "46802",
    "UsageTypeID": 4,
    "AddressInfo": {
        "ID": 114241,
        "Title": "Derry Municipal Lot",
        "AddressLine1": "14 Manning St",
        "Town": "Derry",
        "StateOrProvince": "New Hampshire",
        "Postcode": "03038",
        "CountryID": 2,
        "Latitude": 42.8821212,
        "Longitude": -71.3264818,
        "ContactTelephone1": "(603) 432-6100",
        "DistanceUnit": 0
    },
    "Connections": [
        {
            "ID": 160465,
            "ConnectionTypeID": 30,
            "StatusTypeID": 50,
            "LevelID": 2,
            "PowerKW": 16,
            "CurrentTypeID": 20,
            "Quantity": 3
        }
    ],
    "NumberOfPoints": 3,
    "GeneralComments": "3 Tesla Connectors, up to 16kW.Available to the public. Self park.",
    "StatusTypeID": 50,
    "DateLastStatusUpdate": "2019-01-02T21:53:00Z",
    "DataQualityLevel": 1,
    "DateCreated": "2019-01-02T21:53:00Z",
    "SubmissionStatusTypeID": 200
}