{
    "MediaItems": [
        {
            "ID": 3536,
            "ChargePointID": 51346,
            "ItemURL": "https://s3-ap-southeast-2.amazonaws.com/openchargemap/images/PL/OCM51346/OCM-51346.orig.2015112922322866.jpg",
            "ItemThumbnailURL": "https://s3-ap-southeast-2.amazonaws.com/openchargemap/images/PL/OCM51346/OCM-51346.thmb.2015112922322866.jpg",
            "Comment": "Just visiting :-)",
            "IsEnabled": true,
            "IsVideo": false,
            "IsFeaturedItem": false,
            "IsExternalResource": false,
            "User": {
                "ID": 6418,
                "Username": "PatrykS"
            },
            "DateCreated": "2015-11-29T22:33:00Z"
        }
    ],
    "IsRecentlyVerified": false,
    "ID": 51346,
    "UUID": "B4AEC070-2309-4DEB-91C9-F7BEDED88827",
    "DataProviderID": 1,
    "OperatorID": 105,
    "OperatorsReference": "Essent EM-PL-00000001-01-00004",
    "UsageTypeID": 1,
    "UsageCost": "0.00 jaarabonnement",
    "AddressInfo": {
        "ID": 51692,
        "Title": "Budynek RWE - Wybrzeże Kościuszkowskie 41",
        "AddressLine1": "Wybrzeże Kościuszkowskie 41",
        "Town": "Warszawa",
        "StateOrProvince": "mazowieckie",
        "Postcode": "00-347",
        "CountryID": 179,
        "Latitude": 52.239246,
        "Longitude": 21.030837,
        "RelatedURL": "https://www.rwe-mobility.com/web/cms/en/1195202/emobility/rwe-charging-post-finder/",
        "DistanceUnit": 0
    },
    "Connections": [
        {
            "ID": 63563,
            "ConnectionTypeID": 25,
            "StatusTypeID": 50,
            "LevelID": 2,
            "Amps": 32,
            "Voltage": 400,
            "PowerKW": 22,
            "CurrentTypeID": 20,
            "Quantity": 4
        }
    ],
    "NumberOfPoints": 4,
    "GeneralComments": "2 stations, 2 Mennekes (IEC 62196-2 Type 2) sockets in each station.",
    "StatusTypeID": 50,
    "DateLastStatusUpdate": "2016-12-12T11:15:00Z",
    "DataQualityLevel": 3,
    "DateCreated": "2015-07-24T06:28:00Z",
    "SubmissionStatusTypeID": 100
}