{
    "IsRecentlyVerified": false,
    "ID": 158511,
    "UUID": "E6C14F6C-C880-4E58-8B58-185F9336CAD1",
    "DataProviderID": 2,
    "DataProvidersReference": "151060",
    "OperatorID": 3293,
    "UsageTypeID": 1,
    "AddressInfo": {
        "ID": 158868,
        "Title": "Costa Mesa Courtyards",
        "AddressLine1": "1835 Newport Blvd",
        "Town": "Costa Mesa",
        "StateOrProvince": "CA",
        "Postcode": "92627",
        "CountryID": 2,
        "Latitude": 33.64233,
        "Longitude": -117.91955,
        "ContactTelephone1": "888-264-2208",
        "AccessComments": "6am-12am daily",
        "RelatedURL": "https://voltacharging.com/",
        "DistanceUnit": 0
    },
    "Connections": [
        {
            "ID": 228506,
            "ConnectionTypeID": 1,
            "LevelID": 2,
            "Amps": 16,
            "Voltage": 230,
            "PowerKW": 3.7,
            "CurrentTypeID": 10,
            "Quantity": 2
        }
    ],
    "StatusTypeID": 50,
    "DateLastStatusUpdate": "2020-06-26T02:55:00Z",
    "DataQualityLevel": 3,
    "DateCreated": "2020-06-26T02:55:00Z",
    "SubmissionStatusTypeID": 100
}