{
    "IsRecentlyVerified": false,
    "ID": 184548,
    "UUID": "3AB7EBB6-42B6-4287-BA4A-C582F48FB6A2",
    "DataProviderID": 29,
    "DataProvidersReference": "17736",
    "OperatorID": 220,
    "AddressInfo": {
        "ID": 184907,
        "Title": "Alter Heidberg 1",
        "AddressLine1": "Alter Heidberg 1",
        "Town": "Norderstedt",
        "Postcode": "22846",
        "CountryID": 87,
        "Latitude": 53.70874,
        "Longitude": 9.99445,
        "DistanceUnit": 0
    },
    "Connections": [
        {
            "ID": 292952,
            "ConnectionTypeID": 28,
            "StatusTypeID": 50,
            "LevelID": 2,
            "PowerKW": 22,
            "CurrentTypeID": 20
        },
        {
            "ID": 292953,
            "ConnectionTypeID": 25,
            "StatusTypeID": 50,
            "LevelID": 2,
            "PowerKW": 22,
            "CurrentTypeID": 20
        },
        {
            "ID": 302140,
            "ConnectionTypeID": 28,
            "StatusTypeID": 50,
            "LevelID": 2,
            "PowerKW": 22,
            "CurrentTypeID": 20
        },
        {
            "ID": 302141,
            "ConnectionTypeID": 25,
            "StatusTypeID": 50,
            "LevelID": 2,
            "PowerKW": 22,
            "CurrentTypeID": 20
        }
    ],
    "StatusTypeID": 50,
    "DateLastStatusUpdate": "2021-07-12T02:52:00Z",
    "MetadataValues": [
        {
            "ID": 16839,
            "MetadataFieldID": 4,
            "ItemValue": "Data from the German chargepoint registry provided by Bundesnetzagentur.de under the CC-BY 4.0 license"
        }
    ],
    "DataQualityLevel": 3,
    "DateCreated": "2021-07-08T10:05:00Z",
    "SubmissionStatusTypeID": 100
}