{
    "IsRecentlyVerified": false,
    "ID": 163405,
    "UUID": "C66878FF-056C-403F-AE5A-5A1745D8E957",
    "DataProviderID": 1,
    "OperatorID": 3307,
    "UsageTypeID": 1,
    "UsageCost": "80 HUF/min",
    "AddressInfo": {
        "ID": 163762,
        "Title": "Táncsics Mihály utca",
        "AddressLine1": "Táncsics Mihály utca",
        "AddressLine2": "Tabán",
        "Town": "Szolnok",
        "StateOrProvince": "Jász-Nagykun-Szolnok",
        "Postcode": "5000",
        "CountryID": 104,
        "Latitude": 47.17444864467686,
        "Longitude": 20.197154652104928,
        "DistanceUnit": 0
    },
    "Connections": [
        {
            "ID": 234983,
            "ConnectionTypeID": 33,
            "StatusTypeID": 50,
            "LevelID": 3,
            "Amps": 125,
            "Voltage": 400,
            "PowerKW": 50,
            "CurrentTypeID": 30,
            "Quantity": 1
        },
        {
            "ID": 234984,
            "ConnectionTypeID": 2,
            "StatusTypeID": 50,
            "LevelID": 3,
            "Amps": 125,
            "Voltage": 400,
            "PowerKW": 50,
            "CurrentTypeID": 30,
            "Quantity": 1
        }
    ],
    "NumberOfPoints": 1,
    "StatusTypeID": 50,
    "DateLastStatusUpdate": "2020-08-24T09:11:00Z",
    "DataQualityLevel": 1,
    "DateCreated": "2020-08-23T18:08:00Z",
    "SubmissionStatusTypeID": 200
}