{
    "IsRecentlyVerified": false,
    "ID": 14974,
    "UUID": "F13BF6A7-799C-4F90-9D77-6EFDC314A10C",
    "DataProviderID": 1,
    "OperatorID": 22,
    "OperatorsReference": "C63J6",
    "AddressInfo": {
        "ID": 15320,
        "Title": "Lee Valley Park",
        "AddressLine1": "Ballyard",
        "AddressLine2": "Tralee",
        "Town": "Kerry",
        "StateOrProvince": "County Kerry",
        "CountryID": 3,
        "Latitude": 52.260883,
        "Longitude": -9.714192,
        "DistanceUnit": 0
    },
    "Connections": [
        {
            "ID": 18537,
            "ConnectionTypeID": 25,
            "StatusTypeID": 50,
            "LevelID": 2,
            "Amps": 32,
            "Voltage": 400,
            "PowerKW": 22,
            "CurrentTypeID": 20,
            "Quantity": 2
        }
    ],
    "NumberOfPoints": 2,
    "StatusTypeID": 50,
    "DateLastStatusUpdate": "2019-06-04T06:09:00Z",
    "DataQualityLevel": 2,
    "DateCreated": "2012-12-11T15:08:00Z",
    "SubmissionStatusTypeID": 100
}