{
    "IsRecentlyVerified": false,
    "ID": 37494,
    "UUID": "5D4C261C-1BDB-4F7B-9ACD-8A9BF111E9A0",
    "DataProviderID": 26,
    "DataProvidersReference": "14941",
    "OperatorID": 162,
    "OperatorsReference": "Kruislaan",
    "UsageCost": "0.00 gratis",
    "AddressInfo": {
        "ID": 37840,
        "Title": "Science Park",
        "AddressLine1": "Science Park",
        "Town": "Amsterdam",
        "Postcode": "1098 XG",
        "CountryID": 159,
        "Latitude": 52.354912,
        "Longitude": 4.9522,
        "RelatedURL": "http://www.nieuwamsterdamsklimaat.nl/vervoer/amsterdam_elektrisch/kaart_oplaadpunten",
        "DistanceUnit": 0
    },
    "Connections": [
        {
            "ID": 41005,
            "ConnectionTypeID": 28,
            "LevelID": 1,
            "PowerKW": 2.3,
            "CurrentTypeID": 10
        }
    ],
    "NumberOfPoints": 1,
    "StatusTypeID": 50,
    "DateLastStatusUpdate": "2016-06-04T02:53:00Z",
    "DataQualityLevel": 3,
    "DateCreated": "2015-01-09T06:07:00Z",
    "SubmissionStatusTypeID": 100
}