{
    "IsRecentlyVerified": false,
    "ID": 61515,
    "UUID": "69AE121F-3B8E-4C4E-B299-A633E4142A21",
    "DataProviderID": 1,
    "OperatorID": 3315,
    "OperatorsReference": "51018",
    "UsageTypeID": 4,
    "UsageCost": "Free. Parking fees apply.",
    "AddressInfo": {
        "ID": 61861,
        "Title": "Grangemouth - Union Road Car Park",
        "AddressLine1": "11 Union Road",
        "Town": "Grangemouth",
        "Postcode": "FK3 8AB",
        "CountryID": 1,
        "Latitude": 56.020109,
        "Longitude": -3.723729,
        "RelatedURL": "http://www.chargeyourcar.org.uk",
        "DistanceUnit": 0
    },
    "Connections": [
        {
            "ID": 78396,
            "ConnectionTypeID": 25,
            "StatusTypeID": 50,
            "LevelID": 2,
            "Amps": 32,
            "Voltage": 400,
            "PowerKW": 22,
            "CurrentTypeID": 20,
            "Quantity": 2
        }
    ],
    "NumberOfPoints": 2,
    "StatusTypeID": 50,
    "DateLastStatusUpdate": "2018-04-09T16:26:00Z",
    "MetadataValues": [
        {
            "ID": 3013,
            "MetadataFieldID": 4,
            "ItemValue": "Contains public sector information licensed under the Open Government Licence v2.0. http://www.nationalarchives.gov.uk/doc/open-government-licence/version/2/"
        }
    ],
    "DataQualityLevel": 3,
    "DateCreated": "2016-03-03T11:17:00Z",
    "SubmissionStatusTypeID": 100
}