{
    "UserComments": [
        {
            "ID": 20978,
            "ChargePointID": 99275,
            "CommentTypeID": 10,
            "UserName": "Simon Hewison",
            "Comment": "",
            "DateCreated": "2019-05-08T15:22:43.367Z",
            "User": {
                "ID": 4575,
                "Username": "Simon Hewison"
            },
            "CheckinStatusTypeID": 10
        },
        {
            "ID": 19714,
            "ChargePointID": 99275,
            "CommentTypeID": 10,
            "UserName": "markrassell",
            "Comment": "Love these machines. Fast and reliable. ",
            "Rating": 5,
            "DateCreated": "2018-06-24T17:12:04.51Z",
            "User": {
                "ID": 15812,
                "Username": "markrassell"
            },
            "CheckinStatusTypeID": 10
        },
        {
            "ID": 19701,
            "ChargePointID": 99275,
            "CommentTypeID": 10,
            "UserName": "markrassell",
            "Comment": "Working well. Have to log registration at reception to get free parking ",
            "Rating": 5,
            "DateCreated": "2018-06-22T10:32:06.943Z",
            "User": {
                "ID": 15812,
                "Username": "markrassell"
            },
            "CheckinStatusTypeID": 10
        },
        {
            "ID": 19350,
            "ChargePointID": 99275,
            "CommentTypeID": 10,
            "UserName": "Simon Hewison",
            "Comment": "Plug in hybrid blocking rapid charger. After 43 minutes, had only drawn 2.49kWh",
            "DateCreated": "2018-03-28T13:31:13.483Z",
            "User": {
                "ID": 4575,
                "Username": "Simon Hewison"
            },
            "CheckinStatusTypeID": 100
        },
        {
            "ID": 19321,
            "ChargePointID": 99275,
            "CommentTypeID": 10,
            "UserName": "Simon Hewison",
            "Comment": "Had feedback from Chargemaster. Apparently, there was a loose connection on the cable to the charger which caused the issue yesterday; an engineer has attended the unit, and it's repaired.",
            "DateCreated": "2018-03-22T09:48:14.473Z",
            "User": {
                "ID": 4575,
                "Username": "Simon Hewison"
            },
            "CheckinStatusTypeID": 0
        },
        {
            "ID": 19320,
            "ChargePointID": 99275,
            "CommentTypeID": 10,
            "UserName": "Simon Hewison",
            "Comment": "Flash and bang coming from unit shortly after starting chademo charge.  Nissan leaf. has been bricked. Thinks it is in turtle mode now (wasn't before) and now won't move or even charge from  13A socket ",
            "Rating": 1,
            "DateCreated": "2018-03-21T15:04:36.073Z",
            "User": {
                "ID": 4575,
                "Username": "Simon Hewison"
            },
            "CheckinStatusTypeID": 25
        }
    ],
    "IsRecentlyVerified": false,
    "ID": 99275,
    "UUID": "4FE7A5BF-67CD-4439-AF14-EF9149C010BA",
    "DataProviderID": 1,
    "OperatorID": 32,
    "OperatorsReference": "24040",
    "UsageTypeID": 4,
    "UsageCost": "£0.108/kWh; for Polar Plus subscription members only",
    "AddressInfo": {
        "ID": 99621,
        "Title": "Holiday Inn-High Wycombe",
        "AddressLine1": "Handycross",
        "Town": "High Wycombe",
        "Postcode": "HP11 1TL",
        "CountryID": 1,
        "Latitude": 51.6134,
        "Longitude": -0.771,
        "DistanceUnit": 0
    },
    "Connections": [
        {
            "ID": 140255,
            "ConnectionTypeID": 33,
            "StatusTypeID": 50,
            "LevelID": 3,
            "PowerKW": 50,
            "CurrentTypeID": 30,
            "Quantity": 1
        },
        {
            "ID": 140256,
            "ConnectionTypeID": 2,
            "StatusTypeID": 50,
            "LevelID": 3,
            "PowerKW": 50,
            "CurrentTypeID": 30,
            "Quantity": 1
        },
        {
            "ID": 140257,
            "ConnectionTypeID": 1036,
            "StatusTypeID": 50,
            "LevelID": 3,
            "PowerKW": 43,
            "CurrentTypeID": 20,
            "Quantity": 1
        }
    ],
    "NumberOfPoints": 1,
    "StatusTypeID": 50,
    "DateLastStatusUpdate": "2019-06-21T05:17:00Z",
    "DataQualityLevel": 1,
    "DateCreated": "2018-01-25T16:01:00Z",
    "SubmissionStatusTypeID": 200
}