{
    "IsRecentlyVerified": false,
    "ID": 83938,
    "UUID": "9D9D63BB-C4F3-43EF-BEA6-A4F882C74B6C",
    "DataProviderID": 1,
    "DataProvidersReference": "3810",
    "AddressInfo": {
        "ID": 84284,
        "Title": "Autosalpa Kouvola",
        "AddressLine1": "Kaitilankatu 1",
        "Town": "Korjala-Kaunisnurmi",
        "StateOrProvince": "Kymenlaakso",
        "Postcode": "45130",
        "CountryID": 79,
        "Latitude": 60.86516,
        "Longitude": 26.66293,
        "AccessComments": "Yrityksen tai yhteisön omalla parkkialueella tai -hallissa",
        "DistanceUnit": 0
    },
    "Connections": [
        {
            "ID": 119201,
            "ConnectionTypeID": 0,
            "Reference": "1",
            "LevelID": 2,
            "Amps": 32,
            "Voltage": 400,
            "PowerKW": 22,
            "Comments": "Mode 3"
        },
        {
            "ID": 119202,
            "ConnectionTypeID": 0,
            "Reference": "2",
            "LevelID": 2,
            "Amps": 32,
            "Voltage": 400,
            "PowerKW": 22,
            "Comments": "Mode 3"
        }
    ],
    "NumberOfPoints": 2,
    "DateLastStatusUpdate": "2020-05-26T08:24:00Z",
    "DataQualityLevel": 2,
    "DateCreated": "2017-02-11T22:03:00Z",
    "SubmissionStatusTypeID": 100
}