{
    "IsRecentlyVerified": false,
    "ID": 82003,
    "UUID": "BE2B76D3-28AF-4FF6-9952-D9836F3A33EA",
    "DataProviderID": 1,
    "OperatorID": 23,
    "OperatorsReference": "20321",
    "UsageTypeID": 6,
    "AddressInfo": {
        "ID": 82349,
        "Title": "Storefjell Resort Hotel",
        "AddressLine1": "Einarsetvegen 401",
        "Town": "Gol i Hallingdal",
        "Postcode": "3550",
        "CountryID": 168,
        "Latitude": 60.803814,
        "Longitude": 8.95448,
        "ContactTelephone1": "+47 32 07 80 00",
        "DistanceUnit": 0
    },
    "Connections": [
        {
            "ID": 116763,
            "ConnectionTypeID": 30,
            "StatusTypeID": 50,
            "LevelID": 2,
            "Amps": 32,
            "Voltage": 400,
            "PowerKW": 22,
            "CurrentTypeID": 20,
            "Quantity": 2
        }
    ],
    "NumberOfPoints": 2,
    "GeneralComments": "2 Tesla Connectors, up to 22kW.Available for patrons only. Please see front desk.",
    "StatusTypeID": 50,
    "DateLastStatusUpdate": "2020-08-24T14:03:00Z",
    "DataQualityLevel": 1,
    "DateCreated": "2017-02-03T13:57:00Z",
    "SubmissionStatusTypeID": 200
}