{
    "IsRecentlyVerified": false,
    "ID": 38099,
    "UUID": "44CF4F65-6C86-4EC3-AEA4-2A30A9038B99",
    "DataProviderID": 26,
    "DataProvidersReference": "30463",
    "OperatorID": 108,
    "OperatorsReference": "Vattenfall Buckower Damm ",
    "UsageCost": "0.00 afhankelijk van pas",
    "AddressInfo": {
        "ID": 38445,
        "Title": "Buckower Damm 96-100",
        "AddressLine1": "Buckower Damm 96-100",
        "Town": "Britz",
        "Postcode": "12349",
        "CountryID": 87,
        "Latitude": 52.435095,
        "Longitude": 13.434965,
        "ContactTelephone1": "+49(0)800-2 335 335",
        "ContactEmail": "emobility@vattenfall.de",
        "RelatedURL": "http://www.vattenfall.de/de/emobility/ladestationen-berlin.htm",
        "DistanceUnit": 0
    },
    "Connections": [
        {
            "ID": 41610,
            "ConnectionTypeID": 25,
            "LevelID": 2,
            "PowerKW": 5,
            "CurrentTypeID": 10
        }
    ],
    "NumberOfPoints": 2,
    "StatusTypeID": 50,
    "DateLastStatusUpdate": "2016-03-03T12:40:00Z",
    "DataQualityLevel": 3,
    "DateCreated": "2015-01-09T06:07:00Z",
    "SubmissionStatusTypeID": 100
}