{
    "IsRecentlyVerified": false,
    "ID": 145773,
    "UUID": "6982257F-D23C-4256-9772-CB649F77A482",
    "DataProviderID": 2,
    "DataProvidersReference": "121133",
    "OperatorID": 5,
    "UsageTypeID": 1,
    "AddressInfo": {
        "ID": 146125,
        "Title": "2ND ST PARKING",
        "AddressLine1": "4407 2 St",
        "Town": "Peachland",
        "StateOrProvince": "BC",
        "Postcode": "V0H 1X7",
        "CountryID": 44,
        "Latitude": 49.7735099,
        "Longitude": -119.737313,
        "ContactTelephone1": "888-758-4389",
        "AccessComments": "24 hours daily",
        "RelatedURL": "http://www.chargepoint.com/",
        "DistanceUnit": 0
    },
    "Connections": [
        {
            "ID": 202511,
            "ConnectionTypeID": 1,
            "LevelID": 2,
            "Amps": 16,
            "Voltage": 230,
            "PowerKW": 3.7,
            "CurrentTypeID": 10,
            "Quantity": 2
        }
    ],
    "StatusTypeID": 50,
    "DateLastStatusUpdate": "2020-06-26T03:12:00Z",
    "DataQualityLevel": 3,
    "DateCreated": "2019-12-24T09:25:00Z",
    "SubmissionStatusTypeID": 100
}