{
    "IsRecentlyVerified": false,
    "ID": 8021,
    "UUID": "0C071579-25A8-4050-9C46-92E424DDA20D",
    "DataProviderID": 15,
    "DataProvidersReference": "6055",
    "OperatorID": 26,
    "AddressInfo": {
        "ID": 7918,
        "Title": "24 Performance Dr",
        "AddressLine1": "24 Performance Dr",
        "Town": "Bennington",
        "StateOrProvince": "VT",
        "Postcode": "5201",
        "CountryID": 2,
        "Latitude": 42.89494,
        "Longitude": -73.19694,
        "ContactTelephone1": " (802) 447-2301",
        "RelatedURL": "http://carstations.com/6055",
        "DistanceUnit": 0
    },
    "Connections": [
        {
            "ID": 5450,
            "ConnectionTypeID": 1,
            "Reference": "J1772",
            "LevelID": 2
        }
    ],
    "StatusTypeID": 0,
    "DateLastStatusUpdate": "2017-11-04T14:04:00Z",
    "DataQualityLevel": 1,
    "DateCreated": "2011-11-11T12:05:00Z",
    "SubmissionStatusTypeID": 100
}