{
    "IsRecentlyVerified": false,
    "ID": 57824,
    "UUID": "F933FC2D-5834-4C01-8E80-6F0C622656B3",
    "DataProviderID": 1,
    "DataProvidersReference": "3153",
    "AddressInfo": {
        "ID": 58170,
        "Title": "McDonalds Grimstad",
        "AddressLine1": "Vesterled 104",
        "Town": "GRIMSTAD",
        "StateOrProvince": "Agder",
        "Postcode": "4877",
        "CountryID": 168,
        "Latitude": 58.34186,
        "Longitude": 8.56957,
        "AccessComments": "Ved McDonalds",
        "DistanceUnit": 0
    },
    "Connections": [
        {
            "ID": 73287,
            "ConnectionTypeID": 0,
            "Reference": "1",
            "LevelID": 2,
            "Amps": 100,
            "Voltage": 500,
            "PowerKW": 50,
            "Comments": "Mode 4"
        },
        {
            "ID": 84041,
            "ConnectionTypeID": 0,
            "Reference": "2",
            "LevelID": 2,
            "Amps": 100,
            "Voltage": 500,
            "PowerKW": 50,
            "Comments": "Mode 4"
        },
        {
            "ID": 84042,
            "ConnectionTypeID": 0,
            "Reference": "3",
            "LevelID": 2,
            "Amps": 100,
            "Voltage": 500,
            "PowerKW": 50,
            "Comments": "Mode 4"
        },
        {
            "ID": 84043,
            "ConnectionTypeID": 0,
            "Reference": "4",
            "LevelID": 2,
            "Amps": 100,
            "Voltage": 500,
            "PowerKW": 50,
            "Comments": "Mode 4"
        },
        {
            "ID": 84044,
            "ConnectionTypeID": 0,
            "Reference": "5",
            "LevelID": 2,
            "Amps": 32,
            "Voltage": 400,
            "PowerKW": 22,
            "Comments": "Mode 3"
        },
        {
            "ID": 87957,
            "ConnectionTypeID": 0,
            "Reference": "6",
            "LevelID": 2,
            "Amps": 32,
            "Voltage": 400,
            "PowerKW": 22,
            "Comments": "Mode 3"
        }
    ],
    "NumberOfPoints": 6,
    "DateLastStatusUpdate": "2020-05-26T08:22:00Z",
    "DataQualityLevel": 2,
    "DateCreated": "2015-12-26T11:12:00Z",
    "SubmissionStatusTypeID": 100
}