{
    "UserComments": [
        {
            "ID": 22626,
            "ChargePointID": 156376,
            "CommentTypeID": 10,
            "UserName": "ForumElettrico.it",
            "Comment": "Essendo tra i parcheggi più comodi all'ingresso dei negozi sono sempre occupati da auto termiche. Leggi la recensione completa qui > \r\nhttps://www.forumelettrico.it/forum/2-colonnine-evway-nel-parcheggio-del-centro-commerciale-settimo-cielo-t8663.html",
            "RelatedURL": "https://www.forumelettrico.it/forum/2-colonnine-evway-nel-parcheggio-del-centro-commerciale-settimo-cielo-t8663.html",
            "DateCreated": "2020-05-18T14:10:13.01Z",
            "User": {
                "ID": 11749,
                "Username": "ForumElettrico.it"
            },
            "CheckinStatusTypeID": 10,
            "IsActionedByEditor": false
        }
    ],
    "MediaItems": [
        {
            "ID": 22376,
            "ChargePointID": 156376,
            "ItemURL": "https://s3-ap-southeast-2.amazonaws.com/openchargemap/images/IT/OCM156376/OCM-156376.orig.2020051814102918.jpg",
            "ItemThumbnailURL": "https://s3-ap-southeast-2.amazonaws.com/openchargemap/images/IT/OCM156376/OCM-156376.thmb.2020051814102918.jpg",
            "Comment": "",
            "IsEnabled": true,
            "IsVideo": false,
            "IsFeaturedItem": false,
            "IsExternalResource": false,
            "User": {
                "ID": 11749,
                "Username": "ForumElettrico.it"
            },
            "DateCreated": "2020-05-18T14:11:00Z"
        },
        {
            "ID": 22377,
            "ChargePointID": 156376,
            "ItemURL": "https://s3-ap-southeast-2.amazonaws.com/openchargemap/images/IT/OCM156376/OCM-156376.orig.2020051814103684.jpg",
            "ItemThumbnailURL": "https://s3-ap-southeast-2.amazonaws.com/openchargemap/images/IT/OCM156376/OCM-156376.thmb.2020051814103684.jpg",
            "Comment": "",
            "IsEnabled": true,
            "IsVideo": false,
            "IsFeaturedItem": false,
            "IsExternalResource": false,
            "User": {
                "ID": 11749,
                "Username": "ForumElettrico.it"
            },
            "DateCreated": "2020-05-18T14:11:00Z"
        }
    ],
    "IsRecentlyVerified": false,
    "ID": 156376,
    "UUID": "B9F59052-FB48-444F-B94B-7425DBF5F11F",
    "DataProviderID": 1,
    "OperatorID": 3291,
    "UsageTypeID": 1,
    "AddressInfo": {
        "ID": 156730,
        "Title": "Evway Settimo Cielo Retail Park",
        "AddressLine1": "Via Umberto Giordano",
        "Town": "Settimo Torinese",
        "StateOrProvince": "TO",
        "Postcode": "10036 ",
        "CountryID": 112,
        "Latitude": 45.139496,
        "Longitude": 7.733701,
        "RelatedURL": "https://www.forumelettrico.it/forum/2-colonnine-evway-nel-parcheggio-del-centro-commerciale-settimo-cielo-t8663.html",
        "DistanceUnit": 0
    },
    "Connections": [
        {
            "ID": 220044,
            "ConnectionTypeID": 25,
            "StatusTypeID": 50,
            "LevelID": 2,
            "Amps": 16,
            "Voltage": 400,
            "PowerKW": 11,
            "CurrentTypeID": 20,
            "Quantity": 2
        }
    ],
    "NumberOfPoints": 2,
    "StatusTypeID": 50,
    "DateLastStatusUpdate": "2020-05-19T06:49:00Z",
    "DataQualityLevel": 1,
    "DateCreated": "2020-05-18T14:10:00Z",
    "SubmissionStatusTypeID": 200
}