{
    "IsRecentlyVerified": false,
    "ID": 44904,
    "UUID": "F4E94EF4-C4D5-43BB-A10E-2C9C98D9E8BB",
    "DataProviderID": 1,
    "OperatorID": 22,
    "OperatorsReference": "C6DSK",
    "UsageTypeID": 4,
    "AddressInfo": {
        "ID": 45250,
        "Title": "Town Hall Car Park",
        "AddressLine1": "Off Barrow Track",
        "AddressLine2": "Carlow",
        "Town": "Carlow",
        "StateOrProvince": "County Carlow",
        "CountryID": 3,
        "Latitude": 52.837679,
        "Longitude": -6.933489,
        "DistanceUnit": 0
    },
    "Connections": [
        {
            "ID": 55227,
            "ConnectionTypeID": 25,
            "StatusTypeID": 50,
            "LevelID": 2,
            "Amps": 32,
            "Voltage": 400,
            "PowerKW": 22,
            "CurrentTypeID": 20,
            "Quantity": 2
        }
    ],
    "NumberOfPoints": 2,
    "StatusTypeID": 50,
    "DateLastStatusUpdate": "2019-06-09T05:40:00Z",
    "DataQualityLevel": 2,
    "DateCreated": "2015-04-22T02:47:00Z",
    "SubmissionStatusTypeID": 100
}