{
    "IsRecentlyVerified": false,
    "ID": 61644,
    "UUID": "FD28B8DC-7E5C-4C9E-8810-CAC720F75E36",
    "DataProviderID": 2,
    "DataProvidersReference": "72635",
    "OperatorID": 5,
    "UsageTypeID": 1,
    "AddressInfo": {
        "ID": 61990,
        "Title": "CINEMARK",
        "AddressLine1": "610 Page St",
        "Town": "Frisco",
        "StateOrProvince": "TX",
        "Postcode": "75034",
        "CountryID": 2,
        "Latitude": 33.1491282,
        "Longitude": -96.8374654,
        "ContactTelephone1": "888-758-4389",
        "AccessComments": "24 hours daily",
        "RelatedURL": "http://www.chargepoint.com/",
        "DistanceUnit": 0
    },
    "Connections": [
        {
            "ID": 78533,
            "ConnectionTypeID": 1,
            "LevelID": 2,
            "Amps": 16,
            "Voltage": 230,
            "PowerKW": 3,
            "CurrentTypeID": 10,
            "Quantity": 4
        }
    ],
    "DateLastStatusUpdate": "2019-12-24T09:09:00Z",
    "DataQualityLevel": 3,
    "DateCreated": "2016-03-03T11:38:00Z",
    "SubmissionStatusTypeID": 100
}