{
    "IsRecentlyVerified": false,
    "ID": 158095,
    "UUID": "5605B3A1-E071-4CB9-9A90-F5C2EA7872B6",
    "DataProviderID": 1,
    "OperatorID": 3392,
    "UsageTypeID": 4,
    "AddressInfo": {
        "ID": 158449,
        "Title": "Water Street",
        "AddressLine1": "Water Street",
        "Town": "Chorley",
        "Postcode": "PR6 8NH",
        "CountryID": 1,
        "Latitude": 53.710962,
        "Longitude": -2.607626,
        "AccessComments": "",
        "RelatedURL": "https://newmotion.com/en_GB/",
        "DistanceUnit": 0
    },
    "Connections": [
        {
            "ID": 227942,
            "ConnectionTypeID": 25,
            "Reference": "ICUEVE900362",
            "StatusTypeID": 50,
            "LevelID": 2,
            "Amps": 16,
            "Voltage": 400,
            "PowerKW": 11,
            "CurrentTypeID": 20,
            "Quantity": 2
        }
    ],
    "StatusTypeID": 50,
    "DateLastStatusUpdate": "2020-10-10T20:59:00Z",
    "MetadataValues": [
        {
            "ID": 7628,
            "MetadataFieldID": 4,
            "ItemValue": "Contains public sector information licensed under the Open Government Licence v2.0. http://www.nationalarchives.gov.uk/doc/open-government-licence/version/2/"
        }
    ],
    "DataQualityLevel": 3,
    "DateCreated": "2020-06-25T10:00:00Z",
    "SubmissionStatusTypeID": 100
}