{
    "IsRecentlyVerified": false,
    "ID": 8126,
    "UUID": "FA13C25D-BB5C-4A32-AC8B-369105415D12",
    "DataProviderID": 15,
    "DataProvidersReference": "6529",
    "OperatorID": 26,
    "AddressInfo": {
        "ID": 8023,
        "Title": "1260 Broad St",
        "AddressLine1": "1260 Broad St",
        "Town": "Sumter",
        "StateOrProvince": "SC",
        "Postcode": "29150",
        "CountryID": 2,
        "Latitude": 33.95576,
        "Longitude": -80.38696,
        "ContactTelephone1": " (803) 469-3424",
        "RelatedURL": "http://carstations.com/6529",
        "DistanceUnit": 0
    },
    "Connections": [
        {
            "ID": 5555,
            "ConnectionTypeID": 1,
            "Reference": "J1772",
            "LevelID": 2
        }
    ],
    "StatusTypeID": 0,
    "DateLastStatusUpdate": "2017-11-04T14:04:00Z",
    "DataQualityLevel": 1,
    "DateCreated": "2011-11-11T12:06:00Z",
    "SubmissionStatusTypeID": 100
}