{
    "IsRecentlyVerified": false,
    "ID": 109170,
    "UUID": "4640B6C6-5E9F-4F2B-BDD3-EF6EFD8387B2",
    "DataProviderID": 1,
    "OperatorID": 23,
    "OperatorsReference": "44790",
    "UsageTypeID": 4,
    "AddressInfo": {
        "ID": 109516,
        "Title": "PV Parking 40-07 73RD St",
        "AddressLine1": "40-07 73RD St",
        "Town": "Woodside",
        "StateOrProvince": "New York",
        "Postcode": "11377",
        "CountryID": 2,
        "Latitude": 40.7464805,
        "Longitude": -73.8922584,
        "ContactTelephone1": "(718) 609-1200",
        "DistanceUnit": 0
    },
    "Connections": [
        {
            "ID": 154288,
            "ConnectionTypeID": 30,
            "StatusTypeID": 50,
            "LevelID": 2,
            "PowerKW": 6,
            "CurrentTypeID": 10,
            "Quantity": 4
        }
    ],
    "NumberOfPoints": 4,
    "GeneralComments": "4 Tesla Connectors, up to 6kW.Parking fees will apply. Please see valet.",
    "StatusTypeID": 50,
    "DateLastStatusUpdate": "2018-10-11T13:49:00Z",
    "DataQualityLevel": 1,
    "DateCreated": "2018-10-11T13:49:00Z",
    "SubmissionStatusTypeID": 200
}