{
    "IsRecentlyVerified": false,
    "ID": 42944,
    "UUID": "491F6F38-8ABC-49BE-BD01-63A3348C756A",
    "DataProviderID": 26,
    "DataProvidersReference": "60016",
    "OperatorID": 179,
    "OperatorsReference": "Ecotap 1404426",
    "UsageCost": "0.00 afhankelijk van pas",
    "AddressInfo": {
        "ID": 43290,
        "Title": "Poeldijkseweg 45",
        "AddressLine1": "Poeldijkseweg 45",
        "Town": "Westland",
        "Postcode": "2544 NS",
        "CountryID": 159,
        "Latitude": 52.028033,
        "Longitude": 4.254778,
        "RelatedURL": "http://www.ecotap.nl",
        "DistanceUnit": 0
    },
    "Connections": [
        {
            "ID": 51909,
            "ConnectionTypeID": 25,
            "LevelID": 2,
            "PowerKW": 22,
            "CurrentTypeID": 10
        }
    ],
    "NumberOfPoints": 2,
    "StatusTypeID": 50,
    "DateLastStatusUpdate": "2016-06-04T02:44:00Z",
    "DataQualityLevel": 3,
    "DateCreated": "2015-03-25T02:49:00Z",
    "SubmissionStatusTypeID": 100
}