{
    "IsRecentlyVerified": false,
    "ID": 3558,
    "UUID": "19DBB7B4-410B-48BA-B0BC-698231B34C2F",
    "DataProviderID": 1,
    "OperatorID": 6,
    "UsageTypeID": 1,
    "AddressInfo": {
        "ID": 3559,
        "Title": "Stockton Nissan",
        "AddressLine1": "3077 E. Hammer Lane",
        "Town": "Stockton",
        "StateOrProvince": "CA",
        "Postcode": "95212",
        "CountryID": 2,
        "Latitude": 38.0228,
        "Longitude": -121.2757,
        "ContactTelephone1": "866-272-2505",
        "DistanceUnit": 0
    },
    "Connections": [
        {
            "ID": 73,
            "ConnectionTypeID": 1,
            "Quantity": 1
        }
    ],
    "NumberOfPoints": 2,
    "DateLastStatusUpdate": "2019-12-15T06:07:00Z",
    "DateCreated": "2010-02-28T00:00:00Z",
    "SubmissionStatusTypeID": 200
}