{
    "IsRecentlyVerified": false,
    "ID": 82075,
    "UUID": "6FD7E01A-8E5F-459F-8B3B-0D5E10C6D70B",
    "DataProviderID": 1,
    "OperatorID": 23,
    "OperatorsReference": "23174",
    "UsageTypeID": 4,
    "AddressInfo": {
        "ID": 82421,
        "Title": "Stella Maris Hotel de Luxe",
        "AddressLine1": "3 Kogtvedvænget",
        "Town": "Svendborg",
        "Postcode": "5700",
        "CountryID": 65,
        "Latitude": 55.044064,
        "Longitude": 10.578424,
        "ContactTelephone1": "+45 62 21 25 25",
        "DistanceUnit": 0
    },
    "Connections": [
        {
            "ID": 116835,
            "ConnectionTypeID": 30,
            "StatusTypeID": 50,
            "LevelID": 2,
            "Amps": 16,
            "Voltage": 400,
            "PowerKW": 11,
            "CurrentTypeID": 20,
            "Quantity": 2
        }
    ],
    "NumberOfPoints": 2,
    "GeneralComments": "2 Tesla Connectors, up to 11kW.Available for customers. Please see front desk.",
    "StatusTypeID": 50,
    "DateLastStatusUpdate": "2018-10-03T18:35:00Z",
    "DataQualityLevel": 1,
    "DateCreated": "2017-02-03T14:39:00Z",
    "SubmissionStatusTypeID": 200
}