{
    "IsRecentlyVerified": false,
    "ID": 122277,
    "UUID": "13ECBA37-1FDC-411C-BB42-211D9D807E08",
    "DataProviderID": 2,
    "DataProvidersReference": "76720",
    "UsageTypeID": 2,
    "AddressInfo": {
        "ID": 122623,
        "Title": "Department of Mental Health",
        "AddressLine1": "523 Shatto Pl",
        "Town": "Los Angeles",
        "StateOrProvince": "CA",
        "Postcode": "90020",
        "CountryID": 2,
        "Latitude": 34.064254,
        "Longitude": -118.290442,
        "ContactTelephone1": "",
        "AccessComments": "Permitted employee parking only; keypad activated, instructions on EVSE",
        "RelatedURL": "",
        "DistanceUnit": 0
    },
    "Connections": [
        {
            "ID": 172156,
            "ConnectionTypeID": 1,
            "LevelID": 2,
            "Amps": 16,
            "Voltage": 230,
            "PowerKW": 3.7,
            "CurrentTypeID": 10,
            "Quantity": 2
        }
    ],
    "DateLastStatusUpdate": "2020-06-26T02:56:00Z",
    "DataQualityLevel": 3,
    "DateCreated": "2019-04-06T05:02:00Z",
    "SubmissionStatusTypeID": 100
}