{
    "IsRecentlyVerified": false,
    "ID": 172296,
    "UUID": "E258E932-6BD2-4971-94C1-55B31F479053",
    "DataProviderID": 1,
    "OperatorID": 21,
    "UsageTypeID": 4,
    "UsageCost": "Mobi.E compatible card or App",
    "AddressInfo": {
        "ID": 172655,
        "Title": "RMZ-00001",
        "AddressLine1": "Rua do Jardim",
        "Town": "Reguengos de Monsaraz",
        "StateOrProvince": "Évora",
        "Postcode": "7201-970",
        "CountryID": 180,
        "Latitude": 38.42341595037195,
        "Longitude": -7.536971426212176,
        "DistanceUnit": 0
    },
    "Connections": [
        {
            "ID": 263424,
            "ConnectionTypeID": 25,
            "StatusTypeID": 50,
            "LevelID": 2,
            "Amps": 32,
            "Voltage": 400,
            "PowerKW": 22,
            "CurrentTypeID": 20,
            "Quantity": 2
        }
    ],
    "NumberOfPoints": 2,
    "StatusTypeID": 50,
    "DateLastStatusUpdate": "2021-01-28T23:10:00Z",
    "DataQualityLevel": 1,
    "DateCreated": "2021-01-28T23:10:00Z",
    "SubmissionStatusTypeID": 200
}