{
    "UserComments": [
        {
            "ID": 15949,
            "ChargePointID": 57536,
            "CommentTypeID": 10,
            "UserName": "Robert Malcolm Kay",
            "Comment": "Good rapid, convenient location for shops.",
            "Rating": 5,
            "DateCreated": "2017-02-19T17:30:42.71Z",
            "User": {
                "ID": 4751,
                "Username": "Robert Malcolm Kay"
            },
            "CheckinStatusTypeID": 10
        },
        {
            "ID": 13815,
            "ChargePointID": 57536,
            "CommentTypeID": 10,
            "UserName": "Robert Malcolm Kay",
            "Comment": "Chademo charger, used on 11th and 12th July, sweet! Good location near all amenities.",
            "Rating": 5,
            "DateCreated": "2016-07-12T22:05:43.637Z",
            "User": {
                "ID": 4751,
                "Username": "Robert Malcolm Kay"
            },
            "CheckinStatusTypeID": 10
        },
        {
            "ID": 10107,
            "ChargePointID": 57536,
            "CommentTypeID": 10,
            "UserName": "Anon74856763534",
            "Comment": "Needed to reset unit (was showing 'stop by charge error' on arrival). Straightforward manual reset and it was working again.",
            "DateCreated": "2016-04-06T15:30:39.83Z",
            "User": {
                "ID": 1192,
                "Username": "Anon74856763534"
            },
            "CheckinStatusTypeID": 10
        },
        {
            "ID": 10083,
            "ChargePointID": 57536,
            "CommentTypeID": 10,
            "UserName": "Anon74856763534",
            "Comment": "",
            "DateCreated": "2016-04-04T13:04:40.567Z",
            "User": {
                "ID": 1192,
                "Username": "Anon74856763534"
            },
            "CheckinStatusTypeID": 10
        }
    ],
    "IsRecentlyVerified": false,
    "ID": 57536,
    "UUID": "89E83879-422C-40DC-A885-1CADD4821B70",
    "DataProviderID": 1,
    "OperatorID": 3315,
    "OperatorsReference": "51140",
    "UsageTypeID": 4,
    "UsageCost": "Free",
    "AddressInfo": {
        "ID": 57882,
        "Title": "Lorne Street Car Park",
        "AddressLine1": "Lorne Street",
        "Town": "Lochgilphead",
        "StateOrProvince": "Argyll",
        "Postcode": "PA31 8LP",
        "CountryID": 1,
        "Latitude": 56.037874,
        "Longitude": -5.435285,
        "DistanceUnit": 0
    },
    "Connections": [
        {
            "ID": 72713,
            "ConnectionTypeID": 33,
            "StatusTypeID": 0,
            "LevelID": 3,
            "PowerKW": 50,
            "CurrentTypeID": 30,
            "Quantity": 1
        },
        {
            "ID": 72714,
            "ConnectionTypeID": 2,
            "StatusTypeID": 50,
            "LevelID": 3,
            "PowerKW": 50,
            "CurrentTypeID": 30,
            "Quantity": 1
        },
        {
            "ID": 72715,
            "ConnectionTypeID": 1036,
            "StatusTypeID": 50,
            "LevelID": 3,
            "Voltage": 400,
            "PowerKW": 43,
            "CurrentTypeID": 20,
            "Quantity": 1
        }
    ],
    "NumberOfPoints": 4,
    "StatusTypeID": 50,
    "DateLastStatusUpdate": "2020-03-19T06:22:00Z",
    "DataQualityLevel": 1,
    "DateCreated": "2015-12-02T12:16:00Z",
    "SubmissionStatusTypeID": 200
}