{
    "IsRecentlyVerified": false,
    "ID": 129880,
    "UUID": "9E0E046D-277D-4FF2-9CFA-460D4D06BC14",
    "DataProviderID": 1,
    "OperatorID": 80,
    "UsageTypeID": 4,
    "AddressInfo": {
        "ID": 130226,
        "Title": "Rosano la Pira | EnelX",
        "AddressLine1": "Via Giorgio la Pira",
        "AddressLine2": "Rosano",
        "Town": "Rignano sull'Arno",
        "StateOrProvince": "FI",
        "Postcode": "50067",
        "CountryID": 112,
        "Latitude": 43.76920945405362,
        "Longitude": 11.423375390594856,
        "ContactTelephone1": "800.069.850",
        "RelatedURL": "https://www.enelx.com/it/it/emobility",
        "DistanceUnit": 0
    },
    "Connections": [
        {
            "ID": 181866,
            "ConnectionTypeID": 25,
            "StatusTypeID": 50,
            "LevelID": 2,
            "Amps": 32,
            "Voltage": 400,
            "PowerKW": 22,
            "CurrentTypeID": 20,
            "Quantity": 2
        }
    ],
    "NumberOfPoints": 2,
    "StatusTypeID": 50,
    "DateLastStatusUpdate": "2019-07-30T08:23:00Z",
    "DataQualityLevel": 1,
    "DateCreated": "2019-07-30T08:23:00Z",
    "SubmissionStatusTypeID": 200
}