{
    "IsRecentlyVerified": false,
    "ID": 34806,
    "UUID": "F86BE1CE-6F39-437D-8F7D-7DC664D6BBB5",
    "DataProviderID": 26,
    "DataProvidersReference": "56014",
    "OperatorID": 180,
    "OperatorsReference": "Alfen BRS_0871",
    "UsageCost": "0.00 jaarabonnement",
    "AddressInfo": {
        "ID": 35152,
        "Title": "Delftweg 230",
        "AddressLine1": "Delftweg 230",
        "Town": "Rotterdam",
        "Postcode": "3046 ND",
        "CountryID": 159,
        "Latitude": 51.9577853,
        "Longitude": 4.3998628,
        "ContactTelephone1": "036 - 549 34 00",
        "RelatedURL": "http://www.icu-charging-stations.com/",
        "DistanceUnit": 0
    },
    "Connections": [
        {
            "ID": 38317,
            "ConnectionTypeID": 25,
            "LevelID": 2,
            "PowerKW": 11,
            "CurrentTypeID": 10
        },
        {
            "ID": 47522,
            "ConnectionTypeID": 25,
            "LevelID": 2,
            "PowerKW": 11,
            "CurrentTypeID": 10
        }
    ],
    "NumberOfPoints": 1,
    "StatusTypeID": 50,
    "DateLastStatusUpdate": "2016-06-04T02:43:00Z",
    "DataQualityLevel": 3,
    "DateCreated": "2015-01-09T06:04:00Z",
    "SubmissionStatusTypeID": 100
}