{
    "IsRecentlyVerified": false,
    "ID": 135893,
    "UUID": "9A32A827-58A2-47AA-A9EB-9E750BEE0D36",
    "DataProviderID": 18,
    "DataProvidersReference": "a826535024f83948d11f68baa8ae4a6f",
    "OperatorID": 2244,
    "UsageTypeID": 5,
    "AddressInfo": {
        "ID": 136239,
        "Title": "Selwyn Avenue",
        "AddressLine1": "Selwyn Avenue",
        "Town": "Richmond",
        "Postcode": "TW9 2HQ",
        "CountryID": 1,
        "Latitude": 51.467823,
        "Longitude": -0.29373,
        "AccessComments": "",
        "RelatedURL": "https://www.ubitricity.com",
        "DistanceUnit": 0
    },
    "Connections": [
        {
            "ID": 190315,
            "ConnectionTypeID": 25,
            "Reference": "suby1100000462",
            "StatusTypeID": 50,
            "LevelID": 2,
            "Amps": 16,
            "Voltage": 230,
            "PowerKW": 3.7,
            "CurrentTypeID": 10
        }
    ],
    "StatusTypeID": 0,
    "DateLastStatusUpdate": "2021-04-25T05:46:00Z",
    "MetadataValues": [
        {
            "ID": 5745,
            "MetadataFieldID": 4,
            "ItemValue": "Contains public sector information licensed under the Open Government Licence v2.0. http://www.nationalarchives.gov.uk/doc/open-government-licence/version/2/"
        }
    ],
    "DataQualityLevel": 3,
    "DateCreated": "2019-12-24T05:22:00Z",
    "SubmissionStatusTypeID": 100
}