{
    "IsRecentlyVerified": false,
    "ID": 126323,
    "UUID": "96048F36-7B12-4585-ADB0-3D8AE27978AD",
    "DataProviderID": 1,
    "OperatorID": 3326,
    "UsageTypeID": 5,
    "AddressInfo": {
        "ID": 126669,
        "Title": "The Black Horse Inn ",
        "AddressLine1": "Pilgrims Way",
        "AddressLine2": "Thurnham",
        "Town": "Maidstone",
        "Postcode": "ME14 3LD",
        "CountryID": 1,
        "Latitude": 51.291273,
        "Longitude": 0.5895,
        "RelatedURL": "http://www.alfapower.co.uk/",
        "DistanceUnit": 0
    },
    "Connections": [
        {
            "ID": 177043,
            "ConnectionTypeID": 25,
            "Reference": "A",
            "StatusTypeID": 50,
            "LevelID": 2,
            "Amps": 32,
            "Voltage": 400,
            "PowerKW": 22,
            "CurrentTypeID": 20,
            "Quantity": 2
        }
    ],
    "NumberOfPoints": 2,
    "StatusTypeID": 50,
    "DateLastStatusUpdate": "2019-05-15T14:46:00Z",
    "MetadataValues": [
        {
            "ID": 4230,
            "MetadataFieldID": 4,
            "ItemValue": "Contains public sector information licensed under the Open Government Licence v2.0. http://www.nationalarchives.gov.uk/doc/open-government-licence/version/2/"
        }
    ],
    "DataQualityLevel": 3,
    "DateCreated": "2019-05-15T14:22:00Z",
    "SubmissionStatusTypeID": 100
}