{
    "IsRecentlyVerified": false,
    "ID": 83958,
    "UUID": "7C30AD24-036E-43E0-A53A-C4C66DBD3CB6",
    "DataProviderID": 1,
    "DataProvidersReference": "3750",
    "AddressInfo": {
        "ID": 84304,
        "Title": "Matkailukeskus Niemenharju",
        "AddressLine1": "Viitasaarentie 261",
        "Town": "Pihtipudas Keskus",
        "StateOrProvince": "Keski-Suomi",
        "Postcode": "44800",
        "CountryID": 79,
        "Latitude": 63.34795,
        "Longitude": 25.60283,
        "AccessComments": "Huoltoaseman yhteydessä",
        "DistanceUnit": 0
    },
    "Connections": [
        {
            "ID": 119266,
            "ConnectionTypeID": 0,
            "Reference": "1",
            "LevelID": 2,
            "Amps": 32,
            "Voltage": 400,
            "PowerKW": 22,
            "Comments": "Mode 3"
        },
        {
            "ID": 119267,
            "ConnectionTypeID": 0,
            "Reference": "2",
            "LevelID": 2,
            "Amps": 32,
            "Voltage": 400,
            "PowerKW": 22,
            "Comments": "Mode 3"
        }
    ],
    "NumberOfPoints": 2,
    "DateLastStatusUpdate": "2020-05-26T08:25:00Z",
    "DataQualityLevel": 2,
    "DateCreated": "2017-02-11T22:03:00Z",
    "SubmissionStatusTypeID": 100
}