{
    "IsRecentlyVerified": false,
    "ID": 107952,
    "UUID": "32E4DB46-FED7-41C7-A625-3F9C490FF0A3",
    "DataProviderID": 1,
    "OperatorID": 70,
    "UsageTypeID": 4,
    "AddressInfo": {
        "ID": 108298,
        "Title": "EŞARJ - Aytemiz Petrol Söke",
        "AddressLine1": "Capello Alışveriş Merkezi, Söke, Aydın",
        "Town": "Söke",
        "CountryID": 229,
        "Latitude": 37.669470590324494,
        "Longitude": 27.405754551456084,
        "RelatedURL": "http://esarj.com/harita?s=TR-AYD-002",
        "DistanceUnit": 0
    },
    "Connections": [
        {
            "ID": 152451,
            "ConnectionTypeID": 2,
            "StatusTypeID": 100,
            "LevelID": 3,
            "Amps": 125,
            "Voltage": 500,
            "PowerKW": 45,
            "CurrentTypeID": 30,
            "Quantity": 1
        },
        {
            "ID": 152452,
            "ConnectionTypeID": 33,
            "StatusTypeID": 100,
            "LevelID": 3,
            "Amps": 120,
            "Voltage": 500,
            "PowerKW": 45,
            "CurrentTypeID": 30,
            "Quantity": 1
        },
        {
            "ID": 152453,
            "ConnectionTypeID": 25,
            "StatusTypeID": 100,
            "LevelID": 2,
            "Amps": 32,
            "Voltage": 400,
            "PowerKW": 22,
            "CurrentTypeID": 20,
            "Quantity": 1
        }
    ],
    "NumberOfPoints": 1,
    "StatusTypeID": 100,
    "DateLastStatusUpdate": "2021-01-31T11:46:00Z",
    "DataQualityLevel": 1,
    "DateCreated": "2018-08-22T06:50:00Z",
    "SubmissionStatusTypeID": 200
}