{
    "IsRecentlyVerified": false,
    "ID": 103803,
    "UUID": "4BA16DFE-0C9E-4AFE-8B67-0F97EBC83161",
    "DataProviderID": 1,
    "OperatorID": 25,
    "OperatorsReference": "islington-stpaulsplace",
    "UsageTypeID": 4,
    "UsageCost": "£0.059/minute; min £1.18; other tariffs available",
    "AddressInfo": {
        "ID": 104149,
        "Title": "St Paul's Place",
        "AddressLine1": "16 St Paul's Place",
        "Town": "London",
        "Postcode": "N1 2QF",
        "CountryID": 1,
        "Latitude": 51.547933,
        "Longitude": -0.087969,
        "DistanceUnit": 0
    },
    "Connections": [
        {
            "ID": 146507,
            "ConnectionTypeID": 25,
            "StatusTypeID": 50,
            "LevelID": 2,
            "Amps": 32,
            "Voltage": 230,
            "PowerKW": 7,
            "CurrentTypeID": 10,
            "Quantity": 2
        },
        {
            "ID": 146508,
            "ConnectionTypeID": 1,
            "StatusTypeID": 50,
            "LevelID": 2,
            "Amps": 16,
            "Voltage": 230,
            "PowerKW": 4,
            "CurrentTypeID": 10,
            "Quantity": 2
        }
    ],
    "NumberOfPoints": 2,
    "StatusTypeID": 50,
    "DateLastStatusUpdate": "2018-07-23T15:37:00Z",
    "DataQualityLevel": 1,
    "DateCreated": "2018-05-09T05:18:00Z",
    "SubmissionStatusTypeID": 200
}