{
    "UserComments": [
        {
            "ID": 20015,
            "ChargePointID": 56826,
            "CommentTypeID": 10,
            "UserName": "Weky",
            "Comment": "Csak a jobb oldali töltő működik. Only the right side charger is operational.",
            "Rating": 4,
            "DateCreated": "2018-08-11T19:21:10.303Z",
            "User": {
                "ID": 18836,
                "Username": "Weky"
            },
            "CheckinStatusTypeID": 10
        },
        {
            "ID": 19763,
            "ChargePointID": 56826,
            "CommentTypeID": 1000,
            "UserName": "Morc",
            "Comment": "Left side is not operational, right side indicates readiness but indicates failure when trying to charge my car. A Nissan Leaf charged successfully though today.\r\nBal oldala rossz, jobb oldala készenlétet jelez, de hibát jelez, ha tölteni próbálom az autóm. Egy Nissan Leaf tudott ma tölteni.",
            "Rating": 3,
            "DateCreated": "2018-07-04T14:53:23.7Z",
            "User": {
                "ID": 16301,
                "Username": "Morc"
            },
            "CheckinStatusTypeID": 20
        },
        {
            "ID": 19622,
            "ChargePointID": 56826,
            "CommentTypeID": 1000,
            "UserName": "Morc",
            "Comment": "Az utca felőli bal oldal megint nem működik. Készenlétet jelző lámpa sem világít.\r\nLooking from the access street the left side is in-operational again. Ready light is off as well. ",
            "Rating": 3,
            "DateCreated": "2018-06-08T13:01:31.14Z",
            "User": {
                "ID": 16301,
                "Username": "Morc"
            },
            "CheckinStatusTypeID": 20
        },
        {
            "ID": 19276,
            "ChargePointID": 56826,
            "CommentTypeID": 1000,
            "UserName": "Morc",
            "Comment": "A töltő bal oldala megint NEM MINDIG működik. A készültséget jelző lámpa világít, de nem mindig tölt. The left side is SOMETIMES broken again. The readiness light is on, but does not charge sometimes.",
            "DateCreated": "2018-03-08T09:58:18.187Z",
            "User": {
                "ID": 16301,
                "Username": "Morc"
            },
            "CheckinStatusTypeID": 20
        },
        {
            "ID": 19188,
            "ChargePointID": 56826,
            "CommentTypeID": 10,
            "UserName": "Morc",
            "Comment": "Újra működik mindkét oldal. Both sides are operational again.",
            "DateCreated": "2018-02-14T10:46:03.76Z",
            "User": {
                "ID": 16301,
                "Username": "Morc"
            },
            "CheckinStatusTypeID": 10
        },
        {
            "ID": 17907,
            "ChargePointID": 56826,
            "CommentTypeID": 1000,
            "UserName": "Morc",
            "Comment": "A töltő bal oldala nem működik.\r\nThe left charging port is out of service.",
            "Rating": 4,
            "DateCreated": "2017-11-07T20:26:25.597Z",
            "User": {
                "ID": 16301,
                "Username": "Morc"
            },
            "CheckinStatusTypeID": 10
        },
        {
            "ID": 11709,
            "ChargePointID": 56826,
            "CommentTypeID": 10,
            "UserName": "wagner",
            "Comment": "Mindkét oldali töltő pont megfelelően mukodik",
            "DateCreated": "2016-06-26T13:10:10.913Z",
            "User": {
                "ID": 9081,
                "Username": "wagner"
            },
            "CheckinStatusTypeID": 10
        },
        {
            "ID": 10304,
            "ChargePointID": 56826,
            "CommentTypeID": 10,
            "UserName": "dosacsabi",
            "Comment": "A töltő jobb oldala nem működik.\r\nThe right side of the charger does not work.",
            "DateCreated": "2016-05-05T09:06:54.253Z",
            "User": {
                "ID": 9329,
                "Username": "dosacsabi"
            },
            "CheckinStatusTypeID": 25
        }
    ],
    "MediaItems": [
        {
            "ID": 6405,
            "ChargePointID": 56826,
            "ItemURL": "https://s3-ap-southeast-2.amazonaws.com/openchargemap/images/HU/OCM56826/OCM-56826.orig.2016051209520676.jpg",
            "ItemThumbnailURL": "https://s3-ap-southeast-2.amazonaws.com/openchargemap/images/HU/OCM56826/OCM-56826.thmb.2016051209520676.jpg",
            "Comment": "",
            "IsEnabled": true,
            "IsVideo": false,
            "IsFeaturedItem": false,
            "IsExternalResource": false,
            "User": {
                "ID": 4438,
                "Username": "tibor.antaloczy"
            },
            "DateCreated": "2016-05-12T09:52:00Z"
        }
    ],
    "IsRecentlyVerified": false,
    "ID": 56826,
    "UUID": "02B3091E-280D-4706-B864-50BB4B41BCEA",
    "DataProviderID": 1,
    "OperatorID": 45,
    "UsageTypeID": 1,
    "UsageCost": "free",
    "AddressInfo": {
        "ID": 57172,
        "Title": "Meder utca",
        "AddressLine1": "Meder utca",
        "Town": "Budapest",
        "Postcode": "1138",
        "CountryID": 104,
        "Latitude": 47.548878669423,
        "Longitude": 19.0726246550475,
        "AccessComments": "Charger is located on the left side of the building (viewing it from Váci út), can be accessed from Meder utca / A töltő az épület bal oldalán található (ha a Váci útról nézzük), Meder utcáról közelíthető meg",
        "DistanceUnit": 0
    },
    "Connections": [
        {
            "ID": 71706,
            "ConnectionTypeID": 25,
            "StatusTypeID": 50,
            "LevelID": 2,
            "Amps": 16,
            "Voltage": 400,
            "PowerKW": 11,
            "Quantity": 2
        }
    ],
    "NumberOfPoints": 2,
    "StatusTypeID": 75,
    "DateLastStatusUpdate": "2018-08-11T19:21:00Z",
    "DataQualityLevel": 1,
    "DateCreated": "2015-11-11T23:09:00Z",
    "SubmissionStatusTypeID": 200
}