{
    "IsRecentlyVerified": false,
    "ID": 50666,
    "UUID": "309BADD6-E10A-4788-9E32-48EF1ECA01B9",
    "DataProviderID": 26,
    "DataProvidersReference": "62203",
    "OperatorID": 178,
    "OperatorsReference": "EVnetNL PNB-ENO075",
    "UsageCost": "0.00 jaarabonnement",
    "AddressInfo": {
        "ID": 51012,
        "Title": "Orthen 15",
        "AddressLine1": "Orthen 15",
        "Town": "'s-Hertogenbosch",
        "Postcode": "5231 XN",
        "CountryID": 159,
        "Latitude": 51.704329,
        "Longitude": 5.303816,
        "ContactTelephone1": "0800-3522365",
        "RelatedURL": "http://www.evnet.nl",
        "DistanceUnit": 0
    },
    "Connections": [
        {
            "ID": 62449,
            "ConnectionTypeID": 25,
            "LevelID": 2,
            "PowerKW": 11,
            "CurrentTypeID": 10
        }
    ],
    "NumberOfPoints": 2,
    "StatusTypeID": 50,
    "DateLastStatusUpdate": "2016-06-04T02:40:00Z",
    "DataQualityLevel": 3,
    "DateCreated": "2015-07-22T09:53:00Z",
    "SubmissionStatusTypeID": 100
}