{
    "MediaItems": [
        {
            "ID": 18930,
            "ChargePointID": 13771,
            "ItemURL": "https://s3-ap-southeast-2.amazonaws.com/openchargemap/images/US/OCM13771/OCM-13771.orig.2019071602031320.png",
            "ItemThumbnailURL": "https://s3-ap-southeast-2.amazonaws.com/openchargemap/images/US/OCM13771/OCM-13771.thmb.2019071602031320.png",
            "Comment": "",
            "IsEnabled": true,
            "IsVideo": false,
            "IsFeaturedItem": false,
            "IsExternalResource": false,
            "User": {
                "ID": 19752,
                "Username": "Noodoe EV"
            },
            "DateCreated": "2019-07-16T02:03:00Z"
        }
    ],
    "IsRecentlyVerified": false,
    "ID": 13771,
    "UUID": "F0F134B3-5A72-42B9-AFB3-3ED008407B95",
    "DataProviderID": 1,
    "OperatorID": 3346,
    "UsageTypeID": 6,
    "AddressInfo": {
        "ID": 13668,
        "Title": "Hilton Palm Springs - Noodoe EV",
        "AddressLine1": "400 E. Tahquitz Canyon Way",
        "Town": "Palm Springs",
        "StateOrProvince": "CA",
        "Postcode": "92262",
        "CountryID": 2,
        "Latitude": 33.8233922639221,
        "Longitude": -116.543686712126,
        "ContactTelephone1": "1-888-222-6618",
        "RelatedURL": "http://www.noodoe.com/ev",
        "DistanceUnit": 0
    },
    "Connections": [
        {
            "ID": 11218,
            "ConnectionTypeID": 1,
            "Reference": "J1772",
            "StatusTypeID": 50,
            "LevelID": 2,
            "PowerKW": 7.2,
            "CurrentTypeID": 10,
            "Quantity": 2
        }
    ],
    "NumberOfPoints": 2,
    "StatusTypeID": 50,
    "DateLastStatusUpdate": "2019-08-11T15:25:00Z",
    "DataQualityLevel": 2,
    "DateCreated": "2012-12-06T11:08:00Z",
    "SubmissionStatusTypeID": 100
}