{
    "IsRecentlyVerified": false,
    "ID": 154482,
    "UUID": "19BF642A-6B86-43B2-8667-DE05F7D19B20",
    "DataProviderID": 28,
    "DataProvidersReference": "FR*SOD*S*NPDC*303*1*_*_",
    "UsageTypeID": 5,
    "AddressInfo": {
        "ID": 154835,
        "Title": "Verlinghem - Place de Mairie",
        "AddressLine1": "Place de Mairie, Verlinghem",
        "CountryID": 80,
        "Latitude": 50.681383,
        "Longitude": 2.995271,
        "AccessComments": "24/24 7/7 jours",
        "DistanceUnit": 0
    },
    "Connections": [
        {
            "ID": 217270,
            "ConnectionTypeID": 28,
            "StatusTypeID": 50,
            "LevelID": 2,
            "PowerKW": 22,
            "CurrentTypeID": 10
        },
        {
            "ID": 217271,
            "ConnectionTypeID": 1036,
            "StatusTypeID": 50,
            "LevelID": 2,
            "PowerKW": 22,
            "CurrentTypeID": 20
        },
        {
            "ID": 252465,
            "ConnectionTypeID": 28,
            "StatusTypeID": 50,
            "LevelID": 2,
            "PowerKW": 22,
            "CurrentTypeID": 10
        },
        {
            "ID": 252466,
            "ConnectionTypeID": 1036,
            "StatusTypeID": 50,
            "LevelID": 2,
            "PowerKW": 22,
            "CurrentTypeID": 20
        }
    ],
    "GeneralComments": "\"Type charge indiquée selon décret de 2017",
    "StatusTypeID": 50,
    "DateLastStatusUpdate": "2020-08-27T05:16:00Z",
    "DataQualityLevel": 2,
    "DateCreated": "2020-03-15T10:55:00Z",
    "SubmissionStatusTypeID": 100
}