{
    "IsRecentlyVerified": false,
    "ID": 99191,
    "UUID": "1B3602BE-73D0-4F77-A471-40258F1557E5",
    "DataProviderID": 1,
    "OperatorID": 105,
    "UsageTypeID": 4,
    "AddressInfo": {
        "ID": 99537,
        "Title": "Bahnhof",
        "AddressLine1": "Bahnhofstraße ",
        "Town": "Bad Salzuflen",
        "StateOrProvince": "Kreis Lippe",
        "Postcode": "32105",
        "CountryID": 87,
        "Latitude": 52.08136080000001,
        "Longitude": 8.74205219999999,
        "AccessComments": "Rund um die Uhr (24/7) nutzbare Säule auf dem Parkplatz vom Taxistand aus kommend in der linken Parkplatzreihe, auf den ersten zwei Plätzen. \r\nZur Zeit kostenlos; Umstellung geplant",
        "RelatedURL": "http://www.stwbs.de/",
        "DistanceUnit": 0
    },
    "Connections": [
        {
            "ID": 140127,
            "ConnectionTypeID": 25,
            "StatusTypeID": 50,
            "LevelID": 2,
            "Amps": 32,
            "Voltage": 400,
            "PowerKW": 22,
            "CurrentTypeID": 20,
            "Quantity": 2
        }
    ],
    "NumberOfPoints": 2,
    "StatusTypeID": 50,
    "DateLastStatusUpdate": "2018-01-24T06:14:00Z",
    "DataQualityLevel": 1,
    "DateCreated": "2018-01-24T06:14:00Z",
    "SubmissionStatusTypeID": 200
}