{
    "IsRecentlyVerified": false,
    "ID": 172789,
    "UUID": "71B14BB9-1FE1-49B3-8D92-A57363F62E82",
    "DataProviderID": 1,
    "OperatorID": 1,
    "UsageTypeID": 4,
    "AddressInfo": {
        "ID": 173148,
        "Title": "Banco Promerica Los Sueños",
        "AddressLine1": "",
        "StateOrProvince": "Puntarenas",
        "CountryID": 58,
        "Latitude": 9.65142856618911,
        "Longitude": -84.66599269100408,
        "DistanceUnit": 0
    },
    "Connections": [
        {
            "ID": 264293,
            "ConnectionTypeID": 1,
            "StatusTypeID": 50,
            "Quantity": 1
        }
    ],
    "NumberOfPoints": 1,
    "GeneralComments": "Lunes a viernes 9am a 5pm sabados 9am a 11pm. La tarjeta de activacion la tienen que pedir en el banco. Solo opera cuando el banco esta abierto (máximo una hora de carga)",
    "StatusTypeID": 50,
    "DateLastStatusUpdate": "2021-02-16T23:12:00Z",
    "DataQualityLevel": 1,
    "DateCreated": "2021-02-16T21:31:00Z",
    "SubmissionStatusTypeID": 200
}