{
    "IsRecentlyVerified": false,
    "ID": 88703,
    "UUID": "B38D9632-2C8F-438A-846D-5C6472DC50A7",
    "DataProviderID": 1,
    "DataProvidersReference": "4114",
    "AddressInfo": {
        "ID": 89049,
        "Title": "Golfparkering i Kullaberg, Italienska vägen",
        "AddressLine1": "Italienska vägen 215",
        "Town": "MÖLLE",
        "StateOrProvince": "SKÅNE",
        "Postcode": "26042",
        "CountryID": 216,
        "Latitude": 56.29958,
        "Longitude": 12.467677,
        "AccessComments": "Man hittar laddningsstationen vid golfparkeringen på västra Kullabergs naturreservat.",
        "DistanceUnit": 0
    },
    "Connections": [
        {
            "ID": 125819,
            "ConnectionTypeID": 0,
            "Reference": "1",
            "LevelID": 2,
            "Amps": 32,
            "Voltage": 400,
            "PowerKW": 22,
            "Comments": "Mode 3"
        },
        {
            "ID": 125820,
            "ConnectionTypeID": 0,
            "Reference": "2",
            "LevelID": 2,
            "Amps": 32,
            "Voltage": 400,
            "PowerKW": 22,
            "Comments": "Mode 3"
        }
    ],
    "NumberOfPoints": 2,
    "DateLastStatusUpdate": "2020-05-26T08:21:00Z",
    "DataQualityLevel": 2,
    "DateCreated": "2017-06-09T11:08:00Z",
    "SubmissionStatusTypeID": 100
}