{
    "IsRecentlyVerified": false,
    "ID": 38756,
    "UUID": "0B69AD01-3127-47D3-9004-6E590BA36812",
    "DataProviderID": 26,
    "DataProvidersReference": "48182",
    "OperatorID": 178,
    "OperatorsReference": "EVnetNL EV0064",
    "UsageCost": "0.00 jaarabonnement",
    "AddressInfo": {
        "ID": 39102,
        "Title": "Bentincksdijk",
        "AddressLine1": "Bentincksdijk",
        "Town": "Hoogeveen",
        "Postcode": "7902 NC",
        "CountryID": 159,
        "Latitude": 52.723925,
        "Longitude": 6.492681,
        "ContactTelephone1": "0800-3522365",
        "RelatedURL": "http://www.evnet.nl",
        "DistanceUnit": 0
    },
    "Connections": [
        {
            "ID": 42267,
            "ConnectionTypeID": 25,
            "LevelID": 2,
            "PowerKW": 11,
            "CurrentTypeID": 10
        }
    ],
    "NumberOfPoints": 1,
    "StatusTypeID": 50,
    "DateLastStatusUpdate": "2016-06-04T02:55:00Z",
    "DataQualityLevel": 3,
    "DateCreated": "2015-01-09T06:08:00Z",
    "SubmissionStatusTypeID": 100
}