{
    "IsRecentlyVerified": false,
    "ID": 89026,
    "UUID": "B0369F89-B703-4AC5-B61B-4E68A5D660AC",
    "DataProviderID": 1,
    "OperatorID": 80,
    "UsageTypeID": 4,
    "UsageCost": "0,40 €/kW",
    "AddressInfo": {
        "ID": 89372,
        "Title": "Eneldive Tricase Cappuccini",
        "AddressLine1": "Piazza dei Cappuccini",
        "Town": "Tricase",
        "StateOrProvince": "LE",
        "Postcode": "73039",
        "CountryID": 112,
        "Latitude": 39.93095502170486,
        "Longitude": 18.35670759756429,
        "RelatedURL": "http://eneldrive.it",
        "DistanceUnit": 0
    },
    "Connections": [
        {
            "ID": 126344,
            "ConnectionTypeID": 25,
            "StatusTypeID": 50,
            "LevelID": 2,
            "Amps": 32,
            "Voltage": 400,
            "PowerKW": 22,
            "CurrentTypeID": 20,
            "Quantity": 1
        },
        {
            "ID": 126345,
            "ConnectionTypeID": 36,
            "StatusTypeID": 50,
            "LevelID": 2,
            "Amps": 16,
            "Voltage": 240,
            "PowerKW": 3.7,
            "CurrentTypeID": 10,
            "Quantity": 1
        }
    ],
    "NumberOfPoints": 2,
    "StatusTypeID": 50,
    "DateLastStatusUpdate": "2017-06-19T18:29:00Z",
    "DataQualityLevel": 1,
    "DateCreated": "2017-06-19T18:29:00Z",
    "SubmissionStatusTypeID": 200
}