{
    "IsRecentlyVerified": false,
    "ID": 38484,
    "UUID": "A5CDC677-09BE-412B-93E1-71C6FDA38083",
    "DataProviderID": 1,
    "OperatorID": 105,
    "OperatorsReference": "Essent EM-DE-11000000-10-00009",
    "UsageTypeID": 4,
    "AddressInfo": {
        "ID": 38830,
        "Title": "Zitadellenweg 34",
        "AddressLine1": "Zitadellenweg 34",
        "Town": "Berlin",
        "Postcode": "13599",
        "CountryID": 87,
        "Latitude": 52.538151,
        "Longitude": 13.217505,
        "DistanceUnit": 0
    },
    "Connections": [
        {
            "ID": 41995,
            "ConnectionTypeID": 25,
            "LevelID": 2,
            "PowerKW": 11
        },
        {
            "ID": 49697,
            "ConnectionTypeID": 25,
            "LevelID": 2,
            "PowerKW": 11
        }
    ],
    "NumberOfPoints": 1,
    "StatusTypeID": 50,
    "DateLastStatusUpdate": "2015-04-12T20:28:00Z",
    "DataQualityLevel": 3,
    "DateCreated": "2015-01-09T06:07:00Z",
    "SubmissionStatusTypeID": 200
}