{
    "IsRecentlyVerified": false,
    "ID": 109168,
    "UUID": "201F9321-3754-4D53-B1EA-39C2E0D54D0A",
    "DataProviderID": 1,
    "OperatorID": 23,
    "OperatorsReference": "46350",
    "UsageTypeID": 4,
    "AddressInfo": {
        "ID": 109514,
        "Title": "Courtyard Tampa Northwest/Veterans Expressway",
        "AddressLine1": "12730 Citrus Park LN",
        "Town": "Tampa",
        "StateOrProvince": "Florida",
        "Postcode": "33625",
        "CountryID": 2,
        "Latitude": 28.065916,
        "Longitude": -82.570284,
        "ContactTelephone1": "(813) 920-2011",
        "DistanceUnit": 0
    },
    "Connections": [
        {
            "ID": 154286,
            "ConnectionTypeID": 30,
            "StatusTypeID": 50,
            "LevelID": 2,
            "PowerKW": 16,
            "CurrentTypeID": 20,
            "Quantity": 3
        }
    ],
    "NumberOfPoints": 3,
    "GeneralComments": "3 Tesla Connectors, up to 16kW.Available for customers. Self park.",
    "StatusTypeID": 50,
    "DateLastStatusUpdate": "2019-06-05T11:37:00Z",
    "DataQualityLevel": 1,
    "DateCreated": "2018-10-11T13:49:00Z",
    "SubmissionStatusTypeID": 200
}