{
    "IsRecentlyVerified": false,
    "ID": 155652,
    "UUID": "465ED5D1-5B65-4689-A35E-9B59BE020C9C",
    "DataProviderID": 1,
    "OperatorID": 3389,
    "UsageTypeID": 1,
    "UsageCost": "$1.00/session+$0.21/minute",
    "AddressInfo": {
        "ID": 156006,
        "Title": "Southeastern Electric Cooperative - Francis Energy",
        "AddressLine1": "1514 US-70",
        "Town": "Durant",
        "StateOrProvince": "OK",
        "Postcode": "74702",
        "CountryID": 2,
        "Latitude": 33.99849973477626,
        "Longitude": -96.3550039761252,
        "AccessComments": "Use EVGateway App to manage charging ",
        "RelatedURL": "https://francis.energy/",
        "DistanceUnit": 0
    },
    "Connections": [
        {
            "ID": 219160,
            "ConnectionTypeID": 32,
            "StatusTypeID": 50,
            "LevelID": 3,
            "PowerKW": 50,
            "CurrentTypeID": 30,
            "Quantity": 1,
            "Comments": "BTCPower 50kW"
        },
        {
            "ID": 219161,
            "ConnectionTypeID": 2,
            "StatusTypeID": 50,
            "LevelID": 3,
            "PowerKW": 50,
            "CurrentTypeID": 30,
            "Quantity": 1,
            "Comments": "BTCPower 50kW"
        },
        {
            "ID": 219162,
            "ConnectionTypeID": 1,
            "StatusTypeID": 50,
            "LevelID": 2,
            "Amps": 40,
            "PowerKW": 8,
            "CurrentTypeID": 10,
            "Quantity": 1
        }
    ],
    "NumberOfPoints": 2,
    "GeneralComments": "50kW DC Fast Charger and Level 2 Provided by Francis Energy",
    "StatusTypeID": 50,
    "DateLastStatusUpdate": "2020-04-21T17:58:00Z",
    "DataQualityLevel": 1,
    "DateCreated": "2020-04-21T01:54:00Z",
    "SubmissionStatusTypeID": 200
}