{
    "IsRecentlyVerified": false,
    "ID": 183080,
    "UUID": "8AA01816-7DC0-43BB-A64A-29B0CC26939F",
    "DataProviderID": 29,
    "DataProvidersReference": "17734",
    "AddressInfo": {
        "ID": 183439,
        "Title": "Volksgartenstrasse 80",
        "AddressLine1": "Volksgartenstrasse 80",
        "Town": "Dortmund",
        "Postcode": "44139",
        "CountryID": 87,
        "Latitude": 51.504687,
        "Longitude": 7.329562,
        "DistanceUnit": 0
    },
    "Connections": [
        {
            "ID": 289624,
            "ConnectionTypeID": 33,
            "StatusTypeID": 50,
            "LevelID": 3,
            "PowerKW": 75,
            "CurrentTypeID": 30
        },
        {
            "ID": 289625,
            "ConnectionTypeID": 33,
            "StatusTypeID": 50,
            "LevelID": 3,
            "PowerKW": 75,
            "CurrentTypeID": 30
        }
    ],
    "StatusTypeID": 50,
    "DateLastStatusUpdate": "2021-07-09T03:24:00Z",
    "MetadataValues": [
        {
            "ID": 15373,
            "MetadataFieldID": 4,
            "ItemValue": "Data from the German chargepoint registry provided by Bundesnetzagentur.de under the CC-BY 4.0 license"
        }
    ],
    "DataQualityLevel": 3,
    "DateCreated": "2021-07-08T10:03:00Z",
    "SubmissionStatusTypeID": 100
}