{
    "IsRecentlyVerified": false,
    "ID": 137159,
    "UUID": "AA7FBEF3-0F5F-40B9-9055-B24912554E44",
    "DataProviderID": 2,
    "DataProvidersReference": "139984",
    "OperatorID": 59,
    "UsageTypeID": 1,
    "AddressInfo": {
        "ID": 137505,
        "Title": "Greenlots - 43111",
        "AddressLine1": "1200 Kilauea Avenue",
        "Town": "Hilo",
        "StateOrProvince": "HI",
        "Postcode": "96720",
        "CountryID": 2,
        "Latitude": 19.7109432220459,
        "Longitude": -155.076751708984,
        "ContactTelephone1": "855-900-7584",
        "AccessComments": "24 hours daily",
        "RelatedURL": "http://greenlots.com/",
        "DistanceUnit": 0
    },
    "Connections": [
        {
            "ID": 192017,
            "ConnectionTypeID": 2,
            "LevelID": 3,
            "Amps": 100,
            "Voltage": 400,
            "PowerKW": 40,
            "CurrentTypeID": 30,
            "Quantity": 1
        },
        {
            "ID": 192018,
            "ConnectionTypeID": 32,
            "LevelID": 3,
            "Amps": 100,
            "Voltage": 400,
            "PowerKW": 40,
            "CurrentTypeID": 30,
            "Quantity": 1
        }
    ],
    "StatusTypeID": 50,
    "DateLastStatusUpdate": "2019-12-24T09:04:00Z",
    "DataQualityLevel": 3,
    "DateCreated": "2019-12-24T09:04:00Z",
    "SubmissionStatusTypeID": 100
}