{
    "IsRecentlyVerified": false,
    "ID": 168230,
    "UUID": "85BD8260-40EA-463C-B201-E24205F44286",
    "DataProviderID": 1,
    "OperatorID": 1,
    "UsageTypeID": 1,
    "AddressInfo": {
        "ID": 168589,
        "Title": "De Felice e Morsella",
        "AddressLine1": "Strada Provinciale per Pescara - S. Silvestro, 3, 65100 Pescara PE, Italia",
        "Town": "Pescara",
        "StateOrProvince": "PE",
        "Postcode": "16159",
        "CountryID": 112,
        "Latitude": 42.429269,
        "Longitude": 14.235704,
        "ContactTelephone1": "0102910677",
        "AccessComments": "Ricarica tramite APP certificate su Hubject",
        "RelatedURL": "http://energy.solutions.it@axpo.com",
        "DistanceUnit": 0
    },
    "Connections": [
        {
            "ID": 255472,
            "ConnectionTypeID": 25,
            "StatusTypeID": 50,
            "LevelID": 2,
            "Amps": 32,
            "Voltage": 400,
            "PowerKW": 22,
            "CurrentTypeID": 20,
            "Quantity": 2
        }
    ],
    "NumberOfPoints": 1,
    "GeneralComments": "Gestita da De Felice e Morsella di proprietà Axpo Energy Solutions Italia ",
    "StatusTypeID": 50,
    "DateLastStatusUpdate": "2020-09-21T14:26:00Z",
    "DataQualityLevel": 1,
    "DateCreated": "2020-09-21T06:48:00Z",
    "SubmissionStatusTypeID": 200
}