{
    "IsRecentlyVerified": false,
    "ID": 108013,
    "UUID": "9B62935F-2C01-4FD4-85DA-67BF175BD5A0",
    "DataProviderID": 1,
    "OperatorID": 32,
    "OperatorsReference": "24502",
    "UsageTypeID": 4,
    "UsageCost": "£0.108/kWh; for Polar Plus subscription members only",
    "AddressInfo": {
        "ID": 108359,
        "Title": "The Grange Manor",
        "AddressLine1": "The Grange Manor",
        "Town": "Glensburgh Road",
        "StateOrProvince": "Grangemouth",
        "Postcode": "FK3 8XJ",
        "CountryID": 1,
        "Latitude": 56.015499,
        "Longitude": -3.7461,
        "DistanceUnit": 0
    },
    "Connections": [
        {
            "ID": 152559,
            "ConnectionTypeID": 33,
            "StatusTypeID": 50,
            "LevelID": 3,
            "PowerKW": 50,
            "CurrentTypeID": 30,
            "Quantity": 1
        },
        {
            "ID": 152560,
            "ConnectionTypeID": 2,
            "StatusTypeID": 50,
            "LevelID": 3,
            "PowerKW": 50,
            "CurrentTypeID": 30,
            "Quantity": 1
        },
        {
            "ID": 152561,
            "ConnectionTypeID": 1036,
            "StatusTypeID": 50,
            "LevelID": 3,
            "PowerKW": 43,
            "CurrentTypeID": 20,
            "Quantity": 1
        }
    ],
    "NumberOfPoints": 1,
    "GeneralComments": "Located in the hotel car park. Parking restrictions apply. Please make sure you register your vehicle with reception.",
    "StatusTypeID": 50,
    "DateLastStatusUpdate": "2019-06-20T05:16:00Z",
    "DataQualityLevel": 1,
    "DateCreated": "2018-08-25T05:16:00Z",
    "SubmissionStatusTypeID": 200
}