{
    "IsRecentlyVerified": false,
    "ID": 89796,
    "UUID": "730E7DDC-AF46-46FB-9EAE-42ECAC9DE5AA",
    "DataProviderID": 2,
    "DataProvidersReference": "85386",
    "OperatorID": 5,
    "UsageTypeID": 1,
    "AddressInfo": {
        "ID": 90142,
        "Title": "STATION1",
        "AddressLine1": "11785 NW Timberview Ln",
        "Town": "Portland",
        "StateOrProvince": "OR",
        "Postcode": "97229",
        "CountryID": 2,
        "Latitude": 45.5219071,
        "Longitude": -122.7991643,
        "ContactTelephone1": "888-758-4389",
        "AccessComments": "24 hours daily",
        "RelatedURL": "http://www.chargepoint.com/",
        "DistanceUnit": 0
    },
    "Connections": [
        {
            "ID": 127243,
            "ConnectionTypeID": 1,
            "LevelID": 2,
            "Amps": 16,
            "Voltage": 230,
            "PowerKW": 3.7,
            "CurrentTypeID": 10,
            "Quantity": 2
        }
    ],
    "DateLastStatusUpdate": "2020-06-26T03:09:00Z",
    "DataQualityLevel": 3,
    "DateCreated": "2017-06-22T08:16:00Z",
    "SubmissionStatusTypeID": 100
}