{
    "IsRecentlyVerified": false,
    "ID": 16873,
    "UUID": "14E9D5C6-AA5E-4434-B4EC-D8AAF1C36D8B",
    "DataProviderID": 22,
    "DataProvidersReference": "F38575EE8AF23BA6D923C0D98EE767FC",
    "AddressInfo": {
        "ID": 17218,
        "Title": "北海道日産自動車北店",
        "AddressLine1": "北海道札幌市東区北19条東1-2-20",
        "CountryID": 114,
        "Latitude": 43.08495154,
        "Longitude": 141.3509514,
        "ContactTelephone1": "011-711-6112",
        "DistanceUnit": 0
    },
    "Connections": [
        {
            "ID": 17114,
            "ConnectionTypeID": 2,
            "LevelID": 2,
            "Amps": 100,
            "Voltage": 480,
            "PowerKW": 48,
            "Quantity": 1
        }
    ],
    "DateLastStatusUpdate": "2013-06-29T08:50:00Z",
    "DataQualityLevel": 2,
    "DateCreated": "2013-06-29T08:50:00Z",
    "SubmissionStatusTypeID": 200
}