{
    "IsRecentlyVerified": true,
    "DateLastVerified": "2021-09-18T17:20:00Z",
    "ID": 189277,
    "UUID": "128D6288-B49B-44D0-BD6B-5B07F8A59414",
    "DataProviderID": 1,
    "OperatorID": 80,
    "UsageTypeID": 4,
    "UsageCost": "0.40/kWh",
    "AddressInfo": {
        "ID": 189636,
        "Title": "Via di Pratignone",
        "AddressLine1": "Via di Pratignone",
        "Town": "Calenzano",
        "StateOrProvince": "Tuscany",
        "Postcode": "50041",
        "CountryID": 112,
        "Latitude": 43.84861250543443,
        "Longitude": 11.161418816778905,
        "DistanceUnit": 0
    },
    "Connections": [
        {
            "ID": 306065,
            "ConnectionTypeID": 25,
            "StatusTypeID": 50,
            "LevelID": 2,
            "PowerKW": 22,
            "CurrentTypeID": 20,
            "Quantity": 2
        }
    ],
    "NumberOfPoints": 1,
    "StatusTypeID": 50,
    "DateLastStatusUpdate": "2021-09-19T09:01:00Z",
    "DataQualityLevel": 1,
    "DateCreated": "2021-09-18T17:20:00Z",
    "SubmissionStatusTypeID": 200
}