{
    "IsRecentlyVerified": false,
    "ID": 32218,
    "UUID": "E37239A5-74D7-48F6-A43C-66AC7E3ADD9E",
    "DataProviderID": 1,
    "OperatorID": 105,
    "OperatorsReference": "Essent EM-DE-05382020-01-00001",
    "UsageTypeID": 4,
    "AddressInfo": {
        "ID": 32564,
        "Title": "Fritz-Jacobi-Str. 18",
        "AddressLine1": "Fritz-Jacobi-Str. 18",
        "Town": "Hennef",
        "Postcode": "53773",
        "CountryID": 87,
        "Latitude": 50.778475,
        "Longitude": 7.27076,
        "DistanceUnit": 0
    },
    "Connections": [
        {
            "ID": 35729,
            "ConnectionTypeID": 25,
            "LevelID": 2,
            "PowerKW": 11
        },
        {
            "ID": 46295,
            "ConnectionTypeID": 25,
            "LevelID": 2,
            "PowerKW": 11
        }
    ],
    "NumberOfPoints": 1,
    "StatusTypeID": 50,
    "DateLastStatusUpdate": "2015-04-13T19:51:00Z",
    "DataQualityLevel": 3,
    "DateCreated": "2015-01-09T06:03:00Z",
    "SubmissionStatusTypeID": 200
}