{
    "IsRecentlyVerified": false,
    "ID": 91507,
    "UUID": "63C18D8D-067F-4FCB-9FF4-791C74E43BE7",
    "DataProviderID": 2,
    "DataProvidersReference": "86014",
    "OperatorID": 5,
    "UsageTypeID": 1,
    "AddressInfo": {
        "ID": 91853,
        "Title": "400 DEXTER AVE",
        "AddressLine1": "400 Dexter Ave N",
        "Town": "Seattle",
        "StateOrProvince": "WA",
        "Postcode": "98109",
        "CountryID": 2,
        "Latitude": 47.622309,
        "Longitude": -122.341952,
        "ContactTelephone1": "888-758-4389",
        "AccessComments": "24 hours daily",
        "RelatedURL": "http://www.chargepoint.com/",
        "DistanceUnit": 0
    },
    "Connections": [
        {
            "ID": 129679,
            "ConnectionTypeID": 1,
            "LevelID": 2,
            "Amps": 16,
            "Voltage": 230,
            "PowerKW": 3.7,
            "CurrentTypeID": 10,
            "Quantity": 4
        }
    ],
    "DateLastStatusUpdate": "2020-06-26T03:11:00Z",
    "DataQualityLevel": 3,
    "DateCreated": "2017-08-03T12:25:00Z",
    "SubmissionStatusTypeID": 100
}