{
    "IsRecentlyVerified": false,
    "ID": 56304,
    "UUID": "2B1BE767-A777-4436-83B7-1FADA24BAF72",
    "DataProviderID": 1,
    "OperatorID": 1,
    "UsageTypeID": 1,
    "AddressInfo": {
        "ID": 56650,
        "Title": " Hotel Mercure Bochum City",
        "AddressLine1": "Massenbergstraße 19",
        "AddressLine2": "Mitte",
        "Town": "Bochum",
        "StateOrProvince": "Bochum",
        "Postcode": "44787",
        "CountryID": 87,
        "Latitude": 51.480146382399,
        "Longitude": 7.22336105026236,
        "AccessComments": "Manchmal müssen Parkgebühren bezahlt werden. Auf Ladepunkt der Stadtwerke berufen, dann kann man Glück haben. Das Laden ist kostenlos, Betreiber sind die Stadtwerke Bochum.",
        "RelatedURL": "http://www.ruhrautoe.de/ueber-ruhrautoe/standorte",
        "DistanceUnit": 0
    },
    "Connections": [
        {
            "ID": 71012,
            "ConnectionTypeID": 25,
            "StatusTypeID": 50,
            "LevelID": 2,
            "Amps": 32,
            "Voltage": 400,
            "PowerKW": 22,
            "CurrentTypeID": 20,
            "Quantity": 2
        }
    ],
    "NumberOfPoints": 2,
    "StatusTypeID": 50,
    "DateLastStatusUpdate": "2015-10-29T21:50:00Z",
    "DataQualityLevel": 1,
    "DateCreated": "2015-10-28T14:24:00Z",
    "SubmissionStatusTypeID": 200
}