{
    "IsRecentlyVerified": false,
    "ID": 111388,
    "UUID": "0693F87C-D788-4CDE-89E2-B9A765D439CD",
    "DataProviderID": 2,
    "DataProvidersReference": "99736",
    "OperatorID": 5,
    "UsageTypeID": 1,
    "AddressInfo": {
        "ID": 111734,
        "Title": "TELUS",
        "AddressLine1": "8803 Rte Transcanadienne",
        "Town": "Montréal",
        "StateOrProvince": "QC",
        "Postcode": "H4R 2P1",
        "CountryID": 44,
        "Latitude": 45.4923714,
        "Longitude": -73.7378831,
        "ContactTelephone1": "888-758-4389",
        "AccessComments": "24 hours daily",
        "RelatedURL": "http://www.chargepoint.com/",
        "DistanceUnit": 0
    },
    "Connections": [
        {
            "ID": 156804,
            "ConnectionTypeID": 1,
            "LevelID": 2,
            "Amps": 16,
            "Voltage": 230,
            "PowerKW": 3,
            "CurrentTypeID": 10,
            "Quantity": 2
        }
    ],
    "DateLastStatusUpdate": "2019-12-24T09:23:00Z",
    "DataQualityLevel": 3,
    "DateCreated": "2018-10-18T23:37:00Z",
    "SubmissionStatusTypeID": 100
}