{
    "UserComments": [
        {
            "ID": 4419,
            "ChargePointID": 31632,
            "CommentTypeID": 10,
            "UserName": "tibor.antaloczy",
            "Rating": 5,
            "RelatedURL": "http://on.bubb.li/236262aa53if51k0zplfbql/",
            "DateCreated": "2015-05-12T14:05:16.253Z",
            "User": {
                "ID": 4438,
                "Username": "tibor.antaloczy"
            },
            "CheckinStatusTypeID": 10
        }
    ],
    "MediaItems": [
        {
            "ID": 1363,
            "ChargePointID": 31632,
            "ItemURL": "https://s3-ap-southeast-2.amazonaws.com/openchargemap/images/HU/OCM31632/OCM-31632.orig.2015051214032578.jpg",
            "ItemThumbnailURL": "https://s3-ap-southeast-2.amazonaws.com/openchargemap/images/HU/OCM31632/OCM-31632.thmb.2015051214032578.jpg",
            "Comment": "",
            "IsEnabled": true,
            "IsVideo": false,
            "IsFeaturedItem": false,
            "IsExternalResource": false,
            "User": {
                "ID": 4438,
                "Username": "tibor.antaloczy"
            },
            "DateCreated": "2015-05-12T14:04:00Z"
        },
        {
            "ID": 1364,
            "ChargePointID": 31632,
            "ItemURL": "https://s3-ap-southeast-2.amazonaws.com/openchargemap/images/HU/OCM31632/OCM-31632.orig.2015051214035100.jpg",
            "ItemThumbnailURL": "https://s3-ap-southeast-2.amazonaws.com/openchargemap/images/HU/OCM31632/OCM-31632.thmb.2015051214035100.jpg",
            "Comment": "",
            "IsEnabled": true,
            "IsVideo": false,
            "IsFeaturedItem": false,
            "IsExternalResource": false,
            "User": {
                "ID": 4438,
                "Username": "tibor.antaloczy"
            },
            "DateCreated": "2015-05-12T14:04:00Z"
        }
    ],
    "IsRecentlyVerified": false,
    "ID": 31632,
    "UUID": "A62BF217-52DF-4E0B-B157-EC8AA87D1D8B",
    "DataProviderID": 1,
    "OperatorID": 187,
    "OperatorsReference": "Essent EM-HU-00000001-13-00001",
    "UsageTypeID": 1,
    "UsageCost": "HUF 99/kWh",
    "AddressInfo": {
        "ID": 31978,
        "Title": "Budapest, Jászai Mari tér",
        "AddressLine1": "Jászai Mari tér",
        "Town": "Budapest",
        "Postcode": "1137",
        "CountryID": 104,
        "Latitude": 47.5137935701584,
        "Longitude": 19.0470111879472,
        "ContactTelephone1": "+36 012381818",
        "RelatedURL": "http://www.e-autozas.hu/",
        "DistanceUnit": 0
    },
    "Connections": [
        {
            "ID": 35143,
            "ConnectionTypeID": 25,
            "StatusTypeID": 50,
            "LevelID": 2,
            "Amps": 32,
            "Voltage": 400,
            "PowerKW": 22,
            "CurrentTypeID": 20,
            "Quantity": 1
        },
        {
            "ID": 46022,
            "ConnectionTypeID": 25,
            "StatusTypeID": 50,
            "LevelID": 2,
            "Amps": 32,
            "Voltage": 400,
            "PowerKW": 22,
            "CurrentTypeID": 20,
            "Quantity": 2
        }
    ],
    "NumberOfPoints": 2,
    "GeneralComments": "🇭🇺 2 x 22 kW AC, eCharge+ applikáción keresztüli kártyás fizetés szükséges a töltés indításához.  🇬🇧 2 x 22 kW AC, card payment via eCharge+ application is required to start charging.",
    "StatusTypeID": 50,
    "DateLastStatusUpdate": "2020-07-06T17:31:00Z",
    "DataQualityLevel": 3,
    "DateCreated": "2015-01-09T06:03:00Z",
    "SubmissionStatusTypeID": 100
}