{
    "IsRecentlyVerified": false,
    "ID": 143432,
    "UUID": "C481DFBA-CD8F-4560-807B-2FAB677A1008",
    "DataProviderID": 2,
    "DataProvidersReference": "104154",
    "OperatorID": 5,
    "UsageTypeID": 1,
    "AddressInfo": {
        "ID": 143784,
        "Title": "MILWAUKEE",
        "AddressLine1": "1720 N Arlington Pl",
        "Town": "Milwaukee",
        "StateOrProvince": "WI",
        "Postcode": "53202",
        "CountryID": 2,
        "Latitude": 43.0534492,
        "Longitude": -87.8939989,
        "ContactTelephone1": "888-758-4389",
        "AccessComments": "24 hours daily",
        "RelatedURL": "http://www.chargepoint.com/",
        "DistanceUnit": 0
    },
    "Connections": [
        {
            "ID": 199750,
            "ConnectionTypeID": 1,
            "LevelID": 2,
            "Amps": 16,
            "Voltage": 230,
            "PowerKW": 3.7,
            "CurrentTypeID": 10,
            "Quantity": 2
        }
    ],
    "StatusTypeID": 50,
    "DateLastStatusUpdate": "2020-06-26T03:06:00Z",
    "DataQualityLevel": 3,
    "DateCreated": "2019-12-24T09:21:00Z",
    "SubmissionStatusTypeID": 100
}