{
    "IsRecentlyVerified": false,
    "ID": 176748,
    "UUID": "13DCBB6C-3B55-4B6A-8CCD-3A59D57AD6B3",
    "DataProviderID": 29,
    "DataProvidersReference": "3953",
    "AddressInfo": {
        "ID": 177107,
        "Title": "Frankfurter Straße 31",
        "AddressLine1": "Frankfurter Straße 31",
        "Town": "Seligenstadt",
        "Postcode": "63500",
        "CountryID": 87,
        "Latitude": 50.044467,
        "Longitude": 8.970999,
        "DistanceUnit": 0
    },
    "Connections": [
        {
            "ID": 275018,
            "ConnectionTypeID": 25,
            "StatusTypeID": 50,
            "LevelID": 2,
            "PowerKW": 22,
            "CurrentTypeID": 20
        },
        {
            "ID": 275019,
            "ConnectionTypeID": 25,
            "StatusTypeID": 50,
            "LevelID": 2,
            "PowerKW": 22,
            "CurrentTypeID": 20
        },
        {
            "ID": 297520,
            "ConnectionTypeID": 25,
            "StatusTypeID": 50,
            "LevelID": 2,
            "PowerKW": 22,
            "CurrentTypeID": 20
        },
        {
            "ID": 297521,
            "ConnectionTypeID": 25,
            "StatusTypeID": 50,
            "LevelID": 2,
            "PowerKW": 22,
            "CurrentTypeID": 20
        }
    ],
    "StatusTypeID": 0,
    "DateLastStatusUpdate": "2021-07-12T02:44:00Z",
    "MetadataValues": [
        {
            "ID": 9043,
            "MetadataFieldID": 4,
            "ItemValue": "Data from the German chargepoint registry provided by Bundesnetzagentur.de under the CC-BY 4.0 license"
        }
    ],
    "DataQualityLevel": 3,
    "DateCreated": "2021-07-08T09:48:00Z",
    "SubmissionStatusTypeID": 100
}