{
    "IsRecentlyVerified": false,
    "ID": 131652,
    "UUID": "163E55C1-C852-4725-9128-61059E666393",
    "DataProviderID": 1,
    "OperatorID": 3315,
    "OperatorsReference": "51930",
    "UsageTypeID": 4,
    "UsageCost": "Free",
    "AddressInfo": {
        "ID": 131998,
        "Title": "Barns Crescent Car Park, Ayr",
        "AddressLine1": "Barns Crescent Car Park, Ayr",
        "Postcode": "KA7 2AY",
        "CountryID": 1,
        "Latitude": 55.45883,
        "Longitude": -4.63313,
        "DistanceUnit": 0
    },
    "Connections": [
        {
            "ID": 184257,
            "ConnectionTypeID": 25,
            "StatusTypeID": 50,
            "LevelID": 2,
            "Amps": 32,
            "Voltage": 230,
            "PowerKW": 7,
            "CurrentTypeID": 10,
            "Quantity": 2
        }
    ],
    "NumberOfPoints": 2,
    "StatusTypeID": 50,
    "DateLastStatusUpdate": "2019-10-16T05:13:00Z",
    "DataQualityLevel": 1,
    "DateCreated": "2019-09-10T13:43:00Z",
    "SubmissionStatusTypeID": 200
}