{
    "IsRecentlyVerified": false,
    "ID": 149273,
    "UUID": "2F226297-BE2A-4DF5-B65E-A6F55CA180EB",
    "DataProviderID": 18,
    "DataProvidersReference": "4f141868f35ccdb63a508658bed4981b",
    "OperatorID": 3393,
    "UsageTypeID": 1,
    "AddressInfo": {
        "ID": 149626,
        "Title": "1 Coastguard Cottages",
        "AddressLine1": "1 Coastguard Cottages",
        "Town": "Exbury",
        "Postcode": "SO45 1AD",
        "CountryID": 1,
        "Latitude": 50.785498,
        "Longitude": -1.354438,
        "AccessComments": "",
        "RelatedURL": "http://www.joju.co.uk/",
        "DistanceUnit": 0
    },
    "Connections": [
        {
            "ID": 207269,
            "ConnectionTypeID": 25,
            "Reference": "ICUEVE900666_1",
            "StatusTypeID": 50,
            "LevelID": 2,
            "Amps": 32,
            "Voltage": 230,
            "PowerKW": 7,
            "CurrentTypeID": 10
        },
        {
            "ID": 207270,
            "ConnectionTypeID": 25,
            "Reference": "ICUEVE900666_2",
            "StatusTypeID": 50,
            "LevelID": 2,
            "Amps": 32,
            "Voltage": 230,
            "PowerKW": 7,
            "CurrentTypeID": 10
        }
    ],
    "StatusTypeID": 0,
    "DateLastStatusUpdate": "2020-03-17T08:53:00Z",
    "MetadataValues": [
        {
            "ID": 7020,
            "MetadataFieldID": 4,
            "ItemValue": "Contains public sector information licensed under the Open Government Licence v2.0. http://www.nationalarchives.gov.uk/doc/open-government-licence/version/2/"
        }
    ],
    "DataQualityLevel": 3,
    "DateCreated": "2020-02-21T15:15:00Z",
    "SubmissionStatusTypeID": 100
}