{
    "IsRecentlyVerified": false,
    "ID": 66035,
    "UUID": "0425BBBD-E02B-43CB-8460-581E7B266A24",
    "DataProviderID": 1,
    "OperatorID": 45,
    "UsageTypeID": 7,
    "UsageCost": "Free",
    "AddressInfo": {
        "ID": 66381,
        "Title": "Norseman Oval",
        "AddressLine1": "31 Sinclair Street",
        "Town": "Norseman",
        "StateOrProvince": "WA",
        "Postcode": "6443",
        "CountryID": 18,
        "Latitude": -32.196156,
        "Longitude": 121.77561,
        "RelatedURL": "http://www.dundas.wa.gov.au/",
        "DistanceUnit": 0
    },
    "Connections": [
        {
            "ID": 94229,
            "ConnectionTypeID": 0,
            "StatusTypeID": 50,
            "LevelID": 2,
            "Amps": 32,
            "Voltage": 400,
            "PowerKW": 22,
            "CurrentTypeID": 20,
            "Quantity": 1
        }
    ],
    "NumberOfPoints": 1,
    "GeneralComments": "AS/NZS3123 5 pin three-phase industrial connector",
    "StatusTypeID": 50,
    "DateLastStatusUpdate": "2016-05-29T11:09:00Z",
    "DataQualityLevel": 1,
    "DateCreated": "2016-05-09T22:49:00Z",
    "SubmissionStatusTypeID": 200
}