{
    "IsRecentlyVerified": false,
    "ID": 124037,
    "UUID": "0E71E94C-DB9F-4E7E-8C92-C3DFCC10AF5E",
    "DataProviderID": 2,
    "DataProvidersReference": "94678",
    "UsageTypeID": 1,
    "AddressInfo": {
        "ID": 124383,
        "Title": "Tesla Service Center",
        "AddressLine1": "9850 W Broad St",
        "Town": "Glen Allen",
        "StateOrProvince": "VA",
        "Postcode": "23060",
        "CountryID": 2,
        "Latitude": 37.643994,
        "Longitude": -77.564259,
        "ContactTelephone1": "804-219-4999  877-798-3752",
        "AccessComments": "24 hours daily",
        "RelatedURL": "",
        "DistanceUnit": 0
    },
    "Connections": [
        {
            "ID": 174079,
            "ConnectionTypeID": 27,
            "LevelID": 3,
            "Amps": 100,
            "Voltage": 400,
            "PowerKW": 40,
            "CurrentTypeID": 30,
            "Quantity": 1
        }
    ],
    "DateLastStatusUpdate": "2020-06-26T02:59:00Z",
    "DataQualityLevel": 3,
    "DateCreated": "2019-04-06T05:03:00Z",
    "SubmissionStatusTypeID": 100
}