{
    "IsRecentlyVerified": false,
    "ID": 17436,
    "UUID": "A5968633-9DC5-493B-8DBE-5F5E558A86C6",
    "DataProviderID": 22,
    "DataProvidersReference": "F38575EE8AF23BA6D923C0D98EE767FC",
    "AddressInfo": {
        "ID": 17781,
        "Title": "岡山日産自動車津山店",
        "AddressLine1": "岡山県津山市高野本郷1268-1",
        "CountryID": 114,
        "Latitude": 35.07363923,
        "Longitude": 134.0499877,
        "ContactTelephone1": "0868-26-3923",
        "DistanceUnit": 0
    },
    "Connections": [
        {
            "ID": 17677,
            "ConnectionTypeID": 2,
            "LevelID": 2,
            "Amps": 100,
            "Voltage": 480,
            "PowerKW": 48,
            "Quantity": 1
        }
    ],
    "DateLastStatusUpdate": "2013-06-29T08:58:00Z",
    "DataQualityLevel": 2,
    "DateCreated": "2013-06-29T08:58:00Z",
    "SubmissionStatusTypeID": 200
}