{
    "IsRecentlyVerified": false,
    "ID": 135277,
    "UUID": "520470F5-4D7E-4C45-B24F-6A1C719B1CC2",
    "DataProviderID": 1,
    "OperatorID": 127,
    "UsageTypeID": 6,
    "AddressInfo": {
        "ID": 135623,
        "Title": "Gemeinde Lemwerder",
        "AddressLine1": "Stedinger Straße 51",
        "Town": "Lemwerder",
        "StateOrProvince": "Landkreis Wesermarsch",
        "Postcode": "27809",
        "CountryID": 87,
        "Latitude": 53.16036362103253,
        "Longitude": 8.612230922935737,
        "DistanceUnit": 0
    },
    "Connections": [
        {
            "ID": 189524,
            "ConnectionTypeID": 25
        }
    ],
    "NumberOfPoints": 2,
    "StatusTypeID": 50,
    "DateLastStatusUpdate": "2019-12-16T07:48:00Z",
    "DataQualityLevel": 1,
    "DateCreated": "2019-12-14T23:08:00Z",
    "SubmissionStatusTypeID": 200
}