{
    "IsRecentlyVerified": false,
    "ID": 170942,
    "UUID": "7D01BE0F-E149-4894-BC46-6193AE02A3AF",
    "DataProviderID": 1,
    "OperatorID": 3299,
    "UsageTypeID": 5,
    "UsageCost": "0,79 €/min",
    "AddressInfo": {
        "ID": 171301,
        "Title": "Ionity Saugon Ouest",
        "AddressLine1": "Aire de Saugon Ouest",
        "AddressLine2": "A10",
        "Town": "Saugon",
        "Postcode": "33920",
        "CountryID": 80,
        "Latitude": 45.188939,
        "Longitude": -0.492423,
        "DistanceUnit": 0
    },
    "Connections": [
        {
            "ID": 261161,
            "ConnectionTypeID": 33,
            "StatusTypeID": 50,
            "LevelID": 2,
            "PowerKW": 350
        },
        {
            "ID": 261162,
            "ConnectionTypeID": 33,
            "StatusTypeID": 50,
            "LevelID": 3,
            "PowerKW": 350,
            "CurrentTypeID": 30
        },
        {
            "ID": 261163,
            "ConnectionTypeID": 33,
            "StatusTypeID": 50,
            "LevelID": 3,
            "PowerKW": 350,
            "CurrentTypeID": 30
        },
        {
            "ID": 261164,
            "ConnectionTypeID": 33,
            "StatusTypeID": 50,
            "LevelID": 3,
            "PowerKW": 350,
            "CurrentTypeID": 30
        },
        {
            "ID": 268416,
            "ConnectionTypeID": 1036,
            "StatusTypeID": 50,
            "LevelID": 3,
            "PowerKW": 43,
            "CurrentTypeID": 20,
            "Quantity": 1
        },
        {
            "ID": 268417,
            "ConnectionTypeID": 33,
            "StatusTypeID": 50,
            "LevelID": 3,
            "PowerKW": 50,
            "CurrentTypeID": 30,
            "Quantity": 1
        },
        {
            "ID": 268418,
            "ConnectionTypeID": 2,
            "StatusTypeID": 50,
            "LevelID": 3,
            "PowerKW": 50,
            "CurrentTypeID": 30,
            "Quantity": 1
        }
    ],
    "NumberOfPoints": 5,
    "GeneralComments": "24/7",
    "StatusTypeID": 50,
    "DateLastStatusUpdate": "2021-03-10T21:09:00Z",
    "DataQualityLevel": 1,
    "DateCreated": "2020-12-12T13:35:00Z",
    "SubmissionStatusTypeID": 200
}