{
    "IsRecentlyVerified": false,
    "ID": 187242,
    "UUID": "C93F211A-AAD6-4BF8-8EF3-48AF0C891334",
    "DataProviderID": 29,
    "DataProvidersReference": "2896",
    "OperatorID": 220,
    "AddressInfo": {
        "ID": 187601,
        "Title": "Steilshooper Straße 260",
        "AddressLine1": "Steilshooper Straße 260",
        "Town": "Hamburg",
        "Postcode": "22309",
        "CountryID": 87,
        "Latitude": 53.60328,
        "Longitude": 10.05192,
        "DistanceUnit": 0
    },
    "Connections": [
        {
            "ID": 302002,
            "ConnectionTypeID": 28,
            "StatusTypeID": 50,
            "LevelID": 2,
            "PowerKW": 22,
            "CurrentTypeID": 20
        },
        {
            "ID": 302003,
            "ConnectionTypeID": 25,
            "StatusTypeID": 50,
            "LevelID": 2,
            "PowerKW": 22,
            "CurrentTypeID": 20
        },
        {
            "ID": 302004,
            "ConnectionTypeID": 28,
            "StatusTypeID": 50,
            "LevelID": 2,
            "PowerKW": 22,
            "CurrentTypeID": 20
        },
        {
            "ID": 302005,
            "ConnectionTypeID": 25,
            "StatusTypeID": 50,
            "LevelID": 2,
            "PowerKW": 22,
            "CurrentTypeID": 20
        }
    ],
    "StatusTypeID": 50,
    "DateLastStatusUpdate": "2021-07-12T02:51:00Z",
    "MetadataValues": [
        {
            "ID": 19482,
            "MetadataFieldID": 4,
            "ItemValue": "Data from the German chargepoint registry provided by Bundesnetzagentur.de under the CC-BY 4.0 license"
        }
    ],
    "DataQualityLevel": 3,
    "DateCreated": "2021-07-12T02:51:00Z",
    "SubmissionStatusTypeID": 100
}