{
    "IsRecentlyVerified": false,
    "ID": 95876,
    "UUID": "88FB6B5E-C036-4A61-9847-A3522D07CF35",
    "DataProviderID": 1,
    "OperatorID": 189,
    "UsageTypeID": 4,
    "AddressInfo": {
        "ID": 96222,
        "Title": "Kirchstraße",
        "AddressLine1": "Kirchstraße 1",
        "Town": "Lenggries",
        "StateOrProvince": "Landkreis Bad Tölz-Wolfratshausen",
        "Postcode": "83661",
        "CountryID": 87,
        "Latitude": 47.683856966907726,
        "Longitude": 11.576381457672147,
        "AccessComments": "24/7 nutzbar",
        "DistanceUnit": 0
    },
    "Connections": [
        {
            "ID": 135811,
            "ConnectionTypeID": 25,
            "StatusTypeID": 50,
            "LevelID": 2,
            "Amps": 32,
            "Voltage": 400,
            "PowerKW": 22,
            "CurrentTypeID": 20,
            "Quantity": 2
        }
    ],
    "NumberOfPoints": 2,
    "StatusTypeID": 50,
    "DateLastStatusUpdate": "2017-11-28T14:57:00Z",
    "DataQualityLevel": 1,
    "DateCreated": "2017-11-28T14:57:00Z",
    "SubmissionStatusTypeID": 200
}