{
    "IsRecentlyVerified": false,
    "ID": 128152,
    "UUID": "9F2DFB95-095E-4615-AC54-EBA4708DC3AB",
    "DataProviderID": 1,
    "OperatorID": 80,
    "UsageTypeID": 6,
    "UsageCost": "0,45€/h",
    "AddressInfo": {
        "ID": 128498,
        "Title": "Supergarage Italia | EnelX",
        "AddressLine1": "Via Pandosia, 21/a",
        "Town": "Roma",
        "StateOrProvince": "RM",
        "Postcode": "00183",
        "CountryID": 112,
        "Latitude": 41.8800510239988,
        "Longitude": 12.5044855950396,
        "RelatedURL": "https://www.enelx.com/it/it/emobility",
        "DistanceUnit": 0
    },
    "Connections": [
        {
            "ID": 179329,
            "ConnectionTypeID": 25,
            "StatusTypeID": 50,
            "LevelID": 2,
            "Amps": 32,
            "Voltage": 400,
            "PowerKW": 22,
            "CurrentTypeID": 20,
            "Quantity": 2
        }
    ],
    "NumberOfPoints": 2,
    "GeneralComments": "Parcheggio a pagamento Lun-Sab 6:30-1:30 Dom 6:30-11/18-1:30",
    "StatusTypeID": 50,
    "DateLastStatusUpdate": "2019-06-16T16:27:00Z",
    "DataQualityLevel": 1,
    "DateCreated": "2019-06-16T16:27:00Z",
    "SubmissionStatusTypeID": 200
}