{
    "IsRecentlyVerified": false,
    "ID": 99551,
    "UUID": "849784F3-F40F-46CA-803B-01130C147C14",
    "DataProviderID": 1,
    "OperatorID": 103,
    "UsageTypeID": 4,
    "AddressInfo": {
        "ID": 99897,
        "Title": "Autohaus Wegener",
        "AddressLine1": "Zossener Landstraße 12",
        "Town": "Ludwigsfelde",
        "StateOrProvince": "Landkreis Teltow-Fläming",
        "Postcode": "14974",
        "CountryID": 87,
        "Latitude": 52.2929311,
        "Longitude": 13.271841300000006,
        "RelatedURL": "http://www.stadtwerke-gotha.de/",
        "DistanceUnit": 0
    },
    "Connections": [
        {
            "ID": 140676,
            "ConnectionTypeID": 1036,
            "StatusTypeID": 50,
            "LevelID": 3,
            "Amps": 63,
            "Voltage": 400,
            "PowerKW": 43,
            "CurrentTypeID": 20,
            "Quantity": 1
        },
        {
            "ID": 140677,
            "ConnectionTypeID": 2,
            "StatusTypeID": 50,
            "LevelID": 3,
            "PowerKW": 50,
            "CurrentTypeID": 30,
            "Quantity": 1
        },
        {
            "ID": 140678,
            "ConnectionTypeID": 33,
            "StatusTypeID": 50,
            "LevelID": 3,
            "PowerKW": 50,
            "CurrentTypeID": 30,
            "Quantity": 1
        }
    ],
    "NumberOfPoints": 3,
    "GeneralComments": "24/7 nutzbar",
    "StatusTypeID": 50,
    "DateLastStatusUpdate": "2018-01-29T13:01:00Z",
    "DataQualityLevel": 1,
    "DateCreated": "2018-01-29T13:01:00Z",
    "SubmissionStatusTypeID": 200
}