{
    "UserComments": [
        {
            "ID": 17544,
            "ChargePointID": 88465,
            "CommentTypeID": 10,
            "UserName": "Simon Hewison",
            "Comment": "Does not accept Polar Instant RFID cards (and doesn't show up in their app either). Requires a Polar Plus RFID subscription.",
            "Rating": 2,
            "DateCreated": "2017-08-03T22:40:44.81Z",
            "User": {
                "ID": 4575,
                "Username": "Simon Hewison"
            },
            "CheckinStatusTypeID": 40
        }
    ],
    "MediaItems": [
        {
            "ID": 13090,
            "ChargePointID": 88465,
            "ItemURL": "https://s3-ap-southeast-2.amazonaws.com/openchargemap/images/GB/OCM88465/OCM-88465.orig.2017080307021189.jpg",
            "ItemThumbnailURL": "https://s3-ap-southeast-2.amazonaws.com/openchargemap/images/GB/OCM88465/OCM-88465.thmb.2017080307021189.jpg",
            "Comment": "",
            "IsEnabled": true,
            "IsVideo": false,
            "IsFeaturedItem": false,
            "IsExternalResource": false,
            "User": {
                "ID": 4575,
                "Username": "Simon Hewison"
            },
            "DateCreated": "2017-08-03T07:02:00Z"
        }
    ],
    "IsRecentlyVerified": false,
    "ID": 88465,
    "UUID": "E388E552-1071-4D4B-A03A-966337499DB0",
    "DataProviderID": 1,
    "OperatorID": 32,
    "OperatorsReference": "24051",
    "UsageTypeID": 4,
    "UsageCost": "£0.108/kWh; for Polar Plus subscription members only",
    "AddressInfo": {
        "ID": 88811,
        "Title": "Harvester Didcot",
        "AddressLine1": "Milton Heights Service Area",
        "AddressLine2": "Whins of Milton",
        "Town": "Didcot",
        "StateOrProvince": "Oxfordshire",
        "Postcode": "OX14 4TX",
        "CountryID": 1,
        "Latitude": 51.619331,
        "Longitude": -1.30084,
        "DistanceUnit": 0
    },
    "Connections": [
        {
            "ID": 125483,
            "ConnectionTypeID": 2,
            "StatusTypeID": 50,
            "LevelID": 3,
            "Amps": 125,
            "Voltage": 400,
            "PowerKW": 50,
            "CurrentTypeID": 30,
            "Quantity": 1
        },
        {
            "ID": 125484,
            "ConnectionTypeID": 33,
            "StatusTypeID": 50,
            "LevelID": 3,
            "Amps": 125,
            "Voltage": 400,
            "PowerKW": 50,
            "CurrentTypeID": 30,
            "Quantity": 1
        },
        {
            "ID": 125485,
            "ConnectionTypeID": 1036,
            "StatusTypeID": 50,
            "LevelID": 3,
            "Amps": 63,
            "Voltage": 400,
            "PowerKW": 43,
            "CurrentTypeID": 20,
            "Quantity": 1
        }
    ],
    "NumberOfPoints": 1,
    "StatusTypeID": 50,
    "DateLastStatusUpdate": "2019-06-20T05:20:00Z",
    "DataQualityLevel": 1,
    "DateCreated": "2017-05-30T13:49:00Z",
    "SubmissionStatusTypeID": 200
}