{
    "IsRecentlyVerified": false,
    "ID": 151094,
    "UUID": "90D15070-677B-48AE-8A4F-02515B84050E",
    "DataProviderID": 28,
    "DataProvidersReference": "FR*S13*P13076*001",
    "UsageTypeID": 5,
    "AddressInfo": {
        "ID": 151447,
        "Title": "PLAN-D'ORGON - Route De Cavaillon",
        "AddressLine1": "Route De Cavaillon 13750 PLAN-D'ORGON",
        "CountryID": 80,
        "Latitude": 43.809447,
        "Longitude": 4.998991,
        "AccessComments": "24h/24 7j/7",
        "DistanceUnit": 0
    },
    "Connections": [
        {
            "ID": 210698,
            "ConnectionTypeID": 28,
            "StatusTypeID": 50,
            "LevelID": 2,
            "PowerKW": 22,
            "CurrentTypeID": 10
        },
        {
            "ID": 210699,
            "ConnectionTypeID": 1036,
            "StatusTypeID": 50,
            "LevelID": 2,
            "PowerKW": 22,
            "CurrentTypeID": 20
        },
        {
            "ID": 240668,
            "ConnectionTypeID": 28,
            "StatusTypeID": 50,
            "LevelID": 2,
            "PowerKW": 22,
            "CurrentTypeID": 10
        },
        {
            "ID": 240669,
            "ConnectionTypeID": 1036,
            "StatusTypeID": 50,
            "LevelID": 2,
            "PowerKW": 22,
            "CurrentTypeID": 20
        }
    ],
    "GeneralComments": "Recharge par badge et avec une application smartphone",
    "StatusTypeID": 50,
    "DateLastStatusUpdate": "2020-08-27T05:11:00Z",
    "DataQualityLevel": 2,
    "DateCreated": "2020-03-15T06:18:00Z",
    "SubmissionStatusTypeID": 100
}