{
    "IsRecentlyVerified": false,
    "ID": 144232,
    "UUID": "5EB099B9-31EE-4762-8CBE-2834424A9D5F",
    "DataProviderID": 2,
    "DataProvidersReference": "118956",
    "UsageTypeID": 2,
    "AddressInfo": {
        "ID": 144584,
        "Title": "Lewis & Clark College - Fir Acres Parking Lot",
        "AddressLine1": "615 SW Palatine Hill Rd",
        "Town": "Lake Oswego",
        "StateOrProvince": "OR",
        "Postcode": "97219",
        "CountryID": 2,
        "Latitude": 45.4520974509695,
        "Longitude": -122.667599928558,
        "ContactTelephone1": "",
        "AccessComments": "For student and staff use only",
        "RelatedURL": "",
        "DistanceUnit": 0
    },
    "Connections": [
        {
            "ID": 200721,
            "ConnectionTypeID": 1,
            "LevelID": 2,
            "Amps": 16,
            "Voltage": 230,
            "PowerKW": 3.7,
            "CurrentTypeID": 10,
            "Quantity": 1
        }
    ],
    "StatusTypeID": 50,
    "DateLastStatusUpdate": "2020-06-26T03:09:00Z",
    "DataQualityLevel": 3,
    "DateCreated": "2019-12-24T09:23:00Z",
    "SubmissionStatusTypeID": 100
}