{
    "IsRecentlyVerified": false,
    "ID": 181125,
    "UUID": "7E4C3D83-C1E1-4FFF-9491-46A179CAE42C",
    "DataProviderID": 29,
    "DataProvidersReference": "11233,15899",
    "OperatorID": 44,
    "AddressInfo": {
        "ID": 181484,
        "Title": "Weststr. 16",
        "AddressLine1": "Weststr. 16",
        "Town": "Montabaur",
        "Postcode": "56410",
        "CountryID": 87,
        "Latitude": 50.442205,
        "Longitude": 7.789398,
        "DistanceUnit": 0
    },
    "Connections": [
        {
            "ID": 285056,
            "ConnectionTypeID": 25,
            "StatusTypeID": 50,
            "LevelID": 2,
            "PowerKW": 22,
            "CurrentTypeID": 20
        },
        {
            "ID": 285057,
            "ConnectionTypeID": 25,
            "StatusTypeID": 50,
            "LevelID": 2,
            "PowerKW": 22,
            "CurrentTypeID": 20
        }
    ],
    "StatusTypeID": 50,
    "DateLastStatusUpdate": "2021-07-09T03:19:00Z",
    "MetadataValues": [
        {
            "ID": 13419,
            "MetadataFieldID": 4,
            "ItemValue": "Data from the German chargepoint registry provided by Bundesnetzagentur.de under the CC-BY 4.0 license"
        }
    ],
    "DataQualityLevel": 3,
    "DateCreated": "2021-07-08T10:01:00Z",
    "SubmissionStatusTypeID": 100
}