{
    "IsRecentlyVerified": false,
    "ID": 143700,
    "UUID": "1AC7EBBD-B063-4620-8E8E-B382CD0E5271",
    "DataProviderID": 2,
    "DataProvidersReference": "121298",
    "OperatorID": 5,
    "UsageTypeID": 1,
    "AddressInfo": {
        "ID": 144052,
        "Title": "EVART",
        "AddressLine1": "112 S Main St",
        "Town": "Evart",
        "StateOrProvince": "MI",
        "Postcode": "49631",
        "CountryID": 2,
        "Latitude": 43.9002129,
        "Longitude": -85.2595422,
        "ContactTelephone1": "888-758-4389",
        "AccessComments": "24 hours daily",
        "RelatedURL": "http://www.chargepoint.com/",
        "DistanceUnit": 0
    },
    "Connections": [
        {
            "ID": 200085,
            "ConnectionTypeID": 1,
            "LevelID": 2,
            "Amps": 16,
            "Voltage": 230,
            "PowerKW": 3.7,
            "CurrentTypeID": 10,
            "Quantity": 1
        }
    ],
    "StatusTypeID": 50,
    "DateLastStatusUpdate": "2020-06-26T03:07:00Z",
    "DataQualityLevel": 3,
    "DateCreated": "2019-12-24T09:22:00Z",
    "SubmissionStatusTypeID": 100
}