{
    "IsRecentlyVerified": false,
    "ID": 179258,
    "UUID": "8599EA4A-E367-40F1-BDCA-604C34B9D68E",
    "DataProviderID": 29,
    "DataProvidersReference": "19078",
    "OperatorID": 234,
    "AddressInfo": {
        "ID": 179617,
        "Title": "Markgrafenstraße 4",
        "AddressLine1": "Markgrafenstraße 4",
        "Town": "Weidenbach-Triesdorf",
        "Postcode": "91746",
        "CountryID": 87,
        "Latitude": 49.202035,
        "Longitude": 10.651031,
        "DistanceUnit": 0
    },
    "Connections": [
        {
            "ID": 280815,
            "ConnectionTypeID": 25,
            "StatusTypeID": 50,
            "LevelID": 2,
            "PowerKW": 22,
            "CurrentTypeID": 20
        },
        {
            "ID": 280816,
            "ConnectionTypeID": 25,
            "StatusTypeID": 50,
            "LevelID": 2,
            "PowerKW": 22,
            "CurrentTypeID": 20
        }
    ],
    "StatusTypeID": 50,
    "DateLastStatusUpdate": "2021-07-09T03:15:00Z",
    "MetadataValues": [
        {
            "ID": 11552,
            "MetadataFieldID": 4,
            "ItemValue": "Data from the German chargepoint registry provided by Bundesnetzagentur.de under the CC-BY 4.0 license"
        }
    ],
    "DataQualityLevel": 3,
    "DateCreated": "2021-07-08T09:59:00Z",
    "SubmissionStatusTypeID": 100
}