{
    "IsRecentlyVerified": false,
    "ID": 45201,
    "UUID": "5FF24C3E-1FF8-46B5-9DE5-4AD137639EF8",
    "DataProviderID": 1,
    "OperatorID": 105,
    "UsageTypeID": 1,
    "UsageCost": "0",
    "AddressInfo": {
        "ID": 45547,
        "Title": "E-Bike Station Rathaus",
        "AddressLine1": "Am Rathaus 1",
        "Town": "Herzebrock",
        "Postcode": "33442",
        "CountryID": 87,
        "Latitude": 51.8841004,
        "Longitude": 8.23172739999995,
        "RelatedURL": "http://www.rwe.com/web/cms/de/494436/e-bikes-on-tour/ladestationen/",
        "DistanceUnit": 0
    },
    "Connections": [
        {
            "ID": 55718,
            "ConnectionTypeID": 28,
            "StatusTypeID": 50,
            "LevelID": 1,
            "Amps": 10,
            "Voltage": 230,
            "PowerKW": 2.3,
            "CurrentTypeID": 10,
            "Quantity": 3
        }
    ],
    "NumberOfPoints": 3,
    "StatusTypeID": 50,
    "DateLastStatusUpdate": "2015-04-28T16:06:00Z",
    "DataQualityLevel": 1,
    "DateCreated": "2015-04-28T08:26:00Z",
    "SubmissionStatusTypeID": 200
}