{
    "IsRecentlyVerified": false,
    "ID": 153472,
    "UUID": "D81741A1-656D-4C23-AD1C-26721B505893",
    "DataProviderID": 28,
    "DataProvidersReference": "FR*S56*P56066*A",
    "OperatorID": 3379,
    "UsageTypeID": 5,
    "AddressInfo": {
        "ID": 153825,
        "Title": "Place Général de Gaulle",
        "AddressLine1": "Place Général de Gaulle 56110 Gourin",
        "CountryID": 80,
        "Latitude": 48.141016,
        "Longitude": -3.600977,
        "AccessComments": "24/24 7/7 jours",
        "DistanceUnit": 0
    },
    "Connections": [
        {
            "ID": 215328,
            "ConnectionTypeID": 1036,
            "StatusTypeID": 50,
            "LevelID": 2,
            "PowerKW": 22,
            "CurrentTypeID": 20
        },
        {
            "ID": 215329,
            "ConnectionTypeID": 33,
            "StatusTypeID": 50,
            "LevelID": 3,
            "PowerKW": 20,
            "CurrentTypeID": 30
        },
        {
            "ID": 248773,
            "ConnectionTypeID": 1036,
            "StatusTypeID": 50,
            "LevelID": 2,
            "PowerKW": 22,
            "CurrentTypeID": 20
        }
    ],
    "GeneralComments": "Recharge Gratuite",
    "StatusTypeID": 50,
    "DateLastStatusUpdate": "2020-08-27T05:14:00Z",
    "DataQualityLevel": 2,
    "DateCreated": "2020-03-15T10:54:00Z",
    "SubmissionStatusTypeID": 100
}