{
    "IsRecentlyVerified": false,
    "ID": 159344,
    "UUID": "9EDA6701-1001-4960-BF50-4C5FA490DFB6",
    "DataProviderID": 2,
    "DataProvidersReference": "158503",
    "OperatorID": 39,
    "UsageTypeID": 1,
    "AddressInfo": {
        "ID": 159701,
        "Title": "SemaConnect US HQ",
        "AddressLine1": "4961 Tesla Dr",
        "Town": "Bowie",
        "StateOrProvince": "MD",
        "Postcode": "20715",
        "CountryID": 2,
        "Latitude": 38.9570814,
        "Longitude": -76.7077064,
        "ContactTelephone1": "800-663-5633",
        "AccessComments": "MO: 12:00am-06:00pm; TU: 12:00am-12:00am; WE: 12:00am-12:00am; TH: 12:00am-12:00am; FR: 12:00am-12:00am; SA: 12:00am-12:00am; SU: 06:00am-07:00pm",
        "RelatedURL": "http://www.semacharge.com/",
        "DistanceUnit": 0
    },
    "Connections": [
        {
            "ID": 229496,
            "ConnectionTypeID": 1,
            "LevelID": 2,
            "Amps": 16,
            "Voltage": 230,
            "PowerKW": 3.7,
            "CurrentTypeID": 10,
            "Quantity": 3
        }
    ],
    "StatusTypeID": 50,
    "DateLastStatusUpdate": "2020-06-26T03:00:00Z",
    "DataQualityLevel": 3,
    "DateCreated": "2020-06-26T03:00:00Z",
    "SubmissionStatusTypeID": 100
}