{
    "IsRecentlyVerified": false,
    "ID": 107765,
    "UUID": "AE4E3CD0-BC29-4520-AE7C-7DEA4AB09AAA",
    "DataProviderID": 1,
    "OperatorID": 32,
    "OperatorsReference": "10913,24260",
    "UsageTypeID": 4,
    "UsageCost": "£0.108/kWh; for Polar Plus subscription members only",
    "AddressInfo": {
        "ID": 108111,
        "Title": "China Fleet Country Club",
        "AddressLine1": "China Fleet Country Club",
        "Town": "Saltash",
        "StateOrProvince": "Cornwall",
        "Postcode": "PL12 6LJ",
        "CountryID": 1,
        "Latitude": 50.422401,
        "Longitude": -4.2133,
        "DistanceUnit": 0
    },
    "Connections": [
        {
            "ID": 152166,
            "ConnectionTypeID": 33,
            "StatusTypeID": 50,
            "LevelID": 3,
            "PowerKW": 50,
            "CurrentTypeID": 30,
            "Quantity": 1
        },
        {
            "ID": 152167,
            "ConnectionTypeID": 2,
            "StatusTypeID": 50,
            "LevelID": 3,
            "PowerKW": 50,
            "CurrentTypeID": 30,
            "Quantity": 1
        },
        {
            "ID": 152168,
            "ConnectionTypeID": 1036,
            "StatusTypeID": 50,
            "LevelID": 3,
            "PowerKW": 43,
            "CurrentTypeID": 20,
            "Quantity": 1
        },
        {
            "ID": 166506,
            "ConnectionTypeID": 25,
            "StatusTypeID": 50,
            "LevelID": 2,
            "Amps": 32,
            "Voltage": 230,
            "PowerKW": 7,
            "CurrentTypeID": 10,
            "Quantity": 2
        }
    ],
    "NumberOfPoints": 2,
    "GeneralComments": "Customer car park.",
    "StatusTypeID": 50,
    "DateLastStatusUpdate": "2019-06-21T05:19:00Z",
    "DataQualityLevel": 1,
    "DateCreated": "2018-08-09T05:16:00Z",
    "SubmissionStatusTypeID": 200
}