{
    "IsRecentlyVerified": false,
    "ID": 97391,
    "UUID": "5F130350-1F28-402E-8498-B3648FD6B584",
    "DataProviderID": 1,
    "OperatorID": 23,
    "OperatorsReference": "38737",
    "UsageTypeID": 4,
    "AddressInfo": {
        "ID": 97737,
        "Title": "250 Main Hotel",
        "AddressLine1": "250 Main St",
        "Town": "Rockland",
        "StateOrProvince": "Maine",
        "Postcode": "04841",
        "CountryID": 2,
        "Latitude": 44.10102,
        "Longitude": -69.109375,
        "ContactTelephone1": "(207) 594-5994",
        "DistanceUnit": 0
    },
    "Connections": [
        {
            "ID": 138298,
            "ConnectionTypeID": 30,
            "StatusTypeID": 50,
            "LevelID": 2,
            "PowerKW": 16,
            "CurrentTypeID": 20,
            "Quantity": 2
        }
    ],
    "NumberOfPoints": 2,
    "GeneralComments": "2 Tesla Connectors, up to 16kW.Available for customers. Please see front desk.",
    "StatusTypeID": 50,
    "DateLastStatusUpdate": "2018-01-21T15:18:00Z",
    "DataQualityLevel": 1,
    "DateCreated": "2018-01-21T15:18:00Z",
    "SubmissionStatusTypeID": 200
}