{
    "IsRecentlyVerified": false,
    "ID": 153451,
    "UUID": "B8A87952-9472-4E70-A6CC-A133C0F02B41",
    "DataProviderID": 28,
    "DataProvidersReference": "FR*S56*P56100*A",
    "OperatorID": 3379,
    "UsageTypeID": 5,
    "AddressInfo": {
        "ID": 153804,
        "Title": "Place Morvan Leiz Breizh",
        "AddressLine1": "Place Morvan Leiz Breizh 56630 Langonnet",
        "CountryID": 80,
        "Latitude": 48.103788,
        "Longitude": -3.491434,
        "AccessComments": "24/24 7/7 jours",
        "DistanceUnit": 0
    },
    "Connections": [
        {
            "ID": 215285,
            "ConnectionTypeID": 25,
            "StatusTypeID": 50,
            "LevelID": 2,
            "PowerKW": 18,
            "CurrentTypeID": 20
        },
        {
            "ID": 215286,
            "ConnectionTypeID": 28,
            "StatusTypeID": 50,
            "LevelID": 2,
            "PowerKW": 18,
            "CurrentTypeID": 10
        },
        {
            "ID": 248721,
            "ConnectionTypeID": 25,
            "StatusTypeID": 50,
            "LevelID": 2,
            "PowerKW": 18,
            "CurrentTypeID": 20
        },
        {
            "ID": 248722,
            "ConnectionTypeID": 28,
            "StatusTypeID": 50,
            "LevelID": 2,
            "PowerKW": 18,
            "CurrentTypeID": 10
        }
    ],
    "GeneralComments": "Tarif abonné Morbihan Energies: 18€ ttc/an, puis 0,25€ ttc/kWh consommé. Non abonné: 2€ ttc/charge (3€ sur bornes rapides), puis 0,25€ ttc/kWh consommé. Pénalités applicables au temps si branchement > 6 heures (2 heures sur bornes rapides) : 5€ ttc/heure",
    "StatusTypeID": 50,
    "DateLastStatusUpdate": "2020-08-27T05:14:00Z",
    "DataQualityLevel": 2,
    "DateCreated": "2020-03-15T10:54:00Z",
    "SubmissionStatusTypeID": 100
}