{
    "IsRecentlyVerified": false,
    "ID": 13722,
    "UUID": "A4CC6C4F-5CAE-4130-8881-78968AE378BB",
    "DataProviderID": 1,
    "OperatorID": 19,
    "UsageTypeID": 1,
    "AddressInfo": {
        "ID": 13619,
        "Title": "Hackings Caravan Park",
        "AddressLine1": "Elker Lane",
        "AddressLine2": "Billington",
        "Town": "Clitheroe",
        "StateOrProvince": "Lancashire",
        "Postcode": "BB7 9HZ",
        "CountryID": 1,
        "Latitude": 53.822257,
        "Longitude": -2.43171,
        "ContactTelephone1": "01254 822680",
        "ContactEmail": "wendyhacking@btconnect.com",
        "AccessComments": "Charging availability from 08.00 to 17.00",
        "RelatedURL": "http://www.hackingscaravanpark.co.uk",
        "DistanceUnit": 0
    },
    "Connections": [
        {
            "ID": 11171,
            "ConnectionTypeID": 25,
            "StatusTypeID": 50,
            "LevelID": 2,
            "Amps": 32,
            "Voltage": 230,
            "PowerKW": 7,
            "CurrentTypeID": 20,
            "Quantity": 1
        },
        {
            "ID": 11172,
            "ConnectionTypeID": 3,
            "StatusTypeID": 50,
            "LevelID": 2,
            "Amps": 13,
            "Voltage": 230,
            "PowerKW": 3,
            "CurrentTypeID": 10,
            "Quantity": 1
        }
    ],
    "NumberOfPoints": 2,
    "StatusTypeID": 50,
    "DateLastStatusUpdate": "2017-04-21T17:07:00Z",
    "DataQualityLevel": 1,
    "DateCreated": "2012-12-04T08:21:00Z",
    "SubmissionStatusTypeID": 200
}