{
    "IsRecentlyVerified": false,
    "ID": 87282,
    "UUID": "8D46D6F6-AF23-41B6-885C-3B7AACF690E2",
    "DataProviderID": 1,
    "OperatorID": 45,
    "UsageTypeID": 6,
    "AddressInfo": {
        "ID": 87628,
        "Title": "KTC Königstein",
        "AddressLine1": "Ölmühlweg 65",
        "Town": "Königstein",
        "StateOrProvince": "Hochtaunuskreis",
        "Postcode": "61462",
        "CountryID": 87,
        "Latitude": 50.18636909874752,
        "Longitude": 8.441602181475906,
        "AccessComments": "Eine durchgehend nutzbare Schukodose für Gäste des Kommunikations- und Trainings-Centers",
        "RelatedURL": "http://www.ktc-koenigstein.com/",
        "DistanceUnit": 0
    },
    "Connections": [
        {
            "ID": 123718,
            "ConnectionTypeID": 28,
            "StatusTypeID": 50,
            "LevelID": 2,
            "Amps": 16,
            "Voltage": 230,
            "PowerKW": 3.7,
            "CurrentTypeID": 10,
            "Quantity": 1
        }
    ],
    "NumberOfPoints": 1,
    "StatusTypeID": 50,
    "DateLastStatusUpdate": "2017-05-03T05:47:00Z",
    "DataQualityLevel": 1,
    "DateCreated": "2017-05-03T05:47:00Z",
    "SubmissionStatusTypeID": 200
}