{
    "IsRecentlyVerified": false,
    "ID": 186913,
    "UUID": "129DA382-92EA-47C9-9159-A40935B5FF67",
    "DataProviderID": 29,
    "DataProvidersReference": "6846",
    "OperatorID": 105,
    "AddressInfo": {
        "ID": 187272,
        "Title": "Lange Straße 9",
        "AddressLine1": "Lange Straße 9",
        "Town": "Rahden",
        "Postcode": "32369",
        "CountryID": 87,
        "Latitude": 52.434264,
        "Longitude": 8.611866,
        "DistanceUnit": 0
    },
    "Connections": [
        {
            "ID": 300562,
            "ConnectionTypeID": 25,
            "StatusTypeID": 50,
            "LevelID": 2,
            "PowerKW": 22,
            "CurrentTypeID": 20
        },
        {
            "ID": 300563,
            "ConnectionTypeID": 25,
            "StatusTypeID": 50,
            "LevelID": 2,
            "PowerKW": 22,
            "CurrentTypeID": 20
        }
    ],
    "StatusTypeID": 50,
    "DateLastStatusUpdate": "2021-07-12T02:49:00Z",
    "MetadataValues": [
        {
            "ID": 19153,
            "MetadataFieldID": 4,
            "ItemValue": "Data from the German chargepoint registry provided by Bundesnetzagentur.de under the CC-BY 4.0 license"
        }
    ],
    "DataQualityLevel": 3,
    "DateCreated": "2021-07-12T02:49:00Z",
    "SubmissionStatusTypeID": 100
}