{
    "IsRecentlyVerified": false,
    "ID": 117973,
    "UUID": "964073BA-E2C2-4CFC-A31C-0D909C15BE5B",
    "DataProviderID": 1,
    "OperatorID": 23,
    "OperatorsReference": "49009",
    "UsageTypeID": 4,
    "AddressInfo": {
        "ID": 118319,
        "Title": "Rise By Elevation",
        "AddressLine1": "2200 Freeway BLVD",
        "Town": "Minneapolis",
        "StateOrProvince": "Minnesota",
        "Postcode": "55430",
        "CountryID": 2,
        "Latitude": 45.074457,
        "Longitude": -93.309125,
        "ContactTelephone1": "(763) 566-8000",
        "DistanceUnit": 0
    },
    "Connections": [
        {
            "ID": 166992,
            "ConnectionTypeID": 30,
            "StatusTypeID": 50,
            "LevelID": 2,
            "PowerKW": 16,
            "CurrentTypeID": 20,
            "Quantity": 4
        }
    ],
    "NumberOfPoints": 4,
    "GeneralComments": "4 Tesla Connectors, up to 16kW.Available for customers. Self park.",
    "StatusTypeID": 50,
    "DateLastStatusUpdate": "2019-03-14T23:06:00Z",
    "DataQualityLevel": 1,
    "DateCreated": "2019-03-14T23:06:00Z",
    "SubmissionStatusTypeID": 200
}