{
    "IsRecentlyVerified": false,
    "ID": 90946,
    "UUID": "D6E4E128-AF12-4C81-B353-60D2FDA5C812",
    "DataProviderID": 1,
    "OperatorID": 23,
    "OperatorsReference": "32290",
    "UsageTypeID": 7,
    "AddressInfo": {
        "ID": 91292,
        "Title": "Hotel Gran Paradiso",
        "AddressLine1": "Str. Pre de Vi",
        "Town": "11",
        "StateOrProvince": "St. Kassian",
        "Postcode": "39036",
        "CountryID": 112,
        "Latitude": 46.562736,
        "Longitude": 11.951138,
        "ContactTelephone1": "+39 0471 849 424",
        "DistanceUnit": 0
    },
    "Connections": [
        {
            "ID": 129001,
            "ConnectionTypeID": 30,
            "StatusTypeID": 50,
            "LevelID": 2,
            "Amps": 16,
            "Voltage": 400,
            "PowerKW": 11,
            "CurrentTypeID": 20,
            "Quantity": 1
        }
    ],
    "NumberOfPoints": 1,
    "GeneralComments": "1 Tesla Connector, up to 11kW.Available by reservation only. Please call ahead.",
    "StatusTypeID": 50,
    "DateLastStatusUpdate": "2018-10-03T23:07:00Z",
    "DataQualityLevel": 1,
    "DateCreated": "2017-07-28T05:29:00Z",
    "SubmissionStatusTypeID": 200
}