{
    "IsRecentlyVerified": false,
    "ID": 41565,
    "UUID": "BCCBFD00-C5DA-4331-87A6-92B37CE9DA78",
    "DataProviderID": 26,
    "DataProvidersReference": "59368",
    "OperatorID": 35,
    "OperatorsReference": "ThePluginCompany 900000016",
    "UsageCost": "0.00 afhankelijk van pas",
    "AddressInfo": {
        "ID": 41911,
        "Title": "N3i",
        "AddressLine1": "N3i",
        "Town": "Awans",
        "Postcode": "4340",
        "CountryID": 26,
        "Latitude": 50.680791,
        "Longitude": 5.461968,
        "RelatedURL": "http://www.theplugincompany.com",
        "DistanceUnit": 0
    },
    "Connections": [
        {
            "ID": 45488,
            "ConnectionTypeID": 25,
            "LevelID": 2,
            "PowerKW": 11,
            "CurrentTypeID": 10
        },
        {
            "ID": 45489,
            "ConnectionTypeID": 25,
            "LevelID": 2,
            "PowerKW": 11,
            "CurrentTypeID": 10
        },
        {
            "ID": 45490,
            "ConnectionTypeID": 25,
            "LevelID": 2,
            "PowerKW": 11,
            "CurrentTypeID": 10
        },
        {
            "ID": 45491,
            "ConnectionTypeID": 25,
            "LevelID": 2,
            "PowerKW": 11,
            "CurrentTypeID": 10
        }
    ],
    "NumberOfPoints": 1,
    "StatusTypeID": 50,
    "DateLastStatusUpdate": "2016-06-04T02:38:00Z",
    "DataQualityLevel": 3,
    "DateCreated": "2015-02-09T03:25:00Z",
    "SubmissionStatusTypeID": 100
}