{
    "IsRecentlyVerified": false,
    "ID": 113537,
    "UUID": "6445447F-D692-434D-A1D3-4E8E60E5C401",
    "DataProviderID": 1,
    "OperatorID": 45,
    "UsageTypeID": 1,
    "AddressInfo": {
        "ID": 113883,
        "Title": "ON Mosfellsbær",
        "AddressLine1": "Háholti 2",
        "Town": "Mosfellsbær",
        "Postcode": "270",
        "CountryID": 105,
        "Latitude": 64.166187,
        "Longitude": -21.69611199999997,
        "DistanceUnit": 0
    },
    "Connections": [
        {
            "ID": 159978,
            "ConnectionTypeID": 2,
            "StatusTypeID": 50,
            "LevelID": 3,
            "PowerKW": 50,
            "CurrentTypeID": 30
        },
        {
            "ID": 159979,
            "ConnectionTypeID": 33,
            "StatusTypeID": 50,
            "LevelID": 3,
            "PowerKW": 50,
            "CurrentTypeID": 30
        },
        {
            "ID": 159980,
            "ConnectionTypeID": 1036,
            "StatusTypeID": 50,
            "LevelID": 3,
            "Voltage": 400,
            "PowerKW": 44,
            "CurrentTypeID": 20
        }
    ],
    "NumberOfPoints": 1,
    "StatusTypeID": 50,
    "DateLastStatusUpdate": "2018-12-20T13:00:00Z",
    "DataQualityLevel": 1,
    "DateCreated": "2018-12-18T11:27:00Z",
    "SubmissionStatusTypeID": 200
}