{
    "IsRecentlyVerified": false,
    "ID": 8271,
    "UUID": "F28D6AC6-A794-4A04-BF55-D99DB4B42108",
    "DataProviderID": 15,
    "DataProvidersReference": "2732",
    "OperatorID": 5,
    "UsageTypeID": 1,
    "AddressInfo": {
        "ID": 8168,
        "Title": "3850 Vitruvian Way",
        "AddressLine1": "3850 Vitruvian Way",
        "Town": "Addison",
        "StateOrProvince": "Texas",
        "Postcode": "75001",
        "CountryID": 2,
        "Latitude": 32.93490982,
        "Longitude": -96.85197449,
        "ContactTelephone1": "888-758-4389 ",
        "RelatedURL": "http://carstations.com/2732",
        "DistanceUnit": 0
    },
    "Connections": [
        {
            "ID": 5700,
            "ConnectionTypeID": 9,
            "Reference": "NEMA5",
            "LevelID": 1
        },
        {
            "ID": 6199,
            "ConnectionTypeID": 1,
            "Reference": "J1772",
            "LevelID": 2,
            "Quantity": 1
        }
    ],
    "NumberOfPoints": 3,
    "StatusTypeID": 0,
    "DateLastStatusUpdate": "2017-11-04T14:04:00Z",
    "DataQualityLevel": 1,
    "DateCreated": "2011-11-11T12:06:00Z",
    "SubmissionStatusTypeID": 100
}