{
    "IsRecentlyVerified": false,
    "ID": 135208,
    "UUID": "1D0CF7FF-B79F-4C46-BEB9-976E62100BEA",
    "DataProviderID": 1,
    "OperatorID": 3266,
    "UsageTypeID": 4,
    "UsageCost": "0,35€/kWh (8-22Uhr: +0,02€/min)",
    "AddressInfo": {
        "ID": 135554,
        "Title": "Einkaufszentrum Möbel hesse",
        "AddressLine1": "Robert-Hesse-Straße 5",
        "Town": "Garbsen",
        "StateOrProvince": "Region Hannover",
        "Postcode": "30827",
        "CountryID": 87,
        "Latitude": 52.427828624511676,
        "Longitude": 9.6234195461127,
        "RelatedURL": "http://www.enercity-contracting.de/alternative-antriebe/elektromobilitaet/ladesaeulen/index.html",
        "DistanceUnit": 0
    },
    "Connections": [
        {
            "ID": 189309,
            "ConnectionTypeID": 25,
            "StatusTypeID": 50,
            "LevelID": 2,
            "Amps": 32,
            "Voltage": 400,
            "PowerKW": 22,
            "CurrentTypeID": 20,
            "Quantity": 2
        }
    ],
    "NumberOfPoints": 2,
    "GeneralComments": "Ladesäule direkt an der Einfahrt zum Parkplatz zu Möbel Hesse. 24/7 verfügbar; Freischaltung mit PlugSurfing App oder Keyhanger. Betreiber sind sind Stadtwerke EnerCity.",
    "StatusTypeID": 50,
    "DateLastStatusUpdate": "2019-12-11T14:37:00Z",
    "DataQualityLevel": 1,
    "DateCreated": "2019-12-11T14:37:00Z",
    "SubmissionStatusTypeID": 200
}