{
    "UserComments": [
        {
            "ID": 22374,
            "ChargePointID": 129408,
            "CommentTypeID": 10,
            "UserName": "ForumElettrico.it",
            "Comment": "Rinchiuse in un parcheggio a pagamento che per i primi 15 minuti pare che sia gratuito. Leggi la recensione completa qui > https://www.forumelettrico.it/forum/colonnine-22kw-parcheggio-stazione-pistoia-t6578.html",
            "RelatedURL": "https://www.forumelettrico.it/forum/colonnine-22kw-parcheggio-stazione-pistoia-t6578.html",
            "DateCreated": "2020-04-02T17:09:39.253Z",
            "User": {
                "ID": 11749,
                "Username": "ForumElettrico.it"
            },
            "CheckinStatusTypeID": 10,
            "IsActionedByEditor": false
        }
    ],
    "MediaItems": [
        {
            "ID": 21807,
            "ChargePointID": 129408,
            "ItemURL": "https://s3-ap-southeast-2.amazonaws.com/openchargemap/images/IT/OCM129408/OCM-129408.orig.2020040217095191.jpg",
            "ItemThumbnailURL": "https://s3-ap-southeast-2.amazonaws.com/openchargemap/images/IT/OCM129408/OCM-129408.thmb.2020040217095191.jpg",
            "Comment": "",
            "IsEnabled": true,
            "IsVideo": false,
            "IsFeaturedItem": false,
            "IsExternalResource": false,
            "User": {
                "ID": 11749,
                "Username": "ForumElettrico.it"
            },
            "DateCreated": "2020-04-02T17:10:00Z"
        },
        {
            "ID": 21808,
            "ChargePointID": 129408,
            "ItemURL": "https://s3-ap-southeast-2.amazonaws.com/openchargemap/images/IT/OCM129408/OCM-129408.orig.2020040217095737.jpg",
            "ItemThumbnailURL": "https://s3-ap-southeast-2.amazonaws.com/openchargemap/images/IT/OCM129408/OCM-129408.thmb.2020040217095737.jpg",
            "Comment": "",
            "IsEnabled": true,
            "IsVideo": false,
            "IsFeaturedItem": false,
            "IsExternalResource": false,
            "User": {
                "ID": 11749,
                "Username": "ForumElettrico.it"
            },
            "DateCreated": "2020-04-02T17:10:00Z"
        },
        {
            "ID": 21809,
            "ChargePointID": 129408,
            "ItemURL": "https://s3-ap-southeast-2.amazonaws.com/openchargemap/images/IT/OCM129408/OCM-129408.orig.2020040217100452.jpg",
            "ItemThumbnailURL": "https://s3-ap-southeast-2.amazonaws.com/openchargemap/images/IT/OCM129408/OCM-129408.thmb.2020040217100452.jpg",
            "Comment": "",
            "IsEnabled": true,
            "IsVideo": false,
            "IsFeaturedItem": false,
            "IsExternalResource": false,
            "User": {
                "ID": 11749,
                "Username": "ForumElettrico.it"
            },
            "DateCreated": "2020-04-02T17:10:00Z"
        },
        {
            "ID": 21810,
            "ChargePointID": 129408,
            "ItemURL": "https://s3-ap-southeast-2.amazonaws.com/openchargemap/images/IT/OCM129408/OCM-129408.orig.2020040217101183.jpg",
            "ItemThumbnailURL": "https://s3-ap-southeast-2.amazonaws.com/openchargemap/images/IT/OCM129408/OCM-129408.thmb.2020040217101183.jpg",
            "Comment": "",
            "IsEnabled": true,
            "IsVideo": false,
            "IsFeaturedItem": false,
            "IsExternalResource": false,
            "User": {
                "ID": 11749,
                "Username": "ForumElettrico.it"
            },
            "DateCreated": "2020-04-02T17:10:00Z"
        }
    ],
    "IsRecentlyVerified": false,
    "ID": 129408,
    "UUID": "BC6CA066-C4D1-45B6-947A-1D0A99734FE4",
    "DataProviderID": 1,
    "OperatorID": 80,
    "UsageTypeID": 4,
    "AddressInfo": {
        "ID": 129754,
        "Title": "Parcheggio Stazione di Pistoia | EnelX",
        "AddressLine1": "Viale Vittorio Veneto",
        "Town": "Pistoia",
        "StateOrProvince": "PT",
        "Postcode": "51100",
        "CountryID": 112,
        "Latitude": 43.92718658988136,
        "Longitude": 10.91645748189785,
        "RelatedURL": "https://www.enelx.com/it/it/emobility",
        "DistanceUnit": 0
    },
    "Connections": [
        {
            "ID": 181109,
            "ConnectionTypeID": 25,
            "StatusTypeID": 50,
            "LevelID": 2,
            "Amps": 32,
            "Voltage": 400,
            "PowerKW": 22,
            "CurrentTypeID": 20,
            "Quantity": 3
        },
        {
            "ID": 181110,
            "ConnectionTypeID": 36,
            "StatusTypeID": 50,
            "LevelID": 2,
            "Amps": 16,
            "Voltage": 240,
            "PowerKW": 3.7,
            "CurrentTypeID": 10,
            "Quantity": 1
        }
    ],
    "NumberOfPoints": 4,
    "GeneralComments": "Parcheggio pubblico a pagamento\r\nhttp://www.metropark.it/content/metropark/it/parcheggi/parcheggi-per-regione/toscana/parcheggio-p2-di-pistoia.html",
    "StatusTypeID": 50,
    "DateLastStatusUpdate": "2020-04-02T17:10:00Z",
    "DataQualityLevel": 1,
    "DateCreated": "2019-07-19T13:14:00Z",
    "SubmissionStatusTypeID": 200
}