{
    "IsRecentlyVerified": false,
    "ID": 5064,
    "UUID": "2EAAF704-FB4E-4580-ABE1-C71F3D7BBCA2",
    "DataProviderID": 2,
    "DataProvidersReference": "40382",
    "UsageTypeID": 7,
    "AddressInfo": {
        "ID": 5004,
        "Title": "Hyman Brothers Nissan",
        "AddressLine1": "11841 Midlothian Turnpike",
        "Town": "Midlothian",
        "StateOrProvince": "VA",
        "Postcode": "23113",
        "CountryID": 2,
        "Latitude": 37.50418,
        "Longitude": -77.61949,
        "ContactTelephone1": "804-378-3000",
        "AccessComments": "Dealership business hours",
        "RelatedURL": "",
        "DistanceUnit": 0
    },
    "Connections": [
        {
            "ID": 2931,
            "ConnectionTypeID": 1,
            "LevelID": 2,
            "Amps": 16,
            "Voltage": 230,
            "PowerKW": 3,
            "CurrentTypeID": 10,
            "Quantity": 2
        },
        {
            "ID": 21056,
            "ConnectionTypeID": 2,
            "LevelID": 2,
            "Amps": 100,
            "Voltage": 400,
            "PowerKW": 40,
            "CurrentTypeID": 10,
            "Quantity": 1
        }
    ],
    "DateLastConfirmed": "2011-06-30T00:00:00Z",
    "StatusTypeID": 0,
    "DateLastStatusUpdate": "2019-04-06T04:02:00Z",
    "DataQualityLevel": 1,
    "DateCreated": "2011-07-27T11:31:00Z",
    "SubmissionStatusTypeID": 100
}