{
    "IsRecentlyVerified": false,
    "ID": 63712,
    "UUID": "15A1CC74-9511-43DB-A5B2-F521AF425E85",
    "DataProviderID": 26,
    "DataProvidersReference": "82587",
    "OperatorID": 73,
    "OperatorsReference": "EV-Box EVB-P1409092",
    "UsageCost": "0.00 jaarabonnement",
    "AddressInfo": {
        "ID": 64058,
        "Title": "De Stuwdam 45",
        "AddressLine1": "De Stuwdam 45",
        "Town": "Amersfoort",
        "Postcode": "3815 KM",
        "CountryID": 159,
        "Latitude": 52.16861,
        "Longitude": 5.43017,
        "RelatedURL": "http://www.ev-box.nl",
        "DistanceUnit": 0
    },
    "Connections": [
        {
            "ID": 81350,
            "ConnectionTypeID": 25,
            "LevelID": 2,
            "PowerKW": 5,
            "CurrentTypeID": 10
        }
    ],
    "NumberOfPoints": 1,
    "StatusTypeID": 50,
    "DateLastStatusUpdate": "2016-06-04T02:51:00Z",
    "DataQualityLevel": 3,
    "DateCreated": "2016-03-03T12:31:00Z",
    "SubmissionStatusTypeID": 100
}