{
    "IsRecentlyVerified": false,
    "ID": 179037,
    "UUID": "A8AF5C4F-3231-4D96-B9A8-144405F25687",
    "DataProviderID": 29,
    "DataProvidersReference": "14575",
    "AddressInfo": {
        "ID": 179396,
        "Title": "Oppersdorfer Straße 3",
        "AddressLine1": "Oppersdorfer Straße 3",
        "Town": "Lappersdorf",
        "Postcode": "93138",
        "CountryID": 87,
        "Latitude": 49.05076,
        "Longitude": 12.09116,
        "DistanceUnit": 0
    },
    "Connections": [
        {
            "ID": 280271,
            "ConnectionTypeID": 25,
            "StatusTypeID": 50,
            "LevelID": 2,
            "PowerKW": 22,
            "CurrentTypeID": 20
        },
        {
            "ID": 280272,
            "ConnectionTypeID": 25,
            "StatusTypeID": 50,
            "LevelID": 2,
            "PowerKW": 22,
            "CurrentTypeID": 20
        }
    ],
    "StatusTypeID": 50,
    "DateLastStatusUpdate": "2021-07-09T03:14:00Z",
    "MetadataValues": [
        {
            "ID": 11331,
            "MetadataFieldID": 4,
            "ItemValue": "Data from the German chargepoint registry provided by Bundesnetzagentur.de under the CC-BY 4.0 license"
        }
    ],
    "DataQualityLevel": 3,
    "DateCreated": "2021-07-08T09:59:00Z",
    "SubmissionStatusTypeID": 100
}