{
    "IsRecentlyVerified": false,
    "ID": 18914,
    "UUID": "EA955A28-A7D1-4F52-9963-27773A2E3E2F",
    "DataProviderID": 1,
    "OperatorID": 22,
    "OperatorsReference": "C6QDV",
    "UsageTypeID": 4,
    "UsageCost": "Free",
    "AddressInfo": {
        "ID": 19259,
        "Title": "The Square",
        "AddressLine1": "Castletownbere",
        "Town": "Cork",
        "StateOrProvince": "County Cork",
        "CountryID": 3,
        "Latitude": 51.650662,
        "Longitude": -9.910673,
        "DistanceUnit": 0
    },
    "Connections": [
        {
            "ID": 19169,
            "ConnectionTypeID": 25,
            "StatusTypeID": 50,
            "LevelID": 2,
            "Amps": 32,
            "Voltage": 400,
            "PowerKW": 22,
            "CurrentTypeID": 20,
            "Quantity": 2
        }
    ],
    "NumberOfPoints": 2,
    "StatusTypeID": 50,
    "DateLastStatusUpdate": "2019-06-09T05:37:00Z",
    "DataQualityLevel": 2,
    "DateCreated": "2013-08-29T02:48:00Z",
    "SubmissionStatusTypeID": 200
}