{
    "IsRecentlyVerified": false,
    "ID": 167124,
    "UUID": "ADF66A40-7B68-46AC-B375-59833C74F579",
    "DataProviderID": 1,
    "OperatorID": 150,
    "UsageTypeID": 4,
    "UsageCost": "completely free to use until 29th October 2021.",
    "AddressInfo": {
        "ID": 167483,
        "Title": "Exhibition Road Car Park",
        "AddressLine1": "Exhibition Road",
        "Town": "Shipley",
        "StateOrProvince": "West Yorkshire",
        "Postcode": "BD18 3JW",
        "CountryID": 1,
        "Latitude": 53.836469,
        "Longitude": -1.788719,
        "ContactTelephone1": "0333 666 0059",
        "AccessComments": "£10 overstay fee after 75 mins, then £10 every subsequent 75 mins.",
        "RelatedURL": "https://ev.engie.co.uk/",
        "DistanceUnit": 0
    },
    "Connections": [
        {
            "ID": 253078,
            "ConnectionTypeID": 25,
            "Reference": "1",
            "StatusTypeID": 50,
            "LevelID": 2,
            "Amps": 32,
            "Voltage": 400,
            "PowerKW": 22,
            "CurrentTypeID": 20,
            "Quantity": 1
        },
        {
            "ID": 253079,
            "ConnectionTypeID": 2,
            "Reference": "2",
            "StatusTypeID": 50,
            "LevelID": 3,
            "Amps": 125,
            "Voltage": 400,
            "PowerKW": 50,
            "CurrentTypeID": 30,
            "Quantity": 1
        },
        {
            "ID": 253080,
            "ConnectionTypeID": 33,
            "Reference": "3",
            "StatusTypeID": 50,
            "LevelID": 3,
            "Amps": 125,
            "Voltage": 400,
            "PowerKW": 50,
            "CurrentTypeID": 30,
            "Quantity": 1
        }
    ],
    "GeneralComments": "Engie rapid charger, 50kW DC, AC is a 22 Kw Socket. One bay for general use, one bay for taxis. Both Free to charge. ev.engie.co.uk ",
    "StatusTypeID": 50,
    "DateLastStatusUpdate": "2020-10-03T12:47:00Z",
    "MetadataValues": [
        {
            "ID": 7881,
            "MetadataFieldID": 4,
            "ItemValue": "Contains public sector information licensed under the Open Government Licence v2.0. http://www.nationalarchives.gov.uk/doc/open-government-licence/version/2/"
        }
    ],
    "DataQualityLevel": 3,
    "DateCreated": "2020-08-27T08:10:00Z",
    "SubmissionStatusTypeID": 100
}