{
    "IsRecentlyVerified": false,
    "ID": 54697,
    "UUID": "D60200C4-D3F1-4CE5-9621-018403BBE4F9",
    "DataProviderID": 26,
    "DataProvidersReference": "69875",
    "OperatorID": 103,
    "OperatorsReference": "Allego NLALLEGO0002032",
    "UsageCost": "0.00 jaarabonnement",
    "AddressInfo": {
        "ID": 55043,
        "Title": "Witte Rozenstraat 57",
        "AddressLine1": "Witte Rozenstraat 57",
        "Town": "Leiden",
        "Postcode": "2311 XT",
        "CountryID": 159,
        "Latitude": 52.15156292,
        "Longitude": 4.4839035,
        "ContactTelephone1": "0800-3745337",
        "RelatedURL": "http://www.allego.eu/",
        "DistanceUnit": 0
    },
    "Connections": [
        {
            "ID": 69073,
            "ConnectionTypeID": 25,
            "LevelID": 2,
            "PowerKW": 11,
            "CurrentTypeID": 10
        },
        {
            "ID": 69074,
            "ConnectionTypeID": 25,
            "LevelID": 2,
            "PowerKW": 11,
            "CurrentTypeID": 10
        }
    ],
    "NumberOfPoints": 1,
    "StatusTypeID": 50,
    "DateLastStatusUpdate": "2016-06-04T02:51:00Z",
    "DataQualityLevel": 3,
    "DateCreated": "2015-10-09T06:18:00Z",
    "SubmissionStatusTypeID": 100
}