{
    "IsRecentlyVerified": false,
    "ID": 37007,
    "UUID": "7076F536-88C5-47D8-8745-A85FD8563381",
    "DataProviderID": 26,
    "DataProvidersReference": "21603",
    "OperatorID": 157,
    "OperatorsReference": "NewMotion 02001855",
    "UsageCost": "0.00 jaarabonnement",
    "AddressInfo": {
        "ID": 37353,
        "Title": "Rietwijkeroordweg 64",
        "AddressLine1": "Rietwijkeroordweg 64",
        "Town": "Aalsmeer",
        "Postcode": "1432 JE",
        "CountryID": 159,
        "Latitude": 52.2969548,
        "Longitude": 4.8158897,
        "ContactTelephone1": "088 0109500",
        "RelatedURL": "http://thenewmotion.nl/",
        "DistanceUnit": 0
    },
    "Connections": [
        {
            "ID": 40518,
            "ConnectionTypeID": 25,
            "LevelID": 2,
            "PowerKW": 3.7,
            "CurrentTypeID": 10
        }
    ],
    "NumberOfPoints": 1,
    "StatusTypeID": 50,
    "DateLastStatusUpdate": "2016-06-04T02:52:00Z",
    "DataQualityLevel": 3,
    "DateCreated": "2015-01-09T06:07:00Z",
    "SubmissionStatusTypeID": 100
}