{
    "IsRecentlyVerified": false,
    "ID": 166215,
    "UUID": "37DD9E02-CC1E-46C8-B2B7-DF3DDD51348B",
    "DataProviderID": 28,
    "DataProvidersReference": "FR*S17*PMB17*8",
    "OperatorID": 3407,
    "UsageTypeID": 5,
    "AddressInfo": {
        "ID": 166574,
        "Title": "SAINT JEAN D'ANGELY - place des Martyrs",
        "AddressLine1": "Place De Martyrs 17400 SAINT JEAN D'ANGELY",
        "CountryID": 80,
        "Latitude": 45.945885,
        "Longitude": -0.517528,
        "AccessComments": "24h/24 7j/7",
        "DistanceUnit": 0
    },
    "Connections": [
        {
            "ID": 245147,
            "ConnectionTypeID": 1036,
            "StatusTypeID": 50,
            "LevelID": 2,
            "PowerKW": 36,
            "CurrentTypeID": 20
        },
        {
            "ID": 245148,
            "ConnectionTypeID": 2,
            "StatusTypeID": 50,
            "LevelID": 3,
            "PowerKW": 36,
            "CurrentTypeID": 30
        }
    ],
    "GeneralComments": "Recharge par badge, avec une application smartphone, et CB",
    "StatusTypeID": 50,
    "DateLastStatusUpdate": "2020-08-27T05:12:00Z",
    "DataQualityLevel": 2,
    "DateCreated": "2020-08-27T05:12:00Z",
    "SubmissionStatusTypeID": 100
}