{
    "UserComments": [
        {
            "ID": 10182,
            "ChargePointID": 5473,
            "CommentTypeID": 10,
            "UserName": "drop_short",
            "Comment": "Definitely buzz on way in to ask for the point to be opened, do the same when you pay at the ticket machine.  All 4 spaces were free!",
            "Rating": 4,
            "DateCreated": "2016-04-14T23:16:01.353Z",
            "User": {
                "ID": 9242,
                "Username": "drop_short"
            },
            "CheckinStatusTypeID": 10
        },
        {
            "ID": 75,
            "ChargePointID": 5473,
            "CommentTypeID": 10,
            "UserName": "Evan",
            "Comment": "Elektrobay posts, need to be unlocked by member of staff for each vehicle!  Ask at the management suite in the shopping centre (staff are very helpful).",
            "Rating": 4,
            "DateCreated": "2012-02-18T11:47:34.97Z"
        }
    ],
    "MediaItems": [
        {
            "ID": 495,
            "ChargePointID": 5473,
            "ItemURL": "https://s3-ap-southeast-2.amazonaws.com/openchargemap/images/GB/OCM5473/OCM-5473.orig.2014070919012776.jpg",
            "ItemThumbnailURL": "https://s3-ap-southeast-2.amazonaws.com/openchargemap/images/GB/OCM5473/OCM-5473.thmb.2014070919012776.jpg",
            "Comment": "",
            "IsEnabled": true,
            "IsVideo": false,
            "IsFeaturedItem": false,
            "IsExternalResource": false,
            "User": {
                "ID": 1088,
                "Username": "Buzby"
            },
            "DateCreated": "2014-07-09T19:02:00Z"
        },
        {
            "ID": 494,
            "ChargePointID": 5473,
            "ItemURL": "https://s3-ap-southeast-2.amazonaws.com/openchargemap/images/GB/OCM5473/OCM-5473.orig.2014070919005110.jpg",
            "ItemThumbnailURL": "https://s3-ap-southeast-2.amazonaws.com/openchargemap/images/GB/OCM5473/OCM-5473.thmb.2014070919005110.jpg",
            "Comment": "",
            "IsEnabled": true,
            "IsVideo": false,
            "IsFeaturedItem": false,
            "IsExternalResource": false,
            "User": {
                "ID": 1088,
                "Username": "Buzby"
            },
            "DateCreated": "2014-07-09T19:01:00Z"
        }
    ],
    "IsRecentlyVerified": false,
    "ID": 5473,
    "UUID": "4FEE1397-5D62-4C02-BAB2-24D660FB8E03",
    "DataProviderID": 1,
    "OperatorID": 45,
    "UsageTypeID": 1,
    "UsageCost": "Usual parking charges apply.",
    "AddressInfo": {
        "ID": 5411,
        "Title": "St. Enoch Shopping Centre",
        "AddressLine1": "55 St. Enoch Square",
        "AddressLine2": "",
        "Town": "Glasgow",
        "StateOrProvince": "",
        "Postcode": "G1 4BW",
        "CountryID": 1,
        "Latitude": 55.85739,
        "Longitude": -4.25445,
        "ContactTelephone1": "0141 204 3900",
        "ContactTelephone2": "",
        "ContactEmail": "",
        "AccessComments": "Located on L2 South. Please press help button on entry barrier. ",
        "RelatedURL": "http://www.st-enoch.co.uk/opening-hours--parking/parking.aspx",
        "DistanceUnit": 0
    },
    "Connections": [
        {
            "ID": 26229,
            "ConnectionTypeID": 3,
            "StatusTypeID": 50,
            "LevelID": 2,
            "Voltage": 240,
            "PowerKW": 3,
            "CurrentTypeID": 10,
            "Quantity": 3
        }
    ],
    "NumberOfPoints": 3,
    "GeneralComments": "",
    "StatusTypeID": 50,
    "DateLastStatusUpdate": "2016-04-14T23:16:00Z",
    "DataQualityLevel": 1,
    "DateCreated": "2011-08-29T11:42:00Z",
    "SubmissionStatusTypeID": 200
}