{
    "IsRecentlyVerified": false,
    "ID": 53578,
    "UUID": "E9FF4474-3DF4-4806-8C7F-86D22996EFCB",
    "DataProviderID": 26,
    "DataProvidersReference": "67441",
    "OperatorID": 78,
    "OperatorsReference": "Essent EM-AT-00050628-01-00002",
    "UsageCost": "0.00 jaarabonnement",
    "AddressInfo": {
        "ID": 53924,
        "Title": "B168",
        "AddressLine1": "B168",
        "Town": "Zell am See",
        "Postcode": "5700",
        "CountryID": 19,
        "Latitude": 47.29909,
        "Longitude": 12.78816,
        "RelatedURL": "http://www.essent.nl",
        "DistanceUnit": 0
    },
    "Connections": [
        {
            "ID": 66720,
            "ConnectionTypeID": 25,
            "LevelID": 2,
            "PowerKW": 11,
            "CurrentTypeID": 10
        },
        {
            "ID": 66721,
            "ConnectionTypeID": 25,
            "LevelID": 2,
            "PowerKW": 11,
            "CurrentTypeID": 10
        },
        {
            "ID": 82194,
            "ConnectionTypeID": 2,
            "LevelID": 3,
            "PowerKW": 50,
            "CurrentTypeID": 30
        },
        {
            "ID": 82195,
            "ConnectionTypeID": 25,
            "LevelID": 2,
            "PowerKW": 5,
            "CurrentTypeID": 10
        }
    ],
    "NumberOfPoints": 1,
    "StatusTypeID": 50,
    "DateLastStatusUpdate": "2016-06-04T02:38:00Z",
    "DataQualityLevel": 3,
    "DateCreated": "2015-09-20T11:50:00Z",
    "SubmissionStatusTypeID": 100
}