{
    "IsRecentlyVerified": false,
    "ID": 186453,
    "UUID": "FC618557-E3CC-4EAF-8586-7A701BFC7024",
    "DataProviderID": 29,
    "DataProvidersReference": "17484",
    "OperatorID": 69,
    "AddressInfo": {
        "ID": 186812,
        "Title": "Von-Humboldt-Str. 54",
        "AddressLine1": "Von-Humboldt-Str. 54",
        "Town": "Velbert ",
        "Postcode": "42549",
        "CountryID": 87,
        "Latitude": 51.342231,
        "Longitude": 7.016093,
        "DistanceUnit": 0
    },
    "Connections": [
        {
            "ID": 299179,
            "ConnectionTypeID": 25,
            "StatusTypeID": 50,
            "LevelID": 2,
            "PowerKW": 22,
            "CurrentTypeID": 20
        },
        {
            "ID": 299180,
            "ConnectionTypeID": 25,
            "StatusTypeID": 50,
            "LevelID": 2,
            "PowerKW": 22,
            "CurrentTypeID": 20
        }
    ],
    "StatusTypeID": 50,
    "DateLastStatusUpdate": "2021-07-12T02:47:00Z",
    "MetadataValues": [
        {
            "ID": 18694,
            "MetadataFieldID": 4,
            "ItemValue": "Data from the German chargepoint registry provided by Bundesnetzagentur.de under the CC-BY 4.0 license"
        }
    ],
    "DataQualityLevel": 3,
    "DateCreated": "2021-07-12T02:47:00Z",
    "SubmissionStatusTypeID": 100
}