{
    "IsRecentlyVerified": false,
    "ID": 105611,
    "UUID": "508B942D-26A3-456A-B32E-F7C1A894776C",
    "DataProviderID": 2,
    "DataProvidersReference": "98561",
    "OperatorID": 39,
    "UsageTypeID": 4,
    "AddressInfo": {
        "ID": 105957,
        "Title": "Dog Park",
        "AddressLine1": "150 Greene Lane",
        "Town": "Cherry Hill",
        "StateOrProvince": "NJ",
        "Postcode": "08003",
        "CountryID": 2,
        "Latitude": 39.899716323139,
        "Longitude": -74.956441300458,
        "ContactTelephone1": "800-663-5633",
        "AccessComments": "MO: 12:00am-12:00am; TU: 12:00am-12:00am; WE: 12:00am-12:00am; TH: 12:00am-12:00am; FR: 12:00am-12:00am; SA: 12:00am-12:00am; SU: 12:00am-12:00am",
        "RelatedURL": "http://www.semacharge.com/",
        "DistanceUnit": 0
    },
    "Connections": [
        {
            "ID": 148799,
            "ConnectionTypeID": 1,
            "LevelID": 2,
            "Amps": 16,
            "Voltage": 230,
            "PowerKW": 3,
            "CurrentTypeID": 10,
            "Quantity": 2
        }
    ],
    "DateLastStatusUpdate": "2019-04-06T05:04:00Z",
    "DataQualityLevel": 3,
    "DateCreated": "2018-06-09T04:01:00Z",
    "SubmissionStatusTypeID": 100
}