{
    "IsRecentlyVerified": false,
    "ID": 139065,
    "UUID": "3E856BBB-4F6C-4525-8EAD-002911560CE5",
    "DataProviderID": 2,
    "DataProvidersReference": "93189",
    "OperatorID": 15,
    "UsageTypeID": 4,
    "AddressInfo": {
        "ID": 139417,
        "Title": "Scottsdale Fashion Square - Gold Garage",
        "AddressLine1": "7014 E Camelback Rd",
        "Town": "Scottsdale",
        "StateOrProvince": "AZ",
        "Postcode": "85251",
        "CountryID": 2,
        "Latitude": 33.50387,
        "Longitude": -111.92678,
        "ContactTelephone1": "877-455-3833",
        "AccessComments": "24 hours daily\r\nPublic - Card key at all times",
        "RelatedURL": "https://www.evgo.com/",
        "DistanceUnit": 0
    },
    "Connections": [
        {
            "ID": 194315,
            "ConnectionTypeID": 2,
            "LevelID": 3,
            "Amps": 100,
            "Voltage": 400,
            "PowerKW": 40,
            "CurrentTypeID": 30,
            "Quantity": 1
        },
        {
            "ID": 194316,
            "ConnectionTypeID": 32,
            "LevelID": 3,
            "Amps": 100,
            "Voltage": 400,
            "PowerKW": 40,
            "CurrentTypeID": 30,
            "Quantity": 1
        }
    ],
    "StatusTypeID": 50,
    "DateLastStatusUpdate": "2020-06-26T02:55:00Z",
    "DataQualityLevel": 3,
    "DateCreated": "2019-12-24T09:10:00Z",
    "SubmissionStatusTypeID": 100
}