{
    "IsRecentlyVerified": false,
    "ID": 183518,
    "UUID": "859353F1-0F46-4864-8C71-5DEBDECD8FC5",
    "DataProviderID": 29,
    "DataProvidersReference": "6591",
    "AddressInfo": {
        "ID": 183877,
        "Title": "Rudolf-Breitscheid-Straße 110",
        "AddressLine1": "Rudolf-Breitscheid-Straße 110",
        "Town": "Eberswalde",
        "Postcode": "16225",
        "CountryID": 87,
        "Latitude": 52.828025,
        "Longitude": 13.79268,
        "DistanceUnit": 0
    },
    "Connections": [
        {
            "ID": 290605,
            "ConnectionTypeID": 25,
            "StatusTypeID": 50,
            "LevelID": 2,
            "PowerKW": 22,
            "CurrentTypeID": 20
        },
        {
            "ID": 290606,
            "ConnectionTypeID": 25,
            "StatusTypeID": 50,
            "LevelID": 2,
            "PowerKW": 22,
            "CurrentTypeID": 20
        }
    ],
    "StatusTypeID": 50,
    "DateLastStatusUpdate": "2021-07-12T02:50:00Z",
    "MetadataValues": [
        {
            "ID": 15811,
            "MetadataFieldID": 4,
            "ItemValue": "Data from the German chargepoint registry provided by Bundesnetzagentur.de under the CC-BY 4.0 license"
        }
    ],
    "DataQualityLevel": 3,
    "DateCreated": "2021-07-08T10:04:00Z",
    "SubmissionStatusTypeID": 100
}