{
    "IsRecentlyVerified": false,
    "ID": 182297,
    "UUID": "DFDC704A-4249-42CF-A23C-D7AADF66376E",
    "DataProviderID": 29,
    "DataProvidersReference": "1679",
    "OperatorID": 69,
    "AddressInfo": {
        "ID": 182656,
        "Title": "Am Markt 26",
        "AddressLine1": "Am Markt 26",
        "Town": "Bürgel",
        "Postcode": "07616",
        "CountryID": 87,
        "Latitude": 50.942151,
        "Longitude": 11.753705,
        "DistanceUnit": 0
    },
    "Connections": [
        {
            "ID": 287862,
            "ConnectionTypeID": 28,
            "StatusTypeID": 50,
            "LevelID": 2,
            "PowerKW": 22,
            "CurrentTypeID": 20
        },
        {
            "ID": 287863,
            "ConnectionTypeID": 25,
            "StatusTypeID": 50,
            "LevelID": 2,
            "PowerKW": 22,
            "CurrentTypeID": 20
        },
        {
            "ID": 298496,
            "ConnectionTypeID": 28,
            "StatusTypeID": 50,
            "LevelID": 2,
            "PowerKW": 22,
            "CurrentTypeID": 20
        },
        {
            "ID": 298497,
            "ConnectionTypeID": 25,
            "StatusTypeID": 50,
            "LevelID": 2,
            "PowerKW": 22,
            "CurrentTypeID": 20
        }
    ],
    "StatusTypeID": 50,
    "DateLastStatusUpdate": "2021-07-12T02:46:00Z",
    "MetadataValues": [
        {
            "ID": 14591,
            "MetadataFieldID": 4,
            "ItemValue": "Data from the German chargepoint registry provided by Bundesnetzagentur.de under the CC-BY 4.0 license"
        }
    ],
    "DataQualityLevel": 3,
    "DateCreated": "2021-07-08T10:02:00Z",
    "SubmissionStatusTypeID": 100
}