{
    "UserComments": [
        {
            "ID": 23620,
            "ChargePointID": 170613,
            "CommentTypeID": 50,
            "UserName": "CARGACOCHES",
            "Comment": "Este punto no se encuentra disponible. En breves, les daremos noticias. Lamentamos las molestias.",
            "Rating": 5,
            "DateCreated": "2020-12-09T09:05:26.287Z",
            "User": {
                "ID": 27955,
                "Username": "CARGACOCHES"
            },
            "CheckinStatusTypeID": 210,
            "IsActionedByEditor": false
        }
    ],
    "MediaItems": [
        {
            "ID": 25759,
            "ChargePointID": 170613,
            "ItemURL": "https://s3-ap-southeast-2.amazonaws.com/openchargemap/images/ES/OCM170613/OCM-170613.orig.2020120909054894.jpg",
            "ItemThumbnailURL": "https://s3-ap-southeast-2.amazonaws.com/openchargemap/images/ES/OCM170613/OCM-170613.thmb.2020120909054894.jpg",
            "Comment": "",
            "IsEnabled": true,
            "IsVideo": false,
            "IsFeaturedItem": false,
            "IsExternalResource": false,
            "User": {
                "ID": 27955,
                "Username": "CARGACOCHES"
            },
            "DateCreated": "2020-12-09T09:06:00Z"
        }
    ],
    "IsRecentlyVerified": false,
    "ID": 170613,
    "UUID": "BD19A115-68C5-4B98-B60B-D5C6FA79015F",
    "DataProviderID": 1,
    "OperatorID": 1,
    "UsageTypeID": 1,
    "UsageCost": "0.38",
    "AddressInfo": {
        "ID": 170972,
        "Title": "Polígono industrial La Vega",
        "AddressLine1": "Polígono industrial La Vega",
        "Town": "Campoo de Enmedio",
        "StateOrProvince": "Cantabria",
        "Postcode": "39213",
        "CountryID": 210,
        "Latitude": 42.98706417205349,
        "Longitude": -4.134726731573551,
        "ContactTelephone1": "961679024",
        "ContactTelephone2": "914047905",
        "AccessComments": "app ChargeandParking",
        "RelatedURL": "http://www.cargacoches.com",
        "DistanceUnit": 0
    },
    "Connections": [
        {
            "ID": 260474,
            "ConnectionTypeID": 33,
            "StatusTypeID": 50,
            "LevelID": 3,
            "PowerKW": 50,
            "CurrentTypeID": 30,
            "Quantity": 1
        },
        {
            "ID": 260475,
            "ConnectionTypeID": 2,
            "StatusTypeID": 50,
            "LevelID": 3,
            "PowerKW": 50,
            "CurrentTypeID": 30,
            "Quantity": 1
        },
        {
            "ID": 260476,
            "ConnectionTypeID": 1036,
            "StatusTypeID": 50,
            "LevelID": 3,
            "PowerKW": 43,
            "CurrentTypeID": 20,
            "Quantity": 1
        }
    ],
    "NumberOfPoints": 1,
    "GeneralComments": "(I.V.A. included)",
    "StatusTypeID": 150,
    "DateLastStatusUpdate": "2020-12-09T09:06:00Z",
    "DataQualityLevel": 1,
    "DateCreated": "2020-12-03T12:46:00Z",
    "SubmissionStatusTypeID": 200
}