{
    "IsRecentlyVerified": false,
    "ID": 74451,
    "UUID": "55234981-B35F-46EE-8F5E-3F08BA52F0F3",
    "DataProviderID": 2,
    "DataProvidersReference": "79364",
    "OperatorID": 5,
    "UsageTypeID": 1,
    "AddressInfo": {
        "ID": 74797,
        "Title": "GEORGIA POWER",
        "AddressLine1": "696 1st Ave",
        "Town": "East Ellijay",
        "StateOrProvince": "GA",
        "Postcode": "30539",
        "CountryID": 2,
        "Latitude": 34.677725,
        "Longitude": -84.477156,
        "ContactTelephone1": "888-758-4389",
        "AccessComments": "24 hours daily",
        "RelatedURL": "http://www.chargepoint.com/",
        "DistanceUnit": 0
    },
    "Connections": [
        {
            "ID": 107037,
            "ConnectionTypeID": 1,
            "LevelID": 2,
            "Amps": 16,
            "Voltage": 230,
            "PowerKW": 3,
            "CurrentTypeID": 10,
            "Quantity": 2
        },
        {
            "ID": 107038,
            "ConnectionTypeID": 2,
            "LevelID": 2,
            "Amps": 100,
            "Voltage": 400,
            "PowerKW": 40,
            "CurrentTypeID": 10,
            "Quantity": 1
        },
        {
            "ID": 109456,
            "ConnectionTypeID": 32,
            "LevelID": 2,
            "Amps": 100,
            "Voltage": 400,
            "PowerKW": 40,
            "CurrentTypeID": 10,
            "Quantity": 1
        }
    ],
    "DateLastStatusUpdate": "2019-04-06T04:02:00Z",
    "DataQualityLevel": 3,
    "DateCreated": "2016-12-03T00:12:00Z",
    "SubmissionStatusTypeID": 100
}