{
    "IsRecentlyVerified": false,
    "ID": 79650,
    "UUID": "D2368D81-0CD0-454B-BDB2-AC7F56491D5F",
    "DataProviderID": 1,
    "OperatorID": 23,
    "OperatorsReference": "6758",
    "UsageTypeID": 6,
    "UsageCost": "Free",
    "AddressInfo": {
        "ID": 79996,
        "Title": "Jordan's",
        "AddressLine1": "1470 W Broadway",
        "Town": "Vancouver",
        "StateOrProvince": "BC",
        "Postcode": "V6H 1H4",
        "CountryID": 44,
        "Latitude": 49.263089,
        "Longitude": -123.137586,
        "ContactTelephone1": "(604) 733-1174",
        "DistanceUnit": 0
    },
    "Connections": [
        {
            "ID": 114290,
            "ConnectionTypeID": 30,
            "StatusTypeID": 50,
            "LevelID": 2,
            "PowerKW": 16,
            "CurrentTypeID": 20,
            "Quantity": 1
        }
    ],
    "NumberOfPoints": 1,
    "GeneralComments": "1 Tesla Connector, up to 16kW.Available for patrons only. Please see front desk.",
    "StatusTypeID": 50,
    "DateLastStatusUpdate": "2017-01-29T18:17:00Z",
    "DataQualityLevel": 1,
    "DateCreated": "2017-01-29T18:17:00Z",
    "SubmissionStatusTypeID": 200
}