{
    "IsRecentlyVerified": false,
    "ID": 7673,
    "UUID": "F8D8AE4C-6D7E-4841-9908-5C4CFB102670",
    "DataProviderID": 1,
    "OperatorID": 45,
    "UsageTypeID": 4,
    "UsageCost": "Free",
    "AddressInfo": {
        "ID": 7570,
        "Title": "Parkhaus City Center",
        "AddressLine1": "Friedrich-Ebert-Strasse 33",
        "Town": "Leverkusen",
        "Postcode": "51373 ",
        "CountryID": 87,
        "Latitude": 51.030367676200996,
        "Longitude": 6.9883617580085255,
        "ContactTelephone1": "+49 (0) 1805 - 903310",
        "ContactEmail": "service@apcoa.de",
        "AccessComments": "Einfahrt in der Friedrich Ebert Straße, kurz nach der Einfahrt auf der linken Seite. Es muss eine Lade-Karte im EVL-ePoint beantragt werden. Laden ist kostenfrei, jedoch fallen Parkgebühren an. 1€ pro Stunde für die ersten drei Stunden, danach 1,50€ pro Stunde.",
        "RelatedURL": "http://www.apcoa.de/de/parkhaus-suchen/details/name/City%20Center/apcoa/135/city/Leverkusen.html?no_cache=1",
        "DistanceUnit": 0
    },
    "Connections": [
        {
            "ID": 83401,
            "ConnectionTypeID": 25,
            "StatusTypeID": 50,
            "LevelID": 2,
            "Amps": 32,
            "Voltage": 400,
            "PowerKW": 22,
            "CurrentTypeID": 20,
            "Quantity": 1
        },
        {
            "ID": 83402,
            "ConnectionTypeID": 25,
            "StatusTypeID": 50,
            "LevelID": 2,
            "Amps": 16,
            "Voltage": 400,
            "PowerKW": 11,
            "CurrentTypeID": 20,
            "Quantity": 1
        },
        {
            "ID": 83403,
            "ConnectionTypeID": 28,
            "StatusTypeID": 50,
            "LevelID": 2,
            "Amps": 16,
            "Voltage": 230,
            "PowerKW": 3.7,
            "CurrentTypeID": 10,
            "Quantity": 2
        }
    ],
    "NumberOfPoints": 1,
    "DateLastConfirmed": "2011-11-02T21:07:00Z",
    "StatusTypeID": 50,
    "DateLastStatusUpdate": "2016-03-29T07:34:00Z",
    "DataQualityLevel": 1,
    "DateCreated": "2011-11-02T21:07:00Z",
    "SubmissionStatusTypeID": 200
}