{
    "IsRecentlyVerified": false,
    "ID": 174767,
    "UUID": "4DA6E252-F6B5-452F-9887-E6A2DCF9FF4F",
    "DataProviderID": 1,
    "OperatorID": 3323,
    "UsageTypeID": 4,
    "AddressInfo": {
        "ID": 175126,
        "Title": "Zes - Eskişehir Fuar ve Kongre Merkezi Açık Otopark ",
        "AddressLine1": "",
        "Town": "Eskişehir",
        "StateOrProvince": "Eskişehir",
        "Postcode": "26110",
        "CountryID": 229,
        "Latitude": 39.75246189159054,
        "Longitude": 30.594554416765163,
        "DistanceUnit": 0
    },
    "Connections": [
        {
            "ID": 270802,
            "ConnectionTypeID": 25,
            "StatusTypeID": 50,
            "LevelID": 2,
            "PowerKW": 22,
            "CurrentTypeID": 20,
            "Quantity": 1
        }
    ],
    "NumberOfPoints": 1,
    "StatusTypeID": 50,
    "DateLastStatusUpdate": "2021-04-14T21:53:00Z",
    "DataQualityLevel": 1,
    "DateCreated": "2021-04-11T21:38:00Z",
    "SubmissionStatusTypeID": 200
}