{
    "IsRecentlyVerified": false,
    "ID": 176279,
    "UUID": "4959AFAC-1766-4D35-BEDD-DC1958B25E6C",
    "DataProviderID": 1,
    "OperatorID": 1,
    "UsageTypeID": 1,
    "UsageCost": "Free",
    "AddressInfo": {
        "ID": 176638,
        "Title": "Non-Stop Power (NSP) KZN01M",
        "AddressLine1": "23 Magistralnaya Street",
        "Town": "Kazan",
        "StateOrProvince": "Tatarstan",
        "Postcode": "420108",
        "CountryID": 185,
        "Latitude": 55.749777209814454,
        "Longitude": 49.10567491967606,
        "ContactTelephone1": "+7 917 390-09-64",
        "DistanceUnit": 0
    },
    "Connections": [
        {
            "ID": 273954,
            "ConnectionTypeID": 2,
            "StatusTypeID": 50,
            "LevelID": 3,
            "PowerKW": 45,
            "CurrentTypeID": 30,
            "Quantity": 1
        },
        {
            "ID": 273955,
            "ConnectionTypeID": 33,
            "StatusTypeID": 50,
            "LevelID": 3,
            "PowerKW": 50,
            "CurrentTypeID": 30,
            "Quantity": 1
        },
        {
            "ID": 273956,
            "ConnectionTypeID": 1036,
            "StatusTypeID": 50,
            "CurrentTypeID": 20,
            "Quantity": 1
        },
        {
            "ID": 273957,
            "ConnectionTypeID": 1,
            "StatusTypeID": 50,
            "CurrentTypeID": 10,
            "Quantity": 1
        }
    ],
    "NumberOfPoints": 1,
    "GeneralComments": "Быстрая зарядная станция находится на территории производства. Доступ на территорию условно свободен.",
    "StatusTypeID": 50,
    "DateLastStatusUpdate": "2021-07-03T09:24:00Z",
    "DataQualityLevel": 1,
    "DateCreated": "2021-07-02T19:40:00Z",
    "SubmissionStatusTypeID": 200
}