{
    "IsRecentlyVerified": false,
    "ID": 166141,
    "UUID": "A3A1751A-DBA7-46A0-A3FB-5225ED2E1A01",
    "DataProviderID": 28,
    "DataProvidersReference": "FR*S33*PMB33*147",
    "OperatorID": 3407,
    "UsageTypeID": 5,
    "AddressInfo": {
        "ID": 166500,
        "Title": "SOULAC SUR MER - Parking De La Mairie",
        "AddressLine1": "Parking De La Mairie 33780 SOULAC SUR MER",
        "CountryID": 80,
        "Latitude": 45.51510784,
        "Longitude": -1.122845113,
        "AccessComments": "24h/24 7j/7",
        "DistanceUnit": 0
    },
    "Connections": [
        {
            "ID": 244540,
            "ConnectionTypeID": 25,
            "StatusTypeID": 50,
            "LevelID": 2,
            "PowerKW": 18,
            "CurrentTypeID": 20
        },
        {
            "ID": 244541,
            "ConnectionTypeID": 28,
            "StatusTypeID": 50,
            "LevelID": 2,
            "PowerKW": 18,
            "CurrentTypeID": 10
        },
        {
            "ID": 244542,
            "ConnectionTypeID": 25,
            "StatusTypeID": 50,
            "LevelID": 2,
            "PowerKW": 18,
            "CurrentTypeID": 20
        },
        {
            "ID": 244543,
            "ConnectionTypeID": 28,
            "StatusTypeID": 50,
            "LevelID": 2,
            "PowerKW": 18,
            "CurrentTypeID": 10
        }
    ],
    "GeneralComments": "Recharge par badge et avec une application smartphone",
    "StatusTypeID": 50,
    "DateLastStatusUpdate": "2020-08-27T05:12:00Z",
    "DataQualityLevel": 2,
    "DateCreated": "2020-08-27T05:12:00Z",
    "SubmissionStatusTypeID": 100
}