{
    "IsRecentlyVerified": false,
    "ID": 71757,
    "UUID": "BFDA4DA6-6DDD-4BEC-AD62-1A182FAB1E80",
    "DataProviderID": 1,
    "OperatorID": 45,
    "UsageTypeID": 5,
    "AddressInfo": {
        "ID": 72103,
        "Title": "Parkhaus am Stadtgraben",
        "AddressLine1": "Am Stadtgraben 55",
        "Town": "Andernach",
        "StateOrProvince": "Landkreis Mayen-Koblenz",
        "Postcode": "56626",
        "CountryID": 87,
        "Latitude": 50.4377356,
        "Longitude": 7.40040759999999,
        "AccessComments": "24/7 geöffnet, Ladestation ist ausgeschildert und Laden ist kostenlos. Parkgebühren 0,80€ für erste Stunde, danach 0,50€ pro Stunde.",
        "RelatedURL": "http://andernach.de/",
        "DistanceUnit": 0
    },
    "Connections": [
        {
            "ID": 102786,
            "ConnectionTypeID": 25,
            "StatusTypeID": 50,
            "LevelID": 2,
            "Amps": 32,
            "Voltage": 400,
            "PowerKW": 22,
            "CurrentTypeID": 20,
            "Quantity": 1
        },
        {
            "ID": 102787,
            "ConnectionTypeID": 28,
            "StatusTypeID": 50,
            "LevelID": 2,
            "Amps": 16,
            "Voltage": 230,
            "PowerKW": 3.7,
            "CurrentTypeID": 10,
            "Quantity": 1
        }
    ],
    "NumberOfPoints": 2,
    "StatusTypeID": 50,
    "DateLastStatusUpdate": "2016-09-08T06:07:00Z",
    "DataQualityLevel": 1,
    "DateCreated": "2016-09-07T05:46:00Z",
    "SubmissionStatusTypeID": 200
}