{
    "IsRecentlyVerified": false,
    "ID": 75912,
    "UUID": "B0436E9C-8F49-4450-89B5-E9C7A0560A11",
    "DataProviderID": 1,
    "OperatorID": 23,
    "OperatorsReference": "22321",
    "UsageTypeID": 1,
    "UsageCost": "Free",
    "AddressInfo": {
        "ID": 76258,
        "Title": "Motel 6 - Tesla",
        "AddressLine1": "2100 Stout St",
        "Town": "Menomonie",
        "StateOrProvince": "WI",
        "Postcode": "54751",
        "CountryID": 2,
        "Latitude": 44.9061966,
        "Longitude": -91.9288329,
        "ContactTelephone1": "715-235-6901  877-798-3752",
        "AccessComments": "24 hours daily; for Tesla use only; for guest use only",
        "RelatedURL": "http://www.teslamotors.com/supercharger",
        "DistanceUnit": 0
    },
    "Connections": [
        {
            "ID": 109423,
            "ConnectionTypeID": 30,
            "StatusTypeID": 50,
            "LevelID": 2,
            "Amps": 16,
            "Voltage": 230,
            "PowerKW": 16,
            "CurrentTypeID": 10,
            "Quantity": 2
        }
    ],
    "NumberOfPoints": 2,
    "StatusTypeID": 50,
    "DateLastStatusUpdate": "2017-01-31T18:22:00Z",
    "DataQualityLevel": 3,
    "DateCreated": "2016-12-23T01:25:00Z",
    "SubmissionStatusTypeID": 100
}