{
    "IsRecentlyVerified": false,
    "ID": 116085,
    "UUID": "3CBF8A0A-AE7B-4598-89F0-4D2D349EC94E",
    "DataProviderID": 2,
    "DataProvidersReference": "105543",
    "OperatorID": 5,
    "UsageTypeID": 1,
    "AddressInfo": {
        "ID": 116431,
        "Title": "BLUE MOUNTAIN",
        "AddressLine1": "100 Wintergreen Place Parking Lot 2A",
        "Town": "The Blue Mountains",
        "StateOrProvince": "ON",
        "Postcode": "L9Y 0P3",
        "CountryID": 44,
        "Latitude": 44.507332,
        "Longitude": -80.311013,
        "ContactTelephone1": "888-758-4389",
        "AccessComments": "24 hours daily",
        "RelatedURL": "http://www.chargepoint.com/",
        "DistanceUnit": 0
    },
    "Connections": [
        {
            "ID": 163147,
            "ConnectionTypeID": 1,
            "LevelID": 2,
            "Amps": 16,
            "Voltage": 230,
            "PowerKW": 3.7,
            "CurrentTypeID": 10,
            "Quantity": 4
        }
    ],
    "DateLastStatusUpdate": "2020-06-26T03:08:00Z",
    "DataQualityLevel": 3,
    "DateCreated": "2019-02-11T07:13:00Z",
    "SubmissionStatusTypeID": 100
}