{
    "IsRecentlyVerified": false,
    "ID": 6875,
    "UUID": "29203197-B120-4793-89A0-34A052B838E0",
    "DataProviderID": 2,
    "DataProvidersReference": "41003",
    "OperatorID": 5,
    "UsageTypeID": 1,
    "AddressInfo": {
        "ID": 6776,
        "Title": "KCPL",
        "AddressLine1": "11551 Ash St",
        "Town": "Leawood",
        "StateOrProvince": "KS",
        "Postcode": "66211",
        "CountryID": 2,
        "Latitude": 38.917293,
        "Longitude": -94.64815,
        "ContactTelephone1": "888-758-4389",
        "AccessComments": "24 hours daily",
        "RelatedURL": "http://www.chargepoint.com/",
        "DistanceUnit": 0
    },
    "Connections": [
        {
            "ID": 4376,
            "ConnectionTypeID": 9,
            "LevelID": 1,
            "Amps": 16,
            "Voltage": 120,
            "PowerKW": 1,
            "CurrentTypeID": 10,
            "Quantity": 2
        },
        {
            "ID": 4377,
            "ConnectionTypeID": 1,
            "LevelID": 2,
            "Amps": 16,
            "Voltage": 230,
            "PowerKW": 3,
            "CurrentTypeID": 10,
            "Quantity": 2
        },
        {
            "ID": 21292,
            "ConnectionTypeID": 1,
            "LevelID": 2,
            "Quantity": 2
        }
    ],
    "DateLastConfirmed": "2011-09-25T00:00:00Z",
    "StatusTypeID": 0,
    "DateLastStatusUpdate": "2019-04-06T04:03:00Z",
    "DataQualityLevel": 1,
    "DateCreated": "2011-10-10T12:26:00Z",
    "SubmissionStatusTypeID": 100
}