{
    "IsRecentlyVerified": false,
    "ID": 14618,
    "UUID": "88C904DF-9729-46A8-B037-BBBEA0A0EC7A",
    "DataProviderID": 2,
    "DataProvidersReference": "49365",
    "OperatorID": 5,
    "UsageTypeID": 1,
    "AddressInfo": {
        "ID": 14515,
        "Title": "CARLETON",
        "AddressLine1": "140 Nevada St",
        "Town": "Northfield",
        "StateOrProvince": "MN",
        "Postcode": "55057",
        "CountryID": 2,
        "Latitude": 44.460082,
        "Longitude": -93.151562,
        "ContactTelephone1": "888-758-4389",
        "AccessComments": "24 hours daily",
        "RelatedURL": "http://www.chargepoint.com/",
        "DistanceUnit": 0
    },
    "Connections": [
        {
            "ID": 12104,
            "ConnectionTypeID": 1,
            "LevelID": 2,
            "Amps": 16,
            "Voltage": 230,
            "PowerKW": 3.7,
            "CurrentTypeID": 10,
            "Quantity": 4
        },
        {
            "ID": 21895,
            "ConnectionTypeID": 1,
            "LevelID": 2,
            "Quantity": 2
        }
    ],
    "DateLastStatusUpdate": "2020-06-26T03:08:00Z",
    "DataQualityLevel": 3,
    "DateCreated": "2012-12-06T16:50:00Z",
    "SubmissionStatusTypeID": 100
}