{
    "UserComments": [
        {
            "ID": 3556,
            "ChargePointID": 23793,
            "CommentTypeID": 10,
            "UserName": "verlivanri.ann",
            "Comment": "Succesfully charged my Renault Zoe @ 22kW several times at this place",
            "Rating": 5,
            "DateCreated": "2015-01-10T21:02:09.617Z",
            "User": {
                "ID": 3428,
                "Username": "verlivanri.ann"
            },
            "CheckinStatusTypeID": 10
        },
        {
            "ID": 3555,
            "ChargePointID": 23793,
            "CommentTypeID": 10,
            "UserName": "verlivanri.ann",
            "Comment": "Succesfully charged my Renault Zoe @ 22kW several times at this place",
            "Rating": 5,
            "DateCreated": "2015-01-10T21:02:00.79Z",
            "User": {
                "ID": 3428,
                "Username": "verlivanri.ann"
            },
            "CheckinStatusTypeID": 10
        },
        {
            "ID": 3554,
            "ChargePointID": 23793,
            "CommentTypeID": 10,
            "UserName": "verlivanri.ann",
            "Comment": "Succesfully charged my Renault Zoe @ 22kW several times at this place",
            "Rating": 5,
            "DateCreated": "2015-01-10T21:01:50.493Z",
            "User": {
                "ID": 3428,
                "Username": "verlivanri.ann"
            },
            "CheckinStatusTypeID": 10
        },
        {
            "ID": 868,
            "ChargePointID": 23793,
            "CommentTypeID": 10,
            "UserName": "louis.van-wynsberge",
            "DateCreated": "2014-06-02T07:26:49.843Z",
            "User": {
                "ID": 1392,
                "Username": "louis.van-wynsberge"
            },
            "CheckinStatusTypeID": 10
        }
    ],
    "MediaItems": [
        {
            "ID": 837,
            "ChargePointID": 23793,
            "ItemURL": "https://s3-ap-southeast-2.amazonaws.com/openchargemap/images/BE/OCM23793/OCM-23793.orig.2015010416463493.jpg",
            "ItemThumbnailURL": "https://s3-ap-southeast-2.amazonaws.com/openchargemap/images/BE/OCM23793/OCM-23793.thmb.2015010416463493.jpg",
            "Comment": "",
            "IsEnabled": true,
            "IsVideo": false,
            "IsFeaturedItem": false,
            "IsExternalResource": false,
            "User": {
                "ID": 1761,
                "Username": "filip.vanrickstal"
            },
            "DateCreated": "2015-01-04T16:47:00Z"
        },
        {
            "ID": 835,
            "ChargePointID": 23793,
            "ItemURL": "https://s3-ap-southeast-2.amazonaws.com/openchargemap/images/BE/OCM23793/OCM-23793.orig.2015010416452262.jpg",
            "ItemThumbnailURL": "https://s3-ap-southeast-2.amazonaws.com/openchargemap/images/BE/OCM23793/OCM-23793.thmb.2015010416452262.jpg",
            "Comment": "",
            "IsEnabled": true,
            "IsVideo": false,
            "IsFeaturedItem": false,
            "IsExternalResource": false,
            "User": {
                "ID": 1761,
                "Username": "filip.vanrickstal"
            },
            "DateCreated": "2015-01-04T16:46:00Z"
        },
        {
            "ID": 836,
            "ChargePointID": 23793,
            "ItemURL": "https://s3-ap-southeast-2.amazonaws.com/openchargemap/images/BE/OCM23793/OCM-23793.orig.2015010416455798.jpg",
            "ItemThumbnailURL": "https://s3-ap-southeast-2.amazonaws.com/openchargemap/images/BE/OCM23793/OCM-23793.thmb.2015010416455798.jpg",
            "Comment": "",
            "IsEnabled": true,
            "IsVideo": false,
            "IsFeaturedItem": false,
            "IsExternalResource": false,
            "User": {
                "ID": 1761,
                "Username": "filip.vanrickstal"
            },
            "DateCreated": "2015-01-04T16:46:00Z"
        }
    ],
    "IsRecentlyVerified": false,
    "ID": 23793,
    "UUID": "9604D658-81CF-4A85-97BB-1906AFAD72E5",
    "DataProviderID": 1,
    "OperatorID": 36,
    "UsageTypeID": 4,
    "AddressInfo": {
        "ID": 24138,
        "Title": "EVA Hoeilaart",
        "AddressLine1": "Gemeenteplein 22",
        "Town": "Hoeilaart",
        "Postcode": "1560",
        "CountryID": 26,
        "Latitude": 50.76811953151268,
        "Longitude": 4.4721217675776215,
        "RelatedURL": "http://www.bluecorner.be",
        "DistanceUnit": 0
    },
    "Connections": [
        {
            "ID": 25825,
            "ConnectionTypeID": 25,
            "StatusTypeID": 50,
            "LevelID": 2,
            "Amps": 32,
            "Voltage": 400,
            "PowerKW": 22,
            "CurrentTypeID": 20,
            "Quantity": 1
        },
        {
            "ID": 34806,
            "ConnectionTypeID": 23,
            "StatusTypeID": 50,
            "LevelID": 2,
            "Amps": 16,
            "Voltage": 230,
            "PowerKW": 3.7,
            "CurrentTypeID": 10,
            "Quantity": 7
        }
    ],
    "NumberOfPoints": 2,
    "GeneralComments": "Borne permettant une recharge rapide pour Zoé",
    "StatusTypeID": 50,
    "DateLastStatusUpdate": "2015-01-10T21:02:00Z",
    "DataQualityLevel": 1,
    "DateCreated": "2014-06-02T07:24:00Z",
    "SubmissionStatusTypeID": 200
}