{
    "IsRecentlyVerified": false,
    "ID": 169318,
    "UUID": "370BCA95-907F-4F78-9823-C9867D96868C",
    "DataProviderID": 1,
    "UsageTypeID": 1,
    "AddressInfo": {
        "ID": 169677,
        "Title": "Valderøyvegen",
        "AddressLine1": "Valderøyvegen",
        "Town": "Møre og Romsdal",
        "StateOrProvince": "Møre og Romsdal",
        "Postcode": "6050",
        "CountryID": 168,
        "Latitude": 62.529054026157326,
        "Longitude": 6.1165957996420275,
        "DistanceUnit": 0
    },
    "Connections": [
        {
            "ID": 257617,
            "ConnectionTypeID": 2,
            "StatusTypeID": 50,
            "LevelID": 2,
            "PowerKW": 50
        },
        {
            "ID": 257618,
            "ConnectionTypeID": 33,
            "StatusTypeID": 50,
            "LevelID": 2,
            "PowerKW": 50
        },
        {
            "ID": 257619,
            "ConnectionTypeID": 25,
            "StatusTypeID": 50,
            "LevelID": 2,
            "PowerKW": 22
        }
    ],
    "NumberOfPoints": 3,
    "GeneralComments": "BKK Valderøy",
    "StatusTypeID": 50,
    "DateLastStatusUpdate": "2021-04-02T23:31:00Z",
    "DataQualityLevel": 1,
    "DateCreated": "2020-10-14T10:23:00Z",
    "SubmissionStatusTypeID": 200
}