{
    "IsRecentlyVerified": false,
    "ID": 77304,
    "UUID": "E299FB85-00CC-460B-92C2-B533E2581115",
    "DataProviderID": 1,
    "OperatorID": 105,
    "UsageTypeID": 4,
    "AddressInfo": {
        "ID": 77650,
        "Title": "Rathaus",
        "AddressLine1": "Rathausplatz",
        "Town": "Voerde",
        "StateOrProvince": "Kreis Wesel",
        "Postcode": "46562",
        "CountryID": 87,
        "Latitude": 51.5981793,
        "Longitude": 6.680578200000014,
        "AccessComments": "24/7 nutzbar",
        "RelatedURL": "http://www.waz.de/staedte/dinslaken-huenxe-voerde/voerder-tankstelle-fuer-e-fahrzeuge-id209197519.html",
        "DistanceUnit": 0
    },
    "Connections": [
        {
            "ID": 111382,
            "ConnectionTypeID": 25,
            "StatusTypeID": 50,
            "LevelID": 2,
            "Amps": 32,
            "Voltage": 400,
            "PowerKW": 22,
            "CurrentTypeID": 20,
            "Quantity": 2
        }
    ],
    "NumberOfPoints": 2,
    "StatusTypeID": 50,
    "DateLastStatusUpdate": "2017-01-09T08:36:00Z",
    "DataQualityLevel": 1,
    "DateCreated": "2017-01-09T08:36:00Z",
    "SubmissionStatusTypeID": 200
}