{
    "IsRecentlyVerified": false,
    "ID": 101903,
    "UUID": "449197AA-0D0E-41C2-A157-5A2673B7B053",
    "DataProviderID": 1,
    "OperatorID": 15,
    "UsageTypeID": 1,
    "UsageCost": "$0.25/min; other tariffs available",
    "AddressInfo": {
        "ID": 102249,
        "Title": "EVGo Cullen Park Cracker Barrel",
        "AddressLine1": "19008 Saums Road",
        "AddressLine2": "",
        "Town": "Houston",
        "StateOrProvince": "TX",
        "Postcode": "77094",
        "CountryID": 2,
        "Latitude": 29.78401042437735,
        "Longitude": -95.69186237562462,
        "ContactTelephone1": "",
        "ContactTelephone2": "",
        "ContactEmail": "",
        "AccessComments": "",
        "RelatedURL": "https://www.evgo.com/",
        "DistanceUnit": 0
    },
    "Connections": [
        {
            "ID": 143866,
            "ConnectionTypeID": 32,
            "StatusTypeID": 50,
            "LevelID": 3,
            "PowerKW": 50,
            "CurrentTypeID": 30,
            "Quantity": 2
        },
        {
            "ID": 143867,
            "ConnectionTypeID": 2,
            "StatusTypeID": 50,
            "LevelID": 3,
            "PowerKW": 50,
            "CurrentTypeID": 30,
            "Quantity": 2
        },
        {
            "ID": 143868,
            "ConnectionTypeID": 1,
            "StatusTypeID": 50,
            "LevelID": 2,
            "PowerKW": 7.2,
            "CurrentTypeID": 10,
            "Quantity": 1
        }
    ],
    "NumberOfPoints": 3,
    "GeneralComments": "",
    "StatusTypeID": 50,
    "DateLastStatusUpdate": "2018-05-18T06:12:00Z",
    "DataQualityLevel": 1,
    "DateCreated": "2018-04-14T19:45:00Z",
    "SubmissionStatusTypeID": 200
}