{
    "IsRecentlyVerified": false,
    "ID": 13795,
    "UUID": "886EAAB9-6E46-418D-9FEC-74EFED764521",
    "DataProviderID": 1,
    "OperatorID": 31,
    "UsageTypeID": 1,
    "UsageCost": "",
    "AddressInfo": {
        "ID": 13692,
        "Title": "San Joaquin Valley Air Pollution Control District",
        "AddressLine1": "1990 E. Gettysburg Avenue",
        "AddressLine2": "",
        "Town": "Fresno",
        "StateOrProvince": "CA",
        "Postcode": "93726",
        "CountryID": 2,
        "Latitude": 36.801411,
        "Longitude": -119.788069,
        "ContactTelephone1": "(559) 230-6000",
        "ContactTelephone2": "",
        "ContactEmail": "",
        "AccessComments": "",
        "RelatedURL": "http://carstations.com/24933",
        "DistanceUnit": 0
    },
    "Connections": [
        {
            "ID": 11242,
            "ConnectionTypeID": 1,
            "Reference": "J1772",
            "StatusTypeID": 0,
            "LevelID": 2
        }
    ],
    "NumberOfPoints": 2,
    "GeneralComments": "",
    "StatusTypeID": 50,
    "DateLastStatusUpdate": "2014-08-18T12:21:00Z",
    "DataQualityLevel": 2,
    "DateCreated": "2012-12-06T11:08:00Z",
    "SubmissionStatusTypeID": 100
}