{
    "IsRecentlyVerified": false,
    "ID": 105998,
    "UUID": "C81CD528-FC20-44E7-B3B5-3C05AC8764DE",
    "DataProviderID": 1,
    "OperatorID": 3272,
    "UsageTypeID": 4,
    "AddressInfo": {
        "ID": 106344,
        "Title": "Emotì Evpass Parcheggio Comunale Via Cremignone  Sorengo",
        "AddressLine1": "Via Cremignone",
        "Town": "Sorengo",
        "StateOrProvince": "Distretto di Lugano",
        "Postcode": "6924",
        "CountryID": 217,
        "Latitude": 46.0025858903348,
        "Longitude": 8.93358926066924,
        "ContactTelephone1": "+41 91 946 39 28",
        "ContactTelephone2": "+41 58 221 96 60",
        "RelatedURL": "https://emoti.evpass.ch/",
        "DistanceUnit": 0
    },
    "Connections": [
        {
            "ID": 149270,
            "ConnectionTypeID": 1036,
            "StatusTypeID": 50,
            "LevelID": 2,
            "Amps": 32,
            "Voltage": 400,
            "PowerKW": 22,
            "CurrentTypeID": 20,
            "Quantity": 2
        },
        {
            "ID": 149271,
            "ConnectionTypeID": 1,
            "StatusTypeID": 50,
            "LevelID": 2,
            "Amps": 32,
            "Voltage": 240,
            "PowerKW": 7,
            "CurrentTypeID": 10,
            "Quantity": 2
        },
        {
            "ID": 149272,
            "ConnectionTypeID": 1037,
            "StatusTypeID": 50,
            "LevelID": 2,
            "Amps": 16,
            "Voltage": 240,
            "PowerKW": 3.7,
            "CurrentTypeID": 10,
            "Quantity": 2
        }
    ],
    "NumberOfPoints": 2,
    "StatusTypeID": 50,
    "DateLastStatusUpdate": "2018-06-13T16:26:00Z",
    "DataQualityLevel": 1,
    "DateCreated": "2018-06-13T15:04:00Z",
    "SubmissionStatusTypeID": 200
}