{
    "IsRecentlyVerified": false,
    "ID": 41697,
    "UUID": "62525862-F81C-45C7-BF1D-23F9466422D4",
    "DataProviderID": 26,
    "DataProvidersReference": "59382",
    "OperatorID": 78,
    "OperatorsReference": "Essent EM-NL-00000363-02-00031",
    "UsageCost": "0.00 jaarabonnement",
    "AddressInfo": {
        "ID": 42043,
        "Title": "Nieuwpoortkade 27",
        "AddressLine1": "Nieuwpoortkade 27",
        "Town": "Amsterdam",
        "Postcode": "1055 RX",
        "CountryID": 159,
        "Latitude": 52.382986,
        "Longitude": 4.861224,
        "RelatedURL": "http://www.essent.nl",
        "DistanceUnit": 0
    },
    "Connections": [
        {
            "ID": 45730,
            "ConnectionTypeID": 25,
            "LevelID": 2,
            "PowerKW": 11,
            "CurrentTypeID": 10
        },
        {
            "ID": 45731,
            "ConnectionTypeID": 25,
            "LevelID": 2,
            "PowerKW": 11,
            "CurrentTypeID": 10
        }
    ],
    "NumberOfPoints": 1,
    "StatusTypeID": 50,
    "DateLastStatusUpdate": "2016-06-04T02:54:00Z",
    "DataQualityLevel": 3,
    "DateCreated": "2015-02-09T03:25:00Z",
    "SubmissionStatusTypeID": 100
}