{
    "IsRecentlyVerified": false,
    "ID": 71057,
    "UUID": "35CFEE57-1381-4D7C-AE36-B17D06794318",
    "DataProviderID": 1,
    "OperatorID": 45,
    "UsageTypeID": 6,
    "AddressInfo": {
        "ID": 71403,
        "Title": "Hévíz, Palace Hotel****",
        "AddressLine1": "Rákóczi u. 1.",
        "Town": "Hévíz",
        "StateOrProvince": "Zala megye",
        "Postcode": "8380",
        "CountryID": 104,
        "Latitude": 46.7907512960347,
        "Longitude": 17.1893806497376,
        "ContactTelephone1": "+36 83 542 140",
        "ContactEmail": "reception@palacehotelheviz.hu",
        "RelatedURL": "http://palacehotelheviz.hu/",
        "DistanceUnit": 0
    },
    "Connections": [
        {
            "ID": 101820,
            "ConnectionTypeID": 25,
            "StatusTypeID": 50,
            "LevelID": 2,
            "Amps": 32,
            "Voltage": 400,
            "PowerKW": 22,
            "CurrentTypeID": 20,
            "Quantity": 1
        }
    ],
    "NumberOfPoints": 1,
    "GeneralComments": "A hotel mélygarázsában, szállóvendégek részére vehető igénybe. / In the hotel garage, for guests.",
    "StatusTypeID": 50,
    "DateLastStatusUpdate": "2016-12-27T17:01:00Z",
    "DataQualityLevel": 1,
    "DateCreated": "2016-08-25T06:06:00Z",
    "SubmissionStatusTypeID": 200
}