{
    "IsRecentlyVerified": false,
    "ID": 156906,
    "UUID": "3294E649-A6AC-4D8C-A804-9CC7C678D144",
    "DataProviderID": 19,
    "DataProvidersReference": "5843",
    "AddressInfo": {
        "ID": 157260,
        "Title": "Djursholms IP Skolängsvägen 1",
        "AddressLine1": "Skolängsvägen 1",
        "Town": "DJURSHOLM",
        "StateOrProvince": "STOCKHOLM",
        "Postcode": "18268",
        "CountryID": 216,
        "Latitude": 59.40526,
        "Longitude": 18.08043,
        "AccessComments": "Längst in på besöksparkeringen till Djursholms IP",
        "DistanceUnit": 0
    },
    "Connections": [
        {
            "ID": 222972,
            "ConnectionTypeID": 25,
            "Reference": "1",
            "LevelID": 3,
            "Amps": 32,
            "Voltage": 400,
            "PowerKW": 22,
            "CurrentTypeID": 30
        },
        {
            "ID": 222973,
            "ConnectionTypeID": 25,
            "Reference": "2",
            "LevelID": 3,
            "Amps": 32,
            "Voltage": 400,
            "PowerKW": 22,
            "CurrentTypeID": 30
        },
        {
            "ID": 222974,
            "ConnectionTypeID": 25,
            "Reference": "3",
            "LevelID": 3,
            "Amps": 32,
            "Voltage": 400,
            "PowerKW": 22,
            "CurrentTypeID": 30
        },
        {
            "ID": 222975,
            "ConnectionTypeID": 25,
            "Reference": "4",
            "LevelID": 3,
            "Amps": 32,
            "Voltage": 400,
            "PowerKW": 22,
            "CurrentTypeID": 30
        },
        {
            "ID": 222976,
            "ConnectionTypeID": 25,
            "Reference": "5",
            "LevelID": 3,
            "Amps": 32,
            "Voltage": 400,
            "PowerKW": 22,
            "CurrentTypeID": 30
        },
        {
            "ID": 222977,
            "ConnectionTypeID": 25,
            "Reference": "6",
            "LevelID": 3,
            "Amps": 32,
            "Voltage": 400,
            "PowerKW": 22,
            "CurrentTypeID": 30
        },
        {
            "ID": 222978,
            "ConnectionTypeID": 25,
            "Reference": "7",
            "LevelID": 3,
            "Amps": 32,
            "Voltage": 400,
            "PowerKW": 22,
            "CurrentTypeID": 30
        },
        {
            "ID": 222979,
            "ConnectionTypeID": 25,
            "Reference": "8",
            "LevelID": 3,
            "Amps": 32,
            "Voltage": 400,
            "PowerKW": 22,
            "CurrentTypeID": 30
        }
    ],
    "NumberOfPoints": 8,
    "StatusTypeID": 0,
    "DateLastStatusUpdate": "2021-03-24T05:11:00Z",
    "DataQualityLevel": 2,
    "DateCreated": "2020-05-26T08:22:00Z",
    "SubmissionStatusTypeID": 100
}