{
    "IsRecentlyVerified": false,
    "ID": 186934,
    "UUID": "A5A4922A-26B1-4AB5-92B0-8BB8BF0EFC07",
    "DataProviderID": 29,
    "DataProvidersReference": "16276",
    "OperatorID": 103,
    "AddressInfo": {
        "ID": 187293,
        "Title": "Cicerostr. 13",
        "AddressLine1": "Cicerostr. 13",
        "Town": "Berlin",
        "Postcode": "10709",
        "CountryID": 87,
        "Latitude": 52.494299,
        "Longitude": 13.30161,
        "DistanceUnit": 0
    },
    "Connections": [
        {
            "ID": 300672,
            "ConnectionTypeID": 25,
            "StatusTypeID": 50,
            "LevelID": 2,
            "PowerKW": 11,
            "CurrentTypeID": 20
        },
        {
            "ID": 300673,
            "ConnectionTypeID": 25,
            "StatusTypeID": 50,
            "LevelID": 2,
            "PowerKW": 11,
            "CurrentTypeID": 20
        }
    ],
    "StatusTypeID": 50,
    "DateLastStatusUpdate": "2021-07-12T02:49:00Z",
    "MetadataValues": [
        {
            "ID": 19174,
            "MetadataFieldID": 4,
            "ItemValue": "Data from the German chargepoint registry provided by Bundesnetzagentur.de under the CC-BY 4.0 license"
        }
    ],
    "DataQualityLevel": 3,
    "DateCreated": "2021-07-12T02:49:00Z",
    "SubmissionStatusTypeID": 100
}