{
    "IsRecentlyVerified": false,
    "ID": 179318,
    "UUID": "4D75FBDA-CDC6-41CA-9D42-B0A527768A83",
    "DataProviderID": 29,
    "DataProvidersReference": "16710",
    "OperatorID": 86,
    "AddressInfo": {
        "ID": 179677,
        "Title": "Hauptstätter Str. 67",
        "AddressLine1": "Hauptstätter Str. 67",
        "Town": "Stuttgart",
        "Postcode": "70178",
        "CountryID": 87,
        "Latitude": 48.77,
        "Longitude": 9.17553,
        "DistanceUnit": 0
    },
    "Connections": [
        {
            "ID": 280982,
            "ConnectionTypeID": 28,
            "StatusTypeID": 50,
            "LevelID": 2,
            "PowerKW": 22,
            "CurrentTypeID": 20
        },
        {
            "ID": 280983,
            "ConnectionTypeID": 25,
            "StatusTypeID": 50,
            "LevelID": 2,
            "PowerKW": 22,
            "CurrentTypeID": 20
        },
        {
            "ID": 296152,
            "ConnectionTypeID": 28,
            "StatusTypeID": 50,
            "LevelID": 2,
            "PowerKW": 22,
            "CurrentTypeID": 20
        },
        {
            "ID": 296153,
            "ConnectionTypeID": 25,
            "StatusTypeID": 50,
            "LevelID": 2,
            "PowerKW": 22,
            "CurrentTypeID": 20
        }
    ],
    "StatusTypeID": 50,
    "DateLastStatusUpdate": "2021-07-12T02:41:00Z",
    "MetadataValues": [
        {
            "ID": 11612,
            "MetadataFieldID": 4,
            "ItemValue": "Data from the German chargepoint registry provided by Bundesnetzagentur.de under the CC-BY 4.0 license"
        }
    ],
    "DataQualityLevel": 3,
    "DateCreated": "2021-07-08T09:59:00Z",
    "SubmissionStatusTypeID": 100
}