{
    "IsRecentlyVerified": false,
    "ID": 73782,
    "UUID": "1F7EE330-BFFE-40F8-B28C-36DC3B663E8D",
    "DataProviderID": 1,
    "OperatorID": 89,
    "OperatorsReference": "CEA-10173",
    "UsageTypeID": 4,
    "UsageCost": "CAD 1.00/hour",
    "AddressInfo": {
        "ID": 74128,
        "Title": "MRC Charlevoix-Baie-Saint-Paul",
        "AddressLine1": "9 rue Forget",
        "Town": "Baie-Saint-Paul",
        "StateOrProvince": "QC",
        "Postcode": "G3Z 3G1",
        "CountryID": 44,
        "Latitude": 47.4404380076012,
        "Longitude": -70.5080010502625,
        "DistanceUnit": 0
    },
    "Connections": [
        {
            "ID": 106086,
            "ConnectionTypeID": 1,
            "StatusTypeID": 50,
            "LevelID": 2,
            "Amps": 32,
            "Voltage": 230,
            "PowerKW": 7,
            "CurrentTypeID": 10,
            "Quantity": 1
        }
    ],
    "NumberOfPoints": 1,
    "StatusTypeID": 50,
    "DateLastStatusUpdate": "2017-06-18T05:23:00Z",
    "DataQualityLevel": 1,
    "DateCreated": "2016-11-23T23:04:00Z",
    "SubmissionStatusTypeID": 200
}