{
    "IsRecentlyVerified": false,
    "ID": 159070,
    "UUID": "FCA12620-199F-48FC-BAD5-376C200577F9",
    "DataProviderID": 2,
    "DataProvidersReference": "156595",
    "OperatorID": 3399,
    "UsageTypeID": 5,
    "AddressInfo": {
        "ID": 159427,
        "Title": "City Of Broken Arrow - 1st St",
        "AddressLine1": "215 S 1st St",
        "Town": "Broken Arrow",
        "StateOrProvince": "OK",
        "Postcode": "74012",
        "CountryID": 2,
        "Latitude": 36.050227,
        "Longitude": -95.789557,
        "ContactTelephone1": "800-489-1588",
        "AccessComments": "24 hours daily; Also accepts payment through Francis Energy App\r\nPublic - Credit card at all times",
        "RelatedURL": "https://francis.energy",
        "DistanceUnit": 0
    },
    "Connections": [
        {
            "ID": 229145,
            "ConnectionTypeID": 1,
            "LevelID": 2,
            "Amps": 16,
            "Voltage": 230,
            "PowerKW": 3.7,
            "CurrentTypeID": 10,
            "Quantity": 4
        }
    ],
    "StatusTypeID": 50,
    "DateLastStatusUpdate": "2020-06-26T02:58:00Z",
    "DataQualityLevel": 3,
    "DateCreated": "2020-06-26T02:58:00Z",
    "SubmissionStatusTypeID": 100
}