{
    "IsRecentlyVerified": false,
    "ID": 74374,
    "UUID": "5DAE3C5C-A612-4054-AF30-B68CB3D219E2",
    "DataProviderID": 1,
    "OperatorID": 23,
    "OperatorsReference": "19438",
    "UsageTypeID": 4,
    "UsageCost": "Free",
    "AddressInfo": {
        "ID": 74720,
        "Title": "Golf Cap Malo",
        "AddressLine1": "Avenue du Phare du Grand Jardin",
        "Town": "Melesse",
        "Postcode": "35520",
        "CountryID": 80,
        "Latitude": 48.197905,
        "Longitude": -1.723015,
        "DistanceUnit": 0
    },
    "Connections": [
        {
            "ID": 106943,
            "ConnectionTypeID": 30,
            "StatusTypeID": 50,
            "LevelID": 2,
            "Amps": 32,
            "Voltage": 400,
            "PowerKW": 22,
            "CurrentTypeID": 20,
            "Quantity": 1
        }
    ],
    "NumberOfPoints": 1,
    "GeneralComments": "1 Tesla Connector, up to 22kW.Available to the public. Please call ahead.",
    "StatusTypeID": 50,
    "DateLastStatusUpdate": "2018-10-03T14:12:00Z",
    "DataQualityLevel": 1,
    "DateCreated": "2016-12-02T18:11:00Z",
    "SubmissionStatusTypeID": 200
}