{
    "IsRecentlyVerified": false,
    "ID": 153532,
    "UUID": "B084694D-FD64-4CF6-A089-40F834B4FAB6",
    "DataProviderID": 28,
    "DataProvidersReference": "FR*S77*P77348A",
    "OperatorID": 3413,
    "UsageTypeID": 5,
    "AddressInfo": {
        "ID": 153885,
        "Title": "Ormesson",
        "AddressLine1": "rue de Beaumont",
        "CountryID": 80,
        "Latitude": 48.243545,
        "Longitude": 2.654417,
        "AccessComments": "",
        "DistanceUnit": 0
    },
    "Connections": [
        {
            "ID": 215446,
            "ConnectionTypeID": 28,
            "StatusTypeID": 50,
            "LevelID": 2,
            "PowerKW": 18,
            "CurrentTypeID": 10
        },
        {
            "ID": 215447,
            "ConnectionTypeID": 25,
            "StatusTypeID": 50,
            "LevelID": 2,
            "PowerKW": 18,
            "CurrentTypeID": 20
        },
        {
            "ID": 248940,
            "ConnectionTypeID": 28,
            "StatusTypeID": 50,
            "LevelID": 2,
            "PowerKW": 18,
            "CurrentTypeID": 10
        },
        {
            "ID": 248941,
            "ConnectionTypeID": 25,
            "StatusTypeID": 50,
            "LevelID": 2,
            "PowerKW": 18,
            "CurrentTypeID": 20
        }
    ],
    "GeneralComments": "badge, appli et QR code",
    "StatusTypeID": 50,
    "DateLastStatusUpdate": "2020-08-27T05:14:00Z",
    "DataQualityLevel": 2,
    "DateCreated": "2020-03-15T10:54:00Z",
    "SubmissionStatusTypeID": 100
}