{
    "IsRecentlyVerified": false,
    "ID": 109259,
    "UUID": "B3D6ABFB-2741-4EF2-A7FD-A2E50DF8075C",
    "DataProviderID": 1,
    "OperatorID": 23,
    "OperatorsReference": "44973",
    "UsageTypeID": 4,
    "AddressInfo": {
        "ID": 109605,
        "Title": "Hotel Guglwald",
        "AddressLine1": "Hotel Guglwald",
        "Postcode": "4191",
        "CountryID": 19,
        "Latitude": 48.590649,
        "Longitude": 14.173765,
        "DistanceUnit": 0
    },
    "Connections": [
        {
            "ID": 154377,
            "ConnectionTypeID": 30,
            "StatusTypeID": 50,
            "LevelID": 2,
            "Amps": 16,
            "Voltage": 400,
            "PowerKW": 11,
            "CurrentTypeID": 20,
            "Quantity": 2
        }
    ],
    "NumberOfPoints": 2,
    "GeneralComments": "2 Tesla Connectors, up to 11kW.Available for customers. Please see front desk.",
    "StatusTypeID": 50,
    "DateLastStatusUpdate": "2018-10-11T14:06:00Z",
    "DataQualityLevel": 1,
    "DateCreated": "2018-10-11T14:06:00Z",
    "SubmissionStatusTypeID": 200
}