{
    "IsRecentlyVerified": false,
    "ID": 23167,
    "UUID": "25863296-C5E1-411C-8887-B3FF29CA3C7E",
    "DataProviderID": 1,
    "OperatorID": 76,
    "UsageTypeID": 1,
    "UsageCost": "5€ /up to 60min of loading",
    "AddressInfo": {
        "ID": 23512,
        "Title": "Kuressaare-2",
        "AddressLine1": "Raekoja street 6",
        "AddressLine2": "Uus street",
        "Town": "Kuressaare",
        "StateOrProvince": "Saaremaa island",
        "Postcode": "93814",
        "CountryID": 74,
        "Latitude": 58.2528373247905,
        "Longitude": 22.4878496724079,
        "ContactTelephone1": "+372 6511911",
        "ContactEmail": "tugi@elmo.ee",
        "RelatedURL": "http://www.elmo.ee/en",
        "DistanceUnit": 0
    },
    "Connections": [
        {
            "ID": 24929,
            "ConnectionTypeID": 2,
            "StatusTypeID": 50,
            "LevelID": 3,
            "Amps": 120,
            "Voltage": 500,
            "PowerKW": 50,
            "CurrentTypeID": 30,
            "Quantity": 1
        },
        {
            "ID": 24930,
            "ConnectionTypeID": 25,
            "StatusTypeID": 50,
            "LevelID": 2,
            "Amps": 32,
            "Voltage": 400,
            "PowerKW": 22,
            "CurrentTypeID": 20,
            "Quantity": 1
        }
    ],
    "NumberOfPoints": 1,
    "GeneralComments": "Opened 24h (automatic). \r\nReal-time condition information (operational/not operational/free) - www.elmo.ee \r\nCan pay with client card, SMS or mobile application. \r\nCharger number 74129",
    "StatusTypeID": 50,
    "DateLastStatusUpdate": "2014-04-19T19:51:00Z",
    "DataQualityLevel": 1,
    "DateCreated": "2014-04-19T19:20:00Z",
    "SubmissionStatusTypeID": 200
}