{
    "IsRecentlyVerified": false,
    "ID": 71144,
    "UUID": "0C3C3930-FABB-4055-AF8F-3772E5CD3408",
    "DataProviderID": 1,
    "OperatorID": 45,
    "UsageTypeID": 4,
    "AddressInfo": {
        "ID": 71490,
        "Title": "Ladepunkt Lisberg",
        "AddressLine1": "Hauptstraße 36a",
        "Town": "Lisberg",
        "StateOrProvince": "Lisberg (VGem)",
        "Postcode": "96170",
        "CountryID": 87,
        "Latitude": 49.88502,
        "Longitude": 10.724839999999972,
        "AccessComments": "24/7 nutzbar mit The New Motion Ladekarte. Details nicht bekannt.",
        "DistanceUnit": 0
    },
    "Connections": [
        {
            "ID": 101939,
            "ConnectionTypeID": 25,
            "StatusTypeID": 50,
            "LevelID": 2,
            "Amps": 16,
            "Voltage": 400,
            "PowerKW": 11,
            "CurrentTypeID": 20,
            "Quantity": 2
        }
    ],
    "NumberOfPoints": 2,
    "StatusTypeID": 50,
    "DateLastStatusUpdate": "2016-09-01T05:56:00Z",
    "DataQualityLevel": 1,
    "DateCreated": "2016-09-01T05:56:00Z",
    "SubmissionStatusTypeID": 200
}