{
    "IsRecentlyVerified": false,
    "ID": 7664,
    "UUID": "C6CD5976-8B86-402E-A96A-0B841FB3885F",
    "DataProviderID": 1,
    "UsageTypeID": 1,
    "UsageCost": "Free",
    "AddressInfo": {
        "ID": 7561,
        "Title": "Parkhaus MyZeil - PalaisQuartier",
        "AddressLine1": "Große Eschenheimer Straße 10",
        "AddressLine2": "",
        "Town": "Frankfurt",
        "StateOrProvince": "",
        "Postcode": "60313 ",
        "CountryID": 87,
        "Latitude": 50.11484,
        "Longitude": 8.679669999999987,
        "ContactTelephone1": "+49 (0) 1805 - 903310",
        "ContactTelephone2": "",
        "ContactEmail": "service@apcoa.de",
        "AccessComments": "http://www.apcoa.de/de/parkhaus-suchen/details/name/MyZeil%20-%20PalaisQuartier/apcoa/359/city/Frankfurt.html?no_cache=1",
        "DistanceUnit": 0
    },
    "Connections": [],
    "NumberOfPoints": 1,
    "GeneralComments": "",
    "DateLastConfirmed": "2011-10-31T18:37:00Z",
    "StatusTypeID": 0,
    "DateLastStatusUpdate": "2011-10-31T18:37:00Z",
    "DataQualityLevel": 1,
    "DateCreated": "2011-10-31T18:37:00Z",
    "SubmissionStatusTypeID": 200
}