{
    "IsRecentlyVerified": false,
    "ID": 133865,
    "UUID": "AAA1E1A4-EBA3-4D05-AD6E-0269F3639407",
    "DataProviderID": 1,
    "OperatorID": 3,
    "OperatorsReference": "PG-70101,PG-83691",
    "UsageTypeID": 4,
    "UsageCost": "Free",
    "AddressInfo": {
        "ID": 134211,
        "Title": "Tesco Superstore-Chester-le-Street",
        "AddressLine1": "North Burns",
        "Town": "Chester-Le-Street",
        "Postcode": "DH3 3TF",
        "CountryID": 1,
        "Latitude": 54.858734,
        "Longitude": -1.578042,
        "DistanceUnit": 0
    },
    "Connections": [
        {
            "ID": 187335,
            "ConnectionTypeID": 25,
            "StatusTypeID": 50,
            "LevelID": 2,
            "Amps": 32,
            "Voltage": 230,
            "PowerKW": 7,
            "CurrentTypeID": 10,
            "Quantity": 4
        }
    ],
    "NumberOfPoints": 4,
    "GeneralComments": "This is an open charge unit installed at the Tesco superstore at North Burns, Chester-Le-Street",
    "StatusTypeID": 50,
    "DateLastStatusUpdate": "2019-10-30T06:36:00Z",
    "DataQualityLevel": 1,
    "DateCreated": "2019-10-29T06:35:00Z",
    "SubmissionStatusTypeID": 200
}