{
    "IsRecentlyVerified": false,
    "ID": 185510,
    "UUID": "EA3B02C4-7B24-40A4-9E39-43160A40C470",
    "DataProviderID": 29,
    "DataProvidersReference": "6852",
    "OperatorID": 3325,
    "AddressInfo": {
        "ID": 185869,
        "Title": "Schiffbauergasse vor Nr. 17",
        "AddressLine1": "Schiffbauergasse vor Nr. 17",
        "Town": "Potsdam",
        "Postcode": "14467",
        "CountryID": 87,
        "Latitude": 52.404056,
        "Longitude": 13.074111,
        "DistanceUnit": 0
    },
    "Connections": [
        {
            "ID": 295097,
            "ConnectionTypeID": 25,
            "StatusTypeID": 50,
            "LevelID": 2,
            "PowerKW": 22,
            "CurrentTypeID": 20
        },
        {
            "ID": 295098,
            "ConnectionTypeID": 25,
            "StatusTypeID": 50,
            "LevelID": 2,
            "PowerKW": 22,
            "CurrentTypeID": 20
        }
    ],
    "StatusTypeID": 50,
    "DateLastStatusUpdate": "2021-07-12T02:49:00Z",
    "MetadataValues": [
        {
            "ID": 17801,
            "MetadataFieldID": 4,
            "ItemValue": "Data from the German chargepoint registry provided by Bundesnetzagentur.de under the CC-BY 4.0 license"
        }
    ],
    "DataQualityLevel": 3,
    "DateCreated": "2021-07-08T10:07:00Z",
    "SubmissionStatusTypeID": 100
}