{
    "IsRecentlyVerified": false,
    "ID": 32837,
    "UUID": "77255E6A-2421-422F-AA04-DE429A9B3F66",
    "DataProviderID": 26,
    "DataProvidersReference": "36222",
    "OperatorID": 157,
    "OperatorsReference": "NewMotion 02002367",
    "UsageCost": "0.00 jaarabonnement",
    "AddressInfo": {
        "ID": 33183,
        "Title": "Gerstdijk 18",
        "AddressLine1": "Gerstdijk 18",
        "Town": "Helmond",
        "Postcode": "5704 RG",
        "CountryID": 159,
        "Latitude": 51.4437255859375,
        "Longitude": 5.69686031341553,
        "ContactTelephone1": "088 0109500",
        "RelatedURL": "http://thenewmotion.nl/",
        "DistanceUnit": 0
    },
    "Connections": [
        {
            "ID": 36348,
            "ConnectionTypeID": 25,
            "LevelID": 2,
            "PowerKW": 3.7,
            "CurrentTypeID": 10
        }
    ],
    "NumberOfPoints": 1,
    "StatusTypeID": 50,
    "DateLastStatusUpdate": "2016-06-04T02:39:00Z",
    "DataQualityLevel": 3,
    "DateCreated": "2015-01-09T06:03:00Z",
    "SubmissionStatusTypeID": 100
}