{
    "IsRecentlyVerified": false,
    "ID": 177884,
    "UUID": "367BD5FF-7D32-4621-B12E-098A5686F47F",
    "DataProviderID": 29,
    "DataProvidersReference": "780",
    "OperatorID": 45,
    "AddressInfo": {
        "ID": 178243,
        "Title": "Kronacher Str. 83",
        "AddressLine1": "Kronacher Str. 83",
        "Town": "Naila",
        "Postcode": "95119",
        "CountryID": 87,
        "Latitude": 50.326082,
        "Longitude": 11.702926,
        "DistanceUnit": 0
    },
    "Connections": [
        {
            "ID": 277588,
            "ConnectionTypeID": 33,
            "StatusTypeID": 50,
            "LevelID": 3,
            "PowerKW": 22,
            "CurrentTypeID": 30
        },
        {
            "ID": 277589,
            "ConnectionTypeID": 25,
            "StatusTypeID": 50,
            "LevelID": 2,
            "PowerKW": 11,
            "CurrentTypeID": 20
        }
    ],
    "StatusTypeID": 0,
    "DateLastStatusUpdate": "2021-07-12T02:44:00Z",
    "MetadataValues": [
        {
            "ID": 10178,
            "MetadataFieldID": 4,
            "ItemValue": "Data from the German chargepoint registry provided by Bundesnetzagentur.de under the CC-BY 4.0 license"
        }
    ],
    "DataQualityLevel": 3,
    "DateCreated": "2021-07-08T09:49:00Z",
    "SubmissionStatusTypeID": 100
}