{
    "IsRecentlyVerified": false,
    "ID": 102864,
    "UUID": "F1568DA0-6285-42B4-8955-0B098BD9CF1D",
    "DataProviderID": 2,
    "DataProvidersReference": "91868",
    "UsageTypeID": 1,
    "AddressInfo": {
        "ID": 103210,
        "Title": "Summit County - Courthouse",
        "AddressLine1": "60 N Main St",
        "Town": "Coalville",
        "StateOrProvince": "UT",
        "Postcode": "84017",
        "CountryID": 2,
        "Latitude": 40.918173,
        "Longitude": -111.399073,
        "ContactTelephone1": "888-505-2170",
        "AccessComments": "24 hours daily; please move vehicle when done charging",
        "RelatedURL": "",
        "DistanceUnit": 0
    },
    "Connections": [
        {
            "ID": 145005,
            "ConnectionTypeID": 1,
            "LevelID": 2,
            "Amps": 16,
            "Voltage": 230,
            "PowerKW": 3.7,
            "CurrentTypeID": 10,
            "Quantity": 6
        },
        {
            "ID": 198709,
            "ConnectionTypeID": 2,
            "LevelID": 3,
            "Amps": 100,
            "Voltage": 400,
            "PowerKW": 40,
            "CurrentTypeID": 30,
            "Quantity": 1
        },
        {
            "ID": 198710,
            "ConnectionTypeID": 32,
            "LevelID": 3,
            "Amps": 100,
            "Voltage": 400,
            "PowerKW": 40,
            "CurrentTypeID": 30,
            "Quantity": 1
        }
    ],
    "DateLastStatusUpdate": "2020-06-26T03:03:00Z",
    "DataQualityLevel": 3,
    "DateCreated": "2018-04-21T04:13:00Z",
    "SubmissionStatusTypeID": 100
}