{
    "IsRecentlyVerified": false,
    "ID": 187578,
    "UUID": "93425702-D93F-4A42-ADC1-513B62FAA120",
    "DataProviderID": 18,
    "DataProvidersReference": "0b2b8c09f61ba33014eaf81a420c1fc3",
    "OperatorID": 3393,
    "UsageTypeID": 1,
    "AddressInfo": {
        "ID": 187937,
        "Title": "Jermyns Lane",
        "AddressLine1": "Jermyns Lane",
        "Town": "Ampfield ",
        "Postcode": "SO51 0QA",
        "CountryID": 1,
        "Latitude": 51.01254,
        "Longitude": -1.46516,
        "AccessComments": "",
        "RelatedURL": "http://www.joju.co.uk/",
        "DistanceUnit": 0
    },
    "Connections": [
        {
            "ID": 302751,
            "ConnectionTypeID": 25,
            "Reference": "ICUEVE900679-1",
            "StatusTypeID": 50,
            "LevelID": 2,
            "Amps": 32,
            "Voltage": 230,
            "PowerKW": 7,
            "CurrentTypeID": 10
        },
        {
            "ID": 302752,
            "ConnectionTypeID": 25,
            "Reference": "ICUEVE900679-2",
            "StatusTypeID": 50,
            "LevelID": 2,
            "Amps": 32,
            "Voltage": 230,
            "PowerKW": 7,
            "CurrentTypeID": 10
        }
    ],
    "StatusTypeID": 0,
    "DateLastStatusUpdate": "2021-07-12T03:38:00Z",
    "MetadataValues": [
        {
            "ID": 19818,
            "MetadataFieldID": 4,
            "ItemValue": "Contains public sector information licensed under the Open Government Licence v2.0. http://www.nationalarchives.gov.uk/doc/open-government-licence/version/2/"
        }
    ],
    "DataQualityLevel": 3,
    "DateCreated": "2021-07-12T03:38:00Z",
    "SubmissionStatusTypeID": 100
}