{
    "IsRecentlyVerified": false,
    "ID": 104133,
    "UUID": "B904DB0C-93D8-4341-94E7-98CC3CDE7382",
    "DataProviderID": 1,
    "OperatorID": 3282,
    "UsageTypeID": 1,
    "AddressInfo": {
        "ID": 104479,
        "Title": "Emobitaly E-USIL-01",
        "AddressLine1": "Strada Provinciale  64 ",
        "Town": "Soriano nel Cimino",
        "StateOrProvince": "VT",
        "Postcode": "01039",
        "CountryID": 112,
        "Latitude": 42.4208807008632,
        "Longitude": 12.2361530630816,
        "ContactTelephone1": "0287075535",
        "ContactEmail": "info@emobitaly.it",
        "RelatedURL": "https://www.emobitaly.it",
        "DistanceUnit": 0
    },
    "Connections": [
        {
            "ID": 147059,
            "ConnectionTypeID": 25,
            "StatusTypeID": 50,
            "LevelID": 2,
            "Amps": 16,
            "Voltage": 400,
            "PowerKW": 11,
            "CurrentTypeID": 20,
            "Quantity": 1
        }
    ],
    "NumberOfPoints": 1,
    "GeneralComments": "Open to all EV drivers (payment required): tariffs, payment (credit card) and activation on ricarica.emobitaly.it\r\nRicarica a pagamento per tutti : tariffe, pagamento (carta di credito) e attivazione su ricarica.emobitaly.it",
    "StatusTypeID": 50,
    "DateLastStatusUpdate": "2018-05-16T19:32:00Z",
    "DataQualityLevel": 1,
    "DateCreated": "2018-05-16T09:50:00Z",
    "SubmissionStatusTypeID": 200
}