{
    "IsRecentlyVerified": false,
    "ID": 3075,
    "UUID": "19107A0E-0AA7-4624-A803-608C18A9143B",
    "DataProviderID": 2,
    "DataProvidersReference": "37658",
    "UsageTypeID": 1,
    "AddressInfo": {
        "ID": 3076,
        "Title": "Salt Lake City Main Library",
        "AddressLine1": "210 E 400 S",
        "Town": "Salt Lake City",
        "StateOrProvince": "UT",
        "Postcode": "84111",
        "CountryID": 2,
        "Latitude": 40.759561,
        "Longitude": -111.883924,
        "ContactTelephone1": "801-535-6630",
        "AccessComments": "7:30am-10pm daily; pay lot; maximum session time of 4 hours",
        "RelatedURL": "",
        "DistanceUnit": 0
    },
    "Connections": [
        {
            "ID": 15468,
            "ConnectionTypeID": 9,
            "LevelID": 1,
            "Amps": 16,
            "Voltage": 120,
            "PowerKW": 1.9,
            "CurrentTypeID": 10,
            "Quantity": 2
        },
        {
            "ID": 15469,
            "ConnectionTypeID": 1,
            "LevelID": 2,
            "Amps": 16,
            "Voltage": 230,
            "PowerKW": 3.7,
            "CurrentTypeID": 10,
            "Quantity": 1
        },
        {
            "ID": 20430,
            "ConnectionTypeID": 1,
            "LevelID": 2,
            "Quantity": 1
        }
    ],
    "DateLastConfirmed": "2011-03-31T00:00:00Z",
    "StatusTypeID": 0,
    "DateLastStatusUpdate": "2020-06-26T03:03:00Z",
    "DataQualityLevel": 1,
    "DateCreated": "2011-03-31T00:00:00Z",
    "SubmissionStatusTypeID": 100
}