{
    "IsRecentlyVerified": false,
    "ID": 100147,
    "UUID": "64D4BA34-B9AC-4931-9AED-4BF8443DA481",
    "DataProviderID": 1,
    "OperatorID": 105,
    "UsageTypeID": 4,
    "AddressInfo": {
        "ID": 100493,
        "Title": "Parkplatz Währentrup",
        "AddressLine1": "Währentruper Straße 63",
        "Town": "Oelingshausen",
        "StateOrProvince": "Kreis Lippe",
        "Postcode": "33813",
        "CountryID": 87,
        "Latitude": 51.9575585221444,
        "Longitude": 8.712064311114545,
        "AccessComments": "24/7 nutzbar auf dem Parkplatz",
        "DistanceUnit": 0
    },
    "Connections": [
        {
            "ID": 141467,
            "ConnectionTypeID": 25,
            "StatusTypeID": 50,
            "LevelID": 2,
            "Amps": 32,
            "Voltage": 400,
            "PowerKW": 22,
            "CurrentTypeID": 20,
            "Quantity": 2
        }
    ],
    "NumberOfPoints": 2,
    "StatusTypeID": 50,
    "DateLastStatusUpdate": "2018-02-14T15:00:00Z",
    "DataQualityLevel": 1,
    "DateCreated": "2018-02-14T15:00:00Z",
    "SubmissionStatusTypeID": 200
}