{
    "IsRecentlyVerified": false,
    "ID": 185448,
    "UUID": "5D1ABFE3-5687-4725-986E-326319A55A08",
    "DataProviderID": 29,
    "DataProvidersReference": "18454",
    "AddressInfo": {
        "ID": 185807,
        "Title": "Wieselburger Platz",
        "AddressLine1": "Wieselburger Platz",
        "Town": "Einbeck",
        "Postcode": "37574",
        "CountryID": 87,
        "Latitude": 51.8558861,
        "Longitude": 9.9608611,
        "DistanceUnit": 0
    },
    "Connections": [
        {
            "ID": 294956,
            "ConnectionTypeID": 25,
            "StatusTypeID": 50,
            "LevelID": 2,
            "PowerKW": 22,
            "CurrentTypeID": 20
        },
        {
            "ID": 294957,
            "ConnectionTypeID": 25,
            "StatusTypeID": 50,
            "LevelID": 2,
            "PowerKW": 22,
            "CurrentTypeID": 20
        }
    ],
    "StatusTypeID": 50,
    "DateLastStatusUpdate": "2021-07-12T02:48:00Z",
    "MetadataValues": [
        {
            "ID": 17739,
            "MetadataFieldID": 4,
            "ItemValue": "Data from the German chargepoint registry provided by Bundesnetzagentur.de under the CC-BY 4.0 license"
        }
    ],
    "DataQualityLevel": 3,
    "DateCreated": "2021-07-08T10:06:00Z",
    "SubmissionStatusTypeID": 100
}