{
    "IsRecentlyVerified": false,
    "ID": 29805,
    "UUID": "EBB2D766-BC92-420E-B7C8-DF12A2FF56E1",
    "DataProviderID": 15,
    "DataProvidersReference": "18408",
    "OperatorID": 5,
    "AddressInfo": {
        "ID": 30151,
        "Title": "200 Orchard Ridge Dr",
        "AddressLine1": "200 Orchard Ridge Dr",
        "Town": "Gaithersburg",
        "StateOrProvince": "Maryland",
        "Postcode": "20878",
        "CountryID": 2,
        "Latitude": 39.12822723,
        "Longitude": -77.23522949,
        "ContactTelephone1": "",
        "RelatedURL": "http://carstations.com/18408",
        "DistanceUnit": 0
    },
    "Connections": [
        {
            "ID": 32790,
            "ConnectionTypeID": 1,
            "Reference": "J1772",
            "LevelID": 2
        }
    ],
    "StatusTypeID": 0,
    "DateLastStatusUpdate": "2017-11-04T14:04:00Z",
    "DataQualityLevel": 2,
    "DateCreated": "2014-11-29T05:39:00Z",
    "SubmissionStatusTypeID": 100
}