{
    "IsRecentlyVerified": false,
    "ID": 137214,
    "UUID": "17ECE17E-D947-4C95-B893-9B50A100B159",
    "DataProviderID": 2,
    "DataProvidersReference": "149020",
    "OperatorID": 39,
    "UsageTypeID": 1,
    "AddressInfo": {
        "ID": 137560,
        "Title": "FIU Engineering & Computing Campus",
        "AddressLine1": "10555 West Flagler Street",
        "Town": "Miami",
        "StateOrProvince": "FL",
        "Postcode": "33174",
        "CountryID": 2,
        "Latitude": 25.7697694,
        "Longitude": -80.3675222,
        "ContactTelephone1": "800-663-5633",
        "AccessComments": "MO: 12:00am-12:00am; TU: 12:00am-12:00am; WE: 12:00am-12:00am; TH: 12:00am-12:00am; FR: 12:00am-12:00am; SA: 12:00am-12:00am; SU: 12:00am-12:00am",
        "RelatedURL": "http://www.semacharge.com/",
        "DistanceUnit": 0
    },
    "Connections": [
        {
            "ID": 192081,
            "ConnectionTypeID": 1,
            "LevelID": 2,
            "Amps": 16,
            "Voltage": 230,
            "PowerKW": 3,
            "CurrentTypeID": 10,
            "Quantity": 1
        }
    ],
    "StatusTypeID": 50,
    "DateLastStatusUpdate": "2019-12-24T09:04:00Z",
    "DataQualityLevel": 3,
    "DateCreated": "2019-12-24T09:04:00Z",
    "SubmissionStatusTypeID": 100
}