{
    "UserComments": [
        {
            "ID": 23789,
            "ChargePointID": 172075,
            "CommentTypeID": 10,
            "UserName": "ForumElettrico.it",
            "Comment": "Una tipo 3A da 3 kW ed una tipo 2 da 22 kW, in zona Porta Romana. Leggi la recensione completa qui >  https://www.forumelettrico.it/forum/colonnine-enelx-a-viterbo-citta-piazza-vittorio-veneto-t9372.html",
            "RelatedURL": "https://www.forumelettrico.it/forum/colonnine-enelx-a-viterbo-citta-piazza-vittorio-veneto-t9372.html",
            "DateCreated": "2021-01-14T17:15:04.8Z",
            "User": {
                "ID": 11749,
                "Username": "ForumElettrico.it"
            },
            "CheckinStatusTypeID": 140,
            "IsActionedByEditor": false
        }
    ],
    "MediaItems": [
        {
            "ID": 26194,
            "ChargePointID": 172075,
            "ItemURL": "https://s3-ap-southeast-2.amazonaws.com/openchargemap/images/IT/OCM172075/OCM-172075.orig.2021011417151426.jpg",
            "ItemThumbnailURL": "https://s3-ap-southeast-2.amazonaws.com/openchargemap/images/IT/OCM172075/OCM-172075.thmb.2021011417151426.jpg",
            "Comment": "",
            "IsEnabled": true,
            "IsVideo": false,
            "IsFeaturedItem": false,
            "IsExternalResource": false,
            "User": {
                "ID": 11749,
                "Username": "ForumElettrico.it"
            },
            "DateCreated": "2021-01-14T17:15:00Z"
        }
    ],
    "IsRecentlyVerified": false,
    "ID": 172075,
    "UUID": "ED5F5418-AFB9-4060-B9AC-8DD38F545BFB",
    "DataProviderID": 1,
    "OperatorID": 80,
    "UsageTypeID": 4,
    "AddressInfo": {
        "ID": 172434,
        "Title": "Viterbo Vittorio Veneto | EnelX ",
        "AddressLine1": "Piazza Vittorio Veneto 10",
        "Town": "Viterbo",
        "StateOrProvince": "VT",
        "Postcode": "01100",
        "CountryID": 112,
        "Latitude": 42.416525,
        "Longitude": 12.112898,
        "RelatedURL": "https://www.forumelettrico.it/forum/colonnine-enelx-a-viterbo-citta-piazza-vittorio-veneto-t9372.html",
        "DistanceUnit": 0
    },
    "Connections": [
        {
            "ID": 263012,
            "ConnectionTypeID": 25,
            "StatusTypeID": 50,
            "LevelID": 2,
            "Amps": 32,
            "Voltage": 400,
            "PowerKW": 22,
            "CurrentTypeID": 20,
            "Quantity": 1
        },
        {
            "ID": 263013,
            "ConnectionTypeID": 36,
            "StatusTypeID": 50,
            "LevelID": 2,
            "Amps": 16,
            "Voltage": 240,
            "PowerKW": 3,
            "CurrentTypeID": 10,
            "Quantity": 1
        }
    ],
    "NumberOfPoints": 2,
    "StatusTypeID": 50,
    "DateLastStatusUpdate": "2021-01-15T11:36:00Z",
    "DataQualityLevel": 1,
    "DateCreated": "2021-01-14T17:15:00Z",
    "SubmissionStatusTypeID": 200
}