{
    "UserComments": [
        {
            "ID": 14431,
            "ChargePointID": 65895,
            "CommentTypeID": 10,
            "UserName": "tommy",
            "Comment": "EVolt system run by cpgenie.\nCHAdeMO working fine today.",
            "DateCreated": "2016-10-20T12:50:23.547Z",
            "User": {
                "ID": 6492,
                "Username": "tommy"
            },
            "CheckinStatusTypeID": 10
        }
    ],
    "MediaItems": [
        {
            "ID": 8468,
            "ChargePointID": 65895,
            "ItemURL": "https://s3-ap-southeast-2.amazonaws.com/openchargemap/images/GB/OCM65895/OCM-65895.orig.2016102012533201.jpg",
            "ItemThumbnailURL": "https://s3-ap-southeast-2.amazonaws.com/openchargemap/images/GB/OCM65895/OCM-65895.thmb.2016102012533201.jpg",
            "Comment": "",
            "IsEnabled": true,
            "IsVideo": false,
            "IsFeaturedItem": false,
            "IsExternalResource": false,
            "User": {
                "ID": 6492,
                "Username": "tommy"
            },
            "DateCreated": "2016-10-20T12:54:00Z"
        },
        {
            "ID": 8467,
            "ChargePointID": 65895,
            "ItemURL": "https://s3-ap-southeast-2.amazonaws.com/openchargemap/images/GB/OCM65895/OCM-65895.orig.2016102012515984.jpg",
            "ItemThumbnailURL": "https://s3-ap-southeast-2.amazonaws.com/openchargemap/images/GB/OCM65895/OCM-65895.thmb.2016102012515984.jpg",
            "Comment": "",
            "IsEnabled": true,
            "IsVideo": false,
            "IsFeaturedItem": false,
            "IsExternalResource": false,
            "User": {
                "ID": 6492,
                "Username": "tommy"
            },
            "DateCreated": "2016-10-20T12:52:00Z"
        }
    ],
    "IsRecentlyVerified": false,
    "ID": 65895,
    "UUID": "3D00B009-2DDA-48ED-AA3E-460B206319FA",
    "DataProviderID": 1,
    "OperatorID": 150,
    "OperatorsReference": "Allerdale House Workington ",
    "UsageTypeID": 4,
    "UsageCost": "1 Connection fee + 30p per kWh",
    "AddressInfo": {
        "ID": 66241,
        "Title": "Workington - Allerdale Borough Council",
        "AddressLine1": "William Street",
        "AddressLine2": "North Side",
        "Town": "Workington",
        "StateOrProvince": "Cumbria",
        "Postcode": "CA14 3YJ",
        "CountryID": 1,
        "Latitude": 54.6471677,
        "Longitude": -3.55125750000002,
        "ContactTelephone1": "01946 599208",
        "AccessComments": "£10 overstay fee after 95 mins, then £10 every subsequent 95 mins",
        "RelatedURL": "https://www.cpsgenie.com/ds",
        "DistanceUnit": 0
    },
    "Connections": [
        {
            "ID": 91081,
            "ConnectionTypeID": 2,
            "StatusTypeID": 50,
            "LevelID": 3,
            "Amps": 125,
            "Voltage": 400,
            "PowerKW": 50,
            "CurrentTypeID": 30,
            "Quantity": 1
        },
        {
            "ID": 91082,
            "ConnectionTypeID": 1036,
            "StatusTypeID": 50,
            "LevelID": 3,
            "Amps": 63,
            "Voltage": 400,
            "PowerKW": 43,
            "CurrentTypeID": 20,
            "Quantity": 1
        },
        {
            "ID": 91083,
            "ConnectionTypeID": 33,
            "StatusTypeID": 50,
            "LevelID": 3,
            "Amps": 125,
            "Voltage": 499,
            "PowerKW": 50,
            "CurrentTypeID": 30,
            "Quantity": 1
        },
        {
            "ID": 91084,
            "ConnectionTypeID": 25,
            "StatusTypeID": 50,
            "LevelID": 2,
            "Amps": 32,
            "Voltage": 230,
            "PowerKW": 7,
            "CurrentTypeID": 10,
            "Quantity": 2
        }
    ],
    "NumberOfPoints": 3,
    "StatusTypeID": 50,
    "DateLastStatusUpdate": "2020-10-04T05:12:00Z",
    "DataQualityLevel": 1,
    "DateCreated": "2016-05-04T20:39:00Z",
    "SubmissionStatusTypeID": 200
}