{
    "IsRecentlyVerified": false,
    "ID": 84133,
    "UUID": "2F729A7D-6D19-4D5D-9A25-5552C2CD376E",
    "DataProviderID": 1,
    "OperatorID": 23,
    "OperatorsReference": "24624",
    "UsageTypeID": 6,
    "AddressInfo": {
        "ID": 84479,
        "Title": "Burr Oak Ranch",
        "AddressLine1": "2716 FM 1690",
        "Town": "Lampasas",
        "StateOrProvince": "Texas",
        "Postcode": "76550",
        "CountryID": 2,
        "Latitude": 31.238307,
        "Longitude": -98.13279,
        "ContactTelephone1": "(512) 734-1432",
        "DistanceUnit": 0
    },
    "Connections": [
        {
            "ID": 119534,
            "ConnectionTypeID": 30,
            "StatusTypeID": 50,
            "LevelID": 2,
            "PowerKW": 16,
            "CurrentTypeID": 20,
            "Quantity": 1
        }
    ],
    "NumberOfPoints": 1,
    "GeneralComments": "1 Tesla Connector, up to 16kW.Available for patrons only. Please see front desk.",
    "StatusTypeID": 50,
    "DateLastStatusUpdate": "2017-02-16T16:59:00Z",
    "DataQualityLevel": 1,
    "DateCreated": "2017-02-16T16:59:00Z",
    "SubmissionStatusTypeID": 200
}