{
    "IsRecentlyVerified": false,
    "ID": 72457,
    "UUID": "E757E508-2015-4BD2-BE98-6DE4E1836386",
    "DataProviderID": 1,
    "OperatorID": 1,
    "UsageTypeID": 4,
    "AddressInfo": {
        "ID": 72803,
        "Title": "Rathaus",
        "AddressLine1": "Lange Straße 72",
        "Town": "Lage",
        "StateOrProvince": "Kreis Lippe",
        "Postcode": "32791",
        "CountryID": 87,
        "Latitude": 51.99035,
        "Longitude": 8.79245000000003,
        "AccessComments": "Grüne Ladesäule am Rathaus. Zum Laden ist eine Freischaltung per App nötig. Weitere Details  unbekannt, siehe Artikel",
        "RelatedURL": "http://www.lz.de/lippe/lage/20947193_Neue-Ladestation-fuer-E-Autos-eingeweiht.html",
        "DistanceUnit": 0
    },
    "Connections": [
        {
            "ID": 103837,
            "ConnectionTypeID": 25,
            "StatusTypeID": 50,
            "LevelID": 2,
            "Amps": 32,
            "Voltage": 400,
            "PowerKW": 22,
            "CurrentTypeID": 20,
            "Quantity": 2
        }
    ],
    "NumberOfPoints": 2,
    "StatusTypeID": 50,
    "DateLastStatusUpdate": "2016-10-17T06:54:00Z",
    "DataQualityLevel": 1,
    "DateCreated": "2016-10-17T06:54:00Z",
    "SubmissionStatusTypeID": 200
}