{
    "IsRecentlyVerified": false,
    "ID": 112144,
    "UUID": "F5D9129D-CC5F-4369-B439-DE6A8C56BAAD",
    "DataProviderID": 2,
    "DataProvidersReference": "84670",
    "UsageTypeID": 2,
    "AddressInfo": {
        "ID": 112490,
        "Title": "Impark",
        "AddressLine1": "222 3rd Ave SW",
        "Town": "Calgary",
        "StateOrProvince": "AB",
        "Postcode": "T2P 0B4",
        "CountryID": 44,
        "Latitude": 51.050575,
        "Longitude": -114.066221,
        "ContactTelephone1": "",
        "AccessComments": "For tenant use only",
        "RelatedURL": "",
        "DistanceUnit": 0
    },
    "Connections": [
        {
            "ID": 157695,
            "ConnectionTypeID": 1,
            "LevelID": 2,
            "Amps": 16,
            "Voltage": 230,
            "PowerKW": 3.7,
            "CurrentTypeID": 10,
            "Quantity": 2
        }
    ],
    "DateLastStatusUpdate": "2020-06-26T03:12:00Z",
    "DataQualityLevel": 3,
    "DateCreated": "2018-10-18T23:37:00Z",
    "SubmissionStatusTypeID": 100
}