{
    "IsRecentlyVerified": false,
    "ID": 178450,
    "UUID": "4F652AEC-0226-4391-B516-CDC74A30F301",
    "DataProviderID": 29,
    "DataProvidersReference": "17075",
    "AddressInfo": {
        "ID": 178809,
        "Title": "Möhnestr. 54",
        "AddressLine1": "Möhnestr. 54",
        "Town": "Brilon",
        "Postcode": "59929",
        "CountryID": 87,
        "Latitude": 51.40768,
        "Longitude": 8.57485,
        "DistanceUnit": 0
    },
    "Connections": [
        {
            "ID": 278873,
            "ConnectionTypeID": 28,
            "StatusTypeID": 50,
            "LevelID": 2,
            "PowerKW": 22,
            "CurrentTypeID": 20
        },
        {
            "ID": 278874,
            "ConnectionTypeID": 25,
            "StatusTypeID": 50,
            "LevelID": 2,
            "PowerKW": 22,
            "CurrentTypeID": 20
        },
        {
            "ID": 299303,
            "ConnectionTypeID": 28,
            "StatusTypeID": 50,
            "LevelID": 2,
            "PowerKW": 22,
            "CurrentTypeID": 20
        },
        {
            "ID": 299304,
            "ConnectionTypeID": 25,
            "StatusTypeID": 50,
            "LevelID": 2,
            "PowerKW": 22,
            "CurrentTypeID": 20
        }
    ],
    "StatusTypeID": 0,
    "DateLastStatusUpdate": "2021-07-12T02:47:00Z",
    "MetadataValues": [
        {
            "ID": 10744,
            "MetadataFieldID": 4,
            "ItemValue": "Data from the German chargepoint registry provided by Bundesnetzagentur.de under the CC-BY 4.0 license"
        }
    ],
    "DataQualityLevel": 3,
    "DateCreated": "2021-07-08T09:50:00Z",
    "SubmissionStatusTypeID": 100
}