{
    "UserComments": [
        {
            "ID": 14399,
            "ChargePointID": 22575,
            "CommentTypeID": 10,
            "UserName": "Margaret K",
            "Comment": "",
            "DateCreated": "2016-10-15T10:28:53.823Z",
            "User": {
                "ID": 6348,
                "Username": "Margaret K"
            },
            "CheckinStatusTypeID": 10
        },
        {
            "ID": 10483,
            "ChargePointID": 22575,
            "CommentTypeID": 10,
            "UserName": "Robert Malcolm Kay",
            "Comment": "CYC informed of this error, seems to be the same problem as new Cumnock",
            "DateCreated": "2016-05-24T16:50:28.027Z",
            "User": {
                "ID": 4751,
                "Username": "Robert Malcolm Kay"
            },
            "CheckinStatusTypeID": 25
        },
        {
            "ID": 6736,
            "ChargePointID": 22575,
            "CommentTypeID": 10,
            "UserName": "Anon74856763534",
            "Comment": "Charger has been replaced by new RC unit. Not powered yet.",
            "DateCreated": "2015-10-09T17:27:44.52Z",
            "User": {
                "ID": 1192,
                "Username": "Anon74856763534"
            },
            "CheckinStatusTypeID": 0
        },
        {
            "ID": 1361,
            "ChargePointID": 22575,
            "CommentTypeID": 1000,
            "UserName": "desreid",
            "Comment": "Attempted to charge here late September 2014. A fault was showing on the screen of the charger. Dalmellington seems to have no mobile phone signal at all, so this could be the cause.",
            "Rating": 2,
            "DateCreated": "2014-11-06T18:09:02.243Z",
            "User": {
                "ID": 2375,
                "Username": "desreid"
            },
            "CheckinStatusTypeID": 25
        }
    ],
    "MediaItems": [
        {
            "ID": 3369,
            "ChargePointID": 22575,
            "ItemURL": "https://s3-ap-southeast-2.amazonaws.com/openchargemap/images/GB/OCM22575/OCM-22575.orig.2015100917360174.jpg",
            "ItemThumbnailURL": "https://s3-ap-southeast-2.amazonaws.com/openchargemap/images/GB/OCM22575/OCM-22575.thmb.2015100917360174.jpg",
            "Comment": "",
            "IsEnabled": true,
            "IsVideo": false,
            "IsFeaturedItem": false,
            "IsExternalResource": false,
            "User": {
                "ID": 1192,
                "Username": "Anon74856763534"
            },
            "DateCreated": "2015-10-09T17:36:00Z"
        }
    ],
    "IsRecentlyVerified": false,
    "ID": 22575,
    "UUID": "46BAD1D9-ECB6-458D-969B-D8573B8F4904",
    "DataProviderID": 1,
    "OperatorID": 3315,
    "OperatorsReference": "51170",
    "UsageTypeID": 4,
    "UsageCost": "Free",
    "AddressInfo": {
        "ID": 22920,
        "Title": "Dalmellington Area Centre",
        "AddressLine1": "Main Street",
        "Town": "Dalmellington",
        "StateOrProvince": "East Ayrshire",
        "Postcode": "KA6 7QL",
        "CountryID": 1,
        "Latitude": 55.32361,
        "Longitude": -4.40035,
        "ContactTelephone1": "01912 650 500",
        "AccessComments": "Post owner: East Ayrshire Council. Access: 24 hour ",
        "DistanceUnit": 0
    },
    "Connections": [
        {
            "ID": 24256,
            "ConnectionTypeID": 33,
            "StatusTypeID": 100,
            "LevelID": 3,
            "PowerKW": 50,
            "CurrentTypeID": 30,
            "Quantity": 1
        },
        {
            "ID": 69489,
            "ConnectionTypeID": 2,
            "StatusTypeID": 50,
            "LevelID": 3,
            "PowerKW": 50,
            "CurrentTypeID": 30,
            "Quantity": 1
        },
        {
            "ID": 69490,
            "ConnectionTypeID": 1036,
            "StatusTypeID": 50,
            "LevelID": 3,
            "Voltage": 400,
            "PowerKW": 43,
            "CurrentTypeID": 20,
            "Quantity": 1
        }
    ],
    "NumberOfPoints": 2,
    "StatusTypeID": 50,
    "DateLastStatusUpdate": "2020-01-28T06:15:00Z",
    "MetadataValues": [
        {
            "ID": 562,
            "MetadataFieldID": 4,
            "ItemValue": "Contains public sector information licensed under the Open Government Licence v2.0. http://www.nationalarchives.gov.uk/doc/open-government-licence/version/2/"
        }
    ],
    "DataQualityLevel": 3,
    "DateCreated": "2014-03-22T08:41:00Z",
    "SubmissionStatusTypeID": 100
}