{
    "IsRecentlyVerified": false,
    "ID": 56861,
    "UUID": "0D0FCE0D-772A-40E0-8675-2844B741D9E7",
    "DataProviderID": 1,
    "OperatorID": 80,
    "UsageTypeID": 4,
    "UsageCost": "0,40 €/kW",
    "AddressInfo": {
        "ID": 57207,
        "Title": "Eneldrive Municipio di Minervino",
        "AddressLine1": "Via Duca degli Abruzzi 21",
        "Town": "Minervino di Lecce",
        "StateOrProvince": "LE",
        "Postcode": "73027",
        "CountryID": 112,
        "Latitude": 40.0922867680348,
        "Longitude": 18.4198806165502,
        "RelatedURL": "http://eneldrive.it",
        "DistanceUnit": 0
    },
    "Connections": [
        {
            "ID": 71763,
            "ConnectionTypeID": 25,
            "StatusTypeID": 50,
            "LevelID": 2,
            "Amps": 32,
            "Voltage": 400,
            "PowerKW": 22,
            "CurrentTypeID": 20,
            "Quantity": 1
        },
        {
            "ID": 71764,
            "ConnectionTypeID": 36,
            "StatusTypeID": 50,
            "LevelID": 2,
            "Amps": 16,
            "Voltage": 240,
            "PowerKW": 3.7,
            "CurrentTypeID": 10,
            "Quantity": 1
        }
    ],
    "NumberOfPoints": 1,
    "GeneralComments": "Attenzione - non accessibile durante il periodo dei Mercatini di Natale",
    "StatusTypeID": 50,
    "DateLastStatusUpdate": "2016-05-15T16:39:00Z",
    "DataQualityLevel": 1,
    "DateCreated": "2015-11-13T16:46:00Z",
    "SubmissionStatusTypeID": 200
}