{
    "IsRecentlyVerified": false,
    "ID": 184158,
    "UUID": "D7CFDE9B-024E-4A7D-A209-04B5DC625171",
    "DataProviderID": 29,
    "DataProvidersReference": "8232",
    "OperatorID": 127,
    "AddressInfo": {
        "ID": 184517,
        "Title": "Elberger Straße 4",
        "AddressLine1": "Elberger Straße 4",
        "Town": "Löningen",
        "Postcode": "49624",
        "CountryID": 87,
        "Latitude": 52.73684,
        "Longitude": 7.75634999999999,
        "DistanceUnit": 0
    },
    "Connections": [
        {
            "ID": 292039,
            "ConnectionTypeID": 25,
            "StatusTypeID": 50,
            "LevelID": 2,
            "PowerKW": 22,
            "CurrentTypeID": 20
        },
        {
            "ID": 292040,
            "ConnectionTypeID": 25,
            "StatusTypeID": 50,
            "LevelID": 2,
            "PowerKW": 22,
            "CurrentTypeID": 20
        }
    ],
    "StatusTypeID": 50,
    "DateLastStatusUpdate": "2021-07-12T02:50:00Z",
    "MetadataValues": [
        {
            "ID": 16450,
            "MetadataFieldID": 4,
            "ItemValue": "Data from the German chargepoint registry provided by Bundesnetzagentur.de under the CC-BY 4.0 license"
        }
    ],
    "DataQualityLevel": 3,
    "DateCreated": "2021-07-08T10:05:00Z",
    "SubmissionStatusTypeID": 100
}