{
    "IsRecentlyVerified": false,
    "ID": 97377,
    "UUID": "D8884CDB-3517-4945-8886-59DF95930EFD",
    "DataProviderID": 1,
    "OperatorID": 23,
    "OperatorsReference": "38560",
    "UsageTypeID": 4,
    "AddressInfo": {
        "ID": 97723,
        "Title": "Hotel H10 Puerta de Alcalá",
        "AddressLine1": "Calle de Alcala 66",
        "Town": "Madrid",
        "StateOrProvince": "Madrid",
        "Postcode": "28009",
        "CountryID": 210,
        "Latitude": 40.4221803433862,
        "Longitude": -3.68110131093329,
        "ContactTelephone1": "+34 91 435 10 60",
        "DistanceUnit": 0
    },
    "Connections": [
        {
            "ID": 138284,
            "ConnectionTypeID": 30,
            "StatusTypeID": 50,
            "LevelID": 2,
            "Amps": 32,
            "Voltage": 230,
            "PowerKW": 7,
            "CurrentTypeID": 10,
            "Quantity": 1
        }
    ],
    "NumberOfPoints": 1,
    "GeneralComments": "1 Tesla Connector, up to 7kW.Available for customers. Please see front desk.",
    "StatusTypeID": 50,
    "DateLastStatusUpdate": "2020-08-17T12:14:00Z",
    "DataQualityLevel": 1,
    "DateCreated": "2018-01-21T15:16:00Z",
    "SubmissionStatusTypeID": 200
}