{
    "IsRecentlyVerified": false,
    "ID": 116781,
    "UUID": "62FEB36E-9F5A-4883-932D-9F21BAD337FC",
    "DataProviderID": 1,
    "OperatorID": 23,
    "OperatorsReference": "48772",
    "UsageTypeID": 4,
    "AddressInfo": {
        "ID": 117127,
        "Title": "Melka Estate & Winery",
        "AddressLine1": "2900 Silverado TRL N",
        "Town": "Saint Helena",
        "StateOrProvince": "California",
        "Postcode": "94574",
        "CountryID": 2,
        "Latitude": 34.689229,
        "Longitude": -83.712148,
        "ContactTelephone1": "(707) 963-6008",
        "DistanceUnit": 0
    },
    "Connections": [
        {
            "ID": 165334,
            "ConnectionTypeID": 30,
            "StatusTypeID": 50,
            "LevelID": 2,
            "PowerKW": 16,
            "CurrentTypeID": 20,
            "Quantity": 2
        }
    ],
    "NumberOfPoints": 2,
    "GeneralComments": "2 Tesla Connectors, up to 16kW.Available for customers. Please call ahead.",
    "StatusTypeID": 50,
    "DateLastStatusUpdate": "2019-02-12T11:28:00Z",
    "DataQualityLevel": 1,
    "DateCreated": "2019-02-12T11:28:00Z",
    "SubmissionStatusTypeID": 200
}