{
    "IsRecentlyVerified": false,
    "ID": 105284,
    "UUID": "C27CD5A6-4C84-48CB-9E27-85C5DFB56E8D",
    "DataProviderID": 1,
    "OperatorID": 3261,
    "UsageTypeID": 4,
    "AddressInfo": {
        "ID": 105630,
        "Title": "Rasthof Luzern Neuenkirch Ost",
        "AddressLine1": "A2",
        "Town": "Rothenburg",
        "StateOrProvince": "Luzern",
        "Postcode": "6023",
        "CountryID": 217,
        "Latitude": 47.11339610139057,
        "Longitude": 8.232353608459448,
        "AccessComments": "24/7 open",
        "RelatedURL": "http://www.ionity.eu/",
        "DistanceUnit": 0
    },
    "Connections": [
        {
            "ID": 148427,
            "ConnectionTypeID": 33,
            "StatusTypeID": 50,
            "LevelID": 3,
            "PowerKW": 350,
            "CurrentTypeID": 30,
            "Quantity": 6
        }
    ],
    "NumberOfPoints": 6,
    "StatusTypeID": 50,
    "DateLastStatusUpdate": "2018-06-04T07:28:00Z",
    "DataQualityLevel": 1,
    "DateCreated": "2018-06-04T07:28:00Z",
    "SubmissionStatusTypeID": 200
}