{
    "IsRecentlyVerified": false,
    "ID": 133850,
    "UUID": "A288823B-17B1-4C00-8C47-84D4104005A5",
    "DataProviderID": 1,
    "OperatorID": 20,
    "UsageTypeID": 1,
    "UsageCost": "£0.35/kWh",
    "AddressInfo": {
        "ID": 134196,
        "Title": "Northumberlandia",
        "AddressLine1": "Northumberlandia Car Park",
        "AddressLine2": "Fisher Lane",
        "Town": "Cramlington",
        "StateOrProvince": "Northumberland",
        "Postcode": "NE23 8AU",
        "CountryID": 1,
        "Latitude": 55.0855376441181,
        "Longitude": -1.63126035821733,
        "AccessComments": "Available opening hours only: dawn to dusk. Visitors centre, café and toilets: Th-Su 1000-1600 through the winter months",
        "DistanceUnit": 0
    },
    "Connections": [
        {
            "ID": 187311,
            "ConnectionTypeID": 33,
            "StatusTypeID": 50,
            "LevelID": 3,
            "PowerKW": 50,
            "CurrentTypeID": 30,
            "Quantity": 1
        },
        {
            "ID": 187312,
            "ConnectionTypeID": 2,
            "StatusTypeID": 50,
            "LevelID": 3,
            "PowerKW": 50,
            "CurrentTypeID": 30,
            "Quantity": 1
        },
        {
            "ID": 187313,
            "ConnectionTypeID": 1036,
            "StatusTypeID": 50,
            "LevelID": 3,
            "Amps": 63,
            "Voltage": 400,
            "PowerKW": 43,
            "CurrentTypeID": 20,
            "Quantity": 1
        }
    ],
    "NumberOfPoints": 1,
    "GeneralComments": "In car park for Northumberlandia attraction.",
    "StatusTypeID": 50,
    "DateLastStatusUpdate": "2021-04-04T18:38:00Z",
    "DataQualityLevel": 1,
    "DateCreated": "2019-10-28T17:20:00Z",
    "SubmissionStatusTypeID": 200
}