{
    "IsRecentlyVerified": false,
    "ID": 15986,
    "UUID": "C91296B9-4189-4568-A901-FCFBC1E930A4",
    "DataProviderID": 2,
    "DataProvidersReference": "50684",
    "OperatorID": 5,
    "UsageTypeID": 1,
    "AddressInfo": {
        "ID": 16331,
        "Title": "CITY OF GR PARK",
        "AddressLine1": "1900 Oak Industrial Dr NE",
        "Town": "Grand Rapids",
        "StateOrProvince": "MI",
        "Postcode": "49505",
        "CountryID": 2,
        "Latitude": 42.9747246,
        "Longitude": -85.6206893,
        "ContactTelephone1": "888-758-4389",
        "AccessComments": "24 hours daily",
        "RelatedURL": "http://www.chargepoint.com/",
        "DistanceUnit": 0
    },
    "Connections": [
        {
            "ID": 14366,
            "ConnectionTypeID": 1,
            "LevelID": 2,
            "Amps": 16,
            "Voltage": 230,
            "PowerKW": 3.7,
            "CurrentTypeID": 10,
            "Quantity": 2
        },
        {
            "ID": 22090,
            "ConnectionTypeID": 1,
            "LevelID": 2,
            "Quantity": 2
        }
    ],
    "DateLastStatusUpdate": "2020-06-26T03:06:00Z",
    "DataQualityLevel": 3,
    "DateCreated": "2013-02-18T06:15:00Z",
    "SubmissionStatusTypeID": 100
}