{
    "IsRecentlyVerified": false,
    "ID": 84561,
    "UUID": "80D8F58A-3FED-4CF2-B04F-75D45BDA2665",
    "DataProviderID": 1,
    "OperatorID": 23,
    "OperatorsReference": "25337",
    "UsageTypeID": 4,
    "AddressInfo": {
        "ID": 84907,
        "Title": "Kayenta Coyote Gulch Art Village",
        "AddressLine1": "875 Coyote Gulch CT",
        "Town": "Ivins",
        "StateOrProvince": "Utah",
        "Postcode": "84738",
        "CountryID": 2,
        "Latitude": 37.185035,
        "Longitude": -113.706455,
        "ContactTelephone1": "(435) 688-8535",
        "DistanceUnit": 0
    },
    "Connections": [
        {
            "ID": 120119,
            "ConnectionTypeID": 30,
            "StatusTypeID": 50,
            "LevelID": 2,
            "PowerKW": 8,
            "CurrentTypeID": 10,
            "Quantity": 2
        }
    ],
    "NumberOfPoints": 2,
    "GeneralComments": "2 Tesla Connectors, up to 8kW.Available to the public. Self park.",
    "StatusTypeID": 50,
    "DateLastStatusUpdate": "2017-06-09T13:23:00Z",
    "DataQualityLevel": 1,
    "DateCreated": "2017-03-03T06:39:00Z",
    "SubmissionStatusTypeID": 200
}