{
    "MediaItems": [
        {
            "ID": 13843,
            "ChargePointID": 96447,
            "ItemURL": "https://s3-ap-southeast-2.amazonaws.com/openchargemap/images/BA/OCM96447/OCM-96447.orig.2017122811490190.jpg",
            "ItemThumbnailURL": "https://s3-ap-southeast-2.amazonaws.com/openchargemap/images/BA/OCM96447/OCM-96447.thmb.2017122811490190.jpg",
            "Comment": "",
            "IsEnabled": true,
            "IsVideo": false,
            "IsFeaturedItem": false,
            "IsExternalResource": false,
            "User": {
                "ID": 16809,
                "Username": "termag "
            },
            "DateCreated": "2017-12-28T11:49:00Z"
        }
    ],
    "IsRecentlyVerified": false,
    "ID": 96447,
    "UUID": "E3DD967D-BCC9-416A-9C87-55521B06724D",
    "DataProviderID": 1,
    "UsageTypeID": 5,
    "AddressInfo": {
        "ID": 96793,
        "Title": "Hotel Termag Jahorina",
        "AddressLine1": "Olimpijska 4",
        "AddressLine2": "Olimpijska 4",
        "Town": "Jahorina",
        "StateOrProvince": "Pale municipality",
        "Postcode": "71423",
        "CountryID": 33,
        "Latitude": 43.7353859568588,
        "Longitude": 18.568011332788,
        "ContactTelephone1": "+387 57 270 422",
        "ContactTelephone2": "+387 57 272 100",
        "ContactEmail": "info@termaghotel.com",
        "AccessComments": "Hotel Termag Jahorina",
        "RelatedURL": "https://www.termaghotel.com",
        "DistanceUnit": 0
    },
    "Connections": [
        {
            "ID": 136705,
            "ConnectionTypeID": 25,
            "StatusTypeID": 50,
            "LevelID": 2,
            "PowerKW": 22,
            "CurrentTypeID": 20,
            "Quantity": 1
        }
    ],
    "NumberOfPoints": 1,
    "StatusTypeID": 50,
    "DateLastStatusUpdate": "2019-06-03T12:33:00Z",
    "DataQualityLevel": 1,
    "DateCreated": "2017-12-28T11:44:00Z",
    "SubmissionStatusTypeID": 200
}