{
    "IsRecentlyVerified": false,
    "ID": 160487,
    "UUID": "3A73F69C-7791-4375-8EA4-72F1B07E86DA",
    "DataProviderID": 2,
    "DataProvidersReference": "153614",
    "OperatorID": 59,
    "UsageTypeID": 1,
    "AddressInfo": {
        "ID": 160844,
        "Title": "Electric Vehicle Infrastructure Transportation Alliance - Prosser",
        "AddressLine1": "40 Merlot Dr",
        "Town": "Prosser",
        "StateOrProvince": "WA",
        "Postcode": "99350",
        "CountryID": 2,
        "Latitude": 46.219978,
        "Longitude": -119.785172,
        "ContactTelephone1": "888-758-4389",
        "AccessComments": "24 hours daily",
        "RelatedURL": "http://greenlots.com/",
        "DistanceUnit": 0
    },
    "Connections": [
        {
            "ID": 230911,
            "ConnectionTypeID": 1,
            "LevelID": 2,
            "Amps": 16,
            "Voltage": 230,
            "PowerKW": 3.7,
            "CurrentTypeID": 10,
            "Quantity": 1
        },
        {
            "ID": 230912,
            "ConnectionTypeID": 2,
            "LevelID": 3,
            "Amps": 100,
            "Voltage": 400,
            "PowerKW": 40,
            "CurrentTypeID": 30,
            "Quantity": 1
        },
        {
            "ID": 230913,
            "ConnectionTypeID": 32,
            "LevelID": 3,
            "Amps": 100,
            "Voltage": 400,
            "PowerKW": 40,
            "CurrentTypeID": 30,
            "Quantity": 1
        }
    ],
    "StatusTypeID": 50,
    "DateLastStatusUpdate": "2020-06-26T03:10:00Z",
    "DataQualityLevel": 3,
    "DateCreated": "2020-06-26T03:10:00Z",
    "SubmissionStatusTypeID": 100
}