{
    "IsRecentlyVerified": false,
    "ID": 183685,
    "UUID": "16CD84B4-05C8-4236-9766-050ED8A2D8BB",
    "DataProviderID": 29,
    "DataProvidersReference": "19488",
    "OperatorID": 69,
    "AddressInfo": {
        "ID": 184044,
        "Title": "Rekener Straße",
        "AddressLine1": "Rekener Straße",
        "Town": "Coesfeld",
        "Postcode": "48653",
        "CountryID": 87,
        "Latitude": 51.942151,
        "Longitude": 7.161943,
        "DistanceUnit": 0
    },
    "Connections": [
        {
            "ID": 290970,
            "ConnectionTypeID": 25,
            "StatusTypeID": 50,
            "LevelID": 2,
            "PowerKW": 22,
            "CurrentTypeID": 20
        },
        {
            "ID": 290971,
            "ConnectionTypeID": 25,
            "StatusTypeID": 50,
            "LevelID": 2,
            "PowerKW": 22,
            "CurrentTypeID": 20
        }
    ],
    "StatusTypeID": 50,
    "DateLastStatusUpdate": "2021-07-09T03:25:00Z",
    "MetadataValues": [
        {
            "ID": 15978,
            "MetadataFieldID": 4,
            "ItemValue": "Data from the German chargepoint registry provided by Bundesnetzagentur.de under the CC-BY 4.0 license"
        }
    ],
    "DataQualityLevel": 3,
    "DateCreated": "2021-07-08T10:04:00Z",
    "SubmissionStatusTypeID": 100
}