{
    "IsRecentlyVerified": false,
    "ID": 109190,
    "UUID": "BC6E5B6B-B27F-4E9D-B426-7C2C2CE24362",
    "DataProviderID": 1,
    "OperatorID": 23,
    "OperatorsReference": "46480",
    "UsageTypeID": 4,
    "AddressInfo": {
        "ID": 109536,
        "Title": "Santa Fe Motel",
        "AddressLine1": "510 Cerrillos RD",
        "Town": "Santa Fe",
        "StateOrProvince": "New Mexico",
        "Postcode": "87501",
        "CountryID": 2,
        "Latitude": 35.682345,
        "Longitude": -105.945457,
        "ContactTelephone1": "(505) 982-1039",
        "DistanceUnit": 0
    },
    "Connections": [
        {
            "ID": 154308,
            "ConnectionTypeID": 30,
            "StatusTypeID": 50,
            "LevelID": 2,
            "PowerKW": 16,
            "CurrentTypeID": 20,
            "Quantity": 2
        }
    ],
    "NumberOfPoints": 2,
    "GeneralComments": "2 Tesla Connectors, up to 16kW.Seasonal Availability Please call ahead.",
    "StatusTypeID": 50,
    "DateLastStatusUpdate": "2018-10-11T13:53:00Z",
    "DataQualityLevel": 1,
    "DateCreated": "2018-10-11T13:53:00Z",
    "SubmissionStatusTypeID": 200
}