{
    "IsRecentlyVerified": false,
    "ID": 79390,
    "UUID": "F37120F9-5029-48FC-A7A1-47D8A06FB102",
    "DataProviderID": 1,
    "OperatorID": 23,
    "OperatorsReference": "7589",
    "UsageTypeID": 4,
    "UsageCost": "$0.44/min >=60kW; $0.22/min <60kW; other tariffs for older cars",
    "AddressInfo": {
        "ID": 79736,
        "Title": "Barrie Supercharger",
        "AddressLine1": "100 Mapleview Drive East",
        "Town": "Barrie",
        "StateOrProvince": "ON",
        "Postcode": "L4N 9H6",
        "CountryID": 44,
        "Latitude": 44.341123,
        "Longitude": -79.678975,
        "DistanceUnit": 0
    },
    "Connections": [
        {
            "ID": 114029,
            "ConnectionTypeID": 27,
            "StatusTypeID": 50,
            "LevelID": 3,
            "Voltage": 400,
            "PowerKW": 120,
            "CurrentTypeID": 30,
            "Quantity": 8
        }
    ],
    "NumberOfPoints": 8,
    "GeneralComments": "8 Superchargers, available 24/7",
    "StatusTypeID": 50,
    "DateLastStatusUpdate": "2021-01-04T13:31:00Z",
    "DataQualityLevel": 1,
    "DateCreated": "2017-01-29T16:18:00Z",
    "SubmissionStatusTypeID": 200
}