{
    "IsRecentlyVerified": false,
    "ID": 92160,
    "UUID": "8A216EA4-DC40-4A2F-B17E-DF8CEF336ED5",
    "DataProviderID": 1,
    "OperatorID": 45,
    "UsageTypeID": 6,
    "AddressInfo": {
        "ID": 92506,
        "Title": "Hotel The Westin Bellevue",
        "AddressLine1": "Große Meißner Straße 15",
        "Town": "Dresden",
        "StateOrProvince": "Sachsen",
        "Postcode": "01097",
        "CountryID": 87,
        "Latitude": 51.05858285726978,
        "Longitude": 13.738414764149738,
        "ContactTelephone1": "+49 351-805-0",
        "AccessComments": "Für Hotelgäste kostenlos; PIN für die Säule an der Rezeption. Säule am Taxenstand vor dem Haupteingang.",
        "RelatedURL": "http://www.westin-dresden.de/",
        "DistanceUnit": 0
    },
    "Connections": [
        {
            "ID": 130664,
            "ConnectionTypeID": 25,
            "StatusTypeID": 50,
            "LevelID": 2,
            "Amps": 32,
            "Voltage": 400,
            "PowerKW": 22,
            "CurrentTypeID": 20,
            "Quantity": 1
        }
    ],
    "NumberOfPoints": 1,
    "StatusTypeID": 50,
    "DateLastStatusUpdate": "2017-08-29T13:06:00Z",
    "DataQualityLevel": 1,
    "DateCreated": "2017-08-29T13:06:00Z",
    "SubmissionStatusTypeID": 200
}