{
    "IsRecentlyVerified": false,
    "ID": 164001,
    "UUID": "F49856C7-C875-42AC-9297-3BE1BE76285F",
    "DataProviderID": 1,
    "OperatorID": 23,
    "OperatorsReference": "40589",
    "UsageTypeID": 4,
    "AddressInfo": {
        "ID": 164360,
        "Title": "Majestic Hotel & Spa Barcelona GL",
        "AddressLine1": "Passeig de Gracia",
        "Town": "68",
        "StateOrProvince": "Barcelona",
        "Postcode": "8007",
        "CountryID": 210,
        "Latitude": 41.393632,
        "Longitude": 2.164516,
        "ContactTelephone1": "+34 934 881 717",
        "DistanceUnit": 0
    },
    "Connections": [
        {
            "ID": 235599,
            "ConnectionTypeID": 30,
            "StatusTypeID": 50,
            "LevelID": 2,
            "PowerKW": 22,
            "CurrentTypeID": 20,
            "Quantity": 1
        }
    ],
    "NumberOfPoints": 1,
    "GeneralComments": "1 Tesla Connector, up to 22kW.Available for customers. Please see front desk.",
    "StatusTypeID": 50,
    "DateLastStatusUpdate": "2020-08-24T23:55:00Z",
    "DataQualityLevel": 1,
    "DateCreated": "2020-08-24T23:55:00Z",
    "SubmissionStatusTypeID": 200
}