{
    "IsRecentlyVerified": false,
    "ID": 121879,
    "UUID": "2D0686CD-72BF-4659-BA05-756716970963",
    "DataProviderID": 2,
    "DataProvidersReference": "71444",
    "UsageTypeID": 1,
    "AddressInfo": {
        "ID": 122225,
        "Title": "Marymount College at San Pedro",
        "AddressLine1": "1600 Palos Verdes Dr N",
        "Town": "San Pedro",
        "StateOrProvince": "CA",
        "Postcode": "90710",
        "CountryID": 2,
        "Latitude": 33.778041,
        "Longitude": -118.304893,
        "ContactTelephone1": "310-377-5501",
        "AccessComments": "24 hours daily",
        "RelatedURL": "",
        "DistanceUnit": 0
    },
    "Connections": [
        {
            "ID": 171714,
            "ConnectionTypeID": 1,
            "LevelID": 2,
            "Amps": 16,
            "Voltage": 230,
            "PowerKW": 3.7,
            "CurrentTypeID": 10,
            "Quantity": 3
        }
    ],
    "DateLastStatusUpdate": "2020-06-26T02:56:00Z",
    "DataQualityLevel": 3,
    "DateCreated": "2019-04-06T05:02:00Z",
    "SubmissionStatusTypeID": 100
}