{
    "IsRecentlyVerified": false,
    "ID": 112162,
    "UUID": "71CFF4A5-CECE-44C6-8C00-3621931063B3",
    "DataProviderID": 1,
    "OperatorID": 51,
    "UsageTypeID": 1,
    "AddressInfo": {
        "ID": 112508,
        "Title": "Confederation Inn",
        "AddressLine1": "3330 Fairlight Dr",
        "Town": "Saskatoon",
        "StateOrProvince": "SK",
        "Postcode": "S7M 3Y4",
        "CountryID": 44,
        "Latitude": 52.127842,
        "Longitude": -106.725222,
        "ContactTelephone1": "800-265-3358",
        "AccessComments": "24 hours daily",
        "RelatedURL": "http://suncountryhighway.com/",
        "DistanceUnit": 0
    },
    "Connections": [
        {
            "ID": 157713,
            "ConnectionTypeID": 1,
            "LevelID": 2,
            "Amps": 30,
            "Voltage": 208,
            "PowerKW": 6.6,
            "CurrentTypeID": 10,
            "Quantity": 1
        }
    ],
    "DateLastStatusUpdate": "2021-02-16T08:21:00Z",
    "DataQualityLevel": 3,
    "DateCreated": "2018-10-18T23:37:00Z",
    "SubmissionStatusTypeID": 100
}