{
    "IsRecentlyVerified": false,
    "ID": 158591,
    "UUID": "1C9F686D-BD42-4B2D-BB0C-8167420E5A62",
    "DataProviderID": 2,
    "DataProvidersReference": "158519",
    "OperatorID": 59,
    "UsageTypeID": 1,
    "AddressInfo": {
        "ID": 158948,
        "Title": "Greenlots - 12531A",
        "AddressLine1": "18220 Western Ave",
        "Town": "Los Angeles",
        "StateOrProvince": "CA",
        "Postcode": "90248",
        "CountryID": 2,
        "Latitude": 33.8648262023926,
        "Longitude": -118.309020996094,
        "ContactTelephone1": "855-900-7584",
        "AccessComments": "24 hours daily",
        "RelatedURL": "http://greenlots.com/",
        "DistanceUnit": 0
    },
    "Connections": [
        {
            "ID": 228601,
            "ConnectionTypeID": 1,
            "LevelID": 2,
            "Amps": 16,
            "Voltage": 230,
            "PowerKW": 3.7,
            "CurrentTypeID": 10,
            "Quantity": 1
        }
    ],
    "StatusTypeID": 50,
    "DateLastStatusUpdate": "2020-06-26T02:56:00Z",
    "DataQualityLevel": 3,
    "DateCreated": "2020-06-26T02:56:00Z",
    "SubmissionStatusTypeID": 100
}