{
    "IsRecentlyVerified": false,
    "ID": 140185,
    "UUID": "356C9A3C-6A2A-4F4B-9470-4B3B57D2C405",
    "DataProviderID": 2,
    "DataProvidersReference": "95586",
    "OperatorID": 9,
    "UsageTypeID": 2,
    "AddressInfo": {
        "ID": 140537,
        "Title": "525 N Tryon Street Garage",
        "AddressLine1": "525 N. Tryon Street",
        "Town": "Charlotte",
        "StateOrProvince": "NC",
        "Postcode": "28202",
        "CountryID": 2,
        "Latitude": 35.231197,
        "Longitude": -80.838546,
        "ContactTelephone1": "888-998-2546",
        "AccessComments": "MON: 24 hours | TUE: 24 hours | WED: 24 hours | THU: 24 hours | FRI: 24 hours | SAT: 24 hours | SUN: 24 hours",
        "RelatedURL": "http://www.blinkcharging.com/",
        "DistanceUnit": 0
    },
    "Connections": [
        {
            "ID": 195753,
            "ConnectionTypeID": 1,
            "LevelID": 2,
            "Amps": 16,
            "Voltage": 230,
            "PowerKW": 3.7,
            "CurrentTypeID": 10,
            "Quantity": 2
        }
    ],
    "StatusTypeID": 50,
    "DateLastStatusUpdate": "2020-06-26T02:58:00Z",
    "DataQualityLevel": 3,
    "DateCreated": "2019-12-24T09:12:00Z",
    "SubmissionStatusTypeID": 100
}