{
    "IsRecentlyVerified": false,
    "ID": 94331,
    "UUID": "0344B587-5221-40CA-A38A-1723F0F05740",
    "DataProviderID": 2,
    "DataProvidersReference": "87432",
    "OperatorID": 5,
    "UsageTypeID": 1,
    "AddressInfo": {
        "ID": 94677,
        "Title": "EVERGY",
        "AddressLine1": "8940 N Chestnut Ave @ Savannah West Apartments",
        "Town": "Kansas City",
        "StateOrProvince": "MO",
        "Postcode": "64156",
        "CountryID": 2,
        "Latitude": 39.2559879,
        "Longitude": -94.5460204,
        "ContactTelephone1": "888-758-4389",
        "AccessComments": "24 hours daily",
        "RelatedURL": "http://www.chargepoint.com/",
        "DistanceUnit": 0
    },
    "Connections": [
        {
            "ID": 133431,
            "ConnectionTypeID": 1,
            "LevelID": 2,
            "Amps": 16,
            "Voltage": 230,
            "PowerKW": 3.7,
            "CurrentTypeID": 10,
            "Quantity": 6
        }
    ],
    "DateLastStatusUpdate": "2020-06-26T03:01:00Z",
    "DataQualityLevel": 3,
    "DateCreated": "2017-10-19T02:06:00Z",
    "SubmissionStatusTypeID": 100
}