{
    "IsRecentlyVerified": false,
    "ID": 126603,
    "UUID": "3E6E3C2E-57B7-49C3-AE55-649365FEA255",
    "DataProviderID": 1,
    "UsageTypeID": 4,
    "UsageCost": "30p/kWh",
    "AddressInfo": {
        "ID": 126949,
        "Title": "Weston Recovery Services",
        "AddressLine1": "1 Brimbleworth Lane",
        "Town": "Saint Georges",
        "Postcode": "BS22 7XN",
        "CountryID": 1,
        "Latitude": 51.362272,
        "Longitude": -2.898847,
        "DistanceUnit": 0
    },
    "Connections": [
        {
            "ID": 177340,
            "ConnectionTypeID": 2,
            "StatusTypeID": 50,
            "LevelID": 3,
            "PowerKW": 50,
            "CurrentTypeID": 30,
            "Quantity": 1
        }
    ],
    "NumberOfPoints": 1,
    "GeneralComments": "newmotion charger",
    "StatusTypeID": 50,
    "DateLastStatusUpdate": "2019-05-15T23:38:00Z",
    "DataQualityLevel": 1,
    "DateCreated": "2019-05-15T23:38:00Z",
    "SubmissionStatusTypeID": 200
}