{
    "IsRecentlyVerified": false,
    "ID": 43680,
    "UUID": "09697DF0-9F91-4733-9A48-A49EBB488371",
    "DataProviderID": 1,
    "OperatorID": 167,
    "UsageTypeID": 3,
    "UsageCost": "0",
    "AddressInfo": {
        "ID": 44026,
        "Title": "Autohaus K&S Oder/Spree",
        "AddressLine1": "Am Gewerbepark 1a",
        "Town": "Eisenhüttenstadt",
        "Postcode": "16303",
        "CountryID": 87,
        "Latitude": 52.1511576527157,
        "Longitude": 14.6383696697915,
        "ContactTelephone1": "+49 3364 44444",
        "AccessComments": "Nutzbar während der Öffnungszeiten nach Anmeldung von Mo-Fr 7-18, Sa 9-12Uhr.",
        "RelatedURL": "http://skq.nissan-haendler.de/",
        "DistanceUnit": 0
    },
    "Connections": [
        {
            "ID": 52991,
            "ConnectionTypeID": 28,
            "StatusTypeID": 50,
            "LevelID": 2,
            "Amps": 16,
            "Voltage": 230,
            "PowerKW": 3.7,
            "CurrentTypeID": 10,
            "Quantity": 1
        }
    ],
    "NumberOfPoints": 1,
    "StatusTypeID": 50,
    "DateLastStatusUpdate": "2015-04-11T14:21:00Z",
    "DataQualityLevel": 1,
    "DateCreated": "2015-04-11T09:14:00Z",
    "SubmissionStatusTypeID": 200
}