{
    "IsRecentlyVerified": false,
    "ID": 129405,
    "UUID": "1632FBCA-538C-4880-918D-76E50F0B05EE",
    "DataProviderID": 1,
    "OperatorID": 80,
    "UsageTypeID": 4,
    "AddressInfo": {
        "ID": 129751,
        "Title": "COOP San Miniato | EnelX",
        "AddressLine1": "Via Ferrante Aporti, 13",
        "Town": "San Miniato",
        "StateOrProvince": "PI",
        "Postcode": "56028",
        "CountryID": 112,
        "Latitude": 43.695308716330715,
        "Longitude": 10.835455065104497,
        "RelatedURL": "https://www.enelx.com/it/it/emobility",
        "DistanceUnit": 0
    },
    "Connections": [
        {
            "ID": 181106,
            "ConnectionTypeID": 25,
            "StatusTypeID": 50,
            "LevelID": 2,
            "Amps": 32,
            "Voltage": 400,
            "PowerKW": 22,
            "CurrentTypeID": 20,
            "Quantity": 4
        }
    ],
    "NumberOfPoints": 4,
    "GeneralComments": "Lun-Sab 8:00-20:30 Dom 8:30-13:30",
    "StatusTypeID": 50,
    "DateLastStatusUpdate": "2019-07-19T12:39:00Z",
    "DataQualityLevel": 1,
    "DateCreated": "2019-07-19T12:39:00Z",
    "SubmissionStatusTypeID": 200
}