{
    "IsRecentlyVerified": false,
    "ID": 139141,
    "UUID": "7DF4A19A-83A4-445D-94AC-9BF204AF2BD6",
    "DataProviderID": 2,
    "DataProvidersReference": "95220",
    "OperatorID": 9,
    "UsageTypeID": 1,
    "AddressInfo": {
        "ID": 139493,
        "Title": "Infiniti of Scottsdale North of Dealership",
        "AddressLine1": "7801 E. Frank Lloyd Wright Blvd.",
        "Town": "Scottsdale",
        "StateOrProvince": "AZ",
        "Postcode": "85260",
        "CountryID": 2,
        "Latitude": 33.634113,
        "Longitude": -111.912335,
        "ContactTelephone1": "888-998-2546",
        "AccessComments": "MON: 24 hours | TUE: 24 hours | WED: 24 hours | THU: 24 hours | FRI: 24 hours | SAT: 24 hours | SUN: 24 hours",
        "RelatedURL": "http://www.blinkcharging.com/",
        "DistanceUnit": 0
    },
    "Connections": [
        {
            "ID": 194404,
            "ConnectionTypeID": 1,
            "LevelID": 2,
            "Amps": 16,
            "Voltage": 230,
            "PowerKW": 3.7,
            "CurrentTypeID": 10,
            "Quantity": 2
        }
    ],
    "StatusTypeID": 50,
    "DateLastStatusUpdate": "2020-06-26T02:55:00Z",
    "DataQualityLevel": 3,
    "DateCreated": "2019-12-24T09:10:00Z",
    "SubmissionStatusTypeID": 100
}