{
    "IsRecentlyVerified": false,
    "ID": 165471,
    "UUID": "7BC7F6A3-B650-4CB2-8115-345EC4B8F5CE",
    "DataProviderID": 28,
    "DataProvidersReference": "FR*M13*P13015*002",
    "UsageTypeID": 5,
    "AddressInfo": {
        "ID": 165830,
        "Title": "BOUC-BEL-AIR - Impasse Des Acacias",
        "AddressLine1": "Allée des Coudercs - Parking aire de jeu 0 BOUC-BEL-AIR",
        "CountryID": 80,
        "Latitude": 43.459768,
        "Longitude": 5.41303,
        "AccessComments": "24h/24 7j/7",
        "DistanceUnit": 0
    },
    "Connections": [
        {
            "ID": 239024,
            "ConnectionTypeID": 28,
            "StatusTypeID": 50,
            "LevelID": 2,
            "PowerKW": 22,
            "CurrentTypeID": 10
        },
        {
            "ID": 239025,
            "ConnectionTypeID": 1036,
            "StatusTypeID": 50,
            "LevelID": 2,
            "PowerKW": 22,
            "CurrentTypeID": 20
        },
        {
            "ID": 239026,
            "ConnectionTypeID": 28,
            "StatusTypeID": 50,
            "LevelID": 2,
            "PowerKW": 22,
            "CurrentTypeID": 10
        },
        {
            "ID": 239027,
            "ConnectionTypeID": 1036,
            "StatusTypeID": 50,
            "LevelID": 2,
            "PowerKW": 22,
            "CurrentTypeID": 20
        }
    ],
    "GeneralComments": "Recharge par badge et avec une application smartphone",
    "StatusTypeID": 50,
    "DateLastStatusUpdate": "2020-08-27T05:10:00Z",
    "DataQualityLevel": 2,
    "DateCreated": "2020-08-27T05:10:00Z",
    "SubmissionStatusTypeID": 100
}