{
    "IsRecentlyVerified": false,
    "ID": 56815,
    "UUID": "737AFA67-1C03-4E26-829C-086A4BF63580",
    "DataProviderID": 1,
    "OperatorID": 80,
    "UsageTypeID": 4,
    "UsageCost": "0,40 €/kW",
    "AddressInfo": {
        "ID": 57161,
        "Title": "Eneldrive Piccinino",
        "AddressLine1": "Piazza Piccinino",
        "Town": "Perugia",
        "StateOrProvince": "PG",
        "Postcode": "06123",
        "CountryID": 112,
        "Latitude": 43.1129557783904,
        "Longitude": 12.3905405683593,
        "RelatedURL": "http://eneldrive.it",
        "DistanceUnit": 0
    },
    "Connections": [
        {
            "ID": 71685,
            "ConnectionTypeID": 25,
            "StatusTypeID": 50,
            "LevelID": 2,
            "Amps": 32,
            "Voltage": 400,
            "PowerKW": 22,
            "CurrentTypeID": 20,
            "Quantity": 1
        },
        {
            "ID": 71686,
            "ConnectionTypeID": 36,
            "StatusTypeID": 50,
            "LevelID": 2,
            "Amps": 16,
            "Voltage": 240,
            "PowerKW": 3.7,
            "CurrentTypeID": 10,
            "Quantity": 1
        }
    ],
    "NumberOfPoints": 1,
    "StatusTypeID": 50,
    "DateLastStatusUpdate": "2019-08-06T14:28:00Z",
    "DataQualityLevel": 1,
    "DateCreated": "2015-11-11T15:24:00Z",
    "SubmissionStatusTypeID": 200
}