{
    "UserComments": [
        {
            "ID": 10238,
            "ChargePointID": 33092,
            "CommentTypeID": 10,
            "UserName": "dexter",
            "Comment": "Reserviert, aber ohne Halteverbotszeichen. Ladeplatz 1 von einem Ruhrauto-Kia -nichtladend- blockiert, Ladeplatz 2 von einem Verbrenner. Für Quads und Bikes notfalls über den Bürgersteig nutzbar.",
            "Rating": 4,
            "DateCreated": "2016-04-24T09:16:07.047Z",
            "User": {
                "ID": 4520,
                "Username": "dexter"
            },
            "CheckinStatusTypeID": 10
        }
    ],
    "IsRecentlyVerified": false,
    "ID": 33092,
    "UUID": "F8E9D03B-558B-4A40-AD55-AAAA0E2B076B",
    "DataProviderID": 1,
    "OperatorID": 105,
    "OperatorsReference": "Essent EM-DE-05913000-01-00012",
    "UsageTypeID": 4,
    "AddressInfo": {
        "ID": 33438,
        "Title": "Beurhausstr. 6",
        "AddressLine1": "Beurhausstr. 6",
        "Town": "Dortmund",
        "Postcode": "44137",
        "CountryID": 87,
        "Latitude": 51.509102,
        "Longitude": 7.46078,
        "DistanceUnit": 0
    },
    "Connections": [
        {
            "ID": 36603,
            "ConnectionTypeID": 25,
            "LevelID": 2,
            "PowerKW": 11
        },
        {
            "ID": 46668,
            "ConnectionTypeID": 25,
            "LevelID": 2,
            "PowerKW": 11
        }
    ],
    "NumberOfPoints": 1,
    "StatusTypeID": 50,
    "DateLastStatusUpdate": "2016-04-24T09:16:00Z",
    "DataQualityLevel": 3,
    "DateCreated": "2015-01-09T06:04:00Z",
    "SubmissionStatusTypeID": 200
}