{
    "IsRecentlyVerified": false,
    "ID": 28260,
    "UUID": "B163B6F2-DAFE-48FB-8BF3-9CCB3381F9BF",
    "DataProviderID": 2,
    "DataProvidersReference": "64355",
    "UsageTypeID": 1,
    "AddressInfo": {
        "ID": 28606,
        "Title": "Holiday Inn - Bentleyville",
        "AddressLine1": "25 Smita Ln",
        "Town": "Bentleyville",
        "StateOrProvince": "PA",
        "Postcode": "15314",
        "CountryID": 2,
        "Latitude": 40.130758,
        "Longitude": -79.997975,
        "ContactTelephone1": "724-239-7700",
        "AccessComments": "24 hours daily",
        "RelatedURL": "",
        "DistanceUnit": 0
    },
    "Connections": [
        {
            "ID": 31055,
            "ConnectionTypeID": 1,
            "LevelID": 2,
            "Amps": 16,
            "Voltage": 230,
            "PowerKW": 3,
            "CurrentTypeID": 10,
            "Quantity": 1
        }
    ],
    "DateLastStatusUpdate": "2019-04-06T04:03:00Z",
    "DataQualityLevel": 3,
    "DateCreated": "2014-11-28T03:38:00Z",
    "SubmissionStatusTypeID": 100
}