{
    "IsRecentlyVerified": false,
    "ID": 115384,
    "UUID": "1A90722E-433F-4AB6-8414-37067C265008",
    "DataProviderID": 2,
    "DataProvidersReference": "117067",
    "OperatorID": 5,
    "UsageTypeID": 1,
    "AddressInfo": {
        "ID": 115730,
        "Title": "JLL PARKWAY",
        "AddressLine1": "2701 Dallas Pkwy",
        "Town": "Plano",
        "StateOrProvince": "TX",
        "Postcode": "75093",
        "CountryID": 2,
        "Latitude": 33.0376523,
        "Longitude": -96.8313353,
        "ContactTelephone1": "888-758-4389",
        "AccessComments": "24 hours daily",
        "RelatedURL": "http://www.chargepoint.com/",
        "DistanceUnit": 0
    },
    "Connections": [
        {
            "ID": 162387,
            "ConnectionTypeID": 1,
            "LevelID": 2,
            "Amps": 16,
            "Voltage": 230,
            "PowerKW": 3,
            "CurrentTypeID": 10,
            "Quantity": 2
        }
    ],
    "DateLastStatusUpdate": "2019-04-06T04:01:00Z",
    "DataQualityLevel": 3,
    "DateCreated": "2019-02-11T07:13:00Z",
    "SubmissionStatusTypeID": 100
}