{
    "IsRecentlyVerified": false,
    "ID": 17270,
    "UUID": "5856257F-330D-46D5-B019-BB5520E7742A",
    "DataProviderID": 22,
    "DataProvidersReference": "57574E4F5E30961F96C7E320BF15A5DD",
    "AddressInfo": {
        "ID": 17615,
        "Title": "中部三菱春日井バイパス店",
        "AddressLine1": "愛知県春日井市鳥居松町2-20",
        "CountryID": 114,
        "Latitude": 35.24421083,
        "Longitude": 136.9671237,
        "ContactTelephone1": "0568-81-6111",
        "DistanceUnit": 0
    },
    "Connections": [
        {
            "ID": 17511,
            "ConnectionTypeID": 2,
            "LevelID": 2,
            "Amps": 100,
            "Voltage": 480,
            "PowerKW": 48,
            "Quantity": 1
        }
    ],
    "DateLastStatusUpdate": "2013-06-29T08:56:00Z",
    "DataQualityLevel": 2,
    "DateCreated": "2013-06-29T08:56:00Z",
    "SubmissionStatusTypeID": 200
}