{
    "IsRecentlyVerified": false,
    "ID": 52344,
    "UUID": "73C795BA-DAFF-47EF-9C41-130E5CE854C6",
    "DataProviderID": 1,
    "OperatorID": 105,
    "UsageTypeID": 1,
    "UsageCost": "0",
    "AddressInfo": {
        "ID": 52690,
        "Title": "E-Bike Station Kirchplatz",
        "AddressLine1": "Weseler Straße 19",
        "AddressLine2": "Erle",
        "Town": "Raesfeld",
        "StateOrProvince": "Kreis Borken",
        "Postcode": "46348",
        "CountryID": 87,
        "Latitude": 51.76839,
        "Longitude": 6.83773999999994,
        "RelatedURL": "http://www.rwe.com/web/cms/de/494436/e-bikes-on-tour/ladestationen/",
        "DistanceUnit": 0
    },
    "Connections": [
        {
            "ID": 64997,
            "ConnectionTypeID": 28,
            "StatusTypeID": 50,
            "LevelID": 1,
            "Amps": 10,
            "Voltage": 230,
            "PowerKW": 2.3,
            "CurrentTypeID": 10,
            "Quantity": 3
        }
    ],
    "NumberOfPoints": 3,
    "StatusTypeID": 50,
    "DateLastStatusUpdate": "2015-08-29T08:14:00Z",
    "DataQualityLevel": 1,
    "DateCreated": "2015-08-28T20:34:00Z",
    "SubmissionStatusTypeID": 200
}