{
    "IsRecentlyVerified": false,
    "ID": 84206,
    "UUID": "E76028BD-37D1-4A09-8CB6-AC1F363536DA",
    "DataProviderID": 1,
    "OperatorID": 23,
    "OperatorsReference": "24401",
    "UsageTypeID": 4,
    "AddressInfo": {
        "ID": 84552,
        "Title": "Seepark Hotel Klagenfurt",
        "AddressLine1": "104 Universitätsstrasse",
        "Town": "Klagenfurt",
        "Postcode": "9020",
        "CountryID": 19,
        "Latitude": 46.617975,
        "Longitude": 14.261346,
        "ContactTelephone1": "+43 4632 044990",
        "DistanceUnit": 0
    },
    "Connections": [
        {
            "ID": 119607,
            "ConnectionTypeID": 30,
            "StatusTypeID": 50,
            "LevelID": 2,
            "Amps": 32,
            "Voltage": 400,
            "PowerKW": 22,
            "CurrentTypeID": 20,
            "Quantity": 2
        }
    ],
    "NumberOfPoints": 2,
    "GeneralComments": "2 Tesla Connectors, up to 22kW.Available for customers. Please see front desk.",
    "StatusTypeID": 50,
    "DateLastStatusUpdate": "2018-10-03T21:44:00Z",
    "DataQualityLevel": 1,
    "DateCreated": "2017-02-16T17:14:00Z",
    "SubmissionStatusTypeID": 200
}