{
    "IsRecentlyVerified": false,
    "ID": 139923,
    "UUID": "3D98865C-117D-4A77-9250-B3935493FC9D",
    "DataProviderID": 2,
    "DataProvidersReference": "143595",
    "OperatorID": 5,
    "UsageTypeID": 1,
    "AddressInfo": {
        "ID": 140275,
        "Title": "JLRTO",
        "AddressLine1": "3595 automall dr",
        "Town": "Thousand Oaks",
        "StateOrProvince": "CA",
        "Postcode": "91362",
        "CountryID": 2,
        "Latitude": 34.164024,
        "Longitude": -118.83243,
        "ContactTelephone1": "888-758-4389",
        "AccessComments": "24 hours daily",
        "RelatedURL": "http://www.chargepoint.com/",
        "DistanceUnit": 0
    },
    "Connections": [
        {
            "ID": 195423,
            "ConnectionTypeID": 32,
            "LevelID": 3,
            "Amps": 100,
            "Voltage": 400,
            "PowerKW": 40,
            "CurrentTypeID": 30,
            "Quantity": 1
        }
    ],
    "StatusTypeID": 50,
    "DateLastStatusUpdate": "2019-12-24T09:11:00Z",
    "DataQualityLevel": 3,
    "DateCreated": "2019-12-24T09:11:00Z",
    "SubmissionStatusTypeID": 100
}