{
    "IsRecentlyVerified": false,
    "ID": 109333,
    "UUID": "0196CAD8-16AF-4183-8636-6295AE6F655A",
    "DataProviderID": 1,
    "OperatorID": 23,
    "OperatorsReference": "46040",
    "UsageTypeID": 4,
    "AddressInfo": {
        "ID": 109679,
        "Title": "Hilton Salt Lake City Center",
        "AddressLine1": "255 S W Temple",
        "Town": "Salt Lake City",
        "StateOrProvince": "Utah",
        "Postcode": "84101",
        "CountryID": 2,
        "Latitude": 40.7639,
        "Longitude": -111.893096,
        "ContactTelephone1": "(801) 328-2000",
        "DistanceUnit": 0
    },
    "Connections": [
        {
            "ID": 154451,
            "ConnectionTypeID": 30,
            "StatusTypeID": 50,
            "LevelID": 2,
            "PowerKW": 16,
            "CurrentTypeID": 20,
            "Quantity": 1
        }
    ],
    "NumberOfPoints": 1,
    "GeneralComments": "1 Tesla Connector, up to 16kW.Available for customers. Please see front desk.",
    "StatusTypeID": 50,
    "DateLastStatusUpdate": "2018-10-11T14:26:00Z",
    "DataQualityLevel": 1,
    "DateCreated": "2018-10-11T14:26:00Z",
    "SubmissionStatusTypeID": 200
}