{
    "IsRecentlyVerified": false,
    "ID": 124277,
    "UUID": "6B315CE6-0811-42F2-BEE7-E075646A2635",
    "DataProviderID": 2,
    "DataProvidersReference": "85464",
    "OperatorID": 5,
    "UsageTypeID": 1,
    "AddressInfo": {
        "ID": 124623,
        "Title": "CHP STOCKTON",
        "AddressLine1": "3330 Ad Art Rd",
        "Town": "Stockton",
        "StateOrProvince": "CA",
        "Postcode": "95215",
        "CountryID": 2,
        "Latitude": 37.9930736,
        "Longitude": -121.2503393,
        "ContactTelephone1": "888-758-4389",
        "AccessComments": "24 hours daily",
        "RelatedURL": "http://www.chargepoint.com/",
        "DistanceUnit": 0
    },
    "Connections": [
        {
            "ID": 174357,
            "ConnectionTypeID": 1,
            "LevelID": 2,
            "Amps": 16,
            "Voltage": 230,
            "PowerKW": 3,
            "CurrentTypeID": 10,
            "Quantity": 1
        }
    ],
    "DateLastStatusUpdate": "2019-12-24T09:14:00Z",
    "DataQualityLevel": 3,
    "DateCreated": "2019-04-06T05:03:00Z",
    "SubmissionStatusTypeID": 100
}