{
    "MediaItems": [
        {
            "ID": 19607,
            "ChargePointID": 132048,
            "ItemURL": "https://s3-ap-southeast-2.amazonaws.com/openchargemap/images/IT/OCM132048/OCM-132048.orig.2019091814125555.jpg",
            "ItemThumbnailURL": "https://s3-ap-southeast-2.amazonaws.com/openchargemap/images/IT/OCM132048/OCM-132048.thmb.2019091814125555.jpg",
            "Comment": "",
            "IsEnabled": true,
            "IsVideo": false,
            "IsFeaturedItem": false,
            "IsExternalResource": false,
            "User": {
                "ID": 19496,
                "Username": "ECOGY"
            },
            "DateCreated": "2019-09-18T14:13:00Z"
        },
        {
            "ID": 19606,
            "ChargePointID": 132048,
            "ItemURL": "https://s3-ap-southeast-2.amazonaws.com/openchargemap/images/IT/OCM132048/OCM-132048.orig.2019091814112752.jpg",
            "ItemThumbnailURL": "https://s3-ap-southeast-2.amazonaws.com/openchargemap/images/IT/OCM132048/OCM-132048.thmb.2019091814112752.jpg",
            "Comment": "",
            "IsEnabled": true,
            "IsVideo": false,
            "IsFeaturedItem": false,
            "IsExternalResource": false,
            "User": {
                "ID": 19496,
                "Username": "ECOGY"
            },
            "DateCreated": "2019-09-18T14:12:00Z"
        }
    ],
    "IsRecentlyVerified": false,
    "ID": 132048,
    "UUID": "915A87F0-7B36-40EE-89D6-59DEA911FF2E",
    "DataProviderID": 1,
    "OperatorID": 45,
    "UsageTypeID": 4,
    "UsageCost": "0,35 Euro/kWh",
    "AddressInfo": {
        "ID": 132394,
        "Title": "Panoramic Suites Winzerhöhe ****  ",
        "AddressLine1": "Pichlerstraße 26/B",
        "Town": "39017 Schenna ",
        "StateOrProvince": "Bozen",
        "Postcode": "39017",
        "CountryID": 112,
        "Latitude": 46.6947923836933,
        "Longitude": 11.1992358582113,
        "ContactTelephone1": "+39 339 670 1671",
        "ContactEmail": "info@winzerhoehe.com",
        "AccessComments": "Für Hotelkunden mittels RFID Karte\r\nEcogy 2 Ladestationen zu 11 kW",
        "RelatedURL": "https://www.winzerhoehe.com",
        "DistanceUnit": 0
    },
    "Connections": [
        {
            "ID": 184755,
            "ConnectionTypeID": 25,
            "StatusTypeID": 50,
            "LevelID": 2,
            "Amps": 16,
            "Voltage": 400,
            "PowerKW": 11,
            "CurrentTypeID": 20,
            "Quantity": 1
        },
        {
            "ID": 184756,
            "ConnectionTypeID": 25,
            "StatusTypeID": 50,
            "LevelID": 2,
            "Amps": 16,
            "Voltage": 400,
            "PowerKW": 11,
            "CurrentTypeID": 20,
            "Quantity": 1
        }
    ],
    "NumberOfPoints": 2,
    "GeneralComments": "Die 2 Ladestationen befinden sich auf dem Kundenparkplatz",
    "StatusTypeID": 50,
    "DateLastStatusUpdate": "2019-09-18T16:28:00Z",
    "DataQualityLevel": 1,
    "DateCreated": "2019-09-18T14:09:00Z",
    "SubmissionStatusTypeID": 200
}