{
    "UserComments": [
        {
            "ID": 23145,
            "ChargePointID": 149284,
            "CommentTypeID": 10,
            "UserName": "ForumElettrico.it",
            "Comment": "Una doppietta utile perché vicina all'uscita autostrada Aosta. Leggi la recensione completa qui > https://www.forumelettrico.it/forum/2-x-fast-enelx-aeroporto-aosta-t9465.html",
            "RelatedURL": "https://www.forumelettrico.it/forum/2-x-fast-enelx-aeroporto-aosta-t9465.html",
            "DateCreated": "2020-08-24T14:22:41.293Z",
            "User": {
                "ID": 11749,
                "Username": "ForumElettrico.it"
            },
            "CheckinStatusTypeID": 10,
            "IsActionedByEditor": false
        }
    ],
    "MediaItems": [
        {
            "ID": 24450,
            "ChargePointID": 149284,
            "ItemURL": "https://s3-ap-southeast-2.amazonaws.com/openchargemap/images/IT/OCM149284/OCM-149284.orig.2020082414253895.jpg",
            "ItemThumbnailURL": "https://s3-ap-southeast-2.amazonaws.com/openchargemap/images/IT/OCM149284/OCM-149284.thmb.2020082414253895.jpg",
            "Comment": "",
            "IsEnabled": true,
            "IsVideo": false,
            "IsFeaturedItem": false,
            "IsExternalResource": false,
            "User": {
                "ID": 11749,
                "Username": "ForumElettrico.it"
            },
            "DateCreated": "2020-08-24T14:26:00Z"
        }
    ],
    "IsRecentlyVerified": false,
    "ID": 149284,
    "UUID": "C55C38E9-70CF-4DA0-B993-00E6A4A2D18F",
    "DataProviderID": 1,
    "OperatorID": 80,
    "UsageTypeID": 4,
    "UsageCost": "0,50€/kW",
    "AddressInfo": {
        "ID": 149637,
        "Title": "Aeroporto di Aosta  | ENELX FAST",
        "AddressLine1": "Località Les Iles, 13",
        "AddressLine2": "Les Îles",
        "Town": "Saint-Christophe",
        "StateOrProvince": "AO",
        "Postcode": "11020",
        "CountryID": 112,
        "Latitude": 45.739381772628036,
        "Longitude": 7.363675313778003,
        "RelatedURL": "https://www.enelx.com/it/it/emobility",
        "DistanceUnit": 0
    },
    "Connections": [
        {
            "ID": 207287,
            "ConnectionTypeID": 1036,
            "StatusTypeID": 50,
            "LevelID": 3,
            "Amps": 64,
            "Voltage": 400,
            "PowerKW": 43,
            "CurrentTypeID": 20,
            "Quantity": 2
        },
        {
            "ID": 207288,
            "ConnectionTypeID": 33,
            "StatusTypeID": 50,
            "LevelID": 3,
            "Amps": 120,
            "Voltage": 500,
            "PowerKW": 50,
            "CurrentTypeID": 30,
            "Quantity": 2
        },
        {
            "ID": 207289,
            "ConnectionTypeID": 2,
            "StatusTypeID": 50,
            "LevelID": 3,
            "Amps": 120,
            "Voltage": 500,
            "PowerKW": 50,
            "CurrentTypeID": 30,
            "Quantity": 2
        }
    ],
    "NumberOfPoints": 4,
    "StatusTypeID": 50,
    "DateLastStatusUpdate": "2020-08-24T14:26:00Z",
    "DataQualityLevel": 1,
    "DateCreated": "2020-02-21T16:15:00Z",
    "SubmissionStatusTypeID": 200
}