{
    "IsRecentlyVerified": false,
    "ID": 30981,
    "UUID": "1FD7F58C-1CD0-42C0-B9A7-35971EC0E61F",
    "DataProviderID": 1,
    "DataProvidersReference": "1220",
    "AddressInfo": {
        "ID": 31327,
        "Title": "Sisustuskeskus Sella",
        "AddressLine1": "Veistokouluntie ",
        "Town": "Jurva Keskus",
        "StateOrProvince": "Etelä-Pohjanmaa",
        "Postcode": "66300",
        "CountryID": 79,
        "Latitude": 62.67083,
        "Longitude": 21.98536,
        "AccessComments": "",
        "DistanceUnit": 0
    },
    "Connections": [
        {
            "ID": 34210,
            "ConnectionTypeID": 0,
            "LevelID": 2,
            "Amps": 16,
            "Voltage": 230,
            "PowerKW": 3.68
        },
        {
            "ID": 87345,
            "ConnectionTypeID": 0,
            "Reference": "1",
            "LevelID": 2,
            "Amps": 32,
            "Voltage": 400,
            "PowerKW": 22,
            "Comments": "Mode 3"
        },
        {
            "ID": 89324,
            "ConnectionTypeID": 0,
            "Reference": "2"
        },
        {
            "ID": 225789,
            "ConnectionTypeID": 0,
            "Reference": "3"
        }
    ],
    "NumberOfPoints": 1,
    "DateLastStatusUpdate": "2020-05-26T08:25:00Z",
    "DataQualityLevel": 2,
    "DateCreated": "2014-12-09T09:01:00Z",
    "SubmissionStatusTypeID": 100
}