{
    "IsRecentlyVerified": false,
    "ID": 68160,
    "UUID": "9AA024FB-D2D7-4457-A23B-53DC2045CE58",
    "DataProviderID": 26,
    "DataProvidersReference": "90463",
    "OperatorID": 177,
    "OperatorsReference": "Nuon EVB-P1541121",
    "UsageCost": "0.00 jaarabonnement",
    "AddressInfo": {
        "ID": 68506,
        "Title": "Rondenburglaan",
        "AddressLine1": "Rondenburglaan",
        "Town": "Haarlemmermeer",
        "Postcode": "2135 KN",
        "CountryID": 159,
        "Latitude": 52.299889,
        "Longitude": 4.658184,
        "RelatedURL": "http://www.nuon.nl/ev",
        "DistanceUnit": 0
    },
    "Connections": [
        {
            "ID": 94965,
            "ConnectionTypeID": 25,
            "LevelID": 2,
            "PowerKW": 11,
            "CurrentTypeID": 10
        },
        {
            "ID": 94966,
            "ConnectionTypeID": 25,
            "LevelID": 2,
            "PowerKW": 11,
            "CurrentTypeID": 10
        }
    ],
    "NumberOfPoints": 1,
    "StatusTypeID": 50,
    "DateLastStatusUpdate": "2016-06-04T02:37:00Z",
    "DataQualityLevel": 3,
    "DateCreated": "2016-06-04T02:37:00Z",
    "SubmissionStatusTypeID": 100
}