{
    "IsRecentlyVerified": false,
    "ID": 140356,
    "UUID": "7DF494D1-AB35-4560-AE66-2A2461C05FE2",
    "DataProviderID": 2,
    "DataProvidersReference": "118507",
    "OperatorID": 5,
    "UsageTypeID": 1,
    "AddressInfo": {
        "ID": 140708,
        "Title": "BASF",
        "AddressLine1": "2 TW Alexander Dr",
        "Town": "Durham",
        "StateOrProvince": "NC",
        "Postcode": "27709",
        "CountryID": 2,
        "Latitude": 35.925129,
        "Longitude": -78.864765,
        "ContactTelephone1": "888-758-4389",
        "AccessComments": "24 hours daily",
        "RelatedURL": "http://www.chargepoint.com/",
        "DistanceUnit": 0
    },
    "Connections": [
        {
            "ID": 195968,
            "ConnectionTypeID": 1,
            "LevelID": 2,
            "Amps": 16,
            "Voltage": 230,
            "PowerKW": 3.7,
            "CurrentTypeID": 10,
            "Quantity": 8
        }
    ],
    "StatusTypeID": 50,
    "DateLastStatusUpdate": "2020-06-26T02:58:00Z",
    "DataQualityLevel": 3,
    "DateCreated": "2019-12-24T09:12:00Z",
    "SubmissionStatusTypeID": 100
}