{
    "IsRecentlyVerified": false,
    "ID": 152359,
    "UUID": "3EDA6B9C-DB14-4D77-9940-96D2490E1713",
    "DataProviderID": 28,
    "DataProvidersReference": "",
    "UsageTypeID": 5,
    "AddressInfo": {
        "ID": 152712,
        "Title": "RAZINES 1441",
        "AddressLine1": "Avenue de l'Eglise - 37120 RAZINES",
        "CountryID": 80,
        "Latitude": 46.975509,
        "Longitude": 0.377102,
        "AccessComments": "24/24 7/7",
        "DistanceUnit": 0
    },
    "Connections": [
        {
            "ID": 213269,
            "ConnectionTypeID": 28,
            "StatusTypeID": 50,
            "LevelID": 2,
            "PowerKW": 18,
            "CurrentTypeID": 10
        },
        {
            "ID": 213270,
            "ConnectionTypeID": 25,
            "StatusTypeID": 50,
            "LevelID": 2,
            "PowerKW": 18,
            "CurrentTypeID": 10
        }
    ],
    "GeneralComments": "www.virtaev.fr",
    "StatusTypeID": 50,
    "DateLastStatusUpdate": "2020-03-15T10:53:00Z",
    "DataQualityLevel": 2,
    "DateCreated": "2020-03-15T10:53:00Z",
    "SubmissionStatusTypeID": 100
}