{
    "IsRecentlyVerified": false,
    "ID": 19481,
    "UUID": "8AF13297-FF43-4FE0-A298-625886592DC3",
    "DataProviderID": 1,
    "OperatorID": 25,
    "OperatorsReference": "southwark-danbystreet",
    "UsageTypeID": 4,
    "UsageCost": "£0.059/minute; min £1.18; other tariffs available",
    "AddressInfo": {
        "ID": 19826,
        "Title": "Danby Street",
        "AddressLine1": "Danby Street",
        "Town": "London",
        "Postcode": "SE15 4BW",
        "CountryID": 1,
        "Latitude": 51.4666638,
        "Longitude": -0.0732847,
        "ContactTelephone1": "0845 850 0653",
        "AccessComments": "Charges may apply - refer to the owner of the parking bay for details. Hours accessible: 24 Hrs",
        "RelatedURL": "http://www.southwark.gov.uk/downloads/200072/parking",
        "DistanceUnit": 0
    },
    "Connections": [
        {
            "ID": 19805,
            "ConnectionTypeID": 25,
            "StatusTypeID": 50,
            "LevelID": 2,
            "Amps": 32,
            "Voltage": 230,
            "PowerKW": 7,
            "CurrentTypeID": 10,
            "Quantity": 1
        },
        {
            "ID": 19806,
            "ConnectionTypeID": 1,
            "StatusTypeID": 50,
            "LevelID": 2,
            "Amps": 16,
            "Voltage": 230,
            "PowerKW": 4,
            "CurrentTypeID": 10,
            "Quantity": 1
        }
    ],
    "NumberOfPoints": 1,
    "GeneralComments": "IER model charge point",
    "StatusTypeID": 50,
    "DateLastStatusUpdate": "2017-04-27T13:32:00Z",
    "MetadataValues": [
        {
            "ID": 93,
            "MetadataFieldID": 4,
            "ItemValue": "Data © OpenStreetMap contributors, ODbL 1.0. http://www.openstreetmap.org/copyright"
        }
    ],
    "DataQualityLevel": 1,
    "DateCreated": "2013-10-01T14:28:00Z",
    "SubmissionStatusTypeID": 200
}