{
    "MediaItems": [
        {
            "ID": 12832,
            "ChargePointID": 88693,
            "ItemURL": "https://s3-ap-southeast-2.amazonaws.com/openchargemap/images/DE/OCM88693/OCM-88693.orig.2017061118302716.jpg",
            "ItemThumbnailURL": "https://s3-ap-southeast-2.amazonaws.com/openchargemap/images/DE/OCM88693/OCM-88693.thmb.2017061118302716.jpg",
            "Comment": "",
            "IsEnabled": true,
            "IsVideo": false,
            "IsFeaturedItem": false,
            "IsExternalResource": false,
            "User": {
                "ID": 4573,
                "Username": "Erna_Schleck"
            },
            "DateCreated": "2017-06-11T18:31:00Z"
        },
        {
            "ID": 12831,
            "ChargePointID": 88693,
            "ItemURL": "https://s3-ap-southeast-2.amazonaws.com/openchargemap/images/DE/OCM88693/OCM-88693.orig.2017061118300800.jpg",
            "ItemThumbnailURL": "https://s3-ap-southeast-2.amazonaws.com/openchargemap/images/DE/OCM88693/OCM-88693.thmb.2017061118300800.jpg",
            "Comment": "",
            "IsEnabled": true,
            "IsVideo": false,
            "IsFeaturedItem": false,
            "IsExternalResource": false,
            "User": {
                "ID": 4573,
                "Username": "Erna_Schleck"
            },
            "DateCreated": "2017-06-11T18:30:00Z"
        }
    ],
    "IsRecentlyVerified": false,
    "ID": 88693,
    "UUID": "7AFB9C86-048D-4E15-A5A1-A6FBBF4B4F91",
    "DataProviderID": 1,
    "OperatorID": 45,
    "UsageTypeID": 3,
    "AddressInfo": {
        "ID": 89039,
        "Title": "Supermarkt Edeka",
        "AddressLine1": "Göttinger Chaussee 83",
        "Town": "Hannover",
        "StateOrProvince": "Region Hannover",
        "Postcode": "30459",
        "CountryID": 87,
        "Latitude": 52.3447530953125,
        "Longitude": 9.717859738623,
        "AccessComments": "Mennekes Ladesäule auf dem Edeka Parkplatz am Eingang zum Fitnessstudio. Nach der Einfahrt die 2. links, Ladesäule auf der linken Seite. Nur zu den Öffnungszeiten (Mo-Sa 7-22Uhr) nutzbar; Schlüssel zum Aktivieren bitte an der Information im Edeka Center abholen.  Schaltet nach einer Stunde ab!",
        "RelatedURL": "http://edeka-wucherpfennig.de/",
        "DistanceUnit": 0
    },
    "Connections": [
        {
            "ID": 125806,
            "ConnectionTypeID": 25,
            "StatusTypeID": 50,
            "LevelID": 2,
            "Amps": 32,
            "Voltage": 400,
            "PowerKW": 22,
            "CurrentTypeID": 20,
            "Quantity": 2
        },
        {
            "ID": 125807,
            "ConnectionTypeID": 28,
            "StatusTypeID": 50,
            "LevelID": 2,
            "Amps": 16,
            "Voltage": 230,
            "PowerKW": 3.7,
            "CurrentTypeID": 10,
            "Quantity": 2
        }
    ],
    "NumberOfPoints": 2,
    "GeneralComments": "20.7.17: Parkplätze nicht reserviert, daher oft zugeparkt. Markierung soll noch folgen!",
    "StatusTypeID": 50,
    "DateLastStatusUpdate": "2017-07-20T07:16:00Z",
    "DataQualityLevel": 1,
    "DateCreated": "2017-06-09T06:09:00Z",
    "SubmissionStatusTypeID": 200
}