{
    "IsRecentlyVerified": false,
    "ID": 30193,
    "UUID": "2F202B63-549C-45B4-9AC5-498DC0463C44",
    "DataProviderID": 1,
    "OperatorID": 44,
    "UsageTypeID": 1,
    "AddressInfo": {
        "ID": 30539,
        "Title": "Private Ladestation",
        "AddressLine1": "Grünfinkenweg 5",
        "Town": "Thalham/Attenkirchen",
        "StateOrProvince": "Bayern",
        "Postcode": "85395",
        "CountryID": 87,
        "Latitude": 48.4875319,
        "Longitude": 11.76847,
        "ContactTelephone1": "08168 9998379",
        "AccessComments": "Die Ladestation ist direkt am Grundstück durch ein Schild gekennzeichnet. Zum Auffahren auf das Grundstück einfach die Kette aushängen.\r\nDer Status der Wallbox kann über die Webseite eingesehen werden.",
        "RelatedURL": "http://www.arachnon.de/wb",
        "DistanceUnit": 0
    },
    "Connections": [
        {
            "ID": 33404,
            "ConnectionTypeID": 25,
            "StatusTypeID": 50,
            "LevelID": 2,
            "Amps": 32,
            "Voltage": 380,
            "PowerKW": 22,
            "CurrentTypeID": 20,
            "Quantity": 1
        }
    ],
    "NumberOfPoints": 1,
    "GeneralComments": "Die Ladekosten werden auf einem Display angezeigt. Eine entsprechende Spende ist gerne gesehen.",
    "StatusTypeID": 50,
    "DateLastStatusUpdate": "2014-12-01T12:33:00Z",
    "DataQualityLevel": 1,
    "DateCreated": "2014-12-01T06:55:00Z",
    "SubmissionStatusTypeID": 200
}