{
    "IsRecentlyVerified": false,
    "ID": 140804,
    "UUID": "A6931F1B-612C-45E9-82D4-DEF2044AB6D5",
    "DataProviderID": 2,
    "DataProvidersReference": "93065",
    "OperatorID": 15,
    "UsageTypeID": 4,
    "AddressInfo": {
        "ID": 141156,
        "Title": "Lucky",
        "AddressLine1": "5000 Mowry Ave",
        "Town": "Fremont",
        "StateOrProvince": "CA",
        "Postcode": "94538",
        "CountryID": 2,
        "Latitude": 37.534191,
        "Longitude": -121.99707,
        "ContactTelephone1": "877-455-3833",
        "AccessComments": "24 hours daily\r\nPublic - Card key at all times",
        "RelatedURL": "https://www.evgo.com/",
        "DistanceUnit": 0
    },
    "Connections": [
        {
            "ID": 196537,
            "ConnectionTypeID": 1,
            "LevelID": 2,
            "Amps": 16,
            "Voltage": 230,
            "PowerKW": 3.7,
            "CurrentTypeID": 10,
            "Quantity": 1
        },
        {
            "ID": 196538,
            "ConnectionTypeID": 2,
            "LevelID": 3,
            "Amps": 100,
            "Voltage": 400,
            "PowerKW": 40,
            "CurrentTypeID": 30,
            "Quantity": 1
        },
        {
            "ID": 196539,
            "ConnectionTypeID": 32,
            "LevelID": 3,
            "Amps": 100,
            "Voltage": 400,
            "PowerKW": 40,
            "CurrentTypeID": 30,
            "Quantity": 1
        }
    ],
    "StatusTypeID": 50,
    "DateLastStatusUpdate": "2020-06-26T02:59:00Z",
    "DataQualityLevel": 3,
    "DateCreated": "2019-12-24T09:14:00Z",
    "SubmissionStatusTypeID": 100
}