{
    "IsRecentlyVerified": false,
    "ID": 137801,
    "UUID": "1EF94903-5028-4DB2-89A2-476021F8716B",
    "DataProviderID": 2,
    "DataProvidersReference": "96148",
    "OperatorID": 9,
    "UsageTypeID": 2,
    "AddressInfo": {
        "ID": 138150,
        "Title": "Hotel Lumen",
        "AddressLine1": "6101 Hillcrest Avenue",
        "Town": "Dallas",
        "StateOrProvince": "TX",
        "Postcode": "75205",
        "CountryID": 2,
        "Latitude": 32.8408907,
        "Longitude": -96.7872978,
        "ContactTelephone1": "888-998-2546",
        "AccessComments": "MON: 24 hours | TUE: 24 hours | WED: 24 hours | THU: 24 hours | FRI: 24 hours | SAT: 24 hours | SUN: 24 hours",
        "RelatedURL": "http://www.blinkcharging.com/",
        "DistanceUnit": 0
    },
    "Connections": [
        {
            "ID": 192806,
            "ConnectionTypeID": 1,
            "LevelID": 2,
            "Amps": 16,
            "Voltage": 230,
            "PowerKW": 3,
            "CurrentTypeID": 10,
            "Quantity": 2
        }
    ],
    "StatusTypeID": 50,
    "DateLastStatusUpdate": "2019-12-24T09:06:00Z",
    "DataQualityLevel": 3,
    "DateCreated": "2019-12-24T09:06:00Z",
    "SubmissionStatusTypeID": 100
}