{
    "IsRecentlyVerified": false,
    "ID": 104035,
    "UUID": "6289A13E-AB4B-4302-8ABF-FE042BFF9D86",
    "DataProviderID": 1,
    "OperatorID": 220,
    "UsageTypeID": 4,
    "AddressInfo": {
        "ID": 104381,
        "Title": "Parkplatz Rothermundtstraße / teilAuto Station",
        "AddressLine1": "Rothermundtstraße 2",
        "Town": "Dresden",
        "StateOrProvince": "Sachsen",
        "Postcode": "01277",
        "CountryID": 87,
        "Latitude": 51.03323961964141,
        "Longitude": 13.78307727102515,
        "AccessComments": "Auf dem gebührenpflichtigen Parkplatz sind vier Ladepunkte vorhanden, davon ist einer für CarSharing teilAuto reserviert.",
        "RelatedURL": "http://www.drewag.de/de/drewag/neue-energien/elektromobilitaet.php",
        "DistanceUnit": 0
    },
    "Connections": [
        {
            "ID": 146844,
            "ConnectionTypeID": 25,
            "StatusTypeID": 50,
            "LevelID": 2,
            "Amps": 32,
            "Voltage": 400,
            "PowerKW": 22,
            "CurrentTypeID": 20,
            "Quantity": 3
        }
    ],
    "NumberOfPoints": 3,
    "StatusTypeID": 50,
    "DateLastStatusUpdate": "2018-05-15T06:54:00Z",
    "DataQualityLevel": 1,
    "DateCreated": "2018-05-15T06:54:00Z",
    "SubmissionStatusTypeID": 200
}