{
    "IsRecentlyVerified": false,
    "ID": 73749,
    "UUID": "B974778F-9DA1-4CD2-8320-766DE5B70D01",
    "DataProviderID": 1,
    "OperatorID": 89,
    "OperatorsReference": "AAA-10205",
    "UsageTypeID": 4,
    "UsageCost": "CAD 1.00/hour",
    "AddressInfo": {
        "ID": 74095,
        "Title": "Woodbine Racetrack",
        "AddressLine1": "555 Rexdale Boulevard",
        "Town": "Toronto",
        "StateOrProvince": "ON",
        "Postcode": "M9W 5L2",
        "CountryID": 44,
        "Latitude": 43.716325,
        "Longitude": -79.60208,
        "DistanceUnit": 0
    },
    "Connections": [
        {
            "ID": 106050,
            "ConnectionTypeID": 1,
            "StatusTypeID": 50,
            "LevelID": 2,
            "Amps": 32,
            "Voltage": 230,
            "PowerKW": 7,
            "CurrentTypeID": 10,
            "Quantity": 1
        }
    ],
    "NumberOfPoints": 1,
    "StatusTypeID": 50,
    "DateLastStatusUpdate": "2016-11-27T20:13:00Z",
    "DataQualityLevel": 1,
    "DateCreated": "2016-11-23T22:57:00Z",
    "SubmissionStatusTypeID": 200
}