{
    "IsRecentlyVerified": false,
    "ID": 84963,
    "UUID": "B2FAEC15-38B3-437E-9243-59E8A42CDABA",
    "DataProviderID": 1,
    "OperatorID": 1,
    "UsageTypeID": 1,
    "UsageCost": "0",
    "AddressInfo": {
        "ID": 85309,
        "Title": "Centre Commercial Carrefour",
        "AddressLine1": "1 avenue des Océanites",
        "Town": "Saint-Pierre",
        "StateOrProvince": "Réunion",
        "Postcode": "97410",
        "CountryID": 183,
        "Latitude": -21.3260168,
        "Longitude": 55.4714364,
        "ContactTelephone1": "0262700909",
        "ContactTelephone2": "0262700938",
        "AccessComments": "Parking au sous-sol",
        "RelatedURL": "http://www.carrefour-reunion.com",
        "DistanceUnit": 0
    },
    "Connections": [
        {
            "ID": 120707,
            "ConnectionTypeID": 25,
            "StatusTypeID": 50,
            "LevelID": 2,
            "PowerKW": 22
        }
    ],
    "NumberOfPoints": 2,
    "StatusTypeID": 50,
    "DateLastStatusUpdate": "2017-03-22T10:23:00Z",
    "DataQualityLevel": 1,
    "DateCreated": "2017-03-22T07:09:00Z",
    "SubmissionStatusTypeID": 200
}