{
    "IsRecentlyVerified": false,
    "ID": 79209,
    "UUID": "CDB85AE7-C102-4D80-82AF-36BA07AE7D9C",
    "DataProviderID": 1,
    "OperatorID": 23,
    "OperatorsReference": "10544",
    "UsageTypeID": 6,
    "UsageCost": "Free",
    "AddressInfo": {
        "ID": 79555,
        "Title": "Captain Jefferds Inn, A Select Registry Property",
        "AddressLine1": "5 Pearl St",
        "Town": "Kennebunkport",
        "StateOrProvince": "ME",
        "Postcode": "04046",
        "CountryID": 2,
        "Latitude": 43.3591609,
        "Longitude": -70.4747064,
        "ContactTelephone1": "(207) 967-2311",
        "DistanceUnit": 0
    },
    "Connections": [
        {
            "ID": 113828,
            "ConnectionTypeID": 30,
            "StatusTypeID": 50,
            "LevelID": 2,
            "PowerKW": 16,
            "CurrentTypeID": 20,
            "Quantity": 1
        }
    ],
    "NumberOfPoints": 1,
    "GeneralComments": "1 Tesla Connector, up to 16kW.Available for patrons only. Please see front desk.",
    "StatusTypeID": 50,
    "DateLastStatusUpdate": "2017-01-26T21:07:00Z",
    "DataQualityLevel": 1,
    "DateCreated": "2017-01-26T21:07:00Z",
    "SubmissionStatusTypeID": 200
}