{
    "IsRecentlyVerified": false,
    "ID": 177901,
    "UUID": "01FF47DC-5135-4854-93FA-DA4535C3060F",
    "DataProviderID": 29,
    "DataProvidersReference": "9905",
    "OperatorID": 3403,
    "AddressInfo": {
        "ID": 178260,
        "Title": "Markt 3",
        "AddressLine1": "Markt 3",
        "Town": "Havelberg",
        "Postcode": "39539",
        "CountryID": 87,
        "Latitude": 52.825029,
        "Longitude": 12.074925,
        "DistanceUnit": 0
    },
    "Connections": [
        {
            "ID": 277626,
            "ConnectionTypeID": 25,
            "StatusTypeID": 50,
            "LevelID": 2,
            "PowerKW": 22,
            "CurrentTypeID": 20
        },
        {
            "ID": 277627,
            "ConnectionTypeID": 25,
            "StatusTypeID": 50,
            "LevelID": 2,
            "PowerKW": 22,
            "CurrentTypeID": 20
        }
    ],
    "StatusTypeID": 0,
    "DateLastStatusUpdate": "2021-07-12T02:50:00Z",
    "MetadataValues": [
        {
            "ID": 10195,
            "MetadataFieldID": 4,
            "ItemValue": "Data from the German chargepoint registry provided by Bundesnetzagentur.de under the CC-BY 4.0 license"
        }
    ],
    "DataQualityLevel": 3,
    "DateCreated": "2021-07-08T09:49:00Z",
    "SubmissionStatusTypeID": 100
}