{
    "IsRecentlyVerified": false,
    "ID": 183404,
    "UUID": "95FBF4C8-8942-43EA-B5F3-70E2A9278C3F",
    "DataProviderID": 29,
    "DataProvidersReference": "11963",
    "OperatorID": 45,
    "AddressInfo": {
        "ID": 183763,
        "Title": "Werkstraße 7",
        "AddressLine1": "Werkstraße 7",
        "Town": "Auerbach",
        "Postcode": "08209",
        "CountryID": 87,
        "Latitude": 50.521086,
        "Longitude": 12.379935,
        "DistanceUnit": 0
    },
    "Connections": [
        {
            "ID": 290356,
            "ConnectionTypeID": 25,
            "StatusTypeID": 50,
            "LevelID": 2,
            "PowerKW": 3.7,
            "CurrentTypeID": 10
        },
        {
            "ID": 290357,
            "ConnectionTypeID": 25,
            "StatusTypeID": 50,
            "LevelID": 2,
            "PowerKW": 22,
            "CurrentTypeID": 20
        }
    ],
    "StatusTypeID": 50,
    "DateLastStatusUpdate": "2021-07-12T02:45:00Z",
    "MetadataValues": [
        {
            "ID": 15697,
            "MetadataFieldID": 4,
            "ItemValue": "Data from the German chargepoint registry provided by Bundesnetzagentur.de under the CC-BY 4.0 license"
        }
    ],
    "DataQualityLevel": 3,
    "DateCreated": "2021-07-08T10:04:00Z",
    "SubmissionStatusTypeID": 100
}