{
    "IsRecentlyVerified": false,
    "ID": 8111,
    "UUID": "EE66DECB-0068-4C65-BFA8-2CB01F5388DB",
    "DataProviderID": 15,
    "DataProvidersReference": "6078",
    "OperatorID": 26,
    "AddressInfo": {
        "ID": 8008,
        "Title": "740 Boston Post Road",
        "AddressLine1": "740 Boston Post Road",
        "Town": "Marlborough",
        "StateOrProvince": "MA",
        "Postcode": "1752",
        "CountryID": 2,
        "Latitude": 42.35084,
        "Longitude": -71.50151,
        "ContactTelephone1": " (508) 481-3232",
        "RelatedURL": "http://carstations.com/6078",
        "DistanceUnit": 0
    },
    "Connections": [
        {
            "ID": 5540,
            "ConnectionTypeID": 1,
            "Reference": "J1772",
            "LevelID": 2
        }
    ],
    "StatusTypeID": 0,
    "DateLastStatusUpdate": "2017-11-04T14:04:00Z",
    "DataQualityLevel": 1,
    "DateCreated": "2011-11-11T12:06:00Z",
    "SubmissionStatusTypeID": 100
}