{
    "UserComments": [
        {
            "ID": 16214,
            "ChargePointID": 35101,
            "CommentTypeID": 10,
            "UserName": "Bert van Sas",
            "Comment": "14 April 2017 still NOT IN SERVICE. New owner is Shell Emerald, tel +31 088 313 0162. \r\n\r\n",
            "Rating": 2,
            "DateCreated": "2017-04-14T07:13:01.367Z",
            "User": {
                "ID": 11617,
                "Username": "Bert van Sas"
            },
            "CheckinStatusTypeID": 20
        }
    ],
    "IsRecentlyVerified": false,
    "ID": 35101,
    "UUID": "9700D4E5-7C03-4220-84BA-6B59DA766B9B",
    "DataProviderID": 1,
    "OperatorID": 45,
    "OperatorsReference": "NewMotion t_051811lj001ybhiz",
    "UsageTypeID": 1,
    "UsageCost": "0.00 jaarabonnement",
    "AddressInfo": {
        "ID": 35447,
        "Title": "Shell Emerald, A13 TU-Wijk - Delft-Zuid ",
        "AddressLine1": "Importweg 1",
        "Town": "Pijnacker-Nootdorp",
        "Postcode": "2645 EC",
        "CountryID": 159,
        "Latitude": 51.9976692199707,
        "Longitude": 4.39700698852539,
        "ContactTelephone1": "088 0109500",
        "AccessComments": "14 April 2017 still NOT IN SERVICE. New owner is Shell Emerald, tel +31 088 313 0162. \r\n",
        "DistanceUnit": 0
    },
    "Connections": [
        {
            "ID": 38612,
            "ConnectionTypeID": 2,
            "StatusTypeID": 30,
            "LevelID": 3,
            "PowerKW": 50,
            "CurrentTypeID": 30,
            "Quantity": 1
        }
    ],
    "NumberOfPoints": 1,
    "GeneralComments": "14 April 2017 still NOT IN SERVICE. New owner is Shell Emerald, tel +31 088 313 0162. \r\n",
    "StatusTypeID": 30,
    "DateLastStatusUpdate": "2017-04-14T07:13:00Z",
    "DataQualityLevel": 3,
    "DateCreated": "2015-01-09T06:04:00Z",
    "SubmissionStatusTypeID": 100
}