{
    "IsRecentlyVerified": false,
    "ID": 120016,
    "UUID": "B73B5D90-CA83-4518-A35F-99BB90C25B35",
    "DataProviderID": 2,
    "DataProvidersReference": "74649",
    "UsageTypeID": 2,
    "AddressInfo": {
        "ID": 120362,
        "Title": "United Parcel Service",
        "AddressLine1": "8330 Sweetwater Ln",
        "Town": "Houston",
        "StateOrProvince": "TX",
        "Postcode": "77037",
        "CountryID": 2,
        "Latitude": 29.88145,
        "Longitude": -95.407351,
        "ContactTelephone1": "",
        "AccessComments": "",
        "RelatedURL": "",
        "DistanceUnit": 0
    },
    "Connections": [
        {
            "ID": 169325,
            "ConnectionTypeID": 1,
            "LevelID": 2,
            "Amps": 16,
            "Voltage": 230,
            "PowerKW": 3.7,
            "CurrentTypeID": 10,
            "Quantity": 18
        }
    ],
    "DateLastStatusUpdate": "2020-06-26T02:53:00Z",
    "DataQualityLevel": 3,
    "DateCreated": "2019-04-01T04:59:00Z",
    "SubmissionStatusTypeID": 100
}