{
    "IsRecentlyVerified": false,
    "ID": 60211,
    "UUID": "CA2C0604-2C50-4A90-9550-3B22766E7173",
    "DataProviderID": 1,
    "OperatorID": 80,
    "UsageTypeID": 4,
    "UsageCost": "0,40 €/kW",
    "AddressInfo": {
        "ID": 60557,
        "Title": "Eneldrive (ex SILFI) Europa",
        "AddressLine1": "Via Ungheria / Viale Europa, 119",
        "Town": "Firenze",
        "StateOrProvince": "FI",
        "Postcode": "50126",
        "CountryID": 112,
        "Latitude": 43.756950683663,
        "Longitude": 11.29434085028992,
        "RelatedURL": "http://eneldrive.it",
        "DistanceUnit": 0
    },
    "Connections": [
        {
            "ID": 76208,
            "ConnectionTypeID": 36,
            "StatusTypeID": 50,
            "LevelID": 2,
            "Amps": 16,
            "Voltage": 240,
            "PowerKW": 3,
            "CurrentTypeID": 10,
            "Quantity": 1
        },
        {
            "ID": 76209,
            "ConnectionTypeID": 25,
            "StatusTypeID": 50,
            "LevelID": 2,
            "Amps": 32,
            "Voltage": 400,
            "PowerKW": 22,
            "CurrentTypeID": 20,
            "Quantity": 1
        }
    ],
    "NumberOfPoints": 2,
    "StatusTypeID": 50,
    "DateLastStatusUpdate": "2016-01-13T18:27:00Z",
    "DataQualityLevel": 1,
    "DateCreated": "2016-01-13T18:27:00Z",
    "SubmissionStatusTypeID": 200
}