{
    "IsRecentlyVerified": false,
    "ID": 3345,
    "UUID": "CB967246-F268-43C8-AB35-BE6DF106E782",
    "DataProviderID": 1,
    "OperatorID": 6,
    "UsageTypeID": 6,
    "AddressInfo": {
        "ID": 3346,
        "Title": "Crown Motors Nissan",
        "AddressLine1": "300 East Cypress Avenue",
        "Town": "Redding",
        "StateOrProvince": "CA",
        "Postcode": "96002",
        "CountryID": 2,
        "Latitude": 40.57149,
        "Longitude": -122.3665,
        "ContactTelephone1": "530-223-2177",
        "DistanceUnit": 0
    },
    "Connections": [],
    "NumberOfPoints": 2,
    "GeneralComments": "Cost To Charge: Free Access Hours: Unknown",
    "DateLastStatusUpdate": "2019-12-15T06:07:00Z",
    "DateCreated": "2010-02-28T00:00:00Z",
    "SubmissionStatusTypeID": 200
}