{
    "IsRecentlyVerified": false,
    "ID": 97615,
    "UUID": "D246801A-D28A-4F31-B79B-FFA0C70F6E1C",
    "DataProviderID": 1,
    "OperatorID": 23,
    "OperatorsReference": "38123",
    "UsageTypeID": 4,
    "AddressInfo": {
        "ID": 97961,
        "Title": "Hotel Tesla Smart Stay",
        "AddressLine1": "42 Sumatovacka",
        "Town": "Belgrade",
        "Postcode": "11000",
        "CountryID": 199,
        "Latitude": 44.795242,
        "Longitude": 20.472455,
        "ContactTelephone1": "+381 63 412 669",
        "DistanceUnit": 0
    },
    "Connections": [
        {
            "ID": 138523,
            "ConnectionTypeID": 30,
            "StatusTypeID": 50,
            "LevelID": 2,
            "Amps": 32,
            "Voltage": 400,
            "PowerKW": 22,
            "CurrentTypeID": 20,
            "Quantity": 1
        }
    ],
    "NumberOfPoints": 1,
    "GeneralComments": "1 Tesla Connector, up to 22kW.Available for customers. Please call ahead.",
    "StatusTypeID": 50,
    "DateLastStatusUpdate": "2018-10-04T00:07:00Z",
    "DataQualityLevel": 1,
    "DateCreated": "2018-01-21T15:54:00Z",
    "SubmissionStatusTypeID": 200
}