{
    "IsRecentlyVerified": false,
    "ID": 51316,
    "UUID": "88E49E4C-62CE-497A-8A8F-A4968FE1ED57",
    "DataProviderID": 26,
    "DataProvidersReference": "64195",
    "OperatorID": 73,
    "OperatorsReference": "EV-Box EVB-P1514044",
    "UsageCost": "0.00 jaarabonnement",
    "AddressInfo": {
        "ID": 51662,
        "Title": "Carsveldstraat 14",
        "AddressLine1": "Carsveldstraat 14",
        "Town": "Rotterdam",
        "Postcode": "3077 TM",
        "CountryID": 159,
        "Latitude": 51.89708,
        "Longitude": 4.56296,
        "RelatedURL": "http://www.ev-box.nl",
        "DistanceUnit": 0
    },
    "Connections": [
        {
            "ID": 63506,
            "ConnectionTypeID": 25,
            "LevelID": 2,
            "PowerKW": 11,
            "CurrentTypeID": 10
        },
        {
            "ID": 63507,
            "ConnectionTypeID": 25,
            "LevelID": 2,
            "PowerKW": 11,
            "CurrentTypeID": 10
        }
    ],
    "NumberOfPoints": 1,
    "StatusTypeID": 50,
    "DateLastStatusUpdate": "2016-06-04T02:42:00Z",
    "DataQualityLevel": 3,
    "DateCreated": "2015-07-24T06:28:00Z",
    "SubmissionStatusTypeID": 100
}