{
    "IsRecentlyVerified": false,
    "ID": 185470,
    "UUID": "046EE44A-E6DE-4979-9D5B-36A4621CF42C",
    "DataProviderID": 29,
    "DataProvidersReference": "10984,325",
    "AddressInfo": {
        "ID": 185829,
        "Title": "Preußerstr. 999",
        "AddressLine1": "Preußerstr. 999",
        "Town": "Eckernförde",
        "Postcode": "24340",
        "CountryID": 87,
        "Latitude": 54.463754,
        "Longitude": 9.840495,
        "DistanceUnit": 0
    },
    "Connections": [
        {
            "ID": 295004,
            "ConnectionTypeID": 25,
            "StatusTypeID": 50,
            "LevelID": 2,
            "PowerKW": 22,
            "CurrentTypeID": 20
        },
        {
            "ID": 295005,
            "ConnectionTypeID": 25,
            "StatusTypeID": 50,
            "LevelID": 2,
            "PowerKW": 22,
            "CurrentTypeID": 20
        },
        {
            "ID": 295006,
            "ConnectionTypeID": 25,
            "StatusTypeID": 50,
            "LevelID": 2,
            "PowerKW": 22,
            "CurrentTypeID": 20
        },
        {
            "ID": 295007,
            "ConnectionTypeID": 25,
            "StatusTypeID": 50,
            "LevelID": 2,
            "PowerKW": 22,
            "CurrentTypeID": 20
        }
    ],
    "StatusTypeID": 50,
    "DateLastStatusUpdate": "2021-07-09T03:31:00Z",
    "MetadataValues": [
        {
            "ID": 17761,
            "MetadataFieldID": 4,
            "ItemValue": "Data from the German chargepoint registry provided by Bundesnetzagentur.de under the CC-BY 4.0 license"
        }
    ],
    "DataQualityLevel": 3,
    "DateCreated": "2021-07-08T10:07:00Z",
    "SubmissionStatusTypeID": 100
}