{
    "IsRecentlyVerified": false,
    "ID": 186894,
    "UUID": "6261B862-83CE-4C6C-A3ED-AB8304A96F2F",
    "DataProviderID": 29,
    "DataProvidersReference": "4295,18215",
    "OperatorID": 128,
    "AddressInfo": {
        "ID": 187253,
        "Title": "Kurt-Schumacher-Ring 226",
        "AddressLine1": "Kurt-Schumacher-Ring 226",
        "Town": "Wolfsburg",
        "Postcode": "38444",
        "CountryID": 87,
        "Latitude": 52.39862,
        "Longitude": 10.7542,
        "DistanceUnit": 0
    },
    "Connections": [
        {
            "ID": 300500,
            "ConnectionTypeID": 25,
            "StatusTypeID": 50,
            "LevelID": 2,
            "PowerKW": 22,
            "CurrentTypeID": 20
        },
        {
            "ID": 300501,
            "ConnectionTypeID": 25,
            "StatusTypeID": 50,
            "LevelID": 2,
            "PowerKW": 22,
            "CurrentTypeID": 20
        },
        {
            "ID": 300502,
            "ConnectionTypeID": 25,
            "StatusTypeID": 50,
            "LevelID": 2,
            "PowerKW": 22,
            "CurrentTypeID": 20
        },
        {
            "ID": 300503,
            "ConnectionTypeID": 25,
            "StatusTypeID": 50,
            "LevelID": 2,
            "PowerKW": 22,
            "CurrentTypeID": 20
        }
    ],
    "StatusTypeID": 50,
    "DateLastStatusUpdate": "2021-07-12T02:49:00Z",
    "MetadataValues": [
        {
            "ID": 19134,
            "MetadataFieldID": 4,
            "ItemValue": "Data from the German chargepoint registry provided by Bundesnetzagentur.de under the CC-BY 4.0 license"
        }
    ],
    "DataQualityLevel": 3,
    "DateCreated": "2021-07-12T02:49:00Z",
    "SubmissionStatusTypeID": 100
}