{
    "IsRecentlyVerified": false,
    "ID": 178803,
    "UUID": "3BB28B80-91F7-4CDF-AD96-457064F97196",
    "DataProviderID": 29,
    "DataProvidersReference": "11575",
    "OperatorID": 2243,
    "AddressInfo": {
        "ID": 179162,
        "Title": "Alfred-Neubert-Str. 17",
        "AddressLine1": "Alfred-Neubert-Str. 17",
        "Town": "Chemnitz",
        "Postcode": "09123",
        "CountryID": 87,
        "Latitude": 50.786366,
        "Longitude": 12.902672,
        "DistanceUnit": 0
    },
    "Connections": [
        {
            "ID": 279728,
            "ConnectionTypeID": 28,
            "StatusTypeID": 50,
            "LevelID": 2,
            "PowerKW": 22,
            "CurrentTypeID": 20
        },
        {
            "ID": 279729,
            "ConnectionTypeID": 25,
            "StatusTypeID": 50,
            "LevelID": 2,
            "PowerKW": 22,
            "CurrentTypeID": 20
        },
        {
            "ID": 298181,
            "ConnectionTypeID": 28,
            "StatusTypeID": 50,
            "LevelID": 2,
            "PowerKW": 22,
            "CurrentTypeID": 20
        },
        {
            "ID": 298182,
            "ConnectionTypeID": 25,
            "StatusTypeID": 50,
            "LevelID": 2,
            "PowerKW": 22,
            "CurrentTypeID": 20
        }
    ],
    "StatusTypeID": 0,
    "DateLastStatusUpdate": "2021-07-12T02:45:00Z",
    "MetadataValues": [
        {
            "ID": 11097,
            "MetadataFieldID": 4,
            "ItemValue": "Data from the German chargepoint registry provided by Bundesnetzagentur.de under the CC-BY 4.0 license"
        }
    ],
    "DataQualityLevel": 3,
    "DateCreated": "2021-07-08T09:50:00Z",
    "SubmissionStatusTypeID": 100
}