{
    "IsRecentlyVerified": false,
    "ID": 138782,
    "UUID": "F2372694-90BB-4C85-BBB0-B7444DBAEBC5",
    "DataProviderID": 2,
    "DataProvidersReference": "147046",
    "OperatorID": 5,
    "UsageTypeID": 1,
    "AddressInfo": {
        "ID": 139134,
        "Title": "BMR",
        "AddressLine1": "4940 Carroll Canyon Rd",
        "Town": "San Diego",
        "StateOrProvince": "CA",
        "Postcode": "92121",
        "CountryID": 2,
        "Latitude": 32.8903724,
        "Longitude": -117.1992445,
        "ContactTelephone1": "888-758-4389",
        "AccessComments": "24 hours daily",
        "RelatedURL": "http://www.chargepoint.com/",
        "DistanceUnit": 0
    },
    "Connections": [
        {
            "ID": 193989,
            "ConnectionTypeID": 1,
            "LevelID": 2,
            "Amps": 16,
            "Voltage": 230,
            "PowerKW": 3,
            "CurrentTypeID": 10,
            "Quantity": 2
        }
    ],
    "StatusTypeID": 50,
    "DateLastStatusUpdate": "2019-12-24T09:09:00Z",
    "DataQualityLevel": 3,
    "DateCreated": "2019-12-24T09:09:00Z",
    "SubmissionStatusTypeID": 100
}