{
    "IsRecentlyVerified": false,
    "ID": 104053,
    "UUID": "0BB0A188-3638-416C-B4D6-AD9EAF8F3843",
    "DataProviderID": 1,
    "OperatorID": 45,
    "UsageTypeID": 1,
    "AddressInfo": {
        "ID": 104399,
        "Title": "Euronics XXL Eickhoff",
        "AddressLine1": "Külbe 17",
        "Town": "Warstein",
        "StateOrProvince": "Kreis Soest",
        "Postcode": "59581",
        "CountryID": 87,
        "Latitude": 51.489537055508706,
        "Longitude": 8.334868047221335,
        "AccessComments": "24/7 kostenlos nutzbare Ladesäule auf dem Kundenparkplatz des EURONICS XXL, auf der Straßenseite gegenüber dem Geschäft. Direkt neben dem Blumengeschäft.",
        "RelatedURL": "http://www.klinikumbielefeld.de/",
        "DistanceUnit": 0
    },
    "Connections": [
        {
            "ID": 146872,
            "ConnectionTypeID": 25,
            "StatusTypeID": 50,
            "LevelID": 2,
            "Amps": 32,
            "Voltage": 400,
            "PowerKW": 22,
            "CurrentTypeID": 20,
            "Quantity": 2
        }
    ],
    "NumberOfPoints": 2,
    "StatusTypeID": 50,
    "DateLastStatusUpdate": "2018-05-15T09:10:00Z",
    "DataQualityLevel": 1,
    "DateCreated": "2018-05-15T09:10:00Z",
    "SubmissionStatusTypeID": 200
}