{
    "IsRecentlyVerified": false,
    "ID": 145769,
    "UUID": "627A1B5D-C5B4-46E0-B2A3-D49D2AAEF3BB",
    "DataProviderID": 2,
    "DataProvidersReference": "122927",
    "UsageTypeID": 1,
    "AddressInfo": {
        "ID": 146121,
        "Title": "Fogo Island Inn",
        "AddressLine1": "210 Main Rd",
        "Town": "Joe Batt's Arm",
        "StateOrProvince": "NL",
        "Postcode": "A0G 2X0",
        "CountryID": 44,
        "Latitude": 49.7309895929704,
        "Longitude": -54.1777242849121,
        "ContactTelephone1": "709-658-3444",
        "AccessComments": "24 hours daily; see front desk for access",
        "RelatedURL": "",
        "DistanceUnit": 0
    },
    "Connections": [
        {
            "ID": 202507,
            "ConnectionTypeID": 1,
            "LevelID": 2,
            "Amps": 16,
            "Voltage": 230,
            "PowerKW": 3.7,
            "CurrentTypeID": 10,
            "Quantity": 1
        }
    ],
    "StatusTypeID": 50,
    "DateLastStatusUpdate": "2020-06-26T03:12:00Z",
    "DataQualityLevel": 3,
    "DateCreated": "2019-12-24T09:25:00Z",
    "SubmissionStatusTypeID": 100
}