{
    "UserComments": [
        {
            "ID": 10109,
            "ChargePointID": 64997,
            "CommentTypeID": 10,
            "UserName": "Thomas Walther",
            "Comment": "",
            "Rating": 5,
            "DateCreated": "2016-04-06T19:27:52.04Z",
            "User": {
                "ID": 9031,
                "Username": "Thomas Walther"
            },
            "CheckinStatusTypeID": 10
        }
    ],
    "MediaItems": [
        {
            "ID": 6171,
            "ChargePointID": 64997,
            "ItemURL": "https://s3-ap-southeast-2.amazonaws.com/openchargemap/images/DE/OCM64997/OCM-64997.orig.2016040619315196.jpeg",
            "ItemThumbnailURL": "https://s3-ap-southeast-2.amazonaws.com/openchargemap/images/DE/OCM64997/OCM-64997.thmb.2016040619315196.jpeg",
            "Comment": "",
            "IsEnabled": true,
            "IsVideo": false,
            "IsFeaturedItem": false,
            "IsExternalResource": false,
            "User": {
                "ID": 9031,
                "Username": "Thomas Walther"
            },
            "DateCreated": "2016-04-06T19:32:00Z"
        },
        {
            "ID": 6170,
            "ChargePointID": 64997,
            "ItemURL": "https://s3-ap-southeast-2.amazonaws.com/openchargemap/images/DE/OCM64997/OCM-64997.orig.2016040619303838.jpg",
            "ItemThumbnailURL": "https://s3-ap-southeast-2.amazonaws.com/openchargemap/images/DE/OCM64997/OCM-64997.thmb.2016040619303838.jpg",
            "Comment": "",
            "IsEnabled": true,
            "IsVideo": false,
            "IsFeaturedItem": false,
            "IsExternalResource": false,
            "User": {
                "ID": 9031,
                "Username": "Thomas Walther"
            },
            "DateCreated": "2016-04-06T19:31:00Z"
        },
        {
            "ID": 6169,
            "ChargePointID": 64997,
            "ItemURL": "https://s3-ap-southeast-2.amazonaws.com/openchargemap/images/DE/OCM64997/OCM-64997.orig.2016040619282882.jpg",
            "ItemThumbnailURL": "https://s3-ap-southeast-2.amazonaws.com/openchargemap/images/DE/OCM64997/OCM-64997.thmb.2016040619282882.jpg",
            "Comment": "",
            "IsEnabled": true,
            "IsVideo": false,
            "IsFeaturedItem": false,
            "IsExternalResource": false,
            "User": {
                "ID": 9031,
                "Username": "Thomas Walther"
            },
            "DateCreated": "2016-04-06T19:29:00Z"
        }
    ],
    "IsRecentlyVerified": false,
    "ID": 64997,
    "UUID": "48F782E7-3ECD-4C31-A9E7-77247603E5A0",
    "DataProviderID": 1,
    "OperatorID": 156,
    "UsageTypeID": 4,
    "UsageCost": "0,30€",
    "AddressInfo": {
        "ID": 65343,
        "Title": "Bahnhof Scharfenstein",
        "AddressLine1": "Bahnhofstrasse",
        "AddressLine2": "",
        "Town": "Scharfenstein",
        "StateOrProvince": "Saxony",
        "Postcode": "09430",
        "CountryID": 87,
        "Latitude": 50.70291805205612,
        "Longitude": 13.056280934598584,
        "ContactTelephone1": "+491714039464",
        "ContactTelephone2": "",
        "ContactEmail": "info@buerger-energie-drebach.de",
        "AccessComments": "Ladesäule auf dem Parkplatz vor dem Bahnhofsgebäude neben dem Geldautomat der Erzgebirgssparkasse. The charging station is located on the parking lot at the train station next to the ATM. Die Ladesäule wird von der Bürgerenergiegenossenschaft Bürger Energie Drebach eG betrieben. The charging station is operated by the citizen energy cooperative \"Bürger Energie Drebach eG\" www.buerger-energie-drebach.de",
        "RelatedURL": "http://www.buerger-energie-drebach.de",
        "DistanceUnit": 0
    },
    "Connections": [
        {
            "ID": 83652,
            "ConnectionTypeID": 25,
            "StatusTypeID": 50,
            "LevelID": 2,
            "Amps": 32,
            "Voltage": 230,
            "PowerKW": 22,
            "CurrentTypeID": 20,
            "Quantity": 1
        }
    ],
    "NumberOfPoints": 1,
    "GeneralComments": "",
    "StatusTypeID": 50,
    "DateLastStatusUpdate": "2016-04-06T19:32:00Z",
    "DataQualityLevel": 1,
    "DateCreated": "2016-04-04T09:40:00Z",
    "SubmissionStatusTypeID": 200
}