{
    "IsRecentlyVerified": false,
    "ID": 67214,
    "UUID": "65654441-4528-4AA8-A6BD-47DD8C3C7594",
    "DataProviderID": 1,
    "OperatorID": 23,
    "OperatorsReference": "13877",
    "UsageTypeID": 1,
    "UsageCost": "Free",
    "AddressInfo": {
        "ID": 67560,
        "Title": "Hotel Monaco - Tesla",
        "AddressLine1": "480 King St",
        "Town": "Alexandria",
        "StateOrProvince": "VA",
        "Postcode": "22314",
        "CountryID": 2,
        "Latitude": 38.8043867,
        "Longitude": -77.0445632,
        "ContactTelephone1": "703-549-6080  877-798-3752",
        "AccessComments": "24 hours daily; for Tesla use only; see front desk for access",
        "RelatedURL": "http://www.teslamotors.com/supercharger",
        "DistanceUnit": 0
    },
    "Connections": [
        {
            "ID": 92713,
            "ConnectionTypeID": 30,
            "StatusTypeID": 50,
            "LevelID": 2,
            "Amps": 16,
            "Voltage": 230,
            "PowerKW": 8,
            "CurrentTypeID": 10,
            "Quantity": 1
        }
    ],
    "NumberOfPoints": 1,
    "StatusTypeID": 50,
    "DateLastStatusUpdate": "2017-01-26T02:41:00Z",
    "DataQualityLevel": 3,
    "DateCreated": "2016-05-29T02:04:00Z",
    "SubmissionStatusTypeID": 100
}