{
    "IsRecentlyVerified": false,
    "ID": 157016,
    "UUID": "F8F4FCF7-39CF-4F05-977F-0F15BF13101D",
    "DataProviderID": 19,
    "DataProvidersReference": "1206",
    "AddressInfo": {
        "ID": 157370,
        "Title": "NRK Marienlyst Radiohuset, Oslo",
        "AddressLine1": "Bjørnstjerne Bjørnsons plass 1",
        "Town": "OSLO",
        "StateOrProvince": "Oslo",
        "Postcode": "0340",
        "CountryID": 168,
        "Latitude": 59.93479,
        "Longitude": 10.71759,
        "AccessComments": "Parkometerparkering med lademulighet ved inngangen til radiohuset.",
        "DistanceUnit": 0
    },
    "Connections": [
        {
            "ID": 224080,
            "ConnectionTypeID": 28,
            "Reference": "1",
            "LevelID": 2,
            "Amps": 16,
            "Voltage": 230,
            "PowerKW": 3.7,
            "CurrentTypeID": 10,
            "Comments": "Mode 1"
        },
        {
            "ID": 224081,
            "ConnectionTypeID": 28,
            "Reference": "2",
            "LevelID": 2,
            "Amps": 16,
            "Voltage": 230,
            "PowerKW": 3.7,
            "CurrentTypeID": 10,
            "Comments": "Mode 1"
        }
    ],
    "NumberOfPoints": 2,
    "StatusTypeID": 0,
    "DateLastStatusUpdate": "2020-05-26T08:23:00Z",
    "DataQualityLevel": 2,
    "DateCreated": "2020-05-26T08:23:00Z",
    "SubmissionStatusTypeID": 100
}