{
    "IsRecentlyVerified": false,
    "ID": 136041,
    "UUID": "2005B9B5-3889-4891-A95E-B7E17948334F",
    "DataProviderID": 18,
    "DataProvidersReference": "385c0958cf6fad65d5fc7ff75ec94890",
    "OperatorID": 2244,
    "UsageTypeID": 4,
    "AddressInfo": {
        "ID": 136387,
        "Title": "Chesterfield Road",
        "AddressLine1": "Chesterfield Road",
        "Town": "Chiswick, London",
        "Postcode": "W4 3HQ",
        "CountryID": 1,
        "Latitude": 51.486102,
        "Longitude": -0.26736,
        "AccessComments": "",
        "RelatedURL": "https://www.ubitricity.com",
        "DistanceUnit": 0
    },
    "Connections": [
        {
            "ID": 190468,
            "ConnectionTypeID": 25,
            "Reference": "steob100000740",
            "StatusTypeID": 50,
            "LevelID": 2,
            "Amps": 16,
            "Voltage": 230,
            "PowerKW": 3.7,
            "CurrentTypeID": 10
        }
    ],
    "StatusTypeID": 0,
    "DateLastStatusUpdate": "2021-04-25T05:46:00Z",
    "MetadataValues": [
        {
            "ID": 5893,
            "MetadataFieldID": 4,
            "ItemValue": "Contains public sector information licensed under the Open Government Licence v2.0. http://www.nationalarchives.gov.uk/doc/open-government-licence/version/2/"
        }
    ],
    "DataQualityLevel": 3,
    "DateCreated": "2019-12-24T05:22:00Z",
    "SubmissionStatusTypeID": 100
}