{
    "IsRecentlyVerified": false,
    "ID": 171462,
    "UUID": "71BA4754-3A34-4305-BDF8-6A1EC9F22A4F",
    "DataProviderID": 1,
    "OperatorID": 1,
    "UsageTypeID": 4,
    "AddressInfo": {
        "ID": 171821,
        "Title": "Avenue de Saintonge",
        "AddressLine1": "Avenue de Saintonge",
        "Town": "Lusignan",
        "StateOrProvince": "Aquitaine-Limousin-Poitou-Charentes",
        "Postcode": "86600",
        "CountryID": 80,
        "Latitude": 46.42909815113518,
        "Longitude": 0.11590055305384794,
        "DistanceUnit": 0
    },
    "Connections": [
        {
            "ID": 262135,
            "ConnectionTypeID": 33,
            "StatusTypeID": 50,
            "LevelID": 3,
            "PowerKW": 100,
            "CurrentTypeID": 30,
            "Quantity": 1
        },
        {
            "ID": 262136,
            "ConnectionTypeID": 2,
            "StatusTypeID": 50,
            "LevelID": 3,
            "PowerKW": 100,
            "CurrentTypeID": 30,
            "Quantity": 1
        }
    ],
    "NumberOfPoints": 1,
    "StatusTypeID": 50,
    "DateLastStatusUpdate": "2021-01-02T19:34:00Z",
    "DataQualityLevel": 1,
    "DateCreated": "2021-01-02T08:33:00Z",
    "SubmissionStatusTypeID": 200
}