{
    "IsRecentlyVerified": false,
    "ID": 177854,
    "UUID": "15F90046-47A2-4C76-85DA-F69FA8567B66",
    "DataProviderID": 29,
    "DataProvidersReference": "510",
    "OperatorID": 69,
    "AddressInfo": {
        "ID": 178213,
        "Title": "Flurstraße 9",
        "AddressLine1": "Flurstraße 9",
        "Town": "Blaubeuren - Seißen",
        "Postcode": "89143",
        "CountryID": 87,
        "Latitude": 48.418242,
        "Longitude": 9.748788,
        "DistanceUnit": 0
    },
    "Connections": [
        {
            "ID": 277530,
            "ConnectionTypeID": 25,
            "StatusTypeID": 50,
            "LevelID": 2,
            "PowerKW": 22,
            "CurrentTypeID": 20
        }
    ],
    "StatusTypeID": 0,
    "DateLastStatusUpdate": "2021-07-09T03:12:00Z",
    "MetadataValues": [
        {
            "ID": 10148,
            "MetadataFieldID": 4,
            "ItemValue": "Data from the German chargepoint registry provided by Bundesnetzagentur.de under the CC-BY 4.0 license"
        }
    ],
    "DataQualityLevel": 3,
    "DateCreated": "2021-07-08T09:49:00Z",
    "SubmissionStatusTypeID": 100
}