{
    "IsRecentlyVerified": false,
    "ID": 178744,
    "UUID": "CF1B8276-98ED-4708-B267-5F6E4C53CF74",
    "DataProviderID": 29,
    "DataProvidersReference": "6651",
    "OperatorID": 3351,
    "AddressInfo": {
        "ID": 179103,
        "Title": "Parkplatz Am Hammerberg",
        "AddressLine1": "Parkplatz Am Hammerberg",
        "Town": "Limburg",
        "Postcode": "65549",
        "CountryID": 87,
        "Latitude": 50.380025,
        "Longitude": 8.079082,
        "DistanceUnit": 0
    },
    "Connections": [
        {
            "ID": 279599,
            "ConnectionTypeID": 25,
            "StatusTypeID": 50,
            "LevelID": 2,
            "PowerKW": 11,
            "CurrentTypeID": 20
        },
        {
            "ID": 279600,
            "ConnectionTypeID": 25,
            "StatusTypeID": 50,
            "LevelID": 2,
            "PowerKW": 11,
            "CurrentTypeID": 20
        },
        {
            "ID": 279601,
            "ConnectionTypeID": 1036,
            "StatusTypeID": 50,
            "LevelID": 3,
            "PowerKW": 43,
            "CurrentTypeID": 20
        },
        {
            "ID": 279602,
            "ConnectionTypeID": 25,
            "StatusTypeID": 50,
            "LevelID": 2,
            "PowerKW": 22,
            "CurrentTypeID": 20
        }
    ],
    "StatusTypeID": 0,
    "DateLastStatusUpdate": "2021-07-12T02:44:00Z",
    "MetadataValues": [
        {
            "ID": 11038,
            "MetadataFieldID": 4,
            "ItemValue": "Data from the German chargepoint registry provided by Bundesnetzagentur.de under the CC-BY 4.0 license"
        }
    ],
    "DataQualityLevel": 3,
    "DateCreated": "2021-07-08T09:50:00Z",
    "SubmissionStatusTypeID": 100
}