{
    "IsRecentlyVerified": false,
    "ID": 163476,
    "UUID": "3E153D29-F5D9-4681-AAEB-CD895F9C15E9",
    "DataProviderID": 1,
    "OperatorID": 23,
    "OperatorsReference": "23397",
    "UsageTypeID": 4,
    "AddressInfo": {
        "ID": 163833,
        "Title": "Hotel Chalet Val de Ruda",
        "AddressLine1": "Baqueira Beret - Edif.val de Ruda",
        "Town": "Naut Aran",
        "Postcode": "25598",
        "CountryID": 210,
        "Latitude": 42.699976,
        "Longitude": 0.931197,
        "ContactTelephone1": "+34 973 645 258",
        "DistanceUnit": 0
    },
    "Connections": [
        {
            "ID": 235073,
            "ConnectionTypeID": 30,
            "StatusTypeID": 50,
            "LevelID": 2,
            "PowerKW": 22,
            "CurrentTypeID": 20,
            "Quantity": 1
        }
    ],
    "NumberOfPoints": 1,
    "GeneralComments": "1 Tesla Connector, up to 22kW.Available for customers. Please see front desk.",
    "StatusTypeID": 50,
    "DateLastStatusUpdate": "2020-08-24T11:16:00Z",
    "DataQualityLevel": 1,
    "DateCreated": "2020-08-24T11:16:00Z",
    "SubmissionStatusTypeID": 200
}