{
    "IsRecentlyVerified": false,
    "ID": 162064,
    "UUID": "4AD2BE24-2AD6-4DFE-8298-C69202948ED6",
    "DataProviderID": 1,
    "OperatorID": 108,
    "UsageTypeID": 1,
    "AddressInfo": {
        "ID": 162421,
        "Title": "Honthorststraat",
        "AddressLine1": "Honthorststraat 46",
        "Town": "Amsterdam",
        "StateOrProvince": "Noord-Holland",
        "Postcode": "1071DH",
        "CountryID": 159,
        "Latitude": 52.35769059255907,
        "Longitude": 4.88575757377555,
        "DistanceUnit": 0
    },
    "Connections": [
        {
            "ID": 233252,
            "ConnectionTypeID": 25,
            "StatusTypeID": 50,
            "LevelID": 2,
            "Amps": 16,
            "Voltage": 400,
            "PowerKW": 11,
            "CurrentTypeID": 20,
            "Quantity": 2
        }
    ],
    "NumberOfPoints": 2,
    "StatusTypeID": 50,
    "DateLastStatusUpdate": "2020-08-04T18:17:00Z",
    "DataQualityLevel": 1,
    "DateCreated": "2020-08-01T10:57:00Z",
    "SubmissionStatusTypeID": 200
}