{
    "IsRecentlyVerified": false,
    "ID": 68886,
    "UUID": "CAEC351D-AEB1-464F-9276-D5A8409E938E",
    "DataProviderID": 1,
    "OperatorID": 23,
    "OperatorsReference": "18070",
    "UsageTypeID": 1,
    "UsageCost": "Free",
    "AddressInfo": {
        "ID": 69232,
        "Title": "The Jacqueline House of Wilmington - Tesla",
        "AddressLine1": "3213 SR 956",
        "Town": "New Castle",
        "StateOrProvince": "PA",
        "Postcode": "16105",
        "CountryID": 2,
        "Latitude": 41.0930805,
        "Longitude": -80.3286793,
        "ContactTelephone1": "724-901-7059  877-798-3752",
        "AccessComments": "24 hours daily; for Tesla use only; for guest use only; see front desk for access",
        "RelatedURL": "http://www.teslamotors.com/supercharger",
        "DistanceUnit": 0
    },
    "Connections": [
        {
            "ID": 96589,
            "ConnectionTypeID": 30,
            "StatusTypeID": 50,
            "LevelID": 2,
            "Amps": 16,
            "Voltage": 230,
            "PowerKW": 13,
            "CurrentTypeID": 10,
            "Quantity": 1
        }
    ],
    "NumberOfPoints": 1,
    "StatusTypeID": 50,
    "DateLastStatusUpdate": "2017-01-26T04:17:00Z",
    "DataQualityLevel": 3,
    "DateCreated": "2016-06-25T03:36:00Z",
    "SubmissionStatusTypeID": 100
}