{
    "IsRecentlyVerified": false,
    "ID": 185735,
    "UUID": "20E82B60-8AB9-4728-9774-AF09C533EA4C",
    "DataProviderID": 29,
    "DataProvidersReference": "5705",
    "AddressInfo": {
        "ID": 186094,
        "Title": "Inselstraße 2A",
        "AddressLine1": "Inselstraße 2A",
        "Town": "Bad Abbach",
        "Postcode": "93077",
        "CountryID": 87,
        "Latitude": 48.93703,
        "Longitude": 12.0318,
        "DistanceUnit": 0
    },
    "Connections": [
        {
            "ID": 296411,
            "ConnectionTypeID": 25,
            "StatusTypeID": 50,
            "LevelID": 2,
            "PowerKW": 22,
            "CurrentTypeID": 20
        },
        {
            "ID": 296412,
            "ConnectionTypeID": 25,
            "StatusTypeID": 50,
            "LevelID": 2,
            "PowerKW": 11,
            "CurrentTypeID": 20
        }
    ],
    "StatusTypeID": 50,
    "DateLastStatusUpdate": "2021-07-12T02:42:00Z",
    "MetadataValues": [
        {
            "ID": 17979,
            "MetadataFieldID": 4,
            "ItemValue": "Data from the German chargepoint registry provided by Bundesnetzagentur.de under the CC-BY 4.0 license"
        }
    ],
    "DataQualityLevel": 3,
    "DateCreated": "2021-07-12T02:42:00Z",
    "SubmissionStatusTypeID": 100
}