{
    "IsRecentlyVerified": false,
    "ID": 157937,
    "UUID": "9F7FC7A8-4528-4FA0-8107-9AF6649FDA2C",
    "DataProviderID": 18,
    "DataProvidersReference": "9606eb3c0bc6676d20ca3196b94ba7e4",
    "OperatorID": 8,
    "UsageTypeID": 4,
    "AddressInfo": {
        "ID": 158291,
        "Title": "Saint Mary street",
        "AddressLine1": "Saint Mary street",
        "Town": "High Wycombe",
        "Postcode": "HP11 2HF",
        "CountryID": 1,
        "Latitude": 51.628414,
        "Longitude": -0.750396,
        "AccessComments": "",
        "RelatedURL": "https://www.bpchargemaster.com",
        "DistanceUnit": 0
    },
    "Connections": [
        {
            "ID": 227627,
            "ConnectionTypeID": 25,
            "Reference": "1",
            "StatusTypeID": 50,
            "LevelID": 2,
            "Amps": 32,
            "Voltage": 230,
            "PowerKW": 7,
            "CurrentTypeID": 10
        },
        {
            "ID": 227628,
            "ConnectionTypeID": 25,
            "Reference": "2",
            "StatusTypeID": 50,
            "LevelID": 2,
            "Amps": 32,
            "Voltage": 400,
            "PowerKW": 22,
            "CurrentTypeID": 20
        }
    ],
    "StatusTypeID": 0,
    "DateLastStatusUpdate": "2020-06-25T10:00:00Z",
    "MetadataValues": [
        {
            "ID": 7470,
            "MetadataFieldID": 4,
            "ItemValue": "Contains public sector information licensed under the Open Government Licence v2.0. http://www.nationalarchives.gov.uk/doc/open-government-licence/version/2/"
        }
    ],
    "DataQualityLevel": 3,
    "DateCreated": "2020-06-25T10:00:00Z",
    "SubmissionStatusTypeID": 100
}