{
    "IsRecentlyVerified": false,
    "ID": 150021,
    "UUID": "943B9671-479E-41BE-BE2B-CC0257CC1906",
    "DataProviderID": 1,
    "OperatorID": 103,
    "UsageTypeID": 4,
    "UsageCost": "€ 0,39/kWh + € 0,013/min",
    "AddressInfo": {
        "ID": 150374,
        "Title": "Hülsbecker Straße",
        "AddressLine1": "Hülsbecker Straße",
        "Town": "Heiligenhaus",
        "StateOrProvince": "North Rhine-Westphalia",
        "Postcode": "42579",
        "CountryID": 87,
        "Latitude": 51.32265047268086,
        "Longitude": 6.964925856963646,
        "DistanceUnit": 0
    },
    "Connections": [
        {
            "ID": 208294,
            "ConnectionTypeID": 25,
            "StatusTypeID": 50,
            "LevelID": 2,
            "Amps": 32,
            "Voltage": 400,
            "PowerKW": 22,
            "CurrentTypeID": 20,
            "Quantity": 1
        },
        {
            "ID": 208295,
            "ConnectionTypeID": 25,
            "StatusTypeID": 50,
            "LevelID": 2,
            "Amps": 32,
            "Voltage": 400,
            "PowerKW": 22,
            "CurrentTypeID": 20,
            "Quantity": 1
        }
    ],
    "NumberOfPoints": 2,
    "StatusTypeID": 50,
    "DateLastStatusUpdate": "2020-03-12T12:00:00Z",
    "DataQualityLevel": 1,
    "DateCreated": "2020-03-11T17:42:00Z",
    "SubmissionStatusTypeID": 200
}