{
    "IsRecentlyVerified": false,
    "ID": 49160,
    "UUID": "30BE6A09-E527-4163-9EF1-58A6EAA6D990",
    "DataProviderID": 1,
    "OperatorID": 45,
    "UsageTypeID": 5,
    "AddressInfo": {
        "ID": 49506,
        "Title": "S-Bahnhof Lörrach-Brombach/Hauingen",
        "AddressLine1": "Franz-Ehret Straße",
        "Town": "Lörrach",
        "Postcode": "79539",
        "CountryID": 87,
        "Latitude": 47.6373073785725,
        "Longitude": 7.69496037165529,
        "ContactTelephone1": "+49 762 392 14 06",
        "AccessComments": "Die 24/7 nutzbare Säule kann mit einer NFC-fähigen Kreditkarte genutzt werden (PayPass oder PayWave). Kosten: einmalig € 1,50 + € 2,00/h + € 0,30/kWh",
        "RelatedURL": "http://www.energiedienst.de/cms/unternehmen/verantwortung/e_mobility/elektromobilitaet.php",
        "DistanceUnit": 0
    },
    "Connections": [
        {
            "ID": 60752,
            "ConnectionTypeID": 25,
            "StatusTypeID": 50,
            "LevelID": 2,
            "Amps": 32,
            "Voltage": 400,
            "PowerKW": 22,
            "CurrentTypeID": 20,
            "Quantity": 2
        }
    ],
    "NumberOfPoints": 2,
    "StatusTypeID": 50,
    "DateLastStatusUpdate": "2015-07-12T16:57:00Z",
    "DataQualityLevel": 1,
    "DateCreated": "2015-07-12T16:10:00Z",
    "SubmissionStatusTypeID": 200
}