{
    "IsRecentlyVerified": false,
    "ID": 89314,
    "UUID": "FEB41325-8451-4CC6-8598-FEF1D3BAACFA",
    "DataProviderID": 2,
    "DataProvidersReference": "85455",
    "UsageTypeID": 1,
    "AddressInfo": {
        "ID": 89660,
        "Title": "City of Greenville - Broad Street Garage",
        "AddressLine1": "125 E Broad St",
        "Town": "Greenville",
        "StateOrProvince": "SC",
        "Postcode": "29601",
        "CountryID": 2,
        "Latitude": 34.847118,
        "Longitude": -82.398001,
        "ContactTelephone1": "864-467-4900",
        "AccessComments": "24 hours daily",
        "RelatedURL": "",
        "DistanceUnit": 0
    },
    "Connections": [
        {
            "ID": 126695,
            "ConnectionTypeID": 1,
            "LevelID": 2,
            "Amps": 16,
            "Voltage": 230,
            "PowerKW": 3.7,
            "CurrentTypeID": 10,
            "Quantity": 2
        }
    ],
    "DateLastStatusUpdate": "2020-06-26T02:57:00Z",
    "DataQualityLevel": 3,
    "DateCreated": "2017-06-22T08:16:00Z",
    "SubmissionStatusTypeID": 100
}