{
    "IsRecentlyVerified": false,
    "ID": 95425,
    "UUID": "FD7585E8-AB13-4E57-BCD9-0FC1CD061345",
    "DataProviderID": 1,
    "OperatorID": 1,
    "UsageTypeID": 1,
    "AddressInfo": {
        "ID": 95771,
        "Title": "Rathaus",
        "AddressLine1": "Amelither Straße 26",
        "Town": "Bodenfelde",
        "StateOrProvince": "Landkreis Northeim",
        "Postcode": "37194",
        "CountryID": 87,
        "Latitude": 51.64282112515089,
        "Longitude": 9.551104608459475,
        "AccessComments": "Säule steht, aber noch nicht aktiv.",
        "RelatedURL": "http://www.stadtwerke-forst.de/",
        "DistanceUnit": 0
    },
    "Connections": [
        {
            "ID": 135187,
            "ConnectionTypeID": 25,
            "StatusTypeID": 50,
            "LevelID": 2,
            "Amps": 32,
            "Voltage": 400,
            "PowerKW": 22,
            "CurrentTypeID": 20,
            "Quantity": 2
        },
        {
            "ID": 135188,
            "ConnectionTypeID": 28,
            "StatusTypeID": 50,
            "LevelID": 2,
            "Amps": 16,
            "Voltage": 230,
            "PowerKW": 3.7,
            "CurrentTypeID": 10,
            "Quantity": 2
        }
    ],
    "NumberOfPoints": 2,
    "StatusTypeID": 150,
    "DateLastStatusUpdate": "2017-11-10T09:56:00Z",
    "DataQualityLevel": 1,
    "DateCreated": "2017-11-10T09:56:00Z",
    "SubmissionStatusTypeID": 200
}