{
    "IsRecentlyVerified": false,
    "ID": 139276,
    "UUID": "7B8E33F8-B698-446B-AEA2-19FE4C404C53",
    "DataProviderID": 2,
    "DataProvidersReference": "95587",
    "OperatorID": 9,
    "UsageTypeID": 1,
    "AddressInfo": {
        "ID": 139628,
        "Title": "Fry's Store #474 Cave Creek",
        "AddressLine1": "29455 N. Cave Creek Rd.",
        "Town": "Cave Creek",
        "StateOrProvince": "AZ",
        "Postcode": "85331",
        "CountryID": 2,
        "Latitude": 33.752384,
        "Longitude": -111.9907679,
        "ContactTelephone1": "888-998-2546",
        "AccessComments": "MON: 24 hours | TUE: 24 hours | WED: 24 hours | THU: 24 hours | FRI: 24 hours | SAT: 24 hours | SUN: 24 hours",
        "RelatedURL": "http://www.blinkcharging.com/",
        "DistanceUnit": 0
    },
    "Connections": [
        {
            "ID": 194579,
            "ConnectionTypeID": 1,
            "LevelID": 2,
            "Amps": 16,
            "Voltage": 230,
            "PowerKW": 3.7,
            "CurrentTypeID": 10,
            "Quantity": 2
        }
    ],
    "StatusTypeID": 50,
    "DateLastStatusUpdate": "2020-06-26T02:56:00Z",
    "DataQualityLevel": 3,
    "DateCreated": "2019-12-24T09:10:00Z",
    "SubmissionStatusTypeID": 100
}