{
    "IsRecentlyVerified": false,
    "ID": 174487,
    "UUID": "B6F59CE8-64C0-4472-B2E2-7CB60D8EBE41",
    "DataProviderID": 1,
    "OperatorID": 3369,
    "UsageTypeID": 4,
    "UsageCost": "7,89€/session",
    "AddressInfo": {
        "ID": 174846,
        "Title": "Sophienstraße",
        "AddressLine1": "Sophienstraße 1A",
        "Town": "Elze",
        "StateOrProvince": "Lower Saxony",
        "Postcode": "31008",
        "CountryID": 87,
        "Latitude": 52.12077344364499,
        "Longitude": 9.74521322325495,
        "DistanceUnit": 0
    },
    "Connections": [
        {
            "ID": 270303,
            "ConnectionTypeID": 33,
            "StatusTypeID": 50,
            "LevelID": 3,
            "PowerKW": 135,
            "CurrentTypeID": 30,
            "Quantity": 1
        },
        {
            "ID": 270304,
            "ConnectionTypeID": 2,
            "StatusTypeID": 50,
            "LevelID": 3,
            "Amps": 125,
            "Voltage": 500,
            "PowerKW": 50,
            "CurrentTypeID": 30,
            "Quantity": 1
        },
        {
            "ID": 270305,
            "ConnectionTypeID": 25,
            "StatusTypeID": 50,
            "LevelID": 2,
            "Amps": 32,
            "Voltage": 400,
            "PowerKW": 22,
            "CurrentTypeID": 20,
            "Quantity": 1
        },
        {
            "ID": 270306,
            "ConnectionTypeID": 1036,
            "StatusTypeID": 50,
            "LevelID": 2,
            "Amps": 32,
            "Voltage": 400,
            "PowerKW": 22,
            "CurrentTypeID": 20,
            "Quantity": 1
        }
    ],
    "NumberOfPoints": 1,
    "StatusTypeID": 50,
    "DateLastStatusUpdate": "2021-04-02T12:53:00Z",
    "DataQualityLevel": 1,
    "DateCreated": "2021-04-02T12:53:00Z",
    "SubmissionStatusTypeID": 200
}