{
    "IsRecentlyVerified": false,
    "ID": 21308,
    "UUID": "FC3BEE16-62B3-45FA-BDD7-9704059A7FB1",
    "DataProviderID": 1,
    "OperatorID": 45,
    "UsageTypeID": 1,
    "UsageCost": "",
    "AddressInfo": {
        "ID": 21653,
        "Title": "Parkhaus P3",
        "AddressLine1": "Westring 26",
        "AddressLine2": "Mitte",
        "Town": "Bochum",
        "StateOrProvince": "Bochum",
        "Postcode": "44787",
        "CountryID": 87,
        "Latitude": 51.48255123806931,
        "Longitude": 7.213122535443044,
        "ContactTelephone1": "",
        "ContactTelephone2": "",
        "ContactEmail": "",
        "AccessComments": "1 Ladesäule/Parkplatz, durch großes blaues \"Oköstrom: Jetzt auch Tanken\" Plakat (neben Platz 1-003) gekennzeichnet, nutzbar während der Öffnungszeiten (Mo–Fr 6:30–22:30 Uhr, Sa 8:00–20:30 Uhr, Sonn-/Feiertag geschlossen), Ladekarte an der Information.",
        "RelatedURL": "http://www.parken-in-bochum.de/parkhaus-p3-rathaus-bvz.php",
        "DistanceUnit": 0
    },
    "Connections": [
        {
            "ID": 23156,
            "ConnectionTypeID": 28,
            "StatusTypeID": 50,
            "LevelID": 2,
            "Amps": 16,
            "Voltage": 230,
            "PowerKW": 3.7,
            "CurrentTypeID": 10,
            "Quantity": 1
        }
    ],
    "NumberOfPoints": 1,
    "GeneralComments": "",
    "StatusTypeID": 50,
    "DateLastStatusUpdate": "2016-08-28T07:43:00Z",
    "DataQualityLevel": 1,
    "DateCreated": "2014-03-21T11:35:00Z",
    "SubmissionStatusTypeID": 200
}