{
    "MediaItems": [
        {
            "ID": 12389,
            "ChargePointID": 88213,
            "ItemURL": "https://s3-ap-southeast-2.amazonaws.com/openchargemap/images/NZ/OCM88213/OCM-88213.orig.2017052409452645.jpg",
            "ItemThumbnailURL": "https://s3-ap-southeast-2.amazonaws.com/openchargemap/images/NZ/OCM88213/OCM-88213.thmb.2017052409452645.jpg",
            "Comment": "",
            "IsEnabled": true,
            "IsVideo": false,
            "IsFeaturedItem": false,
            "IsExternalResource": false,
            "User": {
                "ID": 15365,
                "Username": "sliday"
            },
            "DateCreated": "2017-05-24T09:46:00Z"
        },
        {
            "ID": 12384,
            "ChargePointID": 88213,
            "ItemURL": "https://s3-ap-southeast-2.amazonaws.com/openchargemap/images/NZ/OCM88213/OCM-88213.orig.2017052409442517.jpg",
            "ItemThumbnailURL": "https://s3-ap-southeast-2.amazonaws.com/openchargemap/images/NZ/OCM88213/OCM-88213.thmb.2017052409442517.jpg",
            "Comment": "",
            "IsEnabled": true,
            "IsVideo": false,
            "IsFeaturedItem": false,
            "IsExternalResource": false,
            "User": {
                "ID": 15365,
                "Username": "sliday"
            },
            "DateCreated": "2017-05-24T09:45:00Z"
        },
        {
            "ID": 12385,
            "ChargePointID": 88213,
            "ItemURL": "https://s3-ap-southeast-2.amazonaws.com/openchargemap/images/NZ/OCM88213/OCM-88213.orig.2017052409443658.jpg",
            "ItemThumbnailURL": "https://s3-ap-southeast-2.amazonaws.com/openchargemap/images/NZ/OCM88213/OCM-88213.thmb.2017052409443658.jpg",
            "Comment": "",
            "IsEnabled": true,
            "IsVideo": false,
            "IsFeaturedItem": false,
            "IsExternalResource": false,
            "User": {
                "ID": 15365,
                "Username": "sliday"
            },
            "DateCreated": "2017-05-24T09:45:00Z"
        },
        {
            "ID": 12386,
            "ChargePointID": 88213,
            "ItemURL": "https://s3-ap-southeast-2.amazonaws.com/openchargemap/images/NZ/OCM88213/OCM-88213.orig.2017052409444961.jpg",
            "ItemThumbnailURL": "https://s3-ap-southeast-2.amazonaws.com/openchargemap/images/NZ/OCM88213/OCM-88213.thmb.2017052409444961.jpg",
            "Comment": "",
            "IsEnabled": true,
            "IsVideo": false,
            "IsFeaturedItem": false,
            "IsExternalResource": false,
            "User": {
                "ID": 15365,
                "Username": "sliday"
            },
            "DateCreated": "2017-05-24T09:45:00Z"
        },
        {
            "ID": 12387,
            "ChargePointID": 88213,
            "ItemURL": "https://s3-ap-southeast-2.amazonaws.com/openchargemap/images/NZ/OCM88213/OCM-88213.orig.2017052409450470.jpg",
            "ItemThumbnailURL": "https://s3-ap-southeast-2.amazonaws.com/openchargemap/images/NZ/OCM88213/OCM-88213.thmb.2017052409450470.jpg",
            "Comment": "",
            "IsEnabled": true,
            "IsVideo": false,
            "IsFeaturedItem": false,
            "IsExternalResource": false,
            "User": {
                "ID": 15365,
                "Username": "sliday"
            },
            "DateCreated": "2017-05-24T09:45:00Z"
        },
        {
            "ID": 12388,
            "ChargePointID": 88213,
            "ItemURL": "https://s3-ap-southeast-2.amazonaws.com/openchargemap/images/NZ/OCM88213/OCM-88213.orig.2017052409451468.jpg",
            "ItemThumbnailURL": "https://s3-ap-southeast-2.amazonaws.com/openchargemap/images/NZ/OCM88213/OCM-88213.thmb.2017052409451468.jpg",
            "Comment": "",
            "IsEnabled": true,
            "IsVideo": false,
            "IsFeaturedItem": false,
            "IsExternalResource": false,
            "User": {
                "ID": 15365,
                "Username": "sliday"
            },
            "DateCreated": "2017-05-24T09:45:00Z"
        },
        {
            "ID": 12381,
            "ChargePointID": 88213,
            "ItemURL": "https://s3-ap-southeast-2.amazonaws.com/openchargemap/images/NZ/OCM88213/OCM-88213.orig.2017052409433283.png",
            "ItemThumbnailURL": "https://s3-ap-southeast-2.amazonaws.com/openchargemap/images/NZ/OCM88213/OCM-88213.thmb.2017052409433283.png",
            "Comment": "",
            "IsEnabled": true,
            "IsVideo": false,
            "IsFeaturedItem": false,
            "IsExternalResource": false,
            "User": {
                "ID": 15365,
                "Username": "sliday"
            },
            "DateCreated": "2017-05-24T09:44:00Z"
        },
        {
            "ID": 12382,
            "ChargePointID": 88213,
            "ItemURL": "https://s3-ap-southeast-2.amazonaws.com/openchargemap/images/NZ/OCM88213/OCM-88213.orig.2017052409435543.jpg",
            "ItemThumbnailURL": "https://s3-ap-southeast-2.amazonaws.com/openchargemap/images/NZ/OCM88213/OCM-88213.thmb.2017052409435543.jpg",
            "Comment": "",
            "IsEnabled": true,
            "IsVideo": false,
            "IsFeaturedItem": false,
            "IsExternalResource": false,
            "User": {
                "ID": 15365,
                "Username": "sliday"
            },
            "DateCreated": "2017-05-24T09:44:00Z"
        },
        {
            "ID": 12383,
            "ChargePointID": 88213,
            "ItemURL": "https://s3-ap-southeast-2.amazonaws.com/openchargemap/images/NZ/OCM88213/OCM-88213.orig.2017052409441069.jpg",
            "ItemThumbnailURL": "https://s3-ap-southeast-2.amazonaws.com/openchargemap/images/NZ/OCM88213/OCM-88213.thmb.2017052409441069.jpg",
            "Comment": "",
            "IsEnabled": true,
            "IsVideo": false,
            "IsFeaturedItem": false,
            "IsExternalResource": false,
            "User": {
                "ID": 15365,
                "Username": "sliday"
            },
            "DateCreated": "2017-05-24T09:44:00Z"
        }
    ],
    "IsRecentlyVerified": false,
    "ID": 88213,
    "UUID": "D9D57550-E106-4239-9A79-7390C267FE2C",
    "DataProviderID": 1,
    "OperatorID": 233,
    "UsageTypeID": 4,
    "AddressInfo": {
        "ID": 88559,
        "Title": "BP",
        "AddressLine1": "322 Pakuranga Road",
        "Town": "Pakuranga Heights, Auckland ",
        "Postcode": "2010",
        "CountryID": 161,
        "Latitude": -36.9021868146962,
        "Longitude": 174.896091497519,
        "ContactTelephone1": "(050) 883-2867",
        "DistanceUnit": 0
    },
    "Connections": [
        {
            "ID": 125119,
            "ConnectionTypeID": 2,
            "StatusTypeID": 50,
            "LevelID": 3,
            "PowerKW": 50,
            "CurrentTypeID": 30,
            "Quantity": 2
        },
        {
            "ID": 125120,
            "ConnectionTypeID": 33,
            "StatusTypeID": 50,
            "LevelID": 3,
            "PowerKW": 50,
            "CurrentTypeID": 30,
            "Quantity": 2
        }
    ],
    "NumberOfPoints": 2,
    "GeneralComments": "24hr\r\nTwo Vector 50kW DC combo chargers, each with CHAdeMO and CCS. Todo: barista-made Fairtrade coffee, free WiFi, walking distance to fast-food, +more.",
    "StatusTypeID": 50,
    "DateLastStatusUpdate": "2017-05-24T09:51:00Z",
    "DataQualityLevel": 1,
    "DateCreated": "2017-05-24T09:43:00Z",
    "SubmissionStatusTypeID": 200
}