{
    "UserComments": [
        {
            "ID": 8131,
            "ChargePointID": 47201,
            "CommentTypeID": 10,
            "UserName": "Richard Butler ",
            "Comment": "Sign posted from main road as \"rapid charger\", laminated A4 sheets from council to say that the marked parking space can be used for charging a ev or hybrid for 1 hour, no return within 1 hour, but no clue as to who owns it, or who's card you need. Wasn't until I put up the photo that I spotted on here about taxi only.",
            "DateCreated": "2015-12-02T19:28:56.36Z",
            "User": {
                "ID": 4938,
                "Username": "Richard Butler "
            },
            "CheckinStatusTypeID": 40
        }
    ],
    "MediaItems": [
        {
            "ID": 17197,
            "ChargePointID": 47201,
            "ItemURL": "https://s3-ap-southeast-2.amazonaws.com/openchargemap/images/GB/OCM47201/OCM-47201.orig.2018121213212587.jpg",
            "ItemThumbnailURL": "https://s3-ap-southeast-2.amazonaws.com/openchargemap/images/GB/OCM47201/OCM-47201.thmb.2018121213212587.jpg",
            "Comment": "Download the Electric Blue App (Android or iOS) to operate.\r\nAny problems, call Electric Blue on 0330 111 0078",
            "IsEnabled": true,
            "IsVideo": false,
            "IsFeaturedItem": false,
            "IsExternalResource": false,
            "User": {
                "ID": 19507,
                "Username": "E.Blue"
            },
            "DateCreated": "2018-12-12T13:22:00Z"
        },
        {
            "ID": 3542,
            "ChargePointID": 47201,
            "ItemURL": "https://s3-ap-southeast-2.amazonaws.com/openchargemap/images/GB/OCM47201/OCM-47201.orig.2015120218580409.jpg",
            "ItemThumbnailURL": "https://s3-ap-southeast-2.amazonaws.com/openchargemap/images/GB/OCM47201/OCM-47201.thmb.2015120218580409.jpg",
            "Comment": "No idea who's card you would need \r\n",
            "IsEnabled": true,
            "IsVideo": false,
            "IsFeaturedItem": false,
            "IsExternalResource": false,
            "User": {
                "ID": 4938,
                "Username": "Richard Butler "
            },
            "DateCreated": "2015-12-02T18:58:00Z"
        }
    ],
    "IsRecentlyVerified": false,
    "ID": 47201,
    "UUID": "B8DF07FC-4778-4566-84C6-1CA2850DCD94",
    "DataProviderID": 1,
    "OperatorID": 3391,
    "UsageTypeID": 1,
    "UsageCost": "£0.25/kWh",
    "AddressInfo": {
        "ID": 47547,
        "Title": "Service Road Q",
        "AddressLine1": "The Parade",
        "Town": "Watford",
        "Postcode": "WD17 1NJ",
        "CountryID": 1,
        "Latitude": 51.660202394647584,
        "Longitude": -0.4011181703528921,
        "ContactTelephone1": "0330 111 0078",
        "RelatedURL": "https://www.electricblueuk.com/drivers/",
        "DistanceUnit": 0
    },
    "Connections": [
        {
            "ID": 58173,
            "ConnectionTypeID": 2,
            "StatusTypeID": 50,
            "LevelID": 3,
            "PowerKW": 50,
            "CurrentTypeID": 30,
            "Quantity": 1
        },
        {
            "ID": 58174,
            "ConnectionTypeID": 33,
            "StatusTypeID": 50,
            "LevelID": 3,
            "PowerKW": 50,
            "CurrentTypeID": 30,
            "Quantity": 1
        },
        {
            "ID": 58175,
            "ConnectionTypeID": 1036,
            "StatusTypeID": 50,
            "LevelID": 3,
            "Amps": 63,
            "Voltage": 400,
            "PowerKW": 43,
            "CurrentTypeID": 20,
            "Quantity": 1
        }
    ],
    "NumberOfPoints": 1,
    "GeneralComments": "50kW rapid charger\r\nElectric Blue App (iOS or Android)",
    "StatusTypeID": 50,
    "DateLastStatusUpdate": "2020-09-30T09:47:00Z",
    "DataQualityLevel": 1,
    "DateCreated": "2015-05-17T20:43:00Z",
    "SubmissionStatusTypeID": 200
}