{
    "IsRecentlyVerified": false,
    "ID": 16881,
    "UUID": "C4582771-065F-4EDE-AF0D-8331692D8409",
    "DataProviderID": 22,
    "DataProvidersReference": "6AACD73D825E28970D6D9B8AC7F0D8D8",
    "AddressInfo": {
        "ID": 17226,
        "Title": "帯広日産・釧路日産自動車南２９丁目店",
        "AddressLine1": "北海道帯広市大通南29-2",
        "CountryID": 114,
        "Latitude": 42.89890389,
        "Longitude": 143.2090501,
        "ContactTelephone1": "0155-22-2317",
        "DistanceUnit": 0
    },
    "Connections": [
        {
            "ID": 17122,
            "ConnectionTypeID": 2,
            "LevelID": 2,
            "Amps": 100,
            "Voltage": 480,
            "PowerKW": 48,
            "Quantity": 1
        }
    ],
    "DateLastStatusUpdate": "2013-06-29T08:50:00Z",
    "DataQualityLevel": 2,
    "DateCreated": "2013-06-29T08:50:00Z",
    "SubmissionStatusTypeID": 200
}