{
    "IsRecentlyVerified": false,
    "ID": 149265,
    "UUID": "959D41CB-F867-4AE3-83F6-E0298CCD2A5C",
    "DataProviderID": 1,
    "OperatorID": 80,
    "UsageTypeID": 4,
    "AddressInfo": {
        "ID": 149618,
        "Title": "Caffarel S.P.A. Negozio Aziendale | EnelX",
        "AddressLine1": "Via Caduti per la Libertà, 4",
        "Town": "Luserna San Giovanni",
        "StateOrProvince": "TO",
        "Postcode": "10062",
        "CountryID": 112,
        "Latitude": 44.81676422734546,
        "Longitude": 7.244964423308147,
        "RelatedURL": "https://www.enelx.com/it/it/emobility",
        "DistanceUnit": 0
    },
    "Connections": [
        {
            "ID": 207254,
            "ConnectionTypeID": 25,
            "StatusTypeID": 50,
            "LevelID": 2,
            "Amps": 32,
            "Voltage": 400,
            "PowerKW": 22,
            "CurrentTypeID": 20,
            "Quantity": 2
        }
    ],
    "NumberOfPoints": 2,
    "StatusTypeID": 50,
    "DateLastStatusUpdate": "2020-02-21T10:36:00Z",
    "DataQualityLevel": 1,
    "DateCreated": "2020-02-21T10:36:00Z",
    "SubmissionStatusTypeID": 200
}