{
    "IsRecentlyVerified": false,
    "ID": 175591,
    "UUID": "8EFE8B99-2468-411D-B807-09FA7B745EC8",
    "DataProviderID": 1,
    "OperatorID": 21,
    "UsageTypeID": 4,
    "UsageCost": "Mobi.E compatible card or App",
    "AddressInfo": {
        "ID": 175950,
        "Title": "LSB-00008 - Lidl",
        "AddressLine1": "",
        "Town": "Lisbon",
        "StateOrProvince": "Lisboa",
        "Postcode": "1800-125",
        "CountryID": 180,
        "Latitude": 38.76261402247462,
        "Longitude": -9.116565945619755,
        "DistanceUnit": 0
    },
    "Connections": [
        {
            "ID": 272619,
            "ConnectionTypeID": 2,
            "StatusTypeID": 50,
            "LevelID": 3,
            "Amps": 120,
            "Voltage": 500,
            "PowerKW": 50,
            "CurrentTypeID": 30,
            "Quantity": 1
        },
        {
            "ID": 272620,
            "ConnectionTypeID": 33,
            "StatusTypeID": 50,
            "LevelID": 3,
            "Amps": 125,
            "Voltage": 500,
            "PowerKW": 50,
            "CurrentTypeID": 30,
            "Quantity": 1
        },
        {
            "ID": 272621,
            "ConnectionTypeID": 1036,
            "StatusTypeID": 50,
            "LevelID": 3,
            "Amps": 64,
            "Voltage": 400,
            "PowerKW": 43,
            "CurrentTypeID": 20,
            "Quantity": 1
        }
    ],
    "NumberOfPoints": 2,
    "StatusTypeID": 50,
    "DateLastStatusUpdate": "2021-05-30T15:07:00Z",
    "DataQualityLevel": 1,
    "DateCreated": "2021-05-30T15:07:00Z",
    "SubmissionStatusTypeID": 200
}