{
    "IsRecentlyVerified": false,
    "ID": 71559,
    "UUID": "7E7111A6-A164-480B-B95E-66A159FDBC74",
    "DataProviderID": 1,
    "OperatorID": 23,
    "OperatorsReference": "19525",
    "UsageTypeID": 1,
    "UsageCost": "Free",
    "AddressInfo": {
        "ID": 71905,
        "Title": "Palm Cottages - Tesla",
        "AddressLine1": "1065 Siskiyou Blvd",
        "Town": "Ashland",
        "StateOrProvince": "OR",
        "Postcode": "97520",
        "CountryID": 2,
        "Latitude": 42.188561,
        "Longitude": -122.697062,
        "ContactTelephone1": "541-482-2636  877-798-3752",
        "AccessComments": "24 hours daily; for Tesla use only; for guest use only",
        "RelatedURL": "http://www.teslamotors.com/supercharger",
        "DistanceUnit": 0
    },
    "Connections": [
        {
            "ID": 102384,
            "ConnectionTypeID": 30,
            "StatusTypeID": 50,
            "LevelID": 2,
            "Amps": 16,
            "Voltage": 230,
            "PowerKW": 8,
            "CurrentTypeID": 10,
            "Quantity": 1
        }
    ],
    "NumberOfPoints": 1,
    "StatusTypeID": 50,
    "DateLastStatusUpdate": "2017-01-26T03:11:00Z",
    "DataQualityLevel": 3,
    "DateCreated": "2016-09-02T10:15:00Z",
    "SubmissionStatusTypeID": 100
}