{
    "IsRecentlyVerified": false,
    "ID": 169775,
    "UUID": "D9AE7837-8DC8-4793-8A4E-6A8F1C12E50E",
    "DataProviderID": 1,
    "OperatorID": 23,
    "OperatorsReference": "54828",
    "UsageTypeID": 4,
    "AddressInfo": {
        "ID": 170134,
        "Title": "Domaine Tarbouriech",
        "AddressLine1": "1 Chemin des Domaines",
        "Town": "Marseillan",
        "Postcode": "34340",
        "CountryID": 80,
        "Latitude": 43.397178,
        "Longitude": 3.547582,
        "ContactTelephone1": "+33 4 48 14 00 30",
        "DistanceUnit": 0
    },
    "Connections": [
        {
            "ID": 258690,
            "ConnectionTypeID": 30,
            "StatusTypeID": 50,
            "LevelID": 2,
            "PowerKW": 11,
            "CurrentTypeID": 20,
            "Quantity": 3
        }
    ],
    "NumberOfPoints": 3,
    "GeneralComments": "Charging3 Tesla Connector, up to 11kW.Available for customers. Please call ahead.",
    "StatusTypeID": 50,
    "DateLastStatusUpdate": "2020-11-10T09:42:00Z",
    "DataQualityLevel": 1,
    "DateCreated": "2020-11-10T09:42:00Z",
    "SubmissionStatusTypeID": 200
}