{
    "IsRecentlyVerified": false,
    "ID": 137569,
    "UUID": "80F53436-D909-41F6-994D-3062CF55DCEC",
    "DataProviderID": 2,
    "DataProvidersReference": "113945",
    "OperatorID": 23,
    "UsageTypeID": 1,
    "AddressInfo": {
        "ID": 137915,
        "Title": "Tallahassee Airport - Short Term Parking - Tesla Destination",
        "AddressLine1": "3300 Capital Cir SW",
        "Town": "Tallahassee",
        "StateOrProvince": "FL",
        "Postcode": "32310",
        "CountryID": 2,
        "Latitude": 30.397577,
        "Longitude": -84.347788,
        "ContactTelephone1": "850-861-7802  877-798-3752",
        "AccessComments": "24 hours daily; for Tesla use only",
        "RelatedURL": "https://www.tesla.com/destination-charging",
        "DistanceUnit": 0
    },
    "Connections": [
        {
            "ID": 192504,
            "ConnectionTypeID": 30,
            "LevelID": 2,
            "Amps": 16,
            "Voltage": 230,
            "PowerKW": 3,
            "CurrentTypeID": 10,
            "Quantity": 5
        }
    ],
    "StatusTypeID": 50,
    "DateLastStatusUpdate": "2019-12-24T09:05:00Z",
    "DataQualityLevel": 3,
    "DateCreated": "2019-12-24T09:05:00Z",
    "SubmissionStatusTypeID": 100
}