{
    "IsRecentlyVerified": false,
    "ID": 77657,
    "UUID": "16E6746A-7FBE-47C8-B771-4D407983B740",
    "DataProviderID": 1,
    "OperatorID": 3,
    "OperatorsReference": "PG-91025",
    "UsageTypeID": 6,
    "UsageCost": "Free",
    "AddressInfo": {
        "ID": 78003,
        "Title": "Benx LTD",
        "AddressLine1": "Lonsdale Chambers",
        "Town": " Lonsdale Street",
        "StateOrProvince": " Staffordshire",
        "Postcode": "ST4 4BT",
        "CountryID": 1,
        "Latitude": 53.003062,
        "Longitude": -2.182583,
        "DistanceUnit": 0
    },
    "Connections": [
        {
            "ID": 112184,
            "ConnectionTypeID": 25,
            "StatusTypeID": 50,
            "LevelID": 2,
            "Amps": 32,
            "Voltage": 230,
            "PowerKW": 7,
            "CurrentTypeID": 10,
            "Quantity": 1
        }
    ],
    "NumberOfPoints": 2,
    "GeneralComments": "This is an open charge unit installed at the Benx Ltd office site in Lonsdale Chambers, Lonsdale Street, Stoke on Trent",
    "StatusTypeID": 50,
    "DateLastStatusUpdate": "2017-12-22T12:31:00Z",
    "DataQualityLevel": 1,
    "DateCreated": "2017-01-22T08:54:00Z",
    "SubmissionStatusTypeID": 200
}