{
    "IsRecentlyVerified": false,
    "ID": 106262,
    "UUID": "9F31A098-1467-4A0E-B0D1-B7CB0C024526",
    "DataProviderID": 1,
    "OperatorID": 3266,
    "UsageTypeID": 4,
    "AddressInfo": {
        "ID": 106608,
        "Title": "Gemeindeverwaltung",
        "AddressLine1": "Robert-Eichenauer-Weg",
        "Town": "Hirzenhain",
        "StateOrProvince": "Wetteraukreis",
        "Postcode": "63697",
        "CountryID": 87,
        "Latitude": 50.39250949180384,
        "Longitude": 9.135810724995508,
        "AccessComments": "24/7 nutzbare rote Ladesäule",
        "RelatedURL": "https://www.ovag-energie.de/privatkunden/e-mobilitaet.html",
        "DistanceUnit": 0
    },
    "Connections": [
        {
            "ID": 149607,
            "ConnectionTypeID": 25,
            "StatusTypeID": 50,
            "LevelID": 2,
            "Amps": 32,
            "Voltage": 400,
            "PowerKW": 22,
            "CurrentTypeID": 20,
            "Quantity": 2
        },
        {
            "ID": 149608,
            "ConnectionTypeID": 16,
            "StatusTypeID": 50,
            "LevelID": 2,
            "Amps": 16,
            "Voltage": 230,
            "PowerKW": 3.7,
            "CurrentTypeID": 10,
            "Quantity": 2
        }
    ],
    "NumberOfPoints": 4,
    "StatusTypeID": 50,
    "DateLastStatusUpdate": "2018-06-18T08:32:00Z",
    "DataQualityLevel": 1,
    "DateCreated": "2018-06-18T08:32:00Z",
    "SubmissionStatusTypeID": 200
}