{
    "IsRecentlyVerified": false,
    "ID": 34725,
    "UUID": "AA193960-7B82-42B2-85B8-63381FE640B2",
    "DataProviderID": 26,
    "DataProvidersReference": "34986",
    "OperatorID": 73,
    "OperatorsReference": "EV-Box EVB-P1338032",
    "UsageCost": "0.00 jaarabonnement",
    "AddressInfo": {
        "ID": 35071,
        "Title": "Kleiweg 47",
        "AddressLine1": "Kleiweg 47",
        "Town": "Rotterdam",
        "Postcode": "3051 GJ",
        "CountryID": 159,
        "Latitude": 51.94519,
        "Longitude": 4.48202,
        "RelatedURL": "http://www.ev-box.nl",
        "DistanceUnit": 0
    },
    "Connections": [
        {
            "ID": 38236,
            "ConnectionTypeID": 25,
            "LevelID": 2,
            "PowerKW": 11,
            "CurrentTypeID": 10
        },
        {
            "ID": 47469,
            "ConnectionTypeID": 25,
            "LevelID": 2,
            "PowerKW": 11,
            "CurrentTypeID": 10
        }
    ],
    "NumberOfPoints": 1,
    "StatusTypeID": 50,
    "DateLastStatusUpdate": "2016-06-04T02:43:00Z",
    "DataQualityLevel": 3,
    "DateCreated": "2015-01-09T06:04:00Z",
    "SubmissionStatusTypeID": 100
}