{
    "IsRecentlyVerified": false,
    "ID": 95133,
    "UUID": "DE0BFADD-E87E-4ED6-A81E-6B442696A625",
    "DataProviderID": 1,
    "OperatorID": 3,
    "OperatorsReference": "PG-80591",
    "UsageTypeID": 6,
    "UsageCost": "Free",
    "AddressInfo": {
        "ID": 95479,
        "Title": "Pegasus Life",
        "AddressLine1": "Royal Court",
        "Town": "Church Green",
        "StateOrProvince": "Winchester",
        "Postcode": "SO23 7TW",
        "CountryID": 1,
        "Latitude": 51.086488,
        "Longitude": -1.299456,
        "DistanceUnit": 0
    },
    "Connections": [
        {
            "ID": 134797,
            "ConnectionTypeID": 25,
            "StatusTypeID": 50,
            "LevelID": 2,
            "Amps": 32,
            "Voltage": 400,
            "PowerKW": 22,
            "CurrentTypeID": 20,
            "Quantity": 2
        }
    ],
    "NumberOfPoints": 2,
    "GeneralComments": "This is an open charge unit installed at the Pegasus Life site in Royal Court, Church Green, Kings Worthy, Winchester",
    "StatusTypeID": 50,
    "DateLastStatusUpdate": "2017-11-03T17:31:00Z",
    "DataQualityLevel": 1,
    "DateCreated": "2017-11-03T17:31:00Z",
    "SubmissionStatusTypeID": 200
}