{
    "IsRecentlyVerified": false,
    "ID": 63282,
    "UUID": "211B17E3-DFC6-4740-8E8C-C69E4214B25A",
    "DataProviderID": 26,
    "DataProvidersReference": "72385",
    "OperatorID": 73,
    "OperatorsReference": "EV-Box EVB-P1529003",
    "UsageCost": "0.00 jaarabonnement",
    "AddressInfo": {
        "ID": 63628,
        "Title": "Goosse van der Windstraat 37",
        "AddressLine1": "Goosse van der Windstraat 37",
        "Town": "Rotterdam",
        "Postcode": "3062 XM",
        "CountryID": 159,
        "Latitude": 51.92489,
        "Longitude": 4.5308,
        "RelatedURL": "http://www.ev-box.nl",
        "DistanceUnit": 0
    },
    "Connections": [
        {
            "ID": 80624,
            "ConnectionTypeID": 25,
            "LevelID": 2,
            "PowerKW": 11,
            "CurrentTypeID": 10
        },
        {
            "ID": 80625,
            "ConnectionTypeID": 25,
            "LevelID": 2,
            "PowerKW": 11,
            "CurrentTypeID": 10
        }
    ],
    "NumberOfPoints": 1,
    "StatusTypeID": 50,
    "DateLastStatusUpdate": "2016-06-04T02:42:00Z",
    "DataQualityLevel": 3,
    "DateCreated": "2016-03-03T12:30:00Z",
    "SubmissionStatusTypeID": 100
}