{
    "IsRecentlyVerified": false,
    "ID": 124761,
    "UUID": "049C1C17-BDEB-411E-AE77-23FF34C4B4B3",
    "DataProviderID": 2,
    "DataProvidersReference": "53457",
    "UsageTypeID": 1,
    "AddressInfo": {
        "ID": 125107,
        "Title": "Tipp City - Menards",
        "AddressLine1": "75 Weller Dr",
        "Town": "Tipp City",
        "StateOrProvince": "OH",
        "Postcode": "45371",
        "CountryID": 2,
        "Latitude": 39.964435,
        "Longitude": -84.191229,
        "ContactTelephone1": "937-667-6305",
        "AccessComments": "24 hours daily",
        "RelatedURL": "",
        "DistanceUnit": 0
    },
    "Connections": [
        {
            "ID": 174902,
            "ConnectionTypeID": 1,
            "LevelID": 2,
            "Amps": 16,
            "Voltage": 230,
            "PowerKW": 3.7,
            "CurrentTypeID": 10,
            "Quantity": 1
        }
    ],
    "DateLastStatusUpdate": "2020-06-26T03:02:00Z",
    "DataQualityLevel": 3,
    "DateCreated": "2019-04-06T05:04:00Z",
    "SubmissionStatusTypeID": 100
}