{
    "IsRecentlyVerified": false,
    "ID": 33554,
    "UUID": "C14F8F32-752E-410A-A368-E348263497B6",
    "DataProviderID": 26,
    "DataProvidersReference": "47604",
    "OperatorID": 178,
    "OperatorsReference": "EVnetNL AL756",
    "UsageCost": "0.00 jaarabonnement",
    "AddressInfo": {
        "ID": 33900,
        "Title": "Floris V-laan 21",
        "AddressLine1": "Floris V-laan 21",
        "Town": "Waalwijk",
        "Postcode": "5141 BA",
        "CountryID": 159,
        "Latitude": 51.683936,
        "Longitude": 5.058343,
        "ContactTelephone1": "0800-3522365",
        "RelatedURL": "http://www.evnet.nl",
        "DistanceUnit": 0
    },
    "Connections": [
        {
            "ID": 37065,
            "ConnectionTypeID": 25,
            "LevelID": 2,
            "PowerKW": 11,
            "CurrentTypeID": 10
        }
    ],
    "NumberOfPoints": 2,
    "StatusTypeID": 50,
    "DateLastStatusUpdate": "2016-06-04T02:40:00Z",
    "DataQualityLevel": 3,
    "DateCreated": "2015-01-09T06:04:00Z",
    "SubmissionStatusTypeID": 100
}