{
    "IsRecentlyVerified": false,
    "ID": 170033,
    "UUID": "59A2B9F0-73FD-451B-9054-522E81034BBD",
    "DataProviderID": 1,
    "OperatorID": 3327,
    "UsageTypeID": 4,
    "AddressInfo": {
        "ID": 170392,
        "Title": "Bologna Murri BeCharge",
        "AddressLine1": "Via Augusto Murri, 117",
        "Town": "Bologna",
        "StateOrProvince": "BO",
        "Postcode": "40137",
        "CountryID": 112,
        "Latitude": 44.47891779200407,
        "Longitude": 11.364781753420743,
        "ContactTelephone1": "02-49527730",
        "ContactEmail": "emobility@buildingenergy.it",
        "RelatedURL": "https://www.bec.energy/",
        "DistanceUnit": 0
    },
    "Connections": [
        {
            "ID": 259158,
            "ConnectionTypeID": 25,
            "StatusTypeID": 50,
            "LevelID": 2,
            "Amps": 32,
            "Voltage": 400,
            "PowerKW": 22,
            "CurrentTypeID": 20,
            "Quantity": 2
        }
    ],
    "NumberOfPoints": 2,
    "StatusTypeID": 50,
    "DateLastStatusUpdate": "2020-11-16T17:39:00Z",
    "DataQualityLevel": 1,
    "DateCreated": "2020-11-16T17:39:00Z",
    "SubmissionStatusTypeID": 200
}