{
    "MediaItems": [
        {
            "ID": 22333,
            "ChargePointID": 156278,
            "ItemURL": "https://s3-ap-southeast-2.amazonaws.com/openchargemap/images/HU/OCM156278/OCM-156278.orig.2020051510025223.jpg",
            "ItemThumbnailURL": "https://s3-ap-southeast-2.amazonaws.com/openchargemap/images/HU/OCM156278/OCM-156278.thmb.2020051510025223.jpg",
            "Comment": "",
            "IsEnabled": true,
            "IsVideo": false,
            "IsFeaturedItem": false,
            "IsExternalResource": false,
            "User": {
                "ID": 20407,
                "Username": "OptimumWay"
            },
            "DateCreated": "2020-05-15T10:03:00Z"
        },
        {
            "ID": 22332,
            "ChargePointID": 156278,
            "ItemURL": "https://s3-ap-southeast-2.amazonaws.com/openchargemap/images/HU/OCM156278/OCM-156278.orig.2020051510021311.jpg",
            "ItemThumbnailURL": "https://s3-ap-southeast-2.amazonaws.com/openchargemap/images/HU/OCM156278/OCM-156278.thmb.2020051510021311.jpg",
            "Comment": "",
            "IsEnabled": true,
            "IsVideo": false,
            "IsFeaturedItem": false,
            "IsExternalResource": false,
            "User": {
                "ID": 20407,
                "Username": "OptimumWay"
            },
            "DateCreated": "2020-05-15T10:02:00Z"
        }
    ],
    "IsRecentlyVerified": false,
    "ID": 156278,
    "UUID": "23A48557-908A-449F-B33D-4A349715746A",
    "DataProviderID": 1,
    "OperatorID": 3395,
    "UsageTypeID": 1,
    "AddressInfo": {
        "ID": 156632,
        "Title": "COOP Domb áruház",
        "AddressLine1": "Nyíri utca 44",
        "Town": "Kecskemét",
        "StateOrProvince": "Fejér megye",
        "Postcode": "6000",
        "CountryID": 104,
        "Latitude": 46.914007353128085,
        "Longitude": 19.661913319756195,
        "ContactTelephone1": "+36 70 666 6654",
        "ContactEmail": "ory@optimumway.hu",
        "RelatedURL": "https://optimumway.hu/",
        "DistanceUnit": 0
    },
    "Connections": [
        {
            "ID": 219921,
            "ConnectionTypeID": 25,
            "StatusTypeID": 50,
            "LevelID": 2,
            "Amps": 32,
            "Voltage": 400,
            "PowerKW": 22,
            "Quantity": 2
        }
    ],
    "NumberOfPoints": 2,
    "GeneralComments": "2x22kWAC Type 2 Enel-X charger",
    "StatusTypeID": 50,
    "DateLastStatusUpdate": "2020-05-15T10:03:00Z",
    "DataQualityLevel": 1,
    "DateCreated": "2020-05-15T05:00:00Z",
    "SubmissionStatusTypeID": 200
}