{
    "IsRecentlyVerified": false,
    "ID": 158625,
    "UUID": "658C8DC2-C678-4195-A043-55C07BF91133",
    "DataProviderID": 2,
    "DataProvidersReference": "156072",
    "OperatorID": 5,
    "UsageTypeID": 1,
    "AddressInfo": {
        "ID": 158982,
        "Title": "NORCO CITY HALL",
        "AddressLine1": "2870 Clark Ave",
        "Town": "Norco",
        "StateOrProvince": "CA",
        "Postcode": "92860",
        "CountryID": 2,
        "Latitude": 33.919557,
        "Longitude": -117.561298,
        "ContactTelephone1": "888-758-4389",
        "AccessComments": "24 hours daily",
        "RelatedURL": "http://www.chargepoint.com/",
        "DistanceUnit": 0
    },
    "Connections": [
        {
            "ID": 228636,
            "ConnectionTypeID": 2,
            "LevelID": 3,
            "Amps": 100,
            "Voltage": 400,
            "PowerKW": 40,
            "CurrentTypeID": 30,
            "Quantity": 1
        },
        {
            "ID": 228637,
            "ConnectionTypeID": 32,
            "LevelID": 3,
            "Amps": 100,
            "Voltage": 400,
            "PowerKW": 40,
            "CurrentTypeID": 30,
            "Quantity": 1
        }
    ],
    "StatusTypeID": 50,
    "DateLastStatusUpdate": "2020-06-26T02:56:00Z",
    "DataQualityLevel": 3,
    "DateCreated": "2020-06-26T02:56:00Z",
    "SubmissionStatusTypeID": 100
}