{
    "IsRecentlyVerified": false,
    "ID": 141507,
    "UUID": "FE54BA30-F974-41AF-B595-EDC718FEEFA1",
    "DataProviderID": 2,
    "DataProvidersReference": "87420",
    "OperatorID": 5,
    "UsageTypeID": 1,
    "AddressInfo": {
        "ID": 141859,
        "Title": "EVERGY",
        "AddressLine1": "8202 W 71st St @ SMSD CENTER FOR ACADEMIC ACHIEVEMENT",
        "Town": "Overland Park",
        "StateOrProvince": "KS",
        "Postcode": "66204",
        "CountryID": 2,
        "Latitude": 39.0011958,
        "Longitude": -94.6807034,
        "ContactTelephone1": "888-758-4389",
        "AccessComments": "24 hours daily",
        "RelatedURL": "http://www.chargepoint.com/",
        "DistanceUnit": 0
    },
    "Connections": [
        {
            "ID": 197447,
            "ConnectionTypeID": 1,
            "LevelID": 2,
            "Amps": 16,
            "Voltage": 230,
            "PowerKW": 3.7,
            "CurrentTypeID": 10,
            "Quantity": 6
        }
    ],
    "StatusTypeID": 50,
    "DateLastStatusUpdate": "2020-06-26T03:01:00Z",
    "DataQualityLevel": 3,
    "DateCreated": "2019-12-24T09:15:00Z",
    "SubmissionStatusTypeID": 100
}