{
    "IsRecentlyVerified": false,
    "ID": 65380,
    "UUID": "6E73FAA1-DC23-4CB6-8F6F-2852D4A3F84E",
    "DataProviderID": 26,
    "DataProvidersReference": "85318",
    "OperatorsReference": "NL MAB Exploitatie 1000000060",
    "UsageCost": "0.00 afhankelijk van pas",
    "AddressInfo": {
        "ID": 65726,
        "Title": "Witte Wereld",
        "AddressLine1": "Witte Wereld",
        "Town": "Landgraaf",
        "Postcode": "6372 VG",
        "CountryID": 159,
        "Latitude": 50.875113,
        "Longitude": 6.018621,
        "RelatedURL": "http://www.nlmab.nl",
        "DistanceUnit": 0
    },
    "Connections": [
        {
            "ID": 90085,
            "ConnectionTypeID": 25,
            "LevelID": 2,
            "PowerKW": 11,
            "CurrentTypeID": 10
        }
    ],
    "NumberOfPoints": 2,
    "StatusTypeID": 50,
    "DateLastStatusUpdate": "2016-06-04T02:38:00Z",
    "DataQualityLevel": 3,
    "DateCreated": "2016-04-27T09:41:00Z",
    "SubmissionStatusTypeID": 100
}