{
    "IsRecentlyVerified": false,
    "ID": 176136,
    "UUID": "686002F1-BDCD-4BDB-A7D4-057FC41E151D",
    "DataProviderID": 1,
    "OperatorID": 1,
    "UsageTypeID": 1,
    "AddressInfo": {
        "ID": 176495,
        "Title": "Aristi Mountain Resort",
        "AddressLine1": "Καλπακίου - Αρίστης",
        "Town": "Αρίστη",
        "StateOrProvince": "Ioannina Regional Unit",
        "Postcode": "44016",
        "CountryID": 90,
        "Latitude": 39.93376459871763,
        "Longitude": 20.67016375661774,
        "ContactTelephone1": "+302653041330",
        "ContactEmail": "info@aristi.eu",
        "RelatedURL": "https://www.aristi.eu/en",
        "DistanceUnit": 0
    },
    "Connections": [
        {
            "ID": 273676,
            "ConnectionTypeID": 25,
            "StatusTypeID": 50,
            "LevelID": 2,
            "Amps": 32,
            "Voltage": 400,
            "PowerKW": 22,
            "CurrentTypeID": 20,
            "Quantity": 1
        }
    ],
    "NumberOfPoints": 1,
    "StatusTypeID": 50,
    "DateLastStatusUpdate": "2021-06-29T19:44:00Z",
    "DataQualityLevel": 1,
    "DateCreated": "2021-06-26T19:59:00Z",
    "SubmissionStatusTypeID": 200
}