{
    "IsRecentlyVerified": false,
    "ID": 96315,
    "UUID": "E86E049B-C98F-4715-A027-E8EAD996B09C",
    "DataProviderID": 1,
    "OperatorID": 69,
    "UsageTypeID": 4,
    "AddressInfo": {
        "ID": 96661,
        "Title": "Maximilianstraße",
        "AddressLine1": "Maximilianstraße 16A",
        "Town": "München",
        "StateOrProvince": "Bayern",
        "Postcode": "80539",
        "CountryID": 87,
        "Latitude": 48.1388572,
        "Longitude": 11.581046399999991,
        "RelatedURL": "https://www.swm.de/privatkunden/unternehmen/innovation/elektromobilitaet.html",
        "DistanceUnit": 0
    },
    "Connections": [
        {
            "ID": 136466,
            "ConnectionTypeID": 25,
            "StatusTypeID": 50,
            "LevelID": 2,
            "Amps": 32,
            "Voltage": 400,
            "PowerKW": 22,
            "CurrentTypeID": 20,
            "Quantity": 4
        }
    ],
    "NumberOfPoints": 4,
    "GeneralComments": "24/7 nutzbar. Betreiber sind die Stadtwerke München SWM im Verbund Ladenetz. Freischaltung der Säulen mit SWM Ladekarte, Karten der Roaming Partner oder mit der \"MVG more\" App.",
    "StatusTypeID": 50,
    "DateLastStatusUpdate": "2017-12-21T07:01:00Z",
    "DataQualityLevel": 1,
    "DateCreated": "2017-12-21T07:01:00Z",
    "SubmissionStatusTypeID": 200
}