{
    "IsRecentlyVerified": false,
    "ID": 105785,
    "UUID": "3B4B1B51-267F-4CA9-A624-B9BC176FC7C7",
    "DataProviderID": 2,
    "DataProvidersReference": "98415",
    "OperatorID": 5,
    "UsageTypeID": 1,
    "AddressInfo": {
        "ID": 106131,
        "Title": "DOWNTOWN DA",
        "AddressLine1": "35 W 500 S",
        "Town": "Salt Lake City",
        "StateOrProvince": "UT",
        "Postcode": "84101",
        "CountryID": 2,
        "Latitude": 40.75829,
        "Longitude": -111.892202,
        "ContactTelephone1": "888-758-4389",
        "AccessComments": "24 hours daily",
        "RelatedURL": "http://www.chargepoint.com/",
        "DistanceUnit": 0
    },
    "Connections": [
        {
            "ID": 148987,
            "ConnectionTypeID": 1,
            "LevelID": 2,
            "Amps": 16,
            "Voltage": 230,
            "PowerKW": 3.7,
            "CurrentTypeID": 10,
            "Quantity": 14
        }
    ],
    "DateLastStatusUpdate": "2020-06-26T03:03:00Z",
    "DataQualityLevel": 3,
    "DateCreated": "2018-06-09T04:02:00Z",
    "SubmissionStatusTypeID": 100
}