{
    "IsRecentlyVerified": false,
    "ID": 142979,
    "UUID": "71AE27A5-3D84-4993-A3C2-8F4CDF6A87C6",
    "DataProviderID": 2,
    "DataProvidersReference": "149752",
    "OperatorID": 9,
    "UsageTypeID": 1,
    "AddressInfo": {
        "ID": 143331,
        "Title": "McDonald's NSN-13143",
        "AddressLine1": "26A Sutton Ave.",
        "Town": "Oxford",
        "StateOrProvince": "MA",
        "Postcode": "01540",
        "CountryID": 2,
        "Latitude": 42.116866,
        "Longitude": -71.859812,
        "ContactTelephone1": "888-998-2546",
        "AccessComments": "MON: 24 hours | TUE: 24 hours | WED: 24 hours | THU: 24 hours | FRI: 24 hours | SAT: 24 hours | SUN: 24 hours",
        "RelatedURL": "http://www.blinkcharging.com/",
        "DistanceUnit": 0
    },
    "Connections": [
        {
            "ID": 199225,
            "ConnectionTypeID": 1,
            "LevelID": 2,
            "Amps": 16,
            "Voltage": 230,
            "PowerKW": 3.7,
            "CurrentTypeID": 10,
            "Quantity": 2
        }
    ],
    "StatusTypeID": 50,
    "DateLastStatusUpdate": "2020-06-26T03:05:00Z",
    "DataQualityLevel": 3,
    "DateCreated": "2019-12-24T09:19:00Z",
    "SubmissionStatusTypeID": 100
}