{
    "IsRecentlyVerified": false,
    "ID": 80036,
    "UUID": "6BACB19F-3795-4410-8B81-3299B06D9C12",
    "DataProviderID": 1,
    "OperatorID": 23,
    "OperatorsReference": "23910",
    "UsageTypeID": 6,
    "UsageCost": "Free",
    "AddressInfo": {
        "ID": 80382,
        "Title": "Inn Serendipity Bed & Breakfast and Farm",
        "AddressLine1": "W7843 County RD P",
        "Town": "Browntown",
        "StateOrProvince": "Wisconsin",
        "Postcode": "53522",
        "CountryID": 2,
        "Latitude": 42.519212,
        "Longitude": -89.746523,
        "ContactTelephone1": "(608) 329-7056",
        "DistanceUnit": 0
    },
    "Connections": [
        {
            "ID": 114685,
            "ConnectionTypeID": 30,
            "StatusTypeID": 50,
            "LevelID": 2,
            "PowerKW": 8,
            "CurrentTypeID": 10,
            "Quantity": 1
        }
    ],
    "NumberOfPoints": 1,
    "GeneralComments": "1 Tesla Connector, up to 8kW.Available for patrons only. Please see front desk.",
    "StatusTypeID": 50,
    "DateLastStatusUpdate": "2017-07-13T14:13:00Z",
    "DataQualityLevel": 1,
    "DateCreated": "2017-01-30T18:22:00Z",
    "SubmissionStatusTypeID": 200
}