{
    "IsRecentlyVerified": false,
    "ID": 97276,
    "UUID": "43C3B570-1766-4F94-806D-0FDD5F956B02",
    "DataProviderID": 1,
    "OperatorID": 3315,
    "OperatorsReference": "52522",
    "UsageTypeID": 4,
    "UsageCost": "Free",
    "AddressInfo": {
        "ID": 97622,
        "Title": "Girvan Train Station, Vicarton Street",
        "AddressLine1": "Girvan Train Station",
        "Town": "Vicarton Street",
        "StateOrProvince": "Girvan",
        "Postcode": "KA26 9HF",
        "CountryID": 1,
        "Latitude": 55.2463,
        "Longitude": -4.84819,
        "DistanceUnit": 0
    },
    "Connections": [
        {
            "ID": 138147,
            "ConnectionTypeID": 25,
            "StatusTypeID": 50,
            "LevelID": 2,
            "Amps": 32,
            "Voltage": 230,
            "PowerKW": 7,
            "CurrentTypeID": 10,
            "Quantity": 2
        }
    ],
    "NumberOfPoints": 2,
    "StatusTypeID": 50,
    "DateLastStatusUpdate": "2020-01-02T08:37:00Z",
    "DataQualityLevel": 1,
    "DateCreated": "2018-01-16T06:14:00Z",
    "SubmissionStatusTypeID": 200
}