{
    "UserComments": [
        {
            "ID": 7974,
            "ChargePointID": 48386,
            "CommentTypeID": 10,
            "UserName": "eoosterhoorn",
            "Comment": "Charge point is free most times, have only seen twice another car charging when I returned to the car. Sometimes a car has parked in the spot but this is most likely to pick up a child and should move within 5 minutes.",
            "Rating": 5,
            "DateCreated": "2015-11-12T13:03:11.797Z",
            "User": {
                "ID": 1039,
                "Username": "eoosterhoorn"
            },
            "CheckinStatusTypeID": 10
        }
    ],
    "MediaItems": [
        {
            "ID": 3493,
            "ChargePointID": 48386,
            "ItemURL": "https://s3-ap-southeast-2.amazonaws.com/openchargemap/images/GB/OCM48386/OCM-48386.orig.2015111213040938.jpg",
            "ItemThumbnailURL": "https://s3-ap-southeast-2.amazonaws.com/openchargemap/images/GB/OCM48386/OCM-48386.thmb.2015111213040938.jpg",
            "Comment": "",
            "IsEnabled": true,
            "IsVideo": false,
            "IsFeaturedItem": false,
            "IsExternalResource": false,
            "User": {
                "ID": 1039,
                "Username": "eoosterhoorn"
            },
            "DateCreated": "2015-11-12T13:04:00Z"
        }
    ],
    "IsRecentlyVerified": false,
    "ID": 48386,
    "UUID": "5C40AE0E-67D7-4EDD-97A6-FB08D9F51712",
    "DataProviderID": 1,
    "OperatorID": 3315,
    "OperatorsReference": "50549",
    "UsageTypeID": 6,
    "UsageCost": "Free",
    "AddressInfo": {
        "ID": 48732,
        "Title": "Deanside LTD (technology Park Nursery)",
        "AddressLine1": "Explorer Road",
        "AddressLine2": "Gowrie Park",
        "Town": "Dundee City",
        "Postcode": "DD2 1DX",
        "CountryID": 1,
        "Latitude": 56.468893,
        "Longitude": -3.0587217,
        "DistanceUnit": 0
    },
    "Connections": [
        {
            "ID": 59825,
            "ConnectionTypeID": 25,
            "StatusTypeID": 50,
            "LevelID": 2,
            "Amps": 32,
            "Voltage": 230,
            "PowerKW": 7,
            "CurrentTypeID": 10,
            "Quantity": 2
        }
    ],
    "NumberOfPoints": 2,
    "StatusTypeID": 50,
    "DateLastStatusUpdate": "2018-04-09T17:08:00Z",
    "DataQualityLevel": 1,
    "DateCreated": "2015-06-25T09:56:00Z",
    "SubmissionStatusTypeID": 200
}