{
    "IsRecentlyVerified": false,
    "ID": 177362,
    "UUID": "1E7B20A5-99E4-4A9B-80DB-82B3865A4880",
    "DataProviderID": 29,
    "DataProvidersReference": "4058",
    "OperatorID": 69,
    "AddressInfo": {
        "ID": 177721,
        "Title": "Steubenpl. 4",
        "AddressLine1": "Steubenpl. 4",
        "Town": "München",
        "Postcode": "80639",
        "CountryID": 87,
        "Latitude": 48.151127,
        "Longitude": 11.519815,
        "DistanceUnit": 0
    },
    "Connections": [
        {
            "ID": 276424,
            "ConnectionTypeID": 25,
            "StatusTypeID": 50,
            "LevelID": 2,
            "PowerKW": 22,
            "CurrentTypeID": 20
        },
        {
            "ID": 276425,
            "ConnectionTypeID": 25,
            "StatusTypeID": 50,
            "LevelID": 2,
            "PowerKW": 22,
            "CurrentTypeID": 20
        }
    ],
    "StatusTypeID": 0,
    "DateLastStatusUpdate": "2021-07-09T03:11:00Z",
    "MetadataValues": [
        {
            "ID": 9656,
            "MetadataFieldID": 4,
            "ItemValue": "Data from the German chargepoint registry provided by Bundesnetzagentur.de under the CC-BY 4.0 license"
        }
    ],
    "DataQualityLevel": 3,
    "DateCreated": "2021-07-08T09:48:00Z",
    "SubmissionStatusTypeID": 100
}