{
    "IsRecentlyVerified": false,
    "ID": 122354,
    "UUID": "DCFBA41A-AD57-4B24-93DE-DD9ADA35407C",
    "DataProviderID": 2,
    "DataProvidersReference": "51518",
    "UsageTypeID": 1,
    "AddressInfo": {
        "ID": 122700,
        "Title": "City of Rancho Cucamonga - Public Works Service Center",
        "AddressLine1": "8794 Lions St",
        "Town": "Rancho Cucamonga",
        "StateOrProvince": "CA",
        "Postcode": "91730",
        "CountryID": 2,
        "Latitude": 34.093578,
        "Longitude": -117.605249,
        "ContactTelephone1": "909-774-2047",
        "AccessComments": "Lot business hours; must have MobileNow! App for payment; maximum session time of 4 hours",
        "RelatedURL": "",
        "DistanceUnit": 0
    },
    "Connections": [
        {
            "ID": 172239,
            "ConnectionTypeID": 1,
            "LevelID": 2,
            "Amps": 16,
            "Voltage": 230,
            "PowerKW": 3.7,
            "CurrentTypeID": 10,
            "Quantity": 1
        }
    ],
    "DateLastStatusUpdate": "2020-06-26T02:57:00Z",
    "DataQualityLevel": 3,
    "DateCreated": "2019-04-06T05:03:00Z",
    "SubmissionStatusTypeID": 100
}