{
    "IsRecentlyVerified": false,
    "ID": 165303,
    "UUID": "11C2941C-1B31-4947-A316-5BFC803C4395",
    "DataProviderID": 28,
    "DataProvidersReference": "FR*S64*PMB64*12",
    "OperatorID": 3407,
    "UsageTypeID": 5,
    "AddressInfo": {
        "ID": 165662,
        "Title": "ARETTE LA PIERRE SAINT MARTIN - Parking Office De Tourisme",
        "AddressLine1": "Parking Office De Tourisme 64570 ARETTE LA PIERRE SAINT MARTIN",
        "CountryID": 80,
        "Latitude": 42.977496,
        "Longitude": -0.744628,
        "AccessComments": "24h/24 7j/7",
        "DistanceUnit": 0
    },
    "Connections": [
        {
            "ID": 237339,
            "ConnectionTypeID": 25,
            "StatusTypeID": 50,
            "LevelID": 2,
            "PowerKW": 18,
            "CurrentTypeID": 20
        },
        {
            "ID": 237340,
            "ConnectionTypeID": 28,
            "StatusTypeID": 50,
            "LevelID": 2,
            "PowerKW": 18,
            "CurrentTypeID": 10
        },
        {
            "ID": 237341,
            "ConnectionTypeID": 25,
            "StatusTypeID": 50,
            "LevelID": 2,
            "PowerKW": 18,
            "CurrentTypeID": 20
        },
        {
            "ID": 237342,
            "ConnectionTypeID": 28,
            "StatusTypeID": 50,
            "LevelID": 2,
            "PowerKW": 18,
            "CurrentTypeID": 10
        }
    ],
    "GeneralComments": "Recharge par badge et avec une application smartphone",
    "StatusTypeID": 50,
    "DateLastStatusUpdate": "2020-08-27T05:10:00Z",
    "DataQualityLevel": 2,
    "DateCreated": "2020-08-27T05:10:00Z",
    "SubmissionStatusTypeID": 100
}