{
    "IsRecentlyVerified": false,
    "ID": 136807,
    "UUID": "1AC0F0C3-8E59-421A-8D59-850C46831281",
    "DataProviderID": 18,
    "DataProvidersReference": "bc101eea4b9936d2c39965eae229df27",
    "OperatorID": 150,
    "UsageTypeID": 5,
    "AddressInfo": {
        "ID": 137153,
        "Title": "Blue",
        "AddressLine1": "Blue",
        "Town": "Salford",
        "Postcode": "M50 2TG",
        "CountryID": 1,
        "Latitude": 53.47393,
        "Longitude": -2.300544,
        "AccessComments": "Level 2",
        "RelatedURL": "http://www.chargepointservices.com/",
        "DistanceUnit": 0
    },
    "Connections": [
        {
            "ID": 191414,
            "ConnectionTypeID": 25,
            "Reference": "1",
            "StatusTypeID": 50,
            "LevelID": 2,
            "Amps": 32,
            "Voltage": 400,
            "PowerKW": 22,
            "CurrentTypeID": 20
        },
        {
            "ID": 191415,
            "ConnectionTypeID": 25,
            "Reference": "2",
            "StatusTypeID": 50,
            "LevelID": 2,
            "Amps": 32,
            "Voltage": 400,
            "PowerKW": 22,
            "CurrentTypeID": 20
        }
    ],
    "StatusTypeID": 0,
    "DateLastStatusUpdate": "2020-02-03T17:20:00Z",
    "MetadataValues": [
        {
            "ID": 6659,
            "MetadataFieldID": 4,
            "ItemValue": "Contains public sector information licensed under the Open Government Licence v2.0. http://www.nationalarchives.gov.uk/doc/open-government-licence/version/2/"
        }
    ],
    "DataQualityLevel": 3,
    "DateCreated": "2019-12-24T05:23:00Z",
    "SubmissionStatusTypeID": 100
}