{
    "IsRecentlyVerified": false,
    "ID": 90814,
    "UUID": "2A3BF2F0-EB70-41B2-9F3F-1F2F4B542D17",
    "DataProviderID": 1,
    "DataProvidersReference": "4192",
    "AddressInfo": {
        "ID": 91160,
        "Title": "E.ON Max Mjölby",
        "AddressLine1": "Armborstgatan 2",
        "Town": "MJÖLBY",
        "StateOrProvince": "ÖSTERGÖTLAND",
        "Postcode": "59501",
        "CountryID": 216,
        "Latitude": 58.32391,
        "Longitude": 15.09125,
        "AccessComments": "58.323910, 15.091253",
        "DistanceUnit": 0
    },
    "Connections": [
        {
            "ID": 128575,
            "ConnectionTypeID": 0,
            "Reference": "1",
            "LevelID": 2,
            "Amps": 100,
            "Voltage": 500,
            "PowerKW": 50,
            "Comments": "Mode 4"
        },
        {
            "ID": 128576,
            "ConnectionTypeID": 0,
            "Reference": "2",
            "LevelID": 2,
            "Amps": 100,
            "Voltage": 500,
            "PowerKW": 50,
            "Comments": "Mode 4"
        },
        {
            "ID": 128577,
            "ConnectionTypeID": 0,
            "Reference": "3",
            "LevelID": 2,
            "Amps": 32,
            "Voltage": 400,
            "PowerKW": 22,
            "Comments": "Mode 3"
        }
    ],
    "NumberOfPoints": 3,
    "DateLastStatusUpdate": "2020-05-26T08:22:00Z",
    "DataQualityLevel": 2,
    "DateCreated": "2017-07-25T08:28:00Z",
    "SubmissionStatusTypeID": 100
}