{
    "IsRecentlyVerified": false,
    "ID": 187676,
    "UUID": "13CC1D05-B964-4D5F-9407-554EC4E938CE",
    "DataProviderID": 18,
    "DataProvidersReference": "72a36e8158ffceef8dc28aae2880f440",
    "OperatorID": 2244,
    "UsageTypeID": 5,
    "AddressInfo": {
        "ID": 188035,
        "Title": "Homestead Road",
        "AddressLine1": "Homestead Road",
        "Town": "London",
        "Postcode": "SW6 7BL",
        "CountryID": 1,
        "Latitude": 51.480168,
        "Longitude": -0.205144,
        "AccessComments": "",
        "RelatedURL": "https://www.ubitricity.com",
        "DistanceUnit": 0
    },
    "Connections": [
        {
            "ID": 302909,
            "ConnectionTypeID": 25,
            "Reference": "suby1100004817",
            "StatusTypeID": 50,
            "LevelID": 2,
            "Amps": 16,
            "Voltage": 230,
            "PowerKW": 3.7,
            "CurrentTypeID": 10
        }
    ],
    "StatusTypeID": 0,
    "DateLastStatusUpdate": "2021-07-12T03:38:00Z",
    "MetadataValues": [
        {
            "ID": 19916,
            "MetadataFieldID": 4,
            "ItemValue": "Contains public sector information licensed under the Open Government Licence v2.0. http://www.nationalarchives.gov.uk/doc/open-government-licence/version/2/"
        }
    ],
    "DataQualityLevel": 3,
    "DateCreated": "2021-07-12T03:38:00Z",
    "SubmissionStatusTypeID": 100
}