{
    "IsRecentlyVerified": false,
    "ID": 109288,
    "UUID": "5BBC6592-7549-473B-AB3A-F6CFAC1AA7E3",
    "DataProviderID": 1,
    "OperatorID": 23,
    "OperatorsReference": "45110",
    "UsageTypeID": 4,
    "AddressInfo": {
        "ID": 109634,
        "Title": "Kristinehamn Herrgårdscamping & Stugor",
        "AddressLine1": "Presterudsallén 2",
        "StateOrProvince": "Kristinehamn",
        "Postcode": "68152",
        "CountryID": 216,
        "Latitude": 59.307724,
        "Longitude": 14.067485,
        "ContactTelephone1": " +46 55010280",
        "DistanceUnit": 0
    },
    "Connections": [
        {
            "ID": 154406,
            "ConnectionTypeID": 30,
            "StatusTypeID": 50,
            "LevelID": 2,
            "Amps": 32,
            "Voltage": 400,
            "PowerKW": 22,
            "CurrentTypeID": 20,
            "Quantity": 1
        }
    ],
    "NumberOfPoints": 1,
    "GeneralComments": "1 Tesla Connector, up to 22kW.Available for customers. Self park.",
    "StatusTypeID": 50,
    "DateLastStatusUpdate": "2018-10-11T14:13:00Z",
    "DataQualityLevel": 1,
    "DateCreated": "2018-10-11T14:13:00Z",
    "SubmissionStatusTypeID": 200
}