{
    "IsRecentlyVerified": false,
    "ID": 79299,
    "UUID": "3DCD7856-6110-40EE-A67B-CCFE39A3FC8F",
    "DataProviderID": 1,
    "OperatorID": 23,
    "OperatorsReference": "19322",
    "UsageTypeID": 4,
    "UsageCost": "Free",
    "AddressInfo": {
        "ID": 79645,
        "Title": "Desparada Wines",
        "AddressLine1": "3060 Limestone Wy",
        "Town": "Templeton",
        "StateOrProvince": "California",
        "Postcode": "93465",
        "CountryID": 2,
        "Latitude": 35.575848,
        "Longitude": -120.690237,
        "ContactTelephone1": "(805) 400-9596",
        "DistanceUnit": 0
    },
    "Connections": [
        {
            "ID": 113925,
            "ConnectionTypeID": 30,
            "StatusTypeID": 50,
            "LevelID": 2,
            "PowerKW": 8,
            "CurrentTypeID": 10,
            "Quantity": 1
        }
    ],
    "NumberOfPoints": 1,
    "GeneralComments": "1 Tesla Connector, up to 8kW.Available to the public. Self park.",
    "StatusTypeID": 50,
    "DateLastStatusUpdate": "2017-06-09T14:30:00Z",
    "DataQualityLevel": 1,
    "DateCreated": "2017-01-27T08:01:00Z",
    "SubmissionStatusTypeID": 200
}