{
    "IsRecentlyVerified": false,
    "ID": 167045,
    "UUID": "2443A60B-F17A-4290-A6B8-A4E89E2D9341",
    "DataProviderID": 18,
    "DataProvidersReference": "301f1191201e740200fd6de94eac030e",
    "OperatorID": 3345,
    "UsageTypeID": 5,
    "AddressInfo": {
        "ID": 167404,
        "Title": "CV3 1DZ",
        "AddressLine1": "",
        "Town": "Coventry",
        "Postcode": "CV3 1DZ",
        "CountryID": 1,
        "Latitude": 52.394918,
        "Longitude": -1.470958,
        "AccessComments": "",
        "RelatedURL": "https://char.gy",
        "DistanceUnit": 0
    },
    "Connections": [
        {
            "ID": 252955,
            "ConnectionTypeID": 25,
            "Reference": "00436",
            "StatusTypeID": 50,
            "LevelID": 2,
            "Amps": 16,
            "Voltage": 230,
            "PowerKW": 3.7,
            "CurrentTypeID": 10
        }
    ],
    "StatusTypeID": 0,
    "DateLastStatusUpdate": "2020-08-27T08:10:00Z",
    "MetadataValues": [
        {
            "ID": 7802,
            "MetadataFieldID": 4,
            "ItemValue": "Contains public sector information licensed under the Open Government Licence v2.0. http://www.nationalarchives.gov.uk/doc/open-government-licence/version/2/"
        }
    ],
    "DataQualityLevel": 3,
    "DateCreated": "2020-08-27T08:10:00Z",
    "SubmissionStatusTypeID": 100
}