{
    "IsRecentlyVerified": false,
    "ID": 169814,
    "UUID": "9BF59C09-113D-4FA0-8881-954CA804F365",
    "DataProviderID": 1,
    "OperatorID": 80,
    "UsageTypeID": 4,
    "AddressInfo": {
        "ID": 170173,
        "Title": "GONNOSCODINA Parco San Daniele  | ENELX",
        "AddressLine1": "Via Roma SP46",
        "Town": "Gonnoscodina",
        "StateOrProvince": "OR",
        "Postcode": "09090",
        "CountryID": 112,
        "Latitude": 39.70004068652983,
        "Longitude": 8.834506532856835,
        "RelatedURL": "https://www.enelx.com/it/it/emobility",
        "DistanceUnit": 0
    },
    "Connections": [
        {
            "ID": 258735,
            "ConnectionTypeID": 25,
            "StatusTypeID": 50,
            "LevelID": 2,
            "Amps": 32,
            "Voltage": 400,
            "PowerKW": 22,
            "CurrentTypeID": 20,
            "Quantity": 2
        },
        {
            "ID": 258736,
            "ConnectionTypeID": 36,
            "StatusTypeID": 50,
            "LevelID": 2,
            "Amps": 16,
            "Voltage": 240,
            "PowerKW": 3,
            "CurrentTypeID": 10,
            "Quantity": 1
        }
    ],
    "NumberOfPoints": 2,
    "StatusTypeID": 50,
    "DateLastStatusUpdate": "2020-11-10T16:42:00Z",
    "DataQualityLevel": 1,
    "DateCreated": "2020-11-10T16:42:00Z",
    "SubmissionStatusTypeID": 200
}