{
    "IsRecentlyVerified": false,
    "ID": 47456,
    "UUID": "3A476C8E-8329-4A4B-8B9A-BDD8EB92D551",
    "DataProviderID": 1,
    "OperatorID": 23,
    "OperatorsReference": "7618",
    "UsageTypeID": 7,
    "UsageCost": "Free",
    "AddressInfo": {
        "ID": 47802,
        "Title": "Oxford Hotel - Tesla",
        "AddressLine1": "10 NW Minnesota Ave",
        "Town": "Bend",
        "StateOrProvince": "OR",
        "Postcode": "97701",
        "CountryID": 2,
        "Latitude": 44.0580874,
        "Longitude": -121.3118354,
        "ContactTelephone1": "542-610-3401  877-798-3752",
        "AccessComments": "24 hours daily; for Tesla guest use only",
        "RelatedURL": "http://www.teslamotors.com/supercharger",
        "DistanceUnit": 0
    },
    "Connections": [
        {
            "ID": 58497,
            "ConnectionTypeID": 30,
            "StatusTypeID": 50,
            "LevelID": 2,
            "Amps": 16,
            "Voltage": 230,
            "PowerKW": 13,
            "CurrentTypeID": 10,
            "Quantity": 2
        }
    ],
    "NumberOfPoints": 2,
    "StatusTypeID": 50,
    "DateLastStatusUpdate": "2017-02-01T10:13:00Z",
    "DataQualityLevel": 3,
    "DateCreated": "2015-05-27T08:51:00Z",
    "SubmissionStatusTypeID": 100
}