{
    "IsRecentlyVerified": false,
    "ID": 81469,
    "UUID": "E968AB3E-0481-43FE-B021-1F746D1546A3",
    "DataProviderID": 1,
    "OperatorID": 45,
    "UsageTypeID": 6,
    "AddressInfo": {
        "ID": 81815,
        "Title": " Osteria della Pista",
        "AddressLine1": "Via Verbano, 1",
        "Town": "Casorate Sempione",
        "StateOrProvince": "VA",
        "Postcode": "21011",
        "CountryID": 112,
        "Latitude": 45.67435144273071,
        "Longitude": 8.739920550033377,
        "ContactTelephone1": "+39 0331 295054",
        "ContactEmail": "info@osteriadellapista.com",
        "RelatedURL": "http://www.osteriadellapista.com/",
        "DistanceUnit": 0
    },
    "Connections": [
        {
            "ID": 116205,
            "ConnectionTypeID": 1036,
            "StatusTypeID": 50,
            "LevelID": 2,
            "Amps": 32,
            "Voltage": 400,
            "PowerKW": 22,
            "CurrentTypeID": 20,
            "Quantity": 1
        }
    ],
    "NumberOfPoints": 1,
    "GeneralComments": "Tesla Destination Charging",
    "StatusTypeID": 50,
    "DateLastStatusUpdate": "2017-02-02T16:43:00Z",
    "DataQualityLevel": 1,
    "DateCreated": "2017-02-02T16:43:00Z",
    "SubmissionStatusTypeID": 200
}