{
    "IsRecentlyVerified": false,
    "ID": 158677,
    "UUID": "C2EDD9FB-D847-424D-9996-6DA3CB1E9E20",
    "DataProviderID": 2,
    "DataProvidersReference": "154789",
    "OperatorID": 89,
    "UsageTypeID": 1,
    "AddressInfo": {
        "ID": 159034,
        "Title": "948 E Vernon Ave",
        "AddressLine1": "948 E Vernon Ave",
        "Town": "Los Angeles",
        "StateOrProvince": "CA",
        "Postcode": "90011",
        "CountryID": 2,
        "Latitude": 34.00384309,
        "Longitude": -118.2590748,
        "ContactTelephone1": "888-356-8911",
        "AccessComments": "24 hours daily",
        "RelatedURL": "https://flo.ca/",
        "DistanceUnit": 0
    },
    "Connections": [
        {
            "ID": 228696,
            "ConnectionTypeID": 1,
            "LevelID": 2,
            "Amps": 16,
            "Voltage": 230,
            "PowerKW": 3.7,
            "CurrentTypeID": 10,
            "Quantity": 1
        }
    ],
    "StatusTypeID": 50,
    "DateLastStatusUpdate": "2020-06-26T02:56:00Z",
    "DataQualityLevel": 3,
    "DateCreated": "2020-06-26T02:56:00Z",
    "SubmissionStatusTypeID": 100
}