{
    "IsRecentlyVerified": false,
    "ID": 166336,
    "UUID": "3CACC6CE-D5A4-45CC-8AE0-38046118CB40",
    "DataProviderID": 28,
    "DataProvidersReference": "FR*S25*P02505628",
    "UsageTypeID": 5,
    "AddressInfo": {
        "ID": 166695,
        "Title": "Parking St Paul",
        "AddressLine1": "\"20 Avenue Arthur Gaulard 25000 Besançon\"",
        "CountryID": 80,
        "Latitude": 47.23923,
        "Longitude": 6.03128,
        "AccessComments": "accessible 24h/24 - 7j/7",
        "DistanceUnit": 0
    },
    "Connections": [
        {
            "ID": 246622,
            "ConnectionTypeID": 1036,
            "StatusTypeID": 50,
            "LevelID": 2,
            "PowerKW": 22,
            "CurrentTypeID": 20
        },
        {
            "ID": 246623,
            "ConnectionTypeID": 1036,
            "StatusTypeID": 50,
            "LevelID": 2,
            "PowerKW": 22,
            "CurrentTypeID": 20
        }
    ],
    "GeneralComments": "recharge normale et accélérée accessible par application smartphone/internet et badge - informations site web freshmile.fr",
    "StatusTypeID": 50,
    "DateLastStatusUpdate": "2020-08-27T05:13:00Z",
    "DataQualityLevel": 2,
    "DateCreated": "2020-08-27T05:13:00Z",
    "SubmissionStatusTypeID": 100
}