{
    "IsRecentlyVerified": false,
    "ID": 87831,
    "UUID": "1CE5BD01-025C-49AE-B6B4-CE9BE3EA87D5",
    "DataProviderID": 1,
    "DataProvidersReference": "3987",
    "AddressInfo": {
        "ID": 88177,
        "Title": "Sandvik: Coromant Parkering",
        "AddressLine1": "Mossvägen 10",
        "Town": "SANDVIKEN",
        "StateOrProvince": "GÄVLEBORG",
        "Postcode": "81181",
        "CountryID": 216,
        "Latitude": 60.62201,
        "Longitude": 16.79145,
        "AccessComments": "",
        "DistanceUnit": 0
    },
    "Connections": [
        {
            "ID": 124568,
            "ConnectionTypeID": 0,
            "Reference": "1",
            "LevelID": 2,
            "Amps": 16,
            "Voltage": 400,
            "PowerKW": 11,
            "Comments": "Mode 3"
        },
        {
            "ID": 124569,
            "ConnectionTypeID": 0,
            "Reference": "2",
            "LevelID": 2,
            "Amps": 16,
            "Voltage": 400,
            "PowerKW": 11,
            "Comments": "Mode 3"
        },
        {
            "ID": 124570,
            "ConnectionTypeID": 0,
            "Reference": "3",
            "LevelID": 2,
            "Amps": 16,
            "Voltage": 400,
            "PowerKW": 11,
            "Comments": "Mode 3"
        },
        {
            "ID": 124571,
            "ConnectionTypeID": 0,
            "Reference": "4",
            "LevelID": 2,
            "Amps": 16,
            "Voltage": 400,
            "PowerKW": 11,
            "Comments": "Mode 3"
        }
    ],
    "NumberOfPoints": 4,
    "DateLastStatusUpdate": "2020-05-26T08:24:00Z",
    "DataQualityLevel": 2,
    "DateCreated": "2017-05-16T11:07:00Z",
    "SubmissionStatusTypeID": 100
}