{
    "IsRecentlyVerified": false,
    "ID": 108886,
    "UUID": "8E387480-EA14-4C88-A785-000D7E257FB4",
    "DataProviderID": 1,
    "OperatorID": 23,
    "OperatorsReference": "45279",
    "UsageTypeID": 4,
    "AddressInfo": {
        "ID": 109232,
        "Title": "Holiday Inn Express Munich - City East",
        "AddressLine1": "Holiday Inn Express Munich",
        "Postcode": "81673",
        "CountryID": 87,
        "Latitude": 48.131539,
        "Longitude": 11.628208,
        "ContactTelephone1": " +49 8995 4686 33",
        "DistanceUnit": 0
    },
    "Connections": [
        {
            "ID": 154003,
            "ConnectionTypeID": 30,
            "StatusTypeID": 50,
            "LevelID": 2,
            "Amps": 32,
            "Voltage": 400,
            "PowerKW": 22,
            "CurrentTypeID": 20,
            "Quantity": 2
        }
    ],
    "NumberOfPoints": 2,
    "GeneralComments": "2 Tesla Connectors, up to 22kW.Available for customers. Self park.",
    "StatusTypeID": 50,
    "DateLastStatusUpdate": "2018-10-11T12:58:00Z",
    "DataQualityLevel": 1,
    "DateCreated": "2018-10-11T12:58:00Z",
    "SubmissionStatusTypeID": 200
}