{
    "IsRecentlyVerified": false,
    "ID": 56601,
    "UUID": "81DDC9E2-FDF5-428D-96F3-B1CE59C6EC28",
    "DataProviderID": 1,
    "OperatorID": 23,
    "OperatorsReference": "11920",
    "UsageTypeID": 1,
    "UsageCost": "Free",
    "AddressInfo": {
        "ID": 56947,
        "Title": "Trinidad Bay Bed & Breakfast - Tesla",
        "AddressLine1": "560 Edwards St",
        "Town": "Trinidad",
        "StateOrProvince": "CA",
        "Postcode": "95570",
        "CountryID": 2,
        "Latitude": 41.0586001,
        "Longitude": -124.1427538,
        "ContactTelephone1": "707-677-0840  877-798-3752",
        "AccessComments": "24 hours daily; for Tesla use only; for guest use only; see front desk for access",
        "RelatedURL": "http://www.teslamotors.com/supercharger",
        "DistanceUnit": 0
    },
    "Connections": [
        {
            "ID": 71361,
            "ConnectionTypeID": 30,
            "StatusTypeID": 50,
            "LevelID": 2,
            "Amps": 16,
            "Voltage": 230,
            "PowerKW": 8,
            "CurrentTypeID": 10,
            "Quantity": 1
        }
    ],
    "NumberOfPoints": 1,
    "StatusTypeID": 50,
    "DateLastStatusUpdate": "2017-01-26T16:57:00Z",
    "DataQualityLevel": 3,
    "DateCreated": "2015-11-04T08:42:00Z",
    "SubmissionStatusTypeID": 100
}