{
    "IsRecentlyVerified": false,
    "ID": 142708,
    "UUID": "94B52133-5C67-4767-83FC-0DD2538A7CA5",
    "DataProviderID": 2,
    "DataProvidersReference": "123148",
    "OperatorID": 3372,
    "UsageTypeID": 2,
    "AddressInfo": {
        "ID": 143060,
        "Title": "ABB - Training Center",
        "AddressLine1": "23000 Harvard Rd",
        "Town": "Cleveland",
        "StateOrProvince": "OH",
        "Postcode": "44122",
        "CountryID": 2,
        "Latitude": 41.4503119,
        "Longitude": -81.5158759999999,
        "ContactTelephone1": "",
        "AccessComments": "",
        "RelatedURL": "http://evconnect.com/",
        "DistanceUnit": 0
    },
    "Connections": [
        {
            "ID": 198905,
            "ConnectionTypeID": 2,
            "LevelID": 3,
            "Amps": 100,
            "Voltage": 400,
            "PowerKW": 40,
            "CurrentTypeID": 30,
            "Quantity": 1
        },
        {
            "ID": 198906,
            "ConnectionTypeID": 32,
            "LevelID": 3,
            "Amps": 100,
            "Voltage": 400,
            "PowerKW": 40,
            "CurrentTypeID": 30,
            "Quantity": 1
        }
    ],
    "StatusTypeID": 50,
    "DateLastStatusUpdate": "2020-06-26T03:04:00Z",
    "DataQualityLevel": 3,
    "DateCreated": "2019-12-24T09:18:00Z",
    "SubmissionStatusTypeID": 100
}