{
    "IsRecentlyVerified": false,
    "ID": 177990,
    "UUID": "1668E92F-E038-4D87-B6CB-E362B330BEE3",
    "DataProviderID": 29,
    "DataProvidersReference": "17944,14768",
    "OperatorID": 69,
    "AddressInfo": {
        "ID": 178349,
        "Title": "Burkhardt+Weber-Straße 59",
        "AddressLine1": "Burkhardt+Weber-Straße 59",
        "Town": "Reutlingen",
        "Postcode": "72760",
        "CountryID": 87,
        "Latitude": 48.500089,
        "Longitude": 9.209945,
        "DistanceUnit": 0
    },
    "Connections": [
        {
            "ID": 277824,
            "ConnectionTypeID": 25,
            "StatusTypeID": 50,
            "LevelID": 2,
            "PowerKW": 22,
            "CurrentTypeID": 20
        },
        {
            "ID": 277825,
            "ConnectionTypeID": 25,
            "StatusTypeID": 50,
            "LevelID": 2,
            "PowerKW": 22,
            "CurrentTypeID": 20
        },
        {
            "ID": 277826,
            "ConnectionTypeID": 25,
            "StatusTypeID": 50,
            "LevelID": 2,
            "PowerKW": 22,
            "CurrentTypeID": 20
        },
        {
            "ID": 277827,
            "ConnectionTypeID": 25,
            "StatusTypeID": 50,
            "LevelID": 2,
            "PowerKW": 22,
            "CurrentTypeID": 20
        }
    ],
    "StatusTypeID": 0,
    "DateLastStatusUpdate": "2021-07-09T03:12:00Z",
    "MetadataValues": [
        {
            "ID": 10284,
            "MetadataFieldID": 4,
            "ItemValue": "Data from the German chargepoint registry provided by Bundesnetzagentur.de under the CC-BY 4.0 license"
        }
    ],
    "DataQualityLevel": 3,
    "DateCreated": "2021-07-08T09:49:00Z",
    "SubmissionStatusTypeID": 100
}