{
    "IsRecentlyVerified": false,
    "ID": 17186,
    "UUID": "E0A8C41E-4EEC-47BB-A99F-BC94D42DB3A7",
    "DataProviderID": 22,
    "DataProvidersReference": "5075DC36E6FB5B2F19A38AC28D8A7FCA",
    "AddressInfo": {
        "ID": 17531,
        "Title": "中越三菱六日町店",
        "AddressLine1": "新潟県南魚沼市大杉新田上原995",
        "CountryID": 114,
        "Latitude": 37.10412057,
        "Longitude": 138.8950196,
        "ContactTelephone1": "025-776-3015",
        "DistanceUnit": 0
    },
    "Connections": [
        {
            "ID": 17427,
            "ConnectionTypeID": 2,
            "LevelID": 2,
            "Amps": 100,
            "Voltage": 480,
            "PowerKW": 48,
            "Quantity": 1
        }
    ],
    "DateLastStatusUpdate": "2013-06-29T08:55:00Z",
    "DataQualityLevel": 2,
    "DateCreated": "2013-06-29T08:55:00Z",
    "SubmissionStatusTypeID": 200
}