{
    "IsRecentlyVerified": false,
    "ID": 65882,
    "UUID": "E77D81C1-07FB-4677-A689-3F942C411937",
    "DataProviderID": 1,
    "OperatorID": 234,
    "UsageTypeID": 4,
    "AddressInfo": {
        "ID": 66228,
        "Title": "Hallen und Freibad Pregnitzaue",
        "AddressLine1": "Mittelbügweg",
        "Town": "Nürnberg",
        "StateOrProvince": "Landkreis Nürnberger Land",
        "Postcode": "90571",
        "CountryID": 87,
        "Latitude": 49.475165253048466,
        "Longitude": 11.204984316463435,
        "AccessComments": "Ladesäule auf dem Parkplatz neben dem Schwaiger Frei- und Hallenbad. 24/7 nutzbar mit Ladekarte E-Mobilität.",
        "DistanceUnit": 0
    },
    "Connections": [
        {
            "ID": 91066,
            "ConnectionTypeID": 25,
            "StatusTypeID": 50,
            "LevelID": 2,
            "Amps": 32,
            "Voltage": 400,
            "PowerKW": 22,
            "CurrentTypeID": 20,
            "Quantity": 2
        }
    ],
    "NumberOfPoints": 2,
    "StatusTypeID": 50,
    "DateLastStatusUpdate": "2016-05-04T07:34:00Z",
    "DataQualityLevel": 1,
    "DateCreated": "2016-05-04T07:34:00Z",
    "SubmissionStatusTypeID": 200
}