{
    "IsRecentlyVerified": false,
    "ID": 167936,
    "UUID": "5A1026B0-BBF7-4688-A648-B3BE389F2718",
    "DataProviderID": 18,
    "DataProvidersReference": "5742b33b0a8dce1730546467b4750305",
    "OperatorID": 3391,
    "UsageTypeID": 1,
    "AddressInfo": {
        "ID": 168295,
        "Title": "Montpelier Road",
        "AddressLine1": "Montpelier Road",
        "Town": "Brighton",
        "Postcode": "BN1 2LQ",
        "CountryID": 1,
        "Latitude": 50.823646,
        "Longitude": -0.153599,
        "AccessComments": "",
        "RelatedURL": "https://www.electricblueuk.com/",
        "DistanceUnit": 0
    },
    "Connections": [
        {
            "ID": 254964,
            "ConnectionTypeID": 25,
            "Reference": "62196-2 (SINGLE PHASE)",
            "StatusTypeID": 50,
            "LevelID": 2,
            "Amps": 16,
            "Voltage": 230,
            "PowerKW": 3.7,
            "CurrentTypeID": 10
        }
    ],
    "StatusTypeID": 0,
    "DateLastStatusUpdate": "2020-09-17T21:03:00Z",
    "MetadataValues": [
        {
            "ID": 7980,
            "MetadataFieldID": 4,
            "ItemValue": "Contains public sector information licensed under the Open Government Licence v2.0. http://www.nationalarchives.gov.uk/doc/open-government-licence/version/2/"
        }
    ],
    "DataQualityLevel": 3,
    "DateCreated": "2020-09-17T21:03:00Z",
    "SubmissionStatusTypeID": 100
}