{
    "IsRecentlyVerified": false,
    "ID": 17755,
    "UUID": "B7FB19BD-FA3E-48B3-A9BE-667CC3CEB2DD",
    "DataProviderID": 22,
    "DataProvidersReference": "65F675B3CF48B79D1D4FE970F1688C6B",
    "AddressInfo": {
        "ID": 18100,
        "Title": "日産レンタカー戸塚駅東口店",
        "AddressLine1": "神奈川県横浜市戸塚区上倉田町480",
        "CountryID": 114,
        "Latitude": 35.39896138,
        "Longitude": 139.5363282,
        "ContactTelephone1": "045-864-7023",
        "DistanceUnit": 0
    },
    "Connections": [
        {
            "ID": 17996,
            "ConnectionTypeID": 2,
            "LevelID": 2,
            "Amps": 100,
            "Voltage": 480,
            "PowerKW": 48,
            "Quantity": 1
        }
    ],
    "DateLastStatusUpdate": "2013-06-29T09:02:00Z",
    "DataQualityLevel": 2,
    "DateCreated": "2013-06-29T09:02:00Z",
    "SubmissionStatusTypeID": 200
}