{
    "IsRecentlyVerified": false,
    "ID": 158124,
    "UUID": "B39A1FFA-04B3-4BA5-83F4-878C66940E2F",
    "DataProviderID": 18,
    "DataProvidersReference": "60c1cedfd4af78670239984473424814",
    "OperatorID": 8,
    "UsageTypeID": 4,
    "AddressInfo": {
        "ID": 158478,
        "Title": "Devonshire Hall",
        "AddressLine1": "Devonshire Hall",
        "Town": "Leeds",
        "Postcode": "LS2 9JT",
        "CountryID": 1,
        "Latitude": 53.80838,
        "Longitude": -1.55883,
        "AccessComments": "",
        "RelatedURL": "https://www.bpchargemaster.com",
        "DistanceUnit": 0
    },
    "Connections": [
        {
            "ID": 228002,
            "ConnectionTypeID": 25,
            "Reference": "1",
            "StatusTypeID": 50,
            "LevelID": 2,
            "Amps": 32,
            "Voltage": 230,
            "PowerKW": 7,
            "CurrentTypeID": 10
        },
        {
            "ID": 228003,
            "ConnectionTypeID": 25,
            "Reference": "2",
            "StatusTypeID": 50,
            "LevelID": 2,
            "Amps": 32,
            "Voltage": 400,
            "PowerKW": 22,
            "CurrentTypeID": 20
        }
    ],
    "StatusTypeID": 0,
    "DateLastStatusUpdate": "2020-06-25T10:00:00Z",
    "MetadataValues": [
        {
            "ID": 7657,
            "MetadataFieldID": 4,
            "ItemValue": "Contains public sector information licensed under the Open Government Licence v2.0. http://www.nationalarchives.gov.uk/doc/open-government-licence/version/2/"
        }
    ],
    "DataQualityLevel": 3,
    "DateCreated": "2020-06-25T10:00:00Z",
    "SubmissionStatusTypeID": 100
}