{
    "IsRecentlyVerified": false,
    "ID": 152898,
    "UUID": "4BD3CCC0-E21D-47BC-91E3-752F324BDEBD",
    "DataProviderID": 28,
    "DataProvidersReference": "FR*S41*P41025-12",
    "UsageTypeID": 5,
    "AddressInfo": {
        "ID": 153251,
        "Title": "Bracieux | Rue de Candy",
        "AddressLine1": "Rue de Candy 41250 Bracieux",
        "CountryID": 80,
        "Latitude": 47.54913,
        "Longitude": 1.545043,
        "AccessComments": "24/24 7/7",
        "DistanceUnit": 0
    },
    "Connections": [
        {
            "ID": 214262,
            "ConnectionTypeID": 25,
            "StatusTypeID": 50,
            "LevelID": 2,
            "PowerKW": 18,
            "CurrentTypeID": 20
        },
        {
            "ID": 214263,
            "ConnectionTypeID": 28,
            "StatusTypeID": 50,
            "LevelID": 2,
            "PowerKW": 18,
            "CurrentTypeID": 10
        },
        {
            "ID": 247506,
            "ConnectionTypeID": 25,
            "StatusTypeID": 50,
            "LevelID": 2,
            "PowerKW": 18,
            "CurrentTypeID": 20
        },
        {
            "ID": 247507,
            "ConnectionTypeID": 28,
            "StatusTypeID": 50,
            "LevelID": 2,
            "PowerKW": 18,
            "CurrentTypeID": 10
        }
    ],
    "GeneralComments": "",
    "StatusTypeID": 50,
    "DateLastStatusUpdate": "2020-08-27T05:13:00Z",
    "DataQualityLevel": 2,
    "DateCreated": "2020-03-15T10:54:00Z",
    "SubmissionStatusTypeID": 100
}