{
    "IsRecentlyVerified": false,
    "ID": 14977,
    "UUID": "FC5F6EE8-20FD-4253-8998-84AA56D3E7DA",
    "DataProviderID": 1,
    "OperatorID": 22,
    "OperatorsReference": "C62TP",
    "UsageTypeID": 1,
    "AddressInfo": {
        "ID": 15323,
        "Title": "Mary Street Car Park",
        "AddressLine1": "Tralee",
        "Town": "Kerry",
        "StateOrProvince": "County Kerry",
        "CountryID": 3,
        "Latitude": 52.2681048461141,
        "Longitude": -9.70775212764739,
        "DistanceUnit": 0
    },
    "Connections": [
        {
            "ID": 13359,
            "ConnectionTypeID": 25,
            "StatusTypeID": 50,
            "LevelID": 2,
            "Amps": 32,
            "Voltage": 400,
            "PowerKW": 22,
            "CurrentTypeID": 20,
            "Quantity": 2
        }
    ],
    "NumberOfPoints": 2,
    "StatusTypeID": 50,
    "DateLastStatusUpdate": "2019-06-04T06:05:00Z",
    "DataQualityLevel": 2,
    "DateCreated": "2012-12-11T15:08:00Z",
    "SubmissionStatusTypeID": 100
}