{
    "IsRecentlyVerified": false,
    "ID": 153993,
    "UUID": "A19D6EB9-9DA8-452F-8414-BFA2325CB922",
    "DataProviderID": 28,
    "DataProvidersReference": "FR*S27*PDAMVILLE*MARKET",
    "UsageTypeID": 5,
    "AddressInfo": {
        "ID": 154346,
        "Title": "900007",
        "AddressLine1": "Carrefour Market Damville",
        "CountryID": 80,
        "Latitude": 48.86549,
        "Longitude": 1.070287,
        "AccessComments": "24/24 7/7 jours",
        "DistanceUnit": 0
    },
    "Connections": [
        {
            "ID": 216365,
            "ConnectionTypeID": 28,
            "StatusTypeID": 50,
            "LevelID": 2,
            "PowerKW": 22,
            "CurrentTypeID": 10
        },
        {
            "ID": 216366,
            "ConnectionTypeID": 26,
            "StatusTypeID": 50,
            "LevelID": 2,
            "PowerKW": 22
        },
        {
            "ID": 250513,
            "ConnectionTypeID": 28,
            "StatusTypeID": 50,
            "LevelID": 2,
            "PowerKW": 22,
            "CurrentTypeID": 10
        },
        {
            "ID": 250514,
            "ConnectionTypeID": 26,
            "StatusTypeID": 50,
            "LevelID": 2,
            "PowerKW": 22
        }
    ],
    "GeneralComments": "Borne en service",
    "StatusTypeID": 50,
    "DateLastStatusUpdate": "2020-08-27T05:15:00Z",
    "DataQualityLevel": 2,
    "DateCreated": "2020-03-15T10:54:00Z",
    "SubmissionStatusTypeID": 100
}