{
    "IsRecentlyVerified": false,
    "ID": 19994,
    "UUID": "77E3B99A-FA5A-41F9-B44C-8E9E3DC2D7F2",
    "DataProviderID": 1,
    "OperatorID": 3315,
    "OperatorsReference": "50550",
    "UsageTypeID": 4,
    "UsageCost": "Free",
    "AddressInfo": {
        "ID": 20339,
        "Title": "SCARF",
        "AddressLine1": "1 Cotton Street",
        "AddressLine2": "Torry",
        "Town": "Aberdeen",
        "Postcode": "AB11 5EE",
        "CountryID": 1,
        "Latitude": 57.149144,
        "Longitude": -2.08612,
        "RelatedURL": "http://chargeyourcar.org.uk/ev-driver/",
        "DistanceUnit": 0
    },
    "Connections": [
        {
            "ID": 19974,
            "ConnectionTypeID": 25,
            "StatusTypeID": 50,
            "LevelID": 2,
            "Amps": 32,
            "Voltage": 230,
            "PowerKW": 7,
            "CurrentTypeID": 10,
            "Quantity": 2
        }
    ],
    "NumberOfPoints": 2,
    "StatusTypeID": 50,
    "DateLastStatusUpdate": "2020-03-04T06:21:00Z",
    "DataQualityLevel": 3,
    "DateCreated": "2013-10-24T03:41:00Z",
    "SubmissionStatusTypeID": 200
}