{
    "IsRecentlyVerified": false,
    "ID": 91198,
    "UUID": "A157689F-EB9B-46FE-A1EC-CA6702930418",
    "DataProviderID": 1,
    "OperatorID": 23,
    "OperatorsReference": "32466",
    "UsageTypeID": 4,
    "AddressInfo": {
        "ID": 91544,
        "Title": "Stationnement Publique - Renaissance Marriott",
        "AddressLine1": "638 Cathcart",
        "Town": "Montreal",
        "StateOrProvince": "Quebec",
        "Postcode": "H3B 3A7",
        "CountryID": 44,
        "Latitude": 45.502982,
        "Longitude": -73.568725,
        "ContactTelephone1": "(514) 393-8700",
        "DistanceUnit": 0
    },
    "Connections": [
        {
            "ID": 129328,
            "ConnectionTypeID": 30,
            "StatusTypeID": 50,
            "LevelID": 2,
            "PowerKW": 14,
            "CurrentTypeID": 20,
            "Quantity": 21
        }
    ],
    "NumberOfPoints": 21,
    "GeneralComments": "21 Tesla Connectors, up to 14kW.Parking fees will apply. Please see valet.",
    "StatusTypeID": 50,
    "DateLastStatusUpdate": "2017-08-03T05:31:00Z",
    "DataQualityLevel": 1,
    "DateCreated": "2017-08-02T05:32:00Z",
    "SubmissionStatusTypeID": 200
}