{
    "IsRecentlyVerified": false,
    "ID": 84948,
    "UUID": "A0FDC057-E014-4733-AFC1-137B334FA0A2",
    "DataProviderID": 1,
    "OperatorID": 23,
    "OperatorsReference": "26057",
    "UsageTypeID": 6,
    "AddressInfo": {
        "ID": 85294,
        "Title": "Agriturismo Acetaia Sereni",
        "AddressLine1": "3651 Via Villabianca",
        "Town": "Marano sul Panaro",
        "Postcode": "41054",
        "CountryID": 112,
        "Latitude": 44.468336,
        "Longitude": 10.939675,
        "ContactTelephone1": "+39 059 705 105",
        "DistanceUnit": 0
    },
    "Connections": [
        {
            "ID": 120692,
            "ConnectionTypeID": 30,
            "StatusTypeID": 50,
            "LevelID": 2,
            "Amps": 32,
            "Voltage": 230,
            "PowerKW": 14,
            "CurrentTypeID": 20,
            "Quantity": 1
        }
    ],
    "NumberOfPoints": 1,
    "GeneralComments": "1 Tesla Connector, up to 14kW.Available for patrons only. Please call ahead.",
    "StatusTypeID": 50,
    "DateLastStatusUpdate": "2018-10-03T23:42:00Z",
    "DataQualityLevel": 1,
    "DateCreated": "2017-03-22T06:36:00Z",
    "SubmissionStatusTypeID": 200
}