{
    "IsRecentlyVerified": false,
    "ID": 28374,
    "UUID": "8F889B72-3065-4F62-968D-4421561176FD",
    "DataProviderID": 2,
    "DataProvidersReference": "60326",
    "OperatorID": 5,
    "UsageTypeID": 1,
    "AddressInfo": {
        "ID": 28720,
        "Title": "DANIELS BMW",
        "AddressLine1": "4600 Crackersport Rd",
        "Town": "Allentown",
        "StateOrProvince": "PA",
        "Postcode": "18104",
        "CountryID": 2,
        "Latitude": 40.5999325,
        "Longitude": -75.5626398,
        "ContactTelephone1": "888-758-4389",
        "AccessComments": "24 hours daily",
        "RelatedURL": "http://www.chargepoint.com/",
        "DistanceUnit": 0
    },
    "Connections": [
        {
            "ID": 31173,
            "ConnectionTypeID": 1,
            "LevelID": 2,
            "Amps": 16,
            "Voltage": 230,
            "PowerKW": 3.7,
            "CurrentTypeID": 10,
            "Quantity": 2
        }
    ],
    "DateLastStatusUpdate": "2020-06-26T03:03:00Z",
    "DataQualityLevel": 3,
    "DateCreated": "2014-11-28T03:38:00Z",
    "SubmissionStatusTypeID": 100
}