{
    "IsRecentlyVerified": false,
    "ID": 110331,
    "UUID": "DC5F9638-82F6-40CA-897A-1191BC78CB51",
    "DataProviderID": 2,
    "DataProvidersReference": "100496",
    "OperatorID": 5,
    "UsageTypeID": 1,
    "AddressInfo": {
        "ID": 110677,
        "Title": "HMB",
        "AddressLine1": "620 Correas St",
        "Town": "Half Moon Bay",
        "StateOrProvince": "CA",
        "Postcode": "94019",
        "CountryID": 2,
        "Latitude": 37.4615066,
        "Longitude": -122.431194,
        "ContactTelephone1": "888-758-4389",
        "AccessComments": "24 hours daily",
        "RelatedURL": "http://www.chargepoint.com/",
        "DistanceUnit": 0
    },
    "Connections": [
        {
            "ID": 155572,
            "ConnectionTypeID": 1,
            "LevelID": 2,
            "Amps": 16,
            "Voltage": 230,
            "PowerKW": 3,
            "CurrentTypeID": 10,
            "Quantity": 2
        }
    ],
    "DateLastStatusUpdate": "2019-04-06T04:02:00Z",
    "DataQualityLevel": 3,
    "DateCreated": "2018-10-18T23:36:00Z",
    "SubmissionStatusTypeID": 100
}