{
    "IsRecentlyVerified": false,
    "ID": 109073,
    "UUID": "694B6D3A-6C39-4469-B393-E1DA2C480C38",
    "DataProviderID": 1,
    "OperatorID": 23,
    "OperatorsReference": "44998",
    "UsageTypeID": 6,
    "AddressInfo": {
        "ID": 109419,
        "Title": "Hotel Randers",
        "AddressLine1": "Torvegade 11",
        "StateOrProvince": "Randers C",
        "Postcode": "8900",
        "CountryID": 65,
        "Latitude": 56.460056,
        "Longitude": 10.036619,
        "ContactTelephone1": " +45 86423422",
        "DistanceUnit": 0
    },
    "Connections": [
        {
            "ID": 154191,
            "ConnectionTypeID": 30,
            "StatusTypeID": 50,
            "LevelID": 2,
            "PowerKW": 6,
            "CurrentTypeID": 10,
            "Quantity": 2
        }
    ],
    "NumberOfPoints": 2,
    "GeneralComments": "2 Tesla Connectors, up to 6kW.Available for patrons only. Please see front desk.",
    "StatusTypeID": 50,
    "DateLastStatusUpdate": "2018-10-11T13:32:00Z",
    "DataQualityLevel": 1,
    "DateCreated": "2018-10-11T13:32:00Z",
    "SubmissionStatusTypeID": 200
}