{
    "IsRecentlyVerified": false,
    "ID": 187759,
    "UUID": "F27EE7D8-7D72-4317-8CE3-518FF8F8CD87",
    "DataProviderID": 18,
    "DataProvidersReference": "9ad35b0090051b23f9b2534472cc37a6",
    "OperatorID": 3,
    "UsageTypeID": 1,
    "AddressInfo": {
        "ID": 188118,
        "Title": "Hamton by Hilton - Park Royal, Western Avenue",
        "AddressLine1": "Hamton by Hilton - Park Royal, Western Avenue",
        "Town": "London",
        "Postcode": "W5 3BQ",
        "CountryID": 1,
        "Latitude": 51.52766,
        "Longitude": -0.286338,
        "AccessComments": "",
        "RelatedURL": "http://pod-point.com",
        "DistanceUnit": 0
    },
    "Connections": [
        {
            "ID": 303002,
            "ConnectionTypeID": 25,
            "Reference": "0",
            "StatusTypeID": 50,
            "LevelID": 2,
            "Amps": 32,
            "Voltage": 230,
            "PowerKW": 7,
            "CurrentTypeID": 10
        }
    ],
    "StatusTypeID": 0,
    "DateLastStatusUpdate": "2021-07-12T03:38:00Z",
    "MetadataValues": [
        {
            "ID": 19999,
            "MetadataFieldID": 4,
            "ItemValue": "Contains public sector information licensed under the Open Government Licence v2.0. http://www.nationalarchives.gov.uk/doc/open-government-licence/version/2/"
        }
    ],
    "DataQualityLevel": 3,
    "DateCreated": "2021-07-12T03:38:00Z",
    "SubmissionStatusTypeID": 100
}