{
    "IsRecentlyVerified": false,
    "ID": 91357,
    "UUID": "B65582B5-FD05-43F7-ABCC-DF152BB4D3B3",
    "DataProviderID": 2,
    "DataProvidersReference": "86117",
    "UsageTypeID": 2,
    "AddressInfo": {
        "ID": 91703,
        "Title": "Duke Energy",
        "AddressLine1": "3308 Highway 5",
        "Town": "Aberdeen",
        "StateOrProvince": "NC",
        "Postcode": "28315",
        "CountryID": 2,
        "Latitude": 35.137358,
        "Longitude": -79.437643,
        "ContactTelephone1": "",
        "AccessComments": "Employee and fleet vehicle use only",
        "RelatedURL": "",
        "DistanceUnit": 0
    },
    "Connections": [
        {
            "ID": 129509,
            "ConnectionTypeID": 1,
            "LevelID": 2,
            "Amps": 16,
            "Voltage": 230,
            "PowerKW": 3,
            "CurrentTypeID": 10,
            "Quantity": 2
        }
    ],
    "DateLastStatusUpdate": "2019-04-06T04:02:00Z",
    "DataQualityLevel": 3,
    "DateCreated": "2017-08-03T12:25:00Z",
    "SubmissionStatusTypeID": 100
}