{
    "IsRecentlyVerified": false,
    "ID": 51518,
    "UUID": "CB1EB43A-CB46-4E14-8C67-A939341D712C",
    "DataProviderID": 1,
    "OperatorID": 45,
    "UsageTypeID": 1,
    "AddressInfo": {
        "ID": 51864,
        "Title": "Stadtplatz",
        "AddressLine1": "Stadtplatz 10",
        "Town": "Hemau",
        "StateOrProvince": "Landkreis Regensburg",
        "Postcode": "93155",
        "CountryID": 87,
        "Latitude": 49.0514198,
        "Longitude": 11.7826081000001,
        "AccessComments": "Alles kostenlos und 24/7 nutzbar, 2 Plätze. Betreiber sind die Stadtwerke Hemau.",
        "DistanceUnit": 0
    },
    "Connections": [
        {
            "ID": 63837,
            "ConnectionTypeID": 25,
            "StatusTypeID": 50,
            "LevelID": 2,
            "Amps": 16,
            "Voltage": 400,
            "PowerKW": 11,
            "CurrentTypeID": 20,
            "Quantity": 1
        },
        {
            "ID": 63838,
            "ConnectionTypeID": 28,
            "StatusTypeID": 50,
            "LevelID": 2,
            "Amps": 16,
            "Voltage": 230,
            "PowerKW": 3.7,
            "CurrentTypeID": 10,
            "Quantity": 3
        }
    ],
    "NumberOfPoints": 2,
    "StatusTypeID": 50,
    "DateLastStatusUpdate": "2015-07-28T06:40:00Z",
    "DataQualityLevel": 1,
    "DateCreated": "2015-07-28T06:39:00Z",
    "SubmissionStatusTypeID": 200
}