{
    "IsRecentlyVerified": false,
    "ID": 32506,
    "UUID": "C556FBCF-CE68-4EDE-A8D0-D53366474BE2",
    "DataProviderID": 1,
    "OperatorID": 105,
    "OperatorsReference": "Essent EM-DE-14627140-01-00002",
    "UsageTypeID": 4,
    "AddressInfo": {
        "ID": 32852,
        "Title": "Niederauer Str. 44",
        "AddressLine1": "Niederauer Str. 44",
        "Town": "Meißen",
        "Postcode": "1662",
        "CountryID": 87,
        "Latitude": 51.167403,
        "Longitude": 13.500904,
        "DistanceUnit": 0
    },
    "Connections": [
        {
            "ID": 36017,
            "ConnectionTypeID": 25,
            "LevelID": 2,
            "PowerKW": 11
        },
        {
            "ID": 46406,
            "ConnectionTypeID": 25,
            "LevelID": 2,
            "PowerKW": 11
        }
    ],
    "NumberOfPoints": 1,
    "StatusTypeID": 50,
    "DateLastStatusUpdate": "2015-04-13T19:24:00Z",
    "DataQualityLevel": 3,
    "DateCreated": "2015-01-09T06:03:00Z",
    "SubmissionStatusTypeID": 200
}