{
    "IsRecentlyVerified": false,
    "ID": 142965,
    "UUID": "976623B4-AC77-473A-8EB2-3540C7A6CD15",
    "DataProviderID": 2,
    "DataProvidersReference": "95132",
    "OperatorID": 9,
    "UsageTypeID": 1,
    "AddressInfo": {
        "ID": 143317,
        "Title": "SEARS - Corporate Headquarters (Hoffman Estates)",
        "AddressLine1": "3333 Beverly Rd",
        "Town": "Hoffman Estates",
        "StateOrProvince": "IL",
        "Postcode": "60192",
        "CountryID": 2,
        "Latitude": 42.078494,
        "Longitude": -88.213429,
        "ContactTelephone1": "888-998-2546",
        "AccessComments": "MON: 24 hours | TUE: 24 hours | WED: 24 hours | THU: 24 hours | FRI: 24 hours | SAT: 24 hours | SUN: 24 hours",
        "RelatedURL": "http://www.blinkcharging.com/",
        "DistanceUnit": 0
    },
    "Connections": [
        {
            "ID": 199205,
            "ConnectionTypeID": 1,
            "LevelID": 2,
            "Amps": 16,
            "Voltage": 230,
            "PowerKW": 3.7,
            "CurrentTypeID": 10,
            "Quantity": 1
        }
    ],
    "StatusTypeID": 50,
    "DateLastStatusUpdate": "2020-06-26T03:05:00Z",
    "DataQualityLevel": 3,
    "DateCreated": "2019-12-24T09:19:00Z",
    "SubmissionStatusTypeID": 100
}