{
    "IsRecentlyVerified": false,
    "ID": 146172,
    "UUID": "64EB6E35-A96E-408F-B77E-2043C2C455F7",
    "DataProviderID": 1,
    "OperatorID": 3315,
    "OperatorsReference": "52125",
    "UsageTypeID": 4,
    "UsageCost": "Free",
    "AddressInfo": {
        "ID": 146524,
        "Title": "MRC, Meikelwood Road, Glasgow",
        "AddressLine1": "91 Meikelwood Road Complex",
        "Town": "Police Station",
        "StateOrProvince": "Glasgow",
        "Postcode": "G51 4DU",
        "CountryID": 1,
        "Latitude": 55.85379,
        "Longitude": -4.33733,
        "DistanceUnit": 0
    },
    "Connections": [
        {
            "ID": 203108,
            "ConnectionTypeID": 25,
            "StatusTypeID": 50,
            "LevelID": 2,
            "Amps": 32,
            "Voltage": 230,
            "PowerKW": 7,
            "CurrentTypeID": 10,
            "Quantity": 2
        }
    ],
    "NumberOfPoints": 2,
    "StatusTypeID": 50,
    "DateLastStatusUpdate": "2020-01-02T08:21:00Z",
    "DataQualityLevel": 1,
    "DateCreated": "2020-01-02T08:21:00Z",
    "SubmissionStatusTypeID": 200
}