{
    "IsRecentlyVerified": false,
    "ID": 91359,
    "UUID": "6452DA48-A121-4229-8C16-654F572A225D",
    "DataProviderID": 2,
    "DataProvidersReference": "86027",
    "UsageTypeID": 2,
    "AddressInfo": {
        "ID": 91705,
        "Title": "Albemarle Corp",
        "AddressLine1": "4350 Congress St",
        "Town": "Charlotte",
        "StateOrProvince": "NC",
        "Postcode": "28209",
        "CountryID": 2,
        "Latitude": 35.154231,
        "Longitude": -80.837508,
        "ContactTelephone1": "",
        "AccessComments": "Employee and guest use only",
        "RelatedURL": "",
        "DistanceUnit": 0
    },
    "Connections": [
        {
            "ID": 129511,
            "ConnectionTypeID": 1,
            "LevelID": 2,
            "Amps": 16,
            "Voltage": 230,
            "PowerKW": 3,
            "CurrentTypeID": 10,
            "Quantity": 2
        }
    ],
    "DateLastStatusUpdate": "2019-04-06T04:02:00Z",
    "DataQualityLevel": 3,
    "DateCreated": "2017-08-03T12:25:00Z",
    "SubmissionStatusTypeID": 100
}