{
    "IsRecentlyVerified": false,
    "ID": 17548,
    "UUID": "36B2EB32-0496-4DF3-AC4A-AB5900ABEA17",
    "DataProviderID": 22,
    "DataProvidersReference": "228A37C4A96D1CDC1659B9E2BF4B0000",
    "AddressInfo": {
        "ID": 17893,
        "Title": "新東名高速道路静岡ＳＡ（上り）",
        "AddressLine1": "静岡県静岡市葵区小瀬戸字谷川地1514",
        "CountryID": 114,
        "Latitude": 34.97851797,
        "Longitude": 138.292712,
        "ContactTelephone1": "0570-06-4551",
        "DistanceUnit": 0
    },
    "Connections": [
        {
            "ID": 17789,
            "ConnectionTypeID": 2,
            "LevelID": 2,
            "Amps": 100,
            "Voltage": 480,
            "PowerKW": 48,
            "Quantity": 1
        }
    ],
    "DateLastStatusUpdate": "2013-06-29T08:59:00Z",
    "DataQualityLevel": 2,
    "DateCreated": "2013-06-29T08:59:00Z",
    "SubmissionStatusTypeID": 200
}