{
    "IsRecentlyVerified": false,
    "ID": 116266,
    "UUID": "90BA23FE-F6BF-419D-8E80-3E4C463A779E",
    "DataProviderID": 1,
    "DataProvidersReference": "5345",
    "AddressInfo": {
        "ID": 116612,
        "Title": "Preem Landskrona",
        "AddressLine1": "Örjaleden ",
        "Town": "LANDSKRONA",
        "StateOrProvince": "SKÅNE",
        "Postcode": "26151",
        "CountryID": 216,
        "Latitude": 55.875421,
        "Longitude": 12.8859,
        "AccessComments": "",
        "DistanceUnit": 0
    },
    "Connections": [
        {
            "ID": 163469,
            "ConnectionTypeID": 0,
            "Reference": "1",
            "LevelID": 2,
            "Amps": 100,
            "Voltage": 500,
            "PowerKW": 50,
            "Comments": "Mode 4"
        },
        {
            "ID": 163470,
            "ConnectionTypeID": 0,
            "Reference": "2",
            "LevelID": 2,
            "Amps": 100,
            "Voltage": 500,
            "PowerKW": 50,
            "Comments": "Mode 4"
        },
        {
            "ID": 163471,
            "ConnectionTypeID": 0,
            "Reference": "3",
            "LevelID": 2,
            "Amps": 32,
            "Voltage": 400,
            "PowerKW": 22,
            "Comments": "Mode 3"
        }
    ],
    "NumberOfPoints": 3,
    "DateLastStatusUpdate": "2020-05-26T08:21:00Z",
    "DataQualityLevel": 2,
    "DateCreated": "2019-02-11T09:16:00Z",
    "SubmissionStatusTypeID": 100
}