{
    "IsRecentlyVerified": false,
    "ID": 35130,
    "UUID": "67686CAB-8DE1-4097-92F8-0674E86BA31F",
    "DataProviderID": 26,
    "DataProvidersReference": "47174",
    "OperatorID": 178,
    "OperatorsReference": "EVnetNL AL324",
    "UsageCost": "0.00 jaarabonnement",
    "AddressInfo": {
        "ID": 35476,
        "Title": "Dijkweg 64",
        "AddressLine1": "Dijkweg 64",
        "Town": "Westland",
        "Postcode": "2675 AE",
        "CountryID": 159,
        "Latitude": 52.001475,
        "Longitude": 4.219705,
        "ContactTelephone1": "0800-3522365",
        "RelatedURL": "http://www.evnet.nl",
        "DistanceUnit": 0
    },
    "Connections": [
        {
            "ID": 38641,
            "ConnectionTypeID": 25,
            "LevelID": 2,
            "PowerKW": 11,
            "CurrentTypeID": 10
        }
    ],
    "NumberOfPoints": 2,
    "StatusTypeID": 50,
    "DateLastStatusUpdate": "2016-06-04T02:43:00Z",
    "DataQualityLevel": 3,
    "DateCreated": "2015-01-09T06:04:00Z",
    "SubmissionStatusTypeID": 100
}