{
    "IsRecentlyVerified": false,
    "ID": 139070,
    "UUID": "FAA80C67-8DF2-48C4-B560-9BB1FFC6417E",
    "DataProviderID": 2,
    "DataProvidersReference": "92221",
    "OperatorID": 5,
    "UsageTypeID": 1,
    "AddressInfo": {
        "ID": 139422,
        "Title": "AAA NCNU",
        "AddressLine1": "1050 E Camelback Rd AAA",
        "Town": "Phoenix",
        "StateOrProvince": "AZ",
        "Postcode": "85014",
        "CountryID": 2,
        "Latitude": 33.5093609,
        "Longitude": -112.0585089,
        "ContactTelephone1": "888-758-4389",
        "AccessComments": "24 hours daily",
        "RelatedURL": "http://www.chargepoint.com/",
        "DistanceUnit": 0
    },
    "Connections": [
        {
            "ID": 194321,
            "ConnectionTypeID": 1,
            "LevelID": 2,
            "Amps": 16,
            "Voltage": 230,
            "PowerKW": 3.7,
            "CurrentTypeID": 10,
            "Quantity": 2
        }
    ],
    "StatusTypeID": 50,
    "DateLastStatusUpdate": "2020-06-26T02:55:00Z",
    "DataQualityLevel": 3,
    "DateCreated": "2019-12-24T09:10:00Z",
    "SubmissionStatusTypeID": 100
}