{
    "IsRecentlyVerified": false,
    "ID": 172380,
    "UUID": "C901CC96-9189-470F-9607-D5F9616C1C56",
    "DataProviderID": 1,
    "OperatorID": 3,
    "UsageTypeID": 4,
    "AddressInfo": {
        "ID": 172739,
        "Title": "Aldi Supermarket, Swallownest",
        "AddressLine1": "81 81 Park Hill",
        "AddressLine2": "Swallownest",
        "Town": "Sheffield",
        "StateOrProvince": "England",
        "Postcode": "S26 4UN",
        "CountryID": 1,
        "Latitude": 53.362020585112276,
        "Longitude": -1.3282597152579,
        "DistanceUnit": 0
    },
    "Connections": [
        {
            "ID": 263560,
            "ConnectionTypeID": 25,
            "StatusTypeID": 50,
            "LevelID": 2,
            "Amps": 32,
            "Voltage": 230,
            "PowerKW": 7,
            "CurrentTypeID": 10,
            "Quantity": 2
        },
        {
            "ID": 263561,
            "ConnectionTypeID": 25,
            "StatusTypeID": 50,
            "LevelID": 2,
            "PowerKW": 7,
            "CurrentTypeID": 10,
            "Quantity": 2
        }
    ],
    "NumberOfPoints": 1,
    "StatusTypeID": 50,
    "DateLastStatusUpdate": "2021-01-31T14:39:00Z",
    "DataQualityLevel": 1,
    "DateCreated": "2021-01-31T14:39:00Z",
    "SubmissionStatusTypeID": 200
}