{
    "IsRecentlyVerified": false,
    "ID": 36131,
    "UUID": "CBDD74C3-07A4-4D05-8A50-5345542D0F21",
    "DataProviderID": 26,
    "DataProvidersReference": "50735",
    "OperatorID": 180,
    "OperatorsReference": "Alfen GDH1362",
    "UsageCost": "0.00 jaarabonnement",
    "AddressInfo": {
        "ID": 36477,
        "Title": "De Bruynestraat 63",
        "AddressLine1": "De Bruynestraat 63",
        "Town": "Den Haag",
        "Postcode": "2597 RE",
        "CountryID": 159,
        "Latitude": 52.10069,
        "Longitude": 4.314202,
        "ContactTelephone1": "036 - 549 34 00",
        "RelatedURL": "http://www.icu-charging-stations.com/",
        "DistanceUnit": 0
    },
    "Connections": [
        {
            "ID": 39642,
            "ConnectionTypeID": 25,
            "LevelID": 2,
            "PowerKW": 11,
            "CurrentTypeID": 10
        },
        {
            "ID": 48247,
            "ConnectionTypeID": 25,
            "LevelID": 2,
            "PowerKW": 11,
            "CurrentTypeID": 10
        }
    ],
    "NumberOfPoints": 1,
    "StatusTypeID": 50,
    "DateLastStatusUpdate": "2016-06-04T02:50:00Z",
    "DataQualityLevel": 3,
    "DateCreated": "2015-01-09T06:05:00Z",
    "SubmissionStatusTypeID": 100
}