{
    "IsRecentlyVerified": false,
    "ID": 53260,
    "UUID": "F370BB48-698A-4A9B-A05C-9F2A1E763CDA",
    "DataProviderID": 1,
    "OperatorID": 23,
    "OperatorsReference": "10319",
    "UsageTypeID": 1,
    "UsageCost": "$0.20/min >=60kW; $0.10/min <60kW; other tariffs for older cars",
    "AddressInfo": {
        "ID": 53606,
        "Title": "Outlet Shoppes at Oklahoma City - Tesla",
        "AddressLine1": "7624 W Reno Ave",
        "Town": "Oklahoma City",
        "StateOrProvince": "OK",
        "Postcode": "73127",
        "CountryID": 2,
        "Latitude": 35.4614411,
        "Longitude": -97.6502659,
        "ContactTelephone1": "877-798-3752",
        "AccessComments": "24 hours daily; for Tesla use only",
        "RelatedURL": "http://www.teslamotors.com/supercharger",
        "DistanceUnit": 0
    },
    "Connections": [
        {
            "ID": 66360,
            "ConnectionTypeID": 27,
            "StatusTypeID": 50,
            "LevelID": 3,
            "Amps": 100,
            "Voltage": 400,
            "PowerKW": 120,
            "CurrentTypeID": 30,
            "Quantity": 8
        }
    ],
    "NumberOfPoints": 8,
    "StatusTypeID": 50,
    "DateLastStatusUpdate": "2018-03-13T13:30:00Z",
    "DataQualityLevel": 3,
    "DateCreated": "2015-09-20T11:18:00Z",
    "SubmissionStatusTypeID": 100
}