{
    "IsRecentlyVerified": false,
    "ID": 63487,
    "UUID": "E318A9DD-D144-4904-B816-41B151FC728C",
    "DataProviderID": 26,
    "DataProvidersReference": "75844",
    "OperatorID": 180,
    "OperatorsReference": "Alfen GDH4062",
    "UsageCost": "0.00 jaarabonnement",
    "AddressInfo": {
        "ID": 63833,
        "Title": "B. Thoenplantsoen 32",
        "AddressLine1": "B. Thoenplantsoen 32",
        "Town": "Den Haag",
        "Postcode": "2552 JK",
        "CountryID": 159,
        "Latitude": 52.049088,
        "Longitude": 4.242121,
        "ContactTelephone1": "036 - 549 34 00",
        "RelatedURL": "http://www.icu-charging-stations.com/",
        "DistanceUnit": 0
    },
    "Connections": [
        {
            "ID": 80982,
            "ConnectionTypeID": 25,
            "LevelID": 2,
            "PowerKW": 11,
            "CurrentTypeID": 10
        },
        {
            "ID": 80983,
            "ConnectionTypeID": 25,
            "LevelID": 2,
            "PowerKW": 11,
            "CurrentTypeID": 10
        }
    ],
    "NumberOfPoints": 1,
    "StatusTypeID": 50,
    "DateLastStatusUpdate": "2016-06-04T02:44:00Z",
    "DataQualityLevel": 3,
    "DateCreated": "2016-03-03T12:30:00Z",
    "SubmissionStatusTypeID": 100
}