{
    "IsRecentlyVerified": false,
    "ID": 136563,
    "UUID": "01F1FD50-D7FA-4E2A-864A-A527B9B7C9E1",
    "DataProviderID": 1,
    "OperatorID": 3345,
    "UsageTypeID": 5,
    "AddressInfo": {
        "ID": 136909,
        "Title": "13 Redbridge Lane West",
        "AddressLine1": "13 Redbridge Lane West",
        "Town": "Wanstead",
        "Postcode": "E11 2JU",
        "CountryID": 1,
        "Latitude": 51.57407,
        "Longitude": 0.031407,
        "AccessComments": "",
        "RelatedURL": "https://char.gy",
        "DistanceUnit": 0
    },
    "Connections": [
        {
            "ID": 191017,
            "ConnectionTypeID": 25,
            "Reference": "00106",
            "StatusTypeID": 50,
            "LevelID": 2,
            "Amps": 16,
            "Voltage": 230,
            "PowerKW": 3.7,
            "CurrentTypeID": 10,
            "Quantity": 1
        }
    ],
    "StatusTypeID": 50,
    "DateLastStatusUpdate": "2020-10-11T23:22:00Z",
    "MetadataValues": [
        {
            "ID": 6415,
            "MetadataFieldID": 4,
            "ItemValue": "Contains public sector information licensed under the Open Government Licence v2.0. http://www.nationalarchives.gov.uk/doc/open-government-licence/version/2/"
        }
    ],
    "DataQualityLevel": 3,
    "DateCreated": "2019-12-24T05:22:00Z",
    "SubmissionStatusTypeID": 100
}