{
    "IsRecentlyVerified": false,
    "ID": 143210,
    "UUID": "A994E1D1-4B07-4D9C-9372-AB78AAAEED4D",
    "DataProviderID": 2,
    "DataProvidersReference": "123146",
    "OperatorID": 3372,
    "UsageTypeID": 1,
    "AddressInfo": {
        "ID": 143562,
        "Title": "The Gunlocke Co",
        "AddressLine1": "1 Gunloccke Dr",
        "Town": "Wayland",
        "StateOrProvince": "NY",
        "Postcode": "14572",
        "CountryID": 2,
        "Latitude": 42.5553841,
        "Longitude": -77.5891292,
        "ContactTelephone1": "866-816-7584",
        "AccessComments": "24 hours daily",
        "RelatedURL": "http://evconnect.com/",
        "DistanceUnit": 0
    },
    "Connections": [
        {
            "ID": 199497,
            "ConnectionTypeID": 1,
            "LevelID": 2,
            "Amps": 16,
            "Voltage": 230,
            "PowerKW": 3.7,
            "CurrentTypeID": 10,
            "Quantity": 2
        }
    ],
    "StatusTypeID": 50,
    "DateLastStatusUpdate": "2020-06-26T03:06:00Z",
    "DataQualityLevel": 3,
    "DateCreated": "2019-12-24T09:20:00Z",
    "SubmissionStatusTypeID": 100
}