{
    "IsRecentlyVerified": false,
    "ID": 50945,
    "UUID": "48D415B2-03AC-4D33-9F60-9DA61CB37DBB",
    "DataProviderID": 26,
    "DataProvidersReference": "66504",
    "OperatorID": 103,
    "OperatorsReference": "Allego NLALLEGO0000841",
    "UsageCost": "0.00 jaarabonnement",
    "AddressInfo": {
        "ID": 51291,
        "Title": "Wilhelminabrug",
        "AddressLine1": "Wilhelminabrug",
        "Town": "Deventer",
        "Postcode": "7411 BM",
        "CountryID": 159,
        "Latitude": 52.249994,
        "Longitude": 6.159454,
        "ContactTelephone1": "0800-3745337",
        "RelatedURL": "http://www.allego.eu/",
        "DistanceUnit": 0
    },
    "Connections": [
        {
            "ID": 62940,
            "ConnectionTypeID": 25,
            "LevelID": 2,
            "PowerKW": 22,
            "CurrentTypeID": 10
        },
        {
            "ID": 62941,
            "ConnectionTypeID": 25,
            "LevelID": 2,
            "PowerKW": 22,
            "CurrentTypeID": 10
        }
    ],
    "NumberOfPoints": 1,
    "StatusTypeID": 50,
    "DateLastStatusUpdate": "2016-06-04T02:52:00Z",
    "DataQualityLevel": 3,
    "DateCreated": "2015-07-22T09:54:00Z",
    "SubmissionStatusTypeID": 100
}