{
    "IsRecentlyVerified": false,
    "ID": 89646,
    "UUID": "BF4533BB-FEAF-4F17-BA94-128601780A3B",
    "DataProviderID": 2,
    "DataProvidersReference": "82473",
    "UsageTypeID": 1,
    "AddressInfo": {
        "ID": 89992,
        "Title": "Maggi Mitsubishi",
        "AddressLine1": "273 Benner Pike",
        "Town": "State College",
        "StateOrProvince": "PA",
        "Postcode": "16801",
        "CountryID": 2,
        "Latitude": 40.829495,
        "Longitude": -77.805689,
        "ContactTelephone1": "814-237-8895",
        "AccessComments": "24 hours daily",
        "RelatedURL": "",
        "DistanceUnit": 0
    },
    "Connections": [
        {
            "ID": 127067,
            "ConnectionTypeID": 1,
            "LevelID": 2,
            "Amps": 16,
            "Voltage": 230,
            "PowerKW": 3.7,
            "CurrentTypeID": 10,
            "Quantity": 1
        }
    ],
    "DateLastStatusUpdate": "2020-06-26T03:03:00Z",
    "DataQualityLevel": 3,
    "DateCreated": "2017-06-22T08:16:00Z",
    "SubmissionStatusTypeID": 100
}