{
    "IsRecentlyVerified": false,
    "ID": 102445,
    "UUID": "046F0C7B-200D-419D-8917-60DBD9810F9D",
    "DataProviderID": 2,
    "DataProvidersReference": "95005",
    "UsageTypeID": 1,
    "AddressInfo": {
        "ID": 102791,
        "Title": "Los Angeles Metro - Norwalk Station",
        "AddressLine1": "12650 Imperial Hwy",
        "Town": "Norwalk",
        "StateOrProvince": "CA",
        "Postcode": "90650",
        "CountryID": 2,
        "Latitude": 33.916209,
        "Longitude": -118.061262,
        "ContactTelephone1": "213-922-4638",
        "AccessComments": "24 hours daily; pay lot; must have EV Connect account to access, see www.metro.net/projects/ev/ for more information",
        "RelatedURL": "http://evconnect.com/",
        "DistanceUnit": 0
    },
    "Connections": [
        {
            "ID": 144524,
            "ConnectionTypeID": 1,
            "LevelID": 2,
            "Amps": 16,
            "Voltage": 230,
            "PowerKW": 3,
            "CurrentTypeID": 10,
            "Quantity": 4
        }
    ],
    "DateLastStatusUpdate": "2019-04-06T04:01:00Z",
    "DataQualityLevel": 3,
    "DateCreated": "2018-04-21T04:13:00Z",
    "SubmissionStatusTypeID": 100
}