{
    "IsRecentlyVerified": false,
    "ID": 176765,
    "UUID": "7ABA9388-EBC2-43FF-9F17-37E03596EF75",
    "DataProviderID": 29,
    "DataProvidersReference": "13766",
    "AddressInfo": {
        "ID": 177124,
        "Title": "Harthauserstraße 16",
        "AddressLine1": "Harthauserstraße 16",
        "Town": "Bad Aibling",
        "Postcode": "83043",
        "CountryID": 87,
        "Latitude": 47.865926,
        "Longitude": 12.015712,
        "DistanceUnit": 0
    },
    "Connections": [
        {
            "ID": 275054,
            "ConnectionTypeID": 25,
            "StatusTypeID": 50,
            "LevelID": 2,
            "PowerKW": 22,
            "CurrentTypeID": 20
        },
        {
            "ID": 275055,
            "ConnectionTypeID": 25,
            "StatusTypeID": 50,
            "LevelID": 2,
            "PowerKW": 22,
            "CurrentTypeID": 20
        }
    ],
    "StatusTypeID": 0,
    "DateLastStatusUpdate": "2021-07-09T03:10:00Z",
    "MetadataValues": [
        {
            "ID": 9060,
            "MetadataFieldID": 4,
            "ItemValue": "Data from the German chargepoint registry provided by Bundesnetzagentur.de under the CC-BY 4.0 license"
        }
    ],
    "DataQualityLevel": 3,
    "DateCreated": "2021-07-08T09:48:00Z",
    "SubmissionStatusTypeID": 100
}