{
    "IsRecentlyVerified": false,
    "ID": 66870,
    "UUID": "D7AC392A-E9F9-4497-8AE4-42A55E5D3827",
    "DataProviderID": 1,
    "OperatorID": 23,
    "OperatorsReference": "17183",
    "UsageTypeID": 1,
    "UsageCost": "Free",
    "AddressInfo": {
        "ID": 67216,
        "Title": "Home2 Suites - Tesla",
        "AddressLine1": "210 S Magnolia Dr",
        "Town": "Tallahassee",
        "StateOrProvince": "FL",
        "Postcode": "32301",
        "CountryID": 2,
        "Latitude": 30.4404058,
        "Longitude": -84.2618724,
        "ContactTelephone1": "850-402-8900  877-798-3752",
        "AccessComments": "24 hours daily; for Tesla use only",
        "RelatedURL": "http://www.teslamotors.com/supercharger",
        "DistanceUnit": 0
    },
    "Connections": [
        {
            "ID": 92358,
            "ConnectionTypeID": 30,
            "StatusTypeID": 50,
            "LevelID": 2,
            "Amps": 16,
            "Voltage": 230,
            "PowerKW": 8,
            "CurrentTypeID": 10,
            "Quantity": 2
        }
    ],
    "NumberOfPoints": 2,
    "StatusTypeID": 50,
    "DateLastStatusUpdate": "2017-01-31T19:19:00Z",
    "DataQualityLevel": 3,
    "DateCreated": "2016-05-29T02:04:00Z",
    "SubmissionStatusTypeID": 100
}