{
    "IsRecentlyVerified": false,
    "ID": 2588,
    "UUID": "A77CA6BC-2DBA-4F0D-823A-726C8C099811",
    "DataProviderID": 2,
    "DataProvidersReference": "21557",
    "OperatorID": 5,
    "UsageTypeID": 1,
    "AddressInfo": {
        "ID": 2589,
        "Title": "CITY OF SB EV2",
        "AddressLine1": "1115 Anacapa St",
        "Town": "Santa Barbara",
        "StateOrProvince": "CA",
        "Postcode": "93101",
        "CountryID": 2,
        "Latitude": 34.423495,
        "Longitude": -119.70228,
        "ContactTelephone1": "888-758-4389",
        "AccessComments": "24 hours daily",
        "RelatedURL": "http://www.chargepoint.com/",
        "DistanceUnit": 0
    },
    "Connections": [
        {
            "ID": 12355,
            "ConnectionTypeID": 9,
            "LevelID": 1,
            "Amps": 16,
            "Voltage": 120,
            "PowerKW": 1,
            "CurrentTypeID": 10,
            "Quantity": 2
        },
        {
            "ID": 12356,
            "ConnectionTypeID": 1,
            "LevelID": 2,
            "Amps": 16,
            "Voltage": 230,
            "PowerKW": 3,
            "CurrentTypeID": 10,
            "Quantity": 2
        },
        {
            "ID": 20176,
            "ConnectionTypeID": 1,
            "LevelID": 2,
            "Quantity": 2
        }
    ],
    "DateLastConfirmed": "2010-08-31T00:00:00Z",
    "StatusTypeID": 0,
    "DateLastStatusUpdate": "2019-12-24T09:12:00Z",
    "DataQualityLevel": 1,
    "DateCreated": "2010-08-31T00:00:00Z",
    "SubmissionStatusTypeID": 100
}