{
    "IsRecentlyVerified": false,
    "ID": 45941,
    "UUID": "C0E44187-99CF-44C6-A0B2-2A1935C961A7",
    "DataProviderID": 1,
    "DataProvidersReference": "2134",
    "AddressInfo": {
        "ID": 46287,
        "Title": "Solursgaraget",
        "AddressLine1": "Ångemannagatan 138",
        "Town": "VÄLLINGBY",
        "StateOrProvince": "STOCKHOLM",
        "Postcode": "16265",
        "CountryID": 216,
        "Latitude": 59.36294,
        "Longitude": 17.87529,
        "AccessComments": "Längst ned i garaget, plan -2G.",
        "DistanceUnit": 0
    },
    "Connections": [
        {
            "ID": 56604,
            "ConnectionTypeID": 0,
            "Reference": "1",
            "LevelID": 2,
            "Amps": 16,
            "Voltage": 230,
            "PowerKW": 3.7,
            "Comments": "Mode 3"
        },
        {
            "ID": 84714,
            "ConnectionTypeID": 0,
            "Reference": "2",
            "LevelID": 2,
            "Amps": 16,
            "Voltage": 230,
            "PowerKW": 3.7,
            "Comments": "Mode 3"
        },
        {
            "ID": 84715,
            "ConnectionTypeID": 0,
            "Reference": "3",
            "LevelID": 2,
            "Amps": 16,
            "Voltage": 230,
            "PowerKW": 3.7,
            "Comments": "Mode 3"
        },
        {
            "ID": 88247,
            "ConnectionTypeID": 0,
            "Reference": "4",
            "LevelID": 2,
            "Amps": 16,
            "Voltage": 230,
            "PowerKW": 3.7,
            "Comments": "Mode 3"
        }
    ],
    "NumberOfPoints": 4,
    "DateLastStatusUpdate": "2020-05-26T08:22:00Z",
    "DataQualityLevel": 2,
    "DateCreated": "2015-05-03T00:54:00Z",
    "SubmissionStatusTypeID": 100
}