{
    "IsRecentlyVerified": false,
    "ID": 187529,
    "UUID": "05EF6880-31D0-493B-A18B-24BAEAA07526",
    "DataProviderID": 18,
    "DataProvidersReference": "8f1fd091cc48ed9cbc666ea885f31a93",
    "OperatorID": 3,
    "UsageTypeID": 1,
    "AddressInfo": {
        "ID": 187888,
        "Title": "Starcross",
        "AddressLine1": "Starcross",
        "Town": "Exeter",
        "Postcode": "EX6 8RP",
        "CountryID": 1,
        "Latitude": 50.611273,
        "Longitude": -3.457703,
        "AccessComments": "",
        "RelatedURL": "http://pod-point.com",
        "DistanceUnit": 0
    },
    "Connections": [
        {
            "ID": 302672,
            "ConnectionTypeID": 25,
            "Reference": "0",
            "StatusTypeID": 50,
            "LevelID": 2,
            "Amps": 32,
            "Voltage": 230,
            "PowerKW": 7,
            "CurrentTypeID": 10
        },
        {
            "ID": 302673,
            "ConnectionTypeID": 25,
            "Reference": "1",
            "StatusTypeID": 50,
            "LevelID": 2,
            "Amps": 32,
            "Voltage": 230,
            "PowerKW": 7,
            "CurrentTypeID": 10
        }
    ],
    "StatusTypeID": 0,
    "DateLastStatusUpdate": "2021-07-12T03:38:00Z",
    "MetadataValues": [
        {
            "ID": 19769,
            "MetadataFieldID": 4,
            "ItemValue": "Contains public sector information licensed under the Open Government Licence v2.0. http://www.nationalarchives.gov.uk/doc/open-government-licence/version/2/"
        }
    ],
    "DataQualityLevel": 3,
    "DateCreated": "2021-07-12T03:38:00Z",
    "SubmissionStatusTypeID": 100
}