{
    "IsRecentlyVerified": false,
    "ID": 46286,
    "UUID": "4CEF528D-FED4-4A4C-9DE2-97EB65A0AE6B",
    "DataProviderID": 1,
    "DataProvidersReference": "1538",
    "AddressInfo": {
        "ID": 46632,
        "Title": "Marikollhallen, Rælingen",
        "AddressLine1": "Marikollhallen ",
        "Town": "FJERDINGBY",
        "StateOrProvince": "Viken",
        "Postcode": "2008",
        "CountryID": 168,
        "Latitude": 59.92417,
        "Longitude": 11.06291,
        "AccessComments": "Litt usikker plassering.",
        "DistanceUnit": 0
    },
    "Connections": [
        {
            "ID": 56949,
            "ConnectionTypeID": 0,
            "Reference": "1",
            "LevelID": 2,
            "Amps": 16,
            "Voltage": 230,
            "PowerKW": 3.7,
            "Comments": "Mode 1"
        },
        {
            "ID": 88678,
            "ConnectionTypeID": 0,
            "Reference": "2",
            "LevelID": 2,
            "Amps": 16,
            "Voltage": 230,
            "PowerKW": 3.7,
            "Comments": "Mode 1"
        }
    ],
    "NumberOfPoints": 2,
    "DateLastStatusUpdate": "2020-05-26T08:23:00Z",
    "DataQualityLevel": 2,
    "DateCreated": "2015-05-03T00:54:00Z",
    "SubmissionStatusTypeID": 100
}