{
    "MediaItems": [
        {
            "ID": 18209,
            "ChargePointID": 125845,
            "ItemURL": "https://s3-ap-southeast-2.amazonaws.com/openchargemap/images/IS/OCM125845/OCM-125845.orig.2019043018180943.png",
            "ItemThumbnailURL": "https://s3-ap-southeast-2.amazonaws.com/openchargemap/images/IS/OCM125845/OCM-125845.thmb.2019043018180943.png",
            "Comment": "OV Reykjanes",
            "IsEnabled": true,
            "IsVideo": false,
            "IsFeaturedItem": false,
            "IsExternalResource": false,
            "User": {
                "ID": 20714,
                "Username": "Guuuddd"
            },
            "DateCreated": "2019-04-30T18:18:00Z"
        }
    ],
    "IsRecentlyVerified": false,
    "ID": 125845,
    "UUID": "DBF282F7-B07C-4B67-825C-6ECD5392D84F",
    "DataProviderID": 1,
    "OperatorID": 1,
    "UsageTypeID": 1,
    "AddressInfo": {
        "ID": 126191,
        "Title": "OV Reykjanes",
        "AddressLine1": "634",
        "Town": "Súðavíkurhreppur",
        "CountryID": 105,
        "Latitude": 65.9257108957447,
        "Longitude": -22.4317620610746,
        "AccessComments": "Hleðslustöð OV í Reykjanesi í Ísafjarðardjúpi.\r\n22 kW\r\nType 2",
        "DistanceUnit": 0
    },
    "Connections": [
        {
            "ID": 176361,
            "ConnectionTypeID": 25,
            "StatusTypeID": 50,
            "LevelID": 2,
            "PowerKW": 22,
            "CurrentTypeID": 20,
            "Quantity": 1
        }
    ],
    "NumberOfPoints": 1,
    "StatusTypeID": 50,
    "DateLastStatusUpdate": "2019-05-01T06:00:00Z",
    "DataQualityLevel": 1,
    "DateCreated": "2019-04-30T17:37:00Z",
    "SubmissionStatusTypeID": 200
}