{
    "IsRecentlyVerified": false,
    "ID": 84122,
    "UUID": "A5AF48AA-B71E-49ED-A786-930CC089EB0F",
    "DataProviderID": 1,
    "OperatorID": 23,
    "OperatorsReference": "24741",
    "UsageTypeID": 6,
    "AddressInfo": {
        "ID": 84468,
        "Title": "Hotel Nordic",
        "AddressLine1": "S/N Carrer de Tomas",
        "Town": "El Tarter",
        "Postcode": "AD100",
        "CountryID": 10,
        "Latitude": 42.577795,
        "Longitude": 1.650187,
        "ContactTelephone1": "+37 673 95 00",
        "DistanceUnit": 0
    },
    "Connections": [
        {
            "ID": 119523,
            "ConnectionTypeID": 30,
            "StatusTypeID": 50,
            "LevelID": 2,
            "Amps": 16,
            "Voltage": 400,
            "PowerKW": 11,
            "CurrentTypeID": 20,
            "Quantity": 1
        }
    ],
    "NumberOfPoints": 1,
    "GeneralComments": "1 Tesla Connector, up to 11kW.Available for patrons only. Self park.",
    "StatusTypeID": 50,
    "DateLastStatusUpdate": "2018-10-04T00:06:00Z",
    "DataQualityLevel": 1,
    "DateCreated": "2017-02-16T16:51:00Z",
    "SubmissionStatusTypeID": 200
}