{
    "IsRecentlyVerified": false,
    "ID": 94784,
    "UUID": "3E2B56CF-5318-420C-925B-3E5CDD7C9C92",
    "DataProviderID": 1,
    "OperatorID": 3,
    "OperatorsReference": "PG-91735",
    "UsageTypeID": 6,
    "UsageCost": "Free",
    "AddressInfo": {
        "ID": 95130,
        "Title": "Beech’s Fine Chocolates",
        "AddressLine1": "Fletcher Road",
        "Town": "Preston",
        "Postcode": "PR1 5AD",
        "CountryID": 1,
        "Latitude": 53.764942,
        "Longitude": -2.687999,
        "DistanceUnit": 0
    },
    "Connections": [
        {
            "ID": 133980,
            "ConnectionTypeID": 25,
            "StatusTypeID": 50,
            "LevelID": 2,
            "Amps": 32,
            "Voltage": 400,
            "PowerKW": 22,
            "CurrentTypeID": 20,
            "Quantity": 1
        }
    ],
    "NumberOfPoints": 1,
    "GeneralComments": "This is an open charge unit installed at the Beech's Fine Chocolate site in Fletcher Road, Preston",
    "StatusTypeID": 50,
    "DateLastStatusUpdate": "2017-10-27T05:23:00Z",
    "DataQualityLevel": 1,
    "DateCreated": "2017-10-27T05:23:00Z",
    "SubmissionStatusTypeID": 200
}