{
    "IsRecentlyVerified": false,
    "ID": 158139,
    "UUID": "3FEE1CD0-02C9-49BF-B1AE-33E96FA59F9A",
    "DataProviderID": 1,
    "OperatorID": 32,
    "UsageTypeID": 6,
    "UsageCost": "12p kw",
    "AddressInfo": {
        "ID": 158493,
        "Title": "Travelodge Monks Cross",
        "AddressLine1": "Monks Cross Dr",
        "AddressLine2": "Huntington",
        "Town": "York",
        "Postcode": "YO32 9GZ",
        "CountryID": 1,
        "Latitude": 53.990463,
        "Longitude": -1.047362,
        "AccessComments": "",
        "RelatedURL": "http://www.polar-network.com",
        "DistanceUnit": 0
    },
    "Connections": [
        {
            "ID": 228034,
            "ConnectionTypeID": 25,
            "Reference": "1",
            "StatusTypeID": 50,
            "LevelID": 2,
            "Amps": 32,
            "Voltage": 230,
            "PowerKW": 7,
            "CurrentTypeID": 10,
            "Quantity": 1
        },
        {
            "ID": 228035,
            "ConnectionTypeID": 25,
            "Reference": "2",
            "StatusTypeID": 50,
            "LevelID": 2,
            "Amps": 32,
            "Voltage": 400,
            "PowerKW": 22,
            "CurrentTypeID": 20,
            "Quantity": 1
        }
    ],
    "NumberOfPoints": 2,
    "GeneralComments": "I have been informed by our commissioning team that this polar plus unit is not showing up on the Polar map as per request of the owners.",
    "StatusTypeID": 50,
    "DateLastStatusUpdate": "2020-10-05T18:49:00Z",
    "MetadataValues": [
        {
            "ID": 7672,
            "MetadataFieldID": 4,
            "ItemValue": "Contains public sector information licensed under the Open Government Licence v2.0. http://www.nationalarchives.gov.uk/doc/open-government-licence/version/2/"
        }
    ],
    "DataQualityLevel": 3,
    "DateCreated": "2020-06-25T10:00:00Z",
    "SubmissionStatusTypeID": 100
}