{
    "IsRecentlyVerified": false,
    "ID": 149557,
    "UUID": "0EB7A413-32C0-4E2C-84C9-1590449FEB00",
    "DataProviderID": 1,
    "OperatorID": 3315,
    "OperatorsReference": "52587,52588",
    "UsageTypeID": 4,
    "UsageCost": "Free",
    "AddressInfo": {
        "ID": 149910,
        "Title": "4 Hay Avenue, Edinburgh",
        "AddressLine1": "4 Hay Avenue",
        "Town": "Edinburgh",
        "Postcode": "EH16 4AQ",
        "CountryID": 1,
        "Latitude": 55.934734,
        "Longitude": -3.122766,
        "DistanceUnit": 0
    },
    "Connections": [
        {
            "ID": 207659,
            "ConnectionTypeID": 25,
            "StatusTypeID": 50,
            "LevelID": 2,
            "Amps": 32,
            "Voltage": 230,
            "PowerKW": 7,
            "CurrentTypeID": 10,
            "Quantity": 4
        }
    ],
    "NumberOfPoints": 4,
    "StatusTypeID": 50,
    "DateLastStatusUpdate": "2020-03-01T06:15:00Z",
    "DataQualityLevel": 1,
    "DateCreated": "2020-02-29T06:14:00Z",
    "SubmissionStatusTypeID": 200
}