{
    "IsRecentlyVerified": false,
    "ID": 52652,
    "UUID": "8E95F0DE-01F4-42CC-BCEE-3811739BE285",
    "DataProviderID": 1,
    "OperatorID": 80,
    "UsageTypeID": 4,
    "UsageCost": "0,40€/kW",
    "AddressInfo": {
        "ID": 52998,
        "Title": "Eneldrive DEVAL Chanavey",
        "AddressLine1": "Strada regionale di Rhêmes",
        "AddressLine2": "Chanavey",
        "Town": "Rhêmes-Notre-Dame",
        "StateOrProvince": "AO",
        "Postcode": "11011",
        "CountryID": 112,
        "Latitude": 45.579288764811,
        "Longitude": 7.12354862879873,
        "RelatedURL": "https://www.eneldrive.it/",
        "DistanceUnit": 0
    },
    "Connections": [
        {
            "ID": 65414,
            "ConnectionTypeID": 25,
            "StatusTypeID": 50,
            "LevelID": 2,
            "Amps": 32,
            "Voltage": 400,
            "PowerKW": 22,
            "CurrentTypeID": 20,
            "Quantity": 1
        },
        {
            "ID": 65415,
            "ConnectionTypeID": 36,
            "StatusTypeID": 50,
            "LevelID": 2,
            "Amps": 16,
            "Voltage": 240,
            "PowerKW": 3,
            "CurrentTypeID": 10,
            "Quantity": 1
        }
    ],
    "NumberOfPoints": 1,
    "StatusTypeID": 50,
    "DateLastStatusUpdate": "2016-04-08T09:50:00Z",
    "DataQualityLevel": 1,
    "DateCreated": "2015-09-06T09:38:00Z",
    "SubmissionStatusTypeID": 200
}