{
    "UserComments": [
        {
            "ID": 6674,
            "ChargePointID": 5470,
            "CommentTypeID": 10,
            "UserName": "Richard Butler ",
            "Comment": "Says source London, cyc card worked, polar and ecotricity did not ",
            "DateCreated": "2015-10-01T19:42:30.043Z",
            "User": {
                "ID": 4938,
                "Username": "Richard Butler "
            },
            "CheckinStatusTypeID": 10
        },
        {
            "ID": 4623,
            "ChargePointID": 5470,
            "CommentTypeID": 100,
            "UserName": "",
            "Comment": "Absolute joke poor connection and yes you do have to subscribe it's not just turn up",
            "Rating": 1,
            "DateCreated": "2015-06-04T19:43:23.327Z",
            "CheckinStatusTypeID": 40
        },
        {
            "ID": 3632,
            "ChargePointID": 5470,
            "CommentTypeID": 50,
            "UserName": "David Knights",
            "Comment": "Old style charging post - only accepts 13amp socket chargers. Management office can supply an adapter to a Type 1 connector, but no Type 2 :(",
            "Rating": 2,
            "DateCreated": "2015-01-24T12:44:45.893Z",
            "User": {
                "ID": 4541,
                "Username": "David Knights"
            },
            "CheckinStatusTypeID": 30
        }
    ],
    "MediaItems": [
        {
            "ID": 3324,
            "ChargePointID": 5470,
            "ItemURL": "https://s3-ap-southeast-2.amazonaws.com/openchargemap/images/GB/OCM5470/OCM-5470.orig.2015100119443466.jpg",
            "ItemThumbnailURL": "https://s3-ap-southeast-2.amazonaws.com/openchargemap/images/GB/OCM5470/OCM-5470.thmb.2015100119443466.jpg",
            "Comment": "Workmen in a van were parked diagonally across both bays as I arrived, but we're just leaving. ",
            "IsEnabled": true,
            "IsVideo": false,
            "IsFeaturedItem": false,
            "IsExternalResource": false,
            "User": {
                "ID": 4938,
                "Username": "Richard Butler "
            },
            "DateCreated": "2015-10-01T19:45:00Z"
        }
    ],
    "IsRecentlyVerified": false,
    "ID": 5470,
    "UUID": "72AF1ABD-6E0E-420A-A91C-BDFFD517866C",
    "DataProviderID": 1,
    "OperatorID": 32,
    "OperatorsReference": "CM-10278,CM-4977",
    "UsageTypeID": 4,
    "UsageCost": "£0.12/kWh",
    "AddressInfo": {
        "ID": 5408,
        "Title": "Intu Watford shopping centre",
        "AddressLine1": "Intu Watford shopping centre",
        "Town": "Watford",
        "StateOrProvince": "Hertfordshire",
        "Postcode": "WD17 2UB",
        "CountryID": 1,
        "Latitude": 51.65412,
        "Longitude": -0.39285,
        "ContactTelephone1": "01923 250292",
        "AccessComments": "Queens Car Park level one . Parking charges apply. Shopping hours only.",
        "RelatedURL": "http://intu.co.uk/watford/centre-information/parking",
        "DistanceUnit": 0
    },
    "Connections": [
        {
            "ID": 44800,
            "ConnectionTypeID": 25,
            "StatusTypeID": 50,
            "LevelID": 2,
            "Amps": 32,
            "Voltage": 230,
            "PowerKW": 7.2,
            "CurrentTypeID": 10,
            "Quantity": 2
        }
    ],
    "NumberOfPoints": 4,
    "StatusTypeID": 50,
    "DateLastStatusUpdate": "2019-08-28T20:17:00Z",
    "DataQualityLevel": 1,
    "DateCreated": "2011-08-29T11:42:00Z",
    "SubmissionStatusTypeID": 200
}