{
    "IsRecentlyVerified": false,
    "ID": 70624,
    "UUID": "BA38CB62-F3AF-4EE1-B726-4DA8E83A69E4",
    "DataProviderID": 1,
    "OperatorID": 160,
    "UsageTypeID": 4,
    "AddressInfo": {
        "ID": 70970,
        "Title": "Schlossparkplatz Pillnitz",
        "AddressLine1": "Leonardo-da-Vinci-Straße",
        "Town": "Dresden",
        "StateOrProvince": "Sachsen",
        "Postcode": "01326",
        "CountryID": 87,
        "Latitude": 51.013021814465496,
        "Longitude": 13.86487081891028,
        "ContactTelephone1": "+49 2365 96880 ",
        "AccessComments": "Auf dem zeitweise (täglich 9-17Uhr, im Sommer 8-18Uhr, pauschal 3€) gebührenpflichtigen Parkplatz sind 2 Plätze vor der grünen Ladesäule für Elektrofahrzeuge reserviert.",
        "RelatedURL": "http://www.me-marl.de/",
        "DistanceUnit": 0
    },
    "Connections": [
        {
            "ID": 101110,
            "ConnectionTypeID": 25,
            "StatusTypeID": 50,
            "LevelID": 2,
            "Amps": 32,
            "Voltage": 400,
            "PowerKW": 22,
            "CurrentTypeID": 20,
            "Quantity": 2
        },
        {
            "ID": 101111,
            "ConnectionTypeID": 28,
            "StatusTypeID": 50,
            "LevelID": 2,
            "Amps": 16,
            "Voltage": 230,
            "PowerKW": 3.7,
            "CurrentTypeID": 10,
            "Quantity": 2
        }
    ],
    "NumberOfPoints": 2,
    "StatusTypeID": 50,
    "DateLastStatusUpdate": "2016-07-29T06:55:00Z",
    "DataQualityLevel": 1,
    "DateCreated": "2016-07-29T06:55:00Z",
    "SubmissionStatusTypeID": 200
}