{
    "IsRecentlyVerified": false,
    "ID": 130986,
    "UUID": "AD709D46-3D92-4909-BF26-9CBF86E894E4",
    "DataProviderID": 1,
    "OperatorID": 23,
    "OperatorsReference": "47959",
    "UsageTypeID": 4,
    "AddressInfo": {
        "ID": 131332,
        "Title": "The Moat House, Acton Trussell",
        "AddressLine1": "Lower Penkridge Road",
        "Town": "Acton Trussell",
        "Postcode": "ST17 0RJ",
        "CountryID": 1,
        "Latitude": 52.756225,
        "Longitude": -2.09662,
        "ContactTelephone1": " +44 178 571 2217",
        "DistanceUnit": 0
    },
    "Connections": [
        {
            "ID": 183481,
            "ConnectionTypeID": 30,
            "StatusTypeID": 50,
            "LevelID": 2,
            "PowerKW": 11,
            "CurrentTypeID": 20,
            "Quantity": 1
        }
    ],
    "NumberOfPoints": 1,
    "GeneralComments": "1 Tesla Connector, up to 11kW.Available for customers. Self park.",
    "StatusTypeID": 50,
    "DateLastStatusUpdate": "2019-08-28T19:52:00Z",
    "DataQualityLevel": 1,
    "DateCreated": "2019-08-28T19:52:00Z",
    "SubmissionStatusTypeID": 200
}