{
    "IsRecentlyVerified": false,
    "ID": 111396,
    "UUID": "CF2D11DF-A858-4A28-8EFA-7CEDFCEFA1A4",
    "DataProviderID": 2,
    "DataProvidersReference": "91314",
    "OperatorID": 5,
    "UsageTypeID": 1,
    "AddressInfo": {
        "ID": 111742,
        "Title": "STATION 1",
        "AddressLine1": "8975 Boul Henri-Bourassa O",
        "Town": "Montréal",
        "StateOrProvince": "QC",
        "Postcode": "H4S 1P7",
        "CountryID": 44,
        "Latitude": 45.5015095,
        "Longitude": -73.7464429,
        "ContactTelephone1": "888-758-4389",
        "AccessComments": "24 hours daily",
        "RelatedURL": "http://www.chargepoint.com/",
        "DistanceUnit": 0
    },
    "Connections": [
        {
            "ID": 156814,
            "ConnectionTypeID": 1,
            "LevelID": 2,
            "Amps": 16,
            "Voltage": 230,
            "PowerKW": 3,
            "CurrentTypeID": 10,
            "Quantity": 2
        }
    ],
    "DateLastStatusUpdate": "2019-12-24T09:23:00Z",
    "DataQualityLevel": 3,
    "DateCreated": "2018-10-18T23:37:00Z",
    "SubmissionStatusTypeID": 100
}