{
    "IsRecentlyVerified": false,
    "ID": 36643,
    "UUID": "DF337AAF-E2E0-4B19-9E34-5DEEFCAA1E68",
    "DataProviderID": 26,
    "DataProvidersReference": "48578",
    "OperatorID": 178,
    "OperatorsReference": "EVnetNL REE230",
    "UsageCost": "0.00 jaarabonnement",
    "AddressInfo": {
        "ID": 36989,
        "Title": "Hoofdstraat 10",
        "AddressLine1": "Hoofdstraat 10",
        "Town": "Teylingen",
        "Postcode": "2171 AT",
        "CountryID": 159,
        "Latitude": 52.215515,
        "Longitude": 4.50334,
        "ContactTelephone1": "0800-3522365",
        "RelatedURL": "http://www.evnet.nl",
        "DistanceUnit": 0
    },
    "Connections": [
        {
            "ID": 40154,
            "ConnectionTypeID": 25,
            "LevelID": 2,
            "PowerKW": 11,
            "CurrentTypeID": 10
        }
    ],
    "NumberOfPoints": 2,
    "StatusTypeID": 50,
    "DateLastStatusUpdate": "2016-06-04T02:51:00Z",
    "DataQualityLevel": 3,
    "DateCreated": "2015-01-09T06:05:00Z",
    "SubmissionStatusTypeID": 100
}