{
    "IsRecentlyVerified": false,
    "ID": 92218,
    "UUID": "1D5BEB26-BD41-4899-8FF9-804EEC06C558",
    "DataProviderID": 1,
    "OperatorID": 1,
    "UsageTypeID": 0,
    "AddressInfo": {
        "ID": 92564,
        "Title": "Battisti",
        "AddressLine1": "Viale Cesare Battisti",
        "Town": "Treviso",
        "StateOrProvince": "TV",
        "Postcode": "31100",
        "CountryID": 112,
        "Latitude": 45.666015586244,
        "Longitude": 12.2415775374973,
        "DistanceUnit": 0
    },
    "Connections": [
        {
            "ID": 130753,
            "ConnectionTypeID": 25,
            "StatusTypeID": 50,
            "LevelID": 2,
            "Amps": 32,
            "Voltage": 400,
            "PowerKW": 22,
            "CurrentTypeID": 20,
            "Quantity": 2
        }
    ],
    "NumberOfPoints": 2,
    "StatusTypeID": 50,
    "DateLastStatusUpdate": "2019-01-15T16:26:00Z",
    "DataQualityLevel": 1,
    "DateCreated": "2017-08-31T13:01:00Z",
    "SubmissionStatusTypeID": 200
}