{
    "IsRecentlyVerified": false,
    "ID": 71994,
    "UUID": "B2C2D2E7-BAD2-4892-8238-141E9FB9507D",
    "DataProviderID": 1,
    "OperatorID": 3,
    "OperatorsReference": "PG-90856",
    "UsageTypeID": 6,
    "UsageCost": "1",
    "AddressInfo": {
        "ID": 72340,
        "Title": "Newly Weds Food Limited",
        "AddressLine1": "Manton Road",
        "AddressLine2": "Corby Village",
        "Town": "Corby",
        "StateOrProvince": "Northamptonshire",
        "Postcode": "NN17 4JL",
        "CountryID": 1,
        "Latitude": 52.505692,
        "Longitude": -0.689843,
        "DistanceUnit": 0
    },
    "Connections": [
        {
            "ID": 103222,
            "ConnectionTypeID": 25,
            "StatusTypeID": 50,
            "LevelID": 2,
            "Amps": 32,
            "Voltage": 230,
            "PowerKW": 7,
            "CurrentTypeID": 10,
            "Quantity": 1
        }
    ],
    "NumberOfPoints": 1,
    "StatusTypeID": 0,
    "DateLastStatusUpdate": "2020-02-05T06:34:00Z",
    "DataQualityLevel": 1,
    "DateCreated": "2016-09-27T09:44:00Z",
    "SubmissionStatusTypeID": 200
}