{
    "UserComments": [
        {
            "ID": 24928,
            "ChargePointID": 189489,
            "CommentTypeID": 10,
            "UserName": "ForumElettrico.it",
            "Comment": "Accanto vi è un bar, un negozio di animali ed un supermercato Conad, aperto anche la domenica (ma tanto non vi sono sbarre). Leggi la recensione completa qui:  https://www.forumelettrico.it/forum/colonnina-enel-x-fast-conad-fornovo-di-taro-pr-strada-della-cisa-105-ricco-t20696.html",
            "RelatedURL": "https://www.forumelettrico.it/forum/colonnina-enel-x-fast-conad-fornovo-di-taro-pr-strada-della-cisa-105-ricco-t20696.html",
            "DateCreated": "2021-10-03T15:52:02.61Z",
            "User": {
                "ID": 11749,
                "Username": "ForumElettrico.it"
            },
            "CheckinStatusTypeID": 10,
            "IsActionedByEditor": false
        }
    ],
    "MediaItems": [
        {
            "ID": 29447,
            "ChargePointID": 189489,
            "ItemURL": "https://s3-ap-southeast-2.amazonaws.com/openchargemap/images/IT/OCM189489/OCM-189489.orig.2021100315522948.jpg",
            "ItemThumbnailURL": "https://s3-ap-southeast-2.amazonaws.com/openchargemap/images/IT/OCM189489/OCM-189489.thmb.2021100315522948.jpg",
            "Comment": "",
            "IsEnabled": true,
            "IsVideo": false,
            "IsFeaturedItem": false,
            "IsExternalResource": false,
            "User": {
                "ID": 11749,
                "Username": "ForumElettrico.it"
            },
            "DateCreated": "2021-10-03T15:53:00Z"
        },
        {
            "ID": 29448,
            "ChargePointID": 189489,
            "ItemURL": "https://s3-ap-southeast-2.amazonaws.com/openchargemap/images/IT/OCM189489/OCM-189489.orig.2021100315523446.jpg",
            "ItemThumbnailURL": "https://s3-ap-southeast-2.amazonaws.com/openchargemap/images/IT/OCM189489/OCM-189489.thmb.2021100315523446.jpg",
            "Comment": "",
            "IsEnabled": true,
            "IsVideo": false,
            "IsFeaturedItem": false,
            "IsExternalResource": false,
            "User": {
                "ID": 11749,
                "Username": "ForumElettrico.it"
            },
            "DateCreated": "2021-10-03T15:53:00Z"
        },
        {
            "ID": 29449,
            "ChargePointID": 189489,
            "ItemURL": "https://s3-ap-southeast-2.amazonaws.com/openchargemap/images/IT/OCM189489/OCM-189489.orig.2021100315524110.jpg",
            "ItemThumbnailURL": "https://s3-ap-southeast-2.amazonaws.com/openchargemap/images/IT/OCM189489/OCM-189489.thmb.2021100315524110.jpg",
            "Comment": "",
            "IsEnabled": true,
            "IsVideo": false,
            "IsFeaturedItem": false,
            "IsExternalResource": false,
            "User": {
                "ID": 11749,
                "Username": "ForumElettrico.it"
            },
            "DateCreated": "2021-10-03T15:53:00Z"
        },
        {
            "ID": 29444,
            "ChargePointID": 189489,
            "ItemURL": "https://s3-ap-southeast-2.amazonaws.com/openchargemap/images/IT/OCM189489/OCM-189489.orig.2021100315521358.jpg",
            "ItemThumbnailURL": "https://s3-ap-southeast-2.amazonaws.com/openchargemap/images/IT/OCM189489/OCM-189489.thmb.2021100315521358.jpg",
            "Comment": "",
            "IsEnabled": true,
            "IsVideo": false,
            "IsFeaturedItem": false,
            "IsExternalResource": false,
            "User": {
                "ID": 11749,
                "Username": "ForumElettrico.it"
            },
            "DateCreated": "2021-10-03T15:52:00Z"
        },
        {
            "ID": 29445,
            "ChargePointID": 189489,
            "ItemURL": "https://s3-ap-southeast-2.amazonaws.com/openchargemap/images/IT/OCM189489/OCM-189489.orig.2021100315521895.jpg",
            "ItemThumbnailURL": "https://s3-ap-southeast-2.amazonaws.com/openchargemap/images/IT/OCM189489/OCM-189489.thmb.2021100315521895.jpg",
            "Comment": "",
            "IsEnabled": true,
            "IsVideo": false,
            "IsFeaturedItem": false,
            "IsExternalResource": false,
            "User": {
                "ID": 11749,
                "Username": "ForumElettrico.it"
            },
            "DateCreated": "2021-10-03T15:52:00Z"
        },
        {
            "ID": 29446,
            "ChargePointID": 189489,
            "ItemURL": "https://s3-ap-southeast-2.amazonaws.com/openchargemap/images/IT/OCM189489/OCM-189489.orig.2021100315522429.jpg",
            "ItemThumbnailURL": "https://s3-ap-southeast-2.amazonaws.com/openchargemap/images/IT/OCM189489/OCM-189489.thmb.2021100315522429.jpg",
            "Comment": "",
            "IsEnabled": true,
            "IsVideo": false,
            "IsFeaturedItem": false,
            "IsExternalResource": false,
            "User": {
                "ID": 11749,
                "Username": "ForumElettrico.it"
            },
            "DateCreated": "2021-10-03T15:52:00Z"
        }
    ],
    "IsRecentlyVerified": true,
    "DateLastVerified": "2021-10-03T15:52:00Z",
    "ID": 189489,
    "UUID": "B85D8805-2B9F-4D55-8E58-CB9DF69C882F",
    "DataProviderID": 1,
    "OperatorID": 80,
    "UsageTypeID": 1,
    "AddressInfo": {
        "ID": 189848,
        "Title": "Enel X Conad Riccò",
        "AddressLine1": "Strada della Cisa 105",
        "Town": "Fornovo di Taro",
        "StateOrProvince": "PR",
        "CountryID": 112,
        "Latitude": 44.702532,
        "Longitude": 10.125623,
        "RelatedURL": "https://www.forumelettrico.it/forum/colonnina-enel-x-fast-conad-fornovo-di-taro-pr-strada-della-cisa-105-ricco-t20696.html",
        "DistanceUnit": 0
    },
    "Connections": [
        {
            "ID": 306491,
            "ConnectionTypeID": 33,
            "LevelID": 2,
            "PowerKW": 50
        },
        {
            "ID": 306492,
            "ConnectionTypeID": 2,
            "LevelID": 2,
            "PowerKW": 50
        },
        {
            "ID": 306493,
            "ConnectionTypeID": 1036,
            "LevelID": 2,
            "PowerKW": 43
        }
    ],
    "NumberOfPoints": 1,
    "StatusTypeID": 50,
    "DateLastStatusUpdate": "2021-10-03T15:53:00Z",
    "DataQualityLevel": 1,
    "DateCreated": "2021-10-03T15:52:00Z",
    "SubmissionStatusTypeID": 200
}