{
    "IsRecentlyVerified": false,
    "ID": 62023,
    "UUID": "A1EC301B-3FA2-4BF5-B0DC-9FFA0927E2A2",
    "DataProviderID": 1,
    "OperatorID": 23,
    "OperatorsReference": "7905",
    "UsageTypeID": 7,
    "UsageCost": "Free",
    "AddressInfo": {
        "ID": 62369,
        "Title": "Yates House Bed and Breakfast - Tesla",
        "AddressLine1": "305 2nd St",
        "Town": "Rocheport",
        "StateOrProvince": "MO",
        "Postcode": "65279",
        "CountryID": 2,
        "Latitude": 38.9788384,
        "Longitude": -92.5654654,
        "ContactTelephone1": "573-698-2129  877-798-3752",
        "AccessComments": "24 hours daily; for Tesla use only; for guest use only; see front desk for access",
        "RelatedURL": "http://www.teslamotors.com/supercharger",
        "DistanceUnit": 0
    },
    "Connections": [
        {
            "ID": 78925,
            "ConnectionTypeID": 30,
            "StatusTypeID": 50,
            "LevelID": 2,
            "Amps": 16,
            "Voltage": 230,
            "PowerKW": 13,
            "CurrentTypeID": 10,
            "Quantity": 1
        }
    ],
    "NumberOfPoints": 1,
    "StatusTypeID": 50,
    "DateLastStatusUpdate": "2017-01-26T20:09:00Z",
    "DataQualityLevel": 3,
    "DateCreated": "2016-03-03T11:38:00Z",
    "SubmissionStatusTypeID": 100
}