{
    "IsRecentlyVerified": false,
    "ID": 113021,
    "UUID": "16FC2AC7-190A-4E86-8E74-D0CCAEF6A69C",
    "DataProviderID": 2,
    "DataProvidersReference": "104671",
    "OperatorID": 5,
    "UsageTypeID": 1,
    "AddressInfo": {
        "ID": 113367,
        "Title": "WHOLE FOODS MKT",
        "AddressLine1": "2501 Memorial Pkwy SW",
        "Town": "Huntsville",
        "StateOrProvince": "AL",
        "Postcode": "35801",
        "CountryID": 2,
        "Latitude": 34.713444,
        "Longitude": -86.590469,
        "ContactTelephone1": "888-758-4389",
        "AccessComments": "24 hours daily",
        "RelatedURL": "http://www.chargepoint.com/",
        "DistanceUnit": 0
    },
    "Connections": [
        {
            "ID": 159180,
            "ConnectionTypeID": 1,
            "LevelID": 2,
            "Amps": 16,
            "Voltage": 230,
            "PowerKW": 3,
            "CurrentTypeID": 10,
            "Quantity": 2
        }
    ],
    "DateLastStatusUpdate": "2019-04-06T04:02:00Z",
    "DataQualityLevel": 3,
    "DateCreated": "2018-11-28T02:04:00Z",
    "SubmissionStatusTypeID": 100
}