{
    "IsRecentlyVerified": false,
    "ID": 72008,
    "UUID": "E43E835C-830B-4C8D-B9D7-261CAD4BF177",
    "DataProviderID": 1,
    "OperatorID": 3,
    "OperatorsReference": "PG-80663",
    "UsageTypeID": 6,
    "UsageCost": "Free",
    "AddressInfo": {
        "ID": 72354,
        "Title": "Hyundai North London",
        "AddressLine1": "West Hendon Broadway",
        "AddressLine2": "West Hendon",
        "Town": "London",
        "StateOrProvince": "England",
        "Postcode": "NW9 7BN",
        "CountryID": 1,
        "Latitude": 51.575588,
        "Longitude": -0.237807,
        "DistanceUnit": 0
    },
    "Connections": [
        {
            "ID": 103252,
            "ConnectionTypeID": 25,
            "StatusTypeID": 50,
            "LevelID": 2,
            "Amps": 32,
            "Voltage": 230,
            "PowerKW": 7,
            "CurrentTypeID": 10,
            "Quantity": 2
        }
    ],
    "NumberOfPoints": 3,
    "StatusTypeID": 50,
    "DateLastStatusUpdate": "2017-12-20T11:46:00Z",
    "DataQualityLevel": 1,
    "DateCreated": "2016-09-28T07:57:00Z",
    "SubmissionStatusTypeID": 200
}