{
    "IsRecentlyVerified": false,
    "ID": 127995,
    "UUID": "BACDD271-10A1-4DB2-86F1-657A56FCA33B",
    "DataProviderID": 1,
    "OperatorID": 3253,
    "OperatorsReference": "AT*SMA*EIT1801937*001AC",
    "UsageTypeID": 1,
    "UsageCost": "€0,04/min ; Andere Tarife möglich",
    "AddressInfo": {
        "ID": 128341,
        "Title": "Ladestation Hotel Montana",
        "AddressLine1": "Via Cima Tosa 95",
        "Town": "Madonna di Campiglio",
        "StateOrProvince": "Trentino-Südtirol",
        "Postcode": "38086",
        "CountryID": 112,
        "Latitude": 46.233641,
        "Longitude": 10.823402,
        "DistanceUnit": 0
    },
    "Connections": [
        {
            "ID": 179113,
            "ConnectionTypeID": 1036,
            "StatusTypeID": 50,
            "LevelID": 2,
            "Amps": 16,
            "Voltage": 400,
            "PowerKW": 11,
            "CurrentTypeID": 20,
            "Quantity": 1
        }
    ],
    "NumberOfPoints": 1,
    "StatusTypeID": 50,
    "DateLastStatusUpdate": "2019-06-12T14:21:00Z",
    "DataQualityLevel": 1,
    "DateCreated": "2019-06-12T14:21:00Z",
    "SubmissionStatusTypeID": 200
}