{
    "IsRecentlyVerified": false,
    "ID": 111787,
    "UUID": "FD021946-C486-42BC-9286-30744D4CA730",
    "DataProviderID": 2,
    "DataProvidersReference": "82991",
    "UsageTypeID": 1,
    "AddressInfo": {
        "ID": 112133,
        "Title": "Marcel Dionne et Fils Club Piscine",
        "AddressLine1": "905 rue de Lausanne",
        "Town": "Rimouski",
        "StateOrProvince": "QC",
        "Postcode": "G5L 8Y9",
        "CountryID": 44,
        "Latitude": 48.412116,
        "Longitude": -68.572969,
        "ContactTelephone1": "418-723-1692",
        "AccessComments": "24 hours daily",
        "RelatedURL": "",
        "DistanceUnit": 0
    },
    "Connections": [
        {
            "ID": 157286,
            "ConnectionTypeID": 1,
            "LevelID": 2,
            "Amps": 16,
            "Voltage": 230,
            "PowerKW": 3.7,
            "CurrentTypeID": 10,
            "Quantity": 1
        }
    ],
    "DateLastStatusUpdate": "2020-06-26T03:11:00Z",
    "DataQualityLevel": 3,
    "DateCreated": "2018-10-18T23:37:00Z",
    "SubmissionStatusTypeID": 100
}