{
    "IsRecentlyVerified": false,
    "ID": 154537,
    "UUID": "F9E20EE2-1F9C-4E47-B44C-8EC42919E9F8",
    "DataProviderID": 1,
    "OperatorID": 103,
    "OperatorsReference": "GBALLEGO000178",
    "UsageTypeID": 5,
    "UsageCost": "£0.35/kWh",
    "AddressInfo": {
        "ID": 154890,
        "Title": "Shell Recharge / New Motion  Fontwell nr Chichester",
        "AddressLine1": "Shell Recharge Waitrose Fontwell, Arundel Road",
        "AddressLine2": "Walberton",
        "Town": "Arun",
        "StateOrProvince": "West Sussex",
        "Postcode": "BN18 0SB",
        "CountryID": 1,
        "Latitude": 50.85540124726316,
        "Longitude": -0.6489867293039424,
        "DistanceUnit": 0
    },
    "Connections": [
        {
            "ID": 217343,
            "ConnectionTypeID": 2,
            "StatusTypeID": 50,
            "LevelID": 3,
            "PowerKW": 50,
            "CurrentTypeID": 30,
            "Quantity": 1
        },
        {
            "ID": 217344,
            "ConnectionTypeID": 33,
            "StatusTypeID": 50,
            "LevelID": 3,
            "PowerKW": 50,
            "CurrentTypeID": 30,
            "Quantity": 1
        },
        {
            "ID": 217345,
            "ConnectionTypeID": 1036,
            "StatusTypeID": 50,
            "LevelID": 3,
            "Amps": 63,
            "Voltage": 400,
            "PowerKW": 43,
            "CurrentTypeID": 20,
            "Quantity": 1
        }
    ],
    "NumberOfPoints": 1,
    "StatusTypeID": 50,
    "DateLastStatusUpdate": "2020-03-17T00:37:00Z",
    "DataQualityLevel": 1,
    "DateCreated": "2020-03-16T22:20:00Z",
    "SubmissionStatusTypeID": 200
}