{
    "IsRecentlyVerified": false,
    "ID": 176468,
    "UUID": "2D6BB48C-86A2-4CEA-986D-EB74D0C18AE3",
    "DataProviderID": 29,
    "DataProvidersReference": "16187",
    "AddressInfo": {
        "ID": 176827,
        "Title": "Am Abteihof 1",
        "AddressLine1": "Am Abteihof 1",
        "Town": "Wadgassen",
        "Postcode": "66787",
        "CountryID": 87,
        "Latitude": 49.271529,
        "Longitude": 6.792587,
        "DistanceUnit": 0
    },
    "Connections": [
        {
            "ID": 274420,
            "ConnectionTypeID": 33,
            "StatusTypeID": 50,
            "LevelID": 3,
            "PowerKW": 150,
            "CurrentTypeID": 30
        },
        {
            "ID": 274421,
            "ConnectionTypeID": 2,
            "StatusTypeID": 50,
            "LevelID": 3,
            "PowerKW": 150,
            "CurrentTypeID": 30
        },
        {
            "ID": 296829,
            "ConnectionTypeID": 25,
            "StatusTypeID": 50,
            "LevelID": 2,
            "PowerKW": 22,
            "CurrentTypeID": 20
        },
        {
            "ID": 296830,
            "ConnectionTypeID": 25,
            "StatusTypeID": 50,
            "LevelID": 2,
            "PowerKW": 22,
            "CurrentTypeID": 20
        }
    ],
    "StatusTypeID": 0,
    "DateLastStatusUpdate": "2021-07-12T02:43:00Z",
    "MetadataValues": [
        {
            "ID": 8763,
            "MetadataFieldID": 4,
            "ItemValue": "Data from the German chargepoint registry provided by Bundesnetzagentur.de under the CC-BY 4.0 license"
        }
    ],
    "DataQualityLevel": 3,
    "DateCreated": "2021-07-08T09:48:00Z",
    "SubmissionStatusTypeID": 100
}