{
    "IsRecentlyVerified": false,
    "ID": 166439,
    "UUID": "C41F5572-7733-4772-BAB6-D5F667F57703",
    "DataProviderID": 28,
    "DataProvidersReference": "FR*S44*P44098A",
    "OperatorID": 3412,
    "UsageTypeID": 5,
    "AddressInfo": {
        "ID": 166798,
        "Title": "Missillac | Rue du Chemin de la ville",
        "AddressLine1": "Rue du Chemin de la ville 44780 Missillac",
        "CountryID": 80,
        "Latitude": 47.482992,
        "Longitude": -2.159951,
        "AccessComments": "24/24 7/7",
        "DistanceUnit": 0
    },
    "Connections": [
        {
            "ID": 247348,
            "ConnectionTypeID": 25,
            "StatusTypeID": 50,
            "LevelID": 2,
            "PowerKW": 18,
            "CurrentTypeID": 20
        },
        {
            "ID": 247349,
            "ConnectionTypeID": 28,
            "StatusTypeID": 50,
            "LevelID": 2,
            "PowerKW": 18,
            "CurrentTypeID": 10
        },
        {
            "ID": 247350,
            "ConnectionTypeID": 25,
            "StatusTypeID": 50,
            "LevelID": 2,
            "PowerKW": 18,
            "CurrentTypeID": 20
        },
        {
            "ID": 247351,
            "ConnectionTypeID": 28,
            "StatusTypeID": 50,
            "LevelID": 2,
            "PowerKW": 18,
            "CurrentTypeID": 10
        }
    ],
    "GeneralComments": "",
    "StatusTypeID": 50,
    "DateLastStatusUpdate": "2020-08-27T05:13:00Z",
    "DataQualityLevel": 2,
    "DateCreated": "2020-08-27T05:13:00Z",
    "SubmissionStatusTypeID": 100
}