{
    "MediaItems": [
        {
            "ID": 3171,
            "ChargePointID": 52150,
            "ItemURL": "https://s3-ap-southeast-2.amazonaws.com/openchargemap/images/GB/OCM52150/OCM-52150.orig.2015090808342047.jpg",
            "ItemThumbnailURL": "https://s3-ap-southeast-2.amazonaws.com/openchargemap/images/GB/OCM52150/OCM-52150.thmb.2015090808342047.jpg",
            "Comment": "Only one station working",
            "IsEnabled": true,
            "IsVideo": false,
            "IsFeaturedItem": false,
            "IsExternalResource": false,
            "User": {
                "ID": 4634,
                "Username": "markdl1969"
            },
            "DateCreated": "2015-09-08T08:35:00Z"
        }
    ],
    "IsRecentlyVerified": false,
    "ID": 52150,
    "UUID": "DEBCDDE0-54A1-43AC-AFDA-3D9314C35C66",
    "DataProviderID": 1,
    "OperatorID": 24,
    "UsageTypeID": 4,
    "UsageCost": "£0.30/kWh",
    "AddressInfo": {
        "ID": 52496,
        "Title": "Welcome Break, Burtonwood, M62 Motorway, Jct 8, Great Sankey, Warrington",
        "AddressLine1": "M62 Motorway, Jct 8",
        "AddressLine2": "Great Sankey",
        "Town": "Warrington",
        "StateOrProvince": "Cheshire",
        "Postcode": "WA5 3AX",
        "CountryID": 1,
        "Latitude": 53.41734,
        "Longitude": -2.63885,
        "DistanceUnit": 0
    },
    "Connections": [
        {
            "ID": 64701,
            "ConnectionTypeID": 2,
            "StatusTypeID": 100,
            "LevelID": 3,
            "Amps": 125,
            "Voltage": 400,
            "PowerKW": 50,
            "CurrentTypeID": 30,
            "Quantity": 2
        },
        {
            "ID": 64702,
            "ConnectionTypeID": 1036,
            "StatusTypeID": 100,
            "LevelID": 3,
            "Amps": 63,
            "Voltage": 400,
            "PowerKW": 43,
            "CurrentTypeID": 20,
            "Quantity": 1
        },
        {
            "ID": 64703,
            "ConnectionTypeID": 33,
            "StatusTypeID": 100,
            "LevelID": 3,
            "Amps": 125,
            "Voltage": 400,
            "PowerKW": 50,
            "CurrentTypeID": 30,
            "Quantity": 2
        }
    ],
    "NumberOfPoints": 4,
    "StatusTypeID": 100,
    "DateLastStatusUpdate": "2021-10-14T12:06:00Z",
    "DataQualityLevel": 1,
    "DateCreated": "2015-08-20T13:51:00Z",
    "SubmissionStatusTypeID": 200
}