{
    "IsRecentlyVerified": false,
    "ID": 96733,
    "UUID": "2348A2CB-E800-4395-BC97-D5F5AEF27923",
    "DataProviderID": 2,
    "DataProvidersReference": "88790",
    "OperatorID": 5,
    "UsageTypeID": 1,
    "AddressInfo": {
        "ID": 97079,
        "Title": "EVANSTON CAMPUS",
        "AddressLine1": "1850 Campus Dr",
        "Town": "Evanston",
        "StateOrProvince": "IL",
        "Postcode": "60208",
        "CountryID": 2,
        "Latitude": 42.051027,
        "Longitude": -87.673839,
        "ContactTelephone1": "888-758-4389",
        "AccessComments": "24 hours daily",
        "RelatedURL": "http://www.chargepoint.com/",
        "DistanceUnit": 0
    },
    "Connections": [
        {
            "ID": 137010,
            "ConnectionTypeID": 1,
            "LevelID": 2,
            "Amps": 16,
            "Voltage": 230,
            "PowerKW": 3.7,
            "CurrentTypeID": 10,
            "Quantity": 6
        }
    ],
    "DateLastStatusUpdate": "2020-06-26T03:05:00Z",
    "DataQualityLevel": 3,
    "DateCreated": "2017-12-29T21:01:00Z",
    "SubmissionStatusTypeID": 100
}