{
    "UserComments": [
        {
            "ID": 14183,
            "ChargePointID": 39155,
            "CommentTypeID": 10,
            "UserName": "stocherbube42",
            "Rating": 5,
            "DateCreated": "2016-08-29T15:10:29.59Z",
            "User": {
                "ID": 11746,
                "Username": "stocherbube42"
            },
            "CheckinStatusTypeID": 10
        }
    ],
    "IsRecentlyVerified": false,
    "ID": 39155,
    "UUID": "8F523A10-B9CC-4A6E-A2C2-9A2927ABEE21",
    "DataProviderID": 1,
    "OperatorID": 220,
    "OperatorsReference": "2464,2464,2465",
    "UsageTypeID": 1,
    "UsageCost": "€1.73 + €0.3213/kWh; Andere Tarife möglich",
    "AddressInfo": {
        "ID": 39501,
        "Title": "ElbCampus",
        "AddressLine1": "Zum Handwerkszentrum 1",
        "Town": "Hamburg",
        "Postcode": "21079",
        "CountryID": 87,
        "Latitude": 53.457797602041,
        "Longitude": 9.99459918518072,
        "AccessComments": "2 kostenlose 24/7 verfügbare Parkplätze. Offenes WLAN des Elbcampus nutzbar.",
        "DistanceUnit": 0
    },
    "Connections": [
        {
            "ID": 42666,
            "ConnectionTypeID": 25,
            "StatusTypeID": 50,
            "LevelID": 2,
            "Amps": 32,
            "Voltage": 400,
            "PowerKW": 22,
            "CurrentTypeID": 20,
            "Quantity": 1
        },
        {
            "ID": 49876,
            "ConnectionTypeID": 25,
            "StatusTypeID": 50,
            "LevelID": 2,
            "Amps": 32,
            "Voltage": 400,
            "PowerKW": 11,
            "CurrentTypeID": 20,
            "Quantity": 1
        },
        {
            "ID": 49877,
            "ConnectionTypeID": 28,
            "StatusTypeID": 50,
            "LevelID": 2,
            "Amps": 16,
            "Voltage": 230,
            "PowerKW": 3.7,
            "CurrentTypeID": 10,
            "Quantity": 2
        }
    ],
    "NumberOfPoints": 2,
    "StatusTypeID": 50,
    "DateLastStatusUpdate": "2017-06-10T05:45:00Z",
    "DataQualityLevel": 3,
    "DateCreated": "2015-01-09T06:08:00Z",
    "SubmissionStatusTypeID": 200
}