{
    "UserComments": [
        {
            "ID": 21036,
            "ChargePointID": 53053,
            "CommentTypeID": 10,
            "UserName": "ForumElettrico.it",
            "RelatedURL": "https://www.forumelettrico.it/forum/colonnina-in-via-vandelli-montale-mo-t39.html",
            "DateCreated": "2019-05-22T17:45:24.903Z",
            "User": {
                "ID": 11749,
                "Username": "ForumElettrico.it"
            },
            "CheckinStatusTypeID": 10
        }
    ],
    "MediaItems": [
        {
            "ID": 18491,
            "ChargePointID": 53053,
            "ItemURL": "https://s3-ap-southeast-2.amazonaws.com/openchargemap/images/IT/OCM53053/OCM-53053.orig.2019052217453648.jpg",
            "ItemThumbnailURL": "https://s3-ap-southeast-2.amazonaws.com/openchargemap/images/IT/OCM53053/OCM-53053.thmb.2019052217453648.jpg",
            "Comment": "",
            "IsEnabled": true,
            "IsVideo": false,
            "IsFeaturedItem": false,
            "IsExternalResource": false,
            "User": {
                "ID": 11749,
                "Username": "ForumElettrico.it"
            },
            "DateCreated": "2019-05-22T17:46:00Z"
        },
        {
            "ID": 18492,
            "ChargePointID": 53053,
            "ItemURL": "https://s3-ap-southeast-2.amazonaws.com/openchargemap/images/IT/OCM53053/OCM-53053.orig.2019052217454315.jpg",
            "ItemThumbnailURL": "https://s3-ap-southeast-2.amazonaws.com/openchargemap/images/IT/OCM53053/OCM-53053.thmb.2019052217454315.jpg",
            "Comment": "",
            "IsEnabled": true,
            "IsVideo": false,
            "IsFeaturedItem": false,
            "IsExternalResource": false,
            "User": {
                "ID": 11749,
                "Username": "ForumElettrico.it"
            },
            "DateCreated": "2019-05-22T17:46:00Z"
        }
    ],
    "IsRecentlyVerified": false,
    "ID": 53053,
    "UUID": "D7848848-A68C-46C3-9B2A-F0ABE3995C28",
    "DataProviderID": 1,
    "OperatorID": 80,
    "UsageTypeID": 4,
    "UsageCost": "0,40 €/kW",
    "AddressInfo": {
        "ID": 53399,
        "Title": "Eneldrive Ecovillaggio Montale",
        "AddressLine1": "Km 168, via Vandelli",
        "Town": "Montale ",
        "StateOrProvince": "MO",
        "Postcode": "41051",
        "CountryID": 112,
        "Latitude": 44.5698771611397,
        "Longitude": 10.9074683997283,
        "AccessComments": "http://www.ecovillaggiomontale.it/",
        "RelatedURL": "http://eneldrive.it",
        "DistanceUnit": 0
    },
    "Connections": [
        {
            "ID": 66120,
            "ConnectionTypeID": 25,
            "StatusTypeID": 50,
            "LevelID": 2,
            "Amps": 32,
            "Voltage": 400,
            "PowerKW": 22,
            "CurrentTypeID": 20,
            "Quantity": 1
        },
        {
            "ID": 66121,
            "ConnectionTypeID": 36,
            "StatusTypeID": 50,
            "LevelID": 2,
            "Amps": 13,
            "Voltage": 240,
            "PowerKW": 3,
            "CurrentTypeID": 10,
            "Quantity": 1
        }
    ],
    "NumberOfPoints": 1,
    "StatusTypeID": 50,
    "DateLastStatusUpdate": "2019-05-22T17:46:00Z",
    "DataQualityLevel": 1,
    "DateCreated": "2015-09-17T15:41:00Z",
    "SubmissionStatusTypeID": 200
}