{
    "IsRecentlyVerified": false,
    "ID": 46407,
    "UUID": "FDC20BD1-FDFF-4F72-A177-9393EAC9DFDA",
    "DataProviderID": 1,
    "DataProvidersReference": "738",
    "AddressInfo": {
        "ID": 46753,
        "Title": "Kleivstua Hotell, Hole",
        "AddressLine1": "Dronningveien 500",
        "Town": "KROKKLEIVA",
        "StateOrProvince": "Viken",
        "Postcode": "3531",
        "CountryID": 168,
        "Latitude": 60.04775,
        "Longitude": 10.32234,
        "AccessComments": "Ved inngangen.",
        "DistanceUnit": 0
    },
    "Connections": [
        {
            "ID": 57070,
            "ConnectionTypeID": 0,
            "Reference": "1",
            "LevelID": 2,
            "Amps": 16,
            "Voltage": 230,
            "PowerKW": 3.7,
            "Comments": "Mode 1"
        },
        {
            "ID": 88847,
            "ConnectionTypeID": 0,
            "Reference": "2",
            "LevelID": 2,
            "Amps": 16,
            "Voltage": 230,
            "PowerKW": 3.7,
            "Comments": "Mode 1"
        }
    ],
    "NumberOfPoints": 2,
    "DateLastStatusUpdate": "2020-05-26T08:23:00Z",
    "DataQualityLevel": 2,
    "DateCreated": "2015-05-03T00:54:00Z",
    "SubmissionStatusTypeID": 100
}