{
    "IsRecentlyVerified": false,
    "ID": 20000,
    "UUID": "1710E967-4FBF-4E79-8927-C66FEA0A223E",
    "DataProviderID": 1,
    "OperatorID": 1,
    "UsageTypeID": 0,
    "UsageCost": "",
    "AddressInfo": {
        "ID": 20345,
        "Title": " Renault - Chinon",
        "AddressLine1": "Route de Tours",
        "AddressLine2": "",
        "Town": "",
        "StateOrProvince": " Chinon",
        "Postcode": "37500",
        "CountryID": 80,
        "Latitude": 47.18079,
        "Longitude": 0.26945,
        "ContactTelephone1": "",
        "ContactTelephone2": "",
        "ContactEmail": "",
        "AccessComments": "Ouvert à tous",
        "RelatedURL": "",
        "DistanceUnit": 0
    },
    "Connections": [],
    "GeneralComments": "",
    "StatusTypeID": 50,
    "DateLastStatusUpdate": "2013-10-24T14:09:00Z",
    "DataQualityLevel": 1,
    "DateCreated": "2013-10-24T13:09:00Z",
    "SubmissionStatusTypeID": 200
}