{
    "IsRecentlyVerified": false,
    "ID": 182218,
    "UUID": "57F06D8E-7216-4000-89FD-F87EE9241351",
    "DataProviderID": 29,
    "DataProvidersReference": "20308",
    "AddressInfo": {
        "ID": 182577,
        "Title": "Lohweg 8",
        "AddressLine1": "Lohweg 8",
        "Town": "Hohenburg",
        "Postcode": "92277",
        "CountryID": 87,
        "Latitude": 49.318146,
        "Longitude": 11.836939,
        "DistanceUnit": 0
    },
    "Connections": [
        {
            "ID": 287681,
            "ConnectionTypeID": 25,
            "StatusTypeID": 50,
            "LevelID": 2,
            "PowerKW": 11,
            "CurrentTypeID": 20
        },
        {
            "ID": 287682,
            "ConnectionTypeID": 25,
            "StatusTypeID": 50,
            "LevelID": 2,
            "PowerKW": 11,
            "CurrentTypeID": 20
        }
    ],
    "StatusTypeID": 50,
    "DateLastStatusUpdate": "2021-07-12T02:43:00Z",
    "MetadataValues": [
        {
            "ID": 14512,
            "MetadataFieldID": 4,
            "ItemValue": "Data from the German chargepoint registry provided by Bundesnetzagentur.de under the CC-BY 4.0 license"
        }
    ],
    "DataQualityLevel": 3,
    "DateCreated": "2021-07-08T10:02:00Z",
    "SubmissionStatusTypeID": 100
}