{
    "IsRecentlyVerified": false,
    "ID": 74015,
    "UUID": "CA2E9967-9D7A-4DC9-9B71-065058AEC657",
    "DataProviderID": 1,
    "OperatorID": 89,
    "OperatorsReference": "CEA-148",
    "UsageTypeID": 4,
    "UsageCost": "CAD 2.50",
    "AddressInfo": {
        "ID": 74361,
        "Title": "Verdun-la Station",
        "AddressLine1": "201 rue Berlioz",
        "Town": "Ile des Soeurs",
        "StateOrProvince": "QC",
        "Postcode": "H3E 1C1",
        "CountryID": 44,
        "Latitude": 45.459993,
        "Longitude": -73.54423,
        "DistanceUnit": 0
    },
    "Connections": [
        {
            "ID": 106330,
            "ConnectionTypeID": 1,
            "StatusTypeID": 50,
            "LevelID": 2,
            "Amps": 32,
            "Voltage": 230,
            "PowerKW": 7,
            "CurrentTypeID": 10,
            "Quantity": 1
        }
    ],
    "NumberOfPoints": 1,
    "StatusTypeID": 50,
    "DateLastStatusUpdate": "2017-01-22T19:29:00Z",
    "DataQualityLevel": 1,
    "DateCreated": "2016-11-23T23:58:00Z",
    "SubmissionStatusTypeID": 200
}