{
    "IsRecentlyVerified": false,
    "ID": 128859,
    "UUID": "56E9AC62-01EF-4045-869D-415A6FE3ACD9",
    "DataProviderID": 1,
    "OperatorID": 3360,
    "UsageTypeID": 1,
    "AddressInfo": {
        "ID": 129205,
        "Title": "Le Pouzin",
        "AddressLine1": "Quai René Révollat",
        "Town": "Le Pouzin",
        "Postcode": "07250",
        "CountryID": 80,
        "Latitude": 44.7561989318996,
        "Longitude": 4.75023003929664,
        "RelatedURL": "https://www.cnr.tm.fr/innover-pour-lenergie/favoriser-la-mobilite-electrique/un-corridor-electrique-dans-la-vallee-du-rhone/",
        "DistanceUnit": 0
    },
    "Connections": [
        {
            "ID": 180342,
            "ConnectionTypeID": 33,
            "StatusTypeID": 50,
            "LevelID": 3,
            "PowerKW": 50,
            "CurrentTypeID": 30,
            "Quantity": 2
        },
        {
            "ID": 180343,
            "ConnectionTypeID": 2,
            "StatusTypeID": 50,
            "LevelID": 3,
            "PowerKW": 50,
            "CurrentTypeID": 30,
            "Quantity": 2
        },
        {
            "ID": 180344,
            "ConnectionTypeID": 1036,
            "StatusTypeID": 50,
            "LevelID": 3,
            "PowerKW": 43,
            "CurrentTypeID": 20,
            "Quantity": 2
        }
    ],
    "NumberOfPoints": 2,
    "GeneralComments": "Opérateur CNR (Compagnie Nationale du Rhône)",
    "StatusTypeID": 50,
    "DateLastStatusUpdate": "2019-07-02T04:50:00Z",
    "DataQualityLevel": 1,
    "DateCreated": "2019-07-01T19:01:00Z",
    "SubmissionStatusTypeID": 200
}