{
    "IsRecentlyVerified": false,
    "ID": 186466,
    "UUID": "4CF4ACFC-CA37-4497-8E94-8F93543606C1",
    "DataProviderID": 29,
    "DataProvidersReference": "4111",
    "AddressInfo": {
        "ID": 186825,
        "Title": "Rosenstraße 14",
        "AddressLine1": "Rosenstraße 14",
        "Town": "Meschede",
        "Postcode": "59872",
        "CountryID": 87,
        "Latitude": 51.362133,
        "Longitude": 8.284825,
        "DistanceUnit": 0
    },
    "Connections": [
        {
            "ID": 299215,
            "ConnectionTypeID": 25,
            "StatusTypeID": 50,
            "LevelID": 2,
            "PowerKW": 22,
            "CurrentTypeID": 20
        }
    ],
    "StatusTypeID": 50,
    "DateLastStatusUpdate": "2021-07-12T02:47:00Z",
    "MetadataValues": [
        {
            "ID": 18707,
            "MetadataFieldID": 4,
            "ItemValue": "Data from the German chargepoint registry provided by Bundesnetzagentur.de under the CC-BY 4.0 license"
        }
    ],
    "DataQualityLevel": 3,
    "DateCreated": "2021-07-12T02:47:00Z",
    "SubmissionStatusTypeID": 100
}