{
    "IsRecentlyVerified": false,
    "ID": 34514,
    "UUID": "A9A694BE-9DA6-41D8-A63D-6FEF4D00D698",
    "DataProviderID": 26,
    "DataProvidersReference": "34569",
    "OperatorID": 73,
    "OperatorsReference": "EV-Box EVB-P1309119",
    "UsageCost": "0.00 jaarabonnement",
    "AddressInfo": {
        "ID": 34860,
        "Title": "Hoflaan 87",
        "AddressLine1": "Hoflaan 87",
        "Town": "Rotterdam",
        "Postcode": "3062 JD",
        "CountryID": 159,
        "Latitude": 51.92178,
        "Longitude": 4.51448,
        "RelatedURL": "http://www.ev-box.nl",
        "DistanceUnit": 0
    },
    "Connections": [
        {
            "ID": 38025,
            "ConnectionTypeID": 25,
            "LevelID": 2,
            "PowerKW": 11,
            "CurrentTypeID": 10
        },
        {
            "ID": 47343,
            "ConnectionTypeID": 25,
            "LevelID": 2,
            "PowerKW": 11,
            "CurrentTypeID": 10
        }
    ],
    "NumberOfPoints": 1,
    "StatusTypeID": 50,
    "DateLastStatusUpdate": "2016-06-04T02:42:00Z",
    "DataQualityLevel": 3,
    "DateCreated": "2015-01-09T06:04:00Z",
    "SubmissionStatusTypeID": 100
}