{
    "IsRecentlyVerified": false,
    "ID": 52077,
    "UUID": "0689E228-290D-47F3-A445-DDB600D05DF3",
    "DataProviderID": 2,
    "DataProvidersReference": "69022",
    "OperatorID": 5,
    "UsageTypeID": 1,
    "AddressInfo": {
        "ID": 52423,
        "Title": "BMWSANRAFAEL",
        "AddressLine1": "1599 Francisco Blvd E",
        "Town": "San Rafael",
        "StateOrProvince": "CA",
        "Postcode": "94901",
        "CountryID": 2,
        "Latitude": 37.951478,
        "Longitude": -122.49569,
        "ContactTelephone1": "888-758-4389",
        "AccessComments": "24 hours daily",
        "RelatedURL": "http://www.chargepoint.com/",
        "DistanceUnit": 0
    },
    "Connections": [
        {
            "ID": 64606,
            "ConnectionTypeID": 1,
            "LevelID": 2,
            "Amps": 16,
            "Voltage": 230,
            "PowerKW": 3,
            "CurrentTypeID": 10,
            "Quantity": 5
        }
    ],
    "DateLastStatusUpdate": "2019-04-06T04:02:00Z",
    "DataQualityLevel": 3,
    "DateCreated": "2015-08-19T08:34:00Z",
    "SubmissionStatusTypeID": 100
}