{
    "IsRecentlyVerified": false,
    "ID": 167361,
    "UUID": "6D4F893A-A2EB-43D6-8D0A-C134E5795E76",
    "DataProviderID": 18,
    "DataProvidersReference": "a7743181536bf4b7a4c33d6634081528",
    "OperatorID": 25,
    "UsageTypeID": 4,
    "AddressInfo": {
        "ID": 167720,
        "Title": "Ashley Road",
        "AddressLine1": "Ashley Road",
        "Town": "Merton",
        "Postcode": "SW19 8NU",
        "CountryID": 1,
        "Latitude": 51.422133,
        "Longitude": -0.193232,
        "AccessComments": "",
        "RelatedURL": "https://www.sourcelondon.net",
        "DistanceUnit": 0
    },
    "Connections": [
        {
            "ID": 253456,
            "ConnectionTypeID": 25,
            "Reference": "1",
            "StatusTypeID": 50,
            "LevelID": 2,
            "Amps": 32,
            "Voltage": 230,
            "PowerKW": 7,
            "CurrentTypeID": 10
        },
        {
            "ID": 253457,
            "ConnectionTypeID": 25,
            "Reference": "2",
            "StatusTypeID": 50,
            "LevelID": 2,
            "Amps": 32,
            "Voltage": 230,
            "PowerKW": 7,
            "CurrentTypeID": 10
        },
        {
            "ID": 253458,
            "ConnectionTypeID": 25,
            "Reference": "3",
            "StatusTypeID": 50,
            "LevelID": 2,
            "Amps": 32,
            "Voltage": 230,
            "PowerKW": 7,
            "CurrentTypeID": 10
        }
    ],
    "StatusTypeID": 0,
    "DateLastStatusUpdate": "2020-09-08T02:47:00Z",
    "MetadataValues": [
        {
            "ID": 7902,
            "MetadataFieldID": 4,
            "ItemValue": "Contains public sector information licensed under the Open Government Licence v2.0. http://www.nationalarchives.gov.uk/doc/open-government-licence/version/2/"
        }
    ],
    "DataQualityLevel": 3,
    "DateCreated": "2020-09-08T02:47:00Z",
    "SubmissionStatusTypeID": 100
}