{
    "IsRecentlyVerified": false,
    "ID": 81454,
    "UUID": "7F58861E-DA93-41DD-8665-DDAA8218EEC1",
    "DataProviderID": 1,
    "OperatorID": 45,
    "UsageTypeID": 1,
    "UsageCost": "Spende",
    "AddressInfo": {
        "ID": 81800,
        "Title": "Römer und Bajuwaren Museum (mit E Bike Station)",
        "AddressLine1": "Burgstraße",
        "Town": "Kipfenberg",
        "StateOrProvince": "Landkreis Eichstätt",
        "Postcode": "85110",
        "CountryID": 87,
        "Latitude": 48.9483199457234,
        "Longitude": 11.3981881209015,
        "ContactTelephone1": "+49 8465 905 707",
        "AccessComments": "Die durchgehend nutzbare Ladebox befindet sich unmittelbar vor der Burgmauer, hinter dem Schild \"Römer- und Bajuwarenmuseum - Infopoint Limes\". Spende für den Museumsverein im Museum.\r\nIm Museum befindet sich ein Ladeschrank mit Schließfächern und Schukosteckdosen für E-Bike Akkus. Der kann natürlich nur zu den Öffnungszeiten (siehe Webseite) genutzt werden.",
        "RelatedURL": "http://www.bajuwaren-kipfenberg.de/",
        "DistanceUnit": 0
    },
    "Connections": [
        {
            "ID": 116182,
            "ConnectionTypeID": 25,
            "StatusTypeID": 50,
            "LevelID": 2,
            "Amps": 16,
            "Voltage": 400,
            "PowerKW": 11,
            "CurrentTypeID": 20,
            "Quantity": 1
        },
        {
            "ID": 116183,
            "ConnectionTypeID": 28,
            "StatusTypeID": 50,
            "LevelID": 1,
            "Amps": 10,
            "Voltage": 230,
            "PowerKW": 2.3,
            "CurrentTypeID": 10,
            "Quantity": 3
        }
    ],
    "NumberOfPoints": 1,
    "GeneralComments": "Die Ladestation wurde gemeinsam mit der N-ERGIE und dem Tourismusverband Naturpark Altmühltal errichtet.\r\n",
    "StatusTypeID": 50,
    "DateLastStatusUpdate": "2017-02-02T07:19:00Z",
    "DataQualityLevel": 1,
    "DateCreated": "2017-02-02T07:17:00Z",
    "SubmissionStatusTypeID": 200
}