{
    "IsRecentlyVerified": false,
    "ID": 100748,
    "UUID": "AE2A3E5A-92E9-4AF8-9ECA-B8A3648A6941",
    "DataProviderID": 1,
    "OperatorID": 45,
    "UsageTypeID": 6,
    "AddressInfo": {
        "ID": 101094,
        "Title": "Hotel Voss",
        "AddressLine1": "Bahnhofstraße 17",
        "Town": "Westerstede",
        "StateOrProvince": "Landkreis Ammerland",
        "Postcode": "26655",
        "CountryID": 87,
        "Latitude": 53.2570999050181,
        "Longitude": 7.928984728836099,
        "ContactTelephone1": "+49 4488 5190",
        "AccessComments": "Wallbox ist am linken Parkplatz des Carports für Gäste. Bei hoher Stromaufnahme der Hotelküche kann die Ladeleistung auf 11kW begrenzt sein.",
        "RelatedURL": "https://www.schokoladenhotel.de/",
        "DistanceUnit": 0
    },
    "Connections": [
        {
            "ID": 142306,
            "ConnectionTypeID": 25,
            "StatusTypeID": 50,
            "LevelID": 2,
            "Amps": 34,
            "Voltage": 400,
            "PowerKW": 22,
            "CurrentTypeID": 20,
            "Quantity": 1
        }
    ],
    "NumberOfPoints": 1,
    "StatusTypeID": 50,
    "DateLastStatusUpdate": "2018-03-09T08:22:00Z",
    "DataQualityLevel": 1,
    "DateCreated": "2018-03-09T08:22:00Z",
    "SubmissionStatusTypeID": 200
}