{
    "IsRecentlyVerified": false,
    "ID": 28976,
    "UUID": "6A07DEBE-3176-4870-A5A9-CD6AFAE9BE6D",
    "DataProviderID": 2,
    "DataProvidersReference": "61547",
    "OperatorID": 5,
    "UsageTypeID": 1,
    "AddressInfo": {
        "ID": 29322,
        "Title": "NATIONAL GRID",
        "AddressLine1": "15 Nott Terrace Heights",
        "Town": "Schenectady",
        "StateOrProvince": "NY",
        "Postcode": "12308",
        "CountryID": 2,
        "Latitude": 42.8125934,
        "Longitude": -73.9331603,
        "ContactTelephone1": "888-758-4389",
        "AccessComments": "24 hours daily",
        "RelatedURL": "http://www.chargepoint.com/",
        "DistanceUnit": 0
    },
    "Connections": [
        {
            "ID": 31837,
            "ConnectionTypeID": 1,
            "LevelID": 2,
            "Amps": 16,
            "Voltage": 230,
            "PowerKW": 3,
            "CurrentTypeID": 10,
            "Quantity": 1
        }
    ],
    "DateLastStatusUpdate": "2019-12-24T09:20:00Z",
    "DataQualityLevel": 3,
    "DateCreated": "2014-11-28T03:38:00Z",
    "SubmissionStatusTypeID": 100
}