{
    "IsRecentlyVerified": false,
    "ID": 129769,
    "UUID": "AFB3F0AE-DF19-437E-B394-E2B3390BBBBF",
    "DataProviderID": 1,
    "DataProvidersReference": "CBR-00028",
    "OperatorID": 21,
    "UsageTypeID": 6,
    "UsageCost": "Mobi.E compatible card",
    "AddressInfo": {
        "ID": 130115,
        "Title": "CBR-00028",
        "AddressLine1": "Instituto Superior de Engenharia de Coimbra",
        "Town": "Coimbra",
        "StateOrProvince": "Coimbra",
        "Postcode": "3030-199",
        "CountryID": 180,
        "Latitude": 40.192128,
        "Longitude": -8.413002,
        "DistanceUnit": 0
    },
    "Connections": [
        {
            "ID": 181655,
            "ConnectionTypeID": 25,
            "StatusTypeID": 50,
            "LevelID": 2,
            "Amps": 32,
            "Voltage": 400,
            "PowerKW": 22,
            "CurrentTypeID": 20,
            "Quantity": 2
        }
    ],
    "NumberOfPoints": 2,
    "StatusTypeID": 50,
    "DateLastStatusUpdate": "2020-09-10T11:15:00Z",
    "DataQualityLevel": 3,
    "DateCreated": "2019-07-26T02:45:00Z",
    "SubmissionStatusTypeID": 100
}