{
    "IsRecentlyVerified": false,
    "ID": 174755,
    "UUID": "D65DC3EE-12AD-4AEB-8F9D-B72EA16580CF",
    "DataProviderID": 1,
    "OperatorID": 3323,
    "UsageTypeID": 4,
    "AddressInfo": {
        "ID": 175114,
        "Title": "Zes - Tekpark Yaşam Merkezi",
        "AddressLine1": "",
        "Town": "Tepebaşı",
        "StateOrProvince": "Eskişehir",
        "Postcode": "26200",
        "CountryID": 229,
        "Latitude": 39.79350248620051,
        "Longitude": 30.457797395184002,
        "DistanceUnit": 0
    },
    "Connections": [
        {
            "ID": 270789,
            "ConnectionTypeID": 25,
            "StatusTypeID": 50,
            "LevelID": 2,
            "PowerKW": 22,
            "CurrentTypeID": 20,
            "Quantity": 1
        }
    ],
    "NumberOfPoints": 1,
    "StatusTypeID": 50,
    "DateLastStatusUpdate": "2021-04-14T21:23:00Z",
    "DataQualityLevel": 1,
    "DateCreated": "2021-04-11T21:17:00Z",
    "SubmissionStatusTypeID": 200
}