{
    "MediaItems": [
        {
            "ID": 12129,
            "ChargePointID": 87747,
            "ItemURL": "https://s3-ap-southeast-2.amazonaws.com/openchargemap/images/NZ/OCM87747/OCM-87747.orig.2017051609252131.jpg",
            "ItemThumbnailURL": "https://s3-ap-southeast-2.amazonaws.com/openchargemap/images/NZ/OCM87747/OCM-87747.thmb.2017051609252131.jpg",
            "Comment": "",
            "IsEnabled": true,
            "IsVideo": false,
            "IsFeaturedItem": false,
            "IsExternalResource": false,
            "User": {
                "ID": 15365,
                "Username": "sliday"
            },
            "DateCreated": "2017-05-16T09:26:00Z"
        }
    ],
    "IsRecentlyVerified": false,
    "ID": 87747,
    "UUID": "DF5FA2D8-16DE-40C3-A499-0E6075CF7170",
    "DataProviderID": 1,
    "UsageCost": "$2/h",
    "AddressInfo": {
        "ID": 88093,
        "Title": "Awatere Motor Camp",
        "AddressLine1": "18 Seymour St",
        "Town": "Seddon",
        "Postcode": "7210",
        "CountryID": 161,
        "Latitude": -41.67314997351926,
        "Longitude": 174.07281948055402,
        "ContactTelephone1": "(643) 575-7285",
        "DistanceUnit": 0
    },
    "Connections": [
        {
            "ID": 124370,
            "ConnectionTypeID": 4
        }
    ],
    "NumberOfPoints": 2,
    "GeneralComments": "24h\r\nOvernight honesty box camping and charging. Be honest and give them $10 per charge.",
    "StatusTypeID": 50,
    "DateLastStatusUpdate": "2017-05-16T09:26:00Z",
    "DataQualityLevel": 1,
    "DateCreated": "2017-05-16T09:25:00Z",
    "SubmissionStatusTypeID": 200
}