{
    "IsRecentlyVerified": false,
    "ID": 98055,
    "UUID": "ADD8141B-2B38-4D9E-8EA7-9E15C6CF45C4",
    "DataProviderID": 1,
    "OperatorID": 23,
    "OperatorsReference": "39480",
    "UsageTypeID": 4,
    "AddressInfo": {
        "ID": 98401,
        "Title": "Living Place - Gruppo Jsh",
        "AddressLine1": "Via Properzia De' Rossi",
        "Town": "Villanova di Castenaso",
        "Postcode": "40138",
        "CountryID": 112,
        "Latitude": 44.491831,
        "Longitude": 11.418742,
        "ContactTelephone1": "+39 0516 009 269",
        "DistanceUnit": 0
    },
    "Connections": [
        {
            "ID": 138963,
            "ConnectionTypeID": 30,
            "StatusTypeID": 50,
            "LevelID": 2,
            "Amps": 16,
            "Voltage": 400,
            "PowerKW": 11,
            "CurrentTypeID": 20,
            "Quantity": 1
        }
    ],
    "NumberOfPoints": 1,
    "GeneralComments": "1 Tesla Connector, up to 11kW.Available for customers. Please see front desk.",
    "StatusTypeID": 50,
    "DateLastStatusUpdate": "2018-10-04T06:18:00Z",
    "DataQualityLevel": 1,
    "DateCreated": "2018-01-21T17:41:00Z",
    "SubmissionStatusTypeID": 200
}