{
    "IsRecentlyVerified": false,
    "ID": 159125,
    "UUID": "0E707814-FAB6-481A-8CB7-E15E2FD73B8D",
    "DataProviderID": 2,
    "DataProvidersReference": "155037",
    "OperatorID": 3372,
    "UsageTypeID": 1,
    "AddressInfo": {
        "ID": 159482,
        "Title": "Centennial Recreation Center",
        "AddressLine1": "171 W Edmundson Ave",
        "Town": "Morgan Hill",
        "StateOrProvince": "CA",
        "Postcode": "95037",
        "CountryID": 2,
        "Latitude": 37.1132172,
        "Longitude": -121.6457131,
        "ContactTelephone1": "866-816-7584",
        "AccessComments": "24 hours daily; Also accepts Paypal",
        "RelatedURL": "http://evconnect.com/",
        "DistanceUnit": 0
    },
    "Connections": [
        {
            "ID": 229215,
            "ConnectionTypeID": 1,
            "LevelID": 2,
            "Amps": 16,
            "Voltage": 230,
            "PowerKW": 3.7,
            "CurrentTypeID": 10,
            "Quantity": 2
        }
    ],
    "StatusTypeID": 50,
    "DateLastStatusUpdate": "2020-06-26T02:59:00Z",
    "DataQualityLevel": 3,
    "DateCreated": "2020-06-26T02:59:00Z",
    "SubmissionStatusTypeID": 100
}