{
    "IsRecentlyVerified": false,
    "ID": 43509,
    "UUID": "AE6FE9C9-F79A-4749-93D7-9607045ED212",
    "DataProviderID": 1,
    "OperatorID": 45,
    "UsageTypeID": 3,
    "UsageCost": "0",
    "AddressInfo": {
        "ID": 43855,
        "Title": "Autohaus Hasepark",
        "AddressLine1": "Franz-Lenz-Straße 16",
        "AddressLine2": "Innenstadt",
        "Town": "Osnabrück",
        "StateOrProvince": "Osnabrück",
        "Postcode": "49084",
        "CountryID": 87,
        "Latitude": 52.2720462603743,
        "Longitude": 8.06800203914791,
        "ContactTelephone1": "+49 541760690",
        "AccessComments": "Säule auf dem Hinterhof des Renault/Dacia/Nissan/Hyundai Autohauses vor links neben dem Eingang. 2 Parkplätze nutzbar während der Öffnungszeiten Mo-Fr 7:30-18:30, Sa 9-14Uhr. So 11-17Uhr Schautag, unklar ob dann geladen werden kann.",
        "RelatedURL": "http://walkenhorst-gruppe.de/",
        "DistanceUnit": 0
    },
    "Connections": [
        {
            "ID": 52759,
            "ConnectionTypeID": 0,
            "StatusTypeID": 50,
            "LevelID": 2,
            "Amps": 32,
            "Voltage": 400,
            "PowerKW": 22,
            "CurrentTypeID": 20,
            "Quantity": 2
        }
    ],
    "NumberOfPoints": 2,
    "StatusTypeID": 50,
    "DateLastStatusUpdate": "2015-04-02T09:42:00Z",
    "DataQualityLevel": 1,
    "DateCreated": "2015-04-02T09:04:00Z",
    "SubmissionStatusTypeID": 200
}