{
    "IsRecentlyVerified": false,
    "ID": 61362,
    "UUID": "6F084AC9-391D-4BCD-BA8E-75D5F281B011",
    "DataProviderID": 1,
    "OperatorID": 45,
    "UsageTypeID": 1,
    "AddressInfo": {
        "ID": 61708,
        "Title": "IKEA",
        "AddressLine1": "Josef-Reiert-Straße 9",
        "Town": "Walldorf",
        "StateOrProvince": "Rhein-Neckar-Kreis",
        "Postcode": "69190",
        "CountryID": 87,
        "Latitude": 49.306224,
        "Longitude": 8.629537400000004,
        "AccessComments": "2 große weiße Ladesäulen vor blauer Lochgitterwand in der Nähe des Eingangs. Nutzbar während der Öffnungszeiten Mo-Do/Sa: 9:30-21:00Uhr, Fr: 9:30-22:00Uhr. Achtung: Keine Dosen, alle Anschlüsse mit fest angeschlossenen Kabeln, auch Typ2!",
        "DistanceUnit": 0
    },
    "Connections": [
        {
            "ID": 78154,
            "ConnectionTypeID": 2,
            "StatusTypeID": 50,
            "LevelID": 3,
            "PowerKW": 20,
            "CurrentTypeID": 30,
            "Quantity": 2
        },
        {
            "ID": 78155,
            "ConnectionTypeID": 33,
            "StatusTypeID": 50,
            "LevelID": 3,
            "PowerKW": 20,
            "CurrentTypeID": 30,
            "Quantity": 2
        },
        {
            "ID": 78156,
            "ConnectionTypeID": 25,
            "StatusTypeID": 50,
            "LevelID": 2,
            "Amps": 32,
            "Voltage": 400,
            "PowerKW": 22,
            "CurrentTypeID": 20,
            "Quantity": 2
        }
    ],
    "NumberOfPoints": 6,
    "StatusTypeID": 50,
    "DateLastStatusUpdate": "2016-02-26T07:48:00Z",
    "DataQualityLevel": 1,
    "DateCreated": "2016-02-26T07:48:00Z",
    "SubmissionStatusTypeID": 200
}