{
    "IsRecentlyVerified": false,
    "ID": 175022,
    "UUID": "17E9EF77-71FA-4EAD-80CA-536F20594E1E",
    "DataProviderID": 1,
    "OperatorID": 136,
    "UsageTypeID": 4,
    "UsageCost": "free as of April, 2021",
    "AddressInfo": {
        "ID": 175381,
        "Title": "KAOIL Gas Station",
        "AddressLine1": "Νέων Μουδανιών - Σιθωνίας",
        "Town": "Νέα Μουδανιά",
        "StateOrProvince": "Αποκεντρωμένη Διοίκηση Μακεδονίας - Θράκης",
        "Postcode": "63200",
        "CountryID": 90,
        "Latitude": 40.24514148539842,
        "Longitude": 23.304349206508277,
        "ContactTelephone1": "+302373026501",
        "DistanceUnit": 0
    },
    "Connections": [
        {
            "ID": 271258,
            "ConnectionTypeID": 25,
            "Reference": "52523",
            "StatusTypeID": 50,
            "LevelID": 2,
            "Amps": 32,
            "Voltage": 230,
            "PowerKW": 22,
            "CurrentTypeID": 20,
            "Quantity": 1,
            "Comments": ""
        }
    ],
    "NumberOfPoints": 1,
    "GeneralComments": "1x22kW cable-free charger, Part of Virta: Watt&Volt: ChargeSpot Network. Reservation Possible through the ChargeSpot platform.",
    "StatusTypeID": 50,
    "DateLastStatusUpdate": "2021-04-24T10:44:00Z",
    "DataQualityLevel": 1,
    "DateCreated": "2021-04-24T10:42:00Z",
    "SubmissionStatusTypeID": 200
}