{
    "IsRecentlyVerified": false,
    "ID": 123111,
    "UUID": "DDC196D5-F201-4175-9126-E1A866312552",
    "DataProviderID": 2,
    "DataProvidersReference": "113254",
    "OperatorID": 23,
    "UsageTypeID": 7,
    "AddressInfo": {
        "ID": 123457,
        "Title": "Halter Ranch Vineyard - Tesla Destination",
        "AddressLine1": "8910 Adelaida Rd",
        "Town": "Paso Robles",
        "StateOrProvince": "CA",
        "Postcode": "93446",
        "CountryID": 2,
        "Latitude": 35.648084,
        "Longitude": -120.833095,
        "ContactTelephone1": "888-367-9977  877-798-3752",
        "AccessComments": "24 hours daily; for customer use only\r\nPublic - Call ahead",
        "RelatedURL": "https://www.tesla.com/destination-charging",
        "DistanceUnit": 0
    },
    "Connections": [
        {
            "ID": 173049,
            "ConnectionTypeID": 30,
            "LevelID": 2,
            "Amps": 16,
            "Voltage": 230,
            "PowerKW": 3.7,
            "CurrentTypeID": 10,
            "Quantity": 4
        }
    ],
    "DateLastStatusUpdate": "2020-06-26T02:58:00Z",
    "DataQualityLevel": 3,
    "DateCreated": "2019-04-06T05:03:00Z",
    "SubmissionStatusTypeID": 100
}