{
    "IsRecentlyVerified": false,
    "ID": 84860,
    "UUID": "DB77A002-65EA-4E30-AF2A-83A7F15271FF",
    "DataProviderID": 1,
    "OperatorID": 45,
    "UsageTypeID": 1,
    "AddressInfo": {
        "ID": 85206,
        "Title": "Engelbert Strauss",
        "AddressLine1": "Brammenring 121",
        "Town": "Oberhausen",
        "StateOrProvince": "Oberhausen",
        "Postcode": "46047",
        "CountryID": 87,
        "Latitude": 51.48885689999999,
        "Longitude": 6.885396000000014,
        "AccessComments": "Zwei Säulen stehen auf dem Kundenparkplatz.",
        "DistanceUnit": 0
    },
    "Connections": [
        {
            "ID": 120582,
            "ConnectionTypeID": 25,
            "StatusTypeID": 50,
            "LevelID": 2,
            "Amps": 32,
            "Voltage": 400,
            "PowerKW": 22,
            "CurrentTypeID": 20,
            "Quantity": 4
        },
        {
            "ID": 120583,
            "ConnectionTypeID": 28,
            "StatusTypeID": 50,
            "LevelID": 2,
            "Amps": 16,
            "Voltage": 230,
            "PowerKW": 3.7,
            "CurrentTypeID": 10,
            "Quantity": 4
        }
    ],
    "NumberOfPoints": 8,
    "StatusTypeID": 50,
    "DateLastStatusUpdate": "2017-03-20T07:41:00Z",
    "DataQualityLevel": 1,
    "DateCreated": "2017-03-20T07:41:00Z",
    "SubmissionStatusTypeID": 200
}