{
    "IsRecentlyVerified": false,
    "ID": 121733,
    "UUID": "D25F17B7-F436-4044-8238-3B8D0C9E4D34",
    "DataProviderID": 2,
    "DataProvidersReference": "98681",
    "UsageTypeID": 2,
    "AddressInfo": {
        "ID": 122079,
        "Title": "Naval Hospital Camp Pendleton",
        "AddressLine1": "200 Mercy Cir",
        "Town": "Oceanside",
        "StateOrProvince": "CA",
        "Postcode": "92055",
        "CountryID": 2,
        "Latitude": 33.222128,
        "Longitude": -117.39062,
        "ContactTelephone1": "",
        "AccessComments": "Fleet use only",
        "RelatedURL": "",
        "DistanceUnit": 0
    },
    "Connections": [
        {
            "ID": 171549,
            "ConnectionTypeID": 1,
            "LevelID": 2,
            "Amps": 16,
            "Voltage": 230,
            "PowerKW": 3.7,
            "CurrentTypeID": 10,
            "Quantity": 2
        }
    ],
    "DateLastStatusUpdate": "2020-06-26T02:55:00Z",
    "DataQualityLevel": 3,
    "DateCreated": "2019-04-06T05:02:00Z",
    "SubmissionStatusTypeID": 100
}