{
    "IsRecentlyVerified": false,
    "ID": 159998,
    "UUID": "CFC1DCDD-C2AC-4FA0-BFE5-7022C569BEBE",
    "DataProviderID": 2,
    "DataProvidersReference": "156102",
    "OperatorID": 5,
    "UsageTypeID": 1,
    "AddressInfo": {
        "ID": 160355,
        "Title": "100 CROWLEY",
        "AddressLine1": "100 Crowley Dr",
        "Town": "Marlborough",
        "StateOrProvince": "MA",
        "Postcode": "01752",
        "CountryID": 2,
        "Latitude": 42.36964,
        "Longitude": -71.57233,
        "ContactTelephone1": "888-758-4389",
        "AccessComments": "24 hours daily",
        "RelatedURL": "http://www.chargepoint.com/",
        "DistanceUnit": 0
    },
    "Connections": [
        {
            "ID": 230226,
            "ConnectionTypeID": 1,
            "LevelID": 2,
            "Amps": 16,
            "Voltage": 230,
            "PowerKW": 3.7,
            "CurrentTypeID": 10,
            "Quantity": 2
        }
    ],
    "StatusTypeID": 50,
    "DateLastStatusUpdate": "2020-06-26T03:05:00Z",
    "DataQualityLevel": 3,
    "DateCreated": "2020-06-26T03:05:00Z",
    "SubmissionStatusTypeID": 100
}