{
    "IsRecentlyVerified": false,
    "ID": 114199,
    "UUID": "C5B32189-234A-4DD4-A225-C520C0ADFE18",
    "DataProviderID": 1,
    "OperatorID": 23,
    "OperatorsReference": "34632",
    "UsageTypeID": 4,
    "UsageCost": "$0.24/kWh; other tariffs for older cars",
    "AddressInfo": {
        "ID": 114545,
        "Title": "Rosemont, Il Supercharger",
        "AddressLine1": "5220 Fashion Outlets Way",
        "Town": "Rosemont",
        "StateOrProvince": "IL",
        "Postcode": "60018",
        "CountryID": 2,
        "Latitude": 41.975263,
        "Longitude": -87.866046,
        "DistanceUnit": 0
    },
    "Connections": [
        {
            "ID": 160769,
            "ConnectionTypeID": 27,
            "StatusTypeID": 50,
            "LevelID": 3,
            "PowerKW": 120,
            "CurrentTypeID": 30,
            "Quantity": 10
        }
    ],
    "NumberOfPoints": 10,
    "GeneralComments": "Charging10 Superchargers, available 24/7, up to 120kW",
    "StatusTypeID": 50,
    "DateLastStatusUpdate": "2019-01-03T08:12:00Z",
    "DataQualityLevel": 1,
    "DateCreated": "2019-01-03T08:12:00Z",
    "SubmissionStatusTypeID": 200
}