{
    "IsRecentlyVerified": false,
    "ID": 32698,
    "UUID": "71D252E1-ABDA-4933-8236-666A86062526",
    "DataProviderID": 26,
    "DataProvidersReference": "32288",
    "OperatorID": 157,
    "OperatorsReference": "NewMotion 02005148",
    "UsageCost": "0.00 jaarabonnement",
    "AddressInfo": {
        "ID": 33044,
        "Title": "Frans van Nunenstraat 19",
        "AddressLine1": "Frans van Nunenstraat 19",
        "Town": "Eersel",
        "Postcode": "5524 AT",
        "CountryID": 159,
        "Latitude": 51.3764495849609,
        "Longitude": 5.35294580459595,
        "ContactTelephone1": "088 0109500",
        "RelatedURL": "http://thenewmotion.nl/",
        "DistanceUnit": 0
    },
    "Connections": [
        {
            "ID": 36209,
            "ConnectionTypeID": 25,
            "LevelID": 2,
            "PowerKW": 3.7,
            "CurrentTypeID": 10
        }
    ],
    "NumberOfPoints": 1,
    "StatusTypeID": 50,
    "DateLastStatusUpdate": "2016-06-04T02:38:00Z",
    "DataQualityLevel": 3,
    "DateCreated": "2015-01-09T06:03:00Z",
    "SubmissionStatusTypeID": 100
}