{
    "IsRecentlyVerified": false,
    "ID": 175792,
    "UUID": "DE2D7918-0CBB-4E85-9737-BC78A7613B63",
    "DataProviderID": 1,
    "OperatorID": 21,
    "UsageTypeID": 4,
    "UsageCost": "Mobi.E compatible card or App",
    "AddressInfo": {
        "ID": 176151,
        "Title": "ABF-00007 - Marina de Albufeira",
        "AddressLine1": "Alameda da Orada",
        "Town": "Albufeira",
        "StateOrProvince": "Faro",
        "Postcode": "",
        "CountryID": 180,
        "Latitude": 37.085740951078634,
        "Longitude": -8.266490636501885,
        "DistanceUnit": 0
    },
    "Connections": [
        {
            "ID": 273000,
            "ConnectionTypeID": 25,
            "StatusTypeID": 50,
            "LevelID": 2,
            "Amps": 32,
            "Voltage": 400,
            "PowerKW": 22,
            "CurrentTypeID": 20,
            "Quantity": 2
        }
    ],
    "NumberOfPoints": 2,
    "StatusTypeID": 50,
    "DateLastStatusUpdate": "2021-06-15T10:13:00Z",
    "DataQualityLevel": 1,
    "DateCreated": "2021-06-15T10:13:00Z",
    "SubmissionStatusTypeID": 200
}