{
    "IsRecentlyVerified": false,
    "ID": 116492,
    "UUID": "8C4B179C-8566-4060-A669-1D203CC67DBC",
    "DataProviderID": 19,
    "DataProvidersReference": "5168",
    "AddressInfo": {
        "ID": 116838,
        "Title": "Svegs Hälsocentral",
        "AddressLine1": "Herrögatan 31",
        "Town": "SVEG",
        "StateOrProvince": "JÄMTLAND",
        "Postcode": "84232",
        "CountryID": 216,
        "Latitude": 62.03933,
        "Longitude": 14.35339,
        "AccessComments": "För Region JHs elbilar och laddhybrider samt för besökare, 0680-166 00",
        "DistanceUnit": 0
    },
    "Connections": [
        {
            "ID": 164744,
            "ConnectionTypeID": 25,
            "Reference": "1",
            "LevelID": 2,
            "Amps": 16,
            "Voltage": 400,
            "PowerKW": 11.1,
            "CurrentTypeID": 20,
            "Comments": "Mode 3"
        },
        {
            "ID": 164745,
            "ConnectionTypeID": 25,
            "Reference": "2",
            "LevelID": 2,
            "Amps": 16,
            "Voltage": 400,
            "PowerKW": 11.1,
            "CurrentTypeID": 20,
            "Comments": "Mode 3"
        }
    ],
    "NumberOfPoints": 2,
    "DateLastStatusUpdate": "2019-02-11T09:16:00Z",
    "DataQualityLevel": 2,
    "DateCreated": "2019-02-11T09:16:00Z",
    "SubmissionStatusTypeID": 100
}