{
    "MediaItems": [
        {
            "ID": 12504,
            "ChargePointID": 88260,
            "ItemURL": "https://s3-ap-southeast-2.amazonaws.com/openchargemap/images/NZ/OCM88260/OCM-88260.orig.2017052507512811.jpg",
            "ItemThumbnailURL": "https://s3-ap-southeast-2.amazonaws.com/openchargemap/images/NZ/OCM88260/OCM-88260.thmb.2017052507512811.jpg",
            "Comment": "",
            "IsEnabled": true,
            "IsVideo": false,
            "IsFeaturedItem": false,
            "IsExternalResource": false,
            "User": {
                "ID": 15365,
                "Username": "sliday"
            },
            "DateCreated": "2017-05-25T07:52:00Z"
        },
        {
            "ID": 12505,
            "ChargePointID": 88260,
            "ItemURL": "https://s3-ap-southeast-2.amazonaws.com/openchargemap/images/NZ/OCM88260/OCM-88260.orig.2017052507514002.jpg",
            "ItemThumbnailURL": "https://s3-ap-southeast-2.amazonaws.com/openchargemap/images/NZ/OCM88260/OCM-88260.thmb.2017052507514002.jpg",
            "Comment": "",
            "IsEnabled": true,
            "IsVideo": false,
            "IsFeaturedItem": false,
            "IsExternalResource": false,
            "User": {
                "ID": 15365,
                "Username": "sliday"
            },
            "DateCreated": "2017-05-25T07:52:00Z"
        },
        {
            "ID": 12502,
            "ChargePointID": 88260,
            "ItemURL": "https://s3-ap-southeast-2.amazonaws.com/openchargemap/images/NZ/OCM88260/OCM-88260.orig.2017052507502138.jpg",
            "ItemThumbnailURL": "https://s3-ap-southeast-2.amazonaws.com/openchargemap/images/NZ/OCM88260/OCM-88260.thmb.2017052507502138.jpg",
            "Comment": "",
            "IsEnabled": true,
            "IsVideo": false,
            "IsFeaturedItem": false,
            "IsExternalResource": false,
            "User": {
                "ID": 15365,
                "Username": "sliday"
            },
            "DateCreated": "2017-05-25T07:51:00Z"
        },
        {
            "ID": 12503,
            "ChargePointID": 88260,
            "ItemURL": "https://s3-ap-southeast-2.amazonaws.com/openchargemap/images/NZ/OCM88260/OCM-88260.orig.2017052507504776.jpg",
            "ItemThumbnailURL": "https://s3-ap-southeast-2.amazonaws.com/openchargemap/images/NZ/OCM88260/OCM-88260.thmb.2017052507504776.jpg",
            "Comment": "",
            "IsEnabled": true,
            "IsVideo": false,
            "IsFeaturedItem": false,
            "IsExternalResource": false,
            "User": {
                "ID": 15365,
                "Username": "sliday"
            },
            "DateCreated": "2017-05-25T07:51:00Z"
        }
    ],
    "IsRecentlyVerified": false,
    "ID": 88260,
    "UUID": "F868A0C2-869D-4DC5-9355-370AB895A587",
    "DataProviderID": 1,
    "OperatorID": 229,
    "UsageTypeID": 4,
    "UsageCost": "$0.25/kWh + $0.25/min",
    "AddressInfo": {
        "ID": 88606,
        "Title": "Esk Street",
        "AddressLine1": "116 Esk Street",
        "Town": "Invercargill, Invercargill",
        "Postcode": "9810",
        "CountryID": 161,
        "Latitude": -46.4117329313932,
        "Longitude": 168.353137423691,
        "ContactTelephone1": "(080) 022-4274",
        "DistanceUnit": 0
    },
    "Connections": [
        {
            "ID": 125201,
            "ConnectionTypeID": 2,
            "StatusTypeID": 50,
            "LevelID": 3,
            "PowerKW": 50,
            "CurrentTypeID": 30,
            "Quantity": 1
        },
        {
            "ID": 125202,
            "ConnectionTypeID": 33,
            "StatusTypeID": 50,
            "LevelID": 3,
            "PowerKW": 50,
            "CurrentTypeID": 30,
            "Quantity": 1
        }
    ],
    "NumberOfPoints": 2,
    "GeneralComments": "24/7\r\nEsk Street, opposite Invercargill City Council offices",
    "StatusTypeID": 50,
    "DateLastStatusUpdate": "2017-05-25T11:50:00Z",
    "DataQualityLevel": 1,
    "DateCreated": "2017-05-25T07:50:00Z",
    "SubmissionStatusTypeID": 200
}