{
    "IsRecentlyVerified": false,
    "ID": 139927,
    "UUID": "6EB5D2A4-338F-49A7-A056-854B3C2088B3",
    "DataProviderID": 2,
    "DataProvidersReference": "93168",
    "OperatorID": 15,
    "UsageTypeID": 4,
    "AddressInfo": {
        "ID": 140279,
        "Title": "Walgreens",
        "AddressLine1": "18568 Ventura Blvd",
        "Town": "Tarzana",
        "StateOrProvince": "CA",
        "Postcode": "91356",
        "CountryID": 2,
        "Latitude": 34.16891,
        "Longitude": -118.53798,
        "ContactTelephone1": "877-455-3833",
        "AccessComments": "24 hours daily\r\nPublic - Card key at all times",
        "RelatedURL": "https://www.evgo.com/",
        "DistanceUnit": 0
    },
    "Connections": [
        {
            "ID": 195427,
            "ConnectionTypeID": 2,
            "LevelID": 3,
            "Amps": 100,
            "Voltage": 400,
            "PowerKW": 40,
            "CurrentTypeID": 30,
            "Quantity": 1
        },
        {
            "ID": 195428,
            "ConnectionTypeID": 32,
            "LevelID": 3,
            "Amps": 100,
            "Voltage": 400,
            "PowerKW": 40,
            "CurrentTypeID": 30,
            "Quantity": 1
        }
    ],
    "StatusTypeID": 50,
    "DateLastStatusUpdate": "2020-06-26T02:57:00Z",
    "DataQualityLevel": 3,
    "DateCreated": "2019-12-24T09:11:00Z",
    "SubmissionStatusTypeID": 100
}