{
    "IsRecentlyVerified": false,
    "ID": 111023,
    "UUID": "01919A21-0D8A-4CC9-807A-2CA21622009C",
    "DataProviderID": 2,
    "DataProvidersReference": "83564",
    "UsageTypeID": 1,
    "AddressInfo": {
        "ID": 111369,
        "Title": "Egate Communications",
        "AddressLine1": "85 Curlew Dr",
        "Town": "Toronto",
        "StateOrProvince": "ON",
        "Postcode": "M3A 2P8",
        "CountryID": 44,
        "Latitude": 43.7418688550142,
        "Longitude": -79.317741403856,
        "ContactTelephone1": "416-447-7700 x0",
        "AccessComments": "24 hours daily",
        "RelatedURL": "",
        "DistanceUnit": 0
    },
    "Connections": [
        {
            "ID": 156362,
            "ConnectionTypeID": 1,
            "LevelID": 2,
            "Amps": 16,
            "Voltage": 230,
            "PowerKW": 3.7,
            "CurrentTypeID": 10,
            "Quantity": 1
        }
    ],
    "DateLastStatusUpdate": "2020-06-26T03:07:00Z",
    "DataQualityLevel": 3,
    "DateCreated": "2018-10-18T23:36:00Z",
    "SubmissionStatusTypeID": 100
}