{
    "IsRecentlyVerified": false,
    "ID": 8402,
    "UUID": "71319A64-819D-4276-9FE0-6FDE048F7F5A",
    "DataProviderID": 15,
    "DataProvidersReference": "11424",
    "OperatorID": 5,
    "AddressInfo": {
        "ID": 8299,
        "Title": "6226 W Sahara Ave",
        "AddressLine1": "6226 W Sahara Ave",
        "Town": "Las Vegas",
        "StateOrProvince": "Nevada",
        "Postcode": "89151",
        "CountryID": 2,
        "Latitude": 36.14510345,
        "Longitude": -115.2278061,
        "ContactTelephone1": "(702) 367-5000",
        "RelatedURL": "http://carstations.com/11424",
        "DistanceUnit": 0
    },
    "Connections": [
        {
            "ID": 5830,
            "ConnectionTypeID": 1,
            "Reference": "J1772",
            "LevelID": 2
        },
        {
            "ID": 7432,
            "ConnectionTypeID": 9,
            "Reference": "NEMA5",
            "Quantity": 1
        }
    ],
    "StatusTypeID": 0,
    "DateLastStatusUpdate": "2017-11-04T14:04:00Z",
    "DataQualityLevel": 1,
    "DateCreated": "2011-11-11T12:06:00Z",
    "SubmissionStatusTypeID": 100
}