{
    "IsRecentlyVerified": false,
    "ID": 152928,
    "UUID": "AE6A980A-59DF-4C13-951B-D0E9F35ECEE0",
    "DataProviderID": 28,
    "DataProvidersReference": "FR*S70*P07028522",
    "UsageTypeID": 5,
    "AddressInfo": {
        "ID": 153281,
        "Title": "Place de la Brossolette",
        "AddressLine1": "\"Place Brossolette 70400 H?ricourt\"",
        "CountryID": 80,
        "Latitude": 47.57632,
        "Longitude": 6.76207,
        "AccessComments": "accessible 24h/24 - 7j/7",
        "DistanceUnit": 0
    },
    "Connections": [
        {
            "ID": 214312,
            "ConnectionTypeID": 1036,
            "StatusTypeID": 50,
            "LevelID": 2,
            "PowerKW": 22,
            "CurrentTypeID": 20
        },
        {
            "ID": 247576,
            "ConnectionTypeID": 1036,
            "StatusTypeID": 50,
            "LevelID": 2,
            "PowerKW": 22,
            "CurrentTypeID": 20
        }
    ],
    "GeneralComments": "recharge normale et acceleree accessible par application smartphone/internet et badge - informations site web freshmile.fr",
    "StatusTypeID": 50,
    "DateLastStatusUpdate": "2020-08-27T05:13:00Z",
    "DataQualityLevel": 2,
    "DateCreated": "2020-03-15T10:54:00Z",
    "SubmissionStatusTypeID": 100
}