{
    "IsRecentlyVerified": false,
    "ID": 85129,
    "UUID": "4B4A5510-0136-4931-BF40-00900E16CD55",
    "DataProviderID": 1,
    "OperatorID": 45,
    "UsageTypeID": 5,
    "AddressInfo": {
        "ID": 85475,
        "Title": " Parking de Cornavin",
        "AddressLine1": "Entrée Place de Cornavin 12 ou 7",
        "Town": "Ginevra",
        "Postcode": "1201",
        "CountryID": 217,
        "Latitude": 46.2104846746508,
        "Longitude": 6.14344469636457,
        "ContactTelephone1": "022 827 44 90",
        "ContactEmail": "admin@fondation-parkings.ch",
        "RelatedURL": "https://www.geneve-parking.ch/fr/parkings/place-de-cornavin",
        "DistanceUnit": 0
    },
    "Connections": [
        {
            "ID": 120891,
            "ConnectionTypeID": 1037,
            "StatusTypeID": 0,
            "LevelID": 2,
            "Amps": 10,
            "Voltage": 230,
            "PowerKW": 3,
            "CurrentTypeID": 10,
            "Quantity": 4
        }
    ],
    "NumberOfPoints": 4,
    "GeneralComments": "étage -4",
    "StatusTypeID": 0,
    "DateLastStatusUpdate": "2017-04-01T09:37:00Z",
    "DataQualityLevel": 1,
    "DateCreated": "2017-03-26T17:12:00Z",
    "SubmissionStatusTypeID": 200
}