{
    "IsRecentlyVerified": false,
    "ID": 17758,
    "UUID": "3C260E21-FDB3-43DD-9A52-FFDE3B14623A",
    "DataProviderID": 22,
    "DataProvidersReference": "65F675B3CF48B79D1D4FE970F1688C6B",
    "AddressInfo": {
        "ID": 18103,
        "Title": "ローソン川崎富士見一丁目店",
        "AddressLine1": "神奈川県川崎市川崎区富士見1-6-5",
        "CountryID": 114,
        "Latitude": 35.53050319,
        "Longitude": 139.7138019,
        "ContactTelephone1": "044-246-6649",
        "DistanceUnit": 0
    },
    "Connections": [
        {
            "ID": 17999,
            "ConnectionTypeID": 2,
            "LevelID": 2,
            "Amps": 100,
            "Voltage": 480,
            "PowerKW": 48,
            "Quantity": 1
        }
    ],
    "DateLastStatusUpdate": "2013-06-29T09:02:00Z",
    "DataQualityLevel": 2,
    "DateCreated": "2013-06-29T09:02:00Z",
    "SubmissionStatusTypeID": 200
}