{
    "IsRecentlyVerified": false,
    "ID": 36898,
    "UUID": "DA6E465C-CCD6-4828-8A42-7A3432ABF49F",
    "DataProviderID": 26,
    "DataProvidersReference": "48009",
    "OperatorID": 178,
    "OperatorsReference": "EVnetNL DB0249",
    "UsageCost": "0.00 jaarabonnement",
    "AddressInfo": {
        "ID": 37244,
        "Title": "Tamarindelaan 16",
        "AddressLine1": "Tamarindelaan 16",
        "Town": "Amstelveen",
        "Postcode": "1187 EM",
        "CountryID": 159,
        "Latitude": 52.274158,
        "Longitude": 4.833105,
        "ContactTelephone1": "0800-3522365",
        "RelatedURL": "http://www.evnet.nl",
        "DistanceUnit": 0
    },
    "Connections": [
        {
            "ID": 40409,
            "ConnectionTypeID": 25,
            "LevelID": 2,
            "PowerKW": 11,
            "CurrentTypeID": 10
        }
    ],
    "NumberOfPoints": 2,
    "StatusTypeID": 50,
    "DateLastStatusUpdate": "2016-06-04T02:52:00Z",
    "DataQualityLevel": 3,
    "DateCreated": "2015-01-09T06:07:00Z",
    "SubmissionStatusTypeID": 100
}