{
    "IsRecentlyVerified": false,
    "ID": 80180,
    "UUID": "6455DB81-360F-411C-B95D-8ECC2A16D23B",
    "DataProviderID": 2,
    "DataProvidersReference": "80500",
    "OperatorID": 5,
    "UsageTypeID": 1,
    "AddressInfo": {
        "ID": 80526,
        "Title": "CARTA",
        "AddressLine1": "527 E M L King Blvd",
        "Town": "Chattanooga",
        "StateOrProvince": "TN",
        "Postcode": "37403",
        "CountryID": 2,
        "Latitude": 35.0434275,
        "Longitude": -85.301786,
        "ContactTelephone1": "888-758-4389",
        "AccessComments": "24 hours daily",
        "RelatedURL": "http://www.chargepoint.com/",
        "DistanceUnit": 0
    },
    "Connections": [
        {
            "ID": 114846,
            "ConnectionTypeID": 1,
            "LevelID": 2,
            "Amps": 16,
            "Voltage": 230,
            "PowerKW": 3,
            "CurrentTypeID": 10,
            "Quantity": 2
        }
    ],
    "DateLastStatusUpdate": "2019-04-06T04:02:00Z",
    "DataQualityLevel": 3,
    "DateCreated": "2017-01-31T01:05:00Z",
    "SubmissionStatusTypeID": 100
}