{
    "IsRecentlyVerified": false,
    "ID": 35752,
    "UUID": "ECA015C3-A7C6-4230-8F71-CCB498D5EB41",
    "DataProviderID": 26,
    "DataProvidersReference": "55993",
    "OperatorID": 157,
    "OperatorsReference": "NewMotion 02010163",
    "UsageCost": "0.00 jaarabonnement",
    "AddressInfo": {
        "ID": 36098,
        "Title": "Kalvermarkt",
        "AddressLine1": "Kalvermarkt",
        "Town": "Den Haag",
        "Postcode": "2511 CK",
        "CountryID": 159,
        "Latitude": 52.0778732299805,
        "Longitude": 4.31563997268677,
        "ContactTelephone1": "088 0109500",
        "RelatedURL": "http://thenewmotion.nl/",
        "DistanceUnit": 0
    },
    "Connections": [
        {
            "ID": 39263,
            "ConnectionTypeID": 25,
            "LevelID": 2,
            "PowerKW": 3.7,
            "CurrentTypeID": 10
        }
    ],
    "NumberOfPoints": 1,
    "StatusTypeID": 50,
    "DateLastStatusUpdate": "2016-06-04T02:49:00Z",
    "DataQualityLevel": 3,
    "DateCreated": "2015-01-09T06:05:00Z",
    "SubmissionStatusTypeID": 100
}