{
    "IsRecentlyVerified": false,
    "ID": 187482,
    "UUID": "C0E7DD61-4786-43E2-B331-8271F167F831",
    "DataProviderID": 18,
    "DataProvidersReference": "602f16e2d76469607e94b3f314f812ee",
    "OperatorID": 2244,
    "UsageTypeID": 5,
    "AddressInfo": {
        "ID": 187841,
        "Title": "1 Longbeach Road",
        "AddressLine1": "1 Longbeach Road",
        "Town": "London",
        "Postcode": "SW11 5SS",
        "CountryID": 1,
        "Latitude": -0.159013,
        "Longitude": 51.464542,
        "AccessComments": "",
        "RelatedURL": "https://www.ubitricity.com",
        "DistanceUnit": 0
    },
    "Connections": [
        {
            "ID": 302616,
            "ConnectionTypeID": 25,
            "Reference": "suby1100005402",
            "StatusTypeID": 50,
            "LevelID": 2,
            "Amps": 16,
            "Voltage": 230,
            "PowerKW": 3.7,
            "CurrentTypeID": 10
        }
    ],
    "StatusTypeID": 0,
    "DateLastStatusUpdate": "2021-07-12T03:38:00Z",
    "MetadataValues": [
        {
            "ID": 19722,
            "MetadataFieldID": 4,
            "ItemValue": "Contains public sector information licensed under the Open Government Licence v2.0. http://www.nationalarchives.gov.uk/doc/open-government-licence/version/2/"
        }
    ],
    "DataQualityLevel": 3,
    "DateCreated": "2021-07-12T03:38:00Z",
    "SubmissionStatusTypeID": 100
}