{
    "IsRecentlyVerified": false,
    "ID": 142570,
    "UUID": "8A797570-65C4-4F59-A838-3E55A4DCA907",
    "DataProviderID": 2,
    "DataProvidersReference": "123670",
    "OperatorID": 5,
    "UsageTypeID": 1,
    "AddressInfo": {
        "ID": 142922,
        "Title": "STEINSCHINDER",
        "AddressLine1": "1 Main St",
        "Town": "Hastings-on-Hudson",
        "StateOrProvince": "NY",
        "Postcode": "10706",
        "CountryID": 2,
        "Latitude": 40.9944451,
        "Longitude": -73.8826566,
        "ContactTelephone1": "888-758-4389",
        "AccessComments": "24 hours daily",
        "RelatedURL": "http://www.chargepoint.com/",
        "DistanceUnit": 0
    },
    "Connections": [
        {
            "ID": 198734,
            "ConnectionTypeID": 1,
            "LevelID": 2,
            "Amps": 16,
            "Voltage": 230,
            "PowerKW": 3,
            "CurrentTypeID": 10,
            "Quantity": 2
        }
    ],
    "StatusTypeID": 50,
    "DateLastStatusUpdate": "2019-12-24T09:18:00Z",
    "DataQualityLevel": 3,
    "DateCreated": "2019-12-24T09:18:00Z",
    "SubmissionStatusTypeID": 100
}