{
    "IsRecentlyVerified": false,
    "ID": 106593,
    "UUID": "97835680-D090-4CA7-8761-EA91AD2BA7D5",
    "DataProviderID": 1,
    "OperatorID": 32,
    "OperatorsReference": "24191",
    "UsageTypeID": 4,
    "UsageCost": "£0.108/kWh; for Polar Plus subscription members only",
    "AddressInfo": {
        "ID": 106939,
        "Title": "Holiday Inn Gloucester-Cheltenham",
        "AddressLine1": "Crest Way",
        "AddressLine2": "Barnwood",
        "Town": "Gloucester",
        "Postcode": "GL4 3RX",
        "CountryID": 1,
        "Latitude": 51.864101,
        "Longitude": -2.1946,
        "DistanceUnit": 0
    },
    "Connections": [
        {
            "ID": 150000,
            "ConnectionTypeID": 33,
            "StatusTypeID": 50,
            "LevelID": 3,
            "PowerKW": 50,
            "CurrentTypeID": 30,
            "Quantity": 1
        },
        {
            "ID": 150001,
            "ConnectionTypeID": 2,
            "StatusTypeID": 50,
            "LevelID": 3,
            "PowerKW": 50,
            "CurrentTypeID": 30,
            "Quantity": 1
        },
        {
            "ID": 150002,
            "ConnectionTypeID": 1036,
            "StatusTypeID": 50,
            "LevelID": 3,
            "PowerKW": 43,
            "CurrentTypeID": 20,
            "Quantity": 1
        }
    ],
    "NumberOfPoints": 1,
    "StatusTypeID": 50,
    "DateLastStatusUpdate": "2019-06-20T05:14:00Z",
    "DataQualityLevel": 1,
    "DateCreated": "2018-06-26T05:13:00Z",
    "SubmissionStatusTypeID": 200
}