{
    "IsRecentlyVerified": false,
    "ID": 183944,
    "UUID": "F604A454-EEF2-424E-BBF8-AA827DF10721",
    "DataProviderID": 29,
    "DataProvidersReference": "8134",
    "OperatorID": 69,
    "AddressInfo": {
        "ID": 184303,
        "Title": "Stockhausstr. 2",
        "AddressLine1": "Stockhausstr. 2",
        "Town": "Stade",
        "Postcode": "21682",
        "CountryID": 87,
        "Latitude": 53.600356,
        "Longitude": 9.474163,
        "DistanceUnit": 0
    },
    "Connections": [
        {
            "ID": 291561,
            "ConnectionTypeID": 25,
            "StatusTypeID": 50,
            "LevelID": 2,
            "PowerKW": 22,
            "CurrentTypeID": 20
        },
        {
            "ID": 291562,
            "ConnectionTypeID": 25,
            "StatusTypeID": 50,
            "LevelID": 2,
            "PowerKW": 22,
            "CurrentTypeID": 20
        }
    ],
    "StatusTypeID": 50,
    "DateLastStatusUpdate": "2021-07-12T02:51:00Z",
    "MetadataValues": [
        {
            "ID": 16237,
            "MetadataFieldID": 4,
            "ItemValue": "Data from the German chargepoint registry provided by Bundesnetzagentur.de under the CC-BY 4.0 license"
        }
    ],
    "DataQualityLevel": 3,
    "DateCreated": "2021-07-08T10:04:00Z",
    "SubmissionStatusTypeID": 100
}