{
    "IsRecentlyVerified": false,
    "ID": 56262,
    "UUID": "B3045D39-9FB9-42D3-85CB-1BEC8A512AC1",
    "DataProviderID": 1,
    "OperatorID": 86,
    "UsageTypeID": 4,
    "AddressInfo": {
        "ID": 56608,
        "Title": "Marktplatz",
        "AddressLine1": "Marktplatz 6",
        "Town": "Schönau",
        "StateOrProvince": "Rhein-Neckar-Kreis",
        "Postcode": "69250",
        "CountryID": 87,
        "Latitude": 49.436639,
        "Longitude": 8.809308900000019,
        "ContactTelephone1": "+49 6228 2070",
        "AccessComments": "Rund um die Uhr (24/7) nutzbar. Position: 8 m links vom Marktplatzbrunnen, Multifunktionslaterne.. Umgebung:Klostergebäude, Bäckerei Legron, Eisenwaren und Gartengeräte Kraus, Blumen-Nagel, Café Baden, Kinderkrippe \"die kleinen Strolche\", Edeka, evangelische und katholische Kirche, Rathaus\r\n",
        "RelatedURL": "http://www.www.stadt-schoenau.de",
        "DistanceUnit": 0
    },
    "Connections": [
        {
            "ID": 70942,
            "ConnectionTypeID": 25,
            "StatusTypeID": 50,
            "LevelID": 2,
            "Amps": 32,
            "Voltage": 400,
            "PowerKW": 22,
            "CurrentTypeID": 20,
            "Quantity": 1
        },
        {
            "ID": 70943,
            "ConnectionTypeID": 28,
            "StatusTypeID": 50,
            "LevelID": 2,
            "Amps": 16,
            "Voltage": 230,
            "PowerKW": 3.7,
            "CurrentTypeID": 10,
            "Quantity": 1
        }
    ],
    "NumberOfPoints": 2,
    "StatusTypeID": 50,
    "DateLastStatusUpdate": "2015-10-26T08:19:00Z",
    "DataQualityLevel": 1,
    "DateCreated": "2015-10-26T08:19:00Z",
    "SubmissionStatusTypeID": 200
}