{
    "IsRecentlyVerified": false,
    "ID": 185830,
    "UUID": "B10E0F9D-70F3-48D1-8F63-6E2B74B63854",
    "DataProviderID": 29,
    "DataProvidersReference": "8382",
    "AddressInfo": {
        "ID": 186189,
        "Title": "Röthenbacherstraße",
        "AddressLine1": "Röthenbacherstraße",
        "Town": "Wendelstein",
        "Postcode": "90530",
        "CountryID": 87,
        "Latitude": 49.355115,
        "Longitude": 11.148942,
        "DistanceUnit": 0
    },
    "Connections": [
        {
            "ID": 296911,
            "ConnectionTypeID": 25,
            "StatusTypeID": 50,
            "LevelID": 2,
            "PowerKW": 22,
            "CurrentTypeID": 20
        },
        {
            "ID": 296912,
            "ConnectionTypeID": 25,
            "StatusTypeID": 50,
            "LevelID": 2,
            "PowerKW": 22,
            "CurrentTypeID": 20
        }
    ],
    "StatusTypeID": 50,
    "DateLastStatusUpdate": "2021-07-12T02:43:00Z",
    "MetadataValues": [
        {
            "ID": 18072,
            "MetadataFieldID": 4,
            "ItemValue": "Data from the German chargepoint registry provided by Bundesnetzagentur.de under the CC-BY 4.0 license"
        }
    ],
    "DataQualityLevel": 3,
    "DateCreated": "2021-07-12T02:43:00Z",
    "SubmissionStatusTypeID": 100
}