{
    "IsRecentlyVerified": false,
    "ID": 74339,
    "UUID": "D11BAF99-BB62-4E95-A4FA-507CD77F0484",
    "DataProviderID": 1,
    "OperatorID": 45,
    "UsageTypeID": 6,
    "AddressInfo": {
        "ID": 74685,
        "Title": "Hessen Hotelpark",
        "AddressLine1": "Schwarzengrunder Straße 9",
        "Town": "Hohenroda",
        "StateOrProvince": "Landkreis Hersfeld-Rotenburg",
        "Postcode": "36284",
        "CountryID": 87,
        "Latitude": 50.80919684079372,
        "Longitude": 9.899984480950943,
        "AccessComments": "Nach Anmeldung von Gästen 24/7 nutzbar",
        "DistanceUnit": 0
    },
    "Connections": [
        {
            "ID": 106899,
            "ConnectionTypeID": 17,
            "StatusTypeID": 50,
            "LevelID": 2,
            "Amps": 16,
            "Voltage": 400,
            "PowerKW": 11,
            "CurrentTypeID": 20,
            "Quantity": 1
        }
    ],
    "NumberOfPoints": 1,
    "StatusTypeID": 50,
    "DateLastStatusUpdate": "2016-12-02T07:00:00Z",
    "DataQualityLevel": 1,
    "DateCreated": "2016-12-02T07:00:00Z",
    "SubmissionStatusTypeID": 200
}