{
    "IsRecentlyVerified": false,
    "ID": 175874,
    "UUID": "01E03937-8531-4204-B182-74A8EF631D10",
    "DataProviderID": 1,
    "OperatorID": 1,
    "UsageTypeID": 4,
    "AddressInfo": {
        "ID": 176233,
        "Title": "Casa",
        "AddressLine1": "",
        "Town": "Torrejón del Rey",
        "StateOrProvince": "Castile-La Mancha",
        "Postcode": "",
        "CountryID": 210,
        "Latitude": 40.654658979548394,
        "Longitude": -3.334412473072096,
        "DistanceUnit": 0
    },
    "Connections": [
        {
            "ID": 273123,
            "ConnectionTypeID": 0,
            "StatusTypeID": 50,
            "Quantity": 1
        }
    ],
    "NumberOfPoints": 1,
    "StatusTypeID": 50,
    "DateLastStatusUpdate": "2021-06-20T14:23:00Z",
    "DataQualityLevel": 1,
    "DateCreated": "2021-06-17T14:21:00Z",
    "SubmissionStatusTypeID": 200
}