{
    "IsRecentlyVerified": false,
    "ID": 156598,
    "UUID": "27FA7DEE-EB00-4A11-8CE0-03048680251D",
    "DataProviderID": 19,
    "DataProvidersReference": "5596",
    "AddressInfo": {
        "ID": 156952,
        "Title": "Kommunhuset Markaryd",
        "AddressLine1": "Drottninggatan, 11",
        "Town": "MARKARYD",
        "StateOrProvince": "KRONOBERG",
        "Postcode": "28523",
        "CountryID": 216,
        "Latitude": 56.46298,
        "Longitude": 13.596525,
        "AccessComments": "Besöksparkering vid kommunhuset.",
        "DistanceUnit": 0
    },
    "Connections": [
        {
            "ID": 220720,
            "ConnectionTypeID": 25,
            "Reference": "1",
            "LevelID": 3,
            "Amps": 32,
            "Voltage": 400,
            "PowerKW": 22,
            "CurrentTypeID": 30,
            "Comments": "Mode 3"
        },
        {
            "ID": 220721,
            "ConnectionTypeID": 25,
            "Reference": "2",
            "LevelID": 3,
            "Amps": 32,
            "Voltage": 400,
            "PowerKW": 22,
            "CurrentTypeID": 30,
            "Comments": "Mode 3"
        }
    ],
    "NumberOfPoints": 2,
    "StatusTypeID": 0,
    "DateLastStatusUpdate": "2021-03-24T05:10:00Z",
    "DataQualityLevel": 2,
    "DateCreated": "2020-05-26T08:21:00Z",
    "SubmissionStatusTypeID": 100
}