{
    "IsRecentlyVerified": false,
    "ID": 159465,
    "UUID": "9E633401-0E14-49AA-87D1-A91FFFAA54B8",
    "DataProviderID": 2,
    "DataProvidersReference": "156373",
    "OperatorID": 5,
    "UsageTypeID": 1,
    "AddressInfo": {
        "ID": 159822,
        "Title": "DENVER WATER",
        "AddressLine1": "1600 W 12th Ave",
        "Town": "Denver",
        "StateOrProvince": "CO",
        "Postcode": "80204",
        "CountryID": 2,
        "Latitude": 39.7333415,
        "Longitude": -105.0095443,
        "ContactTelephone1": "888-758-4389",
        "AccessComments": "24 hours daily",
        "RelatedURL": "http://www.chargepoint.com/",
        "DistanceUnit": 0
    },
    "Connections": [
        {
            "ID": 229649,
            "ConnectionTypeID": 1,
            "LevelID": 2,
            "Amps": 16,
            "Voltage": 230,
            "PowerKW": 3.7,
            "CurrentTypeID": 10,
            "Quantity": 1
        }
    ],
    "StatusTypeID": 50,
    "DateLastStatusUpdate": "2020-06-26T03:02:00Z",
    "DataQualityLevel": 3,
    "DateCreated": "2020-06-26T03:02:00Z",
    "SubmissionStatusTypeID": 100
}