{
    "IsRecentlyVerified": false,
    "ID": 80263,
    "UUID": "AEB37B45-B468-4E70-865C-8D2C0F0E3F22",
    "DataProviderID": 2,
    "DataProvidersReference": "80543",
    "UsageTypeID": 1,
    "AddressInfo": {
        "ID": 80609,
        "Title": "Carroll Park Golf Course",
        "AddressLine1": "2100 Washington Blvd",
        "Town": "Baltimore",
        "StateOrProvince": "MD",
        "Postcode": "21230",
        "CountryID": 2,
        "Latitude": 39.27267,
        "Longitude": -76.648655,
        "ContactTelephone1": "410-685-8344",
        "AccessComments": "24 hours daily",
        "RelatedURL": "",
        "DistanceUnit": 0
    },
    "Connections": [
        {
            "ID": 114936,
            "ConnectionTypeID": 1,
            "LevelID": 2,
            "Amps": 16,
            "Voltage": 230,
            "PowerKW": 3.7,
            "CurrentTypeID": 10,
            "Quantity": 4
        }
    ],
    "DateLastStatusUpdate": "2020-06-26T03:01:00Z",
    "DataQualityLevel": 3,
    "DateCreated": "2017-01-31T01:05:00Z",
    "SubmissionStatusTypeID": 100
}