{
    "IsRecentlyVerified": false,
    "ID": 139280,
    "UUID": "599916E9-BFE5-4624-9538-21B563B13FDD",
    "DataProviderID": 2,
    "DataProvidersReference": "73960",
    "OperatorID": 5,
    "UsageTypeID": 1,
    "AddressInfo": {
        "ID": 139632,
        "Title": "TURNER PROPERTI",
        "AddressLine1": "Centennial Olympic Park Dr NW",
        "Town": "Atlanta",
        "StateOrProvince": "GA",
        "Postcode": "30303",
        "CountryID": 2,
        "Latitude": 33.7561503,
        "Longitude": -84.3952932,
        "ContactTelephone1": "888-758-4389",
        "AccessComments": "24 hours daily",
        "RelatedURL": "http://www.chargepoint.com/",
        "DistanceUnit": 0
    },
    "Connections": [
        {
            "ID": 194583,
            "ConnectionTypeID": 1,
            "LevelID": 2,
            "Amps": 16,
            "Voltage": 230,
            "PowerKW": 3,
            "CurrentTypeID": 10,
            "Quantity": 10
        }
    ],
    "StatusTypeID": 50,
    "DateLastStatusUpdate": "2019-12-24T09:10:00Z",
    "DataQualityLevel": 3,
    "DateCreated": "2019-12-24T09:10:00Z",
    "SubmissionStatusTypeID": 100
}