{
    "IsRecentlyVerified": false,
    "ID": 91464,
    "UUID": "6BCE9C33-4DAA-4EA5-8F3E-E543C4341759",
    "DataProviderID": 2,
    "DataProvidersReference": "86180",
    "UsageTypeID": 2,
    "AddressInfo": {
        "ID": 91810,
        "Title": "Duke Energy",
        "AddressLine1": "3395 Greenbush St",
        "Town": "Lafayette",
        "StateOrProvince": "IN",
        "Postcode": "47905",
        "CountryID": 2,
        "Latitude": 40.428145,
        "Longitude": -86.85469,
        "ContactTelephone1": "",
        "AccessComments": "Employee and fleet vehicle use only",
        "RelatedURL": "",
        "DistanceUnit": 0
    },
    "Connections": [
        {
            "ID": 129634,
            "ConnectionTypeID": 1,
            "LevelID": 2,
            "Amps": 16,
            "Voltage": 230,
            "PowerKW": 3.7,
            "CurrentTypeID": 10,
            "Quantity": 8
        }
    ],
    "DateLastStatusUpdate": "2020-06-26T03:03:00Z",
    "DataQualityLevel": 3,
    "DateCreated": "2017-08-03T12:25:00Z",
    "SubmissionStatusTypeID": 100
}