{
    "IsRecentlyVerified": false,
    "ID": 180667,
    "UUID": "DD99B5C6-222D-42F5-A1F2-CE1464B1C1CE",
    "DataProviderID": 29,
    "DataProvidersReference": "10141",
    "AddressInfo": {
        "ID": 181026,
        "Title": "Hofgartenweg 14",
        "AddressLine1": "Hofgartenweg 14",
        "Town": "Günzburg",
        "Postcode": "89312",
        "CountryID": 87,
        "Latitude": 48.45288,
        "Longitude": 10.27765,
        "DistanceUnit": 0
    },
    "Connections": [
        {
            "ID": 284030,
            "ConnectionTypeID": 25,
            "StatusTypeID": 50,
            "LevelID": 2,
            "PowerKW": 22,
            "CurrentTypeID": 20
        },
        {
            "ID": 284031,
            "ConnectionTypeID": 25,
            "StatusTypeID": 50,
            "LevelID": 2,
            "PowerKW": 22,
            "CurrentTypeID": 20
        }
    ],
    "StatusTypeID": 50,
    "DateLastStatusUpdate": "2021-07-12T02:41:00Z",
    "MetadataValues": [
        {
            "ID": 12961,
            "MetadataFieldID": 4,
            "ItemValue": "Data from the German chargepoint registry provided by Bundesnetzagentur.de under the CC-BY 4.0 license"
        }
    ],
    "DataQualityLevel": 3,
    "DateCreated": "2021-07-08T10:00:00Z",
    "SubmissionStatusTypeID": 100
}