{
    "UserComments": [
        {
            "ID": 20786,
            "ChargePointID": 106528,
            "CommentTypeID": 10,
            "UserName": "ForumElettrico.it",
            "RelatedURL": "https://www.forumelettrico.it/forum/colonnina-fast-enel-eva-brescia-centro-t3045.html",
            "DateCreated": "2019-03-10T20:26:52.697Z",
            "User": {
                "ID": 11749,
                "Username": "ForumElettrico.it"
            },
            "CheckinStatusTypeID": 10
        }
    ],
    "MediaItems": [
        {
            "ID": 17756,
            "ChargePointID": 106528,
            "ItemURL": "https://s3-ap-southeast-2.amazonaws.com/openchargemap/images/IT/OCM106528/OCM-106528.orig.2019031020271065.jpg",
            "ItemThumbnailURL": "https://s3-ap-southeast-2.amazonaws.com/openchargemap/images/IT/OCM106528/OCM-106528.thmb.2019031020271065.jpg",
            "Comment": "",
            "IsEnabled": true,
            "IsVideo": false,
            "IsFeaturedItem": false,
            "IsExternalResource": false,
            "User": {
                "ID": 11749,
                "Username": "ForumElettrico.it"
            },
            "DateCreated": "2019-03-10T20:27:00Z"
        }
    ],
    "IsRecentlyVerified": false,
    "ID": 106528,
    "UUID": "8FD01C82-0492-4D32-8E3B-ACCF4A45EAB0",
    "DataProviderID": 1,
    "OperatorID": 80,
    "UsageTypeID": 4,
    "AddressInfo": {
        "ID": 106874,
        "Title": "EnelX EVA+ Enel Point Brescia",
        "AddressLine1": "Via Cassala, 13a",
        "Town": "Brescia",
        "StateOrProvince": "BS",
        "Postcode": "25126 ",
        "CountryID": 112,
        "Latitude": 45.53661610175,
        "Longitude": 10.2039154697427,
        "RelatedURL": "https://www.enelx.com/it/it/emobility",
        "DistanceUnit": 0
    },
    "Connections": [
        {
            "ID": 149908,
            "ConnectionTypeID": 33,
            "StatusTypeID": 50,
            "LevelID": 3,
            "Amps": 120,
            "Voltage": 500,
            "PowerKW": 50,
            "CurrentTypeID": 30,
            "Quantity": 1
        },
        {
            "ID": 149909,
            "ConnectionTypeID": 2,
            "StatusTypeID": 50,
            "LevelID": 3,
            "Amps": 120,
            "Voltage": 500,
            "PowerKW": 50,
            "CurrentTypeID": 30,
            "Quantity": 1
        },
        {
            "ID": 149910,
            "ConnectionTypeID": 1036,
            "StatusTypeID": 50,
            "LevelID": 3,
            "Amps": 64,
            "Voltage": 400,
            "PowerKW": 43,
            "CurrentTypeID": 20,
            "Quantity": 1
        }
    ],
    "NumberOfPoints": 2,
    "StatusTypeID": 50,
    "DateLastStatusUpdate": "2019-03-10T20:27:00Z",
    "DataQualityLevel": 1,
    "DateCreated": "2018-06-23T16:09:00Z",
    "SubmissionStatusTypeID": 200
}