{
    "IsRecentlyVerified": false,
    "ID": 142516,
    "UUID": "DA5D5FC0-EFD1-464B-90F8-F015788424B6",
    "DataProviderID": 2,
    "DataProvidersReference": "149542",
    "OperatorID": 5,
    "UsageTypeID": 1,
    "AddressInfo": {
        "ID": 142868,
        "Title": "NYC FLEET",
        "AddressLine1": "3280 Middletown Rd",
        "Town": "Bronx",
        "StateOrProvince": "NY",
        "Postcode": "10465",
        "CountryID": 2,
        "Latitude": 40.84864,
        "Longitude": -73.82195,
        "ContactTelephone1": "888-758-4389",
        "AccessComments": "24 hours daily",
        "RelatedURL": "http://www.chargepoint.com/",
        "DistanceUnit": 0
    },
    "Connections": [
        {
            "ID": 198668,
            "ConnectionTypeID": 1,
            "LevelID": 2,
            "Amps": 16,
            "Voltage": 230,
            "PowerKW": 3,
            "CurrentTypeID": 10,
            "Quantity": 1
        }
    ],
    "StatusTypeID": 50,
    "DateLastStatusUpdate": "2019-12-24T09:18:00Z",
    "DataQualityLevel": 3,
    "DateCreated": "2019-12-24T09:18:00Z",
    "SubmissionStatusTypeID": 100
}