{
    "IsRecentlyVerified": false,
    "ID": 153858,
    "UUID": "242E0D55-2FB6-4CAE-8900-9B5097043A7D",
    "DataProviderID": 28,
    "DataProvidersReference": "FR*S61*P61232A",
    "UsageTypeID": 5,
    "AddressInfo": {
        "ID": 154211,
        "Title": "Lonlay-l'Abbaye | Place Saint-Sauveur",
        "AddressLine1": "Place Saint-Sauveur 61700 Lonlay-l'Abbaye",
        "CountryID": 80,
        "Latitude": 48.645805,
        "Longitude": -0.71019,
        "AccessComments": "24/24 7/7",
        "DistanceUnit": 0
    },
    "Connections": [
        {
            "ID": 216095,
            "ConnectionTypeID": 25,
            "StatusTypeID": 50,
            "LevelID": 2,
            "PowerKW": 18,
            "CurrentTypeID": 20
        },
        {
            "ID": 216096,
            "ConnectionTypeID": 28,
            "StatusTypeID": 50,
            "LevelID": 2,
            "PowerKW": 18,
            "CurrentTypeID": 10
        },
        {
            "ID": 249996,
            "ConnectionTypeID": 25,
            "StatusTypeID": 50,
            "LevelID": 2,
            "PowerKW": 18,
            "CurrentTypeID": 20
        },
        {
            "ID": 249997,
            "ConnectionTypeID": 28,
            "StatusTypeID": 50,
            "LevelID": 2,
            "PowerKW": 18,
            "CurrentTypeID": 10
        }
    ],
    "GeneralComments": "",
    "StatusTypeID": 50,
    "DateLastStatusUpdate": "2020-08-27T05:15:00Z",
    "DataQualityLevel": 2,
    "DateCreated": "2020-03-15T10:54:00Z",
    "SubmissionStatusTypeID": 100
}