{
    "IsRecentlyVerified": false,
    "ID": 185144,
    "UUID": "0CFACEE6-47FC-47A2-A364-70D33A1D1CFB",
    "DataProviderID": 29,
    "DataProvidersReference": "5740",
    "AddressInfo": {
        "ID": 185503,
        "Title": "Domsland 999",
        "AddressLine1": "Domsland 999",
        "Town": "Eckernförde",
        "Postcode": "24340",
        "CountryID": 87,
        "Latitude": 54.449261,
        "Longitude": 9.821455,
        "DistanceUnit": 0
    },
    "Connections": [
        {
            "ID": 294244,
            "ConnectionTypeID": 25,
            "StatusTypeID": 50,
            "LevelID": 2,
            "PowerKW": 22,
            "CurrentTypeID": 20
        },
        {
            "ID": 294245,
            "ConnectionTypeID": 25,
            "StatusTypeID": 50,
            "LevelID": 2,
            "PowerKW": 22,
            "CurrentTypeID": 20
        }
    ],
    "StatusTypeID": 50,
    "DateLastStatusUpdate": "2021-07-12T02:52:00Z",
    "MetadataValues": [
        {
            "ID": 17435,
            "MetadataFieldID": 4,
            "ItemValue": "Data from the German chargepoint registry provided by Bundesnetzagentur.de under the CC-BY 4.0 license"
        }
    ],
    "DataQualityLevel": 3,
    "DateCreated": "2021-07-08T10:06:00Z",
    "SubmissionStatusTypeID": 100
}