{
    "UserComments": [
        {
            "ID": 6286,
            "ChargePointID": 42512,
            "CommentTypeID": 10,
            "UserName": "Håkan Karlsson",
            "Comment": "Charged my Renault Zoe without any problem",
            "Rating": 5,
            "DateCreated": "2015-08-23T21:19:47.353Z",
            "User": {
                "ID": 6265,
                "Username": "Håkan Karlsson"
            },
            "CheckinStatusTypeID": 10
        }
    ],
    "MediaItems": [
        {
            "ID": 3094,
            "ChargePointID": 42512,
            "ItemURL": "https://s3-ap-southeast-2.amazonaws.com/openchargemap/images/SE/OCM42512/OCM-42512.orig.2015082519443454.jpg",
            "ItemThumbnailURL": "https://s3-ap-southeast-2.amazonaws.com/openchargemap/images/SE/OCM42512/OCM-42512.thmb.2015082519443454.jpg",
            "Comment": "Charging here several times each week.",
            "IsEnabled": true,
            "IsVideo": false,
            "IsFeaturedItem": false,
            "IsExternalResource": false,
            "User": {
                "ID": 6272,
                "Username": "Hakan Karlsson"
            },
            "DateCreated": "2015-08-25T19:45:00Z"
        }
    ],
    "IsRecentlyVerified": false,
    "ID": 42512,
    "UUID": "1082A31F-1D2F-4DF9-9FB5-DB233DDEA4A9",
    "DataProviderID": 1,
    "OperatorID": 1,
    "UsageTypeID": 1,
    "UsageCost": "Free",
    "AddressInfo": {
        "ID": 42858,
        "Title": "Nya Stadens Torg",
        "AddressLine1": "-",
        "Town": "lidköping",
        "Postcode": "53131",
        "CountryID": 216,
        "Latitude": 58.5041994075517,
        "Longitude": 13.1580483913422,
        "RelatedURL": "http://www.lidkoping.se",
        "DistanceUnit": 0
    },
    "Connections": [
        {
            "ID": 51190,
            "ConnectionTypeID": 28,
            "StatusTypeID": 50,
            "LevelID": 1,
            "Voltage": 220,
            "CurrentTypeID": 10,
            "Quantity": 2
        },
        {
            "ID": 51191,
            "ConnectionTypeID": 25,
            "StatusTypeID": 50,
            "LevelID": 2,
            "Voltage": 400,
            "PowerKW": 11,
            "CurrentTypeID": 20,
            "Quantity": 2
        }
    ],
    "NumberOfPoints": 4,
    "StatusTypeID": 50,
    "DateLastStatusUpdate": "2015-08-26T14:24:00Z",
    "DataQualityLevel": 1,
    "DateCreated": "2015-03-13T09:15:00Z",
    "SubmissionStatusTypeID": 200
}