{
    "IsRecentlyVerified": false,
    "ID": 135950,
    "UUID": "3298C7D1-FFBD-4C31-80D4-8D3CEEB54193",
    "DataProviderID": 18,
    "DataProvidersReference": "dc5d87d4ede18ef011716f8e60b6964b",
    "OperatorID": 2244,
    "UsageTypeID": 5,
    "AddressInfo": {
        "ID": 136296,
        "Title": "Alexandra Road",
        "AddressLine1": "Alexandra Road",
        "Town": "Richmond",
        "Postcode": "TW9 2BT",
        "CountryID": 1,
        "Latitude": 51.472931,
        "Longitude": -0.289523,
        "AccessComments": "",
        "RelatedURL": "https://www.ubitricity.com",
        "DistanceUnit": 0
    },
    "Connections": [
        {
            "ID": 190376,
            "ConnectionTypeID": 25,
            "Reference": "suby1100001526",
            "StatusTypeID": 50,
            "LevelID": 2,
            "Amps": 16,
            "Voltage": 230,
            "PowerKW": 3.7,
            "CurrentTypeID": 10
        }
    ],
    "StatusTypeID": 0,
    "DateLastStatusUpdate": "2021-04-25T05:46:00Z",
    "MetadataValues": [
        {
            "ID": 5802,
            "MetadataFieldID": 4,
            "ItemValue": "Contains public sector information licensed under the Open Government Licence v2.0. http://www.nationalarchives.gov.uk/doc/open-government-licence/version/2/"
        }
    ],
    "DataQualityLevel": 3,
    "DateCreated": "2019-12-24T05:22:00Z",
    "SubmissionStatusTypeID": 100
}