{
    "IsRecentlyVerified": false,
    "ID": 88946,
    "UUID": "3CE667AA-EDBA-419E-B43E-91582B8DCB4E",
    "DataProviderID": 1,
    "OperatorID": 80,
    "UsageTypeID": 4,
    "UsageCost": "0,40 €/kW",
    "AddressInfo": {
        "ID": 89292,
        "Title": "Eneldrive Campi Sportivi",
        "AddressLine1": "Via Vittorio Emanuele III",
        "Town": "Copertino",
        "StateOrProvince": "LE",
        "Postcode": "73043 ",
        "CountryID": 112,
        "Latitude": 40.28070615159471,
        "Longitude": 18.065555702077955,
        "RelatedURL": "http://eneldrive.it",
        "DistanceUnit": 0
    },
    "Connections": [
        {
            "ID": 126225,
            "ConnectionTypeID": 25,
            "StatusTypeID": 50,
            "LevelID": 2,
            "Amps": 32,
            "Voltage": 400,
            "PowerKW": 22,
            "CurrentTypeID": 20,
            "Quantity": 1
        },
        {
            "ID": 126226,
            "ConnectionTypeID": 36,
            "StatusTypeID": 50,
            "LevelID": 2,
            "Amps": 16,
            "Voltage": 240,
            "PowerKW": 3.7,
            "CurrentTypeID": 10,
            "Quantity": 1
        }
    ],
    "NumberOfPoints": 2,
    "StatusTypeID": 50,
    "DateLastStatusUpdate": "2017-06-13T09:21:00Z",
    "DataQualityLevel": 1,
    "DateCreated": "2017-06-13T09:21:00Z",
    "SubmissionStatusTypeID": 200
}