{
    "IsRecentlyVerified": false,
    "ID": 136396,
    "UUID": "34853557-0977-491C-A409-7AF23623D5C3",
    "DataProviderID": 18,
    "DataProvidersReference": "41212a9d660d861b9d5bd9c37de55961",
    "OperatorID": 2244,
    "UsageTypeID": 5,
    "AddressInfo": {
        "ID": 136742,
        "Title": "Cumberland Market",
        "AddressLine1": "Cumberland Market",
        "Town": "London",
        "Postcode": "NW1 3QL",
        "CountryID": 1,
        "Latitude": 51.529084,
        "Longitude": -0.142585,
        "AccessComments": "",
        "RelatedURL": "https://www.ubitricity.com",
        "DistanceUnit": 0
    },
    "Connections": [
        {
            "ID": 190840,
            "ConnectionTypeID": 25,
            "Reference": "suby1100001921",
            "StatusTypeID": 50,
            "LevelID": 2,
            "Amps": 16,
            "Voltage": 230,
            "PowerKW": 3.7,
            "CurrentTypeID": 10
        }
    ],
    "StatusTypeID": 0,
    "DateLastStatusUpdate": "2021-04-25T05:46:00Z",
    "MetadataValues": [
        {
            "ID": 6248,
            "MetadataFieldID": 4,
            "ItemValue": "Contains public sector information licensed under the Open Government Licence v2.0. http://www.nationalarchives.gov.uk/doc/open-government-licence/version/2/"
        }
    ],
    "DataQualityLevel": 3,
    "DateCreated": "2019-12-24T05:22:00Z",
    "SubmissionStatusTypeID": 100
}