{
    "IsRecentlyVerified": true,
    "DateLastVerified": "2021-08-05T07:13:00Z",
    "ID": 188619,
    "UUID": "8378C905-24B9-4974-A690-DFF01092814E",
    "DataProviderID": 1,
    "OperatorID": 3364,
    "UsageTypeID": 4,
    "UsageCost": "250",
    "AddressInfo": {
        "ID": 188978,
        "Title": "E2 Vitacura",
        "AddressLine1": "Costanera Norte Km.7,65 eje Oriente Poniente E-2",
        "AddressLine2": "Autopista Costanera Norte",
        "Town": "Vitacura",
        "Postcode": "7640165",
        "CountryID": 49,
        "Latitude": -33.38242990484983,
        "Longitude": -70.58944606765004,
        "AccessComments": "Costanera Norte sentido oriente-poniente entre Américo Vespucio y salida Lo Curro",
        "RelatedURL": "https://copecvoltex.cl/",
        "DistanceUnit": 0
    },
    "Connections": [
        {
            "ID": 304668,
            "ConnectionTypeID": 1036,
            "StatusTypeID": 50,
            "LevelID": 3,
            "Amps": 63,
            "Voltage": 400,
            "PowerKW": 43,
            "CurrentTypeID": 20,
            "Quantity": 1
        },
        {
            "ID": 304669,
            "ConnectionTypeID": 2,
            "StatusTypeID": 50,
            "LevelID": 3,
            "PowerKW": 50,
            "CurrentTypeID": 30,
            "Quantity": 1
        },
        {
            "ID": 304670,
            "ConnectionTypeID": 33,
            "StatusTypeID": 50,
            "LevelID": 3,
            "PowerKW": 50,
            "CurrentTypeID": 30,
            "Quantity": 1
        }
    ],
    "NumberOfPoints": 1,
    "StatusTypeID": 50,
    "DateLastStatusUpdate": "2021-08-17T19:22:00Z",
    "DataQualityLevel": 1,
    "DateCreated": "2021-08-05T07:13:00Z",
    "SubmissionStatusTypeID": 200
}