{
    "IsRecentlyVerified": false,
    "ID": 179186,
    "UUID": "9107A229-3FBF-413D-A1C5-D88F15AD1070",
    "DataProviderID": 29,
    "DataProvidersReference": "17265",
    "AddressInfo": {
        "ID": 179545,
        "Title": "Schülperbaum 4",
        "AddressLine1": "Schülperbaum 4",
        "Town": "Kiel",
        "Postcode": "24103",
        "CountryID": 87,
        "Latitude": 54.319767,
        "Longitude": 10.12846,
        "DistanceUnit": 0
    },
    "Connections": [
        {
            "ID": 280667,
            "ConnectionTypeID": 25,
            "StatusTypeID": 50,
            "LevelID": 2,
            "PowerKW": 22,
            "CurrentTypeID": 20
        },
        {
            "ID": 280668,
            "ConnectionTypeID": 25,
            "StatusTypeID": 50,
            "LevelID": 2,
            "PowerKW": 22,
            "CurrentTypeID": 20
        }
    ],
    "StatusTypeID": 50,
    "DateLastStatusUpdate": "2021-07-12T02:52:00Z",
    "MetadataValues": [
        {
            "ID": 11480,
            "MetadataFieldID": 4,
            "ItemValue": "Data from the German chargepoint registry provided by Bundesnetzagentur.de under the CC-BY 4.0 license"
        }
    ],
    "DataQualityLevel": 3,
    "DateCreated": "2021-07-08T09:59:00Z",
    "SubmissionStatusTypeID": 100
}