{
    "IsRecentlyVerified": false,
    "ID": 116178,
    "UUID": "3F01B2B6-9234-4836-8040-AFBFE463A02B",
    "DataProviderID": 2,
    "DataProvidersReference": "114136",
    "OperatorID": 23,
    "UsageTypeID": 1,
    "AddressInfo": {
        "ID": 116524,
        "Title": "Schweitzer Mountain Resort - Tesla Destination",
        "AddressLine1": "10000 Schweitzer Mountain Rd",
        "Town": "Sandpoint",
        "StateOrProvince": "ID",
        "Postcode": "83864",
        "CountryID": 2,
        "Latitude": 48.363797,
        "Longitude": -116.623785,
        "ContactTelephone1": "208-263-9555  877-798-3752",
        "AccessComments": "24 hours daily; for Tesla use only",
        "RelatedURL": "https://www.tesla.com/destination-charging",
        "DistanceUnit": 0
    },
    "Connections": [
        {
            "ID": 163251,
            "ConnectionTypeID": 0,
            "LevelID": 2,
            "Amps": 16,
            "Voltage": 230,
            "PowerKW": 3,
            "CurrentTypeID": 10,
            "Quantity": 2
        }
    ],
    "DateLastStatusUpdate": "2019-04-06T05:07:00Z",
    "DataQualityLevel": 3,
    "DateCreated": "2019-02-11T07:13:00Z",
    "SubmissionStatusTypeID": 100
}