{
    "IsRecentlyVerified": false,
    "ID": 75299,
    "UUID": "3D9611A6-67B6-42C8-A791-76076BD33920",
    "DataProviderID": 1,
    "OperatorID": 23,
    "OperatorsReference": "18320",
    "UsageTypeID": 6,
    "UsageCost": "Free",
    "AddressInfo": {
        "ID": 75645,
        "Title": "Hôtel Sezz Saint-Tropez - Restaurant Colette",
        "AddressLine1": "151 Route des Salins",
        "Town": "Saint-Tropez",
        "Postcode": "83990",
        "CountryID": 80,
        "Latitude": 43.263864,
        "Longitude": 6.669508,
        "ContactTelephone1": "+33 4 94 55 31 55",
        "DistanceUnit": 0
    },
    "Connections": [
        {
            "ID": 108604,
            "ConnectionTypeID": 30,
            "StatusTypeID": 50,
            "LevelID": 2,
            "Amps": 32,
            "Voltage": 400,
            "PowerKW": 22,
            "CurrentTypeID": 20,
            "Quantity": 2
        }
    ],
    "NumberOfPoints": 2,
    "GeneralComments": "2 Tesla Connector, up to 22kW.Available for patrons only. Please see valet.",
    "StatusTypeID": 50,
    "DateLastStatusUpdate": "2018-10-03T15:20:00Z",
    "DataQualityLevel": 1,
    "DateCreated": "2016-12-14T17:01:00Z",
    "SubmissionStatusTypeID": 200
}