{
    "IsRecentlyVerified": false,
    "ID": 167826,
    "UUID": "7183DB38-85D5-4F2A-92D2-1714989D25CB",
    "DataProviderID": 1,
    "OperatorID": 21,
    "UsageTypeID": 4,
    "UsageCost": "Mobi.E compatible card",
    "AddressInfo": {
        "ID": 168185,
        "Title": "ETR-00003",
        "AddressLine1": "Rua da Restauração",
        "Town": "Estarreja",
        "StateOrProvince": "Aveiro",
        "Postcode": "3860-360 Estarreja",
        "CountryID": 180,
        "Latitude": 40.754343267896104,
        "Longitude": -8.570615471096744,
        "DistanceUnit": 0
    },
    "Connections": [
        {
            "ID": 254812,
            "ConnectionTypeID": 25,
            "StatusTypeID": 50,
            "LevelID": 2,
            "Amps": 32,
            "Voltage": 400,
            "PowerKW": 22,
            "CurrentTypeID": 20,
            "Quantity": 2
        }
    ],
    "NumberOfPoints": 2,
    "StatusTypeID": 50,
    "DateLastStatusUpdate": "2021-01-22T17:54:00Z",
    "DataQualityLevel": 1,
    "DateCreated": "2020-09-14T19:48:00Z",
    "SubmissionStatusTypeID": 200
}