{
    "IsRecentlyVerified": false,
    "ID": 96933,
    "UUID": "E4E5B37D-A22E-4B77-B7AA-8454A0038808",
    "DataProviderID": 1,
    "OperatorID": 3,
    "OperatorsReference": "PG-81629",
    "UsageTypeID": 6,
    "UsageCost": "1",
    "AddressInfo": {
        "ID": 97279,
        "Title": "Evans Halshaw Leeds-Hyundai",
        "AddressLine1": "151 Gelderd Road",
        "Town": "West Yorkshire",
        "Postcode": "LS12 6BZ",
        "CountryID": 1,
        "Latitude": 53.782499,
        "Longitude": -1.577008,
        "DistanceUnit": 0
    },
    "Connections": [
        {
            "ID": 137314,
            "ConnectionTypeID": 25,
            "StatusTypeID": 50,
            "LevelID": 2,
            "Amps": 32,
            "Voltage": 230,
            "PowerKW": 7,
            "CurrentTypeID": 10,
            "Quantity": 2
        }
    ],
    "NumberOfPoints": 6,
    "GeneralComments": "This is an open charge unit installed at the Evans Halshaw Leeds - Hyundai dealership in Gelderd Road, Leeds, West Yorkshire",
    "StatusTypeID": 0,
    "DateLastStatusUpdate": "2020-02-12T11:49:00Z",
    "DataQualityLevel": 1,
    "DateCreated": "2018-01-03T06:29:00Z",
    "SubmissionStatusTypeID": 200
}