{
    "IsRecentlyVerified": false,
    "ID": 84031,
    "UUID": "A228DB50-A12A-4C85-954F-071D311932D1",
    "DataProviderID": 1,
    "OperatorID": 45,
    "UsageTypeID": 6,
    "AddressInfo": {
        "ID": 84377,
        "Title": "Bio-Seminarhotel Lebensquelle",
        "AddressLine1": "Dietershaner Straße 29",
        "Town": "Fulda",
        "StateOrProvince": "Landkreis Fulda",
        "Postcode": "36039",
        "CountryID": 87,
        "Latitude": 50.600628,
        "Longitude": 9.700052599999935,
        "ContactTelephone1": "+49 6616 7915454",
        "AccessComments": "Tesla Destination Charging location mit 2 Lademöglichkeiten. ",
        "RelatedURL": "http://hofgut.eu/",
        "DistanceUnit": 0
    },
    "Connections": [
        {
            "ID": 119432,
            "ConnectionTypeID": 1036,
            "StatusTypeID": 50,
            "LevelID": 2,
            "Amps": 16,
            "Voltage": 230,
            "PowerKW": 3.7,
            "CurrentTypeID": 10,
            "Quantity": 2
        }
    ],
    "NumberOfPoints": 2,
    "StatusTypeID": 50,
    "DateLastStatusUpdate": "2017-02-16T07:02:00Z",
    "DataQualityLevel": 1,
    "DateCreated": "2017-02-16T07:02:00Z",
    "SubmissionStatusTypeID": 200
}