{
    "IsRecentlyVerified": false,
    "ID": 104914,
    "UUID": "E13D7F65-9791-4700-A488-79AFA9BAEAFC",
    "DataProviderID": 1,
    "OperatorID": 23,
    "OperatorsReference": "43384",
    "UsageTypeID": 4,
    "AddressInfo": {
        "ID": 105260,
        "Title": "Radisson Blu Hôtel Nice",
        "AddressLine1": "223 Promenade des Anglais",
        "Town": "Nice",
        "Postcode": "6200",
        "CountryID": 80,
        "Latitude": 43.684438,
        "Longitude": 7.235148,
        "ContactTelephone1": "+33 4 97 17 71 77",
        "DistanceUnit": 0
    },
    "Connections": [
        {
            "ID": 147987,
            "ConnectionTypeID": 30,
            "StatusTypeID": 50,
            "LevelID": 2,
            "Amps": 16,
            "Voltage": 400,
            "PowerKW": 11,
            "CurrentTypeID": 20,
            "Quantity": 2
        }
    ],
    "NumberOfPoints": 2,
    "GeneralComments": "2 Tesla Connectors, up to 11kW.Available for customers. Please see valet.",
    "StatusTypeID": 50,
    "DateLastStatusUpdate": "2018-10-03T19:55:00Z",
    "DataQualityLevel": 1,
    "DateCreated": "2018-05-26T05:31:00Z",
    "SubmissionStatusTypeID": 200
}