{
    "IsRecentlyVerified": false,
    "ID": 162669,
    "UUID": "CE8A6B14-6CD8-489A-B83E-9831DB27991F",
    "DataProviderID": 1,
    "OperatorID": 136,
    "UsageTypeID": 4,
    "UsageCost": "0,20€/kWh",
    "AddressInfo": {
        "ID": 163026,
        "Title": "Tuusulan kunta Urheilupuisto",
        "AddressLine1": "Kilpailukuja 7",
        "Town": "Tuusula",
        "StateOrProvince": "Southern Finland",
        "Postcode": "04300",
        "CountryID": 79,
        "Latitude": 60.39294136988977,
        "Longitude": 25.02892323829792,
        "RelatedURL": "http://www.virta.fi",
        "DistanceUnit": 0
    },
    "Connections": [
        {
            "ID": 234128,
            "ConnectionTypeID": 25,
            "StatusTypeID": 50,
            "LevelID": 2,
            "Amps": 32,
            "Voltage": 400,
            "PowerKW": 22,
            "CurrentTypeID": 20,
            "Quantity": 4
        }
    ],
    "NumberOfPoints": 4,
    "StatusTypeID": 50,
    "DateLastStatusUpdate": "2020-08-14T13:30:00Z",
    "DataQualityLevel": 1,
    "DateCreated": "2020-08-13T23:45:00Z",
    "SubmissionStatusTypeID": 200
}