{
    "IsRecentlyVerified": false,
    "ID": 184266,
    "UUID": "C38A1B00-AA8C-4319-AB3B-0E84736D5777",
    "DataProviderID": 29,
    "DataProvidersReference": "14130",
    "OperatorID": 103,
    "AddressInfo": {
        "ID": 184625,
        "Title": "Stauderstraße 63",
        "AddressLine1": "Stauderstraße 63",
        "Town": "Essen",
        "Postcode": "45326",
        "CountryID": 87,
        "Latitude": 51.495944,
        "Longitude": 7.017153,
        "DistanceUnit": 0
    },
    "Connections": [
        {
            "ID": 292306,
            "ConnectionTypeID": 25,
            "StatusTypeID": 50,
            "LevelID": 2,
            "PowerKW": 22,
            "CurrentTypeID": 20
        },
        {
            "ID": 292307,
            "ConnectionTypeID": 25,
            "StatusTypeID": 50,
            "LevelID": 2,
            "PowerKW": 22,
            "CurrentTypeID": 20
        },
        {
            "ID": 292308,
            "ConnectionTypeID": 25,
            "StatusTypeID": 50,
            "LevelID": 3,
            "PowerKW": 50,
            "CurrentTypeID": 20
        }
    ],
    "StatusTypeID": 50,
    "DateLastStatusUpdate": "2021-07-12T02:47:00Z",
    "MetadataValues": [
        {
            "ID": 16557,
            "MetadataFieldID": 4,
            "ItemValue": "Data from the German chargepoint registry provided by Bundesnetzagentur.de under the CC-BY 4.0 license"
        }
    ],
    "DataQualityLevel": 3,
    "DateCreated": "2021-07-08T10:05:00Z",
    "SubmissionStatusTypeID": 100
}