{
    "IsRecentlyVerified": false,
    "ID": 5314,
    "UUID": "D9E911B6-D0CB-45A4-8F76-848F6D8C20DF",
    "DataProviderID": 1,
    "OperatorID": 20,
    "OperatorsReference": "20018,20077",
    "UsageTypeID": 4,
    "UsageCost": "£1.00/charge admin fee",
    "AddressInfo": {
        "ID": 5253,
        "Title": "Housesteads Car Park",
        "AddressLine1": "Military Road",
        "Town": "Bardon Mill",
        "StateOrProvince": "Northumberland",
        "Postcode": "NE47 6NN",
        "CountryID": 1,
        "Latitude": 55.0115825,
        "Longitude": -2.3187093,
        "DistanceUnit": 0
    },
    "Connections": [
        {
            "ID": 424,
            "ConnectionTypeID": 3,
            "StatusTypeID": 100,
            "LevelID": 2,
            "Amps": 13,
            "Voltage": 230,
            "PowerKW": 3,
            "CurrentTypeID": 10,
            "Quantity": 2
        },
        {
            "ID": 72878,
            "ConnectionTypeID": 25,
            "StatusTypeID": 100,
            "LevelID": 2,
            "Amps": 32,
            "Voltage": 230,
            "PowerKW": 7,
            "CurrentTypeID": 10,
            "Quantity": 1
        }
    ],
    "NumberOfPoints": 2,
    "StatusTypeID": 100,
    "DateLastStatusUpdate": "2017-10-25T05:14:00Z",
    "DataQualityLevel": 1,
    "DateCreated": "2011-08-24T15:40:00Z",
    "SubmissionStatusTypeID": 200
}