{
    "IsRecentlyVerified": false,
    "ID": 116359,
    "UUID": "F8927259-4444-4C43-B15D-BC456CDDEB7D",
    "DataProviderID": 1,
    "DataProvidersReference": "5349",
    "AddressInfo": {
        "ID": 116705,
        "Title": "E.ON besöksparkering Norrköping",
        "AddressLine1": "Östra Promenaden 5",
        "Town": "NORRKÖPING",
        "StateOrProvince": "ÖSTERGÖTLAND",
        "Postcode": "60171",
        "CountryID": 216,
        "Latitude": 58.592345,
        "Longitude": 16.198192,
        "AccessComments": "E.ON besöksparkering Norrköping",
        "DistanceUnit": 0
    },
    "Connections": [
        {
            "ID": 163953,
            "ConnectionTypeID": 0,
            "Reference": "1",
            "LevelID": 2,
            "Amps": 32,
            "Voltage": 400,
            "PowerKW": 22,
            "Comments": "Mode 3"
        },
        {
            "ID": 163954,
            "ConnectionTypeID": 0,
            "Reference": "2",
            "LevelID": 2,
            "Amps": 32,
            "Voltage": 400,
            "PowerKW": 22,
            "Comments": "Mode 3"
        }
    ],
    "NumberOfPoints": 2,
    "DateLastStatusUpdate": "2020-05-26T08:22:00Z",
    "DataQualityLevel": 2,
    "DateCreated": "2019-02-11T09:16:00Z",
    "SubmissionStatusTypeID": 100
}