{
    "IsRecentlyVerified": false,
    "ID": 121266,
    "UUID": "408DDC4F-EC76-47D4-AB77-B9243825BAAD",
    "DataProviderID": 2,
    "DataProvidersReference": "118044",
    "OperatorID": 5,
    "UsageTypeID": 1,
    "AddressInfo": {
        "ID": 121612,
        "Title": "MASTERCARD INT",
        "AddressLine1": "2000 Purchase St",
        "Town": "Harrison",
        "StateOrProvince": "NY",
        "Postcode": "10577",
        "CountryID": 2,
        "Latitude": 41.024512,
        "Longitude": -73.711257,
        "ContactTelephone1": "888-758-4389",
        "AccessComments": "24 hours daily",
        "RelatedURL": "http://www.chargepoint.com/",
        "DistanceUnit": 0
    },
    "Connections": [
        {
            "ID": 170706,
            "ConnectionTypeID": 1,
            "LevelID": 2,
            "Amps": 16,
            "Voltage": 230,
            "PowerKW": 3.7,
            "CurrentTypeID": 10,
            "Quantity": 10
        }
    ],
    "DateLastStatusUpdate": "2020-06-26T03:03:00Z",
    "DataQualityLevel": 3,
    "DateCreated": "2019-04-01T05:00:00Z",
    "SubmissionStatusTypeID": 100
}