{
    "IsRecentlyVerified": false,
    "ID": 62687,
    "UUID": "C55136B6-73B3-4944-9FDF-0CE695926BAA",
    "DataProviderID": 26,
    "DataProvidersReference": "19826",
    "OperatorID": 162,
    "OperatorsReference": "㈱日産サティオ新潟西長岡本社店",
    "UsageCost": "0.00 onbekend",
    "AddressInfo": {
        "ID": 63033,
        "Title": "長岡中之島見附線",
        "AddressLine1": "長岡中之島見附線",
        "Town": "南魚沼郡",
        "Postcode": "",
        "CountryID": 114,
        "Latitude": 37.404308,
        "Longitude": 138.834137,
        "DistanceUnit": 0
    },
    "Connections": [
        {
            "ID": 79610,
            "ConnectionTypeID": 2,
            "LevelID": 3,
            "PowerKW": 50,
            "CurrentTypeID": 30
        }
    ],
    "NumberOfPoints": 1,
    "StatusTypeID": 50,
    "DateLastStatusUpdate": "2016-03-03T12:29:00Z",
    "DataQualityLevel": 3,
    "DateCreated": "2016-03-03T12:29:00Z",
    "SubmissionStatusTypeID": 100
}