{
    "IsRecentlyVerified": false,
    "ID": 180132,
    "UUID": "22340FEE-8909-447D-95CE-C3A91BB531D7",
    "DataProviderID": 29,
    "DataProvidersReference": "18586",
    "OperatorID": 3403,
    "AddressInfo": {
        "ID": 180491,
        "Title": "Fabrikstraße 1",
        "AddressLine1": "Fabrikstraße 1",
        "Town": "Stendal",
        "Postcode": "39576",
        "CountryID": 87,
        "Latitude": 52.604368,
        "Longitude": 11.867295,
        "DistanceUnit": 0
    },
    "Connections": [
        {
            "ID": 282840,
            "ConnectionTypeID": 25,
            "StatusTypeID": 50,
            "LevelID": 2,
            "PowerKW": 11,
            "CurrentTypeID": 20
        },
        {
            "ID": 282841,
            "ConnectionTypeID": 25,
            "StatusTypeID": 50,
            "LevelID": 2,
            "PowerKW": 22,
            "CurrentTypeID": 20
        }
    ],
    "StatusTypeID": 50,
    "DateLastStatusUpdate": "2021-07-12T02:50:00Z",
    "MetadataValues": [
        {
            "ID": 12426,
            "MetadataFieldID": 4,
            "ItemValue": "Data from the German chargepoint registry provided by Bundesnetzagentur.de under the CC-BY 4.0 license"
        }
    ],
    "DataQualityLevel": 3,
    "DateCreated": "2021-07-08T10:00:00Z",
    "SubmissionStatusTypeID": 100
}