{
    "MediaItems": [
        {
            "ID": 29610,
            "ChargePointID": 188338,
            "ItemURL": "https://s3-ap-southeast-2.amazonaws.com/openchargemap/images/PT/OCM188338/OCM-188338.orig.2021102323004713.jpg",
            "ItemThumbnailURL": "https://s3-ap-southeast-2.amazonaws.com/openchargemap/images/PT/OCM188338/OCM-188338.thmb.2021102323004713.jpg",
            "Comment": "",
            "IsEnabled": true,
            "IsVideo": false,
            "IsFeaturedItem": false,
            "IsExternalResource": false,
            "User": {
                "ID": 34537,
                "Username": "Joao Lopes"
            },
            "DateCreated": "2021-10-23T23:01:00Z"
        }
    ],
    "IsRecentlyVerified": false,
    "ID": 188338,
    "UUID": "78565A09-7F3A-4E87-9B72-94EC8B8EF430",
    "DataProviderID": 1,
    "OperatorID": 21,
    "UsageTypeID": 4,
    "UsageCost": "Mobi.E compatible card or App",
    "AddressInfo": {
        "ID": 188697,
        "Title": "SNS-00003 Intermarché",
        "AddressLine1": "Intermarché",
        "Town": "Sines",
        "StateOrProvince": "Setúbal",
        "Postcode": "7520-001",
        "CountryID": 180,
        "Latitude": 37.965135285888366,
        "Longitude": -8.85853855007781,
        "DistanceUnit": 0
    },
    "Connections": [
        {
            "ID": 304058,
            "ConnectionTypeID": 2,
            "StatusTypeID": 50,
            "LevelID": 3,
            "Amps": 120,
            "Voltage": 500,
            "PowerKW": 50,
            "CurrentTypeID": 30,
            "Quantity": 1
        },
        {
            "ID": 304059,
            "ConnectionTypeID": 33,
            "StatusTypeID": 50,
            "LevelID": 3,
            "Amps": 125,
            "Voltage": 500,
            "PowerKW": 50,
            "CurrentTypeID": 30,
            "Quantity": 1
        }
    ],
    "NumberOfPoints": 1,
    "StatusTypeID": 50,
    "DateLastStatusUpdate": "2021-10-23T23:01:00Z",
    "DataQualityLevel": 1,
    "DateCreated": "2021-07-18T13:37:00Z",
    "SubmissionStatusTypeID": 200
}