{
    "IsRecentlyVerified": false,
    "ID": 142796,
    "UUID": "0A7E965D-EEFF-4B13-A47B-F6AEA4E9CEBE",
    "DataProviderID": 2,
    "DataProvidersReference": "124345",
    "OperatorID": 15,
    "UsageTypeID": 4,
    "AddressInfo": {
        "ID": 143148,
        "Title": "The Shoppes at Fox Run 1",
        "AddressLine1": "25 Welles St # 55",
        "Town": "Glastonbury",
        "StateOrProvince": "CT",
        "Postcode": "06033",
        "CountryID": 2,
        "Latitude": 41.714088,
        "Longitude": -72.608292,
        "ContactTelephone1": "877-455-3833",
        "AccessComments": "24 hours daily\r\nPublic - Card key at all times",
        "RelatedURL": "https://www.evgo.com/",
        "DistanceUnit": 0
    },
    "Connections": [
        {
            "ID": 199014,
            "ConnectionTypeID": 2,
            "LevelID": 3,
            "Amps": 100,
            "Voltage": 400,
            "PowerKW": 40,
            "CurrentTypeID": 30,
            "Quantity": 1
        },
        {
            "ID": 199015,
            "ConnectionTypeID": 32,
            "LevelID": 3,
            "Amps": 100,
            "Voltage": 400,
            "PowerKW": 40,
            "CurrentTypeID": 30,
            "Quantity": 1
        }
    ],
    "StatusTypeID": 50,
    "DateLastStatusUpdate": "2020-06-26T03:04:00Z",
    "DataQualityLevel": 3,
    "DateCreated": "2019-12-24T09:19:00Z",
    "SubmissionStatusTypeID": 100
}