{
    "IsRecentlyVerified": false,
    "ID": 166986,
    "UUID": "A9F325A1-23E0-46E2-B812-41CA569DCF9C",
    "DataProviderID": 18,
    "DataProvidersReference": "ec269de89a9bcdde00aab32a340cee51",
    "OperatorID": 150,
    "UsageTypeID": 5,
    "AddressInfo": {
        "ID": 167345,
        "Title": "282 Outland Road",
        "AddressLine1": "282 Outland Road",
        "Town": "Plymouth",
        "Postcode": "PL3 5UQ",
        "CountryID": 1,
        "Latitude": 50.39681,
        "Longitude": -4.140532,
        "AccessComments": "",
        "RelatedURL": "http://www.chargepointservices.com/",
        "DistanceUnit": 0
    },
    "Connections": [
        {
            "ID": 252793,
            "ConnectionTypeID": 25,
            "Reference": "1",
            "StatusTypeID": 50,
            "LevelID": 2,
            "Amps": 32,
            "Voltage": 400,
            "PowerKW": 22,
            "CurrentTypeID": 20
        },
        {
            "ID": 252794,
            "ConnectionTypeID": 2,
            "Reference": "2",
            "StatusTypeID": 50,
            "LevelID": 3,
            "Amps": 125,
            "Voltage": 400,
            "PowerKW": 50,
            "CurrentTypeID": 30
        },
        {
            "ID": 252795,
            "ConnectionTypeID": 1036,
            "Reference": "3",
            "StatusTypeID": 50,
            "LevelID": 3,
            "Amps": 125,
            "Voltage": 400,
            "PowerKW": 50,
            "CurrentTypeID": 30
        }
    ],
    "StatusTypeID": 0,
    "DateLastStatusUpdate": "2021-07-12T03:38:00Z",
    "MetadataValues": [
        {
            "ID": 7743,
            "MetadataFieldID": 4,
            "ItemValue": "Contains public sector information licensed under the Open Government Licence v2.0. http://www.nationalarchives.gov.uk/doc/open-government-licence/version/2/"
        }
    ],
    "DataQualityLevel": 3,
    "DateCreated": "2020-08-27T08:10:00Z",
    "SubmissionStatusTypeID": 100
}