{
    "IsRecentlyVerified": false,
    "ID": 175144,
    "UUID": "613B8A49-BCD0-403C-8EDC-8BC393F74728",
    "DataProviderID": 1,
    "OperatorID": 21,
    "UsageTypeID": 4,
    "UsageCost": "Mobi.E compatible card or App",
    "AddressInfo": {
        "ID": 175503,
        "Title": "CTB-00014 - Lidl",
        "AddressLine1": "Avenida Professor Doutor Egas Moniz",
        "Town": "Castelo Branco",
        "StateOrProvince": "Castelo Branco",
        "Postcode": "6000-767",
        "CountryID": 180,
        "Latitude": 39.810211756282115,
        "Longitude": -7.512878485707915,
        "DistanceUnit": 0
    },
    "Connections": [
        {
            "ID": 271489,
            "ConnectionTypeID": 2,
            "StatusTypeID": 50,
            "LevelID": 3,
            "Amps": 120,
            "Voltage": 500,
            "PowerKW": 50,
            "CurrentTypeID": 20,
            "Quantity": 1
        },
        {
            "ID": 271490,
            "ConnectionTypeID": 33,
            "StatusTypeID": 50,
            "LevelID": 3,
            "Amps": 125,
            "Voltage": 500,
            "PowerKW": 50,
            "CurrentTypeID": 20,
            "Quantity": 1
        },
        {
            "ID": 271491,
            "ConnectionTypeID": 1036,
            "StatusTypeID": 50,
            "LevelID": 3,
            "Amps": 63,
            "Voltage": 400,
            "PowerKW": 43,
            "CurrentTypeID": 20,
            "Quantity": 1
        }
    ],
    "NumberOfPoints": 2,
    "StatusTypeID": 50,
    "DateLastStatusUpdate": "2021-05-01T11:35:00Z",
    "DataQualityLevel": 1,
    "DateCreated": "2021-04-28T15:09:00Z",
    "SubmissionStatusTypeID": 200
}