{
    "IsRecentlyVerified": false,
    "ID": 44832,
    "UUID": "D95855B9-50C4-4DD2-91D9-44DBE557F996",
    "DataProviderID": 1,
    "DataProvidersReference": "2698",
    "AddressInfo": {
        "ID": 45178,
        "Title": "Vattenfall InCharge Snabbladdning",
        "AddressLine1": "Bobergsgatan 15",
        "Town": "STOCKHOLM",
        "StateOrProvince": "STOCKHOLM",
        "Postcode": "11455",
        "CountryID": 216,
        "Latitude": 59.3577,
        "Longitude": 18.08842,
        "AccessComments": "Snabbladdaren är placerat på kontorsvillans parkering.",
        "DistanceUnit": 0
    },
    "Connections": [
        {
            "ID": 55127,
            "ConnectionTypeID": 0,
            "Reference": "1",
            "LevelID": 2,
            "Amps": 100,
            "Voltage": 500,
            "PowerKW": 50,
            "Comments": "Mode 4"
        },
        {
            "ID": 84704,
            "ConnectionTypeID": 0,
            "Reference": "2",
            "LevelID": 2,
            "Amps": 100,
            "Voltage": 500,
            "PowerKW": 50,
            "Comments": "Mode 4"
        },
        {
            "ID": 88243,
            "ConnectionTypeID": 0,
            "Reference": "3",
            "LevelID": 2,
            "Amps": 63,
            "Voltage": 400,
            "PowerKW": 43,
            "Comments": "Mode 3"
        }
    ],
    "NumberOfPoints": 3,
    "DateLastStatusUpdate": "2020-05-26T08:22:00Z",
    "DataQualityLevel": 2,
    "DateCreated": "2015-04-19T05:51:00Z",
    "SubmissionStatusTypeID": 100
}