{
    "IsRecentlyVerified": false,
    "ID": 143196,
    "UUID": "DBB76301-F737-4488-9E65-A10A49EE195E",
    "DataProviderID": 2,
    "DataProvidersReference": "143257",
    "OperatorID": 5,
    "UsageTypeID": 1,
    "AddressInfo": {
        "ID": 143548,
        "Title": "MA PORTFOLIO",
        "AddressLine1": "105 Edgewater Pl",
        "Town": "Wakefield",
        "StateOrProvince": "MA",
        "Postcode": "01880",
        "CountryID": 2,
        "Latitude": 42.5235652,
        "Longitude": -71.0426866,
        "ContactTelephone1": "888-758-4389",
        "AccessComments": "24 hours daily",
        "RelatedURL": "http://www.chargepoint.com/",
        "DistanceUnit": 0
    },
    "Connections": [
        {
            "ID": 199479,
            "ConnectionTypeID": 1,
            "LevelID": 2,
            "Amps": 16,
            "Voltage": 230,
            "PowerKW": 3.7,
            "CurrentTypeID": 10,
            "Quantity": 2
        }
    ],
    "StatusTypeID": 50,
    "DateLastStatusUpdate": "2020-06-26T03:06:00Z",
    "DataQualityLevel": 3,
    "DateCreated": "2019-12-24T09:20:00Z",
    "SubmissionStatusTypeID": 100
}