{
    "IsRecentlyVerified": false,
    "ID": 85625,
    "UUID": "D22D034B-4FEC-4C62-8244-0A4D71E72287",
    "DataProviderID": 1,
    "OperatorID": 3266,
    "UsageTypeID": 4,
    "UsageCost": "0",
    "AddressInfo": {
        "ID": 85971,
        "Title": "Feuerwehr",
        "AddressLine1": "Kertelheinallee 6a",
        "Town": "Nieblum",
        "StateOrProvince": "Föhr-Amrum",
        "Postcode": "25938",
        "CountryID": 87,
        "Latitude": 54.691911496829206,
        "Longitude": 8.488469250926167,
        "AccessComments": "Auf dem Parkplatz hinter der Sparkasse. 24/7 nutzbar mit PlugSurfing App. Laden ist kostenlos.",
        "DistanceUnit": 0
    },
    "Connections": [
        {
            "ID": 121738,
            "ConnectionTypeID": 25,
            "StatusTypeID": 50,
            "LevelID": 2,
            "Amps": 32,
            "Voltage": 400,
            "PowerKW": 22,
            "CurrentTypeID": 20,
            "Quantity": 2
        }
    ],
    "NumberOfPoints": 2,
    "StatusTypeID": 50,
    "DateLastStatusUpdate": "2017-04-10T04:53:00Z",
    "DataQualityLevel": 1,
    "DateCreated": "2017-04-10T04:53:00Z",
    "SubmissionStatusTypeID": 200
}