{
    "IsRecentlyVerified": false,
    "ID": 155529,
    "UUID": "CDA5599A-8539-469B-81A0-A0D63D218C57",
    "DataProviderID": 1,
    "OperatorID": 3310,
    "UsageTypeID": 4,
    "UsageCost": "free charge, pay park",
    "AddressInfo": {
        "ID": 155883,
        "Title": "Reid Promenade Car Park",
        "AddressLine1": "",
        "CountryID": 18,
        "Latitude": -31.7424275967972,
        "Longitude": 115.77324685429267,
        "DistanceUnit": 0
    },
    "Connections": [
        {
            "ID": 218949,
            "ConnectionTypeID": 1,
            "StatusTypeID": 50,
            "LevelID": 2,
            "PowerKW": 7,
            "CurrentTypeID": 10,
            "Quantity": 1
        }
    ],
    "NumberOfPoints": 2,
    "StatusTypeID": 50,
    "DateLastStatusUpdate": "2021-10-13T06:02:00Z",
    "DataQualityLevel": 1,
    "DateCreated": "2020-04-16T21:51:00Z",
    "SubmissionStatusTypeID": 200
}