{
    "IsRecentlyVerified": false,
    "ID": 75260,
    "UUID": "716B280D-9394-43DC-91F5-0E7A205121A6",
    "DataProviderID": 1,
    "OperatorID": 23,
    "OperatorsReference": "19946",
    "UsageTypeID": 6,
    "UsageCost": "Free",
    "AddressInfo": {
        "ID": 75606,
        "Title": "Hôtel l'Estelle en Camargue",
        "AddressLine1": "Route du Petit Rhône D38",
        "Town": "Saintes-Maries-de-la-Mer",
        "Postcode": "13460",
        "CountryID": 80,
        "Latitude": 43.47028,
        "Longitude": 4.395165,
        "ContactTelephone1": "+33 4 90 97 89 01",
        "DistanceUnit": 0
    },
    "Connections": [
        {
            "ID": 108565,
            "ConnectionTypeID": 30,
            "StatusTypeID": 50,
            "LevelID": 2,
            "Amps": 32,
            "Voltage": 230,
            "PowerKW": 17,
            "CurrentTypeID": 20,
            "Quantity": 1
        }
    ],
    "NumberOfPoints": 1,
    "GeneralComments": "1 Tesla Connector, up to 17kW.Available for patrons only. Please see front desk.",
    "StatusTypeID": 50,
    "DateLastStatusUpdate": "2018-10-03T19:50:00Z",
    "DataQualityLevel": 1,
    "DateCreated": "2016-12-14T16:37:00Z",
    "SubmissionStatusTypeID": 200
}