{
    "IsRecentlyVerified": false,
    "ID": 41312,
    "UUID": "4A66972A-2A08-4B0B-B3B7-D2ADCCBB4EEB",
    "DataProviderID": 1,
    "OperatorID": 105,
    "UsageTypeID": 4,
    "UsageCost": "Free",
    "AddressInfo": {
        "ID": 41658,
        "Title": "VR Bank eG",
        "AddressLine1": "Hauptstr. 30",
        "Town": "Niebüll",
        "StateOrProvince": "Südtondern",
        "Postcode": "25899",
        "CountryID": 87,
        "Latitude": 54.7872594261692,
        "Longitude": 8.82721626752856,
        "ContactTelephone1": "+49466160180",
        "AccessComments": "Weißer Triplecharger Ladesäule auf dem Kundenparkplatz der Bank ganz hinten. Zufahrt nur über die Böhmestraße möglich. 24/7 kostenlos nutzbar. ",
        "RelatedURL": "http://www.stadtwerke-niebuell.de/site.php",
        "DistanceUnit": 0
    },
    "Connections": [
        {
            "ID": 45132,
            "ConnectionTypeID": 2,
            "StatusTypeID": 50,
            "LevelID": 3,
            "PowerKW": 50,
            "CurrentTypeID": 30,
            "Quantity": 1
        },
        {
            "ID": 45133,
            "ConnectionTypeID": 1036,
            "StatusTypeID": 50,
            "LevelID": 2,
            "Amps": 32,
            "Voltage": 400,
            "PowerKW": 22,
            "CurrentTypeID": 20,
            "Quantity": 1
        },
        {
            "ID": 103798,
            "ConnectionTypeID": 33,
            "StatusTypeID": 50,
            "LevelID": 3,
            "PowerKW": 50,
            "CurrentTypeID": 30,
            "Quantity": 1
        }
    ],
    "NumberOfPoints": 3,
    "StatusTypeID": 50,
    "DateLastStatusUpdate": "2016-10-14T05:32:00Z",
    "DataQualityLevel": 1,
    "DateCreated": "2015-01-31T11:13:00Z",
    "SubmissionStatusTypeID": 200
}