{
    "MediaItems": [
        {
            "ID": 22799,
            "ChargePointID": 146242,
            "ItemURL": "https://s3-ap-southeast-2.amazonaws.com/openchargemap/images/ES/OCM146242/OCM-146242.orig.2020062616524937.jpg",
            "ItemThumbnailURL": "https://s3-ap-southeast-2.amazonaws.com/openchargemap/images/ES/OCM146242/OCM-146242.thmb.2020062616524937.jpg",
            "Comment": "",
            "IsEnabled": true,
            "IsVideo": false,
            "IsFeaturedItem": false,
            "IsExternalResource": false,
            "User": {
                "ID": 23477,
                "Username": "AquaHotel Aquamarina"
            },
            "DateCreated": "2020-06-26T16:53:00Z"
        },
        {
            "ID": 22798,
            "ChargePointID": 146242,
            "ItemURL": "https://s3-ap-southeast-2.amazonaws.com/openchargemap/images/ES/OCM146242/OCM-146242.orig.2020062616521709.jpg",
            "ItemThumbnailURL": "https://s3-ap-southeast-2.amazonaws.com/openchargemap/images/ES/OCM146242/OCM-146242.thmb.2020062616521709.jpg",
            "Comment": "",
            "IsEnabled": true,
            "IsVideo": false,
            "IsFeaturedItem": false,
            "IsExternalResource": false,
            "User": {
                "ID": 23477,
                "Username": "AquaHotel Aquamarina"
            },
            "DateCreated": "2020-06-26T16:52:00Z"
        }
    ],
    "IsRecentlyVerified": false,
    "ID": 146242,
    "UUID": "596F360C-3D5A-4DCE-82AA-27070E375216",
    "DataProviderID": 1,
    "OperatorID": 1,
    "UsageTypeID": 5,
    "UsageCost": "10€",
    "AddressInfo": {
        "ID": 146594,
        "Title": "Aqua Hotel Aquamarina & Spa",
        "AddressLine1": "Avinguda del Mar, 16",
        "Town": "Santa Susanna",
        "Postcode": "08398",
        "CountryID": 210,
        "Latitude": 41.634727544588884,
        "Longitude": 2.721072568805994,
        "ContactTelephone1": "+34 937 678 060",
        "ContactEmail": "booking@aquahotel.com",
        "RelatedURL": "https://www.aquahotel.com/hoteles/aquamarina-spa/",
        "DistanceUnit": 0
    },
    "Connections": [
        {
            "ID": 203219,
            "ConnectionTypeID": 25,
            "StatusTypeID": 50,
            "LevelID": 3,
            "Amps": 32,
            "Voltage": 400,
            "PowerKW": 22,
            "CurrentTypeID": 30,
            "Quantity": 1
        }
    ],
    "NumberOfPoints": 1,
    "GeneralComments": "The charging point is located in the garage. Go to reception first.",
    "StatusTypeID": 50,
    "DateLastStatusUpdate": "2020-06-26T16:53:00Z",
    "DataQualityLevel": 1,
    "DateCreated": "2020-01-03T12:17:00Z",
    "SubmissionStatusTypeID": 200
}