{
    "IsRecentlyVerified": false,
    "ID": 104522,
    "UUID": "A857567B-2156-4C5F-8FDE-DAD160E7D1A5",
    "DataProviderID": 1,
    "OperatorID": 3253,
    "OperatorsReference": "AT*SMA*EDE0801786*001AC,AT*SMA*EDE0801786*001AC,AT*SMA*EDE0801786*002AC",
    "UsageTypeID": 1,
    "UsageCost": "€0,15/min ; Andere Tarife möglich",
    "AddressInfo": {
        "ID": 104868,
        "Title": "Ladestation SW Bühl",
        "AddressLine1": "Stollhofener Straße 32",
        "Town": "Lichtenau-Ulm",
        "StateOrProvince": "Baden-Württemberg",
        "Postcode": "77839",
        "CountryID": 87,
        "Latitude": 48.732862,
        "Longitude": 8.008835,
        "DistanceUnit": 0
    },
    "Connections": [
        {
            "ID": 147528,
            "ConnectionTypeID": 25,
            "StatusTypeID": 0,
            "LevelID": 2,
            "Amps": 32,
            "Voltage": 400,
            "PowerKW": 22,
            "CurrentTypeID": 20,
            "Quantity": 6
        }
    ],
    "NumberOfPoints": 6,
    "StatusTypeID": 0,
    "DateLastStatusUpdate": "2019-06-12T14:14:00Z",
    "DataQualityLevel": 1,
    "DateCreated": "2018-05-21T05:40:00Z",
    "SubmissionStatusTypeID": 200
}