{
    "IsRecentlyVerified": false,
    "ID": 144466,
    "UUID": "07490E68-6F95-4E06-89E1-F0A908968D6B",
    "DataProviderID": 2,
    "DataProvidersReference": "147851",
    "OperatorID": 39,
    "UsageTypeID": 1,
    "AddressInfo": {
        "ID": 144818,
        "Title": "INDIGO @ 12 west",
        "AddressLine1": "430 SW 13th Ave.",
        "Town": "Portland",
        "StateOrProvince": "OR",
        "Postcode": "97205",
        "CountryID": 2,
        "Latitude": 45.5223977,
        "Longitude": -122.6841263,
        "ContactTelephone1": "800-663-5633",
        "AccessComments": "MO: 12:00am-12:00am; TU: 12:00am-12:00am; WE: 12:00am-12:00am; TH: 12:00am-12:00am; FR: 12:00am-12:00am; SA: 12:00am-12:00am; SU: 12:00am-12:00am",
        "RelatedURL": "http://www.semacharge.com/",
        "DistanceUnit": 0
    },
    "Connections": [
        {
            "ID": 200973,
            "ConnectionTypeID": 1,
            "LevelID": 2,
            "Amps": 16,
            "Voltage": 230,
            "PowerKW": 3.7,
            "CurrentTypeID": 10,
            "Quantity": 2
        }
    ],
    "StatusTypeID": 50,
    "DateLastStatusUpdate": "2020-06-26T03:09:00Z",
    "DataQualityLevel": 3,
    "DateCreated": "2019-12-24T09:23:00Z",
    "SubmissionStatusTypeID": 100
}