{
    "IsRecentlyVerified": false,
    "ID": 65508,
    "UUID": "F2F0B886-6D7C-4EEB-8727-C25327BE2511",
    "DataProviderID": 26,
    "DataProvidersReference": "84459",
    "OperatorID": 73,
    "OperatorsReference": "EV-Box EVB-P1607250",
    "UsageCost": "0.00 jaarabonnement",
    "AddressInfo": {
        "ID": 65854,
        "Title": "Want 12",
        "AddressLine1": "Want 12",
        "Town": "Rotterdam",
        "Postcode": "3192 NN",
        "CountryID": 159,
        "Latitude": 51.85156,
        "Longitude": 4.37604,
        "RelatedURL": "http://www.ev-box.nl",
        "DistanceUnit": 0
    },
    "Connections": [
        {
            "ID": 90287,
            "ConnectionTypeID": 25,
            "LevelID": 2,
            "PowerKW": 11,
            "CurrentTypeID": 10
        },
        {
            "ID": 90288,
            "ConnectionTypeID": 25,
            "LevelID": 2,
            "PowerKW": 11,
            "CurrentTypeID": 10
        }
    ],
    "NumberOfPoints": 1,
    "StatusTypeID": 50,
    "DateLastStatusUpdate": "2016-06-04T02:41:00Z",
    "DataQualityLevel": 3,
    "DateCreated": "2016-04-27T09:41:00Z",
    "SubmissionStatusTypeID": 100
}