{
    "IsRecentlyVerified": false,
    "ID": 173657,
    "UUID": "B36AA71E-3A4A-4475-8F16-4B1EF0C083F3",
    "DataProviderID": 18,
    "DataProvidersReference": "c6160b0e7c84f3f6ed551013921d9778",
    "UsageTypeID": 1,
    "AddressInfo": {
        "ID": 174016,
        "Title": "Bridge Street",
        "AddressLine1": "Bridge Street",
        "Town": "Llandybber",
        "Postcode": "SA40 9XX",
        "CountryID": 1,
        "Latitude": 52.075911,
        "Longitude": -4.158837,
        "AccessComments": "",
        "RelatedURL": "http://www.clenerg-ev.com/",
        "DistanceUnit": 0
    },
    "Connections": [
        {
            "ID": 266781,
            "ConnectionTypeID": 25,
            "Reference": "Connector 1",
            "StatusTypeID": 50,
            "LevelID": 2,
            "Amps": 32,
            "Voltage": 400,
            "PowerKW": 22,
            "CurrentTypeID": 20
        },
        {
            "ID": 266782,
            "ConnectionTypeID": 25,
            "Reference": "Connector 2",
            "StatusTypeID": 50,
            "LevelID": 2,
            "Amps": 32,
            "Voltage": 400,
            "PowerKW": 22,
            "CurrentTypeID": 20
        }
    ],
    "StatusTypeID": 0,
    "DateLastStatusUpdate": "2021-03-03T11:25:00Z",
    "MetadataValues": [
        {
            "ID": 8579,
            "MetadataFieldID": 4,
            "ItemValue": "Contains public sector information licensed under the Open Government Licence v2.0. http://www.nationalarchives.gov.uk/doc/open-government-licence/version/2/"
        }
    ],
    "DataQualityLevel": 3,
    "DateCreated": "2021-03-03T11:25:00Z",
    "SubmissionStatusTypeID": 100
}