{
    "UserComments": [
        {
            "ID": 3808,
            "ChargePointID": 13314,
            "CommentTypeID": 10,
            "UserName": "Leafspy",
            "Comment": "Usually has Council Ampera plugged in during the week but weekends it's usually kindly unplugged so you can access type 2 rather than 3 pin!",
            "Rating": 5,
            "DateCreated": "2015-02-18T08:44:02.733Z",
            "User": {
                "ID": 4610,
                "Username": "Leafspy"
            },
            "CheckinStatusTypeID": 10
        }
    ],
    "IsRecentlyVerified": false,
    "ID": 13314,
    "UUID": "BC2534E2-FC89-44A7-9D23-F3F0BB8D88D5",
    "DataProviderID": 1,
    "OperatorID": 32,
    "OperatorsReference": "11157",
    "UsageTypeID": 4,
    "UsageCost": "Inclusive; for Polar Plus subscription members only. Parking fees apply.",
    "AddressInfo": {
        "ID": 13211,
        "Title": "Wychavon District Council",
        "AddressLine1": "Civic Centre",
        "AddressLine2": "Queen Elizabeth Drive",
        "Town": "Pershore",
        "StateOrProvince": "Worcestershire",
        "Postcode": "WR10 1PT",
        "CountryID": 1,
        "Latitude": 52.114662,
        "Longitude": -2.078315,
        "ContactTelephone1": "01386 565000",
        "ContactEmail": "service@wychavon.gov.uk",
        "AccessComments": "Public access, Please report to reception",
        "RelatedURL": "http://www.wychavon.gov.uk/cms/default.aspx",
        "DistanceUnit": 0
    },
    "Connections": [
        {
            "ID": 10733,
            "ConnectionTypeID": 25,
            "StatusTypeID": 50,
            "LevelID": 2,
            "Amps": 32,
            "Voltage": 230,
            "PowerKW": 7,
            "CurrentTypeID": 10,
            "Quantity": 2
        },
        {
            "ID": 19612,
            "ConnectionTypeID": 3,
            "StatusTypeID": 0,
            "LevelID": 2,
            "Amps": 13,
            "Voltage": 230,
            "PowerKW": 3,
            "CurrentTypeID": 10,
            "Quantity": 1
        }
    ],
    "NumberOfPoints": 2,
    "GeneralComments": "One charging point, two sockets, RFID card accessed, , One three pin BS1363 socket, rated at 3kW (mode 2; standard charge), , One seven pin Type 2 socket rated at 7kW, (mode 3; fast charge), , Fitted under Midlands PiP",
    "StatusTypeID": 50,
    "DateLastStatusUpdate": "2019-03-05T06:23:00Z",
    "DataQualityLevel": 3,
    "DateCreated": "2012-09-08T22:20:00Z",
    "SubmissionStatusTypeID": 200
}