{
    "IsRecentlyVerified": false,
    "ID": 45740,
    "UUID": "088F7E9F-45FC-4DFB-BE76-DCC6D156DF59",
    "DataProviderID": 1,
    "AddressInfo": {
        "ID": 46086,
        "Title": "E 6",
        "AddressLine1": "E 6",
        "AddressLine2": "Håby",
        "Town": "Munkedals kommun",
        "StateOrProvince": "Munkedals kommun",
        "Postcode": "45591",
        "CountryID": 216,
        "Latitude": 58.489606016107956,
        "Longitude": 11.622542017553315,
        "AccessComments": "På McDonalds parkering i Munkedal.",
        "DistanceUnit": 0
    },
    "Connections": [
        {
            "ID": 56403,
            "ConnectionTypeID": 2,
            "Reference": "1",
            "LevelID": 3,
            "Amps": 100,
            "Voltage": 500,
            "PowerKW": 50,
            "CurrentTypeID": 30,
            "Comments": "Mode 4"
        },
        {
            "ID": 84096,
            "ConnectionTypeID": 33,
            "Reference": "2",
            "LevelID": 3,
            "Amps": 100,
            "Voltage": 500,
            "PowerKW": 50,
            "CurrentTypeID": 30,
            "Comments": "Mode 4"
        },
        {
            "ID": 84097,
            "ConnectionTypeID": 25,
            "Reference": "3",
            "LevelID": 3,
            "Amps": 32,
            "Voltage": 400,
            "PowerKW": 12,
            "CurrentTypeID": 30,
            "Comments": "Mode 3"
        },
        {
            "ID": 87989,
            "ConnectionTypeID": 25,
            "Reference": "4",
            "LevelID": 2,
            "Amps": 16,
            "Voltage": 230,
            "PowerKW": 3.7,
            "CurrentTypeID": 10,
            "Comments": "Mode 3"
        }
    ],
    "NumberOfPoints": 4,
    "StatusTypeID": 0,
    "DateLastStatusUpdate": "2020-03-02T16:51:00Z",
    "DataQualityLevel": 2,
    "DateCreated": "2015-05-03T00:54:00Z",
    "SubmissionStatusTypeID": 100
}