{
    "UserComments": [
        {
            "ID": 6789,
            "ChargePointID": 48825,
            "CommentTypeID": 10,
            "UserName": "Neil MacLennan",
            "Comment": "Nice spot to stop for coffe and cake too!",
            "DateCreated": "2015-10-15T17:50:24.377Z",
            "User": {
                "ID": 6192,
                "Username": "Neil MacLennan"
            },
            "CheckinStatusTypeID": 10
        },
        {
            "ID": 6299,
            "ChargePointID": 48825,
            "CommentTypeID": 10,
            "UserName": "Richardt",
            "Comment": "",
            "Rating": 4,
            "DateCreated": "2015-08-24T18:12:13.687Z",
            "User": {
                "ID": 6270,
                "Username": "Richardt"
            },
            "CheckinStatusTypeID": 10
        }
    ],
    "MediaItems": [
        {
            "ID": 3089,
            "ChargePointID": 48825,
            "ItemURL": "https://s3-ap-southeast-2.amazonaws.com/openchargemap/images/GB/OCM48825/OCM-48825.orig.2015082418103439.jpg",
            "ItemThumbnailURL": "https://s3-ap-southeast-2.amazonaws.com/openchargemap/images/GB/OCM48825/OCM-48825.thmb.2015082418103439.jpg",
            "Comment": "",
            "IsEnabled": true,
            "IsVideo": false,
            "IsFeaturedItem": false,
            "IsExternalResource": false,
            "User": {
                "ID": 6270,
                "Username": "Richardt"
            },
            "DateCreated": "2015-08-24T18:11:00Z"
        }
    ],
    "IsRecentlyVerified": false,
    "ID": 48825,
    "UUID": "832E1E82-78B3-4686-8F21-E743ADABE940",
    "DataProviderID": 1,
    "OperatorID": 3315,
    "OperatorsReference": "51091",
    "UsageTypeID": 4,
    "UsageCost": "Free",
    "AddressInfo": {
        "ID": 49171,
        "Title": "Mhor 84 Motel",
        "AddressLine1": "Balquhidder",
        "Town": "Nr Lochearnhead",
        "StateOrProvince": "Stirlingshire",
        "Postcode": "FK19 8NY",
        "CountryID": 1,
        "Latitude": 56.3537433991699,
        "Longitude": -4.32612419128418,
        "DistanceUnit": 0
    },
    "Connections": [
        {
            "ID": 60335,
            "ConnectionTypeID": 25,
            "Reference": "51091",
            "StatusTypeID": 100,
            "LevelID": 2,
            "Amps": 32,
            "Voltage": 230,
            "PowerKW": 7,
            "CurrentTypeID": 10,
            "Quantity": 2
        }
    ],
    "NumberOfPoints": 2,
    "StatusTypeID": 100,
    "DateLastStatusUpdate": "2021-07-18T15:18:00Z",
    "DataQualityLevel": 1,
    "DateCreated": "2015-07-02T18:36:00Z",
    "SubmissionStatusTypeID": 200
}