{
    "IsRecentlyVerified": false,
    "ID": 12953,
    "UUID": "F0B51FAA-0ADE-415D-B232-872B10ABD1BF",
    "DataProviderID": 15,
    "DataProvidersReference": "19950",
    "OperatorID": 42,
    "UsageTypeID": 1,
    "AddressInfo": {
        "ID": 12850,
        "Title": "6815 Main Street",
        "AddressLine1": "6815 Main Street",
        "Town": "Wilmington",
        "StateOrProvince": "NC",
        "Postcode": "28405",
        "CountryID": 2,
        "Latitude": 34.24319,
        "Longitude": -77.83144,
        "ContactTelephone1": "910-256-5131",
        "RelatedURL": "http://carstations.com/19950",
        "DistanceUnit": 0
    },
    "Connections": [
        {
            "ID": 10386,
            "ConnectionTypeID": 1,
            "Reference": "J1772",
            "LevelID": 2
        }
    ],
    "NumberOfPoints": 2,
    "StatusTypeID": 0,
    "DateLastStatusUpdate": "2017-11-04T14:04:00Z",
    "DataQualityLevel": 2,
    "DateCreated": "2012-09-07T19:25:00Z",
    "SubmissionStatusTypeID": 100
}