{
    "IsRecentlyVerified": false,
    "ID": 41817,
    "UUID": "FFEC43C9-31B6-4DCB-A3BD-334FE882D2A3",
    "DataProviderID": 1,
    "OperatorID": 45,
    "UsageTypeID": 1,
    "AddressInfo": {
        "ID": 42163,
        "Title": "McDonalds Restaurant",
        "AddressLine1": "Roßlauer Weg 2-4",
        "Town": "Mannheim",
        "StateOrProvince": "Mannheim",
        "Postcode": "68309",
        "CountryID": 87,
        "Latitude": 49.5148316,
        "Longitude": 8.54732899999999,
        "ContactTelephone1": "0621 701046",
        "AccessComments": "So,Mo-Do 9-24, Fr/Sa 9-2Uhr geöffnet, Ladesäule auf Kundenparkplatz",
        "RelatedURL": "http://www.mcdonalds.de/restaurant?id=722",
        "DistanceUnit": 0
    },
    "Connections": [
        {
            "ID": 50090,
            "ConnectionTypeID": 25,
            "StatusTypeID": 50,
            "LevelID": 2,
            "Amps": 16,
            "Voltage": 400,
            "PowerKW": 11,
            "CurrentTypeID": 20,
            "Quantity": 1
        },
        {
            "ID": 50091,
            "ConnectionTypeID": 28,
            "StatusTypeID": 50,
            "LevelID": 2,
            "Amps": 16,
            "Voltage": 230,
            "PowerKW": 3.7,
            "CurrentTypeID": 10,
            "Quantity": 1
        }
    ],
    "NumberOfPoints": 2,
    "StatusTypeID": 50,
    "DateLastStatusUpdate": "2015-02-12T21:10:00Z",
    "DataQualityLevel": 1,
    "DateCreated": "2015-02-10T14:24:00Z",
    "SubmissionStatusTypeID": 200
}