{
    "IsRecentlyVerified": false,
    "ID": 183481,
    "UUID": "8A05DA0A-E900-420E-8882-4A3406647A7A",
    "DataProviderID": 29,
    "DataProvidersReference": "4600",
    "OperatorID": 189,
    "AddressInfo": {
        "ID": 183840,
        "Title": "Pappelallee 1",
        "AddressLine1": "Pappelallee 1",
        "Town": "Buchbach",
        "Postcode": "84428",
        "CountryID": 87,
        "Latitude": 48.313242,
        "Longitude": 12.274037,
        "DistanceUnit": 0
    },
    "Connections": [
        {
            "ID": 290533,
            "ConnectionTypeID": 25,
            "StatusTypeID": 50,
            "LevelID": 2,
            "PowerKW": 22,
            "CurrentTypeID": 20
        },
        {
            "ID": 290534,
            "ConnectionTypeID": 25,
            "StatusTypeID": 50,
            "LevelID": 2,
            "PowerKW": 22,
            "CurrentTypeID": 20
        }
    ],
    "StatusTypeID": 50,
    "DateLastStatusUpdate": "2021-07-12T02:40:00Z",
    "MetadataValues": [
        {
            "ID": 15774,
            "MetadataFieldID": 4,
            "ItemValue": "Data from the German chargepoint registry provided by Bundesnetzagentur.de under the CC-BY 4.0 license"
        }
    ],
    "DataQualityLevel": 3,
    "DateCreated": "2021-07-08T10:04:00Z",
    "SubmissionStatusTypeID": 100
}