{
    "IsRecentlyVerified": false,
    "ID": 56235,
    "UUID": "F19B9CF0-F5EA-4013-9661-E0EB1B170598",
    "DataProviderID": 1,
    "OperatorID": 45,
    "UsageTypeID": 1,
    "AddressInfo": {
        "ID": 56581,
        "Title": "Ferienpark Aulatal ",
        "AddressLine1": "In den langen Stangen 1",
        "Town": "Oberaula",
        "StateOrProvince": "Schwalm-Eder-Kreis",
        "Postcode": "36280",
        "CountryID": 87,
        "Latitude": 50.84539067677054,
        "Longitude": 9.450237955281077,
        "ContactTelephone1": "+49 6625 919597",
        "AccessComments": "Auf dem Parkplatz , 24/7 ohne Ladekarte nutzbar.",
        "RelatedURL": "http://www.rotkaeppchenland.de/",
        "DistanceUnit": 0
    },
    "Connections": [
        {
            "ID": 70884,
            "ConnectionTypeID": 28,
            "StatusTypeID": 50,
            "LevelID": 2,
            "Amps": 16,
            "Voltage": 230,
            "PowerKW": 3.7,
            "CurrentTypeID": 10,
            "Quantity": 1
        }
    ],
    "NumberOfPoints": 1,
    "StatusTypeID": 50,
    "DateLastStatusUpdate": "2015-10-22T07:17:00Z",
    "DataQualityLevel": 1,
    "DateCreated": "2015-10-22T07:17:00Z",
    "SubmissionStatusTypeID": 200
}