{
    "IsRecentlyVerified": false,
    "ID": 95210,
    "UUID": "F8F9A828-C983-434B-BC9A-790114BC0ED0",
    "DataProviderID": 1,
    "OperatorID": 23,
    "OperatorsReference": "37214",
    "UsageTypeID": 4,
    "AddressInfo": {
        "ID": 95556,
        "Title": "La Grande Terrasse Hôtel & Spa Mgallery",
        "AddressLine1": "La Falaise",
        "Town": "Chatelaillon-Plage",
        "Postcode": "17340",
        "CountryID": 80,
        "Latitude": 46.058665,
        "Longitude": -1.087989,
        "ContactTelephone1": "+33 5 46 56 14 14",
        "DistanceUnit": 0
    },
    "Connections": [
        {
            "ID": 134878,
            "ConnectionTypeID": 30,
            "StatusTypeID": 50,
            "LevelID": 2,
            "Amps": 32,
            "Voltage": 400,
            "PowerKW": 22,
            "CurrentTypeID": 20,
            "Quantity": 2
        }
    ],
    "NumberOfPoints": 2,
    "GeneralComments": "2 Tesla Connectors, up to 22kW.Available for customers. Please call ahead.",
    "StatusTypeID": 50,
    "DateLastStatusUpdate": "2018-10-03T21:21:00Z",
    "DataQualityLevel": 1,
    "DateCreated": "2017-11-05T06:56:00Z",
    "SubmissionStatusTypeID": 200
}