{
    "IsRecentlyVerified": false,
    "ID": 143158,
    "UUID": "8F61C864-71CE-45A1-A1BF-5F4EE52101E6",
    "DataProviderID": 2,
    "DataProvidersReference": "143427",
    "OperatorID": 5,
    "UsageTypeID": 1,
    "AddressInfo": {
        "ID": 143510,
        "Title": "BLAKELEY PROP",
        "AddressLine1": "36 Knox Trail",
        "Town": "Acton",
        "StateOrProvince": "MA",
        "Postcode": "01720",
        "CountryID": 2,
        "Latitude": 42.4459237,
        "Longitude": -71.4258002,
        "ContactTelephone1": "888-758-4389",
        "AccessComments": "24 hours daily",
        "RelatedURL": "http://www.chargepoint.com/",
        "DistanceUnit": 0
    },
    "Connections": [
        {
            "ID": 199430,
            "ConnectionTypeID": 1,
            "LevelID": 2,
            "Amps": 16,
            "Voltage": 230,
            "PowerKW": 3.7,
            "CurrentTypeID": 10,
            "Quantity": 2
        }
    ],
    "StatusTypeID": 50,
    "DateLastStatusUpdate": "2020-06-26T03:06:00Z",
    "DataQualityLevel": 3,
    "DateCreated": "2019-12-24T09:20:00Z",
    "SubmissionStatusTypeID": 100
}