{
    "IsRecentlyVerified": false,
    "ID": 62657,
    "UUID": "881EC1DB-A0B0-4DE7-A5C6-CB62C5DB99C0",
    "DataProviderID": 26,
    "DataProvidersReference": "19959",
    "OperatorID": 162,
    "OperatorsReference": "ひだ荘川温泉 桜香の湯",
    "UsageCost": "0.00 onbekend",
    "AddressInfo": {
        "ID": 63003,
        "Title": "158",
        "AddressLine1": "158",
        "Town": "高山市",
        "Postcode": "",
        "CountryID": 114,
        "Latitude": 36.021168,
        "Longitude": 136.965256,
        "DistanceUnit": 0
    },
    "Connections": [
        {
            "ID": 79579,
            "ConnectionTypeID": 2,
            "LevelID": 3,
            "PowerKW": 50,
            "CurrentTypeID": 30
        }
    ],
    "NumberOfPoints": 1,
    "StatusTypeID": 50,
    "DateLastStatusUpdate": "2016-03-03T12:29:00Z",
    "DataQualityLevel": 3,
    "DateCreated": "2016-03-03T12:29:00Z",
    "SubmissionStatusTypeID": 100
}