{
    "IsRecentlyVerified": false,
    "ID": 145147,
    "UUID": "21BC1BFE-132C-4CE0-9C91-35246844B61A",
    "DataProviderID": 2,
    "DataProvidersReference": "129880",
    "OperatorID": 89,
    "UsageTypeID": 1,
    "AddressInfo": {
        "ID": 145499,
        "Title": "Energir Québec",
        "AddressLine1": "2388 Einstein",
        "Town": "Québec",
        "StateOrProvince": "QC",
        "Postcode": "G1P 4T1",
        "CountryID": 44,
        "Latitude": 46.794296,
        "Longitude": -71.296023,
        "ContactTelephone1": "888-356-8911",
        "AccessComments": "24 hours daily",
        "RelatedURL": "https://flo.ca/",
        "DistanceUnit": 0
    },
    "Connections": [
        {
            "ID": 201756,
            "ConnectionTypeID": 1,
            "LevelID": 2,
            "Amps": 16,
            "Voltage": 230,
            "PowerKW": 3,
            "CurrentTypeID": 10,
            "Quantity": 2
        }
    ],
    "StatusTypeID": 50,
    "DateLastStatusUpdate": "2019-12-24T09:24:00Z",
    "DataQualityLevel": 3,
    "DateCreated": "2019-12-24T09:24:00Z",
    "SubmissionStatusTypeID": 100
}