{
    "MediaItems": [
        {
            "ID": 12566,
            "ChargePointID": 88282,
            "ItemURL": "https://s3-ap-southeast-2.amazonaws.com/openchargemap/images/NC/OCM88282/OCM-88282.orig.2017052514531993.png",
            "ItemThumbnailURL": "https://s3-ap-southeast-2.amazonaws.com/openchargemap/images/NC/OCM88282/OCM-88282.thmb.2017052514531993.png",
            "Comment": "",
            "IsEnabled": true,
            "IsVideo": false,
            "IsFeaturedItem": false,
            "IsExternalResource": false,
            "User": {
                "ID": 15365,
                "Username": "sliday"
            },
            "DateCreated": "2017-05-25T14:54:00Z"
        },
        {
            "ID": 12567,
            "ChargePointID": 88282,
            "ItemURL": "https://s3-ap-southeast-2.amazonaws.com/openchargemap/images/NC/OCM88282/OCM-88282.orig.2017052514533646.jpg",
            "ItemThumbnailURL": "https://s3-ap-southeast-2.amazonaws.com/openchargemap/images/NC/OCM88282/OCM-88282.thmb.2017052514533646.jpg",
            "Comment": "",
            "IsEnabled": true,
            "IsVideo": false,
            "IsFeaturedItem": false,
            "IsExternalResource": false,
            "User": {
                "ID": 15365,
                "Username": "sliday"
            },
            "DateCreated": "2017-05-25T14:54:00Z"
        },
        {
            "ID": 12568,
            "ChargePointID": 88282,
            "ItemURL": "https://s3-ap-southeast-2.amazonaws.com/openchargemap/images/NC/OCM88282/OCM-88282.orig.2017052514535501.jpg",
            "ItemThumbnailURL": "https://s3-ap-southeast-2.amazonaws.com/openchargemap/images/NC/OCM88282/OCM-88282.thmb.2017052514535501.jpg",
            "Comment": "",
            "IsEnabled": true,
            "IsVideo": false,
            "IsFeaturedItem": false,
            "IsExternalResource": false,
            "User": {
                "ID": 15365,
                "Username": "sliday"
            },
            "DateCreated": "2017-05-25T14:54:00Z"
        }
    ],
    "IsRecentlyVerified": false,
    "ID": 88282,
    "UUID": "303618D5-8398-4255-AA7F-66E4551FB20B",
    "DataProviderID": 1,
    "OperatorID": 229,
    "UsageTypeID": 4,
    "UsageCost": "$0.25/kWh + $0.25/minute",
    "AddressInfo": {
        "ID": 88628,
        "Title": "The Warehouse Balclutha",
        "AddressLine1": "23 Charlotte Street",
        "Town": "Balclutha",
        "Postcode": "9230",
        "CountryID": 161,
        "Latitude": -46.2372390196687,
        "Longitude": 169.738244068717,
        "ContactTelephone1": "(080) 022-4274",
        "DistanceUnit": 0
    },
    "Connections": [
        {
            "ID": 125237,
            "ConnectionTypeID": 2,
            "StatusTypeID": 50,
            "LevelID": 3,
            "PowerKW": 50,
            "CurrentTypeID": 30,
            "Quantity": 1
        },
        {
            "ID": 125238,
            "ConnectionTypeID": 33,
            "StatusTypeID": 50,
            "LevelID": 3,
            "PowerKW": 50,
            "CurrentTypeID": 30,
            "Quantity": 1
        }
    ],
    "NumberOfPoints": 2,
    "GeneralComments": "24/7",
    "StatusTypeID": 50,
    "DateLastStatusUpdate": "2017-05-26T06:13:00Z",
    "DataQualityLevel": 1,
    "DateCreated": "2017-05-25T14:53:00Z",
    "SubmissionStatusTypeID": 200
}