{
    "IsRecentlyVerified": false,
    "ID": 173602,
    "UUID": "7AA3F5F1-40CB-4CD6-9C28-6C7065E07121",
    "DataProviderID": 18,
    "DataProvidersReference": "d44516e88a548ff1b4d73b7f9ee80a0a",
    "OperatorID": 3345,
    "UsageTypeID": 5,
    "AddressInfo": {
        "ID": 173961,
        "Title": "N8 9AX",
        "AddressLine1": "",
        "Town": "Haringey",
        "Postcode": "N8 9AX",
        "CountryID": 1,
        "Latitude": 51.576764,
        "Longitude": -0.121941,
        "AccessComments": "",
        "RelatedURL": "https://char.gy",
        "DistanceUnit": 0
    },
    "Connections": [
        {
            "ID": 266685,
            "ConnectionTypeID": 25,
            "Reference": "323",
            "StatusTypeID": 50,
            "LevelID": 2,
            "Amps": 16,
            "Voltage": 230,
            "PowerKW": 3.7,
            "CurrentTypeID": 10
        }
    ],
    "StatusTypeID": 0,
    "DateLastStatusUpdate": "2021-03-03T11:25:00Z",
    "MetadataValues": [
        {
            "ID": 8524,
            "MetadataFieldID": 4,
            "ItemValue": "Contains public sector information licensed under the Open Government Licence v2.0. http://www.nationalarchives.gov.uk/doc/open-government-licence/version/2/"
        }
    ],
    "DataQualityLevel": 3,
    "DateCreated": "2021-03-03T11:25:00Z",
    "SubmissionStatusTypeID": 100
}