{
    "IsRecentlyVerified": false,
    "ID": 166385,
    "UUID": "FE064D3E-4EE6-4D6D-82DC-7EA56557B3CC",
    "DataProviderID": 28,
    "DataProvidersReference": "FR*S44*P44195A",
    "OperatorID": 3412,
    "UsageTypeID": 5,
    "AddressInfo": {
        "ID": 166744,
        "Title": "Savenay | Rue de Verdun 84",
        "AddressLine1": "84 Rue de Verdun 44260 Savenay",
        "CountryID": 80,
        "Latitude": 47.358691,
        "Longitude": -1.939955,
        "AccessComments": "24/24 7/7",
        "DistanceUnit": 0
    },
    "Connections": [
        {
            "ID": 246945,
            "ConnectionTypeID": 25,
            "StatusTypeID": 50,
            "LevelID": 2,
            "PowerKW": 18,
            "CurrentTypeID": 20
        },
        {
            "ID": 246946,
            "ConnectionTypeID": 28,
            "StatusTypeID": 50,
            "LevelID": 2,
            "PowerKW": 18,
            "CurrentTypeID": 10
        },
        {
            "ID": 246947,
            "ConnectionTypeID": 25,
            "StatusTypeID": 50,
            "LevelID": 2,
            "PowerKW": 18,
            "CurrentTypeID": 20
        },
        {
            "ID": 246948,
            "ConnectionTypeID": 28,
            "StatusTypeID": 50,
            "LevelID": 2,
            "PowerKW": 18,
            "CurrentTypeID": 10
        }
    ],
    "GeneralComments": "",
    "StatusTypeID": 50,
    "DateLastStatusUpdate": "2020-08-27T05:13:00Z",
    "DataQualityLevel": 2,
    "DateCreated": "2020-08-27T05:13:00Z",
    "SubmissionStatusTypeID": 100
}