{
    "IsRecentlyVerified": false,
    "ID": 94228,
    "UUID": "AE4A8B7C-A38E-4189-87E7-22B8A446D5A9",
    "DataProviderID": 2,
    "DataProvidersReference": "87426",
    "OperatorID": 5,
    "UsageTypeID": 1,
    "AddressInfo": {
        "ID": 94574,
        "Title": "ROW DTLA",
        "AddressLine1": "787 Alameda St",
        "Town": "Los Angeles",
        "StateOrProvince": "CA",
        "Postcode": "90021",
        "CountryID": 2,
        "Latitude": 34.029149,
        "Longitude": -118.239162,
        "ContactTelephone1": "888-758-4389",
        "AccessComments": "24 hours daily",
        "RelatedURL": "http://www.chargepoint.com/",
        "DistanceUnit": 0
    },
    "Connections": [
        {
            "ID": 133326,
            "ConnectionTypeID": 1,
            "LevelID": 2,
            "Amps": 16,
            "Voltage": 230,
            "PowerKW": 3,
            "CurrentTypeID": 10,
            "Quantity": 8
        }
    ],
    "DateLastStatusUpdate": "2019-04-06T04:01:00Z",
    "DataQualityLevel": 3,
    "DateCreated": "2017-10-19T02:06:00Z",
    "SubmissionStatusTypeID": 100
}