{
    "IsRecentlyVerified": false,
    "ID": 85563,
    "UUID": "FC1F4520-9D26-41B0-9D3E-4399E9588D77",
    "DataProviderID": 1,
    "OperatorID": 125,
    "UsageTypeID": 4,
    "AddressInfo": {
        "ID": 85909,
        "Title": "Supermarkt Edeka",
        "AddressLine1": "Kuhlenstraße 51",
        "Town": "Weserstede",
        "StateOrProvince": "Landkreis Ammerland",
        "Postcode": "26655",
        "CountryID": 87,
        "Latitude": 53.2539262,
        "Longitude": 7.917561100000057,
        "AccessComments": "24/7 nutzbar ",
        "DistanceUnit": 0
    },
    "Connections": [
        {
            "ID": 121665,
            "ConnectionTypeID": 25,
            "StatusTypeID": 50,
            "LevelID": 2,
            "Amps": 32,
            "Voltage": 400,
            "PowerKW": 22,
            "CurrentTypeID": 20,
            "Quantity": 2
        }
    ],
    "NumberOfPoints": 2,
    "StatusTypeID": 50,
    "DateLastStatusUpdate": "2017-04-07T07:43:00Z",
    "DataQualityLevel": 1,
    "DateCreated": "2017-04-07T07:43:00Z",
    "SubmissionStatusTypeID": 200
}