{
    "IsRecentlyVerified": false,
    "ID": 161813,
    "UUID": "21BA6388-B11E-47FE-96E2-2E4583BA43E2",
    "DataProviderID": 1,
    "OperatorID": 63,
    "UsageTypeID": 5,
    "AddressInfo": {
        "ID": 162170,
        "Title": "Hervormingslaan",
        "AddressLine1": "Hervormingslaan",
        "StateOrProvince": "Brussels-Capital",
        "Postcode": "1083",
        "CountryID": 26,
        "Latitude": 50.87536,
        "Longitude": 4.313371,
        "RelatedURL": "https://www.charge.brussels/",
        "DistanceUnit": 0
    },
    "Connections": [
        {
            "ID": 232833,
            "ConnectionTypeID": 25,
            "StatusTypeID": 50,
            "LevelID": 2,
            "PowerKW": 22,
            "CurrentTypeID": 20
        }
    ],
    "NumberOfPoints": 2,
    "GeneralComments": "Regional charging station.",
    "StatusTypeID": 50,
    "DateLastStatusUpdate": "2020-07-26T08:56:00Z",
    "DataQualityLevel": 1,
    "DateCreated": "2020-07-25T14:05:00Z",
    "SubmissionStatusTypeID": 200
}