{
    "IsRecentlyVerified": false,
    "ID": 143278,
    "UUID": "C624BFD9-4616-4618-8FAB-79D6A121E05A",
    "DataProviderID": 2,
    "DataProvidersReference": "147462",
    "OperatorID": 5,
    "UsageTypeID": 1,
    "AddressInfo": {
        "ID": 143630,
        "Title": "PICOTTE",
        "AddressLine1": "80 Wolf Rd",
        "Town": "Colonie",
        "StateOrProvince": "NY",
        "Postcode": "12205",
        "CountryID": 2,
        "Latitude": 42.715648,
        "Longitude": -73.813015,
        "ContactTelephone1": "888-758-4389",
        "AccessComments": "24 hours daily",
        "RelatedURL": "http://www.chargepoint.com/",
        "DistanceUnit": 0
    },
    "Connections": [
        {
            "ID": 199573,
            "ConnectionTypeID": 1,
            "LevelID": 2,
            "Amps": 16,
            "Voltage": 230,
            "PowerKW": 3.7,
            "CurrentTypeID": 10,
            "Quantity": 4
        }
    ],
    "StatusTypeID": 50,
    "DateLastStatusUpdate": "2020-06-26T03:06:00Z",
    "DataQualityLevel": 3,
    "DateCreated": "2019-12-24T09:20:00Z",
    "SubmissionStatusTypeID": 100
}