{
    "IsRecentlyVerified": false,
    "ID": 94300,
    "UUID": "455C1814-7265-4CD1-AFD3-5E28ABB273A9",
    "DataProviderID": 2,
    "DataProvidersReference": "87938",
    "OperatorID": 5,
    "UsageTypeID": 1,
    "AddressInfo": {
        "ID": 94646,
        "Title": "CLPCCD",
        "AddressLine1": "25555 Hesperian Blvd. Parking Lot F",
        "Town": "Hayward",
        "StateOrProvince": "CA",
        "Postcode": "94545",
        "CountryID": 2,
        "Latitude": 37.6391667,
        "Longitude": -122.1055556,
        "ContactTelephone1": "888-758-4389",
        "AccessComments": "24 hours daily",
        "RelatedURL": "http://www.chargepoint.com/",
        "DistanceUnit": 0
    },
    "Connections": [
        {
            "ID": 133399,
            "ConnectionTypeID": 1,
            "LevelID": 2,
            "Amps": 16,
            "Voltage": 230,
            "PowerKW": 3,
            "CurrentTypeID": 10,
            "Quantity": 2
        }
    ],
    "DateLastStatusUpdate": "2019-04-06T04:02:00Z",
    "DataQualityLevel": 3,
    "DateCreated": "2017-10-19T02:06:00Z",
    "SubmissionStatusTypeID": 100
}