{
    "IsRecentlyVerified": false,
    "ID": 112703,
    "UUID": "A4276841-1814-4A00-8B7F-CEFF4804DCB6",
    "DataProviderID": 1,
    "OperatorID": 180,
    "UsageTypeID": 3,
    "UsageCost": "€ 0,30 kWh",
    "AddressInfo": {
        "ID": 113049,
        "Title": "Kleine Veerweg 27",
        "AddressLine1": "Kleine Veerweg",
        "AddressLine2": "Zwolle",
        "Town": "Zwolle",
        "StateOrProvince": "Overijssel",
        "Postcode": "8016PA",
        "CountryID": 159,
        "Latitude": 52.4793532300083,
        "Longitude": 6.089476456552347,
        "ContactTelephone1": "+31384605833",
        "ContactTelephone2": "+31650676476",
        "ContactEmail": "van.swaay@ziggo.nl",
        "DistanceUnit": 0
    },
    "Connections": [
        {
            "ID": 158694,
            "ConnectionTypeID": 25,
            "StatusTypeID": 50,
            "LevelID": 2,
            "Amps": 20,
            "PowerKW": 4,
            "CurrentTypeID": 10
        }
    ],
    "NumberOfPoints": 1,
    "GeneralComments": "Position on private property accessible from public road",
    "StatusTypeID": 50,
    "DateLastStatusUpdate": "2018-11-12T16:07:00Z",
    "DataQualityLevel": 1,
    "DateCreated": "2018-11-11T10:30:00Z",
    "SubmissionStatusTypeID": 200
}