{
    "IsRecentlyVerified": false,
    "ID": 89002,
    "UUID": "F8234307-E0E9-4F4A-9D0D-0AFD4FBBE24C",
    "DataProviderID": 1,
    "OperatorID": 103,
    "UsageTypeID": 4,
    "AddressInfo": {
        "ID": 89348,
        "Title": "Allego Autohof Malsfeld",
        "AddressLine1": "Dr.-Reimer-Straße 2",
        "Town": "Malsfeld",
        "StateOrProvince": "Schwalm-Eder-Kreis",
        "Postcode": "34323",
        "CountryID": 87,
        "Latitude": 51.086857624847845,
        "Longitude": 9.485511604824053,
        "AccessComments": "24/7 verfügbar ab 1.7.2017.",
        "DistanceUnit": 0
    },
    "Connections": [
        {
            "ID": 126311,
            "ConnectionTypeID": 1036,
            "StatusTypeID": 50,
            "LevelID": 3,
            "Amps": 63,
            "Voltage": 400,
            "PowerKW": 43,
            "CurrentTypeID": 20,
            "Quantity": 1
        },
        {
            "ID": 126312,
            "ConnectionTypeID": 2,
            "StatusTypeID": 50,
            "LevelID": 3,
            "PowerKW": 50,
            "CurrentTypeID": 30,
            "Quantity": 1
        },
        {
            "ID": 126313,
            "ConnectionTypeID": 33,
            "StatusTypeID": 50,
            "LevelID": 3,
            "PowerKW": 50,
            "CurrentTypeID": 30,
            "Quantity": 1
        }
    ],
    "NumberOfPoints": 3,
    "StatusTypeID": 50,
    "DateLastStatusUpdate": "2017-06-19T07:20:00Z",
    "DataQualityLevel": 1,
    "DateCreated": "2017-06-19T07:20:00Z",
    "SubmissionStatusTypeID": 200
}