{
    "IsRecentlyVerified": false,
    "ID": 123822,
    "UUID": "0210D61D-0755-44FE-AB4C-ED4FA5843180",
    "DataProviderID": 2,
    "DataProvidersReference": "121224",
    "OperatorID": 5,
    "UsageTypeID": 1,
    "AddressInfo": {
        "ID": 124168,
        "Title": "ELAN MV",
        "AddressLine1": "1030 Castro St",
        "Town": "Mountain View",
        "StateOrProvince": "CA",
        "Postcode": "94040",
        "CountryID": 2,
        "Latitude": 37.3854502,
        "Longitude": -122.0847837,
        "ContactTelephone1": "888-758-4389",
        "AccessComments": "24 hours daily",
        "RelatedURL": "http://www.chargepoint.com/",
        "DistanceUnit": 0
    },
    "Connections": [
        {
            "ID": 173851,
            "ConnectionTypeID": 1,
            "LevelID": 2,
            "Amps": 16,
            "Voltage": 230,
            "PowerKW": 3,
            "CurrentTypeID": 10,
            "Quantity": 1
        }
    ],
    "DateLastStatusUpdate": "2019-12-24T09:13:00Z",
    "DataQualityLevel": 3,
    "DateCreated": "2019-04-06T05:03:00Z",
    "SubmissionStatusTypeID": 100
}