{
    "IsRecentlyVerified": true,
    "DateLastVerified": "2021-09-11T07:39:00Z",
    "ID": 189159,
    "UUID": "06AFBB78-C35C-48FF-8A46-7319F73070B8",
    "DataProviderID": 1,
    "OperatorID": 1,
    "UsageTypeID": 4,
    "AddressInfo": {
        "ID": 189518,
        "Title": "PEA VOLTA Ayutthaya",
        "AddressLine1": "Thanon Asia",
        "Town": "Ayutthaya",
        "StateOrProvince": "Phra Nakhon Si Ayutthaya Province",
        "Postcode": "13000",
        "CountryID": 222,
        "Latitude": 14.383729844854713,
        "Longitude": 100.6032806655287,
        "RelatedURL": "https://www.pea.co.th/en",
        "DistanceUnit": 0
    },
    "Connections": [
        {
            "ID": 305805,
            "ConnectionTypeID": 33,
            "StatusTypeID": 50,
            "LevelID": 3,
            "Amps": 125,
            "PowerKW": 50,
            "CurrentTypeID": 30,
            "Quantity": 1
        }
    ],
    "NumberOfPoints": 1,
    "StatusTypeID": 50,
    "DateLastStatusUpdate": "2021-09-13T22:24:00Z",
    "DataQualityLevel": 1,
    "DateCreated": "2021-09-11T07:39:00Z",
    "SubmissionStatusTypeID": 200
}