{
    "IsRecentlyVerified": false,
    "ID": 137113,
    "UUID": "F30FEAB0-E1C8-4FDE-B057-31F27E8524A3",
    "DataProviderID": 1,
    "DataProvidersReference": "LSB-00102",
    "OperatorID": 21,
    "UsageTypeID": 4,
    "UsageCost": "Mobi.E compatible card",
    "AddressInfo": {
        "ID": 137459,
        "Title": "LSB-00102",
        "AddressLine1": "Rua de O Século 50",
        "Town": "Lisboa",
        "Postcode": "1200-436",
        "CountryID": 180,
        "Latitude": 38.712617,
        "Longitude": -9.147614,
        "RelatedURL": "http://www.mobie.pt",
        "DistanceUnit": 0
    },
    "Connections": [
        {
            "ID": 191970,
            "ConnectionTypeID": 25,
            "StatusTypeID": 50,
            "LevelID": 2,
            "Amps": 32,
            "Voltage": 230,
            "PowerKW": 7.4,
            "CurrentTypeID": 10,
            "Quantity": 2
        }
    ],
    "NumberOfPoints": 2,
    "StatusTypeID": 50,
    "DateLastStatusUpdate": "2020-08-16T10:49:00Z",
    "DataQualityLevel": 3,
    "DateCreated": "2019-12-24T08:08:00Z",
    "SubmissionStatusTypeID": 100
}