{
    "IsRecentlyVerified": true,
    "DateLastVerified": "2021-08-07T16:31:00Z",
    "ID": 188634,
    "UUID": "FECBA826-052C-4D4E-A9D5-7663FF9A8FFC",
    "DataProviderID": 1,
    "OperatorID": 1,
    "UsageTypeID": 1,
    "UsageCost": "Free",
    "AddressInfo": {
        "ID": 188993,
        "Title": "OPP Station",
        "AddressLine1": "3028 Highway 35",
        "Town": "Lindsay ",
        "StateOrProvince": "Ontario ",
        "Postcode": "K9V 4R1",
        "CountryID": 44,
        "Latitude": 44.35105099999913,
        "Longitude": -78.76719099999866,
        "DistanceUnit": 0
    },
    "Connections": [
        {
            "ID": 304713,
            "ConnectionTypeID": 1,
            "StatusTypeID": 50,
            "LevelID": 2,
            "PowerKW": 7,
            "CurrentTypeID": 10,
            "Quantity": 6
        }
    ],
    "NumberOfPoints": 6,
    "StatusTypeID": 50,
    "DateLastStatusUpdate": "2021-08-09T22:14:00Z",
    "DataQualityLevel": 1,
    "DateCreated": "2021-08-07T16:31:00Z",
    "SubmissionStatusTypeID": 200
}