{
    "IsRecentlyVerified": false,
    "ID": 128162,
    "UUID": "E682A987-8E24-40DD-A274-D0391D853094",
    "DataProviderID": 1,
    "OperatorID": 150,
    "UsageTypeID": 4,
    "UsageCost": "£0.50 + £0.30 / kWh. £10.00 overstay fee after 245 mins, then £10.00 every subsequent 245 mins ",
    "AddressInfo": {
        "ID": 128508,
        "Title": "Waterworld Carpark",
        "AddressLine1": "Bodhyfryd",
        "AddressLine2": "Acton",
        "Town": "Wrexham",
        "Postcode": "LL13 8BG",
        "CountryID": 1,
        "Latitude": 53.0483,
        "Longitude": -2.99095,
        "RelatedURL": "http://www.chargepointservices.co.uk",
        "DistanceUnit": 0
    },
    "Connections": [
        {
            "ID": 179343,
            "ConnectionTypeID": 25,
            "Reference": "1",
            "StatusTypeID": 50,
            "LevelID": 2,
            "Amps": 32,
            "Voltage": 400,
            "PowerKW": 22,
            "CurrentTypeID": 10,
            "Quantity": 2
        }
    ],
    "NumberOfPoints": 2,
    "StatusTypeID": 50,
    "DateLastStatusUpdate": "2019-06-17T13:25:00Z",
    "MetadataValues": [
        {
            "ID": 4506,
            "MetadataFieldID": 4,
            "ItemValue": "Contains public sector information licensed under the Open Government Licence v2.0. http://www.nationalarchives.gov.uk/doc/open-government-licence/version/2/"
        }
    ],
    "DataQualityLevel": 3,
    "DateCreated": "2019-06-17T06:40:00Z",
    "SubmissionStatusTypeID": 100
}