{
    "IsRecentlyVerified": false,
    "ID": 152096,
    "UUID": "4477B72D-36F4-42BD-9735-2AE2AF1DF9A5",
    "DataProviderID": 28,
    "DataProvidersReference": "FR*S86*PSORE*B088",
    "UsageTypeID": 5,
    "AddressInfo": {
        "ID": 152449,
        "Title": "B088",
        "AddressLine1": "Place de l'eglise - 86290 - Saint-Leomer",
        "CountryID": 80,
        "Latitude": 46.43572,
        "Longitude": 0.99439,
        "AccessComments": "24/24 7/7 jours",
        "DistanceUnit": 0
    },
    "Connections": [
        {
            "ID": 212773,
            "ConnectionTypeID": 28,
            "StatusTypeID": 50,
            "LevelID": 2,
            "PowerKW": 18,
            "CurrentTypeID": 10
        },
        {
            "ID": 212774,
            "ConnectionTypeID": 26,
            "StatusTypeID": 50,
            "LevelID": 2,
            "PowerKW": 18
        },
        {
            "ID": 245628,
            "ConnectionTypeID": 28,
            "StatusTypeID": 50,
            "LevelID": 2,
            "PowerKW": 18,
            "CurrentTypeID": 10
        },
        {
            "ID": 245629,
            "ConnectionTypeID": 26,
            "StatusTypeID": 50,
            "LevelID": 2,
            "PowerKW": 18
        }
    ],
    "GeneralComments": "",
    "StatusTypeID": 50,
    "DateLastStatusUpdate": "2020-08-27T05:12:00Z",
    "DataQualityLevel": 2,
    "DateCreated": "2020-03-15T10:53:00Z",
    "SubmissionStatusTypeID": 100
}