{
    "IsRecentlyVerified": false,
    "ID": 29302,
    "UUID": "EF5349A6-FA9A-4481-81B3-E8DFBC186E5D",
    "DataProviderID": 2,
    "DataProvidersReference": "60943",
    "OperatorID": 5,
    "UsageTypeID": 1,
    "AddressInfo": {
        "ID": 29648,
        "Title": "US BANCORP",
        "AddressLine1": "125 SW 4th Ave",
        "Town": "Portland",
        "StateOrProvince": "OR",
        "Postcode": "97204",
        "CountryID": 2,
        "Latitude": 45.522235,
        "Longitude": -122.674781,
        "ContactTelephone1": "888-758-4389",
        "AccessComments": "24 hours daily",
        "RelatedURL": "http://www.chargepoint.com/",
        "DistanceUnit": 0
    },
    "Connections": [
        {
            "ID": 32211,
            "ConnectionTypeID": 1,
            "LevelID": 2,
            "Amps": 16,
            "Voltage": 230,
            "PowerKW": 3.7,
            "CurrentTypeID": 10,
            "Quantity": 4
        }
    ],
    "DateLastStatusUpdate": "2020-06-26T03:09:00Z",
    "DataQualityLevel": 3,
    "DateCreated": "2014-11-28T03:39:00Z",
    "SubmissionStatusTypeID": 100
}