{
    "IsRecentlyVerified": false,
    "ID": 79868,
    "UUID": "D79A6851-00BA-4E65-AAA1-B42805C0E255",
    "DataProviderID": 1,
    "OperatorID": 23,
    "OperatorsReference": "12188",
    "UsageTypeID": 4,
    "UsageCost": "Free",
    "AddressInfo": {
        "ID": 80214,
        "Title": "The Umstead Hotel and Spa",
        "AddressLine1": "100 Woodland Pond DR",
        "Town": "Cary",
        "StateOrProvince": "NC",
        "Postcode": "27513",
        "CountryID": 2,
        "Latitude": 35.82945,
        "Longitude": -78.76476,
        "ContactTelephone1": "(919) 447-4000",
        "DistanceUnit": 0
    },
    "Connections": [
        {
            "ID": 114515,
            "ConnectionTypeID": 30,
            "StatusTypeID": 50,
            "LevelID": 2,
            "PowerKW": 8,
            "CurrentTypeID": 10,
            "Quantity": 1
        }
    ],
    "NumberOfPoints": 1,
    "GeneralComments": "1 Tesla Connector, up to 8kW.Available to the public. Please see valet.",
    "StatusTypeID": 50,
    "DateLastStatusUpdate": "2017-06-09T14:10:00Z",
    "DataQualityLevel": 1,
    "DateCreated": "2017-01-30T13:37:00Z",
    "SubmissionStatusTypeID": 200
}