{
    "UserComments": [
        {
            "ID": 23138,
            "ChargePointID": 92435,
            "CommentTypeID": 10,
            "UserName": "polianto",
            "Comment": "Sempre attiva, gratuita e anche all'ombra!",
            "Rating": 5,
            "DateCreated": "2020-08-23T15:54:28.9Z",
            "User": {
                "ID": 1606,
                "Username": "polianto"
            },
            "CheckinStatusTypeID": 10,
            "IsActionedByEditor": false
        },
        {
            "ID": 20499,
            "ChargePointID": 92435,
            "CommentTypeID": 10,
            "UserName": "PowerCruiseControl",
            "Comment": "Good GPS positioning",
            "Rating": 5,
            "DateCreated": "2018-12-09T19:54:23.933Z",
            "User": {
                "ID": 18504,
                "Username": "PowerCruiseControl"
            },
            "CheckinStatusTypeID": 10
        },
        {
            "ID": 17878,
            "ChargePointID": 92435,
            "CommentTypeID": 10,
            "UserName": "polianto",
            "Comment": "Gratuita senza tessera, plug & charge",
            "Rating": 4,
            "RelatedURL": "http://www.forumelettrico.it/forum/nuova-fast-area-di-servizio-paganella-est-tn-t1427.html",
            "DateCreated": "2017-11-01T17:59:11.61Z",
            "User": {
                "ID": 1606,
                "Username": "polianto"
            },
            "CheckinStatusTypeID": 10
        }
    ],
    "MediaItems": [
        {
            "ID": 24423,
            "ChargePointID": 92435,
            "ItemURL": "https://s3-ap-southeast-2.amazonaws.com/openchargemap/images/IT/OCM92435/OCM-92435.orig.2020082315532536.jpg",
            "ItemThumbnailURL": "https://s3-ap-southeast-2.amazonaws.com/openchargemap/images/IT/OCM92435/OCM-92435.thmb.2020082315532536.jpg",
            "Comment": "",
            "IsEnabled": true,
            "IsVideo": false,
            "IsFeaturedItem": false,
            "IsExternalResource": false,
            "User": {
                "ID": 1606,
                "Username": "polianto"
            },
            "DateCreated": "2020-08-23T15:53:00Z"
        },
        {
            "ID": 17236,
            "ChargePointID": 92435,
            "ItemURL": "https://s3-ap-southeast-2.amazonaws.com/openchargemap/images/IT/OCM92435/OCM-92435.orig.2018122009115070.jpg",
            "ItemThumbnailURL": "https://s3-ap-southeast-2.amazonaws.com/openchargemap/images/IT/OCM92435/OCM-92435.thmb.2018122009115070.jpg",
            "Comment": "",
            "IsEnabled": true,
            "IsVideo": false,
            "IsFeaturedItem": false,
            "IsExternalResource": false,
            "User": {
                "ID": 11749,
                "Username": "ForumElettrico.it"
            },
            "DateCreated": "2018-12-20T09:12:00Z"
        },
        {
            "ID": 17237,
            "ChargePointID": 92435,
            "ItemURL": "https://s3-ap-southeast-2.amazonaws.com/openchargemap/images/IT/OCM92435/OCM-92435.orig.2018122009115655.jpg",
            "ItemThumbnailURL": "https://s3-ap-southeast-2.amazonaws.com/openchargemap/images/IT/OCM92435/OCM-92435.thmb.2018122009115655.jpg",
            "Comment": "",
            "IsEnabled": true,
            "IsVideo": false,
            "IsFeaturedItem": false,
            "IsExternalResource": false,
            "User": {
                "ID": 11749,
                "Username": "ForumElettrico.it"
            },
            "DateCreated": "2018-12-20T09:12:00Z"
        },
        {
            "ID": 17178,
            "ChargePointID": 92435,
            "ItemURL": "https://s3-ap-southeast-2.amazonaws.com/openchargemap/images/IT/OCM92435/OCM-92435.orig.2018120919544180.jpg",
            "ItemThumbnailURL": "https://s3-ap-southeast-2.amazonaws.com/openchargemap/images/IT/OCM92435/OCM-92435.thmb.2018120919544180.jpg",
            "Comment": "",
            "IsEnabled": true,
            "IsVideo": false,
            "IsFeaturedItem": false,
            "IsExternalResource": false,
            "User": {
                "ID": 18504,
                "Username": "PowerCruiseControl"
            },
            "DateCreated": "2018-12-09T19:55:00Z"
        },
        {
            "ID": 13615,
            "ChargePointID": 92435,
            "ItemURL": "https://s3-ap-southeast-2.amazonaws.com/openchargemap/images/IT/OCM92435/OCM-92435.orig.2017110117515039.jpg",
            "ItemThumbnailURL": "https://s3-ap-southeast-2.amazonaws.com/openchargemap/images/IT/OCM92435/OCM-92435.thmb.2017110117515039.jpg",
            "Comment": "",
            "IsEnabled": true,
            "IsVideo": false,
            "IsFeaturedItem": false,
            "IsExternalResource": false,
            "User": {
                "ID": 1606,
                "Username": "polianto"
            },
            "DateCreated": "2017-11-01T17:52:00Z"
        },
        {
            "ID": 13614,
            "ChargePointID": 92435,
            "ItemURL": "https://s3-ap-southeast-2.amazonaws.com/openchargemap/images/IT/OCM92435/OCM-92435.orig.2017110117481522.jpg",
            "ItemThumbnailURL": "https://s3-ap-southeast-2.amazonaws.com/openchargemap/images/IT/OCM92435/OCM-92435.thmb.2017110117481522.jpg",
            "Comment": "",
            "IsEnabled": true,
            "IsVideo": false,
            "IsFeaturedItem": false,
            "IsExternalResource": false,
            "User": {
                "ID": 1606,
                "Username": "polianto"
            },
            "DateCreated": "2017-11-01T17:48:00Z"
        }
    ],
    "IsRecentlyVerified": false,
    "ID": 92435,
    "UUID": "CF676B09-E42D-42FD-AE49-009E3F711D0F",
    "DataProviderID": 1,
    "OperatorID": 45,
    "UsageTypeID": 1,
    "UsageCost": "free",
    "AddressInfo": {
        "ID": 92781,
        "Title": "Autobrennero Paganella Est",
        "AddressLine1": "Autostrada A22 Modena-Brennero, KM 184",
        "Town": "Lavis ",
        "StateOrProvince": "TN",
        "Postcode": "38015 ",
        "CountryID": 112,
        "Latitude": 46.1404539361202,
        "Longitude": 11.087537193741,
        "RelatedURL": "https://www.autobrennero.it/it/la-rete-autostradale/i-servizi/mobilita-elettrica/",
        "DistanceUnit": 0
    },
    "Connections": [
        {
            "ID": 131027,
            "ConnectionTypeID": 2,
            "StatusTypeID": 50,
            "LevelID": 3,
            "Amps": 125,
            "Voltage": 500,
            "PowerKW": 50,
            "CurrentTypeID": 30,
            "Quantity": 1
        },
        {
            "ID": 131028,
            "ConnectionTypeID": 1036,
            "StatusTypeID": 50,
            "LevelID": 3,
            "Amps": 64,
            "Voltage": 400,
            "PowerKW": 43,
            "CurrentTypeID": 20,
            "Quantity": 1
        },
        {
            "ID": 131029,
            "ConnectionTypeID": 33,
            "StatusTypeID": 50,
            "LevelID": 3,
            "PowerKW": 50,
            "CurrentTypeID": 30,
            "Quantity": 1
        }
    ],
    "NumberOfPoints": 2,
    "StatusTypeID": 50,
    "DateLastStatusUpdate": "2020-08-23T15:54:00Z",
    "DataQualityLevel": 1,
    "DateCreated": "2017-09-06T07:44:00Z",
    "SubmissionStatusTypeID": 200
}