{
    "IsRecentlyVerified": false,
    "ID": 16671,
    "UUID": "5C76624A-D1DF-4DD5-AE75-1657481E7191",
    "DataProviderID": 1,
    "OperatorID": 57,
    "UsageTypeID": 4,
    "UsageCost": "Free",
    "AddressInfo": {
        "ID": 17016,
        "Title": "The West Australian",
        "AddressLine1": "50 Hasler Road",
        "AddressLine2": "",
        "Town": "Osborne Park",
        "StateOrProvince": "WA",
        "Postcode": "6017",
        "CountryID": 18,
        "Latitude": -31.912390364137213,
        "Longitude": 115.81142842769623,
        "ContactTelephone1": "64881763",
        "ContactTelephone2": "",
        "ContactEmail": "rev@therevproject.com",
        "AccessComments": "",
        "RelatedURL": "http://therevproject.com/charging",
        "DistanceUnit": 0
    },
    "Connections": [
        {
            "ID": 15122,
            "ConnectionTypeID": 25,
            "StatusTypeID": 50,
            "LevelID": 2,
            "Amps": 32,
            "Voltage": 240,
            "PowerKW": 7.2,
            "CurrentTypeID": 10,
            "Quantity": 2
        }
    ],
    "NumberOfPoints": 2,
    "GeneralComments": "Requires free access tag available from The REV Project",
    "StatusTypeID": 50,
    "DateLastStatusUpdate": "2021-10-13T06:06:00Z",
    "DataQualityLevel": 1,
    "DateCreated": "2013-05-29T01:10:00Z",
    "SubmissionStatusTypeID": 200
}