{
    "IsRecentlyVerified": false,
    "ID": 112519,
    "UUID": "6C258860-0940-4A2B-AADB-0D6FB13589AB",
    "DataProviderID": 1,
    "OperatorID": 80,
    "UsageTypeID": 4,
    "AddressInfo": {
        "ID": 112865,
        "Title": "Gerenzano Sturzo | EnelX",
        "AddressLine1": "Via Don Luigi Sturzo, 25",
        "Town": "Gerenzano",
        "StateOrProvince": "VA",
        "Postcode": "21040 ",
        "CountryID": 112,
        "Latitude": 45.6359828273086,
        "Longitude": 8.9946084404645,
        "ContactTelephone1": "800.069.850",
        "RelatedURL": "https://www.enelx.com/it/it/emobility",
        "DistanceUnit": 0
    },
    "Connections": [
        {
            "ID": 158291,
            "ConnectionTypeID": 25,
            "StatusTypeID": 50,
            "LevelID": 2,
            "Amps": 32,
            "Voltage": 400,
            "PowerKW": 22,
            "CurrentTypeID": 20,
            "Quantity": 2
        }
    ],
    "NumberOfPoints": 2,
    "StatusTypeID": 50,
    "DateLastStatusUpdate": "2018-11-14T16:55:00Z",
    "DataQualityLevel": 1,
    "DateCreated": "2018-11-05T13:57:00Z",
    "SubmissionStatusTypeID": 200
}