{
    "IsRecentlyVerified": false,
    "ID": 62226,
    "UUID": "C532F81B-4FC0-4FB3-A1E2-DA40AB160289",
    "DataProviderID": 1,
    "OperatorID": 23,
    "OperatorsReference": "10077",
    "UsageTypeID": 7,
    "UsageCost": "Free",
    "AddressInfo": {
        "ID": 62572,
        "Title": "The Lodge and Conference Center At Geneva on the Lake",
        "AddressLine1": "4888 N Broadway",
        "Town": "Geneva",
        "StateOrProvince": "OH",
        "Postcode": "44041",
        "CountryID": 2,
        "Latitude": 41.8572919,
        "Longitude": -80.9661576,
        "ContactTelephone1": "440-466-7100",
        "AccessComments": "24 hours daily; for guest use only",
        "RelatedURL": "http://www.teslamotors.com/supercharger",
        "DistanceUnit": 0
    },
    "Connections": [
        {
            "ID": 79129,
            "ConnectionTypeID": 30,
            "StatusTypeID": 50,
            "LevelID": 2,
            "Amps": 16,
            "Voltage": 230,
            "PowerKW": 16,
            "CurrentTypeID": 10,
            "Quantity": 2
        }
    ],
    "NumberOfPoints": 2,
    "StatusTypeID": 50,
    "DateLastStatusUpdate": "2017-02-16T11:13:00Z",
    "DataQualityLevel": 3,
    "DateCreated": "2016-03-03T11:38:00Z",
    "SubmissionStatusTypeID": 100
}