{
    "IsRecentlyVerified": false,
    "ID": 181042,
    "UUID": "DA87A7CF-E011-4F88-9808-0E7230A30AFE",
    "DataProviderID": 29,
    "DataProvidersReference": "15710",
    "AddressInfo": {
        "ID": 181401,
        "Title": "Büsumer Str. 150",
        "AddressLine1": "Büsumer Str. 150",
        "Town": "Rendsburg",
        "Postcode": "24768",
        "CountryID": 87,
        "Latitude": 54.327839,
        "Longitude": 9.619281,
        "DistanceUnit": 0
    },
    "Connections": [
        {
            "ID": 284864,
            "ConnectionTypeID": 25,
            "StatusTypeID": 50,
            "LevelID": 2,
            "PowerKW": 22,
            "CurrentTypeID": 20
        },
        {
            "ID": 284865,
            "ConnectionTypeID": 25,
            "StatusTypeID": 50,
            "LevelID": 2,
            "PowerKW": 22,
            "CurrentTypeID": 20
        }
    ],
    "StatusTypeID": 50,
    "DateLastStatusUpdate": "2021-07-12T02:52:00Z",
    "MetadataValues": [
        {
            "ID": 13336,
            "MetadataFieldID": 4,
            "ItemValue": "Data from the German chargepoint registry provided by Bundesnetzagentur.de under the CC-BY 4.0 license"
        }
    ],
    "DataQualityLevel": 3,
    "DateCreated": "2021-07-08T10:01:00Z",
    "SubmissionStatusTypeID": 100
}