{
    "IsRecentlyVerified": false,
    "ID": 75742,
    "UUID": "46A08960-091B-4939-8FF5-CB714A3FC481",
    "DataProviderID": 1,
    "OperatorID": 3,
    "OperatorsReference": "PP-12622",
    "UsageTypeID": 6,
    "UsageCost": "Free",
    "AddressInfo": {
        "ID": 76088,
        "Title": "Henry Colbeck LTD",
        "AddressLine1": "Seventh Avenue",
        "AddressLine2": "Team Valley Trading Estate",
        "Town": "Gateshead",
        "StateOrProvince": "Tyne and Wear",
        "Postcode": "NE11 0HG",
        "CountryID": 1,
        "Latitude": 54.9306795,
        "Longitude": -1.612769,
        "DistanceUnit": 0
    },
    "Connections": [
        {
            "ID": 109230,
            "ConnectionTypeID": 25,
            "StatusTypeID": 50,
            "LevelID": 2,
            "Amps": 32,
            "Voltage": 230,
            "PowerKW": 7,
            "CurrentTypeID": 10,
            "Quantity": 1
        },
        {
            "ID": 109231,
            "ConnectionTypeID": 3,
            "StatusTypeID": 50,
            "LevelID": 2,
            "Amps": 13,
            "Voltage": 230,
            "PowerKW": 3,
            "CurrentTypeID": 10,
            "Quantity": 1
        }
    ],
    "NumberOfPoints": 2,
    "GeneralComments": "Workplace charging",
    "StatusTypeID": 0,
    "DateLastStatusUpdate": "2019-04-30T05:23:00Z",
    "DataQualityLevel": 1,
    "DateCreated": "2016-12-22T15:50:00Z",
    "SubmissionStatusTypeID": 200
}