{
    "IsRecentlyVerified": false,
    "ID": 112171,
    "UUID": "223E8E11-FE89-4616-A20D-2EF2BAAB4E6B",
    "DataProviderID": 2,
    "DataProvidersReference": "83939",
    "UsageTypeID": 1,
    "AddressInfo": {
        "ID": 112517,
        "Title": "Peavey Mart",
        "AddressLine1": "5230 45th St",
        "Town": "Lacombe",
        "StateOrProvince": "AB",
        "Postcode": "T4L 2A1",
        "CountryID": 44,
        "Latitude": 52.467092,
        "Longitude": -113.724817,
        "ContactTelephone1": "403-782-5657",
        "AccessComments": "24 hours daily",
        "RelatedURL": "",
        "DistanceUnit": 0
    },
    "Connections": [
        {
            "ID": 157722,
            "ConnectionTypeID": 1,
            "LevelID": 2,
            "Amps": 16,
            "Voltage": 230,
            "PowerKW": 3.7,
            "CurrentTypeID": 10,
            "Quantity": 1
        }
    ],
    "DateLastStatusUpdate": "2020-06-26T03:12:00Z",
    "DataQualityLevel": 3,
    "DateCreated": "2018-10-18T23:37:00Z",
    "SubmissionStatusTypeID": 100
}