{
    "IsRecentlyVerified": false,
    "ID": 23308,
    "UUID": "1FBFF019-23EC-4C53-A1F0-E8C4CEC89BFE",
    "DataProviderID": 1,
    "OperatorID": 76,
    "UsageTypeID": 1,
    "UsageCost": "5€/up to 60 min",
    "AddressInfo": {
        "ID": 23653,
        "Title": "Võru",
        "AddressLine1": "Tallinna road",
        "Town": "Võru",
        "StateOrProvince": "Võru maakond",
        "Postcode": "65605",
        "CountryID": 74,
        "Latitude": 57.85814623230599,
        "Longitude": 26.976239863489816,
        "ContactTelephone1": "+372 6511911",
        "ContactEmail": "tugi@elmo.ee",
        "AccessComments": "Located at Local tanking station \"Olerex\".",
        "RelatedURL": "http://www.elmo.ee/en/",
        "DistanceUnit": 0
    },
    "Connections": [
        {
            "ID": 25184,
            "ConnectionTypeID": 2,
            "StatusTypeID": 50,
            "LevelID": 3,
            "Amps": 120,
            "Voltage": 500,
            "PowerKW": 50,
            "CurrentTypeID": 30,
            "Quantity": 1
        },
        {
            "ID": 25185,
            "ConnectionTypeID": 25,
            "StatusTypeID": 50,
            "LevelID": 2,
            "Amps": 32,
            "Voltage": 400,
            "PowerKW": 22,
            "CurrentTypeID": 20,
            "Quantity": 1
        }
    ],
    "NumberOfPoints": 1,
    "GeneralComments": "Opened 24h (automatic). \r\nReal-time condition information (operational/not operational/free) - www.elmo.ee \r\nCan pay with client card, SMS or mobile application. \r\nCharger number 86161",
    "StatusTypeID": 50,
    "DateLastStatusUpdate": "2014-05-18T07:44:00Z",
    "DataQualityLevel": 1,
    "DateCreated": "2014-05-18T07:44:00Z",
    "SubmissionStatusTypeID": 200
}