{
    "IsRecentlyVerified": false,
    "ID": 102021,
    "UUID": "9A0333D8-9C7E-4236-966F-A8F59A9DEDFB",
    "DataProviderID": 1,
    "OperatorID": 23,
    "OperatorsReference": "41953",
    "UsageTypeID": 4,
    "AddressInfo": {
        "ID": 102367,
        "Title": "Riverhouse Inn",
        "AddressLine1": "1202 Bay St",
        "Town": "Florence",
        "StateOrProvince": "Oregon",
        "Postcode": "97439",
        "CountryID": 2,
        "Latitude": 43.966652,
        "Longitude": -124.109375,
        "ContactTelephone1": "(541) 997-3933",
        "DistanceUnit": 0
    },
    "Connections": [
        {
            "ID": 144004,
            "ConnectionTypeID": 30,
            "StatusTypeID": 50,
            "LevelID": 2,
            "PowerKW": 16,
            "CurrentTypeID": 20,
            "Quantity": 3
        }
    ],
    "NumberOfPoints": 3,
    "GeneralComments": "3 Tesla Connectors, up to 16kW.Available for customers. Please call ahead.",
    "StatusTypeID": 50,
    "DateLastStatusUpdate": "2018-04-16T04:57:00Z",
    "DataQualityLevel": 1,
    "DateCreated": "2018-04-16T04:57:00Z",
    "SubmissionStatusTypeID": 200
}