{
    "IsRecentlyVerified": false,
    "ID": 138264,
    "UUID": "F1EFAF5C-9D8F-40CD-934F-F7B5DFC66DAC",
    "DataProviderID": 2,
    "DataProvidersReference": "87936",
    "OperatorID": 5,
    "UsageTypeID": 1,
    "AddressInfo": {
        "ID": 138613,
        "Title": "HILLS COUNTY",
        "AddressLine1": "710 E Jackson Street",
        "Town": "Tampa",
        "StateOrProvince": "FL",
        "Postcode": "33602",
        "CountryID": 2,
        "Latitude": 27.948431,
        "Longitude": -82.45391,
        "ContactTelephone1": "888-758-4389",
        "AccessComments": "24 hours daily",
        "RelatedURL": "http://www.chargepoint.com/",
        "DistanceUnit": 0
    },
    "Connections": [
        {
            "ID": 193344,
            "ConnectionTypeID": 1,
            "LevelID": 2,
            "Amps": 16,
            "Voltage": 230,
            "PowerKW": 3.7,
            "CurrentTypeID": 10,
            "Quantity": 4
        }
    ],
    "StatusTypeID": 50,
    "DateLastStatusUpdate": "2020-06-26T02:52:00Z",
    "DataQualityLevel": 3,
    "DateCreated": "2019-12-24T09:08:00Z",
    "SubmissionStatusTypeID": 100
}