{
    "IsRecentlyVerified": false,
    "ID": 14990,
    "UUID": "C2A1C2D7-E78A-49EE-A8D3-2BA1116CAF2B",
    "DataProviderID": 1,
    "OperatorID": 22,
    "OperatorsReference": "C48Z5-A/B",
    "UsageTypeID": 4,
    "AddressInfo": {
        "ID": 15336,
        "Title": "St. Georges Terrace",
        "AddressLine1": "Carrick-on-Shannon",
        "Town": "Leitrim",
        "StateOrProvince": "County Leitrim",
        "CountryID": 3,
        "Latitude": 53.943937,
        "Longitude": -8.098735,
        "DistanceUnit": 0
    },
    "Connections": [
        {
            "ID": 13369,
            "ConnectionTypeID": 25,
            "StatusTypeID": 75,
            "LevelID": 2,
            "Amps": 32,
            "Voltage": 400,
            "PowerKW": 22,
            "CurrentTypeID": 20,
            "Quantity": 2
        }
    ],
    "NumberOfPoints": 2,
    "StatusTypeID": 75,
    "DateLastStatusUpdate": "2016-12-15T20:43:00Z",
    "DataQualityLevel": 2,
    "DateCreated": "2012-12-11T15:08:00Z",
    "SubmissionStatusTypeID": 100
}