{
    "IsRecentlyVerified": false,
    "ID": 94406,
    "UUID": "3087928B-4EF2-4304-933F-46B2031090AC",
    "DataProviderID": 2,
    "DataProvidersReference": "87814",
    "OperatorID": 5,
    "UsageTypeID": 1,
    "AddressInfo": {
        "ID": 94752,
        "Title": "STATION 1",
        "AddressLine1": "445 Page St",
        "Town": "Avon",
        "StateOrProvince": "MA",
        "Postcode": "02322",
        "CountryID": 2,
        "Latitude": 42.1386509,
        "Longitude": -71.0565154,
        "ContactTelephone1": "888-758-4389",
        "AccessComments": "24 hours daily",
        "RelatedURL": "http://www.chargepoint.com/",
        "DistanceUnit": 0
    },
    "Connections": [
        {
            "ID": 133513,
            "ConnectionTypeID": 1,
            "LevelID": 2,
            "Amps": 16,
            "Voltage": 230,
            "PowerKW": 3,
            "CurrentTypeID": 10,
            "Quantity": 2
        }
    ],
    "DateLastStatusUpdate": "2019-12-24T09:19:00Z",
    "DataQualityLevel": 3,
    "DateCreated": "2017-10-19T02:06:00Z",
    "SubmissionStatusTypeID": 100
}