{
    "IsRecentlyVerified": false,
    "ID": 162624,
    "UUID": "38C612AE-080F-4F66-A345-B2BFCFFFFD24",
    "DataProviderID": 1,
    "OperatorID": 136,
    "UsageTypeID": 4,
    "UsageCost": "0,15€/kWh",
    "AddressInfo": {
        "ID": 162981,
        "Title": "Keuda Kansanopistontie",
        "AddressLine1": "Kansanopistontie 60",
        "Town": "Tuusula",
        "StateOrProvince": "Southern Finland",
        "Postcode": "04400",
        "CountryID": 79,
        "Latitude": 60.44341802330442,
        "Longitude": 25.088250907046245,
        "RelatedURL": "http://www.virta.fi",
        "DistanceUnit": 0
    },
    "Connections": [
        {
            "ID": 234065,
            "ConnectionTypeID": 25,
            "StatusTypeID": 50,
            "LevelID": 2,
            "Amps": 16,
            "Voltage": 400,
            "PowerKW": 11,
            "CurrentTypeID": 20,
            "Quantity": 2
        }
    ],
    "NumberOfPoints": 2,
    "StatusTypeID": 50,
    "DateLastStatusUpdate": "2020-08-13T07:40:00Z",
    "DataQualityLevel": 1,
    "DateCreated": "2020-08-12T16:30:00Z",
    "SubmissionStatusTypeID": 200
}