{
    "IsRecentlyVerified": false,
    "ID": 133393,
    "UUID": "8759D2DA-50D7-4453-8F94-CEC56A3970FC",
    "DataProviderID": 1,
    "OperatorID": 3332,
    "UsageTypeID": 1,
    "UsageCost": "0",
    "AddressInfo": {
        "ID": 133739,
        "Title": "Viale Rimembranze",
        "AddressLine1": "Viale Rimembranze",
        "AddressLine2": "Pallanza",
        "Town": "Verbania",
        "StateOrProvince": "VB",
        "Postcode": "28922",
        "CountryID": 112,
        "Latitude": 45.929002347813,
        "Longitude": 8.5558587910939,
        "DistanceUnit": 0
    },
    "Connections": [
        {
            "ID": 186735,
            "ConnectionTypeID": 25,
            "StatusTypeID": 50,
            "LevelID": 2,
            "PowerKW": 22,
            "CurrentTypeID": 20
        }
    ],
    "NumberOfPoints": 2,
    "GeneralComments": "1",
    "StatusTypeID": 50,
    "DateLastStatusUpdate": "2019-10-17T11:12:00Z",
    "DataQualityLevel": 1,
    "DateCreated": "2019-10-17T09:16:00Z",
    "SubmissionStatusTypeID": 200
}