{
    "IsRecentlyVerified": false,
    "ID": 145220,
    "UUID": "892EF240-6C15-420D-90B5-2FAE709A1FDF",
    "DataProviderID": 1,
    "OperatorID": 90,
    "UsageTypeID": 4,
    "UsageCost": "$11.78/hr",
    "AddressInfo": {
        "ID": 145572,
        "Title": "BRCC – Ville de Montmagny – IGA Extra",
        "AddressLine1": "70 Boulevard Taché O",
        "Town": "Montmagny",
        "StateOrProvince": "QC",
        "Postcode": "G5V 3A4",
        "CountryID": 44,
        "Latitude": 46.97988,
        "Longitude": -70.568088,
        "ContactTelephone1": "877-505-2674",
        "AccessComments": "24 hours daily",
        "RelatedURL": "https://lecircuitelectrique.com/",
        "DistanceUnit": 0
    },
    "Connections": [
        {
            "ID": 201838,
            "ConnectionTypeID": 2,
            "StatusTypeID": 50,
            "LevelID": 3,
            "Amps": 125,
            "Voltage": 400,
            "PowerKW": 50,
            "CurrentTypeID": 30,
            "Quantity": 1
        },
        {
            "ID": 201839,
            "ConnectionTypeID": 32,
            "StatusTypeID": 50,
            "LevelID": 3,
            "Amps": 125,
            "Voltage": 400,
            "PowerKW": 50,
            "CurrentTypeID": 30,
            "Quantity": 1
        }
    ],
    "NumberOfPoints": 1,
    "StatusTypeID": 50,
    "DateLastStatusUpdate": "2020-03-17T08:35:00Z",
    "DataQualityLevel": 3,
    "DateCreated": "2019-12-24T09:24:00Z",
    "SubmissionStatusTypeID": 100
}