{
    "IsRecentlyVerified": false,
    "ID": 54650,
    "UUID": "82019E1F-2A11-4FA6-AD0B-FFA4B1B7753B",
    "DataProviderID": 26,
    "DataProvidersReference": "71426",
    "OperatorID": 73,
    "OperatorsReference": "EV-Box EVB-P1529032",
    "UsageCost": "0.00 jaarabonnement",
    "AddressInfo": {
        "ID": 54996,
        "Title": "Goudenregenplantsoen 207",
        "AddressLine1": "Goudenregenplantsoen 207",
        "Town": "Ridderkerk",
        "Postcode": "2982 TE",
        "CountryID": 159,
        "Latitude": 51.87244,
        "Longitude": 4.58166,
        "RelatedURL": "http://www.ev-box.nl",
        "DistanceUnit": 0
    },
    "Connections": [
        {
            "ID": 68987,
            "ConnectionTypeID": 25,
            "LevelID": 2,
            "PowerKW": 11,
            "CurrentTypeID": 10
        },
        {
            "ID": 68988,
            "ConnectionTypeID": 25,
            "LevelID": 2,
            "PowerKW": 11,
            "CurrentTypeID": 10
        }
    ],
    "NumberOfPoints": 1,
    "StatusTypeID": 50,
    "DateLastStatusUpdate": "2016-06-04T02:41:00Z",
    "DataQualityLevel": 3,
    "DateCreated": "2015-10-09T06:18:00Z",
    "SubmissionStatusTypeID": 100
}