{
    "MediaItems": [
        {
            "ID": 677,
            "ChargePointID": 24573,
            "ItemURL": "https://s3-ap-southeast-2.amazonaws.com/openchargemap/images/HK/OCM24573/OCM-24573.orig.2014101913400641.jpg",
            "ItemThumbnailURL": "https://s3-ap-southeast-2.amazonaws.com/openchargemap/images/HK/OCM24573/OCM-24573.thmb.2014101913400641.jpg",
            "Comment": "",
            "IsEnabled": true,
            "IsVideo": false,
            "IsFeaturedItem": false,
            "IsExternalResource": false,
            "User": {
                "ID": 2350,
                "Username": "Lawrence Tse"
            },
            "DateCreated": "2014-10-19T13:40:00Z"
        }
    ],
    "IsRecentlyVerified": false,
    "ID": 24573,
    "UUID": "B50B1F4B-7E1C-4036-84CD-89508228E0C1",
    "DataProviderID": 1,
    "OperatorID": 1,
    "UsageTypeID": 1,
    "UsageCost": "Free",
    "AddressInfo": {
        "ID": 24919,
        "Title": "Ma On Shan Centre",
        "AddressLine1": "1 On Chun Street",
        "Town": "Ma On Shan",
        "StateOrProvince": "New Territories",
        "CountryID": 4,
        "Latitude": 22.4258162412387,
        "Longitude": 114.233533143997,
        "DistanceUnit": 0
    },
    "Connections": [
        {
            "ID": 26841,
            "ConnectionTypeID": 3,
            "StatusTypeID": 50,
            "LevelID": 2,
            "CurrentTypeID": 10
        },
        {
            "ID": 26842,
            "ConnectionTypeID": 3,
            "StatusTypeID": 50,
            "LevelID": 2,
            "CurrentTypeID": 10
        }
    ],
    "NumberOfPoints": 2,
    "StatusTypeID": 50,
    "DateLastStatusUpdate": "2014-10-19T13:40:00Z",
    "DataQualityLevel": 1,
    "DateCreated": "2014-10-13T21:17:00Z",
    "SubmissionStatusTypeID": 200
}