{
    "IsRecentlyVerified": false,
    "ID": 17030,
    "UUID": "8EB309D1-83BB-404B-8C65-381587756701",
    "DataProviderID": 22,
    "DataProvidersReference": "57574E4F5E30961F96C7E320BF15A5DD",
    "AddressInfo": {
        "ID": 17375,
        "Title": "埼玉日産自動車川口栄町店",
        "AddressLine1": "埼玉県川口市栄町1-6-11",
        "CountryID": 114,
        "Latitude": 35.80357423,
        "Longitude": 139.7279881,
        "ContactTelephone1": "048-250-6123",
        "DistanceUnit": 0
    },
    "Connections": [
        {
            "ID": 17271,
            "ConnectionTypeID": 2,
            "LevelID": 2,
            "Amps": 100,
            "Voltage": 480,
            "PowerKW": 48,
            "Quantity": 1
        }
    ],
    "DateLastStatusUpdate": "2013-06-29T08:52:00Z",
    "DataQualityLevel": 2,
    "DateCreated": "2013-06-29T08:52:00Z",
    "SubmissionStatusTypeID": 200
}