{
    "IsRecentlyVerified": false,
    "ID": 95070,
    "UUID": "AFCF73E8-E858-4B8F-851F-E589D3CE1E29",
    "DataProviderID": 1,
    "OperatorID": 23,
    "OperatorsReference": "28679",
    "UsageTypeID": 4,
    "UsageCost": "$0.20/min >=60kW; $0.10/min <60kW; other tariffs for older cars",
    "AddressInfo": {
        "ID": 95416,
        "Title": "Spearfish, SD Supercharger",
        "AddressLine1": "3275 Old Belle RD",
        "Town": "Spearfish",
        "StateOrProvince": "SD",
        "Postcode": "57783-6222",
        "CountryID": 2,
        "Latitude": 44.520573,
        "Longitude": -103.89107,
        "DistanceUnit": 0
    },
    "Connections": [
        {
            "ID": 134710,
            "ConnectionTypeID": 27,
            "StatusTypeID": 50,
            "LevelID": 3,
            "PowerKW": 120,
            "CurrentTypeID": 30,
            "Quantity": 6
        }
    ],
    "NumberOfPoints": 6,
    "GeneralComments": "Charging6 Superchargers, available 24/7, up to 120kW",
    "StatusTypeID": 50,
    "DateLastStatusUpdate": "2018-03-13T16:26:00Z",
    "DataQualityLevel": 1,
    "DateCreated": "2017-11-02T06:43:00Z",
    "SubmissionStatusTypeID": 200
}