{
    "IsRecentlyVerified": false,
    "ID": 183060,
    "UUID": "8D7697B2-B216-4606-88DB-81EA517D2183",
    "DataProviderID": 29,
    "DataProvidersReference": "13767",
    "OperatorID": 86,
    "AddressInfo": {
        "ID": 183419,
        "Title": "BAB67; Autobahnraststätte Lorsch West",
        "AddressLine1": "BAB67; Autobahnraststätte Lorsch West",
        "Town": "Lorsch",
        "Postcode": "64653",
        "CountryID": 87,
        "Latitude": 49.643074,
        "Longitude": 8.551977,
        "DistanceUnit": 0
    },
    "Connections": [
        {
            "ID": 289578,
            "ConnectionTypeID": 1036,
            "StatusTypeID": 50,
            "LevelID": 3,
            "PowerKW": 43,
            "CurrentTypeID": 20
        },
        {
            "ID": 289579,
            "ConnectionTypeID": 33,
            "StatusTypeID": 50,
            "LevelID": 3,
            "PowerKW": 50,
            "CurrentTypeID": 30
        },
        {
            "ID": 297218,
            "ConnectionTypeID": 2,
            "StatusTypeID": 50,
            "LevelID": 3,
            "PowerKW": 50,
            "CurrentTypeID": 30
        }
    ],
    "StatusTypeID": 50,
    "DateLastStatusUpdate": "2021-07-12T02:43:00Z",
    "MetadataValues": [
        {
            "ID": 15353,
            "MetadataFieldID": 4,
            "ItemValue": "Data from the German chargepoint registry provided by Bundesnetzagentur.de under the CC-BY 4.0 license"
        }
    ],
    "DataQualityLevel": 3,
    "DateCreated": "2021-07-08T10:03:00Z",
    "SubmissionStatusTypeID": 100
}