{
    "IsRecentlyVerified": false,
    "ID": 115903,
    "UUID": "1BE5D416-9C43-46E3-B4C0-0E0FA8A8F97A",
    "DataProviderID": 2,
    "DataProvidersReference": "117625",
    "OperatorID": 5,
    "UsageTypeID": 1,
    "AddressInfo": {
        "ID": 116249,
        "Title": "ZONE 6 HDR",
        "AddressLine1": "2130 S 64th Plaza",
        "Town": "Omaha",
        "StateOrProvince": "NE",
        "Postcode": "68106",
        "CountryID": 2,
        "Latitude": 41.238962,
        "Longitude": -96.01109,
        "ContactTelephone1": "888-758-4389",
        "AccessComments": "24 hours daily",
        "RelatedURL": "http://www.chargepoint.com/",
        "DistanceUnit": 0
    },
    "Connections": [
        {
            "ID": 162948,
            "ConnectionTypeID": 1,
            "LevelID": 2,
            "Amps": 16,
            "Voltage": 230,
            "PowerKW": 3.7,
            "CurrentTypeID": 10,
            "Quantity": 4
        }
    ],
    "DateLastStatusUpdate": "2020-06-26T03:04:00Z",
    "DataQualityLevel": 3,
    "DateCreated": "2019-02-11T07:13:00Z",
    "SubmissionStatusTypeID": 100
}