{
    "IsRecentlyVerified": false,
    "ID": 8222,
    "UUID": "C0B965BF-2589-4683-8CF0-5837E21DE3EE",
    "DataProviderID": 15,
    "DataProvidersReference": "7138",
    "OperatorID": 26,
    "AddressInfo": {
        "ID": 8119,
        "Title": "330 E Sioux Ave",
        "AddressLine1": "330 E Sioux Ave",
        "Town": "Pierre",
        "StateOrProvince": "SD",
        "Postcode": "57501",
        "CountryID": 2,
        "Latitude": 44.36065,
        "Longitude": -100.33908,
        "ContactTelephone1": " (605) 224-9900",
        "RelatedURL": "http://carstations.com/7138",
        "DistanceUnit": 0
    },
    "Connections": [
        {
            "ID": 5651,
            "ConnectionTypeID": 1,
            "Reference": "J1772",
            "LevelID": 2
        }
    ],
    "StatusTypeID": 0,
    "DateLastStatusUpdate": "2017-11-04T14:05:00Z",
    "DataQualityLevel": 1,
    "DateCreated": "2011-11-11T12:06:00Z",
    "SubmissionStatusTypeID": 100
}