{
    "IsRecentlyVerified": false,
    "ID": 38817,
    "UUID": "235BD632-6C4B-43F4-B41F-1F1A3E630F95",
    "DataProviderID": 26,
    "DataProvidersReference": "40554",
    "OperatorsReference": "Laadpaal24 1335190",
    "UsageCost": "0.00 afhankelijk van pas",
    "AddressInfo": {
        "ID": 39163,
        "Title": "Tramstraat",
        "AddressLine1": "Tramstraat",
        "Town": "Coevorden",
        "Postcode": "7848 BJ",
        "CountryID": 159,
        "Latitude": 52.856365,
        "Longitude": 6.75166,
        "RelatedURL": "http://www.laadpaal24.nl",
        "DistanceUnit": 0
    },
    "Connections": [
        {
            "ID": 42328,
            "ConnectionTypeID": 25,
            "LevelID": 2,
            "PowerKW": 5,
            "CurrentTypeID": 10
        },
        {
            "ID": 95550,
            "ConnectionTypeID": 25,
            "LevelID": 2,
            "PowerKW": 22,
            "CurrentTypeID": 10
        }
    ],
    "NumberOfPoints": 1,
    "StatusTypeID": 50,
    "DateLastStatusUpdate": "2016-06-04T02:55:00Z",
    "DataQualityLevel": 3,
    "DateCreated": "2015-01-09T06:08:00Z",
    "SubmissionStatusTypeID": 100
}