{
    "IsRecentlyVerified": false,
    "ID": 145150,
    "UUID": "7F113AFE-9239-4C30-848D-5DA2F3EA9E30",
    "DataProviderID": 2,
    "DataProvidersReference": "129881",
    "OperatorID": 89,
    "UsageTypeID": 1,
    "AddressInfo": {
        "ID": 145502,
        "Title": "SQI - Service aérien gouvernemental",
        "AddressLine1": "700 7e rue de l'aéroport",
        "Town": "Quebec",
        "StateOrProvince": "QC",
        "Postcode": "G2G 2S8",
        "CountryID": 44,
        "Latitude": 46.795073,
        "Longitude": -71.378257,
        "ContactTelephone1": "888-356-8911",
        "AccessComments": "24 hours daily",
        "RelatedURL": "https://flo.ca/",
        "DistanceUnit": 0
    },
    "Connections": [
        {
            "ID": 201759,
            "ConnectionTypeID": 1,
            "LevelID": 2,
            "Amps": 16,
            "Voltage": 230,
            "PowerKW": 3.7,
            "CurrentTypeID": 10,
            "Quantity": 2
        }
    ],
    "StatusTypeID": 50,
    "DateLastStatusUpdate": "2020-06-26T03:10:00Z",
    "DataQualityLevel": 3,
    "DateCreated": "2019-12-24T09:24:00Z",
    "SubmissionStatusTypeID": 100
}