{
    "IsRecentlyVerified": false,
    "ID": 102943,
    "UUID": "E8A2F606-92BC-4563-8F65-9BD65C8EECF4",
    "DataProviderID": 2,
    "DataProvidersReference": "92249",
    "OperatorID": 5,
    "UsageTypeID": 1,
    "AddressInfo": {
        "ID": 103289,
        "Title": "EDENS BURLINGTO",
        "AddressLine1": "34 Cambridge St",
        "Town": "Burlington",
        "StateOrProvince": "MA",
        "Postcode": "01803",
        "CountryID": 2,
        "Latitude": 42.4845372,
        "Longitude": -71.1862655,
        "ContactTelephone1": "888-758-4389",
        "AccessComments": "24 hours daily",
        "RelatedURL": "http://www.chargepoint.com/",
        "DistanceUnit": 0
    },
    "Connections": [
        {
            "ID": 145090,
            "ConnectionTypeID": 1,
            "LevelID": 2,
            "Amps": 16,
            "Voltage": 230,
            "PowerKW": 3.7,
            "CurrentTypeID": 10,
            "Quantity": 2
        }
    ],
    "DateLastStatusUpdate": "2020-06-26T03:06:00Z",
    "DataQualityLevel": 3,
    "DateCreated": "2018-04-21T04:13:00Z",
    "SubmissionStatusTypeID": 100
}