{
    "IsRecentlyVerified": false,
    "ID": 88333,
    "UUID": "63C00527-2775-49A6-A7B1-A498FEC6405B",
    "DataProviderID": 1,
    "OperatorID": 23,
    "OperatorsReference": "30100",
    "UsageTypeID": 6,
    "AddressInfo": {
        "ID": 88679,
        "Title": "City Hotel Stockerau",
        "AddressLine1": "49 Hauptstrasse",
        "Town": "Stockerau",
        "Postcode": "2000",
        "CountryID": 19,
        "Latitude": 48.386203,
        "Longitude": 16.215588,
        "ContactTelephone1": "+43 2266 62930",
        "DistanceUnit": 0
    },
    "Connections": [
        {
            "ID": 125299,
            "ConnectionTypeID": 30,
            "StatusTypeID": 50,
            "LevelID": 2,
            "Amps": 32,
            "Voltage": 230,
            "PowerKW": 21,
            "CurrentTypeID": 20,
            "Quantity": 1
        }
    ],
    "NumberOfPoints": 1,
    "GeneralComments": "1 Tesla Connector, up to 21kW.Available for patrons only. Please see front desk.",
    "StatusTypeID": 50,
    "DateLastStatusUpdate": "2018-10-03T20:45:00Z",
    "DataQualityLevel": 1,
    "DateCreated": "2017-05-28T05:59:00Z",
    "SubmissionStatusTypeID": 200
}