{
    "IsRecentlyVerified": false,
    "ID": 32172,
    "UUID": "C3FC0E1B-2F90-4100-AEE1-9C547A62F99C",
    "DataProviderID": 1,
    "OperatorID": 157,
    "OperatorsReference": "NewMotion 02009649",
    "UsageCost": "0.00 jaarabonnement",
    "AddressInfo": {
        "ID": 32518,
        "Title": "Kirchweg 1",
        "AddressLine1": "Kirchweg 1",
        "Town": "Simmerath",
        "Postcode": "52152",
        "CountryID": 87,
        "Latitude": 50.5798187255859,
        "Longitude": 6.30362987518311,
        "ContactTelephone1": "088 0109500",
        "RelatedURL": "http://thenewmotion.nl/",
        "DistanceUnit": 0
    },
    "Connections": [
        {
            "ID": 35683,
            "ConnectionTypeID": 25,
            "LevelID": 2,
            "PowerKW": 3.7,
            "CurrentTypeID": 10
        }
    ],
    "NumberOfPoints": 1,
    "StatusTypeID": 50,
    "DateLastStatusUpdate": "2021-04-25T05:14:00Z",
    "DataQualityLevel": 3,
    "DateCreated": "2015-01-09T06:03:00Z",
    "SubmissionStatusTypeID": 200
}