{
    "IsRecentlyVerified": false,
    "ID": 124442,
    "UUID": "19F7F924-D1C0-46E7-9C73-5D536A8361D9",
    "DataProviderID": 2,
    "DataProvidersReference": "64105",
    "OperatorID": 5,
    "UsageTypeID": 1,
    "AddressInfo": {
        "ID": 124788,
        "Title": "SACRAMENTO",
        "AddressLine1": "5670-5750 Freeport Blvd",
        "Town": "Sacramento",
        "StateOrProvince": "CA",
        "Postcode": "95822",
        "CountryID": 2,
        "Latitude": 38.5218583,
        "Longitude": -121.4983768,
        "ContactTelephone1": "888-758-4389",
        "AccessComments": "24 hours daily",
        "RelatedURL": "http://www.chargepoint.com/",
        "DistanceUnit": 0
    },
    "Connections": [
        {
            "ID": 174541,
            "ConnectionTypeID": 1,
            "LevelID": 2,
            "Amps": 16,
            "Voltage": 230,
            "PowerKW": 3,
            "CurrentTypeID": 10,
            "Quantity": 2
        }
    ],
    "DateLastStatusUpdate": "2019-12-24T09:14:00Z",
    "DataQualityLevel": 3,
    "DateCreated": "2019-04-06T05:03:00Z",
    "SubmissionStatusTypeID": 100
}