{
    "IsRecentlyVerified": false,
    "ID": 17143,
    "UUID": "03B6CF83-DC54-4241-A881-958DE64835D4",
    "DataProviderID": 22,
    "DataProvidersReference": "B91D12ADF38B1A2C446579B64E7C5A7C",
    "AddressInfo": {
        "ID": 17488,
        "Title": "日産プリンス神奈川販売中原店",
        "AddressLine1": "神奈川県川崎市中原区上小田中6-16-2",
        "CountryID": 114,
        "Latitude": 35.57948564,
        "Longitude": 139.6450553,
        "ContactTelephone1": "044-733-2221",
        "DistanceUnit": 0
    },
    "Connections": [
        {
            "ID": 17384,
            "ConnectionTypeID": 2,
            "LevelID": 2,
            "Amps": 100,
            "Voltage": 480,
            "PowerKW": 48,
            "Quantity": 1
        }
    ],
    "DateLastStatusUpdate": "2013-06-29T08:54:00Z",
    "DataQualityLevel": 2,
    "DateCreated": "2013-06-29T08:54:00Z",
    "SubmissionStatusTypeID": 200
}