{
    "IsRecentlyVerified": false,
    "ID": 178812,
    "UUID": "BCE05BF3-417A-42DA-B09C-F6F22B4151F8",
    "DataProviderID": 29,
    "DataProvidersReference": "3381",
    "AddressInfo": {
        "ID": 179171,
        "Title": "Böhmerwaldstraße 111",
        "AddressLine1": "Böhmerwaldstraße 111",
        "Town": "Wenzenbach",
        "Postcode": "93173",
        "CountryID": 87,
        "Latitude": 49.058843,
        "Longitude": 12.135141,
        "DistanceUnit": 0
    },
    "Connections": [
        {
            "ID": 279745,
            "ConnectionTypeID": 25,
            "StatusTypeID": 50,
            "LevelID": 2,
            "PowerKW": 22,
            "CurrentTypeID": 20
        },
        {
            "ID": 279746,
            "ConnectionTypeID": 25,
            "StatusTypeID": 50,
            "LevelID": 2,
            "PowerKW": 22,
            "CurrentTypeID": 20
        }
    ],
    "StatusTypeID": 0,
    "DateLastStatusUpdate": "2021-07-12T02:42:00Z",
    "MetadataValues": [
        {
            "ID": 11106,
            "MetadataFieldID": 4,
            "ItemValue": "Data from the German chargepoint registry provided by Bundesnetzagentur.de under the CC-BY 4.0 license"
        }
    ],
    "DataQualityLevel": 3,
    "DateCreated": "2021-07-08T09:50:00Z",
    "SubmissionStatusTypeID": 100
}