{
    "IsRecentlyVerified": false,
    "ID": 122878,
    "UUID": "CFB4BC10-B8DF-411E-B707-29148057BAB0",
    "DataProviderID": 2,
    "DataProvidersReference": "82263",
    "OperatorID": 5,
    "UsageTypeID": 1,
    "AddressInfo": {
        "ID": 123224,
        "Title": "MASP",
        "AddressLine1": "16999 Airport Blvd",
        "Town": "Mojave",
        "StateOrProvince": "CA",
        "Postcode": "93501",
        "CountryID": 2,
        "Latitude": 35.056127,
        "Longitude": -118.157621,
        "ContactTelephone1": "888-758-4389",
        "AccessComments": "24 hours daily",
        "RelatedURL": "http://www.chargepoint.com/",
        "DistanceUnit": 0
    },
    "Connections": [
        {
            "ID": 172803,
            "ConnectionTypeID": 1,
            "LevelID": 2,
            "Amps": 16,
            "Voltage": 230,
            "PowerKW": 3,
            "CurrentTypeID": 10,
            "Quantity": 4
        }
    ],
    "DateLastStatusUpdate": "2019-12-24T09:12:00Z",
    "DataQualityLevel": 3,
    "DateCreated": "2019-04-06T05:03:00Z",
    "SubmissionStatusTypeID": 100
}