{
    "IsRecentlyVerified": false,
    "ID": 20462,
    "UUID": "4ED9FC2C-8366-476F-992F-8129784D12B0",
    "DataProviderID": 1,
    "OperatorID": 1,
    "UsageTypeID": 0,
    "UsageCost": "",
    "AddressInfo": {
        "ID": 20807,
        "Title": " Parking Gare Part-Dieu",
        "AddressLine1": "110 Rue de Bonnel ",
        "AddressLine2": "",
        "Town": "Lyon",
        "StateOrProvince": "",
        "Postcode": "69003",
        "CountryID": 80,
        "Latitude": 45.76219,
        "Longitude": 4.85264,
        "ContactTelephone1": "",
        "ContactTelephone2": "",
        "ContactEmail": "",
        "AccessComments": "Réservé aux clients de l'établissement",
        "RelatedURL": "",
        "DistanceUnit": 0
    },
    "Connections": [],
    "GeneralComments": "",
    "StatusTypeID": 50,
    "DateLastStatusUpdate": "2013-11-15T11:29:00Z",
    "DataQualityLevel": 1,
    "DateCreated": "2013-11-15T10:48:00Z",
    "SubmissionStatusTypeID": 200
}