{
    "IsRecentlyVerified": false,
    "ID": 186978,
    "UUID": "C905BA05-5D43-4358-9291-520D0D2CF809",
    "DataProviderID": 29,
    "DataProvidersReference": "17531",
    "OperatorID": 103,
    "AddressInfo": {
        "ID": 187337,
        "Title": "Zimbelstr. 4",
        "AddressLine1": "Zimbelstr. 4",
        "Town": "Berlin",
        "Postcode": "13127",
        "CountryID": 87,
        "Latitude": 52.588954,
        "Longitude": 13.429102,
        "DistanceUnit": 0
    },
    "Connections": [
        {
            "ID": 300838,
            "ConnectionTypeID": 33,
            "StatusTypeID": 50,
            "LevelID": 3,
            "PowerKW": 50,
            "CurrentTypeID": 30
        },
        {
            "ID": 300839,
            "ConnectionTypeID": 2,
            "StatusTypeID": 50,
            "LevelID": 3,
            "PowerKW": 50,
            "CurrentTypeID": 30
        },
        {
            "ID": 300840,
            "ConnectionTypeID": 1036,
            "StatusTypeID": 50,
            "LevelID": 3,
            "PowerKW": 43,
            "CurrentTypeID": 20
        }
    ],
    "StatusTypeID": 50,
    "DateLastStatusUpdate": "2021-07-12T02:50:00Z",
    "MetadataValues": [
        {
            "ID": 19218,
            "MetadataFieldID": 4,
            "ItemValue": "Data from the German chargepoint registry provided by Bundesnetzagentur.de under the CC-BY 4.0 license"
        }
    ],
    "DataQualityLevel": 3,
    "DateCreated": "2021-07-12T02:50:00Z",
    "SubmissionStatusTypeID": 100
}