{
    "IsRecentlyVerified": false,
    "ID": 98007,
    "UUID": "EE437D1C-BB12-42C2-A498-A9568F12760E",
    "DataProviderID": 1,
    "OperatorID": 23,
    "OperatorsReference": "39418",
    "UsageTypeID": 6,
    "AddressInfo": {
        "ID": 98353,
        "Title": "Hotel M14",
        "AddressLine1": "Via Acquette",
        "Town": "9",
        "StateOrProvince": "Padova",
        "Postcode": "35122",
        "CountryID": 112,
        "Latitude": 45.399878,
        "Longitude": 11.873504,
        "ContactTelephone1": "+39 0498 762 011",
        "DistanceUnit": 0
    },
    "Connections": [
        {
            "ID": 138915,
            "ConnectionTypeID": 30,
            "StatusTypeID": 50,
            "LevelID": 2,
            "Amps": 32,
            "Voltage": 400,
            "PowerKW": 22,
            "CurrentTypeID": 20,
            "Quantity": 2
        }
    ],
    "NumberOfPoints": 2,
    "GeneralComments": "2 Tesla Connectors, up to 22kW.Available for customers. Please call ahead.",
    "StatusTypeID": 50,
    "DateLastStatusUpdate": "2020-09-30T09:40:00Z",
    "DataQualityLevel": 1,
    "DateCreated": "2018-01-21T17:32:00Z",
    "SubmissionStatusTypeID": 200
}