{
    "IsRecentlyVerified": false,
    "ID": 129710,
    "UUID": "209836B7-5A5E-408E-955B-2DF24917B85E",
    "DataProviderID": 1,
    "OperatorID": 3364,
    "UsageTypeID": 1,
    "UsageCost": "230clp/kWh",
    "AddressInfo": {
        "ID": 130056,
        "Title": "Copec",
        "AddressLine1": "Ruta 5 km 237",
        "AddressLine2": "Santa Amalia",
        "Town": "San Rafael",
        "StateOrProvince": "Provincia de Talca",
        "CountryID": 49,
        "Latitude": -35.320656,
        "Longitude": -71.539357,
        "DistanceUnit": 0
    },
    "Connections": [
        {
            "ID": 181544,
            "ConnectionTypeID": 2,
            "StatusTypeID": 50,
            "LevelID": 3,
            "Amps": 125,
            "Voltage": 500,
            "PowerKW": 50,
            "CurrentTypeID": 30,
            "Quantity": 1
        },
        {
            "ID": 181545,
            "ConnectionTypeID": 1036,
            "StatusTypeID": 50,
            "LevelID": 3,
            "Amps": 63,
            "Voltage": 400,
            "PowerKW": 43,
            "CurrentTypeID": 20,
            "Quantity": 1
        },
        {
            "ID": 181546,
            "ConnectionTypeID": 33,
            "StatusTypeID": 50,
            "LevelID": 3,
            "Amps": 125,
            "Voltage": 500,
            "PowerKW": 50,
            "CurrentTypeID": 30,
            "Quantity": 1
        }
    ],
    "NumberOfPoints": 1,
    "GeneralComments": "Copec/Voltex\r\nMight need app",
    "StatusTypeID": 50,
    "DateLastStatusUpdate": "2019-07-24T11:05:00Z",
    "DataQualityLevel": 1,
    "DateCreated": "2019-07-24T11:04:00Z",
    "SubmissionStatusTypeID": 200
}