{
    "IsRecentlyVerified": false,
    "ID": 67259,
    "UUID": "ACDC63B3-CB58-4390-B2D2-AF94930BCFAC",
    "DataProviderID": 2,
    "DataProvidersReference": "75619",
    "UsageTypeID": 1,
    "AddressInfo": {
        "ID": 67605,
        "Title": "Malloy Toyota Scion",
        "AddressLine1": "400 Weems Ln",
        "Town": "Winchester",
        "StateOrProvince": "VA",
        "Postcode": "22601",
        "CountryID": 2,
        "Latitude": 39.162417,
        "Longitude": -78.182466,
        "ContactTelephone1": "540-678-1791",
        "AccessComments": "Dealership business hours",
        "RelatedURL": "",
        "DistanceUnit": 0
    },
    "Connections": [
        {
            "ID": 92760,
            "ConnectionTypeID": 1,
            "LevelID": 2,
            "Amps": 16,
            "Voltage": 230,
            "PowerKW": 3.7,
            "CurrentTypeID": 10,
            "Quantity": 1
        }
    ],
    "DateLastStatusUpdate": "2020-06-26T03:01:00Z",
    "DataQualityLevel": 3,
    "DateCreated": "2016-05-29T02:05:00Z",
    "SubmissionStatusTypeID": 100
}