{
    "IsRecentlyVerified": false,
    "ID": 65803,
    "UUID": "BFC8E330-7080-4A7B-8D9E-3661113A3916",
    "DataProviderID": 26,
    "DataProvidersReference": "84391",
    "OperatorID": 103,
    "OperatorsReference": "Allego NLALLEGO0001411",
    "UsageCost": "0.00 jaarabonnement",
    "AddressInfo": {
        "ID": 66149,
        "Title": "Jan Steenstraat 5",
        "AddressLine1": "Jan Steenstraat 5",
        "Town": "Groningen",
        "Postcode": "9718 LG",
        "CountryID": 159,
        "Latitude": 53.21628954,
        "Longitude": 6.54673433,
        "ContactTelephone1": "0800-3745337",
        "RelatedURL": "http://www.allego.eu/",
        "DistanceUnit": 0
    },
    "Connections": [
        {
            "ID": 90879,
            "ConnectionTypeID": 25,
            "LevelID": 2,
            "PowerKW": 11,
            "CurrentTypeID": 10
        },
        {
            "ID": 90880,
            "ConnectionTypeID": 25,
            "LevelID": 2,
            "PowerKW": 11,
            "CurrentTypeID": 10
        }
    ],
    "NumberOfPoints": 1,
    "StatusTypeID": 50,
    "DateLastStatusUpdate": "2016-06-04T02:56:00Z",
    "DataQualityLevel": 3,
    "DateCreated": "2016-04-27T09:42:00Z",
    "SubmissionStatusTypeID": 100
}