{
    "IsRecentlyVerified": false,
    "ID": 168357,
    "UUID": "B196141C-4C39-4F16-852E-3E797048EC13",
    "DataProviderID": 1,
    "OperatorID": 32,
    "UsageTypeID": 5,
    "UsageCost": "Polar members: £0.15/kWh; instant: £0.25/kWh (£1.20 min payment); contactless: 30p/kWh (£1.50 min payment)",
    "AddressInfo": {
        "ID": 168716,
        "Title": "Miller & Carter Warrington",
        "AddressLine1": "Delta Crescent",
        "AddressLine2": "Burtonwood and Westbrook",
        "Town": "Warrington",
        "StateOrProvince": "Warrington",
        "Postcode": "WA5 7WQ",
        "CountryID": 1,
        "Latitude": 53.41195930505154,
        "Longitude": -2.633181588116031,
        "AccessComments": "Max height 2m",
        "DistanceUnit": 0
    },
    "Connections": [
        {
            "ID": 255688,
            "ConnectionTypeID": 33,
            "StatusTypeID": 50,
            "LevelID": 3,
            "PowerKW": 50,
            "CurrentTypeID": 30,
            "Quantity": 1
        },
        {
            "ID": 255689,
            "ConnectionTypeID": 2,
            "StatusTypeID": 50,
            "LevelID": 3,
            "PowerKW": 50,
            "CurrentTypeID": 30,
            "Quantity": 1
        },
        {
            "ID": 255690,
            "ConnectionTypeID": 1036,
            "StatusTypeID": 50,
            "LevelID": 3,
            "Amps": 63,
            "Voltage": 400,
            "PowerKW": 43,
            "CurrentTypeID": 20,
            "Quantity": 1
        }
    ],
    "NumberOfPoints": 1,
    "GeneralComments": "Unit located in the customer car park. Parking restrictions might apply, please check with reception.",
    "StatusTypeID": 50,
    "DateLastStatusUpdate": "2020-09-23T06:56:00Z",
    "DataQualityLevel": 1,
    "DateCreated": "2020-09-23T06:54:00Z",
    "SubmissionStatusTypeID": 200
}