{
    "IsRecentlyVerified": false,
    "ID": 154190,
    "UUID": "B02C94EF-F0DA-414A-9424-1BE25374EE8C",
    "DataProviderID": 28,
    "DataProvidersReference": "FR*S27*PBOURTHEROULDE*MAIRIE",
    "UsageTypeID": 5,
    "AddressInfo": {
        "ID": 154543,
        "Title": "900089",
        "AddressLine1": "Place de la Mairie Bourtheroulde",
        "CountryID": 80,
        "Latitude": 49.299502,
        "Longitude": 0.874672,
        "AccessComments": "24/24 7/7 jours",
        "DistanceUnit": 0
    },
    "Connections": [
        {
            "ID": 216723,
            "ConnectionTypeID": 28,
            "StatusTypeID": 50,
            "LevelID": 2,
            "PowerKW": 22,
            "CurrentTypeID": 10
        },
        {
            "ID": 216724,
            "ConnectionTypeID": 26,
            "StatusTypeID": 50,
            "LevelID": 2,
            "PowerKW": 22
        },
        {
            "ID": 251090,
            "ConnectionTypeID": 28,
            "StatusTypeID": 50,
            "LevelID": 2,
            "PowerKW": 22,
            "CurrentTypeID": 10
        },
        {
            "ID": 251091,
            "ConnectionTypeID": 26,
            "StatusTypeID": 50,
            "LevelID": 2,
            "PowerKW": 22
        }
    ],
    "GeneralComments": "Borne en service",
    "StatusTypeID": 50,
    "DateLastStatusUpdate": "2020-08-27T05:16:00Z",
    "DataQualityLevel": 2,
    "DateCreated": "2020-03-15T10:55:00Z",
    "SubmissionStatusTypeID": 100
}