{
    "IsRecentlyVerified": false,
    "ID": 165128,
    "UUID": "D0B7C3AD-164C-4FF9-B076-FC4C9415C645",
    "DataProviderID": 1,
    "OperatorID": 23,
    "OperatorsReference": "34792",
    "UsageTypeID": 4,
    "UsageCost": "$0.24/min >=60kW; $0.12/min <60kW; other tariffs for older cars",
    "AddressInfo": {
        "ID": 165487,
        "Title": "Ashland, NH Supercharger",
        "AddressLine1": "158 Main Street",
        "Town": "Ashland",
        "StateOrProvince": "NH",
        "Postcode": "03217",
        "CountryID": 2,
        "Latitude": 43.69811,
        "Longitude": -71.640125,
        "DistanceUnit": 0
    },
    "Connections": [
        {
            "ID": 236748,
            "ConnectionTypeID": 27,
            "StatusTypeID": 50,
            "LevelID": 3,
            "PowerKW": 120,
            "CurrentTypeID": 30,
            "Quantity": 8
        }
    ],
    "NumberOfPoints": 8,
    "GeneralComments": "Charging8 Superchargers, available 24/7, up to 250kW",
    "StatusTypeID": 50,
    "DateLastStatusUpdate": "2020-08-26T05:26:00Z",
    "DataQualityLevel": 1,
    "DateCreated": "2020-08-26T05:26:00Z",
    "SubmissionStatusTypeID": 200
}