{
    "UserComments": [
        {
            "ID": 12715,
            "ChargePointID": 68468,
            "CommentTypeID": 100,
            "UserName": "orlococco",
            "Comment": "The charge point is ok!",
            "Rating": 5,
            "DateCreated": "2016-06-28T07:32:59.54Z",
            "User": {
                "ID": 11549,
                "Username": "orlococco"
            },
            "CheckinStatusTypeID": 10
        }
    ],
    "MediaItems": [
        {
            "ID": 15694,
            "ChargePointID": 68468,
            "ItemURL": "https://s3-ap-southeast-2.amazonaws.com/openchargemap/images/IT/OCM68468/OCM-68468.orig.2018061816014637.jpg",
            "ItemThumbnailURL": "https://s3-ap-southeast-2.amazonaws.com/openchargemap/images/IT/OCM68468/OCM-68468.thmb.2018061816014637.jpg",
            "Comment": "",
            "IsEnabled": true,
            "IsVideo": false,
            "IsFeaturedItem": false,
            "IsExternalResource": false,
            "User": {
                "ID": 1606,
                "Username": "polianto"
            },
            "DateCreated": "2018-06-18T16:02:00Z"
        },
        {
            "ID": 15695,
            "ChargePointID": 68468,
            "ItemURL": "https://s3-ap-southeast-2.amazonaws.com/openchargemap/images/IT/OCM68468/OCM-68468.orig.2018061816020054.jpg",
            "ItemThumbnailURL": "https://s3-ap-southeast-2.amazonaws.com/openchargemap/images/IT/OCM68468/OCM-68468.thmb.2018061816020054.jpg",
            "Comment": "",
            "IsEnabled": true,
            "IsVideo": false,
            "IsFeaturedItem": false,
            "IsExternalResource": false,
            "User": {
                "ID": 1606,
                "Username": "polianto"
            },
            "DateCreated": "2018-06-18T16:02:00Z"
        },
        {
            "ID": 15696,
            "ChargePointID": 68468,
            "ItemURL": "https://s3-ap-southeast-2.amazonaws.com/openchargemap/images/IT/OCM68468/OCM-68468.orig.2018061816021288.jpg",
            "ItemThumbnailURL": "https://s3-ap-southeast-2.amazonaws.com/openchargemap/images/IT/OCM68468/OCM-68468.thmb.2018061816021288.jpg",
            "Comment": "",
            "IsEnabled": true,
            "IsVideo": false,
            "IsFeaturedItem": false,
            "IsExternalResource": false,
            "User": {
                "ID": 1606,
                "Username": "polianto"
            },
            "DateCreated": "2018-06-18T16:02:00Z"
        },
        {
            "ID": 7678,
            "ChargePointID": 68468,
            "ItemURL": "https://s3-ap-southeast-2.amazonaws.com/openchargemap/images/IT/OCM68468/OCM-68468.orig.2016062910245445.jpg",
            "ItemThumbnailURL": "https://s3-ap-southeast-2.amazonaws.com/openchargemap/images/IT/OCM68468/OCM-68468.thmb.2016062910245445.jpg",
            "Comment": "",
            "IsEnabled": true,
            "IsVideo": false,
            "IsFeaturedItem": false,
            "IsExternalResource": false,
            "User": {
                "ID": 11549,
                "Username": "orlococco"
            },
            "DateCreated": "2016-06-29T10:25:00Z"
        }
    ],
    "IsRecentlyVerified": false,
    "ID": 68468,
    "UUID": "F4718856-480A-4944-8821-02FBE527155C",
    "DataProviderID": 1,
    "OperatorID": 3267,
    "UsageTypeID": 4,
    "UsageCost": "0,488 €/kW",
    "AddressInfo": {
        "ID": 68814,
        "Title": "Duferco Municipio di S. Margherita Ligure",
        "AddressLine1": "Piazza Giuseppe Mazzini, 46",
        "Town": "Santa Margherita Ligure",
        "StateOrProvince": "GE",
        "Postcode": "16038",
        "CountryID": 112,
        "Latitude": 44.3346678385151,
        "Longitude": 9.21017414899485,
        "DistanceUnit": 0
    },
    "Connections": [
        {
            "ID": 95761,
            "ConnectionTypeID": 25,
            "StatusTypeID": 50,
            "LevelID": 2,
            "Amps": 32,
            "Voltage": 240,
            "PowerKW": 7,
            "CurrentTypeID": 10,
            "Quantity": 1
        },
        {
            "ID": 97855,
            "ConnectionTypeID": 36,
            "StatusTypeID": 50,
            "LevelID": 2,
            "Amps": 16,
            "Voltage": 240,
            "PowerKW": 3.7,
            "CurrentTypeID": 10,
            "Quantity": 2
        },
        {
            "ID": 98936,
            "ConnectionTypeID": 25,
            "StatusTypeID": 50,
            "LevelID": 2,
            "Amps": 32,
            "Voltage": 400,
            "PowerKW": 22,
            "CurrentTypeID": 20,
            "Quantity": 1
        },
        {
            "ID": 98937,
            "ConnectionTypeID": 36,
            "StatusTypeID": 50,
            "LevelID": 2,
            "PowerKW": 3.7,
            "CurrentTypeID": 20
        }
    ],
    "NumberOfPoints": 4,
    "StatusTypeID": 50,
    "DateLastStatusUpdate": "2018-06-18T16:02:00Z",
    "DataQualityLevel": 1,
    "DateCreated": "2016-06-08T13:48:00Z",
    "SubmissionStatusTypeID": 200
}