{
    "IsRecentlyVerified": false,
    "ID": 9149,
    "UUID": "C37500AB-9FD5-4470-87F8-5EF295C5CD7A",
    "DataProviderID": 15,
    "DataProvidersReference": "9941",
    "OperatorID": 1,
    "UsageTypeID": 1,
    "AddressInfo": {
        "ID": 9046,
        "Title": "2403 Centreville Rd",
        "AddressLine1": "2403 Centreville Rd",
        "Town": "Herndon",
        "StateOrProvince": "Virginia",
        "Postcode": "20171",
        "CountryID": 2,
        "Latitude": 38.9521,
        "Longitude": -77.40935,
        "ContactTelephone1": "703-434-3615 ",
        "RelatedURL": "http://carstations.com/9941",
        "DistanceUnit": 0
    },
    "Connections": [
        {
            "ID": 6830,
            "ConnectionTypeID": 1,
            "Reference": "J1772",
            "LevelID": 2
        }
    ],
    "NumberOfPoints": 1,
    "StatusTypeID": 0,
    "DateLastStatusUpdate": "2017-11-04T14:04:00Z",
    "DataQualityLevel": 2,
    "DateCreated": "2012-01-23T15:11:00Z",
    "SubmissionStatusTypeID": 100
}