{
    "IsRecentlyVerified": false,
    "ID": 153879,
    "UUID": "4CEE88C3-8729-4D82-9699-156678AB18FD",
    "DataProviderID": 28,
    "DataProvidersReference": "FR*S10*P10216B",
    "UsageTypeID": 5,
    "AddressInfo": {
        "ID": 154232,
        "Title": "MAILLY LE CAMP",
        "AddressLine1": "66 Rue Général de Gaulle 10230 MAILLY LE CAMP",
        "CountryID": 80,
        "Latitude": 48.669258,
        "Longitude": 4.201564,
        "AccessComments": "",
        "DistanceUnit": 0
    },
    "Connections": [
        {
            "ID": 216137,
            "ConnectionTypeID": 28,
            "StatusTypeID": 50,
            "LevelID": 2,
            "PowerKW": 18,
            "CurrentTypeID": 10
        },
        {
            "ID": 216138,
            "ConnectionTypeID": 25,
            "StatusTypeID": 50,
            "LevelID": 2,
            "PowerKW": 18,
            "CurrentTypeID": 20
        },
        {
            "ID": 250048,
            "ConnectionTypeID": 28,
            "StatusTypeID": 50,
            "LevelID": 2,
            "PowerKW": 18,
            "CurrentTypeID": 10
        },
        {
            "ID": 250049,
            "ConnectionTypeID": 25,
            "StatusTypeID": 50,
            "LevelID": 2,
            "PowerKW": 18,
            "CurrentTypeID": 20
        }
    ],
    "GeneralComments": "\"Une unité = 6kWh de recharge. Utilisateur abonné : 1€/unité",
    "StatusTypeID": 50,
    "DateLastStatusUpdate": "2020-08-27T05:15:00Z",
    "DataQualityLevel": 2,
    "DateCreated": "2020-03-15T10:54:00Z",
    "SubmissionStatusTypeID": 100
}