{
    "IsRecentlyVerified": false,
    "ID": 122367,
    "UUID": "86375975-62B9-4932-BA1A-524316E52661",
    "DataProviderID": 2,
    "DataProvidersReference": "60334",
    "OperatorID": 5,
    "UsageTypeID": 1,
    "AddressInfo": {
        "ID": 122713,
        "Title": "CITY HALL LOT",
        "AddressLine1": "227 N Harvard Ave",
        "Town": "Claremont",
        "StateOrProvince": "CA",
        "Postcode": "91711",
        "CountryID": 2,
        "Latitude": 34.096114,
        "Longitude": -117.7166765,
        "ContactTelephone1": "888-758-4389",
        "AccessComments": "24 hours daily",
        "RelatedURL": "http://www.chargepoint.com/",
        "DistanceUnit": 0
    },
    "Connections": [
        {
            "ID": 172252,
            "ConnectionTypeID": 1,
            "LevelID": 2,
            "Amps": 16,
            "Voltage": 230,
            "PowerKW": 3,
            "CurrentTypeID": 10,
            "Quantity": 2
        }
    ],
    "DateLastStatusUpdate": "2019-12-24T09:11:00Z",
    "DataQualityLevel": 3,
    "DateCreated": "2019-04-06T05:03:00Z",
    "SubmissionStatusTypeID": 100
}