{
    "IsRecentlyVerified": false,
    "ID": 169372,
    "UUID": "4BA4DFB3-8B6D-49E1-AB88-90C4D41E8EDD",
    "DataProviderID": 1,
    "OperatorID": 3,
    "OperatorsReference": "PG-84582,PG-84583,PG-84584,PG-84640,PG-84703,PG-98541,PG-98558",
    "UsageTypeID": 4,
    "UsageCost": "Free",
    "AddressInfo": {
        "ID": 169731,
        "Title": "Haywards Heath Station MSCP",
        "AddressLine1": "Commercial Square",
        "Town": "Haywards Heath",
        "Postcode": "RH16 1DJ",
        "CountryID": 1,
        "Latitude": 51.0047348,
        "Longitude": -0.1051424,
        "DistanceUnit": 0
    },
    "Connections": [
        {
            "ID": 257695,
            "ConnectionTypeID": 25,
            "StatusTypeID": 50,
            "LevelID": 2,
            "Amps": 32,
            "Voltage": 230,
            "PowerKW": 7,
            "CurrentTypeID": 10,
            "Quantity": 12
        }
    ],
    "NumberOfPoints": 12,
    "GeneralComments": "This is an open charge unit installed at the Haywards Heath Station MSCP at Commercial Square, Haywards Heath",
    "StatusTypeID": 50,
    "DateLastStatusUpdate": "2020-10-15T21:59:00Z",
    "DataQualityLevel": 1,
    "DateCreated": "2020-10-15T21:36:00Z",
    "SubmissionStatusTypeID": 200
}