{
    "IsRecentlyVerified": false,
    "ID": 100999,
    "UUID": "4E4E4BD7-2771-4973-A6B4-263875493D61",
    "DataProviderID": 1,
    "OperatorID": 45,
    "UsageTypeID": 1,
    "AddressInfo": {
        "ID": 101345,
        "Title": "E-Bike Station Parkplatz Bärenwiese",
        "AddressLine1": "Friedrich-Ebert-Straße",
        "Town": "Ludwigsburg",
        "StateOrProvince": "Landkreis Ludwigsburg",
        "Postcode": "71638",
        "CountryID": 87,
        "Latitude": 48.89333939035857,
        "Longitude": 9.196551162535116,
        "AccessComments": "24/7 nutzbarer Ladeschrank mit 4 abschließbaren Fächern unter einem überdachten Fahrradständer.",
        "DistanceUnit": 0
    },
    "Connections": [
        {
            "ID": 142611,
            "ConnectionTypeID": 28,
            "StatusTypeID": 50,
            "LevelID": 1,
            "Amps": 10,
            "Voltage": 230,
            "PowerKW": 2.3,
            "CurrentTypeID": 10,
            "Quantity": 4
        }
    ],
    "NumberOfPoints": 4,
    "StatusTypeID": 50,
    "DateLastStatusUpdate": "2018-03-14T06:31:00Z",
    "DataQualityLevel": 1,
    "DateCreated": "2018-03-14T06:31:00Z",
    "SubmissionStatusTypeID": 200
}