{
    "IsRecentlyVerified": false,
    "ID": 135740,
    "UUID": "50285C70-1568-4A56-AE5D-A41B4F80559A",
    "DataProviderID": 18,
    "DataProvidersReference": "1b578a8956478def2a120ef4c0ca2975",
    "OperatorID": 3393,
    "UsageTypeID": 5,
    "AddressInfo": {
        "ID": 136086,
        "Title": "St. Bartholomews Road",
        "AddressLine1": "St. Bartholomews Road",
        "Town": "Reading",
        "Postcode": "RG1 3QA",
        "CountryID": 1,
        "Latitude": 51.45305,
        "Longitude": -0.9423,
        "AccessComments": "",
        "RelatedURL": "http://www.joju.co.uk/",
        "DistanceUnit": 0
    },
    "Connections": [
        {
            "ID": 190160,
            "ConnectionTypeID": 25,
            "Reference": "05562",
            "StatusTypeID": 100,
            "LevelID": 2,
            "Amps": 16,
            "Voltage": 230,
            "PowerKW": 3.7,
            "CurrentTypeID": 10
        }
    ],
    "StatusTypeID": 0,
    "DateLastStatusUpdate": "2020-03-17T08:53:00Z",
    "MetadataValues": [
        {
            "ID": 5592,
            "MetadataFieldID": 4,
            "ItemValue": "Contains public sector information licensed under the Open Government Licence v2.0. http://www.nationalarchives.gov.uk/doc/open-government-licence/version/2/"
        }
    ],
    "DataQualityLevel": 3,
    "DateCreated": "2019-12-24T05:22:00Z",
    "SubmissionStatusTypeID": 100
}