{
    "IsRecentlyVerified": false,
    "ID": 160162,
    "UUID": "40080CAC-36A8-4CB6-BB65-5BC6EE3EA318",
    "DataProviderID": 2,
    "DataProvidersReference": "155681",
    "OperatorID": 3372,
    "UsageTypeID": 5,
    "AddressInfo": {
        "ID": 160519,
        "Title": "Porter Town Hall",
        "AddressLine1": "3265 Creek Rd",
        "Town": "Youngstown",
        "StateOrProvince": "NY",
        "Postcode": "14175",
        "CountryID": 2,
        "Latitude": 43.257291,
        "Longitude": -79.008523,
        "ContactTelephone1": "866-816-7584",
        "AccessComments": "24 hours daily; also accepts Paypal and EV Connect App\r\nPublic - Credit card at all times",
        "RelatedURL": "http://evconnect.com/",
        "DistanceUnit": 0
    },
    "Connections": [
        {
            "ID": 230418,
            "ConnectionTypeID": 1,
            "LevelID": 2,
            "Amps": 16,
            "Voltage": 230,
            "PowerKW": 3.7,
            "CurrentTypeID": 10,
            "Quantity": 2
        }
    ],
    "StatusTypeID": 50,
    "DateLastStatusUpdate": "2020-06-26T03:06:00Z",
    "DataQualityLevel": 3,
    "DateCreated": "2020-06-26T03:06:00Z",
    "SubmissionStatusTypeID": 100
}