{
    "IsRecentlyVerified": false,
    "ID": 157839,
    "UUID": "30BEE268-F506-4138-BF03-B4D965BB8ADE",
    "DataProviderID": 18,
    "DataProvidersReference": "cfbe1de1e682aa145ebe2d0360148483",
    "UsageTypeID": 1,
    "AddressInfo": {
        "ID": 158193,
        "Title": "1 Management Centre, Marsh Street North",
        "AddressLine1": "1 Management Centre, Marsh Street North",
        "Town": "Dartford",
        "Postcode": "DA1 5PF",
        "CountryID": 1,
        "Latitude": 51.46167,
        "Longitude": 0.232089,
        "AccessComments": "",
        "RelatedURL": "http://www.national-charge-point-registry.uk/",
        "DistanceUnit": 0
    },
    "Connections": [
        {
            "ID": 227434,
            "ConnectionTypeID": 25,
            "Reference": "8000424",
            "StatusTypeID": 50,
            "LevelID": 2,
            "Amps": 32,
            "Voltage": 400,
            "PowerKW": 22,
            "CurrentTypeID": 20
        }
    ],
    "StatusTypeID": 0,
    "DateLastStatusUpdate": "2020-06-25T10:00:00Z",
    "MetadataValues": [
        {
            "ID": 7372,
            "MetadataFieldID": 4,
            "ItemValue": "Contains public sector information licensed under the Open Government Licence v2.0. http://www.nationalarchives.gov.uk/doc/open-government-licence/version/2/"
        }
    ],
    "DataQualityLevel": 3,
    "DateCreated": "2020-06-25T10:00:00Z",
    "SubmissionStatusTypeID": 100
}