{
    "IsRecentlyVerified": false,
    "ID": 158921,
    "UUID": "C3809616-FEA2-4503-9F19-3DD9D15ADA69",
    "DataProviderID": 2,
    "DataProvidersReference": "152368",
    "OperatorID": 59,
    "UsageTypeID": 1,
    "AddressInfo": {
        "ID": 159278,
        "Title": "Greenlots - 12266A",
        "AddressLine1": "8761 N VAN NUYS BLVD",
        "Town": "Los Angeles",
        "StateOrProvince": "CA",
        "Postcode": "91402",
        "CountryID": 2,
        "Latitude": 34.2290000915527,
        "Longitude": -118.450202941895,
        "ContactTelephone1": "855-900-7584",
        "AccessComments": "24 hours daily",
        "RelatedURL": "http://greenlots.com/",
        "DistanceUnit": 0
    },
    "Connections": [
        {
            "ID": 228958,
            "ConnectionTypeID": 1,
            "LevelID": 2,
            "Amps": 16,
            "Voltage": 230,
            "PowerKW": 3.7,
            "CurrentTypeID": 10,
            "Quantity": 1
        }
    ],
    "StatusTypeID": 50,
    "DateLastStatusUpdate": "2020-06-26T02:57:00Z",
    "DataQualityLevel": 3,
    "DateCreated": "2020-06-26T02:57:00Z",
    "SubmissionStatusTypeID": 100
}