{
    "IsRecentlyVerified": false,
    "ID": 140402,
    "UUID": "84DEE0A9-287F-4FEE-8676-BA4532C33D93",
    "DataProviderID": 2,
    "DataProvidersReference": "144040",
    "OperatorID": 5,
    "UsageTypeID": 1,
    "AddressInfo": {
        "ID": 140754,
        "Title": "SILVERTON HYATT",
        "AddressLine1": "8380 Dean Martin Dr",
        "Town": "Las Vegas",
        "StateOrProvince": "NV",
        "Postcode": "89139",
        "CountryID": 2,
        "Latitude": 36.037548,
        "Longitude": -115.185839,
        "ContactTelephone1": "888-758-4389",
        "AccessComments": "24 hours daily",
        "RelatedURL": "http://www.chargepoint.com/",
        "DistanceUnit": 0
    },
    "Connections": [
        {
            "ID": 196025,
            "ConnectionTypeID": 1,
            "LevelID": 2,
            "Amps": 16,
            "Voltage": 230,
            "PowerKW": 3.7,
            "CurrentTypeID": 10,
            "Quantity": 4
        }
    ],
    "StatusTypeID": 50,
    "DateLastStatusUpdate": "2020-06-26T02:58:00Z",
    "DataQualityLevel": 3,
    "DateCreated": "2019-12-24T09:12:00Z",
    "SubmissionStatusTypeID": 100
}