{
    "IsRecentlyVerified": false,
    "ID": 140337,
    "UUID": "37253961-64D9-4634-A7D0-DDBB88624F5D",
    "DataProviderID": 2,
    "DataProvidersReference": "95059",
    "OperatorID": 9,
    "UsageTypeID": 1,
    "AddressInfo": {
        "ID": 140689,
        "Title": "Lakeside Centre Two",
        "AddressLine1": "2095 Lakeside Centre Way",
        "Town": "Knoxville",
        "StateOrProvince": "TN",
        "Postcode": "37922",
        "CountryID": 2,
        "Latitude": 35.860623,
        "Longitude": -84.064901,
        "ContactTelephone1": "888-998-2546",
        "AccessComments": "MON: 24 hours | TUE: 24 hours | WED: 24 hours | THU: 24 hours | FRI: 24 hours | SAT: 24 hours | SUN: 24 hours",
        "RelatedURL": "http://www.blinkcharging.com/",
        "DistanceUnit": 0
    },
    "Connections": [
        {
            "ID": 195949,
            "ConnectionTypeID": 1,
            "LevelID": 2,
            "Amps": 16,
            "Voltage": 230,
            "PowerKW": 3.7,
            "CurrentTypeID": 10,
            "Quantity": 2
        }
    ],
    "StatusTypeID": 50,
    "DateLastStatusUpdate": "2020-06-26T02:58:00Z",
    "DataQualityLevel": 3,
    "DateCreated": "2019-12-24T09:12:00Z",
    "SubmissionStatusTypeID": 100
}