{
    "IsRecentlyVerified": false,
    "ID": 159438,
    "UUID": "22FFBA8E-A11E-4274-8C52-1C1E0A07833C",
    "DataProviderID": 2,
    "DataProvidersReference": "158529",
    "OperatorID": 5,
    "UsageTypeID": 1,
    "AddressInfo": {
        "ID": 159795,
        "Title": "GLENWOOD SPRNGS",
        "AddressLine1": "101 8th St",
        "Town": "Glenwood Springs",
        "StateOrProvince": "CO",
        "Postcode": "81601",
        "CountryID": 2,
        "Latitude": 39.5470599,
        "Longitude": -107.3278271,
        "ContactTelephone1": "888-758-4389",
        "AccessComments": "24 hours daily",
        "RelatedURL": "http://www.chargepoint.com/",
        "DistanceUnit": 0
    },
    "Connections": [
        {
            "ID": 229616,
            "ConnectionTypeID": 1,
            "LevelID": 2,
            "Amps": 16,
            "Voltage": 230,
            "PowerKW": 3.7,
            "CurrentTypeID": 10,
            "Quantity": 2
        }
    ],
    "StatusTypeID": 50,
    "DateLastStatusUpdate": "2020-06-26T03:02:00Z",
    "DataQualityLevel": 3,
    "DateCreated": "2020-06-26T03:02:00Z",
    "SubmissionStatusTypeID": 100
}