{
    "IsRecentlyVerified": false,
    "ID": 147828,
    "UUID": "BA063D33-F088-49DD-9093-D2161786E169",
    "DataProviderID": 1,
    "OperatorID": 1,
    "UsageTypeID": 5,
    "UsageCost": "HUF150/kwh",
    "AddressInfo": {
        "ID": 148180,
        "Title": "Shell M7 59km, direction towards Balaton",
        "AddressLine1": "M7 59km",
        "Town": "Székesfehérvár",
        "Postcode": "8000",
        "CountryID": 104,
        "Latitude": 47.17684336860091,
        "Longitude": 18.47651035059664,
        "ContactTelephone1": "+3614801114",
        "AccessComments": "Shell Recharge: located next to shop building",
        "RelatedURL": "http://www.shell.hu/recharge",
        "DistanceUnit": 0
    },
    "Connections": [
        {
            "ID": 205199,
            "ConnectionTypeID": 33,
            "StatusTypeID": 50,
            "LevelID": 3,
            "PowerKW": 50,
            "CurrentTypeID": 30,
            "Quantity": 1
        },
        {
            "ID": 205200,
            "ConnectionTypeID": 2,
            "StatusTypeID": 50,
            "LevelID": 3,
            "PowerKW": 50,
            "CurrentTypeID": 30,
            "Quantity": 1
        },
        {
            "ID": 205201,
            "ConnectionTypeID": 1036,
            "StatusTypeID": 50,
            "LevelID": 3,
            "PowerKW": 43,
            "CurrentTypeID": 20,
            "Quantity": 1
        }
    ],
    "NumberOfPoints": 1,
    "GeneralComments": "From July 1 Shell Recharge welcomes Mobiliti customers for charging through the Mobiliti application or with a Mobiliti charging key.  Július 1-től a Shell Recharge töltőpont várja a Mobiliti ügyfeleket, akik a Mobiliti applikációján keresztül vagy Mobiliti ügyfélkulccsal indíthatják az elektromos autójuk töltését. Az ügyfelek 150 Ft/kWh-ért vehetik igénybe a töltők összes csatlakozóját.",
    "StatusTypeID": 50,
    "DateLastStatusUpdate": "2020-07-06T17:31:00Z",
    "DataQualityLevel": 1,
    "DateCreated": "2020-01-17T09:18:00Z",
    "SubmissionStatusTypeID": 200
}