{
    "IsRecentlyVerified": false,
    "ID": 71985,
    "UUID": "25276111-AED8-41D4-859A-B1360C487F8C",
    "DataProviderID": 1,
    "OperatorID": 45,
    "UsageTypeID": 1,
    "AddressInfo": {
        "ID": 72331,
        "Title": "E-Bike Station am Bahnhof",
        "AddressLine1": "Bahnhofsplatz",
        "Town": "Grafing",
        "StateOrProvince": "Landkreis Ebersberg",
        "Postcode": "85567",
        "CountryID": 87,
        "Latitude": 48.047374604735765,
        "Longitude": 11.963169368747701,
        "AccessComments": "Am roten Schild an den überdachten Fahrradstellplätzen sind 4 Schukodosen. 24/7 frei nutzbar.",
        "DistanceUnit": 0
    },
    "Connections": [
        {
            "ID": 103211,
            "ConnectionTypeID": 28,
            "StatusTypeID": 50,
            "LevelID": 1,
            "Amps": 10,
            "Voltage": 230,
            "PowerKW": 2.3,
            "CurrentTypeID": 10,
            "Quantity": 4
        }
    ],
    "NumberOfPoints": 4,
    "StatusTypeID": 50,
    "DateLastStatusUpdate": "2016-09-27T08:56:00Z",
    "DataQualityLevel": 1,
    "DateCreated": "2016-09-27T08:56:00Z",
    "SubmissionStatusTypeID": 200
}