{
    "IsRecentlyVerified": false,
    "ID": 122625,
    "UUID": "6060C35A-085B-4B07-B139-987FE00DEA63",
    "DataProviderID": 2,
    "DataProvidersReference": "80422",
    "OperatorID": 5,
    "UsageTypeID": 1,
    "AddressInfo": {
        "ID": 122971,
        "Title": "TOWN CENTER",
        "AddressLine1": "1000 Town Center Dr",
        "Town": "Oxnard",
        "StateOrProvince": "CA",
        "Postcode": "93036",
        "CountryID": 2,
        "Latitude": 34.243103,
        "Longitude": -119.182023,
        "ContactTelephone1": "888-758-4389",
        "AccessComments": "24 hours daily",
        "RelatedURL": "http://www.chargepoint.com/",
        "DistanceUnit": 0
    },
    "Connections": [
        {
            "ID": 172530,
            "ConnectionTypeID": 1,
            "LevelID": 2,
            "Amps": 16,
            "Voltage": 230,
            "PowerKW": 3,
            "CurrentTypeID": 10,
            "Quantity": 4
        }
    ],
    "DateLastStatusUpdate": "2019-12-24T09:12:00Z",
    "DataQualityLevel": 3,
    "DateCreated": "2019-04-06T05:03:00Z",
    "SubmissionStatusTypeID": 100
}