{
    "IsRecentlyVerified": false,
    "ID": 183645,
    "UUID": "59D5353C-001E-4A51-954D-D472BCB04536",
    "DataProviderID": 29,
    "DataProvidersReference": "18510",
    "OperatorID": 86,
    "AddressInfo": {
        "ID": 184004,
        "Title": "Parkplatz Burghof",
        "AddressLine1": "Parkplatz Burghof",
        "Town": "Langenau ",
        "Postcode": "89129",
        "CountryID": 87,
        "Latitude": 48.5000571,
        "Longitude": 10.123939,
        "DistanceUnit": 0
    },
    "Connections": [
        {
            "ID": 290876,
            "ConnectionTypeID": 28,
            "StatusTypeID": 50,
            "LevelID": 2,
            "PowerKW": 22,
            "CurrentTypeID": 20
        },
        {
            "ID": 290877,
            "ConnectionTypeID": 25,
            "StatusTypeID": 50,
            "LevelID": 2,
            "PowerKW": 22,
            "CurrentTypeID": 20
        },
        {
            "ID": 295873,
            "ConnectionTypeID": 28,
            "StatusTypeID": 50,
            "LevelID": 2,
            "PowerKW": 22,
            "CurrentTypeID": 20
        },
        {
            "ID": 295874,
            "ConnectionTypeID": 25,
            "StatusTypeID": 50,
            "LevelID": 2,
            "PowerKW": 22,
            "CurrentTypeID": 20
        }
    ],
    "StatusTypeID": 50,
    "DateLastStatusUpdate": "2021-07-12T02:41:00Z",
    "MetadataValues": [
        {
            "ID": 15938,
            "MetadataFieldID": 4,
            "ItemValue": "Data from the German chargepoint registry provided by Bundesnetzagentur.de under the CC-BY 4.0 license"
        }
    ],
    "DataQualityLevel": 3,
    "DateCreated": "2021-07-08T10:04:00Z",
    "SubmissionStatusTypeID": 100
}