{
    "IsRecentlyVerified": false,
    "ID": 97410,
    "UUID": "23D320BC-5D20-4116-800E-89AEF7D6D01C",
    "DataProviderID": 1,
    "OperatorID": 23,
    "OperatorsReference": "38336",
    "UsageTypeID": 4,
    "AddressInfo": {
        "ID": 97756,
        "Title": "Fairfield Inn & Suites By Marriott Chicago",
        "AddressLine1": "700 National Pkwy",
        "Town": "Schaumburg",
        "StateOrProvince": "Illinois",
        "Postcode": "60173",
        "CountryID": 2,
        "Latitude": 42.0413625,
        "Longitude": -88.0509415,
        "ContactTelephone1": "(847) 541-3347",
        "DistanceUnit": 0
    },
    "Connections": [
        {
            "ID": 138317,
            "ConnectionTypeID": 30,
            "StatusTypeID": 50,
            "LevelID": 2,
            "PowerKW": 12,
            "CurrentTypeID": 20,
            "Quantity": 2
        }
    ],
    "NumberOfPoints": 2,
    "GeneralComments": "2 Tesla Connectors, up to 12kW.Available for customers. Please see front desk.",
    "StatusTypeID": 50,
    "DateLastStatusUpdate": "2018-01-21T15:21:00Z",
    "DataQualityLevel": 1,
    "DateCreated": "2018-01-21T15:21:00Z",
    "SubmissionStatusTypeID": 200
}