{
    "IsRecentlyVerified": false,
    "ID": 169034,
    "UUID": "FC952E0F-C472-489B-8FC0-FBDD0166FD88",
    "DataProviderID": 1,
    "OperatorID": 3,
    "OperatorsReference": "PG-70294,PG-84610",
    "UsageTypeID": 4,
    "UsageCost": "Free",
    "AddressInfo": {
        "ID": 169393,
        "Title": "Tesco Extra",
        "AddressLine1": "Tesco Extra",
        "Town": "Nuneaton and Bedworth",
        "StateOrProvince": "England",
        "Postcode": "CV12 8JP",
        "CountryID": 1,
        "Latitude": 52.4811547613565,
        "Longitude": -1.474941192296,
        "RelatedURL": "http://www.pod-point.com",
        "DistanceUnit": 0
    },
    "Connections": [
        {
            "ID": 257127,
            "ConnectionTypeID": 25,
            "StatusTypeID": 50,
            "LevelID": 2,
            "Amps": 32,
            "Voltage": 230,
            "PowerKW": 7,
            "CurrentTypeID": 10,
            "Quantity": 4
        }
    ],
    "NumberOfPoints": 4,
    "GeneralComments": "Store: Mon-Sat 6am-Midnight, Sun 10am-4pm *3HRS MAX PARKING - ANPR £70 FINE*",
    "StatusTypeID": 50,
    "DateLastStatusUpdate": "2021-03-15T06:31:00Z",
    "DataQualityLevel": 1,
    "DateCreated": "2020-10-09T20:13:00Z",
    "SubmissionStatusTypeID": 200
}