{
    "IsRecentlyVerified": false,
    "ID": 65617,
    "UUID": "662E35AB-6DEE-45D3-B5A6-7E4C433B3352",
    "DataProviderID": 26,
    "DataProvidersReference": "84627",
    "OperatorID": 103,
    "OperatorsReference": "Allego NLALLEGO0007702",
    "UsageCost": "0.00 jaarabonnement",
    "AddressInfo": {
        "ID": 65963,
        "Title": "Kalverdans",
        "AddressLine1": "Kalverdans",
        "Town": "Alphen aan den Rijn",
        "Postcode": "2771 RR",
        "CountryID": 159,
        "Latitude": 52.07406,
        "Longitude": 4.639055,
        "ContactTelephone1": "0800-3745337",
        "RelatedURL": "http://www.allego.eu/",
        "DistanceUnit": 0
    },
    "Connections": [
        {
            "ID": 90538,
            "ConnectionTypeID": 25,
            "LevelID": 2,
            "PowerKW": 11,
            "CurrentTypeID": 10
        },
        {
            "ID": 90539,
            "ConnectionTypeID": 25,
            "LevelID": 2,
            "PowerKW": 11,
            "CurrentTypeID": 10
        }
    ],
    "NumberOfPoints": 1,
    "StatusTypeID": 50,
    "DateLastStatusUpdate": "2016-06-04T02:47:00Z",
    "DataQualityLevel": 3,
    "DateCreated": "2016-04-27T09:42:00Z",
    "SubmissionStatusTypeID": 100
}