{
    "IsRecentlyVerified": false,
    "ID": 124183,
    "UUID": "522AC674-4955-4BA5-BCFA-995A929F98E4",
    "DataProviderID": 2,
    "DataProvidersReference": "49335",
    "OperatorID": 5,
    "UsageTypeID": 1,
    "AddressInfo": {
        "ID": 124529,
        "Title": "CARCHARGING",
        "AddressLine1": "1611 Telegraph Ave",
        "Town": "Oakland",
        "StateOrProvince": "CA",
        "Postcode": "94612",
        "CountryID": 2,
        "Latitude": 37.806488,
        "Longitude": -122.270401,
        "ContactTelephone1": "888-758-4389",
        "AccessComments": "24 hours daily",
        "RelatedURL": "http://www.chargepoint.com/",
        "DistanceUnit": 0
    },
    "Connections": [
        {
            "ID": 174252,
            "ConnectionTypeID": 9,
            "LevelID": 1,
            "Amps": 16,
            "Voltage": 120,
            "PowerKW": 1,
            "CurrentTypeID": 10,
            "Quantity": 1
        },
        {
            "ID": 174253,
            "ConnectionTypeID": 1,
            "LevelID": 2,
            "Amps": 16,
            "Voltage": 230,
            "PowerKW": 3,
            "CurrentTypeID": 10,
            "Quantity": 1
        }
    ],
    "DateLastStatusUpdate": "2019-12-24T09:14:00Z",
    "DataQualityLevel": 3,
    "DateCreated": "2019-04-06T05:03:00Z",
    "SubmissionStatusTypeID": 100
}