{
    "IsRecentlyVerified": false,
    "ID": 105991,
    "UUID": "A3AD92BB-535F-47EB-A14E-B152FB29812E",
    "DataProviderID": 1,
    "OperatorID": 45,
    "UsageTypeID": 1,
    "AddressInfo": {
        "ID": 106337,
        "Title": "Bulling",
        "AddressLine1": "Hirsauer Straße 125",
        "Town": "Pforzheim",
        "StateOrProvince": "Pforzheim",
        "Postcode": "75180",
        "CountryID": 87,
        "Latitude": 48.874835749673046,
        "Longitude": 8.67682890125809,
        "RelatedURL": "http://www.bulling.de/2018/05/09/elektromobilitaet-fuer-sie-und-uns/",
        "DistanceUnit": 0
    },
    "Connections": [
        {
            "ID": 149256,
            "ConnectionTypeID": 25,
            "StatusTypeID": 50,
            "LevelID": 2,
            "Amps": 32,
            "Voltage": 400,
            "PowerKW": 22,
            "CurrentTypeID": 20,
            "Quantity": 1
        }
    ],
    "NumberOfPoints": 2,
    "GeneralComments": "24/7 verfügbar",
    "StatusTypeID": 50,
    "DateLastStatusUpdate": "2018-06-13T12:06:00Z",
    "DataQualityLevel": 1,
    "DateCreated": "2018-06-13T12:06:00Z",
    "SubmissionStatusTypeID": 200
}