{
    "IsRecentlyVerified": false,
    "ID": 90285,
    "UUID": "56D058F7-9254-4D57-A712-ABAF6974CEF9",
    "DataProviderID": 1,
    "OperatorID": 23,
    "OperatorsReference": "30809",
    "UsageTypeID": 6,
    "AddressInfo": {
        "ID": 90631,
        "Title": "Hotel Schönruh",
        "AddressLine1": "285 Innertal",
        "Town": "Gerols",
        "Postcode": "6281",
        "CountryID": 19,
        "Latitude": 47.229739,
        "Longitude": 12.045904,
        "ContactTelephone1": "+43 5284 5368",
        "DistanceUnit": 0
    },
    "Connections": [
        {
            "ID": 127938,
            "ConnectionTypeID": 30,
            "StatusTypeID": 50,
            "LevelID": 2,
            "Amps": 32,
            "Voltage": 230,
            "PowerKW": 14,
            "CurrentTypeID": 20,
            "Quantity": 2
        }
    ],
    "NumberOfPoints": 2,
    "GeneralComments": "2 Tesla Connectors, up to 14kW.Available for patrons only. Please call ahead.",
    "StatusTypeID": 50,
    "DateLastStatusUpdate": "2018-10-03T19:47:00Z",
    "DataQualityLevel": 1,
    "DateCreated": "2017-07-13T14:38:00Z",
    "SubmissionStatusTypeID": 200
}