{
    "IsRecentlyVerified": false,
    "ID": 128882,
    "UUID": "7A59AB0A-96CA-40D2-9CD0-AA0E134F009D",
    "DataProviderID": 1,
    "OperatorID": 213,
    "OperatorsReference": "5a269ddde4b070f679bd5c58,5a269ddde4b070f679bd5c58",
    "UsageTypeID": 6,
    "UsageCost": "0,279€/minute",
    "AddressInfo": {
        "ID": 129228,
        "Title": "Aire de Brou Dampierre (ESSO) sens province PARIS - Dampierre-sous-Brou",
        "AddressLine1": "L'Océane - Aire de Brou Dampierre (ESSO) sens province PARIS",
        "Town": "Frazé",
        "Postcode": "28160",
        "CountryID": 80,
        "Latitude": 48.2392728853862,
        "Longitude": 1.08201310417621,
        "AccessComments": "A11",
        "DistanceUnit": 0
    },
    "Connections": [
        {
            "ID": 180394,
            "ConnectionTypeID": 2,
            "StatusTypeID": 50,
            "LevelID": 3,
            "PowerKW": 50,
            "CurrentTypeID": 30,
            "Quantity": 1
        },
        {
            "ID": 180734,
            "ConnectionTypeID": 33,
            "StatusTypeID": 50,
            "LevelID": 3,
            "PowerKW": 50,
            "CurrentTypeID": 30,
            "Quantity": 1
        },
        {
            "ID": 180735,
            "ConnectionTypeID": 1036,
            "StatusTypeID": 50,
            "LevelID": 3,
            "Amps": 63,
            "Voltage": 400,
            "PowerKW": 43,
            "CurrentTypeID": 20,
            "Quantity": 1
        }
    ],
    "NumberOfPoints": 1,
    "GeneralComments": "Operator: Corri-Door / Chargemap pass",
    "StatusTypeID": 75,
    "DateLastStatusUpdate": "2020-01-05T20:28:00Z",
    "DataQualityLevel": 1,
    "DateCreated": "2019-07-02T19:44:00Z",
    "SubmissionStatusTypeID": 200
}