{
    "IsRecentlyVerified": false,
    "ID": 99840,
    "UUID": "95520C54-34A5-4CE5-8D90-C52150DC5919",
    "DataProviderID": 1,
    "OperatorID": 23,
    "OperatorsReference": "40353",
    "UsageTypeID": 4,
    "AddressInfo": {
        "ID": 100186,
        "Title": "Sea Lord Hotel and Beachclub",
        "AddressLine1": "4140 el Mar DR",
        "Town": "Lauderdale-by-the-Sea",
        "StateOrProvince": "Florida",
        "Postcode": "33308",
        "CountryID": 2,
        "Latitude": 26.1852677,
        "Longitude": -80.0958898,
        "ContactTelephone1": "(954) 776-1505",
        "DistanceUnit": 0
    },
    "Connections": [
        {
            "ID": 141057,
            "ConnectionTypeID": 30,
            "StatusTypeID": 50,
            "LevelID": 2,
            "PowerKW": 16,
            "CurrentTypeID": 20,
            "Quantity": 1
        }
    ],
    "NumberOfPoints": 1,
    "GeneralComments": "1 Tesla Connector, up to 16kW.Available for customers. Please see front desk.",
    "StatusTypeID": 50,
    "DateLastStatusUpdate": "2018-02-06T06:44:00Z",
    "DataQualityLevel": 1,
    "DateCreated": "2018-02-06T06:44:00Z",
    "SubmissionStatusTypeID": 200
}