{
    "IsRecentlyVerified": false,
    "ID": 32515,
    "UUID": "C8C90E6B-512D-4E87-9A9A-73BD03724C14",
    "DataProviderID": 26,
    "DataProvidersReference": "47283",
    "OperatorID": 178,
    "OperatorsReference": "EVnetNL AL439",
    "UsageCost": "0.00 jaarabonnement",
    "AddressInfo": {
        "ID": 32861,
        "Title": "Wilhelminaplein 2",
        "AddressLine1": "Wilhelminaplein 2",
        "Town": "Maasgouw",
        "Postcode": "6097 AT",
        "CountryID": 159,
        "Latitude": 51.181241,
        "Longitude": 5.900583,
        "ContactTelephone1": "0800-3522365",
        "RelatedURL": "http://www.evnet.nl",
        "DistanceUnit": 0
    },
    "Connections": [
        {
            "ID": 36026,
            "ConnectionTypeID": 25,
            "LevelID": 2,
            "PowerKW": 11,
            "CurrentTypeID": 10
        }
    ],
    "NumberOfPoints": 2,
    "StatusTypeID": 50,
    "DateLastStatusUpdate": "2016-06-04T02:38:00Z",
    "DataQualityLevel": 3,
    "DateCreated": "2015-01-09T06:03:00Z",
    "SubmissionStatusTypeID": 100
}