{
    "IsRecentlyVerified": false,
    "ID": 89274,
    "UUID": "663E0F7B-F752-4A5E-93E9-EB498487FD05",
    "DataProviderID": 2,
    "DataProvidersReference": "81221",
    "OperatorID": 5,
    "UsageTypeID": 1,
    "AddressInfo": {
        "ID": 89620,
        "Title": "GENERAL MOTORS",
        "AddressLine1": "2010 Warsaw Rd Exn",
        "Town": "Roswell",
        "StateOrProvince": "GA",
        "Postcode": "30076",
        "CountryID": 2,
        "Latitude": 34.0457649,
        "Longitude": -84.3295098,
        "ContactTelephone1": "888-758-4389",
        "AccessComments": "24 hours daily",
        "RelatedURL": "http://www.chargepoint.com/",
        "DistanceUnit": 0
    },
    "Connections": [
        {
            "ID": 126651,
            "ConnectionTypeID": 1,
            "LevelID": 2,
            "Amps": 16,
            "Voltage": 230,
            "PowerKW": 3,
            "CurrentTypeID": 10,
            "Quantity": 2
        }
    ],
    "DateLastStatusUpdate": "2019-04-06T04:01:00Z",
    "DataQualityLevel": 3,
    "DateCreated": "2017-06-22T08:16:00Z",
    "SubmissionStatusTypeID": 100
}