{
    "UserComments": [
        {
            "ID": 21174,
            "ChargePointID": 121775,
            "CommentTypeID": 10,
            "UserName": "N41EF",
            "Comment": "Kroger Parking lot. Several place to eat within a few minutes",
            "DateCreated": "2019-07-06T15:52:07.637Z",
            "User": {
                "ID": 20086,
                "Username": "N41EF"
            }
        }
    ],
    "MediaItems": [
        {
            "ID": 18808,
            "ChargePointID": 121775,
            "ItemURL": "https://s3-ap-southeast-2.amazonaws.com/openchargemap/images/US/OCM121775/OCM-121775.orig.2019070615511263.png",
            "ItemThumbnailURL": "https://s3-ap-southeast-2.amazonaws.com/openchargemap/images/US/OCM121775/OCM-121775.thmb.2019070615511263.png",
            "Comment": "",
            "IsEnabled": true,
            "IsVideo": false,
            "IsFeaturedItem": false,
            "IsExternalResource": false,
            "User": {
                "ID": 20086,
                "Username": "N41EF"
            },
            "DateCreated": "2019-07-06T15:52:00Z"
        }
    ],
    "IsRecentlyVerified": false,
    "ID": 121775,
    "UUID": "72F5FF9C-80D0-4AD3-9886-DDAA33C13380",
    "DataProviderID": 2,
    "DataProvidersReference": "92484",
    "OperatorID": 5,
    "UsageTypeID": 1,
    "AddressInfo": {
        "ID": 122121,
        "Title": "GEORGIA POWER",
        "AddressLine1": "2801 Washington Rd",
        "Town": "Augusta",
        "StateOrProvince": "GA",
        "Postcode": "30909",
        "CountryID": 2,
        "Latitude": 33.5110791,
        "Longitude": -82.0281601,
        "ContactTelephone1": "888-758-4389",
        "AccessComments": "24 hours daily",
        "RelatedURL": "http://www.chargepoint.com/",
        "DistanceUnit": 0
    },
    "Connections": [
        {
            "ID": 171595,
            "ConnectionTypeID": 2,
            "LevelID": 3,
            "Amps": 100,
            "Voltage": 400,
            "PowerKW": 40,
            "CurrentTypeID": 30,
            "Quantity": 1
        },
        {
            "ID": 171596,
            "ConnectionTypeID": 32,
            "LevelID": 3,
            "Amps": 100,
            "Voltage": 400,
            "PowerKW": 40,
            "CurrentTypeID": 30,
            "Quantity": 1
        }
    ],
    "DateLastStatusUpdate": "2020-06-26T02:55:00Z",
    "DataQualityLevel": 3,
    "DateCreated": "2019-04-06T05:02:00Z",
    "SubmissionStatusTypeID": 100
}