{
    "IsRecentlyVerified": false,
    "ID": 71702,
    "UUID": "C5289DEC-8F3E-4AE4-A19E-9D3B3153246B",
    "DataProviderID": 1,
    "OperatorID": 3315,
    "OperatorsReference": "51123",
    "UsageTypeID": 4,
    "UsageCost": "Free",
    "AddressInfo": {
        "ID": 72048,
        "Title": "Sibbald Training",
        "AddressLine1": "Shona's Way",
        "AddressLine2": "Sibbald Park",
        "Town": "Blackridge",
        "StateOrProvince": "West Lothian",
        "Postcode": "EH48 3BN",
        "CountryID": 1,
        "Latitude": 55.889043,
        "Longitude": -3.73814,
        "DistanceUnit": 0
    },
    "Connections": [
        {
            "ID": 102700,
            "ConnectionTypeID": 25,
            "StatusTypeID": 50,
            "LevelID": 2,
            "Amps": 32,
            "Voltage": 400,
            "PowerKW": 22,
            "CurrentTypeID": 20,
            "Quantity": 2
        }
    ],
    "NumberOfPoints": 2,
    "StatusTypeID": 50,
    "DateLastStatusUpdate": "2020-01-02T08:39:00Z",
    "DataQualityLevel": 1,
    "DateCreated": "2016-09-03T11:54:00Z",
    "SubmissionStatusTypeID": 200
}