{
    "IsRecentlyVerified": false,
    "ID": 179187,
    "UUID": "97EB9179-AF35-4230-91B5-FB8DD11B9980",
    "DataProviderID": 29,
    "DataProvidersReference": "15342",
    "OperatorID": 2241,
    "AddressInfo": {
        "ID": 179546,
        "Title": "Bischwiesen",
        "AddressLine1": "Bischwiesen",
        "Town": "Niefern-Öschelbronn",
        "Postcode": "75223",
        "CountryID": 87,
        "Latitude": 48.918838,
        "Longitude": 8.780908,
        "DistanceUnit": 0
    },
    "Connections": [
        {
            "ID": 280669,
            "ConnectionTypeID": 25,
            "StatusTypeID": 50,
            "LevelID": 2,
            "PowerKW": 22,
            "CurrentTypeID": 20
        },
        {
            "ID": 280670,
            "ConnectionTypeID": 25,
            "StatusTypeID": 50,
            "LevelID": 2,
            "PowerKW": 22,
            "CurrentTypeID": 20
        }
    ],
    "StatusTypeID": 50,
    "DateLastStatusUpdate": "2021-07-12T02:42:00Z",
    "MetadataValues": [
        {
            "ID": 11481,
            "MetadataFieldID": 4,
            "ItemValue": "Data from the German chargepoint registry provided by Bundesnetzagentur.de under the CC-BY 4.0 license"
        }
    ],
    "DataQualityLevel": 3,
    "DateCreated": "2021-07-08T09:59:00Z",
    "SubmissionStatusTypeID": 100
}