{
    "IsRecentlyVerified": false,
    "ID": 57756,
    "UUID": "C01E110A-150F-47C1-897C-E29F3DFC0248",
    "DataProviderID": 1,
    "OperatorID": 185,
    "UsageTypeID": 4,
    "UsageCost": "",
    "AddressInfo": {
        "ID": 58102,
        "Title": "Supermarkt famila ",
        "AddressLine1": "Barnitzer Straße 1-7",
        "AddressLine2": "",
        "Town": "Reinfeld",
        "StateOrProvince": "Kreis Stormarn",
        "Postcode": "23858",
        "CountryID": 87,
        "Latitude": 53.82230443796705,
        "Longitude": 10.50192783718717,
        "ContactTelephone1": "+45 8616 8888",
        "ContactTelephone2": "",
        "ContactEmail": "",
        "AccessComments": "In Blickrichtung von der Bäckerei \"Junge\" kommend, auf dem Parkplatz des famila. Lt. Clever bis Ende 2016 ohne Ladekarte kostenlos nutzbar; danach mit Clever Ladekarte oder SMS.",
        "RelatedURL": "http://de.clever.dk/",
        "DistanceUnit": 0
    },
    "Connections": [
        {
            "ID": 73120,
            "ConnectionTypeID": 2,
            "StatusTypeID": 50,
            "LevelID": 3,
            "PowerKW": 50,
            "CurrentTypeID": 30,
            "Quantity": 1
        },
        {
            "ID": 73121,
            "ConnectionTypeID": 33,
            "StatusTypeID": 50,
            "LevelID": 3,
            "PowerKW": 50,
            "CurrentTypeID": 30,
            "Quantity": 1
        },
        {
            "ID": 73122,
            "ConnectionTypeID": 1036,
            "StatusTypeID": 50,
            "LevelID": 3,
            "Amps": 63,
            "Voltage": 400,
            "PowerKW": 43,
            "CurrentTypeID": 20,
            "Quantity": 1
        }
    ],
    "NumberOfPoints": 2,
    "GeneralComments": "",
    "StatusTypeID": 50,
    "DateLastStatusUpdate": "2016-12-07T06:49:00Z",
    "DataQualityLevel": 1,
    "DateCreated": "2015-12-22T13:51:00Z",
    "SubmissionStatusTypeID": 200
}