{
    "IsRecentlyVerified": false,
    "ID": 138446,
    "UUID": "003C4108-B209-4F5B-84D6-98E20127772E",
    "DataProviderID": 2,
    "DataProvidersReference": "95933",
    "OperatorID": 9,
    "UsageTypeID": 2,
    "AddressInfo": {
        "ID": 138795,
        "Title": "George Bush Airport (IAH) Terminal Garage A/B - 1st Floor",
        "AddressLine1": "2800 N Terminal Rd, Terminal A",
        "Town": "Houston",
        "StateOrProvince": "TX",
        "Postcode": "77032",
        "CountryID": 2,
        "Latitude": 29.986744,
        "Longitude": -95.351534,
        "ContactTelephone1": "888-998-2546",
        "AccessComments": "MON: 24 hours | TUE: 24 hours | WED: 24 hours | THU: 24 hours | FRI: 24 hours | SAT: 24 hours | SUN: 24 hours",
        "RelatedURL": "http://www.blinkcharging.com/",
        "DistanceUnit": 0
    },
    "Connections": [
        {
            "ID": 193565,
            "ConnectionTypeID": 1,
            "LevelID": 2,
            "Amps": 16,
            "Voltage": 230,
            "PowerKW": 3.7,
            "CurrentTypeID": 10,
            "Quantity": 2
        }
    ],
    "StatusTypeID": 50,
    "DateLastStatusUpdate": "2020-06-26T02:54:00Z",
    "DataQualityLevel": 3,
    "DateCreated": "2019-12-24T09:08:00Z",
    "SubmissionStatusTypeID": 100
}