{
    "UserComments": [
        {
            "ID": 24487,
            "ChargePointID": 125815,
            "CommentTypeID": 10,
            "UserName": "ForumElettrico.it",
            "Comment": "Nessun problema con NFC Enel X sulla presa tipo 2, ed ho interrotto avvicinandomi all'auto ed estraendo  il cavo prima lato auto. Leggi la recensione completa qui > https://www.forumelettrico.it/forum/post213406.html#p213406",
            "RelatedURL": "https://www.forumelettrico.it/forum/post213406.html#p213406",
            "DateCreated": "2021-06-15T09:17:03.643Z",
            "User": {
                "ID": 11749,
                "Username": "ForumElettrico.it"
            },
            "CheckinStatusTypeID": 10,
            "IsActionedByEditor": false
        },
        {
            "ID": 20936,
            "ChargePointID": 125815,
            "CommentTypeID": 10,
            "UserName": "ForumElettrico.it",
            "RelatedURL": "https://www.forumelettrico.it/forum/colonnina-enel-x-22-kw-gualtieri-re-piazza-iv-novembre-4-t5478.html",
            "DateCreated": "2019-04-28T16:00:35.297Z",
            "User": {
                "ID": 11749,
                "Username": "ForumElettrico.it"
            },
            "CheckinStatusTypeID": 10
        }
    ],
    "MediaItems": [
        {
            "ID": 28158,
            "ChargePointID": 125815,
            "ItemURL": "https://s3-ap-southeast-2.amazonaws.com/openchargemap/images/IT/OCM125815/OCM-125815.orig.2021061509171427.jpg",
            "ItemThumbnailURL": "https://s3-ap-southeast-2.amazonaws.com/openchargemap/images/IT/OCM125815/OCM-125815.thmb.2021061509171427.jpg",
            "Comment": "",
            "IsEnabled": true,
            "IsVideo": false,
            "IsFeaturedItem": false,
            "IsExternalResource": false,
            "User": {
                "ID": 11749,
                "Username": "ForumElettrico.it"
            },
            "DateCreated": "2021-06-15T09:17:00Z"
        },
        {
            "ID": 18187,
            "ChargePointID": 125815,
            "ItemURL": "https://s3-ap-southeast-2.amazonaws.com/openchargemap/images/IT/OCM125815/OCM-125815.orig.2019042816005266.jpg",
            "ItemThumbnailURL": "https://s3-ap-southeast-2.amazonaws.com/openchargemap/images/IT/OCM125815/OCM-125815.thmb.2019042816005266.jpg",
            "Comment": "",
            "IsEnabled": true,
            "IsVideo": false,
            "IsFeaturedItem": false,
            "IsExternalResource": false,
            "User": {
                "ID": 11749,
                "Username": "ForumElettrico.it"
            },
            "DateCreated": "2019-04-28T16:01:00Z"
        },
        {
            "ID": 18188,
            "ChargePointID": 125815,
            "ItemURL": "https://s3-ap-southeast-2.amazonaws.com/openchargemap/images/IT/OCM125815/OCM-125815.orig.2019042816005921.jpg",
            "ItemThumbnailURL": "https://s3-ap-southeast-2.amazonaws.com/openchargemap/images/IT/OCM125815/OCM-125815.thmb.2019042816005921.jpg",
            "Comment": "",
            "IsEnabled": true,
            "IsVideo": false,
            "IsFeaturedItem": false,
            "IsExternalResource": false,
            "User": {
                "ID": 11749,
                "Username": "ForumElettrico.it"
            },
            "DateCreated": "2019-04-28T16:01:00Z"
        },
        {
            "ID": 18189,
            "ChargePointID": 125815,
            "ItemURL": "https://s3-ap-southeast-2.amazonaws.com/openchargemap/images/IT/OCM125815/OCM-125815.orig.2019042816010584.jpg",
            "ItemThumbnailURL": "https://s3-ap-southeast-2.amazonaws.com/openchargemap/images/IT/OCM125815/OCM-125815.thmb.2019042816010584.jpg",
            "Comment": "",
            "IsEnabled": true,
            "IsVideo": false,
            "IsFeaturedItem": false,
            "IsExternalResource": false,
            "User": {
                "ID": 11749,
                "Username": "ForumElettrico.it"
            },
            "DateCreated": "2019-04-28T16:01:00Z"
        },
        {
            "ID": 18190,
            "ChargePointID": 125815,
            "ItemURL": "https://s3-ap-southeast-2.amazonaws.com/openchargemap/images/IT/OCM125815/OCM-125815.orig.2019042816011334.jpg",
            "ItemThumbnailURL": "https://s3-ap-southeast-2.amazonaws.com/openchargemap/images/IT/OCM125815/OCM-125815.thmb.2019042816011334.jpg",
            "Comment": "",
            "IsEnabled": true,
            "IsVideo": false,
            "IsFeaturedItem": false,
            "IsExternalResource": false,
            "User": {
                "ID": 11749,
                "Username": "ForumElettrico.it"
            },
            "DateCreated": "2019-04-28T16:01:00Z"
        }
    ],
    "IsRecentlyVerified": false,
    "ID": 125815,
    "UUID": "3BB1CB1A-E506-4CBE-9DB2-093CED5A0B43",
    "DataProviderID": 1,
    "OperatorID": 80,
    "UsageTypeID": 1,
    "AddressInfo": {
        "ID": 126161,
        "Title": "Gualtieri IV Novembre | EnelX",
        "AddressLine1": "Piazza IV Novembre 4",
        "Town": "Gualtieri",
        "StateOrProvince": "RE",
        "CountryID": 112,
        "Latitude": 44.905526,
        "Longitude": 10.631184,
        "RelatedURL": "https://www.forumelettrico.it/forum/colonnina-enel-x-22-kw-gualtieri-re-piazza-iv-novembre-4-t5478.html",
        "DistanceUnit": 0
    },
    "Connections": [
        {
            "ID": 176322,
            "ConnectionTypeID": 25,
            "StatusTypeID": 50,
            "LevelID": 2,
            "Amps": 32,
            "Voltage": 400,
            "PowerKW": 22,
            "CurrentTypeID": 20,
            "Quantity": 2
        }
    ],
    "NumberOfPoints": 2,
    "StatusTypeID": 50,
    "DateLastStatusUpdate": "2021-06-15T09:17:00Z",
    "DataQualityLevel": 1,
    "DateCreated": "2019-04-28T16:00:00Z",
    "SubmissionStatusTypeID": 200
}