{
    "IsRecentlyVerified": false,
    "ID": 135285,
    "UUID": "A9E9750C-D73E-415A-84F1-B444ADEF46BB",
    "DataProviderID": 1,
    "OperatorID": 3367,
    "UsageTypeID": 4,
    "AddressInfo": {
        "ID": 135631,
        "Title": "SHARZ - Energy Petrol Babaeski",
        "AddressLine1": "İstanbul Kırklareli Yolu, 39200 Karamesutlu/Babaeski/Kırklareli, Türkiye",
        "Town": "Havsa",
        "StateOrProvince": "Havsa",
        "CountryID": 229,
        "Latitude": 41.47455723991047,
        "Longitude": 27.098620124061313,
        "DistanceUnit": 0
    },
    "Connections": [
        {
            "ID": 189536,
            "ConnectionTypeID": 25,
            "StatusTypeID": 50,
            "LevelID": 2,
            "Amps": 32,
            "Voltage": 400,
            "PowerKW": 22,
            "CurrentTypeID": 20,
            "Quantity": 1
        }
    ],
    "NumberOfPoints": 1,
    "GeneralComments": "www.sharz.net",
    "StatusTypeID": 50,
    "DateLastStatusUpdate": "2019-12-15T07:21:00Z",
    "DataQualityLevel": 1,
    "DateCreated": "2019-12-15T07:21:00Z",
    "SubmissionStatusTypeID": 200
}