{
    "IsRecentlyVerified": false,
    "ID": 145025,
    "UUID": "B1FD0F2D-6F8A-4137-8CCA-3709F29B103F",
    "DataProviderID": 2,
    "DataProvidersReference": "145350",
    "OperatorID": 90,
    "UsageTypeID": 1,
    "AddressInfo": {
        "ID": 145377,
        "Title": "Société des casinos - Casino Mont-Tremblant",
        "AddressLine1": "300 chemin des Pleiades",
        "Town": "Mont-Tremblant",
        "StateOrProvince": "QC",
        "Postcode": "J8E 0A7",
        "CountryID": 44,
        "Latitude": 46.201066,
        "Longitude": -74.568231,
        "ContactTelephone1": "877-505-2674",
        "AccessComments": "24 hours daily",
        "RelatedURL": "https://lecircuitelectrique.com/",
        "DistanceUnit": 0
    },
    "Connections": [
        {
            "ID": 201605,
            "ConnectionTypeID": 1,
            "LevelID": 2,
            "Amps": 16,
            "Voltage": 230,
            "PowerKW": 3.7,
            "CurrentTypeID": 10,
            "Quantity": 2
        }
    ],
    "StatusTypeID": 50,
    "DateLastStatusUpdate": "2020-06-26T03:10:00Z",
    "DataQualityLevel": 3,
    "DateCreated": "2019-12-24T09:24:00Z",
    "SubmissionStatusTypeID": 100
}