{
    "IsRecentlyVerified": false,
    "ID": 23112,
    "UUID": "C4AE8B89-E189-41C7-B554-6B64614C0277",
    "DataProviderID": 1,
    "OperatorID": 62,
    "UsageTypeID": 4,
    "UsageCost": "",
    "AddressInfo": {
        "ID": 23457,
        "Title": "Auchan MONTLUÇON DOMERAT",
        "AddressLine1": "Avenue des Martyrs",
        "AddressLine2": "",
        "Town": "Prémilhat",
        "StateOrProvince": "Montluçon",
        "Postcode": "03410",
        "CountryID": 80,
        "Latitude": 46.3387318180263,
        "Longitude": 2.56763640967687,
        "ContactTelephone1": "04.70.08.24.00 ",
        "ContactTelephone2": "",
        "ContactEmail": "",
        "AccessComments": "",
        "RelatedURL": "http://www.auchan.fr/magasins/montlucon-domerat/152/informations-pratiques/",
        "DistanceUnit": 0
    },
    "Connections": [
        {
            "ID": 24830,
            "ConnectionTypeID": 2,
            "StatusTypeID": 0,
            "LevelID": 3,
            "CurrentTypeID": 30,
            "Quantity": 1
        },
        {
            "ID": 24831,
            "ConnectionTypeID": 25,
            "StatusTypeID": 0,
            "LevelID": 3,
            "CurrentTypeID": 20,
            "Quantity": 1
        }
    ],
    "NumberOfPoints": 2,
    "GeneralComments": "",
    "StatusTypeID": 50,
    "DateLastStatusUpdate": "2015-06-03T11:20:00Z",
    "DataQualityLevel": 1,
    "DateCreated": "2014-04-14T11:03:00Z",
    "SubmissionStatusTypeID": 200
}