{
    "IsRecentlyVerified": true,
    "DateLastVerified": "2021-09-21T14:26:00Z",
    "ID": 189350,
    "UUID": "9E4A304F-82F8-4ECC-8B19-CA2F8D7CBD3A",
    "DataProviderID": 1,
    "OperatorID": 32,
    "UsageTypeID": 6,
    "UsageCost": "Free",
    "AddressInfo": {
        "ID": 189709,
        "Title": "BMW UK Training Academy",
        "AddressLine1": "Wokefield Park",
        "Town": "Grazeley Green",
        "StateOrProvince": "England",
        "Postcode": "RG7 3AE",
        "CountryID": 1,
        "Latitude": 51.38671312426325,
        "Longitude": -1.0354753226970388,
        "AccessComments": "behind barrier in training centre car park. No access for adjacent hotel guests.",
        "DistanceUnit": 0
    },
    "Connections": [
        {
            "ID": 306206,
            "ConnectionTypeID": 25,
            "Reference": "2674",
            "StatusTypeID": 50,
            "LevelID": 2,
            "Amps": 32,
            "Voltage": 230,
            "PowerKW": 7.2,
            "CurrentTypeID": 10,
            "Quantity": 2
        },
        {
            "ID": 306207,
            "ConnectionTypeID": 25,
            "StatusTypeID": 50,
            "LevelID": 2,
            "Amps": 32,
            "Voltage": 230,
            "PowerKW": 7.2,
            "CurrentTypeID": 10,
            "Quantity": 2,
            "Comments": "4452"
        },
        {
            "ID": 306208,
            "ConnectionTypeID": 25,
            "Reference": "4453",
            "StatusTypeID": 50,
            "LevelID": 2,
            "Amps": 32,
            "Voltage": 230,
            "PowerKW": 7.2,
            "CurrentTypeID": 10,
            "Quantity": 2
        },
        {
            "ID": 306209,
            "ConnectionTypeID": 25,
            "Reference": "4454",
            "StatusTypeID": 50,
            "LevelID": 2,
            "Amps": 32,
            "Voltage": 230,
            "PowerKW": 7.2,
            "CurrentTypeID": 10,
            "Quantity": 2
        },
        {
            "ID": 306210,
            "ConnectionTypeID": 25,
            "Reference": "4455",
            "StatusTypeID": 50,
            "LevelID": 2,
            "Amps": 32,
            "Voltage": 230,
            "PowerKW": 7.2,
            "CurrentTypeID": 10,
            "Quantity": 2,
            "Comments": ""
        }
    ],
    "NumberOfPoints": 1,
    "StatusTypeID": 50,
    "DateLastStatusUpdate": "2021-09-21T14:26:00Z",
    "DataQualityLevel": 1,
    "DateCreated": "2021-09-21T14:26:00Z",
    "SubmissionStatusTypeID": 200
}