{
    "IsRecentlyVerified": false,
    "ID": 111409,
    "UUID": "6CE1561A-3A2A-4F46-A7D0-9D4562C5F48F",
    "DataProviderID": 2,
    "DataProvidersReference": "91527",
    "OperatorID": 5,
    "UsageTypeID": 1,
    "AddressInfo": {
        "ID": 111755,
        "Title": "CST CANADA CO",
        "AddressLine1": "2805-2809 Rue Étienne-Lenoir",
        "Town": "Laval",
        "StateOrProvince": "AB",
        "Postcode": "H7R",
        "CountryID": 44,
        "Latitude": 45.5612026,
        "Longitude": -73.817223,
        "ContactTelephone1": "888-758-4389",
        "AccessComments": "24 hours daily",
        "RelatedURL": "http://www.chargepoint.com/",
        "DistanceUnit": 0
    },
    "Connections": [
        {
            "ID": 156828,
            "ConnectionTypeID": 1,
            "LevelID": 2,
            "Amps": 16,
            "Voltage": 230,
            "PowerKW": 3,
            "CurrentTypeID": 10,
            "Quantity": 2
        }
    ],
    "DateLastStatusUpdate": "2019-12-24T09:23:00Z",
    "DataQualityLevel": 3,
    "DateCreated": "2018-10-18T23:37:00Z",
    "SubmissionStatusTypeID": 100
}