{
    "IsRecentlyVerified": false,
    "ID": 185070,
    "UUID": "352106E5-ADDC-41E6-9EAF-FC4404121F88",
    "DataProviderID": 29,
    "DataProvidersReference": "6989",
    "OperatorID": 234,
    "AddressInfo": {
        "ID": 185429,
        "Title": "Bernecker Str. 27",
        "AddressLine1": "Bernecker Str. 27",
        "Town": "Himmelkron",
        "Postcode": "95502",
        "CountryID": 87,
        "Latitude": 50.05907,
        "Longitude": 11.60612,
        "DistanceUnit": 0
    },
    "Connections": [
        {
            "ID": 294096,
            "ConnectionTypeID": 25,
            "StatusTypeID": 50,
            "LevelID": 2,
            "PowerKW": 22,
            "CurrentTypeID": 20
        },
        {
            "ID": 294097,
            "ConnectionTypeID": 25,
            "StatusTypeID": 50,
            "LevelID": 2,
            "PowerKW": 22,
            "CurrentTypeID": 20
        }
    ],
    "StatusTypeID": 50,
    "DateLastStatusUpdate": "2021-07-12T02:44:00Z",
    "MetadataValues": [
        {
            "ID": 17361,
            "MetadataFieldID": 4,
            "ItemValue": "Data from the German chargepoint registry provided by Bundesnetzagentur.de under the CC-BY 4.0 license"
        }
    ],
    "DataQualityLevel": 3,
    "DateCreated": "2021-07-08T10:06:00Z",
    "SubmissionStatusTypeID": 100
}