{
    "IsRecentlyVerified": false,
    "ID": 141895,
    "UUID": "50D7C353-78A8-4B4F-B0CA-34DC825C6D01",
    "DataProviderID": 2,
    "DataProvidersReference": "104040",
    "OperatorID": 5,
    "UsageTypeID": 1,
    "AddressInfo": {
        "ID": 142247,
        "Title": "CRA - DENVER",
        "AddressLine1": "891 14th St",
        "Town": "Denver",
        "StateOrProvince": "CO",
        "Postcode": "80202",
        "CountryID": 2,
        "Latitude": 39.7448438,
        "Longitude": -104.9958538,
        "ContactTelephone1": "888-758-4389",
        "AccessComments": "24 hours daily",
        "RelatedURL": "http://www.chargepoint.com/",
        "DistanceUnit": 0
    },
    "Connections": [
        {
            "ID": 197933,
            "ConnectionTypeID": 1,
            "LevelID": 2,
            "Amps": 16,
            "Voltage": 230,
            "PowerKW": 3,
            "CurrentTypeID": 10,
            "Quantity": 1
        }
    ],
    "StatusTypeID": 50,
    "DateLastStatusUpdate": "2019-12-24T09:16:00Z",
    "DataQualityLevel": 3,
    "DateCreated": "2019-12-24T09:16:00Z",
    "SubmissionStatusTypeID": 100
}