{
    "IsRecentlyVerified": false,
    "ID": 176936,
    "UUID": "FD7D867F-E155-4CC7-AEE6-EA5538FA8D3A",
    "DataProviderID": 29,
    "DataProvidersReference": "5333",
    "OperatorID": 45,
    "AddressInfo": {
        "ID": 177295,
        "Title": "Hauptstraße 1",
        "AddressLine1": "Hauptstraße 1",
        "Town": "Cremlingen",
        "Postcode": "38162",
        "CountryID": 87,
        "Latitude": 52.249269,
        "Longitude": 10.647236,
        "DistanceUnit": 0
    },
    "Connections": [
        {
            "ID": 275480,
            "ConnectionTypeID": 33,
            "StatusTypeID": 50,
            "LevelID": 3,
            "PowerKW": 22,
            "CurrentTypeID": 30
        },
        {
            "ID": 275481,
            "ConnectionTypeID": 25,
            "StatusTypeID": 50,
            "LevelID": 2,
            "PowerKW": 11,
            "CurrentTypeID": 20
        }
    ],
    "StatusTypeID": 0,
    "DateLastStatusUpdate": "2021-07-12T02:49:00Z",
    "MetadataValues": [
        {
            "ID": 9230,
            "MetadataFieldID": 4,
            "ItemValue": "Data from the German chargepoint registry provided by Bundesnetzagentur.de under the CC-BY 4.0 license"
        }
    ],
    "DataQualityLevel": 3,
    "DateCreated": "2021-07-08T09:48:00Z",
    "SubmissionStatusTypeID": 100
}