{
    "IsRecentlyVerified": false,
    "ID": 136714,
    "UUID": "90CAA6D9-142C-4DEA-9B1A-9F08A2913F1E",
    "DataProviderID": 1,
    "OperatorID": 1,
    "UsageTypeID": 4,
    "AddressInfo": {
        "ID": 137060,
        "Title": "On-street",
        "AddressLine1": "High Street",
        "Town": "Birmingham",
        "Postcode": "B17 9QE",
        "CountryID": 1,
        "Latitude": 52.45878,
        "Longitude": -1.94953,
        "AccessComments": "On-street. In front of Lloyds Chemist. Fitted under Midlands PiP",
        "RelatedURL": "http://www.national-charge-point-registry.uk/",
        "DistanceUnit": 0
    },
    "Connections": [
        {
            "ID": 191261,
            "ConnectionTypeID": 25,
            "Reference": "0",
            "StatusTypeID": 50,
            "LevelID": 2,
            "Amps": 32,
            "Voltage": 400,
            "PowerKW": 22,
            "CurrentTypeID": 20
        },
        {
            "ID": 191262,
            "ConnectionTypeID": 25,
            "Reference": "1",
            "StatusTypeID": 50,
            "LevelID": 2,
            "Amps": 32,
            "Voltage": 400,
            "PowerKW": 22,
            "CurrentTypeID": 20
        }
    ],
    "StatusTypeID": 50,
    "DateLastStatusUpdate": "2020-11-24T17:40:00Z",
    "MetadataValues": [
        {
            "ID": 6566,
            "MetadataFieldID": 4,
            "ItemValue": "Contains public sector information licensed under the Open Government Licence v2.0. http://www.nationalarchives.gov.uk/doc/open-government-licence/version/2/"
        }
    ],
    "DataQualityLevel": 3,
    "DateCreated": "2019-12-24T05:23:00Z",
    "SubmissionStatusTypeID": 100
}