{
    "IsRecentlyVerified": false,
    "ID": 111293,
    "UUID": "97045715-727D-44F0-9A61-2D43AAEF7B28",
    "DataProviderID": 2,
    "DataProvidersReference": "83333",
    "UsageTypeID": 1,
    "AddressInfo": {
        "ID": 111639,
        "Title": "Brett Chevrolet Cadillac",
        "AddressLine1": "183 Rothesay Ave",
        "Town": "St. John",
        "StateOrProvince": "NB",
        "Postcode": "E2L 3T5",
        "CountryID": 44,
        "Latitude": 45.288795,
        "Longitude": -66.046037,
        "ContactTelephone1": "506-634-5555",
        "AccessComments": "Dealership business hours",
        "RelatedURL": "",
        "DistanceUnit": 0
    },
    "Connections": [
        {
            "ID": 156693,
            "ConnectionTypeID": 1,
            "LevelID": 2,
            "Amps": 16,
            "Voltage": 230,
            "PowerKW": 3.7,
            "CurrentTypeID": 10,
            "Quantity": 1
        }
    ],
    "DateLastStatusUpdate": "2020-06-26T03:08:00Z",
    "DataQualityLevel": 3,
    "DateCreated": "2018-10-18T23:37:00Z",
    "SubmissionStatusTypeID": 100
}