{
    "UserComments": [
        {
            "ID": 19598,
            "ChargePointID": 96183,
            "CommentTypeID": 10,
            "UserName": "Simon Hewison",
            "Comment": "noted to be working",
            "Rating": 4,
            "RelatedURL": "https://speakev.com/threads/shoutout-for-visit-hillbrush-at-mere-on-the-a303.120489/",
            "DateCreated": "2018-05-31T12:11:00.707Z",
            "User": {
                "ID": 4575,
                "Username": "Simon Hewison"
            },
            "CheckinStatusTypeID": 0
        }
    ],
    "IsRecentlyVerified": false,
    "ID": 96183,
    "UUID": "6617DF0F-24A3-4F7A-A86D-2B905D196BE1",
    "DataProviderID": 1,
    "OperatorID": 45,
    "UsageTypeID": 1,
    "UsageCost": "Free",
    "AddressInfo": {
        "ID": 96529,
        "Title": "Visit Hillbrush Cafe And Visitor Centre",
        "AddressLine1": "1 Norwood Park, Castle Street",
        "AddressLine2": "Zeals",
        "Town": "Mere",
        "StateOrProvince": "Wiltshire",
        "Postcode": "BA12 6LA",
        "CountryID": 1,
        "Latitude": 51.08943499999999,
        "Longitude": -2.287074999999959,
        "ContactTelephone1": "+44 1747 440077",
        "AccessComments": "0800-1800 Mon-Sat",
        "RelatedURL": "http://www.visit.hillbrush.com/",
        "DistanceUnit": 0
    },
    "Connections": [
        {
            "ID": 136275,
            "ConnectionTypeID": 25,
            "StatusTypeID": 50,
            "LevelID": 2,
            "Amps": 32,
            "Voltage": 230,
            "PowerKW": 7,
            "CurrentTypeID": 10,
            "Quantity": 2
        }
    ],
    "NumberOfPoints": 2,
    "StatusTypeID": 50,
    "DateLastStatusUpdate": "2018-05-31T12:11:00Z",
    "DataQualityLevel": 1,
    "DateCreated": "2017-12-14T09:58:00Z",
    "SubmissionStatusTypeID": 200
}