{
    "IsRecentlyVerified": false,
    "ID": 97178,
    "UUID": "C78D4A59-9AEC-43B8-AF2F-9E9E99274B2C",
    "DataProviderID": 1,
    "OperatorID": 3,
    "OperatorsReference": "PG-81489",
    "UsageTypeID": 6,
    "UsageCost": "1",
    "AddressInfo": {
        "ID": 97524,
        "Title": "Immediate Transportation Co LTD",
        "AddressLine1": "2 A/b Ridgeway Distribution Centre",
        "Town": "Buckinghamshire",
        "Postcode": "SL0 9JQ",
        "CountryID": 1,
        "Latitude": 51.514565,
        "Longitude": -0.509441,
        "DistanceUnit": 0
    },
    "Connections": [
        {
            "ID": 137986,
            "ConnectionTypeID": 25,
            "StatusTypeID": 50,
            "LevelID": 2,
            "Amps": 32,
            "Voltage": 400,
            "PowerKW": 22,
            "CurrentTypeID": 20,
            "Quantity": 2
        }
    ],
    "NumberOfPoints": 4,
    "GeneralComments": "This is an open charge unit installed at the Immediate Transportation Co Ltd site in The Ridgeway, Iver, Buckinghamshire",
    "StatusTypeID": 0,
    "DateLastStatusUpdate": "2020-02-16T14:58:00Z",
    "DataQualityLevel": 1,
    "DateCreated": "2018-01-09T16:36:00Z",
    "SubmissionStatusTypeID": 200
}