{
    "IsRecentlyVerified": false,
    "ID": 106972,
    "UUID": "423ABFF0-0BEC-46A1-966B-5FE2C9484842",
    "DataProviderID": 1,
    "OperatorID": 220,
    "UsageTypeID": 4,
    "AddressInfo": {
        "ID": 107318,
        "Title": "Amt Lützow-Lübstorf",
        "AddressLine1": "Dorfmitte 16",
        "Town": "Lützow",
        "StateOrProvince": "Nordwestmecklenburg",
        "Postcode": "19209",
        "CountryID": 87,
        "Latitude": 53.653202899019156,
        "Longitude": 11.17377030431362,
        "AccessComments": "24/7 nutzbar. Betreiber ist die WEMAG.",
        "RelatedURL": "http://www.wemag.com/laden",
        "DistanceUnit": 0
    },
    "Connections": [
        {
            "ID": 150803,
            "ConnectionTypeID": 25,
            "StatusTypeID": 50,
            "LevelID": 2,
            "Amps": 32,
            "Voltage": 400,
            "PowerKW": 22,
            "CurrentTypeID": 20,
            "Quantity": 2
        }
    ],
    "NumberOfPoints": 2,
    "StatusTypeID": 50,
    "DateLastStatusUpdate": "2018-07-11T06:59:00Z",
    "DataQualityLevel": 1,
    "DateCreated": "2018-07-11T06:59:00Z",
    "SubmissionStatusTypeID": 200
}