{
    "IsRecentlyVerified": false,
    "ID": 145750,
    "UUID": "DD691FC8-C878-4F81-BB32-AE22F07DF443",
    "DataProviderID": 1,
    "OperatorID": 3385,
    "UsageTypeID": 1,
    "UsageCost": "$0.12/minute",
    "AddressInfo": {
        "ID": 146102,
        "Title": "4th Ave Parking/Charging",
        "AddressLine1": "412 Wallace street",
        "Town": "Hope",
        "StateOrProvince": "BC",
        "Postcode": "V0X1L0",
        "CountryID": 44,
        "Latitude": 49.38048,
        "Longitude": -121.438662,
        "ContactTelephone1": "",
        "AccessComments": "24 hours daily",
        "RelatedURL": "",
        "DistanceUnit": 0
    },
    "Connections": [
        {
            "ID": 202481,
            "ConnectionTypeID": 2,
            "LevelID": 3,
            "Amps": 60,
            "Voltage": 400,
            "PowerKW": 25,
            "CurrentTypeID": 30,
            "Quantity": 1
        },
        {
            "ID": 202482,
            "ConnectionTypeID": 32,
            "LevelID": 3,
            "Amps": 65,
            "Voltage": 400,
            "PowerKW": 25,
            "CurrentTypeID": 30,
            "Quantity": 1
        },
        {
            "ID": 206101,
            "ConnectionTypeID": 2,
            "Reference": "BC Hydo Mini Charger",
            "StatusTypeID": 50,
            "LevelID": 3,
            "Amps": 60,
            "Voltage": 400,
            "PowerKW": 25,
            "CurrentTypeID": 30,
            "Quantity": 1
        },
        {
            "ID": 206102,
            "ConnectionTypeID": 32,
            "Reference": "BC Hydro Mini Charger",
            "StatusTypeID": 50,
            "LevelID": 3,
            "Amps": 65,
            "Voltage": 400,
            "PowerKW": 25,
            "CurrentTypeID": 30,
            "Quantity": 1
        }
    ],
    "GeneralComments": "25 kW Mini Charger",
    "StatusTypeID": 50,
    "DateLastStatusUpdate": "2021-10-06T03:53:00Z",
    "DataQualityLevel": 3,
    "DateCreated": "2019-12-24T09:25:00Z",
    "SubmissionStatusTypeID": 100
}