{
    "IsRecentlyVerified": false,
    "ID": 140539,
    "UUID": "A6D57312-2C4C-43CD-B815-4A748CC9D221",
    "DataProviderID": 2,
    "DataProvidersReference": "144080",
    "OperatorID": 5,
    "UsageTypeID": 1,
    "AddressInfo": {
        "ID": 140891,
        "Title": "MBA",
        "AddressLine1": "100 Pacific St",
        "Town": "Monterey",
        "StateOrProvince": "CA",
        "Postcode": "93940",
        "CountryID": 2,
        "Latitude": 36.603839,
        "Longitude": -121.895736,
        "ContactTelephone1": "888-758-4389",
        "AccessComments": "24 hours daily",
        "RelatedURL": "http://www.chargepoint.com/",
        "DistanceUnit": 0
    },
    "Connections": [
        {
            "ID": 196190,
            "ConnectionTypeID": 1,
            "LevelID": 2,
            "Amps": 16,
            "Voltage": 230,
            "PowerKW": 3,
            "CurrentTypeID": 10,
            "Quantity": 8
        }
    ],
    "StatusTypeID": 50,
    "DateLastStatusUpdate": "2019-12-24T09:13:00Z",
    "DataQualityLevel": 3,
    "DateCreated": "2019-12-24T09:13:00Z",
    "SubmissionStatusTypeID": 100
}