{
    "IsRecentlyVerified": false,
    "ID": 63271,
    "UUID": "38921FC7-7F52-4933-BB96-3D455E831303",
    "DataProviderID": 26,
    "DataProvidersReference": "76915",
    "OperatorID": 73,
    "OperatorsReference": "EV-Box EVB-P1507001",
    "UsageCost": "0.00 jaarabonnement",
    "AddressInfo": {
        "ID": 63617,
        "Title": "Händelstraat 17",
        "AddressLine1": "Händelstraat 17",
        "Town": "Capelle aan den IJssel",
        "Postcode": "2901 JC",
        "CountryID": 159,
        "Latitude": 51.9204,
        "Longitude": 4.56613,
        "RelatedURL": "http://www.ev-box.nl",
        "DistanceUnit": 0
    },
    "Connections": [
        {
            "ID": 80603,
            "ConnectionTypeID": 25,
            "LevelID": 2,
            "PowerKW": 11,
            "CurrentTypeID": 10
        },
        {
            "ID": 80604,
            "ConnectionTypeID": 25,
            "LevelID": 2,
            "PowerKW": 11,
            "CurrentTypeID": 10
        }
    ],
    "NumberOfPoints": 1,
    "StatusTypeID": 50,
    "DateLastStatusUpdate": "2016-06-04T02:42:00Z",
    "DataQualityLevel": 3,
    "DateCreated": "2016-03-03T12:30:00Z",
    "SubmissionStatusTypeID": 100
}