{
    "IsRecentlyVerified": false,
    "ID": 38741,
    "UUID": "2A004142-3BD5-4F56-B71A-705FF262344B",
    "DataProviderID": 26,
    "DataProvidersReference": "48190",
    "OperatorID": 178,
    "OperatorsReference": "EVnetNL EV0072",
    "UsageCost": "0.00 jaarabonnement",
    "AddressInfo": {
        "ID": 39087,
        "Title": "Rivièralaan 2-TR",
        "AddressLine1": "Rivièralaan 2-TR",
        "Town": "Noordoostpolder",
        "Postcode": "8303 WP",
        "CountryID": 159,
        "Latitude": 52.711437,
        "Longitude": 5.74056,
        "ContactTelephone1": "0800-3522365",
        "RelatedURL": "http://www.evnet.nl",
        "DistanceUnit": 0
    },
    "Connections": [
        {
            "ID": 42252,
            "ConnectionTypeID": 25,
            "LevelID": 2,
            "PowerKW": 11,
            "CurrentTypeID": 10
        }
    ],
    "NumberOfPoints": 1,
    "StatusTypeID": 50,
    "DateLastStatusUpdate": "2016-06-04T02:55:00Z",
    "DataQualityLevel": 3,
    "DateCreated": "2015-01-09T06:08:00Z",
    "SubmissionStatusTypeID": 100
}