{
    "IsRecentlyVerified": false,
    "ID": 131658,
    "UUID": "F4182F9F-2480-4A92-AC7D-5FB6EFD28AB2",
    "DataProviderID": 1,
    "OperatorID": 20,
    "OperatorsReference": "60290..60293",
    "UsageTypeID": 4,
    "UsageCost": "Free",
    "AddressInfo": {
        "ID": 132004,
        "Title": "Browncross Street",
        "AddressLine1": "Browncross Street",
        "Town": "Salford",
        "Postcode": "M3 5FU",
        "CountryID": 1,
        "Latitude": 53.48295,
        "Longitude": -2.25319,
        "DistanceUnit": 0
    },
    "Connections": [
        {
            "ID": 184268,
            "ConnectionTypeID": 25,
            "StatusTypeID": 50,
            "LevelID": 2,
            "Amps": 32,
            "Voltage": 230,
            "PowerKW": 7,
            "CurrentTypeID": 10,
            "Quantity": 4
        }
    ],
    "NumberOfPoints": 4,
    "StatusTypeID": 50,
    "DateLastStatusUpdate": "2020-03-11T06:19:00Z",
    "DataQualityLevel": 1,
    "DateCreated": "2019-09-10T13:45:00Z",
    "SubmissionStatusTypeID": 200
}