{
    "UserComments": [
        {
            "ID": 16030,
            "ChargePointID": 73301,
            "CommentTypeID": 10,
            "UserName": "Bert van Sas",
            "Rating": 5,
            "DateCreated": "2017-03-07T18:44:38.953Z",
            "User": {
                "ID": 11617,
                "Username": "Bert van Sas"
            },
            "CheckinStatusTypeID": 10
        },
        {
            "ID": 14544,
            "ChargePointID": 73301,
            "CommentTypeID": 10,
            "UserName": "Bert van Sas",
            "Rating": 5,
            "DateCreated": "2016-11-17T16:15:43.703Z",
            "User": {
                "ID": 11617,
                "Username": "Bert van Sas"
            },
            "CheckinStatusTypeID": 140
        }
    ],
    "MediaItems": [
        {
            "ID": 10612,
            "ChargePointID": 73301,
            "ItemURL": "https://s3-ap-southeast-2.amazonaws.com/openchargemap/images/NL/OCM73301/OCM-73301.orig.2017030718442509.jpg",
            "ItemThumbnailURL": "https://s3-ap-southeast-2.amazonaws.com/openchargemap/images/NL/OCM73301/OCM-73301.thmb.2017030718442509.jpg",
            "Comment": "Lower floor, also 14 charging points.",
            "IsEnabled": true,
            "IsVideo": false,
            "IsFeaturedItem": false,
            "IsExternalResource": false,
            "User": {
                "ID": 11617,
                "Username": "Bert van Sas"
            },
            "DateCreated": "2017-03-07T18:45:00Z"
        },
        {
            "ID": 10611,
            "ChargePointID": 73301,
            "ItemURL": "https://s3-ap-southeast-2.amazonaws.com/openchargemap/images/NL/OCM73301/OCM-73301.orig.2017030718435583.jpg",
            "ItemThumbnailURL": "https://s3-ap-southeast-2.amazonaws.com/openchargemap/images/NL/OCM73301/OCM-73301.thmb.2017030718435583.jpg",
            "Comment": "1 Floor 7x2 is 14 charging points and at the lower floor another 14 !",
            "IsEnabled": true,
            "IsVideo": false,
            "IsFeaturedItem": false,
            "IsExternalResource": false,
            "User": {
                "ID": 11617,
                "Username": "Bert van Sas"
            },
            "DateCreated": "2017-03-07T18:44:00Z"
        },
        {
            "ID": 8583,
            "ChargePointID": 73301,
            "ItemURL": "https://s3-ap-southeast-2.amazonaws.com/openchargemap/images/NL/OCM73301/OCM-73301.orig.2016111716150209.jpg",
            "ItemThumbnailURL": "https://s3-ap-southeast-2.amazonaws.com/openchargemap/images/NL/OCM73301/OCM-73301.thmb.2016111716150209.jpg",
            "Comment": "",
            "IsEnabled": true,
            "IsVideo": false,
            "IsFeaturedItem": false,
            "IsExternalResource": false,
            "User": {
                "ID": 11617,
                "Username": "Bert van Sas"
            },
            "DateCreated": "2016-11-17T16:15:00Z"
        },
        {
            "ID": 8584,
            "ChargePointID": 73301,
            "ItemURL": "https://s3-ap-southeast-2.amazonaws.com/openchargemap/images/NL/OCM73301/OCM-73301.orig.2016111716151255.jpg",
            "ItemThumbnailURL": "https://s3-ap-southeast-2.amazonaws.com/openchargemap/images/NL/OCM73301/OCM-73301.thmb.2016111716151255.jpg",
            "Comment": "",
            "IsEnabled": true,
            "IsVideo": false,
            "IsFeaturedItem": false,
            "IsExternalResource": false,
            "User": {
                "ID": 11617,
                "Username": "Bert van Sas"
            },
            "DateCreated": "2016-11-17T16:15:00Z"
        }
    ],
    "IsRecentlyVerified": false,
    "ID": 73301,
    "UUID": "5C1518F1-A157-41FE-B81C-325765BEE3A0",
    "DataProviderID": 1,
    "OperatorID": 29,
    "UsageTypeID": 1,
    "AddressInfo": {
        "ID": 73647,
        "Title": "Parkeergarage Paleiskwartier",
        "AddressLine1": "Hugo de Grootlaan 84",
        "Town": "'s Hertogenbosch",
        "StateOrProvince": "Noord-Brabant",
        "Postcode": "5223 LC",
        "CountryID": 159,
        "Latitude": 51.6893525,
        "Longitude": 5.28978660000007,
        "DistanceUnit": 0
    },
    "Connections": [
        {
            "ID": 105474,
            "ConnectionTypeID": 25,
            "StatusTypeID": 50,
            "LevelID": 2,
            "Amps": 16,
            "Voltage": 230,
            "PowerKW": 11,
            "CurrentTypeID": 20,
            "Quantity": 28
        }
    ],
    "NumberOfPoints": 28,
    "GeneralComments": "Ground level, is entrance level: 14 and below another 14!",
    "StatusTypeID": 50,
    "DateLastStatusUpdate": "2017-03-07T18:46:00Z",
    "DataQualityLevel": 1,
    "DateCreated": "2016-11-17T16:15:00Z",
    "SubmissionStatusTypeID": 200
}