{
    "IsRecentlyVerified": false,
    "ID": 180499,
    "UUID": "CC0FF6F7-18B7-4DDF-B507-DF87A23795C5",
    "DataProviderID": 29,
    "DataProvidersReference": "9551",
    "OperatorID": 132,
    "AddressInfo": {
        "ID": 180858,
        "Title": "Deisterstraße 10",
        "AddressLine1": "Deisterstraße 10",
        "Town": "Göttingen",
        "Postcode": "37081",
        "CountryID": 87,
        "Latitude": 51.52787,
        "Longitude": 9.89962,
        "DistanceUnit": 0
    },
    "Connections": [
        {
            "ID": 283647,
            "ConnectionTypeID": 25,
            "StatusTypeID": 50,
            "LevelID": 2,
            "PowerKW": 22,
            "CurrentTypeID": 20
        },
        {
            "ID": 283648,
            "ConnectionTypeID": 25,
            "StatusTypeID": 50,
            "LevelID": 2,
            "PowerKW": 22,
            "CurrentTypeID": 20
        }
    ],
    "StatusTypeID": 50,
    "DateLastStatusUpdate": "2021-07-12T02:48:00Z",
    "MetadataValues": [
        {
            "ID": 12793,
            "MetadataFieldID": 4,
            "ItemValue": "Data from the German chargepoint registry provided by Bundesnetzagentur.de under the CC-BY 4.0 license"
        }
    ],
    "DataQualityLevel": 3,
    "DateCreated": "2021-07-08T10:00:00Z",
    "SubmissionStatusTypeID": 100
}