{
    "IsRecentlyVerified": false,
    "ID": 36157,
    "UUID": "9AF3C76E-8751-41CF-90AB-20E8564C5129",
    "DataProviderID": 26,
    "DataProvidersReference": "46985",
    "OperatorID": 178,
    "OperatorsReference": "EVnetNL AL120",
    "UsageCost": "0.00 jaarabonnement",
    "AddressInfo": {
        "ID": 36503,
        "Title": "Nobelstraat",
        "AddressLine1": "Nobelstraat",
        "Town": "Brummen",
        "Postcode": "6961 ZP",
        "CountryID": 159,
        "Latitude": 52.104177,
        "Longitude": 6.058809,
        "ContactTelephone1": "0800-3522365",
        "RelatedURL": "http://www.evnet.nl",
        "DistanceUnit": 0
    },
    "Connections": [
        {
            "ID": 39668,
            "ConnectionTypeID": 25,
            "LevelID": 2,
            "PowerKW": 11,
            "CurrentTypeID": 10
        }
    ],
    "NumberOfPoints": 1,
    "StatusTypeID": 50,
    "DateLastStatusUpdate": "2016-06-04T02:50:00Z",
    "DataQualityLevel": 3,
    "DateCreated": "2015-01-09T06:05:00Z",
    "SubmissionStatusTypeID": 100
}