{
    "IsRecentlyVerified": false,
    "ID": 104407,
    "UUID": "A7F37FA3-FC27-48AB-B77F-DC0C507CB176",
    "DataProviderID": 1,
    "OperatorID": 23,
    "OperatorsReference": "43159",
    "UsageTypeID": 4,
    "AddressInfo": {
        "ID": 104753,
        "Title": "Queen's Athletics & Recreation Centre (Arc)",
        "AddressLine1": "284 Earl St",
        "Town": "Kingston",
        "StateOrProvince": "Ontario",
        "Postcode": "K7L 3N6",
        "CountryID": 44,
        "Latitude": 44.228991,
        "Longitude": -76.493536,
        "ContactTelephone1": "(613) 533-2953",
        "DistanceUnit": 0
    },
    "Connections": [
        {
            "ID": 147402,
            "ConnectionTypeID": 30,
            "StatusTypeID": 50,
            "LevelID": 2,
            "PowerKW": 16,
            "CurrentTypeID": 20,
            "Quantity": 8
        }
    ],
    "NumberOfPoints": 8,
    "GeneralComments": "8 Tesla Connectors, up to 16kW.Parking fees will apply. Self park.",
    "StatusTypeID": 50,
    "DateLastStatusUpdate": "2018-05-20T05:30:00Z",
    "DataQualityLevel": 1,
    "DateCreated": "2018-05-20T05:30:00Z",
    "SubmissionStatusTypeID": 200
}