{
    "IsRecentlyVerified": false,
    "ID": 67615,
    "UUID": "29D3B764-1E33-470F-96DB-E2E1EC3C49F6",
    "DataProviderID": 1,
    "DataProvidersReference": "3380",
    "AddressInfo": {
        "ID": 67961,
        "Title": "E.ON OKQ8 Värnamo",
        "AddressLine1": "Refugen 4",
        "Town": "VÄRNAMO",
        "StateOrProvince": "JÖNKÖPING",
        "Postcode": "33193",
        "CountryID": 216,
        "Latitude": 57.16302,
        "Longitude": 14.07345,
        "AccessComments": "Samlokaliserad med OKQ8 inne på bensinmackens område, intill E.ONs fordonsgasstation.",
        "DistanceUnit": 0
    },
    "Connections": [
        {
            "ID": 93162,
            "ConnectionTypeID": 0,
            "Reference": "1",
            "LevelID": 2,
            "Amps": 100,
            "Voltage": 500,
            "PowerKW": 50,
            "Comments": "Mode 4"
        },
        {
            "ID": 93163,
            "ConnectionTypeID": 0,
            "Reference": "2",
            "LevelID": 2,
            "Amps": 100,
            "Voltage": 500,
            "PowerKW": 50,
            "Comments": "Mode 4"
        },
        {
            "ID": 93164,
            "ConnectionTypeID": 0,
            "Reference": "3",
            "LevelID": 2,
            "Amps": 32,
            "Voltage": 400,
            "PowerKW": 22,
            "Comments": "Mode 3"
        }
    ],
    "NumberOfPoints": 3,
    "DateLastStatusUpdate": "2020-05-26T08:21:00Z",
    "DataQualityLevel": 2,
    "DateCreated": "2016-05-29T06:25:00Z",
    "SubmissionStatusTypeID": 100
}