{
    "IsRecentlyVerified": false,
    "ID": 47385,
    "UUID": "E3BDEE63-C9B7-4310-8822-CA7891550BF1",
    "DataProviderID": 2,
    "DataProvidersReference": "67181",
    "OperatorID": 5,
    "UsageTypeID": 1,
    "AddressInfo": {
        "ID": 47731,
        "Title": "CITY OF REDWOOD",
        "AddressLine1": "799 St Francis St",
        "Town": "Redwood City",
        "StateOrProvince": "CA",
        "Postcode": "94061",
        "CountryID": 2,
        "Latitude": 37.4719595,
        "Longitude": -122.2399898,
        "ContactTelephone1": "888-758-4389",
        "AccessComments": "24 hours daily",
        "RelatedURL": "http://www.chargepoint.com/",
        "DistanceUnit": 0
    },
    "Connections": [
        {
            "ID": 58422,
            "ConnectionTypeID": 1,
            "LevelID": 2,
            "Amps": 16,
            "Voltage": 230,
            "PowerKW": 3,
            "CurrentTypeID": 10,
            "Quantity": 2
        }
    ],
    "DateLastStatusUpdate": "2019-04-06T04:02:00Z",
    "DataQualityLevel": 3,
    "DateCreated": "2015-05-27T08:50:00Z",
    "SubmissionStatusTypeID": 100
}