{
    "IsRecentlyVerified": false,
    "ID": 50436,
    "UUID": "D442B8C1-44B6-44C9-BB7A-045B84B49F99",
    "DataProviderID": 2,
    "DataProvidersReference": "68404",
    "UsageTypeID": 7,
    "AddressInfo": {
        "ID": 50782,
        "Title": "Monarch Ford",
        "AddressLine1": "132 N D St",
        "Town": "Exeter",
        "StateOrProvince": "CA",
        "Postcode": "93221",
        "CountryID": 2,
        "Latitude": 36.297258,
        "Longitude": -119.140309,
        "ContactTelephone1": "559-592-3800",
        "AccessComments": "Dealership business hours",
        "RelatedURL": "",
        "DistanceUnit": 0
    },
    "Connections": [
        {
            "ID": 62136,
            "ConnectionTypeID": 1,
            "LevelID": 2,
            "Amps": 16,
            "Voltage": 230,
            "PowerKW": 3,
            "CurrentTypeID": 10,
            "Quantity": 2
        }
    ],
    "DateLastStatusUpdate": "2019-04-06T04:02:00Z",
    "DataQualityLevel": 3,
    "DateCreated": "2015-07-22T08:57:00Z",
    "SubmissionStatusTypeID": 100
}