{
    "UserComments": [
        {
            "ID": 23115,
            "ChargePointID": 125127,
            "CommentTypeID": 10,
            "UserName": "ForumElettrico.it",
            "Comment": "La strada è a senso unico, per cui a fine ricarica bisogna andare a sinistra della colonnina e fare tutto il giro. Leggi la recensione completa qui >  https://www.forumelettrico.it/forum/post128998.html#p128998",
            "RelatedURL": "https://www.forumelettrico.it/forum/post128998.html#p128998",
            "DateCreated": "2020-08-18T16:53:44.607Z",
            "User": {
                "ID": 11749,
                "Username": "ForumElettrico.it"
            },
            "CheckinStatusTypeID": 10,
            "IsActionedByEditor": false
        },
        {
            "ID": 20922,
            "ChargePointID": 125127,
            "CommentTypeID": 10,
            "UserName": "ForumElettrico.it",
            "RelatedURL": "https://www.forumelettrico.it/forum/fast-enel-santarcangelo-di-romagna-via-bertozzi-46-158-t5265.html",
            "DateCreated": "2019-04-23T07:14:08.53Z",
            "User": {
                "ID": 11749,
                "Username": "ForumElettrico.it"
            },
            "CheckinStatusTypeID": 10
        }
    ],
    "MediaItems": [
        {
            "ID": 24326,
            "ChargePointID": 125127,
            "ItemURL": "https://s3-ap-southeast-2.amazonaws.com/openchargemap/images/IT/OCM125127/OCM-125127.orig.2020081816535887.jpg",
            "ItemThumbnailURL": "https://s3-ap-southeast-2.amazonaws.com/openchargemap/images/IT/OCM125127/OCM-125127.thmb.2020081816535887.jpg",
            "Comment": "",
            "IsEnabled": true,
            "IsVideo": false,
            "IsFeaturedItem": false,
            "IsExternalResource": false,
            "User": {
                "ID": 11749,
                "Username": "ForumElettrico.it"
            },
            "DateCreated": "2020-08-18T16:54:00Z"
        },
        {
            "ID": 24327,
            "ChargePointID": 125127,
            "ItemURL": "https://s3-ap-southeast-2.amazonaws.com/openchargemap/images/IT/OCM125127/OCM-125127.orig.2020081816540434.jpg",
            "ItemThumbnailURL": "https://s3-ap-southeast-2.amazonaws.com/openchargemap/images/IT/OCM125127/OCM-125127.thmb.2020081816540434.jpg",
            "Comment": "",
            "IsEnabled": true,
            "IsVideo": false,
            "IsFeaturedItem": false,
            "IsExternalResource": false,
            "User": {
                "ID": 11749,
                "Username": "ForumElettrico.it"
            },
            "DateCreated": "2020-08-18T16:54:00Z"
        },
        {
            "ID": 18130,
            "ChargePointID": 125127,
            "ItemURL": "https://s3-ap-southeast-2.amazonaws.com/openchargemap/images/IT/OCM125127/OCM-125127.orig.2019042307143707.jpg",
            "ItemThumbnailURL": "https://s3-ap-southeast-2.amazonaws.com/openchargemap/images/IT/OCM125127/OCM-125127.thmb.2019042307143707.jpg",
            "Comment": "",
            "IsEnabled": true,
            "IsVideo": false,
            "IsFeaturedItem": false,
            "IsExternalResource": false,
            "User": {
                "ID": 11749,
                "Username": "ForumElettrico.it"
            },
            "DateCreated": "2019-04-23T07:15:00Z"
        },
        {
            "ID": 18131,
            "ChargePointID": 125127,
            "ItemURL": "https://s3-ap-southeast-2.amazonaws.com/openchargemap/images/IT/OCM125127/OCM-125127.orig.2019042307144834.jpg",
            "ItemThumbnailURL": "https://s3-ap-southeast-2.amazonaws.com/openchargemap/images/IT/OCM125127/OCM-125127.thmb.2019042307144834.jpg",
            "Comment": "",
            "IsEnabled": true,
            "IsVideo": false,
            "IsFeaturedItem": false,
            "IsExternalResource": false,
            "User": {
                "ID": 11749,
                "Username": "ForumElettrico.it"
            },
            "DateCreated": "2019-04-23T07:15:00Z"
        },
        {
            "ID": 18132,
            "ChargePointID": 125127,
            "ItemURL": "https://s3-ap-southeast-2.amazonaws.com/openchargemap/images/IT/OCM125127/OCM-125127.orig.2019042307145847.jpg",
            "ItemThumbnailURL": "https://s3-ap-southeast-2.amazonaws.com/openchargemap/images/IT/OCM125127/OCM-125127.thmb.2019042307145847.jpg",
            "Comment": "",
            "IsEnabled": true,
            "IsVideo": false,
            "IsFeaturedItem": false,
            "IsExternalResource": false,
            "User": {
                "ID": 11749,
                "Username": "ForumElettrico.it"
            },
            "DateCreated": "2019-04-23T07:15:00Z"
        }
    ],
    "IsRecentlyVerified": false,
    "ID": 125127,
    "UUID": "B1B9F8B7-F4C8-4747-9109-8444199DE643",
    "DataProviderID": 1,
    "OperatorID": 80,
    "UsageTypeID": 4,
    "AddressInfo": {
        "ID": 125473,
        "Title": "EnelX EVA+  Santarcangelo Bertozzi ",
        "AddressLine1": "Via Bertozzi 46-158",
        "Town": "Santarcangelo di Romagna",
        "StateOrProvince": "RN",
        "Postcode": "47822",
        "CountryID": 112,
        "Latitude": 44.0658970305751,
        "Longitude": 12.4664487280562,
        "ContactTelephone1": "800.069.850",
        "RelatedURL": "https://www.enelx.com/it/it/emobility",
        "DistanceUnit": 0
    },
    "Connections": [
        {
            "ID": 175369,
            "ConnectionTypeID": 33,
            "StatusTypeID": 50,
            "LevelID": 3,
            "Amps": 120,
            "Voltage": 500,
            "PowerKW": 50,
            "CurrentTypeID": 30,
            "Quantity": 1
        },
        {
            "ID": 175370,
            "ConnectionTypeID": 2,
            "StatusTypeID": 50,
            "LevelID": 3,
            "Amps": 120,
            "Voltage": 500,
            "PowerKW": 50,
            "CurrentTypeID": 30,
            "Quantity": 1
        },
        {
            "ID": 175371,
            "ConnectionTypeID": 1036,
            "StatusTypeID": 50,
            "LevelID": 3,
            "Amps": 64,
            "Voltage": 400,
            "PowerKW": 43,
            "CurrentTypeID": 20,
            "Quantity": 1
        }
    ],
    "NumberOfPoints": 2,
    "StatusTypeID": 50,
    "DateLastStatusUpdate": "2020-08-18T16:54:00Z",
    "DataQualityLevel": 1,
    "DateCreated": "2019-04-10T15:32:00Z",
    "SubmissionStatusTypeID": 200
}