{
    "IsRecentlyVerified": false,
    "ID": 109311,
    "UUID": "E2942B20-576F-4462-B11B-032CB1EE1E31",
    "DataProviderID": 1,
    "OperatorID": 23,
    "OperatorsReference": "44736",
    "UsageTypeID": 4,
    "AddressInfo": {
        "ID": 109657,
        "Title": "The Jockey Club Rooms",
        "AddressLine1": "The Jockey Club Rooms",
        "Postcode": "CB8 8JL",
        "CountryID": 1,
        "Latitude": 52.243055,
        "Longitude": 0.404978,
        "ContactTelephone1": " +44 163 866 3101",
        "DistanceUnit": 0
    },
    "Connections": [
        {
            "ID": 154429,
            "ConnectionTypeID": 30,
            "StatusTypeID": 50,
            "LevelID": 2,
            "PowerKW": 13,
            "CurrentTypeID": 20,
            "Quantity": 2
        }
    ],
    "NumberOfPoints": 2,
    "GeneralComments": "2 Tesla Connectors, up to 13kW.Available to the public. Please see front desk.",
    "StatusTypeID": 50,
    "DateLastStatusUpdate": "2018-10-11T14:18:00Z",
    "DataQualityLevel": 1,
    "DateCreated": "2018-10-11T14:18:00Z",
    "SubmissionStatusTypeID": 200
}