{
    "UserComments": [
        {
            "ID": 339,
            "ChargePointID": 10417,
            "CommentTypeID": 10,
            "UserName": "Matt Beard",
            "Comment": "It looks like parking arrangements may have changed here recently. Have found car park 2 open quite often recently. There is no parking charge while charging, but also the sign says EVs park free anyway! Currently only 4 out of 5 stars as car park opening time unclear.",
            "Rating": 4,
            "DateCreated": "2013-05-30T12:52:38.373Z",
            "User": {
                "ID": 1032,
                "Username": "Matt Beard"
            },
            "CheckinStatusTypeID": 10
        },
        {
            "ID": 193,
            "ChargePointID": 10417,
            "CommentTypeID": 10,
            "UserName": "Matt Beard",
            "Comment": "This car park has a gate that seems to be closed even at times when other car parks on the site are open. Check before you turn up!",
            "DateCreated": "2012-11-17T12:05:56.923Z",
            "User": {
                "ID": 1032,
                "Username": "Matt Beard"
            }
        }
    ],
    "MediaItems": [
        {
            "ID": 233,
            "ChargePointID": 10417,
            "ItemURL": "https://s3-ap-southeast-2.amazonaws.com/openchargemap/images/GB/OCM10417/OCM-10417.orig.2014021809434598.jpg",
            "ItemThumbnailURL": "https://s3-ap-southeast-2.amazonaws.com/openchargemap/images/GB/OCM10417/OCM-10417.thmb.2014021809434598.jpg",
            "Comment": "Charger location indicated. As can be seen, there is no access when the car park is closed.",
            "IsEnabled": true,
            "IsVideo": false,
            "IsFeaturedItem": false,
            "IsExternalResource": false,
            "User": {
                "ID": 1032,
                "Username": "Matt Beard"
            },
            "DateCreated": "2014-02-18T09:44:00Z"
        },
        {
            "ID": 227,
            "ChargePointID": 10417,
            "ItemURL": "https://s3-ap-southeast-2.amazonaws.com/openchargemap/images/GB/OCM10417/OCM-10417.orig.2014021505414898.jpg",
            "ItemThumbnailURL": "https://s3-ap-southeast-2.amazonaws.com/openchargemap/images/GB/OCM10417/OCM-10417.thmb.2014021505414898.jpg",
            "Comment": "",
            "IsEnabled": true,
            "IsVideo": false,
            "IsFeaturedItem": false,
            "IsExternalResource": false,
            "User": {
                "ID": 1000,
                "Username": "Christopher Cook"
            },
            "DateCreated": "2014-02-15T05:42:00Z"
        }
    ],
    "IsRecentlyVerified": false,
    "ID": 10417,
    "UUID": "E8464325-5A23-44DE-86D6-58D4A7BA927E",
    "DataProviderID": 1,
    "OperatorID": 3,
    "OperatorsReference": "PP-5112113",
    "UsageTypeID": 6,
    "UsageCost": "Free",
    "AddressInfo": {
        "ID": 10314,
        "Title": "AECC - Car Park 2",
        "AddressLine1": "AECC",
        "AddressLine2": "Bridge of Don",
        "Town": "Aberdeen",
        "StateOrProvince": "Aberdeenshire",
        "Postcode": "AB23 8BL",
        "CountryID": 1,
        "Latitude": 57.1853475528229,
        "Longitude": -2.08867143839859,
        "ContactTelephone1": "+44 (0) 1224 824824",
        "ContactEmail": "aecc@aecc.co.uk",
        "AccessComments": "Located in Car Park 2 - May be reserved for Council access so phone ahead",
        "RelatedURL": "http://www.aecc.co.uk/",
        "DistanceUnit": 0
    },
    "Connections": [
        {
            "ID": 8349,
            "ConnectionTypeID": 25,
            "StatusTypeID": 50,
            "LevelID": 2,
            "Amps": 32,
            "Voltage": 230,
            "PowerKW": 7,
            "CurrentTypeID": 10,
            "Quantity": 2
        }
    ],
    "NumberOfPoints": 2,
    "StatusTypeID": 0,
    "DateLastStatusUpdate": "2019-05-02T19:38:00Z",
    "DataQualityLevel": 1,
    "DateCreated": "2012-05-22T13:00:00Z",
    "SubmissionStatusTypeID": 200
}