{
    "IsRecentlyVerified": false,
    "ID": 132548,
    "UUID": "C8BDC1A5-4B8D-4B97-9F97-D5F2D5C5639C",
    "DataProviderID": 1,
    "OperatorID": 45,
    "UsageTypeID": 5,
    "UsageCost": "0,25€/kWh",
    "AddressInfo": {
        "ID": 132894,
        "Title": "ADS Green Arc",
        "AddressLine1": "Viale Europa, 62",
        "Town": "San Gregorio di Catania",
        "StateOrProvince": "CT",
        "Postcode": "95027",
        "CountryID": 112,
        "Latitude": 37.5725060269371,
        "Longitude": 15.1113375853402,
        "ContactTelephone1": "095 779 6261",
        "RelatedURL": "http://www.greenarc.it/",
        "DistanceUnit": 0
    },
    "Connections": [
        {
            "ID": 185569,
            "ConnectionTypeID": 33,
            "StatusTypeID": 50,
            "LevelID": 3,
            "PowerKW": 20,
            "CurrentTypeID": 30,
            "Quantity": 1
        },
        {
            "ID": 185570,
            "ConnectionTypeID": 2,
            "StatusTypeID": 50,
            "LevelID": 3,
            "PowerKW": 20,
            "CurrentTypeID": 30,
            "Quantity": 1
        },
        {
            "ID": 185571,
            "ConnectionTypeID": 25,
            "StatusTypeID": 50,
            "LevelID": 2,
            "Amps": 32,
            "Voltage": 400,
            "PowerKW": 22,
            "CurrentTypeID": 20,
            "Quantity": 1
        }
    ],
    "NumberOfPoints": 2,
    "GeneralComments": "Aperta dalle 06:00 alle 22:00 tutti i giorni",
    "StatusTypeID": 50,
    "DateLastStatusUpdate": "2019-10-02T09:02:00Z",
    "DataQualityLevel": 1,
    "DateCreated": "2019-10-02T09:02:00Z",
    "SubmissionStatusTypeID": 200
}