{
    "IsRecentlyVerified": false,
    "ID": 129875,
    "UUID": "B6161B3C-725D-4071-AD8E-9878B0B8C2C4",
    "DataProviderID": 1,
    "OperatorID": 89,
    "UsageTypeID": 1,
    "UsageCost": "Currently Free",
    "AddressInfo": {
        "ID": 130221,
        "Title": "Jaffray Pump and Pantry",
        "AddressLine1": "Crowsnest Highway Hwy 93 &, Tie Lake Rd, Jaffray, BC V0B 1T0",
        "Town": "Jaffray",
        "StateOrProvince": "Regional District of East Kootenay",
        "Postcode": "V0B 1T0",
        "CountryID": 44,
        "Latitude": 49.3759227620852,
        "Longitude": -115.298240317679,
        "DistanceUnit": 0
    },
    "Connections": [
        {
            "ID": 181850,
            "ConnectionTypeID": 2,
            "StatusTypeID": 50,
            "LevelID": 3,
            "PowerKW": 50,
            "CurrentTypeID": 30,
            "Quantity": 1
        },
        {
            "ID": 181851,
            "ConnectionTypeID": 32,
            "StatusTypeID": 50,
            "LevelID": 3,
            "PowerKW": 50,
            "CurrentTypeID": 30
        }
    ],
    "NumberOfPoints": 1,
    "GeneralComments": "Part of the Accelerate Kootenays network",
    "StatusTypeID": 50,
    "DateLastStatusUpdate": "2019-08-03T18:28:00Z",
    "DataQualityLevel": 1,
    "DateCreated": "2019-07-29T20:10:00Z",
    "SubmissionStatusTypeID": 200
}