{
    "UserComments": [
        {
            "ID": 19200,
            "ChargePointID": 70749,
            "CommentTypeID": 10,
            "UserName": "Jonny-B52",
            "Comment": "Gute Station - meistens frei",
            "Rating": 5,
            "DateCreated": "2018-02-17T16:39:41.287Z",
            "User": {
                "ID": 18038,
                "Username": "Jonny-B52"
            },
            "CheckinStatusTypeID": 0
        }
    ],
    "IsRecentlyVerified": false,
    "ID": 70749,
    "UUID": "A249FB8B-30A8-48A8-9058-AF569278EE32",
    "DataProviderID": 1,
    "OperatorID": 45,
    "UsageTypeID": 5,
    "AddressInfo": {
        "ID": 71095,
        "Title": "Parkhaus Prinzengarten",
        "AddressLine1": "Bahnhofstraße 21",
        "Town": "Sigmaringen",
        "StateOrProvince": "Landkreis Sigmaringen",
        "Postcode": "72488",
        "CountryID": 87,
        "Latitude": 48.0853729,
        "Longitude": 9.225017500000035,
        "AccessComments": "24/7 kostenlos nutzbare Wallbox - links neben der Ein- und Ausfahrt; Parkgebühren maximal 2 €, 30 min kostenlos.\r\nLadedauer max. 3 Std. ",
        "RelatedURL": "http://www.stadtwerke-sigmaringen.de/de/Strom/E-Mobilitaet/E-Ladesaeulen/E-Ladesaeulen-der-Stadtwerke-Sigma",
        "DistanceUnit": 0
    },
    "Connections": [
        {
            "ID": 101347,
            "ConnectionTypeID": 25,
            "StatusTypeID": 50,
            "LevelID": 2,
            "Amps": 32,
            "Voltage": 400,
            "PowerKW": 22,
            "CurrentTypeID": 20,
            "Quantity": 1
        }
    ],
    "NumberOfPoints": 1,
    "StatusTypeID": 50,
    "DateLastStatusUpdate": "2018-02-17T23:44:00Z",
    "DataQualityLevel": 1,
    "DateCreated": "2016-08-09T06:24:00Z",
    "SubmissionStatusTypeID": 200
}