{
    "IsRecentlyVerified": false,
    "ID": 19902,
    "UUID": "DB09E4ED-3458-41BD-8069-DC19AD6C800E",
    "DataProviderID": 1,
    "OperatorID": 213,
    "OperatorsReference": "5a4eedc0e4b08b4f09b7b0c7,5a4eedc0e4b08b4f09b7b0c7",
    "UsageTypeID": 0,
    "AddressInfo": {
        "ID": 20247,
        "Title": "Place du Général de Gaulle - Vannes",
        "AddressLine1": "Place du Général de Gaulle",
        "StateOrProvince": " Vannes",
        "Postcode": "56000",
        "CountryID": 80,
        "Latitude": 47.6584,
        "Longitude": -2.75369,
        "AccessComments": "Ouvert à tous",
        "DistanceUnit": 0
    },
    "Connections": [],
    "NumberOfPoints": 4,
    "StatusTypeID": 50,
    "DateLastStatusUpdate": "2020-01-05T20:29:00Z",
    "DataQualityLevel": 1,
    "DateCreated": "2013-10-21T03:53:00Z",
    "SubmissionStatusTypeID": 200
}