{
    "IsRecentlyVerified": false,
    "ID": 31504,
    "UUID": "B7878132-0A25-441F-8DB6-C593209D494A",
    "DataProviderID": 26,
    "DataProvidersReference": "49864",
    "OperatorID": 78,
    "OperatorsReference": "Essent EM-AT-00020305-01-00003",
    "UsageCost": "0.00 jaarabonnement",
    "AddressInfo": {
        "ID": 31850,
        "Title": "Villacher Straße",
        "AddressLine1": "Villacher Straße",
        "Town": "Hermagor",
        "Postcode": "9620",
        "CountryID": 19,
        "Latitude": 46.627798,
        "Longitude": 13.375378,
        "RelatedURL": "http://www.essent.nl",
        "DistanceUnit": 0
    },
    "Connections": [
        {
            "ID": 35015,
            "ConnectionTypeID": 25,
            "LevelID": 2,
            "PowerKW": 11,
            "CurrentTypeID": 10
        },
        {
            "ID": 45921,
            "ConnectionTypeID": 25,
            "LevelID": 2,
            "PowerKW": 11
        }
    ],
    "NumberOfPoints": 1,
    "StatusTypeID": 50,
    "DateLastStatusUpdate": "2016-06-04T02:37:00Z",
    "DataQualityLevel": 3,
    "DateCreated": "2015-01-09T06:03:00Z",
    "SubmissionStatusTypeID": 100
}