{
    "IsRecentlyVerified": false,
    "ID": 121929,
    "UUID": "9F229EE6-E3C6-481E-A255-307C58D7B327",
    "DataProviderID": 2,
    "DataProvidersReference": "94759",
    "OperatorID": 3372,
    "UsageTypeID": 2,
    "AddressInfo": {
        "ID": 122275,
        "Title": "ADP - La Palma",
        "AddressLine1": "5355 Orangethorpe Ave",
        "Town": "La Palma",
        "StateOrProvince": "CA",
        "Postcode": "90623",
        "CountryID": 2,
        "Latitude": 33.859752,
        "Longitude": -118.039334,
        "ContactTelephone1": "",
        "AccessComments": "Employee use only",
        "RelatedURL": "http://evconnect.com/",
        "DistanceUnit": 0
    },
    "Connections": [
        {
            "ID": 171770,
            "ConnectionTypeID": 1,
            "LevelID": 2,
            "Amps": 16,
            "Voltage": 230,
            "PowerKW": 3.7,
            "CurrentTypeID": 10,
            "Quantity": 10
        }
    ],
    "DateLastStatusUpdate": "2020-06-26T02:56:00Z",
    "DataQualityLevel": 3,
    "DateCreated": "2019-04-06T05:02:00Z",
    "SubmissionStatusTypeID": 100
}