{
    "IsRecentlyVerified": false,
    "ID": 121441,
    "UUID": "708E9356-C37D-45E4-A349-296F891C9E1E",
    "DataProviderID": 1,
    "OperatorID": 25,
    "OperatorsReference": "towerhamlets-cablestreet228",
    "UsageTypeID": 4,
    "UsageCost": "£0.059/minute; min £1.18; other tariffs available",
    "AddressInfo": {
        "ID": 121787,
        "Title": "Cable Street 228",
        "AddressLine1": "228 Cable Street",
        "Town": "London",
        "Postcode": "E1 0DR",
        "CountryID": 1,
        "Latitude": 51.511056,
        "Longitude": -0.059034,
        "DistanceUnit": 0
    },
    "Connections": [
        {
            "ID": 171082,
            "ConnectionTypeID": 1,
            "StatusTypeID": 50,
            "LevelID": 2,
            "Amps": 16,
            "Voltage": 230,
            "PowerKW": 4,
            "CurrentTypeID": 10,
            "Quantity": 1
        },
        {
            "ID": 171083,
            "ConnectionTypeID": 25,
            "StatusTypeID": 50,
            "LevelID": 2,
            "Amps": 32,
            "Voltage": 230,
            "PowerKW": 7,
            "CurrentTypeID": 10,
            "Quantity": 1
        }
    ],
    "NumberOfPoints": 1,
    "StatusTypeID": 50,
    "DateLastStatusUpdate": "2019-04-01T14:18:00Z",
    "DataQualityLevel": 1,
    "DateCreated": "2019-04-01T14:18:00Z",
    "SubmissionStatusTypeID": 200
}