{
    "IsRecentlyVerified": false,
    "ID": 24590,
    "UUID": "5D637234-134B-44FF-BF6F-3079445AC262",
    "DataProviderID": 1,
    "OperatorID": 91,
    "UsageTypeID": 7,
    "AddressInfo": {
        "ID": 24936,
        "Title": "EROSKI HONDARRIBIA",
        "AddressLine1": "Minasoroeta Kalea, 4",
        "Town": "Hondarribia",
        "StateOrProvince": "Provincia de Gipuzkoa",
        "Postcode": "20280",
        "CountryID": 210,
        "Latitude": 43.361583,
        "Longitude": -1.793754,
        "ContactTelephone1": "+34 902 540 810",
        "ContactEmail": "ibil@ibil.es",
        "AccessComments": "Parking Interior Planta -1. Pedir tarjeta en recepción.",
        "RelatedURL": "http://www.ibil.es",
        "DistanceUnit": 0
    },
    "Connections": [
        {
            "ID": 26867,
            "ConnectionTypeID": 25,
            "StatusTypeID": 50,
            "LevelID": 2,
            "Amps": 32,
            "Voltage": 380,
            "PowerKW": 11,
            "Quantity": 2
        },
        {
            "ID": 26868,
            "ConnectionTypeID": 13,
            "StatusTypeID": 50,
            "LevelID": 2,
            "Amps": 16,
            "Voltage": 230,
            "PowerKW": 3.7,
            "Quantity": 2
        }
    ],
    "NumberOfPoints": 2,
    "StatusTypeID": 50,
    "DateLastStatusUpdate": "2016-02-18T09:23:00Z",
    "DataQualityLevel": 1,
    "DateCreated": "2014-10-21T10:24:00Z",
    "SubmissionStatusTypeID": 200
}