{
    "IsRecentlyVerified": false,
    "ID": 65464,
    "UUID": "8BD9E1A9-B2AD-4916-9301-A2D4B567C729",
    "DataProviderID": 26,
    "DataProvidersReference": "85615",
    "OperatorID": 73,
    "OperatorsReference": "EV-Box EVB-P1551057",
    "UsageCost": "0.00 jaarabonnement",
    "AddressInfo": {
        "ID": 65810,
        "Title": "Elstweg 12",
        "AddressLine1": "Elstweg 12",
        "Town": "Cuijk",
        "Postcode": "5437 PE",
        "CountryID": 159,
        "Latitude": 51.72461,
        "Longitude": 5.82244,
        "RelatedURL": "http://www.ev-box.nl",
        "DistanceUnit": 0
    },
    "Connections": [
        {
            "ID": 90211,
            "ConnectionTypeID": 25,
            "LevelID": 2,
            "PowerKW": 11,
            "CurrentTypeID": 10
        }
    ],
    "NumberOfPoints": 1,
    "StatusTypeID": 50,
    "DateLastStatusUpdate": "2016-06-04T02:40:00Z",
    "DataQualityLevel": 3,
    "DateCreated": "2016-04-27T09:41:00Z",
    "SubmissionStatusTypeID": 100
}