{
    "MediaItems": [
        {
            "ID": 29388,
            "ChargePointID": 189425,
            "ItemURL": "https://s3-ap-southeast-2.amazonaws.com/openchargemap/images/US/OCM189425/OCM-189425.orig.2021092815144789.jpg",
            "ItemThumbnailURL": "https://s3-ap-southeast-2.amazonaws.com/openchargemap/images/US/OCM189425/OCM-189425.thmb.2021092815144789.jpg",
            "Comment": "",
            "IsEnabled": true,
            "IsVideo": false,
            "IsFeaturedItem": false,
            "IsExternalResource": false,
            "User": {
                "ID": 34694,
                "Username": "Tim"
            },
            "DateCreated": "2021-09-28T15:15:00Z"
        },
        {
            "ID": 29387,
            "ChargePointID": 189425,
            "ItemURL": "https://s3-ap-southeast-2.amazonaws.com/openchargemap/images/US/OCM189425/OCM-189425.orig.2021092815080357.jpg",
            "ItemThumbnailURL": "https://s3-ap-southeast-2.amazonaws.com/openchargemap/images/US/OCM189425/OCM-189425.thmb.2021092815080357.jpg",
            "Comment": "",
            "IsEnabled": true,
            "IsVideo": false,
            "IsFeaturedItem": false,
            "IsExternalResource": false,
            "User": {
                "ID": 34694,
                "Username": "Tim"
            },
            "DateCreated": "2021-09-28T15:08:00Z"
        }
    ],
    "IsRecentlyVerified": true,
    "DateLastVerified": "2021-09-28T00:38:00Z",
    "ID": 189425,
    "UUID": "7CD8715D-0831-4A61-BCBE-1208A7559FE0",
    "DataProviderID": 1,
    "OperatorID": 1,
    "UsageTypeID": 1,
    "UsageCost": "$0",
    "AddressInfo": {
        "ID": 189784,
        "Title": "BBB Industries",
        "AddressLine1": "15120 Commerce Drive North",
        "Town": "Dearborn",
        "StateOrProvince": "MI",
        "Postcode": "48120",
        "CountryID": 2,
        "Latitude": 42.31232435098653,
        "Longitude": -83.18548473611588,
        "ContactTelephone1": "313.216.2640",
        "AccessComments": "On North Corner of Building",
        "RelatedURL": "http://www.bbbind.com",
        "DistanceUnit": 0
    },
    "Connections": [
        {
            "ID": 306367,
            "ConnectionTypeID": 32,
            "StatusTypeID": 50,
            "LevelID": 3,
            "PowerKW": 60,
            "CurrentTypeID": 30,
            "Quantity": 2
        }
    ],
    "NumberOfPoints": 2,
    "StatusTypeID": 50,
    "DateLastStatusUpdate": "2021-09-28T19:12:00Z",
    "DataQualityLevel": 1,
    "DateCreated": "2021-09-28T00:38:00Z",
    "SubmissionStatusTypeID": 200
}