{
    "IsRecentlyVerified": false,
    "ID": 159616,
    "UUID": "02BC2A0B-D240-43D8-8E70-D74E877F0EAF",
    "DataProviderID": 2,
    "DataProvidersReference": "153342",
    "OperatorID": 59,
    "UsageTypeID": 1,
    "AddressInfo": {
        "ID": 159973,
        "Title": "Greenlots - 182155",
        "AddressLine1": "3801 Walnut St",
        "Town": "Harrisburg",
        "StateOrProvince": "PA",
        "Postcode": "17109",
        "CountryID": 2,
        "Latitude": 40.290692,
        "Longitude": -76.833031,
        "ContactTelephone1": "855-900-7584",
        "AccessComments": "24 hours daily",
        "RelatedURL": "http://greenlots.com/",
        "DistanceUnit": 0
    },
    "Connections": [
        {
            "ID": 229816,
            "ConnectionTypeID": 1,
            "LevelID": 2,
            "Amps": 16,
            "Voltage": 230,
            "PowerKW": 3.7,
            "CurrentTypeID": 10,
            "Quantity": 2
        }
    ],
    "StatusTypeID": 50,
    "DateLastStatusUpdate": "2020-06-26T03:02:00Z",
    "DataQualityLevel": 3,
    "DateCreated": "2020-06-26T03:02:00Z",
    "SubmissionStatusTypeID": 100
}