{
    "IsRecentlyVerified": false,
    "ID": 45733,
    "UUID": "E6DF7FD2-3BA4-488C-9C69-B4CD376FE3FB",
    "DataProviderID": 1,
    "DataProvidersReference": "244",
    "AddressInfo": {
        "ID": 46079,
        "Title": "AMFI Eikunda, Egersund",
        "AddressLine1": "Fabrikkgaten 2",
        "Town": "EGERSUND",
        "StateOrProvince": "Rogaland",
        "Postcode": "4370",
        "CountryID": 168,
        "Latitude": 58.45433,
        "Longitude": 6.0032,
        "AccessComments": "Ladepunktene er installert i 1.etasje i parkeringshuset på AMFI Eikunda med innkjøring fra Jernbaneveien.",
        "DistanceUnit": 0
    },
    "Connections": [
        {
            "ID": 56396,
            "ConnectionTypeID": 0,
            "Reference": "1",
            "LevelID": 2,
            "Amps": 16,
            "Voltage": 230,
            "PowerKW": 3.7,
            "Comments": "Mode 1"
        },
        {
            "ID": 87975,
            "ConnectionTypeID": 0,
            "Reference": "2",
            "LevelID": 2,
            "Amps": 16,
            "Voltage": 230,
            "PowerKW": 3.7,
            "Comments": "Mode 1"
        }
    ],
    "NumberOfPoints": 2,
    "DateLastStatusUpdate": "2020-05-26T08:22:00Z",
    "DataQualityLevel": 2,
    "DateCreated": "2015-05-03T00:54:00Z",
    "SubmissionStatusTypeID": 100
}