{
    "IsRecentlyVerified": false,
    "ID": 71458,
    "UUID": "2B57697F-1480-4E53-957A-C9CB6C7EB800",
    "DataProviderID": 2,
    "DataProvidersReference": "77184",
    "UsageTypeID": 1,
    "AddressInfo": {
        "ID": 71804,
        "Title": "City of Takoma Park - Junction Parking Lot",
        "AddressLine1": "7309 Carroll Ave",
        "Town": "Takoma Park",
        "StateOrProvince": "MD",
        "Postcode": "20912",
        "CountryID": 2,
        "Latitude": 38.978277,
        "Longitude": -77.005876,
        "ContactTelephone1": "410-685-1109",
        "AccessComments": "24 hours daily",
        "RelatedURL": "",
        "DistanceUnit": 0
    },
    "Connections": [
        {
            "ID": 102278,
            "ConnectionTypeID": 1,
            "LevelID": 2,
            "Amps": 16,
            "Voltage": 230,
            "PowerKW": 3.7,
            "CurrentTypeID": 10,
            "Quantity": 4
        }
    ],
    "DateLastStatusUpdate": "2020-06-26T03:01:00Z",
    "DataQualityLevel": 3,
    "DateCreated": "2016-09-02T10:15:00Z",
    "SubmissionStatusTypeID": 100
}