{
    "IsRecentlyVerified": false,
    "ID": 176738,
    "UUID": "1CEE7D96-BD6E-4F1E-B594-BFCDEE6344B5",
    "DataProviderID": 29,
    "DataProvidersReference": "2371",
    "OperatorID": 45,
    "AddressInfo": {
        "ID": 177097,
        "Title": "Chiemseestraße 37",
        "AddressLine1": "Chiemseestraße 37",
        "Town": "Rosenheim",
        "Postcode": "83022",
        "CountryID": 87,
        "Latitude": 47.85028,
        "Longitude": 12.13702,
        "DistanceUnit": 0
    },
    "Connections": [
        {
            "ID": 274997,
            "ConnectionTypeID": 25,
            "StatusTypeID": 50,
            "LevelID": 2,
            "PowerKW": 22,
            "CurrentTypeID": 20
        },
        {
            "ID": 274998,
            "ConnectionTypeID": 25,
            "StatusTypeID": 50,
            "LevelID": 2,
            "PowerKW": 22,
            "CurrentTypeID": 20
        }
    ],
    "StatusTypeID": 0,
    "DateLastStatusUpdate": "2021-07-09T03:10:00Z",
    "MetadataValues": [
        {
            "ID": 9033,
            "MetadataFieldID": 4,
            "ItemValue": "Data from the German chargepoint registry provided by Bundesnetzagentur.de under the CC-BY 4.0 license"
        }
    ],
    "DataQualityLevel": 3,
    "DateCreated": "2021-07-08T09:48:00Z",
    "SubmissionStatusTypeID": 100
}