{
    "IsRecentlyVerified": false,
    "ID": 173363,
    "UUID": "2B8B2D4D-26AA-4E64-8C9C-3D3054692F80",
    "DataProviderID": 18,
    "DataProvidersReference": "35edba6d5151bf9073ab488a80938117",
    "OperatorID": 2244,
    "UsageTypeID": 1,
    "AddressInfo": {
        "ID": 173722,
        "Title": "61 Compayne Gardens",
        "AddressLine1": "61 Compayne Gardens",
        "Town": "London",
        "Postcode": "NW6 3DB",
        "CountryID": 1,
        "Latitude": -0.18773,
        "Longitude": 51.545118,
        "AccessComments": "",
        "RelatedURL": "https://www.ubitricity.com",
        "DistanceUnit": 0
    },
    "Connections": [
        {
            "ID": 266388,
            "ConnectionTypeID": 25,
            "Reference": "suby1100005299",
            "StatusTypeID": 50,
            "LevelID": 2,
            "Amps": 16,
            "Voltage": 230,
            "PowerKW": 3.7,
            "CurrentTypeID": 10
        }
    ],
    "StatusTypeID": 0,
    "DateLastStatusUpdate": "2021-07-12T03:38:00Z",
    "MetadataValues": [
        {
            "ID": 8285,
            "MetadataFieldID": 4,
            "ItemValue": "Contains public sector information licensed under the Open Government Licence v2.0. http://www.nationalarchives.gov.uk/doc/open-government-licence/version/2/"
        }
    ],
    "DataQualityLevel": 3,
    "DateCreated": "2021-03-03T11:24:00Z",
    "SubmissionStatusTypeID": 100
}