{
    "IsRecentlyVerified": false,
    "ID": 139987,
    "UUID": "6E30106B-FAF5-4FC1-B4E9-C5A5EB1B30FE",
    "DataProviderID": 2,
    "DataProvidersReference": "93111",
    "OperatorID": 15,
    "UsageTypeID": 4,
    "AddressInfo": {
        "ID": 140339,
        "Title": "Camarillo Premium Outlets",
        "AddressLine1": "990 Camarillo Center Dr",
        "Town": "Camarillo",
        "StateOrProvince": "CA",
        "Postcode": "93010",
        "CountryID": 2,
        "Latitude": 34.21604,
        "Longitude": -119.05777,
        "ContactTelephone1": "877-455-3833",
        "AccessComments": "24 hours daily\r\nPublic - Card key at all times",
        "RelatedURL": "https://www.evgo.com/",
        "DistanceUnit": 0
    },
    "Connections": [
        {
            "ID": 195499,
            "ConnectionTypeID": 1,
            "LevelID": 2,
            "Amps": 16,
            "Voltage": 230,
            "PowerKW": 3.7,
            "CurrentTypeID": 10,
            "Quantity": 3
        }
    ],
    "StatusTypeID": 50,
    "DateLastStatusUpdate": "2020-06-26T02:57:00Z",
    "DataQualityLevel": 3,
    "DateCreated": "2019-12-24T09:11:00Z",
    "SubmissionStatusTypeID": 100
}