{
    "UserComments": [
        {
            "ID": 17694,
            "ChargePointID": 92392,
            "CommentTypeID": 10,
            "UserName": "symCharge",
            "Comment": "Rund um die Uhr frei zugänglich. Mit bis zu 22kW laden, perfekt. Wer Lust hat kann gleich noch im Hessen-Center shoppen gehen oder mal kurz was zu essen holen.",
            "Rating": 5,
            "DateCreated": "2017-09-11T09:47:01.057Z",
            "User": {
                "ID": 16088,
                "Username": "symCharge"
            },
            "CheckinStatusTypeID": 10
        }
    ],
    "MediaItems": [
        {
            "ID": 13299,
            "ChargePointID": 92392,
            "ItemURL": "https://s3-ap-southeast-2.amazonaws.com/openchargemap/images/DE/OCM92392/OCM-92392.orig.2017091109441921.jpg",
            "ItemThumbnailURL": "https://s3-ap-southeast-2.amazonaws.com/openchargemap/images/DE/OCM92392/OCM-92392.thmb.2017091109441921.jpg",
            "Comment": "Nutzbar mit NewMotion Card und allen Roaming Partnern.",
            "IsEnabled": true,
            "IsVideo": false,
            "IsFeaturedItem": false,
            "IsExternalResource": false,
            "User": {
                "ID": 16088,
                "Username": "symCharge"
            },
            "DateCreated": "2017-09-11T09:45:00Z"
        },
        {
            "ID": 13298,
            "ChargePointID": 92392,
            "ItemURL": "https://s3-ap-southeast-2.amazonaws.com/openchargemap/images/DE/OCM92392/OCM-92392.orig.2017091109432247.jpg",
            "ItemThumbnailURL": "https://s3-ap-southeast-2.amazonaws.com/openchargemap/images/DE/OCM92392/OCM-92392.thmb.2017091109432247.jpg",
            "Comment": "Nutzbar mit NewMotion Card und allen Roaming Partnern.",
            "IsEnabled": true,
            "IsVideo": false,
            "IsFeaturedItem": false,
            "IsExternalResource": false,
            "User": {
                "ID": 16088,
                "Username": "symCharge"
            },
            "DateCreated": "2017-09-11T09:44:00Z"
        },
        {
            "ID": 13297,
            "ChargePointID": 92392,
            "ItemURL": "https://s3-ap-southeast-2.amazonaws.com/openchargemap/images/DE/OCM92392/OCM-92392.orig.2017091109411886.jpg",
            "ItemThumbnailURL": "https://s3-ap-southeast-2.amazonaws.com/openchargemap/images/DE/OCM92392/OCM-92392.thmb.2017091109411886.jpg",
            "Comment": "An der Ostseite des Hessen-Centers, frei zugänglich.",
            "IsEnabled": true,
            "IsVideo": false,
            "IsFeaturedItem": false,
            "IsExternalResource": false,
            "User": {
                "ID": 16088,
                "Username": "symCharge"
            },
            "DateCreated": "2017-09-11T09:42:00Z"
        },
        {
            "ID": 13296,
            "ChargePointID": 92392,
            "ItemURL": "https://s3-ap-southeast-2.amazonaws.com/openchargemap/images/DE/OCM92392/OCM-92392.orig.2017091109402760.jpg",
            "ItemThumbnailURL": "https://s3-ap-southeast-2.amazonaws.com/openchargemap/images/DE/OCM92392/OCM-92392.thmb.2017091109402760.jpg",
            "Comment": "An der Ostseite des Hessen-Centers, frei zugänglich.",
            "IsEnabled": true,
            "IsVideo": false,
            "IsFeaturedItem": false,
            "IsExternalResource": false,
            "User": {
                "ID": 16088,
                "Username": "symCharge"
            },
            "DateCreated": "2017-09-11T09:41:00Z"
        }
    ],
    "IsRecentlyVerified": false,
    "ID": 92392,
    "UUID": "584987A4-9436-4CAD-AA88-09DF5E5088AD",
    "DataProviderID": 1,
    "OperatorID": 156,
    "UsageTypeID": 4,
    "UsageCost": "",
    "AddressInfo": {
        "ID": 92738,
        "Title": "Hessen Center",
        "AddressLine1": "Borsigallee 26",
        "AddressLine2": "",
        "Town": "Frankfurt am Main",
        "StateOrProvince": "Frankfurt am Main",
        "Postcode": "60388",
        "CountryID": 87,
        "Latitude": 50.14120736592908,
        "Longitude": 8.75361442565918,
        "ContactTelephone1": "",
        "ContactTelephone2": "",
        "ContactEmail": "",
        "AccessComments": "3 durchgehend nutzbare New Motion lolo Wallboxen unter dem roten Schild \"Rewe Center\" mit 3 Parkplätzen davor. Wand ist grün markiert mit \"SC Sym Charge\".",
        "RelatedURL": "",
        "DistanceUnit": 0
    },
    "Connections": [
        {
            "ID": 130962,
            "ConnectionTypeID": 25,
            "StatusTypeID": 50,
            "LevelID": 2,
            "Amps": 32,
            "Voltage": 400,
            "PowerKW": 22,
            "CurrentTypeID": 20,
            "Quantity": 3
        }
    ],
    "NumberOfPoints": 3,
    "GeneralComments": "",
    "StatusTypeID": 50,
    "DateLastStatusUpdate": "2017-09-12T17:52:00Z",
    "DataQualityLevel": 1,
    "DateCreated": "2017-09-04T06:42:00Z",
    "SubmissionStatusTypeID": 200
}