{
    "IsRecentlyVerified": false,
    "ID": 179257,
    "UUID": "B2B1AAE4-9459-435D-8359-3FA598C54A91",
    "DataProviderID": 29,
    "DataProvidersReference": "14932",
    "AddressInfo": {
        "ID": 179616,
        "Title": "Karl-Schneider-Straße 2",
        "AddressLine1": "Karl-Schneider-Straße 2",
        "Town": "Gladbeck",
        "Postcode": "45966",
        "CountryID": 87,
        "Latitude": 51.5733,
        "Longitude": 6.9714,
        "DistanceUnit": 0
    },
    "Connections": [
        {
            "ID": 280813,
            "ConnectionTypeID": 1036,
            "StatusTypeID": 50,
            "LevelID": 2,
            "PowerKW": 22,
            "CurrentTypeID": 20
        },
        {
            "ID": 280814,
            "ConnectionTypeID": 1036,
            "StatusTypeID": 50,
            "LevelID": 2,
            "PowerKW": 22,
            "CurrentTypeID": 20
        }
    ],
    "StatusTypeID": 50,
    "DateLastStatusUpdate": "2021-07-12T02:48:00Z",
    "MetadataValues": [
        {
            "ID": 11551,
            "MetadataFieldID": 4,
            "ItemValue": "Data from the German chargepoint registry provided by Bundesnetzagentur.de under the CC-BY 4.0 license"
        }
    ],
    "DataQualityLevel": 3,
    "DateCreated": "2021-07-08T09:59:00Z",
    "SubmissionStatusTypeID": 100
}