{
    "IsRecentlyVerified": false,
    "ID": 85651,
    "UUID": "C835A644-A0C7-4EAE-863C-FF4576355707",
    "DataProviderID": 1,
    "OperatorID": 23,
    "OperatorsReference": "26345",
    "UsageTypeID": 6,
    "AddressInfo": {
        "ID": 85997,
        "Title": "The Grey Swan Inn Bed and Breakfast",
        "AddressLine1": "615 S Main St",
        "Town": "Blackstone",
        "StateOrProvince": "Virginia",
        "Postcode": "23824",
        "CountryID": 2,
        "Latitude": 37.0739031,
        "Longitude": -78.000788,
        "ContactTelephone1": "(434) 292-3199",
        "DistanceUnit": 0
    },
    "Connections": [
        {
            "ID": 121769,
            "ConnectionTypeID": 30,
            "StatusTypeID": 50,
            "LevelID": 2,
            "PowerKW": 8,
            "CurrentTypeID": 10,
            "Quantity": 1
        }
    ],
    "NumberOfPoints": 1,
    "GeneralComments": "1 Tesla Connector, up to 8kW.Available for patrons only. Please see front desk.",
    "StatusTypeID": 50,
    "DateLastStatusUpdate": "2017-07-13T15:15:00Z",
    "DataQualityLevel": 1,
    "DateCreated": "2017-04-10T05:39:00Z",
    "SubmissionStatusTypeID": 200
}