{
    "IsRecentlyVerified": false,
    "ID": 125848,
    "UUID": "0B492293-5B02-41A2-8926-8E8BED89FB52",
    "DataProviderID": 1,
    "OperatorID": 32,
    "OperatorsReference": "10766,10767",
    "UsageTypeID": 4,
    "UsageCost": "£0.108/kWh; for Polar Plus subscription members only",
    "AddressInfo": {
        "ID": 126194,
        "Title": "Milton Keynes Village Practice",
        "AddressLine1": "Milton Keynes Village Practice",
        "Town": "Griffith Gate",
        "StateOrProvince": "Milton Keynes",
        "Postcode": "MK10 9BQ",
        "CountryID": 1,
        "Latitude": 52.043571,
        "Longitude": -0.698054,
        "DistanceUnit": 0
    },
    "Connections": [
        {
            "ID": 176366,
            "ConnectionTypeID": 25,
            "StatusTypeID": 50,
            "LevelID": 2,
            "Amps": 32,
            "Voltage": 230,
            "PowerKW": 7,
            "CurrentTypeID": 10,
            "Quantity": 4
        }
    ],
    "NumberOfPoints": 4,
    "GeneralComments": "The unit is located in the car park at the back of the building.",
    "StatusTypeID": 50,
    "DateLastStatusUpdate": "2019-05-01T08:26:00Z",
    "DataQualityLevel": 1,
    "DateCreated": "2019-05-01T05:13:00Z",
    "SubmissionStatusTypeID": 200
}