{
    "IsRecentlyVerified": false,
    "ID": 73910,
    "UUID": "150EFF4E-A825-4909-BCEC-F33F3D66D735",
    "DataProviderID": 1,
    "OperatorID": 89,
    "OperatorsReference": "CEA-10315",
    "UsageTypeID": 4,
    "UsageCost": "CAD 1.00/hour",
    "AddressInfo": {
        "ID": 74256,
        "Title": "Westmount-Centre des Loisirs",
        "AddressLine1": "4675 Rue Sainte-Catherine",
        "Town": "Westmount",
        "StateOrProvince": "QC",
        "Postcode": "H3Z 1S4",
        "CountryID": 44,
        "Latitude": 45.47958,
        "Longitude": -73.59653,
        "DistanceUnit": 0
    },
    "Connections": [
        {
            "ID": 106222,
            "ConnectionTypeID": 1,
            "StatusTypeID": 50,
            "LevelID": 2,
            "Amps": 32,
            "Voltage": 230,
            "PowerKW": 7,
            "CurrentTypeID": 10,
            "Quantity": 1
        }
    ],
    "NumberOfPoints": 1,
    "StatusTypeID": 50,
    "DateLastStatusUpdate": "2017-01-22T19:33:00Z",
    "DataQualityLevel": 1,
    "DateCreated": "2016-11-23T23:33:00Z",
    "SubmissionStatusTypeID": 200
}