{
    "UserComments": [
        {
            "ID": 22815,
            "ChargePointID": 157662,
            "CommentTypeID": 10,
            "UserName": "ForumElettrico.it",
            "Comment": "Tutto in mezzo al verde ed in particolare ai vigneti e quindi si sposa bene con l'auto elettrica. Leggi la recensione completa qui > https://www.forumelettrico.it/forum/colonnina-emobitaly-11-kw-agriturismo-verdenoce-albinea-re-via-venturi-9-t11071.html",
            "RelatedURL": "https://www.forumelettrico.it/forum/colonnina-emobitaly-11-kw-agriturismo-verdenoce-albinea-re-via-venturi-9-t11071.html",
            "DateCreated": "2020-06-23T15:47:03.41Z",
            "User": {
                "ID": 11749,
                "Username": "ForumElettrico.it"
            },
            "CheckinStatusTypeID": 10,
            "IsActionedByEditor": false
        }
    ],
    "MediaItems": [
        {
            "ID": 22783,
            "ChargePointID": 157662,
            "ItemURL": "https://s3-ap-southeast-2.amazonaws.com/openchargemap/images/IT/OCM157662/OCM-157662.orig.2020062315473450.jpg",
            "ItemThumbnailURL": "https://s3-ap-southeast-2.amazonaws.com/openchargemap/images/IT/OCM157662/OCM-157662.thmb.2020062315473450.jpg",
            "Comment": "",
            "IsEnabled": true,
            "IsVideo": false,
            "IsFeaturedItem": false,
            "IsExternalResource": false,
            "User": {
                "ID": 11749,
                "Username": "ForumElettrico.it"
            },
            "DateCreated": "2020-06-23T15:48:00Z"
        },
        {
            "ID": 22784,
            "ChargePointID": 157662,
            "ItemURL": "https://s3-ap-southeast-2.amazonaws.com/openchargemap/images/IT/OCM157662/OCM-157662.orig.2020062315474166.jpg",
            "ItemThumbnailURL": "https://s3-ap-southeast-2.amazonaws.com/openchargemap/images/IT/OCM157662/OCM-157662.thmb.2020062315474166.jpg",
            "Comment": "",
            "IsEnabled": true,
            "IsVideo": false,
            "IsFeaturedItem": false,
            "IsExternalResource": false,
            "User": {
                "ID": 11749,
                "Username": "ForumElettrico.it"
            },
            "DateCreated": "2020-06-23T15:48:00Z"
        },
        {
            "ID": 22780,
            "ChargePointID": 157662,
            "ItemURL": "https://s3-ap-southeast-2.amazonaws.com/openchargemap/images/IT/OCM157662/OCM-157662.orig.2020062315471505.jpg",
            "ItemThumbnailURL": "https://s3-ap-southeast-2.amazonaws.com/openchargemap/images/IT/OCM157662/OCM-157662.thmb.2020062315471505.jpg",
            "Comment": "",
            "IsEnabled": true,
            "IsVideo": false,
            "IsFeaturedItem": false,
            "IsExternalResource": false,
            "User": {
                "ID": 11749,
                "Username": "ForumElettrico.it"
            },
            "DateCreated": "2020-06-23T15:47:00Z"
        },
        {
            "ID": 22781,
            "ChargePointID": 157662,
            "ItemURL": "https://s3-ap-southeast-2.amazonaws.com/openchargemap/images/IT/OCM157662/OCM-157662.orig.2020062315472169.jpg",
            "ItemThumbnailURL": "https://s3-ap-southeast-2.amazonaws.com/openchargemap/images/IT/OCM157662/OCM-157662.thmb.2020062315472169.jpg",
            "Comment": "",
            "IsEnabled": true,
            "IsVideo": false,
            "IsFeaturedItem": false,
            "IsExternalResource": false,
            "User": {
                "ID": 11749,
                "Username": "ForumElettrico.it"
            },
            "DateCreated": "2020-06-23T15:47:00Z"
        },
        {
            "ID": 22782,
            "ChargePointID": 157662,
            "ItemURL": "https://s3-ap-southeast-2.amazonaws.com/openchargemap/images/IT/OCM157662/OCM-157662.orig.2020062315472788.jpg",
            "ItemThumbnailURL": "https://s3-ap-southeast-2.amazonaws.com/openchargemap/images/IT/OCM157662/OCM-157662.thmb.2020062315472788.jpg",
            "Comment": "",
            "IsEnabled": true,
            "IsVideo": false,
            "IsFeaturedItem": false,
            "IsExternalResource": false,
            "User": {
                "ID": 11749,
                "Username": "ForumElettrico.it"
            },
            "DateCreated": "2020-06-23T15:47:00Z"
        }
    ],
    "IsRecentlyVerified": false,
    "ID": 157662,
    "UUID": "B7BC77F3-CEB2-449D-8C1F-4A6F36170B6D",
    "DataProviderID": 1,
    "OperatorID": 3282,
    "UsageTypeID": 6,
    "AddressInfo": {
        "ID": 158016,
        "Title": "Emobitaly Agriturismo Verdenoce",
        "AddressLine1": "Via Venturi 9",
        "Town": "Albinea",
        "StateOrProvince": "RE",
        "CountryID": 112,
        "Latitude": 44.624042,
        "Longitude": 10.647322,
        "RelatedURL": "https://www.forumelettrico.it/forum/colonnina-emobitaly-11-kw-agriturismo-verdenoce-albinea-re-via-venturi-9-t11071.html",
        "DistanceUnit": 0
    },
    "Connections": [
        {
            "ID": 227173,
            "ConnectionTypeID": 25,
            "LevelID": 2,
            "PowerKW": 11
        }
    ],
    "NumberOfPoints": 1,
    "StatusTypeID": 50,
    "DateLastStatusUpdate": "2020-06-23T15:48:00Z",
    "DataQualityLevel": 1,
    "DateCreated": "2020-06-23T15:41:00Z",
    "SubmissionStatusTypeID": 200
}