{
    "IsRecentlyVerified": false,
    "ID": 96697,
    "UUID": "C70607FD-7167-43EE-A0C6-F9C474EAF51A",
    "DataProviderID": 2,
    "DataProvidersReference": "88089",
    "OperatorID": 5,
    "UsageTypeID": 1,
    "AddressInfo": {
        "ID": 97043,
        "Title": "MONMOUTH UNIV",
        "AddressLine1": "98 Larchwood Ave",
        "Town": "West Long Branch",
        "StateOrProvince": "NJ",
        "Postcode": "07764",
        "CountryID": 2,
        "Latitude": 40.2804855,
        "Longitude": -74.0087685,
        "ContactTelephone1": "888-758-4389",
        "AccessComments": "24 hours daily",
        "RelatedURL": "http://www.chargepoint.com/",
        "DistanceUnit": 0
    },
    "Connections": [
        {
            "ID": 136970,
            "ConnectionTypeID": 9,
            "LevelID": 1,
            "Amps": 16,
            "Voltage": 120,
            "PowerKW": 1.9,
            "CurrentTypeID": 10,
            "Quantity": 1
        },
        {
            "ID": 136971,
            "ConnectionTypeID": 1,
            "LevelID": 2,
            "Amps": 16,
            "Voltage": 230,
            "PowerKW": 3.7,
            "CurrentTypeID": 10,
            "Quantity": 1
        }
    ],
    "DateLastStatusUpdate": "2020-06-26T03:02:00Z",
    "DataQualityLevel": 3,
    "DateCreated": "2017-12-29T21:01:00Z",
    "SubmissionStatusTypeID": 100
}