{
    "IsRecentlyVerified": false,
    "ID": 93375,
    "UUID": "5E59CC7D-5B92-48BA-A669-1A6777B2E482",
    "DataProviderID": 1,
    "OperatorID": 23,
    "OperatorsReference": "35794",
    "UsageTypeID": 6,
    "AddressInfo": {
        "ID": 93721,
        "Title": "Saint James Paris",
        "AddressLine1": "43 Avenue Bugeaud",
        "Town": "Paris",
        "Postcode": "75116",
        "CountryID": 80,
        "Latitude": 48.870909,
        "Longitude": 2.279195,
        "ContactTelephone1": "+33 1 44 05 81 81",
        "DistanceUnit": 0
    },
    "Connections": [
        {
            "ID": 132252,
            "ConnectionTypeID": 30,
            "StatusTypeID": 50,
            "LevelID": 2,
            "Amps": 16,
            "Voltage": 400,
            "PowerKW": 11,
            "CurrentTypeID": 20,
            "Quantity": 1
        }
    ],
    "NumberOfPoints": 1,
    "GeneralComments": "1 Tesla Connector, up to 11kW.Available for patrons only. Please see valet.",
    "StatusTypeID": 50,
    "DateLastStatusUpdate": "2018-10-03T20:29:00Z",
    "DataQualityLevel": 1,
    "DateCreated": "2017-09-27T19:23:00Z",
    "SubmissionStatusTypeID": 200
}