{
    "IsRecentlyVerified": false,
    "ID": 35806,
    "UUID": "A48C6E92-6D12-4992-B591-493B3E477A60",
    "DataProviderID": 26,
    "DataProvidersReference": "48535",
    "OperatorID": 178,
    "OperatorsReference": "EVnetNL REE097",
    "UsageCost": "0.00 jaarabonnement",
    "AddressInfo": {
        "ID": 36152,
        "Title": "Westerkade 4",
        "AddressLine1": "Westerkade 4",
        "Town": "Utrecht",
        "Postcode": "3511 HA",
        "CountryID": 159,
        "Latitude": 52.080699,
        "Longitude": 5.123515,
        "ContactTelephone1": "0800-3522365",
        "RelatedURL": "http://www.evnet.nl",
        "DistanceUnit": 0
    },
    "Connections": [
        {
            "ID": 39317,
            "ConnectionTypeID": 25,
            "LevelID": 1,
            "PowerKW": 2.3,
            "CurrentTypeID": 10
        }
    ],
    "NumberOfPoints": 2,
    "StatusTypeID": 50,
    "DateLastStatusUpdate": "2016-06-04T02:49:00Z",
    "DataQualityLevel": 3,
    "DateCreated": "2015-01-09T06:05:00Z",
    "SubmissionStatusTypeID": 100
}