{
    "IsRecentlyVerified": false,
    "ID": 45936,
    "UUID": "F47DE6AB-FE05-461F-98F4-681ED7A8E34A",
    "DataProviderID": 1,
    "DataProvidersReference": "2437",
    "AddressInfo": {
        "ID": 46282,
        "Title": "Vattenfall InCharge Snabbladdning",
        "AddressLine1": "Ulvsundavägen 160",
        "Town": "BROMMA",
        "StateOrProvince": "STOCKHOLM",
        "Postcode": "16867",
        "CountryID": 216,
        "Latitude": 59.35327,
        "Longitude": 17.95832,
        "AccessComments": "På Max hamburgerrestaurangs parkeringsplats.",
        "DistanceUnit": 0
    },
    "Connections": [
        {
            "ID": 56599,
            "ConnectionTypeID": 0,
            "Reference": "1",
            "LevelID": 2,
            "Amps": 100,
            "Voltage": 500,
            "PowerKW": 50,
            "Comments": "Mode 4"
        },
        {
            "ID": 84691,
            "ConnectionTypeID": 0,
            "Reference": "2",
            "LevelID": 2,
            "Amps": 100,
            "Voltage": 500,
            "PowerKW": 50,
            "Comments": "Mode 4"
        },
        {
            "ID": 88238,
            "ConnectionTypeID": 0,
            "Reference": "3",
            "LevelID": 2,
            "Amps": 63,
            "Voltage": 400,
            "PowerKW": 43,
            "Comments": "Mode 3"
        }
    ],
    "NumberOfPoints": 3,
    "DateLastStatusUpdate": "2020-05-26T08:22:00Z",
    "DataQualityLevel": 2,
    "DateCreated": "2015-05-03T00:54:00Z",
    "SubmissionStatusTypeID": 100
}