{
    "IsRecentlyVerified": false,
    "ID": 16843,
    "UUID": "3D39D225-4456-4880-9748-1F2D14CEF91B",
    "DataProviderID": 2,
    "DataProvidersReference": "52071",
    "UsageTypeID": 7,
    "AddressInfo": {
        "ID": 17188,
        "Title": "Vogler Motor Co",
        "AddressLine1": "1170 E Main St",
        "Town": "Carbondale",
        "StateOrProvince": "IL",
        "Postcode": "62901",
        "CountryID": 2,
        "Latitude": 37.730396,
        "Longitude": -89.19403,
        "ContactTelephone1": "618-457-8135",
        "AccessComments": "Dealership business hours; contact in advance",
        "RelatedURL": "",
        "DistanceUnit": 0
    },
    "Connections": [
        {
            "ID": 17080,
            "ConnectionTypeID": 1,
            "LevelID": 2,
            "Amps": 16,
            "Voltage": 230,
            "PowerKW": 3,
            "CurrentTypeID": 10,
            "Quantity": 1
        },
        {
            "ID": 22261,
            "ConnectionTypeID": 1,
            "LevelID": 2,
            "Quantity": 1
        }
    ],
    "DateLastStatusUpdate": "2019-04-06T04:02:00Z",
    "DataQualityLevel": 3,
    "DateCreated": "2013-06-27T03:48:00Z",
    "SubmissionStatusTypeID": 200
}