{
    "IsRecentlyVerified": false,
    "ID": 50779,
    "UUID": "5E3C3516-DAC1-41D9-9EE5-B073049A2F04",
    "DataProviderID": 26,
    "DataProvidersReference": "65900",
    "OperatorID": 179,
    "OperatorsReference": "Ecotap 1601122",
    "UsageCost": "0.00 afhankelijk van pas",
    "AddressInfo": {
        "ID": 51125,
        "Title": "Rijndwarsweg 6",
        "AddressLine1": "Rijndwarsweg 6",
        "Town": "Rotterdam",
        "Postcode": "3198 LK",
        "CountryID": 159,
        "Latitude": 51.948612,
        "Longitude": 4.14841,
        "RelatedURL": "http://www.ecotap.nl",
        "DistanceUnit": 0
    },
    "Connections": [
        {
            "ID": 62649,
            "ConnectionTypeID": 25,
            "LevelID": 2,
            "PowerKW": 11,
            "CurrentTypeID": 10
        }
    ],
    "NumberOfPoints": 2,
    "StatusTypeID": 50,
    "DateLastStatusUpdate": "2016-06-04T02:43:00Z",
    "DataQualityLevel": 3,
    "DateCreated": "2015-07-22T09:53:00Z",
    "SubmissionStatusTypeID": 100
}