{
    "IsRecentlyVerified": false,
    "ID": 178368,
    "UUID": "7BA28056-7A6A-4928-BD8C-C3AE4FAEFFCF",
    "DataProviderID": 29,
    "DataProvidersReference": "14772",
    "OperatorID": 86,
    "AddressInfo": {
        "ID": 178727,
        "Title": "Esslinger Straße 26",
        "AddressLine1": "Esslinger Straße 26",
        "Town": "Ostfildern",
        "Postcode": "73760",
        "CountryID": 87,
        "Latitude": 48.714672,
        "Longitude": 9.300899,
        "DistanceUnit": 0
    },
    "Connections": [
        {
            "ID": 278685,
            "ConnectionTypeID": 28,
            "StatusTypeID": 50,
            "LevelID": 2,
            "PowerKW": 22,
            "CurrentTypeID": 10
        },
        {
            "ID": 278686,
            "ConnectionTypeID": 28,
            "StatusTypeID": 50,
            "LevelID": 2,
            "PowerKW": 22,
            "CurrentTypeID": 10
        }
    ],
    "StatusTypeID": 0,
    "DateLastStatusUpdate": "2021-07-09T03:13:00Z",
    "MetadataValues": [
        {
            "ID": 10662,
            "MetadataFieldID": 4,
            "ItemValue": "Data from the German chargepoint registry provided by Bundesnetzagentur.de under the CC-BY 4.0 license"
        }
    ],
    "DataQualityLevel": 3,
    "DateCreated": "2021-07-08T09:50:00Z",
    "SubmissionStatusTypeID": 100
}