{
    "IsRecentlyVerified": false,
    "ID": 182323,
    "UUID": "AF861BC2-87BD-46E6-B90B-05A7FA2ED56B",
    "DataProviderID": 29,
    "DataProvidersReference": "82",
    "AddressInfo": {
        "ID": 182682,
        "Title": "Sommerauer Str. 5",
        "AddressLine1": "Sommerauer Str. 5",
        "Town": "St. Georgen",
        "Postcode": "78112",
        "CountryID": 87,
        "Latitude": 48.1255,
        "Longitude": 8.326627,
        "DistanceUnit": 0
    },
    "Connections": [
        {
            "ID": 287920,
            "ConnectionTypeID": 25,
            "StatusTypeID": 50,
            "LevelID": 2,
            "PowerKW": 22,
            "CurrentTypeID": 20
        },
        {
            "ID": 287921,
            "ConnectionTypeID": 25,
            "StatusTypeID": 50,
            "LevelID": 2,
            "PowerKW": 22,
            "CurrentTypeID": 20
        }
    ],
    "StatusTypeID": 50,
    "DateLastStatusUpdate": "2021-07-12T02:40:00Z",
    "MetadataValues": [
        {
            "ID": 14617,
            "MetadataFieldID": 4,
            "ItemValue": "Data from the German chargepoint registry provided by Bundesnetzagentur.de under the CC-BY 4.0 license"
        }
    ],
    "DataQualityLevel": 3,
    "DateCreated": "2021-07-08T10:02:00Z",
    "SubmissionStatusTypeID": 100
}