{
    "IsRecentlyVerified": false,
    "ID": 152107,
    "UUID": "281DBAB7-1274-43DE-B054-B0CA370B4145",
    "DataProviderID": 28,
    "DataProvidersReference": "FR*S86*PSORE*B047",
    "UsageTypeID": 5,
    "AddressInfo": {
        "ID": 152460,
        "Title": "B047",
        "AddressLine1": "Place de la Liberte - 86290 - La Trimouille",
        "CountryID": 80,
        "Latitude": 46.46695,
        "Longitude": 1.04278,
        "AccessComments": "24/24 7/7 jours",
        "DistanceUnit": 0
    },
    "Connections": [
        {
            "ID": 212793,
            "ConnectionTypeID": 28,
            "StatusTypeID": 50,
            "LevelID": 2,
            "PowerKW": 18,
            "CurrentTypeID": 10
        },
        {
            "ID": 212794,
            "ConnectionTypeID": 25,
            "StatusTypeID": 50,
            "LevelID": 2,
            "PowerKW": 18,
            "CurrentTypeID": 20
        },
        {
            "ID": 245650,
            "ConnectionTypeID": 28,
            "StatusTypeID": 50,
            "LevelID": 2,
            "PowerKW": 18,
            "CurrentTypeID": 10
        },
        {
            "ID": 245651,
            "ConnectionTypeID": 25,
            "StatusTypeID": 50,
            "LevelID": 2,
            "PowerKW": 18,
            "CurrentTypeID": 20
        }
    ],
    "GeneralComments": "",
    "StatusTypeID": 50,
    "DateLastStatusUpdate": "2020-08-27T05:12:00Z",
    "DataQualityLevel": 2,
    "DateCreated": "2020-03-15T10:53:00Z",
    "SubmissionStatusTypeID": 100
}