{
    "IsRecentlyVerified": false,
    "ID": 52932,
    "UUID": "01DC99BA-07A7-4AD8-9389-E6C774AA92B3",
    "DataProviderID": 1,
    "OperatorID": 1,
    "UsageTypeID": 0,
    "AddressInfo": {
        "ID": 53278,
        "Title": "Comune Di Villalago",
        "AddressLine1": "Via Corrado Lafolla, 1",
        "Town": "Villalago",
        "StateOrProvince": "AQ",
        "Postcode": "67032",
        "CountryID": 112,
        "Latitude": 41.93588122754435,
        "Longitude": 13.83546201772151,
        "ContactTelephone1": "0864 740102",
        "DistanceUnit": 0
    },
    "Connections": [
        {
            "ID": 65896,
            "ConnectionTypeID": 25,
            "StatusTypeID": 0,
            "LevelID": 2,
            "CurrentTypeID": 10,
            "Quantity": 1
        }
    ],
    "NumberOfPoints": 1,
    "StatusTypeID": 50,
    "DateLastStatusUpdate": "2015-09-14T16:29:00Z",
    "DataQualityLevel": 1,
    "DateCreated": "2015-09-14T16:29:00Z",
    "SubmissionStatusTypeID": 200
}