{
    "IsRecentlyVerified": false,
    "ID": 77281,
    "UUID": "0CD8A628-F6D7-420E-8F76-2443EBB8DCE2",
    "DataProviderID": 1,
    "OperatorID": 33,
    "UsageTypeID": 4,
    "AddressInfo": {
        "ID": 77627,
        "Title": "Place Jean Goutte Toquet - Ouanne",
        "AddressLine1": "3 Rue de Toucy",
        "AddressLine2": "Les Fontaines",
        "Town": "Ouanne",
        "StateOrProvince": "Auxerre",
        "Postcode": "89560",
        "CountryID": 80,
        "Latitude": 47.661429,
        "Longitude": 3.417264,
        "DistanceUnit": 0
    },
    "Connections": [
        {
            "ID": 111207,
            "ConnectionTypeID": 25,
            "StatusTypeID": 50,
            "LevelID": 2,
            "Amps": 32,
            "Voltage": 400,
            "PowerKW": 22,
            "CurrentTypeID": 20,
            "Quantity": 2
        },
        {
            "ID": 111208,
            "ConnectionTypeID": 23,
            "StatusTypeID": 50,
            "LevelID": 2,
            "Amps": 16,
            "Voltage": 230,
            "PowerKW": 4,
            "CurrentTypeID": 10,
            "Quantity": 2
        }
    ],
    "NumberOfPoints": 2,
    "StatusTypeID": 50,
    "DateLastStatusUpdate": "2017-01-08T14:36:00Z",
    "DataQualityLevel": 1,
    "DateCreated": "2017-01-08T14:36:00Z",
    "SubmissionStatusTypeID": 200
}