{
    "IsRecentlyVerified": false,
    "ID": 166561,
    "UUID": "4DF70B9D-3C92-41C0-AC75-A57D2096B685",
    "DataProviderID": 28,
    "DataProvidersReference": "FR*S28*P28116*2",
    "UsageTypeID": 5,
    "AddressInfo": {
        "ID": 166920,
        "Title": "Courville-sur-Eure | Rue des Planches 1",
        "AddressLine1": "1 Rue des Planches 28190 Courville-sur-Eure",
        "CountryID": 80,
        "Latitude": 48.449574,
        "Longitude": 1.240356,
        "AccessComments": "24/24 7/7",
        "DistanceUnit": 0
    },
    "Connections": [
        {
            "ID": 249429,
            "ConnectionTypeID": 1036,
            "StatusTypeID": 50,
            "LevelID": 2,
            "PowerKW": 22,
            "CurrentTypeID": 20
        },
        {
            "ID": 249430,
            "ConnectionTypeID": 26,
            "StatusTypeID": 50,
            "LevelID": 2,
            "PowerKW": 22
        },
        {
            "ID": 249431,
            "ConnectionTypeID": 28,
            "StatusTypeID": 50,
            "LevelID": 2,
            "PowerKW": 22,
            "CurrentTypeID": 10
        }
    ],
    "GeneralComments": "",
    "StatusTypeID": 50,
    "DateLastStatusUpdate": "2020-08-27T05:15:00Z",
    "DataQualityLevel": 2,
    "DateCreated": "2020-08-27T05:15:00Z",
    "SubmissionStatusTypeID": 100
}