{
    "IsRecentlyVerified": false,
    "ID": 57114,
    "UUID": "EC173703-7D0B-4F07-8550-D3DCD09E57C8",
    "DataProviderID": 1,
    "OperatorID": 45,
    "UsageTypeID": 5,
    "UsageCost": "0,50€/kWh",
    "AddressInfo": {
        "ID": 57460,
        "Title": "Stellplatz Kristall-Saunatherme",
        "AddressLine1": "Auf dem Glockenberg",
        "Town": "Altenau",
        "StateOrProvince": "Landkreis Goslar",
        "Postcode": "38707",
        "CountryID": 87,
        "Latitude": 51.79839,
        "Longitude": 10.44345,
        "AccessComments": "Auf dem Wohnmobilstellplatz für 15 Mobile (auf dem Parkplatz, nicht reserviert), langes Stromkabel ist von Vorteil. Blaue Stromsäule mit 6 Anschlüssen.",
        "RelatedURL": "http://www.kristalltherme-altenau.de/Reisemobile/reisemobile_wohnmobile.php",
        "DistanceUnit": 0
    },
    "Connections": [
        {
            "ID": 72165,
            "ConnectionTypeID": 16,
            "StatusTypeID": 50,
            "LevelID": 2,
            "Amps": 16,
            "Voltage": 230,
            "PowerKW": 3.7,
            "CurrentTypeID": 10,
            "Quantity": 6
        }
    ],
    "NumberOfPoints": 6,
    "StatusTypeID": 50,
    "DateLastStatusUpdate": "2015-11-23T13:07:00Z",
    "DataQualityLevel": 1,
    "DateCreated": "2015-11-23T12:50:00Z",
    "SubmissionStatusTypeID": 200
}