{
    "MediaItems": [
        {
            "ID": 4747,
            "ChargePointID": 59145,
            "ItemURL": "https://s3-ap-southeast-2.amazonaws.com/openchargemap/images/RO/OCM59145/OCM-59145.orig.2016010813152604.jpeg",
            "ItemThumbnailURL": "https://s3-ap-southeast-2.amazonaws.com/openchargemap/images/RO/OCM59145/OCM-59145.thmb.2016010813152604.jpeg",
            "Comment": "",
            "IsEnabled": true,
            "IsVideo": false,
            "IsFeaturedItem": false,
            "IsExternalResource": false,
            "User": {
                "ID": 6812,
                "Username": "Daniel Vlad"
            },
            "DateCreated": "2016-01-08T13:16:00Z"
        }
    ],
    "IsRecentlyVerified": false,
    "ID": 59145,
    "UUID": "64BBE885-A10C-49DE-A77E-85722F45058B",
    "DataProviderID": 1,
    "OperatorID": 1,
    "UsageTypeID": 1,
    "UsageCost": "free",
    "AddressInfo": {
        "ID": 59491,
        "Title": "Mega Image Băneasa",
        "AddressLine1": "Șoseaua București-Ploiești 85-87",
        "AddressLine2": "Băneasa",
        "Town": "Bucharest",
        "Postcode": "013696",
        "CountryID": 184,
        "Latitude": 44.5054247924775,
        "Longitude": 26.0806419176522,
        "ContactEmail": "office@e-mobility.ro",
        "RelatedURL": "http://www.e-mobility.ro/",
        "DistanceUnit": 0
    },
    "Connections": [
        {
            "ID": 75070,
            "ConnectionTypeID": 25,
            "StatusTypeID": 50,
            "LevelID": 2,
            "Amps": 32,
            "Voltage": 380,
            "PowerKW": 22,
            "CurrentTypeID": 20,
            "Quantity": 1
        }
    ],
    "NumberOfPoints": 1,
    "StatusTypeID": 50,
    "DateLastStatusUpdate": "2016-01-08T19:40:00Z",
    "DataQualityLevel": 1,
    "DateCreated": "2016-01-08T13:12:00Z",
    "SubmissionStatusTypeID": 200
}