{
    "UserComments": [
        {
            "ID": 19289,
            "ChargePointID": 100891,
            "CommentTypeID": 10,
            "UserName": "bloemkool",
            "Comment": "Newly installed in 2018. Charged my car there successfully. Ask for the key inside. \nOwner do not want charge sessions during dinner and sauna times. I can’t argue with that. ",
            "Rating": 5,
            "DateCreated": "2018-03-11T16:20:23.147Z",
            "User": {
                "ID": 18094,
                "Username": "bloemkool"
            },
            "CheckinStatusTypeID": 10
        }
    ],
    "MediaItems": [
        {
            "ID": 15162,
            "ChargePointID": 100891,
            "ItemURL": "https://s3-ap-southeast-2.amazonaws.com/openchargemap/images/IT/OCM100891/OCM-100891.orig.2018031218211387.jpeg",
            "ItemThumbnailURL": "https://s3-ap-southeast-2.amazonaws.com/openchargemap/images/IT/OCM100891/OCM-100891.thmb.2018031218211387.jpeg",
            "Comment": "",
            "IsEnabled": true,
            "IsVideo": false,
            "IsFeaturedItem": false,
            "IsExternalResource": false,
            "User": {
                "ID": 18094,
                "Username": "bloemkool"
            },
            "DateCreated": "2018-03-12T18:21:00Z"
        },
        {
            "ID": 15161,
            "ChargePointID": 100891,
            "ItemURL": "https://s3-ap-southeast-2.amazonaws.com/openchargemap/images/IT/OCM100891/OCM-100891.orig.2018031116180793.jpeg",
            "ItemThumbnailURL": "https://s3-ap-southeast-2.amazonaws.com/openchargemap/images/IT/OCM100891/OCM-100891.thmb.2018031116180793.jpeg",
            "Comment": "",
            "IsEnabled": true,
            "IsVideo": false,
            "IsFeaturedItem": false,
            "IsExternalResource": false,
            "User": {
                "ID": 18094,
                "Username": "bloemkool"
            },
            "DateCreated": "2018-03-11T16:18:00Z"
        }
    ],
    "IsRecentlyVerified": false,
    "ID": 100891,
    "UUID": "D643500E-8D6A-4B19-8DAE-76017B0069AB",
    "DataProviderID": 1,
    "OperatorID": 45,
    "UsageTypeID": 6,
    "UsageCost": "Free",
    "AddressInfo": {
        "ID": 101237,
        "Title": "Hotel Chalet La Palsa",
        "AddressLine1": "Str. San Senese, 9",
        "Town": "La Valle",
        "Postcode": "39030",
        "CountryID": 112,
        "Latitude": 46.6573219,
        "Longitude": 11.92420960000004,
        "AccessComments": "At the parking lot  ",
        "RelatedURL": "http://www.lapalsa.it/it/hotel-la-val-alta-badia",
        "DistanceUnit": 0
    },
    "Connections": [
        {
            "ID": 142478,
            "ConnectionTypeID": 25,
            "StatusTypeID": 50,
            "LevelID": 2,
            "Amps": 32,
            "Voltage": 400,
            "PowerKW": 22,
            "CurrentTypeID": 20,
            "Quantity": 1
        }
    ],
    "NumberOfPoints": 1,
    "GeneralComments": "From 20:00 till 8:00 available",
    "StatusTypeID": 50,
    "DateLastStatusUpdate": "2018-03-12T18:21:00Z",
    "DataQualityLevel": 1,
    "DateCreated": "2018-03-10T20:39:00Z",
    "SubmissionStatusTypeID": 200
}