{
    "IsRecentlyVerified": false,
    "ID": 62525,
    "UUID": "DE3FAE90-9996-4E19-AF7A-42DE4FC40B3B",
    "DataProviderID": 26,
    "DataProvidersReference": "79165",
    "OperatorID": 157,
    "OperatorsReference": "NewMotion 02013045",
    "UsageCost": "0.00 jaarabonnement",
    "AddressInfo": {
        "ID": 62871,
        "Title": "Persiaran APEC",
        "AddressLine1": "Persiaran APEC",
        "Town": "Cyberjaya",
        "Postcode": "63000",
        "CountryID": 137,
        "Latitude": 2.90722110779707,
        "Longitude": 101.656301047816,
        "ContactTelephone1": "088 0109500",
        "RelatedURL": "http://thenewmotion.nl/",
        "DistanceUnit": 0
    },
    "Connections": [
        {
            "ID": 79441,
            "ConnectionTypeID": 25,
            "LevelID": 2,
            "PowerKW": 3.7,
            "CurrentTypeID": 10
        },
        {
            "ID": 79442,
            "ConnectionTypeID": 25,
            "LevelID": 2,
            "PowerKW": 3.7,
            "CurrentTypeID": 10
        }
    ],
    "NumberOfPoints": 1,
    "StatusTypeID": 50,
    "DateLastStatusUpdate": "2016-06-04T02:37:00Z",
    "DataQualityLevel": 3,
    "DateCreated": "2016-03-03T12:28:00Z",
    "SubmissionStatusTypeID": 100
}