{
    "IsRecentlyVerified": false,
    "ID": 8077,
    "UUID": "FFDEEFE1-A84C-4196-9AC0-4C23F4E1685D",
    "DataProviderID": 15,
    "DataProvidersReference": "6072",
    "OperatorID": 26,
    "AddressInfo": {
        "ID": 7974,
        "Title": "40 Russell St",
        "AddressLine1": "40 Russell St",
        "Town": "Hadley",
        "StateOrProvince": "MA",
        "Postcode": "1035",
        "CountryID": 2,
        "Latitude": 42.3402,
        "Longitude": -72.6061,
        "ContactTelephone1": " (413) 774-3121",
        "RelatedURL": "http://carstations.com/6072",
        "DistanceUnit": 0
    },
    "Connections": [
        {
            "ID": 5506,
            "ConnectionTypeID": 1,
            "Reference": "J1772",
            "LevelID": 2
        }
    ],
    "StatusTypeID": 0,
    "DateLastStatusUpdate": "2017-11-04T14:04:00Z",
    "DataQualityLevel": 1,
    "DateCreated": "2011-11-11T12:05:00Z",
    "SubmissionStatusTypeID": 100
}