{
    "IsRecentlyVerified": false,
    "ID": 143884,
    "UUID": "29A4BE5A-D7E9-4415-B82D-5A300FD9ED1E",
    "DataProviderID": 2,
    "DataProvidersReference": "84885",
    "UsageTypeID": 2,
    "AddressInfo": {
        "ID": 144236,
        "Title": "Nova Scotia Community College - Akerley Campus",
        "AddressLine1": "21 Woodlawn Rd",
        "Town": "Dartmouth",
        "StateOrProvince": "NS",
        "Postcode": "B2W 2R6",
        "CountryID": 44,
        "Latitude": 44.683848,
        "Longitude": -63.52697,
        "ContactTelephone1": "902-491-4900",
        "AccessComments": "24 hours daily; parking pass required",
        "RelatedURL": "",
        "DistanceUnit": 0
    },
    "Connections": [
        {
            "ID": 200300,
            "ConnectionTypeID": 1,
            "LevelID": 2,
            "Amps": 16,
            "Voltage": 230,
            "PowerKW": 3.7,
            "CurrentTypeID": 10,
            "Quantity": 3
        }
    ],
    "GeneralComments": "Planned for future date. Not Operational.",
    "DatePlanned": "2020-06-01T00:00:00Z",
    "StatusTypeID": 150,
    "DateLastStatusUpdate": "2020-06-26T03:08:00Z",
    "DataQualityLevel": 3,
    "DateCreated": "2019-12-24T09:22:00Z",
    "SubmissionStatusTypeID": 100
}