{
    "IsRecentlyVerified": false,
    "ID": 181203,
    "UUID": "92DD241D-878E-4C68-B03D-73031DB9BD7C",
    "DataProviderID": 29,
    "DataProvidersReference": "12921",
    "AddressInfo": {
        "ID": 181562,
        "Title": "Hauptstr. 28",
        "AddressLine1": "Hauptstr. 28",
        "Town": "Kölbingen",
        "Postcode": "56459",
        "CountryID": 87,
        "Latitude": 50.551043,
        "Longitude": 7.934248,
        "DistanceUnit": 0
    },
    "Connections": [
        {
            "ID": 285225,
            "ConnectionTypeID": 25,
            "StatusTypeID": 50,
            "LevelID": 2,
            "PowerKW": 22,
            "CurrentTypeID": 20
        },
        {
            "ID": 285226,
            "ConnectionTypeID": 25,
            "StatusTypeID": 50,
            "LevelID": 2,
            "PowerKW": 22,
            "CurrentTypeID": 20
        }
    ],
    "StatusTypeID": 50,
    "DateLastStatusUpdate": "2021-07-09T03:19:00Z",
    "MetadataValues": [
        {
            "ID": 13497,
            "MetadataFieldID": 4,
            "ItemValue": "Data from the German chargepoint registry provided by Bundesnetzagentur.de under the CC-BY 4.0 license"
        }
    ],
    "DataQualityLevel": 3,
    "DateCreated": "2021-07-08T10:01:00Z",
    "SubmissionStatusTypeID": 100
}