{
    "IsRecentlyVerified": false,
    "ID": 125802,
    "UUID": "C4F73A2D-3580-4C72-8395-BEF9D393E68F",
    "DataProviderID": 1,
    "OperatorID": 25,
    "OperatorsReference": "hammersmithandfulham-everingtonstreet",
    "UsageTypeID": 4,
    "UsageCost": "£0.059/minute; min £1.18; other tariffs available",
    "AddressInfo": {
        "ID": 126148,
        "Title": "Everington Street",
        "AddressLine1": "Opposite 56 Everington Street",
        "Town": "London",
        "Postcode": "SW6 7PL",
        "CountryID": 1,
        "Latitude": 51.483501,
        "Longitude": -0.216314,
        "DistanceUnit": 0
    },
    "Connections": [
        {
            "ID": 176296,
            "ConnectionTypeID": 25,
            "StatusTypeID": 50,
            "LevelID": 2,
            "Amps": 32,
            "Voltage": 230,
            "PowerKW": 7,
            "CurrentTypeID": 10,
            "Quantity": 2
        },
        {
            "ID": 176297,
            "ConnectionTypeID": 1,
            "StatusTypeID": 50,
            "LevelID": 2,
            "Amps": 16,
            "Voltage": 230,
            "PowerKW": 4,
            "CurrentTypeID": 10,
            "Quantity": 2
        }
    ],
    "NumberOfPoints": 2,
    "StatusTypeID": 50,
    "DateLastStatusUpdate": "2019-05-02T05:39:00Z",
    "DataQualityLevel": 1,
    "DateCreated": "2019-04-27T05:38:00Z",
    "SubmissionStatusTypeID": 200
}