{
    "IsRecentlyVerified": false,
    "ID": 52986,
    "UUID": "3A85F855-CAC6-4F92-BC24-98B900EFB3C6",
    "DataProviderID": 1,
    "UsageTypeID": 4,
    "AddressInfo": {
        "ID": 53332,
        "Title": "Leclerc Drive / Voie des Stades",
        "AddressLine1": "Voie des Stades",
        "Town": "Périgueux",
        "StateOrProvince": "Périgueux",
        "Postcode": "24000",
        "CountryID": 80,
        "Latitude": 45.2013552193794,
        "Longitude": 0.692947011477814,
        "DistanceUnit": 0
    },
    "Connections": [],
    "NumberOfPoints": 2,
    "StatusTypeID": 50,
    "DateLastStatusUpdate": "2015-09-17T14:22:00Z",
    "DataQualityLevel": 1,
    "DateCreated": "2015-09-16T08:55:00Z",
    "SubmissionStatusTypeID": 200
}