{
    "IsRecentlyVerified": false,
    "ID": 145275,
    "UUID": "E00DE28F-856F-4F59-BC9C-D00A54875AC0",
    "DataProviderID": 2,
    "DataProvidersReference": "96505",
    "OperatorID": 9,
    "UsageTypeID": 1,
    "AddressInfo": {
        "ID": 145627,
        "Title": "Walgreens Store #7677",
        "AddressLine1": "1502 Lake Tapps Parkway SE",
        "Town": "Auburn",
        "StateOrProvince": "WA",
        "Postcode": "98092",
        "CountryID": 2,
        "Latitude": 47.245269,
        "Longitude": -122.206909,
        "ContactTelephone1": "888-998-2546",
        "AccessComments": "MON: 24 hours | TUE: 24 hours | WED: 24 hours | THU: 24 hours | FRI: 24 hours | SAT: 24 hours | SUN: 24 hours",
        "RelatedURL": "http://www.blinkcharging.com/",
        "DistanceUnit": 0
    },
    "Connections": [
        {
            "ID": 201911,
            "ConnectionTypeID": 1,
            "LevelID": 2,
            "Amps": 16,
            "Voltage": 230,
            "PowerKW": 3.7,
            "CurrentTypeID": 10,
            "Quantity": 1
        },
        {
            "ID": 201912,
            "ConnectionTypeID": 2,
            "LevelID": 3,
            "Amps": 100,
            "Voltage": 400,
            "PowerKW": 40,
            "CurrentTypeID": 30,
            "Quantity": 2
        }
    ],
    "StatusTypeID": 50,
    "DateLastStatusUpdate": "2020-06-26T03:10:00Z",
    "DataQualityLevel": 3,
    "DateCreated": "2019-12-24T09:24:00Z",
    "SubmissionStatusTypeID": 100
}