{
    "IsRecentlyVerified": false,
    "ID": 140220,
    "UUID": "27252F21-1012-45EE-9472-D566CDCB7FDC",
    "DataProviderID": 2,
    "DataProvidersReference": "85428",
    "OperatorID": 5,
    "UsageTypeID": 1,
    "AddressInfo": {
        "ID": 140572,
        "Title": "HAMPTON INN NRT",
        "AddressLine1": "8818 Spectrum Park Way",
        "Town": "Bakersfield",
        "StateOrProvince": "CA",
        "Postcode": "93308",
        "CountryID": 2,
        "Latitude": 35.4397547,
        "Longitude": -119.0759297,
        "ContactTelephone1": "888-758-4389",
        "AccessComments": "24 hours daily",
        "RelatedURL": "http://www.chargepoint.com/",
        "DistanceUnit": 0
    },
    "Connections": [
        {
            "ID": 195805,
            "ConnectionTypeID": 1,
            "LevelID": 2,
            "Amps": 16,
            "Voltage": 230,
            "PowerKW": 3,
            "CurrentTypeID": 10,
            "Quantity": 2
        }
    ],
    "StatusTypeID": 50,
    "DateLastStatusUpdate": "2019-12-24T09:12:00Z",
    "DataQualityLevel": 3,
    "DateCreated": "2019-12-24T09:12:00Z",
    "SubmissionStatusTypeID": 100
}