{
    "IsRecentlyVerified": false,
    "ID": 53397,
    "UUID": "82E77662-B0C6-4E1B-BE73-7EBF3A096325",
    "DataProviderID": 2,
    "DataProvidersReference": "69835",
    "UsageTypeID": 1,
    "AddressInfo": {
        "ID": 53743,
        "Title": "Kwik Trip #245",
        "AddressLine1": "95 4th Ave SE",
        "Town": "Plainview",
        "StateOrProvince": "MN",
        "Postcode": "55964",
        "CountryID": 2,
        "Latitude": 44.160507,
        "Longitude": -92.165581,
        "ContactTelephone1": "507-534-1295",
        "AccessComments": "24 hours daily",
        "RelatedURL": "",
        "DistanceUnit": 0
    },
    "Connections": [
        {
            "ID": 66513,
            "ConnectionTypeID": 9,
            "LevelID": 1,
            "Amps": 16,
            "Voltage": 120,
            "PowerKW": 1.9,
            "CurrentTypeID": 10,
            "Quantity": 1
        }
    ],
    "DateLastStatusUpdate": "2020-06-26T03:07:00Z",
    "DataQualityLevel": 3,
    "DateCreated": "2015-09-20T11:18:00Z",
    "SubmissionStatusTypeID": 100
}