{
    "IsRecentlyVerified": false,
    "ID": 137940,
    "UUID": "2C567104-35A5-4C0B-88CF-0A39C77D95EB",
    "DataProviderID": 2,
    "DataProvidersReference": "82198",
    "OperatorID": 5,
    "UsageTypeID": 1,
    "AddressInfo": {
        "ID": 138289,
        "Title": "RAMONA SHOPPING",
        "AddressLine1": "1312-1314 CA-67",
        "Town": "Ramona",
        "StateOrProvince": "CA",
        "Postcode": "92065",
        "CountryID": 2,
        "Latitude": 33.0389948,
        "Longitude": -116.873771,
        "ContactTelephone1": "888-758-4389",
        "AccessComments": "24 hours daily",
        "RelatedURL": "http://www.chargepoint.com/",
        "DistanceUnit": 0
    },
    "Connections": [
        {
            "ID": 192968,
            "ConnectionTypeID": 1,
            "LevelID": 2,
            "Amps": 16,
            "Voltage": 230,
            "PowerKW": 3,
            "CurrentTypeID": 10,
            "Quantity": 2
        }
    ],
    "StatusTypeID": 50,
    "DateLastStatusUpdate": "2019-12-24T09:06:00Z",
    "DataQualityLevel": 3,
    "DateCreated": "2019-12-24T09:06:00Z",
    "SubmissionStatusTypeID": 100
}