{
    "IsRecentlyVerified": false,
    "ID": 103010,
    "UUID": "EBD556B6-9ACC-4061-BDD0-6DA65300CFC1",
    "DataProviderID": 2,
    "DataProvidersReference": "42044",
    "UsageTypeID": 2,
    "AddressInfo": {
        "ID": 103356,
        "Title": "City of Tacoma - Municipal Building",
        "AddressLine1": "747 Market St",
        "Town": "Tacoma",
        "StateOrProvince": "WA",
        "Postcode": "98402",
        "CountryID": 2,
        "Latitude": 47.255854,
        "Longitude": -122.44172,
        "ContactTelephone1": "",
        "AccessComments": "",
        "RelatedURL": "",
        "DistanceUnit": 0
    },
    "Connections": [
        {
            "ID": 145164,
            "ConnectionTypeID": 1,
            "LevelID": 2,
            "Amps": 16,
            "Voltage": 230,
            "PowerKW": 3.7,
            "CurrentTypeID": 10,
            "Quantity": 2
        }
    ],
    "DateLastStatusUpdate": "2020-06-26T03:10:00Z",
    "DataQualityLevel": 3,
    "DateCreated": "2018-04-21T04:13:00Z",
    "SubmissionStatusTypeID": 100
}