{
    "IsRecentlyVerified": false,
    "ID": 155077,
    "UUID": "2A64E41D-42B7-4301-BE50-040616A22051",
    "DataProviderID": 1,
    "OperatorID": 3315,
    "OperatorsReference": "51638",
    "UsageTypeID": 4,
    "UsageCost": "Free",
    "AddressInfo": {
        "ID": 155431,
        "Title": "Richmond Street, Glasgow",
        "AddressLine1": "Richmond Street",
        "Town": "Glasgow",
        "Postcode": "G1 1XQ",
        "CountryID": 1,
        "Latitude": 55.861514,
        "Longitude": -4.244327,
        "DistanceUnit": 0
    },
    "Connections": [
        {
            "ID": 218286,
            "ConnectionTypeID": 25,
            "StatusTypeID": 50,
            "LevelID": 2,
            "Amps": 32,
            "Voltage": 400,
            "PowerKW": 22,
            "CurrentTypeID": 20,
            "Quantity": 2
        }
    ],
    "NumberOfPoints": 2,
    "StatusTypeID": 50,
    "DateLastStatusUpdate": "2020-03-26T06:15:00Z",
    "DataQualityLevel": 1,
    "DateCreated": "2020-03-26T06:15:00Z",
    "SubmissionStatusTypeID": 200
}