{
    "IsRecentlyVerified": false,
    "ID": 81346,
    "UUID": "44EC5AA7-252F-45A0-8BF2-F6B976E1C83D",
    "DataProviderID": 1,
    "OperatorID": 23,
    "OperatorsReference": "10622",
    "UsageTypeID": 6,
    "UsageCost": "Free",
    "AddressInfo": {
        "ID": 81692,
        "Title": "Hilton Garden Inn Killeen",
        "AddressLine1": "2704 O W Curry DR",
        "Town": "Killeen",
        "StateOrProvince": "TX",
        "Postcode": "76542",
        "CountryID": 2,
        "Latitude": 31.0863846,
        "Longitude": -97.7145113,
        "ContactTelephone1": "(254) 554-3900",
        "DistanceUnit": 0
    },
    "Connections": [
        {
            "ID": 116062,
            "ConnectionTypeID": 30,
            "StatusTypeID": 50,
            "LevelID": 2,
            "PowerKW": 13,
            "CurrentTypeID": 20,
            "Quantity": 2
        }
    ],
    "NumberOfPoints": 2,
    "GeneralComments": "2 Tesla Connectors, up to 13kW.Available for patrons only. Please see front desk.",
    "StatusTypeID": 50,
    "DateLastStatusUpdate": "2017-02-01T09:33:00Z",
    "DataQualityLevel": 1,
    "DateCreated": "2017-02-01T09:33:00Z",
    "SubmissionStatusTypeID": 200
}