{
    "IsRecentlyVerified": false,
    "ID": 64483,
    "UUID": "E8BB96D4-4B47-4F1C-ACE3-BF4FC7A5CCA2",
    "DataProviderID": 1,
    "OperatorID": 98,
    "UsageTypeID": 4,
    "AddressInfo": {
        "ID": 64829,
        "Title": "GIZ Haus",
        "AddressLine1": "Dag-Hammarskjöld-Weg 1-5",
        "Town": "Eschborn",
        "StateOrProvince": "Main-Taunus-Kreis",
        "Postcode": "65760",
        "CountryID": 87,
        "Latitude": 50.147897,
        "Longitude": 8.556141199999956,
        "ContactTelephone1": "06196 79660",
        "AccessComments": "Box F-117 gegenüber dem Schwimmbad. ",
        "DistanceUnit": 0
    },
    "Connections": [
        {
            "ID": 82755,
            "ConnectionTypeID": 16,
            "StatusTypeID": 50,
            "LevelID": 2,
            "Amps": 16,
            "Voltage": 230,
            "PowerKW": 3.7,
            "CurrentTypeID": 10,
            "Quantity": 1
        },
        {
            "ID": 82756,
            "ConnectionTypeID": 17,
            "StatusTypeID": 50,
            "LevelID": 2,
            "Amps": 16,
            "Voltage": 400,
            "PowerKW": 11,
            "CurrentTypeID": 20,
            "Quantity": 0
        },
        {
            "ID": 82757,
            "ConnectionTypeID": 28,
            "StatusTypeID": 50,
            "LevelID": 2,
            "Amps": 16,
            "Voltage": 230,
            "PowerKW": 3.7,
            "CurrentTypeID": 10,
            "Quantity": 2
        }
    ],
    "NumberOfPoints": 1,
    "GeneralComments": "Absicherung 16A insgesamt",
    "StatusTypeID": 50,
    "DateLastStatusUpdate": "2016-03-08T12:50:00Z",
    "DataQualityLevel": 1,
    "DateCreated": "2016-03-08T12:50:00Z",
    "SubmissionStatusTypeID": 200
}