{
    "IsRecentlyVerified": false,
    "ID": 121770,
    "UUID": "AFA3C53B-BC08-49F5-8327-18C898F5D71F",
    "DataProviderID": 2,
    "DataProvidersReference": "105103",
    "OperatorID": 5,
    "UsageTypeID": 1,
    "AddressInfo": {
        "ID": 122116,
        "Title": "ARCADIA 4222",
        "AddressLine1": "4203 E Thomas Rd",
        "Town": "Phoenix",
        "StateOrProvince": "AZ",
        "Postcode": "85018",
        "CountryID": 2,
        "Latitude": 33.4806253,
        "Longitude": -111.990211,
        "ContactTelephone1": "888-758-4389",
        "AccessComments": "24 hours daily",
        "RelatedURL": "http://www.chargepoint.com/",
        "DistanceUnit": 0
    },
    "Connections": [
        {
            "ID": 171590,
            "ConnectionTypeID": 1,
            "LevelID": 2,
            "Amps": 16,
            "Voltage": 230,
            "PowerKW": 3.7,
            "CurrentTypeID": 10,
            "Quantity": 2
        }
    ],
    "DateLastStatusUpdate": "2020-06-26T02:55:00Z",
    "DataQualityLevel": 3,
    "DateCreated": "2019-04-06T05:02:00Z",
    "SubmissionStatusTypeID": 100
}