{
    "IsRecentlyVerified": false,
    "ID": 96022,
    "UUID": "58464566-72D3-4DD9-BDBD-9577A72894D5",
    "DataProviderID": 1,
    "OperatorID": 3,
    "OperatorsReference": "PG-91638",
    "UsageTypeID": 6,
    "UsageCost": "Free",
    "AddressInfo": {
        "ID": 96368,
        "Title": "Isle of Man Post Office-Northern Delivery Office",
        "AddressLine1": "Northern Delivery Office",
        "Town": "Ramsey",
        "Postcode": "IM8 2AA",
        "CountryID": 110,
        "Latitude": 54.150208,
        "Longitude": -4.478333,
        "DistanceUnit": 0
    },
    "Connections": [
        {
            "ID": 136031,
            "ConnectionTypeID": 25,
            "StatusTypeID": 50,
            "LevelID": 2,
            "Amps": 32,
            "Voltage": 230,
            "PowerKW": 7,
            "CurrentTypeID": 10,
            "Quantity": 1
        }
    ],
    "NumberOfPoints": 1,
    "GeneralComments": "This is an open charge unit installed at the Isle of Man - Northern Delivery Office in Gladstone Way, Ramsey",
    "StatusTypeID": 50,
    "DateLastStatusUpdate": "2017-12-06T06:32:00Z",
    "DataQualityLevel": 1,
    "DateCreated": "2017-12-06T06:32:00Z",
    "SubmissionStatusTypeID": 200
}