{
    "IsRecentlyVerified": false,
    "ID": 176740,
    "UUID": "64726702-DA9D-484D-A0E7-17F91FC87CDC",
    "DataProviderID": 29,
    "DataProvidersReference": "10380",
    "AddressInfo": {
        "ID": 177099,
        "Title": "Paradeisstraße 56",
        "AddressLine1": "Paradeisstraße 56",
        "Town": "Weilheim",
        "Postcode": "82362",
        "CountryID": 87,
        "Latitude": 47.8511,
        "Longitude": 11.13982,
        "DistanceUnit": 0
    },
    "Connections": [
        {
            "ID": 275001,
            "ConnectionTypeID": 25,
            "StatusTypeID": 50,
            "LevelID": 2,
            "PowerKW": 22,
            "CurrentTypeID": 20
        }
    ],
    "StatusTypeID": 0,
    "DateLastStatusUpdate": "2021-07-09T03:10:00Z",
    "MetadataValues": [
        {
            "ID": 9035,
            "MetadataFieldID": 4,
            "ItemValue": "Data from the German chargepoint registry provided by Bundesnetzagentur.de under the CC-BY 4.0 license"
        }
    ],
    "DataQualityLevel": 3,
    "DateCreated": "2021-07-08T09:48:00Z",
    "SubmissionStatusTypeID": 100
}