{
    "IsRecentlyVerified": false,
    "ID": 154763,
    "UUID": "45128374-C448-4D54-8332-6DB7231AFC8C",
    "DataProviderID": 1,
    "OperatorID": 3315,
    "OperatorsReference": "52665",
    "UsageTypeID": 4,
    "UsageCost": "£0.38 fixed charge and £0.15 per kWh",
    "AddressInfo": {
        "ID": 155116,
        "Title": "Dawson Park, Broughty Ferry",
        "AddressLine1": "Dawson Park",
        "Town": "Clinton Terrace",
        "StateOrProvince": "Broughty Ferry",
        "Postcode": "DD5 1PG",
        "CountryID": 1,
        "Latitude": 56.474617,
        "Longitude": -2.89371,
        "DistanceUnit": 0
    },
    "Connections": [
        {
            "ID": 217782,
            "ConnectionTypeID": 25,
            "StatusTypeID": 50,
            "LevelID": 2,
            "Amps": 32,
            "Voltage": 230,
            "PowerKW": 7,
            "CurrentTypeID": 10,
            "Quantity": 2
        }
    ],
    "NumberOfPoints": 2,
    "StatusTypeID": 50,
    "DateLastStatusUpdate": "2020-03-18T06:21:00Z",
    "DataQualityLevel": 1,
    "DateCreated": "2020-03-18T06:21:00Z",
    "SubmissionStatusTypeID": 200
}