{
    "IsRecentlyVerified": false,
    "ID": 70006,
    "UUID": "FF1B24BE-283A-4DD0-AFE3-8EEE20B24687",
    "DataProviderID": 1,
    "OperatorID": 23,
    "OperatorsReference": "24383",
    "UsageTypeID": 6,
    "AddressInfo": {
        "ID": 70352,
        "Title": "Hotel Croux",
        "AddressLine1": "Via Croux, 8",
        "Town": "Courmayeur",
        "StateOrProvince": "AO",
        "Postcode": "11013",
        "CountryID": 112,
        "Latitude": 45.7920013869388,
        "Longitude": 6.9709041137612,
        "ContactTelephone1": "+39 0165 846 735",
        "ContactEmail": "info@hotelcroux.it",
        "RelatedURL": "http://www.hotelcroux.it/",
        "DistanceUnit": 0
    },
    "Connections": [
        {
            "ID": 98876,
            "ConnectionTypeID": 25,
            "StatusTypeID": 50,
            "LevelID": 2,
            "Amps": 32,
            "Voltage": 400,
            "PowerKW": 22,
            "CurrentTypeID": 20,
            "Quantity": 1
        },
        {
            "ID": 116200,
            "ConnectionTypeID": 1036,
            "StatusTypeID": 50,
            "LevelID": 2,
            "Amps": 32,
            "Voltage": 400,
            "PowerKW": 22,
            "CurrentTypeID": 20,
            "Quantity": 1
        },
        {
            "ID": 153516,
            "ConnectionTypeID": 30,
            "StatusTypeID": 50,
            "LevelID": 2,
            "Amps": 32,
            "Voltage": 400,
            "PowerKW": 22,
            "CurrentTypeID": 20,
            "Quantity": 1
        }
    ],
    "NumberOfPoints": 2,
    "GeneralComments": "http://www.hotelcroux.it/datapage.asp?id=12&l=1\r\nTesla Destination Charging",
    "StatusTypeID": 50,
    "DateLastStatusUpdate": "2018-10-05T08:17:00Z",
    "DataQualityLevel": 1,
    "DateCreated": "2016-07-01T10:08:00Z",
    "SubmissionStatusTypeID": 200
}