{
    "MediaItems": [
        {
            "ID": 15741,
            "ChargePointID": 90545,
            "ItemURL": "https://s3-ap-southeast-2.amazonaws.com/openchargemap/images/DE/OCM90545/OCM-90545.orig.2018062305175914.jpg",
            "ItemThumbnailURL": "https://s3-ap-southeast-2.amazonaws.com/openchargemap/images/DE/OCM90545/OCM-90545.thmb.2018062305175914.jpg",
            "Comment": "",
            "IsEnabled": true,
            "IsVideo": false,
            "IsFeaturedItem": false,
            "IsExternalResource": false,
            "User": {
                "ID": 18527,
                "Username": "Elefantus"
            },
            "DateCreated": "2018-06-23T05:18:00Z"
        },
        {
            "ID": 15740,
            "ChargePointID": 90545,
            "ItemURL": "https://s3-ap-southeast-2.amazonaws.com/openchargemap/images/DE/OCM90545/OCM-90545.orig.2018062305164687.jpg",
            "ItemThumbnailURL": "https://s3-ap-southeast-2.amazonaws.com/openchargemap/images/DE/OCM90545/OCM-90545.thmb.2018062305164687.jpg",
            "Comment": "",
            "IsEnabled": true,
            "IsVideo": false,
            "IsFeaturedItem": false,
            "IsExternalResource": false,
            "User": {
                "ID": 18527,
                "Username": "Elefantus"
            },
            "DateCreated": "2018-06-23T05:17:00Z"
        }
    ],
    "IsRecentlyVerified": false,
    "ID": 90545,
    "UUID": "150CB72A-E44F-48A1-80C9-689667FFC37F",
    "DataProviderID": 1,
    "OperatorID": 3248,
    "UsageTypeID": 1,
    "AddressInfo": {
        "ID": 90891,
        "Title": "Rasthof Dresdner Tor Nord",
        "AddressLine1": "A4",
        "Town": "Wilsdruff",
        "StateOrProvince": "Landkreis Meißen",
        "Postcode": "01723",
        "CountryID": 87,
        "Latitude": 51.06305006106083,
        "Longitude": 13.570818787582425,
        "ContactTelephone1": "+49 228 922-0",
        "AccessComments": "24/7 open",
        "RelatedURL": "http://tank.rast.de/emobility",
        "DistanceUnit": 0
    },
    "Connections": [
        {
            "ID": 128225,
            "ConnectionTypeID": 1036,
            "StatusTypeID": 50,
            "LevelID": 3,
            "Amps": 63,
            "Voltage": 400,
            "PowerKW": 43,
            "CurrentTypeID": 20,
            "Quantity": 1
        },
        {
            "ID": 128226,
            "ConnectionTypeID": 2,
            "StatusTypeID": 50,
            "LevelID": 3,
            "PowerKW": 50,
            "CurrentTypeID": 30,
            "Quantity": 1
        },
        {
            "ID": 128227,
            "ConnectionTypeID": 33,
            "StatusTypeID": 50,
            "LevelID": 3,
            "PowerKW": 50,
            "CurrentTypeID": 30,
            "Quantity": 1
        }
    ],
    "NumberOfPoints": 3,
    "StatusTypeID": 50,
    "DateLastStatusUpdate": "2018-06-23T05:18:00Z",
    "DataQualityLevel": 1,
    "DateCreated": "2017-07-17T06:10:00Z",
    "SubmissionStatusTypeID": 200
}