{
    "IsRecentlyVerified": false,
    "ID": 173499,
    "UUID": "3E657BC7-E63E-4502-971D-C0E779A3E87B",
    "DataProviderID": 18,
    "DataProvidersReference": "91eb504e5277b6a41b3d36d9f81944cd",
    "UsageTypeID": 5,
    "AddressInfo": {
        "ID": 173858,
        "Title": "Poynders Gardens",
        "AddressLine1": "Poynders Gardens",
        "Town": "Thornton",
        "Postcode": "SW4 8PE",
        "CountryID": 1,
        "Latitude": 51.44876,
        "Longitude": -0.139349,
        "AccessComments": "Dual post mounted unit ",
        "RelatedURL": "http://www.connectedkerb.com/",
        "DistanceUnit": 0
    },
    "Connections": [
        {
            "ID": 266552,
            "ConnectionTypeID": 25,
            "Reference": "Type 2",
            "StatusTypeID": 50,
            "LevelID": 2,
            "Amps": 32,
            "Voltage": 230,
            "PowerKW": 7,
            "CurrentTypeID": 10
        }
    ],
    "StatusTypeID": 0,
    "DateLastStatusUpdate": "2021-03-03T11:25:00Z",
    "MetadataValues": [
        {
            "ID": 8421,
            "MetadataFieldID": 4,
            "ItemValue": "Contains public sector information licensed under the Open Government Licence v2.0. http://www.nationalarchives.gov.uk/doc/open-government-licence/version/2/"
        }
    ],
    "DataQualityLevel": 3,
    "DateCreated": "2021-03-03T11:25:00Z",
    "SubmissionStatusTypeID": 100
}