{
    "IsRecentlyVerified": false,
    "ID": 136257,
    "UUID": "A6AAFC58-B3F7-4929-86FC-A4B88D08422C",
    "DataProviderID": 1,
    "OperatorID": 2244,
    "UsageTypeID": 5,
    "AddressInfo": {
        "ID": 136603,
        "Title": "Sirdar Road",
        "AddressLine1": "Sirdar Road",
        "Town": "London",
        "Postcode": "W11 4EQ",
        "CountryID": 1,
        "Latitude": 51.511588,
        "Longitude": -0.215067,
        "AccessComments": "",
        "RelatedURL": "https://www.ubitricity.com",
        "DistanceUnit": 0
    },
    "Connections": [
        {
            "ID": 190693,
            "ConnectionTypeID": 25,
            "Reference": "suby1100003276",
            "StatusTypeID": 50,
            "LevelID": 2,
            "Amps": 16,
            "Voltage": 230,
            "PowerKW": 3.7,
            "CurrentTypeID": 10,
            "Quantity": 1
        }
    ],
    "StatusTypeID": 50,
    "DateLastStatusUpdate": "2020-10-11T23:43:00Z",
    "MetadataValues": [
        {
            "ID": 6109,
            "MetadataFieldID": 4,
            "ItemValue": "Contains public sector information licensed under the Open Government Licence v2.0. http://www.nationalarchives.gov.uk/doc/open-government-licence/version/2/"
        }
    ],
    "DataQualityLevel": 3,
    "DateCreated": "2019-12-24T05:22:00Z",
    "SubmissionStatusTypeID": 100
}