{
    "IsRecentlyVerified": false,
    "ID": 111857,
    "UUID": "A25EC4CF-BEB9-4FE1-87EE-8EDA42033AD0",
    "DataProviderID": 2,
    "DataProvidersReference": "96688",
    "OperatorID": 5,
    "UsageTypeID": 1,
    "AddressInfo": {
        "ID": 112203,
        "Title": "VISITOR CENTRE",
        "AddressLine1": "8113 Queen St",
        "Town": "Duncan",
        "StateOrProvince": "BC",
        "Postcode": "V9L 5W7",
        "CountryID": 44,
        "Latitude": 48.8649538,
        "Longitude": -123.6409447,
        "ContactTelephone1": "888-758-4389",
        "AccessComments": "24 hours daily",
        "RelatedURL": "http://www.chargepoint.com/",
        "DistanceUnit": 0
    },
    "Connections": [
        {
            "ID": 157364,
            "ConnectionTypeID": 1,
            "LevelID": 2,
            "Amps": 16,
            "Voltage": 230,
            "PowerKW": 3,
            "CurrentTypeID": 10,
            "Quantity": 2
        }
    ],
    "DateLastStatusUpdate": "2019-12-24T09:25:00Z",
    "DataQualityLevel": 3,
    "DateCreated": "2018-10-18T23:37:00Z",
    "SubmissionStatusTypeID": 100
}