{
    "IsRecentlyVerified": false,
    "ID": 103009,
    "UUID": "2736DBC3-D910-43C1-AD55-3732986B8E59",
    "DataProviderID": 2,
    "DataProvidersReference": "92167",
    "OperatorID": 39,
    "UsageTypeID": 1,
    "AddressInfo": {
        "ID": 103355,
        "Title": "Four Lakes Apartments",
        "AddressLine1": "6821 Udall Place Southeast",
        "Town": "Auburn",
        "StateOrProvince": "WA",
        "Postcode": "98092",
        "CountryID": 2,
        "Latitude": 47.24745538956,
        "Longitude": -122.20054897354,
        "ContactTelephone1": "800-663-5633",
        "AccessComments": "MO: 12:00am-12:00am; TU: 12:00am-12:00am; WE: 12:00am-12:00am; TH: 12:00am-12:00am; FR: 12:00am-12:00am; SA: 12:00am-12:00am; SU: 12:00am-12:00am",
        "RelatedURL": "http://www.semacharge.com/",
        "DistanceUnit": 0
    },
    "Connections": [
        {
            "ID": 145163,
            "ConnectionTypeID": 1,
            "LevelID": 2,
            "Amps": 16,
            "Voltage": 230,
            "PowerKW": 3,
            "CurrentTypeID": 10,
            "Quantity": 2
        }
    ],
    "DateLastStatusUpdate": "2019-04-06T05:07:00Z",
    "DataQualityLevel": 3,
    "DateCreated": "2018-04-21T04:13:00Z",
    "SubmissionStatusTypeID": 100
}