{
    "IsRecentlyVerified": false,
    "ID": 53062,
    "UUID": "F0ACFD6E-1881-4F00-9E34-F7CBA9B85E43",
    "DataProviderID": 1,
    "OperatorID": 32,
    "OperatorsReference": "2047",
    "UsageTypeID": 6,
    "UsageCost": "Inclusive; for Polar Plus subscription members only",
    "AddressInfo": {
        "ID": 53408,
        "Title": "Pullman Volkswagen",
        "AddressLine1": "Newcastle Road",
        "Town": "Sunderland",
        "Postcode": "SR5 1QE",
        "CountryID": 1,
        "Latitude": 54.929901,
        "Longitude": -1.39043,
        "AccessComments": "Dealership opening hours only. Contact dealership for any restrictions.",
        "DistanceUnit": 0
    },
    "Connections": [
        {
            "ID": 66140,
            "ConnectionTypeID": 3,
            "StatusTypeID": 50,
            "LevelID": 2,
            "Amps": 13,
            "Voltage": 230,
            "PowerKW": 3,
            "CurrentTypeID": 10,
            "Quantity": 1
        },
        {
            "ID": 66141,
            "ConnectionTypeID": 25,
            "StatusTypeID": 50,
            "LevelID": 2,
            "Amps": 32,
            "Voltage": 230,
            "PowerKW": 7,
            "CurrentTypeID": 10,
            "Quantity": 1
        }
    ],
    "NumberOfPoints": 1,
    "StatusTypeID": 50,
    "DateLastStatusUpdate": "2019-03-05T06:36:00Z",
    "DataQualityLevel": 1,
    "DateCreated": "2015-09-18T11:53:00Z",
    "SubmissionStatusTypeID": 200
}