{
    "IsRecentlyVerified": false,
    "ID": 136433,
    "UUID": "5FD12302-D8FB-4BA5-90EF-018A7DDAB8B6",
    "DataProviderID": 1,
    "OperatorID": 25,
    "UsageTypeID": 4,
    "AddressInfo": {
        "ID": 136779,
        "Title": "London Road",
        "AddressLine1": "London Road",
        "Town": "Barking",
        "Postcode": "IG11 7BL",
        "CountryID": 1,
        "Latitude": 51.538721,
        "Longitude": 0.077796,
        "AccessComments": "",
        "RelatedURL": "https://www.sourcelondon.net",
        "DistanceUnit": 0
    },
    "Connections": [
        {
            "ID": 190879,
            "ConnectionTypeID": 25,
            "Reference": "1",
            "StatusTypeID": 50,
            "LevelID": 2,
            "Amps": 32,
            "Voltage": 230,
            "PowerKW": 7,
            "CurrentTypeID": 10,
            "Quantity": 1
        },
        {
            "ID": 190880,
            "ConnectionTypeID": 25,
            "Reference": "2",
            "StatusTypeID": 50,
            "LevelID": 2,
            "Amps": 32,
            "Voltage": 230,
            "PowerKW": 7,
            "CurrentTypeID": 10,
            "Quantity": 1
        }
    ],
    "StatusTypeID": 50,
    "DateLastStatusUpdate": "2020-10-11T22:55:00Z",
    "MetadataValues": [
        {
            "ID": 6285,
            "MetadataFieldID": 4,
            "ItemValue": "Contains public sector information licensed under the Open Government Licence v2.0. http://www.nationalarchives.gov.uk/doc/open-government-licence/version/2/"
        }
    ],
    "DataQualityLevel": 3,
    "DateCreated": "2019-12-24T05:22:00Z",
    "SubmissionStatusTypeID": 100
}