{
    "MediaItems": [
        {
            "ID": 28912,
            "ChargePointID": 188189,
            "ItemURL": "https://s3-ap-southeast-2.amazonaws.com/openchargemap/images/IT/OCM188189/OCM-188189.orig.2021080613563159.jpg",
            "ItemThumbnailURL": "https://s3-ap-southeast-2.amazonaws.com/openchargemap/images/IT/OCM188189/OCM-188189.thmb.2021080613563159.jpg",
            "Comment": "",
            "IsEnabled": true,
            "IsVideo": false,
            "IsFeaturedItem": false,
            "IsExternalResource": false,
            "User": {
                "ID": 19496,
                "Username": "ECOGY"
            },
            "DateCreated": "2021-08-06T13:57:00Z"
        },
        {
            "ID": 28911,
            "ChargePointID": 188189,
            "ItemURL": "https://s3-ap-southeast-2.amazonaws.com/openchargemap/images/IT/OCM188189/OCM-188189.orig.2021080613560291.jpg",
            "ItemThumbnailURL": "https://s3-ap-southeast-2.amazonaws.com/openchargemap/images/IT/OCM188189/OCM-188189.thmb.2021080613560291.jpg",
            "Comment": "",
            "IsEnabled": true,
            "IsVideo": false,
            "IsFeaturedItem": false,
            "IsExternalResource": false,
            "User": {
                "ID": 19496,
                "Username": "ECOGY"
            },
            "DateCreated": "2021-08-06T13:56:00Z"
        }
    ],
    "IsRecentlyVerified": false,
    "ID": 188189,
    "UUID": "87F2FF2D-0C03-4EE4-9151-DF170B489B26",
    "DataProviderID": 1,
    "OperatorID": 1,
    "UsageTypeID": 4,
    "UsageCost": "25 cent /kWh",
    "AddressInfo": {
        "ID": 188548,
        "Title": "Hotel Ciurnadù***",
        "AddressLine1": "Str. Ciurnadù, 1",
        "Town": "39030 La Val / Wengen (BZ)",
        "StateOrProvince": "Trentino-Alto Adige - Südtirol",
        "Postcode": "39030",
        "CountryID": 112,
        "Latitude": 46.65648881911585,
        "Longitude": 11.944914746445988,
        "ContactTelephone1": "+39 0471 727 940",
        "AccessComments": "For guest. RFID card available at office",
        "RelatedURL": "https://www.ciurnadu.it/de/gasthof-la-val-alta-badia",
        "DistanceUnit": 0
    },
    "Connections": [
        {
            "ID": 303735,
            "ConnectionTypeID": 33,
            "StatusTypeID": 50,
            "LevelID": 2,
            "Amps": 10,
            "Voltage": 400,
            "PowerKW": 7,
            "CurrentTypeID": 20,
            "Quantity": 1
        }
    ],
    "NumberOfPoints": 1,
    "GeneralComments": "The charging station is in the parking lot",
    "StatusTypeID": 50,
    "DateLastStatusUpdate": "2021-08-06T13:57:00Z",
    "DataQualityLevel": 1,
    "DateCreated": "2021-07-13T14:44:00Z",
    "SubmissionStatusTypeID": 200
}