{
    "IsRecentlyVerified": false,
    "ID": 179212,
    "UUID": "F69A6746-4071-4991-A174-7B4EBAA3C61B",
    "DataProviderID": 29,
    "DataProvidersReference": "5522",
    "AddressInfo": {
        "ID": 179571,
        "Title": "Dorfstrasse 4",
        "AddressLine1": "Dorfstrasse 4",
        "Town": "Horstedt",
        "Postcode": "25860",
        "CountryID": 87,
        "Latitude": 54.525805,
        "Longitude": 9.068051,
        "DistanceUnit": 0
    },
    "Connections": [
        {
            "ID": 280719,
            "ConnectionTypeID": 25,
            "StatusTypeID": 50,
            "LevelID": 2,
            "PowerKW": 22,
            "CurrentTypeID": 20
        },
        {
            "ID": 280720,
            "ConnectionTypeID": 25,
            "StatusTypeID": 50,
            "LevelID": 2,
            "PowerKW": 22,
            "CurrentTypeID": 20
        }
    ],
    "StatusTypeID": 50,
    "DateLastStatusUpdate": "2021-07-12T02:52:00Z",
    "MetadataValues": [
        {
            "ID": 11506,
            "MetadataFieldID": 4,
            "ItemValue": "Data from the German chargepoint registry provided by Bundesnetzagentur.de under the CC-BY 4.0 license"
        }
    ],
    "DataQualityLevel": 3,
    "DateCreated": "2021-07-08T09:59:00Z",
    "SubmissionStatusTypeID": 100
}