{
    "IsRecentlyVerified": false,
    "ID": 50847,
    "UUID": "09580F3F-40EB-4243-BB99-D64CD8BBCA31",
    "DataProviderID": 26,
    "DataProvidersReference": "63756",
    "OperatorID": 180,
    "OperatorsReference": "Alfen GDH2791",
    "UsageCost": "0.00 jaarabonnement",
    "AddressInfo": {
        "ID": 51193,
        "Title": "Harriëtte Freezerhof 86",
        "AddressLine1": "Harriëtte Freezerhof 86",
        "Town": "Den Haag",
        "Postcode": "2492 JD",
        "CountryID": 159,
        "Latitude": 52.063495,
        "Longitude": 4.404794,
        "ContactTelephone1": "036 - 549 34 00",
        "RelatedURL": "http://www.icu-charging-stations.com/",
        "DistanceUnit": 0
    },
    "Connections": [
        {
            "ID": 62768,
            "ConnectionTypeID": 25,
            "LevelID": 2,
            "PowerKW": 11,
            "CurrentTypeID": 10
        },
        {
            "ID": 62769,
            "ConnectionTypeID": 25,
            "LevelID": 2,
            "PowerKW": 11,
            "CurrentTypeID": 10
        }
    ],
    "NumberOfPoints": 1,
    "StatusTypeID": 50,
    "DateLastStatusUpdate": "2016-06-04T02:45:00Z",
    "DataQualityLevel": 3,
    "DateCreated": "2015-07-22T09:54:00Z",
    "SubmissionStatusTypeID": 100
}