{
    "IsRecentlyVerified": false,
    "ID": 91245,
    "UUID": "C172399E-DA05-44C1-B3DE-3F0FE3224C75",
    "DataProviderID": 1,
    "OperatorID": 23,
    "OperatorsReference": "32518",
    "UsageTypeID": 6,
    "AddressInfo": {
        "ID": 91591,
        "Title": "Eriksgårdens Fjällhotell",
        "AddressLine1": "Vintergatan 3",
        "Town": "Funäsdalen",
        "Postcode": "84095",
        "CountryID": 216,
        "Latitude": 62.550714,
        "Longitude": 12.529234,
        "ContactTelephone1": "+46 684 21 006",
        "DistanceUnit": 0
    },
    "Connections": [
        {
            "ID": 129376,
            "ConnectionTypeID": 30,
            "StatusTypeID": 50,
            "LevelID": 2,
            "Amps": 16,
            "Voltage": 400,
            "PowerKW": 11,
            "CurrentTypeID": 20,
            "Quantity": 1
        }
    ],
    "NumberOfPoints": 1,
    "GeneralComments": "1 Tesla Connector, up to 11kW.Available for patrons only. Please see front desk.",
    "StatusTypeID": 50,
    "DateLastStatusUpdate": "2018-10-03T20:45:00Z",
    "DataQualityLevel": 1,
    "DateCreated": "2017-08-02T05:39:00Z",
    "SubmissionStatusTypeID": 200
}