{
    "MediaItems": [
        {
            "ID": 18457,
            "ChargePointID": 126765,
            "ItemURL": "https://s3-ap-southeast-2.amazonaws.com/openchargemap/images/FI/OCM126765/OCM-126765.orig.2019051916311582.jpg",
            "ItemThumbnailURL": "https://s3-ap-southeast-2.amazonaws.com/openchargemap/images/FI/OCM126765/OCM-126765.thmb.2019051916311582.jpg",
            "Comment": "",
            "IsEnabled": true,
            "IsVideo": false,
            "IsFeaturedItem": false,
            "IsExternalResource": false,
            "User": {
                "ID": 20857,
                "Username": "busman"
            },
            "DateCreated": "2019-05-19T16:31:00Z"
        },
        {
            "ID": 18455,
            "ChargePointID": 126765,
            "ItemURL": "https://s3-ap-southeast-2.amazonaws.com/openchargemap/images/FI/OCM126765/OCM-126765.orig.2019051916293115.jpg",
            "ItemThumbnailURL": "https://s3-ap-southeast-2.amazonaws.com/openchargemap/images/FI/OCM126765/OCM-126765.thmb.2019051916293115.jpg",
            "Comment": "",
            "IsEnabled": true,
            "IsVideo": false,
            "IsFeaturedItem": false,
            "IsExternalResource": false,
            "User": {
                "ID": 20857,
                "Username": "busman"
            },
            "DateCreated": "2019-05-19T16:30:00Z"
        },
        {
            "ID": 18456,
            "ChargePointID": 126765,
            "ItemURL": "https://s3-ap-southeast-2.amazonaws.com/openchargemap/images/FI/OCM126765/OCM-126765.orig.2019051916301211.jpg",
            "ItemThumbnailURL": "https://s3-ap-southeast-2.amazonaws.com/openchargemap/images/FI/OCM126765/OCM-126765.thmb.2019051916301211.jpg",
            "Comment": "",
            "IsEnabled": true,
            "IsVideo": false,
            "IsFeaturedItem": false,
            "IsExternalResource": false,
            "User": {
                "ID": 20857,
                "Username": "busman"
            },
            "DateCreated": "2019-05-19T16:30:00Z"
        }
    ],
    "IsRecentlyVerified": false,
    "ID": 126765,
    "UUID": "64FDAFFC-F741-4C01-87DC-D4F2CBE8AD74",
    "DataProviderID": 1,
    "OperatorID": 3354,
    "UsageTypeID": 4,
    "AddressInfo": {
        "ID": 127111,
        "Title": "K-Citymarket Helsinki Easton",
        "AddressLine1": "Kauppakartanonkatu 3",
        "Town": "Helsinki",
        "StateOrProvince": "Uusimaa",
        "Postcode": "00930",
        "CountryID": 79,
        "Latitude": 60.2099758997263,
        "Longitude": 25.0848111435438,
        "AccessComments": "Parkkihallissa / Inside parking",
        "RelatedURL": "https://www.k-ruoka.fi/kauppa/k-citymarket-helsinki-easton",
        "DistanceUnit": 0
    },
    "Connections": [
        {
            "ID": 177562,
            "ConnectionTypeID": 25,
            "StatusTypeID": 50,
            "LevelID": 2,
            "CurrentTypeID": 20,
            "Quantity": 6
        },
        {
            "ID": 177563,
            "ConnectionTypeID": 2,
            "StatusTypeID": 50,
            "LevelID": 3,
            "CurrentTypeID": 30,
            "Quantity": 2
        },
        {
            "ID": 177564,
            "ConnectionTypeID": 33,
            "StatusTypeID": 50,
            "LevelID": 3,
            "CurrentTypeID": 30,
            "Quantity": 2
        }
    ],
    "NumberOfPoints": 8,
    "GeneralComments": "Chargers indoors and access restricted to opening hours.",
    "StatusTypeID": 50,
    "DateLastStatusUpdate": "2019-05-27T22:13:00Z",
    "DataQualityLevel": 1,
    "DateCreated": "2019-05-19T16:28:00Z",
    "SubmissionStatusTypeID": 200
}