{
    "IsRecentlyVerified": false,
    "ID": 66130,
    "UUID": "989E482C-A124-499E-93C2-452F679F152C",
    "DataProviderID": 1,
    "OperatorID": 1240,
    "UsageTypeID": 1,
    "AddressInfo": {
        "ID": 66476,
        "Title": "E-Bike Station Gaststätte Zum Schwanen",
        "AddressLine1": "Hauptstraße 80",
        "AddressLine2": "Weiherhof",
        "Town": "Weingarten (Pfalz)",
        "StateOrProvince": "Lingenfeld",
        "Postcode": "67366",
        "CountryID": 87,
        "Latitude": 49.2585026,
        "Longitude": 8.283557999999971,
        "RelatedURL": "https://www.pfalzwerke.de/energieberatung/9244.php",
        "DistanceUnit": 0
    },
    "Connections": [
        {
            "ID": 91421,
            "ConnectionTypeID": 28,
            "StatusTypeID": 50,
            "LevelID": 1,
            "Amps": 10,
            "Voltage": 230,
            "PowerKW": 2.3,
            "CurrentTypeID": 10,
            "Quantity": 4
        }
    ],
    "NumberOfPoints": 4,
    "StatusTypeID": 50,
    "DateLastStatusUpdate": "2016-05-12T06:23:00Z",
    "DataQualityLevel": 1,
    "DateCreated": "2016-05-12T06:23:00Z",
    "SubmissionStatusTypeID": 200
}