{
    "IsRecentlyVerified": false,
    "ID": 152788,
    "UUID": "47C1D8F3-FCC9-47BC-8121-FA5514479E6A",
    "DataProviderID": 28,
    "DataProvidersReference": "FR*S49*P49221*001",
    "UsageTypeID": 5,
    "AddressInfo": {
        "ID": 153141,
        "Title": "MOULIHERNE - Rue D'Anjou",
        "AddressLine1": "Rue D'Anjou 49390 MOULIHERNE",
        "CountryID": 80,
        "Latitude": 47.465705,
        "Longitude": 0.014452,
        "AccessComments": "24h/24 7j/7",
        "DistanceUnit": 0
    },
    "Connections": [
        {
            "ID": 214046,
            "ConnectionTypeID": 25,
            "StatusTypeID": 50,
            "LevelID": 2,
            "PowerKW": 18,
            "CurrentTypeID": 20
        },
        {
            "ID": 214047,
            "ConnectionTypeID": 28,
            "StatusTypeID": 50,
            "LevelID": 2,
            "PowerKW": 18,
            "CurrentTypeID": 10
        },
        {
            "ID": 247265,
            "ConnectionTypeID": 25,
            "StatusTypeID": 50,
            "LevelID": 2,
            "PowerKW": 18,
            "CurrentTypeID": 20
        },
        {
            "ID": 247266,
            "ConnectionTypeID": 28,
            "StatusTypeID": 50,
            "LevelID": 2,
            "PowerKW": 18,
            "CurrentTypeID": 10
        }
    ],
    "GeneralComments": "Recharge par badge et avec une application smartphone",
    "StatusTypeID": 50,
    "DateLastStatusUpdate": "2020-08-27T05:13:00Z",
    "DataQualityLevel": 2,
    "DateCreated": "2020-03-15T10:54:00Z",
    "SubmissionStatusTypeID": 100
}