{
    "IsRecentlyVerified": false,
    "ID": 167009,
    "UUID": "F40C0635-68E1-40BE-A1D9-3A537EEDA62D",
    "DataProviderID": 18,
    "DataProvidersReference": "4d89c2441591328e732fea57475ccf8c",
    "UsageTypeID": 5,
    "AddressInfo": {
        "ID": 167368,
        "Title": "1-25 Tulse Hill, Brixton",
        "AddressLine1": "1-25 Tulse Hill, Brixton",
        "Town": "London",
        "Postcode": "SW2 2TH",
        "CountryID": 1,
        "Latitude": 51.454782,
        "Longitude": -0.113358,
        "AccessComments": "",
        "RelatedURL": "http://www.esb-evsolutions.co.uk/",
        "DistanceUnit": 0
    },
    "Connections": [
        {
            "ID": 252856,
            "ConnectionTypeID": 2,
            "Reference": "CHAdeMO",
            "StatusTypeID": 50,
            "LevelID": 3,
            "Amps": 125,
            "Voltage": 400,
            "PowerKW": 50,
            "CurrentTypeID": 30
        },
        {
            "ID": 252857,
            "ConnectionTypeID": 1036,
            "Reference": "CCS",
            "StatusTypeID": 50,
            "LevelID": 3,
            "Amps": 125,
            "Voltage": 400,
            "PowerKW": 50,
            "CurrentTypeID": 30
        },
        {
            "ID": 252858,
            "ConnectionTypeID": 1036,
            "Reference": "AC43",
            "StatusTypeID": 50,
            "LevelID": 3,
            "Amps": 63,
            "Voltage": 400,
            "PowerKW": 43,
            "CurrentTypeID": 20
        }
    ],
    "StatusTypeID": 0,
    "DateLastStatusUpdate": "2021-07-12T03:38:00Z",
    "MetadataValues": [
        {
            "ID": 7766,
            "MetadataFieldID": 4,
            "ItemValue": "Contains public sector information licensed under the Open Government Licence v2.0. http://www.nationalarchives.gov.uk/doc/open-government-licence/version/2/"
        }
    ],
    "DataQualityLevel": 3,
    "DateCreated": "2020-08-27T08:10:00Z",
    "SubmissionStatusTypeID": 100
}