{
    "IsRecentlyVerified": true,
    "DateLastVerified": "2021-10-03T14:43:00Z",
    "ID": 189488,
    "UUID": "2B364AEA-E110-41F5-A8C2-C3BB6F38D24D",
    "DataProviderID": 1,
    "OperatorID": 21,
    "UsageTypeID": 4,
    "UsageCost": "Mobi.E compatible card or App",
    "AddressInfo": {
        "ID": 189847,
        "Title": "MMV-00002 - Mercado Municipal",
        "AddressLine1": "Rua Mendanha Raposo",
        "Town": "Montemor-o-Velho",
        "StateOrProvince": "Coimbra",
        "Postcode": "3140-271 Montemor-o-Velho",
        "CountryID": 180,
        "Latitude": 40.1736062132679,
        "Longitude": -8.681645048176847,
        "DistanceUnit": 0
    },
    "Connections": [
        {
            "ID": 306488,
            "ConnectionTypeID": 33,
            "StatusTypeID": 50,
            "LevelID": 3,
            "Amps": 125,
            "Voltage": 500,
            "PowerKW": 50,
            "CurrentTypeID": 30,
            "Quantity": 1
        },
        {
            "ID": 306489,
            "ConnectionTypeID": 2,
            "StatusTypeID": 50,
            "LevelID": 3,
            "Amps": 120,
            "Voltage": 500,
            "PowerKW": 50,
            "CurrentTypeID": 30,
            "Quantity": 1
        },
        {
            "ID": 306490,
            "ConnectionTypeID": 1036,
            "StatusTypeID": 50,
            "LevelID": 3,
            "Amps": 64,
            "Voltage": 400,
            "PowerKW": 43,
            "CurrentTypeID": 20,
            "Quantity": 1
        }
    ],
    "NumberOfPoints": 2,
    "StatusTypeID": 50,
    "DateLastStatusUpdate": "2021-10-03T14:43:00Z",
    "DataQualityLevel": 1,
    "DateCreated": "2021-10-03T14:43:00Z",
    "SubmissionStatusTypeID": 200
}