{
    "IsRecentlyVerified": false,
    "ID": 20993,
    "UUID": "D12CA515-17C7-4ABB-800F-F1F8A9B284E4",
    "DataProviderID": 2,
    "DataProvidersReference": "58292",
    "OperatorID": 5,
    "UsageTypeID": 1,
    "AddressInfo": {
        "ID": 21338,
        "Title": "BUCKLIN PARK",
        "AddressLine1": "73484 Twentynine Palms Hwy",
        "Town": "Twentynine Palms",
        "StateOrProvince": "CA",
        "Postcode": "92277",
        "CountryID": 2,
        "Latitude": 34.136029,
        "Longitude": -116.0591211,
        "ContactTelephone1": "888-758-4389",
        "AccessComments": "24 hours daily",
        "RelatedURL": "http://www.chargepoint.com/",
        "DistanceUnit": 0
    },
    "Connections": [
        {
            "ID": 22858,
            "ConnectionTypeID": 1,
            "LevelID": 2,
            "Amps": 16,
            "Voltage": 230,
            "PowerKW": 3,
            "CurrentTypeID": 10,
            "Quantity": 1
        }
    ],
    "DateLastStatusUpdate": "2019-04-06T04:01:00Z",
    "DataQualityLevel": 3,
    "DateCreated": "2014-02-06T04:57:00Z",
    "SubmissionStatusTypeID": 100
}