{
    "IsRecentlyVerified": false,
    "ID": 89905,
    "UUID": "1999C842-0B8A-4238-8DB2-9C6904D78DBC",
    "DataProviderID": 2,
    "DataProvidersReference": "85648",
    "OperatorID": 5,
    "UsageTypeID": 1,
    "AddressInfo": {
        "ID": 90251,
        "Title": "TOWN HALL",
        "AddressLine1": "21445 Catawba Ave",
        "Town": "Cornelius",
        "StateOrProvince": "NC",
        "Postcode": "28031",
        "CountryID": 2,
        "Latitude": 35.4824265,
        "Longitude": -80.8587052,
        "ContactTelephone1": "888-758-4389",
        "AccessComments": "24 hours daily",
        "RelatedURL": "http://www.chargepoint.com/",
        "DistanceUnit": 0
    },
    "Connections": [
        {
            "ID": 127439,
            "ConnectionTypeID": 1,
            "LevelID": 2,
            "Amps": 16,
            "Voltage": 230,
            "PowerKW": 3,
            "CurrentTypeID": 10,
            "Quantity": 2
        }
    ],
    "DateLastStatusUpdate": "2019-04-06T04:02:00Z",
    "DataQualityLevel": 3,
    "DateCreated": "2017-07-01T03:43:00Z",
    "SubmissionStatusTypeID": 100
}