{
    "IsRecentlyVerified": false,
    "ID": 129400,
    "UUID": "90962453-9311-4A14-BCA8-21AE6622DCF4",
    "DataProviderID": 1,
    "OperatorID": 80,
    "UsageTypeID": 4,
    "AddressInfo": {
        "ID": 129746,
        "Title": "Carrozzeria Fiorillo | EnelX",
        "AddressLine1": "Strada Tuscanese Km 3.500, 75",
        "Town": "Viterbo",
        "StateOrProvince": "VT",
        "Postcode": "01100",
        "CountryID": 112,
        "Latitude": 42.4219466726435,
        "Longitude": 12.060491443644,
        "ContactTelephone1": "800.069.850",
        "RelatedURL": "https://www.enelx.com/it/it/emobility",
        "DistanceUnit": 0
    },
    "Connections": [
        {
            "ID": 181098,
            "ConnectionTypeID": 25,
            "StatusTypeID": 50,
            "LevelID": 2,
            "Amps": 32,
            "Voltage": 400,
            "PowerKW": 22,
            "CurrentTypeID": 20,
            "Quantity": 2
        }
    ],
    "NumberOfPoints": 2,
    "GeneralComments": "\tLun-Ven 8:00-13:00/15:00-19:00 Sab 8:00-13:00",
    "StatusTypeID": 50,
    "DateLastStatusUpdate": "2019-07-19T10:21:00Z",
    "DataQualityLevel": 1,
    "DateCreated": "2019-07-19T10:21:00Z",
    "SubmissionStatusTypeID": 200
}