{
    "MediaItems": [
        {
            "ID": 15160,
            "ChargePointID": 100889,
            "ItemURL": "https://s3-ap-southeast-2.amazonaws.com/openchargemap/images/CZ/OCM100889/OCM-100889.orig.2018031110544350.jpg",
            "ItemThumbnailURL": "https://s3-ap-southeast-2.amazonaws.com/openchargemap/images/CZ/OCM100889/OCM-100889.thmb.2018031110544350.jpg",
            "Comment": "Umístění nabíjecího bodu",
            "IsEnabled": true,
            "IsVideo": false,
            "IsFeaturedItem": false,
            "IsExternalResource": false,
            "User": {
                "ID": 6224,
                "Username": "ozana"
            },
            "DateCreated": "2018-03-11T10:55:00Z"
        },
        {
            "ID": 15158,
            "ChargePointID": 100889,
            "ItemURL": "https://s3-ap-southeast-2.amazonaws.com/openchargemap/images/CZ/OCM100889/OCM-100889.orig.2018031110534962.jpg",
            "ItemThumbnailURL": "https://s3-ap-southeast-2.amazonaws.com/openchargemap/images/CZ/OCM100889/OCM-100889.thmb.2018031110534962.jpg",
            "Comment": "Stojan rychlého nabíjení a wallbox Mennekes",
            "IsEnabled": true,
            "IsVideo": false,
            "IsFeaturedItem": false,
            "IsExternalResource": false,
            "User": {
                "ID": 6224,
                "Username": "ozana"
            },
            "DateCreated": "2018-03-11T10:54:00Z"
        },
        {
            "ID": 15159,
            "ChargePointID": 100889,
            "ItemURL": "https://s3-ap-southeast-2.amazonaws.com/openchargemap/images/CZ/OCM100889/OCM-100889.orig.2018031110541794.jpg",
            "ItemThumbnailURL": "https://s3-ap-southeast-2.amazonaws.com/openchargemap/images/CZ/OCM100889/OCM-100889.thmb.2018031110541794.jpg",
            "Comment": "",
            "IsEnabled": true,
            "IsVideo": false,
            "IsFeaturedItem": false,
            "IsExternalResource": false,
            "User": {
                "ID": 6224,
                "Username": "ozana"
            },
            "DateCreated": "2018-03-11T10:54:00Z"
        }
    ],
    "IsRecentlyVerified": false,
    "ID": 100889,
    "UUID": "88C299B4-B409-489F-8F2B-E7A5FF42D955",
    "DataProviderID": 1,
    "OperatorID": 221,
    "UsageTypeID": 6,
    "AddressInfo": {
        "ID": 101235,
        "Title": "AutoMyčka SCF",
        "AddressLine1": "Hradecká 545",
        "Town": "Staré Hradiště",
        "StateOrProvince": "okres Pardubice",
        "Postcode": "53352",
        "CountryID": 64,
        "Latitude": 50.0623004,
        "Longitude": 15.7751061,
        "ContactTelephone1": "+420725767373",
        "ContactEmail": "LK.elektro@tiscali.cz",
        "AccessComments": "Operator EVmapa.cz\r\nNabíječka BLUE electric POWER 18 kW = DC 450V, 40A.\r\nV místě je dle provozní doby WC, automat na nápoje, myčka SCF, vysavač a nedaleko restaurace. Vnitřní i venkovní posezení.",
        "RelatedURL": "https://www.evmapa.cz/pardubice-automycka-scf",
        "DistanceUnit": 0
    },
    "Connections": [
        {
            "ID": 142472,
            "ConnectionTypeID": 2,
            "StatusTypeID": 50,
            "LevelID": 3,
            "Amps": 40,
            "Voltage": 450,
            "PowerKW": 18,
            "CurrentTypeID": 30,
            "Quantity": 1
        },
        {
            "ID": 142473,
            "ConnectionTypeID": 33,
            "StatusTypeID": 50,
            "LevelID": 3,
            "Amps": 40,
            "Voltage": 450,
            "PowerKW": 18,
            "CurrentTypeID": 30,
            "Quantity": 1
        },
        {
            "ID": 142474,
            "ConnectionTypeID": 25,
            "StatusTypeID": 50,
            "LevelID": 2,
            "Amps": 32,
            "Voltage": 400,
            "PowerKW": 22,
            "CurrentTypeID": 20,
            "Quantity": 1
        }
    ],
    "NumberOfPoints": 1,
    "StatusTypeID": 50,
    "DateLastStatusUpdate": "2018-03-11T10:55:00Z",
    "DataQualityLevel": 1,
    "DateCreated": "2018-03-10T18:15:00Z",
    "SubmissionStatusTypeID": 200
}