{
    "IsRecentlyVerified": false,
    "ID": 32927,
    "UUID": "38DE7DE7-0F83-4A62-92D6-D11A72813325",
    "DataProviderID": 26,
    "DataProvidersReference": "35044",
    "OperatorID": 73,
    "OperatorsReference": "EV-Box EVB-P1339034",
    "UsageCost": "0.00 jaarabonnement",
    "AddressInfo": {
        "ID": 33273,
        "Title": "Industrieweg",
        "AddressLine1": "Industrieweg",
        "Town": "Zundert",
        "Postcode": "4881 GJ",
        "CountryID": 159,
        "Latitude": 51.46631,
        "Longitude": 4.6582,
        "RelatedURL": "http://www.ev-box.nl",
        "DistanceUnit": 0
    },
    "Connections": [
        {
            "ID": 36438,
            "ConnectionTypeID": 25,
            "LevelID": 2,
            "PowerKW": 11,
            "CurrentTypeID": 10
        },
        {
            "ID": 46602,
            "ConnectionTypeID": 25,
            "LevelID": 2,
            "PowerKW": 11
        }
    ],
    "NumberOfPoints": 1,
    "StatusTypeID": 50,
    "DateLastStatusUpdate": "2016-06-04T02:39:00Z",
    "DataQualityLevel": 3,
    "DateCreated": "2015-01-09T06:03:00Z",
    "SubmissionStatusTypeID": 100
}