{
    "IsRecentlyVerified": false,
    "ID": 15074,
    "UUID": "4AEEF809-C4D2-4FEC-B18F-71A87BCBF0D7",
    "DataProviderID": 1,
    "OperatorID": 45,
    "OperatorsReference": "Doolin Camping and Caravan Park",
    "UsageTypeID": 7,
    "AddressInfo": {
        "ID": 15420,
        "Title": "Doolin Camping and Caravan Park",
        "AddressLine1": "Doolin",
        "Town": "Clare",
        "StateOrProvince": "County Clare",
        "CountryID": 3,
        "Latitude": 53.016332,
        "Longitude": -9.40154,
        "DistanceUnit": 0
    },
    "Connections": [
        {
            "ID": 92009,
            "ConnectionTypeID": 25,
            "StatusTypeID": 50,
            "LevelID": 2,
            "Amps": 16,
            "Voltage": 230,
            "PowerKW": 3.7,
            "CurrentTypeID": 10,
            "Quantity": 1
        }
    ],
    "NumberOfPoints": 1,
    "StatusTypeID": 50,
    "DateLastStatusUpdate": "2016-05-23T15:27:00Z",
    "DataQualityLevel": 2,
    "DateCreated": "2012-12-11T15:08:00Z",
    "SubmissionStatusTypeID": 100
}