{
    "IsRecentlyVerified": false,
    "ID": 4810,
    "UUID": "22242757-F909-4010-84ED-8AA9E86CBB1C",
    "DataProviderID": 2,
    "DataProvidersReference": "39853",
    "UsageTypeID": 7,
    "AddressInfo": {
        "ID": 4753,
        "Title": "Avondale Nissan",
        "AddressLine1": "10305 W Papago Fwy",
        "Town": "Avondale",
        "StateOrProvince": "AZ",
        "Postcode": "85323",
        "CountryID": 2,
        "Latitude": 33.459826,
        "Longitude": -112.284168,
        "ContactTelephone1": "888-390-9140",
        "AccessComments": "Dealership business hours\r\nPublic - Call ahead",
        "RelatedURL": "",
        "DistanceUnit": 0
    },
    "Connections": [
        {
            "ID": 15864,
            "ConnectionTypeID": 1,
            "LevelID": 2,
            "Amps": 16,
            "Voltage": 230,
            "PowerKW": 3.7,
            "CurrentTypeID": 10,
            "Quantity": 1
        },
        {
            "ID": 20837,
            "ConnectionTypeID": 1,
            "LevelID": 2,
            "Quantity": 1
        }
    ],
    "DateLastConfirmed": "2011-05-31T00:00:00Z",
    "StatusTypeID": 0,
    "DateLastStatusUpdate": "2020-06-26T02:55:00Z",
    "DataQualityLevel": 1,
    "DateCreated": "2011-07-04T18:02:00Z",
    "SubmissionStatusTypeID": 100
}