{
    "IsRecentlyVerified": false,
    "ID": 77458,
    "UUID": "D008D80F-036B-42F6-9E17-58BB0943AC0E",
    "DataProviderID": 1,
    "OperatorID": 156,
    "UsageTypeID": 4,
    "AddressInfo": {
        "ID": 77804,
        "Title": "Bahnhofsvorplatz",
        "AddressLine1": "Bahnhofstraße 11a",
        "Town": "Crimmitschau",
        "StateOrProvince": "Crimmitschau-Dennheritz",
        "Postcode": "08451",
        "CountryID": 87,
        "Latitude": 50.81527798317197,
        "Longitude": 12.391896880950988,
        "AccessComments": "24/7 nutzbar",
        "DistanceUnit": 0
    },
    "Connections": [
        {
            "ID": 111609,
            "ConnectionTypeID": 25,
            "StatusTypeID": 50,
            "LevelID": 2,
            "Amps": 32,
            "Voltage": 400,
            "PowerKW": 22,
            "CurrentTypeID": 20,
            "Quantity": 2
        }
    ],
    "NumberOfPoints": 2,
    "StatusTypeID": 50,
    "DateLastStatusUpdate": "2017-01-16T11:49:00Z",
    "DataQualityLevel": 1,
    "DateCreated": "2017-01-16T11:49:00Z",
    "SubmissionStatusTypeID": 200
}