{
    "IsRecentlyVerified": false,
    "ID": 8993,
    "UUID": "0FF97FCB-8A9E-4C2F-A49A-3D1DB8C37243",
    "DataProviderID": 15,
    "DataProvidersReference": "12304",
    "OperatorID": 5,
    "AddressInfo": {
        "ID": 8890,
        "Title": "20840 West Rd",
        "AddressLine1": "20840 West Rd",
        "Town": "Woodhaven",
        "StateOrProvince": "Michigan",
        "Postcode": "48183",
        "CountryID": 2,
        "Latitude": 42.14107513,
        "Longitude": -83.23352051,
        "ContactTelephone1": "",
        "RelatedURL": "http://carstations.com/12304",
        "DistanceUnit": 0
    },
    "Connections": [
        {
            "ID": 6564,
            "ConnectionTypeID": 1,
            "Reference": "J1772",
            "LevelID": 2
        },
        {
            "ID": 6921,
            "ConnectionTypeID": 9,
            "Reference": "NEMA5",
            "LevelID": 1,
            "Quantity": 1
        }
    ],
    "StatusTypeID": 0,
    "DateLastStatusUpdate": "2017-11-04T14:04:00Z",
    "DataQualityLevel": 1,
    "DateCreated": "2011-12-10T20:50:00Z",
    "SubmissionStatusTypeID": 100
}