{
    "IsRecentlyVerified": false,
    "ID": 54264,
    "UUID": "272F630F-8237-4BD4-801F-9D47D10B7E94",
    "DataProviderID": 1,
    "OperatorID": 173,
    "UsageTypeID": 4,
    "AddressInfo": {
        "ID": 54610,
        "Title": "BMW Lenbachplatz",
        "AddressLine1": "Lenbachplatz 7a",
        "Town": "München",
        "StateOrProvince": "Bayern",
        "Postcode": "80333",
        "CountryID": 87,
        "Latitude": 48.14035940689455,
        "Longitude": 11.568539739742265,
        "AccessComments": "Rund um die Uhr (24/7) nutzbar. Position: Zufahrt über Maxburgstraße\r\n",
        "DistanceUnit": 0
    },
    "Connections": [
        {
            "ID": 68300,
            "ConnectionTypeID": 25,
            "StatusTypeID": 50,
            "LevelID": 2,
            "Amps": 32,
            "Voltage": 400,
            "PowerKW": 22,
            "CurrentTypeID": 20,
            "Quantity": 1
        },
        {
            "ID": 68301,
            "ConnectionTypeID": 33,
            "StatusTypeID": 50,
            "LevelID": 3,
            "PowerKW": 20,
            "CurrentTypeID": 30,
            "Quantity": 1
        }
    ],
    "NumberOfPoints": 2,
    "StatusTypeID": 50,
    "DateLastStatusUpdate": "2017-01-20T06:29:00Z",
    "DataQualityLevel": 1,
    "DateCreated": "2015-09-25T15:39:00Z",
    "SubmissionStatusTypeID": 200
}