{
    "IsRecentlyVerified": false,
    "ID": 46459,
    "UUID": "F0844B2E-9721-4B99-815A-364BF0BF909B",
    "DataProviderID": 1,
    "DataProvidersReference": "788",
    "AddressInfo": {
        "ID": 46805,
        "Title": "Slåtthaug videregående skole, Nesttun",
        "AddressLine1": "Slåtthaugvegen 134",
        "Town": "NESTTUN",
        "StateOrProvince": "Vestland",
        "Postcode": "5222",
        "CountryID": 168,
        "Latitude": 60.309262,
        "Longitude": 5.357525,
        "AccessComments": "Disse plassene er offentlige fra 1600 - 0700. Like ved idrettsanlegg.",
        "DistanceUnit": 0
    },
    "Connections": [
        {
            "ID": 57122,
            "ConnectionTypeID": 0,
            "Reference": "1",
            "LevelID": 2,
            "Amps": 16,
            "Voltage": 230,
            "PowerKW": 3.7,
            "Comments": "Mode 1"
        },
        {
            "ID": 86751,
            "ConnectionTypeID": 0,
            "Reference": "2",
            "LevelID": 2,
            "Amps": 16,
            "Voltage": 230,
            "PowerKW": 3.7,
            "Comments": "Mode 1"
        },
        {
            "ID": 86752,
            "ConnectionTypeID": 0,
            "Reference": "3",
            "LevelID": 2,
            "Amps": 16,
            "Voltage": 230,
            "PowerKW": 3.7,
            "Comments": "Mode 1"
        },
        {
            "ID": 88963,
            "ConnectionTypeID": 0,
            "Reference": "4",
            "LevelID": 2,
            "Amps": 16,
            "Voltage": 230,
            "PowerKW": 3.7,
            "Comments": "Mode 1"
        }
    ],
    "NumberOfPoints": 4,
    "DateLastStatusUpdate": "2020-05-26T08:24:00Z",
    "DataQualityLevel": 2,
    "DateCreated": "2015-05-03T00:54:00Z",
    "SubmissionStatusTypeID": 100
}