{
    "IsRecentlyVerified": false,
    "ID": 182321,
    "UUID": "5F417FA7-807A-472C-8962-8F9A16B5A8A4",
    "DataProviderID": 29,
    "DataProvidersReference": "7582",
    "AddressInfo": {
        "ID": 182680,
        "Title": "Volksbadstraße ggüb. 85",
        "AddressLine1": "Volksbadstraße ggüb. 85",
        "Town": "Mönchengladbach",
        "Postcode": "41065",
        "CountryID": 87,
        "Latitude": 51.19881,
        "Longitude": 6.47299,
        "DistanceUnit": 0
    },
    "Connections": [
        {
            "ID": 287916,
            "ConnectionTypeID": 25,
            "StatusTypeID": 50,
            "LevelID": 2,
            "PowerKW": 22,
            "CurrentTypeID": 20
        },
        {
            "ID": 287917,
            "ConnectionTypeID": 25,
            "StatusTypeID": 50,
            "LevelID": 2,
            "PowerKW": 22,
            "CurrentTypeID": 20
        }
    ],
    "StatusTypeID": 50,
    "DateLastStatusUpdate": "2021-07-09T03:22:00Z",
    "MetadataValues": [
        {
            "ID": 14615,
            "MetadataFieldID": 4,
            "ItemValue": "Data from the German chargepoint registry provided by Bundesnetzagentur.de under the CC-BY 4.0 license"
        }
    ],
    "DataQualityLevel": 3,
    "DateCreated": "2021-07-08T10:02:00Z",
    "SubmissionStatusTypeID": 100
}