{
    "IsRecentlyVerified": false,
    "ID": 38497,
    "UUID": "4EC742B2-1903-4BEF-90BB-04AF9174348E",
    "DataProviderID": 26,
    "DataProvidersReference": "48157",
    "OperatorID": 178,
    "OperatorsReference": "EVnetNL EV0038",
    "UsageCost": "0.00 jaarabonnement",
    "AddressInfo": {
        "ID": 38843,
        "Title": "Tuin van Kapitein Rommel 15",
        "AddressLine1": "Tuin van Kapitein Rommel 15",
        "Town": "Castricum",
        "Postcode": "1901 DZ",
        "CountryID": 159,
        "Latitude": 52.544901,
        "Longitude": 4.660249,
        "ContactTelephone1": "0800-3522365",
        "RelatedURL": "http://www.evnet.nl",
        "DistanceUnit": 0
    },
    "Connections": [
        {
            "ID": 42008,
            "ConnectionTypeID": 25,
            "LevelID": 2,
            "PowerKW": 11,
            "CurrentTypeID": 10
        },
        {
            "ID": 49705,
            "ConnectionTypeID": 25,
            "LevelID": 2,
            "PowerKW": 11,
            "CurrentTypeID": 10
        }
    ],
    "NumberOfPoints": 1,
    "StatusTypeID": 50,
    "DateLastStatusUpdate": "2016-06-04T02:55:00Z",
    "DataQualityLevel": 3,
    "DateCreated": "2015-01-09T06:07:00Z",
    "SubmissionStatusTypeID": 100
}