{
    "IsRecentlyVerified": false,
    "ID": 54695,
    "UUID": "6A711E10-1DE2-41F6-8588-90351B9E4B1E",
    "DataProviderID": 26,
    "DataProvidersReference": "71258",
    "OperatorID": 103,
    "OperatorsReference": "Allego NLALLEGO0003401",
    "UsageCost": "0.00 jaarabonnement",
    "AddressInfo": {
        "ID": 55041,
        "Title": "Cronesteinkade 28",
        "AddressLine1": "Cronesteinkade 28",
        "Town": "Leiden",
        "Postcode": "2313 GX",
        "CountryID": 159,
        "Latitude": 52.15109693,
        "Longitude": 4.49755524,
        "ContactTelephone1": "0800-3745337",
        "RelatedURL": "http://www.allego.eu/",
        "DistanceUnit": 0
    },
    "Connections": [
        {
            "ID": 69069,
            "ConnectionTypeID": 25,
            "LevelID": 2,
            "PowerKW": 11,
            "CurrentTypeID": 10
        },
        {
            "ID": 69070,
            "ConnectionTypeID": 25,
            "LevelID": 2,
            "PowerKW": 11,
            "CurrentTypeID": 10
        }
    ],
    "NumberOfPoints": 1,
    "StatusTypeID": 50,
    "DateLastStatusUpdate": "2016-06-04T02:51:00Z",
    "DataQualityLevel": 3,
    "DateCreated": "2015-10-09T06:18:00Z",
    "SubmissionStatusTypeID": 100
}