{
    "IsRecentlyVerified": false,
    "ID": 95811,
    "UUID": "CE130CE0-D4CF-4BE7-9D0C-DEBE4B5DE661",
    "DataProviderID": 1,
    "UsageTypeID": 0,
    "AddressInfo": {
        "ID": 96157,
        "Title": " Sky Car Srl",
        "AddressLine1": "Via Feliciano Fedeli, 6",
        "Town": "Foligno ",
        "StateOrProvince": "PG",
        "Postcode": "06034",
        "CountryID": 112,
        "Latitude": 42.97264346177814,
        "Longitude": 12.685576633487488,
        "RelatedURL": "http://skycaritalia.it/",
        "DistanceUnit": 0
    },
    "Connections": [
        {
            "ID": 135716,
            "ConnectionTypeID": 25,
            "StatusTypeID": 0,
            "LevelID": 2,
            "Quantity": 1
        }
    ],
    "NumberOfPoints": 1,
    "GeneralComments": "Per utilizzarlo  serve l'APP Spotlink http://www.emotion-team.com/spotlink/",
    "StatusTypeID": 50,
    "DateLastStatusUpdate": "2017-11-25T13:30:00Z",
    "DataQualityLevel": 1,
    "DateCreated": "2017-11-25T13:30:00Z",
    "SubmissionStatusTypeID": 200
}