{
    "IsRecentlyVerified": false,
    "ID": 124165,
    "UUID": "012260E5-1300-4099-88A7-3F1578C64580",
    "DataProviderID": 2,
    "DataProvidersReference": "74277",
    "OperatorID": 5,
    "UsageTypeID": 1,
    "AddressInfo": {
        "ID": 124511,
        "Title": "HOMEWOOD SUITES",
        "AddressLine1": "1103 Embarcadero",
        "Town": "Oakland",
        "StateOrProvince": "CA",
        "Postcode": "94606",
        "CountryID": 2,
        "Latitude": 37.788073,
        "Longitude": -122.252071,
        "ContactTelephone1": "888-758-4389",
        "AccessComments": "24 hours daily",
        "RelatedURL": "http://www.chargepoint.com/",
        "DistanceUnit": 0
    },
    "Connections": [
        {
            "ID": 174228,
            "ConnectionTypeID": 32,
            "LevelID": 3,
            "Amps": 100,
            "Voltage": 400,
            "PowerKW": 40,
            "CurrentTypeID": 30,
            "Quantity": 1
        }
    ],
    "DateLastStatusUpdate": "2019-12-24T09:14:00Z",
    "DataQualityLevel": 3,
    "DateCreated": "2019-04-06T05:03:00Z",
    "SubmissionStatusTypeID": 100
}