{
    "IsRecentlyVerified": false,
    "ID": 116081,
    "UUID": "5811C7A8-673A-49B6-9556-1A5A3A9106FF",
    "DataProviderID": 2,
    "DataProvidersReference": "117458",
    "OperatorID": 5,
    "UsageTypeID": 1,
    "AddressInfo": {
        "ID": 116427,
        "Title": "MULLIGANS",
        "AddressLine1": "926 Western Avenue",
        "Town": "Manchester",
        "StateOrProvince": "ME",
        "Postcode": "04351",
        "CountryID": 2,
        "Latitude": 44.3245283,
        "Longitude": -69.8606738,
        "ContactTelephone1": "888-758-4389",
        "AccessComments": "24 hours daily",
        "RelatedURL": "http://www.chargepoint.com/",
        "DistanceUnit": 0
    },
    "Connections": [
        {
            "ID": 163143,
            "ConnectionTypeID": 1,
            "LevelID": 2,
            "Amps": 16,
            "Voltage": 230,
            "PowerKW": 3.7,
            "CurrentTypeID": 10,
            "Quantity": 2
        }
    ],
    "DateLastStatusUpdate": "2020-06-26T03:07:00Z",
    "DataQualityLevel": 3,
    "DateCreated": "2019-02-11T07:13:00Z",
    "SubmissionStatusTypeID": 100
}