{
    "MediaItems": [
        {
            "ID": 5964,
            "ChargePointID": 47277,
            "ItemURL": "https://s3-ap-southeast-2.amazonaws.com/openchargemap/images/IT/OCM47277/OCM-47277.orig.2016022709070136.jpg",
            "ItemThumbnailURL": "https://s3-ap-southeast-2.amazonaws.com/openchargemap/images/IT/OCM47277/OCM-47277.thmb.2016022709070136.jpg",
            "Comment": "All charging equipments",
            "IsEnabled": true,
            "IsVideo": false,
            "IsFeaturedItem": false,
            "IsExternalResource": false,
            "User": {
                "ID": 4857,
                "Username": "Pasquale"
            },
            "DateCreated": "2016-02-27T09:07:00Z"
        },
        {
            "ID": 1499,
            "ChargePointID": 47277,
            "ItemURL": "https://s3-ap-southeast-2.amazonaws.com/openchargemap/images/IT/OCM47277/OCM-47277.orig.2015052708210803.jpg",
            "ItemThumbnailURL": "https://s3-ap-southeast-2.amazonaws.com/openchargemap/images/IT/OCM47277/OCM-47277.thmb.2015052708210803.jpg",
            "Comment": "The box has a key that locks plugs during charge",
            "IsEnabled": true,
            "IsVideo": false,
            "IsFeaturedItem": false,
            "IsExternalResource": false,
            "User": {
                "ID": 4858,
                "Username": "Pasquale Pizzichetti"
            },
            "DateCreated": "2015-05-27T08:21:00Z"
        }
    ],
    "IsRecentlyVerified": false,
    "ID": 47277,
    "UUID": "E63135EA-00B9-4ADA-B1E7-8856FB065935",
    "DataProviderID": 1,
    "OperatorID": 44,
    "UsageTypeID": 6,
    "UsageCost": "5 Euro first hour, then 3 Euro following hours",
    "AddressInfo": {
        "ID": 47623,
        "Title": "Agenzia ABC di Cascarino",
        "AddressLine1": "viale Lepanto 99",
        "AddressLine2": "Porto Santa Margherita",
        "Town": "Caorle",
        "StateOrProvince": "Venezia",
        "Postcode": "30021",
        "CountryID": 112,
        "Latitude": 45.5859972264065,
        "Longitude": 12.8546950717224,
        "ContactTelephone1": "+393482602491",
        "ContactTelephone2": "+390421260066",
        "ContactEmail": "ik3ngu@gmail.com",
        "AccessComments": "Autoroute A4 from Venice to Trieste, then go out at San Stino di Livenza gate and drive until you reach Caorle. Before Bridge turn right towards Eraclea. After 2,5 km turn left into Porto Santa Margherita and search for viale Lepanto 99.",
        "RelatedURL": "http://www.abcmare.it",
        "DistanceUnit": 0
    },
    "Connections": [
        {
            "ID": 58287,
            "ConnectionTypeID": 13,
            "StatusTypeID": 50,
            "LevelID": 2,
            "Amps": 32,
            "Voltage": 220,
            "PowerKW": 7,
            "CurrentTypeID": 10,
            "Quantity": 1
        },
        {
            "ID": 78222,
            "ConnectionTypeID": 0,
            "StatusTypeID": 50,
            "LevelID": 2,
            "Amps": 16,
            "Voltage": 230,
            "PowerKW": 3,
            "CurrentTypeID": 10,
            "Quantity": 1
        }
    ],
    "NumberOfPoints": 2,
    "GeneralComments": "Real estate and Torurist Agency in Porto Santa Margherita very near Caorle (Venice - Italy). We offer charge point to our customers that stay on holiday in our apartments and villas.",
    "StatusTypeID": 50,
    "DateLastStatusUpdate": "2017-07-10T15:22:00Z",
    "DataQualityLevel": 1,
    "DateCreated": "2015-05-22T16:10:00Z",
    "SubmissionStatusTypeID": 200
}