{
    "IsRecentlyVerified": false,
    "ID": 51496,
    "UUID": "21A0BC9E-7DFF-42B1-960F-D49525DBF3A4",
    "DataProviderID": 1,
    "OperatorID": 69,
    "UsageTypeID": 4,
    "AddressInfo": {
        "ID": 51842,
        "Title": "Seidlstraße",
        "AddressLine1": "Seidlstraße 20",
        "Town": "München",
        "StateOrProvince": "Bayern",
        "Postcode": "80335",
        "CountryID": 87,
        "Latitude": 48.1446312283547,
        "Longitude": 11.5577142030411,
        "ContactTelephone1": "+49 89 3810101",
        "AccessComments": "1 kostenloser Parkplätze, 24/7 Laden mit Ladekarte von Ladenetz, EWE, WSW, ladeticket, TNM oder Charge&Fuel.",
        "RelatedURL": "http://www.swm.de/privatkunden/unternehmen/innovation/elektromobilitaet/swm-ladestationen.html",
        "DistanceUnit": 0
    },
    "Connections": [
        {
            "ID": 63806,
            "ConnectionTypeID": 25,
            "StatusTypeID": 50,
            "LevelID": 2,
            "Amps": 32,
            "Voltage": 400,
            "PowerKW": 22,
            "CurrentTypeID": 20,
            "Quantity": 2
        },
        {
            "ID": 63807,
            "ConnectionTypeID": 28,
            "StatusTypeID": 50,
            "LevelID": 2,
            "Amps": 16,
            "Voltage": 230,
            "PowerKW": 3.7,
            "CurrentTypeID": 10,
            "Quantity": 2
        }
    ],
    "NumberOfPoints": 1,
    "StatusTypeID": 50,
    "DateLastStatusUpdate": "2015-07-27T11:33:00Z",
    "DataQualityLevel": 1,
    "DateCreated": "2015-07-27T09:00:00Z",
    "SubmissionStatusTypeID": 200
}