{
    "IsRecentlyVerified": false,
    "ID": 99990,
    "UUID": "1C6D08EE-5C40-4E6D-AF48-01B0D800878C",
    "DataProviderID": 1,
    "OperatorID": 23,
    "OperatorsReference": "40575",
    "UsageTypeID": 4,
    "AddressInfo": {
        "ID": 100336,
        "Title": "Springhill Suites By Marriott Charleston North",
        "AddressLine1": "7535 N Forest DR",
        "Town": "North Charleston",
        "StateOrProvince": "South Carolina",
        "Postcode": "29420",
        "CountryID": 2,
        "Latitude": 32.9388585,
        "Longitude": -80.0529389,
        "ContactTelephone1": "(843) 572-8866",
        "DistanceUnit": 0
    },
    "Connections": [
        {
            "ID": 141242,
            "ConnectionTypeID": 30,
            "StatusTypeID": 50,
            "LevelID": 2,
            "PowerKW": 16,
            "CurrentTypeID": 20,
            "Quantity": 2
        }
    ],
    "NumberOfPoints": 2,
    "GeneralComments": "2 Tesla Connectors, up to 16kW.Available for customers. Please see front desk.",
    "StatusTypeID": 50,
    "DateLastStatusUpdate": "2018-02-09T06:50:00Z",
    "DataQualityLevel": 1,
    "DateCreated": "2018-02-09T06:50:00Z",
    "SubmissionStatusTypeID": 200
}