{
    "IsRecentlyVerified": false,
    "ID": 141859,
    "UUID": "7B47FA92-3720-4562-9AC5-A11FE7DA92F3",
    "DataProviderID": 2,
    "DataProvidersReference": "148153",
    "OperatorID": 39,
    "UsageTypeID": 1,
    "AddressInfo": {
        "ID": 142211,
        "Title": "Volvo Powertrain NA",
        "AddressLine1": "13302 Pennsylvania Ave",
        "Town": "Hagerstown",
        "StateOrProvince": "MD",
        "Postcode": "21742",
        "CountryID": 2,
        "Latitude": 39.6790139,
        "Longitude": -77.7201762,
        "ContactTelephone1": "800-663-5633",
        "AccessComments": "MO: Not Specified; TU: Not Specified; WE: Not Specified; TH: Not Specified; FR: Not Specified; SA: Not Specified; SU: Not Specified",
        "RelatedURL": "http://www.semacharge.com/",
        "DistanceUnit": 0
    },
    "Connections": [
        {
            "ID": 197892,
            "ConnectionTypeID": 1,
            "LevelID": 2,
            "Amps": 16,
            "Voltage": 230,
            "PowerKW": 3.7,
            "CurrentTypeID": 10,
            "Quantity": 2
        }
    ],
    "StatusTypeID": 50,
    "DateLastStatusUpdate": "2020-06-26T03:02:00Z",
    "DataQualityLevel": 3,
    "DateCreated": "2019-12-24T09:16:00Z",
    "SubmissionStatusTypeID": 100
}