{
    "IsRecentlyVerified": false,
    "ID": 147974,
    "UUID": "1C7BFE41-2872-493F-8BF8-EE74B1C38D49",
    "DataProviderID": 1,
    "OperatorID": 80,
    "UsageTypeID": 4,
    "AddressInfo": {
        "ID": 148326,
        "Title": "CLUSONE Defendente | ENELX ",
        "AddressLine1": "Via San Defendente",
        "Town": "Clusone",
        "StateOrProvince": "BG",
        "Postcode": "24023",
        "CountryID": 112,
        "Latitude": 45.89148122363105,
        "Longitude": 9.952019494593628,
        "ContactTelephone1": "800.069.850",
        "RelatedURL": "https://www.enelx.com/it/it/emobility",
        "DistanceUnit": 0
    },
    "Connections": [
        {
            "ID": 205425,
            "ConnectionTypeID": 25,
            "StatusTypeID": 50,
            "LevelID": 2,
            "Amps": 32,
            "Voltage": 400,
            "PowerKW": 22,
            "CurrentTypeID": 20,
            "Quantity": 2
        }
    ],
    "NumberOfPoints": 2,
    "StatusTypeID": 50,
    "DateLastStatusUpdate": "2020-01-21T17:13:00Z",
    "DataQualityLevel": 1,
    "DateCreated": "2020-01-21T17:13:00Z",
    "SubmissionStatusTypeID": 200
}