{
    "IsRecentlyVerified": false,
    "ID": 173715,
    "UUID": "EAE75863-8143-4311-8F21-DCB7D69D73A8",
    "DataProviderID": 18,
    "DataProvidersReference": "58f9067fdaf69fdde42cf95d8daacfde",
    "OperatorID": 20,
    "UsageTypeID": 4,
    "AddressInfo": {
        "ID": 174074,
        "Title": "Middlesbrough",
        "AddressLine1": "Windward Way",
        "Town": "Middlesbrough",
        "Postcode": "TS2 1QG",
        "CountryID": 1,
        "Latitude": 54.577356,
        "Longitude": -1.226179,
        "AccessComments": "Windward Way",
        "RelatedURL": "http://www.chargeyourcar.org.uk",
        "DistanceUnit": 0
    },
    "Connections": [
        {
            "ID": 266900,
            "ConnectionTypeID": 25,
            "Reference": "0",
            "StatusTypeID": 50,
            "LevelID": 2,
            "Amps": 32,
            "Voltage": 230,
            "PowerKW": 7,
            "CurrentTypeID": 10
        },
        {
            "ID": 266901,
            "ConnectionTypeID": 25,
            "Reference": "1",
            "StatusTypeID": 50,
            "LevelID": 2,
            "Amps": 32,
            "Voltage": 230,
            "PowerKW": 7,
            "CurrentTypeID": 10
        }
    ],
    "StatusTypeID": 0,
    "DateLastStatusUpdate": "2021-03-03T11:25:00Z",
    "MetadataValues": [
        {
            "ID": 8637,
            "MetadataFieldID": 4,
            "ItemValue": "Contains public sector information licensed under the Open Government Licence v2.0. http://www.nationalarchives.gov.uk/doc/open-government-licence/version/2/"
        }
    ],
    "DataQualityLevel": 3,
    "DateCreated": "2021-03-03T11:25:00Z",
    "SubmissionStatusTypeID": 100
}