{
    "IsRecentlyVerified": false,
    "ID": 175369,
    "UUID": "B4815131-F891-4E6A-A3C9-7ECB52C4A0F6",
    "DataProviderID": 1,
    "OperatorID": 121,
    "UsageTypeID": 4,
    "UsageCost": "0",
    "AddressInfo": {
        "ID": 175728,
        "Title": "Posthornstraße",
        "AddressLine1": "Posthornstraße",
        "Town": "Hanover",
        "StateOrProvince": "Lower Saxony",
        "Postcode": "30449",
        "CountryID": 87,
        "Latitude": 52.364336498586226,
        "Longitude": 9.71526574228983,
        "AccessComments": "24/7 verfügbare Ladestation an einem Lichtmast. Freischaltbar auch mit EnBW/ADAC, PlugSurfing, EinfachStromLaden u.v.a. Ladekarten / Apps. ",
        "DistanceUnit": 0
    },
    "Connections": [
        {
            "ID": 272044,
            "ConnectionTypeID": 25,
            "StatusTypeID": 50,
            "LevelID": 2,
            "Amps": 32,
            "Voltage": 400,
            "PowerKW": 22,
            "CurrentTypeID": 20,
            "Quantity": 1
        }
    ],
    "NumberOfPoints": 1,
    "StatusTypeID": 50,
    "DateLastStatusUpdate": "2021-05-16T14:59:00Z",
    "DataQualityLevel": 1,
    "DateCreated": "2021-05-14T12:53:00Z",
    "SubmissionStatusTypeID": 200
}