{
    "IsRecentlyVerified": false,
    "ID": 122597,
    "UUID": "CBA1A691-0925-413B-8C3F-34F478E7C333",
    "DataProviderID": 2,
    "DataProvidersReference": "67302",
    "UsageTypeID": 1,
    "AddressInfo": {
        "ID": 122943,
        "Title": "Los Angeles County Sheriff - La Crescenta Station",
        "AddressLine1": "4554 Briggs Ave",
        "Town": "La Crescenta",
        "StateOrProvince": "CA",
        "Postcode": "91214",
        "CountryID": 2,
        "Latitude": 34.220972,
        "Longitude": -118.230266,
        "ContactTelephone1": "323-267-2023",
        "AccessComments": "24 hours daily; keypad activated, instructions on EVSE",
        "RelatedURL": "",
        "DistanceUnit": 0
    },
    "Connections": [
        {
            "ID": 172502,
            "ConnectionTypeID": 1,
            "LevelID": 2,
            "Amps": 16,
            "Voltage": 230,
            "PowerKW": 3.7,
            "CurrentTypeID": 10,
            "Quantity": 1
        }
    ],
    "DateLastStatusUpdate": "2020-06-26T02:57:00Z",
    "DataQualityLevel": 3,
    "DateCreated": "2019-04-06T05:03:00Z",
    "SubmissionStatusTypeID": 100
}