{
    "IsRecentlyVerified": false,
    "ID": 139913,
    "UUID": "7AEA02BD-B69C-4210-8349-1BAB83971542",
    "DataProviderID": 2,
    "DataProvidersReference": "95958",
    "OperatorID": 9,
    "UsageTypeID": 2,
    "AddressInfo": {
        "ID": 140265,
        "Title": "El Camino Shopping Center",
        "AddressLine1": "23335 Mulholand Drive",
        "Town": "Woodland Hills",
        "StateOrProvince": "CA",
        "Postcode": "91364",
        "CountryID": 2,
        "Latitude": 34.155972,
        "Longitude": -118.633389,
        "ContactTelephone1": "888-998-2546",
        "AccessComments": "MON: 24 hours | TUE: 24 hours | WED: 24 hours | THU: 24 hours | FRI: 24 hours | SAT: 24 hours | SUN: 24 hours",
        "RelatedURL": "http://www.blinkcharging.com/",
        "DistanceUnit": 0
    },
    "Connections": [
        {
            "ID": 195410,
            "ConnectionTypeID": 1,
            "LevelID": 2,
            "Amps": 16,
            "Voltage": 230,
            "PowerKW": 3.7,
            "CurrentTypeID": 10,
            "Quantity": 2
        }
    ],
    "StatusTypeID": 50,
    "DateLastStatusUpdate": "2020-06-26T02:57:00Z",
    "DataQualityLevel": 3,
    "DateCreated": "2019-12-24T09:11:00Z",
    "SubmissionStatusTypeID": 100
}