{
    "IsRecentlyVerified": false,
    "ID": 110966,
    "UUID": "C72CED87-DC33-412D-AE2D-B0BDF52CA3A4",
    "DataProviderID": 2,
    "DataProvidersReference": "91501",
    "OperatorID": 5,
    "UsageTypeID": 1,
    "AddressInfo": {
        "ID": 111312,
        "Title": "TRIOVEST INC.",
        "AddressLine1": "5015 Spectrum Way",
        "Town": "Mississauga",
        "StateOrProvince": "ON",
        "Postcode": "L4W 0E4",
        "CountryID": 44,
        "Latitude": 43.649772,
        "Longitude": -79.607026,
        "ContactTelephone1": "888-758-4389",
        "AccessComments": "24 hours daily",
        "RelatedURL": "http://www.chargepoint.com/",
        "DistanceUnit": 0
    },
    "Connections": [
        {
            "ID": 156296,
            "ConnectionTypeID": 1,
            "LevelID": 2,
            "Amps": 16,
            "Voltage": 230,
            "PowerKW": 3,
            "CurrentTypeID": 10,
            "Quantity": 10
        }
    ],
    "DateLastStatusUpdate": "2019-12-24T09:21:00Z",
    "DataQualityLevel": 3,
    "DateCreated": "2018-10-18T23:36:00Z",
    "SubmissionStatusTypeID": 100
}