{
    "IsRecentlyVerified": false,
    "ID": 47413,
    "UUID": "285B8249-1796-4E59-B398-41596A338094",
    "DataProviderID": 2,
    "DataProvidersReference": "67078",
    "OperatorID": 5,
    "UsageTypeID": 1,
    "AddressInfo": {
        "ID": 47759,
        "Title": "TANGER",
        "AddressLine1": "311 Stanley K Tanger Dr",
        "Town": "Lancaster",
        "StateOrProvince": "PA",
        "Postcode": "17602",
        "CountryID": 2,
        "Latitude": 40.025364,
        "Longitude": -76.220792,
        "ContactTelephone1": "888-758-4389",
        "AccessComments": "24 hours daily",
        "RelatedURL": "http://www.chargepoint.com/",
        "DistanceUnit": 0
    },
    "Connections": [
        {
            "ID": 58452,
            "ConnectionTypeID": 1,
            "LevelID": 2,
            "Amps": 16,
            "Voltage": 230,
            "PowerKW": 3.7,
            "CurrentTypeID": 10,
            "Quantity": 4
        }
    ],
    "DateLastStatusUpdate": "2020-06-26T03:02:00Z",
    "DataQualityLevel": 3,
    "DateCreated": "2015-05-27T08:51:00Z",
    "SubmissionStatusTypeID": 100
}