{
    "IsRecentlyVerified": false,
    "ID": 79846,
    "UUID": "8CD5E270-73AD-4C7E-A288-C7699D02BF27",
    "DataProviderID": 1,
    "OperatorID": 23,
    "OperatorsReference": "24112",
    "UsageTypeID": 6,
    "UsageCost": "Free",
    "AddressInfo": {
        "ID": 80192,
        "Title": "Alpin Life Hotel Gebhard Fiss",
        "AddressLine1": "36 Via Claudia Augusta",
        "Town": "Fiss",
        "StateOrProvince": "Tirol",
        "Postcode": "6533",
        "CountryID": 19,
        "Latitude": 47.055663,
        "Longitude": 10.618127,
        "ContactTelephone1": "+43 5476 6617",
        "DistanceUnit": 0
    },
    "Connections": [
        {
            "ID": 114493,
            "ConnectionTypeID": 30,
            "StatusTypeID": 50,
            "LevelID": 2,
            "Amps": 16,
            "Voltage": 400,
            "PowerKW": 11,
            "CurrentTypeID": 20,
            "Quantity": 1
        }
    ],
    "NumberOfPoints": 1,
    "GeneralComments": "1 Tesla Connector, up to 11kW.Available for patrons only. Please see front desk.",
    "StatusTypeID": 50,
    "DateLastStatusUpdate": "2018-10-03T18:30:00Z",
    "DataQualityLevel": 1,
    "DateCreated": "2017-01-30T13:32:00Z",
    "SubmissionStatusTypeID": 200
}