{
    "IsRecentlyVerified": false,
    "ID": 87478,
    "UUID": "F26B84D2-9B74-4090-81A1-49C5CBFBE827",
    "DataProviderID": 1,
    "OperatorID": 3,
    "OperatorsReference": "PG-91219",
    "UsageTypeID": 6,
    "UsageCost": "1",
    "AddressInfo": {
        "ID": 87824,
        "Title": "Estuary View Medical Centre",
        "AddressLine1": "Boorman Way",
        "Town": "Whitstable",
        "Postcode": "CT5 3SE",
        "CountryID": 1,
        "Latitude": 51.341598,
        "Longitude": 1.013082,
        "DistanceUnit": 0
    },
    "Connections": [
        {
            "ID": 124011,
            "ConnectionTypeID": 25,
            "StatusTypeID": 50,
            "LevelID": 2,
            "Amps": 32,
            "Voltage": 230,
            "PowerKW": 7,
            "CurrentTypeID": 10,
            "Quantity": 1
        }
    ],
    "NumberOfPoints": 1,
    "GeneralComments": "This is an open charge unit installed at the Estuary View Medical Centre site in Boorman Way, Whitstable",
    "StatusTypeID": 0,
    "DateLastStatusUpdate": "2020-01-27T16:47:00Z",
    "DataQualityLevel": 1,
    "DateCreated": "2017-05-11T05:24:00Z",
    "SubmissionStatusTypeID": 200
}