{
    "IsRecentlyVerified": false,
    "ID": 75652,
    "UUID": "ECF7F67F-9DBD-4913-933E-3FB19FC73853",
    "DataProviderID": 1,
    "OperatorID": 45,
    "UsageTypeID": 1,
    "AddressInfo": {
        "ID": 75998,
        "Title": "Supermarkt Lidl",
        "AddressLine1": "Holsterhauser Straße 59",
        "Town": "Herne",
        "StateOrProvince": "Herne",
        "Postcode": "44652",
        "CountryID": 87,
        "Latitude": 51.5241555,
        "Longitude": 7.186307899999974,
        "AccessComments": "Details unbekannt; bitte nachtragen",
        "DistanceUnit": 0
    },
    "Connections": [
        {
            "ID": 109102,
            "ConnectionTypeID": 25,
            "StatusTypeID": 50,
            "LevelID": 2,
            "Amps": 16,
            "Voltage": 400,
            "PowerKW": 11,
            "CurrentTypeID": 20,
            "Quantity": 1
        }
    ],
    "NumberOfPoints": 1,
    "StatusTypeID": 50,
    "DateLastStatusUpdate": "2016-12-19T08:26:00Z",
    "DataQualityLevel": 1,
    "DateCreated": "2016-12-19T08:26:00Z",
    "SubmissionStatusTypeID": 200
}