{
    "IsRecentlyVerified": false,
    "ID": 143295,
    "UUID": "04FEA923-691E-4E41-A453-5B263E69B5C2",
    "DataProviderID": 2,
    "DataProvidersReference": "143241",
    "OperatorID": 5,
    "UsageTypeID": 1,
    "AddressInfo": {
        "ID": 143647,
        "Title": "HUDSON PRESERVE",
        "AddressLine1": "2101 Beryl Way",
        "Town": "Watervliet",
        "StateOrProvince": "NY",
        "Postcode": "12189",
        "CountryID": 2,
        "Latitude": 42.733166,
        "Longitude": -73.727295,
        "ContactTelephone1": "888-758-4389",
        "AccessComments": "24 hours daily",
        "RelatedURL": "http://www.chargepoint.com/",
        "DistanceUnit": 0
    },
    "Connections": [
        {
            "ID": 199591,
            "ConnectionTypeID": 1,
            "LevelID": 2,
            "Amps": 16,
            "Voltage": 230,
            "PowerKW": 3.7,
            "CurrentTypeID": 10,
            "Quantity": 2
        }
    ],
    "StatusTypeID": 50,
    "DateLastStatusUpdate": "2020-06-26T03:06:00Z",
    "DataQualityLevel": 3,
    "DateCreated": "2019-12-24T09:20:00Z",
    "SubmissionStatusTypeID": 100
}