{
    "IsRecentlyVerified": false,
    "ID": 141013,
    "UUID": "46644DBF-817A-4997-B024-ACC177A7B0C5",
    "DataProviderID": 2,
    "DataProvidersReference": "95180",
    "OperatorID": 9,
    "UsageTypeID": 1,
    "AddressInfo": {
        "ID": 141365,
        "Title": "Concord Hilton",
        "AddressLine1": "1970 Diamond Blvd.",
        "Town": "Concord",
        "StateOrProvince": "CA",
        "Postcode": "94520",
        "CountryID": 2,
        "Latitude": 37.971326,
        "Longitude": -122.054309,
        "ContactTelephone1": "888-998-2546",
        "AccessComments": "MON: 24 hours | TUE: 24 hours | WED: 24 hours | THU: 24 hours | FRI: 24 hours | SAT: 24 hours | SUN: 24 hours",
        "RelatedURL": "http://www.blinkcharging.com/",
        "DistanceUnit": 0
    },
    "Connections": [
        {
            "ID": 196814,
            "ConnectionTypeID": 1,
            "LevelID": 2,
            "Amps": 16,
            "Voltage": 230,
            "PowerKW": 3.7,
            "CurrentTypeID": 10,
            "Quantity": 6
        },
        {
            "ID": 196815,
            "ConnectionTypeID": 2,
            "LevelID": 3,
            "Amps": 100,
            "Voltage": 400,
            "PowerKW": 40,
            "CurrentTypeID": 30,
            "Quantity": 2
        }
    ],
    "StatusTypeID": 50,
    "DateLastStatusUpdate": "2020-06-26T02:59:00Z",
    "DataQualityLevel": 3,
    "DateCreated": "2019-12-24T09:14:00Z",
    "SubmissionStatusTypeID": 100
}