{
    "IsRecentlyVerified": false,
    "ID": 97113,
    "UUID": "E683DF4B-EFA5-4B93-93A5-3E73C08E8C2C",
    "DataProviderID": 1,
    "OperatorID": 45,
    "UsageTypeID": 6,
    "AddressInfo": {
        "ID": 97459,
        "Title": "Ferienwohnung Hafenblick",
        "AddressLine1": "Jürgensgaarder Straße 6",
        "Town": "Flensburg",
        "StateOrProvince": "Flensburg",
        "Postcode": "24943",
        "CountryID": 87,
        "Latitude": 54.79044,
        "Longitude": 9.441320000000019,
        "ContactTelephone1": "+49 461 31329986",
        "AccessComments": "24/7 nutzbar für Feriengäste, Wallbox am Stellplatz 8 in der Tiefgarage.",
        "RelatedURL": "http://www.fewo1846.de/objektdetails/hafenblick.html",
        "DistanceUnit": 0
    },
    "Connections": [
        {
            "ID": 137877,
            "ConnectionTypeID": 25,
            "StatusTypeID": 50,
            "LevelID": 2,
            "Amps": 16,
            "Voltage": 400,
            "PowerKW": 11,
            "CurrentTypeID": 20,
            "Quantity": 1
        }
    ],
    "NumberOfPoints": 1,
    "StatusTypeID": 50,
    "DateLastStatusUpdate": "2018-01-05T13:34:00Z",
    "DataQualityLevel": 1,
    "DateCreated": "2018-01-05T13:34:00Z",
    "SubmissionStatusTypeID": 200
}