{
    "IsRecentlyVerified": true,
    "DateLastVerified": "2021-11-01T14:51:00Z",
    "ID": 189756,
    "UUID": "4A6DD60D-3F79-4864-95F3-C23E307CE37A",
    "DataProviderID": 1,
    "OperatorID": 21,
    "UsageTypeID": 4,
    "UsageCost": "Mobi.E compatible card or App",
    "AddressInfo": {
        "ID": 190115,
        "Title": "LRA-00032 - Intermarché",
        "AddressLine1": "Rua de Santo André",
        "Town": "Leiria",
        "StateOrProvince": "Leiria",
        "Postcode": "2400",
        "CountryID": 180,
        "Latitude": 39.74133033077152,
        "Longitude": -8.797079227696997,
        "DistanceUnit": 0
    },
    "Connections": [
        {
            "ID": 307013,
            "ConnectionTypeID": 33,
            "StatusTypeID": 50,
            "LevelID": 3,
            "Amps": 125,
            "Voltage": 500,
            "PowerKW": 50,
            "CurrentTypeID": 30,
            "Quantity": 1
        },
        {
            "ID": 307014,
            "ConnectionTypeID": 2,
            "StatusTypeID": 50,
            "LevelID": 3,
            "Amps": 120,
            "Voltage": 500,
            "PowerKW": 50,
            "CurrentTypeID": 30,
            "Quantity": 1
        },
        {
            "ID": 307015,
            "ConnectionTypeID": 1036,
            "StatusTypeID": 50,
            "LevelID": 3,
            "Amps": 64,
            "Voltage": 400,
            "PowerKW": 43,
            "CurrentTypeID": 20,
            "Quantity": 1
        }
    ],
    "NumberOfPoints": 2,
    "StatusTypeID": 50,
    "DateLastStatusUpdate": "2021-11-01T14:51:00Z",
    "DataQualityLevel": 1,
    "DateCreated": "2021-11-01T14:51:00Z",
    "SubmissionStatusTypeID": 200
}