{
    "IsRecentlyVerified": false,
    "ID": 138637,
    "UUID": "8388CDFE-38D4-4E9E-97B2-E48356504ABF",
    "DataProviderID": 2,
    "DataProvidersReference": "148878",
    "OperatorID": 39,
    "UsageTypeID": 1,
    "AddressInfo": {
        "ID": 138987,
        "Title": "MTS Garage Lot #526",
        "AddressLine1": "1255 Imperial Avenue",
        "Town": "San Diego",
        "StateOrProvince": "CA",
        "Postcode": "92101",
        "CountryID": 2,
        "Latitude": 32.7057287,
        "Longitude": -117.1532674,
        "ContactTelephone1": "800-663-5633",
        "AccessComments": "MO: Not Specified; TU: Not Specified; WE: Not Specified; TH: Not Specified; FR: Not Specified; SA: Not Specified; SU: Not Specified",
        "RelatedURL": "http://www.semacharge.com/",
        "DistanceUnit": 0
    },
    "Connections": [
        {
            "ID": 193803,
            "ConnectionTypeID": 1,
            "LevelID": 2,
            "Amps": 16,
            "Voltage": 230,
            "PowerKW": 3.7,
            "CurrentTypeID": 10,
            "Quantity": 3
        }
    ],
    "StatusTypeID": 50,
    "DateLastStatusUpdate": "2020-06-26T02:55:00Z",
    "DataQualityLevel": 3,
    "DateCreated": "2019-12-24T09:09:00Z",
    "SubmissionStatusTypeID": 100
}