{
    "IsRecentlyVerified": false,
    "ID": 35826,
    "UUID": "7F6E1B97-030C-4625-9970-DCFF5A49462C",
    "DataProviderID": 26,
    "DataProvidersReference": "50515",
    "OperatorID": 180,
    "OperatorsReference": "Alfen GDH0112",
    "UsageCost": "0.00 jaarabonnement",
    "AddressInfo": {
        "ID": 36172,
        "Title": "Elandstraat 38A",
        "AddressLine1": "Elandstraat 38A",
        "Town": "Den Haag",
        "Postcode": "2513 GT",
        "CountryID": 159,
        "Latitude": 52.08160677,
        "Longitude": 4.29945885,
        "ContactTelephone1": "036 - 549 34 00",
        "RelatedURL": "http://www.icu-charging-stations.com/",
        "DistanceUnit": 0
    },
    "Connections": [
        {
            "ID": 39337,
            "ConnectionTypeID": 25,
            "LevelID": 2,
            "PowerKW": 11,
            "CurrentTypeID": 10
        },
        {
            "ID": 48079,
            "ConnectionTypeID": 25,
            "LevelID": 2,
            "PowerKW": 11,
            "CurrentTypeID": 10
        }
    ],
    "NumberOfPoints": 1,
    "StatusTypeID": 50,
    "DateLastStatusUpdate": "2016-06-04T02:49:00Z",
    "DataQualityLevel": 3,
    "DateCreated": "2015-01-09T06:05:00Z",
    "SubmissionStatusTypeID": 100
}