{
    "IsRecentlyVerified": false,
    "ID": 95032,
    "UUID": "D52A045B-08FA-4AE4-B82F-A2B5EC75C722",
    "DataProviderID": 1,
    "OperatorID": 69,
    "UsageTypeID": 4,
    "AddressInfo": {
        "ID": 95378,
        "Title": "Klinik Euregio",
        "AddressLine1": "Albert-Schweitzer-Straße 10",
        "Town": "Nordhorn",
        "StateOrProvince": "Landkreis Grafschaft Bentheim",
        "Postcode": "48527",
        "CountryID": 87,
        "Latitude": 52.44269999999999,
        "Longitude": 7.065799999999967,
        "AccessComments": "Eintrag laut Karte Ladenetz.\r\n",
        "RelatedURL": "http://www.nvb.de/",
        "DistanceUnit": 0
    },
    "Connections": [
        {
            "ID": 134658,
            "ConnectionTypeID": 25,
            "StatusTypeID": 50,
            "LevelID": 2,
            "Amps": 16,
            "Voltage": 400,
            "PowerKW": 11,
            "CurrentTypeID": 20,
            "Quantity": 1
        }
    ],
    "NumberOfPoints": 1,
    "StatusTypeID": 50,
    "DateLastStatusUpdate": "2017-11-01T10:36:00Z",
    "DataQualityLevel": 1,
    "DateCreated": "2017-11-01T10:36:00Z",
    "SubmissionStatusTypeID": 200
}