{
    "IsRecentlyVerified": false,
    "ID": 139421,
    "UUID": "572D5160-1E95-4A5B-9D3A-F27EEE76F3EE",
    "DataProviderID": 2,
    "DataProvidersReference": "72757",
    "OperatorID": 1242,
    "UsageTypeID": 2,
    "AddressInfo": {
        "ID": 139773,
        "Title": "Toyota Technical Center",
        "AddressLine1": "1630  W 186th St",
        "Town": "Gardena",
        "StateOrProvince": "CA",
        "Postcode": "90248",
        "CountryID": 2,
        "Latitude": 33.861163,
        "Longitude": -118.306516,
        "ContactTelephone1": "855-443-3873",
        "AccessComments": "",
        "RelatedURL": "https://www.gewattstation.com",
        "DistanceUnit": 0
    },
    "Connections": [
        {
            "ID": 194776,
            "ConnectionTypeID": 1,
            "LevelID": 2,
            "Amps": 16,
            "Voltage": 230,
            "PowerKW": 3.7,
            "CurrentTypeID": 10,
            "Quantity": 1
        }
    ],
    "StatusTypeID": 50,
    "DateLastStatusUpdate": "2020-06-26T02:56:00Z",
    "DataQualityLevel": 3,
    "DateCreated": "2019-12-24T09:10:00Z",
    "SubmissionStatusTypeID": 100
}