{
    "IsRecentlyVerified": false,
    "ID": 35297,
    "UUID": "A8B342E9-D119-4F15-8610-D439382F1687",
    "DataProviderID": 26,
    "DataProvidersReference": "48331",
    "OperatorID": 178,
    "OperatorsReference": "EVnetNL EV0224",
    "UsageCost": "0.00 jaarabonnement",
    "AddressInfo": {
        "ID": 35643,
        "Title": "Eerste Abel Tasmanhof 1",
        "AddressLine1": "Eerste Abel Tasmanhof 1",
        "Town": "Gouda",
        "Postcode": "2803 GM",
        "CountryID": 159,
        "Latitude": 52.024124,
        "Longitude": 4.704238,
        "ContactTelephone1": "0800-3522365",
        "RelatedURL": "http://www.evnet.nl",
        "DistanceUnit": 0
    },
    "Connections": [
        {
            "ID": 38808,
            "ConnectionTypeID": 25,
            "LevelID": 2,
            "PowerKW": 11,
            "CurrentTypeID": 10
        }
    ],
    "NumberOfPoints": 1,
    "StatusTypeID": 50,
    "DateLastStatusUpdate": "2016-06-04T02:44:00Z",
    "DataQualityLevel": 3,
    "DateCreated": "2015-01-09T06:04:00Z",
    "SubmissionStatusTypeID": 100
}