{
    "IsRecentlyVerified": false,
    "ID": 132774,
    "UUID": "2B850F05-C576-4C28-89CF-9C5ED2C5C702",
    "DataProviderID": 1,
    "OperatorID": 25,
    "OperatorsReference": "westminster-lancastergate",
    "UsageTypeID": 4,
    "UsageCost": "£0.073/minute; min £1.38; other tariffs available",
    "AddressInfo": {
        "ID": 133120,
        "Title": "Lancaster Gate",
        "AddressLine1": "14 Lancaster Gate",
        "Town": "London",
        "Postcode": "W2 3LH",
        "CountryID": 1,
        "Latitude": 51.511847,
        "Longitude": -0.178415,
        "DistanceUnit": 0
    },
    "Connections": [
        {
            "ID": 185932,
            "ConnectionTypeID": 25,
            "StatusTypeID": 50,
            "LevelID": 2,
            "Amps": 32,
            "Voltage": 400,
            "PowerKW": 22,
            "CurrentTypeID": 20,
            "Quantity": 1
        }
    ],
    "NumberOfPoints": 1,
    "StatusTypeID": 50,
    "DateLastStatusUpdate": "2019-10-07T08:06:00Z",
    "DataQualityLevel": 1,
    "DateCreated": "2019-10-07T08:06:00Z",
    "SubmissionStatusTypeID": 200
}