{
    "IsRecentlyVerified": false,
    "ID": 185971,
    "UUID": "4714A823-50AE-4E16-B528-C8FF409B3FA0",
    "DataProviderID": 29,
    "DataProvidersReference": "7098",
    "AddressInfo": {
        "ID": 186330,
        "Title": "Böllberg 36",
        "AddressLine1": "Böllberg 36",
        "Town": "Gau-Weinheim",
        "Postcode": "55578",
        "CountryID": 87,
        "Latitude": 49.84767,
        "Longitude": 8.04549,
        "DistanceUnit": 0
    },
    "Connections": [
        {
            "ID": 297351,
            "ConnectionTypeID": 25,
            "StatusTypeID": 50,
            "LevelID": 2,
            "PowerKW": 22,
            "CurrentTypeID": 20
        }
    ],
    "StatusTypeID": 50,
    "DateLastStatusUpdate": "2021-07-12T02:44:00Z",
    "MetadataValues": [
        {
            "ID": 18213,
            "MetadataFieldID": 4,
            "ItemValue": "Data from the German chargepoint registry provided by Bundesnetzagentur.de under the CC-BY 4.0 license"
        }
    ],
    "DataQualityLevel": 3,
    "DateCreated": "2021-07-12T02:44:00Z",
    "SubmissionStatusTypeID": 100
}