{
    "UserComments": [
        {
            "ID": 4352,
            "ChargePointID": 46724,
            "CommentTypeID": 10,
            "UserName": "tibor.antaloczy",
            "Rating": 4,
            "DateCreated": "2015-05-03T22:42:57.983Z",
            "User": {
                "ID": 4438,
                "Username": "tibor.antaloczy"
            },
            "CheckinStatusTypeID": 40
        }
    ],
    "MediaItems": [
        {
            "ID": 1306,
            "ChargePointID": 46724,
            "ItemURL": "https://s3-ap-southeast-2.amazonaws.com/openchargemap/images/HU/OCM46724/OCM-46724.orig.2015050322413181.jpg",
            "ItemThumbnailURL": "https://s3-ap-southeast-2.amazonaws.com/openchargemap/images/HU/OCM46724/OCM-46724.thmb.2015050322413181.jpg",
            "Comment": "",
            "IsEnabled": true,
            "IsVideo": false,
            "IsFeaturedItem": false,
            "IsExternalResource": false,
            "User": {
                "ID": 4438,
                "Username": "tibor.antaloczy"
            },
            "DateCreated": "2015-05-03T22:42:00Z"
        },
        {
            "ID": 1307,
            "ChargePointID": 46724,
            "ItemURL": "https://s3-ap-southeast-2.amazonaws.com/openchargemap/images/HU/OCM46724/OCM-46724.orig.2015050322414546.jpg",
            "ItemThumbnailURL": "https://s3-ap-southeast-2.amazonaws.com/openchargemap/images/HU/OCM46724/OCM-46724.thmb.2015050322414546.jpg",
            "Comment": "",
            "IsEnabled": true,
            "IsVideo": false,
            "IsFeaturedItem": false,
            "IsExternalResource": false,
            "User": {
                "ID": 4438,
                "Username": "tibor.antaloczy"
            },
            "DateCreated": "2015-05-03T22:42:00Z"
        },
        {
            "ID": 1308,
            "ChargePointID": 46724,
            "ItemURL": "https://s3-ap-southeast-2.amazonaws.com/openchargemap/images/HU/OCM46724/OCM-46724.orig.2015050322415949.jpg",
            "ItemThumbnailURL": "https://s3-ap-southeast-2.amazonaws.com/openchargemap/images/HU/OCM46724/OCM-46724.thmb.2015050322415949.jpg",
            "Comment": "",
            "IsEnabled": true,
            "IsVideo": false,
            "IsFeaturedItem": false,
            "IsExternalResource": false,
            "User": {
                "ID": 4438,
                "Username": "tibor.antaloczy"
            },
            "DateCreated": "2015-05-03T22:42:00Z"
        },
        {
            "ID": 1304,
            "ChargePointID": 46724,
            "ItemURL": "https://s3-ap-southeast-2.amazonaws.com/openchargemap/images/HU/OCM46724/OCM-46724.orig.2015050322405428.jpg",
            "ItemThumbnailURL": "https://s3-ap-southeast-2.amazonaws.com/openchargemap/images/HU/OCM46724/OCM-46724.thmb.2015050322405428.jpg",
            "Comment": "",
            "IsEnabled": true,
            "IsVideo": false,
            "IsFeaturedItem": false,
            "IsExternalResource": false,
            "User": {
                "ID": 4438,
                "Username": "tibor.antaloczy"
            },
            "DateCreated": "2015-05-03T22:41:00Z"
        },
        {
            "ID": 1305,
            "ChargePointID": 46724,
            "ItemURL": "https://s3-ap-southeast-2.amazonaws.com/openchargemap/images/HU/OCM46724/OCM-46724.orig.2015050322411588.jpg",
            "ItemThumbnailURL": "https://s3-ap-southeast-2.amazonaws.com/openchargemap/images/HU/OCM46724/OCM-46724.thmb.2015050322411588.jpg",
            "Comment": "",
            "IsEnabled": true,
            "IsVideo": false,
            "IsFeaturedItem": false,
            "IsExternalResource": false,
            "User": {
                "ID": 4438,
                "Username": "tibor.antaloczy"
            },
            "DateCreated": "2015-05-03T22:41:00Z"
        }
    ],
    "IsRecentlyVerified": false,
    "ID": 46724,
    "UUID": "C0F76DA3-256F-4393-8ADE-55B62940B9DD",
    "DataProviderID": 1,
    "OperatorID": 45,
    "UsageTypeID": 7,
    "UsageCost": "free",
    "AddressInfo": {
        "ID": 47070,
        "Title": "Bükkaranyos, központ",
        "AddressLine1": "Petőfi Sándor u. 57.",
        "Town": "Bükkaranyos",
        "StateOrProvince": "Borsod-Abaúj-Zemplén megye",
        "Postcode": "3554",
        "CountryID": 104,
        "Latitude": 47.986331,
        "Longitude": 20.77936,
        "AccessComments": "A főút mellett egy fedett parkolóban. Az üzemeltetéshez szükséges kártyát a helyi önkormányzattól kell kérni. CHAdeMO rendszerű autókkal a szélkerék melletti villámtöltő használata javasolt. / Charging station is located along the main road. Magnetic card to operate the charger is available at the local council office. For CHAdeMO cars the fast charger by the wind turbine is a much better option.",
        "DistanceUnit": 0
    },
    "Connections": [
        {
            "ID": 57399,
            "ConnectionTypeID": 25,
            "StatusTypeID": 50,
            "LevelID": 2,
            "Quantity": 1
        },
        {
            "ID": 57400,
            "ConnectionTypeID": 28,
            "StatusTypeID": 50,
            "LevelID": 2,
            "CurrentTypeID": 10,
            "Quantity": 1
        }
    ],
    "NumberOfPoints": 1,
    "StatusTypeID": 50,
    "DateLastStatusUpdate": "2015-05-04T05:00:00Z",
    "DataQualityLevel": 1,
    "DateCreated": "2015-05-03T22:40:00Z",
    "SubmissionStatusTypeID": 200
}