{
    "UserComments": [
        {
            "ID": 10186,
            "ChargePointID": 56937,
            "CommentTypeID": 10,
            "UserName": "ajkelly",
            "Comment": "Charged from AC side successfully while a van was charging using Chademo connector. ",
            "DateCreated": "2016-04-15T14:18:51.607Z",
            "User": {
                "ID": 6406,
                "Username": "ajkelly"
            },
            "CheckinStatusTypeID": 10
        },
        {
            "ID": 8088,
            "ChargePointID": 56937,
            "CommentTypeID": 10,
            "UserName": "Anon74856763534",
            "Comment": "Successful CCS charge reported.",
            "DateCreated": "2015-11-27T09:49:40Z",
            "User": {
                "ID": 1192,
                "Username": "Anon74856763534"
            },
            "CheckinStatusTypeID": 0
        }
    ],
    "MediaItems": [
        {
            "ID": 3527,
            "ChargePointID": 56937,
            "ItemURL": "https://s3-ap-southeast-2.amazonaws.com/openchargemap/images/GB/OCM56937/OCM-56937.orig.2015112709485634.jpeg",
            "ItemThumbnailURL": "https://s3-ap-southeast-2.amazonaws.com/openchargemap/images/GB/OCM56937/OCM-56937.thmb.2015112709485634.jpeg",
            "Comment": "",
            "IsEnabled": true,
            "IsVideo": false,
            "IsFeaturedItem": false,
            "IsExternalResource": false,
            "User": {
                "ID": 1192,
                "Username": "Anon74856763534"
            },
            "DateCreated": "2015-11-27T09:49:00Z"
        }
    ],
    "IsRecentlyVerified": false,
    "ID": 56937,
    "UUID": "6B1BACB7-F812-4CF5-AF84-FFB46494EFE7",
    "DataProviderID": 1,
    "OperatorID": 3315,
    "OperatorsReference": "50969",
    "UsageTypeID": 4,
    "UsageCost": "Free",
    "AddressInfo": {
        "ID": 57283,
        "Title": "Petheram Bridge Car Park",
        "AddressLine1": "Links Crescent",
        "Town": "St. Andrews",
        "StateOrProvince": "Fife",
        "Postcode": "KY16 9SG",
        "CountryID": 1,
        "Latitude": 56.34191,
        "Longitude": -2.80813,
        "DistanceUnit": 0
    },
    "Connections": [
        {
            "ID": 71876,
            "ConnectionTypeID": 2,
            "StatusTypeID": 50,
            "LevelID": 3,
            "Amps": 125,
            "Voltage": 400,
            "PowerKW": 50,
            "CurrentTypeID": 30,
            "Quantity": 1
        },
        {
            "ID": 71877,
            "ConnectionTypeID": 1036,
            "StatusTypeID": 50,
            "LevelID": 3,
            "Amps": 63,
            "Voltage": 400,
            "PowerKW": 43,
            "CurrentTypeID": 20,
            "Quantity": 1
        },
        {
            "ID": 71878,
            "ConnectionTypeID": 33,
            "StatusTypeID": 50,
            "LevelID": 3,
            "Amps": 125,
            "Voltage": 400,
            "PowerKW": 50,
            "CurrentTypeID": 30,
            "Quantity": 1
        }
    ],
    "NumberOfPoints": 1,
    "StatusTypeID": 50,
    "DateLastStatusUpdate": "2020-05-01T05:16:00Z",
    "DataQualityLevel": 1,
    "DateCreated": "2015-11-17T14:37:00Z",
    "SubmissionStatusTypeID": 100
}