{
    "IsRecentlyVerified": false,
    "ID": 129261,
    "UUID": "1FB1C458-4372-41F1-9324-9FA0ABAF4C78",
    "DataProviderID": 1,
    "OperatorID": 3,
    "OperatorsReference": "PG-83198",
    "UsageTypeID": 4,
    "UsageCost": "£0.14/kWh",
    "AddressInfo": {
        "ID": 129607,
        "Title": "Blair Castle",
        "AddressLine1": "Blair Atholl",
        "Town": "Pitlochry",
        "Postcode": "PH18 5TH",
        "CountryID": 1,
        "Latitude": 56.766999,
        "Longitude": -3.845643,
        "DistanceUnit": 0
    },
    "Connections": [
        {
            "ID": 180922,
            "ConnectionTypeID": 25,
            "StatusTypeID": 50,
            "LevelID": 2,
            "Amps": 32,
            "Voltage": 230,
            "PowerKW": 7,
            "CurrentTypeID": 10,
            "Quantity": 2
        }
    ],
    "NumberOfPoints": 2,
    "GeneralComments": "This is an open charge unit installed at Blair Castle at Blair Atholl, Pitlochry",
    "StatusTypeID": 50,
    "DateLastStatusUpdate": "2019-07-16T08:18:00Z",
    "DataQualityLevel": 1,
    "DateCreated": "2019-07-16T08:18:00Z",
    "SubmissionStatusTypeID": 200
}