{
    "IsRecentlyVerified": false,
    "ID": 177178,
    "UUID": "B365A094-2136-4C3E-BF7A-59D565E937D9",
    "DataProviderID": 29,
    "DataProvidersReference": "17854",
    "OperatorID": 45,
    "AddressInfo": {
        "ID": 177537,
        "Title": "Böningstraße 151",
        "AddressLine1": "Böningstraße 151",
        "Town": "Mönchengladbach",
        "Postcode": "41236",
        "CountryID": 87,
        "Latitude": 51.151105,
        "Longitude": 6.421727,
        "DistanceUnit": 0
    },
    "Connections": [
        {
            "ID": 276015,
            "ConnectionTypeID": 25,
            "StatusTypeID": 50,
            "LevelID": 2,
            "PowerKW": 11,
            "CurrentTypeID": 20
        },
        {
            "ID": 276016,
            "ConnectionTypeID": 25,
            "StatusTypeID": 50,
            "LevelID": 2,
            "PowerKW": 22,
            "CurrentTypeID": 20
        }
    ],
    "StatusTypeID": 0,
    "DateLastStatusUpdate": "2021-07-12T02:46:00Z",
    "MetadataValues": [
        {
            "ID": 9472,
            "MetadataFieldID": 4,
            "ItemValue": "Data from the German chargepoint registry provided by Bundesnetzagentur.de under the CC-BY 4.0 license"
        }
    ],
    "DataQualityLevel": 3,
    "DateCreated": "2021-07-08T09:48:00Z",
    "SubmissionStatusTypeID": 100
}