{
    "UserComments": [
        {
            "ID": 23517,
            "ChargePointID": 168356,
            "CommentTypeID": 10,
            "UserName": "ForumElettrico.it",
            "Comment": "2 postazioni AC/DC con pagamento tramite POS per un totale di 4 stalli riservati. Leggi la recensione completa qui >  https://www.forumelettrico.it/forum/enercoop-busto-garolfo-mi-t12913.html",
            "RelatedURL": "https://www.forumelettrico.it/forum/enercoop-busto-garolfo-mi-t12913.html",
            "DateCreated": "2020-11-17T08:36:12.767Z",
            "User": {
                "ID": 11749,
                "Username": "ForumElettrico.it"
            },
            "CheckinStatusTypeID": 140,
            "IsActionedByEditor": false
        }
    ],
    "MediaItems": [
        {
            "ID": 25470,
            "ChargePointID": 168356,
            "ItemURL": "https://s3-ap-southeast-2.amazonaws.com/openchargemap/images/IT/OCM168356/OCM-168356.orig.2020111708363034.jpg",
            "ItemThumbnailURL": "https://s3-ap-southeast-2.amazonaws.com/openchargemap/images/IT/OCM168356/OCM-168356.thmb.2020111708363034.jpg",
            "Comment": "",
            "IsEnabled": true,
            "IsVideo": false,
            "IsFeaturedItem": false,
            "IsExternalResource": false,
            "User": {
                "ID": 11749,
                "Username": "ForumElettrico.it"
            },
            "DateCreated": "2020-11-17T08:37:00Z"
        },
        {
            "ID": 25469,
            "ChargePointID": 168356,
            "ItemURL": "https://s3-ap-southeast-2.amazonaws.com/openchargemap/images/IT/OCM168356/OCM-168356.orig.2020111708362407.jpg",
            "ItemThumbnailURL": "https://s3-ap-southeast-2.amazonaws.com/openchargemap/images/IT/OCM168356/OCM-168356.thmb.2020111708362407.jpg",
            "Comment": "",
            "IsEnabled": true,
            "IsVideo": false,
            "IsFeaturedItem": false,
            "IsExternalResource": false,
            "User": {
                "ID": 11749,
                "Username": "ForumElettrico.it"
            },
            "DateCreated": "2020-11-17T08:36:00Z"
        }
    ],
    "IsRecentlyVerified": false,
    "ID": 168356,
    "UUID": "4A40338C-5107-44FF-906E-49259CE63CBE",
    "DataProviderID": 1,
    "OperatorID": 45,
    "UsageTypeID": 5,
    "AddressInfo": {
        "ID": 168715,
        "Title": "ENERCOOP  Busto Garolfo",
        "AddressLine1": "Viale Europa",
        "AddressLine2": "Angolo Via Arconate, 79",
        "Town": "Busto Garolfo",
        "StateOrProvince": "MI",
        "Postcode": "20020",
        "CountryID": 112,
        "Latitude": 45.546699921801434,
        "Longitude": 8.86977254046542,
        "RelatedURL": "https://www.e-coop.it/web/coop-lombardia/le-stazioni-carburante-enercoop",
        "DistanceUnit": 0
    },
    "Connections": [
        {
            "ID": 255685,
            "ConnectionTypeID": 33,
            "StatusTypeID": 50,
            "LevelID": 3,
            "PowerKW": 50,
            "CurrentTypeID": 30,
            "Quantity": 2
        },
        {
            "ID": 255686,
            "ConnectionTypeID": 2,
            "StatusTypeID": 50,
            "LevelID": 3,
            "PowerKW": 50,
            "CurrentTypeID": 30,
            "Quantity": 2
        },
        {
            "ID": 255687,
            "ConnectionTypeID": 25,
            "StatusTypeID": 50,
            "LevelID": 2,
            "Amps": 32,
            "Voltage": 400,
            "PowerKW": 22,
            "CurrentTypeID": 20,
            "Quantity": 2
        }
    ],
    "NumberOfPoints": 4,
    "StatusTypeID": 50,
    "DateLastStatusUpdate": "2020-11-17T08:37:00Z",
    "DataQualityLevel": 1,
    "DateCreated": "2020-09-23T06:44:00Z",
    "SubmissionStatusTypeID": 200
}