{
    "IsRecentlyVerified": false,
    "ID": 32856,
    "UUID": "82585A8D-7D78-4AE2-9BF0-8FB3ED9753CE",
    "DataProviderID": 26,
    "DataProvidersReference": "33994",
    "OperatorID": 73,
    "OperatorsReference": "EV-Box EVB-P1243011",
    "UsageCost": "0.00 jaarabonnement",
    "AddressInfo": {
        "ID": 33202,
        "Title": "Den Dolech",
        "AddressLine1": "Den Dolech",
        "Town": "Eindhoven",
        "Postcode": "5600 MB",
        "CountryID": 159,
        "Latitude": 51.44836,
        "Longitude": 5.48507,
        "RelatedURL": "http://www.ev-box.nl",
        "DistanceUnit": 0
    },
    "Connections": [
        {
            "ID": 36367,
            "ConnectionTypeID": 25,
            "LevelID": 2,
            "PowerKW": 11,
            "CurrentTypeID": 10
        },
        {
            "ID": 46570,
            "ConnectionTypeID": 25,
            "LevelID": 2,
            "PowerKW": 11,
            "CurrentTypeID": 10
        }
    ],
    "NumberOfPoints": 1,
    "StatusTypeID": 50,
    "DateLastStatusUpdate": "2016-06-04T02:39:00Z",
    "DataQualityLevel": 3,
    "DateCreated": "2015-01-09T06:03:00Z",
    "SubmissionStatusTypeID": 100
}