{
    "IsRecentlyVerified": false,
    "ID": 144775,
    "UUID": "04B64D3A-800C-443A-84C4-7CC69E42CAF3",
    "DataProviderID": 2,
    "DataProvidersReference": "129766",
    "OperatorID": 89,
    "UsageTypeID": 1,
    "AddressInfo": {
        "ID": 145127,
        "Title": "University St-Francis Xavier - Bloomfield Centre",
        "AddressLine1": "5555 Union Place",
        "Town": "Antigonish",
        "StateOrProvince": "NS",
        "Postcode": "B2G 2W5",
        "CountryID": 44,
        "Latitude": 45.617241,
        "Longitude": -61.993617,
        "ContactTelephone1": "888-356-8911",
        "AccessComments": "24 hours daily",
        "RelatedURL": "https://flo.ca/",
        "DistanceUnit": 0
    },
    "Connections": [
        {
            "ID": 201303,
            "ConnectionTypeID": 1,
            "LevelID": 2,
            "Amps": 16,
            "Voltage": 230,
            "PowerKW": 3.7,
            "CurrentTypeID": 10,
            "Quantity": 2
        }
    ],
    "StatusTypeID": 50,
    "DateLastStatusUpdate": "2020-06-26T03:09:00Z",
    "DataQualityLevel": 3,
    "DateCreated": "2019-12-24T09:23:00Z",
    "SubmissionStatusTypeID": 100
}