{
    "IsRecentlyVerified": false,
    "ID": 62764,
    "UUID": "E62DAE7C-5243-44DF-B591-7391226DB43D",
    "DataProviderID": 26,
    "DataProvidersReference": "79509",
    "OperatorID": 73,
    "OperatorsReference": "EV-Box EVB-P1539082",
    "UsageCost": "0.00 jaarabonnement",
    "AddressInfo": {
        "ID": 63110,
        "Title": "Alpenstrasse 45",
        "AddressLine1": "Alpenstrasse 45",
        "Town": "Interlaken",
        "Postcode": "3800",
        "CountryID": 217,
        "Latitude": 46.6854312750788,
        "Longitude": 7.86655426025391,
        "RelatedURL": "http://www.ev-box.nl",
        "DistanceUnit": 0
    },
    "Connections": [
        {
            "ID": 79702,
            "ConnectionTypeID": 25,
            "LevelID": 2,
            "PowerKW": 11,
            "CurrentTypeID": 10
        },
        {
            "ID": 79703,
            "ConnectionTypeID": 25,
            "LevelID": 2,
            "PowerKW": 11,
            "CurrentTypeID": 10
        }
    ],
    "NumberOfPoints": 1,
    "StatusTypeID": 50,
    "DateLastStatusUpdate": "2016-06-04T02:37:00Z",
    "DataQualityLevel": 3,
    "DateCreated": "2016-03-03T12:29:00Z",
    "SubmissionStatusTypeID": 100
}