{
    "IsRecentlyVerified": false,
    "ID": 77606,
    "UUID": "BF542CC3-2CB4-4A4F-B639-AB6FC51B7758",
    "DataProviderID": 1,
    "OperatorID": 156,
    "UsageTypeID": 4,
    "AddressInfo": {
        "ID": 77952,
        "Title": "HTW Berlin Campus Treskowallee",
        "AddressLine1": "Römerweg 42",
        "Town": "Berlin",
        "StateOrProvince": "Berlin",
        "Postcode": "10318",
        "CountryID": 87,
        "Latitude": 52.492331748293374,
        "Longitude": 13.525905210418617,
        "AccessComments": "Nach Abbiegen in dem Römerweg von der Treskowallee kommt rechts eine Einfahrt mit einer Schranke. Sie führt zum Mitarbeiterparkplatz und öffnet mit einer 1€ Münze. Danach ist die Ladestation in Sicht. Ladekosten 0,25€/kWh. 2 Parkplätze vor der lolo-Duo Wallbox am Pfahl.",
        "RelatedURL": "http://www.htw-berlin.de/einrichtungen/zentrale-hochschulverwaltung/service-technische-dienste-bauunterhalt",
        "DistanceUnit": 0
    },
    "Connections": [
        {
            "ID": 112118,
            "ConnectionTypeID": 25,
            "StatusTypeID": 50,
            "LevelID": 2,
            "Amps": 32,
            "Voltage": 400,
            "PowerKW": 22,
            "CurrentTypeID": 20,
            "Quantity": 2
        }
    ],
    "NumberOfPoints": 2,
    "StatusTypeID": 50,
    "DateLastStatusUpdate": "2017-01-20T07:04:00Z",
    "DataQualityLevel": 1,
    "DateCreated": "2017-01-20T07:04:00Z",
    "SubmissionStatusTypeID": 200
}