{
    "IsRecentlyVerified": false,
    "ID": 46996,
    "UUID": "EEAAEF5F-6A92-43BC-AF6F-9F1F3CF74883",
    "DataProviderID": 26,
    "DataProvidersReference": "61685",
    "OperatorID": 180,
    "OperatorsReference": "Alfen GDH3122",
    "UsageCost": "0.00 jaarabonnement",
    "AddressInfo": {
        "ID": 47342,
        "Title": "Tholensestraat 139",
        "AddressLine1": "Tholensestraat 139",
        "Town": "Den Haag",
        "Postcode": "2583 NT",
        "CountryID": 159,
        "Latitude": 52.087568,
        "Longitude": 4.25701,
        "ContactTelephone1": "036 - 549 34 00",
        "RelatedURL": "http://www.icu-charging-stations.com/",
        "DistanceUnit": 0
    },
    "Connections": [
        {
            "ID": 57838,
            "ConnectionTypeID": 25,
            "LevelID": 2,
            "PowerKW": 11,
            "CurrentTypeID": 10
        },
        {
            "ID": 57839,
            "ConnectionTypeID": 25,
            "LevelID": 2,
            "PowerKW": 11,
            "CurrentTypeID": 10
        }
    ],
    "NumberOfPoints": 1,
    "StatusTypeID": 50,
    "DateLastStatusUpdate": "2016-06-04T02:50:00Z",
    "DataQualityLevel": 3,
    "DateCreated": "2015-05-11T09:12:00Z",
    "SubmissionStatusTypeID": 100
}