{
    "IsRecentlyVerified": false,
    "ID": 87466,
    "UUID": "195F2E7C-4905-45AF-87AB-AD2283044A69",
    "DataProviderID": 1,
    "OperatorID": 45,
    "UsageTypeID": 6,
    "AddressInfo": {
        "ID": 87812,
        "Title": "Nissan Cockram Christchurch",
        "AddressLine1": "18 Manchester St",
        "Town": "Christchurch ",
        "StateOrProvince": "Christchurch Central",
        "Postcode": "8011",
        "CountryID": 161,
        "Latitude": -43.5394589,
        "Longitude": 172.6398612,
        "ContactTelephone1": "033662644",
        "DistanceUnit": 0
    },
    "Connections": [
        {
            "ID": 123994,
            "ConnectionTypeID": 1,
            "StatusTypeID": 50,
            "LevelID": 2,
            "Voltage": 230,
            "CurrentTypeID": 10
        }
    ],
    "NumberOfPoints": 1,
    "GeneralComments": "Only for Nissan LEAF vehicles. Internally to the building and so only available during business hours. Also allows imports.\r\n",
    "StatusTypeID": 50,
    "DateLastStatusUpdate": "2017-05-10T18:13:00Z",
    "DataQualityLevel": 1,
    "DateCreated": "2017-05-09T10:53:00Z",
    "SubmissionStatusTypeID": 200
}