{
    "IsRecentlyVerified": false,
    "ID": 187020,
    "UUID": "896D7457-5AE4-482A-AD4E-93FA7A00CEB1",
    "DataProviderID": 29,
    "DataProvidersReference": "17843",
    "OperatorID": 45,
    "AddressInfo": {
        "ID": 187379,
        "Title": "Wildeshauser Str. 1",
        "AddressLine1": "Wildeshauser Str. 1",
        "Town": "Visbek",
        "Postcode": "49429",
        "CountryID": 87,
        "Latitude": 52.841184,
        "Longitude": 8.316975,
        "DistanceUnit": 0
    },
    "Connections": [
        {
            "ID": 300967,
            "ConnectionTypeID": 33,
            "StatusTypeID": 50,
            "LevelID": 3,
            "PowerKW": 22,
            "CurrentTypeID": 30
        },
        {
            "ID": 300968,
            "ConnectionTypeID": 25,
            "StatusTypeID": 50,
            "LevelID": 2,
            "PowerKW": 11,
            "CurrentTypeID": 20
        }
    ],
    "StatusTypeID": 50,
    "DateLastStatusUpdate": "2021-07-12T02:50:00Z",
    "MetadataValues": [
        {
            "ID": 19260,
            "MetadataFieldID": 4,
            "ItemValue": "Data from the German chargepoint registry provided by Bundesnetzagentur.de under the CC-BY 4.0 license"
        }
    ],
    "DataQualityLevel": 3,
    "DateCreated": "2021-07-12T02:50:00Z",
    "SubmissionStatusTypeID": 100
}