{
    "IsRecentlyVerified": false,
    "ID": 34881,
    "UUID": "ACCA3E33-AA8E-4BDD-9D04-2DEA1D2605C2",
    "DataProviderID": 26,
    "DataProvidersReference": "57819",
    "OperatorID": 73,
    "OperatorsReference": "EV-Box EVB-P1427229",
    "UsageCost": "0.00 jaarabonnement",
    "AddressInfo": {
        "ID": 35227,
        "Title": "Berberisweg 488",
        "AddressLine1": "Berberisweg 488",
        "Town": "Rotterdam",
        "Postcode": "3053 PL",
        "CountryID": 159,
        "Latitude": 51.96559,
        "Longitude": 4.47198,
        "RelatedURL": "http://www.ev-box.nl",
        "DistanceUnit": 0
    },
    "Connections": [
        {
            "ID": 38392,
            "ConnectionTypeID": 25,
            "LevelID": 2,
            "PowerKW": 11,
            "CurrentTypeID": 10
        },
        {
            "ID": 47575,
            "ConnectionTypeID": 25,
            "LevelID": 2,
            "PowerKW": 11,
            "CurrentTypeID": 10
        }
    ],
    "NumberOfPoints": 1,
    "StatusTypeID": 50,
    "DateLastStatusUpdate": "2016-06-04T02:43:00Z",
    "DataQualityLevel": 3,
    "DateCreated": "2015-01-09T06:04:00Z",
    "SubmissionStatusTypeID": 100
}