{
    "MediaItems": [
        {
            "ID": 28364,
            "ChargePointID": 175996,
            "ItemURL": "https://s3-ap-southeast-2.amazonaws.com/openchargemap/images/RO/OCM175996/OCM-175996.orig.2021063003403946.jpg",
            "ItemThumbnailURL": "https://s3-ap-southeast-2.amazonaws.com/openchargemap/images/RO/OCM175996/OCM-175996.thmb.2021063003403946.jpg",
            "Comment": "",
            "IsEnabled": true,
            "IsVideo": false,
            "IsFeaturedItem": false,
            "IsExternalResource": false,
            "User": {
                "ID": 33070,
                "Username": "Arkadiy"
            },
            "DateCreated": "2021-06-30T03:41:00Z"
        }
    ],
    "IsRecentlyVerified": false,
    "ID": 175996,
    "UUID": "7A290344-E1F5-4E71-9155-E341DA84E906",
    "DataProviderID": 1,
    "OperatorID": 45,
    "UsageTypeID": 1,
    "UsageCost": "Free",
    "AddressInfo": {
        "ID": 176355,
        "Title": "Strada Bujorului",
        "AddressLine1": "Strada Bujorului",
        "Town": "Аджиджа",
        "StateOrProvince": "Констанца",
        "Postcode": "907015",
        "CountryID": 184,
        "Latitude": 44.08931185365702,
        "Longitude": 28.61042491340754,
        "DistanceUnit": 0
    },
    "Connections": [
        {
            "ID": 273390,
            "ConnectionTypeID": 2,
            "StatusTypeID": 50,
            "LevelID": 3,
            "PowerKW": 50,
            "CurrentTypeID": 30,
            "Quantity": 1
        },
        {
            "ID": 273391,
            "ConnectionTypeID": 33,
            "StatusTypeID": 50,
            "LevelID": 3,
            "Amps": 125,
            "Voltage": 500,
            "PowerKW": 50,
            "CurrentTypeID": 30,
            "Quantity": 1
        }
    ],
    "NumberOfPoints": 2,
    "StatusTypeID": 50,
    "DateLastStatusUpdate": "2021-07-02T10:49:00Z",
    "DataQualityLevel": 1,
    "DateCreated": "2021-06-21T12:28:00Z",
    "SubmissionStatusTypeID": 200
}