{
    "IsRecentlyVerified": false,
    "ID": 154021,
    "UUID": "7A510DEA-A1B8-4D5F-A4B5-054515A40231",
    "DataProviderID": 28,
    "DataProvidersReference": "FR*S77*P77300A",
    "OperatorID": 3413,
    "UsageTypeID": 5,
    "AddressInfo": {
        "ID": 154374,
        "Title": "Montceaux-les-Meaux",
        "AddressLine1": "place de la mairie",
        "CountryID": 80,
        "Latitude": 48.9417972,
        "Longitude": 2.985625,
        "AccessComments": "",
        "DistanceUnit": 0
    },
    "Connections": [
        {
            "ID": 216421,
            "ConnectionTypeID": 28,
            "StatusTypeID": 50,
            "LevelID": 2,
            "PowerKW": 18,
            "CurrentTypeID": 10
        },
        {
            "ID": 216422,
            "ConnectionTypeID": 25,
            "StatusTypeID": 50,
            "LevelID": 2,
            "PowerKW": 18,
            "CurrentTypeID": 20
        }
    ],
    "GeneralComments": "badge, appli et QR code",
    "StatusTypeID": 50,
    "DateLastStatusUpdate": "2020-08-27T05:16:00Z",
    "DataQualityLevel": 2,
    "DateCreated": "2020-03-15T10:54:00Z",
    "SubmissionStatusTypeID": 100
}