{
    "IsRecentlyVerified": false,
    "ID": 52935,
    "UUID": "A3C3FAF2-A5D5-4245-9292-BC186A7FD703",
    "DataProviderID": 1,
    "OperatorID": 45,
    "UsageTypeID": 5,
    "UsageCost": "Nur Parkgebühren",
    "AddressInfo": {
        "ID": 53281,
        "Title": "Tiefgarage Theresien Center",
        "AddressLine1": "Geiselhöringerstraße 2",
        "Town": "Straubing",
        "StateOrProvince": "Straubing",
        "Postcode": "94315",
        "CountryID": 87,
        "Latitude": 48.8798664113552,
        "Longitude": 12.5641265981476,
        "ContactTelephone1": "+49 9421 9628794",
        "AccessComments": "Im 2. Untergeschoß an der Schranke rechts sind zwei reservierte und grün markierte Ladeplätze. Laden kostenlos, Parkgebühren <1h:kostenlos, danach 1,20€/h",
        "RelatedURL": "http://www.theresien-center.eu/",
        "DistanceUnit": 0
    },
    "Connections": [
        {
            "ID": 65901,
            "ConnectionTypeID": 25,
            "StatusTypeID": 50,
            "LevelID": 2,
            "Amps": 16,
            "Voltage": 400,
            "PowerKW": 11,
            "CurrentTypeID": 20,
            "Quantity": 2
        }
    ],
    "NumberOfPoints": 1,
    "StatusTypeID": 50,
    "DateLastStatusUpdate": "2015-09-15T06:33:00Z",
    "DataQualityLevel": 1,
    "DateCreated": "2015-09-15T06:02:00Z",
    "SubmissionStatusTypeID": 200
}