{
    "IsRecentlyVerified": false,
    "ID": 97869,
    "UUID": "05DDE4DA-F2BE-4484-B0A7-5CA16EE1D927",
    "DataProviderID": 1,
    "OperatorID": 23,
    "OperatorsReference": "38610",
    "UsageTypeID": 4,
    "AddressInfo": {
        "ID": 98215,
        "Title": "SKT. Petri",
        "AddressLine1": "Krystalgade 22",
        "Town": "København K",
        "Postcode": "1172",
        "CountryID": 65,
        "Latitude": 55.68064,
        "Longitude": 12.572009,
        "ContactTelephone1": "+45 33459806",
        "DistanceUnit": 0
    },
    "Connections": [
        {
            "ID": 138777,
            "ConnectionTypeID": 30,
            "StatusTypeID": 50,
            "LevelID": 2,
            "Amps": 16,
            "Voltage": 400,
            "PowerKW": 11,
            "CurrentTypeID": 20,
            "Quantity": 1
        }
    ],
    "NumberOfPoints": 1,
    "GeneralComments": "1 Tesla Connector, up to 11kW.Available for customers. Please see valet.",
    "StatusTypeID": 50,
    "DateLastStatusUpdate": "2018-10-03T14:28:00Z",
    "DataQualityLevel": 1,
    "DateCreated": "2018-01-21T16:52:00Z",
    "SubmissionStatusTypeID": 200
}