{
    "IsRecentlyVerified": false,
    "ID": 13808,
    "UUID": "82A1A503-86C7-42B2-8F23-B60A4C7A147A",
    "DataProviderID": 15,
    "DataProvidersReference": "23496",
    "OperatorID": 5,
    "AddressInfo": {
        "ID": 13705,
        "Title": "22 Parking Structure",
        "AddressLine1": "22 Parking Structure",
        "Town": "Santa Barbara",
        "StateOrProvince": "California",
        "Postcode": "93106",
        "CountryID": 2,
        "Latitude": 34.41352081,
        "Longitude": -119.853096,
        "ContactTelephone1": "",
        "RelatedURL": "http://carstations.com/23496",
        "DistanceUnit": 0
    },
    "Connections": [
        {
            "ID": 11255,
            "ConnectionTypeID": 1,
            "Reference": "J1772",
            "LevelID": 2
        }
    ],
    "StatusTypeID": 0,
    "DateLastStatusUpdate": "2017-11-04T14:04:00Z",
    "DataQualityLevel": 2,
    "DateCreated": "2012-12-06T11:08:00Z",
    "SubmissionStatusTypeID": 100
}