{
    "IsRecentlyVerified": false,
    "ID": 171974,
    "UUID": "FDE9A7CC-6AC4-4CE3-82A1-1AEF42DC3673",
    "DataProviderID": 1,
    "OperatorID": 21,
    "UsageTypeID": 4,
    "UsageCost": "Mobi.E compatible card",
    "AddressInfo": {
        "ID": 172333,
        "Title": "PCR-00001",
        "AddressLine1": "Rua Heróis do Ultramar",
        "Town": "Paredes de Coura",
        "StateOrProvince": "Viana do Castelo",
        "Postcode": "4940-521",
        "CountryID": 180,
        "Latitude": 41.91210664258264,
        "Longitude": -8.559931736237786,
        "DistanceUnit": 0
    },
    "Connections": [
        {
            "ID": 262825,
            "ConnectionTypeID": 25,
            "StatusTypeID": 50,
            "LevelID": 2,
            "Amps": 32,
            "Voltage": 400,
            "PowerKW": 22,
            "CurrentTypeID": 20,
            "Quantity": 2
        }
    ],
    "NumberOfPoints": 2,
    "StatusTypeID": 50,
    "DateLastStatusUpdate": "2021-01-10T11:12:00Z",
    "DataQualityLevel": 1,
    "DateCreated": "2021-01-10T11:12:00Z",
    "SubmissionStatusTypeID": 200
}