{
    "IsRecentlyVerified": false,
    "ID": 115754,
    "UUID": "9F7D4249-AB30-47E3-BE8B-CAE65D6DC6B7",
    "DataProviderID": 2,
    "DataProvidersReference": "80282",
    "OperatorID": 5,
    "UsageTypeID": 1,
    "AddressInfo": {
        "ID": 116100,
        "Title": "EVERGY",
        "AddressLine1": "4747 Flora Ave @ KCPS Paseo Academy",
        "Town": "Kansas City",
        "StateOrProvince": "MO",
        "Postcode": "64110",
        "CountryID": 2,
        "Latitude": 39.039428,
        "Longitude": -94.565293,
        "ContactTelephone1": "888-758-4389",
        "AccessComments": "24 hours daily",
        "RelatedURL": "http://www.chargepoint.com/",
        "DistanceUnit": 0
    },
    "Connections": [
        {
            "ID": 162788,
            "ConnectionTypeID": 1,
            "LevelID": 2,
            "Amps": 16,
            "Voltage": 230,
            "PowerKW": 3,
            "CurrentTypeID": 10,
            "Quantity": 6
        }
    ],
    "DateLastStatusUpdate": "2019-12-24T09:15:00Z",
    "DataQualityLevel": 3,
    "DateCreated": "2019-02-11T07:13:00Z",
    "SubmissionStatusTypeID": 100
}