{
    "IsRecentlyVerified": false,
    "ID": 178040,
    "UUID": "75520918-38AF-4EB3-8153-44C268CF5FAF",
    "DataProviderID": 29,
    "DataProvidersReference": "8224",
    "AddressInfo": {
        "ID": 178399,
        "Title": "Köstlinstraße 9",
        "AddressLine1": "Köstlinstraße 9",
        "Town": "Tübingen",
        "Postcode": "72074",
        "CountryID": 87,
        "Latitude": 48.529759,
        "Longitude": 9.067778,
        "DistanceUnit": 0
    },
    "Connections": [
        {
            "ID": 277940,
            "ConnectionTypeID": 25,
            "StatusTypeID": 50,
            "LevelID": 2,
            "PowerKW": 22,
            "CurrentTypeID": 20
        },
        {
            "ID": 277941,
            "ConnectionTypeID": 25,
            "StatusTypeID": 50,
            "LevelID": 2,
            "PowerKW": 22,
            "CurrentTypeID": 20
        }
    ],
    "StatusTypeID": 0,
    "DateLastStatusUpdate": "2021-07-09T03:12:00Z",
    "MetadataValues": [
        {
            "ID": 10334,
            "MetadataFieldID": 4,
            "ItemValue": "Data from the German chargepoint registry provided by Bundesnetzagentur.de under the CC-BY 4.0 license"
        }
    ],
    "DataQualityLevel": 3,
    "DateCreated": "2021-07-08T09:49:00Z",
    "SubmissionStatusTypeID": 100
}