{
    "IsRecentlyVerified": false,
    "ID": 120021,
    "UUID": "6EED716F-7524-4493-A8FA-C59A9B5464D2",
    "DataProviderID": 2,
    "DataProvidersReference": "94972",
    "UsageTypeID": 1,
    "AddressInfo": {
        "ID": 120367,
        "Title": "Flophouze Hotel & Recycling the Past Shop",
        "AddressLine1": "1132 W FM 1291 N",
        "Town": "Round Top",
        "StateOrProvince": "TX",
        "Postcode": "78954",
        "CountryID": 2,
        "Latitude": 30.016869,
        "Longitude": -96.75233,
        "ContactTelephone1": "609-618-7606",
        "AccessComments": "24 hours daily",
        "RelatedURL": "",
        "DistanceUnit": 0
    },
    "Connections": [
        {
            "ID": 169330,
            "ConnectionTypeID": 1,
            "LevelID": 2,
            "Amps": 16,
            "Voltage": 230,
            "PowerKW": 3.7,
            "CurrentTypeID": 10,
            "Quantity": 1
        }
    ],
    "DateLastStatusUpdate": "2020-06-26T02:54:00Z",
    "DataQualityLevel": 3,
    "DateCreated": "2019-04-01T04:59:00Z",
    "SubmissionStatusTypeID": 100
}