{
    "IsRecentlyVerified": false,
    "ID": 105523,
    "UUID": "667DC15E-FAB8-4846-A01F-39C18DC2C4A3",
    "DataProviderID": 1,
    "OperatorID": 23,
    "OperatorsReference": "44115",
    "UsageTypeID": 4,
    "AddressInfo": {
        "ID": 105869,
        "Title": "Qualicum Beach Inn",
        "AddressLine1": "2690 Island Hwy W",
        "Town": "Qualicum Beach",
        "StateOrProvince": "British Columbia",
        "Postcode": "V9K 1G8",
        "CountryID": 44,
        "Latitude": 49.35609,
        "Longitude": -124.438562,
        "ContactTelephone1": "(778) 734-1035",
        "DistanceUnit": 0
    },
    "Connections": [
        {
            "ID": 148705,
            "ConnectionTypeID": 30,
            "StatusTypeID": 50,
            "LevelID": 2,
            "PowerKW": 14,
            "CurrentTypeID": 20,
            "Quantity": 1
        }
    ],
    "NumberOfPoints": 1,
    "GeneralComments": "1 Tesla Connector, up to 14kW.Available for customers. Please see front desk.",
    "StatusTypeID": 50,
    "DateLastStatusUpdate": "2018-06-08T05:33:00Z",
    "DataQualityLevel": 1,
    "DateCreated": "2018-06-08T05:33:00Z",
    "SubmissionStatusTypeID": 200
}