{
    "IsRecentlyVerified": false,
    "ID": 126658,
    "UUID": "DECB43AB-CACB-4A55-ACFC-6029212D83E4",
    "DataProviderID": 1,
    "OperatorID": 1,
    "UsageTypeID": 0,
    "AddressInfo": {
        "ID": 127004,
        "Title": "Mömax parkoló",
        "AddressLine1": "Virágfüzér út 2",
        "Town": "Sopron",
        "StateOrProvince": "Győr-Moson-Sopron",
        "Postcode": "9400",
        "CountryID": 104,
        "Latitude": 47.672865156547,
        "Longitude": 16.6110751741796,
        "DistanceUnit": 0
    },
    "Connections": [
        {
            "ID": 177403,
            "ConnectionTypeID": 25,
            "StatusTypeID": 0,
            "LevelID": 2,
            "CurrentTypeID": 20,
            "Quantity": 2
        },
        {
            "ID": 177404,
            "ConnectionTypeID": 25,
            "StatusTypeID": 0,
            "LevelID": 2,
            "CurrentTypeID": 20,
            "Quantity": 2
        },
        {
            "ID": 177405,
            "ConnectionTypeID": 25,
            "StatusTypeID": 0,
            "LevelID": 2,
            "CurrentTypeID": 20,
            "Quantity": 2
        }
    ],
    "NumberOfPoints": 3,
    "StatusTypeID": 50,
    "DateLastStatusUpdate": "2019-05-16T18:59:00Z",
    "DataQualityLevel": 1,
    "DateCreated": "2019-05-16T08:29:00Z",
    "SubmissionStatusTypeID": 200
}