{
    "IsRecentlyVerified": false,
    "ID": 90292,
    "UUID": "1E0CF315-0BC0-46A8-9540-92A306CE3BB6",
    "DataProviderID": 1,
    "OperatorID": 23,
    "OperatorsReference": "31130",
    "UsageTypeID": 4,
    "AddressInfo": {
        "ID": 90638,
        "Title": "The Players Casino Ventura",
        "AddressLine1": "6580 Auto Center DR",
        "Town": "Ventura",
        "StateOrProvince": "California",
        "Postcode": "93003",
        "CountryID": 2,
        "Latitude": 34.244518,
        "Longitude": -119.19819,
        "ContactTelephone1": "(805) 643-1392",
        "DistanceUnit": 0
    },
    "Connections": [
        {
            "ID": 127945,
            "ConnectionTypeID": 30,
            "StatusTypeID": 50,
            "LevelID": 2,
            "PowerKW": 8,
            "CurrentTypeID": 10,
            "Quantity": 2
        }
    ],
    "NumberOfPoints": 2,
    "GeneralComments": "2 Tesla Connectors, up to 8kW.Available for customers. Self park.",
    "StatusTypeID": 50,
    "DateLastStatusUpdate": "2017-07-13T14:40:00Z",
    "DataQualityLevel": 1,
    "DateCreated": "2017-07-13T14:40:00Z",
    "SubmissionStatusTypeID": 200
}