{
    "IsRecentlyVerified": false,
    "ID": 150028,
    "UUID": "0C88E662-C3B9-4D1F-92B9-19C299C34921",
    "DataProviderID": 1,
    "OperatorID": 3315,
    "OperatorsReference": "51645",
    "UsageTypeID": 4,
    "UsageCost": "Free",
    "AddressInfo": {
        "ID": 150381,
        "Title": "Mortonhall Crematorium, Howden Hall Road, Edinburgh",
        "AddressLine1": "30B Howden Hall Road",
        "Town": "Edinburgh",
        "Postcode": "EH16 6TX",
        "CountryID": 1,
        "Latitude": 55.90277,
        "Longitude": -3.17047,
        "DistanceUnit": 0
    },
    "Connections": [
        {
            "ID": 208306,
            "ConnectionTypeID": 25,
            "StatusTypeID": 50,
            "LevelID": 2,
            "Amps": 32,
            "Voltage": 230,
            "PowerKW": 7,
            "CurrentTypeID": 10,
            "Quantity": 1
        }
    ],
    "NumberOfPoints": 1,
    "StatusTypeID": 50,
    "DateLastStatusUpdate": "2020-05-01T05:13:00Z",
    "DataQualityLevel": 1,
    "DateCreated": "2020-03-12T06:20:00Z",
    "SubmissionStatusTypeID": 200
}