{
    "IsRecentlyVerified": false,
    "ID": 117416,
    "UUID": "44F8C9B1-56B2-4A90-BCB4-5EC2EDA542A8",
    "DataProviderID": 1,
    "OperatorID": 22,
    "OperatorsReference": "C2TBK-A/B",
    "UsageTypeID": 4,
    "AddressInfo": {
        "ID": 117762,
        "Title": "Barrack Lane",
        "AddressLine1": "New Ross",
        "Town": "County Wexford",
        "CountryID": 3,
        "Latitude": 52.395284,
        "Longitude": -6.943578,
        "DistanceUnit": 0
    },
    "Connections": [
        {
            "ID": 166153,
            "ConnectionTypeID": 25,
            "StatusTypeID": 50,
            "LevelID": 2,
            "Amps": 32,
            "Voltage": 400,
            "PowerKW": 22,
            "CurrentTypeID": 20,
            "Quantity": 2
        }
    ],
    "NumberOfPoints": 2,
    "StatusTypeID": 50,
    "DateLastStatusUpdate": "2019-06-03T15:13:00Z",
    "DataQualityLevel": 1,
    "DateCreated": "2019-02-18T06:35:00Z",
    "SubmissionStatusTypeID": 200
}