{
    "IsRecentlyVerified": false,
    "ID": 35258,
    "UUID": "2D41B05A-EF5A-4AF6-8A90-5D7B73035B03",
    "DataProviderID": 26,
    "DataProvidersReference": "47655",
    "OperatorID": 178,
    "OperatorsReference": "EVnetNL AL806",
    "UsageCost": "0.00 jaarabonnement",
    "AddressInfo": {
        "ID": 35604,
        "Title": "Zandlaan 34",
        "AddressLine1": "Zandlaan 34",
        "Town": "Ede",
        "Postcode": "6717 LP",
        "CountryID": 159,
        "Latitude": 52.019065,
        "Longitude": 5.662701,
        "ContactTelephone1": "0800-3522365",
        "RelatedURL": "http://www.evnet.nl",
        "DistanceUnit": 0
    },
    "Connections": [
        {
            "ID": 38769,
            "ConnectionTypeID": 25,
            "LevelID": 2,
            "PowerKW": 11,
            "CurrentTypeID": 10
        }
    ],
    "NumberOfPoints": 2,
    "StatusTypeID": 50,
    "DateLastStatusUpdate": "2016-06-04T02:44:00Z",
    "DataQualityLevel": 3,
    "DateCreated": "2015-01-09T06:04:00Z",
    "SubmissionStatusTypeID": 100
}