{
    "IsRecentlyVerified": false,
    "ID": 126210,
    "UUID": "2BE81F93-DB72-4626-B89B-084F8B2B6C7F",
    "DataProviderID": 1,
    "OperatorID": 3,
    "OperatorsReference": "PG-81198",
    "UsageTypeID": 4,
    "UsageCost": "Free",
    "AddressInfo": {
        "ID": 126556,
        "Title": "Cross Hill Car Park",
        "AddressLine1": "4 Cross Hill",
        "Town": "Driffield",
        "StateOrProvince": "East Yorkshire",
        "Postcode": "YO25 6RQ",
        "CountryID": 1,
        "Latitude": 54.004828,
        "Longitude": -0.44048,
        "DistanceUnit": 0
    },
    "Connections": [
        {
            "ID": 176890,
            "ConnectionTypeID": 25,
            "StatusTypeID": 50,
            "LevelID": 2,
            "Amps": 32,
            "Voltage": 230,
            "PowerKW": 7,
            "CurrentTypeID": 10,
            "Quantity": 2
        }
    ],
    "NumberOfPoints": 2,
    "GeneralComments": "This is an open charge unit installed at the Cross Hill Car Park in Cross Hill, Driffield",
    "StatusTypeID": 50,
    "DateLastStatusUpdate": "2019-05-13T14:49:00Z",
    "DataQualityLevel": 1,
    "DateCreated": "2019-05-13T14:49:00Z",
    "SubmissionStatusTypeID": 200
}