{
    "IsRecentlyVerified": false,
    "ID": 42291,
    "UUID": "C16A8894-4256-4806-AF8B-85413E18D2DD",
    "DataProviderID": 2,
    "DataProvidersReference": "60747",
    "OperatorID": 5,
    "UsageTypeID": 1,
    "AddressInfo": {
        "ID": 42637,
        "Title": "PBO",
        "AddressLine1": "Executive Center DrPalm Beach Mall",
        "Town": "West Palm Beach",
        "StateOrProvince": "FL",
        "Postcode": "33401",
        "CountryID": 2,
        "Latitude": 26.7243453,
        "Longitude": -80.0864409,
        "ContactTelephone1": "888-758-4389",
        "AccessComments": "24 hours daily",
        "RelatedURL": "http://www.chargepoint.com/",
        "DistanceUnit": 0
    },
    "Connections": [
        {
            "ID": 50862,
            "ConnectionTypeID": 1,
            "LevelID": 2,
            "Amps": 16,
            "Voltage": 230,
            "PowerKW": 3,
            "CurrentTypeID": 10,
            "Quantity": 2
        }
    ],
    "DateLastStatusUpdate": "2019-12-24T09:08:00Z",
    "DataQualityLevel": 3,
    "DateCreated": "2015-03-06T06:27:00Z",
    "SubmissionStatusTypeID": 100
}