{
    "UserComments": [
        {
            "ID": 1335,
            "ChargePointID": 13516,
            "CommentTypeID": 10,
            "UserName": "Frank Visser",
            "Comment": "Gratis laden, krap manoeuvreren naar de lader tussen uitgestalde auto's",
            "Rating": 5,
            "DateCreated": "2014-10-28T22:58:30.563Z",
            "User": {
                "ID": 2369,
                "Username": "Frank Visser"
            },
            "CheckinStatusTypeID": 10
        }
    ],
    "IsRecentlyVerified": false,
    "ID": 13516,
    "UUID": "00B6AFB7-C94E-48A0-92FF-B2423FA05EB8",
    "DataProviderID": 1,
    "UsageTypeID": 1,
    "UsageCost": "Free",
    "AddressInfo": {
        "ID": 13413,
        "Title": "Nissan Visscher",
        "AddressLine1": "Schepenbergweg 43",
        "AddressLine2": "",
        "Town": "Amsterdam",
        "StateOrProvince": "",
        "Postcode": "1105 AS",
        "CountryID": 159,
        "Latitude": 52.29377880000001,
        "Longitude": 4.946344299999964,
        "ContactTelephone1": "(020) 6910201",
        "ContactTelephone2": "",
        "ContactEmail": "Info@uwnissandealer.nl",
        "AccessComments": "14/7",
        "RelatedURL": "http://www.uwnissandealer.nl/",
        "DistanceUnit": 0
    },
    "Connections": [
        {
            "ID": 10984,
            "ConnectionTypeID": 2,
            "StatusTypeID": 0,
            "LevelID": 3,
            "Quantity": 1
        }
    ],
    "NumberOfPoints": 1,
    "GeneralComments": "",
    "StatusTypeID": 50,
    "DateLastStatusUpdate": "2014-10-28T22:59:00Z",
    "DataQualityLevel": 1,
    "DateCreated": "2012-11-03T12:11:00Z",
    "SubmissionStatusTypeID": 200
}