{
    "IsRecentlyVerified": false,
    "ID": 144950,
    "UUID": "BA3E6AB4-22F6-417A-910D-7B7F167190AC",
    "DataProviderID": 2,
    "DataProvidersReference": "144368",
    "OperatorID": 90,
    "UsageTypeID": 1,
    "AddressInfo": {
        "ID": 145302,
        "Title": "BRCC - Sainte-Julienne-Shell",
        "AddressLine1": "1175 route 125",
        "Town": "Sainte-Julienne",
        "StateOrProvince": "QC",
        "Postcode": "J0K 2T0",
        "CountryID": 44,
        "Latitude": 45.956563,
        "Longitude": -73.705665,
        "ContactTelephone1": "877-505-2674",
        "AccessComments": "24 hours daily",
        "RelatedURL": "https://lecircuitelectrique.com/",
        "DistanceUnit": 0
    },
    "Connections": [
        {
            "ID": 201514,
            "ConnectionTypeID": 2,
            "LevelID": 3,
            "Amps": 100,
            "Voltage": 400,
            "PowerKW": 40,
            "CurrentTypeID": 30,
            "Quantity": 1
        },
        {
            "ID": 201515,
            "ConnectionTypeID": 32,
            "LevelID": 3,
            "Amps": 100,
            "Voltage": 400,
            "PowerKW": 40,
            "CurrentTypeID": 30,
            "Quantity": 1
        }
    ],
    "StatusTypeID": 50,
    "DateLastStatusUpdate": "2020-06-26T03:10:00Z",
    "DataQualityLevel": 3,
    "DateCreated": "2019-12-24T09:24:00Z",
    "SubmissionStatusTypeID": 100
}