{
    "IsRecentlyVerified": false,
    "ID": 129315,
    "UUID": "7C63998C-CAB8-4EE6-8B2D-6D957B3E1195",
    "DataProviderID": 1,
    "OperatorID": 3,
    "OperatorsReference": "PG-82979,PG-83256",
    "UsageTypeID": 4,
    "UsageCost": "Free",
    "AddressInfo": {
        "ID": 129661,
        "Title": "South Croydon Railway Station",
        "AddressLine1": "Blunt Road",
        "Town": "Croydon",
        "StateOrProvince": "Greater London",
        "Postcode": "CR2 7PA",
        "CountryID": 1,
        "Latitude": 51.362728,
        "Longitude": -0.093708,
        "DistanceUnit": 0
    },
    "Connections": [
        {
            "ID": 180986,
            "ConnectionTypeID": 25,
            "StatusTypeID": 50,
            "LevelID": 2,
            "Amps": 32,
            "Voltage": 230,
            "PowerKW": 7,
            "CurrentTypeID": 10,
            "Quantity": 4
        }
    ],
    "NumberOfPoints": 4,
    "GeneralComments": "This is an open charge unit installed at the South Croydon Railway Station car park at Blunt Road, Croydon",
    "StatusTypeID": 50,
    "DateLastStatusUpdate": "2019-07-18T05:27:00Z",
    "DataQualityLevel": 1,
    "DateCreated": "2019-07-17T05:21:00Z",
    "SubmissionStatusTypeID": 200
}