{
    "IsRecentlyVerified": false,
    "ID": 65395,
    "UUID": "865F36B9-5703-4053-B785-8AF6D57E1CAB",
    "DataProviderID": 26,
    "DataProvidersReference": "86281",
    "OperatorID": 73,
    "OperatorsReference": "EV-Box EVB-P1409115",
    "UsageCost": "0.00 jaarabonnement",
    "AddressInfo": {
        "ID": 65741,
        "Title": "Krommingenstraat",
        "AddressLine1": "Krommingenstraat",
        "Town": "Waasmunster",
        "Postcode": "9250",
        "CountryID": 26,
        "Latitude": 51.12128,
        "Longitude": 4.02021,
        "RelatedURL": "http://www.ev-box.nl",
        "DistanceUnit": 0
    },
    "Connections": [
        {
            "ID": 90106,
            "ConnectionTypeID": 25,
            "LevelID": 2,
            "PowerKW": 11,
            "CurrentTypeID": 10
        },
        {
            "ID": 90107,
            "ConnectionTypeID": 25,
            "LevelID": 2,
            "PowerKW": 11,
            "CurrentTypeID": 10
        }
    ],
    "NumberOfPoints": 1,
    "StatusTypeID": 50,
    "DateLastStatusUpdate": "2016-06-04T02:38:00Z",
    "DataQualityLevel": 3,
    "DateCreated": "2016-04-27T09:41:00Z",
    "SubmissionStatusTypeID": 100
}