{
    "IsRecentlyVerified": false,
    "ID": 97964,
    "UUID": "F37DEF02-7A98-4C7F-A082-0E48EE567444",
    "DataProviderID": 1,
    "OperatorID": 23,
    "OperatorsReference": "39469",
    "UsageTypeID": 4,
    "AddressInfo": {
        "ID": 98310,
        "Title": "Anglesey Arms",
        "AddressLine1": "Anglesey Arms",
        "Postcode": "LL59 5EA",
        "CountryID": 1,
        "Latitude": 53.22272,
        "Longitude": -4.166325,
        "ContactTelephone1": "+44 124 871 2305",
        "DistanceUnit": 0
    },
    "Connections": [
        {
            "ID": 138872,
            "ConnectionTypeID": 30,
            "StatusTypeID": 50,
            "LevelID": 2,
            "Amps": 16,
            "Voltage": 400,
            "PowerKW": 11,
            "CurrentTypeID": 20,
            "Quantity": 2
        }
    ],
    "NumberOfPoints": 2,
    "GeneralComments": "2 Tesla Connectors, up to 11kW.Available for customers. Please call ahead.",
    "StatusTypeID": 50,
    "DateLastStatusUpdate": "2018-10-03T21:55:00Z",
    "DataQualityLevel": 1,
    "DateCreated": "2018-01-21T17:25:00Z",
    "SubmissionStatusTypeID": 200
}