{
    "IsRecentlyVerified": false,
    "ID": 99260,
    "UUID": "34DB426A-F203-4A16-B20B-C8745B7B9AC8",
    "DataProviderID": 1,
    "OperatorID": 45,
    "UsageTypeID": 4,
    "AddressInfo": {
        "ID": 99606,
        "Title": "GenoHotel",
        "AddressLine1": "Schulze-Delitzsch-Straße 2",
        "Town": "Baunatal",
        "StateOrProvince": "Landkreis Kassel",
        "Postcode": "34225",
        "CountryID": 87,
        "Latitude": 51.256,
        "Longitude": 9.395340000000033,
        "ContactTelephone1": "+49 5601 9786000",
        "AccessComments": "Drei durchgehend nutzbare Ladesäulen auf dem Hotelparkplatz an der Bahnhofstraße. Parkplätze sind durch Sperrbügel versperrt. An der Rezeption kann man den Schlüssel bekommen.",
        "RelatedURL": "http://www.genohotel-baunatal.de/",
        "DistanceUnit": 0
    },
    "Connections": [
        {
            "ID": 140225,
            "ConnectionTypeID": 25,
            "StatusTypeID": 50,
            "LevelID": 2,
            "Amps": 16,
            "Voltage": 400,
            "PowerKW": 11,
            "CurrentTypeID": 20,
            "Quantity": 3
        }
    ],
    "NumberOfPoints": 3,
    "StatusTypeID": 50,
    "DateLastStatusUpdate": "2018-01-25T08:19:00Z",
    "DataQualityLevel": 1,
    "DateCreated": "2018-01-25T08:19:00Z",
    "SubmissionStatusTypeID": 200
}