{
    "IsRecentlyVerified": false,
    "ID": 11793,
    "UUID": "209129D2-1912-4034-8614-2A887CDA8EBC",
    "DataProviderID": 15,
    "DataProvidersReference": "20553",
    "OperatorID": 26,
    "UsageTypeID": 1,
    "AddressInfo": {
        "ID": 11690,
        "Title": "434 Kuulei Rd",
        "AddressLine1": "434 Kuulei Rd",
        "Town": "Kailua",
        "StateOrProvince": "HI",
        "Postcode": "96734",
        "CountryID": 2,
        "Latitude": 21.3948,
        "Longitude": -157.74334,
        "ContactTelephone1": "(808) 262-0369",
        "RelatedURL": "http://carstations.com/20553",
        "DistanceUnit": 0
    },
    "Connections": [
        {
            "ID": 9197,
            "ConnectionTypeID": 2,
            "Reference": "CHADEMO",
            "LevelID": 3
        }
    ],
    "NumberOfPoints": 1,
    "StatusTypeID": 0,
    "DateLastStatusUpdate": "2017-11-04T14:03:00Z",
    "DataQualityLevel": 2,
    "DateCreated": "2012-07-13T04:32:00Z",
    "SubmissionStatusTypeID": 100
}