{
    "IsRecentlyVerified": false,
    "ID": 71600,
    "UUID": "61F352DA-74C3-44BD-B2FE-CAEE20A9708E",
    "DataProviderID": 2,
    "DataProvidersReference": "77404",
    "UsageTypeID": 1,
    "AddressInfo": {
        "ID": 71946,
        "Title": "South Paris Police Station",
        "AddressLine1": "13 Church St",
        "Town": "South Paris",
        "StateOrProvince": "ME",
        "Postcode": "04281",
        "CountryID": 2,
        "Latitude": 44.223939,
        "Longitude": -70.514496,
        "ContactTelephone1": "207-743-2501",
        "AccessComments": "24 hours daily",
        "RelatedURL": "",
        "DistanceUnit": 0
    },
    "Connections": [
        {
            "ID": 102427,
            "ConnectionTypeID": 1,
            "LevelID": 2,
            "Amps": 16,
            "Voltage": 230,
            "PowerKW": 3.7,
            "CurrentTypeID": 10,
            "Quantity": 1
        }
    ],
    "DateLastStatusUpdate": "2020-06-26T03:07:00Z",
    "DataQualityLevel": 3,
    "DateCreated": "2016-09-02T10:15:00Z",
    "SubmissionStatusTypeID": 100
}