{
    "IsRecentlyVerified": false,
    "ID": 88861,
    "UUID": "34425FFF-6E5B-4ED5-ADC8-4D10D3366DFC",
    "DataProviderID": 1,
    "OperatorID": 23,
    "OperatorsReference": "30555",
    "UsageTypeID": 6,
    "AddressInfo": {
        "ID": 89207,
        "Title": "Hotel Pez Espada",
        "AddressLine1": "Avda Salvador Allende 11",
        "Town": "Torremolinos",
        "StateOrProvince": "Málaga",
        "Postcode": "29620",
        "CountryID": 210,
        "Latitude": 36.605901,
        "Longitude": -4.507376,
        "ContactTelephone1": "+34 952 380 300",
        "DistanceUnit": 0
    },
    "Connections": [
        {
            "ID": 126109,
            "ConnectionTypeID": 30,
            "StatusTypeID": 50,
            "LevelID": 2,
            "Amps": 32,
            "Voltage": 400,
            "PowerKW": 22,
            "CurrentTypeID": 20,
            "Quantity": 1
        }
    ],
    "NumberOfPoints": 1,
    "GeneralComments": "1 Tesla Connector, up to 22kW.Available for patrons only. Please see front desk.",
    "StatusTypeID": 50,
    "DateLastStatusUpdate": "2020-08-17T12:07:00Z",
    "DataQualityLevel": 1,
    "DateCreated": "2017-06-09T15:00:00Z",
    "SubmissionStatusTypeID": 200
}