{
    "IsRecentlyVerified": false,
    "ID": 184725,
    "UUID": "8E4D740C-7513-469A-8164-3B81AE5A3E9C",
    "DataProviderID": 29,
    "DataProvidersReference": "17981",
    "AddressInfo": {
        "ID": 185084,
        "Title": "Kupferstraße 30",
        "AddressLine1": "Kupferstraße 30",
        "Town": "Elsohe",
        "Postcode": "59889",
        "CountryID": 87,
        "Latitude": 51.257137,
        "Longitude": 8.169701,
        "DistanceUnit": 0
    },
    "Connections": [
        {
            "ID": 293341,
            "ConnectionTypeID": 25,
            "StatusTypeID": 50,
            "LevelID": 2,
            "PowerKW": 22,
            "CurrentTypeID": 20
        },
        {
            "ID": 293342,
            "ConnectionTypeID": 25,
            "StatusTypeID": 50,
            "LevelID": 2,
            "PowerKW": 22,
            "CurrentTypeID": 20
        }
    ],
    "StatusTypeID": 50,
    "DateLastStatusUpdate": "2021-07-12T02:47:00Z",
    "MetadataValues": [
        {
            "ID": 17016,
            "MetadataFieldID": 4,
            "ItemValue": "Data from the German chargepoint registry provided by Bundesnetzagentur.de under the CC-BY 4.0 license"
        }
    ],
    "DataQualityLevel": 3,
    "DateCreated": "2021-07-08T10:05:00Z",
    "SubmissionStatusTypeID": 100
}