{
    "IsRecentlyVerified": false,
    "ID": 71046,
    "UUID": "39B01E90-3E85-4DEB-8EDA-8401F7BDAE0B",
    "DataProviderID": 1,
    "OperatorID": 105,
    "UsageTypeID": 4,
    "AddressInfo": {
        "ID": 71392,
        "Title": "Industriegebiet",
        "AddressLine1": "Landwehr 7",
        "Town": "Medebach",
        "StateOrProvince": "Hochsauerlandkreis",
        "Postcode": "59964",
        "CountryID": 87,
        "Latitude": 51.194218865210296,
        "Longitude": 8.724189474868792,
        "AccessComments": "Station ist direkt an der Kreuzung auf der linken Seite wenn man in das Industriegebiet fährt. 24/7 nutzbar mit Vertrag von RWE oder Roamingpartnern.",
        "DistanceUnit": 0
    },
    "Connections": [
        {
            "ID": 101805,
            "ConnectionTypeID": 25,
            "StatusTypeID": 50,
            "LevelID": 2,
            "Amps": 32,
            "Voltage": 400,
            "PowerKW": 22,
            "CurrentTypeID": 20,
            "Quantity": 2
        }
    ],
    "NumberOfPoints": 2,
    "StatusTypeID": 50,
    "DateLastStatusUpdate": "2016-08-24T06:32:00Z",
    "DataQualityLevel": 1,
    "DateCreated": "2016-08-24T06:32:00Z",
    "SubmissionStatusTypeID": 200
}