{
    "UserComments": [
        {
            "ID": 24800,
            "ChargePointID": 168029,
            "CommentTypeID": 10,
            "UserName": "Elio",
            "Comment": "I had to try two different connectors but after a fee attemps I was able to charge successfully my Renault Zoe ",
            "Rating": 3,
            "DateCreated": "2021-09-01T22:27:48.723Z",
            "User": {
                "ID": 34336,
                "Username": "Elio"
            },
            "CheckinStatusTypeID": 10,
            "IsActionedByEditor": false
        }
    ],
    "MediaItems": [
        {
            "ID": 29204,
            "ChargePointID": 168029,
            "ItemURL": "https://s3-ap-southeast-2.amazonaws.com/openchargemap/images/ES/OCM168029/OCM-168029.orig.2021090611514548.jpg",
            "ItemThumbnailURL": "https://s3-ap-southeast-2.amazonaws.com/openchargemap/images/ES/OCM168029/OCM-168029.thmb.2021090611514548.jpg",
            "Comment": "",
            "IsEnabled": true,
            "IsVideo": false,
            "IsFeaturedItem": false,
            "IsExternalResource": false,
            "User": {
                "ID": 34336,
                "Username": "Elio"
            },
            "DateCreated": "2021-09-06T11:52:00Z"
        }
    ],
    "IsRecentlyVerified": false,
    "ID": 168029,
    "UUID": "7AF68CEC-9EAD-49AB-A935-C17D5D687137",
    "DataProviderID": 1,
    "OperatorID": 23,
    "OperatorsReference": "54558",
    "UsageTypeID": 4,
    "AddressInfo": {
        "ID": 168388,
        "Title": "Centro Comercial Torre Sevilla",
        "AddressLine1": "Calle Gonzalo Jiménez de Quesada 2",
        "Town": "Sevilla",
        "Postcode": "41092",
        "CountryID": 210,
        "Latitude": 37.391426,
        "Longitude": -6.010484,
        "ContactTelephone1": "+34 662 41 80 60",
        "DistanceUnit": 0
    },
    "Connections": [
        {
            "ID": 255093,
            "ConnectionTypeID": 30,
            "StatusTypeID": 50,
            "LevelID": 2,
            "PowerKW": 11,
            "CurrentTypeID": 20,
            "Quantity": 7
        }
    ],
    "NumberOfPoints": 7,
    "GeneralComments": "Charging7 Tesla Connector, up to 11kW.Available to the public. Present parking ticket to gate attendant for validation.\r\n",
    "StatusTypeID": 50,
    "DateLastStatusUpdate": "2021-09-06T11:52:00Z",
    "DataQualityLevel": 1,
    "DateCreated": "2020-09-19T05:35:00Z",
    "SubmissionStatusTypeID": 200
}