{
    "IsRecentlyVerified": false,
    "ID": 115095,
    "UUID": "CE89620E-CFAA-446D-BFD4-DB3FBA51DE71",
    "DataProviderID": 1,
    "OperatorID": 80,
    "UsageTypeID": 4,
    "AddressInfo": {
        "ID": 115441,
        "Title": "Genova Genziane | EnelX",
        "AddressLine1": "Via delle Genziane, 26",
        "Town": "Genova",
        "StateOrProvince": "GE",
        "Postcode": "16148",
        "CountryID": 112,
        "Latitude": 44.397609588886624,
        "Longitude": 8.999868466737805,
        "RelatedURL": "https://www.enelx.com/it/it/emobility",
        "DistanceUnit": 0
    },
    "Connections": [
        {
            "ID": 161961,
            "ConnectionTypeID": 25,
            "StatusTypeID": 50,
            "LevelID": 2,
            "Amps": 32,
            "Voltage": 400,
            "PowerKW": 22,
            "CurrentTypeID": 20,
            "Quantity": 2
        }
    ],
    "NumberOfPoints": 2,
    "StatusTypeID": 50,
    "DateLastStatusUpdate": "2019-01-29T15:28:00Z",
    "DataQualityLevel": 1,
    "DateCreated": "2019-01-29T15:28:00Z",
    "SubmissionStatusTypeID": 200
}