{
    "IsRecentlyVerified": false,
    "ID": 160688,
    "UUID": "C1688867-E6B8-4E98-BA3F-F223580F80C9",
    "DataProviderID": 2,
    "DataProvidersReference": "156778",
    "UsageTypeID": 2,
    "AddressInfo": {
        "ID": 161045,
        "Title": "QuadReal Property Group",
        "AddressLine1": "2920 Virtual Way",
        "Town": "Vancouver",
        "StateOrProvince": "BC",
        "Postcode": "V5M 0A6",
        "CountryID": 44,
        "Latitude": 49.260422,
        "Longitude": -123.043515,
        "ContactTelephone1": "",
        "AccessComments": "",
        "RelatedURL": "",
        "DistanceUnit": 0
    },
    "Connections": [
        {
            "ID": 231226,
            "ConnectionTypeID": 2,
            "LevelID": 3,
            "Amps": 100,
            "Voltage": 400,
            "PowerKW": 40,
            "CurrentTypeID": 30,
            "Quantity": 1
        },
        {
            "ID": 231227,
            "ConnectionTypeID": 32,
            "LevelID": 3,
            "Amps": 100,
            "Voltage": 400,
            "PowerKW": 40,
            "CurrentTypeID": 30,
            "Quantity": 1
        }
    ],
    "GeneralComments": "Planned for future date. Not Operational.",
    "DatePlanned": "2020-09-01T00:00:00Z",
    "StatusTypeID": 150,
    "DateLastStatusUpdate": "2020-06-26T03:12:00Z",
    "DataQualityLevel": 3,
    "DateCreated": "2020-06-26T03:12:00Z",
    "SubmissionStatusTypeID": 100
}