{
    "IsRecentlyVerified": false,
    "ID": 77055,
    "UUID": "E646D6D4-82AB-460B-9AFE-3D3D824AB450",
    "DataProviderID": 1,
    "OperatorID": 1,
    "UsageTypeID": 1,
    "UsageCost": "Free",
    "AddressInfo": {
        "ID": 77401,
        "Title": "Shopping Arena",
        "AddressLine1": "Alpenstraße 107",
        "Town": "Salzburg",
        "StateOrProvince": "Salzburg",
        "Postcode": "5020",
        "CountryID": 19,
        "Latitude": 47.7748573,
        "Longitude": 13.0699427,
        "ContactTelephone1": " 0662 620021",
        "AccessComments": "Tiefgarage - 1.UG (Neubau)",
        "RelatedURL": "http://www.dieshoppingarena.at/",
        "DistanceUnit": 0
    },
    "Connections": [
        {
            "ID": 110681,
            "ConnectionTypeID": 25,
            "StatusTypeID": 0,
            "LevelID": 2
        },
        {
            "ID": 110682,
            "ConnectionTypeID": 25,
            "StatusTypeID": 0,
            "LevelID": 2
        }
    ],
    "NumberOfPoints": 2,
    "StatusTypeID": 50,
    "DateLastStatusUpdate": "2016-12-28T23:32:00Z",
    "DataQualityLevel": 1,
    "DateCreated": "2016-12-28T07:15:00Z",
    "SubmissionStatusTypeID": 200
}