{
    "IsRecentlyVerified": false,
    "ID": 37691,
    "UUID": "F6F06B14-D162-4FF8-B0BD-63530E6E60A0",
    "DataProviderID": 26,
    "DataProvidersReference": "25830",
    "OperatorID": 78,
    "OperatorsReference": "Essent EM-NL-00000363-02-00009",
    "UsageCost": "0.00 jaarabonnement",
    "AddressInfo": {
        "ID": 38037,
        "Title": "Da Costakade 138B",
        "AddressLine1": "Da Costakade 138B",
        "Town": "Amsterdam",
        "Postcode": "1053 XC",
        "CountryID": 159,
        "Latitude": 52.368374,
        "Longitude": 4.872646,
        "RelatedURL": "http://www.essent.nl",
        "DistanceUnit": 0
    },
    "Connections": [
        {
            "ID": 41202,
            "ConnectionTypeID": 25,
            "LevelID": 2,
            "PowerKW": 11,
            "CurrentTypeID": 10
        },
        {
            "ID": 49198,
            "ConnectionTypeID": 25,
            "LevelID": 2,
            "PowerKW": 11,
            "CurrentTypeID": 10
        }
    ],
    "NumberOfPoints": 1,
    "StatusTypeID": 50,
    "DateLastStatusUpdate": "2016-06-04T02:53:00Z",
    "DataQualityLevel": 3,
    "DateCreated": "2015-01-09T06:07:00Z",
    "SubmissionStatusTypeID": 100
}