{
    "IsRecentlyVerified": false,
    "ID": 15218,
    "UUID": "C931DAF9-7FCC-45DD-9DD8-4CBE983BD79D",
    "DataProviderID": 1,
    "OperatorID": 1,
    "UsageTypeID": 0,
    "UsageCost": "Free",
    "AddressInfo": {
        "ID": 15564,
        "Title": "Nissan Orange",
        "AddressLine1": "956, bd. de Lattre de Tassigny",
        "AddressLine2": "",
        "Town": "ORANGE",
        "StateOrProvince": "",
        "Postcode": "84100",
        "CountryID": 80,
        "Latitude": 44.1503552,
        "Longitude": 4.803270699999985,
        "ContactTelephone1": "04 90 34 44 33",
        "ContactTelephone2": "",
        "ContactEmail": "contact@nissan-orange.com",
        "AccessComments": "Lundi au Samedi : 8h-12h et 14h-19h ",
        "RelatedURL": "http://www.nissan-orange.com",
        "DistanceUnit": 0
    },
    "Connections": [
        {
            "ID": 13508,
            "ConnectionTypeID": 2,
            "StatusTypeID": 0,
            "LevelID": 3,
            "Quantity": 1
        }
    ],
    "NumberOfPoints": 1,
    "GeneralComments": "",
    "StatusTypeID": 50,
    "DateLastStatusUpdate": "2012-12-24T14:12:00Z",
    "DataQualityLevel": 1,
    "DateCreated": "2012-12-24T14:12:00Z",
    "SubmissionStatusTypeID": 200
}