{
    "IsRecentlyVerified": false,
    "ID": 159419,
    "UUID": "A48F5ADA-0F97-4333-9F77-8442220D730B",
    "DataProviderID": 2,
    "DataProvidersReference": "150795",
    "OperatorID": 5,
    "UsageTypeID": 1,
    "AddressInfo": {
        "ID": 159776,
        "Title": "ADENA",
        "AddressLine1": "272 Hospital rd",
        "Town": "Chillicothe",
        "StateOrProvince": "OH",
        "Postcode": "45601",
        "CountryID": 2,
        "Latitude": 39.396231,
        "Longitude": -82.968355,
        "ContactTelephone1": "888-758-4389",
        "AccessComments": "24 hours daily",
        "RelatedURL": "http://www.chargepoint.com/",
        "DistanceUnit": 0
    },
    "Connections": [
        {
            "ID": 229592,
            "ConnectionTypeID": 1,
            "LevelID": 2,
            "Amps": 16,
            "Voltage": 230,
            "PowerKW": 3.7,
            "CurrentTypeID": 10,
            "Quantity": 4
        }
    ],
    "StatusTypeID": 50,
    "DateLastStatusUpdate": "2020-06-26T03:01:00Z",
    "DataQualityLevel": 3,
    "DateCreated": "2020-06-26T03:01:00Z",
    "SubmissionStatusTypeID": 100
}