{
    "IsRecentlyVerified": false,
    "ID": 74181,
    "UUID": "4E5167B4-3565-418F-BB01-8B15228278C9",
    "DataProviderID": 1,
    "OperatorID": 89,
    "OperatorsReference": "CEA-195",
    "UsageTypeID": 4,
    "UsageCost": "CAD 2.50",
    "AddressInfo": {
        "ID": 74527,
        "Title": "Québec-Hôtel de Ville",
        "AddressLine1": "2 rue des Jardins",
        "AddressLine2": "Hôtel de Ville",
        "Town": "Québec",
        "StateOrProvince": "QC",
        "Postcode": "G1R 4S9",
        "CountryID": 44,
        "Latitude": 46.814167,
        "Longitude": -71.20864,
        "DistanceUnit": 0
    },
    "Connections": [
        {
            "ID": 106525,
            "ConnectionTypeID": 1,
            "StatusTypeID": 50,
            "LevelID": 2,
            "Amps": 32,
            "Voltage": 230,
            "PowerKW": 7,
            "CurrentTypeID": 10,
            "Quantity": 1
        }
    ],
    "NumberOfPoints": 1,
    "StatusTypeID": 50,
    "DateLastStatusUpdate": "2016-11-29T09:24:00Z",
    "DataQualityLevel": 1,
    "DateCreated": "2016-11-24T14:50:00Z",
    "SubmissionStatusTypeID": 200
}