{
    "IsRecentlyVerified": false,
    "ID": 102710,
    "UUID": "DA857F87-B64D-42E1-806A-BDB74BB0DD1A",
    "DataProviderID": 2,
    "DataProvidersReference": "87952",
    "OperatorID": 5,
    "UsageTypeID": 1,
    "AddressInfo": {
        "ID": 103056,
        "Title": "EVERGY",
        "AddressLine1": "601 NW Shamrock Ave @ John Knox Village",
        "Town": "Lees Summit",
        "StateOrProvince": "MO",
        "Postcode": "64081",
        "CountryID": 2,
        "Latitude": 38.9228962,
        "Longitude": -94.4100601,
        "ContactTelephone1": "888-758-4389",
        "AccessComments": "24 hours daily",
        "RelatedURL": "http://www.chargepoint.com/",
        "DistanceUnit": 0
    },
    "Connections": [
        {
            "ID": 144830,
            "ConnectionTypeID": 1,
            "LevelID": 2,
            "Amps": 16,
            "Voltage": 230,
            "PowerKW": 3.7,
            "CurrentTypeID": 10,
            "Quantity": 6
        }
    ],
    "DateLastStatusUpdate": "2020-06-26T03:00:00Z",
    "DataQualityLevel": 3,
    "DateCreated": "2018-04-21T04:13:00Z",
    "SubmissionStatusTypeID": 100
}