{
    "IsRecentlyVerified": false,
    "ID": 79310,
    "UUID": "4BB9D2F7-12D4-47C9-B773-4C702121D01C",
    "DataProviderID": 1,
    "OperatorID": 1,
    "UsageTypeID": 4,
    "AddressInfo": {
        "ID": 79656,
        "Title": "Biogasanlage",
        "AddressLine1": "Koloniestraße",
        "Town": "Groß Pankow (Prignitz)",
        "StateOrProvince": "Landkreis Prignitz",
        "Postcode": "16928",
        "CountryID": 87,
        "Latitude": 53.16764728100748,
        "Longitude": 12.065822675285277,
        "AccessComments": "Eintrag laut EE-Mobil.",
        "DistanceUnit": 0
    },
    "Connections": [
        {
            "ID": 113936,
            "ConnectionTypeID": 28,
            "StatusTypeID": 50,
            "LevelID": 2,
            "Amps": 16,
            "Voltage": 230,
            "PowerKW": 3.7,
            "CurrentTypeID": 10,
            "Quantity": 1
        },
        {
            "ID": 113937,
            "ConnectionTypeID": 25,
            "StatusTypeID": 50,
            "LevelID": 2,
            "Amps": 32,
            "Voltage": 400,
            "PowerKW": 22,
            "CurrentTypeID": 20,
            "Quantity": 1
        }
    ],
    "NumberOfPoints": 2,
    "GeneralComments": "Betreiber ist EE-Mobil: https://www.ee-mobil.de/ladestation-finden/",
    "StatusTypeID": 50,
    "DateLastStatusUpdate": "2017-01-27T08:04:00Z",
    "DataQualityLevel": 1,
    "DateCreated": "2017-01-27T08:04:00Z",
    "SubmissionStatusTypeID": 200
}