{
    "IsRecentlyVerified": false,
    "ID": 146596,
    "UUID": "E139C5C7-AE5D-48EC-8F68-E49AA30236C2",
    "DataProviderID": 1,
    "OperatorID": 1,
    "UsageTypeID": 1,
    "AddressInfo": {
        "ID": 146948,
        "Title": "Shell Bouznika",
        "AddressLine1": "Autoroute A1",
        "Town": "Bouznika",
        "CountryID": 153,
        "Latitude": 33.77961228465112,
        "Longitude": -7.2325736273026,
        "DistanceUnit": 0
    },
    "Connections": [
        {
            "ID": 203835,
            "ConnectionTypeID": 0,
            "StatusTypeID": 50,
            "LevelID": 2,
            "PowerKW": 22,
            "CurrentTypeID": 20,
            "Quantity": 2
        }
    ],
    "NumberOfPoints": 1,
    "StatusTypeID": 50,
    "DateLastStatusUpdate": "2020-01-11T21:50:00Z",
    "DataQualityLevel": 1,
    "DateCreated": "2020-01-11T21:50:00Z",
    "SubmissionStatusTypeID": 200
}