{
    "IsRecentlyVerified": false,
    "ID": 167585,
    "UUID": "4625111A-E0E7-4037-9EDD-EBB43A795769",
    "DataProviderID": 1,
    "OperatorID": 198,
    "UsageTypeID": 1,
    "AddressInfo": {
        "ID": 167944,
        "Title": "McDonald's",
        "AddressLine1": "Pinassvägen 1",
        "Town": "Söderhamn",
        "StateOrProvince": "Gävleborgs län",
        "Postcode": "82640",
        "CountryID": 216,
        "Latitude": 61.29870756088579,
        "Longitude": 17.02794294708201,
        "AccessComments": "Parking at McDonalds",
        "DistanceUnit": 0
    },
    "Connections": [
        {
            "ID": 254347,
            "ConnectionTypeID": 2,
            "Reference": "1",
            "StatusTypeID": 50,
            "LevelID": 3,
            "PowerKW": 50,
            "CurrentTypeID": 30,
            "Quantity": 2,
            "Comments": "Mode 4"
        },
        {
            "ID": 254348,
            "ConnectionTypeID": 33,
            "Reference": "2",
            "StatusTypeID": 50,
            "LevelID": 3,
            "PowerKW": 50,
            "CurrentTypeID": 30,
            "Quantity": 2,
            "Comments": "Mode 4"
        }
    ],
    "NumberOfPoints": 2,
    "StatusTypeID": 50,
    "DateLastStatusUpdate": "2021-04-10T10:58:00Z",
    "DataQualityLevel": 2,
    "DateCreated": "2020-09-08T04:14:00Z",
    "SubmissionStatusTypeID": 100
}