{
    "IsRecentlyVerified": false,
    "ID": 129862,
    "UUID": "D10EBFBB-8E7A-43C0-8770-7BCA8CC956D9",
    "DataProviderID": 1,
    "OperatorID": 80,
    "UsageTypeID": 4,
    "AddressInfo": {
        "ID": 130208,
        "Title": "COOP Rende | EnelX",
        "AddressLine1": "Via Giosuè Carducci",
        "AddressLine2": "angolo Via Repaci, 40",
        "Town": "Rende",
        "StateOrProvince": "CS",
        "Postcode": "87036",
        "CountryID": 112,
        "Latitude": 39.331137111892986,
        "Longitude": 16.24854079045042,
        "ContactTelephone1": "800.069.850",
        "RelatedURL": "https://www.enelx.com/it/it/emobility",
        "DistanceUnit": 0
    },
    "Connections": [
        {
            "ID": 181833,
            "ConnectionTypeID": 25,
            "StatusTypeID": 50,
            "LevelID": 2,
            "Amps": 32,
            "Voltage": 400,
            "PowerKW": 22,
            "CurrentTypeID": 20,
            "Quantity": 2
        },
        {
            "ID": 181834,
            "ConnectionTypeID": 36,
            "StatusTypeID": 50,
            "LevelID": 2,
            "Amps": 16,
            "Voltage": 240,
            "PowerKW": 3.7,
            "CurrentTypeID": 10,
            "Quantity": 2
        }
    ],
    "NumberOfPoints": 4,
    "StatusTypeID": 50,
    "DateLastStatusUpdate": "2019-07-29T15:35:00Z",
    "DataQualityLevel": 1,
    "DateCreated": "2019-07-29T15:35:00Z",
    "SubmissionStatusTypeID": 200
}