{
    "IsRecentlyVerified": false,
    "ID": 42995,
    "UUID": "E2C7098B-C419-41B8-B568-A9BB1936B01F",
    "DataProviderID": 26,
    "DataProvidersReference": "59876",
    "OperatorID": 73,
    "OperatorsReference": "EV-Box EVB-P1413187",
    "UsageCost": "0.00 jaarabonnement",
    "AddressInfo": {
        "ID": 43341,
        "Title": "Nieuw-Loosdrechtsedijk 105",
        "AddressLine1": "Nieuw-Loosdrechtsedijk 105",
        "Town": "Wijdemeren",
        "Postcode": "1231 KN",
        "CountryID": 159,
        "Latitude": 52.1952,
        "Longitude": 5.12861,
        "RelatedURL": "http://www.ev-box.nl",
        "DistanceUnit": 0
    },
    "Connections": [
        {
            "ID": 51996,
            "ConnectionTypeID": 25,
            "LevelID": 2,
            "PowerKW": 11,
            "CurrentTypeID": 10
        },
        {
            "ID": 51997,
            "ConnectionTypeID": 25,
            "LevelID": 2,
            "PowerKW": 11
        }
    ],
    "NumberOfPoints": 1,
    "StatusTypeID": 50,
    "DateLastStatusUpdate": "2016-06-04T02:51:00Z",
    "DataQualityLevel": 3,
    "DateCreated": "2015-03-25T02:49:00Z",
    "SubmissionStatusTypeID": 100
}