{
    "IsRecentlyVerified": false,
    "ID": 111528,
    "UUID": "95FA4741-4536-4E3E-8A36-220278296087",
    "DataProviderID": 2,
    "DataProvidersReference": "98576",
    "OperatorID": 5,
    "UsageTypeID": 1,
    "AddressInfo": {
        "ID": 111874,
        "Title": "DUAL PORT",
        "AddressLine1": "559 Centre St",
        "Town": "Espanola",
        "StateOrProvince": "ON",
        "Postcode": "P5E 1J9",
        "CountryID": 44,
        "Latitude": 46.2531662,
        "Longitude": -81.764925,
        "ContactTelephone1": "888-758-4389",
        "AccessComments": "24 hours daily",
        "RelatedURL": "http://www.chargepoint.com/",
        "DistanceUnit": 0
    },
    "Connections": [
        {
            "ID": 156981,
            "ConnectionTypeID": 1,
            "LevelID": 2,
            "Amps": 16,
            "Voltage": 230,
            "PowerKW": 3.7,
            "CurrentTypeID": 10,
            "Quantity": 2
        }
    ],
    "DateLastStatusUpdate": "2020-06-26T03:10:00Z",
    "DataQualityLevel": 3,
    "DateCreated": "2018-10-18T23:37:00Z",
    "SubmissionStatusTypeID": 100
}