{
    "IsRecentlyVerified": false,
    "ID": 173818,
    "UUID": "834D707B-8437-46BF-B043-9D0A9CB0DBAF",
    "DataProviderID": 19,
    "DataProvidersReference": "6966",
    "AddressInfo": {
        "ID": 174177,
        "Title": "Jökulsárlón",
        "AddressLine1": "Jökulsárlón ",
        "Town": "Höfn í Hornafirði",
        "StateOrProvince": "Austurland",
        "Postcode": "781",
        "CountryID": 105,
        "Latitude": 64.04823,
        "Longitude": -16.179771,
        "AccessComments": "",
        "DistanceUnit": 0
    },
    "Connections": [
        {
            "ID": 267263,
            "ConnectionTypeID": 2,
            "Reference": "1",
            "LevelID": 3,
            "Amps": 100,
            "Voltage": 500,
            "PowerKW": 50,
            "CurrentTypeID": 30,
            "Comments": "Mode 4"
        },
        {
            "ID": 267264,
            "ConnectionTypeID": 33,
            "Reference": "2",
            "LevelID": 3,
            "Amps": 100,
            "Voltage": 500,
            "PowerKW": 50,
            "CurrentTypeID": 30,
            "Comments": "Mode 4"
        },
        {
            "ID": 267265,
            "ConnectionTypeID": 25,
            "Reference": "3",
            "LevelID": 3,
            "Amps": 32,
            "Voltage": 400,
            "PowerKW": 22,
            "CurrentTypeID": 30,
            "Comments": "Mode 3"
        }
    ],
    "NumberOfPoints": 3,
    "StatusTypeID": 0,
    "DateLastStatusUpdate": "2021-03-04T05:39:00Z",
    "DataQualityLevel": 2,
    "DateCreated": "2021-03-04T05:39:00Z",
    "SubmissionStatusTypeID": 100
}