{
    "IsRecentlyVerified": false,
    "ID": 52654,
    "UUID": "92FE8EFB-1AAC-41AC-B088-9A392DF259EA",
    "DataProviderID": 1,
    "OperatorID": 80,
    "UsageTypeID": 4,
    "UsageCost": "0,40€/kW",
    "AddressInfo": {
        "ID": 53000,
        "Title": "Eneldrive DEVAL Village de Cogne",
        "AddressLine1": "Village de Cogne, 80",
        "AddressLine2": "Miniera",
        "Town": "Cogne",
        "StateOrProvince": "AO",
        "Postcode": "11012",
        "CountryID": 112,
        "Latitude": 45.6104213773799,
        "Longitude": 7.36224913787008,
        "RelatedURL": "https://www.eneldrive.it/",
        "DistanceUnit": 0
    },
    "Connections": [
        {
            "ID": 65418,
            "ConnectionTypeID": 25,
            "StatusTypeID": 50,
            "LevelID": 2,
            "Amps": 32,
            "Voltage": 400,
            "PowerKW": 22,
            "CurrentTypeID": 20,
            "Quantity": 1
        },
        {
            "ID": 65419,
            "ConnectionTypeID": 36,
            "StatusTypeID": 50,
            "LevelID": 2,
            "Amps": 16,
            "Voltage": 240,
            "PowerKW": 3,
            "CurrentTypeID": 10,
            "Quantity": 1
        }
    ],
    "NumberOfPoints": 1,
    "StatusTypeID": 50,
    "DateLastStatusUpdate": "2016-04-08T09:54:00Z",
    "DataQualityLevel": 1,
    "DateCreated": "2015-09-06T09:42:00Z",
    "SubmissionStatusTypeID": 200
}