{
    "IsRecentlyVerified": false,
    "ID": 148486,
    "UUID": "C8080FDD-67D6-4C47-ACC7-8D4B67CEDE9F",
    "DataProviderID": 18,
    "DataProvidersReference": "828df2b0d2b816dcb757df94250e7d47",
    "OperatorID": 3393,
    "UsageTypeID": 1,
    "AddressInfo": {
        "ID": 148838,
        "Title": "George Yard",
        "AddressLine1": "George Yard",
        "Town": "Andover",
        "Postcode": "SP10 1EP",
        "CountryID": 1,
        "Latitude": 51.206867,
        "Longitude": -1.477911,
        "AccessComments": "",
        "RelatedURL": "http://www.joju.co.uk/",
        "DistanceUnit": 0
    },
    "Connections": [
        {
            "ID": 206146,
            "ConnectionTypeID": 25,
            "Reference": "ALF-0000978_1",
            "StatusTypeID": 50,
            "LevelID": 2,
            "Amps": 32,
            "Voltage": 400,
            "PowerKW": 22,
            "CurrentTypeID": 20
        }
    ],
    "StatusTypeID": 0,
    "DateLastStatusUpdate": "2020-03-17T08:53:00Z",
    "MetadataValues": [
        {
            "ID": 6976,
            "MetadataFieldID": 4,
            "ItemValue": "Contains public sector information licensed under the Open Government Licence v2.0. http://www.nationalarchives.gov.uk/doc/open-government-licence/version/2/"
        }
    ],
    "DataQualityLevel": 3,
    "DateCreated": "2020-02-03T16:49:00Z",
    "SubmissionStatusTypeID": 100
}