{
    "IsRecentlyVerified": false,
    "ID": 123987,
    "UUID": "CD8CD59B-AA7E-45BB-86A5-DD037A4F4F43",
    "DataProviderID": 2,
    "DataProvidersReference": "61084",
    "OperatorID": 5,
    "UsageTypeID": 1,
    "AddressInfo": {
        "ID": 124333,
        "Title": "BAYSHORE TECH",
        "AddressLine1": "1600 Bridge Pkwy",
        "Town": "Redwood City",
        "StateOrProvince": "CA",
        "Postcode": "94065",
        "CountryID": 2,
        "Latitude": 37.536576,
        "Longitude": -122.258393,
        "ContactTelephone1": "888-758-4389",
        "AccessComments": "24 hours daily",
        "RelatedURL": "http://www.chargepoint.com/",
        "DistanceUnit": 0
    },
    "Connections": [
        {
            "ID": 174028,
            "ConnectionTypeID": 1,
            "LevelID": 2,
            "Amps": 16,
            "Voltage": 230,
            "PowerKW": 3,
            "CurrentTypeID": 10,
            "Quantity": 10
        }
    ],
    "DateLastStatusUpdate": "2019-12-24T09:14:00Z",
    "DataQualityLevel": 3,
    "DateCreated": "2019-04-06T05:03:00Z",
    "SubmissionStatusTypeID": 100
}