{
    "IsRecentlyVerified": false,
    "ID": 146068,
    "UUID": "7526A69D-E239-4718-BC75-D7F68B046F4A",
    "DataProviderID": 1,
    "OperatorID": 23,
    "OperatorsReference": "34531",
    "UsageTypeID": 4,
    "UsageCost": "SEK 2.56/kWh; andra taxor möjligt för äldre bilar",
    "AddressInfo": {
        "ID": 146420,
        "Title": "Markaryd Supercharger",
        "AddressLine1": "Ulvarydsvägen 2",
        "Town": "Markaryd",
        "Postcode": "28535",
        "CountryID": 216,
        "Latitude": 56.444825,
        "Longitude": 13.603916,
        "DistanceUnit": 0
    },
    "Connections": [
        {
            "ID": 202956,
            "ConnectionTypeID": 27,
            "StatusTypeID": 50,
            "LevelID": 3,
            "PowerKW": 120,
            "CurrentTypeID": 30,
            "Quantity": 12
        }
    ],
    "NumberOfPoints": 20,
    "GeneralComments": "Charging20 Superchargers, available 24/7, up to 150kW",
    "StatusTypeID": 50,
    "DateLastStatusUpdate": "2020-12-03T07:01:00Z",
    "DataQualityLevel": 1,
    "DateCreated": "2019-12-30T21:33:00Z",
    "SubmissionStatusTypeID": 200
}