{
    "UserComments": [
        {
            "ID": 7963,
            "ChargePointID": 13639,
            "CommentTypeID": 10,
            "UserName": "jivemonkey",
            "Comment": "Charged a few times here with Polar Plus card. Works a treat and convenient location.",
            "Rating": 5,
            "DateCreated": "2015-11-09T14:36:15.39Z",
            "User": {
                "ID": 6337,
                "Username": "jivemonkey"
            },
            "CheckinStatusTypeID": 10
        },
        {
            "ID": 1176,
            "ChargePointID": 13639,
            "CommentTypeID": 10,
            "UserName": "igsmith.orrery",
            "Comment": "Convenient location very near town centre, parking is free - used it several times with a Source East card. It is at the end of a Taxi rank, so sometime need to kick a taxi out of the spot, but they move with good grace.",
            "Rating": 5,
            "DateCreated": "2014-09-05T09:41:16.093Z",
            "User": {
                "ID": 1927,
                "Username": "igsmith.orrery"
            },
            "CheckinStatusTypeID": 10
        }
    ],
    "IsRecentlyVerified": false,
    "ID": 13639,
    "UUID": "E8C6D366-0BC9-4539-A317-D0E2AAE801FC",
    "DataProviderID": 1,
    "OperatorID": 32,
    "OperatorsReference": "1317",
    "UsageTypeID": 4,
    "UsageCost": "£0.108/kWh; for Polar Plus subscription members only",
    "AddressInfo": {
        "ID": 13536,
        "Title": "De Parys Avenue",
        "AddressLine1": "De Parys Avenue",
        "Town": "Bedford",
        "Postcode": "MK40 2TX",
        "CountryID": 1,
        "Latitude": 52.13948,
        "Longitude": -0.46689,
        "AccessComments": "Outside public toilets",
        "DistanceUnit": 0
    },
    "Connections": [
        {
            "ID": 11106,
            "ConnectionTypeID": 3,
            "StatusTypeID": 50,
            "LevelID": 2,
            "Amps": 13,
            "Voltage": 230,
            "PowerKW": 3,
            "CurrentTypeID": 10,
            "Quantity": 1
        },
        {
            "ID": 68216,
            "ConnectionTypeID": 25,
            "StatusTypeID": 50,
            "LevelID": 2,
            "Amps": 32,
            "Voltage": 230,
            "PowerKW": 7,
            "CurrentTypeID": 10,
            "Quantity": 2
        },
        {
            "ID": 149386,
            "ConnectionTypeID": 25,
            "StatusTypeID": 50,
            "LevelID": 2,
            "Amps": 16,
            "Voltage": 230,
            "PowerKW": 4,
            "CurrentTypeID": 10,
            "Quantity": 1
        }
    ],
    "NumberOfPoints": 2,
    "GeneralComments": "Chargemaster post. Formerly on Source East cards.",
    "StatusTypeID": 50,
    "DateLastStatusUpdate": "2019-03-05T06:13:00Z",
    "DataQualityLevel": 3,
    "DateCreated": "2012-11-23T04:40:00Z",
    "SubmissionStatusTypeID": 200
}