{
    "IsRecentlyVerified": false,
    "ID": 37510,
    "UUID": "C91293CE-10A7-42B8-8243-86409A37DA1C",
    "DataProviderID": 26,
    "DataProvidersReference": "25874",
    "OperatorID": 78,
    "OperatorsReference": "Essent EM-NL-00000363-04-00004",
    "UsageCost": "0.00 jaarabonnement",
    "AddressInfo": {
        "ID": 37856,
        "Title": "Jacob Obrechtstraat 33-1",
        "AddressLine1": "Jacob Obrechtstraat 33-1",
        "Town": "Amsterdam",
        "Postcode": "1071 KG",
        "CountryID": 159,
        "Latitude": 52.355808,
        "Longitude": 4.875634,
        "RelatedURL": "http://www.essent.nl",
        "DistanceUnit": 0
    },
    "Connections": [
        {
            "ID": 41021,
            "ConnectionTypeID": 25,
            "LevelID": 2,
            "PowerKW": 11,
            "CurrentTypeID": 10
        },
        {
            "ID": 49030,
            "ConnectionTypeID": 25,
            "LevelID": 2,
            "PowerKW": 11,
            "CurrentTypeID": 10
        }
    ],
    "NumberOfPoints": 1,
    "StatusTypeID": 50,
    "DateLastStatusUpdate": "2016-06-04T02:53:00Z",
    "DataQualityLevel": 3,
    "DateCreated": "2015-01-09T06:07:00Z",
    "SubmissionStatusTypeID": 100
}