{
    "IsRecentlyVerified": false,
    "ID": 144513,
    "UUID": "592041E7-94CE-4C9D-9390-2CB16E085E51",
    "DataProviderID": 2,
    "DataProvidersReference": "149871",
    "OperatorID": 9,
    "UsageTypeID": 1,
    "AddressInfo": {
        "ID": 144865,
        "Title": "47th Avenue Parking",
        "AddressLine1": "4805 NE Glisan St",
        "Town": "Portland",
        "StateOrProvince": "OR",
        "Postcode": "97213",
        "CountryID": 2,
        "Latitude": 45.528816,
        "Longitude": -122.614195,
        "ContactTelephone1": "888-998-2546",
        "AccessComments": "MON: 24 hours | TUE: 24 hours | WED: 24 hours | THU: 24 hours | FRI: 24 hours | SAT: 24 hours | SUN: 24 hours",
        "RelatedURL": "http://www.blinkcharging.com/",
        "DistanceUnit": 0
    },
    "Connections": [
        {
            "ID": 201020,
            "ConnectionTypeID": 1,
            "LevelID": 2,
            "Amps": 16,
            "Voltage": 230,
            "PowerKW": 3.7,
            "CurrentTypeID": 10,
            "Quantity": 2
        }
    ],
    "StatusTypeID": 50,
    "DateLastStatusUpdate": "2020-06-26T03:09:00Z",
    "DataQualityLevel": 3,
    "DateCreated": "2019-12-24T09:23:00Z",
    "SubmissionStatusTypeID": 100
}