{
    "IsRecentlyVerified": false,
    "ID": 34322,
    "UUID": "CB1F3E2C-D4E7-42F0-BC4E-129D32436D97",
    "DataProviderID": 26,
    "DataProvidersReference": "56771",
    "OperatorID": 73,
    "OperatorsReference": "EV-Box EVB-P1407036",
    "UsageCost": "0.00 jaarabonnement",
    "AddressInfo": {
        "ID": 34668,
        "Title": "1e van Leyden Gaelstraat 300",
        "AddressLine1": "1e van Leyden Gaelstraat 300",
        "Town": "Vlaardingen",
        "Postcode": "3134 LE",
        "CountryID": 159,
        "Latitude": 51.9051292903397,
        "Longitude": 4.34915994907374,
        "RelatedURL": "http://www.ev-box.nl",
        "DistanceUnit": 0
    },
    "Connections": [
        {
            "ID": 37833,
            "ConnectionTypeID": 25,
            "LevelID": 2,
            "PowerKW": 5,
            "CurrentTypeID": 10
        },
        {
            "ID": 47171,
            "ConnectionTypeID": 25,
            "LevelID": 2,
            "PowerKW": 5,
            "CurrentTypeID": 10
        }
    ],
    "NumberOfPoints": 1,
    "StatusTypeID": 50,
    "DateLastStatusUpdate": "2016-03-03T12:37:00Z",
    "DataQualityLevel": 3,
    "DateCreated": "2015-01-09T06:04:00Z",
    "SubmissionStatusTypeID": 100
}