{
    "IsRecentlyVerified": false,
    "ID": 138026,
    "UUID": "3DB53A00-7A30-4EFD-9C5C-74D350EC6859",
    "DataProviderID": 2,
    "DataProvidersReference": "96592",
    "OperatorID": 9,
    "UsageTypeID": 1,
    "AddressInfo": {
        "ID": 138375,
        "Title": "Pala Casino Spa & Resort",
        "AddressLine1": "11154 Highway 76",
        "Town": "Pala",
        "StateOrProvince": "CA",
        "Postcode": "92059",
        "CountryID": 2,
        "Latitude": 33.363188,
        "Longitude": -117.084713,
        "ContactTelephone1": "888-998-2546",
        "AccessComments": "MON: 24 hours | TUE: 24 hours | WED: 24 hours | THU: 24 hours | FRI: 24 hours | SAT: 24 hours | SUN: 24 hours",
        "RelatedURL": "http://www.blinkcharging.com/",
        "DistanceUnit": 0
    },
    "Connections": [
        {
            "ID": 193070,
            "ConnectionTypeID": 1,
            "LevelID": 2,
            "Amps": 16,
            "Voltage": 230,
            "PowerKW": 3,
            "CurrentTypeID": 10,
            "Quantity": 1
        }
    ],
    "StatusTypeID": 50,
    "DateLastStatusUpdate": "2019-12-24T09:06:00Z",
    "DataQualityLevel": 3,
    "DateCreated": "2019-12-24T09:06:00Z",
    "SubmissionStatusTypeID": 100
}