{
    "IsRecentlyVerified": false,
    "ID": 141586,
    "UUID": "21EEC344-2A65-4916-9726-B2B6BC481EBA",
    "DataProviderID": 2,
    "DataProvidersReference": "74127",
    "OperatorID": 5,
    "UsageTypeID": 1,
    "AddressInfo": {
        "ID": 141938,
        "Title": "EVERGY",
        "AddressLine1": "1120 Oak St @ KCMO Wolf Parking Garage",
        "Town": "Kansas City",
        "StateOrProvince": "MO",
        "Postcode": "64106",
        "CountryID": 2,
        "Latitude": 39.100732,
        "Longitude": -94.578699,
        "ContactTelephone1": "888-758-4389",
        "AccessComments": "24 hours daily",
        "RelatedURL": "http://www.chargepoint.com/",
        "DistanceUnit": 0
    },
    "Connections": [
        {
            "ID": 197547,
            "ConnectionTypeID": 1,
            "LevelID": 2,
            "Amps": 16,
            "Voltage": 230,
            "PowerKW": 3.7,
            "CurrentTypeID": 10,
            "Quantity": 8
        }
    ],
    "StatusTypeID": 50,
    "DateLastStatusUpdate": "2020-06-26T03:01:00Z",
    "DataQualityLevel": 3,
    "DateCreated": "2019-12-24T09:15:00Z",
    "SubmissionStatusTypeID": 100
}