{
    "IsRecentlyVerified": false,
    "ID": 79867,
    "UUID": "F528016B-7EB7-4874-B5EC-9D0856EE5B7E",
    "DataProviderID": 1,
    "OperatorID": 23,
    "OperatorsReference": "14588",
    "UsageTypeID": 4,
    "UsageCost": "Free",
    "AddressInfo": {
        "ID": 80213,
        "Title": "Best Western Plus Kamloops Hotel",
        "AddressLine1": "660 Columbia St W",
        "Town": "Kamloops",
        "StateOrProvince": "BC",
        "Postcode": "V2C 1L1",
        "CountryID": 44,
        "Latitude": 50.671634,
        "Longitude": -120.354883,
        "ContactTelephone1": "(250) 374-7878",
        "DistanceUnit": 0
    },
    "Connections": [
        {
            "ID": 114514,
            "ConnectionTypeID": 30,
            "StatusTypeID": 50,
            "LevelID": 2,
            "PowerKW": 8,
            "CurrentTypeID": 10,
            "Quantity": 1
        }
    ],
    "NumberOfPoints": 1,
    "GeneralComments": "1 Tesla Connector, up to 8kW.Available to the public. Please call ahead.",
    "StatusTypeID": 50,
    "DateLastStatusUpdate": "2017-06-09T14:55:00Z",
    "DataQualityLevel": 1,
    "DateCreated": "2017-01-30T13:37:00Z",
    "SubmissionStatusTypeID": 200
}