{
    "IsRecentlyVerified": false,
    "ID": 142335,
    "UUID": "44F0ED1F-DB79-4199-B4C5-381EDD325520",
    "DataProviderID": 2,
    "DataProvidersReference": "147854",
    "OperatorID": 39,
    "UsageTypeID": 1,
    "AddressInfo": {
        "ID": 142687,
        "Title": "Operation Svcs",
        "AddressLine1": "300 West Laporte, Bldg. B",
        "Town": "Fort Collins",
        "StateOrProvince": "CO",
        "Postcode": "80521",
        "CountryID": 2,
        "Latitude": 40.5898562,
        "Longitude": -105.0812483,
        "ContactTelephone1": "800-663-5633",
        "AccessComments": "MO: 12:00am-12:00am; TU: 12:00am-12:00am; WE: 12:00am-12:00am; TH: 12:00am-12:00am; FR: 12:00am-12:00am; SA: 12:00am-12:00am; SU: 12:00am-12:00am",
        "RelatedURL": "http://www.semacharge.com/",
        "DistanceUnit": 0
    },
    "Connections": [
        {
            "ID": 198450,
            "ConnectionTypeID": 1,
            "LevelID": 2,
            "Amps": 16,
            "Voltage": 230,
            "PowerKW": 3.7,
            "CurrentTypeID": 10,
            "Quantity": 3
        }
    ],
    "StatusTypeID": 50,
    "DateLastStatusUpdate": "2020-06-26T03:03:00Z",
    "DataQualityLevel": 3,
    "DateCreated": "2019-12-24T09:17:00Z",
    "SubmissionStatusTypeID": 100
}