{
    "IsRecentlyVerified": false,
    "ID": 146028,
    "UUID": "9272BCBA-A461-4FB9-B8CB-8DC18375B1A7",
    "DataProviderID": 1,
    "OperatorID": 23,
    "OperatorsReference": "52549",
    "UsageTypeID": 4,
    "UsageCost": "€0.25/kWh; andere tarieven voor oudere auto's",
    "AddressInfo": {
        "ID": 146380,
        "Title": "Assen Supercharger",
        "AddressLine1": "1 Balkenweg",
        "Town": "Assen",
        "CountryID": 159,
        "Latitude": 52.9929,
        "Longitude": 6.52447,
        "DistanceUnit": 0
    },
    "Connections": [
        {
            "ID": 202916,
            "ConnectionTypeID": 27,
            "StatusTypeID": 50,
            "LevelID": 3,
            "PowerKW": 120,
            "CurrentTypeID": 30,
            "Quantity": 14
        }
    ],
    "NumberOfPoints": 14,
    "GeneralComments": "14 Superchargers, available 24/7, up to 150kW",
    "StatusTypeID": 50,
    "DateLastStatusUpdate": "2019-12-30T21:26:00Z",
    "DataQualityLevel": 1,
    "DateCreated": "2019-12-30T21:26:00Z",
    "SubmissionStatusTypeID": 200
}