{
    "IsRecentlyVerified": false,
    "ID": 152252,
    "UUID": "7F27A42D-32CF-45B5-A81B-867A5D8E9EA2",
    "DataProviderID": 28,
    "DataProvidersReference": "FR*S86*PSORE*B133",
    "UsageTypeID": 5,
    "AddressInfo": {
        "ID": 152605,
        "Title": "B133",
        "AddressLine1": "Rue de Touraine - 86530 - Cenon sur Vienne",
        "CountryID": 80,
        "Latitude": 46.77659,
        "Longitude": 0.53496,
        "AccessComments": "24/24 7/7 jours",
        "DistanceUnit": 0
    },
    "Connections": [
        {
            "ID": 213077,
            "ConnectionTypeID": 28,
            "StatusTypeID": 50,
            "LevelID": 2,
            "PowerKW": 18,
            "CurrentTypeID": 10
        },
        {
            "ID": 213078,
            "ConnectionTypeID": 25,
            "StatusTypeID": 50,
            "LevelID": 2,
            "PowerKW": 18,
            "CurrentTypeID": 20
        },
        {
            "ID": 245937,
            "ConnectionTypeID": 28,
            "StatusTypeID": 50,
            "LevelID": 2,
            "PowerKW": 18,
            "CurrentTypeID": 10
        },
        {
            "ID": 245938,
            "ConnectionTypeID": 25,
            "StatusTypeID": 50,
            "LevelID": 2,
            "PowerKW": 18,
            "CurrentTypeID": 20
        }
    ],
    "GeneralComments": "",
    "StatusTypeID": 50,
    "DateLastStatusUpdate": "2020-08-27T05:13:00Z",
    "DataQualityLevel": 2,
    "DateCreated": "2020-03-15T10:53:00Z",
    "SubmissionStatusTypeID": 100
}