{
    "IsRecentlyVerified": false,
    "ID": 34314,
    "UUID": "B9425DA8-918B-4A07-8ACA-E01AA97E9D2E",
    "DataProviderID": 26,
    "DataProvidersReference": "47119",
    "OperatorID": 178,
    "OperatorsReference": "EVnetNL AL266",
    "UsageCost": "0.00 jaarabonnement",
    "AddressInfo": {
        "ID": 34660,
        "Title": "Slagveld 36",
        "AddressLine1": "Slagveld 36",
        "Town": "Brielle",
        "Postcode": "3231 AP",
        "CountryID": 159,
        "Latitude": 51.904561,
        "Longitude": 4.168458,
        "ContactTelephone1": "0800-3522365",
        "RelatedURL": "http://www.evnet.nl",
        "DistanceUnit": 0
    },
    "Connections": [
        {
            "ID": 37825,
            "ConnectionTypeID": 25,
            "LevelID": 2,
            "PowerKW": 11,
            "CurrentTypeID": 10
        }
    ],
    "NumberOfPoints": 2,
    "StatusTypeID": 50,
    "DateLastStatusUpdate": "2016-06-04T02:42:00Z",
    "DataQualityLevel": 3,
    "DateCreated": "2015-01-09T06:04:00Z",
    "SubmissionStatusTypeID": 100
}