{
    "IsRecentlyVerified": false,
    "ID": 46020,
    "UUID": "A21A7A68-0511-41B0-B18D-90BBDD87524E",
    "DataProviderID": 1,
    "DataProvidersReference": "482",
    "AddressInfo": {
        "ID": 46366,
        "Title": "Rådhuset, Sande",
        "AddressLine1": "Prestegårdsalleen 35",
        "Town": "SANDE I VESTFOLD",
        "StateOrProvince": "Vestfold og Telemark",
        "Postcode": "3070",
        "CountryID": 168,
        "Latitude": 59.59306,
        "Longitude": 10.2075,
        "AccessComments": "Ligger ved hovedinngangen.",
        "DistanceUnit": 0
    },
    "Connections": [
        {
            "ID": 56683,
            "ConnectionTypeID": 0,
            "Reference": "1",
            "LevelID": 2,
            "Amps": 16,
            "Voltage": 230,
            "PowerKW": 3.7,
            "Comments": "Mode 1"
        },
        {
            "ID": 88347,
            "ConnectionTypeID": 0,
            "Reference": "2",
            "LevelID": 2,
            "Amps": 16,
            "Voltage": 230,
            "PowerKW": 3.7,
            "Comments": "Mode 1"
        }
    ],
    "NumberOfPoints": 2,
    "DateLastStatusUpdate": "2020-05-26T08:23:00Z",
    "DataQualityLevel": 2,
    "DateCreated": "2015-05-03T00:54:00Z",
    "SubmissionStatusTypeID": 100
}