{
    "UserComments": [
        {
            "ID": 20996,
            "ChargePointID": 56839,
            "CommentTypeID": 10,
            "UserName": "polianto",
            "Comment": "Il display non funziona ma si riesce ad utilizzare lo stesso la colonnina\r\n     https://www.forumelettrico.it/forum/colonnina-enel-22kwac-todi-viale-abdon-menecali-3-todi-t5617.html",
            "Rating": 3,
            "RelatedURL": "https://www.forumelettrico.it/forum/colonnina-enel-22kwac-todi-viale-abdon-menecali-3-todi-t5617.html",
            "DateCreated": "2019-05-12T16:15:07.5Z",
            "User": {
                "ID": 1606,
                "Username": "polianto"
            },
            "CheckinStatusTypeID": 10
        }
    ],
    "MediaItems": [
        {
            "ID": 18337,
            "ChargePointID": 56839,
            "ItemURL": "https://s3-ap-southeast-2.amazonaws.com/openchargemap/images/IT/OCM56839/OCM-56839.orig.2019051216135658.jpg",
            "ItemThumbnailURL": "https://s3-ap-southeast-2.amazonaws.com/openchargemap/images/IT/OCM56839/OCM-56839.thmb.2019051216135658.jpg",
            "Comment": "",
            "IsEnabled": true,
            "IsVideo": false,
            "IsFeaturedItem": false,
            "IsExternalResource": false,
            "User": {
                "ID": 1606,
                "Username": "polianto"
            },
            "DateCreated": "2019-05-12T16:14:00Z"
        },
        {
            "ID": 18338,
            "ChargePointID": 56839,
            "ItemURL": "https://s3-ap-southeast-2.amazonaws.com/openchargemap/images/IT/OCM56839/OCM-56839.orig.2019051216140844.jpg",
            "ItemThumbnailURL": "https://s3-ap-southeast-2.amazonaws.com/openchargemap/images/IT/OCM56839/OCM-56839.thmb.2019051216140844.jpg",
            "Comment": "",
            "IsEnabled": true,
            "IsVideo": false,
            "IsFeaturedItem": false,
            "IsExternalResource": false,
            "User": {
                "ID": 1606,
                "Username": "polianto"
            },
            "DateCreated": "2019-05-12T16:14:00Z"
        }
    ],
    "IsRecentlyVerified": false,
    "ID": 56839,
    "UUID": "E13CD3BA-3823-423B-96FD-9B3456CECCA1",
    "DataProviderID": 1,
    "OperatorID": 80,
    "UsageTypeID": 4,
    "UsageCost": "0,40 €/kW",
    "AddressInfo": {
        "ID": 57185,
        "Title": "Eneldrive  Tempio della Consolazione",
        "AddressLine1": "Via Menecali Abdon",
        "Town": "Todi",
        "StateOrProvince": "PG",
        "Postcode": "06059",
        "CountryID": 112,
        "Latitude": 42.7781328307196,
        "Longitude": 12.4039579072473,
        "RelatedURL": "http://eneldrive.it",
        "DistanceUnit": 0
    },
    "Connections": [
        {
            "ID": 71726,
            "ConnectionTypeID": 25,
            "StatusTypeID": 50,
            "LevelID": 2,
            "Amps": 32,
            "Voltage": 400,
            "PowerKW": 22,
            "CurrentTypeID": 20,
            "Quantity": 1
        },
        {
            "ID": 71727,
            "ConnectionTypeID": 36,
            "StatusTypeID": 50,
            "LevelID": 2,
            "Amps": 16,
            "Voltage": 240,
            "PowerKW": 3.7,
            "CurrentTypeID": 10,
            "Quantity": 1
        }
    ],
    "NumberOfPoints": 1,
    "GeneralComments": "Attenzione - non accessibile durante il periodo dei Mercatini di Natale",
    "StatusTypeID": 50,
    "DateLastStatusUpdate": "2019-05-12T16:15:00Z",
    "DataQualityLevel": 1,
    "DateCreated": "2015-11-12T16:32:00Z",
    "SubmissionStatusTypeID": 200
}