{
    "IsRecentlyVerified": false,
    "ID": 173507,
    "UUID": "7786FC51-5B55-4B62-895F-268D4B504CCC",
    "DataProviderID": 18,
    "DataProvidersReference": "3dae7d02b063d20a593ed61053bf966c",
    "OperatorID": 3345,
    "UsageTypeID": 5,
    "AddressInfo": {
        "ID": 173866,
        "Title": "23 Sansom Street",
        "AddressLine1": "23 Sansom Street",
        "Town": "London",
        "Postcode": "SE5 7RD",
        "CountryID": 1,
        "Latitude": 51.47601,
        "Longitude": -0.088272,
        "AccessComments": "",
        "RelatedURL": "https://char.gy",
        "DistanceUnit": 0
    },
    "Connections": [
        {
            "ID": 266564,
            "ConnectionTypeID": 25,
            "Reference": "467",
            "StatusTypeID": 50,
            "LevelID": 2,
            "Amps": 16,
            "Voltage": 230,
            "PowerKW": 3.7,
            "CurrentTypeID": 10
        }
    ],
    "StatusTypeID": 0,
    "DateLastStatusUpdate": "2021-03-03T11:25:00Z",
    "MetadataValues": [
        {
            "ID": 8429,
            "MetadataFieldID": 4,
            "ItemValue": "Contains public sector information licensed under the Open Government Licence v2.0. http://www.nationalarchives.gov.uk/doc/open-government-licence/version/2/"
        }
    ],
    "DataQualityLevel": 3,
    "DateCreated": "2021-03-03T11:25:00Z",
    "SubmissionStatusTypeID": 100
}