{
    "IsRecentlyVerified": false,
    "ID": 79328,
    "UUID": "8B3B197F-A1BB-4965-91AD-1AD0156B4DCC",
    "DataProviderID": 1,
    "OperatorID": 103,
    "UsageTypeID": 4,
    "AddressInfo": {
        "ID": 79674,
        "Title": "P & R Sint Michiels (Brugge)",
        "AddressLine1": "Torhoutse Steenweg 248",
        "Town": "Brugge",
        "StateOrProvince": "West-vlaanderen",
        "Postcode": "8200",
        "CountryID": 26,
        "Latitude": 51.194288,
        "Longitude": 3.198188200000004,
        "DistanceUnit": 0
    },
    "Connections": [
        {
            "ID": 113958,
            "ConnectionTypeID": 2,
            "StatusTypeID": 50,
            "LevelID": 3,
            "CurrentTypeID": 30
        },
        {
            "ID": 113959,
            "ConnectionTypeID": 33,
            "StatusTypeID": 50,
            "LevelID": 3,
            "CurrentTypeID": 30
        },
        {
            "ID": 113960,
            "ConnectionTypeID": 25,
            "StatusTypeID": 50,
            "LevelID": 3,
            "CurrentTypeID": 20
        }
    ],
    "NumberOfPoints": 3,
    "StatusTypeID": 50,
    "DateLastStatusUpdate": "2017-01-27T19:38:00Z",
    "DataQualityLevel": 1,
    "DateCreated": "2017-01-27T17:22:00Z",
    "SubmissionStatusTypeID": 200
}