{
    "UserComments": [
        {
            "ID": 1017,
            "ChargePointID": 20831,
            "CommentTypeID": 10,
            "UserName": "rshang",
            "Comment": "",
            "Rating": 4,
            "DateCreated": "2014-07-20T22:32:43.453Z",
            "User": {
                "ID": 2174,
                "Username": "rshang"
            },
            "CheckinStatusTypeID": 10
        }
    ],
    "MediaItems": [
        {
            "ID": 538,
            "ChargePointID": 20831,
            "ItemURL": "https://s3-ap-southeast-2.amazonaws.com/openchargemap/images/US/OCM20831/OCM-20831.orig.2014072022313514.jpg",
            "ItemThumbnailURL": "https://s3-ap-southeast-2.amazonaws.com/openchargemap/images/US/OCM20831/OCM-20831.thmb.2014072022313514.jpg",
            "Comment": "",
            "IsEnabled": true,
            "IsVideo": false,
            "IsFeaturedItem": false,
            "IsExternalResource": false,
            "User": {
                "ID": 2174,
                "Username": "rshang"
            },
            "DateCreated": "2014-07-20T22:32:00Z"
        },
        {
            "ID": 537,
            "ChargePointID": 20831,
            "ItemURL": "https://s3-ap-southeast-2.amazonaws.com/openchargemap/images/US/OCM20831/OCM-20831.orig.2014072022310942.jpg",
            "ItemThumbnailURL": "https://s3-ap-southeast-2.amazonaws.com/openchargemap/images/US/OCM20831/OCM-20831.thmb.2014072022310942.jpg",
            "Comment": "",
            "IsEnabled": true,
            "IsVideo": false,
            "IsFeaturedItem": false,
            "IsExternalResource": false,
            "User": {
                "ID": 2174,
                "Username": "rshang"
            },
            "DateCreated": "2014-07-20T22:31:00Z"
        }
    ],
    "IsRecentlyVerified": false,
    "ID": 20831,
    "UUID": "F04C993D-1A48-42A7-9E72-666D3B555673",
    "DataProviderID": 1,
    "OperatorID": 1,
    "UsageTypeID": 1,
    "UsageCost": "Free",
    "AddressInfo": {
        "ID": 21176,
        "Title": "Computer History Museum",
        "AddressLine1": "1401 N Shoreline Blvd",
        "Town": "Mountain View",
        "StateOrProvince": "CA",
        "Postcode": "94043",
        "CountryID": 2,
        "Latitude": 37.413959,
        "Longitude": -122.075931,
        "AccessComments": "Behind museum in back of parking lot closest to Inigo Way",
        "DistanceUnit": 0
    },
    "Connections": [],
    "NumberOfPoints": 2,
    "GeneralComments": "No J1772, only a level 1 outlet (NEMA 5-15/20) and a twistlock outlet, probably L6-20 or L6-30 (please update if you know for sure)",
    "StatusTypeID": 50,
    "DateLastStatusUpdate": "2014-01-16T11:03:00Z",
    "DataQualityLevel": 1,
    "DateCreated": "2014-01-16T00:03:00Z",
    "SubmissionStatusTypeID": 200
}