{
    "IsRecentlyVerified": false,
    "ID": 154922,
    "UUID": "37AD8B4C-7880-4B7B-91EF-0B595D2144E3",
    "DataProviderID": 1,
    "OperatorID": 103,
    "OperatorsReference": "BEALLEGO002166",
    "UsageTypeID": 1,
    "UsageCost": "0,32 €/kWh",
    "AddressInfo": {
        "ID": 155276,
        "Title": "Vijverplein",
        "AddressLine1": "Vijverplein",
        "Town": "Zutendaal",
        "StateOrProvince": "Flanders",
        "Postcode": "3690",
        "CountryID": 26,
        "Latitude": 50.93122831432396,
        "Longitude": 5.570598177587726,
        "DistanceUnit": 0
    },
    "Connections": [
        {
            "ID": 218029,
            "ConnectionTypeID": 25,
            "StatusTypeID": 50,
            "LevelID": 2,
            "Amps": 16,
            "Voltage": 400,
            "PowerKW": 11,
            "CurrentTypeID": 20,
            "Quantity": 2
        }
    ],
    "NumberOfPoints": 2,
    "StatusTypeID": 50,
    "DateLastStatusUpdate": "2020-03-22T08:29:00Z",
    "DataQualityLevel": 1,
    "DateCreated": "2020-03-21T20:08:00Z",
    "SubmissionStatusTypeID": 200
}