{
    "IsRecentlyVerified": false,
    "ID": 37396,
    "UUID": "29F0AC2D-1EC6-45D2-A8D4-66CA88A8E5CF",
    "DataProviderID": 26,
    "DataProvidersReference": "25882",
    "OperatorID": 78,
    "OperatorsReference": "Essent EM-NL-00000363-04-00008",
    "UsageCost": "0.00 jaarabonnement",
    "AddressInfo": {
        "ID": 37742,
        "Title": "Rietwijkerstraat 36-1",
        "AddressLine1": "Rietwijkerstraat 36-1",
        "Town": "Amsterdam",
        "Postcode": "1059 XA",
        "CountryID": 159,
        "Latitude": 52.349523,
        "Longitude": 4.84872,
        "RelatedURL": "http://www.essent.nl",
        "DistanceUnit": 0
    },
    "Connections": [
        {
            "ID": 40907,
            "ConnectionTypeID": 25,
            "LevelID": 2,
            "PowerKW": 11,
            "CurrentTypeID": 10
        },
        {
            "ID": 48934,
            "ConnectionTypeID": 25,
            "LevelID": 2,
            "PowerKW": 11,
            "CurrentTypeID": 10
        }
    ],
    "NumberOfPoints": 1,
    "StatusTypeID": 50,
    "DateLastStatusUpdate": "2016-06-04T02:53:00Z",
    "DataQualityLevel": 3,
    "DateCreated": "2015-01-09T06:07:00Z",
    "SubmissionStatusTypeID": 100
}