{
    "UserComments": [
        {
            "ID": 17361,
            "ChargePointID": 85144,
            "CommentTypeID": 10,
            "UserName": "Action Acton",
            "Comment": "The level 2 is attached to garage and is available 24/7",
            "Rating": 5,
            "DateCreated": "2017-06-02T03:41:51.507Z",
            "User": {
                "ID": 13572,
                "Username": "Action Acton"
            },
            "CheckinStatusTypeID": 140
        }
    ],
    "IsRecentlyVerified": false,
    "ID": 85144,
    "UUID": "348F6BFD-1460-451D-9EB8-8367B706E60D",
    "DataProviderID": 1,
    "OperatorID": 44,
    "UsageTypeID": 6,
    "AddressInfo": {
        "ID": 85490,
        "Title": "3622 East 6th Street",
        "AddressLine1": "3622 East 6th Street",
        "Town": "City of Superior",
        "StateOrProvince": "Douglas County",
        "Postcode": "54880",
        "CountryID": 2,
        "Latitude": 46.688935,
        "Longitude": -92.03252,
        "ContactTelephone1": "218-310-8859",
        "ContactTelephone2": "2183108859",
        "ContactEmail": "mractionacton@gmail.com",
        "AccessComments": "Level 2 station inside garage.  110 v outlet outside the garage.  Free for public use, please call before using.",
        "DistanceUnit": 0
    },
    "Connections": [
        {
            "ID": 120906,
            "ConnectionTypeID": 1,
            "StatusTypeID": 50,
            "LevelID": 2,
            "Amps": 40,
            "Voltage": 240,
            "PowerKW": 9.6,
            "CurrentTypeID": 10,
            "Quantity": 1
        }
    ],
    "NumberOfPoints": 1,
    "StatusTypeID": 50,
    "DateLastStatusUpdate": "2017-06-02T03:42:00Z",
    "DataQualityLevel": 1,
    "DateCreated": "2017-03-27T03:46:00Z",
    "SubmissionStatusTypeID": 200
}