{
    "IsRecentlyVerified": false,
    "ID": 32625,
    "UUID": "D804573B-A24C-4C7B-B8C1-6FECF174D526",
    "DataProviderID": 26,
    "DataProvidersReference": "47388",
    "OperatorID": 178,
    "OperatorsReference": "EVnetNL AL546",
    "UsageCost": "0.00 jaarabonnement",
    "AddressInfo": {
        "ID": 32971,
        "Title": "El Pinar 8",
        "AddressLine1": "El Pinar 8",
        "Town": "Cranendonck",
        "Postcode": "6026 SP",
        "CountryID": 159,
        "Latitude": 51.313968,
        "Longitude": 5.628811,
        "ContactTelephone1": "0800-3522365",
        "RelatedURL": "http://www.evnet.nl",
        "DistanceUnit": 0
    },
    "Connections": [
        {
            "ID": 36136,
            "ConnectionTypeID": 25,
            "LevelID": 2,
            "PowerKW": 11,
            "CurrentTypeID": 10
        }
    ],
    "NumberOfPoints": 2,
    "StatusTypeID": 50,
    "DateLastStatusUpdate": "2016-06-04T02:38:00Z",
    "DataQualityLevel": 3,
    "DateCreated": "2015-01-09T06:03:00Z",
    "SubmissionStatusTypeID": 100
}