{
    "UserComments": [
        {
            "ID": 22352,
            "ChargePointID": 121395,
            "CommentTypeID": 10,
            "UserName": "ForumElettrico.it",
            "Comment": "Ricarica gratuita per tutti i clienti del Ristorante del Golf. Leggi la recensione completa qui > https://www.forumelettrico.it/forum/colonnina-ekomobil-22-kw-golf-club-il-torrazzo-cremona-cr-via-castelleone-101-t6246.html",
            "RelatedURL": "https://www.forumelettrico.it/forum/colonnina-ekomobil-22-kw-golf-club-il-torrazzo-cremona-cr-via-castelleone-101-t6246.html",
            "DateCreated": "2020-03-27T17:31:15.287Z",
            "User": {
                "ID": 11749,
                "Username": "ForumElettrico.it"
            },
            "CheckinStatusTypeID": 140,
            "IsActionedByEditor": false
        }
    ],
    "MediaItems": [
        {
            "ID": 18744,
            "ChargePointID": 121395,
            "ItemURL": "https://s3-ap-southeast-2.amazonaws.com/openchargemap/images/IT/OCM121395/OCM-121395.orig.2019062818093009.jpg",
            "ItemThumbnailURL": "https://s3-ap-southeast-2.amazonaws.com/openchargemap/images/IT/OCM121395/OCM-121395.thmb.2019062818093009.jpg",
            "Comment": "",
            "IsEnabled": true,
            "IsVideo": false,
            "IsFeaturedItem": false,
            "IsExternalResource": false,
            "User": {
                "ID": 19460,
                "Username": "Ekomobil"
            },
            "DateCreated": "2019-06-28T18:10:00Z"
        },
        {
            "ID": 18745,
            "ChargePointID": 121395,
            "ItemURL": "https://s3-ap-southeast-2.amazonaws.com/openchargemap/images/IT/OCM121395/OCM-121395.orig.2019062818095237.jpg",
            "ItemThumbnailURL": "https://s3-ap-southeast-2.amazonaws.com/openchargemap/images/IT/OCM121395/OCM-121395.thmb.2019062818095237.jpg",
            "Comment": "",
            "IsEnabled": true,
            "IsVideo": false,
            "IsFeaturedItem": false,
            "IsExternalResource": false,
            "User": {
                "ID": 19460,
                "Username": "Ekomobil"
            },
            "DateCreated": "2019-06-28T18:10:00Z"
        },
        {
            "ID": 18746,
            "ChargePointID": 121395,
            "ItemURL": "https://s3-ap-southeast-2.amazonaws.com/openchargemap/images/IT/OCM121395/OCM-121395.orig.2019062818101325.jpg",
            "ItemThumbnailURL": "https://s3-ap-southeast-2.amazonaws.com/openchargemap/images/IT/OCM121395/OCM-121395.thmb.2019062818101325.jpg",
            "Comment": "",
            "IsEnabled": true,
            "IsVideo": false,
            "IsFeaturedItem": false,
            "IsExternalResource": false,
            "User": {
                "ID": 19460,
                "Username": "Ekomobil"
            },
            "DateCreated": "2019-06-28T18:10:00Z"
        }
    ],
    "IsRecentlyVerified": false,
    "ID": 121395,
    "UUID": "E5A3CB82-988A-4F80-BCB5-A7ABE1A54842",
    "DataProviderID": 1,
    "OperatorID": 3342,
    "UsageTypeID": 4,
    "AddressInfo": {
        "ID": 121741,
        "Title": "Ekomobil - 22 kW",
        "AddressLine1": "Via Castelleone 101",
        "Town": "Cremona",
        "StateOrProvince": "CR",
        "Postcode": "26100",
        "CountryID": 112,
        "Latitude": 45.16207588842363,
        "Longitude": 9.983502273355953,
        "ContactTelephone1": "0372596311",
        "ContactEmail": "info@ekomobil.it",
        "RelatedURL": "https://www.ekomobil.it/",
        "DistanceUnit": 0
    },
    "Connections": [
        {
            "ID": 170871,
            "ConnectionTypeID": 25,
            "StatusTypeID": 50,
            "LevelID": 2,
            "Amps": 32,
            "Voltage": 400,
            "PowerKW": 22,
            "CurrentTypeID": 20,
            "Quantity": 2
        }
    ],
    "NumberOfPoints": 2,
    "StatusTypeID": 50,
    "DateLastStatusUpdate": "2020-03-27T17:31:00Z",
    "DataQualityLevel": 1,
    "DateCreated": "2019-04-01T13:37:00Z",
    "SubmissionStatusTypeID": 200
}