{
    "IsRecentlyVerified": false,
    "ID": 4995,
    "UUID": "32BE61E1-89FF-4011-8AAE-CEC547DDBD47",
    "DataProviderID": 2,
    "DataProvidersReference": "40040",
    "OperatorID": 5,
    "UsageTypeID": 1,
    "AddressInfo": {
        "ID": 4935,
        "Title": "MTA",
        "AddressLine1": "8476-8484 Honeygo Blvd",
        "Town": "Nottingham",
        "StateOrProvince": "MD",
        "Postcode": "21236",
        "CountryID": 2,
        "Latitude": 39.376897,
        "Longitude": -76.460451,
        "ContactTelephone1": "888-758-4389",
        "AccessComments": "24 hours daily",
        "RelatedURL": "http://www.chargepoint.com/",
        "DistanceUnit": 0
    },
    "Connections": [
        {
            "ID": 2944,
            "ConnectionTypeID": 9,
            "LevelID": 1,
            "Amps": 16,
            "Voltage": 120,
            "PowerKW": 1,
            "CurrentTypeID": 10,
            "Quantity": 1
        },
        {
            "ID": 21011,
            "ConnectionTypeID": 1,
            "LevelID": 2,
            "Amps": 16,
            "Voltage": 230,
            "PowerKW": 3,
            "CurrentTypeID": 10,
            "Quantity": 4
        }
    ],
    "DateLastConfirmed": "2011-09-25T00:00:00Z",
    "StatusTypeID": 0,
    "DateLastStatusUpdate": "2019-04-06T04:03:00Z",
    "DataQualityLevel": 1,
    "DateCreated": "2011-07-04T18:02:00Z",
    "SubmissionStatusTypeID": 100
}