{
    "IsRecentlyVerified": false,
    "ID": 159963,
    "UUID": "B5DAF0D3-D6EB-43E8-BD64-6E0EBC8E8630",
    "DataProviderID": 2,
    "DataProvidersReference": "152532",
    "OperatorID": 5,
    "UsageTypeID": 1,
    "AddressInfo": {
        "ID": 160320,
        "Title": "TOWN OF MILTON",
        "AddressLine1": "25 Wharf St",
        "Town": "Milton",
        "StateOrProvince": "MA",
        "Postcode": "02186",
        "CountryID": 2,
        "Latitude": 42.269527,
        "Longitude": -71.06661,
        "ContactTelephone1": "888-758-4389",
        "AccessComments": "24 hours daily",
        "RelatedURL": "http://www.chargepoint.com/",
        "DistanceUnit": 0
    },
    "Connections": [
        {
            "ID": 230188,
            "ConnectionTypeID": 1,
            "LevelID": 2,
            "Amps": 16,
            "Voltage": 230,
            "PowerKW": 3.7,
            "CurrentTypeID": 10,
            "Quantity": 2
        }
    ],
    "StatusTypeID": 50,
    "DateLastStatusUpdate": "2020-06-26T03:05:00Z",
    "DataQualityLevel": 3,
    "DateCreated": "2020-06-26T03:05:00Z",
    "SubmissionStatusTypeID": 100
}