{
    "IsRecentlyVerified": false,
    "ID": 153303,
    "UUID": "912CE892-A90C-450C-B6D4-6C75CBDCEF06",
    "DataProviderID": 28,
    "DataProvidersReference": "FR*S89*P89384*A",
    "UsageTypeID": 5,
    "AddressInfo": {
        "ID": 153656,
        "Title": "SENAN_13 Route de Joigny",
        "AddressLine1": "13 Route de Joigny 89710 SENAN",
        "CountryID": 80,
        "Latitude": 47.9125884,
        "Longitude": 3.35926831,
        "AccessComments": "24/24 7/7 jours",
        "DistanceUnit": 0
    },
    "Connections": [
        {
            "ID": 215003,
            "ConnectionTypeID": 28,
            "StatusTypeID": 50,
            "LevelID": 2,
            "PowerKW": 22,
            "CurrentTypeID": 10
        },
        {
            "ID": 215004,
            "ConnectionTypeID": 1036,
            "StatusTypeID": 50,
            "LevelID": 2,
            "PowerKW": 22,
            "CurrentTypeID": 20
        },
        {
            "ID": 248386,
            "ConnectionTypeID": 28,
            "StatusTypeID": 50,
            "LevelID": 2,
            "PowerKW": 22,
            "CurrentTypeID": 10
        },
        {
            "ID": 248387,
            "ConnectionTypeID": 1036,
            "StatusTypeID": 50,
            "LevelID": 2,
            "PowerKW": 22,
            "CurrentTypeID": 20
        }
    ],
    "GeneralComments": "",
    "StatusTypeID": 50,
    "DateLastStatusUpdate": "2020-08-27T05:14:00Z",
    "DataQualityLevel": 2,
    "DateCreated": "2020-03-15T10:54:00Z",
    "SubmissionStatusTypeID": 100
}