{
    "IsRecentlyVerified": false,
    "ID": 86181,
    "UUID": "4552AD3F-584D-44AD-9A56-4AD37148F8C6",
    "DataProviderID": 1,
    "OperatorID": 23,
    "OperatorsReference": "29214",
    "UsageTypeID": 6,
    "AddressInfo": {
        "ID": 86527,
        "Title": "Hôtel Center Brest",
        "AddressLine1": "4 Boulevard Leon Blum",
        "Town": "Brest",
        "Postcode": "29200",
        "CountryID": 80,
        "Latitude": 48.402056,
        "Longitude": -4.484322,
        "ContactTelephone1": "+33 2 98 80 78 07",
        "DistanceUnit": 0
    },
    "Connections": [
        {
            "ID": 122558,
            "ConnectionTypeID": 30,
            "StatusTypeID": 50,
            "LevelID": 2,
            "Amps": 32,
            "Voltage": 230,
            "PowerKW": 14,
            "CurrentTypeID": 20,
            "Quantity": 1
        }
    ],
    "NumberOfPoints": 1,
    "GeneralComments": "1 Tesla Connector, up to 14kW.Available for patrons only. Please call ahead.",
    "StatusTypeID": 50,
    "DateLastStatusUpdate": "2018-10-03T19:49:00Z",
    "DataQualityLevel": 1,
    "DateCreated": "2017-04-29T05:52:00Z",
    "SubmissionStatusTypeID": 200
}