{
    "IsRecentlyVerified": false,
    "ID": 106144,
    "UUID": "BCC07420-ADBE-4DA8-A064-451D1CD77093",
    "DataProviderID": 1,
    "OperatorID": 23,
    "OperatorsReference": "44272",
    "UsageTypeID": 4,
    "AddressInfo": {
        "ID": 106490,
        "Title": "The Cavalier Virginia Beach",
        "AddressLine1": "4200 Atlantic Ave",
        "Town": "Virginia Beach",
        "StateOrProvince": "Virginia",
        "Postcode": "23451",
        "CountryID": 2,
        "Latitude": 36.86894,
        "Longitude": -75.9844534,
        "ContactTelephone1": "(757) 425-8555",
        "DistanceUnit": 0
    },
    "Connections": [
        {
            "ID": 149476,
            "ConnectionTypeID": 30,
            "StatusTypeID": 50,
            "LevelID": 2,
            "PowerKW": 16,
            "CurrentTypeID": 20,
            "Quantity": 3
        }
    ],
    "NumberOfPoints": 3,
    "GeneralComments": "3 Tesla Connectors, up to 16kW.Available for customers. Please see front desk.",
    "StatusTypeID": 50,
    "DateLastStatusUpdate": "2018-06-16T05:30:00Z",
    "DataQualityLevel": 1,
    "DateCreated": "2018-06-16T05:30:00Z",
    "SubmissionStatusTypeID": 200
}