{
    "MediaItems": [
        {
            "ID": 2891,
            "ChargePointID": 51581,
            "ItemURL": "https://s3-ap-southeast-2.amazonaws.com/openchargemap/images/US/OCM51581/OCM-51581.orig.2015073106245807.jpg",
            "ItemThumbnailURL": "https://s3-ap-southeast-2.amazonaws.com/openchargemap/images/US/OCM51581/OCM-51581.thmb.2015073106245807.jpg",
            "Comment": "",
            "IsEnabled": true,
            "IsVideo": false,
            "IsFeaturedItem": false,
            "IsExternalResource": false,
            "User": {
                "ID": 2310,
                "Username": "Peter K."
            },
            "DateCreated": "2015-07-31T06:25:00Z"
        },
        {
            "ID": 2890,
            "ChargePointID": 51581,
            "ItemURL": "https://s3-ap-southeast-2.amazonaws.com/openchargemap/images/US/OCM51581/OCM-51581.orig.2015073106231890.jpg",
            "ItemThumbnailURL": "https://s3-ap-southeast-2.amazonaws.com/openchargemap/images/US/OCM51581/OCM-51581.thmb.2015073106231890.jpg",
            "Comment": "",
            "IsEnabled": true,
            "IsVideo": false,
            "IsFeaturedItem": false,
            "IsExternalResource": false,
            "User": {
                "ID": 2310,
                "Username": "Peter K."
            },
            "DateCreated": "2015-07-31T06:24:00Z"
        },
        {
            "ID": 2889,
            "ChargePointID": 51581,
            "ItemURL": "https://s3-ap-southeast-2.amazonaws.com/openchargemap/images/US/OCM51581/OCM-51581.orig.2015073106225010.jpg",
            "ItemThumbnailURL": "https://s3-ap-southeast-2.amazonaws.com/openchargemap/images/US/OCM51581/OCM-51581.thmb.2015073106225010.jpg",
            "Comment": "",
            "IsEnabled": true,
            "IsVideo": false,
            "IsFeaturedItem": false,
            "IsExternalResource": false,
            "User": {
                "ID": 2310,
                "Username": "Peter K."
            },
            "DateCreated": "2015-07-31T06:23:00Z"
        }
    ],
    "IsRecentlyVerified": false,
    "ID": 51581,
    "UUID": "4CB15173-16DF-47D2-ACE5-9353AE502AA3",
    "DataProviderID": 1,
    "OperatorID": 9,
    "UsageTypeID": 0,
    "AddressInfo": {
        "ID": 51927,
        "Title": "Honeywell - Deer Valley",
        "AddressLine1": "N19th Ave Phoenix",
        "AddressLine2": "Deer Valley",
        "Town": "Phoenix",
        "StateOrProvince": "AZ",
        "Postcode": "85027",
        "CountryID": 2,
        "Latitude": 33.6820646074389,
        "Longitude": -112.097709135661,
        "AccessComments": "From the north side of most northern Honeywell building.",
        "DistanceUnit": 0
    },
    "Connections": [
        {
            "ID": 63958,
            "ConnectionTypeID": 1,
            "StatusTypeID": 50,
            "Quantity": 3
        }
    ],
    "NumberOfPoints": 3,
    "StatusTypeID": 50,
    "DateLastStatusUpdate": "2015-08-02T18:50:00Z",
    "DataQualityLevel": 1,
    "DateCreated": "2015-07-31T06:22:00Z",
    "SubmissionStatusTypeID": 200
}