{
    "MediaItems": [
        {
            "ID": 247,
            "ChargePointID": 21140,
            "ItemURL": "https://s3-ap-southeast-2.amazonaws.com/openchargemap/images/IT/OCM21140/OCM-21140.orig.2014022417532532.jpg",
            "ItemThumbnailURL": "https://s3-ap-southeast-2.amazonaws.com/openchargemap/images/IT/OCM21140/OCM-21140.thmb.2014022417532532.jpg",
            "Comment": "",
            "IsEnabled": true,
            "IsVideo": false,
            "IsFeaturedItem": false,
            "IsExternalResource": false,
            "User": {
                "ID": 1606,
                "Username": "polianto"
            },
            "DateCreated": "2014-02-24T17:54:00Z"
        }
    ],
    "IsRecentlyVerified": false,
    "ID": 21140,
    "UUID": "8B652F5A-8E03-451D-85F7-D5A5BDCBDD29",
    "DataProviderID": 1,
    "OperatorID": 80,
    "UsageTypeID": 4,
    "UsageCost": "0,40€/kWh",
    "AddressInfo": {
        "ID": 21485,
        "Title": "Eneldrive Via Salvemini SDM",
        "AddressLine1": "Via Salvemini",
        "Town": "San Donato Milanese",
        "StateOrProvince": "Milano",
        "Postcode": "20097",
        "CountryID": 112,
        "Latitude": 45.419654869814,
        "Longitude": 9.25863134264454,
        "RelatedURL": "https://www.eneldrive.it/",
        "DistanceUnit": 0
    },
    "Connections": [
        {
            "ID": 22998,
            "ConnectionTypeID": 25,
            "StatusTypeID": 30,
            "LevelID": 2,
            "Amps": 32,
            "Voltage": 400,
            "PowerKW": 22,
            "CurrentTypeID": 20,
            "Quantity": 1
        },
        {
            "ID": 83741,
            "ConnectionTypeID": 36,
            "StatusTypeID": 30,
            "LevelID": 2,
            "Amps": 16,
            "Voltage": 240,
            "PowerKW": 3.7,
            "CurrentTypeID": 10,
            "Quantity": 1
        }
    ],
    "NumberOfPoints": 1,
    "StatusTypeID": 30,
    "DateLastStatusUpdate": "2016-08-28T12:17:00Z",
    "DataQualityLevel": 1,
    "DateCreated": "2014-02-24T17:50:00Z",
    "SubmissionStatusTypeID": 200
}