{
    "IsRecentlyVerified": false,
    "ID": 9460,
    "UUID": "A5CA57FB-8A6D-4F2C-9391-0DB8F23D6F3A",
    "DataProviderID": 1,
    "DataProvidersReference": "LSB-00521",
    "OperatorID": 21,
    "UsageTypeID": 4,
    "UsageCost": "Mobi.E compatible card",
    "AddressInfo": {
        "ID": 9357,
        "Title": "LSB-00520",
        "AddressLine1": "Praça Afonso de Albuquerque",
        "Town": "Lisboa",
        "Postcode": "1300-004",
        "CountryID": 180,
        "Latitude": 38.696606,
        "Longitude": -9.201489,
        "RelatedURL": "http://www.mobie.pt",
        "DistanceUnit": 0
    },
    "Connections": [
        {
            "ID": 33205,
            "ConnectionTypeID": 25,
            "StatusTypeID": 50,
            "LevelID": 2,
            "Amps": 16,
            "Voltage": 230,
            "PowerKW": 3.7,
            "CurrentTypeID": 10,
            "Quantity": 6
        }
    ],
    "NumberOfPoints": 6,
    "StatusTypeID": 50,
    "DateLastStatusUpdate": "2020-08-18T20:54:00Z",
    "DataQualityLevel": 3,
    "DateCreated": "2012-02-08T15:16:00Z",
    "SubmissionStatusTypeID": 100
}