{
    "IsRecentlyVerified": false,
    "ID": 60405,
    "UUID": "AD21E7EF-3A8A-46B0-AFBA-DFA46EB6C604",
    "DataProviderID": 1,
    "OperatorID": 1,
    "UsageTypeID": 1,
    "AddressInfo": {
        "ID": 60751,
        "Title": "Bahnhof",
        "AddressLine1": "Bahnhofstraße",
        "Town": "Ritterhude",
        "StateOrProvince": "Landkreis Osterholz",
        "Postcode": "27721",
        "CountryID": 87,
        "Latitude": 53.18356,
        "Longitude": 8.754860000000008,
        "AccessComments": "Rund um die Uhr (24/7) nutzbar\r\n",
        "RelatedURL": "http://www.osterholzer-stadtwerke.de/",
        "DistanceUnit": 0
    },
    "Connections": [
        {
            "ID": 76518,
            "ConnectionTypeID": 25,
            "StatusTypeID": 50,
            "LevelID": 2,
            "Amps": 32,
            "Voltage": 400,
            "PowerKW": 22,
            "CurrentTypeID": 20,
            "Quantity": 2
        }
    ],
    "NumberOfPoints": 2,
    "StatusTypeID": 50,
    "DateLastStatusUpdate": "2016-01-25T07:27:00Z",
    "DataQualityLevel": 1,
    "DateCreated": "2016-01-25T07:27:00Z",
    "SubmissionStatusTypeID": 200
}