{
    "IsRecentlyVerified": false,
    "ID": 89974,
    "UUID": "15C0D159-A77E-4310-B4A7-A8DC13099C1F",
    "DataProviderID": 1,
    "OperatorID": 3261,
    "UsageTypeID": 4,
    "AddressInfo": {
        "ID": 90320,
        "Title": "Sankt-Jürgener-Straße",
        "AddressLine1": "Sankt-Jürgener-Straße 17",
        "AddressLine2": "Sankt Jürgen",
        "Town": "Schleswig",
        "StateOrProvince": "Kreis Schleswig-Flensburg",
        "Postcode": "24837",
        "CountryID": 87,
        "Latitude": 54.5240261,
        "Longitude": 9.570390699999962,
        "ContactTelephone1": "+49 4621 801 0",
        "AccessComments": "In der Nähe des Helios Klinikums an der Straße. Freischaltung mit New Motion, PlugSurfing, Z.E. Pass oder über die emobility community Website.",
        "DistanceUnit": 0
    },
    "Connections": [
        {
            "ID": 127544,
            "ConnectionTypeID": 25,
            "StatusTypeID": 50,
            "LevelID": 2,
            "Amps": 32,
            "Voltage": 400,
            "PowerKW": 22,
            "CurrentTypeID": 20,
            "Quantity": 2
        }
    ],
    "NumberOfPoints": 2,
    "StatusTypeID": 50,
    "DateLastStatusUpdate": "2017-07-03T07:22:00Z",
    "DataQualityLevel": 1,
    "DateCreated": "2017-07-03T07:22:00Z",
    "SubmissionStatusTypeID": 200
}