{
    "IsRecentlyVerified": false,
    "ID": 36635,
    "UUID": "62700D39-A53B-4024-91D4-2156947724D4",
    "DataProviderID": 26,
    "DataProvidersReference": "56233",
    "OperatorID": 73,
    "OperatorsReference": "EV-Box EVB-P1437147",
    "UsageCost": "0.00 jaarabonnement",
    "AddressInfo": {
        "ID": 36981,
        "Title": "Warmonderweg 3",
        "AddressLine1": "Warmonderweg 3",
        "Town": "Teylingen",
        "Postcode": "2171 AH",
        "CountryID": 159,
        "Latitude": 52.21471,
        "Longitude": 4.50341,
        "RelatedURL": "http://www.ev-box.nl",
        "DistanceUnit": 0
    },
    "Connections": [
        {
            "ID": 40146,
            "ConnectionTypeID": 25,
            "LevelID": 2,
            "PowerKW": 11,
            "CurrentTypeID": 10
        },
        {
            "ID": 48428,
            "ConnectionTypeID": 25,
            "LevelID": 2,
            "PowerKW": 11,
            "CurrentTypeID": 10
        }
    ],
    "NumberOfPoints": 1,
    "StatusTypeID": 50,
    "DateLastStatusUpdate": "2016-06-04T02:51:00Z",
    "DataQualityLevel": 3,
    "DateCreated": "2015-01-09T06:05:00Z",
    "SubmissionStatusTypeID": 100
}