{
    "IsRecentlyVerified": false,
    "ID": 163682,
    "UUID": "C02EC66E-BCAA-42F3-9503-C0B089779E6D",
    "DataProviderID": 1,
    "OperatorID": 23,
    "OperatorsReference": "33414",
    "UsageTypeID": 4,
    "AddressInfo": {
        "ID": 164039,
        "Title": "Los Naranjos Campo de Golf",
        "AddressLine1": "Los Naranjos Campo de Golf",
        "Postcode": "29660",
        "CountryID": 210,
        "Latitude": 36.509707,
        "Longitude": -4.979749,
        "ContactTelephone1": "+34 952 81 24 28",
        "DistanceUnit": 0
    },
    "Connections": [
        {
            "ID": 235279,
            "ConnectionTypeID": 30,
            "StatusTypeID": 50,
            "LevelID": 2,
            "PowerKW": 11,
            "CurrentTypeID": 20,
            "Quantity": 1
        }
    ],
    "NumberOfPoints": 1,
    "GeneralComments": "1 Tesla Connector, up to 11kW.Available for customers. Self park.",
    "StatusTypeID": 50,
    "DateLastStatusUpdate": "2020-08-24T14:28:00Z",
    "DataQualityLevel": 1,
    "DateCreated": "2020-08-24T14:28:00Z",
    "SubmissionStatusTypeID": 200
}