{
    "IsRecentlyVerified": false,
    "ID": 75442,
    "UUID": "C068576E-A45A-46AE-854F-A3EF5518A2FB",
    "DataProviderID": 1,
    "OperatorID": 23,
    "OperatorsReference": "19433",
    "UsageTypeID": 4,
    "UsageCost": "£0.24/kWh;other tariffs for older cars",
    "AddressInfo": {
        "ID": 75788,
        "Title": "Sarn Park Supercharger",
        "AddressLine1": "Sarn Park Services",
        "AddressLine2": "Pen y Cae",
        "Town": "Bridgend",
        "Postcode": "CF32 9SY",
        "CountryID": 1,
        "Latitude": 51.535351,
        "Longitude": -3.577637,
        "DistanceUnit": 0
    },
    "Connections": [
        {
            "ID": 108747,
            "ConnectionTypeID": 27,
            "StatusTypeID": 50,
            "LevelID": 3,
            "PowerKW": 120,
            "CurrentTypeID": 30,
            "Quantity": 8
        }
    ],
    "NumberOfPoints": 8,
    "GeneralComments": "8 Superchargers, available 24/7",
    "StatusTypeID": 50,
    "DateLastStatusUpdate": "2020-10-16T10:57:00Z",
    "DataQualityLevel": 1,
    "DateCreated": "2016-12-14T20:26:00Z",
    "SubmissionStatusTypeID": 200
}