{
    "IsRecentlyVerified": false,
    "ID": 31011,
    "UUID": "DE623898-133B-45BE-A768-27B0C93E98CD",
    "DataProviderID": 1,
    "DataProvidersReference": "2169",
    "AddressInfo": {
        "ID": 31357,
        "Title": "Tanka i Östersund",
        "AddressLine1": "Montörvägen 30",
        "Town": "ÖSTERSUND",
        "StateOrProvince": "JÄMTLAND",
        "Postcode": "83148",
        "CountryID": 216,
        "Latitude": 63.17009,
        "Longitude": 14.67932,
        "AccessComments": "Vid Bilbolagets entré.",
        "DistanceUnit": 0
    },
    "Connections": [
        {
            "ID": 34240,
            "ConnectionTypeID": 0,
            "Reference": "1",
            "LevelID": 2,
            "Amps": 16,
            "Voltage": 230,
            "PowerKW": 3.7,
            "Comments": "Mode 3"
        },
        {
            "ID": 89365,
            "ConnectionTypeID": 0,
            "Reference": "2",
            "LevelID": 2,
            "Amps": 16,
            "Voltage": 230,
            "PowerKW": 3.7,
            "Comments": "Mode 3"
        }
    ],
    "NumberOfPoints": 2,
    "DateLastStatusUpdate": "2020-05-26T08:25:00Z",
    "DataQualityLevel": 2,
    "DateCreated": "2014-12-09T09:01:00Z",
    "SubmissionStatusTypeID": 100
}