{
    "IsRecentlyVerified": false,
    "ID": 57066,
    "UUID": "836DE30E-8386-4564-82A1-68B29683D231",
    "DataProviderID": 1,
    "OperatorID": 45,
    "UsageTypeID": 1,
    "AddressInfo": {
        "ID": 57412,
        "Title": "CCS Ladepunkt BMW Welt",
        "AddressLine1": "Am Olympiapark",
        "AddressLine2": "Bezirksteil Am Riesenfeld",
        "Town": "München",
        "StateOrProvince": "Bayern",
        "Postcode": "80809",
        "CountryID": 87,
        "Latitude": 48.176931614253995,
        "Longitude": 11.55748739874186,
        "AccessComments": "2 kostelose Parkplätze an formschöner Ladestelle mit Überdachung, 24/7 kostenlos nutzbar.",
        "RelatedURL": "http://www.bmw-welt.com/",
        "DistanceUnit": 0
    },
    "Connections": [
        {
            "ID": 72093,
            "ConnectionTypeID": 33,
            "StatusTypeID": 50,
            "LevelID": 3,
            "PowerKW": 50,
            "CurrentTypeID": 30,
            "Quantity": 1
        }
    ],
    "NumberOfPoints": 1,
    "StatusTypeID": 50,
    "DateLastStatusUpdate": "2015-11-21T20:53:00Z",
    "DataQualityLevel": 1,
    "DateCreated": "2015-11-21T20:53:00Z",
    "SubmissionStatusTypeID": 200
}