{
    "IsRecentlyVerified": false,
    "ID": 186116,
    "UUID": "76964B3B-2732-4D4B-9DE3-8F517AA9FED2",
    "DataProviderID": 29,
    "DataProvidersReference": "8403",
    "AddressInfo": {
        "ID": 186475,
        "Title": "Moorstraße 11",
        "AddressLine1": "Moorstraße 11",
        "Town": "Plauen",
        "Postcode": "08527",
        "CountryID": 87,
        "Latitude": 50.492029,
        "Longitude": 12.144375,
        "DistanceUnit": 0
    },
    "Connections": [
        {
            "ID": 297827,
            "ConnectionTypeID": 33,
            "StatusTypeID": 50,
            "LevelID": 3,
            "PowerKW": 22,
            "CurrentTypeID": 30
        },
        {
            "ID": 297828,
            "ConnectionTypeID": 25,
            "StatusTypeID": 50,
            "LevelID": 2,
            "PowerKW": 11,
            "CurrentTypeID": 20
        }
    ],
    "StatusTypeID": 50,
    "DateLastStatusUpdate": "2021-07-12T02:45:00Z",
    "MetadataValues": [
        {
            "ID": 18358,
            "MetadataFieldID": 4,
            "ItemValue": "Data from the German chargepoint registry provided by Bundesnetzagentur.de under the CC-BY 4.0 license"
        }
    ],
    "DataQualityLevel": 3,
    "DateCreated": "2021-07-12T02:45:00Z",
    "SubmissionStatusTypeID": 100
}