{
    "IsRecentlyVerified": false,
    "ID": 144277,
    "UUID": "3A54C2B1-01ED-4B59-B9E8-125229E1EA9A",
    "DataProviderID": 2,
    "DataProvidersReference": "129677",
    "OperatorID": 89,
    "UsageTypeID": 1,
    "AddressInfo": {
        "ID": 144629,
        "Title": "Mail Champlain",
        "AddressLine1": "2151 boul. Lapinière",
        "Town": "Brossard",
        "StateOrProvince": "QC",
        "Postcode": "J4W 2T5",
        "CountryID": 44,
        "Latitude": 45.472098,
        "Longitude": -73.470775,
        "ContactTelephone1": "888-356-8911",
        "AccessComments": "24 hours daily",
        "RelatedURL": "https://flo.ca/",
        "DistanceUnit": 0
    },
    "Connections": [
        {
            "ID": 200769,
            "ConnectionTypeID": 1,
            "LevelID": 2,
            "Amps": 16,
            "Voltage": 230,
            "PowerKW": 3.7,
            "CurrentTypeID": 10,
            "Quantity": 4
        }
    ],
    "StatusTypeID": 50,
    "DateLastStatusUpdate": "2020-06-26T03:09:00Z",
    "DataQualityLevel": 3,
    "DateCreated": "2019-12-24T09:23:00Z",
    "SubmissionStatusTypeID": 100
}