{
    "IsRecentlyVerified": false,
    "ID": 20482,
    "UUID": "089CF8AB-9F24-422F-A763-D37E2E2780E7",
    "DataProviderID": 1,
    "OperatorID": 1,
    "UsageTypeID": 0,
    "UsageCost": "",
    "AddressInfo": {
        "ID": 20827,
        "Title": "Restaurant Marguin",
        "AddressLine1": "916 Route de Strasbourg ",
        "AddressLine2": "",
        "Town": "Les Echets",
        "StateOrProvince": "",
        "Postcode": "01700",
        "CountryID": 80,
        "Latitude": 45.87232,
        "Longitude": 4.91215,
        "ContactTelephone1": "",
        "ContactTelephone2": "",
        "ContactEmail": "",
        "AccessComments": "Réservé aux clients de l'établissement",
        "RelatedURL": "",
        "DistanceUnit": 0
    },
    "Connections": [],
    "GeneralComments": "",
    "StatusTypeID": 50,
    "DateLastStatusUpdate": "2013-11-15T14:44:00Z",
    "DataQualityLevel": 1,
    "DateCreated": "2013-11-15T10:48:00Z",
    "SubmissionStatusTypeID": 200
}