{
    "IsRecentlyVerified": false,
    "ID": 177013,
    "UUID": "320923F2-46D2-4735-8F4E-F6F7DD595AE7",
    "DataProviderID": 29,
    "DataProvidersReference": "6106",
    "AddressInfo": {
        "ID": 177372,
        "Title": "Rosenstraße 16",
        "AddressLine1": "Rosenstraße 16",
        "Town": "Türkheim",
        "Postcode": "86842",
        "CountryID": 87,
        "Latitude": 48.060687,
        "Longitude": 10.638703,
        "DistanceUnit": 0
    },
    "Connections": [
        {
            "ID": 275652,
            "ConnectionTypeID": 25,
            "StatusTypeID": 50,
            "LevelID": 2,
            "PowerKW": 22,
            "CurrentTypeID": 20
        },
        {
            "ID": 275653,
            "ConnectionTypeID": 25,
            "StatusTypeID": 50,
            "LevelID": 2,
            "PowerKW": 22,
            "CurrentTypeID": 20
        }
    ],
    "StatusTypeID": 0,
    "DateLastStatusUpdate": "2021-07-09T03:11:00Z",
    "MetadataValues": [
        {
            "ID": 9307,
            "MetadataFieldID": 4,
            "ItemValue": "Data from the German chargepoint registry provided by Bundesnetzagentur.de under the CC-BY 4.0 license"
        }
    ],
    "DataQualityLevel": 3,
    "DateCreated": "2021-07-08T09:48:00Z",
    "SubmissionStatusTypeID": 100
}