{
    "IsRecentlyVerified": false,
    "ID": 54830,
    "UUID": "75B4773D-F9E2-4903-A4D5-53DCE0750859",
    "DataProviderID": 1,
    "OperatorID": 23,
    "OperatorsReference": "7197",
    "UsageTypeID": 1,
    "UsageCost": "Free",
    "AddressInfo": {
        "ID": 55176,
        "Title": "Lakehouse Hotel and Resort - Tesla",
        "AddressLine1": "1025 La Bonita Dr",
        "Town": "San Marcos",
        "StateOrProvince": "CA",
        "Postcode": "92078",
        "CountryID": 2,
        "Latitude": 33.1248309,
        "Longitude": -117.2078864,
        "ContactTelephone1": "760-744-0120  877-798-3752",
        "AccessComments": "24 hours daily; for Tesla use only; for guest use only",
        "RelatedURL": "http://www.teslamotors.com/supercharger",
        "DistanceUnit": 0
    },
    "Connections": [
        {
            "ID": 69304,
            "ConnectionTypeID": 30,
            "StatusTypeID": 50,
            "LevelID": 2,
            "Amps": 16,
            "Voltage": 230,
            "PowerKW": 8,
            "CurrentTypeID": 10,
            "Quantity": 1
        }
    ],
    "NumberOfPoints": 1,
    "StatusTypeID": 50,
    "DateLastStatusUpdate": "2017-01-26T16:43:00Z",
    "DataQualityLevel": 3,
    "DateCreated": "2015-10-09T07:24:00Z",
    "SubmissionStatusTypeID": 100
}