{
    "IsRecentlyVerified": false,
    "ID": 84855,
    "UUID": "5CEF8597-0006-4F31-9DCD-B10CD388CED1",
    "DataProviderID": 1,
    "OperatorID": 69,
    "UsageTypeID": 4,
    "AddressInfo": {
        "ID": 85201,
        "Title": "Parkhaus Emsgalerie",
        "AddressLine1": "Münsterstraße 37",
        "Town": "Rheine",
        "StateOrProvince": "Kreis Steinfurt",
        "Postcode": "48431",
        "CountryID": 87,
        "Latitude": 52.27800307307736,
        "Longitude": 7.441601037573258,
        "ContactTelephone1": "+49 5971 45260",
        "AccessComments": "Auf dem Parkdeck P3, leicht erkennbar",
        "RelatedURL": "http://www.stadtwerke-rheine.de/",
        "DistanceUnit": 0
    },
    "Connections": [
        {
            "ID": 120577,
            "ConnectionTypeID": 25,
            "StatusTypeID": 50,
            "LevelID": 2,
            "Amps": 32,
            "Voltage": 400,
            "PowerKW": 22,
            "CurrentTypeID": 20,
            "Quantity": 2
        }
    ],
    "NumberOfPoints": 2,
    "StatusTypeID": 50,
    "DateLastStatusUpdate": "2017-03-20T07:08:00Z",
    "DataQualityLevel": 1,
    "DateCreated": "2017-03-20T07:08:00Z",
    "SubmissionStatusTypeID": 200
}