{
    "IsRecentlyVerified": false,
    "ID": 137814,
    "UUID": "CD024DE5-BF0F-457F-9E3E-B12EF852BFB2",
    "DataProviderID": 2,
    "DataProvidersReference": "123656",
    "OperatorID": 5,
    "UsageTypeID": 1,
    "AddressInfo": {
        "ID": 138163,
        "Title": "WESTFIELD UTC",
        "AddressLine1": "8800 Lombard Place",
        "Town": "San Diego",
        "StateOrProvince": "CA",
        "Postcode": "92122",
        "CountryID": 2,
        "Latitude": 32.867443,
        "Longitude": -117.2120705,
        "ContactTelephone1": "888-758-4389",
        "AccessComments": "24 hours daily",
        "RelatedURL": "http://www.chargepoint.com/",
        "DistanceUnit": 0
    },
    "Connections": [
        {
            "ID": 192821,
            "ConnectionTypeID": 1,
            "LevelID": 2,
            "Amps": 16,
            "Voltage": 230,
            "PowerKW": 3,
            "CurrentTypeID": 10,
            "Quantity": 11
        }
    ],
    "StatusTypeID": 50,
    "DateLastStatusUpdate": "2019-12-24T09:06:00Z",
    "DataQualityLevel": 3,
    "DateCreated": "2019-12-24T09:06:00Z",
    "SubmissionStatusTypeID": 100
}