{
    "IsRecentlyVerified": false,
    "ID": 91807,
    "UUID": "2285516E-7980-40A9-8825-6316DF80374A",
    "DataProviderID": 1,
    "OperatorID": 23,
    "OperatorsReference": "32826",
    "UsageTypeID": 4,
    "AddressInfo": {
        "ID": 92153,
        "Title": "Hotel Mision Colima",
        "AddressLine1": "Blvd. Camino Real No. 999 Col. el Diezmo",
        "Town": "Colima",
        "StateOrProvince": "Colima",
        "Postcode": "28010",
        "CountryID": 146,
        "Latitude": 19.257353,
        "Longitude": -103.694081,
        "ContactTelephone1": "+52 312 313 8102",
        "DistanceUnit": 0
    },
    "Connections": [
        {
            "ID": 130156,
            "ConnectionTypeID": 30,
            "StatusTypeID": 50,
            "LevelID": 2,
            "PowerKW": 18,
            "CurrentTypeID": 20,
            "Quantity": 3
        }
    ],
    "NumberOfPoints": 3,
    "GeneralComments": "3 Tesla Connectors, up to 18kW.Available for customers. Please see front desk.",
    "StatusTypeID": 50,
    "DateLastStatusUpdate": "2017-08-18T07:38:00Z",
    "DataQualityLevel": 1,
    "DateCreated": "2017-08-18T07:38:00Z",
    "SubmissionStatusTypeID": 200
}