{
    "IsRecentlyVerified": false,
    "ID": 160361,
    "UUID": "27CEEA1E-0D72-4618-A572-78715E2C4488",
    "DataProviderID": 2,
    "DataProvidersReference": "157684",
    "UsageTypeID": 2,
    "AddressInfo": {
        "ID": 160718,
        "Title": "Canadian Tire Corporation",
        "AddressLine1": "2010 Ogilvie Rd",
        "Town": "Gloucester",
        "StateOrProvince": "ON",
        "Postcode": "K1J 8X3",
        "CountryID": 44,
        "Latitude": 45.435066,
        "Longitude": -75.6086337,
        "ContactTelephone1": "",
        "AccessComments": "",
        "RelatedURL": "",
        "DistanceUnit": 0
    },
    "Connections": [
        {
            "ID": 230733,
            "ConnectionTypeID": 2,
            "LevelID": 3,
            "Amps": 100,
            "Voltage": 400,
            "PowerKW": 40,
            "CurrentTypeID": 30,
            "Quantity": 1
        },
        {
            "ID": 230734,
            "ConnectionTypeID": 32,
            "LevelID": 3,
            "Amps": 100,
            "Voltage": 400,
            "PowerKW": 40,
            "CurrentTypeID": 30,
            "Quantity": 1
        }
    ],
    "GeneralComments": "Planned for future date. Not Operational.",
    "DatePlanned": "2020-09-01T00:00:00Z",
    "StatusTypeID": 150,
    "DateLastStatusUpdate": "2020-06-26T03:09:00Z",
    "DataQualityLevel": 3,
    "DateCreated": "2020-06-26T03:09:00Z",
    "SubmissionStatusTypeID": 100
}