{
    "IsRecentlyVerified": false,
    "ID": 71943,
    "UUID": "5B392891-2B1D-4245-AE70-735D64206230",
    "DataProviderID": 1,
    "OperatorID": 156,
    "UsageTypeID": 4,
    "UsageCost": "0,30€/kWh",
    "AddressInfo": {
        "ID": 72289,
        "Title": "Zender-Exclusiv-Auto",
        "AddressLine1": "Florinstraße 12",
        "Town": "Mülheim-Kärlich",
        "StateOrProvince": "Weißenthurm",
        "Postcode": "56218",
        "CountryID": 87,
        "Latitude": 50.39294453090975,
        "Longitude": 7.525130454631035,
        "RelatedURL": "http://www.autohaus-zender.de/",
        "DistanceUnit": 0
    },
    "Connections": [
        {
            "ID": 103123,
            "ConnectionTypeID": 25,
            "StatusTypeID": 50,
            "LevelID": 2,
            "Amps": 32,
            "Voltage": 400,
            "PowerKW": 22,
            "CurrentTypeID": 20,
            "Quantity": 1
        }
    ],
    "NumberOfPoints": 1,
    "StatusTypeID": 50,
    "DateLastStatusUpdate": "2016-09-26T06:32:00Z",
    "DataQualityLevel": 1,
    "DateCreated": "2016-09-26T06:32:00Z",
    "SubmissionStatusTypeID": 200
}