{
    "IsRecentlyVerified": false,
    "ID": 159335,
    "UUID": "940E27BF-AFD3-47D3-98F9-8335E4690CE4",
    "DataProviderID": 2,
    "DataProvidersReference": "154186",
    "OperatorID": 15,
    "UsageTypeID": 1,
    "AddressInfo": {
        "ID": 159692,
        "Title": "Sheetz #304",
        "AddressLine1": "25224 Poland Rd",
        "Town": "Chantilly",
        "StateOrProvince": "VA",
        "Postcode": "20152",
        "CountryID": 2,
        "Latitude": 38.9194482,
        "Longitude": -77.4982189,
        "ContactTelephone1": "877-455-3833",
        "AccessComments": "24 hours daily",
        "RelatedURL": "https://www.evgo.com/",
        "DistanceUnit": 0
    },
    "Connections": [
        {
            "ID": 229485,
            "ConnectionTypeID": 2,
            "LevelID": 3,
            "Amps": 100,
            "Voltage": 400,
            "PowerKW": 40,
            "CurrentTypeID": 30,
            "Quantity": 1
        },
        {
            "ID": 229486,
            "ConnectionTypeID": 32,
            "LevelID": 3,
            "Amps": 100,
            "Voltage": 400,
            "PowerKW": 40,
            "CurrentTypeID": 30,
            "Quantity": 1
        }
    ],
    "StatusTypeID": 50,
    "DateLastStatusUpdate": "2020-06-26T03:00:00Z",
    "DataQualityLevel": 3,
    "DateCreated": "2020-06-26T03:00:00Z",
    "SubmissionStatusTypeID": 100
}