{
    "IsRecentlyVerified": false,
    "ID": 144288,
    "UUID": "803927F4-A2DA-48A6-9C1E-6A57FBC632E4",
    "DataProviderID": 2,
    "DataProvidersReference": "130416",
    "OperatorID": 90,
    "UsageTypeID": 1,
    "AddressInfo": {
        "ID": 144640,
        "Title": "2855 Centre",
        "AddressLine1": "2855 rue du Centre",
        "Town": "Montréal",
        "StateOrProvince": "QC",
        "Postcode": "H4C 3B4",
        "CountryID": 44,
        "Latitude": 45.476636,
        "Longitude": -73.572661,
        "ContactTelephone1": "877-505-2674",
        "AccessComments": "24 hours daily",
        "RelatedURL": "https://lecircuitelectrique.com/",
        "DistanceUnit": 0
    },
    "Connections": [
        {
            "ID": 200783,
            "ConnectionTypeID": 1,
            "LevelID": 2,
            "Amps": 16,
            "Voltage": 230,
            "PowerKW": 3.7,
            "CurrentTypeID": 10,
            "Quantity": 2
        }
    ],
    "StatusTypeID": 50,
    "DateLastStatusUpdate": "2020-06-26T03:09:00Z",
    "DataQualityLevel": 3,
    "DateCreated": "2019-12-24T09:23:00Z",
    "SubmissionStatusTypeID": 100
}