{
    "IsRecentlyVerified": false,
    "ID": 120984,
    "UUID": "B4EBCC1E-003B-4DB3-B028-5779C42B2148",
    "DataProviderID": 2,
    "DataProvidersReference": "85560",
    "OperatorID": 5,
    "UsageTypeID": 1,
    "AddressInfo": {
        "ID": 121330,
        "Title": "MOORES MILL",
        "AddressLine1": "2330 Coronet Way NW",
        "Town": "Atlanta",
        "StateOrProvince": "GA",
        "Postcode": "30318",
        "CountryID": 2,
        "Latitude": 33.8191221,
        "Longitude": -84.4488843,
        "ContactTelephone1": "888-758-4389",
        "AccessComments": "24 hours daily",
        "RelatedURL": "http://www.chargepoint.com/",
        "DistanceUnit": 0
    },
    "Connections": [
        {
            "ID": 170393,
            "ConnectionTypeID": 1,
            "LevelID": 2,
            "Amps": 16,
            "Voltage": 230,
            "PowerKW": 3.7,
            "CurrentTypeID": 10,
            "Quantity": 2
        }
    ],
    "DateLastStatusUpdate": "2020-06-26T02:56:00Z",
    "DataQualityLevel": 3,
    "DateCreated": "2019-04-01T04:59:00Z",
    "SubmissionStatusTypeID": 100
}