{
    "IsRecentlyVerified": false,
    "ID": 163584,
    "UUID": "1A1DD934-E6BF-49E8-B44E-4555B8A416FE",
    "DataProviderID": 1,
    "OperatorID": 23,
    "OperatorsReference": "44432",
    "UsageTypeID": 4,
    "AddressInfo": {
        "ID": 163941,
        "Title": "Hotel Yoy Villa de Sallent",
        "AddressLine1": "Av. de los Pirineos",
        "Town": "s/n",
        "StateOrProvince": "Formigal",
        "Postcode": "22640",
        "CountryID": 210,
        "Latitude": 42.775294,
        "Longitude": -0.361528,
        "ContactTelephone1": "+34 974 49 02 23",
        "DistanceUnit": 0
    },
    "Connections": [
        {
            "ID": 235181,
            "ConnectionTypeID": 30,
            "StatusTypeID": 50,
            "LevelID": 2,
            "PowerKW": 14,
            "CurrentTypeID": 20,
            "Quantity": 1
        }
    ],
    "NumberOfPoints": 1,
    "GeneralComments": "1 Tesla Connector, up to 14kW.Available for customers. Please call ahead.",
    "StatusTypeID": 50,
    "DateLastStatusUpdate": "2020-08-24T12:55:00Z",
    "DataQualityLevel": 1,
    "DateCreated": "2020-08-24T12:55:00Z",
    "SubmissionStatusTypeID": 200
}