{
    "UserComments": [
        {
            "ID": 21571,
            "ChargePointID": 111227,
            "CommentTypeID": 10,
            "UserName": "MikeMacMan",
            "Comment": "Max of 35 kW per plugshare. However, most users reported a max of 22 kW.",
            "RelatedURL": "https://www.plugshare.com/location/124589",
            "DateCreated": "2019-09-29T07:30:04.037Z",
            "User": {
                "ID": 22305,
                "Username": "MikeMacMan"
            },
            "CheckinStatusTypeID": 0
        }
    ],
    "IsRecentlyVerified": false,
    "ID": 111227,
    "UUID": "FFE51F78-ED57-461D-AC29-AAAA7BA58C48",
    "DataProviderID": 1,
    "UsageTypeID": 1,
    "AddressInfo": {
        "ID": 111573,
        "Title": "Tim Horton's",
        "AddressLine1": "525 Highway 11 W",
        "Town": "Fort Frances",
        "StateOrProvince": "ON",
        "Postcode": "P9A 3J3",
        "CountryID": 44,
        "Latitude": 48.6101249692776,
        "Longitude": -93.4150917329781,
        "ContactTelephone1": "807-274-3953",
        "AccessComments": "24 hours daily",
        "RelatedURL": "https://www.plugshare.com/location/124589",
        "DistanceUnit": 0
    },
    "Connections": [
        {
            "ID": 156611,
            "ConnectionTypeID": 2,
            "LevelID": 2,
            "Amps": 100,
            "Voltage": 400,
            "PowerKW": 35,
            "CurrentTypeID": 10,
            "Quantity": 1
        },
        {
            "ID": 156612,
            "ConnectionTypeID": 32,
            "LevelID": 2,
            "Amps": 100,
            "Voltage": 400,
            "PowerKW": 35,
            "CurrentTypeID": 10,
            "Quantity": 1
        }
    ],
    "StatusTypeID": 0,
    "DateLastStatusUpdate": "2019-09-29T09:30:00Z",
    "DataQualityLevel": 3,
    "DateCreated": "2018-10-18T23:36:00Z",
    "SubmissionStatusTypeID": 100
}