{
    "IsRecentlyVerified": false,
    "ID": 182476,
    "UUID": "A13B8AD2-F862-454E-B704-D29012BC3A12",
    "DataProviderID": 29,
    "DataProvidersReference": "2461",
    "AddressInfo": {
        "ID": 182835,
        "Title": "Dorfstr. 12",
        "AddressLine1": "Dorfstr. 12",
        "Town": "Bordelum",
        "Postcode": "25852",
        "CountryID": 87,
        "Latitude": 54.631729,
        "Longitude": 8.938346,
        "DistanceUnit": 0
    },
    "Connections": [
        {
            "ID": 288271,
            "ConnectionTypeID": 25,
            "StatusTypeID": 50,
            "LevelID": 2,
            "PowerKW": 22,
            "CurrentTypeID": 20
        },
        {
            "ID": 288272,
            "ConnectionTypeID": 25,
            "StatusTypeID": 50,
            "LevelID": 2,
            "PowerKW": 22,
            "CurrentTypeID": 20
        },
        {
            "ID": 302510,
            "ConnectionTypeID": 25,
            "StatusTypeID": 50,
            "LevelID": 2,
            "PowerKW": 22,
            "CurrentTypeID": 20
        },
        {
            "ID": 302511,
            "ConnectionTypeID": 25,
            "StatusTypeID": 50,
            "LevelID": 2,
            "PowerKW": 22,
            "CurrentTypeID": 20
        }
    ],
    "StatusTypeID": 50,
    "DateLastStatusUpdate": "2021-07-12T02:52:00Z",
    "MetadataValues": [
        {
            "ID": 14769,
            "MetadataFieldID": 4,
            "ItemValue": "Data from the German chargepoint registry provided by Bundesnetzagentur.de under the CC-BY 4.0 license"
        }
    ],
    "DataQualityLevel": 3,
    "DateCreated": "2021-07-08T10:03:00Z",
    "SubmissionStatusTypeID": 100
}