{
    "IsRecentlyVerified": false,
    "ID": 128391,
    "UUID": "09226E4E-8905-4A93-9B5C-699BEAA42ACC",
    "DataProviderID": 1,
    "OperatorID": 45,
    "UsageTypeID": 6,
    "UsageCost": "Free For Customers",
    "AddressInfo": {
        "ID": 128737,
        "Title": "Batchelors of York Suzuki",
        "AddressLine1": "Ings Lane",
        "AddressLine2": "Nether Poppleton",
        "Town": "Nether Poppleton",
        "StateOrProvince": "York",
        "Postcode": "YO26 6RA",
        "CountryID": 1,
        "Latitude": 53.97969384293643,
        "Longitude": -1.134434397190489,
        "ContactTelephone1": "01904520820",
        "ContactEmail": "bdc@batchelorsmotorgroup.co.uk",
        "RelatedURL": "https://www.batchelorsmotorgroup.co.uk",
        "DistanceUnit": 0
    },
    "Connections": [
        {
            "ID": 179738,
            "ConnectionTypeID": 0,
            "StatusTypeID": 50,
            "LevelID": 2
        }
    ],
    "NumberOfPoints": 2,
    "StatusTypeID": 50,
    "DateLastStatusUpdate": "2019-07-02T05:10:00Z",
    "DataQualityLevel": 1,
    "DateCreated": "2019-06-23T13:35:00Z",
    "SubmissionStatusTypeID": 200
}