{
    "IsRecentlyVerified": false,
    "ID": 153647,
    "UUID": "09746E7A-1C52-4897-924A-8BEC0B98E081",
    "DataProviderID": 28,
    "DataProvidersReference": "FR*S10*P10064B",
    "UsageTypeID": 5,
    "AddressInfo": {
        "ID": 154000,
        "Title": "BRIENNE LE CHÂTEAU",
        "AddressLine1": "29 Rue d'Arcis 10500 BRIENNE LE CHÂTEAU",
        "CountryID": 80,
        "Latitude": 48.399932,
        "Longitude": 4.516982,
        "AccessComments": "",
        "DistanceUnit": 0
    },
    "Connections": [
        {
            "ID": 215672,
            "ConnectionTypeID": 28,
            "StatusTypeID": 50,
            "LevelID": 2,
            "PowerKW": 18,
            "CurrentTypeID": 10
        },
        {
            "ID": 215673,
            "ConnectionTypeID": 25,
            "StatusTypeID": 50,
            "LevelID": 2,
            "PowerKW": 18,
            "CurrentTypeID": 20
        },
        {
            "ID": 249265,
            "ConnectionTypeID": 28,
            "StatusTypeID": 50,
            "LevelID": 2,
            "PowerKW": 18,
            "CurrentTypeID": 10
        },
        {
            "ID": 249266,
            "ConnectionTypeID": 25,
            "StatusTypeID": 50,
            "LevelID": 2,
            "PowerKW": 18,
            "CurrentTypeID": 20
        }
    ],
    "GeneralComments": "\"Une unité = 6kWh de recharge. Utilisateur abonné : 1€/unité",
    "StatusTypeID": 50,
    "DateLastStatusUpdate": "2020-08-27T05:15:00Z",
    "DataQualityLevel": 2,
    "DateCreated": "2020-03-15T10:54:00Z",
    "SubmissionStatusTypeID": 100
}