{
    "IsRecentlyVerified": false,
    "ID": 68714,
    "UUID": "BFE2D866-58C4-420A-9699-8EBD7B6C6FF7",
    "DataProviderID": 1,
    "OperatorID": 45,
    "UsageTypeID": 1,
    "AddressInfo": {
        "ID": 69060,
        "Title": "e-Bike Station Stadthallenfoyer",
        "AddressLine1": "Carl-Lomb-Straße 1",
        "Town": "Birstein",
        "StateOrProvince": "Main-Kinzig-Kreis",
        "Postcode": "63633",
        "CountryID": 87,
        "Latitude": 50.3521083,
        "Longitude": 9.309242799999993,
        "ContactTelephone1": "+49 6054 8080",
        "AccessComments": "Im Foyer der Stadthalle, zwischen den WC. Sitzmöglichkeiten vorhanden. Essen unmittelbar am Ladeort möglich. Mehrere Restaurants in der unmittelbaren Umgebung. Hinweis: Fahrrad muss draußen bleiben Akku kann während des Ladens nicht gesichert werden.",
        "DistanceUnit": 0
    },
    "Connections": [
        {
            "ID": 96369,
            "ConnectionTypeID": 28,
            "StatusTypeID": 50,
            "LevelID": 1,
            "Amps": 10,
            "Voltage": 230,
            "PowerKW": 2.3,
            "CurrentTypeID": 10,
            "Quantity": 1
        }
    ],
    "NumberOfPoints": 1,
    "StatusTypeID": 50,
    "DateLastStatusUpdate": "2016-06-19T12:28:00Z",
    "DataQualityLevel": 1,
    "DateCreated": "2016-06-19T12:28:00Z",
    "SubmissionStatusTypeID": 200
}