{
    "IsRecentlyVerified": false,
    "ID": 93862,
    "UUID": "9A1EFC86-0501-47A6-AB92-CE4C91B174CC",
    "DataProviderID": 1,
    "OperatorID": 156,
    "UsageTypeID": 4,
    "AddressInfo": {
        "ID": 94208,
        "Title": "Auto-Tröndle",
        "AddressLine1": "Schaffhauser Straße 1",
        "Town": "Grafenhausen",
        "StateOrProvince": "Verwaltungsverband Oberes Schlüchttal",
        "Postcode": "79865",
        "CountryID": 87,
        "Latitude": 47.7752051,
        "Longitude": 8.25605270000005,
        "ContactTelephone1": "+49 7748 92919-0",
        "AccessComments": "Eintrag lt. New Motion Verzeichnis; Details unbekannt. Zusätzliche CCS und Chademo Lademöglichkeit zu den Öffnungszeiten.",
        "RelatedURL": "http://www.auto-troendle.de/",
        "DistanceUnit": 0
    },
    "Connections": [
        {
            "ID": 132869,
            "ConnectionTypeID": 25,
            "StatusTypeID": 50,
            "LevelID": 2,
            "Amps": 32,
            "Voltage": 400,
            "PowerKW": 22,
            "CurrentTypeID": 20,
            "Quantity": 1
        },
        {
            "ID": 132877,
            "ConnectionTypeID": 2,
            "StatusTypeID": 50,
            "LevelID": 3,
            "PowerKW": 20,
            "CurrentTypeID": 30,
            "Quantity": 1
        },
        {
            "ID": 132878,
            "ConnectionTypeID": 33,
            "StatusTypeID": 50,
            "LevelID": 3,
            "PowerKW": 20,
            "CurrentTypeID": 30,
            "Quantity": 1
        }
    ],
    "NumberOfPoints": 1,
    "StatusTypeID": 50,
    "DateLastStatusUpdate": "2017-10-11T06:16:00Z",
    "DataQualityLevel": 1,
    "DateCreated": "2017-10-11T05:35:00Z",
    "SubmissionStatusTypeID": 200
}