{
    "IsRecentlyVerified": false,
    "ID": 122778,
    "UUID": "A0FC467F-7EB3-4840-AB5A-8E0EA2999F15",
    "DataProviderID": 2,
    "DataProvidersReference": "61846",
    "OperatorID": 5,
    "UsageTypeID": 1,
    "AddressInfo": {
        "ID": 123124,
        "Title": "BMW CENTURY",
        "AddressLine1": "3800 University Dr NW",
        "Town": "Huntsville",
        "StateOrProvince": "AL",
        "Postcode": "35816",
        "CountryID": 2,
        "Latitude": 34.7354945,
        "Longitude": -86.6239556,
        "ContactTelephone1": "888-758-4389",
        "AccessComments": "24 hours daily",
        "RelatedURL": "http://www.chargepoint.com/",
        "DistanceUnit": 0
    },
    "Connections": [
        {
            "ID": 172697,
            "ConnectionTypeID": 1,
            "LevelID": 2,
            "Amps": 16,
            "Voltage": 230,
            "PowerKW": 3.7,
            "CurrentTypeID": 10,
            "Quantity": 2
        }
    ],
    "DateLastStatusUpdate": "2020-06-26T02:57:00Z",
    "DataQualityLevel": 3,
    "DateCreated": "2019-04-06T05:03:00Z",
    "SubmissionStatusTypeID": 100
}