{
    "IsRecentlyVerified": false,
    "ID": 20242,
    "UUID": "B1F26D53-9396-40A8-80FA-E45F06E7B5E1",
    "DataProviderID": 1,
    "OperatorID": 1,
    "UsageTypeID": 0,
    "UsageCost": "",
    "AddressInfo": {
        "ID": 20587,
        "Title": "Nissan - Albi",
        "AddressLine1": "9 Rue Capitaine Treilhes",
        "AddressLine2": "",
        "Town": "",
        "StateOrProvince": "Albi",
        "Postcode": "81000 ",
        "CountryID": 80,
        "Latitude": 43.91564,
        "Longitude": 2.14455,
        "ContactTelephone1": "",
        "ContactTelephone2": "",
        "ContactEmail": "",
        "AccessComments": "Ouvert à tous",
        "RelatedURL": "",
        "DistanceUnit": 0
    },
    "Connections": [],
    "GeneralComments": "",
    "StatusTypeID": 50,
    "DateLastStatusUpdate": "2013-11-07T17:44:00Z",
    "DataQualityLevel": 1,
    "DateCreated": "2013-11-07T09:16:00Z",
    "SubmissionStatusTypeID": 200
}