{
    "IsRecentlyVerified": false,
    "ID": 63668,
    "UUID": "4CFF1F75-9889-4A57-818F-E5C5E9E97AFB",
    "DataProviderID": 26,
    "DataProvidersReference": "82967",
    "OperatorID": 103,
    "OperatorsReference": "Allego NLALLEGO0003392",
    "UsageCost": "0.00 jaarabonnement",
    "AddressInfo": {
        "ID": 64014,
        "Title": "Gerda Brautigamsingel 112",
        "AddressLine1": "Gerda Brautigamsingel 112",
        "Town": "Leiden",
        "Postcode": "2331 SP",
        "CountryID": 159,
        "Latitude": 52.14434343,
        "Longitude": 4.45213605,
        "ContactTelephone1": "0800-3745337",
        "RelatedURL": "http://www.allego.eu/",
        "DistanceUnit": 0
    },
    "Connections": [
        {
            "ID": 81268,
            "ConnectionTypeID": 25,
            "LevelID": 2,
            "PowerKW": 11,
            "CurrentTypeID": 10
        },
        {
            "ID": 81269,
            "ConnectionTypeID": 25,
            "LevelID": 2,
            "PowerKW": 11,
            "CurrentTypeID": 10
        }
    ],
    "NumberOfPoints": 1,
    "StatusTypeID": 50,
    "DateLastStatusUpdate": "2016-06-04T02:50:00Z",
    "DataQualityLevel": 3,
    "DateCreated": "2016-03-03T12:31:00Z",
    "SubmissionStatusTypeID": 100
}