{
    "IsRecentlyVerified": false,
    "ID": 139343,
    "UUID": "69C8E16F-B641-4B12-858B-0BDC010F8CA6",
    "DataProviderID": 2,
    "DataProvidersReference": "76933",
    "OperatorID": 5,
    "UsageTypeID": 1,
    "AddressInfo": {
        "ID": 139695,
        "Title": "CITY OF LA",
        "AddressLine1": "1674 Lomita Blvd",
        "Town": "Los Angeles",
        "StateOrProvince": "CA",
        "Postcode": "90710",
        "CountryID": 2,
        "Latitude": 33.7977023,
        "Longitude": -118.3069033,
        "ContactTelephone1": "888-758-4389",
        "AccessComments": "24 hours daily",
        "RelatedURL": "http://www.chargepoint.com/",
        "DistanceUnit": 0
    },
    "Connections": [
        {
            "ID": 194666,
            "ConnectionTypeID": 1,
            "LevelID": 2,
            "Amps": 16,
            "Voltage": 230,
            "PowerKW": 3,
            "CurrentTypeID": 10,
            "Quantity": 1
        }
    ],
    "StatusTypeID": 50,
    "DateLastStatusUpdate": "2019-12-24T09:10:00Z",
    "DataQualityLevel": 3,
    "DateCreated": "2019-12-24T09:10:00Z",
    "SubmissionStatusTypeID": 100
}