{
    "UserComments": [
        {
            "ID": 10462,
            "ChargePointID": 42697,
            "CommentTypeID": 10,
            "UserName": "Simon Hewison",
            "Comment": "Source London card worked fine. Usual chargemaster rigmarole of waiting for the type 2 socket. ",
            "DateCreated": "2016-05-21T17:22:47.47Z",
            "User": {
                "ID": 4575,
                "Username": "Simon Hewison"
            },
            "CheckinStatusTypeID": 10
        },
        {
            "ID": 6462,
            "ChargePointID": 42697,
            "CommentTypeID": 1000,
            "UserName": "Jason Hockley",
            "Comment": "I left my car plugged in while I went shopping for 25 minutes. As far as I can tell, despite no error messages anywhere and the lights on my Nissan Leaf's dashboard lighting up correctly, my car was not charged at all. \n\nI did do a quick check with the LeafSpy Pro app when I first plugged in, which suggested that it started charging at a very, very low level. When I got back my battery didn't show any increase at all.",
            "Rating": 1,
            "DateCreated": "2015-09-10T13:41:14.773Z",
            "User": {
                "ID": 6275,
                "Username": "Jason Hockley"
            },
            "CheckinStatusTypeID": 25
        }
    ],
    "IsRecentlyVerified": false,
    "ID": 42697,
    "UUID": "A0191DF7-7543-4B87-9B8C-4F5A867AA2C6",
    "DataProviderID": 1,
    "OperatorID": 32,
    "OperatorsReference": "1626",
    "UsageTypeID": 4,
    "UsageCost": "£0.108/kWh; for Polar Plus subscription members only. Normal car park fees apply",
    "AddressInfo": {
        "ID": 43043,
        "Title": "Gade Car Park",
        "AddressLine1": "Rosslyn Road",
        "Town": "Watford",
        "StateOrProvince": "Hertfordshire",
        "Postcode": "WD18 0JY",
        "CountryID": 1,
        "Latitude": 51.657155,
        "Longitude": -0.401465,
        "DistanceUnit": 0
    },
    "Connections": [
        {
            "ID": 51510,
            "ConnectionTypeID": 25,
            "StatusTypeID": 50,
            "LevelID": 2,
            "Amps": 32,
            "Voltage": 230,
            "PowerKW": 7,
            "CurrentTypeID": 10,
            "Quantity": 2
        },
        {
            "ID": 51511,
            "ConnectionTypeID": 3,
            "StatusTypeID": 50,
            "LevelID": 2,
            "Amps": 13,
            "Voltage": 230,
            "PowerKW": 3,
            "CurrentTypeID": 10,
            "Quantity": 1
        }
    ],
    "NumberOfPoints": 2,
    "GeneralComments": "Chargemaster post with Souce East branding",
    "StatusTypeID": 50,
    "DateLastStatusUpdate": "2019-03-08T06:35:00Z",
    "DataQualityLevel": 1,
    "DateCreated": "2015-03-21T00:15:00Z",
    "SubmissionStatusTypeID": 200
}