{
    "IsRecentlyVerified": false,
    "ID": 92955,
    "UUID": "0605938A-F1F4-4A12-BE26-4B5D16AD19E0",
    "DataProviderID": 1,
    "OperatorID": 45,
    "UsageTypeID": 1,
    "AddressInfo": {
        "ID": 93301,
        "Title": "Im Städtle",
        "AddressLine1": "Im Städtle 19",
        "Town": "Steißlingen",
        "StateOrProvince": "Verwaltungsgemeinschaft Singen (Hohentwiel)",
        "Postcode": "78256",
        "CountryID": 87,
        "Latitude": 47.7964877,
        "Longitude": 8.92863239999997,
        "AccessComments": "Ladepunkt der Gemeindewerke Steißlingen. 2 Mennekes Wallboxen link und rechts an Pfahl. 24/7 ohne Ladekarte kostenlos nutzbar.",
        "RelatedURL": "https://steisslingen.de/",
        "DistanceUnit": 0
    },
    "Connections": [
        {
            "ID": 131681,
            "ConnectionTypeID": 25,
            "StatusTypeID": 50,
            "LevelID": 2,
            "Amps": 32,
            "Voltage": 400,
            "PowerKW": 22,
            "CurrentTypeID": 20,
            "Quantity": 2
        }
    ],
    "NumberOfPoints": 2,
    "StatusTypeID": 50,
    "DateLastStatusUpdate": "2017-09-14T11:38:00Z",
    "DataQualityLevel": 1,
    "DateCreated": "2017-09-14T11:38:00Z",
    "SubmissionStatusTypeID": 200
}