{
    "IsRecentlyVerified": false,
    "ID": 61155,
    "UUID": "97D98AF4-D550-4EBD-8281-0B3C7E256B57",
    "DataProviderID": 1,
    "OperatorID": 1,
    "UsageTypeID": 1,
    "AddressInfo": {
        "ID": 61501,
        "Title": "Subestación Corredoria",
        "AddressLine1": "Carretera de la Estrecha, 33",
        "Town": "Oviedo",
        "StateOrProvince": "Oviedo",
        "Postcode": "33011",
        "CountryID": 210,
        "Latitude": 43.38124,
        "Longitude": -5.828678,
        "ContactTelephone1": "+34 902860860",
        "RelatedURL": "http://eficiencia.hcenergia.com/efi...",
        "DistanceUnit": 0
    },
    "Connections": [
        {
            "ID": 77823,
            "ConnectionTypeID": 28
        }
    ],
    "StatusTypeID": 0,
    "DateLastStatusUpdate": "2021-04-27T01:11:00Z",
    "DataQualityLevel": 3,
    "DateCreated": "2016-02-13T00:24:00Z",
    "SubmissionStatusTypeID": 200
}