{
    "IsRecentlyVerified": false,
    "ID": 87822,
    "UUID": "DA42E917-2810-446A-A36B-B0A254E58D7D",
    "DataProviderID": 1,
    "DataProvidersReference": "4089",
    "AddressInfo": {
        "ID": 88168,
        "Title": "K-Citymarket Kerava",
        "AddressLine1": "Nikonkatu 1",
        "Town": "Kerava Keskus",
        "StateOrProvince": "Uusimaa",
        "Postcode": "04200",
        "CountryID": 79,
        "Latitude": 60.4002,
        "Longitude": 25.10131,
        "AccessComments": "Parkkihallissa, lähellä kaupan sisäänkäyntiä",
        "DistanceUnit": 0
    },
    "Connections": [
        {
            "ID": 124540,
            "ConnectionTypeID": 0,
            "Reference": "1",
            "LevelID": 2,
            "Amps": 32,
            "Voltage": 400,
            "PowerKW": 22,
            "Comments": "Mode 3"
        },
        {
            "ID": 124541,
            "ConnectionTypeID": 0,
            "Reference": "2",
            "LevelID": 2,
            "Amps": 32,
            "Voltage": 400,
            "PowerKW": 22,
            "Comments": "Mode 3"
        },
        {
            "ID": 124542,
            "ConnectionTypeID": 0,
            "Reference": "3",
            "LevelID": 2,
            "Amps": 32,
            "Voltage": 400,
            "PowerKW": 22,
            "Comments": "Mode 3"
        },
        {
            "ID": 124543,
            "ConnectionTypeID": 0,
            "Reference": "4",
            "LevelID": 2,
            "Amps": 32,
            "Voltage": 400,
            "PowerKW": 22,
            "Comments": "Mode 3"
        }
    ],
    "NumberOfPoints": 4,
    "DateLastStatusUpdate": "2020-05-26T08:24:00Z",
    "DataQualityLevel": 2,
    "DateCreated": "2017-05-16T11:07:00Z",
    "SubmissionStatusTypeID": 100
}