{
    "IsRecentlyVerified": false,
    "ID": 106565,
    "UUID": "99C65825-5D2E-4446-8156-D97C7CE56321",
    "DataProviderID": 1,
    "OperatorID": 86,
    "UsageTypeID": 4,
    "AddressInfo": {
        "ID": 106911,
        "Title": "Rathaus",
        "AddressLine1": "Bahnhofstraße 8",
        "Town": "Sandhausen",
        "StateOrProvince": "Rhein-Neckar-Kreis",
        "Postcode": "69207",
        "CountryID": 87,
        "Latitude": 49.341826251963774,
        "Longitude": 8.660040973680111,
        "AccessComments": "24/7 nutzbar",
        "RelatedURL": "https://zuhause.enbw.com/elektromobilitaet/produkte/mobilityplus-app/ladestation-finden",
        "DistanceUnit": 0
    },
    "Connections": [
        {
            "ID": 149958,
            "ConnectionTypeID": 25,
            "StatusTypeID": 50,
            "LevelID": 2,
            "Amps": 32,
            "Voltage": 400,
            "PowerKW": 22,
            "CurrentTypeID": 20,
            "Quantity": 2
        },
        {
            "ID": 149959,
            "ConnectionTypeID": 28,
            "StatusTypeID": 50,
            "LevelID": 2,
            "Amps": 16,
            "Voltage": 230,
            "PowerKW": 3.7,
            "CurrentTypeID": 10,
            "Quantity": 2
        }
    ],
    "NumberOfPoints": 4,
    "StatusTypeID": 50,
    "DateLastStatusUpdate": "2018-06-25T05:30:00Z",
    "DataQualityLevel": 1,
    "DateCreated": "2018-06-25T05:30:00Z",
    "SubmissionStatusTypeID": 200
}