{
    "IsRecentlyVerified": false,
    "ID": 159289,
    "UUID": "09E176E0-9084-4A90-81BC-702C64CC0A46",
    "DataProviderID": 2,
    "DataProvidersReference": "150396",
    "UsageTypeID": 2,
    "AddressInfo": {
        "ID": 159646,
        "Title": "The Falls At Willow Creek",
        "AddressLine1": "1780 Creekside Dr",
        "Town": "Folsom",
        "StateOrProvince": "CA",
        "Postcode": "95630",
        "CountryID": 2,
        "Latitude": 38.67093,
        "Longitude": -121.13824,
        "ContactTelephone1": "",
        "AccessComments": "Resident use only",
        "RelatedURL": "",
        "DistanceUnit": 0
    },
    "Connections": [
        {
            "ID": 229426,
            "ConnectionTypeID": 1,
            "LevelID": 2,
            "Amps": 16,
            "Voltage": 230,
            "PowerKW": 3.7,
            "CurrentTypeID": 10,
            "Quantity": 2
        }
    ],
    "StatusTypeID": 50,
    "DateLastStatusUpdate": "2020-06-26T03:00:00Z",
    "DataQualityLevel": 3,
    "DateCreated": "2020-06-26T03:00:00Z",
    "SubmissionStatusTypeID": 100
}