{
    "IsRecentlyVerified": false,
    "ID": 44621,
    "UUID": "2F63C2A0-D4CA-4FAD-A070-FF778A9A9F0A",
    "DataProviderID": 1,
    "OperatorID": 45,
    "UsageTypeID": 6,
    "AddressInfo": {
        "ID": 44967,
        "Title": "Freizeit KG",
        "AddressLine1": "Elsener Straße 2",
        "AddressLine2": "Heepen",
        "Town": "Bielefeld",
        "StateOrProvince": "Nordrhein-Westfalen",
        "Postcode": "33729",
        "CountryID": 87,
        "Latitude": 52.071432885754,
        "Longitude": 8.6160166158834,
        "ContactTelephone1": "0521/977323",
        "AccessComments": "Auf dem Parkplatz des Wohnmobil-Autohauses. Immer nutzbar.",
        "RelatedURL": "http://www.freizeit-kg.de/",
        "DistanceUnit": 0
    },
    "Connections": [
        {
            "ID": 54813,
            "ConnectionTypeID": 16,
            "StatusTypeID": 50,
            "LevelID": 2,
            "Amps": 16,
            "Voltage": 230,
            "PowerKW": 3.7,
            "CurrentTypeID": 10,
            "Quantity": 4
        }
    ],
    "NumberOfPoints": 4,
    "StatusTypeID": 50,
    "DateLastStatusUpdate": "2015-04-18T12:14:00Z",
    "DataQualityLevel": 1,
    "DateCreated": "2015-04-18T11:41:00Z",
    "SubmissionStatusTypeID": 200
}