{
    "IsRecentlyVerified": false,
    "ID": 17060,
    "UUID": "673F5FAA-F419-4963-B4BF-D1B28E8819E1",
    "DataProviderID": 22,
    "DataProvidersReference": "F38575EE8AF23BA6D923C0D98EE767FC",
    "AddressInfo": {
        "ID": 17405,
        "Title": "千葉三菱コルト松戸店",
        "AddressLine1": "千葉県松戸市松飛台525-2",
        "CountryID": 114,
        "Latitude": 35.77820891,
        "Longitude": 139.9680388,
        "ContactTelephone1": "047-388-2271",
        "DistanceUnit": 0
    },
    "Connections": [
        {
            "ID": 17301,
            "ConnectionTypeID": 2,
            "LevelID": 2,
            "Amps": 100,
            "Voltage": 480,
            "PowerKW": 48,
            "Quantity": 1
        }
    ],
    "DateLastStatusUpdate": "2013-06-29T08:53:00Z",
    "DataQualityLevel": 2,
    "DateCreated": "2013-06-29T08:53:00Z",
    "SubmissionStatusTypeID": 200
}