{
    "IsRecentlyVerified": false,
    "ID": 85009,
    "UUID": "53A58BFD-759E-42D9-8180-A7D5F94862C0",
    "DataProviderID": 1,
    "OperatorID": 23,
    "OperatorsReference": "26038",
    "UsageTypeID": 4,
    "AddressInfo": {
        "ID": 85355,
        "Title": "Financial District Garage",
        "AddressLine1": "730 Shelby",
        "Town": "Detroit",
        "StateOrProvince": "Michigan",
        "Postcode": "48226",
        "CountryID": 2,
        "Latitude": 42.331181,
        "Longitude": -83.048927,
        "ContactTelephone1": "(313) 963-1187",
        "DistanceUnit": 0
    },
    "Connections": [
        {
            "ID": 120758,
            "ConnectionTypeID": 30,
            "StatusTypeID": 50,
            "LevelID": 2,
            "PowerKW": 16,
            "CurrentTypeID": 20,
            "Quantity": 3
        }
    ],
    "NumberOfPoints": 3,
    "GeneralComments": "3 Tesla Connectors, up to 16kW.Available to the public. Self park.",
    "StatusTypeID": 50,
    "DateLastStatusUpdate": "2017-03-23T06:30:00Z",
    "DataQualityLevel": 1,
    "DateCreated": "2017-03-23T06:30:00Z",
    "SubmissionStatusTypeID": 200
}