{
    "IsRecentlyVerified": false,
    "ID": 137193,
    "UUID": "CCB9F106-0B7C-46CA-9527-C91A9B6F83C7",
    "DataProviderID": 2,
    "DataProvidersReference": "145505",
    "OperatorID": 5,
    "UsageTypeID": 1,
    "AddressInfo": {
        "ID": 137539,
        "Title": "HD SOUTH",
        "AddressLine1": "19825 S Dixie Hwy",
        "Town": "Cutler Bay",
        "StateOrProvince": "FL",
        "Postcode": "33157",
        "CountryID": 2,
        "Latitude": 25.584173,
        "Longitude": -80.36372,
        "ContactTelephone1": "888-758-4389",
        "AccessComments": "24 hours daily",
        "RelatedURL": "http://www.chargepoint.com/",
        "DistanceUnit": 0
    },
    "Connections": [
        {
            "ID": 192056,
            "ConnectionTypeID": 32,
            "LevelID": 3,
            "Amps": 100,
            "Voltage": 400,
            "PowerKW": 40,
            "CurrentTypeID": 30,
            "Quantity": 1
        }
    ],
    "StatusTypeID": 50,
    "DateLastStatusUpdate": "2019-12-24T09:04:00Z",
    "DataQualityLevel": 3,
    "DateCreated": "2019-12-24T09:04:00Z",
    "SubmissionStatusTypeID": 100
}