{
    "IsRecentlyVerified": false,
    "ID": 17847,
    "UUID": "E8D97CB7-2BD9-433B-B484-D077558F0196",
    "DataProviderID": 22,
    "DataProvidersReference": "106D6A60386B448F80D401758C203F54",
    "AddressInfo": {
        "ID": 18192,
        "Title": "乗鞍観光センター駐車場",
        "AddressLine1": "長野県松本市安曇鈴蘭4294-3",
        "CountryID": 114,
        "Latitude": 36.1218479,
        "Longitude": 137.624962,
        "ContactTelephone1": "0263-93-2645",
        "DistanceUnit": 0
    },
    "Connections": [
        {
            "ID": 18088,
            "ConnectionTypeID": 2,
            "LevelID": 2,
            "Amps": 100,
            "Voltage": 480,
            "PowerKW": 48,
            "Quantity": 1
        }
    ],
    "DateLastStatusUpdate": "2013-06-29T09:04:00Z",
    "DataQualityLevel": 2,
    "DateCreated": "2013-06-29T09:04:00Z",
    "SubmissionStatusTypeID": 200
}