{
    "IsRecentlyVerified": false,
    "ID": 113210,
    "UUID": "68286F28-4803-4E33-9752-78EB68486C1C",
    "DataProviderID": 2,
    "DataProvidersReference": "104337",
    "OperatorID": 9,
    "UsageTypeID": 2,
    "AddressInfo": {
        "ID": 113556,
        "Title": "Escena Apartments",
        "AddressLine1": "20760 Empire Avenue",
        "Town": "Bend",
        "StateOrProvince": "OR",
        "Postcode": "97701",
        "CountryID": 2,
        "Latitude": 44.091444,
        "Longitude": -121.286057,
        "ContactTelephone1": "888-998-2546",
        "AccessComments": "MON: 24 hours | TUE: 24 hours | WED: 24 hours | THU: 24 hours | FRI: 24 hours | SAT: 24 hours | SUN: 24 hours",
        "RelatedURL": "http://www.blinkcharging.com/",
        "DistanceUnit": 0
    },
    "Connections": [
        {
            "ID": 159399,
            "ConnectionTypeID": 1,
            "LevelID": 2,
            "Amps": 16,
            "Voltage": 230,
            "PowerKW": 3.7,
            "CurrentTypeID": 10,
            "Quantity": 3
        }
    ],
    "DateLastStatusUpdate": "2020-06-26T03:07:00Z",
    "DataQualityLevel": 3,
    "DateCreated": "2018-11-28T02:04:00Z",
    "SubmissionStatusTypeID": 100
}