{
    "IsRecentlyVerified": false,
    "ID": 142591,
    "UUID": "B4516571-4610-4F15-B017-41B8900DF55B",
    "DataProviderID": 2,
    "DataProvidersReference": "123218",
    "OperatorID": 3372,
    "UsageTypeID": 1,
    "AddressInfo": {
        "ID": 142943,
        "Title": "Fall River Joint Unified School District - Transportation Department",
        "AddressLine1": "44154 Walnut St",
        "Town": "McArthur",
        "StateOrProvince": "CA",
        "Postcode": "96056",
        "CountryID": 2,
        "Latitude": 41.0467959,
        "Longitude": -121.4018466,
        "ContactTelephone1": "866-816-7584",
        "AccessComments": "24 hours daily",
        "RelatedURL": "http://evconnect.com/",
        "DistanceUnit": 0
    },
    "Connections": [
        {
            "ID": 198761,
            "ConnectionTypeID": 1,
            "LevelID": 2,
            "Amps": 16,
            "Voltage": 230,
            "PowerKW": 3.7,
            "CurrentTypeID": 10,
            "Quantity": 1
        }
    ],
    "StatusTypeID": 50,
    "DateLastStatusUpdate": "2020-06-26T03:03:00Z",
    "DataQualityLevel": 3,
    "DateCreated": "2019-12-24T09:18:00Z",
    "SubmissionStatusTypeID": 100
}