{
    "IsRecentlyVerified": false,
    "ID": 173978,
    "UUID": "C9CF3695-2680-4B9C-95D4-23BC9DFF452E",
    "DataProviderID": 1,
    "OperatorID": 21,
    "UsageTypeID": 4,
    "UsageCost": "Mobi.E compatible card or App",
    "AddressInfo": {
        "ID": 174337,
        "Title": "SXL-00011 - Lidl",
        "AddressLine1": "Avenida 10 de Junho",
        "Town": "Fernão Ferro",
        "StateOrProvince": "Setúbal",
        "Postcode": "2840",
        "CountryID": 180,
        "Latitude": 38.55541124105039,
        "Longitude": -9.088026730174988,
        "DistanceUnit": 0
    },
    "Connections": [
        {
            "ID": 268115,
            "ConnectionTypeID": 2,
            "StatusTypeID": 50,
            "LevelID": 3,
            "Amps": 125,
            "Voltage": 400,
            "PowerKW": 50,
            "CurrentTypeID": 30,
            "Quantity": 1
        },
        {
            "ID": 268116,
            "ConnectionTypeID": 33,
            "StatusTypeID": 50,
            "LevelID": 3,
            "Amps": 125,
            "Voltage": 400,
            "PowerKW": 50,
            "CurrentTypeID": 30,
            "Quantity": 1
        },
        {
            "ID": 268117,
            "ConnectionTypeID": 1036,
            "StatusTypeID": 50,
            "LevelID": 3,
            "PowerKW": 43,
            "CurrentTypeID": 20,
            "Quantity": 1
        }
    ],
    "NumberOfPoints": 2,
    "StatusTypeID": 50,
    "DateLastStatusUpdate": "2021-03-08T22:57:00Z",
    "DataQualityLevel": 1,
    "DateCreated": "2021-03-08T22:57:00Z",
    "SubmissionStatusTypeID": 200
}