{
    "IsRecentlyVerified": false,
    "ID": 132221,
    "UUID": "B41C30E3-2639-4A14-87F7-2B44AC2F7521",
    "DataProviderID": 1,
    "OperatorID": 150,
    "UsageTypeID": 4,
    "UsageCost": "£1.00+£0.30/kWh; £10.00 overstay fee after 95 mins, then £10.00 every subsequent 95 mins",
    "AddressInfo": {
        "ID": 132567,
        "Title": "Morrisons Banbury",
        "AddressLine1": "Swan Close Road",
        "Town": "Banbury",
        "Postcode": "OX16 5AQ",
        "CountryID": 1,
        "Latitude": 52.057037,
        "Longitude": -1.331814,
        "RelatedURL": "http://www.chargepointservices.com/",
        "DistanceUnit": 0
    },
    "Connections": [
        {
            "ID": 185062,
            "ConnectionTypeID": 1036,
            "Reference": "1",
            "StatusTypeID": 50,
            "LevelID": 3,
            "Amps": 63,
            "Voltage": 400,
            "PowerKW": 43,
            "CurrentTypeID": 20,
            "Quantity": 1
        },
        {
            "ID": 185073,
            "ConnectionTypeID": 2,
            "StatusTypeID": 50,
            "LevelID": 3,
            "PowerKW": 50,
            "CurrentTypeID": 30,
            "Quantity": 1
        },
        {
            "ID": 185074,
            "ConnectionTypeID": 33,
            "StatusTypeID": 50,
            "LevelID": 3,
            "PowerKW": 50,
            "CurrentTypeID": 30,
            "Quantity": 1
        }
    ],
    "NumberOfPoints": 1,
    "StatusTypeID": 50,
    "DateLastStatusUpdate": "2019-09-24T13:17:00Z",
    "MetadataValues": [
        {
            "ID": 4948,
            "MetadataFieldID": 4,
            "ItemValue": "Contains public sector information licensed under the Open Government Licence v2.0. http://www.nationalarchives.gov.uk/doc/open-government-licence/version/2/"
        }
    ],
    "DataQualityLevel": 3,
    "DateCreated": "2019-09-24T12:46:00Z",
    "SubmissionStatusTypeID": 200
}