{
    "IsRecentlyVerified": false,
    "ID": 103216,
    "UUID": "E59225FE-8BE1-4C3A-BC05-97617E1220CD",
    "DataProviderID": 1,
    "OperatorID": 45,
    "UsageTypeID": 1,
    "AddressInfo": {
        "ID": 103562,
        "Title": "Alte Bundesstraße",
        "AddressLine1": "Alte Bundesstraße ",
        "Town": "VVG der Gemeinde Gundelfingen",
        "StateOrProvince": "VVG der Gemeinde Gundelfingen",
        "Postcode": "79194",
        "CountryID": 87,
        "Latitude": 48.04330921895391,
        "Longitude": 7.868311092659724,
        "AccessComments": "Rund um die Uhr (24/7) nutzbar. Position: direkt in der Ortsmitte, am Ende der Parkreihe zwischen Supermarkt Penny und Drogeriemarkt Rossmann. ",
        "DistanceUnit": 0
    },
    "Connections": [
        {
            "ID": 145828,
            "ConnectionTypeID": 25,
            "StatusTypeID": 50,
            "LevelID": 2,
            "Amps": 32,
            "Voltage": 400,
            "PowerKW": 22,
            "CurrentTypeID": 20,
            "Quantity": 1
        },
        {
            "ID": 145829,
            "ConnectionTypeID": 28,
            "StatusTypeID": 50,
            "LevelID": 2,
            "Amps": 16,
            "Voltage": 230,
            "PowerKW": 3.7,
            "CurrentTypeID": 10,
            "Quantity": 1
        }
    ],
    "NumberOfPoints": 2,
    "StatusTypeID": 50,
    "DateLastStatusUpdate": "2018-04-24T13:48:00Z",
    "DataQualityLevel": 1,
    "DateCreated": "2018-04-24T13:48:00Z",
    "SubmissionStatusTypeID": 200
}