{
    "IsRecentlyVerified": false,
    "ID": 137956,
    "UUID": "DDE4D19B-01BA-421F-B0BE-78EA42E412AC",
    "DataProviderID": 2,
    "DataProvidersReference": "96105",
    "OperatorID": 9,
    "UsageTypeID": 1,
    "AddressInfo": {
        "ID": 138305,
        "Title": "IKEA - Frisco",
        "AddressLine1": "7171 Ikea Dr",
        "Town": "Frisco",
        "StateOrProvince": "TX",
        "Postcode": "75035",
        "CountryID": 2,
        "Latitude": 33.094181,
        "Longitude": -96.820495,
        "ContactTelephone1": "888-998-2546",
        "AccessComments": "MON: 24 hours | TUE: 24 hours | WED: 24 hours | THU: 24 hours | FRI: 24 hours | SAT: 24 hours | SUN: 24 hours",
        "RelatedURL": "http://www.blinkcharging.com/",
        "DistanceUnit": 0
    },
    "Connections": [
        {
            "ID": 192986,
            "ConnectionTypeID": 1,
            "LevelID": 2,
            "Amps": 16,
            "Voltage": 230,
            "PowerKW": 3,
            "CurrentTypeID": 10,
            "Quantity": 3
        }
    ],
    "StatusTypeID": 50,
    "DateLastStatusUpdate": "2019-12-24T09:06:00Z",
    "DataQualityLevel": 3,
    "DateCreated": "2019-12-24T09:06:00Z",
    "SubmissionStatusTypeID": 100
}