{
    "IsRecentlyVerified": true,
    "DateLastVerified": "2021-09-07T09:05:00Z",
    "ID": 189085,
    "UUID": "8E38D8B8-186B-4F10-AF53-505945C8D896",
    "DataProviderID": 1,
    "OperatorID": 3267,
    "UsageTypeID": 4,
    "AddressInfo": {
        "ID": 189444,
        "Title": "DUFERCO Serravalle Designer Outlet",
        "AddressLine1": "SP35bis - Via Novi 95",
        "Town": "Serravalle Scrivia",
        "StateOrProvince": "AL",
        "Postcode": "15069",
        "CountryID": 112,
        "Latitude": 44.73326779680906,
        "Longitude": 8.83381996133187,
        "DistanceUnit": 0
    },
    "Connections": [
        {
            "ID": 305659,
            "ConnectionTypeID": 33,
            "StatusTypeID": 50,
            "LevelID": 3,
            "PowerKW": 50,
            "CurrentTypeID": 30,
            "Quantity": 2
        },
        {
            "ID": 305660,
            "ConnectionTypeID": 25,
            "StatusTypeID": 50,
            "LevelID": 2,
            "Amps": 32,
            "Voltage": 400,
            "PowerKW": 22,
            "CurrentTypeID": 20,
            "Quantity": 2
        },
        {
            "ID": 305661,
            "ConnectionTypeID": 36,
            "StatusTypeID": 50,
            "LevelID": 2,
            "Amps": 16,
            "Voltage": 240,
            "PowerKW": 3,
            "CurrentTypeID": 10,
            "Quantity": 2
        }
    ],
    "NumberOfPoints": 4,
    "StatusTypeID": 50,
    "DateLastStatusUpdate": "2021-09-07T09:05:00Z",
    "DataQualityLevel": 1,
    "DateCreated": "2021-09-07T09:05:00Z",
    "SubmissionStatusTypeID": 200
}