{
    "IsRecentlyVerified": false,
    "ID": 185877,
    "UUID": "066E67A9-B16D-40CF-8CE8-9DCEF7863B3A",
    "DataProviderID": 29,
    "DataProvidersReference": "9241",
    "AddressInfo": {
        "ID": 186236,
        "Title": "Seckenheimer Landstraße 166",
        "AddressLine1": "Seckenheimer Landstraße 166",
        "Town": "Mannheim",
        "Postcode": "68163",
        "CountryID": 87,
        "Latitude": 49.476583,
        "Longitude": 8.520583,
        "DistanceUnit": 0
    },
    "Connections": [
        {
            "ID": 297077,
            "ConnectionTypeID": 25,
            "StatusTypeID": 50,
            "LevelID": 2,
            "PowerKW": 22,
            "CurrentTypeID": 20
        },
        {
            "ID": 297078,
            "ConnectionTypeID": 25,
            "StatusTypeID": 50,
            "LevelID": 2,
            "PowerKW": 22,
            "CurrentTypeID": 20
        }
    ],
    "StatusTypeID": 50,
    "DateLastStatusUpdate": "2021-07-12T02:43:00Z",
    "MetadataValues": [
        {
            "ID": 18119,
            "MetadataFieldID": 4,
            "ItemValue": "Data from the German chargepoint registry provided by Bundesnetzagentur.de under the CC-BY 4.0 license"
        }
    ],
    "DataQualityLevel": 3,
    "DateCreated": "2021-07-12T02:43:00Z",
    "SubmissionStatusTypeID": 100
}