{
    "IsRecentlyVerified": false,
    "ID": 91581,
    "UUID": "54819E77-24A2-4488-A26E-70C588374382",
    "DataProviderID": 1,
    "OperatorID": 45,
    "UsageTypeID": 1,
    "UsageCost": "Free. Parking fees apply",
    "AddressInfo": {
        "ID": 91927,
        "Title": "  1401 Mckinney Street",
        "AddressLine1": "1401 Mckinney Street",
        "Town": "Houston",
        "StateOrProvince": "TX",
        "Postcode": "77010",
        "CountryID": 2,
        "Latitude": 29.755142,
        "Longitude": -95.360707,
        "AccessComments": "Wall outlets distributed along southwest wall (building side). Standard parking rates apply. $5 event parking for weekend baseball games.",
        "DistanceUnit": 0
    },
    "Connections": [
        {
            "ID": 129827,
            "ConnectionTypeID": 15,
            "StatusTypeID": 0,
            "LevelID": 1,
            "Amps": 15,
            "Voltage": 110,
            "PowerKW": 1.6,
            "CurrentTypeID": 10,
            "Quantity": 6
        }
    ],
    "NumberOfPoints": 6,
    "StatusTypeID": 50,
    "DateLastStatusUpdate": "2017-08-09T14:56:00Z",
    "DataQualityLevel": 1,
    "DateCreated": "2017-08-07T15:45:00Z",
    "SubmissionStatusTypeID": 200
}