{
    "IsRecentlyVerified": false,
    "ID": 183145,
    "UUID": "E8261391-EB82-4806-A207-912811311D10",
    "DataProviderID": 29,
    "DataProvidersReference": "2164",
    "AddressInfo": {
        "ID": 183504,
        "Title": "Gerichtsstraße 11",
        "AddressLine1": "Gerichtsstraße 11",
        "Town": "Herne",
        "Postcode": "44649",
        "CountryID": 87,
        "Latitude": 51.529254,
        "Longitude": 7.157291,
        "DistanceUnit": 0
    },
    "Connections": [
        {
            "ID": 289766,
            "ConnectionTypeID": 25,
            "StatusTypeID": 50,
            "LevelID": 2,
            "PowerKW": 11,
            "CurrentTypeID": 20
        },
        {
            "ID": 289767,
            "ConnectionTypeID": 25,
            "StatusTypeID": 50,
            "LevelID": 2,
            "PowerKW": 11,
            "CurrentTypeID": 20
        }
    ],
    "StatusTypeID": 50,
    "DateLastStatusUpdate": "2021-07-09T03:24:00Z",
    "MetadataValues": [
        {
            "ID": 15438,
            "MetadataFieldID": 4,
            "ItemValue": "Data from the German chargepoint registry provided by Bundesnetzagentur.de under the CC-BY 4.0 license"
        }
    ],
    "DataQualityLevel": 3,
    "DateCreated": "2021-07-08T10:03:00Z",
    "SubmissionStatusTypeID": 100
}