{
    "IsRecentlyVerified": false,
    "ID": 45320,
    "UUID": "E2FEA026-8760-466D-AB8B-EE04D2B87C35",
    "DataProviderID": 1,
    "OperatorID": 105,
    "UsageTypeID": 1,
    "AddressInfo": {
        "ID": 45666,
        "Title": "e-Bike Station Rathaus",
        "AddressLine1": "Alte Münsterstraße 16",
        "AddressLine2": "Dörenthe",
        "Town": "Ibbenbüren",
        "StateOrProvince": "Kreis Steinfurt",
        "Postcode": "49477",
        "CountryID": 87,
        "Latitude": 52.27314,
        "Longitude": 7.71468000000004,
        "DistanceUnit": 0
    },
    "Connections": [
        {
            "ID": 55904,
            "ConnectionTypeID": 28,
            "StatusTypeID": 50,
            "LevelID": 1,
            "Amps": 10,
            "Voltage": 230,
            "PowerKW": 2.3,
            "CurrentTypeID": 10,
            "Quantity": 3
        }
    ],
    "NumberOfPoints": 3,
    "StatusTypeID": 50,
    "DateLastStatusUpdate": "2015-04-30T12:02:00Z",
    "DataQualityLevel": 1,
    "DateCreated": "2015-04-30T11:10:00Z",
    "SubmissionStatusTypeID": 200
}