{
    "IsRecentlyVerified": false,
    "ID": 31660,
    "UUID": "FEFE9067-6ECE-4DB3-B0CC-037FC21CA1CC",
    "DataProviderID": 1,
    "OperatorID": 157,
    "OperatorsReference": "NewMotion 02009301",
    "UsageCost": "0.00 jaarabonnement",
    "AddressInfo": {
        "ID": 32006,
        "Title": "Wolferstraße 1a",
        "AddressLine1": "Wolferstraße 1a",
        "Town": "Übersee",
        "Postcode": "83236",
        "CountryID": 87,
        "Latitude": 47.8213882446289,
        "Longitude": 12.4827861785889,
        "ContactTelephone1": "088 0109500",
        "RelatedURL": "http://thenewmotion.nl/",
        "DistanceUnit": 0
    },
    "Connections": [
        {
            "ID": 35171,
            "ConnectionTypeID": 25,
            "LevelID": 2,
            "PowerKW": 3.7,
            "CurrentTypeID": 10
        }
    ],
    "NumberOfPoints": 1,
    "StatusTypeID": 50,
    "DateLastStatusUpdate": "2021-04-25T05:14:00Z",
    "DataQualityLevel": 3,
    "DateCreated": "2015-01-09T06:03:00Z",
    "SubmissionStatusTypeID": 200
}