{
    "IsRecentlyVerified": false,
    "ID": 125000,
    "UUID": "0BAE18C9-01E5-41D4-9D91-6EC3F91CA02D",
    "DataProviderID": 1,
    "OperatorID": 3382,
    "UsageTypeID": 4,
    "AddressInfo": {
        "ID": 125346,
        "Title": "Municipio di Nembro | Ressolar",
        "AddressLine1": "Via Roma",
        "AddressLine2": "Botta",
        "Town": "Nembro",
        "StateOrProvince": "BG",
        "Postcode": "24027",
        "CountryID": 112,
        "Latitude": 45.74325184515166,
        "Longitude": 9.75866454332288,
        "ContactTelephone1": "+39 035 36 92 145",
        "ContactEmail": "info@ressolar.it",
        "RelatedURL": "https://www.ressolar.it/mobilita-sostenibile/",
        "DistanceUnit": 0
    },
    "Connections": [
        {
            "ID": 175203,
            "ConnectionTypeID": 25,
            "StatusTypeID": 50,
            "LevelID": 2,
            "Amps": 32,
            "Voltage": 400,
            "PowerKW": 22,
            "CurrentTypeID": 20,
            "Quantity": 2
        }
    ],
    "NumberOfPoints": 2,
    "GeneralComments": "Si attiva con l'App Wroom",
    "StatusTypeID": 50,
    "DateLastStatusUpdate": "2020-01-23T09:44:00Z",
    "DataQualityLevel": 1,
    "DateCreated": "2019-04-07T14:01:00Z",
    "SubmissionStatusTypeID": 200
}