{
    "IsRecentlyVerified": false,
    "ID": 139824,
    "UUID": "CEF04EE1-5739-4507-8941-C58977D7057F",
    "DataProviderID": 2,
    "DataProvidersReference": "148634",
    "OperatorID": 39,
    "UsageTypeID": 1,
    "AddressInfo": {
        "ID": 140176,
        "Title": "Windward Pointe 200",
        "AddressLine1": "5900 Windward Parkway",
        "Town": "Alpharetta",
        "StateOrProvince": "GA",
        "Postcode": "30005",
        "CountryID": 2,
        "Latitude": 34.0914703,
        "Longitude": -84.2511971,
        "ContactTelephone1": "800-663-5633",
        "AccessComments": "MO: 12:00am-12:00am; TU: 12:00am-12:00am; WE: 12:00am-12:00am; TH: 12:00am-12:00am; FR: 12:00am-12:00am; SA: 12:00am-12:00am; SU: 12:00am-12:00am",
        "RelatedURL": "http://www.semacharge.com/",
        "DistanceUnit": 0
    },
    "Connections": [
        {
            "ID": 195294,
            "ConnectionTypeID": 1,
            "LevelID": 2,
            "Amps": 16,
            "Voltage": 230,
            "PowerKW": 3.7,
            "CurrentTypeID": 10,
            "Quantity": 2
        }
    ],
    "StatusTypeID": 50,
    "DateLastStatusUpdate": "2020-06-26T02:57:00Z",
    "DataQualityLevel": 3,
    "DateCreated": "2019-12-24T09:11:00Z",
    "SubmissionStatusTypeID": 100
}