{
    "MediaItems": [
        {
            "ID": 13971,
            "ChargePointID": 87322,
            "ItemURL": "https://s3-ap-southeast-2.amazonaws.com/openchargemap/images/SK/OCM87322/OCM-87322.orig.2018011918253124.jpg",
            "ItemThumbnailURL": "https://s3-ap-southeast-2.amazonaws.com/openchargemap/images/SK/OCM87322/OCM-87322.thmb.2018011918253124.jpg",
            "Comment": "Další wallboxy (Schneider) v orenžové zóně.",
            "IsEnabled": true,
            "IsVideo": false,
            "IsFeaturedItem": false,
            "IsExternalResource": false,
            "User": {
                "ID": 6224,
                "Username": "ozana"
            },
            "DateCreated": "2018-01-19T18:26:00Z"
        },
        {
            "ID": 13317,
            "ChargePointID": 87322,
            "ItemURL": "https://s3-ap-southeast-2.amazonaws.com/openchargemap/images/SK/OCM87322/OCM-87322.orig.2017091818105271.jpg",
            "ItemThumbnailURL": "https://s3-ap-southeast-2.amazonaws.com/openchargemap/images/SK/OCM87322/OCM-87322.thmb.2017091818105271.jpg",
            "Comment": "Tesla Destination Charger  at underground parking",
            "IsEnabled": true,
            "IsVideo": false,
            "IsFeaturedItem": false,
            "IsExternalResource": false,
            "User": {
                "ID": 6224,
                "Username": "ozana"
            },
            "DateCreated": "2017-09-18T18:11:00Z"
        },
        {
            "ID": 12251,
            "ChargePointID": 87322,
            "ItemURL": "https://s3-ap-southeast-2.amazonaws.com/openchargemap/images/SK/OCM87322/OCM-87322.orig.2017052016095860.jpg",
            "ItemThumbnailURL": "https://s3-ap-southeast-2.amazonaws.com/openchargemap/images/SK/OCM87322/OCM-87322.thmb.2017052016095860.jpg",
            "Comment": "",
            "IsEnabled": true,
            "IsVideo": false,
            "IsFeaturedItem": false,
            "IsExternalResource": false,
            "User": {
                "ID": 6224,
                "Username": "ozana"
            },
            "DateCreated": "2017-05-20T16:10:00Z"
        }
    ],
    "IsRecentlyVerified": false,
    "ID": 87322,
    "UUID": "A5C4D5C8-FF1C-4967-A680-15C08B021273",
    "DataProviderID": 1,
    "OperatorID": 23,
    "OperatorsReference": "28877",
    "UsageTypeID": 1,
    "UsageCost": "€0.25/kWh; ostatné tarify pre staršie vozidlá",
    "AddressInfo": {
        "ID": 87668,
        "Title": "Bratislava Supercharger",
        "AddressLine1": "Aupark Shopping Center Einsteinova 3541/18",
        "AddressLine2": "Petržalka",
        "Town": "Bratislava",
        "StateOrProvince": "Bratislava",
        "Postcode": "851 01",
        "CountryID": 204,
        "Latitude": 48.132152147315225,
        "Longitude": 17.10814684737602,
        "ContactTelephone1": "+421 (02) 6826 6111",
        "ContactEmail": "info@aupark-bratislava.sk",
        "AccessComments": "Tesla Superchargers and Destination Chargers (at underground parking)",
        "RelatedURL": "http://www.aupark-bratislava.sk",
        "DistanceUnit": 0
    },
    "Connections": [
        {
            "ID": 123763,
            "ConnectionTypeID": 27,
            "StatusTypeID": 50,
            "LevelID": 3,
            "PowerKW": 135,
            "CurrentTypeID": 30,
            "Quantity": 6
        },
        {
            "ID": 123764,
            "ConnectionTypeID": 25,
            "StatusTypeID": 50,
            "LevelID": 2,
            "Amps": 32,
            "Voltage": 400,
            "PowerKW": 22,
            "CurrentTypeID": 20,
            "Quantity": 8
        }
    ],
    "NumberOfPoints": 8,
    "GeneralComments": "V oranzovej (strednej) zone zo zadnej strany (od sadu J.Krala) su nainstalovane nove nabijacky od firmy schneider (Typ2).",
    "StatusTypeID": 50,
    "DateLastStatusUpdate": "2020-05-25T06:02:00Z",
    "DataQualityLevel": 1,
    "DateCreated": "2017-05-04T06:26:00Z",
    "SubmissionStatusTypeID": 200
}