{
    "IsRecentlyVerified": false,
    "ID": 157861,
    "UUID": "B9DA6E53-F63B-4001-8930-0BBCE543C62F",
    "DataProviderID": 18,
    "DataProvidersReference": "9adbfdde7f2caa32c6d714b51d16a3e4",
    "UsageTypeID": 1,
    "AddressInfo": {
        "ID": 158215,
        "Title": "Level B – Fulham Broadway Car Park, Fulham Road",
        "AddressLine1": "Level B – Fulham Broadway Car Park, Fulham Road",
        "Town": "London",
        "Postcode": "SW6 1BW",
        "CountryID": 1,
        "Latitude": 51.480316,
        "Longitude": -0.194363,
        "AccessComments": "",
        "RelatedURL": "http://tbc",
        "DistanceUnit": 0
    },
    "Connections": [
        {
            "ID": 227476,
            "ConnectionTypeID": 25,
            "Reference": "4002063",
            "StatusTypeID": 50,
            "LevelID": 2,
            "Amps": 32,
            "Voltage": 400,
            "PowerKW": 22,
            "CurrentTypeID": 20
        }
    ],
    "StatusTypeID": 0,
    "DateLastStatusUpdate": "2021-07-12T03:38:00Z",
    "MetadataValues": [
        {
            "ID": 7394,
            "MetadataFieldID": 4,
            "ItemValue": "Contains public sector information licensed under the Open Government Licence v2.0. http://www.nationalarchives.gov.uk/doc/open-government-licence/version/2/"
        }
    ],
    "DataQualityLevel": 3,
    "DateCreated": "2020-06-25T10:00:00Z",
    "SubmissionStatusTypeID": 100
}