{
    "IsRecentlyVerified": false,
    "ID": 60559,
    "UUID": "2DC43A72-0AFA-4578-AA81-F564658D87CC",
    "DataProviderID": 1,
    "OperatorID": 80,
    "UsageTypeID": 4,
    "UsageCost": "0,40 €/kW",
    "AddressInfo": {
        "ID": 60905,
        "Title": "Eneldrive (ex SILFI) Sant'Agostino",
        "AddressLine1": "Via Sant'Agostino, 1",
        "Town": "Firenze",
        "StateOrProvince": "FI",
        "Postcode": "50125",
        "CountryID": 112,
        "Latitude": 43.76656406545747,
        "Longitude": 11.246657919331948,
        "RelatedURL": "http://eneldrive.it",
        "DistanceUnit": 0
    },
    "Connections": [
        {
            "ID": 76735,
            "ConnectionTypeID": 36,
            "StatusTypeID": 50,
            "LevelID": 2,
            "Amps": 16,
            "Voltage": 240,
            "PowerKW": 3,
            "CurrentTypeID": 10,
            "Quantity": 1
        },
        {
            "ID": 76736,
            "ConnectionTypeID": 25,
            "StatusTypeID": 50,
            "LevelID": 2,
            "Amps": 32,
            "Voltage": 400,
            "PowerKW": 22,
            "CurrentTypeID": 20,
            "Quantity": 1
        }
    ],
    "NumberOfPoints": 2,
    "StatusTypeID": 50,
    "DateLastStatusUpdate": "2016-02-01T16:54:00Z",
    "DataQualityLevel": 1,
    "DateCreated": "2016-02-01T16:54:00Z",
    "SubmissionStatusTypeID": 200
}