{
    "MediaItems": [
        {
            "ID": 20806,
            "ChargePointID": 146220,
            "ItemURL": "https://s3-ap-southeast-2.amazonaws.com/openchargemap/images/IT/OCM146220/OCM-146220.orig.2020010217344656.png",
            "ItemThumbnailURL": "https://s3-ap-southeast-2.amazonaws.com/openchargemap/images/IT/OCM146220/OCM-146220.thmb.2020010217344656.png",
            "Comment": "type2 11 kW , gratis per i clienti",
            "IsEnabled": true,
            "IsVideo": false,
            "IsFeaturedItem": false,
            "IsExternalResource": false,
            "User": {
                "ID": 19722,
                "Username": "baxxx"
            },
            "DateCreated": "2020-01-02T17:35:00Z"
        }
    ],
    "IsRecentlyVerified": false,
    "ID": 146220,
    "UUID": "33234B1A-68B0-4007-9111-056210B5ACB9",
    "DataProviderID": 1,
    "OperatorID": 45,
    "UsageTypeID": 6,
    "UsageCost": "free for customers",
    "AddressInfo": {
        "ID": 146572,
        "Title": "Cantina F.lli Bortolin",
        "AddressLine1": "Strada Menegazzi 5",
        "Town": "Valdobbiadene",
        "StateOrProvince": "TV",
        "Postcode": "31049",
        "CountryID": 112,
        "Latitude": 45.90307175780799,
        "Longitude": 12.035680602545199,
        "ContactTelephone1": "0423 900135",
        "ContactEmail": "info@bortolin.com",
        "AccessComments": "Riservata ai clienti della cantina. Chiedere al personale per utilizzo",
        "RelatedURL": "http://www.bortolin.com",
        "DistanceUnit": 0
    },
    "Connections": [
        {
            "ID": 203176,
            "ConnectionTypeID": 1036,
            "StatusTypeID": 50,
            "LevelID": 2,
            "Amps": 16,
            "Voltage": 400,
            "PowerKW": 11,
            "CurrentTypeID": 20,
            "Quantity": 1
        }
    ],
    "NumberOfPoints": 1,
    "StatusTypeID": 50,
    "DateLastStatusUpdate": "2020-01-06T15:39:00Z",
    "DataQualityLevel": 1,
    "DateCreated": "2020-01-02T15:51:00Z",
    "SubmissionStatusTypeID": 200
}