{
    "IsRecentlyVerified": false,
    "ID": 116970,
    "UUID": "A7237EF5-4619-40DE-8C69-814D0D82F386",
    "DataProviderID": 1,
    "OperatorID": 3332,
    "UsageTypeID": 6,
    "UsageCost": "Costo al min. €0,02 Costo prenotazione €5,00",
    "AddressInfo": {
        "ID": 117316,
        "Title": "Hotel Prima Luna | Driwe",
        "AddressLine1": "Via Gardesana",
        "AddressLine2": "San Maggiore",
        "Town": "Malcesine",
        "StateOrProvince": "VR",
        "Postcode": "37018",
        "CountryID": 112,
        "Latitude": 45.7714439271885,
        "Longitude": 10.8124512327249,
        "ContactTelephone1": "+39 0445 1620036",
        "ContactEmail": "charge@driwe.eu",
        "AccessComments": "Hotel Prima Luna",
        "RelatedURL": "https://www.driwe.eu/",
        "DistanceUnit": 0
    },
    "Connections": [
        {
            "ID": 165575,
            "ConnectionTypeID": 1036,
            "StatusTypeID": 50,
            "LevelID": 2,
            "Amps": 16,
            "Voltage": 230,
            "PowerKW": 3.7,
            "CurrentTypeID": 10,
            "Quantity": 1
        }
    ],
    "NumberOfPoints": 1,
    "StatusTypeID": 50,
    "DateLastStatusUpdate": "2019-02-15T15:58:00Z",
    "DataQualityLevel": 1,
    "DateCreated": "2019-02-15T15:05:00Z",
    "SubmissionStatusTypeID": 200
}