{
    "IsRecentlyVerified": false,
    "ID": 79261,
    "UUID": "D389B643-22DE-42E1-A902-63623341000A",
    "DataProviderID": 1,
    "OperatorID": 45,
    "UsageTypeID": 6,
    "AddressInfo": {
        "ID": 79607,
        "Title": "E-Bike Station Altstadtcafe",
        "AddressLine1": "Untertor 2",
        "Town": "Wächtersbach",
        "StateOrProvince": "Main-Kinzig-Kreis",
        "Postcode": "63607",
        "CountryID": 87,
        "Latitude": 50.25840760000001,
        "Longitude": 9.28695259999995,
        "AccessComments": "Kostenloses Aufladen am Altstadtcafe.",
        "DistanceUnit": 0
    },
    "Connections": [
        {
            "ID": 113884,
            "ConnectionTypeID": 28,
            "StatusTypeID": 50,
            "LevelID": 1,
            "Amps": 10,
            "Voltage": 230,
            "PowerKW": 2.3,
            "CurrentTypeID": 10,
            "Quantity": 4
        }
    ],
    "NumberOfPoints": 4,
    "StatusTypeID": 50,
    "DateLastStatusUpdate": "2017-01-27T07:21:00Z",
    "DataQualityLevel": 1,
    "DateCreated": "2017-01-27T07:21:00Z",
    "SubmissionStatusTypeID": 200
}