{
    "IsRecentlyVerified": false,
    "ID": 33817,
    "UUID": "13456D28-A780-4115-91E8-97B77CC9D469",
    "DataProviderID": 26,
    "DataProvidersReference": "47186",
    "OperatorID": 178,
    "OperatorsReference": "EVnetNL AL336",
    "UsageCost": "0.00 jaarabonnement",
    "AddressInfo": {
        "ID": 34163,
        "Title": "Sportlaan",
        "AddressLine1": "Sportlaan",
        "Town": "Binnenmaas",
        "Postcode": "XG",
        "CountryID": 159,
        "Latitude": 51.793061,
        "Longitude": 4.556424,
        "ContactTelephone1": "0800-3522365",
        "RelatedURL": "http://www.evnet.nl",
        "DistanceUnit": 0
    },
    "Connections": [
        {
            "ID": 37328,
            "ConnectionTypeID": 25,
            "LevelID": 2,
            "PowerKW": 11,
            "CurrentTypeID": 10
        }
    ],
    "NumberOfPoints": 2,
    "StatusTypeID": 50,
    "DateLastStatusUpdate": "2016-06-04T02:40:00Z",
    "DataQualityLevel": 3,
    "DateCreated": "2015-01-09T06:04:00Z",
    "SubmissionStatusTypeID": 100
}