{
    "IsRecentlyVerified": false,
    "ID": 61423,
    "UUID": "75BCCEF3-8E49-4E77-98D2-8732DF510394",
    "DataProviderID": 1,
    "DataProvidersReference": "2249",
    "AddressInfo": {
        "ID": 61769,
        "Title": "Östersund Arena",
        "AddressLine1": "Östersund Arena 27",
        "Town": "ÖSTERSUND",
        "StateOrProvince": "JÄMTLAND",
        "Postcode": "83132",
        "CountryID": 216,
        "Latitude": 63.19578,
        "Longitude": 14.66044,
        "AccessComments": "På parkeringen till vänster om entrén.",
        "DistanceUnit": 0
    },
    "Connections": [
        {
            "ID": 78219,
            "ConnectionTypeID": 0,
            "Reference": "1",
            "LevelID": 2,
            "Amps": 32,
            "Voltage": 400,
            "PowerKW": 22,
            "Comments": "Mode 3"
        },
        {
            "ID": 89374,
            "ConnectionTypeID": 0,
            "Reference": "2",
            "LevelID": 2,
            "Amps": 32,
            "Voltage": 230,
            "PowerKW": 7.4,
            "Comments": "Mode 3"
        }
    ],
    "NumberOfPoints": 2,
    "DateLastStatusUpdate": "2020-05-26T08:25:00Z",
    "DataQualityLevel": 2,
    "DateCreated": "2016-02-27T02:32:00Z",
    "SubmissionStatusTypeID": 100
}