{
    "IsRecentlyVerified": false,
    "ID": 65782,
    "UUID": "B33631EB-4292-4A89-BA33-66180A1A7535",
    "DataProviderID": 26,
    "DataProvidersReference": "84637",
    "OperatorID": 103,
    "OperatorsReference": "Allego NLALLEGO0006332",
    "UsageCost": "0.00 jaarabonnement",
    "AddressInfo": {
        "ID": 66128,
        "Title": "Molenweidtje",
        "AddressLine1": "Molenweidtje",
        "Town": "Bergen (NH)",
        "Postcode": "1862 BD",
        "CountryID": 159,
        "Latitude": 52.676034,
        "Longitude": 4.708761,
        "ContactTelephone1": "0800-3745337",
        "RelatedURL": "http://www.allego.eu/",
        "DistanceUnit": 0
    },
    "Connections": [
        {
            "ID": 90846,
            "ConnectionTypeID": 25,
            "LevelID": 2,
            "PowerKW": 11,
            "CurrentTypeID": 10
        },
        {
            "ID": 90847,
            "ConnectionTypeID": 25,
            "LevelID": 2,
            "PowerKW": 11,
            "CurrentTypeID": 10
        }
    ],
    "NumberOfPoints": 1,
    "StatusTypeID": 50,
    "DateLastStatusUpdate": "2016-06-04T02:55:00Z",
    "DataQualityLevel": 3,
    "DateCreated": "2016-04-27T09:42:00Z",
    "SubmissionStatusTypeID": 100
}