{
    "IsRecentlyVerified": false,
    "ID": 88831,
    "UUID": "0F395C23-8285-4249-9816-BBB9B0D0C3BF",
    "DataProviderID": 1,
    "OperatorID": 23,
    "OperatorsReference": "30595",
    "UsageTypeID": 4,
    "AddressInfo": {
        "ID": 89177,
        "Title": "Melia Coral",
        "AddressLine1": "Katoro 20",
        "Town": "Umag",
        "Postcode": "52470",
        "CountryID": 60,
        "Latitude": 45.460508,
        "Longitude": 13.513941,
        "ContactTelephone1": "+385 52 701 000",
        "DistanceUnit": 0
    },
    "Connections": [
        {
            "ID": 126079,
            "ConnectionTypeID": 1036,
            "StatusTypeID": 50,
            "LevelID": 2,
            "Amps": 32,
            "Voltage": 400,
            "PowerKW": 22,
            "CurrentTypeID": 20,
            "Quantity": 1
        }
    ],
    "NumberOfPoints": 1,
    "GeneralComments": "1 Tesla Connector, up to 22kW.Available for customers. Please call ahead.",
    "StatusTypeID": 50,
    "DateLastStatusUpdate": "2017-06-09T14:24:00Z",
    "DataQualityLevel": 1,
    "DateCreated": "2017-06-09T14:24:00Z",
    "SubmissionStatusTypeID": 200
}