{
    "IsRecentlyVerified": false,
    "ID": 35736,
    "UUID": "0F10554D-5FE2-4117-856E-2BF286B27AC4",
    "DataProviderID": 26,
    "DataProvidersReference": "32150",
    "OperatorID": 157,
    "OperatorsReference": "NewMotion ICUEVE000023",
    "UsageCost": "0.00 jaarabonnement",
    "AddressInfo": {
        "ID": 36082,
        "Title": "Pelmolenlaan 19",
        "AddressLine1": "Pelmolenlaan 19",
        "Town": "Woerden",
        "Postcode": "3447 GW",
        "CountryID": 159,
        "Latitude": 52.0769081115723,
        "Longitude": 4.89197158813477,
        "ContactTelephone1": "088 0109500",
        "RelatedURL": "http://thenewmotion.nl/",
        "DistanceUnit": 0
    },
    "Connections": [
        {
            "ID": 39247,
            "ConnectionTypeID": 25,
            "LevelID": 2,
            "PowerKW": 22,
            "CurrentTypeID": 10
        },
        {
            "ID": 48026,
            "ConnectionTypeID": 25,
            "LevelID": 2,
            "PowerKW": 3.7,
            "CurrentTypeID": 10
        },
        {
            "ID": 48027,
            "ConnectionTypeID": 25,
            "LevelID": 2,
            "PowerKW": 3.7,
            "CurrentTypeID": 10
        },
        {
            "ID": 82288,
            "ConnectionTypeID": 25,
            "LevelID": 2,
            "PowerKW": 22,
            "CurrentTypeID": 10
        },
        {
            "ID": 90920,
            "ConnectionTypeID": 25,
            "LevelID": 2,
            "PowerKW": 22,
            "CurrentTypeID": 10
        }
    ],
    "NumberOfPoints": 2,
    "StatusTypeID": 50,
    "DateLastStatusUpdate": "2016-06-04T02:49:00Z",
    "DataQualityLevel": 3,
    "DateCreated": "2015-01-09T06:05:00Z",
    "SubmissionStatusTypeID": 100
}