{
    "IsRecentlyVerified": false,
    "ID": 142835,
    "UUID": "208F85E7-8733-45E1-80E5-84BA05021127",
    "DataProviderID": 2,
    "DataProvidersReference": "64273",
    "OperatorID": 5,
    "UsageTypeID": 1,
    "AddressInfo": {
        "ID": 143187,
        "Title": "JNS",
        "AddressLine1": "2700 Ogden Ave",
        "Town": "Downers Grove",
        "StateOrProvince": "IL",
        "Postcode": "60515",
        "CountryID": 2,
        "Latitude": 41.8060295,
        "Longitude": -88.0502077,
        "ContactTelephone1": "888-758-4389",
        "AccessComments": "24 hours daily",
        "RelatedURL": "http://www.chargepoint.com/",
        "DistanceUnit": 0
    },
    "Connections": [
        {
            "ID": 199061,
            "ConnectionTypeID": 1,
            "LevelID": 2,
            "Amps": 16,
            "Voltage": 230,
            "PowerKW": 3.7,
            "CurrentTypeID": 10,
            "Quantity": 1
        }
    ],
    "StatusTypeID": 50,
    "DateLastStatusUpdate": "2020-06-26T03:05:00Z",
    "DataQualityLevel": 3,
    "DateCreated": "2019-12-24T09:19:00Z",
    "SubmissionStatusTypeID": 100
}