{
    "IsRecentlyVerified": false,
    "ID": 153214,
    "UUID": "93D7CA8A-F781-423F-AED3-4134347E7E50",
    "DataProviderID": 28,
    "DataProvidersReference": "FR*S70*P0702278",
    "UsageTypeID": 5,
    "AddressInfo": {
        "ID": 153567,
        "Title": "Champs de foire",
        "AddressLine1": "Place du champs de foire - Faucogney et la mer",
        "CountryID": 80,
        "Latitude": 47.84139,
        "Longitude": 6.56167,
        "AccessComments": "accessible 24h/24 - 7j/7",
        "DistanceUnit": 0
    },
    "Connections": [
        {
            "ID": 214832,
            "ConnectionTypeID": 1036,
            "StatusTypeID": 50,
            "LevelID": 2,
            "PowerKW": 22,
            "CurrentTypeID": 20
        },
        {
            "ID": 248205,
            "ConnectionTypeID": 1036,
            "StatusTypeID": 50,
            "LevelID": 2,
            "PowerKW": 22,
            "CurrentTypeID": 20
        }
    ],
    "GeneralComments": "recharge normale et acceleree accessible par application smartphone/internet et badge - informations site web freshmile.fr",
    "StatusTypeID": 50,
    "DateLastStatusUpdate": "2020-08-27T05:14:00Z",
    "DataQualityLevel": 2,
    "DateCreated": "2020-03-15T10:54:00Z",
    "SubmissionStatusTypeID": 100
}