{
    "UserComments": [
        {
            "ID": 24303,
            "ChargePointID": 175302,
            "CommentTypeID": 10,
            "UserName": "ForumElettrico.it",
            "Comment": "Di fronte c'è un bar con una piccola cucina, poi un altro bar che fa anche da tabacchino e poco dopo una pizzeria. Leggi la recensione completa qui >  https://www.forumelettrico.it/forum/colonnine-be-charge-fast-piacenza-pc-strada-gragnana-17-t17640.html",
            "RelatedURL": "https://www.forumelettrico.it/forum/colonnine-be-charge-fast-piacenza-pc-strada-gragnana-17-t17640.html",
            "DateCreated": "2021-05-08T09:35:14.06Z",
            "User": {
                "ID": 11749,
                "Username": "ForumElettrico.it"
            },
            "CheckinStatusTypeID": 10,
            "IsActionedByEditor": false
        }
    ],
    "MediaItems": [
        {
            "ID": 27554,
            "ChargePointID": 175302,
            "ItemURL": "https://s3-ap-southeast-2.amazonaws.com/openchargemap/images/IT/OCM175302/OCM-175302.orig.2021050809352988.jpg",
            "ItemThumbnailURL": "https://s3-ap-southeast-2.amazonaws.com/openchargemap/images/IT/OCM175302/OCM-175302.thmb.2021050809352988.jpg",
            "Comment": "",
            "IsEnabled": true,
            "IsVideo": false,
            "IsFeaturedItem": false,
            "IsExternalResource": false,
            "User": {
                "ID": 11749,
                "Username": "ForumElettrico.it"
            },
            "DateCreated": "2021-05-08T09:36:00Z"
        },
        {
            "ID": 27555,
            "ChargePointID": 175302,
            "ItemURL": "https://s3-ap-southeast-2.amazonaws.com/openchargemap/images/IT/OCM175302/OCM-175302.orig.2021050809353661.jpg",
            "ItemThumbnailURL": "https://s3-ap-southeast-2.amazonaws.com/openchargemap/images/IT/OCM175302/OCM-175302.thmb.2021050809353661.jpg",
            "Comment": "",
            "IsEnabled": true,
            "IsVideo": false,
            "IsFeaturedItem": false,
            "IsExternalResource": false,
            "User": {
                "ID": 11749,
                "Username": "ForumElettrico.it"
            },
            "DateCreated": "2021-05-08T09:36:00Z"
        },
        {
            "ID": 27556,
            "ChargePointID": 175302,
            "ItemURL": "https://s3-ap-southeast-2.amazonaws.com/openchargemap/images/IT/OCM175302/OCM-175302.orig.2021050809354251.jpg",
            "ItemThumbnailURL": "https://s3-ap-southeast-2.amazonaws.com/openchargemap/images/IT/OCM175302/OCM-175302.thmb.2021050809354251.jpg",
            "Comment": "",
            "IsEnabled": true,
            "IsVideo": false,
            "IsFeaturedItem": false,
            "IsExternalResource": false,
            "User": {
                "ID": 11749,
                "Username": "ForumElettrico.it"
            },
            "DateCreated": "2021-05-08T09:36:00Z"
        },
        {
            "ID": 27557,
            "ChargePointID": 175302,
            "ItemURL": "https://s3-ap-southeast-2.amazonaws.com/openchargemap/images/IT/OCM175302/OCM-175302.orig.2021050809354945.jpg",
            "ItemThumbnailURL": "https://s3-ap-southeast-2.amazonaws.com/openchargemap/images/IT/OCM175302/OCM-175302.thmb.2021050809354945.jpg",
            "Comment": "",
            "IsEnabled": true,
            "IsVideo": false,
            "IsFeaturedItem": false,
            "IsExternalResource": false,
            "User": {
                "ID": 11749,
                "Username": "ForumElettrico.it"
            },
            "DateCreated": "2021-05-08T09:36:00Z"
        },
        {
            "ID": 27553,
            "ChargePointID": 175302,
            "ItemURL": "https://s3-ap-southeast-2.amazonaws.com/openchargemap/images/IT/OCM175302/OCM-175302.orig.2021050809352342.jpg",
            "ItemThumbnailURL": "https://s3-ap-southeast-2.amazonaws.com/openchargemap/images/IT/OCM175302/OCM-175302.thmb.2021050809352342.jpg",
            "Comment": "",
            "IsEnabled": true,
            "IsVideo": false,
            "IsFeaturedItem": false,
            "IsExternalResource": false,
            "User": {
                "ID": 11749,
                "Username": "ForumElettrico.it"
            },
            "DateCreated": "2021-05-08T09:35:00Z"
        }
    ],
    "IsRecentlyVerified": false,
    "ID": 175302,
    "UUID": "CF9E1FBA-9ED6-4E20-B2EF-914FD6F01B1B",
    "DataProviderID": 1,
    "OperatorID": 3327,
    "UsageTypeID": 1,
    "AddressInfo": {
        "ID": 175661,
        "Title": "Be Charge Gragnana ",
        "AddressLine1": "Strada Gragnana 17",
        "Town": "Piacenza",
        "StateOrProvince": "PC",
        "CountryID": 112,
        "Latitude": 45.044605,
        "Longitude": 9.661725,
        "RelatedURL": "https://www.forumelettrico.it/forum/colonnine-be-charge-fast-piacenza-pc-strada-gragnana-17-t17640.html",
        "DistanceUnit": 0
    },
    "Connections": [
        {
            "ID": 271891,
            "ConnectionTypeID": 33,
            "LevelID": 2,
            "PowerKW": 75
        },
        {
            "ID": 271892,
            "ConnectionTypeID": 2,
            "LevelID": 2,
            "PowerKW": 63
        },
        {
            "ID": 271893,
            "ConnectionTypeID": 1036,
            "LevelID": 2,
            "PowerKW": 22
        },
        {
            "ID": 271894,
            "ConnectionTypeID": 25,
            "LevelID": 2,
            "PowerKW": 22,
            "Quantity": 2
        }
    ],
    "NumberOfPoints": 3,
    "StatusTypeID": 50,
    "DateLastStatusUpdate": "2021-05-08T09:59:00Z",
    "DataQualityLevel": 1,
    "DateCreated": "2021-05-08T09:35:00Z",
    "SubmissionStatusTypeID": 200
}