{
    "IsRecentlyVerified": false,
    "ID": 73982,
    "UUID": "D00CD387-635A-438D-BD55-3566E990E652",
    "DataProviderID": 1,
    "OperatorID": 89,
    "OperatorsReference": "CEA-240",
    "UsageTypeID": 4,
    "UsageCost": "CAD 1.00/hour",
    "AddressInfo": {
        "ID": 74328,
        "Title": "Deserres-St-Hubert",
        "AddressLine1": "4055 boulevard Taschereau",
        "Town": "St-Hubert",
        "StateOrProvince": "QC",
        "Postcode": "J4T 2G8",
        "CountryID": 44,
        "Latitude": 45.4861630678737,
        "Longitude": -73.4662960330658,
        "DistanceUnit": 0
    },
    "Connections": [
        {
            "ID": 106296,
            "ConnectionTypeID": 1,
            "StatusTypeID": 50,
            "LevelID": 2,
            "Amps": 32,
            "Voltage": 230,
            "PowerKW": 7,
            "CurrentTypeID": 10,
            "Quantity": 1
        }
    ],
    "NumberOfPoints": 1,
    "StatusTypeID": 50,
    "DateLastStatusUpdate": "2017-01-22T19:12:00Z",
    "DataQualityLevel": 1,
    "DateCreated": "2016-11-23T23:50:00Z",
    "SubmissionStatusTypeID": 200
}