{
    "IsRecentlyVerified": false,
    "ID": 81762,
    "UUID": "A2F526C4-5ED5-4EA4-BC2F-A97D1AA94E1D",
    "DataProviderID": 1,
    "OperatorID": 23,
    "OperatorsReference": "19389",
    "UsageTypeID": 6,
    "AddressInfo": {
        "ID": 82108,
        "Title": "Ipark Nyc 455 Central Park West",
        "AddressLine1": "27 West 105th St",
        "Town": "New York",
        "StateOrProvince": "New York",
        "Postcode": "10025",
        "CountryID": 2,
        "Latitude": 40.797771,
        "Longitude": -73.96142,
        "ContactTelephone1": "(212) 666-7246",
        "DistanceUnit": 0
    },
    "Connections": [
        {
            "ID": 116520,
            "ConnectionTypeID": 30,
            "StatusTypeID": 50,
            "LevelID": 2,
            "PowerKW": 8,
            "CurrentTypeID": 10,
            "Quantity": 2
        }
    ],
    "NumberOfPoints": 2,
    "GeneralComments": "2 Tesla Connectors, up to 8kW.Available for patrons only. Please see valet.",
    "StatusTypeID": 50,
    "DateLastStatusUpdate": "2017-06-09T12:44:00Z",
    "DataQualityLevel": 1,
    "DateCreated": "2017-02-03T11:56:00Z",
    "SubmissionStatusTypeID": 200
}