{
    "IsRecentlyVerified": false,
    "ID": 14478,
    "UUID": "F4D1BC07-FE7F-40A1-8279-87D68F9DD56A",
    "DataProviderID": 2,
    "DataProvidersReference": "47784",
    "UsageTypeID": 7,
    "AddressInfo": {
        "ID": 14375,
        "Title": "Pittsburgh East Nissan",
        "AddressLine1": "3355 William Penn Hwy",
        "Town": "Pittsburgh",
        "StateOrProvince": "PA",
        "Postcode": "15235",
        "CountryID": 2,
        "Latitude": 40.431599,
        "Longitude": -79.814633,
        "ContactTelephone1": "412-824-9020",
        "AccessComments": "Dealership business hours",
        "RelatedURL": "",
        "DistanceUnit": 0
    },
    "Connections": [
        {
            "ID": 16644,
            "ConnectionTypeID": 1,
            "LevelID": 2,
            "Amps": 16,
            "Voltage": 230,
            "PowerKW": 3,
            "CurrentTypeID": 10,
            "Quantity": 1
        },
        {
            "ID": 21768,
            "ConnectionTypeID": 2,
            "LevelID": 2,
            "Amps": 100,
            "Voltage": 400,
            "PowerKW": 40,
            "CurrentTypeID": 10,
            "Quantity": 1
        }
    ],
    "DateLastStatusUpdate": "2019-04-06T04:03:00Z",
    "DataQualityLevel": 3,
    "DateCreated": "2012-12-06T16:49:00Z",
    "SubmissionStatusTypeID": 100
}