{
    "MediaItems": [
        {
            "ID": 6612,
            "ChargePointID": 68626,
            "ItemURL": "https://s3-ap-southeast-2.amazonaws.com/openchargemap/images/US/OCM68626/OCM-68626.orig.2016061316411129.jpg",
            "ItemThumbnailURL": "https://s3-ap-southeast-2.amazonaws.com/openchargemap/images/US/OCM68626/OCM-68626.thmb.2016061316411129.jpg",
            "Comment": "EV Plug (J1772) - Charger is located on front porch. It's on 24/7. Shops open M-F 8am to 5pm. ",
            "IsEnabled": true,
            "IsVideo": false,
            "IsFeaturedItem": false,
            "IsExternalResource": false,
            "User": {
                "ID": 9498,
                "Username": "Master Mechanics"
            },
            "DateCreated": "2016-06-13T16:41:00Z"
        }
    ],
    "IsRecentlyVerified": false,
    "ID": 68626,
    "UUID": "2E8C15F2-120D-45F9-B87A-E18412461E4F",
    "DataProviderID": 1,
    "OperatorID": 45,
    "UsageTypeID": 1,
    "UsageCost": "FREE",
    "AddressInfo": {
        "ID": 68972,
        "Title": "The Master Mechanics",
        "AddressLine1": "3480 CHAMBERSBURG ROAD",
        "Town": "BIGLERVILLE",
        "StateOrProvince": "PA",
        "Postcode": "17307",
        "CountryID": 2,
        "Latitude": 39.8852315,
        "Longitude": -77.3431675,
        "ContactTelephone1": "717-337-0855",
        "ContactEmail": "mastermechanics@embarqmail.com",
        "AccessComments": "EV Plug (J1772) -  Charger is located on front porch. It's on 24/7. Shops open M-F 8am to 5pm. ",
        "RelatedURL": "http://www.gettysburgev.com",
        "DistanceUnit": 0
    },
    "Connections": [
        {
            "ID": 96232,
            "ConnectionTypeID": 1,
            "StatusTypeID": 50,
            "LevelID": 2,
            "CurrentTypeID": 10
        }
    ],
    "NumberOfPoints": 1,
    "GeneralComments": "EV Plug (J1772) -  Charger is located on front porch. It's on 24/7. Shops open M-F 8am to 5pm. ",
    "StatusTypeID": 50,
    "DateLastStatusUpdate": "2016-06-13T19:26:00Z",
    "DataQualityLevel": 1,
    "DateCreated": "2016-06-13T16:28:00Z",
    "SubmissionStatusTypeID": 200
}