{
    "IsRecentlyVerified": false,
    "ID": 101455,
    "UUID": "344E1998-8F7B-40AF-8D7C-63D7D1125F49",
    "DataProviderID": 1,
    "OperatorID": 3315,
    "OperatorsReference": "50463,50464,50465,50466,50467,50468,50823",
    "UsageTypeID": 4,
    "UsageCost": "Free, Parking fee required ",
    "AddressInfo": {
        "ID": 101801,
        "Title": "Livingston Designer Outlet - Blue Carpark",
        "AddressLine1": "Almondvale Road",
        "Town": "Livingston",
        "StateOrProvince": "West Lothian",
        "Postcode": "EH54 6GS",
        "CountryID": 1,
        "Latitude": 55.8821186006993,
        "Longitude": -3.51813277854035,
        "AccessComments": "2 bays in external car park.  Available 24/7",
        "DistanceUnit": 0
    },
    "Connections": [
        {
            "ID": 143247,
            "ConnectionTypeID": 25,
            "StatusTypeID": 100,
            "LevelID": 2,
            "Amps": 32,
            "Voltage": 400,
            "PowerKW": 22,
            "CurrentTypeID": 20,
            "Quantity": 6
        }
    ],
    "NumberOfPoints": 6,
    "StatusTypeID": 100,
    "DateLastStatusUpdate": "2020-05-29T05:20:00Z",
    "DataQualityLevel": 1,
    "DateCreated": "2018-03-29T05:16:00Z",
    "SubmissionStatusTypeID": 200
}