{
    "IsRecentlyVerified": false,
    "ID": 140502,
    "UUID": "E57E4CA7-52A7-4FF9-A1D2-AD6C1E76D8BF",
    "DataProviderID": 2,
    "DataProvidersReference": "145555",
    "OperatorID": 5,
    "UsageTypeID": 1,
    "AddressInfo": {
        "ID": 140854,
        "Title": "7SPC",
        "AddressLine1": "117 Boone St",
        "Town": "Jonesborough",
        "StateOrProvince": "TN",
        "Postcode": "37659",
        "CountryID": 2,
        "Latitude": 36.29695,
        "Longitude": -82.471016,
        "ContactTelephone1": "888-758-4389",
        "AccessComments": "24 hours daily",
        "RelatedURL": "http://www.chargepoint.com/",
        "DistanceUnit": 0
    },
    "Connections": [
        {
            "ID": 196146,
            "ConnectionTypeID": 1,
            "LevelID": 2,
            "Amps": 16,
            "Voltage": 230,
            "PowerKW": 3.7,
            "CurrentTypeID": 10,
            "Quantity": 2
        }
    ],
    "StatusTypeID": 50,
    "DateLastStatusUpdate": "2020-06-26T02:58:00Z",
    "DataQualityLevel": 3,
    "DateCreated": "2019-12-24T09:13:00Z",
    "SubmissionStatusTypeID": 100
}