{
    "IsRecentlyVerified": false,
    "ID": 142111,
    "UUID": "90DF8FDE-302F-42DF-B9A7-DB1276F0E6BD",
    "DataProviderID": 2,
    "DataProvidersReference": "147400",
    "OperatorID": 5,
    "UsageTypeID": 1,
    "AddressInfo": {
        "ID": 142463,
        "Title": "BREIT EV GROUP",
        "AddressLine1": "426 Lancaster Ave",
        "Town": "Devon",
        "StateOrProvince": "PA",
        "Postcode": "19333",
        "CountryID": 2,
        "Latitude": 40.045067,
        "Longitude": -75.43173,
        "ContactTelephone1": "888-758-4389",
        "AccessComments": "24 hours daily",
        "RelatedURL": "http://www.chargepoint.com/",
        "DistanceUnit": 0
    },
    "Connections": [
        {
            "ID": 198182,
            "ConnectionTypeID": 1,
            "LevelID": 2,
            "Amps": 16,
            "Voltage": 230,
            "PowerKW": 3.7,
            "CurrentTypeID": 10,
            "Quantity": 2
        }
    ],
    "StatusTypeID": 50,
    "DateLastStatusUpdate": "2020-06-26T03:02:00Z",
    "DataQualityLevel": 3,
    "DateCreated": "2019-12-24T09:17:00Z",
    "SubmissionStatusTypeID": 100
}