{
    "IsRecentlyVerified": false,
    "ID": 124261,
    "UUID": "A61581AF-BA86-45E7-8DD4-6A712EBCDC03",
    "DataProviderID": 2,
    "DataProvidersReference": "48653",
    "UsageTypeID": 1,
    "AddressInfo": {
        "ID": 124607,
        "Title": "City of Evansville - Sycamore Street Public Garage",
        "AddressLine1": "500 Sycamore St",
        "Town": "Evansville",
        "StateOrProvince": "IN",
        "Postcode": "47708",
        "CountryID": 2,
        "Latitude": 37.973291,
        "Longitude": -87.570076,
        "ContactTelephone1": "812-435-6061",
        "AccessComments": "7am-6pm daily; pay lot",
        "RelatedURL": "",
        "DistanceUnit": 0
    },
    "Connections": [
        {
            "ID": 174339,
            "ConnectionTypeID": 1,
            "LevelID": 2,
            "Amps": 16,
            "Voltage": 230,
            "PowerKW": 3.7,
            "CurrentTypeID": 10,
            "Quantity": 6
        }
    ],
    "DateLastStatusUpdate": "2020-06-26T02:59:00Z",
    "DataQualityLevel": 3,
    "DateCreated": "2019-04-06T05:03:00Z",
    "SubmissionStatusTypeID": 100
}