{
    "IsRecentlyVerified": false,
    "ID": 97459,
    "UUID": "841E99BA-E3E3-42A8-ADF0-9023C465F42D",
    "DataProviderID": 1,
    "OperatorID": 23,
    "OperatorsReference": "38618",
    "UsageTypeID": 4,
    "AddressInfo": {
        "ID": 97805,
        "Title": "Hotel Weingut Schloss Gamlitz",
        "AddressLine1": "Eckberger Weinstrasse 32",
        "Town": "Gamlitz",
        "Postcode": "8462",
        "CountryID": 19,
        "Latitude": 46.718982,
        "Longitude": 15.553422,
        "ContactTelephone1": "+43 3453 2363",
        "DistanceUnit": 0
    },
    "Connections": [
        {
            "ID": 138366,
            "ConnectionTypeID": 30,
            "StatusTypeID": 50,
            "LevelID": 2,
            "Amps": 16,
            "Voltage": 400,
            "PowerKW": 11,
            "CurrentTypeID": 20,
            "Quantity": 1
        }
    ],
    "NumberOfPoints": 1,
    "GeneralComments": "1 Tesla Connector, up to 11kW.Available for customers. Please see front desk.",
    "StatusTypeID": 50,
    "DateLastStatusUpdate": "2018-10-03T20:34:00Z",
    "DataQualityLevel": 1,
    "DateCreated": "2018-01-21T15:29:00Z",
    "SubmissionStatusTypeID": 200
}