{
    "MediaItems": [
        {
            "ID": 1522,
            "ChargePointID": 47612,
            "ItemURL": "https://s3-ap-southeast-2.amazonaws.com/openchargemap/images/US/OCM47612/OCM-47612.orig.2015060220052607.jpg",
            "ItemThumbnailURL": "https://s3-ap-southeast-2.amazonaws.com/openchargemap/images/US/OCM47612/OCM-47612.thmb.2015060220052607.jpg",
            "Comment": "",
            "IsEnabled": true,
            "IsVideo": false,
            "IsFeaturedItem": false,
            "IsExternalResource": false,
            "User": {
                "ID": 4910,
                "Username": "Blakeslee Vineyard"
            },
            "DateCreated": "2015-06-02T20:06:00Z"
        },
        {
            "ID": 1523,
            "ChargePointID": 47612,
            "ItemURL": "https://s3-ap-southeast-2.amazonaws.com/openchargemap/images/US/OCM47612/OCM-47612.orig.2015060220054380.jpg",
            "ItemThumbnailURL": "https://s3-ap-southeast-2.amazonaws.com/openchargemap/images/US/OCM47612/OCM-47612.thmb.2015060220054380.jpg",
            "Comment": "",
            "IsEnabled": true,
            "IsVideo": false,
            "IsFeaturedItem": false,
            "IsExternalResource": false,
            "User": {
                "ID": 4910,
                "Username": "Blakeslee Vineyard"
            },
            "DateCreated": "2015-06-02T20:06:00Z"
        }
    ],
    "IsRecentlyVerified": false,
    "ID": 47612,
    "UUID": "3F0E5D0C-DEDD-4FEE-B3C7-8D0440567EBA",
    "DataProviderID": 1,
    "OperatorID": 45,
    "UsageTypeID": 6,
    "AddressInfo": {
        "ID": 47958,
        "Title": "Blakeslee Vineyard Estate",
        "AddressLine1": "20875 Southwest Chapman Road",
        "Town": "Sherwood",
        "StateOrProvince": "Washington County",
        "Postcode": "97140",
        "CountryID": 2,
        "Latitude": 45.348869012367,
        "Longitude": -122.893034989602,
        "ContactTelephone1": "503-625-6902",
        "ContactTelephone2": "5036256902",
        "ContactEmail": "info@blakesleevineyard.com",
        "DistanceUnit": 0
    },
    "Connections": [
        {
            "ID": 58698,
            "ConnectionTypeID": 1,
            "StatusTypeID": 50,
            "LevelID": 2,
            "Amps": 0,
            "Voltage": 0,
            "Quantity": 0
        }
    ],
    "NumberOfPoints": 1,
    "StatusTypeID": 50,
    "DateLastStatusUpdate": "2015-06-03T12:56:00Z",
    "DataQualityLevel": 1,
    "DateCreated": "2015-06-02T20:05:00Z",
    "SubmissionStatusTypeID": 200
}