{
    "MediaItems": [
        {
            "ID": 19039,
            "ChargePointID": 116493,
            "ItemURL": "https://s3-ap-southeast-2.amazonaws.com/openchargemap/images/NO/OCM116493/OCM-116493.orig.2019072516103701.png",
            "ItemThumbnailURL": "https://s3-ap-southeast-2.amazonaws.com/openchargemap/images/NO/OCM116493/OCM-116493.thmb.2019072516103701.png",
            "Comment": "",
            "IsEnabled": true,
            "IsVideo": false,
            "IsFeaturedItem": false,
            "IsExternalResource": false,
            "User": {
                "ID": 21713,
                "Username": "Rindis"
            },
            "DateCreated": "2019-07-25T16:11:00Z"
        }
    ],
    "IsRecentlyVerified": false,
    "ID": 116493,
    "UUID": "649D5626-6511-41CA-A823-48988514E99E",
    "DataProviderID": 1,
    "DataProvidersReference": "5238",
    "AddressInfo": {
        "ID": 116839,
        "Title": "Coop Prix Selje",
        "AddressLine1": "Selje ",
        "Town": "SELJE",
        "StateOrProvince": "Vestland",
        "Postcode": "6740",
        "CountryID": 168,
        "Latitude": 62.04525,
        "Longitude": 5.34509,
        "AccessComments": "",
        "DistanceUnit": 0
    },
    "Connections": [
        {
            "ID": 164746,
            "ConnectionTypeID": 0,
            "Reference": "1",
            "LevelID": 2,
            "Amps": 100,
            "Voltage": 500,
            "PowerKW": 50,
            "Comments": "Mode 4"
        },
        {
            "ID": 164747,
            "ConnectionTypeID": 0,
            "Reference": "2",
            "LevelID": 2,
            "Amps": 100,
            "Voltage": 500,
            "PowerKW": 50,
            "Comments": "Mode 4"
        }
    ],
    "NumberOfPoints": 2,
    "DateLastStatusUpdate": "2020-05-26T08:25:00Z",
    "DataQualityLevel": 2,
    "DateCreated": "2019-02-11T09:16:00Z",
    "SubmissionStatusTypeID": 100
}