{
    "IsRecentlyVerified": false,
    "ID": 140610,
    "UUID": "26DBCA7A-6609-4861-A548-203AF5FD88C7",
    "DataProviderID": 2,
    "DataProvidersReference": "117825",
    "OperatorID": 5,
    "UsageTypeID": 1,
    "AddressInfo": {
        "ID": 140962,
        "Title": "STAFF OF LIFE",
        "AddressLine1": "1266 Soquel Ave",
        "Town": "Santa Cruz",
        "StateOrProvince": "CA",
        "Postcode": "95062",
        "CountryID": 2,
        "Latitude": 36.9802889,
        "Longitude": -122.0079588,
        "ContactTelephone1": "888-758-4389",
        "AccessComments": "24 hours daily",
        "RelatedURL": "http://www.chargepoint.com/",
        "DistanceUnit": 0
    },
    "Connections": [
        {
            "ID": 196294,
            "ConnectionTypeID": 1,
            "LevelID": 2,
            "Amps": 16,
            "Voltage": 230,
            "PowerKW": 3,
            "CurrentTypeID": 10,
            "Quantity": 2
        }
    ],
    "StatusTypeID": 50,
    "DateLastStatusUpdate": "2019-12-24T09:13:00Z",
    "DataQualityLevel": 3,
    "DateCreated": "2019-12-24T09:13:00Z",
    "SubmissionStatusTypeID": 100
}