{
    "IsRecentlyVerified": false,
    "ID": 166968,
    "UUID": "7E94B2D1-A11A-4B87-BE51-6096311671D1",
    "DataProviderID": 1,
    "OperatorID": 21,
    "UsageTypeID": 4,
    "UsageCost": "Mobi.E compatible card",
    "AddressInfo": {
        "ID": 167327,
        "Title": "VGS-00001",
        "AddressLine1": "R. do Gov",
        "Town": "Vagos",
        "StateOrProvince": "Aveiro",
        "Postcode": "3840-262",
        "CountryID": 180,
        "Latitude": 40.562889,
        "Longitude": -8.767444,
        "RelatedURL": "https://www.mobie.pt",
        "DistanceUnit": 0
    },
    "Connections": [
        {
            "ID": 252771,
            "ConnectionTypeID": 25,
            "StatusTypeID": 50,
            "LevelID": 2,
            "Amps": 32,
            "Voltage": 400,
            "PowerKW": 22,
            "CurrentTypeID": 20,
            "Quantity": 2
        }
    ],
    "NumberOfPoints": 2,
    "StatusTypeID": 50,
    "DateLastStatusUpdate": "2020-09-16T20:24:00Z",
    "DataQualityLevel": 3,
    "DateCreated": "2020-08-27T06:37:00Z",
    "SubmissionStatusTypeID": 100
}