{
    "IsRecentlyVerified": false,
    "ID": 114477,
    "UUID": "91FAFE03-1D18-4821-9412-4FD442DFFD74",
    "DataProviderID": 1,
    "OperatorID": 80,
    "UsageTypeID": 4,
    "AddressInfo": {
        "ID": 114823,
        "Title": "Cormano D'Annunzio | EnelX",
        "AddressLine1": "Via Gabriele D'Annunzio",
        "Town": "Cormano",
        "StateOrProvince": "MI",
        "Postcode": "20032",
        "CountryID": 112,
        "Latitude": 45.5498628760554,
        "Longitude": 9.16031187418553,
        "ContactTelephone1": "800.069.850",
        "RelatedURL": "https://www.enelx.com/it/it/emobility",
        "DistanceUnit": 0
    },
    "Connections": [
        {
            "ID": 161147,
            "ConnectionTypeID": 25,
            "StatusTypeID": 50,
            "LevelID": 2,
            "Amps": 32,
            "Voltage": 400,
            "PowerKW": 22,
            "CurrentTypeID": 20,
            "Quantity": 2
        }
    ],
    "NumberOfPoints": 2,
    "StatusTypeID": 50,
    "DateLastStatusUpdate": "2019-05-20T17:42:00Z",
    "DataQualityLevel": 1,
    "DateCreated": "2019-01-08T10:54:00Z",
    "SubmissionStatusTypeID": 200
}