{
    "UserComments": [
        {
            "ID": 20365,
            "ChargePointID": 112375,
            "CommentTypeID": 10,
            "UserName": "ForumElettrico.it",
            "RelatedURL": "https://www.forumelettrico.it/forum/colonnina-22-kw-estra-san-severino-marche-t3907.html",
            "DateCreated": "2018-10-26T07:22:36.99Z",
            "User": {
                "ID": 11749,
                "Username": "ForumElettrico.it"
            },
            "CheckinStatusTypeID": 10
        }
    ],
    "MediaItems": [
        {
            "ID": 16901,
            "ChargePointID": 112375,
            "ItemURL": "https://s3-ap-southeast-2.amazonaws.com/openchargemap/images/IT/OCM112375/OCM-112375.orig.2018102607225500.jpg",
            "ItemThumbnailURL": "https://s3-ap-southeast-2.amazonaws.com/openchargemap/images/IT/OCM112375/OCM-112375.thmb.2018102607225500.jpg",
            "Comment": "",
            "IsEnabled": true,
            "IsVideo": false,
            "IsFeaturedItem": false,
            "IsExternalResource": false,
            "User": {
                "ID": 11749,
                "Username": "ForumElettrico.it"
            },
            "DateCreated": "2018-10-26T07:23:00Z"
        },
        {
            "ID": 16902,
            "ChargePointID": 112375,
            "ItemURL": "https://s3-ap-southeast-2.amazonaws.com/openchargemap/images/IT/OCM112375/OCM-112375.orig.2018102607230119.jpg",
            "ItemThumbnailURL": "https://s3-ap-southeast-2.amazonaws.com/openchargemap/images/IT/OCM112375/OCM-112375.thmb.2018102607230119.jpg",
            "Comment": "",
            "IsEnabled": true,
            "IsVideo": false,
            "IsFeaturedItem": false,
            "IsExternalResource": false,
            "User": {
                "ID": 11749,
                "Username": "ForumElettrico.it"
            },
            "DateCreated": "2018-10-26T07:23:00Z"
        }
    ],
    "IsRecentlyVerified": false,
    "ID": 112375,
    "UUID": "E5638061-157C-4F66-89E6-2B0F198ABC63",
    "DataProviderID": 1,
    "OperatorID": 1,
    "UsageTypeID": 4,
    "AddressInfo": {
        "ID": 112721,
        "Title": "Estra Parcheggio San Domenico",
        "AddressLine1": "Via Gorgonero",
        "Town": "San Severino Marche",
        "StateOrProvince": "MC",
        "CountryID": 112,
        "Latitude": 43.23101,
        "Longitude": 13.177845,
        "RelatedURL": "https://www.forumelettrico.it/forum/colonnina-22-kw-estra-san-severino-marche-t3907.html",
        "DistanceUnit": 0
    },
    "Connections": [
        {
            "ID": 158057,
            "ConnectionTypeID": 25,
            "StatusTypeID": 50,
            "LevelID": 2,
            "Quantity": 1
        }
    ],
    "NumberOfPoints": 1,
    "StatusTypeID": 50,
    "DateLastStatusUpdate": "2019-10-04T08:23:00Z",
    "DataQualityLevel": 1,
    "DateCreated": "2018-10-26T07:22:00Z",
    "SubmissionStatusTypeID": 200
}