{
    "IsRecentlyVerified": false,
    "ID": 35060,
    "UUID": "2CF73459-71CB-496A-BFDD-8CA77189F94E",
    "DataProviderID": 26,
    "DataProvidersReference": "48703",
    "OperatorID": 178,
    "OperatorsReference": "EVnetNL REE582",
    "UsageCost": "0.00 jaarabonnement",
    "AddressInfo": {
        "ID": 35406,
        "Title": "Rosendaalsestraat 436",
        "AddressLine1": "Rosendaalsestraat 436",
        "Town": "Arnhem",
        "Postcode": "6824 CT",
        "CountryID": 159,
        "Latitude": 51.990407,
        "Longitude": 5.92928,
        "ContactTelephone1": "0800-3522365",
        "RelatedURL": "http://www.evnet.nl",
        "DistanceUnit": 0
    },
    "Connections": [
        {
            "ID": 38571,
            "ConnectionTypeID": 25,
            "LevelID": 1,
            "PowerKW": 2.3,
            "CurrentTypeID": 10
        }
    ],
    "NumberOfPoints": 1,
    "StatusTypeID": 50,
    "DateLastStatusUpdate": "2016-06-04T02:43:00Z",
    "DataQualityLevel": 3,
    "DateCreated": "2015-01-09T06:04:00Z",
    "SubmissionStatusTypeID": 100
}