{
    "IsRecentlyVerified": false,
    "ID": 188094,
    "UUID": "DEAA526B-40DE-4D9F-9E29-BBC723AA1FAB",
    "DataProviderID": 1,
    "OperatorID": 3,
    "UsageTypeID": 1,
    "AddressInfo": {
        "ID": 188453,
        "Title": "IOM Food Park",
        "AddressLine1": "IOM Food Park",
        "Town": "Peel",
        "Postcode": "IM5 1TD",
        "CountryID": 110,
        "Latitude": 54.220379,
        "Longitude": -4.699051,
        "RelatedURL": "http://pod-point.com",
        "DistanceUnit": 0
    },
    "Connections": [
        {
            "ID": 303543,
            "ConnectionTypeID": 25,
            "Reference": "0",
            "StatusTypeID": 50,
            "LevelID": 2,
            "Amps": 32,
            "Voltage": 230,
            "PowerKW": 7,
            "CurrentTypeID": 10
        }
    ],
    "StatusTypeID": 0,
    "DateLastStatusUpdate": "2021-07-12T21:19:00Z",
    "MetadataValues": [
        {
            "ID": 20334,
            "MetadataFieldID": 4,
            "ItemValue": "Contains public sector information licensed under the Open Government Licence v2.0. http://www.nationalarchives.gov.uk/doc/open-government-licence/version/2/"
        }
    ],
    "DataQualityLevel": 3,
    "DateCreated": "2021-07-12T03:39:00Z",
    "SubmissionStatusTypeID": 100
}