{
    "IsRecentlyVerified": false,
    "ID": 94382,
    "UUID": "5148F09B-3659-46F9-9987-086F3A6D3549",
    "DataProviderID": 2,
    "DataProvidersReference": "87983",
    "OperatorID": 5,
    "UsageTypeID": 1,
    "AddressInfo": {
        "ID": 94728,
        "Title": "SECAUCUS",
        "AddressLine1": "1535 Paterson Plank Rd",
        "Town": "Secaucus",
        "StateOrProvince": "NJ",
        "Postcode": "07094",
        "CountryID": 2,
        "Latitude": 40.7990197,
        "Longitude": -74.0586448,
        "ContactTelephone1": "888-758-4389",
        "AccessComments": "24 hours daily",
        "RelatedURL": "http://www.chargepoint.com/",
        "DistanceUnit": 0
    },
    "Connections": [
        {
            "ID": 133487,
            "ConnectionTypeID": 1,
            "LevelID": 2,
            "Amps": 16,
            "Voltage": 230,
            "PowerKW": 3.7,
            "CurrentTypeID": 10,
            "Quantity": 1
        }
    ],
    "DateLastStatusUpdate": "2020-06-26T03:03:00Z",
    "DataQualityLevel": 3,
    "DateCreated": "2017-10-19T02:06:00Z",
    "SubmissionStatusTypeID": 100
}