{
    "UserComments": [
        {
            "ID": 21712,
            "ChargePointID": 133703,
            "CommentTypeID": 10,
            "UserName": "Arktal",
            "Comment": "Charged successfully on October the 6th (Type 2 plug)",
            "Rating": 4,
            "DateCreated": "2019-10-24T09:44:19.13Z",
            "User": {
                "ID": 22814,
                "Username": "Arktal"
            },
            "CheckinStatusTypeID": 10
        }
    ],
    "IsRecentlyVerified": false,
    "ID": 133703,
    "UUID": "FB333ED5-D118-416C-950E-4C1C127FE778",
    "DataProviderID": 1,
    "OperatorID": 1,
    "UsageTypeID": 1,
    "UsageCost": "0,04€/mn",
    "AddressInfo": {
        "ID": 134049,
        "Title": "Place du Pigeonnier",
        "AddressLine1": "Place du Pigeonnier",
        "Town": "Marthon",
        "StateOrProvince": "Angoulême",
        "Postcode": "16380",
        "CountryID": 80,
        "Latitude": 45.6118075578239,
        "Longitude": 0.444462739295886,
        "RelatedURL": "https://mobive.fr/fr/carte/",
        "DistanceUnit": 0
    },
    "Connections": [
        {
            "ID": 187121,
            "ConnectionTypeID": 25,
            "StatusTypeID": 50,
            "LevelID": 2,
            "Amps": 32,
            "Voltage": 400,
            "PowerKW": 22,
            "CurrentTypeID": 20,
            "Quantity": 2
        }
    ],
    "NumberOfPoints": 2,
    "StatusTypeID": 50,
    "DateLastStatusUpdate": "2019-10-25T19:15:00Z",
    "DataQualityLevel": 1,
    "DateCreated": "2019-10-24T09:36:00Z",
    "SubmissionStatusTypeID": 200
}