{
    "UserComments": [
        {
            "ID": 13778,
            "ChargePointID": 48769,
            "CommentTypeID": 50,
            "UserName": "Simon Hewison",
            "Comment": "Tesla have moved their superchargers to a bigger location on this site where they now have 7 charging bays.",
            "DateCreated": "2016-07-06T15:32:28.827Z",
            "User": {
                "ID": 4575,
                "Username": "Simon Hewison"
            },
            "CheckinStatusTypeID": 140
        },
        {
            "ID": 6030,
            "ChargePointID": 48769,
            "CommentTypeID": 10,
            "UserName": "cgiAlexis",
            "Comment": "Just finished charging a Zoe on one post and a Leaf started charging on the other post :-) ",
            "Rating": 5,
            "DateCreated": "2015-07-26T10:50:21.027Z",
            "User": {
                "ID": 4558,
                "Username": "cgiAlexis"
            },
            "CheckinStatusTypeID": 10
        },
        {
            "ID": 6012,
            "ChargePointID": 48769,
            "CommentTypeID": 10,
            "UserName": "cgiAlexis",
            "Comment": "Great location though seems to have stolen disabled spots. Great services!",
            "Rating": 5,
            "DateCreated": "2015-07-24T18:55:46.08Z",
            "User": {
                "ID": 4558,
                "Username": "cgiAlexis"
            },
            "CheckinStatusTypeID": 10
        }
    ],
    "MediaItems": [
        {
            "ID": 7785,
            "ChargePointID": 48769,
            "ItemURL": "https://s3-ap-southeast-2.amazonaws.com/openchargemap/images/GB/OCM48769/OCM-48769.orig.2016071817494575.jpg",
            "ItemThumbnailURL": "https://s3-ap-southeast-2.amazonaws.com/openchargemap/images/GB/OCM48769/OCM-48769.thmb.2016071817494575.jpg",
            "Comment": "To support this many Supercharger bays, there's a shiny new electricity substation just to serve the Tesla outlets.",
            "IsEnabled": true,
            "IsVideo": false,
            "IsFeaturedItem": false,
            "IsExternalResource": false,
            "User": {
                "ID": 4575,
                "Username": "Simon Hewison"
            },
            "DateCreated": "2016-07-18T17:50:00Z"
        },
        {
            "ID": 7784,
            "ChargePointID": 48769,
            "ItemURL": "https://s3-ap-southeast-2.amazonaws.com/openchargemap/images/GB/OCM48769/OCM-48769.orig.2016071817483450.jpg",
            "ItemThumbnailURL": "https://s3-ap-southeast-2.amazonaws.com/openchargemap/images/GB/OCM48769/OCM-48769.thmb.2016071817483450.jpg",
            "Comment": "New Tesla layout, far more outlets, further from the main services building.",
            "IsEnabled": true,
            "IsVideo": false,
            "IsFeaturedItem": false,
            "IsExternalResource": false,
            "User": {
                "ID": 4575,
                "Username": "Simon Hewison"
            },
            "DateCreated": "2016-07-18T17:49:00Z"
        }
    ],
    "IsRecentlyVerified": false,
    "ID": 48769,
    "UUID": "EF1D1E99-7BD8-40E5-BBB2-B585312E9E04",
    "DataProviderID": 1,
    "OperatorID": 23,
    "OperatorsReference": "9822",
    "UsageTypeID": 4,
    "UsageCost": "£0.24/kWh;other tariffs for older cars",
    "AddressInfo": {
        "ID": 49115,
        "Title": "South Mimms Supercharger",
        "AddressLine1": "Bignell's Corner",
        "Town": "Potters Bar",
        "Postcode": "EN6 3QQ",
        "CountryID": 1,
        "Latitude": 51.6875231393701,
        "Longitude": -0.223615765571594,
        "DistanceUnit": 0
    },
    "Connections": [
        {
            "ID": 60238,
            "ConnectionTypeID": 27,
            "StatusTypeID": 50,
            "LevelID": 3,
            "PowerKW": 120,
            "CurrentTypeID": 30,
            "Quantity": 12
        },
        {
            "ID": 175689,
            "ConnectionTypeID": 33,
            "StatusTypeID": 50,
            "LevelID": 3,
            "PowerKW": 120,
            "CurrentTypeID": 30,
            "Quantity": 12
        }
    ],
    "NumberOfPoints": 12,
    "StatusTypeID": 50,
    "DateLastStatusUpdate": "2020-10-16T10:59:00Z",
    "DataQualityLevel": 1,
    "DateCreated": "2015-06-30T12:17:00Z",
    "SubmissionStatusTypeID": 200
}