{
    "IsRecentlyVerified": false,
    "ID": 152777,
    "UUID": "DC993DA3-FC17-4BE7-94D9-D451108CE8C6",
    "DataProviderID": 28,
    "DataProvidersReference": "FRS1826901",
    "UsageTypeID": 5,
    "AddressInfo": {
        "ID": 153130,
        "Title": "Vailly sur Sauldre",
        "AddressLine1": "Route de Chevaise - 18260 VAILLY SUR SAULDRE",
        "CountryID": 80,
        "Latitude": 47.4583069,
        "Longitude": 2.6508327,
        "AccessComments": "24h/24h",
        "DistanceUnit": 0
    },
    "Connections": [
        {
            "ID": 214025,
            "ConnectionTypeID": 26,
            "StatusTypeID": 50,
            "LevelID": 2,
            "PowerKW": 18
        },
        {
            "ID": 247236,
            "ConnectionTypeID": 26,
            "StatusTypeID": 50,
            "LevelID": 2,
            "PowerKW": 18
        }
    ],
    "GeneralComments": "Borne en service",
    "StatusTypeID": 50,
    "DateLastStatusUpdate": "2020-08-27T05:13:00Z",
    "DataQualityLevel": 2,
    "DateCreated": "2020-03-15T10:54:00Z",
    "SubmissionStatusTypeID": 100
}