{
    "IsRecentlyVerified": false,
    "ID": 36660,
    "UUID": "5335F0D0-239D-425C-A01D-F3349BC2D6E6",
    "DataProviderID": 26,
    "DataProvidersReference": "47341",
    "OperatorID": 178,
    "OperatorsReference": "EVnetNL AL497",
    "UsageCost": "0.00 jaarabonnement",
    "AddressInfo": {
        "ID": 37006,
        "Title": "Nijverheidstraat",
        "AddressLine1": "Nijverheidstraat",
        "Town": "Enschede",
        "Postcode": "7511 JW",
        "CountryID": 159,
        "Latitude": 52.219081,
        "Longitude": 6.891636,
        "ContactTelephone1": "0800-3522365",
        "RelatedURL": "http://www.evnet.nl",
        "DistanceUnit": 0
    },
    "Connections": [
        {
            "ID": 40171,
            "ConnectionTypeID": 25,
            "LevelID": 2,
            "PowerKW": 11,
            "CurrentTypeID": 10
        }
    ],
    "NumberOfPoints": 2,
    "StatusTypeID": 50,
    "DateLastStatusUpdate": "2016-06-04T02:51:00Z",
    "DataQualityLevel": 3,
    "DateCreated": "2015-01-09T06:07:00Z",
    "SubmissionStatusTypeID": 100
}