{
    "IsRecentlyVerified": false,
    "ID": 72128,
    "UUID": "9096AE39-3812-4F22-A56D-F72E0FD7D09C",
    "DataProviderID": 2,
    "DataProvidersReference": "78365",
    "UsageTypeID": 1,
    "AddressInfo": {
        "ID": 72474,
        "Title": "Tampa International Airport - Economy Parking Lot",
        "AddressLine1": "5601 Airport Service Rd",
        "Town": "Tampa",
        "StateOrProvince": "FL",
        "Postcode": "33607",
        "CountryID": 2,
        "Latitude": 27.966583,
        "Longitude": -82.5359,
        "ContactTelephone1": "813-870-8790",
        "AccessComments": "24 hours daily; economy parking rates apply",
        "RelatedURL": "",
        "DistanceUnit": 0
    },
    "Connections": [
        {
            "ID": 103424,
            "ConnectionTypeID": 0,
            "LevelID": 1,
            "Amps": 16,
            "Voltage": 120,
            "PowerKW": 1.9,
            "CurrentTypeID": 10,
            "Quantity": 4
        }
    ],
    "DateLastStatusUpdate": "2020-06-26T02:52:00Z",
    "DataQualityLevel": 3,
    "DateCreated": "2016-10-09T02:44:00Z",
    "SubmissionStatusTypeID": 100
}