{
    "IsRecentlyVerified": false,
    "ID": 27093,
    "UUID": "B0139D1B-9682-4A11-ACFB-1CDAB714DE40",
    "DataProviderID": 2,
    "DataProvidersReference": "53405",
    "OperatorID": 5,
    "UsageTypeID": 1,
    "AddressInfo": {
        "ID": 27439,
        "Title": "SB MTD",
        "AddressLine1": "550 Olive St",
        "Town": "Santa Barbara",
        "StateOrProvince": "CA",
        "Postcode": "93101",
        "CountryID": 2,
        "Latitude": 34.4226904,
        "Longitude": -119.6902418,
        "ContactTelephone1": "888-758-4389",
        "AccessComments": "24 hours daily",
        "RelatedURL": "http://www.chargepoint.com/",
        "DistanceUnit": 0
    },
    "Connections": [
        {
            "ID": 29672,
            "ConnectionTypeID": 1,
            "LevelID": 2,
            "Amps": 16,
            "Voltage": 230,
            "PowerKW": 3,
            "CurrentTypeID": 10,
            "Quantity": 1
        },
        {
            "ID": 29673,
            "ConnectionTypeID": 1,
            "LevelID": 2,
            "Amps": 16,
            "Voltage": 230,
            "PowerKW": 3,
            "CurrentTypeID": 10,
            "Quantity": 1
        }
    ],
    "DateLastStatusUpdate": "2019-04-06T04:02:00Z",
    "DataQualityLevel": 3,
    "DateCreated": "2014-11-28T03:37:00Z",
    "SubmissionStatusTypeID": 100
}