{
    "UserComments": [
        {
            "ID": 24684,
            "ChargePointID": 20808,
            "CommentTypeID": 10,
            "UserName": "Simon Hewison",
            "Comment": "queueing for only charge point",
            "DateCreated": "2021-08-01T15:52:40.637Z",
            "User": {
                "ID": 4575,
                "Username": "Simon Hewison"
            },
            "CheckinStatusTypeID": 100,
            "IsActionedByEditor": false
        },
        {
            "ID": 21108,
            "ChargePointID": 20808,
            "CommentTypeID": 10,
            "UserName": "Uncle Dave",
            "Comment": "",
            "Rating": 5,
            "DateCreated": "2019-06-13T19:34:44.793Z",
            "User": {
                "ID": 11911,
                "Username": "Uncle Dave"
            },
            "CheckinStatusTypeID": 10
        },
        {
            "ID": 9510,
            "ChargePointID": 20808,
            "CommentTypeID": 10,
            "UserName": "Paul Bedworth",
            "Comment": "Charged PHEV no problems, but there is a strange clucking/clicking noise from the unit when charging. It was also in fault when I arrived which obviously reset when I used it.",
            "Rating": 4,
            "DateCreated": "2016-01-13T08:57:45.113Z",
            "User": {
                "ID": 6335,
                "Username": "Paul Bedworth"
            },
            "CheckinStatusTypeID": 10
        },
        {
            "ID": 6494,
            "ChargePointID": 20808,
            "CommentTypeID": 10,
            "UserName": "Paul Bedworth",
            "Comment": "PHEV charged fine 😁",
            "Rating": 5,
            "DateCreated": "2015-09-16T07:22:20Z",
            "User": {
                "ID": 6335,
                "Username": "Paul Bedworth"
            },
            "CheckinStatusTypeID": 10
        },
        {
            "ID": 4876,
            "ChargePointID": 20808,
            "CommentTypeID": 10,
            "UserName": "Flash",
            "Comment": "Charged the Leaf just fine.",
            "Rating": 5,
            "DateCreated": "2015-07-10T16:20:20.377Z",
            "User": {
                "ID": 5042,
                "Username": "Flash"
            },
            "CheckinStatusTypeID": 10
        },
        {
            "ID": 4565,
            "ChargePointID": 20808,
            "CommentTypeID": 10,
            "UserName": "jimkat77",
            "Comment": "Chademo working fine!",
            "Rating": 5,
            "DateCreated": "2015-05-26T13:34:13.13Z",
            "User": {
                "ID": 4730,
                "Username": "jimkat77"
            },
            "CheckinStatusTypeID": 10
        },
        {
            "ID": 3811,
            "ChargePointID": 20808,
            "CommentTypeID": 10,
            "UserName": "marksbrady1",
            "Comment": "Charged successfully.  ",
            "Rating": 5,
            "DateCreated": "2015-02-18T10:43:01.5Z",
            "User": {
                "ID": 1742,
                "Username": "marksbrady1"
            },
            "CheckinStatusTypeID": 10
        },
        {
            "ID": 3788,
            "ChargePointID": 20808,
            "CommentTypeID": 10,
            "UserName": "",
            "Comment": "",
            "DateCreated": "2015-02-16T10:40:59.617Z",
            "CheckinStatusTypeID": 10
        },
        {
            "ID": 988,
            "ChargePointID": 20808,
            "CommentTypeID": 10,
            "UserName": "chris",
            "Comment": "No problems, all good.",
            "Rating": 5,
            "DateCreated": "2014-07-11T07:15:24.813Z",
            "User": {
                "ID": 1993,
                "Username": "chris"
            },
            "CheckinStatusTypeID": 10
        },
        {
            "ID": 864,
            "ChargePointID": 20808,
            "CommentTypeID": 10,
            "UserName": "christadm2",
            "Comment": "All good.",
            "Rating": 5,
            "DateCreated": "2014-06-01T11:53:00.31Z",
            "User": {
                "ID": 1842,
                "Username": "christadm2"
            },
            "CheckinStatusTypeID": 10
        }
    ],
    "IsRecentlyVerified": false,
    "ID": 20808,
    "UUID": "CB725737-36D1-4E7F-9F86-0FA2017BE788",
    "DataProviderID": 1,
    "OperatorID": 24,
    "OperatorsReference": "0064",
    "UsageTypeID": 5,
    "UsageCost": "£0.30/kWh",
    "AddressInfo": {
        "ID": 21153,
        "Title": "Frankley Moto M5 (S) Services",
        "AddressLine1": "M5 Junction 3/4",
        "AddressLine2": "Illey Lane",
        "Town": "Birmingham",
        "StateOrProvince": "Worcestershire",
        "Postcode": "B32 4AR",
        "CountryID": 1,
        "Latitude": 52.429092,
        "Longitude": -2.017065,
        "AccessComments": "The charger is at the front of the building to the left of the entrance.",
        "DistanceUnit": 0
    },
    "Connections": [
        {
            "ID": 22652,
            "ConnectionTypeID": 2,
            "Reference": "0064",
            "StatusTypeID": 50,
            "LevelID": 3,
            "Amps": 200,
            "Voltage": 500,
            "PowerKW": 100,
            "CurrentTypeID": 30,
            "Quantity": 1
        },
        {
            "ID": 22653,
            "ConnectionTypeID": 33,
            "Reference": "0064",
            "StatusTypeID": 50,
            "LevelID": 3,
            "Amps": 200,
            "Voltage": 920,
            "PowerKW": 120,
            "CurrentTypeID": 30,
            "Quantity": 1
        }
    ],
    "NumberOfPoints": 2,
    "StatusTypeID": 50,
    "DateLastStatusUpdate": "2021-08-01T15:53:00Z",
    "DataQualityLevel": 1,
    "DateCreated": "2014-01-13T11:21:00Z",
    "SubmissionStatusTypeID": 200
}