{
    "IsRecentlyVerified": false,
    "ID": 18879,
    "UUID": "1A8BC708-34E9-47CB-8DD7-1BCC78AC0510",
    "DataProviderID": 2,
    "DataProvidersReference": "52600",
    "UsageTypeID": 7,
    "AddressInfo": {
        "ID": 19224,
        "Title": "Kidd Ford",
        "AddressLine1": "5917 Manchester Hwy",
        "Town": "Morrison",
        "StateOrProvince": "TN",
        "Postcode": "37357",
        "CountryID": 2,
        "Latitude": 35.632542,
        "Longitude": -85.852605,
        "ContactTelephone1": "931-668-2177",
        "AccessComments": "Dealership business hours",
        "RelatedURL": "",
        "DistanceUnit": 0
    },
    "Connections": [
        {
            "ID": 19118,
            "ConnectionTypeID": 1,
            "LevelID": 2,
            "Amps": 16,
            "Voltage": 230,
            "PowerKW": 3,
            "CurrentTypeID": 10,
            "Quantity": 1
        },
        {
            "ID": 22315,
            "ConnectionTypeID": 1,
            "LevelID": 2,
            "Quantity": 2
        }
    ],
    "DateLastStatusUpdate": "2019-04-06T04:02:00Z",
    "DataQualityLevel": 3,
    "DateCreated": "2013-08-25T04:20:00Z",
    "SubmissionStatusTypeID": 200
}