{
    "IsRecentlyVerified": false,
    "ID": 168896,
    "UUID": "EF4B49C5-C02E-4706-A6E8-E0F9E74DC0D2",
    "DataProviderID": 1,
    "OperatorID": 3296,
    "UsageTypeID": 5,
    "UsageCost": "£0.40/kWh",
    "AddressInfo": {
        "ID": 169255,
        "Title": "Starbucks Clough Road",
        "AddressLine1": "Clough Road",
        "Town": "Kingston upon Hull",
        "StateOrProvince": "England",
        "Postcode": "HU5 7PY",
        "CountryID": 1,
        "Latitude": 53.76778991166273,
        "Longitude": -0.33560012484826984,
        "DistanceUnit": 0
    },
    "Connections": [
        {
            "ID": 256801,
            "ConnectionTypeID": 2,
            "StatusTypeID": 50,
            "LevelID": 3,
            "PowerKW": 50,
            "CurrentTypeID": 30,
            "Quantity": 2
        },
        {
            "ID": 256802,
            "ConnectionTypeID": 33,
            "StatusTypeID": 50,
            "LevelID": 3,
            "PowerKW": 50,
            "CurrentTypeID": 30,
            "Quantity": 2
        }
    ],
    "NumberOfPoints": 2,
    "StatusTypeID": 50,
    "DateLastStatusUpdate": "2021-05-26T10:03:00Z",
    "DataQualityLevel": 1,
    "DateCreated": "2020-10-07T06:43:00Z",
    "SubmissionStatusTypeID": 200
}