{
    "IsRecentlyVerified": false,
    "ID": 29166,
    "UUID": "7D85A31F-9E1A-4614-AFC4-1F2F4E4B51A3",
    "DataProviderID": 2,
    "DataProvidersReference": "60506",
    "UsageTypeID": 1,
    "AddressInfo": {
        "ID": 29512,
        "Title": "Kwik Trip #792",
        "AddressLine1": "1500 Mill St",
        "Town": "New London",
        "StateOrProvince": "WI",
        "Postcode": "54961",
        "CountryID": 2,
        "Latitude": 44.380718,
        "Longitude": -88.731542,
        "ContactTelephone1": "920-982-7530",
        "AccessComments": "24 hours daily",
        "RelatedURL": "",
        "DistanceUnit": 0
    },
    "Connections": [
        {
            "ID": 32050,
            "ConnectionTypeID": 9,
            "LevelID": 1,
            "Amps": 16,
            "Voltage": 120,
            "PowerKW": 1.9,
            "CurrentTypeID": 10,
            "Quantity": 1
        }
    ],
    "DateLastStatusUpdate": "2020-06-26T03:08:00Z",
    "DataQualityLevel": 3,
    "DateCreated": "2014-11-28T03:39:00Z",
    "SubmissionStatusTypeID": 100
}