{
    "IsRecentlyVerified": false,
    "ID": 131530,
    "UUID": "735753DB-F52F-42E2-B06D-C5CF93A3E776",
    "DataProviderID": 1,
    "OperatorID": 3,
    "OperatorsReference": "PG-70017,PG-83522",
    "UsageTypeID": 4,
    "UsageCost": "Free",
    "AddressInfo": {
        "ID": 131876,
        "Title": "Tesco Extra-Portsmouth",
        "AddressLine1": "Clement Attlee Way",
        "Town": "Portsmouth",
        "Postcode": "PO6 4SR",
        "CountryID": 1,
        "Latitude": 50.845449,
        "Longitude": -1.09538,
        "DistanceUnit": 0
    },
    "Connections": [
        {
            "ID": 184095,
            "ConnectionTypeID": 25,
            "StatusTypeID": 50,
            "LevelID": 2,
            "Amps": 32,
            "Voltage": 230,
            "PowerKW": 7,
            "CurrentTypeID": 10,
            "Quantity": 4
        }
    ],
    "NumberOfPoints": 4,
    "GeneralComments": "This is an open charge unit installed at the Tesco Extra super store at Clement Attlee Way, Portsmouth",
    "StatusTypeID": 50,
    "DateLastStatusUpdate": "2019-09-09T12:24:00Z",
    "DataQualityLevel": 1,
    "DateCreated": "2019-09-09T08:05:00Z",
    "SubmissionStatusTypeID": 200
}