{
    "IsRecentlyVerified": false,
    "ID": 144540,
    "UUID": "8B0C1AC2-CDA7-4A96-B744-D7466511BE37",
    "DataProviderID": 2,
    "DataProvidersReference": "81378",
    "OperatorID": 5,
    "UsageTypeID": 1,
    "AddressInfo": {
        "ID": 144892,
        "Title": "LCT",
        "AddressLine1": "825 NE Multnomah St",
        "Town": "Portland",
        "StateOrProvince": "OR",
        "Postcode": "97232",
        "CountryID": 2,
        "Latitude": 45.5325034,
        "Longitude": -122.6576193,
        "ContactTelephone1": "888-758-4389",
        "AccessComments": "24 hours daily",
        "RelatedURL": "http://www.chargepoint.com/",
        "DistanceUnit": 0
    },
    "Connections": [
        {
            "ID": 201048,
            "ConnectionTypeID": 1,
            "LevelID": 2,
            "Amps": 16,
            "Voltage": 230,
            "PowerKW": 3.7,
            "CurrentTypeID": 10,
            "Quantity": 2
        }
    ],
    "StatusTypeID": 50,
    "DateLastStatusUpdate": "2020-06-26T03:09:00Z",
    "DataQualityLevel": 3,
    "DateCreated": "2019-12-24T09:23:00Z",
    "SubmissionStatusTypeID": 100
}