{
    "IsRecentlyVerified": false,
    "ID": 17611,
    "UUID": "49DBC057-9D67-4920-8CED-72A0D6DD908E",
    "DataProviderID": 22,
    "DataProvidersReference": "B91D12ADF38B1A2C446579B64E7C5A7C",
    "AddressInfo": {
        "ID": 17956,
        "Title": "三菱サテライトショップとおの",
        "AddressLine1": "岩手県遠野市松崎町白岩11-2-1",
        "CountryID": 114,
        "Latitude": 39.33958871,
        "Longitude": 141.5363057,
        "ContactTelephone1": "0198-62-9580",
        "DistanceUnit": 0
    },
    "Connections": [
        {
            "ID": 17852,
            "ConnectionTypeID": 2,
            "LevelID": 2,
            "Amps": 100,
            "Voltage": 480,
            "PowerKW": 48,
            "Quantity": 1
        }
    ],
    "DateLastStatusUpdate": "2013-06-29T09:00:00Z",
    "DataQualityLevel": 2,
    "DateCreated": "2013-06-29T09:00:00Z",
    "SubmissionStatusTypeID": 200
}