{
    "IsRecentlyVerified": false,
    "ID": 15845,
    "UUID": "4B394DB6-998E-4D15-91DB-CE39A627CECE",
    "DataProviderID": 1,
    "OperatorID": 45,
    "OperatorsReference": "12152894W",
    "UsageTypeID": 6,
    "AddressInfo": {
        "ID": 16190,
        "Title": "Southview Park Hotel",
        "AddressLine1": "Burgh Road",
        "Town": "Skegness",
        "Postcode": "PE25 2LA",
        "CountryID": 1,
        "Latitude": 53.156848,
        "Longitude": 0.307362,
        "ContactTelephone1": "01754 896060",
        "AccessComments": "At rear of building in main car park",
        "RelatedURL": "http://www.southviewparkhotel.co.uk/",
        "DistanceUnit": 0
    },
    "Connections": [
        {
            "ID": 14198,
            "ConnectionTypeID": 25,
            "StatusTypeID": 100,
            "LevelID": 2,
            "Amps": 16,
            "PowerKW": 3,
            "CurrentTypeID": 10,
            "Quantity": 1
        }
    ],
    "NumberOfPoints": 1,
    "GeneralComments": "One charging point, one socket. Fitted under Midlands PiP. Users report requests to pay £5 per hour to charge.",
    "StatusTypeID": 100,
    "DateLastStatusUpdate": "2019-07-17T10:21:00Z",
    "DataQualityLevel": 3,
    "DateCreated": "2013-01-31T04:46:00Z",
    "SubmissionStatusTypeID": 200
}