{
    "IsRecentlyVerified": false,
    "ID": 188414,
    "UUID": "AC246676-E375-4DDA-9AB0-2E6FDE777F45",
    "DataProviderID": 1,
    "OperatorID": 1,
    "UsageTypeID": 1,
    "AddressInfo": {
        "ID": 188773,
        "Title": "vulkanija experience center",
        "AddressLine1": "grad 174",
        "Town": "grad",
        "Postcode": "9264",
        "CountryID": 205,
        "Latitude": 46.80294538746037,
        "Longitude": 16.092663023858336,
        "DistanceUnit": 0
    },
    "Connections": [
        {
            "ID": 304229,
            "ConnectionTypeID": 25,
            "StatusTypeID": 50,
            "LevelID": 2,
            "PowerKW": 11,
            "Quantity": 2
        }
    ],
    "NumberOfPoints": 2,
    "StatusTypeID": 50,
    "DateLastStatusUpdate": "2021-07-24T21:10:00Z",
    "DataQualityLevel": 1,
    "DateCreated": "2021-07-23T12:46:00Z",
    "SubmissionStatusTypeID": 200
}