{
    "IsRecentlyVerified": false,
    "ID": 137942,
    "UUID": "B334B2F5-549B-4EAB-8B11-2132AEEE5CF4",
    "DataProviderID": 2,
    "DataProvidersReference": "95646",
    "OperatorID": 9,
    "UsageTypeID": 1,
    "AddressInfo": {
        "ID": 138291,
        "Title": "City of Encinitas - Lot B SW Corner Vulcan and E St",
        "AddressLine1": "600 S Vulcan Ave",
        "Town": "Encinitas",
        "StateOrProvince": "CA",
        "Postcode": "92024",
        "CountryID": 2,
        "Latitude": 33.0448057,
        "Longitude": -117.2924134,
        "ContactTelephone1": "888-998-2546",
        "AccessComments": "MON: 24 hours | TUE: 24 hours | WED: 24 hours | THU: 24 hours | FRI: 24 hours | SAT: 24 hours | SUN: 24 hours",
        "RelatedURL": "http://www.blinkcharging.com/",
        "DistanceUnit": 0
    },
    "Connections": [
        {
            "ID": 192970,
            "ConnectionTypeID": 1,
            "LevelID": 2,
            "Amps": 16,
            "Voltage": 230,
            "PowerKW": 3,
            "CurrentTypeID": 10,
            "Quantity": 2
        }
    ],
    "StatusTypeID": 50,
    "DateLastStatusUpdate": "2019-12-24T09:06:00Z",
    "DataQualityLevel": 3,
    "DateCreated": "2019-12-24T09:06:00Z",
    "SubmissionStatusTypeID": 100
}