{
    "IsRecentlyVerified": false,
    "ID": 88672,
    "UUID": "9F29CB73-CCD4-42DB-ACE2-7BED43ED59DA",
    "DataProviderID": 1,
    "OperatorID": 3,
    "OperatorsReference": "PG-81110",
    "UsageTypeID": 6,
    "UsageCost": "Free",
    "AddressInfo": {
        "ID": 89018,
        "Title": "Emg Spalding-Hyundai",
        "AddressLine1": "Glendum Close",
        "Town": "Spalding",
        "Postcode": "PE11 3DQ",
        "CountryID": 1,
        "Latitude": 52.811121,
        "Longitude": -0.132247,
        "DistanceUnit": 0
    },
    "Connections": [
        {
            "ID": 125767,
            "ConnectionTypeID": 25,
            "StatusTypeID": 50,
            "LevelID": 2,
            "Amps": 32,
            "Voltage": 230,
            "PowerKW": 7,
            "CurrentTypeID": 10,
            "Quantity": 2
        }
    ],
    "NumberOfPoints": 3,
    "GeneralComments": "This is an open charge unit installed at the EMG Hyundai dealership in Wardentree Lane, PinchBeck, Spalding",
    "StatusTypeID": 50,
    "DateLastStatusUpdate": "2017-12-20T11:50:00Z",
    "DataQualityLevel": 1,
    "DateCreated": "2017-06-07T18:21:00Z",
    "SubmissionStatusTypeID": 200
}