{
    "MediaItems": [
        {
            "ID": 23315,
            "ChargePointID": 126151,
            "ItemURL": "https://s3-ap-southeast-2.amazonaws.com/openchargemap/images/DE/OCM126151/OCM-126151.orig.2020072912474683.jpg",
            "ItemThumbnailURL": "https://s3-ap-southeast-2.amazonaws.com/openchargemap/images/DE/OCM126151/OCM-126151.thmb.2020072912474683.jpg",
            "Comment": "",
            "IsEnabled": true,
            "IsVideo": false,
            "IsFeaturedItem": false,
            "IsExternalResource": false,
            "User": {
                "ID": 19398,
                "Username": "EWP"
            },
            "DateCreated": "2020-07-29T12:48:00Z"
        },
        {
            "ID": 23313,
            "ChargePointID": 126151,
            "ItemURL": "https://s3-ap-southeast-2.amazonaws.com/openchargemap/images/DE/OCM126151/OCM-126151.orig.2020072912470724.jpg",
            "ItemThumbnailURL": "https://s3-ap-southeast-2.amazonaws.com/openchargemap/images/DE/OCM126151/OCM-126151.thmb.2020072912470724.jpg",
            "Comment": "",
            "IsEnabled": true,
            "IsVideo": false,
            "IsFeaturedItem": false,
            "IsExternalResource": false,
            "User": {
                "ID": 19398,
                "Username": "EWP"
            },
            "DateCreated": "2020-07-29T12:47:00Z"
        },
        {
            "ID": 23314,
            "ChargePointID": 126151,
            "ItemURL": "https://s3-ap-southeast-2.amazonaws.com/openchargemap/images/DE/OCM126151/OCM-126151.orig.2020072912472321.jpg",
            "ItemThumbnailURL": "https://s3-ap-southeast-2.amazonaws.com/openchargemap/images/DE/OCM126151/OCM-126151.thmb.2020072912472321.jpg",
            "Comment": "",
            "IsEnabled": true,
            "IsVideo": false,
            "IsFeaturedItem": false,
            "IsExternalResource": false,
            "User": {
                "ID": 19398,
                "Username": "EWP"
            },
            "DateCreated": "2020-07-29T12:47:00Z"
        }
    ],
    "IsRecentlyVerified": false,
    "ID": 126151,
    "UUID": "EC64EBC0-4046-4029-BB89-AEE443396E3D",
    "DataProviderID": 1,
    "OperatorID": 3325,
    "UsageTypeID": 1,
    "AddressInfo": {
        "ID": 126497,
        "Title": "Dr.-Rudolf-Tschäpe-Platz (ID 7266)",
        "AddressLine1": "Dr.-Rudolf-Tschäpe-Platz",
        "Town": "Potsdam",
        "StateOrProvince": "Brandenburg",
        "Postcode": "14473",
        "CountryID": 87,
        "Latitude": 52.3961163156026,
        "Longitude": 13.0358130815536,
        "ContactTelephone1": "+49 331 661 3100",
        "AccessComments": "Dr.-Rudolf-Tschäpe-Platz",
        "RelatedURL": "https://www.swp-potsdam.de/de/energie/elektromobilität/",
        "DistanceUnit": 0
    },
    "Connections": [
        {
            "ID": 176799,
            "ConnectionTypeID": 25,
            "StatusTypeID": 30,
            "LevelID": 2,
            "Amps": 32,
            "Voltage": 400,
            "PowerKW": 22,
            "CurrentTypeID": 20,
            "Quantity": 2
        }
    ],
    "NumberOfPoints": 2,
    "GeneralComments": "Ladepunkte: 2 x 22 kW, Typ 2zwei Parkplätze Zugangs-/Bezahlmodus: App und e-Roaming RFID-Karten (z.B. Plugsurfing, The New Motion)Betreiber: EWPKontakt im Störungsfall: +49 331 661 3100",
    "StatusTypeID": 50,
    "DateLastStatusUpdate": "2021-08-25T13:08:00Z",
    "DataQualityLevel": 1,
    "DateCreated": "2019-05-13T12:23:00Z",
    "SubmissionStatusTypeID": 200
}