{
    "IsRecentlyVerified": false,
    "ID": 141042,
    "UUID": "9A1FEB52-5250-40B3-A97C-64B44F2BA11F",
    "DataProviderID": 2,
    "DataProvidersReference": "146785",
    "OperatorID": 9,
    "UsageTypeID": 1,
    "AddressInfo": {
        "ID": 141394,
        "Title": "EdgeWater Apartments",
        "AddressLine1": "2105 Carion Ct.",
        "Town": "Pittsburg",
        "StateOrProvince": "CA",
        "Postcode": "94565",
        "CountryID": 2,
        "Latitude": 38.014467,
        "Longitude": -121.869583,
        "ContactTelephone1": "888-998-2546",
        "AccessComments": "MON: 24 hours | TUE: 24 hours | WED: 24 hours | THU: 24 hours | FRI: 24 hours | SAT: 24 hours | SUN: 24 hours",
        "RelatedURL": "http://www.blinkcharging.com/",
        "DistanceUnit": 0
    },
    "Connections": [
        {
            "ID": 196850,
            "ConnectionTypeID": 1,
            "LevelID": 2,
            "Amps": 16,
            "Voltage": 230,
            "PowerKW": 3.7,
            "CurrentTypeID": 10,
            "Quantity": 4
        }
    ],
    "StatusTypeID": 50,
    "DateLastStatusUpdate": "2020-06-26T02:59:00Z",
    "DataQualityLevel": 3,
    "DateCreated": "2019-12-24T09:14:00Z",
    "SubmissionStatusTypeID": 100
}