{
    "IsRecentlyVerified": false,
    "ID": 56805,
    "UUID": "F787419E-28F0-4378-A196-9CFA5269BCF2",
    "DataProviderID": 1,
    "OperatorID": 80,
    "UsageTypeID": 4,
    "UsageCost": "0,45 €/kW",
    "AddressInfo": {
        "ID": 57151,
        "Title": "Palasport Barton | EnelX",
        "AddressLine1": "Viale Pietro Conti",
        "AddressLine2": "Pian di Massiano",
        "Town": "Perugia",
        "StateOrProvince": "PG",
        "Postcode": "06128",
        "CountryID": 112,
        "Latitude": 43.11020599118791,
        "Longitude": 12.358606625278298,
        "RelatedURL": "https://www.enelx.com/it/it/emobility",
        "DistanceUnit": 0
    },
    "Connections": [
        {
            "ID": 71668,
            "ConnectionTypeID": 25,
            "StatusTypeID": 50,
            "LevelID": 2,
            "Amps": 32,
            "Voltage": 400,
            "PowerKW": 22,
            "CurrentTypeID": 20,
            "Quantity": 1
        },
        {
            "ID": 71669,
            "ConnectionTypeID": 36,
            "StatusTypeID": 50,
            "LevelID": 2,
            "Amps": 16,
            "Voltage": 240,
            "PowerKW": 3.7,
            "CurrentTypeID": 10,
            "Quantity": 1
        }
    ],
    "NumberOfPoints": 1,
    "StatusTypeID": 50,
    "DateLastStatusUpdate": "2019-08-06T14:17:00Z",
    "DataQualityLevel": 1,
    "DateCreated": "2015-11-10T15:54:00Z",
    "SubmissionStatusTypeID": 200
}