{
    "IsRecentlyVerified": false,
    "ID": 22644,
    "UUID": "444CD11C-BF4D-4465-95F5-065A162057E3",
    "DataProviderID": 1,
    "OperatorID": 20,
    "OperatorsReference": "60216,60217",
    "UsageTypeID": 4,
    "UsageCost": "Free",
    "AddressInfo": {
        "ID": 22989,
        "Title": "Leigh Town Centre",
        "AddressLine1": "Market Street",
        "AddressLine2": "Leigh",
        "Town": "Wigan",
        "Postcode": "WN7 1DY",
        "CountryID": 1,
        "Latitude": 53.49758931369001,
        "Longitude": -2.520668029402797,
        "DistanceUnit": 0
    },
    "Connections": [
        {
            "ID": 24325,
            "ConnectionTypeID": 25,
            "StatusTypeID": 50,
            "LevelID": 2,
            "Amps": 32,
            "Voltage": 230,
            "PowerKW": 7,
            "CurrentTypeID": 10,
            "Quantity": 2
        }
    ],
    "NumberOfPoints": 2,
    "StatusTypeID": 50,
    "DateLastStatusUpdate": "2018-11-18T12:46:00Z",
    "MetadataValues": [
        {
            "ID": 631,
            "MetadataFieldID": 4,
            "ItemValue": "Contains public sector information licensed under the Open Government Licence v2.0. http://www.nationalarchives.gov.uk/doc/open-government-licence/version/2/"
        }
    ],
    "DataQualityLevel": 3,
    "DateCreated": "2014-03-22T08:41:00Z",
    "SubmissionStatusTypeID": 100
}