{
    "IsRecentlyVerified": false,
    "ID": 152569,
    "UUID": "060CFD24-75DE-4267-97A1-9DD297867AFC",
    "DataProviderID": 28,
    "DataProvidersReference": "FR*S41*P41135-38",
    "OperatorID": 136,
    "UsageTypeID": 5,
    "AddressInfo": {
        "ID": 152922,
        "Title": "Mennetou-sur-Cher - 2925",
        "AddressLine1": "Place du 11 Novembre - 41320 Mennetou-sur-Cher",
        "CountryID": 80,
        "Latitude": 47.268444,
        "Longitude": 1.865459,
        "AccessComments": "24/24 7/7",
        "DistanceUnit": 0
    },
    "Connections": [
        {
            "ID": 213633,
            "ConnectionTypeID": 28,
            "StatusTypeID": 50,
            "LevelID": 2,
            "PowerKW": 18,
            "CurrentTypeID": 10
        },
        {
            "ID": 213634,
            "ConnectionTypeID": 25,
            "StatusTypeID": 50,
            "LevelID": 2,
            "PowerKW": 18,
            "CurrentTypeID": 20
        },
        {
            "ID": 246683,
            "ConnectionTypeID": 28,
            "StatusTypeID": 50,
            "LevelID": 2,
            "PowerKW": 18,
            "CurrentTypeID": 10
        },
        {
            "ID": 246684,
            "ConnectionTypeID": 25,
            "StatusTypeID": 50,
            "LevelID": 2,
            "PowerKW": 18,
            "CurrentTypeID": 20
        },
        {
            "ID": 246685,
            "ConnectionTypeID": 28,
            "StatusTypeID": 50,
            "LevelID": 2,
            "PowerKW": 3.7,
            "CurrentTypeID": 10
        }
    ],
    "GeneralComments": "www.virtaev.fr",
    "StatusTypeID": 50,
    "DateLastStatusUpdate": "2020-08-27T05:13:00Z",
    "DataQualityLevel": 2,
    "DateCreated": "2020-03-15T10:53:00Z",
    "SubmissionStatusTypeID": 100
}