{
    "IsRecentlyVerified": false,
    "ID": 132617,
    "UUID": "05DEA5C5-0382-4B88-A262-53E0E6E70BAF",
    "DataProviderID": 1,
    "OperatorID": 80,
    "UsageTypeID": 4,
    "AddressInfo": {
        "ID": 132963,
        "Title": "Navaccia Porticciolo | EnelX",
        "AddressLine1": "Via Navaccia",
        "Town": "Tuoro sul Trasimeno",
        "StateOrProvince": "PG",
        "Postcode": "06069",
        "CountryID": 112,
        "Latitude": 43.19289699049935,
        "Longitude": 12.076945278029939,
        "ContactTelephone1": "800.069.850",
        "RelatedURL": "https://www.enelx.com/it/it/emobility",
        "DistanceUnit": 0
    },
    "Connections": [
        {
            "ID": 185658,
            "ConnectionTypeID": 25,
            "StatusTypeID": 150,
            "LevelID": 2,
            "Amps": 32,
            "Voltage": 400,
            "PowerKW": 22,
            "CurrentTypeID": 20,
            "Quantity": 1
        },
        {
            "ID": 185659,
            "ConnectionTypeID": 36,
            "StatusTypeID": 150,
            "LevelID": 2,
            "Amps": 16,
            "Voltage": 240,
            "PowerKW": 3.7,
            "CurrentTypeID": 10,
            "Quantity": 1
        }
    ],
    "NumberOfPoints": 2,
    "StatusTypeID": 150,
    "DateLastStatusUpdate": "2019-10-03T15:08:00Z",
    "DataQualityLevel": 1,
    "DateCreated": "2019-10-03T15:08:00Z",
    "SubmissionStatusTypeID": 200
}