{
    "IsRecentlyVerified": false,
    "ID": 154635,
    "UUID": "522CFEBD-F742-4F9A-9297-477E34E76901",
    "DataProviderID": 18,
    "DataProvidersReference": "8857cf467e38ff4f1f36ded5f0a83946",
    "OperatorID": 3392,
    "UsageTypeID": 1,
    "UsageCost": "36p per kw",
    "AddressInfo": {
        "ID": 154988,
        "Title": "Shell Barthomley",
        "AddressLine1": "A500 / M6",
        "Town": "Crewe",
        "Postcode": "CW2 5PS",
        "CountryID": 1,
        "Latitude": 53.06875,
        "Longitude": -2.335737,
        "AccessComments": "",
        "RelatedURL": "http://www.shell.co.uk/motorist/welcome-to-shell-recharge.html",
        "DistanceUnit": 0
    },
    "Connections": [
        {
            "ID": 217541,
            "ConnectionTypeID": 1036,
            "Reference": "1",
            "StatusTypeID": 50,
            "LevelID": 3,
            "Amps": 63,
            "Voltage": 400,
            "PowerKW": 43,
            "CurrentTypeID": 20
        },
        {
            "ID": 217542,
            "ConnectionTypeID": 33,
            "Reference": "2",
            "StatusTypeID": 50,
            "LevelID": 3,
            "Amps": 125,
            "Voltage": 400,
            "PowerKW": 50,
            "CurrentTypeID": 30
        },
        {
            "ID": 217543,
            "ConnectionTypeID": 2,
            "Reference": "3",
            "StatusTypeID": 50,
            "LevelID": 3,
            "Amps": 125,
            "Voltage": 400,
            "PowerKW": 50,
            "CurrentTypeID": 30
        }
    ],
    "StatusTypeID": 50,
    "DateLastStatusUpdate": "2020-11-17T23:30:00Z",
    "MetadataValues": [
        {
            "ID": 7187,
            "MetadataFieldID": 4,
            "ItemValue": "Contains public sector information licensed under the Open Government Licence v2.0. http://www.nationalarchives.gov.uk/doc/open-government-licence/version/2/"
        }
    ],
    "DataQualityLevel": 3,
    "DateCreated": "2020-03-17T08:15:00Z",
    "SubmissionStatusTypeID": 100
}