{
    "IsRecentlyVerified": false,
    "ID": 37069,
    "UUID": "7FD168C8-50C5-495F-978C-4B6D6B9EFB5C",
    "DataProviderID": 26,
    "DataProvidersReference": "36147",
    "OperatorID": 157,
    "OperatorsReference": "NewMotion 02006267",
    "UsageCost": "0.00 jaarabonnement",
    "AddressInfo": {
        "ID": 37415,
        "Title": "Deltaweg 11",
        "AddressLine1": "Deltaweg 11",
        "Town": "Haarlemmermeer",
        "Postcode": "2134 XS",
        "CountryID": 159,
        "Latitude": 52.3049812316894,
        "Longitude": 4.63214015960693,
        "ContactTelephone1": "088 0109500",
        "RelatedURL": "http://thenewmotion.nl/",
        "DistanceUnit": 0
    },
    "Connections": [
        {
            "ID": 40580,
            "ConnectionTypeID": 25,
            "LevelID": 2,
            "PowerKW": 3.7,
            "CurrentTypeID": 10
        }
    ],
    "NumberOfPoints": 1,
    "StatusTypeID": 50,
    "DateLastStatusUpdate": "2016-06-04T02:52:00Z",
    "DataQualityLevel": 3,
    "DateCreated": "2015-01-09T06:07:00Z",
    "SubmissionStatusTypeID": 100
}