{
    "IsRecentlyVerified": false,
    "ID": 61149,
    "UUID": "FFD234F4-FC11-4CE3-B341-F9549620B863",
    "DataProviderID": 27,
    "DataProvidersReference": "122",
    "OperatorID": 1237,
    "UsageTypeID": 1,
    "AddressInfo": {
        "ID": 61495,
        "Title": "Julián Ceballos",
        "AddressLine1": "Calle Julián Ceballos, 9-11",
        "Town": "Torrelavega",
        "StateOrProvince": "Cantabria",
        "Postcode": "39300",
        "CountryID": 210,
        "Latitude": 43.348854,
        "Longitude": -4.051288,
        "ContactTelephone1": "+34 900102260",
        "ContactEmail": "Contacto.emobility@eon.com",
        "DistanceUnit": 0
    },
    "Connections": [
        {
            "ID": 77807,
            "ConnectionTypeID": 28,
            "LevelID": 1,
            "PowerKW": 2.3
        }
    ],
    "StatusTypeID": 0,
    "DateLastStatusUpdate": "2016-02-13T00:24:00Z",
    "DataQualityLevel": 3,
    "DateCreated": "2016-02-13T00:24:00Z",
    "SubmissionStatusTypeID": 200
}