{
    "UserComments": [
        {
            "ID": 21240,
            "ChargePointID": 126709,
            "CommentTypeID": 10,
            "UserName": "ForumElettrico.it",
            "RelatedURL": "https://www.forumelettrico.it/forum/colonnina-enel-x-22-kw-malalbergo-bo-via-ca-bianca-6-ponticelli-t6352.html",
            "DateCreated": "2019-07-21T15:58:14.63Z",
            "User": {
                "ID": 11749,
                "Username": "ForumElettrico.it"
            },
            "CheckinStatusTypeID": 10
        }
    ],
    "MediaItems": [
        {
            "ID": 19000,
            "ChargePointID": 126709,
            "ItemURL": "https://s3-ap-southeast-2.amazonaws.com/openchargemap/images/IT/OCM126709/OCM-126709.orig.2019072115582584.jpg",
            "ItemThumbnailURL": "https://s3-ap-southeast-2.amazonaws.com/openchargemap/images/IT/OCM126709/OCM-126709.thmb.2019072115582584.jpg",
            "Comment": "",
            "IsEnabled": true,
            "IsVideo": false,
            "IsFeaturedItem": false,
            "IsExternalResource": false,
            "User": {
                "ID": 11749,
                "Username": "ForumElettrico.it"
            },
            "DateCreated": "2019-07-21T15:59:00Z"
        },
        {
            "ID": 19001,
            "ChargePointID": 126709,
            "ItemURL": "https://s3-ap-southeast-2.amazonaws.com/openchargemap/images/IT/OCM126709/OCM-126709.orig.2019072115583984.jpg",
            "ItemThumbnailURL": "https://s3-ap-southeast-2.amazonaws.com/openchargemap/images/IT/OCM126709/OCM-126709.thmb.2019072115583984.jpg",
            "Comment": "",
            "IsEnabled": true,
            "IsVideo": false,
            "IsFeaturedItem": false,
            "IsExternalResource": false,
            "User": {
                "ID": 11749,
                "Username": "ForumElettrico.it"
            },
            "DateCreated": "2019-07-21T15:59:00Z"
        },
        {
            "ID": 19002,
            "ChargePointID": 126709,
            "ItemURL": "https://s3-ap-southeast-2.amazonaws.com/openchargemap/images/IT/OCM126709/OCM-126709.orig.2019072115584759.jpg",
            "ItemThumbnailURL": "https://s3-ap-southeast-2.amazonaws.com/openchargemap/images/IT/OCM126709/OCM-126709.thmb.2019072115584759.jpg",
            "Comment": "",
            "IsEnabled": true,
            "IsVideo": false,
            "IsFeaturedItem": false,
            "IsExternalResource": false,
            "User": {
                "ID": 11749,
                "Username": "ForumElettrico.it"
            },
            "DateCreated": "2019-07-21T15:59:00Z"
        },
        {
            "ID": 19003,
            "ChargePointID": 126709,
            "ItemURL": "https://s3-ap-southeast-2.amazonaws.com/openchargemap/images/IT/OCM126709/OCM-126709.orig.2019072115585309.jpg",
            "ItemThumbnailURL": "https://s3-ap-southeast-2.amazonaws.com/openchargemap/images/IT/OCM126709/OCM-126709.thmb.2019072115585309.jpg",
            "Comment": "",
            "IsEnabled": true,
            "IsVideo": false,
            "IsFeaturedItem": false,
            "IsExternalResource": false,
            "User": {
                "ID": 11749,
                "Username": "ForumElettrico.it"
            },
            "DateCreated": "2019-07-21T15:59:00Z"
        }
    ],
    "IsRecentlyVerified": false,
    "ID": 126709,
    "UUID": "15EC54B2-FCAE-4977-BC71-C66F35E9CC4E",
    "DataProviderID": 1,
    "OperatorID": 80,
    "UsageTypeID": 4,
    "AddressInfo": {
        "ID": 127055,
        "Title": "Ponticelli Ca' Bianca | EnelX",
        "AddressLine1": "Via Ca' Bianca",
        "AddressLine2": "Frazione Ponticelli",
        "Town": "Malalbergo",
        "StateOrProvince": "BO",
        "Postcode": "40051 ",
        "CountryID": 112,
        "Latitude": 44.6981436893919,
        "Longitude": 11.4727328133122,
        "ContactTelephone1": "800.069.850",
        "RelatedURL": "https://www.enelx.com/it/it/emobility",
        "DistanceUnit": 0
    },
    "Connections": [
        {
            "ID": 177491,
            "ConnectionTypeID": 25,
            "StatusTypeID": 50,
            "LevelID": 2,
            "Amps": 32,
            "Voltage": 400,
            "PowerKW": 22,
            "CurrentTypeID": 20,
            "Quantity": 1
        },
        {
            "ID": 177492,
            "ConnectionTypeID": 36,
            "StatusTypeID": 50,
            "LevelID": 2,
            "Amps": 16,
            "Voltage": 240,
            "PowerKW": 3.7,
            "CurrentTypeID": 10,
            "Quantity": 1
        }
    ],
    "NumberOfPoints": 2,
    "StatusTypeID": 50,
    "DateLastStatusUpdate": "2019-07-21T15:59:00Z",
    "DataQualityLevel": 1,
    "DateCreated": "2019-05-17T17:57:00Z",
    "SubmissionStatusTypeID": 200
}