{
    "IsRecentlyVerified": false,
    "ID": 32303,
    "UUID": "9F52CD7C-D72B-4998-83D6-9914F1735FAC",
    "DataProviderID": 26,
    "DataProvidersReference": "48976",
    "OperatorID": 157,
    "OperatorsReference": "NewMotion 02008552",
    "UsageCost": "0.00 jaarabonnement",
    "AddressInfo": {
        "ID": 32649,
        "Title": "Tunnelweg 95",
        "AddressLine1": "Tunnelweg 95",
        "Town": "Kerkrade",
        "Postcode": "6468 EJ",
        "CountryID": 159,
        "Latitude": 50.8716659545898,
        "Longitude": 6.03450727462769,
        "ContactTelephone1": "088 0109500",
        "RelatedURL": "http://thenewmotion.nl/",
        "DistanceUnit": 0
    },
    "Connections": [
        {
            "ID": 35814,
            "ConnectionTypeID": 25,
            "LevelID": 2,
            "PowerKW": 3.7,
            "CurrentTypeID": 10
        },
        {
            "ID": 46334,
            "ConnectionTypeID": 25,
            "LevelID": 2,
            "PowerKW": 3.7,
            "CurrentTypeID": 10
        }
    ],
    "NumberOfPoints": 1,
    "StatusTypeID": 50,
    "DateLastStatusUpdate": "2016-06-04T02:38:00Z",
    "DataQualityLevel": 3,
    "DateCreated": "2015-01-09T06:03:00Z",
    "SubmissionStatusTypeID": 100
}