{
    "IsRecentlyVerified": false,
    "ID": 144451,
    "UUID": "BB74EA05-729D-4F5C-945E-09A272BB4293",
    "DataProviderID": 2,
    "DataProvidersReference": "130577",
    "OperatorID": 90,
    "UsageTypeID": 1,
    "AddressInfo": {
        "ID": 144803,
        "Title": "1 Mont-Royal Est",
        "AddressLine1": "1 Avenue du Mont-Royal E",
        "Town": "Montréal",
        "StateOrProvince": "QC",
        "Postcode": "H2T 1N4",
        "CountryID": 44,
        "Latitude": 45.520373,
        "Longitude": -73.586509,
        "ContactTelephone1": "877-505-2674",
        "AccessComments": "24 hours daily",
        "RelatedURL": "https://lecircuitelectrique.com/",
        "DistanceUnit": 0
    },
    "Connections": [
        {
            "ID": 200956,
            "ConnectionTypeID": 1,
            "LevelID": 2,
            "Amps": 16,
            "Voltage": 230,
            "PowerKW": 3.7,
            "CurrentTypeID": 10,
            "Quantity": 2
        }
    ],
    "StatusTypeID": 50,
    "DateLastStatusUpdate": "2020-06-26T03:09:00Z",
    "DataQualityLevel": 3,
    "DateCreated": "2019-12-24T09:23:00Z",
    "SubmissionStatusTypeID": 100
}