{
    "IsRecentlyVerified": false,
    "ID": 41330,
    "UUID": "17DEC113-722C-43C8-9E51-8A0AAD160469",
    "DataProviderID": 2,
    "DataProvidersReference": "46383",
    "UsageTypeID": 1,
    "AddressInfo": {
        "ID": 41676,
        "Title": "Courtyard By Marriott - Plano Parkway",
        "AddressLine1": "4901 W Plano Pkwy",
        "Town": "Plano",
        "StateOrProvince": "TX",
        "Postcode": "75093",
        "CountryID": 2,
        "Latitude": 33.01736,
        "Longitude": -96.7937,
        "ContactTelephone1": "972-867-8000",
        "AccessComments": "24 hours daily; for guest use only",
        "RelatedURL": "",
        "DistanceUnit": 0
    },
    "Connections": [
        {
            "ID": 45166,
            "ConnectionTypeID": 1,
            "LevelID": 2,
            "Amps": 16,
            "Voltage": 230,
            "PowerKW": 3.7,
            "CurrentTypeID": 10,
            "Quantity": 2
        }
    ],
    "DateLastStatusUpdate": "2020-06-26T02:55:00Z",
    "DataQualityLevel": 3,
    "DateCreated": "2015-02-02T06:34:00Z",
    "SubmissionStatusTypeID": 100
}