{
    "IsRecentlyVerified": false,
    "ID": 74159,
    "UUID": "0CDA9EB1-6C59-411F-AFC6-D76CA9E66163",
    "DataProviderID": 1,
    "OperatorID": 89,
    "OperatorsReference": "CEC-00036",
    "UsageTypeID": 4,
    "UsageCost": "CAD 10.00/hour",
    "AddressInfo": {
        "ID": 74505,
        "Title": "BRCC-les Pères Nature",
        "AddressLine1": "10735 1er Av.",
        "Town": "Saint-Georges",
        "StateOrProvince": "QC",
        "Postcode": "G5Y 2B8",
        "CountryID": 44,
        "Latitude": 46.125588,
        "Longitude": -70.684813,
        "DistanceUnit": 0
    },
    "Connections": [
        {
            "ID": 106497,
            "ConnectionTypeID": 2,
            "StatusTypeID": 50,
            "LevelID": 3,
            "PowerKW": 50,
            "CurrentTypeID": 20,
            "Quantity": 1
        },
        {
            "ID": 106498,
            "ConnectionTypeID": 32,
            "StatusTypeID": 50,
            "LevelID": 3,
            "PowerKW": 50,
            "CurrentTypeID": 20,
            "Quantity": 1
        }
    ],
    "NumberOfPoints": 1,
    "StatusTypeID": 50,
    "DateLastStatusUpdate": "2017-01-22T19:35:00Z",
    "DataQualityLevel": 1,
    "DateCreated": "2016-11-24T14:17:00Z",
    "SubmissionStatusTypeID": 200
}