{
    "IsRecentlyVerified": false,
    "ID": 85684,
    "UUID": "DA44705E-0F35-4A5B-AE9D-04E89CBE083C",
    "DataProviderID": 1,
    "OperatorID": 45,
    "UsageTypeID": 6,
    "AddressInfo": {
        "ID": 86030,
        "Title": "Hotel Restaurant Weserschiffchen",
        "AddressLine1": "Unterloh 62",
        "Town": "Porta Westfalica",
        "StateOrProvince": "Kreis Minden-Lübbecke",
        "Postcode": "32457",
        "CountryID": 87,
        "Latitude": 52.20743,
        "Longitude": 8.862449999999967,
        "ContactTelephone1": "+49 57317550980",
        "RelatedURL": "http://www.weserschiffchen.de/",
        "DistanceUnit": 0
    },
    "Connections": [
        {
            "ID": 121818,
            "ConnectionTypeID": 17,
            "StatusTypeID": 50,
            "LevelID": 2,
            "Amps": 16,
            "Voltage": 400,
            "PowerKW": 11,
            "CurrentTypeID": 20,
            "Quantity": 1
        }
    ],
    "NumberOfPoints": 1,
    "StatusTypeID": 50,
    "DateLastStatusUpdate": "2017-04-11T07:03:00Z",
    "DataQualityLevel": 1,
    "DateCreated": "2017-04-11T07:03:00Z",
    "SubmissionStatusTypeID": 200
}