{
    "IsRecentlyVerified": false,
    "ID": 150406,
    "UUID": "EA6736A5-F437-4BD0-A692-1AC28E4BFFA1",
    "DataProviderID": 28,
    "DataProvidersReference": "FR*S83*P83091*A",
    "UsageTypeID": 5,
    "AddressInfo": {
        "ID": 150759,
        "Title": "PIERREFEU DU VAR_2 Avenue L?on Blum",
        "AddressLine1": "2 Avenue L?on Blum 83390 PIERREFEU DU VAR",
        "CountryID": 80,
        "Latitude": 43.228023,
        "Longitude": 6.143279,
        "AccessComments": "24/24 7/7 jours",
        "DistanceUnit": 0
    },
    "Connections": [
        {
            "ID": 209102,
            "ConnectionTypeID": 28,
            "StatusTypeID": 50,
            "LevelID": 2,
            "PowerKW": 22,
            "CurrentTypeID": 10
        },
        {
            "ID": 209103,
            "ConnectionTypeID": 1036,
            "StatusTypeID": 50,
            "LevelID": 2,
            "PowerKW": 22,
            "CurrentTypeID": 20
        },
        {
            "ID": 237849,
            "ConnectionTypeID": 28,
            "StatusTypeID": 50,
            "LevelID": 2,
            "PowerKW": 22,
            "CurrentTypeID": 10
        },
        {
            "ID": 237850,
            "ConnectionTypeID": 1036,
            "StatusTypeID": 50,
            "LevelID": 2,
            "PowerKW": 22,
            "CurrentTypeID": 20
        }
    ],
    "GeneralComments": "",
    "StatusTypeID": 50,
    "DateLastStatusUpdate": "2020-08-27T05:10:00Z",
    "DataQualityLevel": 2,
    "DateCreated": "2020-03-15T06:17:00Z",
    "SubmissionStatusTypeID": 100
}