{
    "IsRecentlyVerified": false,
    "ID": 180838,
    "UUID": "D7A3904D-DB14-4981-915F-07BB8CD85B14",
    "DataProviderID": 29,
    "DataProvidersReference": "14755",
    "OperatorID": 86,
    "AddressInfo": {
        "ID": 181197,
        "Title": "Langer Weg 50",
        "AddressLine1": "Langer Weg 50",
        "Town": "Esslingen",
        "Postcode": "73732",
        "CountryID": 87,
        "Latitude": 48.757079,
        "Longitude": 9.313677,
        "DistanceUnit": 0
    },
    "Connections": [
        {
            "ID": 284436,
            "ConnectionTypeID": 28,
            "StatusTypeID": 50,
            "LevelID": 2,
            "PowerKW": 22,
            "CurrentTypeID": 20
        },
        {
            "ID": 284437,
            "ConnectionTypeID": 25,
            "StatusTypeID": 50,
            "LevelID": 2,
            "PowerKW": 22,
            "CurrentTypeID": 20
        },
        {
            "ID": 296140,
            "ConnectionTypeID": 28,
            "StatusTypeID": 50,
            "LevelID": 2,
            "PowerKW": 22,
            "CurrentTypeID": 20
        },
        {
            "ID": 296141,
            "ConnectionTypeID": 25,
            "StatusTypeID": 50,
            "LevelID": 2,
            "PowerKW": 22,
            "CurrentTypeID": 20
        }
    ],
    "StatusTypeID": 50,
    "DateLastStatusUpdate": "2021-07-12T02:41:00Z",
    "MetadataValues": [
        {
            "ID": 13132,
            "MetadataFieldID": 4,
            "ItemValue": "Data from the German chargepoint registry provided by Bundesnetzagentur.de under the CC-BY 4.0 license"
        }
    ],
    "DataQualityLevel": 3,
    "DateCreated": "2021-07-08T10:01:00Z",
    "SubmissionStatusTypeID": 100
}