{
    "IsRecentlyVerified": false,
    "ID": 154457,
    "UUID": "686A515E-FE04-4768-9D5D-9E07B5359664",
    "DataProviderID": 28,
    "DataProvidersReference": "FR*SOD*S*NPDC*232*1*_*_",
    "UsageTypeID": 5,
    "AddressInfo": {
        "ID": 154810,
        "Title": "Gruson - Rue du Maréchal Leclerc",
        "AddressLine1": "Rue du Maréchal Leclerc, Gruson",
        "CountryID": 80,
        "Latitude": 50.596516,
        "Longitude": 3.204439,
        "AccessComments": "24/24 7/7 jours",
        "DistanceUnit": 0
    },
    "Connections": [
        {
            "ID": 217220,
            "ConnectionTypeID": 28,
            "StatusTypeID": 50,
            "LevelID": 2,
            "PowerKW": 22,
            "CurrentTypeID": 10
        },
        {
            "ID": 217221,
            "ConnectionTypeID": 1036,
            "StatusTypeID": 50,
            "LevelID": 2,
            "PowerKW": 22,
            "CurrentTypeID": 20
        },
        {
            "ID": 252316,
            "ConnectionTypeID": 28,
            "StatusTypeID": 50,
            "LevelID": 2,
            "PowerKW": 22,
            "CurrentTypeID": 10
        },
        {
            "ID": 252317,
            "ConnectionTypeID": 1036,
            "StatusTypeID": 50,
            "LevelID": 2,
            "PowerKW": 22,
            "CurrentTypeID": 20
        }
    ],
    "GeneralComments": "\"Type charge indiquée selon décret de 2017",
    "StatusTypeID": 50,
    "DateLastStatusUpdate": "2020-08-27T05:16:00Z",
    "DataQualityLevel": 2,
    "DateCreated": "2020-03-15T10:55:00Z",
    "SubmissionStatusTypeID": 100
}