{
    "IsRecentlyVerified": false,
    "ID": 90139,
    "UUID": "C7BE7D2F-E044-4F60-8609-96562F70CD67",
    "DataProviderID": 1,
    "OperatorID": 72,
    "UsageTypeID": 4,
    "AddressInfo": {
        "ID": 90485,
        "Title": "Parkplatz Ewald-Sträßer-Weg",
        "AddressLine1": "Ewald-Sträßer-Weg 4",
        "Town": "Burscheid",
        "StateOrProvince": "Rheinisch-Bergischer Kreis",
        "Postcode": "51399",
        "CountryID": 87,
        "Latitude": 51.083390547053654,
        "Longitude": 7.11942640541837,
        "AccessComments": "Genaue Lage unbekannt. 24/7 nutzbar mit TankE Zugang der RheinEnergie.",
        "RelatedURL": "http://www.wn.de/Muensterland/Kreis-Coesfeld/Havixbeck/2849382-Elektromobilitaet-E-Tankstelle-am-Netz",
        "DistanceUnit": 0
    },
    "Connections": [
        {
            "ID": 127779,
            "ConnectionTypeID": 25,
            "StatusTypeID": 50,
            "LevelID": 2,
            "Amps": 32,
            "Voltage": 400,
            "PowerKW": 22,
            "CurrentTypeID": 20,
            "Quantity": 2
        }
    ],
    "NumberOfPoints": 2,
    "StatusTypeID": 50,
    "DateLastStatusUpdate": "2017-07-12T05:45:00Z",
    "DataQualityLevel": 1,
    "DateCreated": "2017-07-12T05:45:00Z",
    "SubmissionStatusTypeID": 200
}