{
    "IsRecentlyVerified": false,
    "ID": 115405,
    "UUID": "590846BD-FA84-4856-A038-B71E0B2F409A",
    "DataProviderID": 2,
    "DataProvidersReference": "112699",
    "OperatorID": 23,
    "UsageTypeID": 1,
    "AddressInfo": {
        "ID": 115751,
        "Title": "Home2 Suites - Birmingham Colonnade - Tesla Destination",
        "AddressLine1": "3920 Colonnade Pkwy",
        "Town": "Birmingham",
        "StateOrProvince": "AL",
        "Postcode": "35243",
        "CountryID": 2,
        "Latitude": 33.435176,
        "Longitude": -86.731087,
        "ContactTelephone1": "205-969-7631  877-798-3752",
        "AccessComments": "24 hours daily; for Tesla use only; for guest use only; see front desk for access",
        "RelatedURL": "https://www.tesla.com/destination-charging",
        "DistanceUnit": 0
    },
    "Connections": [
        {
            "ID": 162410,
            "ConnectionTypeID": 0,
            "LevelID": 2,
            "Amps": 16,
            "Voltage": 230,
            "PowerKW": 3,
            "CurrentTypeID": 10,
            "Quantity": 4
        }
    ],
    "DateLastStatusUpdate": "2019-04-06T04:01:00Z",
    "DataQualityLevel": 3,
    "DateCreated": "2019-02-11T07:13:00Z",
    "SubmissionStatusTypeID": 100
}