{
    "IsRecentlyVerified": false,
    "ID": 79577,
    "UUID": "900A3F40-FE03-4725-A6B9-1CE242EB6351",
    "DataProviderID": 1,
    "OperatorID": 23,
    "OperatorsReference": "7180",
    "UsageTypeID": 7,
    "UsageCost": "Free",
    "AddressInfo": {
        "ID": 79923,
        "Title": "Beaver Valley Ski Club",
        "AddressLine1": "100 Pioneer DR",
        "Town": "Markdale",
        "StateOrProvince": "ON",
        "Postcode": "N0C 1H0",
        "CountryID": 44,
        "Latitude": 44.358147,
        "Longitude": -80.545293,
        "ContactTelephone1": "(519) 986-2520",
        "DistanceUnit": 0
    },
    "Connections": [
        {
            "ID": 114217,
            "ConnectionTypeID": 30,
            "StatusTypeID": 50,
            "LevelID": 2,
            "PowerKW": 10,
            "CurrentTypeID": 10,
            "Quantity": 1
        }
    ],
    "NumberOfPoints": 1,
    "GeneralComments": "1 Tesla Connector, up to 10kW.Available by reservation only. Please see front desk.",
    "StatusTypeID": 50,
    "DateLastStatusUpdate": "2017-06-09T15:09:00Z",
    "DataQualityLevel": 1,
    "DateCreated": "2017-01-29T18:00:00Z",
    "SubmissionStatusTypeID": 200
}