{
    "IsRecentlyVerified": false,
    "ID": 46209,
    "UUID": "67F6CA95-F364-43A6-B424-B2791BD33E62",
    "DataProviderID": 1,
    "DataProvidersReference": "1060",
    "AddressInfo": {
        "ID": 46555,
        "Title": "Bøgata på Kampen, Oslo",
        "AddressLine1": "Bøgata 17",
        "Town": "OSLO",
        "StateOrProvince": "Oslo",
        "Postcode": "0655",
        "CountryID": 168,
        "Latitude": 59.91325,
        "Longitude": 10.78069,
        "AccessComments": "",
        "DistanceUnit": 0
    },
    "Connections": [
        {
            "ID": 56872,
            "ConnectionTypeID": 0,
            "Reference": "1",
            "LevelID": 2,
            "Amps": 16,
            "Voltage": 230,
            "PowerKW": 3.7,
            "Comments": "Mode 1"
        },
        {
            "ID": 88586,
            "ConnectionTypeID": 0,
            "Reference": "2",
            "LevelID": 2,
            "Amps": 16,
            "Voltage": 230,
            "PowerKW": 3.7,
            "Comments": "Mode 1"
        }
    ],
    "NumberOfPoints": 2,
    "DateLastStatusUpdate": "2020-05-26T08:23:00Z",
    "DataQualityLevel": 2,
    "DateCreated": "2015-05-03T00:54:00Z",
    "SubmissionStatusTypeID": 100
}