{
    "IsRecentlyVerified": false,
    "ID": 154074,
    "UUID": "51A17FE5-A141-4E19-8A10-1EF6628872B9",
    "DataProviderID": 28,
    "DataProvidersReference": "FR*S27*PBEAUMONTROGE*CARNOT",
    "UsageTypeID": 5,
    "AddressInfo": {
        "ID": 154427,
        "Title": "900069",
        "AddressLine1": "Plce Carnot Beaumont le Roger",
        "CountryID": 80,
        "Latitude": 49.080689,
        "Longitude": 0.775525,
        "AccessComments": "24/24 7/7 jours",
        "DistanceUnit": 0
    },
    "Connections": [
        {
            "ID": 216527,
            "ConnectionTypeID": 28,
            "StatusTypeID": 50,
            "LevelID": 2,
            "PowerKW": 22,
            "CurrentTypeID": 10
        },
        {
            "ID": 216528,
            "ConnectionTypeID": 1036,
            "StatusTypeID": 50,
            "LevelID": 2,
            "PowerKW": 22,
            "CurrentTypeID": 20
        },
        {
            "ID": 250856,
            "ConnectionTypeID": 28,
            "StatusTypeID": 50,
            "LevelID": 2,
            "PowerKW": 22,
            "CurrentTypeID": 10
        },
        {
            "ID": 250857,
            "ConnectionTypeID": 1036,
            "StatusTypeID": 50,
            "LevelID": 2,
            "PowerKW": 22,
            "CurrentTypeID": 20
        }
    ],
    "GeneralComments": "Borne en service",
    "StatusTypeID": 50,
    "DateLastStatusUpdate": "2020-08-27T05:16:00Z",
    "DataQualityLevel": 2,
    "DateCreated": "2020-03-15T10:54:00Z",
    "SubmissionStatusTypeID": 100
}