{
    "MediaItems": [
        {
            "ID": 26759,
            "ChargePointID": 170467,
            "ItemURL": "https://s3-ap-southeast-2.amazonaws.com/openchargemap/images/IT/OCM170467/OCM-170467.orig.2021030507361847.jpg",
            "ItemThumbnailURL": "https://s3-ap-southeast-2.amazonaws.com/openchargemap/images/IT/OCM170467/OCM-170467.thmb.2021030507361847.jpg",
            "Comment": "",
            "IsEnabled": true,
            "IsVideo": false,
            "IsFeaturedItem": false,
            "IsExternalResource": false,
            "User": {
                "ID": 30672,
                "Username": "Rock&Watt"
            },
            "DateCreated": "2021-03-05T07:36:00Z"
        },
        {
            "ID": 26758,
            "ChargePointID": 170467,
            "ItemURL": "https://s3-ap-southeast-2.amazonaws.com/openchargemap/images/IT/OCM170467/OCM-170467.orig.2021030507352774.jpg",
            "ItemThumbnailURL": "https://s3-ap-southeast-2.amazonaws.com/openchargemap/images/IT/OCM170467/OCM-170467.thmb.2021030507352774.jpg",
            "Comment": "",
            "IsEnabled": true,
            "IsVideo": false,
            "IsFeaturedItem": false,
            "IsExternalResource": false,
            "User": {
                "ID": 30672,
                "Username": "Rock&Watt"
            },
            "DateCreated": "2021-03-05T07:35:00Z"
        }
    ],
    "IsRecentlyVerified": false,
    "ID": 170467,
    "UUID": "4B118E95-9002-46A3-B164-F503C564B57D",
    "DataProviderID": 1,
    "OperatorID": 3327,
    "UsageTypeID": 4,
    "AddressInfo": {
        "ID": 170826,
        "Title": "BECHARGE Carbonara al Ticino Via Roma",
        "AddressLine1": "Via Roma",
        "Town": "Carbonara al Ticino",
        "StateOrProvince": "PV",
        "Postcode": "27020",
        "CountryID": 112,
        "Latitude": 45.16485943511981,
        "Longitude": 9.05860601740335,
        "ContactTelephone1": "02-49527730",
        "ContactEmail": "emobility@buildingenergy.it",
        "RelatedURL": "https://www.bec.energy/",
        "DistanceUnit": 0
    },
    "Connections": [
        {
            "ID": 260120,
            "ConnectionTypeID": 25,
            "StatusTypeID": 50,
            "LevelID": 2,
            "Amps": 32,
            "Voltage": 400,
            "PowerKW": 22,
            "CurrentTypeID": 20,
            "Quantity": 2
        }
    ],
    "NumberOfPoints": 2,
    "StatusTypeID": 50,
    "DateLastStatusUpdate": "2021-03-05T07:44:00Z",
    "DataQualityLevel": 1,
    "DateCreated": "2020-11-27T15:42:00Z",
    "SubmissionStatusTypeID": 200
}