{
    "IsRecentlyVerified": false,
    "ID": 181324,
    "UUID": "600C8B7E-B185-4470-ADD1-CA0C031B397B",
    "DataProviderID": 29,
    "DataProvidersReference": "1588",
    "OperatorID": 234,
    "AddressInfo": {
        "ID": 181683,
        "Title": "Egidienplatz",
        "AddressLine1": "Egidienplatz",
        "Town": "Nürnberg",
        "Postcode": "90403",
        "CountryID": 87,
        "Latitude": 49.456903,
        "Longitude": 11.082322,
        "DistanceUnit": 0
    },
    "Connections": [
        {
            "ID": 285495,
            "ConnectionTypeID": 25,
            "StatusTypeID": 50,
            "LevelID": 2,
            "PowerKW": 22,
            "CurrentTypeID": 20
        },
        {
            "ID": 285496,
            "ConnectionTypeID": 25,
            "StatusTypeID": 50,
            "LevelID": 2,
            "PowerKW": 22,
            "CurrentTypeID": 20
        }
    ],
    "StatusTypeID": 50,
    "DateLastStatusUpdate": "2021-07-12T02:43:00Z",
    "MetadataValues": [
        {
            "ID": 13618,
            "MetadataFieldID": 4,
            "ItemValue": "Data from the German chargepoint registry provided by Bundesnetzagentur.de under the CC-BY 4.0 license"
        }
    ],
    "DataQualityLevel": 3,
    "DateCreated": "2021-07-08T10:01:00Z",
    "SubmissionStatusTypeID": 100
}