{
    "IsRecentlyVerified": false,
    "ID": 36476,
    "UUID": "D6192FE7-97B7-448D-964C-A6EDACB8F5C4",
    "DataProviderID": 26,
    "DataProvidersReference": "47405",
    "OperatorID": 178,
    "OperatorsReference": "EVnetNL AL562",
    "UsageCost": "0.00 jaarabonnement",
    "AddressInfo": {
        "ID": 36822,
        "Title": "Inputplein 2",
        "AddressLine1": "Inputplein 2",
        "Town": "Amersfoort",
        "Postcode": "3821 AM",
        "CountryID": 159,
        "Latitude": 52.174556,
        "Longitude": 5.404971,
        "ContactTelephone1": "0800-3522365",
        "RelatedURL": "http://www.evnet.nl",
        "DistanceUnit": 0
    },
    "Connections": [
        {
            "ID": 39987,
            "ConnectionTypeID": 25,
            "LevelID": 2,
            "PowerKW": 11,
            "CurrentTypeID": 10
        }
    ],
    "NumberOfPoints": 2,
    "StatusTypeID": 50,
    "DateLastStatusUpdate": "2016-06-04T02:51:00Z",
    "DataQualityLevel": 3,
    "DateCreated": "2015-01-09T06:05:00Z",
    "SubmissionStatusTypeID": 100
}