{
    "IsRecentlyVerified": false,
    "ID": 187747,
    "UUID": "AC58CD72-549B-4EC9-B1A3-3A08EFAE44F9",
    "DataProviderID": 18,
    "DataProvidersReference": "7a67479680807e851a8637b3c222f2ba",
    "OperatorID": 3,
    "UsageTypeID": 1,
    "AddressInfo": {
        "ID": 188106,
        "Title": "Woodlands House",
        "AddressLine1": "Woodlands House",
        "Town": "Cardiff",
        "Postcode": "CF14 4HH",
        "CountryID": 1,
        "Latitude": 51.520046,
        "Longitude": -3.194338,
        "AccessComments": "",
        "RelatedURL": "http://pod-point.com",
        "DistanceUnit": 0
    },
    "Connections": [
        {
            "ID": 302987,
            "ConnectionTypeID": 25,
            "Reference": "0",
            "StatusTypeID": 50,
            "LevelID": 2,
            "Amps": 32,
            "Voltage": 230,
            "PowerKW": 7,
            "CurrentTypeID": 10
        }
    ],
    "StatusTypeID": 0,
    "DateLastStatusUpdate": "2021-07-12T03:38:00Z",
    "MetadataValues": [
        {
            "ID": 19987,
            "MetadataFieldID": 4,
            "ItemValue": "Contains public sector information licensed under the Open Government Licence v2.0. http://www.nationalarchives.gov.uk/doc/open-government-licence/version/2/"
        }
    ],
    "DataQualityLevel": 3,
    "DateCreated": "2021-07-12T03:38:00Z",
    "SubmissionStatusTypeID": 100
}