{
    "IsRecentlyVerified": false,
    "ID": 21005,
    "UUID": "43CBC6C4-F527-45F2-B2F2-1C4071684175",
    "DataProviderID": 2,
    "DataProvidersReference": "60016",
    "OperatorID": 5,
    "UsageTypeID": 1,
    "AddressInfo": {
        "ID": 21350,
        "Title": "BMW SANDIA",
        "AddressLine1": "6001 Pan American Fwy",
        "Town": "Albuquerque",
        "StateOrProvince": "NM",
        "Postcode": "87109",
        "CountryID": 2,
        "Latitude": 35.1490981,
        "Longitude": -106.590478,
        "ContactTelephone1": "888-758-4389",
        "AccessComments": "24 hours daily",
        "RelatedURL": "http://www.chargepoint.com/",
        "DistanceUnit": 0
    },
    "Connections": [
        {
            "ID": 22872,
            "ConnectionTypeID": 1,
            "LevelID": 2,
            "Amps": 16,
            "Voltage": 230,
            "PowerKW": 3,
            "CurrentTypeID": 10,
            "Quantity": 1
        }
    ],
    "DateLastStatusUpdate": "2019-04-06T04:02:00Z",
    "DataQualityLevel": 3,
    "DateCreated": "2014-02-06T04:57:00Z",
    "SubmissionStatusTypeID": 100
}