{
    "IsRecentlyVerified": false,
    "ID": 122905,
    "UUID": "092F5766-3496-49F4-A593-71BFA6AF469A",
    "DataProviderID": 2,
    "DataProvidersReference": "67187",
    "OperatorID": 5,
    "UsageTypeID": 1,
    "AddressInfo": {
        "ID": 123251,
        "Title": "CITY HALL",
        "AddressLine1": "128 Rte 58",
        "Town": "Tehachapi",
        "StateOrProvince": "CA",
        "Postcode": "93561",
        "CountryID": 2,
        "Latitude": 35.1315123,
        "Longitude": -118.4463194,
        "ContactTelephone1": "888-758-4389",
        "AccessComments": "24 hours daily",
        "RelatedURL": "http://www.chargepoint.com/",
        "DistanceUnit": 0
    },
    "Connections": [
        {
            "ID": 172833,
            "ConnectionTypeID": 1,
            "LevelID": 2,
            "Amps": 16,
            "Voltage": 230,
            "PowerKW": 3,
            "CurrentTypeID": 10,
            "Quantity": 2
        }
    ],
    "DateLastStatusUpdate": "2019-12-24T09:12:00Z",
    "DataQualityLevel": 3,
    "DateCreated": "2019-04-06T05:03:00Z",
    "SubmissionStatusTypeID": 100
}