{
    "IsRecentlyVerified": false,
    "ID": 120086,
    "UUID": "73B7E624-487A-48E4-9B54-43DEECADEBBB",
    "DataProviderID": 2,
    "DataProvidersReference": "80300",
    "OperatorID": 5,
    "UsageTypeID": 1,
    "AddressInfo": {
        "ID": 120432,
        "Title": "PARK&ZOOM",
        "AddressLine1": "9518 Hotel Dr",
        "Town": "Austin",
        "StateOrProvince": "TX",
        "Postcode": "78719",
        "CountryID": 2,
        "Latitude": 30.212027,
        "Longitude": -97.6629,
        "ContactTelephone1": "888-758-4389",
        "AccessComments": "24 hours daily",
        "RelatedURL": "http://www.chargepoint.com/",
        "DistanceUnit": 0
    },
    "Connections": [
        {
            "ID": 169403,
            "ConnectionTypeID": 1,
            "LevelID": 2,
            "Amps": 16,
            "Voltage": 230,
            "PowerKW": 3,
            "CurrentTypeID": 10,
            "Quantity": 8
        }
    ],
    "DateLastStatusUpdate": "2019-12-24T09:08:00Z",
    "DataQualityLevel": 3,
    "DateCreated": "2019-04-01T04:59:00Z",
    "SubmissionStatusTypeID": 100
}