{
    "IsRecentlyVerified": false,
    "ID": 117978,
    "UUID": "3DC23B92-6F5F-4FC0-82C3-B604A2129981",
    "DataProviderID": 1,
    "OperatorID": 23,
    "OperatorsReference": "49115",
    "UsageTypeID": 4,
    "UsageCost": "$0.22/kWh; other tariffs for older cars",
    "AddressInfo": {
        "ID": 118324,
        "Title": "Riverview, FL Supercharger",
        "AddressLine1": "10665 Big Bend Road",
        "Town": "Riverview",
        "StateOrProvince": "FL",
        "Postcode": "33578",
        "CountryID": 2,
        "Latitude": 27.791411,
        "Longitude": -82.332817,
        "DistanceUnit": 0
    },
    "Connections": [
        {
            "ID": 166997,
            "ConnectionTypeID": 27,
            "StatusTypeID": 50,
            "LevelID": 3,
            "PowerKW": 120,
            "CurrentTypeID": 30,
            "Quantity": 10
        }
    ],
    "NumberOfPoints": 10,
    "GeneralComments": "Charging10 Superchargers, available 24/7, up to 120kW",
    "StatusTypeID": 50,
    "DateLastStatusUpdate": "2019-03-14T23:07:00Z",
    "DataQualityLevel": 1,
    "DateCreated": "2019-03-14T23:07:00Z",
    "SubmissionStatusTypeID": 200
}