{
    "IsRecentlyVerified": false,
    "ID": 177883,
    "UUID": "E21341D5-E668-4843-ADF4-B9DC87C26B0F",
    "DataProviderID": 29,
    "DataProvidersReference": "15486",
    "AddressInfo": {
        "ID": 178242,
        "Title": "Dirnaich 15",
        "AddressLine1": "Dirnaich 15",
        "Town": "Gangkofen",
        "Postcode": "84140",
        "CountryID": 87,
        "Latitude": 48.447806,
        "Longitude": 12.504205,
        "DistanceUnit": 0
    },
    "Connections": [
        {
            "ID": 277587,
            "ConnectionTypeID": 25,
            "StatusTypeID": 50,
            "LevelID": 2,
            "PowerKW": 22,
            "CurrentTypeID": 20
        }
    ],
    "StatusTypeID": 0,
    "DateLastStatusUpdate": "2021-07-09T03:12:00Z",
    "MetadataValues": [
        {
            "ID": 10177,
            "MetadataFieldID": 4,
            "ItemValue": "Data from the German chargepoint registry provided by Bundesnetzagentur.de under the CC-BY 4.0 license"
        }
    ],
    "DataQualityLevel": 3,
    "DateCreated": "2021-07-08T09:49:00Z",
    "SubmissionStatusTypeID": 100
}