{
    "IsRecentlyVerified": false,
    "ID": 179815,
    "UUID": "DF1CEAAA-9FA2-44EC-B470-16870B4D951A",
    "DataProviderID": 29,
    "DataProvidersReference": "6706,14636",
    "AddressInfo": {
        "ID": 180174,
        "Title": "Rathausplatz 1",
        "AddressLine1": "Rathausplatz 1",
        "Town": "St. Wendel",
        "Postcode": "66606",
        "CountryID": 87,
        "Latitude": 49.467745,
        "Longitude": 7.16908,
        "DistanceUnit": 0
    },
    "Connections": [
        {
            "ID": 282135,
            "ConnectionTypeID": 25,
            "StatusTypeID": 50,
            "LevelID": 2,
            "PowerKW": 22,
            "CurrentTypeID": 20
        },
        {
            "ID": 282136,
            "ConnectionTypeID": 25,
            "StatusTypeID": 50,
            "LevelID": 2,
            "PowerKW": 22,
            "CurrentTypeID": 20
        },
        {
            "ID": 282137,
            "ConnectionTypeID": 25,
            "StatusTypeID": 50,
            "LevelID": 2,
            "PowerKW": 22,
            "CurrentTypeID": 20
        },
        {
            "ID": 282138,
            "ConnectionTypeID": 25,
            "StatusTypeID": 50,
            "LevelID": 2,
            "PowerKW": 22,
            "CurrentTypeID": 20
        }
    ],
    "StatusTypeID": 50,
    "DateLastStatusUpdate": "2021-07-09T03:17:00Z",
    "MetadataValues": [
        {
            "ID": 12109,
            "MetadataFieldID": 4,
            "ItemValue": "Data from the German chargepoint registry provided by Bundesnetzagentur.de under the CC-BY 4.0 license"
        }
    ],
    "DataQualityLevel": 3,
    "DateCreated": "2021-07-08T09:59:00Z",
    "SubmissionStatusTypeID": 100
}