{
    "IsRecentlyVerified": false,
    "ID": 110786,
    "UUID": "1690005E-4ACA-4C2C-BCE0-591F8F36B22C",
    "DataProviderID": 2,
    "DataProvidersReference": "99424",
    "OperatorID": 5,
    "UsageTypeID": 1,
    "AddressInfo": {
        "ID": 111132,
        "Title": "EVPASS",
        "AddressLine1": "400-498 Harrison St",
        "Town": "Syracuse",
        "StateOrProvince": "NY",
        "Postcode": "13202",
        "CountryID": 2,
        "Latitude": 43.044095,
        "Longitude": -76.147524,
        "ContactTelephone1": "888-758-4389",
        "AccessComments": "24 hours daily",
        "RelatedURL": "http://www.chargepoint.com/",
        "DistanceUnit": 0
    },
    "Connections": [
        {
            "ID": 156078,
            "ConnectionTypeID": 1,
            "LevelID": 2,
            "Amps": 16,
            "Voltage": 230,
            "PowerKW": 3,
            "CurrentTypeID": 10,
            "Quantity": 14
        }
    ],
    "DateLastStatusUpdate": "2019-12-24T09:21:00Z",
    "DataQualityLevel": 3,
    "DateCreated": "2018-10-18T23:36:00Z",
    "SubmissionStatusTypeID": 100
}