{
    "IsRecentlyVerified": false,
    "ID": 96279,
    "UUID": "CCBD83B9-AFF1-478D-B0BE-D6BFEBE51DBC",
    "DataProviderID": 1,
    "OperatorID": 3,
    "OperatorsReference": "PSL-64938",
    "UsageTypeID": 6,
    "UsageCost": "Free",
    "AddressInfo": {
        "ID": 96625,
        "Title": "Minerva House",
        "AddressLine1": "Minerva House",
        "Town": "Holbeach",
        "Postcode": "PE12 7PT",
        "CountryID": 1,
        "Latitude": 52.807212,
        "Longitude": 0.017037,
        "DistanceUnit": 0
    },
    "Connections": [
        {
            "ID": 136419,
            "ConnectionTypeID": 1,
            "StatusTypeID": 50,
            "LevelID": 2,
            "Voltage": 230,
            "PowerKW": 3,
            "CurrentTypeID": 10,
            "Quantity": 1
        }
    ],
    "NumberOfPoints": 1,
    "GeneralComments": "This unit is installed at Minerva House in Park Road, Holbeach",
    "StatusTypeID": 50,
    "DateLastStatusUpdate": "2017-12-20T11:08:00Z",
    "DataQualityLevel": 1,
    "DateCreated": "2017-12-20T11:08:00Z",
    "SubmissionStatusTypeID": 200
}