{
    "IsRecentlyVerified": false,
    "ID": 122167,
    "UUID": "DED18F83-5E74-406F-901E-221ED81DB9E9",
    "DataProviderID": 2,
    "DataProvidersReference": "118466",
    "OperatorID": 39,
    "UsageTypeID": 1,
    "AddressInfo": {
        "ID": 122513,
        "Title": "Main Location",
        "AddressLine1": "11390 W Olympic Blvd.",
        "Town": "Los Angeles",
        "StateOrProvince": "CA",
        "Postcode": "90064",
        "CountryID": 2,
        "Latitude": 34.036977,
        "Longitude": -118.4426047,
        "ContactTelephone1": "800-663-5633",
        "AccessComments": "MO: Not Specified; TU: Not Specified; WE: Not Specified; TH: Not Specified; FR: Not Specified; SA: Not Specified; SU: Not Specified",
        "RelatedURL": "http://www.semacharge.com/",
        "DistanceUnit": 0
    },
    "Connections": [
        {
            "ID": 172034,
            "ConnectionTypeID": 1,
            "LevelID": 2,
            "Amps": 16,
            "Voltage": 230,
            "PowerKW": 3,
            "CurrentTypeID": 10,
            "Quantity": 6
        }
    ],
    "DateLastStatusUpdate": "2019-04-06T05:02:00Z",
    "DataQualityLevel": 3,
    "DateCreated": "2019-04-06T05:02:00Z",
    "SubmissionStatusTypeID": 100
}