{
    "IsRecentlyVerified": false,
    "ID": 182570,
    "UUID": "C6076B46-7DD7-4A24-8A30-0CD5907E9C77",
    "DataProviderID": 29,
    "DataProvidersReference": "10608",
    "OperatorID": 45,
    "AddressInfo": {
        "ID": 182929,
        "Title": "Meininger Straße 6",
        "AddressLine1": "Meininger Straße 6",
        "Town": "Bad Neustadt",
        "Postcode": "97616",
        "CountryID": 87,
        "Latitude": 50.325876,
        "Longitude": 10.221644,
        "DistanceUnit": 0
    },
    "Connections": [
        {
            "ID": 288483,
            "ConnectionTypeID": 1036,
            "StatusTypeID": 50,
            "LevelID": 3,
            "PowerKW": 43,
            "CurrentTypeID": 20
        },
        {
            "ID": 288484,
            "ConnectionTypeID": 33,
            "StatusTypeID": 50,
            "LevelID": 3,
            "PowerKW": 50,
            "CurrentTypeID": 30
        },
        {
            "ID": 297719,
            "ConnectionTypeID": 2,
            "StatusTypeID": 50,
            "LevelID": 3,
            "PowerKW": 50,
            "CurrentTypeID": 30
        }
    ],
    "StatusTypeID": 50,
    "DateLastStatusUpdate": "2021-07-12T02:44:00Z",
    "MetadataValues": [
        {
            "ID": 14863,
            "MetadataFieldID": 4,
            "ItemValue": "Data from the German chargepoint registry provided by Bundesnetzagentur.de under the CC-BY 4.0 license"
        }
    ],
    "DataQualityLevel": 3,
    "DateCreated": "2021-07-08T10:03:00Z",
    "SubmissionStatusTypeID": 100
}