{
    "IsRecentlyVerified": false,
    "ID": 32859,
    "UUID": "4DF0A7B8-2E36-4F22-9607-F4AF73B4C52C",
    "DataProviderID": 1,
    "OperatorID": 105,
    "OperatorsReference": "Essent EM-DE-05113000-01-00009",
    "UsageTypeID": 4,
    "AddressInfo": {
        "ID": 33205,
        "Title": "Rellinghauserstraße 37",
        "AddressLine1": "Rellinghauserstraße 37",
        "Town": "Essen",
        "StateOrProvince": "NRW",
        "Postcode": "45128",
        "CountryID": 87,
        "Latitude": 51.447822,
        "Longitude": 7.013708,
        "DistanceUnit": 0
    },
    "Connections": [
        {
            "ID": 36370,
            "ConnectionTypeID": 25,
            "StatusTypeID": 50,
            "LevelID": 2,
            "PowerKW": 22,
            "CurrentTypeID": 20,
            "Quantity": 2
        },
        {
            "ID": 46563,
            "ConnectionTypeID": 25,
            "StatusTypeID": 50,
            "LevelID": 2,
            "PowerKW": 22,
            "CurrentTypeID": 20,
            "Quantity": 2
        }
    ],
    "NumberOfPoints": 2,
    "StatusTypeID": 50,
    "DateLastStatusUpdate": "2019-10-30T16:50:00Z",
    "DataQualityLevel": 3,
    "DateCreated": "2015-01-09T06:03:00Z",
    "SubmissionStatusTypeID": 200
}