{
    "IsRecentlyVerified": false,
    "ID": 15211,
    "UUID": "CD0FAE54-4958-46EA-ABD7-1A8CFE978F72",
    "DataProviderID": 1,
    "OperatorID": 1,
    "UsageTypeID": 0,
    "UsageCost": "Free",
    "AddressInfo": {
        "ID": 15557,
        "Title": "Nissan PARIWEST ",
        "AddressLine1": " 6 bis. RUE ALFRED KASTLER",
        "AddressLine2": "zone Pariwest",
        "Town": "Maurepas",
        "StateOrProvince": "",
        "Postcode": "78310",
        "CountryID": 80,
        "Latitude": 48.7623589,
        "Longitude": 1.9453260000000228,
        "ContactTelephone1": "0130164655",
        "ContactTelephone2": " 08 99 23 76 36",
        "ContactEmail": "",
        "AccessComments": "",
        "RelatedURL": "",
        "DistanceUnit": 0
    },
    "Connections": [
        {
            "ID": 13501,
            "ConnectionTypeID": 2,
            "StatusTypeID": 0,
            "LevelID": 3,
            "Quantity": 1
        }
    ],
    "NumberOfPoints": 1,
    "GeneralComments": "",
    "StatusTypeID": 50,
    "DateLastStatusUpdate": "2012-12-23T13:02:00Z",
    "DataQualityLevel": 1,
    "DateCreated": "2012-12-23T12:59:00Z",
    "SubmissionStatusTypeID": 200
}