{
    "IsRecentlyVerified": false,
    "ID": 139582,
    "UUID": "686CBD53-6B27-446E-88F3-13ED24F26D42",
    "DataProviderID": 2,
    "DataProvidersReference": "148811",
    "OperatorID": 39,
    "UsageTypeID": 1,
    "AddressInfo": {
        "ID": 139934,
        "Title": "Crescent Park",
        "AddressLine1": "5710 Crescent Park E.",
        "Town": "Playa Vista",
        "StateOrProvince": "CA",
        "Postcode": "90094",
        "CountryID": 2,
        "Latitude": 33.9719794,
        "Longitude": -118.4281221,
        "ContactTelephone1": "800-663-5633",
        "AccessComments": "MO: 12:00am-12:00am; TU: 12:00am-12:00am; WE: 12:00am-12:00am; TH: 12:00am-12:00am; FR: 12:00am-12:00am; SA: 12:00am-12:00am; SU: 12:00am-12:00am",
        "RelatedURL": "http://www.semacharge.com/",
        "DistanceUnit": 0
    },
    "Connections": [
        {
            "ID": 194990,
            "ConnectionTypeID": 1,
            "LevelID": 2,
            "Amps": 16,
            "Voltage": 230,
            "PowerKW": 3,
            "CurrentTypeID": 10,
            "Quantity": 2
        }
    ],
    "StatusTypeID": 50,
    "DateLastStatusUpdate": "2019-12-24T09:11:00Z",
    "DataQualityLevel": 3,
    "DateCreated": "2019-12-24T09:11:00Z",
    "SubmissionStatusTypeID": 100
}