{
    "IsRecentlyVerified": false,
    "ID": 121090,
    "UUID": "47CD1BDD-98BD-475A-8511-DAC8D575473D",
    "DataProviderID": 2,
    "DataProvidersReference": "82467",
    "UsageTypeID": 2,
    "AddressInfo": {
        "ID": 121436,
        "Title": "Mother's Nutritional Center",
        "AddressLine1": "13635 Freeway Dr",
        "Town": "Santa Fe Springs",
        "StateOrProvince": "CA",
        "Postcode": "90670",
        "CountryID": 2,
        "Latitude": 33.892058,
        "Longitude": -118.041517,
        "ContactTelephone1": "",
        "AccessComments": "Employee use only",
        "RelatedURL": "",
        "DistanceUnit": 0
    },
    "Connections": [
        {
            "ID": 170519,
            "ConnectionTypeID": 1,
            "LevelID": 2,
            "Amps": 16,
            "Voltage": 230,
            "PowerKW": 3,
            "CurrentTypeID": 10,
            "Quantity": 4
        }
    ],
    "DateLastStatusUpdate": "2019-04-01T04:59:00Z",
    "DataQualityLevel": 3,
    "DateCreated": "2019-04-01T04:59:00Z",
    "SubmissionStatusTypeID": 100
}