{
    "IsRecentlyVerified": false,
    "ID": 180900,
    "UUID": "2D1D639D-4811-400E-AA6A-F292C19AD028",
    "DataProviderID": 29,
    "DataProvidersReference": "18537",
    "AddressInfo": {
        "ID": 181259,
        "Title": "Ober-Eschbacher Str. 153",
        "AddressLine1": "Ober-Eschbacher Str. 153",
        "Town": "Bad Homburg",
        "Postcode": "61352",
        "CountryID": 87,
        "Latitude": 50.210594,
        "Longitude": 8.656355,
        "DistanceUnit": 0
    },
    "Connections": [
        {
            "ID": 284562,
            "ConnectionTypeID": 25,
            "StatusTypeID": 50,
            "LevelID": 2,
            "PowerKW": 22,
            "CurrentTypeID": 20
        },
        {
            "ID": 284563,
            "ConnectionTypeID": 25,
            "StatusTypeID": 50,
            "LevelID": 2,
            "PowerKW": 22,
            "CurrentTypeID": 20
        }
    ],
    "StatusTypeID": 50,
    "DateLastStatusUpdate": "2021-07-09T03:19:00Z",
    "MetadataValues": [
        {
            "ID": 13194,
            "MetadataFieldID": 4,
            "ItemValue": "Data from the German chargepoint registry provided by Bundesnetzagentur.de under the CC-BY 4.0 license"
        }
    ],
    "DataQualityLevel": 3,
    "DateCreated": "2021-07-08T10:01:00Z",
    "SubmissionStatusTypeID": 100
}