{
    "IsRecentlyVerified": false,
    "ID": 171005,
    "UUID": "7BDD57EF-5AFF-4BA2-81D8-224F61F694B1",
    "DataProviderID": 1,
    "OperatorID": 3,
    "OperatorsReference": "t54_it1_3420_052",
    "UsageTypeID": 4,
    "UsageCost": "£0.25/kWh",
    "AddressInfo": {
        "ID": 171364,
        "Title": "Lidl - Wollaton",
        "AddressLine1": " 110 Trowell Road",
        "Town": "Wollaton",
        "StateOrProvince": "England",
        "Postcode": "NG8 2DH ",
        "CountryID": 1,
        "Latitude": 52.9563284182838,
        "Longitude": -1.23003651437477,
        "RelatedURL": "https://pod-point.com/",
        "DistanceUnit": 0
    },
    "Connections": [
        {
            "ID": 261266,
            "ConnectionTypeID": 25,
            "StatusTypeID": 50,
            "LevelID": 2,
            "Amps": 32,
            "Voltage": 400,
            "PowerKW": 22,
            "CurrentTypeID": 20,
            "Quantity": 1
        },
        {
            "ID": 268954,
            "ConnectionTypeID": 33,
            "StatusTypeID": 50,
            "LevelID": 3,
            "PowerKW": 50,
            "CurrentTypeID": 30,
            "Quantity": 1
        },
        {
            "ID": 268955,
            "ConnectionTypeID": 2,
            "StatusTypeID": 50,
            "LevelID": 3,
            "PowerKW": 50,
            "CurrentTypeID": 30,
            "Quantity": 1
        }
    ],
    "NumberOfPoints": 1,
    "StatusTypeID": 50,
    "DateLastStatusUpdate": "2021-03-17T06:18:00Z",
    "DataQualityLevel": 1,
    "DateCreated": "2020-12-16T23:46:00Z",
    "SubmissionStatusTypeID": 200
}