{
    "IsRecentlyVerified": false,
    "ID": 142991,
    "UUID": "89195A55-34B9-49D9-A42B-CF0B15913E0D",
    "DataProviderID": 2,
    "DataProvidersReference": "123110",
    "OperatorID": 3372,
    "UsageTypeID": 1,
    "AddressInfo": {
        "ID": 143343,
        "Title": "Delaware & Ulster Railroad",
        "AddressLine1": "43510 Highway 28",
        "Town": "Arkville",
        "StateOrProvince": "NY",
        "Postcode": "12406",
        "CountryID": 2,
        "Latitude": 42.1474371,
        "Longitude": -74.6149171,
        "ContactTelephone1": "866-816-7584",
        "AccessComments": "24 hours daily",
        "RelatedURL": "http://evconnect.com/",
        "DistanceUnit": 0
    },
    "Connections": [
        {
            "ID": 199239,
            "ConnectionTypeID": 1,
            "LevelID": 2,
            "Amps": 16,
            "Voltage": 230,
            "PowerKW": 3.7,
            "CurrentTypeID": 10,
            "Quantity": 1
        }
    ],
    "StatusTypeID": 50,
    "DateLastStatusUpdate": "2020-06-26T03:05:00Z",
    "DataQualityLevel": 3,
    "DateCreated": "2019-12-24T09:19:00Z",
    "SubmissionStatusTypeID": 100
}