{
    "IsRecentlyVerified": false,
    "ID": 109454,
    "UUID": "5042EF83-1799-43F2-9DCA-C57D1A627987",
    "DataProviderID": 1,
    "OperatorID": 80,
    "UsageTypeID": 4,
    "AddressInfo": {
        "ID": 109800,
        "Title": "Svincolo Tremonzelli | EnelX",
        "AddressLine1": "Strada statale dell'Etna e delle Madonie",
        "Town": "Polizzi Generosa ",
        "StateOrProvince": "PA",
        "Postcode": "90022",
        "CountryID": 112,
        "Latitude": 37.75912198555591,
        "Longitude": 13.965030986381407,
        "ContactTelephone1": "800.069.850",
        "RelatedURL": "https://www.enelx.com/it/it/emobility",
        "DistanceUnit": 0
    },
    "Connections": [
        {
            "ID": 154633,
            "ConnectionTypeID": 25,
            "StatusTypeID": 50,
            "LevelID": 2,
            "Amps": 32,
            "Voltage": 400,
            "PowerKW": 22,
            "CurrentTypeID": 20,
            "Quantity": 1
        },
        {
            "ID": 154634,
            "ConnectionTypeID": 36,
            "StatusTypeID": 50,
            "LevelID": 2,
            "Amps": 16,
            "Voltage": 240,
            "PowerKW": 3.7,
            "CurrentTypeID": 10,
            "Quantity": 1
        }
    ],
    "NumberOfPoints": 2,
    "StatusTypeID": 50,
    "DateLastStatusUpdate": "2018-10-15T13:58:00Z",
    "DataQualityLevel": 1,
    "DateCreated": "2018-10-15T13:58:00Z",
    "SubmissionStatusTypeID": 200
}