{
    "IsRecentlyVerified": false,
    "ID": 87676,
    "UUID": "479C9204-BA26-4C4F-8E6F-3300061052A3",
    "DataProviderID": 1,
    "UsageCost": "$2/hr",
    "AddressInfo": {
        "ID": 88022,
        "Title": "Waikouaiti Beach Camping Caravan Park",
        "AddressLine1": "186 Beach St",
        "Town": "Waikouaiti",
        "Postcode": "9510",
        "CountryID": 161,
        "Latitude": -45.61187959999999,
        "Longitude": 170.6726847,
        "ContactTelephone1": "034657432",
        "DistanceUnit": 0
    },
    "Connections": [
        {
            "ID": 124284,
            "ConnectionTypeID": 4
        }
    ],
    "NumberOfPoints": 1,
    "GeneralComments": "Suggest $2/hr (but not negotiated)\r\nMultiple outlets available if charger electrically tested and tagged.",
    "StatusTypeID": 50,
    "DateLastStatusUpdate": "2017-05-15T10:58:00Z",
    "DataQualityLevel": 1,
    "DateCreated": "2017-05-15T10:58:00Z",
    "SubmissionStatusTypeID": 200
}