{
    "IsRecentlyVerified": false,
    "ID": 175048,
    "UUID": "3F86FF40-52D9-48C6-B8B1-748E74672295",
    "DataProviderID": 1,
    "OperatorID": 3299,
    "UsageTypeID": 1,
    "AddressInfo": {
        "ID": 175407,
        "Title": "IONITY Lacq Audéjos Nord",
        "AddressLine1": "Aire de Lacq Sud AUDEJOS Autoroute A64",
        "Town": "Lacq",
        "Postcode": "64170",
        "CountryID": 80,
        "Latitude": 43.418629,
        "Longitude": -0.584799,
        "DistanceUnit": 0
    },
    "Connections": [
        {
            "ID": 271295,
            "ConnectionTypeID": 33,
            "StatusTypeID": 50,
            "LevelID": 3,
            "PowerKW": 350,
            "CurrentTypeID": 30
        }
    ],
    "NumberOfPoints": 4,
    "StatusTypeID": 50,
    "DateLastStatusUpdate": "2021-05-04T15:39:00Z",
    "DataQualityLevel": 1,
    "DateCreated": "2021-04-25T15:23:00Z",
    "SubmissionStatusTypeID": 200
}