{
    "IsRecentlyVerified": false,
    "ID": 34171,
    "UUID": "4D06147E-FEE0-4478-8CD7-9DA13F5AB215",
    "DataProviderID": 26,
    "DataProvidersReference": "55266",
    "OperatorID": 157,
    "OperatorsReference": "NewMotion 03999993",
    "UsageCost": "0.00 jaarabonnement",
    "AddressInfo": {
        "ID": 34517,
        "Title": "Koningsweg 1",
        "AddressLine1": "Koningsweg 1",
        "Town": "Druten",
        "Postcode": "6655 AA",
        "CountryID": 159,
        "Latitude": 51.876436,
        "Longitude": 5.59056829999997,
        "ContactTelephone1": "088 0109500",
        "RelatedURL": "http://thenewmotion.nl/",
        "DistanceUnit": 0
    },
    "Connections": [
        {
            "ID": 37682,
            "ConnectionTypeID": 25,
            "LevelID": 2,
            "PowerKW": 22,
            "CurrentTypeID": 10
        }
    ],
    "NumberOfPoints": 1,
    "StatusTypeID": 50,
    "DateLastStatusUpdate": "2016-06-04T02:41:00Z",
    "DataQualityLevel": 3,
    "DateCreated": "2015-01-09T06:04:00Z",
    "SubmissionStatusTypeID": 100
}