{
    "IsRecentlyVerified": false,
    "ID": 16792,
    "UUID": "0B8F6A99-D0C8-4965-AF27-555E7EB5F635",
    "DataProviderID": 2,
    "DataProvidersReference": "52000",
    "OperatorID": 5,
    "UsageTypeID": 1,
    "AddressInfo": {
        "ID": 17137,
        "Title": "CITY OF DULUTH",
        "AddressLine1": "600-780 W Michigan St",
        "Town": "Duluth",
        "StateOrProvince": "MN",
        "Postcode": "55802",
        "CountryID": 2,
        "Latitude": 46.780835,
        "Longitude": -92.105163,
        "ContactTelephone1": "888-758-4389",
        "AccessComments": "24 hours daily",
        "RelatedURL": "http://www.chargepoint.com/",
        "DistanceUnit": 0
    },
    "Connections": [
        {
            "ID": 17018,
            "ConnectionTypeID": 9,
            "LevelID": 1,
            "Amps": 16,
            "Voltage": 120,
            "PowerKW": 1,
            "CurrentTypeID": 10,
            "Quantity": 1
        },
        {
            "ID": 17019,
            "ConnectionTypeID": 1,
            "LevelID": 2,
            "Amps": 16,
            "Voltage": 230,
            "PowerKW": 3,
            "CurrentTypeID": 10,
            "Quantity": 1
        },
        {
            "ID": 22240,
            "ConnectionTypeID": 1,
            "LevelID": 2,
            "Quantity": 1
        }
    ],
    "DateLastStatusUpdate": "2019-04-06T05:07:00Z",
    "DataQualityLevel": 3,
    "DateCreated": "2013-06-16T03:49:00Z",
    "SubmissionStatusTypeID": 200
}