{
    "UserComments": [
        {
            "ID": 24652,
            "ChargePointID": 72335,
            "CommentTypeID": 50,
            "UserName": "Honda_Insight",
            "Comment": "FREE!!!",
            "Rating": 5,
            "DateCreated": "2021-07-26T08:24:48.223Z",
            "User": {
                "ID": 33563,
                "Username": "Honda_Insight"
            },
            "CheckinStatusTypeID": 10,
            "IsActionedByEditor": false
        }
    ],
    "IsRecentlyVerified": false,
    "ID": 72335,
    "UUID": "1D6D62D8-E1B9-4199-A892-5197A2D5C94B",
    "DataProviderID": 2,
    "DataProvidersReference": "78843",
    "OperatorID": 5,
    "UsageTypeID": 1,
    "AddressInfo": {
        "ID": 72681,
        "Title": "HY VEE",
        "AddressLine1": "1500 Central Park Commons Dr",
        "Town": "Eagan",
        "StateOrProvince": "MN",
        "Postcode": "55121",
        "CountryID": 2,
        "Latitude": 44.834539,
        "Longitude": -93.171111,
        "ContactTelephone1": "888-758-4389",
        "AccessComments": "24 hours daily",
        "RelatedURL": "http://www.chargepoint.com/",
        "DistanceUnit": 0
    },
    "Connections": [
        {
            "ID": 103643,
            "ConnectionTypeID": 1,
            "LevelID": 2,
            "Amps": 16,
            "Voltage": 230,
            "PowerKW": 3.7,
            "CurrentTypeID": 10,
            "Quantity": 4
        }
    ],
    "DateLastStatusUpdate": "2021-07-26T08:25:00Z",
    "DataQualityLevel": 3,
    "DateCreated": "2016-10-09T02:45:00Z",
    "SubmissionStatusTypeID": 100
}