{
    "IsRecentlyVerified": false,
    "ID": 148992,
    "UUID": "F1E9303E-6E21-45ED-B4EF-0AAE682FEC2D",
    "DataProviderID": 1,
    "OperatorID": 136,
    "UsageTypeID": 4,
    "UsageCost": "0,26€/kWh min fee 0,5€ + 0,91€/h",
    "AddressInfo": {
        "ID": 149345,
        "Title": "Q park Dixi",
        "AddressLine1": "Ratatie 11",
        "Town": "Vantaa",
        "StateOrProvince": "Southern Finland",
        "Postcode": "01301",
        "CountryID": 79,
        "Latitude": 60.29449844537149,
        "Longitude": 25.044441317581686,
        "RelatedURL": "http://www.virta.fi",
        "DistanceUnit": 0
    },
    "Connections": [
        {
            "ID": 206910,
            "ConnectionTypeID": 25,
            "StatusTypeID": 50,
            "LevelID": 2,
            "Amps": 32,
            "Voltage": 400,
            "PowerKW": 22,
            "CurrentTypeID": 20,
            "Quantity": 6
        }
    ],
    "NumberOfPoints": 6,
    "StatusTypeID": 50,
    "DateLastStatusUpdate": "2020-02-15T09:28:00Z",
    "DataQualityLevel": 1,
    "DateCreated": "2020-02-14T20:55:00Z",
    "SubmissionStatusTypeID": 200
}