{
    "IsRecentlyVerified": false,
    "ID": 102470,
    "UUID": "08C5D3E4-3D93-4BCB-8F45-52F20A4A6DE4",
    "DataProviderID": 2,
    "DataProvidersReference": "94774",
    "UsageTypeID": 1,
    "AddressInfo": {
        "ID": 102816,
        "Title": "Whispering Lakes Golf Couse",
        "AddressLine1": "2525 E Riverside Dr",
        "Town": "Ontario",
        "StateOrProvince": "CA",
        "Postcode": "91761",
        "CountryID": 2,
        "Latitude": 34.021139,
        "Longitude": -117.604535,
        "ContactTelephone1": "866-816-7584",
        "AccessComments": "Business hours",
        "RelatedURL": "http://evconnect.com/",
        "DistanceUnit": 0
    },
    "Connections": [
        {
            "ID": 144551,
            "ConnectionTypeID": 1,
            "LevelID": 2,
            "Amps": 16,
            "Voltage": 230,
            "PowerKW": 3,
            "CurrentTypeID": 10,
            "Quantity": 8
        }
    ],
    "DateLastStatusUpdate": "2019-04-06T04:01:00Z",
    "DataQualityLevel": 3,
    "DateCreated": "2018-04-21T04:13:00Z",
    "SubmissionStatusTypeID": 100
}