{
    "IsRecentlyVerified": false,
    "ID": 182543,
    "UUID": "F47A0949-D5C8-40AC-991B-1802B72DEBE3",
    "DataProviderID": 29,
    "DataProvidersReference": "3183",
    "AddressInfo": {
        "ID": 182902,
        "Title": "Bayern-und-Sachsen-Straße 1 z",
        "AddressLine1": "Bayern-und-Sachsen-Straße 1 z",
        "Town": "Riesa",
        "Postcode": "01589",
        "CountryID": 87,
        "Latitude": 51.293906,
        "Longitude": 13.2946,
        "DistanceUnit": 0
    },
    "Connections": [
        {
            "ID": 288425,
            "ConnectionTypeID": 25,
            "StatusTypeID": 50,
            "LevelID": 2,
            "PowerKW": 22,
            "CurrentTypeID": 20
        },
        {
            "ID": 288426,
            "ConnectionTypeID": 25,
            "StatusTypeID": 50,
            "LevelID": 2,
            "PowerKW": 22,
            "CurrentTypeID": 20
        }
    ],
    "StatusTypeID": 50,
    "DateLastStatusUpdate": "2021-07-09T03:23:00Z",
    "MetadataValues": [
        {
            "ID": 14836,
            "MetadataFieldID": 4,
            "ItemValue": "Data from the German chargepoint registry provided by Bundesnetzagentur.de under the CC-BY 4.0 license"
        }
    ],
    "DataQualityLevel": 3,
    "DateCreated": "2021-07-08T10:03:00Z",
    "SubmissionStatusTypeID": 100
}