{
    "IsRecentlyVerified": false,
    "ID": 181355,
    "UUID": "135E8C78-96DC-42BF-8E63-D6FB93C2F56A",
    "DataProviderID": 29,
    "DataProvidersReference": "17045",
    "AddressInfo": {
        "ID": 181714,
        "Title": "Am Steigerturm 14",
        "AddressLine1": "Am Steigerturm 14",
        "Town": "Hameln",
        "Postcode": "31785",
        "CountryID": 87,
        "Latitude": 52.108242,
        "Longitude": 9.362776,
        "DistanceUnit": 0
    },
    "Connections": [
        {
            "ID": 285562,
            "ConnectionTypeID": 25,
            "StatusTypeID": 50,
            "LevelID": 2,
            "PowerKW": 22,
            "CurrentTypeID": 20
        },
        {
            "ID": 285563,
            "ConnectionTypeID": 25,
            "StatusTypeID": 50,
            "LevelID": 2,
            "PowerKW": 22,
            "CurrentTypeID": 20
        },
        {
            "ID": 300185,
            "ConnectionTypeID": 25,
            "StatusTypeID": 50,
            "LevelID": 2,
            "PowerKW": 22,
            "CurrentTypeID": 20
        },
        {
            "ID": 300186,
            "ConnectionTypeID": 25,
            "StatusTypeID": 50,
            "LevelID": 2,
            "PowerKW": 22,
            "CurrentTypeID": 20
        }
    ],
    "StatusTypeID": 50,
    "DateLastStatusUpdate": "2021-07-12T02:49:00Z",
    "MetadataValues": [
        {
            "ID": 13649,
            "MetadataFieldID": 4,
            "ItemValue": "Data from the German chargepoint registry provided by Bundesnetzagentur.de under the CC-BY 4.0 license"
        }
    ],
    "DataQualityLevel": 3,
    "DateCreated": "2021-07-08T10:01:00Z",
    "SubmissionStatusTypeID": 100
}