{
    "IsRecentlyVerified": false,
    "ID": 136845,
    "UUID": "80AFFF7D-B17A-4D6F-90DF-75642DA3EAFA",
    "DataProviderID": 18,
    "DataProvidersReference": "76a46febd7bd778ef507650bccb2c2b7",
    "UsageTypeID": 1,
    "AddressInfo": {
        "ID": 137191,
        "Title": "85 Marble Arch Road",
        "AddressLine1": "85 Marble Arch Road",
        "Town": "Enniskillen",
        "Postcode": "BT92 1EW",
        "CountryID": 1,
        "Latitude": 54.470137,
        "Longitude": -7.640219,
        "AccessComments": "",
        "RelatedURL": "https://www.drdni.gov.uk/",
        "DistanceUnit": 0
    },
    "Connections": [
        {
            "ID": 191494,
            "ConnectionTypeID": 25,
            "Reference": "1",
            "StatusTypeID": 50,
            "LevelID": 2,
            "Amps": 32,
            "Voltage": 230,
            "PowerKW": 7,
            "CurrentTypeID": 10
        },
        {
            "ID": 191495,
            "ConnectionTypeID": 25,
            "Reference": "2",
            "StatusTypeID": 50,
            "LevelID": 2,
            "Amps": 32,
            "Voltage": 230,
            "PowerKW": 7,
            "CurrentTypeID": 10
        }
    ],
    "StatusTypeID": 0,
    "DateLastStatusUpdate": "2020-03-17T08:54:00Z",
    "MetadataValues": [
        {
            "ID": 6697,
            "MetadataFieldID": 4,
            "ItemValue": "Contains public sector information licensed under the Open Government Licence v2.0. http://www.nationalarchives.gov.uk/doc/open-government-licence/version/2/"
        }
    ],
    "DataQualityLevel": 3,
    "DateCreated": "2019-12-24T05:23:00Z",
    "SubmissionStatusTypeID": 100
}