{
    "IsRecentlyVerified": false,
    "ID": 46936,
    "UUID": "AAFDE8C2-C7D8-4D97-92BD-3DE341C0F8E3",
    "DataProviderID": 2,
    "DataProvidersReference": "67051",
    "OperatorID": 5,
    "UsageTypeID": 1,
    "AddressInfo": {
        "ID": 47282,
        "Title": "DEER PARK",
        "AddressLine1": "152 The Arches Cir",
        "Town": "Deer Park",
        "StateOrProvince": "NY",
        "Postcode": "11729",
        "CountryID": 2,
        "Latitude": 40.764866,
        "Longitude": -73.30495,
        "ContactTelephone1": "888-758-4389",
        "AccessComments": "24 hours daily",
        "RelatedURL": "http://www.chargepoint.com/",
        "DistanceUnit": 0
    },
    "Connections": [
        {
            "ID": 57756,
            "ConnectionTypeID": 1,
            "LevelID": 2,
            "Amps": 16,
            "Voltage": 230,
            "PowerKW": 3,
            "CurrentTypeID": 10,
            "Quantity": 12
        }
    ],
    "DateLastStatusUpdate": "2019-12-24T09:17:00Z",
    "DataQualityLevel": 3,
    "DateCreated": "2015-05-11T08:54:00Z",
    "SubmissionStatusTypeID": 100
}