{
    "IsRecentlyVerified": false,
    "ID": 184898,
    "UUID": "2B6B9574-3127-43E7-942D-15FE98DF022C",
    "DataProviderID": 29,
    "DataProvidersReference": "7799",
    "OperatorID": 189,
    "AddressInfo": {
        "ID": 185257,
        "Title": "Neufahrner Straße 45",
        "AddressLine1": "Neufahrner Straße 45",
        "Town": "Rottenburg",
        "Postcode": "84056",
        "CountryID": 87,
        "Latitude": 48.702157,
        "Longitude": 12.039256,
        "DistanceUnit": 0
    },
    "Connections": [
        {
            "ID": 293739,
            "ConnectionTypeID": 25,
            "StatusTypeID": 50,
            "LevelID": 2,
            "PowerKW": 22,
            "CurrentTypeID": 20
        },
        {
            "ID": 293740,
            "ConnectionTypeID": 25,
            "StatusTypeID": 50,
            "LevelID": 2,
            "PowerKW": 22,
            "CurrentTypeID": 20
        }
    ],
    "StatusTypeID": 50,
    "DateLastStatusUpdate": "2021-07-12T02:41:00Z",
    "MetadataValues": [
        {
            "ID": 17189,
            "MetadataFieldID": 4,
            "ItemValue": "Data from the German chargepoint registry provided by Bundesnetzagentur.de under the CC-BY 4.0 license"
        }
    ],
    "DataQualityLevel": 3,
    "DateCreated": "2021-07-08T10:06:00Z",
    "SubmissionStatusTypeID": 100
}