{
    "UserComments": [
        {
            "ID": 14687,
            "ChargePointID": 9501,
            "CommentTypeID": 10,
            "UserName": "Someone_Just_",
            "Comment": "Still not replaced",
            "Rating": 1,
            "DateCreated": "2016-12-11T20:25:14.943Z",
            "User": {
                "ID": 1107,
                "Username": "Someone_Just_"
            },
            "CheckinStatusTypeID": 200
        },
        {
            "ID": 8231,
            "ChargePointID": 9501,
            "CommentTypeID": 10,
            "UserName": "Someone_Just_",
            "Comment": "Charger is gone ... No info....",
            "Rating": 1,
            "DateCreated": "2015-12-15T20:41:47.78Z",
            "User": {
                "ID": 1107,
                "Username": "Someone_Just_"
            },
            "CheckinStatusTypeID": 50
        },
        {
            "ID": 3930,
            "ChargePointID": 9501,
            "CommentTypeID": 10,
            "UserName": "Someone_Just_",
            "Comment": "Was iced, but still managed to get my charge.",
            "Rating": 3,
            "DateCreated": "2015-03-05T19:21:13.627Z",
            "User": {
                "ID": 1107,
                "Username": "Someone_Just_"
            },
            "CheckinStatusTypeID": 10
        },
        {
            "ID": 691,
            "ChargePointID": 9501,
            "CommentTypeID": 10,
            "UserName": "Someone_Just_",
            "Comment": "Working fine",
            "Rating": 5,
            "DateCreated": "2014-03-12T21:56:17.987Z",
            "User": {
                "ID": 1107,
                "Username": "Someone_Just_"
            },
            "CheckinStatusTypeID": 10
        }
    ],
    "MediaItems": [
        {
            "ID": 3620,
            "ChargePointID": 9501,
            "ItemURL": "https://s3-ap-southeast-2.amazonaws.com/openchargemap/images/BE/OCM9501/OCM-9501.orig.2015121520404383.jpg",
            "ItemThumbnailURL": "https://s3-ap-southeast-2.amazonaws.com/openchargemap/images/BE/OCM9501/OCM-9501.thmb.2015121520404383.jpg",
            "Comment": "Charger gone ...",
            "IsEnabled": true,
            "IsVideo": false,
            "IsFeaturedItem": false,
            "IsExternalResource": false,
            "User": {
                "ID": 1107,
                "Username": "Someone_Just_"
            },
            "DateCreated": "2015-12-15T20:41:00Z"
        },
        {
            "ID": 76,
            "ChargePointID": 9501,
            "ItemURL": "https://s3-ap-southeast-2.amazonaws.com/openchargemap/images/BE/OCM9501/OCM-9501.orig.2013083020464551.jpg",
            "ItemThumbnailURL": "https://s3-ap-southeast-2.amazonaws.com/openchargemap/images/BE/OCM9501/OCM-9501.thmb.2013083020464551.jpg",
            "Comment": "",
            "IsEnabled": true,
            "IsVideo": false,
            "IsFeaturedItem": false,
            "IsExternalResource": false,
            "User": {
                "ID": 1107,
                "Username": "Someone_Just_"
            },
            "DateCreated": "2013-08-30T20:47:00Z"
        },
        {
            "ID": 75,
            "ChargePointID": 9501,
            "ItemURL": "https://s3-ap-southeast-2.amazonaws.com/openchargemap/images/BE/OCM9501/OCM-9501.orig.2013083020404406.jpg",
            "ItemThumbnailURL": "https://s3-ap-southeast-2.amazonaws.com/openchargemap/images/BE/OCM9501/OCM-9501.thmb.2013083020404406.jpg",
            "Comment": "Dode needed for paying charge by SMS: ANTE7",
            "IsEnabled": true,
            "IsVideo": false,
            "IsFeaturedItem": false,
            "IsExternalResource": false,
            "User": {
                "ID": 1107,
                "Username": "Someone_Just_"
            },
            "DateCreated": "2013-08-30T20:41:00Z"
        }
    ],
    "IsRecentlyVerified": false,
    "ID": 9501,
    "UUID": "10CE519E-7320-4BC7-9D66-8C73C4F4F65A",
    "DataProviderID": 1,
    "OperatorID": 35,
    "UsageTypeID": 1,
    "UsageCost": "Pay by SMS or buy a card.",
    "AddressInfo": {
        "ID": 9398,
        "Title": "Maurice Dequeeckerplein 2",
        "AddressLine1": "Maurice Dequeeckerplein 2",
        "Town": "Deurne",
        "CountryID": 26,
        "Latitude": 51.218867121726994,
        "Longitude": 4.460423882907416,
        "ContactTelephone1": "+32 (0)3 727 16 60",
        "ContactEmail": "info@gapa.antwerpen.be",
        "RelatedURL": "http://www.parkereninantwerpen.be/publieke-oplaadpalen",
        "DistanceUnit": 0
    },
    "Connections": [
        {
            "ID": 23097,
            "ConnectionTypeID": 23,
            "StatusTypeID": 50,
            "LevelID": 2,
            "Amps": 16,
            "Voltage": 220,
            "PowerKW": 3.5,
            "CurrentTypeID": 10,
            "Quantity": 1
        }
    ],
    "NumberOfPoints": 1,
    "GeneralComments": "Er zijn 3 manieren om op te laden: 1. Sms (beschikbaar voor alle Belgische gsm-providers; 0,15 euro per verzonden/ontvangen sms) Opladen starten: u stuurt een bericht met het nummer van de paal, gevolgd door een spatie en uw volledige nummerplaat (zonder spaties) naar 4242. Opladen stoppen: u stuurt een bericht met ‘Q' naar 4242. 2. QR-Code (beschikbaar voor alle Belgische gsm-providers; 0,15 euro per verzonden/ontvangen sms) Opladen starten: u scant de QR-code op de paal, waarna u via de 4242 applicatie het opladen eenvoudig kan starten door uw nummerplaat in te geven. Opladen stoppen: ‘Stop' aanklikken in de 4242 applicatie. Deze applicatie is al beschikbaar voor de Android-markt, eind januari 2012 volgt de iPhone App Store. 3. Badge (te koop bij het Parkeerbedrijf voor 20 euro) Opladen starten en stoppen: kaart tegen de kaartlezer houden. (geen kosten) De stopcontacten op de palen zijn van het ‘type E'. http://electricaloutlet.org/type-e",
    "StatusTypeID": 50,
    "DateLastStatusUpdate": "2016-12-11T20:25:00Z",
    "DataQualityLevel": 1,
    "DateCreated": "2012-02-15T10:58:00Z",
    "SubmissionStatusTypeID": 200
}