{
    "IsRecentlyVerified": false,
    "ID": 77143,
    "UUID": "40BEA43D-1DAC-485E-8174-870223A3CD6A",
    "DataProviderID": 1,
    "OperatorID": 86,
    "UsageTypeID": 4,
    "AddressInfo": {
        "ID": 77489,
        "Title": "Rasthof Ob der Tauber Ost",
        "AddressLine1": "A81",
        "Town": "Grünsfeld",
        "StateOrProvince": "Main-Tauber-Kreis",
        "Postcode": "97947",
        "CountryID": 87,
        "Latitude": 49.62192228113008,
        "Longitude": 9.72971561204225,
        "ContactTelephone1": "+49 721 72586 001",
        "AccessComments": "24/7 nutzbar",
        "RelatedURL": "http://www.enbw.com/privatkunden/energie-und-zukunft/e-mobilitaet/ladestationen",
        "DistanceUnit": 0
    },
    "Connections": [
        {
            "ID": 110820,
            "ConnectionTypeID": 2,
            "StatusTypeID": 50,
            "LevelID": 3,
            "PowerKW": 50,
            "CurrentTypeID": 30,
            "Quantity": 1
        },
        {
            "ID": 110821,
            "ConnectionTypeID": 33,
            "StatusTypeID": 50,
            "LevelID": 3,
            "PowerKW": 50,
            "CurrentTypeID": 30,
            "Quantity": 2
        },
        {
            "ID": 110822,
            "ConnectionTypeID": 1036,
            "StatusTypeID": 50,
            "LevelID": 3,
            "Amps": 63,
            "Voltage": 400,
            "PowerKW": 43,
            "CurrentTypeID": 20,
            "Quantity": 2
        }
    ],
    "NumberOfPoints": 5,
    "StatusTypeID": 50,
    "DateLastStatusUpdate": "2017-01-04T06:36:00Z",
    "DataQualityLevel": 1,
    "DateCreated": "2017-01-04T06:36:00Z",
    "SubmissionStatusTypeID": 200
}