{
    "IsRecentlyVerified": false,
    "ID": 149716,
    "UUID": "C5C966F1-7108-492C-BC27-FCAF939BFEE3",
    "DataProviderID": 1,
    "OperatorID": 3323,
    "UsageTypeID": 4,
    "AddressInfo": {
        "ID": 150069,
        "Title": "ZES - Bamboo AVM Nazilli",
        "AddressLine1": "İsabeyli Mah. 11. Cad. No: 34-3/C Nazilli/Aydın",
        "Town": "Nazilli",
        "CountryID": 229,
        "Latitude": 37.89807935587669,
        "Longitude": 28.278227819769995,
        "AccessComments": "Available 7/24. Located opposite the Migros parking lot",
        "RelatedURL": "http://www.zes.net",
        "DistanceUnit": 0
    },
    "Connections": [
        {
            "ID": 207856,
            "ConnectionTypeID": 25,
            "StatusTypeID": 50,
            "LevelID": 2,
            "Amps": 32,
            "Voltage": 400,
            "PowerKW": 22,
            "CurrentTypeID": 20,
            "Quantity": 2
        }
    ],
    "NumberOfPoints": 2,
    "GeneralComments": "New, clean, fast energy of the Turkey roads. Download ZES Mobile App to apply and then you can easily find the nearest charging station and get their information.",
    "StatusTypeID": 50,
    "DateLastStatusUpdate": "2020-03-04T20:38:00Z",
    "DataQualityLevel": 1,
    "DateCreated": "2020-03-04T20:38:00Z",
    "SubmissionStatusTypeID": 200
}