{
    "IsRecentlyVerified": false,
    "ID": 181022,
    "UUID": "B3615D37-5CD5-412D-9C70-DA836AE78183",
    "DataProviderID": 29,
    "DataProvidersReference": "5990",
    "AddressInfo": {
        "ID": 181381,
        "Title": "Holdenstedter Str. 64",
        "AddressLine1": "Holdenstedter Str. 64",
        "Town": "Uelzen / Holdenstedt",
        "Postcode": "29525",
        "CountryID": 87,
        "Latitude": 52.926834,
        "Longitude": 10.52761,
        "DistanceUnit": 0
    },
    "Connections": [
        {
            "ID": 284819,
            "ConnectionTypeID": 33,
            "StatusTypeID": 50,
            "LevelID": 3,
            "PowerKW": 150,
            "CurrentTypeID": 30
        },
        {
            "ID": 284820,
            "ConnectionTypeID": 2,
            "StatusTypeID": 50,
            "LevelID": 3,
            "PowerKW": 150,
            "CurrentTypeID": 30
        },
        {
            "ID": 300999,
            "ConnectionTypeID": 1036,
            "StatusTypeID": 50,
            "LevelID": 3,
            "PowerKW": 43,
            "CurrentTypeID": 20
        },
        {
            "ID": 301000,
            "ConnectionTypeID": 25,
            "StatusTypeID": 50,
            "LevelID": 2,
            "PowerKW": 22,
            "CurrentTypeID": 20
        }
    ],
    "StatusTypeID": 50,
    "DateLastStatusUpdate": "2021-07-12T02:50:00Z",
    "MetadataValues": [
        {
            "ID": 13316,
            "MetadataFieldID": 4,
            "ItemValue": "Data from the German chargepoint registry provided by Bundesnetzagentur.de under the CC-BY 4.0 license"
        }
    ],
    "DataQualityLevel": 3,
    "DateCreated": "2021-07-08T10:01:00Z",
    "SubmissionStatusTypeID": 100
}