{
    "IsRecentlyVerified": false,
    "ID": 162613,
    "UUID": "966B63F8-6E67-4164-9EA9-9707A456DE5A",
    "DataProviderID": 1,
    "OperatorID": 21,
    "UsageTypeID": 4,
    "UsageCost": "Mobi.E compatible card",
    "AddressInfo": {
        "ID": 162970,
        "Title": "OER-00014",
        "AddressLine1": "Rainbow",
        "Town": "Carnaxide",
        "StateOrProvince": "Lisboa",
        "Postcode": "2790",
        "CountryID": 180,
        "Latitude": 38.72282184615719,
        "Longitude": -9.247125868958165,
        "AccessComments": "Down the ramp on the back of Rainbow offices",
        "DistanceUnit": 0
    },
    "Connections": [
        {
            "ID": 234050,
            "ConnectionTypeID": 25,
            "StatusTypeID": 50,
            "LevelID": 2,
            "Amps": 32,
            "Voltage": 400,
            "PowerKW": 22,
            "CurrentTypeID": 20,
            "Quantity": 2
        }
    ],
    "NumberOfPoints": 2,
    "StatusTypeID": 50,
    "DateLastStatusUpdate": "2020-08-12T13:36:00Z",
    "DataQualityLevel": 1,
    "DateCreated": "2020-08-12T13:36:00Z",
    "SubmissionStatusTypeID": 200
}