{
    "IsRecentlyVerified": false,
    "ID": 139699,
    "UUID": "0AB70BCA-642A-4781-9533-B8DD2BDAB2B3",
    "DataProviderID": 2,
    "DataProvidersReference": "143118",
    "OperatorID": 59,
    "UsageTypeID": 1,
    "AddressInfo": {
        "ID": 140051,
        "Title": "Greenlots - 12292A",
        "AddressLine1": "248 E 9TH ST",
        "Town": "Los Angeles",
        "StateOrProvince": "CA",
        "Postcode": "90015",
        "CountryID": 2,
        "Latitude": 34.0403442382812,
        "Longitude": -118.253791809082,
        "ContactTelephone1": "855-900-7584",
        "AccessComments": "24 hours daily",
        "RelatedURL": "http://greenlots.com/",
        "DistanceUnit": 0
    },
    "Connections": [
        {
            "ID": 195140,
            "ConnectionTypeID": 1,
            "LevelID": 2,
            "Amps": 16,
            "Voltage": 230,
            "PowerKW": 3.7,
            "CurrentTypeID": 10,
            "Quantity": 1
        }
    ],
    "StatusTypeID": 50,
    "DateLastStatusUpdate": "2020-06-26T02:56:00Z",
    "DataQualityLevel": 3,
    "DateCreated": "2019-12-24T09:11:00Z",
    "SubmissionStatusTypeID": 100
}