{
    "IsRecentlyVerified": false,
    "ID": 160198,
    "UUID": "D4B112A8-F321-4810-9960-9E5A5FF6AFD1",
    "DataProviderID": 2,
    "DataProvidersReference": "158072",
    "UsageTypeID": 2,
    "AddressInfo": {
        "ID": 160555,
        "Title": "Waypoint Convenience Keelsdale",
        "AddressLine1": "15 Photography Dr",
        "Town": "Toronto",
        "StateOrProvince": "ON",
        "Postcode": "M6M 0A1",
        "CountryID": 44,
        "Latitude": 43.6862558,
        "Longitude": -79.4825385,
        "ContactTelephone1": "",
        "AccessComments": "",
        "RelatedURL": "",
        "DistanceUnit": 0
    },
    "Connections": [
        {
            "ID": 230467,
            "ConnectionTypeID": 2,
            "LevelID": 3,
            "Amps": 100,
            "Voltage": 400,
            "PowerKW": 40,
            "CurrentTypeID": 30,
            "Quantity": 1
        },
        {
            "ID": 230468,
            "ConnectionTypeID": 32,
            "LevelID": 3,
            "Amps": 100,
            "Voltage": 400,
            "PowerKW": 40,
            "CurrentTypeID": 30,
            "Quantity": 1
        }
    ],
    "GeneralComments": "Planned for future date. Not Operational.",
    "DatePlanned": "2020-09-01T00:00:00Z",
    "StatusTypeID": 150,
    "DateLastStatusUpdate": "2020-06-26T03:07:00Z",
    "DataQualityLevel": 3,
    "DateCreated": "2020-06-26T03:07:00Z",
    "SubmissionStatusTypeID": 100
}