{
    "IsRecentlyVerified": false,
    "ID": 45607,
    "UUID": "3778D524-749F-4402-BAFD-5D9242F1FCDD",
    "DataProviderID": 1,
    "DataProvidersReference": "2321",
    "AddressInfo": {
        "ID": 45953,
        "Title": "Stortorget",
        "AddressLine1": "Stortorget ",
        "Town": "FALKENBERG",
        "StateOrProvince": "HALLAND",
        "Postcode": "31130",
        "CountryID": 216,
        "Latitude": 56.90516,
        "Longitude": 12.49093,
        "AccessComments": "Sydvästra sidan av Stortorget mot Arvidstorpsvägen.",
        "DistanceUnit": 0
    },
    "Connections": [
        {
            "ID": 56270,
            "ConnectionTypeID": 0,
            "Reference": "1",
            "LevelID": 2,
            "Amps": 16,
            "Voltage": 230,
            "PowerKW": 3.7
        },
        {
            "ID": 87801,
            "ConnectionTypeID": 0,
            "Reference": "2",
            "LevelID": 2,
            "Amps": 32,
            "Voltage": 400,
            "PowerKW": 22
        }
    ],
    "NumberOfPoints": 2,
    "DateLastStatusUpdate": "2020-05-26T08:21:00Z",
    "DataQualityLevel": 2,
    "DateCreated": "2015-05-03T00:54:00Z",
    "SubmissionStatusTypeID": 100
}