{
    "IsRecentlyVerified": false,
    "ID": 48078,
    "UUID": "D3C47491-03A9-44D4-A8F7-A507B6B3F17C",
    "DataProviderID": 2,
    "DataProvidersReference": "67872",
    "UsageTypeID": 2,
    "AddressInfo": {
        "ID": 48424,
        "Title": "Black Forest Ventures",
        "AddressLine1": "2829 Technology Forest Blvd",
        "Town": "The Woodlands",
        "StateOrProvince": "TX",
        "Postcode": "77381",
        "CountryID": 2,
        "Latitude": 30.176773,
        "Longitude": -95.481683,
        "ContactTelephone1": "",
        "AccessComments": "Employee use only",
        "RelatedURL": "",
        "DistanceUnit": 0
    },
    "Connections": [
        {
            "ID": 59432,
            "ConnectionTypeID": 1,
            "LevelID": 2,
            "Amps": 16,
            "Voltage": 230,
            "PowerKW": 3.7,
            "CurrentTypeID": 10,
            "Quantity": 2
        }
    ],
    "DateLastStatusUpdate": "2020-06-26T02:54:00Z",
    "DataQualityLevel": 3,
    "DateCreated": "2015-06-24T11:44:00Z",
    "SubmissionStatusTypeID": 100
}