{
    "IsRecentlyVerified": false,
    "ID": 145919,
    "UUID": "20B36A35-29A6-4A34-9F62-E91F4E25A255",
    "DataProviderID": 1,
    "OperatorID": 80,
    "UsageTypeID": 4,
    "AddressInfo": {
        "ID": 146271,
        "Title": "Parcheggio Peppino Impastato NICHELINO | ENELX",
        "AddressLine1": "Via S. Francesco D'Assisi",
        "Town": "Nichelino",
        "StateOrProvince": "TO",
        "Postcode": "10042",
        "CountryID": 112,
        "Latitude": 44.99928631624687,
        "Longitude": 7.650479687418056,
        "ContactTelephone1": "800.069.850",
        "RelatedURL": "https://www.enelx.com/it/it/emobility",
        "DistanceUnit": 0
    },
    "Connections": [
        {
            "ID": 202790,
            "ConnectionTypeID": 25,
            "StatusTypeID": 50,
            "LevelID": 2,
            "Amps": 32,
            "Voltage": 400,
            "PowerKW": 22,
            "CurrentTypeID": 20,
            "Quantity": 2
        }
    ],
    "NumberOfPoints": 2,
    "StatusTypeID": 50,
    "DateLastStatusUpdate": "2019-12-27T11:15:00Z",
    "DataQualityLevel": 1,
    "DateCreated": "2019-12-27T11:15:00Z",
    "SubmissionStatusTypeID": 200
}