{
    "IsRecentlyVerified": false,
    "ID": 145231,
    "UUID": "410A5D35-82CF-41E0-9C05-B5056334B3C7",
    "DataProviderID": 1,
    "OperatorID": 3375,
    "UsageTypeID": 5,
    "UsageCost": "$15/hr",
    "AddressInfo": {
        "ID": 145583,
        "Title": "Petro-Pass Truck Stop",
        "AddressLine1": "315 Rue Ouellette",
        "Town": "Grand Falls",
        "StateOrProvince": "NB",
        "Postcode": "E3Z 1A6",
        "CountryID": 44,
        "Latitude": 47.0377347,
        "Longitude": -67.7703592,
        "ContactTelephone1": "1 800-668-0220",
        "ContactTelephone2": "506-473-5575",
        "AccessComments": "24 hours daily",
        "RelatedURL": "https://petro-canada.ca/ev",
        "DistanceUnit": 0
    },
    "Connections": [
        {
            "ID": 201851,
            "ConnectionTypeID": 2,
            "StatusTypeID": 50,
            "LevelID": 3,
            "Amps": 250,
            "Voltage": 400,
            "PowerKW": 100,
            "CurrentTypeID": 30,
            "Quantity": 2
        },
        {
            "ID": 201852,
            "ConnectionTypeID": 32,
            "StatusTypeID": 50,
            "LevelID": 3,
            "Amps": 500,
            "Voltage": 400,
            "PowerKW": 200,
            "CurrentTypeID": 30,
            "Quantity": 2
        },
        {
            "ID": 217694,
            "ConnectionTypeID": 1,
            "StatusTypeID": 50,
            "LevelID": 2,
            "Amps": 32,
            "Voltage": 230,
            "PowerKW": 7.2,
            "CurrentTypeID": 10,
            "Quantity": 1
        }
    ],
    "NumberOfPoints": 2,
    "StatusTypeID": 50,
    "DateLastStatusUpdate": "2020-03-17T08:38:00Z",
    "DataQualityLevel": 3,
    "DateCreated": "2019-12-24T09:24:00Z",
    "SubmissionStatusTypeID": 100
}