{
    "IsRecentlyVerified": false,
    "ID": 152373,
    "UUID": "0308F91F-619D-48F2-96A5-E5B102CA9F59",
    "DataProviderID": 28,
    "DataProvidersReference": "FRS1821801",
    "UsageTypeID": 5,
    "AddressInfo": {
        "ID": 152726,
        "Title": "St Just",
        "AddressLine1": "Place de la Mairie - 18340 ST JUST",
        "CountryID": 80,
        "Latitude": 46.9923185,
        "Longitude": 2.509975,
        "AccessComments": "24h/24h",
        "DistanceUnit": 0
    },
    "Connections": [
        {
            "ID": 213297,
            "ConnectionTypeID": 25,
            "StatusTypeID": 50,
            "LevelID": 2,
            "PowerKW": 18,
            "CurrentTypeID": 20
        },
        {
            "ID": 246171,
            "ConnectionTypeID": 25,
            "StatusTypeID": 50,
            "LevelID": 2,
            "PowerKW": 18,
            "CurrentTypeID": 20
        }
    ],
    "GeneralComments": "Borne en service",
    "StatusTypeID": 50,
    "DateLastStatusUpdate": "2020-08-27T05:13:00Z",
    "DataQualityLevel": 2,
    "DateCreated": "2020-03-15T10:53:00Z",
    "SubmissionStatusTypeID": 100
}