{
    "IsRecentlyVerified": false,
    "ID": 179567,
    "UUID": "B904E97D-2F99-406F-899B-377C15EDC202",
    "DataProviderID": 29,
    "DataProvidersReference": "16781",
    "OperatorID": 220,
    "AddressInfo": {
        "ID": 179926,
        "Title": "Großer Schippsee 18",
        "AddressLine1": "Großer Schippsee 18",
        "Town": "Hamburg",
        "Postcode": "21073",
        "CountryID": 87,
        "Latitude": 53.460619,
        "Longitude": 9.98337,
        "DistanceUnit": 0
    },
    "Connections": [
        {
            "ID": 281553,
            "ConnectionTypeID": 28,
            "StatusTypeID": 50,
            "LevelID": 2,
            "PowerKW": 22,
            "CurrentTypeID": 20
        },
        {
            "ID": 281554,
            "ConnectionTypeID": 25,
            "StatusTypeID": 50,
            "LevelID": 2,
            "PowerKW": 22,
            "CurrentTypeID": 20
        },
        {
            "ID": 301337,
            "ConnectionTypeID": 28,
            "StatusTypeID": 50,
            "LevelID": 2,
            "PowerKW": 22,
            "CurrentTypeID": 20
        },
        {
            "ID": 301338,
            "ConnectionTypeID": 25,
            "StatusTypeID": 50,
            "LevelID": 2,
            "PowerKW": 22,
            "CurrentTypeID": 20
        }
    ],
    "StatusTypeID": 50,
    "DateLastStatusUpdate": "2021-07-12T02:51:00Z",
    "MetadataValues": [
        {
            "ID": 11861,
            "MetadataFieldID": 4,
            "ItemValue": "Data from the German chargepoint registry provided by Bundesnetzagentur.de under the CC-BY 4.0 license"
        }
    ],
    "DataQualityLevel": 3,
    "DateCreated": "2021-07-08T09:59:00Z",
    "SubmissionStatusTypeID": 100
}