{
    "IsRecentlyVerified": false,
    "ID": 27770,
    "UUID": "19BF485F-3168-411A-ABCD-F60A1D3BF781",
    "DataProviderID": 2,
    "DataProvidersReference": "51001",
    "UsageTypeID": 1,
    "AddressInfo": {
        "ID": 28116,
        "Title": "University of California Davis - Plug-In Hybrid and Electric Vehicle Research Center",
        "AddressLine1": "1590 Tilia St",
        "Town": "Davis",
        "StateOrProvince": "CA",
        "Postcode": "95616",
        "CountryID": 2,
        "Latitude": 38.54167,
        "Longitude": -121.771,
        "ContactTelephone1": "530-752-2570",
        "AccessComments": "24 hours daily",
        "RelatedURL": "",
        "DistanceUnit": 0
    },
    "Connections": [
        {
            "ID": 30484,
            "ConnectionTypeID": 1,
            "LevelID": 2,
            "Amps": 16,
            "Voltage": 230,
            "PowerKW": 3,
            "CurrentTypeID": 10,
            "Quantity": 5
        }
    ],
    "DateLastStatusUpdate": "2019-04-06T04:03:00Z",
    "DataQualityLevel": 3,
    "DateCreated": "2014-11-28T03:38:00Z",
    "SubmissionStatusTypeID": 100
}