{
    "IsRecentlyVerified": false,
    "ID": 51912,
    "UUID": "DDAC8EA8-A6CE-4BF7-B4D5-0BB0B1FD77E3",
    "DataProviderID": 2,
    "DataProvidersReference": "68815",
    "OperatorID": 5,
    "UsageTypeID": 1,
    "AddressInfo": {
        "ID": 52258,
        "Title": "MTA",
        "AddressLine1": "7012 Muirkirk Rd",
        "Town": "Beltsville",
        "StateOrProvince": "MD",
        "Postcode": "20705",
        "CountryID": 2,
        "Latitude": 39.062138,
        "Longitude": -76.884533,
        "ContactTelephone1": "888-758-4389",
        "AccessComments": "24 hours daily",
        "RelatedURL": "http://www.chargepoint.com/",
        "DistanceUnit": 0
    },
    "Connections": [
        {
            "ID": 64394,
            "ConnectionTypeID": 1,
            "LevelID": 2,
            "Amps": 16,
            "Voltage": 230,
            "PowerKW": 3,
            "CurrentTypeID": 10,
            "Quantity": 2
        }
    ],
    "DateLastStatusUpdate": "2019-12-24T09:15:00Z",
    "DataQualityLevel": 3,
    "DateCreated": "2015-08-13T03:43:00Z",
    "SubmissionStatusTypeID": 100
}