{
    "IsRecentlyVerified": false,
    "ID": 135705,
    "UUID": "DBCB9E7A-D361-44AC-AC2C-8364276EB377",
    "DataProviderID": 18,
    "DataProvidersReference": "4bc8b6842770af33990ad0f4db3e0a2a",
    "OperatorID": 2244,
    "UsageTypeID": 4,
    "AddressInfo": {
        "ID": 136051,
        "Title": "Bedfont Lane",
        "AddressLine1": "Bedfont Lane",
        "Town": "Feltham",
        "Postcode": "TW14 9BH",
        "CountryID": 1,
        "Latitude": 51.449187,
        "Longitude": -0.414854,
        "AccessComments": "",
        "RelatedURL": "https://www.ubitricity.com",
        "DistanceUnit": 0
    },
    "Connections": [
        {
            "ID": 190119,
            "ConnectionTypeID": 25,
            "Reference": "suby1100000927",
            "StatusTypeID": 50,
            "LevelID": 2,
            "Amps": 16,
            "Voltage": 230,
            "PowerKW": 3.7,
            "CurrentTypeID": 10
        }
    ],
    "StatusTypeID": 0,
    "DateLastStatusUpdate": "2021-04-25T05:46:00Z",
    "MetadataValues": [
        {
            "ID": 5557,
            "MetadataFieldID": 4,
            "ItemValue": "Contains public sector information licensed under the Open Government Licence v2.0. http://www.nationalarchives.gov.uk/doc/open-government-licence/version/2/"
        }
    ],
    "DataQualityLevel": 3,
    "DateCreated": "2019-12-24T05:22:00Z",
    "SubmissionStatusTypeID": 100
}