{
    "IsRecentlyVerified": false,
    "ID": 3507,
    "UUID": "05E1F6E5-03C3-45EC-A236-255BC1BC2901",
    "DataProviderID": 1,
    "UsageTypeID": 1,
    "AddressInfo": {
        "ID": 3508,
        "Title": "Harvey's Car Wash",
        "AddressLine1": "1901 L St.",
        "Town": "Sacramento",
        "StateOrProvince": "CA",
        "Postcode": "95811",
        "CountryID": 2,
        "Latitude": 38.57489,
        "Longitude": -121.482,
        "ContactTelephone1": "650-967-7788",
        "DistanceUnit": 0
    },
    "Connections": [
        {
            "ID": 23,
            "ConnectionTypeID": 1,
            "Quantity": 1
        }
    ],
    "NumberOfPoints": 1,
    "DateLastStatusUpdate": "2019-12-15T06:07:00Z",
    "DateCreated": "2010-02-28T00:00:00Z",
    "SubmissionStatusTypeID": 200
}