{
    "MediaItems": [
        {
            "ID": 26212,
            "ChargePointID": 172129,
            "ItemURL": "https://s3-ap-southeast-2.amazonaws.com/openchargemap/images/IT/OCM172129/OCM-172129.orig.2021011718353057.jpg",
            "ItemThumbnailURL": "https://s3-ap-southeast-2.amazonaws.com/openchargemap/images/IT/OCM172129/OCM-172129.thmb.2021011718353057.jpg",
            "Comment": "",
            "IsEnabled": true,
            "IsVideo": false,
            "IsFeaturedItem": false,
            "IsExternalResource": false,
            "User": {
                "ID": 16306,
                "Username": "e-station"
            },
            "DateCreated": "2021-01-17T18:36:00Z"
        },
        {
            "ID": 26211,
            "ChargePointID": 172129,
            "ItemURL": "https://s3-ap-southeast-2.amazonaws.com/openchargemap/images/IT/OCM172129/OCM-172129.orig.2021011718350303.jpg",
            "ItemThumbnailURL": "https://s3-ap-southeast-2.amazonaws.com/openchargemap/images/IT/OCM172129/OCM-172129.thmb.2021011718350303.jpg",
            "Comment": "",
            "IsEnabled": true,
            "IsVideo": false,
            "IsFeaturedItem": false,
            "IsExternalResource": false,
            "User": {
                "ID": 16306,
                "Username": "e-station"
            },
            "DateCreated": "2021-01-17T18:35:00Z"
        }
    ],
    "IsRecentlyVerified": false,
    "ID": 172129,
    "UUID": "142AEEB2-EEB0-40F7-99AF-F62A6893430C",
    "DataProviderID": 1,
    "OperatorID": 45,
    "UsageTypeID": 4,
    "AddressInfo": {
        "ID": 172488,
        "Title": "Hotel Ambassador Tortoreto Lido",
        "AddressLine1": "Lungomare Sirena 594",
        "Town": "Tortoreto Lido",
        "StateOrProvince": "TE",
        "Postcode": "64018",
        "CountryID": 112,
        "Latitude": 42.789175680539614,
        "Longitude": 13.949264586017648,
        "ContactTelephone1": "0861 777399",
        "RelatedURL": "http://www.hotelambassador.it",
        "DistanceUnit": 0
    },
    "Connections": [
        {
            "ID": 263089,
            "ConnectionTypeID": 25,
            "StatusTypeID": 50,
            "LevelID": 2,
            "Amps": 32,
            "Voltage": 400,
            "PowerKW": 22,
            "CurrentTypeID": 20,
            "Quantity": 2,
            "Comments": "n. 2 prese Tipo 2, 22 kW (32A 400V) ciascuna, gratuite per i clienti. n. 2 Type 2 sockets, 22 kW (32A 400V) each, free of charge for customers."
        }
    ],
    "NumberOfPoints": 2,
    "StatusTypeID": 50,
    "DateLastStatusUpdate": "2021-01-20T16:10:00Z",
    "DataQualityLevel": 1,
    "DateCreated": "2021-01-17T18:33:00Z",
    "SubmissionStatusTypeID": 200
}