{
    "IsRecentlyVerified": false,
    "ID": 115992,
    "UUID": "00A817FD-2FAB-40E8-964C-2DD14BDB98A2",
    "DataProviderID": 2,
    "DataProvidersReference": "104958",
    "OperatorID": 5,
    "UsageTypeID": 1,
    "AddressInfo": {
        "ID": 116338,
        "Title": "LAKE TRUST CU",
        "AddressLine1": "4605 Old US 23",
        "Town": "Brighton",
        "StateOrProvince": "MI",
        "Postcode": "48114",
        "CountryID": 2,
        "Latitude": 42.5354773,
        "Longitude": -83.7550389,
        "ContactTelephone1": "888-758-4389",
        "AccessComments": "24 hours daily",
        "RelatedURL": "http://www.chargepoint.com/",
        "DistanceUnit": 0
    },
    "Connections": [
        {
            "ID": 163048,
            "ConnectionTypeID": 1,
            "LevelID": 2,
            "Amps": 16,
            "Voltage": 230,
            "PowerKW": 3,
            "CurrentTypeID": 10,
            "Quantity": 2
        }
    ],
    "DateLastStatusUpdate": "2019-04-06T05:05:00Z",
    "DataQualityLevel": 3,
    "DateCreated": "2019-02-11T07:13:00Z",
    "SubmissionStatusTypeID": 100
}