{
    "IsRecentlyVerified": false,
    "ID": 99262,
    "UUID": "F239E0BD-9C77-48B8-B3BF-9E339F4BC1C4",
    "DataProviderID": 1,
    "OperatorID": 45,
    "UsageTypeID": 4,
    "AddressInfo": {
        "ID": 99608,
        "Title": "Parkgarage Haus der Geschichte Baden-Württemberg",
        "AddressLine1": "Konrad-Adenauer-Straße 16",
        "Town": "Stuttgart",
        "StateOrProvince": "Stuttgart",
        "Postcode": "70173",
        "CountryID": 87,
        "Latitude": 48.77879,
        "Longitude": 9.18602999999996,
        "AccessComments": "2 Ladeplätze in der unteren Ebene nahe der Ausfahrt rechts. Freischaltung mit Ladekarten der Parkraumgesellschaft Baden-Württemberg mbH",
        "RelatedURL": "http://www.pbw.de/",
        "DistanceUnit": 0
    },
    "Connections": [
        {
            "ID": 140227,
            "ConnectionTypeID": 25,
            "StatusTypeID": 50,
            "LevelID": 2,
            "Amps": 16,
            "Voltage": 400,
            "PowerKW": 11,
            "CurrentTypeID": 20,
            "Quantity": 2
        },
        {
            "ID": 140228,
            "ConnectionTypeID": 28,
            "StatusTypeID": 50,
            "LevelID": 2,
            "Amps": 16,
            "Voltage": 230,
            "PowerKW": 3.7,
            "CurrentTypeID": 10,
            "Quantity": 2
        }
    ],
    "NumberOfPoints": 2,
    "StatusTypeID": 50,
    "DateLastStatusUpdate": "2018-01-25T08:23:00Z",
    "DataQualityLevel": 1,
    "DateCreated": "2018-01-25T08:23:00Z",
    "SubmissionStatusTypeID": 200
}