{
    "IsRecentlyVerified": false,
    "ID": 90974,
    "UUID": "1319BE17-B7C1-4BF6-868C-F0C9B2CE451F",
    "DataProviderID": 1,
    "OperatorID": 23,
    "OperatorsReference": "32359",
    "UsageTypeID": 6,
    "AddressInfo": {
        "ID": 91320,
        "Title": "Europa Grand Hotel",
        "AddressLine1": "Via Carpanini",
        "Town": "1",
        "StateOrProvince": "Lerici",
        "Postcode": "19032",
        "CountryID": 112,
        "Latitude": 44.071936,
        "Longitude": 9.913098,
        "ContactTelephone1": "+39 0187 967 800",
        "DistanceUnit": 0
    },
    "Connections": [
        {
            "ID": 129029,
            "ConnectionTypeID": 30,
            "StatusTypeID": 50,
            "LevelID": 2,
            "Amps": 32,
            "Voltage": 400,
            "PowerKW": 22,
            "CurrentTypeID": 20,
            "Quantity": 1
        }
    ],
    "NumberOfPoints": 1,
    "GeneralComments": "1 Tesla Connector, up to 22kW.Available for patrons only. Please call ahead.",
    "StatusTypeID": 50,
    "DateLastStatusUpdate": "2018-10-03T22:11:00Z",
    "DataQualityLevel": 1,
    "DateCreated": "2017-07-28T05:33:00Z",
    "SubmissionStatusTypeID": 200
}