{
    "IsRecentlyVerified": false,
    "ID": 185107,
    "UUID": "4FB3FCFA-0129-42A8-A0B5-90A0231D3E2F",
    "DataProviderID": 29,
    "DataProvidersReference": "17985",
    "OperatorID": 45,
    "AddressInfo": {
        "ID": 185466,
        "Title": "Alfred-Nobel-Straße 14",
        "AddressLine1": "Alfred-Nobel-Straße 14",
        "Town": "Würzburg-Dürrbachau",
        "Postcode": "97080",
        "CountryID": 87,
        "Latitude": 49.806753,
        "Longitude": 9.891633,
        "DistanceUnit": 0
    },
    "Connections": [
        {
            "ID": 294170,
            "ConnectionTypeID": 25,
            "StatusTypeID": 50,
            "LevelID": 2,
            "PowerKW": 22,
            "CurrentTypeID": 20
        },
        {
            "ID": 294171,
            "ConnectionTypeID": 25,
            "StatusTypeID": 50,
            "LevelID": 2,
            "PowerKW": 22,
            "CurrentTypeID": 20
        }
    ],
    "StatusTypeID": 50,
    "DateLastStatusUpdate": "2021-07-12T02:43:00Z",
    "MetadataValues": [
        {
            "ID": 17398,
            "MetadataFieldID": 4,
            "ItemValue": "Data from the German chargepoint registry provided by Bundesnetzagentur.de under the CC-BY 4.0 license"
        }
    ],
    "DataQualityLevel": 3,
    "DateCreated": "2021-07-08T10:06:00Z",
    "SubmissionStatusTypeID": 100
}