{
    "IsRecentlyVerified": false,
    "ID": 64863,
    "UUID": "62A59212-471B-4498-B3BD-651E6D88768E",
    "DataProviderID": 1,
    "OperatorID": 45,
    "UsageTypeID": 0,
    "UsageCost": "Free",
    "AddressInfo": {
        "ID": 65209,
        "Title": "Stadtwerke Amberg",
        "AddressLine1": "Gasfabrikstrasse 12",
        "Town": "Amberg",
        "StateOrProvince": "Bayern",
        "Postcode": "92224",
        "CountryID": 87,
        "Latitude": 49.4417255,
        "Longitude": 11.8618164,
        "AccessComments": "Auf dem Hof der Stadtwerke. Keine Infos über Zugang und Leistung. Ladesäule ist Teil des Pilotprojekts \"AM Ladepole\".",
        "RelatedURL": "http://www.onetz.de/amberg-in-der-oberpfalz/wirtschaft/oberbuergermeister-michael-cerny-rechts-und-der-aufsichtsrat-der-stadtwerke-informierten-sich-ueber-das-neue-konzept-am-ladepole-samt-neuer-andockstation-im-hof-des-amberger-energieversorgers-das-bild-zeigt-von-links-volker-binner-prokurist-stefan-winkler-geschaeftsfuehrer-dr-stephan-prechtl-rudolf-maier-uli-huebner-prokurist-josef-siegert-michaela-holzner-martin-preuss-ralf-kuhn-und-projektmanager-martin-malitzke-bild-hfz-m239466,24392.html",
        "DistanceUnit": 0
    },
    "Connections": [
        {
            "ID": 83705,
            "ConnectionTypeID": 25,
            "StatusTypeID": 50,
            "LevelID": 2,
            "Amps": 16,
            "Voltage": 400,
            "PowerKW": 11,
            "CurrentTypeID": 20,
            "Quantity": 2
        }
    ],
    "NumberOfPoints": 2,
    "StatusTypeID": 50,
    "DateLastStatusUpdate": "2016-04-05T09:49:00Z",
    "DataQualityLevel": 1,
    "DateCreated": "2016-03-30T04:26:00Z",
    "SubmissionStatusTypeID": 200
}