{
    "IsRecentlyVerified": false,
    "ID": 182125,
    "UUID": "F8D9D60C-4415-47DF-B3CF-3761D4EA69A4",
    "DataProviderID": 29,
    "DataProvidersReference": "15436,372",
    "OperatorID": 45,
    "AddressInfo": {
        "ID": 182484,
        "Title": "Raiffeisenstraße 20",
        "AddressLine1": "Raiffeisenstraße 20",
        "Town": "Langenfeld (Rheinland)",
        "Postcode": "40764",
        "CountryID": 87,
        "Latitude": 51.120126,
        "Longitude": 6.924152,
        "DistanceUnit": 0
    },
    "Connections": [
        {
            "ID": 287480,
            "ConnectionTypeID": 33,
            "StatusTypeID": 50,
            "LevelID": 3,
            "PowerKW": 22,
            "CurrentTypeID": 30
        },
        {
            "ID": 287481,
            "ConnectionTypeID": 25,
            "StatusTypeID": 50,
            "LevelID": 2,
            "PowerKW": 11,
            "CurrentTypeID": 20
        },
        {
            "ID": 287482,
            "ConnectionTypeID": 33,
            "StatusTypeID": 50,
            "LevelID": 3,
            "PowerKW": 22,
            "CurrentTypeID": 30
        },
        {
            "ID": 287483,
            "ConnectionTypeID": 25,
            "StatusTypeID": 50,
            "LevelID": 2,
            "PowerKW": 11,
            "CurrentTypeID": 20
        }
    ],
    "StatusTypeID": 50,
    "DateLastStatusUpdate": "2021-07-09T03:22:00Z",
    "MetadataValues": [
        {
            "ID": 14419,
            "MetadataFieldID": 4,
            "ItemValue": "Data from the German chargepoint registry provided by Bundesnetzagentur.de under the CC-BY 4.0 license"
        }
    ],
    "DataQualityLevel": 3,
    "DateCreated": "2021-07-08T10:02:00Z",
    "SubmissionStatusTypeID": 100
}