{
    "IsRecentlyVerified": false,
    "ID": 136329,
    "UUID": "F0239767-D5D4-4956-B587-5138DE1CFB0B",
    "DataProviderID": 18,
    "DataProvidersReference": "2ad8d7208c18f493011f8cf0426d0fad",
    "OperatorID": 2244,
    "UsageTypeID": 5,
    "AddressInfo": {
        "ID": 136675,
        "Title": "Sutherland Avenue",
        "AddressLine1": "Sutherland Avenue",
        "Town": "London",
        "Postcode": "W9 2HQ",
        "CountryID": 1,
        "Latitude": 51.523656,
        "Longitude": -0.192702,
        "AccessComments": "",
        "RelatedURL": "https://www.ubitricity.com",
        "DistanceUnit": 0
    },
    "Connections": [
        {
            "ID": 190769,
            "ConnectionTypeID": 25,
            "Reference": "suby1100002361",
            "StatusTypeID": 50,
            "LevelID": 2,
            "Amps": 16,
            "Voltage": 230,
            "PowerKW": 3.7,
            "CurrentTypeID": 10
        }
    ],
    "StatusTypeID": 0,
    "DateLastStatusUpdate": "2021-04-25T05:46:00Z",
    "MetadataValues": [
        {
            "ID": 6181,
            "MetadataFieldID": 4,
            "ItemValue": "Contains public sector information licensed under the Open Government Licence v2.0. http://www.nationalarchives.gov.uk/doc/open-government-licence/version/2/"
        }
    ],
    "DataQualityLevel": 3,
    "DateCreated": "2019-12-24T05:22:00Z",
    "SubmissionStatusTypeID": 100
}