{
    "IsRecentlyVerified": false,
    "ID": 95597,
    "UUID": "0EF363A7-8C81-40A2-9F61-4ACD3D5E8F55",
    "DataProviderID": 1,
    "OperatorID": 45,
    "UsageTypeID": 5,
    "UsageCost": "0,30€/kWh",
    "AddressInfo": {
        "ID": 95943,
        "Title": "Tankstelle Hummel",
        "AddressLine1": "Großsachsener Straße 4",
        "Town": "Weinheim",
        "StateOrProvince": "Rhein-Neckar-Kreis",
        "Postcode": "69469",
        "CountryID": 87,
        "Latitude": 49.51115249999999,
        "Longitude": 8.729481999999962,
        "AccessComments": "Geöffnet von Mo-Sa 06:45-18:45. Tankstelle hat Aufenthaltsraum mit TV, WLAN und Getränkeautomat.",
        "RelatedURL": "https://www.ladeverbund-frankenplus.de/",
        "DistanceUnit": 0
    },
    "Connections": [
        {
            "ID": 135411,
            "ConnectionTypeID": 25,
            "StatusTypeID": 50,
            "LevelID": 2,
            "Amps": 32,
            "Voltage": 400,
            "PowerKW": 22,
            "CurrentTypeID": 20,
            "Quantity": 1
        }
    ],
    "NumberOfPoints": 1,
    "StatusTypeID": 50,
    "DateLastStatusUpdate": "2017-11-14T06:44:00Z",
    "DataQualityLevel": 1,
    "DateCreated": "2017-11-14T06:44:00Z",
    "SubmissionStatusTypeID": 200
}