{
    "IsRecentlyVerified": false,
    "ID": 123035,
    "UUID": "F5880386-22FB-431F-8548-92BEA3415DED",
    "DataProviderID": 2,
    "DataProvidersReference": "102367",
    "OperatorID": 23,
    "UsageTypeID": 1,
    "AddressInfo": {
        "ID": 123381,
        "Title": "Outlet Shoppes - Oklahoma City - Tesla Supercharger",
        "AddressLine1": "7624 W Reno Ave",
        "Town": "Oklahoma City",
        "StateOrProvince": "OK",
        "Postcode": "73127",
        "CountryID": 2,
        "Latitude": 35.463962,
        "Longitude": -97.649647,
        "ContactTelephone1": "877-798-3752",
        "AccessComments": "24 hours daily; for Tesla use only",
        "RelatedURL": "http://www.teslamotors.com/supercharger",
        "DistanceUnit": 0
    },
    "Connections": [
        {
            "ID": 172971,
            "ConnectionTypeID": 27,
            "LevelID": 2,
            "Amps": 100,
            "Voltage": 400,
            "PowerKW": 40,
            "CurrentTypeID": 10,
            "Quantity": 8
        }
    ],
    "DateLastStatusUpdate": "2019-04-06T05:03:00Z",
    "DataQualityLevel": 3,
    "DateCreated": "2019-04-06T05:03:00Z",
    "SubmissionStatusTypeID": 100
}