{
    "IsRecentlyVerified": false,
    "ID": 20436,
    "UUID": "ED89FF2C-347C-49B1-BEFC-4D1B359C1C32",
    "DataProviderID": 1,
    "OperatorID": 1,
    "UsageTypeID": 0,
    "UsageCost": "",
    "AddressInfo": {
        "ID": 20781,
        "Title": "Sandvik Mining & Construction - Lyon",
        "AddressLine1": "19 Boulevard Maréchal de Lattre de Tassigny",
        "AddressLine2": "",
        "Town": "Meyzieu",
        "StateOrProvince": "",
        "Postcode": "69330",
        "CountryID": 80,
        "Latitude": 45.77457,
        "Longitude": 5.02698,
        "ContactTelephone1": "",
        "ContactTelephone2": "",
        "ContactEmail": "",
        "AccessComments": "Réservé aux clients de l'établissement",
        "RelatedURL": "",
        "DistanceUnit": 0
    },
    "Connections": [],
    "GeneralComments": "",
    "StatusTypeID": 50,
    "DateLastStatusUpdate": "2013-11-13T19:25:00Z",
    "DataQualityLevel": 1,
    "DateCreated": "2013-11-13T11:36:00Z",
    "SubmissionStatusTypeID": 200
}