{
    "IsRecentlyVerified": false,
    "ID": 185534,
    "UUID": "C33E201C-30EF-4B32-8D89-9090F6C81E0A",
    "DataProviderID": 29,
    "DataProvidersReference": "791",
    "AddressInfo": {
        "ID": 185893,
        "Title": "Grellsbüllerstr. 4",
        "AddressLine1": "Grellsbüllerstr. 4",
        "Town": "Humptrup",
        "Postcode": "25923",
        "CountryID": 87,
        "Latitude": 54.86667,
        "Longitude": 8.86667,
        "DistanceUnit": 0
    },
    "Connections": [
        {
            "ID": 295148,
            "ConnectionTypeID": 25,
            "StatusTypeID": 50,
            "LevelID": 2,
            "PowerKW": 22,
            "CurrentTypeID": 20
        }
    ],
    "StatusTypeID": 50,
    "DateLastStatusUpdate": "2021-07-09T03:31:00Z",
    "MetadataValues": [
        {
            "ID": 17825,
            "MetadataFieldID": 4,
            "ItemValue": "Data from the German chargepoint registry provided by Bundesnetzagentur.de under the CC-BY 4.0 license"
        }
    ],
    "DataQualityLevel": 3,
    "DateCreated": "2021-07-08T10:07:00Z",
    "SubmissionStatusTypeID": 100
}