{
    "UserComments": [
        {
            "ID": 9888,
            "ChargePointID": 11870,
            "CommentTypeID": 10,
            "UserName": "PatrickDetige",
            "Comment": "",
            "Rating": 4,
            "DateCreated": "2016-03-07T17:39:58.15Z",
            "User": {
                "ID": 7838,
                "Username": "PatrickDetige"
            },
            "CheckinStatusTypeID": 100
        },
        {
            "ID": 4921,
            "ChargePointID": 11870,
            "CommentTypeID": 10,
            "UserName": "filip.vanrickstal",
            "Comment": "Succesfully charged my Renault Zoe @ 22 kW on 13/07/2015.\r\nThe reserved place is located behind the charging point. Therefore, charging a Zoe requires a long cable if the place before is occupied, which is often the case.",
            "Rating": 5,
            "DateCreated": "2015-07-13T08:36:31.847Z",
            "User": {
                "ID": 1761,
                "Username": "filip.vanrickstal"
            },
            "CheckinStatusTypeID": 10
        }
    ],
    "MediaItems": [
        {
            "ID": 1711,
            "ChargePointID": 11870,
            "ItemURL": "https://s3-ap-southeast-2.amazonaws.com/openchargemap/images/BE/OCM11870/OCM-11870.orig.2015071307450223.jpg",
            "ItemThumbnailURL": "https://s3-ap-southeast-2.amazonaws.com/openchargemap/images/BE/OCM11870/OCM-11870.thmb.2015071307450223.jpg",
            "Comment": "",
            "IsEnabled": true,
            "IsVideo": false,
            "IsFeaturedItem": false,
            "IsExternalResource": false,
            "User": {
                "ID": 1761,
                "Username": "filip.vanrickstal"
            },
            "DateCreated": "2015-07-13T07:45:00Z"
        },
        {
            "ID": 1710,
            "ChargePointID": 11870,
            "ItemURL": "https://s3-ap-southeast-2.amazonaws.com/openchargemap/images/BE/OCM11870/OCM-11870.orig.2015071307440384.jpg",
            "ItemThumbnailURL": "https://s3-ap-southeast-2.amazonaws.com/openchargemap/images/BE/OCM11870/OCM-11870.thmb.2015071307440384.jpg",
            "Comment": "",
            "IsEnabled": true,
            "IsVideo": false,
            "IsFeaturedItem": false,
            "IsExternalResource": false,
            "User": {
                "ID": 1761,
                "Username": "filip.vanrickstal"
            },
            "DateCreated": "2015-07-13T07:44:00Z"
        },
        {
            "ID": 1709,
            "ChargePointID": 11870,
            "ItemURL": "https://s3-ap-southeast-2.amazonaws.com/openchargemap/images/BE/OCM11870/OCM-11870.orig.2015071307430448.jpg",
            "ItemThumbnailURL": "https://s3-ap-southeast-2.amazonaws.com/openchargemap/images/BE/OCM11870/OCM-11870.thmb.2015071307430448.jpg",
            "Comment": "",
            "IsEnabled": true,
            "IsVideo": false,
            "IsFeaturedItem": false,
            "IsExternalResource": false,
            "User": {
                "ID": 1761,
                "Username": "filip.vanrickstal"
            },
            "DateCreated": "2015-07-13T07:43:00Z"
        }
    ],
    "IsRecentlyVerified": false,
    "ID": 11870,
    "UUID": "3E18EBDB-827F-45CE-842F-1772F25818DB",
    "DataProviderID": 1,
    "OperatorID": 36,
    "UsageTypeID": 4,
    "UsageCost": "",
    "AddressInfo": {
        "ID": 11767,
        "Title": "EVA Leuven III",
        "AddressLine1": "Tiensevest 2",
        "AddressLine2": "",
        "Town": "Leuven",
        "StateOrProvince": "",
        "Postcode": "3000",
        "CountryID": 26,
        "Latitude": 50.87960079006076,
        "Longitude": 4.715529925345199,
        "ContactTelephone1": "",
        "ContactTelephone2": "",
        "ContactEmail": "",
        "AccessComments": "",
        "RelatedURL": "http://www.bluecorner.be/",
        "DistanceUnit": 0
    },
    "Connections": [
        {
            "ID": 34638,
            "ConnectionTypeID": 25,
            "StatusTypeID": 50,
            "LevelID": 2,
            "Amps": 32,
            "Voltage": 400,
            "PowerKW": 22,
            "CurrentTypeID": 20,
            "Quantity": 1
        },
        {
            "ID": 34639,
            "ConnectionTypeID": 23,
            "StatusTypeID": 50,
            "LevelID": 2,
            "Amps": 16,
            "Voltage": 230,
            "PowerKW": 3.5,
            "CurrentTypeID": 10,
            "Quantity": 1
        }
    ],
    "NumberOfPoints": 1,
    "GeneralComments": "http://www.bluecorner.be/",
    "StatusTypeID": 50,
    "DateLastStatusUpdate": "2016-03-07T17:40:00Z",
    "DataQualityLevel": 1,
    "DateCreated": "2012-08-17T10:30:00Z",
    "SubmissionStatusTypeID": 200
}