{
    "IsRecentlyVerified": false,
    "ID": 181310,
    "UUID": "8A2C6F27-E8EE-4979-8805-A9D86390D973",
    "DataProviderID": 29,
    "DataProvidersReference": "17888",
    "OperatorID": 3403,
    "AddressInfo": {
        "ID": 181669,
        "Title": "Achter de Weiden 30",
        "AddressLine1": "Achter de Weiden 30",
        "Town": "Schenefeld",
        "Postcode": "22869",
        "CountryID": 87,
        "Latitude": 53.606907,
        "Longitude": 9.829793,
        "DistanceUnit": 0
    },
    "Connections": [
        {
            "ID": 285459,
            "ConnectionTypeID": 1036,
            "StatusTypeID": 50,
            "LevelID": 2,
            "PowerKW": 22,
            "CurrentTypeID": 20
        },
        {
            "ID": 285460,
            "ConnectionTypeID": 33,
            "StatusTypeID": 50,
            "LevelID": 3,
            "PowerKW": 50,
            "CurrentTypeID": 30
        },
        {
            "ID": 302009,
            "ConnectionTypeID": 2,
            "StatusTypeID": 50,
            "LevelID": 3,
            "PowerKW": 50,
            "CurrentTypeID": 30
        }
    ],
    "StatusTypeID": 50,
    "DateLastStatusUpdate": "2021-07-12T02:51:00Z",
    "MetadataValues": [
        {
            "ID": 13604,
            "MetadataFieldID": 4,
            "ItemValue": "Data from the German chargepoint registry provided by Bundesnetzagentur.de under the CC-BY 4.0 license"
        }
    ],
    "DataQualityLevel": 3,
    "DateCreated": "2021-07-08T10:01:00Z",
    "SubmissionStatusTypeID": 100
}