{
    "IsRecentlyVerified": false,
    "ID": 179655,
    "UUID": "C0801166-98C0-400F-A31D-462D09034786",
    "DataProviderID": 29,
    "DataProvidersReference": "14485",
    "AddressInfo": {
        "ID": 180014,
        "Title": "Moseltalstr 40",
        "AddressLine1": "Moseltalstr 40",
        "Town": "Osann-Monzel",
        "Postcode": "54518",
        "CountryID": 87,
        "Latitude": 49.919,
        "Longitude": 6.952,
        "DistanceUnit": 0
    },
    "Connections": [
        {
            "ID": 281749,
            "ConnectionTypeID": 33,
            "StatusTypeID": 50,
            "LevelID": 3,
            "PowerKW": 50,
            "CurrentTypeID": 30
        },
        {
            "ID": 297416,
            "ConnectionTypeID": 25,
            "StatusTypeID": 50,
            "LevelID": 2,
            "PowerKW": 22,
            "CurrentTypeID": 20
        }
    ],
    "StatusTypeID": 50,
    "DateLastStatusUpdate": "2021-07-12T02:44:00Z",
    "MetadataValues": [
        {
            "ID": 11949,
            "MetadataFieldID": 4,
            "ItemValue": "Data from the German chargepoint registry provided by Bundesnetzagentur.de under the CC-BY 4.0 license"
        }
    ],
    "DataQualityLevel": 3,
    "DateCreated": "2021-07-08T09:59:00Z",
    "SubmissionStatusTypeID": 100
}