{
    "IsRecentlyVerified": false,
    "ID": 178663,
    "UUID": "9477A0E0-2FFC-4D9D-9085-3CC570D6F95F",
    "DataProviderID": 29,
    "DataProvidersReference": "3577,12523",
    "AddressInfo": {
        "ID": 179022,
        "Title": "Ittersbacherstr. 1",
        "AddressLine1": "Ittersbacherstr. 1",
        "Town": "Straubenhardt",
        "Postcode": "75334",
        "CountryID": 87,
        "Latitude": 48.854869,
        "Longitude": 8.531453,
        "DistanceUnit": 0
    },
    "Connections": [
        {
            "ID": 279372,
            "ConnectionTypeID": 28,
            "StatusTypeID": 50,
            "LevelID": 2,
            "PowerKW": 22,
            "CurrentTypeID": 10
        },
        {
            "ID": 279373,
            "ConnectionTypeID": 28,
            "StatusTypeID": 50,
            "LevelID": 2,
            "PowerKW": 22,
            "CurrentTypeID": 10
        },
        {
            "ID": 279374,
            "ConnectionTypeID": 28,
            "StatusTypeID": 50,
            "LevelID": 2,
            "PowerKW": 22,
            "CurrentTypeID": 10
        },
        {
            "ID": 279375,
            "ConnectionTypeID": 28,
            "StatusTypeID": 50,
            "LevelID": 2,
            "PowerKW": 22,
            "CurrentTypeID": 10
        }
    ],
    "StatusTypeID": 0,
    "DateLastStatusUpdate": "2021-07-09T03:14:00Z",
    "MetadataValues": [
        {
            "ID": 10957,
            "MetadataFieldID": 4,
            "ItemValue": "Data from the German chargepoint registry provided by Bundesnetzagentur.de under the CC-BY 4.0 license"
        }
    ],
    "DataQualityLevel": 3,
    "DateCreated": "2021-07-08T09:50:00Z",
    "SubmissionStatusTypeID": 100
}