{
    "IsRecentlyVerified": false,
    "ID": 187576,
    "UUID": "208629B9-22F3-460B-AE97-1255645B690A",
    "DataProviderID": 18,
    "DataProvidersReference": "6a9923180d026664453952ecc27c4e68",
    "OperatorID": 3393,
    "UsageTypeID": 1,
    "AddressInfo": {
        "ID": 187935,
        "Title": "Bluebell Railway",
        "AddressLine1": "Bluebell Railway",
        "Town": "Uckfield ",
        "Postcode": "TN22 3QL",
        "CountryID": 1,
        "Latitude": 50.9952,
        "Longitude": 0.00138,
        "AccessComments": "",
        "RelatedURL": "http://www.joju.co.uk/",
        "DistanceUnit": 0
    },
    "Connections": [
        {
            "ID": 302747,
            "ConnectionTypeID": 25,
            "Reference": "ICUEVE900787-1",
            "StatusTypeID": 50,
            "LevelID": 2,
            "Amps": 32,
            "Voltage": 230,
            "PowerKW": 7,
            "CurrentTypeID": 10
        },
        {
            "ID": 302748,
            "ConnectionTypeID": 25,
            "Reference": "ICUEVE900787-2",
            "StatusTypeID": 50,
            "LevelID": 2,
            "Amps": 32,
            "Voltage": 230,
            "PowerKW": 7,
            "CurrentTypeID": 10
        }
    ],
    "StatusTypeID": 0,
    "DateLastStatusUpdate": "2021-07-12T03:38:00Z",
    "MetadataValues": [
        {
            "ID": 19816,
            "MetadataFieldID": 4,
            "ItemValue": "Contains public sector information licensed under the Open Government Licence v2.0. http://www.nationalarchives.gov.uk/doc/open-government-licence/version/2/"
        }
    ],
    "DataQualityLevel": 3,
    "DateCreated": "2021-07-12T03:38:00Z",
    "SubmissionStatusTypeID": 100
}