{
    "IsRecentlyVerified": false,
    "ID": 97014,
    "UUID": "ACE22D68-AA40-4531-AF6C-FF6256028F1B",
    "DataProviderID": 1,
    "DataProvidersReference": "4546",
    "AddressInfo": {
        "ID": 97360,
        "Title": "Åseral kommune",
        "AddressLine1": "Fv352 9-14",
        "Town": "ÅSERAL",
        "StateOrProvince": "Agder",
        "Postcode": "4540",
        "CountryID": 168,
        "Latitude": 58.61642,
        "Longitude": 7.41959,
        "AccessComments": "",
        "DistanceUnit": 0
    },
    "Connections": [
        {
            "ID": 137530,
            "ConnectionTypeID": 0,
            "Reference": "1",
            "LevelID": 2,
            "Amps": 100,
            "Voltage": 500,
            "PowerKW": 50,
            "Comments": "Mode 4"
        },
        {
            "ID": 137531,
            "ConnectionTypeID": 0,
            "Reference": "2",
            "LevelID": 2,
            "Amps": 100,
            "Voltage": 500,
            "PowerKW": 50,
            "Comments": "Mode 4"
        },
        {
            "ID": 137532,
            "ConnectionTypeID": 0,
            "Reference": "3",
            "LevelID": 2,
            "Amps": 32,
            "Voltage": 400,
            "PowerKW": 22,
            "Comments": "Mode 3"
        },
        {
            "ID": 137533,
            "ConnectionTypeID": 0,
            "Reference": "4",
            "LevelID": 2,
            "Amps": 32,
            "Voltage": 400,
            "PowerKW": 22,
            "Comments": "Mode 3"
        }
    ],
    "NumberOfPoints": 4,
    "DateLastStatusUpdate": "2020-05-26T08:22:00Z",
    "DataQualityLevel": 2,
    "DateCreated": "2018-01-04T08:28:00Z",
    "SubmissionStatusTypeID": 100
}