{
    "IsRecentlyVerified": false,
    "ID": 174061,
    "UUID": "761E3BEE-7007-4FC6-AD5B-16835EE198DC",
    "DataProviderID": 1,
    "OperatorID": 1,
    "UsageTypeID": 4,
    "UsageCost": "PCL – até 0,0738 €/min; PCR – 0,1599 €/min",
    "AddressInfo": {
        "ID": 174420,
        "Title": "Continente Viseu",
        "AddressLine1": "Avenida Bélgica 150",
        "Town": "Viseu",
        "Postcode": "3510-159",
        "CountryID": 180,
        "Latitude": 40.67253621611653,
        "Longitude": -7.919210594686319,
        "AccessComments": "09:00-21:00",
        "RelatedURL": "https://plugcharge.continente.pt/",
        "DistanceUnit": 0
    },
    "Connections": [
        {
            "ID": 268657,
            "ConnectionTypeID": 25,
            "StatusTypeID": 50,
            "LevelID": 2,
            "PowerKW": 22,
            "CurrentTypeID": 20,
            "Quantity": 4
        },
        {
            "ID": 268658,
            "ConnectionTypeID": 2,
            "StatusTypeID": 50,
            "LevelID": 3,
            "PowerKW": 48,
            "CurrentTypeID": 30,
            "Quantity": 1
        },
        {
            "ID": 268659,
            "ConnectionTypeID": 33,
            "StatusTypeID": 50,
            "LevelID": 3,
            "PowerKW": 50,
            "CurrentTypeID": 30,
            "Quantity": 1
        }
    ],
    "NumberOfPoints": 5,
    "StatusTypeID": 50,
    "DateLastStatusUpdate": "2021-03-13T21:01:00Z",
    "DataQualityLevel": 1,
    "DateCreated": "2021-03-12T12:03:00Z",
    "SubmissionStatusTypeID": 200
}