{
    "IsRecentlyVerified": false,
    "ID": 79368,
    "UUID": "3FA74BDF-A555-4F1B-866C-BF738070CABF",
    "DataProviderID": 1,
    "OperatorID": 23,
    "OperatorsReference": "19184",
    "UsageTypeID": 6,
    "UsageCost": "Free",
    "AddressInfo": {
        "ID": 79714,
        "Title": "Hampton Inn & Suites Tilton",
        "AddressLine1": "195 Laconia RD",
        "Town": "Tilton",
        "StateOrProvince": "New Hampshire",
        "Postcode": "03276",
        "CountryID": 2,
        "Latitude": 43.442649,
        "Longitude": -71.589209,
        "ContactTelephone1": "(603) 286-3400",
        "DistanceUnit": 0
    },
    "Connections": [
        {
            "ID": 114000,
            "ConnectionTypeID": 30,
            "StatusTypeID": 50,
            "LevelID": 2,
            "PowerKW": 16,
            "CurrentTypeID": 20,
            "Quantity": 1
        }
    ],
    "NumberOfPoints": 1,
    "GeneralComments": "1 Tesla Connector, up to 16kW.Available for patrons only. Please see front desk.",
    "StatusTypeID": 50,
    "DateLastStatusUpdate": "2017-01-28T13:42:00Z",
    "DataQualityLevel": 1,
    "DateCreated": "2017-01-28T13:42:00Z",
    "SubmissionStatusTypeID": 200
}