{
    "IsRecentlyVerified": false,
    "ID": 134092,
    "UUID": "696F1E97-4AC2-4FA5-81B3-0711CCA3B508",
    "DataProviderID": 1,
    "OperatorID": 3315,
    "OperatorsReference": "51682",
    "UsageTypeID": 4,
    "UsageCost": "Free",
    "AddressInfo": {
        "ID": 134438,
        "Title": "Dudley Drive, Glasgow",
        "AddressLine1": "34 Dudley Drive",
        "Town": "Glasgow",
        "Postcode": "G12 9SA",
        "CountryID": 1,
        "Latitude": 55.87787,
        "Longitude": -4.3127,
        "DistanceUnit": 0
    },
    "Connections": [
        {
            "ID": 187631,
            "ConnectionTypeID": 25,
            "StatusTypeID": 50,
            "LevelID": 2,
            "Amps": 32,
            "Voltage": 400,
            "PowerKW": 22,
            "CurrentTypeID": 20,
            "Quantity": 2
        }
    ],
    "NumberOfPoints": 2,
    "StatusTypeID": 50,
    "DateLastStatusUpdate": "2020-01-14T14:43:00Z",
    "DataQualityLevel": 1,
    "DateCreated": "2019-11-03T06:19:00Z",
    "SubmissionStatusTypeID": 200
}