{
    "IsRecentlyVerified": false,
    "ID": 33122,
    "UUID": "D6434D68-5ED0-4482-986E-E987BA09D629",
    "DataProviderID": 1,
    "OperatorID": 105,
    "OperatorsReference": "Essent EM-DE-05154012-01-00001",
    "UsageTypeID": 4,
    "AddressInfo": {
        "ID": 33468,
        "Title": "Markt 25",
        "AddressLine1": "Markt 25",
        "Town": "Geldern",
        "Postcode": "47608",
        "CountryID": 87,
        "Latitude": 51.515833,
        "Longitude": 6.322222,
        "DistanceUnit": 0
    },
    "Connections": [
        {
            "ID": 36633,
            "ConnectionTypeID": 25,
            "LevelID": 2,
            "PowerKW": 11
        },
        {
            "ID": 46689,
            "ConnectionTypeID": 25,
            "LevelID": 2,
            "PowerKW": 11
        }
    ],
    "NumberOfPoints": 1,
    "StatusTypeID": 50,
    "DateLastStatusUpdate": "2015-04-13T05:04:00Z",
    "DataQualityLevel": 3,
    "DateCreated": "2015-01-09T06:04:00Z",
    "SubmissionStatusTypeID": 200
}