{
    "IsRecentlyVerified": false,
    "ID": 137978,
    "UUID": "800E65D0-A9E4-4E82-987A-690FF9599E82",
    "DataProviderID": 2,
    "DataProvidersReference": "95919",
    "OperatorID": 9,
    "UsageTypeID": 1,
    "AddressInfo": {
        "ID": 138327,
        "Title": "Fairview Town Hall",
        "AddressLine1": "372 Town Place",
        "Town": "Fairview",
        "StateOrProvince": "TX",
        "Postcode": "75069",
        "CountryID": 2,
        "Latitude": 33.13232,
        "Longitude": -96.64707,
        "ContactTelephone1": "888-998-2546",
        "AccessComments": "MON: 24 hours | TUE: 24 hours | WED: 24 hours | THU: 24 hours | FRI: 24 hours | SAT: 24 hours | SUN: 24 hours",
        "RelatedURL": "http://www.blinkcharging.com/",
        "DistanceUnit": 0
    },
    "Connections": [
        {
            "ID": 193014,
            "ConnectionTypeID": 1,
            "LevelID": 2,
            "Amps": 16,
            "Voltage": 230,
            "PowerKW": 3,
            "CurrentTypeID": 10,
            "Quantity": 2
        }
    ],
    "StatusTypeID": 50,
    "DateLastStatusUpdate": "2019-12-24T09:06:00Z",
    "DataQualityLevel": 3,
    "DateCreated": "2019-12-24T09:06:00Z",
    "SubmissionStatusTypeID": 100
}