{
    "IsRecentlyVerified": false,
    "ID": 61525,
    "UUID": "B61A636D-D2FD-487D-AE76-487498866C74",
    "DataProviderID": 1,
    "DataProvidersReference": "MTS-00003",
    "OperatorID": 21,
    "UsageTypeID": 4,
    "UsageCost": "Mobi.E compatible card",
    "AddressInfo": {
        "ID": 61871,
        "Title": "MTS-00002/3",
        "AddressLine1": "Mar Shopping",
        "Town": "Matosinhos",
        "StateOrProvince": "Porto",
        "Postcode": "4450-745",
        "CountryID": 180,
        "Latitude": 41.208924,
        "Longitude": -8.687527,
        "AccessComments": "Level -1",
        "RelatedURL": "http://www.mobie.pt",
        "DistanceUnit": 0
    },
    "Connections": [
        {
            "ID": 78406,
            "ConnectionTypeID": 25,
            "StatusTypeID": 50,
            "LevelID": 2,
            "Amps": 32,
            "Voltage": 230,
            "PowerKW": 7.4,
            "CurrentTypeID": 10,
            "Quantity": 4
        }
    ],
    "NumberOfPoints": 4,
    "GeneralComments": "09h00 > 24h00",
    "StatusTypeID": 50,
    "DateLastStatusUpdate": "2020-10-02T18:53:00Z",
    "DataQualityLevel": 3,
    "DateCreated": "2016-03-03T11:20:00Z",
    "SubmissionStatusTypeID": 100
}