{
    "IsRecentlyVerified": false,
    "ID": 143015,
    "UUID": "1EDF8F39-4291-4D65-B840-19B7F85E89A0",
    "DataProviderID": 2,
    "DataProvidersReference": "143221",
    "OperatorID": 5,
    "UsageTypeID": 1,
    "AddressInfo": {
        "ID": 143367,
        "Title": "MOTOWN HARLEY",
        "AddressLine1": "14100 Telegraph Rd",
        "Town": "Taylor",
        "StateOrProvince": "MI",
        "Postcode": "48180",
        "CountryID": 2,
        "Latitude": 42.2041,
        "Longitude": -83.2696242,
        "ContactTelephone1": "888-758-4389",
        "AccessComments": "24 hours daily",
        "RelatedURL": "http://www.chargepoint.com/",
        "DistanceUnit": 0
    },
    "Connections": [
        {
            "ID": 199269,
            "ConnectionTypeID": 32,
            "LevelID": 3,
            "Amps": 100,
            "Voltage": 400,
            "PowerKW": 40,
            "CurrentTypeID": 30,
            "Quantity": 1
        }
    ],
    "StatusTypeID": 50,
    "DateLastStatusUpdate": "2020-06-26T03:05:00Z",
    "DataQualityLevel": 3,
    "DateCreated": "2019-12-24T09:19:00Z",
    "SubmissionStatusTypeID": 100
}