{
    "IsRecentlyVerified": false,
    "ID": 154671,
    "UUID": "EE238C4E-7151-4BFB-956D-4FD98B037B47",
    "DataProviderID": 1,
    "OperatorID": 20,
    "OperatorsReference": "31128",
    "UsageTypeID": 1,
    "UsageCost": "Free",
    "AddressInfo": {
        "ID": 155024,
        "Title": "Coopie's Lane",
        "AddressLine1": "Coopie's Lane",
        "Town": "Morpeth",
        "Postcode": "NE61 2SL",
        "CountryID": 1,
        "Latitude": 55.162166,
        "Longitude": -1.682229,
        "RelatedURL": "http://www.chargeyourcar.org.uk",
        "DistanceUnit": 0
    },
    "Connections": [
        {
            "ID": 217607,
            "ConnectionTypeID": 25,
            "Reference": "31126",
            "StatusTypeID": 50,
            "LevelID": 2,
            "Amps": 32,
            "Voltage": 230,
            "PowerKW": 7,
            "CurrentTypeID": 10,
            "Quantity": 1
        },
        {
            "ID": 217608,
            "ConnectionTypeID": 25,
            "Reference": "31128",
            "StatusTypeID": 50,
            "LevelID": 2,
            "Amps": 32,
            "Voltage": 230,
            "PowerKW": 7,
            "CurrentTypeID": 10
        }
    ],
    "NumberOfPoints": 2,
    "StatusTypeID": 0,
    "DateLastStatusUpdate": "2020-06-03T05:13:00Z",
    "MetadataValues": [
        {
            "ID": 7223,
            "MetadataFieldID": 4,
            "ItemValue": "Contains public sector information licensed under the Open Government Licence v2.0. http://www.nationalarchives.gov.uk/doc/open-government-licence/version/2/"
        }
    ],
    "DataQualityLevel": 3,
    "DateCreated": "2020-03-17T08:15:00Z",
    "SubmissionStatusTypeID": 100
}