{
    "IsRecentlyVerified": false,
    "ID": 168415,
    "UUID": "E1403D11-E67A-44B7-B662-348C56036777",
    "DataProviderID": 1,
    "OperatorID": 80,
    "UsageTypeID": 4,
    "AddressInfo": {
        "ID": 168774,
        "Title": "MONTANO LUCINO  Adda | ENELX",
        "AddressLine1": "Via Adda",
        "Town": "Montano Lucino",
        "StateOrProvince": "CO",
        "Postcode": "22079",
        "CountryID": 112,
        "Latitude": 45.77942337696015,
        "Longitude": 9.040035155257442,
        "RelatedURL": "https://www.enelx.com/it/it/emobility",
        "DistanceUnit": 0
    },
    "Connections": [
        {
            "ID": 255778,
            "ConnectionTypeID": 25,
            "StatusTypeID": 50,
            "LevelID": 2,
            "Amps": 32,
            "Voltage": 400,
            "PowerKW": 22,
            "CurrentTypeID": 20,
            "Quantity": 1
        },
        {
            "ID": 255779,
            "ConnectionTypeID": 36,
            "StatusTypeID": 50,
            "LevelID": 2,
            "Amps": 16,
            "Voltage": 240,
            "PowerKW": 3.7,
            "CurrentTypeID": 10,
            "Quantity": 1
        }
    ],
    "NumberOfPoints": 2,
    "StatusTypeID": 50,
    "DateLastStatusUpdate": "2020-09-25T09:10:00Z",
    "DataQualityLevel": 1,
    "DateCreated": "2020-09-25T09:10:00Z",
    "SubmissionStatusTypeID": 200
}