{
    "IsRecentlyVerified": false,
    "ID": 142054,
    "UUID": "798A7360-C7B9-453D-9803-361CE97A22E6",
    "DataProviderID": 2,
    "DataProvidersReference": "96072",
    "OperatorID": 9,
    "UsageTypeID": 1,
    "AddressInfo": {
        "ID": 142406,
        "Title": "Lankenau Medical Center Parking Garage D",
        "AddressLine1": "100 East Lancaster Avenue",
        "Town": "Wynnewood",
        "StateOrProvince": "PA",
        "Postcode": "19096",
        "CountryID": 2,
        "Latitude": 39.987133,
        "Longitude": -75.263665,
        "ContactTelephone1": "888-998-2546",
        "AccessComments": "MON: 24 hours | TUE: 24 hours | WED: 24 hours | THU: 24 hours | FRI: 24 hours | SAT: 24 hours | SUN: 24 hours",
        "RelatedURL": "http://www.blinkcharging.com/",
        "DistanceUnit": 0
    },
    "Connections": [
        {
            "ID": 198116,
            "ConnectionTypeID": 2,
            "LevelID": 3,
            "Amps": 100,
            "Voltage": 400,
            "PowerKW": 40,
            "CurrentTypeID": 30,
            "Quantity": 2
        }
    ],
    "StatusTypeID": 50,
    "DateLastStatusUpdate": "2020-06-26T03:02:00Z",
    "DataQualityLevel": 3,
    "DateCreated": "2019-12-24T09:17:00Z",
    "SubmissionStatusTypeID": 100
}