{
    "IsRecentlyVerified": false,
    "ID": 186140,
    "UUID": "DE632E3C-D50E-4422-BBBA-597BBAB4FDF9",
    "DataProviderID": 29,
    "DataProvidersReference": "19516",
    "OperatorID": 45,
    "AddressInfo": {
        "ID": 186499,
        "Title": "Geraer Str. 28",
        "AddressLine1": "Geraer Str. 28",
        "Town": "Schleiz",
        "Postcode": "07907",
        "CountryID": 87,
        "Latitude": 50.580827,
        "Longitude": 11.809474,
        "DistanceUnit": 0
    },
    "Connections": [
        {
            "ID": 297926,
            "ConnectionTypeID": 33,
            "StatusTypeID": 50,
            "LevelID": 3,
            "PowerKW": 22,
            "CurrentTypeID": 30
        },
        {
            "ID": 297927,
            "ConnectionTypeID": 25,
            "StatusTypeID": 50,
            "LevelID": 2,
            "PowerKW": 11,
            "CurrentTypeID": 20
        }
    ],
    "StatusTypeID": 50,
    "DateLastStatusUpdate": "2021-07-12T02:45:00Z",
    "MetadataValues": [
        {
            "ID": 18382,
            "MetadataFieldID": 4,
            "ItemValue": "Data from the German chargepoint registry provided by Bundesnetzagentur.de under the CC-BY 4.0 license"
        }
    ],
    "DataQualityLevel": 3,
    "DateCreated": "2021-07-12T02:45:00Z",
    "SubmissionStatusTypeID": 100
}