{
    "IsRecentlyVerified": false,
    "ID": 112600,
    "UUID": "7D4B554A-4BE6-4995-AE89-26BD6A5BC0D5",
    "DataProviderID": 1,
    "OperatorID": 20,
    "OperatorsReference": "80252,80253",
    "UsageTypeID": 4,
    "UsageCost": "Free",
    "AddressInfo": {
        "ID": 112946,
        "Title": "Town Hall Multi-Storey Car Park",
        "AddressLine1": "The Boulevard",
        "Town": "Crawley",
        "StateOrProvince": "West Sussex",
        "Postcode": "RH10 1UZ",
        "CountryID": 1,
        "Latitude": 51.11663,
        "Longitude": -0.1838,
        "DistanceUnit": 0
    },
    "Connections": [
        {
            "ID": 158427,
            "ConnectionTypeID": 25,
            "StatusTypeID": 50,
            "LevelID": 2,
            "Amps": 32,
            "Voltage": 400,
            "PowerKW": 22,
            "CurrentTypeID": 20,
            "Quantity": 4
        }
    ],
    "NumberOfPoints": 4,
    "StatusTypeID": 50,
    "DateLastStatusUpdate": "2018-11-10T06:25:00Z",
    "DataQualityLevel": 1,
    "DateCreated": "2018-11-09T06:15:00Z",
    "SubmissionStatusTypeID": 200
}