{
    "IsRecentlyVerified": false,
    "ID": 158526,
    "UUID": "B833B575-F520-4AAF-AD73-128EE3AEABB7",
    "DataProviderID": 2,
    "DataProvidersReference": "152740",
    "OperatorID": 3293,
    "UsageTypeID": 1,
    "AddressInfo": {
        "ID": 158883,
        "Title": "Seacliff Village Shopping Center - Handicap Only",
        "AddressLine1": "7051 W Yorktown Ave",
        "Town": "Huntington Beach",
        "StateOrProvince": "CA",
        "Postcode": "92648",
        "CountryID": 2,
        "Latitude": 33.680195,
        "Longitude": -118.004622,
        "ContactTelephone1": "888-264-2208",
        "AccessComments": "6am-12pm daily",
        "RelatedURL": "https://voltacharging.com/",
        "DistanceUnit": 0
    },
    "Connections": [
        {
            "ID": 228525,
            "ConnectionTypeID": 1,
            "LevelID": 2,
            "Amps": 16,
            "Voltage": 230,
            "PowerKW": 3.7,
            "CurrentTypeID": 10,
            "Quantity": 1
        }
    ],
    "StatusTypeID": 50,
    "DateLastStatusUpdate": "2020-06-26T02:55:00Z",
    "DataQualityLevel": 3,
    "DateCreated": "2020-06-26T02:55:00Z",
    "SubmissionStatusTypeID": 100
}