{
    "IsRecentlyVerified": false,
    "ID": 146512,
    "UUID": "AA5EBF73-53BA-4DB2-B67E-CC74837F6AC3",
    "DataProviderID": 1,
    "OperatorID": 80,
    "UsageTypeID": 4,
    "AddressInfo": {
        "ID": 146864,
        "Title": "Muicipio di Bregano | EnelX",
        "AddressLine1": "Via Piave, 39",
        "Town": "Bregano",
        "StateOrProvince": "VA",
        "Postcode": "21020",
        "CountryID": 112,
        "Latitude": 45.82354811166314,
        "Longitude": 8.687369620325171,
        "ContactTelephone1": "800.069.850",
        "RelatedURL": "https://www.enelx.com/it/it/emobility",
        "DistanceUnit": 0
    },
    "Connections": [
        {
            "ID": 203703,
            "ConnectionTypeID": 25,
            "StatusTypeID": 50,
            "LevelID": 2,
            "Amps": 32,
            "Voltage": 400,
            "PowerKW": 22,
            "CurrentTypeID": 20,
            "Quantity": 2
        }
    ],
    "NumberOfPoints": 2,
    "StatusTypeID": 50,
    "DateLastStatusUpdate": "2020-01-10T11:41:00Z",
    "DataQualityLevel": 1,
    "DateCreated": "2020-01-10T11:41:00Z",
    "SubmissionStatusTypeID": 200
}