{
    "IsRecentlyVerified": false,
    "ID": 142471,
    "UUID": "28B40447-6592-41CA-83BB-3BE9B4B05127",
    "DataProviderID": 2,
    "DataProvidersReference": "122961",
    "OperatorID": 5,
    "UsageTypeID": 1,
    "AddressInfo": {
        "ID": 142823,
        "Title": "CSJ BRENTWOOD",
        "AddressLine1": "1725 Brentwood Rd",
        "Town": "Brentwood",
        "StateOrProvince": "NY",
        "Postcode": "11717",
        "CountryID": 2,
        "Latitude": 40.774401,
        "Longitude": -73.246076,
        "ContactTelephone1": "888-758-4389",
        "AccessComments": "24 hours daily",
        "RelatedURL": "http://www.chargepoint.com/",
        "DistanceUnit": 0
    },
    "Connections": [
        {
            "ID": 198616,
            "ConnectionTypeID": 1,
            "LevelID": 2,
            "Amps": 16,
            "Voltage": 230,
            "PowerKW": 3.7,
            "CurrentTypeID": 10,
            "Quantity": 4
        }
    ],
    "StatusTypeID": 50,
    "DateLastStatusUpdate": "2020-06-26T03:03:00Z",
    "DataQualityLevel": 3,
    "DateCreated": "2019-12-24T09:17:00Z",
    "SubmissionStatusTypeID": 100
}