{
    "MediaItems": [
        {
            "ID": 1583,
            "ChargePointID": 47657,
            "ItemURL": "https://s3-ap-southeast-2.amazonaws.com/openchargemap/images/GB/OCM47657/OCM-47657.orig.2015062310334772.jpg",
            "ItemThumbnailURL": "https://s3-ap-southeast-2.amazonaws.com/openchargemap/images/GB/OCM47657/OCM-47657.thmb.2015062310334772.jpg",
            "Comment": "Was on CYC as public, then I posted this to them.  Now its private.",
            "IsEnabled": true,
            "IsVideo": false,
            "IsFeaturedItem": false,
            "IsExternalResource": false,
            "User": {
                "ID": 4778,
                "Username": "Sandy Ritchie"
            },
            "DateCreated": "2015-06-23T10:34:00Z"
        }
    ],
    "IsRecentlyVerified": false,
    "ID": 47657,
    "UUID": "3C83BEE7-A212-41EB-A8BC-D517788DDCC5",
    "DataProviderID": 1,
    "OperatorID": 3315,
    "OperatorsReference": "50779",
    "UsageTypeID": 6,
    "UsageCost": "Free",
    "AddressInfo": {
        "ID": 48003,
        "Title": "Fife College",
        "AddressLine1": "Stenton Road",
        "Town": "Glenrothes",
        "Postcode": "KY6 2RA",
        "CountryID": 1,
        "Latitude": 56.18577,
        "Longitude": -3.177809,
        "RelatedURL": "http://www.chargeyourcar.org.uk",
        "DistanceUnit": 0
    },
    "Connections": [
        {
            "ID": 58767,
            "ConnectionTypeID": 25,
            "StatusTypeID": 50,
            "LevelID": 2,
            "Amps": 32,
            "Voltage": 230,
            "PowerKW": 7,
            "CurrentTypeID": 10,
            "Quantity": 2
        }
    ],
    "NumberOfPoints": 2,
    "GeneralComments": "Workplace car park",
    "StatusTypeID": 50,
    "DateLastStatusUpdate": "2018-04-09T16:56:00Z",
    "MetadataValues": [
        {
            "ID": 1437,
            "MetadataFieldID": 4,
            "ItemValue": "Contains public sector information licensed under the Open Government Licence v2.0. http://www.nationalarchives.gov.uk/doc/open-government-licence/version/2/"
        }
    ],
    "DataQualityLevel": 3,
    "DateCreated": "2015-06-05T08:10:00Z",
    "SubmissionStatusTypeID": 100
}