{
    "IsRecentlyVerified": false,
    "ID": 108692,
    "UUID": "71AFFBB9-AB3A-43F4-B95B-68E697FDF1D9",
    "DataProviderID": 1,
    "OperatorID": 23,
    "OperatorsReference": "45243",
    "UsageTypeID": 4,
    "UsageCost": "$0.26/kWh; other tariffs for older cars",
    "AddressInfo": {
        "ID": 109038,
        "Title": "Thousand Oaks, Ca - West Hillcrest Drive Supercharger",
        "AddressLine1": "350 West Hillcrest Drive",
        "Town": "Thousand Oaks",
        "StateOrProvince": "CA",
        "Postcode": "91360",
        "CountryID": 2,
        "Latitude": 34.184617,
        "Longitude": -118.890892,
        "DistanceUnit": 0
    },
    "Connections": [
        {
            "ID": 153807,
            "ConnectionTypeID": 27,
            "StatusTypeID": 50,
            "LevelID": 3,
            "PowerKW": 120,
            "CurrentTypeID": 30,
            "Quantity": 20
        }
    ],
    "NumberOfPoints": 20,
    "GeneralComments": "Charging20 Superchargers, available 24/7, up to 72kW",
    "StatusTypeID": 50,
    "DateLastStatusUpdate": "2018-10-11T12:24:00Z",
    "DataQualityLevel": 1,
    "DateCreated": "2018-10-11T12:24:00Z",
    "SubmissionStatusTypeID": 200
}