{
    "IsRecentlyVerified": false,
    "ID": 134254,
    "UUID": "CAE9A940-8928-499F-8213-B915E5E4540F",
    "DataProviderID": 1,
    "OperatorID": 80,
    "UsageTypeID": 4,
    "AddressInfo": {
        "ID": 134600,
        "Title": "Garage Cristoforo Colombo | EnelX",
        "AddressLine1": "Via Cristoforo Colombo, 120",
        "Town": "Rome",
        "StateOrProvince": "RM",
        "Postcode": "00154",
        "CountryID": 112,
        "Latitude": 41.8654044779886,
        "Longitude": 12.4962919646844,
        "RelatedURL": "https://www.enelx.com/it/it/emobility",
        "DistanceUnit": 0
    },
    "Connections": [
        {
            "ID": 187863,
            "ConnectionTypeID": 25,
            "StatusTypeID": 50,
            "LevelID": 2,
            "Amps": 32,
            "Voltage": 400,
            "PowerKW": 22,
            "CurrentTypeID": 20,
            "Quantity": 4
        }
    ],
    "NumberOfPoints": 4,
    "GeneralComments": "Garage a pagamento",
    "StatusTypeID": 50,
    "DateLastStatusUpdate": "2019-11-05T17:15:00Z",
    "DataQualityLevel": 1,
    "DateCreated": "2019-11-05T17:15:00Z",
    "SubmissionStatusTypeID": 200
}