{
    "IsRecentlyVerified": false,
    "ID": 176959,
    "UUID": "FB313FE6-58D2-4BB1-9596-0D606C3EF97A",
    "DataProviderID": 29,
    "DataProvidersReference": "20810",
    "OperatorID": 105,
    "AddressInfo": {
        "ID": 177318,
        "Title": "Becheltestraße 56",
        "AddressLine1": "Becheltestraße 56",
        "Town": "Hagen",
        "Postcode": "58089",
        "CountryID": 87,
        "Latitude": 51.377581,
        "Longitude": 7.452031,
        "DistanceUnit": 0
    },
    "Connections": [
        {
            "ID": 275534,
            "ConnectionTypeID": 25,
            "StatusTypeID": 50,
            "LevelID": 2,
            "PowerKW": 22,
            "CurrentTypeID": 20
        },
        {
            "ID": 275535,
            "ConnectionTypeID": 25,
            "StatusTypeID": 50,
            "LevelID": 2,
            "PowerKW": 22,
            "CurrentTypeID": 20
        },
        {
            "ID": 275536,
            "ConnectionTypeID": 25,
            "StatusTypeID": 50,
            "LevelID": 2,
            "PowerKW": 22,
            "CurrentTypeID": 20
        },
        {
            "ID": 275537,
            "ConnectionTypeID": 25,
            "StatusTypeID": 50,
            "LevelID": 2,
            "PowerKW": 22,
            "CurrentTypeID": 20
        }
    ],
    "StatusTypeID": 0,
    "DateLastStatusUpdate": "2021-07-12T02:47:00Z",
    "MetadataValues": [
        {
            "ID": 9253,
            "MetadataFieldID": 4,
            "ItemValue": "Data from the German chargepoint registry provided by Bundesnetzagentur.de under the CC-BY 4.0 license"
        }
    ],
    "DataQualityLevel": 3,
    "DateCreated": "2021-07-08T09:48:00Z",
    "SubmissionStatusTypeID": 100
}