{
    "MediaItems": [
        {
            "ID": 28886,
            "ChargePointID": 188570,
            "ItemURL": "https://s3-ap-southeast-2.amazonaws.com/openchargemap/images/US/OCM188570/OCM-188570.orig.2021080305503503.jpeg",
            "ItemThumbnailURL": "https://s3-ap-southeast-2.amazonaws.com/openchargemap/images/US/OCM188570/OCM-188570.thmb.2021080305503503.jpeg",
            "Comment": "",
            "IsEnabled": true,
            "IsVideo": false,
            "IsFeaturedItem": false,
            "IsExternalResource": false,
            "User": {
                "ID": 33708,
                "Username": "ReChargeAK"
            },
            "DateCreated": "2021-08-03T05:51:00Z"
        },
        {
            "ID": 28887,
            "ChargePointID": 188570,
            "ItemURL": "https://s3-ap-southeast-2.amazonaws.com/openchargemap/images/US/OCM188570/OCM-188570.orig.2021080305511096.jpeg",
            "ItemThumbnailURL": "https://s3-ap-southeast-2.amazonaws.com/openchargemap/images/US/OCM188570/OCM-188570.thmb.2021080305511096.jpeg",
            "Comment": "",
            "IsEnabled": true,
            "IsVideo": false,
            "IsFeaturedItem": false,
            "IsExternalResource": false,
            "User": {
                "ID": 33708,
                "Username": "ReChargeAK"
            },
            "DateCreated": "2021-08-03T05:51:00Z"
        },
        {
            "ID": 28885,
            "ChargePointID": 188570,
            "ItemURL": "https://s3-ap-southeast-2.amazonaws.com/openchargemap/images/US/OCM188570/OCM-188570.orig.2021080305495959.jpeg",
            "ItemThumbnailURL": "https://s3-ap-southeast-2.amazonaws.com/openchargemap/images/US/OCM188570/OCM-188570.thmb.2021080305495959.jpeg",
            "Comment": "",
            "IsEnabled": true,
            "IsVideo": false,
            "IsFeaturedItem": false,
            "IsExternalResource": false,
            "User": {
                "ID": 33708,
                "Username": "ReChargeAK"
            },
            "DateCreated": "2021-08-03T05:50:00Z"
        }
    ],
    "IsRecentlyVerified": false,
    "ID": 188570,
    "UUID": "8581547C-1C31-431E-9DE5-C5264E68B8AD",
    "DataProviderID": 1,
    "UsageTypeID": 5,
    "AddressInfo": {
        "ID": 188929,
        "Title": "ReCharge Alaska - Cantwell",
        "AddressLine1": "214.5 Mile George Parks Highway",
        "Town": "Cantwell",
        "StateOrProvince": "Alaska",
        "Postcode": "99729",
        "CountryID": 2,
        "Latitude": 63.447125465171894,
        "Longitude": -148.83507216191418,
        "ContactTelephone1": "7208331479",
        "ContactEmail": "rechargeak@outlook.com",
        "RelatedURL": "https://www.rechargealaska.net/",
        "DistanceUnit": 0
    },
    "Connections": [
        {
            "ID": 304579,
            "ConnectionTypeID": 2,
            "StatusTypeID": 50,
            "LevelID": 3,
            "Voltage": 500,
            "PowerKW": 50,
            "CurrentTypeID": 30,
            "Quantity": 1
        },
        {
            "ID": 304580,
            "ConnectionTypeID": 32,
            "StatusTypeID": 50,
            "LevelID": 3,
            "Voltage": 500,
            "PowerKW": 50,
            "CurrentTypeID": 30,
            "Quantity": 1
        }
    ],
    "NumberOfPoints": 1,
    "StatusTypeID": 50,
    "DateLastStatusUpdate": "2021-08-03T12:50:00Z",
    "DataQualityLevel": 1,
    "DateCreated": "2021-08-03T05:47:00Z",
    "SubmissionStatusTypeID": 200
}