{
    "IsRecentlyVerified": false,
    "ID": 17866,
    "UUID": "B29211DD-28F2-4C19-A101-E3E088E26C07",
    "DataProviderID": 22,
    "DataProvidersReference": "5C46DFDE90D27CF400999DED4049F356",
    "AddressInfo": {
        "ID": 18211,
        "Title": "静岡県東部総合庁舎",
        "AddressLine1": "静岡県沼津市高島本町1-3",
        "CountryID": 114,
        "Latitude": 35.10666412,
        "Longitude": 138.8570314,
        "ContactTelephone1": "054-221-2949",
        "DistanceUnit": 0
    },
    "Connections": [
        {
            "ID": 18107,
            "ConnectionTypeID": 2,
            "LevelID": 2,
            "Amps": 100,
            "Voltage": 480,
            "PowerKW": 48,
            "Quantity": 1
        }
    ],
    "DateLastStatusUpdate": "2013-06-29T09:04:00Z",
    "DataQualityLevel": 2,
    "DateCreated": "2013-06-29T09:04:00Z",
    "SubmissionStatusTypeID": 200
}