{
    "IsRecentlyVerified": false,
    "ID": 53510,
    "UUID": "DF561BA1-9F6F-466D-838E-8B0218C93752",
    "DataProviderID": 1,
    "DataProvidersReference": "2963",
    "AddressInfo": {
        "ID": 53856,
        "Title": "Köpcentret Rondellen",
        "AddressLine1": "Hästhovsvägen 2",
        "Town": "JÖNKÖPING",
        "StateOrProvince": "JÖNKÖPING",
        "Postcode": "55454",
        "CountryID": 216,
        "Latitude": 57.77947,
        "Longitude": 14.22284,
        "AccessComments": "Allmän parkering, mot fasad.",
        "DistanceUnit": 0
    },
    "Connections": [
        {
            "ID": 66631,
            "ConnectionTypeID": 0,
            "Reference": "1",
            "LevelID": 2,
            "Amps": 32,
            "Voltage": 230,
            "PowerKW": 7.4,
            "Comments": "Mode 3"
        },
        {
            "ID": 87891,
            "ConnectionTypeID": 0,
            "Reference": "2",
            "LevelID": 2,
            "Amps": 16,
            "Voltage": 230,
            "PowerKW": 3.7,
            "Comments": "Mode 1"
        }
    ],
    "NumberOfPoints": 2,
    "DateLastStatusUpdate": "2020-05-26T08:21:00Z",
    "DataQualityLevel": 2,
    "DateCreated": "2015-09-20T11:33:00Z",
    "SubmissionStatusTypeID": 100
}