{
    "IsRecentlyVerified": false,
    "ID": 63243,
    "UUID": "171806ED-9552-41FB-8821-C500D9D1AD89",
    "DataProviderID": 26,
    "DataProvidersReference": "72545",
    "OperatorID": 73,
    "OperatorsReference": "EV-Box EVB-P1510004",
    "UsageCost": "0.00 jaarabonnement",
    "AddressInfo": {
        "ID": 63589,
        "Title": "Hofsingel 33",
        "AddressLine1": "Hofsingel 33",
        "Town": "Vlaardingen",
        "Postcode": "3134 VE",
        "CountryID": 159,
        "Latitude": 51.91075,
        "Longitude": 4.34889,
        "RelatedURL": "http://www.ev-box.nl",
        "DistanceUnit": 0
    },
    "Connections": [
        {
            "ID": 80541,
            "ConnectionTypeID": 25,
            "LevelID": 2,
            "PowerKW": 11,
            "CurrentTypeID": 10
        },
        {
            "ID": 80542,
            "ConnectionTypeID": 25,
            "LevelID": 2,
            "PowerKW": 11,
            "CurrentTypeID": 10
        }
    ],
    "NumberOfPoints": 1,
    "StatusTypeID": 50,
    "DateLastStatusUpdate": "2016-06-04T02:42:00Z",
    "DataQualityLevel": 3,
    "DateCreated": "2016-03-03T12:30:00Z",
    "SubmissionStatusTypeID": 100
}