{
    "IsRecentlyVerified": false,
    "ID": 106521,
    "UUID": "7D2D23B1-C3BC-4580-A873-635B38E0C03D",
    "DataProviderID": 1,
    "OperatorID": 23,
    "OperatorsReference": "44407",
    "UsageTypeID": 4,
    "AddressInfo": {
        "ID": 106867,
        "Title": "Joyce Vineyards",
        "AddressLine1": "1 E Carmel Valley RD",
        "Town": "Carmel Valley",
        "StateOrProvince": "California",
        "Postcode": "93924",
        "CountryID": 2,
        "Latitude": 36.477736,
        "Longitude": -121.728896,
        "ContactTelephone1": "(831) 659-2885",
        "DistanceUnit": 0
    },
    "Connections": [
        {
            "ID": 149898,
            "ConnectionTypeID": 30,
            "StatusTypeID": 50,
            "LevelID": 2,
            "PowerKW": 16,
            "CurrentTypeID": 20,
            "Quantity": 4
        }
    ],
    "NumberOfPoints": 4,
    "GeneralComments": "4 Tesla Connectors, up to 16kW.Available for customers. Please call ahead.",
    "StatusTypeID": 50,
    "DateLastStatusUpdate": "2018-06-23T05:43:00Z",
    "DataQualityLevel": 1,
    "DateCreated": "2018-06-23T05:43:00Z",
    "SubmissionStatusTypeID": 200
}