{
    "IsRecentlyVerified": false,
    "ID": 38271,
    "UUID": "9361C04C-69A1-49DD-B706-1D5BC874D9F3",
    "DataProviderID": 26,
    "DataProvidersReference": "20523",
    "OperatorsReference": "M&O Techniek",
    "UsageCost": "0.00 jaarabonnement",
    "AddressInfo": {
        "ID": 38617,
        "Title": "Eenhoornweg 7",
        "AddressLine1": "Eenhoornweg 7",
        "Town": "Wormerland",
        "Postcode": "1531 ME",
        "CountryID": 159,
        "Latitude": 52.497192885749,
        "Longitude": 4.7982116127014,
        "RelatedURL": "http://www.mo-techniek.nl",
        "DistanceUnit": 0
    },
    "Connections": [
        {
            "ID": 41782,
            "ConnectionTypeID": 25,
            "LevelID": 2,
            "PowerKW": 11,
            "CurrentTypeID": 10
        }
    ],
    "NumberOfPoints": 1,
    "StatusTypeID": 50,
    "DateLastStatusUpdate": "2016-06-04T02:54:00Z",
    "DataQualityLevel": 3,
    "DateCreated": "2015-01-09T06:07:00Z",
    "SubmissionStatusTypeID": 100
}