{
    "IsRecentlyVerified": false,
    "ID": 41411,
    "UUID": "2AAAAEF7-C690-4895-B07C-2DD63C53D998",
    "DataProviderID": 1,
    "OperatorID": 23,
    "OperatorsReference": "6553",
    "UsageTypeID": 1,
    "UsageCost": "$0.21/kWh; other tariffs for older cars",
    "AddressInfo": {
        "ID": 41757,
        "Title": "Ground Round Grill & Bar - Tesla",
        "AddressLine1": "1290 Ryans Rd",
        "Town": "Worthington",
        "StateOrProvince": "MN",
        "Postcode": "56187",
        "CountryID": 2,
        "Latitude": 43.634433,
        "Longitude": -95.595456,
        "ContactTelephone1": "877-798-3752",
        "AccessComments": "24 hours daily; for Tesla use only",
        "RelatedURL": "http://www.teslamotors.com/supercharger",
        "DistanceUnit": 0
    },
    "Connections": [
        {
            "ID": 45259,
            "ConnectionTypeID": 27,
            "StatusTypeID": 50,
            "LevelID": 3,
            "Amps": 100,
            "Voltage": 400,
            "PowerKW": 120,
            "CurrentTypeID": 30,
            "Quantity": 6
        }
    ],
    "NumberOfPoints": 6,
    "StatusTypeID": 50,
    "DateLastStatusUpdate": "2018-03-13T13:42:00Z",
    "DataQualityLevel": 3,
    "DateCreated": "2015-02-02T06:34:00Z",
    "SubmissionStatusTypeID": 100
}