{
    "IsRecentlyVerified": false,
    "ID": 181706,
    "UUID": "A160AA6C-7A4D-435F-AD9C-95C38732BF20",
    "DataProviderID": 29,
    "DataProvidersReference": "7915",
    "AddressInfo": {
        "ID": 182065,
        "Title": "Nerotal 6",
        "AddressLine1": "Nerotal 6",
        "Town": "Wiesbaden",
        "Postcode": "65193",
        "CountryID": 87,
        "Latitude": 50.091348,
        "Longitude": 8.235888,
        "DistanceUnit": 0
    },
    "Connections": [
        {
            "ID": 286389,
            "ConnectionTypeID": 25,
            "StatusTypeID": 50,
            "LevelID": 2,
            "PowerKW": 22,
            "CurrentTypeID": 20
        },
        {
            "ID": 286390,
            "ConnectionTypeID": 25,
            "StatusTypeID": 50,
            "LevelID": 2,
            "PowerKW": 22,
            "CurrentTypeID": 20
        }
    ],
    "StatusTypeID": 50,
    "DateLastStatusUpdate": "2021-07-12T02:44:00Z",
    "MetadataValues": [
        {
            "ID": 14000,
            "MetadataFieldID": 4,
            "ItemValue": "Data from the German chargepoint registry provided by Bundesnetzagentur.de under the CC-BY 4.0 license"
        }
    ],
    "DataQualityLevel": 3,
    "DateCreated": "2021-07-08T10:02:00Z",
    "SubmissionStatusTypeID": 100
}