{
    "IsRecentlyVerified": false,
    "ID": 32629,
    "UUID": "F015719E-4BE5-495F-9F41-7B7D2E199676",
    "DataProviderID": 1,
    "OperatorID": 73,
    "OperatorsReference": "EV-Box EVB-P1317145",
    "UsageCost": "0.00 jaarabonnement",
    "AddressInfo": {
        "ID": 32975,
        "Title": "Bythesea Road",
        "AddressLine1": "Bythesea Road",
        "Town": "Trowbridge",
        "StateOrProvince": "Wiltshire",
        "Postcode": "BA14 8JN",
        "CountryID": 1,
        "Latitude": 51.3170534674079,
        "Longitude": -2.21095335449218,
        "AccessComments": "Access via Mortimer Street",
        "RelatedURL": "http://www.ev-box.nl",
        "DistanceUnit": 0
    },
    "Connections": [
        {
            "ID": 36140,
            "ConnectionTypeID": 25,
            "LevelID": 2,
            "PowerKW": 5,
            "CurrentTypeID": 10,
            "Quantity": 1
        }
    ],
    "NumberOfPoints": 5,
    "StatusTypeID": 50,
    "DateLastStatusUpdate": "2015-02-07T14:57:00Z",
    "DataQualityLevel": 3,
    "DateCreated": "2015-01-09T06:03:00Z",
    "SubmissionStatusTypeID": 100
}