{
    "IsRecentlyVerified": false,
    "ID": 111114,
    "UUID": "089D83E5-BD31-4D38-9C19-5CD43F6977C7",
    "DataProviderID": 2,
    "DataProvidersReference": "88680",
    "UsageTypeID": 1,
    "AddressInfo": {
        "ID": 111460,
        "Title": "Scotiabank",
        "AddressLine1": "1700 King Rd",
        "Town": "King City",
        "StateOrProvince": "ON",
        "Postcode": "L7B 0N1",
        "CountryID": 44,
        "Latitude": 43.934119,
        "Longitude": -79.507386,
        "ContactTelephone1": "905-833-5933",
        "AccessComments": "24 hours daily",
        "RelatedURL": "",
        "DistanceUnit": 0
    },
    "Connections": [
        {
            "ID": 156474,
            "ConnectionTypeID": 2,
            "LevelID": 3,
            "Amps": 100,
            "Voltage": 400,
            "PowerKW": 40,
            "CurrentTypeID": 30,
            "Quantity": 1
        },
        {
            "ID": 156475,
            "ConnectionTypeID": 32,
            "LevelID": 3,
            "Amps": 100,
            "Voltage": 400,
            "PowerKW": 40,
            "CurrentTypeID": 30,
            "Quantity": 1
        }
    ],
    "DateLastStatusUpdate": "2020-06-26T03:07:00Z",
    "DataQualityLevel": 3,
    "DateCreated": "2018-10-18T23:36:00Z",
    "SubmissionStatusTypeID": 100
}