{
    "IsRecentlyVerified": false,
    "ID": 104256,
    "UUID": "E57C20B2-3B6B-4CBB-AD66-B8F49BFA5C8F",
    "DataProviderID": 1,
    "OperatorID": 23,
    "OperatorsReference": "43033",
    "UsageTypeID": 4,
    "AddressInfo": {
        "ID": 104602,
        "Title": "Vineyard 29",
        "AddressLine1": "2929 N Hwy 29",
        "Town": "St Helena",
        "StateOrProvince": "California",
        "Postcode": "94574",
        "CountryID": 2,
        "Latitude": 38.519294,
        "Longitude": -122.495569,
        "ContactTelephone1": "(707) 963-9292",
        "DistanceUnit": 0
    },
    "Connections": [
        {
            "ID": 147218,
            "ConnectionTypeID": 30,
            "StatusTypeID": 50,
            "LevelID": 2,
            "PowerKW": 16,
            "CurrentTypeID": 20,
            "Quantity": 4
        }
    ],
    "NumberOfPoints": 4,
    "GeneralComments": "4 Tesla Connectors, up to 16kW.Available for customers. Please call ahead.",
    "StatusTypeID": 50,
    "DateLastStatusUpdate": "2018-05-18T05:31:00Z",
    "DataQualityLevel": 1,
    "DateCreated": "2018-05-18T05:31:00Z",
    "SubmissionStatusTypeID": 200
}