{
    "IsRecentlyVerified": false,
    "ID": 18652,
    "UUID": "D571FF35-99FC-4792-B1DB-6D5E22C66679",
    "DataProviderID": 15,
    "DataProvidersReference": "32009",
    "OperatorID": 5,
    "AddressInfo": {
        "ID": 18997,
        "Title": "13775 - 70 Avenue",
        "AddressLine1": "13775 - 70 Avenue",
        "Town": "Surrey",
        "StateOrProvince": "British Columbia",
        "Postcode": "V3W 0E1",
        "CountryID": 44,
        "Latitude": 49.13066014,
        "Longitude": -122.8407572,
        "ContactTelephone1": "+1 604-598-7400",
        "RelatedURL": "http://carstations.com/32009",
        "DistanceUnit": 0
    },
    "Connections": [
        {
            "ID": 18885,
            "ConnectionTypeID": 1,
            "Reference": "J1772",
            "LevelID": 2
        }
    ],
    "StatusTypeID": 0,
    "DateLastStatusUpdate": "2017-11-04T14:05:00Z",
    "DataQualityLevel": 2,
    "DateCreated": "2013-08-25T03:29:00Z",
    "SubmissionStatusTypeID": 200
}