{
    "IsRecentlyVerified": false,
    "ID": 115659,
    "UUID": "6EF54DEA-9466-4EE2-B5F3-9816F3F1AB17",
    "DataProviderID": 1,
    "OperatorID": 23,
    "OperatorsReference": "43704",
    "UsageTypeID": 5,
    "UsageCost": "$0.21/kWh; other tariffs for older cars",
    "AddressInfo": {
        "ID": 116005,
        "Title": "Sheetz Store #302 - Tesla Supercharger",
        "AddressLine1": "1250 Richmond Ave",
        "Town": "Staunton",
        "StateOrProvince": "VA",
        "Postcode": "22402",
        "CountryID": 2,
        "Latitude": 38.133337,
        "Longitude": -79.043223,
        "ContactTelephone1": "877-798-3752",
        "AccessComments": "24 hours daily; for Tesla use only",
        "RelatedURL": "http://www.teslamotors.com/supercharger",
        "DistanceUnit": 0
    },
    "Connections": [
        {
            "ID": 162687,
            "ConnectionTypeID": 27,
            "StatusTypeID": 50,
            "LevelID": 3,
            "Amps": 100,
            "Voltage": 400,
            "PowerKW": 120,
            "CurrentTypeID": 30,
            "Quantity": 8
        }
    ],
    "NumberOfPoints": 8,
    "StatusTypeID": 50,
    "DateLastStatusUpdate": "2019-02-13T06:44:00Z",
    "DataQualityLevel": 3,
    "DateCreated": "2019-02-11T07:13:00Z",
    "SubmissionStatusTypeID": 100
}