{
    "IsRecentlyVerified": false,
    "ID": 155877,
    "UUID": "ED307888-8053-4EB3-A5C2-6D4E1CA9965F",
    "DataProviderID": 1,
    "OperatorID": 187,
    "UsageTypeID": 1,
    "UsageCost": "Free",
    "AddressInfo": {
        "ID": 156231,
        "Title": "Ferencváros, Bakáts tér 12-13.",
        "AddressLine1": "Bakáts tér 12-13.",
        "Town": "Budapest",
        "Postcode": "1092",
        "CountryID": 104,
        "Latitude": 47.483628,
        "Longitude": 19.067784,
        "ContactTelephone1": "+36 1 238 3838",
        "RelatedURL": "https://e-autozas.hu/",
        "DistanceUnit": 0
    },
    "Connections": [
        {
            "ID": 219444,
            "ConnectionTypeID": 25,
            "StatusTypeID": 50,
            "LevelID": 2,
            "Amps": 32,
            "Voltage": 400,
            "PowerKW": 22,
            "CurrentTypeID": 20,
            "Quantity": 2
        }
    ],
    "NumberOfPoints": 2,
    "GeneralComments": "🇭🇺 A töltés indításához előzetes regisztráció szükséges (www.e-autozas.hu). Ezután az eCharge+ applikáción keresztül indítható a töltés.\r\n🇬🇧 Registration required to start charging (www.e-autozas.hu). After that use the eCharge+ application to start charging. (x2)",
    "StatusTypeID": 50,
    "DateLastStatusUpdate": "2020-04-27T18:22:00Z",
    "DataQualityLevel": 1,
    "DateCreated": "2020-04-27T08:03:00Z",
    "SubmissionStatusTypeID": 200
}