{
    "IsRecentlyVerified": false,
    "ID": 138287,
    "UUID": "CBCC8D71-D89F-4552-B930-E388D8BC901F",
    "DataProviderID": 2,
    "DataProvidersReference": "145336",
    "OperatorID": 5,
    "UsageTypeID": 1,
    "AddressInfo": {
        "ID": 138636,
        "Title": "LAKELAND HARLEY",
        "AddressLine1": "4202 Lakeland Hills Blvd",
        "Town": "Lakeland",
        "StateOrProvince": "FL",
        "Postcode": "33805",
        "CountryID": 2,
        "Latitude": 28.095829,
        "Longitude": -81.9527,
        "ContactTelephone1": "888-758-4389",
        "AccessComments": "24 hours daily",
        "RelatedURL": "http://www.chargepoint.com/",
        "DistanceUnit": 0
    },
    "Connections": [
        {
            "ID": 193374,
            "ConnectionTypeID": 32,
            "LevelID": 3,
            "Amps": 100,
            "Voltage": 400,
            "PowerKW": 40,
            "CurrentTypeID": 30,
            "Quantity": 1
        }
    ],
    "StatusTypeID": 50,
    "DateLastStatusUpdate": "2020-06-26T02:52:00Z",
    "DataQualityLevel": 3,
    "DateCreated": "2019-12-24T09:08:00Z",
    "SubmissionStatusTypeID": 100
}