{
    "IsRecentlyVerified": false,
    "ID": 17525,
    "UUID": "C6F3F4AF-38FF-419C-A26E-1C114718068E",
    "DataProviderID": 22,
    "DataProvidersReference": "57574E4F5E30961F96C7E320BF15A5DD",
    "AddressInfo": {
        "ID": 17870,
        "Title": "鹿児島日産自動車西千石店",
        "AddressLine1": "鹿児島県鹿児島市西千石町7-5",
        "CountryID": 114,
        "Latitude": 31.58900355,
        "Longitude": 130.5473613,
        "ContactTelephone1": "099-223-8112",
        "DistanceUnit": 0
    },
    "Connections": [
        {
            "ID": 17766,
            "ConnectionTypeID": 2,
            "LevelID": 2,
            "Amps": 100,
            "Voltage": 480,
            "PowerKW": 48,
            "Quantity": 1
        }
    ],
    "DateLastStatusUpdate": "2013-06-29T08:59:00Z",
    "DataQualityLevel": 2,
    "DateCreated": "2013-06-29T08:59:00Z",
    "SubmissionStatusTypeID": 200
}