{
    "IsRecentlyVerified": false,
    "ID": 89718,
    "UUID": "5324D2B8-BE82-4E48-8E8C-AC5042E8E8CD",
    "DataProviderID": 2,
    "DataProvidersReference": "82077",
    "OperatorID": 5,
    "UsageTypeID": 1,
    "AddressInfo": {
        "ID": 90064,
        "Title": "SOUTHSTREET",
        "AddressLine1": "29 South St",
        "Town": "Hudson",
        "StateOrProvince": "MA",
        "Postcode": "01749",
        "CountryID": 2,
        "Latitude": 42.3905045,
        "Longitude": -71.566784,
        "ContactTelephone1": "888-758-4389",
        "AccessComments": "24 hours daily",
        "RelatedURL": "http://www.chargepoint.com/",
        "DistanceUnit": 0
    },
    "Connections": [
        {
            "ID": 127150,
            "ConnectionTypeID": 1,
            "LevelID": 2,
            "Amps": 16,
            "Voltage": 230,
            "PowerKW": 3,
            "CurrentTypeID": 10,
            "Quantity": 2
        }
    ],
    "DateLastStatusUpdate": "2019-12-24T09:20:00Z",
    "DataQualityLevel": 3,
    "DateCreated": "2017-06-22T08:16:00Z",
    "SubmissionStatusTypeID": 100
}