{
    "UserComments": [
        {
            "ID": 20887,
            "ChargePointID": 116851,
            "CommentTypeID": 10,
            "UserName": "ForumElettrico.it",
            "RelatedURL": "https://www.forumelettrico.it/forum/colonnina-enel-x-22-kw-godiasco-salice-terme-pv-viale-guglielmo-marconi-2-t5290.html",
            "DateCreated": "2019-04-12T15:25:27.803Z",
            "User": {
                "ID": 11749,
                "Username": "ForumElettrico.it"
            },
            "CheckinStatusTypeID": 140
        }
    ],
    "MediaItems": [
        {
            "ID": 18042,
            "ChargePointID": 116851,
            "ItemURL": "https://s3-ap-southeast-2.amazonaws.com/openchargemap/images/IT/OCM116851/OCM-116851.orig.2019041215253930.jpg",
            "ItemThumbnailURL": "https://s3-ap-southeast-2.amazonaws.com/openchargemap/images/IT/OCM116851/OCM-116851.thmb.2019041215253930.jpg",
            "Comment": "",
            "IsEnabled": true,
            "IsVideo": false,
            "IsFeaturedItem": false,
            "IsExternalResource": false,
            "User": {
                "ID": 11749,
                "Username": "ForumElettrico.it"
            },
            "DateCreated": "2019-04-12T15:26:00Z"
        },
        {
            "ID": 18043,
            "ChargePointID": 116851,
            "ItemURL": "https://s3-ap-southeast-2.amazonaws.com/openchargemap/images/IT/OCM116851/OCM-116851.orig.2019041215254534.jpg",
            "ItemThumbnailURL": "https://s3-ap-southeast-2.amazonaws.com/openchargemap/images/IT/OCM116851/OCM-116851.thmb.2019041215254534.jpg",
            "Comment": "",
            "IsEnabled": true,
            "IsVideo": false,
            "IsFeaturedItem": false,
            "IsExternalResource": false,
            "User": {
                "ID": 11749,
                "Username": "ForumElettrico.it"
            },
            "DateCreated": "2019-04-12T15:26:00Z"
        }
    ],
    "IsRecentlyVerified": false,
    "ID": 116851,
    "UUID": "5BBF248B-ECF5-455C-8813-5089F85B4824",
    "DataProviderID": 1,
    "OperatorID": 80,
    "UsageTypeID": 4,
    "AddressInfo": {
        "ID": 117197,
        "Title": "Salice Terme Marconi | EnelX",
        "AddressLine1": "Via Guglielmo Marconi",
        "AddressLine2": "Salice Terme",
        "Town": "Godiasco ",
        "StateOrProvince": "PV",
        "Postcode": "27052",
        "CountryID": 112,
        "Latitude": 44.9149820301595,
        "Longitude": 9.02646138641262,
        "RelatedURL": "https://www.enelx.com/it/it/emobility",
        "DistanceUnit": 0
    },
    "Connections": [
        {
            "ID": 165417,
            "ConnectionTypeID": 25,
            "StatusTypeID": 50,
            "LevelID": 2,
            "Amps": 32,
            "Voltage": 400,
            "PowerKW": 22,
            "CurrentTypeID": 20,
            "Quantity": 2
        }
    ],
    "NumberOfPoints": 2,
    "StatusTypeID": 50,
    "DateLastStatusUpdate": "2019-04-12T15:26:00Z",
    "DataQualityLevel": 1,
    "DateCreated": "2019-02-12T15:25:00Z",
    "SubmissionStatusTypeID": 200
}