{
    "MediaItems": [
        {
            "ID": 12122,
            "ChargePointID": 87736,
            "ItemURL": "https://s3-ap-southeast-2.amazonaws.com/openchargemap/images/NZ/OCM87736/OCM-87736.orig.2017051608141097.jpg",
            "ItemThumbnailURL": "https://s3-ap-southeast-2.amazonaws.com/openchargemap/images/NZ/OCM87736/OCM-87736.thmb.2017051608141097.jpg",
            "Comment": "",
            "IsEnabled": true,
            "IsVideo": false,
            "IsFeaturedItem": false,
            "IsExternalResource": false,
            "User": {
                "ID": 15365,
                "Username": "sliday"
            },
            "DateCreated": "2017-05-16T08:14:00Z"
        }
    ],
    "IsRecentlyVerified": false,
    "ID": 87736,
    "UUID": "DDF434FC-64F6-437D-9357-C88F38A45212",
    "DataProviderID": 1,
    "UsageCost": "$2/h",
    "AddressInfo": {
        "ID": 88082,
        "Title": "Wanaka Top 10 Holiday Park",
        "AddressLine1": "217 Mount Aspiring Road",
        "Town": "Wanaka",
        "Postcode": "9343",
        "CountryID": 161,
        "Latitude": -44.699085,
        "Longitude": 169.10116100000005,
        "ContactTelephone1": "(643) 443-7360",
        "DistanceUnit": 0
    },
    "Connections": [
        {
            "ID": 124360,
            "ConnectionTypeID": 4
        }
    ],
    "NumberOfPoints": 1,
    "GeneralComments": "$2/h or by negotiation.\r\n8am-8pm\r\n",
    "StatusTypeID": 50,
    "DateLastStatusUpdate": "2017-05-16T08:14:00Z",
    "DataQualityLevel": 1,
    "DateCreated": "2017-05-16T08:14:00Z",
    "SubmissionStatusTypeID": 200
}