{
    "IsRecentlyVerified": false,
    "ID": 27139,
    "UUID": "FDCA1F48-F919-433C-BAB3-D582CB1EE9EA",
    "DataProviderID": 2,
    "DataProvidersReference": "45779",
    "UsageTypeID": 1,
    "AddressInfo": {
        "ID": 27485,
        "Title": "City of Rock Hill - Giordana Velodrome",
        "AddressLine1": "1000 Riverwalk Pkwy",
        "Town": "Rock Hill",
        "StateOrProvince": "SC",
        "Postcode": "29730",
        "CountryID": 2,
        "Latitude": 34.977,
        "Longitude": -80.9771,
        "ContactTelephone1": "803-325-2505",
        "AccessComments": "24 hours daily",
        "RelatedURL": "",
        "DistanceUnit": 0
    },
    "Connections": [
        {
            "ID": 29724,
            "ConnectionTypeID": 1,
            "LevelID": 2,
            "Amps": 16,
            "Voltage": 230,
            "PowerKW": 3,
            "CurrentTypeID": 10,
            "Quantity": 2
        }
    ],
    "DateLastStatusUpdate": "2019-04-06T04:02:00Z",
    "DataQualityLevel": 3,
    "DateCreated": "2014-11-28T03:37:00Z",
    "SubmissionStatusTypeID": 100
}