{
    "IsRecentlyVerified": false,
    "ID": 85188,
    "UUID": "A350BDB1-A5B5-4D1F-9488-9BFA26D8C005",
    "DataProviderID": 1,
    "OperatorID": 23,
    "OperatorsReference": "25875",
    "UsageTypeID": 7,
    "AddressInfo": {
        "ID": 85534,
        "Title": "Eco Silver House",
        "AddressLine1": "144 Dunajska Cesta",
        "Town": "Ljubljana",
        "Postcode": "1000",
        "CountryID": 205,
        "Latitude": 46.080367,
        "Longitude": 14.513472,
        "ContactTelephone1": "+386 41 432 890",
        "DistanceUnit": 0
    },
    "Connections": [
        {
            "ID": 120957,
            "ConnectionTypeID": 30,
            "StatusTypeID": 50,
            "LevelID": 2,
            "Amps": 32,
            "Voltage": 400,
            "PowerKW": 22,
            "CurrentTypeID": 20,
            "Quantity": 1
        }
    ],
    "NumberOfPoints": 1,
    "GeneralComments": "1 Tesla Connector, up to 22kW.Available by reservation only. Please call ahead.",
    "StatusTypeID": 50,
    "DateLastStatusUpdate": "2018-10-03T16:14:00Z",
    "DataQualityLevel": 1,
    "DateCreated": "2017-03-28T05:23:00Z",
    "SubmissionStatusTypeID": 200
}