{
    "IsRecentlyVerified": false,
    "ID": 184797,
    "UUID": "DE3CA986-A255-462D-8845-EC128D90BE56",
    "DataProviderID": 29,
    "DataProvidersReference": "11668",
    "AddressInfo": {
        "ID": 185156,
        "Title": "Fischerstraße 7",
        "AddressLine1": "Fischerstraße 7",
        "Town": "Prenzlau",
        "Postcode": "17291",
        "CountryID": 87,
        "Latitude": 53.311814,
        "Longitude": 13.852571,
        "DistanceUnit": 0
    },
    "Connections": [
        {
            "ID": 293506,
            "ConnectionTypeID": 25,
            "StatusTypeID": 50,
            "LevelID": 2,
            "PowerKW": 22,
            "CurrentTypeID": 20
        },
        {
            "ID": 293507,
            "ConnectionTypeID": 25,
            "StatusTypeID": 50,
            "LevelID": 2,
            "PowerKW": 22,
            "CurrentTypeID": 20
        }
    ],
    "StatusTypeID": 50,
    "DateLastStatusUpdate": "2021-07-09T03:29:00Z",
    "MetadataValues": [
        {
            "ID": 17088,
            "MetadataFieldID": 4,
            "ItemValue": "Data from the German chargepoint registry provided by Bundesnetzagentur.de under the CC-BY 4.0 license"
        }
    ],
    "DataQualityLevel": 3,
    "DateCreated": "2021-07-08T10:05:00Z",
    "SubmissionStatusTypeID": 100
}