{
    "IsRecentlyVerified": false,
    "ID": 51475,
    "UUID": "566F36C8-A38A-4F09-8DB2-14DE59464980",
    "DataProviderID": 1,
    "OperatorID": 167,
    "UsageTypeID": 3,
    "UsageCost": "0",
    "AddressInfo": {
        "ID": 51821,
        "Title": "Autohaus Priller",
        "AddressLine1": "Schinderstraßl 22",
        "Town": "Ergolding",
        "StateOrProvince": "Landkreis Landshut",
        "Postcode": "84030",
        "CountryID": 87,
        "Latitude": 48.5639334818777,
        "Longitude": 12.1663182797622,
        "ContactTelephone1": "0 87 31 / 7 99 3",
        "AccessComments": "Kostenloses Laden an der Werkstatt des Nissan Autohauses während der Öffnungszeiten Mo-Fr 8-12,13-18Uhr, Sa 9-12Uhr. In der Werkstatt fragen, Steckdose nicht von außen zugänglich.",
        "RelatedURL": "https://www.autohaus-priller.de/",
        "DistanceUnit": 0
    },
    "Connections": [
        {
            "ID": 63768,
            "ConnectionTypeID": 28,
            "StatusTypeID": 50,
            "LevelID": 2,
            "Amps": 16,
            "Voltage": 230,
            "PowerKW": 3.7,
            "CurrentTypeID": 10,
            "Quantity": 1
        }
    ],
    "NumberOfPoints": 1,
    "StatusTypeID": 50,
    "DateLastStatusUpdate": "2015-07-27T07:10:00Z",
    "DataQualityLevel": 1,
    "DateCreated": "2015-07-27T06:56:00Z",
    "SubmissionStatusTypeID": 200
}