{
    "IsRecentlyVerified": true,
    "DateLastVerified": "2021-09-18T17:22:00Z",
    "ID": 189278,
    "UUID": "E5646F51-7097-4C82-9768-005BA2E546D1",
    "DataProviderID": 1,
    "OperatorID": 80,
    "UsageTypeID": 4,
    "UsageCost": "0.40/kWh",
    "AddressInfo": {
        "ID": 189637,
        "Title": "Viale Giacomo Matteotti",
        "AddressLine1": "Viale Giacomo Matteotti",
        "Town": "Calenzano",
        "StateOrProvince": "Tuscany",
        "Postcode": "50037",
        "CountryID": 112,
        "Latitude": 43.85731256868377,
        "Longitude": 11.145957988071132,
        "DistanceUnit": 0
    },
    "Connections": [
        {
            "ID": 306066,
            "ConnectionTypeID": 25,
            "StatusTypeID": 50,
            "LevelID": 2,
            "PowerKW": 20,
            "CurrentTypeID": 20,
            "Quantity": 2
        }
    ],
    "NumberOfPoints": 1,
    "StatusTypeID": 50,
    "DateLastStatusUpdate": "2021-09-19T09:01:00Z",
    "DataQualityLevel": 1,
    "DateCreated": "2021-09-18T17:22:00Z",
    "SubmissionStatusTypeID": 200
}