{
    "IsRecentlyVerified": false,
    "ID": 46893,
    "UUID": "277B8FDC-4EE7-42E1-9137-EDB3FA20A8F5",
    "DataProviderID": 1,
    "OperatorID": 189,
    "UsageTypeID": 4,
    "AddressInfo": {
        "ID": 47239,
        "Title": "E-Wald Ladesäule in Rotthalmünster",
        "AddressLine1": "Bräugasse",
        "Town": "Rotthalmünster",
        "Postcode": "94094",
        "CountryID": 87,
        "Latitude": 48.3591871805267,
        "Longitude": 13.201532551065,
        "DistanceUnit": 0
    },
    "Connections": [
        {
            "ID": 57701,
            "ConnectionTypeID": 25,
            "StatusTypeID": 50,
            "LevelID": 2,
            "Amps": 32,
            "Voltage": 400,
            "PowerKW": 22,
            "CurrentTypeID": 20,
            "Quantity": 2
        },
        {
            "ID": 57702,
            "ConnectionTypeID": 28,
            "StatusTypeID": 50,
            "LevelID": 2,
            "Amps": 16,
            "Voltage": 230,
            "PowerKW": 3.7,
            "CurrentTypeID": 10,
            "Quantity": 2
        }
    ],
    "NumberOfPoints": 2,
    "StatusTypeID": 50,
    "DateLastStatusUpdate": "2015-05-08T21:33:00Z",
    "DataQualityLevel": 1,
    "DateCreated": "2015-05-08T21:31:00Z",
    "SubmissionStatusTypeID": 200
}