{
    "UserComments": [
        {
            "ID": 9874,
            "ChargePointID": 41807,
            "CommentTypeID": 10,
            "UserName": "ajkelly",
            "Comment": "Although the charge point worked from the CYC app, when we ended the session through the app, the charger did not release the cable and so needed to contact CYC out of hours. ",
            "DateCreated": "2016-03-06T14:45:46.053Z",
            "User": {
                "ID": 6406,
                "Username": "ajkelly"
            },
            "CheckinStatusTypeID": 25
        },
        {
            "ID": 3737,
            "ChargePointID": 41807,
            "CommentTypeID": 10,
            "UserName": "Anon74856763534",
            "Comment": "Unit powered and ICE-free.",
            "DateCreated": "2015-02-10T11:46:12.04Z",
            "User": {
                "ID": 1192,
                "Username": "Anon74856763534"
            },
            "CheckinStatusTypeID": 210
        }
    ],
    "MediaItems": [
        {
            "ID": 986,
            "ChargePointID": 41807,
            "ItemURL": "https://s3-ap-southeast-2.amazonaws.com/openchargemap/images/GB/OCM41807/OCM-41807.orig.2015021011451510.jpg",
            "ItemThumbnailURL": "https://s3-ap-southeast-2.amazonaws.com/openchargemap/images/GB/OCM41807/OCM-41807.thmb.2015021011451510.jpg",
            "Comment": "",
            "IsEnabled": true,
            "IsVideo": false,
            "IsFeaturedItem": false,
            "IsExternalResource": false,
            "User": {
                "ID": 1192,
                "Username": "Anon74856763534"
            },
            "DateCreated": "2015-02-10T11:45:00Z"
        }
    ],
    "IsRecentlyVerified": false,
    "ID": 41807,
    "UUID": "1994BB1C-CABE-4AFD-9922-74A800FD3900",
    "DataProviderID": 1,
    "OperatorID": 3315,
    "OperatorsReference": "50648",
    "UsageTypeID": 4,
    "UsageCost": "Free",
    "AddressInfo": {
        "ID": 42153,
        "Title": "Shore Public Car Park",
        "AddressLine1": "Shore",
        "Town": "Arbroath",
        "StateOrProvince": "Angus",
        "Postcode": "DD11 1PS",
        "CountryID": 1,
        "Latitude": 56.5563526759245,
        "Longitude": -2.5839975158691,
        "DistanceUnit": 0
    },
    "Connections": [
        {
            "ID": 50076,
            "ConnectionTypeID": 25,
            "StatusTypeID": 50,
            "LevelID": 2,
            "Amps": 32,
            "Voltage": 400,
            "PowerKW": 22,
            "CurrentTypeID": 20,
            "Quantity": 2
        }
    ],
    "NumberOfPoints": 2,
    "StatusTypeID": 50,
    "DateLastStatusUpdate": "2018-06-12T05:14:00Z",
    "DataQualityLevel": 1,
    "DateCreated": "2015-02-10T11:45:00Z",
    "SubmissionStatusTypeID": 200
}