{
    "IsRecentlyVerified": false,
    "ID": 120337,
    "UUID": "865D31B9-FD8D-4CCD-9C30-5F74E3E2954B",
    "DataProviderID": 2,
    "DataProvidersReference": "62352",
    "OperatorID": 5,
    "UsageTypeID": 1,
    "AddressInfo": {
        "ID": 120683,
        "Title": "HILTON HEAD BMW",
        "AddressLine1": "1230 Fording Island Rd",
        "Town": "Bluffton",
        "StateOrProvince": "SC",
        "Postcode": "29910",
        "CountryID": 2,
        "Latitude": 32.2482895,
        "Longitude": -80.8356783,
        "ContactTelephone1": "888-758-4389",
        "AccessComments": "24 hours daily",
        "RelatedURL": "http://www.chargepoint.com/",
        "DistanceUnit": 0
    },
    "Connections": [
        {
            "ID": 169673,
            "ConnectionTypeID": 1,
            "LevelID": 2,
            "Amps": 16,
            "Voltage": 230,
            "PowerKW": 3.7,
            "CurrentTypeID": 10,
            "Quantity": 2
        }
    ],
    "DateLastStatusUpdate": "2020-06-26T02:54:00Z",
    "DataQualityLevel": 3,
    "DateCreated": "2019-04-01T04:59:00Z",
    "SubmissionStatusTypeID": 100
}