{
    "IsRecentlyVerified": false,
    "ID": 174260,
    "UUID": "9401B13F-C7FB-4400-90AF-B3DEE6E3E415",
    "DataProviderID": 19,
    "DataProvidersReference": "7426",
    "AddressInfo": {
        "ID": 174619,
        "Title": "Gåsevikveien 1",
        "AddressLine1": "Gåsevikveien 1",
        "Town": "KJELLER",
        "StateOrProvince": "Viken",
        "Postcode": "2007",
        "CountryID": 168,
        "Latitude": 59.97234,
        "Longitude": 11.04873,
        "AccessComments": "Laderen er montert på garasjen som står langs veien",
        "DistanceUnit": 0
    },
    "Connections": [
        {
            "ID": 269624,
            "ConnectionTypeID": 25,
            "Reference": "1",
            "LevelID": 2,
            "Amps": 32,
            "Voltage": 230,
            "PowerKW": 12.7,
            "CurrentTypeID": 20,
            "Comments": "Mode 3"
        }
    ],
    "NumberOfPoints": 1,
    "StatusTypeID": 0,
    "DateLastStatusUpdate": "2021-03-24T05:12:00Z",
    "DataQualityLevel": 2,
    "DateCreated": "2021-03-24T05:12:00Z",
    "SubmissionStatusTypeID": 100
}