{
    "IsRecentlyVerified": false,
    "ID": 160310,
    "UUID": "982B2013-D42B-4ACF-8C69-F029B5F8BE76",
    "DataProviderID": 2,
    "DataProvidersReference": "150194",
    "UsageTypeID": 2,
    "AddressInfo": {
        "ID": 160667,
        "Title": "Goodwill",
        "AddressLine1": "1867 S Robert St",
        "Town": "West Saint Paul",
        "StateOrProvince": "MN",
        "Postcode": "55118",
        "CountryID": 2,
        "Latitude": 44.890399,
        "Longitude": -93.080785,
        "ContactTelephone1": "",
        "AccessComments": "",
        "RelatedURL": "",
        "DistanceUnit": 0
    },
    "Connections": [
        {
            "ID": 230655,
            "ConnectionTypeID": 1,
            "LevelID": 2,
            "Amps": 16,
            "Voltage": 230,
            "PowerKW": 3.7,
            "CurrentTypeID": 10,
            "Quantity": 2
        }
    ],
    "StatusTypeID": 50,
    "DateLastStatusUpdate": "2020-06-26T03:08:00Z",
    "DataQualityLevel": 3,
    "DateCreated": "2020-06-26T03:08:00Z",
    "SubmissionStatusTypeID": 100
}