{
    "IsRecentlyVerified": false,
    "ID": 177125,
    "UUID": "84CBB80A-C48F-4369-8906-BA3E274F1672",
    "DataProviderID": 29,
    "DataProvidersReference": "17767",
    "OperatorID": 86,
    "AddressInfo": {
        "ID": 177484,
        "Title": "Burgplatz 1",
        "AddressLine1": "Burgplatz 1",
        "Town": "Bönnigheim",
        "Postcode": "74257",
        "CountryID": 87,
        "Latitude": 49.041859,
        "Longitude": 9.090844,
        "DistanceUnit": 0
    },
    "Connections": [
        {
            "ID": 275895,
            "ConnectionTypeID": 28,
            "StatusTypeID": 50,
            "LevelID": 2,
            "PowerKW": 22,
            "CurrentTypeID": 20
        },
        {
            "ID": 275896,
            "ConnectionTypeID": 25,
            "StatusTypeID": 50,
            "LevelID": 2,
            "PowerKW": 22,
            "CurrentTypeID": 20
        },
        {
            "ID": 296548,
            "ConnectionTypeID": 28,
            "StatusTypeID": 50,
            "LevelID": 2,
            "PowerKW": 22,
            "CurrentTypeID": 20
        },
        {
            "ID": 296549,
            "ConnectionTypeID": 25,
            "StatusTypeID": 50,
            "LevelID": 2,
            "PowerKW": 22,
            "CurrentTypeID": 20
        }
    ],
    "StatusTypeID": 0,
    "DateLastStatusUpdate": "2021-07-12T02:42:00Z",
    "MetadataValues": [
        {
            "ID": 9419,
            "MetadataFieldID": 4,
            "ItemValue": "Data from the German chargepoint registry provided by Bundesnetzagentur.de under the CC-BY 4.0 license"
        }
    ],
    "DataQualityLevel": 3,
    "DateCreated": "2021-07-08T09:48:00Z",
    "SubmissionStatusTypeID": 100
}