{
    "IsRecentlyVerified": false,
    "ID": 5049,
    "UUID": "93CD18E7-9106-48F1-AE30-8EF47FEBD2D1",
    "DataProviderID": 2,
    "DataProvidersReference": "40367",
    "OperatorID": 5,
    "UsageTypeID": 1,
    "AddressInfo": {
        "ID": 4989,
        "Title": "NV ENERGY",
        "AddressLine1": "6100 Neil Rd",
        "Town": "Reno",
        "StateOrProvince": "NV",
        "Postcode": "89511",
        "CountryID": 2,
        "Latitude": 39.468356,
        "Longitude": -119.782453,
        "ContactTelephone1": "888-758-4389",
        "AccessComments": "24 hours daily",
        "RelatedURL": "http://www.chargepoint.com/",
        "DistanceUnit": 0
    },
    "Connections": [
        {
            "ID": 2943,
            "ConnectionTypeID": 1,
            "LevelID": 2,
            "Amps": 16,
            "Voltage": 230,
            "PowerKW": 3,
            "CurrentTypeID": 10,
            "Quantity": 6
        },
        {
            "ID": 21042,
            "ConnectionTypeID": 1,
            "LevelID": 2,
            "Quantity": 4
        }
    ],
    "DateLastConfirmed": "2011-06-30T00:00:00Z",
    "StatusTypeID": 0,
    "DateLastStatusUpdate": "2019-04-06T04:03:00Z",
    "DataQualityLevel": 1,
    "DateCreated": "2011-07-27T11:31:00Z",
    "SubmissionStatusTypeID": 100
}