{
    "IsRecentlyVerified": false,
    "ID": 52649,
    "UUID": "0D3AFC43-2C02-4FF6-9312-903A37755F7F",
    "DataProviderID": 1,
    "OperatorID": 80,
    "UsageTypeID": 4,
    "UsageCost": "0,40€/kW",
    "AddressInfo": {
        "ID": 52995,
        "Title": "Eneldrive DEVAL Autoporto",
        "AddressLine1": "Loc. Autoporto",
        "Town": "Pollein",
        "StateOrProvince": "AO",
        "Postcode": "11020 ",
        "CountryID": 112,
        "Latitude": 45.735044961894,
        "Longitude": 7.36953133534552,
        "RelatedURL": "https://www.eneldrive.it/",
        "DistanceUnit": 0
    },
    "Connections": [
        {
            "ID": 65408,
            "ConnectionTypeID": 25,
            "StatusTypeID": 50,
            "LevelID": 2,
            "Amps": 32,
            "Voltage": 400,
            "PowerKW": 22,
            "CurrentTypeID": 20,
            "Quantity": 1
        },
        {
            "ID": 65409,
            "ConnectionTypeID": 36,
            "StatusTypeID": 50,
            "LevelID": 2,
            "Amps": 16,
            "Voltage": 240,
            "PowerKW": 3,
            "CurrentTypeID": 10,
            "Quantity": 1
        }
    ],
    "NumberOfPoints": 1,
    "StatusTypeID": 50,
    "DateLastStatusUpdate": "2016-04-08T09:58:00Z",
    "DataQualityLevel": 1,
    "DateCreated": "2015-09-06T09:32:00Z",
    "SubmissionStatusTypeID": 200
}