{
    "IsRecentlyVerified": false,
    "ID": 93733,
    "UUID": "10A09717-E913-4506-8757-F0E47D2B3D94",
    "DataProviderID": 1,
    "OperatorID": 59,
    "UsageTypeID": 4,
    "AddressInfo": {
        "ID": 94079,
        "Title": "Business Aviation Complex",
        "AddressLine1": "West Camp Road",
        "Town": "Seletar",
        "StateOrProvince": "Central",
        "Postcode": "798273",
        "CountryID": 202,
        "Latitude": 1.420811,
        "Longitude": 103.865224,
        "DistanceUnit": 0
    },
    "Connections": [
        {
            "ID": 132706,
            "ConnectionTypeID": 1,
            "StatusTypeID": 50,
            "LevelID": 2,
            "CurrentTypeID": 10,
            "Quantity": 1
        }
    ],
    "NumberOfPoints": 1,
    "StatusTypeID": 50,
    "DateLastStatusUpdate": "2017-10-06T12:22:00Z",
    "DataQualityLevel": 1,
    "DateCreated": "2017-10-06T12:21:00Z",
    "SubmissionStatusTypeID": 200
}