{
    "IsRecentlyVerified": false,
    "ID": 169320,
    "UUID": "1FB0206E-0E9F-42A4-8DD8-F16BD902DD70",
    "DataProviderID": 1,
    "OperatorID": 80,
    "UsageTypeID": 4,
    "AddressInfo": {
        "ID": 169679,
        "Title": "Castellana Papa Giovanni XXIII | ENELX",
        "AddressLine1": "Viale Papa Giovanni XXIII",
        "AddressLine2": "Castellana",
        "Town": "Pianella",
        "StateOrProvince": "PE",
        "Postcode": "65019",
        "CountryID": 112,
        "Latitude": 42.39653438786351,
        "Longitude": 14.109344878386878,
        "ContactTelephone1": "800.069.850",
        "RelatedURL": "https://www.enelx.com/it/it/emobility",
        "DistanceUnit": 0
    },
    "Connections": [
        {
            "ID": 257623,
            "ConnectionTypeID": 25,
            "StatusTypeID": 50,
            "LevelID": 2,
            "Amps": 32,
            "Voltage": 400,
            "PowerKW": 22,
            "CurrentTypeID": 20,
            "Quantity": 1
        },
        {
            "ID": 257624,
            "ConnectionTypeID": 36,
            "StatusTypeID": 50,
            "LevelID": 2,
            "Amps": 16,
            "Voltage": 240,
            "PowerKW": 3.7,
            "CurrentTypeID": 10,
            "Quantity": 1
        }
    ],
    "NumberOfPoints": 2,
    "StatusTypeID": 50,
    "DateLastStatusUpdate": "2020-10-14T14:35:00Z",
    "DataQualityLevel": 1,
    "DateCreated": "2020-10-14T14:35:00Z",
    "SubmissionStatusTypeID": 200
}