{
    "IsRecentlyVerified": false,
    "ID": 59096,
    "UUID": "1AA99956-D2C8-4E24-9ACE-A3BE1775D6E7",
    "DataProviderID": 1,
    "OperatorID": 23,
    "OperatorsReference": "10044",
    "UsageTypeID": 4,
    "UsageCost": "€0.37/kWh; Autres tarifs pour les voitures anciennes",
    "AddressInfo": {
        "ID": 59442,
        "Title": "Tesla Calais - Eurotunnel Terminal Supercharger",
        "AddressLine1": "Boulevard du Kent",
        "Town": "Coquelles",
        "StateOrProvince": "Nord-Pas-de-Calais",
        "Postcode": "62231",
        "CountryID": 80,
        "Latitude": 50.9350105287438,
        "Longitude": 1.81306105026249,
        "AccessComments": "After ticket booths, turn tight / sur la droite après la vérification de billets\r\n\r\n(Tesla have another Supercharger nearby at the Inter Hotel for those not travelling to the United Kingdom /\r\nTesla ont une autre Supercharger à Inter Hôtel proximité pour ceux qui ne voyagent au Royaume-Uni) ",
        "DistanceUnit": 0
    },
    "Connections": [
        {
            "ID": 74988,
            "ConnectionTypeID": 27,
            "StatusTypeID": 50,
            "LevelID": 3,
            "PowerKW": 150,
            "CurrentTypeID": 30,
            "Quantity": 8
        }
    ],
    "NumberOfPoints": 8,
    "GeneralComments": "Available to Eurotunnel passengers travelling from France to the UK only.",
    "StatusTypeID": 50,
    "DateLastStatusUpdate": "2021-11-03T21:59:00Z",
    "DataQualityLevel": 1,
    "DateCreated": "2016-01-07T11:42:00Z",
    "SubmissionStatusTypeID": 200
}