{
    "IsRecentlyVerified": false,
    "ID": 89328,
    "UUID": "0AB6BF24-8C9F-43A4-9D5A-3498A29834BD",
    "DataProviderID": 2,
    "DataProvidersReference": "81522",
    "OperatorID": 5,
    "UsageTypeID": 1,
    "AddressInfo": {
        "ID": 89674,
        "Title": "FAMILYMOTORSAG",
        "AddressLine1": "6000 Wible Rd",
        "Town": "Bakersfield",
        "StateOrProvince": "CA",
        "Postcode": "93313",
        "CountryID": 2,
        "Latitude": 35.2998645,
        "Longitude": -119.0384759,
        "ContactTelephone1": "888-758-4389",
        "AccessComments": "24 hours daily",
        "RelatedURL": "http://www.chargepoint.com/",
        "DistanceUnit": 0
    },
    "Connections": [
        {
            "ID": 126710,
            "ConnectionTypeID": 1,
            "LevelID": 2,
            "Amps": 16,
            "Voltage": 230,
            "PowerKW": 3,
            "CurrentTypeID": 10,
            "Quantity": 2
        }
    ],
    "DateLastStatusUpdate": "2019-04-06T04:02:00Z",
    "DataQualityLevel": 3,
    "DateCreated": "2017-06-22T08:16:00Z",
    "SubmissionStatusTypeID": 100
}