{
    "IsRecentlyVerified": false,
    "ID": 30925,
    "UUID": "885867A1-F8B4-46FB-B34A-FAD5F7C23DDF",
    "DataProviderID": 1,
    "DataProvidersReference": "1531",
    "AddressInfo": {
        "ID": 31271,
        "Title": "Koppang stasjon",
        "AddressLine1": "Koppang stasjon ",
        "Town": "KOPPANG",
        "StateOrProvince": "Innlandet",
        "Postcode": "2480",
        "CountryID": 168,
        "Latitude": 61.57311,
        "Longitude": 11.04397,
        "AccessComments": "",
        "DistanceUnit": 0
    },
    "Connections": [
        {
            "ID": 34154,
            "ConnectionTypeID": 0,
            "Reference": "1",
            "LevelID": 2,
            "Amps": 16,
            "Voltage": 230,
            "PowerKW": 3.7,
            "Comments": "Mode 1"
        },
        {
            "ID": 89237,
            "ConnectionTypeID": 0,
            "Reference": "2",
            "LevelID": 2,
            "Amps": 16,
            "Voltage": 230,
            "PowerKW": 3.7,
            "Comments": "Mode 1"
        }
    ],
    "NumberOfPoints": 2,
    "DateLastStatusUpdate": "2020-05-26T08:24:00Z",
    "DataQualityLevel": 2,
    "DateCreated": "2014-12-09T09:01:00Z",
    "SubmissionStatusTypeID": 100
}