{
    "IsRecentlyVerified": false,
    "ID": 93004,
    "UUID": "4114EAF1-6A90-46E0-8FC5-E0FF96E9E605",
    "DataProviderID": 1,
    "OperatorID": 23,
    "OperatorsReference": "34931",
    "UsageTypeID": 7,
    "AddressInfo": {
        "ID": 93350,
        "Title": "Innside Düsseldorf Hafen",
        "AddressLine1": "Innside Düsseldorf Hafen",
        "Postcode": "40221",
        "CountryID": 87,
        "Latitude": 51.214912,
        "Longitude": 6.75047,
        "ContactTelephone1": "+49 2114 47170",
        "DistanceUnit": 0
    },
    "Connections": [
        {
            "ID": 131738,
            "ConnectionTypeID": 30,
            "StatusTypeID": 50,
            "LevelID": 2,
            "Amps": 32,
            "Voltage": 400,
            "PowerKW": 22,
            "CurrentTypeID": 20,
            "Quantity": 1
        }
    ],
    "NumberOfPoints": 1,
    "GeneralComments": "1 Tesla Connector, up to 22kW.Available by reservation only. Please call ahead.",
    "StatusTypeID": 50,
    "DateLastStatusUpdate": "2018-10-03T15:29:00Z",
    "DataQualityLevel": 1,
    "DateCreated": "2017-09-15T05:35:00Z",
    "SubmissionStatusTypeID": 200
}