{
    "IsRecentlyVerified": false,
    "ID": 178648,
    "UUID": "07DEEA9C-0487-4BB2-872E-14372530066C",
    "DataProviderID": 29,
    "DataProvidersReference": "1389",
    "OperatorID": 86,
    "AddressInfo": {
        "ID": 179007,
        "Title": "Autobahn 5",
        "AddressLine1": "Autobahn 5",
        "Town": "Bad Bellingen",
        "Postcode": "79415",
        "CountryID": 87,
        "Latitude": 47.737003,
        "Longitude": 7.550667,
        "DistanceUnit": 0
    },
    "Connections": [
        {
            "ID": 279341,
            "ConnectionTypeID": 33,
            "StatusTypeID": 50,
            "LevelID": 3,
            "PowerKW": 50,
            "CurrentTypeID": 30
        },
        {
            "ID": 295343,
            "ConnectionTypeID": 2,
            "StatusTypeID": 50,
            "LevelID": 3,
            "PowerKW": 50,
            "CurrentTypeID": 30
        },
        {
            "ID": 295344,
            "ConnectionTypeID": 25,
            "StatusTypeID": 50,
            "LevelID": 2,
            "PowerKW": 22,
            "CurrentTypeID": 20
        }
    ],
    "StatusTypeID": 0,
    "DateLastStatusUpdate": "2021-07-12T02:39:00Z",
    "MetadataValues": [
        {
            "ID": 10942,
            "MetadataFieldID": 4,
            "ItemValue": "Data from the German chargepoint registry provided by Bundesnetzagentur.de under the CC-BY 4.0 license"
        }
    ],
    "DataQualityLevel": 3,
    "DateCreated": "2021-07-08T09:50:00Z",
    "SubmissionStatusTypeID": 100
}