{
    "IsRecentlyVerified": false,
    "ID": 135667,
    "UUID": "CAD7ECA3-D0A1-4C00-B99B-388CBB5A7653",
    "DataProviderID": 18,
    "DataProvidersReference": "314a07f9848eeff2f90ae29152999894",
    "OperatorID": 2244,
    "UsageTypeID": 5,
    "AddressInfo": {
        "ID": 136013,
        "Title": "Heath Gardens",
        "AddressLine1": "Heath Gardens",
        "Town": "Twickenham",
        "Postcode": "TW1 4LZ",
        "CountryID": 1,
        "Latitude": 51.443518,
        "Longitude": -0.337191,
        "AccessComments": "",
        "RelatedURL": "https://www.ubitricity.com",
        "DistanceUnit": 0
    },
    "Connections": [
        {
            "ID": 190078,
            "ConnectionTypeID": 25,
            "Reference": "suby1100002334",
            "StatusTypeID": 50,
            "LevelID": 2,
            "Amps": 16,
            "Voltage": 230,
            "PowerKW": 3.7,
            "CurrentTypeID": 10
        }
    ],
    "StatusTypeID": 0,
    "DateLastStatusUpdate": "2021-04-25T05:46:00Z",
    "MetadataValues": [
        {
            "ID": 5519,
            "MetadataFieldID": 4,
            "ItemValue": "Contains public sector information licensed under the Open Government Licence v2.0. http://www.nationalarchives.gov.uk/doc/open-government-licence/version/2/"
        }
    ],
    "DataQualityLevel": 3,
    "DateCreated": "2019-12-24T05:22:00Z",
    "SubmissionStatusTypeID": 100
}