{
    "IsRecentlyVerified": false,
    "ID": 29653,
    "UUID": "CD991FA1-6D06-4757-A362-5EEB739CB8AA",
    "DataProviderID": 15,
    "DataProvidersReference": "31172",
    "OperatorID": 1,
    "UsageTypeID": 1,
    "AddressInfo": {
        "ID": 29999,
        "Title": "324 South B Street",
        "AddressLine1": "324 South B Street",
        "Town": "Oxnard",
        "StateOrProvince": "CA",
        "Postcode": "93030",
        "CountryID": 2,
        "Latitude": 34.19943,
        "Longitude": -119.17929,
        "ContactTelephone1": "",
        "RelatedURL": "http://carstations.com/31172",
        "DistanceUnit": 0
    },
    "Connections": [
        {
            "ID": 32638,
            "ConnectionTypeID": 1,
            "Reference": "J1772",
            "LevelID": 2
        }
    ],
    "NumberOfPoints": 1,
    "StatusTypeID": 0,
    "DateLastStatusUpdate": "2017-11-04T14:04:00Z",
    "DataQualityLevel": 2,
    "DateCreated": "2014-11-29T05:39:00Z",
    "SubmissionStatusTypeID": 100
}