{
    "IsRecentlyVerified": false,
    "ID": 132780,
    "UUID": "8EF5A223-130A-489E-874B-2182B74CBB3F",
    "DataProviderID": 1,
    "OperatorID": 25,
    "OperatorsReference": "westminster-goldensquare",
    "UsageTypeID": 4,
    "UsageCost": "£0.073/minute; min £1.38; other tariffs available",
    "AddressInfo": {
        "ID": 133126,
        "Title": "Golden Square",
        "AddressLine1": "33 Golden Square",
        "Town": "London",
        "Postcode": "W1F 9JT",
        "CountryID": 1,
        "Latitude": 51.511818,
        "Longitude": -0.137617,
        "DistanceUnit": 0
    },
    "Connections": [
        {
            "ID": 185955,
            "ConnectionTypeID": 25,
            "StatusTypeID": 50,
            "LevelID": 2,
            "Amps": 32,
            "Voltage": 400,
            "PowerKW": 22,
            "CurrentTypeID": 20,
            "Quantity": 1
        }
    ],
    "NumberOfPoints": 1,
    "StatusTypeID": 50,
    "DateLastStatusUpdate": "2019-10-07T08:07:00Z",
    "DataQualityLevel": 1,
    "DateCreated": "2019-10-07T08:07:00Z",
    "SubmissionStatusTypeID": 200
}