{
    "IsRecentlyVerified": false,
    "ID": 96175,
    "UUID": "FDEAA136-C2DC-4425-9AC0-CCE10DDF11C4",
    "DataProviderID": 1,
    "OperatorID": 3315,
    "OperatorsReference": "52506",
    "UsageTypeID": 4,
    "UsageCost": "Free",
    "AddressInfo": {
        "ID": 96521,
        "Title": "Bridge of Allan",
        "AddressLine1": "Henderson Street",
        "Town": "Stirling",
        "Postcode": "FK9 4NA",
        "CountryID": 1,
        "Latitude": 56.15686,
        "Longitude": -3.95648,
        "DistanceUnit": 0
    },
    "Connections": [
        {
            "ID": 136267,
            "ConnectionTypeID": 25,
            "StatusTypeID": 50,
            "LevelID": 2,
            "Amps": 32,
            "Voltage": 230,
            "PowerKW": 7,
            "CurrentTypeID": 10,
            "Quantity": 2
        }
    ],
    "NumberOfPoints": 2,
    "StatusTypeID": 50,
    "DateLastStatusUpdate": "2020-06-01T05:14:00Z",
    "DataQualityLevel": 1,
    "DateCreated": "2017-12-14T06:14:00Z",
    "SubmissionStatusTypeID": 200
}