{
    "IsRecentlyVerified": false,
    "ID": 89318,
    "UUID": "96545312-7A72-42EA-8227-0194C9CD85D1",
    "DataProviderID": 2,
    "DataProvidersReference": "82263",
    "OperatorID": 5,
    "UsageTypeID": 1,
    "AddressInfo": {
        "ID": 89664,
        "Title": "MASP",
        "AddressLine1": "16999 Airport Blvd",
        "Town": "Mojave",
        "StateOrProvince": "CA",
        "Postcode": "93501",
        "CountryID": 2,
        "Latitude": 35.056127,
        "Longitude": -118.157621,
        "ContactTelephone1": "888-758-4389",
        "AccessComments": "24 hours daily",
        "RelatedURL": "http://www.chargepoint.com/",
        "DistanceUnit": 0
    },
    "Connections": [
        {
            "ID": 126699,
            "ConnectionTypeID": 1,
            "LevelID": 2,
            "Amps": 16,
            "Voltage": 230,
            "PowerKW": 3,
            "CurrentTypeID": 10,
            "Quantity": 4
        }
    ],
    "DateLastStatusUpdate": "2019-04-06T04:02:00Z",
    "DataQualityLevel": 3,
    "DateCreated": "2017-06-22T08:16:00Z",
    "SubmissionStatusTypeID": 100
}