{
    "IsRecentlyVerified": false,
    "ID": 143607,
    "UUID": "20FFD8EF-C4A9-4CA0-A71E-3971C41EB6A8",
    "DataProviderID": 2,
    "DataProvidersReference": "121252",
    "OperatorID": 5,
    "UsageTypeID": 1,
    "AddressInfo": {
        "ID": 143959,
        "Title": "MORGUARD",
        "AddressLine1": "77 City Centre Dr",
        "Town": "Mississauga",
        "StateOrProvince": "ON",
        "Postcode": "L5B 1M5",
        "CountryID": 44,
        "Latitude": 43.5921857,
        "Longitude": -79.6381983,
        "ContactTelephone1": "888-758-4389",
        "AccessComments": "24 hours daily",
        "RelatedURL": "http://www.chargepoint.com/",
        "DistanceUnit": 0
    },
    "Connections": [
        {
            "ID": 199966,
            "ConnectionTypeID": 1,
            "LevelID": 2,
            "Amps": 16,
            "Voltage": 230,
            "PowerKW": 3.7,
            "CurrentTypeID": 10,
            "Quantity": 1
        }
    ],
    "StatusTypeID": 50,
    "DateLastStatusUpdate": "2020-06-26T03:07:00Z",
    "DataQualityLevel": 3,
    "DateCreated": "2019-12-24T09:21:00Z",
    "SubmissionStatusTypeID": 100
}