{
    "IsRecentlyVerified": false,
    "ID": 53689,
    "UUID": "61963882-F4A3-4F05-9FFE-78E0AA73590E",
    "DataProviderID": 26,
    "DataProvidersReference": "67056",
    "OperatorID": 178,
    "OperatorsReference": "EVnetNL PNB-ENO098",
    "UsageCost": "0.00 jaarabonnement",
    "AddressInfo": {
        "ID": 54035,
        "Title": "Besterdplein 40",
        "AddressLine1": "Besterdplein 40",
        "Town": "Tilburg",
        "Postcode": "5014 HP",
        "CountryID": 159,
        "Latitude": 51.565017,
        "Longitude": 5.091278,
        "ContactTelephone1": "0800-3522365",
        "RelatedURL": "http://www.evnet.nl",
        "DistanceUnit": 0
    },
    "Connections": [
        {
            "ID": 66920,
            "ConnectionTypeID": 25,
            "LevelID": 2,
            "PowerKW": 11,
            "CurrentTypeID": 10
        }
    ],
    "NumberOfPoints": 2,
    "StatusTypeID": 50,
    "DateLastStatusUpdate": "2016-06-04T02:39:00Z",
    "DataQualityLevel": 3,
    "DateCreated": "2015-09-20T11:50:00Z",
    "SubmissionStatusTypeID": 100
}