{
    "UserComments": [
        {
            "ID": 22301,
            "ChargePointID": 154594,
            "CommentTypeID": 10,
            "UserName": "ForumElettrico.it",
            "Comment": "Pare veramente impossibile trovare anche solo uno di quei 3 posti liberi. Leggi la recensione completa qui > https://www.forumelettrico.it/forum/assago-calavera-fresh-mex-pole-2x22kw-t5692.html",
            "DateCreated": "2020-03-17T08:14:51.86Z",
            "User": {
                "ID": 11749,
                "Username": "ForumElettrico.it"
            },
            "CheckinStatusTypeID": 140,
            "IsActionedByEditor": false
        }
    ],
    "MediaItems": [
        {
            "ID": 21605,
            "ChargePointID": 154594,
            "ItemURL": "https://s3-ap-southeast-2.amazonaws.com/openchargemap/images/IT/OCM154594/OCM-154594.orig.2020031708152893.jpg",
            "ItemThumbnailURL": "https://s3-ap-southeast-2.amazonaws.com/openchargemap/images/IT/OCM154594/OCM-154594.thmb.2020031708152893.jpg",
            "Comment": "",
            "IsEnabled": true,
            "IsVideo": false,
            "IsFeaturedItem": false,
            "IsExternalResource": false,
            "User": {
                "ID": 11749,
                "Username": "ForumElettrico.it"
            },
            "DateCreated": "2020-03-17T08:16:00Z"
        },
        {
            "ID": 21606,
            "ChargePointID": 154594,
            "ItemURL": "https://s3-ap-southeast-2.amazonaws.com/openchargemap/images/IT/OCM154594/OCM-154594.orig.2020031708153656.jpg",
            "ItemThumbnailURL": "https://s3-ap-southeast-2.amazonaws.com/openchargemap/images/IT/OCM154594/OCM-154594.thmb.2020031708153656.jpg",
            "Comment": "",
            "IsEnabled": true,
            "IsVideo": false,
            "IsFeaturedItem": false,
            "IsExternalResource": false,
            "User": {
                "ID": 11749,
                "Username": "ForumElettrico.it"
            },
            "DateCreated": "2020-03-17T08:16:00Z"
        },
        {
            "ID": 21602,
            "ChargePointID": 154594,
            "ItemURL": "https://s3-ap-southeast-2.amazonaws.com/openchargemap/images/IT/OCM154594/OCM-154594.orig.2020031708150288.jpg",
            "ItemThumbnailURL": "https://s3-ap-southeast-2.amazonaws.com/openchargemap/images/IT/OCM154594/OCM-154594.thmb.2020031708150288.jpg",
            "Comment": "",
            "IsEnabled": true,
            "IsVideo": false,
            "IsFeaturedItem": false,
            "IsExternalResource": false,
            "User": {
                "ID": 11749,
                "Username": "ForumElettrico.it"
            },
            "DateCreated": "2020-03-17T08:15:00Z"
        },
        {
            "ID": 21603,
            "ChargePointID": 154594,
            "ItemURL": "https://s3-ap-southeast-2.amazonaws.com/openchargemap/images/IT/OCM154594/OCM-154594.orig.2020031708151089.jpg",
            "ItemThumbnailURL": "https://s3-ap-southeast-2.amazonaws.com/openchargemap/images/IT/OCM154594/OCM-154594.thmb.2020031708151089.jpg",
            "Comment": "",
            "IsEnabled": true,
            "IsVideo": false,
            "IsFeaturedItem": false,
            "IsExternalResource": false,
            "User": {
                "ID": 11749,
                "Username": "ForumElettrico.it"
            },
            "DateCreated": "2020-03-17T08:15:00Z"
        },
        {
            "ID": 21604,
            "ChargePointID": 154594,
            "ItemURL": "https://s3-ap-southeast-2.amazonaws.com/openchargemap/images/IT/OCM154594/OCM-154594.orig.2020031708152019.jpg",
            "ItemThumbnailURL": "https://s3-ap-southeast-2.amazonaws.com/openchargemap/images/IT/OCM154594/OCM-154594.thmb.2020031708152019.jpg",
            "Comment": "",
            "IsEnabled": true,
            "IsVideo": false,
            "IsFeaturedItem": false,
            "IsExternalResource": false,
            "User": {
                "ID": 11749,
                "Username": "ForumElettrico.it"
            },
            "DateCreated": "2020-03-17T08:15:00Z"
        }
    ],
    "IsRecentlyVerified": false,
    "ID": 154594,
    "UUID": "CFC52C42-7BEC-442E-8A04-9B209320542F",
    "DataProviderID": 1,
    "OperatorID": 1,
    "UsageTypeID": 6,
    "AddressInfo": {
        "ID": 154947,
        "Title": "Calavera Fresh Mex",
        "AddressLine1": "Viale della Fonte Lunga",
        "Town": "Assago",
        "StateOrProvince": "MI",
        "CountryID": 112,
        "Latitude": 45.405938,
        "Longitude": 9.151912,
        "RelatedURL": "https://www.forumelettrico.it/forum/assago-calavera-fresh-mex-pole-2x22kw-t5692.html",
        "DistanceUnit": 0
    },
    "Connections": [
        {
            "ID": 217452,
            "ConnectionTypeID": 25,
            "LevelID": 2,
            "PowerKW": 22
        }
    ],
    "NumberOfPoints": 1,
    "StatusTypeID": 50,
    "DateLastStatusUpdate": "2020-03-17T08:16:00Z",
    "DataQualityLevel": 1,
    "DateCreated": "2020-03-17T08:15:00Z",
    "SubmissionStatusTypeID": 200
}