{
    "UserComments": [
        {
            "ID": 20156,
            "ChargePointID": 41940,
            "CommentTypeID": 10,
            "UserName": "ricky101uk",
            "Comment": "Charger not working - shows power but car won’t accept the charge. Car worked fine on different charger. Another driver with an i3 also had problems. I have contacted geniepoint ",
            "Rating": 1,
            "DateCreated": "2018-09-17T07:29:18.357Z",
            "User": {
                "ID": 19059,
                "Username": "ricky101uk"
            },
            "CheckinStatusTypeID": 25
        }
    ],
    "IsRecentlyVerified": false,
    "ID": 41940,
    "UUID": "E5D6BEBE-8322-4137-AA10-DFF10610427E",
    "DataProviderID": 1,
    "OperatorID": 150,
    "UsageTypeID": 4,
    "UsageCost": "£0.50 + £0.30/kWh ",
    "AddressInfo": {
        "ID": 42286,
        "Title": "Pavillion car park",
        "AddressLine1": "Quay Road",
        "Town": "Ryde",
        "StateOrProvince": "Isle of Wight",
        "Postcode": "PO33 2HH",
        "CountryID": 1,
        "Latitude": 50.732474,
        "Longitude": -1.157001,
        "AccessComments": "Pavillion car park next to Hoverport",
        "RelatedURL": "http://www.chargepointservices.co.uk",
        "DistanceUnit": 0
    },
    "Connections": [
        {
            "ID": 50307,
            "ConnectionTypeID": 25,
            "Reference": "1",
            "StatusTypeID": 50,
            "LevelID": 2,
            "Amps": 32,
            "Voltage": 230,
            "PowerKW": 7,
            "CurrentTypeID": 10,
            "Quantity": 2
        }
    ],
    "NumberOfPoints": 2,
    "StatusTypeID": 50,
    "DateLastStatusUpdate": "2019-04-26T18:15:00Z",
    "MetadataValues": [
        {
            "ID": 1335,
            "MetadataFieldID": 4,
            "ItemValue": "Contains public sector information licensed under the Open Government Licence v2.0. http://www.nationalarchives.gov.uk/doc/open-government-licence/version/2/"
        }
    ],
    "DataQualityLevel": 3,
    "DateCreated": "2015-02-23T02:00:00Z",
    "SubmissionStatusTypeID": 100
}