{
    "IsRecentlyVerified": false,
    "ID": 167931,
    "UUID": "4FA082A9-5D6F-4094-95BA-21747FE8EB36",
    "DataProviderID": 1,
    "OperatorID": 21,
    "UsageTypeID": 4,
    "UsageCost": "Mobi.E compatible card or App",
    "AddressInfo": {
        "ID": 168290,
        "Title": "MCD-00001",
        "AddressLine1": "Rua Eng. Moura Pegado",
        "Town": "Macedo de Cavaleiros",
        "StateOrProvince": "Brangança",
        "CountryID": 180,
        "Latitude": 41.53824327313629,
        "Longitude": -6.968757779790849,
        "DistanceUnit": 0
    },
    "Connections": [
        {
            "ID": 254958,
            "ConnectionTypeID": 25,
            "StatusTypeID": 50,
            "LevelID": 2,
            "Amps": 32,
            "Voltage": 400,
            "PowerKW": 22,
            "CurrentTypeID": 20,
            "Quantity": 2
        }
    ],
    "NumberOfPoints": 2,
    "StatusTypeID": 50,
    "DateLastStatusUpdate": "2021-02-20T20:33:00Z",
    "DataQualityLevel": 1,
    "DateCreated": "2020-09-17T20:38:00Z",
    "SubmissionStatusTypeID": 200
}