{
    "IsRecentlyVerified": false,
    "ID": 136084,
    "UUID": "2D0A39CB-CF58-4D6D-8ACE-0A92E5759DF2",
    "DataProviderID": 18,
    "DataProvidersReference": "22e6a9213136964e32370c20e5020123",
    "OperatorID": 2244,
    "UsageTypeID": 4,
    "AddressInfo": {
        "ID": 136430,
        "Title": "Duke Road",
        "AddressLine1": "Duke Road",
        "Town": "London",
        "Postcode": "W4 2BX",
        "CountryID": 1,
        "Latitude": 51.488875,
        "Longitude": -0.257804,
        "AccessComments": "",
        "RelatedURL": "https://www.ubitricity.com",
        "DistanceUnit": 0
    },
    "Connections": [
        {
            "ID": 190511,
            "ConnectionTypeID": 25,
            "Reference": "suby1100000841",
            "StatusTypeID": 50,
            "LevelID": 2,
            "Amps": 16,
            "Voltage": 230,
            "PowerKW": 3.7,
            "CurrentTypeID": 10
        }
    ],
    "StatusTypeID": 0,
    "DateLastStatusUpdate": "2021-04-25T05:46:00Z",
    "MetadataValues": [
        {
            "ID": 5936,
            "MetadataFieldID": 4,
            "ItemValue": "Contains public sector information licensed under the Open Government Licence v2.0. http://www.nationalarchives.gov.uk/doc/open-government-licence/version/2/"
        }
    ],
    "DataQualityLevel": 3,
    "DateCreated": "2019-12-24T05:22:00Z",
    "SubmissionStatusTypeID": 100
}