{
    "IsRecentlyVerified": false,
    "ID": 95754,
    "UUID": "BAEC048C-EFEC-417D-BFEF-EBA77CDDAEA9",
    "DataProviderID": 1,
    "OperatorID": 105,
    "UsageTypeID": 4,
    "AddressInfo": {
        "ID": 96100,
        "Title": "Martinistraße ",
        "AddressLine1": "Martinistraße  19",
        "Town": "Recklinghausen",
        "StateOrProvince": "Kreis Recklinghausen",
        "Postcode": "45657",
        "CountryID": 87,
        "Latitude": 51.617292436430546,
        "Longitude": 7.201016423873154,
        "AccessComments": "24/7 nutzbar. Eintrag lt. innogy eCharge App.",
        "RelatedURL": "http://www.innogy.com/web/cms/de/3020064/home/emobility/mobilitaet/",
        "DistanceUnit": 0
    },
    "Connections": [
        {
            "ID": 135640,
            "ConnectionTypeID": 25,
            "StatusTypeID": 50,
            "LevelID": 2,
            "Amps": 32,
            "Voltage": 400,
            "PowerKW": 22,
            "CurrentTypeID": 20,
            "Quantity": 4
        }
    ],
    "NumberOfPoints": 4,
    "StatusTypeID": 50,
    "DateLastStatusUpdate": "2017-11-23T07:28:00Z",
    "DataQualityLevel": 1,
    "DateCreated": "2017-11-23T07:28:00Z",
    "SubmissionStatusTypeID": 200
}