{
    "IsRecentlyVerified": false,
    "ID": 120183,
    "UUID": "2FB2588A-42B4-42D9-A4E6-1AAD3325DC2F",
    "DataProviderID": 2,
    "DataProvidersReference": "70631",
    "OperatorID": 5,
    "UsageTypeID": 1,
    "AddressInfo": {
        "ID": 120529,
        "Title": "PRESIDIUM",
        "AddressLine1": "7607 Blessing Ave",
        "Town": "Austin",
        "StateOrProvince": "TX",
        "Postcode": "78752",
        "CountryID": 2,
        "Latitude": 30.3338571,
        "Longitude": -97.6913017,
        "ContactTelephone1": "888-758-4389",
        "AccessComments": "24 hours daily",
        "RelatedURL": "http://www.chargepoint.com/",
        "DistanceUnit": 0
    },
    "Connections": [
        {
            "ID": 169509,
            "ConnectionTypeID": 1,
            "LevelID": 2,
            "Amps": 16,
            "Voltage": 230,
            "PowerKW": 3,
            "CurrentTypeID": 10,
            "Quantity": 2
        }
    ],
    "DateLastStatusUpdate": "2019-12-24T09:08:00Z",
    "DataQualityLevel": 3,
    "DateCreated": "2019-04-01T04:59:00Z",
    "SubmissionStatusTypeID": 100
}