{
    "IsRecentlyVerified": false,
    "ID": 77754,
    "UUID": "B5C9D945-EC1F-49FD-B27E-ED1714E28C56",
    "DataProviderID": 1,
    "OperatorID": 45,
    "UsageTypeID": 6,
    "AddressInfo": {
        "ID": 78100,
        "Title": " Rosalpina Dolomites",
        "AddressLine1": "Palmschoß 292",
        "Town": "Bressanone ",
        "StateOrProvince": "BZ",
        "Postcode": "39042 ",
        "CountryID": 112,
        "Latitude": 46.67585477292266,
        "Longitude": 11.709930135780965,
        "ContactTelephone1": "+39 0472 521 008",
        "ContactEmail": "info@rosalpina-dolomites.com",
        "RelatedURL": "http://www.rosalpina-dolomites.com/en/hideaway-vacation-dolomites/1-0.html",
        "DistanceUnit": 0
    },
    "Connections": [
        {
            "ID": 112330,
            "ConnectionTypeID": 1036,
            "StatusTypeID": 50,
            "LevelID": 2,
            "Amps": 16,
            "Voltage": 400,
            "PowerKW": 11,
            "CurrentTypeID": 20,
            "Quantity": 1
        }
    ],
    "NumberOfPoints": 1,
    "GeneralComments": "Tesla Destination Charging\r\n",
    "StatusTypeID": 50,
    "DateLastStatusUpdate": "2017-01-23T15:32:00Z",
    "DataQualityLevel": 1,
    "DateCreated": "2017-01-23T15:32:00Z",
    "SubmissionStatusTypeID": 200
}