{
    "IsRecentlyVerified": false,
    "ID": 70936,
    "UUID": "84E6F088-FFC2-41DA-B797-469858EB0710",
    "DataProviderID": 1,
    "OperatorID": 2244,
    "UsageTypeID": 4,
    "AddressInfo": {
        "ID": 71282,
        "Title": "Peter-Weiss-Gesamtschule",
        "AddressLine1": "Herderstraße 16",
        "AddressLine2": "Königsborn",
        "Town": "Unna",
        "StateOrProvince": "Kreis Unna",
        "Postcode": "59423",
        "CountryID": 87,
        "Latitude": 51.53319,
        "Longitude": 7.6955299999999625,
        "AccessComments": "Auf dem Lehrerparkplatz. Zu Schulzeiten (Mo-Fr) erst ab 15Uhr für die öffentliche Benutzung freigegeben. Es wird das Ubitricity Ladekabel benötigt!",
        "DistanceUnit": 0
    },
    "Connections": [
        {
            "ID": 101627,
            "ConnectionTypeID": 25,
            "StatusTypeID": 50,
            "LevelID": 2,
            "Amps": 16,
            "Voltage": 230,
            "PowerKW": 3.7,
            "CurrentTypeID": 10,
            "Quantity": 1
        }
    ],
    "NumberOfPoints": 1,
    "GeneralComments": "Eine einfache Steckdose hätte es auch getan!",
    "StatusTypeID": 50,
    "DateLastStatusUpdate": "2016-08-19T05:46:00Z",
    "DataQualityLevel": 1,
    "DateCreated": "2016-08-19T05:46:00Z",
    "SubmissionStatusTypeID": 200
}