{
    "IsRecentlyVerified": false,
    "ID": 143776,
    "UUID": "C705C93B-FD9D-4FA8-93E5-568B9BE426DC",
    "DataProviderID": 2,
    "DataProvidersReference": "129579",
    "OperatorID": 89,
    "UsageTypeID": 1,
    "AddressInfo": {
        "ID": 144128,
        "Title": "Kingston - Pump House-Steam House Museum",
        "AddressLine1": "23 Ontario St",
        "Town": "Kingston",
        "StateOrProvince": "ON",
        "Postcode": "K7L 2Y2",
        "CountryID": 44,
        "Latitude": 44.224133,
        "Longitude": -76.484737,
        "ContactTelephone1": "888-356-8911",
        "AccessComments": "24 hours daily",
        "RelatedURL": "https://flo.ca/",
        "DistanceUnit": 0
    },
    "Connections": [
        {
            "ID": 200171,
            "ConnectionTypeID": 1,
            "LevelID": 2,
            "Amps": 16,
            "Voltage": 230,
            "PowerKW": 3.7,
            "CurrentTypeID": 10,
            "Quantity": 2
        }
    ],
    "StatusTypeID": 50,
    "DateLastStatusUpdate": "2020-06-26T03:07:00Z",
    "DataQualityLevel": 3,
    "DateCreated": "2019-12-24T09:22:00Z",
    "SubmissionStatusTypeID": 100
}