{
    "IsRecentlyVerified": false,
    "ID": 181844,
    "UUID": "C50A67E3-9FFC-4341-B499-23243262A095",
    "DataProviderID": 29,
    "DataProvidersReference": "14390",
    "AddressInfo": {
        "ID": 182203,
        "Title": "Steinstraße 9",
        "AddressLine1": "Steinstraße 9",
        "Town": "Bad Oeynhausen",
        "Postcode": "32547",
        "CountryID": 87,
        "Latitude": 52.20661,
        "Longitude": 8.80521,
        "DistanceUnit": 0
    },
    "Connections": [
        {
            "ID": 286792,
            "ConnectionTypeID": 25,
            "StatusTypeID": 50,
            "LevelID": 2,
            "PowerKW": 22,
            "CurrentTypeID": 20
        },
        {
            "ID": 286793,
            "ConnectionTypeID": 25,
            "StatusTypeID": 50,
            "LevelID": 2,
            "PowerKW": 22,
            "CurrentTypeID": 20
        }
    ],
    "StatusTypeID": 50,
    "DateLastStatusUpdate": "2021-07-12T02:49:00Z",
    "MetadataValues": [
        {
            "ID": 14138,
            "MetadataFieldID": 4,
            "ItemValue": "Data from the German chargepoint registry provided by Bundesnetzagentur.de under the CC-BY 4.0 license"
        }
    ],
    "DataQualityLevel": 3,
    "DateCreated": "2021-07-08T10:02:00Z",
    "SubmissionStatusTypeID": 100
}