{
    "IsRecentlyVerified": false,
    "ID": 138450,
    "UUID": "8557B4D9-1E4A-49E8-B6EE-946BA0E17D49",
    "DataProviderID": 2,
    "DataProvidersReference": "147004",
    "UsageTypeID": 1,
    "AddressInfo": {
        "ID": 138799,
        "Title": "South Coast Solar",
        "AddressLine1": "2605 Ridgelake Dr",
        "Town": "Metairie",
        "StateOrProvince": "LA",
        "Postcode": "70002",
        "CountryID": 2,
        "Latitude": 29.999889,
        "Longitude": -90.153424,
        "ContactTelephone1": "855-980-7047",
        "AccessComments": "24 hours daily; primarily for employee use",
        "RelatedURL": "",
        "DistanceUnit": 0
    },
    "Connections": [
        {
            "ID": 193569,
            "ConnectionTypeID": 1,
            "LevelID": 2,
            "Amps": 16,
            "Voltage": 230,
            "PowerKW": 3.7,
            "CurrentTypeID": 10,
            "Quantity": 1
        }
    ],
    "StatusTypeID": 50,
    "DateLastStatusUpdate": "2020-06-26T02:54:00Z",
    "DataQualityLevel": 3,
    "DateCreated": "2019-12-24T09:08:00Z",
    "SubmissionStatusTypeID": 100
}