{
    "IsRecentlyVerified": false,
    "ID": 102240,
    "UUID": "B5F0D46C-FC5B-4F35-A76C-B02F912AC0F5",
    "DataProviderID": 1,
    "OperatorID": 45,
    "UsageTypeID": 1,
    "AddressInfo": {
        "ID": 102586,
        "Title": "Hotel Victory",
        "AddressLine1": "Vintrovna 35/443",
        "AddressLine2": "Popůvky u Brna",
        "Town": "Popůvky",
        "StateOrProvince": "okres Brno-venkov",
        "Postcode": "66441",
        "CountryID": 64,
        "Latitude": 49.1843189410624,
        "Longitude": 16.4758182221069,
        "ContactEmail": "frantisek.vychodil@datip.cz",
        "DistanceUnit": 0
    },
    "Connections": [
        {
            "ID": 144297,
            "ConnectionTypeID": 25,
            "StatusTypeID": 50,
            "LevelID": 2,
            "Amps": 32,
            "Voltage": 400,
            "PowerKW": 22,
            "CurrentTypeID": 20,
            "Quantity": 1
        }
    ],
    "NumberOfPoints": 1,
    "StatusTypeID": 50,
    "DateLastStatusUpdate": "2018-04-20T16:53:00Z",
    "DataQualityLevel": 1,
    "DateCreated": "2018-04-20T16:52:00Z",
    "SubmissionStatusTypeID": 200
}