{
    "IsRecentlyVerified": false,
    "ID": 102626,
    "UUID": "848D73A2-571B-489C-B3D2-733BB30EE3F7",
    "DataProviderID": 2,
    "DataProvidersReference": "88524",
    "OperatorID": 5,
    "UsageTypeID": 1,
    "AddressInfo": {
        "ID": 102972,
        "Title": "FACEBOOK",
        "AddressLine1": "164 Jefferson Dr. MPK 28",
        "Town": "Menlo Park",
        "StateOrProvince": "CA",
        "Postcode": "94025",
        "CountryID": 2,
        "Latitude": 37.481634,
        "Longitude": -122.172448,
        "ContactTelephone1": "888-758-4389",
        "AccessComments": "24 hours daily",
        "RelatedURL": "http://www.chargepoint.com/",
        "DistanceUnit": 0
    },
    "Connections": [
        {
            "ID": 144727,
            "ConnectionTypeID": 1,
            "LevelID": 2,
            "Amps": 16,
            "Voltage": 230,
            "PowerKW": 3,
            "CurrentTypeID": 10,
            "Quantity": 10
        }
    ],
    "DateLastStatusUpdate": "2019-04-06T04:02:00Z",
    "DataQualityLevel": 3,
    "DateCreated": "2018-04-21T04:13:00Z",
    "SubmissionStatusTypeID": 100
}