{
    "IsRecentlyVerified": false,
    "ID": 53263,
    "UUID": "8481BEE2-3DA8-40DD-9563-CA4F4CE74638",
    "DataProviderID": 2,
    "DataProvidersReference": "69878",
    "UsageTypeID": 1,
    "AddressInfo": {
        "ID": 53609,
        "Title": "City of Santa Fe - Genoveva Chavez Community Center",
        "AddressLine1": "3221 W Rodeo Rd",
        "Town": "Santa Fe",
        "StateOrProvince": "NM",
        "Postcode": "87507",
        "CountryID": 2,
        "Latitude": 35.641221,
        "Longitude": -105.994804,
        "ContactTelephone1": "505-955-4000",
        "AccessComments": "7am-6pm daily",
        "RelatedURL": "",
        "DistanceUnit": 0
    },
    "Connections": [
        {
            "ID": 66364,
            "ConnectionTypeID": 1,
            "LevelID": 2,
            "Amps": 16,
            "Voltage": 230,
            "PowerKW": 3,
            "CurrentTypeID": 10,
            "Quantity": 1
        }
    ],
    "DateLastStatusUpdate": "2019-04-06T04:02:00Z",
    "DataQualityLevel": 3,
    "DateCreated": "2015-09-20T11:18:00Z",
    "SubmissionStatusTypeID": 100
}