{
    "IsRecentlyVerified": false,
    "ID": 159878,
    "UUID": "024907D8-ED90-4FF7-A4BB-23EED801A58B",
    "DataProviderID": 2,
    "DataProvidersReference": "152192",
    "OperatorID": 3293,
    "UsageTypeID": 1,
    "AddressInfo": {
        "ID": 160235,
        "Title": "Oakbrook Center - Blue Garage 1st Floor",
        "AddressLine1": "100 Oakbrook Center",
        "Town": "Oak Brook",
        "StateOrProvince": "IL",
        "Postcode": "60523",
        "CountryID": 2,
        "Latitude": 41.851613,
        "Longitude": -87.951624,
        "ContactTelephone1": "888-264-2208",
        "AccessComments": "6am-12pm daily",
        "RelatedURL": "https://voltacharging.com/",
        "DistanceUnit": 0
    },
    "Connections": [
        {
            "ID": 230099,
            "ConnectionTypeID": 1,
            "LevelID": 2,
            "Amps": 16,
            "Voltage": 230,
            "PowerKW": 3.7,
            "CurrentTypeID": 10,
            "Quantity": 2
        }
    ],
    "StatusTypeID": 50,
    "DateLastStatusUpdate": "2020-06-26T03:05:00Z",
    "DataQualityLevel": 3,
    "DateCreated": "2020-06-26T03:05:00Z",
    "SubmissionStatusTypeID": 100
}