{
    "IsRecentlyVerified": false,
    "ID": 13186,
    "UUID": "948AD0A8-CD99-4323-B371-BA250972F38B",
    "DataProviderID": 1,
    "OperatorID": 45,
    "UsageTypeID": 6,
    "AddressInfo": {
        "ID": 13083,
        "Title": "Geraldine Road",
        "AddressLine1": "Geraldine Road",
        "Town": "Great Malvern",
        "Postcode": "WR14 3SZ",
        "CountryID": 1,
        "Latitude": 52.10497,
        "Longitude": -2.311893,
        "AccessComments": "One charging point, one plug, , One five pin J1772 tethered plug rated at 7kW, (mode 3; fast charge), , Fitted under Midlands PiP",
        "DistanceUnit": 0
    },
    "Connections": [
        {
            "ID": 10605,
            "ConnectionTypeID": 1,
            "StatusTypeID": 50,
            "LevelID": 2,
            "Amps": 32,
            "Voltage": 230,
            "PowerKW": 7,
            "CurrentTypeID": 10,
            "Quantity": 1
        }
    ],
    "NumberOfPoints": 1,
    "GeneralComments": "Open Monday to Friday from 9am to 5pm (at the latest). Gate is locked after 5pm.",
    "StatusTypeID": 50,
    "DateLastStatusUpdate": "2019-04-24T11:33:00Z",
    "DataQualityLevel": 3,
    "DateCreated": "2012-09-08T22:19:00Z",
    "SubmissionStatusTypeID": 200
}