{
    "IsRecentlyVerified": false,
    "ID": 127809,
    "UUID": "1BBF042E-3309-4DA0-9930-12CC6F53D009",
    "DataProviderID": 1,
    "OperatorID": 22,
    "OperatorsReference": "C7TY6",
    "UsageTypeID": 4,
    "AddressInfo": {
        "ID": 128155,
        "Title": "The Promenade",
        "AddressLine1": "Tramore",
        "Town": "County Waterford",
        "CountryID": 3,
        "Latitude": 52.159399,
        "Longitude": -7.14197,
        "DistanceUnit": 0
    },
    "Connections": [
        {
            "ID": 178924,
            "ConnectionTypeID": 25,
            "StatusTypeID": 50,
            "LevelID": 2,
            "Amps": 32,
            "Voltage": 400,
            "PowerKW": 22,
            "CurrentTypeID": 20,
            "Quantity": 2
        }
    ],
    "NumberOfPoints": 2,
    "StatusTypeID": 50,
    "DateLastStatusUpdate": "2019-06-12T05:43:00Z",
    "DataQualityLevel": 1,
    "DateCreated": "2019-06-12T05:43:00Z",
    "SubmissionStatusTypeID": 200
}