{
    "IsRecentlyVerified": false,
    "ID": 75235,
    "UUID": "D7750C6F-DF32-4C9B-8E6E-488795B6796E",
    "DataProviderID": 1,
    "OperatorID": 23,
    "OperatorsReference": "19736",
    "UsageTypeID": 4,
    "UsageCost": "Free",
    "AddressInfo": {
        "ID": 75581,
        "Title": "Domaine de Manville",
        "AddressLine1": "Domaine de Manville",
        "Town": "Les Baux-de-Provence",
        "StateOrProvince": "Provence-Alpes-Côte d'Azur",
        "Postcode": "13520",
        "CountryID": 80,
        "Latitude": 43.731909,
        "Longitude": 4.801986,
        "ContactTelephone1": "+33 4 90 54 40 20",
        "DistanceUnit": 0
    },
    "Connections": [
        {
            "ID": 108540,
            "ConnectionTypeID": 30,
            "StatusTypeID": 50,
            "LevelID": 2,
            "Amps": 32,
            "Voltage": 400,
            "PowerKW": 22,
            "CurrentTypeID": 20,
            "Quantity": 2
        }
    ],
    "NumberOfPoints": 2,
    "GeneralComments": "2 Tesla Connector, up to 22kW.Available to the public. Please see front desk.",
    "StatusTypeID": 50,
    "DateLastStatusUpdate": "2018-10-03T16:29:00Z",
    "DataQualityLevel": 1,
    "DateCreated": "2016-12-14T15:59:00Z",
    "SubmissionStatusTypeID": 200
}