{
    "IsRecentlyVerified": false,
    "ID": 87987,
    "UUID": "E04F3E8F-DE9E-42F3-8880-FA0F7B0CDFE8",
    "DataProviderID": 1,
    "OperatorID": 23,
    "OperatorsReference": "29528",
    "UsageTypeID": 4,
    "AddressInfo": {
        "ID": 88333,
        "Title": "Hotel Hacienda Cocoyoc",
        "AddressLine1": "Carretera Federal Cuernavaca- Cuautla KM 32.5 Cocoyoc Centro",
        "Town": "Yautepec",
        "StateOrProvince": "Morelos",
        "Postcode": "62736",
        "CountryID": 146,
        "Latitude": 18.883304,
        "Longitude": -98.984873,
        "ContactTelephone1": "+52 735 356 2211",
        "DistanceUnit": 0
    },
    "Connections": [
        {
            "ID": 124815,
            "ConnectionTypeID": 30,
            "StatusTypeID": 50,
            "LevelID": 2,
            "PowerKW": 18,
            "CurrentTypeID": 20,
            "Quantity": 2
        }
    ],
    "NumberOfPoints": 2,
    "GeneralComments": "2 Tesla Connectors, up to 18kW.Available for customers. Self park.",
    "StatusTypeID": 50,
    "DateLastStatusUpdate": "2017-05-19T05:32:00Z",
    "DataQualityLevel": 1,
    "DateCreated": "2017-05-19T05:32:00Z",
    "SubmissionStatusTypeID": 200
}