{
    "IsRecentlyVerified": false,
    "ID": 149493,
    "UUID": "0CFE0C22-B46E-42FB-ADEA-0845C5A72A1D",
    "DataProviderID": 1,
    "OperatorID": 23,
    "OperatorsReference": "34187",
    "UsageTypeID": 6,
    "UsageCost": "Check Tesla Navigation",
    "AddressInfo": {
        "ID": 149846,
        "Title": "Alcácer Do Sal Supercharger",
        "AddressLine1": "Boa Viagem Restaurante",
        "Town": "Alcacer do Sal",
        "StateOrProvince": "Setúbal",
        "CountryID": 180,
        "Latitude": 38.392402,
        "Longitude": -8.51382,
        "AccessComments": "Only Tesla",
        "DistanceUnit": 0
    },
    "Connections": [
        {
            "ID": 207563,
            "ConnectionTypeID": 27,
            "StatusTypeID": 50,
            "LevelID": 3,
            "PowerKW": 150,
            "CurrentTypeID": 30,
            "Quantity": 10
        },
        {
            "ID": 268856,
            "ConnectionTypeID": 33,
            "StatusTypeID": 50,
            "LevelID": 3,
            "PowerKW": 150,
            "CurrentTypeID": 30,
            "Quantity": 10
        }
    ],
    "NumberOfPoints": 10,
    "GeneralComments": "10 Superchargers, available 24/7, up to 150kW",
    "StatusTypeID": 50,
    "DateLastStatusUpdate": "2021-09-25T19:21:00Z",
    "DataQualityLevel": 1,
    "DateCreated": "2020-02-27T06:53:00Z",
    "SubmissionStatusTypeID": 200
}