{
    "IsRecentlyVerified": false,
    "ID": 160087,
    "UUID": "211D7D3E-BCFE-47F3-BAE2-7033A79DCD4D",
    "DataProviderID": 2,
    "DataProvidersReference": "156641",
    "OperatorID": 5,
    "UsageTypeID": 1,
    "AddressInfo": {
        "ID": 160444,
        "Title": "MARKET 32 EV",
        "AddressLine1": "1 S Barney Rd",
        "Town": "Clifton Park",
        "StateOrProvince": "NY",
        "Postcode": "12065",
        "CountryID": 2,
        "Latitude": 42.840517,
        "Longitude": -73.806182,
        "ContactTelephone1": "888-758-4389",
        "AccessComments": "24 hours daily",
        "RelatedURL": "http://www.chargepoint.com/",
        "DistanceUnit": 0
    },
    "Connections": [
        {
            "ID": 230325,
            "ConnectionTypeID": 1,
            "LevelID": 2,
            "Amps": 16,
            "Voltage": 230,
            "PowerKW": 3.7,
            "CurrentTypeID": 10,
            "Quantity": 4
        }
    ],
    "StatusTypeID": 50,
    "DateLastStatusUpdate": "2020-06-26T03:06:00Z",
    "DataQualityLevel": 3,
    "DateCreated": "2020-06-26T03:06:00Z",
    "SubmissionStatusTypeID": 100
}