{
    "IsRecentlyVerified": false,
    "ID": 180789,
    "UUID": "9CE68C45-036A-4D67-A8FD-4E7FCEEF42F9",
    "DataProviderID": 29,
    "DataProvidersReference": "11273",
    "OperatorID": 69,
    "AddressInfo": {
        "ID": 181148,
        "Title": "Markstraße 4",
        "AddressLine1": "Markstraße 4",
        "Town": "Hopsten",
        "Postcode": "48496",
        "CountryID": 87,
        "Latitude": 52.383656,
        "Longitude": 7.60426,
        "DistanceUnit": 0
    },
    "Connections": [
        {
            "ID": 284327,
            "ConnectionTypeID": 25,
            "StatusTypeID": 50,
            "LevelID": 2,
            "PowerKW": 22,
            "CurrentTypeID": 20
        },
        {
            "ID": 284328,
            "ConnectionTypeID": 25,
            "StatusTypeID": 50,
            "LevelID": 2,
            "PowerKW": 22,
            "CurrentTypeID": 20
        }
    ],
    "StatusTypeID": 50,
    "DateLastStatusUpdate": "2021-07-12T02:49:00Z",
    "MetadataValues": [
        {
            "ID": 13083,
            "MetadataFieldID": 4,
            "ItemValue": "Data from the German chargepoint registry provided by Bundesnetzagentur.de under the CC-BY 4.0 license"
        }
    ],
    "DataQualityLevel": 3,
    "DateCreated": "2021-07-08T10:01:00Z",
    "SubmissionStatusTypeID": 100
}