{
    "IsRecentlyVerified": false,
    "ID": 75510,
    "UUID": "51C38A84-1AAF-45C1-B9E0-96007E47A2A5",
    "DataProviderID": 1,
    "OperatorID": 89,
    "OperatorsReference": "AAB-10593",
    "UsageTypeID": 4,
    "UsageCost": "CAD 2.00/hour",
    "AddressInfo": {
        "ID": 75856,
        "Title": "SJHC-Olm Garage",
        "AddressLine1": "30 The Queensway",
        "Town": "Toronto",
        "StateOrProvince": "ON",
        "Postcode": "M6R 1B5",
        "CountryID": 44,
        "Latitude": 43.641067,
        "Longitude": -79.450148,
        "DistanceUnit": 0
    },
    "Connections": [
        {
            "ID": 108842,
            "ConnectionTypeID": 1,
            "StatusTypeID": 50,
            "LevelID": 2,
            "Amps": 32,
            "Voltage": 230,
            "PowerKW": 7,
            "CurrentTypeID": 10,
            "Quantity": 1
        }
    ],
    "NumberOfPoints": 1,
    "StatusTypeID": 50,
    "DateLastStatusUpdate": "2017-01-24T09:37:00Z",
    "DataQualityLevel": 1,
    "DateCreated": "2016-12-15T15:43:00Z",
    "SubmissionStatusTypeID": 200
}