{
    "IsRecentlyVerified": false,
    "ID": 4627,
    "UUID": "E1A72F54-B0CB-4279-A813-712706285D8B",
    "DataProviderID": 2,
    "DataProvidersReference": "37813",
    "UsageTypeID": 7,
    "AddressInfo": {
        "ID": 4572,
        "Title": "Courtyard Marriott - Hadley Amherst",
        "AddressLine1": "423 Russell St",
        "Town": "Hadley",
        "StateOrProvince": "MA",
        "Postcode": "01035",
        "CountryID": 2,
        "Latitude": 42.36262,
        "Longitude": -72.5395,
        "ContactTelephone1": "413-256-5454",
        "AccessComments": "24 hours daily; for guest use only\r\nPublic - Call ahead",
        "RelatedURL": "",
        "DistanceUnit": 0
    },
    "Connections": [
        {
            "ID": 15506,
            "ConnectionTypeID": 1,
            "LevelID": 2,
            "Amps": 16,
            "Voltage": 230,
            "PowerKW": 3.7,
            "CurrentTypeID": 10,
            "Quantity": 1
        },
        {
            "ID": 20452,
            "ConnectionTypeID": 1,
            "LevelID": 2,
            "Quantity": 1
        }
    ],
    "DateLastConfirmed": "2011-09-25T00:00:00Z",
    "StatusTypeID": 0,
    "DateLastStatusUpdate": "2020-06-26T03:05:00Z",
    "DataQualityLevel": 1,
    "DateCreated": "2011-07-04T18:02:00Z",
    "SubmissionStatusTypeID": 100
}