{
    "IsRecentlyVerified": false,
    "ID": 123783,
    "UUID": "F1BB52BE-622A-4CCD-9B94-7AB8F41234CC",
    "DataProviderID": 2,
    "DataProvidersReference": "93737",
    "OperatorID": 15,
    "UsageTypeID": 4,
    "AddressInfo": {
        "ID": 124129,
        "Title": "New Seasons",
        "AddressLine1": "760 E El Camino Real",
        "Town": "Sunnyvale",
        "StateOrProvince": "CA",
        "Postcode": "94087",
        "CountryID": 2,
        "Latitude": 37.356815,
        "Longitude": -122.020049,
        "ContactTelephone1": "877-455-3833",
        "AccessComments": "24 hours daily\r\nPublic - Card key at all times",
        "RelatedURL": "https://www.evgo.com/",
        "DistanceUnit": 0
    },
    "Connections": [
        {
            "ID": 173809,
            "ConnectionTypeID": 2,
            "LevelID": 3,
            "Amps": 100,
            "Voltage": 400,
            "PowerKW": 40,
            "CurrentTypeID": 30,
            "Quantity": 1
        },
        {
            "ID": 173810,
            "ConnectionTypeID": 32,
            "LevelID": 3,
            "Amps": 100,
            "Voltage": 400,
            "PowerKW": 40,
            "CurrentTypeID": 30,
            "Quantity": 1
        }
    ],
    "DateLastStatusUpdate": "2020-06-26T02:59:00Z",
    "DataQualityLevel": 3,
    "DateCreated": "2019-04-06T05:03:00Z",
    "SubmissionStatusTypeID": 100
}