{
    "IsRecentlyVerified": false,
    "ID": 182404,
    "UUID": "0D0E5911-3285-439B-ACE5-F19113B0B144",
    "DataProviderID": 29,
    "DataProvidersReference": "8616",
    "OperatorID": 184,
    "AddressInfo": {
        "ID": 182763,
        "Title": "Worthstr. 2 (Parkplatz)",
        "AddressLine1": "Worthstr. 2 (Parkplatz)",
        "Town": "Schalksmühle",
        "Postcode": "58579",
        "CountryID": 87,
        "Latitude": 51.240633,
        "Longitude": 7.531501,
        "DistanceUnit": 0
    },
    "Connections": [
        {
            "ID": 288090,
            "ConnectionTypeID": 25,
            "StatusTypeID": 50,
            "LevelID": 2,
            "PowerKW": 11,
            "CurrentTypeID": 20
        },
        {
            "ID": 288091,
            "ConnectionTypeID": 25,
            "StatusTypeID": 50,
            "LevelID": 2,
            "PowerKW": 22,
            "CurrentTypeID": 20
        }
    ],
    "StatusTypeID": 50,
    "DateLastStatusUpdate": "2021-07-09T03:22:00Z",
    "MetadataValues": [
        {
            "ID": 14698,
            "MetadataFieldID": 4,
            "ItemValue": "Data from the German chargepoint registry provided by Bundesnetzagentur.de under the CC-BY 4.0 license"
        }
    ],
    "DataQualityLevel": 3,
    "DateCreated": "2021-07-08T10:03:00Z",
    "SubmissionStatusTypeID": 100
}