{
    "IsRecentlyVerified": false,
    "ID": 139430,
    "UUID": "D80E3906-B478-414F-9ECE-15B6A4B6B6B1",
    "DataProviderID": 2,
    "DataProvidersReference": "124691",
    "OperatorID": 9,
    "UsageTypeID": 1,
    "AddressInfo": {
        "ID": 139782,
        "Title": "City Of Cerritos",
        "AddressLine1": "18125 Bloomfield Ave",
        "Town": "Cerritos",
        "StateOrProvince": "CA",
        "Postcode": "90703",
        "CountryID": 2,
        "Latitude": 33.866732,
        "Longitude": -118.06382,
        "ContactTelephone1": "888-998-2546",
        "AccessComments": "MON: 24 hours | TUE: 24 hours | WED: 24 hours | THU: 24 hours | FRI: 24 hours | SAT: 24 hours | SUN: 24 hours",
        "RelatedURL": "http://www.blinkcharging.com/",
        "DistanceUnit": 0
    },
    "Connections": [
        {
            "ID": 194791,
            "ConnectionTypeID": 1,
            "LevelID": 2,
            "Amps": 16,
            "Voltage": 230,
            "PowerKW": 3.7,
            "CurrentTypeID": 10,
            "Quantity": 2
        }
    ],
    "StatusTypeID": 50,
    "DateLastStatusUpdate": "2020-06-26T02:56:00Z",
    "DataQualityLevel": 3,
    "DateCreated": "2019-12-24T09:10:00Z",
    "SubmissionStatusTypeID": 100
}