{
    "IsRecentlyVerified": false,
    "ID": 137178,
    "UUID": "6570A0BF-5B47-4017-B9A6-FD086BD306FF",
    "DataProviderID": 2,
    "DataProvidersReference": "82386",
    "UsageTypeID": 1,
    "AddressInfo": {
        "ID": 137524,
        "Title": "Chinatown Gateway Plaza",
        "AddressLine1": "1031 Nuuanu Ave",
        "Town": "Honolulu",
        "StateOrProvince": "HI",
        "Postcode": "96817",
        "CountryID": 2,
        "Latitude": 21.310543,
        "Longitude": -157.862248,
        "ContactTelephone1": "808-524-3737",
        "AccessComments": "6am-12am daily",
        "RelatedURL": "",
        "DistanceUnit": 0
    },
    "Connections": [
        {
            "ID": 192038,
            "ConnectionTypeID": 1,
            "LevelID": 2,
            "Amps": 16,
            "Voltage": 230,
            "PowerKW": 3,
            "CurrentTypeID": 10,
            "Quantity": 3
        }
    ],
    "StatusTypeID": 50,
    "DateLastStatusUpdate": "2019-12-24T09:04:00Z",
    "DataQualityLevel": 3,
    "DateCreated": "2019-12-24T09:04:00Z",
    "SubmissionStatusTypeID": 100
}