{
    "MediaItems": [
        {
            "ID": 12688,
            "ChargePointID": 88427,
            "ItemURL": "https://s3-ap-southeast-2.amazonaws.com/openchargemap/images/NZ/OCM88427/OCM-88427.orig.2017052911502893.jpg",
            "ItemThumbnailURL": "https://s3-ap-southeast-2.amazonaws.com/openchargemap/images/NZ/OCM88427/OCM-88427.thmb.2017052911502893.jpg",
            "Comment": "",
            "IsEnabled": true,
            "IsVideo": false,
            "IsFeaturedItem": false,
            "IsExternalResource": false,
            "User": {
                "ID": 15365,
                "Username": "sliday"
            },
            "DateCreated": "2017-05-29T11:51:00Z"
        }
    ],
    "IsRecentlyVerified": false,
    "ID": 88427,
    "UUID": "A20BF86F-5AAB-48AC-9567-97BD230CB52C",
    "DataProviderID": 1,
    "UsageCost": "$5 or by negotiation",
    "AddressInfo": {
        "ID": 88773,
        "Title": "Bus Stop Cafe",
        "AddressLine1": "Lake Road",
        "Town": "Waikato, Mangakino",
        "Postcode": "3492",
        "CountryID": 161,
        "Latitude": -38.36596905414413,
        "Longitude": 175.78061157824857,
        "ContactTelephone1": "(027) 203-7110",
        "DistanceUnit": 0
    },
    "Connections": [
        {
            "ID": 125422,
            "ConnectionTypeID": 4
        },
        {
            "ID": 125423,
            "ConnectionTypeID": 29
        }
    ],
    "NumberOfPoints": 8,
    "GeneralComments": "Located at the Lakeside Reserve in Mangakino, the Bus Stop Cafe is a unique converted 1972 Bedford bus with stunning views across Lake Maraetai.\r\n",
    "StatusTypeID": 50,
    "DateLastStatusUpdate": "2017-05-29T11:51:00Z",
    "DataQualityLevel": 1,
    "DateCreated": "2017-05-29T11:50:00Z",
    "SubmissionStatusTypeID": 200
}