{
    "IsRecentlyVerified": false,
    "ID": 41160,
    "UUID": "AFFED270-9149-4450-ACD5-3722F442BD10",
    "DataProviderID": 2,
    "DataProvidersReference": "64734",
    "UsageTypeID": 1,
    "AddressInfo": {
        "ID": 41506,
        "Title": "Wayne State University - Parking Structure #7",
        "AddressLine1": "3717 John R",
        "Town": "Detroit",
        "StateOrProvince": "MI",
        "Postcode": "48202",
        "CountryID": 2,
        "Latitude": 42.349218009098,
        "Longitude": -83.0565744079649,
        "ContactTelephone1": "313-577-1979",
        "AccessComments": "Garage business hours",
        "RelatedURL": "",
        "DistanceUnit": 0
    },
    "Connections": [
        {
            "ID": 44938,
            "ConnectionTypeID": 1,
            "LevelID": 2,
            "Amps": 16,
            "Voltage": 230,
            "PowerKW": 3.7,
            "CurrentTypeID": 10,
            "Quantity": 1
        }
    ],
    "DateLastStatusUpdate": "2020-06-26T03:05:00Z",
    "DataQualityLevel": 3,
    "DateCreated": "2015-01-27T05:18:00Z",
    "SubmissionStatusTypeID": 100
}