{
    "IsRecentlyVerified": false,
    "ID": 92215,
    "UUID": "935F11DA-9206-4C9A-B98D-649F2A6BA0E6",
    "DataProviderID": 1,
    "OperatorID": 220,
    "OperatorsReference": "3614,3614,3615",
    "UsageTypeID": 1,
    "UsageCost": "€1.73 + €0.3213/kWh; Andere Tarife möglich",
    "AddressInfo": {
        "ID": 92561,
        "Title": "Uhlandstraße",
        "AddressLine1": "Uhlandstraße 4",
        "Town": "Hamburg",
        "StateOrProvince": "Hamburg",
        "Postcode": "22087",
        "CountryID": 87,
        "Latitude": 53.5651051,
        "Longitude": 10.0249136,
        "AccessComments": "24/7 nutzbar",
        "DistanceUnit": 0
    },
    "Connections": [
        {
            "ID": 130745,
            "ConnectionTypeID": 25,
            "StatusTypeID": 50,
            "LevelID": 2,
            "Amps": 32,
            "Voltage": 400,
            "PowerKW": 22,
            "CurrentTypeID": 20,
            "Quantity": 2
        },
        {
            "ID": 130746,
            "ConnectionTypeID": 28,
            "StatusTypeID": 50,
            "LevelID": 2,
            "Amps": 16,
            "Voltage": 230,
            "PowerKW": 3.7,
            "CurrentTypeID": 10,
            "Quantity": 2
        }
    ],
    "NumberOfPoints": 4,
    "StatusTypeID": 50,
    "DateLastStatusUpdate": "2017-09-10T14:11:00Z",
    "DataQualityLevel": 1,
    "DateCreated": "2017-08-31T10:10:00Z",
    "SubmissionStatusTypeID": 200
}