{
    "IsRecentlyVerified": false,
    "ID": 184998,
    "UUID": "C14AFE8F-E34A-44B7-AE49-48C9DD7D0A1F",
    "DataProviderID": 29,
    "DataProvidersReference": "3363",
    "OperatorID": 3403,
    "AddressInfo": {
        "ID": 185357,
        "Title": "Raststätte Zweidorfer Holz Süd",
        "AddressLine1": "Raststätte Zweidorfer Holz Süd",
        "Town": "Wendeburg",
        "Postcode": "38176",
        "CountryID": 87,
        "Latitude": 52.33838,
        "Longitude": 10.359787,
        "DistanceUnit": 0
    },
    "Connections": [
        {
            "ID": 293943,
            "ConnectionTypeID": 1036,
            "StatusTypeID": 50,
            "LevelID": 3,
            "PowerKW": 43,
            "CurrentTypeID": 20
        },
        {
            "ID": 293944,
            "ConnectionTypeID": 33,
            "StatusTypeID": 50,
            "LevelID": 3,
            "PowerKW": 50,
            "CurrentTypeID": 30
        },
        {
            "ID": 293945,
            "ConnectionTypeID": 2,
            "StatusTypeID": 50,
            "LevelID": 3,
            "PowerKW": 50,
            "CurrentTypeID": 30
        },
        {
            "ID": 293946,
            "ConnectionTypeID": 25,
            "StatusTypeID": 50,
            "LevelID": 2,
            "PowerKW": 22,
            "CurrentTypeID": 20
        }
    ],
    "StatusTypeID": 50,
    "DateLastStatusUpdate": "2021-07-12T02:49:00Z",
    "MetadataValues": [
        {
            "ID": 17289,
            "MetadataFieldID": 4,
            "ItemValue": "Data from the German chargepoint registry provided by Bundesnetzagentur.de under the CC-BY 4.0 license"
        }
    ],
    "DataQualityLevel": 3,
    "DateCreated": "2021-07-08T10:06:00Z",
    "SubmissionStatusTypeID": 100
}