{
    "IsRecentlyVerified": false,
    "ID": 103066,
    "UUID": "4867F834-648E-4639-BB75-7C66334DE7EB",
    "DataProviderID": 1,
    "DataProvidersReference": "4718",
    "AddressInfo": {
        "ID": 103412,
        "Title": "Stationen i Hovmantorp",
        "AddressLine1": "Storgatan 58",
        "Town": "HOVMANTORP",
        "StateOrProvince": "KRONOBERG",
        "Postcode": "36051",
        "CountryID": 216,
        "Latitude": 56.7861,
        "Longitude": 15.14102,
        "AccessComments": "Stolpen är placerad på parkeringen bredvid Järnvägscaféet",
        "DistanceUnit": 0
    },
    "Connections": [
        {
            "ID": 145238,
            "ConnectionTypeID": 0,
            "Reference": "1",
            "LevelID": 2,
            "Amps": 32,
            "Voltage": 400,
            "PowerKW": 22,
            "Comments": "Mode 3"
        },
        {
            "ID": 145239,
            "ConnectionTypeID": 0,
            "Reference": "2",
            "LevelID": 2,
            "Amps": 32,
            "Voltage": 400,
            "PowerKW": 22,
            "Comments": "Mode 3"
        }
    ],
    "NumberOfPoints": 2,
    "DateLastStatusUpdate": "2020-05-26T08:21:00Z",
    "DataQualityLevel": 2,
    "DateCreated": "2018-04-21T06:52:00Z",
    "SubmissionStatusTypeID": 100
}