{
    "IsRecentlyVerified": false,
    "ID": 179346,
    "UUID": "EEC07878-9B96-4091-95BE-B930CFF6FFFF",
    "DataProviderID": 29,
    "DataProvidersReference": "17447",
    "OperatorID": 105,
    "AddressInfo": {
        "ID": 179705,
        "Title": "Bahnwinkel 2",
        "AddressLine1": "Bahnwinkel 2",
        "Town": "Bohmte",
        "Postcode": "49163",
        "CountryID": 87,
        "Latitude": 52.368859,
        "Longitude": 8.312394,
        "DistanceUnit": 0
    },
    "Connections": [
        {
            "ID": 281046,
            "ConnectionTypeID": 25,
            "StatusTypeID": 50,
            "LevelID": 2,
            "PowerKW": 22,
            "CurrentTypeID": 20
        },
        {
            "ID": 281047,
            "ConnectionTypeID": 25,
            "StatusTypeID": 50,
            "LevelID": 2,
            "PowerKW": 22,
            "CurrentTypeID": 20
        }
    ],
    "StatusTypeID": 50,
    "DateLastStatusUpdate": "2021-07-12T02:49:00Z",
    "MetadataValues": [
        {
            "ID": 11640,
            "MetadataFieldID": 4,
            "ItemValue": "Data from the German chargepoint registry provided by Bundesnetzagentur.de under the CC-BY 4.0 license"
        }
    ],
    "DataQualityLevel": 3,
    "DateCreated": "2021-07-08T09:59:00Z",
    "SubmissionStatusTypeID": 100
}