{
    "IsRecentlyVerified": false,
    "ID": 159486,
    "UUID": "D35268E3-EBB8-4E13-9FD3-8C38B7ABC4CA",
    "DataProviderID": 2,
    "DataProvidersReference": "158364",
    "UsageTypeID": 1,
    "AddressInfo": {
        "ID": 159843,
        "Title": "Stratton Building",
        "AddressLine1": "401 S Spring St",
        "Town": "Springfield",
        "StateOrProvince": "IL",
        "Postcode": "62704",
        "CountryID": 2,
        "Latitude": 39.797803,
        "Longitude": -89.657204,
        "ContactTelephone1": "217-782-6445",
        "AccessComments": "24 hours daily",
        "RelatedURL": "",
        "DistanceUnit": 0
    },
    "Connections": [
        {
            "ID": 229672,
            "ConnectionTypeID": 1,
            "LevelID": 2,
            "Amps": 16,
            "Voltage": 230,
            "PowerKW": 3.7,
            "CurrentTypeID": 10,
            "Quantity": 2
        }
    ],
    "StatusTypeID": 50,
    "DateLastStatusUpdate": "2020-06-26T03:02:00Z",
    "DataQualityLevel": 3,
    "DateCreated": "2020-06-26T03:02:00Z",
    "SubmissionStatusTypeID": 100
}