{
    "IsRecentlyVerified": false,
    "ID": 102098,
    "UUID": "939685E4-1881-49EE-8832-6C73EED86308",
    "DataProviderID": 1,
    "OperatorID": 105,
    "UsageTypeID": 4,
    "AddressInfo": {
        "ID": 102444,
        "Title": "Matthias-Hoeren-Platz",
        "AddressLine1": "An der Sandkuhle 2",
        "Town": "Korschenbroich",
        "StateOrProvince": "Rhein-Kreis Neuss",
        "Postcode": "41352",
        "CountryID": 87,
        "Latitude": 51.18925546528936,
        "Longitude": 6.510835223120921,
        "AccessComments": "Auf dem Parkplatz an der Straßenseite direkt links an der Einfahrt st eine weiße Ladesäule. Parkplätze sind nicht reserviert!",
        "RelatedURL": "https://www.enbw.com/unternehmen/konzern/elektromobilitaet/elektromobilitaet-bei-der-enbw/",
        "DistanceUnit": 0
    },
    "Connections": [
        {
            "ID": 144085,
            "ConnectionTypeID": 25,
            "StatusTypeID": 50,
            "LevelID": 2,
            "Amps": 32,
            "Voltage": 400,
            "PowerKW": 22,
            "CurrentTypeID": 20,
            "Quantity": 2
        }
    ],
    "NumberOfPoints": 2,
    "StatusTypeID": 50,
    "DateLastStatusUpdate": "2018-04-16T07:50:00Z",
    "DataQualityLevel": 1,
    "DateCreated": "2018-04-16T07:50:00Z",
    "SubmissionStatusTypeID": 200
}