{
    "UserComments": [
        {
            "ID": 23194,
            "ChargePointID": 155765,
            "CommentTypeID": 10,
            "UserName": "ForumElettrico.it",
            "Comment": "Accanto abbiamo una gelateria ed in pochi minuti a piedi si arriva nel centro storico. Leggi la recensione completa qui > https://www.forumelettrico.it/forum/colonnina-enel-x-22-kw-stadio-enzo-ricci-sassuolo-mo-piazza-risorgimento-1-t12593.html",
            "RelatedURL": "https://www.forumelettrico.it/forum/colonnina-enel-x-22-kw-stadio-enzo-ricci-sassuolo-mo-piazza-risorgimento-1-t12593.html",
            "DateCreated": "2020-09-09T15:55:55.58Z",
            "User": {
                "ID": 11749,
                "Username": "ForumElettrico.it"
            },
            "CheckinStatusTypeID": 10,
            "IsActionedByEditor": false
        }
    ],
    "MediaItems": [
        {
            "ID": 24641,
            "ChargePointID": 155765,
            "ItemURL": "https://s3-ap-southeast-2.amazonaws.com/openchargemap/images/IT/OCM155765/OCM-155765.orig.2020090915563020.jpg",
            "ItemThumbnailURL": "https://s3-ap-southeast-2.amazonaws.com/openchargemap/images/IT/OCM155765/OCM-155765.thmb.2020090915563020.jpg",
            "Comment": "",
            "IsEnabled": true,
            "IsVideo": false,
            "IsFeaturedItem": false,
            "IsExternalResource": false,
            "User": {
                "ID": 11749,
                "Username": "ForumElettrico.it"
            },
            "DateCreated": "2020-09-09T15:57:00Z"
        },
        {
            "ID": 24637,
            "ChargePointID": 155765,
            "ItemURL": "https://s3-ap-southeast-2.amazonaws.com/openchargemap/images/IT/OCM155765/OCM-155765.orig.2020090915560623.jpg",
            "ItemThumbnailURL": "https://s3-ap-southeast-2.amazonaws.com/openchargemap/images/IT/OCM155765/OCM-155765.thmb.2020090915560623.jpg",
            "Comment": "",
            "IsEnabled": true,
            "IsVideo": false,
            "IsFeaturedItem": false,
            "IsExternalResource": false,
            "User": {
                "ID": 11749,
                "Username": "ForumElettrico.it"
            },
            "DateCreated": "2020-09-09T15:56:00Z"
        },
        {
            "ID": 24638,
            "ChargePointID": 155765,
            "ItemURL": "https://s3-ap-southeast-2.amazonaws.com/openchargemap/images/IT/OCM155765/OCM-155765.orig.2020090915561277.jpg",
            "ItemThumbnailURL": "https://s3-ap-southeast-2.amazonaws.com/openchargemap/images/IT/OCM155765/OCM-155765.thmb.2020090915561277.jpg",
            "Comment": "",
            "IsEnabled": true,
            "IsVideo": false,
            "IsFeaturedItem": false,
            "IsExternalResource": false,
            "User": {
                "ID": 11749,
                "Username": "ForumElettrico.it"
            },
            "DateCreated": "2020-09-09T15:56:00Z"
        },
        {
            "ID": 24639,
            "ChargePointID": 155765,
            "ItemURL": "https://s3-ap-southeast-2.amazonaws.com/openchargemap/images/IT/OCM155765/OCM-155765.orig.2020090915561866.jpg",
            "ItemThumbnailURL": "https://s3-ap-southeast-2.amazonaws.com/openchargemap/images/IT/OCM155765/OCM-155765.thmb.2020090915561866.jpg",
            "Comment": "",
            "IsEnabled": true,
            "IsVideo": false,
            "IsFeaturedItem": false,
            "IsExternalResource": false,
            "User": {
                "ID": 11749,
                "Username": "ForumElettrico.it"
            },
            "DateCreated": "2020-09-09T15:56:00Z"
        },
        {
            "ID": 24640,
            "ChargePointID": 155765,
            "ItemURL": "https://s3-ap-southeast-2.amazonaws.com/openchargemap/images/IT/OCM155765/OCM-155765.orig.2020090915562419.jpg",
            "ItemThumbnailURL": "https://s3-ap-southeast-2.amazonaws.com/openchargemap/images/IT/OCM155765/OCM-155765.thmb.2020090915562419.jpg",
            "Comment": "",
            "IsEnabled": true,
            "IsVideo": false,
            "IsFeaturedItem": false,
            "IsExternalResource": false,
            "User": {
                "ID": 11749,
                "Username": "ForumElettrico.it"
            },
            "DateCreated": "2020-09-09T15:56:00Z"
        }
    ],
    "IsRecentlyVerified": false,
    "ID": 155765,
    "UUID": "597FDFA7-8667-4681-9FB5-3183367CBAF0",
    "DataProviderID": 1,
    "OperatorID": 80,
    "UsageTypeID": 4,
    "AddressInfo": {
        "ID": 156119,
        "Title": "SASSUOLO Parcheggio piazza Risorgimento | ENELX",
        "AddressLine1": "Piazza Risorgimento",
        "AddressLine2": "Ingresso da Viale Giacomo Matteotti",
        "Town": "Sassuolo",
        "StateOrProvince": "MO",
        "Postcode": "41049",
        "CountryID": 112,
        "Latitude": 44.54016121018179,
        "Longitude": 10.787426085228049,
        "RelatedURL": "https://www.enelx.com/it/it/emobility",
        "DistanceUnit": 0
    },
    "Connections": [
        {
            "ID": 219329,
            "ConnectionTypeID": 25,
            "StatusTypeID": 50,
            "LevelID": 2,
            "Amps": 32,
            "Voltage": 400,
            "PowerKW": 22,
            "CurrentTypeID": 20,
            "Quantity": 2
        }
    ],
    "NumberOfPoints": 2,
    "StatusTypeID": 50,
    "DateLastStatusUpdate": "2020-09-09T15:57:00Z",
    "DataQualityLevel": 1,
    "DateCreated": "2020-04-23T15:49:00Z",
    "SubmissionStatusTypeID": 200
}