{
    "IsRecentlyVerified": false,
    "ID": 171104,
    "UUID": "73A695AA-DFF5-4660-BDE8-B659F43E29DC",
    "DataProviderID": 1,
    "OperatorID": 3353,
    "UsageTypeID": 4,
    "UsageCost": "0,16€/kWh",
    "AddressInfo": {
        "ID": 171463,
        "Title": "Kauppakeskus Lohi",
        "AddressLine1": "Suurlohjankatu 6-9",
        "Town": "Lohja",
        "StateOrProvince": "Southern Finland",
        "Postcode": "08100",
        "CountryID": 79,
        "Latitude": 60.25095514077046,
        "Longitude": 24.069706155382846,
        "RelatedURL": "http://www.plugitcloud.com",
        "DistanceUnit": 0
    },
    "Connections": [
        {
            "ID": 261452,
            "ConnectionTypeID": 25,
            "StatusTypeID": 50,
            "LevelID": 2,
            "Amps": 32,
            "Voltage": 400,
            "PowerKW": 22,
            "CurrentTypeID": 20,
            "Quantity": 5
        }
    ],
    "NumberOfPoints": 5,
    "StatusTypeID": 50,
    "DateLastStatusUpdate": "2020-12-20T18:49:00Z",
    "DataQualityLevel": 1,
    "DateCreated": "2020-12-20T18:13:00Z",
    "SubmissionStatusTypeID": 200
}