{
    "IsRecentlyVerified": false,
    "ID": 73740,
    "UUID": "2DC6852D-0E51-4B79-9E5F-EB59AE893B52",
    "DataProviderID": 1,
    "OperatorID": 89,
    "OperatorsReference": "AAA-433",
    "UsageTypeID": 4,
    "UsageCost": "CAD 1.00/hour",
    "AddressInfo": {
        "ID": 74086,
        "Title": "Oxford-1250 BLD. René-Lévesque O.",
        "AddressLine1": "1250 boul. René-Lévesque",
        "Town": "Montréal",
        "StateOrProvince": "QC",
        "Postcode": "H3B 2G4",
        "CountryID": 44,
        "Latitude": 45.49756,
        "Longitude": -73.571169,
        "DistanceUnit": 0
    },
    "Connections": [
        {
            "ID": 106041,
            "ConnectionTypeID": 1,
            "StatusTypeID": 50,
            "LevelID": 2,
            "Amps": 32,
            "Voltage": 230,
            "PowerKW": 7,
            "CurrentTypeID": 10,
            "Quantity": 1
        }
    ],
    "NumberOfPoints": 1,
    "StatusTypeID": 50,
    "DateLastStatusUpdate": "2017-01-24T09:52:00Z",
    "DataQualityLevel": 1,
    "DateCreated": "2016-11-23T22:54:00Z",
    "SubmissionStatusTypeID": 200
}