{
    "IsRecentlyVerified": false,
    "ID": 66691,
    "UUID": "7516709B-FFC1-4812-B31B-193961FF3E35",
    "DataProviderID": 1,
    "OperatorID": 23,
    "OperatorsReference": "21813",
    "UsageTypeID": 6,
    "UsageCost": "Free",
    "AddressInfo": {
        "ID": 67037,
        "Title": "Blue Ridge Inn Bed and Breakfast",
        "AddressLine1": "477 W First St",
        "Town": "Blue Ridge",
        "StateOrProvince": "GA",
        "Postcode": "30513",
        "CountryID": 2,
        "Latitude": 34.8661044,
        "Longitude": -84.3250675,
        "ContactTelephone1": "7066617575",
        "ContactEmail": "info@blueridgeinnbandb.com",
        "AccessComments": "Plug in garage",
        "RelatedURL": "http://blueridgeinnbandb.com",
        "DistanceUnit": 0
    },
    "Connections": [
        {
            "ID": 92143,
            "ConnectionTypeID": 30,
            "StatusTypeID": 50,
            "LevelID": 2,
            "Amps": 32,
            "Voltage": 230,
            "PowerKW": 16,
            "CurrentTypeID": 10,
            "Quantity": 1
        }
    ],
    "NumberOfPoints": 1,
    "StatusTypeID": 50,
    "DateLastStatusUpdate": "2017-01-26T16:31:00Z",
    "DataQualityLevel": 1,
    "DateCreated": "2016-05-25T18:32:00Z",
    "SubmissionStatusTypeID": 200
}