{
    "IsRecentlyVerified": true,
    "DateLastVerified": "2021-08-07T11:01:00Z",
    "ID": 188632,
    "UUID": "EFA4923E-3D36-499F-8C7B-89D6840943C7",
    "DataProviderID": 1,
    "OperatorID": 45,
    "UsageTypeID": 5,
    "UsageCost": "£4 per hour ",
    "AddressInfo": {
        "ID": 188991,
        "Title": "May Garland Inn ",
        "AddressLine1": "Horam Road",
        "AddressLine2": "Horam",
        "Town": "Wealden",
        "StateOrProvince": "East Sussex",
        "Postcode": "TN21 0LJ ",
        "CountryID": 1,
        "Latitude": 50.92740729352033,
        "Longitude": 0.23899223247258305,
        "ContactTelephone1": "01435812249",
        "ContactEmail": "maygarland@live.com",
        "RelatedURL": "https://maygarlandinn.co.uk",
        "DistanceUnit": 0
    },
    "Connections": [
        {
            "ID": 304708,
            "ConnectionTypeID": 1036,
            "StatusTypeID": 50,
            "LevelID": 2,
            "Amps": 32,
            "Voltage": 400,
            "PowerKW": 22,
            "CurrentTypeID": 20,
            "Quantity": 1
        },
        {
            "ID": 304709,
            "ConnectionTypeID": 1036,
            "StatusTypeID": 50,
            "LevelID": 1,
            "Amps": 10,
            "Voltage": 240,
            "PowerKW": 2,
            "CurrentTypeID": 10,
            "Quantity": 2
        },
        {
            "ID": 304710,
            "ConnectionTypeID": 30,
            "StatusTypeID": 50,
            "LevelID": 2,
            "Amps": 31,
            "Voltage": 240,
            "PowerKW": 7.4,
            "CurrentTypeID": 10,
            "Quantity": 1
        },
        {
            "ID": 304711,
            "ConnectionTypeID": 4,
            "StatusTypeID": 50,
            "LevelID": 2,
            "Amps": 32,
            "Voltage": 240,
            "PowerKW": 7.4,
            "CurrentTypeID": 10,
            "Quantity": 1
        }
    ],
    "NumberOfPoints": 2,
    "GeneralComments": "22kw charger\r\n11kw charger coming soon",
    "StatusTypeID": 50,
    "DateLastStatusUpdate": "2021-08-08T20:18:00Z",
    "DataQualityLevel": 1,
    "DateCreated": "2021-08-07T11:01:00Z",
    "SubmissionStatusTypeID": 200
}