{
    "IsRecentlyVerified": false,
    "ID": 52982,
    "UUID": "C65BE166-DDE0-4FFF-B874-E60FC39BEC0C",
    "DataProviderID": 1,
    "OperatorID": 32,
    "OperatorsReference": "123",
    "UsageTypeID": 4,
    "UsageCost": "Inclusive; for Polar Plus subscription members only",
    "AddressInfo": {
        "ID": 53328,
        "Title": "Renault Liverpool",
        "AddressLine1": "Sefton Street",
        "Town": "Liverpool",
        "Postcode": "L8 6PZ",
        "CountryID": 1,
        "Latitude": 53.383579,
        "Longitude": -2.97723,
        "AccessComments": "Available dealership opening hours only",
        "DistanceUnit": 0
    },
    "Connections": [
        {
            "ID": 65992,
            "ConnectionTypeID": 25,
            "StatusTypeID": 50,
            "LevelID": 2,
            "Amps": 32,
            "Voltage": 400,
            "PowerKW": 22,
            "CurrentTypeID": 20,
            "Quantity": 2
        }
    ],
    "NumberOfPoints": 2,
    "StatusTypeID": 50,
    "DateLastStatusUpdate": "2019-03-08T06:17:00Z",
    "DataQualityLevel": 1,
    "DateCreated": "2015-09-16T08:26:00Z",
    "SubmissionStatusTypeID": 200
}