{
    "IsRecentlyVerified": false,
    "ID": 36422,
    "UUID": "68400074-C7C5-4339-B5B8-DFAFC3869B78",
    "DataProviderID": 26,
    "DataProvidersReference": "56095",
    "OperatorID": 73,
    "OperatorsReference": "EV-Box EVB-P1430225",
    "UsageCost": "0.00 jaarabonnement",
    "AddressInfo": {
        "ID": 36768,
        "Title": "Nieuw Nijenrode",
        "AddressLine1": "Nieuw Nijenrode",
        "Town": "Stichtse Vecht",
        "Postcode": "3621 MA",
        "CountryID": 159,
        "Latitude": 52.1603,
        "Longitude": 5.0076,
        "RelatedURL": "http://www.ev-box.nl",
        "DistanceUnit": 0
    },
    "Connections": [
        {
            "ID": 39933,
            "ConnectionTypeID": 25,
            "LevelID": 2,
            "PowerKW": 11,
            "CurrentTypeID": 10
        },
        {
            "ID": 48359,
            "ConnectionTypeID": 25,
            "LevelID": 2,
            "PowerKW": 11,
            "CurrentTypeID": 10
        },
        {
            "ID": 48360,
            "ConnectionTypeID": 25,
            "LevelID": 2,
            "PowerKW": 11,
            "CurrentTypeID": 10
        },
        {
            "ID": 48361,
            "ConnectionTypeID": 25,
            "LevelID": 2,
            "PowerKW": 11,
            "CurrentTypeID": 10
        },
        {
            "ID": 82305,
            "ConnectionTypeID": 25,
            "LevelID": 2,
            "PowerKW": 11,
            "CurrentTypeID": 10
        },
        {
            "ID": 82306,
            "ConnectionTypeID": 25,
            "LevelID": 2,
            "PowerKW": 11,
            "CurrentTypeID": 10
        }
    ],
    "NumberOfPoints": 1,
    "StatusTypeID": 50,
    "DateLastStatusUpdate": "2016-06-04T02:51:00Z",
    "DataQualityLevel": 3,
    "DateCreated": "2015-01-09T06:05:00Z",
    "SubmissionStatusTypeID": 100
}