{
    "IsRecentlyVerified": false,
    "ID": 71554,
    "UUID": "CC74BAB6-CD23-4A16-A7AC-12112D2C49B9",
    "DataProviderID": 1,
    "OperatorID": 23,
    "OperatorsReference": "19038",
    "UsageTypeID": 1,
    "UsageCost": "Free",
    "AddressInfo": {
        "ID": 71900,
        "Title": "Hampton Inn - Tesla",
        "AddressLine1": "1565 N Dixie Hwy",
        "Town": "Monroe",
        "StateOrProvince": "MI",
        "Postcode": "48162",
        "CountryID": 2,
        "Latitude": 41.9292802,
        "Longitude": -83.3529319,
        "ContactTelephone1": "734-289-5700  877-798-3752",
        "AccessComments": "24 hours daily; for Tesla use only; for guest use only; see front desk for access",
        "RelatedURL": "http://www.teslamotors.com/supercharger",
        "DistanceUnit": 0
    },
    "Connections": [
        {
            "ID": 102378,
            "ConnectionTypeID": 30,
            "StatusTypeID": 50,
            "LevelID": 2,
            "Amps": 16,
            "Voltage": 230,
            "PowerKW": 16,
            "CurrentTypeID": 10,
            "Quantity": 1
        }
    ],
    "NumberOfPoints": 1,
    "StatusTypeID": 50,
    "DateLastStatusUpdate": "2017-01-26T04:25:00Z",
    "DataQualityLevel": 3,
    "DateCreated": "2016-09-02T10:15:00Z",
    "SubmissionStatusTypeID": 100
}