{
    "UserComments": [
        {
            "ID": 20007,
            "ChargePointID": 107763,
            "CommentTypeID": 10,
            "UserName": "Hypermile",
            "Comment": "Looks like we are days away from Tesla turning on the site!",
            "DateCreated": "2018-08-08T21:18:10.923Z",
            "User": {
                "ID": 11824,
                "Username": "Hypermile"
            },
            "CheckinStatusTypeID": 140
        }
    ],
    "MediaItems": [
        {
            "ID": 16226,
            "ChargePointID": 107763,
            "ItemURL": "https://s3-ap-southeast-2.amazonaws.com/openchargemap/images/US/OCM107763/OCM-107763.orig.2018080821173394.jpg",
            "ItemThumbnailURL": "https://s3-ap-southeast-2.amazonaws.com/openchargemap/images/US/OCM107763/OCM-107763.thmb.2018080821173394.jpg",
            "Comment": "",
            "IsEnabled": true,
            "IsVideo": false,
            "IsFeaturedItem": false,
            "IsExternalResource": false,
            "User": {
                "ID": 11824,
                "Username": "Hypermile"
            },
            "DateCreated": "2018-08-08T21:18:00Z"
        },
        {
            "ID": 16222,
            "ChargePointID": 107763,
            "ItemURL": "https://s3-ap-southeast-2.amazonaws.com/openchargemap/images/US/OCM107763/OCM-107763.orig.2018080821162138.jpg",
            "ItemThumbnailURL": "https://s3-ap-southeast-2.amazonaws.com/openchargemap/images/US/OCM107763/OCM-107763.thmb.2018080821162138.jpg",
            "Comment": "",
            "IsEnabled": true,
            "IsVideo": false,
            "IsFeaturedItem": false,
            "IsExternalResource": false,
            "User": {
                "ID": 11824,
                "Username": "Hypermile"
            },
            "DateCreated": "2018-08-08T21:17:00Z"
        },
        {
            "ID": 16223,
            "ChargePointID": 107763,
            "ItemURL": "https://s3-ap-southeast-2.amazonaws.com/openchargemap/images/US/OCM107763/OCM-107763.orig.2018080821163517.jpg",
            "ItemThumbnailURL": "https://s3-ap-southeast-2.amazonaws.com/openchargemap/images/US/OCM107763/OCM-107763.thmb.2018080821163517.jpg",
            "Comment": "",
            "IsEnabled": true,
            "IsVideo": false,
            "IsFeaturedItem": false,
            "IsExternalResource": false,
            "User": {
                "ID": 11824,
                "Username": "Hypermile"
            },
            "DateCreated": "2018-08-08T21:17:00Z"
        },
        {
            "ID": 16224,
            "ChargePointID": 107763,
            "ItemURL": "https://s3-ap-southeast-2.amazonaws.com/openchargemap/images/US/OCM107763/OCM-107763.orig.2018080821165670.jpg",
            "ItemThumbnailURL": "https://s3-ap-southeast-2.amazonaws.com/openchargemap/images/US/OCM107763/OCM-107763.thmb.2018080821165670.jpg",
            "Comment": "",
            "IsEnabled": true,
            "IsVideo": false,
            "IsFeaturedItem": false,
            "IsExternalResource": false,
            "User": {
                "ID": 11824,
                "Username": "Hypermile"
            },
            "DateCreated": "2018-08-08T21:17:00Z"
        },
        {
            "ID": 16225,
            "ChargePointID": 107763,
            "ItemURL": "https://s3-ap-southeast-2.amazonaws.com/openchargemap/images/US/OCM107763/OCM-107763.orig.2018080821171130.jpg",
            "ItemThumbnailURL": "https://s3-ap-southeast-2.amazonaws.com/openchargemap/images/US/OCM107763/OCM-107763.thmb.2018080821171130.jpg",
            "Comment": "",
            "IsEnabled": true,
            "IsVideo": false,
            "IsFeaturedItem": false,
            "IsExternalResource": false,
            "User": {
                "ID": 11824,
                "Username": "Hypermile"
            },
            "DateCreated": "2018-08-08T21:17:00Z"
        }
    ],
    "IsRecentlyVerified": false,
    "ID": 107763,
    "UUID": "07785CB4-ED0F-4ED4-BF3D-B3BC962957C1",
    "DataProviderID": 1,
    "OperatorID": 23,
    "OperatorsReference": "45646",
    "UsageTypeID": 6,
    "UsageCost": "$0.20/min >=60kW; $0.10/min <60kW; other tariffs for older cars",
    "AddressInfo": {
        "ID": 108109,
        "Title": "Rudy's Country Store and Bar-B-Q",
        "AddressLine1": "14620 Northwest Fwy",
        "Town": "Houston",
        "StateOrProvince": "TX",
        "Postcode": "77040",
        "CountryID": 2,
        "Latitude": 29.8670457114485,
        "Longitude": -95.5384324281831,
        "AccessComments": "24/7",
        "RelatedURL": "http://tesla.com/findus",
        "DistanceUnit": 0
    },
    "Connections": [
        {
            "ID": 152159,
            "ConnectionTypeID": 27,
            "StatusTypeID": 30,
            "LevelID": 3,
            "Voltage": 400,
            "PowerKW": 135,
            "CurrentTypeID": 30,
            "Quantity": 8
        }
    ],
    "NumberOfPoints": 8,
    "GeneralComments": "24/7.  Bar-B-Q open late, with a gasoline service station on site.",
    "StatusTypeID": 50,
    "DateLastStatusUpdate": "2018-10-12T05:34:00Z",
    "DataQualityLevel": 1,
    "DateCreated": "2018-08-08T21:16:00Z",
    "SubmissionStatusTypeID": 200
}