{
    "IsRecentlyVerified": false,
    "ID": 144544,
    "UUID": "2451170B-9254-42CB-8750-8034E4771DD0",
    "DataProviderID": 2,
    "DataProvidersReference": "147566",
    "OperatorID": 90,
    "UsageTypeID": 1,
    "AddressInfo": {
        "ID": 144896,
        "Title": "5110 Chambord",
        "AddressLine1": "5110 Chambord",
        "Town": "Montréal",
        "StateOrProvince": "QC",
        "Postcode": "H2J 3N5",
        "CountryID": 44,
        "Latitude": 45.533061,
        "Longitude": -73.584577,
        "ContactTelephone1": "877-505-2674",
        "AccessComments": "24 hours daily",
        "RelatedURL": "https://lecircuitelectrique.com/",
        "DistanceUnit": 0
    },
    "Connections": [
        {
            "ID": 201052,
            "ConnectionTypeID": 1,
            "LevelID": 2,
            "Amps": 16,
            "Voltage": 230,
            "PowerKW": 3.7,
            "CurrentTypeID": 10,
            "Quantity": 2
        }
    ],
    "StatusTypeID": 50,
    "DateLastStatusUpdate": "2020-06-26T03:09:00Z",
    "DataQualityLevel": 3,
    "DateCreated": "2019-12-24T09:23:00Z",
    "SubmissionStatusTypeID": 100
}