{
    "IsRecentlyVerified": false,
    "ID": 51312,
    "UUID": "CA553224-0976-4D12-914D-12E96EEE54E1",
    "DataProviderID": 26,
    "DataProvidersReference": "66732",
    "OperatorID": 103,
    "OperatorsReference": "Allego NLALLEGO0002331",
    "UsageCost": "0.00 jaarabonnement",
    "AddressInfo": {
        "ID": 51658,
        "Title": "Dorpsstraat 51",
        "AddressLine1": "Dorpsstraat 51",
        "Town": "Wijchen",
        "Postcode": "6617 AC",
        "CountryID": 159,
        "Latitude": 51.8507355,
        "Longitude": 5.6662573,
        "ContactTelephone1": "0800-3745337",
        "RelatedURL": "http://www.allego.eu/",
        "DistanceUnit": 0
    },
    "Connections": [
        {
            "ID": 63499,
            "ConnectionTypeID": 25,
            "LevelID": 2,
            "PowerKW": 11,
            "CurrentTypeID": 10
        },
        {
            "ID": 63500,
            "ConnectionTypeID": 25,
            "LevelID": 2,
            "PowerKW": 11,
            "CurrentTypeID": 10
        }
    ],
    "NumberOfPoints": 1,
    "StatusTypeID": 50,
    "DateLastStatusUpdate": "2016-06-04T02:41:00Z",
    "DataQualityLevel": 3,
    "DateCreated": "2015-07-24T06:28:00Z",
    "SubmissionStatusTypeID": 100
}