{
    "IsRecentlyVerified": false,
    "ID": 112455,
    "UUID": "889CD09B-129D-4D3A-A706-0A3507238426",
    "DataProviderID": 1,
    "OperatorID": 80,
    "UsageTypeID": 4,
    "AddressInfo": {
        "ID": 112801,
        "Title": "Cavallirio Strona | EnelX",
        "AddressLine1": "Via alla Strona",
        "Town": "Cavallirio",
        "StateOrProvince": "NO",
        "Postcode": "28010 ",
        "CountryID": 112,
        "Latitude": 45.66165599802014,
        "Longitude": 8.39859790600633,
        "ContactTelephone1": "800.069.850",
        "RelatedURL": "https://www.enelx.com/it/it/emobility",
        "DistanceUnit": 0
    },
    "Connections": [
        {
            "ID": 158185,
            "ConnectionTypeID": 25,
            "StatusTypeID": 50,
            "LevelID": 2,
            "Amps": 32,
            "Voltage": 400,
            "PowerKW": 22,
            "CurrentTypeID": 20,
            "Quantity": 2
        }
    ],
    "NumberOfPoints": 2,
    "StatusTypeID": 50,
    "DateLastStatusUpdate": "2018-10-30T14:01:00Z",
    "DataQualityLevel": 1,
    "DateCreated": "2018-10-30T14:01:00Z",
    "SubmissionStatusTypeID": 200
}