{
    "IsRecentlyVerified": false,
    "ID": 107911,
    "UUID": "C2E8AE5A-2CFB-4296-8021-FCC13ECDACF8",
    "DataProviderID": 1,
    "OperatorID": 3319,
    "UsageTypeID": 1,
    "UsageCost": "free",
    "AddressInfo": {
        "ID": 108257,
        "Title": "Budapest, Hegyalatti utca",
        "AddressLine1": "Hegyalatti utca 2.",
        "Town": "Budapest",
        "StateOrProvince": "Budapest",
        "Postcode": "1171",
        "CountryID": 104,
        "Latitude": 47.46908073367837,
        "Longitude": 19.29283027479937,
        "ContactTelephone1": "+36 80 21-00-12",
        "ContactEmail": "kommunikacio@e-mobi.hu",
        "RelatedURL": "https://e-mobi.hu/",
        "DistanceUnit": 0
    },
    "Connections": [
        {
            "ID": 152397,
            "ConnectionTypeID": 25,
            "StatusTypeID": 50,
            "LevelID": 2,
            "Amps": 32,
            "Voltage": 400,
            "PowerKW": 22,
            "CurrentTypeID": 20,
            "Quantity": 2
        }
    ],
    "NumberOfPoints": 2,
    "StatusTypeID": 50,
    "DateLastStatusUpdate": "2018-08-18T08:01:00Z",
    "DataQualityLevel": 1,
    "DateCreated": "2018-08-18T08:01:00Z",
    "SubmissionStatusTypeID": 200
}