{
    "UserComments": [
        {
            "ID": 22333,
            "ChargePointID": 125831,
            "CommentTypeID": 10,
            "UserName": "ForumElettrico.it",
            "Comment": "Nei dintorni c'è la cantina, il centro congressi, il ristorante, l'osteria, la passeggiata nel Bosco dei Pensieri. Leggi la recensione completa qui > https://www.forumelettrico.it/forum/colonnine-enel-x-22-22-kw-serralunga-d-alba-parcheggio-fontanafredda-t6106.html",
            "RelatedURL": "https://www.forumelettrico.it/forum/colonnine-enel-x-22-22-kw-serralunga-d-alba-parcheggio-fontanafredda-t6106.html",
            "DateCreated": "2020-03-23T07:49:15.49Z",
            "User": {
                "ID": 11749,
                "Username": "ForumElettrico.it"
            },
            "CheckinStatusTypeID": 10,
            "IsActionedByEditor": false
        },
        {
            "ID": 21834,
            "ChargePointID": 125831,
            "CommentTypeID": 10,
            "UserName": "Gigiv",
            "Comment": "pleasant place for charge, ",
            "Rating": 4,
            "DateCreated": "2019-11-18T20:14:30.107Z",
            "User": {
                "ID": 18828,
                "Username": "Gigiv"
            },
            "CheckinStatusTypeID": 10,
            "IsActionedByEditor": false
        }
    ],
    "MediaItems": [
        {
            "ID": 21680,
            "ChargePointID": 125831,
            "ItemURL": "https://s3-ap-southeast-2.amazonaws.com/openchargemap/images/IT/OCM125831/OCM-125831.orig.2020032307492742.jpg",
            "ItemThumbnailURL": "https://s3-ap-southeast-2.amazonaws.com/openchargemap/images/IT/OCM125831/OCM-125831.thmb.2020032307492742.jpg",
            "Comment": "",
            "IsEnabled": true,
            "IsVideo": false,
            "IsFeaturedItem": false,
            "IsExternalResource": false,
            "User": {
                "ID": 11749,
                "Username": "ForumElettrico.it"
            },
            "DateCreated": "2020-03-23T07:50:00Z"
        }
    ],
    "IsRecentlyVerified": false,
    "ID": 125831,
    "UUID": "0CCDF7E8-2D8A-457F-BADC-544E56FCBEFE",
    "DataProviderID": 1,
    "OperatorID": 80,
    "UsageTypeID": 4,
    "AddressInfo": {
        "ID": 126177,
        "Title": "Cantine Fontanafredda | EnelX",
        "AddressLine1": "Via Fontanafredda",
        "Town": "Serralunga d'Alba",
        "StateOrProvince": "CN",
        "Postcode": "12050",
        "CountryID": 112,
        "Latitude": 44.637990589620614,
        "Longitude": 7.985010620595631,
        "RelatedURL": "https://www.enelx.com/it/it/emobility",
        "DistanceUnit": 0
    },
    "Connections": [
        {
            "ID": 176343,
            "ConnectionTypeID": 25,
            "StatusTypeID": 50,
            "LevelID": 2,
            "Amps": 32,
            "Voltage": 400,
            "PowerKW": 22,
            "CurrentTypeID": 20,
            "Quantity": 4
        }
    ],
    "NumberOfPoints": 4,
    "StatusTypeID": 50,
    "DateLastStatusUpdate": "2020-03-23T07:50:00Z",
    "DataQualityLevel": 1,
    "DateCreated": "2019-04-29T16:32:00Z",
    "SubmissionStatusTypeID": 200
}