{
    "IsRecentlyVerified": false,
    "ID": 29954,
    "UUID": "B8B6BDF6-D97D-4F23-8398-C0871E0CD9A1",
    "DataProviderID": 15,
    "DataProvidersReference": "38131",
    "OperatorID": 5,
    "AddressInfo": {
        "ID": 30300,
        "Title": "160 Urquhart Ave",
        "AddressLine1": "160 Urquhart Ave",
        "Town": "Moncton",
        "StateOrProvince": "New Brunswick",
        "Postcode": "E1H 2R5",
        "CountryID": 44,
        "Latitude": 46.1275930084979,
        "Longitude": -64.7549992552948,
        "ContactTelephone1": "",
        "RelatedURL": "http://carstations.com/38131",
        "DistanceUnit": 0
    },
    "Connections": [
        {
            "ID": 32939,
            "ConnectionTypeID": 1,
            "Reference": "J1772",
            "LevelID": 2
        }
    ],
    "StatusTypeID": 0,
    "DateLastStatusUpdate": "2017-11-04T14:05:00Z",
    "DataQualityLevel": 2,
    "DateCreated": "2014-11-29T05:39:00Z",
    "SubmissionStatusTypeID": 100
}