{
    "UserComments": [
        {
            "ID": 17850,
            "ChargePointID": 77128,
            "CommentTypeID": 10,
            "UserName": "Erna_Schleck",
            "Comment": "Schönes Aufladen inmitten von Glasscherben und Altpapier. Wer denkt sich so einen Standort aus?",
            "Rating": 1,
            "DateCreated": "2017-10-22T17:57:13.067Z",
            "User": {
                "ID": 4573,
                "Username": "Erna_Schleck"
            },
            "CheckinStatusTypeID": 10
        }
    ],
    "MediaItems": [
        {
            "ID": 13568,
            "ChargePointID": 77128,
            "ItemURL": "https://s3-ap-southeast-2.amazonaws.com/openchargemap/images/DE/OCM77128/OCM-77128.orig.2017102217581973.jpg",
            "ItemThumbnailURL": "https://s3-ap-southeast-2.amazonaws.com/openchargemap/images/DE/OCM77128/OCM-77128.thmb.2017102217581973.jpg",
            "Comment": "",
            "IsEnabled": true,
            "IsVideo": false,
            "IsFeaturedItem": false,
            "IsExternalResource": false,
            "User": {
                "ID": 4573,
                "Username": "Erna_Schleck"
            },
            "DateCreated": "2017-10-22T17:59:00Z"
        },
        {
            "ID": 13569,
            "ChargePointID": 77128,
            "ItemURL": "https://s3-ap-southeast-2.amazonaws.com/openchargemap/images/DE/OCM77128/OCM-77128.orig.2017102217584865.jpg",
            "ItemThumbnailURL": "https://s3-ap-southeast-2.amazonaws.com/openchargemap/images/DE/OCM77128/OCM-77128.thmb.2017102217584865.jpg",
            "Comment": "",
            "IsEnabled": true,
            "IsVideo": false,
            "IsFeaturedItem": false,
            "IsExternalResource": false,
            "User": {
                "ID": 4573,
                "Username": "Erna_Schleck"
            },
            "DateCreated": "2017-10-22T17:59:00Z"
        }
    ],
    "IsRecentlyVerified": false,
    "ID": 77128,
    "UUID": "9345C687-C223-4683-ABE0-1BBB10F65F82",
    "DataProviderID": 1,
    "OperatorID": 1,
    "UsageTypeID": 4,
    "AddressInfo": {
        "ID": 77474,
        "Title": "Avacon am S-Bahnhof Wennigsen",
        "AddressLine1": "Heisterweg 2",
        "Town": "Wennigsen",
        "StateOrProvince": "Region Hannover",
        "Postcode": "30974",
        "CountryID": 87,
        "Latitude": 52.27987,
        "Longitude": 9.57323999999994,
        "AccessComments": "Ladesäule neben der Einfahrt zum kommunalen Bauhof zwischen Glas- und Altpapiercontainern, gegenüber/hinter dem S Bahnhof Wennigsen. Freischaltung mit z.B. New Motion Ladekarte, der QR Code ist nicht vorhanden (am 22.10.2017). Werbeladesäule mit großen hochkant stehendem Touchscreen,, der ansonsten Wettervorhersage und Werbung anzeigt.",
        "DistanceUnit": 0
    },
    "Connections": [
        {
            "ID": 110793,
            "ConnectionTypeID": 25,
            "StatusTypeID": 50,
            "LevelID": 2,
            "Amps": 16,
            "Voltage": 400,
            "PowerKW": 22,
            "CurrentTypeID": 20,
            "Quantity": 2
        }
    ],
    "NumberOfPoints": 2,
    "GeneralComments": "Betreiber ist die Avacon.",
    "StatusTypeID": 50,
    "DateLastStatusUpdate": "2017-10-22T19:57:00Z",
    "DataQualityLevel": 1,
    "DateCreated": "2017-01-02T14:18:00Z",
    "SubmissionStatusTypeID": 200
}