{
    "IsRecentlyVerified": false,
    "ID": 138821,
    "UUID": "6E36578E-06A7-46D3-9470-62ECA42AEB6A",
    "DataProviderID": 2,
    "DataProvidersReference": "95643",
    "OperatorID": 9,
    "UsageTypeID": 1,
    "AddressInfo": {
        "ID": 139173,
        "Title": "Nissan North America-Central Region",
        "AddressLine1": "4400 Regent Blvd",
        "Town": "Irving",
        "StateOrProvince": "TX",
        "Postcode": "75063",
        "CountryID": 2,
        "Latitude": 32.927491,
        "Longitude": -97.005533,
        "ContactTelephone1": "888-998-2546",
        "AccessComments": "MON: 24 hours | TUE: 24 hours | WED: 24 hours | THU: 24 hours | FRI: 24 hours | SAT: 24 hours | SUN: 24 hours",
        "RelatedURL": "http://www.blinkcharging.com/",
        "DistanceUnit": 0
    },
    "Connections": [
        {
            "ID": 194036,
            "ConnectionTypeID": 1,
            "LevelID": 2,
            "Amps": 16,
            "Voltage": 230,
            "PowerKW": 3.7,
            "CurrentTypeID": 10,
            "Quantity": 2
        }
    ],
    "StatusTypeID": 50,
    "DateLastStatusUpdate": "2020-06-26T02:55:00Z",
    "DataQualityLevel": 3,
    "DateCreated": "2019-12-24T09:09:00Z",
    "SubmissionStatusTypeID": 100
}