{
    "IsRecentlyVerified": false,
    "ID": 153818,
    "UUID": "6DD7B8E9-AB3A-417B-B53D-5D60B6C11A09",
    "DataProviderID": 28,
    "DataProvidersReference": "FR*S10*P10167A",
    "UsageTypeID": 5,
    "AddressInfo": {
        "ID": 154171,
        "Title": "GRANDVILLE",
        "AddressLine1": "5 Grande Rue 10700 GRANDVILLE",
        "CountryID": 80,
        "Latitude": 48.592374,
        "Longitude": 4.232003,
        "AccessComments": "",
        "DistanceUnit": 0
    },
    "Connections": [
        {
            "ID": 216017,
            "ConnectionTypeID": 28,
            "StatusTypeID": 50,
            "LevelID": 2,
            "PowerKW": 18,
            "CurrentTypeID": 10
        },
        {
            "ID": 216018,
            "ConnectionTypeID": 25,
            "StatusTypeID": 50,
            "LevelID": 2,
            "PowerKW": 18,
            "CurrentTypeID": 20
        },
        {
            "ID": 249831,
            "ConnectionTypeID": 28,
            "StatusTypeID": 50,
            "LevelID": 2,
            "PowerKW": 18,
            "CurrentTypeID": 10
        },
        {
            "ID": 249832,
            "ConnectionTypeID": 25,
            "StatusTypeID": 50,
            "LevelID": 2,
            "PowerKW": 18,
            "CurrentTypeID": 20
        }
    ],
    "GeneralComments": "\"Une unité = 6kWh de recharge. Utilisateur abonné : 1€/unité",
    "StatusTypeID": 50,
    "DateLastStatusUpdate": "2020-08-27T05:15:00Z",
    "DataQualityLevel": 2,
    "DateCreated": "2020-03-15T10:54:00Z",
    "SubmissionStatusTypeID": 100
}