{
    "IsRecentlyVerified": false,
    "ID": 156787,
    "UUID": "2B42FF8D-1FBC-498C-B83A-949DA09B6303",
    "DataProviderID": 19,
    "DataProvidersReference": "5922",
    "AddressInfo": {
        "ID": 157141,
        "Title": "Tanka Motala",
        "AddressLine1": "Vintergatan 9 ",
        "Town": "MOTALA",
        "StateOrProvince": "ÖSTERGÖTLAND",
        "Postcode": "59132",
        "CountryID": 216,
        "Latitude": 58.53598,
        "Longitude": 15.016,
        "AccessComments": "Vintergatan 9\r59132 Motala\r58°32U+0026#039;09.5\"N 15°00U+0026#039;57.6\"E",
        "DistanceUnit": 0
    },
    "Connections": [
        {
            "ID": 221868,
            "ConnectionTypeID": 25,
            "Reference": "1",
            "LevelID": 3,
            "Amps": 32,
            "Voltage": 400,
            "PowerKW": 22,
            "CurrentTypeID": 30
        }
    ],
    "NumberOfPoints": 1,
    "StatusTypeID": 0,
    "DateLastStatusUpdate": "2021-03-24T05:11:00Z",
    "DataQualityLevel": 2,
    "DateCreated": "2020-05-26T08:22:00Z",
    "SubmissionStatusTypeID": 100
}