{
    "IsRecentlyVerified": false,
    "ID": 112395,
    "UUID": "C6EA7F71-B3BC-4F9A-B461-09A3E82CAC55",
    "DataProviderID": 1,
    "OperatorID": 3315,
    "OperatorsReference": "51305",
    "UsageTypeID": 4,
    "UsageCost": "Free",
    "AddressInfo": {
        "ID": 112741,
        "Title": "West Harris Trust, Isle of Harris",
        "AddressLine1": "West Harris Trust, Isle of Harris",
        "Postcode": "HS3 3AE",
        "CountryID": 1,
        "Latitude": 57.85963,
        "Longitude": -6.99324,
        "DistanceUnit": 0
    },
    "Connections": [
        {
            "ID": 158092,
            "ConnectionTypeID": 25,
            "StatusTypeID": 50,
            "LevelID": 2,
            "Amps": 32,
            "Voltage": 400,
            "PowerKW": 22,
            "CurrentTypeID": 20,
            "Quantity": 2
        }
    ],
    "NumberOfPoints": 2,
    "StatusTypeID": 50,
    "DateLastStatusUpdate": "2018-10-29T06:14:00Z",
    "DataQualityLevel": 1,
    "DateCreated": "2018-10-29T06:14:00Z",
    "SubmissionStatusTypeID": 200
}