{
    "IsRecentlyVerified": false,
    "ID": 81497,
    "UUID": "E8FD7324-89A5-4D51-BD7B-B4195211BE55",
    "DataProviderID": 1,
    "OperatorID": 23,
    "OperatorsReference": "23406",
    "UsageTypeID": 7,
    "UsageCost": "Free",
    "AddressInfo": {
        "ID": 81843,
        "Title": "Designhotel Walliserhof",
        "AddressLine1": "43 Gufer",
        "Town": "Brand",
        "Postcode": "6708",
        "CountryID": 19,
        "Latitude": 47.105249,
        "Longitude": 9.740567,
        "ContactTelephone1": "+43 5559 241",
        "DistanceUnit": 0
    },
    "Connections": [
        {
            "ID": 116233,
            "ConnectionTypeID": 30,
            "StatusTypeID": 50,
            "LevelID": 2,
            "Amps": 16,
            "Voltage": 400,
            "PowerKW": 11,
            "CurrentTypeID": 20,
            "Quantity": 2
        }
    ],
    "NumberOfPoints": 2,
    "GeneralComments": "2 Tesla Connectors, up to 11kW.Available by reservation only. Please call ahead.",
    "StatusTypeID": 50,
    "DateLastStatusUpdate": "2018-10-03T16:12:00Z",
    "DataQualityLevel": 1,
    "DateCreated": "2017-02-02T17:25:00Z",
    "SubmissionStatusTypeID": 200
}