{
    "IsRecentlyVerified": false,
    "ID": 57454,
    "UUID": "952A22D9-C765-436D-81A4-5F8E2B923DF1",
    "DataProviderID": 1,
    "OperatorID": 1,
    "UsageTypeID": 0,
    "AddressInfo": {
        "ID": 57800,
        "Title": "Parkplatz",
        "AddressLine1": "Rebstraße",
        "Town": "Neuenburg am Rhein",
        "StateOrProvince": "Landkreis Breisgau-Hochschwarzwald",
        "Postcode": "79395",
        "CountryID": 87,
        "Latitude": 47.8147309,
        "Longitude": 7.56259139999997,
        "AccessComments": "Auf dem Parpkplatz in der Rebstraße neben dem Bonufacius-Amerbach-Haus, in dem die Stadtbibliothek untergebracht ist. \r\nEeine der beiden Säulen ist für die Gemeindesharing-Zoe reserviert und deshalb abgesperrt. Ladeleistung und Zugangskonditionen unbekannt! ",
        "DistanceUnit": 0
    },
    "Connections": [
        {
            "ID": 72573,
            "ConnectionTypeID": 25,
            "StatusTypeID": 50,
            "LevelID": 2,
            "PowerKW": 22,
            "CurrentTypeID": 20,
            "Quantity": 1
        }
    ],
    "NumberOfPoints": 1,
    "StatusTypeID": 50,
    "DateLastStatusUpdate": "2015-11-30T18:11:00Z",
    "DataQualityLevel": 1,
    "DateCreated": "2015-11-30T12:22:00Z",
    "SubmissionStatusTypeID": 200
}