{
    "IsRecentlyVerified": false,
    "ID": 29090,
    "UUID": "C6A26329-E0C5-4194-BB6F-AA8456579BEC",
    "DataProviderID": 2,
    "DataProvidersReference": "62504",
    "OperatorID": 5,
    "UsageTypeID": 1,
    "AddressInfo": {
        "ID": 29436,
        "Title": "DEFOREST",
        "AddressLine1": "4905 County Hwy V",
        "Town": "DeForest",
        "StateOrProvince": "WI",
        "Postcode": "53532",
        "CountryID": 2,
        "Latitude": 43.2498869,
        "Longitude": -89.3739808,
        "ContactTelephone1": "888-758-4389",
        "AccessComments": "24 hours daily",
        "RelatedURL": "http://www.chargepoint.com/",
        "DistanceUnit": 0
    },
    "Connections": [
        {
            "ID": 31966,
            "ConnectionTypeID": 1,
            "LevelID": 2,
            "Amps": 16,
            "Voltage": 230,
            "PowerKW": 3.7,
            "CurrentTypeID": 10,
            "Quantity": 2
        }
    ],
    "DateLastStatusUpdate": "2020-06-26T03:06:00Z",
    "DataQualityLevel": 3,
    "DateCreated": "2014-11-28T03:39:00Z",
    "SubmissionStatusTypeID": 100
}