{
    "IsRecentlyVerified": false,
    "ID": 90878,
    "UUID": "DA3DCCCD-64DD-437E-82A5-E1B0C2E74A11",
    "DataProviderID": 1,
    "OperatorID": 3,
    "OperatorsReference": "PG-80988,PG-80990,PG-80992",
    "UsageTypeID": 6,
    "UsageCost": "Free",
    "AddressInfo": {
        "ID": 91224,
        "Title": "Forbury Place",
        "AddressLine1": "Forbury Road",
        "Town": "Berkshire",
        "Postcode": "RG1 3JH",
        "CountryID": 1,
        "Latitude": 51.458135,
        "Longitude": -0.970005,
        "DistanceUnit": 0
    },
    "Connections": [
        {
            "ID": 128920,
            "ConnectionTypeID": 25,
            "StatusTypeID": 50,
            "LevelID": 2,
            "Amps": 32,
            "Voltage": 230,
            "PowerKW": 7,
            "CurrentTypeID": 10,
            "Quantity": 6
        }
    ],
    "NumberOfPoints": 10,
    "GeneralComments": "This is an open charge unit installed at Forbury Place in Forbury Road, Reading, Berkshire",
    "StatusTypeID": 50,
    "DateLastStatusUpdate": "2018-03-09T06:31:00Z",
    "DataQualityLevel": 1,
    "DateCreated": "2017-07-26T05:23:00Z",
    "SubmissionStatusTypeID": 200
}