{
    "IsRecentlyVerified": false,
    "ID": 183142,
    "UUID": "6380C45C-A099-4A09-A773-85EDE25BC2B7",
    "DataProviderID": 29,
    "DataProvidersReference": "3069",
    "AddressInfo": {
        "ID": 183501,
        "Title": "Sangerhäuser Straße 0",
        "AddressLine1": "Sangerhäuser Straße 0",
        "Town": "Lutherstadt Eisleben",
        "Postcode": "06295",
        "CountryID": 87,
        "Latitude": 51.528356,
        "Longitude": 11.541139,
        "DistanceUnit": 0
    },
    "Connections": [
        {
            "ID": 289760,
            "ConnectionTypeID": 25,
            "StatusTypeID": 50,
            "LevelID": 2,
            "PowerKW": 22,
            "CurrentTypeID": 20
        },
        {
            "ID": 289761,
            "ConnectionTypeID": 25,
            "StatusTypeID": 50,
            "LevelID": 2,
            "PowerKW": 22,
            "CurrentTypeID": 20
        }
    ],
    "StatusTypeID": 50,
    "DateLastStatusUpdate": "2021-07-09T03:24:00Z",
    "MetadataValues": [
        {
            "ID": 15435,
            "MetadataFieldID": 4,
            "ItemValue": "Data from the German chargepoint registry provided by Bundesnetzagentur.de under the CC-BY 4.0 license"
        }
    ],
    "DataQualityLevel": 3,
    "DateCreated": "2021-07-08T10:03:00Z",
    "SubmissionStatusTypeID": 100
}