{
    "IsRecentlyVerified": false,
    "ID": 166583,
    "UUID": "3A97DA3D-7AC0-400D-9DDB-4E0AE9F562AE",
    "DataProviderID": 28,
    "DataProvidersReference": "FR*S61*P61305A",
    "UsageTypeID": 5,
    "AddressInfo": {
        "ID": 166942,
        "Title": "Longny les Villages | Neuilly",
        "AddressLine1": "Neuilly 61290 Longny les Villages",
        "CountryID": 80,
        "Latitude": 48.54201,
        "Longitude": 0.903617,
        "AccessComments": "24/24 7/7",
        "DistanceUnit": 0
    },
    "Connections": [
        {
            "ID": 249685,
            "ConnectionTypeID": 25,
            "StatusTypeID": 50,
            "LevelID": 2,
            "PowerKW": 18,
            "CurrentTypeID": 20
        },
        {
            "ID": 249686,
            "ConnectionTypeID": 28,
            "StatusTypeID": 50,
            "LevelID": 2,
            "PowerKW": 18,
            "CurrentTypeID": 10
        },
        {
            "ID": 249687,
            "ConnectionTypeID": 26,
            "StatusTypeID": 50,
            "LevelID": 2,
            "PowerKW": 18
        },
        {
            "ID": 249688,
            "ConnectionTypeID": 28,
            "StatusTypeID": 50,
            "LevelID": 2,
            "PowerKW": 18,
            "CurrentTypeID": 10
        }
    ],
    "GeneralComments": "",
    "StatusTypeID": 50,
    "DateLastStatusUpdate": "2020-08-27T05:15:00Z",
    "DataQualityLevel": 2,
    "DateCreated": "2020-08-27T05:15:00Z",
    "SubmissionStatusTypeID": 100
}