{
    "IsRecentlyVerified": false,
    "ID": 45271,
    "UUID": "EBEDB893-D17C-4CD9-B02D-FE6B0C0CEC91",
    "DataProviderID": 1,
    "OperatorID": 45,
    "OperatorsReference": "26427",
    "UsageTypeID": 6,
    "AddressInfo": {
        "ID": 45617,
        "Title": "Hotel Restaurant Schloss Engers",
        "AddressLine1": "Alte SchlossStrasse 2",
        "Town": "Neuwied-Engers",
        "StateOrProvince": "Landkreis Neuwied",
        "Postcode": "56566",
        "CountryID": 87,
        "Latitude": 50.422968,
        "Longitude": 7.54323150000005,
        "ContactTelephone1": "+49 2622-9264295",
        "ContactEmail": "rezeption@schloss-engers.de",
        "AccessComments": "Ladesäule mit CEE 22kW Steckdose neben der Rezeption, auf Anfrage wird der Platz auch vorreserviert.",
        "RelatedURL": "http://www.schloss-engers.de/",
        "DistanceUnit": 0
    },
    "Connections": [
        {
            "ID": 55805,
            "ConnectionTypeID": 17,
            "StatusTypeID": 50,
            "LevelID": 2,
            "Amps": 32,
            "Voltage": 400,
            "PowerKW": 22,
            "CurrentTypeID": 20,
            "Quantity": 1
        }
    ],
    "NumberOfPoints": 2,
    "StatusTypeID": 50,
    "DateLastStatusUpdate": "2017-04-07T07:17:00Z",
    "DataQualityLevel": 1,
    "DateCreated": "2015-04-29T11:29:00Z",
    "SubmissionStatusTypeID": 200
}