{
    "UserComments": [
        {
            "ID": 8459,
            "ChargePointID": 59131,
            "CommentTypeID": 10,
            "UserName": "Chris",
            "Comment": "Good spot with park.",
            "Rating": 5,
            "DateCreated": "2016-01-08T05:23:59.717Z",
            "User": {
                "ID": 6744,
                "Username": "Chris"
            },
            "CheckinStatusTypeID": 10
        }
    ],
    "MediaItems": [
        {
            "ID": 4742,
            "ChargePointID": 59131,
            "ItemURL": "https://s3-ap-southeast-2.amazonaws.com/openchargemap/images/NZ/OCM59131/OCM-59131.orig.2016010805231935.jpg",
            "ItemThumbnailURL": "https://s3-ap-southeast-2.amazonaws.com/openchargemap/images/NZ/OCM59131/OCM-59131.thmb.2016010805231935.jpg",
            "Comment": "",
            "IsEnabled": true,
            "IsVideo": false,
            "IsFeaturedItem": false,
            "IsExternalResource": false,
            "User": {
                "ID": 6744,
                "Username": "Chris"
            },
            "DateCreated": "2016-01-08T05:24:00Z"
        }
    ],
    "IsRecentlyVerified": false,
    "ID": 59131,
    "UUID": "7CA89C2A-6A48-480B-9823-CE29CF7E0ACA",
    "DataProviderID": 1,
    "OperatorID": 45,
    "UsageTypeID": 6,
    "UsageCost": "Free",
    "AddressInfo": {
        "ID": 59477,
        "Title": "Les Mills Newmarket",
        "AddressLine1": "269 Khyber Pass Rd",
        "AddressLine2": "Newmarket",
        "Town": "Auckland",
        "Postcode": "1023",
        "CountryID": 161,
        "Latitude": -36.8662563,
        "Longitude": 174.7707158,
        "ContactTelephone1": "093672300",
        "AccessComments": "In carpark off Mountain Rd, business hours only.",
        "RelatedURL": "https://www.lesmills.co.nz/clubs/newmarket/",
        "DistanceUnit": 0
    },
    "Connections": [
        {
            "ID": 75040,
            "ConnectionTypeID": 1,
            "StatusTypeID": 50,
            "LevelID": 2,
            "Amps": 32,
            "Voltage": 230,
            "PowerKW": 7.4,
            "CurrentTypeID": 10,
            "Quantity": 1
        }
    ],
    "NumberOfPoints": 1,
    "GeneralComments": "Available for gym users only",
    "StatusTypeID": 50,
    "DateLastStatusUpdate": "2016-01-13T07:35:00Z",
    "DataQualityLevel": 1,
    "DateCreated": "2016-01-08T01:42:00Z",
    "SubmissionStatusTypeID": 200
}