{
    "IsRecentlyVerified": false,
    "ID": 140070,
    "UUID": "FF266108-2D7D-445F-B2D1-AA0B72493FE8",
    "DataProviderID": 2,
    "DataProvidersReference": "149561",
    "OperatorID": 15,
    "UsageTypeID": 1,
    "AddressInfo": {
        "ID": 140422,
        "Title": "Hampton Inn Lancaster",
        "AddressLine1": "2300 Double Play Way",
        "Town": "Lancaster",
        "StateOrProvince": "CA",
        "Postcode": "93536",
        "CountryID": 2,
        "Latitude": 34.7012,
        "Longitude": -118.171465,
        "ContactTelephone1": "877-455-3833",
        "AccessComments": "24 hours daily",
        "RelatedURL": "https://www.evgo.com/",
        "DistanceUnit": 0
    },
    "Connections": [
        {
            "ID": 195613,
            "ConnectionTypeID": 2,
            "LevelID": 3,
            "Amps": 100,
            "Voltage": 400,
            "PowerKW": 40,
            "CurrentTypeID": 30,
            "Quantity": 1
        },
        {
            "ID": 195614,
            "ConnectionTypeID": 32,
            "LevelID": 3,
            "Amps": 100,
            "Voltage": 400,
            "PowerKW": 40,
            "CurrentTypeID": 30,
            "Quantity": 1
        }
    ],
    "StatusTypeID": 50,
    "DateLastStatusUpdate": "2020-06-26T02:57:00Z",
    "DataQualityLevel": 3,
    "DateCreated": "2019-12-24T09:12:00Z",
    "SubmissionStatusTypeID": 100
}