{
    "IsRecentlyVerified": false,
    "ID": 180836,
    "UUID": "4362ADF8-74B2-4A4E-A959-5540A531921A",
    "DataProviderID": 29,
    "DataProvidersReference": "19446",
    "OperatorID": 127,
    "AddressInfo": {
        "ID": 181195,
        "Title": "Ammerländer Heerstr. 23",
        "AddressLine1": "Ammerländer Heerstr. 23",
        "Town": "Oldenburg",
        "Postcode": "26129",
        "CountryID": 87,
        "Latitude": 53.1439469,
        "Longitude": 8.18991419999997,
        "DistanceUnit": 0
    },
    "Connections": [
        {
            "ID": 284432,
            "ConnectionTypeID": 1036,
            "StatusTypeID": 50,
            "LevelID": 3,
            "PowerKW": 43,
            "CurrentTypeID": 20
        },
        {
            "ID": 284433,
            "ConnectionTypeID": 33,
            "StatusTypeID": 50,
            "LevelID": 3,
            "PowerKW": 50,
            "CurrentTypeID": 30
        },
        {
            "ID": 301151,
            "ConnectionTypeID": 2,
            "StatusTypeID": 50,
            "LevelID": 3,
            "PowerKW": 50,
            "CurrentTypeID": 30
        }
    ],
    "StatusTypeID": 50,
    "DateLastStatusUpdate": "2021-07-12T02:50:00Z",
    "MetadataValues": [
        {
            "ID": 13130,
            "MetadataFieldID": 4,
            "ItemValue": "Data from the German chargepoint registry provided by Bundesnetzagentur.de under the CC-BY 4.0 license"
        }
    ],
    "DataQualityLevel": 3,
    "DateCreated": "2021-07-08T10:01:00Z",
    "SubmissionStatusTypeID": 100
}