{
    "IsRecentlyVerified": false,
    "ID": 184597,
    "UUID": "ADA879A2-E715-4333-8ABB-B3BC15DAB9D3",
    "DataProviderID": 29,
    "DataProvidersReference": "6663",
    "OperatorID": 124,
    "AddressInfo": {
        "ID": 184956,
        "Title": "Alte Straße 17-20",
        "AddressLine1": "Alte Straße 17-20",
        "Town": "Bremervörde",
        "Postcode": "27432",
        "CountryID": 87,
        "Latitude": 53.485998,
        "Longitude": 9.14363,
        "DistanceUnit": 0
    },
    "Connections": [
        {
            "ID": 293056,
            "ConnectionTypeID": 25,
            "StatusTypeID": 50,
            "LevelID": 2,
            "PowerKW": 22,
            "CurrentTypeID": 20
        },
        {
            "ID": 301368,
            "ConnectionTypeID": 25,
            "StatusTypeID": 50,
            "LevelID": 2,
            "PowerKW": 22,
            "CurrentTypeID": 20
        }
    ],
    "StatusTypeID": 50,
    "DateLastStatusUpdate": "2021-07-12T02:51:00Z",
    "MetadataValues": [
        {
            "ID": 16888,
            "MetadataFieldID": 4,
            "ItemValue": "Data from the German chargepoint registry provided by Bundesnetzagentur.de under the CC-BY 4.0 license"
        }
    ],
    "DataQualityLevel": 3,
    "DateCreated": "2021-07-08T10:05:00Z",
    "SubmissionStatusTypeID": 100
}