{
    "IsRecentlyVerified": false,
    "ID": 68085,
    "UUID": "1AF8DC84-D3C6-4228-A50C-1A14F0906FDC",
    "DataProviderID": 26,
    "DataProvidersReference": "93406",
    "OperatorID": 103,
    "OperatorsReference": "Allego NLALLEGO0010421",
    "UsageCost": "0.00 jaarabonnement",
    "AddressInfo": {
        "ID": 68431,
        "Title": "Chopinlaan",
        "AddressLine1": "Chopinlaan",
        "Town": "Alphen aan den Rijn",
        "Postcode": "2394 GL",
        "CountryID": 159,
        "Latitude": 52.129868,
        "Longitude": 4.59209579,
        "ContactTelephone1": "0800-3745337",
        "RelatedURL": "http://www.allego.eu/",
        "DistanceUnit": 0
    },
    "Connections": [
        {
            "ID": 94820,
            "ConnectionTypeID": 25,
            "LevelID": 2,
            "PowerKW": 11,
            "CurrentTypeID": 10
        },
        {
            "ID": 94821,
            "ConnectionTypeID": 25,
            "LevelID": 2,
            "PowerKW": 11,
            "CurrentTypeID": 10
        }
    ],
    "NumberOfPoints": 1,
    "StatusTypeID": 50,
    "DateLastStatusUpdate": "2016-06-04T02:37:00Z",
    "DataQualityLevel": 3,
    "DateCreated": "2016-06-04T02:37:00Z",
    "SubmissionStatusTypeID": 100
}