{
    "MediaItems": [
        {
            "ID": 1146,
            "ChargePointID": 40902,
            "ItemURL": "https://s3-ap-southeast-2.amazonaws.com/openchargemap/images/DE/OCM40902/OCM-40902.orig.2015032615420433.jpg",
            "ItemThumbnailURL": "https://s3-ap-southeast-2.amazonaws.com/openchargemap/images/DE/OCM40902/OCM-40902.thmb.2015032615420433.jpg",
            "Comment": "Die Ladesäule befindet sich fast in der Mitte zwischen den Parkbereichen A und B kann mit Hilfe des orangen Schildes auf dem Pfahl rechts einfacher auf dem unübersichtlichen Großparkplatz gefunden werden. Die Plätze sind zwar markiert, aber was hilft es, wenn sich \"brunnenandi\" quer auf zwei stellt? Dabei war es noch nicht mal voll, wie mag es am Samstag um 11 Uhr sein?",
            "IsEnabled": true,
            "IsVideo": false,
            "IsFeaturedItem": false,
            "IsExternalResource": false,
            "User": {
                "ID": 4573,
                "Username": "Erna_Schleck"
            },
            "DateCreated": "2015-03-26T15:42:00Z"
        }
    ],
    "IsRecentlyVerified": false,
    "ID": 40902,
    "UUID": "AFCD8A5D-F544-465D-BB75-C88E71A0C933",
    "DataProviderID": 1,
    "OperatorID": 45,
    "UsageTypeID": 1,
    "UsageCost": "0",
    "AddressInfo": {
        "ID": 41248,
        "Title": "LUV Shopping Center Lübeck Dänischburg",
        "AddressLine1": "Dänischburger Landstraße 81",
        "Town": "Lübeck-Dänischburg",
        "Postcode": "23569",
        "CountryID": 87,
        "Latitude": 53.9136711844482,
        "Longitude": 10.7369647468354,
        "AccessComments": "Ab 1.8.2017 werden zwei neue ABB Säulen aktiviert, die von IKEA betrieben werden. Die alte \"Netz Lübeck\" Säule ist abgebaut!\r\nAnfahrt Richtung IKEA, Ziel zwischen Parkbereichen A und B fast am Gebäude am Nebeneingang. Die Säule wird markiert durch ein oranges Schild auf Pfahl mit Auto und Stecker. 4 Parkplätze sind markiert, aber ohne \"P-Schild\". Nutzbar von Mo-Sa 8-20Uhr, danach ist der Parkplatz durch Schranken abgesperrt.\r\n",
        "RelatedURL": "http://www.luvshopping.de/de-de/service/e-tankstelle",
        "DistanceUnit": 0
    },
    "Connections": [
        {
            "ID": 44538,
            "ConnectionTypeID": 1036,
            "StatusTypeID": 50,
            "LevelID": 2,
            "Amps": 32,
            "Voltage": 400,
            "PowerKW": 22,
            "CurrentTypeID": 20,
            "Quantity": 2
        },
        {
            "ID": 44539,
            "ConnectionTypeID": 33,
            "StatusTypeID": 50,
            "LevelID": 3,
            "PowerKW": 20,
            "CurrentTypeID": 30,
            "Quantity": 2
        },
        {
            "ID": 128262,
            "ConnectionTypeID": 2,
            "StatusTypeID": 50,
            "LevelID": 3,
            "PowerKW": 20,
            "CurrentTypeID": 30,
            "Quantity": 2
        }
    ],
    "NumberOfPoints": 6,
    "StatusTypeID": 50,
    "DateLastStatusUpdate": "2017-07-18T06:17:00Z",
    "DataQualityLevel": 1,
    "DateCreated": "2015-01-16T11:25:00Z",
    "SubmissionStatusTypeID": 200
}