{
    "IsRecentlyVerified": false,
    "ID": 19064,
    "UUID": "49A3BB32-7E7D-4BAB-A42F-F5D75860DB30",
    "DataProviderID": 1,
    "OperatorID": 7,
    "UsageTypeID": 1,
    "UsageCost": "Free",
    "AddressInfo": {
        "ID": 19409,
        "Title": "Nissan Trenton",
        "AddressLine1": "Anlaby High Rd",
        "Town": "Hull",
        "Postcode": "HU4 7RA",
        "CountryID": 1,
        "Latitude": 53.744388199999996,
        "Longitude": -0.40917850000005274,
        "ContactTelephone1": "01482 561350",
        "ContactEmail": "d1800dp@nissandealergb.co.uk",
        "RelatedURL": "http://www.trentonhull.co.uk/",
        "DistanceUnit": 0
    },
    "Connections": [
        {
            "ID": 19305,
            "ConnectionTypeID": 2,
            "StatusTypeID": 50,
            "LevelID": 3,
            "Amps": 100,
            "Voltage": 230,
            "PowerKW": 50,
            "CurrentTypeID": 30,
            "Quantity": 1
        }
    ],
    "NumberOfPoints": 1,
    "StatusTypeID": 50,
    "DateLastStatusUpdate": "2019-02-08T01:30:00Z",
    "DataQualityLevel": 1,
    "DateCreated": "2013-09-10T15:45:00Z",
    "SubmissionStatusTypeID": 200
}