{
    "IsRecentlyVerified": false,
    "ID": 160290,
    "UUID": "81C28BB8-0409-48DF-93E3-100F08BEED4C",
    "DataProviderID": 2,
    "DataProvidersReference": "156675",
    "UsageTypeID": 2,
    "AddressInfo": {
        "ID": 160647,
        "Title": "Hydro One Inc",
        "AddressLine1": "955 9th Ave E",
        "Town": "Owen Sound",
        "StateOrProvince": "ON",
        "Postcode": "N4K 6N4",
        "CountryID": 44,
        "Latitude": 44.5621125,
        "Longitude": -80.923446,
        "ContactTelephone1": "",
        "AccessComments": "",
        "RelatedURL": "",
        "DistanceUnit": 0
    },
    "Connections": [
        {
            "ID": 230624,
            "ConnectionTypeID": 2,
            "LevelID": 3,
            "Amps": 100,
            "Voltage": 400,
            "PowerKW": 40,
            "CurrentTypeID": 30,
            "Quantity": 1
        },
        {
            "ID": 230625,
            "ConnectionTypeID": 32,
            "LevelID": 3,
            "Amps": 100,
            "Voltage": 400,
            "PowerKW": 40,
            "CurrentTypeID": 30,
            "Quantity": 1
        }
    ],
    "GeneralComments": "Planned for future date. Not Operational.",
    "DatePlanned": "2020-09-01T00:00:00Z",
    "StatusTypeID": 150,
    "DateLastStatusUpdate": "2020-06-26T03:08:00Z",
    "DataQualityLevel": 3,
    "DateCreated": "2020-06-26T03:08:00Z",
    "SubmissionStatusTypeID": 100
}