{
    "IsRecentlyVerified": false,
    "ID": 140514,
    "UUID": "0515451F-6737-4ECB-8C13-F41DA53DAA43",
    "DataProviderID": 2,
    "DataProvidersReference": "138583",
    "UsageTypeID": 1,
    "AddressInfo": {
        "ID": 140866,
        "Title": "Hands On!",
        "AddressLine1": "1212 Suncrest Dr",
        "Town": "Gray",
        "StateOrProvince": "TN",
        "Postcode": "37615",
        "CountryID": 2,
        "Latitude": 36.386632,
        "Longitude": -82.498535,
        "ContactTelephone1": "423-434-4263",
        "AccessComments": "24 hours daily",
        "RelatedURL": "",
        "DistanceUnit": 0
    },
    "Connections": [
        {
            "ID": 196162,
            "ConnectionTypeID": 1,
            "LevelID": 2,
            "Amps": 16,
            "Voltage": 230,
            "PowerKW": 3.7,
            "CurrentTypeID": 10,
            "Quantity": 4
        }
    ],
    "StatusTypeID": 50,
    "DateLastStatusUpdate": "2020-06-26T02:58:00Z",
    "DataQualityLevel": 3,
    "DateCreated": "2019-12-24T09:13:00Z",
    "SubmissionStatusTypeID": 100
}