{
    "IsRecentlyVerified": false,
    "ID": 101252,
    "UUID": "01A61AF7-87D6-4DDC-8FDA-EB232D2B5AEA",
    "DataProviderID": 1,
    "OperatorID": 164,
    "UsageTypeID": 6,
    "AddressInfo": {
        "ID": 101598,
        "Title": " Camping Latsch / Laces",
        "AddressLine1": "Via Nazionale, 4",
        "Town": "Silandro ",
        "StateOrProvince": "BZ",
        "Postcode": "39028",
        "CountryID": 112,
        "Latitude": 46.6219995079642,
        "Longitude": 10.8633167760253,
        "ContactTelephone1": "+39 0473 62 32 17",
        "ContactEmail": "info@camping-latsch.com",
        "RelatedURL": "https://www.camping-latsch.com",
        "DistanceUnit": 0
    },
    "Connections": [
        {
            "ID": 142936,
            "ConnectionTypeID": 25,
            "StatusTypeID": 50,
            "LevelID": 2,
            "Amps": 32,
            "Voltage": 400,
            "PowerKW": 22,
            "CurrentTypeID": 20,
            "Quantity": 1
        }
    ],
    "NumberOfPoints": 1,
    "GeneralComments": "http://www.alperia.eu/cosa-facciamo/e-mobility.html",
    "StatusTypeID": 50,
    "DateLastStatusUpdate": "2018-03-22T13:54:00Z",
    "DataQualityLevel": 1,
    "DateCreated": "2018-03-22T13:47:00Z",
    "SubmissionStatusTypeID": 200
}