{
    "IsRecentlyVerified": false,
    "ID": 174979,
    "UUID": "F42E5F88-E5AE-4E81-A52F-6A7DB8A1F6F3",
    "DataProviderID": 1,
    "OperatorID": 3,
    "UsageTypeID": 4,
    "UsageCost": "Rapid 27p per kW ",
    "AddressInfo": {
        "ID": 175338,
        "Title": "Tesco Canwick Rd",
        "AddressLine1": "Canwick Rd Trading Estate",
        "AddressLine2": "",
        "Town": "Lincoln",
        "StateOrProvince": "England",
        "Postcode": "LN5 8HS",
        "CountryID": 1,
        "Latitude": 53.223023,
        "Longitude": -0.5320423,
        "RelatedURL": "http://www.pod-point.com",
        "DistanceUnit": 0
    },
    "Connections": [
        {
            "ID": 271165,
            "ConnectionTypeID": 25,
            "StatusTypeID": 50,
            "LevelID": 2,
            "Amps": 32,
            "Voltage": 230,
            "PowerKW": 7,
            "CurrentTypeID": 10,
            "Quantity": 2
        },
        {
            "ID": 271513,
            "ConnectionTypeID": 25,
            "StatusTypeID": 50,
            "LevelID": 2,
            "PowerKW": 22,
            "CurrentTypeID": 20,
            "Quantity": 2
        },
        {
            "ID": 272547,
            "ConnectionTypeID": 2,
            "StatusTypeID": 50,
            "LevelID": 3,
            "PowerKW": 50,
            "CurrentTypeID": 30,
            "Quantity": 1
        },
        {
            "ID": 272548,
            "ConnectionTypeID": 33,
            "StatusTypeID": 50,
            "LevelID": 3,
            "PowerKW": 50,
            "CurrentTypeID": 30,
            "Quantity": 1
        }
    ],
    "NumberOfPoints": 1,
    "GeneralComments": "Pod Point. Twin Type 2: 7kW Dane-Joel & 22kW Zane-Liam. 50kW CHAdeMO & CCS Bain-Lyla",
    "StatusTypeID": 50,
    "DateLastStatusUpdate": "2021-05-28T10:33:00Z",
    "DataQualityLevel": 1,
    "DateCreated": "2021-04-23T03:37:00Z",
    "SubmissionStatusTypeID": 200
}