{
    "IsRecentlyVerified": true,
    "DateLastVerified": "2021-09-05T22:55:00Z",
    "ID": 189060,
    "UUID": "D29654A0-71D9-42B4-B642-CD8479BBA41E",
    "DataProviderID": 1,
    "OperatorID": 1,
    "UsageTypeID": 1,
    "AddressInfo": {
        "ID": 189419,
        "Title": "South Cariboo Visitor Center",
        "AddressLine1": "Tourist Information",
        "Town": "100 Mile House",
        "StateOrProvince": "BC",
        "Postcode": "V0K2E0",
        "CountryID": 44,
        "Latitude": 51.64159139233678,
        "Longitude": -121.2979338728245,
        "DistanceUnit": 0
    },
    "Connections": [
        {
            "ID": 305611,
            "ConnectionTypeID": 32,
            "StatusTypeID": 50,
            "LevelID": 3,
            "PowerKW": 50,
            "CurrentTypeID": 30,
            "Quantity": 2
        },
        {
            "ID": 305612,
            "ConnectionTypeID": 2,
            "StatusTypeID": 50,
            "LevelID": 2,
            "PowerKW": 50,
            "Quantity": 2
        }
    ],
    "NumberOfPoints": 2,
    "StatusTypeID": 50,
    "DateLastStatusUpdate": "2021-09-13T13:08:00Z",
    "DataQualityLevel": 1,
    "DateCreated": "2021-09-05T22:55:00Z",
    "SubmissionStatusTypeID": 200
}