{
    "IsRecentlyVerified": false,
    "ID": 129721,
    "UUID": "5B4DD03E-67F8-4C50-AD62-8CFA76147483",
    "DataProviderID": 1,
    "OperatorID": 80,
    "UsageTypeID": 4,
    "AddressInfo": {
        "ID": 130067,
        "Title": "CM Motors | EnelX",
        "AddressLine1": "Via IV Novembre, 55",
        "Town": "Ciampino",
        "StateOrProvince": "RM",
        "Postcode": "00043",
        "CountryID": 112,
        "Latitude": 41.8022285214957,
        "Longitude": 12.6001810495253,
        "ContactTelephone1": "800.069.850",
        "RelatedURL": "https://www.enelx.com/it/it/emobility",
        "DistanceUnit": 0
    },
    "Connections": [
        {
            "ID": 181573,
            "ConnectionTypeID": 25,
            "StatusTypeID": 50,
            "LevelID": 2,
            "Amps": 32,
            "Voltage": 400,
            "PowerKW": 22,
            "CurrentTypeID": 20,
            "Quantity": 2
        }
    ],
    "NumberOfPoints": 2,
    "GeneralComments": "Garage a pagamento",
    "StatusTypeID": 50,
    "DateLastStatusUpdate": "2019-07-24T14:25:00Z",
    "DataQualityLevel": 1,
    "DateCreated": "2019-07-24T14:25:00Z",
    "SubmissionStatusTypeID": 200
}