{
    "IsRecentlyVerified": false,
    "ID": 7009,
    "UUID": "D08C9505-94AF-4167-990F-CA3A1C2D47D3",
    "DataProviderID": 1,
    "UsageTypeID": 4,
    "UsageCost": "Free",
    "AddressInfo": {
        "ID": 6910,
        "Title": "2 square de Clignancourt (mairie du 18è)",
        "AddressLine1": "2 square de Clignancourt ",
        "AddressLine2": "",
        "Town": "Paris",
        "StateOrProvince": "",
        "Postcode": "",
        "CountryID": 80,
        "Latitude": 48.892366,
        "Longitude": 2.3463947999999846,
        "ContactTelephone1": "+33 01 53 20 09 69 ",
        "ContactTelephone2": "",
        "ContactEmail": "sim@semeru.fayat.com",
        "AccessComments": "http://www.paris.fr/pratique/voitures-deux-roues-motorises/bornes-de-recharge-pour-vehicules-electriques/p5775",
        "DistanceUnit": 0
    },
    "Connections": [],
    "NumberOfPoints": 1,
    "GeneralComments": "Où se procurer la carte pour recharger son véhicule électrique ? La carte est gratuite. Où la trouver ? Espace mobilités électriques 112 quater rue Marcadet (18e)- +33 01 53 20 09 69 ",
    "DateLastConfirmed": "2011-10-12T20:42:00Z",
    "StatusTypeID": 0,
    "DateLastStatusUpdate": "2011-10-12T20:42:00Z",
    "DataQualityLevel": 1,
    "DateCreated": "2011-10-12T20:42:00Z",
    "SubmissionStatusTypeID": 200
}