{
    "IsRecentlyVerified": false,
    "ID": 9689,
    "UUID": "75CA9604-19BF-4939-863C-5891AF3DE0DD",
    "DataProviderID": 15,
    "DataProvidersReference": "16637",
    "OperatorID": 26,
    "UsageTypeID": 1,
    "AddressInfo": {
        "ID": 9586,
        "Title": "28585 Telegraph Road",
        "AddressLine1": "28585 Telegraph Road",
        "Town": "Southfield",
        "StateOrProvince": "Michigan",
        "Postcode": "48034",
        "CountryID": 2,
        "Latitude": 42.498161224511,
        "Longitude": -83.2865810394287,
        "ContactTelephone1": "248-353-1300",
        "RelatedURL": "http://carstations.com/16637",
        "DistanceUnit": 0
    },
    "Connections": [
        {
            "ID": 7497,
            "ConnectionTypeID": 1,
            "Reference": "J1772",
            "LevelID": 2
        }
    ],
    "NumberOfPoints": 2,
    "StatusTypeID": 50,
    "DateLastStatusUpdate": "2017-11-04T14:04:00Z",
    "DataQualityLevel": 2,
    "DateCreated": "2012-04-16T15:45:00Z",
    "SubmissionStatusTypeID": 100
}