{
    "IsRecentlyVerified": false,
    "ID": 63467,
    "UUID": "5487BB7F-C70A-4246-A855-B9827C4D3DE0",
    "DataProviderID": 26,
    "DataProvidersReference": "77176",
    "OperatorID": 73,
    "OperatorsReference": "EV-Box EVB-P1450147",
    "UsageCost": "0.00 jaarabonnement",
    "AddressInfo": {
        "ID": 63813,
        "Title": "Vuurvlinderberm",
        "AddressLine1": "Vuurvlinderberm",
        "Town": "Houten",
        "Postcode": "3994 WH",
        "CountryID": 159,
        "Latitude": 52.03592,
        "Longitude": 5.18201,
        "RelatedURL": "http://www.ev-box.nl",
        "DistanceUnit": 0
    },
    "Connections": [
        {
            "ID": 80951,
            "ConnectionTypeID": 25,
            "LevelID": 2,
            "PowerKW": 5,
            "CurrentTypeID": 10
        },
        {
            "ID": 95459,
            "ConnectionTypeID": 25,
            "LevelID": 2,
            "PowerKW": 11,
            "CurrentTypeID": 10
        }
    ],
    "NumberOfPoints": 1,
    "StatusTypeID": 50,
    "DateLastStatusUpdate": "2016-06-04T02:44:00Z",
    "DataQualityLevel": 3,
    "DateCreated": "2016-03-03T12:30:00Z",
    "SubmissionStatusTypeID": 100
}