{
    "IsRecentlyVerified": false,
    "ID": 45671,
    "UUID": "EDE1C4E1-1F01-4D28-B4C3-287AD3C868DB",
    "DataProviderID": 1,
    "DataProvidersReference": "2717",
    "AddressInfo": {
        "ID": 46017,
        "Title": "Novotel",
        "AddressLine1": "Klippan 1",
        "Town": "GÖTEBORG",
        "StateOrProvince": "VÄSTRA GÖTALAND",
        "Postcode": "41456",
        "CountryID": 216,
        "Latitude": 57.69043,
        "Longitude": 11.90839,
        "AccessComments": "",
        "DistanceUnit": 0
    },
    "Connections": [
        {
            "ID": 56334,
            "ConnectionTypeID": 0,
            "Reference": "1",
            "LevelID": 2,
            "Amps": 16,
            "Voltage": 230,
            "PowerKW": 3.7,
            "Comments": "Mode 1"
        }
    ],
    "NumberOfPoints": 1,
    "DateLastStatusUpdate": "2020-05-26T08:21:00Z",
    "DataQualityLevel": 2,
    "DateCreated": "2015-05-03T00:54:00Z",
    "SubmissionStatusTypeID": 100
}