{
    "MediaItems": [
        {
            "ID": 22581,
            "ChargePointID": 119359,
            "ItemURL": "https://s3-ap-southeast-2.amazonaws.com/openchargemap/images/US/OCM119359/OCM-119359.orig.2020060523025447.jpg",
            "ItemThumbnailURL": "https://s3-ap-southeast-2.amazonaws.com/openchargemap/images/US/OCM119359/OCM-119359.thmb.2020060523025447.jpg",
            "Comment": "",
            "IsEnabled": true,
            "IsVideo": false,
            "IsFeaturedItem": false,
            "IsExternalResource": false,
            "User": {
                "ID": 20248,
                "Username": "Red"
            },
            "DateCreated": "2020-06-05T23:03:00Z"
        },
        {
            "ID": 22580,
            "ChargePointID": 119359,
            "ItemURL": "https://s3-ap-southeast-2.amazonaws.com/openchargemap/images/US/OCM119359/OCM-119359.orig.2020060523014834.jpg",
            "ItemThumbnailURL": "https://s3-ap-southeast-2.amazonaws.com/openchargemap/images/US/OCM119359/OCM-119359.thmb.2020060523014834.jpg",
            "Comment": "",
            "IsEnabled": true,
            "IsVideo": false,
            "IsFeaturedItem": false,
            "IsExternalResource": false,
            "User": {
                "ID": 20248,
                "Username": "Red"
            },
            "DateCreated": "2020-06-05T23:02:00Z"
        }
    ],
    "IsRecentlyVerified": false,
    "ID": 119359,
    "UUID": "52B7FC2B-6133-487A-BE36-4D63F67E9A3A",
    "DataProviderID": 2,
    "DataProvidersReference": "120886",
    "OperatorID": 59,
    "UsageTypeID": 1,
    "AddressInfo": {
        "ID": 119705,
        "Title": "Greenlots - 43169",
        "AddressLine1": "Route 11",
        "Town": "Na’alehua",
        "StateOrProvince": "HI",
        "Postcode": "96772",
        "CountryID": 2,
        "Latitude": 19.0616817474365,
        "Longitude": -155.586273193359,
        "ContactTelephone1": "855-900-7584",
        "AccessComments": "24 hours daily",
        "RelatedURL": "http://greenlots.com/",
        "DistanceUnit": 0
    },
    "Connections": [
        {
            "ID": 168607,
            "ConnectionTypeID": 2,
            "LevelID": 3,
            "Amps": 100,
            "Voltage": 400,
            "PowerKW": 40,
            "CurrentTypeID": 30,
            "Quantity": 1
        },
        {
            "ID": 168608,
            "ConnectionTypeID": 32,
            "LevelID": 3,
            "Amps": 100,
            "Voltage": 400,
            "PowerKW": 40,
            "CurrentTypeID": 30,
            "Quantity": 1
        }
    ],
    "DateLastStatusUpdate": "2020-06-26T02:52:00Z",
    "DataQualityLevel": 3,
    "DateCreated": "2019-04-01T04:59:00Z",
    "SubmissionStatusTypeID": 100
}