{
    "IsRecentlyVerified": false,
    "ID": 65953,
    "UUID": "DCEC142D-F9A4-4E28-A6C8-AB9EB72F076C",
    "DataProviderID": 1,
    "OperatorID": 196,
    "UsageTypeID": 4,
    "AddressInfo": {
        "ID": 66299,
        "Title": "Red Tortuga - La Jonquera",
        "AddressLine1": "Avinguda del Sis d'Octubre",
        "AddressLine2": "Mas de l'Esquerrà",
        "Town": "la Jonquera",
        "Postcode": "17700",
        "CountryID": 210,
        "Latitude": 42.4068605492048,
        "Longitude": 2.88003733655397,
        "AccessComments": "Charging station for cooling trucks, but can be used by EVs as well after registration at Nomadpower. Activation by phone or app. Connector numbers 34001..34006",
        "RelatedURL": "https://www.nomadpower.eu/de/chargepoints/59/connector/106/",
        "DistanceUnit": 0
    },
    "Connections": [
        {
            "ID": 91175,
            "ConnectionTypeID": 17,
            "StatusTypeID": 50,
            "LevelID": 2,
            "Amps": 32,
            "Voltage": 400,
            "PowerKW": 22,
            "CurrentTypeID": 20,
            "Quantity": 6
        }
    ],
    "NumberOfPoints": 6,
    "StatusTypeID": 50,
    "DateLastStatusUpdate": "2019-12-20T09:10:00Z",
    "DataQualityLevel": 1,
    "DateCreated": "2016-05-06T15:49:00Z",
    "SubmissionStatusTypeID": 200
}