{
    "IsRecentlyVerified": false,
    "ID": 39211,
    "UUID": "C753CA61-7D46-4956-B421-5F9CF472B6A2",
    "DataProviderID": 1,
    "OperatorID": 220,
    "OperatorsReference": "2695,2695,2694",
    "UsageTypeID": 1,
    "UsageCost": "€1.73 + €0.3213/kWh; Andere Tarife möglich",
    "AddressInfo": {
        "ID": 39557,
        "Title": "Lattenkamp",
        "AddressLine1": "Lattenkamp 92",
        "Town": "Hamburg",
        "Postcode": "22299",
        "CountryID": 87,
        "Latitude": 53.6004257646542,
        "Longitude": 9.99492885400196,
        "AccessComments": "Fast an der Ecke Braamkamp gelegen. 1 parkgebührenpflichiger Parkplatz in Parkbucht neben der durchgehend nutzbaren Ladesäule.",
        "DistanceUnit": 0
    },
    "Connections": [
        {
            "ID": 42722,
            "ConnectionTypeID": 25,
            "StatusTypeID": 50,
            "LevelID": 2,
            "Amps": 32,
            "Voltage": 400,
            "PowerKW": 11,
            "CurrentTypeID": 20,
            "Quantity": 1
        },
        {
            "ID": 49960,
            "ConnectionTypeID": 25,
            "StatusTypeID": 50,
            "LevelID": 2,
            "Amps": 32,
            "Voltage": 400,
            "PowerKW": 22,
            "CurrentTypeID": 20,
            "Quantity": 1
        },
        {
            "ID": 83524,
            "ConnectionTypeID": 28,
            "StatusTypeID": 50,
            "LevelID": 2,
            "Amps": 16,
            "Voltage": 230,
            "PowerKW": 3.7,
            "CurrentTypeID": 10,
            "Quantity": 2
        }
    ],
    "NumberOfPoints": 2,
    "StatusTypeID": 50,
    "DateLastStatusUpdate": "2017-06-11T09:42:00Z",
    "DataQualityLevel": 3,
    "DateCreated": "2015-01-09T06:08:00Z",
    "SubmissionStatusTypeID": 200
}