{
    "MediaItems": [
        {
            "ID": 25488,
            "ChargePointID": 170123,
            "ItemURL": "https://s3-ap-southeast-2.amazonaws.com/openchargemap/images/CA/OCM170123/OCM-170123.orig.2020111901130688.jpg",
            "ItemThumbnailURL": "https://s3-ap-southeast-2.amazonaws.com/openchargemap/images/CA/OCM170123/OCM-170123.thmb.2020111901130688.jpg",
            "Comment": "",
            "IsEnabled": true,
            "IsVideo": false,
            "IsFeaturedItem": false,
            "IsExternalResource": false,
            "User": {
                "ID": 22855,
                "Username": "bert hogendoorn "
            },
            "DateCreated": "2020-11-19T01:13:00Z"
        },
        {
            "ID": 25487,
            "ChargePointID": 170123,
            "ItemURL": "https://s3-ap-southeast-2.amazonaws.com/openchargemap/images/CA/OCM170123/OCM-170123.orig.2020111901045308.jpg",
            "ItemThumbnailURL": "https://s3-ap-southeast-2.amazonaws.com/openchargemap/images/CA/OCM170123/OCM-170123.thmb.2020111901045308.jpg",
            "Comment": "",
            "IsEnabled": true,
            "IsVideo": false,
            "IsFeaturedItem": false,
            "IsExternalResource": false,
            "User": {
                "ID": 22855,
                "Username": "bert hogendoorn "
            },
            "DateCreated": "2020-11-19T01:05:00Z"
        },
        {
            "ID": 25486,
            "ChargePointID": 170123,
            "ItemURL": "https://s3-ap-southeast-2.amazonaws.com/openchargemap/images/CA/OCM170123/OCM-170123.orig.2020111901042026.jpg",
            "ItemThumbnailURL": "https://s3-ap-southeast-2.amazonaws.com/openchargemap/images/CA/OCM170123/OCM-170123.thmb.2020111901042026.jpg",
            "Comment": "",
            "IsEnabled": true,
            "IsVideo": false,
            "IsFeaturedItem": false,
            "IsExternalResource": false,
            "User": {
                "ID": 22855,
                "Username": "bert hogendoorn "
            },
            "DateCreated": "2020-11-19T01:04:00Z"
        }
    ],
    "IsRecentlyVerified": false,
    "ID": 170123,
    "UUID": "38F73604-EF96-42AB-AD31-7FBBEF1EE178",
    "DataProviderID": 1,
    "OperatorID": 3400,
    "UsageTypeID": 1,
    "AddressInfo": {
        "ID": 170482,
        "Title": "Electrify- Canada Shops of Canmore",
        "AddressLine1": "300 Old Canmore Road",
        "Town": "Canmore",
        "StateOrProvince": "Alberta",
        "CountryID": 44,
        "Latitude": 51.088249,
        "Longitude": -115.346154,
        "ContactTelephone1": "833-231-3226",
        "RelatedURL": "http://www.electrify-canada.ca",
        "DistanceUnit": 0
    },
    "Connections": [
        {
            "ID": 259351,
            "ConnectionTypeID": 32,
            "StatusTypeID": 50,
            "LevelID": 3,
            "PowerKW": 150,
            "CurrentTypeID": 30,
            "Quantity": 4
        },
        {
            "ID": 259352,
            "ConnectionTypeID": 2,
            "StatusTypeID": 50,
            "LevelID": 3,
            "PowerKW": 100,
            "CurrentTypeID": 30,
            "Quantity": 1
        }
    ],
    "NumberOfPoints": 4,
    "StatusTypeID": 50,
    "DateLastStatusUpdate": "2020-11-20T10:02:00Z",
    "DataQualityLevel": 1,
    "DateCreated": "2020-11-19T01:00:00Z",
    "SubmissionStatusTypeID": 200
}