{
    "IsRecentlyVerified": false,
    "ID": 19971,
    "UUID": "5DE70306-1E3A-4442-9A62-B33792790EBC",
    "DataProviderID": 1,
    "OperatorID": 1,
    "UsageTypeID": 0,
    "UsageCost": "",
    "AddressInfo": {
        "ID": 20316,
        "Title": "Renault Ascoria - Tourlaville",
        "AddressLine1": "854 Boulevard de l'Est",
        "AddressLine2": "",
        "Town": "",
        "StateOrProvince": "Tourlaville",
        "Postcode": "50110",
        "CountryID": 80,
        "Latitude": 49.63471,
        "Longitude": -1.58787,
        "ContactTelephone1": "",
        "ContactTelephone2": "",
        "ContactEmail": "",
        "AccessComments": "Réservé aux clients de l'établissement",
        "RelatedURL": "",
        "DistanceUnit": 0
    },
    "Connections": [],
    "GeneralComments": "",
    "StatusTypeID": 50,
    "DateLastStatusUpdate": "2013-10-23T13:22:00Z",
    "DataQualityLevel": 1,
    "DateCreated": "2013-10-23T07:43:00Z",
    "SubmissionStatusTypeID": 200
}