{
    "IsRecentlyVerified": false,
    "ID": 122078,
    "UUID": "A8D0A616-A3F0-495E-8268-BA04E0166302",
    "DataProviderID": 2,
    "DataProvidersReference": "48636",
    "UsageTypeID": 1,
    "AddressInfo": {
        "ID": 122424,
        "Title": "University of South Carolina - Horizon Garage",
        "AddressLine1": "519 Main St",
        "Town": "Columbia",
        "StateOrProvince": "SC",
        "Postcode": "29201",
        "CountryID": 2,
        "Latitude": 33.992388,
        "Longitude": -81.029594,
        "ContactTelephone1": "803-777-5341",
        "AccessComments": "24 hours daily",
        "RelatedURL": "",
        "DistanceUnit": 0
    },
    "Connections": [
        {
            "ID": 171931,
            "ConnectionTypeID": 1,
            "LevelID": 2,
            "Amps": 16,
            "Voltage": 230,
            "PowerKW": 3.7,
            "CurrentTypeID": 10,
            "Quantity": 1
        }
    ],
    "DateLastStatusUpdate": "2020-06-26T02:56:00Z",
    "DataQualityLevel": 3,
    "DateCreated": "2019-04-06T05:02:00Z",
    "SubmissionStatusTypeID": 100
}