{
    "IsRecentlyVerified": false,
    "ID": 99865,
    "UUID": "1C4CD7B2-93AA-468D-B226-B08DA7F1A383",
    "DataProviderID": 1,
    "OperatorID": 23,
    "OperatorsReference": "40343",
    "UsageTypeID": 4,
    "AddressInfo": {
        "ID": 100211,
        "Title": "The Peerless Hotel",
        "AddressLine1": "243 4th St",
        "Town": "Ashland",
        "StateOrProvince": "Oregon",
        "Postcode": "97520",
        "CountryID": 2,
        "Latitude": 42.197543,
        "Longitude": -122.707718,
        "ContactTelephone1": "(541) 488-1082",
        "DistanceUnit": 0
    },
    "Connections": [
        {
            "ID": 141082,
            "ConnectionTypeID": 30,
            "StatusTypeID": 50,
            "LevelID": 2,
            "PowerKW": 16,
            "CurrentTypeID": 20,
            "Quantity": 2
        }
    ],
    "NumberOfPoints": 2,
    "GeneralComments": "2 Tesla Connectors, up to 16kW.Available for customers. Please see front desk.",
    "StatusTypeID": 50,
    "DateLastStatusUpdate": "2018-02-06T06:48:00Z",
    "DataQualityLevel": 1,
    "DateCreated": "2018-02-06T06:48:00Z",
    "SubmissionStatusTypeID": 200
}