{
    "IsRecentlyVerified": false,
    "ID": 145836,
    "UUID": "CEFA29BD-2043-499C-871F-421C0707C8EF",
    "DataProviderID": 2,
    "DataProvidersReference": "131340",
    "OperatorID": 90,
    "UsageTypeID": 1,
    "AddressInfo": {
        "ID": 146188,
        "Title": "Hôtel Fermont",
        "AddressLine1": "299 rue Le Carrefour",
        "Town": "Fermont",
        "StateOrProvince": "QC",
        "Postcode": "G0G 1J0",
        "CountryID": 44,
        "Latitude": 52.7985033601237,
        "Longitude": -67.0856015344239,
        "ContactTelephone1": "877-505-2674",
        "AccessComments": "24 hours daily",
        "RelatedURL": "https://lecircuitelectrique.com/",
        "DistanceUnit": 0
    },
    "Connections": [
        {
            "ID": 202606,
            "ConnectionTypeID": 1,
            "LevelID": 2,
            "Amps": 16,
            "Voltage": 230,
            "PowerKW": 3.7,
            "CurrentTypeID": 10,
            "Quantity": 1
        }
    ],
    "StatusTypeID": 50,
    "DateLastStatusUpdate": "2020-06-26T03:12:00Z",
    "DataQualityLevel": 3,
    "DateCreated": "2019-12-24T09:25:00Z",
    "SubmissionStatusTypeID": 100
}