{
    "IsRecentlyVerified": false,
    "ID": 88619,
    "UUID": "BE018E53-C327-4C03-B547-D054FB96266B",
    "DataProviderID": 1,
    "OperatorID": 105,
    "UsageTypeID": 4,
    "AddressInfo": {
        "ID": 88965,
        "Title": "Reichsstraße",
        "AddressLine1": "Reichsstraße 10",
        "Town": "Wolfenbüttel",
        "StateOrProvince": "Landkreis Wolfenbüttel",
        "Postcode": "38300",
        "CountryID": 87,
        "Latitude": 52.16218325435221,
        "Longitude": 10.537312083328304,
        "AccessComments": "24/7 nutzbare Ladesäule ist in Höhe der Kirche; von einem Baum verdeckt. Keine Beschilderung!",
        "DistanceUnit": 0
    },
    "Connections": [
        {
            "ID": 125692,
            "ConnectionTypeID": 25,
            "StatusTypeID": 50,
            "LevelID": 2,
            "Amps": 32,
            "Voltage": 400,
            "PowerKW": 22,
            "CurrentTypeID": 20,
            "Quantity": 2
        }
    ],
    "NumberOfPoints": 2,
    "StatusTypeID": 50,
    "DateLastStatusUpdate": "2017-06-06T05:57:00Z",
    "DataQualityLevel": 1,
    "DateCreated": "2017-06-06T05:57:00Z",
    "SubmissionStatusTypeID": 200
}