{
    "IsRecentlyVerified": false,
    "ID": 110767,
    "UUID": "899EEC23-1700-4928-8CCD-5A109C7D5E71",
    "DataProviderID": 2,
    "DataProvidersReference": "100000",
    "OperatorID": 5,
    "UsageTypeID": 1,
    "AddressInfo": {
        "ID": 111113,
        "Title": "GRCC",
        "AddressLine1": "140 Bostwick Ave",
        "Town": "Grand Rapids",
        "StateOrProvince": "MI",
        "Postcode": "49503",
        "CountryID": 2,
        "Latitude": 42.9657854,
        "Longitude": -85.6658173,
        "ContactTelephone1": "888-758-4389",
        "AccessComments": "24 hours daily",
        "RelatedURL": "http://www.chargepoint.com/",
        "DistanceUnit": 0
    },
    "Connections": [
        {
            "ID": 156054,
            "ConnectionTypeID": 1,
            "LevelID": 2,
            "Amps": 16,
            "Voltage": 230,
            "PowerKW": 3.7,
            "CurrentTypeID": 10,
            "Quantity": 2
        }
    ],
    "DateLastStatusUpdate": "2020-06-26T03:06:00Z",
    "DataQualityLevel": 3,
    "DateCreated": "2018-10-18T23:36:00Z",
    "SubmissionStatusTypeID": 100
}