{
    "IsRecentlyVerified": false,
    "ID": 179195,
    "UUID": "0AAF0B94-CFCD-4056-BC82-B6AEEAF97D99",
    "DataProviderID": 29,
    "DataProvidersReference": "16636",
    "OperatorID": 220,
    "AddressInfo": {
        "ID": 179554,
        "Title": "Luruper Hauptstraße 138",
        "AddressLine1": "Luruper Hauptstraße 138",
        "Town": "Hamburg",
        "Postcode": "22547",
        "CountryID": 87,
        "Latitude": 53.591702,
        "Longitude": 9.872562,
        "DistanceUnit": 0
    },
    "Connections": [
        {
            "ID": 280685,
            "ConnectionTypeID": 28,
            "StatusTypeID": 50,
            "LevelID": 2,
            "PowerKW": 22,
            "CurrentTypeID": 20
        },
        {
            "ID": 280686,
            "ConnectionTypeID": 25,
            "StatusTypeID": 50,
            "LevelID": 2,
            "PowerKW": 22,
            "CurrentTypeID": 20
        },
        {
            "ID": 301937,
            "ConnectionTypeID": 28,
            "StatusTypeID": 50,
            "LevelID": 2,
            "PowerKW": 22,
            "CurrentTypeID": 20
        },
        {
            "ID": 301938,
            "ConnectionTypeID": 25,
            "StatusTypeID": 50,
            "LevelID": 2,
            "PowerKW": 22,
            "CurrentTypeID": 20
        }
    ],
    "StatusTypeID": 50,
    "DateLastStatusUpdate": "2021-07-12T02:51:00Z",
    "MetadataValues": [
        {
            "ID": 11489,
            "MetadataFieldID": 4,
            "ItemValue": "Data from the German chargepoint registry provided by Bundesnetzagentur.de under the CC-BY 4.0 license"
        }
    ],
    "DataQualityLevel": 3,
    "DateCreated": "2021-07-08T09:59:00Z",
    "SubmissionStatusTypeID": 100
}