{
    "IsRecentlyVerified": false,
    "ID": 46230,
    "UUID": "43CD96DE-1CBB-45B2-805C-0D6C85FBC4E5",
    "DataProviderID": 1,
    "OperatorID": 202,
    "UsageTypeID": 5,
    "AddressInfo": {
        "ID": 46576,
        "Title": "Fortum ladestasjon One Park Sentrum P-hus (Ibsen), Oslo",
        "AddressLine1": "C.J Hambros Plass 1",
        "Town": "OSLO",
        "StateOrProvince": "Oslo",
        "Postcode": "0164",
        "CountryID": 168,
        "Latitude": 59.91571,
        "Longitude": 10.74248,
        "AccessComments": "Innkjøring fra ring 1. Punktene er på Plan 2, Felt F.",
        "DistanceUnit": 0
    },
    "Connections": [
        {
            "ID": 56893,
            "ConnectionTypeID": 25,
            "Reference": "1",
            "LevelID": 3,
            "Amps": 32,
            "Voltage": 400,
            "PowerKW": 12,
            "CurrentTypeID": 30,
            "Comments": "Mode 3"
        },
        {
            "ID": 85772,
            "ConnectionTypeID": 25,
            "Reference": "2",
            "LevelID": 3,
            "Amps": 32,
            "Voltage": 400,
            "PowerKW": 12,
            "CurrentTypeID": 30,
            "Comments": "Mode 3"
        },
        {
            "ID": 85773,
            "ConnectionTypeID": 25,
            "Reference": "3",
            "LevelID": 2,
            "Amps": 32,
            "Voltage": 230,
            "PowerKW": 7.4,
            "CurrentTypeID": 10,
            "Comments": "Mode 3"
        },
        {
            "ID": 85774,
            "ConnectionTypeID": 25,
            "Reference": "4",
            "LevelID": 2,
            "Amps": 32,
            "Voltage": 230,
            "PowerKW": 7.4,
            "CurrentTypeID": 10,
            "Comments": "Mode 3"
        },
        {
            "ID": 85775,
            "ConnectionTypeID": 25,
            "Reference": "5",
            "LevelID": 2,
            "Amps": 32,
            "Voltage": 230,
            "PowerKW": 7.4,
            "CurrentTypeID": 10,
            "Comments": "Mode 3"
        },
        {
            "ID": 85776,
            "ConnectionTypeID": 25,
            "Reference": "6",
            "LevelID": 2,
            "Amps": 32,
            "Voltage": 230,
            "PowerKW": 7.4,
            "CurrentTypeID": 10,
            "Comments": "Mode 3"
        },
        {
            "ID": 85777,
            "ConnectionTypeID": 25,
            "Reference": "7",
            "LevelID": 2,
            "Amps": 16,
            "Voltage": 230,
            "PowerKW": 3.7,
            "CurrentTypeID": 10,
            "Comments": "Mode 3"
        },
        {
            "ID": 85778,
            "ConnectionTypeID": 25,
            "Reference": "8",
            "LevelID": 2,
            "Amps": 16,
            "Voltage": 230,
            "PowerKW": 3.7,
            "CurrentTypeID": 10,
            "Comments": "Mode 3"
        },
        {
            "ID": 85779,
            "ConnectionTypeID": 25,
            "Reference": "9",
            "LevelID": 2,
            "Amps": 16,
            "Voltage": 230,
            "PowerKW": 3.7,
            "CurrentTypeID": 10,
            "Comments": "Mode 3"
        },
        {
            "ID": 85780,
            "ConnectionTypeID": 25,
            "Reference": "10",
            "LevelID": 2,
            "Amps": 16,
            "Voltage": 230,
            "PowerKW": 3.7,
            "CurrentTypeID": 10,
            "Comments": "Mode 3"
        },
        {
            "ID": 85781,
            "ConnectionTypeID": 25,
            "Reference": "11",
            "LevelID": 2,
            "Amps": 16,
            "Voltage": 230,
            "PowerKW": 3.7,
            "CurrentTypeID": 10,
            "Comments": "Mode 3"
        },
        {
            "ID": 85782,
            "ConnectionTypeID": 25,
            "Reference": "12",
            "LevelID": 2,
            "Amps": 16,
            "Voltage": 230,
            "PowerKW": 3.7,
            "CurrentTypeID": 10,
            "Comments": "Mode 3"
        },
        {
            "ID": 85783,
            "ConnectionTypeID": 25,
            "Reference": "13",
            "LevelID": 2,
            "Amps": 16,
            "Voltage": 230,
            "PowerKW": 3.7,
            "CurrentTypeID": 10,
            "Comments": "Mode 3"
        },
        {
            "ID": 85784,
            "ConnectionTypeID": 25,
            "Reference": "14",
            "LevelID": 2,
            "Amps": 16,
            "Voltage": 230,
            "PowerKW": 3.7,
            "CurrentTypeID": 10,
            "Comments": "Mode 3"
        },
        {
            "ID": 85785,
            "ConnectionTypeID": 25,
            "Reference": "15",
            "LevelID": 2,
            "Amps": 16,
            "Voltage": 230,
            "PowerKW": 3.7,
            "CurrentTypeID": 10,
            "Comments": "Mode 3"
        },
        {
            "ID": 85786,
            "ConnectionTypeID": 25,
            "Reference": "16",
            "LevelID": 2,
            "Amps": 16,
            "Voltage": 230,
            "PowerKW": 3.7,
            "CurrentTypeID": 10,
            "Comments": "Mode 3"
        },
        {
            "ID": 85787,
            "ConnectionTypeID": 25,
            "Reference": "17",
            "LevelID": 2,
            "Amps": 16,
            "Voltage": 230,
            "PowerKW": 3.7,
            "CurrentTypeID": 10,
            "Comments": "Mode 3"
        },
        {
            "ID": 85788,
            "ConnectionTypeID": 25,
            "Reference": "18",
            "LevelID": 2,
            "Amps": 16,
            "Voltage": 230,
            "PowerKW": 3.7,
            "CurrentTypeID": 10,
            "Comments": "Mode 3"
        },
        {
            "ID": 85789,
            "ConnectionTypeID": 25,
            "Reference": "19",
            "LevelID": 2,
            "Amps": 16,
            "Voltage": 230,
            "PowerKW": 3.7,
            "CurrentTypeID": 10,
            "Comments": "Mode 3"
        },
        {
            "ID": 88607,
            "ConnectionTypeID": 25,
            "Reference": "20",
            "LevelID": 2,
            "Amps": 16,
            "Voltage": 230,
            "PowerKW": 3.7,
            "CurrentTypeID": 10,
            "Comments": "Mode 3"
        }
    ],
    "NumberOfPoints": 20,
    "StatusTypeID": 0,
    "DateLastStatusUpdate": "2016-07-19T19:02:00Z",
    "DataQualityLevel": 2,
    "DateCreated": "2015-05-03T00:54:00Z",
    "SubmissionStatusTypeID": 100
}