{
    "IsRecentlyVerified": false,
    "ID": 103567,
    "UUID": "E44F6350-C4E2-4832-9849-B6C1C179C0B7",
    "DataProviderID": 1,
    "OperatorID": 23,
    "OperatorsReference": "42564",
    "UsageTypeID": 4,
    "AddressInfo": {
        "ID": 103913,
        "Title": "Big Rock Pub & Indian Springs Golf Club",
        "AddressLine1": "79940 Westward Ho DR",
        "Town": "Indio",
        "StateOrProvince": "California",
        "Postcode": "92201",
        "CountryID": 2,
        "Latitude": 33.715419,
        "Longitude": -116.270206,
        "ContactTelephone1": "(760) 200-9844",
        "DistanceUnit": 0
    },
    "Connections": [
        {
            "ID": 146234,
            "ConnectionTypeID": 30,
            "StatusTypeID": 50,
            "LevelID": 2,
            "PowerKW": 16,
            "CurrentTypeID": 20,
            "Quantity": 4
        }
    ],
    "NumberOfPoints": 4,
    "GeneralComments": "4 Tesla Connectors, up to 16kW.Available for customers. Self park.",
    "StatusTypeID": 50,
    "DateLastStatusUpdate": "2018-05-04T05:41:00Z",
    "DataQualityLevel": 1,
    "DateCreated": "2018-05-04T05:41:00Z",
    "SubmissionStatusTypeID": 200
}