{
    "IsRecentlyVerified": false,
    "ID": 187726,
    "UUID": "3418495F-01BA-4955-9209-9AB7F3440C48",
    "DataProviderID": 18,
    "DataProvidersReference": "fa905198e11ff95a3e6bc6eadd6f6f44",
    "OperatorID": 2244,
    "UsageTypeID": 5,
    "AddressInfo": {
        "ID": 188085,
        "Title": "81 Willow Vale",
        "AddressLine1": "81 Willow Vale",
        "Town": "London",
        "Postcode": "W12 0JX",
        "CountryID": 1,
        "Latitude": 51.50897,
        "Longitude": -0.238363,
        "AccessComments": "",
        "RelatedURL": "https://www.ubitricity.com",
        "DistanceUnit": 0
    },
    "Connections": [
        {
            "ID": 302963,
            "ConnectionTypeID": 25,
            "Reference": "suby1100004794",
            "StatusTypeID": 50,
            "LevelID": 2,
            "Amps": 16,
            "Voltage": 230,
            "PowerKW": 3.7,
            "CurrentTypeID": 10
        }
    ],
    "StatusTypeID": 0,
    "DateLastStatusUpdate": "2021-07-12T03:38:00Z",
    "MetadataValues": [
        {
            "ID": 19966,
            "MetadataFieldID": 4,
            "ItemValue": "Contains public sector information licensed under the Open Government Licence v2.0. http://www.nationalarchives.gov.uk/doc/open-government-licence/version/2/"
        }
    ],
    "DataQualityLevel": 3,
    "DateCreated": "2021-07-12T03:38:00Z",
    "SubmissionStatusTypeID": 100
}