{
    "IsRecentlyVerified": false,
    "ID": 32849,
    "UUID": "60130FB5-F4E1-442D-B22A-63EEF78BF9E8",
    "DataProviderID": 26,
    "DataProvidersReference": "47631",
    "OperatorID": 178,
    "OperatorsReference": "EVnetNL AL782",
    "UsageCost": "0.00 jaarabonnement",
    "AddressInfo": {
        "ID": 33195,
        "Title": "Graviuspad 2",
        "AddressLine1": "Graviuspad 2",
        "Town": "Eindhoven",
        "Postcode": "5641 WK",
        "CountryID": 159,
        "Latitude": 51.445843,
        "Longitude": 5.518036,
        "ContactTelephone1": "0800-3522365",
        "RelatedURL": "http://www.evnet.nl",
        "DistanceUnit": 0
    },
    "Connections": [
        {
            "ID": 36360,
            "ConnectionTypeID": 25,
            "LevelID": 2,
            "PowerKW": 11,
            "CurrentTypeID": 10
        }
    ],
    "NumberOfPoints": 2,
    "StatusTypeID": 50,
    "DateLastStatusUpdate": "2016-06-04T02:39:00Z",
    "DataQualityLevel": 3,
    "DateCreated": "2015-01-09T06:03:00Z",
    "SubmissionStatusTypeID": 100
}