{
    "IsRecentlyVerified": false,
    "ID": 165415,
    "UUID": "D6AE81A7-99F9-446A-A2D0-2A026A75D056",
    "DataProviderID": 28,
    "DataProvidersReference": "FR*M13*P13213*007",
    "UsageTypeID": 5,
    "AddressInfo": {
        "ID": 165774,
        "Title": "MARSEILLE-13E - Rue Frédéric Joliot Curie",
        "AddressLine1": "Allée des Coudercs - Parking aire de jeu 0 MARSEILLE-13E",
        "CountryID": 80,
        "Latitude": 43.342681,
        "Longitude": 5.436152,
        "AccessComments": "24h/24 7j/7",
        "DistanceUnit": 0
    },
    "Connections": [
        {
            "ID": 238558,
            "ConnectionTypeID": 28,
            "StatusTypeID": 50,
            "LevelID": 2,
            "PowerKW": 22,
            "CurrentTypeID": 10
        },
        {
            "ID": 238559,
            "ConnectionTypeID": 1036,
            "StatusTypeID": 50,
            "LevelID": 2,
            "PowerKW": 22,
            "CurrentTypeID": 20
        }
    ],
    "GeneralComments": "Recharge par badge et avec une application smartphone",
    "StatusTypeID": 50,
    "DateLastStatusUpdate": "2020-08-27T05:10:00Z",
    "DataQualityLevel": 2,
    "DateCreated": "2020-08-27T05:10:00Z",
    "SubmissionStatusTypeID": 100
}