{
    "UserComments": [
        {
            "ID": 21767,
            "ChargePointID": 134253,
            "CommentTypeID": 10,
            "UserName": "Robert Seemueller",
            "Rating": 5,
            "DateCreated": "2019-11-05T14:46:20.583Z",
            "User": {
                "ID": 19108,
                "Username": "Robert Seemueller"
            },
            "CheckinStatusTypeID": 10
        }
    ],
    "MediaItems": [
        {
            "ID": 20266,
            "ChargePointID": 134253,
            "ItemURL": "https://s3-ap-southeast-2.amazonaws.com/openchargemap/images/US/OCM134253/OCM-134253.orig.2019110514471966.jpg",
            "ItemThumbnailURL": "https://s3-ap-southeast-2.amazonaws.com/openchargemap/images/US/OCM134253/OCM-134253.thmb.2019110514471966.jpg",
            "Comment": "",
            "IsEnabled": true,
            "IsVideo": false,
            "IsFeaturedItem": false,
            "IsExternalResource": false,
            "User": {
                "ID": 19108,
                "Username": "Robert Seemueller"
            },
            "DateCreated": "2019-11-05T14:48:00Z"
        },
        {
            "ID": 20267,
            "ChargePointID": 134253,
            "ItemURL": "https://s3-ap-southeast-2.amazonaws.com/openchargemap/images/US/OCM134253/OCM-134253.orig.2019110514474476.jpg",
            "ItemThumbnailURL": "https://s3-ap-southeast-2.amazonaws.com/openchargemap/images/US/OCM134253/OCM-134253.thmb.2019110514474476.jpg",
            "Comment": "",
            "IsEnabled": true,
            "IsVideo": false,
            "IsFeaturedItem": false,
            "IsExternalResource": false,
            "User": {
                "ID": 19108,
                "Username": "Robert Seemueller"
            },
            "DateCreated": "2019-11-05T14:48:00Z"
        },
        {
            "ID": 20265,
            "ChargePointID": 134253,
            "ItemURL": "https://s3-ap-southeast-2.amazonaws.com/openchargemap/images/US/OCM134253/OCM-134253.orig.2019110514464288.jpg",
            "ItemThumbnailURL": "https://s3-ap-southeast-2.amazonaws.com/openchargemap/images/US/OCM134253/OCM-134253.thmb.2019110514464288.jpg",
            "Comment": "",
            "IsEnabled": true,
            "IsVideo": false,
            "IsFeaturedItem": false,
            "IsExternalResource": false,
            "User": {
                "ID": 19108,
                "Username": "Robert Seemueller"
            },
            "DateCreated": "2019-11-05T14:47:00Z"
        }
    ],
    "IsRecentlyVerified": false,
    "ID": 134253,
    "UUID": "5AA50302-4DAA-4F78-A434-B238BCF695FD",
    "DataProviderID": 1,
    "OperatorID": 5,
    "UsageTypeID": 1,
    "UsageCost": "Free",
    "AddressInfo": {
        "ID": 134599,
        "Title": "Northland Central/Buffalo Manufacturing Works",
        "AddressLine1": "683 Northland Avenue",
        "Town": "Buffalo",
        "StateOrProvince": "Erie County",
        "Postcode": "14211",
        "CountryID": 2,
        "Latitude": 42.9189314530233,
        "Longitude": -78.8355284296201,
        "DistanceUnit": 0
    },
    "Connections": [
        {
            "ID": 187862,
            "ConnectionTypeID": 1,
            "StatusTypeID": 50,
            "LevelID": 2,
            "Quantity": 4
        }
    ],
    "NumberOfPoints": 2,
    "StatusTypeID": 50,
    "DateLastStatusUpdate": "2019-11-05T14:48:00Z",
    "DataQualityLevel": 1,
    "DateCreated": "2019-11-05T14:46:00Z",
    "SubmissionStatusTypeID": 200
}