{
    "IsRecentlyVerified": false,
    "ID": 88490,
    "UUID": "961FD4AF-ED55-4EE3-87B6-CF95C7B42C8C",
    "DataProviderID": 1,
    "OperatorID": 2244,
    "UsageTypeID": 4,
    "AddressInfo": {
        "ID": 88836,
        "Title": "Badesee",
        "AddressLine1": "Berliner Ring 110",
        "Town": "Bensheim",
        "StateOrProvince": "Kreis Bergstraße",
        "Postcode": "64625",
        "CountryID": 87,
        "Latitude": 49.68749,
        "Longitude": 8.60581000000002,
        "RelatedURL": "http://www.ggew.de/initiativen/elektromobilitaet",
        "DistanceUnit": 0
    },
    "Connections": [
        {
            "ID": 125517,
            "ConnectionTypeID": 25,
            "StatusTypeID": 50,
            "LevelID": 2,
            "Amps": 16,
            "Voltage": 230,
            "PowerKW": 3.7,
            "CurrentTypeID": 10,
            "Quantity": 1
        }
    ],
    "NumberOfPoints": 1,
    "GeneralComments": "24/7 verfügbar auf dem Parkplatz. Ladepunkt nur mit Ubitricity Smart Cable freischaltbar.",
    "StatusTypeID": 50,
    "DateLastStatusUpdate": "2019-10-21T12:41:00Z",
    "DataQualityLevel": 1,
    "DateCreated": "2017-05-31T10:58:00Z",
    "SubmissionStatusTypeID": 200
}