{
    "IsRecentlyVerified": false,
    "ID": 16980,
    "UUID": "70AFA966-C329-44A5-A0CF-B54BF83B3AB6",
    "DataProviderID": 22,
    "DataProvidersReference": "57574E4F5E30961F96C7E320BF15A5DD",
    "AddressInfo": {
        "ID": 17325,
        "Title": "日産サティオ福島　卸町店",
        "AddressLine1": "福島県郡山市喜久田町字松ヶ作16-20",
        "CountryID": 114,
        "Latitude": 37.44074586,
        "Longitude": 140.3369816,
        "ContactTelephone1": "024-959-3464",
        "DistanceUnit": 0
    },
    "Connections": [
        {
            "ID": 17221,
            "ConnectionTypeID": 2,
            "LevelID": 2,
            "Amps": 100,
            "Voltage": 480,
            "PowerKW": 48,
            "Quantity": 1
        }
    ],
    "DateLastStatusUpdate": "2013-06-29T08:52:00Z",
    "DataQualityLevel": 2,
    "DateCreated": "2013-06-29T08:52:00Z",
    "SubmissionStatusTypeID": 200
}