{
    "IsRecentlyVerified": false,
    "ID": 124593,
    "UUID": "6A5EADF7-0A78-415E-82CA-6A8B44919CF8",
    "DataProviderID": 2,
    "DataProvidersReference": "63413",
    "UsageTypeID": 7,
    "AddressInfo": {
        "ID": 124939,
        "Title": "Hendrick Nissan",
        "AddressLine1": "8400 Shawnee Mission Pkwy",
        "Town": "Merriam",
        "StateOrProvince": "KS",
        "Postcode": "66202",
        "CountryID": 2,
        "Latitude": 39.015091,
        "Longitude": -94.68219,
        "ContactTelephone1": "913-722-5195",
        "AccessComments": "Dealership business hours\r\nPublic - Call ahead",
        "RelatedURL": "",
        "DistanceUnit": 0
    },
    "Connections": [
        {
            "ID": 174715,
            "ConnectionTypeID": 1,
            "LevelID": 2,
            "Amps": 16,
            "Voltage": 230,
            "PowerKW": 3.7,
            "CurrentTypeID": 10,
            "Quantity": 1
        }
    ],
    "DateLastStatusUpdate": "2020-06-26T03:01:00Z",
    "DataQualityLevel": 3,
    "DateCreated": "2019-04-06T05:03:00Z",
    "SubmissionStatusTypeID": 100
}