{
    "IsRecentlyVerified": false,
    "ID": 178828,
    "UUID": "4B2C965E-BE81-4022-B389-3B61255E699C",
    "DataProviderID": 29,
    "DataProvidersReference": "4064",
    "AddressInfo": {
        "ID": 179187,
        "Title": "Industriestraße 9",
        "AddressLine1": "Industriestraße 9",
        "Town": "Bad Abbach",
        "Postcode": "93077",
        "CountryID": 87,
        "Latitude": 48.924912,
        "Longitude": 12.010499,
        "DistanceUnit": 0
    },
    "Connections": [
        {
            "ID": 279776,
            "ConnectionTypeID": 25,
            "StatusTypeID": 50,
            "LevelID": 2,
            "PowerKW": 11,
            "CurrentTypeID": 20
        },
        {
            "ID": 279777,
            "ConnectionTypeID": 25,
            "StatusTypeID": 50,
            "LevelID": 2,
            "PowerKW": 22,
            "CurrentTypeID": 20
        }
    ],
    "StatusTypeID": 0,
    "DateLastStatusUpdate": "2021-07-09T03:14:00Z",
    "MetadataValues": [
        {
            "ID": 11122,
            "MetadataFieldID": 4,
            "ItemValue": "Data from the German chargepoint registry provided by Bundesnetzagentur.de under the CC-BY 4.0 license"
        }
    ],
    "DataQualityLevel": 3,
    "DateCreated": "2021-07-08T09:50:00Z",
    "SubmissionStatusTypeID": 100
}