{
    "IsRecentlyVerified": false,
    "ID": 176276,
    "UUID": "573DA5C8-A210-47C3-8321-ED4C165932AD",
    "DataProviderID": 1,
    "OperatorID": 19,
    "UsageTypeID": 1,
    "AddressInfo": {
        "ID": 176635,
        "Title": "Tredethick Farm Cottages ",
        "AddressLine1": "Tredethick Farm ",
        "Town": "Lostwithiel ",
        "StateOrProvince": "Cornwall ",
        "Postcode": "PL22 0LE",
        "CountryID": 1,
        "Latitude": 50.396615,
        "Longitude": -4.65355,
        "ContactTelephone1": "01208 873618",
        "ContactEmail": "holidays@tredethick.com",
        "RelatedURL": "https://tredethick.com/",
        "DistanceUnit": 0
    },
    "Connections": [
        {
            "ID": 273948,
            "ConnectionTypeID": 25,
            "StatusTypeID": 50,
            "LevelID": 2,
            "Amps": 32,
            "Voltage": 230,
            "PowerKW": 7,
            "CurrentTypeID": 10,
            "Quantity": 1
        }
    ],
    "NumberOfPoints": 1,
    "GeneralComments": "for use by customers/visitors",
    "StatusTypeID": 50,
    "DateLastStatusUpdate": "2021-07-02T16:54:00Z",
    "DataQualityLevel": 1,
    "DateCreated": "2021-07-02T16:54:00Z",
    "SubmissionStatusTypeID": 200
}