{
    "IsRecentlyVerified": false,
    "ID": 48355,
    "UUID": "CA9B0C3D-A317-48C1-85FE-C14B466BB2F4",
    "DataProviderID": 2,
    "DataProvidersReference": "68010",
    "UsageTypeID": 7,
    "AddressInfo": {
        "ID": 48701,
        "Title": "Grappone Ford",
        "AddressLine1": "530 New Hampshire 3A",
        "Town": "Bow",
        "StateOrProvince": "NH",
        "Postcode": "03304",
        "CountryID": 2,
        "Latitude": 43.169099,
        "Longitude": -71.524692,
        "ContactTelephone1": "800-528-8993",
        "AccessComments": "Dealership business hours\r\nPublic - Call ahead",
        "RelatedURL": "",
        "DistanceUnit": 0
    },
    "Connections": [
        {
            "ID": 59781,
            "ConnectionTypeID": 1,
            "LevelID": 2,
            "Amps": 16,
            "Voltage": 230,
            "PowerKW": 3.7,
            "CurrentTypeID": 10,
            "Quantity": 2
        }
    ],
    "DateLastStatusUpdate": "2020-06-26T03:06:00Z",
    "DataQualityLevel": 3,
    "DateCreated": "2015-06-25T02:15:00Z",
    "SubmissionStatusTypeID": 100
}