{
    "IsRecentlyVerified": false,
    "ID": 156831,
    "UUID": "53CC195B-7E33-4D0F-8337-3A479AC48012",
    "DataProviderID": 19,
    "DataProvidersReference": "5932",
    "AddressInfo": {
        "ID": 157185,
        "Title": "Södra allen  34",
        "AddressLine1": "Södra allen 34",
        "Town": "HALLSBERG",
        "StateOrProvince": "ÖREBRO",
        "Postcode": "69431",
        "CountryID": 216,
        "Latitude": 59.06537,
        "Longitude": 15.11551,
        "AccessComments": "Korsningen mellan Södra Allén och Långängsvägen, i närheten av Coop.",
        "DistanceUnit": 0
    },
    "Connections": [
        {
            "ID": 222127,
            "ConnectionTypeID": 25,
            "Reference": "1",
            "LevelID": 3,
            "Amps": 32,
            "Voltage": 400,
            "PowerKW": 22,
            "CurrentTypeID": 30
        },
        {
            "ID": 222128,
            "ConnectionTypeID": 25,
            "Reference": "2",
            "LevelID": 3,
            "Amps": 32,
            "Voltage": 400,
            "PowerKW": 22,
            "CurrentTypeID": 30
        }
    ],
    "NumberOfPoints": 2,
    "StatusTypeID": 0,
    "DateLastStatusUpdate": "2020-05-26T08:22:00Z",
    "DataQualityLevel": 2,
    "DateCreated": "2020-05-26T08:22:00Z",
    "SubmissionStatusTypeID": 100
}