{
    "IsRecentlyVerified": false,
    "ID": 120444,
    "UUID": "F87E0616-194D-4D5B-AB93-4EE933884A1A",
    "DataProviderID": 2,
    "DataProvidersReference": "58723",
    "OperatorID": 5,
    "UsageTypeID": 1,
    "AddressInfo": {
        "ID": 120790,
        "Title": "IRVINE  CO  OFC",
        "AddressLine1": "3131 Camino del Rio North",
        "Town": "San Diego",
        "StateOrProvince": "CA",
        "Postcode": "92108",
        "CountryID": 2,
        "Latitude": 32.775602,
        "Longitude": -117.126059,
        "ContactTelephone1": "888-758-4389",
        "AccessComments": "24 hours daily",
        "RelatedURL": "http://www.chargepoint.com/",
        "DistanceUnit": 0
    },
    "Connections": [
        {
            "ID": 169794,
            "ConnectionTypeID": 1,
            "LevelID": 2,
            "Amps": 16,
            "Voltage": 230,
            "PowerKW": 3,
            "CurrentTypeID": 10,
            "Quantity": 5
        }
    ],
    "DateLastStatusUpdate": "2019-12-24T09:09:00Z",
    "DataQualityLevel": 3,
    "DateCreated": "2019-04-01T04:59:00Z",
    "SubmissionStatusTypeID": 100
}