{
    "IsRecentlyVerified": false,
    "ID": 86104,
    "UUID": "6EF23ECA-9497-4643-9705-4CC352C52D59",
    "DataProviderID": 1,
    "OperatorID": 1,
    "UsageTypeID": 6,
    "UsageCost": "Free",
    "AddressInfo": {
        "ID": 86450,
        "Title": "CYASA Gijón",
        "AddressLine1": "Pol. Ind. de Roces, Calle de Sigmund Freud, 19",
        "Town": "Gijón",
        "StateOrProvince": "Asturias",
        "Postcode": "33392",
        "CountryID": 210,
        "Latitude": 43.5080426,
        "Longitude": -5.69321739999998,
        "DistanceUnit": 0
    },
    "Connections": [
        {
            "ID": 122454,
            "ConnectionTypeID": 2,
            "StatusTypeID": 50,
            "LevelID": 3,
            "Amps": 125,
            "Voltage": 400,
            "PowerKW": 50,
            "CurrentTypeID": 20,
            "Quantity": 1
        }
    ],
    "NumberOfPoints": 1,
    "GeneralComments": "Uso prioritario para vehículos de la empresa, pero dejan recargar a los clientes que lo necesiten",
    "StatusTypeID": 50,
    "DateLastStatusUpdate": "2017-04-25T18:45:00Z",
    "DataQualityLevel": 1,
    "DateCreated": "2017-04-25T12:10:00Z",
    "SubmissionStatusTypeID": 200
}