{
    "IsRecentlyVerified": false,
    "ID": 141871,
    "UUID": "A13884C7-18C4-4BB0-9A01-A3105048C834",
    "DataProviderID": 2,
    "DataProvidersReference": "121544",
    "OperatorID": 9,
    "UsageTypeID": 2,
    "AddressInfo": {
        "ID": 142223,
        "Title": "Janus Capital Group",
        "AddressLine1": "151 Detroit Street",
        "Town": "Denver",
        "StateOrProvince": "CO",
        "Postcode": "80206",
        "CountryID": 2,
        "Latitude": 39.718799,
        "Longitude": -104.956794,
        "ContactTelephone1": "888-998-2546",
        "AccessComments": "MON: 24 hours | TUE: 24 hours | WED: 24 hours | THU: 24 hours | FRI: 24 hours | SAT: 24 hours | SUN: 24 hours",
        "RelatedURL": "http://www.blinkcharging.com/",
        "DistanceUnit": 0
    },
    "Connections": [
        {
            "ID": 197909,
            "ConnectionTypeID": 1,
            "LevelID": 2,
            "Amps": 16,
            "Voltage": 230,
            "PowerKW": 3.7,
            "CurrentTypeID": 10,
            "Quantity": 1
        }
    ],
    "StatusTypeID": 50,
    "DateLastStatusUpdate": "2020-06-26T03:02:00Z",
    "DataQualityLevel": 3,
    "DateCreated": "2019-12-24T09:16:00Z",
    "SubmissionStatusTypeID": 100
}