{
    "IsRecentlyVerified": false,
    "ID": 185051,
    "UUID": "93433FF1-1DAE-47BB-ACBF-F30B2872135F",
    "DataProviderID": 29,
    "DataProvidersReference": "16914",
    "OperatorID": 105,
    "AddressInfo": {
        "ID": 185410,
        "Title": "Hörder-Bach-Allee ",
        "AddressLine1": "Hörder-Bach-Allee ",
        "Town": "Dortmund",
        "Postcode": "44263",
        "CountryID": 87,
        "Latitude": 51.489983,
        "Longitude": 7.505133,
        "DistanceUnit": 0
    },
    "Connections": [
        {
            "ID": 294052,
            "ConnectionTypeID": 25,
            "StatusTypeID": 50,
            "LevelID": 2,
            "PowerKW": 22,
            "CurrentTypeID": 20
        },
        {
            "ID": 294053,
            "ConnectionTypeID": 25,
            "StatusTypeID": 50,
            "LevelID": 2,
            "PowerKW": 22,
            "CurrentTypeID": 20
        }
    ],
    "StatusTypeID": 50,
    "DateLastStatusUpdate": "2021-07-12T02:47:00Z",
    "MetadataValues": [
        {
            "ID": 17342,
            "MetadataFieldID": 4,
            "ItemValue": "Data from the German chargepoint registry provided by Bundesnetzagentur.de under the CC-BY 4.0 license"
        }
    ],
    "DataQualityLevel": 3,
    "DateCreated": "2021-07-08T10:06:00Z",
    "SubmissionStatusTypeID": 100
}