{
    "IsRecentlyVerified": false,
    "ID": 65829,
    "UUID": "CF96510B-15DC-4287-A19E-DC76CB750171",
    "DataProviderID": 1,
    "OperatorID": 156,
    "UsageTypeID": 4,
    "AddressInfo": {
        "ID": 66175,
        "Title": "Erlebniswald Trappenkamp",
        "AddressLine1": "Tannenhof",
        "Town": "Daldorf",
        "StateOrProvince": "Boostedt-Rickling",
        "Postcode": "24635",
        "CountryID": 87,
        "Latitude": 54.0233594,
        "Longitude": 10.239730799999961,
        "ContactTelephone1": "+49 4328 170480",
        "AccessComments": "24/7 verfügbar.",
        "RelatedURL": "http://www.forst-sh.de/erlebnis/kontakt.html",
        "DistanceUnit": 0
    },
    "Connections": [
        {
            "ID": 90974,
            "ConnectionTypeID": 25,
            "StatusTypeID": 50,
            "LevelID": 2,
            "Amps": 32,
            "Voltage": 400,
            "PowerKW": 22,
            "CurrentTypeID": 20,
            "Quantity": 1
        },
        {
            "ID": 90975,
            "ConnectionTypeID": 28,
            "StatusTypeID": 50,
            "LevelID": 2,
            "Amps": 16,
            "Voltage": 230,
            "PowerKW": 3.7,
            "CurrentTypeID": 10,
            "Quantity": 1
        }
    ],
    "NumberOfPoints": 1,
    "StatusTypeID": 50,
    "DateLastStatusUpdate": "2016-04-28T07:49:00Z",
    "DataQualityLevel": 1,
    "DateCreated": "2016-04-28T07:49:00Z",
    "SubmissionStatusTypeID": 200
}