{
    "UserComments": [
        {
            "ID": 14358,
            "ChargePointID": 32649,
            "CommentTypeID": 10,
            "UserName": "Bert van Sas",
            "Comment": "Charged succesfully 7 oct 2016",
            "Rating": 5,
            "DateCreated": "2016-10-07T13:32:56.927Z",
            "User": {
                "ID": 11617,
                "Username": "Bert van Sas"
            },
            "CheckinStatusTypeID": 10
        }
    ],
    "MediaItems": [
        {
            "ID": 8393,
            "ChargePointID": 32649,
            "ItemURL": "https://s3-ap-southeast-2.amazonaws.com/openchargemap/images/NL/OCM32649/OCM-32649.orig.2016100713314145.jpg",
            "ItemThumbnailURL": "https://s3-ap-southeast-2.amazonaws.com/openchargemap/images/NL/OCM32649/OCM-32649.thmb.2016100713314145.jpg",
            "Comment": "Follow Stuvesande road to the carpark at the left. At the left is the charging point.",
            "IsEnabled": true,
            "IsVideo": false,
            "IsFeaturedItem": false,
            "IsExternalResource": false,
            "User": {
                "ID": 11617,
                "Username": "Bert van Sas"
            },
            "DateCreated": "2016-10-07T13:32:00Z"
        },
        {
            "ID": 8394,
            "ChargePointID": 32649,
            "ItemURL": "https://s3-ap-southeast-2.amazonaws.com/openchargemap/images/NL/OCM32649/OCM-32649.orig.2016100713315752.jpg",
            "ItemThumbnailURL": "https://s3-ap-southeast-2.amazonaws.com/openchargemap/images/NL/OCM32649/OCM-32649.thmb.2016100713315752.jpg",
            "Comment": "",
            "IsEnabled": true,
            "IsVideo": false,
            "IsFeaturedItem": false,
            "IsExternalResource": false,
            "User": {
                "ID": 11617,
                "Username": "Bert van Sas"
            },
            "DateCreated": "2016-10-07T13:32:00Z"
        },
        {
            "ID": 8395,
            "ChargePointID": 32649,
            "ItemURL": "https://s3-ap-southeast-2.amazonaws.com/openchargemap/images/NL/OCM32649/OCM-32649.orig.2016100713321190.jpg",
            "ItemThumbnailURL": "https://s3-ap-southeast-2.amazonaws.com/openchargemap/images/NL/OCM32649/OCM-32649.thmb.2016100713321190.jpg",
            "Comment": "",
            "IsEnabled": true,
            "IsVideo": false,
            "IsFeaturedItem": false,
            "IsExternalResource": false,
            "User": {
                "ID": 11617,
                "Username": "Bert van Sas"
            },
            "DateCreated": "2016-10-07T13:32:00Z"
        }
    ],
    "IsRecentlyVerified": false,
    "ID": 32649,
    "UUID": "BE900A9D-862C-407B-BEBA-ADA3D708CF89",
    "DataProviderID": 1,
    "OperatorID": 178,
    "OperatorsReference": "EVnetNL RWE014",
    "UsageTypeID": 1,
    "UsageCost": "0.00 jaarabonnement",
    "AddressInfo": {
        "ID": 32995,
        "Title": "Stuvesande 78",
        "AddressLine1": "Stuvesande 78",
        "Town": "Terneuzen",
        "StateOrProvince": "Zeeland",
        "Postcode": "4532 MH",
        "CountryID": 159,
        "Latitude": 51.33568062136311,
        "Longitude": 3.8379347962951282,
        "ContactTelephone1": "0800-3522365",
        "AccessComments": "Follow Stvesande road to the car park left. The charging point is at that car park in the left corner.",
        "RelatedURL": "http://www.evnet.nl",
        "DistanceUnit": 0
    },
    "Connections": [
        {
            "ID": 36160,
            "ConnectionTypeID": 25,
            "StatusTypeID": 50,
            "LevelID": 2,
            "PowerKW": 11,
            "CurrentTypeID": 10
        },
        {
            "ID": 46460,
            "ConnectionTypeID": 25,
            "StatusTypeID": 50,
            "LevelID": 2,
            "PowerKW": 11,
            "CurrentTypeID": 10
        }
    ],
    "NumberOfPoints": 2,
    "GeneralComments": "The New Motion card is okay.",
    "StatusTypeID": 50,
    "DateLastStatusUpdate": "2016-10-07T13:36:00Z",
    "DataQualityLevel": 3,
    "DateCreated": "2015-01-09T06:03:00Z",
    "SubmissionStatusTypeID": 100
}