{
    "IsRecentlyVerified": false,
    "ID": 87719,
    "UUID": "90893E08-AB9E-4739-890A-01FD66261D5B",
    "DataProviderID": 1,
    "OperatorID": 23,
    "OperatorsReference": "29595",
    "UsageTypeID": 6,
    "AddressInfo": {
        "ID": 88065,
        "Title": "Hôtel & Spa Best Western Plus - Chassieu",
        "AddressLine1": "82 Route de Lyon",
        "Town": "Chassieu",
        "Postcode": "69680",
        "CountryID": 80,
        "Latitude": 45.737861,
        "Longitude": 4.968764,
        "ContactTelephone1": "+33 4 72 47 72 72",
        "DistanceUnit": 0
    },
    "Connections": [
        {
            "ID": 124335,
            "ConnectionTypeID": 30,
            "StatusTypeID": 50,
            "LevelID": 2,
            "Amps": 32,
            "Voltage": 230,
            "PowerKW": 17,
            "CurrentTypeID": 20,
            "Quantity": 1
        }
    ],
    "NumberOfPoints": 1,
    "GeneralComments": "1 Tesla Connector, up to 17kW.Available for patrons only. Please see front desk.",
    "StatusTypeID": 50,
    "DateLastStatusUpdate": "2018-10-03T22:22:00Z",
    "DataQualityLevel": 1,
    "DateCreated": "2017-05-16T05:29:00Z",
    "SubmissionStatusTypeID": 200
}