{
    "IsRecentlyVerified": false,
    "ID": 117479,
    "UUID": "9D10ED45-C82A-4A21-9A4E-B4513C632A7C",
    "DataProviderID": 1,
    "OperatorID": 23,
    "OperatorsReference": "49008",
    "UsageTypeID": 4,
    "AddressInfo": {
        "ID": 117825,
        "Title": "Signature Flight Support PDK",
        "AddressLine1": "1 Corsair DR Ste 108",
        "Town": "Atlatna",
        "StateOrProvince": "Georgia",
        "Postcode": "30341",
        "CountryID": 2,
        "Latitude": 33.88401,
        "Longitude": -84.3027,
        "ContactTelephone1": "(770) 452-0010",
        "DistanceUnit": 0
    },
    "Connections": [
        {
            "ID": 166217,
            "ConnectionTypeID": 30,
            "StatusTypeID": 50,
            "LevelID": 2,
            "PowerKW": 10,
            "CurrentTypeID": 10,
            "Quantity": 1
        }
    ],
    "NumberOfPoints": 1,
    "GeneralComments": "1 Tesla Connector, up to 10kW.Available for members only. Self park.",
    "StatusTypeID": 50,
    "DateLastStatusUpdate": "2019-02-18T06:48:00Z",
    "DataQualityLevel": 1,
    "DateCreated": "2019-02-18T06:48:00Z",
    "SubmissionStatusTypeID": 200
}