{
    "IsRecentlyVerified": false,
    "ID": 83482,
    "UUID": "7A0EB3AA-5EBE-489F-A9D2-5724AD9B36D6",
    "DataProviderID": 1,
    "OperatorID": 3,
    "OperatorsReference": "PG-80789",
    "UsageTypeID": 6,
    "UsageCost": "1",
    "AddressInfo": {
        "ID": 83828,
        "Title": "Nestle Purina Petcare UK LTD",
        "AddressLine1": "Cromwell Road",
        "Town": " Cambridgeshire",
        "Postcode": "PE13 2RG",
        "CountryID": 1,
        "Latitude": 52.661063,
        "Longitude": 0.152795,
        "DistanceUnit": 0
    },
    "Connections": [
        {
            "ID": 118297,
            "ConnectionTypeID": 25,
            "StatusTypeID": 50,
            "LevelID": 2,
            "Amps": 32,
            "Voltage": 230,
            "PowerKW": 7,
            "CurrentTypeID": 10,
            "Quantity": 2
        }
    ],
    "NumberOfPoints": 6,
    "GeneralComments": "This is an open charge unit installed at the Nestle Purina Petcare UK Ltd site in Cromwell Road, Wisbech, Cambridgeshire",
    "StatusTypeID": 0,
    "DateLastStatusUpdate": "2020-01-18T06:31:00Z",
    "DataQualityLevel": 1,
    "DateCreated": "2017-02-08T10:25:00Z",
    "SubmissionStatusTypeID": 200
}