{
    "IsRecentlyVerified": false,
    "ID": 45478,
    "UUID": "89BD43F3-DCE5-44F0-9D6C-FA2404591258",
    "DataProviderID": 26,
    "DataProvidersReference": "61543",
    "OperatorID": 73,
    "OperatorsReference": "EV-Box EVB-P1445055",
    "UsageCost": "0.00 jaarabonnement",
    "AddressInfo": {
        "ID": 45824,
        "Title": "Sint Jorisweg",
        "AddressLine1": "Sint Jorisweg",
        "Town": "Delft",
        "Postcode": "2612",
        "CountryID": 159,
        "Latitude": 52.02184,
        "Longitude": 4.36001,
        "RelatedURL": "http://www.ev-box.nl",
        "DistanceUnit": 0
    },
    "Connections": [
        {
            "ID": 56093,
            "ConnectionTypeID": 25,
            "LevelID": 2,
            "PowerKW": 11,
            "CurrentTypeID": 10
        }
    ],
    "NumberOfPoints": 1,
    "StatusTypeID": 50,
    "DateLastStatusUpdate": "2016-06-04T02:44:00Z",
    "DataQualityLevel": 3,
    "DateCreated": "2015-05-01T04:40:00Z",
    "SubmissionStatusTypeID": 100
}