{
    "IsRecentlyVerified": false,
    "ID": 186996,
    "UUID": "E974848C-D5A0-4C7B-B3DA-CE6C4FDEF60C",
    "DataProviderID": 29,
    "DataProvidersReference": "10170",
    "AddressInfo": {
        "ID": 187355,
        "Title": "Pankeborn 5",
        "AddressLine1": "Pankeborn 5",
        "Town": "Bernau",
        "Postcode": "16321",
        "CountryID": 87,
        "Latitude": 52.685043,
        "Longitude": 13.601331,
        "DistanceUnit": 0
    },
    "Connections": [
        {
            "ID": 300905,
            "ConnectionTypeID": 17,
            "StatusTypeID": 50,
            "LevelID": 2,
            "PowerKW": 22,
            "CurrentTypeID": 20
        },
        {
            "ID": 300906,
            "ConnectionTypeID": 25,
            "StatusTypeID": 50,
            "LevelID": 2,
            "PowerKW": 22,
            "CurrentTypeID": 20
        },
        {
            "ID": 300907,
            "ConnectionTypeID": 17,
            "StatusTypeID": 50,
            "LevelID": 2,
            "PowerKW": 22,
            "CurrentTypeID": 20
        },
        {
            "ID": 300908,
            "ConnectionTypeID": 25,
            "StatusTypeID": 50,
            "LevelID": 2,
            "PowerKW": 22,
            "CurrentTypeID": 20
        }
    ],
    "StatusTypeID": 50,
    "DateLastStatusUpdate": "2021-07-12T02:50:00Z",
    "MetadataValues": [
        {
            "ID": 19236,
            "MetadataFieldID": 4,
            "ItemValue": "Data from the German chargepoint registry provided by Bundesnetzagentur.de under the CC-BY 4.0 license"
        }
    ],
    "DataQualityLevel": 3,
    "DateCreated": "2021-07-12T02:50:00Z",
    "SubmissionStatusTypeID": 100
}