{
    "IsRecentlyVerified": false,
    "ID": 133483,
    "UUID": "AE6C4300-0824-47C0-89D0-778C5524FFEE",
    "DataProviderID": 1,
    "OperatorID": 25,
    "OperatorsReference": "southwark-pickwickroad2",
    "UsageTypeID": 4,
    "UsageCost": "£0.059/minute; min £1.18; other tariffs available",
    "AddressInfo": {
        "ID": 133829,
        "Title": "Pickwick Road (2)",
        "AddressLine1": "1 Pickwick Road (2)",
        "Town": "London",
        "Postcode": "SE21 7JN",
        "CountryID": 1,
        "Latitude": 51.448269,
        "Longitude": -0.085789,
        "DistanceUnit": 0
    },
    "Connections": [
        {
            "ID": 186846,
            "ConnectionTypeID": 25,
            "StatusTypeID": 50,
            "LevelID": 2,
            "Amps": 32,
            "Voltage": 230,
            "PowerKW": 7,
            "CurrentTypeID": 10,
            "Quantity": 3
        },
        {
            "ID": 186847,
            "ConnectionTypeID": 1,
            "StatusTypeID": 50,
            "LevelID": 2,
            "Voltage": 230,
            "PowerKW": 4,
            "CurrentTypeID": 10,
            "Quantity": 3
        }
    ],
    "NumberOfPoints": 3,
    "StatusTypeID": 50,
    "DateLastStatusUpdate": "2019-10-22T05:36:00Z",
    "DataQualityLevel": 1,
    "DateCreated": "2019-10-19T05:27:00Z",
    "SubmissionStatusTypeID": 200
}