{
    "IsRecentlyVerified": false,
    "ID": 56270,
    "UUID": "E9B86AAF-00C3-4E28-A3B3-54F485FC932D",
    "DataProviderID": 1,
    "OperatorID": 220,
    "OperatorsReference": "4285,4285",
    "UsageTypeID": 4,
    "UsageCost": "€1.73 + €0.3213/kWh; Andere Tarife möglich",
    "AddressInfo": {
        "ID": 56616,
        "Title": "Schweimlerstraße",
        "AddressLine1": "Schweimlerstraße 1",
        "AddressLine2": "Hohenfelde",
        "Town": "Hamburg",
        "StateOrProvince": "Hamburg",
        "Postcode": "22087",
        "CountryID": 87,
        "Latitude": 53.5617188,
        "Longitude": 10.0164923,
        "AccessComments": "Rund um die Uhr (24/7) nutzbar\r\n",
        "DistanceUnit": 0
    },
    "Connections": [
        {
            "ID": 70955,
            "ConnectionTypeID": 25,
            "StatusTypeID": 50,
            "LevelID": 2,
            "Amps": 32,
            "Voltage": 400,
            "PowerKW": 22,
            "CurrentTypeID": 20,
            "Quantity": 2
        },
        {
            "ID": 70956,
            "ConnectionTypeID": 28,
            "StatusTypeID": 50,
            "LevelID": 2,
            "Amps": 16,
            "Voltage": 230,
            "PowerKW": 3.7,
            "CurrentTypeID": 10,
            "Quantity": 2
        }
    ],
    "NumberOfPoints": 2,
    "StatusTypeID": 50,
    "DateLastStatusUpdate": "2017-08-18T05:27:00Z",
    "DataQualityLevel": 1,
    "DateCreated": "2015-10-26T12:10:00Z",
    "SubmissionStatusTypeID": 200
}