{
    "IsRecentlyVerified": false,
    "ID": 152909,
    "UUID": "1E203D2A-DC28-4169-8899-4982BD0746CE",
    "DataProviderID": 28,
    "DataProvidersReference": "FRS1801101",
    "UsageTypeID": 5,
    "AddressInfo": {
        "ID": 153262,
        "Title": "Argent sur Sauldre",
        "AddressLine1": "Place du marche - 18410 ARGENT SUR SAULDRE",
        "CountryID": 80,
        "Latitude": 47.5592618,
        "Longitude": 2.4470023,
        "AccessComments": "24h/24h",
        "DistanceUnit": 0
    },
    "Connections": [
        {
            "ID": 214277,
            "ConnectionTypeID": 26,
            "StatusTypeID": 50,
            "LevelID": 2,
            "PowerKW": 18
        },
        {
            "ID": 247534,
            "ConnectionTypeID": 26,
            "StatusTypeID": 50,
            "LevelID": 2,
            "PowerKW": 18
        }
    ],
    "GeneralComments": "Borne en service",
    "StatusTypeID": 50,
    "DateLastStatusUpdate": "2020-08-27T05:13:00Z",
    "DataQualityLevel": 2,
    "DateCreated": "2020-03-15T10:54:00Z",
    "SubmissionStatusTypeID": 100
}