{
    "IsRecentlyVerified": false,
    "ID": 60728,
    "UUID": "2941948F-1BDA-4D11-A231-A0AC38D8FC9A",
    "DataProviderID": 25,
    "DataProvidersReference": "FGCSQZE ",
    "AddressInfo": {
        "ID": 61074,
        "Title": "Intercanviador FGC Sant Quirze ",
        "AddressLine1": "Carretera de Molins de Rei - Avinguda Països Catalans",
        "Town": "SANT QUIRZE DEL VALLÈS ",
        "StateOrProvince": "Barcelona ",
        "CountryID": 210,
        "Latitude": 41.53044,
        "Longitude": 2.08878,
        "ContactTelephone1": " ",
        "AccessComments": " ",
        "DistanceUnit": 0
    },
    "Connections": [
        {
            "ID": 76986,
            "ConnectionTypeID": 28,
            "StatusTypeID": 50,
            "LevelID": 2,
            "Amps": 32,
            "Voltage": 220,
            "PowerKW": 7,
            "CurrentTypeID": 10
        }
    ],
    "GeneralComments": "http://premsa.gencat.cat/pres_fsvp/AppJava/notapremsavw/281799/ca/projecte-pilot-installar-punts-recarrega-vehicles-electrics-estacions-dfgc.do",
    "StatusTypeID": 50,
    "DateLastStatusUpdate": "2016-02-07T04:06:00Z",
    "MetadataValues": [
        {
            "ID": 2975,
            "MetadataFieldID": 5
        }
    ],
    "DataQualityLevel": 2,
    "DateCreated": "2016-02-07T04:06:00Z",
    "SubmissionStatusTypeID": 100
}