{
    "IsRecentlyVerified": false,
    "ID": 186537,
    "UUID": "079E46B8-4FE1-4889-BF01-BAF86487A963",
    "DataProviderID": 29,
    "DataProvidersReference": "21013",
    "OperatorID": 3403,
    "AddressInfo": {
        "ID": 186896,
        "Title": "Mathilde-Kaiser-Straße 42",
        "AddressLine1": "Mathilde-Kaiser-Straße 42",
        "Town": "Essen",
        "Postcode": "45138",
        "CountryID": 87,
        "Latitude": 51.446434,
        "Longitude": 7.005813,
        "DistanceUnit": 0
    },
    "Connections": [
        {
            "ID": 299408,
            "ConnectionTypeID": 25,
            "StatusTypeID": 50,
            "LevelID": 2,
            "PowerKW": 11,
            "CurrentTypeID": 20
        },
        {
            "ID": 299409,
            "ConnectionTypeID": 25,
            "StatusTypeID": 50,
            "LevelID": 2,
            "PowerKW": 11,
            "CurrentTypeID": 20
        }
    ],
    "StatusTypeID": 50,
    "DateLastStatusUpdate": "2021-07-12T02:47:00Z",
    "MetadataValues": [
        {
            "ID": 18778,
            "MetadataFieldID": 4,
            "ItemValue": "Data from the German chargepoint registry provided by Bundesnetzagentur.de under the CC-BY 4.0 license"
        }
    ],
    "DataQualityLevel": 3,
    "DateCreated": "2021-07-12T02:47:00Z",
    "SubmissionStatusTypeID": 100
}