{
    "IsRecentlyVerified": false,
    "ID": 144564,
    "UUID": "F4A61CBB-E8B2-4245-A925-1F6BAC013E47",
    "DataProviderID": 2,
    "DataProvidersReference": "130642",
    "OperatorID": 90,
    "UsageTypeID": 1,
    "AddressInfo": {
        "ID": 144916,
        "Title": "7151 St-Dominique",
        "AddressLine1": "7151A St-Dominique",
        "Town": "Montréal",
        "StateOrProvince": "QC",
        "Postcode": "H2R 1X3",
        "CountryID": 44,
        "Latitude": 45.535353,
        "Longitude": -73.61758,
        "ContactTelephone1": "877-505-2674",
        "AccessComments": "24 hours daily",
        "RelatedURL": "https://lecircuitelectrique.com/",
        "DistanceUnit": 0
    },
    "Connections": [
        {
            "ID": 201074,
            "ConnectionTypeID": 1,
            "LevelID": 2,
            "Amps": 16,
            "Voltage": 230,
            "PowerKW": 3.7,
            "CurrentTypeID": 10,
            "Quantity": 2
        }
    ],
    "StatusTypeID": 50,
    "DateLastStatusUpdate": "2020-06-26T03:09:00Z",
    "DataQualityLevel": 3,
    "DateCreated": "2019-12-24T09:23:00Z",
    "SubmissionStatusTypeID": 100
}