{
    "IsRecentlyVerified": false,
    "ID": 57326,
    "UUID": "C335E6EA-18E6-45AA-941A-FE8C381BD440",
    "DataProviderID": 2,
    "DataProvidersReference": "70964",
    "UsageTypeID": 2,
    "AddressInfo": {
        "ID": 57672,
        "Title": "Ivy Car Barn",
        "AddressLine1": "311 E Chase St",
        "Town": "Baltimore",
        "StateOrProvince": "MD",
        "Postcode": "21202",
        "CountryID": 2,
        "Latitude": 39.302532,
        "Longitude": -76.610935,
        "ContactTelephone1": "",
        "AccessComments": "",
        "RelatedURL": "",
        "DistanceUnit": 0
    },
    "Connections": [
        {
            "ID": 72427,
            "ConnectionTypeID": 1,
            "LevelID": 2,
            "Amps": 16,
            "Voltage": 230,
            "PowerKW": 3.7,
            "CurrentTypeID": 10,
            "Quantity": 2
        }
    ],
    "DateLastStatusUpdate": "2020-06-26T03:01:00Z",
    "DataQualityLevel": 3,
    "DateCreated": "2015-11-30T11:50:00Z",
    "SubmissionStatusTypeID": 100
}