{
    "IsRecentlyVerified": false,
    "ID": 95120,
    "UUID": "217464CA-9202-4847-8A12-99E26E3930EA",
    "DataProviderID": 1,
    "OperatorID": 80,
    "UsageTypeID": 4,
    "UsageCost": "0,40 €/kWh",
    "AddressInfo": {
        "ID": 95466,
        "Title": "Eneldrive Parcheggio Giosuè",
        "AddressLine1": "Via Giosuè Pinto",
        "Town": "Ostuni",
        "StateOrProvince": "BR",
        "Postcode": "72017",
        "CountryID": 112,
        "Latitude": 40.73283094916215,
        "Longitude": 17.581130237683986,
        "RelatedURL": "http://eneldrive.it",
        "DistanceUnit": 0
    },
    "Connections": [
        {
            "ID": 134775,
            "ConnectionTypeID": 25,
            "StatusTypeID": 50,
            "LevelID": 2,
            "Amps": 32,
            "Voltage": 400,
            "PowerKW": 22,
            "CurrentTypeID": 20,
            "Quantity": 1
        },
        {
            "ID": 134776,
            "ConnectionTypeID": 36,
            "StatusTypeID": 50,
            "LevelID": 2,
            "Amps": 16,
            "Voltage": 240,
            "PowerKW": 3,
            "CurrentTypeID": 10,
            "Quantity": 1
        }
    ],
    "NumberOfPoints": 2,
    "StatusTypeID": 50,
    "DateLastStatusUpdate": "2017-11-03T11:16:00Z",
    "DataQualityLevel": 1,
    "DateCreated": "2017-11-03T11:16:00Z",
    "SubmissionStatusTypeID": 200
}