{
    "IsRecentlyVerified": false,
    "ID": 179464,
    "UUID": "214A66AF-80D1-4D39-B8BF-DDA8DA2D1237",
    "DataProviderID": 29,
    "DataProvidersReference": "10234",
    "OperatorID": 127,
    "AddressInfo": {
        "ID": 179823,
        "Title": "Rathausstraße 14",
        "AddressLine1": "Rathausstraße 14",
        "Town": "Hesel",
        "Postcode": "26835",
        "CountryID": 87,
        "Latitude": 53.306735124402,
        "Longitude": 7.594470173317,
        "DistanceUnit": 0
    },
    "Connections": [
        {
            "ID": 281323,
            "ConnectionTypeID": 25,
            "StatusTypeID": 50,
            "LevelID": 2,
            "PowerKW": 22,
            "CurrentTypeID": 20
        },
        {
            "ID": 281324,
            "ConnectionTypeID": 25,
            "StatusTypeID": 50,
            "LevelID": 2,
            "PowerKW": 22,
            "CurrentTypeID": 20
        }
    ],
    "StatusTypeID": 50,
    "DateLastStatusUpdate": "2021-07-12T02:51:00Z",
    "MetadataValues": [
        {
            "ID": 11758,
            "MetadataFieldID": 4,
            "ItemValue": "Data from the German chargepoint registry provided by Bundesnetzagentur.de under the CC-BY 4.0 license"
        }
    ],
    "DataQualityLevel": 3,
    "DateCreated": "2021-07-08T09:59:00Z",
    "SubmissionStatusTypeID": 100
}