{
    "IsRecentlyVerified": false,
    "ID": 121452,
    "UUID": "76826B35-5B14-40E2-99A7-8665DF56F326",
    "DataProviderID": 1,
    "OperatorID": 3296,
    "UsageTypeID": 5,
    "UsageCost": "35p/kWh",
    "AddressInfo": {
        "ID": 121798,
        "Title": "Hillstreet Shopping Centre",
        "AddressLine1": "Wilson Street",
        "Town": "Middlesbrough",
        "Postcode": "TS1 1SU",
        "CountryID": 1,
        "Latitude": 54.577389,
        "Longitude": -1.240509,
        "DistanceUnit": 0
    },
    "Connections": [
        {
            "ID": 171120,
            "ConnectionTypeID": 33,
            "StatusTypeID": 50,
            "LevelID": 3,
            "PowerKW": 50,
            "CurrentTypeID": 30,
            "Quantity": 2
        },
        {
            "ID": 171121,
            "ConnectionTypeID": 2,
            "StatusTypeID": 50,
            "LevelID": 3,
            "PowerKW": 50,
            "CurrentTypeID": 30,
            "Quantity": 2
        }
    ],
    "NumberOfPoints": 2,
    "StatusTypeID": 50,
    "DateLastStatusUpdate": "2019-04-02T15:08:00Z",
    "DataQualityLevel": 1,
    "DateCreated": "2019-04-02T15:08:00Z",
    "SubmissionStatusTypeID": 200
}