{
    "IsRecentlyVerified": false,
    "ID": 135965,
    "UUID": "3E5EC100-1D37-45DE-AAC2-CFEFA2C18DD7",
    "DataProviderID": 18,
    "DataProvidersReference": "00b2f5de79f2ffc788af5e48a2076ea7",
    "OperatorID": 3,
    "UsageTypeID": 4,
    "AddressInfo": {
        "ID": 136311,
        "Title": "Hounslow. Civic Centre, Car Club Bays.",
        "AddressLine1": "39 Neville Close",
        "Town": "Hounslow",
        "Postcode": "TW3 4DN",
        "CountryID": 1,
        "Latitude": 51.475,
        "Longitude": -0.366,
        "AccessComments": "",
        "RelatedURL": "http://pod-point.com",
        "DistanceUnit": 0
    },
    "Connections": [
        {
            "ID": 190391,
            "ConnectionTypeID": 3,
            "Reference": "1",
            "StatusTypeID": 50,
            "LevelID": 2,
            "Amps": 13,
            "Voltage": 230,
            "PowerKW": 3,
            "CurrentTypeID": 10
        },
        {
            "ID": 190392,
            "ConnectionTypeID": 3,
            "Reference": "2",
            "StatusTypeID": 50,
            "LevelID": 2,
            "Amps": 13,
            "Voltage": 230,
            "PowerKW": 3,
            "CurrentTypeID": 10
        }
    ],
    "StatusTypeID": 0,
    "DateLastStatusUpdate": "2020-02-21T15:15:00Z",
    "MetadataValues": [
        {
            "ID": 5817,
            "MetadataFieldID": 4,
            "ItemValue": "Contains public sector information licensed under the Open Government Licence v2.0. http://www.nationalarchives.gov.uk/doc/open-government-licence/version/2/"
        }
    ],
    "DataQualityLevel": 3,
    "DateCreated": "2019-12-24T05:22:00Z",
    "SubmissionStatusTypeID": 100
}