{
    "IsRecentlyVerified": false,
    "ID": 85171,
    "UUID": "D2F6070E-CCC5-4954-B170-02FF6CBDF422",
    "DataProviderID": 1,
    "OperatorID": 23,
    "OperatorsReference": "26046",
    "UsageTypeID": 6,
    "AddressInfo": {
        "ID": 85517,
        "Title": "Gaustablikk Høyfjellshotell",
        "AddressLine1": "Kvitåvatnvegen 372",
        "Town": "Rjukan",
        "Postcode": "3660",
        "CountryID": 168,
        "Latitude": 59.880092,
        "Longitude": 8.734633,
        "ContactTelephone1": "+47 35 09 14 22",
        "DistanceUnit": 0
    },
    "Connections": [
        {
            "ID": 120933,
            "ConnectionTypeID": 30,
            "StatusTypeID": 50,
            "LevelID": 2,
            "Amps": 32,
            "Voltage": 230,
            "PowerKW": 13,
            "CurrentTypeID": 20,
            "Quantity": 2
        }
    ],
    "NumberOfPoints": 2,
    "GeneralComments": "2 Tesla Connectors, up to 13kW.Available for patrons only. Please see front desk.",
    "StatusTypeID": 50,
    "DateLastStatusUpdate": "2020-08-24T09:11:00Z",
    "DataQualityLevel": 1,
    "DateCreated": "2017-03-27T05:26:00Z",
    "SubmissionStatusTypeID": 200
}