{
    "IsRecentlyVerified": false,
    "ID": 135550,
    "UUID": "B504BF73-C5FF-405E-9E3C-A0D78FDA4905",
    "DataProviderID": 18,
    "DataProvidersReference": "e9516d1499b5f4fc9b4587180971e8ea",
    "OperatorID": 8,
    "UsageTypeID": 5,
    "AddressInfo": {
        "ID": 135896,
        "Title": "Carriers Road",
        "AddressLine1": "Carriers Road",
        "Town": "Cranbrook",
        "Postcode": "TN17 3JN",
        "CountryID": 1,
        "Latitude": 51.022266,
        "Longitude": 0.006995,
        "AccessComments": "first 6 places on the right as you enter the car park",
        "RelatedURL": "https://www.bpchargemaster.com",
        "DistanceUnit": 0
    },
    "Connections": [
        {
            "ID": 189920,
            "ConnectionTypeID": 25,
            "Reference": "8944538523016180914",
            "StatusTypeID": 50,
            "LevelID": 2,
            "Amps": 32,
            "Voltage": 230,
            "PowerKW": 7,
            "CurrentTypeID": 10
        }
    ],
    "StatusTypeID": 0,
    "DateLastStatusUpdate": "2019-12-24T05:22:00Z",
    "MetadataValues": [
        {
            "ID": 5402,
            "MetadataFieldID": 4,
            "ItemValue": "Contains public sector information licensed under the Open Government Licence v2.0. http://www.nationalarchives.gov.uk/doc/open-government-licence/version/2/"
        }
    ],
    "DataQualityLevel": 3,
    "DateCreated": "2019-12-24T05:22:00Z",
    "SubmissionStatusTypeID": 100
}