{
    "IsRecentlyVerified": false,
    "ID": 149199,
    "UUID": "95906828-C020-49F7-B771-00875EC9EF88",
    "DataProviderID": 1,
    "OperatorID": 3,
    "OperatorsReference": "t54_it1_2419_047",
    "UsageTypeID": 4,
    "UsageCost": "£0.25/kWh",
    "AddressInfo": {
        "ID": 149552,
        "Title": "Lidl-Warstock Road",
        "AddressLine1": "Warstock Road",
        "Town": "Birmingham",
        "Postcode": "B14 4ST",
        "CountryID": 1,
        "Latitude": 52.414035,
        "Longitude": -1.883844,
        "DistanceUnit": 0
    },
    "Connections": [
        {
            "ID": 207173,
            "ConnectionTypeID": 1036,
            "StatusTypeID": 50,
            "LevelID": 3,
            "PowerKW": 43,
            "CurrentTypeID": 20,
            "Quantity": 3
        },
        {
            "ID": 218498,
            "ConnectionTypeID": 2,
            "StatusTypeID": 50,
            "LevelID": 3,
            "PowerKW": 50,
            "CurrentTypeID": 30,
            "Quantity": 1
        },
        {
            "ID": 218499,
            "ConnectionTypeID": 25,
            "StatusTypeID": 50,
            "LevelID": 2,
            "Amps": 32,
            "Voltage": 400,
            "PowerKW": 22,
            "CurrentTypeID": 20,
            "Quantity": 1
        },
        {
            "ID": 218500,
            "ConnectionTypeID": 33,
            "StatusTypeID": 50,
            "LevelID": 3,
            "PowerKW": 50,
            "CurrentTypeID": 30,
            "Quantity": 1
        }
    ],
    "NumberOfPoints": 3,
    "GeneralComments": "This is a Pod Point rapid charger installed at the Lidl super store at Warstock Road, Birmingham",
    "StatusTypeID": 50,
    "DateLastStatusUpdate": "2021-03-20T06:27:00Z",
    "DataQualityLevel": 1,
    "DateCreated": "2020-02-20T06:38:00Z",
    "SubmissionStatusTypeID": 200
}