{
    "IsRecentlyVerified": false,
    "ID": 151644,
    "UUID": "9CCED87C-841F-4891-89EA-2DDECBB8B828",
    "DataProviderID": 28,
    "DataProvidersReference": "FR*S38*P38052*A",
    "OperatorID": 3408,
    "UsageTypeID": 5,
    "AddressInfo": {
        "ID": 151997,
        "Title": "LE BOURG D OISANS_Rue Des Colporteurs",
        "AddressLine1": "Rue Des Colporteurs 38520 LE BOURG D OISANS",
        "CountryID": 80,
        "Latitude": 45.055493,
        "Longitude": 6.034235,
        "AccessComments": "24/24 7/7 jours",
        "DistanceUnit": 0
    },
    "Connections": [
        {
            "ID": 211868,
            "ConnectionTypeID": 2,
            "StatusTypeID": 50,
            "LevelID": 3,
            "PowerKW": 50,
            "CurrentTypeID": 30
        },
        {
            "ID": 243735,
            "ConnectionTypeID": 1036,
            "StatusTypeID": 50,
            "LevelID": 3,
            "PowerKW": 43,
            "CurrentTypeID": 20
        },
        {
            "ID": 243736,
            "ConnectionTypeID": 2,
            "StatusTypeID": 50,
            "LevelID": 3,
            "PowerKW": 50,
            "CurrentTypeID": 30
        }
    ],
    "GeneralComments": "",
    "StatusTypeID": 50,
    "DateLastStatusUpdate": "2020-08-27T05:12:00Z",
    "DataQualityLevel": 2,
    "DateCreated": "2020-03-15T10:53:00Z",
    "SubmissionStatusTypeID": 100
}