{
    "IsRecentlyVerified": false,
    "ID": 136688,
    "UUID": "0C97428E-38FA-4AF4-9611-1651C27669EC",
    "DataProviderID": 18,
    "DataProvidersReference": "67fd590c0ce05ca724b7436ced5e956d",
    "OperatorID": 3345,
    "UsageTypeID": 5,
    "AddressInfo": {
        "ID": 137034,
        "Title": "18 Centaur Road",
        "AddressLine1": "18 Centaur Road",
        "Town": "Coventry",
        "Postcode": "CV5 6LX",
        "CountryID": 1,
        "Latitude": 52.404971,
        "Longitude": -1.532322,
        "AccessComments": "EV Bay on Centaur Road, cnr Centaur Road & Sovereign Road",
        "RelatedURL": "https://char.gy",
        "DistanceUnit": 0
    },
    "Connections": [
        {
            "ID": 191227,
            "ConnectionTypeID": 25,
            "Reference": "100364",
            "StatusTypeID": 50,
            "LevelID": 2,
            "Amps": 16,
            "Voltage": 230,
            "PowerKW": 3.7,
            "CurrentTypeID": 10
        }
    ],
    "StatusTypeID": 0,
    "DateLastStatusUpdate": "2019-12-24T05:22:00Z",
    "MetadataValues": [
        {
            "ID": 6540,
            "MetadataFieldID": 4,
            "ItemValue": "Contains public sector information licensed under the Open Government Licence v2.0. http://www.nationalarchives.gov.uk/doc/open-government-licence/version/2/"
        }
    ],
    "DataQualityLevel": 3,
    "DateCreated": "2019-12-24T05:22:00Z",
    "SubmissionStatusTypeID": 100
}