{
    "UserComments": [
        {
            "ID": 22065,
            "ChargePointID": 147867,
            "CommentTypeID": 10,
            "UserName": "ForumElettrico.it",
            "RelatedURL": "https://www.forumelettrico.it/forum/stazione-gofast-wurenlos-a1-svizzera-t8768.html",
            "DateCreated": "2020-01-18T17:41:20.737Z",
            "User": {
                "ID": 11749,
                "Username": "ForumElettrico.it"
            },
            "CheckinStatusTypeID": 10,
            "IsActionedByEditor": false
        }
    ],
    "MediaItems": [
        {
            "ID": 21032,
            "ChargePointID": 147867,
            "ItemURL": "https://s3-ap-southeast-2.amazonaws.com/openchargemap/images/CH/OCM147867/OCM-147867.orig.2020011817413041.jpg",
            "ItemThumbnailURL": "https://s3-ap-southeast-2.amazonaws.com/openchargemap/images/CH/OCM147867/OCM-147867.thmb.2020011817413041.jpg",
            "Comment": "",
            "IsEnabled": true,
            "IsVideo": false,
            "IsFeaturedItem": false,
            "IsExternalResource": false,
            "User": {
                "ID": 11749,
                "Username": "ForumElettrico.it"
            },
            "DateCreated": "2020-01-18T17:42:00Z"
        },
        {
            "ID": 21033,
            "ChargePointID": 147867,
            "ItemURL": "https://s3-ap-southeast-2.amazonaws.com/openchargemap/images/CH/OCM147867/OCM-147867.orig.2020011817413707.jpg",
            "ItemThumbnailURL": "https://s3-ap-southeast-2.amazonaws.com/openchargemap/images/CH/OCM147867/OCM-147867.thmb.2020011817413707.jpg",
            "Comment": "",
            "IsEnabled": true,
            "IsVideo": false,
            "IsFeaturedItem": false,
            "IsExternalResource": false,
            "User": {
                "ID": 11749,
                "Username": "ForumElettrico.it"
            },
            "DateCreated": "2020-01-18T17:42:00Z"
        },
        {
            "ID": 21034,
            "ChargePointID": 147867,
            "ItemURL": "https://s3-ap-southeast-2.amazonaws.com/openchargemap/images/CH/OCM147867/OCM-147867.orig.2020011817414254.jpg",
            "ItemThumbnailURL": "https://s3-ap-southeast-2.amazonaws.com/openchargemap/images/CH/OCM147867/OCM-147867.thmb.2020011817414254.jpg",
            "Comment": "",
            "IsEnabled": true,
            "IsVideo": false,
            "IsFeaturedItem": false,
            "IsExternalResource": false,
            "User": {
                "ID": 11749,
                "Username": "ForumElettrico.it"
            },
            "DateCreated": "2020-01-18T17:42:00Z"
        }
    ],
    "IsRecentlyVerified": false,
    "ID": 147867,
    "UUID": "4C6EA5C6-5A18-49FB-B218-3F37C0CD4AE2",
    "DataProviderID": 1,
    "OperatorID": 1,
    "UsageTypeID": 1,
    "AddressInfo": {
        "ID": 148219,
        "Title": "GoFast Shopping-Raststätte",
        "AddressLine1": "A1 (verso Baden)",
        "Town": "Würenlos AG",
        "CountryID": 217,
        "Latitude": 47.439073,
        "Longitude": 8.348292,
        "RelatedURL": "https://www.forumelettrico.it/forum/stazione-gofast-wurenlos-a1-svizzera-t8768.html",
        "DistanceUnit": 0
    },
    "Connections": [
        {
            "ID": 205268,
            "ConnectionTypeID": 33,
            "LevelID": 2,
            "PowerKW": 300
        },
        {
            "ID": 205269,
            "ConnectionTypeID": 2,
            "LevelID": 2,
            "PowerKW": 60
        },
        {
            "ID": 205270,
            "ConnectionTypeID": 1036,
            "LevelID": 2,
            "PowerKW": 43
        },
        {
            "ID": 205271,
            "ConnectionTypeID": 25,
            "LevelID": 2,
            "PowerKW": 22
        }
    ],
    "NumberOfPoints": 7,
    "StatusTypeID": 50,
    "DateLastStatusUpdate": "2020-01-19T09:28:00Z",
    "DataQualityLevel": 1,
    "DateCreated": "2020-01-18T17:41:00Z",
    "SubmissionStatusTypeID": 200
}