{
    "IsRecentlyVerified": false,
    "ID": 52468,
    "UUID": "6817C047-2822-44BC-BAFE-8068312A8D57",
    "DataProviderID": 1,
    "OperatorID": 105,
    "UsageTypeID": 1,
    "AddressInfo": {
        "ID": 52814,
        "Title": "E-Bike Station Verbandsgemeinde-Verwaltung",
        "AddressLine1": "Nahestraße 63",
        "Town": "Rüdesheim",
        "Postcode": "55593",
        "CountryID": 87,
        "Latitude": 49.84548,
        "Longitude": 7.81628000000001,
        "RelatedURL": "http://www.rwe.com/web/cms/de/494436/e-bikes-on-tour/ladestationen/",
        "DistanceUnit": 0
    },
    "Connections": [
        {
            "ID": 65121,
            "ConnectionTypeID": 28,
            "StatusTypeID": 50,
            "LevelID": 1,
            "Amps": 10,
            "Voltage": 230,
            "PowerKW": 2.3,
            "CurrentTypeID": 10,
            "Quantity": 3
        }
    ],
    "NumberOfPoints": 3,
    "StatusTypeID": 50,
    "DateLastStatusUpdate": "2015-08-29T07:04:00Z",
    "DataQualityLevel": 1,
    "DateCreated": "2015-08-28T22:17:00Z",
    "SubmissionStatusTypeID": 200
}