{
    "MediaItems": [
        {
            "ID": 17582,
            "ChargePointID": 116963,
            "ItemURL": "https://s3-ap-southeast-2.amazonaws.com/openchargemap/images/IE/OCM116963/OCM-116963.orig.2019021510373335.jpg",
            "ItemThumbnailURL": "https://s3-ap-southeast-2.amazonaws.com/openchargemap/images/IE/OCM116963/OCM-116963.thmb.2019021510373335.jpg",
            "Comment": "",
            "IsEnabled": true,
            "IsVideo": false,
            "IsFeaturedItem": false,
            "IsExternalResource": false,
            "User": {
                "ID": 19946,
                "Username": "Guillaume"
            },
            "DateCreated": "2019-02-15T10:38:00Z"
        },
        {
            "ID": 17583,
            "ChargePointID": 116963,
            "ItemURL": "https://s3-ap-southeast-2.amazonaws.com/openchargemap/images/IE/OCM116963/OCM-116963.orig.2019021510374671.jpg",
            "ItemThumbnailURL": "https://s3-ap-southeast-2.amazonaws.com/openchargemap/images/IE/OCM116963/OCM-116963.thmb.2019021510374671.jpg",
            "Comment": "",
            "IsEnabled": true,
            "IsVideo": false,
            "IsFeaturedItem": false,
            "IsExternalResource": false,
            "User": {
                "ID": 19946,
                "Username": "Guillaume"
            },
            "DateCreated": "2019-02-15T10:38:00Z"
        }
    ],
    "IsRecentlyVerified": false,
    "ID": 116963,
    "UUID": "E0AA4CC2-F645-4CE2-966D-CF2727200162",
    "DataProviderID": 1,
    "OperatorID": 45,
    "UsageTypeID": 6,
    "UsageCost": "Free",
    "AddressInfo": {
        "ID": 117309,
        "Title": "North Main Street Car park",
        "AddressLine1": "North Main Street",
        "Town": "Cork",
        "StateOrProvince": "County Cork",
        "Postcode": "T12 WC93",
        "CountryID": 3,
        "Latitude": 51.90129350886568,
        "Longitude": -8.476768999872547,
        "AccessComments": "The North Main Street car park is open during the day, closed at night (check details in the link)",
        "RelatedURL": "http://sp1ral.corkcity.ie/services/roadstransportation/transportationdivision/parking/offstreetparking/multi-storeycarparks/northmainstreetcarpark/",
        "DistanceUnit": 0
    },
    "Connections": [
        {
            "ID": 165560,
            "ConnectionTypeID": 25,
            "StatusTypeID": 50,
            "LevelID": 2,
            "Amps": 16,
            "Voltage": 220,
            "PowerKW": 3,
            "CurrentTypeID": 10,
            "Quantity": 2
        }
    ],
    "NumberOfPoints": 2,
    "GeneralComments": "The chargers are on the first level when you enter the car park, at the very end (left side).",
    "StatusTypeID": 50,
    "DateLastStatusUpdate": "2019-02-15T12:24:00Z",
    "DataQualityLevel": 1,
    "DateCreated": "2019-02-15T10:37:00Z",
    "SubmissionStatusTypeID": 200
}