{
    "IsRecentlyVerified": false,
    "ID": 155299,
    "UUID": "29BE643B-DEE1-40AE-AC90-14A50556216B",
    "DataProviderID": 1,
    "OperatorID": 23,
    "OperatorsReference": "53299",
    "UsageTypeID": 4,
    "UsageCost": "$0.44/min >=60kW; $0.22/min <60kW; other tariffs for older cars",
    "AddressInfo": {
        "ID": 155653,
        "Title": "Kitchener, on Supercharger",
        "AddressLine1": "663 Victoria Street North",
        "Town": "Kitchener",
        "StateOrProvince": "ON",
        "Postcode": "N2H 5G3",
        "CountryID": 44,
        "Latitude": 43.461251,
        "Longitude": -80.472322,
        "DistanceUnit": 0
    },
    "Connections": [
        {
            "ID": 218627,
            "ConnectionTypeID": 27,
            "StatusTypeID": 50,
            "LevelID": 3,
            "PowerKW": 120,
            "CurrentTypeID": 30,
            "Quantity": 8
        }
    ],
    "NumberOfPoints": 8,
    "GeneralComments": "Charging8 Superchargers, available 24/7, up to 250kW",
    "StatusTypeID": 50,
    "DateLastStatusUpdate": "2021-01-04T13:31:00Z",
    "DataQualityLevel": 1,
    "DateCreated": "2020-04-05T09:01:00Z",
    "SubmissionStatusTypeID": 200
}