{
    "IsRecentlyVerified": false,
    "ID": 85235,
    "UUID": "6A3957AB-9CC4-4F68-9641-5582C30AAFF7",
    "DataProviderID": 1,
    "OperatorID": 5,
    "UsageTypeID": 1,
    "UsageCost": "Free",
    "AddressInfo": {
        "ID": 85581,
        "Title": "National Grid Hannaford",
        "AddressLine1": "777 Rogers Street",
        "Town": "Lowell",
        "StateOrProvince": "MA",
        "Postcode": "01852",
        "CountryID": 2,
        "Latitude": 42.6287659,
        "Longitude": -71.2782021,
        "DistanceUnit": 0
    },
    "Connections": [
        {
            "ID": 121028,
            "ConnectionTypeID": 32,
            "StatusTypeID": 50,
            "LevelID": 3,
            "PowerKW": 50,
            "CurrentTypeID": 30,
            "Quantity": 1
        },
        {
            "ID": 121029,
            "ConnectionTypeID": 2,
            "StatusTypeID": 50,
            "LevelID": 3,
            "PowerKW": 50,
            "CurrentTypeID": 30,
            "Quantity": 1
        }
    ],
    "NumberOfPoints": 1,
    "StatusTypeID": 50,
    "DateLastStatusUpdate": "2017-03-30T12:32:00Z",
    "DataQualityLevel": 1,
    "DateCreated": "2017-03-30T02:15:00Z",
    "SubmissionStatusTypeID": 200
}