{
    "IsRecentlyVerified": false,
    "ID": 79040,
    "UUID": "A7E7A01A-DD3F-4522-BB6F-9A3F3FD23A32",
    "DataProviderID": 1,
    "OperatorID": 23,
    "OperatorsReference": "13944",
    "UsageTypeID": 4,
    "UsageCost": "$0.44/min >=60kW; $0.22/min <60kW; other tariffs for older cars",
    "AddressInfo": {
        "ID": 79386,
        "Title": "Port Hope Supercharger",
        "AddressLine1": "6498 Telephone RD.",
        "Town": "Port Hope",
        "Postcode": "L1A3V6",
        "CountryID": 44,
        "Latitude": 43.971602,
        "Longitude": -78.285397,
        "DistanceUnit": 0
    },
    "Connections": [
        {
            "ID": 113659,
            "ConnectionTypeID": 27,
            "StatusTypeID": 50,
            "LevelID": 3,
            "PowerKW": 120,
            "CurrentTypeID": 30,
            "Quantity": 8
        }
    ],
    "NumberOfPoints": 8,
    "GeneralComments": "8 Superchargers, available 24/7",
    "StatusTypeID": 50,
    "DateLastStatusUpdate": "2021-01-04T13:37:00Z",
    "DataQualityLevel": 1,
    "DateCreated": "2017-01-26T19:11:00Z",
    "SubmissionStatusTypeID": 200
}