{
    "IsRecentlyVerified": false,
    "ID": 188303,
    "UUID": "DD7BADF4-E13B-4234-A7DA-3EED7E4C769D",
    "DataProviderID": 1,
    "OperatorID": 3371,
    "UsageTypeID": 4,
    "AddressInfo": {
        "ID": 188662,
        "Title": "Wenea Hotel el Acueducto",
        "AddressLine1": "Carretera de Santa Amalia a Ciudad Real",
        "Town": "Acedera",
        "StateOrProvince": "Extremadura",
        "Postcode": "",
        "CountryID": 210,
        "Latitude": 39.07746379924973,
        "Longitude": -5.5757468907850125,
        "ContactTelephone1": "915 060 600",
        "DistanceUnit": 0
    },
    "Connections": [
        {
            "ID": 303990,
            "ConnectionTypeID": 33,
            "StatusTypeID": 50,
            "LevelID": 3,
            "PowerKW": 80,
            "CurrentTypeID": 30,
            "Quantity": 1
        },
        {
            "ID": 303991,
            "ConnectionTypeID": 33,
            "StatusTypeID": 50,
            "LevelID": 3,
            "PowerKW": 50,
            "CurrentTypeID": 30,
            "Quantity": 1
        },
        {
            "ID": 303992,
            "ConnectionTypeID": 2,
            "StatusTypeID": 50,
            "LevelID": 3,
            "PowerKW": 50,
            "CurrentTypeID": 30,
            "Quantity": 1
        },
        {
            "ID": 303993,
            "ConnectionTypeID": 25,
            "StatusTypeID": 50,
            "LevelID": 2,
            "PowerKW": 22,
            "CurrentTypeID": 20,
            "Quantity": 1
        }
    ],
    "NumberOfPoints": 1,
    "StatusTypeID": 50,
    "DateLastStatusUpdate": "2021-07-17T18:22:00Z",
    "DataQualityLevel": 1,
    "DateCreated": "2021-07-17T14:14:00Z",
    "SubmissionStatusTypeID": 200
}