{
    "IsRecentlyVerified": false,
    "ID": 94318,
    "UUID": "5125BABF-100E-43CB-A357-C32FA86FA38F",
    "DataProviderID": 2,
    "DataProvidersReference": "87932",
    "OperatorID": 5,
    "UsageTypeID": 1,
    "AddressInfo": {
        "ID": 94664,
        "Title": "EVERGY",
        "AddressLine1": "520 NW Murray Rd @ John Knox Village",
        "Town": "Lees Summit",
        "StateOrProvince": "MO",
        "Postcode": "64081",
        "CountryID": 2,
        "Latitude": 38.9213008,
        "Longitude": -94.4040984,
        "ContactTelephone1": "888-758-4389",
        "AccessComments": "24 hours daily",
        "RelatedURL": "http://www.chargepoint.com/",
        "DistanceUnit": 0
    },
    "Connections": [
        {
            "ID": 133417,
            "ConnectionTypeID": 1,
            "LevelID": 2,
            "Amps": 16,
            "Voltage": 230,
            "PowerKW": 3.7,
            "CurrentTypeID": 10,
            "Quantity": 6
        }
    ],
    "DateLastStatusUpdate": "2020-06-26T03:00:00Z",
    "DataQualityLevel": 3,
    "DateCreated": "2017-10-19T02:06:00Z",
    "SubmissionStatusTypeID": 100
}