{
    "IsRecentlyVerified": false,
    "ID": 172344,
    "UUID": "98944C96-3132-431F-95CF-800BE811BA76",
    "DataProviderID": 1,
    "OperatorID": 3,
    "OperatorsReference": "t54_hu1_4020_013",
    "UsageTypeID": 4,
    "UsageCost": "£0.25/kWh",
    "AddressInfo": {
        "ID": 172703,
        "Title": "Lidl - Rowan Road",
        "AddressLine1": " 216 Rowan Road",
        "Town": "Mitcham",
        "StateOrProvince": "England",
        "Postcode": "SW16 5HX ",
        "CountryID": 1,
        "Latitude": 51.411724509612,
        "Longitude": -0.139830368833373,
        "RelatedURL": "https://pod-point.com/",
        "DistanceUnit": 0
    },
    "Connections": [
        {
            "ID": 263492,
            "ConnectionTypeID": 33,
            "StatusTypeID": 50,
            "LevelID": 3,
            "PowerKW": 50,
            "CurrentTypeID": 30,
            "Quantity": 1
        },
        {
            "ID": 263493,
            "ConnectionTypeID": 2,
            "StatusTypeID": 50,
            "LevelID": 3,
            "PowerKW": 50,
            "CurrentTypeID": 30,
            "Quantity": 1
        },
        {
            "ID": 263494,
            "ConnectionTypeID": 25,
            "StatusTypeID": 50,
            "LevelID": 2,
            "Amps": 32,
            "Voltage": 400,
            "PowerKW": 22,
            "CurrentTypeID": 20,
            "Quantity": 1
        }
    ],
    "NumberOfPoints": 1,
    "StatusTypeID": 50,
    "DateLastStatusUpdate": "2021-03-20T06:27:00Z",
    "DataQualityLevel": 1,
    "DateCreated": "2021-01-30T17:43:00Z",
    "SubmissionStatusTypeID": 200
}