{
    "IsRecentlyVerified": false,
    "ID": 119405,
    "UUID": "695B89D1-44E2-493B-B348-796393968E18",
    "DataProviderID": 2,
    "DataProvidersReference": "81297",
    "UsageTypeID": 1,
    "AddressInfo": {
        "ID": 119751,
        "Title": "Rainbow Drive-in",
        "AddressLine1": "3308 Kanaina Ave",
        "Town": "Honolulu",
        "StateOrProvince": "HI",
        "Postcode": "96815",
        "CountryID": 2,
        "Latitude": 21.27596,
        "Longitude": -157.81454,
        "ContactTelephone1": "808-737-0177",
        "AccessComments": "Parking lot hours; for customer use only",
        "RelatedURL": "",
        "DistanceUnit": 0
    },
    "Connections": [
        {
            "ID": 168663,
            "ConnectionTypeID": 1,
            "LevelID": 2,
            "Amps": 16,
            "Voltage": 230,
            "PowerKW": 3.7,
            "CurrentTypeID": 10,
            "Quantity": 1
        }
    ],
    "DateLastStatusUpdate": "2020-06-26T02:52:00Z",
    "DataQualityLevel": 3,
    "DateCreated": "2019-04-01T04:59:00Z",
    "SubmissionStatusTypeID": 100
}