{
    "UserComments": [
        {
            "ID": 14214,
            "ChargePointID": 71720,
            "CommentTypeID": 10,
            "UserName": "GUN-ZE1",
            "Rating": 4,
            "DateCreated": "2016-09-07T05:50:52.153Z",
            "User": {
                "ID": 9368,
                "Username": "GUN-ZE1"
            },
            "CheckinStatusTypeID": 10
        }
    ],
    "MediaItems": [
        {
            "ID": 8258,
            "ChargePointID": 71720,
            "ItemURL": "https://s3-ap-southeast-2.amazonaws.com/openchargemap/images/DE/OCM71720/OCM-71720.orig.2016090705522133.jpg",
            "ItemThumbnailURL": "https://s3-ap-southeast-2.amazonaws.com/openchargemap/images/DE/OCM71720/OCM-71720.thmb.2016090705522133.jpg",
            "Comment": "",
            "IsEnabled": true,
            "IsVideo": false,
            "IsFeaturedItem": false,
            "IsExternalResource": false,
            "User": {
                "ID": 9368,
                "Username": "GUN-ZE1"
            },
            "DateCreated": "2016-09-07T05:53:00Z"
        },
        {
            "ID": 8259,
            "ChargePointID": 71720,
            "ItemURL": "https://s3-ap-southeast-2.amazonaws.com/openchargemap/images/DE/OCM71720/OCM-71720.orig.2016090705523420.jpg",
            "ItemThumbnailURL": "https://s3-ap-southeast-2.amazonaws.com/openchargemap/images/DE/OCM71720/OCM-71720.thmb.2016090705523420.jpg",
            "Comment": "",
            "IsEnabled": true,
            "IsVideo": false,
            "IsFeaturedItem": false,
            "IsExternalResource": false,
            "User": {
                "ID": 9368,
                "Username": "GUN-ZE1"
            },
            "DateCreated": "2016-09-07T05:53:00Z"
        },
        {
            "ID": 8260,
            "ChargePointID": 71720,
            "ItemURL": "https://s3-ap-southeast-2.amazonaws.com/openchargemap/images/DE/OCM71720/OCM-71720.orig.2016090705524812.jpg",
            "ItemThumbnailURL": "https://s3-ap-southeast-2.amazonaws.com/openchargemap/images/DE/OCM71720/OCM-71720.thmb.2016090705524812.jpg",
            "Comment": "",
            "IsEnabled": true,
            "IsVideo": false,
            "IsFeaturedItem": false,
            "IsExternalResource": false,
            "User": {
                "ID": 9368,
                "Username": "GUN-ZE1"
            },
            "DateCreated": "2016-09-07T05:53:00Z"
        },
        {
            "ID": 8256,
            "ChargePointID": 71720,
            "ItemURL": "https://s3-ap-southeast-2.amazonaws.com/openchargemap/images/DE/OCM71720/OCM-71720.orig.2016090705513331.jpg",
            "ItemThumbnailURL": "https://s3-ap-southeast-2.amazonaws.com/openchargemap/images/DE/OCM71720/OCM-71720.thmb.2016090705513331.jpg",
            "Comment": "",
            "IsEnabled": true,
            "IsVideo": false,
            "IsFeaturedItem": false,
            "IsExternalResource": false,
            "User": {
                "ID": 9368,
                "Username": "GUN-ZE1"
            },
            "DateCreated": "2016-09-07T05:52:00Z"
        },
        {
            "ID": 8257,
            "ChargePointID": 71720,
            "ItemURL": "https://s3-ap-southeast-2.amazonaws.com/openchargemap/images/DE/OCM71720/OCM-71720.orig.2016090705520713.jpg",
            "ItemThumbnailURL": "https://s3-ap-southeast-2.amazonaws.com/openchargemap/images/DE/OCM71720/OCM-71720.thmb.2016090705520713.jpg",
            "Comment": "",
            "IsEnabled": true,
            "IsVideo": false,
            "IsFeaturedItem": false,
            "IsExternalResource": false,
            "User": {
                "ID": 9368,
                "Username": "GUN-ZE1"
            },
            "DateCreated": "2016-09-07T05:52:00Z"
        }
    ],
    "IsRecentlyVerified": false,
    "ID": 71720,
    "UUID": "4C9A659E-DA24-4603-A5C1-198982760E62",
    "DataProviderID": 1,
    "OperatorID": 234,
    "UsageTypeID": 4,
    "AddressInfo": {
        "ID": 72066,
        "Title": "N-Ergie-Ladesäule Gemeindehaus Merkendorf",
        "AddressLine1": "Schulstraße 6",
        "Town": "Merkendorf",
        "StateOrProvince": "Landkreis Ansbach",
        "Postcode": "91732",
        "CountryID": 87,
        "Latitude": 49.20479537742018,
        "Longitude": 10.700971348410139,
        "ContactTelephone1": "+49 911 80201",
        "ContactEmail": "elektromobilitaet@n-ergie.de",
        "AccessComments": "24/7 nutzbar.",
        "RelatedURL": "http://n-ergie.de",
        "DistanceUnit": 0
    },
    "Connections": [
        {
            "ID": 102725,
            "ConnectionTypeID": 25,
            "StatusTypeID": 50,
            "LevelID": 2,
            "Amps": 32,
            "Voltage": 400,
            "PowerKW": 22,
            "CurrentTypeID": 20,
            "Quantity": 2
        }
    ],
    "NumberOfPoints": 2,
    "GeneralComments": "Zufahrt etwas versteckt beim Gemeindehaus an der Kirche.",
    "StatusTypeID": 50,
    "DateLastStatusUpdate": "2016-09-07T05:53:00Z",
    "DataQualityLevel": 1,
    "DateCreated": "2016-09-05T07:30:00Z",
    "SubmissionStatusTypeID": 200
}