{
    "IsRecentlyVerified": false,
    "ID": 181586,
    "UUID": "8CCA0D78-D032-4541-BD8A-CDDF6E34EB48",
    "DataProviderID": 29,
    "DataProvidersReference": "15990",
    "AddressInfo": {
        "ID": 181945,
        "Title": "Kietz 9",
        "AddressLine1": "Kietz 9",
        "Town": "Lunow-Stolzenhagen",
        "Postcode": "16248",
        "CountryID": 87,
        "Latitude": 52.948939,
        "Longitude": 14.108532,
        "DistanceUnit": 0
    },
    "Connections": [
        {
            "ID": 286128,
            "ConnectionTypeID": 25,
            "StatusTypeID": 50,
            "LevelID": 2,
            "PowerKW": 22,
            "CurrentTypeID": 20
        },
        {
            "ID": 286129,
            "ConnectionTypeID": 25,
            "StatusTypeID": 50,
            "LevelID": 2,
            "PowerKW": 22,
            "CurrentTypeID": 20
        }
    ],
    "StatusTypeID": 50,
    "DateLastStatusUpdate": "2021-07-12T02:50:00Z",
    "MetadataValues": [
        {
            "ID": 13880,
            "MetadataFieldID": 4,
            "ItemValue": "Data from the German chargepoint registry provided by Bundesnetzagentur.de under the CC-BY 4.0 license"
        }
    ],
    "DataQualityLevel": 3,
    "DateCreated": "2021-07-08T10:02:00Z",
    "SubmissionStatusTypeID": 100
}