{
    "IsRecentlyVerified": false,
    "ID": 186055,
    "UUID": "93BB5B2E-B3D6-4093-9627-FA66FD5F78B6",
    "DataProviderID": 29,
    "DataProvidersReference": "3327",
    "OperatorID": 45,
    "AddressInfo": {
        "ID": 186414,
        "Title": "Karl-von-Drais-Str. 6-9",
        "AddressLine1": "Karl-von-Drais-Str. 6-9",
        "Town": "Frankfurt",
        "Postcode": "60435",
        "CountryID": 87,
        "Latitude": 50.149791,
        "Longitude": 8.677948,
        "DistanceUnit": 0
    },
    "Connections": [
        {
            "ID": 297607,
            "ConnectionTypeID": 25,
            "StatusTypeID": 50,
            "LevelID": 2,
            "PowerKW": 22,
            "CurrentTypeID": 20
        },
        {
            "ID": 297608,
            "ConnectionTypeID": 25,
            "StatusTypeID": 50,
            "LevelID": 2,
            "PowerKW": 22,
            "CurrentTypeID": 20
        }
    ],
    "StatusTypeID": 50,
    "DateLastStatusUpdate": "2021-07-12T02:44:00Z",
    "MetadataValues": [
        {
            "ID": 18297,
            "MetadataFieldID": 4,
            "ItemValue": "Data from the German chargepoint registry provided by Bundesnetzagentur.de under the CC-BY 4.0 license"
        }
    ],
    "DataQualityLevel": 3,
    "DateCreated": "2021-07-12T02:44:00Z",
    "SubmissionStatusTypeID": 100
}