{
    "IsRecentlyVerified": false,
    "ID": 16925,
    "UUID": "0D4FB142-5F35-4235-AEDF-C822865170CC",
    "DataProviderID": 22,
    "DataProvidersReference": "5075DC36E6FB5B2F19A38AC28D8A7FCA",
    "AddressInfo": {
        "ID": 17270,
        "Title": "宮城三菱多賀城店",
        "AddressLine1": "宮城県多賀城市明月1ｰ61ｰ1",
        "CountryID": 114,
        "Latitude": 38.28577559,
        "Longitude": 141.0108006,
        "ContactTelephone1": "022-366-3101",
        "DistanceUnit": 0
    },
    "Connections": [
        {
            "ID": 17166,
            "ConnectionTypeID": 2,
            "LevelID": 2,
            "Amps": 100,
            "Voltage": 480,
            "PowerKW": 48,
            "Quantity": 1
        }
    ],
    "DateLastStatusUpdate": "2013-06-29T08:51:00Z",
    "DataQualityLevel": 2,
    "DateCreated": "2013-06-29T08:51:00Z",
    "SubmissionStatusTypeID": 200
}