{
    "IsRecentlyVerified": false,
    "ID": 170465,
    "UUID": "101D1463-70F6-485B-A25B-95CDCF0371F9",
    "DataProviderID": 1,
    "OperatorID": 3327,
    "UsageTypeID": 4,
    "AddressInfo": {
        "ID": 170824,
        "Title": "BECHARGE Capena Tiberina",
        "AddressLine1": "Via Tiberina, 34",
        "Town": "Capena",
        "StateOrProvince": "RM",
        "Postcode": "00060",
        "CountryID": 112,
        "Latitude": 42.115039411298994,
        "Longitude": 12.586899360845223,
        "ContactTelephone1": "02-49527730",
        "ContactEmail": "emobility@buildingenergy.it",
        "RelatedURL": "https://www.bec.energy/",
        "DistanceUnit": 0
    },
    "Connections": [
        {
            "ID": 260118,
            "ConnectionTypeID": 25,
            "StatusTypeID": 50,
            "LevelID": 2,
            "Amps": 32,
            "Voltage": 400,
            "PowerKW": 22,
            "CurrentTypeID": 20,
            "Quantity": 4
        }
    ],
    "NumberOfPoints": 4,
    "StatusTypeID": 50,
    "DateLastStatusUpdate": "2020-11-27T15:10:00Z",
    "DataQualityLevel": 1,
    "DateCreated": "2020-11-27T15:10:00Z",
    "SubmissionStatusTypeID": 200
}