{
    "IsRecentlyVerified": false,
    "ID": 159416,
    "UUID": "17C6414A-9F9D-4C23-BAE9-F39097D3FBFD",
    "DataProviderID": 2,
    "DataProvidersReference": "152204",
    "OperatorID": 3293,
    "UsageTypeID": 1,
    "AddressInfo": {
        "ID": 159773,
        "Title": "White Marsh Mall - East Entrance",
        "AddressLine1": "8200 Perry Hall Blvd",
        "Town": "Baltimore",
        "StateOrProvince": "MD",
        "Postcode": "21236",
        "CountryID": 2,
        "Latitude": 39.374985,
        "Longitude": -76.466179,
        "ContactTelephone1": "888-264-2208",
        "AccessComments": "6am-12pm daily",
        "RelatedURL": "https://voltacharging.com/",
        "DistanceUnit": 0
    },
    "Connections": [
        {
            "ID": 229589,
            "ConnectionTypeID": 1,
            "LevelID": 2,
            "Amps": 16,
            "Voltage": 230,
            "PowerKW": 3.7,
            "CurrentTypeID": 10,
            "Quantity": 2
        }
    ],
    "StatusTypeID": 50,
    "DateLastStatusUpdate": "2020-06-26T03:01:00Z",
    "DataQualityLevel": 3,
    "DateCreated": "2020-06-26T03:01:00Z",
    "SubmissionStatusTypeID": 100
}