{
    "UserComments": [
        {
            "ID": 22447,
            "ChargePointID": 155541,
            "CommentTypeID": 10,
            "UserName": "ForumElettrico.it",
            "Comment": "Immediatamente visibile sulla Strada Statale 30, che attraversa il paese. Leggi la recensione qui > https://www.forumelettrico.it/forum/colonnina-enel-x-22-kw-montechiaro-piana-al-via-nazionale-47-t6997.html",
            "RelatedURL": "https://www.forumelettrico.it/forum/colonnina-enel-x-22-kw-montechiaro-piana-al-via-nazionale-47-t6997.html",
            "DateCreated": "2020-04-17T06:31:54.02Z",
            "User": {
                "ID": 11749,
                "Username": "ForumElettrico.it"
            },
            "CheckinStatusTypeID": 140,
            "IsActionedByEditor": false
        }
    ],
    "MediaItems": [
        {
            "ID": 21977,
            "ChargePointID": 155541,
            "ItemURL": "https://s3-ap-southeast-2.amazonaws.com/openchargemap/images/IT/OCM155541/OCM-155541.orig.2020041706320387.jpg",
            "ItemThumbnailURL": "https://s3-ap-southeast-2.amazonaws.com/openchargemap/images/IT/OCM155541/OCM-155541.thmb.2020041706320387.jpg",
            "Comment": "",
            "IsEnabled": true,
            "IsVideo": false,
            "IsFeaturedItem": false,
            "IsExternalResource": false,
            "User": {
                "ID": 11749,
                "Username": "ForumElettrico.it"
            },
            "DateCreated": "2020-04-17T06:32:00Z"
        },
        {
            "ID": 21978,
            "ChargePointID": 155541,
            "ItemURL": "https://s3-ap-southeast-2.amazonaws.com/openchargemap/images/IT/OCM155541/OCM-155541.orig.2020041706321034.jpg",
            "ItemThumbnailURL": "https://s3-ap-southeast-2.amazonaws.com/openchargemap/images/IT/OCM155541/OCM-155541.thmb.2020041706321034.jpg",
            "Comment": "",
            "IsEnabled": true,
            "IsVideo": false,
            "IsFeaturedItem": false,
            "IsExternalResource": false,
            "User": {
                "ID": 11749,
                "Username": "ForumElettrico.it"
            },
            "DateCreated": "2020-04-17T06:32:00Z"
        },
        {
            "ID": 21979,
            "ChargePointID": 155541,
            "ItemURL": "https://s3-ap-southeast-2.amazonaws.com/openchargemap/images/IT/OCM155541/OCM-155541.orig.2020041706321768.jpg",
            "ItemThumbnailURL": "https://s3-ap-southeast-2.amazonaws.com/openchargemap/images/IT/OCM155541/OCM-155541.thmb.2020041706321768.jpg",
            "Comment": "",
            "IsEnabled": true,
            "IsVideo": false,
            "IsFeaturedItem": false,
            "IsExternalResource": false,
            "User": {
                "ID": 11749,
                "Username": "ForumElettrico.it"
            },
            "DateCreated": "2020-04-17T06:32:00Z"
        },
        {
            "ID": 21980,
            "ChargePointID": 155541,
            "ItemURL": "https://s3-ap-southeast-2.amazonaws.com/openchargemap/images/IT/OCM155541/OCM-155541.orig.2020041706322351.jpg",
            "ItemThumbnailURL": "https://s3-ap-southeast-2.amazonaws.com/openchargemap/images/IT/OCM155541/OCM-155541.thmb.2020041706322351.jpg",
            "Comment": "",
            "IsEnabled": true,
            "IsVideo": false,
            "IsFeaturedItem": false,
            "IsExternalResource": false,
            "User": {
                "ID": 11749,
                "Username": "ForumElettrico.it"
            },
            "DateCreated": "2020-04-17T06:32:00Z"
        }
    ],
    "IsRecentlyVerified": false,
    "ID": 155541,
    "UUID": "4A865A70-2E9B-43E6-96E9-E794FFDF4C6B",
    "DataProviderID": 1,
    "OperatorID": 80,
    "UsageTypeID": 4,
    "AddressInfo": {
        "ID": 155895,
        "Title": "Montechiaro d'Acqui Piana | EnelX",
        "AddressLine1": "Via Nazionale 47",
        "AddressLine2": "Montechiaro Piana",
        "Town": "Montechiaro d'Acqui",
        "StateOrProvince": "AL",
        "Postcode": "15010",
        "CountryID": 112,
        "Latitude": 44.600802,
        "Longitude": 8.353469,
        "RelatedURL": "https://www.forumelettrico.it/forum/colonnina-enel-x-22-kw-montechiaro-piana-al-via-nazionale-47-t6997.html",
        "DistanceUnit": 0
    },
    "Connections": [
        {
            "ID": 218963,
            "ConnectionTypeID": 25,
            "StatusTypeID": 150,
            "LevelID": 2,
            "Amps": 32,
            "Voltage": 400,
            "PowerKW": 22,
            "CurrentTypeID": 20,
            "Quantity": 2
        }
    ],
    "NumberOfPoints": 2,
    "StatusTypeID": 150,
    "DateLastStatusUpdate": "2020-04-23T14:17:00Z",
    "DataQualityLevel": 1,
    "DateCreated": "2020-04-17T06:32:00Z",
    "SubmissionStatusTypeID": 200
}