{
    "IsRecentlyVerified": false,
    "ID": 89349,
    "UUID": "240B72FC-8B28-47DD-8D20-0027F5BC3D63",
    "DataProviderID": 2,
    "DataProvidersReference": "68004",
    "UsageTypeID": 2,
    "AddressInfo": {
        "ID": 89695,
        "Title": "SAS Institute Inc",
        "AddressLine1": "801 SAS Campus Dr",
        "Town": "Cary",
        "StateOrProvince": "NC",
        "Postcode": "27513",
        "CountryID": 2,
        "Latitude": 35.82111,
        "Longitude": -78.749317,
        "ContactTelephone1": "",
        "AccessComments": "Employee and guest use only",
        "RelatedURL": "",
        "DistanceUnit": 0
    },
    "Connections": [
        {
            "ID": 126734,
            "ConnectionTypeID": 1,
            "LevelID": 2,
            "Amps": 16,
            "Voltage": 230,
            "PowerKW": 3,
            "CurrentTypeID": 10,
            "Quantity": 6
        }
    ],
    "DateLastStatusUpdate": "2019-04-06T04:02:00Z",
    "DataQualityLevel": 3,
    "DateCreated": "2017-06-22T08:16:00Z",
    "SubmissionStatusTypeID": 100
}