{
    "IsRecentlyVerified": false,
    "ID": 101433,
    "UUID": "B497796E-4AC7-4127-8633-AE03541454D6",
    "DataProviderID": 1,
    "OperatorID": 1,
    "UsageTypeID": 4,
    "AddressInfo": {
        "ID": 101779,
        "Title": "Frank Kien GmbH",
        "AddressLine1": "Kirchhellener Straße 251B",
        "Town": "Bottrop",
        "StateOrProvince": "Bottrop",
        "Postcode": "46240",
        "CountryID": 87,
        "Latitude": 51.5428705712693,
        "Longitude": 6.91747863061903,
        "ContactTelephone1": "+4989248837755",
        "AccessComments": "24/7 nutzbar mit Ladekarte EinfachStromLaden oder NewMotion. Betreiber ist Digital Energy Solutions.",
        "RelatedURL": "https://www.digital-energysolutions.de",
        "DistanceUnit": 0
    },
    "Connections": [
        {
            "ID": 143222,
            "ConnectionTypeID": 25,
            "StatusTypeID": 50,
            "LevelID": 2,
            "Amps": 32,
            "Voltage": 400,
            "PowerKW": 22,
            "CurrentTypeID": 20,
            "Quantity": 2
        }
    ],
    "NumberOfPoints": 2,
    "StatusTypeID": 50,
    "DateLastStatusUpdate": "2018-03-28T11:25:00Z",
    "DataQualityLevel": 1,
    "DateCreated": "2018-03-28T11:23:00Z",
    "SubmissionStatusTypeID": 200
}