{
    "IsRecentlyVerified": false,
    "ID": 45582,
    "UUID": "B9E50A64-6666-48D8-A964-1B9D0FA543F0",
    "DataProviderID": 1,
    "DataProvidersReference": "2401",
    "AddressInfo": {
        "ID": 45928,
        "Title": "Din Bil Malmö",
        "AddressLine1": "Kabingatan 1",
        "Town": "MALMÖ",
        "StateOrProvince": "SKÅNE",
        "Postcode": "21239",
        "CountryID": 216,
        "Latitude": 55.604,
        "Longitude": 13.06542,
        "AccessComments": "Utanför entrén till anläggningen",
        "DistanceUnit": 0
    },
    "Connections": [
        {
            "ID": 56245,
            "ConnectionTypeID": 0,
            "Reference": "1",
            "LevelID": 2,
            "Amps": 50,
            "Voltage": 500,
            "PowerKW": 20,
            "Comments": "Mode 4"
        },
        {
            "ID": 87743,
            "ConnectionTypeID": 0,
            "Reference": "2",
            "LevelID": 2,
            "Amps": 32,
            "Voltage": 230,
            "PowerKW": 7.4,
            "Comments": "Mode 3"
        }
    ],
    "NumberOfPoints": 2,
    "DateLastStatusUpdate": "2020-05-26T08:21:00Z",
    "DataQualityLevel": 2,
    "DateCreated": "2015-05-03T00:54:00Z",
    "SubmissionStatusTypeID": 100
}