{
    "IsRecentlyVerified": false,
    "ID": 160092,
    "UUID": "E5F9C84C-B52A-48B1-847B-2B4994629156",
    "DataProviderID": 2,
    "DataProvidersReference": "153219",
    "OperatorID": 5,
    "UsageTypeID": 1,
    "AddressInfo": {
        "ID": 160449,
        "Title": "GRHD",
        "AddressLine1": "2977 Corporate Grove Dr",
        "Town": "Hudsonville",
        "StateOrProvince": "MI",
        "Postcode": "49426",
        "CountryID": 2,
        "Latitude": 42.847847,
        "Longitude": -85.85757,
        "ContactTelephone1": "888-758-4389",
        "AccessComments": "24 hours daily",
        "RelatedURL": "http://www.chargepoint.com/",
        "DistanceUnit": 0
    },
    "Connections": [
        {
            "ID": 230330,
            "ConnectionTypeID": 32,
            "LevelID": 3,
            "Amps": 100,
            "Voltage": 400,
            "PowerKW": 40,
            "CurrentTypeID": 30,
            "Quantity": 1
        }
    ],
    "StatusTypeID": 50,
    "DateLastStatusUpdate": "2020-06-26T03:06:00Z",
    "DataQualityLevel": 3,
    "DateCreated": "2020-06-26T03:06:00Z",
    "SubmissionStatusTypeID": 100
}