{
    "IsRecentlyVerified": false,
    "ID": 152499,
    "UUID": "EA6E4EBE-9377-4F2B-AE3B-822BD9C270E7",
    "DataProviderID": 28,
    "DataProvidersReference": "FR*S58*P58218*A",
    "UsageTypeID": 5,
    "AddressInfo": {
        "ID": 152852,
        "Title": "PREMERY_Place du Champ de Foire",
        "AddressLine1": "Place du Champ de Foire 58700 PREMERY",
        "CountryID": 80,
        "Latitude": 47.17272712,
        "Longitude": 3.33184272,
        "AccessComments": "24/24 7/7 jours",
        "DistanceUnit": 0
    },
    "Connections": [
        {
            "ID": 213509,
            "ConnectionTypeID": 28,
            "StatusTypeID": 50,
            "LevelID": 2,
            "PowerKW": 22,
            "CurrentTypeID": 10
        },
        {
            "ID": 213510,
            "ConnectionTypeID": 1036,
            "StatusTypeID": 50,
            "LevelID": 2,
            "PowerKW": 22,
            "CurrentTypeID": 20
        },
        {
            "ID": 246521,
            "ConnectionTypeID": 28,
            "StatusTypeID": 50,
            "LevelID": 2,
            "PowerKW": 22,
            "CurrentTypeID": 10
        },
        {
            "ID": 246522,
            "ConnectionTypeID": 1036,
            "StatusTypeID": 50,
            "LevelID": 2,
            "PowerKW": 22,
            "CurrentTypeID": 20
        }
    ],
    "GeneralComments": "",
    "StatusTypeID": 50,
    "DateLastStatusUpdate": "2020-08-27T05:13:00Z",
    "DataQualityLevel": 2,
    "DateCreated": "2020-03-15T10:53:00Z",
    "SubmissionStatusTypeID": 100
}