{
    "IsRecentlyVerified": false,
    "ID": 163994,
    "UUID": "040E8080-A9C2-4A64-B823-DA0C1788D4FB",
    "DataProviderID": 1,
    "OperatorID": 23,
    "OperatorsReference": "44580",
    "UsageTypeID": 4,
    "AddressInfo": {
        "ID": 164353,
        "Title": "Casa Rural Mas Roselló",
        "AddressLine1": "Cami Mas Palli",
        "Town": "7",
        "StateOrProvince": "Calonge",
        "Postcode": "17251",
        "CountryID": 210,
        "Latitude": 41.84603,
        "Longitude": 3.070962,
        "ContactTelephone1": "+34 972 652 452",
        "DistanceUnit": 0
    },
    "Connections": [
        {
            "ID": 235592,
            "ConnectionTypeID": 30,
            "StatusTypeID": 50,
            "LevelID": 2,
            "PowerKW": 9,
            "CurrentTypeID": 20,
            "Quantity": 1
        }
    ],
    "NumberOfPoints": 1,
    "GeneralComments": "1 Tesla Connector, up to 9kW.Available for customers. Please see front desk.",
    "StatusTypeID": 50,
    "DateLastStatusUpdate": "2020-08-24T23:51:00Z",
    "DataQualityLevel": 1,
    "DateCreated": "2020-08-24T23:51:00Z",
    "SubmissionStatusTypeID": 200
}