{
    "IsRecentlyVerified": false,
    "ID": 149523,
    "UUID": "FCA0AF63-FD3B-4D22-9E60-43E384CD4339",
    "DataProviderID": 1,
    "OperatorID": 38,
    "UsageTypeID": 4,
    "UsageCost": "0,25e/kWh",
    "AddressInfo": {
        "ID": 149876,
        "Title": "secto Vaihtoautot",
        "AddressLine1": "Olarinluoma 19",
        "Town": "Espoo",
        "StateOrProvince": "Southern Finland",
        "Postcode": "02220",
        "CountryID": 79,
        "Latitude": 60.180721593479234,
        "Longitude": 24.76004676269622,
        "RelatedURL": "http://www.virta.fi",
        "DistanceUnit": 0
    },
    "Connections": [
        {
            "ID": 207599,
            "ConnectionTypeID": 25,
            "StatusTypeID": 50,
            "LevelID": 2,
            "Amps": 32,
            "Voltage": 400,
            "PowerKW": 22,
            "CurrentTypeID": 20,
            "Quantity": 2
        }
    ],
    "NumberOfPoints": 2,
    "StatusTypeID": 50,
    "DateLastStatusUpdate": "2020-02-27T16:21:00Z",
    "DataQualityLevel": 1,
    "DateCreated": "2020-02-27T15:15:00Z",
    "SubmissionStatusTypeID": 200
}