{
    "IsRecentlyVerified": false,
    "ID": 170999,
    "UUID": "30C413F7-4A55-4243-998A-982C4B129D0A",
    "DataProviderID": 1,
    "OperatorID": 3327,
    "UsageTypeID": 4,
    "AddressInfo": {
        "ID": 171358,
        "Title": "BECHARGE Gangi Rimembranze",
        "AddressLine1": "Viale delle Rimembranze",
        "Town": "Gangi",
        "StateOrProvince": "PA",
        "Postcode": "90024",
        "CountryID": 112,
        "Latitude": 37.79815365989124,
        "Longitude": 14.207066675948681,
        "ContactTelephone1": "02-49527730",
        "ContactEmail": "emobility@buildingenergy.it",
        "RelatedURL": "https://www.bec.energy/",
        "DistanceUnit": 0
    },
    "Connections": [
        {
            "ID": 261259,
            "ConnectionTypeID": 25,
            "StatusTypeID": 50,
            "LevelID": 2,
            "Amps": 32,
            "Voltage": 400,
            "PowerKW": 22,
            "CurrentTypeID": 20,
            "Quantity": 2
        }
    ],
    "NumberOfPoints": 2,
    "StatusTypeID": 50,
    "DateLastStatusUpdate": "2020-12-16T15:21:00Z",
    "DataQualityLevel": 1,
    "DateCreated": "2020-12-16T15:21:00Z",
    "SubmissionStatusTypeID": 200
}