{
    "IsRecentlyVerified": false,
    "ID": 182744,
    "UUID": "32CC46FA-DC25-49EA-AA6C-AFAFEB924B0F",
    "DataProviderID": 29,
    "DataProvidersReference": "13718",
    "OperatorID": 45,
    "AddressInfo": {
        "ID": 183103,
        "Title": "Schongauer Str 29-31",
        "AddressLine1": "Schongauer Str 29-31",
        "Town": "Leipzig",
        "Postcode": "04328",
        "CountryID": 87,
        "Latitude": 51.348367,
        "Longitude": 12.471781,
        "DistanceUnit": 0
    },
    "Connections": [
        {
            "ID": 288864,
            "ConnectionTypeID": 25,
            "StatusTypeID": 50,
            "LevelID": 2,
            "PowerKW": 22,
            "CurrentTypeID": 20
        },
        {
            "ID": 288865,
            "ConnectionTypeID": 25,
            "StatusTypeID": 50,
            "LevelID": 2,
            "PowerKW": 22,
            "CurrentTypeID": 20
        }
    ],
    "StatusTypeID": 50,
    "DateLastStatusUpdate": "2021-07-12T02:47:00Z",
    "MetadataValues": [
        {
            "ID": 15037,
            "MetadataFieldID": 4,
            "ItemValue": "Data from the German chargepoint registry provided by Bundesnetzagentur.de under the CC-BY 4.0 license"
        }
    ],
    "DataQualityLevel": 3,
    "DateCreated": "2021-07-08T10:03:00Z",
    "SubmissionStatusTypeID": 100
}