{
    "MediaItems": [
        {
            "ID": 9336,
            "ChargePointID": 64603,
            "ItemURL": "https://s3-ap-southeast-2.amazonaws.com/openchargemap/images/ES/OCM64603/OCM-64603.orig.2017012709525727.jpg",
            "ItemThumbnailURL": "https://s3-ap-southeast-2.amazonaws.com/openchargemap/images/ES/OCM64603/OCM-64603.thmb.2017012709525727.jpg",
            "Comment": "",
            "IsEnabled": true,
            "IsVideo": false,
            "IsFeaturedItem": false,
            "IsExternalResource": false,
            "User": {
                "ID": 9094,
                "Username": "etecnic_me"
            },
            "DateCreated": "2017-01-27T09:53:00Z"
        },
        {
            "ID": 6074,
            "ChargePointID": 64603,
            "ItemURL": "https://s3-ap-southeast-2.amazonaws.com/openchargemap/images/ES/OCM64603/OCM-64603.orig.2016031412054624.jpg",
            "ItemThumbnailURL": "https://s3-ap-southeast-2.amazonaws.com/openchargemap/images/ES/OCM64603/OCM-64603.thmb.2016031412054624.jpg",
            "Comment": "",
            "IsEnabled": true,
            "IsVideo": false,
            "IsFeaturedItem": false,
            "IsExternalResource": false,
            "User": {
                "ID": 9094,
                "Username": "etecnic_me"
            },
            "DateCreated": "2016-03-14T12:06:00Z"
        }
    ],
    "IsRecentlyVerified": false,
    "ID": 64603,
    "UUID": "DC08B327-0E3A-41E1-A63A-E1DF1C1247B3",
    "DataProviderID": 1,
    "OperatorID": 45,
    "UsageTypeID": 4,
    "UsageCost": "Mas información en el camping.",
    "AddressInfo": {
        "ID": 64949,
        "Title": "Camping Aquarius",
        "AddressLine1": "Carrer cami vell a Sant Pere Pescador",
        "Town": "Sant Pere Pescador",
        "StateOrProvince": "Girona",
        "Postcode": "17470",
        "CountryID": 210,
        "Latitude": 42.177439,
        "Longitude": 3.107979,
        "ContactTelephone1": "0034 972 52 00 03",
        "ContactEmail": "info@aquarius.es",
        "AccessComments": "EN: To use these charging points you need an RFID card provided by Aquarius camping. You can get this card at Aquarius camping reception. Once the user gets Aquarius camping card, can enable the system.\r\nES: Para poder utilizar estos puntos, hay que disponer de una tarjeta RFID que emite el propio camping Aquarius. Todos aquellos que lo deseen, pueden adquirir la tarjeta en la recepción del camping. Una vez el usuario disponga de la tarjeta, puede hacer uso del sistema.",
        "RelatedURL": "http://www.aquarius.es",
        "DistanceUnit": 0
    },
    "Connections": [
        {
            "ID": 83031,
            "ConnectionTypeID": 25,
            "StatusTypeID": 50,
            "LevelID": 2,
            "Amps": 32,
            "Voltage": 400,
            "PowerKW": 11,
            "CurrentTypeID": 20,
            "Quantity": 2
        },
        {
            "ID": 83032,
            "ConnectionTypeID": 28,
            "StatusTypeID": 50,
            "LevelID": 2,
            "Amps": 10,
            "Voltage": 400,
            "PowerKW": 3.4,
            "CurrentTypeID": 10,
            "Quantity": 2
        }
    ],
    "NumberOfPoints": 2,
    "GeneralComments": "EN: This station is provided by 2 Mennekes ports and 2 Schuko ports and allows simultaneous loading, more info to this station in www.etecnic.es \r\nES: Es un punto DUO, de la marca ETECNIC y del fabricante INGETEAM. Tiene 4 conectores que van de forma simultanea el lado izquierdo y derecho. M+M o M+S o S+S. Mas información www.etecnic.es",
    "StatusTypeID": 50,
    "DateLastStatusUpdate": "2017-01-27T09:53:00Z",
    "DataQualityLevel": 1,
    "DateCreated": "2016-03-14T12:05:00Z",
    "SubmissionStatusTypeID": 200
}