{
    "IsRecentlyVerified": false,
    "ID": 52653,
    "UUID": "AB1B98C7-C4BA-49A0-B005-2393597DBBD3",
    "DataProviderID": 1,
    "OperatorID": 80,
    "UsageTypeID": 4,
    "UsageCost": "0,40€/kW",
    "AddressInfo": {
        "ID": 52999,
        "Title": "Eneldrive DEVAL Municipio di Valsavarenche",
        "AddressLine1": "Frazione Degioz, 166",
        "Town": "Valsavarenche",
        "StateOrProvince": "AO",
        "Postcode": "11010",
        "CountryID": 112,
        "Latitude": 45.5921357818169,
        "Longitude": 7.20869803618551,
        "RelatedURL": "https://www.eneldrive.it/",
        "DistanceUnit": 0
    },
    "Connections": [
        {
            "ID": 65416,
            "ConnectionTypeID": 25,
            "StatusTypeID": 50,
            "LevelID": 2,
            "Amps": 32,
            "Voltage": 400,
            "PowerKW": 22,
            "CurrentTypeID": 20,
            "Quantity": 1
        },
        {
            "ID": 65417,
            "ConnectionTypeID": 36,
            "StatusTypeID": 50,
            "LevelID": 2,
            "Amps": 16,
            "Voltage": 240,
            "PowerKW": 3,
            "CurrentTypeID": 10,
            "Quantity": 1
        }
    ],
    "NumberOfPoints": 1,
    "StatusTypeID": 50,
    "DateLastStatusUpdate": "2016-04-08T09:52:00Z",
    "DataQualityLevel": 1,
    "DateCreated": "2015-09-06T09:40:00Z",
    "SubmissionStatusTypeID": 200
}