{
    "IsRecentlyVerified": false,
    "ID": 158806,
    "UUID": "416D5ECD-B8C9-4DF3-A41D-C5577F2EABB4",
    "DataProviderID": 2,
    "DataProvidersReference": "155385",
    "OperatorID": 59,
    "UsageTypeID": 1,
    "AddressInfo": {
        "ID": 159163,
        "Title": "Greenlots - 12560A",
        "AddressLine1": "2104 Colorado Blvd",
        "Town": "Los Angeles",
        "StateOrProvince": "CA",
        "Postcode": "90041",
        "CountryID": 2,
        "Latitude": 34.1390419006348,
        "Longitude": -118.212120056152,
        "ContactTelephone1": "855-900-7584",
        "AccessComments": "24 hours daily",
        "RelatedURL": "http://greenlots.com/",
        "DistanceUnit": 0
    },
    "Connections": [
        {
            "ID": 228840,
            "ConnectionTypeID": 1,
            "LevelID": 2,
            "Amps": 16,
            "Voltage": 230,
            "PowerKW": 3.7,
            "CurrentTypeID": 10,
            "Quantity": 1
        }
    ],
    "StatusTypeID": 50,
    "DateLastStatusUpdate": "2020-06-26T02:57:00Z",
    "DataQualityLevel": 3,
    "DateCreated": "2020-06-26T02:57:00Z",
    "SubmissionStatusTypeID": 100
}