{
    "IsRecentlyVerified": false,
    "ID": 65594,
    "UUID": "09C89056-C708-49F5-B65C-E81C94B5F40A",
    "DataProviderID": 26,
    "DataProvidersReference": "84942",
    "OperatorID": 73,
    "OperatorsReference": "EV-Box EVB-P1536056",
    "UsageCost": "0.00 jaarabonnement",
    "AddressInfo": {
        "ID": 65940,
        "Title": "Galvanibaan 10",
        "AddressLine1": "Galvanibaan 10",
        "Town": "Nieuwegein",
        "Postcode": "3439 MG",
        "CountryID": 159,
        "Latitude": 52.02476,
        "Longitude": 5.10618,
        "RelatedURL": "http://www.ev-box.nl",
        "DistanceUnit": 0
    },
    "Connections": [
        {
            "ID": 90483,
            "ConnectionTypeID": 25,
            "LevelID": 2,
            "PowerKW": 11,
            "CurrentTypeID": 10
        },
        {
            "ID": 90484,
            "ConnectionTypeID": 25,
            "LevelID": 2,
            "PowerKW": 11,
            "CurrentTypeID": 10
        }
    ],
    "NumberOfPoints": 1,
    "StatusTypeID": 50,
    "DateLastStatusUpdate": "2016-06-04T02:44:00Z",
    "DataQualityLevel": 3,
    "DateCreated": "2016-04-27T09:41:00Z",
    "SubmissionStatusTypeID": 100
}