{
    "IsRecentlyVerified": false,
    "ID": 131897,
    "UUID": "690FBE47-FCE1-4544-BDCD-AB42C0B4764C",
    "DataProviderID": 1,
    "OperatorID": 1,
    "UsageTypeID": 1,
    "UsageCost": "Free",
    "AddressInfo": {
        "ID": 132243,
        "Title": "4th Street Parking Deck",
        "AddressLine1": "4th Street and Cotanche Street",
        "Town": "Greenville",
        "StateOrProvince": "North Carolina",
        "Postcode": "27858",
        "CountryID": 2,
        "Latitude": 35.6117437864428,
        "Longitude": -77.3718306459442,
        "AccessComments": "Located just inside the garage entrance.",
        "DistanceUnit": 0
    },
    "Connections": [
        {
            "ID": 184567,
            "ConnectionTypeID": 1,
            "StatusTypeID": 50,
            "LevelID": 2,
            "Amps": 30,
            "Voltage": 240,
            "PowerKW": 6.6,
            "CurrentTypeID": 10,
            "Quantity": 2
        }
    ],
    "NumberOfPoints": 2,
    "StatusTypeID": 50,
    "DateLastStatusUpdate": "2019-09-14T20:50:00Z",
    "DataQualityLevel": 1,
    "DateCreated": "2019-09-14T18:44:00Z",
    "SubmissionStatusTypeID": 200
}