{
    "IsRecentlyVerified": false,
    "ID": 63296,
    "UUID": "C80C9C2E-2596-4648-90E6-A519446A62BC",
    "DataProviderID": 26,
    "DataProvidersReference": "83612",
    "OperatorID": 73,
    "OperatorsReference": "EV-Box EVB-P1548071",
    "UsageCost": "0.00 jaarabonnement",
    "AddressInfo": {
        "ID": 63642,
        "Title": "Kievitstraat 10",
        "AddressLine1": "Kievitstraat 10",
        "Town": "Maassluis",
        "Postcode": "3145 CD",
        "CountryID": 159,
        "Latitude": 51.93165,
        "Longitude": 4.23206,
        "RelatedURL": "http://www.ev-box.nl",
        "DistanceUnit": 0
    },
    "Connections": [
        {
            "ID": 80650,
            "ConnectionTypeID": 25,
            "LevelID": 2,
            "PowerKW": 5,
            "CurrentTypeID": 10
        }
    ],
    "NumberOfPoints": 1,
    "StatusTypeID": 50,
    "DateLastStatusUpdate": "2016-06-04T02:42:00Z",
    "DataQualityLevel": 3,
    "DateCreated": "2016-03-03T12:30:00Z",
    "SubmissionStatusTypeID": 100
}