{
    "IsRecentlyVerified": false,
    "ID": 20471,
    "UUID": "AC6DA0AC-7528-4C30-BF61-9A5554C2D70D",
    "DataProviderID": 1,
    "OperatorID": 1,
    "UsageTypeID": 0,
    "UsageCost": "",
    "AddressInfo": {
        "ID": 20816,
        "Title": "Parking Croix Rousse",
        "AddressLine1": "73 Rue Belfort ",
        "AddressLine2": "",
        "Town": "Lyon",
        "StateOrProvince": "",
        "Postcode": "69004",
        "CountryID": 80,
        "Latitude": 45.78162,
        "Longitude": 4.83303,
        "ContactTelephone1": "",
        "ContactTelephone2": "",
        "ContactEmail": "",
        "AccessComments": "Réservé aux clients de l'établissement",
        "RelatedURL": "",
        "DistanceUnit": 0
    },
    "Connections": [],
    "GeneralComments": "",
    "StatusTypeID": 50,
    "DateLastStatusUpdate": "2013-11-15T12:23:00Z",
    "DataQualityLevel": 1,
    "DateCreated": "2013-11-15T10:48:00Z",
    "SubmissionStatusTypeID": 200
}