{
    "IsRecentlyVerified": false,
    "ID": 79884,
    "UUID": "0887EF20-7265-498C-9E0C-FFBCCE01F189",
    "DataProviderID": 1,
    "OperatorID": 23,
    "OperatorsReference": "7682",
    "UsageTypeID": 4,
    "UsageCost": "$0.23/kWh; other tariffs for older cars",
    "AddressInfo": {
        "ID": 80230,
        "Title": "West Springfield Supercharger",
        "AddressLine1": "935 Riverdale Street",
        "Town": "West Springfield",
        "StateOrProvince": "MA",
        "Postcode": "01089",
        "CountryID": 2,
        "Latitude": 42.130914,
        "Longitude": -72.621435,
        "DistanceUnit": 0
    },
    "Connections": [
        {
            "ID": 114531,
            "ConnectionTypeID": 27,
            "StatusTypeID": 50,
            "LevelID": 3,
            "PowerKW": 120,
            "CurrentTypeID": 30,
            "Quantity": 8
        }
    ],
    "NumberOfPoints": 8,
    "GeneralComments": "8 Superchargers, available 24/7",
    "StatusTypeID": 50,
    "DateLastStatusUpdate": "2018-03-13T13:39:00Z",
    "DataQualityLevel": 1,
    "DateCreated": "2017-01-30T13:42:00Z",
    "SubmissionStatusTypeID": 200
}