{
    "IsRecentlyVerified": false,
    "ID": 8769,
    "UUID": "AB964DCA-467C-47CE-B973-52AA6277A292",
    "DataProviderID": 15,
    "DataProvidersReference": "11711",
    "OperatorID": 5,
    "AddressInfo": {
        "ID": 8666,
        "Title": "1221 Nevin Ave",
        "AddressLine1": "1221 Nevin Ave",
        "Town": "Richmond",
        "StateOrProvince": "California",
        "Postcode": "94801",
        "CountryID": 2,
        "Latitude": 37.93742371,
        "Longitude": -122.3579636,
        "ContactTelephone1": "",
        "RelatedURL": "http://carstations.com/11711",
        "DistanceUnit": 0
    },
    "Connections": [
        {
            "ID": 6178,
            "ConnectionTypeID": 1,
            "Reference": "J1772",
            "LevelID": 2
        },
        {
            "ID": 6390,
            "ConnectionTypeID": 9,
            "Reference": "NEMA5",
            "Quantity": 1
        }
    ],
    "StatusTypeID": 0,
    "DateLastStatusUpdate": "2017-11-04T14:04:00Z",
    "DataQualityLevel": 1,
    "DateCreated": "2011-11-19T21:32:00Z",
    "SubmissionStatusTypeID": 100
}