{
    "IsRecentlyVerified": false,
    "ID": 123250,
    "UUID": "856AFF3F-7B6F-47ED-8269-E9BB8CCD9380",
    "DataProviderID": 2,
    "DataProvidersReference": "61845",
    "OperatorID": 5,
    "UsageTypeID": 1,
    "AddressInfo": {
        "ID": 123596,
        "Title": "PERFORMANCE BMW",
        "AddressLine1": "1810 Durham-Chapel Hill Blvd",
        "Town": "Chapel Hill",
        "StateOrProvince": "NC",
        "Postcode": "27514",
        "CountryID": 2,
        "Latitude": 35.9453628,
        "Longitude": -79.0092813,
        "ContactTelephone1": "888-758-4389",
        "AccessComments": "24 hours daily",
        "RelatedURL": "http://www.chargepoint.com/",
        "DistanceUnit": 0
    },
    "Connections": [
        {
            "ID": 173206,
            "ConnectionTypeID": 1,
            "LevelID": 2,
            "Amps": 16,
            "Voltage": 230,
            "PowerKW": 3.7,
            "CurrentTypeID": 10,
            "Quantity": 2
        }
    ],
    "DateLastStatusUpdate": "2020-06-26T02:58:00Z",
    "DataQualityLevel": 3,
    "DateCreated": "2019-04-06T05:03:00Z",
    "SubmissionStatusTypeID": 100
}