{
    "UserComments": [
        {
            "ID": 10062,
            "ChargePointID": 40994,
            "CommentTypeID": 10,
            "UserName": "JM1972",
            "Comment": "This charger is round the back of the hotel in the lane that runs for the side entrance of the railway station at Falcon Square to Academy Street.",
            "DateCreated": "2016-04-01T06:13:17.053Z",
            "User": {
                "ID": 9183,
                "Username": "JM1972"
            },
            "CheckinStatusTypeID": 0
        }
    ],
    "MediaItems": [
        {
            "ID": 930,
            "ChargePointID": 40994,
            "ItemURL": "https://s3-ap-southeast-2.amazonaws.com/openchargemap/images/GB/OCM40994/OCM-40994.orig.2015012018040029.jpg",
            "ItemThumbnailURL": "https://s3-ap-southeast-2.amazonaws.com/openchargemap/images/GB/OCM40994/OCM-40994.thmb.2015012018040029.jpg",
            "Comment": "",
            "IsEnabled": true,
            "IsVideo": false,
            "IsFeaturedItem": false,
            "IsExternalResource": false,
            "User": {
                "ID": 1192,
                "Username": "Anon74856763534"
            },
            "DateCreated": "2015-01-20T18:05:00Z"
        }
    ],
    "IsRecentlyVerified": false,
    "ID": 40994,
    "UUID": "502341B9-5D85-4AEC-962E-2FA53DF25135",
    "DataProviderID": 1,
    "OperatorID": 19,
    "UsageTypeID": 1,
    "UsageCost": "Free",
    "AddressInfo": {
        "ID": 41340,
        "Title": "Royal Highland Hotel",
        "AddressLine1": "Station Square",
        "AddressLine2": "Academy Street",
        "Town": "Inverness",
        "StateOrProvince": "Highland",
        "Postcode": "IV1 1LG",
        "CountryID": 1,
        "Latitude": 57.47930320802607,
        "Longitude": -4.223806757949893,
        "ContactTelephone1": "",
        "ContactTelephone2": "",
        "ContactEmail": "info@royalhighlandhotel.co.uk",
        "AccessComments": "",
        "RelatedURL": "http://www.royalhighlandhotel.co.uk",
        "DistanceUnit": 0
    },
    "Connections": [
        {
            "ID": 44690,
            "ConnectionTypeID": 25,
            "StatusTypeID": 50,
            "LevelID": 2,
            "Amps": 32,
            "Voltage": 230,
            "PowerKW": 7,
            "CurrentTypeID": 10,
            "Quantity": 1
        }
    ],
    "NumberOfPoints": 1,
    "GeneralComments": "",
    "StatusTypeID": 50,
    "DateLastStatusUpdate": "2016-04-01T06:13:00Z",
    "DataQualityLevel": 1,
    "DateCreated": "2015-01-20T16:37:00Z",
    "SubmissionStatusTypeID": 200
}