{
    "IsRecentlyVerified": false,
    "ID": 107449,
    "UUID": "218DFF23-EE33-4147-ACEB-71D3D0D2CFBD",
    "DataProviderID": 1,
    "OperatorID": 3319,
    "UsageTypeID": 1,
    "UsageCost": " bruttó 80 Ft/kWh",
    "AddressInfo": {
        "ID": 107795,
        "Title": "Keszthely, Sopron utca",
        "AddressLine1": "Sopron utca 2.",
        "Town": "Keszthely",
        "StateOrProvince": "Zala",
        "Postcode": "8360",
        "CountryID": 104,
        "Latitude": 46.772724,
        "Longitude": 17.241544,
        "ContactTelephone1": "+36 80 21-00-12",
        "ContactEmail": "kommunikacio@e-mobi.hu",
        "RelatedURL": "https://e-mobi.hu",
        "DistanceUnit": 0
    },
    "Connections": [
        {
            "ID": 151596,
            "ConnectionTypeID": 25,
            "StatusTypeID": 50,
            "LevelID": 2,
            "Amps": 32,
            "Voltage": 400,
            "PowerKW": 22,
            "CurrentTypeID": 20,
            "Quantity": 2
        }
    ],
    "NumberOfPoints": 2,
    "GeneralComments": "",
    "StatusTypeID": 50,
    "DateLastStatusUpdate": "2020-05-09T09:10:00Z",
    "DataQualityLevel": 1,
    "DateCreated": "2018-07-29T17:24:00Z",
    "SubmissionStatusTypeID": 200
}