{
    "IsRecentlyVerified": false,
    "ID": 18094,
    "UUID": "36F2AF93-34C1-475E-82A6-6BE6F5A6906C",
    "DataProviderID": 22,
    "DataProvidersReference": "E94F0BFAB8C987A7437BA4E1697C1CC0",
    "AddressInfo": {
        "ID": 18439,
        "Title": "永田公園",
        "AddressLine1": "鹿児島県熊毛郡屋久島町永田379-1",
        "CountryID": 114,
        "Latitude": 30.40528923,
        "Longitude": 130.430295,
        "ContactTelephone1": "0997-46-2211",
        "DistanceUnit": 0
    },
    "Connections": [
        {
            "ID": 18335,
            "ConnectionTypeID": 2,
            "LevelID": 2,
            "Amps": 100,
            "Voltage": 480,
            "PowerKW": 48,
            "Quantity": 1
        }
    ],
    "DateLastStatusUpdate": "2013-06-29T09:07:00Z",
    "DataQualityLevel": 2,
    "DateCreated": "2013-06-29T09:07:00Z",
    "SubmissionStatusTypeID": 200
}