{
    "IsRecentlyVerified": false,
    "ID": 106101,
    "UUID": "2AD95951-07D9-4F1C-9732-B7EA1A0FDC7A",
    "DataProviderID": 1,
    "OperatorID": 1,
    "UsageTypeID": 6,
    "AddressInfo": {
        "ID": 106447,
        "Title": "Mike Wye & Associates",
        "AddressLine1": "Buckland Filleigh Sawmills",
        "AddressLine2": "Buckland Filleigh",
        "Town": "Beaworthy",
        "StateOrProvince": "Devon",
        "Postcode": "EX21 5RN",
        "CountryID": 1,
        "Latitude": 50.866971038861,
        "Longitude": -4.19454586858637,
        "ContactTelephone1": "01409 281644",
        "ContactEmail": "sales@mikewye.co.uk",
        "AccessComments": "Open Monday - Friday 8 AM to 4.30 PM",
        "RelatedURL": "https://www.mikewye.co.uk/",
        "DistanceUnit": 0
    },
    "Connections": [
        {
            "ID": 149427,
            "ConnectionTypeID": 1036,
            "LevelID": 2,
            "Amps": 32,
            "Voltage": 230,
            "PowerKW": 7,
            "CurrentTypeID": 10,
            "Quantity": 1
        }
    ],
    "NumberOfPoints": 1,
    "GeneralComments": "Open Monday - Friday 8 AM to 4.30 PM",
    "StatusTypeID": 50,
    "DateLastStatusUpdate": "2018-06-15T20:14:00Z",
    "DataQualityLevel": 1,
    "DateCreated": "2018-06-15T10:40:00Z",
    "SubmissionStatusTypeID": 200
}