{
    "IsRecentlyVerified": false,
    "ID": 153583,
    "UUID": "7ADD4EB2-D859-46B7-89AC-C1D9076ACDF7",
    "DataProviderID": 28,
    "DataProvidersReference": "FR*S10*P10124A",
    "UsageTypeID": 5,
    "AddressInfo": {
        "ID": 153936,
        "Title": "DIERREY SAINT JULIEN",
        "AddressLine1": "4 Rue du Moulin 10190 DIERREY SAINT JULIEN",
        "CountryID": 80,
        "Latitude": 48.311377,
        "Longitude": 3.829991,
        "AccessComments": "",
        "DistanceUnit": 0
    },
    "Connections": [
        {
            "ID": 215545,
            "ConnectionTypeID": 28,
            "StatusTypeID": 50,
            "LevelID": 2,
            "PowerKW": 18,
            "CurrentTypeID": 10
        },
        {
            "ID": 215546,
            "ConnectionTypeID": 25,
            "StatusTypeID": 50,
            "LevelID": 2,
            "PowerKW": 18,
            "CurrentTypeID": 20
        },
        {
            "ID": 249074,
            "ConnectionTypeID": 28,
            "StatusTypeID": 50,
            "LevelID": 2,
            "PowerKW": 18,
            "CurrentTypeID": 10
        },
        {
            "ID": 249075,
            "ConnectionTypeID": 25,
            "StatusTypeID": 50,
            "LevelID": 2,
            "PowerKW": 18,
            "CurrentTypeID": 20
        }
    ],
    "GeneralComments": "\"Une unité = 6kWh de recharge. Utilisateur abonné : 1€/unité",
    "StatusTypeID": 50,
    "DateLastStatusUpdate": "2020-08-27T05:14:00Z",
    "DataQualityLevel": 2,
    "DateCreated": "2020-03-15T10:54:00Z",
    "SubmissionStatusTypeID": 100
}