{
    "IsRecentlyVerified": false,
    "ID": 136423,
    "UUID": "E076FB6E-3BDB-44E4-85A9-5C7368351659",
    "DataProviderID": 18,
    "DataProvidersReference": "9d27ece30c10f0fa972b2f018cfc3366",
    "OperatorID": 2244,
    "UsageTypeID": 5,
    "AddressInfo": {
        "ID": 136769,
        "Title": "Townshend Road",
        "AddressLine1": "Townshend Road",
        "Town": "London",
        "Postcode": "NW8 6LJ",
        "CountryID": 1,
        "Latitude": 51.536308,
        "Longitude": -0.16726,
        "AccessComments": "",
        "RelatedURL": "https://www.ubitricity.com",
        "DistanceUnit": 0
    },
    "Connections": [
        {
            "ID": 190869,
            "ConnectionTypeID": 25,
            "Reference": "suby1100002882",
            "StatusTypeID": 50,
            "LevelID": 2,
            "Amps": 16,
            "Voltage": 230,
            "PowerKW": 3.7,
            "CurrentTypeID": 10
        }
    ],
    "StatusTypeID": 0,
    "DateLastStatusUpdate": "2021-04-25T05:46:00Z",
    "MetadataValues": [
        {
            "ID": 6275,
            "MetadataFieldID": 4,
            "ItemValue": "Contains public sector information licensed under the Open Government Licence v2.0. http://www.nationalarchives.gov.uk/doc/open-government-licence/version/2/"
        }
    ],
    "DataQualityLevel": 3,
    "DateCreated": "2019-12-24T05:22:00Z",
    "SubmissionStatusTypeID": 100
}