{
    "IsRecentlyVerified": false,
    "ID": 17928,
    "UUID": "55DC368C-126B-4F72-96C9-93478F35AE83",
    "DataProviderID": 22,
    "DataProvidersReference": "5C46DFDE90D27CF400999DED4049F356",
    "AddressInfo": {
        "ID": 18273,
        "Title": "国民宿舎慶野松原荘",
        "AddressLine1": "兵庫県南あわじ市松帆古津路970-67",
        "CountryID": 114,
        "Latitude": 34.33823263,
        "Longitude": 134.7348258,
        "ContactTelephone1": "0799-36-3391",
        "DistanceUnit": 0
    },
    "Connections": [
        {
            "ID": 18169,
            "ConnectionTypeID": 2,
            "LevelID": 2,
            "Amps": 100,
            "Voltage": 480,
            "PowerKW": 48,
            "Quantity": 1
        }
    ],
    "DateLastStatusUpdate": "2013-06-29T09:05:00Z",
    "DataQualityLevel": 2,
    "DateCreated": "2013-06-29T09:05:00Z",
    "SubmissionStatusTypeID": 200
}