{
    "IsRecentlyVerified": false,
    "ID": 170219,
    "UUID": "5CB05C35-8D0A-425F-9E95-B43C7AF433A6",
    "DataProviderID": 1,
    "OperatorID": 5,
    "UsageTypeID": 1,
    "UsageCost": "Free",
    "AddressInfo": {
        "ID": 170578,
        "Title": "Pickard Street Citgo station",
        "AddressLine1": "West Pickard Street",
        "Town": "Mt. Pleasant",
        "StateOrProvince": "MI",
        "CountryID": 2,
        "Latitude": 43.61188303283211,
        "Longitude": -84.78669065471752,
        "DistanceUnit": 0
    },
    "Connections": [
        {
            "ID": 259522,
            "ConnectionTypeID": 32,
            "StatusTypeID": 50,
            "LevelID": 3,
            "Amps": 125,
            "PowerKW": 62.5,
            "CurrentTypeID": 30,
            "Quantity": 2
        },
        {
            "ID": 259523,
            "ConnectionTypeID": 2,
            "StatusTypeID": 50,
            "LevelID": 3,
            "PowerKW": 50,
            "CurrentTypeID": 30,
            "Quantity": 2
        }
    ],
    "NumberOfPoints": 1,
    "StatusTypeID": 50,
    "DateLastStatusUpdate": "2020-11-21T08:42:00Z",
    "DataQualityLevel": 1,
    "DateCreated": "2020-11-20T14:52:00Z",
    "SubmissionStatusTypeID": 200
}