{
    "IsRecentlyVerified": false,
    "ID": 36449,
    "UUID": "B711A9D2-7392-4BD4-B3DA-694D8B355438",
    "DataProviderID": 26,
    "DataProvidersReference": "49437",
    "OperatorsReference": "Alewijnse 1420173",
    "UsageCost": "0.00 afhankelijk van pas",
    "AddressInfo": {
        "ID": 36795,
        "Title": "Einsteinweg 92",
        "AddressLine1": "Einsteinweg 92",
        "Town": "Leiden",
        "Postcode": "2333 CD",
        "CountryID": 159,
        "Latitude": 52.166662,
        "Longitude": 4.456317,
        "RelatedURL": "http://www.alewijnse.com/nl",
        "DistanceUnit": 0
    },
    "Connections": [
        {
            "ID": 39960,
            "ConnectionTypeID": 25,
            "LevelID": 2,
            "PowerKW": 11,
            "CurrentTypeID": 10
        }
    ],
    "NumberOfPoints": 2,
    "StatusTypeID": 50,
    "DateLastStatusUpdate": "2016-06-04T02:51:00Z",
    "DataQualityLevel": 3,
    "DateCreated": "2015-01-09T06:05:00Z",
    "SubmissionStatusTypeID": 100
}