{
    "IsRecentlyVerified": false,
    "ID": 114016,
    "UUID": "F68E16D2-F7BA-43E0-B1FF-0D22279A21DB",
    "DataProviderID": 1,
    "OperatorID": 23,
    "OperatorsReference": "47961",
    "UsageTypeID": 4,
    "AddressInfo": {
        "ID": 114362,
        "Title": "Le Clos du Phare",
        "AddressLine1": "6 Route du Plateau",
        "Town": "Saint-Samson-de-la-Roque",
        "Postcode": "27680",
        "CountryID": 80,
        "Latitude": 49.427426,
        "Longitude": 0.434093,
        "ContactTelephone1": " +33 2 32 20 45 27",
        "DistanceUnit": 0
    },
    "Connections": [
        {
            "ID": 160586,
            "ConnectionTypeID": 30,
            "StatusTypeID": 50,
            "LevelID": 2,
            "PowerKW": 17,
            "CurrentTypeID": 20,
            "Quantity": 1
        }
    ],
    "NumberOfPoints": 1,
    "GeneralComments": "1 Tesla Connector, up to 17kW.Available for customers. Please see front desk.",
    "StatusTypeID": 50,
    "DateLastStatusUpdate": "2019-01-03T06:34:00Z",
    "DataQualityLevel": 1,
    "DateCreated": "2019-01-03T06:34:00Z",
    "SubmissionStatusTypeID": 200
}