{
    "MediaItems": [
        {
            "ID": 18822,
            "ChargePointID": 127241,
            "ItemURL": "https://s3-ap-southeast-2.amazonaws.com/openchargemap/images/GR/OCM127241/OCM-127241.orig.2019070806120794.png",
            "ItemThumbnailURL": "https://s3-ap-southeast-2.amazonaws.com/openchargemap/images/GR/OCM127241/OCM-127241.thmb.2019070806120794.png",
            "Comment": "",
            "IsEnabled": true,
            "IsVideo": false,
            "IsFeaturedItem": false,
            "IsExternalResource": false,
            "User": {
                "ID": 20466,
                "Username": "Muadib"
            },
            "DateCreated": "2019-07-08T06:12:00Z"
        }
    ],
    "IsRecentlyVerified": false,
    "ID": 127241,
    "UUID": "F349EEA3-36EB-4405-90F0-22BB3C247F4D",
    "DataProviderID": 1,
    "OperatorID": 45,
    "UsageTypeID": 1,
    "AddressInfo": {
        "ID": 127587,
        "Title": "ODYSSEAS HOTEL",
        "AddressLine1": "Unnamed Road Polychrono",
        "Town": "Polychrono",
        "StateOrProvince": "Δήμος Κασσάνδρας",
        "Postcode": "63085",
        "CountryID": 90,
        "Latitude": 40.0161917969108,
        "Longitude": 23.5311951573882,
        "ContactTelephone1": "+3023740 52124",
        "ContactEmail": "sales@odysseas.net",
        "RelatedURL": "http://www.polychrono-village.com/en/home.htm",
        "DistanceUnit": 0
    },
    "Connections": [
        {
            "ID": 178172,
            "ConnectionTypeID": 25,
            "StatusTypeID": 50,
            "LevelID": 2,
            "Amps": 32,
            "Voltage": 230,
            "PowerKW": 7.4,
            "CurrentTypeID": 10,
            "Quantity": 1
        }
    ],
    "NumberOfPoints": 1,
    "StatusTypeID": 50,
    "DateLastStatusUpdate": "2019-07-08T06:12:00Z",
    "DataQualityLevel": 1,
    "DateCreated": "2019-05-31T20:34:00Z",
    "SubmissionStatusTypeID": 200
}