{
    "IsRecentlyVerified": false,
    "ID": 182147,
    "UUID": "58878270-347A-49FA-B54A-900490F6BC10",
    "DataProviderID": 29,
    "DataProvidersReference": "5924",
    "OperatorID": 3443,
    "AddressInfo": {
        "ID": 182506,
        "Title": "Parkplatz Feuerteich",
        "AddressLine1": "Parkplatz Feuerteich",
        "Town": "Attendorn",
        "Postcode": "57439",
        "CountryID": 87,
        "Latitude": 51.1277,
        "Longitude": 7.9015,
        "DistanceUnit": 0
    },
    "Connections": [
        {
            "ID": 287533,
            "ConnectionTypeID": 25,
            "StatusTypeID": 50,
            "LevelID": 2,
            "PowerKW": 22,
            "CurrentTypeID": 20
        },
        {
            "ID": 287534,
            "ConnectionTypeID": 25,
            "StatusTypeID": 50,
            "LevelID": 2,
            "PowerKW": 22,
            "CurrentTypeID": 20
        }
    ],
    "StatusTypeID": 50,
    "DateLastStatusUpdate": "2021-07-09T03:22:00Z",
    "MetadataValues": [
        {
            "ID": 14441,
            "MetadataFieldID": 4,
            "ItemValue": "Data from the German chargepoint registry provided by Bundesnetzagentur.de under the CC-BY 4.0 license"
        }
    ],
    "DataQualityLevel": 3,
    "DateCreated": "2021-07-08T10:02:00Z",
    "SubmissionStatusTypeID": 100
}