{
    "IsRecentlyVerified": false,
    "ID": 92148,
    "UUID": "E3E5DF84-0141-4CE3-BA84-C52449B1FB84",
    "DataProviderID": 1,
    "OperatorID": 105,
    "UsageTypeID": 1,
    "AddressInfo": {
        "ID": 92494,
        "Title": "E-Bike Station Altes Missionshaus",
        "AddressLine1": "Arnold-Janssen-Straße 9",
        "Town": "Wittlich",
        "StateOrProvince": "Landkreis Bernkastel-Wittlich",
        "Postcode": "54516",
        "CountryID": 87,
        "Latitude": 49.97869924994123,
        "Longitude": 6.926467697076757,
        "AccessComments": "24/7 nutzbarer Ladeschrank",
        "DistanceUnit": 0
    },
    "Connections": [
        {
            "ID": 130648,
            "ConnectionTypeID": 28,
            "StatusTypeID": 50,
            "LevelID": 1,
            "Amps": 10,
            "Voltage": 230,
            "PowerKW": 2.3,
            "CurrentTypeID": 10,
            "Quantity": 3
        }
    ],
    "NumberOfPoints": 3,
    "StatusTypeID": 50,
    "DateLastStatusUpdate": "2017-08-29T11:44:00Z",
    "DataQualityLevel": 1,
    "DateCreated": "2017-08-29T11:44:00Z",
    "SubmissionStatusTypeID": 200
}