{
    "IsRecentlyVerified": false,
    "ID": 72466,
    "UUID": "42827411-F288-4A9A-AADF-02B8D95C542E",
    "DataProviderID": 1,
    "OperatorID": 69,
    "UsageTypeID": 4,
    "AddressInfo": {
        "ID": 72812,
        "Title": "Königsallee",
        "AddressLine1": "Königsallee 22",
        "Town": "Ludwigsburg",
        "StateOrProvince": "Landkreis Ludwigsburg",
        "Postcode": "71638",
        "CountryID": 87,
        "Latitude": 48.893019507738224,
        "Longitude": 9.196549111639332,
        "AccessComments": "24/7 verfügbare Ladesäule an der Straßenseite mit 2 reservierten Parkplätzen.",
        "RelatedURL": "http://swlb.de/",
        "DistanceUnit": 0
    },
    "Connections": [
        {
            "ID": 103851,
            "ConnectionTypeID": 25,
            "StatusTypeID": 50,
            "LevelID": 2,
            "Amps": 32,
            "Voltage": 400,
            "PowerKW": 22,
            "CurrentTypeID": 20,
            "Quantity": 2
        },
        {
            "ID": 103852,
            "ConnectionTypeID": 28,
            "StatusTypeID": 50,
            "LevelID": 2,
            "Amps": 16,
            "Voltage": 230,
            "PowerKW": 3.7,
            "CurrentTypeID": 10,
            "Quantity": 2
        }
    ],
    "NumberOfPoints": 2,
    "StatusTypeID": 50,
    "DateLastStatusUpdate": "2016-10-17T07:24:00Z",
    "DataQualityLevel": 1,
    "DateCreated": "2016-10-17T07:24:00Z",
    "SubmissionStatusTypeID": 200
}