{
    "IsRecentlyVerified": false,
    "ID": 138930,
    "UUID": "A64C23EB-BFFB-4E5B-B18E-4EEAA107D9B6",
    "DataProviderID": 2,
    "DataProvidersReference": "96502",
    "OperatorID": 9,
    "UsageTypeID": 1,
    "AddressInfo": {
        "ID": 139282,
        "Title": "El Norte Parkway Plaza Regency",
        "AddressLine1": "1000 W El Norte Pkwy",
        "Town": "Escondido",
        "StateOrProvince": "CA",
        "Postcode": "92026",
        "CountryID": 2,
        "Latitude": 33.148109,
        "Longitude": -117.106775,
        "ContactTelephone1": "888-998-2546",
        "AccessComments": "MON: 24 hours | TUE: 24 hours | WED: 24 hours | THU: 24 hours | FRI: 24 hours | SAT: 24 hours | SUN: 24 hours",
        "RelatedURL": "http://www.blinkcharging.com/",
        "DistanceUnit": 0
    },
    "Connections": [
        {
            "ID": 194162,
            "ConnectionTypeID": 1,
            "LevelID": 2,
            "Amps": 16,
            "Voltage": 230,
            "PowerKW": 3.7,
            "CurrentTypeID": 10,
            "Quantity": 2
        }
    ],
    "StatusTypeID": 50,
    "DateLastStatusUpdate": "2020-06-26T02:55:00Z",
    "DataQualityLevel": 3,
    "DateCreated": "2019-12-24T09:09:00Z",
    "SubmissionStatusTypeID": 100
}