{
    "IsRecentlyVerified": false,
    "ID": 102151,
    "UUID": "8C18BCED-E925-45BC-AC22-BEE0855B6598",
    "DataProviderID": 1,
    "OperatorID": 45,
    "UsageTypeID": 6,
    "AddressInfo": {
        "ID": 102497,
        "Title": "LIDL Hradec Králové",
        "AddressLine1": "Víta Nejedlého 1083/14 ",
        "Town": "Hradec Králové",
        "StateOrProvince": "okres Hradec Králové",
        "Postcode": "50003",
        "CountryID": 64,
        "Latitude": 50.2138876142984,
        "Longitude": 15.8583734472213,
        "DistanceUnit": 0
    },
    "Connections": [
        {
            "ID": 144162,
            "ConnectionTypeID": 2,
            "StatusTypeID": 150,
            "LevelID": 3,
            "PowerKW": 50,
            "CurrentTypeID": 30,
            "Quantity": 1
        },
        {
            "ID": 144163,
            "ConnectionTypeID": 33,
            "StatusTypeID": 150,
            "LevelID": 3,
            "PowerKW": 50,
            "CurrentTypeID": 30,
            "Quantity": 1
        },
        {
            "ID": 144164,
            "ConnectionTypeID": 25,
            "StatusTypeID": 150,
            "LevelID": 3,
            "Amps": 63,
            "Voltage": 400,
            "PowerKW": 43,
            "CurrentTypeID": 20,
            "Quantity": 1
        }
    ],
    "NumberOfPoints": 1,
    "StatusTypeID": 150,
    "DateLastStatusUpdate": "2018-06-08T06:02:00Z",
    "DataQualityLevel": 1,
    "DateCreated": "2018-04-17T12:37:00Z",
    "SubmissionStatusTypeID": 200
}