{
    "IsRecentlyVerified": false,
    "ID": 54589,
    "UUID": "2134E2E3-42F8-43BA-A8C5-588EA13B8706",
    "DataProviderID": 26,
    "DataProvidersReference": "66800",
    "OperatorID": 73,
    "OperatorsReference": "EV-Box EVB-P1418257",
    "UsageCost": "0.00 jaarabonnement",
    "AddressInfo": {
        "ID": 54935,
        "Title": "Via Giovanni Barbini",
        "AddressLine1": "Via Giovanni Barbini",
        "Town": "Casteddu/Cagliari",
        "Postcode": "09121-09131,",
        "CountryID": 112,
        "Latitude": 39.20973,
        "Longitude": 9.11507,
        "RelatedURL": "http://www.ev-box.nl",
        "DistanceUnit": 0
    },
    "Connections": [
        {
            "ID": 68881,
            "ConnectionTypeID": 25,
            "LevelID": 2,
            "PowerKW": 5,
            "CurrentTypeID": 10
        },
        {
            "ID": 68882,
            "ConnectionTypeID": 25,
            "LevelID": 2,
            "PowerKW": 5,
            "CurrentTypeID": 10
        }
    ],
    "NumberOfPoints": 1,
    "StatusTypeID": 50,
    "DateLastStatusUpdate": "2016-06-04T02:37:00Z",
    "DataQualityLevel": 3,
    "DateCreated": "2015-10-09T06:18:00Z",
    "SubmissionStatusTypeID": 100
}