{
    "IsRecentlyVerified": false,
    "ID": 36952,
    "UUID": "462871D6-6E0E-45BE-A807-B6A06FEE1AB6",
    "DataProviderID": 26,
    "DataProvidersReference": "48174",
    "OperatorID": 178,
    "OperatorsReference": "EVnetNL EV0055",
    "UsageCost": "0.00 jaarabonnement",
    "AddressInfo": {
        "ID": 37298,
        "Title": "Oosteinderweg 493",
        "AddressLine1": "Oosteinderweg 493",
        "Town": "Aalsmeer",
        "Postcode": "1432 BK",
        "CountryID": 159,
        "Latitude": 52.289247,
        "Longitude": 4.811752,
        "ContactTelephone1": "0800-3522365",
        "RelatedURL": "http://www.evnet.nl",
        "DistanceUnit": 0
    },
    "Connections": [
        {
            "ID": 40463,
            "ConnectionTypeID": 25,
            "LevelID": 2,
            "PowerKW": 11,
            "CurrentTypeID": 10
        }
    ],
    "NumberOfPoints": 1,
    "StatusTypeID": 50,
    "DateLastStatusUpdate": "2016-06-04T02:52:00Z",
    "DataQualityLevel": 3,
    "DateCreated": "2015-01-09T06:07:00Z",
    "SubmissionStatusTypeID": 100
}