{
    "IsRecentlyVerified": false,
    "ID": 102559,
    "UUID": "0FB1727F-DAB5-44B7-B0D6-DA43D5134FAB",
    "DataProviderID": 2,
    "DataProvidersReference": "92435",
    "OperatorID": 5,
    "UsageTypeID": 1,
    "AddressInfo": {
        "ID": 102905,
        "Title": "RCC COLLEGE",
        "AddressLine1": "1531 Trinity Church Rd",
        "Town": "Concord",
        "StateOrProvince": "NC",
        "Postcode": "28027",
        "CountryID": 2,
        "Latitude": 35.4370465,
        "Longitude": -80.6594445,
        "ContactTelephone1": "888-758-4389",
        "AccessComments": "24 hours daily",
        "RelatedURL": "http://www.chargepoint.com/",
        "DistanceUnit": 0
    },
    "Connections": [
        {
            "ID": 144646,
            "ConnectionTypeID": 1,
            "LevelID": 2,
            "Amps": 16,
            "Voltage": 230,
            "PowerKW": 3,
            "CurrentTypeID": 10,
            "Quantity": 2
        }
    ],
    "DateLastStatusUpdate": "2019-04-06T04:02:00Z",
    "DataQualityLevel": 3,
    "DateCreated": "2018-04-21T04:13:00Z",
    "SubmissionStatusTypeID": 100
}