{
    "IsRecentlyVerified": false,
    "ID": 37104,
    "UUID": "14224F11-2A55-4667-905D-6D833124BC9B",
    "DataProviderID": 1,
    "OperatorID": 105,
    "OperatorsReference": "Essent EM-DE-03456001-01-00002",
    "UsageTypeID": 4,
    "AddressInfo": {
        "ID": 37450,
        "Title": "Professor-Prakke-Str. 1",
        "AddressLine1": "Professor-Prakke-Str. 1",
        "Town": "Bad Bentheim",
        "Postcode": "48455",
        "CountryID": 87,
        "Latitude": 52.30992233380363,
        "Longitude": 7.160039403276642,
        "DistanceUnit": 0
    },
    "Connections": [
        {
            "ID": 40615,
            "ConnectionTypeID": 25,
            "LevelID": 2,
            "PowerKW": 11
        },
        {
            "ID": 48641,
            "ConnectionTypeID": 25,
            "LevelID": 2,
            "PowerKW": 11
        }
    ],
    "NumberOfPoints": 1,
    "StatusTypeID": 50,
    "DateLastStatusUpdate": "2020-10-26T10:38:00Z",
    "DataQualityLevel": 3,
    "DateCreated": "2015-01-09T06:07:00Z",
    "SubmissionStatusTypeID": 200
}