{
    "IsRecentlyVerified": false,
    "ID": 13934,
    "UUID": "7D5E0EDF-675D-4C0A-997B-7670235D39F9",
    "DataProviderID": 2,
    "DataProvidersReference": "42421",
    "UsageTypeID": 1,
    "AddressInfo": {
        "ID": 13831,
        "Title": "Kwik Trip #832",
        "AddressLine1": "208 E Main",
        "Town": "Waunakee",
        "StateOrProvince": "WI",
        "Postcode": "53597",
        "CountryID": 2,
        "Latitude": 43.191654,
        "Longitude": -89.452404,
        "ContactTelephone1": "608-849-5008",
        "AccessComments": "24 hours daily",
        "RelatedURL": "",
        "DistanceUnit": 0
    },
    "Connections": [
        {
            "ID": 11363,
            "ConnectionTypeID": 9,
            "LevelID": 1,
            "Amps": 16,
            "Voltage": 120,
            "PowerKW": 1.9,
            "CurrentTypeID": 10,
            "Quantity": 1
        }
    ],
    "DateLastStatusUpdate": "2020-06-26T03:06:00Z",
    "DataQualityLevel": 3,
    "DateCreated": "2012-12-06T16:48:00Z",
    "SubmissionStatusTypeID": 100
}