{
    "IsRecentlyVerified": false,
    "ID": 176880,
    "UUID": "591BCC40-39C1-4778-B64A-D7B9A7F4BE74",
    "DataProviderID": 29,
    "DataProvidersReference": "16373",
    "AddressInfo": {
        "ID": 177239,
        "Title": "Am Diestelrasen 2",
        "AddressLine1": "Am Diestelrasen 2",
        "Town": "Schlüchtern",
        "Postcode": "36281",
        "CountryID": 87,
        "Latitude": 50.386857,
        "Longitude": 9.525529,
        "DistanceUnit": 0
    },
    "Connections": [
        {
            "ID": 275338,
            "ConnectionTypeID": 25,
            "StatusTypeID": 50,
            "LevelID": 2,
            "PowerKW": 11,
            "CurrentTypeID": 20
        },
        {
            "ID": 275339,
            "ConnectionTypeID": 25,
            "StatusTypeID": 50,
            "LevelID": 2,
            "PowerKW": 11,
            "CurrentTypeID": 20
        }
    ],
    "StatusTypeID": 0,
    "DateLastStatusUpdate": "2021-07-12T02:44:00Z",
    "MetadataValues": [
        {
            "ID": 9175,
            "MetadataFieldID": 4,
            "ItemValue": "Data from the German chargepoint registry provided by Bundesnetzagentur.de under the CC-BY 4.0 license"
        }
    ],
    "DataQualityLevel": 3,
    "DateCreated": "2021-07-08T09:48:00Z",
    "SubmissionStatusTypeID": 100
}