{
    "IsRecentlyVerified": false,
    "ID": 62294,
    "UUID": "C3F5F82A-C444-4E41-B500-0778E31AA7A2",
    "DataProviderID": 1,
    "OperatorID": 23,
    "OperatorsReference": "7916",
    "UsageTypeID": 1,
    "UsageCost": "Free",
    "AddressInfo": {
        "ID": 62640,
        "Title": "Brook Farm Inn",
        "AddressLine1": "15 Hawthorne St",
        "Town": "Lenox",
        "StateOrProvince": "MA",
        "Postcode": "01240",
        "CountryID": 2,
        "Latitude": 42.352564,
        "Longitude": -73.288507,
        "ContactTelephone1": "800-285-7638  877-798-3752",
        "AccessComments": "24 hours daily; for guest use only; see front desk for access",
        "RelatedURL": "http://www.teslamotors.com/supercharger",
        "DistanceUnit": 0
    },
    "Connections": [
        {
            "ID": 79197,
            "ConnectionTypeID": 30,
            "StatusTypeID": 50,
            "LevelID": 2,
            "Amps": 16,
            "Voltage": 230,
            "PowerKW": 16,
            "CurrentTypeID": 10,
            "Quantity": 1
        }
    ],
    "NumberOfPoints": 1,
    "StatusTypeID": 50,
    "DateLastStatusUpdate": "2017-01-26T19:40:00Z",
    "DataQualityLevel": 3,
    "DateCreated": "2016-03-03T11:38:00Z",
    "SubmissionStatusTypeID": 100
}