{
    "IsRecentlyVerified": false,
    "ID": 160255,
    "UUID": "D1F08FF2-A194-40A3-A1C8-1C263E88166E",
    "DataProviderID": 2,
    "DataProvidersReference": "157687",
    "UsageTypeID": 2,
    "AddressInfo": {
        "ID": 160612,
        "Title": "Canadian Tire Corporation",
        "AddressLine1": "430 Holland St W",
        "Town": "Bradord",
        "StateOrProvince": "ON",
        "Postcode": "L3Z 2A4",
        "CountryID": 44,
        "Latitude": 44.1093347,
        "Longitude": -79.5853892,
        "ContactTelephone1": "",
        "AccessComments": "",
        "RelatedURL": "",
        "DistanceUnit": 0
    },
    "Connections": [
        {
            "ID": 230568,
            "ConnectionTypeID": 2,
            "LevelID": 3,
            "Amps": 100,
            "Voltage": 400,
            "PowerKW": 40,
            "CurrentTypeID": 30,
            "Quantity": 1
        },
        {
            "ID": 230569,
            "ConnectionTypeID": 32,
            "LevelID": 3,
            "Amps": 100,
            "Voltage": 400,
            "PowerKW": 40,
            "CurrentTypeID": 30,
            "Quantity": 1
        }
    ],
    "GeneralComments": "Planned for future date. Not Operational.",
    "DatePlanned": "2020-09-01T00:00:00Z",
    "StatusTypeID": 150,
    "DateLastStatusUpdate": "2020-06-26T03:07:00Z",
    "DataQualityLevel": 3,
    "DateCreated": "2020-06-26T03:07:00Z",
    "SubmissionStatusTypeID": 100
}