{
    "IsRecentlyVerified": false,
    "ID": 138731,
    "UUID": "FC25B5D5-3E15-485B-85C9-F1A2FD721BD8",
    "DataProviderID": 2,
    "DataProvidersReference": "143682",
    "OperatorID": 5,
    "UsageTypeID": 1,
    "AddressInfo": {
        "ID": 139083,
        "Title": "AMERICANAIRLINE",
        "AddressLine1": "4601 Highway 360",
        "Town": "Fort Worth",
        "StateOrProvince": "TX",
        "Postcode": "76155",
        "CountryID": 2,
        "Latitude": 32.8335174,
        "Longitude": -97.0622818,
        "ContactTelephone1": "888-758-4389",
        "AccessComments": "24 hours daily",
        "RelatedURL": "http://www.chargepoint.com/",
        "DistanceUnit": 0
    },
    "Connections": [
        {
            "ID": 193923,
            "ConnectionTypeID": 1,
            "LevelID": 2,
            "Amps": 16,
            "Voltage": 230,
            "PowerKW": 3,
            "CurrentTypeID": 10,
            "Quantity": 2
        }
    ],
    "StatusTypeID": 50,
    "DateLastStatusUpdate": "2019-12-24T09:09:00Z",
    "DataQualityLevel": 3,
    "DateCreated": "2019-12-24T09:09:00Z",
    "SubmissionStatusTypeID": 100
}