{
    "IsRecentlyVerified": false,
    "ID": 154188,
    "UUID": "154B733B-2E2C-4375-B2FE-9620ADBCAE07",
    "DataProviderID": 28,
    "DataProvidersReference": "FR*S27*PSTOUENTILLEUL*MAIRIE",
    "UsageTypeID": 5,
    "AddressInfo": {
        "ID": 154541,
        "Title": "900066",
        "AddressLine1": "Rue de la Mairie Saint Ouen du Tilleul",
        "CountryID": 80,
        "Latitude": 49.293602,
        "Longitude": 0.951704,
        "AccessComments": "24/24 7/7 jours",
        "DistanceUnit": 0
    },
    "Connections": [
        {
            "ID": 216719,
            "ConnectionTypeID": 28,
            "StatusTypeID": 50,
            "LevelID": 2,
            "PowerKW": 22,
            "CurrentTypeID": 10
        },
        {
            "ID": 216720,
            "ConnectionTypeID": 26,
            "StatusTypeID": 50,
            "LevelID": 2,
            "PowerKW": 22
        },
        {
            "ID": 251086,
            "ConnectionTypeID": 26,
            "StatusTypeID": 50,
            "LevelID": 2,
            "PowerKW": 22
        },
        {
            "ID": 251087,
            "ConnectionTypeID": 28,
            "StatusTypeID": 50,
            "LevelID": 2,
            "PowerKW": 22,
            "CurrentTypeID": 10
        }
    ],
    "GeneralComments": "Borne en service",
    "StatusTypeID": 50,
    "DateLastStatusUpdate": "2020-08-27T05:16:00Z",
    "DataQualityLevel": 2,
    "DateCreated": "2020-03-15T10:55:00Z",
    "SubmissionStatusTypeID": 100
}