{
    "IsRecentlyVerified": false,
    "ID": 161093,
    "UUID": "07EA0E21-5E3C-418E-8244-C8C9190A340E",
    "DataProviderID": 1,
    "OperatorID": 45,
    "UsageTypeID": 6,
    "UsageCost": "Free",
    "AddressInfo": {
        "ID": 161450,
        "Title": "National Trust Fountains Abbey Car Park B",
        "AddressLine1": "Fountains Lane",
        "AddressLine2": "Aldfield",
        "Town": "Harrogate",
        "StateOrProvince": "North Yorkshire",
        "Postcode": "HG4 3EA",
        "CountryID": 1,
        "Latitude": 54.113412268974656,
        "Longitude": -1.5830613029778533,
        "ContactTelephone1": "01765608160",
        "AccessComments": "In Car Park B - corner closest to visitors centre",
        "RelatedURL": "https://www.nationaltrust.org.uk/fountains-abbey-and-studley-royal-water-garden",
        "DistanceUnit": 0
    },
    "Connections": [
        {
            "ID": 231785,
            "ConnectionTypeID": 25,
            "StatusTypeID": 50,
            "LevelID": 2,
            "PowerKW": 7,
            "CurrentTypeID": 10,
            "Quantity": 2
        },
        {
            "ID": 231786,
            "ConnectionTypeID": 25,
            "StatusTypeID": 50,
            "LevelID": 2,
            "PowerKW": 7,
            "CurrentTypeID": 10,
            "Quantity": 2
        },
        {
            "ID": 231787,
            "ConnectionTypeID": 25,
            "StatusTypeID": 50,
            "LevelID": 2,
            "PowerKW": 7,
            "CurrentTypeID": 10,
            "Quantity": 2
        }
    ],
    "NumberOfPoints": 6,
    "StatusTypeID": 50,
    "DateLastStatusUpdate": "2020-07-03T08:36:00Z",
    "DataQualityLevel": 1,
    "DateCreated": "2020-07-03T08:32:00Z",
    "SubmissionStatusTypeID": 200
}