{
    "IsRecentlyVerified": false,
    "ID": 29823,
    "UUID": "1E3D3D33-B1A3-45E2-AA93-BF90FBE9F730",
    "DataProviderID": 15,
    "DataProvidersReference": "36572",
    "OperatorID": 1,
    "AddressInfo": {
        "ID": 30169,
        "Title": "585 MarketPlace Drive",
        "AddressLine1": "585 MarketPlace Drive",
        "Town": "Bel Air",
        "StateOrProvince": "MD",
        "Postcode": "21014",
        "CountryID": 2,
        "Latitude": 39.52405,
        "Longitude": -76.349654,
        "ContactTelephone1": "",
        "RelatedURL": "http://carstations.com/36572",
        "DistanceUnit": 0
    },
    "Connections": [
        {
            "ID": 32808,
            "ConnectionTypeID": 1,
            "Reference": "J1772",
            "LevelID": 2
        }
    ],
    "StatusTypeID": 0,
    "DateLastStatusUpdate": "2017-11-04T14:04:00Z",
    "DataQualityLevel": 2,
    "DateCreated": "2014-11-29T05:39:00Z",
    "SubmissionStatusTypeID": 100
}