{
    "IsRecentlyVerified": false,
    "ID": 176687,
    "UUID": "9671DDF4-09F0-4A21-8223-AAB8D8ED83FE",
    "DataProviderID": 29,
    "DataProvidersReference": "8049",
    "AddressInfo": {
        "ID": 177046,
        "Title": "Heideweg 9",
        "AddressLine1": "Heideweg 9",
        "Town": "Lampertheim",
        "Postcode": "68623",
        "CountryID": 87,
        "Latitude": 49.588075,
        "Longitude": 8.483777,
        "DistanceUnit": 0
    },
    "Connections": [
        {
            "ID": 274893,
            "ConnectionTypeID": 25,
            "StatusTypeID": 50,
            "LevelID": 2,
            "PowerKW": 22,
            "CurrentTypeID": 20
        },
        {
            "ID": 274894,
            "ConnectionTypeID": 25,
            "StatusTypeID": 50,
            "LevelID": 2,
            "PowerKW": 22,
            "CurrentTypeID": 20
        }
    ],
    "StatusTypeID": 0,
    "DateLastStatusUpdate": "2021-07-12T02:43:00Z",
    "MetadataValues": [
        {
            "ID": 8982,
            "MetadataFieldID": 4,
            "ItemValue": "Data from the German chargepoint registry provided by Bundesnetzagentur.de under the CC-BY 4.0 license"
        }
    ],
    "DataQualityLevel": 3,
    "DateCreated": "2021-07-08T09:48:00Z",
    "SubmissionStatusTypeID": 100
}