{
    "IsRecentlyVerified": false,
    "ID": 50479,
    "UUID": "C8A3D448-CA86-45C3-9DE6-B2B0A83E3D47",
    "DataProviderID": 2,
    "DataProvidersReference": "68291",
    "OperatorID": 39,
    "UsageTypeID": 4,
    "AddressInfo": {
        "ID": 50825,
        "Title": "Lewis & Sons",
        "AddressLine1": "10495 South Progress Way",
        "Town": "Parker",
        "StateOrProvince": "CO",
        "Postcode": "80134",
        "CountryID": 2,
        "Latitude": 39.526012,
        "Longitude": -104.76978,
        "ContactTelephone1": "800-663-5633",
        "AccessComments": "MO: Not Specified; TU: Not Specified; WE: Not Specified; TH: Not Specified; FR: Not Specified; SA: Not Specified; SU: Not Specified",
        "RelatedURL": "http://www.semacharge.com/",
        "DistanceUnit": 0
    },
    "Connections": [
        {
            "ID": 62186,
            "ConnectionTypeID": 1,
            "LevelID": 2,
            "Amps": 16,
            "Voltage": 230,
            "PowerKW": 3,
            "CurrentTypeID": 10,
            "Quantity": 2
        }
    ],
    "DateLastStatusUpdate": "2019-04-06T05:04:00Z",
    "DataQualityLevel": 3,
    "DateCreated": "2015-07-22T08:58:00Z",
    "SubmissionStatusTypeID": 100
}