{
    "IsRecentlyVerified": false,
    "ID": 155399,
    "UUID": "A872949C-E713-487A-BFAC-5870EB5B2EBE",
    "DataProviderID": 1,
    "OperatorID": 3,
    "OperatorsReference": "PG-70191,PG-85400",
    "UsageTypeID": 4,
    "UsageCost": "Free,£0.27/kWh",
    "AddressInfo": {
        "ID": 155753,
        "Title": "Tesco Superstore-Southam",
        "AddressLine1": "Northfield Road",
        "Town": "Kineton Road Industrial Estate",
        "StateOrProvince": "Southam",
        "Postcode": "CV47 0FG",
        "CountryID": 1,
        "Latitude": 52.248256,
        "Longitude": -1.400682,
        "DistanceUnit": 0
    },
    "Connections": [
        {
            "ID": 218793,
            "ConnectionTypeID": 25,
            "StatusTypeID": 50,
            "LevelID": 2,
            "Amps": 32,
            "Voltage": 400,
            "PowerKW": 22,
            "CurrentTypeID": 20,
            "Quantity": 2
        },
        {
            "ID": 268060,
            "ConnectionTypeID": 25,
            "StatusTypeID": 50,
            "LevelID": 2,
            "Amps": 32,
            "Voltage": 230,
            "PowerKW": 7,
            "CurrentTypeID": 10,
            "Quantity": 2
        }
    ],
    "NumberOfPoints": 4,
    "GeneralComments": "This is an open charge unit installed at the Tesco super store at Northfield Road, Kineton Road Industrial Estate, Southam",
    "StatusTypeID": 50,
    "DateLastStatusUpdate": "2021-03-08T17:56:00Z",
    "DataQualityLevel": 1,
    "DateCreated": "2020-04-11T05:48:00Z",
    "SubmissionStatusTypeID": 200
}