{
    "IsRecentlyVerified": false,
    "ID": 107277,
    "UUID": "D7244D47-5223-47C2-9E30-EA6A8DD13236",
    "DataProviderID": 1,
    "OperatorID": 25,
    "OperatorsReference": "greenwich-tarvesway",
    "UsageTypeID": 4,
    "UsageCost": "£0.059/minute; min £1.18; other tariffs available",
    "AddressInfo": {
        "ID": 107623,
        "Title": "Tarves Way",
        "AddressLine1": "7 Tarves Way",
        "Town": "London",
        "Postcode": "SE10 9JP",
        "CountryID": 1,
        "Latitude": 51.4787219561,
        "Longitude": -0.0157049364635,
        "DistanceUnit": 0
    },
    "Connections": [
        {
            "ID": 151329,
            "ConnectionTypeID": 25,
            "StatusTypeID": 50,
            "LevelID": 2,
            "Amps": 32,
            "Voltage": 230,
            "PowerKW": 7,
            "CurrentTypeID": 10,
            "Quantity": 3
        },
        {
            "ID": 151330,
            "ConnectionTypeID": 1,
            "StatusTypeID": 50,
            "LevelID": 2,
            "Amps": 16,
            "Voltage": 230,
            "PowerKW": 4,
            "CurrentTypeID": 10,
            "Quantity": 3
        },
        {
            "ID": 151331,
            "ConnectionTypeID": 25,
            "StatusTypeID": 50,
            "LevelID": 2,
            "Amps": 32,
            "Voltage": 230,
            "PowerKW": 7,
            "CurrentTypeID": 10,
            "Quantity": 3
        },
        {
            "ID": 151332,
            "ConnectionTypeID": 1,
            "StatusTypeID": 50,
            "LevelID": 2,
            "Amps": 16,
            "Voltage": 230,
            "PowerKW": 4,
            "CurrentTypeID": 10,
            "Quantity": 3
        },
        {
            "ID": 151333,
            "ConnectionTypeID": 25,
            "StatusTypeID": 50,
            "LevelID": 2,
            "Amps": 32,
            "Voltage": 230,
            "PowerKW": 7,
            "CurrentTypeID": 10,
            "Quantity": 3
        }
    ],
    "NumberOfPoints": 3,
    "StatusTypeID": 50,
    "DateLastStatusUpdate": "2018-07-23T15:57:00Z",
    "DataQualityLevel": 1,
    "DateCreated": "2018-07-23T15:42:00Z",
    "SubmissionStatusTypeID": 200
}