{
    "IsRecentlyVerified": false,
    "ID": 53597,
    "UUID": "3E6D7CDC-6A88-4F7A-834C-A051C6D377F5",
    "DataProviderID": 1,
    "OperatorID": 105,
    "OperatorsReference": "Essent EM-DE-09184140-01-00001",
    "UsageTypeID": 1,
    "UsageCost": "0",
    "AddressInfo": {
        "ID": 53943,
        "Title": "Aldi Süd",
        "AddressLine1": "Innstraße 3",
        "AddressLine2": "",
        "Town": "Putzbrunn",
        "StateOrProvince": "",
        "Postcode": "85640",
        "CountryID": 87,
        "Latitude": 48.08121,
        "Longitude": 11.69224,
        "ContactTelephone1": "",
        "ContactTelephone2": "",
        "ContactEmail": "",
        "AccessComments": "",
        "RelatedURL": "",
        "DistanceUnit": 0
    },
    "Connections": [
        {
            "ID": 66748,
            "ConnectionTypeID": 2,
            "StatusTypeID": 50,
            "LevelID": 2,
            "Amps": 32,
            "Voltage": 400,
            "PowerKW": 22,
            "CurrentTypeID": 20,
            "Quantity": 2
        },
        {
            "ID": 272668,
            "ConnectionTypeID": 33,
            "StatusTypeID": 50,
            "LevelID": 3,
            "PowerKW": 20,
            "CurrentTypeID": 30,
            "Quantity": 1
        }
    ],
    "NumberOfPoints": 2,
    "GeneralComments": "",
    "StatusTypeID": 50,
    "DateLastStatusUpdate": "2021-06-01T18:20:00Z",
    "DataQualityLevel": 3,
    "DateCreated": "2015-09-20T11:50:00Z",
    "SubmissionStatusTypeID": 200
}