{
    "IsRecentlyVerified": false,
    "ID": 41798,
    "UUID": "725D12AB-5E51-4340-AF79-2EED7E8C4208",
    "DataProviderID": 1,
    "OperatorID": 45,
    "UsageTypeID": 1,
    "AddressInfo": {
        "ID": 42144,
        "Title": "Bistro & Laden Altes Feuerwehrhaus",
        "AddressLine1": "Klützer Straße 34",
        "Town": "Damshagen",
        "StateOrProvince": "Klützer Winkel",
        "Postcode": "23948",
        "CountryID": 87,
        "Latitude": 53.92989,
        "Longitude": 11.1519000000001,
        "ContactTelephone1": "0388252 67174",
        "ContactEmail": "info@gutshaus-stellshagen.de",
        "AccessComments": "Immer nutzbar.",
        "RelatedURL": "http://www.altes-feuerwehrhaus.com",
        "DistanceUnit": 0
    },
    "Connections": [
        {
            "ID": 50067,
            "ConnectionTypeID": 28,
            "StatusTypeID": 50,
            "LevelID": 2,
            "Amps": 16,
            "Voltage": 230,
            "PowerKW": 3.7,
            "CurrentTypeID": 10,
            "Quantity": 1
        }
    ],
    "NumberOfPoints": 1,
    "StatusTypeID": 50,
    "DateLastStatusUpdate": "2015-02-12T21:24:00Z",
    "DataQualityLevel": 1,
    "DateCreated": "2015-02-10T11:20:00Z",
    "SubmissionStatusTypeID": 200
}