{
    "IsRecentlyVerified": false,
    "ID": 46112,
    "UUID": "A99F2255-A938-4580-8A5E-C79C803C2EDC",
    "DataProviderID": 1,
    "DataProvidersReference": "1618",
    "AddressInfo": {
        "ID": 46458,
        "Title": "Holmlia Senter P-hus, Oslo",
        "AddressLine1": "Holmlia Senter vei ",
        "Town": "OSLO",
        "StateOrProvince": "Oslo",
        "Postcode": "1155",
        "CountryID": 168,
        "Latitude": 59.83481,
        "Longitude": 10.7956,
        "AccessComments": "Innerst ved veggen til høyre i første etasje.",
        "DistanceUnit": 0
    },
    "Connections": [
        {
            "ID": 56775,
            "ConnectionTypeID": 0,
            "Reference": "1",
            "LevelID": 2,
            "Amps": 16,
            "Voltage": 230,
            "PowerKW": 3.7,
            "Comments": "Mode 1"
        }
    ],
    "NumberOfPoints": 1,
    "DateLastStatusUpdate": "2020-05-26T08:23:00Z",
    "DataQualityLevel": 2,
    "DateCreated": "2015-05-03T00:54:00Z",
    "SubmissionStatusTypeID": 100
}