{
    "UserComments": [
        {
            "ID": 21524,
            "ChargePointID": 93944,
            "CommentTypeID": 10,
            "UserName": "electric-biker",
            "Comment": "Charging works, but I was charged € 1.70 per kwh !!!",
            "Rating": 1,
            "DateCreated": "2019-09-17T13:20:21.707Z",
            "User": {
                "ID": 22355,
                "Username": "electric-biker"
            },
            "CheckinStatusTypeID": 10
        }
    ],
    "IsRecentlyVerified": false,
    "ID": 93944,
    "UUID": "22C27810-6268-424B-B52F-26FCAF9D7CE2",
    "DataProviderID": 1,
    "OperatorID": 3248,
    "UsageTypeID": 1,
    "AddressInfo": {
        "ID": 94290,
        "Title": "Rasthof Vellern Süd",
        "AddressLine1": "A2",
        "Town": "Beckum",
        "StateOrProvince": "Kreis Warendorf",
        "Postcode": "59269",
        "CountryID": 87,
        "Latitude": 51.790979539952346,
        "Longitude": 8.073250964384444,
        "AccessComments": "24/7 nutzbar",
        "DistanceUnit": 0
    },
    "Connections": [
        {
            "ID": 132981,
            "ConnectionTypeID": 1036,
            "StatusTypeID": 50,
            "LevelID": 3,
            "Amps": 63,
            "Voltage": 400,
            "PowerKW": 43,
            "CurrentTypeID": 20,
            "Quantity": 1
        },
        {
            "ID": 132982,
            "ConnectionTypeID": 33,
            "StatusTypeID": 50,
            "LevelID": 3,
            "PowerKW": 50,
            "CurrentTypeID": 30,
            "Quantity": 1
        },
        {
            "ID": 132983,
            "ConnectionTypeID": 2,
            "StatusTypeID": 50,
            "LevelID": 3,
            "PowerKW": 50,
            "CurrentTypeID": 30,
            "Quantity": 1
        }
    ],
    "NumberOfPoints": 3,
    "StatusTypeID": 50,
    "DateLastStatusUpdate": "2019-09-17T13:20:00Z",
    "DataQualityLevel": 1,
    "DateCreated": "2017-10-13T07:52:00Z",
    "SubmissionStatusTypeID": 200
}