{
    "IsRecentlyVerified": false,
    "ID": 170630,
    "UUID": "7DAC20C0-3708-40F5-8C8A-52EEDF5BB4BA",
    "DataProviderID": 1,
    "OperatorID": 1,
    "UsageTypeID": 1,
    "AddressInfo": {
        "ID": 170989,
        "Title": "Hotel Oxford",
        "AddressLine1": "Hotel Oxford",
        "Town": "Constanța",
        "StateOrProvince": "Constanța",
        "Postcode": "900478",
        "CountryID": 184,
        "Latitude": 44.21693367562392,
        "Longitude": 28.62900196139799,
        "DistanceUnit": 0
    },
    "Connections": [
        {
            "ID": 260543,
            "ConnectionTypeID": 25,
            "StatusTypeID": 50,
            "LevelID": 2,
            "Amps": 32,
            "Voltage": 230,
            "PowerKW": 7,
            "CurrentTypeID": 10,
            "Quantity": 1
        }
    ],
    "NumberOfPoints": 1,
    "StatusTypeID": 50,
    "DateLastStatusUpdate": "2020-12-04T11:07:00Z",
    "DataQualityLevel": 1,
    "DateCreated": "2020-12-04T09:14:00Z",
    "SubmissionStatusTypeID": 200
}