{
    "IsRecentlyVerified": false,
    "ID": 66932,
    "UUID": "343F1967-6761-4011-A1D4-7E16CC42313D",
    "DataProviderID": 1,
    "OperatorID": 23,
    "OperatorsReference": "12250",
    "UsageTypeID": 1,
    "UsageCost": "Free",
    "AddressInfo": {
        "ID": 67278,
        "Title": "The Wildwood Inn - Tesla",
        "AddressLine1": "2602 Lillian Miller Pkwy",
        "Town": "Denton",
        "StateOrProvince": "TX",
        "Postcode": "76210",
        "CountryID": 2,
        "Latitude": 33.1801832,
        "Longitude": -97.1117109,
        "ContactTelephone1": "940-243-4919  877-798-3752",
        "AccessComments": "24 hours daily; for Tesla use only; for guest use only; see front desk for access",
        "RelatedURL": "http://www.teslamotors.com/supercharger",
        "DistanceUnit": 0
    },
    "Connections": [
        {
            "ID": 92420,
            "ConnectionTypeID": 30,
            "StatusTypeID": 50,
            "LevelID": 2,
            "Amps": 16,
            "Voltage": 230,
            "PowerKW": 8,
            "CurrentTypeID": 10,
            "Quantity": 2
        }
    ],
    "NumberOfPoints": 2,
    "StatusTypeID": 50,
    "DateLastStatusUpdate": "2017-01-31T20:02:00Z",
    "DataQualityLevel": 3,
    "DateCreated": "2016-05-29T02:04:00Z",
    "SubmissionStatusTypeID": 100
}