{
    "IsRecentlyVerified": false,
    "ID": 137783,
    "UUID": "82CF5DD8-9528-46DA-A9D8-E070686914C5",
    "DataProviderID": 2,
    "DataProvidersReference": "148690",
    "OperatorID": 39,
    "UsageTypeID": 1,
    "AddressInfo": {
        "ID": 138132,
        "Title": "Aura On Mckinney",
        "AddressLine1": "4209 McKinney Avenue",
        "Town": "Dallas",
        "StateOrProvince": "TX",
        "Postcode": "75204",
        "CountryID": 2,
        "Latitude": 32.8167932,
        "Longitude": -96.791941,
        "ContactTelephone1": "800-663-5633",
        "AccessComments": "MO: Not Specified; TU: Not Specified; WE: Not Specified; TH: Not Specified; FR: Not Specified; SA: Not Specified; SU: Not Specified",
        "RelatedURL": "http://www.semacharge.com/",
        "DistanceUnit": 0
    },
    "Connections": [
        {
            "ID": 192778,
            "ConnectionTypeID": 1,
            "LevelID": 2,
            "Amps": 16,
            "Voltage": 230,
            "PowerKW": 3,
            "CurrentTypeID": 10,
            "Quantity": 2
        }
    ],
    "StatusTypeID": 50,
    "DateLastStatusUpdate": "2019-12-24T09:06:00Z",
    "DataQualityLevel": 3,
    "DateCreated": "2019-12-24T09:06:00Z",
    "SubmissionStatusTypeID": 100
}