{
    "IsRecentlyVerified": false,
    "ID": 122301,
    "UUID": "3ACAB511-47D4-4B35-9272-7C1AB683531A",
    "DataProviderID": 2,
    "DataProvidersReference": "63971",
    "OperatorID": 5,
    "UsageTypeID": 1,
    "AddressInfo": {
        "ID": 122647,
        "Title": "AVALON CHARGE",
        "AddressLine1": "2200 Avalon Boulevard",
        "Town": "Alpharetta",
        "StateOrProvince": "GA",
        "Postcode": "30009",
        "CountryID": 2,
        "Latitude": 34.070554,
        "Longitude": -84.278213,
        "ContactTelephone1": "888-758-4389",
        "AccessComments": "24 hours daily",
        "RelatedURL": "http://www.chargepoint.com/",
        "DistanceUnit": 0
    },
    "Connections": [
        {
            "ID": 172182,
            "ConnectionTypeID": 1,
            "LevelID": 2,
            "Amps": 16,
            "Voltage": 230,
            "PowerKW": 3,
            "CurrentTypeID": 10,
            "Quantity": 4
        }
    ],
    "DateLastStatusUpdate": "2019-12-24T09:11:00Z",
    "DataQualityLevel": 3,
    "DateCreated": "2019-04-06T05:02:00Z",
    "SubmissionStatusTypeID": 100
}