{
    "IsRecentlyVerified": false,
    "ID": 120272,
    "UUID": "B3752D06-5711-4401-804A-D932BB632677",
    "DataProviderID": 2,
    "DataProvidersReference": "60700",
    "UsageTypeID": 2,
    "AddressInfo": {
        "ID": 120618,
        "Title": "Alabama Power - Mobile Division Office",
        "AddressLine1": "150 Saint Joseph St",
        "Town": "Mobile",
        "StateOrProvince": "AL",
        "Postcode": "36602",
        "CountryID": 2,
        "Latitude": 30.694703,
        "Longitude": -88.042744,
        "ContactTelephone1": "",
        "AccessComments": "",
        "RelatedURL": "",
        "DistanceUnit": 0
    },
    "Connections": [
        {
            "ID": 169603,
            "ConnectionTypeID": 1,
            "LevelID": 2,
            "Amps": 16,
            "Voltage": 230,
            "PowerKW": 3.7,
            "CurrentTypeID": 10,
            "Quantity": 6
        }
    ],
    "DateLastStatusUpdate": "2020-06-26T02:54:00Z",
    "DataQualityLevel": 3,
    "DateCreated": "2019-04-01T04:59:00Z",
    "SubmissionStatusTypeID": 100
}