{
    "IsRecentlyVerified": false,
    "ID": 176709,
    "UUID": "00A0CDF7-938B-4B9C-82B0-AF924D12A95B",
    "DataProviderID": 29,
    "DataProvidersReference": "5847,9452",
    "OperatorID": 86,
    "AddressInfo": {
        "ID": 177068,
        "Title": "Alltanner Str. 12",
        "AddressLine1": "Alltanner Str. 12",
        "Town": "Wolfegg",
        "Postcode": "88364",
        "CountryID": 87,
        "Latitude": 47.821392,
        "Longitude": 9.794651,
        "DistanceUnit": 0
    },
    "Connections": [
        {
            "ID": 274935,
            "ConnectionTypeID": 28,
            "StatusTypeID": 50,
            "LevelID": 2,
            "PowerKW": 22,
            "CurrentTypeID": 10
        },
        {
            "ID": 274936,
            "ConnectionTypeID": 28,
            "StatusTypeID": 50,
            "LevelID": 2,
            "PowerKW": 22,
            "CurrentTypeID": 10
        },
        {
            "ID": 274937,
            "ConnectionTypeID": 28,
            "StatusTypeID": 50,
            "LevelID": 2,
            "PowerKW": 22,
            "CurrentTypeID": 10
        },
        {
            "ID": 274938,
            "ConnectionTypeID": 28,
            "StatusTypeID": 50,
            "LevelID": 2,
            "PowerKW": 22,
            "CurrentTypeID": 10
        }
    ],
    "StatusTypeID": 0,
    "DateLastStatusUpdate": "2021-07-09T03:10:00Z",
    "MetadataValues": [
        {
            "ID": 9004,
            "MetadataFieldID": 4,
            "ItemValue": "Data from the German chargepoint registry provided by Bundesnetzagentur.de under the CC-BY 4.0 license"
        }
    ],
    "DataQualityLevel": 3,
    "DateCreated": "2021-07-08T09:48:00Z",
    "SubmissionStatusTypeID": 100
}