{
    "IsRecentlyVerified": false,
    "ID": 177246,
    "UUID": "6608BB65-94F6-4B6A-BC33-9FAEF8EE98D8",
    "DataProviderID": 29,
    "DataProvidersReference": "963",
    "OperatorID": 86,
    "AddressInfo": {
        "ID": 177605,
        "Title": "A2 Raststätte Auetal Nord",
        "AddressLine1": "A2 Raststätte Auetal Nord",
        "Town": "Auetal",
        "Postcode": "31749",
        "CountryID": 87,
        "Latitude": 52.223838,
        "Longitude": 9.221553,
        "DistanceUnit": 0
    },
    "Connections": [
        {
            "ID": 276171,
            "ConnectionTypeID": 1036,
            "StatusTypeID": 50,
            "LevelID": 3,
            "PowerKW": 43,
            "CurrentTypeID": 20
        },
        {
            "ID": 276172,
            "ConnectionTypeID": 33,
            "StatusTypeID": 50,
            "LevelID": 3,
            "PowerKW": 50,
            "CurrentTypeID": 30
        },
        {
            "ID": 300307,
            "ConnectionTypeID": 2,
            "StatusTypeID": 50,
            "LevelID": 3,
            "PowerKW": 50,
            "CurrentTypeID": 30
        }
    ],
    "StatusTypeID": 0,
    "DateLastStatusUpdate": "2021-07-12T02:49:00Z",
    "MetadataValues": [
        {
            "ID": 9540,
            "MetadataFieldID": 4,
            "ItemValue": "Data from the German chargepoint registry provided by Bundesnetzagentur.de under the CC-BY 4.0 license"
        }
    ],
    "DataQualityLevel": 3,
    "DateCreated": "2021-07-08T09:48:00Z",
    "SubmissionStatusTypeID": 100
}