{
    "IsRecentlyVerified": false,
    "ID": 84567,
    "UUID": "AC3DA5BE-9165-4E20-ACAA-491CE1F464C5",
    "DataProviderID": 1,
    "OperatorID": 1,
    "UsageTypeID": 4,
    "UsageCost": "0,263€/kWh + Start 2€ bei New Motion/PlugSurfing",
    "AddressInfo": {
        "ID": 84913,
        "Title": "Gemeindeparkplatz",
        "AddressLine1": "Ferdinand-Egelinski-Straße 1",
        "Town": "Seebad Ahlbeck",
        "StateOrProvince": "Landkreis Vorpommern-Greifswald",
        "Postcode": "17419",
        "CountryID": 87,
        "Latitude": 53.93581593446767,
        "Longitude": 14.195692863159914,
        "ContactTelephone1": "+49 38372 140001",
        "AccessComments": "24/7 geöffneter Solarcarport mit Ladestation. Freischaltbar mit New Motion oder PlugSurfing Ladekarte oder App. Wird die Betreiberkarte der \"Inselwerke Usedom\" verwendet, entfällt die Startgebühr von 2€.",
        "RelatedURL": "http://www.inselwerke.de/",
        "DistanceUnit": 0
    },
    "Connections": [
        {
            "ID": 120129,
            "ConnectionTypeID": 25,
            "StatusTypeID": 50,
            "LevelID": 2,
            "Amps": 32,
            "Voltage": 400,
            "PowerKW": 22,
            "CurrentTypeID": 20,
            "Quantity": 2
        }
    ],
    "NumberOfPoints": 2,
    "StatusTypeID": 50,
    "DateLastStatusUpdate": "2017-03-03T09:43:00Z",
    "DataQualityLevel": 1,
    "DateCreated": "2017-03-03T09:43:00Z",
    "SubmissionStatusTypeID": 200
}