{
    "UserComments": [
        {
            "ID": 24699,
            "ChargePointID": 188499,
            "CommentTypeID": 10,
            "UserName": "Paul Jaramillo",
            "Comment": "Carga a 110v todo bien",
            "Rating": 5,
            "DateCreated": "2021-08-06T19:05:24.57Z",
            "User": {
                "ID": 16800,
                "Username": "Paul Jaramillo"
            },
            "CheckinStatusTypeID": 10,
            "IsActionedByEditor": false
        }
    ],
    "MediaItems": [
        {
            "ID": 28915,
            "ChargePointID": 188499,
            "ItemURL": "https://s3-ap-southeast-2.amazonaws.com/openchargemap/images/EC/OCM188499/OCM-188499.orig.2021080614440144.jpg",
            "ItemThumbnailURL": "https://s3-ap-southeast-2.amazonaws.com/openchargemap/images/EC/OCM188499/OCM-188499.thmb.2021080614440144.jpg",
            "Comment": "carga de 110v con traquilidad",
            "IsEnabled": true,
            "IsVideo": false,
            "IsFeaturedItem": false,
            "IsExternalResource": false,
            "User": {
                "ID": 16800,
                "Username": "Paul Jaramillo"
            },
            "DateCreated": "2021-08-06T14:44:00Z"
        },
        {
            "ID": 28914,
            "ChargePointID": 188499,
            "ItemURL": "https://s3-ap-southeast-2.amazonaws.com/openchargemap/images/EC/OCM188499/OCM-188499.orig.2021080614431857.jpg",
            "ItemThumbnailURL": "https://s3-ap-southeast-2.amazonaws.com/openchargemap/images/EC/OCM188499/OCM-188499.thmb.2021080614431857.jpg",
            "Comment": "",
            "IsEnabled": true,
            "IsVideo": false,
            "IsFeaturedItem": false,
            "IsExternalResource": false,
            "User": {
                "ID": 16800,
                "Username": "Paul Jaramillo"
            },
            "DateCreated": "2021-08-06T14:43:00Z"
        }
    ],
    "IsRecentlyVerified": false,
    "ID": 188499,
    "UUID": "9E549DC0-5A47-4D98-93AF-D6ADBB1DFE24",
    "DataProviderID": 1,
    "OperatorID": 1,
    "UsageTypeID": 6,
    "UsageCost": "0",
    "AddressInfo": {
        "ID": 188858,
        "Title": "Avenida Eloy Alfaro",
        "AddressLine1": "Avenida Eloy Alfaro",
        "Town": "Quito",
        "StateOrProvince": "Pichincha",
        "Postcode": "EC170124",
        "CountryID": 69,
        "Latitude": -0.1454943450823123,
        "Longitude": -78.46952728597864,
        "ContactTelephone1": "098-762-5547",
        "AccessComments": "solicita permiso al administrador",
        "DistanceUnit": 0
    },
    "Connections": [
        {
            "ID": 304426,
            "ConnectionTypeID": 28,
            "StatusTypeID": 50,
            "Voltage": 110,
            "CurrentTypeID": 10,
            "Quantity": 1,
            "Comments": "solo vehiculos de dos ruedad. espacio limitado"
        }
    ],
    "NumberOfPoints": 1,
    "StatusTypeID": 50,
    "DateLastStatusUpdate": "2021-08-10T05:14:00Z",
    "DataQualityLevel": 1,
    "DateCreated": "2021-07-29T14:15:00Z",
    "SubmissionStatusTypeID": 200
}