{
    "IsRecentlyVerified": false,
    "ID": 54915,
    "UUID": "65DBAA00-FC7D-4654-A28D-775097B01E8E",
    "DataProviderID": 2,
    "DataProvidersReference": "70070",
    "UsageTypeID": 1,
    "AddressInfo": {
        "ID": 55261,
        "Title": "American River College - Automotive Technology Building",
        "AddressLine1": "4700 College Oak Dr",
        "Town": "Sacramento",
        "StateOrProvince": "CA",
        "Postcode": "95841",
        "CountryID": 2,
        "Latitude": 38.65041,
        "Longitude": -121.345496,
        "ContactTelephone1": "916-484-8354",
        "AccessComments": "Garage business hours; must have parking permit",
        "RelatedURL": "",
        "DistanceUnit": 0
    },
    "Connections": [
        {
            "ID": 69394,
            "ConnectionTypeID": 1,
            "LevelID": 2,
            "Amps": 16,
            "Voltage": 230,
            "PowerKW": 3.7,
            "CurrentTypeID": 10,
            "Quantity": 14
        }
    ],
    "DateLastStatusUpdate": "2020-06-26T03:00:00Z",
    "DataQualityLevel": 3,
    "DateCreated": "2015-10-09T07:24:00Z",
    "SubmissionStatusTypeID": 100
}