{
    "IsRecentlyVerified": false,
    "ID": 165262,
    "UUID": "55E3A8AF-2459-4CC7-A82B-996F081EE6CD",
    "DataProviderID": 1,
    "DataProvidersReference": "TR-IZM-017",
    "OperatorID": 70,
    "UsageTypeID": 1,
    "AddressInfo": {
        "ID": 165621,
        "Title": "Eşarj - İzmir Palas Otel",
        "AddressLine1": "Kültür, Vasıf Çınar Blv No:2, Konak",
        "Town": "İzmir",
        "StateOrProvince": "İzmir",
        "Postcode": "35220",
        "CountryID": 229,
        "Latitude": 38.431549,
        "Longitude": 27.136526,
        "ContactTelephone1": "+90 (850) 433 72 75",
        "ContactEmail": "destek@esarj.com",
        "RelatedURL": "https://esarj.com/en/map?s=TR-IZM-020",
        "DistanceUnit": 0
    },
    "Connections": [
        {
            "ID": 236942,
            "ConnectionTypeID": 33,
            "StatusTypeID": 50,
            "LevelID": 3,
            "Amps": 60,
            "Voltage": 400,
            "PowerKW": 24,
            "CurrentTypeID": 30,
            "Quantity": 1
        }
    ],
    "NumberOfPoints": 1,
    "GeneralComments": "Eşarj Charging Systems",
    "StatusTypeID": 50,
    "DateLastStatusUpdate": "2021-04-02T13:00:00Z",
    "DataQualityLevel": 3,
    "DateCreated": "2020-08-26T08:19:00Z",
    "SubmissionStatusTypeID": 200
}