{
    "IsRecentlyVerified": false,
    "ID": 84116,
    "UUID": "2225EB34-8DD7-4081-A079-FEBE9118D27D",
    "DataProviderID": 1,
    "OperatorID": 23,
    "OperatorsReference": "24358",
    "UsageTypeID": 4,
    "AddressInfo": {
        "ID": 84462,
        "Title": "Beau Rivage Resort & Casino - Garage 2ND Floor",
        "AddressLine1": "875 Beach BLVD",
        "Town": "Biloxi",
        "StateOrProvince": "MS",
        "Postcode": "39530",
        "CountryID": 2,
        "Latitude": 30.393664,
        "Longitude": -88.893472,
        "ContactTelephone1": "(228) 386-7111",
        "DistanceUnit": 0
    },
    "Connections": [
        {
            "ID": 119517,
            "ConnectionTypeID": 30,
            "StatusTypeID": 50,
            "LevelID": 2,
            "PowerKW": 16,
            "CurrentTypeID": 20,
            "Quantity": 2
        }
    ],
    "NumberOfPoints": 2,
    "GeneralComments": "2 Tesla Connectors, up to 16kW.Available for customers. Self park.",
    "StatusTypeID": 50,
    "DateLastStatusUpdate": "2017-02-16T16:50:00Z",
    "DataQualityLevel": 1,
    "DateCreated": "2017-02-16T16:50:00Z",
    "SubmissionStatusTypeID": 200
}