{
    "IsRecentlyVerified": false,
    "ID": 166127,
    "UUID": "04DD083C-7DB9-4856-8547-CCC6C5F2E049",
    "DataProviderID": 28,
    "DataProvidersReference": "FR*S24*PMB24*150",
    "OperatorID": 3407,
    "UsageTypeID": 5,
    "AddressInfo": {
        "ID": 166486,
        "Title": "THIVIERS - Place De La Liberation",
        "AddressLine1": "Place De La Liberation 24800 THIVIERS",
        "CountryID": 80,
        "Latitude": 45.4209268,
        "Longitude": 0.9243158,
        "AccessComments": "24h/24 7j/7",
        "DistanceUnit": 0
    },
    "Connections": [
        {
            "ID": 244418,
            "ConnectionTypeID": 28,
            "StatusTypeID": 50,
            "LevelID": 2,
            "PowerKW": 4,
            "CurrentTypeID": 10
        },
        {
            "ID": 244419,
            "ConnectionTypeID": 2,
            "StatusTypeID": 50,
            "LevelID": 3,
            "PowerKW": 50,
            "CurrentTypeID": 30
        }
    ],
    "GeneralComments": "Recharge par badge et avec une application smartphone",
    "StatusTypeID": 50,
    "DateLastStatusUpdate": "2020-08-27T05:12:00Z",
    "DataQualityLevel": 2,
    "DateCreated": "2020-08-27T05:12:00Z",
    "SubmissionStatusTypeID": 100
}