{
    "IsRecentlyVerified": false,
    "ID": 154200,
    "UUID": "2BB68614-893F-4104-97CE-A9BB09933971",
    "DataProviderID": 28,
    "DataProvidersReference": "FR*S60*PNOAILLES",
    "OperatorID": 3379,
    "UsageTypeID": 5,
    "AddressInfo": {
        "ID": 154553,
        "Title": "Noailles, Paris",
        "AddressLine1": "Rue de Paris 60430 Noailles",
        "CountryID": 80,
        "Latitude": 49.3232,
        "Longitude": 2.20158,
        "AccessComments": "24h/24 7j/7",
        "DistanceUnit": 0
    },
    "Connections": [
        {
            "ID": 216739,
            "ConnectionTypeID": 1036,
            "StatusTypeID": 50,
            "LevelID": 2,
            "PowerKW": 22,
            "CurrentTypeID": 20
        },
        {
            "ID": 251110,
            "ConnectionTypeID": 1036,
            "StatusTypeID": 50,
            "LevelID": 2,
            "PowerKW": 22,
            "CurrentTypeID": 20
        }
    ],
    "GeneralComments": "",
    "StatusTypeID": 50,
    "DateLastStatusUpdate": "2020-08-27T05:16:00Z",
    "DataQualityLevel": 2,
    "DateCreated": "2020-03-15T10:55:00Z",
    "SubmissionStatusTypeID": 100
}