{
    "IsRecentlyVerified": false,
    "ID": 128798,
    "UUID": "52AF1AB9-09BF-4BAD-8E66-09E1755FD376",
    "DataProviderID": 1,
    "OperatorID": 46,
    "UsageTypeID": 4,
    "AddressInfo": {
        "ID": 129144,
        "Title": "Parkplatz Am Sonnenkamp",
        "AddressLine1": "Am Sonnenkamp 76",
        "Town": "Hildesheim",
        "StateOrProvince": "Landkreis Hildesheim",
        "Postcode": "31157",
        "CountryID": 87,
        "Latitude": 52.2409000946481,
        "Longitude": 9.87197605427559,
        "DistanceUnit": 0
    },
    "Connections": [
        {
            "ID": 180196,
            "ConnectionTypeID": 25,
            "StatusTypeID": 50,
            "LevelID": 2,
            "Amps": 32,
            "Voltage": 400,
            "PowerKW": 22,
            "CurrentTypeID": 20,
            "Quantity": 2
        }
    ],
    "NumberOfPoints": 2,
    "GeneralComments": "24/7 verfügbare grüne Ladesäule mit 2 reservierten kostenlosen Parkplätzen davor.",
    "StatusTypeID": 50,
    "DateLastStatusUpdate": "2019-06-28T08:30:00Z",
    "DataQualityLevel": 1,
    "DateCreated": "2019-06-28T08:30:00Z",
    "SubmissionStatusTypeID": 200
}