{
    "IsRecentlyVerified": false,
    "ID": 15321,
    "UUID": "4FDC1B73-7C1B-40EB-88C5-0B8AC3F3EF9D",
    "DataProviderID": 1,
    "OperatorID": 35,
    "UsageTypeID": 4,
    "UsageCost": "",
    "AddressInfo": {
        "ID": 15667,
        "Title": "Euregio ",
        "AddressLine1": "zur holzwarche 29",
        "AddressLine2": "",
        "Town": "Buellingen",
        "StateOrProvince": "",
        "Postcode": "4761",
        "CountryID": 26,
        "Latitude": 50.4236809,
        "Longitude": 6.261177099999941,
        "ContactTelephone1": "+32 (0)80 64 27 93",
        "ContactTelephone2": "",
        "ContactEmail": "info@euregio.net",
        "AccessComments": "09.00 - 17.00 h. (Monday - Thursday) 09.00 - 15.00 h. (Friday) Our offices remain closed on Saturdays and Sundays and on Belgian holidays",
        "RelatedURL": "http://www.euregio.net/en_impressum.html",
        "DistanceUnit": 0
    },
    "Connections": [],
    "NumberOfPoints": 1,
    "GeneralComments": "",
    "StatusTypeID": 50,
    "DateLastStatusUpdate": "2013-01-07T16:11:00Z",
    "DataQualityLevel": 1,
    "DateCreated": "2013-01-07T16:09:00Z",
    "SubmissionStatusTypeID": 200
}