{
    "IsRecentlyVerified": false,
    "ID": 162670,
    "UUID": "9BF44FD8-3B1B-4F7F-8574-13A0A3DE0FEF",
    "DataProviderID": 1,
    "OperatorID": 136,
    "UsageTypeID": 4,
    "UsageCost": "0,15€/kWh",
    "AddressInfo": {
        "ID": 163027,
        "Title": "TNT Finland",
        "AddressLine1": "Tullimiehentie 2",
        "Town": "Vantaa",
        "StateOrProvince": "Southern Finland",
        "Postcode": "01530",
        "CountryID": 79,
        "Latitude": 60.309755466822224,
        "Longitude": 24.99469340123676,
        "RelatedURL": "http://www.virta.fi",
        "DistanceUnit": 0
    },
    "Connections": [
        {
            "ID": 234129,
            "ConnectionTypeID": 0,
            "StatusTypeID": 50,
            "LevelID": 2,
            "Amps": 32,
            "Voltage": 400,
            "PowerKW": 22,
            "CurrentTypeID": 20,
            "Quantity": 2
        }
    ],
    "NumberOfPoints": 2,
    "StatusTypeID": 50,
    "DateLastStatusUpdate": "2020-08-14T13:29:00Z",
    "DataQualityLevel": 1,
    "DateCreated": "2020-08-13T23:50:00Z",
    "SubmissionStatusTypeID": 200
}