{
    "IsRecentlyVerified": false,
    "ID": 139304,
    "UUID": "BD8BDC10-F9E7-4AF2-933F-A54B0FA913DC",
    "DataProviderID": 2,
    "DataProvidersReference": "99033",
    "OperatorID": 59,
    "UsageTypeID": 1,
    "AddressInfo": {
        "ID": 139656,
        "Title": "Greenlots - D63114",
        "AddressLine1": "1301 Thornton Rd",
        "Town": "Lithia Springs",
        "StateOrProvince": "GA",
        "Postcode": "30122",
        "CountryID": 2,
        "Latitude": 33.7687950134277,
        "Longitude": -84.6020126342773,
        "ContactTelephone1": "855-900-7584",
        "AccessComments": "24 hours daily",
        "RelatedURL": "http://greenlots.com/",
        "DistanceUnit": 0
    },
    "Connections": [
        {
            "ID": 194615,
            "ConnectionTypeID": 2,
            "LevelID": 3,
            "Amps": 100,
            "Voltage": 400,
            "PowerKW": 40,
            "CurrentTypeID": 30,
            "Quantity": 1
        },
        {
            "ID": 194616,
            "ConnectionTypeID": 32,
            "LevelID": 3,
            "Amps": 100,
            "Voltage": 400,
            "PowerKW": 40,
            "CurrentTypeID": 30,
            "Quantity": 1
        }
    ],
    "StatusTypeID": 50,
    "DateLastStatusUpdate": "2020-06-26T02:56:00Z",
    "DataQualityLevel": 3,
    "DateCreated": "2019-12-24T09:10:00Z",
    "SubmissionStatusTypeID": 100
}