{
    "IsRecentlyVerified": false,
    "ID": 32348,
    "UUID": "7FDF0C22-9FC3-4159-BE68-041A3DFB890B",
    "DataProviderID": 26,
    "DataProvidersReference": "47053",
    "OperatorID": 178,
    "OperatorsReference": "EVnetNL AL193",
    "UsageCost": "0.00 jaarabonnement",
    "AddressInfo": {
        "ID": 32694,
        "Title": "SUN-plein",
        "AddressLine1": "SUN-plein",
        "Town": "Landgraaf",
        "Postcode": "6373 LH",
        "CountryID": 159,
        "Latitude": 50.908078,
        "Longitude": 6.035633,
        "ContactTelephone1": "0800-3522365",
        "RelatedURL": "http://www.evnet.nl",
        "DistanceUnit": 0
    },
    "Connections": [
        {
            "ID": 35859,
            "ConnectionTypeID": 25,
            "LevelID": 2,
            "PowerKW": 11,
            "CurrentTypeID": 10
        }
    ],
    "NumberOfPoints": 1,
    "StatusTypeID": 50,
    "DateLastStatusUpdate": "2016-06-04T02:38:00Z",
    "DataQualityLevel": 3,
    "DateCreated": "2015-01-09T06:03:00Z",
    "SubmissionStatusTypeID": 100
}