{
    "IsRecentlyVerified": false,
    "ID": 4208,
    "UUID": "6AD140E7-1ABA-4B89-B7D7-3E44D78FCBA5",
    "DataProviderID": 2,
    "DataProvidersReference": "38859",
    "UsageTypeID": 2,
    "AddressInfo": {
        "ID": 4207,
        "Title": "Duke Energy",
        "AddressLine1": "1000 E Main St",
        "Town": "Plainfield",
        "StateOrProvince": "IN",
        "Postcode": "46168",
        "CountryID": 2,
        "Latitude": 39.70909,
        "Longitude": -86.3894,
        "ContactTelephone1": "800-937-3853",
        "AccessComments": "",
        "RelatedURL": "",
        "DistanceUnit": 0
    },
    "Connections": [
        {
            "ID": 12717,
            "ConnectionTypeID": 1,
            "LevelID": 2,
            "Amps": 16,
            "Voltage": 230,
            "PowerKW": 3.7,
            "CurrentTypeID": 10,
            "Quantity": 10
        },
        {
            "ID": 20564,
            "ConnectionTypeID": 1,
            "LevelID": 2,
            "Quantity": 5
        }
    ],
    "DateLastConfirmed": "2011-04-30T00:00:00Z",
    "StatusTypeID": 0,
    "DateLastStatusUpdate": "2020-06-26T03:02:00Z",
    "DataQualityLevel": 1,
    "DateCreated": "2011-05-09T14:58:00Z",
    "SubmissionStatusTypeID": 100
}