{
    "IsRecentlyVerified": false,
    "ID": 187961,
    "UUID": "795EEDBF-0950-4127-9AA2-3E940B75EA0E",
    "DataProviderID": 18,
    "DataProvidersReference": "4c0cf2514d40a8198e3f23be70bf4303",
    "UsageTypeID": 5,
    "AddressInfo": {
        "ID": 188320,
        "Title": "High Street",
        "AddressLine1": "High Street",
        "Town": "Kinver",
        "Postcode": "dy7 6he",
        "CountryID": 1,
        "Latitude": 52.448969,
        "Longitude": -2.22865,
        "AccessComments": "carpark behind tandoori",
        "RelatedURL": "http://www.national-charge-point-registry.uk/",
        "DistanceUnit": 0
    },
    "Connections": [
        {
            "ID": 303291,
            "ConnectionTypeID": 25,
            "Reference": "UKEV106552",
            "StatusTypeID": 50,
            "LevelID": 2,
            "Amps": 32,
            "Voltage": 230,
            "PowerKW": 7,
            "CurrentTypeID": 10
        }
    ],
    "StatusTypeID": 0,
    "DateLastStatusUpdate": "2021-07-12T03:39:00Z",
    "MetadataValues": [
        {
            "ID": 20201,
            "MetadataFieldID": 4,
            "ItemValue": "Contains public sector information licensed under the Open Government Licence v2.0. http://www.nationalarchives.gov.uk/doc/open-government-licence/version/2/"
        }
    ],
    "DataQualityLevel": 3,
    "DateCreated": "2021-07-12T03:39:00Z",
    "SubmissionStatusTypeID": 100
}