{
    "IsRecentlyVerified": false,
    "ID": 182911,
    "UUID": "471CF32B-55C2-4337-80E6-5BC92AFACE22",
    "DataProviderID": 29,
    "DataProvidersReference": "70",
    "AddressInfo": {
        "ID": 183270,
        "Title": "Uferstr. 10",
        "AddressLine1": "Uferstr. 10",
        "Town": "Radebeul",
        "Postcode": "01445",
        "CountryID": 87,
        "Latitude": 51.1038612411271,
        "Longitude": 13.6214913563068,
        "DistanceUnit": 0
    },
    "Connections": [
        {
            "ID": 289241,
            "ConnectionTypeID": 25,
            "StatusTypeID": 50,
            "LevelID": 2,
            "PowerKW": 22,
            "CurrentTypeID": 20
        },
        {
            "ID": 289242,
            "ConnectionTypeID": 25,
            "StatusTypeID": 50,
            "LevelID": 2,
            "PowerKW": 22,
            "CurrentTypeID": 20
        }
    ],
    "StatusTypeID": 50,
    "DateLastStatusUpdate": "2021-07-12T02:46:00Z",
    "MetadataValues": [
        {
            "ID": 15204,
            "MetadataFieldID": 4,
            "ItemValue": "Data from the German chargepoint registry provided by Bundesnetzagentur.de under the CC-BY 4.0 license"
        }
    ],
    "DataQualityLevel": 3,
    "DateCreated": "2021-07-08T10:03:00Z",
    "SubmissionStatusTypeID": 100
}