{
    "IsRecentlyVerified": false,
    "ID": 56700,
    "UUID": "5CB6E0DF-B0CF-4AF5-B487-B704AB4B9449",
    "DataProviderID": 1,
    "DataProvidersReference": "3107",
    "AddressInfo": {
        "ID": 57046,
        "Title": "Campus Roslagen",
        "AddressLine1": "Kaserngatan 1",
        "Town": "NORRTÄLJE",
        "StateOrProvince": "STOCKHOLM",
        "Postcode": "76146",
        "CountryID": 216,
        "Latitude": 59.75212,
        "Longitude": 18.68308,
        "AccessComments": "Bakom den lilla tegelbyggnaden finns två parkeringsplatser med laddmöjlighet.",
        "DistanceUnit": 0
    },
    "Connections": [
        {
            "ID": 71499,
            "ConnectionTypeID": 0,
            "Reference": "1",
            "LevelID": 2,
            "Amps": 32,
            "Voltage": 400,
            "PowerKW": 22,
            "Comments": "Mode 3"
        },
        {
            "ID": 88431,
            "ConnectionTypeID": 0,
            "Reference": "2",
            "LevelID": 2,
            "Amps": 32,
            "Voltage": 400,
            "PowerKW": 22,
            "Comments": "Mode 3"
        }
    ],
    "NumberOfPoints": 2,
    "DateLastStatusUpdate": "2020-05-26T08:23:00Z",
    "DataQualityLevel": 2,
    "DateCreated": "2015-11-06T03:39:00Z",
    "SubmissionStatusTypeID": 100
}