{
    "MediaItems": [
        {
            "ID": 18109,
            "ChargePointID": 107320,
            "ItemURL": "https://s3-ap-southeast-2.amazonaws.com/openchargemap/images/DE/OCM107320/OCM-107320.orig.2019041717283869.png",
            "ItemThumbnailURL": "https://s3-ap-southeast-2.amazonaws.com/openchargemap/images/DE/OCM107320/OCM-107320.thmb.2019041717283869.png",
            "Comment": "",
            "IsEnabled": true,
            "IsVideo": false,
            "IsFeaturedItem": false,
            "IsExternalResource": false,
            "User": {
                "ID": 20568,
                "Username": "Pepp"
            },
            "DateCreated": "2019-04-17T17:29:00Z"
        },
        {
            "ID": 18108,
            "ChargePointID": 107320,
            "ItemURL": "https://s3-ap-southeast-2.amazonaws.com/openchargemap/images/DE/OCM107320/OCM-107320.orig.2019041717253978.png",
            "ItemThumbnailURL": "https://s3-ap-southeast-2.amazonaws.com/openchargemap/images/DE/OCM107320/OCM-107320.thmb.2019041717253978.png",
            "Comment": "",
            "IsEnabled": true,
            "IsVideo": false,
            "IsFeaturedItem": false,
            "IsExternalResource": false,
            "User": {
                "ID": 20568,
                "Username": "Pepp"
            },
            "DateCreated": "2019-04-17T17:26:00Z"
        }
    ],
    "IsRecentlyVerified": false,
    "ID": 107320,
    "UUID": "F23355AC-978C-43D8-9916-041F52E14055",
    "DataProviderID": 1,
    "OperatorID": 86,
    "UsageTypeID": 4,
    "AddressInfo": {
        "ID": 107666,
        "Title": "Rathaus",
        "AddressLine1": "Rathausstraße 2a",
        "Town": "St. Leon-Rot",
        "StateOrProvince": "Rhein-Neckar-Kreis",
        "Postcode": "68789",
        "CountryID": 87,
        "Latitude": 49.26694134062283,
        "Longitude": 8.615398231554423,
        "AccessComments": "24/7 nutzbare Ladesäule mit 2 nicht reservierten Parkplätzen davor",
        "DistanceUnit": 0
    },
    "Connections": [
        {
            "ID": 151415,
            "ConnectionTypeID": 25,
            "StatusTypeID": 50,
            "LevelID": 2,
            "Amps": 32,
            "Voltage": 400,
            "PowerKW": 22,
            "CurrentTypeID": 20,
            "Quantity": 2
        },
        {
            "ID": 151416,
            "ConnectionTypeID": 28,
            "StatusTypeID": 50,
            "LevelID": 2,
            "Amps": 16,
            "Voltage": 230,
            "PowerKW": 3.7,
            "CurrentTypeID": 10,
            "Quantity": 2
        }
    ],
    "NumberOfPoints": 2,
    "StatusTypeID": 50,
    "DateLastStatusUpdate": "2019-04-17T17:29:00Z",
    "DataQualityLevel": 1,
    "DateCreated": "2018-07-24T06:39:00Z",
    "SubmissionStatusTypeID": 200
}