{
    "IsRecentlyVerified": false,
    "ID": 93073,
    "UUID": "74D3BA61-7F3E-4462-ADDD-0D7E85498486",
    "DataProviderID": 1,
    "OperatorID": 45,
    "UsageTypeID": 3,
    "AddressInfo": {
        "ID": 93419,
        "Title": "Schlosshotel",
        "AddressLine1": "Schloßstraße 14",
        "Town": "Ingelfingen",
        "StateOrProvince": "Hohenlohekreis",
        "Postcode": "74653",
        "CountryID": 87,
        "Latitude": 49.3008021,
        "Longitude": 9.652166599999987,
        "ContactTelephone1": "+49 7940 91650",
        "AccessComments": "24/7 nutzbare Wallbox in der Parkgarage. Für Gäste kostenlos",
        "RelatedURL": "https://www.schloss-hotel-ingelfingen.de/",
        "DistanceUnit": 0
    },
    "Connections": [
        {
            "ID": 131832,
            "ConnectionTypeID": 25,
            "StatusTypeID": 50,
            "LevelID": 2,
            "Amps": 16,
            "Voltage": 400,
            "PowerKW": 11,
            "CurrentTypeID": 20,
            "Quantity": 2
        }
    ],
    "NumberOfPoints": 2,
    "StatusTypeID": 50,
    "DateLastStatusUpdate": "2017-09-18T09:17:00Z",
    "DataQualityLevel": 1,
    "DateCreated": "2017-09-18T09:17:00Z",
    "SubmissionStatusTypeID": 200
}