{
    "IsRecentlyVerified": false,
    "ID": 19522,
    "UUID": "57403283-0823-4711-B44E-AE81F7AAD59F",
    "DataProviderID": 15,
    "DataProvidersReference": "36063",
    "OperatorID": 1,
    "UsageTypeID": 1,
    "AddressInfo": {
        "ID": 19867,
        "Title": "1315 Kootenay Street",
        "AddressLine1": "1315 Kootenay Street",
        "Town": "Vancouver",
        "StateOrProvince": "",
        "Postcode": "V5K 4Y3",
        "CountryID": 44,
        "Latitude": 49.2727,
        "Longitude": -123.02822,
        "ContactTelephone1": "604-431-3830",
        "RelatedURL": "http://carstations.com/36063",
        "DistanceUnit": 0
    },
    "Connections": [
        {
            "ID": 19846,
            "ConnectionTypeID": 1,
            "Reference": "J1772",
            "LevelID": 2
        }
    ],
    "NumberOfPoints": 1,
    "StatusTypeID": 0,
    "DateLastStatusUpdate": "2017-11-04T14:05:00Z",
    "DataQualityLevel": 2,
    "DateCreated": "2013-10-07T03:38:00Z",
    "SubmissionStatusTypeID": 200
}