{
    "IsRecentlyVerified": false,
    "ID": 67511,
    "UUID": "C69A22F8-2415-44D0-A8E4-5E8C29939778",
    "DataProviderID": 1,
    "OperatorID": 23,
    "OperatorsReference": "10409",
    "UsageTypeID": 1,
    "UsageCost": "Free",
    "AddressInfo": {
        "ID": 67857,
        "Title": "The Inn at Cooperstown - Tesla",
        "AddressLine1": "16 Chestnut St",
        "Town": "Cooperstown",
        "StateOrProvince": "NY",
        "Postcode": "13326",
        "CountryID": 2,
        "Latitude": 42.70163,
        "Longitude": -74.926982,
        "ContactTelephone1": "607-547-5756  877-798-3752",
        "AccessComments": "24 hours daily; for Tesla use only; see front desk for access",
        "RelatedURL": "http://www.teslamotors.com/supercharger",
        "DistanceUnit": 0
    },
    "Connections": [
        {
            "ID": 93016,
            "ConnectionTypeID": 30,
            "StatusTypeID": 50,
            "LevelID": 2,
            "Amps": 16,
            "Voltage": 230,
            "PowerKW": 16,
            "CurrentTypeID": 10,
            "Quantity": 1
        }
    ],
    "NumberOfPoints": 1,
    "StatusTypeID": 50,
    "DateLastStatusUpdate": "2017-01-26T04:55:00Z",
    "DataQualityLevel": 3,
    "DateCreated": "2016-05-29T02:05:00Z",
    "SubmissionStatusTypeID": 100
}