{
    "IsRecentlyVerified": false,
    "ID": 79556,
    "UUID": "FF09D2BB-2D4C-4E29-B7A9-0A537669CC9C",
    "DataProviderID": 1,
    "OperatorID": 23,
    "OperatorsReference": "14633",
    "UsageTypeID": 6,
    "UsageCost": "Free",
    "AddressInfo": {
        "ID": 79902,
        "Title": "Brancliff Inn C.1859",
        "AddressLine1": "40 Platoff St",
        "Town": "Niagara on the Lake",
        "StateOrProvince": "ON",
        "Postcode": "L0S 1J0",
        "CountryID": 44,
        "Latitude": 43.252941,
        "Longitude": -79.070499,
        "ContactTelephone1": "(905) 468-8800",
        "DistanceUnit": 0
    },
    "Connections": [
        {
            "ID": 114196,
            "ConnectionTypeID": 30,
            "StatusTypeID": 50,
            "LevelID": 2,
            "PowerKW": 8,
            "CurrentTypeID": 10,
            "Quantity": 1
        }
    ],
    "NumberOfPoints": 1,
    "GeneralComments": "1 Tesla Connector, up to 8kW.Available for patrons only. Please see front desk.",
    "StatusTypeID": 50,
    "DateLastStatusUpdate": "2017-07-13T14:59:00Z",
    "DataQualityLevel": 1,
    "DateCreated": "2017-01-29T17:56:00Z",
    "SubmissionStatusTypeID": 200
}