{
    "IsRecentlyVerified": false,
    "ID": 113474,
    "UUID": "C98935BB-867D-45F4-8E86-7D63DA37924C",
    "DataProviderID": 1,
    "UsageTypeID": 0,
    "AddressInfo": {
        "ID": 113820,
        "Title": "Centro Commerciale Via Dublino",
        "AddressLine1": "Via Dublino",
        "Town": "Oristano",
        "StateOrProvince": "OR",
        "Postcode": "09170",
        "CountryID": 112,
        "Latitude": 39.88956582835088,
        "Longitude": 8.599974082079575,
        "DistanceUnit": 0
    },
    "Connections": [
        {
            "ID": 159874,
            "ConnectionTypeID": 25,
            "StatusTypeID": 50,
            "LevelID": 2,
            "Amps": 32,
            "Voltage": 240,
            "PowerKW": 22,
            "CurrentTypeID": 20,
            "Quantity": 4
        }
    ],
    "NumberOfPoints": 4,
    "StatusTypeID": 50,
    "DateLastStatusUpdate": "2018-12-13T15:10:00Z",
    "DataQualityLevel": 1,
    "DateCreated": "2018-12-13T15:10:00Z",
    "SubmissionStatusTypeID": 200
}