{
    "IsRecentlyVerified": false,
    "ID": 168620,
    "UUID": "2D6C59F6-592A-4DCC-84B1-5CF59306CCC1",
    "DataProviderID": 1,
    "OperatorID": 21,
    "UsageTypeID": 4,
    "UsageCost": "Mobi.E compatible card",
    "AddressInfo": {
        "ID": 168979,
        "Title": "MTS-00011",
        "AddressLine1": "BP Via Norte",
        "Town": "Matosinhos",
        "StateOrProvince": "Porto",
        "Postcode": "4465",
        "CountryID": 180,
        "Latitude": 41.186124963840285,
        "Longitude": -8.62431045866947,
        "DistanceUnit": 0
    },
    "Connections": [
        {
            "ID": 256146,
            "ConnectionTypeID": 2,
            "StatusTypeID": 50,
            "LevelID": 3,
            "Amps": 120,
            "Voltage": 500,
            "PowerKW": 50,
            "CurrentTypeID": 30,
            "Quantity": 1
        },
        {
            "ID": 256147,
            "ConnectionTypeID": 33,
            "StatusTypeID": 50,
            "LevelID": 3,
            "Amps": 125,
            "Voltage": 500,
            "PowerKW": 50,
            "CurrentTypeID": 30,
            "Quantity": 1
        },
        {
            "ID": 256148,
            "ConnectionTypeID": 1036,
            "StatusTypeID": 50,
            "LevelID": 3,
            "Amps": 63,
            "Voltage": 400,
            "PowerKW": 43,
            "CurrentTypeID": 20,
            "Quantity": 1
        }
    ],
    "NumberOfPoints": 2,
    "StatusTypeID": 50,
    "DateLastStatusUpdate": "2020-10-02T19:21:00Z",
    "DataQualityLevel": 1,
    "DateCreated": "2020-10-02T19:21:00Z",
    "SubmissionStatusTypeID": 200
}