{
    "IsRecentlyVerified": false,
    "ID": 33600,
    "UUID": "AA128D69-6B63-49FA-9FA5-AD737E2C0AEF",
    "DataProviderID": 26,
    "DataProvidersReference": "34347",
    "OperatorID": 73,
    "OperatorsReference": "EV-Box EVB-P1305025",
    "UsageCost": "0.00 jaarabonnement",
    "AddressInfo": {
        "ID": 33946,
        "Title": "Havenweg 20c",
        "AddressLine1": "Havenweg 20c",
        "Town": "Waalwijk",
        "Postcode": "5145 NJ",
        "CountryID": 159,
        "Latitude": 51.69361,
        "Longitude": 5.04623,
        "RelatedURL": "http://www.ev-box.nl",
        "DistanceUnit": 0
    },
    "Connections": [
        {
            "ID": 37111,
            "ConnectionTypeID": 25,
            "LevelID": 2,
            "PowerKW": 5,
            "CurrentTypeID": 10
        },
        {
            "ID": 46858,
            "ConnectionTypeID": 25,
            "LevelID": 2,
            "PowerKW": 5,
            "CurrentTypeID": 10
        }
    ],
    "NumberOfPoints": 1,
    "StatusTypeID": 50,
    "DateLastStatusUpdate": "2016-06-04T02:40:00Z",
    "DataQualityLevel": 3,
    "DateCreated": "2015-01-09T06:04:00Z",
    "SubmissionStatusTypeID": 100
}