{
    "IsRecentlyVerified": false,
    "ID": 112788,
    "UUID": "CA66CC53-D268-433F-924D-B21EEDA90FE9",
    "DataProviderID": 1,
    "OperatorID": 47,
    "UsageTypeID": 4,
    "UsageCost": "£0.33/kWh",
    "AddressInfo": {
        "ID": 113134,
        "Title": "Sandfield Road",
        "AddressLine1": "Sandfield Road",
        "AddressLine2": "Headington",
        "Town": "Oxford",
        "Postcode": "OX3 7RQ",
        "CountryID": 1,
        "Latitude": 51.758372153305594,
        "Longitude": -1.2171042904895635,
        "DistanceUnit": 0
    },
    "Connections": [
        {
            "ID": 158827,
            "ConnectionTypeID": 25,
            "StatusTypeID": 50,
            "LevelID": 2,
            "Amps": 32,
            "Voltage": 230,
            "PowerKW": 7.4,
            "CurrentTypeID": 10,
            "Quantity": 2
        }
    ],
    "NumberOfPoints": 2,
    "StatusTypeID": 50,
    "DateLastStatusUpdate": "2018-11-14T17:28:00Z",
    "DataQualityLevel": 1,
    "DateCreated": "2018-11-14T17:28:00Z",
    "SubmissionStatusTypeID": 200
}