{
    "IsRecentlyVerified": false,
    "ID": 66627,
    "UUID": "9888E935-C245-4307-8FCB-8B911824F0B7",
    "DataProviderID": 1,
    "OperatorID": 103,
    "UsageTypeID": 4,
    "AddressInfo": {
        "ID": 66973,
        "Title": "Gewerbepark Koblenz",
        "AddressLine1": "Carl-Zeiss-Straße 10",
        "Town": "Koblenz",
        "StateOrProvince": "Koblenz",
        "Postcode": "56070",
        "CountryID": 87,
        "Latitude": 50.3880807,
        "Longitude": 7.557509600000003,
        "AccessComments": "24/7 nutzbare Schnellladesäule mit The New Motion Ladekarte, PlugSurfing Keyhanger, intercharge direct und ChargeNow.",
        "RelatedURL": "http://www.allego.eu/",
        "DistanceUnit": 0
    },
    "Connections": [
        {
            "ID": 92051,
            "ConnectionTypeID": 2,
            "StatusTypeID": 50,
            "LevelID": 3,
            "PowerKW": 50,
            "CurrentTypeID": 30,
            "Quantity": 1
        },
        {
            "ID": 92052,
            "ConnectionTypeID": 33,
            "StatusTypeID": 50,
            "LevelID": 3,
            "PowerKW": 50,
            "CurrentTypeID": 30,
            "Quantity": 1
        },
        {
            "ID": 92053,
            "ConnectionTypeID": 25,
            "StatusTypeID": 50,
            "LevelID": 3,
            "Amps": 63,
            "Voltage": 400,
            "PowerKW": 43,
            "CurrentTypeID": 20,
            "Quantity": 1
        }
    ],
    "NumberOfPoints": 3,
    "StatusTypeID": 50,
    "DateLastStatusUpdate": "2016-05-24T07:19:00Z",
    "DataQualityLevel": 1,
    "DateCreated": "2016-05-24T07:19:00Z",
    "SubmissionStatusTypeID": 200
}