{
    "IsRecentlyVerified": false,
    "ID": 88931,
    "UUID": "FA913AD8-2E7C-44D3-B35F-E7733B71FEFE",
    "DataProviderID": 1,
    "OperatorID": 156,
    "UsageTypeID": 4,
    "AddressInfo": {
        "ID": 89277,
        "Title": "Stadtverwaltung ",
        "AddressLine1": "Schlossplatz 1",
        "Town": "Eislingen-Fils",
        "StateOrProvince": "Gemeindeverwaltungsverband Eislingen-Ottenbach-Salach",
        "Postcode": "73054",
        "CountryID": 87,
        "Latitude": 48.69672010000001,
        "Longitude": 9.706849899999952,
        "RelatedURL": "http://www.heldele.de/",
        "DistanceUnit": 0
    },
    "Connections": [
        {
            "ID": 126202,
            "ConnectionTypeID": 25,
            "LevelID": 2,
            "Amps": 32,
            "Voltage": 400,
            "PowerKW": 22,
            "Quantity": 2
        }
    ],
    "NumberOfPoints": 2,
    "StatusTypeID": 50,
    "DateLastStatusUpdate": "2017-06-12T13:32:00Z",
    "DataQualityLevel": 1,
    "DateCreated": "2017-06-12T13:32:00Z",
    "SubmissionStatusTypeID": 200
}