{
    "UserComments": [
        {
            "ID": 14734,
            "ChargePointID": 23123,
            "CommentTypeID": 100,
            "UserName": "Anthony B",
            "Comment": "Do you know when this location will be up and running (Auchan Chatillion Sur Seine). Asked in the supermarket they did not seem to know anything about it.",
            "DateCreated": "2016-12-24T16:42:47.49Z",
            "User": {
                "ID": 12140,
                "Username": "Anthony B"
            },
            "CheckinStatusTypeID": 130
        }
    ],
    "IsRecentlyVerified": false,
    "ID": 23123,
    "UUID": "BE794A12-E752-4ED6-90F3-5BD423740744",
    "DataProviderID": 1,
    "OperatorID": 62,
    "UsageTypeID": 4,
    "AddressInfo": {
        "ID": 23468,
        "Title": "Auchan CHATILLON SUR SEINE",
        "AddressLine1": "D 971",
        "Town": "Montliot-et-Courcelles",
        "StateOrProvince": "Montbard",
        "Postcode": "21400",
        "CountryID": 80,
        "Latitude": 47.8801174370925,
        "Longitude": 4.56317118893275,
        "ContactTelephone1": "03.80.91.01.01",
        "RelatedURL": "http://www.auchan.fr/magasins/chatillon-sur-seine/192/informations-pratiques/#",
        "DistanceUnit": 0
    },
    "Connections": [
        {
            "ID": 24852,
            "ConnectionTypeID": 2,
            "LevelID": 3,
            "CurrentTypeID": 30,
            "Quantity": 1
        },
        {
            "ID": 24853,
            "ConnectionTypeID": 25,
            "LevelID": 3,
            "CurrentTypeID": 20,
            "Quantity": 1
        }
    ],
    "NumberOfPoints": 1,
    "StatusTypeID": 150,
    "DateLastStatusUpdate": "2016-12-24T16:43:00Z",
    "DataQualityLevel": 1,
    "DateCreated": "2014-04-15T14:17:00Z",
    "SubmissionStatusTypeID": 200
}