{
    "IsRecentlyVerified": false,
    "ID": 87557,
    "UUID": "CF9FD0D6-95E8-408B-B18C-40C62C0FD1A3",
    "DataProviderID": 1,
    "OperatorID": 3315,
    "OperatorsReference": "51349",
    "UsageTypeID": 4,
    "UsageCost": "Free",
    "AddressInfo": {
        "ID": 87903,
        "Title": "Peel St. Car Club, Glasgow",
        "AddressLine1": "Peel Street",
        "Town": "Glasgow",
        "Postcode": "G11 5LX",
        "CountryID": 1,
        "Latitude": 55.87094,
        "Longitude": -4.30968,
        "DistanceUnit": 0
    },
    "Connections": [
        {
            "ID": 124119,
            "ConnectionTypeID": 25,
            "StatusTypeID": 50,
            "LevelID": 2,
            "Amps": 32,
            "Voltage": 400,
            "PowerKW": 22,
            "CurrentTypeID": 20,
            "Quantity": 2
        }
    ],
    "NumberOfPoints": 2,
    "StatusTypeID": 50,
    "DateLastStatusUpdate": "2019-03-05T06:15:00Z",
    "DataQualityLevel": 1,
    "DateCreated": "2017-05-13T05:14:00Z",
    "SubmissionStatusTypeID": 200
}