{
    "IsRecentlyVerified": false,
    "ID": 158900,
    "UUID": "7B78B518-1FC8-4C10-BFAB-09AAE033A768",
    "DataProviderID": 2,
    "DataProvidersReference": "153131",
    "OperatorID": 89,
    "UsageTypeID": 1,
    "AddressInfo": {
        "ID": 159257,
        "Title": "7537 Balboa Blvd",
        "AddressLine1": "7537 Balboa Blvd",
        "Town": "Los Angeles",
        "StateOrProvince": "CA",
        "Postcode": "91406",
        "CountryID": 2,
        "Latitude": 34.20754449,
        "Longitude": -118.5012885,
        "ContactTelephone1": "888-356-8911",
        "AccessComments": "24 hours daily",
        "RelatedURL": "https://flo.ca/",
        "DistanceUnit": 0
    },
    "Connections": [
        {
            "ID": 228937,
            "ConnectionTypeID": 1,
            "LevelID": 2,
            "Amps": 16,
            "Voltage": 230,
            "PowerKW": 3.7,
            "CurrentTypeID": 10,
            "Quantity": 1
        }
    ],
    "StatusTypeID": 50,
    "DateLastStatusUpdate": "2020-06-26T02:57:00Z",
    "DataQualityLevel": 3,
    "DateCreated": "2020-06-26T02:57:00Z",
    "SubmissionStatusTypeID": 100
}