{
    "IsRecentlyVerified": false,
    "ID": 137180,
    "UUID": "9A7A2068-8672-418A-B883-17236901DB76",
    "DataProviderID": 2,
    "DataProvidersReference": "145535",
    "OperatorID": 5,
    "UsageTypeID": 1,
    "AddressInfo": {
        "ID": 137526,
        "Title": "KO'OLINA BC",
        "AddressLine1": "92-149 Waipahe Pl",
        "Town": "Kapolei",
        "StateOrProvince": "HI",
        "Postcode": "96707",
        "CountryID": 2,
        "Latitude": 21.330809,
        "Longitude": -158.12126,
        "ContactTelephone1": "888-758-4389",
        "AccessComments": "24 hours daily",
        "RelatedURL": "http://www.chargepoint.com/",
        "DistanceUnit": 0
    },
    "Connections": [
        {
            "ID": 192040,
            "ConnectionTypeID": 1,
            "LevelID": 2,
            "Amps": 16,
            "Voltage": 230,
            "PowerKW": 3,
            "CurrentTypeID": 10,
            "Quantity": 2
        }
    ],
    "StatusTypeID": 50,
    "DateLastStatusUpdate": "2019-12-24T09:04:00Z",
    "DataQualityLevel": 3,
    "DateCreated": "2019-12-24T09:04:00Z",
    "SubmissionStatusTypeID": 100
}