{
    "IsRecentlyVerified": false,
    "ID": 143760,
    "UUID": "69711436-0BF3-48C5-8BA3-BC729ADE49BD",
    "DataProviderID": 2,
    "DataProvidersReference": "123608",
    "UsageTypeID": 1,
    "AddressInfo": {
        "ID": 144112,
        "Title": "East Warren Community Market",
        "AddressLine1": "42 Roxbury Mountain Rd",
        "Town": "Warren",
        "StateOrProvince": "VT",
        "Postcode": "05674",
        "CountryID": 2,
        "Latitude": 44.108814,
        "Longitude": -72.819168,
        "ContactTelephone1": "802-496-6758",
        "AccessComments": "24 hours daily",
        "RelatedURL": "",
        "DistanceUnit": 0
    },
    "Connections": [
        {
            "ID": 200152,
            "ConnectionTypeID": 1,
            "LevelID": 2,
            "Amps": 16,
            "Voltage": 230,
            "PowerKW": 3.7,
            "CurrentTypeID": 10,
            "Quantity": 2
        }
    ],
    "StatusTypeID": 50,
    "DateLastStatusUpdate": "2020-06-26T03:07:00Z",
    "DataQualityLevel": 3,
    "DateCreated": "2019-12-24T09:22:00Z",
    "SubmissionStatusTypeID": 100
}