{
    "IsRecentlyVerified": false,
    "ID": 151915,
    "UUID": "2E1422CD-4B42-453A-AF28-E8EF48C340EB",
    "DataProviderID": 28,
    "DataProvidersReference": "FRS42P42187K1",
    "UsageTypeID": 5,
    "AddressInfo": {
        "ID": 152268,
        "Title": "place Gabriel Péri",
        "AddressLine1": "25 place gabriel péri",
        "CountryID": 80,
        "Latitude": 46.02885,
        "Longitude": 4.065983,
        "AccessComments": "24/24 - 7/7",
        "DistanceUnit": 0
    },
    "Connections": [
        {
            "ID": 212409,
            "ConnectionTypeID": 28,
            "StatusTypeID": 50,
            "LevelID": 2,
            "PowerKW": 22,
            "CurrentTypeID": 10
        },
        {
            "ID": 212410,
            "ConnectionTypeID": 1036,
            "StatusTypeID": 50,
            "LevelID": 2,
            "PowerKW": 22,
            "CurrentTypeID": 20
        },
        {
            "ID": 245238,
            "ConnectionTypeID": 28,
            "StatusTypeID": 50,
            "LevelID": 2,
            "PowerKW": 22,
            "CurrentTypeID": 10
        },
        {
            "ID": 245239,
            "ConnectionTypeID": 1036,
            "StatusTypeID": 50,
            "LevelID": 2,
            "PowerKW": 22,
            "CurrentTypeID": 20
        }
    ],
    "GeneralComments": "En service",
    "StatusTypeID": 50,
    "DateLastStatusUpdate": "2020-08-27T05:12:00Z",
    "DataQualityLevel": 2,
    "DateCreated": "2020-03-15T10:53:00Z",
    "SubmissionStatusTypeID": 100
}