{
    "IsRecentlyVerified": false,
    "ID": 119541,
    "UUID": "54A3B56D-C9F3-4422-9D26-BB41501FB67B",
    "DataProviderID": 2,
    "DataProvidersReference": "96751",
    "OperatorID": 9,
    "UsageTypeID": 1,
    "AddressInfo": {
        "ID": 119887,
        "Title": "12th Street & Drexel Avenue Garage",
        "AddressLine1": "512 12th Street",
        "Town": "Miami Beach",
        "StateOrProvince": "FL",
        "Postcode": "33139",
        "CountryID": 2,
        "Latitude": 25.7828,
        "Longitude": -80.133,
        "ContactTelephone1": "888-998-2546",
        "AccessComments": "MON: 24 hours | TUE: 24 hours | WED: 24 hours | THU: 24 hours | FRI: 24 hours | SAT: 24 hours | SUN: 24 hours",
        "RelatedURL": "http://www.blinkcharging.com/",
        "DistanceUnit": 0
    },
    "Connections": [
        {
            "ID": 168815,
            "ConnectionTypeID": 1,
            "LevelID": 2,
            "Amps": 16,
            "Voltage": 230,
            "PowerKW": 3.7,
            "CurrentTypeID": 10,
            "Quantity": 2
        }
    ],
    "DateLastStatusUpdate": "2020-06-26T02:52:00Z",
    "DataQualityLevel": 3,
    "DateCreated": "2019-04-01T04:59:00Z",
    "SubmissionStatusTypeID": 100
}