{
    "IsRecentlyVerified": false,
    "ID": 122634,
    "UUID": "BD824BF4-8ADF-4999-9D58-0194671394A8",
    "DataProviderID": 2,
    "DataProvidersReference": "61812",
    "OperatorID": 5,
    "UsageTypeID": 1,
    "AddressInfo": {
        "ID": 122980,
        "Title": "TANGER COMMERCE",
        "AddressLine1": "800 Steven B Tanger Blvd",
        "Town": "Commerce",
        "StateOrProvince": "GA",
        "Postcode": "30529",
        "CountryID": 2,
        "Latitude": 34.25078,
        "Longitude": -83.472017,
        "ContactTelephone1": "888-758-4389",
        "AccessComments": "24 hours daily",
        "RelatedURL": "http://www.chargepoint.com/",
        "DistanceUnit": 0
    },
    "Connections": [
        {
            "ID": 172539,
            "ConnectionTypeID": 1,
            "LevelID": 2,
            "Amps": 16,
            "Voltage": 230,
            "PowerKW": 3,
            "CurrentTypeID": 10,
            "Quantity": 4
        }
    ],
    "DateLastStatusUpdate": "2019-12-24T09:12:00Z",
    "DataQualityLevel": 3,
    "DateCreated": "2019-04-06T05:03:00Z",
    "SubmissionStatusTypeID": 100
}