{
    "IsRecentlyVerified": false,
    "ID": 176603,
    "UUID": "C906FD5B-2B43-46D4-A01C-0FB17DC1749A",
    "DataProviderID": 29,
    "DataProvidersReference": "7664",
    "AddressInfo": {
        "ID": 176962,
        "Title": "Friedrich-Ebert-Straße 51",
        "AddressLine1": "Friedrich-Ebert-Straße 51",
        "Town": "Salzgitter",
        "Postcode": "38259",
        "CountryID": 87,
        "Latitude": 52.042,
        "Longitude": 10.388,
        "DistanceUnit": 0
    },
    "Connections": [
        {
            "ID": 274705,
            "ConnectionTypeID": 25,
            "StatusTypeID": 50,
            "LevelID": 2,
            "PowerKW": 22,
            "CurrentTypeID": 20
        },
        {
            "ID": 274706,
            "ConnectionTypeID": 25,
            "StatusTypeID": 50,
            "LevelID": 2,
            "PowerKW": 22,
            "CurrentTypeID": 20
        }
    ],
    "StatusTypeID": 0,
    "DateLastStatusUpdate": "2021-07-12T02:48:00Z",
    "MetadataValues": [
        {
            "ID": 8898,
            "MetadataFieldID": 4,
            "ItemValue": "Data from the German chargepoint registry provided by Bundesnetzagentur.de under the CC-BY 4.0 license"
        }
    ],
    "DataQualityLevel": 3,
    "DateCreated": "2021-07-08T09:48:00Z",
    "SubmissionStatusTypeID": 100
}