{
    "IsRecentlyVerified": false,
    "ID": 28090,
    "UUID": "B431A230-2E56-40A9-831F-2A6D28D4431F",
    "DataProviderID": 2,
    "DataProvidersReference": "64200",
    "OperatorID": 5,
    "UsageTypeID": 1,
    "AddressInfo": {
        "ID": 28436,
        "Title": "HUNT VALLEY VW",
        "AddressLine1": "9800 York Rd",
        "Town": "Cockeysville",
        "StateOrProvince": "MD",
        "Postcode": "21030",
        "CountryID": 2,
        "Latitude": 39.4588889,
        "Longitude": -76.6347222,
        "ContactTelephone1": "888-758-4389",
        "AccessComments": "24 hours daily",
        "RelatedURL": "http://www.chargepoint.com/",
        "DistanceUnit": 0
    },
    "Connections": [
        {
            "ID": 30870,
            "ConnectionTypeID": 1,
            "LevelID": 2,
            "Amps": 16,
            "Voltage": 230,
            "PowerKW": 3,
            "CurrentTypeID": 10,
            "Quantity": 2
        }
    ],
    "DateLastStatusUpdate": "2019-04-06T04:03:00Z",
    "DataQualityLevel": 3,
    "DateCreated": "2014-11-28T03:38:00Z",
    "SubmissionStatusTypeID": 100
}