{
    "IsRecentlyVerified": false,
    "ID": 146186,
    "UUID": "49ECC130-6C93-43A1-B01A-EB0B53FCA079",
    "DataProviderID": 1,
    "OperatorID": 3315,
    "OperatorsReference": "52160",
    "UsageTypeID": 4,
    "UsageCost": "£0.38 fixed charge and £0.15 per kWh",
    "AddressInfo": {
        "ID": 146538,
        "Title": "East District Housing Office, Dundee",
        "AddressLine1": "189 Pitkerro Road",
        "Town": "Dundee",
        "Postcode": "DD4 8ES",
        "CountryID": 1,
        "Latitude": 56.482168,
        "Longitude": -2.935639,
        "DistanceUnit": 0
    },
    "Connections": [
        {
            "ID": 203126,
            "ConnectionTypeID": 25,
            "StatusTypeID": 50,
            "LevelID": 2,
            "Amps": 32,
            "Voltage": 400,
            "PowerKW": 22,
            "CurrentTypeID": 20,
            "Quantity": 2
        }
    ],
    "NumberOfPoints": 2,
    "StatusTypeID": 50,
    "DateLastStatusUpdate": "2020-02-18T06:16:00Z",
    "DataQualityLevel": 1,
    "DateCreated": "2020-01-02T08:26:00Z",
    "SubmissionStatusTypeID": 200
}