{
    "IsRecentlyVerified": false,
    "ID": 96938,
    "UUID": "6F912A7E-63A6-4F07-88FF-5848AD68003A",
    "DataProviderID": 1,
    "OperatorID": 45,
    "UsageTypeID": 4,
    "AddressInfo": {
        "ID": 97284,
        "Title": "Wilhelm F. Schmitz GmbH",
        "AddressLine1": "An der Lokrichthalle 7",
        "Town": "Trier",
        "StateOrProvince": "Trier",
        "Postcode": "54294",
        "CountryID": 87,
        "Latitude": 49.7434604,
        "Longitude": 6.618726599999945,
        "ContactTelephone1": "+49 651 827780",
        "AccessComments": "Schlüssel zur Aktivierung bitte am Empfang abholen; die Öffnungszeiten sind von Mo-Do 07:30-16:30, Fr 07:30-13:30.",
        "RelatedURL": "http://www.elektro-schmitz.de/",
        "DistanceUnit": 0
    },
    "Connections": [
        {
            "ID": 137319,
            "ConnectionTypeID": 25,
            "StatusTypeID": 50,
            "LevelID": 2,
            "Amps": 32,
            "Voltage": 400,
            "PowerKW": 22,
            "CurrentTypeID": 20,
            "Quantity": 1
        }
    ],
    "NumberOfPoints": 1,
    "StatusTypeID": 50,
    "DateLastStatusUpdate": "2018-01-03T08:26:00Z",
    "DataQualityLevel": 1,
    "DateCreated": "2018-01-03T08:26:00Z",
    "SubmissionStatusTypeID": 200
}