{
    "UserComments": [
        {
            "ID": 24228,
            "ChargePointID": 148937,
            "CommentTypeID": 50,
            "UserName": "Surfer79",
            "Comment": "off line from 2 month",
            "Rating": 1,
            "DateCreated": "2021-04-23T20:38:46.41Z",
            "User": {
                "ID": 27407,
                "Username": "Surfer79"
            },
            "CheckinStatusTypeID": 120,
            "IsActionedByEditor": false
        },
        {
            "ID": 22471,
            "ChargePointID": 148937,
            "CommentTypeID": 10,
            "UserName": "ForumElettrico.it",
            "Comment": "Il numero da chiamare è un verde di GardaUno, che sembra aver preso la gestione delle colonnine. Leggi la recensione completa qui > https://www.forumelettrico.it/forum/colonnina-22-kw-via-porta-s-zeno-verona-t7235.html",
            "RelatedURL": "https://www.forumelettrico.it/forum/colonnina-22-kw-via-porta-s-zeno-verona-t7235.html",
            "DateCreated": "2020-04-21T12:33:34.557Z",
            "User": {
                "ID": 11749,
                "Username": "ForumElettrico.it"
            },
            "CheckinStatusTypeID": 10,
            "IsActionedByEditor": false
        },
        {
            "ID": 22142,
            "ChargePointID": 148937,
            "CommentTypeID": 10,
            "UserName": "AGSM Verona",
            "Rating": 5,
            "DateCreated": "2020-02-13T13:05:27.95Z",
            "User": {
                "ID": 24996,
                "Username": "AGSM Verona"
            },
            "CheckinStatusTypeID": 10,
            "IsActionedByEditor": true
        }
    ],
    "MediaItems": [
        {
            "ID": 22052,
            "ChargePointID": 148937,
            "ItemURL": "https://s3-ap-southeast-2.amazonaws.com/openchargemap/images/IT/OCM148937/OCM-148937.orig.2020042112343083.jpg",
            "ItemThumbnailURL": "https://s3-ap-southeast-2.amazonaws.com/openchargemap/images/IT/OCM148937/OCM-148937.thmb.2020042112343083.jpg",
            "Comment": "",
            "IsEnabled": true,
            "IsVideo": false,
            "IsFeaturedItem": false,
            "IsExternalResource": false,
            "User": {
                "ID": 11749,
                "Username": "ForumElettrico.it"
            },
            "DateCreated": "2020-04-21T12:35:00Z"
        },
        {
            "ID": 22047,
            "ChargePointID": 148937,
            "ItemURL": "https://s3-ap-southeast-2.amazonaws.com/openchargemap/images/IT/OCM148937/OCM-148937.orig.2020042112334769.jpg",
            "ItemThumbnailURL": "https://s3-ap-southeast-2.amazonaws.com/openchargemap/images/IT/OCM148937/OCM-148937.thmb.2020042112334769.jpg",
            "Comment": "",
            "IsEnabled": true,
            "IsVideo": false,
            "IsFeaturedItem": false,
            "IsExternalResource": false,
            "User": {
                "ID": 11749,
                "Username": "ForumElettrico.it"
            },
            "DateCreated": "2020-04-21T12:34:00Z"
        },
        {
            "ID": 22048,
            "ChargePointID": 148937,
            "ItemURL": "https://s3-ap-southeast-2.amazonaws.com/openchargemap/images/IT/OCM148937/OCM-148937.orig.2020042112335422.jpg",
            "ItemThumbnailURL": "https://s3-ap-southeast-2.amazonaws.com/openchargemap/images/IT/OCM148937/OCM-148937.thmb.2020042112335422.jpg",
            "Comment": "",
            "IsEnabled": true,
            "IsVideo": false,
            "IsFeaturedItem": false,
            "IsExternalResource": false,
            "User": {
                "ID": 11749,
                "Username": "ForumElettrico.it"
            },
            "DateCreated": "2020-04-21T12:34:00Z"
        },
        {
            "ID": 22049,
            "ChargePointID": 148937,
            "ItemURL": "https://s3-ap-southeast-2.amazonaws.com/openchargemap/images/IT/OCM148937/OCM-148937.orig.2020042112340306.jpg",
            "ItemThumbnailURL": "https://s3-ap-southeast-2.amazonaws.com/openchargemap/images/IT/OCM148937/OCM-148937.thmb.2020042112340306.jpg",
            "Comment": "",
            "IsEnabled": true,
            "IsVideo": false,
            "IsFeaturedItem": false,
            "IsExternalResource": false,
            "User": {
                "ID": 11749,
                "Username": "ForumElettrico.it"
            },
            "DateCreated": "2020-04-21T12:34:00Z"
        },
        {
            "ID": 22050,
            "ChargePointID": 148937,
            "ItemURL": "https://s3-ap-southeast-2.amazonaws.com/openchargemap/images/IT/OCM148937/OCM-148937.orig.2020042112341084.jpg",
            "ItemThumbnailURL": "https://s3-ap-southeast-2.amazonaws.com/openchargemap/images/IT/OCM148937/OCM-148937.thmb.2020042112341084.jpg",
            "Comment": "",
            "IsEnabled": true,
            "IsVideo": false,
            "IsFeaturedItem": false,
            "IsExternalResource": false,
            "User": {
                "ID": 11749,
                "Username": "ForumElettrico.it"
            },
            "DateCreated": "2020-04-21T12:34:00Z"
        },
        {
            "ID": 22051,
            "ChargePointID": 148937,
            "ItemURL": "https://s3-ap-southeast-2.amazonaws.com/openchargemap/images/IT/OCM148937/OCM-148937.orig.2020042112342301.jpg",
            "ItemThumbnailURL": "https://s3-ap-southeast-2.amazonaws.com/openchargemap/images/IT/OCM148937/OCM-148937.thmb.2020042112342301.jpg",
            "Comment": "",
            "IsEnabled": true,
            "IsVideo": false,
            "IsFeaturedItem": false,
            "IsExternalResource": false,
            "User": {
                "ID": 11749,
                "Username": "ForumElettrico.it"
            },
            "DateCreated": "2020-04-21T12:34:00Z"
        },
        {
            "ID": 21223,
            "ChargePointID": 148937,
            "ItemURL": "https://s3-ap-southeast-2.amazonaws.com/openchargemap/images/IT/OCM148937/OCM-148937.orig.2020021313065171.jpg",
            "ItemThumbnailURL": "https://s3-ap-southeast-2.amazonaws.com/openchargemap/images/IT/OCM148937/OCM-148937.thmb.2020021313065171.jpg",
            "Comment": "",
            "IsEnabled": true,
            "IsVideo": false,
            "IsFeaturedItem": false,
            "IsExternalResource": false,
            "User": {
                "ID": 24996,
                "Username": "AGSM Verona"
            },
            "DateCreated": "2020-02-13T13:07:00Z"
        }
    ],
    "IsRecentlyVerified": false,
    "ID": 148937,
    "UUID": "2230C7E6-EAD5-4BDC-A9E0-F32EDA7BAD90",
    "DataProviderID": 1,
    "OperatorID": 118,
    "UsageTypeID": 1,
    "AddressInfo": {
        "ID": 149290,
        "Title": "AGSM - Via Porta San Zeno",
        "AddressLine1": "Via Porta San Zeno",
        "AddressLine2": "Centro Storico",
        "Town": "Verona",
        "StateOrProvince": "Verona",
        "Postcode": "37123",
        "CountryID": 112,
        "Latitude": 45.44241283789188,
        "Longitude": 10.976230329564032,
        "RelatedURL": "http://www.agsm.it",
        "DistanceUnit": 0
    },
    "Connections": [
        {
            "ID": 206820,
            "ConnectionTypeID": 25,
            "StatusTypeID": 50,
            "LevelID": 2,
            "Amps": 32,
            "Voltage": 400,
            "PowerKW": 22,
            "CurrentTypeID": 20,
            "Quantity": 1
        }
    ],
    "NumberOfPoints": 2,
    "StatusTypeID": 50,
    "DateLastStatusUpdate": "2021-04-23T20:39:00Z",
    "DataQualityLevel": 1,
    "DateCreated": "2020-02-13T13:05:00Z",
    "SubmissionStatusTypeID": 200
}