{
    "IsRecentlyVerified": false,
    "ID": 57310,
    "UUID": "D95461D0-DF61-43ED-8C06-BE142D2DCCEA",
    "DataProviderID": 1,
    "OperatorID": 23,
    "OperatorsReference": "20823",
    "UsageTypeID": 1,
    "UsageCost": "Free",
    "AddressInfo": {
        "ID": 57656,
        "Title": "Sorrel River Ranch Resort and Spa - Tesla",
        "AddressLine1": "Mile 17 Highway 128",
        "Town": "Moab",
        "StateOrProvince": "UT",
        "Postcode": "84532",
        "CountryID": 2,
        "Latitude": 38.698485,
        "Longitude": -109.397054,
        "ContactTelephone1": "435-259-4642  877-798-3752",
        "AccessComments": "24 hours daily; for Tesla use only; for guest use only; see front desk for access",
        "RelatedURL": "http://www.teslamotors.com/supercharger",
        "DistanceUnit": 0
    },
    "Connections": [
        {
            "ID": 72410,
            "ConnectionTypeID": 30,
            "StatusTypeID": 50,
            "LevelID": 2,
            "Amps": 16,
            "Voltage": 230,
            "PowerKW": 16,
            "CurrentTypeID": 10,
            "Quantity": 1
        }
    ],
    "NumberOfPoints": 1,
    "StatusTypeID": 50,
    "DateLastStatusUpdate": "2017-01-26T20:54:00Z",
    "DataQualityLevel": 3,
    "DateCreated": "2015-11-30T11:50:00Z",
    "SubmissionStatusTypeID": 100
}