{
    "IsRecentlyVerified": false,
    "ID": 142297,
    "UUID": "12693406-E2A8-4526-A424-3B5A74AD0B54",
    "DataProviderID": 2,
    "DataProvidersReference": "98673",
    "UsageTypeID": 2,
    "AddressInfo": {
        "ID": 142649,
        "Title": "Environmental Protection Agency",
        "AddressLine1": "2890 Woodbridge Ave",
        "Town": "Edison",
        "StateOrProvince": "NJ",
        "Postcode": "08837",
        "CountryID": 2,
        "Latitude": 40.515384,
        "Longitude": -74.357705,
        "ContactTelephone1": "",
        "AccessComments": "Fleet use only",
        "RelatedURL": "",
        "DistanceUnit": 0
    },
    "Connections": [
        {
            "ID": 198404,
            "ConnectionTypeID": 1,
            "LevelID": 2,
            "Amps": 16,
            "Voltage": 230,
            "PowerKW": 3.7,
            "CurrentTypeID": 10,
            "Quantity": 4
        }
    ],
    "StatusTypeID": 50,
    "DateLastStatusUpdate": "2020-06-26T03:03:00Z",
    "DataQualityLevel": 3,
    "DateCreated": "2019-12-24T09:17:00Z",
    "SubmissionStatusTypeID": 100
}