{
    "IsRecentlyVerified": false,
    "ID": 159727,
    "UUID": "D1A712D3-8CDE-4AA1-9A6A-80E72F3F9CA3",
    "DataProviderID": 2,
    "DataProvidersReference": "156233",
    "OperatorID": 5,
    "UsageTypeID": 1,
    "AddressInfo": {
        "ID": 160084,
        "Title": "MAYOR-BA",
        "AddressLine1": "330 Passaic St",
        "Town": "Passaic",
        "StateOrProvince": "NJ",
        "Postcode": "07055",
        "CountryID": 2,
        "Latitude": 40.8607282,
        "Longitude": -74.124145,
        "ContactTelephone1": "888-758-4389",
        "AccessComments": "24 hours daily",
        "RelatedURL": "http://www.chargepoint.com/",
        "DistanceUnit": 0
    },
    "Connections": [
        {
            "ID": 229935,
            "ConnectionTypeID": 1,
            "LevelID": 2,
            "Amps": 16,
            "Voltage": 230,
            "PowerKW": 3.7,
            "CurrentTypeID": 10,
            "Quantity": 1
        }
    ],
    "StatusTypeID": 50,
    "DateLastStatusUpdate": "2020-06-26T03:03:00Z",
    "DataQualityLevel": 3,
    "DateCreated": "2020-06-26T03:03:00Z",
    "SubmissionStatusTypeID": 100
}