{
    "IsRecentlyVerified": false,
    "ID": 57934,
    "UUID": "8BBA405C-D734-4FAB-9109-FF217FA85DE3",
    "DataProviderID": 1,
    "OperatorID": 234,
    "UsageTypeID": 4,
    "UsageCost": "0",
    "AddressInfo": {
        "ID": 58280,
        "Title": "N-Ergie Ladesäule",
        "AddressLine1": "Sperbersloher Straße 6",
        "Town": "Schwanstetten",
        "Postcode": "90596",
        "CountryID": 87,
        "Latitude": 49.31113,
        "Longitude": 11.12554,
        "AccessComments": "Rund um die Uhr (24/7) nutzbar. Umgebung:Restaurant ca. 200 m entfernt, verschiedene Einkaufsmögkichkeiten\r\n",
        "DistanceUnit": 0
    },
    "Connections": [
        {
            "ID": 73593,
            "ConnectionTypeID": 1036,
            "StatusTypeID": 50,
            "LevelID": 2,
            "Amps": 32,
            "Voltage": 400,
            "PowerKW": 22,
            "CurrentTypeID": 20,
            "Quantity": 2
        }
    ],
    "NumberOfPoints": 2,
    "StatusTypeID": 50,
    "DateLastStatusUpdate": "2016-09-15T09:31:00Z",
    "DataQualityLevel": 1,
    "DateCreated": "2015-12-29T12:20:00Z",
    "SubmissionStatusTypeID": 200
}