{
    "IsRecentlyVerified": false,
    "ID": 159687,
    "UUID": "45A32EEB-3056-4CD0-BE45-AF269BAAED67",
    "DataProviderID": 2,
    "DataProvidersReference": "154582",
    "OperatorID": 5,
    "UsageTypeID": 1,
    "AddressInfo": {
        "ID": 160044,
        "Title": "PANYNJ",
        "AddressLine1": "3 Journal Square Plaza PATH-JSTC",
        "Town": "Jersey City",
        "StateOrProvince": "NJ",
        "Postcode": "07306",
        "CountryID": 2,
        "Latitude": 40.732408,
        "Longitude": -74.065224,
        "ContactTelephone1": "888-758-4389",
        "AccessComments": "24 hours daily",
        "RelatedURL": "http://www.chargepoint.com/",
        "DistanceUnit": 0
    },
    "Connections": [
        {
            "ID": 229892,
            "ConnectionTypeID": 1,
            "LevelID": 2,
            "Amps": 16,
            "Voltage": 230,
            "PowerKW": 3.7,
            "CurrentTypeID": 10,
            "Quantity": 4
        }
    ],
    "StatusTypeID": 50,
    "DateLastStatusUpdate": "2020-06-26T03:03:00Z",
    "DataQualityLevel": 3,
    "DateCreated": "2020-06-26T03:03:00Z",
    "SubmissionStatusTypeID": 100
}