{
    "IsRecentlyVerified": false,
    "ID": 145178,
    "UUID": "CBE5B1B3-706F-41FA-83F6-D8FA9C17F097",
    "DataProviderID": 2,
    "DataProvidersReference": "123639",
    "UsageTypeID": 1,
    "AddressInfo": {
        "ID": 145530,
        "Title": "Lignite Energy Council",
        "AddressLine1": "1016 E Owens Ave",
        "Town": "Bismarck",
        "StateOrProvince": "ND",
        "Postcode": "58501",
        "CountryID": 2,
        "Latitude": 46.824795,
        "Longitude": -100.776383,
        "ContactTelephone1": "701-258-7117",
        "AccessComments": "8am-5pm M-F",
        "RelatedURL": "",
        "DistanceUnit": 0
    },
    "Connections": [
        {
            "ID": 201789,
            "ConnectionTypeID": 1,
            "LevelID": 2,
            "Amps": 16,
            "Voltage": 230,
            "PowerKW": 3.7,
            "CurrentTypeID": 10,
            "Quantity": 2
        }
    ],
    "StatusTypeID": 50,
    "DateLastStatusUpdate": "2020-06-26T03:10:00Z",
    "DataQualityLevel": 3,
    "DateCreated": "2019-12-24T09:24:00Z",
    "SubmissionStatusTypeID": 100
}