{
    "IsRecentlyVerified": false,
    "ID": 120069,
    "UUID": "3D9FAF25-67D7-4D93-A5F2-27B53E29B6F6",
    "DataProviderID": 2,
    "DataProvidersReference": "71471",
    "OperatorID": 5,
    "UsageTypeID": 1,
    "AddressInfo": {
        "ID": 120415,
        "Title": "WHOLE FOODS JAX",
        "AddressLine1": "10601 San Jose Blvd",
        "Town": "Jacksonville",
        "StateOrProvince": "FL",
        "Postcode": "32257",
        "CountryID": 2,
        "Latitude": 30.1847136,
        "Longitude": -81.6255796,
        "ContactTelephone1": "888-758-4389",
        "AccessComments": "24 hours daily",
        "RelatedURL": "http://www.chargepoint.com/",
        "DistanceUnit": 0
    },
    "Connections": [
        {
            "ID": 169384,
            "ConnectionTypeID": 1,
            "LevelID": 2,
            "Amps": 16,
            "Voltage": 230,
            "PowerKW": 3,
            "CurrentTypeID": 10,
            "Quantity": 2
        }
    ],
    "DateLastStatusUpdate": "2019-04-01T04:59:00Z",
    "DataQualityLevel": 3,
    "DateCreated": "2019-04-01T04:59:00Z",
    "SubmissionStatusTypeID": 100
}