{
    "IsRecentlyVerified": false,
    "ID": 72589,
    "UUID": "20E3F6EF-B28E-495C-BEAD-3512C62A652B",
    "DataProviderID": 1,
    "OperatorID": 45,
    "UsageTypeID": 5,
    "UsageCost": "0,35€/kWh",
    "AddressInfo": {
        "ID": 72935,
        "Title": "Römerallee",
        "AddressLine1": "Römerallee 51",
        "Town": "Zülpich",
        "StateOrProvince": "Kreis Euskirchen",
        "Postcode": "53909",
        "CountryID": 87,
        "Latitude": 50.69784,
        "Longitude": 6.65773999999999,
        "AccessComments": "Täglich von 6-21Uhr nutzbar.",
        "DistanceUnit": 0
    },
    "Connections": [
        {
            "ID": 104056,
            "ConnectionTypeID": 25,
            "StatusTypeID": 50,
            "LevelID": 2,
            "Amps": 32,
            "Voltage": 400,
            "PowerKW": 22,
            "CurrentTypeID": 20,
            "Quantity": 1
        },
        {
            "ID": 104057,
            "ConnectionTypeID": 28,
            "StatusTypeID": 50,
            "LevelID": 2,
            "Amps": 16,
            "Voltage": 230,
            "PowerKW": 3.7,
            "CurrentTypeID": 10,
            "Quantity": 5
        }
    ],
    "NumberOfPoints": 2,
    "StatusTypeID": 50,
    "DateLastStatusUpdate": "2016-10-25T08:01:00Z",
    "DataQualityLevel": 1,
    "DateCreated": "2016-10-25T08:01:00Z",
    "SubmissionStatusTypeID": 200
}