{
    "IsRecentlyVerified": false,
    "ID": 37837,
    "UUID": "9CF6DBE3-E84C-4F83-9532-82D751ABF36D",
    "DataProviderID": 26,
    "DataProvidersReference": "25824",
    "OperatorID": 78,
    "OperatorsReference": "Essent EM-NL-00000363-02-00006",
    "UsageCost": "0.00 jaarabonnement",
    "AddressInfo": {
        "ID": 38183,
        "Title": "De Rijpgracht 34-1",
        "AddressLine1": "De Rijpgracht 34-1",
        "Town": "Amsterdam",
        "Postcode": "1055 VT",
        "CountryID": 159,
        "Latitude": 52.377476,
        "Longitude": 4.85997,
        "RelatedURL": "http://www.essent.nl",
        "DistanceUnit": 0
    },
    "Connections": [
        {
            "ID": 41348,
            "ConnectionTypeID": 25,
            "LevelID": 2,
            "PowerKW": 11,
            "CurrentTypeID": 10
        },
        {
            "ID": 49313,
            "ConnectionTypeID": 25,
            "LevelID": 2,
            "PowerKW": 11,
            "CurrentTypeID": 10
        }
    ],
    "NumberOfPoints": 1,
    "StatusTypeID": 50,
    "DateLastStatusUpdate": "2016-06-04T02:54:00Z",
    "DataQualityLevel": 3,
    "DateCreated": "2015-01-09T06:07:00Z",
    "SubmissionStatusTypeID": 100
}