{
    "IsRecentlyVerified": false,
    "ID": 139017,
    "UUID": "F453F736-4802-4A1B-95FB-99F2BA4C1DD9",
    "DataProviderID": 2,
    "DataProvidersReference": "95298",
    "OperatorID": 9,
    "UsageTypeID": 1,
    "AddressInfo": {
        "ID": 139369,
        "Title": "Chase Field",
        "AddressLine1": "377 E Jackson St",
        "Town": "Phoenix",
        "StateOrProvince": "AZ",
        "Postcode": "85003",
        "CountryID": 2,
        "Latitude": 33.445113,
        "Longitude": -112.06903,
        "ContactTelephone1": "888-998-2546",
        "AccessComments": "MON: 24 hours | TUE: 24 hours | WED: 24 hours | THU: 24 hours | FRI: 24 hours | SAT: 24 hours | SUN: 24 hours",
        "RelatedURL": "http://www.blinkcharging.com/",
        "DistanceUnit": 0
    },
    "Connections": [
        {
            "ID": 194262,
            "ConnectionTypeID": 1,
            "LevelID": 2,
            "Amps": 16,
            "Voltage": 230,
            "PowerKW": 3.7,
            "CurrentTypeID": 10,
            "Quantity": 3
        }
    ],
    "StatusTypeID": 50,
    "DateLastStatusUpdate": "2020-06-26T02:55:00Z",
    "DataQualityLevel": 3,
    "DateCreated": "2019-12-24T09:09:00Z",
    "SubmissionStatusTypeID": 100
}