{
    "IsRecentlyVerified": false,
    "ID": 61022,
    "UUID": "62EB50BB-B741-40FF-AB42-D6EDAA883176",
    "DataProviderID": 27,
    "DataProvidersReference": "316",
    "UsageTypeID": 1,
    "AddressInfo": {
        "ID": 61368,
        "Title": "Aparcamiento Plaza del Turia",
        "AddressLine1": "Plaza del Turia, 1-2",
        "Town": "Móstoles",
        "StateOrProvince": "Móstoles",
        "Postcode": "28934",
        "CountryID": 210,
        "Latitude": 40.316832,
        "Longitude": -3.873245,
        "ContactTelephone1": "ND",
        "RelatedURL": "http://blog.electromaps.com/2011/02...",
        "DistanceUnit": 0
    },
    "Connections": [
        {
            "ID": 77510,
            "ConnectionTypeID": 28
        },
        {
            "ID": 77511,
            "ConnectionTypeID": 28
        }
    ],
    "StatusTypeID": 0,
    "DateLastStatusUpdate": "2016-02-13T00:23:00Z",
    "DataQualityLevel": 3,
    "DateCreated": "2016-02-13T00:23:00Z",
    "SubmissionStatusTypeID": 200
}