{
    "IsRecentlyVerified": false,
    "ID": 158264,
    "UUID": "1C308FF1-9EE2-46BA-88B7-E40C844EC15D",
    "DataProviderID": 2,
    "DataProvidersReference": "153684",
    "OperatorID": 5,
    "UsageTypeID": 1,
    "AddressInfo": {
        "ID": 158618,
        "Title": "LARGO STATION",
        "AddressLine1": "401 Rosery Rd NE",
        "Town": "Largo",
        "StateOrProvince": "FL",
        "Postcode": "33770",
        "CountryID": 2,
        "Latitude": 27.9267826,
        "Longitude": -82.7817689,
        "ContactTelephone1": "888-758-4389",
        "AccessComments": "24 hours daily",
        "RelatedURL": "http://www.chargepoint.com/",
        "DistanceUnit": 0
    },
    "Connections": [
        {
            "ID": 228220,
            "ConnectionTypeID": 1,
            "LevelID": 2,
            "Amps": 16,
            "Voltage": 230,
            "PowerKW": 3.7,
            "CurrentTypeID": 10,
            "Quantity": 2
        }
    ],
    "StatusTypeID": 50,
    "DateLastStatusUpdate": "2020-06-26T02:52:00Z",
    "DataQualityLevel": 3,
    "DateCreated": "2020-06-26T02:52:00Z",
    "SubmissionStatusTypeID": 100
}