{
    "IsRecentlyVerified": false,
    "ID": 61438,
    "UUID": "32118241-00A1-49A8-AE38-A885B8CE468A",
    "DataProviderID": 1,
    "OperatorID": 45,
    "UsageTypeID": 1,
    "AddressInfo": {
        "ID": 61784,
        "Title": "DEW",
        "AddressLine1": "Rosental 27",
        "AddressLine2": "Mitte",
        "Town": "Dortmund",
        "StateOrProvince": "Dortmund",
        "Postcode": "44135",
        "CountryID": 87,
        "Latitude": 51.51139999999999,
        "Longitude": 7.470000000000027,
        "AccessComments": "Blaue überdachte Box am Parkplatz direkt hinter der Einfahrt links.",
        "DistanceUnit": 0
    },
    "Connections": [
        {
            "ID": 78241,
            "ConnectionTypeID": 16,
            "StatusTypeID": 50,
            "LevelID": 2,
            "Amps": 16,
            "Voltage": 230,
            "PowerKW": 3.7,
            "CurrentTypeID": 10,
            "Quantity": 1
        }
    ],
    "NumberOfPoints": 1,
    "StatusTypeID": 50,
    "DateLastStatusUpdate": "2016-02-29T07:56:00Z",
    "DataQualityLevel": 1,
    "DateCreated": "2016-02-29T07:56:00Z",
    "SubmissionStatusTypeID": 200
}