{
    "IsRecentlyVerified": false,
    "ID": 8584,
    "UUID": "1188AF69-7A41-4878-9547-4467B7EF4363",
    "DataProviderID": 15,
    "DataProvidersReference": "523",
    "OperatorID": 41,
    "UsageTypeID": 1,
    "AddressInfo": {
        "ID": 8481,
        "Title": "2200 Virginia Avenue",
        "AddressLine1": "2200 Virginia Avenue",
        "Town": "Santa Monica",
        "StateOrProvince": "California",
        "Postcode": "90404",
        "CountryID": 2,
        "Latitude": 34.02107,
        "Longitude": -118.4686,
        "ContactTelephone1": "310-458-8688",
        "RelatedURL": "http://carstations.com/523",
        "DistanceUnit": 0
    },
    "Connections": [
        {
            "ID": 6008,
            "ConnectionTypeID": 7,
            "Reference": "AVCON",
            "Quantity": 1
        },
        {
            "ID": 6220,
            "ConnectionTypeID": 1,
            "Reference": "J1772",
            "LevelID": 2
        }
    ],
    "NumberOfPoints": 3,
    "StatusTypeID": 50,
    "DateLastStatusUpdate": "2017-11-04T14:04:00Z",
    "DataQualityLevel": 1,
    "DateCreated": "2011-11-11T12:06:00Z",
    "SubmissionStatusTypeID": 100
}