{
    "IsRecentlyVerified": false,
    "ID": 115501,
    "UUID": "9CEAC388-BFDF-4CB8-8CA7-726B5DA4117C",
    "DataProviderID": 2,
    "DataProvidersReference": "113071",
    "OperatorID": 23,
    "UsageTypeID": 7,
    "AddressInfo": {
        "ID": 115847,
        "Title": "Spear Vineyards and Winery - Tesla Destination",
        "AddressLine1": "6700 CA-246",
        "Town": "Lompoc",
        "StateOrProvince": "CA",
        "Postcode": "93436",
        "CountryID": 2,
        "Latitude": 34.634794,
        "Longitude": -120.296983,
        "ContactTelephone1": "805-737-1829  877-798-3752",
        "AccessComments": "Available by appointment only; for Tesla use only",
        "RelatedURL": "https://www.tesla.com/destination-charging",
        "DistanceUnit": 0
    },
    "Connections": [
        {
            "ID": 162516,
            "ConnectionTypeID": 0,
            "LevelID": 2,
            "Amps": 16,
            "Voltage": 230,
            "PowerKW": 3,
            "CurrentTypeID": 10,
            "Quantity": 1
        }
    ],
    "DateLastStatusUpdate": "2019-04-06T04:02:00Z",
    "DataQualityLevel": 3,
    "DateCreated": "2019-02-11T07:13:00Z",
    "SubmissionStatusTypeID": 100
}