{
    "IsRecentlyVerified": false,
    "ID": 73866,
    "UUID": "AE7EBFB9-285A-4788-8218-E13EB352C34B",
    "DataProviderID": 1,
    "OperatorID": 89,
    "OperatorsReference": "CEA-10046",
    "UsageTypeID": 4,
    "UsageCost": "CAD 1.00/hour",
    "AddressInfo": {
        "ID": 74212,
        "Title": "St-Hubert-Jonquière",
        "AddressLine1": "3657 boul. Harvey",
        "Town": "Jonquiere",
        "StateOrProvince": "QC",
        "Postcode": "G7X 3A9",
        "CountryID": 44,
        "Latitude": 48.411383,
        "Longitude": -71.23709,
        "DistanceUnit": 0
    },
    "Connections": [
        {
            "ID": 106177,
            "ConnectionTypeID": 1,
            "StatusTypeID": 50,
            "LevelID": 2,
            "Amps": 32,
            "Voltage": 230,
            "PowerKW": 7,
            "CurrentTypeID": 10,
            "Quantity": 1
        }
    ],
    "NumberOfPoints": 1,
    "StatusTypeID": 50,
    "DateLastStatusUpdate": "2016-11-27T16:50:00Z",
    "DataQualityLevel": 1,
    "DateCreated": "2016-11-23T23:23:00Z",
    "SubmissionStatusTypeID": 200
}