{
    "IsRecentlyVerified": false,
    "ID": 62971,
    "UUID": "D21471FF-5CAB-467E-8397-884E6EEC2F2A",
    "DataProviderID": 26,
    "DataProvidersReference": "79582",
    "OperatorID": 178,
    "OperatorsReference": "EVnetNL PNB-ENO119",
    "UsageCost": "0.00 jaarabonnement",
    "AddressInfo": {
        "ID": 63317,
        "Title": "Ridder van Cuijkstraat 42",
        "AddressLine1": "Ridder van Cuijkstraat 42",
        "Town": "Boxtel",
        "Postcode": "5282 NN",
        "CountryID": 159,
        "Latitude": 51.590872,
        "Longitude": 5.3116,
        "ContactTelephone1": "0800-3522365",
        "RelatedURL": "http://www.evnet.nl",
        "DistanceUnit": 0
    },
    "Connections": [
        {
            "ID": 80057,
            "ConnectionTypeID": 25,
            "LevelID": 1,
            "PowerKW": 2.3,
            "CurrentTypeID": 10
        }
    ],
    "NumberOfPoints": 1,
    "StatusTypeID": 50,
    "DateLastStatusUpdate": "2016-06-04T02:39:00Z",
    "DataQualityLevel": 3,
    "DateCreated": "2016-03-03T12:29:00Z",
    "SubmissionStatusTypeID": 100
}