{
    "IsRecentlyVerified": false,
    "ID": 103328,
    "UUID": "FE61B269-CC5E-4B3A-B4FA-947D812D4C93",
    "DataProviderID": 1,
    "OperatorID": 3,
    "OperatorsReference": "PG-92624",
    "UsageTypeID": 6,
    "UsageCost": "1",
    "AddressInfo": {
        "ID": 103674,
        "Title": "JLR-Team Valley Landrover Service Centre",
        "AddressLine1": "Unit 2, Bamburgh Court",
        "AddressLine2": "Bensham",
        "Town": "Gateshead",
        "Postcode": "NE11 0TX",
        "CountryID": 1,
        "Latitude": 54.943215,
        "Longitude": -1.621617,
        "DistanceUnit": 0
    },
    "Connections": [
        {
            "ID": 145973,
            "ConnectionTypeID": 25,
            "StatusTypeID": 50,
            "LevelID": 2,
            "Amps": 32,
            "Voltage": 230,
            "PowerKW": 7,
            "CurrentTypeID": 10,
            "Quantity": 1
        }
    ],
    "NumberOfPoints": 2,
    "GeneralComments": "This is an open charge unit installed at the JLR - Team Valley Landrover Service Centre in Bamburgh Court, Gateshead",
    "StatusTypeID": 0,
    "DateLastStatusUpdate": "2020-01-14T09:51:00Z",
    "DataQualityLevel": 1,
    "DateCreated": "2018-04-27T05:32:00Z",
    "SubmissionStatusTypeID": 200
}