{
    "IsRecentlyVerified": false,
    "ID": 179280,
    "UUID": "8D0388F6-6296-47D3-BA46-BD990048EA71",
    "DataProviderID": 29,
    "DataProvidersReference": "16092",
    "AddressInfo": {
        "ID": 179639,
        "Title": "Obere Donaulände 5",
        "AddressLine1": "Obere Donaulände 5",
        "Town": "Passau",
        "Postcode": "94032",
        "CountryID": 87,
        "Latitude": 48.575,
        "Longitude": 13.45744,
        "DistanceUnit": 0
    },
    "Connections": [
        {
            "ID": 280871,
            "ConnectionTypeID": 25,
            "StatusTypeID": 50,
            "LevelID": 2,
            "PowerKW": 22,
            "CurrentTypeID": 20
        },
        {
            "ID": 280872,
            "ConnectionTypeID": 25,
            "StatusTypeID": 50,
            "LevelID": 2,
            "PowerKW": 22,
            "CurrentTypeID": 20
        }
    ],
    "StatusTypeID": 50,
    "DateLastStatusUpdate": "2021-07-12T02:41:00Z",
    "MetadataValues": [
        {
            "ID": 11574,
            "MetadataFieldID": 4,
            "ItemValue": "Data from the German chargepoint registry provided by Bundesnetzagentur.de under the CC-BY 4.0 license"
        }
    ],
    "DataQualityLevel": 3,
    "DateCreated": "2021-07-08T09:59:00Z",
    "SubmissionStatusTypeID": 100
}