{
    "IsRecentlyVerified": false,
    "ID": 68456,
    "UUID": "2E2D9692-6C1C-49E4-802B-8FFBC01CEEE7",
    "DataProviderID": 1,
    "OperatorID": 3315,
    "OperatorsReference": "51219",
    "UsageTypeID": 4,
    "UsageCost": "Free",
    "AddressInfo": {
        "ID": 68802,
        "Title": "Raigmore Hospital, Inverness",
        "AddressLine1": "Old Perth Road",
        "AddressLine2": "Inshes",
        "Town": "Inverness",
        "Postcode": "IV2 3FG",
        "CountryID": 1,
        "Latitude": 57.474964,
        "Longitude": -4.193695,
        "DistanceUnit": 0
    },
    "Connections": [
        {
            "ID": 95745,
            "ConnectionTypeID": 25,
            "StatusTypeID": 50,
            "LevelID": 2,
            "Amps": 32,
            "Voltage": 400,
            "PowerKW": 7,
            "CurrentTypeID": 20,
            "Quantity": 2
        },
        {
            "ID": 162164,
            "ConnectionTypeID": 1036,
            "StatusTypeID": 50,
            "LevelID": 3,
            "PowerKW": 43,
            "CurrentTypeID": 20,
            "Quantity": 1
        },
        {
            "ID": 162165,
            "ConnectionTypeID": 2,
            "StatusTypeID": 50,
            "LevelID": 3,
            "PowerKW": 50,
            "CurrentTypeID": 30,
            "Quantity": 1
        },
        {
            "ID": 162166,
            "ConnectionTypeID": 33,
            "StatusTypeID": 50,
            "LevelID": 3,
            "PowerKW": 50,
            "CurrentTypeID": 30,
            "Quantity": 1
        }
    ],
    "NumberOfPoints": 2,
    "StatusTypeID": 50,
    "DateLastStatusUpdate": "2020-03-26T06:17:00Z",
    "DataQualityLevel": 1,
    "DateCreated": "2016-06-08T00:31:00Z",
    "SubmissionStatusTypeID": 200
}