{
    "IsRecentlyVerified": false,
    "ID": 122835,
    "UUID": "264D5894-7DFB-4477-A37A-16609B2C614E",
    "DataProviderID": 2,
    "DataProvidersReference": "47094",
    "UsageTypeID": 7,
    "AddressInfo": {
        "ID": 123181,
        "Title": "Rock Hill Nissan",
        "AddressLine1": "550 Galleria Blvd",
        "Town": "Rock Hill",
        "StateOrProvince": "SC",
        "Postcode": "29730",
        "CountryID": 2,
        "Latitude": 34.945197,
        "Longitude": -80.969333,
        "ContactTelephone1": "803-366-8171",
        "AccessComments": "Dealership business hours\r\nPublic - Call ahead",
        "RelatedURL": "",
        "DistanceUnit": 0
    },
    "Connections": [
        {
            "ID": 172758,
            "ConnectionTypeID": 1,
            "LevelID": 2,
            "Amps": 16,
            "Voltage": 230,
            "PowerKW": 3.7,
            "CurrentTypeID": 10,
            "Quantity": 1
        }
    ],
    "DateLastStatusUpdate": "2020-06-26T02:57:00Z",
    "DataQualityLevel": 3,
    "DateCreated": "2019-04-06T05:03:00Z",
    "SubmissionStatusTypeID": 100
}