{
    "IsRecentlyVerified": false,
    "ID": 179665,
    "UUID": "D8D82E66-103D-48E6-8DA0-8E7956F33F81",
    "DataProviderID": 29,
    "DataProvidersReference": "5444",
    "AddressInfo": {
        "ID": 180024,
        "Title": "Friedrich-Ebert-Platz",
        "AddressLine1": "Friedrich-Ebert-Platz",
        "Town": "Heidelberg",
        "Postcode": "69117",
        "CountryID": 87,
        "Latitude": 49.408614,
        "Longitude": 8.698401,
        "DistanceUnit": 0
    },
    "Connections": [
        {
            "ID": 281768,
            "ConnectionTypeID": 25,
            "StatusTypeID": 50,
            "LevelID": 2,
            "PowerKW": 22,
            "CurrentTypeID": 20
        },
        {
            "ID": 281769,
            "ConnectionTypeID": 25,
            "StatusTypeID": 50,
            "LevelID": 2,
            "PowerKW": 22,
            "CurrentTypeID": 20
        },
        {
            "ID": 281770,
            "ConnectionTypeID": 25,
            "StatusTypeID": 50,
            "LevelID": 2,
            "PowerKW": 22,
            "CurrentTypeID": 20
        },
        {
            "ID": 281771,
            "ConnectionTypeID": 25,
            "StatusTypeID": 50,
            "LevelID": 2,
            "PowerKW": 22,
            "CurrentTypeID": 20
        }
    ],
    "StatusTypeID": 50,
    "DateLastStatusUpdate": "2021-07-09T03:16:00Z",
    "MetadataValues": [
        {
            "ID": 11959,
            "MetadataFieldID": 4,
            "ItemValue": "Data from the German chargepoint registry provided by Bundesnetzagentur.de under the CC-BY 4.0 license"
        }
    ],
    "DataQualityLevel": 3,
    "DateCreated": "2021-07-08T09:59:00Z",
    "SubmissionStatusTypeID": 100
}