{
    "IsRecentlyVerified": false,
    "ID": 42334,
    "UUID": "77AE91DF-B0D3-41E6-B1DF-E76FE4F57CF1",
    "DataProviderID": 2,
    "DataProvidersReference": "65047",
    "UsageTypeID": 1,
    "AddressInfo": {
        "ID": 42680,
        "Title": "Kwik Trip #865",
        "AddressLine1": "130 Dynex Dr",
        "Town": "Pewaukee",
        "StateOrProvince": "WI",
        "Postcode": "53072",
        "CountryID": 2,
        "Latitude": 43.082916,
        "Longitude": -88.25319,
        "ContactTelephone1": "262-691-1474",
        "AccessComments": "24 hours daily",
        "RelatedURL": "",
        "DistanceUnit": 0
    },
    "Connections": [
        {
            "ID": 50905,
            "ConnectionTypeID": 9,
            "LevelID": 1,
            "Amps": 16,
            "Voltage": 120,
            "PowerKW": 1.9,
            "CurrentTypeID": 10,
            "Quantity": 1
        }
    ],
    "DateLastStatusUpdate": "2020-06-26T03:06:00Z",
    "DataQualityLevel": 3,
    "DateCreated": "2015-03-06T06:27:00Z",
    "SubmissionStatusTypeID": 100
}