{
    "IsRecentlyVerified": false,
    "ID": 131152,
    "UUID": "72A7FA3A-FE8B-4866-8E0C-BDB8CB08AFED",
    "DataProviderID": 2,
    "DataProvidersReference": "143568",
    "OperatorID": 5,
    "UsageTypeID": 1,
    "AddressInfo": {
        "ID": 131498,
        "Title": "VINTAGE WP",
        "AddressLine1": "4460 N Goldenrod Rd",
        "Town": "Winter Park",
        "StateOrProvince": "AL",
        "Postcode": "32792",
        "CountryID": 2,
        "Latitude": 28.6030768,
        "Longitude": -81.288979,
        "ContactTelephone1": "888-758-4389",
        "AccessComments": "24 hours daily",
        "RelatedURL": "http://www.chargepoint.com/",
        "DistanceUnit": 0
    },
    "Connections": [
        {
            "ID": 183649,
            "ConnectionTypeID": 1,
            "LevelID": 2,
            "Amps": 16,
            "Voltage": 230,
            "PowerKW": 3,
            "CurrentTypeID": 10,
            "Quantity": 2
        }
    ],
    "DateLastStatusUpdate": "2019-12-24T09:08:00Z",
    "DataQualityLevel": 3,
    "DateCreated": "2019-08-29T08:33:00Z",
    "SubmissionStatusTypeID": 100
}