{
    "IsRecentlyVerified": false,
    "ID": 91764,
    "UUID": "78C25B2C-A899-4520-B8F4-D00C569B8CD4",
    "DataProviderID": 1,
    "OperatorID": 3,
    "OperatorsReference": "PG-81162",
    "UsageTypeID": 4,
    "UsageCost": "Free",
    "AddressInfo": {
        "ID": 92110,
        "Title": "The Betsey Wynne",
        "AddressLine1": "21 Mursley Road",
        "Town": "Buckinghamshire",
        "Postcode": "MK17 0SH",
        "CountryID": 1,
        "Latitude": 51.939167,
        "Longitude": -0.830254,
        "DistanceUnit": 0
    },
    "Connections": [
        {
            "ID": 130093,
            "ConnectionTypeID": 25,
            "StatusTypeID": 50,
            "LevelID": 2,
            "Amps": 32,
            "Voltage": 230,
            "PowerKW": 7,
            "CurrentTypeID": 10,
            "Quantity": 2
        }
    ],
    "NumberOfPoints": 2,
    "GeneralComments": "This is an open charge unit installed at The Betsey Wynne in Mursley Road, Swanbourne, Buckinghamshire",
    "StatusTypeID": 50,
    "DateLastStatusUpdate": "2017-08-17T05:19:00Z",
    "DataQualityLevel": 1,
    "DateCreated": "2017-08-17T05:19:00Z",
    "SubmissionStatusTypeID": 200
}