{
    "IsRecentlyVerified": false,
    "ID": 107595,
    "UUID": "B817761F-6C1B-4DEF-B075-C1659C070EE0",
    "DataProviderID": 1,
    "OperatorID": 229,
    "UsageTypeID": 4,
    "UsageCost": "$0.25/kWh + $0.25/min",
    "AddressInfo": {
        "ID": 107941,
        "Title": "Cox Street Car Park",
        "AddressLine1": "Geraldine-Fairlie Hwy",
        "Town": "Geraldine",
        "Postcode": "7930",
        "CountryID": 161,
        "Latitude": -44.092851,
        "Longitude": 171.243145,
        "DistanceUnit": 0
    },
    "Connections": [
        {
            "ID": 151825,
            "ConnectionTypeID": 2,
            "StatusTypeID": 50,
            "LevelID": 3,
            "PowerKW": 50,
            "CurrentTypeID": 30,
            "Quantity": 1
        },
        {
            "ID": 151826,
            "ConnectionTypeID": 33,
            "StatusTypeID": 50,
            "LevelID": 3,
            "PowerKW": 50,
            "CurrentTypeID": 30,
            "Quantity": 1
        }
    ],
    "NumberOfPoints": 1,
    "StatusTypeID": 50,
    "DateLastStatusUpdate": "2018-08-02T21:52:00Z",
    "DataQualityLevel": 1,
    "DateCreated": "2018-08-02T21:41:00Z",
    "SubmissionStatusTypeID": 200
}