{
    "IsRecentlyVerified": false,
    "ID": 163753,
    "UUID": "607F0483-3AF6-4F3C-829D-4DE852FB79BC",
    "DataProviderID": 1,
    "OperatorID": 23,
    "OperatorsReference": "49439",
    "UsageTypeID": 4,
    "AddressInfo": {
        "ID": 164110,
        "Title": "Hotel Schloss Gehrden",
        "AddressLine1": "Schlossstrasse 6",
        "Town": "Brakel-Gehrden",
        "Postcode": "33034",
        "CountryID": 87,
        "Latitude": 51.653418,
        "Longitude": 9.118536,
        "ContactTelephone1": " +49 5648 9632 00",
        "DistanceUnit": 0
    },
    "Connections": [
        {
            "ID": 235350,
            "ConnectionTypeID": 30,
            "StatusTypeID": 50,
            "LevelID": 2,
            "PowerKW": 22,
            "CurrentTypeID": 20,
            "Quantity": 2
        }
    ],
    "NumberOfPoints": 2,
    "GeneralComments": "2 Tesla Connectors, up to 22kW.Available for customers. Please see front desk.",
    "StatusTypeID": 50,
    "DateLastStatusUpdate": "2020-08-24T16:20:00Z",
    "DataQualityLevel": 1,
    "DateCreated": "2020-08-24T16:20:00Z",
    "SubmissionStatusTypeID": 200
}