{
    "IsRecentlyVerified": false,
    "ID": 75794,
    "UUID": "A2CC7E66-DC01-458F-9569-AB2614118671",
    "DataProviderID": 1,
    "OperatorID": 23,
    "OperatorsReference": "23214",
    "UsageTypeID": 1,
    "UsageCost": "Free",
    "AddressInfo": {
        "ID": 76140,
        "Title": "The Spring Resort and Spa - Tesla",
        "AddressLine1": "12699 Reposo Way",
        "Town": "Desert Hot Springs",
        "StateOrProvince": "CA",
        "Postcode": "92240",
        "CountryID": 2,
        "Latitude": 33.9557361,
        "Longitude": -116.4824411,
        "ContactTelephone1": "760-251-6700  877-798-3752",
        "AccessComments": "24 hours daily; for Tesla use only; for guest use only; see front desk for access",
        "RelatedURL": "http://www.teslamotors.com/supercharger",
        "DistanceUnit": 0
    },
    "Connections": [
        {
            "ID": 109298,
            "ConnectionTypeID": 30,
            "StatusTypeID": 50,
            "LevelID": 2,
            "Amps": 16,
            "Voltage": 230,
            "PowerKW": 8,
            "CurrentTypeID": 10,
            "Quantity": 1
        }
    ],
    "NumberOfPoints": 1,
    "StatusTypeID": 50,
    "DateLastStatusUpdate": "2017-01-26T02:37:00Z",
    "DataQualityLevel": 3,
    "DateCreated": "2016-12-23T01:25:00Z",
    "SubmissionStatusTypeID": 100
}