{
    "IsRecentlyVerified": false,
    "ID": 46016,
    "UUID": "693C77A0-CB78-4659-8C9D-C1E7194FF553",
    "DataProviderID": 1,
    "DataProvidersReference": "477",
    "AddressInfo": {
        "ID": 46362,
        "Title": "Sande ungdomsskole, Sande",
        "AddressLine1": "Skolegata 8",
        "Town": "SANDE I VESTFOLD",
        "StateOrProvince": "Vestfold og Telemark",
        "Postcode": "3070",
        "CountryID": 168,
        "Latitude": 59.58583,
        "Longitude": 10.21417,
        "AccessComments": "",
        "DistanceUnit": 0
    },
    "Connections": [
        {
            "ID": 56679,
            "ConnectionTypeID": 0,
            "Reference": "1",
            "LevelID": 2,
            "Amps": 16,
            "Voltage": 230,
            "PowerKW": 3.7,
            "Comments": "Mode 1"
        },
        {
            "ID": 88341,
            "ConnectionTypeID": 0,
            "Reference": "2",
            "LevelID": 2,
            "Amps": 16,
            "Voltage": 230,
            "PowerKW": 3.7,
            "Comments": "Mode 1"
        }
    ],
    "NumberOfPoints": 2,
    "DateLastStatusUpdate": "2020-05-26T08:23:00Z",
    "DataQualityLevel": 2,
    "DateCreated": "2015-05-03T00:54:00Z",
    "SubmissionStatusTypeID": 100
}