{
    "IsRecentlyVerified": false,
    "ID": 13850,
    "UUID": "8690CC42-6F05-41AA-B19A-8C4770C64801",
    "DataProviderID": 1,
    "DataProvidersReference": "LSB-01503",
    "OperatorID": 21,
    "UsageTypeID": 4,
    "UsageCost": "Mobi.E compatible card",
    "AddressInfo": {
        "ID": 13747,
        "Title": "LSB-00242/43/44",
        "AddressLine1": "Avenida Marquês Tomar",
        "Town": "Lisboa",
        "Postcode": "1050-000",
        "CountryID": 180,
        "Latitude": 38.73626367824565,
        "Longitude": -9.149375653392099,
        "AccessComments": "Paid parking",
        "RelatedURL": "http://www.mobie.pt",
        "DistanceUnit": 0
    },
    "Connections": [
        {
            "ID": 33256,
            "ConnectionTypeID": 25,
            "StatusTypeID": 50,
            "LevelID": 2,
            "Amps": 32,
            "Voltage": 400,
            "PowerKW": 22,
            "CurrentTypeID": 20,
            "Quantity": 3
        }
    ],
    "NumberOfPoints": 3,
    "StatusTypeID": 50,
    "DateLastStatusUpdate": "2020-08-17T20:13:00Z",
    "DataQualityLevel": 3,
    "DateCreated": "2012-12-06T11:17:00Z",
    "SubmissionStatusTypeID": 100
}