{
    "IsRecentlyVerified": false,
    "ID": 171623,
    "UUID": "C49D1925-9A8E-45D1-ADCB-23C619EE8AAF",
    "DataProviderID": 1,
    "OperatorID": 1,
    "UsageTypeID": 1,
    "AddressInfo": {
        "ID": 171982,
        "Title": "Coopeguanacaste Nicoya",
        "AddressLine1": "Avenida 2",
        "Town": "Nicoya",
        "StateOrProvince": "Guanacaste",
        "Postcode": "50201",
        "CountryID": 58,
        "Latitude": 10.14172154890474,
        "Longitude": -85.45463271508129,
        "DistanceUnit": 0
    },
    "Connections": [
        {
            "ID": 262439,
            "ConnectionTypeID": 1,
            "StatusTypeID": 100,
            "LevelID": 2,
            "Amps": 32,
            "Voltage": 240,
            "PowerKW": 7.7,
            "CurrentTypeID": 10,
            "Quantity": 1,
            "Comments": "Commercial Hours"
        }
    ],
    "NumberOfPoints": 1,
    "GeneralComments": "Commercial Hours",
    "StatusTypeID": 100,
    "DateLastStatusUpdate": "2021-01-07T08:43:00Z",
    "DataQualityLevel": 1,
    "DateCreated": "2021-01-07T00:38:00Z",
    "SubmissionStatusTypeID": 200
}