{
    "IsRecentlyVerified": false,
    "ID": 38162,
    "UUID": "E29A21B5-CBFD-4AED-9E32-A8C1C482D735",
    "DataProviderID": 26,
    "DataProvidersReference": "30471",
    "OperatorID": 108,
    "OperatorsReference": "Vattenfall Technischer Überwachungsverein (TÜV)",
    "UsageCost": "0.00 afhankelijk van pas",
    "AddressInfo": {
        "ID": 38508,
        "Title": "Alboinstraße",
        "AddressLine1": "Alboinstraße",
        "Town": "Schöneberg",
        "Postcode": "12103",
        "CountryID": 87,
        "Latitude": 52.463985,
        "Longitude": 13.369857,
        "ContactTelephone1": "+49(0)800-2 335 335",
        "ContactEmail": "emobility@vattenfall.de",
        "RelatedURL": "http://www.vattenfall.de/de/emobility/ladestationen-berlin.htm",
        "DistanceUnit": 0
    },
    "Connections": [
        {
            "ID": 41673,
            "ConnectionTypeID": 25,
            "LevelID": 2,
            "PowerKW": 5,
            "CurrentTypeID": 10
        }
    ],
    "NumberOfPoints": 2,
    "StatusTypeID": 50,
    "DateLastStatusUpdate": "2016-03-03T12:40:00Z",
    "DataQualityLevel": 3,
    "DateCreated": "2015-01-09T06:07:00Z",
    "SubmissionStatusTypeID": 100
}