{
    "IsRecentlyVerified": false,
    "ID": 187927,
    "UUID": "79C4D6C6-7A06-4155-BEBC-6255F4A2D3A3",
    "DataProviderID": 18,
    "DataProvidersReference": "d80994f9f4102c2e1f5a2e10728aeea6",
    "OperatorID": 3345,
    "UsageTypeID": 5,
    "AddressInfo": {
        "ID": 188286,
        "Title": "CV6 3EY",
        "AddressLine1": "",
        "Town": "Coventry",
        "Postcode": "CV6 3EY",
        "CountryID": 1,
        "Latitude": 52.423032,
        "Longitude": -1.517144,
        "AccessComments": "",
        "RelatedURL": "https://char.gy",
        "DistanceUnit": 0
    },
    "Connections": [
        {
            "ID": 303257,
            "ConnectionTypeID": 25,
            "Reference": "727",
            "StatusTypeID": 50,
            "LevelID": 2,
            "Amps": 16,
            "Voltage": 230,
            "PowerKW": 3.7,
            "CurrentTypeID": 10
        }
    ],
    "StatusTypeID": 0,
    "DateLastStatusUpdate": "2021-07-12T03:39:00Z",
    "MetadataValues": [
        {
            "ID": 20167,
            "MetadataFieldID": 4,
            "ItemValue": "Contains public sector information licensed under the Open Government Licence v2.0. http://www.nationalarchives.gov.uk/doc/open-government-licence/version/2/"
        }
    ],
    "DataQualityLevel": 3,
    "DateCreated": "2021-07-12T03:39:00Z",
    "SubmissionStatusTypeID": 100
}