{
    "IsRecentlyVerified": false,
    "ID": 44574,
    "UUID": "4E7A204E-21E4-4391-A03F-57DCFACDC779",
    "DataProviderID": 2,
    "DataProvidersReference": "66647",
    "OperatorID": 5,
    "UsageTypeID": 1,
    "AddressInfo": {
        "ID": 44920,
        "Title": "JBG SMITH",
        "AddressLine1": "11440 Commerce Park Dr",
        "Town": "Reston",
        "StateOrProvince": "VA",
        "Postcode": "20191",
        "CountryID": 2,
        "Latitude": 38.9471256,
        "Longitude": -77.341325,
        "ContactTelephone1": "888-758-4389",
        "AccessComments": "24 hours daily",
        "RelatedURL": "http://www.chargepoint.com/",
        "DistanceUnit": 0
    },
    "Connections": [
        {
            "ID": 54754,
            "ConnectionTypeID": 1,
            "LevelID": 2,
            "Amps": 16,
            "Voltage": 230,
            "PowerKW": 3.7,
            "CurrentTypeID": 10,
            "Quantity": 2
        }
    ],
    "DateLastStatusUpdate": "2020-06-26T03:00:00Z",
    "DataQualityLevel": 3,
    "DateCreated": "2015-04-17T12:30:00Z",
    "SubmissionStatusTypeID": 100
}