{
    "IsRecentlyVerified": false,
    "ID": 111399,
    "UUID": "C7C6DB9E-FBC4-4328-8AE9-CD0AC8B146F6",
    "DataProviderID": 2,
    "DataProvidersReference": "91259",
    "OperatorID": 5,
    "UsageTypeID": 1,
    "AddressInfo": {
        "ID": 111745,
        "Title": "MARCEL-LAURINS",
        "AddressLine1": "925 Boulevard Marcel-Laurin",
        "Town": "MontrÃ©al",
        "StateOrProvince": "QC",
        "Postcode": "H4M 2N1",
        "CountryID": 44,
        "Latitude": 45.5091192,
        "Longitude": -73.6861732,
        "ContactTelephone1": "888-758-4389",
        "AccessComments": "24 hours daily",
        "RelatedURL": "http://www.chargepoint.com/",
        "DistanceUnit": 0
    },
    "Connections": [
        {
            "ID": 156817,
            "ConnectionTypeID": 32,
            "LevelID": 2,
            "Amps": 100,
            "Voltage": 400,
            "PowerKW": 40,
            "CurrentTypeID": 10,
            "Quantity": 1
        }
    ],
    "DateLastStatusUpdate": "2019-04-06T05:07:00Z",
    "DataQualityLevel": 3,
    "DateCreated": "2018-10-18T23:37:00Z",
    "SubmissionStatusTypeID": 100
}