{
    "IsRecentlyVerified": true,
    "DateLastVerified": "2021-10-24T05:40:00Z",
    "ID": 189665,
    "UUID": "5AE17569-6B05-4829-8650-3DD37999EC7F",
    "DataProviderID": 1,
    "OperatorID": 3338,
    "UsageTypeID": 4,
    "UsageCost": "Yearly Subscription",
    "AddressInfo": {
        "ID": 190024,
        "Title": "Mall of Medini",
        "AddressLine1": "Mall of Medini",
        "Town": "Johor Bahru",
        "StateOrProvince": "Johor",
        "Postcode": "79250",
        "CountryID": 137,
        "Latitude": 1.425373663952172,
        "Longitude": 103.63351963183493,
        "DistanceUnit": 0
    },
    "Connections": [
        {
            "ID": 306819,
            "ConnectionTypeID": 25,
            "StatusTypeID": 50,
            "LevelID": 2,
            "Amps": 32,
            "Voltage": 415,
            "PowerKW": 22,
            "CurrentTypeID": 20,
            "Quantity": 2
        }
    ],
    "NumberOfPoints": 2,
    "StatusTypeID": 50,
    "DateLastStatusUpdate": "2021-10-24T23:16:00Z",
    "DataQualityLevel": 1,
    "DateCreated": "2021-10-24T05:40:00Z",
    "SubmissionStatusTypeID": 200
}