{
    "IsRecentlyVerified": false,
    "ID": 63111,
    "UUID": "8B0FB297-6DF8-4836-8CB8-5B626DE8618E",
    "DataProviderID": 26,
    "DataProvidersReference": "73347",
    "OperatorID": 157,
    "OperatorsReference": "NewMotion 02012120",
    "UsageCost": "0.00 jaarabonnement",
    "AddressInfo": {
        "ID": 63457,
        "Title": "Simon Stevinstraat 3",
        "AddressLine1": "Simon Stevinstraat 3",
        "Town": "Oud-Beijerland",
        "Postcode": "3261 MG",
        "CountryID": 159,
        "Latitude": 51.8287461168648,
        "Longitude": 4.44425103278809,
        "ContactTelephone1": "088 0109500",
        "RelatedURL": "http://thenewmotion.nl/",
        "DistanceUnit": 0
    },
    "Connections": [
        {
            "ID": 80254,
            "ConnectionTypeID": 25,
            "LevelID": 2,
            "PowerKW": 3.7,
            "CurrentTypeID": 10
        }
    ],
    "NumberOfPoints": 1,
    "StatusTypeID": 50,
    "DateLastStatusUpdate": "2016-06-04T02:41:00Z",
    "DataQualityLevel": 3,
    "DateCreated": "2016-03-03T12:29:00Z",
    "SubmissionStatusTypeID": 100
}