{
    "IsRecentlyVerified": false,
    "ID": 143815,
    "UUID": "DBBC0B7A-789D-434B-A60F-87321A1A0437",
    "DataProviderID": 2,
    "DataProvidersReference": "93468",
    "OperatorID": 15,
    "UsageTypeID": 4,
    "AddressInfo": {
        "ID": 144167,
        "Title": "Hannaford Supermarket",
        "AddressLine1": "29 Whitten Rd",
        "Town": "Augusta",
        "StateOrProvince": "ME",
        "Postcode": "04330",
        "CountryID": 2,
        "Latitude": 44.313406,
        "Longitude": -69.811525,
        "ContactTelephone1": "877-455-3833",
        "AccessComments": "24 hours daily\r\nPublic - Card key at all times",
        "RelatedURL": "https://www.evgo.com/",
        "DistanceUnit": 0
    },
    "Connections": [
        {
            "ID": 200216,
            "ConnectionTypeID": 2,
            "LevelID": 3,
            "Amps": 100,
            "Voltage": 400,
            "PowerKW": 40,
            "CurrentTypeID": 30,
            "Quantity": 1
        },
        {
            "ID": 200217,
            "ConnectionTypeID": 32,
            "LevelID": 3,
            "Amps": 100,
            "Voltage": 400,
            "PowerKW": 40,
            "CurrentTypeID": 30,
            "Quantity": 1
        }
    ],
    "StatusTypeID": 50,
    "DateLastStatusUpdate": "2020-06-26T03:07:00Z",
    "DataQualityLevel": 3,
    "DateCreated": "2019-12-24T09:22:00Z",
    "SubmissionStatusTypeID": 100
}