{
    "IsRecentlyVerified": false,
    "ID": 107696,
    "UUID": "D64D5B65-5E94-40A2-8F0C-434313964E96",
    "DataProviderID": 1,
    "OperatorID": 1,
    "UsageTypeID": 6,
    "AddressInfo": {
        "ID": 108042,
        "Title": "Blu Suite Hotel - Recharge Point",
        "AddressLine1": "Via Alfonso Pinzon, 290",
        "AddressLine2": "Bellaria ",
        "Town": "Igea Marina",
        "StateOrProvince": "RN",
        "Postcode": "47813",
        "CountryID": 112,
        "Latitude": 44.1246904,
        "Longitude": 12.4916714,
        "ContactTelephone1": "+39 0541 332 454",
        "ContactEmail": "reservation@blusuitehotel.it",
        "RelatedURL": "https://www.blusuitehotel.it",
        "DistanceUnit": 0
    },
    "Connections": [],
    "NumberOfPoints": 1,
    "StatusTypeID": 50,
    "DateLastStatusUpdate": "2018-08-07T15:42:00Z",
    "DataQualityLevel": 1,
    "DateCreated": "2018-08-07T14:12:00Z",
    "SubmissionStatusTypeID": 200
}