{
    "IsRecentlyVerified": false,
    "ID": 97933,
    "UUID": "45944A69-5E31-4349-B9E4-5573049701BC",
    "DataProviderID": 1,
    "OperatorID": 23,
    "OperatorsReference": "39167",
    "UsageTypeID": 4,
    "AddressInfo": {
        "ID": 98279,
        "Title": "La Cocina el Tras",
        "AddressLine1": "Carretera Federal Mexico - Toluca 2685 Palo Alto",
        "Town": "Cuajimalpa de Morelos",
        "StateOrProvince": "Ciudad de Mexico",
        "Postcode": "05110",
        "CountryID": 146,
        "Latitude": 19.381156,
        "Longitude": -99.254927,
        "ContactTelephone1": "+52 55 5259 0641",
        "DistanceUnit": 0
    },
    "Connections": [
        {
            "ID": 138841,
            "ConnectionTypeID": 30,
            "StatusTypeID": 50,
            "LevelID": 2,
            "PowerKW": 18,
            "CurrentTypeID": 20,
            "Quantity": 1
        }
    ],
    "NumberOfPoints": 1,
    "GeneralComments": "1 Tesla Connector, up to 18kW.Available to the public. Self park.",
    "StatusTypeID": 50,
    "DateLastStatusUpdate": "2018-01-21T17:02:00Z",
    "DataQualityLevel": 1,
    "DateCreated": "2018-01-21T17:02:00Z",
    "SubmissionStatusTypeID": 200
}