{
    "IsRecentlyVerified": false,
    "ID": 170750,
    "UUID": "188F1825-3661-4F89-966C-E44183816356",
    "DataProviderID": 1,
    "OperatorID": 23,
    "OperatorsReference": "55179",
    "UsageTypeID": 4,
    "UsageCost": "$0.26/kWh; other tariffs for older cars",
    "AddressInfo": {
        "ID": 171109,
        "Title": "Irvine, Ca - Walnut Ave Supercharger",
        "AddressLine1": "5406 Walnut Avenue",
        "Town": "Irvine",
        "StateOrProvince": "CA",
        "Postcode": "92604",
        "CountryID": 2,
        "Latitude": 33.689788,
        "Longitude": -117.769036,
        "DistanceUnit": 0
    },
    "Connections": [
        {
            "ID": 260880,
            "ConnectionTypeID": 27,
            "StatusTypeID": 50,
            "LevelID": 3,
            "PowerKW": 120,
            "CurrentTypeID": 30,
            "Quantity": 8
        }
    ],
    "NumberOfPoints": 8,
    "GeneralComments": "Charging8 Superchargers, available 24/7, up to 250kW",
    "StatusTypeID": 50,
    "DateLastStatusUpdate": "2020-12-08T06:53:00Z",
    "DataQualityLevel": 1,
    "DateCreated": "2020-12-08T06:53:00Z",
    "SubmissionStatusTypeID": 200
}