{
    "IsRecentlyVerified": false,
    "ID": 177241,
    "UUID": "5A3328C8-97D0-47EC-8D19-6AB91E739CC3",
    "DataProviderID": 29,
    "DataProvidersReference": "9205",
    "OperatorID": 69,
    "AddressInfo": {
        "ID": 177600,
        "Title": "Silberdistelstr. 55",
        "AddressLine1": "Silberdistelstr. 55",
        "Town": "München",
        "Postcode": "80689",
        "CountryID": 87,
        "Latitude": 48.129678,
        "Longitude": 11.478428,
        "DistanceUnit": 0
    },
    "Connections": [
        {
            "ID": 276161,
            "ConnectionTypeID": 25,
            "StatusTypeID": 50,
            "LevelID": 2,
            "PowerKW": 22,
            "CurrentTypeID": 20
        },
        {
            "ID": 276162,
            "ConnectionTypeID": 25,
            "StatusTypeID": 50,
            "LevelID": 2,
            "PowerKW": 22,
            "CurrentTypeID": 20
        }
    ],
    "StatusTypeID": 0,
    "DateLastStatusUpdate": "2021-07-09T03:11:00Z",
    "MetadataValues": [
        {
            "ID": 9535,
            "MetadataFieldID": 4,
            "ItemValue": "Data from the German chargepoint registry provided by Bundesnetzagentur.de under the CC-BY 4.0 license"
        }
    ],
    "DataQualityLevel": 3,
    "DateCreated": "2021-07-08T09:48:00Z",
    "SubmissionStatusTypeID": 100
}