{
    "IsRecentlyVerified": false,
    "ID": 64557,
    "UUID": "8CE87CDC-D7F3-4157-911E-759376E94354",
    "DataProviderID": 1,
    "OperatorID": 98,
    "UsageTypeID": 4,
    "AddressInfo": {
        "ID": 64903,
        "Title": "Solarwerkstatt GmbH",
        "AddressLine1": "Ravensburger Straße 41/1",
        "Town": "Tettnang",
        "StateOrProvince": "Bodenseekreis",
        "Postcode": "88069",
        "CountryID": 87,
        "Latitude": 47.67795,
        "Longitude": 9.586520000000064,
        "ContactTelephone1": "+49 7542 50 99 51",
        "ContactEmail": "ralf.nickel@gmx.de",
        "AccessComments": "Box F-136 ist im überdachten Materiallager, mind. 5 m Verlängerungskabel nötig.",
        "DistanceUnit": 0
    },
    "Connections": [
        {
            "ID": 82931,
            "ConnectionTypeID": 17,
            "StatusTypeID": 50,
            "LevelID": 2,
            "Amps": 16,
            "Voltage": 400,
            "PowerKW": 11,
            "CurrentTypeID": 20,
            "Quantity": 0
        },
        {
            "ID": 82932,
            "ConnectionTypeID": 16,
            "StatusTypeID": 50,
            "LevelID": 2,
            "Amps": 16,
            "Voltage": 230,
            "PowerKW": 3.7,
            "CurrentTypeID": 10,
            "Quantity": 1
        },
        {
            "ID": 82933,
            "ConnectionTypeID": 28,
            "StatusTypeID": 50,
            "LevelID": 2,
            "Amps": 16,
            "Voltage": 230,
            "PowerKW": 3.7,
            "CurrentTypeID": 10,
            "Quantity": 2
        }
    ],
    "NumberOfPoints": 1,
    "GeneralComments": "\r\n",
    "StatusTypeID": 50,
    "DateLastStatusUpdate": "2016-03-10T07:36:00Z",
    "DataQualityLevel": 1,
    "DateCreated": "2016-03-10T07:36:00Z",
    "SubmissionStatusTypeID": 200
}