{
    "IsRecentlyVerified": false,
    "ID": 134479,
    "UUID": "8A83566C-7EBB-4FBA-92AE-A9BA05F7B738",
    "DataProviderID": 1,
    "OperatorID": 23,
    "OperatorsReference": "52360",
    "UsageTypeID": 4,
    "UsageCost": "£0.24/kWh;other tariffs for older cars",
    "AddressInfo": {
        "ID": 134825,
        "Title": "Manchester-South Supercharger",
        "AddressLine1": "396 Wellington Road",
        "Town": "Stockport",
        "Postcode": "SK4 5AD",
        "CountryID": 1,
        "Latitude": 53.430272,
        "Longitude": -2.179346,
        "DistanceUnit": 0
    },
    "Connections": [
        {
            "ID": 188206,
            "ConnectionTypeID": 27,
            "StatusTypeID": 50,
            "LevelID": 3,
            "PowerKW": 120,
            "CurrentTypeID": 30,
            "Quantity": 8
        }
    ],
    "NumberOfPoints": 8,
    "GeneralComments": "Charging4 superchargers, available 24/7, up to 120kW",
    "StatusTypeID": 50,
    "DateLastStatusUpdate": "2020-09-06T05:27:00Z",
    "DataQualityLevel": 1,
    "DateCreated": "2019-11-12T11:21:00Z",
    "SubmissionStatusTypeID": 200
}