{
    "IsRecentlyVerified": false,
    "ID": 155898,
    "UUID": "8D9BC959-BA62-4079-9EE5-E9776E238070",
    "DataProviderID": 1,
    "OperatorID": 187,
    "UsageTypeID": 1,
    "UsageCost": "Free",
    "AddressInfo": {
        "ID": 156252,
        "Title": "ELMŰ, Dózsa György u. ",
        "AddressLine1": "Dózsa György u. 24.",
        "Town": "Onga",
        "Postcode": "3562",
        "CountryID": 104,
        "Latitude": 48.121335,
        "Longitude": 20.915705,
        "ContactTelephone1": "+36 012381818",
        "RelatedURL": "https://e-autozas.hu/",
        "DistanceUnit": 0
    },
    "Connections": [
        {
            "ID": 219465,
            "ConnectionTypeID": 25,
            "StatusTypeID": 50,
            "LevelID": 2,
            "Amps": 32,
            "Voltage": 400,
            "PowerKW": 22,
            "CurrentTypeID": 20,
            "Quantity": 2
        }
    ],
    "NumberOfPoints": 2,
    "GeneralComments": "HU A töltés inditáshoz előzetes regisztráció szükséges a www.e-autozas.hu oldalon, ezután az eCharge+ applikáción keresztül menedzselhető a töltés.\r\nGB For start the charging, prelimary registration is necessary at the www.e-autozas.hu website, after that the charging is manageable via eCharge+ application.",
    "StatusTypeID": 50,
    "DateLastStatusUpdate": "2020-04-27T18:20:00Z",
    "DataQualityLevel": 1,
    "DateCreated": "2020-04-27T11:34:00Z",
    "SubmissionStatusTypeID": 200
}