{
    "IsRecentlyVerified": false,
    "ID": 169991,
    "UUID": "4FF26C7C-C9A6-4BEA-A66D-E4EF1DF69691",
    "DataProviderID": 1,
    "OperatorID": 38,
    "UsageTypeID": 6,
    "UsageCost": "0.00 € for customer of Lidl",
    "AddressInfo": {
        "ID": 170350,
        "Title": "7d Satower Straße",
        "AddressLine1": "7d Satower Straße",
        "Town": "Rostock",
        "StateOrProvince": "Mecklenburg-Vorpommern",
        "Postcode": "18059",
        "CountryID": 87,
        "Latitude": 54.07697848847937,
        "Longitude": 12.099782556755713,
        "DistanceUnit": 0
    },
    "Connections": [
        {
            "ID": 259077,
            "ConnectionTypeID": 25,
            "StatusTypeID": 50,
            "LevelID": 2,
            "Amps": 16,
            "Voltage": 400,
            "PowerKW": 11,
            "CurrentTypeID": 20,
            "Quantity": 1
        }
    ],
    "NumberOfPoints": 1,
    "StatusTypeID": 50,
    "DateLastStatusUpdate": "2020-11-15T23:29:00Z",
    "DataQualityLevel": 1,
    "DateCreated": "2020-11-15T21:54:00Z",
    "SubmissionStatusTypeID": 200
}