{
    "IsRecentlyVerified": false,
    "ID": 139836,
    "UUID": "339EE3D5-3909-4942-A098-25D1BD2CB163",
    "DataProviderID": 2,
    "DataProvidersReference": "149567",
    "OperatorID": 59,
    "UsageTypeID": 1,
    "AddressInfo": {
        "ID": 140188,
        "Title": "Greenlots - 12588",
        "AddressLine1": "1440 N La Brea Ave",
        "Town": "Los Angeles",
        "StateOrProvince": "CA",
        "Postcode": "90028",
        "CountryID": 2,
        "Latitude": 34.096996307373,
        "Longitude": -118.343994140625,
        "ContactTelephone1": "855-900-7584",
        "AccessComments": "24 hours daily",
        "RelatedURL": "http://greenlots.com/",
        "DistanceUnit": 0
    },
    "Connections": [
        {
            "ID": 195309,
            "ConnectionTypeID": 1,
            "LevelID": 2,
            "Amps": 16,
            "Voltage": 230,
            "PowerKW": 3.7,
            "CurrentTypeID": 10,
            "Quantity": 1
        }
    ],
    "StatusTypeID": 50,
    "DateLastStatusUpdate": "2020-06-26T02:57:00Z",
    "DataQualityLevel": 3,
    "DateCreated": "2019-12-24T09:11:00Z",
    "SubmissionStatusTypeID": 100
}