{
    "IsRecentlyVerified": false,
    "ID": 113481,
    "UUID": "23E63F8B-F24B-409D-A98A-95545729F5AC",
    "DataProviderID": 1,
    "OperatorID": 32,
    "OperatorsReference": "24475",
    "UsageTypeID": 5,
    "UsageCost": "£0.108/kWh; for Polar Plus subscription members only",
    "AddressInfo": {
        "ID": 113827,
        "Title": "Bliss Hotels LTD",
        "AddressLine1": "Bliss Hotels LTD",
        "Town": "The Promenade Marine Lake",
        "StateOrProvince": "Southport",
        "Postcode": "PR9 0DZ",
        "CountryID": 1,
        "Latitude": 53.651627,
        "Longitude": -3.006322,
        "ContactTelephone1": "0330 016 5126",
        "AccessComments": "Please note that an overstay fee of £10 per hour after 90 minutes stay applies to this site.",
        "RelatedURL": "https://polar-network.com/",
        "DistanceUnit": 0
    },
    "Connections": [
        {
            "ID": 159884,
            "ConnectionTypeID": 33,
            "StatusTypeID": 50,
            "LevelID": 3,
            "PowerKW": 50,
            "CurrentTypeID": 30,
            "Quantity": 1
        },
        {
            "ID": 159885,
            "ConnectionTypeID": 2,
            "StatusTypeID": 50,
            "LevelID": 3,
            "PowerKW": 50,
            "CurrentTypeID": 30,
            "Quantity": 1
        },
        {
            "ID": 159886,
            "ConnectionTypeID": 1036,
            "StatusTypeID": 50,
            "LevelID": 3,
            "PowerKW": 43,
            "CurrentTypeID": 20,
            "Quantity": 1
        },
        {
            "ID": 307062,
            "ConnectionTypeID": 33,
            "StatusTypeID": 50,
            "Quantity": 1
        }
    ],
    "NumberOfPoints": 1,
    "GeneralComments": "Unit located in the hotel Underground car park. Charge point operated by Chargemaster. Available on the POLAR network. Visit www.polar-network.com to apply.",
    "StatusTypeID": 50,
    "DateLastStatusUpdate": "2021-11-03T02:36:00Z",
    "DataQualityLevel": 1,
    "DateCreated": "2018-12-14T06:16:00Z",
    "SubmissionStatusTypeID": 200
}