{
    "IsRecentlyVerified": false,
    "ID": 112095,
    "UUID": "3B39DCC1-37CC-4F19-9849-AD857597A067",
    "DataProviderID": 2,
    "DataProvidersReference": "82843",
    "UsageTypeID": 1,
    "AddressInfo": {
        "ID": 112441,
        "Title": "Red River College",
        "AddressLine1": "Skinner Rd",
        "Town": "Winnipeg",
        "StateOrProvince": "MB",
        "Postcode": "R3J 3Y9",
        "CountryID": 44,
        "Latitude": 49.9193337685111,
        "Longitude": -97.2090431223373,
        "ContactTelephone1": "204-632-3960",
        "AccessComments": "24 hours daily",
        "RelatedURL": "",
        "DistanceUnit": 0
    },
    "Connections": [
        {
            "ID": 157638,
            "ConnectionTypeID": 1,
            "LevelID": 2,
            "Amps": 16,
            "Voltage": 230,
            "PowerKW": 3.7,
            "CurrentTypeID": 10,
            "Quantity": 1
        },
        {
            "ID": 157639,
            "ConnectionTypeID": 2,
            "LevelID": 3,
            "Amps": 100,
            "Voltage": 400,
            "PowerKW": 40,
            "CurrentTypeID": 30,
            "Quantity": 1
        }
    ],
    "DateLastStatusUpdate": "2020-06-26T03:12:00Z",
    "DataQualityLevel": 3,
    "DateCreated": "2018-10-18T23:37:00Z",
    "SubmissionStatusTypeID": 100
}