{
    "IsRecentlyVerified": false,
    "ID": 71976,
    "UUID": "72BEF973-E39D-4385-B0CA-947C8867596B",
    "DataProviderID": 1,
    "OperatorID": 189,
    "UsageTypeID": 4,
    "AddressInfo": {
        "ID": 72322,
        "Title": "Marktplatz",
        "AddressLine1": "Am Markt",
        "Town": "Bergen",
        "StateOrProvince": "Bergen auf Rügen",
        "Postcode": "18528",
        "CountryID": 87,
        "Latitude": 54.41783771765613,
        "Longitude": 13.433663954631028,
        "AccessComments": "24/7 nutzbar mit The New Motion Ladekarte, PlugSurfing Keyhanger, Charge & Pay sowie allen Angeboten von E-Wald.",
        "RelatedURL": "http://e-dis.de/",
        "DistanceUnit": 0
    },
    "Connections": [
        {
            "ID": 103193,
            "ConnectionTypeID": 25,
            "StatusTypeID": 50,
            "LevelID": 2,
            "Amps": 32,
            "Voltage": 400,
            "PowerKW": 22,
            "CurrentTypeID": 20,
            "Quantity": 2
        },
        {
            "ID": 103194,
            "ConnectionTypeID": 28,
            "StatusTypeID": 50,
            "LevelID": 2,
            "Amps": 16,
            "Voltage": 230,
            "PowerKW": 3.7,
            "CurrentTypeID": 10,
            "Quantity": 2
        }
    ],
    "NumberOfPoints": 4,
    "StatusTypeID": 50,
    "DateLastStatusUpdate": "2016-09-27T08:18:00Z",
    "DataQualityLevel": 1,
    "DateCreated": "2016-09-27T08:18:00Z",
    "SubmissionStatusTypeID": 200
}