{
    "IsRecentlyVerified": false,
    "ID": 103987,
    "UUID": "2BC79D8F-EC9E-49E7-8B75-83E35B41EDCE",
    "DataProviderID": 1,
    "OperatorID": 125,
    "UsageTypeID": 4,
    "AddressInfo": {
        "ID": 104333,
        "Title": "Autohaus Gebrüder Bormann",
        "AddressLine1": "Im Sommerfeld 1",
        "Town": "Wolfenbüttel",
        "StateOrProvince": "Landkreis Wolfenbüttel",
        "Postcode": "38304",
        "CountryID": 87,
        "Latitude": 52.145650043673406,
        "Longitude": 10.54625605221895,
        "AccessComments": "24/7 nutzbare Ladesäule ist direkt an der Einfahrt. ",
        "DistanceUnit": 0
    },
    "Connections": [
        {
            "ID": 146786,
            "ConnectionTypeID": 25,
            "StatusTypeID": 50,
            "LevelID": 2,
            "Amps": 32,
            "Voltage": 400,
            "PowerKW": 22,
            "CurrentTypeID": 20,
            "Quantity": 2
        }
    ],
    "NumberOfPoints": 2,
    "StatusTypeID": 50,
    "DateLastStatusUpdate": "2018-05-14T13:00:00Z",
    "DataQualityLevel": 1,
    "DateCreated": "2018-05-14T13:00:00Z",
    "SubmissionStatusTypeID": 200
}