{
    "IsRecentlyVerified": false,
    "ID": 27831,
    "UUID": "EBEF6A90-67A1-46F1-BD6C-3863810EEF4E",
    "DataProviderID": 2,
    "DataProvidersReference": "45167",
    "OperatorID": 5,
    "UsageTypeID": 1,
    "AddressInfo": {
        "ID": 28177,
        "Title": "CITYOFMANASSAS",
        "AddressLine1": "9027 Center St",
        "Town": "Manassas",
        "StateOrProvince": "VA",
        "Postcode": "20110",
        "CountryID": 2,
        "Latitude": 38.750938,
        "Longitude": -77.470247,
        "ContactTelephone1": "888-758-4389",
        "AccessComments": "24 hours daily",
        "RelatedURL": "http://www.chargepoint.com/",
        "DistanceUnit": 0
    },
    "Connections": [
        {
            "ID": 30557,
            "ConnectionTypeID": 9,
            "LevelID": 1,
            "Amps": 16,
            "Voltage": 120,
            "PowerKW": 1.9,
            "CurrentTypeID": 10,
            "Quantity": 2
        },
        {
            "ID": 30558,
            "ConnectionTypeID": 1,
            "LevelID": 2,
            "Amps": 16,
            "Voltage": 230,
            "PowerKW": 3.7,
            "CurrentTypeID": 10,
            "Quantity": 2
        }
    ],
    "DateLastStatusUpdate": "2020-06-26T03:00:00Z",
    "DataQualityLevel": 3,
    "DateCreated": "2014-11-28T03:38:00Z",
    "SubmissionStatusTypeID": 100
}