{
    "IsRecentlyVerified": false,
    "ID": 33837,
    "UUID": "E324D2A5-68D4-467E-A71B-B2731FF24994",
    "DataProviderID": 26,
    "DataProvidersReference": "49656",
    "OperatorsReference": "ENE-P1742",
    "UsageCost": "0.00 afhankelijk van pas",
    "AddressInfo": {
        "ID": 34183,
        "Title": "Biezenweide 17",
        "AddressLine1": "Biezenweide 17",
        "Town": "Binnenmaas",
        "Postcode": "3297 GB",
        "CountryID": 159,
        "Latitude": 51.804,
        "Longitude": 4.558,
        "ContactTelephone1": "0900-0201",
        "ContactEmail": "info@eneco.nl",
        "RelatedURL": "http://www.eneco.nl",
        "DistanceUnit": 0
    },
    "Connections": [
        {
            "ID": 37348,
            "ConnectionTypeID": 25,
            "LevelID": 2,
            "PowerKW": 5,
            "CurrentTypeID": 10
        }
    ],
    "NumberOfPoints": 1,
    "StatusTypeID": 50,
    "DateLastStatusUpdate": "2016-06-04T02:40:00Z",
    "DataQualityLevel": 3,
    "DateCreated": "2015-01-09T06:04:00Z",
    "SubmissionStatusTypeID": 100
}