{
    "IsRecentlyVerified": false,
    "ID": 131824,
    "UUID": "14FDB28B-5102-499B-9FDE-80E5D8C57838",
    "DataProviderID": 1,
    "OperatorID": 80,
    "UsageTypeID": 4,
    "AddressInfo": {
        "ID": 132170,
        "Title": "Ponte a Egola Chico Mendes | EnelX",
        "AddressLine1": "Via Chico Mendes",
        "AddressLine2": "Ponte a Egola",
        "Town": "San Miniato",
        "StateOrProvince": "PI",
        "Postcode": "56024",
        "CountryID": 112,
        "Latitude": 43.6913140053697,
        "Longitude": 10.794498380905,
        "ContactTelephone1": "800.069.850",
        "RelatedURL": "https://www.enelx.com/it/it/emobility",
        "DistanceUnit": 0
    },
    "Connections": [
        {
            "ID": 184483,
            "ConnectionTypeID": 25,
            "StatusTypeID": 50,
            "LevelID": 2,
            "Amps": 32,
            "Voltage": 400,
            "PowerKW": 22,
            "CurrentTypeID": 20,
            "Quantity": 2
        }
    ],
    "NumberOfPoints": 2,
    "StatusTypeID": 50,
    "DateLastStatusUpdate": "2019-09-13T10:48:00Z",
    "DataQualityLevel": 1,
    "DateCreated": "2019-09-13T10:48:00Z",
    "SubmissionStatusTypeID": 200
}