{
    "IsRecentlyVerified": false,
    "ID": 183921,
    "UUID": "D5C39556-CBED-4FD9-B621-65EAA30540B8",
    "DataProviderID": 29,
    "DataProvidersReference": "10442",
    "OperatorID": 86,
    "AddressInfo": {
        "ID": 184280,
        "Title": "Engerstr. 1-9",
        "AddressLine1": "Engerstr. 1-9",
        "Town": "Bünde",
        "Postcode": "32257",
        "CountryID": 87,
        "Latitude": 52.18969,
        "Longitude": 8.575216,
        "DistanceUnit": 0
    },
    "Connections": [
        {
            "ID": 291510,
            "ConnectionTypeID": 25,
            "StatusTypeID": 50,
            "LevelID": 2,
            "PowerKW": 22,
            "CurrentTypeID": 20
        },
        {
            "ID": 291511,
            "ConnectionTypeID": 25,
            "StatusTypeID": 50,
            "LevelID": 2,
            "PowerKW": 22,
            "CurrentTypeID": 20
        }
    ],
    "StatusTypeID": 50,
    "DateLastStatusUpdate": "2021-07-09T03:26:00Z",
    "MetadataValues": [
        {
            "ID": 16214,
            "MetadataFieldID": 4,
            "ItemValue": "Data from the German chargepoint registry provided by Bundesnetzagentur.de under the CC-BY 4.0 license"
        }
    ],
    "DataQualityLevel": 3,
    "DateCreated": "2021-07-08T10:04:00Z",
    "SubmissionStatusTypeID": 100
}