{
    "IsRecentlyVerified": false,
    "ID": 102518,
    "UUID": "38715B86-BA95-48CA-9DD0-21D9ABE07A58",
    "DataProviderID": 2,
    "DataProvidersReference": "94732",
    "UsageTypeID": 2,
    "AddressInfo": {
        "ID": 102864,
        "Title": "Office Building",
        "AddressLine1": "29219 Canwood St",
        "Town": "Agoura Hills",
        "StateOrProvince": "CA",
        "Postcode": "91301",
        "CountryID": 2,
        "Latitude": 34.148198,
        "Longitude": -118.762487,
        "ContactTelephone1": "",
        "AccessComments": "Employee use only",
        "RelatedURL": "http://evconnect.com/",
        "DistanceUnit": 0
    },
    "Connections": [
        {
            "ID": 144602,
            "ConnectionTypeID": 1,
            "LevelID": 2,
            "Amps": 16,
            "Voltage": 230,
            "PowerKW": 3,
            "CurrentTypeID": 10,
            "Quantity": 4
        }
    ],
    "DateLastStatusUpdate": "2019-04-06T04:01:00Z",
    "DataQualityLevel": 3,
    "DateCreated": "2018-04-21T04:13:00Z",
    "SubmissionStatusTypeID": 100
}