{
    "IsRecentlyVerified": false,
    "ID": 140831,
    "UUID": "365E70D4-F045-4710-AC72-310B8BFB819A",
    "DataProviderID": 2,
    "DataProvidersReference": "148592",
    "OperatorID": 39,
    "UsageTypeID": 1,
    "AddressInfo": {
        "ID": 141183,
        "Title": "Hotel Focus SFO",
        "AddressLine1": "111 Mitchell Avenue",
        "Town": "South San Francisco",
        "StateOrProvince": "CA",
        "Postcode": "94080",
        "CountryID": 2,
        "Latitude": 37.6496413,
        "Longitude": -122.4042951,
        "ContactTelephone1": "800-663-5633",
        "AccessComments": "MO: 12:00am-12:00am; TU: 12:00am-12:00am; WE: 12:00am-12:00am; TH: 12:00am-12:00am; FR: 12:00am-12:00am; SA: 12:00am-12:00am; SU: 12:00am-12:00am",
        "RelatedURL": "http://www.semacharge.com/",
        "DistanceUnit": 0
    },
    "Connections": [
        {
            "ID": 196574,
            "ConnectionTypeID": 1,
            "LevelID": 2,
            "Amps": 16,
            "Voltage": 230,
            "PowerKW": 3.7,
            "CurrentTypeID": 10,
            "Quantity": 2
        }
    ],
    "StatusTypeID": 50,
    "DateLastStatusUpdate": "2020-06-26T02:59:00Z",
    "DataQualityLevel": 3,
    "DateCreated": "2019-12-24T09:14:00Z",
    "SubmissionStatusTypeID": 100
}