{
    "IsRecentlyVerified": false,
    "ID": 102773,
    "UUID": "920C01C4-426D-4748-B1FC-D4FCD357F980",
    "DataProviderID": 2,
    "DataProvidersReference": "87637",
    "OperatorID": 5,
    "UsageTypeID": 1,
    "AddressInfo": {
        "ID": 103119,
        "Title": "EVERGY",
        "AddressLine1": "4902 Mitchell Ave @ American Family Insurance",
        "Town": "St Joseph",
        "StateOrProvince": "MO",
        "Postcode": "64507",
        "CountryID": 2,
        "Latitude": 39.755289,
        "Longitude": -94.777481,
        "ContactTelephone1": "888-758-4389",
        "AccessComments": "24 hours daily",
        "RelatedURL": "http://www.chargepoint.com/",
        "DistanceUnit": 0
    },
    "Connections": [
        {
            "ID": 144899,
            "ConnectionTypeID": 1,
            "LevelID": 2,
            "Amps": 16,
            "Voltage": 230,
            "PowerKW": 3,
            "CurrentTypeID": 10,
            "Quantity": 4
        }
    ],
    "DateLastStatusUpdate": "2019-12-24T09:16:00Z",
    "DataQualityLevel": 3,
    "DateCreated": "2018-04-21T04:13:00Z",
    "SubmissionStatusTypeID": 100
}