{
    "IsRecentlyVerified": false,
    "ID": 184962,
    "UUID": "15B84342-7332-453A-A7DB-1B881C4E9E2A",
    "DataProviderID": 29,
    "DataProvidersReference": "15646",
    "AddressInfo": {
        "ID": 185321,
        "Title": "Universitätsklinikum des Saarlandes",
        "AddressLine1": "Universitätsklinikum des Saarlandes",
        "Town": "Homburg",
        "Postcode": "66424",
        "CountryID": 87,
        "Latitude": 49.30929,
        "Longitude": 7.345428,
        "DistanceUnit": 0
    },
    "Connections": [
        {
            "ID": 293869,
            "ConnectionTypeID": 25,
            "StatusTypeID": 50,
            "LevelID": 2,
            "PowerKW": 22,
            "CurrentTypeID": 20
        },
        {
            "ID": 293870,
            "ConnectionTypeID": 25,
            "StatusTypeID": 50,
            "LevelID": 2,
            "PowerKW": 22,
            "CurrentTypeID": 20
        }
    ],
    "StatusTypeID": 50,
    "DateLastStatusUpdate": "2021-07-12T02:43:00Z",
    "MetadataValues": [
        {
            "ID": 17253,
            "MetadataFieldID": 4,
            "ItemValue": "Data from the German chargepoint registry provided by Bundesnetzagentur.de under the CC-BY 4.0 license"
        }
    ],
    "DataQualityLevel": 3,
    "DateCreated": "2021-07-08T10:06:00Z",
    "SubmissionStatusTypeID": 100
}