{
    "IsRecentlyVerified": false,
    "ID": 141678,
    "UUID": "60EDBD07-0C5C-4161-8730-07CF84E970ED",
    "DataProviderID": 2,
    "DataProvidersReference": "145162",
    "OperatorID": 5,
    "UsageTypeID": 1,
    "AddressInfo": {
        "ID": 142030,
        "Title": "EVERGY",
        "AddressLine1": "8325 N Platte Purchase Dr @ Evergy Northland Service Center",
        "Town": "Kansas City",
        "StateOrProvince": "MO",
        "Postcode": "64151",
        "CountryID": 2,
        "Latitude": 39.2442287,
        "Longitude": -94.6007295,
        "ContactTelephone1": "888-758-4389",
        "AccessComments": "24 hours daily",
        "RelatedURL": "http://www.chargepoint.com/",
        "DistanceUnit": 0
    },
    "Connections": [
        {
            "ID": 197662,
            "ConnectionTypeID": 1,
            "LevelID": 2,
            "Amps": 16,
            "Voltage": 230,
            "PowerKW": 3.7,
            "CurrentTypeID": 10,
            "Quantity": 4
        }
    ],
    "StatusTypeID": 50,
    "DateLastStatusUpdate": "2020-06-26T03:01:00Z",
    "DataQualityLevel": 3,
    "DateCreated": "2019-12-24T09:16:00Z",
    "SubmissionStatusTypeID": 100
}