{
    "IsRecentlyVerified": false,
    "ID": 132186,
    "UUID": "113C4B91-9629-4C2C-8106-1663DDE25827",
    "DataProviderID": 1,
    "UsageTypeID": 4,
    "AddressInfo": {
        "ID": 132532,
        "Title": "Moso in Passiria Stuls | E.U.M.gen.",
        "AddressLine1": "Stulles",
        "AddressLine2": "Stuls ",
        "Town": "Moso in Passiria",
        "StateOrProvince": "BZ",
        "Postcode": "39013",
        "CountryID": 112,
        "Latitude": 46.82801756708929,
        "Longitude": 11.200194238880385,
        "RelatedURL": "http://www.eum-genmbh.com",
        "DistanceUnit": 0
    },
    "Connections": [
        {
            "ID": 185007,
            "ConnectionTypeID": 25,
            "StatusTypeID": 50,
            "LevelID": 2,
            "Amps": 32,
            "Voltage": 400,
            "PowerKW": 22,
            "CurrentTypeID": 20,
            "Quantity": 2
        }
    ],
    "NumberOfPoints": 2,
    "StatusTypeID": 50,
    "DateLastStatusUpdate": "2019-11-11T07:46:00Z",
    "DataQualityLevel": 1,
    "DateCreated": "2019-09-23T09:14:00Z",
    "SubmissionStatusTypeID": 200
}