{
    "IsRecentlyVerified": false,
    "ID": 134856,
    "UUID": "FE76107B-2101-4971-8DDB-B8D12B1719B5",
    "DataProviderID": 1,
    "OperatorID": 1,
    "UsageTypeID": 1,
    "AddressInfo": {
        "ID": 135202,
        "Title": "Tehnix Donji Kraljevec",
        "AddressLine1": "2026",
        "Town": "Cirkovljan",
        "StateOrProvince": "Međimurje County",
        "Postcode": "40323",
        "CountryID": 60,
        "Latitude": 46.35523686759353,
        "Longitude": 16.65683362202833,
        "AccessComments": "https://www.plugshare.com/location/159610",
        "DistanceUnit": 0
    },
    "Connections": [
        {
            "ID": 188732,
            "ConnectionTypeID": 2,
            "StatusTypeID": 50,
            "LevelID": 1,
            "Amps": 0,
            "Voltage": 0,
            "PowerKW": 50,
            "CurrentTypeID": 30,
            "Quantity": 1
        },
        {
            "ID": 188733,
            "ConnectionTypeID": 33,
            "StatusTypeID": 50,
            "LevelID": 1,
            "Amps": 0,
            "Voltage": 0,
            "PowerKW": 50,
            "CurrentTypeID": 30,
            "Quantity": 1
        }
    ],
    "NumberOfPoints": 1,
    "GeneralComments": "CHAdeMO – DC 50 kW\r\nCCS – DC 50 kW\r\nType 2 – AC 22 kW\r\nOpen 24 / 7 ",
    "StatusTypeID": 50,
    "DateLastStatusUpdate": "2019-12-02T09:47:00Z",
    "DataQualityLevel": 1,
    "DateCreated": "2019-11-26T12:27:00Z",
    "SubmissionStatusTypeID": 200
}