{
    "IsRecentlyVerified": false,
    "ID": 144161,
    "UUID": "E64EF022-E7B7-4F4A-BC2C-6E3BE082FF1B",
    "DataProviderID": 2,
    "DataProvidersReference": "129657",
    "OperatorID": 89,
    "UsageTypeID": 1,
    "AddressInfo": {
        "ID": 144513,
        "Title": "Saint-Césaire - Hôtel de Ville",
        "AddressLine1": "1111 avenue St-Paul",
        "Town": "St-Césaire",
        "StateOrProvince": "QC",
        "Postcode": "J0L 1T0",
        "CountryID": 44,
        "Latitude": 45.409938,
        "Longitude": -73.004076,
        "ContactTelephone1": "888-356-8911",
        "AccessComments": "24 hours daily",
        "RelatedURL": "https://flo.ca/",
        "DistanceUnit": 0
    },
    "Connections": [
        {
            "ID": 200642,
            "ConnectionTypeID": 1,
            "LevelID": 2,
            "Amps": 16,
            "Voltage": 230,
            "PowerKW": 3.7,
            "CurrentTypeID": 10,
            "Quantity": 2
        }
    ],
    "StatusTypeID": 50,
    "DateLastStatusUpdate": "2020-06-26T03:09:00Z",
    "DataQualityLevel": 3,
    "DateCreated": "2019-12-24T09:23:00Z",
    "SubmissionStatusTypeID": 100
}