{
    "MediaItems": [
        {
            "ID": 12708,
            "ChargePointID": 88470,
            "ItemURL": "https://s3-ap-southeast-2.amazonaws.com/openchargemap/images/NZ/OCM88470/OCM-88470.orig.2017053104522319.jpg",
            "ItemThumbnailURL": "https://s3-ap-southeast-2.amazonaws.com/openchargemap/images/NZ/OCM88470/OCM-88470.thmb.2017053104522319.jpg",
            "Comment": "",
            "IsEnabled": true,
            "IsVideo": false,
            "IsFeaturedItem": false,
            "IsExternalResource": false,
            "User": {
                "ID": 15365,
                "Username": "sliday"
            },
            "DateCreated": "2017-05-31T04:53:00Z"
        },
        {
            "ID": 12709,
            "ChargePointID": 88470,
            "ItemURL": "https://s3-ap-southeast-2.amazonaws.com/openchargemap/images/NZ/OCM88470/OCM-88470.orig.2017053104523573.jpg",
            "ItemThumbnailURL": "https://s3-ap-southeast-2.amazonaws.com/openchargemap/images/NZ/OCM88470/OCM-88470.thmb.2017053104523573.jpg",
            "Comment": "",
            "IsEnabled": true,
            "IsVideo": false,
            "IsFeaturedItem": false,
            "IsExternalResource": false,
            "User": {
                "ID": 15365,
                "Username": "sliday"
            },
            "DateCreated": "2017-05-31T04:53:00Z"
        },
        {
            "ID": 12710,
            "ChargePointID": 88470,
            "ItemURL": "https://s3-ap-southeast-2.amazonaws.com/openchargemap/images/NZ/OCM88470/OCM-88470.orig.2017053104524624.jpg",
            "ItemThumbnailURL": "https://s3-ap-southeast-2.amazonaws.com/openchargemap/images/NZ/OCM88470/OCM-88470.thmb.2017053104524624.jpg",
            "Comment": "",
            "IsEnabled": true,
            "IsVideo": false,
            "IsFeaturedItem": false,
            "IsExternalResource": false,
            "User": {
                "ID": 15365,
                "Username": "sliday"
            },
            "DateCreated": "2017-05-31T04:53:00Z"
        },
        {
            "ID": 12711,
            "ChargePointID": 88470,
            "ItemURL": "https://s3-ap-southeast-2.amazonaws.com/openchargemap/images/NZ/OCM88470/OCM-88470.orig.2017053104525700.jpg",
            "ItemThumbnailURL": "https://s3-ap-southeast-2.amazonaws.com/openchargemap/images/NZ/OCM88470/OCM-88470.thmb.2017053104525700.jpg",
            "Comment": "",
            "IsEnabled": true,
            "IsVideo": false,
            "IsFeaturedItem": false,
            "IsExternalResource": false,
            "User": {
                "ID": 15365,
                "Username": "sliday"
            },
            "DateCreated": "2017-05-31T04:53:00Z"
        },
        {
            "ID": 12707,
            "ChargePointID": 88470,
            "ItemURL": "https://s3-ap-southeast-2.amazonaws.com/openchargemap/images/NZ/OCM88470/OCM-88470.orig.2017053104520960.jpg",
            "ItemThumbnailURL": "https://s3-ap-southeast-2.amazonaws.com/openchargemap/images/NZ/OCM88470/OCM-88470.thmb.2017053104520960.jpg",
            "Comment": "",
            "IsEnabled": true,
            "IsVideo": false,
            "IsFeaturedItem": false,
            "IsExternalResource": false,
            "User": {
                "ID": 15365,
                "Username": "sliday"
            },
            "DateCreated": "2017-05-31T04:52:00Z"
        }
    ],
    "IsRecentlyVerified": false,
    "ID": 88470,
    "UUID": "0736B5C6-3C26-4005-A817-08F575C5AE2A",
    "DataProviderID": 1,
    "AddressInfo": {
        "ID": 88816,
        "Title": "Northlands Mall",
        "AddressLine1": "55 Main N Rd",
        "Town": "Papanui, Christchurch",
        "Postcode": "8052",
        "CountryID": 161,
        "Latitude": -43.4914776563429,
        "Longitude": 172.609918096959,
        "ContactTelephone1": "033526535",
        "DistanceUnit": 0
    },
    "Connections": [
        {
            "ID": 125491,
            "ConnectionTypeID": 1,
            "Amps": 32
        }
    ],
    "NumberOfPoints": 4,
    "GeneralComments": "24/7. The carpark is never locked.\r\nMeridian EV Charging Unit - (4x) 32amp, with J1772 plugs. Located on 2nd level of northern parking building.",
    "StatusTypeID": 50,
    "DateLastStatusUpdate": "2017-05-31T04:55:00Z",
    "DataQualityLevel": 1,
    "DateCreated": "2017-05-31T04:52:00Z",
    "SubmissionStatusTypeID": 200
}