{
    "IsRecentlyVerified": false,
    "ID": 43437,
    "UUID": "879A13A3-16EF-48E0-9CB8-392C05226CBD",
    "DataProviderID": 1,
    "OperatorID": 45,
    "UsageTypeID": 3,
    "AddressInfo": {
        "ID": 43783,
        "Title": "EAM Servicecenter ",
        "AddressLine1": "Letznerstraße 7",
        "Town": "Hardegsen",
        "StateOrProvince": "Landkreis Northeim",
        "Postcode": "37181",
        "CountryID": 87,
        "Latitude": 51.64682000000001,
        "Longitude": 9.827419999999961,
        "ContactTelephone1": "05505 99900",
        "AccessComments": "Ladebox ist mit Schlüssel aufzuschließen, der im ServiceCenter hinterlegt ist. Öffnungszeiten unbekannt.",
        "RelatedURL": "http://www.eam.de/",
        "DistanceUnit": 0
    },
    "Connections": [
        {
            "ID": 52656,
            "ConnectionTypeID": 28,
            "StatusTypeID": 50,
            "LevelID": 2,
            "Amps": 16,
            "Voltage": 230,
            "PowerKW": 3.7,
            "CurrentTypeID": 10,
            "Quantity": 2
        }
    ],
    "NumberOfPoints": 2,
    "StatusTypeID": 50,
    "DateLastStatusUpdate": "2015-03-31T09:29:00Z",
    "DataQualityLevel": 1,
    "DateCreated": "2015-03-31T09:29:00Z",
    "SubmissionStatusTypeID": 200
}