{
    "IsRecentlyVerified": false,
    "ID": 157176,
    "UUID": "14521931-8C66-40D4-ADDE-C86F6FC66A55",
    "DataProviderID": 19,
    "DataProvidersReference": "6280",
    "AddressInfo": {
        "ID": 157530,
        "Title": "Sentrum Bilverksted",
        "AddressLine1": "Strandgata 133",
        "Town": "ÅNDALSNES",
        "StateOrProvince": "Møre og Romsdal",
        "Postcode": "6300",
        "CountryID": 168,
        "Latitude": 62.5607,
        "Longitude": 7.68071,
        "AccessComments": "Sentrum Bilverksted AS",
        "DistanceUnit": 0
    },
    "Connections": [
        {
            "ID": 225768,
            "ConnectionTypeID": 25,
            "Reference": "1",
            "LevelID": 2,
            "Amps": 32,
            "Voltage": 230,
            "PowerKW": 7.4,
            "CurrentTypeID": 10,
            "Comments": "Mode 3"
        },
        {
            "ID": 225769,
            "ConnectionTypeID": 25,
            "Reference": "2",
            "LevelID": 2,
            "Amps": 32,
            "Voltage": 230,
            "PowerKW": 7.4,
            "CurrentTypeID": 10,
            "Comments": "Mode 3"
        },
        {
            "ID": 225770,
            "ConnectionTypeID": 25,
            "Reference": "3",
            "LevelID": 2,
            "Amps": 32,
            "Voltage": 230,
            "PowerKW": 7.4,
            "CurrentTypeID": 10,
            "Comments": "Mode 3"
        },
        {
            "ID": 225771,
            "ConnectionTypeID": 25,
            "Reference": "4",
            "LevelID": 2,
            "Amps": 32,
            "Voltage": 230,
            "PowerKW": 7.4,
            "CurrentTypeID": 10,
            "Comments": "Mode 3"
        }
    ],
    "NumberOfPoints": 4,
    "StatusTypeID": 0,
    "DateLastStatusUpdate": "2021-03-24T05:12:00Z",
    "DataQualityLevel": 2,
    "DateCreated": "2020-05-26T08:25:00Z",
    "SubmissionStatusTypeID": 100
}