{
    "IsRecentlyVerified": false,
    "ID": 13924,
    "UUID": "A7832604-457B-4BEE-BD50-4972C11C20E1",
    "DataProviderID": 2,
    "DataProvidersReference": "42408",
    "UsageTypeID": 1,
    "AddressInfo": {
        "ID": 13821,
        "Title": "Kwik Trip #367",
        "AddressLine1": "701 W State St",
        "Town": "Fox Lake",
        "StateOrProvince": "WI",
        "Postcode": "53933",
        "CountryID": 2,
        "Latitude": 43.567014,
        "Longitude": -88.916183,
        "ContactTelephone1": "920-928-2070",
        "AccessComments": "24 hours daily",
        "RelatedURL": "",
        "DistanceUnit": 0
    },
    "Connections": [
        {
            "ID": 11353,
            "ConnectionTypeID": 9,
            "LevelID": 1,
            "Amps": 16,
            "Voltage": 120,
            "PowerKW": 1.9,
            "CurrentTypeID": 10,
            "Quantity": 1
        }
    ],
    "DateLastStatusUpdate": "2020-06-26T03:07:00Z",
    "DataQualityLevel": 3,
    "DateCreated": "2012-12-06T16:48:00Z",
    "SubmissionStatusTypeID": 100
}