{
    "IsRecentlyVerified": false,
    "ID": 181838,
    "UUID": "5909BEEB-BB94-4408-A1DC-71EF186D5DE1",
    "DataProviderID": 29,
    "DataProvidersReference": "8220,6421",
    "AddressInfo": {
        "ID": 182197,
        "Title": "Brüderstr. 53",
        "AddressLine1": "Brüderstr. 53",
        "Town": "Bergisch Gladbach",
        "Postcode": "51427",
        "CountryID": 87,
        "Latitude": 50.951086,
        "Longitude": 7.146015,
        "DistanceUnit": 0
    },
    "Connections": [
        {
            "ID": 286764,
            "ConnectionTypeID": 25,
            "StatusTypeID": 50,
            "LevelID": 2,
            "PowerKW": 22,
            "CurrentTypeID": 20
        },
        {
            "ID": 286765,
            "ConnectionTypeID": 25,
            "StatusTypeID": 50,
            "LevelID": 2,
            "PowerKW": 22,
            "CurrentTypeID": 20
        },
        {
            "ID": 286766,
            "ConnectionTypeID": 25,
            "StatusTypeID": 50,
            "LevelID": 2,
            "PowerKW": 22,
            "CurrentTypeID": 20
        },
        {
            "ID": 286767,
            "ConnectionTypeID": 25,
            "StatusTypeID": 50,
            "LevelID": 2,
            "PowerKW": 22,
            "CurrentTypeID": 20
        }
    ],
    "StatusTypeID": 50,
    "DateLastStatusUpdate": "2021-07-09T03:21:00Z",
    "MetadataValues": [
        {
            "ID": 14132,
            "MetadataFieldID": 4,
            "ItemValue": "Data from the German chargepoint registry provided by Bundesnetzagentur.de under the CC-BY 4.0 license"
        }
    ],
    "DataQualityLevel": 3,
    "DateCreated": "2021-07-08T10:02:00Z",
    "SubmissionStatusTypeID": 100
}