{
    "IsRecentlyVerified": false,
    "ID": 135963,
    "UUID": "74A17442-A100-438C-9BC1-C6D89A271C28",
    "DataProviderID": 18,
    "DataProvidersReference": "97f4c22bfe4216becff94b18fb479131",
    "OperatorID": 2244,
    "UsageTypeID": 5,
    "AddressInfo": {
        "ID": 136309,
        "Title": "Calais Street",
        "AddressLine1": "Calais Street",
        "Town": "London",
        "Postcode": "SE5 9LP",
        "CountryID": 1,
        "Latitude": 51.474783,
        "Longitude": -0.102536,
        "AccessComments": "",
        "RelatedURL": "https://www.ubitricity.com",
        "DistanceUnit": 0
    },
    "Connections": [
        {
            "ID": 190389,
            "ConnectionTypeID": 25,
            "Reference": "suby1100000386",
            "StatusTypeID": 50,
            "LevelID": 2,
            "Amps": 16,
            "Voltage": 230,
            "PowerKW": 3.7,
            "CurrentTypeID": 10
        }
    ],
    "StatusTypeID": 0,
    "DateLastStatusUpdate": "2021-04-25T05:46:00Z",
    "MetadataValues": [
        {
            "ID": 5815,
            "MetadataFieldID": 4,
            "ItemValue": "Contains public sector information licensed under the Open Government Licence v2.0. http://www.nationalarchives.gov.uk/doc/open-government-licence/version/2/"
        }
    ],
    "DataQualityLevel": 3,
    "DateCreated": "2019-12-24T05:22:00Z",
    "SubmissionStatusTypeID": 100
}