{
    "IsRecentlyVerified": false,
    "ID": 173294,
    "UUID": "33C0F32D-2053-44A4-B7E9-D0D7DE72FBE5",
    "DataProviderID": 19,
    "DataProvidersReference": "6944",
    "AddressInfo": {
        "ID": 173653,
        "Title": "Skjöldólfsstaðir",
        "AddressLine1": "Skjöldólfsstaðir ",
        "Town": "Egilsstöðum",
        "StateOrProvince": "Austurland",
        "Postcode": "701",
        "CountryID": 105,
        "Latitude": 65.316921,
        "Longitude": -15.116231,
        "AccessComments": "",
        "DistanceUnit": 0
    },
    "Connections": [
        {
            "ID": 266195,
            "ConnectionTypeID": 25,
            "Reference": "1",
            "LevelID": 3,
            "Amps": 32,
            "Voltage": 400,
            "PowerKW": 22,
            "CurrentTypeID": 30,
            "Comments": "Mode 3"
        }
    ],
    "NumberOfPoints": 1,
    "StatusTypeID": 0,
    "DateLastStatusUpdate": "2021-03-03T09:03:00Z",
    "DataQualityLevel": 2,
    "DateCreated": "2021-03-03T09:03:00Z",
    "SubmissionStatusTypeID": 100
}