{
    "IsRecentlyVerified": false,
    "ID": 36826,
    "UUID": "DD57E202-E4FC-4BCB-B4BC-22F1C806FD43",
    "DataProviderID": 1,
    "OperatorID": 105,
    "OperatorsReference": "Essent EM-DE-05566092-01-00003",
    "UsageTypeID": 1,
    "AddressInfo": {
        "ID": 37172,
        "Title": "BAT Brockbachtal Süd",
        "AddressLine1": "Danebrock 1",
        "Town": "Velpe",
        "Postcode": "49492",
        "CountryID": 87,
        "Latitude": 52.260378203316016,
        "Longitude": 7.848027899475025,
        "AccessComments": "24/7 nutzbar ohne Ladekarte, Laden kostenlos an 2 Plätzen.",
        "DistanceUnit": 0
    },
    "Connections": [
        {
            "ID": 40337,
            "ConnectionTypeID": 2,
            "StatusTypeID": 50,
            "LevelID": 3,
            "PowerKW": 20,
            "CurrentTypeID": 30,
            "Quantity": 1
        },
        {
            "ID": 72820,
            "ConnectionTypeID": 25,
            "StatusTypeID": 50,
            "LevelID": 2,
            "PowerKW": 22,
            "CurrentTypeID": 20,
            "Quantity": 1
        },
        {
            "ID": 72821,
            "ConnectionTypeID": 33,
            "StatusTypeID": 50,
            "LevelID": 3,
            "PowerKW": 20,
            "CurrentTypeID": 30,
            "Quantity": 1
        }
    ],
    "NumberOfPoints": 2,
    "StatusTypeID": 50,
    "DateLastStatusUpdate": "2015-12-07T10:36:00Z",
    "DataQualityLevel": 3,
    "DateCreated": "2015-01-09T06:07:00Z",
    "SubmissionStatusTypeID": 200
}