{
    "IsRecentlyVerified": false,
    "ID": 153614,
    "UUID": "14A08568-CB91-457E-8384-A7C228A2E21B",
    "DataProviderID": 28,
    "DataProvidersReference": "FR*S10*P10123B",
    "UsageTypeID": 5,
    "AddressInfo": {
        "ID": 153967,
        "Title": "DIENVILLE",
        "AddressLine1": "37 Avenue Paul Girard 10500 DIENVILLE",
        "CountryID": 80,
        "Latitude": 48.348173,
        "Longitude": 4.535224,
        "AccessComments": "",
        "DistanceUnit": 0
    },
    "Connections": [
        {
            "ID": 215606,
            "ConnectionTypeID": 28,
            "StatusTypeID": 50,
            "LevelID": 2,
            "PowerKW": 18,
            "CurrentTypeID": 10
        },
        {
            "ID": 215607,
            "ConnectionTypeID": 25,
            "StatusTypeID": 50,
            "LevelID": 2,
            "PowerKW": 18,
            "CurrentTypeID": 20
        },
        {
            "ID": 249177,
            "ConnectionTypeID": 28,
            "StatusTypeID": 50,
            "LevelID": 2,
            "PowerKW": 18,
            "CurrentTypeID": 10
        },
        {
            "ID": 249178,
            "ConnectionTypeID": 25,
            "StatusTypeID": 50,
            "LevelID": 2,
            "PowerKW": 18,
            "CurrentTypeID": 20
        }
    ],
    "GeneralComments": "\"Une unité = 6kWh de recharge. Utilisateur abonné : 1€/unité",
    "StatusTypeID": 50,
    "DateLastStatusUpdate": "2020-08-27T05:14:00Z",
    "DataQualityLevel": 2,
    "DateCreated": "2020-03-15T10:54:00Z",
    "SubmissionStatusTypeID": 100
}