{
    "IsRecentlyVerified": false,
    "ID": 108432,
    "UUID": "250EDCDC-4E12-4F0F-A2AE-A2DB8A40E211",
    "DataProviderID": 1,
    "OperatorID": 80,
    "UsageTypeID": 4,
    "AddressInfo": {
        "ID": 108778,
        "Title": "Treviglio  Parcheggio della piscina | EnelX",
        "AddressLine1": "Via Abate Crippa, 34",
        "Town": "Treviglio",
        "StateOrProvince": "BG",
        "Postcode": "24047",
        "CountryID": 112,
        "Latitude": 45.52114498933404,
        "Longitude": 9.601591051756486,
        "ContactTelephone1": "800.069.850",
        "RelatedURL": "https://www.enelx.com/it/it/emobility",
        "DistanceUnit": 0
    },
    "Connections": [
        {
            "ID": 153322,
            "ConnectionTypeID": 25,
            "StatusTypeID": 50,
            "LevelID": 2,
            "Amps": 32,
            "Voltage": 400,
            "PowerKW": 22,
            "CurrentTypeID": 20,
            "Quantity": 1
        },
        {
            "ID": 153323,
            "ConnectionTypeID": 36,
            "StatusTypeID": 50,
            "LevelID": 2,
            "Amps": 16,
            "Voltage": 240,
            "PowerKW": 3.7,
            "CurrentTypeID": 10,
            "Quantity": 1
        }
    ],
    "NumberOfPoints": 2,
    "StatusTypeID": 50,
    "DateLastStatusUpdate": "2018-10-01T13:14:00Z",
    "DataQualityLevel": 1,
    "DateCreated": "2018-10-01T13:14:00Z",
    "SubmissionStatusTypeID": 200
}