{
    "IsRecentlyVerified": false,
    "ID": 173036,
    "UUID": "DA7C4156-7963-43C3-919A-66D5223FA9F3",
    "DataProviderID": 1,
    "OperatorID": 3307,
    "UsageTypeID": 5,
    "AddressInfo": {
        "ID": 173395,
        "Title": "NKM 22 kW DC Bártfai utca",
        "AddressLine1": "Bártfai utca 52/B",
        "Town": "Budapest",
        "Postcode": "1119",
        "CountryID": 104,
        "Latitude": 47.46739446036776,
        "Longitude": 19.03176404016881,
        "DistanceUnit": 0
    },
    "Connections": [
        {
            "ID": 264759,
            "ConnectionTypeID": 33,
            "StatusTypeID": 50,
            "LevelID": 3,
            "PowerKW": 22,
            "CurrentTypeID": 30,
            "Quantity": 1,
            "Comments": ""
        },
        {
            "ID": 264760,
            "ConnectionTypeID": 2,
            "StatusTypeID": 50,
            "LevelID": 3,
            "PowerKW": 22,
            "CurrentTypeID": 30,
            "Quantity": 1
        }
    ],
    "NumberOfPoints": 1,
    "StatusTypeID": 50,
    "DateLastStatusUpdate": "2021-03-02T12:46:00Z",
    "DataQualityLevel": 1,
    "DateCreated": "2021-03-02T08:32:00Z",
    "SubmissionStatusTypeID": 200
}