{
    "IsRecentlyVerified": false,
    "ID": 157725,
    "UUID": "7295B1F7-1D90-41DC-B2B8-C7D13A4BA522",
    "DataProviderID": 1,
    "OperatorID": 21,
    "UsageTypeID": 4,
    "UsageCost": "Mobi.E compatible card",
    "AddressInfo": {
        "ID": 158079,
        "Title": "VPA-00001",
        "AddressLine1": "Largo Sousa e Costa",
        "Town": "Vila Pouca de Aguiar",
        "StateOrProvince": "Vila Real",
        "Postcode": "5450-020",
        "CountryID": 180,
        "Latitude": 41.498944,
        "Longitude": -7.643833,
        "RelatedURL": "https://www.mobie.pt",
        "DistanceUnit": 0
    },
    "Connections": [
        {
            "ID": 227239,
            "ConnectionTypeID": 25,
            "StatusTypeID": 50,
            "LevelID": 2,
            "Amps": 32,
            "Voltage": 400,
            "PowerKW": 22,
            "CurrentTypeID": 20,
            "Quantity": 2
        }
    ],
    "NumberOfPoints": 2,
    "StatusTypeID": 50,
    "DateLastStatusUpdate": "2020-09-18T20:54:00Z",
    "DataQualityLevel": 3,
    "DateCreated": "2020-06-25T05:42:00Z",
    "SubmissionStatusTypeID": 100
}