{
    "IsRecentlyVerified": false,
    "ID": 29713,
    "UUID": "7C62BA29-CE58-4DA1-9368-3BC45A855606",
    "DataProviderID": 15,
    "DataProvidersReference": "37390",
    "OperatorID": 31,
    "UsageTypeID": 1,
    "AddressInfo": {
        "ID": 30059,
        "Title": "902 Pacific Ave",
        "AddressLine1": "902 Pacific Ave",
        "Town": "Santa Cruz",
        "StateOrProvince": "CA",
        "Postcode": "95060",
        "CountryID": 2,
        "Latitude": 36.97056,
        "Longitude": -122.02496,
        "ContactTelephone1": "831-420-5184",
        "RelatedURL": "http://carstations.com/37390",
        "DistanceUnit": 0
    },
    "Connections": [
        {
            "ID": 32698,
            "ConnectionTypeID": 1,
            "Reference": "J1772",
            "LevelID": 2
        }
    ],
    "NumberOfPoints": 2,
    "StatusTypeID": 50,
    "DateLastStatusUpdate": "2017-11-04T14:04:00Z",
    "DataQualityLevel": 2,
    "DateCreated": "2014-11-29T05:39:00Z",
    "SubmissionStatusTypeID": 100
}