{
    "UserComments": [
        {
            "ID": 10441,
            "ChargePointID": 46348,
            "CommentTypeID": 10,
            "UserName": "Zyg0te",
            "Comment": "Perfekt plassert rett foran inngangen. Et fin trøst når man må begi seg inn på IKEA",
            "Rating": 5,
            "DateCreated": "2016-05-18T21:08:07.107Z",
            "User": {
                "ID": 7885,
                "Username": "Zyg0te"
            },
            "CheckinStatusTypeID": 10
        }
    ],
    "MediaItems": [
        {
            "ID": 5913,
            "ChargePointID": 46348,
            "ItemURL": "https://s3-ap-southeast-2.amazonaws.com/openchargemap/images/NO/OCM46348/OCM-46348.orig.2016022009332343.jpeg",
            "ItemThumbnailURL": "https://s3-ap-southeast-2.amazonaws.com/openchargemap/images/NO/OCM46348/OCM-46348.thmb.2016022009332343.jpeg",
            "Comment": "",
            "IsEnabled": true,
            "IsVideo": false,
            "IsFeaturedItem": false,
            "IsExternalResource": false,
            "User": {
                "ID": 7885,
                "Username": "Zyg0te"
            },
            "DateCreated": "2016-02-20T09:34:00Z"
        }
    ],
    "IsRecentlyVerified": false,
    "ID": 46348,
    "UUID": "BACE0EE5-15AA-4F5E-B019-7EF291D19563",
    "DataProviderID": 1,
    "AddressInfo": {
        "ID": 46694,
        "Title": "IKEA Furuset, Oslo",
        "AddressLine1": "Strømsveien 303",
        "Town": "OSLO",
        "StateOrProvince": "Oslo",
        "Postcode": "1081",
        "CountryID": 168,
        "Latitude": 59.934104254450084,
        "Longitude": 10.870841896820126,
        "AccessComments": "Type2: Ved IKEA Busholdeplass.\r\nSchuko: Rett utenfor hovedinngangen.",
        "DistanceUnit": 0
    },
    "Connections": [
        {
            "ID": 57011,
            "ConnectionTypeID": 25,
            "Reference": "1",
            "StatusTypeID": 50,
            "LevelID": 2,
            "Amps": 16,
            "Voltage": 400,
            "PowerKW": 6,
            "CurrentTypeID": 20,
            "Comments": "Mode 3"
        },
        {
            "ID": 76648,
            "ConnectionTypeID": 28,
            "StatusTypeID": 50,
            "Amps": 13,
            "Quantity": 4
        }
    ],
    "NumberOfPoints": 10,
    "StatusTypeID": 50,
    "DateLastStatusUpdate": "2016-05-18T21:08:00Z",
    "DataQualityLevel": 2,
    "DateCreated": "2015-05-03T00:54:00Z",
    "SubmissionStatusTypeID": 100
}