{
    "UserComments": [
        {
            "ID": 21978,
            "ChargePointID": 86047,
            "CommentTypeID": 1000,
            "UserName": "SR-71 Blackbird",
            "Comment": "benutzung wurde verweigert!!!",
            "Rating": 1,
            "DateCreated": "2020-01-02T11:47:52.07Z",
            "User": {
                "ID": 23318,
                "Username": "SR-71 Blackbird"
            },
            "CheckinStatusTypeID": 40,
            "IsActionedByEditor": false
        }
    ],
    "IsRecentlyVerified": false,
    "ID": 86047,
    "UUID": "2F35BEF6-5479-43E2-99F2-3A6C971FA1C2",
    "DataProviderID": 1,
    "OperatorID": 45,
    "UsageTypeID": 2,
    "AddressInfo": {
        "ID": 86393,
        "Title": "Parkplatz Autostadt",
        "AddressLine1": "Parkstraße",
        "Town": "Wolfsburg",
        "StateOrProvince": "Wolfsburg",
        "Postcode": "38440",
        "CountryID": 87,
        "Latitude": 52.434099828938194,
        "Longitude": 10.796289149665874,
        "AccessComments": "Ca 20 Ladestationen. NICHT ZUGÄNGLICH FÜR BENUTZER DES PARKPLATZES!!!! So macht Energiewende Spaß. VW nur weiter so!",
        "DistanceUnit": 0
    },
    "Connections": [
        {
            "ID": 122379,
            "ConnectionTypeID": 25,
            "StatusTypeID": 50,
            "LevelID": 2,
            "Amps": 16,
            "Voltage": 230,
            "PowerKW": 3.7,
            "CurrentTypeID": 10,
            "Quantity": 4
        }
    ],
    "NumberOfPoints": 4,
    "StatusTypeID": 50,
    "DateLastStatusUpdate": "2020-01-02T17:35:00Z",
    "DataQualityLevel": 1,
    "DateCreated": "2017-04-24T06:52:00Z",
    "SubmissionStatusTypeID": 200
}