{
    "IsRecentlyVerified": false,
    "ID": 101448,
    "UUID": "9C3FC0D4-BEFB-4BC0-8ACD-10AB6030D124",
    "DataProviderID": 1,
    "OperatorID": 156,
    "UsageTypeID": 4,
    "AddressInfo": {
        "ID": 101794,
        "Title": "Tiefgarage G1",
        "AddressLine1": "Marktstraße",
        "Town": "Mannheim",
        "StateOrProvince": "Mannheim",
        "Postcode": "68159",
        "CountryID": 87,
        "Latitude": 49.49001010095331,
        "Longitude": 8.4673055009888,
        "AccessComments": "24/7 nutzbar",
        "RelatedURL": "https://www.parken-mannheim.de/parken/tiefgarage-collini-center",
        "DistanceUnit": 0
    },
    "Connections": [
        {
            "ID": 143239,
            "ConnectionTypeID": 25,
            "StatusTypeID": 50,
            "LevelID": 2,
            "Amps": 16,
            "Voltage": 400,
            "PowerKW": 11,
            "CurrentTypeID": 20,
            "Quantity": 2
        }
    ],
    "NumberOfPoints": 2,
    "StatusTypeID": 50,
    "DateLastStatusUpdate": "2018-03-28T12:03:00Z",
    "DataQualityLevel": 1,
    "DateCreated": "2018-03-28T12:03:00Z",
    "SubmissionStatusTypeID": 200
}