{
    "IsRecentlyVerified": false,
    "ID": 125821,
    "UUID": "14B32217-B5C4-4891-9A29-847802C9D9C5",
    "DataProviderID": 1,
    "OperatorID": 45,
    "UsageTypeID": 1,
    "AddressInfo": {
        "ID": 126167,
        "Title": "ON Byko",
        "AddressLine1": "Skemmuvegur 2a",
        "Town": "Kópavogur",
        "Postcode": "200",
        "CountryID": 105,
        "Latitude": 64.1084519093853,
        "Longitude": -21.8529652141274,
        "DistanceUnit": 0
    },
    "Connections": [
        {
            "ID": 176333,
            "ConnectionTypeID": 25,
            "StatusTypeID": 50,
            "LevelID": 2,
            "Amps": 32,
            "Voltage": 400,
            "PowerKW": 22,
            "CurrentTypeID": 20,
            "Quantity": 2
        }
    ],
    "NumberOfPoints": 1,
    "StatusTypeID": 50,
    "DateLastStatusUpdate": "2019-04-29T18:37:00Z",
    "DataQualityLevel": 1,
    "DateCreated": "2019-04-29T09:12:00Z",
    "SubmissionStatusTypeID": 200
}