{
    "IsRecentlyVerified": false,
    "ID": 161666,
    "UUID": "DE1318D9-2B3E-46EC-A0A4-E6BF0DDB3C92",
    "DataProviderID": 1,
    "OperatorID": 63,
    "UsageTypeID": 5,
    "AddressInfo": {
        "ID": 162023,
        "Title": "Rue de Genève - Genèvestraat",
        "AddressLine1": "Rue de Genève - Genèvestraat",
        "Town": "Evere",
        "StateOrProvince": "Brussels-Capital",
        "Postcode": "1140",
        "CountryID": 26,
        "Latitude": 50.86624741841612,
        "Longitude": 4.403713746724179,
        "DistanceUnit": 0
    },
    "Connections": [
        {
            "ID": 232638,
            "ConnectionTypeID": 25,
            "StatusTypeID": 50,
            "LevelID": 2,
            "PowerKW": 22,
            "CurrentTypeID": 20,
            "Quantity": 2
        }
    ],
    "NumberOfPoints": 2,
    "StatusTypeID": 50,
    "DateLastStatusUpdate": "2020-07-23T09:47:00Z",
    "DataQualityLevel": 1,
    "DateCreated": "2020-07-20T10:48:00Z",
    "SubmissionStatusTypeID": 200
}