{
    "IsRecentlyVerified": false,
    "ID": 176573,
    "UUID": "0179CC31-C7FD-42D8-85E8-CD080835BDB3",
    "DataProviderID": 29,
    "DataProvidersReference": "3933",
    "AddressInfo": {
        "ID": 176932,
        "Title": "Bahnhofplatz",
        "AddressLine1": "Bahnhofplatz",
        "Town": "Glauchau",
        "Postcode": "08371",
        "CountryID": 87,
        "Latitude": 50.827876,
        "Longitude": 12.547434,
        "DistanceUnit": 0
    },
    "Connections": [
        {
            "ID": 274643,
            "ConnectionTypeID": 25,
            "StatusTypeID": 50,
            "LevelID": 2,
            "PowerKW": 22,
            "CurrentTypeID": 20
        },
        {
            "ID": 274644,
            "ConnectionTypeID": 25,
            "StatusTypeID": 50,
            "LevelID": 2,
            "PowerKW": 22,
            "CurrentTypeID": 20
        }
    ],
    "StatusTypeID": 0,
    "DateLastStatusUpdate": "2021-07-12T02:45:00Z",
    "MetadataValues": [
        {
            "ID": 8868,
            "MetadataFieldID": 4,
            "ItemValue": "Data from the German chargepoint registry provided by Bundesnetzagentur.de under the CC-BY 4.0 license"
        }
    ],
    "DataQualityLevel": 3,
    "DateCreated": "2021-07-08T09:48:00Z",
    "SubmissionStatusTypeID": 100
}