{
    "IsRecentlyVerified": false,
    "ID": 97056,
    "UUID": "8DBB4F87-1579-454B-96DF-31DF6C6E19F4",
    "DataProviderID": 1,
    "DataProvidersReference": "4454",
    "AddressInfo": {
        "ID": 97402,
        "Title": "Leksands Sparbank",
        "AddressLine1": "Sparbanksgatan 1",
        "Town": "LEKSAND",
        "StateOrProvince": "DALARNA",
        "Postcode": "79331",
        "CountryID": 216,
        "Latitude": 60.73099,
        "Longitude": 14.9951,
        "AccessComments": "Längst in på Leksands Sparbanks parkering på baksidan av bankhuset och huvudentrén.",
        "DistanceUnit": 0
    },
    "Connections": [
        {
            "ID": 137713,
            "ConnectionTypeID": 0,
            "Reference": "1",
            "LevelID": 2,
            "Amps": 16,
            "Voltage": 400,
            "PowerKW": 11,
            "Comments": "Mode 3"
        },
        {
            "ID": 137714,
            "ConnectionTypeID": 0,
            "Reference": "2",
            "LevelID": 2,
            "Amps": 16,
            "Voltage": 400,
            "PowerKW": 11,
            "Comments": "Mode 3"
        },
        {
            "ID": 137715,
            "ConnectionTypeID": 0,
            "Reference": "3",
            "LevelID": 2,
            "Amps": 16,
            "Voltage": 400,
            "PowerKW": 11,
            "Comments": "Mode 3"
        },
        {
            "ID": 137716,
            "ConnectionTypeID": 0,
            "Reference": "4",
            "LevelID": 2,
            "Amps": 16,
            "Voltage": 400,
            "PowerKW": 11,
            "Comments": "Mode 3"
        }
    ],
    "NumberOfPoints": 4,
    "DateLastStatusUpdate": "2020-05-26T08:24:00Z",
    "DataQualityLevel": 2,
    "DateCreated": "2018-01-04T08:28:00Z",
    "SubmissionStatusTypeID": 100
}