{
    "IsRecentlyVerified": false,
    "ID": 91376,
    "UUID": "F8334326-1C25-4B67-8B39-E743D7622D57",
    "DataProviderID": 2,
    "DataProvidersReference": "86097",
    "OperatorID": 5,
    "UsageTypeID": 1,
    "AddressInfo": {
        "ID": 91722,
        "Title": "DOWNTOWN",
        "AddressLine1": "44 W Main St Tourism/Visitor Ctr",
        "Town": "Thomasville",
        "StateOrProvince": "NC",
        "Postcode": "27360",
        "CountryID": 2,
        "Latitude": 35.8823047,
        "Longitude": -80.0835051,
        "ContactTelephone1": "888-758-4389",
        "AccessComments": "24 hours daily",
        "RelatedURL": "http://www.chargepoint.com/",
        "DistanceUnit": 0
    },
    "Connections": [
        {
            "ID": 129528,
            "ConnectionTypeID": 1,
            "LevelID": 2,
            "Amps": 16,
            "Voltage": 230,
            "PowerKW": 3,
            "CurrentTypeID": 10,
            "Quantity": 2
        }
    ],
    "DateLastStatusUpdate": "2019-04-06T04:02:00Z",
    "DataQualityLevel": 3,
    "DateCreated": "2017-08-03T12:25:00Z",
    "SubmissionStatusTypeID": 100
}