{
    "IsRecentlyVerified": false,
    "ID": 20047,
    "UUID": "D81AA646-A0D2-4659-9EB7-EE32FF8635B6",
    "DataProviderID": 1,
    "OperatorID": 1,
    "UsageTypeID": 0,
    "UsageCost": "",
    "AddressInfo": {
        "ID": 20392,
        "Title": "Place Jean Sapin - Cucq",
        "AddressLine1": "Place Jean Sapin",
        "AddressLine2": "",
        "Town": "",
        "StateOrProvince": "Cucq",
        "Postcode": "62780",
        "CountryID": 80,
        "Latitude": 50.481,
        "Longitude": 1.58949,
        "ContactTelephone1": "",
        "ContactTelephone2": "",
        "ContactEmail": "",
        "AccessComments": "Ouvert à tous",
        "RelatedURL": "",
        "DistanceUnit": 0
    },
    "Connections": [],
    "GeneralComments": "",
    "StatusTypeID": 50,
    "DateLastStatusUpdate": "2013-10-25T12:01:00Z",
    "DataQualityLevel": 1,
    "DateCreated": "2013-10-25T10:28:00Z",
    "SubmissionStatusTypeID": 200
}