{
    "IsRecentlyVerified": false,
    "ID": 113687,
    "UUID": "70711DC3-F41D-4B28-A6FC-7CDDD78565B5",
    "DataProviderID": 1,
    "OperatorID": 80,
    "UsageTypeID": 4,
    "AddressInfo": {
        "ID": 114033,
        "Title": "Treviglio Crivelli | EnelX",
        "AddressLine1": "Via Crivelli",
        "Town": "Treviglio",
        "StateOrProvince": "BG",
        "Postcode": "24047",
        "CountryID": 112,
        "Latitude": 45.51995774715217,
        "Longitude": 9.596868433986359,
        "ContactTelephone1": "800.069.850",
        "RelatedURL": "https://www.enelx.com/it/it/emobility",
        "DistanceUnit": 0
    },
    "Connections": [
        {
            "ID": 160233,
            "ConnectionTypeID": 25,
            "StatusTypeID": 50,
            "LevelID": 2,
            "Amps": 32,
            "Voltage": 400,
            "PowerKW": 22,
            "CurrentTypeID": 20,
            "Quantity": 2
        }
    ],
    "NumberOfPoints": 2,
    "StatusTypeID": 50,
    "DateLastStatusUpdate": "2018-12-30T15:26:00Z",
    "DataQualityLevel": 1,
    "DateCreated": "2018-12-30T15:26:00Z",
    "SubmissionStatusTypeID": 200
}