{
    "IsRecentlyVerified": false,
    "ID": 17462,
    "UUID": "249A7926-D817-43A9-A875-0D5CB3EF8A3B",
    "DataProviderID": 22,
    "DataProvidersReference": "F38575EE8AF23BA6D923C0D98EE767FC",
    "AddressInfo": {
        "ID": 17807,
        "Title": "徳島日産自動車徳島店",
        "AddressLine1": "徳島県徳島市昭和町8-44-5",
        "CountryID": 114,
        "Latitude": 34.05598495,
        "Longitude": 134.5704969,
        "ContactTelephone1": "088-623-2161",
        "DistanceUnit": 0
    },
    "Connections": [
        {
            "ID": 17703,
            "ConnectionTypeID": 2,
            "LevelID": 2,
            "Amps": 100,
            "Voltage": 480,
            "PowerKW": 48,
            "Quantity": 1
        }
    ],
    "DateLastStatusUpdate": "2013-06-29T08:58:00Z",
    "DataQualityLevel": 2,
    "DateCreated": "2013-06-29T08:58:00Z",
    "SubmissionStatusTypeID": 200
}