{
    "IsRecentlyVerified": false,
    "ID": 172721,
    "UUID": "690894E9-0A2C-4571-85A8-2569EF1F8664",
    "DataProviderID": 1,
    "OperatorID": 21,
    "UsageTypeID": 4,
    "UsageCost": "Mobi.E compatible card or App",
    "AddressInfo": {
        "ID": 173080,
        "Title": "TVD-00015/16/17/18",
        "AddressLine1": "Intermarché",
        "Town": "Torres Vedras",
        "StateOrProvince": "Lisboa",
        "Postcode": "",
        "CountryID": 180,
        "Latitude": 39.102076905125955,
        "Longitude": -9.257847747914639,
        "AccessComments": "Intermarché",
        "DistanceUnit": 0
    },
    "Connections": [
        {
            "ID": 264128,
            "ConnectionTypeID": 2,
            "StatusTypeID": 50,
            "LevelID": 3,
            "Amps": 120,
            "Voltage": 500,
            "PowerKW": 50,
            "CurrentTypeID": 30,
            "Quantity": 2
        },
        {
            "ID": 264129,
            "ConnectionTypeID": 33,
            "StatusTypeID": 50,
            "LevelID": 3,
            "Amps": 120,
            "Voltage": 500,
            "PowerKW": 50,
            "CurrentTypeID": 30,
            "Quantity": 1
        },
        {
            "ID": 264130,
            "ConnectionTypeID": 25,
            "StatusTypeID": 50,
            "LevelID": 2,
            "Amps": 32,
            "Voltage": 400,
            "PowerKW": 22,
            "CurrentTypeID": 20,
            "Quantity": 2
        },
        {
            "ID": 264131,
            "ConnectionTypeID": 33,
            "StatusTypeID": 50,
            "LevelID": 3,
            "Amps": 350,
            "Voltage": 920,
            "PowerKW": 160,
            "CurrentTypeID": 30,
            "Quantity": 1
        }
    ],
    "NumberOfPoints": 4,
    "StatusTypeID": 50,
    "DateLastStatusUpdate": "2021-02-13T22:34:00Z",
    "DataQualityLevel": 1,
    "DateCreated": "2021-02-13T22:34:00Z",
    "SubmissionStatusTypeID": 200
}