{
    "IsRecentlyVerified": false,
    "ID": 179886,
    "UUID": "E8D9CDFF-1105-4EBB-8FE8-1A1327A872C9",
    "DataProviderID": 29,
    "DataProvidersReference": "19631",
    "AddressInfo": {
        "ID": 180245,
        "Title": "Hauptstr. 24",
        "AddressLine1": "Hauptstr. 24",
        "Town": "Lachen",
        "Postcode": "87760",
        "CountryID": 87,
        "Latitude": 47.94503,
        "Longitude": 10.23866,
        "DistanceUnit": 0
    },
    "Connections": [
        {
            "ID": 282312,
            "ConnectionTypeID": 25,
            "StatusTypeID": 50,
            "LevelID": 2,
            "PowerKW": 22,
            "CurrentTypeID": 20
        },
        {
            "ID": 282313,
            "ConnectionTypeID": 25,
            "StatusTypeID": 50,
            "LevelID": 2,
            "PowerKW": 22,
            "CurrentTypeID": 20
        }
    ],
    "StatusTypeID": 50,
    "DateLastStatusUpdate": "2021-07-12T02:40:00Z",
    "MetadataValues": [
        {
            "ID": 12180,
            "MetadataFieldID": 4,
            "ItemValue": "Data from the German chargepoint registry provided by Bundesnetzagentur.de under the CC-BY 4.0 license"
        }
    ],
    "DataQualityLevel": 3,
    "DateCreated": "2021-07-08T10:00:00Z",
    "SubmissionStatusTypeID": 100
}