{
    "IsRecentlyVerified": false,
    "ID": 140484,
    "UUID": "C66903E6-59FA-4728-B2EC-418CCEFAAB00",
    "DataProviderID": 2,
    "DataProvidersReference": "104938",
    "UsageTypeID": 2,
    "AddressInfo": {
        "ID": 140836,
        "Title": "Capital One - Las Vegas",
        "AddressLine1": "1111 N Town Center Dr",
        "Town": "Las Vegas",
        "StateOrProvince": "NV",
        "Postcode": "89144",
        "CountryID": 2,
        "Latitude": 36.183452,
        "Longitude": -115.312736,
        "ContactTelephone1": "",
        "AccessComments": "Employee use only",
        "RelatedURL": "",
        "DistanceUnit": 0
    },
    "Connections": [
        {
            "ID": 196122,
            "ConnectionTypeID": 1,
            "LevelID": 2,
            "Amps": 16,
            "Voltage": 230,
            "PowerKW": 3.7,
            "CurrentTypeID": 10,
            "Quantity": 4
        }
    ],
    "StatusTypeID": 50,
    "DateLastStatusUpdate": "2020-06-26T02:58:00Z",
    "DataQualityLevel": 3,
    "DateCreated": "2019-12-24T09:13:00Z",
    "SubmissionStatusTypeID": 100
}