{
    "IsRecentlyVerified": false,
    "ID": 152794,
    "UUID": "E4B12E4D-0D82-4859-83DB-DC34CCF0C300",
    "DataProviderID": 28,
    "DataProvidersReference": "FR*S49*P49007*026",
    "UsageTypeID": 5,
    "AddressInfo": {
        "ID": 153147,
        "Title": "ANGERS - Rue Louis Gain",
        "AddressLine1": "Rue Louis Gain 49000 ANGERS",
        "CountryID": 80,
        "Latitude": 47.469068,
        "Longitude": -0.539925,
        "AccessComments": "24h/24 7j/7",
        "DistanceUnit": 0
    },
    "Connections": [
        {
            "ID": 214057,
            "ConnectionTypeID": 25,
            "StatusTypeID": 50,
            "LevelID": 2,
            "PowerKW": 18,
            "CurrentTypeID": 20
        },
        {
            "ID": 214058,
            "ConnectionTypeID": 28,
            "StatusTypeID": 50,
            "LevelID": 2,
            "PowerKW": 18,
            "CurrentTypeID": 10
        },
        {
            "ID": 247278,
            "ConnectionTypeID": 25,
            "StatusTypeID": 50,
            "LevelID": 2,
            "PowerKW": 18,
            "CurrentTypeID": 20
        },
        {
            "ID": 247279,
            "ConnectionTypeID": 28,
            "StatusTypeID": 50,
            "LevelID": 2,
            "PowerKW": 18,
            "CurrentTypeID": 10
        }
    ],
    "GeneralComments": "Recharge par badge et avec une application smartphone",
    "StatusTypeID": 50,
    "DateLastStatusUpdate": "2020-08-27T05:13:00Z",
    "DataQualityLevel": 2,
    "DateCreated": "2020-03-15T10:54:00Z",
    "SubmissionStatusTypeID": 100
}