{
    "IsRecentlyVerified": false,
    "ID": 184714,
    "UUID": "909214A9-9DB5-4CEF-A106-D4451F1587EB",
    "DataProviderID": 29,
    "DataProvidersReference": "15561",
    "OperatorID": 3297,
    "AddressInfo": {
        "ID": 185073,
        "Title": "Hauptstraße 59",
        "AddressLine1": "Hauptstraße 59",
        "Town": "Brombachtal",
        "Postcode": "64753",
        "CountryID": 87,
        "Latitude": 49.732325,
        "Longitude": 8.957419,
        "DistanceUnit": 0
    },
    "Connections": [
        {
            "ID": 293318,
            "ConnectionTypeID": 25,
            "StatusTypeID": 50,
            "LevelID": 2,
            "PowerKW": 22,
            "CurrentTypeID": 20
        },
        {
            "ID": 293319,
            "ConnectionTypeID": 25,
            "StatusTypeID": 50,
            "LevelID": 2,
            "PowerKW": 22,
            "CurrentTypeID": 20
        }
    ],
    "StatusTypeID": 50,
    "DateLastStatusUpdate": "2021-07-12T02:43:00Z",
    "MetadataValues": [
        {
            "ID": 17005,
            "MetadataFieldID": 4,
            "ItemValue": "Data from the German chargepoint registry provided by Bundesnetzagentur.de under the CC-BY 4.0 license"
        }
    ],
    "DataQualityLevel": 3,
    "DateCreated": "2021-07-08T10:05:00Z",
    "SubmissionStatusTypeID": 100
}