{
    "IsRecentlyVerified": false,
    "ID": 153642,
    "UUID": "908F0DF2-29D2-40DB-B191-7F587D1A0BFC",
    "DataProviderID": 28,
    "DataProvidersReference": "FR*S10*P10064C",
    "UsageTypeID": 5,
    "AddressInfo": {
        "ID": 153995,
        "Title": "BRIENNE LE CHÂTEAU",
        "AddressLine1": "69 Rue de l'École Militaire 10500 BRIENNE LE CHÂTEAU",
        "CountryID": 80,
        "Latitude": 48.391572,
        "Longitude": 4.52755,
        "AccessComments": "",
        "DistanceUnit": 0
    },
    "Connections": [
        {
            "ID": 215662,
            "ConnectionTypeID": 28,
            "StatusTypeID": 50,
            "LevelID": 2,
            "PowerKW": 18,
            "CurrentTypeID": 10
        },
        {
            "ID": 215663,
            "ConnectionTypeID": 25,
            "StatusTypeID": 50,
            "LevelID": 2,
            "PowerKW": 18,
            "CurrentTypeID": 20
        },
        {
            "ID": 249259,
            "ConnectionTypeID": 28,
            "StatusTypeID": 50,
            "LevelID": 2,
            "PowerKW": 18,
            "CurrentTypeID": 10
        },
        {
            "ID": 249260,
            "ConnectionTypeID": 25,
            "StatusTypeID": 50,
            "LevelID": 2,
            "PowerKW": 18,
            "CurrentTypeID": 20
        }
    ],
    "GeneralComments": "\"Une unité = 6kWh de recharge. Utilisateur abonné : 1€/unité",
    "StatusTypeID": 50,
    "DateLastStatusUpdate": "2020-08-27T05:15:00Z",
    "DataQualityLevel": 2,
    "DateCreated": "2020-03-15T10:54:00Z",
    "SubmissionStatusTypeID": 100
}