{
    "IsRecentlyVerified": false,
    "ID": 42471,
    "UUID": "D7D0DF36-9C14-4E3A-90CB-98F3A3EADC3C",
    "DataProviderID": 1,
    "OperatorID": 167,
    "UsageTypeID": 7,
    "UsageCost": "0",
    "AddressInfo": {
        "ID": 42817,
        "Title": "Autohaus Giselheid Konrad",
        "AddressLine1": "Dornbergsweg 36",
        "Town": "Wernigerode",
        "Postcode": "38855",
        "CountryID": 87,
        "Latitude": 51.8513434951791,
        "Longitude": 10.7890375278306,
        "ContactTelephone1": "05321 334980",
        "AccessComments": "Nissan Autohaus nimmt am \"Freistrom für Alle\" Programm teil, siehe Webseite.  Geöffnet von Mo.-Fr. 8:00 bis 18.00 Uhr, Sa 8:00-12:00Uhr. Freischaltung durch Mitarbeiter.",
        "RelatedURL": "http://www.nissan.de/DE/de/vehicle/electric-vehicles/leaf/charging-and-battery/freistrom-info.html",
        "DistanceUnit": 0
    },
    "Connections": [
        {
            "ID": 51128,
            "ConnectionTypeID": 28,
            "StatusTypeID": 50,
            "LevelID": 2,
            "Amps": 12,
            "Voltage": 230,
            "PowerKW": 2.8,
            "CurrentTypeID": 10,
            "Quantity": 1
        }
    ],
    "NumberOfPoints": 1,
    "StatusTypeID": 50,
    "DateLastStatusUpdate": "2015-07-06T10:46:00Z",
    "DataQualityLevel": 1,
    "DateCreated": "2015-03-11T14:44:00Z",
    "SubmissionStatusTypeID": 200
}