{
    "IsRecentlyVerified": false,
    "ID": 51931,
    "UUID": "3C83F898-883D-4535-B65C-28ACA3CA5F46",
    "DataProviderID": 1,
    "OperatorID": 23,
    "OperatorsReference": "8298",
    "UsageTypeID": 7,
    "UsageCost": "Free",
    "AddressInfo": {
        "ID": 52277,
        "Title": "Fairville Inn - Tesla",
        "AddressLine1": "506 Kennett Pike",
        "Town": "Chadds Ford",
        "StateOrProvince": "PA",
        "Postcode": "19317",
        "CountryID": 2,
        "Latitude": 39.8459468,
        "Longitude": -75.6321627,
        "ContactTelephone1": "610-388-5900  877-798-3752",
        "AccessComments": "24 hours daily; for Tesla use only;  for guest use only; see front desk for access",
        "RelatedURL": "http://www.teslamotors.com/supercharger",
        "DistanceUnit": 0
    },
    "Connections": [
        {
            "ID": 64413,
            "ConnectionTypeID": 30,
            "StatusTypeID": 50,
            "LevelID": 2,
            "Amps": 16,
            "Voltage": 230,
            "PowerKW": 8,
            "CurrentTypeID": 10,
            "Quantity": 1
        }
    ],
    "NumberOfPoints": 1,
    "StatusTypeID": 50,
    "DateLastStatusUpdate": "2017-01-26T15:26:00Z",
    "DataQualityLevel": 3,
    "DateCreated": "2015-08-13T03:43:00Z",
    "SubmissionStatusTypeID": 100
}