{
    "IsRecentlyVerified": false,
    "ID": 138611,
    "UUID": "7D669ABC-1A8C-4432-BEC5-93AC54446546",
    "DataProviderID": 2,
    "DataProvidersReference": "149500",
    "OperatorID": 9,
    "UsageTypeID": 1,
    "AddressInfo": {
        "ID": 138960,
        "Title": "Cedar Hill",
        "AddressLine1": "285 Uptown Blvd",
        "Town": "Cedar Hill",
        "StateOrProvince": "TX",
        "Postcode": "75104",
        "CountryID": 2,
        "Latitude": 32.592591,
        "Longitude": -96.951575,
        "ContactTelephone1": "888-998-2546",
        "AccessComments": "MON: 24 hours | TUE: 24 hours | WED: 24 hours | THU: 24 hours | FRI: 24 hours | SAT: 24 hours | SUN: 24 hours",
        "RelatedURL": "http://www.blinkcharging.com/",
        "DistanceUnit": 0
    },
    "Connections": [
        {
            "ID": 193763,
            "ConnectionTypeID": 1,
            "LevelID": 2,
            "Amps": 16,
            "Voltage": 230,
            "PowerKW": 3.7,
            "CurrentTypeID": 10,
            "Quantity": 3
        }
    ],
    "StatusTypeID": 50,
    "DateLastStatusUpdate": "2020-06-26T02:54:00Z",
    "DataQualityLevel": 3,
    "DateCreated": "2019-12-24T09:09:00Z",
    "SubmissionStatusTypeID": 100
}