{
    "IsRecentlyVerified": false,
    "ID": 38460,
    "UUID": "FCC4E898-2F6C-4610-BA88-19E2910A6A44",
    "DataProviderID": 1,
    "OperatorID": 156,
    "OperatorsReference": "NewMotion 02010249",
    "UsageTypeID": 4,
    "UsageCost": "",
    "AddressInfo": {
        "ID": 38806,
        "Title": "Allee der Kosmonauten 140",
        "AddressLine1": "Allee der Kosmonauten 140",
        "AddressLine2": "",
        "Town": "Berlin",
        "StateOrProvince": "",
        "Postcode": "12683",
        "CountryID": 87,
        "Latitude": 52.5338401794434,
        "Longitude": 13.5543041229248,
        "ContactTelephone1": "",
        "ContactTelephone2": "",
        "ContactEmail": "",
        "AccessComments": "",
        "RelatedURL": "",
        "DistanceUnit": 0
    },
    "Connections": [
        {
            "ID": 41971,
            "ConnectionTypeID": 25,
            "StatusTypeID": 0,
            "LevelID": 2,
            "PowerKW": 37,
            "CurrentTypeID": 10
        }
    ],
    "NumberOfPoints": 1,
    "GeneralComments": "",
    "StatusTypeID": 50,
    "DateLastStatusUpdate": "2015-06-12T21:28:00Z",
    "DataQualityLevel": 3,
    "DateCreated": "2015-01-09T06:07:00Z",
    "SubmissionStatusTypeID": 200
}