{
    "IsRecentlyVerified": false,
    "ID": 19028,
    "UUID": "2B5B3BFA-5023-4CDE-B86C-1653CE61F4A4",
    "DataProviderID": 1,
    "OperatorID": 32,
    "OperatorsReference": "2180,2193,2194",
    "UsageTypeID": 4,
    "UsageCost": "Inclusive; for Polar Plus subscription members only. Parking fees apply",
    "AddressInfo": {
        "ID": 19373,
        "Title": "Newham University Hospital",
        "AddressLine1": "West Entrance Car Park",
        "AddressLine2": "Glen Road",
        "Town": "Newham",
        "StateOrProvince": "London",
        "Postcode": "E13 8SL",
        "CountryID": 1,
        "Latitude": 51.5223208,
        "Longitude": 0.0353747999999996,
        "ContactTelephone1": "0845 850 0653",
        "DistanceUnit": 0
    },
    "Connections": [
        {
            "ID": 19273,
            "ConnectionTypeID": 25,
            "StatusTypeID": 50,
            "LevelID": 2,
            "Amps": 32,
            "Voltage": 230,
            "PowerKW": 7,
            "CurrentTypeID": 10,
            "Quantity": 6
        }
    ],
    "NumberOfPoints": 6,
    "GeneralComments": "Chargemaster posts.",
    "StatusTypeID": 50,
    "DateLastStatusUpdate": "2019-05-01T08:25:00Z",
    "DataQualityLevel": 1,
    "DateCreated": "2013-09-09T16:50:00Z",
    "SubmissionStatusTypeID": 200
}