{
    "IsRecentlyVerified": false,
    "ID": 68059,
    "UUID": "0FEA891B-4006-436A-BE7C-4FFDFA553133",
    "DataProviderID": 26,
    "DataProvidersReference": "90811",
    "OperatorID": 177,
    "OperatorsReference": "Nuon EVB-P1531131",
    "UsageCost": "0.00 jaarabonnement",
    "AddressInfo": {
        "ID": 68405,
        "Title": "Zonnedauw 2",
        "AddressLine1": "Zonnedauw 2",
        "Town": "Utrecht",
        "Postcode": "3453 VX",
        "CountryID": 159,
        "Latitude": 52.078603,
        "Longitude": 5.018398,
        "RelatedURL": "http://www.nuon.nl/ev",
        "DistanceUnit": 0
    },
    "Connections": [
        {
            "ID": 94772,
            "ConnectionTypeID": 25,
            "LevelID": 2,
            "PowerKW": 11,
            "CurrentTypeID": 10
        },
        {
            "ID": 94773,
            "ConnectionTypeID": 25,
            "LevelID": 2,
            "PowerKW": 11,
            "CurrentTypeID": 10
        }
    ],
    "NumberOfPoints": 1,
    "StatusTypeID": 50,
    "DateLastStatusUpdate": "2016-06-04T02:37:00Z",
    "DataQualityLevel": 3,
    "DateCreated": "2016-06-04T02:37:00Z",
    "SubmissionStatusTypeID": 100
}