{
    "IsRecentlyVerified": false,
    "ID": 125157,
    "UUID": "58E9D753-8AD6-4A3B-AF4E-4272924FAA8E",
    "DataProviderID": 1,
    "OperatorID": 23,
    "OperatorsReference": "49711",
    "UsageTypeID": 4,
    "AddressInfo": {
        "ID": 125503,
        "Title": "Dock Square Parking Garage",
        "AddressLine1": "20 Clinton St",
        "Town": "Boston",
        "StateOrProvince": "Massachusetts",
        "Postcode": "02109",
        "CountryID": 2,
        "Latitude": 42.3610186,
        "Longitude": -71.0549916,
        "ContactTelephone1": "(857) 317-4293",
        "DistanceUnit": 0
    },
    "Connections": [
        {
            "ID": 175413,
            "ConnectionTypeID": 30,
            "StatusTypeID": 50,
            "LevelID": 2,
            "PowerKW": 16,
            "CurrentTypeID": 20,
            "Quantity": 8
        }
    ],
    "NumberOfPoints": 8,
    "GeneralComments": "8 Tesla Connectors, up to 16kW.Parking fees will apply. Self park.",
    "StatusTypeID": 50,
    "DateLastStatusUpdate": "2019-04-11T06:01:00Z",
    "DataQualityLevel": 1,
    "DateCreated": "2019-04-11T06:01:00Z",
    "SubmissionStatusTypeID": 200
}