{
    "IsRecentlyVerified": false,
    "ID": 146303,
    "UUID": "750FAD82-323B-4FEA-9C31-1C65F3D2C1D4",
    "DataProviderID": 1,
    "OperatorID": 213,
    "OperatorsReference": "5a5d6dd5e4b00c0be8671de8",
    "UsageTypeID": 1,
    "UsageCost": "0.00€",
    "AddressInfo": {
        "ID": 146655,
        "Title": "Rue de la Roche Blanche",
        "AddressLine1": "Rue de la Roche Blanche",
        "Town": "Saint-Molf",
        "StateOrProvince": "Loire-Atlantique",
        "Postcode": "44350",
        "CountryID": 80,
        "Latitude": 47.394709,
        "Longitude": -2.425414,
        "DistanceUnit": 0
    },
    "Connections": [
        {
            "ID": 203345,
            "ConnectionTypeID": 1036,
            "StatusTypeID": 50,
            "LevelID": 2,
            "PowerKW": 18,
            "CurrentTypeID": 20,
            "Quantity": 1
        },
        {
            "ID": 203346,
            "ConnectionTypeID": 23,
            "StatusTypeID": 50,
            "LevelID": 2,
            "PowerKW": 6,
            "CurrentTypeID": 20,
            "Quantity": 1
        }
    ],
    "NumberOfPoints": 1,
    "StatusTypeID": 50,
    "DateLastStatusUpdate": "2020-01-05T20:24:00Z",
    "DataQualityLevel": 1,
    "DateCreated": "2020-01-05T20:24:00Z",
    "SubmissionStatusTypeID": 200
}