{
    "IsRecentlyVerified": false,
    "ID": 142541,
    "UUID": "2020E0E2-F051-4D6F-B997-6F3E395209DD",
    "DataProviderID": 2,
    "DataProvidersReference": "115239",
    "OperatorID": 23,
    "UsageTypeID": 1,
    "AddressInfo": {
        "ID": 142893,
        "Title": "Sebonack Golf Club - Tesla Destination",
        "AddressLine1": "405 Sebonac Rd",
        "Town": "Southampton",
        "StateOrProvince": "NY",
        "Postcode": "11968",
        "CountryID": 2,
        "Latitude": 40.902715,
        "Longitude": -72.450378,
        "ContactTelephone1": "631-287-4444  877-798-3752",
        "AccessComments": "24 hours daily; for member use only; see front desk for access",
        "RelatedURL": "https://www.tesla.com/destination-charging",
        "DistanceUnit": 0
    },
    "Connections": [
        {
            "ID": 198695,
            "ConnectionTypeID": 30,
            "LevelID": 2,
            "Amps": 16,
            "Voltage": 230,
            "PowerKW": 3.7,
            "CurrentTypeID": 10,
            "Quantity": 1
        }
    ],
    "StatusTypeID": 50,
    "DateLastStatusUpdate": "2020-06-26T03:03:00Z",
    "DataQualityLevel": 3,
    "DateCreated": "2019-12-24T09:18:00Z",
    "SubmissionStatusTypeID": 100
}