{
    "IsRecentlyVerified": false,
    "ID": 102687,
    "UUID": "E80B81D7-4792-409E-8800-35FA1E63BCE4",
    "DataProviderID": 2,
    "DataProvidersReference": "94786",
    "OperatorID": 3372,
    "UsageTypeID": 1,
    "AddressInfo": {
        "ID": 103033,
        "Title": "Grant Union High School",
        "AddressLine1": "1400 B Grand Ave",
        "Town": "Sacramento",
        "StateOrProvince": "CA",
        "Postcode": "95838",
        "CountryID": 2,
        "Latitude": 38.634754,
        "Longitude": -121.434747,
        "ContactTelephone1": "866-816-7584",
        "AccessComments": "School business hours",
        "RelatedURL": "http://evconnect.com/",
        "DistanceUnit": 0
    },
    "Connections": [
        {
            "ID": 144800,
            "ConnectionTypeID": 1,
            "LevelID": 2,
            "Amps": 16,
            "Voltage": 230,
            "PowerKW": 3.7,
            "CurrentTypeID": 10,
            "Quantity": 8
        },
        {
            "ID": 144801,
            "ConnectionTypeID": 2,
            "LevelID": 2,
            "Amps": 100,
            "Voltage": 400,
            "PowerKW": 40,
            "CurrentTypeID": 10,
            "Quantity": 1
        },
        {
            "ID": 144802,
            "ConnectionTypeID": 32,
            "LevelID": 2,
            "Amps": 100,
            "Voltage": 400,
            "PowerKW": 40,
            "CurrentTypeID": 10,
            "Quantity": 1
        }
    ],
    "DateLastStatusUpdate": "2020-06-26T03:00:00Z",
    "DataQualityLevel": 3,
    "DateCreated": "2018-04-21T04:13:00Z",
    "SubmissionStatusTypeID": 100
}