{
    "IsRecentlyVerified": false,
    "ID": 30963,
    "UUID": "46927AE4-73B8-448B-9EEB-C2402DEB4F57",
    "DataProviderID": 1,
    "DataProvidersReference": "1806",
    "AddressInfo": {
        "ID": 31309,
        "Title": "Fjellstova Ørskogfjellet",
        "AddressLine1": "Ørskogfjellet ",
        "Town": "ØRSKOG",
        "StateOrProvince": "Møre og Romsdal",
        "Postcode": "6249",
        "CountryID": 168,
        "Latitude": 62.52064,
        "Longitude": 6.91602,
        "AccessComments": "Ladekontaktene er på trestolpene til venstre for inngangen.",
        "DistanceUnit": 0
    },
    "Connections": [
        {
            "ID": 34192,
            "ConnectionTypeID": 0,
            "Reference": "1",
            "LevelID": 2,
            "Amps": 16,
            "Voltage": 230,
            "PowerKW": 3.7,
            "Comments": "Mode 1"
        },
        {
            "ID": 87289,
            "ConnectionTypeID": 0,
            "Reference": "2",
            "LevelID": 2,
            "Amps": 16,
            "Voltage": 230,
            "PowerKW": 3.7,
            "Comments": "Mode 1"
        },
        {
            "ID": 89303,
            "ConnectionTypeID": 0,
            "Reference": "3",
            "LevelID": 2,
            "Amps": 16,
            "Voltage": 230,
            "PowerKW": 3.7,
            "Comments": "Mode 1"
        }
    ],
    "NumberOfPoints": 3,
    "DateLastStatusUpdate": "2020-05-26T08:25:00Z",
    "DataQualityLevel": 2,
    "DateCreated": "2014-12-09T09:01:00Z",
    "SubmissionStatusTypeID": 100
}