{
    "IsRecentlyVerified": false,
    "ID": 116555,
    "UUID": "01724DD4-BD26-4B26-9124-A467CDE14305",
    "DataProviderID": 1,
    "DataProvidersReference": "5038",
    "AddressInfo": {
        "ID": 116901,
        "Title": "Laddstation Råneå Kängsövägen",
        "AddressLine1": "Kängsövägen 2",
        "Town": "RÅNEÅ",
        "StateOrProvince": "NORRBOTTEN",
        "Postcode": "95531",
        "CountryID": 216,
        "Latitude": 65.85623,
        "Longitude": 22.28996,
        "AccessComments": "Laddstationen finns på parkeringsplatserna angränsande till Råneå Busstation.",
        "DistanceUnit": 0
    },
    "Connections": [
        {
            "ID": 164948,
            "ConnectionTypeID": 0,
            "Reference": "1",
            "LevelID": 2,
            "Amps": 32,
            "Voltage": 400,
            "PowerKW": 22,
            "Comments": "Mode 3"
        },
        {
            "ID": 164949,
            "ConnectionTypeID": 0,
            "Reference": "2",
            "LevelID": 2,
            "Amps": 32,
            "Voltage": 400,
            "PowerKW": 22,
            "Comments": "Mode 3"
        }
    ],
    "NumberOfPoints": 2,
    "DateLastStatusUpdate": "2020-05-26T08:25:00Z",
    "DataQualityLevel": 2,
    "DateCreated": "2019-02-11T09:16:00Z",
    "SubmissionStatusTypeID": 100
}