{
    "IsRecentlyVerified": false,
    "ID": 99942,
    "UUID": "EAC3B9F1-0ECF-4BFA-AFCC-7D71FC7DFBAB",
    "DataProviderID": 1,
    "OperatorID": 150,
    "OperatorsReference": "Halfords Autocentre High Wycombe",
    "UsageTypeID": 4,
    "UsageCost": "Â£1.00 + Â£0.30/kWh; Â£10.00 overstay after 65 mins",
    "AddressInfo": {
        "ID": 100288,
        "Title": "Halfords Autocentre High Wycombe",
        "AddressLine1": "82 Desborough Road",
        "AddressLine2": "Castlefield",
        "Town": "High Wycombe",
        "StateOrProvince": "Buckinghamshire",
        "Postcode": "HP11 2SF",
        "CountryID": 1,
        "Latitude": 51.631105,
        "Longitude": -0.76295226,
        "RelatedURL": "https://www.geniepoint.co.uk/ds",
        "DistanceUnit": 0
    },
    "Connections": [
        {
            "ID": 141192,
            "ConnectionTypeID": 1036,
            "StatusTypeID": 50,
            "LevelID": 3,
            "PowerKW": 43,
            "CurrentTypeID": 20,
            "Quantity": 1
        },
        {
            "ID": 141193,
            "ConnectionTypeID": 2,
            "StatusTypeID": 50,
            "LevelID": 3,
            "PowerKW": 50,
            "CurrentTypeID": 30,
            "Quantity": 1
        },
        {
            "ID": 141194,
            "ConnectionTypeID": 33,
            "StatusTypeID": 50,
            "LevelID": 3,
            "PowerKW": 50,
            "CurrentTypeID": 30,
            "Quantity": 1
        }
    ],
    "NumberOfPoints": 1,
    "StatusTypeID": 50,
    "DateLastStatusUpdate": "2020-10-07T15:08:00Z",
    "DataQualityLevel": 1,
    "DateCreated": "2018-02-09T06:32:00Z",
    "SubmissionStatusTypeID": 200
}