{
    "IsRecentlyVerified": false,
    "ID": 180153,
    "UUID": "2CAA8288-1774-4B5B-AA70-08DCD4B2366B",
    "DataProviderID": 29,
    "DataProvidersReference": "5273",
    "OperatorID": 45,
    "AddressInfo": {
        "ID": 180512,
        "Title": "Heckenweg 5",
        "AddressLine1": "Heckenweg 5",
        "Town": "Schweinfurt",
        "Postcode": "97422",
        "CountryID": 87,
        "Latitude": 50.056245,
        "Longitude": 10.225941,
        "DistanceUnit": 0
    },
    "Connections": [
        {
            "ID": 282885,
            "ConnectionTypeID": 25,
            "StatusTypeID": 50,
            "LevelID": 2,
            "PowerKW": 22,
            "CurrentTypeID": 20
        },
        {
            "ID": 282886,
            "ConnectionTypeID": 25,
            "StatusTypeID": 50,
            "LevelID": 2,
            "PowerKW": 22,
            "CurrentTypeID": 20
        }
    ],
    "StatusTypeID": 50,
    "DateLastStatusUpdate": "2021-07-12T02:44:00Z",
    "MetadataValues": [
        {
            "ID": 12447,
            "MetadataFieldID": 4,
            "ItemValue": "Data from the German chargepoint registry provided by Bundesnetzagentur.de under the CC-BY 4.0 license"
        }
    ],
    "DataQualityLevel": 3,
    "DateCreated": "2021-07-08T10:00:00Z",
    "SubmissionStatusTypeID": 100
}