{
    "MediaItems": [
        {
            "ID": 18121,
            "ChargePointID": 125552,
            "ItemURL": "https://s3-ap-southeast-2.amazonaws.com/openchargemap/images/IT/OCM125552/OCM-125552.orig.2019042014565583.jpg",
            "ItemThumbnailURL": "https://s3-ap-southeast-2.amazonaws.com/openchargemap/images/IT/OCM125552/OCM-125552.thmb.2019042014565583.jpg",
            "Comment": "",
            "IsEnabled": true,
            "IsVideo": false,
            "IsFeaturedItem": false,
            "IsExternalResource": false,
            "User": {
                "ID": 20610,
                "Username": "B&B  Cjargnei"
            },
            "DateCreated": "2019-04-20T14:57:00Z"
        },
        {
            "ID": 18118,
            "ChargePointID": 125552,
            "ItemURL": "https://s3-ap-southeast-2.amazonaws.com/openchargemap/images/IT/OCM125552/OCM-125552.orig.2019042014552103.jpg",
            "ItemThumbnailURL": "https://s3-ap-southeast-2.amazonaws.com/openchargemap/images/IT/OCM125552/OCM-125552.thmb.2019042014552103.jpg",
            "Comment": "",
            "IsEnabled": true,
            "IsVideo": false,
            "IsFeaturedItem": false,
            "IsExternalResource": false,
            "User": {
                "ID": 20610,
                "Username": "B&B  Cjargnei"
            },
            "DateCreated": "2019-04-20T14:56:00Z"
        },
        {
            "ID": 18119,
            "ChargePointID": 125552,
            "ItemURL": "https://s3-ap-southeast-2.amazonaws.com/openchargemap/images/IT/OCM125552/OCM-125552.orig.2019042014555792.jpg",
            "ItemThumbnailURL": "https://s3-ap-southeast-2.amazonaws.com/openchargemap/images/IT/OCM125552/OCM-125552.thmb.2019042014555792.jpg",
            "Comment": "",
            "IsEnabled": true,
            "IsVideo": false,
            "IsFeaturedItem": false,
            "IsExternalResource": false,
            "User": {
                "ID": 20610,
                "Username": "B&B  Cjargnei"
            },
            "DateCreated": "2019-04-20T14:56:00Z"
        },
        {
            "ID": 18120,
            "ChargePointID": 125552,
            "ItemURL": "https://s3-ap-southeast-2.amazonaws.com/openchargemap/images/IT/OCM125552/OCM-125552.orig.2019042014561893.jpg",
            "ItemThumbnailURL": "https://s3-ap-southeast-2.amazonaws.com/openchargemap/images/IT/OCM125552/OCM-125552.thmb.2019042014561893.jpg",
            "Comment": "",
            "IsEnabled": true,
            "IsVideo": false,
            "IsFeaturedItem": false,
            "IsExternalResource": false,
            "User": {
                "ID": 20610,
                "Username": "B&B  Cjargnei"
            },
            "DateCreated": "2019-04-20T14:56:00Z"
        }
    ],
    "IsRecentlyVerified": false,
    "ID": 125552,
    "UUID": "A22AD609-327C-4AC3-A590-7CDC4EE802E8",
    "DataProviderID": 1,
    "OperatorID": 1,
    "UsageTypeID": 6,
    "AddressInfo": {
        "ID": 125898,
        "Title": "agriturismo Cjargnei bed and breakfast",
        "AddressLine1": "via mander 21",
        "Town": "Povoletto",
        "StateOrProvince": "udine",
        "Postcode": "33047",
        "CountryID": 112,
        "Latitude": 46.1168461060993,
        "Longitude": 13.302168187949064,
        "ContactTelephone1": "00393475236155",
        "ContactEmail": "info@cjargnei.it",
        "AccessComments": "A23 uscita Udine-Nord. ",
        "RelatedURL": "https://www.cjargnei.it/",
        "DistanceUnit": 0
    },
    "Connections": [
        {
            "ID": 175931,
            "ConnectionTypeID": 25,
            "StatusTypeID": 50,
            "LevelID": 2,
            "Amps": 32,
            "Voltage": 400,
            "PowerKW": 22,
            "CurrentTypeID": 20,
            "Quantity": 1
        },
        {
            "ID": 176054,
            "ConnectionTypeID": 13,
            "StatusTypeID": 50,
            "LevelID": 2,
            "Amps": 20,
            "Voltage": 240,
            "PowerKW": 3.7,
            "CurrentTypeID": 10,
            "Quantity": 1
        }
    ],
    "NumberOfPoints": 2,
    "GeneralComments": "gratis per ospiti bed and breakfast",
    "StatusTypeID": 50,
    "DateLastStatusUpdate": "2019-04-23T07:36:00Z",
    "DataQualityLevel": 1,
    "DateCreated": "2019-04-20T14:55:00Z",
    "SubmissionStatusTypeID": 200
}