{
    "IsRecentlyVerified": false,
    "ID": 170363,
    "UUID": "CEB84EB7-D149-4849-81A2-68AB21254AA7",
    "DataProviderID": 1,
    "OperatorID": 3327,
    "UsageTypeID": 4,
    "AddressInfo": {
        "ID": 170722,
        "Title": "BECHARGE Trattoria Nalin Campodarsego",
        "AddressLine1": "Via Bassa I, 119",
        "Town": "Campodarsego",
        "StateOrProvince": "PD",
        "Postcode": "35011",
        "CountryID": 112,
        "Latitude": 45.485245595468655,
        "Longitude": 11.933836444299459,
        "ContactTelephone1": "02-49527730",
        "ContactEmail": "emobility@buildingenergy.it",
        "RelatedURL": "https://www.bec.energy/",
        "DistanceUnit": 0
    },
    "Connections": [
        {
            "ID": 259863,
            "ConnectionTypeID": 25,
            "StatusTypeID": 50,
            "LevelID": 2,
            "Amps": 32,
            "Voltage": 400,
            "PowerKW": 22,
            "CurrentTypeID": 20,
            "Quantity": 4
        }
    ],
    "NumberOfPoints": 4,
    "StatusTypeID": 50,
    "DateLastStatusUpdate": "2020-11-24T17:06:00Z",
    "DataQualityLevel": 1,
    "DateCreated": "2020-11-24T17:06:00Z",
    "SubmissionStatusTypeID": 200
}