{
    "IsRecentlyVerified": false,
    "ID": 35313,
    "UUID": "7AF2B962-130A-4BD2-AFF1-5312FE2E9E9F",
    "DataProviderID": 26,
    "DataProvidersReference": "33826",
    "OperatorID": 73,
    "OperatorsReference": "EV-Box EVB-P1228142",
    "UsageCost": "0.00 jaarabonnement",
    "AddressInfo": {
        "ID": 35659,
        "Title": "Coenecoop 129C",
        "AddressLine1": "Coenecoop 129C",
        "Town": "Waddinxveen",
        "Postcode": "2741 PJ",
        "CountryID": 159,
        "Latitude": 52.02612,
        "Longitude": 4.65625,
        "RelatedURL": "http://www.ev-box.nl",
        "DistanceUnit": 0
    },
    "Connections": [
        {
            "ID": 38824,
            "ConnectionTypeID": 25,
            "LevelID": 2,
            "PowerKW": 5,
            "CurrentTypeID": 10
        }
    ],
    "NumberOfPoints": 1,
    "StatusTypeID": 50,
    "DateLastStatusUpdate": "2016-03-03T12:37:00Z",
    "DataQualityLevel": 3,
    "DateCreated": "2015-01-09T06:04:00Z",
    "SubmissionStatusTypeID": 100
}