{
    "IsRecentlyVerified": false,
    "ID": 124626,
    "UUID": "73C51385-5FA7-4EF6-BE84-542CCE21BBD1",
    "DataProviderID": 2,
    "DataProvidersReference": "50399",
    "UsageTypeID": 2,
    "AddressInfo": {
        "ID": 124972,
        "Title": "Melink",
        "AddressLine1": "5140 River Valley Rd",
        "Town": "Milford",
        "StateOrProvince": "OH",
        "Postcode": "45150",
        "CountryID": 2,
        "Latitude": 39.144528,
        "Longitude": -84.248677,
        "ContactTelephone1": "",
        "AccessComments": "Employee and visitor use only",
        "RelatedURL": "",
        "DistanceUnit": 0
    },
    "Connections": [
        {
            "ID": 174753,
            "ConnectionTypeID": 0,
            "LevelID": 1,
            "Amps": 16,
            "Voltage": 120,
            "PowerKW": 1.9,
            "CurrentTypeID": 10,
            "Quantity": 15
        },
        {
            "ID": 174754,
            "ConnectionTypeID": 1,
            "LevelID": 2,
            "Amps": 16,
            "Voltage": 230,
            "PowerKW": 3.7,
            "CurrentTypeID": 10,
            "Quantity": 9
        }
    ],
    "DateLastStatusUpdate": "2020-06-26T03:01:00Z",
    "DataQualityLevel": 3,
    "DateCreated": "2019-04-06T05:03:00Z",
    "SubmissionStatusTypeID": 100
}