{
    "IsRecentlyVerified": false,
    "ID": 41250,
    "UUID": "A2BF4C4D-72FC-4561-91F5-E69A0AD4F74C",
    "DataProviderID": 15,
    "DataProvidersReference": "29754",
    "OperatorID": 9,
    "AddressInfo": {
        "ID": 41596,
        "Title": "5600, rue Pierre-de-Coubertin",
        "AddressLine1": "5600, rue Pierre-de-Coubertin",
        "Town": "Montreal",
        "StateOrProvince": "CA-QC",
        "Postcode": "CA",
        "CountryID": 44,
        "Latitude": 45.568057,
        "Longitude": -73.542891,
        "ContactTelephone1": "",
        "RelatedURL": "http://carstations.com/29754",
        "DistanceUnit": 0
    },
    "Connections": [
        {
            "ID": 45038,
            "ConnectionTypeID": 1,
            "Reference": "J1772",
            "LevelID": 2
        }
    ],
    "StatusTypeID": 0,
    "DateLastStatusUpdate": "2017-11-04T14:05:00Z",
    "DataQualityLevel": 2,
    "DateCreated": "2015-01-28T11:44:00Z",
    "SubmissionStatusTypeID": 100
}