{
    "IsRecentlyVerified": false,
    "ID": 52991,
    "UUID": "5288DE75-C4BB-42EF-A526-9AA7837D1390",
    "DataProviderID": 1,
    "OperatorID": 1,
    "UsageTypeID": 1,
    "AddressInfo": {
        "ID": 53337,
        "Title": "Nissan Périgueux",
        "AddressLine1": "Voie des Stades",
        "Town": "Périgueux",
        "StateOrProvince": "Périgueux",
        "Postcode": "24000",
        "CountryID": 80,
        "Latitude": 45.19976862026,
        "Longitude": 0.69501430126341,
        "ContactTelephone1": "+33 5 53 53 54 55",
        "RelatedURL": "http://www.groupedupouy.fr/page-274/nissan-perigueux.html",
        "DistanceUnit": 0
    },
    "Connections": [],
    "NumberOfPoints": 1,
    "StatusTypeID": 50,
    "DateLastStatusUpdate": "2015-12-20T21:45:00Z",
    "DataQualityLevel": 1,
    "DateCreated": "2015-09-16T09:38:00Z",
    "SubmissionStatusTypeID": 200
}