{
    "IsRecentlyVerified": false,
    "ID": 116334,
    "UUID": "CF58B1CC-B161-4C47-8FCB-F40E6D867B7E",
    "DataProviderID": 1,
    "DataProvidersReference": "5127",
    "AddressInfo": {
        "ID": 116680,
        "Title": "Jörlanda pendelparkering",
        "AddressLine1": "Jörlandavägen ",
        "Town": "JÖRLANDA",
        "StateOrProvince": "VÄSTRA GÖTALAND",
        "Postcode": "44465",
        "CountryID": 216,
        "Latitude": 57.98624,
        "Longitude": 11.82976,
        "AccessComments": "Jörlanda pendelparkering",
        "DistanceUnit": 0
    },
    "Connections": [
        {
            "ID": 163830,
            "ConnectionTypeID": 0,
            "Reference": "1",
            "LevelID": 2,
            "Amps": 16,
            "Voltage": 230,
            "PowerKW": 3.7,
            "Comments": "Mode 1"
        },
        {
            "ID": 163831,
            "ConnectionTypeID": 0,
            "Reference": "2",
            "LevelID": 2,
            "Amps": 16,
            "Voltage": 230,
            "PowerKW": 3.7,
            "Comments": "Mode 1"
        }
    ],
    "NumberOfPoints": 2,
    "DateLastStatusUpdate": "2020-05-26T08:21:00Z",
    "DataQualityLevel": 2,
    "DateCreated": "2019-02-11T09:16:00Z",
    "SubmissionStatusTypeID": 100
}