{
    "IsRecentlyVerified": false,
    "ID": 129870,
    "UUID": "2C64FF7C-BB5F-4CE6-AC7C-DAB626A11CBD",
    "DataProviderID": 1,
    "OperatorID": 45,
    "UsageTypeID": 1,
    "AddressInfo": {
        "ID": 130216,
        "Title": "Stoppustuð - Lýsuhólslaug",
        "AddressLine1": "Lýsuhóli",
        "Town": "Snæfellsbæ",
        "CountryID": 105,
        "Latitude": 64.8414018150136,
        "Longitude": -23.2141329212874,
        "DistanceUnit": 0
    },
    "Connections": [
        {
            "ID": 181844,
            "ConnectionTypeID": 25,
            "StatusTypeID": 50,
            "LevelID": 2,
            "Amps": 32,
            "Voltage": 400,
            "PowerKW": 22,
            "Quantity": 1
        }
    ],
    "NumberOfPoints": 1,
    "StatusTypeID": 50,
    "DateLastStatusUpdate": "2019-07-30T09:12:00Z",
    "DataQualityLevel": 1,
    "DateCreated": "2019-07-29T15:52:00Z",
    "SubmissionStatusTypeID": 200
}