{
    "IsRecentlyVerified": false,
    "ID": 172598,
    "UUID": "3058E92D-5771-4D39-8894-7988A0066F6E",
    "DataProviderID": 1,
    "OperatorID": 3296,
    "UsageTypeID": 5,
    "UsageCost": "£0.40/kWh",
    "AddressInfo": {
        "ID": 172957,
        "Title": "McDonald’s Loughborough",
        "AddressLine1": "Epinal Way",
        "AddressLine2": "Park Road Roundabout",
        "Town": "Loughborough",
        "StateOrProvince": "England",
        "Postcode": "LE11 2HJ",
        "CountryID": 1,
        "Latitude": 52.75922871882287,
        "Longitude": -1.2058004188834275,
        "RelatedURL": "https://instavolt.co.uk/",
        "DistanceUnit": 0
    },
    "Connections": [
        {
            "ID": 263913,
            "ConnectionTypeID": 33,
            "StatusTypeID": 50,
            "LevelID": 3,
            "PowerKW": 50,
            "CurrentTypeID": 30,
            "Quantity": 1
        },
        {
            "ID": 263914,
            "ConnectionTypeID": 2,
            "StatusTypeID": 50,
            "LevelID": 3,
            "PowerKW": 50,
            "CurrentTypeID": 30,
            "Quantity": 1
        }
    ],
    "NumberOfPoints": 1,
    "StatusTypeID": 50,
    "DateLastStatusUpdate": "2021-05-26T09:27:00Z",
    "DataQualityLevel": 1,
    "DateCreated": "2021-02-09T19:11:00Z",
    "SubmissionStatusTypeID": 200
}