{
    "IsRecentlyVerified": false,
    "ID": 173749,
    "UUID": "DE1D64FB-F229-4D58-9BE7-1707A53BD05A",
    "DataProviderID": 19,
    "DataProvidersReference": "6968",
    "AddressInfo": {
        "ID": 174108,
        "Title": "Hellisheiði (ON)",
        "AddressLine1": "Hellisheiðavirkjun ",
        "Town": "Selfossi",
        "StateOrProvince": "Suðurland",
        "Postcode": "801",
        "CountryID": 105,
        "Latitude": 64.03756,
        "Longitude": -21.401909,
        "AccessComments": "",
        "DistanceUnit": 0
    },
    "Connections": [
        {
            "ID": 267013,
            "ConnectionTypeID": 2,
            "Reference": "1",
            "LevelID": 3,
            "Amps": 100,
            "Voltage": 500,
            "PowerKW": 50,
            "CurrentTypeID": 30,
            "Comments": "Mode 4"
        },
        {
            "ID": 267014,
            "ConnectionTypeID": 33,
            "Reference": "2",
            "LevelID": 3,
            "Amps": 100,
            "Voltage": 500,
            "PowerKW": 50,
            "CurrentTypeID": 30,
            "Comments": "Mode 4"
        }
    ],
    "NumberOfPoints": 2,
    "StatusTypeID": 0,
    "DateLastStatusUpdate": "2021-03-03T11:38:00Z",
    "DataQualityLevel": 2,
    "DateCreated": "2021-03-03T11:38:00Z",
    "SubmissionStatusTypeID": 100
}