{
    "IsRecentlyVerified": false,
    "ID": 96314,
    "UUID": "5D1B9989-9A42-4366-B468-7365ED75B5C7",
    "DataProviderID": 1,
    "OperatorID": 69,
    "UsageTypeID": 4,
    "AddressInfo": {
        "ID": 96660,
        "Title": "Maximiliansplatz",
        "AddressLine1": "Maximiliansplatz 13",
        "Town": "München",
        "StateOrProvince": "Bayern",
        "Postcode": "80333",
        "CountryID": 87,
        "Latitude": 48.1421039,
        "Longitude": 11.573252300000036,
        "RelatedURL": "https://www.swm.de/privatkunden/unternehmen/innovation/elektromobilitaet.html",
        "DistanceUnit": 0
    },
    "Connections": [
        {
            "ID": 136465,
            "ConnectionTypeID": 25,
            "StatusTypeID": 50,
            "LevelID": 2,
            "Amps": 32,
            "Voltage": 400,
            "PowerKW": 22,
            "CurrentTypeID": 20,
            "Quantity": 4
        }
    ],
    "NumberOfPoints": 4,
    "GeneralComments": "24/7 nutzbar. Betreiber sind die Stadtwerke München SWM im Verbund Ladenetz. Freischaltung der Säulen mit SWM Ladekarte, Karten der Roaming Partner oder mit der \"MVG more\" App.",
    "StatusTypeID": 50,
    "DateLastStatusUpdate": "2017-12-21T07:00:00Z",
    "DataQualityLevel": 1,
    "DateCreated": "2017-12-21T07:00:00Z",
    "SubmissionStatusTypeID": 200
}