{
    "IsRecentlyVerified": false,
    "ID": 145596,
    "UUID": "48328DFA-BF3E-498A-9D86-08B7EA9B540B",
    "DataProviderID": 2,
    "DataProvidersReference": "122217",
    "OperatorID": 5,
    "UsageTypeID": 1,
    "AddressInfo": {
        "ID": 145948,
        "Title": "SKAGITYMCA",
        "AddressLine1": "1901 Hoag Rd",
        "Town": "Mount Vernon",
        "StateOrProvince": "WA",
        "Postcode": "98273",
        "CountryID": 2,
        "Latitude": 48.443101,
        "Longitude": -122.316545,
        "ContactTelephone1": "888-758-4389",
        "AccessComments": "24 hours daily",
        "RelatedURL": "http://www.chargepoint.com/",
        "DistanceUnit": 0
    },
    "Connections": [
        {
            "ID": 202308,
            "ConnectionTypeID": 1,
            "LevelID": 2,
            "Amps": 16,
            "Voltage": 230,
            "PowerKW": 3.7,
            "CurrentTypeID": 10,
            "Quantity": 6
        }
    ],
    "StatusTypeID": 50,
    "DateLastStatusUpdate": "2020-06-26T03:11:00Z",
    "DataQualityLevel": 3,
    "DateCreated": "2019-12-24T09:25:00Z",
    "SubmissionStatusTypeID": 100
}