{
    "IsRecentlyVerified": false,
    "ID": 88715,
    "UUID": "C3C9324E-D60F-42C8-B1EA-6760323BACFE",
    "DataProviderID": 1,
    "DataProvidersReference": "4113",
    "AddressInfo": {
        "ID": 89061,
        "Title": "Odengatan 35, Eskilstuna",
        "AddressLine1": "Odengatan 35",
        "Town": "ESKILSTUNA",
        "StateOrProvince": "SÖDERMANLAND",
        "Postcode": "63352",
        "CountryID": 216,
        "Latitude": 59.37317,
        "Longitude": 16.533961,
        "AccessComments": "På baksidan av huset.",
        "DistanceUnit": 0
    },
    "Connections": [
        {
            "ID": 125921,
            "ConnectionTypeID": 0,
            "Reference": "1",
            "LevelID": 2,
            "Amps": 16,
            "Voltage": 400,
            "PowerKW": 11,
            "Comments": "Mode 3"
        },
        {
            "ID": 125922,
            "ConnectionTypeID": 0,
            "Reference": "2",
            "LevelID": 2,
            "Amps": 16,
            "Voltage": 400,
            "PowerKW": 11,
            "Comments": "Mode 3"
        }
    ],
    "NumberOfPoints": 2,
    "DateLastStatusUpdate": "2020-05-26T08:22:00Z",
    "DataQualityLevel": 2,
    "DateCreated": "2017-06-09T11:08:00Z",
    "SubmissionStatusTypeID": 100
}