{
    "IsRecentlyVerified": false,
    "ID": 124767,
    "UUID": "BCD68B5A-B63A-40C6-9E84-F24BAC8BE87E",
    "DataProviderID": 2,
    "DataProvidersReference": "47800",
    "UsageTypeID": 7,
    "AddressInfo": {
        "ID": 125113,
        "Title": "Apple Nissan",
        "AddressLine1": "1510 Whiteford Rd",
        "Town": "York",
        "StateOrProvince": "PA",
        "Postcode": "17402",
        "CountryID": 2,
        "Latitude": 39.981691,
        "Longitude": -76.699213,
        "ContactTelephone1": "717-755-9504",
        "AccessComments": "Dealership business hours\r\nPublic - Call ahead",
        "RelatedURL": "",
        "DistanceUnit": 0
    },
    "Connections": [
        {
            "ID": 174909,
            "ConnectionTypeID": 1,
            "LevelID": 2,
            "Amps": 16,
            "Voltage": 230,
            "PowerKW": 3.7,
            "CurrentTypeID": 10,
            "Quantity": 1
        }
    ],
    "DateLastStatusUpdate": "2020-06-26T03:02:00Z",
    "DataQualityLevel": 3,
    "DateCreated": "2019-04-06T05:04:00Z",
    "SubmissionStatusTypeID": 100
}