{
    "IsRecentlyVerified": false,
    "ID": 15398,
    "UUID": "DAF981BC-E77E-4D23-8317-19747F14BC16",
    "DataProviderID": 1,
    "OperatorID": 51,
    "UsageTypeID": 0,
    "UsageCost": "Free",
    "AddressInfo": {
        "ID": 15744,
        "Title": "Brant Renewable Energy",
        "AddressLine1": "65 Dundas St. E",
        "AddressLine2": "",
        "Town": "Paris",
        "StateOrProvince": "ON",
        "Postcode": "N3L 3H1",
        "CountryID": 44,
        "Latitude": 43.18813369999999,
        "Longitude": -80.38383010000001,
        "ContactTelephone1": "519-442-3077",
        "ContactTelephone2": "1-226-387-0508",
        "ContactEmail": "info@brantrenewable.ca",
        "AccessComments": "Monday to Friday 8:30AM - 4:30PM Public Holidays Excepted",
        "RelatedURL": "http://www.brantrenewable.ca/",
        "DistanceUnit": 0
    },
    "Connections": [
        {
            "ID": 13706,
            "ConnectionTypeID": 1,
            "StatusTypeID": 0,
            "LevelID": 2,
            "Amps": 72,
            "Voltage": 240,
            "PowerKW": 17.3,
            "Quantity": 1
        }
    ],
    "NumberOfPoints": 1,
    "GeneralComments": "",
    "StatusTypeID": 50,
    "DateLastStatusUpdate": "2013-01-09T14:02:00Z",
    "DataQualityLevel": 1,
    "DateCreated": "2013-01-09T14:02:00Z",
    "SubmissionStatusTypeID": 200
}