{
    "IsRecentlyVerified": false,
    "ID": 77291,
    "UUID": "4071A493-028F-49B7-BFB4-42B91ECD24D7",
    "DataProviderID": 1,
    "OperatorID": 3253,
    "OperatorsReference": "AT*SMA*EAT0100101*001AC,AT*SMA*EAT0100101*002AC",
    "UsageTypeID": 1,
    "UsageCost": "€0,15/min ; Andere Tarife möglich",
    "AddressInfo": {
        "ID": 77637,
        "Title": "Ladestation Outlet Center",
        "AddressLine1": "Designer Outlet Straße 1",
        "Town": "Parndorf ",
        "StateOrProvince": "Burgenland",
        "Postcode": "7111",
        "CountryID": 19,
        "Latitude": 47.980139,
        "Longitude": 16.848224,
        "DistanceUnit": 0
    },
    "Connections": [
        {
            "ID": 111361,
            "ConnectionTypeID": 25,
            "StatusTypeID": 50,
            "LevelID": 2,
            "Amps": 32,
            "Voltage": 400,
            "PowerKW": 22,
            "CurrentTypeID": 20,
            "Quantity": 2
        }
    ],
    "NumberOfPoints": 6,
    "StatusTypeID": 50,
    "DateLastStatusUpdate": "2017-01-23T16:41:00Z",
    "DataQualityLevel": 1,
    "DateCreated": "2017-01-08T23:47:00Z",
    "SubmissionStatusTypeID": 200
}