{
    "IsRecentlyVerified": false,
    "ID": 61490,
    "UUID": "C2E4C4E3-4ACA-4D1E-A988-391C3230F86F",
    "DataProviderID": 1,
    "OperatorID": 98,
    "UsageTypeID": 4,
    "AddressInfo": {
        "ID": 61836,
        "Title": "WES energy GmbH",
        "AddressLine1": "Österstraße 15 ",
        "Town": "Sankt Michaelisdonn",
        "StateOrProvince": "Kreis Dithmarschen",
        "Postcode": "25693",
        "CountryID": 87,
        "Latitude": 53.98627159999999,
        "Longitude": 9.116002900000012,
        "ContactTelephone1": "+49-4853-88198-0",
        "AccessComments": "Um die Ecke in die Poststraße einbiegen und vor dem Haus auf dem Grünstreifen parken. ",
        "RelatedURL": "http://www.wes-energy.de",
        "DistanceUnit": 0
    },
    "Connections": [
        {
            "ID": 78338,
            "ConnectionTypeID": 17,
            "StatusTypeID": 50,
            "LevelID": 2,
            "Amps": 16,
            "Voltage": 400,
            "PowerKW": 11,
            "CurrentTypeID": 20,
            "Quantity": 0
        },
        {
            "ID": 78339,
            "ConnectionTypeID": 16,
            "StatusTypeID": 50,
            "LevelID": 2,
            "Amps": 16,
            "Voltage": 230,
            "PowerKW": 3.7,
            "CurrentTypeID": 10,
            "Quantity": 2
        },
        {
            "ID": 78340,
            "ConnectionTypeID": 28,
            "StatusTypeID": 50,
            "LevelID": 2,
            "Amps": 16,
            "Voltage": 230,
            "PowerKW": 3.7,
            "CurrentTypeID": 10,
            "Quantity": 1
        }
    ],
    "NumberOfPoints": 1,
    "StatusTypeID": 50,
    "DateLastStatusUpdate": "2016-03-02T07:02:00Z",
    "DataQualityLevel": 1,
    "DateCreated": "2016-03-02T07:02:00Z",
    "SubmissionStatusTypeID": 200
}