{
    "IsRecentlyVerified": false,
    "ID": 89698,
    "UUID": "86C42224-BDDB-46A5-B81F-E68496FAD7A3",
    "DataProviderID": 2,
    "DataProvidersReference": "82681",
    "OperatorID": 5,
    "UsageTypeID": 1,
    "AddressInfo": {
        "ID": 90044,
        "Title": "OREGON1",
        "AddressLine1": "510 west Washington street",
        "Town": "Oregon",
        "StateOrProvince": "IL",
        "Postcode": "61061",
        "CountryID": 2,
        "Latitude": 42.0148059,
        "Longitude": -89.3348673,
        "ContactTelephone1": "888-758-4389",
        "AccessComments": "24 hours daily",
        "RelatedURL": "http://www.chargepoint.com/",
        "DistanceUnit": 0
    },
    "Connections": [
        {
            "ID": 127128,
            "ConnectionTypeID": 1,
            "LevelID": 2,
            "Amps": 16,
            "Voltage": 230,
            "PowerKW": 3.7,
            "CurrentTypeID": 10,
            "Quantity": 2
        }
    ],
    "DateLastStatusUpdate": "2020-06-26T03:05:00Z",
    "DataQualityLevel": 3,
    "DateCreated": "2017-06-22T08:16:00Z",
    "SubmissionStatusTypeID": 100
}