{
    "IsRecentlyVerified": false,
    "ID": 85601,
    "UUID": "AF770DD4-214F-4B6E-92AB-29DC01C4AD48",
    "DataProviderID": 1,
    "OperatorID": 23,
    "OperatorsReference": "26403",
    "UsageTypeID": 6,
    "AddressInfo": {
        "ID": 85947,
        "Title": "Schloss Hotel Wolfsbrunnen",
        "AddressLine1": "1 Am Berg",
        "Town": "Meinhard",
        "Postcode": "37276",
        "CountryID": 87,
        "Latitude": 51.20361,
        "Longitude": 10.106907,
        "ContactTelephone1": "+49 5651 335790",
        "DistanceUnit": 0
    },
    "Connections": [
        {
            "ID": 121706,
            "ConnectionTypeID": 30,
            "StatusTypeID": 50,
            "LevelID": 2,
            "Amps": 32,
            "Voltage": 400,
            "PowerKW": 22,
            "CurrentTypeID": 20,
            "Quantity": 2
        }
    ],
    "NumberOfPoints": 2,
    "GeneralComments": "2 Tesla Connectors, up to 22kW.Available for patrons only. Please see front desk.",
    "StatusTypeID": 50,
    "DateLastStatusUpdate": "2018-10-03T17:42:00Z",
    "DataQualityLevel": 1,
    "DateCreated": "2017-04-09T05:39:00Z",
    "SubmissionStatusTypeID": 200
}