{
    "IsRecentlyVerified": false,
    "ID": 11730,
    "UUID": "AB771CE6-56C0-4038-AEEA-7F554C430618",
    "DataProviderID": 1,
    "OperatorID": 1,
    "UsageTypeID": 6,
    "UsageCost": "Free",
    "AddressInfo": {
        "ID": 11627,
        "Title": "Nissan Fakto Auto",
        "AddressLine1": "Osmussaare tee 10",
        "AddressLine2": "",
        "Town": "Tallinn",
        "StateOrProvince": "",
        "Postcode": "13811",
        "CountryID": 74,
        "Latitude": 59.43835199999999,
        "Longitude": 24.873632199999975,
        "ContactTelephone1": "+372 6389200",
        "ContactTelephone2": "",
        "ContactEmail": "info@faktoauto.ee",
        "AccessComments": "",
        "RelatedURL": "http://www.faktoauto.ee",
        "DistanceUnit": 0
    },
    "Connections": [
        {
            "ID": 9084,
            "ConnectionTypeID": 1,
            "StatusTypeID": 50,
            "LevelID": 2,
            "Amps": 16,
            "Voltage": 240,
            "PowerKW": 3.8,
            "Quantity": 1
        }
    ],
    "NumberOfPoints": 1,
    "GeneralComments": "Circutor home charger installed at the Nissan dealership near the main entrance. Accessible 24/7 for customers and visitors.",
    "StatusTypeID": 50,
    "DateLastStatusUpdate": "2012-06-21T21:17:00Z",
    "DataQualityLevel": 1,
    "DateCreated": "2012-06-21T21:06:00Z",
    "SubmissionStatusTypeID": 200
}