{
    "IsRecentlyVerified": false,
    "ID": 173764,
    "UUID": "B275BF82-AFFF-4D6E-96EB-C87C457A2A08",
    "DataProviderID": 19,
    "DataProvidersReference": "6995",
    "AddressInfo": {
        "ID": 174123,
        "Title": "Hringbraut (Landspítali)",
        "AddressLine1": "Hringbraut - Landsspítali ",
        "Town": "Reykjavík",
        "StateOrProvince": "Höfuðborgarsvæði",
        "Postcode": "101",
        "CountryID": 105,
        "Latitude": 64.139028,
        "Longitude": -21.929568,
        "AccessComments": "",
        "DistanceUnit": 0
    },
    "Connections": [
        {
            "ID": 267066,
            "ConnectionTypeID": 25,
            "Reference": "1",
            "LevelID": 3,
            "Amps": 32,
            "Voltage": 400,
            "PowerKW": 22,
            "CurrentTypeID": 30,
            "Comments": "Mode 3"
        },
        {
            "ID": 267067,
            "ConnectionTypeID": 25,
            "Reference": "2",
            "LevelID": 3,
            "Amps": 32,
            "Voltage": 400,
            "PowerKW": 22,
            "CurrentTypeID": 30,
            "Comments": "Mode 3"
        },
        {
            "ID": 267068,
            "ConnectionTypeID": 25,
            "Reference": "3",
            "LevelID": 3,
            "Amps": 32,
            "Voltage": 400,
            "PowerKW": 22,
            "CurrentTypeID": 30,
            "Comments": "Mode 3"
        },
        {
            "ID": 267069,
            "ConnectionTypeID": 25,
            "Reference": "4",
            "LevelID": 3,
            "Amps": 32,
            "Voltage": 400,
            "PowerKW": 22,
            "CurrentTypeID": 30,
            "Comments": "Mode 3"
        }
    ],
    "NumberOfPoints": 4,
    "StatusTypeID": 0,
    "DateLastStatusUpdate": "2021-03-03T11:38:00Z",
    "DataQualityLevel": 2,
    "DateCreated": "2021-03-03T11:38:00Z",
    "SubmissionStatusTypeID": 100
}