{
    "IsRecentlyVerified": false,
    "ID": 51554,
    "UUID": "9AA1BF79-950A-4172-8FA6-A6AA5DC864F5",
    "DataProviderID": 1,
    "OperatorID": 201,
    "UsageTypeID": 4,
    "AddressInfo": {
        "ID": 51900,
        "Title": "OMV Tankstelle",
        "AddressLine1": "Wendling 14",
        "AddressLine2": "Salzhub",
        "Town": "Irschenberg",
        "StateOrProvince": "Landkreis Miesbach",
        "Postcode": "83737",
        "CountryID": 87,
        "Latitude": 47.82683,
        "Longitude": 11.89809,
        "ContactTelephone1": "08025-281103",
        "AccessComments": " \"München Umland\" oder \"KommEnergie\" Ladekarte erforderlich, sonst 5€ pauschal oder 0,50€/kWh bei CEE/Schuko Ladung, die an der Kasse aktiviert werden.",
        "DistanceUnit": 0
    },
    "Connections": [
        {
            "ID": 63904,
            "ConnectionTypeID": 17,
            "StatusTypeID": 50,
            "LevelID": 2,
            "Amps": 32,
            "Voltage": 400,
            "PowerKW": 22,
            "CurrentTypeID": 20,
            "Quantity": 2
        },
        {
            "ID": 63905,
            "ConnectionTypeID": 28,
            "StatusTypeID": 50,
            "LevelID": 2,
            "Amps": 16,
            "Voltage": 230,
            "PowerKW": 3.7,
            "CurrentTypeID": 10,
            "Quantity": 2
        },
        {
            "ID": 63906,
            "ConnectionTypeID": 2,
            "StatusTypeID": 50,
            "LevelID": 3,
            "PowerKW": 50,
            "CurrentTypeID": 30,
            "Quantity": 1
        }
    ],
    "NumberOfPoints": 5,
    "StatusTypeID": 50,
    "DateLastStatusUpdate": "2015-07-28T13:09:00Z",
    "DataQualityLevel": 1,
    "DateCreated": "2015-07-28T13:08:00Z",
    "SubmissionStatusTypeID": 200
}