{
    "IsRecentlyVerified": false,
    "ID": 15271,
    "UUID": "1A74A918-0B9C-403C-A50D-FDB4811CB6CD",
    "DataProviderID": 1,
    "OperatorID": 1,
    "UsageTypeID": 5,
    "UsageCost": "Free",
    "AddressInfo": {
        "ID": 15617,
        "Title": "Parking Annonciade",
        "AddressLine1": "",
        "AddressLine2": "",
        "Town": "La Rousse",
        "StateOrProvince": "",
        "Postcode": "",
        "CountryID": 149,
        "Latitude": 43.747343,
        "Longitude": 7.43051,
        "ContactTelephone1": "+377 98 98 80 33",
        "ContactTelephone2": "",
        "ContactEmail": "",
        "AccessComments": " emplacements sont signalés par un panneau vert apposé sur le mur du parking.",
        "RelatedURL": "https://www.monaco-parkings.mc/",
        "DistanceUnit": 0
    },
    "Connections": [
        {
            "ID": 13577,
            "ConnectionTypeID": 0,
            "StatusTypeID": 0,
            "Amps": 20,
            "Quantity": 1
        }
    ],
    "NumberOfPoints": 1,
    "GeneralComments": " PARKING CHARGES APPLY",
    "StatusTypeID": 50,
    "DateLastStatusUpdate": "2012-12-29T19:54:00Z",
    "DataQualityLevel": 1,
    "DateCreated": "2012-12-29T19:54:00Z",
    "SubmissionStatusTypeID": 200
}