{
    "IsRecentlyVerified": false,
    "ID": 121729,
    "UUID": "21ABEA09-F769-42B9-B325-9F7471787D69",
    "DataProviderID": 2,
    "DataProvidersReference": "96928",
    "UsageTypeID": 1,
    "AddressInfo": {
        "ID": 122075,
        "Title": "City of McKinney - Senior Recreation Center",
        "AddressLine1": "1400 S College St",
        "Town": "McKinney",
        "StateOrProvince": "TX",
        "Postcode": "75069",
        "CountryID": 2,
        "Latitude": 33.183097,
        "Longitude": -96.621074,
        "ContactTelephone1": "972-547-7491",
        "AccessComments": "8:30am-5:30pm daily",
        "RelatedURL": "",
        "DistanceUnit": 0
    },
    "Connections": [
        {
            "ID": 171544,
            "ConnectionTypeID": 1,
            "LevelID": 2,
            "Amps": 16,
            "Voltage": 230,
            "PowerKW": 3.7,
            "CurrentTypeID": 10,
            "Quantity": 1
        }
    ],
    "DateLastStatusUpdate": "2020-06-26T02:55:00Z",
    "DataQualityLevel": 3,
    "DateCreated": "2019-04-06T05:02:00Z",
    "SubmissionStatusTypeID": 100
}