{
    "IsRecentlyVerified": false,
    "ID": 178790,
    "UUID": "3E46823D-9B9E-427E-B7D8-2E9C2EF925D7",
    "DataProviderID": 29,
    "DataProvidersReference": "11720",
    "OperatorID": 69,
    "AddressInfo": {
        "ID": 179149,
        "Title": "Am Brunnen 11",
        "AddressLine1": "Am Brunnen 11",
        "Town": "Blaubeuren - Asch",
        "Postcode": "89143",
        "CountryID": 87,
        "Latitude": 48.437012,
        "Longitude": 9.820351,
        "DistanceUnit": 0
    },
    "Connections": [
        {
            "ID": 279702,
            "ConnectionTypeID": 25,
            "StatusTypeID": 50,
            "LevelID": 2,
            "PowerKW": 22,
            "CurrentTypeID": 20
        },
        {
            "ID": 279703,
            "ConnectionTypeID": 25,
            "StatusTypeID": 50,
            "LevelID": 2,
            "PowerKW": 22,
            "CurrentTypeID": 20
        }
    ],
    "StatusTypeID": 0,
    "DateLastStatusUpdate": "2021-07-12T02:41:00Z",
    "MetadataValues": [
        {
            "ID": 11084,
            "MetadataFieldID": 4,
            "ItemValue": "Data from the German chargepoint registry provided by Bundesnetzagentur.de under the CC-BY 4.0 license"
        }
    ],
    "DataQualityLevel": 3,
    "DateCreated": "2021-07-08T09:50:00Z",
    "SubmissionStatusTypeID": 100
}