{
    "IsRecentlyVerified": false,
    "ID": 158810,
    "UUID": "6F2533C3-F638-4A2A-BF5C-A2CEF431FCC6",
    "DataProviderID": 2,
    "DataProvidersReference": "153741",
    "OperatorID": 59,
    "UsageTypeID": 1,
    "AddressInfo": {
        "ID": 159167,
        "Title": "Greenlots - 12232A",
        "AddressLine1": "11644 VENTURA BLVD",
        "Town": "Studio City",
        "StateOrProvince": "CA",
        "Postcode": "91604",
        "CountryID": 2,
        "Latitude": 34.1409034729004,
        "Longitude": -118.386383056641,
        "ContactTelephone1": "855-900-7584",
        "AccessComments": "24 hours daily",
        "RelatedURL": "http://greenlots.com/",
        "DistanceUnit": 0
    },
    "Connections": [
        {
            "ID": 228844,
            "ConnectionTypeID": 1,
            "LevelID": 2,
            "Amps": 16,
            "Voltage": 230,
            "PowerKW": 3.7,
            "CurrentTypeID": 10,
            "Quantity": 1
        }
    ],
    "StatusTypeID": 50,
    "DateLastStatusUpdate": "2020-06-26T02:57:00Z",
    "DataQualityLevel": 3,
    "DateCreated": "2020-06-26T02:57:00Z",
    "SubmissionStatusTypeID": 100
}