{
    "IsRecentlyVerified": false,
    "ID": 31562,
    "UUID": "93C98C2A-83C6-44D1-945C-4BD39A0E8F5B",
    "DataProviderID": 26,
    "DataProvidersReference": "24164",
    "OperatorID": 78,
    "OperatorsReference": "Essent EM-CH-00002000-01-00002",
    "UsageCost": "0.00 jaarabonnement",
    "AddressInfo": {
        "ID": 31908,
        "Title": "Rue des Bercles",
        "AddressLine1": "Rue des Bercles",
        "Town": "Neuchâtel",
        "Postcode": "2000",
        "CountryID": 217,
        "Latitude": 46.993412,
        "Longitude": 6.927765,
        "RelatedURL": "http://www.essent.nl",
        "DistanceUnit": 0
    },
    "Connections": [
        {
            "ID": 35073,
            "ConnectionTypeID": 25,
            "LevelID": 2,
            "PowerKW": 11,
            "CurrentTypeID": 10
        }
    ],
    "NumberOfPoints": 1,
    "StatusTypeID": 50,
    "DateLastStatusUpdate": "2016-06-04T02:37:00Z",
    "DataQualityLevel": 3,
    "DateCreated": "2015-01-09T06:03:00Z",
    "SubmissionStatusTypeID": 100
}