{
    "IsRecentlyVerified": false,
    "ID": 64402,
    "UUID": "65F873BE-7629-4045-9D1C-05816B77F668",
    "DataProviderID": 1,
    "OperatorID": 45,
    "UsageTypeID": 5,
    "UsageCost": "0,25€/kWh",
    "AddressInfo": {
        "ID": 64748,
        "Title": "Autohof Thüringer Tor Süd",
        "AddressLine1": "An der B247",
        "AddressLine2": "Neue Mühle",
        "Town": "Schwabhausen",
        "StateOrProvince": "Günthersleben-Wechmar",
        "Postcode": "99869",
        "CountryID": 87,
        "Latitude": 50.8972993625504,
        "Longitude": 10.7254178774231,
        "ContactTelephone1": "+49 36256 32682",
        "AccessComments": "Neben der Tankstelle auf den Zwischenstreifen bei den LKW Parkplätzen sind halbhoch kleine Boxen mit roten 22kw Dosen\r\nmontiert. Nummer der Box in der Tankstelle nennen, die dann von dort freigeschaltet wird. 24/7 nutzbar.",
        "DistanceUnit": 0
    },
    "Connections": [
        {
            "ID": 82593,
            "ConnectionTypeID": 17,
            "StatusTypeID": 50,
            "LevelID": 2,
            "Amps": 32,
            "Voltage": 400,
            "PowerKW": 22,
            "CurrentTypeID": 20,
            "Quantity": 5
        }
    ],
    "NumberOfPoints": 5,
    "StatusTypeID": 50,
    "DateLastStatusUpdate": "2016-03-05T14:22:00Z",
    "DataQualityLevel": 1,
    "DateCreated": "2016-03-05T14:21:00Z",
    "SubmissionStatusTypeID": 200
}