{
    "IsRecentlyVerified": false,
    "ID": 48847,
    "UUID": "74183E6B-08BD-454A-B5C1-38CB988B7CAA",
    "DataProviderID": 1,
    "OperatorID": 3315,
    "OperatorsReference": "50397,50398",
    "UsageTypeID": 4,
    "UsageCost": "Free",
    "AddressInfo": {
        "ID": 49193,
        "Title": "Wishaw Park and Ride",
        "AddressLine1": "Wishaw",
        "Town": "Motherwell",
        "Postcode": "ML2 0HF",
        "CountryID": 1,
        "Latitude": 55.772479,
        "Longitude": -3.929385,
        "DistanceUnit": 0
    },
    "Connections": [
        {
            "ID": 60363,
            "ConnectionTypeID": 25,
            "StatusTypeID": 75,
            "LevelID": 2,
            "Amps": 32,
            "Voltage": 230,
            "PowerKW": 7,
            "CurrentTypeID": 10,
            "Quantity": 2
        }
    ],
    "NumberOfPoints": 2,
    "StatusTypeID": 50,
    "DateLastStatusUpdate": "2020-02-20T06:15:00Z",
    "DataQualityLevel": 1,
    "DateCreated": "2015-07-03T13:01:00Z",
    "SubmissionStatusTypeID": 200
}