{
    "IsRecentlyVerified": false,
    "ID": 72883,
    "UUID": "186BB617-87D8-422D-B15E-AF8C479F3A7E",
    "DataProviderID": 2,
    "DataProvidersReference": "78947",
    "OperatorID": 5,
    "UsageTypeID": 1,
    "AddressInfo": {
        "ID": 73229,
        "Title": "GUEST RANCH",
        "AddressLine1": "5501 N Hacienda Del Sol Rd",
        "Town": "Tucson",
        "StateOrProvince": "AZ",
        "Postcode": "85718",
        "CountryID": 2,
        "Latitude": 32.3071714,
        "Longitude": -110.915041,
        "ContactTelephone1": "888-758-4389",
        "AccessComments": "24 hours daily",
        "RelatedURL": "http://www.chargepoint.com/",
        "DistanceUnit": 0
    },
    "Connections": [
        {
            "ID": 104548,
            "ConnectionTypeID": 1,
            "LevelID": 2,
            "Amps": 16,
            "Voltage": 230,
            "PowerKW": 3.7,
            "CurrentTypeID": 10,
            "Quantity": 2
        }
    ],
    "DateLastStatusUpdate": "2020-06-26T02:54:00Z",
    "DataQualityLevel": 3,
    "DateCreated": "2016-11-01T13:06:00Z",
    "SubmissionStatusTypeID": 100
}