{
    "IsRecentlyVerified": false,
    "ID": 20393,
    "UUID": "B6AEB818-89CA-4C46-8408-9EC0F5943D70",
    "DataProviderID": 1,
    "OperatorID": 1,
    "UsageTypeID": 0,
    "UsageCost": "",
    "AddressInfo": {
        "ID": 20738,
        "Title": " Particulier - Digne les Bains",
        "AddressLine1": "14 Place de la République",
        "AddressLine2": "",
        "Town": "Digne-les-Bains",
        "StateOrProvince": "",
        "Postcode": "04000",
        "CountryID": 80,
        "Latitude": 44.09842,
        "Longitude": 6.23105,
        "ContactTelephone1": "",
        "ContactTelephone2": "",
        "ContactEmail": "",
        "AccessComments": "Réservé aux personnes identifiées",
        "RelatedURL": "",
        "DistanceUnit": 0
    },
    "Connections": [],
    "GeneralComments": "",
    "StatusTypeID": 50,
    "DateLastStatusUpdate": "2013-11-13T14:02:00Z",
    "DataQualityLevel": 1,
    "DateCreated": "2013-11-13T11:36:00Z",
    "SubmissionStatusTypeID": 200
}