{
    "IsRecentlyVerified": false,
    "ID": 39048,
    "UUID": "8CE8BC44-556F-485E-8597-DA28181304C2",
    "DataProviderID": 26,
    "DataProvidersReference": "40485",
    "OperatorID": 157,
    "OperatorsReference": "NewMotion ICUEVE001000",
    "UsageCost": "0.00 jaarabonnement",
    "AddressInfo": {
        "ID": 39394,
        "Title": "Rouaanstraat 33",
        "AddressLine1": "Rouaanstraat 33",
        "Town": "Groningen",
        "Postcode": "9723 CC",
        "CountryID": 159,
        "Latitude": 53.1972732543945,
        "Longitude": 6.60784721374512,
        "ContactTelephone1": "088 0109500",
        "RelatedURL": "http://thenewmotion.nl/",
        "DistanceUnit": 0
    },
    "Connections": [
        {
            "ID": 42559,
            "ConnectionTypeID": 25,
            "LevelID": 2,
            "PowerKW": 22,
            "CurrentTypeID": 10
        }
    ],
    "NumberOfPoints": 2,
    "StatusTypeID": 50,
    "DateLastStatusUpdate": "2016-06-04T02:56:00Z",
    "DataQualityLevel": 3,
    "DateCreated": "2015-01-09T06:08:00Z",
    "SubmissionStatusTypeID": 100
}