{
    "IsRecentlyVerified": false,
    "ID": 32802,
    "UUID": "957DB65A-B619-4E61-B19B-546F59A46F2F",
    "DataProviderID": 26,
    "DataProvidersReference": "47164",
    "OperatorID": 178,
    "OperatorsReference": "EVnetNL AL313",
    "UsageCost": "0.00 jaarabonnement",
    "AddressInfo": {
        "ID": 33148,
        "Title": "Deken van Somerenstraat 2",
        "AddressLine1": "Deken van Somerenstraat 2",
        "Town": "Eindhoven",
        "Postcode": "5611 KX",
        "CountryID": 159,
        "Latitude": 51.434102,
        "Longitude": 5.475069,
        "ContactTelephone1": "0800-3522365",
        "RelatedURL": "http://www.evnet.nl",
        "DistanceUnit": 0
    },
    "Connections": [
        {
            "ID": 36313,
            "ConnectionTypeID": 25,
            "LevelID": 2,
            "PowerKW": 11,
            "CurrentTypeID": 10
        }
    ],
    "NumberOfPoints": 2,
    "StatusTypeID": 50,
    "DateLastStatusUpdate": "2016-06-04T02:39:00Z",
    "DataQualityLevel": 3,
    "DateCreated": "2015-01-09T06:03:00Z",
    "SubmissionStatusTypeID": 100
}