{
    "IsRecentlyVerified": false,
    "ID": 157052,
    "UUID": "FE7B0818-7C85-4A9B-9A43-6B1AFAC10438",
    "DataProviderID": 19,
    "DataProvidersReference": "6347",
    "AddressInfo": {
        "ID": 157406,
        "Title": "Vårdcentralen Smedjebacken",
        "AddressLine1": "Bergslagsvägen 21",
        "Town": "SMEDJEBACKEN",
        "StateOrProvince": "DALARNA",
        "Postcode": "77732",
        "CountryID": 216,
        "Latitude": 60.14612,
        "Longitude": 15.41159,
        "AccessComments": "Nedre parkeringen vid huvudentrén Vårdcentralen, infart från Bergslagsvägen.",
        "DistanceUnit": 0
    },
    "Connections": [
        {
            "ID": 224380,
            "ConnectionTypeID": 25,
            "Reference": "1",
            "LevelID": 2,
            "Amps": 16,
            "Voltage": 230,
            "PowerKW": 3.7,
            "CurrentTypeID": 10,
            "Comments": "Mode 3"
        },
        {
            "ID": 224381,
            "ConnectionTypeID": 25,
            "Reference": "2",
            "LevelID": 2,
            "Amps": 16,
            "Voltage": 230,
            "PowerKW": 3.7,
            "CurrentTypeID": 10,
            "Comments": "Mode 3"
        }
    ],
    "NumberOfPoints": 2,
    "StatusTypeID": 0,
    "DateLastStatusUpdate": "2021-03-24T05:12:00Z",
    "DataQualityLevel": 2,
    "DateCreated": "2020-05-26T08:23:00Z",
    "SubmissionStatusTypeID": 100
}