{
    "IsRecentlyVerified": false,
    "ID": 144601,
    "UUID": "2F3F2EFE-9B5C-4EF0-A33E-6AE0CFD96719",
    "DataProviderID": 2,
    "DataProvidersReference": "130674",
    "OperatorID": 90,
    "UsageTypeID": 1,
    "AddressInfo": {
        "ID": 144953,
        "Title": "7187 St-Hubert",
        "AddressLine1": "7187 St-Hubert",
        "Town": "Montréal",
        "StateOrProvince": "QC",
        "Postcode": "H2R 2N2",
        "CountryID": 44,
        "Latitude": 45.54103,
        "Longitude": -73.61374,
        "ContactTelephone1": "877-505-2674",
        "AccessComments": "24 hours daily",
        "RelatedURL": "https://lecircuitelectrique.com/",
        "DistanceUnit": 0
    },
    "Connections": [
        {
            "ID": 201113,
            "ConnectionTypeID": 1,
            "LevelID": 2,
            "Amps": 16,
            "Voltage": 230,
            "PowerKW": 3.7,
            "CurrentTypeID": 10,
            "Quantity": 2
        }
    ],
    "StatusTypeID": 50,
    "DateLastStatusUpdate": "2020-06-26T03:09:00Z",
    "DataQualityLevel": 3,
    "DateCreated": "2019-12-24T09:23:00Z",
    "SubmissionStatusTypeID": 100
}