{
    "IsRecentlyVerified": false,
    "ID": 61489,
    "UUID": "1B8B9318-ED73-4521-B7D9-41B7606C7F0E",
    "DataProviderID": 1,
    "OperatorID": 98,
    "UsageTypeID": 4,
    "AddressInfo": {
        "ID": 61835,
        "Title": "ZTS GmbH",
        "AddressLine1": "Wischhofstraße 1-3",
        "AddressLine2": "Gaarden-Ost",
        "Town": "Kiel",
        "StateOrProvince": "Kiel",
        "Postcode": "24148",
        "CountryID": 87,
        "Latitude": 54.32859999999999,
        "Longitude": 10.177500000000009,
        "ContactTelephone1": "+49-431-720690-0",
        "AccessComments": "Grüne Ladesäule bei den Parkplätzen. Geöffnet täglich von 6-20Uhr.",
        "RelatedURL": "http://www.seefischmarkt-kiel.de",
        "DistanceUnit": 0
    },
    "Connections": [
        {
            "ID": 78335,
            "ConnectionTypeID": 17,
            "StatusTypeID": 50,
            "LevelID": 2,
            "Amps": 16,
            "Voltage": 400,
            "PowerKW": 11,
            "CurrentTypeID": 20,
            "Quantity": 0
        },
        {
            "ID": 78336,
            "ConnectionTypeID": 16,
            "StatusTypeID": 50,
            "LevelID": 2,
            "Amps": 16,
            "Voltage": 230,
            "PowerKW": 3.7,
            "CurrentTypeID": 10,
            "Quantity": 1
        },
        {
            "ID": 78337,
            "ConnectionTypeID": 28,
            "StatusTypeID": 50,
            "LevelID": 2,
            "Amps": 16,
            "Voltage": 230,
            "PowerKW": 3.7,
            "CurrentTypeID": 10,
            "Quantity": 2
        }
    ],
    "NumberOfPoints": 2,
    "StatusTypeID": 50,
    "DateLastStatusUpdate": "2016-03-02T07:00:00Z",
    "DataQualityLevel": 1,
    "DateCreated": "2016-03-02T07:00:00Z",
    "SubmissionStatusTypeID": 200
}