{
    "IsRecentlyVerified": false,
    "ID": 48822,
    "UUID": "4BE6733C-7C96-48C8-AE31-FE854E9D6F53",
    "DataProviderID": 1,
    "OperatorID": 3315,
    "OperatorsReference": "50194,50195",
    "UsageTypeID": 6,
    "UsageCost": "£0.15/kWh;min £1.00",
    "AddressInfo": {
        "ID": 49168,
        "Title": "Mull and Iona Community Trust Bunessan",
        "AddressLine1": "Unit 1, The Square",
        "AddressLine2": "Bunessan",
        "Town": "Isle of Mull",
        "Postcode": "PA67 6DG",
        "CountryID": 1,
        "Latitude": 56.315596,
        "Longitude": -6.235259,
        "DistanceUnit": 0
    },
    "Connections": [
        {
            "ID": 60332,
            "ConnectionTypeID": 3,
            "StatusTypeID": 100,
            "LevelID": 2,
            "Amps": 13,
            "Voltage": 230,
            "PowerKW": 3,
            "CurrentTypeID": 10,
            "Quantity": 1
        },
        {
            "ID": 60891,
            "ConnectionTypeID": 25,
            "StatusTypeID": 100,
            "LevelID": 2,
            "Amps": 32,
            "Voltage": 230,
            "PowerKW": 7,
            "CurrentTypeID": 10,
            "Quantity": 1
        }
    ],
    "NumberOfPoints": 1,
    "StatusTypeID": 100,
    "DateLastStatusUpdate": "2018-04-09T16:37:00Z",
    "DataQualityLevel": 1,
    "DateCreated": "2015-07-02T12:18:00Z",
    "SubmissionStatusTypeID": 200
}