{
    "IsRecentlyVerified": false,
    "ID": 125841,
    "UUID": "36E2CDC7-8DB9-4797-888D-4F7D77A9F3A2",
    "DataProviderID": 1,
    "OperatorID": 3327,
    "UsageTypeID": 4,
    "AddressInfo": {
        "ID": 126187,
        "Title": "Hotel Lieta Sosta | BeCharge",
        "AddressLine1": "Via Adriatica, 230",
        "AddressLine2": "Colfiorito ",
        "Town": "Foligno",
        "StateOrProvince": "PG",
        "Postcode": "06034",
        "CountryID": 112,
        "Latitude": 43.0286391402024,
        "Longitude": 12.8917880052605,
        "ContactTelephone1": "02-49527730",
        "ContactEmail": "emobility@buildingenergy.it",
        "RelatedURL": "https://www.bec.energy/",
        "DistanceUnit": 0
    },
    "Connections": [
        {
            "ID": 176355,
            "ConnectionTypeID": 25,
            "StatusTypeID": 50,
            "LevelID": 2,
            "Amps": 32,
            "Voltage": 400,
            "PowerKW": 22,
            "CurrentTypeID": 20,
            "Quantity": 2
        }
    ],
    "NumberOfPoints": 2,
    "GeneralComments": "\r\n",
    "StatusTypeID": 50,
    "DateLastStatusUpdate": "2019-04-30T13:41:00Z",
    "DataQualityLevel": 1,
    "DateCreated": "2019-04-30T13:14:00Z",
    "SubmissionStatusTypeID": 200
}