{
    "IsRecentlyVerified": false,
    "ID": 32731,
    "UUID": "BCA6B46F-0610-4FEB-BFE0-22834AD21F8C",
    "DataProviderID": 26,
    "DataProvidersReference": "47126",
    "OperatorID": 178,
    "OperatorsReference": "EVnetNL AL275",
    "UsageCost": "0.00 jaarabonnement",
    "AddressInfo": {
        "ID": 33077,
        "Title": "Koningsplein",
        "AddressLine1": "Koningsplein",
        "Town": "Asten",
        "Postcode": "5721 GJ",
        "CountryID": 159,
        "Latitude": 51.403279,
        "Longitude": 5.743993,
        "ContactTelephone1": "0800-3522365",
        "RelatedURL": "http://www.evnet.nl",
        "DistanceUnit": 0
    },
    "Connections": [
        {
            "ID": 36242,
            "ConnectionTypeID": 25,
            "LevelID": 2,
            "PowerKW": 11,
            "CurrentTypeID": 10
        }
    ],
    "NumberOfPoints": 2,
    "StatusTypeID": 50,
    "DateLastStatusUpdate": "2016-06-04T02:38:00Z",
    "DataQualityLevel": 3,
    "DateCreated": "2015-01-09T06:03:00Z",
    "SubmissionStatusTypeID": 100
}