{
    "IsRecentlyVerified": false,
    "ID": 85137,
    "UUID": "F611F7E4-E021-4AA9-9DB0-0F03D389C37F",
    "DataProviderID": 1,
    "OperatorID": 45,
    "UsageTypeID": 5,
    "AddressInfo": {
        "ID": 85483,
        "Title": " P+R Étoile",
        "AddressLine1": "Carrefour de l'Etoile, 1",
        "Town": "Genève",
        "Postcode": "1211",
        "CountryID": 217,
        "Latitude": 46.1871408835465,
        "Longitude": 6.1281775626518,
        "ContactTelephone1": "022 827 44 90",
        "ContactEmail": "admin@fondation-parkings.ch",
        "RelatedURL": "https://www.geneve-parking.ch/fr/parkings/place-de-cornavin",
        "DistanceUnit": 0
    },
    "Connections": [
        {
            "ID": 120899,
            "ConnectionTypeID": 1037,
            "StatusTypeID": 50,
            "LevelID": 2,
            "Amps": 10,
            "Voltage": 230,
            "PowerKW": 3,
            "CurrentTypeID": 10,
            "Quantity": 6
        }
    ],
    "NumberOfPoints": 6,
    "GeneralComments": "étage 1",
    "StatusTypeID": 50,
    "DateLastStatusUpdate": "2017-04-01T09:34:00Z",
    "DataQualityLevel": 1,
    "DateCreated": "2017-03-26T17:33:00Z",
    "SubmissionStatusTypeID": 200
}