{
    "IsRecentlyVerified": false,
    "ID": 15761,
    "UUID": "4D3F986F-B373-4FC1-9D6C-4D940600E98F",
    "DataProviderID": 1,
    "OperatorID": 56,
    "UsageTypeID": 4,
    "UsageCost": "Free",
    "AddressInfo": {
        "ID": 16106,
        "Title": "Turin",
        "AddressLine1": "41 route de Turin",
        "Town": "NICE",
        "Postcode": "06300",
        "CountryID": 80,
        "Latitude": 43.71199379999999,
        "Longitude": 7.2847384000000375,
        "DistanceUnit": 0
    },
    "Connections": [
        {
            "ID": 14106,
            "ConnectionTypeID": 13,
            "StatusTypeID": 0,
            "LevelID": 2,
            "Amps": 16,
            "Voltage": 220,
            "PowerKW": 4,
            "CurrentTypeID": 20,
            "Quantity": 2
        }
    ],
    "NumberOfPoints": 2,
    "StatusTypeID": 50,
    "DateLastStatusUpdate": "2017-04-21T20:02:00Z",
    "DataQualityLevel": 1,
    "DateCreated": "2013-01-21T18:08:00Z",
    "SubmissionStatusTypeID": 200
}