{
    "IsRecentlyVerified": false,
    "ID": 46269,
    "UUID": "FC07DF3D-26C3-4B8A-9951-1B1B24E18FB6",
    "DataProviderID": 1,
    "DataProvidersReference": "1119",
    "AddressInfo": {
        "ID": 46615,
        "Title": "Mauritz Hansens gate/Homansbyen, Oslo",
        "AddressLine1": "Mauritz Hansens gate 2",
        "Town": "OSLO",
        "StateOrProvince": "Oslo",
        "Postcode": "0350",
        "CountryID": 168,
        "Latitude": 59.92117,
        "Longitude": 10.73107,
        "AccessComments": "Innkjøring kun mulig fra Welhavens gate, dvs sving ned fra Parkveien fordi Welhavens gate er enveiskjørt ned mot sentrum.",
        "DistanceUnit": 0
    },
    "Connections": [
        {
            "ID": 56932,
            "ConnectionTypeID": 0,
            "Reference": "1",
            "LevelID": 2,
            "Amps": 16,
            "Voltage": 230,
            "PowerKW": 3.7,
            "Comments": "Mode 1"
        },
        {
            "ID": 85879,
            "ConnectionTypeID": 0,
            "Reference": "2",
            "LevelID": 2,
            "Amps": 16,
            "Voltage": 230,
            "PowerKW": 3.7,
            "Comments": "Mode 1"
        },
        {
            "ID": 85880,
            "ConnectionTypeID": 0,
            "Reference": "3",
            "LevelID": 2,
            "Amps": 16,
            "Voltage": 230,
            "PowerKW": 3.7,
            "Comments": "Mode 1"
        },
        {
            "ID": 88655,
            "ConnectionTypeID": 0,
            "Reference": "4",
            "LevelID": 2,
            "Amps": 16,
            "Voltage": 230,
            "PowerKW": 3.7,
            "Comments": "Mode 1"
        }
    ],
    "NumberOfPoints": 4,
    "DateLastStatusUpdate": "2020-05-26T08:23:00Z",
    "DataQualityLevel": 2,
    "DateCreated": "2015-05-03T00:54:00Z",
    "SubmissionStatusTypeID": 100
}