{
    "IsRecentlyVerified": false,
    "ID": 175203,
    "UUID": "A3DBFC63-F7C1-470F-B6C1-940F9A3D2759",
    "DataProviderID": 1,
    "OperatorID": 3299,
    "UsageTypeID": 4,
    "UsageCost": "0.79€ / kWh or Mobi.E compatible card or App",
    "AddressInfo": {
        "ID": 175562,
        "Title": "IONITY Almodôvar N-S ADV-00004/5",
        "AddressLine1": "Area de Serviço de Almodôvar",
        "Town": "Almodôvar",
        "StateOrProvince": "Beja",
        "Postcode": "",
        "CountryID": 180,
        "Latitude": 37.5359146764531,
        "Longitude": -8.184786575256453,
        "DistanceUnit": 0
    },
    "Connections": [
        {
            "ID": 271646,
            "ConnectionTypeID": 33,
            "StatusTypeID": 50,
            "LevelID": 3,
            "Amps": 500,
            "Voltage": 920,
            "PowerKW": 350,
            "CurrentTypeID": 30,
            "Quantity": 2
        }
    ],
    "NumberOfPoints": 2,
    "StatusTypeID": 50,
    "DateLastStatusUpdate": "2021-05-01T12:19:00Z",
    "DataQualityLevel": 1,
    "DateCreated": "2021-05-01T12:19:00Z",
    "SubmissionStatusTypeID": 200
}