{
    "UserComments": [
        {
            "ID": 20340,
            "ChargePointID": 112297,
            "CommentTypeID": 10,
            "UserName": "Robert Seemueller",
            "Rating": 5,
            "DateCreated": "2018-10-24T02:27:57.917Z",
            "User": {
                "ID": 19108,
                "Username": "Robert Seemueller"
            },
            "CheckinStatusTypeID": 140
        }
    ],
    "MediaItems": [
        {
            "ID": 16878,
            "ChargePointID": 112297,
            "ItemURL": "https://s3-ap-southeast-2.amazonaws.com/openchargemap/images/US/OCM112297/OCM-112297.orig.2018102402272472.jpg",
            "ItemThumbnailURL": "https://s3-ap-southeast-2.amazonaws.com/openchargemap/images/US/OCM112297/OCM-112297.thmb.2018102402272472.jpg",
            "Comment": "",
            "IsEnabled": true,
            "IsVideo": false,
            "IsFeaturedItem": false,
            "IsExternalResource": false,
            "User": {
                "ID": 19108,
                "Username": "Robert Seemueller"
            },
            "DateCreated": "2018-10-24T02:28:00Z"
        },
        {
            "ID": 16877,
            "ChargePointID": 112297,
            "ItemURL": "https://s3-ap-southeast-2.amazonaws.com/openchargemap/images/US/OCM112297/OCM-112297.orig.2018102402270359.jpg",
            "ItemThumbnailURL": "https://s3-ap-southeast-2.amazonaws.com/openchargemap/images/US/OCM112297/OCM-112297.thmb.2018102402270359.jpg",
            "Comment": "",
            "IsEnabled": true,
            "IsVideo": false,
            "IsFeaturedItem": false,
            "IsExternalResource": false,
            "User": {
                "ID": 19108,
                "Username": "Robert Seemueller"
            },
            "DateCreated": "2018-10-24T02:27:00Z"
        }
    ],
    "IsRecentlyVerified": false,
    "ID": 112297,
    "UUID": "B3A41FCA-2216-4098-B04C-CF9A796887BF",
    "DataProviderID": 1,
    "OperatorID": 1,
    "UsageTypeID": 1,
    "UsageCost": "free",
    "AddressInfo": {
        "ID": 112643,
        "Title": "Fernbach Ramp",
        "AddressLine1": "200 Pearl Street",
        "Town": "Buffalo",
        "StateOrProvince": "New York",
        "Postcode": "14203",
        "CountryID": 2,
        "Latitude": 42.8850432175934,
        "Longitude": -78.87614099440583,
        "AccessComments": "4 Charging stations located near the entrance to the ramp off Pearl Street at south end of ramp.",
        "DistanceUnit": 0
    },
    "Connections": [
        {
            "ID": 157915,
            "ConnectionTypeID": 1,
            "StatusTypeID": 50,
            "LevelID": 2,
            "Quantity": 4
        }
    ],
    "NumberOfPoints": 4,
    "GeneralComments": "Need EV Connect App. Charging is free. Parking is $2 an hour, maximum $8 daily.",
    "StatusTypeID": 50,
    "DateLastStatusUpdate": "2018-10-25T09:37:00Z",
    "DataQualityLevel": 1,
    "DateCreated": "2018-10-24T02:19:00Z",
    "SubmissionStatusTypeID": 200
}