{
    "IsRecentlyVerified": false,
    "ID": 166334,
    "UUID": "298498E9-EA75-4A6D-8274-90040DCA0545",
    "DataProviderID": 28,
    "DataProvidersReference": "FR*S25*P02505630",
    "UsageTypeID": 5,
    "AddressInfo": {
        "ID": 166693,
        "Title": "Parking Granvelle",
        "AddressLine1": "\"11 Rue de la Préfecture 25000 Besançon\"",
        "CountryID": 80,
        "Latitude": 47.23496,
        "Longitude": 6.02517,
        "AccessComments": "accessible 24h/24 - 7j/7",
        "DistanceUnit": 0
    },
    "Connections": [
        {
            "ID": 246614,
            "ConnectionTypeID": 1036,
            "StatusTypeID": 50,
            "LevelID": 2,
            "PowerKW": 22,
            "CurrentTypeID": 20
        },
        {
            "ID": 246615,
            "ConnectionTypeID": 1036,
            "StatusTypeID": 50,
            "LevelID": 2,
            "PowerKW": 22,
            "CurrentTypeID": 20
        }
    ],
    "GeneralComments": "recharge normale et accélérée accessible par application smartphone/internet et badge - informations site web freshmile.fr",
    "StatusTypeID": 50,
    "DateLastStatusUpdate": "2020-08-27T05:13:00Z",
    "DataQualityLevel": 2,
    "DateCreated": "2020-08-27T05:13:00Z",
    "SubmissionStatusTypeID": 100
}