{
    "UserComments": [
        {
            "ID": 14115,
            "ChargePointID": 62002,
            "CommentTypeID": 10,
            "UserName": "Kent",
            "Comment": "Have stayed at the Inn many times. GREAT destination location.  Just ordered my Tesla. Will use charger next visit and submit photos.",
            "Rating": 4,
            "DateCreated": "2016-08-20T05:18:44.67Z",
            "User": {
                "ID": 11743,
                "Username": "Kent"
            },
            "CheckinStatusTypeID": 140
        },
        {
            "ID": 14114,
            "ChargePointID": 62002,
            "CommentTypeID": 10,
            "UserName": "Kent",
            "Comment": "",
            "DateCreated": "2016-08-20T05:14:27.07Z",
            "User": {
                "ID": 11743,
                "Username": "Kent"
            },
            "CheckinStatusTypeID": 140
        }
    ],
    "IsRecentlyVerified": false,
    "ID": 62002,
    "UUID": "AFF56C2A-DE64-4115-B399-C3634E2C4757",
    "DataProviderID": 2,
    "DataProvidersReference": "73771",
    "OperatorID": 23,
    "UsageTypeID": 7,
    "AddressInfo": {
        "ID": 62348,
        "Title": "Murphin Ridge Inn - Tesla",
        "AddressLine1": "750 Murphin Ridge Rd",
        "Town": "West Union",
        "StateOrProvince": "OH",
        "Postcode": "45693",
        "CountryID": 2,
        "Latitude": 38.879023,
        "Longitude": -83.472163,
        "ContactTelephone1": "877-687-7446  877-798-3752",
        "AccessComments": "24 hours daily; for guest use only",
        "RelatedURL": "https://www.tesla.com/destination-charging",
        "DistanceUnit": 0
    },
    "Connections": [
        {
            "ID": 78902,
            "ConnectionTypeID": 0,
            "LevelID": 2,
            "Amps": 16,
            "Voltage": 230,
            "PowerKW": 3,
            "CurrentTypeID": 10,
            "Quantity": 1
        }
    ],
    "DateLastStatusUpdate": "2018-11-28T02:07:00Z",
    "DataQualityLevel": 3,
    "DateCreated": "2016-03-03T11:38:00Z",
    "SubmissionStatusTypeID": 100
}