{
    "IsRecentlyVerified": false,
    "ID": 72665,
    "UUID": "021E339E-8377-4CBA-A2D5-7A343D11038B",
    "DataProviderID": 1,
    "OperatorID": 45,
    "UsageTypeID": 1,
    "AddressInfo": {
        "ID": 73011,
        "Title": "E-Bike Station Farm in the box",
        "AddressLine1": "Tannenbergstraße 58",
        "Town": "Wuppertal",
        "StateOrProvince": "Wuppertal",
        "Postcode": "42103",
        "CountryID": 87,
        "Latitude": 51.2505355,
        "Longitude": 7.13642110000001,
        "AccessComments": "Auf dem Parkplatz am Gebäude ist eine Art zweistöckiges Gewächshaus, unten mit Werbung beklebt. Davor ist ein Fahrradständer \"GZ Brandservices\" , auf dessen Rückseite  4 Schukodosen montiert ist. Da der Fahrradständer mitten auf Autoparkplätzen steht, ist die Ladestelle auch von Elektroautos nutzbar. 24/7 nutzbar, Gesamtbelastbarkeit 3.7kW!",
        "DistanceUnit": 0
    },
    "Connections": [
        {
            "ID": 104182,
            "ConnectionTypeID": 28,
            "StatusTypeID": 50,
            "LevelID": 2,
            "Amps": 16,
            "Voltage": 230,
            "PowerKW": 3.7,
            "CurrentTypeID": 10,
            "Quantity": 4
        }
    ],
    "NumberOfPoints": 4,
    "StatusTypeID": 50,
    "DateLastStatusUpdate": "2016-10-31T07:01:00Z",
    "DataQualityLevel": 1,
    "DateCreated": "2016-10-31T06:58:00Z",
    "SubmissionStatusTypeID": 200
}