{
    "IsRecentlyVerified": false,
    "ID": 178391,
    "UUID": "09C0566D-26A9-4100-BAE7-E930CB771A70",
    "DataProviderID": 29,
    "DataProvidersReference": "7274",
    "OperatorID": 86,
    "AddressInfo": {
        "ID": 178750,
        "Title": "Esslinger Str. 7",
        "AddressLine1": "Esslinger Str. 7",
        "Town": "Esslingen",
        "Postcode": "73732",
        "CountryID": 87,
        "Latitude": 48.743219,
        "Longitude": 9.340183,
        "DistanceUnit": 0
    },
    "Connections": [
        {
            "ID": 278735,
            "ConnectionTypeID": 28,
            "StatusTypeID": 50,
            "LevelID": 2,
            "PowerKW": 22,
            "CurrentTypeID": 20
        },
        {
            "ID": 278736,
            "ConnectionTypeID": 25,
            "StatusTypeID": 50,
            "LevelID": 2,
            "PowerKW": 22,
            "CurrentTypeID": 20
        },
        {
            "ID": 296122,
            "ConnectionTypeID": 28,
            "StatusTypeID": 50,
            "LevelID": 2,
            "PowerKW": 22,
            "CurrentTypeID": 20
        },
        {
            "ID": 296123,
            "ConnectionTypeID": 25,
            "StatusTypeID": 50,
            "LevelID": 2,
            "PowerKW": 22,
            "CurrentTypeID": 20
        }
    ],
    "StatusTypeID": 0,
    "DateLastStatusUpdate": "2021-07-12T02:41:00Z",
    "MetadataValues": [
        {
            "ID": 10685,
            "MetadataFieldID": 4,
            "ItemValue": "Data from the German chargepoint registry provided by Bundesnetzagentur.de under the CC-BY 4.0 license"
        }
    ],
    "DataQualityLevel": 3,
    "DateCreated": "2021-07-08T09:50:00Z",
    "SubmissionStatusTypeID": 100
}