{
    "IsRecentlyVerified": false,
    "ID": 57393,
    "UUID": "68FC356F-6088-42E9-AA35-446868301E81",
    "DataProviderID": 2,
    "DataProvidersReference": "71024",
    "OperatorID": 5,
    "UsageTypeID": 1,
    "AddressInfo": {
        "ID": 57739,
        "Title": "SUNY ONEONTA",
        "AddressLine1": "24-26 Ravine Pkwy N",
        "Town": "Oneonta",
        "StateOrProvince": "NY",
        "Postcode": "13820",
        "CountryID": 2,
        "Latitude": 42.4694812,
        "Longitude": -75.0657228,
        "ContactTelephone1": "888-758-4389",
        "AccessComments": "24 hours daily",
        "RelatedURL": "http://www.chargepoint.com/",
        "DistanceUnit": 0
    },
    "Connections": [
        {
            "ID": 72499,
            "ConnectionTypeID": 1,
            "LevelID": 2,
            "Amps": 16,
            "Voltage": 230,
            "PowerKW": 3.7,
            "CurrentTypeID": 10,
            "Quantity": 2
        }
    ],
    "DateLastStatusUpdate": "2020-06-26T03:06:00Z",
    "DataQualityLevel": 3,
    "DateCreated": "2015-11-30T11:50:00Z",
    "SubmissionStatusTypeID": 100
}