{
    "IsRecentlyVerified": false,
    "ID": 134271,
    "UUID": "DCD2F32F-7C9C-4666-861E-AE066AAC2906",
    "DataProviderID": 1,
    "OperatorID": 3315,
    "OperatorsReference": "52554",
    "UsageTypeID": 4,
    "UsageCost": "Free",
    "AddressInfo": {
        "ID": 134617,
        "Title": "Lanark Railway Station, Lanark",
        "AddressLine1": "Bannatyne Street",
        "Town": "Lanark",
        "Postcode": "ML11 7JP",
        "CountryID": 1,
        "Latitude": 55.672951,
        "Longitude": -3.771597,
        "DistanceUnit": 0
    },
    "Connections": [
        {
            "ID": 187889,
            "ConnectionTypeID": 25,
            "StatusTypeID": 50,
            "LevelID": 2,
            "Amps": 16,
            "Voltage": 400,
            "PowerKW": 11,
            "CurrentTypeID": 20,
            "Quantity": 2
        }
    ],
    "NumberOfPoints": 2,
    "StatusTypeID": 50,
    "DateLastStatusUpdate": "2019-11-07T06:13:00Z",
    "DataQualityLevel": 1,
    "DateCreated": "2019-11-07T06:13:00Z",
    "SubmissionStatusTypeID": 200
}