{
    "IsRecentlyVerified": false,
    "ID": 16371,
    "UUID": "72B0DB70-838B-460D-A572-3D19559734EE",
    "DataProviderID": 2,
    "DataProvidersReference": "51297",
    "OperatorID": 5,
    "UsageTypeID": 1,
    "AddressInfo": {
        "ID": 16716,
        "Title": "LAFAYETTE BOYNT",
        "AddressLine1": "901 Boynton Ave",
        "Town": "Bronx",
        "StateOrProvince": "NY",
        "Postcode": "10473",
        "CountryID": 2,
        "Latitude": 40.8214511,
        "Longitude": -73.8776415,
        "ContactTelephone1": "888-758-4389",
        "AccessComments": "24 hours daily",
        "RelatedURL": "http://www.chargepoint.com/",
        "DistanceUnit": 0
    },
    "Connections": [
        {
            "ID": 14850,
            "ConnectionTypeID": 1,
            "LevelID": 2,
            "Amps": 16,
            "Voltage": 230,
            "PowerKW": 3,
            "CurrentTypeID": 10,
            "Quantity": 2
        },
        {
            "ID": 22175,
            "ConnectionTypeID": 1,
            "LevelID": 2,
            "Quantity": 2
        }
    ],
    "DateLastStatusUpdate": "2019-12-24T09:18:00Z",
    "DataQualityLevel": 3,
    "DateCreated": "2013-04-18T04:39:00Z",
    "SubmissionStatusTypeID": 100
}