{
    "IsRecentlyVerified": false,
    "ID": 182366,
    "UUID": "B3C54CD3-7781-4DB9-8FA3-9435BEBA6CCB",
    "DataProviderID": 29,
    "DataProvidersReference": "130",
    "AddressInfo": {
        "ID": 182725,
        "Title": "Parkplatz des Bahnhofs Gruiten am Neandertalweg",
        "AddressLine1": "Parkplatz des Bahnhofs Gruiten am Neandertalweg",
        "Town": "Haan",
        "Postcode": "42782",
        "CountryID": 87,
        "Latitude": 51.215127,
        "Longitude": 7.00996,
        "DistanceUnit": 0
    },
    "Connections": [
        {
            "ID": 288006,
            "ConnectionTypeID": 25,
            "StatusTypeID": 50,
            "LevelID": 2,
            "PowerKW": 22,
            "CurrentTypeID": 20
        },
        {
            "ID": 288007,
            "ConnectionTypeID": 25,
            "StatusTypeID": 50,
            "LevelID": 2,
            "PowerKW": 22,
            "CurrentTypeID": 20
        }
    ],
    "StatusTypeID": 50,
    "DateLastStatusUpdate": "2021-07-09T03:22:00Z",
    "MetadataValues": [
        {
            "ID": 14660,
            "MetadataFieldID": 4,
            "ItemValue": "Data from the German chargepoint registry provided by Bundesnetzagentur.de under the CC-BY 4.0 license"
        }
    ],
    "DataQualityLevel": 3,
    "DateCreated": "2021-07-08T10:02:00Z",
    "SubmissionStatusTypeID": 100
}