{
    "IsRecentlyVerified": false,
    "ID": 70116,
    "UUID": "5C9058A6-EDF4-431C-A295-DD62026B52BD",
    "DataProviderID": 1,
    "OperatorID": 234,
    "UsageTypeID": 4,
    "AddressInfo": {
        "ID": 70462,
        "Title": "Rathausplatz ",
        "AddressLine1": "Mimberger Straße ",
        "Town": "Burgthann",
        "StateOrProvince": "Nürnberger Land",
        "Postcode": "90559",
        "CountryID": 87,
        "Latitude": 49.35143650000001,
        "Longitude": 11.314933800000063,
        "AccessComments": "24/7 verfügbar.",
        "DistanceUnit": 0
    },
    "Connections": [
        {
            "ID": 100033,
            "ConnectionTypeID": 25,
            "StatusTypeID": 50,
            "LevelID": 2,
            "PowerKW": 22,
            "CurrentTypeID": 20,
            "Quantity": 2
        }
    ],
    "NumberOfPoints": 2,
    "StatusTypeID": 50,
    "DateLastStatusUpdate": "2016-07-08T10:02:00Z",
    "DataQualityLevel": 1,
    "DateCreated": "2016-07-08T10:02:00Z",
    "SubmissionStatusTypeID": 200
}