{
    "IsRecentlyVerified": false,
    "ID": 108064,
    "UUID": "EAE20158-2BCC-4E1B-AC57-C71FDC71F006",
    "DataProviderID": 1,
    "OperatorID": 80,
    "UsageTypeID": 4,
    "AddressInfo": {
        "ID": 108410,
        "Title": "Area Camper | EnelX",
        "AddressLine1": "Via Campo Boario",
        "Town": "Roccascalegna ",
        "StateOrProvince": "CH",
        "Postcode": "66040 ",
        "CountryID": 112,
        "Latitude": 42.0622255650279,
        "Longitude": 14.310104071147,
        "ContactTelephone1": "800.069.850",
        "RelatedURL": "https://www.enelx.com/it/it/emobility",
        "DistanceUnit": 0
    },
    "Connections": [
        {
            "ID": 152635,
            "ConnectionTypeID": 25,
            "StatusTypeID": 50,
            "LevelID": 2,
            "Amps": 32,
            "Voltage": 400,
            "PowerKW": 22,
            "CurrentTypeID": 20,
            "Quantity": 1
        },
        {
            "ID": 152636,
            "ConnectionTypeID": 36,
            "StatusTypeID": 50,
            "LevelID": 2,
            "Amps": 16,
            "Voltage": 240,
            "PowerKW": 3.7,
            "CurrentTypeID": 10,
            "Quantity": 1
        }
    ],
    "NumberOfPoints": 2,
    "StatusTypeID": 50,
    "DateLastStatusUpdate": "2019-11-07T15:09:00Z",
    "DataQualityLevel": 1,
    "DateCreated": "2018-08-29T12:50:00Z",
    "SubmissionStatusTypeID": 200
}