{
    "IsRecentlyVerified": false,
    "ID": 3529,
    "UUID": "9F92AA21-9583-489F-B84D-C1B4BA42A56A",
    "DataProviderID": 1,
    "UsageTypeID": 1,
    "AddressInfo": {
        "ID": 3530,
        "Title": "Plug In Carolina",
        "AddressLine1": "66 Richardson St",
        "Town": "Greenville",
        "StateOrProvince": "SC",
        "Postcode": "29601",
        "CountryID": 2,
        "Latitude": 34.852,
        "Longitude": -82.4,
        "DistanceUnit": 0
    },
    "Connections": [
        {
            "ID": 45,
            "ConnectionTypeID": 1,
            "Quantity": 1
        }
    ],
    "NumberOfPoints": 1,
    "DateLastStatusUpdate": "2019-12-15T06:07:00Z",
    "DateCreated": "2010-02-28T00:00:00Z",
    "SubmissionStatusTypeID": 200
}