{
    "IsRecentlyVerified": false,
    "ID": 188017,
    "UUID": "59073DAB-7ED1-4A25-9F61-C6249D5D7C87",
    "DataProviderID": 18,
    "DataProvidersReference": "2ccf2ebd89f6f0619198bed97f3d0c51",
    "OperatorID": 3,
    "UsageTypeID": 1,
    "AddressInfo": {
        "ID": 188376,
        "Title": "Unit 10, Enterprise House Wistaston Road",
        "AddressLine1": "Unit 10, Enterprise House Wistaston Road",
        "Town": "Crewe",
        "Postcode": "CW2 7RP",
        "CountryID": 1,
        "Latitude": 53.096673,
        "Longitude": -2.449976,
        "AccessComments": "",
        "RelatedURL": "http://pod-point.com",
        "DistanceUnit": 0
    },
    "Connections": [
        {
            "ID": 303389,
            "ConnectionTypeID": 25,
            "Reference": "0",
            "StatusTypeID": 50,
            "LevelID": 2,
            "Amps": 32,
            "Voltage": 230,
            "PowerKW": 7,
            "CurrentTypeID": 10
        }
    ],
    "StatusTypeID": 0,
    "DateLastStatusUpdate": "2021-07-12T03:39:00Z",
    "MetadataValues": [
        {
            "ID": 20257,
            "MetadataFieldID": 4,
            "ItemValue": "Contains public sector information licensed under the Open Government Licence v2.0. http://www.nationalarchives.gov.uk/doc/open-government-licence/version/2/"
        }
    ],
    "DataQualityLevel": 3,
    "DateCreated": "2021-07-12T03:39:00Z",
    "SubmissionStatusTypeID": 100
}