{
    "IsRecentlyVerified": false,
    "ID": 183532,
    "UUID": "448A0686-9992-4B6E-A3A9-E6CEA7CDE79C",
    "DataProviderID": 29,
    "DataProvidersReference": "2538",
    "OperatorID": 105,
    "AddressInfo": {
        "ID": 183891,
        "Title": "Hannöversche Straße 22",
        "AddressLine1": "Hannöversche Straße 22",
        "Town": "Dortmund",
        "Postcode": "44143",
        "CountryID": 87,
        "Latitude": 51.519433,
        "Longitude": 7.49855,
        "DistanceUnit": 0
    },
    "Connections": [
        {
            "ID": 290632,
            "ConnectionTypeID": 25,
            "StatusTypeID": 50,
            "LevelID": 2,
            "PowerKW": 22,
            "CurrentTypeID": 20
        },
        {
            "ID": 290633,
            "ConnectionTypeID": 25,
            "StatusTypeID": 50,
            "LevelID": 2,
            "PowerKW": 22,
            "CurrentTypeID": 20
        }
    ],
    "StatusTypeID": 50,
    "DateLastStatusUpdate": "2021-07-12T02:47:00Z",
    "MetadataValues": [
        {
            "ID": 15825,
            "MetadataFieldID": 4,
            "ItemValue": "Data from the German chargepoint registry provided by Bundesnetzagentur.de under the CC-BY 4.0 license"
        }
    ],
    "DataQualityLevel": 3,
    "DateCreated": "2021-07-08T10:04:00Z",
    "SubmissionStatusTypeID": 100
}