{
    "IsRecentlyVerified": false,
    "ID": 157801,
    "UUID": "87308E34-0310-4A42-8053-7D8259AC42BD",
    "DataProviderID": 1,
    "OperatorID": 8,
    "UsageTypeID": 4,
    "AddressInfo": {
        "ID": 158155,
        "Title": "716-702 London Road",
        "AddressLine1": "716-702 London Road",
        "Town": "Sutton",
        "Postcode": "SM3 9BY",
        "CountryID": 1,
        "Latitude": 51.376366,
        "Longitude": -0.222026,
        "AccessComments": "",
        "RelatedURL": "https://polar-network.com/",
        "DistanceUnit": 0
    },
    "Connections": [
        {
            "ID": 227365,
            "ConnectionTypeID": 2,
            "Reference": "1",
            "StatusTypeID": 50,
            "LevelID": 3,
            "Amps": 125,
            "Voltage": 400,
            "PowerKW": 50,
            "CurrentTypeID": 30
        },
        {
            "ID": 227366,
            "ConnectionTypeID": 33,
            "Reference": "2",
            "StatusTypeID": 50,
            "LevelID": 3,
            "Amps": 125,
            "Voltage": 400,
            "PowerKW": 50,
            "CurrentTypeID": 30
        },
        {
            "ID": 257277,
            "ConnectionTypeID": 1036,
            "StatusTypeID": 50,
            "LevelID": 3,
            "PowerKW": 43,
            "CurrentTypeID": 20,
            "Quantity": 1
        }
    ],
    "StatusTypeID": 50,
    "DateLastStatusUpdate": "2020-10-10T22:22:00Z",
    "MetadataValues": [
        {
            "ID": 7334,
            "MetadataFieldID": 4,
            "ItemValue": "Contains public sector information licensed under the Open Government Licence v2.0. http://www.nationalarchives.gov.uk/doc/open-government-licence/version/2/"
        }
    ],
    "DataQualityLevel": 3,
    "DateCreated": "2020-06-25T10:00:00Z",
    "SubmissionStatusTypeID": 100
}