{
    "IsRecentlyVerified": false,
    "ID": 183461,
    "UUID": "7D40835C-51F8-4B5A-9666-96E16D4A0BCE",
    "DataProviderID": 29,
    "DataProvidersReference": "10732",
    "OperatorID": 86,
    "AddressInfo": {
        "ID": 183820,
        "Title": "Talheimer Straße 38",
        "AddressLine1": "Talheimer Straße 38",
        "Town": "Flein",
        "Postcode": "74223",
        "CountryID": 87,
        "Latitude": 49.103025,
        "Longitude": 9.202138,
        "DistanceUnit": 0
    },
    "Connections": [
        {
            "ID": 290473,
            "ConnectionTypeID": 25,
            "StatusTypeID": 50,
            "LevelID": 2,
            "PowerKW": 22,
            "CurrentTypeID": 20
        },
        {
            "ID": 290474,
            "ConnectionTypeID": 25,
            "StatusTypeID": 50,
            "LevelID": 2,
            "PowerKW": 22,
            "CurrentTypeID": 20
        }
    ],
    "StatusTypeID": 50,
    "DateLastStatusUpdate": "2021-07-12T02:42:00Z",
    "MetadataValues": [
        {
            "ID": 15754,
            "MetadataFieldID": 4,
            "ItemValue": "Data from the German chargepoint registry provided by Bundesnetzagentur.de under the CC-BY 4.0 license"
        }
    ],
    "DataQualityLevel": 3,
    "DateCreated": "2021-07-08T10:04:00Z",
    "SubmissionStatusTypeID": 100
}