{
    "IsRecentlyVerified": false,
    "ID": 5836,
    "UUID": "EFB4F490-FB18-41AF-893E-BB9B5E4B52F0",
    "DataProviderID": 1,
    "OperatorID": 32,
    "OperatorsReference": "247",
    "UsageTypeID": 4,
    "UsageCost": "Inclusive; for Polar Plus subscription members only",
    "AddressInfo": {
        "ID": 5758,
        "Title": "Basepoint Business & Innovation Centre",
        "AddressLine1": "110 Butterfield",
        "AddressLine2": "Hitchin Road",
        "Town": "Luton",
        "StateOrProvince": "Bedfordshire",
        "Postcode": "LU2 8DD",
        "CountryID": 1,
        "Latitude": 51.9117753,
        "Longitude": -0.3880388,
        "DistanceUnit": 0
    },
    "Connections": [
        {
            "ID": 585,
            "ConnectionTypeID": 25,
            "StatusTypeID": 50,
            "LevelID": 2,
            "Amps": 32,
            "Voltage": 230,
            "PowerKW": 7,
            "CurrentTypeID": 10,
            "Quantity": 2
        },
        {
            "ID": 52830,
            "ConnectionTypeID": 3,
            "StatusTypeID": 50,
            "LevelID": 2,
            "Amps": 13,
            "Voltage": 230,
            "PowerKW": 3,
            "CurrentTypeID": 10,
            "Quantity": 1
        }
    ],
    "NumberOfPoints": 2,
    "GeneralComments": "Chargemaster post 247. Formerly on Source East",
    "StatusTypeID": 50,
    "DateLastStatusUpdate": "2019-03-06T06:16:00Z",
    "DataQualityLevel": 1,
    "DateCreated": "2011-09-12T11:40:00Z",
    "SubmissionStatusTypeID": 200
}