{
    "IsRecentlyVerified": false,
    "ID": 19903,
    "UUID": "8EF936DA-9593-4E83-8195-2B9A192C69D7",
    "DataProviderID": 1,
    "OperatorID": 1,
    "UsageTypeID": 0,
    "UsageCost": "",
    "AddressInfo": {
        "ID": 20248,
        "Title": "Renault - Vannes",
        "AddressLine1": "Route de Nantes",
        "AddressLine2": "",
        "Town": "",
        "StateOrProvince": " Vannes",
        "Postcode": "56000",
        "CountryID": 80,
        "Latitude": 47.65432,
        "Longitude": -2.73712,
        "ContactTelephone1": "",
        "ContactTelephone2": "",
        "ContactEmail": "",
        "AccessComments": "Ouvert à tous",
        "RelatedURL": "",
        "DistanceUnit": 0
    },
    "Connections": [],
    "GeneralComments": "",
    "StatusTypeID": 50,
    "DateLastStatusUpdate": "2013-10-21T20:26:00Z",
    "DataQualityLevel": 1,
    "DateCreated": "2013-10-21T03:53:00Z",
    "SubmissionStatusTypeID": 200
}