{
    "IsRecentlyVerified": false,
    "ID": 160358,
    "UUID": "5EAA89DF-FDD6-4E98-B6F6-C83254F32177",
    "DataProviderID": 2,
    "DataProvidersReference": "156692",
    "UsageTypeID": 2,
    "AddressInfo": {
        "ID": 160715,
        "Title": "Canadian Tire Corporation",
        "AddressLine1": "245 Daniel St S",
        "Town": "Arnprior",
        "StateOrProvince": "ON",
        "Postcode": "K7S 3K5",
        "CountryID": 44,
        "Latitude": 45.42587,
        "Longitude": -76.36536,
        "ContactTelephone1": "",
        "AccessComments": "",
        "RelatedURL": "",
        "DistanceUnit": 0
    },
    "Connections": [
        {
            "ID": 230728,
            "ConnectionTypeID": 2,
            "LevelID": 3,
            "Amps": 100,
            "Voltage": 400,
            "PowerKW": 40,
            "CurrentTypeID": 30,
            "Quantity": 1
        },
        {
            "ID": 230729,
            "ConnectionTypeID": 32,
            "LevelID": 3,
            "Amps": 100,
            "Voltage": 400,
            "PowerKW": 40,
            "CurrentTypeID": 30,
            "Quantity": 1
        }
    ],
    "GeneralComments": "Planned for future date. Not Operational.",
    "DatePlanned": "2020-09-01T00:00:00Z",
    "StatusTypeID": 150,
    "DateLastStatusUpdate": "2020-06-26T03:09:00Z",
    "DataQualityLevel": 3,
    "DateCreated": "2020-06-26T03:09:00Z",
    "SubmissionStatusTypeID": 100
}