{
    "IsRecentlyVerified": false,
    "ID": 94968,
    "UUID": "BB6DF2B7-46CA-43DD-B6A8-0F9CC57BDBF8",
    "DataProviderID": 1,
    "OperatorID": 23,
    "OperatorsReference": "36995",
    "UsageTypeID": 4,
    "AddressInfo": {
        "ID": 95314,
        "Title": "Aberdeen Centre",
        "AddressLine1": "4151 Hazelbridge Wy",
        "Town": "Richmond",
        "StateOrProvince": "British Columbia",
        "Postcode": "V6X 4J7",
        "CountryID": 44,
        "Latitude": 49.18379,
        "Longitude": -123.133567,
        "ContactTelephone1": "(604) 270-1234",
        "DistanceUnit": 0
    },
    "Connections": [
        {
            "ID": 134582,
            "ConnectionTypeID": 30,
            "StatusTypeID": 50,
            "LevelID": 2,
            "PowerKW": 16,
            "CurrentTypeID": 20,
            "Quantity": 3
        }
    ],
    "NumberOfPoints": 3,
    "GeneralComments": "3 Tesla Connectors, up to 16kW.Available to the public. Self park.",
    "StatusTypeID": 50,
    "DateLastStatusUpdate": "2017-10-29T06:58:00Z",
    "DataQualityLevel": 1,
    "DateCreated": "2017-10-29T06:58:00Z",
    "SubmissionStatusTypeID": 200
}