{
    "IsRecentlyVerified": false,
    "ID": 180407,
    "UUID": "2C28E2D0-0C69-49D3-9B52-208535A0527A",
    "DataProviderID": 29,
    "DataProvidersReference": "4392",
    "AddressInfo": {
        "ID": 180766,
        "Title": "Schlutuper Straße 16",
        "AddressLine1": "Schlutuper Straße 16",
        "Town": "Lübeck",
        "Postcode": "23566",
        "CountryID": 87,
        "Latitude": 53.864506,
        "Longitude": 10.721079,
        "DistanceUnit": 0
    },
    "Connections": [
        {
            "ID": 283447,
            "ConnectionTypeID": 28,
            "StatusTypeID": 50,
            "LevelID": 2,
            "PowerKW": 22,
            "CurrentTypeID": 20
        },
        {
            "ID": 283448,
            "ConnectionTypeID": 25,
            "StatusTypeID": 50,
            "LevelID": 2,
            "PowerKW": 22,
            "CurrentTypeID": 20
        },
        {
            "ID": 302212,
            "ConnectionTypeID": 28,
            "StatusTypeID": 50,
            "LevelID": 2,
            "PowerKW": 22,
            "CurrentTypeID": 20
        },
        {
            "ID": 302213,
            "ConnectionTypeID": 25,
            "StatusTypeID": 50,
            "LevelID": 2,
            "PowerKW": 22,
            "CurrentTypeID": 20
        }
    ],
    "StatusTypeID": 50,
    "DateLastStatusUpdate": "2021-07-12T02:52:00Z",
    "MetadataValues": [
        {
            "ID": 12701,
            "MetadataFieldID": 4,
            "ItemValue": "Data from the German chargepoint registry provided by Bundesnetzagentur.de under the CC-BY 4.0 license"
        }
    ],
    "DataQualityLevel": 3,
    "DateCreated": "2021-07-08T10:00:00Z",
    "SubmissionStatusTypeID": 100
}