{
    "IsRecentlyVerified": false,
    "ID": 112148,
    "UUID": "B73BCBF1-28DA-4CEF-A7A2-B01D9B674AE5",
    "DataProviderID": 2,
    "DataProvidersReference": "83718",
    "UsageTypeID": 7,
    "AddressInfo": {
        "ID": 112494,
        "Title": "Royal Oak Nissan",
        "AddressLine1": "7690 110th Ave NW",
        "Town": "Calgary",
        "StateOrProvince": "AB",
        "Postcode": "T3R 1R8",
        "CountryID": 44,
        "Latitude": 51.153652,
        "Longitude": -114.19546,
        "ContactTelephone1": "403-241-1040",
        "AccessComments": "24 hours daily\r\nPublic - Call ahead",
        "RelatedURL": "",
        "DistanceUnit": 0
    },
    "Connections": [
        {
            "ID": 157699,
            "ConnectionTypeID": 1,
            "LevelID": 2,
            "Amps": 16,
            "Voltage": 230,
            "PowerKW": 3.7,
            "CurrentTypeID": 10,
            "Quantity": 1
        }
    ],
    "DateLastStatusUpdate": "2020-06-26T03:12:00Z",
    "DataQualityLevel": 3,
    "DateCreated": "2018-10-18T23:37:00Z",
    "SubmissionStatusTypeID": 100
}