{
    "IsRecentlyVerified": false,
    "ID": 31431,
    "UUID": "F46079BA-1BC5-4B28-8B54-078BBEB0272D",
    "DataProviderID": 26,
    "DataProvidersReference": "31320",
    "OperatorID": 78,
    "OperatorsReference": "Essent EM-MT-00000038-01-00001",
    "UsageCost": "0.00 jaarabonnement",
    "AddressInfo": {
        "ID": 31777,
        "Title": "Gdida",
        "AddressLine1": "Gdida",
        "Town": "Naxxar",
        "Postcode": "NXR 1700",
        "CountryID": 140,
        "Latitude": 35.913111,
        "Longitude": 14.443208,
        "RelatedURL": "http://www.essent.nl",
        "DistanceUnit": 0
    },
    "Connections": [
        {
            "ID": 34942,
            "ConnectionTypeID": 25,
            "LevelID": 2,
            "PowerKW": 11,
            "CurrentTypeID": 10
        },
        {
            "ID": 45865,
            "ConnectionTypeID": 25,
            "LevelID": 2,
            "PowerKW": 11,
            "CurrentTypeID": 10
        }
    ],
    "NumberOfPoints": 1,
    "StatusTypeID": 50,
    "DateLastStatusUpdate": "2016-06-04T02:37:00Z",
    "DataQualityLevel": 3,
    "DateCreated": "2015-01-09T06:03:00Z",
    "SubmissionStatusTypeID": 100
}