{
    "IsRecentlyVerified": false,
    "ID": 50525,
    "UUID": "B239830E-D453-418A-BE78-A0A202DBD18F",
    "DataProviderID": 26,
    "DataProvidersReference": "57998",
    "OperatorID": 36,
    "OperatorsReference": "ENO-EVA-A025_2",
    "UsageCost": "0.00 afhankelijk van pas",
    "AddressInfo": {
        "ID": 50871,
        "Title": "Kapelstraat 47-49",
        "AddressLine1": "Kapelstraat 47-49",
        "Town": "Bredene",
        "Postcode": "8450",
        "CountryID": 26,
        "Latitude": 51.24873,
        "Longitude": 2.9640524,
        "ContactTelephone1": "+32 (0)78 48 10 77",
        "ContactEmail": "services@bluecorner.be",
        "RelatedURL": "http://www.bluecorner.be",
        "DistanceUnit": 0
    },
    "Connections": [
        {
            "ID": 62260,
            "ConnectionTypeID": 25,
            "LevelID": 2,
            "PowerKW": 22,
            "CurrentTypeID": 10
        },
        {
            "ID": 62261,
            "ConnectionTypeID": 25,
            "LevelID": 2,
            "PowerKW": 5,
            "CurrentTypeID": 10
        }
    ],
    "NumberOfPoints": 1,
    "StatusTypeID": 50,
    "DateLastStatusUpdate": "2016-06-04T02:38:00Z",
    "DataQualityLevel": 3,
    "DateCreated": "2015-07-22T09:51:00Z",
    "SubmissionStatusTypeID": 100
}