{
    "IsRecentlyVerified": false,
    "ID": 143911,
    "UUID": "D45BA22B-8F6C-4A29-80A6-1CD7071D7ADE",
    "DataProviderID": 2,
    "DataProvidersReference": "96295",
    "OperatorID": 9,
    "UsageTypeID": 1,
    "AddressInfo": {
        "ID": 144263,
        "Title": "City of Falls City",
        "AddressLine1": "299 Mill St.",
        "Town": "Falls City",
        "StateOrProvince": "OR",
        "Postcode": "97344",
        "CountryID": 2,
        "Latitude": 44.865414,
        "Longitude": -123.434127,
        "ContactTelephone1": "888-998-2546",
        "AccessComments": "MON: 24 hours | TUE: 24 hours | WED: 24 hours | THU: 24 hours | FRI: 24 hours | SAT: 24 hours | SUN: 24 hours",
        "RelatedURL": "http://www.blinkcharging.com/",
        "DistanceUnit": 0
    },
    "Connections": [
        {
            "ID": 200335,
            "ConnectionTypeID": 1,
            "LevelID": 2,
            "Amps": 16,
            "Voltage": 230,
            "PowerKW": 3.7,
            "CurrentTypeID": 10,
            "Quantity": 2
        }
    ],
    "StatusTypeID": 50,
    "DateLastStatusUpdate": "2020-06-26T03:08:00Z",
    "DataQualityLevel": 3,
    "DateCreated": "2019-12-24T09:22:00Z",
    "SubmissionStatusTypeID": 100
}