{
    "IsRecentlyVerified": false,
    "ID": 123337,
    "UUID": "EEBC0623-40A2-422A-84B9-74D4C0EAB834",
    "DataProviderID": 2,
    "DataProvidersReference": "74910",
    "OperatorID": 5,
    "UsageTypeID": 1,
    "AddressInfo": {
        "ID": 123683,
        "Title": "HAVANA PHIL'S",
        "AddressLine1": "1628 Battleground Ave",
        "Town": "Greensboro",
        "StateOrProvince": "NC",
        "Postcode": "27408",
        "CountryID": 2,
        "Latitude": 36.090729,
        "Longitude": -79.811402,
        "ContactTelephone1": "888-758-4389",
        "AccessComments": "24 hours daily",
        "RelatedURL": "http://www.chargepoint.com/",
        "DistanceUnit": 0
    },
    "Connections": [
        {
            "ID": 173303,
            "ConnectionTypeID": 1,
            "LevelID": 2,
            "Amps": 16,
            "Voltage": 230,
            "PowerKW": 3.7,
            "CurrentTypeID": 10,
            "Quantity": 1
        }
    ],
    "DateLastStatusUpdate": "2020-06-26T02:58:00Z",
    "DataQualityLevel": 3,
    "DateCreated": "2019-04-06T05:03:00Z",
    "SubmissionStatusTypeID": 100
}