{
    "IsRecentlyVerified": false,
    "ID": 108364,
    "UUID": "BB486B5F-892C-449D-BBF8-7525DABB8712",
    "DataProviderID": 1,
    "OperatorID": 3253,
    "OperatorsReference": "AT*SMA*EAT0301985*001AC",
    "UsageTypeID": 1,
    "UsageCost": "€0,15/min ; Andere Tarife möglich",
    "AddressInfo": {
        "ID": 108710,
        "Title": "Ladestation Riedrich GmbH",
        "AddressLine1": "Wagramerstraße 24",
        "Town": "Grafenwörth",
        "StateOrProvince": "Niederösterreich",
        "Postcode": "3484",
        "CountryID": 19,
        "Latitude": 48.415122,
        "Longitude": 15.773839,
        "DistanceUnit": 0
    },
    "Connections": [
        {
            "ID": 153208,
            "ConnectionTypeID": 25,
            "StatusTypeID": 50,
            "LevelID": 2,
            "Amps": 32,
            "Voltage": 400,
            "PowerKW": 22,
            "CurrentTypeID": 20,
            "Quantity": 1
        }
    ],
    "NumberOfPoints": 1,
    "StatusTypeID": 50,
    "DateLastStatusUpdate": "2018-09-26T05:30:00Z",
    "DataQualityLevel": 1,
    "DateCreated": "2018-09-25T05:40:00Z",
    "SubmissionStatusTypeID": 200
}