{
    "IsRecentlyVerified": false,
    "ID": 88007,
    "UUID": "24654495-19B7-48D6-936B-62AB9A6DF097",
    "DataProviderID": 1,
    "OperatorID": 220,
    "OperatorsReference": "4014",
    "UsageTypeID": 1,
    "UsageCost": "€1.73 + €0.3213/kWh; Andere Tarife möglich",
    "AddressInfo": {
        "ID": 88353,
        "Title": "Moorkamp 3",
        "AddressLine1": "Moorkamp 3",
        "Town": "Eimsbüttel",
        "StateOrProvince": "Hamburg",
        "Postcode": "20357",
        "CountryID": 87,
        "Latitude": 53.56947,
        "Longitude": 9.96661,
        "DistanceUnit": 0
    },
    "Connections": [
        {
            "ID": 124902,
            "ConnectionTypeID": 28,
            "StatusTypeID": 50,
            "LevelID": 2,
            "Amps": 16,
            "Voltage": 230,
            "PowerKW": 3.7,
            "CurrentTypeID": 10,
            "Quantity": 2
        },
        {
            "ID": 124903,
            "ConnectionTypeID": 25,
            "StatusTypeID": 50,
            "LevelID": 2,
            "Amps": 32,
            "Voltage": 400,
            "PowerKW": 22,
            "CurrentTypeID": 20,
            "Quantity": 2
        }
    ],
    "NumberOfPoints": 2,
    "StatusTypeID": 50,
    "DateLastStatusUpdate": "2017-06-11T09:40:00Z",
    "DataQualityLevel": 1,
    "DateCreated": "2017-05-19T05:35:00Z",
    "SubmissionStatusTypeID": 200
}