{
    "IsRecentlyVerified": false,
    "ID": 184601,
    "UUID": "C2BA199E-BE8F-4D38-9AE8-A8D31B859E61",
    "DataProviderID": 29,
    "DataProvidersReference": "2219",
    "OperatorID": 127,
    "AddressInfo": {
        "ID": 184960,
        "Title": "Bundesstraße70 3",
        "AddressLine1": "Bundesstraße70 3",
        "Town": "Lehe",
        "Postcode": "26892",
        "CountryID": 87,
        "Latitude": 53.00122653315,
        "Longitude": 7.344403266907,
        "DistanceUnit": 0
    },
    "Connections": [
        {
            "ID": 293061,
            "ConnectionTypeID": 25,
            "StatusTypeID": 50,
            "LevelID": 2,
            "PowerKW": 22,
            "CurrentTypeID": 20
        },
        {
            "ID": 293062,
            "ConnectionTypeID": 25,
            "StatusTypeID": 50,
            "LevelID": 2,
            "PowerKW": 22,
            "CurrentTypeID": 20
        }
    ],
    "StatusTypeID": 50,
    "DateLastStatusUpdate": "2021-07-09T03:28:00Z",
    "MetadataValues": [
        {
            "ID": 16892,
            "MetadataFieldID": 4,
            "ItemValue": "Data from the German chargepoint registry provided by Bundesnetzagentur.de under the CC-BY 4.0 license"
        }
    ],
    "DataQualityLevel": 3,
    "DateCreated": "2021-07-08T10:05:00Z",
    "SubmissionStatusTypeID": 100
}