{
    "IsRecentlyVerified": false,
    "ID": 60616,
    "UUID": "18155C61-257D-46E0-9EA5-D8016DA34BE5",
    "DataProviderID": 1,
    "OperatorID": 45,
    "UsageTypeID": 5,
    "UsageCost": "0,20€/kWh",
    "AddressInfo": {
        "ID": 60962,
        "Title": "Bahnhof",
        "AddressLine1": "Am Bahnhof",
        "AddressLine2": "Industriepark-West",
        "Town": "Ludwigsfelde",
        "StateOrProvince": "Landkreis Teltow-Fläming",
        "Postcode": "14974",
        "CountryID": 87,
        "Latitude": 52.2987003544176,
        "Longitude": 13.2667109134918,
        "AccessComments": "24/7 verfügbar. Bezahlung des Stroms am Parkscheinautomat mit Münzen, EC- oder Kreditkarte, Parken ist frei.",
        "RelatedURL": "http://www.reiseland-brandenburg.de/reiseziele/flaeming/details/id/15990/theme/a-z.html",
        "DistanceUnit": 0
    },
    "Connections": [
        {
            "ID": 76829,
            "ConnectionTypeID": 25,
            "StatusTypeID": 50,
            "LevelID": 2,
            "Amps": 32,
            "Voltage": 400,
            "PowerKW": 22,
            "CurrentTypeID": 20,
            "Quantity": 1
        },
        {
            "ID": 76830,
            "ConnectionTypeID": 28,
            "StatusTypeID": 50,
            "LevelID": 2,
            "Amps": 16,
            "Voltage": 230,
            "PowerKW": 3.7,
            "CurrentTypeID": 10,
            "Quantity": 1
        }
    ],
    "NumberOfPoints": 1,
    "StatusTypeID": 50,
    "DateLastStatusUpdate": "2016-09-28T12:52:00Z",
    "DataQualityLevel": 1,
    "DateCreated": "2016-02-05T06:46:00Z",
    "SubmissionStatusTypeID": 200
}