{
    "IsRecentlyVerified": false,
    "ID": 140651,
    "UUID": "C3275B52-88C3-4287-9E4F-51273A418F06",
    "DataProviderID": 2,
    "DataProvidersReference": "120912",
    "UsageTypeID": 2,
    "AddressInfo": {
        "ID": 141003,
        "Title": "Vocera Communications",
        "AddressLine1": "525 Race St",
        "Town": "San Jose",
        "StateOrProvince": "CA",
        "Postcode": "95126",
        "CountryID": 2,
        "Latitude": 37.318731,
        "Longitude": -121.911781,
        "ContactTelephone1": "",
        "AccessComments": "",
        "RelatedURL": "",
        "DistanceUnit": 0
    },
    "Connections": [
        {
            "ID": 196342,
            "ConnectionTypeID": 11,
            "LevelID": 1,
            "Amps": 16,
            "Voltage": 120,
            "PowerKW": 1.9,
            "CurrentTypeID": 10,
            "Quantity": 1
        },
        {
            "ID": 229235,
            "ConnectionTypeID": 1,
            "LevelID": 2,
            "Amps": 16,
            "Voltage": 230,
            "PowerKW": 3.7,
            "CurrentTypeID": 10,
            "Quantity": 6
        }
    ],
    "StatusTypeID": 50,
    "DateLastStatusUpdate": "2020-06-26T02:59:00Z",
    "DataQualityLevel": 3,
    "DateCreated": "2019-12-24T09:13:00Z",
    "SubmissionStatusTypeID": 100
}