{
    "IsRecentlyVerified": false,
    "ID": 102056,
    "UUID": "AA86534B-0A80-4AEB-87FD-AB23E18015AB",
    "DataProviderID": 1,
    "OperatorID": 23,
    "OperatorsReference": "42142",
    "UsageTypeID": 4,
    "AddressInfo": {
        "ID": 102402,
        "Title": "Aloft Tempe",
        "AddressLine1": "951 E Playa del Norte DR",
        "Town": "Tempe",
        "StateOrProvince": "Arizona",
        "Postcode": "85281",
        "CountryID": 2,
        "Latitude": 33.43468,
        "Longitude": -111.924376,
        "ContactTelephone1": "(480) 621-3300",
        "DistanceUnit": 0
    },
    "Connections": [
        {
            "ID": 144039,
            "ConnectionTypeID": 30,
            "StatusTypeID": 50,
            "LevelID": 2,
            "PowerKW": 13,
            "CurrentTypeID": 20,
            "Quantity": 3
        }
    ],
    "NumberOfPoints": 3,
    "GeneralComments": "3 Tesla Connectors, up to 13kW.Available for customers. Please see front desk.",
    "StatusTypeID": 50,
    "DateLastStatusUpdate": "2018-04-16T05:04:00Z",
    "DataQualityLevel": 1,
    "DateCreated": "2018-04-16T05:04:00Z",
    "SubmissionStatusTypeID": 200
}