{
    "UserComments": [
        {
            "ID": 10192,
            "ChargePointID": 64595,
            "CommentTypeID": 10,
            "UserName": "Bss57",
            "Comment": "Max stay 90 minutes or it will be expensive",
            "DateCreated": "2016-04-15T21:46:02.507Z",
            "User": {
                "ID": 6295,
                "Username": "Bss57"
            },
            "CheckinStatusTypeID": 10
        },
        {
            "ID": 9934,
            "ChargePointID": 64595,
            "CommentTypeID": 10,
            "UserName": "Bss57",
            "Comment": "It's free to use",
            "Rating": 5,
            "DateCreated": "2016-03-16T08:24:27.407Z",
            "User": {
                "ID": 6295,
                "Username": "Bss57"
            },
            "CheckinStatusTypeID": 10
        }
    ],
    "MediaItems": [
        {
            "ID": 6245,
            "ChargePointID": 64595,
            "ItemURL": "https://s3-ap-southeast-2.amazonaws.com/openchargemap/images/GB/OCM64595/OCM-64595.orig.2016041521493494.jpg",
            "ItemThumbnailURL": "https://s3-ap-southeast-2.amazonaws.com/openchargemap/images/GB/OCM64595/OCM-64595.thmb.2016041521493494.jpg",
            "Comment": "",
            "IsEnabled": true,
            "IsVideo": false,
            "IsFeaturedItem": false,
            "IsExternalResource": false,
            "User": {
                "ID": 6295,
                "Username": "Bss57"
            },
            "DateCreated": "2016-04-15T21:50:00Z"
        }
    ],
    "IsRecentlyVerified": false,
    "ID": 64595,
    "UUID": "10EAC661-8748-4C69-A575-45D0B4AABE48",
    "DataProviderID": 1,
    "OperatorID": 32,
    "OperatorsReference": "3654",
    "UsageTypeID": 4,
    "UsageCost": "Inclusive; for Polar Plus subscription members only",
    "AddressInfo": {
        "ID": 64941,
        "Title": "Asda Stonecot",
        "AddressLine1": "near 463 Sutton Common Road",
        "Town": "Sutton",
        "StateOrProvince": "London",
        "Postcode": "SM3 9HB",
        "CountryID": 1,
        "Latitude": 51.3853072,
        "Longitude": -0.2113094,
        "RelatedURL": "http://storelocator.asda.com/store/stonecot",
        "DistanceUnit": 0
    },
    "Connections": [
        {
            "ID": 83017,
            "ConnectionTypeID": 25,
            "StatusTypeID": 50,
            "LevelID": 2,
            "Amps": 32,
            "Voltage": 230,
            "PowerKW": 7,
            "CurrentTypeID": 10,
            "Quantity": 2
        }
    ],
    "NumberOfPoints": 2,
    "StatusTypeID": 50,
    "DateLastStatusUpdate": "2019-03-07T06:23:00Z",
    "DataQualityLevel": 1,
    "DateCreated": "2016-03-12T17:42:00Z",
    "SubmissionStatusTypeID": 200
}