{
    "IsRecentlyVerified": false,
    "ID": 102661,
    "UUID": "A7C6E37D-DE75-43E0-875B-7DEEB540A595",
    "DataProviderID": 2,
    "DataProvidersReference": "94542",
    "UsageTypeID": 1,
    "AddressInfo": {
        "ID": 103007,
        "Title": "Lewis Hall",
        "AddressLine1": "13384 Laundry Rd",
        "Town": "Montpelier Station",
        "StateOrProvince": "VA",
        "Postcode": "22957",
        "CountryID": 2,
        "Latitude": 38.218992,
        "Longitude": -78.166102,
        "ContactTelephone1": "540-672-2728",
        "AccessComments": "9am-5pm daily",
        "RelatedURL": "",
        "DistanceUnit": 0
    },
    "Connections": [
        {
            "ID": 144769,
            "ConnectionTypeID": 1,
            "LevelID": 2,
            "Amps": 16,
            "Voltage": 230,
            "PowerKW": 3,
            "CurrentTypeID": 10,
            "Quantity": 6
        }
    ],
    "DateLastStatusUpdate": "2019-04-06T04:02:00Z",
    "DataQualityLevel": 3,
    "DateCreated": "2018-04-21T04:13:00Z",
    "SubmissionStatusTypeID": 100
}