{
    "IsRecentlyVerified": false,
    "ID": 103349,
    "UUID": "058D283F-F45E-4C6C-941E-7711F9A91A20",
    "DataProviderID": 1,
    "OperatorID": 3315,
    "OperatorsReference": "50142",
    "UsageTypeID": 4,
    "UsageCost": "Free",
    "AddressInfo": {
        "ID": 103695,
        "Title": "Paradykes Primary School, Loanhead",
        "AddressLine1": "Paradykes Primary School",
        "Town": "Loanhead Community Hub",
        "StateOrProvince": "Loanhead",
        "Postcode": "EH20 9LA",
        "CountryID": 1,
        "Latitude": 55.87950927351789,
        "Longitude": -3.1589315104674824,
        "DistanceUnit": 0
    },
    "Connections": [
        {
            "ID": 146000,
            "ConnectionTypeID": 25,
            "StatusTypeID": 50,
            "LevelID": 2,
            "Amps": 32,
            "Voltage": 230,
            "PowerKW": 7,
            "CurrentTypeID": 10,
            "Quantity": 2
        }
    ],
    "NumberOfPoints": 2,
    "StatusTypeID": 50,
    "DateLastStatusUpdate": "2018-04-28T05:16:00Z",
    "DataQualityLevel": 1,
    "DateCreated": "2018-04-28T05:16:00Z",
    "SubmissionStatusTypeID": 200
}