{
    "IsRecentlyVerified": false,
    "ID": 124818,
    "UUID": "CE36AE10-F29E-4D36-893A-512A3B34DDE6",
    "DataProviderID": 2,
    "DataProvidersReference": "100410",
    "OperatorID": 5,
    "UsageTypeID": 1,
    "AddressInfo": {
        "ID": 125164,
        "Title": "ESTES PARKING",
        "AddressLine1": "335 W Elkhorn Ave",
        "Town": "Estes Park",
        "StateOrProvince": "CO",
        "Postcode": "80517",
        "CountryID": 2,
        "Latitude": 40.3779575,
        "Longitude": -105.5196856,
        "ContactTelephone1": "888-758-4389",
        "AccessComments": "24 hours daily",
        "RelatedURL": "http://www.chargepoint.com/",
        "DistanceUnit": 0
    },
    "Connections": [
        {
            "ID": 174969,
            "ConnectionTypeID": 1,
            "LevelID": 2,
            "Amps": 16,
            "Voltage": 230,
            "PowerKW": 3.7,
            "CurrentTypeID": 10,
            "Quantity": 2
        }
    ],
    "DateLastStatusUpdate": "2020-06-26T03:03:00Z",
    "DataQualityLevel": 3,
    "DateCreated": "2019-04-06T05:04:00Z",
    "SubmissionStatusTypeID": 100
}