{
    "IsRecentlyVerified": false,
    "ID": 182124,
    "UUID": "3F7B9CBC-8178-4085-8C84-163999C34EA9",
    "DataProviderID": 29,
    "DataProvidersReference": "4280",
    "OperatorID": 45,
    "AddressInfo": {
        "ID": 182483,
        "Title": "Itzelstr. 34",
        "AddressLine1": "Itzelstr. 34",
        "Town": "Bad Wildungen",
        "Postcode": "34537",
        "CountryID": 87,
        "Latitude": 51.119439,
        "Longitude": 9.132768,
        "DistanceUnit": 0
    },
    "Connections": [
        {
            "ID": 287478,
            "ConnectionTypeID": 25,
            "StatusTypeID": 50,
            "LevelID": 2,
            "PowerKW": 21,
            "CurrentTypeID": 20
        },
        {
            "ID": 287479,
            "ConnectionTypeID": 25,
            "StatusTypeID": 50,
            "LevelID": 2,
            "PowerKW": 21,
            "CurrentTypeID": 20
        }
    ],
    "StatusTypeID": 50,
    "DateLastStatusUpdate": "2021-07-09T03:22:00Z",
    "MetadataValues": [
        {
            "ID": 14418,
            "MetadataFieldID": 4,
            "ItemValue": "Data from the German chargepoint registry provided by Bundesnetzagentur.de under the CC-BY 4.0 license"
        }
    ],
    "DataQualityLevel": 3,
    "DateCreated": "2021-07-08T10:02:00Z",
    "SubmissionStatusTypeID": 100
}