{
    "IsRecentlyVerified": false,
    "ID": 99952,
    "UUID": "BBD8D286-A7F4-4052-A937-515F6FAB9BBA",
    "DataProviderID": 1,
    "OperatorID": 23,
    "OperatorsReference": "40573",
    "UsageTypeID": 4,
    "AddressInfo": {
        "ID": 100298,
        "Title": "Los Gatos Garden Inn",
        "AddressLine1": "46 E Main St",
        "Town": "Los Gatos",
        "StateOrProvince": "California",
        "Postcode": "95030",
        "CountryID": 2,
        "Latitude": 37.220872,
        "Longitude": -121.980319,
        "ContactTelephone1": "(408) 354-6446",
        "DistanceUnit": 0
    },
    "Connections": [
        {
            "ID": 141204,
            "ConnectionTypeID": 30,
            "StatusTypeID": 50,
            "LevelID": 2,
            "PowerKW": 16,
            "CurrentTypeID": 20,
            "Quantity": 2
        }
    ],
    "NumberOfPoints": 2,
    "GeneralComments": "2 Tesla Connectors, up to 16kW.Available for customers. Please see front desk.",
    "StatusTypeID": 50,
    "DateLastStatusUpdate": "2018-02-09T06:44:00Z",
    "DataQualityLevel": 1,
    "DateCreated": "2018-02-09T06:44:00Z",
    "SubmissionStatusTypeID": 200
}