{
    "IsRecentlyVerified": false,
    "ID": 113174,
    "UUID": "1674117D-220E-486D-B2C0-6241B14382E1",
    "DataProviderID": 2,
    "DataProvidersReference": "104279",
    "UsageTypeID": 7,
    "AddressInfo": {
        "ID": 113520,
        "Title": "Feldman Chevrolet - New Hudson",
        "AddressLine1": "30400 Lyon Center Dr",
        "Town": "New Hudson",
        "StateOrProvince": "MI",
        "Postcode": "48165",
        "CountryID": 2,
        "Latitude": 42.515722,
        "Longitude": -83.608279,
        "ContactTelephone1": "248-939-5399",
        "AccessComments": "Dealership business hours\r\nPublic - Call ahead",
        "RelatedURL": "",
        "DistanceUnit": 0
    },
    "Connections": [
        {
            "ID": 159357,
            "ConnectionTypeID": 32,
            "LevelID": 3,
            "Amps": 100,
            "Voltage": 400,
            "PowerKW": 40,
            "CurrentTypeID": 30,
            "Quantity": 1
        }
    ],
    "DateLastStatusUpdate": "2020-06-26T03:06:00Z",
    "DataQualityLevel": 3,
    "DateCreated": "2018-11-28T02:04:00Z",
    "SubmissionStatusTypeID": 100
}