{
    "IsRecentlyVerified": false,
    "ID": 105148,
    "UUID": "461DD321-663C-4A02-B549-AFBB2EE4642C",
    "DataProviderID": 1,
    "OperatorID": 142,
    "OperatorsReference": "3345202",
    "UsageTypeID": 4,
    "AddressInfo": {
        "ID": 105494,
        "Title": "Unicredit Bank Austria Ag Hirschstetten",
        "AddressLine1": "Quadenstraße 35",
        "Town": "Wien",
        "Postcode": "1220",
        "CountryID": 19,
        "Latitude": 48.2375897,
        "Longitude": 16.4785704,
        "DistanceUnit": 0
    },
    "Connections": [
        {
            "ID": 148254,
            "ConnectionTypeID": 25,
            "StatusTypeID": 50,
            "LevelID": 2,
            "Amps": 16,
            "Voltage": 400,
            "PowerKW": 11,
            "CurrentTypeID": 20,
            "Quantity": 2
        }
    ],
    "NumberOfPoints": 2,
    "GeneralComments": "Wien Energie Tanke-Karte, WienMobil-Karte",
    "StatusTypeID": 50,
    "DateLastStatusUpdate": "2018-05-31T14:46:00Z",
    "DataQualityLevel": 1,
    "DateCreated": "2018-05-31T14:46:00Z",
    "SubmissionStatusTypeID": 200
}