{
    "IsRecentlyVerified": false,
    "ID": 97848,
    "UUID": "5ED8F73A-5268-4120-9020-364497703007",
    "DataProviderID": 1,
    "OperatorID": 23,
    "OperatorsReference": "39290",
    "UsageTypeID": 4,
    "AddressInfo": {
        "ID": 98194,
        "Title": "Best Western Edgewater",
        "AddressLine1": "56 Bridge St",
        "Town": "Sandpoint",
        "StateOrProvince": "Idaho",
        "Postcode": "83864",
        "CountryID": 2,
        "Latitude": 48.274961,
        "Longitude": -116.544463,
        "ContactTelephone1": "(208) 263-3194",
        "DistanceUnit": 0
    },
    "Connections": [
        {
            "ID": 138756,
            "ConnectionTypeID": 30,
            "StatusTypeID": 50,
            "LevelID": 2,
            "PowerKW": 10,
            "CurrentTypeID": 10,
            "Quantity": 2
        }
    ],
    "NumberOfPoints": 2,
    "GeneralComments": "2 Tesla Connectors, up to 10kW.Available for customers. Please see front desk.",
    "StatusTypeID": 50,
    "DateLastStatusUpdate": "2018-01-21T16:48:00Z",
    "DataQualityLevel": 1,
    "DateCreated": "2018-01-21T16:48:00Z",
    "SubmissionStatusTypeID": 200
}