{
    "IsRecentlyVerified": false,
    "ID": 133980,
    "UUID": "817BB3CA-A1B1-4758-B428-872339BF7B8B",
    "DataProviderID": 1,
    "OperatorID": 23,
    "OperatorsReference": "52277",
    "UsageTypeID": 4,
    "AddressInfo": {
        "ID": 134326,
        "Title": "Greenmount Bowl",
        "AddressLine1": "1625 N Main St",
        "Town": "Hampstead",
        "StateOrProvince": "Maryland",
        "Postcode": "21074",
        "CountryID": 2,
        "Latitude": 39.62023,
        "Longitude": -76.856198,
        "ContactTelephone1": "(410) 374-6211",
        "DistanceUnit": 0
    },
    "Connections": [
        {
            "ID": 187475,
            "ConnectionTypeID": 30,
            "StatusTypeID": 50,
            "LevelID": 2,
            "PowerKW": 16,
            "CurrentTypeID": 20,
            "Quantity": 2
        }
    ],
    "NumberOfPoints": 2,
    "GeneralComments": "2 Tesla Connectors, up to 16kW.Available to the public. Self park.",
    "StatusTypeID": 50,
    "DateLastStatusUpdate": "2019-10-31T06:38:00Z",
    "DataQualityLevel": 1,
    "DateCreated": "2019-10-31T06:38:00Z",
    "SubmissionStatusTypeID": 200
}