{
    "IsRecentlyVerified": false,
    "ID": 146331,
    "UUID": "E154DCAC-55EB-41D1-AF1F-26AA9215554C",
    "DataProviderID": 1,
    "OperatorID": 3384,
    "UsageTypeID": 1,
    "AddressInfo": {
        "ID": 146683,
        "Title": "Salona Mall",
        "AddressLine1": "Antuna Gustava Matoša 10",
        "AddressLine2": "Smiljanovac",
        "Town": "Grad Solin",
        "StateOrProvince": "Grad Solin",
        "Postcode": "21210",
        "CountryID": 60,
        "Latitude": 43.53000384542099,
        "Longitude": 16.492323249525384,
        "ContactTelephone1": "+385 08000005",
        "AccessComments": "https://www.plugshare.com/location/222113",
        "DistanceUnit": 0
    },
    "Connections": [
        {
            "ID": 203417,
            "ConnectionTypeID": 33,
            "StatusTypeID": 50,
            "LevelID": 3,
            "PowerKW": 50,
            "CurrentTypeID": 30,
            "Quantity": 1
        },
        {
            "ID": 203418,
            "ConnectionTypeID": 2,
            "StatusTypeID": 50,
            "LevelID": 3,
            "PowerKW": 50,
            "CurrentTypeID": 30,
            "Quantity": 1
        }
    ],
    "NumberOfPoints": 1,
    "GeneralComments": "1x CCS+Chademo 50kW, Type2\r\noperated by Hrvatski Telekom\r\n24/7, Grocery, Shopping, WiFi, Park, EV Parking, Restrooms, Dining\r\n",
    "StatusTypeID": 50,
    "DateLastStatusUpdate": "2020-01-09T16:06:00Z",
    "DataQualityLevel": 1,
    "DateCreated": "2020-01-07T07:08:00Z",
    "SubmissionStatusTypeID": 200
}