{
    "IsRecentlyVerified": false,
    "ID": 177619,
    "UUID": "58455896-EADC-441F-A758-ED47A47C4B31",
    "DataProviderID": 29,
    "DataProvidersReference": "20231",
    "OperatorID": 45,
    "AddressInfo": {
        "ID": 177978,
        "Title": "Wallbergstraße 20",
        "AddressLine1": "Wallbergstraße 20",
        "Town": "Mering",
        "Postcode": "86415",
        "CountryID": 87,
        "Latitude": 48.254594,
        "Longitude": 10.986705,
        "DistanceUnit": 0
    },
    "Connections": [
        {
            "ID": 276973,
            "ConnectionTypeID": 25,
            "StatusTypeID": 50,
            "LevelID": 2,
            "PowerKW": 22,
            "CurrentTypeID": 20
        },
        {
            "ID": 276974,
            "ConnectionTypeID": 25,
            "StatusTypeID": 50,
            "LevelID": 2,
            "PowerKW": 22,
            "CurrentTypeID": 20
        }
    ],
    "StatusTypeID": 0,
    "DateLastStatusUpdate": "2021-07-09T03:12:00Z",
    "MetadataValues": [
        {
            "ID": 9913,
            "MetadataFieldID": 4,
            "ItemValue": "Data from the German chargepoint registry provided by Bundesnetzagentur.de under the CC-BY 4.0 license"
        }
    ],
    "DataQualityLevel": 3,
    "DateCreated": "2021-07-08T09:49:00Z",
    "SubmissionStatusTypeID": 100
}