{
    "IsRecentlyVerified": false,
    "ID": 122218,
    "UUID": "99CDE750-355B-4746-A04D-6F147567F74A",
    "DataProviderID": 2,
    "DataProvidersReference": "53676",
    "UsageTypeID": 1,
    "AddressInfo": {
        "ID": 122564,
        "Title": "FIAT of Ontario",
        "AddressLine1": "1201 Auto Center Dr",
        "Town": "Ontario",
        "StateOrProvince": "CA",
        "Postcode": "91761",
        "CountryID": 2,
        "Latitude": 34.051442,
        "Longitude": -117.543902,
        "ContactTelephone1": "909-212-7300",
        "AccessComments": "Dealership business hours",
        "RelatedURL": "",
        "DistanceUnit": 0
    },
    "Connections": [
        {
            "ID": 172090,
            "ConnectionTypeID": 1,
            "LevelID": 2,
            "Amps": 16,
            "Voltage": 230,
            "PowerKW": 3.7,
            "CurrentTypeID": 10,
            "Quantity": 3
        }
    ],
    "DateLastStatusUpdate": "2020-06-26T02:56:00Z",
    "DataQualityLevel": 3,
    "DateCreated": "2019-04-06T05:02:00Z",
    "SubmissionStatusTypeID": 100
}