{
    "IsRecentlyVerified": false,
    "ID": 170299,
    "UUID": "D04FCB3F-29B2-41F1-951E-D9B932B47C67",
    "DataProviderID": 1,
    "OperatorID": 38,
    "UsageTypeID": 1,
    "UsageCost": "free",
    "AddressInfo": {
        "ID": 170658,
        "Title": "LIDL Cologno Monzese",
        "AddressLine1": "Via per Imbersago",
        "Town": "Cologno Monzese",
        "StateOrProvince": "MI",
        "Postcode": "20093",
        "CountryID": 112,
        "Latitude": 45.540616408526404,
        "Longitude": 9.288166999693544,
        "RelatedURL": "https://www.lidl.it",
        "DistanceUnit": 0
    },
    "Connections": [
        {
            "ID": 259728,
            "ConnectionTypeID": 25,
            "StatusTypeID": 150,
            "LevelID": 2,
            "Amps": 32,
            "Voltage": 400,
            "PowerKW": 22,
            "CurrentTypeID": 20,
            "Quantity": 2
        }
    ],
    "NumberOfPoints": 2,
    "StatusTypeID": 150,
    "DateLastStatusUpdate": "2020-11-23T11:50:00Z",
    "DataQualityLevel": 1,
    "DateCreated": "2020-11-23T11:50:00Z",
    "SubmissionStatusTypeID": 200
}