{
    "IsRecentlyVerified": false,
    "ID": 66321,
    "UUID": "2DE08BD8-8AF6-4FD3-9BC7-8E7755309CDF",
    "DataProviderID": 1,
    "OperatorID": 45,
    "UsageTypeID": 1,
    "AddressInfo": {
        "ID": 66667,
        "Title": "E-Bike Station Cafe Feldmann",
        "AddressLine1": "Landgrafenstraße 5",
        "Town": "Bad Sooden-Allendorf",
        "StateOrProvince": "Werra-Meißner-Kreis",
        "Postcode": "37242",
        "CountryID": 87,
        "Latitude": 51.2683916,
        "Longitude": 9.965777099999968,
        "ContactTelephone1": "+49 5652 917878",
        "ContactEmail": "webmaster@cafe-feldmann.de",
        "RelatedURL": "http://www.nordhessen.de/de/e-bikes",
        "DistanceUnit": 0
    },
    "Connections": [
        {
            "ID": 91690,
            "ConnectionTypeID": 28,
            "StatusTypeID": 50,
            "LevelID": 1,
            "Amps": 10,
            "Voltage": 230,
            "PowerKW": 2.3,
            "CurrentTypeID": 10,
            "Quantity": 1
        }
    ],
    "NumberOfPoints": 1,
    "StatusTypeID": 50,
    "DateLastStatusUpdate": "2016-05-18T09:43:00Z",
    "DataQualityLevel": 1,
    "DateCreated": "2016-05-18T09:43:00Z",
    "SubmissionStatusTypeID": 200
}