{
    "IsRecentlyVerified": false,
    "ID": 89037,
    "UUID": "D37BF33D-0D47-491A-A04B-2D672FA3E58B",
    "DataProviderID": 1,
    "OperatorID": 3,
    "OperatorsReference": "PG-81102",
    "UsageTypeID": 4,
    "UsageCost": "1",
    "AddressInfo": {
        "ID": 89383,
        "Title": "Roundswell-Hyundai",
        "AddressLine1": "Lauder Lane",
        "Town": "Roundswell Business Park",
        "StateOrProvince": "Devon",
        "Postcode": "EX31 3TA",
        "CountryID": 1,
        "Latitude": 51.064878,
        "Longitude": -4.083926,
        "DistanceUnit": 0
    },
    "Connections": [
        {
            "ID": 126362,
            "ConnectionTypeID": 25,
            "StatusTypeID": 50,
            "LevelID": 2,
            "Amps": 32,
            "Voltage": 230,
            "PowerKW": 7,
            "CurrentTypeID": 10,
            "Quantity": 2
        }
    ],
    "NumberOfPoints": 3,
    "GeneralComments": "This is an open charge unit installed at the Roundswell - Hyundai dealership in Lauder Lane, Roundswell Business Park, Barnstaple, Devon",
    "StatusTypeID": 50,
    "DateLastStatusUpdate": "2020-01-11T21:38:00Z",
    "DataQualityLevel": 1,
    "DateCreated": "2017-06-21T05:36:00Z",
    "SubmissionStatusTypeID": 200
}