{
    "IsRecentlyVerified": false,
    "ID": 179883,
    "UUID": "B84B5884-F2AD-4ADA-9977-E22ABF62532B",
    "DataProviderID": 29,
    "DataProvidersReference": "1268",
    "AddressInfo": {
        "ID": 180242,
        "Title": "Goethestr. 7",
        "AddressLine1": "Goethestr. 7",
        "Town": "Mainz",
        "Postcode": "55118",
        "CountryID": 87,
        "Latitude": 50.009616,
        "Longitude": 8.252423,
        "DistanceUnit": 0
    },
    "Connections": [
        {
            "ID": 282306,
            "ConnectionTypeID": 25,
            "StatusTypeID": 50,
            "LevelID": 2,
            "PowerKW": 22,
            "CurrentTypeID": 20
        },
        {
            "ID": 282307,
            "ConnectionTypeID": 25,
            "StatusTypeID": 50,
            "LevelID": 2,
            "PowerKW": 22,
            "CurrentTypeID": 20
        }
    ],
    "StatusTypeID": 50,
    "DateLastStatusUpdate": "2021-07-12T02:44:00Z",
    "MetadataValues": [
        {
            "ID": 12177,
            "MetadataFieldID": 4,
            "ItemValue": "Data from the German chargepoint registry provided by Bundesnetzagentur.de under the CC-BY 4.0 license"
        }
    ],
    "DataQualityLevel": 3,
    "DateCreated": "2021-07-08T10:00:00Z",
    "SubmissionStatusTypeID": 100
}