{
    "IsRecentlyVerified": false,
    "ID": 133070,
    "UUID": "01EDBBA3-69D1-4592-93E9-D999CFFCBA1F",
    "DataProviderID": 1,
    "OperatorID": 23,
    "OperatorsReference": "52062",
    "UsageTypeID": 4,
    "AddressInfo": {
        "ID": 133416,
        "Title": "Zájezdní Hostinec U Jiskru",
        "AddressLine1": "Kbelnice 23",
        "Town": "Prestovice",
        "Postcode": "38601",
        "CountryID": 64,
        "Latitude": 50.069805,
        "Longitude": 14.461984,
        "ContactTelephone1": "+42 3863 21277",
        "DistanceUnit": 0
    },
    "Connections": [
        {
            "ID": 186351,
            "ConnectionTypeID": 30,
            "StatusTypeID": 50,
            "LevelID": 2,
            "PowerKW": 22,
            "CurrentTypeID": 20,
            "Quantity": 1
        }
    ],
    "NumberOfPoints": 1,
    "GeneralComments": "1 Tesla Connector, up to 22kW.Available to the public. Self park.",
    "StatusTypeID": 50,
    "DateLastStatusUpdate": "2019-10-12T05:50:00Z",
    "DataQualityLevel": 1,
    "DateCreated": "2019-10-12T05:50:00Z",
    "SubmissionStatusTypeID": 200
}