{
    "IsRecentlyVerified": false,
    "ID": 27285,
    "UUID": "28ECF5CF-61F0-4360-AAA7-A412D690CFB4",
    "DataProviderID": 2,
    "DataProvidersReference": "62388",
    "OperatorID": 5,
    "UsageTypeID": 1,
    "AddressInfo": {
        "ID": 27631,
        "Title": "VIEWPOINTE",
        "AddressLine1": "8275 S Eastern Ave",
        "Town": "Las Vegas",
        "StateOrProvince": "NV",
        "Postcode": "89123",
        "CountryID": 2,
        "Latitude": 36.0390968,
        "Longitude": -115.1191359,
        "ContactTelephone1": "888-758-4389",
        "AccessComments": "24 hours daily",
        "RelatedURL": "http://www.chargepoint.com/",
        "DistanceUnit": 0
    },
    "Connections": [
        {
            "ID": 29886,
            "ConnectionTypeID": 1,
            "LevelID": 2,
            "Amps": 16,
            "Voltage": 230,
            "PowerKW": 3,
            "CurrentTypeID": 10,
            "Quantity": 2
        }
    ],
    "DateLastStatusUpdate": "2019-04-06T04:02:00Z",
    "DataQualityLevel": 3,
    "DateCreated": "2014-11-28T03:37:00Z",
    "SubmissionStatusTypeID": 100
}