{
    "IsRecentlyVerified": false,
    "ID": 99610,
    "UUID": "8C867D31-8096-4ACA-BA28-79B4EB102898",
    "DataProviderID": 1,
    "OperatorID": 2244,
    "UsageTypeID": 4,
    "AddressInfo": {
        "ID": 99956,
        "Title": "Ubitricity Campden Street",
        "AddressLine1": "2 Campden Street",
        "Town": "London",
        "StateOrProvince": "England",
        "Postcode": "W8 7EP",
        "CountryID": 1,
        "Latitude": 51.507013,
        "Longitude": -0.194977,
        "RelatedURL": "https://www.rbkc.gov.uk/parking-transport-and-streets/parking/visitor-parking/electric-vehicles",
        "DistanceUnit": 0
    },
    "Connections": [
        {
            "ID": 140753,
            "ConnectionTypeID": 25,
            "StatusTypeID": 50,
            "LevelID": 2,
            "Amps": 16,
            "Voltage": 230,
            "PowerKW": 3.6,
            "CurrentTypeID": 10,
            "Quantity": 1
        }
    ],
    "NumberOfPoints": 1,
    "GeneralComments": "Lamp post charger. Ubitricity dongle needed.",
    "StatusTypeID": 50,
    "DateLastStatusUpdate": "2018-01-31T13:37:00Z",
    "DataQualityLevel": 1,
    "DateCreated": "2018-01-31T13:37:00Z",
    "SubmissionStatusTypeID": 200
}