{
    "IsRecentlyVerified": false,
    "ID": 84178,
    "UUID": "F287EF62-54CE-41D6-8066-1D479A2139CE",
    "DataProviderID": 1,
    "OperatorID": 23,
    "OperatorsReference": "24620",
    "UsageTypeID": 4,
    "AddressInfo": {
        "ID": 84524,
        "Title": "Ocean View Lodge",
        "AddressLine1": "1141 N Main St",
        "Town": "Fort Bragg",
        "StateOrProvince": "California",
        "Postcode": "95437",
        "CountryID": 2,
        "Latitude": 39.462683,
        "Longitude": -123.806348,
        "ContactTelephone1": "(707) 964-1951",
        "DistanceUnit": 0
    },
    "Connections": [
        {
            "ID": 119579,
            "ConnectionTypeID": 30,
            "StatusTypeID": 50,
            "LevelID": 2,
            "PowerKW": 16,
            "CurrentTypeID": 20,
            "Quantity": 2
        }
    ],
    "NumberOfPoints": 2,
    "GeneralComments": "2 Tesla Connectors, up to 16kW.Available for customers. Please call ahead.",
    "StatusTypeID": 50,
    "DateLastStatusUpdate": "2017-02-16T17:08:00Z",
    "DataQualityLevel": 1,
    "DateCreated": "2017-02-16T17:08:00Z",
    "SubmissionStatusTypeID": 200
}