{
    "IsRecentlyVerified": false,
    "ID": 185180,
    "UUID": "4445CA31-FA3E-47BB-B3DD-C5C474D26C68",
    "DataProviderID": 29,
    "DataProvidersReference": "12422,308",
    "AddressInfo": {
        "ID": 185539,
        "Title": "Vogteiweg",
        "AddressLine1": "Vogteiweg",
        "Town": "Ahrensburg",
        "Postcode": "22926",
        "CountryID": 87,
        "Latitude": 53.68596,
        "Longitude": 10.239426,
        "DistanceUnit": 0
    },
    "Connections": [
        {
            "ID": 294317,
            "ConnectionTypeID": 25,
            "StatusTypeID": 50,
            "LevelID": 2,
            "PowerKW": 22,
            "CurrentTypeID": 20
        },
        {
            "ID": 294318,
            "ConnectionTypeID": 25,
            "StatusTypeID": 50,
            "LevelID": 2,
            "PowerKW": 22,
            "CurrentTypeID": 20
        },
        {
            "ID": 294319,
            "ConnectionTypeID": 25,
            "StatusTypeID": 50,
            "LevelID": 2,
            "PowerKW": 22,
            "CurrentTypeID": 20
        },
        {
            "ID": 294320,
            "ConnectionTypeID": 25,
            "StatusTypeID": 50,
            "LevelID": 2,
            "PowerKW": 22,
            "CurrentTypeID": 20
        }
    ],
    "StatusTypeID": 50,
    "DateLastStatusUpdate": "2021-07-09T03:30:00Z",
    "MetadataValues": [
        {
            "ID": 17471,
            "MetadataFieldID": 4,
            "ItemValue": "Data from the German chargepoint registry provided by Bundesnetzagentur.de under the CC-BY 4.0 license"
        }
    ],
    "DataQualityLevel": 3,
    "DateCreated": "2021-07-08T10:06:00Z",
    "SubmissionStatusTypeID": 100
}