{
    "IsRecentlyVerified": false,
    "ID": 61288,
    "UUID": "531BE77E-9EA3-4261-AAE4-4DBAA861F2D0",
    "DataProviderID": 1,
    "OperatorID": 214,
    "UsageTypeID": 4,
    "AddressInfo": {
        "ID": 61634,
        "Title": "Dahlmannstraße",
        "AddressLine1": "Dahlmannstraße 1A",
        "AddressLine2": "Charlottenburg",
        "Town": "Berlin",
        "StateOrProvince": "Berlin",
        "Postcode": "10629",
        "CountryID": 87,
        "Latitude": 52.503325,
        "Longitude": 13.303533300000026,
        "AccessComments": "24/7 nutzbar, u.a. auch mit The New Motion,  ACE-Ladekarte oder Lichtblick Fahrstrom",
        "DistanceUnit": 0
    },
    "Connections": [
        {
            "ID": 78043,
            "ConnectionTypeID": 25,
            "StatusTypeID": 50,
            "LevelID": 2,
            "Amps": 16,
            "Voltage": 400,
            "PowerKW": 11,
            "CurrentTypeID": 20,
            "Quantity": 2
        }
    ],
    "NumberOfPoints": 2,
    "StatusTypeID": 50,
    "DateLastStatusUpdate": "2016-02-22T13:38:00Z",
    "DataQualityLevel": 1,
    "DateCreated": "2016-02-22T13:38:00Z",
    "SubmissionStatusTypeID": 200
}