{
    "IsRecentlyVerified": false,
    "ID": 27278,
    "UUID": "7F229713-386A-4F61-9A05-3A8F99D308B9",
    "DataProviderID": 2,
    "DataProvidersReference": "63298",
    "OperatorID": 5,
    "UsageTypeID": 1,
    "AddressInfo": {
        "ID": 27624,
        "Title": "BSMG",
        "AddressLine1": "250 South Mangum Street",
        "Town": "Durham",
        "StateOrProvince": "NC",
        "Postcode": "27701",
        "CountryID": 2,
        "Latitude": 35.992739,
        "Longitude": -78.902515,
        "ContactTelephone1": "888-758-4389",
        "AccessComments": "24 hours daily",
        "RelatedURL": "http://www.chargepoint.com/",
        "DistanceUnit": 0
    },
    "Connections": [
        {
            "ID": 29879,
            "ConnectionTypeID": 1,
            "LevelID": 2,
            "Amps": 16,
            "Voltage": 230,
            "PowerKW": 3.7,
            "CurrentTypeID": 10,
            "Quantity": 6
        }
    ],
    "DateLastStatusUpdate": "2020-06-26T02:58:00Z",
    "DataQualityLevel": 3,
    "DateCreated": "2014-11-28T03:37:00Z",
    "SubmissionStatusTypeID": 100
}