{
    "IsRecentlyVerified": false,
    "ID": 143156,
    "UUID": "D8BDAFAA-0227-4F86-B41F-FAA6C33F130A",
    "DataProviderID": 2,
    "DataProvidersReference": "123654",
    "OperatorID": 5,
    "UsageTypeID": 1,
    "AddressInfo": {
        "ID": 143508,
        "Title": "CORNELL",
        "AddressLine1": "176 Hoy Rd",
        "Town": "Ithaca",
        "StateOrProvince": "NY",
        "Postcode": "14853",
        "CountryID": 2,
        "Latitude": 42.44345,
        "Longitude": -76.47946,
        "ContactTelephone1": "888-758-4389",
        "AccessComments": "24 hours daily",
        "RelatedURL": "http://www.chargepoint.com/",
        "DistanceUnit": 0
    },
    "Connections": [
        {
            "ID": 199428,
            "ConnectionTypeID": 1,
            "LevelID": 2,
            "Amps": 16,
            "Voltage": 230,
            "PowerKW": 3.7,
            "CurrentTypeID": 10,
            "Quantity": 2
        }
    ],
    "StatusTypeID": 50,
    "DateLastStatusUpdate": "2020-06-26T03:06:00Z",
    "DataQualityLevel": 3,
    "DateCreated": "2019-12-24T09:20:00Z",
    "SubmissionStatusTypeID": 100
}