{
    "UserComments": [
        {
            "ID": 13825,
            "ChargePointID": 52574,
            "CommentTypeID": 10,
            "UserName": "xester",
            "Rating": 4,
            "DateCreated": "2016-07-13T21:27:38.623Z",
            "User": {
                "ID": 6169,
                "Username": "xester"
            },
            "CheckinStatusTypeID": 10
        }
    ],
    "IsRecentlyVerified": false,
    "ID": 52574,
    "UUID": "5F20D639-3781-45C2-97BA-0B5B8FA8FE05",
    "DataProviderID": 1,
    "OperatorID": 212,
    "UsageTypeID": 4,
    "AddressInfo": {
        "ID": 52920,
        "Title": "Parking Sant Ferran",
        "AddressLine1": "Carrer de Sant Ferran",
        "Town": "Reus",
        "StateOrProvince": "Tarragona",
        "Postcode": "43201",
        "CountryID": 210,
        "Latitude": 41.1592719,
        "Longitude": 1.1024846000000252,
        "ContactTelephone1": "+34 977 300 006",
        "ContactEmail": "amersam@amersam.com",
        "AccessComments": "Tarjeta de abono",
        "RelatedURL": "http://www.amersam.com",
        "DistanceUnit": 0
    },
    "Connections": [
        {
            "ID": 65297,
            "ConnectionTypeID": 25,
            "StatusTypeID": 50,
            "LevelID": 2,
            "Amps": 16,
            "Voltage": 230,
            "PowerKW": 3.6,
            "CurrentTypeID": 10,
            "Quantity": 1
        },
        {
            "ID": 100206,
            "ConnectionTypeID": 28,
            "StatusTypeID": 50,
            "LevelID": 2,
            "Amps": 16,
            "Voltage": 230,
            "PowerKW": 3.6,
            "CurrentTypeID": 10,
            "Quantity": 1
        },
        {
            "ID": 100207,
            "ConnectionTypeID": 25,
            "StatusTypeID": 50,
            "LevelID": 2,
            "Amps": 16,
            "Voltage": 230,
            "PowerKW": 3.6,
            "CurrentTypeID": 10,
            "Quantity": 1
        },
        {
            "ID": 100208,
            "ConnectionTypeID": 28,
            "StatusTypeID": 50,
            "LevelID": 2,
            "Amps": 16,
            "Voltage": 230,
            "PowerKW": 3.6,
            "CurrentTypeID": 10,
            "Quantity": 1
        }
    ],
    "NumberOfPoints": 2,
    "StatusTypeID": 50,
    "DateLastStatusUpdate": "2016-07-13T21:28:00Z",
    "DataQualityLevel": 1,
    "DateCreated": "2015-09-03T12:21:00Z",
    "SubmissionStatusTypeID": 200
}