{
    "IsRecentlyVerified": false,
    "ID": 39030,
    "UUID": "9C089893-7470-4302-9BCB-88CDE50666FB",
    "DataProviderID": 26,
    "DataProvidersReference": "46969",
    "OperatorsReference": "Kantoor bouwlocatie Heijmans",
    "UsageCost": "0.00 gratis",
    "AddressInfo": {
        "ID": 39376,
        "Title": "Wiardaplantage 19k",
        "AddressLine1": "Wiardaplantage 19k",
        "Town": "Leeuwarden",
        "Postcode": "8939 AA",
        "CountryID": 159,
        "Latitude": 53.183908821662,
        "Longitude": 5.8222496509552,
        "RelatedURL": "http://vrij-baan.nl",
        "DistanceUnit": 0
    },
    "Connections": [
        {
            "ID": 42541,
            "ConnectionTypeID": 25,
            "LevelID": 2,
            "PowerKW": 3.7,
            "CurrentTypeID": 10
        }
    ],
    "NumberOfPoints": 2,
    "StatusTypeID": 50,
    "DateLastStatusUpdate": "2016-06-04T02:56:00Z",
    "DataQualityLevel": 3,
    "DateCreated": "2015-01-09T06:08:00Z",
    "SubmissionStatusTypeID": 100
}