{
    "IsRecentlyVerified": false,
    "ID": 52406,
    "UUID": "92F56146-193E-4090-86A7-5BA13C01F34B",
    "DataProviderID": 1,
    "OperatorID": 105,
    "UsageTypeID": 1,
    "AddressInfo": {
        "ID": 52752,
        "Title": "E-Bike Station Rathaus",
        "AddressLine1": "Veldhausener Str. 26",
        "Town": "Neuenhaus",
        "Postcode": "49828",
        "CountryID": 87,
        "Latitude": 52.49936,
        "Longitude": 6.96722999999997,
        "RelatedURL": "http://www.rwe.com/web/cms/de/494436/e-bikes-on-tour/ladestationen/",
        "DistanceUnit": 0
    },
    "Connections": [
        {
            "ID": 65059,
            "ConnectionTypeID": 28,
            "StatusTypeID": 50,
            "LevelID": 1,
            "Amps": 10,
            "Voltage": 230,
            "PowerKW": 2.3,
            "CurrentTypeID": 10,
            "Quantity": 3
        }
    ],
    "NumberOfPoints": 3,
    "StatusTypeID": 50,
    "DateLastStatusUpdate": "2015-08-29T07:33:00Z",
    "DataQualityLevel": 1,
    "DateCreated": "2015-08-28T21:34:00Z",
    "SubmissionStatusTypeID": 200
}