{
    "UserComments": [
        {
            "ID": 10093,
            "ChargePointID": 48009,
            "CommentTypeID": 10,
            "UserName": "Anon74856763534",
            "Comment": "Powered off. CYC aware.",
            "DateCreated": "2016-04-05T15:21:27.993Z",
            "User": {
                "ID": 1192,
                "Username": "Anon74856763534"
            },
            "CheckinStatusTypeID": 20
        }
    ],
    "MediaItems": [
        {
            "ID": 6161,
            "ChargePointID": 48009,
            "ItemURL": "https://s3-ap-southeast-2.amazonaws.com/openchargemap/images/GB/OCM48009/OCM-48009.orig.2016040515204030.jpeg",
            "ItemThumbnailURL": "https://s3-ap-southeast-2.amazonaws.com/openchargemap/images/GB/OCM48009/OCM-48009.thmb.2016040515204030.jpeg",
            "Comment": "",
            "IsEnabled": true,
            "IsVideo": false,
            "IsFeaturedItem": false,
            "IsExternalResource": false,
            "User": {
                "ID": 1192,
                "Username": "Anon74856763534"
            },
            "DateCreated": "2016-04-05T15:21:00Z"
        },
        {
            "ID": 3506,
            "ChargePointID": 48009,
            "ItemURL": "https://s3-ap-southeast-2.amazonaws.com/openchargemap/images/GB/OCM48009/OCM-48009.orig.2015111817585299.jpeg",
            "ItemThumbnailURL": "https://s3-ap-southeast-2.amazonaws.com/openchargemap/images/GB/OCM48009/OCM-48009.thmb.2015111817585299.jpeg",
            "Comment": "",
            "IsEnabled": true,
            "IsVideo": false,
            "IsFeaturedItem": false,
            "IsExternalResource": false,
            "User": {
                "ID": 1192,
                "Username": "Anon74856763534"
            },
            "DateCreated": "2015-11-18T17:59:00Z"
        },
        {
            "ID": 3504,
            "ChargePointID": 48009,
            "ItemURL": "https://s3-ap-southeast-2.amazonaws.com/openchargemap/images/GB/OCM48009/OCM-48009.orig.2015111814183505.jpeg",
            "ItemThumbnailURL": "https://s3-ap-southeast-2.amazonaws.com/openchargemap/images/GB/OCM48009/OCM-48009.thmb.2015111814183505.jpeg",
            "Comment": "",
            "IsEnabled": true,
            "IsVideo": false,
            "IsFeaturedItem": false,
            "IsExternalResource": false,
            "User": {
                "ID": 1192,
                "Username": "Anon74856763534"
            },
            "DateCreated": "2015-11-18T14:19:00Z"
        }
    ],
    "IsRecentlyVerified": false,
    "ID": 48009,
    "UUID": "145BC400-EB87-4758-A0F3-FA5FC4542ED1",
    "DataProviderID": 1,
    "OperatorID": 3315,
    "OperatorsReference": "50645",
    "UsageTypeID": 4,
    "UsageCost": "Free",
    "AddressInfo": {
        "ID": 48355,
        "Title": "Kilchoan Ferry Terminal",
        "AddressLine1": "Kilchoan Ferry Terminal",
        "Town": "Kilchoan",
        "StateOrProvince": "Argyll",
        "Postcode": "PH36 4LJ",
        "CountryID": 1,
        "Latitude": 56.68856,
        "Longitude": -6.09413,
        "DistanceUnit": 0
    },
    "Connections": [
        {
            "ID": 59249,
            "ConnectionTypeID": 2,
            "StatusTypeID": 50,
            "LevelID": 3,
            "Amps": 125,
            "Voltage": 400,
            "PowerKW": 50,
            "CurrentTypeID": 30,
            "Quantity": 1
        },
        {
            "ID": 59250,
            "ConnectionTypeID": 1036,
            "StatusTypeID": 50,
            "LevelID": 3,
            "Amps": 63,
            "Voltage": 400,
            "PowerKW": 43,
            "CurrentTypeID": 20,
            "Quantity": 1
        },
        {
            "ID": 59251,
            "ConnectionTypeID": 33,
            "StatusTypeID": 100,
            "LevelID": 3,
            "Amps": 125,
            "Voltage": 400,
            "PowerKW": 50,
            "CurrentTypeID": 30,
            "Quantity": 1
        }
    ],
    "NumberOfPoints": 2,
    "StatusTypeID": 50,
    "DateLastStatusUpdate": "2019-10-08T05:14:00Z",
    "DataQualityLevel": 1,
    "DateCreated": "2015-06-22T13:07:00Z",
    "SubmissionStatusTypeID": 200
}