{
    "IsRecentlyVerified": false,
    "ID": 15434,
    "UUID": "C446B3BE-827B-4140-A70E-9C69F7D5EB2E",
    "DataProviderID": 1,
    "OperatorID": 51,
    "UsageTypeID": 0,
    "UsageCost": "Free",
    "AddressInfo": {
        "ID": 15780,
        "Title": "Kal Tire",
        "AddressLine1": "2671 Box Springs Way NW",
        "AddressLine2": "",
        "Town": "Medicine Hat",
        "StateOrProvince": "AB",
        "Postcode": "T1B 2R4",
        "CountryID": 44,
        "Latitude": 50.0043245,
        "Longitude": -110.64731589999997,
        "ContactTelephone1": "403) 527-4900",
        "ContactTelephone2": "",
        "ContactEmail": "",
        "AccessComments": "charging only during business hours         Business Hours: Mon-Fri: 7:30am to 6:00pm Sat: 8:00am to 5:00pm                24 Hour Emergency Road Service: 1-888-KAL-TIRE (525-8473)  ",
        "RelatedURL": "http://www.kaltire.com/moduleinterface.php?page=location-finder&mact=Locations,m1_,detail,0,1&m1_loc_id=176#frommap",
        "DistanceUnit": 0
    },
    "Connections": [
        {
            "ID": 13743,
            "ConnectionTypeID": 1,
            "StatusTypeID": 0,
            "LevelID": 2,
            "Amps": 32,
            "Voltage": 240,
            "PowerKW": 7.7,
            "Quantity": 1
        }
    ],
    "NumberOfPoints": 1,
    "GeneralComments": "",
    "StatusTypeID": 50,
    "DateLastStatusUpdate": "2013-01-09T19:07:00Z",
    "DataQualityLevel": 1,
    "DateCreated": "2013-01-09T19:07:00Z",
    "SubmissionStatusTypeID": 200
}