{
    "IsRecentlyVerified": false,
    "ID": 88249,
    "UUID": "34B5C58E-CD16-4D70-8C14-DAC73195E003",
    "DataProviderID": 1,
    "OperatorID": 23,
    "OperatorsReference": "30042",
    "UsageTypeID": 6,
    "AddressInfo": {
        "ID": 88595,
        "Title": "Glass House Dream&charme",
        "AddressLine1": "10 Strada Colombaro",
        "Town": "Terruggia",
        "Postcode": "15033",
        "CountryID": 112,
        "Latitude": 45.082402,
        "Longitude": 8.444644,
        "ContactTelephone1": "+39 0280 503 457",
        "DistanceUnit": 0
    },
    "Connections": [
        {
            "ID": 125176,
            "ConnectionTypeID": 30,
            "StatusTypeID": 50,
            "LevelID": 2,
            "Amps": 16,
            "Voltage": 400,
            "PowerKW": 11,
            "CurrentTypeID": 20,
            "Quantity": 1
        }
    ],
    "NumberOfPoints": 1,
    "GeneralComments": "1 Tesla Connector, up to 11kW.Available for patrons only. Please call ahead.",
    "StatusTypeID": 50,
    "DateLastStatusUpdate": "2018-10-03T23:59:00Z",
    "DataQualityLevel": 1,
    "DateCreated": "2017-05-25T05:59:00Z",
    "SubmissionStatusTypeID": 200
}