{
    "IsRecentlyVerified": false,
    "ID": 178547,
    "UUID": "6E73E6C1-6A2D-45E2-8826-91CC54779E4C",
    "DataProviderID": 29,
    "DataProvidersReference": "7475",
    "AddressInfo": {
        "ID": 178906,
        "Title": "Bahnhofstraße 2",
        "AddressLine1": "Bahnhofstraße 2",
        "Town": "Höfen",
        "Postcode": "75339",
        "CountryID": 87,
        "Latitude": 48.799702,
        "Longitude": 8.582415,
        "DistanceUnit": 0
    },
    "Connections": [
        {
            "ID": 279108,
            "ConnectionTypeID": 25,
            "StatusTypeID": 50,
            "LevelID": 2,
            "PowerKW": 22,
            "CurrentTypeID": 20
        },
        {
            "ID": 279109,
            "ConnectionTypeID": 25,
            "StatusTypeID": 50,
            "LevelID": 2,
            "PowerKW": 22,
            "CurrentTypeID": 20
        }
    ],
    "StatusTypeID": 0,
    "DateLastStatusUpdate": "2021-07-09T03:13:00Z",
    "MetadataValues": [
        {
            "ID": 10841,
            "MetadataFieldID": 4,
            "ItemValue": "Data from the German chargepoint registry provided by Bundesnetzagentur.de under the CC-BY 4.0 license"
        }
    ],
    "DataQualityLevel": 3,
    "DateCreated": "2021-07-08T09:50:00Z",
    "SubmissionStatusTypeID": 100
}