{
    "IsRecentlyVerified": false,
    "ID": 95219,
    "UUID": "8E741088-E13B-4FB6-AED0-F6036115C29A",
    "DataProviderID": 1,
    "OperatorID": 23,
    "OperatorsReference": "37251",
    "UsageTypeID": 4,
    "AddressInfo": {
        "ID": 95565,
        "Title": "Hotel Norica Therme",
        "AddressLine1": "Kaiser-Franz-Platz 3",
        "Town": "Bad Hofgastein",
        "Postcode": "5630",
        "CountryID": 19,
        "Latitude": 47.171187,
        "Longitude": 13.105918,
        "ContactTelephone1": "+43 6432 8391",
        "DistanceUnit": 0
    },
    "Connections": [
        {
            "ID": 134887,
            "ConnectionTypeID": 30,
            "StatusTypeID": 50,
            "LevelID": 2,
            "Amps": 16,
            "Voltage": 400,
            "PowerKW": 11,
            "CurrentTypeID": 20,
            "Quantity": 2
        }
    ],
    "NumberOfPoints": 2,
    "GeneralComments": "2 Tesla Connectors, up to 11kW.Available for customers. Please see front desk.",
    "StatusTypeID": 50,
    "DateLastStatusUpdate": "2018-10-03T18:05:00Z",
    "DataQualityLevel": 1,
    "DateCreated": "2017-11-05T06:57:00Z",
    "SubmissionStatusTypeID": 200
}