{
    "IsRecentlyVerified": false,
    "ID": 114197,
    "UUID": "8F61635F-FFE5-4F21-964E-E4F3D682F294",
    "DataProviderID": 1,
    "OperatorID": 23,
    "OperatorsReference": "47494",
    "UsageTypeID": 6,
    "AddressInfo": {
        "ID": 114543,
        "Title": "Hotel Waldhof auf Herrenland",
        "AddressLine1": "Auf Dem Herrenland 2",
        "Town": "Moelln",
        "Postcode": "23879",
        "CountryID": 87,
        "Latitude": 53.632342,
        "Longitude": 10.724284,
        "ContactTelephone1": "+49 4542 2115",
        "DistanceUnit": 0
    },
    "Connections": [
        {
            "ID": 160767,
            "ConnectionTypeID": 30,
            "StatusTypeID": 50,
            "LevelID": 2,
            "PowerKW": 17,
            "CurrentTypeID": 20,
            "Quantity": 1
        }
    ],
    "NumberOfPoints": 1,
    "GeneralComments": "1 Tesla Connector, up to 17kW.Available for patrons only. Please see front desk.",
    "StatusTypeID": 50,
    "DateLastStatusUpdate": "2020-08-18T05:52:00Z",
    "DataQualityLevel": 1,
    "DateCreated": "2019-01-03T08:12:00Z",
    "SubmissionStatusTypeID": 200
}