{
    "IsRecentlyVerified": false,
    "ID": 68312,
    "UUID": "94B0C05A-0DF3-4215-9392-5CB4ECB20B61",
    "DataProviderID": 26,
    "DataProvidersReference": "92766",
    "OperatorID": 157,
    "OperatorsReference": "NewMotion 03006626",
    "UsageCost": "0.00 jaarabonnement",
    "AddressInfo": {
        "ID": 68658,
        "Title": "Fivelpoort 1",
        "AddressLine1": "Fivelpoort 1",
        "Town": "Appingedam",
        "Postcode": "9902 SR",
        "CountryID": 159,
        "Latitude": 53.3031488,
        "Longitude": 6.856694,
        "ContactTelephone1": "088 0109500",
        "RelatedURL": "http://thenewmotion.nl/",
        "DistanceUnit": 0
    },
    "Connections": [
        {
            "ID": 95238,
            "ConnectionTypeID": 25,
            "LevelID": 2,
            "PowerKW": 11,
            "CurrentTypeID": 10
        }
    ],
    "NumberOfPoints": 1,
    "StatusTypeID": 50,
    "DateLastStatusUpdate": "2016-06-04T02:37:00Z",
    "DataQualityLevel": 3,
    "DateCreated": "2016-06-04T02:37:00Z",
    "SubmissionStatusTypeID": 100
}