{
    "IsRecentlyVerified": false,
    "ID": 103200,
    "UUID": "833158D5-2BA3-4868-A8B0-249AD147AFB0",
    "DataProviderID": 1,
    "OperatorID": 86,
    "UsageTypeID": 4,
    "AddressInfo": {
        "ID": 103546,
        "Title": "Gemeindeverwaltung",
        "AddressLine1": "Kirchstraße 11",
        "Town": "Nehren",
        "StateOrProvince": "Verwaltungsverband Steinlach-Wiesaz",
        "Postcode": "72147",
        "CountryID": 87,
        "Latitude": 48.432796575258784,
        "Longitude": 9.068447899475132,
        "AccessComments": "24/7 nutzbare Ladesäule hinter der Remise des Gasthauses Schwanen. \r\n",
        "DistanceUnit": 0
    },
    "Connections": [
        {
            "ID": 145803,
            "ConnectionTypeID": 25,
            "StatusTypeID": 50,
            "LevelID": 2,
            "Amps": 32,
            "Voltage": 400,
            "PowerKW": 22,
            "CurrentTypeID": 20,
            "Quantity": 2
        },
        {
            "ID": 145804,
            "ConnectionTypeID": 28,
            "StatusTypeID": 50,
            "LevelID": 2,
            "Amps": 16,
            "Voltage": 230,
            "PowerKW": 3.7,
            "CurrentTypeID": 10,
            "Quantity": 2
        }
    ],
    "NumberOfPoints": 4,
    "StatusTypeID": 50,
    "DateLastStatusUpdate": "2018-04-24T09:35:00Z",
    "DataQualityLevel": 1,
    "DateCreated": "2018-04-24T09:35:00Z",
    "SubmissionStatusTypeID": 200
}