{
    "IsRecentlyVerified": false,
    "ID": 33640,
    "UUID": "44F31E92-2AC9-40D7-A59C-9A769092F954",
    "DataProviderID": 26,
    "DataProvidersReference": "47634",
    "OperatorID": 178,
    "OperatorsReference": "EVnetNL AL785",
    "UsageCost": "0.00 jaarabonnement",
    "AddressInfo": {
        "ID": 33986,
        "Title": "Rietveldenweg 43",
        "AddressLine1": "Rietveldenweg 43",
        "Town": "'s-Hertogenbosch",
        "Postcode": "5222 AP",
        "CountryID": 159,
        "Latitude": 51.703661,
        "Longitude": 5.270814,
        "ContactTelephone1": "0800-3522365",
        "RelatedURL": "http://www.evnet.nl",
        "DistanceUnit": 0
    },
    "Connections": [
        {
            "ID": 37151,
            "ConnectionTypeID": 25,
            "LevelID": 2,
            "PowerKW": 11,
            "CurrentTypeID": 10
        }
    ],
    "NumberOfPoints": 2,
    "StatusTypeID": 50,
    "DateLastStatusUpdate": "2016-06-04T02:40:00Z",
    "DataQualityLevel": 3,
    "DateCreated": "2015-01-09T06:04:00Z",
    "SubmissionStatusTypeID": 100
}