{
    "IsRecentlyVerified": false,
    "ID": 94724,
    "UUID": "055610FA-88B1-468C-A4CB-73AB5881D52E",
    "DataProviderID": 1,
    "OperatorID": 125,
    "UsageTypeID": 4,
    "AddressInfo": {
        "ID": 95070,
        "Title": "Autohaus Werner Hilgen",
        "AddressLine1": "Friedrichsfehner Straße 6",
        "Town": "Edewecht",
        "StateOrProvince": "Landkreis Ammerland",
        "Postcode": "26188",
        "CountryID": 87,
        "Latitude": 53.12471576302896,
        "Longitude": 8.087517419573928,
        "AccessComments": "24/7 open",
        "DistanceUnit": 0
    },
    "Connections": [
        {
            "ID": 133894,
            "ConnectionTypeID": 25,
            "StatusTypeID": 50,
            "LevelID": 2,
            "Amps": 32,
            "Voltage": 400,
            "PowerKW": 22,
            "CurrentTypeID": 20,
            "Quantity": 2
        }
    ],
    "NumberOfPoints": 2,
    "StatusTypeID": 50,
    "DateLastStatusUpdate": "2017-10-23T13:16:00Z",
    "DataQualityLevel": 1,
    "DateCreated": "2017-10-23T13:16:00Z",
    "SubmissionStatusTypeID": 200
}