{
    "IsRecentlyVerified": false,
    "ID": 127047,
    "UUID": "484DA4F9-4C46-4CB4-99C9-D528516D5ACD",
    "DataProviderID": 1,
    "UsageTypeID": 1,
    "UsageCost": "Bitte beim jeweiligen Ladekartenanbieter nachlesen.",
    "AddressInfo": {
        "ID": 127393,
        "Title": "Ladestation Oberlaa",
        "AddressLine1": "Biererlgasse 11",
        "Town": "Wien",
        "StateOrProvince": "Wien",
        "Postcode": "1100",
        "CountryID": 19,
        "Latitude": 48.1395073859218,
        "Longitude": 16.4025773578184,
        "ContactTelephone1": "+436605223979",
        "ContactEmail": "office@wendt.at",
        "AccessComments": "2x Typ 2 22kW - Lastmanagement (1x 22kW oder 2x 11kW)\r\nDie Ladestation befindet sich nur 400 Meter von der U-Bahn Station U1 Oberlaa entfernt. Die Therme Wien, der Kurpark Oberlaa, die Kurkonditorei Oberlaa, Heurigen und Buschenschanken sowie weitere Gastronomiebetriebe erreichen Sie ebenfalls in wenigen Gehminuten. Ein Hotel, eine Pension und ein Tierarzt sind 200 Meter entfernt. Beim Ladevorgang benötigen Sie keinen Parkschein.",
        "RelatedURL": "http://www.ladestation-oberlaa.at",
        "DistanceUnit": 0
    },
    "Connections": [
        {
            "ID": 177916,
            "ConnectionTypeID": 25,
            "StatusTypeID": 50,
            "LevelID": 2,
            "Amps": 32,
            "Voltage": 400,
            "PowerKW": 22,
            "CurrentTypeID": 20,
            "Quantity": 2
        }
    ],
    "NumberOfPoints": 2,
    "GeneralComments": "Der Ladevorgang kann mit diversen Ladekarten gestartet werden - wie zum Beispiel NewMotion, Plugsurfing, Maingau, BMW Karte, usw. oder mit QR-Code.",
    "StatusTypeID": 50,
    "DateLastStatusUpdate": "2019-05-26T09:05:00Z",
    "DataQualityLevel": 1,
    "DateCreated": "2019-05-26T05:41:00Z",
    "SubmissionStatusTypeID": 200
}