{
    "IsRecentlyVerified": false,
    "ID": 145578,
    "UUID": "68BE3D45-B038-4EE0-A1D5-DD3200E565A8",
    "DataProviderID": 2,
    "DataProvidersReference": "131267",
    "OperatorID": 90,
    "UsageTypeID": 1,
    "AddressInfo": {
        "ID": 145930,
        "Title": "Accomodation Senneterre, 560, 6e Rue Ouest",
        "AddressLine1": "560 6e Rue Ouest",
        "Town": "Senneterre",
        "StateOrProvince": "QC",
        "Postcode": "J0Y 2M0",
        "CountryID": 44,
        "Latitude": 48.38573,
        "Longitude": -77.250021,
        "ContactTelephone1": "877-505-2674",
        "AccessComments": "24 hours daily",
        "RelatedURL": "https://lecircuitelectrique.com/",
        "DistanceUnit": 0
    },
    "Connections": [
        {
            "ID": 202289,
            "ConnectionTypeID": 1,
            "LevelID": 2,
            "Amps": 16,
            "Voltage": 230,
            "PowerKW": 3.7,
            "CurrentTypeID": 10,
            "Quantity": 1
        }
    ],
    "StatusTypeID": 50,
    "DateLastStatusUpdate": "2020-06-26T03:11:00Z",
    "DataQualityLevel": 3,
    "DateCreated": "2019-12-24T09:25:00Z",
    "SubmissionStatusTypeID": 100
}