{
    "IsRecentlyVerified": false,
    "ID": 107415,
    "UUID": "2F91C20E-B6F3-4369-9ED3-6AB936E1E059",
    "DataProviderID": 1,
    "OperatorID": 3319,
    "UsageTypeID": 1,
    "UsageCost": "bruttó 80 Ft/kWh",
    "AddressInfo": {
        "ID": 107761,
        "Title": "Bicske, Kossuth Lajos utca",
        "AddressLine1": "Kossuth Lajos utca",
        "Town": "Bicske",
        "StateOrProvince": "Fejér megye",
        "Postcode": "2060",
        "CountryID": 104,
        "Latitude": 47.49236825720904,
        "Longitude": 18.634237144566328,
        "ContactTelephone1": "+36 1 265-5029",
        "ContactEmail": "kommunikacio@e-mobi.hu",
        "RelatedURL": "https://e-mobi.hu/",
        "DistanceUnit": 0
    },
    "Connections": [
        {
            "ID": 151562,
            "ConnectionTypeID": 25,
            "StatusTypeID": 50,
            "LevelID": 2,
            "Amps": 32,
            "Voltage": 400,
            "PowerKW": 22,
            "CurrentTypeID": 20,
            "Quantity": 2
        }
    ],
    "NumberOfPoints": 2,
    "StatusTypeID": 50,
    "DateLastStatusUpdate": "2020-05-09T09:12:00Z",
    "DataQualityLevel": 1,
    "DateCreated": "2018-07-29T12:29:00Z",
    "SubmissionStatusTypeID": 200
}