{
    "MediaItems": [
        {
            "ID": 29360,
            "ChargePointID": 188219,
            "ItemURL": "https://s3-ap-southeast-2.amazonaws.com/openchargemap/images/IT/OCM188219/OCM-188219.orig.2021092714033688.jpg",
            "ItemThumbnailURL": "https://s3-ap-southeast-2.amazonaws.com/openchargemap/images/IT/OCM188219/OCM-188219.thmb.2021092714033688.jpg",
            "Comment": "",
            "IsEnabled": true,
            "IsVideo": false,
            "IsFeaturedItem": false,
            "IsExternalResource": false,
            "User": {
                "ID": 19496,
                "Username": "ECOGY"
            },
            "DateCreated": "2021-09-27T14:04:00Z"
        },
        {
            "ID": 29361,
            "ChargePointID": 188219,
            "ItemURL": "https://s3-ap-southeast-2.amazonaws.com/openchargemap/images/IT/OCM188219/OCM-188219.orig.2021092714034935.jpg",
            "ItemThumbnailURL": "https://s3-ap-southeast-2.amazonaws.com/openchargemap/images/IT/OCM188219/OCM-188219.thmb.2021092714034935.jpg",
            "Comment": "",
            "IsEnabled": true,
            "IsVideo": false,
            "IsFeaturedItem": false,
            "IsExternalResource": false,
            "User": {
                "ID": 19496,
                "Username": "ECOGY"
            },
            "DateCreated": "2021-09-27T14:04:00Z"
        }
    ],
    "IsRecentlyVerified": false,
    "ID": 188219,
    "UUID": "2AAB68DB-0763-469A-9C64-9835084B72B5",
    "DataProviderID": 1,
    "OperatorID": 1,
    "UsageTypeID": 4,
    "UsageCost": "0,30 €/kWh",
    "AddressInfo": {
        "ID": 188578,
        "Title": "Hotel Sigmundskron***",
        "AddressLine1": "66 Weinstraße - Strada del Vino",
        "Town": "Eppan an der Weinstraße - Appiano sulla Strada del Vino",
        "StateOrProvince": "Trentino-Alto Adige - Südtirol",
        "Postcode": "39057",
        "CountryID": 112,
        "Latitude": 46.475409000005754,
        "Longitude": 11.299974025794995,
        "ContactTelephone1": "+39 0471 633 205  ",
        "AccessComments": "For guest. RFID card available at office",
        "RelatedURL": "https://www.sigmundskron.com/de",
        "DistanceUnit": 0
    },
    "Connections": [
        {
            "ID": 303801,
            "ConnectionTypeID": 33,
            "StatusTypeID": 50,
            "LevelID": 2,
            "Amps": 13,
            "Voltage": 400,
            "PowerKW": 9,
            "CurrentTypeID": 20,
            "Quantity": 1
        }
    ],
    "NumberOfPoints": 1,
    "GeneralComments": "The charging station is in the parking lot",
    "StatusTypeID": 50,
    "DateLastStatusUpdate": "2021-09-27T14:04:00Z",
    "DataQualityLevel": 1,
    "DateCreated": "2021-07-14T14:42:00Z",
    "SubmissionStatusTypeID": 200
}