{
    "IsRecentlyVerified": false,
    "ID": 81741,
    "UUID": "B62F2971-196D-42CF-A24F-0CB3FADA9796",
    "DataProviderID": 1,
    "OperatorID": 23,
    "OperatorsReference": "11921",
    "UsageTypeID": 6,
    "AddressInfo": {
        "ID": 82087,
        "Title": "The Hazelton Hotel",
        "AddressLine1": "118 Yorkville Ave",
        "Town": "Toronto",
        "StateOrProvince": "ON",
        "Postcode": "M5R 1C2",
        "CountryID": 44,
        "Latitude": 43.670651,
        "Longitude": -79.39394,
        "ContactTelephone1": "(416) 963-6300",
        "DistanceUnit": 0
    },
    "Connections": [
        {
            "ID": 116499,
            "ConnectionTypeID": 30,
            "StatusTypeID": 50,
            "LevelID": 2,
            "PowerKW": 8,
            "CurrentTypeID": 10,
            "Quantity": 2
        }
    ],
    "NumberOfPoints": 2,
    "GeneralComments": "2 Tesla Connectors, up to 8kW.Available for patrons only. Please see valet.",
    "StatusTypeID": 50,
    "DateLastStatusUpdate": "2017-06-09T12:56:00Z",
    "DataQualityLevel": 1,
    "DateCreated": "2017-02-03T11:52:00Z",
    "SubmissionStatusTypeID": 200
}