{
    "IsRecentlyVerified": false,
    "ID": 126992,
    "UUID": "E9AC4649-7107-41B6-B912-ACE604C55C9C",
    "DataProviderID": 1,
    "OperatorID": 3,
    "OperatorsReference": "PG-82861,PG-82892",
    "UsageTypeID": 4,
    "UsageCost": "£0.14/kWh",
    "AddressInfo": {
        "ID": 127338,
        "Title": "Blair Castle Caravan Park",
        "AddressLine1": "Blair Atholl",
        "Town": "Pitlochry",
        "Postcode": "PH18 5SR",
        "CountryID": 1,
        "Latitude": 56.768056,
        "Longitude": -3.844444,
        "DistanceUnit": 0
    },
    "Connections": [
        {
            "ID": 177850,
            "ConnectionTypeID": 25,
            "StatusTypeID": 50,
            "LevelID": 2,
            "Amps": 32,
            "Voltage": 230,
            "PowerKW": 7,
            "CurrentTypeID": 10,
            "Quantity": 4
        }
    ],
    "NumberOfPoints": 4,
    "GeneralComments": "This is an open charge unit installed at the Atholl Estates Office at Blair Atholl, Pitlochry",
    "StatusTypeID": 50,
    "DateLastStatusUpdate": "2019-06-25T05:27:00Z",
    "DataQualityLevel": 1,
    "DateCreated": "2019-05-25T05:29:00Z",
    "SubmissionStatusTypeID": 200
}