{
    "IsRecentlyVerified": false,
    "ID": 129999,
    "UUID": "8BB4912C-D34E-4E81-B33D-8B96A04F6457",
    "DataProviderID": 1,
    "OperatorID": 80,
    "UsageTypeID": 4,
    "UsageCost": "0,45 €/kW",
    "AddressInfo": {
        "ID": 130345,
        "Title": " San Lazzaro di Savena Repubblica | EnelX",
        "AddressLine1": "Via della Repubblica",
        "Town": " San Lazzaro di Savena",
        "StateOrProvince": "BO",
        "Postcode": "40068",
        "CountryID": 112,
        "Latitude": 44.4706507075847,
        "Longitude": 11.403566683157,
        "RelatedURL": "https://www.enelx.com/it/it/emobility",
        "DistanceUnit": 0
    },
    "Connections": [
        {
            "ID": 181990,
            "ConnectionTypeID": 25,
            "StatusTypeID": 50,
            "LevelID": 2,
            "Amps": 32,
            "Voltage": 400,
            "PowerKW": 22,
            "CurrentTypeID": 20,
            "Quantity": 2
        }
    ],
    "NumberOfPoints": 2,
    "StatusTypeID": 50,
    "DateLastStatusUpdate": "2019-07-30T10:41:00Z",
    "DataQualityLevel": 1,
    "DateCreated": "2019-07-30T10:41:00Z",
    "SubmissionStatusTypeID": 200
}