{
    "IsRecentlyVerified": false,
    "ID": 92028,
    "UUID": "6BCD6E90-0334-4945-A9F8-3D5298A784A2",
    "DataProviderID": 1,
    "OperatorID": 23,
    "OperatorsReference": "33145",
    "UsageTypeID": 4,
    "AddressInfo": {
        "ID": 92374,
        "Title": "MT. Bachelor Ski Resort",
        "AddressLine1": "191717 MT. Bachelor DR",
        "Town": "Bend",
        "StateOrProvince": "Oregon",
        "Postcode": "97702",
        "CountryID": 2,
        "Latitude": 44.003734,
        "Longitude": -121.678497,
        "ContactTelephone1": "(541) 382-2442",
        "DistanceUnit": 0
    },
    "Connections": [
        {
            "ID": 130489,
            "ConnectionTypeID": 30,
            "StatusTypeID": 50,
            "LevelID": 2,
            "PowerKW": 6,
            "CurrentTypeID": 10,
            "Quantity": 3
        }
    ],
    "NumberOfPoints": 3,
    "GeneralComments": "3 Tesla Connectors, up to 6kW.Available for customers. Please call ahead.",
    "StatusTypeID": 50,
    "DateLastStatusUpdate": "2017-08-24T05:55:00Z",
    "DataQualityLevel": 1,
    "DateCreated": "2017-08-24T05:55:00Z",
    "SubmissionStatusTypeID": 200
}