{
    "IsRecentlyVerified": false,
    "ID": 95431,
    "UUID": "08DB7303-7925-4265-9AA4-D720772A2A20",
    "DataProviderID": 1,
    "OperatorID": 156,
    "UsageTypeID": 4,
    "AddressInfo": {
        "ID": 95777,
        "Title": "Ladepunkt Svendborger Straße",
        "AddressLine1": "Svendborger Straße 11",
        "Town": "Stralsund",
        "StateOrProvince": "Landkreis Vorpommern-Rügen",
        "Postcode": "18437",
        "CountryID": 87,
        "Latitude": 54.30484,
        "Longitude": 13.039049999999975,
        "AccessComments": "24/7 nutzbar",
        "DistanceUnit": 0
    },
    "Connections": [
        {
            "ID": 135200,
            "ConnectionTypeID": 25,
            "StatusTypeID": 50,
            "LevelID": 2,
            "Amps": 16,
            "Voltage": 230,
            "PowerKW": 3.7,
            "CurrentTypeID": 10,
            "Quantity": 1
        }
    ],
    "NumberOfPoints": 1,
    "StatusTypeID": 50,
    "DateLastStatusUpdate": "2017-11-10T10:11:00Z",
    "DataQualityLevel": 1,
    "DateCreated": "2017-11-10T10:11:00Z",
    "SubmissionStatusTypeID": 200
}