{
    "IsRecentlyVerified": false,
    "ID": 38314,
    "UUID": "BD93E0ED-D71A-4866-B7A1-079C80D264C7",
    "DataProviderID": 1,
    "OperatorID": 105,
    "OperatorsReference": "Essent EM-DE-11000000-01-00054",
    "UsageTypeID": 4,
    "AddressInfo": {
        "ID": 38660,
        "Title": "Burggrafenstraße 6",
        "AddressLine1": "Burggrafenstraße 6",
        "Town": "Berlin",
        "Postcode": "10787",
        "CountryID": 87,
        "Latitude": 52.505073,
        "Longitude": 13.343569,
        "DistanceUnit": 0
    },
    "Connections": [
        {
            "ID": 41825,
            "ConnectionTypeID": 25,
            "LevelID": 2,
            "PowerKW": 11
        }
    ],
    "NumberOfPoints": 1,
    "StatusTypeID": 50,
    "DateLastStatusUpdate": "2015-04-12T18:34:00Z",
    "DataQualityLevel": 3,
    "DateCreated": "2015-01-09T06:07:00Z",
    "SubmissionStatusTypeID": 200
}