{
    "MediaItems": [
        {
            "ID": 110,
            "ChargePointID": 9085,
            "ItemURL": "https://s3-ap-southeast-2.amazonaws.com/openchargemap/images/GB/OCM9085/OCM-9085.orig.2013101107033304.jpg",
            "ItemThumbnailURL": "https://s3-ap-southeast-2.amazonaws.com/openchargemap/images/GB/OCM9085/OCM-9085.thmb.2013101107033304.jpg",
            "Comment": "Pod Point in School Place. Needs swipecard from the Council",
            "IsEnabled": true,
            "IsVideo": false,
            "IsFeaturedItem": false,
            "IsExternalResource": false,
            "User": {
                "ID": 1241,
                "Username": "NeilKermode"
            },
            "DateCreated": "2013-10-11T07:04:00Z"
        }
    ],
    "IsRecentlyVerified": false,
    "ID": 9085,
    "UUID": "674BE41C-B834-4EE9-83B6-20AE8FCD428B",
    "DataProviderID": 1,
    "OperatorID": 3315,
    "OperatorsReference": "50726",
    "UsageTypeID": 4,
    "UsageCost": "Free",
    "AddressInfo": {
        "ID": 8982,
        "Title": "East Kirk Car Park",
        "AddressLine1": "School Place",
        "Town": "Kirkwall",
        "StateOrProvince": "Orkney",
        "Postcode": "KW15 1NY",
        "CountryID": 1,
        "Latitude": 58.9809,
        "Longitude": -2.95566,
        "ContactTelephone1": "01856 873535",
        "AccessComments": "This is a charging pole that needs a swipe card (RFID)",
        "DistanceUnit": 0
    },
    "Connections": [
        {
            "ID": 6761,
            "ConnectionTypeID": 25,
            "StatusTypeID": 50,
            "LevelID": 2,
            "Amps": 32,
            "Voltage": 400,
            "PowerKW": 7,
            "CurrentTypeID": 20,
            "Quantity": 4
        }
    ],
    "NumberOfPoints": 4,
    "StatusTypeID": 50,
    "DateLastStatusUpdate": "2020-03-10T06:13:00Z",
    "DataQualityLevel": 1,
    "DateCreated": "2012-01-01T12:54:00Z",
    "SubmissionStatusTypeID": 100
}