{
    "IsRecentlyVerified": false,
    "ID": 81635,
    "UUID": "1E2B1CFB-95D9-4FF0-B42D-A0BEBEB8D603",
    "DataProviderID": 1,
    "OperatorID": 23,
    "OperatorsReference": "21408",
    "UsageTypeID": 6,
    "AddressInfo": {
        "ID": 81981,
        "Title": "Fiesta Inn Leon",
        "AddressLine1": "Boulevard Adolfo Lopez Mateos Oriente 2702 Jardines de Jerez",
        "Town": "El Desagae",
        "StateOrProvince": "Guanajuato",
        "Postcode": "37530",
        "CountryID": 146,
        "Latitude": 21.102948,
        "Longitude": -101.637287,
        "ContactTelephone1": "+52 477 710 0500",
        "DistanceUnit": 0
    },
    "Connections": [
        {
            "ID": 116383,
            "ConnectionTypeID": 30,
            "StatusTypeID": 50,
            "LevelID": 2,
            "PowerKW": 16,
            "CurrentTypeID": 20,
            "Quantity": 2
        }
    ],
    "NumberOfPoints": 2,
    "GeneralComments": "2 Tesla Connectors, up to 16kW.Available for patrons only. Please see front desk.",
    "StatusTypeID": 50,
    "DateLastStatusUpdate": "2017-02-03T09:11:00Z",
    "DataQualityLevel": 1,
    "DateCreated": "2017-02-03T09:11:00Z",
    "SubmissionStatusTypeID": 200
}