{
    "IsRecentlyVerified": false,
    "ID": 61034,
    "UUID": "2D9FFCC5-D0C9-4DCE-A83A-C7B78E5872AF",
    "DataProviderID": 1,
    "OperatorID": 3279,
    "OperatorsReference": "0133,0133",
    "UsageTypeID": 4,
    "UsageCost": "€0/kWh",
    "AddressInfo": {
        "ID": 61380,
        "Title": "Boadilla del Monte - Hermanos Machado",
        "AddressLine1": "Calle Hermanos Machado, 1503",
        "Town": "Boadilla del Monte",
        "StateOrProvince": "Madrid",
        "Postcode": "28660",
        "CountryID": 210,
        "Latitude": 40.40887,
        "Longitude": -3.89666,
        "ContactTelephone1": "900215470",
        "ContactEmail": "clientes@fenieenergia.es",
        "DistanceUnit": 0
    },
    "Connections": [
        {
            "ID": 77540,
            "ConnectionTypeID": 25,
            "StatusTypeID": 75,
            "LevelID": 2,
            "Amps": 32,
            "Voltage": 400,
            "PowerKW": 22,
            "CurrentTypeID": 20,
            "Quantity": 3
        },
        {
            "ID": 158891,
            "ConnectionTypeID": 28,
            "StatusTypeID": 75,
            "LevelID": 1,
            "Amps": 10,
            "Voltage": 230,
            "PowerKW": 2.3,
            "CurrentTypeID": 10,
            "Quantity": 3
        }
    ],
    "NumberOfPoints": 3,
    "StatusTypeID": 75,
    "DateLastStatusUpdate": "2018-11-19T06:39:00Z",
    "DataQualityLevel": 3,
    "DateCreated": "2016-02-13T00:23:00Z",
    "SubmissionStatusTypeID": 200
}