{
    "UserComments": [
        {
            "ID": 21088,
            "ChargePointID": 79253,
            "CommentTypeID": 10,
            "UserName": "polianto",
            "Comment": "You can go to  \"my profile\" -> \"my upload\" and delete it \r\n",
            "DateCreated": "2019-06-08T09:34:33.56Z",
            "User": {
                "ID": 1606,
                "Username": "polianto"
            },
            "CheckinStatusTypeID": 0
        },
        {
            "ID": 21084,
            "ChargePointID": 79253,
            "CommentTypeID": 10,
            "UserName": "Phevy",
            "Comment": "I added the photo to the wrong location. but I cannot remove it now.",
            "DateCreated": "2019-06-07T00:15:21.577Z",
            "User": {
                "ID": 15969,
                "Username": "Phevy"
            },
            "IsActionedByEditor": true
        }
    ],
    "MediaItems": [
        {
            "ID": 18589,
            "ChargePointID": 79253,
            "ItemURL": "https://s3-ap-southeast-2.amazonaws.com/openchargemap/images/CA/OCM79253/OCM-79253.orig.2019060623580195.png",
            "ItemThumbnailURL": "https://s3-ap-southeast-2.amazonaws.com/openchargemap/images/CA/OCM79253/OCM-79253.thmb.2019060623580195.png",
            "Comment": "",
            "IsEnabled": true,
            "IsVideo": false,
            "IsFeaturedItem": false,
            "IsExternalResource": false,
            "User": {
                "ID": 15969,
                "Username": "Phevy"
            },
            "DateCreated": "2019-06-06T23:58:00Z"
        }
    ],
    "IsRecentlyVerified": false,
    "ID": 79253,
    "UUID": "EA69F07B-7676-46FD-AC04-898018AED068",
    "DataProviderID": 1,
    "OperatorID": 23,
    "OperatorsReference": "10548",
    "UsageTypeID": 4,
    "UsageCost": "Free",
    "AddressInfo": {
        "ID": 79599,
        "Title": "Bramalea City Centre",
        "AddressLine1": "25 Peel Centre DR",
        "Town": "Brampton",
        "StateOrProvince": "ON",
        "Postcode": "L6T 5T9",
        "CountryID": 44,
        "Latitude": 43.714566,
        "Longitude": -79.724928,
        "ContactTelephone1": "(905) 793-4682",
        "DistanceUnit": 0
    },
    "Connections": [
        {
            "ID": 113872,
            "ConnectionTypeID": 30,
            "StatusTypeID": 50,
            "LevelID": 2,
            "PowerKW": 13,
            "CurrentTypeID": 20,
            "Quantity": 1
        }
    ],
    "NumberOfPoints": 1,
    "GeneralComments": "1 Tesla Connector, up to 13kW.Available to the public. Self park.",
    "StatusTypeID": 50,
    "DateLastStatusUpdate": "2019-06-08T09:35:00Z",
    "DataQualityLevel": 1,
    "DateCreated": "2017-01-26T21:19:00Z",
    "SubmissionStatusTypeID": 200
}