{
    "IsRecentlyVerified": false,
    "ID": 177587,
    "UUID": "992404C0-B8B7-43A7-A9AA-0A26B945EC61",
    "DataProviderID": 29,
    "DataProvidersReference": "10736",
    "AddressInfo": {
        "ID": 177946,
        "Title": "Pforzheimer Platz",
        "AddressLine1": "Pforzheimer Platz",
        "Town": "Hoyerswerda",
        "Postcode": "02977",
        "CountryID": 87,
        "Latitude": 51.4345,
        "Longitude": 14.24451,
        "DistanceUnit": 0
    },
    "Connections": [
        {
            "ID": 276899,
            "ConnectionTypeID": 25,
            "StatusTypeID": 50,
            "LevelID": 2,
            "PowerKW": 22,
            "CurrentTypeID": 20
        },
        {
            "ID": 276900,
            "ConnectionTypeID": 25,
            "StatusTypeID": 50,
            "LevelID": 2,
            "PowerKW": 22,
            "CurrentTypeID": 20
        }
    ],
    "StatusTypeID": 0,
    "DateLastStatusUpdate": "2021-07-12T02:47:00Z",
    "MetadataValues": [
        {
            "ID": 9881,
            "MetadataFieldID": 4,
            "ItemValue": "Data from the German chargepoint registry provided by Bundesnetzagentur.de under the CC-BY 4.0 license"
        }
    ],
    "DataQualityLevel": 3,
    "DateCreated": "2021-07-08T09:49:00Z",
    "SubmissionStatusTypeID": 100
}