{
    "IsRecentlyVerified": false,
    "ID": 106370,
    "UUID": "62F4EA04-B27B-4D6C-823F-E77FAAFEEAC0",
    "DataProviderID": 1,
    "OperatorID": 170,
    "UsageTypeID": 4,
    "AddressInfo": {
        "ID": 106716,
        "Title": "TSV Seestermüher Marsch",
        "AddressLine1": "Dorfstraße 54a",
        "Town": "Seestermühe",
        "StateOrProvince": "Elmshorn-Land",
        "Postcode": "25371",
        "CountryID": 87,
        "Latitude": 53.70340207562,
        "Longitude": 9.57530576190186,
        "ContactTelephone1": "+49 41216450",
        "RelatedURL": "https://www.stadtwerke-elmshorn.de/eMobil",
        "DistanceUnit": 0
    },
    "Connections": [
        {
            "ID": 149736,
            "ConnectionTypeID": 25,
            "StatusTypeID": 50,
            "LevelID": 2,
            "Amps": 32,
            "Voltage": 400,
            "PowerKW": 22,
            "CurrentTypeID": 20,
            "Quantity": 2
        }
    ],
    "NumberOfPoints": 2,
    "StatusTypeID": 50,
    "DateLastStatusUpdate": "2018-06-21T07:52:00Z",
    "DataQualityLevel": 1,
    "DateCreated": "2018-06-21T07:36:00Z",
    "SubmissionStatusTypeID": 200
}