{
    "IsRecentlyVerified": false,
    "ID": 107464,
    "UUID": "A4E051FE-6B67-46B2-BFB3-FDA71DA4C023",
    "DataProviderID": 1,
    "OperatorID": 3307,
    "UsageTypeID": 1,
    "UsageCost": "Szolgáltatás díja (bruttó): 80Ft/kWh",
    "AddressInfo": {
        "ID": 107810,
        "Title": "Baja, Petőfi sziget",
        "AddressLine1": "Május 1. sétány",
        "Town": "Baja",
        "StateOrProvince": "Bács-Kiskun megye",
        "Postcode": "6500",
        "CountryID": 104,
        "Latitude": 46.1773541235095,
        "Longitude": 18.9464971518677,
        "ContactTelephone1": "+36 82 56-57-58",
        "ContactEmail": "help@mobiliti.hu",
        "RelatedURL": "http://www.mobiliti.hu",
        "DistanceUnit": 0
    },
    "Connections": [
        {
            "ID": 151613,
            "ConnectionTypeID": 25,
            "StatusTypeID": 50,
            "LevelID": 2,
            "Amps": 16,
            "Voltage": 400,
            "PowerKW": 11,
            "CurrentTypeID": 20,
            "Quantity": 2
        }
    ],
    "NumberOfPoints": 2,
    "StatusTypeID": 50,
    "DateLastStatusUpdate": "2020-05-08T07:48:00Z",
    "DataQualityLevel": 1,
    "DateCreated": "2018-07-29T19:47:00Z",
    "SubmissionStatusTypeID": 200
}