{
    "IsRecentlyVerified": false,
    "ID": 149710,
    "UUID": "6FF361AA-1B05-4E94-BA14-F809DD789205",
    "DataProviderID": 1,
    "OperatorID": 3299,
    "UsageTypeID": 1,
    "UsageCost": "DKK  6.20/kWh; andre tilgængelige takster",
    "AddressInfo": {
        "ID": 150063,
        "Title": "IONITY Aabenraa",
        "AddressLine1": "Egevej 6",
        "Town": "Aabenraa",
        "Postcode": "6200",
        "CountryID": 65,
        "Latitude": 55.06505,
        "Longitude": 9.3663,
        "DistanceUnit": 0
    },
    "Connections": [
        {
            "ID": 207846,
            "ConnectionTypeID": 33,
            "StatusTypeID": 50,
            "LevelID": 3,
            "PowerKW": 350,
            "CurrentTypeID": 30,
            "Quantity": 6
        }
    ],
    "NumberOfPoints": 6,
    "StatusTypeID": 50,
    "DateLastStatusUpdate": "2020-03-05T09:32:00Z",
    "DataQualityLevel": 1,
    "DateCreated": "2020-03-04T08:43:00Z",
    "SubmissionStatusTypeID": 200
}