{
    "IsRecentlyVerified": false,
    "ID": 17357,
    "UUID": "C0CCDE38-995E-42E1-AC5E-5D594D2AEBC9",
    "DataProviderID": 22,
    "DataProvidersReference": "5075DC36E6FB5B2F19A38AC28D8A7FCA",
    "AddressInfo": {
        "ID": 17702,
        "Title": "西日本三菱茨木店",
        "AddressLine1": "大阪府茨木市畑田町20-11",
        "CountryID": 114,
        "Latitude": 34.83070282,
        "Longitude": 135.5668257,
        "ContactTelephone1": "072-625-1515",
        "DistanceUnit": 0
    },
    "Connections": [
        {
            "ID": 17598,
            "ConnectionTypeID": 2,
            "LevelID": 2,
            "Amps": 100,
            "Voltage": 480,
            "PowerKW": 48,
            "Quantity": 1
        }
    ],
    "DateLastStatusUpdate": "2013-06-29T08:57:00Z",
    "DataQualityLevel": 2,
    "DateCreated": "2013-06-29T08:57:00Z",
    "SubmissionStatusTypeID": 200
}