{
    "IsRecentlyVerified": false,
    "ID": 62195,
    "UUID": "899EAF69-AAE7-4372-B16F-4747201D4044",
    "DataProviderID": 2,
    "DataProvidersReference": "73863",
    "UsageTypeID": 1,
    "AddressInfo": {
        "ID": 62541,
        "Title": "Wallingford Shopping Center",
        "AddressLine1": "930 N Colony Rd",
        "Town": "Wallingford",
        "StateOrProvince": "CT",
        "Postcode": "06492",
        "CountryID": 2,
        "Latitude": 41.483774,
        "Longitude": -72.807124,
        "ContactTelephone1": "212-759-3535",
        "AccessComments": "24 hours daily",
        "RelatedURL": "",
        "DistanceUnit": 0
    },
    "Connections": [
        {
            "ID": 79098,
            "ConnectionTypeID": 1,
            "LevelID": 2,
            "Amps": 16,
            "Voltage": 230,
            "PowerKW": 3.7,
            "CurrentTypeID": 10,
            "Quantity": 2
        }
    ],
    "DateLastStatusUpdate": "2020-06-26T03:04:00Z",
    "DataQualityLevel": 3,
    "DateCreated": "2016-03-03T11:38:00Z",
    "SubmissionStatusTypeID": 100
}