{
    "IsRecentlyVerified": false,
    "ID": 80284,
    "UUID": "0F5D6F2B-B2D9-49C6-8CA1-456F55F24598",
    "DataProviderID": 2,
    "DataProvidersReference": "80630",
    "UsageTypeID": 1,
    "AddressInfo": {
        "ID": 80630,
        "Title": "Wright Point Office Park",
        "AddressLine1": "5200 Springfield St",
        "Town": "Riverside",
        "StateOrProvince": "OH",
        "Postcode": "45431",
        "CountryID": 2,
        "Latitude": 39.781661,
        "Longitude": -84.118916,
        "ContactTelephone1": "937-233-1801",
        "AccessComments": "7am-7pm M-F; 8am-12pm Sat",
        "RelatedURL": "",
        "DistanceUnit": 0
    },
    "Connections": [
        {
            "ID": 114957,
            "ConnectionTypeID": 1,
            "LevelID": 2,
            "Amps": 16,
            "Voltage": 230,
            "PowerKW": 3.7,
            "CurrentTypeID": 10,
            "Quantity": 2
        }
    ],
    "DateLastStatusUpdate": "2020-06-26T03:02:00Z",
    "DataQualityLevel": 3,
    "DateCreated": "2017-01-31T01:05:00Z",
    "SubmissionStatusTypeID": 100
}