{
    "IsRecentlyVerified": false,
    "ID": 166116,
    "UUID": "92A3B47F-B6D4-440E-9B5E-4395916EC1FC",
    "DataProviderID": 28,
    "DataProvidersReference": "FR*S16*PMB16*48",
    "OperatorID": 3407,
    "UsageTypeID": 5,
    "AddressInfo": {
        "ID": 166475,
        "Title": "BAIGNES-SAINTE RADEGONDE - Parking Mairie - Rampe Saint Nicolas",
        "AddressLine1": "Parking Mairie - Rampe Saint Nicolas 16360 BAIGNES-SAINTE RADEGONDE",
        "CountryID": 80,
        "Latitude": 45.383055,
        "Longitude": -0.236464,
        "AccessComments": "24h/24 7j/7",
        "DistanceUnit": 0
    },
    "Connections": [
        {
            "ID": 244334,
            "ConnectionTypeID": 1036,
            "StatusTypeID": 50,
            "LevelID": 2,
            "PowerKW": 22,
            "CurrentTypeID": 20
        },
        {
            "ID": 244335,
            "ConnectionTypeID": 28,
            "StatusTypeID": 50,
            "LevelID": 2,
            "PowerKW": 22,
            "CurrentTypeID": 10
        },
        {
            "ID": 244336,
            "ConnectionTypeID": 1036,
            "StatusTypeID": 50,
            "LevelID": 2,
            "PowerKW": 22,
            "CurrentTypeID": 20
        },
        {
            "ID": 244337,
            "ConnectionTypeID": 28,
            "StatusTypeID": 50,
            "LevelID": 2,
            "PowerKW": 22,
            "CurrentTypeID": 10
        }
    ],
    "GeneralComments": "Recharge par badge et avec une application smartphone",
    "StatusTypeID": 50,
    "DateLastStatusUpdate": "2020-08-27T05:12:00Z",
    "DataQualityLevel": 2,
    "DateCreated": "2020-08-27T05:12:00Z",
    "SubmissionStatusTypeID": 100
}