{
    "IsRecentlyVerified": false,
    "ID": 33463,
    "UUID": "38FA6A47-9E7C-4268-AA81-0DAD24A27876",
    "DataProviderID": 26,
    "DataProvidersReference": "47380",
    "OperatorID": 178,
    "OperatorsReference": "EVnetNL AL538",
    "UsageCost": "0.00 jaarabonnement",
    "AddressInfo": {
        "ID": 33809,
        "Title": "Looiersplein 25-NU01",
        "AddressLine1": "Looiersplein 25-NU01",
        "Town": "Dongen",
        "Postcode": "5104 GN",
        "CountryID": 159,
        "Latitude": 51.625843,
        "Longitude": 4.942463,
        "ContactTelephone1": "0800-3522365",
        "RelatedURL": "http://www.evnet.nl",
        "DistanceUnit": 0
    },
    "Connections": [
        {
            "ID": 36974,
            "ConnectionTypeID": 25,
            "LevelID": 2,
            "PowerKW": 11,
            "CurrentTypeID": 10
        }
    ],
    "NumberOfPoints": 2,
    "StatusTypeID": 50,
    "DateLastStatusUpdate": "2016-06-04T02:39:00Z",
    "DataQualityLevel": 3,
    "DateCreated": "2015-01-09T06:04:00Z",
    "SubmissionStatusTypeID": 100
}