{
    "IsRecentlyVerified": false,
    "ID": 173598,
    "UUID": "E2B50AA8-4F90-4CDF-8500-C7102A44CA42",
    "DataProviderID": 18,
    "DataProvidersReference": "019107ecbe557508ad449304fbd4ee43",
    "OperatorID": 25,
    "UsageTypeID": 4,
    "AddressInfo": {
        "ID": 173957,
        "Title": "Durham Road (Islington)",
        "AddressLine1": "Durham Road (Islington)",
        "Town": "Islington ",
        "Postcode": "N7 7DL",
        "CountryID": 1,
        "Latitude": 51.564096,
        "Longitude": -0.112584,
        "AccessComments": "",
        "RelatedURL": "https://www.sourcelondon.net",
        "DistanceUnit": 0
    },
    "Connections": [
        {
            "ID": 266678,
            "ConnectionTypeID": 1,
            "Reference": "1",
            "StatusTypeID": 50,
            "LevelID": 2,
            "Amps": 13,
            "Voltage": 230,
            "PowerKW": 3,
            "CurrentTypeID": 10
        },
        {
            "ID": 266679,
            "ConnectionTypeID": 25,
            "Reference": "2",
            "StatusTypeID": 50,
            "LevelID": 2,
            "Amps": 32,
            "Voltage": 230,
            "PowerKW": 7,
            "CurrentTypeID": 10
        }
    ],
    "StatusTypeID": 0,
    "DateLastStatusUpdate": "2021-03-03T11:25:00Z",
    "MetadataValues": [
        {
            "ID": 8520,
            "MetadataFieldID": 4,
            "ItemValue": "Contains public sector information licensed under the Open Government Licence v2.0. http://www.nationalarchives.gov.uk/doc/open-government-licence/version/2/"
        }
    ],
    "DataQualityLevel": 3,
    "DateCreated": "2021-03-03T11:25:00Z",
    "SubmissionStatusTypeID": 100
}