{
    "IsRecentlyVerified": false,
    "ID": 68290,
    "UUID": "B2A24A6F-CDD7-4392-8C90-5FF5F1F23BB7",
    "DataProviderID": 26,
    "DataProvidersReference": "93369",
    "OperatorID": 73,
    "OperatorsReference": "EV-Box EVB-P1416003",
    "UsageCost": "0.00 jaarabonnement",
    "AddressInfo": {
        "ID": 68636,
        "Title": "K R Poststraat 91-1",
        "AddressLine1": "K R Poststraat 91-1",
        "Town": "Heerenveen",
        "Postcode": "8441 EN",
        "CountryID": 159,
        "Latitude": 52.96386,
        "Longitude": 5.92772,
        "RelatedURL": "http://www.ev-box.nl",
        "DistanceUnit": 0
    },
    "Connections": [
        {
            "ID": 95201,
            "ConnectionTypeID": 25,
            "LevelID": 2,
            "PowerKW": 5,
            "CurrentTypeID": 10
        },
        {
            "ID": 95202,
            "ConnectionTypeID": 25,
            "LevelID": 2,
            "PowerKW": 5,
            "CurrentTypeID": 10
        }
    ],
    "NumberOfPoints": 1,
    "StatusTypeID": 50,
    "DateLastStatusUpdate": "2016-06-04T02:37:00Z",
    "DataQualityLevel": 3,
    "DateCreated": "2016-06-04T02:37:00Z",
    "SubmissionStatusTypeID": 100
}