{
    "IsRecentlyVerified": false,
    "ID": 57786,
    "UUID": "E0D701B8-2143-44D9-AB83-A6D77D6FD9B7",
    "DataProviderID": 1,
    "OperatorID": 45,
    "UsageTypeID": 3,
    "AddressInfo": {
        "ID": 58132,
        "Title": "Sandelving Aerospace",
        "AddressLine1": "Münstertäler Straße 22",
        "AddressLine2": "Gewerbepark Breisgau",
        "Town": "Eschbach",
        "StateOrProvince": "VVG der Stadt Heitersheim",
        "Postcode": "79427",
        "CountryID": 87,
        "Latitude": 47.8962836,
        "Longitude": 7.62789880000003,
        "ContactTelephone1": "+49 76349057700",
        "AccessComments": "Nach telefonischer Vereinbarung.\r\n",
        "RelatedURL": "http://www.aircraftspruce.eu/",
        "DistanceUnit": 0
    },
    "Connections": [],
    "NumberOfPoints": 5,
    "StatusTypeID": 50,
    "DateLastStatusUpdate": "2018-06-22T08:19:00Z",
    "DataQualityLevel": 1,
    "DateCreated": "2015-12-23T11:32:00Z",
    "SubmissionStatusTypeID": 200
}