{
    "IsRecentlyVerified": false,
    "ID": 47972,
    "UUID": "FE1A17CA-A906-4597-86C2-A8E9055876C5",
    "DataProviderID": 1,
    "OperatorID": 45,
    "UsageTypeID": 7,
    "UsageCost": "?",
    "AddressInfo": {
        "ID": 48318,
        "Title": "NISSAN Auto IN",
        "AddressLine1": "Poděbradská 292",
        "Town": "Pardubice",
        "Postcode": "530 09",
        "CountryID": 64,
        "Latitude": 50.0592137,
        "Longitude": 15.7503472,
        "ContactTelephone1": "+420 469 775 055",
        "AccessComments": "CZ: Otevírací doba: Po-Pá: 8:00 – 18:00, So: 8:30 – 12:30.\r\nEN: Opening hours: Mo-Fri: 8:00 – 18:00, Sa: 8:30 – 12:30.",
        "DistanceUnit": 0
    },
    "Connections": [
        {
            "ID": 59187,
            "ConnectionTypeID": 2,
            "StatusTypeID": 0,
            "LevelID": 3,
            "PowerKW": 44,
            "CurrentTypeID": 30,
            "Quantity": 1
        }
    ],
    "NumberOfPoints": 1,
    "GeneralComments": "CZ: Zdarma, nebo se slevou pro Nissan Leaf, je potřeba mít PIN kód od Auto In s.r.o. Ostatní auta musí zaplatit přes www.evmap.cz 10 CZK/kWh.\r\nEN: Free for Nissan Leafs serviced here, necessary to have PIN code from Auto In company. Other cars supposedly have to pay via www.evmap.cz 10 CZK/kWh.",
    "StatusTypeID": 0,
    "DateLastStatusUpdate": "2018-06-18T14:22:00Z",
    "DataQualityLevel": 1,
    "DateCreated": "2015-06-19T20:13:00Z",
    "SubmissionStatusTypeID": 200
}