{
    "IsRecentlyVerified": false,
    "ID": 140731,
    "UUID": "1279BAB8-6E26-485F-BAD3-43DF396DF243",
    "DataProviderID": 2,
    "DataProvidersReference": "103840",
    "OperatorID": 5,
    "UsageTypeID": 1,
    "AddressInfo": {
        "ID": 141083,
        "Title": "CT4000FAMILYPAL",
        "AddressLine1": "90 E Tasman Dr",
        "Town": "San Jose",
        "StateOrProvince": "CA",
        "Postcode": "95134",
        "CountryID": 2,
        "Latitude": 37.410286,
        "Longitude": -121.941999,
        "ContactTelephone1": "888-758-4389",
        "AccessComments": "24 hours daily",
        "RelatedURL": "http://www.chargepoint.com/",
        "DistanceUnit": 0
    },
    "Connections": [
        {
            "ID": 196442,
            "ConnectionTypeID": 1,
            "LevelID": 2,
            "Amps": 16,
            "Voltage": 230,
            "PowerKW": 3,
            "CurrentTypeID": 10,
            "Quantity": 4
        }
    ],
    "StatusTypeID": 50,
    "DateLastStatusUpdate": "2019-12-24T09:13:00Z",
    "DataQualityLevel": 3,
    "DateCreated": "2019-12-24T09:13:00Z",
    "SubmissionStatusTypeID": 100
}