{
    "IsRecentlyVerified": false,
    "ID": 158115,
    "UUID": "E671D4B5-4D02-4358-9372-5E6CC6EB2EDD",
    "DataProviderID": 1,
    "OperatorID": 8,
    "UsageTypeID": 1,
    "AddressInfo": {
        "ID": 158469,
        "Title": "Ingram street car park",
        "AddressLine1": "Ingram street car park",
        "Town": "Leeds",
        "Postcode": "LS11 9AW",
        "CountryID": 1,
        "Latitude": 53.788719,
        "Longitude": -1.549335,
        "AccessComments": "",
        "RelatedURL": "https://www.bpchargemaster.com",
        "DistanceUnit": 0
    },
    "Connections": [
        {
            "ID": 227984,
            "ConnectionTypeID": 25,
            "Reference": "1",
            "StatusTypeID": 50,
            "LevelID": 2,
            "Amps": 32,
            "Voltage": 230,
            "PowerKW": 7,
            "CurrentTypeID": 10,
            "Quantity": 2
        },
        {
            "ID": 227985,
            "ConnectionTypeID": 25,
            "Reference": "2",
            "StatusTypeID": 50,
            "LevelID": 2,
            "Amps": 32,
            "Voltage": 400,
            "PowerKW": 22,
            "CurrentTypeID": 20,
            "Quantity": 2
        }
    ],
    "StatusTypeID": 50,
    "DateLastStatusUpdate": "2020-10-10T20:28:00Z",
    "MetadataValues": [
        {
            "ID": 7648,
            "MetadataFieldID": 4,
            "ItemValue": "Contains public sector information licensed under the Open Government Licence v2.0. http://www.nationalarchives.gov.uk/doc/open-government-licence/version/2/"
        }
    ],
    "DataQualityLevel": 3,
    "DateCreated": "2020-06-25T10:00:00Z",
    "SubmissionStatusTypeID": 100
}