{
    "IsRecentlyVerified": false,
    "ID": 135854,
    "UUID": "96D5F5B7-F552-456A-9377-0625CE850A32",
    "DataProviderID": 18,
    "DataProvidersReference": "96f2d9fc1613f10b22456b66fe603940",
    "OperatorID": 2244,
    "UsageTypeID": 5,
    "AddressInfo": {
        "ID": 136200,
        "Title": "Fontarabia Road",
        "AddressLine1": "Fontarabia Road",
        "Town": "London",
        "Postcode": "SW11 5PF",
        "CountryID": 1,
        "Latitude": 51.463719,
        "Longitude": -0.153096,
        "AccessComments": "",
        "RelatedURL": "https://www.ubitricity.com",
        "DistanceUnit": 0
    },
    "Connections": [
        {
            "ID": 190275,
            "ConnectionTypeID": 25,
            "Reference": "suby1100002062",
            "StatusTypeID": 50,
            "LevelID": 2,
            "Amps": 16,
            "Voltage": 230,
            "PowerKW": 3.7,
            "CurrentTypeID": 10
        }
    ],
    "StatusTypeID": 0,
    "DateLastStatusUpdate": "2021-04-25T05:46:00Z",
    "MetadataValues": [
        {
            "ID": 5706,
            "MetadataFieldID": 4,
            "ItemValue": "Contains public sector information licensed under the Open Government Licence v2.0. http://www.nationalarchives.gov.uk/doc/open-government-licence/version/2/"
        }
    ],
    "DataQualityLevel": 3,
    "DateCreated": "2019-12-24T05:22:00Z",
    "SubmissionStatusTypeID": 100
}