{
    "IsRecentlyVerified": false,
    "ID": 136835,
    "UUID": "B2C738DE-5973-40F2-AF64-39ED35B52779",
    "DataProviderID": 1,
    "OperatorID": 20,
    "UsageTypeID": 4,
    "AddressInfo": {
        "ID": 137181,
        "Title": "Cineworld Car Park",
        "AddressLine1": "Martello Way",
        "Town": "York",
        "StateOrProvince": "England",
        "Postcode": "YO32 9JU",
        "CountryID": 1,
        "Latitude": 53.98303335466517,
        "Longitude": -1.0522966330805446,
        "RelatedURL": "https://www.chargeyourcar.org.uk/",
        "DistanceUnit": 0
    },
    "Connections": [
        {
            "ID": 191476,
            "ConnectionTypeID": 25,
            "Reference": "62035-1",
            "StatusTypeID": 50,
            "LevelID": 2,
            "PowerKW": 7,
            "CurrentTypeID": 10,
            "Quantity": 2
        },
        {
            "ID": 256540,
            "ConnectionTypeID": 25,
            "StatusTypeID": 50,
            "LevelID": 2,
            "PowerKW": 7,
            "CurrentTypeID": 10,
            "Quantity": 2
        }
    ],
    "NumberOfPoints": 4,
    "StatusTypeID": 50,
    "DateLastStatusUpdate": "2021-10-20T17:55:00Z",
    "MetadataValues": [
        {
            "ID": 6687,
            "MetadataFieldID": 4,
            "ItemValue": "Contains public sector information licensed under the Open Government Licence v2.0. http://www.nationalarchives.gov.uk/doc/open-government-licence/version/2/"
        }
    ],
    "DataQualityLevel": 3,
    "DateCreated": "2019-12-24T05:23:00Z",
    "SubmissionStatusTypeID": 100
}