{
    "IsRecentlyVerified": false,
    "ID": 14248,
    "UUID": "DE3C753C-67ED-47DB-8585-D0C025D3D9E5",
    "DataProviderID": 2,
    "DataProvidersReference": "46528",
    "UsageTypeID": 7,
    "AddressInfo": {
        "ID": 14145,
        "Title": "Woodmen Nissan",
        "AddressLine1": "6840 Vincent Dr",
        "Town": "Colorado Springs",
        "StateOrProvince": "CO",
        "Postcode": "80918",
        "CountryID": 2,
        "Latitude": 38.931011,
        "Longitude": -104.811075,
        "ContactTelephone1": "719-234-1000",
        "AccessComments": "Dealership business hours\r\nPublic - Call ahead",
        "RelatedURL": "",
        "DistanceUnit": 0
    },
    "Connections": [
        {
            "ID": 16516,
            "ConnectionTypeID": 1,
            "LevelID": 2,
            "Amps": 16,
            "Voltage": 230,
            "PowerKW": 3.7,
            "CurrentTypeID": 10,
            "Quantity": 1
        },
        {
            "ID": 21617,
            "ConnectionTypeID": 2,
            "LevelID": 3,
            "Amps": 100,
            "Voltage": 400,
            "PowerKW": 40,
            "CurrentTypeID": 30,
            "Quantity": 1
        },
        {
            "ID": 149065,
            "ConnectionTypeID": 32,
            "LevelID": 3,
            "Amps": 100,
            "Voltage": 400,
            "PowerKW": 40,
            "CurrentTypeID": 30,
            "Quantity": 1
        }
    ],
    "DateLastStatusUpdate": "2020-06-26T03:00:00Z",
    "DataQualityLevel": 3,
    "DateCreated": "2012-12-06T16:49:00Z",
    "SubmissionStatusTypeID": 100
}