{
    "IsRecentlyVerified": false,
    "ID": 50752,
    "UUID": "D091B4EA-4AFD-4590-8872-564A3E8E79AB",
    "DataProviderID": 26,
    "DataProvidersReference": "64255",
    "OperatorID": 73,
    "OperatorsReference": "EV-Box EVB-P1512142",
    "UsageCost": "0.00 jaarabonnement",
    "AddressInfo": {
        "ID": 51098,
        "Title": "Bovenstraat 201",
        "AddressLine1": "Bovenstraat 201",
        "Town": "Rotterdam",
        "Postcode": "3077 BE",
        "CountryID": 159,
        "Latitude": 51.89681,
        "Longitude": 4.54498,
        "RelatedURL": "http://www.ev-box.nl",
        "DistanceUnit": 0
    },
    "Connections": [
        {
            "ID": 62594,
            "ConnectionTypeID": 25,
            "LevelID": 2,
            "PowerKW": 11,
            "CurrentTypeID": 10
        },
        {
            "ID": 62595,
            "ConnectionTypeID": 25,
            "LevelID": 2,
            "PowerKW": 11,
            "CurrentTypeID": 10
        }
    ],
    "NumberOfPoints": 1,
    "StatusTypeID": 50,
    "DateLastStatusUpdate": "2016-06-04T02:42:00Z",
    "DataQualityLevel": 3,
    "DateCreated": "2015-07-22T09:53:00Z",
    "SubmissionStatusTypeID": 100
}