{
    "IsRecentlyVerified": false,
    "ID": 128226,
    "UUID": "3440BD01-3765-454F-A76B-B72DCB91FF25",
    "DataProviderID": 1,
    "OperatorID": 1,
    "UsageTypeID": 1,
    "AddressInfo": {
        "ID": 128572,
        "Title": "Green Motion Place de la Gare",
        "AddressLine1": "Place de la gare",
        "Town": "La Chaux-de-Fonds",
        "Postcode": "2301",
        "CountryID": 217,
        "Latitude": 47.0996565710943,
        "Longitude": 6.82543697829226,
        "DistanceUnit": 0
    },
    "Connections": [
        {
            "ID": 179469,
            "ConnectionTypeID": 1036,
            "LevelID": 2,
            "Amps": 32,
            "Voltage": 400,
            "PowerKW": 22,
            "CurrentTypeID": 20,
            "Quantity": 2
        },
        {
            "ID": 179470,
            "ConnectionTypeID": 1,
            "StatusTypeID": 50,
            "LevelID": 2,
            "Amps": 32,
            "Voltage": 230,
            "PowerKW": 7,
            "CurrentTypeID": 10,
            "Quantity": 2
        },
        {
            "ID": 179471,
            "ConnectionTypeID": 1037,
            "LevelID": 2,
            "Amps": 16,
            "Voltage": 230,
            "PowerKW": 3.7,
            "CurrentTypeID": 10,
            "Quantity": 2
        }
    ],
    "NumberOfPoints": 2,
    "GeneralComments": "Stationnement limité à 2h / Parking limited to 2h",
    "StatusTypeID": 50,
    "DateLastStatusUpdate": "2019-06-19T12:15:00Z",
    "DataQualityLevel": 1,
    "DateCreated": "2019-06-18T11:25:00Z",
    "SubmissionStatusTypeID": 200
}