{
    "IsRecentlyVerified": false,
    "ID": 142089,
    "UUID": "BCF2C48F-3E51-41A5-9EAB-8AEC63E70B1C",
    "DataProviderID": 2,
    "DataProvidersReference": "99135",
    "OperatorID": 59,
    "UsageTypeID": 1,
    "AddressInfo": {
        "ID": 142441,
        "Title": "Greenlots - 52004D",
        "AddressLine1": "1325 Pearl St.",
        "Town": "Boulder",
        "StateOrProvince": "CO",
        "Postcode": "80302",
        "CountryID": 2,
        "Latitude": 40.0187950134277,
        "Longitude": -105.278198242188,
        "ContactTelephone1": "855-900-7584",
        "AccessComments": "24 hours daily",
        "RelatedURL": "http://greenlots.com/",
        "DistanceUnit": 0
    },
    "Connections": [
        {
            "ID": 198157,
            "ConnectionTypeID": 1,
            "LevelID": 2,
            "Amps": 16,
            "Voltage": 230,
            "PowerKW": 3.7,
            "CurrentTypeID": 10,
            "Quantity": 2
        }
    ],
    "StatusTypeID": 50,
    "DateLastStatusUpdate": "2020-06-26T03:02:00Z",
    "DataQualityLevel": 3,
    "DateCreated": "2019-12-24T09:17:00Z",
    "SubmissionStatusTypeID": 100
}