{
    "IsRecentlyVerified": false,
    "ID": 181058,
    "UUID": "A5FE6B9F-CE1B-4F44-B435-722B260EB71A",
    "DataProviderID": 29,
    "DataProvidersReference": "17999",
    "AddressInfo": {
        "ID": 181417,
        "Title": "Stadtplatz 48",
        "AddressLine1": "Stadtplatz 48",
        "Town": "Mühldorf a. Inn",
        "Postcode": "84453",
        "CountryID": 87,
        "Latitude": 48.241369,
        "Longitude": 12.52421,
        "DistanceUnit": 0
    },
    "Connections": [
        {
            "ID": 284895,
            "ConnectionTypeID": 25,
            "StatusTypeID": 50,
            "LevelID": 2,
            "PowerKW": 22,
            "CurrentTypeID": 20
        },
        {
            "ID": 284896,
            "ConnectionTypeID": 25,
            "StatusTypeID": 50,
            "LevelID": 2,
            "PowerKW": 22,
            "CurrentTypeID": 20
        }
    ],
    "StatusTypeID": 50,
    "DateLastStatusUpdate": "2021-07-12T02:40:00Z",
    "MetadataValues": [
        {
            "ID": 13352,
            "MetadataFieldID": 4,
            "ItemValue": "Data from the German chargepoint registry provided by Bundesnetzagentur.de under the CC-BY 4.0 license"
        }
    ],
    "DataQualityLevel": 3,
    "DateCreated": "2021-07-08T10:01:00Z",
    "SubmissionStatusTypeID": 100
}