{
    "IsRecentlyVerified": false,
    "ID": 28328,
    "UUID": "55AB363B-4D1C-4AA9-89E8-A082BF8A30A9",
    "DataProviderID": 2,
    "DataProvidersReference": "64349",
    "UsageTypeID": 1,
    "AddressInfo": {
        "ID": 28674,
        "Title": "University of Pittsburgh Medical Center - Children's Hospital",
        "AddressLine1": "4401 Penn Ave",
        "Town": "Pittsburgh",
        "StateOrProvince": "PA",
        "Postcode": "15224",
        "CountryID": 2,
        "Latitude": 40.466049,
        "Longitude": -79.952992,
        "ContactTelephone1": "412-692-5325  412-692-8088",
        "AccessComments": "24 hours daily",
        "RelatedURL": "",
        "DistanceUnit": 0
    },
    "Connections": [
        {
            "ID": 31125,
            "ConnectionTypeID": 1,
            "LevelID": 2,
            "Amps": 16,
            "Voltage": 230,
            "PowerKW": 3,
            "CurrentTypeID": 10,
            "Quantity": 2
        }
    ],
    "DateLastStatusUpdate": "2019-04-06T04:03:00Z",
    "DataQualityLevel": 3,
    "DateCreated": "2014-11-28T03:38:00Z",
    "SubmissionStatusTypeID": 100
}