{
    "IsRecentlyVerified": false,
    "ID": 185000,
    "UUID": "F91A5E37-7C95-4FEA-B0E8-BB6FAED41DCB",
    "DataProviderID": 29,
    "DataProvidersReference": "12580",
    "OperatorID": 69,
    "AddressInfo": {
        "ID": 185359,
        "Title": "Hohenwaldeckstr. 20a",
        "AddressLine1": "Hohenwaldeckstr. 20a",
        "Town": "München",
        "Postcode": "81541",
        "CountryID": 87,
        "Latitude": 48.116356,
        "Longitude": 11.594155,
        "DistanceUnit": 0
    },
    "Connections": [
        {
            "ID": 293949,
            "ConnectionTypeID": 25,
            "StatusTypeID": 50,
            "LevelID": 2,
            "PowerKW": 22,
            "CurrentTypeID": 20
        },
        {
            "ID": 293950,
            "ConnectionTypeID": 25,
            "StatusTypeID": 50,
            "LevelID": 2,
            "PowerKW": 22,
            "CurrentTypeID": 20
        }
    ],
    "StatusTypeID": 50,
    "DateLastStatusUpdate": "2021-07-12T02:40:00Z",
    "MetadataValues": [
        {
            "ID": 17291,
            "MetadataFieldID": 4,
            "ItemValue": "Data from the German chargepoint registry provided by Bundesnetzagentur.de under the CC-BY 4.0 license"
        }
    ],
    "DataQualityLevel": 3,
    "DateCreated": "2021-07-08T10:06:00Z",
    "SubmissionStatusTypeID": 100
}