{
    "IsRecentlyVerified": false,
    "ID": 71703,
    "UUID": "BA990202-A563-4B25-9FAF-1F3B3217E675",
    "DataProviderID": 1,
    "OperatorID": 3,
    "OperatorsReference": "PSL-70929",
    "UsageTypeID": 6,
    "UsageCost": "Free",
    "AddressInfo": {
        "ID": 72049,
        "Title": "Mitton Group",
        "AddressLine1": "Mackenzie House",
        "AddressLine2": "Low Moor",
        "Town": "Bradford",
        "StateOrProvince": "England",
        "Postcode": "BD12 0HS",
        "CountryID": 1,
        "Latitude": 53.755491,
        "Longitude": -1.759781,
        "DistanceUnit": 0
    },
    "Connections": [
        {
            "ID": 102701,
            "ConnectionTypeID": 1,
            "StatusTypeID": 50,
            "LevelID": 2,
            "Amps": 32,
            "Voltage": 230,
            "PowerKW": 7,
            "CurrentTypeID": 10,
            "Quantity": 1
        }
    ],
    "NumberOfPoints": 1,
    "StatusTypeID": 50,
    "DateLastStatusUpdate": "2016-11-10T17:25:00Z",
    "DataQualityLevel": 1,
    "DateCreated": "2016-09-03T18:31:00Z",
    "SubmissionStatusTypeID": 200
}