{
    "IsRecentlyVerified": false,
    "ID": 112209,
    "UUID": "90359221-6DDC-4243-913A-D76AA3C4BD72",
    "DataProviderID": 2,
    "DataProvidersReference": "100021",
    "OperatorID": 5,
    "UsageTypeID": 1,
    "AddressInfo": {
        "ID": 112555,
        "Title": "NORDENVW",
        "AddressLine1": "14703 137 Ave NW",
        "Town": "Edmonton",
        "StateOrProvince": "AB",
        "Postcode": "T5L 2L5",
        "CountryID": 44,
        "Latitude": 53.598634,
        "Longitude": -113.576207,
        "ContactTelephone1": "888-758-4389",
        "AccessComments": "24 hours daily",
        "RelatedURL": "http://www.chargepoint.com/",
        "DistanceUnit": 0
    },
    "Connections": [
        {
            "ID": 157760,
            "ConnectionTypeID": 1,
            "LevelID": 2,
            "Amps": 16,
            "Voltage": 230,
            "PowerKW": 3,
            "CurrentTypeID": 10,
            "Quantity": 2
        },
        {
            "ID": 157761,
            "ConnectionTypeID": 32,
            "LevelID": 3,
            "Amps": 100,
            "Voltage": 400,
            "PowerKW": 40,
            "CurrentTypeID": 30,
            "Quantity": 1
        }
    ],
    "DateLastStatusUpdate": "2019-12-24T09:25:00Z",
    "DataQualityLevel": 3,
    "DateCreated": "2018-10-18T23:37:00Z",
    "SubmissionStatusTypeID": 100
}