{
    "MediaItems": [
        {
            "ID": 24771,
            "ChargePointID": 161695,
            "ItemURL": "https://s3-ap-southeast-2.amazonaws.com/openchargemap/images/IT/OCM161695/OCM-161695.orig.2020092416195803.jpg",
            "ItemThumbnailURL": "https://s3-ap-southeast-2.amazonaws.com/openchargemap/images/IT/OCM161695/OCM-161695.thmb.2020092416195803.jpg",
            "Comment": "",
            "IsEnabled": true,
            "IsVideo": false,
            "IsFeaturedItem": false,
            "IsExternalResource": false,
            "User": {
                "ID": 1606,
                "Username": "polianto"
            },
            "DateCreated": "2020-09-24T16:20:00Z"
        },
        {
            "ID": 24772,
            "ChargePointID": 161695,
            "ItemURL": "https://s3-ap-southeast-2.amazonaws.com/openchargemap/images/IT/OCM161695/OCM-161695.orig.2020092416200993.jpg",
            "ItemThumbnailURL": "https://s3-ap-southeast-2.amazonaws.com/openchargemap/images/IT/OCM161695/OCM-161695.thmb.2020092416200993.jpg",
            "Comment": "",
            "IsEnabled": true,
            "IsVideo": false,
            "IsFeaturedItem": false,
            "IsExternalResource": false,
            "User": {
                "ID": 1606,
                "Username": "polianto"
            },
            "DateCreated": "2020-09-24T16:20:00Z"
        }
    ],
    "IsRecentlyVerified": false,
    "ID": 161695,
    "UUID": "971B5F66-2C0B-4B6D-8471-EC1596C23D02",
    "DataProviderID": 1,
    "OperatorID": 3327,
    "UsageTypeID": 4,
    "AddressInfo": {
        "ID": 162052,
        "Title": "Chiesa della Santa Famiglia PIANCAMUNO | BECHARGE",
        "AddressLine1": "Via Giovanni Paolo II",
        "AddressLine2": "Beata",
        "Town": "Pian Camuno",
        "StateOrProvince": "BS",
        "Postcode": "25050",
        "CountryID": 112,
        "Latitude": 45.83558239488019,
        "Longitude": 10.137435886476851,
        "ContactTelephone1": "02-49527730",
        "ContactEmail": "emobility@buildingenergy.it",
        "RelatedURL": "https://www.bec.energy/",
        "DistanceUnit": 0
    },
    "Connections": [
        {
            "ID": 232675,
            "ConnectionTypeID": 25,
            "StatusTypeID": 50,
            "LevelID": 2,
            "Amps": 32,
            "Voltage": 400,
            "PowerKW": 22,
            "CurrentTypeID": 20,
            "Quantity": 2
        }
    ],
    "NumberOfPoints": 2,
    "StatusTypeID": 50,
    "DateLastStatusUpdate": "2020-09-24T16:20:00Z",
    "DataQualityLevel": 1,
    "DateCreated": "2020-07-21T13:35:00Z",
    "SubmissionStatusTypeID": 200
}