{
    "MediaItems": [
        {
            "ID": 8509,
            "ChargePointID": 56906,
            "ItemURL": "https://s3-ap-southeast-2.amazonaws.com/openchargemap/images/DE/OCM56906/OCM-56906.orig.2016102919065151.jpg",
            "ItemThumbnailURL": "https://s3-ap-southeast-2.amazonaws.com/openchargemap/images/DE/OCM56906/OCM-56906.thmb.2016102919065151.jpg",
            "Comment": "",
            "IsEnabled": true,
            "IsVideo": false,
            "IsFeaturedItem": false,
            "IsExternalResource": false,
            "User": {
                "ID": 11914,
                "Username": "Heiko Schmidt"
            },
            "DateCreated": "2016-10-29T19:07:00Z"
        }
    ],
    "IsRecentlyVerified": false,
    "ID": 56906,
    "UUID": "E5ABACEA-C1AD-4C97-B8CA-5CAF6A2084A7",
    "DataProviderID": 1,
    "OperatorID": 196,
    "UsageTypeID": 4,
    "UsageCost": "0",
    "AddressInfo": {
        "ID": 57252,
        "Title": "24 Autohof Langenselbold-West Nomadpower",
        "AddressLine1": "Röntgenstraße",
        "Town": "Neuberg",
        "StateOrProvince": "Main-Kinzig-Kreis",
        "Postcode": "63526",
        "CountryID": 87,
        "Latitude": 50.1817227519468,
        "Longitude": 9.0066562262557,
        "AccessComments": "Diese 24/7 geöffnete Ladestation ist eigentlich für Kühllaster gedacht, kann aber auch zum Aufladen nach Registrierung bei Nomad Power (siehe Webseite) benutzt werden. Freischaltung per App, Webseite oder Telefon. Laden zur Zeit kostenlos. Anschlüsse 49041..49044",
        "RelatedURL": "https://www.nomadpower.eu/de/chargepoints/71/connector/187/",
        "DistanceUnit": 0
    },
    "Connections": [
        {
            "ID": 71839,
            "ConnectionTypeID": 17,
            "StatusTypeID": 50,
            "LevelID": 2,
            "Amps": 32,
            "Voltage": 400,
            "PowerKW": 22,
            "CurrentTypeID": 20,
            "Quantity": 4
        }
    ],
    "NumberOfPoints": 4,
    "StatusTypeID": 50,
    "DateLastStatusUpdate": "2016-12-20T06:30:00Z",
    "DataQualityLevel": 1,
    "DateCreated": "2015-11-16T10:00:00Z",
    "SubmissionStatusTypeID": 200
}