{
    "IsRecentlyVerified": false,
    "ID": 16927,
    "UUID": "2FE089E8-0EF0-4CFE-A0C1-9BB97DB4EB03",
    "DataProviderID": 22,
    "DataProvidersReference": "B91D12ADF38B1A2C446579B64E7C5A7C",
    "AddressInfo": {
        "ID": 17272,
        "Title": "日産プリンス宮城販売多賀城店",
        "AddressLine1": "宮城県多賀城市町前2丁目1-15",
        "CountryID": 114,
        "Latitude": 38.28476442,
        "Longitude": 141.0020292,
        "ContactTelephone1": "022-365-9161",
        "DistanceUnit": 0
    },
    "Connections": [
        {
            "ID": 17168,
            "ConnectionTypeID": 2,
            "LevelID": 2,
            "Amps": 100,
            "Voltage": 480,
            "PowerKW": 48,
            "Quantity": 1
        }
    ],
    "DateLastStatusUpdate": "2013-06-29T08:51:00Z",
    "DataQualityLevel": 2,
    "DateCreated": "2013-06-29T08:51:00Z",
    "SubmissionStatusTypeID": 200
}