{
    "IsRecentlyVerified": false,
    "ID": 144820,
    "UUID": "9CB6EFC2-CEAF-4184-9B8C-C7C46493A00E",
    "DataProviderID": 2,
    "DataProvidersReference": "143849",
    "UsageTypeID": 1,
    "AddressInfo": {
        "ID": 145172,
        "Title": "Danforth Town Center",
        "AddressLine1": "18 Central St",
        "Town": "Danforth",
        "StateOrProvince": "ME",
        "Postcode": "04424",
        "CountryID": 2,
        "Latitude": 45.65917,
        "Longitude": -67.866857,
        "ContactTelephone1": "207-448-2321",
        "AccessComments": "24 hours daily",
        "RelatedURL": "",
        "DistanceUnit": 0
    },
    "Connections": [
        {
            "ID": 201358,
            "ConnectionTypeID": 1,
            "LevelID": 2,
            "Amps": 16,
            "Voltage": 230,
            "PowerKW": 3.7,
            "CurrentTypeID": 10,
            "Quantity": 2
        }
    ],
    "StatusTypeID": 50,
    "DateLastStatusUpdate": "2020-06-26T03:09:00Z",
    "DataQualityLevel": 3,
    "DateCreated": "2019-12-24T09:23:00Z",
    "SubmissionStatusTypeID": 100
}