{
    "IsRecentlyVerified": false,
    "ID": 121177,
    "UUID": "BC1F2D0D-867C-449A-A2EA-C2F9338380D1",
    "DataProviderID": 2,
    "DataProvidersReference": "118933",
    "OperatorID": 39,
    "UsageTypeID": 4,
    "AddressInfo": {
        "ID": 121523,
        "Title": "Premier Tech Center",
        "AddressLine1": "2810 North Parham Road",
        "Town": "Richmond",
        "StateOrProvince": "VA",
        "Postcode": "23294",
        "CountryID": 2,
        "Latitude": 37.6276096,
        "Longitude": -77.5499941,
        "ContactTelephone1": "800-663-5633",
        "AccessComments": "MO: Not Specified; TU: Not Specified; WE: Not Specified; TH: Not Specified; FR: Not Specified; SA: Not Specified; SU: Not Specified",
        "RelatedURL": "http://www.semacharge.com/",
        "DistanceUnit": 0
    },
    "Connections": [
        {
            "ID": 170614,
            "ConnectionTypeID": 1,
            "LevelID": 2,
            "Amps": 16,
            "Voltage": 230,
            "PowerKW": 3,
            "CurrentTypeID": 10,
            "Quantity": 2
        }
    ],
    "DateLastStatusUpdate": "2019-04-01T04:59:00Z",
    "DataQualityLevel": 3,
    "DateCreated": "2019-04-01T04:59:00Z",
    "SubmissionStatusTypeID": 100
}