{
    "IsRecentlyVerified": false,
    "ID": 145547,
    "UUID": "BCA2BA8F-5764-4800-9D9F-C644200AC226",
    "DataProviderID": 2,
    "DataProvidersReference": "145131",
    "OperatorID": 9,
    "UsageTypeID": 1,
    "AddressInfo": {
        "ID": 145899,
        "Title": "REVISION MARINE",
        "AddressLine1": "301 10th Street",
        "Town": "Port Townsend",
        "StateOrProvince": "WA",
        "Postcode": "98368",
        "CountryID": 2,
        "Latitude": 48.10697,
        "Longitude": -122.779991,
        "ContactTelephone1": "888-998-2546",
        "AccessComments": "MON: 24 hours | TUE: 24 hours | WED: 24 hours | THU: 24 hours | FRI: 24 hours | SAT: 24 hours | SUN: 24 hours",
        "RelatedURL": "http://www.blinkcharging.com/",
        "DistanceUnit": 0
    },
    "Connections": [
        {
            "ID": 202253,
            "ConnectionTypeID": 1,
            "LevelID": 2,
            "Amps": 16,
            "Voltage": 230,
            "PowerKW": 3.7,
            "CurrentTypeID": 10,
            "Quantity": 1
        }
    ],
    "StatusTypeID": 50,
    "DateLastStatusUpdate": "2020-06-26T03:11:00Z",
    "DataQualityLevel": 3,
    "DateCreated": "2019-12-24T09:25:00Z",
    "SubmissionStatusTypeID": 100
}