{
    "MediaItems": [
        {
            "ID": 24959,
            "ChargePointID": 30196,
            "ItemURL": "https://s3-ap-southeast-2.amazonaws.com/openchargemap/images/GB/OCM30196/OCM-30196.orig.2020100520491481.jpg",
            "ItemThumbnailURL": "https://s3-ap-southeast-2.amazonaws.com/openchargemap/images/GB/OCM30196/OCM-30196.thmb.2020100520491481.jpg",
            "Comment": "Vulcan Street staff car park entrance",
            "IsEnabled": true,
            "IsVideo": false,
            "IsFeaturedItem": false,
            "IsExternalResource": false,
            "User": {
                "ID": 26009,
                "Username": "mcv84"
            },
            "DateCreated": "2020-10-05T20:49:00Z"
        },
        {
            "ID": 24958,
            "ChargePointID": 30196,
            "ItemURL": "https://s3-ap-southeast-2.amazonaws.com/openchargemap/images/GB/OCM30196/OCM-30196.orig.2020100520480047.jpg",
            "ItemThumbnailURL": "https://s3-ap-southeast-2.amazonaws.com/openchargemap/images/GB/OCM30196/OCM-30196.thmb.2020100520480047.jpg",
            "Comment": "Charge point",
            "IsEnabled": true,
            "IsVideo": false,
            "IsFeaturedItem": false,
            "IsExternalResource": false,
            "User": {
                "ID": 26009,
                "Username": "mcv84"
            },
            "DateCreated": "2020-10-05T20:48:00Z"
        },
        {
            "ID": 24957,
            "ChargePointID": 30196,
            "ItemURL": "https://s3-ap-southeast-2.amazonaws.com/openchargemap/images/GB/OCM30196/OCM-30196.orig.2020100520471522.jpg",
            "ItemThumbnailURL": "https://s3-ap-southeast-2.amazonaws.com/openchargemap/images/GB/OCM30196/OCM-30196.thmb.2020100520471522.jpg",
            "Comment": "Located behind portacabins adjacent to pedestrian crossing entrance",
            "IsEnabled": true,
            "IsVideo": false,
            "IsFeaturedItem": false,
            "IsExternalResource": false,
            "User": {
                "ID": 26009,
                "Username": "mcv84"
            },
            "DateCreated": "2020-10-05T20:47:00Z"
        },
        {
            "ID": 24955,
            "ChargePointID": 30196,
            "ItemURL": "https://s3-ap-southeast-2.amazonaws.com/openchargemap/images/GB/OCM30196/OCM-30196.orig.2020100520455995.jpg",
            "ItemThumbnailURL": "https://s3-ap-southeast-2.amazonaws.com/openchargemap/images/GB/OCM30196/OCM-30196.thmb.2020100520455995.jpg",
            "Comment": "Car park subject to tidal flooding!",
            "IsEnabled": true,
            "IsVideo": false,
            "IsFeaturedItem": false,
            "IsExternalResource": false,
            "User": {
                "ID": 26009,
                "Username": "mcv84"
            },
            "DateCreated": "2020-10-05T20:46:00Z"
        },
        {
            "ID": 24956,
            "ChargePointID": 30196,
            "ItemURL": "https://s3-ap-southeast-2.amazonaws.com/openchargemap/images/GB/OCM30196/OCM-30196.orig.2020100520462399.jpg",
            "ItemThumbnailURL": "https://s3-ap-southeast-2.amazonaws.com/openchargemap/images/GB/OCM30196/OCM-30196.thmb.2020100520462399.jpg",
            "Comment": "Car park closing times",
            "IsEnabled": true,
            "IsVideo": false,
            "IsFeaturedItem": false,
            "IsExternalResource": false,
            "User": {
                "ID": 26009,
                "Username": "mcv84"
            },
            "DateCreated": "2020-10-05T20:46:00Z"
        }
    ],
    "IsRecentlyVerified": false,
    "ID": 30196,
    "UUID": "43E33066-41B1-4932-AEA1-386BF57D21E7",
    "DataProviderID": 1,
    "OperatorID": 20,
    "UsageTypeID": 6,
    "AddressInfo": {
        "ID": 30542,
        "Title": "Middlesbrough College Staff Car Park",
        "AddressLine1": "Vulcan Street",
        "Town": "Middlesbrough",
        "Postcode": "TS2 1PP",
        "CountryID": 1,
        "Latitude": 54.580919374117144,
        "Longitude": -1.2256352331556855,
        "AccessComments": "Closes Monday to Thursday 21:30, Friday 21:00, weekend access by request",
        "DistanceUnit": 0
    },
    "Connections": [
        {
            "ID": 33409,
            "ConnectionTypeID": 25,
            "Reference": "0",
            "StatusTypeID": 0,
            "LevelID": 2,
            "PowerKW": 7,
            "CurrentTypeID": 10,
            "Quantity": 2
        }
    ],
    "StatusTypeID": 0,
    "DateLastStatusUpdate": "2020-10-08T20:53:00Z",
    "MetadataValues": [
        {
            "ID": 1276,
            "MetadataFieldID": 4,
            "ItemValue": "Contains public sector information licensed under the Open Government Licence v2.0. http://www.nationalarchives.gov.uk/doc/open-government-licence/version/2/"
        }
    ],
    "DataQualityLevel": 3,
    "DateCreated": "2014-12-02T01:23:00Z",
    "SubmissionStatusTypeID": 200
}