{
    "IsRecentlyVerified": false,
    "ID": 186758,
    "UUID": "37BA5DB2-8A77-46B7-B007-093A4E09E3CB",
    "DataProviderID": 29,
    "DataProvidersReference": "9094",
    "AddressInfo": {
        "ID": 187117,
        "Title": "Campusallee 1",
        "AddressLine1": "Campusallee 1",
        "Town": "Lemgo",
        "Postcode": "32657",
        "CountryID": 87,
        "Latitude": 52.01732,
        "Longitude": 8.90176,
        "DistanceUnit": 0
    },
    "Connections": [
        {
            "ID": 300093,
            "ConnectionTypeID": 25,
            "StatusTypeID": 50,
            "LevelID": 2,
            "PowerKW": 22,
            "CurrentTypeID": 20
        },
        {
            "ID": 300094,
            "ConnectionTypeID": 25,
            "StatusTypeID": 50,
            "LevelID": 2,
            "PowerKW": 22,
            "CurrentTypeID": 20
        },
        {
            "ID": 300095,
            "ConnectionTypeID": 25,
            "StatusTypeID": 50,
            "LevelID": 2,
            "PowerKW": 22,
            "CurrentTypeID": 20
        },
        {
            "ID": 300096,
            "ConnectionTypeID": 25,
            "StatusTypeID": 50,
            "LevelID": 2,
            "PowerKW": 22,
            "CurrentTypeID": 20
        }
    ],
    "StatusTypeID": 50,
    "DateLastStatusUpdate": "2021-07-12T02:48:00Z",
    "MetadataValues": [
        {
            "ID": 18999,
            "MetadataFieldID": 4,
            "ItemValue": "Data from the German chargepoint registry provided by Bundesnetzagentur.de under the CC-BY 4.0 license"
        }
    ],
    "DataQualityLevel": 3,
    "DateCreated": "2021-07-12T02:48:00Z",
    "SubmissionStatusTypeID": 100
}