{
    "IsRecentlyVerified": false,
    "ID": 155617,
    "UUID": "982CC725-BCF7-47CD-9E27-9A66908914C9",
    "DataProviderID": 1,
    "OperatorID": 3389,
    "UsageTypeID": 1,
    "UsageCost": "$1.00 to Connect, $.21 per minute",
    "AddressInfo": {
        "ID": 155971,
        "Title": "Chickasaw Border Casino - Francis Energy",
        "AddressLine1": "22953 Brown Springs Road",
        "Town": "Thackerville",
        "StateOrProvince": "OK",
        "Postcode": "73459",
        "CountryID": 2,
        "Latitude": 33.73411487472657,
        "Longitude": -97.14521916892221,
        "AccessComments": "Use EVGateway App to manage charging ",
        "RelatedURL": "https://francis.energy/",
        "DistanceUnit": 0
    },
    "Connections": [
        {
            "ID": 219099,
            "ConnectionTypeID": 32,
            "StatusTypeID": 50,
            "LevelID": 3,
            "PowerKW": 50,
            "CurrentTypeID": 30,
            "Quantity": 2,
            "Comments": "BTCPower 50kW"
        },
        {
            "ID": 219100,
            "ConnectionTypeID": 2,
            "StatusTypeID": 50,
            "LevelID": 3,
            "PowerKW": 50,
            "CurrentTypeID": 30,
            "Quantity": 2,
            "Comments": "BTCPower 50kW"
        }
    ],
    "NumberOfPoints": 2,
    "GeneralComments": "50kW DC Fast Chargers Provided by Francis Energy",
    "StatusTypeID": 50,
    "DateLastStatusUpdate": "2020-04-20T13:48:00Z",
    "DataQualityLevel": 1,
    "DateCreated": "2020-04-19T19:49:00Z",
    "SubmissionStatusTypeID": 200
}