{
    "IsRecentlyVerified": false,
    "ID": 29806,
    "UUID": "5B8781B8-B7EE-4028-A300-0CEA76A5D4DB",
    "DataProviderID": 15,
    "DataProvidersReference": "18421",
    "OperatorID": 5,
    "AddressInfo": {
        "ID": 30152,
        "Title": "101 Orchard Ridge Dr",
        "AddressLine1": "101 Orchard Ridge Dr",
        "Town": "Gaithersburg",
        "StateOrProvince": "Maryland",
        "Postcode": "20878",
        "CountryID": 2,
        "Latitude": 39.12828445,
        "Longitude": -77.23201752,
        "ContactTelephone1": "",
        "RelatedURL": "http://carstations.com/18421",
        "DistanceUnit": 0
    },
    "Connections": [
        {
            "ID": 32791,
            "ConnectionTypeID": 1,
            "Reference": "J1772",
            "LevelID": 2
        }
    ],
    "StatusTypeID": 0,
    "DateLastStatusUpdate": "2017-11-04T14:04:00Z",
    "DataQualityLevel": 2,
    "DateCreated": "2014-11-29T05:39:00Z",
    "SubmissionStatusTypeID": 100
}