{
    "IsRecentlyVerified": true,
    "DateLastVerified": "2021-10-16T04:27:00Z",
    "ID": 189585,
    "UUID": "A7DC0909-BBFB-4CA0-9736-7B63F4D0CB7E",
    "DataProviderID": 1,
    "OperatorID": 1,
    "UsageTypeID": 4,
    "UsageCost": "0.40/kWh",
    "AddressInfo": {
        "ID": 189944,
        "Title": "Via Bagni",
        "AddressLine1": "Via Bagni",
        "Town": "Saluzzo",
        "StateOrProvince": "Piemont",
        "Postcode": "12037",
        "CountryID": 112,
        "Latitude": 44.64731434087159,
        "Longitude": 7.496580762506142,
        "DistanceUnit": 0
    },
    "Connections": [
        {
            "ID": 306685,
            "ConnectionTypeID": 1036,
            "StatusTypeID": 50,
            "LevelID": 2,
            "Amps": 32,
            "Voltage": 400,
            "PowerKW": 22,
            "CurrentTypeID": 20,
            "Quantity": 2
        }
    ],
    "NumberOfPoints": 1,
    "StatusTypeID": 50,
    "DateLastStatusUpdate": "2021-10-17T14:55:00Z",
    "DataQualityLevel": 1,
    "DateCreated": "2021-10-16T04:27:00Z",
    "SubmissionStatusTypeID": 200
}