{
    "IsRecentlyVerified": false,
    "ID": 99452,
    "UUID": "86EBE738-A676-4816-A400-A8570BB261BE",
    "DataProviderID": 1,
    "OperatorID": 23,
    "OperatorsReference": "40081",
    "UsageTypeID": 4,
    "AddressInfo": {
        "ID": 99798,
        "Title": "Hacienda Corralejo",
        "AddressLine1": "Ex Hacienda Corralejo SN Estacion Corralejo",
        "Town": "Penjamo",
        "StateOrProvince": "Guanajuato",
        "Postcode": "36921",
        "CountryID": 146,
        "Latitude": 20.471302,
        "Longitude": -101.617433,
        "ContactTelephone1": "+52 469 696 4104",
        "DistanceUnit": 0
    },
    "Connections": [
        {
            "ID": 140541,
            "ConnectionTypeID": 30,
            "StatusTypeID": 50,
            "LevelID": 2,
            "PowerKW": 18,
            "CurrentTypeID": 20,
            "Quantity": 2
        }
    ],
    "NumberOfPoints": 2,
    "GeneralComments": "2 Tesla Connectors, up to 18kW.Available to the public. Self park.",
    "StatusTypeID": 50,
    "DateLastStatusUpdate": "2018-01-26T06:51:00Z",
    "DataQualityLevel": 1,
    "DateCreated": "2018-01-26T06:51:00Z",
    "SubmissionStatusTypeID": 200
}