{
    "IsRecentlyVerified": false,
    "ID": 41976,
    "UUID": "6754FB1F-B2EE-4DB3-A9BB-C8A4E482AEF8",
    "DataProviderID": 2,
    "DataProvidersReference": "1517",
    "UsageTypeID": 2,
    "AddressInfo": {
        "ID": 42322,
        "Title": "LADWP - Truesdale Center",
        "AddressLine1": "11797 Truesdale St",
        "Town": "Sun Valley",
        "StateOrProvince": "CA",
        "Postcode": "91352",
        "CountryID": 2,
        "Latitude": 34.2483191527193,
        "Longitude": -118.387971374344,
        "ContactTelephone1": "",
        "AccessComments": "Fleet use only",
        "RelatedURL": "",
        "DistanceUnit": 0
    },
    "Connections": [
        {
            "ID": 50345,
            "ConnectionTypeID": 1,
            "LevelID": 2,
            "Amps": 16,
            "Voltage": 230,
            "PowerKW": 3.7,
            "CurrentTypeID": 10,
            "Quantity": 15
        }
    ],
    "DateLastStatusUpdate": "2020-06-26T02:57:00Z",
    "DataQualityLevel": 3,
    "DateCreated": "2015-02-23T02:09:00Z",
    "SubmissionStatusTypeID": 100
}