{
    "IsRecentlyVerified": false,
    "ID": 101797,
    "UUID": "0A437FD2-B4F5-4550-9D9C-577271F84DD6",
    "DataProviderID": 1,
    "OperatorID": 1,
    "UsageTypeID": 4,
    "AddressInfo": {
        "ID": 102143,
        "Title": "Harbigstraße ",
        "AddressLine1": "Harbigstraße ",
        "Town": " Hückelhoven",
        "StateOrProvince": "Kreis Heinsberg",
        "Postcode": "41836",
        "CountryID": 87,
        "Latitude": 51.0526932517827,
        "Longitude": 6.221436381475769,
        "AccessComments": "24/7 nutzbar, keine markierten Parkplätze. Anfahrt über Parkleitsystem \"P1 Stadion\" , dann die letzten beiden Parkplätze vor der Straßenkreuzung Harbigstraße / Am Parkhof. Betreiber ist NEW; mit beliebiger Ladekarte freischaltbar.",
        "RelatedURL": "http://www.new.de",
        "DistanceUnit": 0
    },
    "Connections": [
        {
            "ID": 143692,
            "ConnectionTypeID": 25,
            "StatusTypeID": 50,
            "LevelID": 2,
            "Amps": 32,
            "Voltage": 400,
            "PowerKW": 22,
            "CurrentTypeID": 20,
            "Quantity": 2
        }
    ],
    "NumberOfPoints": 2,
    "StatusTypeID": 50,
    "DateLastStatusUpdate": "2018-04-09T11:46:00Z",
    "DataQualityLevel": 1,
    "DateCreated": "2018-04-09T11:46:00Z",
    "SubmissionStatusTypeID": 200
}