{
    "IsRecentlyVerified": false,
    "ID": 107218,
    "UUID": "476F99C6-ADE7-4EB5-8933-A72091B9F965",
    "DataProviderID": 1,
    "OperatorID": 220,
    "UsageTypeID": 4,
    "AddressInfo": {
        "ID": 107564,
        "Title": "Lange Straße",
        "AddressLine1": "Lange Straße 6",
        "Town": "Hamburg",
        "StateOrProvince": "Hamburg",
        "Postcode": "20359",
        "CountryID": 87,
        "Latitude": 53.54727980000001,
        "Longitude": 9.95645890000003,
        "AccessComments": "24/7 nutzbar",
        "DistanceUnit": 0
    },
    "Connections": [
        {
            "ID": 151220,
            "ConnectionTypeID": 1036,
            "StatusTypeID": 50,
            "LevelID": 2,
            "Amps": 16,
            "Voltage": 400,
            "PowerKW": 11,
            "CurrentTypeID": 20,
            "Quantity": 1
        },
        {
            "ID": 151221,
            "ConnectionTypeID": 2,
            "StatusTypeID": 50,
            "LevelID": 3,
            "PowerKW": 50,
            "CurrentTypeID": 30,
            "Quantity": 1
        },
        {
            "ID": 151222,
            "ConnectionTypeID": 33,
            "StatusTypeID": 50,
            "LevelID": 3,
            "PowerKW": 50,
            "CurrentTypeID": 30,
            "Quantity": 1
        }
    ],
    "NumberOfPoints": 3,
    "StatusTypeID": 50,
    "DateLastStatusUpdate": "2018-07-23T07:16:00Z",
    "DataQualityLevel": 1,
    "DateCreated": "2018-07-23T07:16:00Z",
    "SubmissionStatusTypeID": 200
}