{
    "IsRecentlyVerified": false,
    "ID": 81466,
    "UUID": "8279AF9F-C226-4028-B3DE-C340CBB6A868",
    "DataProviderID": 1,
    "OperatorID": 23,
    "OperatorsReference": "24377",
    "UsageTypeID": 6,
    "AddressInfo": {
        "ID": 81812,
        "Title": "Hotel Gitschberg",
        "AddressLine1": "Via Endereck, 2",
        "Town": "Maranza ",
        "StateOrProvince": "BZ",
        "Postcode": "39037",
        "CountryID": 112,
        "Latitude": 46.8229216339398,
        "Longitude": 11.6673216903656,
        "ContactTelephone1": "+39 0472 520 170",
        "ContactEmail": "info@gitschberg.it",
        "RelatedURL": "http://www.gitschberg.it/",
        "DistanceUnit": 0
    },
    "Connections": [
        {
            "ID": 116202,
            "ConnectionTypeID": 30,
            "StatusTypeID": 50,
            "LevelID": 2,
            "Amps": 16,
            "Voltage": 400,
            "PowerKW": 11,
            "CurrentTypeID": 20,
            "Quantity": 1
        }
    ],
    "NumberOfPoints": 1,
    "GeneralComments": "Tesla Destination Charging",
    "StatusTypeID": 50,
    "DateLastStatusUpdate": "2018-10-03T22:45:00Z",
    "DataQualityLevel": 1,
    "DateCreated": "2017-02-02T16:33:00Z",
    "SubmissionStatusTypeID": 200
}