{
    "IsRecentlyVerified": false,
    "ID": 123613,
    "UUID": "0034392C-90F3-4AC6-91FF-3BFA4D4F07C3",
    "DataProviderID": 2,
    "DataProvidersReference": "66898",
    "UsageTypeID": 2,
    "AddressInfo": {
        "ID": 123959,
        "Title": "NEXCOM - Norfolk",
        "AddressLine1": "3280 Virginia Beach Blvd",
        "Town": "Virginia Beach",
        "StateOrProvince": "VA",
        "Postcode": "23452",
        "CountryID": 2,
        "Latitude": 36.9431333,
        "Longitude": -76.3099396,
        "ContactTelephone1": "",
        "AccessComments": "",
        "RelatedURL": "",
        "DistanceUnit": 0
    },
    "Connections": [
        {
            "ID": 173623,
            "ConnectionTypeID": 1,
            "LevelID": 2,
            "Amps": 16,
            "Voltage": 230,
            "PowerKW": 3.7,
            "CurrentTypeID": 10,
            "Quantity": 2
        }
    ],
    "DateLastStatusUpdate": "2020-06-26T02:59:00Z",
    "DataQualityLevel": 3,
    "DateCreated": "2019-04-06T05:03:00Z",
    "SubmissionStatusTypeID": 100
}