{
    "IsRecentlyVerified": false,
    "ID": 123820,
    "UUID": "AD9E46E7-AB24-4100-99B9-BC0C7239E343",
    "DataProviderID": 2,
    "DataProvidersReference": "49342",
    "UsageTypeID": 1,
    "AddressInfo": {
        "ID": 124166,
        "Title": "Homewood Suites - San Jose Airport",
        "AddressLine1": "10 W Trimble Rd",
        "Town": "San Jose",
        "StateOrProvince": "CA",
        "Postcode": "95131",
        "CountryID": 2,
        "Latitude": 37.38514,
        "Longitude": -121.9288,
        "ContactTelephone1": "408-428-9900",
        "AccessComments": "24 hours daily; for guest use only",
        "RelatedURL": "",
        "DistanceUnit": 0
    },
    "Connections": [
        {
            "ID": 173849,
            "ConnectionTypeID": 1,
            "LevelID": 2,
            "Amps": 16,
            "Voltage": 230,
            "PowerKW": 3.7,
            "CurrentTypeID": 10,
            "Quantity": 2
        }
    ],
    "DateLastStatusUpdate": "2020-06-26T02:59:00Z",
    "DataQualityLevel": 3,
    "DateCreated": "2019-04-06T05:03:00Z",
    "SubmissionStatusTypeID": 100
}