{
    "IsRecentlyVerified": false,
    "ID": 158251,
    "UUID": "EF81C7FA-390B-4201-A713-0CDF13C0E29A",
    "DataProviderID": 2,
    "DataProvidersReference": "153889",
    "OperatorID": 9,
    "UsageTypeID": 1,
    "AddressInfo": {
        "ID": 158605,
        "Title": "The Bristol Palm Beach",
        "AddressLine1": "440 Royal Palm Way, Suite 100",
        "Town": "Palm Beach",
        "StateOrProvince": "FL",
        "Postcode": "33480",
        "CountryID": 2,
        "Latitude": 26.703761,
        "Longitude": -80.049946,
        "ContactTelephone1": "888-998-2546",
        "AccessComments": "MON: 24 hours | TUE: 24 hours | WED: 24 hours | THU: 24 hours | FRI: 24 hours | SAT: 24 hours | SUN: 24 hours",
        "RelatedURL": "http://www.blinkcharging.com/",
        "DistanceUnit": 0
    },
    "Connections": [
        {
            "ID": 228205,
            "ConnectionTypeID": 1,
            "LevelID": 2,
            "Amps": 16,
            "Voltage": 230,
            "PowerKW": 3.7,
            "CurrentTypeID": 10,
            "Quantity": 1
        }
    ],
    "StatusTypeID": 50,
    "DateLastStatusUpdate": "2020-06-26T02:52:00Z",
    "DataQualityLevel": 3,
    "DateCreated": "2020-06-26T02:52:00Z",
    "SubmissionStatusTypeID": 100
}