{
    "IsRecentlyVerified": false,
    "ID": 152574,
    "UUID": "65ED865C-B491-4817-A967-E7CA2363A222",
    "DataProviderID": 28,
    "DataProvidersReference": "FR*S41*P41220-81",
    "UsageTypeID": 5,
    "AddressInfo": {
        "ID": 152927,
        "Title": "Selles-sur-Cher | Rue du Moulinet",
        "AddressLine1": "Rue du Moulinet 41130 Selles-sur-Cher",
        "CountryID": 80,
        "Latitude": 47.273795,
        "Longitude": 1.553632,
        "AccessComments": "24/24 7/7",
        "DistanceUnit": 0
    },
    "Connections": [
        {
            "ID": 213643,
            "ConnectionTypeID": 25,
            "StatusTypeID": 50,
            "LevelID": 2,
            "PowerKW": 18,
            "CurrentTypeID": 20
        },
        {
            "ID": 213644,
            "ConnectionTypeID": 28,
            "StatusTypeID": 50,
            "LevelID": 2,
            "PowerKW": 18,
            "CurrentTypeID": 10
        },
        {
            "ID": 246702,
            "ConnectionTypeID": 25,
            "StatusTypeID": 50,
            "LevelID": 2,
            "PowerKW": 18,
            "CurrentTypeID": 20
        },
        {
            "ID": 246703,
            "ConnectionTypeID": 28,
            "StatusTypeID": 50,
            "LevelID": 2,
            "PowerKW": 18,
            "CurrentTypeID": 10
        }
    ],
    "GeneralComments": "",
    "StatusTypeID": 50,
    "DateLastStatusUpdate": "2020-08-27T05:13:00Z",
    "DataQualityLevel": 2,
    "DateCreated": "2020-03-15T10:53:00Z",
    "SubmissionStatusTypeID": 100
}