{
    "IsRecentlyVerified": false,
    "ID": 96779,
    "UUID": "A5B02D22-8FED-455F-AA73-4BF73A6383B6",
    "DataProviderID": 2,
    "DataProvidersReference": "88627",
    "OperatorID": 5,
    "UsageTypeID": 1,
    "AddressInfo": {
        "ID": 97125,
        "Title": "BUCKS",
        "AddressLine1": "519 W McKinley Ave",
        "Town": "Milwaukee",
        "StateOrProvince": "WI",
        "Postcode": "53212",
        "CountryID": 2,
        "Latitude": 43.0465438,
        "Longitude": -87.9183363,
        "ContactTelephone1": "888-758-4389",
        "AccessComments": "24 hours daily",
        "RelatedURL": "http://www.chargepoint.com/",
        "DistanceUnit": 0
    },
    "Connections": [
        {
            "ID": 137058,
            "ConnectionTypeID": 1,
            "LevelID": 2,
            "Amps": 16,
            "Voltage": 230,
            "PowerKW": 3.7,
            "CurrentTypeID": 10,
            "Quantity": 2
        }
    ],
    "DateLastStatusUpdate": "2020-06-26T03:06:00Z",
    "DataQualityLevel": 3,
    "DateCreated": "2017-12-29T21:01:00Z",
    "SubmissionStatusTypeID": 100
}