{
    "IsRecentlyVerified": false,
    "ID": 73687,
    "UUID": "64F48B8B-129C-45DD-B1E5-9B2E96B2A3AA",
    "DataProviderID": 1,
    "OperatorID": 89,
    "OperatorsReference": "CEA-10038",
    "UsageTypeID": 4,
    "UsageCost": "CAD 1.00/hour",
    "AddressInfo": {
        "ID": 74033,
        "Title": "Sur Rue-Ville-Marie-Rue Mackay",
        "AddressLine1": "1428 rue Mackay",
        "Town": "Montréal",
        "StateOrProvince": "QC",
        "Postcode": "H3G 2H9",
        "CountryID": 44,
        "Latitude": 45.495977,
        "Longitude": -73.57747,
        "DistanceUnit": 0
    },
    "Connections": [
        {
            "ID": 105986,
            "ConnectionTypeID": 1,
            "StatusTypeID": 50,
            "LevelID": 2,
            "Amps": 32,
            "Voltage": 230,
            "PowerKW": 7,
            "CurrentTypeID": 10,
            "Quantity": 1
        }
    ],
    "NumberOfPoints": 1,
    "StatusTypeID": 50,
    "DateLastStatusUpdate": "2017-03-30T14:30:00Z",
    "DataQualityLevel": 1,
    "DateCreated": "2016-11-23T22:42:00Z",
    "SubmissionStatusTypeID": 200
}