{
    "IsRecentlyVerified": false,
    "ID": 141636,
    "UUID": "78B2DDB6-B072-4F88-9818-85FE31451ACD",
    "DataProviderID": 2,
    "DataProvidersReference": "150244",
    "OperatorID": 39,
    "UsageTypeID": 1,
    "AddressInfo": {
        "ID": 141988,
        "Title": "6950 CGD",
        "AddressLine1": "6950 Columbia Gateway Drive",
        "Town": "Columbia",
        "StateOrProvince": "MD",
        "Postcode": "21046",
        "CountryID": 2,
        "Latitude": 39.180545,
        "Longitude": -76.800684,
        "ContactTelephone1": "800-663-5633",
        "AccessComments": "MO: Not Specified; TU: Not Specified; WE: Not Specified; TH: Not Specified; FR: Not Specified; SA: Not Specified; SU: Not Specified",
        "RelatedURL": "http://www.semacharge.com/",
        "DistanceUnit": 0
    },
    "Connections": [
        {
            "ID": 197611,
            "ConnectionTypeID": 1,
            "LevelID": 2,
            "Amps": 16,
            "Voltage": 230,
            "PowerKW": 3.7,
            "CurrentTypeID": 10,
            "Quantity": 2
        }
    ],
    "StatusTypeID": 50,
    "DateLastStatusUpdate": "2020-06-26T03:01:00Z",
    "DataQualityLevel": 3,
    "DateCreated": "2019-12-24T09:16:00Z",
    "SubmissionStatusTypeID": 100
}