{
    "IsRecentlyVerified": false,
    "ID": 28289,
    "UUID": "0D828FF3-DD6E-495E-8A9B-51DB7C7E3CA7",
    "DataProviderID": 2,
    "DataProvidersReference": "62547",
    "OperatorID": 5,
    "UsageTypeID": 1,
    "AddressInfo": {
        "ID": 28635,
        "Title": "BMW OF PG",
        "AddressLine1": "2111 W Grove Pkwy",
        "Town": "Pleasant Grove",
        "StateOrProvince": "UT",
        "Postcode": "84062",
        "CountryID": 2,
        "Latitude": 40.3521972,
        "Longitude": -111.769819,
        "ContactTelephone1": "888-758-4389",
        "AccessComments": "24 hours daily",
        "RelatedURL": "http://www.chargepoint.com/",
        "DistanceUnit": 0
    },
    "Connections": [
        {
            "ID": 31085,
            "ConnectionTypeID": 1,
            "LevelID": 2,
            "Amps": 16,
            "Voltage": 230,
            "PowerKW": 3,
            "CurrentTypeID": 10,
            "Quantity": 2
        }
    ],
    "DateLastStatusUpdate": "2019-04-06T04:03:00Z",
    "DataQualityLevel": 3,
    "DateCreated": "2014-11-28T03:38:00Z",
    "SubmissionStatusTypeID": 100
}