{
    "IsRecentlyVerified": false,
    "ID": 186989,
    "UUID": "C0EBBF06-ED2D-4BE7-BA54-0D25BA49B878",
    "DataProviderID": 29,
    "DataProvidersReference": "3790",
    "OperatorID": 3403,
    "AddressInfo": {
        "ID": 187348,
        "Title": "Kirchstraße bei Nr. 34",
        "AddressLine1": "Kirchstraße bei Nr. 34",
        "Town": "Hennigsdorf",
        "Postcode": "16761",
        "CountryID": 87,
        "Latitude": 52.6385,
        "Longitude": 13.2068,
        "DistanceUnit": 0
    },
    "Connections": [
        {
            "ID": 300884,
            "ConnectionTypeID": 25,
            "StatusTypeID": 50,
            "LevelID": 2,
            "PowerKW": 22,
            "CurrentTypeID": 20
        },
        {
            "ID": 300885,
            "ConnectionTypeID": 25,
            "StatusTypeID": 50,
            "LevelID": 2,
            "PowerKW": 22,
            "CurrentTypeID": 20
        }
    ],
    "StatusTypeID": 50,
    "DateLastStatusUpdate": "2021-07-12T02:50:00Z",
    "MetadataValues": [
        {
            "ID": 19229,
            "MetadataFieldID": 4,
            "ItemValue": "Data from the German chargepoint registry provided by Bundesnetzagentur.de under the CC-BY 4.0 license"
        }
    ],
    "DataQualityLevel": 3,
    "DateCreated": "2021-07-12T02:50:00Z",
    "SubmissionStatusTypeID": 100
}