{
    "IsRecentlyVerified": false,
    "ID": 52045,
    "UUID": "B733A8E5-321C-4A46-B942-5B9D3C75B55B",
    "DataProviderID": 1,
    "OperatorID": 150,
    "OperatorsReference": "Cornwall College St Austell - Cornwall",
    "UsageTypeID": 4,
    "UsageCost": "Â£0.50 + Â£0.30/kWh",
    "AddressInfo": {
        "ID": 52391,
        "Title": "Cornwall College St Austell - Cornwall",
        "AddressLine1": "Tregonissey Road",
        "Town": "Saint Austell",
        "Postcode": "PL25 4DJ",
        "CountryID": 1,
        "Latitude": 50.346543,
        "Longitude": -4.784679,
        "AccessComments": "Term Time only",
        "RelatedURL": "http://www.chargepointservices.co.uk",
        "DistanceUnit": 0
    },
    "Connections": [
        {
            "ID": 64572,
            "ConnectionTypeID": 25,
            "StatusTypeID": 50,
            "LevelID": 2,
            "Amps": 32,
            "Voltage": 400,
            "PowerKW": 22,
            "CurrentTypeID": 20,
            "Quantity": 2
        }
    ],
    "NumberOfPoints": 2,
    "StatusTypeID": 0,
    "DateLastStatusUpdate": "2018-11-02T08:45:00Z",
    "MetadataValues": [
        {
            "ID": 1738,
            "MetadataFieldID": 4,
            "ItemValue": "Contains public sector information licensed under the Open Government Licence v2.0. http://www.nationalarchives.gov.uk/doc/open-government-licence/version/2/"
        }
    ],
    "DataQualityLevel": 3,
    "DateCreated": "2015-08-19T08:25:00Z",
    "SubmissionStatusTypeID": 100
}