{
    "IsRecentlyVerified": false,
    "ID": 21263,
    "UUID": "8E82E8A2-D594-4B1D-8C45-3749A75DE5D0",
    "DataProviderID": 1,
    "OperatorID": 82,
    "UsageTypeID": 4,
    "UsageCost": "15€ for 3months",
    "AddressInfo": {
        "ID": 21608,
        "Title": "A2A Villaggio Sereno",
        "AddressLine1": "Traversa Dodicesima Villaggio Sereno",
        "AddressLine2": "Circoscrizione Brescia Sud",
        "Town": "Brescia",
        "StateOrProvince": "Brescia",
        "Postcode": "25125",
        "CountryID": 112,
        "Latitude": 45.51290654687824,
        "Longitude": 10.189181706606524,
        "ContactTelephone1": "800035151",
        "ContactTelephone2": "800035151",
        "RelatedURL": "http://www.e-moving.it/",
        "DistanceUnit": 0
    },
    "Connections": [
        {
            "ID": 23117,
            "ConnectionTypeID": 25,
            "StatusTypeID": 50,
            "LevelID": 2,
            "PowerKW": 3,
            "CurrentTypeID": 10,
            "Quantity": 2
        }
    ],
    "NumberOfPoints": 2,
    "StatusTypeID": 50,
    "DateLastStatusUpdate": "2014-03-17T18:34:00Z",
    "DataQualityLevel": 1,
    "DateCreated": "2014-03-17T18:34:00Z",
    "SubmissionStatusTypeID": 200
}