{
    "IsRecentlyVerified": false,
    "ID": 17575,
    "UUID": "6C05CB43-263F-4608-BAD5-BF11A50F1BBC",
    "DataProviderID": 22,
    "DataProvidersReference": "FB6A4114C5D63FC0BE8286359AFF72CE",
    "AddressInfo": {
        "ID": 17920,
        "Title": "ニッポンレンタカー那覇空港前営業所",
        "AddressLine1": "沖縄県那覇市鏡水438",
        "CountryID": 114,
        "Latitude": 26.21235037,
        "Longitude": 127.6569906,
        "ContactTelephone1": "098-859-0505",
        "DistanceUnit": 0
    },
    "Connections": [
        {
            "ID": 17816,
            "ConnectionTypeID": 2,
            "LevelID": 2,
            "Amps": 100,
            "Voltage": 480,
            "PowerKW": 48,
            "Quantity": 1
        }
    ],
    "DateLastStatusUpdate": "2013-06-29T09:00:00Z",
    "DataQualityLevel": 2,
    "DateCreated": "2013-06-29T09:00:00Z",
    "SubmissionStatusTypeID": 200
}