{
    "IsRecentlyVerified": false,
    "ID": 144901,
    "UUID": "E20F2223-932E-444F-A48E-3A2F51A2B0D8",
    "DataProviderID": 1,
    "OperatorID": 3365,
    "UsageTypeID": 1,
    "AddressInfo": {
        "ID": 145253,
        "Title": "The Hopewell Rocks",
        "AddressLine1": "131 Discovery Rd",
        "Town": "Hopewell Cape",
        "StateOrProvince": "NB",
        "Postcode": "E4H 4Z5",
        "CountryID": 44,
        "Latitude": 45.821839,
        "Longitude": -64.577434,
        "ContactTelephone1": "844-661-6272",
        "AccessComments": "24 hours daily",
        "RelatedURL": "https://echargenetwork.com/",
        "DistanceUnit": 0
    },
    "Connections": [
        {
            "ID": 201452,
            "ConnectionTypeID": 1,
            "LevelID": 2,
            "Amps": 16,
            "Voltage": 230,
            "PowerKW": 3.7,
            "CurrentTypeID": 10,
            "Quantity": 2
        }
    ],
    "StatusTypeID": 50,
    "DateLastStatusUpdate": "2020-11-20T14:21:00Z",
    "DataQualityLevel": 3,
    "DateCreated": "2019-12-24T09:24:00Z",
    "SubmissionStatusTypeID": 100
}