{
    "IsRecentlyVerified": false,
    "ID": 119901,
    "UUID": "D1D77133-50EA-4382-B21A-5FBE43422EE3",
    "DataProviderID": 2,
    "DataProvidersReference": "67291",
    "UsageTypeID": 1,
    "AddressInfo": {
        "ID": 120247,
        "Title": "Embry-Riddle Aeronautical University",
        "AddressLine1": "600 S Clyde Morris Blvd",
        "Town": "Daytona Beach",
        "StateOrProvince": "FL",
        "Postcode": "32114",
        "CountryID": 2,
        "Latitude": 29.19003,
        "Longitude": -81.046837,
        "ContactTelephone1": "386-226-6000",
        "AccessComments": "24 hours daily",
        "RelatedURL": "",
        "DistanceUnit": 0
    },
    "Connections": [
        {
            "ID": 169200,
            "ConnectionTypeID": 1,
            "LevelID": 2,
            "Amps": 16,
            "Voltage": 230,
            "PowerKW": 3.7,
            "CurrentTypeID": 10,
            "Quantity": 2
        }
    ],
    "DateLastStatusUpdate": "2020-06-26T02:52:00Z",
    "DataQualityLevel": 3,
    "DateCreated": "2019-04-01T04:59:00Z",
    "SubmissionStatusTypeID": 100
}