{
    "MediaItems": [
        {
            "ID": 7765,
            "ChargePointID": 58003,
            "ItemURL": "https://s3-ap-southeast-2.amazonaws.com/openchargemap/images/AT/OCM58003/OCM-58003.orig.2016071807025288.jpg",
            "ItemThumbnailURL": "https://s3-ap-southeast-2.amazonaws.com/openchargemap/images/AT/OCM58003/OCM-58003.thmb.2016071807025288.jpg",
            "Comment": "Summer Park",
            "IsEnabled": true,
            "IsVideo": false,
            "IsFeaturedItem": false,
            "IsExternalResource": false,
            "User": {
                "ID": 7832,
                "Username": "MRiedlsperger"
            },
            "DateCreated": "2016-07-18T07:03:00Z"
        },
        {
            "ID": 7766,
            "ChargePointID": 58003,
            "ItemURL": "https://s3-ap-southeast-2.amazonaws.com/openchargemap/images/AT/OCM58003/OCM-58003.orig.2016071807031327.jpg",
            "ItemThumbnailURL": "https://s3-ap-southeast-2.amazonaws.com/openchargemap/images/AT/OCM58003/OCM-58003.thmb.2016071807031327.jpg",
            "Comment": "Summer\r\n",
            "IsEnabled": true,
            "IsVideo": false,
            "IsFeaturedItem": false,
            "IsExternalResource": false,
            "User": {
                "ID": 7832,
                "Username": "MRiedlsperger"
            },
            "DateCreated": "2016-07-18T07:03:00Z"
        },
        {
            "ID": 7764,
            "ChargePointID": 58003,
            "ItemURL": "https://s3-ap-southeast-2.amazonaws.com/openchargemap/images/AT/OCM58003/OCM-58003.orig.2016071807021261.jpg",
            "ItemThumbnailURL": "https://s3-ap-southeast-2.amazonaws.com/openchargemap/images/AT/OCM58003/OCM-58003.thmb.2016071807021261.jpg",
            "Comment": "",
            "IsEnabled": true,
            "IsVideo": false,
            "IsFeaturedItem": false,
            "IsExternalResource": false,
            "User": {
                "ID": 7832,
                "Username": "MRiedlsperger"
            },
            "DateCreated": "2016-07-18T07:02:00Z"
        },
        {
            "ID": 4774,
            "ChargePointID": 58003,
            "ItemURL": "https://s3-ap-southeast-2.amazonaws.com/openchargemap/images/AT/OCM58003/OCM-58003.orig.2016011412131999.jpg",
            "ItemThumbnailURL": "https://s3-ap-southeast-2.amazonaws.com/openchargemap/images/AT/OCM58003/OCM-58003.thmb.2016011412131999.jpg",
            "Comment": "",
            "IsEnabled": true,
            "IsVideo": false,
            "IsFeaturedItem": false,
            "IsExternalResource": false,
            "User": {
                "ID": 7832,
                "Username": "MRiedlsperger"
            },
            "DateCreated": "2016-01-14T12:14:00Z"
        },
        {
            "ID": 4773,
            "ChargePointID": 58003,
            "ItemURL": "https://s3-ap-southeast-2.amazonaws.com/openchargemap/images/AT/OCM58003/OCM-58003.orig.2016011412121257.jpg",
            "ItemThumbnailURL": "https://s3-ap-southeast-2.amazonaws.com/openchargemap/images/AT/OCM58003/OCM-58003.thmb.2016011412121257.jpg",
            "Comment": "",
            "IsEnabled": true,
            "IsVideo": false,
            "IsFeaturedItem": false,
            "IsExternalResource": false,
            "User": {
                "ID": 7832,
                "Username": "MRiedlsperger"
            },
            "DateCreated": "2016-01-14T12:12:00Z"
        },
        {
            "ID": 4772,
            "ChargePointID": 58003,
            "ItemURL": "https://s3-ap-southeast-2.amazonaws.com/openchargemap/images/AT/OCM58003/OCM-58003.orig.2016011412110291.jpg",
            "ItemThumbnailURL": "https://s3-ap-southeast-2.amazonaws.com/openchargemap/images/AT/OCM58003/OCM-58003.thmb.2016011412110291.jpg",
            "Comment": "",
            "IsEnabled": true,
            "IsVideo": false,
            "IsFeaturedItem": false,
            "IsExternalResource": false,
            "User": {
                "ID": 7832,
                "Username": "MRiedlsperger"
            },
            "DateCreated": "2016-01-14T12:11:00Z"
        }
    ],
    "IsRecentlyVerified": false,
    "ID": 58003,
    "UUID": "4E6B006A-3780-4047-B537-90EA418F7292",
    "DataProviderID": 1,
    "OperatorID": 1,
    "UsageTypeID": 5,
    "AddressInfo": {
        "ID": 58349,
        "Title": "Bergbahnen Steinplatte",
        "AddressLine1": "Alpegg 10",
        "Town": "Waidring",
        "StateOrProvince": "Tyrol",
        "Postcode": "6384",
        "CountryID": 19,
        "Latitude": 47.5875522,
        "Longitude": 12.5638068000001,
        "ContactTelephone1": "+43535353530",
        "ContactEmail": "office@steinplatte.co.at",
        "AccessComments": "Charging card available at the tickets sale at Bergbahnen Steinplatte station at the bottom. Free for costumer! New electric charging station directly at the parking area of Steinplatte ski resort in Waidring. The station is next to the “Biathron” (huge white sphere at the entrance of the parking area) www.steinplatte.tirol / www.triassicpark.at",
        "RelatedURL": "http://www.steinplatte.tirol",
        "DistanceUnit": 0
    },
    "Connections": [
        {
            "ID": 73833,
            "ConnectionTypeID": 25,
            "StatusTypeID": 50,
            "LevelID": 2,
            "Amps": 32,
            "Voltage": 400,
            "PowerKW": 11,
            "CurrentTypeID": 20,
            "Quantity": 2
        },
        {
            "ID": 73867,
            "ConnectionTypeID": 28,
            "StatusTypeID": 50,
            "LevelID": 2,
            "Amps": 16,
            "Voltage": 230,
            "PowerKW": 3.7,
            "CurrentTypeID": 10,
            "Quantity": 2
        }
    ],
    "NumberOfPoints": 2,
    "GeneralComments": "2 x Type 2 11kW, 2 Schuko 230V/16A, no Cable;",
    "StatusTypeID": 50,
    "DateLastStatusUpdate": "2016-07-18T07:03:00Z",
    "DataQualityLevel": 1,
    "DateCreated": "2016-01-04T09:34:00Z",
    "SubmissionStatusTypeID": 200
}