{
    "IsRecentlyVerified": false,
    "ID": 32322,
    "UUID": "46180D2B-D4CC-4B7E-8B7B-22923F9ECEA5",
    "DataProviderID": 26,
    "DataProvidersReference": "17010",
    "OperatorID": 162,
    "OperatorsReference": "Nieuw Eyckholt 208",
    "UsageCost": "0.00 gratis",
    "AddressInfo": {
        "ID": 32668,
        "Title": "Nieuw-Eyckholt",
        "AddressLine1": "Nieuw-Eyckholt",
        "Town": "Heerlen",
        "Postcode": "6419 DD",
        "CountryID": 159,
        "Latitude": 50.885749319861,
        "Longitude": 5.9667241573334,
        "DistanceUnit": 0
    },
    "Connections": [
        {
            "ID": 35833,
            "ConnectionTypeID": 28,
            "LevelID": 1,
            "PowerKW": 2.3,
            "CurrentTypeID": 10
        }
    ],
    "NumberOfPoints": 1,
    "StatusTypeID": 50,
    "DateLastStatusUpdate": "2016-06-04T02:38:00Z",
    "DataQualityLevel": 3,
    "DateCreated": "2015-01-09T06:03:00Z",
    "SubmissionStatusTypeID": 100
}