{
    "UserComments": [
        {
            "ID": 21020,
            "ChargePointID": 88477,
            "CommentTypeID": 10,
            "UserName": "polianto",
            "Comment": "https://www.forumelettrico.it/forum/post49535.html#p49535",
            "Rating": 5,
            "RelatedURL": "https://www.forumelettrico.it/forum/post49535.html#p49535",
            "DateCreated": "2019-05-18T15:03:05.08Z",
            "User": {
                "ID": 1606,
                "Username": "polianto"
            },
            "CheckinStatusTypeID": 10
        }
    ],
    "MediaItems": [
        {
            "ID": 18441,
            "ChargePointID": 88477,
            "ItemURL": "https://s3-ap-southeast-2.amazonaws.com/openchargemap/images/IT/OCM88477/OCM-88477.orig.2019051814363739.jpg",
            "ItemThumbnailURL": "https://s3-ap-southeast-2.amazonaws.com/openchargemap/images/IT/OCM88477/OCM-88477.thmb.2019051814363739.jpg",
            "Comment": "",
            "IsEnabled": true,
            "IsVideo": false,
            "IsFeaturedItem": false,
            "IsExternalResource": false,
            "User": {
                "ID": 1606,
                "Username": "polianto"
            },
            "DateCreated": "2019-05-18T14:37:00Z"
        },
        {
            "ID": 18442,
            "ChargePointID": 88477,
            "ItemURL": "https://s3-ap-southeast-2.amazonaws.com/openchargemap/images/IT/OCM88477/OCM-88477.orig.2019051814365152.jpg",
            "ItemThumbnailURL": "https://s3-ap-southeast-2.amazonaws.com/openchargemap/images/IT/OCM88477/OCM-88477.thmb.2019051814365152.jpg",
            "Comment": "",
            "IsEnabled": true,
            "IsVideo": false,
            "IsFeaturedItem": false,
            "IsExternalResource": false,
            "User": {
                "ID": 1606,
                "Username": "polianto"
            },
            "DateCreated": "2019-05-18T14:37:00Z"
        }
    ],
    "IsRecentlyVerified": false,
    "ID": 88477,
    "UUID": "F2BF087E-890D-49F4-AA1E-D60CAA2275EA",
    "DataProviderID": 1,
    "OperatorID": 23,
    "OperatorsReference": "30002",
    "UsageTypeID": 6,
    "AddressInfo": {
        "ID": 88823,
        "Title": "Agriturismo Azienda Agricola Il Pozzo",
        "AddressLine1": "31/B Loc. Il Pozzo",
        "Town": "Capolona",
        "Postcode": "52010",
        "CountryID": 112,
        "Latitude": 43.589703,
        "Longitude": 11.869266,
        "ContactTelephone1": "+39 338 740 1265",
        "DistanceUnit": 0
    },
    "Connections": [
        {
            "ID": 125502,
            "ConnectionTypeID": 30,
            "StatusTypeID": 50,
            "LevelID": 2,
            "Amps": 32,
            "Voltage": 230,
            "PowerKW": 14,
            "CurrentTypeID": 20,
            "Quantity": 1
        },
        {
            "ID": 177542,
            "ConnectionTypeID": 1036,
            "StatusTypeID": 50,
            "LevelID": 2,
            "Amps": 32,
            "Voltage": 230,
            "PowerKW": 14,
            "CurrentTypeID": 20,
            "Quantity": 1
        }
    ],
    "NumberOfPoints": 2,
    "GeneralComments": "1 Tesla Connector, up to 14kW + 1 for alla EV. Available for patrons only. Please call ahead.",
    "StatusTypeID": 50,
    "DateLastStatusUpdate": "2019-05-18T15:03:00Z",
    "DataQualityLevel": 1,
    "DateCreated": "2017-05-31T06:29:00Z",
    "SubmissionStatusTypeID": 200
}