{
    "IsRecentlyVerified": false,
    "ID": 48526,
    "UUID": "0EA9C6C7-B0BE-488E-B7B9-67ECC8C1189C",
    "DataProviderID": 1,
    "OperatorID": 32,
    "OperatorsReference": "858",
    "UsageTypeID": 6,
    "UsageCost": "Inclusive; for Polar Plus subscription members only",
    "AddressInfo": {
        "ID": 48872,
        "Title": "Greetham Golf Club",
        "AddressLine1": "Wood Lane",
        "Town": "Greetham",
        "Postcode": "LE15 7SN",
        "CountryID": 1,
        "Latitude": 52.710907,
        "Longitude": -0.600861,
        "AccessComments": "LHS of reception. Please report to reception. Fitted under Midlands PiP\r\nGolfers and patrons of the site only",
        "RelatedURL": "http://www.greethamvalley.co.uk/",
        "DistanceUnit": 0
    },
    "Connections": [
        {
            "ID": 59981,
            "ConnectionTypeID": 25,
            "StatusTypeID": 50,
            "LevelID": 2,
            "Amps": 32,
            "Voltage": 230,
            "PowerKW": 7,
            "CurrentTypeID": 10,
            "Quantity": 1
        },
        {
            "ID": 60516,
            "ConnectionTypeID": 3,
            "StatusTypeID": 50,
            "LevelID": 2,
            "Amps": 13,
            "Voltage": 230,
            "PowerKW": 3,
            "CurrentTypeID": 10,
            "Quantity": 1
        }
    ],
    "NumberOfPoints": 2,
    "GeneralComments": "Chargemaster Post. Polar Network cards also accepted",
    "StatusTypeID": 50,
    "DateLastStatusUpdate": "2019-03-08T06:32:00Z",
    "MetadataValues": [
        {
            "ID": 1533,
            "MetadataFieldID": 4,
            "ItemValue": "Contains public sector information licensed under the Open Government Licence v2.0. http://www.nationalarchives.gov.uk/doc/open-government-licence/version/2/"
        }
    ],
    "DataQualityLevel": 3,
    "DateCreated": "2015-06-27T07:22:00Z",
    "SubmissionStatusTypeID": 200
}