{
    "MediaItems": [
        {
            "ID": 12206,
            "ChargePointID": 87929,
            "ItemURL": "https://s3-ap-southeast-2.amazonaws.com/openchargemap/images/NZ/OCM87929/OCM-87929.orig.2017051807393614.jpg",
            "ItemThumbnailURL": "https://s3-ap-southeast-2.amazonaws.com/openchargemap/images/NZ/OCM87929/OCM-87929.thmb.2017051807393614.jpg",
            "Comment": "",
            "IsEnabled": true,
            "IsVideo": false,
            "IsFeaturedItem": false,
            "IsExternalResource": false,
            "User": {
                "ID": 15365,
                "Username": "sliday"
            },
            "DateCreated": "2017-05-18T07:40:00Z"
        }
    ],
    "IsRecentlyVerified": false,
    "ID": 87929,
    "UUID": "6F1D3E00-97F7-4DAA-8A13-9A2A89AC25A8",
    "DataProviderID": 1,
    "AddressInfo": {
        "ID": 88275,
        "Title": "Schnappa Rock Restaurant & Bar",
        "AddressLine1": "1 Marina Rd",
        "Town": "Whangarei",
        "Postcode": "0173",
        "CountryID": 161,
        "Latitude": -35.60864479990407,
        "Longitude": 174.5264086961412,
        "ContactTelephone1": "094343774",
        "DistanceUnit": 0
    },
    "Connections": [
        {
            "ID": 124737,
            "ConnectionTypeID": 1
        },
        {
            "ID": 124738,
            "ConnectionTypeID": 29
        }
    ],
    "NumberOfPoints": 2,
    "GeneralComments": "08:00 - 23:00\r\n",
    "StatusTypeID": 50,
    "DateLastStatusUpdate": "2017-05-18T07:40:00Z",
    "DataQualityLevel": 1,
    "DateCreated": "2017-05-18T07:39:00Z",
    "SubmissionStatusTypeID": 200
}