{
    "IsRecentlyVerified": false,
    "ID": 124560,
    "UUID": "B859B648-87C9-4DD1-BBA2-94B64D35932B",
    "DataProviderID": 2,
    "DataProvidersReference": "44907",
    "OperatorID": 5,
    "UsageTypeID": 1,
    "AddressInfo": {
        "ID": 124906,
        "Title": "JOHNSON COUNTY",
        "AddressLine1": "11880 S Sunset Dr",
        "Town": "Olathe",
        "StateOrProvince": "KS",
        "Postcode": "66061",
        "CountryID": 2,
        "Latitude": 38.9157944,
        "Longitude": -94.8042374,
        "ContactTelephone1": "888-758-4389",
        "AccessComments": "24 hours daily",
        "RelatedURL": "http://www.chargepoint.com/",
        "DistanceUnit": 0
    },
    "Connections": [
        {
            "ID": 174675,
            "ConnectionTypeID": 1,
            "LevelID": 2,
            "Amps": 16,
            "Voltage": 230,
            "PowerKW": 3.7,
            "CurrentTypeID": 10,
            "Quantity": 2
        }
    ],
    "DateLastStatusUpdate": "2020-06-26T03:00:00Z",
    "DataQualityLevel": 3,
    "DateCreated": "2019-04-06T05:03:00Z",
    "SubmissionStatusTypeID": 100
}