{
    "IsRecentlyVerified": false,
    "ID": 138417,
    "UUID": "4624BA65-F34D-41A6-BBA8-CCDAE7A2A038",
    "DataProviderID": 2,
    "DataProvidersReference": "150031",
    "OperatorID": 5,
    "UsageTypeID": 1,
    "AddressInfo": {
        "ID": 138766,
        "Title": "BROOKFIELD PROP",
        "AddressLine1": "1200 Bagby St",
        "Town": "Houston",
        "StateOrProvince": "TX",
        "Postcode": "77002",
        "CountryID": 2,
        "Latitude": 29.758931,
        "Longitude": -95.3709709,
        "ContactTelephone1": "888-758-4389",
        "AccessComments": "24 hours daily",
        "RelatedURL": "http://www.chargepoint.com/",
        "DistanceUnit": 0
    },
    "Connections": [
        {
            "ID": 193530,
            "ConnectionTypeID": 1,
            "LevelID": 2,
            "Amps": 16,
            "Voltage": 230,
            "PowerKW": 3.7,
            "CurrentTypeID": 10,
            "Quantity": 2
        }
    ],
    "StatusTypeID": 50,
    "DateLastStatusUpdate": "2020-06-26T02:53:00Z",
    "DataQualityLevel": 3,
    "DateCreated": "2019-12-24T09:08:00Z",
    "SubmissionStatusTypeID": 100
}