{
    "IsRecentlyVerified": false,
    "ID": 155234,
    "UUID": "1323FC45-80A2-4C39-921E-56290734BFD6",
    "DataProviderID": 1,
    "OperatorID": 3315,
    "OperatorsReference": "52936",
    "UsageTypeID": 4,
    "UsageCost": "Free",
    "AddressInfo": {
        "ID": 155588,
        "Title": "22 KW Charger At Bruce House, Wellgate, Arbroath",
        "AddressLine1": "Bruce House",
        "Town": "Wellgate",
        "StateOrProvince": "Arbroath",
        "Postcode": "DD11 3TP",
        "CountryID": 1,
        "Latitude": 56.561879,
        "Longitude": -2.589468,
        "DistanceUnit": 0
    },
    "Connections": [
        {
            "ID": 218524,
            "ConnectionTypeID": 25,
            "StatusTypeID": 50,
            "LevelID": 2,
            "Amps": 32,
            "Voltage": 400,
            "PowerKW": 22,
            "CurrentTypeID": 20,
            "Quantity": 2
        }
    ],
    "NumberOfPoints": 2,
    "StatusTypeID": 50,
    "DateLastStatusUpdate": "2020-04-02T05:17:00Z",
    "DataQualityLevel": 1,
    "DateCreated": "2020-04-02T05:17:00Z",
    "SubmissionStatusTypeID": 200
}