{
    "IsRecentlyVerified": false,
    "ID": 96726,
    "UUID": "8013B4B0-BE0A-4391-8F85-EEBEE72F8E26",
    "DataProviderID": 2,
    "DataProvidersReference": "88145",
    "OperatorID": 5,
    "UsageTypeID": 1,
    "AddressInfo": {
        "ID": 97072,
        "Title": "BETHEL",
        "AddressLine1": "3586 State Rte 55",
        "Town": "Kauneonga Lake",
        "StateOrProvince": "NY",
        "Postcode": "12749",
        "CountryID": 2,
        "Latitude": 41.6859816,
        "Longitude": -74.8307887,
        "ContactTelephone1": "888-758-4389",
        "AccessComments": "24 hours daily",
        "RelatedURL": "http://www.chargepoint.com/",
        "DistanceUnit": 0
    },
    "Connections": [
        {
            "ID": 137003,
            "ConnectionTypeID": 1,
            "LevelID": 2,
            "Amps": 16,
            "Voltage": 230,
            "PowerKW": 3,
            "CurrentTypeID": 10,
            "Quantity": 2
        }
    ],
    "DateLastStatusUpdate": "2019-12-24T09:19:00Z",
    "DataQualityLevel": 3,
    "DateCreated": "2017-12-29T21:01:00Z",
    "SubmissionStatusTypeID": 100
}