{
    "IsRecentlyVerified": false,
    "ID": 142995,
    "UUID": "9253C15A-92AC-496B-A69F-C8017A58B25F",
    "DataProviderID": 2,
    "DataProvidersReference": "149253",
    "OperatorID": 5,
    "UsageTypeID": 1,
    "AddressInfo": {
        "ID": 143347,
        "Title": "MASS AUDUBON",
        "AddressLine1": "963 Washington St",
        "Town": "Canton",
        "StateOrProvince": "MA",
        "Postcode": "02021",
        "CountryID": 2,
        "Latitude": 42.16427,
        "Longitude": -71.14278,
        "ContactTelephone1": "888-758-4389",
        "AccessComments": "24 hours daily",
        "RelatedURL": "http://www.chargepoint.com/",
        "DistanceUnit": 0
    },
    "Connections": [
        {
            "ID": 199244,
            "ConnectionTypeID": 1,
            "LevelID": 2,
            "Amps": 16,
            "Voltage": 230,
            "PowerKW": 3.7,
            "CurrentTypeID": 10,
            "Quantity": 2
        }
    ],
    "StatusTypeID": 50,
    "DateLastStatusUpdate": "2020-06-26T03:05:00Z",
    "DataQualityLevel": 3,
    "DateCreated": "2019-12-24T09:19:00Z",
    "SubmissionStatusTypeID": 100
}