{
    "IsRecentlyVerified": false,
    "ID": 68758,
    "UUID": "A3538569-F8D4-489F-BF05-CD5AC959BAAB",
    "DataProviderID": 1,
    "OperatorID": 105,
    "UsageTypeID": 4,
    "AddressInfo": {
        "ID": 69104,
        "Title": "Hotel Heide Park",
        "AddressLine1": "Heide Park 1",
        "Town": "Soltau",
        "StateOrProvince": "Landkreis Heidekreis",
        "Postcode": "29614",
        "CountryID": 87,
        "Latitude": 53.02528650000001,
        "Longitude": 9.87460329999999,
        "AccessComments": "Ladestation befindet sich auf dem Parkplatz des Abenteuerhotels. ",
        "RelatedURL": "http://www.sw-soltau.de/",
        "DistanceUnit": 0
    },
    "Connections": [
        {
            "ID": 96435,
            "ConnectionTypeID": 25,
            "StatusTypeID": 50,
            "LevelID": 2,
            "Amps": 32,
            "Voltage": 400,
            "PowerKW": 22,
            "CurrentTypeID": 20,
            "Quantity": 2
        }
    ],
    "NumberOfPoints": 2,
    "StatusTypeID": 50,
    "DateLastStatusUpdate": "2016-06-21T11:50:00Z",
    "DataQualityLevel": 1,
    "DateCreated": "2016-06-21T11:50:00Z",
    "SubmissionStatusTypeID": 200
}