{
    "MediaItems": [
        {
            "ID": 6376,
            "ChargePointID": 65992,
            "ItemURL": "https://s3-ap-southeast-2.amazonaws.com/openchargemap/images/SI/OCM65992/OCM-65992.orig.2016050818580274.jpg",
            "ItemThumbnailURL": "https://s3-ap-southeast-2.amazonaws.com/openchargemap/images/SI/OCM65992/OCM-65992.thmb.2016050818580274.jpg",
            "Comment": "",
            "IsEnabled": true,
            "IsVideo": false,
            "IsFeaturedItem": false,
            "IsExternalResource": false,
            "User": {
                "ID": 9348,
                "Username": "Damijan"
            },
            "DateCreated": "2016-05-08T18:58:00Z"
        },
        {
            "ID": 6375,
            "ChargePointID": 65992,
            "ItemURL": "https://s3-ap-southeast-2.amazonaws.com/openchargemap/images/SI/OCM65992/OCM-65992.orig.2016050818562713.jpg",
            "ItemThumbnailURL": "https://s3-ap-southeast-2.amazonaws.com/openchargemap/images/SI/OCM65992/OCM-65992.thmb.2016050818562713.jpg",
            "Comment": "Charging station in Kranjska Gora",
            "IsEnabled": true,
            "IsVideo": false,
            "IsFeaturedItem": false,
            "IsExternalResource": false,
            "User": {
                "ID": 9348,
                "Username": "Damijan"
            },
            "DateCreated": "2016-05-08T18:57:00Z"
        }
    ],
    "IsRecentlyVerified": false,
    "ID": 65992,
    "UUID": "FB48BF22-92F3-4A45-8889-1DC4DA652C14",
    "DataProviderID": 1,
    "OperatorID": 1,
    "UsageTypeID": 1,
    "UsageCost": "Free",
    "AddressInfo": {
        "ID": 66338,
        "Title": "PP Kranjska Gora",
        "AddressLine1": "Kolodvorska 1b",
        "Town": "Kranjska Gora",
        "Postcode": "4280",
        "CountryID": 205,
        "Latitude": 46.4853676,
        "Longitude": 13.7848126,
        "DistanceUnit": 0
    },
    "Connections": [
        {
            "ID": 91232,
            "ConnectionTypeID": 25,
            "StatusTypeID": 50,
            "LevelID": 2,
            "Amps": 32,
            "Voltage": 230,
            "PowerKW": 22,
            "CurrentTypeID": 20,
            "Quantity": 1
        },
        {
            "ID": 91233,
            "ConnectionTypeID": 28,
            "StatusTypeID": 50,
            "LevelID": 2,
            "Amps": 16,
            "Voltage": 230,
            "PowerKW": 3.7,
            "CurrentTypeID": 10,
            "Quantity": 1
        },
        {
            "ID": 91234,
            "ConnectionTypeID": 16,
            "StatusTypeID": 50,
            "LevelID": 2,
            "Amps": 16,
            "Voltage": 230,
            "PowerKW": 3.7,
            "CurrentTypeID": 10,
            "Quantity": 1
        },
        {
            "ID": 91235,
            "ConnectionTypeID": 17,
            "StatusTypeID": 50,
            "LevelID": 2,
            "Amps": 16,
            "Voltage": 230,
            "PowerKW": 11,
            "CurrentTypeID": 20,
            "Quantity": 1
        }
    ],
    "NumberOfPoints": 2,
    "StatusTypeID": 50,
    "DateLastStatusUpdate": "2016-05-09T13:18:00Z",
    "DataQualityLevel": 1,
    "DateCreated": "2016-05-08T11:18:00Z",
    "SubmissionStatusTypeID": 200
}