{
    "IsRecentlyVerified": false,
    "ID": 171030,
    "UUID": "E80DC776-340E-4258-B5F9-1D183DBDBE46",
    "DataProviderID": 1,
    "OperatorID": 3315,
    "UsageTypeID": 4,
    "UsageCost": "Free",
    "AddressInfo": {
        "ID": 171389,
        "Title": "Lochinver Community Hall Carpark",
        "AddressLine1": "A837",
        "Town": "Lochinver",
        "StateOrProvince": "Scotland",
        "Postcode": "",
        "CountryID": 1,
        "Latitude": 58.14963812965911,
        "Longitude": -5.2399111624229135,
        "DistanceUnit": 0
    },
    "Connections": [
        {
            "ID": 261324,
            "ConnectionTypeID": 33,
            "Reference": "52491",
            "StatusTypeID": 50,
            "LevelID": 3,
            "PowerKW": 50,
            "CurrentTypeID": 30,
            "Quantity": 1
        },
        {
            "ID": 261325,
            "ConnectionTypeID": 2,
            "Reference": "52491",
            "StatusTypeID": 50,
            "LevelID": 3,
            "PowerKW": 50,
            "CurrentTypeID": 30,
            "Quantity": 1
        },
        {
            "ID": 261326,
            "ConnectionTypeID": 1036,
            "Reference": "52491",
            "StatusTypeID": 50,
            "LevelID": 3,
            "PowerKW": 43,
            "CurrentTypeID": 20,
            "Quantity": 1
        },
        {
            "ID": 261327,
            "ConnectionTypeID": 25,
            "Reference": "52492",
            "StatusTypeID": 50,
            "LevelID": 2,
            "PowerKW": 22,
            "CurrentTypeID": 20,
            "Quantity": 2
        }
    ],
    "NumberOfPoints": 4,
    "StatusTypeID": 50,
    "DateLastStatusUpdate": "2020-12-18T19:49:00Z",
    "DataQualityLevel": 1,
    "DateCreated": "2020-12-17T10:28:00Z",
    "SubmissionStatusTypeID": 200
}