{
    "IsRecentlyVerified": false,
    "ID": 70966,
    "UUID": "027563BF-C0DD-468B-8F87-CE2235758043",
    "DataProviderID": 1,
    "OperatorID": 234,
    "UsageTypeID": 1,
    "UsageCost": "derzeit kostenlos",
    "AddressInfo": {
        "ID": 71312,
        "Title": "Stadtmauer",
        "AddressLine1": "Brunnenstraße 1",
        "Town": "Ochsenfurt",
        "StateOrProvince": "Landkreis Würzburg",
        "Postcode": "97199",
        "CountryID": 87,
        "Latitude": 49.66485375100241,
        "Longitude": 10.061072503378785,
        "ContactTelephone1": "+49 911 80201",
        "ContactEmail": "elektromobilitaet@n-ergie.de",
        "AccessComments": "Ladeverbund Franken+, 24/7 nutzbar mit der Ladekarte E-Mobilität, Smartphone App oder SMS der N-Ergie. Derzeit noch kostenfrei ohne Anmeldung nutzbar.",
        "RelatedURL": "https://n-ergie.de",
        "DistanceUnit": 0
    },
    "Connections": [
        {
            "ID": 101680,
            "ConnectionTypeID": 25,
            "StatusTypeID": 50,
            "LevelID": 2,
            "Amps": 32,
            "Voltage": 400,
            "PowerKW": 22,
            "CurrentTypeID": 20,
            "Quantity": 2
        }
    ],
    "NumberOfPoints": 2,
    "StatusTypeID": 50,
    "DateLastStatusUpdate": "2016-08-22T06:29:00Z",
    "DataQualityLevel": 1,
    "DateCreated": "2016-08-22T06:29:00Z",
    "SubmissionStatusTypeID": 200
}