{
    "IsRecentlyVerified": false,
    "ID": 177356,
    "UUID": "1D3821CC-6FC3-46CA-A18D-2FC4898675E0",
    "DataProviderID": 29,
    "DataProvidersReference": "10465",
    "OperatorID": 3403,
    "AddressInfo": {
        "ID": 177715,
        "Title": "Marktstraße 1",
        "AddressLine1": "Marktstraße 1",
        "Town": "Lehre",
        "Postcode": "38165",
        "CountryID": 87,
        "Latitude": 52.32993,
        "Longitude": 10.66842,
        "DistanceUnit": 0
    },
    "Connections": [
        {
            "ID": 276412,
            "ConnectionTypeID": 25,
            "StatusTypeID": 50,
            "LevelID": 2,
            "PowerKW": 22,
            "CurrentTypeID": 20
        },
        {
            "ID": 276413,
            "ConnectionTypeID": 25,
            "StatusTypeID": 50,
            "LevelID": 2,
            "PowerKW": 22,
            "CurrentTypeID": 20
        }
    ],
    "StatusTypeID": 0,
    "DateLastStatusUpdate": "2021-07-12T02:49:00Z",
    "MetadataValues": [
        {
            "ID": 9650,
            "MetadataFieldID": 4,
            "ItemValue": "Data from the German chargepoint registry provided by Bundesnetzagentur.de under the CC-BY 4.0 license"
        }
    ],
    "DataQualityLevel": 3,
    "DateCreated": "2021-07-08T09:48:00Z",
    "SubmissionStatusTypeID": 100
}