{
    "UserComments": [
        {
            "ID": 21382,
            "ChargePointID": 26002,
            "CommentTypeID": 10,
            "UserName": "Henry Hallan",
            "Comment": "",
            "DateCreated": "2019-08-21T18:21:08.623Z",
            "User": {
                "ID": 21921,
                "Username": "Henry Hallan"
            },
            "CheckinStatusTypeID": 10
        }
    ],
    "IsRecentlyVerified": false,
    "ID": 26002,
    "UUID": "B4788AF7-0FEE-4602-B4FB-DF2600DCB679",
    "DataProviderID": 1,
    "OperatorID": 22,
    "OperatorsReference": "C4FVM",
    "AddressInfo": {
        "ID": 26348,
        "Title": "Car Park Off Milltown Malbay Road",
        "AddressLine1": "Lahinch",
        "Town": "Clare",
        "StateOrProvince": "Co Clare",
        "CountryID": 3,
        "Latitude": 52.928911,
        "Longitude": -9.346292,
        "DistanceUnit": 0
    },
    "Connections": [
        {
            "ID": 28374,
            "ConnectionTypeID": 25,
            "StatusTypeID": 50,
            "LevelID": 2,
            "Amps": 32,
            "Voltage": 400,
            "PowerKW": 22,
            "CurrentTypeID": 20,
            "Quantity": 2
        }
    ],
    "NumberOfPoints": 2,
    "StatusTypeID": 50,
    "DateLastStatusUpdate": "2019-08-21T18:21:00Z",
    "DataQualityLevel": 2,
    "DateCreated": "2014-11-27T09:11:00Z",
    "SubmissionStatusTypeID": 100
}