{
    "IsRecentlyVerified": false,
    "ID": 65269,
    "UUID": "01C4691B-7AB6-4AFC-A5FC-80447A700028",
    "DataProviderID": 1,
    "OperatorID": 45,
    "UsageTypeID": 6,
    "UsageCost": "",
    "AddressInfo": {
        "ID": 65615,
        "Title": "Italiana Hotels Milan Rho Fair",
        "AddressLine1": "Via Alessandro Volta, 54",
        "AddressLine2": "",
        "Town": "Rho",
        "StateOrProvince": "MI",
        "Postcode": "20017",
        "CountryID": 112,
        "Latitude": 45.52356545537929,
        "Longitude": 9.037408233507449,
        "ContactTelephone1": "",
        "ContactTelephone2": "",
        "ContactEmail": "",
        "AccessComments": "",
        "RelatedURL": "http://www.italianahotelsmilan-rhofair.com/",
        "DistanceUnit": 0
    },
    "Connections": [
        {
            "ID": 89883,
            "ConnectionTypeID": 1036,
            "StatusTypeID": 50,
            "LevelID": 1,
            "Amps": 32,
            "Voltage": 40,
            "PowerKW": 22,
            "CurrentTypeID": 20,
            "Quantity": 2
        }
    ],
    "NumberOfPoints": 2,
    "GeneralComments": "",
    "StatusTypeID": 50,
    "DateLastStatusUpdate": "2016-06-10T14:42:00Z",
    "DataQualityLevel": 1,
    "DateCreated": "2016-04-25T18:10:00Z",
    "SubmissionStatusTypeID": 200
}