{
    "IsRecentlyVerified": false,
    "ID": 124985,
    "UUID": "ECB49D54-6809-46D6-BA25-531931BFAEE6",
    "DataProviderID": 1,
    "OperatorID": 80,
    "UsageTypeID": 4,
    "AddressInfo": {
        "ID": 125331,
        "Title": "Maccagno Argentina | EnelX",
        "AddressLine1": "Via Argentina",
        "AddressLine2": "Maccagno ",
        "Town": "Maccagno con Pino e Veddasca",
        "StateOrProvince": "VA",
        "Postcode": "21061",
        "CountryID": 112,
        "Latitude": 46.0442953291086,
        "Longitude": 8.73476747526411,
        "ContactTelephone1": "800.069.850",
        "RelatedURL": "https://www.enelx.com/it/it/emobility",
        "DistanceUnit": 0
    },
    "Connections": [
        {
            "ID": 175188,
            "ConnectionTypeID": 25,
            "StatusTypeID": 50,
            "LevelID": 2,
            "Amps": 32,
            "Voltage": 400,
            "PowerKW": 22,
            "CurrentTypeID": 20,
            "Quantity": 2
        }
    ],
    "NumberOfPoints": 2,
    "StatusTypeID": 50,
    "DateLastStatusUpdate": "2019-05-20T17:50:00Z",
    "DataQualityLevel": 1,
    "DateCreated": "2019-04-07T10:57:00Z",
    "SubmissionStatusTypeID": 200
}