{
    "IsRecentlyVerified": false,
    "ID": 87965,
    "UUID": "0EE90048-9138-4387-B41A-D664F9D2FF58",
    "DataProviderID": 1,
    "OperatorID": 45,
    "UsageTypeID": 6,
    "AddressInfo": {
        "ID": 88311,
        "Title": " Rome Life Hotel",
        "AddressLine1": "Via Palermo, 10",
        "Town": "Roma",
        "StateOrProvince": "RM",
        "Postcode": "00184",
        "CountryID": 112,
        "Latitude": 41.898719940954116,
        "Longitude": 12.491594880985648,
        "ContactTelephone1": " +39 06 99291210 ",
        "ContactEmail": "romelife@moodhotels.it",
        "RelatedURL": "http://www.moodhotels.it/ita/life-hotel-roma",
        "DistanceUnit": 0
    },
    "Connections": [
        {
            "ID": 124781,
            "ConnectionTypeID": 25,
            "StatusTypeID": 0,
            "LevelID": 2,
            "Quantity": 1
        }
    ],
    "NumberOfPoints": 1,
    "StatusTypeID": 50,
    "DateLastStatusUpdate": "2017-05-18T13:24:00Z",
    "DataQualityLevel": 1,
    "DateCreated": "2017-05-18T13:24:00Z",
    "SubmissionStatusTypeID": 200
}