{
    "IsRecentlyVerified": false,
    "ID": 88730,
    "UUID": "B3330116-8AE6-43E9-A06A-4FCB6142DDB7",
    "DataProviderID": 1,
    "DataProvidersReference": "4117",
    "AddressInfo": {
        "ID": 89076,
        "Title": "Kauppakeskus Puuvilla",
        "AddressLine1": "Siltapuistokatu 14",
        "Town": "Pori Keskus",
        "StateOrProvince": "Satakunta",
        "Postcode": "28100",
        "CountryID": 79,
        "Latitude": 61.49458,
        "Longitude": 21.79984,
        "AccessComments": "Parkkitaso P2, 2.krs",
        "DistanceUnit": 0
    },
    "Connections": [
        {
            "ID": 125968,
            "ConnectionTypeID": 0,
            "Reference": "1",
            "LevelID": 2,
            "Amps": 32,
            "Voltage": 400,
            "PowerKW": 22,
            "Comments": "Mode 3"
        },
        {
            "ID": 125969,
            "ConnectionTypeID": 0,
            "Reference": "2",
            "LevelID": 2,
            "Amps": 32,
            "Voltage": 400,
            "PowerKW": 22,
            "Comments": "Mode 3"
        }
    ],
    "NumberOfPoints": 2,
    "DateLastStatusUpdate": "2020-05-26T08:24:00Z",
    "DataQualityLevel": 2,
    "DateCreated": "2017-06-09T11:08:00Z",
    "SubmissionStatusTypeID": 100
}