{
    "IsRecentlyVerified": false,
    "ID": 116331,
    "UUID": "30C18715-1A80-4F21-88F3-1162619F8F32",
    "DataProviderID": 1,
    "DataProvidersReference": "5003",
    "AddressInfo": {
        "ID": 116677,
        "Title": "Lenavägen 2",
        "AddressLine1": "Lenavägen 2",
        "Town": "ULRICEHAMN",
        "StateOrProvince": "VÄSTRA GÖTALAND",
        "Postcode": "52301",
        "CountryID": 216,
        "Latitude": 57.858063,
        "Longitude": 13.429675,
        "AccessComments": "på framsidan av entré 4",
        "DistanceUnit": 0
    },
    "Connections": [
        {
            "ID": 163822,
            "ConnectionTypeID": 0,
            "Reference": "1",
            "LevelID": 2,
            "Amps": 16,
            "Voltage": 230,
            "PowerKW": 3.7,
            "Comments": "Mode 3"
        },
        {
            "ID": 163823,
            "ConnectionTypeID": 0,
            "Reference": "2",
            "LevelID": 2,
            "Amps": 16,
            "Voltage": 230,
            "PowerKW": 3.7,
            "Comments": "Mode 3"
        }
    ],
    "NumberOfPoints": 2,
    "DateLastStatusUpdate": "2020-05-26T08:21:00Z",
    "DataQualityLevel": 2,
    "DateCreated": "2019-02-11T09:16:00Z",
    "SubmissionStatusTypeID": 100
}