{
    "IsRecentlyVerified": false,
    "ID": 142559,
    "UUID": "A3DD0240-E9AB-4AAF-8B76-2C24211D2C51",
    "DataProviderID": 2,
    "DataProvidersReference": "145333",
    "OperatorID": 5,
    "UsageTypeID": 1,
    "AddressInfo": {
        "ID": 142911,
        "Title": "TOM",
        "AddressLine1": "4 Baldwin Ave",
        "Town": "Larchmont",
        "StateOrProvince": "NY",
        "Postcode": "10538",
        "CountryID": 2,
        "Latitude": 40.9353445,
        "Longitude": -73.7603524,
        "ContactTelephone1": "888-758-4389",
        "AccessComments": "24 hours daily",
        "RelatedURL": "http://www.chargepoint.com/",
        "DistanceUnit": 0
    },
    "Connections": [
        {
            "ID": 198720,
            "ConnectionTypeID": 1,
            "LevelID": 2,
            "Amps": 16,
            "Voltage": 230,
            "PowerKW": 3.7,
            "CurrentTypeID": 10,
            "Quantity": 2
        }
    ],
    "StatusTypeID": 50,
    "DateLastStatusUpdate": "2020-06-26T03:03:00Z",
    "DataQualityLevel": 3,
    "DateCreated": "2019-12-24T09:18:00Z",
    "SubmissionStatusTypeID": 100
}