{
    "IsRecentlyVerified": false,
    "ID": 88518,
    "UUID": "1D87BE00-5673-4C7D-A5D2-704ECB01F76E",
    "DataProviderID": 1,
    "OperatorID": 80,
    "UsageTypeID": 4,
    "UsageCost": "0,40 €/kW",
    "AddressInfo": {
        "ID": 88864,
        "Title": "Eneldrive Rosselli",
        "AddressLine1": "Via Fratelli Rosselli",
        "Town": "Fasano",
        "StateOrProvince": "BR",
        "Postcode": "72015",
        "CountryID": 112,
        "Latitude": 40.83243163917546,
        "Longitude": 17.359080623018354,
        "RelatedURL": "http://eneldrive.it",
        "DistanceUnit": 0
    },
    "Connections": [
        {
            "ID": 125563,
            "ConnectionTypeID": 25,
            "StatusTypeID": 50,
            "LevelID": 2,
            "Amps": 32,
            "Voltage": 400,
            "PowerKW": 22,
            "CurrentTypeID": 20,
            "Quantity": 2
        },
        {
            "ID": 125564,
            "ConnectionTypeID": 36,
            "StatusTypeID": 50,
            "LevelID": 2,
            "Amps": 16,
            "Voltage": 240,
            "PowerKW": 3.7,
            "CurrentTypeID": 10,
            "Quantity": 2
        }
    ],
    "NumberOfPoints": 2,
    "StatusTypeID": 50,
    "DateLastStatusUpdate": "2017-05-31T16:37:00Z",
    "DataQualityLevel": 1,
    "DateCreated": "2017-05-31T16:37:00Z",
    "SubmissionStatusTypeID": 200
}