{
    "IsRecentlyVerified": false,
    "ID": 34132,
    "UUID": "E7931E6F-9B6E-499C-B997-7914A7BABA8F",
    "DataProviderID": 26,
    "DataProvidersReference": "45815",
    "OperatorID": 73,
    "OperatorsReference": "EV-Box EVB-P1348174",
    "UsageCost": "0.00 jaarabonnement",
    "AddressInfo": {
        "ID": 34478,
        "Title": "Alsemstraat 10",
        "AddressLine1": "Alsemstraat 10",
        "Town": "Rotterdam",
        "Postcode": "3193 TA",
        "CountryID": 159,
        "Latitude": 51.8684,
        "Longitude": 4.34549,
        "RelatedURL": "http://www.ev-box.nl",
        "DistanceUnit": 0
    },
    "Connections": [
        {
            "ID": 37643,
            "ConnectionTypeID": 25,
            "LevelID": 2,
            "PowerKW": 11,
            "CurrentTypeID": 10
        },
        {
            "ID": 47081,
            "ConnectionTypeID": 25,
            "LevelID": 2,
            "PowerKW": 11,
            "CurrentTypeID": 10
        }
    ],
    "NumberOfPoints": 1,
    "StatusTypeID": 50,
    "DateLastStatusUpdate": "2016-06-04T02:41:00Z",
    "DataQualityLevel": 3,
    "DateCreated": "2015-01-09T06:04:00Z",
    "SubmissionStatusTypeID": 100
}