{
    "IsRecentlyVerified": false,
    "ID": 33906,
    "UUID": "BE40AA73-3D9E-4E66-8F26-98FA1C9A5852",
    "DataProviderID": 26,
    "DataProvidersReference": "48677",
    "OperatorID": 178,
    "OperatorsReference": "EVnetNL REE556",
    "UsageCost": "0.00 jaarabonnement",
    "AddressInfo": {
        "ID": 34252,
        "Title": "Neerbosscheweg",
        "AddressLine1": "Neerbosscheweg",
        "Town": "Nijmegen",
        "Postcode": "6534 AA",
        "CountryID": 159,
        "Latitude": 51.825779,
        "Longitude": 5.825258,
        "ContactTelephone1": "0800-3522365",
        "RelatedURL": "http://www.evnet.nl",
        "DistanceUnit": 0
    },
    "Connections": [
        {
            "ID": 37417,
            "ConnectionTypeID": 25,
            "LevelID": 1,
            "PowerKW": 2.3,
            "CurrentTypeID": 10
        }
    ],
    "NumberOfPoints": 1,
    "StatusTypeID": 50,
    "DateLastStatusUpdate": "2016-06-04T02:40:00Z",
    "DataQualityLevel": 3,
    "DateCreated": "2015-01-09T06:04:00Z",
    "SubmissionStatusTypeID": 100
}