{
    "IsRecentlyVerified": false,
    "ID": 150825,
    "UUID": "81E608EC-1B47-468F-B670-A7B0F7541867",
    "DataProviderID": 28,
    "DataProvidersReference": "FR*S83*P83038*A",
    "UsageTypeID": 5,
    "AddressInfo": {
        "ID": 151178,
        "Title": "CHATEAUDOUBLE_Saint-Eloi",
        "AddressLine1": "Saint-Eloi 83300 CHATEAUDOUBLE",
        "CountryID": 80,
        "Latitude": 43.597875,
        "Longitude": 6.450228,
        "AccessComments": "24/24 7/7 jours",
        "DistanceUnit": 0
    },
    "Connections": [
        {
            "ID": 210059,
            "ConnectionTypeID": 28,
            "StatusTypeID": 50,
            "LevelID": 2,
            "PowerKW": 22,
            "CurrentTypeID": 10
        },
        {
            "ID": 210060,
            "ConnectionTypeID": 1036,
            "StatusTypeID": 50,
            "LevelID": 2,
            "PowerKW": 22,
            "CurrentTypeID": 20
        },
        {
            "ID": 239703,
            "ConnectionTypeID": 28,
            "StatusTypeID": 50,
            "LevelID": 2,
            "PowerKW": 22,
            "CurrentTypeID": 10
        },
        {
            "ID": 239704,
            "ConnectionTypeID": 1036,
            "StatusTypeID": 50,
            "LevelID": 2,
            "PowerKW": 22,
            "CurrentTypeID": 20
        }
    ],
    "GeneralComments": "",
    "StatusTypeID": 50,
    "DateLastStatusUpdate": "2020-08-27T05:10:00Z",
    "DataQualityLevel": 2,
    "DateCreated": "2020-03-15T06:17:00Z",
    "SubmissionStatusTypeID": 100
}