{
    "IsRecentlyVerified": false,
    "ID": 107251,
    "UUID": "9E8DE907-07F6-4FE3-B352-31F5537FF553",
    "DataProviderID": 1,
    "OperatorID": 25,
    "OperatorsReference": "brent-woodlane",
    "UsageTypeID": 4,
    "UsageCost": "£0.059/minute; min £1.18; other tariffs available",
    "AddressInfo": {
        "ID": 107597,
        "Title": "Wood Lane",
        "AddressLine1": "Wood Lane",
        "AddressLine2": "Colindale",
        "Town": "London",
        "StateOrProvince": "England",
        "Postcode": "NW9 8DU",
        "CountryID": 1,
        "Latitude": 51.5738775,
        "Longitude": -0.261572200000046,
        "DistanceUnit": 0
    },
    "Connections": [
        {
            "ID": 151267,
            "ConnectionTypeID": 25,
            "StatusTypeID": 50,
            "LevelID": 2,
            "Amps": 32,
            "Voltage": 230,
            "PowerKW": 7,
            "CurrentTypeID": 10,
            "Quantity": 2
        },
        {
            "ID": 151268,
            "ConnectionTypeID": 1,
            "StatusTypeID": 50,
            "LevelID": 2,
            "Amps": 16,
            "Voltage": 230,
            "PowerKW": 4,
            "CurrentTypeID": 10,
            "Quantity": 2
        }
    ],
    "NumberOfPoints": 2,
    "StatusTypeID": 50,
    "DateLastStatusUpdate": "2019-01-08T08:27:00Z",
    "DataQualityLevel": 1,
    "DateCreated": "2018-07-23T14:44:00Z",
    "SubmissionStatusTypeID": 200
}