{
    "IsRecentlyVerified": false,
    "ID": 112561,
    "UUID": "57C3E36C-91FF-4C9A-A05B-DF144BC41674",
    "DataProviderID": 1,
    "OperatorID": 80,
    "UsageTypeID": 4,
    "AddressInfo": {
        "ID": 112907,
        "Title": "Pizzo Riviera Prangi | EnelX",
        "AddressLine1": "Deviazione VII Riviera Prangi",
        "Town": "Pizzo",
        "StateOrProvince": "VV",
        "Postcode": "89812",
        "CountryID": 112,
        "Latitude": 38.76309676432109,
        "Longitude": 16.195925333991454,
        "ContactTelephone1": "800.069.850",
        "RelatedURL": "https://www.enelx.com/it/it/emobility",
        "DistanceUnit": 0
    },
    "Connections": [
        {
            "ID": 158358,
            "ConnectionTypeID": 25,
            "StatusTypeID": 50,
            "LevelID": 2,
            "Amps": 32,
            "Voltage": 400,
            "PowerKW": 22,
            "CurrentTypeID": 20,
            "Quantity": 2
        }
    ],
    "NumberOfPoints": 2,
    "StatusTypeID": 50,
    "DateLastStatusUpdate": "2018-11-07T11:51:00Z",
    "DataQualityLevel": 1,
    "DateCreated": "2018-11-07T11:51:00Z",
    "SubmissionStatusTypeID": 200
}