{
    "IsRecentlyVerified": false,
    "ID": 133562,
    "UUID": "BEE5AE62-27E0-4DD3-8F4E-0C16D79D1DEE",
    "DataProviderID": 1,
    "OperatorID": 23,
    "OperatorsReference": "52194",
    "UsageTypeID": 4,
    "AddressInfo": {
        "ID": 133908,
        "Title": "Park Kwik-300 Ashland",
        "AddressLine1": "300 Ashland PL",
        "Town": "Brooklyn",
        "StateOrProvince": "New York",
        "Postcode": "11217",
        "CountryID": 2,
        "Latitude": 40.68608,
        "Longitude": -73.978252,
        "ContactTelephone1": "(718) 925-3387",
        "DistanceUnit": 0
    },
    "Connections": [
        {
            "ID": 186947,
            "ConnectionTypeID": 30,
            "StatusTypeID": 50,
            "LevelID": 2,
            "PowerKW": 10,
            "CurrentTypeID": 20,
            "Quantity": 4
        }
    ],
    "NumberOfPoints": 4,
    "GeneralComments": "4 Tesla Connectors, up to 10kW.Parking fees will apply. Please see valet.",
    "StatusTypeID": 50,
    "DateLastStatusUpdate": "2019-10-21T05:48:00Z",
    "DataQualityLevel": 1,
    "DateCreated": "2019-10-21T05:48:00Z",
    "SubmissionStatusTypeID": 200
}