{
    "IsRecentlyVerified": false,
    "ID": 160294,
    "UUID": "73845CDB-5B01-477B-9E2A-893E1A5EE930",
    "DataProviderID": 2,
    "DataProvidersReference": "158063",
    "UsageTypeID": 2,
    "AddressInfo": {
        "ID": 160651,
        "Title": "Real Canadian Superstore",
        "AddressLine1": "1972 Parkdale Ave",
        "Town": "Brockville",
        "StateOrProvince": "ON",
        "Postcode": "K6V 7N4",
        "CountryID": 44,
        "Latitude": 44.6140249,
        "Longitude": -75.6887651,
        "ContactTelephone1": "",
        "AccessComments": "",
        "RelatedURL": "",
        "DistanceUnit": 0
    },
    "Connections": [
        {
            "ID": 230631,
            "ConnectionTypeID": 2,
            "LevelID": 3,
            "Amps": 100,
            "Voltage": 400,
            "PowerKW": 40,
            "CurrentTypeID": 30,
            "Quantity": 1
        },
        {
            "ID": 230632,
            "ConnectionTypeID": 32,
            "LevelID": 3,
            "Amps": 100,
            "Voltage": 400,
            "PowerKW": 40,
            "CurrentTypeID": 30,
            "Quantity": 1
        }
    ],
    "GeneralComments": "Planned for future date. Not Operational.",
    "DatePlanned": "2020-09-01T00:00:00Z",
    "StatusTypeID": 150,
    "DateLastStatusUpdate": "2020-06-26T03:08:00Z",
    "DataQualityLevel": 3,
    "DateCreated": "2020-06-26T03:08:00Z",
    "SubmissionStatusTypeID": 100
}