{
    "IsRecentlyVerified": false,
    "ID": 179310,
    "UUID": "A7CDD919-167F-4FC9-B239-4083844645CE",
    "DataProviderID": 29,
    "DataProvidersReference": "1986",
    "AddressInfo": {
        "ID": 179669,
        "Title": "Mainzer Straße 65",
        "AddressLine1": "Mainzer Straße 65",
        "Town": "Saarbrücken",
        "Postcode": "66121",
        "CountryID": 87,
        "Latitude": 49.229953,
        "Longitude": 7.005671,
        "DistanceUnit": 0
    },
    "Connections": [
        {
            "ID": 280964,
            "ConnectionTypeID": 25,
            "StatusTypeID": 50,
            "LevelID": 2,
            "PowerKW": 22,
            "CurrentTypeID": 20
        },
        {
            "ID": 280965,
            "ConnectionTypeID": 25,
            "StatusTypeID": 50,
            "LevelID": 2,
            "PowerKW": 22,
            "CurrentTypeID": 20
        }
    ],
    "StatusTypeID": 50,
    "DateLastStatusUpdate": "2021-07-09T03:15:00Z",
    "MetadataValues": [
        {
            "ID": 11604,
            "MetadataFieldID": 4,
            "ItemValue": "Data from the German chargepoint registry provided by Bundesnetzagentur.de under the CC-BY 4.0 license"
        }
    ],
    "DataQualityLevel": 3,
    "DateCreated": "2021-07-08T09:59:00Z",
    "SubmissionStatusTypeID": 100
}