{
    "IsRecentlyVerified": false,
    "ID": 29511,
    "UUID": "771877A0-671C-40D6-8F52-DBE7E68B23D1",
    "DataProviderID": 15,
    "DataProvidersReference": "17752",
    "OperatorID": 5,
    "AddressInfo": {
        "ID": 29857,
        "Title": "101 N Church St",
        "AddressLine1": "101 N Church St",
        "Town": "Kissimmee",
        "StateOrProvince": "Florida",
        "Postcode": "34741",
        "CountryID": 2,
        "Latitude": 28.2945385,
        "Longitude": -81.40679169,
        "ContactTelephone1": "(407) 847-2821",
        "RelatedURL": "http://carstations.com/17752",
        "DistanceUnit": 0
    },
    "Connections": [
        {
            "ID": 32496,
            "ConnectionTypeID": 1,
            "Reference": "J1772",
            "LevelID": 2
        }
    ],
    "StatusTypeID": 0,
    "DateLastStatusUpdate": "2017-11-04T14:03:00Z",
    "DataQualityLevel": 2,
    "DateCreated": "2014-11-29T05:39:00Z",
    "SubmissionStatusTypeID": 100
}