{
    "IsRecentlyVerified": false,
    "ID": 176297,
    "UUID": "F5BA7CC0-7450-4884-8741-83E30AA2F301",
    "DataProviderID": 1,
    "OperatorID": 45,
    "UsageTypeID": 6,
    "UsageCost": "Free",
    "AddressInfo": {
        "ID": 176656,
        "Title": "Hotel Corvin Sissi",
        "AddressLine1": "35 Angyal utca",
        "Town": "Budapest",
        "StateOrProvince": "Közép-Magyarország",
        "Postcode": "1094",
        "CountryID": 104,
        "Latitude": 47.48340632040359,
        "Longitude": 19.070607947145504,
        "AccessComments": "Located in the underground parking lot",
        "DistanceUnit": 0
    },
    "Connections": [
        {
            "ID": 274019,
            "ConnectionTypeID": 25,
            "StatusTypeID": 50,
            "LevelID": 2,
            "PowerKW": 22,
            "CurrentTypeID": 20,
            "Quantity": 1
        }
    ],
    "NumberOfPoints": 1,
    "StatusTypeID": 50,
    "DateLastStatusUpdate": "2021-07-05T11:27:00Z",
    "DataQualityLevel": 1,
    "DateCreated": "2021-07-04T05:55:00Z",
    "SubmissionStatusTypeID": 200
}