{
    "IsRecentlyVerified": false,
    "ID": 7943,
    "UUID": "1F386AE1-FA93-41CB-BB26-5593ED383F5D",
    "DataProviderID": 15,
    "DataProvidersReference": "6304",
    "OperatorID": 26,
    "AddressInfo": {
        "ID": 7840,
        "Title": "1301 Route 23",
        "AddressLine1": "1301 Route 23",
        "Town": "Butler",
        "StateOrProvince": "NJ",
        "Postcode": "7405",
        "CountryID": 2,
        "Latitude": 40.99157,
        "Longitude": -74.34664,
        "ContactTelephone1": " (973) 838-0800",
        "RelatedURL": "http://carstations.com/6304",
        "DistanceUnit": 0
    },
    "Connections": [
        {
            "ID": 5372,
            "ConnectionTypeID": 1,
            "Reference": "J1772",
            "LevelID": 2
        }
    ],
    "StatusTypeID": 0,
    "DateLastStatusUpdate": "2017-11-04T14:04:00Z",
    "DataQualityLevel": 1,
    "DateCreated": "2011-11-11T12:05:00Z",
    "SubmissionStatusTypeID": 100
}