{
    "IsRecentlyVerified": false,
    "ID": 115376,
    "UUID": "844CB30F-443F-4137-905F-3A1027444280",
    "DataProviderID": 2,
    "DataProvidersReference": "117539",
    "OperatorID": 5,
    "UsageTypeID": 1,
    "AddressInfo": {
        "ID": 115722,
        "Title": "PFENEX INC.",
        "AddressLine1": "10790 Roselle St",
        "Town": "San Diego",
        "StateOrProvince": "CA",
        "Postcode": "92121",
        "CountryID": 2,
        "Latitude": 32.898107,
        "Longitude": -117.223757,
        "ContactTelephone1": "888-758-4389",
        "AccessComments": "24 hours daily",
        "RelatedURL": "http://www.chargepoint.com/",
        "DistanceUnit": 0
    },
    "Connections": [
        {
            "ID": 162379,
            "ConnectionTypeID": 1,
            "LevelID": 2,
            "Amps": 16,
            "Voltage": 230,
            "PowerKW": 3,
            "CurrentTypeID": 10,
            "Quantity": 4
        }
    ],
    "DateLastStatusUpdate": "2019-04-06T04:01:00Z",
    "DataQualityLevel": 3,
    "DateCreated": "2019-02-11T07:13:00Z",
    "SubmissionStatusTypeID": 100
}