{
    "IsRecentlyVerified": false,
    "ID": 63039,
    "UUID": "6229423E-2312-4323-910C-49E639FE9EE6",
    "DataProviderID": 26,
    "DataProvidersReference": "79922",
    "OperatorID": 73,
    "OperatorsReference": "EV-Box EVB-P1415204",
    "UsageCost": "0.00 jaarabonnement",
    "AddressInfo": {
        "ID": 63385,
        "Title": "Walessingel 20",
        "AddressLine1": "Walessingel 20",
        "Town": "'s-Hertogenbosch",
        "Postcode": "5247 WT",
        "CountryID": 159,
        "Latitude": 51.72564,
        "Longitude": 5.36379,
        "RelatedURL": "http://www.ev-box.nl",
        "DistanceUnit": 0
    },
    "Connections": [
        {
            "ID": 80151,
            "ConnectionTypeID": 25,
            "LevelID": 2,
            "PowerKW": 5,
            "CurrentTypeID": 10
        }
    ],
    "NumberOfPoints": 1,
    "StatusTypeID": 50,
    "DateLastStatusUpdate": "2016-06-04T02:40:00Z",
    "DataQualityLevel": 3,
    "DateCreated": "2016-03-03T12:29:00Z",
    "SubmissionStatusTypeID": 100
}