{
    "IsRecentlyVerified": false,
    "ID": 37216,
    "UUID": "519ACA97-8CAF-4CA8-BD9E-D3EE5EFACBD2",
    "DataProviderID": 26,
    "DataProvidersReference": "46980",
    "OperatorID": 178,
    "OperatorsReference": "EVnetNL AL113",
    "UsageCost": "0.00 jaarabonnement",
    "AddressInfo": {
        "ID": 37562,
        "Title": "Elspeterbosweg 12",
        "AddressLine1": "Elspeterbosweg 12",
        "Town": "Nunspeet",
        "Postcode": "8076 RC",
        "CountryID": 159,
        "Latitude": 52.331264,
        "Longitude": 5.828564,
        "ContactTelephone1": "0800-3522365",
        "RelatedURL": "http://www.evnet.nl",
        "DistanceUnit": 0
    },
    "Connections": [
        {
            "ID": 40727,
            "ConnectionTypeID": 25,
            "LevelID": 2,
            "PowerKW": 11,
            "CurrentTypeID": 10
        }
    ],
    "NumberOfPoints": 1,
    "StatusTypeID": 50,
    "DateLastStatusUpdate": "2016-06-04T02:53:00Z",
    "DataQualityLevel": 3,
    "DateCreated": "2015-01-09T06:07:00Z",
    "SubmissionStatusTypeID": 100
}