{
    "IsRecentlyVerified": false,
    "ID": 64811,
    "UUID": "15121A40-9FD7-4F8D-971D-A324481477D1",
    "DataProviderID": 1,
    "OperatorID": 45,
    "UsageTypeID": 6,
    "AddressInfo": {
        "ID": 65157,
        "Title": "Klosterbräustüberl",
        "AddressLine1": "Zeilerweg 2",
        "AddressLine2": "Straßberg",
        "Town": "Benediktbeuern",
        "StateOrProvince": "Benediktbeuern (VGem)",
        "Postcode": "83671",
        "CountryID": 87,
        "Latitude": 47.7079794493756,
        "Longitude": 11.4016944884301,
        "ContactTelephone1": "+49 88579407",
        "AccessComments": "Lademöglichkeit für Gäste im Innenhof.",
        "RelatedURL": "http://klosterwirt.de/",
        "DistanceUnit": 0
    },
    "Connections": [
        {
            "ID": 83326,
            "ConnectionTypeID": 28,
            "StatusTypeID": 50,
            "LevelID": 2,
            "Amps": 16,
            "Voltage": 230,
            "PowerKW": 3.7,
            "CurrentTypeID": 10,
            "Quantity": 1
        }
    ],
    "NumberOfPoints": 1,
    "StatusTypeID": 50,
    "DateLastStatusUpdate": "2016-03-23T17:05:00Z",
    "DataQualityLevel": 1,
    "DateCreated": "2016-03-23T09:33:00Z",
    "SubmissionStatusTypeID": 200
}