{
    "IsRecentlyVerified": false,
    "ID": 121327,
    "UUID": "B9595FD8-8E70-499F-ACBF-E7A9DEEFF3B2",
    "DataProviderID": 2,
    "DataProvidersReference": "118525",
    "UsageTypeID": 2,
    "AddressInfo": {
        "ID": 121673,
        "Title": "Idaho Power - Equipment Resource Pool",
        "AddressLine1": "11900 Franklin Rd",
        "Town": "Boise",
        "StateOrProvince": "ID",
        "Postcode": "83708",
        "CountryID": 2,
        "Latitude": 43.6063199,
        "Longitude": -116.3327047,
        "ContactTelephone1": "",
        "AccessComments": "Employee use only",
        "RelatedURL": "",
        "DistanceUnit": 0
    },
    "Connections": [
        {
            "ID": 170772,
            "ConnectionTypeID": 1,
            "LevelID": 2,
            "Amps": 16,
            "Voltage": 230,
            "PowerKW": 3.7,
            "CurrentTypeID": 10,
            "Quantity": 2
        }
    ],
    "DateLastStatusUpdate": "2020-06-26T03:07:00Z",
    "DataQualityLevel": 3,
    "DateCreated": "2019-04-01T05:00:00Z",
    "SubmissionStatusTypeID": 100
}