{
    "IsRecentlyVerified": false,
    "ID": 180793,
    "UUID": "7FC16A24-2393-4253-8A5B-E789720C15A9",
    "DataProviderID": 29,
    "DataProvidersReference": "5617",
    "AddressInfo": {
        "ID": 181152,
        "Title": "Eisenbahnstraße 5",
        "AddressLine1": "Eisenbahnstraße 5",
        "Town": "Rodgau",
        "Postcode": "63110",
        "CountryID": 87,
        "Latitude": 50.024605,
        "Longitude": 8.884834,
        "DistanceUnit": 0
    },
    "Connections": [
        {
            "ID": 284341,
            "ConnectionTypeID": 25,
            "StatusTypeID": 50,
            "LevelID": 2,
            "PowerKW": 22,
            "CurrentTypeID": 20
        },
        {
            "ID": 284342,
            "ConnectionTypeID": 25,
            "StatusTypeID": 50,
            "LevelID": 2,
            "PowerKW": 22,
            "CurrentTypeID": 20
        }
    ],
    "StatusTypeID": 50,
    "DateLastStatusUpdate": "2021-07-12T02:44:00Z",
    "MetadataValues": [
        {
            "ID": 13087,
            "MetadataFieldID": 4,
            "ItemValue": "Data from the German chargepoint registry provided by Bundesnetzagentur.de under the CC-BY 4.0 license"
        }
    ],
    "DataQualityLevel": 3,
    "DateCreated": "2021-07-08T10:01:00Z",
    "SubmissionStatusTypeID": 100
}