{
    "IsRecentlyVerified": false,
    "ID": 155392,
    "UUID": "9DDD898C-8544-47B0-BA9E-C2DCC0B99C7A",
    "DataProviderID": 1,
    "OperatorID": 20,
    "OperatorsReference": "80577",
    "UsageTypeID": 4,
    "UsageCost": "Â£1.50 min charge with 18 Pence per kWh",
    "AddressInfo": {
        "ID": 155746,
        "Title": "Greenhill Way, Harrow",
        "AddressLine1": "Greenhill Way",
        "Town": "London",
        "Postcode": "HA1 1JP",
        "CountryID": 1,
        "Latitude": 51.58187,
        "Longitude": -0.33636,
        "DistanceUnit": 0
    },
    "Connections": [
        {
            "ID": 218778,
            "ConnectionTypeID": 25,
            "StatusTypeID": 50,
            "LevelID": 2,
            "Amps": 32,
            "Voltage": 400,
            "PowerKW": 22,
            "CurrentTypeID": 20,
            "Quantity": 2
        }
    ],
    "NumberOfPoints": 2,
    "StatusTypeID": 50,
    "DateLastStatusUpdate": "2020-04-11T05:25:00Z",
    "DataQualityLevel": 1,
    "DateCreated": "2020-04-10T05:15:00Z",
    "SubmissionStatusTypeID": 200
}