{
    "IsRecentlyVerified": false,
    "ID": 178953,
    "UUID": "63356D9E-24F6-4A0B-A9E7-F39BA75F4C0B",
    "DataProviderID": 29,
    "DataProvidersReference": "688",
    "OperatorID": 45,
    "AddressInfo": {
        "ID": 179312,
        "Title": "Seestraße 49",
        "AddressLine1": "Seestraße 49",
        "Town": "Gailsdorf",
        "Postcode": "74405",
        "CountryID": 87,
        "Latitude": 49.0007086,
        "Longitude": 9.759158,
        "DistanceUnit": 0
    },
    "Connections": [
        {
            "ID": 280068,
            "ConnectionTypeID": 25,
            "StatusTypeID": 50,
            "LevelID": 2,
            "PowerKW": 22,
            "CurrentTypeID": 20
        },
        {
            "ID": 280069,
            "ConnectionTypeID": 25,
            "StatusTypeID": 50,
            "LevelID": 2,
            "PowerKW": 22,
            "CurrentTypeID": 20
        }
    ],
    "StatusTypeID": 50,
    "DateLastStatusUpdate": "2021-07-09T03:14:00Z",
    "MetadataValues": [
        {
            "ID": 11247,
            "MetadataFieldID": 4,
            "ItemValue": "Data from the German chargepoint registry provided by Bundesnetzagentur.de under the CC-BY 4.0 license"
        }
    ],
    "DataQualityLevel": 3,
    "DateCreated": "2021-07-08T09:59:00Z",
    "SubmissionStatusTypeID": 100
}