{
    "IsRecentlyVerified": false,
    "ID": 20477,
    "UUID": "8C4E7491-5B84-44C7-870A-CC4293B8C548",
    "DataProviderID": 1,
    "OperatorID": 1,
    "UsageTypeID": 0,
    "UsageCost": "",
    "AddressInfo": {
        "ID": 20822,
        "Title": "Nissan - Lyon",
        "AddressLine1": "65 Rue du Souvenir",
        "AddressLine2": "",
        "Town": "Lyon",
        "StateOrProvince": "",
        "Postcode": "69337",
        "CountryID": 80,
        "Latitude": 45.77556,
        "Longitude": 4.79583,
        "ContactTelephone1": "",
        "ContactTelephone2": "",
        "ContactEmail": "",
        "AccessComments": "Ouvert à tous",
        "RelatedURL": "",
        "DistanceUnit": 0
    },
    "Connections": [],
    "GeneralComments": "",
    "StatusTypeID": 50,
    "DateLastStatusUpdate": "2013-11-15T12:53:00Z",
    "DataQualityLevel": 1,
    "DateCreated": "2013-11-15T10:48:00Z",
    "SubmissionStatusTypeID": 200
}