{
    "IsRecentlyVerified": false,
    "ID": 162834,
    "UUID": "18B66486-3EC2-42B8-A02F-8615E2A62FBB",
    "DataProviderID": 1,
    "OperatorID": 21,
    "UsageTypeID": 4,
    "UsageCost": "Mobi.E compatible card",
    "AddressInfo": {
        "ID": 163191,
        "Title": "LSB-00241",
        "AddressLine1": "Rua de Manuel de Jesús Coelho",
        "Town": "Lisbon",
        "StateOrProvince": "Lisboa",
        "Postcode": "1269-066",
        "CountryID": 180,
        "Latitude": 38.720839121647316,
        "Longitude": -9.144906204775907,
        "AccessComments": "Paid parking",
        "DistanceUnit": 0
    },
    "Connections": [
        {
            "ID": 234365,
            "ConnectionTypeID": 25,
            "StatusTypeID": 50,
            "LevelID": 2,
            "Amps": 16,
            "Voltage": 400,
            "PowerKW": 11,
            "CurrentTypeID": 20,
            "Quantity": 2
        }
    ],
    "NumberOfPoints": 2,
    "StatusTypeID": 50,
    "DateLastStatusUpdate": "2020-08-17T19:41:00Z",
    "DataQualityLevel": 1,
    "DateCreated": "2020-08-17T19:41:00Z",
    "SubmissionStatusTypeID": 200
}