{
    "UserComments": [
        {
            "ID": 21208,
            "ChargePointID": 129062,
            "CommentTypeID": 10,
            "UserName": "LuiKast",
            "Comment": "Erfolgreich geladen",
            "Rating": 5,
            "DateCreated": "2019-07-13T10:10:44.933Z",
            "User": {
                "ID": 21518,
                "Username": "LuiKast"
            }
        }
    ],
    "MediaItems": [
        {
            "ID": 18898,
            "ChargePointID": 129062,
            "ItemURL": "https://s3-ap-southeast-2.amazonaws.com/openchargemap/images/DE/OCM129062/OCM-129062.orig.2019071310122633.png",
            "ItemThumbnailURL": "https://s3-ap-southeast-2.amazonaws.com/openchargemap/images/DE/OCM129062/OCM-129062.thmb.2019071310122633.png",
            "Comment": "",
            "IsEnabled": true,
            "IsVideo": false,
            "IsFeaturedItem": false,
            "IsExternalResource": false,
            "User": {
                "ID": 21518,
                "Username": "LuiKast"
            },
            "DateCreated": "2019-07-13T10:13:00Z"
        }
    ],
    "IsRecentlyVerified": false,
    "ID": 129062,
    "UUID": "BD480579-AEA5-436D-A6F7-12331ED87B44",
    "DataProviderID": 1,
    "OperatorID": 220,
    "UsageTypeID": 1,
    "AddressInfo": {
        "ID": 129408,
        "Title": "Indiastraße",
        "AddressLine1": " Indiastraße 1",
        "Town": "Hamburg",
        "StateOrProvince": "Hamburg",
        "Postcode": "20457 ",
        "CountryID": 87,
        "Latitude": 53.5279597728585,
        "Longitude": 9.99487983572442,
        "DistanceUnit": 0
    },
    "Connections": [
        {
            "ID": 180675,
            "ConnectionTypeID": 25,
            "StatusTypeID": 50,
            "LevelID": 2,
            "Amps": 32,
            "Voltage": 400,
            "PowerKW": 22,
            "CurrentTypeID": 20,
            "Quantity": 2
        }
    ],
    "NumberOfPoints": 2,
    "StatusTypeID": 50,
    "DateLastStatusUpdate": "2019-07-13T10:13:00Z",
    "DataQualityLevel": 1,
    "DateCreated": "2019-07-12T08:55:00Z",
    "SubmissionStatusTypeID": 200
}