{
    "IsRecentlyVerified": false,
    "ID": 97383,
    "UUID": "B9143034-56C4-4DED-AF6C-42147057BC82",
    "DataProviderID": 1,
    "OperatorID": 23,
    "OperatorsReference": "39380",
    "UsageTypeID": 4,
    "AddressInfo": {
        "ID": 97729,
        "Title": "Hotel Kokenhof",
        "AddressLine1": "Isernhägener Strasse 3",
        "Town": "Burgwedel",
        "Postcode": "30938",
        "CountryID": 87,
        "Latitude": 52.491431,
        "Longitude": 9.842861,
        "ContactTelephone1": "+49 5139 8030",
        "DistanceUnit": 0
    },
    "Connections": [
        {
            "ID": 138290,
            "ConnectionTypeID": 30,
            "StatusTypeID": 50,
            "LevelID": 2,
            "Amps": 16,
            "Voltage": 400,
            "PowerKW": 11,
            "CurrentTypeID": 20,
            "Quantity": 1
        }
    ],
    "NumberOfPoints": 1,
    "GeneralComments": "1 Tesla Connector, up to 11kW.Available for customers. Please see front desk.",
    "StatusTypeID": 50,
    "DateLastStatusUpdate": "2018-10-03T21:01:00Z",
    "DataQualityLevel": 1,
    "DateCreated": "2018-01-21T15:17:00Z",
    "SubmissionStatusTypeID": 200
}