{
    "IsRecentlyVerified": false,
    "ID": 19156,
    "UUID": "60CC48B8-3DC4-4712-AA38-BD229DDF49C8",
    "DataProviderID": 1,
    "OperatorID": 93,
    "OperatorsReference": "SC156",
    "UsageTypeID": 1,
    "AddressInfo": {
        "ID": 19501,
        "Title": "Brunswick Moviebowl, Brunswick Lane",
        "AddressLine1": "Brunswick Lane",
        "AddressLine2": "Pennyburn Industrial Estate",
        "Town": "Londonderry ",
        "Postcode": "BT48 0LU",
        "CountryID": 1,
        "Latitude": 55.0125,
        "Longitude": -7.32144,
        "ContactTelephone1": "028 7137 1999",
        "RelatedURL": "http://www.brunswickmoviebowl.com/",
        "DistanceUnit": 0
    },
    "Connections": [
        {
            "ID": 19427,
            "ConnectionTypeID": 25,
            "StatusTypeID": 50,
            "LevelID": 2,
            "Amps": 32,
            "Voltage": 400,
            "PowerKW": 22,
            "CurrentTypeID": 20,
            "Quantity": 2
        }
    ],
    "NumberOfPoints": 2,
    "GeneralComments": "ECar card required",
    "StatusTypeID": 50,
    "DateLastStatusUpdate": "2017-07-18T05:27:00Z",
    "DataQualityLevel": 1,
    "DateCreated": "2013-09-12T18:18:00Z",
    "SubmissionStatusTypeID": 200
}