{
    "IsRecentlyVerified": false,
    "ID": 141136,
    "UUID": "570E40D4-331E-4063-AED8-5B31E3830084",
    "DataProviderID": 1,
    "OperatorID": 23,
    "OperatorsReference": "34652",
    "UsageTypeID": 1,
    "UsageCost": "$0.26/kWh; other tariffs for older cars",
    "AddressInfo": {
        "ID": 141488,
        "Title": "Coddingtown Mall - Tesla Supercharger",
        "AddressLine1": "733 Coddingtown Center",
        "Town": "Santa Rosa",
        "StateOrProvince": "CA",
        "Postcode": "95401",
        "CountryID": 2,
        "Latitude": 38.459469,
        "Longitude": -122.730199,
        "ContactTelephone1": "877-798-3752",
        "AccessComments": "24 hours daily; for Tesla use only",
        "RelatedURL": "http://www.teslamotors.com/supercharger",
        "DistanceUnit": 0
    },
    "Connections": [
        {
            "ID": 196976,
            "ConnectionTypeID": 27,
            "StatusTypeID": 50,
            "LevelID": 3,
            "Amps": 100,
            "Voltage": 400,
            "PowerKW": 120,
            "CurrentTypeID": 30,
            "Quantity": 20
        }
    ],
    "NumberOfPoints": 20,
    "StatusTypeID": 50,
    "DateLastStatusUpdate": "2020-04-05T08:49:00Z",
    "DataQualityLevel": 3,
    "DateCreated": "2019-12-24T09:14:00Z",
    "SubmissionStatusTypeID": 100
}