{
    "IsRecentlyVerified": false,
    "ID": 184942,
    "UUID": "687D9694-BE16-40EF-BB84-4F62A252049B",
    "DataProviderID": 29,
    "DataProvidersReference": "15018",
    "OperatorID": 69,
    "AddressInfo": {
        "ID": 185301,
        "Title": "Ahornweg 4",
        "AddressLine1": "Ahornweg 4",
        "Town": "Glinde",
        "Postcode": "21509",
        "CountryID": 87,
        "Latitude": 53.5356,
        "Longitude": 10.23003,
        "DistanceUnit": 0
    },
    "Connections": [
        {
            "ID": 293828,
            "ConnectionTypeID": 25,
            "StatusTypeID": 50,
            "LevelID": 2,
            "PowerKW": 22,
            "CurrentTypeID": 20
        },
        {
            "ID": 293829,
            "ConnectionTypeID": 25,
            "StatusTypeID": 50,
            "LevelID": 2,
            "PowerKW": 22,
            "CurrentTypeID": 20
        }
    ],
    "StatusTypeID": 50,
    "DateLastStatusUpdate": "2021-07-09T03:29:00Z",
    "MetadataValues": [
        {
            "ID": 17233,
            "MetadataFieldID": 4,
            "ItemValue": "Data from the German chargepoint registry provided by Bundesnetzagentur.de under the CC-BY 4.0 license"
        }
    ],
    "DataQualityLevel": 3,
    "DateCreated": "2021-07-08T10:06:00Z",
    "SubmissionStatusTypeID": 100
}