{
    "IsRecentlyVerified": false,
    "ID": 123860,
    "UUID": "17EDD2F0-FB8D-449C-948A-EB190B46CC4B",
    "DataProviderID": 2,
    "DataProvidersReference": "72691",
    "OperatorID": 1242,
    "UsageTypeID": 1,
    "AddressInfo": {
        "ID": 124206,
        "Title": "161650G02002020000",
        "AddressLine1": "310  Crescent Village Cir",
        "Town": "San Jose",
        "StateOrProvince": "CA",
        "Postcode": "95134",
        "CountryID": 2,
        "Latitude": 37.4025009,
        "Longitude": -121.9299645,
        "ContactTelephone1": "855-443-3873",
        "AccessComments": "24 hours daily",
        "RelatedURL": "https://www.gewattstation.com",
        "DistanceUnit": 0
    },
    "Connections": [
        {
            "ID": 173891,
            "ConnectionTypeID": 1,
            "LevelID": 2,
            "Amps": 16,
            "Voltage": 230,
            "PowerKW": 3.7,
            "CurrentTypeID": 10,
            "Quantity": 1
        }
    ],
    "DateLastStatusUpdate": "2020-06-26T02:59:00Z",
    "DataQualityLevel": 3,
    "DateCreated": "2019-04-06T05:03:00Z",
    "SubmissionStatusTypeID": 100
}