{
    "IsRecentlyVerified": false,
    "ID": 122748,
    "UUID": "5B7A02CC-3472-40FB-BCF1-6C56DE23CA46",
    "DataProviderID": 2,
    "DataProvidersReference": "121193",
    "OperatorID": 3318,
    "UsageTypeID": 1,
    "AddressInfo": {
        "ID": 123094,
        "Title": "Walmart 124 Little Rock",
        "AddressLine1": "8801 Baseline Road",
        "Town": "Little Rock",
        "StateOrProvince": "AR",
        "Postcode": "72209",
        "CountryID": 2,
        "Latitude": 34.668684,
        "Longitude": -92.376676,
        "ContactTelephone1": "833-632-2778",
        "AccessComments": "24 hours daily",
        "RelatedURL": "https://www.electrifyamerica.com/",
        "DistanceUnit": 0
    },
    "Connections": [
        {
            "ID": 172662,
            "ConnectionTypeID": 2,
            "LevelID": 2,
            "Amps": 100,
            "Voltage": 400,
            "PowerKW": 40,
            "CurrentTypeID": 10,
            "Quantity": 1
        },
        {
            "ID": 172663,
            "ConnectionTypeID": 32,
            "LevelID": 2,
            "Amps": 100,
            "Voltage": 400,
            "PowerKW": 40,
            "CurrentTypeID": 10,
            "Quantity": 1
        }
    ],
    "DateLastStatusUpdate": "2019-04-06T05:03:00Z",
    "DataQualityLevel": 3,
    "DateCreated": "2019-04-06T05:03:00Z",
    "SubmissionStatusTypeID": 100
}