{
    "MediaItems": [
        {
            "ID": 18485,
            "ChargePointID": 24704,
            "ItemURL": "https://s3-ap-southeast-2.amazonaws.com/openchargemap/images/GB/OCM24704/OCM-24704.orig.2019052211053581.jpg",
            "ItemThumbnailURL": "https://s3-ap-southeast-2.amazonaws.com/openchargemap/images/GB/OCM24704/OCM-24704.thmb.2019052211053581.jpg",
            "Comment": "",
            "IsEnabled": true,
            "IsVideo": false,
            "IsFeaturedItem": false,
            "IsExternalResource": false,
            "User": {
                "ID": 15366,
                "Username": "ZCWCara"
            },
            "DateCreated": "2019-05-22T11:06:00Z"
        },
        {
            "ID": 18486,
            "ChargePointID": 24704,
            "ItemURL": "https://s3-ap-southeast-2.amazonaws.com/openchargemap/images/GB/OCM24704/OCM-24704.orig.2019052211055789.jpg",
            "ItemThumbnailURL": "https://s3-ap-southeast-2.amazonaws.com/openchargemap/images/GB/OCM24704/OCM-24704.thmb.2019052211055789.jpg",
            "Comment": "",
            "IsEnabled": true,
            "IsVideo": false,
            "IsFeaturedItem": false,
            "IsExternalResource": false,
            "User": {
                "ID": 15366,
                "Username": "ZCWCara"
            },
            "DateCreated": "2019-05-22T11:06:00Z"
        }
    ],
    "IsRecentlyVerified": false,
    "ID": 24704,
    "UUID": "8D91E42D-0E4D-4CBC-B0E3-2CE4D8952534",
    "DataProviderID": 1,
    "OperatorID": 19,
    "UsageTypeID": 1,
    "UsageCost": "Free for customers",
    "AddressInfo": {
        "ID": 25050,
        "Title": "The Izaak Walton Hotel ",
        "AddressLine1": "Dovedale",
        "AddressLine2": "Ilam",
        "Town": "Nr. Ashbourne",
        "StateOrProvince": "Staffordshire",
        "Postcode": "DE6 2AY",
        "CountryID": 1,
        "Latitude": 53.054078,
        "Longitude": -1.787825,
        "ContactTelephone1": "01335 350981",
        "ContactEmail": "reception@izaakwaltonhotel.com",
        "RelatedURL": "http://www.izaakwaltonhotel.com/",
        "DistanceUnit": 0
    },
    "Connections": [
        {
            "ID": 27018,
            "ConnectionTypeID": 25,
            "StatusTypeID": 50,
            "LevelID": 2,
            "Amps": 32,
            "Voltage": 230,
            "PowerKW": 7,
            "CurrentTypeID": 10,
            "Quantity": 1
        },
        {
            "ID": 27019,
            "ConnectionTypeID": 3,
            "StatusTypeID": 50,
            "LevelID": 2,
            "Amps": 3,
            "Voltage": 230,
            "PowerKW": 3,
            "CurrentTypeID": 10,
            "Quantity": 1
        }
    ],
    "NumberOfPoints": 2,
    "StatusTypeID": 50,
    "DateLastStatusUpdate": "2019-05-22T11:06:00Z",
    "DataQualityLevel": 1,
    "DateCreated": "2014-11-01T03:05:00Z",
    "SubmissionStatusTypeID": 200
}