{
    "IsRecentlyVerified": false,
    "ID": 81918,
    "UUID": "CBBFF6B4-F2C6-49BA-8EB7-C9A755CC10B8",
    "DataProviderID": 1,
    "OperatorID": 23,
    "OperatorsReference": "22335",
    "UsageTypeID": 6,
    "AddressInfo": {
        "ID": 82264,
        "Title": "Sanborn's Taxquena",
        "AddressLine1": "Av. Miguel Angel de Quevedo 1030 Parque San Andres",
        "Town": "Coyoacan",
        "StateOrProvince": "Ciudad de Mexico",
        "Postcode": "4040",
        "CountryID": 146,
        "Latitude": 19.342994,
        "Longitude": -99.149345,
        "ContactTelephone1": "+52 55 5544 1154",
        "DistanceUnit": 0
    },
    "Connections": [
        {
            "ID": 116677,
            "ConnectionTypeID": 30,
            "StatusTypeID": 50,
            "LevelID": 2,
            "PowerKW": 18,
            "CurrentTypeID": 20,
            "Quantity": 2
        }
    ],
    "NumberOfPoints": 2,
    "GeneralComments": "2 Tesla Connectors, up to 18kW.Available for patrons only. Self park.",
    "StatusTypeID": 50,
    "DateLastStatusUpdate": "2017-02-03T13:29:00Z",
    "DataQualityLevel": 1,
    "DateCreated": "2017-02-03T13:29:00Z",
    "SubmissionStatusTypeID": 200
}