{
    "IsRecentlyVerified": false,
    "ID": 130537,
    "UUID": "57BB4A2C-658D-4183-83EA-162C4EFF30DE",
    "DataProviderID": 1,
    "OperatorID": 80,
    "UsageTypeID": 4,
    "AddressInfo": {
        "ID": 130883,
        "Title": "Nemi Trebbiano | EnelX",
        "AddressLine1": "Via del Trebbiano",
        "Town": "Nemi",
        "StateOrProvince": "RM",
        "Postcode": "00040",
        "CountryID": 112,
        "Latitude": 41.70279988961087,
        "Longitude": 12.709143790757594,
        "ContactTelephone1": "800.069.850",
        "RelatedURL": "https://www.enelx.com/it/it/emobility",
        "DistanceUnit": 0
    },
    "Connections": [
        {
            "ID": 182736,
            "ConnectionTypeID": 25,
            "StatusTypeID": 50,
            "LevelID": 2,
            "Amps": 32,
            "Voltage": 400,
            "PowerKW": 22,
            "CurrentTypeID": 20,
            "Quantity": 1
        },
        {
            "ID": 182737,
            "ConnectionTypeID": 36,
            "StatusTypeID": 50,
            "LevelID": 2,
            "Amps": 16,
            "Voltage": 240,
            "PowerKW": 3.7,
            "CurrentTypeID": 10,
            "Quantity": 1
        }
    ],
    "NumberOfPoints": 2,
    "StatusTypeID": 50,
    "DateLastStatusUpdate": "2019-08-06T10:06:00Z",
    "DataQualityLevel": 1,
    "DateCreated": "2019-08-06T10:06:00Z",
    "SubmissionStatusTypeID": 200
}