{
    "IsRecentlyVerified": false,
    "ID": 178064,
    "UUID": "472C8707-AFFB-4EDA-8EF7-44937FC6DA04",
    "DataProviderID": 29,
    "DataProvidersReference": "9964",
    "OperatorID": 86,
    "AddressInfo": {
        "ID": 178423,
        "Title": "Florianweg 1",
        "AddressLine1": "Florianweg 1",
        "Town": "Neenstetten",
        "Postcode": "89189",
        "CountryID": 87,
        "Latitude": 48.542435,
        "Longitude": 10.02037,
        "DistanceUnit": 0
    },
    "Connections": [
        {
            "ID": 277999,
            "ConnectionTypeID": 25,
            "StatusTypeID": 50,
            "LevelID": 2,
            "PowerKW": 22,
            "CurrentTypeID": 20
        },
        {
            "ID": 278000,
            "ConnectionTypeID": 25,
            "StatusTypeID": 50,
            "LevelID": 2,
            "PowerKW": 22,
            "CurrentTypeID": 20
        }
    ],
    "StatusTypeID": 0,
    "DateLastStatusUpdate": "2021-07-09T03:12:00Z",
    "MetadataValues": [
        {
            "ID": 10358,
            "MetadataFieldID": 4,
            "ItemValue": "Data from the German chargepoint registry provided by Bundesnetzagentur.de under the CC-BY 4.0 license"
        }
    ],
    "DataQualityLevel": 3,
    "DateCreated": "2021-07-08T09:49:00Z",
    "SubmissionStatusTypeID": 100
}