{
    "IsRecentlyVerified": false,
    "ID": 184445,
    "UUID": "44AD21F8-C114-4DF3-9217-272E4D159982",
    "DataProviderID": 29,
    "DataProvidersReference": "3690",
    "OperatorID": 103,
    "AddressInfo": {
        "ID": 184804,
        "Title": "Charlottenburger Ufer 1",
        "AddressLine1": "Charlottenburger Ufer 1",
        "Town": "Berlin",
        "Postcode": "10587",
        "CountryID": 87,
        "Latitude": 52.52122,
        "Longitude": 13.300289,
        "DistanceUnit": 0
    },
    "Connections": [
        {
            "ID": 292741,
            "ConnectionTypeID": 25,
            "StatusTypeID": 50,
            "LevelID": 2,
            "PowerKW": 11,
            "CurrentTypeID": 20
        },
        {
            "ID": 292742,
            "ConnectionTypeID": 25,
            "StatusTypeID": 50,
            "LevelID": 2,
            "PowerKW": 11,
            "CurrentTypeID": 20
        }
    ],
    "StatusTypeID": 50,
    "DateLastStatusUpdate": "2021-07-12T02:50:00Z",
    "MetadataValues": [
        {
            "ID": 16736,
            "MetadataFieldID": 4,
            "ItemValue": "Data from the German chargepoint registry provided by Bundesnetzagentur.de under the CC-BY 4.0 license"
        }
    ],
    "DataQualityLevel": 3,
    "DateCreated": "2021-07-08T10:05:00Z",
    "SubmissionStatusTypeID": 100
}