{
    "IsRecentlyVerified": false,
    "ID": 140830,
    "UUID": "0772BC01-83F9-4227-A361-DEA3B6BFF41E",
    "DataProviderID": 2,
    "DataProvidersReference": "123269",
    "OperatorID": 3372,
    "UsageTypeID": 2,
    "AddressInfo": {
        "ID": 141182,
        "Title": "Vivante Apartments",
        "AddressLine1": "26609 Gading Rd",
        "Town": "Hayward",
        "StateOrProvince": "CA",
        "Postcode": "94544",
        "CountryID": 2,
        "Latitude": 37.6405184,
        "Longitude": -122.0818803,
        "ContactTelephone1": "866-816-7584",
        "AccessComments": "24 hours daily",
        "RelatedURL": "http://evconnect.com/",
        "DistanceUnit": 0
    },
    "Connections": [
        {
            "ID": 196573,
            "ConnectionTypeID": 1,
            "LevelID": 2,
            "Amps": 16,
            "Voltage": 230,
            "PowerKW": 3.7,
            "CurrentTypeID": 10,
            "Quantity": 2
        }
    ],
    "StatusTypeID": 50,
    "DateLastStatusUpdate": "2020-06-26T02:59:00Z",
    "DataQualityLevel": 3,
    "DateCreated": "2019-12-24T09:14:00Z",
    "SubmissionStatusTypeID": 100
}