{
    "UserComments": [
        {
            "ID": 3562,
            "ChargePointID": 22821,
            "CommentTypeID": 100,
            "UserName": "tim_battersby",
            "Comment": "Location has 3 dedicated charging bays two type 2 and one three pin.",
            "Rating": 4,
            "DateCreated": "2015-01-11T09:19:02.777Z",
            "User": {
                "ID": 1250,
                "Username": "tim_battersby"
            },
            "CheckinStatusTypeID": 10
        }
    ],
    "IsRecentlyVerified": false,
    "ID": 22821,
    "UUID": "3568251B-2968-45E2-A5EA-E0C8BAEDFBA9",
    "DataProviderID": 1,
    "OperatorID": 3295,
    "UsageTypeID": 5,
    "UsageCost": "Free",
    "AddressInfo": {
        "ID": 23166,
        "Title": "Teesside University Clarendon Road",
        "AddressLine1": "Clarendon Road",
        "Town": "Middlesbrough",
        "Postcode": "TS1 3DP",
        "CountryID": 1,
        "Latitude": 54.571284,
        "Longitude": -1.234692,
        "DistanceUnit": 0
    },
    "Connections": [
        {
            "ID": 24502,
            "ConnectionTypeID": 25,
            "StatusTypeID": 50,
            "LevelID": 2,
            "Amps": 32,
            "Voltage": 230,
            "PowerKW": 7,
            "CurrentTypeID": 10,
            "Quantity": 4
        }
    ],
    "NumberOfPoints": 4,
    "GeneralComments": "Car park and charging restricted to university staff and students during the week. Full public access available at weekends.",
    "StatusTypeID": 50,
    "DateLastStatusUpdate": "2017-10-31T19:30:00Z",
    "MetadataValues": [
        {
            "ID": 808,
            "MetadataFieldID": 4,
            "ItemValue": "Contains public sector information licensed under the Open Government Licence v2.0. http://www.nationalarchives.gov.uk/doc/open-government-licence/version/2/"
        }
    ],
    "DataQualityLevel": 3,
    "DateCreated": "2014-03-22T08:42:00Z",
    "SubmissionStatusTypeID": 200
}