{
    "IsRecentlyVerified": false,
    "ID": 115646,
    "UUID": "D9BB98D2-5F16-44AF-9415-D0A6238E669B",
    "DataProviderID": 2,
    "DataProvidersReference": "113329",
    "OperatorID": 23,
    "UsageTypeID": 2,
    "AddressInfo": {
        "ID": 115992,
        "Title": "Airbnb - Gold Mine - Tesla Destination",
        "AddressLine1": "10 Gold Mine Dr",
        "Town": "San Francisco",
        "StateOrProvince": "CA",
        "Postcode": "94131",
        "CountryID": 2,
        "Latitude": 37.744131,
        "Longitude": -122.43674,
        "ContactTelephone1": "",
        "AccessComments": "Available for Airbnb patrons only; for Tesla use only",
        "RelatedURL": "https://www.tesla.com/destination-charging",
        "DistanceUnit": 0
    },
    "Connections": [
        {
            "ID": 162672,
            "ConnectionTypeID": 0,
            "LevelID": 2,
            "Amps": 16,
            "Voltage": 230,
            "PowerKW": 3,
            "CurrentTypeID": 10,
            "Quantity": 1
        }
    ],
    "DateLastStatusUpdate": "2019-04-06T04:02:00Z",
    "DataQualityLevel": 3,
    "DateCreated": "2019-02-11T07:13:00Z",
    "SubmissionStatusTypeID": 100
}