{
    "IsRecentlyVerified": false,
    "ID": 186369,
    "UUID": "6E80BD37-2431-4519-A2B5-96B48AF0E63D",
    "DataProviderID": 29,
    "DataProvidersReference": "18588",
    "AddressInfo": {
        "ID": 186728,
        "Title": "Olper Str. 9",
        "AddressLine1": "Olper Str. 9",
        "Town": "Eslohe",
        "Postcode": "59889",
        "CountryID": 87,
        "Latitude": 51.201368,
        "Longitude": 8.158175,
        "DistanceUnit": 0
    },
    "Connections": [
        {
            "ID": 298905,
            "ConnectionTypeID": 25,
            "StatusTypeID": 50,
            "LevelID": 2,
            "PowerKW": 22,
            "CurrentTypeID": 20
        }
    ],
    "StatusTypeID": 50,
    "DateLastStatusUpdate": "2021-07-12T02:46:00Z",
    "MetadataValues": [
        {
            "ID": 18610,
            "MetadataFieldID": 4,
            "ItemValue": "Data from the German chargepoint registry provided by Bundesnetzagentur.de under the CC-BY 4.0 license"
        }
    ],
    "DataQualityLevel": 3,
    "DateCreated": "2021-07-12T02:46:00Z",
    "SubmissionStatusTypeID": 100
}