{
    "IsRecentlyVerified": false,
    "ID": 84498,
    "UUID": "76065103-9296-40B9-AD0C-F93063B51181",
    "DataProviderID": 1,
    "OperatorID": 23,
    "OperatorsReference": "25369",
    "UsageTypeID": 4,
    "AddressInfo": {
        "ID": 84844,
        "Title": "Hôtel Bellevue",
        "AddressLine1": "Rue du Candèlas",
        "Town": "Saint Martin D'Ardèche",
        "Postcode": "7700",
        "CountryID": 80,
        "Latitude": 44.301009,
        "Longitude": 4.567624,
        "ContactTelephone1": "+33 4 75 04 66 72",
        "DistanceUnit": 0
    },
    "Connections": [
        {
            "ID": 119973,
            "ConnectionTypeID": 30,
            "StatusTypeID": 50,
            "LevelID": 2,
            "Amps": 32,
            "Voltage": 230,
            "PowerKW": 17,
            "CurrentTypeID": 20,
            "Quantity": 1
        }
    ],
    "NumberOfPoints": 1,
    "GeneralComments": "1 Tesla Connector, up to 17kW.Available for customers. Please see front desk.",
    "StatusTypeID": 50,
    "DateLastStatusUpdate": "2018-10-03T22:03:00Z",
    "DataQualityLevel": 1,
    "DateCreated": "2017-03-02T06:37:00Z",
    "SubmissionStatusTypeID": 200
}