{
    "IsRecentlyVerified": false,
    "ID": 176174,
    "UUID": "5D09711B-61CC-4437-8A8F-987A47C5FEB3",
    "DataProviderID": 1,
    "OperatorID": 214,
    "UsageTypeID": 4,
    "AddressInfo": {
        "ID": 176533,
        "Title": "Wittenauer Straße",
        "AddressLine1": "Wittenauer Straße",
        "Town": "Berlin",
        "StateOrProvince": "Berlin",
        "Postcode": "13435",
        "CountryID": 87,
        "Latitude": 52.60401361990415,
        "Longitude": 13.335543942780077,
        "DistanceUnit": 0
    },
    "Connections": [
        {
            "ID": 273776,
            "ConnectionTypeID": 25,
            "Reference": "DEALLEGO0019241",
            "StatusTypeID": 50,
            "LevelID": 2,
            "Amps": 16,
            "Voltage": 400,
            "PowerKW": 11,
            "CurrentTypeID": 20,
            "Quantity": 1
        },
        {
            "ID": 273777,
            "ConnectionTypeID": 25,
            "Reference": "DEALLEGO0019242",
            "StatusTypeID": 50,
            "LevelID": 2,
            "Amps": 16,
            "Voltage": 400,
            "PowerKW": 11,
            "CurrentTypeID": 20,
            "Quantity": 1
        }
    ],
    "NumberOfPoints": 2,
    "StatusTypeID": 50,
    "DateLastStatusUpdate": "2021-06-29T12:24:00Z",
    "DataQualityLevel": 1,
    "DateCreated": "2021-06-29T12:24:00Z",
    "SubmissionStatusTypeID": 200
}