{
    "IsRecentlyVerified": false,
    "ID": 180597,
    "UUID": "4E20A583-9597-4A39-85A5-6CAE950B9CD9",
    "DataProviderID": 29,
    "DataProvidersReference": "6549",
    "AddressInfo": {
        "ID": 180956,
        "Title": "Ostring 18",
        "AddressLine1": "Ostring 18",
        "Town": "Rodgau",
        "Postcode": "63110",
        "CountryID": 87,
        "Latitude": 50.02748,
        "Longitude": 8.886415,
        "DistanceUnit": 0
    },
    "Connections": [
        {
            "ID": 283862,
            "ConnectionTypeID": 25,
            "StatusTypeID": 50,
            "LevelID": 2,
            "PowerKW": 22,
            "CurrentTypeID": 20
        },
        {
            "ID": 283863,
            "ConnectionTypeID": 25,
            "StatusTypeID": 50,
            "LevelID": 2,
            "PowerKW": 22,
            "CurrentTypeID": 20
        }
    ],
    "StatusTypeID": 50,
    "DateLastStatusUpdate": "2021-07-09T03:18:00Z",
    "MetadataValues": [
        {
            "ID": 12891,
            "MetadataFieldID": 4,
            "ItemValue": "Data from the German chargepoint registry provided by Bundesnetzagentur.de under the CC-BY 4.0 license"
        }
    ],
    "DataQualityLevel": 3,
    "DateCreated": "2021-07-08T10:00:00Z",
    "SubmissionStatusTypeID": 100
}