{
    "IsRecentlyVerified": false,
    "ID": 172769,
    "UUID": "26E95318-C510-44D7-83B9-B8A0BB925B30",
    "DataProviderID": 1,
    "OperatorID": 3434,
    "UsageTypeID": 4,
    "AddressInfo": {
        "ID": 173128,
        "Title": "מיקדו G",
        "AddressLine1": "Aharon Becker St 8",
        "Town": "Tel Aviv",
        "CountryID": 111,
        "Latitude": 32.1227536,
        "Longitude": 34.8163938,
        "ContactTelephone2": "https://user.evedge.co.il/#/portal/locations",
        "DistanceUnit": 0
    },
    "Connections": [
        {
            "ID": 264247,
            "ConnectionTypeID": 25,
            "StatusTypeID": 50,
            "LevelID": 3,
            "PowerKW": 43,
            "CurrentTypeID": 20,
            "Quantity": 1
        },
        {
            "ID": 264248,
            "ConnectionTypeID": 33,
            "StatusTypeID": 50,
            "LevelID": 3,
            "PowerKW": 50,
            "CurrentTypeID": 30,
            "Quantity": 1
        },
        {
            "ID": 264249,
            "ConnectionTypeID": 2,
            "StatusTypeID": 50,
            "LevelID": 3,
            "PowerKW": 50,
            "CurrentTypeID": 30,
            "Quantity": 1
        }
    ],
    "NumberOfPoints": 1,
    "StatusTypeID": 50,
    "DateLastStatusUpdate": "2021-02-16T17:49:00Z",
    "DataQualityLevel": 1,
    "DateCreated": "2021-02-16T14:16:00Z",
    "SubmissionStatusTypeID": 200
}