{
    "IsRecentlyVerified": false,
    "ID": 187107,
    "UUID": "BBFE408D-CF5F-4367-BC10-291A535D99DF",
    "DataProviderID": 29,
    "DataProvidersReference": "7108",
    "OperatorID": 45,
    "AddressInfo": {
        "ID": 187466,
        "Title": "Hauptstr. 34",
        "AddressLine1": "Hauptstr. 34",
        "Town": "Hambergen",
        "Postcode": "27729",
        "CountryID": 87,
        "Latitude": 53.3077574,
        "Longitude": 8.8369523,
        "DistanceUnit": 0
    },
    "Connections": [
        {
            "ID": 301230,
            "ConnectionTypeID": 25,
            "StatusTypeID": 50,
            "LevelID": 2,
            "PowerKW": 22,
            "CurrentTypeID": 20
        },
        {
            "ID": 301231,
            "ConnectionTypeID": 33,
            "StatusTypeID": 50,
            "LevelID": 3,
            "PowerKW": 50,
            "CurrentTypeID": 30
        },
        {
            "ID": 301232,
            "ConnectionTypeID": 1036,
            "StatusTypeID": 50,
            "LevelID": 3,
            "PowerKW": 50,
            "CurrentTypeID": 30
        },
        {
            "ID": 301233,
            "ConnectionTypeID": 2,
            "StatusTypeID": 50,
            "LevelID": 3,
            "PowerKW": 50,
            "CurrentTypeID": 30
        }
    ],
    "StatusTypeID": 50,
    "DateLastStatusUpdate": "2021-07-12T02:51:00Z",
    "MetadataValues": [
        {
            "ID": 19347,
            "MetadataFieldID": 4,
            "ItemValue": "Data from the German chargepoint registry provided by Bundesnetzagentur.de under the CC-BY 4.0 license"
        }
    ],
    "DataQualityLevel": 3,
    "DateCreated": "2021-07-12T02:51:00Z",
    "SubmissionStatusTypeID": 100
}