{
    "IsRecentlyVerified": false,
    "ID": 113046,
    "UUID": "CE2BC847-CFFD-410C-954E-42B3AFA84FA3",
    "DataProviderID": 2,
    "DataProvidersReference": "104820",
    "OperatorID": 3318,
    "UsageTypeID": 1,
    "AddressInfo": {
        "ID": 113392,
        "Title": "National Corvette Museum",
        "AddressLine1": "350 Corvette Dr.",
        "Town": "Bowling Green",
        "StateOrProvince": "KY",
        "Postcode": "42101",
        "CountryID": 2,
        "Latitude": 37.003304,
        "Longitude": -86.374937,
        "ContactTelephone1": "833-632-2778",
        "AccessComments": "24 hours daily",
        "RelatedURL": "https://www.electrifyamerica.com/",
        "DistanceUnit": 0
    },
    "Connections": [
        {
            "ID": 159206,
            "ConnectionTypeID": 2,
            "LevelID": 2,
            "Amps": 100,
            "Voltage": 400,
            "PowerKW": 40,
            "CurrentTypeID": 10,
            "Quantity": 1
        },
        {
            "ID": 159207,
            "ConnectionTypeID": 32,
            "LevelID": 2,
            "Amps": 100,
            "Voltage": 400,
            "PowerKW": 40,
            "CurrentTypeID": 10,
            "Quantity": 1
        }
    ],
    "DateLastStatusUpdate": "2019-04-06T04:02:00Z",
    "DataQualityLevel": 3,
    "DateCreated": "2018-11-28T02:04:00Z",
    "SubmissionStatusTypeID": 100
}