{
    "IsRecentlyVerified": false,
    "ID": 74336,
    "UUID": "BB571B95-BA8D-4602-BE6B-1C33C5F66FA0",
    "DataProviderID": 1,
    "OperatorID": 44,
    "UsageTypeID": 3,
    "UsageCost": "0,30€/kWh",
    "AddressInfo": {
        "ID": 74682,
        "Title": "Ladepunkt Jahnstraße",
        "AddressLine1": "Jahnstraße 8",
        "Town": "Dürbheim",
        "StateOrProvince": "Verwaltungsgemeinschaft Spaichingen",
        "Postcode": "78589",
        "CountryID": 87,
        "Latitude": 48.0562,
        "Longitude": 8.789690000000064,
        "ContactTelephone1": "+49 174 1014781",
        "AccessComments": "Ladestelle befindet sich direkt am Haus unter einem Glasdach. Der Typ 2-Stecker ist fest mit einem sechs Meter-Kabel verbunden. Laden nur nach telefonischer Voranmeldung bei Herrn Hug möglich!",
        "DistanceUnit": 0
    },
    "Connections": [
        {
            "ID": 106896,
            "ConnectionTypeID": 1036,
            "StatusTypeID": 50,
            "LevelID": 2,
            "Amps": 32,
            "Voltage": 400,
            "PowerKW": 22,
            "CurrentTypeID": 20,
            "Quantity": 1
        }
    ],
    "NumberOfPoints": 1,
    "StatusTypeID": 50,
    "DateLastStatusUpdate": "2016-12-02T06:52:00Z",
    "DataQualityLevel": 1,
    "DateCreated": "2016-12-02T06:52:00Z",
    "SubmissionStatusTypeID": 200
}