{
    "IsRecentlyVerified": true,
    "DateLastVerified": "2021-08-29T14:14:00Z",
    "ID": 188984,
    "UUID": "3CA54414-EA1F-4A95-A22E-68E5B2F2C14D",
    "DataProviderID": 1,
    "OperatorID": 2247,
    "UsageTypeID": 1,
    "UsageCost": "0,3049 €/kWh",
    "AddressInfo": {
        "ID": 189343,
        "Title": "Hotel Restaurante La Parra",
        "AddressLine1": "N-634, 285",
        "Town": "Ribadedeva",
        "StateOrProvince": "Asturias ",
        "CountryID": 210,
        "Latitude": 43.38571297099057,
        "Longitude": -4.5713444565130885,
        "DistanceUnit": 0
    },
    "Connections": [
        {
            "ID": 305443,
            "ConnectionTypeID": 33,
            "StatusTypeID": 50,
            "LevelID": 3,
            "PowerKW": 50,
            "CurrentTypeID": 30,
            "Quantity": 1
        },
        {
            "ID": 305444,
            "ConnectionTypeID": 2,
            "StatusTypeID": 50,
            "LevelID": 3,
            "PowerKW": 50,
            "CurrentTypeID": 30,
            "Quantity": 1
        },
        {
            "ID": 305445,
            "ConnectionTypeID": 1036,
            "StatusTypeID": 50,
            "LevelID": 3,
            "PowerKW": 43,
            "CurrentTypeID": 20,
            "Quantity": 1
        }
    ],
    "NumberOfPoints": 1,
    "StatusTypeID": 50,
    "DateLastStatusUpdate": "2021-09-01T08:00:00Z",
    "DataQualityLevel": 1,
    "DateCreated": "2021-08-29T14:14:00Z",
    "SubmissionStatusTypeID": 200
}