{
    "IsRecentlyVerified": false,
    "ID": 136173,
    "UUID": "501551E3-2386-4B2A-BB98-733088ECF44D",
    "DataProviderID": 18,
    "DataProvidersReference": "6f0b37f247acb98440090f21acd2e5fa",
    "OperatorID": 2244,
    "UsageTypeID": 5,
    "AddressInfo": {
        "ID": 136519,
        "Title": "Bath Terrace",
        "AddressLine1": "Bath Terrace",
        "Town": "London",
        "Postcode": "SE1 6PN",
        "CountryID": 1,
        "Latitude": 51.496482,
        "Longitude": -0.096888,
        "AccessComments": "",
        "RelatedURL": "https://www.ubitricity.com",
        "DistanceUnit": 0
    },
    "Connections": [
        {
            "ID": 190602,
            "ConnectionTypeID": 25,
            "Reference": "suby1100001285",
            "StatusTypeID": 50,
            "LevelID": 2,
            "Amps": 16,
            "Voltage": 230,
            "PowerKW": 3.7,
            "CurrentTypeID": 10
        }
    ],
    "StatusTypeID": 0,
    "DateLastStatusUpdate": "2021-04-25T05:46:00Z",
    "MetadataValues": [
        {
            "ID": 6025,
            "MetadataFieldID": 4,
            "ItemValue": "Contains public sector information licensed under the Open Government Licence v2.0. http://www.nationalarchives.gov.uk/doc/open-government-licence/version/2/"
        }
    ],
    "DataQualityLevel": 3,
    "DateCreated": "2019-12-24T05:22:00Z",
    "SubmissionStatusTypeID": 100
}