{
    "IsRecentlyVerified": false,
    "ID": 144928,
    "UUID": "20B0DA55-EED1-4683-A009-E921F5339741",
    "DataProviderID": 2,
    "DataProvidersReference": "145523",
    "OperatorID": 90,
    "UsageTypeID": 1,
    "AddressInfo": {
        "ID": 145280,
        "Title": "Desjardins - CdS de Lavaltrie",
        "AddressLine1": "74 Chemin de Lavaltrie",
        "Town": "Lavaltrie",
        "StateOrProvince": "QC",
        "Postcode": "J5T 2H1",
        "CountryID": 44,
        "Latitude": 45.892642,
        "Longitude": -73.292662,
        "ContactTelephone1": "877-505-2674",
        "AccessComments": "24 hours daily",
        "RelatedURL": "https://lecircuitelectrique.com/",
        "DistanceUnit": 0
    },
    "Connections": [
        {
            "ID": 201484,
            "ConnectionTypeID": 1,
            "LevelID": 2,
            "Amps": 16,
            "Voltage": 230,
            "PowerKW": 3.7,
            "CurrentTypeID": 10,
            "Quantity": 1
        }
    ],
    "StatusTypeID": 50,
    "DateLastStatusUpdate": "2020-06-26T03:10:00Z",
    "DataQualityLevel": 3,
    "DateCreated": "2019-12-24T09:24:00Z",
    "SubmissionStatusTypeID": 100
}