{
    "IsRecentlyVerified": false,
    "ID": 178836,
    "UUID": "4DFF90DE-17F5-414A-9ED1-FBEDE8504349",
    "DataProviderID": 29,
    "DataProvidersReference": "10908",
    "AddressInfo": {
        "ID": 179195,
        "Title": "Lutherstr. 56",
        "AddressLine1": "Lutherstr. 56",
        "Town": "Lutherstadt Wittenberg",
        "Postcode": "06886",
        "CountryID": 87,
        "Latitude": 51.871,
        "Longitude": 12.6433,
        "DistanceUnit": 0
    },
    "Connections": [
        {
            "ID": 279792,
            "ConnectionTypeID": 25,
            "StatusTypeID": 50,
            "LevelID": 2,
            "PowerKW": 22,
            "CurrentTypeID": 20
        },
        {
            "ID": 279793,
            "ConnectionTypeID": 25,
            "StatusTypeID": 50,
            "LevelID": 2,
            "PowerKW": 22,
            "CurrentTypeID": 20
        }
    ],
    "StatusTypeID": 0,
    "DateLastStatusUpdate": "2021-07-12T02:48:00Z",
    "MetadataValues": [
        {
            "ID": 11130,
            "MetadataFieldID": 4,
            "ItemValue": "Data from the German chargepoint registry provided by Bundesnetzagentur.de under the CC-BY 4.0 license"
        }
    ],
    "DataQualityLevel": 3,
    "DateCreated": "2021-07-08T09:50:00Z",
    "SubmissionStatusTypeID": 100
}