{
    "IsRecentlyVerified": false,
    "ID": 6989,
    "UUID": "50C00EA0-5514-410C-9BFA-7C727CDA11C2",
    "DataProviderID": 1,
    "UsageTypeID": 4,
    "UsageCost": "Free",
    "AddressInfo": {
        "ID": 6890,
        "Title": "85 bis bd de Magenta",
        "AddressLine1": "85 bis boulevard de Magenta",
        "AddressLine2": "",
        "Town": "Paris",
        "StateOrProvince": "",
        "Postcode": "",
        "CountryID": 80,
        "Latitude": 48.8772631,
        "Longitude": 2.3551221999999825,
        "ContactTelephone1": "+33 01 53 20 09 69 ",
        "ContactTelephone2": "",
        "ContactEmail": "sim@semeru.fayat.com",
        "AccessComments": "http://www.paris.fr/pratique/voitures-deux-roues-motorises/bornes-de-recharge-pour-vehicules-electriques/p5775",
        "DistanceUnit": 0
    },
    "Connections": [],
    "NumberOfPoints": 1,
    "GeneralComments": "Où se procurer la carte pour recharger son véhicule électrique ? La carte est gratuite. Où la trouver ? Espace mobilités électriques 112 quater rue Marcadet (18e)- +33 01 53 20 09 69 ",
    "DateLastConfirmed": "2011-10-12T19:59:00Z",
    "StatusTypeID": 0,
    "DateLastStatusUpdate": "2011-10-12T19:59:00Z",
    "DataQualityLevel": 1,
    "DateCreated": "2011-10-12T19:59:00Z",
    "SubmissionStatusTypeID": 200
}