{
    "IsRecentlyVerified": false,
    "ID": 158519,
    "UUID": "D2706ABC-43C4-4529-A937-AE59B2E23432",
    "DataProviderID": 2,
    "DataProvidersReference": "158841",
    "OperatorID": 5,
    "UsageTypeID": 1,
    "AddressInfo": {
        "ID": 158876,
        "Title": "PLAZA VERDE",
        "AddressLine1": "23 Campus Dr",
        "Town": "Irvine",
        "StateOrProvince": "CA",
        "Postcode": "92612",
        "CountryID": 2,
        "Latitude": 33.6487984,
        "Longitude": -117.8279594,
        "ContactTelephone1": "888-758-4389",
        "AccessComments": "24 hours daily",
        "RelatedURL": "http://www.chargepoint.com/",
        "DistanceUnit": 0
    },
    "Connections": [
        {
            "ID": 228518,
            "ConnectionTypeID": 1,
            "LevelID": 2,
            "Amps": 16,
            "Voltage": 230,
            "PowerKW": 3.7,
            "CurrentTypeID": 10,
            "Quantity": 11
        }
    ],
    "StatusTypeID": 50,
    "DateLastStatusUpdate": "2020-06-26T02:55:00Z",
    "DataQualityLevel": 3,
    "DateCreated": "2020-06-26T02:55:00Z",
    "SubmissionStatusTypeID": 100
}