{
    "IsRecentlyVerified": false,
    "ID": 20330,
    "UUID": "0A4FF9A9-FEC3-4C14-8E8F-827B907C96C7",
    "DataProviderID": 1,
    "OperatorID": 1,
    "UsageTypeID": 0,
    "UsageCost": "",
    "AddressInfo": {
        "ID": 20675,
        "Title": "Intermarche - Six Fours les Plages",
        "AddressLine1": "60 traverse Font de Fillo",
        "AddressLine2": "",
        "Town": "Six Fours les Plages",
        "StateOrProvince": "",
        "Postcode": "83140",
        "CountryID": 80,
        "Latitude": 43.09448,
        "Longitude": 5.82484,
        "ContactTelephone1": "",
        "ContactTelephone2": "",
        "ContactEmail": "",
        "AccessComments": "Ouvert à tous",
        "RelatedURL": "",
        "DistanceUnit": 0
    },
    "Connections": [],
    "GeneralComments": "",
    "StatusTypeID": 50,
    "DateLastStatusUpdate": "2013-11-12T10:40:00Z",
    "DataQualityLevel": 1,
    "DateCreated": "2013-11-12T09:43:00Z",
    "SubmissionStatusTypeID": 200
}