{
    "IsRecentlyVerified": false,
    "ID": 46384,
    "UUID": "1FAB697E-881F-4963-A5E1-1B1BEAB1E1D5",
    "DataProviderID": 1,
    "DataProvidersReference": "1046",
    "AddressInfo": {
        "ID": 46730,
        "Title": "Årvoll Vest Borettslag 2, Oslo",
        "AddressLine1": "Bård Skolemesters vei ",
        "Town": "OSLO",
        "StateOrProvince": "Oslo",
        "Postcode": "0590",
        "CountryID": 168,
        "Latitude": 59.94499,
        "Longitude": 10.81158,
        "AccessComments": "",
        "DistanceUnit": 0
    },
    "Connections": [
        {
            "ID": 57047,
            "ConnectionTypeID": 0,
            "Reference": "1",
            "LevelID": 2,
            "Amps": 16,
            "Voltage": 230,
            "PowerKW": 3.7,
            "Comments": "Mode 1"
        },
        {
            "ID": 88788,
            "ConnectionTypeID": 0,
            "Reference": "2",
            "LevelID": 2,
            "Amps": 16,
            "Voltage": 230,
            "PowerKW": 3.7,
            "Comments": "Mode 1"
        }
    ],
    "NumberOfPoints": 2,
    "DateLastStatusUpdate": "2020-05-26T08:23:00Z",
    "DataQualityLevel": 2,
    "DateCreated": "2015-05-03T00:54:00Z",
    "SubmissionStatusTypeID": 100
}