{
    "IsRecentlyVerified": false,
    "ID": 113789,
    "UUID": "F5FF6B54-AE1B-47CA-9AF8-71CCFA92FCAE",
    "DataProviderID": 1,
    "OperatorID": 23,
    "OperatorsReference": "47569",
    "UsageTypeID": 4,
    "AddressInfo": {
        "ID": 114135,
        "Title": "Farmers Market Parking Lot, Chico",
        "AddressLine1": "E 2ND St",
        "Town": "Chico",
        "StateOrProvince": "California",
        "Postcode": "95928",
        "CountryID": 2,
        "Latitude": 39.730972,
        "Longitude": -121.8391766,
        "ContactTelephone1": "(530) 894-4200",
        "DistanceUnit": 0
    },
    "Connections": [
        {
            "ID": 160359,
            "ConnectionTypeID": 30,
            "StatusTypeID": 50,
            "LevelID": 2,
            "PowerKW": 16,
            "CurrentTypeID": 20,
            "Quantity": 2
        }
    ],
    "NumberOfPoints": 2,
    "GeneralComments": "2 Tesla Connectors, up to 16kW.Available to the public. Self park.",
    "StatusTypeID": 50,
    "DateLastStatusUpdate": "2019-01-02T21:35:00Z",
    "DataQualityLevel": 1,
    "DateCreated": "2019-01-02T21:35:00Z",
    "SubmissionStatusTypeID": 200
}