{
    "IsRecentlyVerified": false,
    "ID": 15209,
    "UUID": "C04AE6D7-43A3-446B-A665-9A8219978415",
    "DataProviderID": 1,
    "OperatorID": 1,
    "UsageTypeID": 0,
    "UsageCost": "Free",
    "AddressInfo": {
        "ID": 15555,
        "Title": "Nissan Ndn",
        "AddressLine1": "29 Route de Mantes",
        "AddressLine2": "",
        "Town": "Chambourcy",
        "StateOrProvince": "",
        "Postcode": "78240",
        "CountryID": 80,
        "Latitude": 48.9056328,
        "Longitude": 2.0502678999999944,
        "ContactTelephone1": " 01 82 03 00 70",
        "ContactTelephone2": "",
        "ContactEmail": "",
        "AccessComments": "Horaires d'ouverture du Show-room: Lundi au Samedi de 9h à 12h30 et de 14h à 19h",
        "RelatedURL": "http://www.neubauer.fr/nissan/?concession=chambourcy",
        "DistanceUnit": 0
    },
    "Connections": [
        {
            "ID": 13499,
            "ConnectionTypeID": 2,
            "StatusTypeID": 0,
            "LevelID": 3,
            "Quantity": 1
        }
    ],
    "NumberOfPoints": 1,
    "GeneralComments": "",
    "StatusTypeID": 50,
    "DateLastStatusUpdate": "2012-12-23T12:17:00Z",
    "DataQualityLevel": 1,
    "DateCreated": "2012-12-23T12:17:00Z",
    "SubmissionStatusTypeID": 200
}