{
    "IsRecentlyVerified": false,
    "ID": 119591,
    "UUID": "8E8E3C2F-FE1A-4AF9-956A-B7C950E353A5",
    "DataProviderID": 2,
    "DataProvidersReference": "117629",
    "OperatorID": 5,
    "UsageTypeID": 1,
    "AddressInfo": {
        "ID": 119937,
        "Title": "OBE POWER",
        "AddressLine1": "44 Frontage Rd",
        "Town": "Davie",
        "StateOrProvince": "FL",
        "Postcode": "33314",
        "CountryID": 2,
        "Latitude": 26.0812238,
        "Longitude": -80.2478247,
        "ContactTelephone1": "888-758-4389",
        "AccessComments": "24 hours daily",
        "RelatedURL": "http://www.chargepoint.com/",
        "DistanceUnit": 0
    },
    "Connections": [
        {
            "ID": 168867,
            "ConnectionTypeID": 1,
            "LevelID": 2,
            "Amps": 16,
            "Voltage": 230,
            "PowerKW": 3.7,
            "CurrentTypeID": 10,
            "Quantity": 2
        }
    ],
    "DateLastStatusUpdate": "2020-06-26T02:52:00Z",
    "DataQualityLevel": 3,
    "DateCreated": "2019-04-01T04:59:00Z",
    "SubmissionStatusTypeID": 100
}