{
    "IsRecentlyVerified": false,
    "ID": 108638,
    "UUID": "CE143645-5D28-4E74-AE59-1DFB65A3C34D",
    "DataProviderID": 1,
    "OperatorID": 3296,
    "UsageTypeID": 5,
    "UsageCost": "35p/kWh",
    "AddressInfo": {
        "ID": 108984,
        "Title": "Dryburn View",
        "AddressLine1": "3 Finchale Road",
        "Town": "Durham",
        "Postcode": "DH1 5JW",
        "CountryID": 1,
        "Latitude": 54.792905,
        "Longitude": -1.5905,
        "DistanceUnit": 0
    },
    "Connections": [
        {
            "ID": 153722,
            "ConnectionTypeID": 2,
            "StatusTypeID": 50,
            "LevelID": 3,
            "PowerKW": 50,
            "CurrentTypeID": 30,
            "Quantity": 2
        },
        {
            "ID": 153723,
            "ConnectionTypeID": 33,
            "StatusTypeID": 50,
            "LevelID": 3,
            "PowerKW": 50,
            "CurrentTypeID": 30,
            "Quantity": 2
        }
    ],
    "NumberOfPoints": 2,
    "StatusTypeID": 50,
    "DateLastStatusUpdate": "2018-10-08T18:30:00Z",
    "DataQualityLevel": 1,
    "DateCreated": "2018-10-08T18:30:00Z",
    "SubmissionStatusTypeID": 200
}