{
    "IsRecentlyVerified": false,
    "ID": 85117,
    "UUID": "ADA8CCD9-BB02-44E9-BDC8-1521C1FC3398",
    "DataProviderID": 1,
    "OperatorID": 23,
    "OperatorsReference": "26029",
    "UsageTypeID": 4,
    "AddressInfo": {
        "ID": 85463,
        "Title": "Apple Parking 332 W 11th Street",
        "AddressLine1": "332 W 11th St",
        "Town": "New York",
        "StateOrProvince": "New York",
        "Postcode": "10014",
        "CountryID": 2,
        "Latitude": 40.735597,
        "Longitude": -74.007693,
        "ContactTelephone1": "(212) 741-9079",
        "DistanceUnit": 0
    },
    "Connections": [
        {
            "ID": 120875,
            "ConnectionTypeID": 30,
            "StatusTypeID": 50,
            "LevelID": 2,
            "Amps": 16,
            "Voltage": 400,
            "PowerKW": 11,
            "CurrentTypeID": 20,
            "Quantity": 3
        }
    ],
    "NumberOfPoints": 3,
    "GeneralComments": "3 Tesla Connectors, up to 11kW.Available to the public. Please call ahead.",
    "StatusTypeID": 50,
    "DateLastStatusUpdate": "2017-03-26T05:26:00Z",
    "DataQualityLevel": 1,
    "DateCreated": "2017-03-26T05:26:00Z",
    "SubmissionStatusTypeID": 200
}