{
    "IsRecentlyVerified": false,
    "ID": 99215,
    "UUID": "DAE0EE15-7B09-41B0-8D6D-9B1E388A825C",
    "DataProviderID": 1,
    "OperatorID": 25,
    "OperatorsReference": "barkinganddagenham-galestreet",
    "UsageTypeID": 4,
    "UsageCost": "£0.059/minute; min £1.18; other tariffs available",
    "AddressInfo": {
        "ID": 99561,
        "Title": "Gale Street",
        "AddressLine1": "547 Gale Street",
        "Town": "ROMFORD",
        "Postcode": "RM9 4TS",
        "CountryID": 1,
        "Latitude": 51.5375891807,
        "Longitude": 0.127378481879,
        "DistanceUnit": 0
    },
    "Connections": [
        {
            "ID": 140165,
            "ConnectionTypeID": 25,
            "StatusTypeID": 50,
            "LevelID": 2,
            "Amps": 32,
            "Voltage": 230,
            "PowerKW": 7,
            "CurrentTypeID": 10,
            "Quantity": 3
        },
        {
            "ID": 140166,
            "ConnectionTypeID": 1,
            "StatusTypeID": 50,
            "LevelID": 2,
            "Amps": 16,
            "Voltage": 230,
            "PowerKW": 4,
            "CurrentTypeID": 10,
            "Quantity": 3
        }
    ],
    "NumberOfPoints": 3,
    "StatusTypeID": 50,
    "DateLastStatusUpdate": "2018-04-14T05:36:00Z",
    "DataQualityLevel": 1,
    "DateCreated": "2018-01-24T06:32:00Z",
    "SubmissionStatusTypeID": 200
}