{
    "IsRecentlyVerified": false,
    "ID": 94074,
    "UUID": "C713E6FC-9553-4ABF-A503-9C52481B56D1",
    "DataProviderID": 1,
    "OperatorID": 86,
    "UsageTypeID": 4,
    "AddressInfo": {
        "ID": 94420,
        "Title": "Rasthof Huntetal-West",
        "AddressLine1": "A29",
        "Town": "Wardenburg",
        "StateOrProvince": "Landkreis Oldenburg",
        "Postcode": "26203",
        "CountryID": 87,
        "Latitude": 53.04490698745283,
        "Longitude": 8.220142445368994,
        "AccessComments": "24/7 nutzbar, hinter der Raststätte ganz rechts einordnen, dann auf der linken Seite hinter dem blauen Schild für LKW/PKW Parkplätze hinter der zweiten gründen Recyclingtonne.",
        "DistanceUnit": 0
    },
    "Connections": [
        {
            "ID": 133141,
            "ConnectionTypeID": 1036,
            "StatusTypeID": 50,
            "LevelID": 2,
            "Amps": 32,
            "Voltage": 400,
            "PowerKW": 22,
            "CurrentTypeID": 20,
            "Quantity": 1
        },
        {
            "ID": 133142,
            "ConnectionTypeID": 33,
            "StatusTypeID": 50,
            "LevelID": 3,
            "PowerKW": 50,
            "CurrentTypeID": 30,
            "Quantity": 1
        },
        {
            "ID": 133143,
            "ConnectionTypeID": 2,
            "StatusTypeID": 50,
            "LevelID": 3,
            "PowerKW": 50,
            "CurrentTypeID": 30,
            "Quantity": 1
        }
    ],
    "NumberOfPoints": 3,
    "GeneralComments": "Inbetriebnahme 01.11.2017",
    "StatusTypeID": 50,
    "DateLastStatusUpdate": "2017-10-16T07:17:00Z",
    "DataQualityLevel": 1,
    "DateCreated": "2017-10-16T07:17:00Z",
    "SubmissionStatusTypeID": 200
}