{
    "IsRecentlyVerified": false,
    "ID": 84161,
    "UUID": "70742FB7-BD0C-4E2C-8089-E6958772D7E3",
    "DataProviderID": 1,
    "OperatorID": 23,
    "OperatorsReference": "24397",
    "UsageTypeID": 4,
    "AddressInfo": {
        "ID": 84507,
        "Title": "Hotel Hafen Flensburg",
        "AddressLine1": "33 Schiffbrücke",
        "Town": "Flensburg",
        "Postcode": "24939",
        "CountryID": 87,
        "Latitude": 54.792487,
        "Longitude": 9.433292,
        "ContactTelephone1": "+49 4611 60680",
        "DistanceUnit": 0
    },
    "Connections": [
        {
            "ID": 119562,
            "ConnectionTypeID": 30,
            "StatusTypeID": 50,
            "LevelID": 2,
            "Amps": 32,
            "Voltage": 400,
            "PowerKW": 22,
            "CurrentTypeID": 20,
            "Quantity": 2
        }
    ],
    "NumberOfPoints": 2,
    "GeneralComments": "2 Tesla Connectors, up to 22kW.Available for customers. Please see front desk.",
    "StatusTypeID": 50,
    "DateLastStatusUpdate": "2018-10-03T19:55:00Z",
    "DataQualityLevel": 1,
    "DateCreated": "2017-02-16T17:04:00Z",
    "SubmissionStatusTypeID": 200
}