{
    "IsRecentlyVerified": false,
    "ID": 7982,
    "UUID": "B0F44A77-A4F6-4A7F-9E4F-091FDB5CC413",
    "DataProviderID": 15,
    "DataProvidersReference": "10778",
    "OperatorID": 5,
    "UsageTypeID": 2,
    "AddressInfo": {
        "ID": 7879,
        "Title": "109 E 58th St",
        "AddressLine1": "109 E 58th St",
        "Town": "New York",
        "StateOrProvince": "New York",
        "Postcode": "10022",
        "CountryID": 2,
        "Latitude": 40.76202393,
        "Longitude": -73.96981049,
        "ContactTelephone1": "",
        "RelatedURL": "http://carstations.com/10778",
        "DistanceUnit": 0
    },
    "Connections": [
        {
            "ID": 5411,
            "ConnectionTypeID": 9,
            "Reference": "NEMA5",
            "LevelID": 1,
            "Quantity": 1
        },
        {
            "ID": 6189,
            "ConnectionTypeID": 1,
            "Reference": "J1772",
            "LevelID": 2
        }
    ],
    "NumberOfPoints": 1,
    "StatusTypeID": 0,
    "DateLastStatusUpdate": "2017-11-04T14:04:00Z",
    "DataQualityLevel": 1,
    "DateCreated": "2011-11-11T12:05:00Z",
    "SubmissionStatusTypeID": 100
}