{
    "IsRecentlyVerified": false,
    "ID": 176716,
    "UUID": "4CB55269-0AD7-41AE-8627-4EBB0B9E8B32",
    "DataProviderID": 29,
    "DataProvidersReference": "12029",
    "OperatorID": 86,
    "AddressInfo": {
        "ID": 177075,
        "Title": "Marktplatz 1",
        "AddressLine1": "Marktplatz 1",
        "Town": "Baienfurt",
        "Postcode": "88255",
        "CountryID": 87,
        "Latitude": 47.828076,
        "Longitude": 9.650301,
        "DistanceUnit": 0
    },
    "Connections": [
        {
            "ID": 274951,
            "ConnectionTypeID": 28,
            "StatusTypeID": 50,
            "LevelID": 2,
            "PowerKW": 22,
            "CurrentTypeID": 10
        },
        {
            "ID": 274952,
            "ConnectionTypeID": 28,
            "StatusTypeID": 50,
            "LevelID": 2,
            "PowerKW": 22,
            "CurrentTypeID": 10
        }
    ],
    "StatusTypeID": 0,
    "DateLastStatusUpdate": "2021-07-09T03:10:00Z",
    "MetadataValues": [
        {
            "ID": 9011,
            "MetadataFieldID": 4,
            "ItemValue": "Data from the German chargepoint registry provided by Bundesnetzagentur.de under the CC-BY 4.0 license"
        }
    ],
    "DataQualityLevel": 3,
    "DateCreated": "2021-07-08T09:48:00Z",
    "SubmissionStatusTypeID": 100
}