{
    "MediaItems": [
        {
            "ID": 28337,
            "ChargePointID": 176135,
            "ItemURL": "https://s3-ap-southeast-2.amazonaws.com/openchargemap/images/GR/OCM176135/OCM-176135.orig.2021062808235594.jpg",
            "ItemThumbnailURL": "https://s3-ap-southeast-2.amazonaws.com/openchargemap/images/GR/OCM176135/OCM-176135.thmb.2021062808235594.jpg",
            "Comment": "",
            "IsEnabled": true,
            "IsVideo": false,
            "IsFeaturedItem": false,
            "IsExternalResource": false,
            "User": {
                "ID": 18761,
                "Username": "EVentusiast"
            },
            "DateCreated": "2021-06-28T08:24:00Z"
        },
        {
            "ID": 28336,
            "ChargePointID": 176135,
            "ItemURL": "https://s3-ap-southeast-2.amazonaws.com/openchargemap/images/GR/OCM176135/OCM-176135.orig.2021062808232305.png",
            "ItemThumbnailURL": "https://s3-ap-southeast-2.amazonaws.com/openchargemap/images/GR/OCM176135/OCM-176135.thmb.2021062808232305.png",
            "Comment": "",
            "IsEnabled": true,
            "IsVideo": false,
            "IsFeaturedItem": false,
            "IsExternalResource": false,
            "User": {
                "ID": 18761,
                "Username": "EVentusiast"
            },
            "DateCreated": "2021-06-28T08:23:00Z"
        }
    ],
    "IsRecentlyVerified": false,
    "ID": 176135,
    "UUID": "0468C96E-46F8-4475-8BCF-78AD0379CFAF",
    "DataProviderID": 1,
    "OperatorID": 85,
    "UsageTypeID": 1,
    "UsageCost": "Free",
    "AddressInfo": {
        "ID": 176494,
        "Title": "Charging Station Kritis Str. Region  of Peloponnese",
        "AddressLine1": "Κρήτης 15",
        "Town": "Municipality of Kalamata",
        "StateOrProvince": "Messenia Regional Unit",
        "Postcode": "24100",
        "CountryID": 90,
        "Latitude": 37.027506201461705,
        "Longitude": 22.11289670299493,
        "AccessComments": "Region of Peloponnese",
        "RelatedURL": "https://www.ppel.gov.gr/",
        "DistanceUnit": 0
    },
    "Connections": [
        {
            "ID": 273675,
            "ConnectionTypeID": 25,
            "StatusTypeID": 50,
            "LevelID": 2,
            "Amps": 32,
            "Voltage": 400,
            "PowerKW": 22,
            "CurrentTypeID": 20,
            "Quantity": 2
        }
    ],
    "NumberOfPoints": 2,
    "StatusTypeID": 75,
    "DateLastStatusUpdate": "2021-06-28T08:24:00Z",
    "DataQualityLevel": 1,
    "DateCreated": "2021-06-26T19:53:00Z",
    "SubmissionStatusTypeID": 200
}