{
    "IsRecentlyVerified": false,
    "ID": 20979,
    "UUID": "B4919C6D-1463-4C0E-9C57-4E3D60F54AA2",
    "DataProviderID": 2,
    "DataProvidersReference": "58254",
    "OperatorID": 5,
    "UsageTypeID": 1,
    "AddressInfo": {
        "ID": 21324,
        "Title": "NATIONAL GRID",
        "AddressLine1": "52 E Main St",
        "Town": "Fredonia",
        "StateOrProvince": "NY",
        "Postcode": "14063",
        "CountryID": 2,
        "Latitude": 42.4418221,
        "Longitude": -79.3295637,
        "ContactTelephone1": "888-758-4389",
        "AccessComments": "24 hours daily",
        "RelatedURL": "http://www.chargepoint.com/",
        "DistanceUnit": 0
    },
    "Connections": [
        {
            "ID": 22843,
            "ConnectionTypeID": 1,
            "LevelID": 2,
            "Amps": 16,
            "Voltage": 230,
            "PowerKW": 3,
            "CurrentTypeID": 10,
            "Quantity": 2
        }
    ],
    "DateLastStatusUpdate": "2019-12-24T09:20:00Z",
    "DataQualityLevel": 3,
    "DateCreated": "2014-02-06T04:57:00Z",
    "SubmissionStatusTypeID": 100
}