{
    "IsRecentlyVerified": false,
    "ID": 5471,
    "UUID": "2E1140A4-FC71-48D3-A45F-87A80A31A0B8",
    "DataProviderID": 1,
    "OperatorID": 16,
    "UsageTypeID": 1,
    "UsageCost": "Free",
    "AddressInfo": {
        "ID": 5409,
        "Title": "The Glades Shopping Centre",
        "AddressLine1": "High Street",
        "Town": "Bromley",
        "StateOrProvince": "Kent",
        "Postcode": "BR1 1DN",
        "CountryID": 1,
        "Latitude": 51.40389,
        "Longitude": 0.01656,
        "ContactTelephone1": "020 8313 9292",
        "ContactTelephone2": "0845 850 0653",
        "AccessComments": "Parking bays located at car park Level 1 Green, location E. Hours: 07:30-18:45 Mon-Wed & Fri-Sat, 07:30-21:45 Thurs, 09:00-17:45 Sun",
        "RelatedURL": "http://www.theglades.uk.com",
        "DistanceUnit": 0
    },
    "Connections": [
        {
            "ID": 19668,
            "ConnectionTypeID": 3,
            "StatusTypeID": 50,
            "LevelID": 2,
            "Amps": 13,
            "Voltage": 230,
            "PowerKW": 3,
            "CurrentTypeID": 20,
            "Quantity": 2
        }
    ],
    "NumberOfPoints": 2,
    "GeneralComments": "Orphaned Elektromotive charge points, no longer on the Source London map. Reports are that a Charge your Car car will operate them.",
    "StatusTypeID": 0,
    "DateLastStatusUpdate": "2018-06-04T15:12:00Z",
    "DataQualityLevel": 1,
    "DateCreated": "2011-08-29T11:42:00Z",
    "SubmissionStatusTypeID": 200
}