{
    "IsRecentlyVerified": false,
    "ID": 124217,
    "UUID": "73D0B977-4993-43B0-A8AE-485A9BF16E60",
    "DataProviderID": 2,
    "DataProvidersReference": "52732",
    "OperatorID": 5,
    "UsageTypeID": 1,
    "AddressInfo": {
        "ID": 124563,
        "Title": "HAUKE PARK",
        "AddressLine1": "1 Hamilton Dr",
        "Town": "Mill Valley",
        "StateOrProvince": "CA",
        "Postcode": "94941",
        "CountryID": 2,
        "Latitude": 37.8961549,
        "Longitude": -122.5221661,
        "ContactTelephone1": "888-758-4389",
        "AccessComments": "24 hours daily",
        "RelatedURL": "http://www.chargepoint.com/",
        "DistanceUnit": 0
    },
    "Connections": [
        {
            "ID": 174289,
            "ConnectionTypeID": 1,
            "LevelID": 2,
            "Amps": 16,
            "Voltage": 230,
            "PowerKW": 3,
            "CurrentTypeID": 10,
            "Quantity": 2
        }
    ],
    "DateLastStatusUpdate": "2019-12-24T09:14:00Z",
    "DataQualityLevel": 3,
    "DateCreated": "2019-04-06T05:03:00Z",
    "SubmissionStatusTypeID": 100
}