{
    "IsRecentlyVerified": false,
    "ID": 96886,
    "UUID": "5C37F585-05BD-422B-8EC3-639361C6EE84",
    "DataProviderID": 1,
    "OperatorID": 69,
    "UsageTypeID": 4,
    "AddressInfo": {
        "ID": 97232,
        "Title": "Einkaufszentrum",
        "AddressLine1": "Zeulsdorfer Straße 97",
        "Town": "Gera",
        "StateOrProvince": "Thüringen",
        "Postcode": "07549",
        "CountryID": 87,
        "Latitude": 50.8445443,
        "Longitude": 12.063591200000019,
        "AccessComments": "Rund um die Uhr (24/7) nutzbar\r\n",
        "DistanceUnit": 0
    },
    "Connections": [
        {
            "ID": 137242,
            "ConnectionTypeID": 25,
            "StatusTypeID": 50,
            "LevelID": 2,
            "Amps": 32,
            "Voltage": 400,
            "PowerKW": 22,
            "CurrentTypeID": 20,
            "Quantity": 2
        }
    ],
    "NumberOfPoints": 2,
    "StatusTypeID": 50,
    "DateLastStatusUpdate": "2018-01-02T12:36:00Z",
    "DataQualityLevel": 1,
    "DateCreated": "2018-01-02T12:36:00Z",
    "SubmissionStatusTypeID": 200
}