{
    "IsRecentlyVerified": false,
    "ID": 33403,
    "UUID": "D8C30F6E-920E-4DCF-85A0-9F8826C16D75",
    "DataProviderID": 26,
    "DataProvidersReference": "56256",
    "OperatorID": 73,
    "OperatorsReference": "EV-Box EVB-P1412103",
    "UsageCost": "0.00 jaarabonnement",
    "AddressInfo": {
        "ID": 33749,
        "Title": "Het Klaverblad 25",
        "AddressLine1": "Het Klaverblad 25",
        "Town": "Boxtel",
        "Postcode": "5283 TV",
        "CountryID": 159,
        "Latitude": 51.59593,
        "Longitude": 5.33957,
        "RelatedURL": "http://www.ev-box.nl",
        "DistanceUnit": 0
    },
    "Connections": [
        {
            "ID": 36914,
            "ConnectionTypeID": 25,
            "LevelID": 2,
            "PowerKW": 5,
            "CurrentTypeID": 10
        }
    ],
    "NumberOfPoints": 1,
    "StatusTypeID": 50,
    "DateLastStatusUpdate": "2016-06-04T02:39:00Z",
    "DataQualityLevel": 3,
    "DateCreated": "2015-01-09T06:04:00Z",
    "SubmissionStatusTypeID": 100
}