{
    "IsRecentlyVerified": false,
    "ID": 168275,
    "UUID": "E1E1EF8C-F5A9-4E8D-8951-EBB41B441EFD",
    "DataProviderID": 1,
    "OperatorID": 105,
    "UsageTypeID": 4,
    "AddressInfo": {
        "ID": 168634,
        "Title": "Parkplatz Bachgängel",
        "AddressLine1": "Rittergartenstraße 10",
        "Town": "Neustadt an der Weinstraße",
        "StateOrProvince": "Rheinland-Pfalz",
        "Postcode": "67433",
        "CountryID": 87,
        "Latitude": 49.35518885549445,
        "Longitude": 8.135231104704872,
        "RelatedURL": "https://www.neustadt.eu/Wirtschaft-Verkehr/Verkehr/Parken-im-Stadtzentrum",
        "DistanceUnit": 0
    },
    "Connections": [
        {
            "ID": 255561,
            "ConnectionTypeID": 25,
            "StatusTypeID": 50,
            "LevelID": 2,
            "Amps": 32,
            "Voltage": 400,
            "PowerKW": 22,
            "CurrentTypeID": 20,
            "Quantity": 2
        }
    ],
    "NumberOfPoints": 2,
    "StatusTypeID": 50,
    "DateLastStatusUpdate": "2020-09-21T12:25:00Z",
    "DataQualityLevel": 1,
    "DateCreated": "2020-09-21T12:25:00Z",
    "SubmissionStatusTypeID": 200
}