{
    "IsRecentlyVerified": false,
    "ID": 187191,
    "UUID": "DBF325E2-B721-4934-99EC-2B4117ACD370",
    "DataProviderID": 29,
    "DataProvidersReference": "9865",
    "OperatorID": 220,
    "AddressInfo": {
        "ID": 187550,
        "Title": "Falkentaler Weg 4",
        "AddressLine1": "Falkentaler Weg 4",
        "Town": "Hamburg",
        "Postcode": "22587",
        "CountryID": 87,
        "Latitude": 53.55993,
        "Longitude": 9.79076,
        "DistanceUnit": 0
    },
    "Connections": [
        {
            "ID": 301658,
            "ConnectionTypeID": 28,
            "StatusTypeID": 50,
            "LevelID": 2,
            "PowerKW": 22,
            "CurrentTypeID": 20
        },
        {
            "ID": 301659,
            "ConnectionTypeID": 25,
            "StatusTypeID": 50,
            "LevelID": 2,
            "PowerKW": 22,
            "CurrentTypeID": 20
        },
        {
            "ID": 301660,
            "ConnectionTypeID": 28,
            "StatusTypeID": 50,
            "LevelID": 2,
            "PowerKW": 22,
            "CurrentTypeID": 20
        },
        {
            "ID": 301661,
            "ConnectionTypeID": 25,
            "StatusTypeID": 50,
            "LevelID": 2,
            "PowerKW": 22,
            "CurrentTypeID": 20
        }
    ],
    "StatusTypeID": 50,
    "DateLastStatusUpdate": "2021-07-12T02:51:00Z",
    "MetadataValues": [
        {
            "ID": 19431,
            "MetadataFieldID": 4,
            "ItemValue": "Data from the German chargepoint registry provided by Bundesnetzagentur.de under the CC-BY 4.0 license"
        }
    ],
    "DataQualityLevel": 3,
    "DateCreated": "2021-07-12T02:51:00Z",
    "SubmissionStatusTypeID": 100
}