{
    "IsRecentlyVerified": false,
    "ID": 67349,
    "UUID": "09FD6C65-9600-41D1-AD13-DFA5317E44E0",
    "DataProviderID": 1,
    "OperatorID": 23,
    "OperatorsReference": "16209",
    "UsageTypeID": 1,
    "UsageCost": "Free",
    "AddressInfo": {
        "ID": 67695,
        "Title": "Quik Park - Tesla",
        "AddressLine1": "81 Fleet Pl",
        "Town": "Brooklyn",
        "StateOrProvince": "NY",
        "Postcode": "11201",
        "CountryID": 2,
        "Latitude": 40.6931107,
        "Longitude": -73.9812858,
        "ContactTelephone1": "212-832-2066  877-798-3752",
        "AccessComments": "24 hours daily; for Tesla use only; see valet for access",
        "RelatedURL": "http://www.teslamotors.com/supercharger",
        "DistanceUnit": 0
    },
    "Connections": [
        {
            "ID": 92853,
            "ConnectionTypeID": 30,
            "StatusTypeID": 50,
            "LevelID": 2,
            "Amps": 16,
            "Voltage": 230,
            "PowerKW": 8,
            "CurrentTypeID": 10,
            "Quantity": 2
        }
    ],
    "NumberOfPoints": 2,
    "StatusTypeID": 50,
    "DateLastStatusUpdate": "2017-01-31T20:23:00Z",
    "DataQualityLevel": 3,
    "DateCreated": "2016-05-29T02:05:00Z",
    "SubmissionStatusTypeID": 100
}