{
    "IsRecentlyVerified": false,
    "ID": 177830,
    "UUID": "0387A142-C6DC-4F4A-908F-D1FBABCA0B26",
    "DataProviderID": 29,
    "DataProvidersReference": "6690",
    "OperatorID": 45,
    "AddressInfo": {
        "ID": 178189,
        "Title": "Kinzigstraße 11",
        "AddressLine1": "Kinzigstraße 11",
        "Town": "Berghaupten",
        "Postcode": "77791",
        "CountryID": 87,
        "Latitude": 48.404577,
        "Longitude": 8.001135,
        "DistanceUnit": 0
    },
    "Connections": [
        {
            "ID": 277485,
            "ConnectionTypeID": 25,
            "StatusTypeID": 50,
            "LevelID": 2,
            "PowerKW": 22,
            "CurrentTypeID": 20
        },
        {
            "ID": 277486,
            "ConnectionTypeID": 25,
            "StatusTypeID": 50,
            "LevelID": 2,
            "PowerKW": 22,
            "CurrentTypeID": 20
        }
    ],
    "StatusTypeID": 0,
    "DateLastStatusUpdate": "2021-07-09T03:12:00Z",
    "MetadataValues": [
        {
            "ID": 10124,
            "MetadataFieldID": 4,
            "ItemValue": "Data from the German chargepoint registry provided by Bundesnetzagentur.de under the CC-BY 4.0 license"
        }
    ],
    "DataQualityLevel": 3,
    "DateCreated": "2021-07-08T09:49:00Z",
    "SubmissionStatusTypeID": 100
}