{
    "IsRecentlyVerified": false,
    "ID": 113176,
    "UUID": "1A641CD6-6BFE-4753-AFA9-45769AD1D9A3",
    "DataProviderID": 2,
    "DataProvidersReference": "104302",
    "UsageTypeID": 2,
    "AddressInfo": {
        "ID": 113522,
        "Title": "EBSCO",
        "AddressLine1": "1 Peatfield St",
        "Town": "Ipswich",
        "StateOrProvince": "MA",
        "Postcode": "01938",
        "CountryID": 2,
        "Latitude": 42.675583,
        "Longitude": -70.840555,
        "ContactTelephone1": "",
        "AccessComments": "Employee use only",
        "RelatedURL": "",
        "DistanceUnit": 0
    },
    "Connections": [
        {
            "ID": 159359,
            "ConnectionTypeID": 1,
            "LevelID": 2,
            "Amps": 16,
            "Voltage": 230,
            "PowerKW": 3.7,
            "CurrentTypeID": 10,
            "Quantity": 1
        }
    ],
    "DateLastStatusUpdate": "2020-06-26T03:06:00Z",
    "DataQualityLevel": 3,
    "DateCreated": "2018-11-28T02:04:00Z",
    "SubmissionStatusTypeID": 100
}