{
    "IsRecentlyVerified": false,
    "ID": 142877,
    "UUID": "67AF7658-163D-4FB7-A50F-B62B8017B21D",
    "DataProviderID": 2,
    "DataProvidersReference": "143621",
    "OperatorID": 5,
    "UsageTypeID": 1,
    "AddressInfo": {
        "ID": 143229,
        "Title": "THE COOPER",
        "AddressLine1": "720 S Wells St",
        "Town": "Chicago",
        "StateOrProvince": "IL",
        "Postcode": "60699",
        "CountryID": 2,
        "Latitude": 41.87309,
        "Longitude": -87.633797,
        "ContactTelephone1": "888-758-4389",
        "AccessComments": "24 hours daily",
        "RelatedURL": "http://www.chargepoint.com/",
        "DistanceUnit": 0
    },
    "Connections": [
        {
            "ID": 199105,
            "ConnectionTypeID": 1,
            "LevelID": 2,
            "Amps": 16,
            "Voltage": 230,
            "PowerKW": 3.7,
            "CurrentTypeID": 10,
            "Quantity": 4
        }
    ],
    "StatusTypeID": 50,
    "DateLastStatusUpdate": "2020-06-26T03:05:00Z",
    "DataQualityLevel": 3,
    "DateCreated": "2019-12-24T09:19:00Z",
    "SubmissionStatusTypeID": 100
}