{
    "IsRecentlyVerified": false,
    "ID": 95517,
    "UUID": "E5268792-D259-4A22-8573-32BE69318D73",
    "DataProviderID": 1,
    "OperatorID": 23,
    "OperatorsReference": "37697",
    "UsageTypeID": 4,
    "AddressInfo": {
        "ID": 95863,
        "Title": "La Quinta Inn & Suites Austin - Cedar Park",
        "AddressLine1": "1010 E Whitestone BLVD",
        "Town": "Cedar Park",
        "StateOrProvince": "TX",
        "Postcode": "78613",
        "CountryID": 2,
        "Latitude": 30.524131,
        "Longitude": -97.817548,
        "ContactTelephone1": "(512) 528-9300",
        "DistanceUnit": 0
    },
    "Connections": [
        {
            "ID": 135300,
            "ConnectionTypeID": 30,
            "StatusTypeID": 50,
            "LevelID": 2,
            "PowerKW": 8,
            "CurrentTypeID": 10,
            "Quantity": 2
        }
    ],
    "NumberOfPoints": 2,
    "GeneralComments": "2 Tesla Connectors, up to 8kW.Available for customers. Please see front desk.",
    "StatusTypeID": 50,
    "DateLastStatusUpdate": "2017-11-12T06:55:00Z",
    "DataQualityLevel": 1,
    "DateCreated": "2017-11-12T06:55:00Z",
    "SubmissionStatusTypeID": 200
}