{
    "IsRecentlyVerified": false,
    "ID": 94988,
    "UUID": "3CA5E015-C64C-448B-A04C-129AD58DFAC9",
    "DataProviderID": 1,
    "OperatorID": 69,
    "UsageTypeID": 1,
    "UsageCost": "Free",
    "AddressInfo": {
        "ID": 95334,
        "Title": "Stadtwerke Nettetal",
        "AddressLine1": "Dörkesplatz",
        "Town": "Nettetal",
        "StateOrProvince": "NRW",
        "Postcode": "41334",
        "CountryID": 87,
        "Latitude": 51.3070523085136,
        "Longitude": 6.27707183361053,
        "ContactEmail": "e-mobil@stadtwerke-nettetal.de",
        "AccessComments": "ladenetz.de",
        "DistanceUnit": 0
    },
    "Connections": [
        {
            "ID": 134602,
            "ConnectionTypeID": 25,
            "StatusTypeID": 50,
            "LevelID": 2,
            "PowerKW": 22,
            "CurrentTypeID": 20,
            "Quantity": 2
        }
    ],
    "NumberOfPoints": 1,
    "StatusTypeID": 50,
    "DateLastStatusUpdate": "2017-11-06T07:37:00Z",
    "DataQualityLevel": 1,
    "DateCreated": "2017-10-28T16:15:00Z",
    "SubmissionStatusTypeID": 200
}