{
    "IsRecentlyVerified": false,
    "ID": 143659,
    "UUID": "8626B765-BACF-4CFE-9641-F5AC7733AFA9",
    "DataProviderID": 2,
    "DataProvidersReference": "85318",
    "UsageTypeID": 7,
    "AddressInfo": {
        "ID": 144011,
        "Title": "Airport Marriott",
        "AddressLine1": "901 Dixon Rd",
        "Town": "Toronto",
        "StateOrProvince": "ON",
        "Postcode": "M9W 1J5",
        "CountryID": 44,
        "Latitude": 43.686704,
        "Longitude": -79.593924,
        "ContactTelephone1": "416-674-9400  844-835-2348",
        "AccessComments": "24 hours daily; For guest use only, parking fee required\r\nPublic - Call ahead",
        "RelatedURL": "",
        "DistanceUnit": 0
    },
    "Connections": [
        {
            "ID": 200031,
            "ConnectionTypeID": 1,
            "LevelID": 2,
            "Amps": 16,
            "Voltage": 230,
            "PowerKW": 3.7,
            "CurrentTypeID": 10,
            "Quantity": 2
        },
        {
            "ID": 200032,
            "ConnectionTypeID": 2,
            "LevelID": 3,
            "Amps": 100,
            "Voltage": 400,
            "PowerKW": 40,
            "CurrentTypeID": 30,
            "Quantity": 1
        }
    ],
    "StatusTypeID": 150,
    "DateLastStatusUpdate": "2020-06-26T03:07:00Z",
    "DataQualityLevel": 3,
    "DateCreated": "2019-12-24T09:21:00Z",
    "SubmissionStatusTypeID": 100
}