{
    "IsRecentlyVerified": false,
    "ID": 33842,
    "UUID": "3A8F1A55-727F-455F-AD5F-86F2CA115AB7",
    "DataProviderID": 26,
    "DataProvidersReference": "47475",
    "OperatorID": 178,
    "OperatorsReference": "EVnetNL AL631",
    "UsageCost": "0.00 jaarabonnement",
    "AddressInfo": {
        "ID": 34188,
        "Title": "Raadhuisplein 1",
        "AddressLine1": "Raadhuisplein 1",
        "Town": "Werkendam",
        "Postcode": "4251 VZ",
        "CountryID": 159,
        "Latitude": 51.806475,
        "Longitude": 4.896322,
        "ContactTelephone1": "0800-3522365",
        "RelatedURL": "http://www.evnet.nl",
        "DistanceUnit": 0
    },
    "Connections": [
        {
            "ID": 37353,
            "ConnectionTypeID": 25,
            "LevelID": 2,
            "PowerKW": 11,
            "CurrentTypeID": 10
        }
    ],
    "NumberOfPoints": 2,
    "StatusTypeID": 50,
    "DateLastStatusUpdate": "2016-06-04T02:40:00Z",
    "DataQualityLevel": 3,
    "DateCreated": "2015-01-09T06:04:00Z",
    "SubmissionStatusTypeID": 100
}