{
    "IsRecentlyVerified": false,
    "ID": 142783,
    "UUID": "8D92CBEA-551E-4C07-B92F-01C88FD09B09",
    "DataProviderID": 2,
    "DataProvidersReference": "123064",
    "OperatorID": 3372,
    "UsageTypeID": 1,
    "AddressInfo": {
        "ID": 143135,
        "Title": "Vassar College",
        "AddressLine1": "124 Raymond Ave",
        "Town": "Poughkeepsie",
        "StateOrProvince": "NY",
        "Postcode": "12604",
        "CountryID": 2,
        "Latitude": 41.6860037,
        "Longitude": -73.8974478,
        "ContactTelephone1": "866-816-7584",
        "AccessComments": "24 hours daily",
        "RelatedURL": "http://evconnect.com/",
        "DistanceUnit": 0
    },
    "Connections": [
        {
            "ID": 199000,
            "ConnectionTypeID": 1,
            "LevelID": 2,
            "Amps": 16,
            "Voltage": 230,
            "PowerKW": 3.7,
            "CurrentTypeID": 10,
            "Quantity": 2
        }
    ],
    "StatusTypeID": 50,
    "DateLastStatusUpdate": "2020-06-26T03:04:00Z",
    "DataQualityLevel": 3,
    "DateCreated": "2019-12-24T09:19:00Z",
    "SubmissionStatusTypeID": 100
}