{
    "IsRecentlyVerified": false,
    "ID": 115664,
    "UUID": "AF800FD0-C621-4408-A546-7C6899EDA917",
    "DataProviderID": 2,
    "DataProvidersReference": "117455",
    "OperatorID": 39,
    "UsageTypeID": 4,
    "AddressInfo": {
        "ID": 116010,
        "Title": "Kaiser Pueblo",
        "AddressLine1": "2625 West Pueblo Boulevard",
        "Town": "Pueblo",
        "StateOrProvince": "CO",
        "Postcode": "81004",
        "CountryID": 2,
        "Latitude": 38.2186745,
        "Longitude": -104.6407541,
        "ContactTelephone1": "800-663-5633",
        "AccessComments": "MO: Not Specified; TU: Not Specified; WE: Not Specified; TH: Not Specified; FR: Not Specified; SA: Not Specified; SU: Not Specified",
        "RelatedURL": "http://www.semacharge.com/",
        "DistanceUnit": 0
    },
    "Connections": [
        {
            "ID": 162692,
            "ConnectionTypeID": 1,
            "LevelID": 2,
            "Amps": 16,
            "Voltage": 230,
            "PowerKW": 3,
            "CurrentTypeID": 10,
            "Quantity": 1
        }
    ],
    "DateLastStatusUpdate": "2019-04-06T04:02:00Z",
    "DataQualityLevel": 3,
    "DateCreated": "2019-02-11T07:13:00Z",
    "SubmissionStatusTypeID": 100
}