{
    "IsRecentlyVerified": false,
    "ID": 24081,
    "UUID": "FE941FBA-38BD-43D8-B480-8F032A0650E9",
    "DataProviderID": 1,
    "OperatorID": 74,
    "UsageTypeID": 1,
    "UsageCost": "",
    "AddressInfo": {
        "ID": 24426,
        "Title": "Fastned Bornheim",
        "AddressLine1": "A28",
        "AddressLine2": "Oldebroek",
        "Town": "Wezep",
        "StateOrProvince": "Gelderland",
        "Postcode": "8095PV",
        "CountryID": 159,
        "Latitude": 52.4518600817357,
        "Longitude": 5.97846352167368,
        "ContactTelephone1": "",
        "ContactTelephone2": "",
        "ContactEmail": "",
        "AccessComments": "North-bound",
        "RelatedURL": "http://www.fastned.nl",
        "DistanceUnit": 0
    },
    "Connections": [
        {
            "ID": 26097,
            "ConnectionTypeID": 2,
            "StatusTypeID": 0,
            "LevelID": 3,
            "PowerKW": 50,
            "CurrentTypeID": 30,
            "Quantity": 2
        },
        {
            "ID": 26098,
            "ConnectionTypeID": 33,
            "StatusTypeID": 0,
            "LevelID": 3,
            "PowerKW": 50,
            "CurrentTypeID": 30,
            "Quantity": 2
        },
        {
            "ID": 26099,
            "ConnectionTypeID": 25,
            "StatusTypeID": 0,
            "LevelID": 2,
            "PowerKW": 22,
            "CurrentTypeID": 20,
            "Quantity": 2
        }
    ],
    "NumberOfPoints": 1,
    "GeneralComments": "",
    "StatusTypeID": 50,
    "DateLastStatusUpdate": "2016-03-11T23:23:00Z",
    "DataQualityLevel": 1,
    "DateCreated": "2014-06-14T16:43:00Z",
    "SubmissionStatusTypeID": 200
}