{
    "UserComments": [
        {
            "ID": 24503,
            "ChargePointID": 175889,
            "CommentTypeID": 10,
            "UserName": "ForumElettrico.it",
            "Comment": "Installazione tattica per un biberonaggio prima di iniziare la SR18 per la località sciistica Pila. Leggi la recensione completa qui >  https://www.forumelettrico.it/forum/colonnina-be-charge-fast-frazione-pont-suaz-162-charvensod-t18249.html",
            "RelatedURL": "https://www.forumelettrico.it/forum/colonnina-be-charge-fast-frazione-pont-suaz-162-charvensod-t18249.html",
            "DateCreated": "2021-06-18T05:34:01.593Z",
            "User": {
                "ID": 11749,
                "Username": "ForumElettrico.it"
            },
            "CheckinStatusTypeID": 10,
            "IsActionedByEditor": false
        }
    ],
    "MediaItems": [
        {
            "ID": 28186,
            "ChargePointID": 175889,
            "ItemURL": "https://s3-ap-southeast-2.amazonaws.com/openchargemap/images/IT/OCM175889/OCM-175889.orig.2021061805343058.jpg",
            "ItemThumbnailURL": "https://s3-ap-southeast-2.amazonaws.com/openchargemap/images/IT/OCM175889/OCM-175889.thmb.2021061805343058.jpg",
            "Comment": "",
            "IsEnabled": true,
            "IsVideo": false,
            "IsFeaturedItem": false,
            "IsExternalResource": false,
            "User": {
                "ID": 11749,
                "Username": "ForumElettrico.it"
            },
            "DateCreated": "2021-06-18T05:35:00Z"
        },
        {
            "ID": 28183,
            "ChargePointID": 175889,
            "ItemURL": "https://s3-ap-southeast-2.amazonaws.com/openchargemap/images/IT/OCM175889/OCM-175889.orig.2021061805341160.jpg",
            "ItemThumbnailURL": "https://s3-ap-southeast-2.amazonaws.com/openchargemap/images/IT/OCM175889/OCM-175889.thmb.2021061805341160.jpg",
            "Comment": "",
            "IsEnabled": true,
            "IsVideo": false,
            "IsFeaturedItem": false,
            "IsExternalResource": false,
            "User": {
                "ID": 11749,
                "Username": "ForumElettrico.it"
            },
            "DateCreated": "2021-06-18T05:34:00Z"
        },
        {
            "ID": 28184,
            "ChargePointID": 175889,
            "ItemURL": "https://s3-ap-southeast-2.amazonaws.com/openchargemap/images/IT/OCM175889/OCM-175889.orig.2021061805341732.jpg",
            "ItemThumbnailURL": "https://s3-ap-southeast-2.amazonaws.com/openchargemap/images/IT/OCM175889/OCM-175889.thmb.2021061805341732.jpg",
            "Comment": "",
            "IsEnabled": true,
            "IsVideo": false,
            "IsFeaturedItem": false,
            "IsExternalResource": false,
            "User": {
                "ID": 11749,
                "Username": "ForumElettrico.it"
            },
            "DateCreated": "2021-06-18T05:34:00Z"
        },
        {
            "ID": 28185,
            "ChargePointID": 175889,
            "ItemURL": "https://s3-ap-southeast-2.amazonaws.com/openchargemap/images/IT/OCM175889/OCM-175889.orig.2021061805342378.jpg",
            "ItemThumbnailURL": "https://s3-ap-southeast-2.amazonaws.com/openchargemap/images/IT/OCM175889/OCM-175889.thmb.2021061805342378.jpg",
            "Comment": "",
            "IsEnabled": true,
            "IsVideo": false,
            "IsFeaturedItem": false,
            "IsExternalResource": false,
            "User": {
                "ID": 11749,
                "Username": "ForumElettrico.it"
            },
            "DateCreated": "2021-06-18T05:34:00Z"
        }
    ],
    "IsRecentlyVerified": false,
    "ID": 175889,
    "UUID": "46501AD9-EC29-40FD-B75D-B406B1A52191",
    "DataProviderID": 1,
    "OperatorID": 3327,
    "UsageTypeID": 1,
    "AddressInfo": {
        "ID": 176248,
        "Title": "Be Charge ",
        "AddressLine1": "Frazione Pont Suaz 19",
        "Town": "Charvensod",
        "StateOrProvince": "AO",
        "CountryID": 112,
        "Latitude": 45.72767,
        "Longitude": 7.322699,
        "RelatedURL": "https://www.forumelettrico.it/forum/colonnina-be-charge-fast-frazione-pont-suaz-162-charvensod-t18249.html",
        "DistanceUnit": 0
    },
    "Connections": [
        {
            "ID": 273152,
            "ConnectionTypeID": 33,
            "LevelID": 2,
            "PowerKW": 75
        },
        {
            "ID": 273153,
            "ConnectionTypeID": 2,
            "LevelID": 2,
            "PowerKW": 63
        },
        {
            "ID": 273154,
            "ConnectionTypeID": 25,
            "LevelID": 2,
            "PowerKW": 22
        }
    ],
    "NumberOfPoints": 1,
    "StatusTypeID": 50,
    "DateLastStatusUpdate": "2021-06-18T05:35:00Z",
    "DataQualityLevel": 1,
    "DateCreated": "2021-06-18T05:34:00Z",
    "SubmissionStatusTypeID": 200
}