{
    "IsRecentlyVerified": false,
    "ID": 121894,
    "UUID": "06C336CA-8236-4277-8F76-0BCAC41D82B6",
    "DataProviderID": 2,
    "DataProvidersReference": "114084",
    "OperatorID": 23,
    "UsageTypeID": 1,
    "AddressInfo": {
        "ID": 122240,
        "Title": "Atlanta Evergreen Marriott Conference Resort - Tesla Destination",
        "AddressLine1": "4021 Lakeview Dr",
        "Town": "Stone Mountain",
        "StateOrProvince": "GA",
        "Postcode": "30083",
        "CountryID": 2,
        "Latitude": 33.7983,
        "Longitude": -84.1393,
        "ContactTelephone1": "770-879-9900  877-798-3752",
        "AccessComments": "24 hours daily; for customer use only; see valet for access",
        "RelatedURL": "https://www.tesla.com/destination-charging",
        "DistanceUnit": 0
    },
    "Connections": [
        {
            "ID": 171732,
            "ConnectionTypeID": 30,
            "LevelID": 2,
            "Amps": 16,
            "Voltage": 230,
            "PowerKW": 3.7,
            "CurrentTypeID": 10,
            "Quantity": 3
        }
    ],
    "DateLastStatusUpdate": "2020-06-26T02:56:00Z",
    "DataQualityLevel": 3,
    "DateCreated": "2019-04-06T05:02:00Z",
    "SubmissionStatusTypeID": 100
}