{
    "IsRecentlyVerified": false,
    "ID": 41069,
    "UUID": "08CA2955-5F52-4533-A38B-0DD8207DFA0A",
    "DataProviderID": 1,
    "OperatorID": 45,
    "UsageTypeID": 7,
    "UsageCost": "0",
    "AddressInfo": {
        "ID": 41415,
        "Title": "Jenny Elektrotechnik AG ",
        "AddressLine1": "Lily-Braun-Straße 1a",
        "Town": " Bad Oldesloe",
        "StateOrProvince": "Kreis Stormarn",
        "Postcode": "23843",
        "CountryID": 87,
        "Latitude": 53.80283,
        "Longitude": 10.40281,
        "ContactTelephone1": "04191 93000",
        "AccessComments": "Während der Öffnungszeiten (Mo-Do 7:00-16:30, Fr. 7:00-14:30) kostenlos nutzbare Ladesäule direkt vor dem Eingang. Im Laden fragen und Säule aktivieren lassen.",
        "RelatedURL": "http://www.jenny-elektrotechnik.de/pdf/Markt%20Bad%20Oldesloe%2006-09-2014.pdf",
        "DistanceUnit": 0
    },
    "Connections": [
        {
            "ID": 44810,
            "ConnectionTypeID": 25,
            "StatusTypeID": 50,
            "LevelID": 2,
            "Amps": 32,
            "Voltage": 400,
            "PowerKW": 22,
            "CurrentTypeID": 20,
            "Quantity": 1
        },
        {
            "ID": 44811,
            "ConnectionTypeID": 28,
            "StatusTypeID": 50,
            "LevelID": 2,
            "Amps": 16,
            "Voltage": 230,
            "PowerKW": 3.7,
            "CurrentTypeID": 10,
            "Quantity": 2
        }
    ],
    "NumberOfPoints": 3,
    "StatusTypeID": 50,
    "DateLastStatusUpdate": "2015-01-25T14:17:00Z",
    "DataQualityLevel": 1,
    "DateCreated": "2015-01-25T10:53:00Z",
    "SubmissionStatusTypeID": 200
}