{
    "IsRecentlyVerified": false,
    "ID": 77612,
    "UUID": "BD70303E-F9C5-4204-8F50-A463E998FF42",
    "DataProviderID": 1,
    "OperatorID": 160,
    "UsageTypeID": 4,
    "AddressInfo": {
        "ID": 77958,
        "Title": "Parkplatz Auenstraße",
        "AddressLine1": "Auenstraße 29",
        "Town": "Suhl",
        "StateOrProvince": "Suhl",
        "Postcode": "98529",
        "CountryID": 87,
        "Latitude": 50.60847050252851,
        "Longitude": 10.681485941839476,
        "AccessComments": "Gegenüber der freiwilligen Feuerwehr auf den Parkplätzen. 24/7 nutzbar",
        "DistanceUnit": 0
    },
    "Connections": [
        {
            "ID": 112125,
            "ConnectionTypeID": 25,
            "StatusTypeID": 50,
            "LevelID": 2,
            "Amps": 32,
            "Voltage": 400,
            "PowerKW": 22,
            "CurrentTypeID": 20,
            "Quantity": 2
        },
        {
            "ID": 112126,
            "ConnectionTypeID": 28,
            "StatusTypeID": 50,
            "LevelID": 2,
            "Amps": 16,
            "Voltage": 230,
            "PowerKW": 3.7,
            "CurrentTypeID": 10,
            "Quantity": 2
        }
    ],
    "NumberOfPoints": 2,
    "StatusTypeID": 50,
    "DateLastStatusUpdate": "2017-01-20T07:23:00Z",
    "DataQualityLevel": 1,
    "DateCreated": "2017-01-20T07:23:00Z",
    "SubmissionStatusTypeID": 200
}