{
    "IsRecentlyVerified": false,
    "ID": 142940,
    "UUID": "DE359BB6-2CF4-4F11-862E-3E3C9C29A751",
    "DataProviderID": 2,
    "DataProvidersReference": "123122",
    "OperatorID": 3372,
    "UsageTypeID": 1,
    "AddressInfo": {
        "ID": 143292,
        "Title": "Hopson Cottage - Brad College Admissions",
        "AddressLine1": "60 W Ravine Rd",
        "Town": "Annandale-on-Hudson",
        "StateOrProvince": "NY",
        "Postcode": "12504",
        "CountryID": 2,
        "Latitude": 42.0220708,
        "Longitude": -73.9109959,
        "ContactTelephone1": "866-816-7584",
        "AccessComments": "24 hours daily",
        "RelatedURL": "http://evconnect.com/",
        "DistanceUnit": 0
    },
    "Connections": [
        {
            "ID": 199176,
            "ConnectionTypeID": 1,
            "LevelID": 2,
            "Amps": 16,
            "Voltage": 230,
            "PowerKW": 3.7,
            "CurrentTypeID": 10,
            "Quantity": 2
        }
    ],
    "StatusTypeID": 50,
    "DateLastStatusUpdate": "2020-06-26T03:05:00Z",
    "DataQualityLevel": 3,
    "DateCreated": "2019-12-24T09:19:00Z",
    "SubmissionStatusTypeID": 100
}