{
    "IsRecentlyVerified": false,
    "ID": 35787,
    "UUID": "8DBC1F84-3E7B-4F7A-9ACD-FD97BE1700E9",
    "DataProviderID": 26,
    "DataProvidersReference": "39419",
    "OperatorID": 157,
    "OperatorsReference": "NewMotion GDH036",
    "UsageCost": "0.00 jaarabonnement",
    "AddressInfo": {
        "ID": 36133,
        "Title": "Haviklaan 20",
        "AddressLine1": "Haviklaan 20",
        "Town": "Den Haag",
        "Postcode": "2566 XJ",
        "CountryID": 159,
        "Latitude": 52.0799369812012,
        "Longitude": 4.25648498535156,
        "ContactTelephone1": "088 0109500",
        "RelatedURL": "http://thenewmotion.nl/",
        "DistanceUnit": 0
    },
    "Connections": [
        {
            "ID": 39298,
            "ConnectionTypeID": 25,
            "LevelID": 2,
            "PowerKW": 22,
            "CurrentTypeID": 10
        }
    ],
    "NumberOfPoints": 2,
    "StatusTypeID": 50,
    "DateLastStatusUpdate": "2016-06-04T02:49:00Z",
    "DataQualityLevel": 3,
    "DateCreated": "2015-01-09T06:05:00Z",
    "SubmissionStatusTypeID": 100
}