{
    "IsRecentlyVerified": false,
    "ID": 157074,
    "UUID": "BFBD48EB-943D-4B4D-8848-A0C901FA7160",
    "DataProviderID": 19,
    "DataProvidersReference": "6090",
    "AddressInfo": {
        "ID": 157428,
        "Title": "Äventyrsgruvan",
        "AddressLine1": "Krongruvvägen 50",
        "Town": "IDKERBERGET",
        "StateOrProvince": "DALARNA",
        "Postcode": "78199",
        "CountryID": 216,
        "Latitude": 60.33571,
        "Longitude": 15.18855,
        "AccessComments": "Krongruvvägen 50",
        "DistanceUnit": 0
    },
    "Connections": [
        {
            "ID": 225191,
            "ConnectionTypeID": 25,
            "Reference": "1",
            "LevelID": 3,
            "Amps": 32,
            "Voltage": 400,
            "PowerKW": 22,
            "CurrentTypeID": 30
        },
        {
            "ID": 225192,
            "ConnectionTypeID": 25,
            "Reference": "2",
            "LevelID": 3,
            "Amps": 32,
            "Voltage": 400,
            "PowerKW": 22,
            "CurrentTypeID": 30
        },
        {
            "ID": 225193,
            "ConnectionTypeID": 25,
            "Reference": "3",
            "LevelID": 3,
            "Amps": 32,
            "Voltage": 400,
            "PowerKW": 22,
            "CurrentTypeID": 30
        },
        {
            "ID": 225194,
            "ConnectionTypeID": 25,
            "Reference": "4",
            "LevelID": 3,
            "Amps": 32,
            "Voltage": 400,
            "PowerKW": 22,
            "CurrentTypeID": 30
        }
    ],
    "NumberOfPoints": 4,
    "StatusTypeID": 0,
    "DateLastStatusUpdate": "2021-03-24T05:12:00Z",
    "DataQualityLevel": 2,
    "DateCreated": "2020-05-26T08:24:00Z",
    "SubmissionStatusTypeID": 100
}