{
    "IsRecentlyVerified": false,
    "ID": 75771,
    "UUID": "ADE3B296-05F4-4920-AE66-22A6F47DE196",
    "DataProviderID": 1,
    "OperatorID": 23,
    "OperatorsReference": "43034",
    "UsageTypeID": 1,
    "UsageCost": "Free",
    "AddressInfo": {
        "ID": 76117,
        "Title": "Renaissance Austin Hotel - Tesla",
        "AddressLine1": "9721 Arboretum Blvd",
        "Town": "Austin",
        "StateOrProvince": "TX",
        "Postcode": "78759",
        "CountryID": 2,
        "Latitude": 30.3918212,
        "Longitude": -97.7497533,
        "ContactTelephone1": "512-343-2626  877-798-3752",
        "AccessComments": "24 hours daily; for Tesla use only; for guest use only; see valet for access",
        "RelatedURL": "http://www.teslamotors.com/supercharger",
        "DistanceUnit": 0
    },
    "Connections": [
        {
            "ID": 109268,
            "ConnectionTypeID": 30,
            "StatusTypeID": 50,
            "LevelID": 2,
            "Amps": 16,
            "Voltage": 230,
            "PowerKW": 16,
            "CurrentTypeID": 10,
            "Quantity": 4
        }
    ],
    "NumberOfPoints": 4,
    "StatusTypeID": 50,
    "DateLastStatusUpdate": "2018-05-19T05:27:00Z",
    "DataQualityLevel": 3,
    "DateCreated": "2016-12-23T01:24:00Z",
    "SubmissionStatusTypeID": 100
}