{
    "IsRecentlyVerified": false,
    "ID": 8001,
    "UUID": "B059C9A5-3D58-4842-8632-EF4D13D21667",
    "DataProviderID": 15,
    "DataProvidersReference": "5213",
    "OperatorID": 26,
    "AddressInfo": {
        "ID": 7898,
        "Title": "74-15 Northern Bl",
        "AddressLine1": "74-15 Northern Bl",
        "Town": "Jackson Heights",
        "StateOrProvince": "NY",
        "Postcode": "11372",
        "CountryID": 2,
        "Latitude": 40.75489,
        "Longitude": -73.89267,
        "ContactTelephone1": " (718) 898-7800 ",
        "RelatedURL": "http://carstations.com/5213",
        "DistanceUnit": 0
    },
    "Connections": [
        {
            "ID": 5430,
            "ConnectionTypeID": 1,
            "Reference": "J1772",
            "LevelID": 2
        }
    ],
    "StatusTypeID": 0,
    "DateLastStatusUpdate": "2017-11-04T14:04:00Z",
    "DataQualityLevel": 1,
    "DateCreated": "2011-11-11T12:05:00Z",
    "SubmissionStatusTypeID": 100
}