{
    "IsRecentlyVerified": false,
    "ID": 141907,
    "UUID": "DE27807C-4598-4277-B91C-04536DAEC8BE",
    "DataProviderID": 2,
    "DataProvidersReference": "105109",
    "OperatorID": 5,
    "UsageTypeID": 1,
    "AddressInfo": {
        "ID": 142259,
        "Title": "POINT 21",
        "AddressLine1": "2131 Lawrence St",
        "Town": "Denver",
        "StateOrProvince": "CO",
        "Postcode": "80205",
        "CountryID": 2,
        "Latitude": 39.7536445,
        "Longitude": -104.9902491,
        "ContactTelephone1": "888-758-4389",
        "AccessComments": "24 hours daily",
        "RelatedURL": "http://www.chargepoint.com/",
        "DistanceUnit": 0
    },
    "Connections": [
        {
            "ID": 197945,
            "ConnectionTypeID": 1,
            "LevelID": 2,
            "Amps": 16,
            "Voltage": 230,
            "PowerKW": 3,
            "CurrentTypeID": 10,
            "Quantity": 2
        }
    ],
    "StatusTypeID": 50,
    "DateLastStatusUpdate": "2019-12-24T09:16:00Z",
    "DataQualityLevel": 3,
    "DateCreated": "2019-12-24T09:16:00Z",
    "SubmissionStatusTypeID": 100
}