{
    "IsRecentlyVerified": true,
    "DateLastVerified": "2021-08-18T06:04:00Z",
    "ID": 188782,
    "UUID": "160F5C79-C51F-4A0A-8F53-655300F00ABF",
    "DataProviderID": 1,
    "OperatorID": 80,
    "UsageTypeID": 4,
    "UsageCost": "fre",
    "AddressInfo": {
        "ID": 189141,
        "Title": "Cargador Rápido Edifiio Enel",
        "AddressLine1": "San Isidro 85",
        "Town": "Santiago",
        "StateOrProvince": "Región Metropolitana de Santiago",
        "Postcode": "8330924",
        "CountryID": 49,
        "Latitude": -33.44460503810639,
        "Longitude": -70.64510271944596,
        "RelatedURL": "https://www.enelx.com/cl/es",
        "DistanceUnit": 0
    },
    "Connections": [
        {
            "ID": 305027,
            "ConnectionTypeID": 0,
            "StatusTypeID": 50,
            "LevelID": 2,
            "PowerKW": 50,
            "Quantity": 1
        }
    ],
    "NumberOfPoints": 1,
    "StatusTypeID": 50,
    "DateLastStatusUpdate": "2021-08-18T06:04:00Z",
    "DataQualityLevel": 1,
    "DateCreated": "2021-08-18T06:04:00Z",
    "SubmissionStatusTypeID": 200
}