{
    "IsRecentlyVerified": false,
    "ID": 113664,
    "UUID": "F04C70E1-92FD-4BDB-B7D3-6ACF28777AE1",
    "DataProviderID": 1,
    "OperatorID": 80,
    "UsageTypeID": 4,
    "AddressInfo": {
        "ID": 114010,
        "Title": " Aeroporto di Reggio Calabria | EnelX",
        "AddressLine1": "Via Ravagnese Inferiore",
        "AddressLine2": "San Gregorio",
        "Town": "Reggio Calabria ",
        "StateOrProvince": "RC",
        "Postcode": "89134 ",
        "CountryID": 112,
        "Latitude": 38.07521936525645,
        "Longitude": 15.652882704134687,
        "ContactTelephone1": "800.069.850",
        "RelatedURL": "https://www.enelx.com/it/it/emobility",
        "DistanceUnit": 0
    },
    "Connections": [
        {
            "ID": 160196,
            "ConnectionTypeID": 25,
            "StatusTypeID": 150,
            "LevelID": 2,
            "Amps": 32,
            "Voltage": 400,
            "PowerKW": 22,
            "CurrentTypeID": 20,
            "Quantity": 1
        },
        {
            "ID": 160197,
            "ConnectionTypeID": 36,
            "StatusTypeID": 150,
            "LevelID": 2,
            "Amps": 16,
            "Voltage": 240,
            "PowerKW": 3.7,
            "CurrentTypeID": 10,
            "Quantity": 1
        }
    ],
    "NumberOfPoints": 2,
    "StatusTypeID": 150,
    "DateLastStatusUpdate": "2018-12-29T14:54:00Z",
    "DataQualityLevel": 1,
    "DateCreated": "2018-12-29T14:54:00Z",
    "SubmissionStatusTypeID": 200
}