{
    "IsRecentlyVerified": false,
    "ID": 85577,
    "UUID": "C8E67CE2-BB94-4D23-BBF9-24E5675EA8C2",
    "DataProviderID": 1,
    "OperatorID": 23,
    "OperatorsReference": "26389",
    "UsageTypeID": 6,
    "AddressInfo": {
        "ID": 85923,
        "Title": "Valldal Camping",
        "AddressLine1": "47 Urikamben",
        "Town": "Valldal",
        "Postcode": "6210",
        "CountryID": 168,
        "Latitude": 62.317207,
        "Longitude": 7.294391,
        "ContactTelephone1": "+47 98 88 72 56",
        "DistanceUnit": 0
    },
    "Connections": [
        {
            "ID": 121681,
            "ConnectionTypeID": 30,
            "StatusTypeID": 50,
            "LevelID": 2,
            "Amps": 32,
            "Voltage": 230,
            "PowerKW": 13,
            "CurrentTypeID": 20,
            "Quantity": 2
        }
    ],
    "NumberOfPoints": 2,
    "GeneralComments": "2 Tesla Connectors, up to 13kW.Available for patrons only. Please see front desk.",
    "StatusTypeID": 50,
    "DateLastStatusUpdate": "2020-08-24T11:22:00Z",
    "DataQualityLevel": 1,
    "DateCreated": "2017-04-08T05:40:00Z",
    "SubmissionStatusTypeID": 200
}