{
    "IsRecentlyVerified": false,
    "ID": 104195,
    "UUID": "4340070F-1989-4DEA-AFFA-32E957DE0171",
    "DataProviderID": 1,
    "OperatorID": 45,
    "UsageTypeID": 4,
    "AddressInfo": {
        "ID": 104541,
        "Title": "Untertorplatz",
        "AddressLine1": "Untertorplatz",
        "Town": "Landau",
        "StateOrProvince": "Landau in der Pfalz",
        "Postcode": "76829",
        "CountryID": 87,
        "Latitude": 49.19983870683743,
        "Longitude": 8.116430031738219,
        "AccessComments": "24/7 nutzbare Ladesäule auf dem Parkplatz Weißquartierstr. / Am Großmarkt, nahe der Kreuzung. Keine reservierten Parkplätze, hohe Zuparkgefahr! Parkgebühren werden erhoben, das Laden ist kostenlos.",
        "RelatedURL": "http://www.energie-suedwest.de/",
        "DistanceUnit": 0
    },
    "Connections": [
        {
            "ID": 147137,
            "ConnectionTypeID": 25,
            "StatusTypeID": 50,
            "LevelID": 2,
            "Amps": 32,
            "Voltage": 400,
            "PowerKW": 22,
            "CurrentTypeID": 20,
            "Quantity": 4
        }
    ],
    "NumberOfPoints": 4,
    "StatusTypeID": 50,
    "DateLastStatusUpdate": "2018-05-17T08:39:00Z",
    "DataQualityLevel": 1,
    "DateCreated": "2018-05-17T08:39:00Z",
    "SubmissionStatusTypeID": 200
}