{
    "IsRecentlyVerified": false,
    "ID": 187349,
    "UUID": "0063583B-CB11-4083-A1BB-4E9F9BACB054",
    "DataProviderID": 1,
    "OperatorID": 45,
    "AddressInfo": {
        "ID": 187708,
        "Title": "Hollerstr./ Ecke Konrad Adenauer-Str.",
        "AddressLine1": "Hollerstr./ Ecke Konrad Adenauer-Str.",
        "Town": "Büdelsdorf",
        "Postcode": "24782",
        "CountryID": 87,
        "Latitude": 54.32265,
        "Longitude": 9.69216,
        "DistanceUnit": 0
    },
    "Connections": [
        {
            "ID": 302375,
            "ConnectionTypeID": 25,
            "StatusTypeID": 50,
            "LevelID": 2,
            "PowerKW": 22,
            "CurrentTypeID": 20
        },
        {
            "ID": 302376,
            "ConnectionTypeID": 25,
            "StatusTypeID": 50,
            "LevelID": 2,
            "PowerKW": 22,
            "CurrentTypeID": 20
        }
    ],
    "StatusTypeID": 50,
    "DateLastStatusUpdate": "2021-08-23T15:52:00Z",
    "MetadataValues": [
        {
            "ID": 19589,
            "MetadataFieldID": 4,
            "ItemValue": "Data from the German chargepoint registry provided by Bundesnetzagentur.de under the CC-BY 4.0 license"
        }
    ],
    "DataQualityLevel": 3,
    "DateCreated": "2021-07-12T02:52:00Z",
    "SubmissionStatusTypeID": 100
}