{
    "IsRecentlyVerified": false,
    "ID": 154088,
    "UUID": "DE8BA85F-A20B-4028-987C-EB6B99FBCF76",
    "DataProviderID": 28,
    "DataProvidersReference": "FR*S60*PPLAILLY",
    "OperatorID": 3379,
    "UsageTypeID": 5,
    "AddressInfo": {
        "ID": 154441,
        "Title": "Plailly, Vergers",
        "AddressLine1": "Rue des Vergers 60128 Plailly",
        "CountryID": 80,
        "Latitude": 49.1062,
        "Longitude": 2.59313,
        "AccessComments": "24h/24 7j/7",
        "DistanceUnit": 0
    },
    "Connections": [
        {
            "ID": 216554,
            "ConnectionTypeID": 1036,
            "StatusTypeID": 50,
            "LevelID": 2,
            "PowerKW": 22,
            "CurrentTypeID": 20
        },
        {
            "ID": 250887,
            "ConnectionTypeID": 1036,
            "StatusTypeID": 50,
            "LevelID": 2,
            "PowerKW": 22,
            "CurrentTypeID": 20
        }
    ],
    "GeneralComments": "",
    "StatusTypeID": 50,
    "DateLastStatusUpdate": "2020-08-27T05:16:00Z",
    "DataQualityLevel": 2,
    "DateCreated": "2020-03-15T10:54:00Z",
    "SubmissionStatusTypeID": 100
}