{
    "IsRecentlyVerified": false,
    "ID": 162329,
    "UUID": "C879E95D-0490-4581-9DD1-6471D36CC5E8",
    "DataProviderID": 1,
    "OperatorID": 18,
    "UsageTypeID": 4,
    "UsageCost": "paid charging, free parking",
    "AddressInfo": {
        "ID": 162686,
        "Title": "MPREIS Langkampfen (TIWAG)",
        "AddressLine1": "Schönwörthstraße",
        "Town": "Gemeinde Langkampfen",
        "StateOrProvince": "Tirol",
        "Postcode": "6336",
        "CountryID": 19,
        "Latitude": 47.53435610715718,
        "Longitude": 12.09291171163477,
        "RelatedURL": "https://www.tiwag.at/nc/privatkunden/energieeffizienz/mobilitaet/",
        "DistanceUnit": 0
    },
    "Connections": [
        {
            "ID": 233631,
            "ConnectionTypeID": 25,
            "StatusTypeID": 50,
            "LevelID": 2,
            "Amps": 32,
            "PowerKW": 22,
            "CurrentTypeID": 20,
            "Quantity": 2
        },
        {
            "ID": 233632,
            "ConnectionTypeID": 28,
            "StatusTypeID": 50,
            "LevelID": 2,
            "Amps": 13,
            "PowerKW": 3.7,
            "CurrentTypeID": 10,
            "Quantity": 2
        }
    ],
    "NumberOfPoints": 1,
    "StatusTypeID": 50,
    "DateLastStatusUpdate": "2020-08-06T11:30:00Z",
    "DataQualityLevel": 1,
    "DateCreated": "2020-08-06T04:10:00Z",
    "SubmissionStatusTypeID": 200
}