{
    "IsRecentlyVerified": false,
    "ID": 66913,
    "UUID": "69675BBD-71F0-49EB-B54F-5A70C6F66D77",
    "DataProviderID": 1,
    "OperatorID": 23,
    "OperatorsReference": "14598",
    "UsageTypeID": 1,
    "UsageCost": "Free",
    "AddressInfo": {
        "ID": 67259,
        "Title": "La Jolla Shores Hotel - Tesla",
        "AddressLine1": "8110 Camino Del Oro",
        "Town": "San Diego",
        "StateOrProvince": "CA",
        "Postcode": "92037",
        "CountryID": 2,
        "Latitude": 32.8549896,
        "Longitude": -117.258174,
        "ContactTelephone1": "858-412-0721  877-798-3752",
        "AccessComments": "24 hours daily; for Tesla use only; for guest use only; see front desk for access",
        "RelatedURL": "http://www.teslamotors.com/supercharger",
        "DistanceUnit": 0
    },
    "Connections": [
        {
            "ID": 92401,
            "ConnectionTypeID": 30,
            "StatusTypeID": 50,
            "LevelID": 2,
            "Amps": 16,
            "Voltage": 230,
            "PowerKW": 8,
            "CurrentTypeID": 10,
            "Quantity": 2
        }
    ],
    "NumberOfPoints": 2,
    "StatusTypeID": 50,
    "DateLastStatusUpdate": "2017-01-31T19:02:00Z",
    "DataQualityLevel": 3,
    "DateCreated": "2016-05-29T02:04:00Z",
    "SubmissionStatusTypeID": 100
}