{
    "IsRecentlyVerified": false,
    "ID": 94810,
    "UUID": "320E274D-4DDF-4144-86F9-12EA0A7524BD",
    "DataProviderID": 1,
    "OperatorID": 3,
    "OperatorsReference": "t53_hu1_2417_007",
    "UsageTypeID": 4,
    "UsageCost": "£0.25/kWh",
    "AddressInfo": {
        "ID": 95156,
        "Title": "Lidl-Bucksburn",
        "AddressLine1": "Inverurie Road",
        "Town": "Aberdeen",
        "Postcode": "AB21 9LZ",
        "CountryID": 1,
        "Latitude": 57.179293,
        "Longitude": -2.17626,
        "DistanceUnit": 0
    },
    "Connections": [
        {
            "ID": 134013,
            "ConnectionTypeID": 2,
            "StatusTypeID": 50,
            "LevelID": 3,
            "Amps": 125,
            "Voltage": 500,
            "PowerKW": 50,
            "CurrentTypeID": 30,
            "Quantity": 1
        },
        {
            "ID": 134014,
            "ConnectionTypeID": 1036,
            "StatusTypeID": 50,
            "LevelID": 3,
            "Amps": 63,
            "Voltage": 400,
            "PowerKW": 43,
            "CurrentTypeID": 20,
            "Quantity": 1
        },
        {
            "ID": 134015,
            "ConnectionTypeID": 33,
            "StatusTypeID": 50,
            "LevelID": 3,
            "Amps": 125,
            "Voltage": 500,
            "PowerKW": 50,
            "CurrentTypeID": 30,
            "Quantity": 1
        },
        {
            "ID": 135093,
            "ConnectionTypeID": 1036,
            "StatusTypeID": 50,
            "LevelID": 3,
            "PowerKW": 43,
            "CurrentTypeID": 20,
            "Quantity": 1
        }
    ],
    "NumberOfPoints": 3,
    "StatusTypeID": 50,
    "DateLastStatusUpdate": "2021-03-20T06:27:00Z",
    "DataQualityLevel": 1,
    "DateCreated": "2017-10-27T12:11:00Z",
    "SubmissionStatusTypeID": 200
}