{
    "IsRecentlyVerified": false,
    "ID": 135778,
    "UUID": "F38A8309-E917-4168-9917-6AF7A1516297",
    "DataProviderID": 18,
    "DataProvidersReference": "3105fe6122fe0c014bf8dd8d3120867d",
    "OperatorID": 2244,
    "UsageTypeID": 5,
    "AddressInfo": {
        "ID": 136124,
        "Title": "Clapham Common West Side",
        "AddressLine1": "Clapham Common West Side",
        "Town": "London",
        "Postcode": "SW4 9AU",
        "CountryID": 1,
        "Latitude": 51.456761,
        "Longitude": -0.155402,
        "AccessComments": "",
        "RelatedURL": "https://www.ubitricity.com",
        "DistanceUnit": 0
    },
    "Connections": [
        {
            "ID": 190198,
            "ConnectionTypeID": 25,
            "Reference": "suby1100001465",
            "StatusTypeID": 50,
            "LevelID": 2,
            "Amps": 16,
            "Voltage": 230,
            "PowerKW": 3.7,
            "CurrentTypeID": 10
        }
    ],
    "StatusTypeID": 0,
    "DateLastStatusUpdate": "2021-04-25T05:46:00Z",
    "MetadataValues": [
        {
            "ID": 5630,
            "MetadataFieldID": 4,
            "ItemValue": "Contains public sector information licensed under the Open Government Licence v2.0. http://www.nationalarchives.gov.uk/doc/open-government-licence/version/2/"
        }
    ],
    "DataQualityLevel": 3,
    "DateCreated": "2019-12-24T05:22:00Z",
    "SubmissionStatusTypeID": 100
}