{
    "IsRecentlyVerified": false,
    "ID": 52973,
    "UUID": "E7483BDE-DDEC-4FFD-B70E-64D775F470C5",
    "DataProviderID": 1,
    "UsageTypeID": 6,
    "AddressInfo": {
        "ID": 53319,
        "Title": "Keropetrol   ",
        "AddressLine1": "Strada Statale 1 Via Aurelia",
        "AddressLine2": "Pietra Ligure",
        "StateOrProvince": "SV",
        "Postcode": "17027",
        "CountryID": 112,
        "Latitude": 44.13984169869378,
        "Longitude": 8.269035426544992,
        "RelatedURL": "http://www.keropetrol.com/",
        "DistanceUnit": 0
    },
    "Connections": [
        {
            "ID": 65982,
            "ConnectionTypeID": 25,
            "StatusTypeID": 50,
            "LevelID": 2,
            "Amps": 32,
            "Voltage": 400,
            "PowerKW": 22,
            "CurrentTypeID": 20,
            "Quantity": 1
        },
        {
            "ID": 65983,
            "ConnectionTypeID": 0,
            "StatusTypeID": 50,
            "LevelID": 2,
            "Amps": 13,
            "Voltage": 240,
            "PowerKW": 3,
            "CurrentTypeID": 10,
            "Quantity": 1
        }
    ],
    "NumberOfPoints": 1,
    "StatusTypeID": 50,
    "DateLastStatusUpdate": "2015-09-15T16:02:00Z",
    "DataQualityLevel": 1,
    "DateCreated": "2015-09-15T16:02:00Z",
    "SubmissionStatusTypeID": 200
}