{
    "IsRecentlyVerified": false,
    "ID": 158601,
    "UUID": "AC3DC106-0332-4FE3-B92A-B8A9E5C9C45F",
    "DataProviderID": 2,
    "DataProvidersReference": "155506",
    "UsageTypeID": 1,
    "AddressInfo": {
        "ID": 158958,
        "Title": "City of Manhattan Beach - Upper South Pier Parking Lot",
        "AddressLine1": "1121 Ocean Dr",
        "Town": "Manhattan Beach",
        "StateOrProvince": "CA",
        "Postcode": "90266",
        "CountryID": 2,
        "Latitude": 33.883937,
        "Longitude": -118.411118,
        "ContactTelephone1": "310-802-5000",
        "AccessComments": "24 hours daily; five hour parking limit",
        "RelatedURL": "",
        "DistanceUnit": 0
    },
    "Connections": [
        {
            "ID": 228611,
            "ConnectionTypeID": 1,
            "LevelID": 2,
            "Amps": 16,
            "Voltage": 230,
            "PowerKW": 3.7,
            "CurrentTypeID": 10,
            "Quantity": 2
        }
    ],
    "StatusTypeID": 50,
    "DateLastStatusUpdate": "2020-06-26T02:56:00Z",
    "DataQualityLevel": 3,
    "DateCreated": "2020-06-26T02:56:00Z",
    "SubmissionStatusTypeID": 100
}