{
    "IsRecentlyVerified": false,
    "ID": 8633,
    "UUID": "47042B1F-7984-4188-9E9A-75085F31BDDA",
    "DataProviderID": 15,
    "DataProvidersReference": "9005",
    "OperatorID": 26,
    "AddressInfo": {
        "ID": 8530,
        "Title": "12100 Los Osos Valley Road",
        "AddressLine1": "12100 Los Osos Valley Road",
        "Town": "San Luis Obispo",
        "StateOrProvince": "CA",
        "Postcode": "93405",
        "CountryID": 2,
        "Latitude": 35.25078,
        "Longitude": -120.68485,
        "ContactTelephone1": "",
        "RelatedURL": "http://carstations.com/9005",
        "DistanceUnit": 0
    },
    "Connections": [
        {
            "ID": 6057,
            "ConnectionTypeID": 1,
            "Reference": "J1772",
            "LevelID": 2
        }
    ],
    "StatusTypeID": 0,
    "DateLastStatusUpdate": "2017-11-04T14:04:00Z",
    "DataQualityLevel": 1,
    "DateCreated": "2011-11-11T12:07:00Z",
    "SubmissionStatusTypeID": 100
}