{
    "IsRecentlyVerified": false,
    "ID": 124832,
    "UUID": "C541D5A7-D43A-4D2F-AE8B-0DD009FCDA32",
    "DataProviderID": 2,
    "DataProvidersReference": "64350",
    "UsageTypeID": 1,
    "AddressInfo": {
        "ID": 125178,
        "Title": "University of Pittsburgh Medical Center - Mercy Hospital",
        "AddressLine1": "1400 Locust St",
        "Town": "Pittsburgh",
        "StateOrProvince": "PA",
        "Postcode": "15219",
        "CountryID": 2,
        "Latitude": 40.436276,
        "Longitude": -79.985191,
        "ContactTelephone1": "412-232-7998",
        "AccessComments": "24 hours daily",
        "RelatedURL": "",
        "DistanceUnit": 0
    },
    "Connections": [
        {
            "ID": 174984,
            "ConnectionTypeID": 1,
            "LevelID": 2,
            "Amps": 16,
            "Voltage": 230,
            "PowerKW": 3.7,
            "CurrentTypeID": 10,
            "Quantity": 1
        }
    ],
    "DateLastStatusUpdate": "2020-06-26T03:03:00Z",
    "DataQualityLevel": 3,
    "DateCreated": "2019-04-06T05:04:00Z",
    "SubmissionStatusTypeID": 100
}