{
    "IsRecentlyVerified": false,
    "ID": 162623,
    "UUID": "D91F2184-C402-4331-8F46-129CEE826BE7",
    "DataProviderID": 1,
    "OperatorID": 136,
    "UsageTypeID": 4,
    "UsageCost": "0,15€/Kwh",
    "AddressInfo": {
        "ID": 162980,
        "Title": "Keuda Sibeliuksenväylä",
        "AddressLine1": "Sibeliuksenväylä 55",
        "Town": "Järvenpää",
        "StateOrProvince": "Southern Finland",
        "Postcode": "04400",
        "CountryID": 79,
        "Latitude": 60.459231654193445,
        "Longitude": 25.083902015801755,
        "RelatedURL": "http://www.virta.fi",
        "DistanceUnit": 0
    },
    "Connections": [
        {
            "ID": 234064,
            "ConnectionTypeID": 25,
            "StatusTypeID": 50,
            "LevelID": 2,
            "Amps": 16,
            "Voltage": 400,
            "PowerKW": 11,
            "CurrentTypeID": 20,
            "Quantity": 2
        }
    ],
    "NumberOfPoints": 2,
    "StatusTypeID": 50,
    "DateLastStatusUpdate": "2020-08-13T07:40:00Z",
    "DataQualityLevel": 1,
    "DateCreated": "2020-08-12T16:27:00Z",
    "SubmissionStatusTypeID": 200
}