{
    "UserComments": [
        {
            "ID": 17328,
            "ChargePointID": 71166,
            "CommentTypeID": 10,
            "UserName": "TheScotstounPele",
            "Comment": "Working well.",
            "DateCreated": "2017-05-25T21:37:39.873Z",
            "User": {
                "ID": 6377,
                "Username": "TheScotstounPele"
            },
            "CheckinStatusTypeID": 10
        }
    ],
    "IsRecentlyVerified": false,
    "ID": 71166,
    "UUID": "5DFCA670-2499-483E-B52D-ACC4F73A0B68",
    "DataProviderID": 1,
    "OperatorID": 3315,
    "OperatorsReference": "51009",
    "UsageTypeID": 4,
    "UsageCost": "Free",
    "AddressInfo": {
        "ID": 71512,
        "Title": "Integrated Environmental Solutions LTD",
        "AddressLine1": "IES Helix Building",
        "Town": "Glasgow City",
        "StateOrProvince": "Scotland",
        "Postcode": "G20 0SP",
        "CountryID": 1,
        "Latitude": 55.901877,
        "Longitude": -4.31243489999997,
        "DistanceUnit": 0
    },
    "Connections": [
        {
            "ID": 101964,
            "ConnectionTypeID": 25,
            "StatusTypeID": 50,
            "LevelID": 2,
            "Amps": 32,
            "Voltage": 230,
            "PowerKW": 7,
            "CurrentTypeID": 10,
            "Quantity": 2
        }
    ],
    "NumberOfPoints": 2,
    "StatusTypeID": 50,
    "DateLastStatusUpdate": "2019-08-15T05:16:00Z",
    "DataQualityLevel": 1,
    "DateCreated": "2016-09-01T09:54:00Z",
    "SubmissionStatusTypeID": 200
}