{
    "IsRecentlyVerified": false,
    "ID": 115165,
    "UUID": "E8D7F45C-57AD-4818-87E9-E4042A816CE1",
    "DataProviderID": 1,
    "DataProvidersReference": "AVR-00008",
    "OperatorID": 21,
    "UsageTypeID": 4,
    "UsageCost": "Mobi.E compatible card",
    "AddressInfo": {
        "ID": 115511,
        "Title": "AVR-00008",
        "AddressLine1": "Campus Universitário de Santiago, Aveiro",
        "Town": "Aveiro",
        "Postcode": "3810-193",
        "CountryID": 180,
        "Latitude": 40.6294,
        "Longitude": -8.654226,
        "RelatedURL": "http://www.mobie.pt",
        "DistanceUnit": 0
    },
    "Connections": [
        {
            "ID": 162099,
            "ConnectionTypeID": 25,
            "StatusTypeID": 50,
            "LevelID": 2,
            "Amps": 32,
            "Voltage": 400,
            "PowerKW": 22,
            "CurrentTypeID": 20,
            "Quantity": 2
        }
    ],
    "NumberOfPoints": 2,
    "StatusTypeID": 50,
    "DateLastStatusUpdate": "2020-09-12T19:15:00Z",
    "DataQualityLevel": 3,
    "DateCreated": "2019-02-02T22:37:00Z",
    "SubmissionStatusTypeID": 100
}