{
    "IsRecentlyVerified": false,
    "ID": 99555,
    "UUID": "308D4D73-2C38-4983-9A52-9C30E70C8906",
    "DataProviderID": 1,
    "OperatorID": 45,
    "UsageTypeID": 6,
    "AddressInfo": {
        "ID": 99901,
        "Title": "Parador de Oropesa",
        "AddressLine1": "Parador Virrey de Toledo",
        "Town": "Oropesa",
        "StateOrProvince": "Toledo",
        "Postcode": "45560 Oropesa",
        "CountryID": 210,
        "Latitude": 39.9194,
        "Longitude": -5.17499999999995,
        "DistanceUnit": 0
    },
    "Connections": [
        {
            "ID": 140682,
            "ConnectionTypeID": 17,
            "StatusTypeID": 50,
            "LevelID": 2,
            "Amps": 32,
            "Voltage": 400,
            "PowerKW": 22,
            "CurrentTypeID": 20,
            "Quantity": 1
        }
    ],
    "NumberOfPoints": 1,
    "StatusTypeID": 50,
    "DateLastStatusUpdate": "2018-01-29T20:25:00Z",
    "DataQualityLevel": 1,
    "DateCreated": "2018-01-29T16:11:00Z",
    "SubmissionStatusTypeID": 200
}