{
    "IsRecentlyVerified": false,
    "ID": 111157,
    "UUID": "24BBC3C2-1DB4-41AA-9A69-25CEC57E1A28",
    "DataProviderID": 2,
    "DataProvidersReference": "84328",
    "UsageTypeID": 1,
    "AddressInfo": {
        "ID": 111503,
        "Title": "Shannonville Motorsports Park",
        "AddressLine1": "7047 Old Highway 2",
        "Town": "Shannonville",
        "StateOrProvince": "ON",
        "Postcode": "K0K 3A0",
        "CountryID": 44,
        "Latitude": 44.222004,
        "Longitude": -77.159369,
        "ContactTelephone1": "800-959-8955  613-969-1906",
        "AccessComments": "24 hours daily (Apr-Oct), 9am-4pm M-Th (Nov-Mar)",
        "RelatedURL": "",
        "DistanceUnit": 0
    },
    "Connections": [
        {
            "ID": 156528,
            "ConnectionTypeID": 1,
            "LevelID": 2,
            "Amps": 16,
            "Voltage": 230,
            "PowerKW": 3.7,
            "CurrentTypeID": 10,
            "Quantity": 2
        }
    ],
    "DateLastStatusUpdate": "2020-06-26T03:07:00Z",
    "DataQualityLevel": 3,
    "DateCreated": "2018-10-18T23:36:00Z",
    "SubmissionStatusTypeID": 100
}