{
    "IsRecentlyVerified": false,
    "ID": 169746,
    "UUID": "33F37E90-CF6F-4848-9097-C351E45D1CEC",
    "DataProviderID": 1,
    "OperatorID": 3327,
    "UsageTypeID": 1,
    "AddressInfo": {
        "ID": 170105,
        "Title": "BECHARGE Hotel Miramonti Val Masino",
        "AddressLine1": "Via Zocca, 12",
        "Town": "Val Masino",
        "StateOrProvince": "SO",
        "Postcode": "23010 ",
        "CountryID": 112,
        "Latitude": 46.22050801814419,
        "Longitude": 9.637447683712367,
        "ContactTelephone1": "02-49527730",
        "ContactEmail": "emobility@buildingenergy.it",
        "RelatedURL": "https://www.bec.energy/",
        "DistanceUnit": 0
    },
    "Connections": [
        {
            "ID": 258598,
            "ConnectionTypeID": 25,
            "StatusTypeID": 50,
            "LevelID": 2,
            "Amps": 32,
            "Voltage": 400,
            "PowerKW": 22,
            "CurrentTypeID": 20,
            "Quantity": 2
        }
    ],
    "NumberOfPoints": 2,
    "StatusTypeID": 50,
    "DateLastStatusUpdate": "2020-11-06T16:54:00Z",
    "DataQualityLevel": 1,
    "DateCreated": "2020-11-06T16:54:00Z",
    "SubmissionStatusTypeID": 200
}