{
    "IsRecentlyVerified": false,
    "ID": 109207,
    "UUID": "B69CE18B-1A3E-4488-8BE6-E2915F88CF5D",
    "DataProviderID": 1,
    "OperatorID": 23,
    "OperatorsReference": "34255",
    "UsageTypeID": 4,
    "UsageCost": "$0.22/kWh; other tariffs for older cars",
    "AddressInfo": {
        "ID": 109553,
        "Title": "Delray Beach, FL Supercharger",
        "AddressLine1": "14851 Lyons Road",
        "Town": "Delray Beach",
        "StateOrProvince": "FL",
        "Postcode": "33446",
        "CountryID": 2,
        "Latitude": 26.455624,
        "Longitude": -80.190377,
        "DistanceUnit": 0
    },
    "Connections": [
        {
            "ID": 154325,
            "ConnectionTypeID": 27,
            "StatusTypeID": 50,
            "LevelID": 3,
            "PowerKW": 120,
            "CurrentTypeID": 30,
            "Quantity": 18
        }
    ],
    "NumberOfPoints": 18,
    "GeneralComments": "Charging18 Superchargers, available 24/7, up to 120kW",
    "StatusTypeID": 50,
    "DateLastStatusUpdate": "2018-10-11T13:56:00Z",
    "DataQualityLevel": 1,
    "DateCreated": "2018-10-11T13:56:00Z",
    "SubmissionStatusTypeID": 200
}