{
    "IsRecentlyVerified": false,
    "ID": 67300,
    "UUID": "C92505B4-3158-4F1A-B3CF-90A5AA6890FD",
    "DataProviderID": 1,
    "OperatorID": 23,
    "OperatorsReference": "12274",
    "UsageTypeID": 1,
    "UsageCost": "Free",
    "AddressInfo": {
        "ID": 67646,
        "Title": "Oxford Suites - Tesla",
        "AddressLine1": "2035 Business Ln",
        "Town": "Chico",
        "StateOrProvince": "CA",
        "Postcode": "95928",
        "CountryID": 2,
        "Latitude": 39.7247851,
        "Longitude": -121.8053366,
        "ContactTelephone1": "530-899-9090  877-798-3752",
        "AccessComments": "24 hours daily; for Tesla use only; for guest use only; see front desk for access",
        "RelatedURL": "http://www.teslamotors.com/supercharger",
        "DistanceUnit": 0
    },
    "Connections": [
        {
            "ID": 92802,
            "ConnectionTypeID": 30,
            "StatusTypeID": 50,
            "LevelID": 2,
            "Amps": 16,
            "Voltage": 230,
            "PowerKW": 8,
            "CurrentTypeID": 10,
            "Quantity": 1
        }
    ],
    "NumberOfPoints": 1,
    "StatusTypeID": 50,
    "DateLastStatusUpdate": "2017-01-26T04:38:00Z",
    "DataQualityLevel": 3,
    "DateCreated": "2016-05-29T02:05:00Z",
    "SubmissionStatusTypeID": 100
}