{
    "IsRecentlyVerified": false,
    "ID": 97316,
    "UUID": "00B3D502-6870-4F17-A967-1D8586644EB9",
    "DataProviderID": 1,
    "OperatorID": 91,
    "UsageTypeID": 4,
    "UsageCost": "IBIL fee",
    "AddressInfo": {
        "ID": 97662,
        "Title": "Valle de Mena City Hall",
        "AddressLine1": "Calle Félix Rodríguez de la Fuente, 2L",
        "Town": "Villasana de Mena",
        "StateOrProvince": "Burgos",
        "Postcode": "09580",
        "CountryID": 210,
        "Latitude": 43.0982156,
        "Longitude": -3.28339630000005,
        "AccessComments": "Open 24 hours.",
        "RelatedURL": "https://www.ibil.es/index.php/es/",
        "DistanceUnit": 0
    },
    "Connections": [
        {
            "ID": 138206,
            "ConnectionTypeID": 25,
            "Voltage": 230,
            "Quantity": 1
        },
        {
            "ID": 138207,
            "ConnectionTypeID": 25
        }
    ],
    "NumberOfPoints": 2,
    "GeneralComments": "Free parking. Charging here requires the IBIL card.",
    "StatusTypeID": 50,
    "DateLastStatusUpdate": "2018-01-18T13:54:00Z",
    "DataQualityLevel": 1,
    "DateCreated": "2018-01-17T11:08:00Z",
    "SubmissionStatusTypeID": 200
}