{
    "IsRecentlyVerified": false,
    "ID": 166982,
    "UUID": "D6DCF274-B7A8-4AF3-ACBE-6388A4B371CB",
    "DataProviderID": 1,
    "OperatorID": 21,
    "UsageTypeID": 4,
    "UsageCost": "Mobi.E compatible card",
    "AddressInfo": {
        "ID": 167341,
        "Title": "BRG-00040/41/42",
        "AddressLine1": "Makro Braga",
        "Town": "Braga",
        "StateOrProvince": "Braga",
        "Postcode": "4710-104",
        "CountryID": 180,
        "Latitude": 41.549664,
        "Longitude": -8.401487,
        "AccessComments": "Makro",
        "RelatedURL": "https://www.mobie.pt",
        "DistanceUnit": 0
    },
    "Connections": [
        {
            "ID": 252785,
            "ConnectionTypeID": 25,
            "StatusTypeID": 50,
            "LevelID": 2,
            "Amps": 32,
            "Voltage": 400,
            "PowerKW": 22,
            "CurrentTypeID": 20,
            "Quantity": 6
        }
    ],
    "NumberOfPoints": 6,
    "StatusTypeID": 50,
    "DateLastStatusUpdate": "2020-09-24T21:15:00Z",
    "DataQualityLevel": 3,
    "DateCreated": "2020-08-27T06:37:00Z",
    "SubmissionStatusTypeID": 100
}