{
    "IsRecentlyVerified": false,
    "ID": 110895,
    "UUID": "9DDB9FE6-CC40-4CCB-A2FB-16900208C552",
    "DataProviderID": 2,
    "DataProvidersReference": "84952",
    "UsageTypeID": 7,
    "AddressInfo": {
        "ID": 111241,
        "Title": "Waterloo Nissan",
        "AddressLine1": "141 Northfield Dr W",
        "Town": "Waterloo",
        "StateOrProvince": "ON",
        "Postcode": "N2L 5A6",
        "CountryID": 44,
        "Latitude": 43.497011,
        "Longitude": -80.545283,
        "ContactTelephone1": "519-884-3660",
        "AccessComments": "24 hours daily\r\nPublic - Call ahead",
        "RelatedURL": "",
        "DistanceUnit": 0
    },
    "Connections": [
        {
            "ID": 156209,
            "ConnectionTypeID": 1,
            "LevelID": 2,
            "Amps": 16,
            "Voltage": 230,
            "PowerKW": 3.7,
            "CurrentTypeID": 10,
            "Quantity": 1
        }
    ],
    "DateLastStatusUpdate": "2020-06-26T03:07:00Z",
    "DataQualityLevel": 3,
    "DateCreated": "2018-10-18T23:36:00Z",
    "SubmissionStatusTypeID": 100
}