{
    "IsRecentlyVerified": false,
    "ID": 42505,
    "UUID": "E22147F3-AD41-45E7-AF98-2A6F789B941D",
    "DataProviderID": 1,
    "OperatorID": 45,
    "UsageTypeID": 1,
    "AddressInfo": {
        "ID": 42851,
        "Title": "Parkhaus CITTI-Park",
        "AddressLine1": "Langberger Weg 4",
        "Town": " Flensburg",
        "Postcode": "24941",
        "CountryID": 87,
        "Latitude": 54.77424683605999,
        "Longitude": 9.39816623386537,
        "ContactTelephone1": "+49 461 57060",
        "RelatedURL": "http://www.citti-park-flensburg.de/service.html",
        "DistanceUnit": 0
    },
    "Connections": [
        {
            "ID": 51178,
            "ConnectionTypeID": 25,
            "StatusTypeID": 50,
            "LevelID": 2,
            "Amps": 32,
            "Voltage": 400,
            "PowerKW": 22,
            "CurrentTypeID": 20,
            "Quantity": 2
        },
        {
            "ID": 51179,
            "ConnectionTypeID": 28,
            "StatusTypeID": 50,
            "LevelID": 2,
            "Amps": 16,
            "Voltage": 230,
            "PowerKW": 3.7,
            "CurrentTypeID": 10,
            "Quantity": 2
        }
    ],
    "NumberOfPoints": 4,
    "GeneralComments": "Im Parkhaus auf Ebene 0, direkt am Cittymarkt-Eingang. Laden kostenlos und immer möglich, nachdem an der Information eine dauerhaft gültige Ladekarte gegen 5€ Pfand abgeholt wurde,  während der Öffnungszeiten Mo-Sa 8-20Uhr. Auch E-Bike-Verleih.\r\nEIne weitere Ladestation gibt es auf dem Parkplatz.",
    "StatusTypeID": 50,
    "DateLastStatusUpdate": "2015-03-13T07:59:00Z",
    "DataQualityLevel": 1,
    "DateCreated": "2015-03-13T07:58:00Z",
    "SubmissionStatusTypeID": 200
}