{
    "UserComments": [
        {
            "ID": 408,
            "ChargePointID": 18415,
            "CommentTypeID": 10,
            "UserName": "Carrie",
            "Comment": "Stopped here for lunch and a quick charge. No fee if using hotel facilities. Space was ICE'd when I arrived but it was the hotel receptionist's car and she happily and quickly moved it. Lovely lunch and not far from the motorway if you're travelling from North east of Scotland and need a quick charge before Edinburgh. ",
            "Rating": 4,
            "DateCreated": "2013-08-22T12:48:22.61Z",
            "CheckinStatusTypeID": 0
        }
    ],
    "IsRecentlyVerified": false,
    "ID": 18415,
    "UUID": "DD13DEEE-B5D0-48A6-A37C-C49448E029B3",
    "DataProviderID": 1,
    "OperatorID": 19,
    "UsageTypeID": 1,
    "UsageCost": "",
    "AddressInfo": {
        "ID": 18760,
        "Title": "Pitbauchlie House Hotel",
        "AddressLine1": "Aberdour Road ",
        "AddressLine2": "Dunfermline",
        "Town": "Fife",
        "StateOrProvince": "Scotland",
        "Postcode": "KY11 4PB",
        "CountryID": 1,
        "Latitude": 56.0596785,
        "Longitude": -3.414058000000068,
        "ContactTelephone1": "01383 722 282",
        "ContactTelephone2": "",
        "ContactEmail": "info@pitbauchlie.com",
        "AccessComments": "",
        "RelatedURL": "http://www.pitbauchlie.com",
        "DistanceUnit": 0
    },
    "Connections": [
        {
            "ID": 18638,
            "ConnectionTypeID": 25,
            "StatusTypeID": 50,
            "LevelID": 2,
            "Amps": 32,
            "Voltage": 230,
            "PowerKW": 7,
            "CurrentTypeID": 10,
            "Quantity": 1
        }
    ],
    "NumberOfPoints": 1,
    "GeneralComments": "",
    "StatusTypeID": 50,
    "DateLastStatusUpdate": "2013-07-19T15:51:00Z",
    "DataQualityLevel": 1,
    "DateCreated": "2013-07-19T15:51:00Z",
    "SubmissionStatusTypeID": 200
}