{
    "IsRecentlyVerified": false,
    "ID": 136372,
    "UUID": "D0312A35-8350-47F0-BD42-4DF1EB2D16C5",
    "DataProviderID": 1,
    "OperatorID": 2244,
    "UsageTypeID": 5,
    "AddressInfo": {
        "ID": 136718,
        "Title": "Lydford Road",
        "AddressLine1": "Lydford Road",
        "Town": "London",
        "Postcode": "W9 3LU",
        "CountryID": 1,
        "Latitude": 51.527225,
        "Longitude": -0.199294,
        "AccessComments": "",
        "RelatedURL": "https://www.ubitricity.com",
        "DistanceUnit": 0
    },
    "Connections": [
        {
            "ID": 190812,
            "ConnectionTypeID": 25,
            "Reference": "suby1100002841",
            "StatusTypeID": 50,
            "LevelID": 2,
            "Amps": 16,
            "Voltage": 230,
            "PowerKW": 3.7,
            "CurrentTypeID": 10,
            "Quantity": 2
        }
    ],
    "StatusTypeID": 50,
    "DateLastStatusUpdate": "2020-10-11T23:33:00Z",
    "MetadataValues": [
        {
            "ID": 6224,
            "MetadataFieldID": 4,
            "ItemValue": "Contains public sector information licensed under the Open Government Licence v2.0. http://www.nationalarchives.gov.uk/doc/open-government-licence/version/2/"
        }
    ],
    "DataQualityLevel": 3,
    "DateCreated": "2019-12-24T05:22:00Z",
    "SubmissionStatusTypeID": 100
}