{
    "IsRecentlyVerified": false,
    "ID": 93787,
    "UUID": "0F2B68C4-AA86-49F6-915D-F7574F90DF41",
    "DataProviderID": 1,
    "OperatorID": 23,
    "OperatorsReference": "36130",
    "UsageTypeID": 4,
    "AddressInfo": {
        "ID": 94133,
        "Title": "Gray Eagle Lodge",
        "AddressLine1": "5000 Gold Lake RD",
        "Town": "Graeagle",
        "StateOrProvince": "California",
        "Postcode": "96103",
        "CountryID": 2,
        "Latitude": 39.723118,
        "Longitude": -120.662973,
        "ContactTelephone1": "(530) 836-2511",
        "DistanceUnit": 0
    },
    "Connections": [
        {
            "ID": 132769,
            "ConnectionTypeID": 30,
            "StatusTypeID": 50,
            "LevelID": 2,
            "PowerKW": 8,
            "CurrentTypeID": 10,
            "Quantity": 1
        }
    ],
    "NumberOfPoints": 1,
    "GeneralComments": "1 Tesla Connector, up to 8kW.Available for customers. Please call ahead.",
    "StatusTypeID": 50,
    "DateLastStatusUpdate": "2017-10-08T05:36:00Z",
    "DataQualityLevel": 1,
    "DateCreated": "2017-10-08T05:36:00Z",
    "SubmissionStatusTypeID": 200
}