{
    "IsRecentlyVerified": false,
    "ID": 120362,
    "UUID": "E2110DD4-981E-406E-8C07-C9DD09DFA498",
    "DataProviderID": 2,
    "DataProvidersReference": "87776",
    "UsageTypeID": 2,
    "AddressInfo": {
        "ID": 120708,
        "Title": "Alabama Power - Prattville Office",
        "AddressLine1": "1651 E Main St",
        "Town": "Prattville",
        "StateOrProvince": "AL",
        "Postcode": "36066",
        "CountryID": 2,
        "Latitude": 32.461286,
        "Longitude": -86.428374,
        "ContactTelephone1": "",
        "AccessComments": "",
        "RelatedURL": "",
        "DistanceUnit": 0
    },
    "Connections": [
        {
            "ID": 169704,
            "ConnectionTypeID": 1,
            "LevelID": 2,
            "Amps": 16,
            "Voltage": 230,
            "PowerKW": 3.7,
            "CurrentTypeID": 10,
            "Quantity": 1
        }
    ],
    "DateLastStatusUpdate": "2020-06-26T02:54:00Z",
    "DataQualityLevel": 3,
    "DateCreated": "2019-04-01T04:59:00Z",
    "SubmissionStatusTypeID": 100
}