{
    "IsRecentlyVerified": false,
    "ID": 30747,
    "UUID": "B0F0506F-AA18-40CE-80D4-02442BE009B5",
    "DataProviderID": 1,
    "DataProvidersReference": "1366",
    "AddressInfo": {
        "ID": 31093,
        "Title": "Skedsmo rådhus, Lillestrøm",
        "AddressLine1": "Jonas Lies gate 18",
        "Town": "LILLESTRØM",
        "StateOrProvince": "Viken",
        "Postcode": "2000",
        "CountryID": 168,
        "Latitude": 59.95479,
        "Longitude": 11.03878,
        "AccessComments": "På \"gult område\" for besøkende til rådhuset. Strøm hentes fra motorvarmere.",
        "DistanceUnit": 0
    },
    "Connections": [
        {
            "ID": 33976,
            "ConnectionTypeID": 0,
            "Reference": "1",
            "LevelID": 2,
            "Amps": 16,
            "Voltage": 230,
            "PowerKW": 3.7,
            "Comments": "Mode 1"
        },
        {
            "ID": 88803,
            "ConnectionTypeID": 0,
            "Reference": "2",
            "LevelID": 2,
            "Amps": 16,
            "Voltage": 230,
            "PowerKW": 3.7,
            "Comments": "Mode 1"
        }
    ],
    "NumberOfPoints": 2,
    "DateLastStatusUpdate": "2020-05-26T08:23:00Z",
    "DataQualityLevel": 2,
    "DateCreated": "2014-12-09T09:00:00Z",
    "SubmissionStatusTypeID": 100
}