{
    "IsRecentlyVerified": false,
    "ID": 18435,
    "UUID": "7049C88F-EEC5-40D7-AF77-558A0A91C4DA",
    "DataProviderID": 15,
    "DataProvidersReference": "32829",
    "OperatorID": 26,
    "UsageTypeID": 1,
    "AddressInfo": {
        "ID": 18780,
        "Title": "25485 U.S. 19",
        "AddressLine1": "25485 U.S. 19",
        "Town": "Clearwater",
        "StateOrProvince": "Florida",
        "Postcode": "33763",
        "CountryID": 2,
        "Latitude": 28.004056,
        "Longitude": -82.7288,
        "ContactTelephone1": "727-791-1818",
        "RelatedURL": "http://carstations.com/32829",
        "DistanceUnit": 0
    },
    "Connections": [
        {
            "ID": 18675,
            "ConnectionTypeID": 1,
            "Reference": "J1772",
            "LevelID": 2
        }
    ],
    "NumberOfPoints": 4,
    "StatusTypeID": 50,
    "DateLastStatusUpdate": "2017-11-04T14:03:00Z",
    "DataQualityLevel": 2,
    "DateCreated": "2013-07-25T05:05:00Z",
    "SubmissionStatusTypeID": 200
}