{
    "MediaItems": [
        {
            "ID": 25215,
            "ChargePointID": 42413,
            "ItemURL": "https://s3-ap-southeast-2.amazonaws.com/openchargemap/images/DE/OCM42413/OCM-42413.orig.2020102513323761.jpg",
            "ItemThumbnailURL": "https://s3-ap-southeast-2.amazonaws.com/openchargemap/images/DE/OCM42413/OCM-42413.thmb.2020102513323761.jpg",
            "Comment": "",
            "IsEnabled": true,
            "IsVideo": false,
            "IsFeaturedItem": false,
            "IsExternalResource": false,
            "User": {
                "ID": 19566,
                "Username": "eupeptico"
            },
            "DateCreated": "2020-10-25T13:33:00Z"
        }
    ],
    "IsRecentlyVerified": false,
    "ID": 42413,
    "UUID": "E727FAC9-00C2-4459-90E0-FEA7809ACF38",
    "DataProviderID": 1,
    "OperatorID": 165,
    "UsageTypeID": 5,
    "UsageCost": "1. bis 3. Stunde je 1€; jede weitere Stunde 0,50€",
    "AddressInfo": {
        "ID": 42759,
        "Title": "Eschenheimer Tor 3",
        "AddressLine1": "Mainova Stromtankstelle",
        "AddressLine2": "Eschenheimer Tor 3",
        "Town": "Frankfurt am Main",
        "StateOrProvince": "Hessen",
        "Postcode": "60318",
        "CountryID": 87,
        "Latitude": 50.11741403766027,
        "Longitude": 8.679090411961624,
        "ContactTelephone1": "0800 11 444 88",
        "ContactEmail": "online-redaktion@mainova.de",
        "AccessComments": "Parkgebühren von Mo. bis Sa. 9:00 - 20:00 Uhr. Keine Anmeldung notwendig",
        "RelatedURL": "https://www.mainova.de/privatkunden/mobilitaet/stromtankstellen.html",
        "DistanceUnit": 0
    },
    "Connections": [
        {
            "ID": 51032,
            "ConnectionTypeID": 25,
            "StatusTypeID": 50,
            "LevelID": 2,
            "Amps": 32,
            "Voltage": 400,
            "PowerKW": 22,
            "CurrentTypeID": 20,
            "Quantity": 2
        }
    ],
    "NumberOfPoints": 2,
    "StatusTypeID": 50,
    "DateLastStatusUpdate": "2020-10-28T13:38:00Z",
    "DataQualityLevel": 1,
    "DateCreated": "2015-03-09T19:24:00Z",
    "SubmissionStatusTypeID": 200
}