{
    "IsRecentlyVerified": false,
    "ID": 32970,
    "UUID": "1B352605-2C42-4878-B240-3E5920963DF1",
    "DataProviderID": 26,
    "DataProvidersReference": "48414",
    "OperatorID": 178,
    "OperatorsReference": "EVnetNL PNB-REE0051",
    "UsageCost": "0.00 jaarabonnement",
    "AddressInfo": {
        "ID": 33316,
        "Title": "Ukkelstraat 2A",
        "AddressLine1": "Ukkelstraat 2A",
        "Town": "Eindhoven",
        "Postcode": "5628 TE",
        "CountryID": 159,
        "Latitude": 51.476721,
        "Longitude": 5.485331,
        "ContactTelephone1": "0800-3522365",
        "RelatedURL": "http://www.evnet.nl",
        "DistanceUnit": 0
    },
    "Connections": [
        {
            "ID": 36481,
            "ConnectionTypeID": 25,
            "LevelID": 2,
            "PowerKW": 11,
            "CurrentTypeID": 10
        }
    ],
    "NumberOfPoints": 1,
    "StatusTypeID": 50,
    "DateLastStatusUpdate": "2016-06-04T02:39:00Z",
    "DataQualityLevel": 3,
    "DateCreated": "2015-01-09T06:03:00Z",
    "SubmissionStatusTypeID": 100
}