{
    "IsRecentlyVerified": false,
    "ID": 181667,
    "UUID": "B12A00AC-2827-42DF-8D6B-D89614A7C7EA",
    "DataProviderID": 29,
    "DataProvidersReference": "10776,17312",
    "AddressInfo": {
        "ID": 182026,
        "Title": "Breiter Weg 58",
        "AddressLine1": "Breiter Weg 58",
        "Town": "Stadtroda",
        "Postcode": "07646",
        "CountryID": 87,
        "Latitude": 50.858353,
        "Longitude": 11.73671,
        "DistanceUnit": 0
    },
    "Connections": [
        {
            "ID": 286305,
            "ConnectionTypeID": 25,
            "StatusTypeID": 50,
            "LevelID": 2,
            "PowerKW": 22,
            "CurrentTypeID": 20
        },
        {
            "ID": 286306,
            "ConnectionTypeID": 25,
            "StatusTypeID": 50,
            "LevelID": 2,
            "PowerKW": 22,
            "CurrentTypeID": 20
        },
        {
            "ID": 286307,
            "ConnectionTypeID": 28,
            "StatusTypeID": 50,
            "LevelID": 2,
            "PowerKW": 22,
            "CurrentTypeID": 10
        },
        {
            "ID": 286308,
            "ConnectionTypeID": 28,
            "StatusTypeID": 50,
            "LevelID": 2,
            "PowerKW": 22,
            "CurrentTypeID": 10
        }
    ],
    "StatusTypeID": 50,
    "DateLastStatusUpdate": "2021-07-09T03:20:00Z",
    "MetadataValues": [
        {
            "ID": 13961,
            "MetadataFieldID": 4,
            "ItemValue": "Data from the German chargepoint registry provided by Bundesnetzagentur.de under the CC-BY 4.0 license"
        }
    ],
    "DataQualityLevel": 3,
    "DateCreated": "2021-07-08T10:02:00Z",
    "SubmissionStatusTypeID": 100
}