{
    "IsRecentlyVerified": false,
    "ID": 135644,
    "UUID": "E87EF60F-0DE7-46AE-8F2E-97855C943DC9",
    "DataProviderID": 18,
    "DataProvidersReference": "c2ed5db7277b1e1f3c0ca5897a3221a6",
    "OperatorID": 2244,
    "UsageTypeID": 5,
    "AddressInfo": {
        "ID": 135990,
        "Title": "Waldegrave Gardens",
        "AddressLine1": "Waldegrave Gardens",
        "Town": "Twickenham",
        "Postcode": "TW1 4PQ",
        "CountryID": 1,
        "Latitude": 51.438821,
        "Longitude": -0.336733,
        "AccessComments": "",
        "RelatedURL": "https://www.ubitricity.com",
        "DistanceUnit": 0
    },
    "Connections": [
        {
            "ID": 190054,
            "ConnectionTypeID": 25,
            "Reference": "suby1100002060",
            "StatusTypeID": 50,
            "LevelID": 2,
            "Amps": 16,
            "Voltage": 230,
            "PowerKW": 3.7,
            "CurrentTypeID": 10
        }
    ],
    "StatusTypeID": 0,
    "DateLastStatusUpdate": "2021-04-25T05:46:00Z",
    "MetadataValues": [
        {
            "ID": 5496,
            "MetadataFieldID": 4,
            "ItemValue": "Contains public sector information licensed under the Open Government Licence v2.0. http://www.nationalarchives.gov.uk/doc/open-government-licence/version/2/"
        }
    ],
    "DataQualityLevel": 3,
    "DateCreated": "2019-12-24T05:22:00Z",
    "SubmissionStatusTypeID": 100
}