{
    "IsRecentlyVerified": false,
    "ID": 153805,
    "UUID": "0CC2AA4B-527F-42D7-8969-F1818F1928BB",
    "DataProviderID": 28,
    "DataProvidersReference": "FRS29PSDE29ABXA",
    "OperatorID": 3379,
    "UsageTypeID": 5,
    "AddressInfo": {
        "ID": 154158,
        "Title": "Lesneven - Rue Vally Goz",
        "AddressLine1": "Rue Vally Goz - 29124 Lesneven",
        "CountryID": 80,
        "Latitude": 48.573501,
        "Longitude": -4.32041,
        "AccessComments": "24/24_7/7",
        "DistanceUnit": 0
    },
    "Connections": [
        {
            "ID": 215991,
            "ConnectionTypeID": 1036,
            "StatusTypeID": 50,
            "LevelID": 2,
            "PowerKW": 22,
            "CurrentTypeID": 20
        },
        {
            "ID": 215992,
            "ConnectionTypeID": 28,
            "StatusTypeID": 50,
            "LevelID": 2,
            "PowerKW": 22,
            "CurrentTypeID": 10
        },
        {
            "ID": 249758,
            "ConnectionTypeID": 1036,
            "StatusTypeID": 50,
            "LevelID": 2,
            "PowerKW": 22,
            "CurrentTypeID": 20
        },
        {
            "ID": 249759,
            "ConnectionTypeID": 28,
            "StatusTypeID": 50,
            "LevelID": 2,
            "PowerKW": 22,
            "CurrentTypeID": 10
        }
    ],
    "GeneralComments": "",
    "StatusTypeID": 50,
    "DateLastStatusUpdate": "2020-08-27T05:15:00Z",
    "DataQualityLevel": 2,
    "DateCreated": "2020-03-15T10:54:00Z",
    "SubmissionStatusTypeID": 100
}