{
    "IsRecentlyVerified": false,
    "ID": 144982,
    "UUID": "A799AF23-1B5E-4833-A2D2-F15B032925C6",
    "DataProviderID": 2,
    "DataProvidersReference": "150273",
    "OperatorID": 89,
    "UsageTypeID": 1,
    "AddressInfo": {
        "ID": 145334,
        "Title": "Parc Henri-Letendre",
        "AddressLine1": "435 rue du Quai",
        "Town": "Sainte-Anne-de-Sorel",
        "StateOrProvince": "QC",
        "Postcode": "J3P 5N3",
        "CountryID": 44,
        "Latitude": 46.058269,
        "Longitude": -73.068272,
        "ContactTelephone1": "888-356-8911",
        "AccessComments": "24 hours daily",
        "RelatedURL": "https://flo.ca/",
        "DistanceUnit": 0
    },
    "Connections": [
        {
            "ID": 201548,
            "ConnectionTypeID": 1,
            "LevelID": 2,
            "Amps": 16,
            "Voltage": 230,
            "PowerKW": 3.7,
            "CurrentTypeID": 10,
            "Quantity": 1
        }
    ],
    "StatusTypeID": 50,
    "DateLastStatusUpdate": "2020-06-26T03:10:00Z",
    "DataQualityLevel": 3,
    "DateCreated": "2019-12-24T09:24:00Z",
    "SubmissionStatusTypeID": 100
}