{
    "IsRecentlyVerified": false,
    "ID": 23166,
    "UUID": "19893F46-0948-4FD4-9D2C-030AB995A213",
    "DataProviderID": 1,
    "OperatorID": 76,
    "UsageTypeID": 1,
    "UsageCost": "5€ /up to 60min of loading",
    "AddressInfo": {
        "ID": 23511,
        "Title": "Kuressaare-1",
        "AddressLine1": "Tallinna street 84",
        "Town": "Kuressaare",
        "StateOrProvince": "Saaremaa island",
        "Postcode": "93815",
        "CountryID": 74,
        "Latitude": 58.264543418391,
        "Longitude": 22.5130999879923,
        "ContactTelephone1": "+372 6511911",
        "ContactEmail": "tugi@elmo.ee",
        "RelatedURL": "http://www.elmo.ee/en",
        "DistanceUnit": 0
    },
    "Connections": [
        {
            "ID": 24927,
            "ConnectionTypeID": 2,
            "StatusTypeID": 50,
            "LevelID": 3,
            "Amps": 120,
            "Voltage": 500,
            "PowerKW": 50,
            "CurrentTypeID": 30,
            "Quantity": 1
        },
        {
            "ID": 24928,
            "ConnectionTypeID": 25,
            "StatusTypeID": 50,
            "LevelID": 2,
            "Amps": 32,
            "Voltage": 400,
            "PowerKW": 22,
            "CurrentTypeID": 20,
            "Quantity": 1
        }
    ],
    "NumberOfPoints": 1,
    "GeneralComments": "Opened 24h (automatic). \r\nReal-time condition information (operational/not operational/free) - www.elmo.ee \r\nCan pay with client card, SMS or mobile application. \r\nCharger number 74121",
    "StatusTypeID": 50,
    "DateLastStatusUpdate": "2014-04-19T19:51:00Z",
    "DataQualityLevel": 1,
    "DateCreated": "2014-04-19T19:14:00Z",
    "SubmissionStatusTypeID": 200
}