{
    "IsRecentlyVerified": false,
    "ID": 100000,
    "UUID": "C800EF6A-48C9-479D-A03A-A375F5673F34",
    "DataProviderID": 1,
    "OperatorID": 23,
    "OperatorsReference": "40600",
    "UsageTypeID": 4,
    "AddressInfo": {
        "ID": 100346,
        "Title": "Hôtel les Colonnes",
        "AddressLine1": "8 Avenue des Marronniers",
        "Town": "Gréoux-les-Bains",
        "Postcode": "4800",
        "CountryID": 80,
        "Latitude": 43.758409,
        "Longitude": 5.885539,
        "ContactTelephone1": "+33 4 92 70 46 46",
        "DistanceUnit": 0
    },
    "Connections": [
        {
            "ID": 141252,
            "ConnectionTypeID": 30,
            "StatusTypeID": 50,
            "LevelID": 2,
            "Amps": 32,
            "Voltage": 230,
            "PowerKW": 14,
            "CurrentTypeID": 20,
            "Quantity": 2
        }
    ],
    "NumberOfPoints": 2,
    "GeneralComments": "2 Tesla Connectors, up to 14kW.Available for customers. Please see front desk.",
    "StatusTypeID": 50,
    "DateLastStatusUpdate": "2018-10-03T17:16:00Z",
    "DataQualityLevel": 1,
    "DateCreated": "2018-02-09T06:52:00Z",
    "SubmissionStatusTypeID": 200
}