{
    "IsRecentlyVerified": false,
    "ID": 16937,
    "UUID": "40F3F69B-C513-4A3D-8C86-EBEF91567FFD",
    "DataProviderID": 22,
    "DataProvidersReference": "57574E4F5E30961F96C7E320BF15A5DD",
    "AddressInfo": {
        "ID": 17282,
        "Title": "羽後日産モーター御所野店",
        "AddressLine1": "秋田県秋田市御所野堤台1丁目",
        "CountryID": 114,
        "Latitude": 39.66802965,
        "Longitude": 140.1666293,
        "ContactTelephone1": "018-839-5588",
        "DistanceUnit": 0
    },
    "Connections": [
        {
            "ID": 17178,
            "ConnectionTypeID": 2,
            "LevelID": 2,
            "Amps": 100,
            "Voltage": 480,
            "PowerKW": 48,
            "Quantity": 1
        }
    ],
    "DateLastStatusUpdate": "2013-06-29T08:51:00Z",
    "DataQualityLevel": 2,
    "DateCreated": "2013-06-29T08:51:00Z",
    "SubmissionStatusTypeID": 200
}