{
    "IsRecentlyVerified": false,
    "ID": 107284,
    "UUID": "B6CA092E-D3EA-4247-9056-618D75998B01",
    "DataProviderID": 1,
    "OperatorID": 25,
    "OperatorsReference": "islington-cardozoroad",
    "UsageTypeID": 4,
    "UsageCost": "£0.059/minute; min £1.18; other tariffs available",
    "AddressInfo": {
        "ID": 107630,
        "Title": "Cardozo Road",
        "AddressLine1": "2 Cardozo Road (site 2)",
        "Town": "London",
        "Postcode": "N7 9JF",
        "CountryID": 1,
        "Latitude": 51.551294,
        "Longitude": -0.120081,
        "DistanceUnit": 0
    },
    "Connections": [
        {
            "ID": 151346,
            "ConnectionTypeID": 25,
            "StatusTypeID": 50,
            "LevelID": 2,
            "Amps": 32,
            "Voltage": 230,
            "PowerKW": 7,
            "CurrentTypeID": 10,
            "Quantity": 2
        },
        {
            "ID": 151347,
            "ConnectionTypeID": 1,
            "StatusTypeID": 50,
            "LevelID": 2,
            "Amps": 16,
            "Voltage": 230,
            "PowerKW": 4,
            "CurrentTypeID": 10,
            "Quantity": 2
        }
    ],
    "NumberOfPoints": 2,
    "StatusTypeID": 50,
    "DateLastStatusUpdate": "2018-11-21T21:12:00Z",
    "DataQualityLevel": 1,
    "DateCreated": "2018-07-23T15:57:00Z",
    "SubmissionStatusTypeID": 200
}