{
    "IsRecentlyVerified": false,
    "ID": 57851,
    "UUID": "63EE1DF0-3A19-4E03-A9A1-C637C38A83C8",
    "DataProviderID": 1,
    "DataProvidersReference": "3111",
    "AddressInfo": {
        "ID": 58197,
        "Title": "Lundstams i Östersund",
        "AddressLine1": "Storlienvägen 50",
        "Town": "ÖSTERSUND",
        "StateOrProvince": "JÄMTLAND",
        "Postcode": "83125",
        "CountryID": 216,
        "Latitude": 63.20687,
        "Longitude": 14.64009,
        "AccessComments": "",
        "DistanceUnit": 0
    },
    "Connections": [
        {
            "ID": 73314,
            "ConnectionTypeID": 0,
            "Reference": "1",
            "LevelID": 2,
            "Amps": 32,
            "Voltage": 400,
            "PowerKW": 22,
            "Comments": "Mode 3"
        },
        {
            "ID": 89377,
            "ConnectionTypeID": 0,
            "Reference": "2",
            "LevelID": 2,
            "Amps": 32,
            "Voltage": 230,
            "PowerKW": 7.4,
            "Comments": "Mode 3"
        }
    ],
    "NumberOfPoints": 2,
    "DateLastStatusUpdate": "2020-05-26T08:25:00Z",
    "DataQualityLevel": 2,
    "DateCreated": "2015-12-26T11:12:00Z",
    "SubmissionStatusTypeID": 100
}