{
    "IsRecentlyVerified": false,
    "ID": 160781,
    "UUID": "B34AF32B-FB43-4E76-8C63-C83C2ABA37DA",
    "DataProviderID": 1,
    "OperatorID": 89,
    "UsageTypeID": 1,
    "UsageCost": "$0.25/minute",
    "AddressInfo": {
        "ID": 161138,
        "Title": "Dollarama/Tesla Supercharger",
        "AddressLine1": "775 Rita Rd",
        "Town": "Quesnel",
        "StateOrProvince": "BC",
        "Postcode": "V2J 0C2",
        "CountryID": 44,
        "Latitude": 52.9669073,
        "Longitude": -122.4401636,
        "ContactTelephone1": "",
        "AccessComments": "",
        "RelatedURL": "",
        "DistanceUnit": 0
    },
    "Connections": [
        {
            "ID": 231393,
            "ConnectionTypeID": 2,
            "LevelID": 3,
            "Amps": 125,
            "Voltage": 400,
            "PowerKW": 50,
            "CurrentTypeID": 30,
            "Quantity": 1
        },
        {
            "ID": 231394,
            "ConnectionTypeID": 32,
            "LevelID": 3,
            "Amps": 125,
            "Voltage": 400,
            "PowerKW": 50,
            "CurrentTypeID": 30,
            "Quantity": 1
        }
    ],
    "GeneralComments": "",
    "DatePlanned": "2020-09-01T00:00:00Z",
    "StatusTypeID": 50,
    "DateLastStatusUpdate": "2021-10-09T17:08:00Z",
    "DataQualityLevel": 3,
    "DateCreated": "2020-06-26T03:12:00Z",
    "SubmissionStatusTypeID": 100
}