{
    "IsRecentlyVerified": false,
    "ID": 131048,
    "UUID": "54976CDB-EB2F-4378-8AE9-37BC66230F6A",
    "DataProviderID": 1,
    "OperatorID": 23,
    "OperatorsReference": "51493",
    "UsageTypeID": 4,
    "AddressInfo": {
        "ID": 131394,
        "Title": "Pivovar Podlesi",
        "AddressLine1": "Podlesi 139",
        "Town": "Pribram",
        "Postcode": "261 01",
        "CountryID": 64,
        "Latitude": 49.689742,
        "Longitude": 13.981832,
        "ContactTelephone1": "+42 3265 3194 9",
        "DistanceUnit": 0
    },
    "Connections": [
        {
            "ID": 183543,
            "ConnectionTypeID": 30,
            "StatusTypeID": 50,
            "LevelID": 2,
            "PowerKW": 11,
            "CurrentTypeID": 20,
            "Quantity": 2
        }
    ],
    "NumberOfPoints": 2,
    "GeneralComments": "2 Tesla Connectors, up to 11kW.Available for customers. Please see front desk.",
    "StatusTypeID": 50,
    "DateLastStatusUpdate": "2019-08-28T20:03:00Z",
    "DataQualityLevel": 1,
    "DateCreated": "2019-08-28T20:03:00Z",
    "SubmissionStatusTypeID": 200
}