{
    "IsRecentlyVerified": false,
    "ID": 79802,
    "UUID": "8152F6E1-6790-4C35-B153-0153C40F14A7",
    "DataProviderID": 1,
    "OperatorID": 23,
    "OperatorsReference": "28997",
    "UsageTypeID": 4,
    "UsageCost": "$0.44/min >=60kW; $0.22/min <60kW; other tariffs for older cars",
    "AddressInfo": {
        "ID": 80148,
        "Title": "Woodstock Supercharger",
        "AddressLine1": "580 Bruin Blvd.",
        "Town": "Woodstock",
        "Postcode": "N4V 1E5",
        "CountryID": 44,
        "Latitude": 43.111918,
        "Longitude": -80.738804,
        "DistanceUnit": 0
    },
    "Connections": [
        {
            "ID": 114449,
            "ConnectionTypeID": 27,
            "StatusTypeID": 50,
            "LevelID": 3,
            "PowerKW": 120,
            "CurrentTypeID": 30,
            "Quantity": 8
        }
    ],
    "NumberOfPoints": 8,
    "GeneralComments": "8 Superchargers, available 24/7",
    "StatusTypeID": 50,
    "DateLastStatusUpdate": "2021-01-04T13:38:00Z",
    "DataQualityLevel": 1,
    "DateCreated": "2017-01-30T13:18:00Z",
    "SubmissionStatusTypeID": 200
}