{
    "IsRecentlyVerified": false,
    "ID": 184862,
    "UUID": "AD283446-9D9F-40AE-BB97-4E82B56E3441",
    "DataProviderID": 29,
    "DataProvidersReference": "16001",
    "AddressInfo": {
        "ID": 185221,
        "Title": "Sportplatzstraße 5",
        "AddressLine1": "Sportplatzstraße 5",
        "Town": "Pretzfeld",
        "Postcode": "91362",
        "CountryID": 87,
        "Latitude": 49.754286,
        "Longitude": 11.171697,
        "DistanceUnit": 0
    },
    "Connections": [
        {
            "ID": 293651,
            "ConnectionTypeID": 25,
            "StatusTypeID": 50,
            "LevelID": 2,
            "PowerKW": 22,
            "CurrentTypeID": 20
        },
        {
            "ID": 293652,
            "ConnectionTypeID": 25,
            "StatusTypeID": 50,
            "LevelID": 2,
            "PowerKW": 22,
            "CurrentTypeID": 20
        }
    ],
    "StatusTypeID": 50,
    "DateLastStatusUpdate": "2021-07-12T02:43:00Z",
    "MetadataValues": [
        {
            "ID": 17153,
            "MetadataFieldID": 4,
            "ItemValue": "Data from the German chargepoint registry provided by Bundesnetzagentur.de under the CC-BY 4.0 license"
        }
    ],
    "DataQualityLevel": 3,
    "DateCreated": "2021-07-08T10:06:00Z",
    "SubmissionStatusTypeID": 100
}