{
    "IsRecentlyVerified": false,
    "ID": 105019,
    "UUID": "7250335B-E4D3-451B-962F-5056654994C2",
    "DataProviderID": 1,
    "OperatorID": 1,
    "UsageTypeID": 1,
    "AddressInfo": {
        "ID": 105365,
        "Title": "Bauamt",
        "AddressLine1": "Wilhelmstraße 41",
        "Town": "Bad Wildbad",
        "StateOrProvince": "Verwaltungsgemeinschaft Bad Wildbad",
        "Postcode": "75323",
        "CountryID": 87,
        "Latitude": 48.75260472580821,
        "Longitude": 8.54993567486872,
        "AccessComments": "24/7 kostenlos nutzbare schwarze Mennekes Ladesäule vor dem Bauamt an der Straße.",
        "RelatedURL": "http://www.encw.de/",
        "DistanceUnit": 0
    },
    "Connections": [
        {
            "ID": 148103,
            "ConnectionTypeID": 25,
            "StatusTypeID": 50,
            "LevelID": 2,
            "Amps": 32,
            "Voltage": 400,
            "PowerKW": 22,
            "CurrentTypeID": 20,
            "Quantity": 2
        },
        {
            "ID": 148104,
            "ConnectionTypeID": 28,
            "StatusTypeID": 50,
            "LevelID": 2,
            "Amps": 16,
            "Voltage": 230,
            "PowerKW": 3.7,
            "CurrentTypeID": 10,
            "Quantity": 2
        }
    ],
    "NumberOfPoints": 4,
    "StatusTypeID": 50,
    "DateLastStatusUpdate": "2018-05-28T07:59:00Z",
    "DataQualityLevel": 1,
    "DateCreated": "2018-05-28T07:59:00Z",
    "SubmissionStatusTypeID": 200
}