{
    "IsRecentlyVerified": false,
    "ID": 31204,
    "UUID": "60443F46-73D3-4370-ABD3-C9444FD4F016",
    "DataProviderID": 1,
    "OperatorID": 45,
    "UsageTypeID": 1,
    "UsageCost": "0",
    "AddressInfo": {
        "ID": 31550,
        "Title": "Dokeos SPRL",
        "AddressLine1": "99 ruue du Perréon",
        "Town": "Louveigné (Sprimont)",
        "StateOrProvince": "Liege",
        "Postcode": "4141",
        "CountryID": 26,
        "Latitude": 50.530493,
        "Longitude": 5.7151748,
        "ContactTelephone1": "0478038560",
        "ContactTelephone2": "0497243165",
        "ContactEmail": "thomas@outlook.com",
        "AccessComments": "Trois maisons plus haut que le Delhaize Proxy dde Louveigné",
        "RelatedURL": "http://www.dokeos.com",
        "DistanceUnit": 0
    },
    "Connections": [
        {
            "ID": 34475,
            "ConnectionTypeID": 25,
            "StatusTypeID": 50,
            "LevelID": 2,
            "Amps": 16,
            "Voltage": 220,
            "PowerKW": 3.5,
            "CurrentTypeID": 10,
            "Quantity": 1
        }
    ],
    "NumberOfPoints": 1,
    "GeneralComments": "Prise pour Renault ZE. Menekes II. Charge dite rapide. Charge une batterie de 22KwH en 6heures. ",
    "StatusTypeID": 50,
    "DateLastStatusUpdate": "2014-12-15T11:06:00Z",
    "DataQualityLevel": 1,
    "DateCreated": "2014-12-14T21:26:00Z",
    "SubmissionStatusTypeID": 200
}