{
    "IsRecentlyVerified": false,
    "ID": 71778,
    "UUID": "C16FDF61-E70E-45A9-B170-F846C055884F",
    "DataProviderID": 1,
    "OperatorID": 105,
    "UsageTypeID": 4,
    "AddressInfo": {
        "ID": 72124,
        "Title": "RWE Ladesäule",
        "AddressLine1": "Adolf-Kolping-Straße 173",
        "Town": "Neustadt an der Weinstraße",
        "StateOrProvince": "Neustadt an der Weinstraße",
        "Postcode": "67433",
        "CountryID": 87,
        "Latitude": 49.3393039,
        "Longitude": 8.161739099999977,
        "ContactTelephone1": "+49 6321 402-271",
        "RelatedURL": "http://www.swneustadt.de/",
        "DistanceUnit": 0
    },
    "Connections": [
        {
            "ID": 102810,
            "ConnectionTypeID": 25,
            "StatusTypeID": 50,
            "LevelID": 2,
            "Amps": 32,
            "Voltage": 400,
            "PowerKW": 22,
            "CurrentTypeID": 20,
            "Quantity": 2
        }
    ],
    "NumberOfPoints": 2,
    "StatusTypeID": 50,
    "DateLastStatusUpdate": "2016-09-08T05:17:00Z",
    "DataQualityLevel": 1,
    "DateCreated": "2016-09-08T05:17:00Z",
    "SubmissionStatusTypeID": 200
}