{
    "UserComments": [
        {
            "ID": 23506,
            "ChargePointID": 169945,
            "CommentTypeID": 10,
            "UserName": "ForumElettrico.it",
            "Comment": "Ottima come backup alla colonnina di Piazza dei Tribunali in quanto distante solo 160 metri. Leggi la recensione completa qui > https://www.forumelettrico.it/forum/colonnina-hera-22-kw-bologna-bo-via-alfonso-rubbiani-3-t13960.html",
            "RelatedURL": "https://www.forumelettrico.it/forum/colonnina-hera-22-kw-bologna-bo-via-alfonso-rubbiani-3-t13960.html",
            "DateCreated": "2020-11-14T15:06:50.36Z",
            "User": {
                "ID": 11749,
                "Username": "ForumElettrico.it"
            },
            "CheckinStatusTypeID": 10,
            "IsActionedByEditor": false
        }
    ],
    "MediaItems": [
        {
            "ID": 25447,
            "ChargePointID": 169945,
            "ItemURL": "https://s3-ap-southeast-2.amazonaws.com/openchargemap/images/IT/OCM169945/OCM-169945.orig.2020111415065961.jpg",
            "ItemThumbnailURL": "https://s3-ap-southeast-2.amazonaws.com/openchargemap/images/IT/OCM169945/OCM-169945.thmb.2020111415065961.jpg",
            "Comment": "",
            "IsEnabled": true,
            "IsVideo": false,
            "IsFeaturedItem": false,
            "IsExternalResource": false,
            "User": {
                "ID": 11749,
                "Username": "ForumElettrico.it"
            },
            "DateCreated": "2020-11-14T15:07:00Z"
        },
        {
            "ID": 25448,
            "ChargePointID": 169945,
            "ItemURL": "https://s3-ap-southeast-2.amazonaws.com/openchargemap/images/IT/OCM169945/OCM-169945.orig.2020111415070561.jpg",
            "ItemThumbnailURL": "https://s3-ap-southeast-2.amazonaws.com/openchargemap/images/IT/OCM169945/OCM-169945.thmb.2020111415070561.jpg",
            "Comment": "",
            "IsEnabled": true,
            "IsVideo": false,
            "IsFeaturedItem": false,
            "IsExternalResource": false,
            "User": {
                "ID": 11749,
                "Username": "ForumElettrico.it"
            },
            "DateCreated": "2020-11-14T15:07:00Z"
        },
        {
            "ID": 25449,
            "ChargePointID": 169945,
            "ItemURL": "https://s3-ap-southeast-2.amazonaws.com/openchargemap/images/IT/OCM169945/OCM-169945.orig.2020111415071096.jpg",
            "ItemThumbnailURL": "https://s3-ap-southeast-2.amazonaws.com/openchargemap/images/IT/OCM169945/OCM-169945.thmb.2020111415071096.jpg",
            "Comment": "",
            "IsEnabled": true,
            "IsVideo": false,
            "IsFeaturedItem": false,
            "IsExternalResource": false,
            "User": {
                "ID": 11749,
                "Username": "ForumElettrico.it"
            },
            "DateCreated": "2020-11-14T15:07:00Z"
        },
        {
            "ID": 25450,
            "ChargePointID": 169945,
            "ItemURL": "https://s3-ap-southeast-2.amazonaws.com/openchargemap/images/IT/OCM169945/OCM-169945.orig.2020111415071788.jpg",
            "ItemThumbnailURL": "https://s3-ap-southeast-2.amazonaws.com/openchargemap/images/IT/OCM169945/OCM-169945.thmb.2020111415071788.jpg",
            "Comment": "",
            "IsEnabled": true,
            "IsVideo": false,
            "IsFeaturedItem": false,
            "IsExternalResource": false,
            "User": {
                "ID": 11749,
                "Username": "ForumElettrico.it"
            },
            "DateCreated": "2020-11-14T15:07:00Z"
        },
        {
            "ID": 25451,
            "ChargePointID": 169945,
            "ItemURL": "https://s3-ap-southeast-2.amazonaws.com/openchargemap/images/IT/OCM169945/OCM-169945.orig.2020111415072433.jpg",
            "ItemThumbnailURL": "https://s3-ap-southeast-2.amazonaws.com/openchargemap/images/IT/OCM169945/OCM-169945.thmb.2020111415072433.jpg",
            "Comment": "",
            "IsEnabled": true,
            "IsVideo": false,
            "IsFeaturedItem": false,
            "IsExternalResource": false,
            "User": {
                "ID": 11749,
                "Username": "ForumElettrico.it"
            },
            "DateCreated": "2020-11-14T15:07:00Z"
        }
    ],
    "IsRecentlyVerified": false,
    "ID": 169945,
    "UUID": "3C92412A-949E-4C96-B45B-AED275D53C22",
    "DataProviderID": 1,
    "OperatorID": 1,
    "UsageTypeID": 1,
    "AddressInfo": {
        "ID": 170304,
        "Title": "Hera Rubbiani ",
        "AddressLine1": "Via Alfonso Rubbiani 3",
        "Town": "Bologna",
        "StateOrProvince": "BO",
        "CountryID": 112,
        "Latitude": 44.487418,
        "Longitude": 11.344954,
        "RelatedURL": "https://www.forumelettrico.it/forum/colonnina-hera-22-kw-bologna-bo-via-alfonso-rubbiani-3-t13960.html",
        "DistanceUnit": 0
    },
    "Connections": [
        {
            "ID": 258980,
            "ConnectionTypeID": 25,
            "LevelID": 2,
            "PowerKW": 22,
            "Quantity": 2
        }
    ],
    "NumberOfPoints": 1,
    "StatusTypeID": 50,
    "DateLastStatusUpdate": "2020-11-14T15:07:00Z",
    "DataQualityLevel": 1,
    "DateCreated": "2020-11-14T15:07:00Z",
    "SubmissionStatusTypeID": 200
}