{
    "MediaItems": [
        {
            "ID": 8378,
            "ChargePointID": 72046,
            "ItemURL": "https://s3-ap-southeast-2.amazonaws.com/openchargemap/images/DK/OCM72046/OCM-72046.orig.2016100219225218.jpg",
            "ItemThumbnailURL": "https://s3-ap-southeast-2.amazonaws.com/openchargemap/images/DK/OCM72046/OCM-72046.thmb.2016100219225218.jpg",
            "Comment": "",
            "IsEnabled": true,
            "IsVideo": false,
            "IsFeaturedItem": false,
            "IsExternalResource": false,
            "User": {
                "ID": 11862,
                "Username": "PeFu"
            },
            "DateCreated": "2016-10-02T19:23:00Z"
        },
        {
            "ID": 8375,
            "ChargePointID": 72046,
            "ItemURL": "https://s3-ap-southeast-2.amazonaws.com/openchargemap/images/DK/OCM72046/OCM-72046.orig.2016100217453068.jpg",
            "ItemThumbnailURL": "https://s3-ap-southeast-2.amazonaws.com/openchargemap/images/DK/OCM72046/OCM-72046.thmb.2016100217453068.jpg",
            "Comment": "",
            "IsEnabled": true,
            "IsVideo": false,
            "IsFeaturedItem": false,
            "IsExternalResource": false,
            "User": {
                "ID": 11862,
                "Username": "PeFu"
            },
            "DateCreated": "2016-10-02T17:46:00Z"
        },
        {
            "ID": 8374,
            "ChargePointID": 72046,
            "ItemURL": "https://s3-ap-southeast-2.amazonaws.com/openchargemap/images/DK/OCM72046/OCM-72046.orig.2016100217434505.jpg",
            "ItemThumbnailURL": "https://s3-ap-southeast-2.amazonaws.com/openchargemap/images/DK/OCM72046/OCM-72046.thmb.2016100217434505.jpg",
            "Comment": "",
            "IsEnabled": true,
            "IsVideo": false,
            "IsFeaturedItem": false,
            "IsExternalResource": false,
            "User": {
                "ID": 11862,
                "Username": "PeFu"
            },
            "DateCreated": "2016-10-02T17:44:00Z"
        }
    ],
    "IsRecentlyVerified": false,
    "ID": 72046,
    "UUID": "680BD58B-E485-4E62-835D-9058E6A15E26",
    "DataProviderID": 1,
    "OperatorID": 3251,
    "UsageTypeID": 4,
    "UsageCost": "E.ON",
    "AddressInfo": {
        "ID": 72392,
        "Title": "E.ON @ Mimersgade 7A",
        "AddressLine1": "Mimersgade 7A",
        "Town": "Horsens",
        "Postcode": "8700",
        "CountryID": 65,
        "Latitude": 55.8556903,
        "Longitude": 9.8336176,
        "AccessComments": "E.ON Denmark",
        "RelatedURL": "https://www.eon.dk/",
        "DistanceUnit": 0
    },
    "Connections": [
        {
            "ID": 103312,
            "ConnectionTypeID": 25,
            "StatusTypeID": 50,
            "LevelID": 2,
            "PowerKW": 11,
            "CurrentTypeID": 20
        },
        {
            "ID": 103313,
            "ConnectionTypeID": 25,
            "StatusTypeID": 50,
            "LevelID": 2,
            "PowerKW": 11,
            "CurrentTypeID": 20,
            "Quantity": 0
        }
    ],
    "NumberOfPoints": 2,
    "GeneralComments": "E.ON Denmark",
    "StatusTypeID": 50,
    "DateLastStatusUpdate": "2016-10-02T19:23:00Z",
    "DataQualityLevel": 1,
    "DateCreated": "2016-10-02T17:39:00Z",
    "SubmissionStatusTypeID": 200
}