{
    "IsRecentlyVerified": false,
    "ID": 185773,
    "UUID": "00B74D5B-E37D-4BE5-A0BB-D896726E337F",
    "DataProviderID": 29,
    "DataProvidersReference": "21457",
    "OperatorID": 2241,
    "AddressInfo": {
        "ID": 186132,
        "Title": "Bahnhofstraße 1",
        "AddressLine1": "Bahnhofstraße 1",
        "Town": "Östringen - Odenheim",
        "Postcode": "76684",
        "CountryID": 87,
        "Latitude": 49.104615,
        "Longitude": 8.444182,
        "DistanceUnit": 0
    },
    "Connections": [
        {
            "ID": 296598,
            "ConnectionTypeID": 25,
            "StatusTypeID": 50,
            "LevelID": 2,
            "PowerKW": 22,
            "CurrentTypeID": 20
        },
        {
            "ID": 296599,
            "ConnectionTypeID": 25,
            "StatusTypeID": 50,
            "LevelID": 2,
            "PowerKW": 22,
            "CurrentTypeID": 20
        }
    ],
    "StatusTypeID": 50,
    "DateLastStatusUpdate": "2021-07-12T02:42:00Z",
    "MetadataValues": [
        {
            "ID": 18017,
            "MetadataFieldID": 4,
            "ItemValue": "Data from the German chargepoint registry provided by Bundesnetzagentur.de under the CC-BY 4.0 license"
        }
    ],
    "DataQualityLevel": 3,
    "DateCreated": "2021-07-12T02:42:00Z",
    "SubmissionStatusTypeID": 100
}