{
    "IsRecentlyVerified": false,
    "ID": 72350,
    "UUID": "20BE62A5-955D-4D24-A286-DA06B98D2043",
    "DataProviderID": 1,
    "OperatorID": 20,
    "OperatorsReference": "60062,60063",
    "UsageTypeID": 4,
    "UsageCost": "Free",
    "AddressInfo": {
        "ID": 72696,
        "Title": "George Street",
        "AddressLine1": "George Street",
        "Town": "Oldham",
        "Postcode": "OL1 1LS",
        "CountryID": 1,
        "Latitude": 53.5404344555439,
        "Longitude": -2.11609516560669,
        "DistanceUnit": 0
    },
    "Connections": [
        {
            "ID": 103662,
            "ConnectionTypeID": 25,
            "StatusTypeID": 50,
            "LevelID": 2,
            "Amps": 32,
            "Voltage": 230,
            "PowerKW": 7,
            "CurrentTypeID": 10,
            "Quantity": 2
        }
    ],
    "NumberOfPoints": 2,
    "StatusTypeID": 50,
    "DateLastStatusUpdate": "2017-05-02T12:58:00Z",
    "DataQualityLevel": 1,
    "DateCreated": "2016-10-09T14:35:00Z",
    "SubmissionStatusTypeID": 200
}