{
    "IsRecentlyVerified": false,
    "ID": 90593,
    "UUID": "5F30B6C1-4D2B-4424-87FB-D8DC3C6821EA",
    "DataProviderID": 1,
    "OperatorID": 1,
    "UsageTypeID": 1,
    "AddressInfo": {
        "ID": 90939,
        "Title": "Elektro črpalka",
        "AddressLine1": "Trg Edvarda Kardelja 1",
        "Town": "Nova Gorica",
        "Postcode": "5000",
        "CountryID": 205,
        "Latitude": 45.9568705969606,
        "Longitude": 13.6480893593163,
        "DistanceUnit": 0
    },
    "Connections": [
        {
            "ID": 128284,
            "ConnectionTypeID": 28,
            "StatusTypeID": 50,
            "LevelID": 1,
            "Amps": 10,
            "PowerKW": 2.2,
            "CurrentTypeID": 10,
            "Quantity": 1
        }
    ],
    "NumberOfPoints": 1,
    "StatusTypeID": 50,
    "DateLastStatusUpdate": "2017-07-20T12:58:00Z",
    "DataQualityLevel": 1,
    "DateCreated": "2017-07-19T10:46:00Z",
    "SubmissionStatusTypeID": 200
}