{
    "IsRecentlyVerified": false,
    "ID": 73735,
    "UUID": "D7C359CE-987D-45AD-BBFD-7DB4212A7475",
    "DataProviderID": 1,
    "OperatorID": 89,
    "OperatorsReference": "CEA-10656",
    "UsageTypeID": 4,
    "UsageCost": "CAD 1.00/hour",
    "AddressInfo": {
        "ID": 74081,
        "Title": "St-Jean-sur-Richelieu-Centre Fernand-Charest",
        "AddressLine1": "190 rue Laurier",
        "Town": "Saint-Jean-sur-Richelieu",
        "StateOrProvince": "QC",
        "Postcode": "J3B 2K3",
        "CountryID": 44,
        "Latitude": 45.3059501873296,
        "Longitude": -73.2570946355819,
        "DistanceUnit": 0
    },
    "Connections": [
        {
            "ID": 106036,
            "ConnectionTypeID": 1,
            "StatusTypeID": 50,
            "LevelID": 2,
            "Amps": 32,
            "Voltage": 230,
            "PowerKW": 7,
            "CurrentTypeID": 10,
            "Quantity": 1
        }
    ],
    "NumberOfPoints": 1,
    "StatusTypeID": 50,
    "DateLastStatusUpdate": "2018-03-28T05:40:00Z",
    "DataQualityLevel": 1,
    "DateCreated": "2016-11-23T22:53:00Z",
    "SubmissionStatusTypeID": 200
}