{
    "UserComments": [
        {
            "ID": 1127,
            "ChargePointID": 10481,
            "CommentTypeID": 50,
            "UserName": "Zster69",
            "Comment": "Free to charge with chargepoint card.",
            "DateCreated": "2014-08-20T16:53:08.22Z",
            "User": {
                "ID": 2253,
                "Username": "Zster69"
            },
            "CheckinStatusTypeID": 10
        }
    ],
    "IsRecentlyVerified": false,
    "ID": 10481,
    "UUID": "B70ACC4F-FBC3-4458-B1A4-F9A94BB646B7",
    "DataProviderID": 15,
    "DataProvidersReference": "18133",
    "OperatorID": 5,
    "AddressInfo": {
        "ID": 10378,
        "Title": "3525 NW 25th St",
        "AddressLine1": "3525 NW 25th St",
        "Town": "Miami",
        "StateOrProvince": "Florida",
        "Postcode": "33142",
        "CountryID": 2,
        "Latitude": 25.79962349,
        "Longitude": -80.2542572,
        "ContactTelephone1": "(305) 636-1600",
        "RelatedURL": "http://carstations.com/18133",
        "DistanceUnit": 0
    },
    "Connections": [
        {
            "ID": 8416,
            "ConnectionTypeID": 1,
            "Reference": "J1772",
            "LevelID": 2
        },
        {
            "ID": 8459,
            "ConnectionTypeID": 9,
            "Reference": "NEMA5",
            "LevelID": 1,
            "Quantity": 1
        }
    ],
    "StatusTypeID": 0,
    "DateLastStatusUpdate": "2017-11-04T14:03:00Z",
    "DataQualityLevel": 2,
    "DateCreated": "2012-05-25T14:21:00Z",
    "SubmissionStatusTypeID": 100
}