{
    "IsRecentlyVerified": false,
    "ID": 185604,
    "UUID": "97456351-2FE0-42D1-8679-1340EA496706",
    "DataProviderID": 29,
    "DataProvidersReference": "14804",
    "AddressInfo": {
        "ID": 185963,
        "Title": "Bahnhofstraße 2",
        "AddressLine1": "Bahnhofstraße 2",
        "Town": "St. Georgen",
        "Postcode": "78112",
        "CountryID": 87,
        "Latitude": 48.124883,
        "Longitude": 8.341316,
        "DistanceUnit": 0
    },
    "Connections": [
        {
            "ID": 295540,
            "ConnectionTypeID": 33,
            "StatusTypeID": 50,
            "LevelID": 3,
            "PowerKW": 150,
            "CurrentTypeID": 30
        },
        {
            "ID": 295541,
            "ConnectionTypeID": 33,
            "StatusTypeID": 50,
            "LevelID": 3,
            "PowerKW": 150,
            "CurrentTypeID": 30
        },
        {
            "ID": 295542,
            "ConnectionTypeID": 1036,
            "StatusTypeID": 50,
            "LevelID": 3,
            "PowerKW": 44,
            "CurrentTypeID": 20
        }
    ],
    "StatusTypeID": 50,
    "DateLastStatusUpdate": "2021-07-12T02:40:00Z",
    "MetadataValues": [
        {
            "ID": 17848,
            "MetadataFieldID": 4,
            "ItemValue": "Data from the German chargepoint registry provided by Bundesnetzagentur.de under the CC-BY 4.0 license"
        }
    ],
    "DataQualityLevel": 3,
    "DateCreated": "2021-07-12T02:40:00Z",
    "SubmissionStatusTypeID": 100
}