{
    "IsRecentlyVerified": false,
    "ID": 159244,
    "UUID": "180E4E0B-2A24-47AE-9D29-ACB3C8D6C076",
    "DataProviderID": 2,
    "DataProvidersReference": "153658",
    "OperatorID": 59,
    "UsageTypeID": 1,
    "AddressInfo": {
        "ID": 159601,
        "Title": "Greenlots - 112655U",
        "AddressLine1": "125 Bahia Way",
        "Town": "San Rafael",
        "StateOrProvince": "CA",
        "Postcode": "94901",
        "CountryID": 2,
        "Latitude": 37.965895,
        "Longitude": -122.49773,
        "ContactTelephone1": "855-900-7584",
        "AccessComments": "24 hours daily",
        "RelatedURL": "http://greenlots.com/",
        "DistanceUnit": 0
    },
    "Connections": [
        {
            "ID": 229376,
            "ConnectionTypeID": 1,
            "LevelID": 2,
            "Amps": 16,
            "Voltage": 230,
            "PowerKW": 3.7,
            "CurrentTypeID": 10,
            "Quantity": 15
        }
    ],
    "StatusTypeID": 50,
    "DateLastStatusUpdate": "2020-06-26T02:59:00Z",
    "DataQualityLevel": 3,
    "DateCreated": "2020-06-26T02:59:00Z",
    "SubmissionStatusTypeID": 100
}