{
    "IsRecentlyVerified": false,
    "ID": 179958,
    "UUID": "AFA04D4D-E057-4938-86EA-F24C0ABC0908",
    "DataProviderID": 29,
    "DataProvidersReference": "1050",
    "OperatorID": 188,
    "AddressInfo": {
        "ID": 180317,
        "Title": "Auf dem Damm 1",
        "AddressLine1": "Auf dem Damm 1",
        "Town": "Büdingen",
        "Postcode": "63654",
        "CountryID": 87,
        "Latitude": 50.292453,
        "Longitude": 9.116268,
        "DistanceUnit": 0
    },
    "Connections": [
        {
            "ID": 282471,
            "ConnectionTypeID": 28,
            "StatusTypeID": 50,
            "LevelID": 2,
            "PowerKW": 22,
            "CurrentTypeID": 20
        },
        {
            "ID": 282472,
            "ConnectionTypeID": 25,
            "StatusTypeID": 50,
            "LevelID": 2,
            "PowerKW": 22,
            "CurrentTypeID": 20
        },
        {
            "ID": 297682,
            "ConnectionTypeID": 28,
            "StatusTypeID": 50,
            "LevelID": 2,
            "PowerKW": 22,
            "CurrentTypeID": 20
        },
        {
            "ID": 297683,
            "ConnectionTypeID": 25,
            "StatusTypeID": 50,
            "LevelID": 2,
            "PowerKW": 22,
            "CurrentTypeID": 20
        }
    ],
    "StatusTypeID": 50,
    "DateLastStatusUpdate": "2021-07-12T02:44:00Z",
    "MetadataValues": [
        {
            "ID": 12252,
            "MetadataFieldID": 4,
            "ItemValue": "Data from the German chargepoint registry provided by Bundesnetzagentur.de under the CC-BY 4.0 license"
        }
    ],
    "DataQualityLevel": 3,
    "DateCreated": "2021-07-08T10:00:00Z",
    "SubmissionStatusTypeID": 100
}