{
    "IsRecentlyVerified": false,
    "ID": 81802,
    "UUID": "EF396998-D7E7-402A-B44C-F02798920979",
    "DataProviderID": 1,
    "OperatorID": 23,
    "OperatorsReference": "20904",
    "UsageTypeID": 6,
    "AddressInfo": {
        "ID": 82148,
        "Title": "Pga Sweden National",
        "AddressLine1": "Klubbhuset 230 40 Bara",
        "Town": "Bara",
        "Postcode": "230 40",
        "CountryID": 216,
        "Latitude": 55.568417,
        "Longitude": 13.187731,
        "ContactTelephone1": "+46 406 35 51 00",
        "DistanceUnit": 0
    },
    "Connections": [
        {
            "ID": 116560,
            "ConnectionTypeID": 30,
            "StatusTypeID": 50,
            "LevelID": 2,
            "Amps": 16,
            "Voltage": 400,
            "PowerKW": 11,
            "CurrentTypeID": 20,
            "Quantity": 2
        }
    ],
    "NumberOfPoints": 2,
    "GeneralComments": "2 Tesla Connectors, up to 11kW.Available for patrons only. Self park.",
    "StatusTypeID": 50,
    "DateLastStatusUpdate": "2018-10-03T19:06:00Z",
    "DataQualityLevel": 1,
    "DateCreated": "2017-02-03T12:21:00Z",
    "SubmissionStatusTypeID": 200
}