{
    "IsRecentlyVerified": false,
    "ID": 107488,
    "UUID": "929C6AA8-212A-4A47-B227-D643B022BF17",
    "DataProviderID": 1,
    "OperatorID": 3319,
    "UsageTypeID": 1,
    "UsageCost": "80 Ft/perc",
    "AddressInfo": {
        "ID": 107834,
        "Title": "Kiskunhalas, Bethlen Gábor tér",
        "AddressLine1": "Bethlen Gábor tér ",
        "Town": "Kiskunhalas",
        "StateOrProvince": "Bács-Kiskun megye",
        "Postcode": "6400",
        "CountryID": 104,
        "Latitude": 46.4304179025757,
        "Longitude": 19.4820977109647,
        "ContactTelephone1": "+36 80 21-00-12",
        "ContactEmail": "kommunikacio@e-mobi.hu",
        "RelatedURL": "https://e-mobi.hu",
        "DistanceUnit": 0
    },
    "Connections": [
        {
            "ID": 151647,
            "ConnectionTypeID": 32,
            "StatusTypeID": 50,
            "LevelID": 3,
            "Amps": 120,
            "Voltage": 400,
            "PowerKW": 50,
            "CurrentTypeID": 30,
            "Quantity": 1
        },
        {
            "ID": 185799,
            "ConnectionTypeID": 2,
            "StatusTypeID": 50,
            "LevelID": 3,
            "PowerKW": 50,
            "CurrentTypeID": 30,
            "Quantity": 1
        }
    ],
    "NumberOfPoints": 1,
    "GeneralComments": "",
    "StatusTypeID": 50,
    "DateLastStatusUpdate": "2020-05-09T09:10:00Z",
    "DataQualityLevel": 1,
    "DateCreated": "2018-07-29T23:31:00Z",
    "SubmissionStatusTypeID": 200
}