{
    "IsRecentlyVerified": false,
    "ID": 157253,
    "UUID": "8E92160F-1481-410A-A18D-645F052A9800",
    "DataProviderID": 19,
    "DataProvidersReference": "5496",
    "AddressInfo": {
        "ID": 157607,
        "Title": "Snickargatan 26",
        "AddressLine1": "Snickargatan 26",
        "Town": "PITEÅ",
        "StateOrProvince": "NORRBOTTEN",
        "Postcode": "94163",
        "CountryID": 216,
        "Latitude": 65.32913,
        "Longitude": 21.46153,
        "AccessComments": "Besöksparkeringen Universitetsområdet",
        "DistanceUnit": 0
    },
    "Connections": [
        {
            "ID": 226287,
            "ConnectionTypeID": 25,
            "Reference": "1",
            "LevelID": 3,
            "Amps": 32,
            "Voltage": 400,
            "PowerKW": 22,
            "CurrentTypeID": 30
        },
        {
            "ID": 226288,
            "ConnectionTypeID": 25,
            "Reference": "2",
            "LevelID": 3,
            "Amps": 32,
            "Voltage": 400,
            "PowerKW": 22,
            "CurrentTypeID": 30
        },
        {
            "ID": 226289,
            "ConnectionTypeID": 25,
            "Reference": "3",
            "LevelID": 2,
            "Amps": 16,
            "Voltage": 230,
            "PowerKW": 3.7,
            "CurrentTypeID": 10
        }
    ],
    "NumberOfPoints": 3,
    "StatusTypeID": 0,
    "DateLastStatusUpdate": "2021-03-24T05:12:00Z",
    "DataQualityLevel": 2,
    "DateCreated": "2020-05-26T08:25:00Z",
    "SubmissionStatusTypeID": 100
}