{
    "IsRecentlyVerified": false,
    "ID": 132760,
    "UUID": "CA52E3FA-965B-4A73-A81D-8E88151C4A3D",
    "DataProviderID": 1,
    "OperatorID": 25,
    "OperatorsReference": "camden-hampsteadgrove",
    "UsageTypeID": 4,
    "UsageCost": "£0.073/minute; min £1.38; other tariffs available",
    "AddressInfo": {
        "ID": 133106,
        "Title": "Hampstead Grove",
        "AddressLine1": "Hampstead Grove Junction Upper Terrace",
        "Town": "London",
        "Postcode": "NW3 6SR",
        "CountryID": 1,
        "Latitude": 51.560314,
        "Longitude": -0.179407,
        "DistanceUnit": 0
    },
    "Connections": [
        {
            "ID": 185877,
            "ConnectionTypeID": 25,
            "StatusTypeID": 50,
            "LevelID": 2,
            "Amps": 32,
            "Voltage": 230,
            "PowerKW": 7,
            "CurrentTypeID": 10,
            "Quantity": 1
        },
        {
            "ID": 185878,
            "ConnectionTypeID": 1,
            "StatusTypeID": 50,
            "LevelID": 2,
            "Voltage": 230,
            "PowerKW": 4,
            "CurrentTypeID": 10,
            "Quantity": 1
        }
    ],
    "NumberOfPoints": 1,
    "StatusTypeID": 50,
    "DateLastStatusUpdate": "2019-10-07T08:05:00Z",
    "DataQualityLevel": 1,
    "DateCreated": "2019-10-07T08:05:00Z",
    "SubmissionStatusTypeID": 200
}