{
    "IsRecentlyVerified": false,
    "ID": 175364,
    "UUID": "4B418FCC-4634-46FF-A28E-3DAED591D49C",
    "DataProviderID": 1,
    "OperatorID": 115,
    "UsageTypeID": 1,
    "AddressInfo": {
        "ID": 175723,
        "Title": "ČEZ Benzina, Nové Strašecí",
        "AddressLine1": "Karlovarská ",
        "AddressLine2": "Nové Strašecí",
        "CountryID": 64,
        "Latitude": 50.158418860220735,
        "Longitude": 13.896243243122626,
        "DistanceUnit": 0
    },
    "Connections": [
        {
            "ID": 272034,
            "ConnectionTypeID": 2,
            "StatusTypeID": 50,
            "LevelID": 3,
            "PowerKW": 50,
            "CurrentTypeID": 30,
            "Quantity": 1
        },
        {
            "ID": 272035,
            "ConnectionTypeID": 33,
            "StatusTypeID": 50,
            "LevelID": 3,
            "Amps": 1,
            "PowerKW": 50,
            "CurrentTypeID": 30
        },
        {
            "ID": 272036,
            "ConnectionTypeID": 25,
            "StatusTypeID": 50,
            "LevelID": 2,
            "Amps": 32,
            "Voltage": 400,
            "PowerKW": 22,
            "CurrentTypeID": 20,
            "Quantity": 1
        }
    ],
    "NumberOfPoints": 1,
    "StatusTypeID": 50,
    "DateLastStatusUpdate": "2021-05-15T07:48:00Z",
    "DataQualityLevel": 1,
    "DateCreated": "2021-05-14T08:14:00Z",
    "SubmissionStatusTypeID": 200
}