{
    "IsRecentlyVerified": false,
    "ID": 104102,
    "UUID": "06DAEA10-D678-46B5-B384-9E81AB577721",
    "DataProviderID": 1,
    "OperatorID": 80,
    "UsageTypeID": 4,
    "UsageCost": "",
    "AddressInfo": {
        "ID": 104448,
        "Title": "Eneldrive Fast EVA+ Eboli",
        "AddressLine1": "Via San Vito Martire",
        "AddressLine2": "",
        "Town": "Eboli",
        "StateOrProvince": "SA",
        "Postcode": "84025",
        "CountryID": 112,
        "Latitude": 40.6042455934253,
        "Longitude": 15.0483800890244,
        "ContactTelephone1": "",
        "ContactTelephone2": "",
        "ContactEmail": "",
        "AccessComments": "",
        "RelatedURL": "",
        "DistanceUnit": 0
    },
    "Connections": [
        {
            "ID": 147003,
            "ConnectionTypeID": 33,
            "StatusTypeID": 0,
            "LevelID": 1,
            "Amps": 500,
            "Voltage": 120,
            "PowerKW": 50,
            "CurrentTypeID": 30
        },
        {
            "ID": 147004,
            "ConnectionTypeID": 2,
            "StatusTypeID": 0,
            "LevelID": 1,
            "Amps": 500,
            "Voltage": 120,
            "PowerKW": 50,
            "CurrentTypeID": 30
        },
        {
            "ID": 147005,
            "ConnectionTypeID": 1036,
            "StatusTypeID": 0,
            "LevelID": 1,
            "Amps": 400,
            "Voltage": 64,
            "PowerKW": 43,
            "CurrentTypeID": 20
        }
    ],
    "NumberOfPoints": 2,
    "GeneralComments": "",
    "StatusTypeID": 150,
    "DateLastStatusUpdate": "2018-09-10T09:34:00Z",
    "DataQualityLevel": 1,
    "DateCreated": "2018-05-15T17:48:00Z",
    "SubmissionStatusTypeID": 200
}