{
    "IsRecentlyVerified": false,
    "ID": 61352,
    "UUID": "A776BEE3-27E6-48E5-B2A3-DE4156D6227E",
    "DataProviderID": 1,
    "OperatorID": 127,
    "UsageTypeID": 5,
    "AddressInfo": {
        "ID": 61698,
        "Title": "Parkhaus EWE",
        "AddressLine1": "Hegermühlenstraße 58",
        "Town": "Strausberg",
        "StateOrProvince": "Landkreis Märkisch-Oderland",
        "Postcode": "15344",
        "CountryID": 87,
        "Latitude": 52.57565,
        "Longitude": 13.882330000000024,
        "ContactTelephone1": "+49 800 3932000",
        "AccessComments": "RFID Ladekarte, beim Pförtner des Parkhauses erhältlich, zur Freischaltung notwendig. Möglich das auch EWE  / SWB Karten funktionieren. Stromkosten sind in Parkgebühren enthalten. Geöffnet von Mo-Do 6:45-21Uhr, Do 6:45-19Uhr, Sa 7:30-14:30. ",
        "RelatedURL": "http://www.ewe.de/",
        "DistanceUnit": 0
    },
    "Connections": [
        {
            "ID": 78138,
            "ConnectionTypeID": 25,
            "StatusTypeID": 50,
            "LevelID": 2,
            "Amps": 32,
            "Voltage": 400,
            "PowerKW": 22,
            "CurrentTypeID": 20,
            "Quantity": 1
        }
    ],
    "NumberOfPoints": 1,
    "StatusTypeID": 50,
    "DateLastStatusUpdate": "2016-02-25T06:32:00Z",
    "DataQualityLevel": 1,
    "DateCreated": "2016-02-25T06:32:00Z",
    "SubmissionStatusTypeID": 200
}