{
    "IsRecentlyVerified": false,
    "ID": 54428,
    "UUID": "777C7516-B024-4D39-B0C3-9AC36BBF97DE",
    "DataProviderID": 1,
    "OperatorID": 45,
    "UsageTypeID": 3,
    "AddressInfo": {
        "ID": 54774,
        "Title": "Elektro-Würkner",
        "AddressLine1": "Eislebener Straße 1a",
        "Town": "Farnstädt",
        "Postcode": "06279",
        "CountryID": 87,
        "Latitude": 51.422118868433,
        "Longitude": 11.5672952195739,
        "ContactTelephone1": "+49 34776 9191-0",
        "AccessComments": "2 kostenlose Parkplätze + Laden.",
        "RelatedURL": "http://www.elektro-wuerkner.de/",
        "DistanceUnit": 0
    },
    "Connections": [
        {
            "ID": 68623,
            "ConnectionTypeID": 25,
            "StatusTypeID": 50,
            "LevelID": 2,
            "Amps": 16,
            "Voltage": 400,
            "PowerKW": 11,
            "CurrentTypeID": 20,
            "Quantity": 2
        },
        {
            "ID": 68624,
            "ConnectionTypeID": 28,
            "StatusTypeID": 50,
            "LevelID": 2,
            "Amps": 16,
            "Voltage": 230,
            "PowerKW": 3.7,
            "CurrentTypeID": 10,
            "Quantity": 2
        }
    ],
    "NumberOfPoints": 2,
    "StatusTypeID": 50,
    "DateLastStatusUpdate": "2015-10-02T11:04:00Z",
    "DataQualityLevel": 1,
    "DateCreated": "2015-10-02T07:38:00Z",
    "SubmissionStatusTypeID": 200
}