{
    "IsRecentlyVerified": false,
    "ID": 186940,
    "UUID": "124FAE9C-FBB4-4B01-8D81-90B3744557B6",
    "DataProviderID": 29,
    "DataProvidersReference": "3537",
    "OperatorID": 103,
    "AddressInfo": {
        "ID": 187299,
        "Title": "Leuschnerdamm 1",
        "AddressLine1": "Leuschnerdamm 1",
        "Town": "Berlin",
        "Postcode": "10999",
        "CountryID": 87,
        "Latitude": 52.505621,
        "Longitude": 13.419379,
        "DistanceUnit": 0
    },
    "Connections": [
        {
            "ID": 300702,
            "ConnectionTypeID": 25,
            "StatusTypeID": 50,
            "LevelID": 2,
            "PowerKW": 11,
            "CurrentTypeID": 20
        },
        {
            "ID": 300703,
            "ConnectionTypeID": 25,
            "StatusTypeID": 50,
            "LevelID": 2,
            "PowerKW": 11,
            "CurrentTypeID": 20
        }
    ],
    "StatusTypeID": 50,
    "DateLastStatusUpdate": "2021-07-12T02:49:00Z",
    "MetadataValues": [
        {
            "ID": 19180,
            "MetadataFieldID": 4,
            "ItemValue": "Data from the German chargepoint registry provided by Bundesnetzagentur.de under the CC-BY 4.0 license"
        }
    ],
    "DataQualityLevel": 3,
    "DateCreated": "2021-07-12T02:49:00Z",
    "SubmissionStatusTypeID": 100
}