{
    "IsRecentlyVerified": false,
    "ID": 52992,
    "UUID": "96160B3C-494E-463B-83D5-B7A0B562C6DA",
    "DataProviderID": 1,
    "OperatorID": 1,
    "UsageTypeID": 6,
    "AddressInfo": {
        "ID": 53338,
        "Title": "RENAULT SARDA",
        "AddressLine1": "Avenue michel grandou",
        "AddressLine2": "Avenue Michel Grandou",
        "Town": "Trélissac",
        "StateOrProvince": "Périgueux",
        "Postcode": "24750",
        "CountryID": 80,
        "Latitude": 45.2013245079912,
        "Longitude": 0.800042923576698,
        "ContactTelephone1": " +33553024141",
        "RelatedURL": "http://www.renault.fr/concession/perigueux/informations-generales",
        "DistanceUnit": 0
    },
    "Connections": [],
    "NumberOfPoints": 1,
    "StatusTypeID": 50,
    "DateLastStatusUpdate": "2015-09-17T14:13:00Z",
    "DataQualityLevel": 1,
    "DateCreated": "2015-09-16T10:09:00Z",
    "SubmissionStatusTypeID": 200
}