{
    "IsRecentlyVerified": false,
    "ID": 92328,
    "UUID": "542BB0E6-3B6D-4806-9D83-D90EF9F7C63D",
    "DataProviderID": 1,
    "OperatorID": 23,
    "OperatorsReference": "33380",
    "UsageTypeID": 4,
    "AddressInfo": {
        "ID": 92674,
        "Title": "Brecon Retreat - Aberyscir",
        "AddressLine1": "Brecon Retreat",
        "Town": "Aberyscir",
        "Postcode": "LD3 9NP",
        "CountryID": 1,
        "Latitude": 51.965554,
        "Longitude": -3.452627,
        "ContactTelephone1": "+44 187 463 6263",
        "DistanceUnit": 0
    },
    "Connections": [
        {
            "ID": 130871,
            "ConnectionTypeID": 30,
            "StatusTypeID": 50,
            "LevelID": 2,
            "Amps": 32,
            "Voltage": 230,
            "PowerKW": 7,
            "CurrentTypeID": 10,
            "Quantity": 1
        }
    ],
    "NumberOfPoints": 1,
    "GeneralComments": "1 Tesla Connector, up to 7kW.Available for customers. Self park.",
    "StatusTypeID": 50,
    "DateLastStatusUpdate": "2018-12-13T11:49:00Z",
    "DataQualityLevel": 1,
    "DateCreated": "2017-09-01T05:45:00Z",
    "SubmissionStatusTypeID": 200
}