{
    "IsRecentlyVerified": false,
    "ID": 138070,
    "UUID": "CE7ED6CA-08D4-4536-A9BA-9E0497C5C3A7",
    "DataProviderID": 2,
    "DataProvidersReference": "96121",
    "OperatorID": 9,
    "UsageTypeID": 2,
    "AddressInfo": {
        "ID": 138419,
        "Title": "Hines - US Airways Flight Training Center",
        "AddressLine1": "1950 E Buckeye Rd.",
        "Town": "Phoenix",
        "StateOrProvince": "AZ",
        "Postcode": "85034",
        "CountryID": 2,
        "Latitude": 33.436935,
        "Longitude": -112.040864,
        "ContactTelephone1": "888-998-2546",
        "AccessComments": "MON: 24 hours | TUE: 24 hours | WED: 24 hours | THU: 24 hours | FRI: 24 hours | SAT: 24 hours | SUN: 24 hours",
        "RelatedURL": "http://www.blinkcharging.com/",
        "DistanceUnit": 0
    },
    "Connections": [
        {
            "ID": 193120,
            "ConnectionTypeID": 1,
            "LevelID": 2,
            "Amps": 16,
            "Voltage": 230,
            "PowerKW": 3,
            "CurrentTypeID": 10,
            "Quantity": 3
        }
    ],
    "StatusTypeID": 50,
    "DateLastStatusUpdate": "2019-12-24T09:06:00Z",
    "DataQualityLevel": 3,
    "DateCreated": "2019-12-24T09:06:00Z",
    "SubmissionStatusTypeID": 100
}