{
    "IsRecentlyVerified": false,
    "ID": 159973,
    "UUID": "E2F4F158-6C25-43F0-AE03-DE77575540BC",
    "DataProviderID": 2,
    "DataProvidersReference": "153011",
    "OperatorID": 5,
    "UsageTypeID": 1,
    "AddressInfo": {
        "ID": 160330,
        "Title": "WABAN LOT",
        "AddressLine1": "1 Waban St",
        "Town": "Wellesley",
        "StateOrProvince": "MA",
        "Postcode": "02482",
        "CountryID": 2,
        "Latitude": 42.2954786,
        "Longitude": -71.2955719,
        "ContactTelephone1": "888-758-4389",
        "AccessComments": "24 hours daily",
        "RelatedURL": "http://www.chargepoint.com/",
        "DistanceUnit": 0
    },
    "Connections": [
        {
            "ID": 230200,
            "ConnectionTypeID": 1,
            "LevelID": 2,
            "Amps": 16,
            "Voltage": 230,
            "PowerKW": 3.7,
            "CurrentTypeID": 10,
            "Quantity": 2
        }
    ],
    "StatusTypeID": 50,
    "DateLastStatusUpdate": "2020-06-26T03:05:00Z",
    "DataQualityLevel": 3,
    "DateCreated": "2020-06-26T03:05:00Z",
    "SubmissionStatusTypeID": 100
}