{
    "IsRecentlyVerified": false,
    "ID": 182060,
    "UUID": "149C5BF2-D37A-4CBF-A039-E9491572718F",
    "DataProviderID": 29,
    "DataProvidersReference": "835",
    "AddressInfo": {
        "ID": 182419,
        "Title": "Maurerstraße 10A",
        "AddressLine1": "Maurerstraße 10A",
        "Town": "Buchholz",
        "Postcode": "21244",
        "CountryID": 87,
        "Latitude": 53.354011,
        "Longitude": 9.864671,
        "DistanceUnit": 0
    },
    "Connections": [
        {
            "ID": 287335,
            "ConnectionTypeID": 25,
            "StatusTypeID": 50,
            "LevelID": 2,
            "PowerKW": 22,
            "CurrentTypeID": 20
        },
        {
            "ID": 287336,
            "ConnectionTypeID": 25,
            "StatusTypeID": 50,
            "LevelID": 2,
            "PowerKW": 22,
            "CurrentTypeID": 20
        }
    ],
    "StatusTypeID": 50,
    "DateLastStatusUpdate": "2021-07-12T02:51:00Z",
    "MetadataValues": [
        {
            "ID": 14354,
            "MetadataFieldID": 4,
            "ItemValue": "Data from the German chargepoint registry provided by Bundesnetzagentur.de under the CC-BY 4.0 license"
        }
    ],
    "DataQualityLevel": 3,
    "DateCreated": "2021-07-08T10:02:00Z",
    "SubmissionStatusTypeID": 100
}