{
    "IsRecentlyVerified": false,
    "ID": 101465,
    "UUID": "90143712-A46B-403D-AFD3-CD816D2C65F5",
    "DataProviderID": 1,
    "OperatorID": 3253,
    "OperatorsReference": "AT*SMA*EAT0201783*001AC,AT*SMA*EAT0201783*002AC",
    "UsageTypeID": 1,
    "UsageCost": "€0,04/min ; Andere Tarife möglich",
    "AddressInfo": {
        "ID": 101811,
        "Title": "Ladestation Billa",
        "AddressLine1": "Seebach 1",
        "Town": "Kühnsdorf",
        "StateOrProvince": "Kärnten",
        "Postcode": "9125",
        "CountryID": 19,
        "Latitude": 46.631098,
        "Longitude": 14.636901,
        "DistanceUnit": 0
    },
    "Connections": [
        {
            "ID": 143258,
            "ConnectionTypeID": 25,
            "StatusTypeID": 50,
            "LevelID": 2,
            "Amps": 32,
            "Voltage": 400,
            "PowerKW": 11,
            "CurrentTypeID": 20,
            "Quantity": 2
        }
    ],
    "NumberOfPoints": 2,
    "StatusTypeID": 50,
    "DateLastStatusUpdate": "2018-07-24T05:33:00Z",
    "DataQualityLevel": 1,
    "DateCreated": "2018-03-29T06:06:00Z",
    "SubmissionStatusTypeID": 200
}