{
    "IsRecentlyVerified": false,
    "ID": 72353,
    "UUID": "0D641827-32CA-46E4-B366-A56210FF976B",
    "DataProviderID": 1,
    "OperatorID": 69,
    "UsageTypeID": 4,
    "AddressInfo": {
        "ID": 72699,
        "Title": "Stadtwerke",
        "AddressLine1": "Saerbecker Straße 77-81",
        "Town": "Greven",
        "StateOrProvince": "Kreis Steinfurt",
        "Postcode": "48268",
        "CountryID": 87,
        "Latitude": 52.10396980741788,
        "Longitude": 7.611353145368969,
        "ContactTelephone1": "+49 2571 509-255",
        "AccessComments": "Im Verbund Ladenetz, also auch mit The New Motion, EWE, SUN, Vattenfall u.a. Ladekarten nutzbar.",
        "RelatedURL": "http://www.stadtwerke-greven.de/",
        "DistanceUnit": 0
    },
    "Connections": [
        {
            "ID": 103666,
            "ConnectionTypeID": 25,
            "StatusTypeID": 50,
            "LevelID": 2,
            "Amps": 16,
            "Voltage": 400,
            "PowerKW": 11,
            "CurrentTypeID": 20,
            "Quantity": 2
        }
    ],
    "NumberOfPoints": 2,
    "StatusTypeID": 50,
    "DateLastStatusUpdate": "2016-10-10T05:43:00Z",
    "DataQualityLevel": 1,
    "DateCreated": "2016-10-10T05:43:00Z",
    "SubmissionStatusTypeID": 200
}