{
    "IsRecentlyVerified": false,
    "ID": 124450,
    "UUID": "E4C09A37-8842-4DC4-BBB4-1A59FCD34190",
    "DataProviderID": 2,
    "DataProvidersReference": "33556",
    "UsageTypeID": 1,
    "AddressInfo": {
        "ID": 124796,
        "Title": "Davis Amtrak Station",
        "AddressLine1": "840 2nd St",
        "Town": "Davis",
        "StateOrProvince": "CA",
        "Postcode": "95616",
        "CountryID": 2,
        "Latitude": 38.5443,
        "Longitude": -121.738,
        "ContactTelephone1": "",
        "AccessComments": "24 hours daily",
        "RelatedURL": "",
        "DistanceUnit": 0
    },
    "Connections": [
        {
            "ID": 174551,
            "ConnectionTypeID": 1,
            "LevelID": 2,
            "Amps": 16,
            "Voltage": 230,
            "PowerKW": 3.7,
            "CurrentTypeID": 10,
            "Quantity": 2
        }
    ],
    "GeneralComments": "1 SP Inductive",
    "DateLastStatusUpdate": "2020-06-26T03:00:00Z",
    "DataQualityLevel": 3,
    "DateCreated": "2019-04-06T05:03:00Z",
    "SubmissionStatusTypeID": 100
}