{
    "IsRecentlyVerified": false,
    "ID": 7897,
    "UUID": "1BCC86E9-19D9-459A-B752-C9933AAC26B6",
    "DataProviderID": 1,
    "OperatorID": 1,
    "UsageTypeID": 2,
    "UsageCost": "Free",
    "AddressInfo": {
        "ID": 7794,
        "Title": "60 Chemin Mill",
        "AddressLine1": "60 Chemin Mill",
        "Town": "Wakefield",
        "Postcode": "J0X 3G0",
        "CountryID": 44,
        "Latitude": 45.63488,
        "Longitude": -75.93581,
        "ContactTelephone1": "8194591838",
        "RelatedURL": "http://carstations.com/11358",
        "DistanceUnit": 0
    },
    "Connections": [
        {
            "ID": 5326,
            "ConnectionTypeID": 1,
            "Reference": "J1772",
            "LevelID": 2
        }
    ],
    "NumberOfPoints": 1,
    "StatusTypeID": 0,
    "DateLastStatusUpdate": "2020-11-23T12:35:00Z",
    "DataQualityLevel": 1,
    "DateCreated": "2011-11-11T12:05:00Z",
    "SubmissionStatusTypeID": 100
}