{
    "IsRecentlyVerified": false,
    "ID": 38624,
    "UUID": "60E7E808-7E85-4090-BF09-84F211E2C9E7",
    "DataProviderID": 26,
    "DataProvidersReference": "34103",
    "OperatorID": 73,
    "OperatorsReference": "EV-Box EVB-P1243141",
    "UsageCost": "0.00 jaarabonnement",
    "AddressInfo": {
        "ID": 38970,
        "Title": "Hakstraat 11A",
        "AddressLine1": "Hakstraat 11A",
        "Town": "Noordoostpolder",
        "Postcode": "8308 AH",
        "CountryID": 159,
        "Latitude": 52.64236,
        "Longitude": 5.71656,
        "RelatedURL": "http://www.ev-box.nl",
        "DistanceUnit": 0
    },
    "Connections": [
        {
            "ID": 42135,
            "ConnectionTypeID": 25,
            "LevelID": 2,
            "PowerKW": 11,
            "CurrentTypeID": 10
        }
    ],
    "NumberOfPoints": 1,
    "StatusTypeID": 50,
    "DateLastStatusUpdate": "2016-06-04T02:55:00Z",
    "DataQualityLevel": 3,
    "DateCreated": "2015-01-09T06:08:00Z",
    "SubmissionStatusTypeID": 100
}