{
    "IsRecentlyVerified": false,
    "ID": 97382,
    "UUID": "F22366A1-1205-4D57-AE46-BDD6F3D05CAA",
    "DataProviderID": 1,
    "OperatorID": 23,
    "OperatorsReference": "38165",
    "UsageTypeID": 4,
    "AddressInfo": {
        "ID": 97728,
        "Title": "Qualys Hôtel d'Alsace",
        "AddressLine1": "187 Route de Lyon",
        "Town": "Illkirch",
        "Postcode": "67400",
        "CountryID": 80,
        "Latitude": 48.528267,
        "Longitude": 7.710783,
        "ContactTelephone1": "+33 3 90 40 35 00",
        "DistanceUnit": 0
    },
    "Connections": [
        {
            "ID": 138289,
            "ConnectionTypeID": 30,
            "StatusTypeID": 50,
            "LevelID": 2,
            "Amps": 32,
            "Voltage": 230,
            "PowerKW": 14,
            "CurrentTypeID": 20,
            "Quantity": 2
        }
    ],
    "NumberOfPoints": 2,
    "GeneralComments": "2 Tesla Connectors, up to 14kW.Available for customers. Please see front desk.",
    "StatusTypeID": 50,
    "DateLastStatusUpdate": "2018-10-03T20:33:00Z",
    "DataQualityLevel": 1,
    "DateCreated": "2018-01-21T15:17:00Z",
    "SubmissionStatusTypeID": 200
}