{
    "IsRecentlyVerified": false,
    "ID": 62631,
    "UUID": "6D2DCD18-126A-4D26-877B-ED0A50E76EF7",
    "DataProviderID": 26,
    "DataProvidersReference": "20144",
    "OperatorID": 162,
    "OperatorsReference": "松江市役所　",
    "UsageCost": "0.00 onbekend",
    "AddressInfo": {
        "ID": 62977,
        "Title": "国道431号",
        "AddressLine1": "国道431号",
        "Town": "仁多郡",
        "Postcode": "690-8540",
        "CountryID": 114,
        "Latitude": 35.46806,
        "Longitude": 133.04837,
        "DistanceUnit": 0
    },
    "Connections": [
        {
            "ID": 79553,
            "ConnectionTypeID": 2,
            "LevelID": 3,
            "PowerKW": 50,
            "CurrentTypeID": 30
        },
        {
            "ID": 95263,
            "ConnectionTypeID": 2,
            "LevelID": 3,
            "PowerKW": 50,
            "CurrentTypeID": 30
        }
    ],
    "NumberOfPoints": 1,
    "StatusTypeID": 50,
    "DateLastStatusUpdate": "2016-06-04T02:37:00Z",
    "DataQualityLevel": 3,
    "DateCreated": "2016-03-03T12:29:00Z",
    "SubmissionStatusTypeID": 100
}