{
    "IsRecentlyVerified": false,
    "ID": 84774,
    "UUID": "468C8C57-6356-4021-90D0-AF0BC3ADEA3C",
    "DataProviderID": 1,
    "OperatorID": 1,
    "UsageTypeID": 1,
    "UsageCost": "3,50€",
    "AddressInfo": {
        "ID": 85120,
        "Title": "Parkplatz Butenwall",
        "AddressLine1": "Butenwall 10",
        "Town": "Borken",
        "StateOrProvince": "Kreis Borken",
        "Postcode": "46325",
        "CountryID": 87,
        "Latitude": 51.841382840340565,
        "Longitude": 6.8572011404060085,
        "ContactTelephone1": "+49 2861 936171",
        "AccessComments": "24/7 nutzbare kostenlose Ladestation.",
        "RelatedURL": "http://www.stadtwerke-borken.de/",
        "DistanceUnit": 0
    },
    "Connections": [
        {
            "ID": 120436,
            "ConnectionTypeID": 25,
            "StatusTypeID": 50,
            "LevelID": 2,
            "Amps": 32,
            "Voltage": 400,
            "PowerKW": 22,
            "CurrentTypeID": 20,
            "Quantity": 1
        },
        {
            "ID": 120437,
            "ConnectionTypeID": 25,
            "StatusTypeID": 50,
            "LevelID": 2,
            "Amps": 16,
            "Voltage": 400,
            "PowerKW": 11,
            "CurrentTypeID": 20,
            "Quantity": 1
        },
        {
            "ID": 120438,
            "ConnectionTypeID": 28,
            "StatusTypeID": 50,
            "LevelID": 2,
            "Amps": 16,
            "Voltage": 230,
            "PowerKW": 3.7,
            "CurrentTypeID": 10,
            "Quantity": 1
        }
    ],
    "NumberOfPoints": 3,
    "GeneralComments": "Betreiber sind die Stadtwerke Borken.",
    "StatusTypeID": 50,
    "DateLastStatusUpdate": "2017-03-15T06:49:00Z",
    "DataQualityLevel": 1,
    "DateCreated": "2017-03-15T06:49:00Z",
    "SubmissionStatusTypeID": 200
}