{
    "IsRecentlyVerified": false,
    "ID": 28886,
    "UUID": "42E7BA17-6899-4BCC-B21B-53C1F7CED216",
    "DataProviderID": 2,
    "DataProvidersReference": "42186",
    "OperatorID": 5,
    "UsageTypeID": 1,
    "AddressInfo": {
        "ID": 29232,
        "Title": "NEMC GREEN",
        "AddressLine1": "28100 Cabot Dr",
        "Town": "Novi",
        "StateOrProvince": "MI",
        "Postcode": "48377",
        "CountryID": 2,
        "Latitude": 42.4990387,
        "Longitude": -83.4393387,
        "ContactTelephone1": "888-758-4389",
        "AccessComments": "24 hours daily",
        "RelatedURL": "http://www.chargepoint.com/",
        "DistanceUnit": 0
    },
    "Connections": [
        {
            "ID": 31742,
            "ConnectionTypeID": 9,
            "LevelID": 1,
            "Amps": 16,
            "Voltage": 120,
            "PowerKW": 1.9,
            "CurrentTypeID": 10,
            "Quantity": 1
        },
        {
            "ID": 31743,
            "ConnectionTypeID": 1,
            "LevelID": 2,
            "Amps": 16,
            "Voltage": 230,
            "PowerKW": 3.7,
            "CurrentTypeID": 10,
            "Quantity": 1
        }
    ],
    "DateLastStatusUpdate": "2020-06-26T03:06:00Z",
    "DataQualityLevel": 3,
    "DateCreated": "2014-11-28T03:38:00Z",
    "SubmissionStatusTypeID": 100
}