{
    "IsRecentlyVerified": false,
    "ID": 89135,
    "UUID": "E80C8C74-6EE6-427B-A84E-84BFC3040302",
    "DataProviderID": 2,
    "DataProvidersReference": "49392",
    "OperatorID": 5,
    "UsageTypeID": 1,
    "AddressInfo": {
        "ID": 89481,
        "Title": "NATIONAL INSTRU",
        "AddressLine1": "11500 N Mopac Expy",
        "Town": "Austin",
        "StateOrProvince": "TX",
        "Postcode": "78759",
        "CountryID": 2,
        "Latitude": 30.408048,
        "Longitude": -97.725664,
        "ContactTelephone1": "888-758-4389",
        "AccessComments": "24 hours daily",
        "RelatedURL": "http://www.chargepoint.com/",
        "DistanceUnit": 0
    },
    "Connections": [
        {
            "ID": 126491,
            "ConnectionTypeID": 1,
            "LevelID": 2,
            "Amps": 16,
            "Voltage": 230,
            "PowerKW": 3,
            "CurrentTypeID": 10,
            "Quantity": 20
        }
    ],
    "DateLastStatusUpdate": "2019-12-24T09:09:00Z",
    "DataQualityLevel": 3,
    "DateCreated": "2017-06-22T08:16:00Z",
    "SubmissionStatusTypeID": 100
}