{
    "IsRecentlyVerified": false,
    "ID": 78745,
    "UUID": "A5DEA75C-B9B6-4B69-A599-862AC128F6C3",
    "DataProviderID": 1,
    "OperatorID": 23,
    "OperatorsReference": "23394",
    "UsageTypeID": 4,
    "UsageCost": "Free",
    "AddressInfo": {
        "ID": 79091,
        "Title": "Schweizerhof Flims Romantik Hotel",
        "AddressLine1": "1 Rudi Dadens",
        "Town": "Flims Waldhaus",
        "Postcode": "7018",
        "CountryID": 217,
        "Latitude": 46.827003,
        "Longitude": 9.290015,
        "ContactTelephone1": "+41 81 928 10 10",
        "DistanceUnit": 0
    },
    "Connections": [
        {
            "ID": 113364,
            "ConnectionTypeID": 30,
            "StatusTypeID": 50,
            "LevelID": 2,
            "Amps": 32,
            "Voltage": 400,
            "PowerKW": 22,
            "CurrentTypeID": 20,
            "Quantity": 1
        }
    ],
    "NumberOfPoints": 1,
    "GeneralComments": "1 Tesla Connector, up to 22kW.Available for customers. Please see front desk.",
    "StatusTypeID": 50,
    "DateLastStatusUpdate": "2018-10-03T14:59:00Z",
    "DataQualityLevel": 1,
    "DateCreated": "2017-01-26T15:23:00Z",
    "SubmissionStatusTypeID": 200
}