{
    "IsRecentlyVerified": false,
    "ID": 4440,
    "UUID": "51BFFF25-79DF-4D56-A027-EA8AEEEAF8EA",
    "DataProviderID": 1,
    "OperatorID": 1,
    "AddressInfo": {
        "ID": 4410,
        "Title": "Baynard House Car Park",
        "AddressLine1": "Queen Victoria Street",
        "AddressLine2": "City of London",
        "Town": "London",
        "Postcode": "EC4V 4BY",
        "CountryID": 1,
        "Latitude": 51.518005,
        "Longitude": -0.103962,
        "ContactTelephone1": "020 7332 1548",
        "DistanceUnit": 0
    },
    "Connections": [],
    "GeneralComments": "",
    "StatusTypeID": 50,
    "DateLastStatusUpdate": "2011-05-17T17:23:00Z",
    "DateCreated": "2011-05-17T17:23:00Z",
    "SubmissionStatusTypeID": 200
}