{
    "IsRecentlyVerified": false,
    "ID": 166470,
    "UUID": "E344F64D-1A90-47E8-810A-4ECBA5DBC17A",
    "DataProviderID": 28,
    "DataProvidersReference": "FR*S56*P56107*B",
    "OperatorID": 3379,
    "UsageTypeID": 5,
    "AddressInfo": {
        "ID": 166829,
        "Title": "Place de l'Eglise",
        "AddressLine1": "Place de l'Eglise 56260 Larmor-Plage",
        "CountryID": 80,
        "Latitude": 47.705921,
        "Longitude": -3.382892,
        "AccessComments": "24h/24h-7J/7J",
        "DistanceUnit": 0
    },
    "Connections": [
        {
            "ID": 247911,
            "ConnectionTypeID": 25,
            "StatusTypeID": 50,
            "LevelID": 2,
            "PowerKW": 7,
            "CurrentTypeID": 10
        },
        {
            "ID": 247912,
            "ConnectionTypeID": 25,
            "StatusTypeID": 50,
            "LevelID": 2,
            "PowerKW": 7,
            "CurrentTypeID": 10
        }
    ],
    "GeneralComments": "Tarif abonné Morbihan Energies: 18€ ttc/an, puis 0,25€ ttc/kWh consommé. Non abonné: 2€ ttc/charge (3€ sur bornes rapides), puis 0,25€ ttc/kWh consommé. Pénalités applicables au temps si branchement > 6 heures (2 heures sur bornes rapides) : 5€ ttc/heure",
    "StatusTypeID": 50,
    "DateLastStatusUpdate": "2020-08-27T05:14:00Z",
    "DataQualityLevel": 2,
    "DateCreated": "2020-08-27T05:14:00Z",
    "SubmissionStatusTypeID": 100
}