{
    "IsRecentlyVerified": false,
    "ID": 141022,
    "UUID": "013CE5DC-E8DB-420D-9513-81CE4A3727CF",
    "DataProviderID": 2,
    "DataProvidersReference": "95073",
    "OperatorID": 9,
    "UsageTypeID": 1,
    "AddressInfo": {
        "ID": 141374,
        "Title": "United Markets San Anselmo",
        "AddressLine1": "100 Red Hill Rd.",
        "Town": "San Anselmo",
        "StateOrProvince": "CA",
        "Postcode": "94960",
        "CountryID": 2,
        "Latitude": 37.977309,
        "Longitude": -122.553439,
        "ContactTelephone1": "888-998-2546",
        "AccessComments": "MON: 7:00am-7:30pm | TUE: 7:00am-7:30pm | WED: 7:00am-7:30pm | THU: 7:00am-7:30pm | FRI: 7:00am-7:30pm | SAT: 7:00am-7:30pm | SUN: 7:00am-7:30pm",
        "RelatedURL": "http://www.blinkcharging.com/",
        "DistanceUnit": 0
    },
    "Connections": [
        {
            "ID": 196825,
            "ConnectionTypeID": 2,
            "LevelID": 3,
            "Amps": 100,
            "Voltage": 400,
            "PowerKW": 40,
            "CurrentTypeID": 30,
            "Quantity": 2
        }
    ],
    "StatusTypeID": 50,
    "DateLastStatusUpdate": "2020-06-26T02:59:00Z",
    "DataQualityLevel": 3,
    "DateCreated": "2019-12-24T09:14:00Z",
    "SubmissionStatusTypeID": 100
}