{
    "IsRecentlyVerified": false,
    "ID": 139620,
    "UUID": "EFE45729-DF7D-4C4F-9312-E1733A0BBF81",
    "DataProviderID": 2,
    "DataProvidersReference": "93169",
    "OperatorID": 15,
    "UsageTypeID": 4,
    "AddressInfo": {
        "ID": 139972,
        "Title": "Lincoln Place",
        "AddressLine1": "1050 Frederick St",
        "Town": "Venice",
        "StateOrProvince": "CA",
        "Postcode": "90291",
        "CountryID": 2,
        "Latitude": 33.999398,
        "Longitude": -118.460599,
        "ContactTelephone1": "877-455-3833",
        "AccessComments": "24 hours daily\r\nPublic - Card key at all times",
        "RelatedURL": "https://www.evgo.com/",
        "DistanceUnit": 0
    },
    "Connections": [
        {
            "ID": 195041,
            "ConnectionTypeID": 2,
            "LevelID": 3,
            "Amps": 100,
            "Voltage": 400,
            "PowerKW": 40,
            "CurrentTypeID": 30,
            "Quantity": 1
        },
        {
            "ID": 195042,
            "ConnectionTypeID": 32,
            "LevelID": 3,
            "Amps": 100,
            "Voltage": 400,
            "PowerKW": 40,
            "CurrentTypeID": 30,
            "Quantity": 1
        }
    ],
    "StatusTypeID": 50,
    "DateLastStatusUpdate": "2020-06-26T02:56:00Z",
    "DataQualityLevel": 3,
    "DateCreated": "2019-12-24T09:11:00Z",
    "SubmissionStatusTypeID": 100
}