{
    "IsRecentlyVerified": false,
    "ID": 87438,
    "UUID": "FDBD7816-D94A-4261-B180-E56CDF02B6CF",
    "DataProviderID": 1,
    "OperatorID": 214,
    "UsageTypeID": 4,
    "AddressInfo": {
        "ID": 87784,
        "Title": "Neustädtische Kirchstraße",
        "AddressLine1": "Neustädtische Kirchstraße 8",
        "Town": "Berlin",
        "StateOrProvince": "Berlin",
        "Postcode": "10117",
        "CountryID": 87,
        "Latitude": 52.51943010000001,
        "Longitude": 13.38557620000006,
        "AccessComments": "24/7 nutzbar",
        "DistanceUnit": 0
    },
    "Connections": [
        {
            "ID": 123950,
            "ConnectionTypeID": 25,
            "StatusTypeID": 50,
            "LevelID": 2,
            "Amps": 16,
            "Voltage": 400,
            "PowerKW": 11,
            "CurrentTypeID": 20,
            "Quantity": 2
        }
    ],
    "NumberOfPoints": 2,
    "StatusTypeID": 50,
    "DateLastStatusUpdate": "2017-05-08T07:15:00Z",
    "DataQualityLevel": 1,
    "DateCreated": "2017-05-08T07:15:00Z",
    "SubmissionStatusTypeID": 200
}