{
    "IsRecentlyVerified": false,
    "ID": 24345,
    "UUID": "242802DB-8953-436D-ABB1-AB4FB2DC33A9",
    "DataProviderID": 1,
    "OperatorID": 1,
    "UsageTypeID": 1,
    "AddressInfo": {
        "ID": 24691,
        "Title": "ABC Kuninkaantie",
        "AddressLine1": "Vanhankyläntie 77",
        "Town": "Loviisa",
        "StateOrProvince": "Uusimaa",
        "Postcode": "07740",
        "CountryID": 79,
        "Latitude": 60.485005501547235,
        "Longitude": 25.89251261071955,
        "DistanceUnit": 0
    },
    "Connections": [
        {
            "ID": 26506,
            "ConnectionTypeID": 2,
            "StatusTypeID": 50,
            "LevelID": 3,
            "CurrentTypeID": 30
        },
        {
            "ID": 26507,
            "ConnectionTypeID": 33,
            "StatusTypeID": 50,
            "LevelID": 3,
            "CurrentTypeID": 30
        }
    ],
    "NumberOfPoints": 1,
    "StatusTypeID": 50,
    "DateLastStatusUpdate": "2014-08-31T19:14:00Z",
    "DataQualityLevel": 1,
    "DateCreated": "2014-08-31T19:14:00Z",
    "SubmissionStatusTypeID": 200
}