{
    "IsRecentlyVerified": false,
    "ID": 123427,
    "UUID": "EBF7E21B-DD47-4B12-96EA-62ADEF3B6AF7",
    "DataProviderID": 2,
    "DataProvidersReference": "117602",
    "UsageTypeID": 1,
    "AddressInfo": {
        "ID": 123773,
        "Title": "Tulsa Zoo",
        "AddressLine1": "6421 E 36th St N",
        "Town": "Tulsa",
        "StateOrProvince": "OK",
        "Postcode": "74115",
        "CountryID": 2,
        "Latitude": 36.2136248339968,
        "Longitude": -95.9046680317383,
        "ContactTelephone1": "918-669-6600",
        "AccessComments": "9am-5pm daily; for zoo patron use only",
        "RelatedURL": "",
        "DistanceUnit": 0
    },
    "Connections": [
        {
            "ID": 173402,
            "ConnectionTypeID": 1,
            "LevelID": 2,
            "Amps": 16,
            "Voltage": 230,
            "PowerKW": 3.7,
            "CurrentTypeID": 10,
            "Quantity": 4
        }
    ],
    "DateLastStatusUpdate": "2020-06-26T02:58:00Z",
    "DataQualityLevel": 3,
    "DateCreated": "2019-04-06T05:03:00Z",
    "SubmissionStatusTypeID": 100
}