{
    "IsRecentlyVerified": false,
    "ID": 73390,
    "UUID": "82F20C36-4698-4E68-93DE-9CBC6C3E198E",
    "DataProviderID": 1,
    "OperatorID": 89,
    "OperatorsReference": "AAA-396",
    "UsageTypeID": 4,
    "UsageCost": "Free",
    "AddressInfo": {
        "ID": 73736,
        "Title": "Powell River-Westview Harbor",
        "AddressLine1": "6910 Wharf Street",
        "Town": "Powell River",
        "StateOrProvince": "BC",
        "Postcode": "V8A 1T9",
        "CountryID": 44,
        "Latitude": 49.838206,
        "Longitude": -124.528817,
        "DistanceUnit": 0
    },
    "Connections": [
        {
            "ID": 105593,
            "ConnectionTypeID": 1,
            "StatusTypeID": 50,
            "LevelID": 2,
            "Amps": 32,
            "Voltage": 230,
            "PowerKW": 7,
            "CurrentTypeID": 10,
            "Quantity": 1
        }
    ],
    "NumberOfPoints": 1,
    "StatusTypeID": 50,
    "DateLastStatusUpdate": "2016-11-27T16:43:00Z",
    "DataQualityLevel": 1,
    "DateCreated": "2016-11-21T23:32:00Z",
    "SubmissionStatusTypeID": 200
}