{
    "IsRecentlyVerified": false,
    "ID": 120426,
    "UUID": "1DA5A414-4EBC-41AB-8A0B-9D1200BC8E5A",
    "DataProviderID": 2,
    "DataProvidersReference": "81774",
    "OperatorID": 107,
    "UsageTypeID": 1,
    "AddressInfo": {
        "ID": 120772,
        "Title": "Ocean Beach Park",
        "AddressLine1": "1950 Abbott St",
        "Town": "San Diego",
        "StateOrProvince": "CA",
        "Postcode": "92107",
        "CountryID": 2,
        "Latitude": 32.749021,
        "Longitude": -117.251853,
        "ContactTelephone1": "858-581-9982",
        "AccessComments": "24 hours daily",
        "RelatedURL": "http://www.opconnect.com/",
        "DistanceUnit": 0
    },
    "Connections": [
        {
            "ID": 169774,
            "ConnectionTypeID": 1,
            "LevelID": 2,
            "Amps": 16,
            "Voltage": 230,
            "PowerKW": 3.7,
            "CurrentTypeID": 10,
            "Quantity": 3
        }
    ],
    "DateLastStatusUpdate": "2020-06-26T02:55:00Z",
    "DataQualityLevel": 3,
    "DateCreated": "2019-04-01T04:59:00Z",
    "SubmissionStatusTypeID": 100
}