{
    "IsRecentlyVerified": false,
    "ID": 129804,
    "UUID": "CA19A4C6-49D6-48E4-B7C5-27276B61CCD4",
    "DataProviderID": 1,
    "OperatorID": 80,
    "UsageTypeID": 4,
    "UsageCost": "0,50 €/kW",
    "AddressInfo": {
        "ID": 130150,
        "Title": "Enel PAN Fast Taranto SS7ter",
        "AddressLine1": "SS7ter",
        "Town": "Taranto",
        "StateOrProvince": "TA",
        "Postcode": "74121",
        "CountryID": 112,
        "Latitude": 40.4649560491084,
        "Longitude": 17.2913852048716,
        "RelatedURL": "https://www.enelx.com/it/it/emobility",
        "DistanceUnit": 0
    },
    "Connections": [
        {
            "ID": 181705,
            "ConnectionTypeID": 33,
            "StatusTypeID": 150,
            "LevelID": 3,
            "PowerKW": 50,
            "CurrentTypeID": 30,
            "Quantity": 1
        },
        {
            "ID": 181706,
            "ConnectionTypeID": 2,
            "StatusTypeID": 150,
            "LevelID": 3,
            "PowerKW": 50,
            "CurrentTypeID": 30,
            "Quantity": 1
        },
        {
            "ID": 181707,
            "ConnectionTypeID": 1036,
            "StatusTypeID": 150,
            "LevelID": 3,
            "Amps": 64,
            "Voltage": 400,
            "PowerKW": 43,
            "CurrentTypeID": 20,
            "Quantity": 1
        },
        {
            "ID": 181708,
            "ConnectionTypeID": 25,
            "StatusTypeID": 150,
            "LevelID": 2,
            "Amps": 32,
            "Voltage": 400,
            "PowerKW": 22,
            "CurrentTypeID": 20,
            "Quantity": 1
        }
    ],
    "NumberOfPoints": 2,
    "StatusTypeID": 150,
    "DateLastStatusUpdate": "2019-07-26T13:06:00Z",
    "DataQualityLevel": 1,
    "DateCreated": "2019-07-26T13:06:00Z",
    "SubmissionStatusTypeID": 200
}