{
    "IsRecentlyVerified": false,
    "ID": 137917,
    "UUID": "6B15B2DA-914B-4FCF-BA6A-C2E6D2B8D513",
    "DataProviderID": 2,
    "DataProvidersReference": "72864",
    "OperatorID": 1242,
    "UsageTypeID": 1,
    "AddressInfo": {
        "ID": 138266,
        "Title": "GE WattStation 3",
        "AddressLine1": "13538  Sabre Springs Pkwy",
        "Town": "San Diego",
        "StateOrProvince": "CA",
        "Postcode": "92128",
        "CountryID": 2,
        "Latitude": 32.9624984,
        "Longitude": -117.0921177,
        "ContactTelephone1": "855-443-3873",
        "AccessComments": "24 hours daily",
        "RelatedURL": "https://www.gewattstation.com",
        "DistanceUnit": 0
    },
    "Connections": [
        {
            "ID": 192942,
            "ConnectionTypeID": 1,
            "LevelID": 2,
            "Amps": 16,
            "Voltage": 230,
            "PowerKW": 3,
            "CurrentTypeID": 10,
            "Quantity": 1
        }
    ],
    "StatusTypeID": 50,
    "DateLastStatusUpdate": "2019-12-24T09:06:00Z",
    "DataQualityLevel": 3,
    "DateCreated": "2019-12-24T09:06:00Z",
    "SubmissionStatusTypeID": 100
}