{
    "IsRecentlyVerified": false,
    "ID": 15519,
    "UUID": "6363A376-216A-4607-86B8-7722EEA5ABEA",
    "DataProviderID": 1,
    "OperatorID": 1,
    "UsageTypeID": 1,
    "AddressInfo": {
        "ID": 15864,
        "Title": "Amoy Plaza",
        "AddressLine1": "77 Ngau Tau Kok Rd",
        "AddressLine2": "",
        "Town": "Ngau Tau Kok",
        "StateOrProvince": "Kowloon",
        "Postcode": "",
        "CountryID": 4,
        "Latitude": 22.324071884155273,
        "Longitude": 114.21636962890625,
        "ContactTelephone1": "",
        "ContactTelephone2": "",
        "ContactEmail": "",
        "AccessComments": "",
        "RelatedURL": "",
        "DistanceUnit": 0
    },
    "Connections": [
        {
            "ID": 13836,
            "ConnectionTypeID": 3,
            "Quantity": 1
        }
    ],
    "NumberOfPoints": 2,
    "DateLastConfirmed": "2011-05-21T00:00:00Z",
    "StatusTypeID": 50,
    "DateLastStatusUpdate": "2013-01-11T21:07:00Z",
    "DateCreated": "2013-01-11T21:53:00Z",
    "SubmissionStatusTypeID": 200
}