{
    "IsRecentlyVerified": false,
    "ID": 182190,
    "UUID": "3FAD74B6-E2CC-4F80-B819-1739D9183CA2",
    "DataProviderID": 29,
    "DataProvidersReference": "4170",
    "OperatorID": 86,
    "AddressInfo": {
        "ID": 182549,
        "Title": "BAB7; Autobahnraststätte Lonetal Ost",
        "AddressLine1": "BAB7; Autobahnraststätte Lonetal Ost",
        "Town": "Giengen",
        "Postcode": "89537",
        "CountryID": 87,
        "Latitude": 48.584106,
        "Longitude": 10.17879,
        "DistanceUnit": 0
    },
    "Connections": [
        {
            "ID": 287624,
            "ConnectionTypeID": 1036,
            "StatusTypeID": 50,
            "LevelID": 3,
            "PowerKW": 43,
            "CurrentTypeID": 20
        },
        {
            "ID": 287625,
            "ConnectionTypeID": 33,
            "StatusTypeID": 50,
            "LevelID": 3,
            "PowerKW": 50,
            "CurrentTypeID": 30
        }
    ],
    "StatusTypeID": 50,
    "DateLastStatusUpdate": "2021-07-12T02:41:00Z",
    "MetadataValues": [
        {
            "ID": 14484,
            "MetadataFieldID": 4,
            "ItemValue": "Data from the German chargepoint registry provided by Bundesnetzagentur.de under the CC-BY 4.0 license"
        }
    ],
    "DataQualityLevel": 3,
    "DateCreated": "2021-07-08T10:02:00Z",
    "SubmissionStatusTypeID": 100
}