{
    "IsRecentlyVerified": false,
    "ID": 19937,
    "UUID": "A109A928-B229-4282-AAED-481E3109A466",
    "DataProviderID": 1,
    "OperatorID": 1,
    "UsageTypeID": 0,
    "UsageCost": "",
    "AddressInfo": {
        "ID": 20282,
        "Title": " Parking Hoche",
        "AddressLine1": "place Hoche",
        "AddressLine2": "",
        "Town": "",
        "StateOrProvince": "RENNES",
        "Postcode": "35000",
        "CountryID": 80,
        "Latitude": 48.11526,
        "Longitude": -1.67694,
        "ContactTelephone1": "",
        "ContactTelephone2": "",
        "ContactEmail": "",
        "AccessComments": "Ouvert à tous",
        "RelatedURL": "",
        "DistanceUnit": 0
    },
    "Connections": [],
    "GeneralComments": "",
    "StatusTypeID": 50,
    "DateLastStatusUpdate": "2013-10-22T17:08:00Z",
    "DataQualityLevel": 1,
    "DateCreated": "2013-10-22T08:06:00Z",
    "SubmissionStatusTypeID": 200
}