{
    "IsRecentlyVerified": false,
    "ID": 73126,
    "UUID": "C6B80C5E-D9A8-4BE0-9289-174BEDFF5C36",
    "DataProviderID": 1,
    "OperatorID": 3261,
    "UsageTypeID": 5,
    "UsageCost": "PlugSurfing: 0,153€/min an Typ2 / 43kW!",
    "AddressInfo": {
        "ID": 73472,
        "Title": "Markus Goltz Naturstein",
        "AddressLine1": "Märsche 2",
        "AddressLine2": "",
        "Town": "Geestgottberg",
        "StateOrProvince": "Seehausen",
        "Postcode": "39615",
        "CountryID": 87,
        "Latitude": 52.9727557749859,
        "Longitude": 11.7344898846558,
        "ContactTelephone1": "+49 39397 - 376",
        "ContactTelephone2": "",
        "ContactEmail": "",
        "AccessComments": "24/7 nutzbare Ladesäule, freischaltbar mit PlugSurfing Keyhanger oder App oder ecommunity Website von be energised.",
        "RelatedURL": "http://www.markus-goltz.de/",
        "DistanceUnit": 0
    },
    "Connections": [
        {
            "ID": 105142,
            "ConnectionTypeID": 1036,
            "StatusTypeID": 50,
            "LevelID": 3,
            "Amps": 63,
            "Voltage": 400,
            "PowerKW": 43,
            "CurrentTypeID": 20,
            "Quantity": 1
        },
        {
            "ID": 105143,
            "ConnectionTypeID": 33,
            "StatusTypeID": 50,
            "LevelID": 3,
            "PowerKW": 50,
            "CurrentTypeID": 30,
            "Quantity": 1
        },
        {
            "ID": 105144,
            "ConnectionTypeID": 2,
            "StatusTypeID": 50,
            "LevelID": 3,
            "PowerKW": 50,
            "CurrentTypeID": 30,
            "Quantity": 1
        }
    ],
    "NumberOfPoints": 3,
    "GeneralComments": "",
    "StatusTypeID": 50,
    "DateLastStatusUpdate": "2017-06-07T18:50:00Z",
    "DataQualityLevel": 1,
    "DateCreated": "2016-11-08T07:20:00Z",
    "SubmissionStatusTypeID": 200
}