{
    "IsRecentlyVerified": false,
    "ID": 185506,
    "UUID": "D3F5EB69-FA22-4FC5-9A60-CA8B60830E59",
    "DataProviderID": 29,
    "DataProvidersReference": "396",
    "AddressInfo": {
        "ID": 185865,
        "Title": "Große Str. bei 16",
        "AddressLine1": "Große Str. bei 16",
        "Town": "Süderbrarup",
        "Postcode": "24392",
        "CountryID": 87,
        "Latitude": 54.635104,
        "Longitude": 9.773658,
        "DistanceUnit": 0
    },
    "Connections": [
        {
            "ID": 295089,
            "ConnectionTypeID": 25,
            "StatusTypeID": 50,
            "LevelID": 2,
            "PowerKW": 22,
            "CurrentTypeID": 20
        },
        {
            "ID": 295090,
            "ConnectionTypeID": 25,
            "StatusTypeID": 50,
            "LevelID": 2,
            "PowerKW": 22,
            "CurrentTypeID": 20
        }
    ],
    "StatusTypeID": 50,
    "DateLastStatusUpdate": "2021-07-09T03:31:00Z",
    "MetadataValues": [
        {
            "ID": 17797,
            "MetadataFieldID": 4,
            "ItemValue": "Data from the German chargepoint registry provided by Bundesnetzagentur.de under the CC-BY 4.0 license"
        }
    ],
    "DataQualityLevel": 3,
    "DateCreated": "2021-07-08T10:07:00Z",
    "SubmissionStatusTypeID": 100
}