{
    "IsRecentlyVerified": false,
    "ID": 38054,
    "UUID": "9B33B966-4CD2-4AA4-AFAF-54404FB8AC6F",
    "DataProviderID": 26,
    "DataProvidersReference": "27732",
    "OperatorID": 157,
    "OperatorsReference": "NewMotion 02002732",
    "UsageCost": "0.00 jaarabonnement",
    "AddressInfo": {
        "ID": 38400,
        "Title": "Eperweg",
        "AddressLine1": "Eperweg",
        "Town": "Elburg",
        "Postcode": "8084 HD",
        "CountryID": 159,
        "Latitude": 52.4108009338379,
        "Longitude": 5.88844299316406,
        "ContactTelephone1": "088 0109500",
        "RelatedURL": "http://thenewmotion.nl/",
        "DistanceUnit": 0
    },
    "Connections": [
        {
            "ID": 41565,
            "ConnectionTypeID": 25,
            "LevelID": 2,
            "PowerKW": 3.7,
            "CurrentTypeID": 10
        }
    ],
    "NumberOfPoints": 1,
    "StatusTypeID": 50,
    "DateLastStatusUpdate": "2016-06-04T02:54:00Z",
    "DataQualityLevel": 3,
    "DateCreated": "2015-01-09T06:07:00Z",
    "SubmissionStatusTypeID": 100
}