{
    "IsRecentlyVerified": false,
    "ID": 139107,
    "UUID": "EBA54A8B-23F2-47AC-AA61-E46647D9B2DB",
    "DataProviderID": 2,
    "DataProvidersReference": "95282",
    "OperatorID": 9,
    "UsageTypeID": 1,
    "AddressInfo": {
        "ID": 139459,
        "Title": "Fry's Store #612 Phoenix",
        "AddressLine1": "4707 E. Shea Blvd.",
        "Town": "Phoenix",
        "StateOrProvince": "AZ",
        "Postcode": "85028",
        "CountryID": 2,
        "Latitude": 33.581299,
        "Longitude": -111.979134,
        "ContactTelephone1": "888-998-2546",
        "AccessComments": "MON: 24 hours | TUE: 24 hours | WED: 24 hours | THU: 24 hours | FRI: 24 hours | SAT: 24 hours | SUN: 24 hours",
        "RelatedURL": "http://www.blinkcharging.com/",
        "DistanceUnit": 0
    },
    "Connections": [
        {
            "ID": 194369,
            "ConnectionTypeID": 2,
            "LevelID": 3,
            "Amps": 100,
            "Voltage": 400,
            "PowerKW": 40,
            "CurrentTypeID": 30,
            "Quantity": 2
        }
    ],
    "StatusTypeID": 50,
    "DateLastStatusUpdate": "2019-12-24T09:10:00Z",
    "DataQualityLevel": 3,
    "DateCreated": "2019-12-24T09:10:00Z",
    "SubmissionStatusTypeID": 100
}