{
    "IsRecentlyVerified": false,
    "ID": 103166,
    "UUID": "351724E4-B41A-4777-B8F9-7E1E0B120249",
    "DataProviderID": 1,
    "OperatorID": 45,
    "UsageTypeID": 6,
    "AddressInfo": {
        "ID": 103512,
        "Title": " Albergo Ristorante Amici",
        "AddressLine1": "Via Giuseppe Garibaldi, 80",
        "Town": "Varese Ligure",
        "StateOrProvince": "SP",
        "Postcode": "19028",
        "CountryID": 112,
        "Latitude": 44.37828092543549,
        "Longitude": 9.59529572046847,
        "ContactTelephone1": " 0187 842139",
        "ContactEmail": "info@albergoamici.com",
        "RelatedURL": "http://www.albergoamici.it/",
        "DistanceUnit": 0
    },
    "Connections": [
        {
            "ID": 145762,
            "ConnectionTypeID": 25,
            "StatusTypeID": 50,
            "LevelID": 2,
            "CurrentTypeID": 10,
            "Quantity": 1
        }
    ],
    "NumberOfPoints": 1,
    "StatusTypeID": 50,
    "DateLastStatusUpdate": "2018-04-23T09:52:00Z",
    "DataQualityLevel": 1,
    "DateCreated": "2018-04-23T09:52:00Z",
    "SubmissionStatusTypeID": 200
}