{
    "IsRecentlyVerified": false,
    "ID": 114226,
    "UUID": "FCF03F85-D8EF-45E6-9C0C-5AD8BA5F1A99",
    "DataProviderID": 1,
    "OperatorID": 3315,
    "OperatorsReference": "50846",
    "UsageTypeID": 4,
    "UsageCost": "Free",
    "AddressInfo": {
        "ID": 114572,
        "Title": "Loch Fyne Oyster Restaurant , Cairndow",
        "AddressLine1": "Loch Fyne Oysters",
        "Town": "Clachan",
        "StateOrProvince": "Cairndow",
        "Postcode": "PA26 8BL",
        "CountryID": 1,
        "Latitude": 56.27144,
        "Longitude": -4.92821,
        "DistanceUnit": 0
    },
    "Connections": [
        {
            "ID": 160800,
            "ConnectionTypeID": 25,
            "StatusTypeID": 100,
            "LevelID": 2,
            "Amps": 32,
            "Voltage": 400,
            "PowerKW": 22,
            "CurrentTypeID": 20,
            "Quantity": 2
        }
    ],
    "NumberOfPoints": 2,
    "StatusTypeID": 50,
    "DateLastStatusUpdate": "2020-10-12T18:41:00Z",
    "DataQualityLevel": 1,
    "DateCreated": "2019-01-04T06:16:00Z",
    "SubmissionStatusTypeID": 200
}