{
    "IsRecentlyVerified": false,
    "ID": 123004,
    "UUID": "45AD5220-9D72-43B5-82E7-C2F837821E43",
    "DataProviderID": 2,
    "DataProvidersReference": "114707",
    "OperatorID": 23,
    "UsageTypeID": 1,
    "AddressInfo": {
        "ID": 123350,
        "Title": "Snowbird Mountain Lodge - Tesla Destination",
        "AddressLine1": "4633 Santeetlah Rd",
        "Town": "Robbinsville",
        "StateOrProvince": "NC",
        "Postcode": "28771",
        "CountryID": 2,
        "Latitude": 35.345092,
        "Longitude": -83.893071,
        "ContactTelephone1": "828-479-3433  877-798-3752",
        "AccessComments": "24 hours daily; see front desk for access",
        "RelatedURL": "https://www.tesla.com/destination-charging",
        "DistanceUnit": 0
    },
    "Connections": [
        {
            "ID": 172939,
            "ConnectionTypeID": 30,
            "LevelID": 2,
            "Amps": 16,
            "Voltage": 230,
            "PowerKW": 3.7,
            "CurrentTypeID": 10,
            "Quantity": 4
        }
    ],
    "DateLastStatusUpdate": "2020-06-26T02:58:00Z",
    "DataQualityLevel": 3,
    "DateCreated": "2019-04-06T05:03:00Z",
    "SubmissionStatusTypeID": 100
}