{
    "IsRecentlyVerified": false,
    "ID": 62120,
    "UUID": "E091162B-AF82-4FE3-9856-470FB492CF23",
    "DataProviderID": 1,
    "OperatorID": 23,
    "OperatorsReference": "13142",
    "UsageTypeID": 7,
    "UsageCost": "Free",
    "AddressInfo": {
        "ID": 62466,
        "Title": "Hilton Columbus Downtown",
        "AddressLine1": "401 N High St",
        "Town": "Columbus",
        "StateOrProvince": "OH",
        "Postcode": "43215",
        "CountryID": 2,
        "Latitude": 39.9708025,
        "Longitude": -83.0027373,
        "ContactTelephone1": "614-384-8600",
        "AccessComments": "24 hours daily; for guest use only",
        "RelatedURL": "http://www.teslamotors.com/supercharger",
        "DistanceUnit": 0
    },
    "Connections": [
        {
            "ID": 79023,
            "ConnectionTypeID": 30,
            "StatusTypeID": 50,
            "LevelID": 2,
            "Amps": 16,
            "Voltage": 230,
            "PowerKW": 8,
            "CurrentTypeID": 10,
            "Quantity": 2
        }
    ],
    "NumberOfPoints": 2,
    "StatusTypeID": 50,
    "DateLastStatusUpdate": "2017-02-02T22:55:00Z",
    "DataQualityLevel": 3,
    "DateCreated": "2016-03-03T11:38:00Z",
    "SubmissionStatusTypeID": 100
}