{
    "IsRecentlyVerified": false,
    "ID": 77614,
    "UUID": "A195479D-17D9-4F77-9B76-F2426A6A44B8",
    "DataProviderID": 1,
    "OperatorID": 160,
    "UsageTypeID": 4,
    "AddressInfo": {
        "ID": 77960,
        "Title": "Erlebnispark Meeresaquarium",
        "AddressLine1": "Beethovenstraße 16",
        "Town": "Zella-Mehlis",
        "StateOrProvince": "Suhl",
        "Postcode": "98544",
        "CountryID": 87,
        "Latitude": 50.65857,
        "Longitude": 10.65355999999997,
        "AccessComments": "24/7 nutzbar",
        "DistanceUnit": 0
    },
    "Connections": [
        {
            "ID": 112128,
            "ConnectionTypeID": 25,
            "StatusTypeID": 50,
            "LevelID": 2,
            "Amps": 32,
            "Voltage": 400,
            "PowerKW": 22,
            "CurrentTypeID": 20,
            "Quantity": 2
        },
        {
            "ID": 112129,
            "ConnectionTypeID": 28,
            "StatusTypeID": 50,
            "LevelID": 2,
            "Amps": 16,
            "Voltage": 230,
            "PowerKW": 3.7,
            "CurrentTypeID": 10,
            "Quantity": 2
        }
    ],
    "NumberOfPoints": 2,
    "StatusTypeID": 50,
    "DateLastStatusUpdate": "2017-01-20T07:24:00Z",
    "DataQualityLevel": 1,
    "DateCreated": "2017-01-20T07:24:00Z",
    "SubmissionStatusTypeID": 200
}