{
    "IsRecentlyVerified": false,
    "ID": 119504,
    "UUID": "6179AE5C-2859-461D-8658-FCD9F7306CB6",
    "DataProviderID": 2,
    "DataProvidersReference": "103560",
    "UsageTypeID": 1,
    "AddressInfo": {
        "ID": 119850,
        "Title": "Everglades National Park - Ernest F. Coe Visitor Center",
        "AddressLine1": "40001 State Rd 9336",
        "Town": "Homestead",
        "StateOrProvince": "FL",
        "Postcode": "33034",
        "CountryID": 2,
        "Latitude": 25.395412,
        "Longitude": -80.584091,
        "ContactTelephone1": "305-242-7700",
        "AccessComments": "Park business hours",
        "RelatedURL": "",
        "DistanceUnit": 0
    },
    "Connections": [
        {
            "ID": 168775,
            "ConnectionTypeID": 2,
            "LevelID": 3,
            "Amps": 100,
            "Voltage": 400,
            "PowerKW": 40,
            "CurrentTypeID": 30,
            "Quantity": 1
        },
        {
            "ID": 168776,
            "ConnectionTypeID": 32,
            "LevelID": 3,
            "Amps": 100,
            "Voltage": 400,
            "PowerKW": 40,
            "CurrentTypeID": 30,
            "Quantity": 1
        },
        {
            "ID": 168777,
            "ConnectionTypeID": 32,
            "LevelID": 2,
            "Amps": 100,
            "Voltage": 400,
            "PowerKW": 40,
            "CurrentTypeID": 10,
            "Quantity": 1
        }
    ],
    "DateLastStatusUpdate": "2020-06-26T02:52:00Z",
    "DataQualityLevel": 3,
    "DateCreated": "2019-04-01T04:59:00Z",
    "SubmissionStatusTypeID": 100
}