{
    "IsRecentlyVerified": false,
    "ID": 128274,
    "UUID": "C40C8BBC-9632-4237-B372-415FCC823426",
    "DataProviderID": 1,
    "OperatorID": 25,
    "OperatorsReference": "ealing-clitherowavenue",
    "UsageTypeID": 4,
    "UsageCost": "£0.059/minute; min £1.18; other tariffs available",
    "AddressInfo": {
        "ID": 128620,
        "Title": "Clitherow Avenue",
        "AddressLine1": "104 Clitherow Avenue",
        "Town": "London",
        "Postcode": "W7 2BX",
        "CountryID": 1,
        "Latitude": 51.498756,
        "Longitude": -0.325761,
        "DistanceUnit": 0
    },
    "Connections": [
        {
            "ID": 179556,
            "ConnectionTypeID": 25,
            "StatusTypeID": 50,
            "LevelID": 2,
            "Amps": 32,
            "Voltage": 230,
            "PowerKW": 7,
            "CurrentTypeID": 10,
            "Quantity": 3
        },
        {
            "ID": 179557,
            "ConnectionTypeID": 1,
            "StatusTypeID": 50,
            "LevelID": 2,
            "Voltage": 230,
            "PowerKW": 4,
            "CurrentTypeID": 10,
            "Quantity": 3
        },
        {
            "ID": 179558,
            "ConnectionTypeID": 25,
            "StatusTypeID": 50,
            "LevelID": 2,
            "Amps": 32,
            "Voltage": 230,
            "PowerKW": 7,
            "CurrentTypeID": 10,
            "Quantity": 3
        },
        {
            "ID": 179559,
            "ConnectionTypeID": 1,
            "StatusTypeID": 50,
            "LevelID": 2,
            "Voltage": 230,
            "PowerKW": 4,
            "CurrentTypeID": 10,
            "Quantity": 3
        }
    ],
    "NumberOfPoints": 3,
    "StatusTypeID": 50,
    "DateLastStatusUpdate": "2019-06-22T05:30:00Z",
    "DataQualityLevel": 1,
    "DateCreated": "2019-06-21T05:41:00Z",
    "SubmissionStatusTypeID": 200
}