{
    "IsRecentlyVerified": false,
    "ID": 37120,
    "UUID": "6CABA370-AECF-44D5-9968-64863FA64431",
    "DataProviderID": 26,
    "DataProvidersReference": "48625",
    "OperatorID": 178,
    "OperatorsReference": "EVnetNL REE425",
    "UsageCost": "0.00 jaarabonnement",
    "AddressInfo": {
        "ID": 37466,
        "Title": "Ganzenmarkt 44",
        "AddressLine1": "Ganzenmarkt 44",
        "Town": "Oldenzaal",
        "Postcode": "7571 CD",
        "CountryID": 159,
        "Latitude": 52.311744,
        "Longitude": 6.930007,
        "ContactTelephone1": "0800-3522365",
        "RelatedURL": "http://www.evnet.nl",
        "DistanceUnit": 0
    },
    "Connections": [
        {
            "ID": 40631,
            "ConnectionTypeID": 25,
            "LevelID": 2,
            "PowerKW": 11,
            "CurrentTypeID": 10
        }
    ],
    "NumberOfPoints": 1,
    "StatusTypeID": 50,
    "DateLastStatusUpdate": "2016-06-04T02:52:00Z",
    "DataQualityLevel": 3,
    "DateCreated": "2015-01-09T06:07:00Z",
    "SubmissionStatusTypeID": 100
}