{
    "IsRecentlyVerified": false,
    "ID": 114148,
    "UUID": "2EC3DB96-A79A-45FB-8833-B450CC24D3E0",
    "DataProviderID": 1,
    "OperatorID": 23,
    "OperatorsReference": "47472",
    "UsageTypeID": 6,
    "AddressInfo": {
        "ID": 114494,
        "Title": "Mottram Hall Hotel",
        "AddressLine1": "Wilmslow Road",
        "Town": "Mottram",
        "StateOrProvince": "Cheshire",
        "Postcode": "SK10 4QT",
        "CountryID": 1,
        "Latitude": 53.312196,
        "Longitude": -2.173484,
        "ContactTelephone1": "+44 1625 828 135",
        "DistanceUnit": 0
    },
    "Connections": [
        {
            "ID": 160718,
            "ConnectionTypeID": 30,
            "StatusTypeID": 50,
            "LevelID": 2,
            "PowerKW": 6,
            "CurrentTypeID": 10,
            "Quantity": 3
        }
    ],
    "NumberOfPoints": 3,
    "GeneralComments": "3 Tesla Connectors, up to 6kW.Available for patrons only. Please see front desk.",
    "StatusTypeID": 50,
    "DateLastStatusUpdate": "2019-01-03T08:02:00Z",
    "DataQualityLevel": 1,
    "DateCreated": "2019-01-03T08:02:00Z",
    "SubmissionStatusTypeID": 200
}