{
    "IsRecentlyVerified": false,
    "ID": 130959,
    "UUID": "6ECC7E2F-90EA-4D73-B6B8-9E4CD6D8F935",
    "DataProviderID": 1,
    "OperatorID": 19,
    "UsageTypeID": 1,
    "AddressInfo": {
        "ID": 131305,
        "Title": "Treworgey Cottages ",
        "AddressLine1": "Duloe, ",
        "Town": "Looe",
        "StateOrProvince": "Cornwall ",
        "Postcode": "PL14 4PP ",
        "CountryID": 1,
        "Latitude": 50.383703,
        "Longitude": -4.475011,
        "ContactTelephone1": "01503 262730",
        "ContactEmail": "stay@treworgeycottages.co.uk",
        "RelatedURL": "https://www.treworgeycottages.com",
        "DistanceUnit": 0
    },
    "Connections": [
        {
            "ID": 183452,
            "ConnectionTypeID": 25,
            "StatusTypeID": 50,
            "LevelID": 2,
            "Amps": 32,
            "Voltage": 230,
            "PowerKW": 7,
            "CurrentTypeID": 10,
            "Quantity": 1
        }
    ],
    "NumberOfPoints": 1,
    "GeneralComments": "For guests staying at the cottages",
    "StatusTypeID": 50,
    "DateLastStatusUpdate": "2019-08-28T12:06:00Z",
    "DataQualityLevel": 1,
    "DateCreated": "2019-08-28T12:06:00Z",
    "SubmissionStatusTypeID": 200
}