{
    "IsRecentlyVerified": false,
    "ID": 129299,
    "UUID": "BA03E02D-0544-40C0-AE19-77D7B5E809C2",
    "DataProviderID": 1,
    "OperatorID": 80,
    "UsageTypeID": 4,
    "AddressInfo": {
        "ID": 129645,
        "Title": "Impianti Sportivi Grignano Polesine | EnelX",
        "AddressLine1": "Via Dosso Faiti",
        "AddressLine2": "Grignano Polesine",
        "Town": "Rovigo",
        "StateOrProvince": "RO",
        "Postcode": "45100",
        "CountryID": 112,
        "Latitude": 45.044087258521614,
        "Longitude": 11.750328860343984,
        "ContactTelephone1": "800.069.850",
        "RelatedURL": "https://www.enelx.com/it/it/emobility",
        "DistanceUnit": 0
    },
    "Connections": [
        {
            "ID": 180963,
            "ConnectionTypeID": 25,
            "StatusTypeID": 50,
            "LevelID": 2,
            "Amps": 32,
            "Voltage": 400,
            "PowerKW": 22,
            "CurrentTypeID": 20,
            "Quantity": 2
        }
    ],
    "NumberOfPoints": 2,
    "StatusTypeID": 50,
    "DateLastStatusUpdate": "2019-07-16T14:32:00Z",
    "DataQualityLevel": 1,
    "DateCreated": "2019-07-16T14:32:00Z",
    "SubmissionStatusTypeID": 200
}