{
    "IsRecentlyVerified": false,
    "ID": 131471,
    "UUID": "C7496812-A4D9-460E-9FE6-3595EC937C7C",
    "DataProviderID": 1,
    "OperatorID": 23,
    "OperatorsReference": "51728",
    "UsageTypeID": 4,
    "AddressInfo": {
        "ID": 131817,
        "Title": "Lustica Bay",
        "AddressLine1": "Novo Naselje",
        "Town": "Radovi",
        "Postcode": "85323",
        "CountryID": 151,
        "Latitude": 42.392379,
        "Longitude": 18.667945,
        "ContactTelephone1": "+382 77 200 100",
        "DistanceUnit": 0
    },
    "Connections": [
        {
            "ID": 184036,
            "ConnectionTypeID": 30,
            "StatusTypeID": 50,
            "LevelID": 2,
            "PowerKW": 22,
            "CurrentTypeID": 20,
            "Quantity": 2
        }
    ],
    "NumberOfPoints": 2,
    "GeneralComments": "2 Tesla Connectors, up to 22kW.Available for customers. Please call ahead.",
    "StatusTypeID": 50,
    "DateLastStatusUpdate": "2019-09-08T05:34:00Z",
    "DataQualityLevel": 1,
    "DateCreated": "2019-09-08T05:34:00Z",
    "SubmissionStatusTypeID": 200
}