{
    "IsRecentlyVerified": false,
    "ID": 2972,
    "UUID": "DE117C5A-12A0-4422-912B-C17999776C35",
    "DataProviderID": 2,
    "DataProvidersReference": "36611",
    "OperatorID": 5,
    "UsageTypeID": 1,
    "AddressInfo": {
        "ID": 2973,
        "Title": "INTERPARK",
        "AddressLine1": "17 E Adams St",
        "Town": "Chicago",
        "StateOrProvince": "IL",
        "Postcode": "60603",
        "CountryID": 2,
        "Latitude": 41.879396,
        "Longitude": -87.626578,
        "ContactTelephone1": "888-758-4389",
        "AccessComments": "24 hours daily",
        "RelatedURL": "http://www.chargepoint.com/",
        "DistanceUnit": 0
    },
    "Connections": [
        {
            "ID": 12641,
            "ConnectionTypeID": 9,
            "LevelID": 1,
            "Amps": 16,
            "Voltage": 120,
            "PowerKW": 1.9,
            "CurrentTypeID": 10,
            "Quantity": 2
        },
        {
            "ID": 12642,
            "ConnectionTypeID": 1,
            "LevelID": 2,
            "Amps": 16,
            "Voltage": 230,
            "PowerKW": 3.7,
            "CurrentTypeID": 10,
            "Quantity": 2
        },
        {
            "ID": 20348,
            "ConnectionTypeID": 1,
            "LevelID": 2,
            "Quantity": 2
        }
    ],
    "DateLastConfirmed": "2011-04-30T00:00:00Z",
    "StatusTypeID": 0,
    "DateLastStatusUpdate": "2020-06-26T03:05:00Z",
    "DataQualityLevel": 1,
    "DateCreated": "2011-04-30T00:00:00Z",
    "SubmissionStatusTypeID": 100
}