{
    "IsRecentlyVerified": false,
    "ID": 120764,
    "UUID": "09763B2E-49A9-4B6A-8B4E-CEAA84769DEF",
    "DataProviderID": 2,
    "DataProvidersReference": "69916",
    "OperatorID": 5,
    "UsageTypeID": 1,
    "AddressInfo": {
        "ID": 121110,
        "Title": "BLUE SOL",
        "AddressLine1": "421 Bernard St",
        "Town": "Costa Mesa",
        "StateOrProvince": "CA",
        "Postcode": "92627",
        "CountryID": 2,
        "Latitude": 33.6447009,
        "Longitude": -117.9179919,
        "ContactTelephone1": "888-758-4389",
        "AccessComments": "24 hours daily",
        "RelatedURL": "http://www.chargepoint.com/",
        "DistanceUnit": 0
    },
    "Connections": [
        {
            "ID": 170149,
            "ConnectionTypeID": 1,
            "LevelID": 2,
            "Amps": 16,
            "Voltage": 230,
            "PowerKW": 3,
            "CurrentTypeID": 10,
            "Quantity": 2
        }
    ],
    "DateLastStatusUpdate": "2019-12-24T09:10:00Z",
    "DataQualityLevel": 3,
    "DateCreated": "2019-04-01T04:59:00Z",
    "SubmissionStatusTypeID": 100
}