{
    "IsRecentlyVerified": false,
    "ID": 147865,
    "UUID": "FF2A5EED-44DC-48E1-A976-621D52DE33D6",
    "DataProviderID": 1,
    "OperatorID": 3323,
    "UsageTypeID": 4,
    "UsageCost": "For Pricing  https://zes.net/fiyatlar.html",
    "AddressInfo": {
        "ID": 148217,
        "Title": "ZES- Oksijen O86 İzmir Yönü",
        "AddressLine1": "Dereçavuşköy Mahallesi , Bursa Çevreyolu , ",
        "Town": "Osmangazi ",
        "StateOrProvince": "Marmara Bölgesi",
        "Postcode": "16160",
        "CountryID": 229,
        "Latitude": 40.28318505215475,
        "Longitude": 28.995856599171702,
        "ContactTelephone1": "+908503399937",
        "AccessComments": "ZES- Oksijen O86 izmir Yönü 1x22kW AC .  Açık Otopark Alanı. Otobana Yakın Bayrak direklerine gelmeden. \r\nZES - Oksijen O86  Towards İzmir 1x22kW AC  Outdoor Parking next to motorway.",
        "RelatedURL": "https://zes.net",
        "DistanceUnit": 0
    },
    "Connections": [
        {
            "ID": 205265,
            "ConnectionTypeID": 25,
            "StatusTypeID": 50,
            "LevelID": 2,
            "Amps": 32,
            "Voltage": 400,
            "PowerKW": 22,
            "CurrentTypeID": 20,
            "Quantity": 1
        }
    ],
    "NumberOfPoints": 1,
    "StatusTypeID": 50,
    "DateLastStatusUpdate": "2020-01-19T10:21:00Z",
    "DataQualityLevel": 1,
    "DateCreated": "2020-01-18T10:00:00Z",
    "SubmissionStatusTypeID": 200
}