{
    "IsRecentlyVerified": false,
    "ID": 131468,
    "UUID": "5775AABF-68CD-4C5B-BB20-C994E72AAB95",
    "DataProviderID": 1,
    "OperatorID": 23,
    "OperatorsReference": "51737",
    "UsageTypeID": 4,
    "AddressInfo": {
        "ID": 131814,
        "Title": "Candlewood Suites Davenport",
        "AddressLine1": "3800 Market Square Cir",
        "Town": "Davenport",
        "StateOrProvince": "Iowa",
        "Postcode": "52807",
        "CountryID": 2,
        "Latitude": 41.570919,
        "Longitude": -90.517593,
        "ContactTelephone1": "(563) 214-7401",
        "DistanceUnit": 0
    },
    "Connections": [
        {
            "ID": 184033,
            "ConnectionTypeID": 30,
            "StatusTypeID": 50,
            "LevelID": 2,
            "PowerKW": 16,
            "CurrentTypeID": 20,
            "Quantity": 2
        }
    ],
    "NumberOfPoints": 2,
    "GeneralComments": "2 Tesla Connectors, up to 16kW.Available for customers. Self park.",
    "StatusTypeID": 50,
    "DateLastStatusUpdate": "2019-09-08T05:34:00Z",
    "DataQualityLevel": 1,
    "DateCreated": "2019-09-08T05:34:00Z",
    "SubmissionStatusTypeID": 200
}