{
    "IsRecentlyVerified": false,
    "ID": 184566,
    "UUID": "C4810858-F4C2-42D3-89F9-BA1DC29B6817",
    "DataProviderID": 29,
    "DataProvidersReference": "3323",
    "OperatorID": 86,
    "AddressInfo": {
        "ID": 184925,
        "Title": "Detmolder Str. 314",
        "AddressLine1": "Detmolder Str. 314",
        "Town": "Bielefeld",
        "Postcode": "33605",
        "CountryID": 87,
        "Latitude": 52.001739,
        "Longitude": 8.569265,
        "DistanceUnit": 0
    },
    "Connections": [
        {
            "ID": 292993,
            "ConnectionTypeID": 33,
            "StatusTypeID": 50,
            "LevelID": 3,
            "PowerKW": 75,
            "CurrentTypeID": 30
        },
        {
            "ID": 292994,
            "ConnectionTypeID": 33,
            "StatusTypeID": 50,
            "LevelID": 3,
            "PowerKW": 75,
            "CurrentTypeID": 30
        }
    ],
    "StatusTypeID": 50,
    "DateLastStatusUpdate": "2021-07-12T02:48:00Z",
    "MetadataValues": [
        {
            "ID": 16857,
            "MetadataFieldID": 4,
            "ItemValue": "Data from the German chargepoint registry provided by Bundesnetzagentur.de under the CC-BY 4.0 license"
        }
    ],
    "DataQualityLevel": 3,
    "DateCreated": "2021-07-08T10:05:00Z",
    "SubmissionStatusTypeID": 100
}