{
    "IsRecentlyVerified": false,
    "ID": 154912,
    "UUID": "739ACF7C-22A8-4EC6-A8E4-D1259E04287E",
    "DataProviderID": 1,
    "OperatorID": 73,
    "UsageTypeID": 4,
    "AddressInfo": {
        "ID": 155265,
        "Title": "Sowetostraat 2",
        "AddressLine1": "Sowetostraat 2",
        "Town": "Delft",
        "StateOrProvince": "Zuid-Holland",
        "Postcode": "2622LA",
        "CountryID": 159,
        "Latitude": 51.981313294692,
        "Longitude": 4.338029529359346,
        "DistanceUnit": 0
    },
    "Connections": [
        {
            "ID": 218014,
            "ConnectionTypeID": 25,
            "StatusTypeID": 50,
            "LevelID": 2,
            "PowerKW": 11,
            "CurrentTypeID": 20,
            "Quantity": 2
        }
    ],
    "NumberOfPoints": 2,
    "StatusTypeID": 50,
    "DateLastStatusUpdate": "2020-03-22T08:55:00Z",
    "DataQualityLevel": 1,
    "DateCreated": "2020-03-21T08:46:00Z",
    "SubmissionStatusTypeID": 200
}