{
    "IsRecentlyVerified": false,
    "ID": 77087,
    "UUID": "007EA568-AF17-4ECE-B015-1D6FD496162C",
    "DataProviderID": 1,
    "OperatorID": 69,
    "UsageTypeID": 4,
    "AddressInfo": {
        "ID": 77433,
        "Title": "Erdgas Schwaben",
        "AddressLine1": "Dieselstraße 23",
        "Town": "Kempten (Allgäu)",
        "StateOrProvince": "Kempten (Allgäu)",
        "Postcode": "87437",
        "CountryID": 87,
        "Latitude": 47.75709,
        "Longitude": 10.316689999999994,
        "AccessComments": "Rund um die Uhr (24/7) nutzbar\r\n",
        "DistanceUnit": 0
    },
    "Connections": [
        {
            "ID": 110738,
            "ConnectionTypeID": 25,
            "StatusTypeID": 50,
            "LevelID": 2,
            "Amps": 32,
            "Voltage": 400,
            "PowerKW": 22,
            "CurrentTypeID": 20,
            "Quantity": 2
        },
        {
            "ID": 110739,
            "ConnectionTypeID": 28,
            "StatusTypeID": 50,
            "LevelID": 2,
            "Amps": 16,
            "Voltage": 230,
            "PowerKW": 3.7,
            "CurrentTypeID": 10,
            "Quantity": 2
        }
    ],
    "NumberOfPoints": 4,
    "StatusTypeID": 50,
    "DateLastStatusUpdate": "2016-12-30T22:06:00Z",
    "DataQualityLevel": 1,
    "DateCreated": "2016-12-30T22:06:00Z",
    "SubmissionStatusTypeID": 200
}