{
    "IsRecentlyVerified": false,
    "ID": 106088,
    "UUID": "4A5E60D4-4FD3-4988-B943-1A28EACBC0CA",
    "DataProviderID": 1,
    "OperatorID": 23,
    "OperatorsReference": "34481",
    "UsageTypeID": 4,
    "UsageCost": "$0.22/kWh; other tariffs for older cars",
    "AddressInfo": {
        "ID": 106434,
        "Title": "Kennebunk, Me Supercharger",
        "AddressLine1": "25.5 Mile Maine Turnpike",
        "Town": "Kennebunk",
        "StateOrProvince": "ME",
        "Postcode": "04043",
        "CountryID": 2,
        "Latitude": 43.4095,
        "Longitude": -70.558523,
        "DistanceUnit": 0
    },
    "Connections": [
        {
            "ID": 149408,
            "ConnectionTypeID": 27,
            "StatusTypeID": 50,
            "LevelID": 3,
            "PowerKW": 120,
            "CurrentTypeID": 30,
            "Quantity": 8
        }
    ],
    "NumberOfPoints": 8,
    "GeneralComments": "Charging8 Superchargers, available 24/7, up to 120kW",
    "StatusTypeID": 50,
    "DateLastStatusUpdate": "2018-06-15T05:31:00Z",
    "DataQualityLevel": 1,
    "DateCreated": "2018-06-15T05:31:00Z",
    "SubmissionStatusTypeID": 200
}