{
    "IsRecentlyVerified": false,
    "ID": 113769,
    "UUID": "974D6F9F-D254-464F-BCA2-7812400B60E1",
    "DataProviderID": 1,
    "OperatorID": 23,
    "OperatorsReference": "47054",
    "UsageTypeID": 4,
    "UsageCost": "HKD 2.90/kWh; /other tariffs for older cars",
    "AddressInfo": {
        "ID": 114115,
        "Title": "Hong Kong - Landmark North",
        "AddressLine1": "Hong Kong",
        "CountryID": 4,
        "Latitude": 22.50271,
        "Longitude": 114.12782,
        "DistanceUnit": 0
    },
    "Connections": [
        {
            "ID": 160339,
            "ConnectionTypeID": 27,
            "StatusTypeID": 50,
            "LevelID": 3,
            "PowerKW": 120,
            "CurrentTypeID": 30,
            "Quantity": 4
        }
    ],
    "NumberOfPoints": 4,
    "GeneralComments": "2 superchargers, available 24/7, up to 120kW",
    "StatusTypeID": 50,
    "DateLastStatusUpdate": "2019-03-23T07:44:00Z",
    "DataQualityLevel": 1,
    "DateCreated": "2019-01-02T21:32:00Z",
    "SubmissionStatusTypeID": 200
}