{
    "IsRecentlyVerified": false,
    "ID": 175775,
    "UUID": "3C66145B-31CE-4005-9636-B5DFE04F3D45",
    "DataProviderID": 1,
    "OperatorID": 73,
    "UsageTypeID": 6,
    "UsageCost": "Paying charging station",
    "AddressInfo": {
        "ID": 176134,
        "Title": "Agriturismo Borgo Valle Rita",
        "AddressLine1": "Contrada Girifalco",
        "Town": "Ginosa",
        "StateOrProvince": "Apulia",
        "Postcode": "74013",
        "CountryID": 112,
        "Latitude": 40.5138348,
        "Longitude": 16.3980533,
        "ContactTelephone1": "+393358107704",
        "DistanceUnit": 0
    },
    "Connections": [
        {
            "ID": 272977,
            "ConnectionTypeID": 25,
            "StatusTypeID": 50,
            "LevelID": 2,
            "Amps": 32,
            "Voltage": 230,
            "PowerKW": 7.4,
            "CurrentTypeID": 10,
            "Quantity": 1
        }
    ],
    "NumberOfPoints": 1,
    "StatusTypeID": 50,
    "DateLastStatusUpdate": "2021-06-14T18:24:00Z",
    "DataQualityLevel": 1,
    "DateCreated": "2021-06-14T08:28:00Z",
    "SubmissionStatusTypeID": 200
}