{
    "IsRecentlyVerified": false,
    "ID": 184348,
    "UUID": "6E25D29B-44D2-4C1E-956E-DAC6978C32A9",
    "DataProviderID": 29,
    "DataProvidersReference": "7484",
    "OperatorID": 127,
    "AddressInfo": {
        "ID": 184707,
        "Title": "Verdener Straße 13",
        "AddressLine1": "Verdener Straße 13",
        "Town": "Rotenburg (Wümme)",
        "Postcode": "27356",
        "CountryID": 87,
        "Latitude": 53.102591999514,
        "Longitude": 9.394758939743,
        "DistanceUnit": 0
    },
    "Connections": [
        {
            "ID": 292510,
            "ConnectionTypeID": 25,
            "StatusTypeID": 50,
            "LevelID": 2,
            "PowerKW": 22,
            "CurrentTypeID": 20
        },
        {
            "ID": 292511,
            "ConnectionTypeID": 25,
            "StatusTypeID": 50,
            "LevelID": 2,
            "PowerKW": 22,
            "CurrentTypeID": 20
        }
    ],
    "StatusTypeID": 50,
    "DateLastStatusUpdate": "2021-07-12T02:50:00Z",
    "MetadataValues": [
        {
            "ID": 16639,
            "MetadataFieldID": 4,
            "ItemValue": "Data from the German chargepoint registry provided by Bundesnetzagentur.de under the CC-BY 4.0 license"
        }
    ],
    "DataQualityLevel": 3,
    "DateCreated": "2021-07-08T10:05:00Z",
    "SubmissionStatusTypeID": 100
}