{
    "IsRecentlyVerified": false,
    "ID": 106014,
    "UUID": "EB884EFE-7958-49BD-A076-7595E34EB28A",
    "DataProviderID": 1,
    "OperatorID": 80,
    "UsageTypeID": 4,
    "AddressInfo": {
        "ID": 106360,
        "Title": "EnelX Conad Magione",
        "AddressLine1": "Via dei Molini",
        "Town": "Magione",
        "StateOrProvince": "PG",
        "Postcode": "06063",
        "CountryID": 112,
        "Latitude": 43.131693354590034,
        "Longitude": 12.205666478244439,
        "ContactTelephone1": "800.069.850",
        "RelatedURL": "https://www.enelx.com/it/it/emobility",
        "DistanceUnit": 0
    },
    "Connections": [
        {
            "ID": 149313,
            "ConnectionTypeID": 25,
            "StatusTypeID": 50,
            "LevelID": 2,
            "Amps": 32,
            "Voltage": 400,
            "PowerKW": 22,
            "CurrentTypeID": 20,
            "Quantity": 1
        },
        {
            "ID": 149314,
            "ConnectionTypeID": 36,
            "StatusTypeID": 50,
            "LevelID": 2,
            "Amps": 16,
            "Voltage": 240,
            "PowerKW": 3.7,
            "CurrentTypeID": 10,
            "Quantity": 1
        }
    ],
    "NumberOfPoints": 2,
    "StatusTypeID": 50,
    "DateLastStatusUpdate": "2018-06-13T16:25:00Z",
    "DataQualityLevel": 1,
    "DateCreated": "2018-06-13T16:25:00Z",
    "SubmissionStatusTypeID": 200
}