{
    "MediaItems": [
        {
            "ID": 21393,
            "ChargePointID": 95130,
            "ItemURL": "https://s3-ap-southeast-2.amazonaws.com/openchargemap/images/IT/OCM95130/OCM-95130.orig.2020030114473349.jpg",
            "ItemThumbnailURL": "https://s3-ap-southeast-2.amazonaws.com/openchargemap/images/IT/OCM95130/OCM-95130.thmb.2020030114473349.jpg",
            "Comment": "",
            "IsEnabled": true,
            "IsVideo": false,
            "IsFeaturedItem": false,
            "IsExternalResource": false,
            "User": {
                "ID": 1606,
                "Username": "polianto"
            },
            "DateCreated": "2020-03-01T14:48:00Z"
        },
        {
            "ID": 21394,
            "ChargePointID": 95130,
            "ItemURL": "https://s3-ap-southeast-2.amazonaws.com/openchargemap/images/IT/OCM95130/OCM-95130.orig.2020030114475025.jpg",
            "ItemThumbnailURL": "https://s3-ap-southeast-2.amazonaws.com/openchargemap/images/IT/OCM95130/OCM-95130.thmb.2020030114475025.jpg",
            "Comment": "",
            "IsEnabled": true,
            "IsVideo": false,
            "IsFeaturedItem": false,
            "IsExternalResource": false,
            "User": {
                "ID": 1606,
                "Username": "polianto"
            },
            "DateCreated": "2020-03-01T14:48:00Z"
        },
        {
            "ID": 21392,
            "ChargePointID": 95130,
            "ItemURL": "https://s3-ap-southeast-2.amazonaws.com/openchargemap/images/IT/OCM95130/OCM-95130.orig.2020030114470790.jpg",
            "ItemThumbnailURL": "https://s3-ap-southeast-2.amazonaws.com/openchargemap/images/IT/OCM95130/OCM-95130.thmb.2020030114470790.jpg",
            "Comment": "",
            "IsEnabled": true,
            "IsVideo": false,
            "IsFeaturedItem": false,
            "IsExternalResource": false,
            "User": {
                "ID": 1606,
                "Username": "polianto"
            },
            "DateCreated": "2020-03-01T14:47:00Z"
        },
        {
            "ID": 21391,
            "ChargePointID": 95130,
            "ItemURL": "https://s3-ap-southeast-2.amazonaws.com/openchargemap/images/IT/OCM95130/OCM-95130.orig.2020030114430163.jpg",
            "ItemThumbnailURL": "https://s3-ap-southeast-2.amazonaws.com/openchargemap/images/IT/OCM95130/OCM-95130.thmb.2020030114430163.jpg",
            "Comment": "",
            "IsEnabled": true,
            "IsVideo": false,
            "IsFeaturedItem": false,
            "IsExternalResource": false,
            "User": {
                "ID": 1606,
                "Username": "polianto"
            },
            "DateCreated": "2020-03-01T14:43:00Z"
        }
    ],
    "IsRecentlyVerified": false,
    "ID": 95130,
    "UUID": "522BD9BB-1418-4639-BA6D-3230B11014E5",
    "DataProviderID": 1,
    "OperatorID": 164,
    "UsageTypeID": 4,
    "AddressInfo": {
        "ID": 95476,
        "Title": "Parcheggio Galvani | Neogy",
        "AddressLine1": "Via Luigi Galvani, 34",
        "Town": "Bolzano",
        "StateOrProvince": "BZ",
        "Postcode": "39100",
        "CountryID": 112,
        "Latitude": 46.47220064840906,
        "Longitude": 11.330587671771582,
        "DistanceUnit": 0
    },
    "Connections": [
        {
            "ID": 134794,
            "ConnectionTypeID": 25,
            "StatusTypeID": 50,
            "LevelID": 2,
            "Amps": 32,
            "Voltage": 400,
            "PowerKW": 22,
            "CurrentTypeID": 20,
            "Quantity": 2
        }
    ],
    "NumberOfPoints": 2,
    "GeneralComments": "Non utilizzabile durante le partite di Hockey - Comoda per andare al THUNIVERSUM",
    "StatusTypeID": 50,
    "DateLastStatusUpdate": "2020-03-01T14:50:00Z",
    "DataQualityLevel": 1,
    "DateCreated": "2017-11-03T11:42:00Z",
    "SubmissionStatusTypeID": 200
}