{
    "IsRecentlyVerified": false,
    "ID": 51485,
    "UUID": "5342A9F2-2488-44DC-9E3B-590ED28E3B16",
    "DataProviderID": 1,
    "OperatorID": 69,
    "UsageTypeID": 4,
    "AddressInfo": {
        "ID": 51831,
        "Title": "Birnauer Straße",
        "AddressLine1": "Birnauer Straße 1",
        "AddressLine2": "Bezirksteil Am Luitpoldpark",
        "Town": "München",
        "StateOrProvince": "Bayern",
        "Postcode": "80809",
        "CountryID": 87,
        "Latitude": 48.1750069299831,
        "Longitude": 11.5657038478851,
        "ContactTelephone1": "+49 89 23612030",
        "AccessComments": "Kostenloses Laden auf 2 kostenpflichtigen Parkplätzen. Ladenetz-Registrierung oder Ladekarte von EWE,WSW,TNM, Charge&Fuel oder ladeticket erforderlich. 24/7 geöffnet.",
        "RelatedURL": "http://www.swm.de/privatkunden/m-strom/autofahren.html",
        "DistanceUnit": 0
    },
    "Connections": [
        {
            "ID": 63784,
            "ConnectionTypeID": 25,
            "StatusTypeID": 50,
            "LevelID": 2,
            "Amps": 32,
            "Voltage": 400,
            "PowerKW": 22,
            "CurrentTypeID": 20,
            "Quantity": 2
        }
    ],
    "NumberOfPoints": 2,
    "StatusTypeID": 50,
    "DateLastStatusUpdate": "2015-07-27T11:41:00Z",
    "DataQualityLevel": 1,
    "DateCreated": "2015-07-27T08:27:00Z",
    "SubmissionStatusTypeID": 200
}