{
    "IsRecentlyVerified": false,
    "ID": 27848,
    "UUID": "BE8D6449-B0FD-4A5F-BD4A-9969293A436D",
    "DataProviderID": 2,
    "DataProvidersReference": "52917",
    "UsageTypeID": 2,
    "AddressInfo": {
        "ID": 28194,
        "Title": "Westar Energy - Salina Service Center",
        "AddressLine1": "1001 Edison Pl",
        "Town": "Salina",
        "StateOrProvince": "KS",
        "Postcode": "67401",
        "CountryID": 2,
        "Latitude": 38.832299,
        "Longitude": -97.595897,
        "ContactTelephone1": "",
        "AccessComments": "Fleet use only",
        "RelatedURL": "",
        "DistanceUnit": 0
    },
    "Connections": [
        {
            "ID": 30577,
            "ConnectionTypeID": 1,
            "LevelID": 2,
            "Amps": 16,
            "Voltage": 230,
            "PowerKW": 3,
            "CurrentTypeID": 10,
            "Quantity": 1
        }
    ],
    "DateLastStatusUpdate": "2019-04-06T04:03:00Z",
    "DataQualityLevel": 3,
    "DateCreated": "2014-11-28T03:38:00Z",
    "SubmissionStatusTypeID": 100
}