{
    "IsRecentlyVerified": false,
    "ID": 99684,
    "UUID": "40490F4D-8AB9-457C-A2AC-6BB824F0C1F2",
    "DataProviderID": 1,
    "OperatorID": 23,
    "OperatorsReference": "40170",
    "UsageTypeID": 4,
    "AddressInfo": {
        "ID": 100030,
        "Title": "Flackley Ash Hotel & Restaurant",
        "AddressLine1": "Mackerel Hill",
        "Town": "Peamarsh",
        "StateOrProvince": "East Sussex",
        "Postcode": "TN31 6YH",
        "CountryID": 1,
        "Latitude": 50.978348,
        "Longitude": 0.676587,
        "ContactTelephone1": "+44 179 723 0651",
        "DistanceUnit": 0
    },
    "Connections": [
        {
            "ID": 140829,
            "ConnectionTypeID": 30,
            "StatusTypeID": 50,
            "LevelID": 2,
            "Amps": 32,
            "Voltage": 230,
            "PowerKW": 7,
            "CurrentTypeID": 10,
            "Quantity": 2
        }
    ],
    "NumberOfPoints": 2,
    "GeneralComments": "2 Tesla Connectors, up to 7kW.Available for customers. Please see front desk.",
    "StatusTypeID": 50,
    "DateLastStatusUpdate": "2018-10-03T20:55:00Z",
    "DataQualityLevel": 1,
    "DateCreated": "2018-02-01T07:10:00Z",
    "SubmissionStatusTypeID": 200
}