{
    "IsRecentlyVerified": false,
    "ID": 137887,
    "UUID": "DD14DDF4-5531-45DF-9A6F-BB8E53C9F737",
    "DataProviderID": 2,
    "DataProvidersReference": "122985",
    "OperatorID": 3318,
    "UsageTypeID": 1,
    "AddressInfo": {
        "ID": 138236,
        "Title": "Target T1829 - N Charleston, SC",
        "AddressLine1": "7250 Rivers Ave",
        "Town": "North Charleston",
        "StateOrProvince": "SC",
        "Postcode": "29406",
        "CountryID": 2,
        "Latitude": 32.935257,
        "Longitude": -80.037095,
        "ContactTelephone1": "833-632-2778",
        "AccessComments": "24 hours daily",
        "RelatedURL": "https://www.electrifyamerica.com/",
        "DistanceUnit": 0
    },
    "Connections": [
        {
            "ID": 192908,
            "ConnectionTypeID": 2,
            "LevelID": 3,
            "Amps": 100,
            "Voltage": 400,
            "PowerKW": 40,
            "CurrentTypeID": 30,
            "Quantity": 1
        },
        {
            "ID": 192909,
            "ConnectionTypeID": 32,
            "LevelID": 3,
            "Amps": 100,
            "Voltage": 400,
            "PowerKW": 40,
            "CurrentTypeID": 30,
            "Quantity": 1
        }
    ],
    "StatusTypeID": 50,
    "DateLastStatusUpdate": "2019-12-24T09:06:00Z",
    "DataQualityLevel": 3,
    "DateCreated": "2019-12-24T09:06:00Z",
    "SubmissionStatusTypeID": 100
}