{
    "IsRecentlyVerified": false,
    "ID": 163411,
    "UUID": "639E7995-4A9A-4168-A656-603451156646",
    "DataProviderID": 1,
    "OperatorID": 21,
    "UsageTypeID": 4,
    "UsageCost": "Mobi.E compatible card",
    "AddressInfo": {
        "ID": 163768,
        "Title": "GRD-00008",
        "AddressLine1": "A23 km 213",
        "Town": "Guarda",
        "StateOrProvince": "Centro",
        "Postcode": "",
        "CountryID": 180,
        "Latitude": 40.54459139839503,
        "Longitude": -7.216389858458797,
        "AccessComments": "Southbound",
        "DistanceUnit": 0
    },
    "Connections": [
        {
            "ID": 234993,
            "ConnectionTypeID": 2,
            "StatusTypeID": 50,
            "LevelID": 3,
            "Amps": 120,
            "Voltage": 500,
            "PowerKW": 50,
            "CurrentTypeID": 30,
            "Quantity": 1
        },
        {
            "ID": 234994,
            "ConnectionTypeID": 33,
            "StatusTypeID": 50,
            "LevelID": 3,
            "Amps": 125,
            "Voltage": 500,
            "PowerKW": 50,
            "CurrentTypeID": 30,
            "Quantity": 1
        },
        {
            "ID": 234995,
            "ConnectionTypeID": 1036,
            "StatusTypeID": 50,
            "LevelID": 3,
            "Amps": 64,
            "Voltage": 400,
            "PowerKW": 43,
            "CurrentTypeID": 20,
            "Quantity": 1
        }
    ],
    "NumberOfPoints": 2,
    "StatusTypeID": 150,
    "DateLastStatusUpdate": "2020-08-23T18:54:00Z",
    "DataQualityLevel": 1,
    "DateCreated": "2020-08-23T18:54:00Z",
    "SubmissionStatusTypeID": 200
}