{
    "IsRecentlyVerified": false,
    "ID": 183089,
    "UUID": "0B249CF3-D6B3-49BC-9EC0-C475D702141B",
    "DataProviderID": 29,
    "DataProvidersReference": "3890",
    "OperatorID": 220,
    "AddressInfo": {
        "ID": 183448,
        "Title": "Wendenstraße 473",
        "AddressLine1": "Wendenstraße 473",
        "Town": "Hamburg",
        "Postcode": "20537",
        "CountryID": 87,
        "Latitude": 53.54966,
        "Longitude": 10.05669,
        "DistanceUnit": 0
    },
    "Connections": [
        {
            "ID": 289644,
            "ConnectionTypeID": 28,
            "StatusTypeID": 50,
            "LevelID": 2,
            "PowerKW": 22,
            "CurrentTypeID": 20
        },
        {
            "ID": 289645,
            "ConnectionTypeID": 25,
            "StatusTypeID": 50,
            "LevelID": 2,
            "PowerKW": 22,
            "CurrentTypeID": 20
        },
        {
            "ID": 301538,
            "ConnectionTypeID": 28,
            "StatusTypeID": 50,
            "LevelID": 2,
            "PowerKW": 22,
            "CurrentTypeID": 20
        },
        {
            "ID": 301539,
            "ConnectionTypeID": 25,
            "StatusTypeID": 50,
            "LevelID": 2,
            "PowerKW": 22,
            "CurrentTypeID": 20
        }
    ],
    "StatusTypeID": 50,
    "DateLastStatusUpdate": "2021-07-12T02:51:00Z",
    "MetadataValues": [
        {
            "ID": 15382,
            "MetadataFieldID": 4,
            "ItemValue": "Data from the German chargepoint registry provided by Bundesnetzagentur.de under the CC-BY 4.0 license"
        }
    ],
    "DataQualityLevel": 3,
    "DateCreated": "2021-07-08T10:03:00Z",
    "SubmissionStatusTypeID": 100
}