{
    "IsRecentlyVerified": false,
    "ID": 150552,
    "UUID": "407F8EDA-630C-4E50-8515-3E8E3B606E15",
    "DataProviderID": 28,
    "DataProvidersReference": "FR*M13*P13075*002",
    "UsageTypeID": 5,
    "AddressInfo": {
        "ID": 150905,
        "Title": "PLAN-DE-CUQUES - Avenue Georges Pompidou",
        "AddressLine1": "Avenue Georges Pompidou 13380 PLAN-DE-CUQUES",
        "CountryID": 80,
        "Latitude": 43.343455,
        "Longitude": 5.463668,
        "AccessComments": "24h/24 7j/7",
        "DistanceUnit": 0
    },
    "Connections": [
        {
            "ID": 209430,
            "ConnectionTypeID": 28,
            "StatusTypeID": 50,
            "LevelID": 2,
            "PowerKW": 22,
            "CurrentTypeID": 10
        },
        {
            "ID": 209431,
            "ConnectionTypeID": 1036,
            "StatusTypeID": 50,
            "LevelID": 2,
            "PowerKW": 22,
            "CurrentTypeID": 20
        },
        {
            "ID": 238560,
            "ConnectionTypeID": 28,
            "StatusTypeID": 50,
            "LevelID": 2,
            "PowerKW": 22,
            "CurrentTypeID": 10
        },
        {
            "ID": 238561,
            "ConnectionTypeID": 1036,
            "StatusTypeID": 50,
            "LevelID": 2,
            "PowerKW": 22,
            "CurrentTypeID": 20
        }
    ],
    "GeneralComments": "Recharge par badge et avec une application smartphone",
    "StatusTypeID": 50,
    "DateLastStatusUpdate": "2020-08-27T05:10:00Z",
    "DataQualityLevel": 2,
    "DateCreated": "2020-03-15T06:17:00Z",
    "SubmissionStatusTypeID": 100
}