{
    "IsRecentlyVerified": false,
    "ID": 84474,
    "UUID": "7735767C-EABA-4509-8681-C0C0C4A333C2",
    "DataProviderID": 1,
    "OperatorID": 45,
    "UsageTypeID": 6,
    "AddressInfo": {
        "ID": 84820,
        "Title": "Gasthof Zum Großen Krug",
        "AddressLine1": "Grimersumer Straße 6",
        "Town": "Wirdum",
        "StateOrProvince": "Samtgemeinde Brookmerland",
        "Postcode": "26529",
        "CountryID": 87,
        "Latitude": 53.47942315381846,
        "Longitude": 7.205740203704849,
        "ContactTelephone1": "+49 4920 213",
        "AccessComments": "Laden für Hotel- und Restaurantgäste kostenlos nach Freischaltung an der Rezeption. CEE Dose am Schuppen neben dem Tor.",
        "RelatedURL": "http://www.zum-grossen-krug.de/",
        "DistanceUnit": 0
    },
    "Connections": [
        {
            "ID": 119935,
            "ConnectionTypeID": 17,
            "StatusTypeID": 50,
            "LevelID": 2,
            "Amps": 16,
            "Voltage": 400,
            "PowerKW": 11,
            "CurrentTypeID": 20,
            "Quantity": 1
        }
    ],
    "NumberOfPoints": 1,
    "StatusTypeID": 50,
    "DateLastStatusUpdate": "2017-02-28T08:21:00Z",
    "DataQualityLevel": 1,
    "DateCreated": "2017-02-28T08:21:00Z",
    "SubmissionStatusTypeID": 200
}