{
    "IsRecentlyVerified": false,
    "ID": 108631,
    "UUID": "68AA9C2B-7060-48D6-8360-6728541F2FDC",
    "DataProviderID": 1,
    "OperatorID": 1,
    "UsageTypeID": 1,
    "AddressInfo": {
        "ID": 108977,
        "Title": "Hoek Gijsbrecht van Amstelstraat en Oude Loosdrechtseweg",
        "AddressLine1": "Gijsbrecht van Amstelstraat",
        "AddressLine2": "Hilversum",
        "StateOrProvince": "Noord-Holland",
        "Postcode": "1215CM",
        "CountryID": 159,
        "Latitude": 52.21624793157964,
        "Longitude": 5.161669539887498,
        "DistanceUnit": 0
    },
    "Connections": [
        {
            "ID": 153709,
            "ConnectionTypeID": 1,
            "LevelID": 2,
            "PowerKW": 11
        }
    ],
    "NumberOfPoints": 1,
    "StatusTypeID": 50,
    "DateLastStatusUpdate": "2018-10-14T15:01:00Z",
    "DataQualityLevel": 1,
    "DateCreated": "2018-10-08T09:02:00Z",
    "SubmissionStatusTypeID": 200
}