{
    "IsRecentlyVerified": false,
    "ID": 144359,
    "UUID": "582D1619-03E5-4C99-B696-A66DFAA407DC",
    "DataProviderID": 2,
    "DataProvidersReference": "96409",
    "OperatorID": 9,
    "UsageTypeID": 1,
    "AddressInfo": {
        "ID": 144711,
        "Title": "FRED MEYER - Corporate Office - Portland OR",
        "AddressLine1": "3800 SE 22nd Ave",
        "Town": "Portland",
        "StateOrProvince": "OR",
        "Postcode": "97202",
        "CountryID": 2,
        "Latitude": 45.495842,
        "Longitude": -122.641314,
        "ContactTelephone1": "888-998-2546",
        "AccessComments": "MON: 24 hours | TUE: 24 hours | WED: 24 hours | THU: 24 hours | FRI: 24 hours | SAT: 24 hours | SUN: 24 hours",
        "RelatedURL": "http://www.blinkcharging.com/",
        "DistanceUnit": 0
    },
    "Connections": [
        {
            "ID": 200858,
            "ConnectionTypeID": 1,
            "LevelID": 2,
            "Amps": 16,
            "Voltage": 230,
            "PowerKW": 3.7,
            "CurrentTypeID": 10,
            "Quantity": 2
        }
    ],
    "StatusTypeID": 50,
    "DateLastStatusUpdate": "2020-06-26T03:09:00Z",
    "DataQualityLevel": 3,
    "DateCreated": "2019-12-24T09:23:00Z",
    "SubmissionStatusTypeID": 100
}