{
    "IsRecentlyVerified": false,
    "ID": 170413,
    "UUID": "4601C9AC-269C-47A6-90EF-42FD700C6726",
    "DataProviderID": 1,
    "OperatorID": 3420,
    "UsageTypeID": 4,
    "UsageCost": "Start fee: 1.5RON, Parking: 6RON/h, Energy: 1.19RON/kWh",
    "AddressInfo": {
        "ID": 170772,
        "Title": "Barrels pub",
        "AddressLine1": "Bulevardul Mamaia",
        "Town": "Constanța",
        "StateOrProvince": "Constanța",
        "CountryID": 184,
        "Latitude": 44.25946541355725,
        "Longitude": 28.61890001404481,
        "DistanceUnit": 0
    },
    "Connections": [
        {
            "ID": 259977,
            "ConnectionTypeID": 25,
            "StatusTypeID": 50,
            "LevelID": 2,
            "Amps": 32,
            "PowerKW": 22,
            "CurrentTypeID": 20,
            "Quantity": 1
        },
        {
            "ID": 259978,
            "ConnectionTypeID": 25,
            "StatusTypeID": 50,
            "LevelID": 2,
            "Amps": 32,
            "PowerKW": 22,
            "CurrentTypeID": 20,
            "Quantity": 1
        }
    ],
    "NumberOfPoints": 2,
    "StatusTypeID": 50,
    "DateLastStatusUpdate": "2020-11-26T09:14:00Z",
    "DataQualityLevel": 1,
    "DateCreated": "2020-11-26T07:58:00Z",
    "SubmissionStatusTypeID": 200
}