{
    "IsRecentlyVerified": false,
    "ID": 91986,
    "UUID": "E59FBC0C-4C2D-49D1-A71D-A00B8F1A7602",
    "DataProviderID": 1,
    "OperatorID": 21,
    "UsageTypeID": 4,
    "UsageCost": "Mobi.E compatible card",
    "AddressInfo": {
        "ID": 92332,
        "Title": "ETR-00001",
        "AddressLine1": "A1 km 255 (Sentido Norte/Sul)",
        "Town": "Estarreja",
        "StateOrProvince": "Aveiro",
        "Postcode": "3865",
        "CountryID": 180,
        "Latitude": 40.7558278139301,
        "Longitude": -8.53692206517485,
        "RelatedURL": "http://www.mobie.pt",
        "DistanceUnit": 0
    },
    "Connections": [
        {
            "ID": 130414,
            "ConnectionTypeID": 2,
            "StatusTypeID": 50,
            "LevelID": 3,
            "Amps": 120,
            "Voltage": 500,
            "PowerKW": 50,
            "CurrentTypeID": 30,
            "Quantity": 1
        },
        {
            "ID": 153455,
            "ConnectionTypeID": 33,
            "StatusTypeID": 50,
            "LevelID": 3,
            "Amps": 125,
            "Voltage": 500,
            "PowerKW": 50,
            "CurrentTypeID": 30,
            "Quantity": 1
        },
        {
            "ID": 153456,
            "ConnectionTypeID": 1036,
            "StatusTypeID": 50,
            "LevelID": 3,
            "Amps": 63,
            "Voltage": 400,
            "PowerKW": 43,
            "CurrentTypeID": 20,
            "Quantity": 1
        }
    ],
    "NumberOfPoints": 2,
    "StatusTypeID": 50,
    "DateLastStatusUpdate": "2020-09-14T19:36:00Z",
    "DataQualityLevel": 3,
    "DateCreated": "2017-08-22T13:38:00Z",
    "SubmissionStatusTypeID": 100
}