{
    "IsRecentlyVerified": false,
    "ID": 97694,
    "UUID": "AEA12ED9-F2E0-4A14-B530-D7A5BA900F2C",
    "DataProviderID": 1,
    "OperatorID": 23,
    "OperatorsReference": "39791",
    "UsageTypeID": 4,
    "AddressInfo": {
        "ID": 98040,
        "Title": "Grand Hôtel des Alpes",
        "AddressLine1": "131 Rue du Lyret",
        "Town": "Chamonix-Mont-Blanc",
        "Postcode": "74400",
        "CountryID": 80,
        "Latitude": 45.921368,
        "Longitude": 6.868437,
        "ContactTelephone1": "+33 4 50 55 37 80",
        "DistanceUnit": 0
    },
    "Connections": [
        {
            "ID": 138602,
            "ConnectionTypeID": 30,
            "StatusTypeID": 50,
            "LevelID": 2,
            "Amps": 32,
            "Voltage": 230,
            "PowerKW": 17,
            "CurrentTypeID": 20,
            "Quantity": 1
        }
    ],
    "NumberOfPoints": 1,
    "GeneralComments": "1 Tesla Connector, up to 17kW.Available for customers. Please see front desk.",
    "StatusTypeID": 50,
    "DateLastStatusUpdate": "2018-10-03T17:48:00Z",
    "DataQualityLevel": 1,
    "DateCreated": "2018-01-21T16:25:00Z",
    "SubmissionStatusTypeID": 200
}