{
    "IsRecentlyVerified": false,
    "ID": 110785,
    "UUID": "2270F572-5924-4749-BCA7-E6CF4FACBC2E",
    "DataProviderID": 2,
    "DataProvidersReference": "104009",
    "OperatorID": 39,
    "UsageTypeID": 4,
    "AddressInfo": {
        "ID": 111131,
        "Title": "DMC-8th-2",
        "AddressLine1": "800 West State Street",
        "Town": "Milwaukee",
        "StateOrProvince": "WI",
        "Postcode": "53233",
        "CountryID": 2,
        "Latitude": 43.043185,
        "Longitude": -87.921918,
        "ContactTelephone1": "800-663-5633",
        "AccessComments": "MO: Not Specified; TU: Not Specified; WE: Not Specified; TH: Not Specified; FR: Not Specified; SA: Not Specified; SU: Not Specified",
        "RelatedURL": "http://www.semacharge.com/",
        "DistanceUnit": 0
    },
    "Connections": [
        {
            "ID": 156077,
            "ConnectionTypeID": 1,
            "LevelID": 2,
            "Amps": 16,
            "Voltage": 230,
            "PowerKW": 3,
            "CurrentTypeID": 10,
            "Quantity": 1
        }
    ],
    "DateLastStatusUpdate": "2019-04-06T05:06:00Z",
    "DataQualityLevel": 3,
    "DateCreated": "2018-10-18T23:36:00Z",
    "SubmissionStatusTypeID": 100
}