{
    "IsRecentlyVerified": false,
    "ID": 123307,
    "UUID": "40E4B8D9-DD90-4064-B5FB-7E2BCDA1628F",
    "DataProviderID": 2,
    "DataProvidersReference": "104489",
    "OperatorID": 5,
    "UsageTypeID": 1,
    "AddressInfo": {
        "ID": 123653,
        "Title": "FLOWJLR",
        "AddressLine1": "1205 Bridford Pkwy",
        "Town": "Greensboro",
        "StateOrProvince": "NC",
        "Postcode": "27407",
        "CountryID": 2,
        "Latitude": 36.058572,
        "Longitude": -79.902895,
        "ContactTelephone1": "888-758-4389",
        "AccessComments": "24 hours daily",
        "RelatedURL": "http://www.chargepoint.com/",
        "DistanceUnit": 0
    },
    "Connections": [
        {
            "ID": 173271,
            "ConnectionTypeID": 1,
            "LevelID": 2,
            "Amps": 16,
            "Voltage": 230,
            "PowerKW": 3.7,
            "CurrentTypeID": 10,
            "Quantity": 5
        },
        {
            "ID": 196033,
            "ConnectionTypeID": 32,
            "LevelID": 3,
            "Amps": 100,
            "Voltage": 400,
            "PowerKW": 40,
            "CurrentTypeID": 30,
            "Quantity": 2
        }
    ],
    "DateLastStatusUpdate": "2020-06-26T02:58:00Z",
    "DataQualityLevel": 3,
    "DateCreated": "2019-04-06T05:03:00Z",
    "SubmissionStatusTypeID": 100
}