{
    "IsRecentlyVerified": false,
    "ID": 32638,
    "UUID": "0EC8473C-F3BB-4AE2-869E-0469FF480591",
    "DataProviderID": 26,
    "DataProvidersReference": "17031",
    "OperatorID": 162,
    "OperatorsReference": "Buitenhaven 6",
    "UsageCost": "0.00 gratis",
    "AddressInfo": {
        "ID": 32984,
        "Title": "Zeevaartweg 1",
        "AddressLine1": "Zeevaartweg 1",
        "Town": "Terneuzen",
        "Postcode": "4531 PB",
        "CountryID": 159,
        "Latitude": 51.327352,
        "Longitude": 3.819541,
        "DistanceUnit": 0
    },
    "Connections": [
        {
            "ID": 36149,
            "ConnectionTypeID": 28,
            "LevelID": 1,
            "PowerKW": 2.3,
            "CurrentTypeID": 10
        }
    ],
    "NumberOfPoints": 1,
    "StatusTypeID": 50,
    "DateLastStatusUpdate": "2016-06-04T02:38:00Z",
    "DataQualityLevel": 3,
    "DateCreated": "2015-01-09T06:03:00Z",
    "SubmissionStatusTypeID": 100
}