{
    "IsRecentlyVerified": false,
    "ID": 53860,
    "UUID": "9BAB0A07-D301-465B-93E4-951BC07F99E0",
    "DataProviderID": 26,
    "DataProvidersReference": "69270",
    "OperatorID": 103,
    "OperatorsReference": "Allego NLALLEGO0002851",
    "UsageCost": "0.00 jaarabonnement",
    "AddressInfo": {
        "ID": 54206,
        "Title": "Hercules 169",
        "AddressLine1": "Hercules 169",
        "Town": "Katwijk",
        "Postcode": "2221 MC",
        "CountryID": 159,
        "Latitude": 52.21147343,
        "Longitude": 4.4218147,
        "ContactTelephone1": "0800-3745337",
        "RelatedURL": "http://www.allego.eu/",
        "DistanceUnit": 0
    },
    "Connections": [
        {
            "ID": 67265,
            "ConnectionTypeID": 25,
            "LevelID": 2,
            "PowerKW": 11,
            "CurrentTypeID": 10
        },
        {
            "ID": 67266,
            "ConnectionTypeID": 25,
            "LevelID": 2,
            "PowerKW": 11,
            "CurrentTypeID": 10
        }
    ],
    "NumberOfPoints": 1,
    "StatusTypeID": 50,
    "DateLastStatusUpdate": "2016-06-04T02:51:00Z",
    "DataQualityLevel": 3,
    "DateCreated": "2015-09-20T11:50:00Z",
    "SubmissionStatusTypeID": 100
}