{
    "IsRecentlyVerified": false,
    "ID": 122303,
    "UUID": "8C431FA0-BB94-46EF-9C80-8D96CD40FE78",
    "DataProviderID": 2,
    "DataProvidersReference": "48961",
    "OperatorID": 5,
    "UsageTypeID": 1,
    "AddressInfo": {
        "ID": 122649,
        "Title": "BEVERLY HILLS",
        "AddressLine1": "438 N Beverly Dr",
        "Town": "Beverly Hills",
        "StateOrProvince": "CA",
        "Postcode": "90210",
        "CountryID": 2,
        "Latitude": 34.07088,
        "Longitude": -118.402363,
        "ContactTelephone1": "888-758-4389",
        "AccessComments": "24 hours daily",
        "RelatedURL": "http://www.chargepoint.com/",
        "DistanceUnit": 0
    },
    "Connections": [
        {
            "ID": 172184,
            "ConnectionTypeID": 1,
            "LevelID": 2,
            "Amps": 16,
            "Voltage": 230,
            "PowerKW": 3,
            "CurrentTypeID": 10,
            "Quantity": 4
        }
    ],
    "DateLastStatusUpdate": "2019-12-24T09:11:00Z",
    "DataQualityLevel": 3,
    "DateCreated": "2019-04-06T05:02:00Z",
    "SubmissionStatusTypeID": 100
}