{
    "IsRecentlyVerified": false,
    "ID": 135479,
    "UUID": "54B605AB-AD7B-4912-B478-8DFB82CD0EE0",
    "DataProviderID": 1,
    "OperatorID": 3311,
    "UsageTypeID": 1,
    "AddressInfo": {
        "ID": 135825,
        "Title": "ELEN Mursko Središće",
        "AddressLine1": "Trg Josipa bana Jelačića 9",
        "Town": "Mursko Središće",
        "StateOrProvince": "Međimurska županija",
        "Postcode": "40315",
        "CountryID": 60,
        "Latitude": 46.5140439730975,
        "Longitude": 16.43935182593475,
        "RelatedURL": "https://elen.hep.hr/",
        "DistanceUnit": 0
    },
    "Connections": [
        {
            "ID": 189816,
            "ConnectionTypeID": 33,
            "StatusTypeID": 50,
            "LevelID": 3,
            "PowerKW": 50,
            "CurrentTypeID": 30,
            "Quantity": 1
        },
        {
            "ID": 189817,
            "ConnectionTypeID": 2,
            "StatusTypeID": 50,
            "LevelID": 3,
            "PowerKW": 50,
            "CurrentTypeID": 30,
            "Quantity": 1
        },
        {
            "ID": 189820,
            "ConnectionTypeID": 1036,
            "StatusTypeID": 50,
            "LevelID": 3,
            "Amps": 63,
            "Voltage": 400,
            "PowerKW": 43,
            "CurrentTypeID": 20,
            "Quantity": 1
        }
    ],
    "NumberOfPoints": 1,
    "GeneralComments": "50 kW DC CCS + Chademo, AC Type2\r\nOpen 24/7",
    "StatusTypeID": 50,
    "DateLastStatusUpdate": "2019-12-23T09:23:00Z",
    "DataQualityLevel": 1,
    "DateCreated": "2019-12-22T17:09:00Z",
    "SubmissionStatusTypeID": 200
}