{
    "IsRecentlyVerified": false,
    "ID": 66296,
    "UUID": "4D3FE37C-61D8-4AEA-9EAC-3830883493D8",
    "DataProviderID": 1,
    "OperatorID": 3,
    "OperatorsReference": "PG-80401",
    "UsageTypeID": 2,
    "UsageCost": "Free",
    "AddressInfo": {
        "ID": 66642,
        "Title": "Park Road",
        "AddressLine1": "Park Road",
        "Town": "Peterborough",
        "Postcode": "PE1 2TR",
        "CountryID": 1,
        "Latitude": 52.575149,
        "Longitude": -0.243121,
        "DistanceUnit": 0
    },
    "Connections": [
        {
            "ID": 91655,
            "ConnectionTypeID": 25,
            "StatusTypeID": 100,
            "LevelID": 2,
            "Amps": 32,
            "Voltage": 230,
            "PowerKW": 3,
            "CurrentTypeID": 10,
            "Quantity": 1
        },
        {
            "ID": 135381,
            "ConnectionTypeID": 25,
            "StatusTypeID": 100,
            "LevelID": 2,
            "Amps": 32,
            "Voltage": 230,
            "PowerKW": 7,
            "CurrentTypeID": 10,
            "Quantity": 1
        }
    ],
    "NumberOfPoints": 2,
    "StatusTypeID": 100,
    "DateLastStatusUpdate": "2018-01-21T06:30:00Z",
    "DataQualityLevel": 1,
    "DateCreated": "2016-05-17T10:43:00Z",
    "SubmissionStatusTypeID": 200
}