{
    "IsRecentlyVerified": false,
    "ID": 145557,
    "UUID": "E52CA099-4980-4ADE-9A4D-A37532CBEDB5",
    "DataProviderID": 2,
    "DataProvidersReference": "143944",
    "OperatorID": 90,
    "UsageTypeID": 1,
    "AddressInfo": {
        "ID": 145909,
        "Title": "Municipalité de Petit-Saguenay",
        "AddressLine1": "60 rue Dumas",
        "Town": "Petit-Saguenay",
        "StateOrProvince": "QC",
        "Postcode": "G0V 1N0",
        "CountryID": 44,
        "Latitude": 48.209028,
        "Longitude": -70.067476,
        "ContactTelephone1": "877-505-2674",
        "AccessComments": "24 hours daily",
        "RelatedURL": "https://lecircuitelectrique.com/",
        "DistanceUnit": 0
    },
    "Connections": [
        {
            "ID": 202266,
            "ConnectionTypeID": 1,
            "LevelID": 2,
            "Amps": 16,
            "Voltage": 230,
            "PowerKW": 3.7,
            "CurrentTypeID": 10,
            "Quantity": 1
        }
    ],
    "StatusTypeID": 50,
    "DateLastStatusUpdate": "2020-06-26T03:11:00Z",
    "DataQualityLevel": 3,
    "DateCreated": "2019-12-24T09:25:00Z",
    "SubmissionStatusTypeID": 100
}