{
    "IsRecentlyVerified": false,
    "ID": 66598,
    "UUID": "90EA21DD-0202-4C99-AA75-E50652DB5548",
    "DataProviderID": 1,
    "OperatorID": 22,
    "OperatorsReference": "C54BQ",
    "UsageTypeID": 4,
    "AddressInfo": {
        "ID": 66944,
        "Title": "Tourist Office Car Park",
        "AddressLine1": "R173",
        "Town": "Carlingford",
        "StateOrProvince": "County Louth",
        "CountryID": 3,
        "Latitude": 54.040456,
        "Longitude": -6.185322,
        "DistanceUnit": 0
    },
    "Connections": [
        {
            "ID": 92019,
            "ConnectionTypeID": 25,
            "StatusTypeID": 75,
            "LevelID": 2,
            "Amps": 32,
            "Voltage": 400,
            "PowerKW": 22,
            "CurrentTypeID": 20,
            "Quantity": 2
        }
    ],
    "NumberOfPoints": 2,
    "StatusTypeID": 75,
    "DateLastStatusUpdate": "2019-06-06T05:43:00Z",
    "DataQualityLevel": 1,
    "DateCreated": "2016-05-23T14:30:00Z",
    "SubmissionStatusTypeID": 100
}