{
    "IsRecentlyVerified": false,
    "ID": 186350,
    "UUID": "3340BEAF-C9E4-4030-A698-DDDD8B4475B6",
    "DataProviderID": 29,
    "DataProvidersReference": "4775",
    "AddressInfo": {
        "ID": 186709,
        "Title": "Schwanenstr. 129z",
        "AddressLine1": "Schwanenstr. 129z",
        "Town": "Solingen",
        "Postcode": "42697",
        "CountryID": 87,
        "Latitude": 51.15505,
        "Longitude": 6.98417,
        "DistanceUnit": 0
    },
    "Connections": [
        {
            "ID": 298821,
            "ConnectionTypeID": 25,
            "StatusTypeID": 50,
            "LevelID": 2,
            "PowerKW": 22,
            "CurrentTypeID": 20
        },
        {
            "ID": 298822,
            "ConnectionTypeID": 25,
            "StatusTypeID": 50,
            "LevelID": 2,
            "PowerKW": 22,
            "CurrentTypeID": 20
        }
    ],
    "StatusTypeID": 50,
    "DateLastStatusUpdate": "2021-07-12T02:46:00Z",
    "MetadataValues": [
        {
            "ID": 18591,
            "MetadataFieldID": 4,
            "ItemValue": "Data from the German chargepoint registry provided by Bundesnetzagentur.de under the CC-BY 4.0 license"
        }
    ],
    "DataQualityLevel": 3,
    "DateCreated": "2021-07-12T02:46:00Z",
    "SubmissionStatusTypeID": 100
}