{
    "IsRecentlyVerified": false,
    "ID": 119361,
    "UUID": "B9B330AE-A346-409B-9FB0-A2AE8C808B14",
    "DataProviderID": 2,
    "DataProvidersReference": "66915",
    "UsageTypeID": 1,
    "AddressInfo": {
        "ID": 119707,
        "Title": "BMW of Kona",
        "AddressLine1": "74-5533 Loloku St",
        "Town": "Kailua-Kona",
        "StateOrProvince": "HI",
        "Postcode": "96740",
        "CountryID": 2,
        "Latitude": 19.64405,
        "Longitude": -156.00273,
        "ContactTelephone1": "866-670-3357",
        "AccessComments": "24 hours daily",
        "RelatedURL": "",
        "DistanceUnit": 0
    },
    "Connections": [
        {
            "ID": 168611,
            "ConnectionTypeID": 1,
            "LevelID": 2,
            "Amps": 16,
            "Voltage": 230,
            "PowerKW": 3.7,
            "CurrentTypeID": 10,
            "Quantity": 1
        }
    ],
    "DateLastStatusUpdate": "2020-06-26T02:52:00Z",
    "DataQualityLevel": 3,
    "DateCreated": "2019-04-01T04:59:00Z",
    "SubmissionStatusTypeID": 100
}