{
    "IsRecentlyVerified": false,
    "ID": 91576,
    "UUID": "9C2995E5-B0FD-4048-9B1F-D8BDD00C61C2",
    "DataProviderID": 1,
    "OperatorID": 3265,
    "UsageTypeID": 4,
    "AddressInfo": {
        "ID": 91922,
        "Title": "Leitwarte der Universität Regensburg",
        "AddressLine1": "Am BioPark 10",
        "Town": "Regensburg",
        "StateOrProvince": "Regensburg",
        "Postcode": "93051",
        "CountryID": 87,
        "Latitude": 48.99188485545868,
        "Longitude": 12.09077164418034,
        "AccessComments": "24/7 geöffnete Ladestation direkt hinter dem Kesselhaus.",
        "DistanceUnit": 0
    },
    "Connections": [
        {
            "ID": 129821,
            "ConnectionTypeID": 25,
            "StatusTypeID": 50,
            "LevelID": 2,
            "Amps": 32,
            "Voltage": 400,
            "PowerKW": 22,
            "CurrentTypeID": 20,
            "Quantity": 2
        }
    ],
    "NumberOfPoints": 2,
    "StatusTypeID": 50,
    "DateLastStatusUpdate": "2017-08-07T08:56:00Z",
    "DataQualityLevel": 1,
    "DateCreated": "2017-08-07T08:56:00Z",
    "SubmissionStatusTypeID": 200
}