{
    "IsRecentlyVerified": false,
    "ID": 129910,
    "UUID": "C31FC2C7-49CF-41CA-9CE9-94F96323CF53",
    "DataProviderID": 1,
    "OperatorID": 23,
    "OperatorsReference": "51262",
    "UsageTypeID": 4,
    "AddressInfo": {
        "ID": 130256,
        "Title": "A Room With A View",
        "AddressLine1": "28 Roland CT",
        "Town": "Walla Walla",
        "StateOrProvince": "Washington",
        "Postcode": "99362",
        "CountryID": 2,
        "Latitude": 46.022244,
        "Longitude": -118.410638,
        "ContactTelephone1": "(509) 529-1194",
        "DistanceUnit": 0
    },
    "Connections": [
        {
            "ID": 181900,
            "ConnectionTypeID": 30,
            "StatusTypeID": 50,
            "LevelID": 2,
            "PowerKW": 13,
            "CurrentTypeID": 20,
            "Quantity": 1
        }
    ],
    "NumberOfPoints": 1,
    "GeneralComments": "1 Tesla Connector, up to 13kW.Available for customers. Please call ahead.",
    "StatusTypeID": 50,
    "DateLastStatusUpdate": "2019-07-30T09:18:00Z",
    "DataQualityLevel": 1,
    "DateCreated": "2019-07-30T09:18:00Z",
    "SubmissionStatusTypeID": 200
}