{
    "IsRecentlyVerified": false,
    "ID": 37496,
    "UUID": "0181B34F-344C-4A42-AC86-A5A0A7B4F79E",
    "DataProviderID": 26,
    "DataProvidersReference": "25894",
    "OperatorID": 78,
    "OperatorsReference": "Essent EM-NL-00000363-04-00014",
    "UsageCost": "0.00 jaarabonnement",
    "AddressInfo": {
        "ID": 37842,
        "Title": "Sloterkade 61-1",
        "AddressLine1": "Sloterkade 61-1",
        "Town": "Amsterdam",
        "Postcode": "1058 HG",
        "CountryID": 159,
        "Latitude": 52.354959,
        "Longitude": 4.853133,
        "RelatedURL": "http://www.essent.nl",
        "DistanceUnit": 0
    },
    "Connections": [
        {
            "ID": 41007,
            "ConnectionTypeID": 25,
            "LevelID": 2,
            "PowerKW": 11,
            "CurrentTypeID": 10
        },
        {
            "ID": 49021,
            "ConnectionTypeID": 25,
            "LevelID": 2,
            "PowerKW": 11,
            "CurrentTypeID": 10
        }
    ],
    "NumberOfPoints": 1,
    "StatusTypeID": 50,
    "DateLastStatusUpdate": "2016-06-04T02:53:00Z",
    "DataQualityLevel": 3,
    "DateCreated": "2015-01-09T06:07:00Z",
    "SubmissionStatusTypeID": 100
}