{
    "IsRecentlyVerified": false,
    "ID": 173454,
    "UUID": "580D497C-7139-41BD-ACDF-F1A9CDABE939",
    "DataProviderID": 18,
    "DataProvidersReference": "c477f70d2885dff00cbb6c3680fd7710",
    "OperatorID": 2244,
    "UsageTypeID": 1,
    "AddressInfo": {
        "ID": 173813,
        "Title": "6 Endsleigh Street",
        "AddressLine1": "6 Endsleigh Street",
        "Town": "London",
        "Postcode": "WC1H 0EF",
        "CountryID": 1,
        "Latitude": -0.130188,
        "Longitude": 51.525514,
        "AccessComments": "",
        "RelatedURL": "https://www.ubitricity.com",
        "DistanceUnit": 0
    },
    "Connections": [
        {
            "ID": 266479,
            "ConnectionTypeID": 25,
            "Reference": "suby1100005037",
            "StatusTypeID": 50,
            "LevelID": 2,
            "Amps": 16,
            "Voltage": 230,
            "PowerKW": 3.7,
            "CurrentTypeID": 10
        }
    ],
    "StatusTypeID": 0,
    "DateLastStatusUpdate": "2021-07-12T03:38:00Z",
    "MetadataValues": [
        {
            "ID": 8376,
            "MetadataFieldID": 4,
            "ItemValue": "Contains public sector information licensed under the Open Government Licence v2.0. http://www.nationalarchives.gov.uk/doc/open-government-licence/version/2/"
        }
    ],
    "DataQualityLevel": 3,
    "DateCreated": "2021-03-03T11:25:00Z",
    "SubmissionStatusTypeID": 100
}