{
    "IsRecentlyVerified": false,
    "ID": 110635,
    "UUID": "8193C79E-9CEA-4493-9FE9-BB4628C28CDB",
    "DataProviderID": 2,
    "DataProvidersReference": "103914",
    "OperatorID": 5,
    "UsageTypeID": 1,
    "AddressInfo": {
        "ID": 110981,
        "Title": "STARR LIBRARY",
        "AddressLine1": "68 W Market St",
        "Town": "Rhinebeck",
        "StateOrProvince": "NY",
        "Postcode": "12572",
        "CountryID": 2,
        "Latitude": 41.9263801,
        "Longitude": -73.9183809,
        "ContactTelephone1": "888-758-4389",
        "AccessComments": "24 hours daily",
        "RelatedURL": "http://www.chargepoint.com/",
        "DistanceUnit": 0
    },
    "Connections": [
        {
            "ID": 155904,
            "ConnectionTypeID": 1,
            "LevelID": 2,
            "Amps": 16,
            "Voltage": 230,
            "PowerKW": 3,
            "CurrentTypeID": 10,
            "Quantity": 2
        }
    ],
    "DateLastStatusUpdate": "2019-12-24T09:19:00Z",
    "DataQualityLevel": 3,
    "DateCreated": "2018-10-18T23:36:00Z",
    "SubmissionStatusTypeID": 100
}