{
    "IsRecentlyVerified": false,
    "ID": 46135,
    "UUID": "ABE1E8AD-BEB6-4057-9ABF-57B50085328E",
    "DataProviderID": 1,
    "DataProvidersReference": "2357",
    "AddressInfo": {
        "ID": 46481,
        "Title": "Charlottenbergs Handelspark",
        "AddressLine1": "Källgatan 10",
        "Town": "CHARLOTTENBERG",
        "StateOrProvince": "VÄRMLAND",
        "Postcode": "67332",
        "CountryID": 216,
        "Latitude": 59.87771,
        "Longitude": 12.28475,
        "AccessComments": "På Charlottenbergs Handelspark, utanför Delicatobutiken.",
        "DistanceUnit": 0
    },
    "Connections": [
        {
            "ID": 56798,
            "ConnectionTypeID": 0,
            "Reference": "1",
            "LevelID": 2,
            "Amps": 16,
            "Voltage": 230,
            "PowerKW": 3.7,
            "Comments": "Mode 1"
        },
        {
            "ID": 88505,
            "ConnectionTypeID": 0,
            "Reference": "2",
            "LevelID": 2,
            "Amps": 16,
            "Voltage": 230,
            "PowerKW": 3.7,
            "Comments": "Mode 1"
        }
    ],
    "NumberOfPoints": 2,
    "DateLastStatusUpdate": "2020-05-26T08:23:00Z",
    "DataQualityLevel": 2,
    "DateCreated": "2015-05-03T00:54:00Z",
    "SubmissionStatusTypeID": 100
}