{
    "IsRecentlyVerified": false,
    "ID": 31234,
    "UUID": "F9460041-F3FE-4F4F-AB77-97481557BFDE",
    "DataProviderID": 1,
    "DataProvidersReference": "2236",
    "AddressInfo": {
        "ID": 31580,
        "Title": "Jamtli laddstation",
        "AddressLine1": "Fornbyvägen 2",
        "Town": "ÖSTERSUND",
        "StateOrProvince": "JÄMTLAND",
        "Postcode": "83131",
        "CountryID": 216,
        "Latitude": 63.1868,
        "Longitude": 14.63838,
        "AccessComments": "För bilar som laddar. Max 4 timmar.",
        "DistanceUnit": 0
    },
    "Connections": [
        {
            "ID": 34507,
            "ConnectionTypeID": 0,
            "Reference": "1",
            "LevelID": 2,
            "Amps": 32,
            "Voltage": 400,
            "PowerKW": 22,
            "Comments": "Mode 3"
        },
        {
            "ID": 87374,
            "ConnectionTypeID": 0,
            "Reference": "2",
            "LevelID": 2,
            "Amps": 32,
            "Voltage": 400,
            "PowerKW": 22,
            "Comments": "Mode 3"
        },
        {
            "ID": 87375,
            "ConnectionTypeID": 0,
            "Reference": "3",
            "LevelID": 2,
            "Amps": 32,
            "Voltage": 230,
            "PowerKW": 7.4,
            "Comments": "Mode 3"
        },
        {
            "ID": 89371,
            "ConnectionTypeID": 0,
            "Reference": "4",
            "LevelID": 2,
            "Amps": 32,
            "Voltage": 230,
            "PowerKW": 7.4,
            "Comments": "Mode 3"
        }
    ],
    "NumberOfPoints": 4,
    "DateLastStatusUpdate": "2020-05-26T08:25:00Z",
    "DataQualityLevel": 2,
    "DateCreated": "2014-12-15T04:37:00Z",
    "SubmissionStatusTypeID": 100
}