{
    "IsRecentlyVerified": false,
    "ID": 139889,
    "UUID": "1DC787C9-E18D-4EF2-AB2E-3F7F83BAB979",
    "DataProviderID": 2,
    "DataProvidersReference": "146918",
    "OperatorID": 59,
    "UsageTypeID": 1,
    "AddressInfo": {
        "ID": 140241,
        "Title": "Greenlots - 12510",
        "AddressLine1": "1355 E. Colorado",
        "Town": "Glendale",
        "StateOrProvince": "CA",
        "Postcode": "91205",
        "CountryID": 2,
        "Latitude": 34.1428184509277,
        "Longitude": -118.235275268555,
        "ContactTelephone1": "855-900-7584",
        "AccessComments": "24 hours daily",
        "RelatedURL": "http://greenlots.com/",
        "DistanceUnit": 0
    },
    "Connections": [
        {
            "ID": 195382,
            "ConnectionTypeID": 1,
            "LevelID": 2,
            "Amps": 16,
            "Voltage": 230,
            "PowerKW": 3.7,
            "CurrentTypeID": 10,
            "Quantity": 1
        }
    ],
    "StatusTypeID": 50,
    "DateLastStatusUpdate": "2020-06-26T02:57:00Z",
    "DataQualityLevel": 3,
    "DateCreated": "2019-12-24T09:11:00Z",
    "SubmissionStatusTypeID": 100
}