{
    "IsRecentlyVerified": false,
    "ID": 178633,
    "UUID": "53C1F258-F76B-4621-9723-006BC98CBAA0",
    "DataProviderID": 29,
    "DataProvidersReference": "11784",
    "OperatorID": 3403,
    "AddressInfo": {
        "ID": 178992,
        "Title": "Celler Str. nähe 9",
        "AddressLine1": "Celler Str. nähe 9",
        "Town": "Burgwedel",
        "Postcode": "30938",
        "CountryID": 87,
        "Latitude": 52.5649169,
        "Longitude": 9.8517068,
        "DistanceUnit": 0
    },
    "Connections": [
        {
            "ID": 279307,
            "ConnectionTypeID": 25,
            "StatusTypeID": 50,
            "LevelID": 2,
            "PowerKW": 22,
            "CurrentTypeID": 20
        },
        {
            "ID": 279308,
            "ConnectionTypeID": 25,
            "StatusTypeID": 50,
            "LevelID": 2,
            "PowerKW": 22,
            "CurrentTypeID": 20
        }
    ],
    "StatusTypeID": 0,
    "DateLastStatusUpdate": "2021-07-12T02:50:00Z",
    "MetadataValues": [
        {
            "ID": 10927,
            "MetadataFieldID": 4,
            "ItemValue": "Data from the German chargepoint registry provided by Bundesnetzagentur.de under the CC-BY 4.0 license"
        }
    ],
    "DataQualityLevel": 3,
    "DateCreated": "2021-07-08T09:50:00Z",
    "SubmissionStatusTypeID": 100
}