{
    "IsRecentlyVerified": false,
    "ID": 95148,
    "UUID": "770AED87-8DE2-4963-AAE6-87BCC5CE5F35",
    "DataProviderID": 1,
    "OperatorID": 3253,
    "OperatorsReference": "*EAT0601782*001AC,*EAT0601782*001DC,*EAT0601782*002AC",
    "UsageTypeID": 1,
    "UsageCost": "€0,15/min ; Andere Tarife möglich",
    "AddressInfo": {
        "ID": 95494,
        "Title": "Ladestation Cargo Center",
        "AddressLine1": "Am Terminal 1",
        "Town": "Werndorf",
        "StateOrProvince": "Steiermark",
        "Postcode": "8402",
        "CountryID": 19,
        "Latitude": 46.9345,
        "Longitude": 15.4665,
        "DistanceUnit": 0
    },
    "Connections": [
        {
            "ID": 134816,
            "ConnectionTypeID": 25,
            "StatusTypeID": 0,
            "LevelID": 2,
            "Amps": 32,
            "Voltage": 400,
            "PowerKW": 22,
            "CurrentTypeID": 20,
            "Quantity": 2
        },
        {
            "ID": 146548,
            "ConnectionTypeID": 33,
            "StatusTypeID": 0,
            "LevelID": 3,
            "PowerKW": 20,
            "CurrentTypeID": 30,
            "Quantity": 1
        }
    ],
    "NumberOfPoints": 2,
    "StatusTypeID": 0,
    "DateLastStatusUpdate": "2019-06-12T14:15:00Z",
    "DataQualityLevel": 1,
    "DateCreated": "2017-11-04T13:07:00Z",
    "SubmissionStatusTypeID": 200
}