{
    "IsRecentlyVerified": false,
    "ID": 29140,
    "UUID": "6A42F4D2-2686-4273-ADAB-FD8F2B010F84",
    "DataProviderID": 2,
    "DataProvidersReference": "51284",
    "UsageTypeID": 1,
    "AddressInfo": {
        "ID": 29486,
        "Title": "Kwik Trip #659",
        "AddressLine1": "1990 Scott Rd NW",
        "Town": "Rochester",
        "StateOrProvince": "MN",
        "Postcode": "55901",
        "CountryID": 2,
        "Latitude": 44.044438,
        "Longitude": -92.514584,
        "ContactTelephone1": "507-289-2185",
        "AccessComments": "24 hours daily",
        "RelatedURL": "",
        "DistanceUnit": 0
    },
    "Connections": [
        {
            "ID": 32021,
            "ConnectionTypeID": 9,
            "LevelID": 1,
            "Amps": 16,
            "Voltage": 120,
            "PowerKW": 1.9,
            "CurrentTypeID": 10,
            "Quantity": 1
        }
    ],
    "DateLastStatusUpdate": "2020-06-26T03:07:00Z",
    "DataQualityLevel": 3,
    "DateCreated": "2014-11-28T03:39:00Z",
    "SubmissionStatusTypeID": 100
}