{
    "IsRecentlyVerified": false,
    "ID": 94122,
    "UUID": "F9C73BB9-5B7D-4C1C-86A4-8DB0920ABBD2",
    "DataProviderID": 1,
    "OperatorID": 3,
    "OperatorsReference": "PG-80698",
    "UsageTypeID": 4,
    "UsageCost": "Free",
    "AddressInfo": {
        "ID": 94468,
        "Title": "Aldi-Snow Hill Way",
        "AddressLine1": "Unit 1",
        "Town": "Wakefield",
        "Postcode": "WF1 2UZ",
        "CountryID": 1,
        "Latitude": 53.697352,
        "Longitude": -1.506397,
        "DistanceUnit": 0
    },
    "Connections": [
        {
            "ID": 133213,
            "ConnectionTypeID": 25,
            "StatusTypeID": 50,
            "LevelID": 2,
            "Amps": 32,
            "Voltage": 230,
            "PowerKW": 7,
            "CurrentTypeID": 10,
            "Quantity": 2
        }
    ],
    "NumberOfPoints": 2,
    "GeneralComments": "This is an open charge unit installed at the Aldi superstore in Snow Hill Way, Wakefield",
    "StatusTypeID": 50,
    "DateLastStatusUpdate": "2017-10-17T15:02:00Z",
    "DataQualityLevel": 1,
    "DateCreated": "2017-10-17T15:02:00Z",
    "SubmissionStatusTypeID": 200
}