{
    "IsRecentlyVerified": false,
    "ID": 39059,
    "UUID": "7C458BA0-4368-482E-8798-A1168FFD1CDE",
    "DataProviderID": 26,
    "DataProvidersReference": "34678",
    "OperatorID": 73,
    "OperatorsReference": "EV-Box EVB-P1317031",
    "UsageCost": "0.00 jaarabonnement",
    "AddressInfo": {
        "ID": 39405,
        "Title": "Anne Wadmanwei 2",
        "AddressLine1": "Anne Wadmanwei 2",
        "Town": "Leeuwarden",
        "Postcode": "8914 BD",
        "CountryID": 159,
        "Latitude": 53.20214,
        "Longitude": 5.76306,
        "RelatedURL": "http://www.ev-box.nl",
        "DistanceUnit": 0
    },
    "Connections": [
        {
            "ID": 42570,
            "ConnectionTypeID": 25,
            "LevelID": 2,
            "PowerKW": 11,
            "CurrentTypeID": 10
        },
        {
            "ID": 49849,
            "ConnectionTypeID": 25,
            "LevelID": 2,
            "PowerKW": 11,
            "CurrentTypeID": 10
        }
    ],
    "NumberOfPoints": 1,
    "StatusTypeID": 50,
    "DateLastStatusUpdate": "2016-06-04T02:56:00Z",
    "DataQualityLevel": 3,
    "DateCreated": "2015-01-09T06:08:00Z",
    "SubmissionStatusTypeID": 100
}