{
    "IsRecentlyVerified": false,
    "ID": 174454,
    "UUID": "9F90E9FF-80B8-4149-9AC9-CC14FC09DCE3",
    "DataProviderID": 1,
    "OperatorID": 1,
    "UsageTypeID": 4,
    "AddressInfo": {
        "ID": 174813,
        "Title": "Value Stay Brussels Expo",
        "AddressLine1": "Luitberg 1",
        "Town": "Grimbergen",
        "StateOrProvince": "Flanders",
        "Postcode": "1853",
        "CountryID": 26,
        "Latitude": 50.904484902645834,
        "Longitude": 4.3539184406182585,
        "RelatedURL": "http://www.gowatts.be",
        "DistanceUnit": 0
    },
    "Connections": [
        {
            "ID": 270251,
            "ConnectionTypeID": 25,
            "StatusTypeID": 50,
            "LevelID": 2,
            "Amps": 32,
            "Voltage": 400,
            "PowerKW": 22,
            "CurrentTypeID": 20,
            "Quantity": 1,
            "Comments": "by Go Watts"
        }
    ],
    "NumberOfPoints": 1,
    "StatusTypeID": 50,
    "DateLastStatusUpdate": "2021-03-31T18:12:00Z",
    "DataQualityLevel": 1,
    "DateCreated": "2021-03-31T11:23:00Z",
    "SubmissionStatusTypeID": 200
}