{
    "IsRecentlyVerified": false,
    "ID": 176081,
    "UUID": "6AEAD5D1-A8CC-4626-8B15-9306731A06FF",
    "DataProviderID": 1,
    "OperatorID": 3425,
    "UsageTypeID": 1,
    "AddressInfo": {
        "ID": 176440,
        "Title": "Hevlín",
        "AddressLine1": "Hevlín 460",
        "AddressLine2": "671 69  Hevlín",
        "CountryID": 64,
        "Latitude": 48.73232867891653,
        "Longitude": 16.382888434734923,
        "DistanceUnit": 0
    },
    "Connections": [
        {
            "ID": 273560,
            "ConnectionTypeID": 1036,
            "StatusTypeID": 50,
            "LevelID": 2,
            "Amps": 32,
            "Voltage": 230,
            "PowerKW": 22,
            "Quantity": 1
        },
        {
            "ID": 273561,
            "ConnectionTypeID": 1036,
            "StatusTypeID": 50,
            "LevelID": 2,
            "Amps": 32,
            "Voltage": 230,
            "PowerKW": 22,
            "Quantity": 1
        }
    ],
    "NumberOfPoints": 2,
    "StatusTypeID": 50,
    "DateLastStatusUpdate": "2021-06-24T12:44:00Z",
    "DataQualityLevel": 1,
    "DateCreated": "2021-06-24T10:46:00Z",
    "SubmissionStatusTypeID": 200
}