{
    "IsRecentlyVerified": false,
    "ID": 173063,
    "UUID": "5A014F28-4D45-43C7-8781-57BFF3E99E2D",
    "DataProviderID": 1,
    "OperatorID": 3,
    "OperatorsReference": "PG-70353,PG-86112",
    "UsageTypeID": 4,
    "UsageCost": "Free",
    "AddressInfo": {
        "ID": 173422,
        "Title": "Tesco Superstore-Springfield Road",
        "AddressLine1": "47-53 Springfield Road",
        "Town": "Chelmsford",
        "Postcode": "CM2 6QT",
        "CountryID": 1,
        "Latitude": 51.7342,
        "Longitude": 0.477223,
        "DistanceUnit": 0
    },
    "Connections": [
        {
            "ID": 264792,
            "ConnectionTypeID": 25,
            "StatusTypeID": 50,
            "LevelID": 2,
            "Amps": 32,
            "Voltage": 230,
            "PowerKW": 7,
            "CurrentTypeID": 10,
            "Quantity": 4
        }
    ],
    "NumberOfPoints": 4,
    "GeneralComments": "This is an open charge unit installed at the Tesco super store at Springfield Road, Chelmsford",
    "StatusTypeID": 50,
    "DateLastStatusUpdate": "2021-03-02T21:11:00Z",
    "DataQualityLevel": 1,
    "DateCreated": "2021-03-02T21:04:00Z",
    "SubmissionStatusTypeID": 200
}