{
    "IsRecentlyVerified": false,
    "ID": 178856,
    "UUID": "E48242D7-4AA4-421E-A519-01F93E851131",
    "DataProviderID": 29,
    "DataProvidersReference": "7035",
    "OperatorID": 140,
    "AddressInfo": {
        "ID": 179215,
        "Title": "Alter Markt",
        "AddressLine1": "Alter Markt",
        "Town": "Dassel/Markoldendorf",
        "Postcode": "37586",
        "CountryID": 87,
        "Latitude": 51.812483,
        "Longitude": 9.769273,
        "DistanceUnit": 0
    },
    "Connections": [
        {
            "ID": 279832,
            "ConnectionTypeID": 25,
            "StatusTypeID": 50,
            "LevelID": 2,
            "PowerKW": 22,
            "CurrentTypeID": 20
        },
        {
            "ID": 279833,
            "ConnectionTypeID": 25,
            "StatusTypeID": 50,
            "LevelID": 2,
            "PowerKW": 22,
            "CurrentTypeID": 20
        }
    ],
    "StatusTypeID": 0,
    "DateLastStatusUpdate": "2021-07-12T02:48:00Z",
    "MetadataValues": [
        {
            "ID": 11150,
            "MetadataFieldID": 4,
            "ItemValue": "Data from the German chargepoint registry provided by Bundesnetzagentur.de under the CC-BY 4.0 license"
        }
    ],
    "DataQualityLevel": 3,
    "DateCreated": "2021-07-08T09:50:00Z",
    "SubmissionStatusTypeID": 100
}