{
    "IsRecentlyVerified": false,
    "ID": 95063,
    "UUID": "DA0BD12A-D082-48B6-8A1E-FBC0741BD6F9",
    "DataProviderID": 1,
    "OperatorID": 3,
    "OperatorsReference": "PG-81313",
    "UsageTypeID": 6,
    "UsageCost": "1",
    "AddressInfo": {
        "ID": 95409,
        "Title": "Randolph House",
        "AddressLine1": "2-12 Northwick Park Road",
        "Town": "London",
        "Postcode": "HA1 2NU",
        "CountryID": 1,
        "Latitude": 51.581246,
        "Longitude": -0.326837,
        "DistanceUnit": 0
    },
    "Connections": [
        {
            "ID": 134703,
            "ConnectionTypeID": 25,
            "StatusTypeID": 50,
            "LevelID": 2,
            "Amps": 32,
            "Voltage": 230,
            "PowerKW": 3,
            "CurrentTypeID": 10,
            "Quantity": 2
        }
    ],
    "NumberOfPoints": 10,
    "GeneralComments": "This is an open charge unit installed at Randolph House in Northwick Park Road, Harrow, London",
    "StatusTypeID": 0,
    "DateLastStatusUpdate": "2020-01-20T06:37:00Z",
    "DataQualityLevel": 1,
    "DateCreated": "2017-11-02T06:25:00Z",
    "SubmissionStatusTypeID": 200
}