{
    "IsRecentlyVerified": false,
    "ID": 7707,
    "UUID": "EB52F690-1444-4A75-92D4-E620C64BB0C5",
    "DataProviderID": 15,
    "DataProvidersReference": "6793",
    "OperatorID": 26,
    "AddressInfo": {
        "ID": 7604,
        "Title": "3003 Stadium Drive",
        "AddressLine1": "3003 Stadium Drive",
        "Town": "Kalamazoo",
        "StateOrProvince": "MI",
        "Postcode": "49008",
        "CountryID": 2,
        "Latitude": 42.27205,
        "Longitude": -85.62717,
        "ContactTelephone1": " (269) 342-9800",
        "RelatedURL": "http://carstations.com/6793",
        "DistanceUnit": 0
    },
    "Connections": [
        {
            "ID": 5139,
            "ConnectionTypeID": 1,
            "Reference": "J1772",
            "LevelID": 2
        }
    ],
    "StatusTypeID": 0,
    "DateLastStatusUpdate": "2017-11-04T14:04:00Z",
    "DataQualityLevel": 1,
    "DateCreated": "2011-11-11T12:05:00Z",
    "SubmissionStatusTypeID": 100
}