{
    "IsRecentlyVerified": false,
    "ID": 131534,
    "UUID": "25BD6388-5832-4C29-A49A-8DA1719E5248",
    "DataProviderID": 1,
    "OperatorID": 3,
    "OperatorsReference": "PG-82985,PG-83261",
    "UsageTypeID": 4,
    "UsageCost": "£0.50/hour for 3 hours,then £2.50/hour for 6 hours,then £3.00/hour",
    "AddressInfo": {
        "ID": 131880,
        "Title": "Clumber Park Lodges",
        "AddressLine1": "Clumber Park",
        "Town": "Worksop",
        "Postcode": "S80 3BQ",
        "CountryID": 1,
        "Latitude": 53.276511,
        "Longitude": -1.095494,
        "DistanceUnit": 0
    },
    "Connections": [
        {
            "ID": 184099,
            "ConnectionTypeID": 25,
            "StatusTypeID": 50,
            "LevelID": 2,
            "Amps": 32,
            "Voltage": 230,
            "PowerKW": 7,
            "CurrentTypeID": 10,
            "Quantity": 4
        }
    ],
    "NumberOfPoints": 4,
    "GeneralComments": "This is an open charge unit installed at the Clumber Park Lodges at Clumber Park, Worksop",
    "StatusTypeID": 50,
    "DateLastStatusUpdate": "2019-10-25T05:35:00Z",
    "DataQualityLevel": 1,
    "DateCreated": "2019-09-09T08:05:00Z",
    "SubmissionStatusTypeID": 200
}