{
    "MediaItems": [
        {
            "ID": 13766,
            "ChargePointID": 52016,
            "ItemURL": "https://s3-ap-southeast-2.amazonaws.com/openchargemap/images/CZ/OCM52016/OCM-52016.orig.2017120412194902.jpg",
            "ItemThumbnailURL": "https://s3-ap-southeast-2.amazonaws.com/openchargemap/images/CZ/OCM52016/OCM-52016.thmb.2017120412194902.jpg",
            "Comment": "",
            "IsEnabled": true,
            "IsVideo": false,
            "IsFeaturedItem": false,
            "IsExternalResource": false,
            "User": {
                "ID": 6224,
                "Username": "ozana"
            },
            "DateCreated": "2017-12-04T12:20:00Z"
        },
        {
            "ID": 3354,
            "ChargePointID": 52016,
            "ItemURL": "https://s3-ap-southeast-2.amazonaws.com/openchargemap/images/CZ/OCM52016/OCM-52016.orig.2015100719031730.jpg",
            "ItemThumbnailURL": "https://s3-ap-southeast-2.amazonaws.com/openchargemap/images/CZ/OCM52016/OCM-52016.thmb.2015100719031730.jpg",
            "Comment": "Nabíjecí stanice před ElectroWorldem",
            "IsEnabled": true,
            "IsVideo": false,
            "IsFeaturedItem": false,
            "IsExternalResource": false,
            "User": {
                "ID": 6224,
                "Username": "ozana"
            },
            "DateCreated": "2015-10-07T19:04:00Z"
        },
        {
            "ID": 3353,
            "ChargePointID": 52016,
            "ItemURL": "https://s3-ap-southeast-2.amazonaws.com/openchargemap/images/CZ/OCM52016/OCM-52016.orig.2015100719024420.jpg",
            "ItemThumbnailURL": "https://s3-ap-southeast-2.amazonaws.com/openchargemap/images/CZ/OCM52016/OCM-52016.thmb.2015100719024420.jpg",
            "Comment": "Nabíjecí stanice před ElectroWorldem na konci parkovišti",
            "IsEnabled": true,
            "IsVideo": false,
            "IsFeaturedItem": false,
            "IsExternalResource": false,
            "User": {
                "ID": 6224,
                "Username": "ozana"
            },
            "DateCreated": "2015-10-07T19:03:00Z"
        }
    ],
    "IsRecentlyVerified": false,
    "ID": 52016,
    "UUID": "1D04D49F-2D98-4E14-9A9A-F0DE64C77708",
    "DataProviderID": 1,
    "OperatorID": 190,
    "UsageTypeID": 1,
    "AddressInfo": {
        "ID": 52362,
        "Title": "Avion Shopping Park Ostrava",
        "AddressLine1": "Rudná 3114",
        "Town": "Ostrava",
        "Postcode": "70030",
        "CountryID": 64,
        "Latitude": 49.802759842415455,
        "Longitude": 18.226591714120918,
        "ContactTelephone1": "+420734234832",
        "AccessComments": "EN: parking near of ElectroWorld\r\nCZ: přilehlé parkoviště u Electro Worldu",
        "RelatedURL": "http://www.premobilita.cz/",
        "DistanceUnit": 0
    },
    "Connections": [
        {
            "ID": 64523,
            "ConnectionTypeID": 25,
            "StatusTypeID": 50,
            "LevelID": 2,
            "Amps": 32,
            "Voltage": 400,
            "PowerKW": 22,
            "CurrentTypeID": 20,
            "Quantity": 1
        },
        {
            "ID": 64524,
            "ConnectionTypeID": 23,
            "StatusTypeID": 50,
            "LevelID": 2,
            "Amps": 16,
            "Voltage": 230,
            "PowerKW": 3.6,
            "CurrentTypeID": 10,
            "Quantity": 1
        }
    ],
    "NumberOfPoints": 1,
    "StatusTypeID": 50,
    "DateLastStatusUpdate": "2017-12-04T12:20:00Z",
    "DataQualityLevel": 1,
    "DateCreated": "2015-08-14T11:49:00Z",
    "SubmissionStatusTypeID": 200
}