{
    "IsRecentlyVerified": false,
    "ID": 74094,
    "UUID": "16BC5904-5683-4D4F-A82A-D179D0133BEA",
    "DataProviderID": 1,
    "OperatorID": 89,
    "OperatorsReference": "AAB-10042",
    "UsageTypeID": 4,
    "UsageCost": "Free",
    "AddressInfo": {
        "ID": 74440,
        "Title": "BC-Easy Park-Hornby Street",
        "AddressLine1": "535 Hornby Street",
        "Town": "Vancouver",
        "StateOrProvince": "BC",
        "Postcode": "V6C 2E8",
        "CountryID": 44,
        "Latitude": 49.285609,
        "Longitude": -123.117458,
        "DistanceUnit": 0
    },
    "Connections": [
        {
            "ID": 106418,
            "ConnectionTypeID": 1,
            "StatusTypeID": 50,
            "LevelID": 2,
            "Amps": 32,
            "Voltage": 230,
            "PowerKW": 7,
            "CurrentTypeID": 10,
            "Quantity": 1
        }
    ],
    "NumberOfPoints": 1,
    "StatusTypeID": 50,
    "DateLastStatusUpdate": "2017-01-24T09:52:00Z",
    "DataQualityLevel": 1,
    "DateCreated": "2016-11-24T00:16:00Z",
    "SubmissionStatusTypeID": 200
}