{
    "IsRecentlyVerified": false,
    "ID": 42082,
    "UUID": "AA2F2074-973D-4408-93B1-608E06AD99C7",
    "DataProviderID": 26,
    "DataProvidersReference": "59651",
    "OperatorID": 157,
    "OperatorsReference": "NewMotion 03000164",
    "UsageCost": "0.00 jaarabonnement",
    "AddressInfo": {
        "ID": 42428,
        "Title": "Industrieweg 40",
        "AddressLine1": "Industrieweg 40",
        "Town": "Stichtse Vecht",
        "Postcode": "3606 AS",
        "CountryID": 159,
        "Latitude": 52.1284584,
        "Longitude": 5.0388863,
        "ContactTelephone1": "088 0109500",
        "RelatedURL": "http://thenewmotion.nl/",
        "DistanceUnit": 0
    },
    "Connections": [
        {
            "ID": 50493,
            "ConnectionTypeID": 25,
            "LevelID": 2,
            "PowerKW": 22,
            "CurrentTypeID": 10
        }
    ],
    "NumberOfPoints": 1,
    "StatusTypeID": 50,
    "DateLastStatusUpdate": "2016-06-04T02:50:00Z",
    "DataQualityLevel": 3,
    "DateCreated": "2015-02-23T03:16:00Z",
    "SubmissionStatusTypeID": 100
}