{
    "IsRecentlyVerified": false,
    "ID": 61381,
    "UUID": "D49B9053-CB89-4FCC-90A2-B1D367C491E8",
    "DataProviderID": 1,
    "DataProvidersReference": "3240",
    "AddressInfo": {
        "ID": 61727,
        "Title": "Coop Obs Bygg, Skien",
        "AddressLine1": "Bjørntvedtvegen 147",
        "Town": "SKIEN",
        "StateOrProvince": "Vestfold og Telemark",
        "Postcode": "3735",
        "CountryID": 168,
        "Latitude": 59.17437,
        "Longitude": 9.60938,
        "AccessComments": "Kundeparkeringen, til venstre for hovedinngangen.",
        "DistanceUnit": 0
    },
    "Connections": [
        {
            "ID": 78177,
            "ConnectionTypeID": 0,
            "Reference": "1",
            "LevelID": 2,
            "Amps": 16,
            "Voltage": 400,
            "PowerKW": 11,
            "Comments": "Mode 3"
        },
        {
            "ID": 88115,
            "ConnectionTypeID": 0,
            "Reference": "2",
            "LevelID": 2,
            "Amps": 16,
            "Voltage": 400,
            "PowerKW": 11,
            "Comments": "Mode 3"
        }
    ],
    "NumberOfPoints": 2,
    "DateLastStatusUpdate": "2020-05-26T08:22:00Z",
    "DataQualityLevel": 2,
    "DateCreated": "2016-02-27T02:32:00Z",
    "SubmissionStatusTypeID": 100
}