{
    "IsRecentlyVerified": false,
    "ID": 160687,
    "UUID": "6469EDBC-EF57-40F7-98A8-987B9990359C",
    "DataProviderID": 2,
    "DataProvidersReference": "156330",
    "OperatorID": 89,
    "UsageTypeID": 1,
    "AddressInfo": {
        "ID": 161044,
        "Title": "City of Coquitlam - The Tennis Centre",
        "AddressLine1": "1650 Foster Avenue",
        "Town": "Coquitlam",
        "StateOrProvince": "BC",
        "Postcode": "V3J 7X1",
        "CountryID": 44,
        "Latitude": 49.255977,
        "Longitude": -122.848609,
        "ContactTelephone1": "888-356-8911",
        "AccessComments": "24 hours daily",
        "RelatedURL": "https://flo.ca/",
        "DistanceUnit": 0
    },
    "Connections": [
        {
            "ID": 231225,
            "ConnectionTypeID": 1,
            "LevelID": 2,
            "Amps": 16,
            "Voltage": 230,
            "PowerKW": 3.7,
            "CurrentTypeID": 10,
            "Quantity": 2
        }
    ],
    "StatusTypeID": 50,
    "DateLastStatusUpdate": "2020-06-26T03:12:00Z",
    "DataQualityLevel": 3,
    "DateCreated": "2020-06-26T03:12:00Z",
    "SubmissionStatusTypeID": 100
}