{
    "IsRecentlyVerified": false,
    "ID": 114587,
    "UUID": "D4F8C1BF-E9D5-4AF7-B2FE-FC5DCE7CDA5C",
    "DataProviderID": 1,
    "OperatorID": 45,
    "UsageTypeID": 1,
    "AddressInfo": {
        "ID": 114933,
        "Title": "Bláa lónið",
        "AddressLine1": "Bláalónsvegur",
        "Town": "Grindavíkurbær",
        "StateOrProvince": "Grindavíkurbær",
        "Postcode": "240",
        "CountryID": 105,
        "Latitude": 63.88112049999996,
        "Longitude": -22.453818947113056,
        "DistanceUnit": 0
    },
    "Connections": [
        {
            "ID": 161275,
            "ConnectionTypeID": 1036,
            "StatusTypeID": 50,
            "LevelID": 2,
            "Amps": 32,
            "PowerKW": 22,
            "CurrentTypeID": 20,
            "Quantity": 1
        },
        {
            "ID": 161276,
            "ConnectionTypeID": 1,
            "StatusTypeID": 50,
            "LevelID": 2,
            "Amps": 32,
            "PowerKW": 7.4,
            "CurrentTypeID": 10,
            "Quantity": 1
        },
        {
            "ID": 161277,
            "ConnectionTypeID": 1,
            "StatusTypeID": 50,
            "LevelID": 2,
            "Amps": 32,
            "PowerKW": 7.4,
            "CurrentTypeID": 10,
            "Quantity": 1
        },
        {
            "ID": 161278,
            "ConnectionTypeID": 1036,
            "StatusTypeID": 50,
            "LevelID": 2,
            "Amps": 32,
            "PowerKW": 22,
            "CurrentTypeID": 20,
            "Quantity": 1
        }
    ],
    "NumberOfPoints": 2,
    "StatusTypeID": 50,
    "DateLastStatusUpdate": "2019-01-10T09:57:00Z",
    "DataQualityLevel": 1,
    "DateCreated": "2019-01-10T09:20:00Z",
    "SubmissionStatusTypeID": 200
}