{
    "IsRecentlyVerified": false,
    "ID": 177699,
    "UUID": "21D84ED5-0DFE-42DC-B40C-B89A09EAA8AE",
    "DataProviderID": 29,
    "DataProvidersReference": "11202",
    "OperatorID": 86,
    "AddressInfo": {
        "ID": 178058,
        "Title": "Sägewerkstraße 6",
        "AddressLine1": "Sägewerkstraße 6",
        "Town": "Oberndorf",
        "Postcode": "78727",
        "CountryID": 87,
        "Latitude": 48.296011,
        "Longitude": 8.575718,
        "DistanceUnit": 0
    },
    "Connections": [
        {
            "ID": 277157,
            "ConnectionTypeID": 33,
            "StatusTypeID": 50,
            "LevelID": 3,
            "PowerKW": 50,
            "CurrentTypeID": 30
        },
        {
            "ID": 277158,
            "ConnectionTypeID": 25,
            "StatusTypeID": 50,
            "LevelID": 2,
            "PowerKW": 22,
            "CurrentTypeID": 20
        }
    ],
    "StatusTypeID": 0,
    "DateLastStatusUpdate": "2021-07-09T03:12:00Z",
    "MetadataValues": [
        {
            "ID": 9993,
            "MetadataFieldID": 4,
            "ItemValue": "Data from the German chargepoint registry provided by Bundesnetzagentur.de under the CC-BY 4.0 license"
        }
    ],
    "DataQualityLevel": 3,
    "DateCreated": "2021-07-08T09:49:00Z",
    "SubmissionStatusTypeID": 100
}