{
    "IsRecentlyVerified": false,
    "ID": 4710,
    "UUID": "C4FC64A7-3063-4F17-AA7F-A51191841C8D",
    "DataProviderID": 2,
    "DataProvidersReference": "39752",
    "UsageTypeID": 7,
    "AddressInfo": {
        "ID": 3541,
        "Title": "Ingram Park Nissan",
        "AddressLine1": "6990 NW Loop 410",
        "Town": "San Antonio",
        "StateOrProvince": "TX",
        "Postcode": "78238",
        "CountryID": 2,
        "Latitude": 29.457047,
        "Longitude": -98.625324,
        "ContactTelephone1": "210-681-6300",
        "AccessComments": "Dealership business hours\r\nPublic - Call ahead",
        "RelatedURL": "",
        "DistanceUnit": 0
    },
    "Connections": [
        {
            "ID": 15773,
            "ConnectionTypeID": 1,
            "LevelID": 2,
            "Amps": 16,
            "Voltage": 230,
            "PowerKW": 3.7,
            "CurrentTypeID": 10,
            "Quantity": 1
        },
        {
            "ID": 20746,
            "ConnectionTypeID": 1,
            "LevelID": 2,
            "Quantity": 1
        }
    ],
    "DateLastConfirmed": "2011-05-31T00:00:00Z",
    "StatusTypeID": 0,
    "DateLastStatusUpdate": "2020-06-26T02:53:00Z",
    "DataQualityLevel": 1,
    "DateCreated": "2011-07-04T18:02:00Z",
    "SubmissionStatusTypeID": 100
}