{
    "MediaItems": [
        {
            "ID": 21311,
            "ChargePointID": 149327,
            "ItemURL": "https://s3-ap-southeast-2.amazonaws.com/openchargemap/images/DE/OCM149327/OCM-149327.orig.2020022216275491.jpg",
            "ItemThumbnailURL": "https://s3-ap-southeast-2.amazonaws.com/openchargemap/images/DE/OCM149327/OCM-149327.thmb.2020022216275491.jpg",
            "Comment": "",
            "IsEnabled": true,
            "IsVideo": false,
            "IsFeaturedItem": false,
            "IsExternalResource": false,
            "User": {
                "ID": 21695,
                "Username": "et42"
            },
            "DateCreated": "2020-02-22T16:28:00Z"
        }
    ],
    "IsRecentlyVerified": false,
    "ID": 149327,
    "UUID": "EFDC5D7E-5DFA-4C85-9F83-B4223B7453AE",
    "DataProviderID": 1,
    "OperatorID": 3297,
    "UsageTypeID": 6,
    "UsageCost": "Free",
    "AddressInfo": {
        "ID": 149680,
        "Title": "LOOP5 Einkaufszentrum",
        "AddressLine1": "Gutenbergstraße 5",
        "Town": "Weiterstadt",
        "StateOrProvince": "Hessen",
        "Postcode": "64331",
        "CountryID": 87,
        "Latitude": 49.89318505360217,
        "Longitude": 8.6057598731893,
        "AccessComments": "Accessible during opening hours. Chargers are located on levels A and E.",
        "RelatedURL": "https://www.loop5.de/",
        "DistanceUnit": 0
    },
    "Connections": [
        {
            "ID": 207338,
            "ConnectionTypeID": 25,
            "StatusTypeID": 50,
            "LevelID": 2,
            "Amps": 32,
            "Voltage": 400,
            "PowerKW": 22,
            "CurrentTypeID": 20,
            "Quantity": 4
        },
        {
            "ID": 207339,
            "ConnectionTypeID": 28,
            "StatusTypeID": 50,
            "LevelID": 2,
            "PowerKW": 3.6,
            "CurrentTypeID": 10,
            "Quantity": 4
        }
    ],
    "NumberOfPoints": 8,
    "StatusTypeID": 50,
    "DateLastStatusUpdate": "2020-02-22T16:28:00Z",
    "DataQualityLevel": 1,
    "DateCreated": "2020-02-22T16:27:00Z",
    "SubmissionStatusTypeID": 200
}