{
    "IsRecentlyVerified": false,
    "ID": 15456,
    "UUID": "440560A4-5B99-4A90-9463-EFE1E6734C70",
    "DataProviderID": 1,
    "OperatorID": 51,
    "UsageTypeID": 0,
    "UsageCost": "Free",
    "AddressInfo": {
        "ID": 15802,
        "Title": "British Columbia Institute of Technology",
        "AddressLine1": "3700 Willingdon Avenue",
        "AddressLine2": "",
        "Town": "Burnaby",
        "StateOrProvince": "BC",
        "Postcode": "V5G 3H2",
        "CountryID": 44,
        "Latitude": 49.2511975,
        "Longitude": -123.00324280000001,
        "ContactTelephone1": "+1 604-434-5734",
        "ContactTelephone2": "",
        "ContactEmail": "",
        "AccessComments": "",
        "RelatedURL": "http://www.bcit.ca",
        "DistanceUnit": 0
    },
    "Connections": [
        {
            "ID": 13765,
            "ConnectionTypeID": 1,
            "StatusTypeID": 0,
            "LevelID": 2,
            "Amps": 72,
            "Voltage": 240,
            "PowerKW": 17.3,
            "Quantity": 1
        }
    ],
    "NumberOfPoints": 1,
    "GeneralComments": "",
    "StatusTypeID": 150,
    "DateLastStatusUpdate": "2013-01-09T22:06:00Z",
    "DataQualityLevel": 1,
    "DateCreated": "2013-01-09T22:05:00Z",
    "SubmissionStatusTypeID": 200
}