{
    "UserComments": [
        {
            "ID": 19929,
            "ChargePointID": 100039,
            "CommentTypeID": 10,
            "UserName": "PowerCruiseControl",
            "Comment": "Charge ok ",
            "Rating": 5,
            "DateCreated": "2018-07-28T10:30:35.923Z",
            "User": {
                "ID": 18504,
                "Username": "PowerCruiseControl"
            },
            "CheckinStatusTypeID": 10
        },
        {
            "ID": 19728,
            "ChargePointID": 100039,
            "CommentTypeID": 10,
            "UserName": "PowerCruiseControl",
            "Comment": "Gps Position ok\nwww.PowerCruiseControl.com",
            "Rating": 5,
            "DateCreated": "2018-06-26T14:04:24.237Z",
            "User": {
                "ID": 18504,
                "Username": "PowerCruiseControl"
            },
            "CheckinStatusTypeID": 10
        }
    ],
    "MediaItems": [
        {
            "ID": 15768,
            "ChargePointID": 100039,
            "ItemURL": "https://s3-ap-southeast-2.amazonaws.com/openchargemap/images/IT/OCM100039/OCM-100039.orig.2018062614063100.jpg",
            "ItemThumbnailURL": "https://s3-ap-southeast-2.amazonaws.com/openchargemap/images/IT/OCM100039/OCM-100039.thmb.2018062614063100.jpg",
            "Comment": "www.PowerCruiseControl.com",
            "IsEnabled": true,
            "IsVideo": false,
            "IsFeaturedItem": false,
            "IsExternalResource": false,
            "User": {
                "ID": 18504,
                "Username": "PowerCruiseControl"
            },
            "DateCreated": "2018-06-26T14:07:00Z"
        },
        {
            "ID": 15767,
            "ChargePointID": 100039,
            "ItemURL": "https://s3-ap-southeast-2.amazonaws.com/openchargemap/images/IT/OCM100039/OCM-100039.orig.2018062614053026.jpg",
            "ItemThumbnailURL": "https://s3-ap-southeast-2.amazonaws.com/openchargemap/images/IT/OCM100039/OCM-100039.thmb.2018062614053026.jpg",
            "Comment": "",
            "IsEnabled": true,
            "IsVideo": false,
            "IsFeaturedItem": false,
            "IsExternalResource": false,
            "User": {
                "ID": 18504,
                "Username": "PowerCruiseControl"
            },
            "DateCreated": "2018-06-26T14:06:00Z"
        }
    ],
    "IsRecentlyVerified": false,
    "ID": 100039,
    "UUID": "33AA39D4-A368-4669-94C7-96D53B2B6A4B",
    "DataProviderID": 1,
    "OperatorID": 80,
    "UsageTypeID": 4,
    "AddressInfo": {
        "ID": 100385,
        "Title": "EnelX EVA+ Polla Fratelli Criscuolo",
        "AddressLine1": "Località San' Antuono - Zona Industriale",
        "Town": "Polla ",
        "StateOrProvince": "SA",
        "Postcode": "84035",
        "CountryID": 112,
        "Latitude": 40.4854555924814,
        "Longitude": 15.5266405644088,
        "RelatedURL": "https://www.enelx.com/it/it/emobility",
        "DistanceUnit": 0
    },
    "Connections": [
        {
            "ID": 141300,
            "ConnectionTypeID": 33,
            "StatusTypeID": 50,
            "LevelID": 3,
            "Amps": 120,
            "PowerKW": 50,
            "CurrentTypeID": 30,
            "Quantity": 1
        },
        {
            "ID": 141301,
            "ConnectionTypeID": 2,
            "StatusTypeID": 50,
            "LevelID": 3,
            "Amps": 120,
            "PowerKW": 50,
            "CurrentTypeID": 30,
            "Quantity": 1
        },
        {
            "ID": 141302,
            "ConnectionTypeID": 1036,
            "StatusTypeID": 50,
            "LevelID": 3,
            "Amps": 63,
            "Voltage": 400,
            "PowerKW": 43,
            "CurrentTypeID": 20,
            "Quantity": 1
        }
    ],
    "NumberOfPoints": 2,
    "StatusTypeID": 50,
    "DateLastStatusUpdate": "2019-06-03T08:07:00Z",
    "DataQualityLevel": 1,
    "DateCreated": "2018-02-09T16:17:00Z",
    "SubmissionStatusTypeID": 200
}