{
    "IsRecentlyVerified": false,
    "ID": 35090,
    "UUID": "E9C3941F-A09D-4819-B4D3-1E2A7F0E5153",
    "DataProviderID": 26,
    "DataProvidersReference": "28120",
    "OperatorID": 157,
    "OperatorsReference": "NewMotion 02004002",
    "UsageCost": "0.00 jaarabonnement",
    "AddressInfo": {
        "ID": 35436,
        "Title": "Orteliusdreef 22",
        "AddressLine1": "Orteliusdreef 22",
        "Town": "Lansingerland",
        "Postcode": "2661 RL",
        "CountryID": 159,
        "Latitude": 51.995361328125,
        "Longitude": 4.50202894210815,
        "ContactTelephone1": "088 0109500",
        "RelatedURL": "http://thenewmotion.nl/",
        "DistanceUnit": 0
    },
    "Connections": [
        {
            "ID": 38601,
            "ConnectionTypeID": 25,
            "LevelID": 2,
            "PowerKW": 3.7,
            "CurrentTypeID": 10
        }
    ],
    "NumberOfPoints": 1,
    "StatusTypeID": 50,
    "DateLastStatusUpdate": "2016-06-04T02:43:00Z",
    "DataQualityLevel": 3,
    "DateCreated": "2015-01-09T06:04:00Z",
    "SubmissionStatusTypeID": 100
}