{
    "IsRecentlyVerified": false,
    "ID": 140199,
    "UUID": "81920286-8315-4CF3-A1A2-EA7D6B2B24EA",
    "DataProviderID": 2,
    "DataProvidersReference": "93515",
    "OperatorID": 15,
    "UsageTypeID": 4,
    "AddressInfo": {
        "ID": 140551,
        "Title": "BP",
        "AddressLine1": "221 Mt Holly Huntersville Rd",
        "Town": "Charlotte",
        "StateOrProvince": "NC",
        "Postcode": "28214",
        "CountryID": 2,
        "Latitude": 35.301669,
        "Longitude": -80.986902,
        "ContactTelephone1": "877-455-3833",
        "AccessComments": "24 hours daily\r\nPublic - Card key at all times",
        "RelatedURL": "https://www.evgo.com/",
        "DistanceUnit": 0
    },
    "Connections": [
        {
            "ID": 195778,
            "ConnectionTypeID": 2,
            "LevelID": 3,
            "Amps": 100,
            "Voltage": 400,
            "PowerKW": 40,
            "CurrentTypeID": 30,
            "Quantity": 1
        },
        {
            "ID": 195779,
            "ConnectionTypeID": 32,
            "LevelID": 3,
            "Amps": 100,
            "Voltage": 400,
            "PowerKW": 40,
            "CurrentTypeID": 30,
            "Quantity": 1
        }
    ],
    "StatusTypeID": 50,
    "DateLastStatusUpdate": "2020-06-26T02:58:00Z",
    "DataQualityLevel": 3,
    "DateCreated": "2019-12-24T09:12:00Z",
    "SubmissionStatusTypeID": 100
}