{
    "IsRecentlyVerified": false,
    "ID": 52486,
    "UUID": "EB74E216-E1F2-464E-BC34-8C3D311C2C50",
    "DataProviderID": 1,
    "OperatorID": 44,
    "UsageTypeID": 3,
    "UsageCost": "Spende 0,27€/kWh",
    "AddressInfo": {
        "ID": 52832,
        "Title": "GoingElectric Crowdfunding Ladepunkt",
        "AddressLine1": "Raschweg 44",
        "Town": "Hamburg",
        "StateOrProvince": "Hamburg",
        "Postcode": "22147",
        "CountryID": 87,
        "Latitude": 53.6127545162669,
        "Longitude": 10.138607084655735,
        "ContactTelephone1": "040 64856290",
        "AccessComments": "24/7 nutzbar, Anmeldung erbeten. Model S Fahrer die 22/11 KW laden möchten sowie Fahrer von Fahrzeugen mit Typ 1 Stecker im Fahrzeug, rufen bitte kurz vorher an. Ich gebe dann eine 22 KW Wallbox heraus, da es technisch nicht möglich ist am 43 KW Anschluss zu laden.\r\n",
        "DistanceUnit": 0
    },
    "Connections": [
        {
            "ID": 65149,
            "ConnectionTypeID": 25,
            "StatusTypeID": 50,
            "LevelID": 3,
            "PowerKW": 43,
            "CurrentTypeID": 20,
            "Quantity": 1
        },
        {
            "ID": 65150,
            "ConnectionTypeID": 25,
            "StatusTypeID": 50,
            "LevelID": 2,
            "Amps": 16,
            "Voltage": 230,
            "PowerKW": 3.7,
            "CurrentTypeID": 10,
            "Quantity": 1
        },
        {
            "ID": 65151,
            "ConnectionTypeID": 17,
            "StatusTypeID": 50,
            "LevelID": 2,
            "PowerKW": 22,
            "CurrentTypeID": 20,
            "Quantity": 1
        },
        {
            "ID": 65152,
            "ConnectionTypeID": 16,
            "StatusTypeID": 50,
            "LevelID": 2,
            "PowerKW": 3.7,
            "CurrentTypeID": 10,
            "Quantity": 1
        },
        {
            "ID": 65153,
            "ConnectionTypeID": 28,
            "StatusTypeID": 50,
            "LevelID": 2,
            "PowerKW": 3.7,
            "CurrentTypeID": 10,
            "Quantity": 1
        }
    ],
    "NumberOfPoints": 2,
    "GeneralComments": "Bitte nicht auf den Rasen fahren!",
    "StatusTypeID": 50,
    "DateLastStatusUpdate": "2015-08-29T09:15:00Z",
    "DataQualityLevel": 1,
    "DateCreated": "2015-08-29T09:15:00Z",
    "SubmissionStatusTypeID": 200
}