{
    "MediaItems": [
        {
            "ID": 17259,
            "ChargePointID": 113611,
            "ItemURL": "https://s3-ap-southeast-2.amazonaws.com/openchargemap/images/GR/OCM113611/OCM-113611.orig.2018122311405135.jpg",
            "ItemThumbnailURL": "https://s3-ap-southeast-2.amazonaws.com/openchargemap/images/GR/OCM113611/OCM-113611.thmb.2018122311405135.jpg",
            "Comment": "",
            "IsEnabled": true,
            "IsVideo": false,
            "IsFeaturedItem": false,
            "IsExternalResource": false,
            "User": {
                "ID": 18761,
                "Username": "EVentusiast"
            },
            "DateCreated": "2018-12-23T11:41:00Z"
        }
    ],
    "IsRecentlyVerified": false,
    "ID": 113611,
    "UUID": "82AEE1DB-3897-4F7D-A6A5-634F0341C855",
    "DataProviderID": 1,
    "OperatorID": 45,
    "UsageTypeID": 1,
    "AddressInfo": {
        "ID": 113957,
        "Title": "Nidimos Hotel",
        "AddressLine1": "Dimou Fragkou 10",
        "Town": "Delfi ",
        "Postcode": "330 54",
        "CountryID": 90,
        "Latitude": 38.4797649,
        "Longitude": 22.491587500000037,
        "ContactTelephone1": "+30 2265083293",
        "RelatedURL": "http://www.nidimoshotel.gr/en/",
        "DistanceUnit": 0
    },
    "Connections": [
        {
            "ID": 160108,
            "ConnectionTypeID": 1036,
            "StatusTypeID": 50,
            "LevelID": 2,
            "Amps": 32,
            "Voltage": 400,
            "PowerKW": 11,
            "CurrentTypeID": 20,
            "Quantity": 1
        }
    ],
    "NumberOfPoints": 1,
    "StatusTypeID": 50,
    "DateLastStatusUpdate": "2018-12-23T16:20:00Z",
    "DataQualityLevel": 1,
    "DateCreated": "2018-12-23T11:38:00Z",
    "SubmissionStatusTypeID": 200
}