{
    "IsRecentlyVerified": false,
    "ID": 56881,
    "UUID": "E743545F-FE1F-4D07-9D24-AA63ECEC2623",
    "DataProviderID": 1,
    "OperatorID": 25,
    "OperatorsReference": "sutton-timessquarecarpark",
    "UsageTypeID": 4,
    "UsageCost": "Free. Parking fees apply.",
    "AddressInfo": {
        "ID": 57227,
        "Title": "Times Square Car Park",
        "AddressLine1": "Throwley Way",
        "Town": "Sutton",
        "Postcode": "SM1 1LF",
        "CountryID": 1,
        "Latitude": 51.363951,
        "Longitude": -0.191486,
        "DistanceUnit": 0
    },
    "Connections": [
        {
            "ID": 71809,
            "ConnectionTypeID": 25,
            "StatusTypeID": 50,
            "LevelID": 2,
            "Amps": 32,
            "Voltage": 230,
            "PowerKW": 7,
            "CurrentTypeID": 10,
            "Quantity": 3
        },
        {
            "ID": 95964,
            "ConnectionTypeID": 1,
            "StatusTypeID": 50,
            "LevelID": 2,
            "Amps": 16,
            "Voltage": 230,
            "PowerKW": 4,
            "CurrentTypeID": 10,
            "Quantity": 3
        }
    ],
    "NumberOfPoints": 3,
    "StatusTypeID": 50,
    "DateLastStatusUpdate": "2017-01-28T06:14:00Z",
    "DataQualityLevel": 1,
    "DateCreated": "2015-11-14T20:59:00Z",
    "SubmissionStatusTypeID": 200
}