{
    "IsRecentlyVerified": false,
    "ID": 137835,
    "UUID": "05EB4D2E-00F6-4468-AF82-1208E6BD2AAF",
    "DataProviderID": 2,
    "DataProvidersReference": "98768",
    "OperatorID": 5,
    "UsageTypeID": 1,
    "AddressInfo": {
        "ID": 138184,
        "Title": "UCSD",
        "AddressLine1": "Voigt Ln",
        "Town": "San Diego",
        "StateOrProvince": "CA",
        "Postcode": "92161",
        "CountryID": 2,
        "Latitude": 32.88354,
        "Longitude": -117.2393246,
        "ContactTelephone1": "888-758-4389",
        "AccessComments": "24 hours daily",
        "RelatedURL": "http://www.chargepoint.com/",
        "DistanceUnit": 0
    },
    "Connections": [
        {
            "ID": 192847,
            "ConnectionTypeID": 1,
            "LevelID": 2,
            "Amps": 16,
            "Voltage": 230,
            "PowerKW": 3,
            "CurrentTypeID": 10,
            "Quantity": 2
        }
    ],
    "StatusTypeID": 50,
    "DateLastStatusUpdate": "2019-12-24T09:06:00Z",
    "DataQualityLevel": 3,
    "DateCreated": "2019-12-24T09:06:00Z",
    "SubmissionStatusTypeID": 100
}