{
    "IsRecentlyVerified": false,
    "ID": 86094,
    "UUID": "26125E22-4747-4645-AB49-0CCFC4D0D879",
    "DataProviderID": 1,
    "OperatorID": 1,
    "UsageTypeID": 6,
    "UsageCost": "Free",
    "AddressInfo": {
        "ID": 86440,
        "Title": "Centro comercial magic",
        "AddressLine1": "Carrer de Juan Valera, 1",
        "Town": "Badalona",
        "StateOrProvince": "Barcelona",
        "Postcode": "08914",
        "CountryID": 210,
        "Latitude": 41.4387628520826,
        "Longitude": 2.22615161111446,
        "DistanceUnit": 0
    },
    "Connections": [
        {
            "ID": 122444,
            "ConnectionTypeID": 28,
            "StatusTypeID": 50,
            "LevelID": 2,
            "Amps": 16,
            "Voltage": 230,
            "PowerKW": 3.7,
            "CurrentTypeID": 10,
            "Quantity": 1
        }
    ],
    "NumberOfPoints": 1,
    "StatusTypeID": 50,
    "DateLastStatusUpdate": "2017-04-25T11:59:00Z",
    "DataQualityLevel": 1,
    "DateCreated": "2017-04-25T11:57:00Z",
    "SubmissionStatusTypeID": 200
}