{
    "IsRecentlyVerified": false,
    "ID": 123476,
    "UUID": "EB1E97D1-678B-44A0-8080-0CBBD09FD8B2",
    "DataProviderID": 2,
    "DataProvidersReference": "121083",
    "UsageTypeID": 1,
    "AddressInfo": {
        "ID": 123822,
        "Title": "Lake Lucerne Resort and Ranch",
        "AddressLine1": "48 CR 317",
        "Town": "Eureka Springs",
        "StateOrProvince": "AR",
        "Postcode": "72632",
        "CountryID": 2,
        "Latitude": 36.3743062274896,
        "Longitude": -93.7331151888161,
        "ContactTelephone1": "479-253-8780",
        "AccessComments": "24 hours daily; for Tesla use only; free for guests; see front desk for access",
        "RelatedURL": "",
        "DistanceUnit": 0
    },
    "Connections": [
        {
            "ID": 173459,
            "ConnectionTypeID": 30,
            "LevelID": 2,
            "Amps": 16,
            "Voltage": 230,
            "PowerKW": 3.7,
            "CurrentTypeID": 10,
            "Quantity": 2
        }
    ],
    "DateLastStatusUpdate": "2020-06-26T02:58:00Z",
    "DataQualityLevel": 3,
    "DateCreated": "2019-04-06T05:03:00Z",
    "SubmissionStatusTypeID": 100
}