{
    "IsRecentlyVerified": false,
    "ID": 62135,
    "UUID": "F70D3608-AF6B-4B02-A0C0-663185466AD2",
    "DataProviderID": 2,
    "DataProvidersReference": "72633",
    "OperatorID": 5,
    "UsageTypeID": 1,
    "AddressInfo": {
        "ID": 62481,
        "Title": "DUKE FARMS",
        "AddressLine1": "1112 Dukes Parkway West",
        "Town": "Hillsborough",
        "StateOrProvince": "NJ",
        "Postcode": "08844",
        "CountryID": 2,
        "Latitude": 40.544791,
        "Longitude": -74.6249888,
        "ContactTelephone1": "888-758-4389",
        "AccessComments": "24 hours daily",
        "RelatedURL": "http://www.chargepoint.com/",
        "DistanceUnit": 0
    },
    "Connections": [
        {
            "ID": 79038,
            "ConnectionTypeID": 1,
            "LevelID": 2,
            "Amps": 16,
            "Voltage": 230,
            "PowerKW": 3.7,
            "CurrentTypeID": 10,
            "Quantity": 2
        }
    ],
    "DateLastStatusUpdate": "2020-06-26T03:03:00Z",
    "DataQualityLevel": 3,
    "DateCreated": "2016-03-03T11:38:00Z",
    "SubmissionStatusTypeID": 100
}