{
    "IsRecentlyVerified": false,
    "ID": 107551,
    "UUID": "64FC1EBE-861F-4D37-8F6A-759745FE59D9",
    "DataProviderID": 1,
    "OperatorID": 229,
    "UsageTypeID": 4,
    "UsageCost": "$0.25/kWh + $0.25/min",
    "AddressInfo": {
        "ID": 107897,
        "Title": "Whanganui Pak'n Save",
        "AddressLine1": "167 Glasgow Street",
        "Town": "Whanganui",
        "Postcode": "4500",
        "CountryID": 161,
        "Latitude": -39.926556,
        "Longitude": 175.038499,
        "DistanceUnit": 0
    },
    "Connections": [
        {
            "ID": 151764,
            "ConnectionTypeID": 2,
            "StatusTypeID": 50,
            "LevelID": 3,
            "PowerKW": 50,
            "CurrentTypeID": 30,
            "Quantity": 1
        },
        {
            "ID": 151765,
            "ConnectionTypeID": 33,
            "StatusTypeID": 50,
            "LevelID": 3,
            "PowerKW": 50,
            "CurrentTypeID": 30,
            "Quantity": 1
        }
    ],
    "NumberOfPoints": 1,
    "StatusTypeID": 50,
    "DateLastStatusUpdate": "2018-08-01T20:13:00Z",
    "DataQualityLevel": 1,
    "DateCreated": "2018-08-01T13:27:00Z",
    "SubmissionStatusTypeID": 200
}