{
    "UserComments": [
        {
            "ID": 17438,
            "ChargePointID": 73109,
            "CommentTypeID": 10,
            "UserName": "polianto",
            "Comment": "Attivata con il badge evway",
            "Rating": 4,
            "DateCreated": "2017-07-02T17:14:21.617Z",
            "User": {
                "ID": 1606,
                "Username": "polianto"
            },
            "CheckinStatusTypeID": 10
        }
    ],
    "MediaItems": [
        {
            "ID": 12932,
            "ChargePointID": 73109,
            "ItemURL": "https://s3-ap-southeast-2.amazonaws.com/openchargemap/images/CH/OCM73109/OCM-73109.orig.2017070217135382.jpg",
            "ItemThumbnailURL": "https://s3-ap-southeast-2.amazonaws.com/openchargemap/images/CH/OCM73109/OCM-73109.thmb.2017070217135382.jpg",
            "Comment": "",
            "IsEnabled": true,
            "IsVideo": false,
            "IsFeaturedItem": false,
            "IsExternalResource": false,
            "User": {
                "ID": 1606,
                "Username": "polianto"
            },
            "DateCreated": "2017-07-02T17:14:00Z"
        }
    ],
    "IsRecentlyVerified": false,
    "ID": 73109,
    "UUID": "6E72578A-FF13-4148-9566-45A9D45B5673",
    "DataProviderID": 1,
    "OperatorID": 3314,
    "UsageTypeID": 1,
    "UsageCost": "AC: CHF 1.- Start plus CHF 0.35./kWh, DC: CHF 2.- Start plus CHF 0.35/kWh",
    "AddressInfo": {
        "ID": 73455,
        "Title": "MIGROS in Rheineck",
        "AddressLine1": "Rhyguetstrasse 2",
        "Town": "Rheineck",
        "StateOrProvince": "Switzerland",
        "Postcode": "9424",
        "CountryID": 217,
        "Latitude": 47.4680793605963,
        "Longitude": 9.58861291408539,
        "ContactTelephone1": "+41800 99 44 99",
        "ContactEmail": "mobilitaet@sgsw.ch",
        "RelatedURL": "https://ost-mobil.easy-4-you.ch/",
        "DistanceUnit": 0
    },
    "Connections": [
        {
            "ID": 105115,
            "ConnectionTypeID": 33,
            "StatusTypeID": 50,
            "LevelID": 3,
            "PowerKW": 50,
            "CurrentTypeID": 30,
            "Quantity": 1
        },
        {
            "ID": 105116,
            "ConnectionTypeID": 2,
            "StatusTypeID": 50,
            "LevelID": 3,
            "PowerKW": 50,
            "CurrentTypeID": 30,
            "Quantity": 1
        },
        {
            "ID": 105117,
            "ConnectionTypeID": 25,
            "StatusTypeID": 50,
            "LevelID": 2,
            "Amps": 32,
            "Voltage": 400,
            "PowerKW": 22,
            "CurrentTypeID": 20,
            "Quantity": 1
        }
    ],
    "NumberOfPoints": 2,
    "StatusTypeID": 50,
    "DateLastStatusUpdate": "2019-05-06T16:35:00Z",
    "DataQualityLevel": 1,
    "DateCreated": "2016-11-07T05:15:00Z",
    "SubmissionStatusTypeID": 200
}