{
    "IsRecentlyVerified": false,
    "ID": 169989,
    "UUID": "F61A8633-5E0E-4731-8601-8BFDCB193ADC",
    "DataProviderID": 1,
    "OperatorID": 38,
    "UsageTypeID": 1,
    "UsageCost": "Free",
    "AddressInfo": {
        "ID": 170348,
        "Title": "Lidl Blejoi",
        "AddressLine1": "",
        "Town": "Blejoi",
        "StateOrProvince": "Prahova",
        "Postcode": "107070",
        "CountryID": 184,
        "Latitude": 44.98693875659936,
        "Longitude": 26.01294272629184,
        "DistanceUnit": 0
    },
    "Connections": [
        {
            "ID": 259074,
            "ConnectionTypeID": 25,
            "StatusTypeID": 50,
            "LevelID": 2,
            "Amps": 32,
            "PowerKW": 22,
            "CurrentTypeID": 20,
            "Quantity": 2
        }
    ],
    "NumberOfPoints": 2,
    "StatusTypeID": 50,
    "DateLastStatusUpdate": "2020-11-15T23:30:00Z",
    "DataQualityLevel": 1,
    "DateCreated": "2020-11-15T12:01:00Z",
    "SubmissionStatusTypeID": 200
}