{
    "IsRecentlyVerified": false,
    "ID": 75159,
    "UUID": "FE8A2D2E-603D-4000-9773-36CFEDE0BE88",
    "DataProviderID": 1,
    "OperatorID": 3,
    "OperatorsReference": "PG-90961",
    "UsageTypeID": 6,
    "UsageCost": "Free",
    "AddressInfo": {
        "ID": 75505,
        "Title": "Diagmed Healthcare LTD",
        "AddressLine1": "Lumley Close",
        "Town": " Thirsk",
        "Postcode": "YO7 3TD",
        "CountryID": 1,
        "Latitude": 54.231436,
        "Longitude": -1.33128,
        "DistanceUnit": 0
    },
    "Connections": [
        {
            "ID": 108401,
            "ConnectionTypeID": 25,
            "StatusTypeID": 50,
            "LevelID": 2,
            "Amps": 32,
            "Voltage": 230,
            "PowerKW": 7,
            "CurrentTypeID": 10,
            "Quantity": 1
        }
    ],
    "NumberOfPoints": 2,
    "StatusTypeID": 50,
    "DateLastStatusUpdate": "2017-12-20T11:45:00Z",
    "DataQualityLevel": 1,
    "DateCreated": "2016-12-13T12:05:00Z",
    "SubmissionStatusTypeID": 200
}