{
    "IsRecentlyVerified": false,
    "ID": 23817,
    "UUID": "A5EDA285-4CA2-4152-95CA-C0705B0703ED",
    "DataProviderID": 1,
    "OperatorID": 206,
    "UsageTypeID": 4,
    "UsageCost": "Free",
    "AddressInfo": {
        "ID": 24162,
        "Title": "B:SM 35 - Rius i Taulet",
        "AddressLine1": "Av. de Rius i Taulet, 4-12",
        "Town": "BARCELONA",
        "StateOrProvince": "Barcelona",
        "Postcode": "08004",
        "CountryID": 210,
        "Latitude": 41.372299,
        "Longitude": 2.153134,
        "ContactTelephone1": "93.423.53.61",
        "AccessComments": "Aparcament públic - Targeta BCN Live / Public parking - BCN Live card",
        "RelatedURL": "http://www.aparcamentsbsm.cat/index.php/fichas-xarxa-04/rius-i-taulet-2000-es.html",
        "DistanceUnit": 0
    },
    "Connections": [
        {
            "ID": 25851,
            "ConnectionTypeID": 25,
            "StatusTypeID": 50,
            "LevelID": 2,
            "Amps": 32,
            "Voltage": 230,
            "PowerKW": 7.2,
            "Quantity": 3
        },
        {
            "ID": 65464,
            "ConnectionTypeID": 28,
            "StatusTypeID": 50,
            "LevelID": 2,
            "Amps": 32,
            "Voltage": 230,
            "PowerKW": 3.6,
            "CurrentTypeID": 10,
            "Quantity": 3
        }
    ],
    "NumberOfPoints": 3,
    "GeneralComments": "There are 3 extra bays for motorcycles",
    "StatusTypeID": 50,
    "DateLastStatusUpdate": "2015-09-06T18:58:00Z",
    "DataQualityLevel": 1,
    "DateCreated": "2014-06-03T05:18:00Z",
    "SubmissionStatusTypeID": 200
}