{
    "IsRecentlyVerified": false,
    "ID": 135820,
    "UUID": "69744C52-1E0B-4B5F-BCC9-89DD0827E5C4",
    "DataProviderID": 18,
    "DataProvidersReference": "79be879098bd58e40f2c142f45cd255e",
    "OperatorID": 2244,
    "UsageTypeID": 5,
    "AddressInfo": {
        "ID": 136166,
        "Title": "Vicarage Road",
        "AddressLine1": "Vicarage Road",
        "Town": "London",
        "Postcode": "SW14 8RZ",
        "CountryID": 1,
        "Latitude": 51.460171,
        "Longitude": -0.26528,
        "AccessComments": "",
        "RelatedURL": "https://www.ubitricity.com",
        "DistanceUnit": 0
    },
    "Connections": [
        {
            "ID": 190241,
            "ConnectionTypeID": 25,
            "Reference": "suby1100000475",
            "StatusTypeID": 50,
            "LevelID": 2,
            "Amps": 16,
            "Voltage": 230,
            "PowerKW": 3.7,
            "CurrentTypeID": 10
        }
    ],
    "StatusTypeID": 0,
    "DateLastStatusUpdate": "2021-04-25T05:46:00Z",
    "MetadataValues": [
        {
            "ID": 5672,
            "MetadataFieldID": 4,
            "ItemValue": "Contains public sector information licensed under the Open Government Licence v2.0. http://www.nationalarchives.gov.uk/doc/open-government-licence/version/2/"
        }
    ],
    "DataQualityLevel": 3,
    "DateCreated": "2019-12-24T05:22:00Z",
    "SubmissionStatusTypeID": 100
}