{
    "IsRecentlyVerified": false,
    "ID": 35608,
    "UUID": "1B69E74F-360A-49AD-8466-7E6E66A97E50",
    "DataProviderID": 26,
    "DataProvidersReference": "49815",
    "OperatorID": 73,
    "OperatorsReference": "EV-Box EVB-P1338006",
    "UsageCost": "0.00 jaarabonnement",
    "AddressInfo": {
        "ID": 35954,
        "Title": "Papendorpseweg 100",
        "AddressLine1": "Papendorpseweg 100",
        "Town": "Utrecht",
        "Postcode": "3528 BJ",
        "CountryID": 159,
        "Latitude": 52.0650747,
        "Longitude": 5.0903194,
        "RelatedURL": "http://www.ev-box.nl",
        "DistanceUnit": 0
    },
    "Connections": [
        {
            "ID": 39119,
            "ConnectionTypeID": 25,
            "LevelID": 2,
            "PowerKW": 11,
            "CurrentTypeID": 10
        },
        {
            "ID": 47968,
            "ConnectionTypeID": 25,
            "LevelID": 2,
            "PowerKW": 11
        },
        {
            "ID": 47969,
            "ConnectionTypeID": 25,
            "LevelID": 2,
            "PowerKW": 11
        },
        {
            "ID": 47970,
            "ConnectionTypeID": 25,
            "LevelID": 2,
            "PowerKW": 11
        }
    ],
    "NumberOfPoints": 1,
    "StatusTypeID": 50,
    "DateLastStatusUpdate": "2016-06-04T02:45:00Z",
    "DataQualityLevel": 3,
    "DateCreated": "2015-01-09T06:05:00Z",
    "SubmissionStatusTypeID": 100
}