{
    "IsRecentlyVerified": false,
    "ID": 106699,
    "UUID": "46E01077-6DA5-4D10-9F40-E8684EAE5798",
    "DataProviderID": 1,
    "DataProvidersReference": "4845",
    "AddressInfo": {
        "ID": 107045,
        "Title": "Tingvallarundeln",
        "AddressLine1": "Kungsgatan 8",
        "Town": "KARLSTAD",
        "StateOrProvince": "VÄRMLAND",
        "Postcode": "65224",
        "CountryID": 216,
        "Latitude": 59.3811274921902,
        "Longitude": 13.505077958107,
        "AccessComments": "Parkeringen mellan Tingvallagymnasiet och Swebank",
        "DistanceUnit": 0
    },
    "Connections": [
        {
            "ID": 150256,
            "ConnectionTypeID": 0,
            "Reference": "1",
            "LevelID": 2,
            "Amps": 16,
            "Voltage": 400,
            "PowerKW": 11,
            "Comments": "Mode 3"
        },
        {
            "ID": 150257,
            "ConnectionTypeID": 0,
            "Reference": "2",
            "LevelID": 2,
            "Amps": 16,
            "Voltage": 400,
            "PowerKW": 11,
            "Comments": "Mode 3"
        },
        {
            "ID": 150258,
            "ConnectionTypeID": 0,
            "Reference": "3",
            "LevelID": 2,
            "Amps": 16,
            "Voltage": 400,
            "PowerKW": 11,
            "Comments": "Mode 3"
        },
        {
            "ID": 150259,
            "ConnectionTypeID": 0,
            "Reference": "4",
            "LevelID": 2,
            "Amps": 16,
            "Voltage": 400,
            "PowerKW": 11,
            "Comments": "Mode 3"
        }
    ],
    "NumberOfPoints": 4,
    "DateLastStatusUpdate": "2020-05-26T08:22:00Z",
    "DataQualityLevel": 2,
    "DateCreated": "2018-06-27T12:11:00Z",
    "SubmissionStatusTypeID": 100
}