{
    "IsRecentlyVerified": false,
    "ID": 23769,
    "UUID": "47089486-A9EB-4058-B7C0-B93F2A90DCD1",
    "DataProviderID": 1,
    "OperatorID": 76,
    "UsageTypeID": 1,
    "UsageCost": "5€/up to 60min",
    "AddressInfo": {
        "ID": 24114,
        "Title": "Õismäe",
        "AddressLine1": "Õismäe street 5",
        "AddressLine2": "Haabersti linnaosa",
        "Town": "Tallinn",
        "StateOrProvince": "Harju maakond",
        "Postcode": "13512",
        "CountryID": 74,
        "Latitude": 59.41342436218971,
        "Longitude": 24.654130778231327,
        "ContactTelephone1": "+372 6511911",
        "ContactEmail": "tugi@elmo.ee",
        "RelatedURL": "http://www.elmo.ee",
        "DistanceUnit": 0
    },
    "Connections": [
        {
            "ID": 25778,
            "ConnectionTypeID": 2,
            "StatusTypeID": 50,
            "LevelID": 3,
            "Amps": 120,
            "Voltage": 500,
            "PowerKW": 50,
            "CurrentTypeID": 30,
            "Quantity": 1
        },
        {
            "ID": 25779,
            "ConnectionTypeID": 25,
            "StatusTypeID": 50,
            "LevelID": 2,
            "Amps": 32,
            "Voltage": 400,
            "PowerKW": 22,
            "CurrentTypeID": 20,
            "Quantity": 1
        }
    ],
    "NumberOfPoints": 1,
    "GeneralComments": "Opened 24h (automatic). \r\nReal-time condition information (operational/not operational/free) - www.elmo.ee \r\nCan pay with client card, SMS or mobile application. \r\nCharger number 37051",
    "StatusTypeID": 50,
    "DateLastStatusUpdate": "2014-05-28T20:53:00Z",
    "DataQualityLevel": 1,
    "DateCreated": "2014-05-28T20:53:00Z",
    "SubmissionStatusTypeID": 200
}