{
    "IsRecentlyVerified": false,
    "ID": 75328,
    "UUID": "694EFBA1-D151-4514-BD49-BF095CED7D7F",
    "DataProviderID": 1,
    "OperatorID": 23,
    "OperatorsReference": "17142",
    "UsageTypeID": 6,
    "UsageCost": "Free",
    "AddressInfo": {
        "ID": 75674,
        "Title": "The Gonville Hotel",
        "AddressLine1": "The Gonville Hotel",
        "Town": "Cambridge",
        "Postcode": "CB1 1LY",
        "CountryID": 1,
        "Latitude": 52.199851,
        "Longitude": 0.128561,
        "ContactTelephone1": "+44 122 336 6611",
        "DistanceUnit": 0
    },
    "Connections": [
        {
            "ID": 108633,
            "ConnectionTypeID": 30,
            "StatusTypeID": 50,
            "LevelID": 2,
            "Amps": 16,
            "Voltage": 400,
            "PowerKW": 11,
            "CurrentTypeID": 20,
            "Quantity": 1
        }
    ],
    "NumberOfPoints": 1,
    "GeneralComments": "1 Tesla Connector, up to 11kW.Available for patrons only. Please call ahead.",
    "StatusTypeID": 50,
    "DateLastStatusUpdate": "2018-10-03T20:02:00Z",
    "DataQualityLevel": 1,
    "DateCreated": "2016-12-14T17:32:00Z",
    "SubmissionStatusTypeID": 200
}