{
    "IsRecentlyVerified": false,
    "ID": 115531,
    "UUID": "61014D0D-3A13-4CA7-A06E-1B514F39BA3C",
    "DataProviderID": 2,
    "DataProvidersReference": "112919",
    "OperatorID": 23,
    "UsageTypeID": 1,
    "AddressInfo": {
        "ID": 115877,
        "Title": "Wellspring Ranch - Tesla Destination",
        "AddressLine1": "9150 Santa Rita Rd",
        "Town": "Cayucos",
        "StateOrProvince": "CA",
        "Postcode": "93430",
        "CountryID": 2,
        "Latitude": 35.49624,
        "Longitude": -120.806161,
        "ContactTelephone1": "805-995-1644  877-798-3752",
        "AccessComments": "24 hours daily; for Tesla use only; for guest use only; see front desk for access",
        "RelatedURL": "https://www.tesla.com/destination-charging",
        "DistanceUnit": 0
    },
    "Connections": [
        {
            "ID": 162548,
            "ConnectionTypeID": 0,
            "LevelID": 2,
            "Amps": 16,
            "Voltage": 230,
            "PowerKW": 3,
            "CurrentTypeID": 10,
            "Quantity": 1
        }
    ],
    "DateLastStatusUpdate": "2019-04-06T04:02:00Z",
    "DataQualityLevel": 3,
    "DateCreated": "2019-02-11T07:13:00Z",
    "SubmissionStatusTypeID": 100
}