{
    "IsRecentlyVerified": false,
    "ID": 183101,
    "UUID": "F8EA2978-DD1E-43B9-B3B7-84E35A9DE4CB",
    "DataProviderID": 29,
    "DataProvidersReference": "13200",
    "OperatorID": 127,
    "AddressInfo": {
        "ID": 183460,
        "Title": "Bahnhofstraße",
        "AddressLine1": "Bahnhofstraße",
        "Town": "Wilhelmshaven",
        "Postcode": "26382",
        "CountryID": 87,
        "Latitude": 53.519587715107,
        "Longitude": 8.109224438667,
        "DistanceUnit": 0
    },
    "Connections": [
        {
            "ID": 289670,
            "ConnectionTypeID": 25,
            "StatusTypeID": 50,
            "LevelID": 2,
            "PowerKW": 22,
            "CurrentTypeID": 20
        },
        {
            "ID": 289671,
            "ConnectionTypeID": 25,
            "StatusTypeID": 50,
            "LevelID": 2,
            "PowerKW": 22,
            "CurrentTypeID": 20
        }
    ],
    "StatusTypeID": 50,
    "DateLastStatusUpdate": "2021-07-12T02:51:00Z",
    "MetadataValues": [
        {
            "ID": 15394,
            "MetadataFieldID": 4,
            "ItemValue": "Data from the German chargepoint registry provided by Bundesnetzagentur.de under the CC-BY 4.0 license"
        }
    ],
    "DataQualityLevel": 3,
    "DateCreated": "2021-07-08T10:03:00Z",
    "SubmissionStatusTypeID": 100
}