{
    "IsRecentlyVerified": false,
    "ID": 162661,
    "UUID": "D627CEB4-1567-4D17-9E0E-85F1C98805CF",
    "DataProviderID": 1,
    "OperatorID": 21,
    "UsageTypeID": 4,
    "UsageCost": "Mobi.E compatible card or App",
    "AddressInfo": {
        "ID": 163018,
        "Title": "SNT-00051",
        "AddressLine1": "A16, km 9,5, Lanço Lourel/Ranholas",
        "Town": "Mem Martins",
        "StateOrProvince": "Lisboa",
        "Postcode": "2710",
        "CountryID": 180,
        "Latitude": 38.79256470581424,
        "Longitude": -9.359182218234906,
        "AccessComments": "Southbound",
        "DistanceUnit": 0
    },
    "Connections": [
        {
            "ID": 234109,
            "ConnectionTypeID": 33,
            "StatusTypeID": 50,
            "LevelID": 3,
            "Amps": 125,
            "Voltage": 500,
            "PowerKW": 50,
            "CurrentTypeID": 30,
            "Quantity": 1
        },
        {
            "ID": 306305,
            "ConnectionTypeID": 2,
            "StatusTypeID": 50,
            "LevelID": 3,
            "Amps": 120,
            "Voltage": 500,
            "PowerKW": 50,
            "CurrentTypeID": 30,
            "Quantity": 1
        }
    ],
    "NumberOfPoints": 1,
    "StatusTypeID": 50,
    "DateLastStatusUpdate": "2021-09-25T19:24:00Z",
    "DataQualityLevel": 1,
    "DateCreated": "2020-08-13T18:41:00Z",
    "SubmissionStatusTypeID": 200
}