{
    "IsRecentlyVerified": false,
    "ID": 145609,
    "UUID": "3781E5FC-2C2B-49DC-B90C-96D6D63E8849",
    "DataProviderID": 2,
    "DataProvidersReference": "129941",
    "OperatorID": 89,
    "UsageTypeID": 1,
    "AddressInfo": {
        "ID": 145961,
        "Title": "FLO - Elements Casino",
        "AddressLine1": "1708 island hwy",
        "Town": "View Royal",
        "StateOrProvince": "BC",
        "Postcode": "V9B 1H8",
        "CountryID": 44,
        "Latitude": 48.451769,
        "Longitude": -123.464554,
        "ContactTelephone1": "888-356-8911",
        "AccessComments": "24 hours daily",
        "RelatedURL": "https://flo.ca/",
        "DistanceUnit": 0
    },
    "Connections": [
        {
            "ID": 202322,
            "ConnectionTypeID": 1,
            "LevelID": 2,
            "Amps": 16,
            "Voltage": 230,
            "PowerKW": 3.7,
            "CurrentTypeID": 10,
            "Quantity": 3
        }
    ],
    "StatusTypeID": 50,
    "DateLastStatusUpdate": "2020-06-26T03:11:00Z",
    "DataQualityLevel": 3,
    "DateCreated": "2019-12-24T09:25:00Z",
    "SubmissionStatusTypeID": 100
}