{
    "IsRecentlyVerified": false,
    "ID": 120812,
    "UUID": "FA5C0120-E241-4EEC-B67E-6E4FC27DB943",
    "DataProviderID": 2,
    "DataProvidersReference": "52108",
    "UsageTypeID": 1,
    "AddressInfo": {
        "ID": 121158,
        "Title": "Peachy Airport Parking",
        "AddressLine1": "3100 Sylvan Rd",
        "Town": "Atlanta",
        "StateOrProvince": "GA",
        "Postcode": "30354",
        "CountryID": 2,
        "Latitude": 33.669868,
        "Longitude": -84.418478,
        "ContactTelephone1": "404-767-7275",
        "AccessComments": "24 hours daily; pay lot; reservations accepted",
        "RelatedURL": "",
        "DistanceUnit": 0
    },
    "Connections": [
        {
            "ID": 170206,
            "ConnectionTypeID": 22,
            "LevelID": 1,
            "Amps": 16,
            "Voltage": 120,
            "PowerKW": 1.9,
            "CurrentTypeID": 10,
            "Quantity": 32
        }
    ],
    "DateLastStatusUpdate": "2020-06-26T02:55:00Z",
    "DataQualityLevel": 3,
    "DateCreated": "2019-04-01T04:59:00Z",
    "SubmissionStatusTypeID": 100
}