{
    "IsRecentlyVerified": false,
    "ID": 111641,
    "UUID": "EBDEA483-BC22-4020-A417-02F5D3209B4C",
    "DataProviderID": 2,
    "DataProvidersReference": "82943",
    "UsageTypeID": 1,
    "AddressInfo": {
        "ID": 111987,
        "Title": "Ecole de Sainte-Famille",
        "AddressLine1": "2482 Ch Royal",
        "Town": "St-Famille",
        "StateOrProvince": "QC",
        "Postcode": "G0A 3P0",
        "CountryID": 44,
        "Latitude": 46.973152,
        "Longitude": -70.962167,
        "ContactTelephone1": "418-829-3572  418-829-0297",
        "AccessComments": "24 hours daily",
        "RelatedURL": "",
        "DistanceUnit": 0
    },
    "Connections": [
        {
            "ID": 157112,
            "ConnectionTypeID": 1,
            "LevelID": 2,
            "Amps": 16,
            "Voltage": 230,
            "PowerKW": 3.7,
            "CurrentTypeID": 10,
            "Quantity": 2
        }
    ],
    "DateLastStatusUpdate": "2020-06-26T03:10:00Z",
    "DataQualityLevel": 3,
    "DateCreated": "2018-10-18T23:37:00Z",
    "SubmissionStatusTypeID": 100
}