{
    "IsRecentlyVerified": false,
    "ID": 140072,
    "UUID": "C83578A4-4707-44AB-9B2B-902B807ACF23",
    "DataProviderID": 2,
    "DataProvidersReference": "93430",
    "OperatorID": 15,
    "UsageTypeID": 4,
    "AddressInfo": {
        "ID": 140424,
        "Title": "Spinx",
        "AddressLine1": "7495 Augusta Rd",
        "Town": "Piedmont",
        "StateOrProvince": "SC",
        "Postcode": "29673",
        "CountryID": 2,
        "Latitude": 34.727677,
        "Longitude": -82.388541,
        "ContactTelephone1": "877-455-3833",
        "AccessComments": "24 hours daily\r\nPublic - Card key at all times",
        "RelatedURL": "https://www.evgo.com/",
        "DistanceUnit": 0
    },
    "Connections": [
        {
            "ID": 195617,
            "ConnectionTypeID": 2,
            "LevelID": 3,
            "Amps": 100,
            "Voltage": 400,
            "PowerKW": 40,
            "CurrentTypeID": 30,
            "Quantity": 1
        },
        {
            "ID": 195618,
            "ConnectionTypeID": 32,
            "LevelID": 3,
            "Amps": 100,
            "Voltage": 400,
            "PowerKW": 40,
            "CurrentTypeID": 30,
            "Quantity": 1
        }
    ],
    "StatusTypeID": 50,
    "DateLastStatusUpdate": "2020-06-26T02:57:00Z",
    "DataQualityLevel": 3,
    "DateCreated": "2019-12-24T09:12:00Z",
    "SubmissionStatusTypeID": 100
}