{
    "IsRecentlyVerified": false,
    "ID": 47205,
    "UUID": "A16A7AE6-F5BC-473E-8EAF-02FE9B1FEAA4",
    "DataProviderID": 1,
    "OperatorID": 23,
    "OperatorsReference": "6457",
    "UsageTypeID": 1,
    "UsageCost": "€0.34/min >=60kW; €0.17/min <60kW; Andere Tarife für ältere Autos",
    "AddressInfo": {
        "ID": 47551,
        "Title": "Tesla Supercharger",
        "AddressLine1": "August-Horch-Straße 12",
        "Town": "Münchberg",
        "StateOrProvince": "Bayern",
        "Postcode": "95213",
        "CountryID": 87,
        "Latitude": 50.2028848094056,
        "Longitude": 11.7765309032542,
        "ContactTelephone1": "+49800 5893542",
        "ContactTelephone2": "+498921 093303",
        "AccessComments": "Aktuell nur vom Model S nutzbar. 4 kostenlose durchgehend nutzbare Parkplätze.",
        "RelatedURL": "https://www.teslamotors.com/",
        "DistanceUnit": 0
    },
    "Connections": [
        {
            "ID": 58181,
            "ConnectionTypeID": 27,
            "StatusTypeID": 50,
            "LevelID": 3,
            "Amps": 300,
            "Voltage": 400,
            "PowerKW": 120,
            "CurrentTypeID": 30,
            "Quantity": 6
        }
    ],
    "NumberOfPoints": 6,
    "StatusTypeID": 50,
    "DateLastStatusUpdate": "2017-01-15T23:11:00Z",
    "DataQualityLevel": 1,
    "DateCreated": "2015-05-18T14:21:00Z",
    "SubmissionStatusTypeID": 200
}