{
    "IsRecentlyVerified": false,
    "ID": 124639,
    "UUID": "BF006DBC-3121-47DC-B9C9-72E3C80DB3BA",
    "DataProviderID": 2,
    "DataProvidersReference": "50674",
    "OperatorID": 5,
    "UsageTypeID": 1,
    "AddressInfo": {
        "ID": 124985,
        "Title": "KSU PARKING GAR",
        "AddressLine1": "808-868 N 17th St",
        "Town": "Manhattan",
        "StateOrProvince": "KS",
        "Postcode": "66502",
        "CountryID": 2,
        "Latitude": 39.1868379,
        "Longitude": -96.5827872,
        "ContactTelephone1": "888-758-4389",
        "AccessComments": "24 hours daily",
        "RelatedURL": "http://www.chargepoint.com/",
        "DistanceUnit": 0
    },
    "Connections": [
        {
            "ID": 174768,
            "ConnectionTypeID": 9,
            "LevelID": 1,
            "Amps": 16,
            "Voltage": 120,
            "PowerKW": 1.9,
            "CurrentTypeID": 10,
            "Quantity": 1
        },
        {
            "ID": 174769,
            "ConnectionTypeID": 1,
            "LevelID": 2,
            "Amps": 16,
            "Voltage": 230,
            "PowerKW": 3.7,
            "CurrentTypeID": 10,
            "Quantity": 1
        }
    ],
    "DateLastStatusUpdate": "2020-06-26T03:01:00Z",
    "DataQualityLevel": 3,
    "DateCreated": "2019-04-06T05:04:00Z",
    "SubmissionStatusTypeID": 100
}