{
    "IsRecentlyVerified": false,
    "ID": 187190,
    "UUID": "3090A573-26E3-4982-8378-C705EDD38021",
    "DataProviderID": 29,
    "DataProvidersReference": "12843",
    "OperatorID": 220,
    "AddressInfo": {
        "ID": 187549,
        "Title": "Blankeneser Bahnhofstraße 16",
        "AddressLine1": "Blankeneser Bahnhofstraße 16",
        "Town": "Hamburg",
        "Postcode": "22587",
        "CountryID": 87,
        "Latitude": 53.559879,
        "Longitude": 9.811179,
        "DistanceUnit": 0
    },
    "Connections": [
        {
            "ID": 301652,
            "ConnectionTypeID": 28,
            "StatusTypeID": 50,
            "LevelID": 2,
            "PowerKW": 22,
            "CurrentTypeID": 20
        },
        {
            "ID": 301653,
            "ConnectionTypeID": 25,
            "StatusTypeID": 50,
            "LevelID": 2,
            "PowerKW": 22,
            "CurrentTypeID": 20
        },
        {
            "ID": 301654,
            "ConnectionTypeID": 28,
            "StatusTypeID": 50,
            "LevelID": 2,
            "PowerKW": 22,
            "CurrentTypeID": 20
        },
        {
            "ID": 301655,
            "ConnectionTypeID": 25,
            "StatusTypeID": 50,
            "LevelID": 2,
            "PowerKW": 22,
            "CurrentTypeID": 20
        }
    ],
    "StatusTypeID": 50,
    "DateLastStatusUpdate": "2021-07-12T02:51:00Z",
    "MetadataValues": [
        {
            "ID": 19430,
            "MetadataFieldID": 4,
            "ItemValue": "Data from the German chargepoint registry provided by Bundesnetzagentur.de under the CC-BY 4.0 license"
        }
    ],
    "DataQualityLevel": 3,
    "DateCreated": "2021-07-12T02:51:00Z",
    "SubmissionStatusTypeID": 100
}