{
    "IsRecentlyVerified": false,
    "ID": 103615,
    "UUID": "D791A671-9135-498A-9F1B-F10B7922D0FC",
    "DataProviderID": 1,
    "OperatorID": 1,
    "UsageTypeID": 1,
    "AddressInfo": {
        "ID": 103961,
        "Title": "Ather Grid Point - Herbs and Spices",
        "AddressLine1": "Whitefield Main Road",
        "AddressLine2": "Hagadur",
        "Town": "Bengaluru",
        "StateOrProvince": "Bangalore Urban",
        "Postcode": "560066",
        "CountryID": 106,
        "Latitude": 12.9679246469975,
        "Longitude": 77.7497762255596,
        "DistanceUnit": 0
    },
    "Connections": [
        {
            "ID": 146282,
            "ConnectionTypeID": 0,
            "StatusTypeID": 50,
            "LevelID": 2,
            "Amps": 16,
            "Voltage": 270,
            "PowerKW": 3,
            "CurrentTypeID": 10,
            "Quantity": 1
        }
    ],
    "NumberOfPoints": 1,
    "StatusTypeID": 50,
    "DateLastStatusUpdate": "2018-05-11T11:04:00Z",
    "DataQualityLevel": 1,
    "DateCreated": "2018-05-04T08:44:00Z",
    "SubmissionStatusTypeID": 200
}