{
    "IsRecentlyVerified": false,
    "ID": 124337,
    "UUID": "49950511-77AD-4308-B726-C38C7A69EB25",
    "DataProviderID": 2,
    "DataProvidersReference": "27302",
    "UsageTypeID": 1,
    "AddressInfo": {
        "ID": 124683,
        "Title": "Rio Vista City Hall",
        "AddressLine1": "1 Main St",
        "Town": "Rio Vista",
        "StateOrProvince": "CA",
        "Postcode": "94571",
        "CountryID": 2,
        "Latitude": 38.15485,
        "Longitude": -121.69,
        "ContactTelephone1": "707-374-6451",
        "AccessComments": "24 hours daily",
        "RelatedURL": "",
        "DistanceUnit": 0
    },
    "Connections": [
        {
            "ID": 174422,
            "ConnectionTypeID": 1,
            "LevelID": 2,
            "Amps": 16,
            "Voltage": 230,
            "PowerKW": 3.7,
            "CurrentTypeID": 10,
            "Quantity": 1
        },
        {
            "ID": 174423,
            "ConnectionTypeID": 1,
            "LevelID": 2,
            "Amps": 16,
            "Voltage": 230,
            "PowerKW": 3,
            "CurrentTypeID": 10,
            "Quantity": 1
        }
    ],
    "DateLastStatusUpdate": "2020-06-26T02:59:00Z",
    "DataQualityLevel": 3,
    "DateCreated": "2019-04-06T05:03:00Z",
    "SubmissionStatusTypeID": 100
}