{
    "IsRecentlyVerified": false,
    "ID": 130824,
    "UUID": "934E68AB-D16E-46A6-9B63-A9912ED60626",
    "DataProviderID": 1,
    "OperatorID": 3343,
    "UsageTypeID": 1,
    "AddressInfo": {
        "ID": 131170,
        "Title": "McDonald's Nijmegen Noviu.",
        "AddressLine1": "Wijchenseweg 202",
        "AddressLine2": "Nijmegen",
        "Town": "Nijmegen",
        "StateOrProvince": "Gelderland",
        "Postcode": "6538 SX",
        "CountryID": 159,
        "Latitude": 51.82525258085269,
        "Longitude": 5.803722694323596,
        "DistanceUnit": 0
    },
    "Connections": [
        {
            "ID": 183358,
            "ConnectionTypeID": 2,
            "StatusTypeID": 50,
            "LevelID": 3,
            "PowerKW": 50,
            "CurrentTypeID": 30,
            "Quantity": 1
        },
        {
            "ID": 183359,
            "ConnectionTypeID": 33,
            "StatusTypeID": 50,
            "LevelID": 3,
            "PowerKW": 50,
            "CurrentTypeID": 30,
            "Quantity": 1
        },
        {
            "ID": 183360,
            "ConnectionTypeID": 1036,
            "StatusTypeID": 50,
            "LevelID": 3,
            "Amps": 63,
            "Voltage": 400,
            "PowerKW": 43,
            "CurrentTypeID": 20,
            "Quantity": 1
        }
    ],
    "NumberOfPoints": 1,
    "StatusTypeID": 50,
    "DateLastStatusUpdate": "2019-08-24T10:48:00Z",
    "DataQualityLevel": 1,
    "DateCreated": "2019-08-18T06:50:00Z",
    "SubmissionStatusTypeID": 200
}