{
    "IsRecentlyVerified": false,
    "ID": 136215,
    "UUID": "7EAC90AF-4978-4A26-BA5D-98078F27EEE6",
    "DataProviderID": 18,
    "DataProvidersReference": "787892b7477cdd5f0316d324096062b1",
    "OperatorID": 20,
    "UsageTypeID": 4,
    "AddressInfo": {
        "ID": 136561,
        "Title": "Longdown Avenue",
        "AddressLine1": "Longdown Avenue",
        "AddressLine2": "Filton",
        "Town": "Patchway",
        "Postcode": "BS34 8QZ",
        "CountryID": 1,
        "Latitude": 51.501078,
        "Longitude": -2.554901,
        "AccessComments": "",
        "RelatedURL": "http://www.chargeyourcar.org.uk",
        "DistanceUnit": 0
    },
    "Connections": [
        {
            "ID": 190649,
            "ConnectionTypeID": 3,
            "Reference": "SW1",
            "StatusTypeID": 50,
            "LevelID": 2,
            "Amps": 13,
            "Voltage": 230,
            "PowerKW": 3,
            "CurrentTypeID": 10
        },
        {
            "ID": 190650,
            "ConnectionTypeID": 25,
            "Reference": "SW2",
            "StatusTypeID": 50,
            "LevelID": 2,
            "Amps": 32,
            "Voltage": 230,
            "PowerKW": 7,
            "CurrentTypeID": 10
        }
    ],
    "StatusTypeID": 0,
    "DateLastStatusUpdate": "2019-12-24T05:22:00Z",
    "MetadataValues": [
        {
            "ID": 6067,
            "MetadataFieldID": 4,
            "ItemValue": "Contains public sector information licensed under the Open Government Licence v2.0. http://www.nationalarchives.gov.uk/doc/open-government-licence/version/2/"
        }
    ],
    "DataQualityLevel": 3,
    "DateCreated": "2019-12-24T05:22:00Z",
    "SubmissionStatusTypeID": 100
}