{
    "IsRecentlyVerified": false,
    "ID": 186123,
    "UUID": "53B78D6B-B522-451F-8ED7-EAC6DADB0002",
    "DataProviderID": 29,
    "DataProvidersReference": "9875",
    "AddressInfo": {
        "ID": 186482,
        "Title": "Bertholdstraße ",
        "AddressLine1": "Bertholdstraße ",
        "Town": "Schleusingen",
        "Postcode": "98443",
        "CountryID": 87,
        "Latitude": 50.51054,
        "Longitude": 10.755407,
        "DistanceUnit": 0
    },
    "Connections": [
        {
            "ID": 297851,
            "ConnectionTypeID": 25,
            "StatusTypeID": 50,
            "LevelID": 2,
            "PowerKW": 22,
            "CurrentTypeID": 20
        },
        {
            "ID": 297852,
            "ConnectionTypeID": 25,
            "StatusTypeID": 50,
            "LevelID": 2,
            "PowerKW": 22,
            "CurrentTypeID": 20
        }
    ],
    "StatusTypeID": 50,
    "DateLastStatusUpdate": "2021-07-12T02:45:00Z",
    "MetadataValues": [
        {
            "ID": 18365,
            "MetadataFieldID": 4,
            "ItemValue": "Data from the German chargepoint registry provided by Bundesnetzagentur.de under the CC-BY 4.0 license"
        }
    ],
    "DataQualityLevel": 3,
    "DateCreated": "2021-07-12T02:45:00Z",
    "SubmissionStatusTypeID": 100
}