{
    "IsRecentlyVerified": false,
    "ID": 146237,
    "UUID": "79CFDE84-8294-4E24-AEE5-FCE7FF2E0F8C",
    "DataProviderID": 1,
    "OperatorID": 105,
    "UsageTypeID": 4,
    "AddressInfo": {
        "ID": 146589,
        "Title": "Bahnhofsparkplatz Völksen-Eldagsen",
        "AddressLine1": "Südfeldstraße 4",
        "Town": "Springe",
        "StateOrProvince": "Region Hannover",
        "Postcode": "31832",
        "CountryID": 87,
        "Latitude": 52.211576875351426,
        "Longitude": 9.626254184681102,
        "ContactTelephone1": "+49 5041 802840",
        "RelatedURL": "http://www.stadtwerke-springe.de/",
        "DistanceUnit": 0
    },
    "Connections": [
        {
            "ID": 203210,
            "ConnectionTypeID": 25,
            "StatusTypeID": 50,
            "LevelID": 2,
            "Amps": 32,
            "Voltage": 400,
            "PowerKW": 22,
            "CurrentTypeID": 20,
            "Quantity": 2
        }
    ],
    "NumberOfPoints": 2,
    "GeneralComments": "Durchgehend nutzbare Ladesäule auf dem Parkplatz am Bahnhof Springe Richtung Hannover. Direkt neben dem Fahrradunterstand gleich links. ",
    "StatusTypeID": 50,
    "DateLastStatusUpdate": "2020-01-03T11:41:00Z",
    "DataQualityLevel": 1,
    "DateCreated": "2020-01-03T11:41:00Z",
    "SubmissionStatusTypeID": 200
}