{
    "MediaItems": [
        {
            "ID": 22111,
            "ChargePointID": 155797,
            "ItemURL": "https://s3-ap-southeast-2.amazonaws.com/openchargemap/images/IT/OCM155797/OCM-155797.orig.2020042417343024.jpg",
            "ItemThumbnailURL": "https://s3-ap-southeast-2.amazonaws.com/openchargemap/images/IT/OCM155797/OCM-155797.thmb.2020042417343024.jpg",
            "Comment": "",
            "IsEnabled": true,
            "IsVideo": false,
            "IsFeaturedItem": false,
            "IsExternalResource": false,
            "User": {
                "ID": 19496,
                "Username": "ECOGY"
            },
            "DateCreated": "2020-04-24T17:35:00Z"
        },
        {
            "ID": 22107,
            "ChargePointID": 155797,
            "ItemURL": "https://s3-ap-southeast-2.amazonaws.com/openchargemap/images/IT/OCM155797/OCM-155797.orig.2020042415114092.jpg",
            "ItemThumbnailURL": "https://s3-ap-southeast-2.amazonaws.com/openchargemap/images/IT/OCM155797/OCM-155797.thmb.2020042415114092.jpg",
            "Comment": "",
            "IsEnabled": true,
            "IsVideo": false,
            "IsFeaturedItem": false,
            "IsExternalResource": false,
            "User": {
                "ID": 19496,
                "Username": "ECOGY"
            },
            "DateCreated": "2020-04-24T15:12:00Z"
        },
        {
            "ID": 22106,
            "ChargePointID": 155797,
            "ItemURL": "https://s3-ap-southeast-2.amazonaws.com/openchargemap/images/IT/OCM155797/OCM-155797.orig.2020042415111781.jpg",
            "ItemThumbnailURL": "https://s3-ap-southeast-2.amazonaws.com/openchargemap/images/IT/OCM155797/OCM-155797.thmb.2020042415111781.jpg",
            "Comment": "",
            "IsEnabled": true,
            "IsVideo": false,
            "IsFeaturedItem": false,
            "IsExternalResource": false,
            "User": {
                "ID": 19496,
                "Username": "ECOGY"
            },
            "DateCreated": "2020-04-24T15:11:00Z"
        }
    ],
    "IsRecentlyVerified": false,
    "ID": 155797,
    "UUID": "088C8B88-78B3-40AD-892E-DD961DF3199B",
    "DataProviderID": 1,
    "OperatorID": 45,
    "UsageTypeID": 4,
    "UsageCost": "0,30 Euro/ kWh",
    "AddressInfo": {
        "ID": 156151,
        "Title": "Hotel Solaia***",
        "AddressLine1": "Oswald-von-Wolkenstein-Str. 61",
        "Town": "Kastelruth ",
        "StateOrProvince": "Bozen",
        "Postcode": "39040",
        "CountryID": 112,
        "Latitude": 46.55910702006895,
        "Longitude": 11.557169750238359,
        "ContactTelephone1": "+39 0471 839 718",
        "ContactEmail": "info@solaia.it",
        "AccessComments": "Für Hotelkunden mittels RFID Karte\r\nEcogy 9 kW",
        "RelatedURL": "https://www.solaia.it/",
        "DistanceUnit": 0
    },
    "Connections": [
        {
            "ID": 219360,
            "ConnectionTypeID": 25,
            "StatusTypeID": 50,
            "LevelID": 2,
            "Amps": 13,
            "Voltage": 400,
            "PowerKW": 9,
            "CurrentTypeID": 20,
            "Quantity": 1
        }
    ],
    "NumberOfPoints": 1,
    "GeneralComments": "Die Ladestation befindet sich auf dem Kundenparkplatz",
    "StatusTypeID": 50,
    "DateLastStatusUpdate": "2020-04-24T17:35:00Z",
    "DataQualityLevel": 1,
    "DateCreated": "2020-04-24T15:11:00Z",
    "SubmissionStatusTypeID": 200
}