{
    "IsRecentlyVerified": false,
    "ID": 185526,
    "UUID": "D3C630F7-AF5A-4AB8-A3BD-0BBDB3A51D6F",
    "DataProviderID": 29,
    "DataProvidersReference": "19048",
    "OperatorID": 45,
    "AddressInfo": {
        "ID": 185885,
        "Title": "Omsewitzer Ring 45",
        "AddressLine1": "Omsewitzer Ring 45",
        "Town": "Dresden Gabitz",
        "Postcode": "01169",
        "CountryID": 87,
        "Latitude": 51.04913,
        "Longitude": 13.66324,
        "DistanceUnit": 0
    },
    "Connections": [
        {
            "ID": 295132,
            "ConnectionTypeID": 25,
            "StatusTypeID": 50,
            "LevelID": 2,
            "PowerKW": 22,
            "CurrentTypeID": 20
        },
        {
            "ID": 295133,
            "ConnectionTypeID": 25,
            "StatusTypeID": 50,
            "LevelID": 2,
            "PowerKW": 22,
            "CurrentTypeID": 20
        }
    ],
    "StatusTypeID": 50,
    "DateLastStatusUpdate": "2021-07-12T02:46:00Z",
    "MetadataValues": [
        {
            "ID": 17817,
            "MetadataFieldID": 4,
            "ItemValue": "Data from the German chargepoint registry provided by Bundesnetzagentur.de under the CC-BY 4.0 license"
        }
    ],
    "DataQualityLevel": 3,
    "DateCreated": "2021-07-08T10:07:00Z",
    "SubmissionStatusTypeID": 100
}