{
    "UserComments": [
        {
            "ID": 23147,
            "ChargePointID": 65862,
            "CommentTypeID": 10,
            "UserName": "ForumElettrico.it",
            "Comment": "Per entrare nel parcheggio si ritira il biglietto alla sbarra ma per i primi 45' la sosta è gratuita. Leggi la recensione completa qui > https://www.forumelettrico.it/forum/colonnine-neogy-fast-teatro-navalge-moena-tn-piaz-de-navalge-t10579.html",
            "RelatedURL": "https://www.forumelettrico.it/forum/colonnine-neogy-fast-teatro-navalge-moena-tn-piaz-de-navalge-t10579.html",
            "DateCreated": "2020-08-25T07:14:23.187Z",
            "User": {
                "ID": 11749,
                "Username": "ForumElettrico.it"
            },
            "CheckinStatusTypeID": 10,
            "IsActionedByEditor": false
        },
        {
            "ID": 20814,
            "ChargePointID": 65862,
            "CommentTypeID": 10,
            "UserName": "ForumElettrico.it",
            "RelatedURL": "https://www.forumelettrico.it/forum/colonnina-moena-tessera-ecofuel-t1320.html",
            "DateCreated": "2019-03-20T16:17:47.153Z",
            "User": {
                "ID": 11749,
                "Username": "ForumElettrico.it"
            },
            "CheckinStatusTypeID": 10
        }
    ],
    "MediaItems": [
        {
            "ID": 24425,
            "ChargePointID": 65862,
            "ItemURL": "https://s3-ap-southeast-2.amazonaws.com/openchargemap/images/IT/OCM65862/OCM-65862.orig.2020082316092724.jpg",
            "ItemThumbnailURL": "https://s3-ap-southeast-2.amazonaws.com/openchargemap/images/IT/OCM65862/OCM-65862.thmb.2020082316092724.jpg",
            "Comment": "",
            "IsEnabled": true,
            "IsVideo": false,
            "IsFeaturedItem": false,
            "IsExternalResource": false,
            "User": {
                "ID": 1606,
                "Username": "polianto"
            },
            "DateCreated": "2020-08-23T16:09:00Z"
        },
        {
            "ID": 24130,
            "ChargePointID": 65862,
            "ItemURL": "https://s3-ap-southeast-2.amazonaws.com/openchargemap/images/IT/OCM65862/OCM-65862.orig.2020081217151138.jpg",
            "ItemThumbnailURL": "https://s3-ap-southeast-2.amazonaws.com/openchargemap/images/IT/OCM65862/OCM-65862.thmb.2020081217151138.jpg",
            "Comment": "",
            "IsEnabled": true,
            "IsVideo": false,
            "IsFeaturedItem": false,
            "IsExternalResource": false,
            "User": {
                "ID": 1606,
                "Username": "polianto"
            },
            "DateCreated": "2020-08-12T17:15:00Z"
        },
        {
            "ID": 17812,
            "ChargePointID": 65862,
            "ItemURL": "https://s3-ap-southeast-2.amazonaws.com/openchargemap/images/IT/OCM65862/OCM-65862.orig.2019032016180444.jpg",
            "ItemThumbnailURL": "https://s3-ap-southeast-2.amazonaws.com/openchargemap/images/IT/OCM65862/OCM-65862.thmb.2019032016180444.jpg",
            "Comment": "",
            "IsEnabled": true,
            "IsVideo": false,
            "IsFeaturedItem": false,
            "IsExternalResource": false,
            "User": {
                "ID": 11749,
                "Username": "ForumElettrico.it"
            },
            "DateCreated": "2019-03-20T16:18:00Z"
        },
        {
            "ID": 17813,
            "ChargePointID": 65862,
            "ItemURL": "https://s3-ap-southeast-2.amazonaws.com/openchargemap/images/IT/OCM65862/OCM-65862.orig.2019032016181223.jpg",
            "ItemThumbnailURL": "https://s3-ap-southeast-2.amazonaws.com/openchargemap/images/IT/OCM65862/OCM-65862.thmb.2019032016181223.jpg",
            "Comment": "",
            "IsEnabled": true,
            "IsVideo": false,
            "IsFeaturedItem": false,
            "IsExternalResource": false,
            "User": {
                "ID": 11749,
                "Username": "ForumElettrico.it"
            },
            "DateCreated": "2019-03-20T16:18:00Z"
        },
        {
            "ID": 7992,
            "ChargePointID": 65862,
            "ItemURL": "https://s3-ap-southeast-2.amazonaws.com/openchargemap/images/IT/OCM65862/OCM-65862.orig.2016080916222366.jpg",
            "ItemThumbnailURL": "https://s3-ap-southeast-2.amazonaws.com/openchargemap/images/IT/OCM65862/OCM-65862.thmb.2016080916222366.jpg",
            "Comment": "",
            "IsEnabled": true,
            "IsVideo": false,
            "IsFeaturedItem": false,
            "IsExternalResource": false,
            "User": {
                "ID": 1606,
                "Username": "polianto"
            },
            "DateCreated": "2016-08-09T16:23:00Z"
        },
        {
            "ID": 7990,
            "ChargePointID": 65862,
            "ItemURL": "https://s3-ap-southeast-2.amazonaws.com/openchargemap/images/IT/OCM65862/OCM-65862.orig.2016080916213116.jpg",
            "ItemThumbnailURL": "https://s3-ap-southeast-2.amazonaws.com/openchargemap/images/IT/OCM65862/OCM-65862.thmb.2016080916213116.jpg",
            "Comment": "",
            "IsEnabled": true,
            "IsVideo": false,
            "IsFeaturedItem": false,
            "IsExternalResource": false,
            "User": {
                "ID": 1606,
                "Username": "polianto"
            },
            "DateCreated": "2016-08-09T16:22:00Z"
        },
        {
            "ID": 7991,
            "ChargePointID": 65862,
            "ItemURL": "https://s3-ap-southeast-2.amazonaws.com/openchargemap/images/IT/OCM65862/OCM-65862.orig.2016080916215498.jpg",
            "ItemThumbnailURL": "https://s3-ap-southeast-2.amazonaws.com/openchargemap/images/IT/OCM65862/OCM-65862.thmb.2016080916215498.jpg",
            "Comment": "",
            "IsEnabled": true,
            "IsVideo": false,
            "IsFeaturedItem": false,
            "IsExternalResource": false,
            "User": {
                "ID": 1606,
                "Username": "polianto"
            },
            "DateCreated": "2016-08-09T16:22:00Z"
        }
    ],
    "IsRecentlyVerified": false,
    "ID": 65862,
    "UUID": "B9D5A717-F45C-4E65-A9C6-90352B255F85",
    "DataProviderID": 1,
    "OperatorID": 164,
    "UsageTypeID": 4,
    "AddressInfo": {
        "ID": 66208,
        "Title": "Moena Navalge | Neogy Fast",
        "AddressLine1": "Piazza de Navalge",
        "Town": "Moena",
        "StateOrProvince": "TN",
        "Postcode": "38035",
        "CountryID": 112,
        "Latitude": 46.373545781249,
        "Longitude": 11.6577246558487,
        "DistanceUnit": 0
    },
    "Connections": [
        {
            "ID": 91041,
            "ConnectionTypeID": 1036,
            "StatusTypeID": 50,
            "LevelID": 3,
            "Amps": 64,
            "Voltage": 400,
            "PowerKW": 43,
            "CurrentTypeID": 20,
            "Quantity": 1
        },
        {
            "ID": 91269,
            "ConnectionTypeID": 33,
            "StatusTypeID": 50,
            "LevelID": 3,
            "PowerKW": 50,
            "CurrentTypeID": 30,
            "Quantity": 1
        },
        {
            "ID": 226823,
            "ConnectionTypeID": 2,
            "StatusTypeID": 50,
            "LevelID": 3,
            "PowerKW": 50,
            "CurrentTypeID": 30,
            "Quantity": 1
        }
    ],
    "NumberOfPoints": 2,
    "StatusTypeID": 50,
    "DateLastStatusUpdate": "2020-08-25T07:14:00Z",
    "DataQualityLevel": 1,
    "DateCreated": "2016-05-02T14:40:00Z",
    "SubmissionStatusTypeID": 200
}