{
    "IsRecentlyVerified": false,
    "ID": 169344,
    "UUID": "75A95A1F-EDF5-41AA-BC03-FC8025A45DD6",
    "DataProviderID": 1,
    "OperatorID": 3,
    "OperatorsReference": "PG-70246,PG-85030",
    "UsageTypeID": 4,
    "UsageCost": "Free",
    "AddressInfo": {
        "ID": 169703,
        "Title": "Tesco Extra-West Durrington",
        "AddressLine1": "New Road",
        "Town": "West Durrington",
        "StateOrProvince": "Worthing",
        "Postcode": "BN13 3PB",
        "CountryID": 1,
        "Latitude": 50.832002,
        "Longitude": -0.424792,
        "DistanceUnit": 0
    },
    "Connections": [
        {
            "ID": 257662,
            "ConnectionTypeID": 25,
            "StatusTypeID": 50,
            "LevelID": 2,
            "Amps": 32,
            "Voltage": 230,
            "PowerKW": 7,
            "CurrentTypeID": 10,
            "Quantity": 4
        }
    ],
    "NumberOfPoints": 4,
    "GeneralComments": "This is an open charge unit installed at the Tesco Extra super store at New Road, West Durrington, Worthing",
    "StatusTypeID": 50,
    "DateLastStatusUpdate": "2020-10-15T21:57:00Z",
    "DataQualityLevel": 1,
    "DateCreated": "2020-10-15T21:33:00Z",
    "SubmissionStatusTypeID": 200
}