{
    "IsRecentlyVerified": false,
    "ID": 124995,
    "UUID": "88A1FEC0-2327-4693-88A4-9A700DF35AE5",
    "DataProviderID": 1,
    "OperatorID": 3382,
    "UsageTypeID": 4,
    "AddressInfo": {
        "ID": 125341,
        "Title": "Villa di Serio Ripe | Ressolar",
        "AddressLine1": "Via delle Ripe, 2",
        "Town": "Villa di Serio",
        "StateOrProvince": "BG",
        "Postcode": "2402",
        "CountryID": 112,
        "Latitude": 45.71866849349635,
        "Longitude": 9.736599339686677,
        "ContactTelephone1": "+39 035 36 92 145",
        "ContactEmail": "info@ressolar.it",
        "RelatedURL": "https://www.ressolar.it/mobilita-sostenibile/",
        "DistanceUnit": 0
    },
    "Connections": [
        {
            "ID": 175198,
            "ConnectionTypeID": 25,
            "StatusTypeID": 150,
            "LevelID": 2,
            "Amps": 32,
            "Voltage": 400,
            "PowerKW": 22,
            "CurrentTypeID": 20,
            "Quantity": 2
        }
    ],
    "NumberOfPoints": 2,
    "GeneralComments": "Si attiva con l'App Wroom",
    "StatusTypeID": 150,
    "DateLastStatusUpdate": "2020-01-23T09:06:00Z",
    "DataQualityLevel": 1,
    "DateCreated": "2019-04-07T13:50:00Z",
    "SubmissionStatusTypeID": 200
}