{
    "IsRecentlyVerified": false,
    "ID": 79216,
    "UUID": "3BDE223D-719D-45AA-8863-4FCD64FE71E5",
    "DataProviderID": 1,
    "OperatorID": 23,
    "OperatorsReference": "8689",
    "UsageTypeID": 4,
    "UsageCost": "CNY 1.80/kWh;其他关税老车/other tariffs for older cars",
    "AddressInfo": {
        "ID": 79562,
        "Title": "Yiwu Your World Plaza Supercharger",
        "AddressLine1": "180 Binjiang Mid RD",
        "Town": "Yiwu",
        "StateOrProvince": "Zhejiang",
        "Postcode": "322000",
        "CountryID": 50,
        "Latitude": 29.301123,
        "Longitude": 120.084763,
        "DistanceUnit": 0
    },
    "Connections": [
        {
            "ID": 113835,
            "ConnectionTypeID": 27,
            "StatusTypeID": 0,
            "LevelID": 3,
            "PowerKW": 120,
            "CurrentTypeID": 30,
            "Quantity": 4
        }
    ],
    "NumberOfPoints": 4,
    "GeneralComments": "4 Superchargers, available 24/7",
    "StatusTypeID": 0,
    "DateLastStatusUpdate": "2017-02-06T08:37:00Z",
    "DataQualityLevel": 1,
    "DateCreated": "2017-01-26T21:09:00Z",
    "SubmissionStatusTypeID": 200
}