{
    "IsRecentlyVerified": false,
    "ID": 67562,
    "UUID": "6E5C04D3-4A2D-409F-9640-1C1A14BE37DB",
    "DataProviderID": 1,
    "OperatorID": 23,
    "OperatorsReference": "16165",
    "UsageTypeID": 1,
    "UsageCost": "Free",
    "AddressInfo": {
        "ID": 67908,
        "Title": "Cape Cod Cottages - Tesla",
        "AddressLine1": "4150 SW Pacific Coast Hwy",
        "Town": "Waldport",
        "StateOrProvince": "OR",
        "Postcode": "97394",
        "CountryID": 2,
        "Latitude": 44.3969395,
        "Longitude": -124.0860918,
        "ContactTelephone1": "503-345-9399  877-798-3752",
        "AccessComments": "24 hours daily; for Tesla use only; for guest use only",
        "RelatedURL": "http://www.teslamotors.com/supercharger",
        "DistanceUnit": 0
    },
    "Connections": [
        {
            "ID": 93067,
            "ConnectionTypeID": 30,
            "StatusTypeID": 50,
            "LevelID": 2,
            "Amps": 16,
            "Voltage": 230,
            "PowerKW": 13,
            "CurrentTypeID": 10,
            "Quantity": 2
        }
    ],
    "NumberOfPoints": 2,
    "StatusTypeID": 50,
    "DateLastStatusUpdate": "2017-01-31T19:52:00Z",
    "DataQualityLevel": 3,
    "DateCreated": "2016-05-29T02:05:00Z",
    "SubmissionStatusTypeID": 100
}