{
    "IsRecentlyVerified": false,
    "ID": 38777,
    "UUID": "7F3BC7DB-F443-475D-AA44-546107112BE2",
    "DataProviderID": 26,
    "DataProvidersReference": "39426",
    "OperatorID": 157,
    "OperatorsReference": "NewMotion 02009138",
    "UsageCost": "0.00 jaarabonnement",
    "AddressInfo": {
        "ID": 39123,
        "Title": "Cornelis Houtmanstraat",
        "AddressLine1": "Cornelis Houtmanstraat",
        "Town": "Emmen",
        "Postcode": "7825 VG",
        "CountryID": 159,
        "Latitude": 52.7536087036133,
        "Longitude": 6.9255051612854,
        "ContactTelephone1": "088 0109500",
        "RelatedURL": "http://thenewmotion.nl/",
        "DistanceUnit": 0
    },
    "Connections": [
        {
            "ID": 42288,
            "ConnectionTypeID": 25,
            "LevelID": 2,
            "PowerKW": 3.7,
            "CurrentTypeID": 10
        },
        {
            "ID": 49775,
            "ConnectionTypeID": 25,
            "LevelID": 2,
            "PowerKW": 37,
            "CurrentTypeID": 10
        }
    ],
    "NumberOfPoints": 1,
    "StatusTypeID": 50,
    "DateLastStatusUpdate": "2016-06-04T02:55:00Z",
    "DataQualityLevel": 3,
    "DateCreated": "2015-01-09T06:08:00Z",
    "SubmissionStatusTypeID": 100
}