{
    "IsRecentlyVerified": false,
    "ID": 153792,
    "UUID": "A8CE9C37-312B-4414-86EF-CAE45F6A62FE",
    "DataProviderID": 28,
    "DataProvidersReference": "FR*S77*P77447A",
    "OperatorID": 3413,
    "UsageTypeID": 5,
    "AddressInfo": {
        "ID": 154145,
        "Title": "Seine-Port",
        "AddressLine1": "rue de Melun",
        "CountryID": 80,
        "Latitude": 48.5577538,
        "Longitude": 2.5491882,
        "AccessComments": "",
        "DistanceUnit": 0
    },
    "Connections": [
        {
            "ID": 215965,
            "ConnectionTypeID": 28,
            "StatusTypeID": 50,
            "LevelID": 2,
            "PowerKW": 18,
            "CurrentTypeID": 10
        },
        {
            "ID": 215966,
            "ConnectionTypeID": 25,
            "StatusTypeID": 50,
            "LevelID": 2,
            "PowerKW": 18,
            "CurrentTypeID": 20
        }
    ],
    "GeneralComments": "badge, appli et QR code",
    "StatusTypeID": 50,
    "DateLastStatusUpdate": "2020-08-27T05:15:00Z",
    "DataQualityLevel": 2,
    "DateCreated": "2020-03-15T10:54:00Z",
    "SubmissionStatusTypeID": 100
}