{
    "IsRecentlyVerified": false,
    "ID": 65310,
    "UUID": "B509BD1E-B8C8-4888-A389-565D9626919B",
    "DataProviderID": 1,
    "DataProvidersReference": "3355",
    "AddressInfo": {
        "ID": 65656,
        "Title": "Overhalla b- og u skole",
        "AddressLine1": "Svenningsbrona 1",
        "Town": "OVERHALLA",
        "StateOrProvince": "Trøndelag",
        "Postcode": "7863",
        "CountryID": 168,
        "Latitude": 64.49836,
        "Longitude": 11.96169,
        "AccessComments": "Parkeringsplass ved skole.",
        "DistanceUnit": 0
    },
    "Connections": [
        {
            "ID": 89969,
            "ConnectionTypeID": 0,
            "Reference": "1",
            "LevelID": 2,
            "Amps": 16,
            "Voltage": 400,
            "PowerKW": 11,
            "Comments": "Mode 3"
        },
        {
            "ID": 89970,
            "ConnectionTypeID": 0,
            "Reference": "2",
            "LevelID": 2,
            "Amps": 16,
            "Voltage": 400,
            "PowerKW": 11,
            "Comments": "Mode 3"
        },
        {
            "ID": 89971,
            "ConnectionTypeID": 0,
            "Reference": "3",
            "LevelID": 2,
            "Amps": 16,
            "Voltage": 400,
            "PowerKW": 11,
            "Comments": "Mode 3"
        },
        {
            "ID": 89972,
            "ConnectionTypeID": 0,
            "Reference": "4",
            "LevelID": 2,
            "Amps": 16,
            "Voltage": 400,
            "PowerKW": 11,
            "Comments": "Mode 3"
        }
    ],
    "NumberOfPoints": 4,
    "DateLastStatusUpdate": "2020-05-26T08:25:00Z",
    "DataQualityLevel": 2,
    "DateCreated": "2016-04-26T12:27:00Z",
    "SubmissionStatusTypeID": 100
}