{
    "MediaItems": [
        {
            "ID": 29509,
            "ChargePointID": 166976,
            "ItemURL": "https://s3-ap-southeast-2.amazonaws.com/openchargemap/images/PT/OCM166976/OCM-166976.orig.2021101213280326.jpg",
            "ItemThumbnailURL": "https://s3-ap-southeast-2.amazonaws.com/openchargemap/images/PT/OCM166976/OCM-166976.thmb.2021101213280326.jpg",
            "Comment": "",
            "IsEnabled": true,
            "IsVideo": false,
            "IsFeaturedItem": false,
            "IsExternalResource": false,
            "User": {
                "ID": 34537,
                "Username": "Joao Lopes"
            },
            "DateCreated": "2021-10-12T13:28:00Z"
        }
    ],
    "IsRecentlyVerified": false,
    "ID": 166976,
    "UUID": "657AC4C3-2810-4D72-8A36-D5C6A2966E7B",
    "DataProviderID": 1,
    "OperatorID": 21,
    "UsageTypeID": 4,
    "UsageCost": "São Félix da Marinha",
    "AddressInfo": {
        "ID": 167335,
        "Title": "VNG-00036/37/38",
        "AddressLine1": "Makro Vila Nova de Gaia",
        "Town": "Vila Nova de Gaia",
        "StateOrProvince": "Porto",
        "Postcode": "4400-625",
        "CountryID": 180,
        "Latitude": 41.120508,
        "Longitude": -8.625678,
        "AccessComments": "Makro",
        "RelatedURL": "https://www.mobie.pt",
        "DistanceUnit": 0
    },
    "Connections": [
        {
            "ID": 252779,
            "ConnectionTypeID": 25,
            "StatusTypeID": 50,
            "LevelID": 2,
            "Amps": 16,
            "Voltage": 400,
            "PowerKW": 11,
            "CurrentTypeID": 20,
            "Quantity": 6
        }
    ],
    "NumberOfPoints": 6,
    "StatusTypeID": 50,
    "DateLastStatusUpdate": "2021-10-12T13:28:00Z",
    "DataQualityLevel": 3,
    "DateCreated": "2020-08-27T06:37:00Z",
    "SubmissionStatusTypeID": 100
}