{
    "IsRecentlyVerified": false,
    "ID": 29661,
    "UUID": "DD19E165-485A-45C2-9DFC-7283D21C29B2",
    "DataProviderID": 15,
    "DataProvidersReference": "35134",
    "OperatorID": 42,
    "UsageTypeID": 1,
    "AddressInfo": {
        "ID": 30007,
        "Title": "4808 University Drive NW",
        "AddressLine1": "4808 University Drive NW",
        "Town": "Huntsville",
        "StateOrProvince": "Alabama",
        "Postcode": "35816",
        "CountryID": 2,
        "Latitude": 34.73786,
        "Longitude": -86.6522,
        "ContactTelephone1": "256-837-1111",
        "RelatedURL": "http://carstations.com/35134",
        "DistanceUnit": 0
    },
    "Connections": [
        {
            "ID": 32646,
            "ConnectionTypeID": 1,
            "Reference": "J1772",
            "LevelID": 2
        }
    ],
    "NumberOfPoints": 2,
    "StatusTypeID": 50,
    "DateLastStatusUpdate": "2017-11-04T14:04:00Z",
    "DataQualityLevel": 2,
    "DateCreated": "2014-11-29T05:39:00Z",
    "SubmissionStatusTypeID": 100
}