{
    "IsRecentlyVerified": false,
    "ID": 140779,
    "UUID": "D5825AD8-5637-4C45-90F2-673FFBD8D02C",
    "DataProviderID": 2,
    "DataProvidersReference": "69013",
    "OperatorID": 5,
    "UsageTypeID": 1,
    "AddressInfo": {
        "ID": 141131,
        "Title": "4700 BOHANNON",
        "AddressLine1": "4700 Bohannon Dr",
        "Town": "Menlo Park",
        "StateOrProvince": "CA",
        "Postcode": "94025",
        "CountryID": 2,
        "Latitude": 37.4795431,
        "Longitude": -122.1749536,
        "ContactTelephone1": "888-758-4389",
        "AccessComments": "24 hours daily",
        "RelatedURL": "http://www.chargepoint.com/",
        "DistanceUnit": 0
    },
    "Connections": [
        {
            "ID": 196505,
            "ConnectionTypeID": 1,
            "LevelID": 2,
            "Amps": 16,
            "Voltage": 230,
            "PowerKW": 3,
            "CurrentTypeID": 10,
            "Quantity": 2
        }
    ],
    "StatusTypeID": 50,
    "DateLastStatusUpdate": "2019-12-24T09:13:00Z",
    "DataQualityLevel": 3,
    "DateCreated": "2019-12-24T09:13:00Z",
    "SubmissionStatusTypeID": 100
}