{
    "IsRecentlyVerified": false,
    "ID": 158506,
    "UUID": "91DAF544-9872-47CD-93C7-C710256E95CB",
    "DataProviderID": 2,
    "DataProvidersReference": "155585",
    "UsageTypeID": 1,
    "AddressInfo": {
        "ID": 158863,
        "Title": "Hartsfield-Jackson Atlanta International Airport - Domestic Terminal South Economy",
        "AddressLine1": "6000 N Terminal Pkwy",
        "Town": "Atlanta",
        "StateOrProvince": "GA",
        "Postcode": "30320",
        "CountryID": 2,
        "Latitude": 33.638834,
        "Longitude": -84.4465,
        "ContactTelephone1": "404-530-7300",
        "AccessComments": "24 hours daily",
        "RelatedURL": "",
        "DistanceUnit": 0
    },
    "Connections": [
        {
            "ID": 228497,
            "ConnectionTypeID": 0,
            "LevelID": 1,
            "Amps": 16,
            "Voltage": 120,
            "PowerKW": 1.9,
            "CurrentTypeID": 10,
            "Quantity": 18
        },
        {
            "ID": 228498,
            "ConnectionTypeID": 1,
            "LevelID": 2,
            "Amps": 16,
            "Voltage": 230,
            "PowerKW": 3.7,
            "CurrentTypeID": 10,
            "Quantity": 8
        }
    ],
    "StatusTypeID": 50,
    "DateLastStatusUpdate": "2020-06-26T02:55:00Z",
    "DataQualityLevel": 3,
    "DateCreated": "2020-06-26T02:55:00Z",
    "SubmissionStatusTypeID": 100
}