{
    "IsRecentlyVerified": false,
    "ID": 181548,
    "UUID": "F6294396-DD2D-4A68-BBEC-5AAD176B3321",
    "DataProviderID": 29,
    "DataProvidersReference": "10003",
    "AddressInfo": {
        "ID": 181907,
        "Title": "Osterwaldweg 55",
        "AddressLine1": "Osterwaldweg 55",
        "Town": "Schneverdingen",
        "Postcode": "29640",
        "CountryID": 87,
        "Latitude": 53.1174617,
        "Longitude": 9.8062507,
        "DistanceUnit": 0
    },
    "Connections": [
        {
            "ID": 286043,
            "ConnectionTypeID": 25,
            "StatusTypeID": 50,
            "LevelID": 2,
            "PowerKW": 22,
            "CurrentTypeID": 20
        },
        {
            "ID": 286044,
            "ConnectionTypeID": 25,
            "StatusTypeID": 50,
            "LevelID": 2,
            "PowerKW": 22,
            "CurrentTypeID": 20
        }
    ],
    "StatusTypeID": 50,
    "DateLastStatusUpdate": "2021-07-12T02:50:00Z",
    "MetadataValues": [
        {
            "ID": 13842,
            "MetadataFieldID": 4,
            "ItemValue": "Data from the German chargepoint registry provided by Bundesnetzagentur.de under the CC-BY 4.0 license"
        }
    ],
    "DataQualityLevel": 3,
    "DateCreated": "2021-07-08T10:02:00Z",
    "SubmissionStatusTypeID": 100
}