{
    "IsRecentlyVerified": false,
    "ID": 37255,
    "UUID": "1CA6DC0F-A7EB-4BD3-863F-09AE6C89D965",
    "DataProviderID": 26,
    "DataProvidersReference": "48641",
    "OperatorID": 178,
    "OperatorsReference": "EVnetNL REE517",
    "UsageCost": "0.00 jaarabonnement",
    "AddressInfo": {
        "ID": 37601,
        "Title": "Jan Schamhartstraat 5/A",
        "AddressLine1": "Jan Schamhartstraat 5/A",
        "Town": "Olst-Wijhe",
        "Postcode": "8121 CM",
        "CountryID": 159,
        "Latitude": 52.337022,
        "Longitude": 6.11101,
        "ContactTelephone1": "0800-3522365",
        "RelatedURL": "http://www.evnet.nl",
        "DistanceUnit": 0
    },
    "Connections": [
        {
            "ID": 40766,
            "ConnectionTypeID": 25,
            "LevelID": 1,
            "PowerKW": 2.3,
            "CurrentTypeID": 10
        }
    ],
    "NumberOfPoints": 1,
    "StatusTypeID": 50,
    "DateLastStatusUpdate": "2016-06-04T02:53:00Z",
    "DataQualityLevel": 3,
    "DateCreated": "2015-01-09T06:07:00Z",
    "SubmissionStatusTypeID": 100
}