{
    "IsRecentlyVerified": false,
    "ID": 180012,
    "UUID": "65F8985B-58CA-4623-853E-5AC5324A32F5",
    "DataProviderID": 29,
    "DataProvidersReference": "16436",
    "OperatorID": 45,
    "AddressInfo": {
        "ID": 180371,
        "Title": "Bgm.-Fleischmann-Str. 1",
        "AddressLine1": "Bgm.-Fleischmann-Str. 1",
        "Town": "Geiersthal",
        "Postcode": "94244",
        "CountryID": 87,
        "Latitude": 49.049861,
        "Longitude": 12.980059,
        "DistanceUnit": 0
    },
    "Connections": [
        {
            "ID": 282592,
            "ConnectionTypeID": 25,
            "StatusTypeID": 50,
            "LevelID": 2,
            "PowerKW": 22,
            "CurrentTypeID": 20
        },
        {
            "ID": 282593,
            "ConnectionTypeID": 25,
            "StatusTypeID": 50,
            "LevelID": 2,
            "PowerKW": 22,
            "CurrentTypeID": 20
        }
    ],
    "StatusTypeID": 50,
    "DateLastStatusUpdate": "2021-07-12T02:42:00Z",
    "MetadataValues": [
        {
            "ID": 12306,
            "MetadataFieldID": 4,
            "ItemValue": "Data from the German chargepoint registry provided by Bundesnetzagentur.de under the CC-BY 4.0 license"
        }
    ],
    "DataQualityLevel": 3,
    "DateCreated": "2021-07-08T10:00:00Z",
    "SubmissionStatusTypeID": 100
}