{
    "IsRecentlyVerified": false,
    "ID": 27337,
    "UUID": "05895762-6FB6-4B96-BE73-712A3513D40F",
    "DataProviderID": 1,
    "OperatorID": 23,
    "OperatorsReference": "6767",
    "UsageTypeID": 7,
    "UsageCost": "Free",
    "AddressInfo": {
        "ID": 27683,
        "Title": "21c Museum Hotel",
        "AddressLine1": "200 NE A St",
        "Town": "Bentonville",
        "StateOrProvince": "AR",
        "Postcode": "72712",
        "CountryID": 2,
        "Latitude": 36.3741018,
        "Longitude": -94.2077937,
        "ContactTelephone1": "479-286-6500",
        "AccessComments": "24 hours daily; complimentary for hotel and restaurant guests",
        "RelatedURL": "http://www.teslamotors.com/supercharger",
        "DistanceUnit": 0
    },
    "Connections": [
        {
            "ID": 29948,
            "ConnectionTypeID": 30,
            "StatusTypeID": 50,
            "LevelID": 2,
            "Amps": 16,
            "Voltage": 230,
            "PowerKW": 13,
            "CurrentTypeID": 10,
            "Quantity": 2
        }
    ],
    "NumberOfPoints": 2,
    "StatusTypeID": 50,
    "DateLastStatusUpdate": "2017-02-02T22:53:00Z",
    "DataQualityLevel": 3,
    "DateCreated": "2014-11-28T03:37:00Z",
    "SubmissionStatusTypeID": 100
}