{
    "IsRecentlyVerified": false,
    "ID": 143026,
    "UUID": "E3B314C2-BD9C-4EEF-8468-8A0D2E3B7EC8",
    "DataProviderID": 2,
    "DataProvidersReference": "81208",
    "OperatorID": 5,
    "UsageTypeID": 1,
    "AddressInfo": {
        "ID": 143378,
        "Title": "GRANITECITY",
        "AddressLine1": "19 Quincy Avenue",
        "Town": "Quincy",
        "StateOrProvince": "MA",
        "Postcode": "02169",
        "CountryID": 2,
        "Latitude": 42.2448707,
        "Longitude": -70.9998678,
        "ContactTelephone1": "888-758-4389",
        "AccessComments": "24 hours daily",
        "RelatedURL": "http://www.chargepoint.com/",
        "DistanceUnit": 0
    },
    "Connections": [
        {
            "ID": 199281,
            "ConnectionTypeID": 1,
            "LevelID": 2,
            "Amps": 16,
            "Voltage": 230,
            "PowerKW": 3,
            "CurrentTypeID": 10,
            "Quantity": 1
        }
    ],
    "StatusTypeID": 50,
    "DateLastStatusUpdate": "2019-12-24T09:19:00Z",
    "DataQualityLevel": 3,
    "DateCreated": "2019-12-24T09:19:00Z",
    "SubmissionStatusTypeID": 100
}