{
    "IsRecentlyVerified": false,
    "ID": 66811,
    "UUID": "74261B14-D4F9-47AD-B640-4B3EC7DFBBBB",
    "DataProviderID": 1,
    "OperatorID": 23,
    "OperatorsReference": "14675",
    "UsageTypeID": 1,
    "UsageCost": "Free",
    "AddressInfo": {
        "ID": 67157,
        "Title": "Hampton Inn - Tesla",
        "AddressLine1": "4760 Helen Hauser Blvd",
        "Town": "Titusville",
        "StateOrProvince": "FL",
        "Postcode": "32780",
        "CountryID": 2,
        "Latitude": 28.5528095,
        "Longitude": -80.8542614,
        "ContactTelephone1": "321-383-9191  877-798-3752",
        "AccessComments": "24 hours daily; for Tesla use only; for guest use only; see front desk for access",
        "RelatedURL": "http://www.teslamotors.com/supercharger",
        "DistanceUnit": 0
    },
    "Connections": [
        {
            "ID": 92298,
            "ConnectionTypeID": 30,
            "StatusTypeID": 50,
            "LevelID": 2,
            "Amps": 16,
            "Voltage": 230,
            "PowerKW": 8,
            "CurrentTypeID": 10,
            "Quantity": 1
        }
    ],
    "NumberOfPoints": 1,
    "StatusTypeID": 50,
    "DateLastStatusUpdate": "2017-01-26T04:31:00Z",
    "DataQualityLevel": 3,
    "DateCreated": "2016-05-29T02:04:00Z",
    "SubmissionStatusTypeID": 100
}