{
    "IsRecentlyVerified": false,
    "ID": 31563,
    "UUID": "9E80B60E-D71E-439C-ABC4-227E093F324E",
    "DataProviderID": 26,
    "DataProvidersReference": "28007",
    "OperatorID": 78,
    "OperatorsReference": "Essent EM-CH-00001364-01-00001",
    "UsageCost": "0.00 jaarabonnement",
    "AddressInfo": {
        "ID": 31909,
        "Title": "Kleinstadt",
        "AddressLine1": "Kleinstadt",
        "Town": "Ingenbohl",
        "Postcode": "6440",
        "CountryID": 217,
        "Latitude": 46.99572,
        "Longitude": 8.606,
        "RelatedURL": "http://www.essent.nl",
        "DistanceUnit": 0
    },
    "Connections": [
        {
            "ID": 35074,
            "ConnectionTypeID": 25,
            "LevelID": 2,
            "PowerKW": 11,
            "CurrentTypeID": 10
        },
        {
            "ID": 45975,
            "ConnectionTypeID": 25,
            "LevelID": 2,
            "PowerKW": 11,
            "CurrentTypeID": 10
        }
    ],
    "NumberOfPoints": 1,
    "StatusTypeID": 50,
    "DateLastStatusUpdate": "2016-06-04T02:37:00Z",
    "DataQualityLevel": 3,
    "DateCreated": "2015-01-09T06:03:00Z",
    "SubmissionStatusTypeID": 100
}