{
    "IsRecentlyVerified": false,
    "ID": 46165,
    "UUID": "F358B682-F9AE-4C69-AA07-07606544A351",
    "DataProviderID": 1,
    "DataProvidersReference": "2110",
    "AddressInfo": {
        "ID": 46511,
        "Title": "Sameiet simensbråtveien BRL, Oslo",
        "AddressLine1": "Simensbråtveien 26",
        "Town": "OSLO",
        "StateOrProvince": "Oslo",
        "Postcode": "1182",
        "CountryID": 168,
        "Latitude": 59.90009,
        "Longitude": 10.7915,
        "AccessComments": "",
        "DistanceUnit": 0
    },
    "Connections": [
        {
            "ID": 56828,
            "ConnectionTypeID": 0,
            "Reference": "1",
            "LevelID": 2,
            "Amps": 16,
            "Voltage": 230,
            "PowerKW": 3.7,
            "Comments": "Mode 1"
        }
    ],
    "NumberOfPoints": 1,
    "DateLastStatusUpdate": "2020-05-26T08:23:00Z",
    "DataQualityLevel": 2,
    "DateCreated": "2015-05-03T00:54:00Z",
    "SubmissionStatusTypeID": 100
}