{
    "IsRecentlyVerified": false,
    "ID": 115606,
    "UUID": "D4F25620-00D2-4EA6-8C8E-377BABB84DDA",
    "DataProviderID": 2,
    "DataProvidersReference": "112927",
    "OperatorID": 23,
    "UsageTypeID": 1,
    "AddressInfo": {
        "ID": 115952,
        "Title": "Chukchansi Crossing Fuel Station - Tesla Destination",
        "AddressLine1": "711 Lucky Ln",
        "Town": "Coarsegold",
        "StateOrProvince": "CA",
        "Postcode": "93614",
        "CountryID": 2,
        "Latitude": 37.2618,
        "Longitude": -119.7005,
        "ContactTelephone1": "866-794-6946  877-798-3752",
        "AccessComments": "24 hours daily; for Tesla use only",
        "RelatedURL": "https://www.tesla.com/destination-charging",
        "DistanceUnit": 0
    },
    "Connections": [
        {
            "ID": 162630,
            "ConnectionTypeID": 0,
            "LevelID": 2,
            "Amps": 16,
            "Voltage": 230,
            "PowerKW": 3,
            "CurrentTypeID": 10,
            "Quantity": 2
        }
    ],
    "DateLastStatusUpdate": "2019-04-06T04:02:00Z",
    "DataQualityLevel": 3,
    "DateCreated": "2019-02-11T07:13:00Z",
    "SubmissionStatusTypeID": 100
}