{
    "IsRecentlyVerified": false,
    "ID": 122629,
    "UUID": "6DA04E40-1A87-46A6-9555-0777A3468D92",
    "DataProviderID": 2,
    "DataProvidersReference": "112868",
    "OperatorID": 23,
    "UsageTypeID": 2,
    "AddressInfo": {
        "ID": 122975,
        "Title": "Camp Run-A-Muk - Tesla Destination",
        "AddressLine1": "41733 Tanager ",
        "Town": "Big Bear Lake",
        "StateOrProvince": "CA",
        "Postcode": "92315",
        "CountryID": 2,
        "Latitude": 34.246274,
        "Longitude": -116.891757,
        "ContactTelephone1": "",
        "AccessComments": "",
        "RelatedURL": "https://www.tesla.com/destination-charging",
        "DistanceUnit": 0
    },
    "Connections": [
        {
            "ID": 172534,
            "ConnectionTypeID": 0,
            "LevelID": 2,
            "Amps": 16,
            "Voltage": 230,
            "PowerKW": 3,
            "CurrentTypeID": 10,
            "Quantity": 1
        }
    ],
    "DateLastStatusUpdate": "2019-04-06T05:03:00Z",
    "DataQualityLevel": 3,
    "DateCreated": "2019-04-06T05:03:00Z",
    "SubmissionStatusTypeID": 100
}