{
    "IsRecentlyVerified": false,
    "ID": 85153,
    "UUID": "560B5354-60C0-4BB1-A98D-4EA2B397C890",
    "DataProviderID": 1,
    "OperatorID": 23,
    "OperatorsReference": "26049",
    "UsageTypeID": 6,
    "AddressInfo": {
        "ID": 85499,
        "Title": "Villa Fenaroli Palace Hotel",
        "AddressLine1": "14 Via Giuseppe Mazzini",
        "Town": "Rezzato",
        "Postcode": "25086",
        "CountryID": 112,
        "Latitude": 45.512146,
        "Longitude": 10.311645,
        "ContactTelephone1": "+39 030 279 3223",
        "DistanceUnit": 0
    },
    "Connections": [
        {
            "ID": 120915,
            "ConnectionTypeID": 30,
            "StatusTypeID": 50,
            "LevelID": 2,
            "Amps": 32,
            "Voltage": 400,
            "PowerKW": 22,
            "CurrentTypeID": 20,
            "Quantity": 2
        }
    ],
    "NumberOfPoints": 2,
    "GeneralComments": "2 Tesla Connectors, up to 22kW.Available for patrons only. Please call ahead.",
    "StatusTypeID": 50,
    "DateLastStatusUpdate": "2018-10-03T23:29:00Z",
    "DataQualityLevel": 1,
    "DateCreated": "2017-03-27T05:23:00Z",
    "SubmissionStatusTypeID": 200
}