{
    "IsRecentlyVerified": false,
    "ID": 13002,
    "UUID": "390B1B9D-194A-4D15-8DB4-0723C5F83488",
    "DataProviderID": 15,
    "DataProvidersReference": "21228",
    "OperatorID": 5,
    "AddressInfo": {
        "ID": 12899,
        "Title": "30755 Auld Rd",
        "AddressLine1": "30755 Auld Rd",
        "Town": "Murrieta",
        "StateOrProvince": "California",
        "Postcode": "92563",
        "CountryID": 2,
        "Latitude": 33.58336639,
        "Longitude": -117.1214676,
        "ContactTelephone1": "",
        "RelatedURL": "http://carstations.com/21228",
        "DistanceUnit": 0
    },
    "Connections": [
        {
            "ID": 10435,
            "ConnectionTypeID": 1,
            "Reference": "J1772",
            "LevelID": 2
        }
    ],
    "StatusTypeID": 0,
    "DateLastStatusUpdate": "2017-11-04T14:04:00Z",
    "DataQualityLevel": 2,
    "DateCreated": "2012-09-07T19:26:00Z",
    "SubmissionStatusTypeID": 100
}