{
    "IsRecentlyVerified": false,
    "ID": 41074,
    "UUID": "EFD1F788-F34F-4DA3-981E-5688241E613F",
    "DataProviderID": 1,
    "OperatorID": 1,
    "UsageTypeID": 6,
    "AddressInfo": {
        "ID": 41420,
        "Title": "Angelma & Mäkelä",
        "AddressLine1": "Palokunnankatu 25",
        "Town": "Hämeenlinna",
        "StateOrProvince": "Kanta-Häme",
        "Postcode": "13100",
        "CountryID": 79,
        "Latitude": 60.993893,
        "Longitude": 24.4595965999999,
        "AccessComments": "- Latauspisteen avaaminen pyydettävä numerosta 0406730121.\r\n- Latausvirta / Latausjännite / Lataustyyppi: 16A / 240V / 1-vaiheinen",
        "DistanceUnit": 0
    },
    "Connections": [
        {
            "ID": 44819,
            "ConnectionTypeID": 28,
            "StatusTypeID": 50,
            "LevelID": 2,
            "Amps": 16,
            "Voltage": 240,
            "PowerKW": 3,
            "CurrentTypeID": 10,
            "Quantity": 1
        }
    ],
    "NumberOfPoints": 1,
    "StatusTypeID": 50,
    "DateLastStatusUpdate": "2015-01-25T14:09:00Z",
    "DataQualityLevel": 1,
    "DateCreated": "2015-01-25T11:48:00Z",
    "SubmissionStatusTypeID": 200
}