{
    "IsRecentlyVerified": false,
    "ID": 172719,
    "UUID": "72867093-3FA3-459A-9CB4-1D893A1A79C2",
    "DataProviderID": 1,
    "OperatorID": 3299,
    "UsageTypeID": 1,
    "AddressInfo": {
        "ID": 173078,
        "Title": "IONITY - métairie de beauregard - Le Passage - Agen",
        "AddressLine1": "métairie de beauregard",
        "Town": "Le Passage",
        "StateOrProvince": "Aquitaine-Limousin-Poitou-Charentes",
        "Postcode": "47520",
        "CountryID": 80,
        "Latitude": 44.17131384369324,
        "Longitude": 0.6096496753923475,
        "DistanceUnit": 0
    },
    "Connections": [
        {
            "ID": 264126,
            "ConnectionTypeID": 33,
            "StatusTypeID": 50,
            "LevelID": 3,
            "PowerKW": 350,
            "CurrentTypeID": 30,
            "Quantity": 4
        }
    ],
    "NumberOfPoints": 4,
    "StatusTypeID": 50,
    "DateLastStatusUpdate": "2021-02-15T10:12:00Z",
    "DataQualityLevel": 1,
    "DateCreated": "2021-02-13T19:00:00Z",
    "SubmissionStatusTypeID": 200
}