{
    "IsRecentlyVerified": false,
    "ID": 102087,
    "UUID": "929F8743-54CB-4E25-A4CF-3111C425E968",
    "DataProviderID": 1,
    "OperatorID": 46,
    "UsageTypeID": 4,
    "AddressInfo": {
        "ID": 102433,
        "Title": "Park & Ride Parkplatz am Bahnhof",
        "AddressLine1": "Lauenburger Straße 33",
        "Town": "Büchen",
        "StateOrProvince": "Büchen",
        "Postcode": "21514",
        "CountryID": 87,
        "Latitude": 53.474612652618525,
        "Longitude": 10.622706441802961,
        "AccessComments": "Zwei 24/7 nutzbare Ladesäulen. Stand 16.4.18: Nur eine Säule ist aktiv.",
        "DistanceUnit": 0
    },
    "Connections": [
        {
            "ID": 144072,
            "ConnectionTypeID": 25,
            "StatusTypeID": 50,
            "LevelID": 2,
            "Amps": 16,
            "Voltage": 400,
            "PowerKW": 11,
            "CurrentTypeID": 20,
            "Quantity": 2
        }
    ],
    "NumberOfPoints": 2,
    "StatusTypeID": 50,
    "DateLastStatusUpdate": "2018-04-16T06:32:00Z",
    "DataQualityLevel": 1,
    "DateCreated": "2018-04-16T06:32:00Z",
    "SubmissionStatusTypeID": 200
}