{
    "IsRecentlyVerified": false,
    "ID": 119557,
    "UUID": "DE55A4AA-0765-4281-A486-13CB0AB40146",
    "DataProviderID": 2,
    "DataProvidersReference": "88344",
    "UsageTypeID": 1,
    "AddressInfo": {
        "ID": 119903,
        "Title": "City of Doral - Government Center",
        "AddressLine1": "8401 NW 53rd Terrace",
        "Town": "Doral",
        "StateOrProvince": "FL",
        "Postcode": "33166",
        "CountryID": 2,
        "Latitude": 25.822094,
        "Longitude": -80.334406,
        "ContactTelephone1": "305-593-6725",
        "AccessComments": "7am-9pm M-F",
        "RelatedURL": "",
        "DistanceUnit": 0
    },
    "Connections": [
        {
            "ID": 168831,
            "ConnectionTypeID": 1,
            "LevelID": 2,
            "Amps": 16,
            "Voltage": 230,
            "PowerKW": 3.7,
            "CurrentTypeID": 10,
            "Quantity": 2
        }
    ],
    "DateLastStatusUpdate": "2020-06-26T02:52:00Z",
    "DataQualityLevel": 3,
    "DateCreated": "2019-04-01T04:59:00Z",
    "SubmissionStatusTypeID": 100
}