{
    "UserComments": [
        {
            "ID": 24159,
            "ChargePointID": 174619,
            "CommentTypeID": 10,
            "UserName": "xester",
            "Rating": 5,
            "DateCreated": "2021-04-09T17:36:01.78Z",
            "User": {
                "ID": 6169,
                "Username": "xester"
            },
            "CheckinStatusTypeID": 10,
            "IsActionedByEditor": false
        }
    ],
    "IsRecentlyVerified": false,
    "ID": 174619,
    "UUID": "C0BBE09C-F15D-493C-AF89-45EEEBA3E620",
    "DataProviderID": 1,
    "OperatorID": 1,
    "UsageTypeID": 6,
    "AddressInfo": {
        "ID": 174978,
        "Title": "Centro Porsche ASTURIAS",
        "AddressLine1": "Pol. Industrial Los Peñones s/n",
        "Town": "Lugones",
        "StateOrProvince": "Asturias",
        "Postcode": "33420",
        "CountryID": 210,
        "Latitude": 43.39485548582232,
        "Longitude": -5.81647401249711,
        "ContactTelephone1": "902 20 24 23",
        "RelatedURL": "http://www.porsche.es",
        "DistanceUnit": 0
    },
    "Connections": [
        {
            "ID": 270553,
            "ConnectionTypeID": 33,
            "StatusTypeID": 150,
            "LevelID": 3,
            "Voltage": 800,
            "PowerKW": 350,
            "CurrentTypeID": 30,
            "Quantity": 2
        },
        {
            "ID": 270554,
            "ConnectionTypeID": 1036,
            "StatusTypeID": 150,
            "LevelID": 2,
            "Amps": 32,
            "Voltage": 400,
            "PowerKW": 22,
            "CurrentTypeID": 20,
            "Quantity": 2
        }
    ],
    "NumberOfPoints": 4,
    "StatusTypeID": 50,
    "DateLastStatusUpdate": "2021-08-25T10:06:00Z",
    "DataQualityLevel": 1,
    "DateCreated": "2021-04-09T17:36:00Z",
    "SubmissionStatusTypeID": 200
}