{
    "IsRecentlyVerified": false,
    "ID": 142153,
    "UUID": "52EF6FE6-8E26-464B-A6E9-D247D0E2B19D",
    "DataProviderID": 2,
    "DataProvidersReference": "144042",
    "OperatorID": 5,
    "UsageTypeID": 1,
    "AddressInfo": {
        "ID": 142505,
        "Title": "DEVON",
        "AddressLine1": "550 American Ave",
        "Town": "King of Prussia",
        "StateOrProvince": "PA",
        "Postcode": "19406",
        "CountryID": 2,
        "Latitude": 40.094913,
        "Longitude": -75.39701,
        "ContactTelephone1": "888-758-4389",
        "AccessComments": "24 hours daily",
        "RelatedURL": "http://www.chargepoint.com/",
        "DistanceUnit": 0
    },
    "Connections": [
        {
            "ID": 198229,
            "ConnectionTypeID": 1,
            "LevelID": 2,
            "Amps": 16,
            "Voltage": 230,
            "PowerKW": 3.7,
            "CurrentTypeID": 10,
            "Quantity": 2
        }
    ],
    "StatusTypeID": 50,
    "DateLastStatusUpdate": "2020-06-26T03:02:00Z",
    "DataQualityLevel": 3,
    "DateCreated": "2019-12-24T09:17:00Z",
    "SubmissionStatusTypeID": 100
}