{
    "IsRecentlyVerified": false,
    "ID": 140324,
    "UUID": "C4D664A9-DC6C-4A8E-BE2D-72EE8EC66DE9",
    "DataProviderID": 2,
    "DataProvidersReference": "93358",
    "OperatorID": 15,
    "UsageTypeID": 4,
    "AddressInfo": {
        "ID": 140676,
        "Title": "Courtyard Marriot",
        "AddressLine1": "3908 Arrow Dr",
        "Town": "Raleigh",
        "StateOrProvince": "NC",
        "Postcode": "27612",
        "CountryID": 2,
        "Latitude": 35.83511,
        "Longitude": -78.673878,
        "ContactTelephone1": "877-455-3833",
        "AccessComments": "24 hours daily\r\nPublic - Card key at all times",
        "RelatedURL": "https://www.evgo.com/",
        "DistanceUnit": 0
    },
    "Connections": [
        {
            "ID": 195933,
            "ConnectionTypeID": 2,
            "LevelID": 3,
            "Amps": 100,
            "Voltage": 400,
            "PowerKW": 40,
            "CurrentTypeID": 30,
            "Quantity": 1
        },
        {
            "ID": 195934,
            "ConnectionTypeID": 32,
            "LevelID": 3,
            "Amps": 100,
            "Voltage": 400,
            "PowerKW": 40,
            "CurrentTypeID": 30,
            "Quantity": 1
        }
    ],
    "StatusTypeID": 50,
    "DateLastStatusUpdate": "2020-06-26T02:58:00Z",
    "DataQualityLevel": 3,
    "DateCreated": "2019-12-24T09:12:00Z",
    "SubmissionStatusTypeID": 100
}