{
    "IsRecentlyVerified": false,
    "ID": 122428,
    "UUID": "2E065A69-BEC3-42CA-A99F-F420580A9918",
    "DataProviderID": 2,
    "DataProvidersReference": "81705",
    "OperatorID": 5,
    "UsageTypeID": 1,
    "AddressInfo": {
        "ID": 122774,
        "Title": "1240-1250 AZUSA",
        "AddressLine1": "1250 W Foothill Blvd",
        "Town": "Azusa",
        "StateOrProvince": "CA",
        "Postcode": "91702",
        "CountryID": 2,
        "Latitude": 34.1332075,
        "Longitude": -117.92672,
        "ContactTelephone1": "888-758-4389",
        "AccessComments": "24 hours daily",
        "RelatedURL": "http://www.chargepoint.com/",
        "DistanceUnit": 0
    },
    "Connections": [
        {
            "ID": 172320,
            "ConnectionTypeID": 1,
            "LevelID": 2,
            "Amps": 16,
            "Voltage": 230,
            "PowerKW": 3,
            "CurrentTypeID": 10,
            "Quantity": 2
        }
    ],
    "DateLastStatusUpdate": "2019-12-24T09:11:00Z",
    "DataQualityLevel": 3,
    "DateCreated": "2019-04-06T05:03:00Z",
    "SubmissionStatusTypeID": 100
}