{
    "IsRecentlyVerified": false,
    "ID": 41489,
    "UUID": "680E5342-F7FA-4BC0-8AFA-ED71E79DC87E",
    "DataProviderID": 1,
    "OperatorID": 93,
    "OperatorsReference": "SC159",
    "UsageTypeID": 4,
    "AddressInfo": {
        "ID": 41835,
        "Title": "Main Street, Plumbridge, Strabane",
        "AddressLine1": "Main Street",
        "Town": "Plumbridge",
        "Postcode": "BT79 8AA",
        "CountryID": 1,
        "Latitude": 54.767818,
        "Longitude": -7.250076,
        "AccessComments": "Main St, Plumbridge, Strabane, BT79 8AA ",
        "DistanceUnit": 0
    },
    "Connections": [
        {
            "ID": 45373,
            "ConnectionTypeID": 25,
            "Reference": "1",
            "StatusTypeID": 50,
            "LevelID": 2,
            "Amps": 32,
            "Voltage": 400,
            "PowerKW": 22,
            "CurrentTypeID": 20,
            "Quantity": 2
        }
    ],
    "NumberOfPoints": 2,
    "StatusTypeID": 50,
    "DateLastStatusUpdate": "2016-05-25T15:45:00Z",
    "MetadataValues": [
        {
            "ID": 1325,
            "MetadataFieldID": 4,
            "ItemValue": "Contains public sector information licensed under the Open Government Licence v2.0. http://www.nationalarchives.gov.uk/doc/open-government-licence/version/2/"
        }
    ],
    "DataQualityLevel": 3,
    "DateCreated": "2015-02-05T08:39:00Z",
    "SubmissionStatusTypeID": 200
}