{
    "IsRecentlyVerified": false,
    "ID": 73021,
    "UUID": "1ABD4BA3-8F42-4DCC-A87A-AF32758ECD2E",
    "DataProviderID": 2,
    "DataProvidersReference": "79220",
    "OperatorID": 5,
    "UsageTypeID": 1,
    "AddressInfo": {
        "ID": 73367,
        "Title": "OSH",
        "AddressLine1": "Bobolink Way",
        "Town": "Salem",
        "StateOrProvince": "OR",
        "Postcode": "97301",
        "CountryID": 2,
        "Latitude": 44.9385422,
        "Longitude": -123.0059817,
        "ContactTelephone1": "888-758-4389",
        "AccessComments": "24 hours daily",
        "RelatedURL": "http://www.chargepoint.com/",
        "DistanceUnit": 0
    },
    "Connections": [
        {
            "ID": 104711,
            "ConnectionTypeID": 1,
            "LevelID": 2,
            "Amps": 16,
            "Voltage": 230,
            "PowerKW": 3.7,
            "CurrentTypeID": 10,
            "Quantity": 8
        }
    ],
    "DateLastStatusUpdate": "2020-06-26T03:08:00Z",
    "DataQualityLevel": 3,
    "DateCreated": "2016-11-01T13:06:00Z",
    "SubmissionStatusTypeID": 100
}