{
    "IsRecentlyVerified": false,
    "ID": 114685,
    "UUID": "746982BC-A7DC-4309-85F7-F5689FCC19C3",
    "DataProviderID": 1,
    "OperatorID": 23,
    "OperatorsReference": "48165",
    "UsageTypeID": 4,
    "AddressInfo": {
        "ID": 115031,
        "Title": "Overton Hotel Lubbock",
        "AddressLine1": "2322 Mac Davis LN",
        "Town": "Lubbock",
        "StateOrProvince": "Texas",
        "Postcode": "79401",
        "CountryID": 2,
        "Latitude": 33.591025,
        "Longitude": -101.867768,
        "ContactTelephone1": "(806) 776-7000",
        "DistanceUnit": 0
    },
    "Connections": [
        {
            "ID": 161405,
            "ConnectionTypeID": 30,
            "StatusTypeID": 50,
            "LevelID": 2,
            "Amps": 32,
            "Voltage": 400,
            "PowerKW": 16,
            "CurrentTypeID": 20,
            "Quantity": 4
        }
    ],
    "NumberOfPoints": 4,
    "GeneralComments": "4 Tesla Connectors, up to 28kW.Available for customers. Please see front desk.",
    "StatusTypeID": 50,
    "DateLastStatusUpdate": "2019-02-15T06:33:00Z",
    "DataQualityLevel": 1,
    "DateCreated": "2019-01-13T06:46:00Z",
    "SubmissionStatusTypeID": 200
}