{
    "IsRecentlyVerified": false,
    "ID": 120071,
    "UUID": "86C5122C-62DD-4308-B381-AE332152A82A",
    "DataProviderID": 2,
    "DataProvidersReference": "68824",
    "OperatorID": 5,
    "UsageTypeID": 1,
    "AddressInfo": {
        "ID": 120417,
        "Title": "PRESIDIUM",
        "AddressLine1": "409 E William Cannon Dr",
        "Town": "Austin",
        "StateOrProvince": "TX",
        "Postcode": "78745",
        "CountryID": 2,
        "Latitude": 30.1915824,
        "Longitude": -97.7756261,
        "ContactTelephone1": "888-758-4389",
        "AccessComments": "24 hours daily",
        "RelatedURL": "http://www.chargepoint.com/",
        "DistanceUnit": 0
    },
    "Connections": [
        {
            "ID": 169386,
            "ConnectionTypeID": 1,
            "LevelID": 2,
            "Amps": 16,
            "Voltage": 230,
            "PowerKW": 3,
            "CurrentTypeID": 10,
            "Quantity": 2
        }
    ],
    "DateLastStatusUpdate": "2019-12-24T09:08:00Z",
    "DataQualityLevel": 3,
    "DateCreated": "2019-04-01T04:59:00Z",
    "SubmissionStatusTypeID": 100
}