{
    "IsRecentlyVerified": false,
    "ID": 31962,
    "UUID": "A2ABEE36-070E-4120-B2F4-03BA928A0C74",
    "DataProviderID": 1,
    "OperatorID": 105,
    "OperatorsReference": "Essent EM-DE-09362000-01-00002",
    "UsageTypeID": 4,
    "AddressInfo": {
        "ID": 32308,
        "Title": "Langobardenstraße 2",
        "AddressLine1": "Langobardenstraße 2",
        "Town": "Regensburg",
        "Postcode": "93053",
        "CountryID": 87,
        "Latitude": 48.995161,
        "Longitude": 12.114058,
        "DistanceUnit": 0
    },
    "Connections": [
        {
            "ID": 35473,
            "ConnectionTypeID": 25,
            "LevelID": 2,
            "PowerKW": 11
        }
    ],
    "NumberOfPoints": 1,
    "StatusTypeID": 50,
    "DateLastStatusUpdate": "2015-04-13T16:05:00Z",
    "DataQualityLevel": 3,
    "DateCreated": "2015-01-09T06:03:00Z",
    "SubmissionStatusTypeID": 200
}