{
    "IsRecentlyVerified": false,
    "ID": 171489,
    "UUID": "8F4838D5-D729-4816-9E63-D2F39A32305F",
    "DataProviderID": 1,
    "OperatorID": 3404,
    "UsageTypeID": 1,
    "AddressInfo": {
        "ID": 171848,
        "Title": "Súper, Bribri",
        "AddressLine1": "Súper, Bribri",
        "Town": "Bratsi",
        "StateOrProvince": "Limón",
        "Postcode": "70401",
        "CountryID": 58,
        "Latitude": 9.625367869329196,
        "Longitude": -82.85170011531368,
        "DistanceUnit": 0
    },
    "Connections": [
        {
            "ID": 262196,
            "ConnectionTypeID": 2,
            "StatusTypeID": 50,
            "LevelID": 3,
            "Amps": 50,
            "Voltage": 480,
            "PowerKW": 50,
            "CurrentTypeID": 30,
            "Quantity": 1
        },
        {
            "ID": 262197,
            "ConnectionTypeID": 32,
            "StatusTypeID": 50,
            "LevelID": 3,
            "Amps": 50,
            "Voltage": 480,
            "PowerKW": 50,
            "CurrentTypeID": 30,
            "Quantity": 1
        },
        {
            "ID": 262198,
            "ConnectionTypeID": 1040,
            "StatusTypeID": 50,
            "LevelID": 3,
            "Amps": 50,
            "Voltage": 480,
            "PowerKW": 50,
            "CurrentTypeID": 30,
            "Quantity": 1
        }
    ],
    "NumberOfPoints": 2,
    "StatusTypeID": 50,
    "DateLastStatusUpdate": "2021-05-06T22:50:00Z",
    "DataQualityLevel": 1,
    "DateCreated": "2021-01-03T02:24:00Z",
    "SubmissionStatusTypeID": 200
}