{
    "IsRecentlyVerified": false,
    "ID": 169729,
    "UUID": "6B51444D-10AE-4C43-BA9C-2D637F200AE9",
    "DataProviderID": 1,
    "OperatorID": 22,
    "UsageTypeID": 4,
    "UsageCost": "0.296",
    "AddressInfo": {
        "ID": 170088,
        "Title": "Cotter Street",
        "AddressLine1": "Cotter Street",
        "Town": "Cork",
        "CountryID": 3,
        "Latitude": 51.89521366092197,
        "Longitude": -8.465944945949332,
        "DistanceUnit": 0
    },
    "Connections": [
        {
            "ID": 258557,
            "ConnectionTypeID": 25,
            "StatusTypeID": 50,
            "LevelID": 2,
            "Amps": 32,
            "Voltage": 400,
            "PowerKW": 22,
            "CurrentTypeID": 20,
            "Quantity": 2
        }
    ],
    "NumberOfPoints": 2,
    "StatusTypeID": 50,
    "DateLastStatusUpdate": "2020-11-06T15:23:00Z",
    "DataQualityLevel": 1,
    "DateCreated": "2020-11-05T11:37:00Z",
    "SubmissionStatusTypeID": 200
}