{
    "IsRecentlyVerified": false,
    "ID": 170418,
    "UUID": "95805AF2-2EC0-4055-AD81-ED1532A4569B",
    "DataProviderID": 1,
    "OperatorID": 3447,
    "UsageTypeID": 1,
    "UsageCost": "",
    "AddressInfo": {
        "ID": 170777,
        "Title": "Total - Les tilleuls",
        "AddressLine1": "Avenue du Maréchal Foch",
        "Town": "Chatou",
        "StateOrProvince": "Ile-de-France",
        "Postcode": "78400",
        "CountryID": 80,
        "Latitude": 48.891961,
        "Longitude": 2.144546,
        "RelatedURL": "https://apps.total-ev-charge.com/charge-points/TOTAL-NF058742-001",
        "DistanceUnit": 0
    },
    "Connections": [
        {
            "ID": 259985,
            "ConnectionTypeID": 2,
            "StatusTypeID": 50,
            "LevelID": 3,
            "PowerKW": 50,
            "CurrentTypeID": 30,
            "Quantity": 1
        },
        {
            "ID": 259986,
            "ConnectionTypeID": 33,
            "StatusTypeID": 50,
            "LevelID": 3,
            "PowerKW": 50,
            "CurrentTypeID": 30,
            "Quantity": 1
        },
        {
            "ID": 259987,
            "ConnectionTypeID": 1036,
            "StatusTypeID": 50,
            "LevelID": 3,
            "PowerKW": 43,
            "CurrentTypeID": 20
        },
        {
            "ID": 272298,
            "ConnectionTypeID": 28,
            "StatusTypeID": 50,
            "CurrentTypeID": 10,
            "Quantity": 1
        }
    ],
    "NumberOfPoints": 1,
    "StatusTypeID": 50,
    "DateLastStatusUpdate": "2021-05-21T20:49:00Z",
    "DataQualityLevel": 1,
    "DateCreated": "2020-11-26T13:59:00Z",
    "SubmissionStatusTypeID": 200
}