{
    "IsRecentlyVerified": false,
    "ID": 178393,
    "UUID": "F74B8B5D-126D-461F-9CD5-69E85A75E0A8",
    "DataProviderID": 29,
    "DataProvidersReference": "15726",
    "OperatorID": 45,
    "AddressInfo": {
        "ID": 178752,
        "Title": "An der Bummansburg 1",
        "AddressLine1": "An der Bummansburg 1",
        "Town": "Bergkamen",
        "Postcode": "59192",
        "CountryID": 87,
        "Latitude": 51.651794,
        "Longitude": 7.6773684,
        "DistanceUnit": 0
    },
    "Connections": [
        {
            "ID": 278743,
            "ConnectionTypeID": 25,
            "StatusTypeID": 50,
            "LevelID": 2,
            "PowerKW": 22,
            "CurrentTypeID": 20
        },
        {
            "ID": 278744,
            "ConnectionTypeID": 25,
            "StatusTypeID": 50,
            "LevelID": 2,
            "PowerKW": 22,
            "CurrentTypeID": 20
        }
    ],
    "StatusTypeID": 0,
    "DateLastStatusUpdate": "2021-07-12T02:48:00Z",
    "MetadataValues": [
        {
            "ID": 10687,
            "MetadataFieldID": 4,
            "ItemValue": "Data from the German chargepoint registry provided by Bundesnetzagentur.de under the CC-BY 4.0 license"
        }
    ],
    "DataQualityLevel": 3,
    "DateCreated": "2021-07-08T09:50:00Z",
    "SubmissionStatusTypeID": 100
}