{
    "IsRecentlyVerified": false,
    "ID": 117652,
    "UUID": "A667608B-54F1-4FC9-B9EA-F06576A29D94",
    "DataProviderID": 1,
    "OperatorID": 32,
    "OperatorsReference": "11470",
    "UsageTypeID": 4,
    "UsageCost": "£0.108/kWh; for Polar Plus subscription members only",
    "AddressInfo": {
        "ID": 117998,
        "Title": "Queens Park Public Car Park",
        "AddressLine1": "Queens Park Public Car Park",
        "Town": "24 The Boulevard",
        "StateOrProvince": "Mablethorpe",
        "Postcode": "LN12 2AD",
        "CountryID": 1,
        "Latitude": 53.338009,
        "Longitude": 0.266292,
        "DistanceUnit": 0
    },
    "Connections": [
        {
            "ID": 166437,
            "ConnectionTypeID": 25,
            "StatusTypeID": 50,
            "LevelID": 2,
            "Amps": 32,
            "Voltage": 230,
            "PowerKW": 7,
            "CurrentTypeID": 10,
            "Quantity": 2
        }
    ],
    "NumberOfPoints": 2,
    "GeneralComments": "Unit located in the car park in the EV marked bays.",
    "StatusTypeID": 50,
    "DateLastStatusUpdate": "2019-03-09T06:42:00Z",
    "DataQualityLevel": 1,
    "DateCreated": "2019-02-21T06:14:00Z",
    "SubmissionStatusTypeID": 200
}