{
    "IsRecentlyVerified": false,
    "ID": 45792,
    "UUID": "DC6A7EF4-F078-4A5B-9CEC-675B80D6A65D",
    "DataProviderID": 19,
    "DataProvidersReference": "859",
    "AddressInfo": {
        "ID": 46138,
        "Title": "Strandkaien, Stavanger",
        "AddressLine1": "Strandkaien ",
        "Town": "STAVANGER",
        "StateOrProvince": "Rogaland",
        "Postcode": "4005",
        "CountryID": 168,
        "Latitude": 58.97256,
        "Longitude": 5.72624,
        "AccessComments": "Strandkaien ved Galleri Sult.",
        "DistanceUnit": 0
    },
    "Connections": [
        {
            "ID": 56455,
            "ConnectionTypeID": 28,
            "Reference": "1",
            "LevelID": 2,
            "Amps": 16,
            "Voltage": 230,
            "PowerKW": 3.7,
            "CurrentTypeID": 10,
            "Comments": "Mode 1"
        },
        {
            "ID": 88062,
            "ConnectionTypeID": 28,
            "Reference": "2",
            "LevelID": 2,
            "Amps": 16,
            "Voltage": 230,
            "PowerKW": 3.7,
            "CurrentTypeID": 10,
            "Comments": "Mode 1"
        }
    ],
    "NumberOfPoints": 2,
    "DateLastStatusUpdate": "2019-02-11T09:16:00Z",
    "DataQualityLevel": 2,
    "DateCreated": "2015-05-03T00:54:00Z",
    "SubmissionStatusTypeID": 100
}