{
    "IsRecentlyVerified": false,
    "ID": 111111,
    "UUID": "C592B424-4DBF-4AE4-A30F-84DC4C988F2D",
    "DataProviderID": 2,
    "DataProvidersReference": "91231",
    "OperatorID": 5,
    "UsageTypeID": 1,
    "AddressInfo": {
        "ID": 111457,
        "Title": "SALESANDSERVICE",
        "AddressLine1": "11262 Yonge St",
        "Town": "Richmond Hill",
        "StateOrProvince": "ON",
        "Postcode": "L4S 1K9",
        "CountryID": 44,
        "Latitude": 43.9018654,
        "Longitude": -79.4450296,
        "ContactTelephone1": "888-758-4389",
        "AccessComments": "24 hours daily",
        "RelatedURL": "http://www.chargepoint.com/",
        "DistanceUnit": 0
    },
    "Connections": [
        {
            "ID": 156471,
            "ConnectionTypeID": 1,
            "LevelID": 2,
            "Amps": 16,
            "Voltage": 230,
            "PowerKW": 3,
            "CurrentTypeID": 10,
            "Quantity": 2
        }
    ],
    "DateLastStatusUpdate": "2019-12-24T09:22:00Z",
    "DataQualityLevel": 3,
    "DateCreated": "2018-10-18T23:36:00Z",
    "SubmissionStatusTypeID": 100
}