{
    "IsRecentlyVerified": false,
    "ID": 128289,
    "UUID": "C6199DA7-DE3A-4C69-8EC1-69827414C3E0",
    "DataProviderID": 1,
    "OperatorID": 23,
    "OperatorsReference": "50734",
    "UsageTypeID": 4,
    "AddressInfo": {
        "ID": 128635,
        "Title": "Doubleback Winery",
        "AddressLine1": "3853 Powerline RD",
        "Town": "Walla Walla",
        "StateOrProvince": "Washington",
        "Postcode": "99362",
        "CountryID": 2,
        "Latitude": 46.014123,
        "Longitude": -118.310165,
        "ContactTelephone1": "(509) 525-3334",
        "DistanceUnit": 0
    },
    "Connections": [
        {
            "ID": 179578,
            "ConnectionTypeID": 30,
            "StatusTypeID": 50,
            "LevelID": 2,
            "PowerKW": 16,
            "CurrentTypeID": 20,
            "Quantity": 1
        }
    ],
    "NumberOfPoints": 1,
    "GeneralComments": "1 Tesla Connector, up to 16kW.Available for customers. Please call ahead.",
    "StatusTypeID": 50,
    "DateLastStatusUpdate": "2019-06-21T06:04:00Z",
    "DataQualityLevel": 1,
    "DateCreated": "2019-06-21T06:04:00Z",
    "SubmissionStatusTypeID": 200
}