{
    "IsRecentlyVerified": false,
    "ID": 23307,
    "UUID": "A51697C9-5DB6-4EFC-885E-59B25E2B9824",
    "DataProviderID": 1,
    "OperatorID": 76,
    "UsageTypeID": 1,
    "UsageCost": "5€/up to 60 min",
    "AddressInfo": {
        "ID": 23652,
        "Title": "Meegomäe",
        "AddressLine1": "Meegomäe road",
        "Town": "Võru vald",
        "StateOrProvince": "Võru maakond",
        "Postcode": "65603",
        "CountryID": 74,
        "Latitude": 57.809001587774226,
        "Longitude": 26.997552696240298,
        "ContactTelephone1": "+372 6511911",
        "ContactEmail": "tugi@elmo.ee",
        "RelatedURL": "http://www.elmo.ee/en/",
        "DistanceUnit": 0
    },
    "Connections": [
        {
            "ID": 25182,
            "ConnectionTypeID": 2,
            "StatusTypeID": 50,
            "LevelID": 3,
            "Amps": 120,
            "Voltage": 500,
            "PowerKW": 50,
            "CurrentTypeID": 30,
            "Quantity": 1
        },
        {
            "ID": 25183,
            "ConnectionTypeID": 25,
            "StatusTypeID": 50,
            "LevelID": 2,
            "Amps": 32,
            "Voltage": 400,
            "PowerKW": 22,
            "CurrentTypeID": 20,
            "Quantity": 1
        }
    ],
    "NumberOfPoints": 1,
    "GeneralComments": "Opened 24h (automatic). \r\nReal-time condition information (operational/not operational/free) - www.elmo.ee \r\nCan pay with client card, SMS or mobile application. \r\nCharger number 86164",
    "StatusTypeID": 50,
    "DateLastStatusUpdate": "2014-05-18T07:38:00Z",
    "DataQualityLevel": 1,
    "DateCreated": "2014-05-18T07:38:00Z",
    "SubmissionStatusTypeID": 200
}