{
    "IsRecentlyVerified": false,
    "ID": 95777,
    "UUID": "2D25C20A-A63D-4A54-811B-767CF1FF1FDF",
    "DataProviderID": 1,
    "OperatorID": 3297,
    "UsageTypeID": 4,
    "AddressInfo": {
        "ID": 96123,
        "Title": "Franklinstraße",
        "AddressLine1": "Franklinstraße 15",
        "Town": "Darmstadt",
        "StateOrProvince": "Darmstadt",
        "Postcode": "64285",
        "CountryID": 87,
        "Latitude": 49.8447493,
        "Longitude": 8.645184599999993,
        "RelatedURL": "http://www.entega.de/energie-sparen/ladestation-elektroauto/",
        "DistanceUnit": 0
    },
    "Connections": [
        {
            "ID": 135677,
            "ConnectionTypeID": 25,
            "StatusTypeID": 50,
            "LevelID": 2,
            "Amps": 32,
            "Voltage": 400,
            "PowerKW": 22,
            "CurrentTypeID": 20,
            "Quantity": 2
        }
    ],
    "NumberOfPoints": 2,
    "GeneralComments": "24/7 verfügbar. Freischaltung mit Ladekarten des LastMileSolution Verbundes: Entega , PlugSurfing, New Motion",
    "StatusTypeID": 50,
    "DateLastStatusUpdate": "2017-11-24T07:00:00Z",
    "DataQualityLevel": 1,
    "DateCreated": "2017-11-24T07:00:00Z",
    "SubmissionStatusTypeID": 200
}