{
    "IsRecentlyVerified": false,
    "ID": 188191,
    "UUID": "E7CED080-5D7B-4830-845E-94CF5FB6EC0C",
    "DataProviderID": 1,
    "OperatorID": 3458,
    "UsageTypeID": 1,
    "UsageCost": "1.5",
    "AddressInfo": {
        "ID": 188550,
        "Title": "JoPetrol - Gulf Khalda EV Charger",
        "AddressLine1": "Wasfi At-Tall Street",
        "AddressLine2": "Amman",
        "Town": "Amman",
        "StateOrProvince": "Amman",
        "CountryID": 116,
        "Latitude": 31.996846744248444,
        "Longitude": 35.83782931905273,
        "DistanceUnit": 0
    },
    "Connections": [
        {
            "ID": 303738,
            "ConnectionTypeID": 2,
            "StatusTypeID": 50,
            "LevelID": 1,
            "Voltage": 0,
            "PowerKW": 50,
            "CurrentTypeID": 30,
            "Quantity": 1,
            "Comments": "Chademo"
        },
        {
            "ID": 303739,
            "ConnectionTypeID": 1036,
            "StatusTypeID": 50,
            "LevelID": 3,
            "PowerKW": 50,
            "CurrentTypeID": 20,
            "Quantity": 1
        }
    ],
    "NumberOfPoints": 2,
    "StatusTypeID": 50,
    "DateLastStatusUpdate": "2021-07-17T11:04:00Z",
    "DataQualityLevel": 1,
    "DateCreated": "2021-07-13T14:52:00Z",
    "SubmissionStatusTypeID": 200
}