{
    "UserComments": [
        {
            "ID": 16219,
            "ChargePointID": 13388,
            "CommentTypeID": 1000,
            "UserName": "Garry TheBiz",
            "Comment": "One side of post is working, the other side is not.",
            "Rating": 5,
            "DateCreated": "2017-04-16T16:08:43.457Z",
            "User": {
                "ID": 6105,
                "Username": "Garry TheBiz"
            },
            "CheckinStatusTypeID": 140
        },
        {
            "ID": 9781,
            "ChargePointID": 13388,
            "CommentTypeID": 50,
            "UserName": "Garry TheBiz",
            "Comment": "New charge post installed, but has an issue locking the cable. Has been taken offline until the issue is resolved. Not possible to charge here at the moment.",
            "Rating": 5,
            "DateCreated": "2016-02-22T21:39:11.257Z",
            "User": {
                "ID": 6105,
                "Username": "Garry TheBiz"
            },
            "CheckinStatusTypeID": 20
        },
        {
            "ID": 9645,
            "ChargePointID": 13388,
            "CommentTypeID": 10,
            "UserName": "Garry TheBiz",
            "Comment": "New charging post fitted and working fine",
            "Rating": 5,
            "DateCreated": "2016-02-05T19:54:43.243Z",
            "User": {
                "ID": 6105,
                "Username": "Garry TheBiz"
            },
            "CheckinStatusTypeID": 10
        },
        {
            "ID": 489,
            "ChargePointID": 13388,
            "CommentTypeID": 50,
            "UserName": "tim_battersby",
            "Comment": "Not working.",
            "Rating": 1,
            "DateCreated": "2013-10-14T21:43:44.707Z",
            "User": {
                "ID": 1250,
                "Username": "tim_battersby"
            },
            "CheckinStatusTypeID": 20
        }
    ],
    "MediaItems": [
        {
            "ID": 5922,
            "ChargePointID": 13388,
            "ItemURL": "https://s3-ap-southeast-2.amazonaws.com/openchargemap/images/GB/OCM13388/OCM-13388.orig.2016022221395783.jpg",
            "ItemThumbnailURL": "https://s3-ap-southeast-2.amazonaws.com/openchargemap/images/GB/OCM13388/OCM-13388.thmb.2016022221395783.jpg",
            "Comment": "",
            "IsEnabled": true,
            "IsVideo": false,
            "IsFeaturedItem": false,
            "IsExternalResource": false,
            "User": {
                "ID": 6105,
                "Username": "Garry TheBiz"
            },
            "DateCreated": "2016-02-22T21:40:00Z"
        },
        {
            "ID": 4840,
            "ChargePointID": 13388,
            "ItemURL": "https://s3-ap-southeast-2.amazonaws.com/openchargemap/images/GB/OCM13388/OCM-13388.orig.2016020519550701.jpg",
            "ItemThumbnailURL": "https://s3-ap-southeast-2.amazonaws.com/openchargemap/images/GB/OCM13388/OCM-13388.thmb.2016020519550701.jpg",
            "Comment": "",
            "IsEnabled": true,
            "IsVideo": false,
            "IsFeaturedItem": false,
            "IsExternalResource": false,
            "User": {
                "ID": 6105,
                "Username": "Garry TheBiz"
            },
            "DateCreated": "2016-02-05T19:55:00Z"
        }
    ],
    "IsRecentlyVerified": false,
    "ID": 13388,
    "UUID": "B77571E0-F42B-481A-AD37-204FDB147A44",
    "DataProviderID": 1,
    "OperatorID": 20,
    "OperatorsReference": "31167,31168",
    "UsageTypeID": 4,
    "UsageCost": "£1.00/charge admin fee",
    "AddressInfo": {
        "ID": 13285,
        "Title": "Windy Hill Lane Car Park",
        "AddressLine1": "Windy Hill Lane",
        "AddressLine2": "Marske By The Sea",
        "Town": "Redcar",
        "StateOrProvince": "North Yorkshire",
        "Postcode": "TS11 7BN",
        "CountryID": 1,
        "Latitude": 54.591627,
        "Longitude": -1.01794,
        "DistanceUnit": 0
    },
    "Connections": [
        {
            "ID": 10842,
            "ConnectionTypeID": 25,
            "StatusTypeID": 75,
            "LevelID": 2,
            "Amps": 16,
            "Voltage": 400,
            "PowerKW": 7,
            "CurrentTypeID": 20,
            "Quantity": 2
        }
    ],
    "NumberOfPoints": 2,
    "GeneralComments": "Free to park",
    "StatusTypeID": 75,
    "DateLastStatusUpdate": "2020-05-09T05:14:00Z",
    "DataQualityLevel": 3,
    "DateCreated": "2012-09-27T04:40:00Z",
    "SubmissionStatusTypeID": 100
}