{
    "IsRecentlyVerified": false,
    "ID": 81693,
    "UUID": "4C45074A-84D5-4B2D-A021-D03EDEFFF2CB",
    "DataProviderID": 1,
    "OperatorID": 23,
    "OperatorsReference": "20963",
    "UsageTypeID": 6,
    "AddressInfo": {
        "ID": 82039,
        "Title": "Fiesta Inn Queretaro Centro sur",
        "AddressLine1": "Boulevard Bernardo Quintana Arroja 7001 Col. Centro sur",
        "Town": "Queretaro",
        "StateOrProvince": "Queretaro",
        "Postcode": "76090",
        "CountryID": 146,
        "Latitude": 20.574125,
        "Longitude": -100.358653,
        "ContactTelephone1": "+52 442 238 6300",
        "DistanceUnit": 0
    },
    "Connections": [
        {
            "ID": 116451,
            "ConnectionTypeID": 30,
            "StatusTypeID": 50,
            "LevelID": 2,
            "PowerKW": 18,
            "CurrentTypeID": 20,
            "Quantity": 2
        }
    ],
    "NumberOfPoints": 2,
    "GeneralComments": "2 Tesla Connectors, up to 18kW.Available for patrons only. Please see front desk.",
    "StatusTypeID": 50,
    "DateLastStatusUpdate": "2017-02-03T11:14:00Z",
    "DataQualityLevel": 1,
    "DateCreated": "2017-02-03T11:14:00Z",
    "SubmissionStatusTypeID": 200
}