{
    "IsRecentlyVerified": false,
    "ID": 145133,
    "UUID": "A6CA1A26-EA62-4A11-8C2A-E5D62CDDD1ED",
    "DataProviderID": 2,
    "DataProvidersReference": "123586",
    "OperatorID": 5,
    "UsageTypeID": 1,
    "AddressInfo": {
        "ID": 145485,
        "Title": "WATERFRONT PARK",
        "AddressLine1": "24 S Main St",
        "Town": "L'Anse",
        "StateOrProvince": "MI",
        "Postcode": "49946",
        "CountryID": 2,
        "Latitude": 46.7571535,
        "Longitude": -88.4558069,
        "ContactTelephone1": "888-758-4389",
        "AccessComments": "24 hours daily",
        "RelatedURL": "http://www.chargepoint.com/",
        "DistanceUnit": 0
    },
    "Connections": [
        {
            "ID": 201740,
            "ConnectionTypeID": 1,
            "LevelID": 2,
            "Amps": 16,
            "Voltage": 230,
            "PowerKW": 3.7,
            "CurrentTypeID": 10,
            "Quantity": 2
        }
    ],
    "StatusTypeID": 50,
    "DateLastStatusUpdate": "2020-06-26T03:10:00Z",
    "DataQualityLevel": 3,
    "DateCreated": "2019-12-24T09:24:00Z",
    "SubmissionStatusTypeID": 100
}