{
    "IsRecentlyVerified": false,
    "ID": 120600,
    "UUID": "4A158C85-16B3-42F1-BD3E-DCD7AB6AA0EA",
    "DataProviderID": 2,
    "DataProvidersReference": "71524",
    "OperatorID": 107,
    "UsageTypeID": 1,
    "AddressInfo": {
        "ID": 120946,
        "Title": "Rancho Bernardo Glassman Park and Recreation Center",
        "AddressLine1": "18584 W Bernardo Dr",
        "Town": "San Diego",
        "StateOrProvince": "CA",
        "Postcode": "92127",
        "CountryID": 2,
        "Latitude": 33.048251,
        "Longitude": -117.076879,
        "ContactTelephone1": "855-885-9571",
        "AccessComments": "24 hours daily",
        "RelatedURL": "http://www.opconnect.com/",
        "DistanceUnit": 0
    },
    "Connections": [
        {
            "ID": 169959,
            "ConnectionTypeID": 1,
            "LevelID": 2,
            "Amps": 16,
            "Voltage": 230,
            "PowerKW": 3.7,
            "CurrentTypeID": 10,
            "Quantity": 3
        }
    ],
    "DateLastStatusUpdate": "2020-06-26T02:55:00Z",
    "DataQualityLevel": 3,
    "DateCreated": "2019-04-01T04:59:00Z",
    "SubmissionStatusTypeID": 100
}