{
    "IsRecentlyVerified": false,
    "ID": 139401,
    "UUID": "C0B5EDEB-A9F6-4554-9C81-A7F24E49B566",
    "DataProviderID": 2,
    "DataProvidersReference": "86925",
    "OperatorID": 5,
    "UsageTypeID": 1,
    "AddressInfo": {
        "ID": 139753,
        "Title": "ATLANTA FALCONS",
        "AddressLine1": "3223 Howell Mill Road Northwest",
        "Town": "Atlanta",
        "StateOrProvince": "GA",
        "Postcode": "30327",
        "CountryID": 2,
        "Latitude": 33.8440561,
        "Longitude": -84.427773,
        "ContactTelephone1": "888-758-4389",
        "AccessComments": "24 hours daily",
        "RelatedURL": "http://www.chargepoint.com/",
        "DistanceUnit": 0
    },
    "Connections": [
        {
            "ID": 194742,
            "ConnectionTypeID": 1,
            "LevelID": 2,
            "Amps": 16,
            "Voltage": 230,
            "PowerKW": 3,
            "CurrentTypeID": 10,
            "Quantity": 2
        }
    ],
    "StatusTypeID": 50,
    "DateLastStatusUpdate": "2019-12-24T09:10:00Z",
    "DataQualityLevel": 3,
    "DateCreated": "2019-12-24T09:10:00Z",
    "SubmissionStatusTypeID": 100
}