{
    "IsRecentlyVerified": false,
    "ID": 124433,
    "UUID": "679CB233-F817-48C7-AAAC-8922A0CC6C00",
    "DataProviderID": 2,
    "DataProvidersReference": "51210",
    "UsageTypeID": 1,
    "AddressInfo": {
        "ID": 124779,
        "Title": "Sheldon Town Center",
        "AddressLine1": "8973 Grant Line Rd",
        "Town": "Elk Grove",
        "StateOrProvince": "CA",
        "Postcode": "95624",
        "CountryID": 2,
        "Latitude": 38.431454,
        "Longitude": -121.299343,
        "ContactTelephone1": "916-869-8017",
        "AccessComments": "24 hours daily",
        "RelatedURL": "",
        "DistanceUnit": 0
    },
    "Connections": [
        {
            "ID": 174531,
            "ConnectionTypeID": 1,
            "LevelID": 2,
            "Amps": 16,
            "Voltage": 230,
            "PowerKW": 3.7,
            "CurrentTypeID": 10,
            "Quantity": 1
        }
    ],
    "DateLastStatusUpdate": "2020-06-26T03:00:00Z",
    "DataQualityLevel": 3,
    "DateCreated": "2019-04-06T05:03:00Z",
    "SubmissionStatusTypeID": 100
}