{
    "IsRecentlyVerified": false,
    "ID": 71832,
    "UUID": "920A7FBE-D543-4D94-99FF-DB2CB24A6BC4",
    "DataProviderID": 1,
    "OperatorID": 3,
    "OperatorsReference": "PG-90574",
    "UsageTypeID": 6,
    "UsageCost": "Free",
    "AddressInfo": {
        "ID": 72178,
        "Title": "Crosskills Pe Limited",
        "AddressLine1": "29 Mission Road",
        "AddressLine2": "Rackheath",
        "Town": "Norwich",
        "StateOrProvince": "Norfolk",
        "Postcode": "NR13 6PL",
        "CountryID": 1,
        "Latitude": 52.673294,
        "Longitude": 1.376086,
        "DistanceUnit": 0
    },
    "Connections": [
        {
            "ID": 102921,
            "ConnectionTypeID": 25,
            "StatusTypeID": 50,
            "LevelID": 2,
            "Amps": 32,
            "Voltage": 230,
            "PowerKW": 7,
            "CurrentTypeID": 10,
            "Quantity": 1
        }
    ],
    "NumberOfPoints": 1,
    "StatusTypeID": 50,
    "DateLastStatusUpdate": "2017-01-20T06:35:00Z",
    "DataQualityLevel": 1,
    "DateCreated": "2016-09-14T18:46:00Z",
    "SubmissionStatusTypeID": 200
}