{
    "IsRecentlyVerified": false,
    "ID": 121356,
    "UUID": "495E9D80-0E34-458D-B144-0C0C45D5671D",
    "DataProviderID": 2,
    "DataProvidersReference": "121034",
    "OperatorID": 59,
    "UsageTypeID": 1,
    "AddressInfo": {
        "ID": 121702,
        "Title": "Greenlots - 54008",
        "AddressLine1": "2295 SW Tualatin Valley Highway",
        "Town": "Hillsboro",
        "StateOrProvince": "OR",
        "Postcode": "97123",
        "CountryID": 2,
        "Latitude": 45.5061454772949,
        "Longitude": -122.958557128906,
        "ContactTelephone1": "855-900-7584",
        "AccessComments": "24 hours daily",
        "RelatedURL": "http://greenlots.com/",
        "DistanceUnit": 0
    },
    "Connections": [
        {
            "ID": 170807,
            "ConnectionTypeID": 1,
            "LevelID": 2,
            "Amps": 16,
            "Voltage": 230,
            "PowerKW": 3.7,
            "CurrentTypeID": 10,
            "Quantity": 2
        },
        {
            "ID": 170808,
            "ConnectionTypeID": 2,
            "LevelID": 3,
            "Amps": 100,
            "Voltage": 400,
            "PowerKW": 40,
            "CurrentTypeID": 30,
            "Quantity": 1
        },
        {
            "ID": 200893,
            "ConnectionTypeID": 32,
            "LevelID": 3,
            "Amps": 100,
            "Voltage": 400,
            "PowerKW": 40,
            "CurrentTypeID": 30,
            "Quantity": 1
        }
    ],
    "DateLastStatusUpdate": "2020-06-26T03:09:00Z",
    "DataQualityLevel": 3,
    "DateCreated": "2019-04-01T05:00:00Z",
    "SubmissionStatusTypeID": 100
}