{
    "IsRecentlyVerified": false,
    "ID": 44670,
    "UUID": "3F60ABD2-F8DB-4E52-9F03-2F743D4C471A",
    "DataProviderID": 26,
    "DataProvidersReference": "60580",
    "OperatorID": 178,
    "OperatorsReference": "EVnetNL PNB-ENO021",
    "UsageCost": "0.00 jaarabonnement",
    "AddressInfo": {
        "ID": 45016,
        "Title": "De Meer 15",
        "AddressLine1": "De Meer 15",
        "Town": "Loon op Zand",
        "Postcode": "5171 WT",
        "CountryID": 159,
        "Latitude": 51.653871,
        "Longitude": 5.037295,
        "ContactTelephone1": "0800-3522365",
        "RelatedURL": "http://www.evnet.nl",
        "DistanceUnit": 0
    },
    "Connections": [
        {
            "ID": 54864,
            "ConnectionTypeID": 25,
            "LevelID": 2,
            "PowerKW": 11,
            "CurrentTypeID": 10
        }
    ],
    "NumberOfPoints": 2,
    "StatusTypeID": 50,
    "DateLastStatusUpdate": "2016-06-04T02:39:00Z",
    "DataQualityLevel": 3,
    "DateCreated": "2015-04-18T13:02:00Z",
    "SubmissionStatusTypeID": 100
}