{
    "IsRecentlyVerified": false,
    "ID": 71115,
    "UUID": "6507694F-3C9E-4966-A14C-B4D918A811FB",
    "DataProviderID": 1,
    "OperatorID": 45,
    "UsageTypeID": 6,
    "AddressInfo": {
        "ID": 71461,
        "Title": "Villa Crespi Relais et Chateaux",
        "AddressLine1": "Via Giuseppe Fava, 18",
        "Town": "Orta San Giulio",
        "StateOrProvince": "NO",
        "Postcode": "28016",
        "CountryID": 112,
        "Latitude": 45.796429713168905,
        "Longitude": 8.416216840221397,
        "ContactTelephone1": "0039-0322/911902",
        "ContactEmail": "info@villacrespi.it",
        "RelatedURL": "http://www.villacrespi.it/",
        "DistanceUnit": 0
    },
    "Connections": [
        {
            "ID": 101903,
            "ConnectionTypeID": 1036,
            "StatusTypeID": 50,
            "LevelID": 2,
            "Amps": 16,
            "Voltage": 400,
            "PowerKW": 11,
            "CurrentTypeID": 20,
            "Quantity": 1
        }
    ],
    "NumberOfPoints": 1,
    "GeneralComments": "Tesla Destination Charge",
    "StatusTypeID": 50,
    "DateLastStatusUpdate": "2016-08-29T15:14:00Z",
    "DataQualityLevel": 1,
    "DateCreated": "2016-08-29T15:14:00Z",
    "SubmissionStatusTypeID": 200
}