{
    "IsRecentlyVerified": false,
    "ID": 44699,
    "UUID": "62883462-7DB2-45D7-89B4-9D5E27ADCDB3",
    "DataProviderID": 26,
    "DataProvidersReference": "60596",
    "OperatorID": 179,
    "OperatorsReference": "Ecotap 1435110",
    "UsageCost": "0.00 afhankelijk van pas",
    "AddressInfo": {
        "ID": 45045,
        "Title": "Pastoor Hootsmansstraat 5",
        "AddressLine1": "Pastoor Hootsmansstraat 5",
        "Town": "Beuningen",
        "Postcode": "6644 CC",
        "CountryID": 159,
        "Latitude": 51.870187,
        "Longitude": 5.740952,
        "RelatedURL": "http://www.ecotap.nl",
        "DistanceUnit": 0
    },
    "Connections": [
        {
            "ID": 54899,
            "ConnectionTypeID": 25,
            "LevelID": 2,
            "PowerKW": 22,
            "CurrentTypeID": 10
        }
    ],
    "NumberOfPoints": 2,
    "StatusTypeID": 50,
    "DateLastStatusUpdate": "2016-06-04T02:41:00Z",
    "DataQualityLevel": 3,
    "DateCreated": "2015-04-18T13:02:00Z",
    "SubmissionStatusTypeID": 100
}