{
    "UserComments": [
        {
            "ID": 22080,
            "ChargePointID": 13434,
            "CommentTypeID": 10,
            "UserName": "Someone_Just_",
            "Rating": 5,
            "DateCreated": "2020-01-25T20:49:16.797Z",
            "User": {
                "ID": 1107,
                "Username": "Someone_Just_"
            },
            "CheckinStatusTypeID": 140,
            "IsActionedByEditor": false
        },
        {
            "ID": 10413,
            "ChargePointID": 13434,
            "CommentTypeID": 10,
            "UserName": "Someone_Just_",
            "Comment": "Still free with Lidl charging card",
            "Rating": 4,
            "DateCreated": "2016-05-14T20:06:31.01Z",
            "User": {
                "ID": 1107,
                "Username": "Someone_Just_"
            },
            "CheckinStatusTypeID": 140
        },
        {
            "ID": 3520,
            "ChargePointID": 13434,
            "CommentTypeID": 10,
            "UserName": "filip.vanrickstal",
            "Comment": "Free charging using the Lidl charging card",
            "Rating": 5,
            "DateCreated": "2015-01-04T16:00:55.737Z",
            "User": {
                "ID": 1761,
                "Username": "filip.vanrickstal"
            },
            "CheckinStatusTypeID": 10
        }
    ],
    "MediaItems": [
        {
            "ID": 826,
            "ChargePointID": 13434,
            "ItemURL": "https://s3-ap-southeast-2.amazonaws.com/openchargemap/images/BE/OCM13434/OCM-13434.orig.2015010415594289.jpg",
            "ItemThumbnailURL": "https://s3-ap-southeast-2.amazonaws.com/openchargemap/images/BE/OCM13434/OCM-13434.thmb.2015010415594289.jpg",
            "Comment": "",
            "IsEnabled": true,
            "IsVideo": false,
            "IsFeaturedItem": false,
            "IsExternalResource": false,
            "User": {
                "ID": 1761,
                "Username": "filip.vanrickstal"
            },
            "DateCreated": "2015-01-04T16:00:00Z"
        },
        {
            "ID": 827,
            "ChargePointID": 13434,
            "ItemURL": "https://s3-ap-southeast-2.amazonaws.com/openchargemap/images/BE/OCM13434/OCM-13434.orig.2015010416001489.jpg",
            "ItemThumbnailURL": "https://s3-ap-southeast-2.amazonaws.com/openchargemap/images/BE/OCM13434/OCM-13434.thmb.2015010416001489.jpg",
            "Comment": "",
            "IsEnabled": true,
            "IsVideo": false,
            "IsFeaturedItem": false,
            "IsExternalResource": false,
            "User": {
                "ID": 1761,
                "Username": "filip.vanrickstal"
            },
            "DateCreated": "2015-01-04T16:00:00Z"
        },
        {
            "ID": 825,
            "ChargePointID": 13434,
            "ItemURL": "https://s3-ap-southeast-2.amazonaws.com/openchargemap/images/BE/OCM13434/OCM-13434.orig.2015010415584106.jpg",
            "ItemThumbnailURL": "https://s3-ap-southeast-2.amazonaws.com/openchargemap/images/BE/OCM13434/OCM-13434.thmb.2015010415584106.jpg",
            "Comment": "",
            "IsEnabled": true,
            "IsVideo": false,
            "IsFeaturedItem": false,
            "IsExternalResource": false,
            "User": {
                "ID": 1761,
                "Username": "filip.vanrickstal"
            },
            "DateCreated": "2015-01-04T15:59:00Z"
        }
    ],
    "IsRecentlyVerified": false,
    "ID": 13434,
    "UUID": "0877587C-7B77-4B46-8711-E4F8999BC91F",
    "DataProviderID": 1,
    "OperatorID": 38,
    "UsageTypeID": 4,
    "UsageCost": "kelbezoek (gedurende max. 1 uur)",
    "AddressInfo": {
        "ID": 13331,
        "Title": "Lidl - Mariakerke",
        "AddressLine1": " Brugsesteenweg 604 ",
        "Town": " Gent - Mariakerke",
        "Postcode": "9030",
        "CountryID": 26,
        "Latitude": 51.07454266331295,
        "Longitude": 3.6810194835364785,
        "AccessComments": "ma - do: 9u00 - 18u30 vr:         9u00 - 19u00 za:         9u00 - 18u00",
        "RelatedURL": "http://www.lidl.be/nl/7641.htm",
        "DistanceUnit": 0
    },
    "Connections": [
        {
            "ID": 10871,
            "ConnectionTypeID": 2,
            "StatusTypeID": 50,
            "LevelID": 3,
            "PowerKW": 50,
            "CurrentTypeID": 30,
            "Quantity": 1
        },
        {
            "ID": 10872,
            "ConnectionTypeID": 33,
            "StatusTypeID": 50,
            "LevelID": 3,
            "PowerKW": 50,
            "CurrentTypeID": 30,
            "Quantity": 1
        },
        {
            "ID": 205641,
            "ConnectionTypeID": 1036,
            "StatusTypeID": 50,
            "LevelID": 2,
            "PowerKW": 22,
            "CurrentTypeID": 20,
            "Quantity": 1
        }
    ],
    "NumberOfPoints": 2,
    "StatusTypeID": 50,
    "DateLastStatusUpdate": "2020-01-25T20:49:00Z",
    "DataQualityLevel": 1,
    "DateCreated": "2012-10-09T16:07:00Z",
    "SubmissionStatusTypeID": 200
}