{
    "IsRecentlyVerified": false,
    "ID": 106668,
    "UUID": "E6AFE2A9-EA29-49A3-AE4C-C753DABDE5E6",
    "DataProviderID": 1,
    "DataProvidersReference": "4806",
    "AddressInfo": {
        "ID": 107014,
        "Title": "Coop Kristdala",
        "AddressLine1": "Nyhemsgatan 14",
        "Town": "KRISTDALA",
        "StateOrProvince": "KALMAR",
        "Postcode": "57091",
        "CountryID": 216,
        "Latitude": 57.40057,
        "Longitude": 16.19805,
        "AccessComments": "På parkeringen vid Coop Kristdala.",
        "DistanceUnit": 0
    },
    "Connections": [
        {
            "ID": 150117,
            "ConnectionTypeID": 0,
            "Reference": "1",
            "LevelID": 2,
            "Amps": 32,
            "Voltage": 400,
            "PowerKW": 22,
            "Comments": "Mode 3"
        },
        {
            "ID": 150118,
            "ConnectionTypeID": 0,
            "Reference": "2",
            "LevelID": 2,
            "Amps": 32,
            "Voltage": 400,
            "PowerKW": 22,
            "Comments": "Mode 3"
        }
    ],
    "NumberOfPoints": 2,
    "DateLastStatusUpdate": "2020-05-26T08:21:00Z",
    "DataQualityLevel": 2,
    "DateCreated": "2018-06-27T12:11:00Z",
    "SubmissionStatusTypeID": 100
}