{
    "IsRecentlyVerified": false,
    "ID": 102595,
    "UUID": "0CED70A0-2E7B-4CBC-843F-C8B7A9F33CA5",
    "DataProviderID": 2,
    "DataProvidersReference": "94941",
    "OperatorID": 5,
    "UsageTypeID": 1,
    "AddressInfo": {
        "ID": 102941,
        "Title": "SANTA CRUZ CNTY",
        "AddressLine1": "2255 Huntington Dr",
        "Town": "Aptos",
        "StateOrProvince": "CA",
        "Postcode": "95003",
        "CountryID": 2,
        "Latitude": 36.9797395,
        "Longitude": -121.8805246,
        "ContactTelephone1": "888-758-4389",
        "AccessComments": "24 hours daily",
        "RelatedURL": "http://www.chargepoint.com/",
        "DistanceUnit": 0
    },
    "Connections": [
        {
            "ID": 144689,
            "ConnectionTypeID": 1,
            "LevelID": 2,
            "Amps": 16,
            "Voltage": 230,
            "PowerKW": 3,
            "CurrentTypeID": 10,
            "Quantity": 2
        }
    ],
    "DateLastStatusUpdate": "2019-04-06T04:02:00Z",
    "DataQualityLevel": 3,
    "DateCreated": "2018-04-21T04:13:00Z",
    "SubmissionStatusTypeID": 100
}