{
    "IsRecentlyVerified": false,
    "ID": 84376,
    "UUID": "A0818F8D-AADD-4B7D-A6CF-C3317FF4DAAF",
    "DataProviderID": 1,
    "OperatorID": 45,
    "OperatorsReference": "17007",
    "UsageTypeID": 6,
    "AddressInfo": {
        "ID": 84722,
        "Title": "Garage San Marco Venezia",
        "AddressLine1": "Piazzale Roma, 467/F ",
        "Town": "Venezia",
        "StateOrProvince": "VE",
        "Postcode": "30135",
        "CountryID": 112,
        "Latitude": 45.437712,
        "Longitude": 12.317446,
        "ContactTelephone1": "+39 041 523 2213",
        "RelatedURL": "http://www.garagesanmarco.it",
        "DistanceUnit": 0
    },
    "Connections": [
        {
            "ID": 119811,
            "ConnectionTypeID": 1036,
            "StatusTypeID": 50,
            "LevelID": 2,
            "Amps": 32,
            "Voltage": 400,
            "PowerKW": 22,
            "CurrentTypeID": 20,
            "Quantity": 2
        }
    ],
    "NumberOfPoints": 2,
    "GeneralComments": "2 Tesla Connector, up to 22kW.Available for patrons only. Please see front desk.",
    "StatusTypeID": 50,
    "DateLastStatusUpdate": "2017-02-22T16:30:00Z",
    "DataQualityLevel": 1,
    "DateCreated": "2017-02-22T06:37:00Z",
    "SubmissionStatusTypeID": 200
}