{
    "IsRecentlyVerified": false,
    "ID": 183031,
    "UUID": "EBA06B23-12F6-409B-9B95-65CB5C094171",
    "DataProviderID": 29,
    "DataProvidersReference": "11940",
    "OperatorID": 220,
    "AddressInfo": {
        "ID": 183390,
        "Title": "Eiffestraße 450",
        "AddressLine1": "Eiffestraße 450",
        "Town": "Hamburg",
        "Postcode": "20537",
        "CountryID": 87,
        "Latitude": 53.55205,
        "Longitude": 10.046934,
        "DistanceUnit": 0
    },
    "Connections": [
        {
            "ID": 289505,
            "ConnectionTypeID": 28,
            "StatusTypeID": 50,
            "LevelID": 2,
            "PowerKW": 22,
            "CurrentTypeID": 20
        },
        {
            "ID": 289506,
            "ConnectionTypeID": 25,
            "StatusTypeID": 50,
            "LevelID": 2,
            "PowerKW": 22,
            "CurrentTypeID": 20
        },
        {
            "ID": 301569,
            "ConnectionTypeID": 28,
            "StatusTypeID": 50,
            "LevelID": 2,
            "PowerKW": 22,
            "CurrentTypeID": 20
        },
        {
            "ID": 301570,
            "ConnectionTypeID": 25,
            "StatusTypeID": 50,
            "LevelID": 2,
            "PowerKW": 22,
            "CurrentTypeID": 20
        }
    ],
    "StatusTypeID": 50,
    "DateLastStatusUpdate": "2021-07-12T02:51:00Z",
    "MetadataValues": [
        {
            "ID": 15324,
            "MetadataFieldID": 4,
            "ItemValue": "Data from the German chargepoint registry provided by Bundesnetzagentur.de under the CC-BY 4.0 license"
        }
    ],
    "DataQualityLevel": 3,
    "DateCreated": "2021-07-08T10:03:00Z",
    "SubmissionStatusTypeID": 100
}