{
    "IsRecentlyVerified": false,
    "ID": 180396,
    "UUID": "E5F30E35-2F88-477C-9DB2-E639D1E1D549",
    "DataProviderID": 29,
    "DataProvidersReference": "12657",
    "OperatorID": 45,
    "AddressInfo": {
        "ID": 180755,
        "Title": "Industriestraße 1",
        "AddressLine1": "Industriestraße 1",
        "Town": "Mülheim",
        "Postcode": "54486",
        "CountryID": 87,
        "Latitude": 49.913418,
        "Longitude": 7.019205,
        "DistanceUnit": 0
    },
    "Connections": [
        {
            "ID": 283425,
            "ConnectionTypeID": 25,
            "StatusTypeID": 50,
            "LevelID": 2,
            "PowerKW": 22,
            "CurrentTypeID": 20
        }
    ],
    "StatusTypeID": 50,
    "DateLastStatusUpdate": "2021-07-09T03:18:00Z",
    "MetadataValues": [
        {
            "ID": 12690,
            "MetadataFieldID": 4,
            "ItemValue": "Data from the German chargepoint registry provided by Bundesnetzagentur.de under the CC-BY 4.0 license"
        }
    ],
    "DataQualityLevel": 3,
    "DateCreated": "2021-07-08T10:00:00Z",
    "SubmissionStatusTypeID": 100
}