{
    "IsRecentlyVerified": false,
    "ID": 111137,
    "UUID": "6D146A67-1399-494A-AC23-B1F74780A55C",
    "DataProviderID": 2,
    "DataProvidersReference": "83311",
    "UsageTypeID": 1,
    "AddressInfo": {
        "ID": 111483,
        "Title": "The Big Apple",
        "AddressLine1": "262 Orchard Rd",
        "Town": "Colbourne",
        "StateOrProvince": "ON",
        "Postcode": "K0K 1S0",
        "CountryID": 44,
        "Latitude": 44.01889,
        "Longitude": -77.909595,
        "ContactTelephone1": "905-355-2574",
        "AccessComments": "24 hours daily",
        "RelatedURL": "",
        "DistanceUnit": 0
    },
    "Connections": [
        {
            "ID": 156506,
            "ConnectionTypeID": 1,
            "LevelID": 2,
            "Amps": 16,
            "Voltage": 230,
            "PowerKW": 3,
            "CurrentTypeID": 10,
            "Quantity": 1
        }
    ],
    "DateLastStatusUpdate": "2019-04-06T05:06:00Z",
    "DataQualityLevel": 3,
    "DateCreated": "2018-10-18T23:36:00Z",
    "SubmissionStatusTypeID": 100
}