{
    "IsRecentlyVerified": false,
    "ID": 73492,
    "UUID": "596784C1-0C31-48FE-AA12-1B67ADA386F5",
    "DataProviderID": 1,
    "OperatorID": 89,
    "OperatorsReference": "CEB-10170",
    "UsageTypeID": 4,
    "UsageCost": "CAD 1.00/hour",
    "AddressInfo": {
        "ID": 73838,
        "Title": "St-Hubert-Sainte-Thérèse",
        "AddressLine1": "350 boul. Labelle",
        "Town": "Ste-Thérèse",
        "StateOrProvince": "QC",
        "Postcode": "J7E 2Y1",
        "CountryID": 44,
        "Latitude": 45.64809036,
        "Longitude": -73.8404388,
        "DistanceUnit": 0
    },
    "Connections": [
        {
            "ID": 105720,
            "ConnectionTypeID": 1,
            "StatusTypeID": 50,
            "LevelID": 2,
            "Amps": 32,
            "Voltage": 230,
            "PowerKW": 7,
            "CurrentTypeID": 10,
            "Quantity": 1
        }
    ],
    "NumberOfPoints": 1,
    "StatusTypeID": 50,
    "DateLastStatusUpdate": "2017-11-12T06:38:00Z",
    "DataQualityLevel": 1,
    "DateCreated": "2016-11-22T14:05:00Z",
    "SubmissionStatusTypeID": 200
}