{
    "IsRecentlyVerified": false,
    "ID": 75129,
    "UUID": "F58AB985-9FAC-4ADB-86D8-F383B1E9F1C5",
    "DataProviderID": 1,
    "OperatorID": 224,
    "UsageTypeID": 4,
    "UsageCost": "€ 1.50 + € 3.50/h + € 0.30/kWh",
    "AddressInfo": {
        "ID": 75475,
        "Title": "Carl-von Ossietzky Straße",
        "AddressLine1": "Carl-von Ossietzky Straße 1a",
        "Town": "Freiburg im Breisgau",
        "StateOrProvince": "Baden-Württemberg",
        "Postcode": "79111",
        "CountryID": 87,
        "Latitude": 47.99995206225829,
        "Longitude": 7.79090061111448,
        "ContactTelephone1": "+49 7621 916 58",
        "AccessComments": "24/7 nutzbar, freischaltbar mit NFC fähiger Kreditkarte. Einer der beiden Plätze ist von Carsharing belegt.",
        "RelatedURL": "http://www.my-e-car.de/start.html",
        "DistanceUnit": 0
    },
    "Connections": [
        {
            "ID": 108349,
            "ConnectionTypeID": 25,
            "StatusTypeID": 50,
            "LevelID": 2,
            "Amps": 32,
            "Voltage": 400,
            "PowerKW": 22,
            "CurrentTypeID": 20,
            "Quantity": 2
        }
    ],
    "NumberOfPoints": 2,
    "StatusTypeID": 50,
    "DateLastStatusUpdate": "2016-12-12T07:25:00Z",
    "DataQualityLevel": 1,
    "DateCreated": "2016-12-12T07:25:00Z",
    "SubmissionStatusTypeID": 200
}