{
    "IsRecentlyVerified": false,
    "ID": 81365,
    "UUID": "E206A153-4DEC-4B90-AE9B-7211E5F86F6E",
    "DataProviderID": 1,
    "OperatorID": 23,
    "OperatorsReference": "17750",
    "UsageTypeID": 4,
    "UsageCost": "Free",
    "AddressInfo": {
        "ID": 81711,
        "Title": "Icon Parking 560 Third Ave",
        "AddressLine1": "560 3RD Ave",
        "Town": "New York",
        "StateOrProvince": "New York",
        "Postcode": "10016",
        "CountryID": 2,
        "Latitude": 40.747962,
        "Longitude": -73.976569,
        "ContactTelephone1": "(212) 599-9807",
        "DistanceUnit": 0
    },
    "Connections": [
        {
            "ID": 116081,
            "ConnectionTypeID": 30,
            "StatusTypeID": 50,
            "LevelID": 2,
            "PowerKW": 8,
            "CurrentTypeID": 10,
            "Quantity": 2
        }
    ],
    "NumberOfPoints": 2,
    "GeneralComments": "2 Tesla Connectors, up to 8kW.Available to the public. Please see valet.",
    "StatusTypeID": 50,
    "DateLastStatusUpdate": "2017-06-09T14:00:00Z",
    "DataQualityLevel": 1,
    "DateCreated": "2017-02-01T09:38:00Z",
    "SubmissionStatusTypeID": 200
}