{
    "IsRecentlyVerified": false,
    "ID": 172763,
    "UUID": "4A046EC2-DE5C-4C49-9CDF-27D67F30A803",
    "DataProviderID": 1,
    "OperatorID": 3434,
    "UsageTypeID": 4,
    "AddressInfo": {
        "ID": 173122,
        "Title": "אוטופיה סוכנות מורשית טויוטה מודיעין",
        "AddressLine1": "Ha-Mekhonai St 5",
        "Town": "Modiin",
        "CountryID": 111,
        "Latitude": 31.888504746163406,
        "Longitude": 34.96073268574651,
        "RelatedURL": "https://user.evedge.co.il/#/portal/locations",
        "DistanceUnit": 0
    },
    "Connections": [
        {
            "ID": 264227,
            "ConnectionTypeID": 33,
            "StatusTypeID": 50,
            "LevelID": 3,
            "PowerKW": 50,
            "CurrentTypeID": 30,
            "Quantity": 1
        },
        {
            "ID": 264228,
            "ConnectionTypeID": 2,
            "StatusTypeID": 50,
            "LevelID": 3,
            "PowerKW": 50,
            "CurrentTypeID": 30,
            "Quantity": 1
        },
        {
            "ID": 264229,
            "ConnectionTypeID": 25,
            "StatusTypeID": 50,
            "LevelID": 2,
            "PowerKW": 22,
            "CurrentTypeID": 20,
            "Quantity": 1
        }
    ],
    "NumberOfPoints": 1,
    "StatusTypeID": 50,
    "DateLastStatusUpdate": "2021-02-16T17:53:00Z",
    "DataQualityLevel": 1,
    "DateCreated": "2021-02-16T13:50:00Z",
    "SubmissionStatusTypeID": 200
}