{
    "IsRecentlyVerified": false,
    "ID": 137594,
    "UUID": "154945CA-4F49-4BEF-A1C8-212912A0B16F",
    "DataProviderID": 2,
    "DataProvidersReference": "144225",
    "OperatorID": 5,
    "UsageTypeID": 1,
    "AddressInfo": {
        "ID": 137940,
        "Title": "USA CHARGING",
        "AddressLine1": "75 S University Blvd",
        "Town": "Mobile",
        "StateOrProvince": "AL",
        "Postcode": "36608",
        "CountryID": 2,
        "Latitude": 30.6877607,
        "Longitude": -88.1720613,
        "ContactTelephone1": "888-758-4389",
        "AccessComments": "24 hours daily",
        "RelatedURL": "http://www.chargepoint.com/",
        "DistanceUnit": 0
    },
    "Connections": [
        {
            "ID": 192538,
            "ConnectionTypeID": 1,
            "LevelID": 2,
            "Amps": 16,
            "Voltage": 230,
            "PowerKW": 3,
            "CurrentTypeID": 10,
            "Quantity": 2
        }
    ],
    "StatusTypeID": 50,
    "DateLastStatusUpdate": "2019-12-24T09:05:00Z",
    "DataQualityLevel": 3,
    "DateCreated": "2019-12-24T09:05:00Z",
    "SubmissionStatusTypeID": 100
}