{
    "IsRecentlyVerified": false,
    "ID": 84623,
    "UUID": "9C78AD1D-00A5-41C7-89E4-701532DBA6F8",
    "DataProviderID": 1,
    "OperatorID": 220,
    "OperatorsReference": "3784,3784,3785",
    "UsageTypeID": 4,
    "UsageCost": "€1.73 + €0.3213/kWh; Andere Tarife möglich",
    "AddressInfo": {
        "ID": 84969,
        "Title": "Holstentwiete",
        "AddressLine1": "Holstentwiete 19",
        "Town": "Hamburg",
        "StateOrProvince": "Hamburg",
        "Postcode": "22763",
        "CountryID": 87,
        "Latitude": 53.5522156,
        "Longitude": 9.92198899999994,
        "AccessComments": "24/7 nutzbar",
        "DistanceUnit": 0
    },
    "Connections": [
        {
            "ID": 120197,
            "ConnectionTypeID": 25,
            "StatusTypeID": 50,
            "LevelID": 2,
            "Amps": 32,
            "Voltage": 400,
            "PowerKW": 22,
            "CurrentTypeID": 20,
            "Quantity": 2
        },
        {
            "ID": 120198,
            "ConnectionTypeID": 28,
            "StatusTypeID": 50,
            "LevelID": 2,
            "Amps": 16,
            "Voltage": 230,
            "PowerKW": 3.7,
            "CurrentTypeID": 10,
            "Quantity": 2
        }
    ],
    "NumberOfPoints": 2,
    "StatusTypeID": 50,
    "DateLastStatusUpdate": "2017-04-20T22:47:00Z",
    "DataQualityLevel": 1,
    "DateCreated": "2017-03-06T07:28:00Z",
    "SubmissionStatusTypeID": 200
}