{
    "IsRecentlyVerified": false,
    "ID": 108445,
    "UUID": "D780D3E0-22E0-4081-B733-9ABDE5C0F93D",
    "DataProviderID": 1,
    "OperatorID": 20,
    "OperatorsReference": "80276..80279",
    "UsageTypeID": 4,
    "UsageCost": "£0.20/kWh;min £1.00",
    "AddressInfo": {
        "ID": 108791,
        "Title": "Sneinton Market Car Park, Nottingham",
        "AddressLine1": "Gedling Street",
        "Town": "Nottingham",
        "Postcode": "NG1 1DS",
        "CountryID": 1,
        "Latitude": 52.95403,
        "Longitude": -1.1388558306885,
        "DistanceUnit": 0
    },
    "Connections": [
        {
            "ID": 153342,
            "ConnectionTypeID": 25,
            "StatusTypeID": 50,
            "LevelID": 2,
            "Amps": 32,
            "Voltage": 230,
            "PowerKW": 7,
            "CurrentTypeID": 10,
            "Quantity": 8
        },
        {
            "ID": 153343,
            "ConnectionTypeID": 3,
            "StatusTypeID": 50,
            "LevelID": 2,
            "Amps": 13,
            "Voltage": 230,
            "PowerKW": 3,
            "CurrentTypeID": 10,
            "Quantity": 2
        }
    ],
    "NumberOfPoints": 8,
    "StatusTypeID": 50,
    "DateLastStatusUpdate": "2018-10-24T05:30:00Z",
    "DataQualityLevel": 1,
    "DateCreated": "2018-10-02T05:18:00Z",
    "SubmissionStatusTypeID": 200
}