{
    "IsRecentlyVerified": false,
    "ID": 40941,
    "UUID": "D3520E8C-879D-48EA-BDCE-B42EEB761287",
    "DataProviderID": 1,
    "OperatorID": 127,
    "UsageTypeID": 1,
    "UsageCost": "0",
    "AddressInfo": {
        "ID": 41287,
        "Title": "Ladesäule Rathaus Langen",
        "AddressLine1": "Sieverner Straße 10",
        "Town": "Langen",
        "StateOrProvince": "Landkreis Cuxhaven",
        "Postcode": "27607",
        "CountryID": 87,
        "Latitude": 53.60905,
        "Longitude": 8.59410000000003,
        "ContactTelephone1": "04418030",
        "ContactTelephone2": "08001014432",
        "AccessComments": "Auf Rathausparkplatz, immer offen",
        "RelatedURL": "http://www.ewe.de/privatkunden/mobilitaet.php",
        "DistanceUnit": 0
    },
    "Connections": [
        {
            "ID": 44592,
            "ConnectionTypeID": 25,
            "StatusTypeID": 50,
            "Quantity": 2
        }
    ],
    "NumberOfPoints": 2,
    "GeneralComments": "Zugang mit EWE / SWB RFID Karte",
    "StatusTypeID": 50,
    "DateLastStatusUpdate": "2015-01-19T19:16:00Z",
    "DataQualityLevel": 1,
    "DateCreated": "2015-01-17T16:19:00Z",
    "SubmissionStatusTypeID": 200
}