{
    "IsRecentlyVerified": false,
    "ID": 172711,
    "UUID": "B5DFE6CC-3FD3-4603-8D4C-E9795AE81E05",
    "DataProviderID": 1,
    "OperatorID": 1,
    "UsageTypeID": 4,
    "AddressInfo": {
        "ID": 173070,
        "Title": "10 Marii Skłodowskiej-Curie",
        "AddressLine1": "10 Marii Skłodowskiej-Curie",
        "Town": "Białystok",
        "StateOrProvince": "Podlaskie Voivodeship",
        "Postcode": "15-097",
        "CountryID": 179,
        "Latitude": 53.128318799999995,
        "Longitude": 23.1578678,
        "DistanceUnit": 0
    },
    "Connections": [
        {
            "ID": 264115,
            "ConnectionTypeID": 33,
            "StatusTypeID": 0,
            "LevelID": 3,
            "PowerKW": 50,
            "CurrentTypeID": 30,
            "Quantity": 1
        }
    ],
    "NumberOfPoints": 1,
    "StatusTypeID": 0,
    "DateLastStatusUpdate": "2021-02-15T10:26:00Z",
    "DataQualityLevel": 1,
    "DateCreated": "2021-02-13T14:54:00Z",
    "SubmissionStatusTypeID": 200
}