{
    "IsRecentlyVerified": false,
    "ID": 102785,
    "UUID": "6E308584-67D6-4A74-91C3-46BDAEBB2EDC",
    "DataProviderID": 2,
    "DataProvidersReference": "80607",
    "UsageTypeID": 1,
    "AddressInfo": {
        "ID": 103131,
        "Title": "Joseph Garage - Russell Street",
        "AddressLine1": "53 W Russell St",
        "Town": "Columbus",
        "StateOrProvince": "OH",
        "Postcode": "43215",
        "CountryID": 2,
        "Latitude": 39.97558,
        "Longitude": -83.003724,
        "ContactTelephone1": "513-315-2451",
        "AccessComments": "24 hours daily",
        "RelatedURL": "",
        "DistanceUnit": 0
    },
    "Connections": [
        {
            "ID": 144916,
            "ConnectionTypeID": 30,
            "LevelID": 2,
            "Amps": 16,
            "Voltage": 230,
            "PowerKW": 3.7,
            "CurrentTypeID": 10,
            "Quantity": 2
        }
    ],
    "DateLastStatusUpdate": "2020-06-26T03:02:00Z",
    "DataQualityLevel": 3,
    "DateCreated": "2018-04-21T04:13:00Z",
    "SubmissionStatusTypeID": 100
}