{
    "IsRecentlyVerified": false,
    "ID": 172005,
    "UUID": "4E6FEF63-67A0-454E-B1DB-A371653DCE1B",
    "DataProviderID": 1,
    "OperatorID": 3378,
    "UsageTypeID": 4,
    "UsageCost": "29RON/AC session, 44RON/DC session",
    "AddressInfo": {
        "ID": 172364,
        "Title": "MOL Ploiesti 3",
        "AddressLine1": "DN1",
        "Town": "Ploiești",
        "StateOrProvince": "Prahova",
        "Postcode": "100537",
        "CountryID": 184,
        "Latitude": 44.96400051972583,
        "Longitude": 25.973170913662443,
        "DistanceUnit": 0
    },
    "Connections": [
        {
            "ID": 262891,
            "ConnectionTypeID": 33,
            "StatusTypeID": 50,
            "LevelID": 3,
            "PowerKW": 50,
            "CurrentTypeID": 30,
            "Quantity": 1
        },
        {
            "ID": 262892,
            "ConnectionTypeID": 2,
            "StatusTypeID": 50,
            "LevelID": 3,
            "PowerKW": 50,
            "CurrentTypeID": 30,
            "Quantity": 1
        },
        {
            "ID": 262893,
            "ConnectionTypeID": 25,
            "StatusTypeID": 50,
            "LevelID": 2,
            "PowerKW": 22,
            "CurrentTypeID": 20,
            "Quantity": 1
        }
    ],
    "NumberOfPoints": 2,
    "GeneralComments": "Temporarily limited to 22kW",
    "StatusTypeID": 50,
    "DateLastStatusUpdate": "2021-02-06T05:37:00Z",
    "DataQualityLevel": 1,
    "DateCreated": "2021-01-11T09:22:00Z",
    "SubmissionStatusTypeID": 200
}