{
    "IsRecentlyVerified": false,
    "ID": 162565,
    "UUID": "A908F5C1-ACCA-4FEB-85D6-E221CD3B80C7",
    "DataProviderID": 1,
    "OperatorID": 45,
    "UsageTypeID": 6,
    "AddressInfo": {
        "ID": 162922,
        "Title": "Comfort Inn",
        "AddressLine1": "943 US-80 W",
        "Town": "Demopolis",
        "StateOrProvince": "AL",
        "Postcode": "36732",
        "CountryID": 2,
        "Latitude": 32.497425,
        "Longitude": -87.848111,
        "ContactTelephone1": "3342899595",
        "ContactEmail": "gm.al392@choicehotels.com",
        "RelatedURL": "https://www.choicehotels.com/alabama/demopolis/comfort-inn-hotels/al392",
        "DistanceUnit": 0
    },
    "Connections": [
        {
            "ID": 233970,
            "ConnectionTypeID": 1,
            "StatusTypeID": 50,
            "LevelID": 2,
            "PowerKW": 7.2,
            "CurrentTypeID": 10,
            "Quantity": 1
        }
    ],
    "NumberOfPoints": 1,
    "StatusTypeID": 50,
    "DateLastStatusUpdate": "2020-08-13T07:41:00Z",
    "DataQualityLevel": 1,
    "DateCreated": "2020-08-12T03:51:00Z",
    "SubmissionStatusTypeID": 200
}