{
    "IsRecentlyVerified": false,
    "ID": 157862,
    "UUID": "BE8D7369-A227-4476-AE3C-8627EA83BC18",
    "DataProviderID": 18,
    "DataProvidersReference": "72c2f0fc89591504280a49c7cb209024",
    "UsageTypeID": 1,
    "AddressInfo": {
        "ID": 158216,
        "Title": "Northern Perimeter Road (Heathrow)",
        "AddressLine1": "Northern Perimeter Road (Heathrow)",
        "Town": "Longford",
        "Postcode": "TW6 2EQ",
        "CountryID": 1,
        "Latitude": 51.480385,
        "Longitude": -0.451055,
        "AccessComments": "",
        "RelatedURL": "http://www.national-charge-point-registry.uk/",
        "DistanceUnit": 0
    },
    "Connections": [
        {
            "ID": 227477,
            "ConnectionTypeID": 25,
            "Reference": "4002601",
            "StatusTypeID": 50,
            "LevelID": 2,
            "Amps": 16,
            "Voltage": 400,
            "PowerKW": 11,
            "CurrentTypeID": 20
        }
    ],
    "StatusTypeID": 0,
    "DateLastStatusUpdate": "2020-06-25T10:00:00Z",
    "MetadataValues": [
        {
            "ID": 7395,
            "MetadataFieldID": 4,
            "ItemValue": "Contains public sector information licensed under the Open Government Licence v2.0. http://www.nationalarchives.gov.uk/doc/open-government-licence/version/2/"
        }
    ],
    "DataQualityLevel": 3,
    "DateCreated": "2020-06-25T10:00:00Z",
    "SubmissionStatusTypeID": 100
}