{
    "UserComments": [
        {
            "ID": 19198,
            "ChargePointID": 57628,
            "CommentTypeID": 10,
            "UserName": "ForumElettrico.it",
            "RelatedURL": "https://www.forumelettrico.it/forum/colonnina-in-via-baldassarre-malamini-1-cento-fe-t79.html",
            "DateCreated": "2018-02-17T13:35:51.51Z",
            "User": {
                "ID": 11749,
                "Username": "ForumElettrico.it"
            },
            "CheckinStatusTypeID": 0
        },
        {
            "ID": 19197,
            "ChargePointID": 57628,
            "CommentTypeID": 10,
            "UserName": "ForumElettrico.it",
            "Comment": "https://www.forumelettrico.it/forum/colonnina-in-via-baldassarre-malamini-1-cento-fe-t79.html\n",
            "DateCreated": "2018-02-17T13:35:42.017Z",
            "User": {
                "ID": 11749,
                "Username": "ForumElettrico.it"
            },
            "CheckinStatusTypeID": 10
        }
    ],
    "MediaItems": [
        {
            "ID": 15077,
            "ChargePointID": 57628,
            "ItemURL": "https://s3-ap-southeast-2.amazonaws.com/openchargemap/images/IT/OCM57628/OCM-57628.orig.2018021713362029.jpg",
            "ItemThumbnailURL": "https://s3-ap-southeast-2.amazonaws.com/openchargemap/images/IT/OCM57628/OCM-57628.thmb.2018021713362029.jpg",
            "Comment": "",
            "IsEnabled": true,
            "IsVideo": false,
            "IsFeaturedItem": false,
            "IsExternalResource": false,
            "User": {
                "ID": 11749,
                "Username": "ForumElettrico.it"
            },
            "DateCreated": "2018-02-17T13:37:00Z"
        },
        {
            "ID": 15078,
            "ChargePointID": 57628,
            "ItemURL": "https://s3-ap-southeast-2.amazonaws.com/openchargemap/images/IT/OCM57628/OCM-57628.orig.2018021713362704.jpg",
            "ItemThumbnailURL": "https://s3-ap-southeast-2.amazonaws.com/openchargemap/images/IT/OCM57628/OCM-57628.thmb.2018021713362704.jpg",
            "Comment": "",
            "IsEnabled": true,
            "IsVideo": false,
            "IsFeaturedItem": false,
            "IsExternalResource": false,
            "User": {
                "ID": 11749,
                "Username": "ForumElettrico.it"
            },
            "DateCreated": "2018-02-17T13:37:00Z"
        },
        {
            "ID": 15079,
            "ChargePointID": 57628,
            "ItemURL": "https://s3-ap-southeast-2.amazonaws.com/openchargemap/images/IT/OCM57628/OCM-57628.orig.2018021713363411.jpg",
            "ItemThumbnailURL": "https://s3-ap-southeast-2.amazonaws.com/openchargemap/images/IT/OCM57628/OCM-57628.thmb.2018021713363411.jpg",
            "Comment": "",
            "IsEnabled": true,
            "IsVideo": false,
            "IsFeaturedItem": false,
            "IsExternalResource": false,
            "User": {
                "ID": 11749,
                "Username": "ForumElettrico.it"
            },
            "DateCreated": "2018-02-17T13:37:00Z"
        },
        {
            "ID": 15080,
            "ChargePointID": 57628,
            "ItemURL": "https://s3-ap-southeast-2.amazonaws.com/openchargemap/images/IT/OCM57628/OCM-57628.orig.2018021713364043.jpg",
            "ItemThumbnailURL": "https://s3-ap-southeast-2.amazonaws.com/openchargemap/images/IT/OCM57628/OCM-57628.thmb.2018021713364043.jpg",
            "Comment": "",
            "IsEnabled": true,
            "IsVideo": false,
            "IsFeaturedItem": false,
            "IsExternalResource": false,
            "User": {
                "ID": 11749,
                "Username": "ForumElettrico.it"
            },
            "DateCreated": "2018-02-17T13:37:00Z"
        },
        {
            "ID": 15081,
            "ChargePointID": 57628,
            "ItemURL": "https://s3-ap-southeast-2.amazonaws.com/openchargemap/images/IT/OCM57628/OCM-57628.orig.2018021713364681.jpg",
            "ItemThumbnailURL": "https://s3-ap-southeast-2.amazonaws.com/openchargemap/images/IT/OCM57628/OCM-57628.thmb.2018021713364681.jpg",
            "Comment": "",
            "IsEnabled": true,
            "IsVideo": false,
            "IsFeaturedItem": false,
            "IsExternalResource": false,
            "User": {
                "ID": 11749,
                "Username": "ForumElettrico.it"
            },
            "DateCreated": "2018-02-17T13:37:00Z"
        },
        {
            "ID": 15076,
            "ChargePointID": 57628,
            "ItemURL": "https://s3-ap-southeast-2.amazonaws.com/openchargemap/images/IT/OCM57628/OCM-57628.orig.2018021713361262.jpg",
            "ItemThumbnailURL": "https://s3-ap-southeast-2.amazonaws.com/openchargemap/images/IT/OCM57628/OCM-57628.thmb.2018021713361262.jpg",
            "Comment": "",
            "IsEnabled": true,
            "IsVideo": false,
            "IsFeaturedItem": false,
            "IsExternalResource": false,
            "User": {
                "ID": 11749,
                "Username": "ForumElettrico.it"
            },
            "DateCreated": "2018-02-17T13:36:00Z"
        }
    ],
    "IsRecentlyVerified": false,
    "ID": 57628,
    "UUID": "79295445-3CCF-423D-B3E1-DFA1203AF328",
    "DataProviderID": 1,
    "OperatorID": 1,
    "UsageTypeID": 6,
    "AddressInfo": {
        "ID": 57974,
        "Title": " C.M.V. Servizi Srl",
        "AddressLine1": "Via Malamini B., 1",
        "Town": "Cento ",
        "StateOrProvince": "FE",
        "Postcode": "44042",
        "CountryID": 112,
        "Latitude": 44.745438759982235,
        "Longitude": 11.277912833533819,
        "ContactTelephone1": "390516833999 ",
        "ContactEmail": "info@cmvservizi.it",
        "RelatedURL": "http://www.cmvservizi.it/",
        "DistanceUnit": 0
    },
    "Connections": [
        {
            "ID": 72872,
            "ConnectionTypeID": 25,
            "StatusTypeID": 50,
            "LevelID": 2,
            "Amps": 32,
            "Voltage": 400,
            "PowerKW": 22,
            "CurrentTypeID": 20,
            "Quantity": 1
        }
    ],
    "NumberOfPoints": 1,
    "StatusTypeID": 50,
    "DateLastStatusUpdate": "2018-02-17T13:37:00Z",
    "DataQualityLevel": 1,
    "DateCreated": "2015-12-10T16:40:00Z",
    "SubmissionStatusTypeID": 200
}