{
    "IsRecentlyVerified": false,
    "ID": 159691,
    "UUID": "809CCEF6-57BB-43B9-BAAE-B93458EC780E",
    "DataProviderID": 2,
    "DataProvidersReference": "152387",
    "OperatorID": 5,
    "UsageTypeID": 1,
    "AddressInfo": {
        "ID": 160048,
        "Title": "VERMELLA HARRIS",
        "AddressLine1": "1100 Frank E Rodgers Blvd S",
        "Town": "Harrison",
        "StateOrProvince": "NJ",
        "Postcode": "07029",
        "CountryID": 2,
        "Latitude": 40.735935,
        "Longitude": -74.154854,
        "ContactTelephone1": "888-758-4389",
        "AccessComments": "24 hours daily",
        "RelatedURL": "http://www.chargepoint.com/",
        "DistanceUnit": 0
    },
    "Connections": [
        {
            "ID": 229896,
            "ConnectionTypeID": 1,
            "LevelID": 2,
            "Amps": 16,
            "Voltage": 230,
            "PowerKW": 3.7,
            "CurrentTypeID": 10,
            "Quantity": 2
        }
    ],
    "StatusTypeID": 50,
    "DateLastStatusUpdate": "2020-06-26T03:03:00Z",
    "DataQualityLevel": 3,
    "DateCreated": "2020-06-26T03:03:00Z",
    "SubmissionStatusTypeID": 100
}