{
    "IsRecentlyVerified": false,
    "ID": 32750,
    "UUID": "851E22C7-232C-4D5D-A825-4A595A481955",
    "DataProviderID": 26,
    "DataProvidersReference": "47296",
    "OperatorID": 178,
    "OperatorsReference": "EVnetNL AL452",
    "UsageCost": "0.00 jaarabonnement",
    "AddressInfo": {
        "ID": 33096,
        "Title": "Bombadil 20",
        "AddressLine1": "Bombadil 20",
        "Town": "Geldrop-Mierlo",
        "Postcode": "5661 AG",
        "CountryID": 159,
        "Latitude": 51.413284,
        "Longitude": 5.542152,
        "ContactTelephone1": "0800-3522365",
        "RelatedURL": "http://www.evnet.nl",
        "DistanceUnit": 0
    },
    "Connections": [
        {
            "ID": 36261,
            "ConnectionTypeID": 25,
            "LevelID": 2,
            "PowerKW": 11,
            "CurrentTypeID": 10
        }
    ],
    "NumberOfPoints": 2,
    "StatusTypeID": 50,
    "DateLastStatusUpdate": "2016-06-04T02:38:00Z",
    "DataQualityLevel": 3,
    "DateCreated": "2015-01-09T06:03:00Z",
    "SubmissionStatusTypeID": 100
}