{
    "IsRecentlyVerified": false,
    "ID": 67989,
    "UUID": "C9396CF9-D825-487B-BFE6-6594526D977F",
    "DataProviderID": 26,
    "DataProvidersReference": "91531",
    "OperatorID": 73,
    "OperatorsReference": "EV-Box EVB-P1607073",
    "UsageCost": "0.00 jaarabonnement",
    "AddressInfo": {
        "ID": 68335,
        "Title": "Zuidzijde 30",
        "AddressLine1": "Zuidzijde 30",
        "Town": "Rotterdam",
        "Postcode": "3181 JD",
        "CountryID": 159,
        "Latitude": 51.90251,
        "Longitude": 4.2385,
        "RelatedURL": "http://www.ev-box.nl",
        "DistanceUnit": 0
    },
    "Connections": [
        {
            "ID": 94650,
            "ConnectionTypeID": 25,
            "LevelID": 2,
            "PowerKW": 11,
            "CurrentTypeID": 10
        },
        {
            "ID": 94651,
            "ConnectionTypeID": 25,
            "LevelID": 2,
            "PowerKW": 11,
            "CurrentTypeID": 10
        }
    ],
    "NumberOfPoints": 1,
    "StatusTypeID": 50,
    "DateLastStatusUpdate": "2016-06-04T02:37:00Z",
    "DataQualityLevel": 3,
    "DateCreated": "2016-06-04T02:37:00Z",
    "SubmissionStatusTypeID": 100
}