{
    "IsRecentlyVerified": false,
    "ID": 71827,
    "UUID": "A752D074-6971-4568-8717-4356E645828E",
    "DataProviderID": 1,
    "OperatorID": 45,
    "UsageTypeID": 3,
    "UsageCost": "Spende",
    "AddressInfo": {
        "ID": 72173,
        "Title": "Autohaus Traurig",
        "AddressLine1": "Daberger Straße 64",
        "Town": "Furth im Wald",
        "StateOrProvince": "Landkreis Cham",
        "Postcode": "93437",
        "CountryID": 87,
        "Latitude": 49.3110042558063,
        "Longitude": 12.8635410502625,
        "ContactTelephone1": " +49 9973 801303",
        "AccessComments": "Säule des Renault / Dacia Autohauses ohne Voranmeldung nutzbar von Mo-Fr 8-18Uhr, Sa 9-12Uhr. Nach Voranmeldung 24/7 nutzbar. Säule ist rechts am Gebäude zwischen E-Wald Säule und Autohauseingang.",
        "RelatedURL": "http://www.autohaus-traurig.de/cms",
        "DistanceUnit": 0
    },
    "Connections": [
        {
            "ID": 102880,
            "ConnectionTypeID": 25,
            "StatusTypeID": 50,
            "LevelID": 2,
            "Amps": 16,
            "Voltage": 400,
            "PowerKW": 11,
            "CurrentTypeID": 20,
            "Quantity": 1
        },
        {
            "ID": 102881,
            "ConnectionTypeID": 28,
            "StatusTypeID": 50,
            "LevelID": 2,
            "Amps": 16,
            "Voltage": 230,
            "PowerKW": 3.7,
            "CurrentTypeID": 10,
            "Quantity": 1
        }
    ],
    "NumberOfPoints": 2,
    "StatusTypeID": 50,
    "DateLastStatusUpdate": "2016-09-14T10:59:00Z",
    "DataQualityLevel": 1,
    "DateCreated": "2016-09-14T10:59:00Z",
    "SubmissionStatusTypeID": 200
}