{
    "IsRecentlyVerified": false,
    "ID": 81477,
    "UUID": "A208C894-5D78-4837-AC7C-D8D2B3B0C856",
    "DataProviderID": 1,
    "OperatorID": 23,
    "OperatorsReference": "20967",
    "UsageTypeID": 6,
    "UsageCost": "Free",
    "AddressInfo": {
        "ID": 81823,
        "Title": "Fiesta Inn San Luis Potosi­ Oriente",
        "AddressLine1": "Carr. 57 KM. 197+100 No. 2390 Periferico Oriente Industrias",
        "Town": "San Luis Potosi",
        "StateOrProvince": "San Luis Potosi",
        "Postcode": "78090",
        "CountryID": 146,
        "Latitude": 22.126663,
        "Longitude": -100.922004,
        "ContactTelephone1": "+52 444 834 4900",
        "DistanceUnit": 0
    },
    "Connections": [
        {
            "ID": 116213,
            "ConnectionTypeID": 30,
            "StatusTypeID": 50,
            "LevelID": 2,
            "PowerKW": 18,
            "CurrentTypeID": 20,
            "Quantity": 2
        }
    ],
    "NumberOfPoints": 2,
    "GeneralComments": "2 Tesla Connectors, up to 18kW.Available for patrons only. Please see front desk.",
    "StatusTypeID": 50,
    "DateLastStatusUpdate": "2017-02-02T17:23:00Z",
    "DataQualityLevel": 1,
    "DateCreated": "2017-02-02T17:23:00Z",
    "SubmissionStatusTypeID": 200
}