{
    "IsRecentlyVerified": false,
    "ID": 123349,
    "UUID": "5EEC20E6-0DCE-41CA-B1A1-E0A890728BAC",
    "DataProviderID": 2,
    "DataProvidersReference": "76426",
    "UsageTypeID": 7,
    "AddressInfo": {
        "ID": 123695,
        "Title": "Sweet Retreat Orchard",
        "AddressLine1": "2925 Frank Perry Rd",
        "Town": "Hillsborough",
        "StateOrProvince": "NC",
        "Postcode": "27278",
        "CountryID": 2,
        "Latitude": 36.103194,
        "Longitude": -79.134278,
        "ContactTelephone1": "919-973-5536",
        "AccessComments": "24 hours daily\r\nPublic - Call ahead",
        "RelatedURL": "",
        "DistanceUnit": 0
    },
    "Connections": [
        {
            "ID": 173315,
            "ConnectionTypeID": 1,
            "LevelID": 2,
            "Amps": 16,
            "Voltage": 230,
            "PowerKW": 3.7,
            "CurrentTypeID": 10,
            "Quantity": 1
        }
    ],
    "DateLastStatusUpdate": "2020-06-26T02:58:00Z",
    "DataQualityLevel": 3,
    "DateCreated": "2019-04-06T05:03:00Z",
    "SubmissionStatusTypeID": 100
}