{
    "MediaItems": [
        {
            "ID": 16617,
            "ChargePointID": 108349,
            "ItemURL": "https://s3-ap-southeast-2.amazonaws.com/openchargemap/images/CZ/OCM108349/OCM-108349.orig.2018092412001680.jpg",
            "ItemThumbnailURL": "https://s3-ap-southeast-2.amazonaws.com/openchargemap/images/CZ/OCM108349/OCM-108349.thmb.2018092412001680.jpg",
            "Comment": "",
            "IsEnabled": true,
            "IsVideo": false,
            "IsFeaturedItem": false,
            "IsExternalResource": false,
            "User": {
                "ID": 6224,
                "Username": "ozana"
            },
            "DateCreated": "2018-09-24T12:00:00Z"
        },
        {
            "ID": 16616,
            "ChargePointID": 108349,
            "ItemURL": "https://s3-ap-southeast-2.amazonaws.com/openchargemap/images/CZ/OCM108349/OCM-108349.orig.2018092411552420.jpg",
            "ItemThumbnailURL": "https://s3-ap-southeast-2.amazonaws.com/openchargemap/images/CZ/OCM108349/OCM-108349.thmb.2018092411552420.jpg",
            "Comment": "",
            "IsEnabled": true,
            "IsVideo": false,
            "IsFeaturedItem": false,
            "IsExternalResource": false,
            "User": {
                "ID": 6224,
                "Username": "ozana"
            },
            "DateCreated": "2018-09-24T11:56:00Z"
        }
    ],
    "IsRecentlyVerified": false,
    "ID": 108349,
    "UUID": "88FE0B9E-D979-42E0-B028-10B6BEBCEC92",
    "DataProviderID": 1,
    "OperatorID": 115,
    "UsageTypeID": 1,
    "AddressInfo": {
        "ID": 108695,
        "Title": "ČEZ Šternberk",
        "AddressLine1": "Olomoucká",
        "Town": "Šternberk",
        "StateOrProvince": "okres Olomouc",
        "Postcode": "78501",
        "CountryID": 64,
        "Latitude": 49.712,
        "Longitude": 17.292,
        "RelatedURL": "http://www.elektromobilita.cz",
        "DistanceUnit": 0
    },
    "Connections": [
        {
            "ID": 153173,
            "ConnectionTypeID": 2,
            "StatusTypeID": 50,
            "LevelID": 3,
            "PowerKW": 50,
            "CurrentTypeID": 30,
            "Quantity": 1
        },
        {
            "ID": 153174,
            "ConnectionTypeID": 33,
            "StatusTypeID": 50,
            "LevelID": 3,
            "PowerKW": 50,
            "CurrentTypeID": 30,
            "Quantity": 1
        },
        {
            "ID": 153175,
            "ConnectionTypeID": 25,
            "StatusTypeID": 50,
            "LevelID": 2,
            "Amps": 32,
            "Voltage": 400,
            "PowerKW": 22,
            "CurrentTypeID": 20,
            "Quantity": 1
        }
    ],
    "NumberOfPoints": 1,
    "StatusTypeID": 50,
    "DateLastStatusUpdate": "2018-09-24T12:00:00Z",
    "DataQualityLevel": 1,
    "DateCreated": "2018-09-24T07:06:00Z",
    "SubmissionStatusTypeID": 200
}