{
    "IsRecentlyVerified": false,
    "ID": 159884,
    "UUID": "F9B607A4-6553-4C07-9085-47D95ECE7D15",
    "DataProviderID": 2,
    "DataProvidersReference": "152182",
    "OperatorID": 3293,
    "UsageTypeID": 1,
    "AddressInfo": {
        "ID": 160241,
        "Title": "United Center - Parking Lot K",
        "AddressLine1": "1901 W Madison St",
        "Town": "Chicago",
        "StateOrProvince": "IL",
        "Postcode": "60612",
        "CountryID": 2,
        "Latitude": 41.879879,
        "Longitude": -87.674151,
        "ContactTelephone1": "888-264-2208",
        "AccessComments": "6am-12pm daily",
        "RelatedURL": "https://voltacharging.com/",
        "DistanceUnit": 0
    },
    "Connections": [
        {
            "ID": 230105,
            "ConnectionTypeID": 1,
            "LevelID": 2,
            "Amps": 16,
            "Voltage": 230,
            "PowerKW": 3.7,
            "CurrentTypeID": 10,
            "Quantity": 2
        }
    ],
    "StatusTypeID": 50,
    "DateLastStatusUpdate": "2020-06-26T03:05:00Z",
    "DataQualityLevel": 3,
    "DateCreated": "2020-06-26T03:05:00Z",
    "SubmissionStatusTypeID": 100
}