{
    "IsRecentlyVerified": false,
    "ID": 116009,
    "UUID": "F08365AD-F425-4EA2-97AA-77D5D917C5A4",
    "DataProviderID": 2,
    "DataProvidersReference": "117619",
    "OperatorID": 5,
    "UsageTypeID": 1,
    "AddressInfo": {
        "ID": 116355,
        "Title": "SALISBURY MA",
        "AddressLine1": "17 Elm St",
        "Town": "Salisbury",
        "StateOrProvince": "MA",
        "Postcode": "01952",
        "CountryID": 2,
        "Latitude": 42.8396093,
        "Longitude": -70.8613894,
        "ContactTelephone1": "888-758-4389",
        "AccessComments": "24 hours daily",
        "RelatedURL": "http://www.chargepoint.com/",
        "DistanceUnit": 0
    },
    "Connections": [
        {
            "ID": 163066,
            "ConnectionTypeID": 1,
            "LevelID": 2,
            "Amps": 16,
            "Voltage": 230,
            "PowerKW": 3.7,
            "CurrentTypeID": 10,
            "Quantity": 2
        }
    ],
    "DateLastStatusUpdate": "2020-06-26T03:06:00Z",
    "DataQualityLevel": 3,
    "DateCreated": "2019-02-11T07:13:00Z",
    "SubmissionStatusTypeID": 100
}