{
    "IsRecentlyVerified": false,
    "ID": 165065,
    "UUID": "EDC2D337-B60C-4141-BB49-F580D5E41B48",
    "DataProviderID": 1,
    "OperatorID": 23,
    "OperatorsReference": "43472",
    "UsageTypeID": 4,
    "UsageCost": "NKR 1.70/kWh; andre tariffer for eldre biler",
    "AddressInfo": {
        "ID": 165424,
        "Title": "Arna Supercharger",
        "AddressLine1": "63 Ådnavegen Indre",
        "Town": "Arna",
        "Postcode": "5620",
        "CountryID": 168,
        "Latitude": 60.421924,
        "Longitude": 5.46703,
        "DistanceUnit": 0
    },
    "Connections": [
        {
            "ID": 236665,
            "ConnectionTypeID": 27,
            "StatusTypeID": 50,
            "LevelID": 3,
            "PowerKW": 120,
            "CurrentTypeID": 30,
            "Quantity": 20
        }
    ],
    "NumberOfPoints": 20,
    "GeneralComments": "Charging20 Superchargers, available 24/7, up to 150kW",
    "StatusTypeID": 50,
    "DateLastStatusUpdate": "2020-08-25T05:51:00Z",
    "DataQualityLevel": 1,
    "DateCreated": "2020-08-25T05:51:00Z",
    "SubmissionStatusTypeID": 200
}