{
    "IsRecentlyVerified": false,
    "ID": 116106,
    "UUID": "1657F969-B52B-4E0E-BBAB-590A44B77994",
    "DataProviderID": 2,
    "DataProvidersReference": "105299",
    "OperatorID": 5,
    "UsageTypeID": 2,
    "AddressInfo": {
        "ID": 116452,
        "Title": "EMPLOYEE SERV",
        "AddressLine1": "18326 SW 108th Ave",
        "Town": "Tualatin",
        "StateOrProvince": "OR",
        "Postcode": "97062",
        "CountryID": 2,
        "Latitude": 45.3871568,
        "Longitude": -122.7887215,
        "ContactTelephone1": "888-758-4389",
        "AccessComments": "24 hours daily",
        "RelatedURL": "http://www.chargepoint.com/",
        "DistanceUnit": 0
    },
    "Connections": [
        {
            "ID": 163169,
            "ConnectionTypeID": 1,
            "LevelID": 2,
            "Amps": 16,
            "Voltage": 230,
            "PowerKW": 3.7,
            "CurrentTypeID": 10,
            "Quantity": 2
        }
    ],
    "DateLastStatusUpdate": "2020-06-26T03:09:00Z",
    "DataQualityLevel": 3,
    "DateCreated": "2019-02-11T07:13:00Z",
    "SubmissionStatusTypeID": 100
}