{
    "IsRecentlyVerified": false,
    "ID": 92563,
    "UUID": "5F031E12-5A7A-47F4-9E0B-B87090E920AB",
    "DataProviderID": 1,
    "OperatorID": 23,
    "OperatorsReference": "33599",
    "UsageTypeID": 4,
    "AddressInfo": {
        "ID": 92909,
        "Title": "Fairfield Inn & Suites By Marriott Gadsden",
        "AddressLine1": "116 Walker St",
        "Town": "Gadsden",
        "StateOrProvince": "Alabama",
        "Postcode": "35904",
        "CountryID": 2,
        "Latitude": 33.998913,
        "Longitude": -86.088265,
        "ContactTelephone1": "(256) 538-2100",
        "DistanceUnit": 0
    },
    "Connections": [
        {
            "ID": 131164,
            "ConnectionTypeID": 30,
            "StatusTypeID": 50,
            "LevelID": 2,
            "PowerKW": 16,
            "CurrentTypeID": 20,
            "Quantity": 4
        }
    ],
    "NumberOfPoints": 4,
    "GeneralComments": "4 Tesla Connectors, up to 16kW.Available for customers. Please see front desk.",
    "StatusTypeID": 50,
    "DateLastStatusUpdate": "2017-09-07T06:03:00Z",
    "DataQualityLevel": 1,
    "DateCreated": "2017-09-07T06:03:00Z",
    "SubmissionStatusTypeID": 200
}