{
    "IsRecentlyVerified": false,
    "ID": 138469,
    "UUID": "F710C92A-1BF6-4BE0-9C22-3D8BD675AD48",
    "DataProviderID": 2,
    "DataProvidersReference": "116944",
    "OperatorID": 5,
    "UsageTypeID": 1,
    "AddressInfo": {
        "ID": 138818,
        "Title": "THE PARK-GARAGE",
        "AddressLine1": "3711 S MoPac Expy",
        "Town": "Austin",
        "StateOrProvince": "TX",
        "Postcode": "78746",
        "CountryID": 2,
        "Latitude": 30.2460067,
        "Longitude": -97.8046215,
        "ContactTelephone1": "888-758-4389",
        "AccessComments": "24 hours daily",
        "RelatedURL": "http://www.chargepoint.com/",
        "DistanceUnit": 0
    },
    "Connections": [
        {
            "ID": 193592,
            "ConnectionTypeID": 1,
            "LevelID": 2,
            "Amps": 16,
            "Voltage": 230,
            "PowerKW": 3,
            "CurrentTypeID": 10,
            "Quantity": 4
        }
    ],
    "StatusTypeID": 50,
    "DateLastStatusUpdate": "2019-12-24T09:08:00Z",
    "DataQualityLevel": 3,
    "DateCreated": "2019-12-24T09:08:00Z",
    "SubmissionStatusTypeID": 100
}