{
    "MediaItems": [
        {
            "ID": 12231,
            "ChargePointID": 87955,
            "ItemURL": "https://s3-ap-southeast-2.amazonaws.com/openchargemap/images/NZ/OCM87955/OCM-87955.orig.2017051811482865.png",
            "ItemThumbnailURL": "https://s3-ap-southeast-2.amazonaws.com/openchargemap/images/NZ/OCM87955/OCM-87955.thmb.2017051811482865.png",
            "Comment": "",
            "IsEnabled": true,
            "IsVideo": false,
            "IsFeaturedItem": false,
            "IsExternalResource": false,
            "User": {
                "ID": 15365,
                "Username": "sliday"
            },
            "DateCreated": "2017-05-18T11:49:00Z"
        }
    ],
    "IsRecentlyVerified": false,
    "ID": 87955,
    "UUID": "7EB919F7-2467-4D2C-9142-42F57A436724",
    "DataProviderID": 1,
    "UsageCost": "$2.50/hr",
    "AddressInfo": {
        "ID": 88301,
        "Title": "Palmerston North Holiday Park",
        "AddressLine1": "133 Dittmer Dr, West End",
        "Town": "Palmerston North",
        "Postcode": "4410",
        "CountryID": 161,
        "Latitude": -40.371476,
        "Longitude": 175.6084972,
        "ContactTelephone1": "063580349",
        "DistanceUnit": 0
    },
    "Connections": [
        {
            "ID": 124771,
            "ConnectionTypeID": 4
        }
    ],
    "NumberOfPoints": 1,
    "GeneralComments": "$2.50/hr daytime (power only; pls pay full rate if you want to use facilities)\r\n8am till 6pm\r\nSeveral powered sites available for daytime car charging, during Office opening hours (8am till 6pm) River and esplanade nearby for walking along while you wait. http://www.palmerstonnorthholidaypark.co.nz",
    "StatusTypeID": 50,
    "DateLastStatusUpdate": "2017-05-18T11:49:00Z",
    "DataQualityLevel": 1,
    "DateCreated": "2017-05-18T11:48:00Z",
    "SubmissionStatusTypeID": 200
}