{
    "IsRecentlyVerified": false,
    "ID": 57859,
    "UUID": "34B9071F-B2F0-4E88-9C94-08A023E8AA5B",
    "DataProviderID": 1,
    "DataProvidersReference": "3123",
    "AddressInfo": {
        "ID": 58205,
        "Title": "Tunturikeskus Galdotieva",
        "AddressLine1": "Ruijantie 2591",
        "Town": "Leppäjärvi",
        "StateOrProvince": "Lappi",
        "Postcode": "99440",
        "CountryID": 79,
        "Latitude": 68.570581,
        "Longitude": 23.335229,
        "AccessComments": "Hotellin tai ravintolan parkkialueella tai -hallissa",
        "DistanceUnit": 0
    },
    "Connections": [
        {
            "ID": 73322,
            "ConnectionTypeID": 0,
            "Reference": "1",
            "LevelID": 2,
            "Amps": 32,
            "Voltage": 400,
            "PowerKW": 22,
            "Comments": "Mode 3"
        },
        {
            "ID": 89539,
            "ConnectionTypeID": 0,
            "Reference": "2",
            "LevelID": 2,
            "Amps": 32,
            "Voltage": 400,
            "PowerKW": 22,
            "Comments": "Mode 3"
        }
    ],
    "NumberOfPoints": 2,
    "DateLastStatusUpdate": "2020-05-26T08:25:00Z",
    "DataQualityLevel": 2,
    "DateCreated": "2015-12-26T11:12:00Z",
    "SubmissionStatusTypeID": 100
}