{
    "IsRecentlyVerified": false,
    "ID": 80311,
    "UUID": "B0628264-87A8-4D4D-9673-A38453973D21",
    "DataProviderID": 2,
    "DataProvidersReference": "80910",
    "OperatorID": 5,
    "UsageTypeID": 1,
    "AddressInfo": {
        "ID": 80657,
        "Title": "NRD 1",
        "AddressLine1": "8901 S 154th St",
        "Town": "Omaha",
        "StateOrProvince": "NE",
        "Postcode": "68138",
        "CountryID": 2,
        "Latitude": 41.1714245,
        "Longitude": -96.1558033,
        "ContactTelephone1": "888-758-4389",
        "AccessComments": "24 hours daily",
        "RelatedURL": "http://www.chargepoint.com/",
        "DistanceUnit": 0
    },
    "Connections": [
        {
            "ID": 114985,
            "ConnectionTypeID": 1,
            "LevelID": 2,
            "Amps": 16,
            "Voltage": 230,
            "PowerKW": 3.7,
            "CurrentTypeID": 10,
            "Quantity": 2
        }
    ],
    "DateLastStatusUpdate": "2020-06-26T03:04:00Z",
    "DataQualityLevel": 3,
    "DateCreated": "2017-01-31T01:05:00Z",
    "SubmissionStatusTypeID": 100
}