{
    "IsRecentlyVerified": false,
    "ID": 52527,
    "UUID": "9606CB06-0CB5-4980-820A-CBF6C1128014",
    "DataProviderID": 1,
    "OperatorID": 45,
    "UsageTypeID": 1,
    "UsageCost": "0",
    "AddressInfo": {
        "ID": 52873,
        "Title": "Autohaus bhg",
        "AddressLine1": "Lange Straße 45",
        "Town": "Balingen",
        "StateOrProvince": "Zollernalbkreis",
        "Postcode": "72336",
        "CountryID": 87,
        "Latitude": 48.2582448787109,
        "Longitude": 8.85016644180292,
        "ContactTelephone1": "07433/993900",
        "AccessComments": "Kostenloses 24/7 Laden am Volkswagen Autohaus. Montiert sind 2 eStations mit Kabel und Typ2 Steckern, die an der Gebäudeecke montiert sind.  Leicht zu finden durch das große Steckdosenplakat und die Blechüberdachung der eStations.",
        "RelatedURL": "http://www.bhg-mobile.de/",
        "DistanceUnit": 0
    },
    "Connections": [
        {
            "ID": 65227,
            "ConnectionTypeID": 25,
            "StatusTypeID": 50,
            "LevelID": 2,
            "Amps": 16,
            "Voltage": 230,
            "PowerKW": 3.7,
            "CurrentTypeID": 10,
            "Quantity": 2
        }
    ],
    "NumberOfPoints": 2,
    "GeneralComments": "Fest montiertes Kabel mit Typ2 Stecker!",
    "StatusTypeID": 50,
    "DateLastStatusUpdate": "2015-09-02T11:15:00Z",
    "DataQualityLevel": 1,
    "DateCreated": "2015-09-02T05:49:00Z",
    "SubmissionStatusTypeID": 200
}