{
    "UserComments": [
        {
            "ID": 11687,
            "ChargePointID": 65599,
            "CommentTypeID": 50,
            "UserName": "Sordone",
            "Comment": "Chargers are behind a gate, it seems only for company users and not publicly available.",
            "DateCreated": "2016-06-23T17:04:06.207Z",
            "User": {
                "ID": 6216,
                "Username": "Sordone"
            },
            "CheckinStatusTypeID": 140
        }
    ],
    "IsRecentlyVerified": false,
    "ID": 65599,
    "UUID": "5F3D9C7C-B778-4469-B979-0BEB9F77B901",
    "DataProviderID": 1,
    "OperatorID": 157,
    "OperatorsReference": "NewMotion 03005804",
    "UsageTypeID": 6,
    "UsageCost": "0.00 jaarabonnement",
    "AddressInfo": {
        "ID": 65945,
        "Title": "Darwinstraat 31B",
        "AddressLine1": "Darwinstraat 31B",
        "Town": "Ede",
        "Postcode": "6718 XR",
        "CountryID": 159,
        "Latitude": 52.031098,
        "Longitude": 5.6079207,
        "ContactTelephone1": "088 0109500",
        "RelatedURL": "http://thenewmotion.nl/",
        "DistanceUnit": 0
    },
    "Connections": [
        {
            "ID": 90498,
            "ConnectionTypeID": 25,
            "LevelID": 2,
            "PowerKW": 22,
            "CurrentTypeID": 10
        },
        {
            "ID": 90499,
            "ConnectionTypeID": 25,
            "LevelID": 2,
            "PowerKW": 22,
            "CurrentTypeID": 10
        },
        {
            "ID": 90500,
            "ConnectionTypeID": 25,
            "LevelID": 2,
            "PowerKW": 22,
            "CurrentTypeID": 10
        },
        {
            "ID": 90501,
            "ConnectionTypeID": 25,
            "LevelID": 2,
            "PowerKW": 22,
            "CurrentTypeID": 10
        },
        {
            "ID": 90502,
            "ConnectionTypeID": 25,
            "LevelID": 2,
            "PowerKW": 22,
            "CurrentTypeID": 10
        },
        {
            "ID": 90503,
            "ConnectionTypeID": 25,
            "LevelID": 2,
            "PowerKW": 22,
            "CurrentTypeID": 10
        }
    ],
    "NumberOfPoints": 1,
    "StatusTypeID": 50,
    "DateLastStatusUpdate": "2016-06-23T23:10:00Z",
    "DataQualityLevel": 3,
    "DateCreated": "2016-04-27T09:41:00Z",
    "SubmissionStatusTypeID": 100
}