{
    "IsRecentlyVerified": false,
    "ID": 44485,
    "UUID": "5DD7841F-B657-4FC7-8385-5A6A617FF4F3",
    "DataProviderID": 1,
    "OperatorID": 45,
    "OperatorsReference": "PG-90822",
    "UsageTypeID": 6,
    "UsageCost": "Free",
    "AddressInfo": {
        "ID": 44831,
        "Title": "Chorley Nissan Blackpool",
        "AddressLine1": "Amy Johnson Way",
        "Town": "Blackpool",
        "Postcode": "FY4 2RP",
        "CountryID": 1,
        "Latitude": 53.777192,
        "Longitude": -3.031687,
        "ContactTelephone1": "+44 1253 298833",
        "RelatedURL": "http://www.chorley-nissan.co.uk/nissan-blackpool.asp",
        "DistanceUnit": 0
    },
    "Connections": [
        {
            "ID": 54638,
            "ConnectionTypeID": 1036,
            "StatusTypeID": 50,
            "LevelID": 3,
            "PowerKW": 43,
            "CurrentTypeID": 20,
            "Quantity": 1
        },
        {
            "ID": 159923,
            "ConnectionTypeID": 2,
            "StatusTypeID": 50,
            "LevelID": 3,
            "PowerKW": 50,
            "CurrentTypeID": 30,
            "Quantity": 1
        },
        {
            "ID": 159924,
            "ConnectionTypeID": 33,
            "StatusTypeID": 50,
            "LevelID": 3,
            "PowerKW": 50,
            "CurrentTypeID": 30,
            "Quantity": 1
        }
    ],
    "NumberOfPoints": 1,
    "StatusTypeID": 50,
    "DateLastStatusUpdate": "2018-12-16T14:01:00Z",
    "DataQualityLevel": 1,
    "DateCreated": "2015-04-13T07:42:00Z",
    "SubmissionStatusTypeID": 200
}