{
    "IsRecentlyVerified": false,
    "ID": 97646,
    "UUID": "7C768D42-DFFE-4EF5-A6B8-D4C464915079",
    "DataProviderID": 1,
    "OperatorID": 23,
    "OperatorsReference": "39827",
    "UsageTypeID": 4,
    "AddressInfo": {
        "ID": 97992,
        "Title": "Central Parking 200 Chambers",
        "AddressLine1": "200 Chambers St",
        "Town": "New York",
        "StateOrProvince": "New York",
        "Postcode": "10007",
        "CountryID": 2,
        "Latitude": 40.716256,
        "Longitude": -74.012543,
        "ContactTelephone1": "(800) 836-6666",
        "DistanceUnit": 0
    },
    "Connections": [
        {
            "ID": 138554,
            "ConnectionTypeID": 30,
            "StatusTypeID": 50,
            "LevelID": 2,
            "PowerKW": 8,
            "CurrentTypeID": 10,
            "Quantity": 2
        }
    ],
    "NumberOfPoints": 2,
    "GeneralComments": "2 Tesla Connectors, up to 8kW.Parking fees will apply. Please see valet.",
    "StatusTypeID": 50,
    "DateLastStatusUpdate": "2018-01-21T15:58:00Z",
    "DataQualityLevel": 1,
    "DateCreated": "2018-01-21T15:58:00Z",
    "SubmissionStatusTypeID": 200
}