{
    "IsRecentlyVerified": false,
    "ID": 141478,
    "UUID": "2E496C56-D42C-46BA-99E3-E8DA013FCDAE",
    "DataProviderID": 2,
    "DataProvidersReference": "68213",
    "OperatorID": 5,
    "UsageTypeID": 1,
    "AddressInfo": {
        "ID": 141830,
        "Title": "EVERGY",
        "AddressLine1": "15000 W 87th St Pkwy @ Hen House Market",
        "Town": "Lenexa",
        "StateOrProvince": "KS",
        "Postcode": "66219",
        "CountryID": 2,
        "Latitude": 38.9724557,
        "Longitude": -94.7606477,
        "ContactTelephone1": "888-758-4389",
        "AccessComments": "24 hours daily",
        "RelatedURL": "http://www.chargepoint.com/",
        "DistanceUnit": 0
    },
    "Connections": [
        {
            "ID": 197413,
            "ConnectionTypeID": 2,
            "LevelID": 3,
            "Amps": 100,
            "Voltage": 400,
            "PowerKW": 40,
            "CurrentTypeID": 30,
            "Quantity": 1
        },
        {
            "ID": 197414,
            "ConnectionTypeID": 32,
            "LevelID": 3,
            "Amps": 100,
            "Voltage": 400,
            "PowerKW": 40,
            "CurrentTypeID": 30,
            "Quantity": 1
        }
    ],
    "StatusTypeID": 50,
    "DateLastStatusUpdate": "2020-06-26T03:01:00Z",
    "DataQualityLevel": 3,
    "DateCreated": "2019-12-24T09:15:00Z",
    "SubmissionStatusTypeID": 100
}