{
    "IsRecentlyVerified": false,
    "ID": 68214,
    "UUID": "6BC59956-594C-48D0-ABA5-938FE30E586E",
    "DataProviderID": 26,
    "DataProvidersReference": "92318",
    "OperatorID": 177,
    "OperatorsReference": "Nuon EVB-P1607236",
    "UsageCost": "0.00 jaarabonnement",
    "AddressInfo": {
        "ID": 68560,
        "Title": "James Bradleystraat 21",
        "AddressLine1": "James Bradleystraat 21",
        "Town": "Amsterdam",
        "Postcode": "1086 ZM",
        "CountryID": 159,
        "Latitude": 52.359908,
        "Longitude": 4.98025,
        "RelatedURL": "http://www.nuon.nl/ev",
        "DistanceUnit": 0
    },
    "Connections": [
        {
            "ID": 95070,
            "ConnectionTypeID": 25,
            "LevelID": 2,
            "PowerKW": 11,
            "CurrentTypeID": 10
        },
        {
            "ID": 95071,
            "ConnectionTypeID": 25,
            "LevelID": 2,
            "PowerKW": 11,
            "CurrentTypeID": 10
        }
    ],
    "NumberOfPoints": 1,
    "StatusTypeID": 50,
    "DateLastStatusUpdate": "2016-06-04T02:37:00Z",
    "DataQualityLevel": 3,
    "DateCreated": "2016-06-04T02:37:00Z",
    "SubmissionStatusTypeID": 100
}