{
    "IsRecentlyVerified": false,
    "ID": 139984,
    "UUID": "DDFFC79B-3D19-4764-BAC7-943F64C34275",
    "DataProviderID": 2,
    "DataProvidersReference": "144236",
    "OperatorID": 59,
    "UsageTypeID": 1,
    "AddressInfo": {
        "ID": 140336,
        "Title": "Greenlots - 12267A",
        "AddressLine1": "7760 N WOODMAN AVE",
        "Town": "Los Angeles",
        "StateOrProvince": "CA",
        "Postcode": "91402",
        "CountryID": 2,
        "Latitude": 34.2116355895996,
        "Longitude": -118.430770874023,
        "ContactTelephone1": "855-900-7584",
        "AccessComments": "24 hours daily",
        "RelatedURL": "http://greenlots.com/",
        "DistanceUnit": 0
    },
    "Connections": [
        {
            "ID": 195494,
            "ConnectionTypeID": 1,
            "LevelID": 2,
            "Amps": 16,
            "Voltage": 230,
            "PowerKW": 3.7,
            "CurrentTypeID": 10,
            "Quantity": 1
        }
    ],
    "StatusTypeID": 50,
    "DateLastStatusUpdate": "2020-06-26T02:57:00Z",
    "DataQualityLevel": 3,
    "DateCreated": "2019-12-24T09:11:00Z",
    "SubmissionStatusTypeID": 100
}