{
    "IsRecentlyVerified": false,
    "ID": 173577,
    "UUID": "DF88F1BC-3032-4A44-9DEF-8AC3D92EB667",
    "DataProviderID": 18,
    "DataProvidersReference": "ca85a11d2dbe4fc87e143ec7460581ab",
    "OperatorID": 2244,
    "UsageTypeID": 5,
    "AddressInfo": {
        "ID": 173936,
        "Title": "15 Loudoun Road",
        "AddressLine1": "15 Loudoun Road",
        "Town": "London",
        "Postcode": "NW8 0LS",
        "CountryID": 1,
        "Latitude": 51.535776,
        "Longitude": -0.178692,
        "AccessComments": "",
        "RelatedURL": "https://www.ubitricity.com",
        "DistanceUnit": 0
    },
    "Connections": [
        {
            "ID": 266646,
            "ConnectionTypeID": 25,
            "Reference": "suby1100006178",
            "StatusTypeID": 50,
            "LevelID": 2,
            "Amps": 16,
            "Voltage": 230,
            "PowerKW": 3.7,
            "CurrentTypeID": 10
        }
    ],
    "StatusTypeID": 0,
    "DateLastStatusUpdate": "2021-04-25T05:46:00Z",
    "MetadataValues": [
        {
            "ID": 8499,
            "MetadataFieldID": 4,
            "ItemValue": "Contains public sector information licensed under the Open Government Licence v2.0. http://www.nationalarchives.gov.uk/doc/open-government-licence/version/2/"
        }
    ],
    "DataQualityLevel": 3,
    "DateCreated": "2021-03-03T11:25:00Z",
    "SubmissionStatusTypeID": 100
}