{
    "IsRecentlyVerified": false,
    "ID": 130052,
    "UUID": "803DCBCD-8C0C-4438-B97B-1F729BF31BD9",
    "DataProviderID": 1,
    "OperatorID": 3299,
    "UsageTypeID": 1,
    "AddressInfo": {
        "ID": 130398,
        "Title": "IONITY Mondsee",
        "AddressLine1": "Rastanlage Mondsee, Warte am See 28, 5311 Innerschwand am Mondsee, Österreich",
        "Town": "Innerschwand am Mondsee",
        "Postcode": "5311",
        "CountryID": 19,
        "Latitude": 47.836676,
        "Longitude": 13.395779,
        "DistanceUnit": 0
    },
    "Connections": [
        {
            "ID": 182043,
            "ConnectionTypeID": 33,
            "LevelID": 2,
            "PowerKW": 350
        }
    ],
    "NumberOfPoints": 6,
    "StatusTypeID": 50,
    "DateLastStatusUpdate": "2019-07-31T10:27:00Z",
    "DataQualityLevel": 1,
    "DateCreated": "2019-07-30T12:56:00Z",
    "SubmissionStatusTypeID": 200
}