{
    "IsRecentlyVerified": false,
    "ID": 169690,
    "UUID": "D1A990C4-3D29-43F1-907C-CE0A866933EC",
    "DataProviderID": 1,
    "OperatorID": 3,
    "OperatorsReference": "PG-70330,PG-85199",
    "UsageTypeID": 4,
    "UsageCost": "Free",
    "AddressInfo": {
        "ID": 170049,
        "Title": "Tesco Superstore",
        "AddressLine1": "Cherry Holt Rd",
        "Town": "Bourne",
        "StateOrProvince": "England",
        "Postcode": "PE10 9LS",
        "CountryID": 1,
        "Latitude": 52.759969742018,
        "Longitude": -0.36653483385021,
        "AccessComments": "Store: Mon-Sat 6am-Midnight, Sun 10am-4pm",
        "RelatedURL": "https://charge.pod-point.com/",
        "DistanceUnit": 0
    },
    "Connections": [
        {
            "ID": 258404,
            "ConnectionTypeID": 25,
            "StatusTypeID": 50,
            "LevelID": 2,
            "Amps": 32,
            "Voltage": 230,
            "PowerKW": 7,
            "CurrentTypeID": 10,
            "Quantity": 4
        }
    ],
    "NumberOfPoints": 4,
    "GeneralComments": "Twin 7kW Pod Points, Myer-Cody & Kent-Erin",
    "StatusTypeID": 50,
    "DateLastStatusUpdate": "2021-03-16T06:20:00Z",
    "DataQualityLevel": 1,
    "DateCreated": "2020-10-31T15:41:00Z",
    "SubmissionStatusTypeID": 200
}