{
    "IsRecentlyVerified": false,
    "ID": 63089,
    "UUID": "67CD3D0A-3A8F-4ACC-B2B7-85F8E79C0094",
    "DataProviderID": 26,
    "DataProvidersReference": "72936",
    "OperatorID": 73,
    "OperatorsReference": "EV-Box EVB-P1426176",
    "UsageCost": "0.00 jaarabonnement",
    "AddressInfo": {
        "ID": 63435,
        "Title": "Kreekweg 10",
        "AddressLine1": "Kreekweg 10",
        "Town": "Zwijndrecht",
        "Postcode": "3336 LC",
        "CountryID": 159,
        "Latitude": 51.80966,
        "Longitude": 4.62331,
        "RelatedURL": "http://www.ev-box.nl",
        "DistanceUnit": 0
    },
    "Connections": [
        {
            "ID": 80221,
            "ConnectionTypeID": 25,
            "LevelID": 2,
            "PowerKW": 5,
            "CurrentTypeID": 10
        }
    ],
    "NumberOfPoints": 1,
    "StatusTypeID": 50,
    "DateLastStatusUpdate": "2016-06-04T02:40:00Z",
    "DataQualityLevel": 3,
    "DateCreated": "2016-03-03T12:29:00Z",
    "SubmissionStatusTypeID": 100
}