{
    "MediaItems": [
        {
            "ID": 28094,
            "ChargePointID": 175699,
            "ItemURL": "https://s3-ap-southeast-2.amazonaws.com/openchargemap/images/IT/OCM175699/OCM-175699.orig.2021061110351287.jpg",
            "ItemThumbnailURL": "https://s3-ap-southeast-2.amazonaws.com/openchargemap/images/IT/OCM175699/OCM-175699.thmb.2021061110351287.jpg",
            "Comment": "",
            "IsEnabled": true,
            "IsVideo": false,
            "IsFeaturedItem": false,
            "IsExternalResource": false,
            "User": {
                "ID": 18556,
                "Username": "GMT"
            },
            "DateCreated": "2021-06-11T10:35:00Z"
        }
    ],
    "IsRecentlyVerified": false,
    "ID": 175699,
    "UUID": "A8990570-227C-4C26-AB9D-E133C0845C3F",
    "DataProviderID": 1,
    "OperatorID": 3328,
    "UsageTypeID": 4,
    "UsageCost": "0,50",
    "AddressInfo": {
        "ID": 176058,
        "Title": "Ital Green Energy",
        "AddressLine1": "Via Baione, 200",
        "Town": "Monopoli",
        "StateOrProvince": "Apulia",
        "Postcode": "70043",
        "CountryID": 112,
        "Latitude": 40.95988072600508,
        "Longitude": 17.260720500609068,
        "RelatedURL": "http://gruppomarseglia.it/",
        "DistanceUnit": 0
    },
    "Connections": [
        {
            "ID": 272821,
            "ConnectionTypeID": 33,
            "StatusTypeID": 50,
            "LevelID": 3,
            "PowerKW": 50,
            "CurrentTypeID": 30,
            "Quantity": 2
        },
        {
            "ID": 272822,
            "ConnectionTypeID": 2,
            "StatusTypeID": 50,
            "LevelID": 3,
            "PowerKW": 50,
            "CurrentTypeID": 30,
            "Quantity": 2
        },
        {
            "ID": 272823,
            "ConnectionTypeID": 25,
            "StatusTypeID": 50,
            "LevelID": 2,
            "PowerKW": 22,
            "CurrentTypeID": 20,
            "Quantity": 1
        },
        {
            "ID": 272824,
            "ConnectionTypeID": 1036,
            "StatusTypeID": 50,
            "LevelID": 3,
            "PowerKW": 43,
            "CurrentTypeID": 20,
            "Quantity": 2
        }
    ],
    "NumberOfPoints": 3,
    "StatusTypeID": 50,
    "DateLastStatusUpdate": "2021-08-03T13:04:00Z",
    "DataQualityLevel": 1,
    "DateCreated": "2021-06-07T13:07:00Z",
    "SubmissionStatusTypeID": 200
}