{
    "IsRecentlyVerified": false,
    "ID": 184458,
    "UUID": "03F5D662-83D6-4995-B68E-D62C70F4F5A6",
    "DataProviderID": 29,
    "DataProvidersReference": "9729",
    "OperatorID": 3403,
    "AddressInfo": {
        "ID": 184817,
        "Title": "Möllner Straße 42",
        "AddressLine1": "Möllner Straße 42",
        "Town": "Schwarzenbek",
        "Postcode": "21493",
        "CountryID": 87,
        "Latitude": 53.510095,
        "Longitude": 10.487616,
        "DistanceUnit": 0
    },
    "Connections": [
        {
            "ID": 292769,
            "ConnectionTypeID": 25,
            "StatusTypeID": 50,
            "LevelID": 2,
            "PowerKW": 22,
            "CurrentTypeID": 20
        },
        {
            "ID": 292770,
            "ConnectionTypeID": 25,
            "StatusTypeID": 50,
            "LevelID": 2,
            "PowerKW": 22,
            "CurrentTypeID": 20
        }
    ],
    "StatusTypeID": 50,
    "DateLastStatusUpdate": "2021-07-12T02:51:00Z",
    "MetadataValues": [
        {
            "ID": 16749,
            "MetadataFieldID": 4,
            "ItemValue": "Data from the German chargepoint registry provided by Bundesnetzagentur.de under the CC-BY 4.0 license"
        }
    ],
    "DataQualityLevel": 3,
    "DateCreated": "2021-07-08T10:05:00Z",
    "SubmissionStatusTypeID": 100
}