{
    "IsRecentlyVerified": false,
    "ID": 154163,
    "UUID": "F873C711-AE13-4BE7-B8FD-6A6497FD7EF9",
    "DataProviderID": 28,
    "DataProvidersReference": "FR*S60*PCREILCARNOT",
    "OperatorID": 3379,
    "UsageTypeID": 5,
    "AddressInfo": {
        "ID": 154516,
        "Title": "Creil, place Carnot",
        "AddressLine1": "Place Carnot 60100 Creil",
        "CountryID": 80,
        "Latitude": 49.2623,
        "Longitude": 2.47148,
        "AccessComments": "24h/24 7j/7",
        "DistanceUnit": 0
    },
    "Connections": [
        {
            "ID": 216677,
            "ConnectionTypeID": 1036,
            "StatusTypeID": 50,
            "LevelID": 2,
            "PowerKW": 22,
            "CurrentTypeID": 20
        },
        {
            "ID": 251038,
            "ConnectionTypeID": 1036,
            "StatusTypeID": 50,
            "LevelID": 2,
            "PowerKW": 22,
            "CurrentTypeID": 20
        }
    ],
    "GeneralComments": "",
    "StatusTypeID": 50,
    "DateLastStatusUpdate": "2020-08-27T05:16:00Z",
    "DataQualityLevel": 2,
    "DateCreated": "2020-03-15T10:55:00Z",
    "SubmissionStatusTypeID": 100
}