{
    "IsRecentlyVerified": false,
    "ID": 66750,
    "UUID": "672EBF2A-8474-4DFC-A5D8-2DD371D11F10",
    "DataProviderID": 1,
    "OperatorID": 23,
    "OperatorsReference": "13883",
    "UsageTypeID": 1,
    "UsageCost": "Free",
    "AddressInfo": {
        "ID": 67096,
        "Title": "24 North Hotel - Tesla",
        "AddressLine1": "3820 N Roosevelt Blvd",
        "Town": "Key West",
        "StateOrProvince": "FL",
        "Postcode": "33040",
        "CountryID": 2,
        "Latitude": 24.571342,
        "Longitude": -81.75516,
        "ContactTelephone1": "305-320-0940  877-798-3752",
        "AccessComments": "24 hours daily; for Tesla use only; see front desk for access",
        "RelatedURL": "http://www.teslamotors.com/supercharger",
        "DistanceUnit": 0
    },
    "Connections": [
        {
            "ID": 92236,
            "ConnectionTypeID": 30,
            "StatusTypeID": 50,
            "LevelID": 2,
            "Amps": 16,
            "Voltage": 230,
            "PowerKW": 16,
            "CurrentTypeID": 10,
            "Quantity": 2
        }
    ],
    "NumberOfPoints": 2,
    "StatusTypeID": 50,
    "DateLastStatusUpdate": "2017-01-31T18:02:00Z",
    "DataQualityLevel": 3,
    "DateCreated": "2016-05-29T02:04:00Z",
    "SubmissionStatusTypeID": 100
}