{
    "IsRecentlyVerified": false,
    "ID": 33374,
    "UUID": "E1126E21-391F-4EE9-80B3-24446A279C7E",
    "DataProviderID": 26,
    "DataProvidersReference": "48448",
    "OperatorID": 178,
    "OperatorsReference": "EVnetNL PNB-REE0103",
    "UsageCost": "0.00 jaarabonnement",
    "AddressInfo": {
        "ID": 33720,
        "Title": "Bloemenblauwtje 1",
        "AddressLine1": "Bloemenblauwtje 1",
        "Town": "Breda",
        "Postcode": "4814 TS",
        "CountryID": 159,
        "Latitude": 51.58754,
        "Longitude": 4.745755,
        "ContactTelephone1": "0800-3522365",
        "RelatedURL": "http://www.evnet.nl",
        "DistanceUnit": 0
    },
    "Connections": [
        {
            "ID": 36885,
            "ConnectionTypeID": 25,
            "LevelID": 1,
            "PowerKW": 2.3,
            "CurrentTypeID": 10
        }
    ],
    "NumberOfPoints": 1,
    "StatusTypeID": 50,
    "DateLastStatusUpdate": "2016-06-04T02:39:00Z",
    "DataQualityLevel": 3,
    "DateCreated": "2015-01-09T06:04:00Z",
    "SubmissionStatusTypeID": 100
}