{
    "IsRecentlyVerified": false,
    "ID": 101637,
    "UUID": "85D9784A-BCB3-4879-B998-83BCD157D762",
    "DataProviderID": 1,
    "OperatorID": 45,
    "UsageTypeID": 3,
    "AddressInfo": {
        "ID": 101983,
        "Title": "Jasto Baustoffwerke",
        "AddressLine1": "Vulkanstraße",
        "Town": "Ochtendung",
        "StateOrProvince": "Maifeld",
        "Postcode": "56299",
        "CountryID": 87,
        "Latitude": 50.35265335774528,
        "Longitude": 7.404099560852046,
        "AccessComments": "\r\n",
        "DistanceUnit": 0
    },
    "Connections": [
        {
            "ID": 143480,
            "ConnectionTypeID": 25,
            "StatusTypeID": 50,
            "LevelID": 2,
            "Amps": 32,
            "Voltage": 400,
            "PowerKW": 22,
            "CurrentTypeID": 20,
            "Quantity": 1
        },
        {
            "ID": 143481,
            "ConnectionTypeID": 28,
            "StatusTypeID": 50,
            "LevelID": 2,
            "Amps": 16,
            "Voltage": 230,
            "PowerKW": 3.7,
            "CurrentTypeID": 10,
            "Quantity": 3
        }
    ],
    "NumberOfPoints": 4,
    "StatusTypeID": 50,
    "DateLastStatusUpdate": "2018-04-03T10:15:00Z",
    "DataQualityLevel": 1,
    "DateCreated": "2018-04-03T10:15:00Z",
    "SubmissionStatusTypeID": 200
}