{
    "IsRecentlyVerified": false,
    "ID": 143289,
    "UUID": "E188B8C1-63B4-4D49-BB2E-D093A546C0CD",
    "DataProviderID": 2,
    "DataProvidersReference": "103530",
    "OperatorID": 5,
    "UsageTypeID": 1,
    "AddressInfo": {
        "ID": 143641,
        "Title": "RPI 1",
        "AddressLine1": "2 Colvin Cir",
        "Town": "Troy",
        "StateOrProvince": "NY",
        "Postcode": "12180",
        "CountryID": 2,
        "Latitude": 42.7313864,
        "Longitude": -73.6690861,
        "ContactTelephone1": "888-758-4389",
        "AccessComments": "24 hours daily",
        "RelatedURL": "http://www.chargepoint.com/",
        "DistanceUnit": 0
    },
    "Connections": [
        {
            "ID": 199585,
            "ConnectionTypeID": 1,
            "LevelID": 2,
            "Amps": 16,
            "Voltage": 230,
            "PowerKW": 3,
            "CurrentTypeID": 10,
            "Quantity": 2
        }
    ],
    "StatusTypeID": 50,
    "DateLastStatusUpdate": "2019-12-24T09:20:00Z",
    "DataQualityLevel": 3,
    "DateCreated": "2019-12-24T09:20:00Z",
    "SubmissionStatusTypeID": 100
}