{
    "IsRecentlyVerified": false,
    "ID": 136516,
    "UUID": "DF7DDB05-6B94-4ECA-AACC-DC916789AC64",
    "DataProviderID": 18,
    "DataProvidersReference": "197fa5ee76368bb7cb32470431f30d9b",
    "OperatorID": 2244,
    "UsageTypeID": 5,
    "AddressInfo": {
        "ID": 136862,
        "Title": "Bayston Road",
        "AddressLine1": "Bayston Road",
        "Town": "London",
        "Postcode": "N16 7LU",
        "CountryID": 1,
        "Latitude": 51.557799,
        "Longitude": -0.071327,
        "AccessComments": "",
        "RelatedURL": "https://www.ubitricity.com",
        "DistanceUnit": 0
    },
    "Connections": [
        {
            "ID": 190966,
            "ConnectionTypeID": 25,
            "Reference": "suby1100002618",
            "StatusTypeID": 50,
            "LevelID": 2,
            "Amps": 16,
            "Voltage": 230,
            "PowerKW": 3.7,
            "CurrentTypeID": 10
        }
    ],
    "StatusTypeID": 0,
    "DateLastStatusUpdate": "2021-04-25T05:46:00Z",
    "MetadataValues": [
        {
            "ID": 6368,
            "MetadataFieldID": 4,
            "ItemValue": "Contains public sector information licensed under the Open Government Licence v2.0. http://www.nationalarchives.gov.uk/doc/open-government-licence/version/2/"
        }
    ],
    "DataQualityLevel": 3,
    "DateCreated": "2019-12-24T05:22:00Z",
    "SubmissionStatusTypeID": 100
}