{
    "IsRecentlyVerified": false,
    "ID": 61097,
    "UUID": "1C082333-CD89-484E-B97A-8B2BEAC9E26A",
    "DataProviderID": 27,
    "DataProvidersReference": "215",
    "UsageTypeID": 1,
    "AddressInfo": {
        "ID": 61443,
        "Title": "Parking Sol de las Moreras",
        "AddressLine1": "Calle Sol de las Moreras, 30",
        "Town": "Aranda de Duero",
        "StateOrProvince": "Burgos",
        "Postcode": "09400",
        "CountryID": 210,
        "Latitude": 41.669473,
        "Longitude": -3.682597,
        "ContactTelephone1": "+34 947 50 90 23",
        "DistanceUnit": 0
    },
    "Connections": [
        {
            "ID": 77683,
            "ConnectionTypeID": 28
        },
        {
            "ID": 77684,
            "ConnectionTypeID": 28
        }
    ],
    "StatusTypeID": 50,
    "DateLastStatusUpdate": "2016-02-13T00:24:00Z",
    "DataQualityLevel": 3,
    "DateCreated": "2016-02-13T00:24:00Z",
    "SubmissionStatusTypeID": 200
}