{
    "IsRecentlyVerified": false,
    "ID": 161824,
    "UUID": "96CF54A8-E0B3-4B5E-B4EF-B0CAE36F8B1A",
    "DataProviderID": 1,
    "OperatorID": 1,
    "UsageTypeID": 6,
    "AddressInfo": {
        "ID": 162181,
        "Title": "Anthemion Suites & Villas",
        "AddressLine1": "25th March St. & Agiou Eleftheriou",
        "Town": "Argolis Regional Unit",
        "StateOrProvince": "Argolis Regional Unit",
        "Postcode": "21100",
        "CountryID": 90,
        "Latitude": 37.56251403521382,
        "Longitude": 22.817041664944327,
        "ContactTelephone1": "+30 27520 22912",
        "ContactEmail": "info@anthemion.gr",
        "RelatedURL": "https://anthemion.gr",
        "DistanceUnit": 0
    },
    "Connections": [
        {
            "ID": 232850,
            "ConnectionTypeID": 25,
            "StatusTypeID": 50,
            "LevelID": 2,
            "Amps": 32,
            "Voltage": 400,
            "PowerKW": 22,
            "CurrentTypeID": 20,
            "Quantity": 1
        }
    ],
    "NumberOfPoints": 1,
    "StatusTypeID": 50,
    "DateLastStatusUpdate": "2020-07-26T08:54:00Z",
    "DataQualityLevel": 1,
    "DateCreated": "2020-07-25T20:10:00Z",
    "SubmissionStatusTypeID": 200
}