{
    "IsRecentlyVerified": false,
    "ID": 116527,
    "UUID": "98167C8D-09E5-4FDA-8142-02243F82E444",
    "DataProviderID": 1,
    "DataProvidersReference": "5091",
    "AddressInfo": {
        "ID": 116873,
        "Title": "Diös Frittzhemsgatan",
        "AddressLine1": "Fritzhemsgatan 1A",
        "Town": "FRÖSÖN",
        "StateOrProvince": "JÄMTLAND",
        "Postcode": "83242",
        "CountryID": 216,
        "Latitude": 63.1837,
        "Longitude": 14.61774,
        "AccessComments": "",
        "DistanceUnit": 0
    },
    "Connections": [
        {
            "ID": 164861,
            "ConnectionTypeID": 0,
            "Reference": "1",
            "LevelID": 2,
            "Amps": 32,
            "Voltage": 400,
            "PowerKW": 22,
            "Comments": "Mode 3"
        },
        {
            "ID": 164862,
            "ConnectionTypeID": 0,
            "Reference": "2",
            "LevelID": 2,
            "Amps": 32,
            "Voltage": 400,
            "PowerKW": 22,
            "Comments": "Mode 3"
        },
        {
            "ID": 164863,
            "ConnectionTypeID": 0,
            "Reference": "3",
            "LevelID": 2,
            "Amps": 32,
            "Voltage": 400,
            "PowerKW": 22,
            "Comments": "Mode 3"
        },
        {
            "ID": 164864,
            "ConnectionTypeID": 0,
            "Reference": "4",
            "LevelID": 2,
            "Amps": 32,
            "Voltage": 400,
            "PowerKW": 22,
            "Comments": "Mode 3"
        }
    ],
    "NumberOfPoints": 4,
    "DateLastStatusUpdate": "2020-05-26T08:25:00Z",
    "DataQualityLevel": 2,
    "DateCreated": "2019-02-11T09:16:00Z",
    "SubmissionStatusTypeID": 100
}