{
    "IsRecentlyVerified": false,
    "ID": 153412,
    "UUID": "8CE4C9B1-607A-4EB6-AFFD-ECFCF009E608",
    "DataProviderID": 28,
    "DataProvidersReference": "FR*S53*P53137*001",
    "UsageTypeID": 5,
    "AddressInfo": {
        "ID": 153765,
        "Title": "LOIRON RUILLE - Rue Du Docteur Ramé",
        "AddressLine1": "Rue Du Docteur Ramé 53320 LOiRON RUILLE",
        "CountryID": 80,
        "Latitude": 48.060102,
        "Longitude": -0.9359299,
        "AccessComments": "24h/24 7j/7",
        "DistanceUnit": 0
    },
    "Connections": [
        {
            "ID": 215211,
            "ConnectionTypeID": 26,
            "StatusTypeID": 50,
            "LevelID": 2,
            "PowerKW": 18
        },
        {
            "ID": 215212,
            "ConnectionTypeID": 28,
            "StatusTypeID": 50,
            "LevelID": 2,
            "PowerKW": 18,
            "CurrentTypeID": 10
        },
        {
            "ID": 248620,
            "ConnectionTypeID": 28,
            "StatusTypeID": 50,
            "LevelID": 2,
            "PowerKW": 18,
            "CurrentTypeID": 10
        },
        {
            "ID": 248621,
            "ConnectionTypeID": 26,
            "StatusTypeID": 50,
            "LevelID": 2,
            "PowerKW": 18
        }
    ],
    "GeneralComments": "Recharge par badge et avec une application smartphone",
    "StatusTypeID": 50,
    "DateLastStatusUpdate": "2020-08-27T05:14:00Z",
    "DataQualityLevel": 2,
    "DateCreated": "2020-03-15T10:54:00Z",
    "SubmissionStatusTypeID": 100
}