{
    "IsRecentlyVerified": false,
    "ID": 177891,
    "UUID": "5F54F288-C8A5-4A65-A465-A573C8BD11A7",
    "DataProviderID": 29,
    "DataProvidersReference": "2085",
    "OperatorID": 127,
    "AddressInfo": {
        "ID": 178250,
        "Title": "Lange Str. 38",
        "AddressLine1": "Lange Str. 38",
        "Town": "Westerstede",
        "Postcode": "26655",
        "CountryID": 87,
        "Latitude": 53.258923,
        "Longitude": 7.919709,
        "DistanceUnit": 0
    },
    "Connections": [
        {
            "ID": 277601,
            "ConnectionTypeID": 25,
            "StatusTypeID": 50,
            "LevelID": 2,
            "PowerKW": 22,
            "CurrentTypeID": 20
        },
        {
            "ID": 277602,
            "ConnectionTypeID": 25,
            "StatusTypeID": 50,
            "LevelID": 2,
            "PowerKW": 22,
            "CurrentTypeID": 20
        }
    ],
    "StatusTypeID": 0,
    "DateLastStatusUpdate": "2021-07-12T02:50:00Z",
    "MetadataValues": [
        {
            "ID": 10185,
            "MetadataFieldID": 4,
            "ItemValue": "Data from the German chargepoint registry provided by Bundesnetzagentur.de under the CC-BY 4.0 license"
        }
    ],
    "DataQualityLevel": 3,
    "DateCreated": "2021-07-08T09:49:00Z",
    "SubmissionStatusTypeID": 100
}