{
    "IsRecentlyVerified": false,
    "ID": 62626,
    "UUID": "8F4E7569-F820-4A89-BD38-4AAA3AFA9AB1",
    "DataProviderID": 26,
    "DataProvidersReference": "19653",
    "OperatorID": 162,
    "OperatorsReference": "ENEOS Dr.Drive 厚木店(24時間年中無休）",
    "UsageCost": "0.00 onbekend",
    "AddressInfo": {
        "ID": 62972,
        "Title": "国道246号線・国道129号線",
        "AddressLine1": "国道246号線・国道129号線",
        "Town": "中郡",
        "Postcode": "",
        "CountryID": 114,
        "Latitude": 35.436268,
        "Longitude": 139.356796,
        "DistanceUnit": 0
    },
    "Connections": [
        {
            "ID": 79548,
            "ConnectionTypeID": 2,
            "LevelID": 3,
            "PowerKW": 50,
            "CurrentTypeID": 30
        },
        {
            "ID": 95262,
            "ConnectionTypeID": 2,
            "LevelID": 3,
            "PowerKW": 50,
            "CurrentTypeID": 30
        }
    ],
    "NumberOfPoints": 1,
    "StatusTypeID": 50,
    "DateLastStatusUpdate": "2016-06-04T02:37:00Z",
    "DataQualityLevel": 3,
    "DateCreated": "2016-03-03T12:28:00Z",
    "SubmissionStatusTypeID": 100
}