{
    "IsRecentlyVerified": false,
    "ID": 39075,
    "UUID": "E4D3B90D-358D-477C-856E-BE7623385F96",
    "DataProviderID": 26,
    "DataProvidersReference": "40831",
    "OperatorID": 162,
    "OperatorsReference": "Wasautomatenverhuur",
    "UsageCost": "0.00 jaarabonnement",
    "AddressInfo": {
        "ID": 39421,
        "Title": "Cuxhavenweg 8",
        "AddressLine1": "Cuxhavenweg 8",
        "Town": "Groningen",
        "Postcode": "9723 JK",
        "CountryID": 159,
        "Latitude": 53.210196346363,
        "Longitude": 6.6230204701424,
        "DistanceUnit": 0
    },
    "Connections": [
        {
            "ID": 42586,
            "ConnectionTypeID": 25,
            "LevelID": 2,
            "PowerKW": 22,
            "CurrentTypeID": 10
        }
    ],
    "NumberOfPoints": 2,
    "StatusTypeID": 50,
    "DateLastStatusUpdate": "2016-06-04T02:56:00Z",
    "DataQualityLevel": 3,
    "DateCreated": "2015-01-09T06:08:00Z",
    "SubmissionStatusTypeID": 100
}