{
    "IsRecentlyVerified": false,
    "ID": 160554,
    "UUID": "3364FD1B-75FD-4A1A-8FF3-77957641621D",
    "DataProviderID": 2,
    "DataProvidersReference": "154101",
    "OperatorID": 5,
    "UsageTypeID": 1,
    "AddressInfo": {
        "ID": 160911,
        "Title": "HINSHAWSHONDA",
        "AddressLine1": "2605 Auburn Way N",
        "Town": "Auburn",
        "StateOrProvince": "WA",
        "Postcode": "98002",
        "CountryID": 2,
        "Latitude": 47.3301442,
        "Longitude": -122.2225295,
        "ContactTelephone1": "888-758-4389",
        "AccessComments": "24 hours daily",
        "RelatedURL": "http://www.chargepoint.com/",
        "DistanceUnit": 0
    },
    "Connections": [
        {
            "ID": 231020,
            "ConnectionTypeID": 1,
            "LevelID": 2,
            "Amps": 16,
            "Voltage": 230,
            "PowerKW": 3.7,
            "CurrentTypeID": 10,
            "Quantity": 1
        }
    ],
    "StatusTypeID": 50,
    "DateLastStatusUpdate": "2020-06-26T03:10:00Z",
    "DataQualityLevel": 3,
    "DateCreated": "2020-06-26T03:10:00Z",
    "SubmissionStatusTypeID": 100
}