{
    "IsRecentlyVerified": false,
    "ID": 106957,
    "UUID": "32587B5C-73DD-44FC-93F2-87429F930030",
    "DataProviderID": 1,
    "OperatorID": 45,
    "UsageTypeID": 3,
    "AddressInfo": {
        "ID": 107303,
        "Title": "Maritim TitiseeHotel",
        "AddressLine1": "Seestraße 16",
        "Town": "Titisee-Neustadt",
        "StateOrProvince": "Verwaltungsgemeinschaft Titisee-Neustadt",
        "Postcode": "79822",
        "CountryID": 87,
        "Latitude": 47.8981926,
        "Longitude": 8.154974400000015,
        "AccessComments": "Bitte am Empfang Bescheid geben, dann wird der Parkplatz zugewiesen. Für Hotelgäste kostenlos, der Anschluss ist Auf dem hoteleigenen Parkplatz. Zu-/Ausfahrt mit Schranke gesichert.",
        "RelatedURL": "https://www.maritim.de/de/hotels/deutschland/titiseehotel-titisee-neustadt/unser-hotel#hotel_content",
        "DistanceUnit": 0
    },
    "Connections": [
        {
            "ID": 150783,
            "ConnectionTypeID": 17,
            "StatusTypeID": 50,
            "LevelID": 2,
            "Amps": 32,
            "Voltage": 400,
            "PowerKW": 22,
            "CurrentTypeID": 20,
            "Quantity": 1
        }
    ],
    "NumberOfPoints": 1,
    "StatusTypeID": 50,
    "DateLastStatusUpdate": "2018-07-10T14:21:00Z",
    "DataQualityLevel": 1,
    "DateCreated": "2018-07-10T14:21:00Z",
    "SubmissionStatusTypeID": 200
}