{
    "IsRecentlyVerified": false,
    "ID": 36338,
    "UUID": "A5951D82-463B-4E77-9BF5-7D0675EDEA0D",
    "DataProviderID": 26,
    "DataProvidersReference": "47859",
    "OperatorID": 178,
    "OperatorsReference": "EVnetNL DB0092",
    "UsageCost": "0.00 jaarabonnement",
    "AddressInfo": {
        "ID": 36684,
        "Title": "Spieghelweg",
        "AddressLine1": "Spieghelweg",
        "Town": "Leusden",
        "Postcode": "3833 AH",
        "CountryID": 159,
        "Latitude": 52.142703,
        "Longitude": 5.413394,
        "ContactTelephone1": "0800-3522365",
        "RelatedURL": "http://www.evnet.nl",
        "DistanceUnit": 0
    },
    "Connections": [
        {
            "ID": 39849,
            "ConnectionTypeID": 25,
            "LevelID": 2,
            "PowerKW": 11,
            "CurrentTypeID": 10
        }
    ],
    "NumberOfPoints": 2,
    "StatusTypeID": 50,
    "DateLastStatusUpdate": "2016-06-04T02:50:00Z",
    "DataQualityLevel": 3,
    "DateCreated": "2015-01-09T06:05:00Z",
    "SubmissionStatusTypeID": 100
}