{
    "IsRecentlyVerified": false,
    "ID": 179832,
    "UUID": "DF76A2B5-BEDC-4C6C-A50D-76E1D624DDC2",
    "DataProviderID": 29,
    "DataProvidersReference": "9565",
    "AddressInfo": {
        "ID": 180191,
        "Title": "Georgstraße 10",
        "AddressLine1": "Georgstraße 10",
        "Town": "Detmold",
        "Postcode": "32756",
        "CountryID": 87,
        "Latitude": 51.950028,
        "Longitude": 8.87270420000004,
        "DistanceUnit": 0
    },
    "Connections": [
        {
            "ID": 282175,
            "ConnectionTypeID": 25,
            "StatusTypeID": 50,
            "LevelID": 2,
            "PowerKW": 22,
            "CurrentTypeID": 20
        },
        {
            "ID": 282176,
            "ConnectionTypeID": 25,
            "StatusTypeID": 50,
            "LevelID": 2,
            "PowerKW": 22,
            "CurrentTypeID": 20
        }
    ],
    "StatusTypeID": 50,
    "DateLastStatusUpdate": "2021-07-12T02:48:00Z",
    "MetadataValues": [
        {
            "ID": 12126,
            "MetadataFieldID": 4,
            "ItemValue": "Data from the German chargepoint registry provided by Bundesnetzagentur.de under the CC-BY 4.0 license"
        }
    ],
    "DataQualityLevel": 3,
    "DateCreated": "2021-07-08T10:00:00Z",
    "SubmissionStatusTypeID": 100
}