{
    "IsRecentlyVerified": false,
    "ID": 145703,
    "UUID": "47D40167-1214-454E-90B9-6F7B400DB8C9",
    "DataProviderID": 2,
    "DataProvidersReference": "129991",
    "OperatorID": 89,
    "UsageTypeID": 1,
    "AddressInfo": {
        "ID": 146055,
        "Title": "Douglas college - New Westminster",
        "AddressLine1": "700, Royal Ave",
        "Town": "New Westminster",
        "StateOrProvince": "BC",
        "Postcode": "V3M 5Z5",
        "CountryID": 44,
        "Latitude": 49.203116,
        "Longitude": -122.914494,
        "ContactTelephone1": "888-356-8911",
        "AccessComments": "24 hours daily",
        "RelatedURL": "https://flo.ca/",
        "DistanceUnit": 0
    },
    "Connections": [
        {
            "ID": 202429,
            "ConnectionTypeID": 1,
            "LevelID": 2,
            "Amps": 16,
            "Voltage": 230,
            "PowerKW": 3.7,
            "CurrentTypeID": 10,
            "Quantity": 2
        }
    ],
    "StatusTypeID": 50,
    "DateLastStatusUpdate": "2020-06-26T03:11:00Z",
    "DataQualityLevel": 3,
    "DateCreated": "2019-12-24T09:25:00Z",
    "SubmissionStatusTypeID": 100
}