{
    "IsRecentlyVerified": false,
    "ID": 178365,
    "UUID": "D0E835C2-FD33-4EBA-8102-4909482C3C5B",
    "DataProviderID": 29,
    "DataProvidersReference": "18139,16955,19007",
    "OperatorID": 86,
    "AddressInfo": {
        "ID": 178724,
        "Title": "Schelmenwasenstr. 15",
        "AddressLine1": "Schelmenwasenstr. 15",
        "Town": "Stuttgart",
        "Postcode": "70567",
        "CountryID": 87,
        "Latitude": 48.7132916,
        "Longitude": 9.1668283,
        "DistanceUnit": 0
    },
    "Connections": [
        {
            "ID": 278675,
            "ConnectionTypeID": 33,
            "StatusTypeID": 50,
            "LevelID": 3,
            "PowerKW": 200,
            "CurrentTypeID": 30
        },
        {
            "ID": 278676,
            "ConnectionTypeID": 33,
            "StatusTypeID": 50,
            "LevelID": 3,
            "PowerKW": 200,
            "CurrentTypeID": 30
        },
        {
            "ID": 278677,
            "ConnectionTypeID": 33,
            "StatusTypeID": 50,
            "LevelID": 3,
            "PowerKW": 200,
            "CurrentTypeID": 30
        },
        {
            "ID": 278678,
            "ConnectionTypeID": 33,
            "StatusTypeID": 50,
            "LevelID": 3,
            "PowerKW": 200,
            "CurrentTypeID": 30
        },
        {
            "ID": 278679,
            "ConnectionTypeID": 33,
            "StatusTypeID": 50,
            "LevelID": 3,
            "PowerKW": 300,
            "CurrentTypeID": 30
        },
        {
            "ID": 278680,
            "ConnectionTypeID": 33,
            "StatusTypeID": 50,
            "LevelID": 3,
            "PowerKW": 300,
            "CurrentTypeID": 30
        }
    ],
    "StatusTypeID": 0,
    "DateLastStatusUpdate": "2021-07-09T03:13:00Z",
    "MetadataValues": [
        {
            "ID": 10659,
            "MetadataFieldID": 4,
            "ItemValue": "Data from the German chargepoint registry provided by Bundesnetzagentur.de under the CC-BY 4.0 license"
        }
    ],
    "DataQualityLevel": 3,
    "DateCreated": "2021-07-08T09:49:00Z",
    "SubmissionStatusTypeID": 100
}