{
    "IsRecentlyVerified": false,
    "ID": 176095,
    "UUID": "86B41365-F7D8-4D40-B0BE-263A6ED77138",
    "DataProviderID": 1,
    "OperatorID": 3,
    "OperatorsReference": "t54_hu1_4520_016",
    "UsageTypeID": 4,
    "UsageCost": "£0.25/kWh",
    "AddressInfo": {
        "ID": 176454,
        "Title": "Lidl-Richmond Road",
        "AddressLine1": "383-393 Richmond Road",
        "Town": "London",
        "StateOrProvince": "England",
        "Postcode": "TW1 2EF",
        "CountryID": 1,
        "Latitude": 51.455762,
        "Longitude": -0.310703,
        "DistanceUnit": 0
    },
    "Connections": [
        {
            "ID": 273586,
            "ConnectionTypeID": 25,
            "Reference": "t54_hu1_4520_016",
            "StatusTypeID": 50,
            "LevelID": 2,
            "Amps": 32,
            "Voltage": 400,
            "PowerKW": 22,
            "CurrentTypeID": 20,
            "Quantity": 1
        },
        {
            "ID": 273587,
            "ConnectionTypeID": 33,
            "Reference": "t54_hu1_4520_016",
            "StatusTypeID": 50,
            "LevelID": 3,
            "PowerKW": 50,
            "CurrentTypeID": 30,
            "Quantity": 1
        },
        {
            "ID": 273588,
            "ConnectionTypeID": 2,
            "Reference": "t54_hu1_4520_016",
            "StatusTypeID": 50,
            "LevelID": 3,
            "PowerKW": 50,
            "CurrentTypeID": 30,
            "Quantity": 1
        }
    ],
    "NumberOfPoints": 1,
    "StatusTypeID": 50,
    "DateLastStatusUpdate": "2021-06-29T14:03:00Z",
    "DataQualityLevel": 1,
    "DateCreated": "2021-06-25T07:20:00Z",
    "SubmissionStatusTypeID": 200
}