{
    "IsRecentlyVerified": false,
    "ID": 3414,
    "UUID": "20581834-3E11-4804-B336-F694E50E61B0",
    "DataProviderID": 1,
    "OperatorID": 6,
    "UsageTypeID": 6,
    "AddressInfo": {
        "ID": 3415,
        "Title": "Beaverton Nissan",
        "AddressLine1": "3855 SW Cedar Hills Blvd",
        "Town": "Beaverton",
        "StateOrProvince": "OR",
        "Postcode": "97075",
        "CountryID": 2,
        "Latitude": 45.4918,
        "Longitude": -122.811,
        "ContactTelephone1": "866-419-5555",
        "DistanceUnit": 0
    },
    "Connections": [],
    "NumberOfPoints": 2,
    "GeneralComments": "Cost To Charge: Free Access Hours: Verify",
    "DateLastStatusUpdate": "2019-12-15T06:07:00Z",
    "DateCreated": "2010-02-28T00:00:00Z",
    "SubmissionStatusTypeID": 200
}