{
    "IsRecentlyVerified": false,
    "ID": 117774,
    "UUID": "16E1E5D0-A53A-44BD-A307-B7160C0BD7FE",
    "DataProviderID": 1,
    "OperatorID": 3341,
    "UsageTypeID": 6,
    "UsageCost": "£0.25/kWh",
    "AddressInfo": {
        "ID": 118120,
        "Title": "West Sussex Council",
        "AddressLine1": "County Hall",
        "Town": "Chichester",
        "Postcode": "PO19 1RG",
        "CountryID": 1,
        "Latitude": 50.837689,
        "Longitude": -0.782666,
        "DistanceUnit": 0
    },
    "Connections": [
        {
            "ID": 166639,
            "ConnectionTypeID": 33,
            "StatusTypeID": 50,
            "LevelID": 3,
            "PowerKW": 50,
            "CurrentTypeID": 30,
            "Quantity": 1
        },
        {
            "ID": 166640,
            "ConnectionTypeID": 2,
            "StatusTypeID": 50,
            "LevelID": 3,
            "PowerKW": 50,
            "CurrentTypeID": 30,
            "Quantity": 1
        },
        {
            "ID": 166641,
            "ConnectionTypeID": 1036,
            "StatusTypeID": 50,
            "LevelID": 3,
            "PowerKW": 43,
            "CurrentTypeID": 20,
            "Quantity": 1
        }
    ],
    "NumberOfPoints": 1,
    "GeneralComments": "Swarco E.Connect",
    "StatusTypeID": 50,
    "DateLastStatusUpdate": "2020-10-06T23:56:00Z",
    "DataQualityLevel": 1,
    "DateCreated": "2019-03-01T13:01:00Z",
    "SubmissionStatusTypeID": 200
}