{
    "IsRecentlyVerified": false,
    "ID": 34032,
    "UUID": "D6D71E2E-E02E-4CBD-A0D1-034B99777CF3",
    "DataProviderID": 26,
    "DataProvidersReference": "48255",
    "OperatorID": 178,
    "OperatorsReference": "EVnetNL EV0143",
    "UsageCost": "0.00 jaarabonnement",
    "AddressInfo": {
        "ID": 34378,
        "Title": "Theemsweg",
        "AddressLine1": "Theemsweg",
        "Town": "Nissewaard",
        "Postcode": "3201 LT",
        "CountryID": 159,
        "Latitude": 51.849341,
        "Longitude": 4.342166,
        "ContactTelephone1": "0800-3522365",
        "RelatedURL": "http://www.evnet.nl",
        "DistanceUnit": 0
    },
    "Connections": [
        {
            "ID": 37543,
            "ConnectionTypeID": 25,
            "LevelID": 2,
            "PowerKW": 11,
            "CurrentTypeID": 10
        }
    ],
    "NumberOfPoints": 1,
    "StatusTypeID": 50,
    "DateLastStatusUpdate": "2016-06-04T02:41:00Z",
    "DataQualityLevel": 3,
    "DateCreated": "2015-01-09T06:04:00Z",
    "SubmissionStatusTypeID": 100
}