{
    "IsRecentlyVerified": false,
    "ID": 115552,
    "UUID": "26E46D03-BF18-4E4B-8F9C-24CCC27EDAD1",
    "DataProviderID": 2,
    "DataProvidersReference": "117698",
    "OperatorID": 5,
    "UsageTypeID": 1,
    "AddressInfo": {
        "ID": 115898,
        "Title": "2473",
        "AddressLine1": "10117 Parkside Dr",
        "Town": "Knoxville",
        "StateOrProvince": "TN",
        "Postcode": "37922",
        "CountryID": 2,
        "Latitude": 35.908894,
        "Longitude": -84.122337,
        "ContactTelephone1": "888-758-4389",
        "AccessComments": "24 hours daily",
        "RelatedURL": "http://www.chargepoint.com/",
        "DistanceUnit": 0
    },
    "Connections": [
        {
            "ID": 162569,
            "ConnectionTypeID": 1,
            "LevelID": 2,
            "Amps": 16,
            "Voltage": 230,
            "PowerKW": 3,
            "CurrentTypeID": 10,
            "Quantity": 2
        }
    ],
    "DateLastStatusUpdate": "2019-04-06T04:02:00Z",
    "DataQualityLevel": 3,
    "DateCreated": "2019-02-11T07:13:00Z",
    "SubmissionStatusTypeID": 100
}