{
    "IsRecentlyVerified": false,
    "ID": 177283,
    "UUID": "454FBA03-6AAF-4A10-8EDF-D334F06B395E",
    "DataProviderID": 29,
    "DataProvidersReference": "14355",
    "OperatorID": 103,
    "AddressInfo": {
        "ID": 177642,
        "Title": "Franzstraße 4",
        "AddressLine1": "Franzstraße 4",
        "Town": "Berlin",
        "Postcode": "13595",
        "CountryID": 87,
        "Latitude": 52.522056,
        "Longitude": 13.198469,
        "DistanceUnit": 0
    },
    "Connections": [
        {
            "ID": 276255,
            "ConnectionTypeID": 25,
            "StatusTypeID": 50,
            "LevelID": 2,
            "PowerKW": 11,
            "CurrentTypeID": 20
        },
        {
            "ID": 276256,
            "ConnectionTypeID": 25,
            "StatusTypeID": 50,
            "LevelID": 2,
            "PowerKW": 11,
            "CurrentTypeID": 20
        }
    ],
    "StatusTypeID": 0,
    "DateLastStatusUpdate": "2021-07-12T02:50:00Z",
    "MetadataValues": [
        {
            "ID": 9577,
            "MetadataFieldID": 4,
            "ItemValue": "Data from the German chargepoint registry provided by Bundesnetzagentur.de under the CC-BY 4.0 license"
        }
    ],
    "DataQualityLevel": 3,
    "DateCreated": "2021-07-08T09:48:00Z",
    "SubmissionStatusTypeID": 100
}