{
    "UserComments": [
        {
            "ID": 14459,
            "ChargePointID": 48860,
            "CommentTypeID": 10,
            "UserName": "steev8",
            "Comment": "Ooops, ignore last update, meant for another site",
            "DateCreated": "2016-10-25T15:33:21.72Z",
            "User": {
                "ID": 1867,
                "Username": "steev8"
            },
            "CheckinStatusTypeID": 0
        },
        {
            "ID": 14458,
            "ChargePointID": 48860,
            "CommentTypeID": 10,
            "UserName": "steev8",
            "Comment": "All good, used Polar Plus card",
            "Rating": 5,
            "DateCreated": "2016-10-25T15:30:23.79Z",
            "User": {
                "ID": 1867,
                "Username": "steev8"
            },
            "CheckinStatusTypeID": 10
        }
    ],
    "IsRecentlyVerified": false,
    "ID": 48860,
    "UUID": "F62E89B9-7C23-4B59-8B23-3D3450A7773A",
    "DataProviderID": 1,
    "OperatorID": 32,
    "OperatorsReference": "3212",
    "UsageTypeID": 4,
    "UsageCost": "Inclusive; for Polar Plus subscription members only",
    "AddressInfo": {
        "ID": 49206,
        "Title": "Petersfinger, Salisbury",
        "AddressLine1": "Petersfinger Road",
        "Town": "Salisbury",
        "StateOrProvince": "Wiltshire",
        "Postcode": "SP5 3BZ",
        "CountryID": 1,
        "Latitude": 51.062152,
        "Longitude": -1.768635,
        "RelatedURL": "http://www.chargemasterplc.com",
        "DistanceUnit": 0
    },
    "Connections": [
        {
            "ID": 60378,
            "ConnectionTypeID": 25,
            "StatusTypeID": 50,
            "LevelID": 2,
            "Amps": 32,
            "Voltage": 230,
            "PowerKW": 7,
            "CurrentTypeID": 10,
            "Quantity": 2
        }
    ],
    "NumberOfPoints": 2,
    "StatusTypeID": 50,
    "DateLastStatusUpdate": "2019-03-08T06:15:00Z",
    "MetadataValues": [
        {
            "ID": 1679,
            "MetadataFieldID": 4,
            "ItemValue": "Contains public sector information licensed under the Open Government Licence v2.0. http://www.nationalarchives.gov.uk/doc/open-government-licence/version/2/"
        }
    ],
    "DataQualityLevel": 3,
    "DateCreated": "2015-07-04T08:17:00Z",
    "SubmissionStatusTypeID": 100
}