{
    "IsRecentlyVerified": false,
    "ID": 145566,
    "UUID": "832A8DC4-DC96-420F-A51E-AD39DEEF4E54",
    "DataProviderID": 2,
    "DataProvidersReference": "131260",
    "OperatorID": 90,
    "UsageTypeID": 1,
    "AddressInfo": {
        "ID": 145918,
        "Title": "BRCC - Lac-Bouchette",
        "AddressLine1": "295 Rue Principale",
        "Town": "Lac-Bouchette",
        "StateOrProvince": "QC",
        "Postcode": "G0W 1V0",
        "CountryID": 44,
        "Latitude": 48.25549,
        "Longitude": -72.186005,
        "ContactTelephone1": "877-505-2674",
        "AccessComments": "24 hours daily",
        "RelatedURL": "https://lecircuitelectrique.com/",
        "DistanceUnit": 0
    },
    "Connections": [
        {
            "ID": 202275,
            "ConnectionTypeID": 2,
            "LevelID": 3,
            "Amps": 100,
            "Voltage": 400,
            "PowerKW": 40,
            "CurrentTypeID": 30,
            "Quantity": 1
        },
        {
            "ID": 202276,
            "ConnectionTypeID": 32,
            "LevelID": 3,
            "Amps": 100,
            "Voltage": 400,
            "PowerKW": 40,
            "CurrentTypeID": 30,
            "Quantity": 1
        }
    ],
    "StatusTypeID": 50,
    "DateLastStatusUpdate": "2020-06-26T03:11:00Z",
    "DataQualityLevel": 3,
    "DateCreated": "2019-12-24T09:25:00Z",
    "SubmissionStatusTypeID": 100
}