{
    "IsRecentlyVerified": false,
    "ID": 134979,
    "UUID": "0BCD312B-D0E3-442B-A7FA-AA1E96C49425",
    "DataProviderID": 1,
    "OperatorID": 3345,
    "UsageTypeID": 5,
    "AddressInfo": {
        "ID": 135325,
        "Title": "Plympton Road",
        "AddressLine1": "Plympton Road",
        "Town": "Kilburn ",
        "Postcode": "NW6 7EQ",
        "CountryID": 1,
        "Latitude": 51.542735,
        "Longitude": -0.204541,
        "AccessComments": "Parking restrictions: KD Permits Only: Mon - Fri, 8.30am - 6.30pm",
        "RelatedURL": "https://char.gy",
        "DistanceUnit": 0
    },
    "Connections": [
        {
            "ID": 188907,
            "ConnectionTypeID": 25,
            "Reference": "155",
            "StatusTypeID": 50,
            "LevelID": 2,
            "Amps": 16,
            "Voltage": 230,
            "PowerKW": 3.7,
            "CurrentTypeID": 10
        }
    ],
    "StatusTypeID": 0,
    "DateLastStatusUpdate": "2019-12-04T14:31:00Z",
    "MetadataValues": [
        {
            "ID": 5320,
            "MetadataFieldID": 4,
            "ItemValue": "Contains public sector information licensed under the Open Government Licence v2.0. http://www.nationalarchives.gov.uk/doc/open-government-licence/version/2/"
        }
    ],
    "DataQualityLevel": 3,
    "DateCreated": "2019-12-03T13:42:00Z",
    "SubmissionStatusTypeID": 100
}