{
    "IsRecentlyVerified": false,
    "ID": 73261,
    "UUID": "911C12B5-4237-4831-8BBF-FA2720A60E8D",
    "DataProviderID": 1,
    "OperatorID": 45,
    "UsageTypeID": 6,
    "AddressInfo": {
        "ID": 73607,
        "Title": "Appartementresidenz",
        "AddressLine1": "Obermoosen 10",
        "Town": "Übersee",
        "StateOrProvince": "Landkreis Traunstein",
        "Postcode": "83236",
        "CountryID": 87,
        "Latitude": 47.81794,
        "Longitude": 12.499080000000049,
        "ContactTelephone1": "+49 8642 598750",
        "RelatedURL": "http://www.chiemsee-residenz.de/",
        "DistanceUnit": 0
    },
    "Connections": [
        {
            "ID": 105421,
            "ConnectionTypeID": 28,
            "StatusTypeID": 50,
            "LevelID": 2,
            "Amps": 16,
            "Voltage": 230,
            "PowerKW": 3.7,
            "CurrentTypeID": 10,
            "Quantity": 1
        }
    ],
    "NumberOfPoints": 1,
    "StatusTypeID": 50,
    "DateLastStatusUpdate": "2016-11-17T07:48:00Z",
    "DataQualityLevel": 1,
    "DateCreated": "2016-11-17T07:48:00Z",
    "SubmissionStatusTypeID": 200
}