{
    "IsRecentlyVerified": false,
    "ID": 142889,
    "UUID": "A2FF53D3-1EE5-48EB-9641-5A69459B6B93",
    "DataProviderID": 2,
    "DataProvidersReference": "70932",
    "OperatorID": 5,
    "UsageTypeID": 1,
    "AddressInfo": {
        "ID": 143241,
        "Title": "NAVY PIER",
        "AddressLine1": "600 E Grand Ave",
        "Town": "Chicago",
        "StateOrProvince": "IL",
        "Postcode": "60611",
        "CountryID": 2,
        "Latitude": 41.8919806,
        "Longitude": -87.6095976,
        "ContactTelephone1": "888-758-4389",
        "AccessComments": "24 hours daily",
        "RelatedURL": "http://www.chargepoint.com/",
        "DistanceUnit": 0
    },
    "Connections": [
        {
            "ID": 199117,
            "ConnectionTypeID": 1,
            "LevelID": 2,
            "Amps": 16,
            "Voltage": 230,
            "PowerKW": 3.7,
            "CurrentTypeID": 10,
            "Quantity": 2
        }
    ],
    "StatusTypeID": 50,
    "DateLastStatusUpdate": "2020-06-26T03:05:00Z",
    "DataQualityLevel": 3,
    "DateCreated": "2019-12-24T09:19:00Z",
    "SubmissionStatusTypeID": 100
}