{
    "IsRecentlyVerified": false,
    "ID": 179630,
    "UUID": "2C5156B8-131C-4E3C-A1AB-26EED1A17EC8",
    "DataProviderID": 29,
    "DataProvidersReference": "812",
    "AddressInfo": {
        "ID": 179989,
        "Title": "Michelbacher Straße 5",
        "AddressLine1": "Michelbacher Straße 5",
        "Town": "Zaberfeld",
        "Postcode": "74374",
        "CountryID": 87,
        "Latitude": 49.059092,
        "Longitude": 8.926855,
        "DistanceUnit": 0
    },
    "Connections": [
        {
            "ID": 281702,
            "ConnectionTypeID": 28,
            "StatusTypeID": 50,
            "LevelID": 2,
            "PowerKW": 22,
            "CurrentTypeID": 20
        },
        {
            "ID": 281703,
            "ConnectionTypeID": 25,
            "StatusTypeID": 50,
            "LevelID": 2,
            "PowerKW": 22,
            "CurrentTypeID": 20
        },
        {
            "ID": 296561,
            "ConnectionTypeID": 28,
            "StatusTypeID": 50,
            "LevelID": 2,
            "PowerKW": 22,
            "CurrentTypeID": 20
        },
        {
            "ID": 296562,
            "ConnectionTypeID": 25,
            "StatusTypeID": 50,
            "LevelID": 2,
            "PowerKW": 22,
            "CurrentTypeID": 20
        }
    ],
    "StatusTypeID": 50,
    "DateLastStatusUpdate": "2021-07-12T02:42:00Z",
    "MetadataValues": [
        {
            "ID": 11924,
            "MetadataFieldID": 4,
            "ItemValue": "Data from the German chargepoint registry provided by Bundesnetzagentur.de under the CC-BY 4.0 license"
        }
    ],
    "DataQualityLevel": 3,
    "DateCreated": "2021-07-08T09:59:00Z",
    "SubmissionStatusTypeID": 100
}