{
    "IsRecentlyVerified": false,
    "ID": 156094,
    "UUID": "E70880D9-CD69-43C9-AEA1-2CA80C8054EE",
    "DataProviderID": 1,
    "OperatorID": 80,
    "UsageTypeID": 4,
    "AddressInfo": {
        "ID": 156448,
        "Title": "MOSCIANO Via Milano | ENELX",
        "AddressLine1": "Via Milano",
        "Town": "Mosciano Sant'Angelo",
        "StateOrProvince": "TE",
        "Postcode": "64023",
        "CountryID": 112,
        "Latitude": 42.74511768677746,
        "Longitude": 13.891892591078772,
        "RelatedURL": "https://www.enelx.com/it/it/emobility",
        "DistanceUnit": 0
    },
    "Connections": [
        {
            "ID": 219701,
            "ConnectionTypeID": 25,
            "StatusTypeID": 50,
            "LevelID": 2,
            "Amps": 32,
            "Voltage": 400,
            "PowerKW": 22,
            "CurrentTypeID": 20,
            "Quantity": 1
        },
        {
            "ID": 219702,
            "ConnectionTypeID": 36,
            "StatusTypeID": 50,
            "LevelID": 2,
            "Amps": 16,
            "Voltage": 240,
            "PowerKW": 3,
            "CurrentTypeID": 10,
            "Quantity": 1
        }
    ],
    "NumberOfPoints": 2,
    "StatusTypeID": 50,
    "DateLastStatusUpdate": "2020-05-06T15:36:00Z",
    "DataQualityLevel": 1,
    "DateCreated": "2020-05-06T15:36:00Z",
    "SubmissionStatusTypeID": 200
}