{
    "IsRecentlyVerified": false,
    "ID": 62644,
    "UUID": "2E0E9604-68CB-4037-B6A7-5100AAF15120",
    "DataProviderID": 26,
    "DataProvidersReference": "19719",
    "OperatorID": 162,
    "OperatorsReference": "日本橋兜町パーキング（兜町駐車場）",
    "UsageCost": "0.00 onbekend",
    "AddressInfo": {
        "ID": 62990,
        "Title": "首都高速1号上野線",
        "AddressLine1": "首都高速1号上野線",
        "Town": "千代田区",
        "Postcode": "101-0041",
        "CountryID": 114,
        "Latitude": 35.683239,
        "Longitude": 139.778061,
        "DistanceUnit": 0
    },
    "Connections": [
        {
            "ID": 79566,
            "ConnectionTypeID": 2,
            "LevelID": 3,
            "PowerKW": 50,
            "CurrentTypeID": 30
        }
    ],
    "NumberOfPoints": 1,
    "StatusTypeID": 50,
    "DateLastStatusUpdate": "2016-03-03T12:29:00Z",
    "DataQualityLevel": 3,
    "DateCreated": "2016-03-03T12:29:00Z",
    "SubmissionStatusTypeID": 100
}