{
    "IsRecentlyVerified": false,
    "ID": 180072,
    "UUID": "F4DCD48B-807F-427A-A67D-5D675F8017D9",
    "DataProviderID": 29,
    "DataProvidersReference": "15142",
    "AddressInfo": {
        "ID": 180431,
        "Title": "Hauptstr.29",
        "AddressLine1": "Hauptstr.29",
        "Town": "Königheim",
        "Postcode": "97953",
        "CountryID": 87,
        "Latitude": 49.61816,
        "Longitude": 9.59558,
        "DistanceUnit": 0
    },
    "Connections": [
        {
            "ID": 282714,
            "ConnectionTypeID": 25,
            "StatusTypeID": 50,
            "LevelID": 2,
            "PowerKW": 22,
            "CurrentTypeID": 20
        },
        {
            "ID": 282715,
            "ConnectionTypeID": 25,
            "StatusTypeID": 50,
            "LevelID": 2,
            "PowerKW": 22,
            "CurrentTypeID": 20
        }
    ],
    "StatusTypeID": 50,
    "DateLastStatusUpdate": "2021-07-09T03:17:00Z",
    "MetadataValues": [
        {
            "ID": 12366,
            "MetadataFieldID": 4,
            "ItemValue": "Data from the German chargepoint registry provided by Bundesnetzagentur.de under the CC-BY 4.0 license"
        }
    ],
    "DataQualityLevel": 3,
    "DateCreated": "2021-07-08T10:00:00Z",
    "SubmissionStatusTypeID": 100
}