{
    "IsRecentlyVerified": false,
    "ID": 125002,
    "UUID": "BFD4FE7D-C2E4-472B-8370-1334D298238A",
    "DataProviderID": 1,
    "OperatorID": 3382,
    "UsageTypeID": 4,
    "AddressInfo": {
        "ID": 125348,
        "Title": "Nembro Stazione Teb | Ressolar",
        "AddressLine1": "Via Luigi Carrara",
        "Town": "Nembro",
        "StateOrProvince": "BG",
        "Postcode": "24022",
        "CountryID": 112,
        "Latitude": 45.7508064063485,
        "Longitude": 9.78154592547742,
        "ContactTelephone1": "+39 035 36 92 145",
        "ContactEmail": "info@ressolar.it",
        "RelatedURL": "https://www.ressolar.it/mobilita-sostenibile/",
        "DistanceUnit": 0
    },
    "Connections": [
        {
            "ID": 175205,
            "ConnectionTypeID": 25,
            "StatusTypeID": 50,
            "LevelID": 2,
            "Amps": 32,
            "Voltage": 400,
            "PowerKW": 22,
            "CurrentTypeID": 20,
            "Quantity": 2
        }
    ],
    "NumberOfPoints": 2,
    "GeneralComments": "Si attiva con l'App Wroom",
    "StatusTypeID": 50,
    "DateLastStatusUpdate": "2020-01-23T09:43:00Z",
    "DataQualityLevel": 1,
    "DateCreated": "2019-04-07T14:05:00Z",
    "SubmissionStatusTypeID": 200
}