{
    "IsRecentlyVerified": false,
    "ID": 149863,
    "UUID": "F4429E88-D588-4CDB-82DC-D8BFC2A6CDD7",
    "DataProviderID": 1,
    "OperatorID": 3293,
    "UsageTypeID": 4,
    "AddressInfo": {
        "ID": 150216,
        "Title": "Revolta",
        "AddressLine1": "First 6th of October",
        "AddressLine2": "Mena Garden City",
        "Town": "Zayed 2000 Compound",
        "StateOrProvince": "Giza Governorate",
        "Postcode": "12573",
        "CountryID": 70,
        "Latitude": 30.015815,
        "Longitude": 30.997728,
        "DistanceUnit": 0
    },
    "Connections": [
        {
            "ID": 208080,
            "ConnectionTypeID": 25,
            "StatusTypeID": 50,
            "LevelID": 2,
            "Amps": 32,
            "Voltage": 400,
            "PowerKW": 22,
            "CurrentTypeID": 20,
            "Quantity": 1
        }
    ],
    "NumberOfPoints": 1,
    "StatusTypeID": 50,
    "DateLastStatusUpdate": "2020-03-07T08:22:00Z",
    "DataQualityLevel": 1,
    "DateCreated": "2020-03-07T08:22:00Z",
    "SubmissionStatusTypeID": 200
}