{
    "IsRecentlyVerified": false,
    "ID": 56806,
    "UUID": "A99A6C1C-28DA-4F18-AC30-CB0A83CB8345",
    "DataProviderID": 1,
    "OperatorID": 80,
    "UsageTypeID": 4,
    "UsageCost": "0,40 €/kW",
    "AddressInfo": {
        "ID": 57152,
        "Title": "Eneldrive Punto Enel",
        "AddressLine1": "Via del Tabacchificio, 26",
        "Town": "Perugia",
        "StateOrProvince": "PG",
        "Postcode": "06128",
        "CountryID": 112,
        "Latitude": 43.1068689746613,
        "Longitude": 12.3637754751519,
        "RelatedURL": "http://eneldrive.it",
        "DistanceUnit": 0
    },
    "Connections": [
        {
            "ID": 71670,
            "ConnectionTypeID": 25,
            "StatusTypeID": 50,
            "LevelID": 2,
            "Amps": 32,
            "Voltage": 400,
            "PowerKW": 22,
            "CurrentTypeID": 20,
            "Quantity": 2
        },
        {
            "ID": 71671,
            "ConnectionTypeID": 36,
            "StatusTypeID": 50,
            "LevelID": 2,
            "Amps": 16,
            "Voltage": 240,
            "PowerKW": 3.7,
            "CurrentTypeID": 10,
            "Quantity": 2
        }
    ],
    "NumberOfPoints": 2,
    "StatusTypeID": 50,
    "DateLastStatusUpdate": "2019-08-06T14:26:00Z",
    "DataQualityLevel": 1,
    "DateCreated": "2015-11-10T16:02:00Z",
    "SubmissionStatusTypeID": 200
}