{
    "IsRecentlyVerified": false,
    "ID": 92084,
    "UUID": "6EFD379D-9D08-471A-8C34-65B6BBA36609",
    "DataProviderID": 1,
    "OperatorID": 3,
    "OperatorsReference": "PG-91022",
    "UsageTypeID": 6,
    "UsageCost": "Free",
    "AddressInfo": {
        "ID": 92430,
        "Title": "Edinburgh Leisure-Dalkeith Place",
        "AddressLine1": "Dalkeith Road",
        "Town": "Edinburgh",
        "Postcode": "EH16 5BB",
        "CountryID": 1,
        "Latitude": 55.938801,
        "Longitude": -3.173628,
        "DistanceUnit": 0
    },
    "Connections": [
        {
            "ID": 130557,
            "ConnectionTypeID": 25,
            "StatusTypeID": 50,
            "LevelID": 2,
            "Amps": 32,
            "Voltage": 230,
            "PowerKW": 7,
            "CurrentTypeID": 10,
            "Quantity": 1
        }
    ],
    "NumberOfPoints": 1,
    "GeneralComments": "This is an open charge unit installed at Edinburgh Leisure site at Dalkeith Road",
    "StatusTypeID": 50,
    "DateLastStatusUpdate": "2017-08-26T05:21:00Z",
    "DataQualityLevel": 1,
    "DateCreated": "2017-08-26T05:21:00Z",
    "SubmissionStatusTypeID": 200
}