{
    "IsRecentlyVerified": false,
    "ID": 156943,
    "UUID": "F5C5E0AF-B9B6-4754-8CDF-BC0980EB0C56",
    "DataProviderID": 19,
    "DataProvidersReference": "5545",
    "AddressInfo": {
        "ID": 157297,
        "Title": "ICA lager Hacksta",
        "AddressLine1": "Saltängsvägen 38",
        "Town": "VÄSTERÅS",
        "StateOrProvince": "VÄSTMANLAND",
        "Postcode": "72132",
        "CountryID": 216,
        "Latitude": 59.58668,
        "Longitude": 16.47849,
        "AccessComments": "ICA lager Hacksta.",
        "DistanceUnit": 0
    },
    "Connections": [
        {
            "ID": 223168,
            "ConnectionTypeID": 25,
            "Reference": "1",
            "LevelID": 3,
            "Amps": 32,
            "Voltage": 400,
            "PowerKW": 22,
            "CurrentTypeID": 30,
            "Comments": "Mode 3"
        },
        {
            "ID": 223169,
            "ConnectionTypeID": 25,
            "Reference": "2",
            "LevelID": 3,
            "Amps": 32,
            "Voltage": 400,
            "PowerKW": 22,
            "CurrentTypeID": 30,
            "Comments": "Mode 3"
        },
        {
            "ID": 223170,
            "ConnectionTypeID": 25,
            "Reference": "3",
            "LevelID": 3,
            "Amps": 32,
            "Voltage": 400,
            "PowerKW": 22,
            "CurrentTypeID": 30,
            "Comments": "Mode 3"
        },
        {
            "ID": 223171,
            "ConnectionTypeID": 25,
            "Reference": "4",
            "LevelID": 3,
            "Amps": 32,
            "Voltage": 400,
            "PowerKW": 22,
            "CurrentTypeID": 30,
            "Comments": "Mode 3"
        }
    ],
    "NumberOfPoints": 4,
    "StatusTypeID": 0,
    "DateLastStatusUpdate": "2021-03-24T05:11:00Z",
    "DataQualityLevel": 2,
    "DateCreated": "2020-05-26T08:23:00Z",
    "SubmissionStatusTypeID": 100
}