{
    "IsRecentlyVerified": false,
    "ID": 73662,
    "UUID": "1E51F975-8B6C-432B-A79E-CA111A00D9A1",
    "DataProviderID": 1,
    "OperatorID": 89,
    "OperatorsReference": "CEA-199",
    "UsageTypeID": 4,
    "UsageCost": "CAD 2.50",
    "AddressInfo": {
        "ID": 74008,
        "Title": "Ville de Saint-Georges-Centre Sportif",
        "AddressLine1": "11121 1e avenue",
        "Town": "Saint-Georges",
        "StateOrProvince": "QC",
        "Postcode": "G5Y 2B9",
        "CountryID": 44,
        "Latitude": 46.1239453341735,
        "Longitude": -70.6777324920654,
        "DistanceUnit": 0
    },
    "Connections": [
        {
            "ID": 105959,
            "ConnectionTypeID": 1,
            "StatusTypeID": 50,
            "LevelID": 2,
            "Amps": 32,
            "Voltage": 230,
            "PowerKW": 7,
            "CurrentTypeID": 10,
            "Quantity": 1
        }
    ],
    "NumberOfPoints": 1,
    "StatusTypeID": 50,
    "DateLastStatusUpdate": "2017-01-22T19:34:00Z",
    "DataQualityLevel": 1,
    "DateCreated": "2016-11-23T22:36:00Z",
    "SubmissionStatusTypeID": 200
}