{
    "UserComments": [
        {
            "ID": 24657,
            "ChargePointID": 42776,
            "CommentTypeID": 10,
            "UserName": "My_Leaf",
            "Comment": "rebranding currently to Fastned",
            "DateCreated": "2021-07-27T13:55:16.47Z",
            "User": {
                "ID": 4511,
                "Username": "My_Leaf"
            },
            "CheckinStatusTypeID": 10,
            "IsActionedByEditor": false
        },
        {
            "ID": 21735,
            "ChargePointID": 42776,
            "CommentTypeID": 10,
            "UserName": "My_Leaf",
            "Comment": "",
            "Rating": 5,
            "DateCreated": "2019-10-29T11:27:54.7Z",
            "User": {
                "ID": 4511,
                "Username": "My_Leaf"
            },
            "CheckinStatusTypeID": 10
        }
    ],
    "MediaItems": [
        {
            "ID": 28799,
            "ChargePointID": 42776,
            "ItemURL": "https://s3-ap-southeast-2.amazonaws.com/openchargemap/images/NL/OCM42776/OCM-42776.orig.2021072713542931.jpg",
            "ItemThumbnailURL": "https://s3-ap-southeast-2.amazonaws.com/openchargemap/images/NL/OCM42776/OCM-42776.thmb.2021072713542931.jpg",
            "Comment": "",
            "IsEnabled": true,
            "IsVideo": false,
            "IsFeaturedItem": false,
            "IsExternalResource": false,
            "User": {
                "ID": 4511,
                "Username": "My_Leaf"
            },
            "DateCreated": "2021-07-27T13:55:00Z"
        },
        {
            "ID": 28798,
            "ChargePointID": 42776,
            "ItemURL": "https://s3-ap-southeast-2.amazonaws.com/openchargemap/images/NL/OCM42776/OCM-42776.orig.2021072713541254.jpg",
            "ItemThumbnailURL": "https://s3-ap-southeast-2.amazonaws.com/openchargemap/images/NL/OCM42776/OCM-42776.thmb.2021072713541254.jpg",
            "Comment": "",
            "IsEnabled": true,
            "IsVideo": false,
            "IsFeaturedItem": false,
            "IsExternalResource": false,
            "User": {
                "ID": 4511,
                "Username": "My_Leaf"
            },
            "DateCreated": "2021-07-27T13:54:00Z"
        },
        {
            "ID": 1137,
            "ChargePointID": 42776,
            "ItemURL": "https://s3-ap-southeast-2.amazonaws.com/openchargemap/images/NL/OCM42776/OCM-42776.orig.2015032322164468.png",
            "ItemThumbnailURL": "https://s3-ap-southeast-2.amazonaws.com/openchargemap/images/NL/OCM42776/OCM-42776.thmb.2015032322164468.png",
            "Comment": "Tesla convertor ",
            "IsEnabled": true,
            "IsVideo": false,
            "IsFeaturedItem": false,
            "IsExternalResource": false,
            "User": {
                "ID": 4511,
                "Username": "My_Leaf"
            },
            "DateCreated": "2015-03-23T22:17:00Z"
        },
        {
            "ID": 1135,
            "ChargePointID": 42776,
            "ItemURL": "https://s3-ap-southeast-2.amazonaws.com/openchargemap/images/NL/OCM42776/OCM-42776.orig.2015032322153950.png",
            "ItemThumbnailURL": "https://s3-ap-southeast-2.amazonaws.com/openchargemap/images/NL/OCM42776/OCM-42776.thmb.2015032322153950.png",
            "Comment": "Hellevliet DBT charger",
            "IsEnabled": true,
            "IsVideo": false,
            "IsFeaturedItem": false,
            "IsExternalResource": false,
            "User": {
                "ID": 4511,
                "Username": "My_Leaf"
            },
            "DateCreated": "2015-03-23T22:16:00Z"
        },
        {
            "ID": 1134,
            "ChargePointID": 42776,
            "ItemURL": "https://s3-ap-southeast-2.amazonaws.com/openchargemap/images/NL/OCM42776/OCM-42776.orig.2015032322150233.png",
            "ItemThumbnailURL": "https://s3-ap-southeast-2.amazonaws.com/openchargemap/images/NL/OCM42776/OCM-42776.thmb.2015032322150233.png",
            "Comment": "Hellevliet DBT Charger",
            "IsEnabled": true,
            "IsVideo": false,
            "IsFeaturedItem": false,
            "IsExternalResource": false,
            "User": {
                "ID": 4511,
                "Username": "My_Leaf"
            },
            "DateCreated": "2015-03-23T22:15:00Z"
        }
    ],
    "IsRecentlyVerified": false,
    "ID": 42776,
    "UUID": "DCA9FBD5-9F84-4FD5-A326-2DC76F36845B",
    "DataProviderID": 1,
    "OperatorID": 74,
    "UsageTypeID": 4,
    "AddressInfo": {
        "ID": 43122,
        "Title": "Hellevliet",
        "AddressLine1": "A12",
        "AddressLine2": "West bound ",
        "Town": "Harmelen",
        "StateOrProvince": "Utrecht",
        "CountryID": 159,
        "Latitude": 52.0820649005251,
        "Longitude": 4.98227833982537,
        "AccessComments": "Gasstation parking",
        "RelatedURL": "http://www.mistergreen.nl",
        "DistanceUnit": 0
    },
    "Connections": [
        {
            "ID": 51627,
            "ConnectionTypeID": 2,
            "StatusTypeID": 50,
            "LevelID": 3,
            "Amps": 110,
            "Voltage": 500,
            "PowerKW": 50,
            "CurrentTypeID": 30,
            "Quantity": 1
        },
        {
            "ID": 51628,
            "ConnectionTypeID": 25,
            "StatusTypeID": 50,
            "LevelID": 2,
            "Amps": 32,
            "Voltage": 220,
            "PowerKW": 23,
            "CurrentTypeID": 20,
            "Quantity": 2
        }
    ],
    "NumberOfPoints": 1,
    "GeneralComments": "Incl. Tesla convertor",
    "StatusTypeID": 50,
    "DateLastStatusUpdate": "2021-07-27T13:56:00Z",
    "DataQualityLevel": 1,
    "DateCreated": "2015-03-23T19:55:00Z",
    "SubmissionStatusTypeID": 200
}