{
    "IsRecentlyVerified": false,
    "ID": 38807,
    "UUID": "5FBABEAC-D6C1-4BE3-A1C5-25679871CA98",
    "DataProviderID": 26,
    "DataProvidersReference": "34879",
    "OperatorID": 73,
    "OperatorsReference": "EV-Box EVB-P1335081",
    "UsageCost": "0.00 jaarabonnement",
    "AddressInfo": {
        "ID": 39153,
        "Title": "A28",
        "AddressLine1": "A28",
        "Town": "Midden-Drenthe",
        "Postcode": "9417 TG",
        "CountryID": 159,
        "Latitude": 52.81706,
        "Longitude": 6.46218,
        "RelatedURL": "http://www.ev-box.nl",
        "DistanceUnit": 0
    },
    "Connections": [
        {
            "ID": 42318,
            "ConnectionTypeID": 25,
            "LevelID": 2,
            "PowerKW": 11,
            "CurrentTypeID": 10
        },
        {
            "ID": 49783,
            "ConnectionTypeID": 25,
            "LevelID": 2,
            "PowerKW": 11,
            "CurrentTypeID": 10
        },
        {
            "ID": 95549,
            "ConnectionTypeID": 25,
            "LevelID": 2,
            "PowerKW": 11,
            "CurrentTypeID": 10
        }
    ],
    "NumberOfPoints": 1,
    "StatusTypeID": 50,
    "DateLastStatusUpdate": "2016-06-04T02:55:00Z",
    "DataQualityLevel": 3,
    "DateCreated": "2015-01-09T06:08:00Z",
    "SubmissionStatusTypeID": 100
}