{
    "IsRecentlyVerified": false,
    "ID": 133929,
    "UUID": "E09BFE67-632D-49FC-948D-102461AC31B5",
    "DataProviderID": 1,
    "OperatorID": 45,
    "UsageTypeID": 1,
    "AddressInfo": {
        "ID": 134275,
        "Title": "Kaufland Luisenglück",
        "AddressLine1": "Luisenglück 43",
        "Town": "Dortmund",
        "StateOrProvince": "NRW",
        "Postcode": "44225",
        "CountryID": 87,
        "Latitude": 51.4773498654974,
        "Longitude": 7.43285282320346,
        "RelatedURL": "http://www.schneller-strom-tanken.de/",
        "DistanceUnit": 0
    },
    "Connections": [
        {
            "ID": 187402,
            "ConnectionTypeID": 1036,
            "StatusTypeID": 50,
            "LevelID": 3,
            "Amps": 63,
            "Voltage": 400,
            "PowerKW": 43,
            "CurrentTypeID": 20,
            "Quantity": 1
        },
        {
            "ID": 187403,
            "ConnectionTypeID": 2,
            "StatusTypeID": 50,
            "LevelID": 3,
            "PowerKW": 50,
            "CurrentTypeID": 30,
            "Quantity": 1
        },
        {
            "ID": 187404,
            "ConnectionTypeID": 33,
            "StatusTypeID": 50,
            "LevelID": 3,
            "PowerKW": 50,
            "CurrentTypeID": 30,
            "Quantity": 1
        }
    ],
    "NumberOfPoints": 1,
    "StatusTypeID": 50,
    "DateLastStatusUpdate": "2019-10-30T10:54:00Z",
    "DataQualityLevel": 1,
    "DateCreated": "2019-10-30T10:54:00Z",
    "SubmissionStatusTypeID": 200
}