{
    "IsRecentlyVerified": false,
    "ID": 152414,
    "UUID": "7D947757-EF70-4BCE-BBF1-E7D95FE48C92",
    "DataProviderID": 28,
    "DataProvidersReference": "FR*S49*P49099*004",
    "UsageTypeID": 5,
    "AddressInfo": {
        "ID": 152767,
        "Title": "CHOLET - Av De La Marne",
        "AddressLine1": "Av De La Marne 49300 CHOLET",
        "CountryID": 80,
        "Latitude": 47.051325,
        "Longitude": -0.885521,
        "AccessComments": "24h/24 7j/7",
        "DistanceUnit": 0
    },
    "Connections": [
        {
            "ID": 213367,
            "ConnectionTypeID": 25,
            "StatusTypeID": 50,
            "LevelID": 2,
            "PowerKW": 18,
            "CurrentTypeID": 20
        },
        {
            "ID": 213368,
            "ConnectionTypeID": 28,
            "StatusTypeID": 50,
            "LevelID": 2,
            "PowerKW": 18,
            "CurrentTypeID": 10
        },
        {
            "ID": 246270,
            "ConnectionTypeID": 25,
            "StatusTypeID": 50,
            "LevelID": 2,
            "PowerKW": 18,
            "CurrentTypeID": 20
        },
        {
            "ID": 246271,
            "ConnectionTypeID": 28,
            "StatusTypeID": 50,
            "LevelID": 2,
            "PowerKW": 18,
            "CurrentTypeID": 10
        }
    ],
    "GeneralComments": "Recharge par badge et avec une application smartphone",
    "StatusTypeID": 50,
    "DateLastStatusUpdate": "2020-08-27T05:13:00Z",
    "DataQualityLevel": 2,
    "DateCreated": "2020-03-15T10:53:00Z",
    "SubmissionStatusTypeID": 100
}