{
    "IsRecentlyVerified": false,
    "ID": 179062,
    "UUID": "21C6949A-06F5-488A-86CD-6D3ECFACEC73",
    "DataProviderID": 29,
    "DataProvidersReference": "2397",
    "AddressInfo": {
        "ID": 179421,
        "Title": "Luitpoldstraße 14",
        "AddressLine1": "Luitpoldstraße 14",
        "Town": "Dinkelsbühl",
        "Postcode": "91550",
        "CountryID": 87,
        "Latitude": 49.068243,
        "Longitude": 10.327596,
        "DistanceUnit": 0
    },
    "Connections": [
        {
            "ID": 280320,
            "ConnectionTypeID": 1036,
            "StatusTypeID": 50,
            "LevelID": 2,
            "PowerKW": 22.1,
            "CurrentTypeID": 20
        },
        {
            "ID": 280321,
            "ConnectionTypeID": 33,
            "StatusTypeID": 50,
            "LevelID": 3,
            "PowerKW": 30,
            "CurrentTypeID": 30
        }
    ],
    "StatusTypeID": 50,
    "DateLastStatusUpdate": "2021-07-09T03:15:00Z",
    "MetadataValues": [
        {
            "ID": 11356,
            "MetadataFieldID": 4,
            "ItemValue": "Data from the German chargepoint registry provided by Bundesnetzagentur.de under the CC-BY 4.0 license"
        }
    ],
    "DataQualityLevel": 3,
    "DateCreated": "2021-07-08T09:59:00Z",
    "SubmissionStatusTypeID": 100
}