{
    "IsRecentlyVerified": false,
    "ID": 31161,
    "UUID": "07263E34-A8F9-43C2-AB50-80C0020DF370",
    "DataProviderID": 2,
    "DataProvidersReference": "64535",
    "OperatorID": 5,
    "UsageTypeID": 1,
    "AddressInfo": {
        "ID": 31507,
        "Title": "MELROSE MA",
        "AddressLine1": "26 Winthrop St",
        "Town": "Melrose",
        "StateOrProvince": "MA",
        "Postcode": "02176",
        "CountryID": 2,
        "Latitude": 42.4577311,
        "Longitude": -71.0650763,
        "ContactTelephone1": "888-758-4389",
        "AccessComments": "24 hours daily",
        "RelatedURL": "http://www.chargepoint.com/",
        "DistanceUnit": 0
    },
    "Connections": [
        {
            "ID": 34427,
            "ConnectionTypeID": 1,
            "LevelID": 2,
            "Amps": 16,
            "Voltage": 230,
            "PowerKW": 3,
            "CurrentTypeID": 10,
            "Quantity": 2
        }
    ],
    "DateLastStatusUpdate": "2019-12-24T09:20:00Z",
    "DataQualityLevel": 3,
    "DateCreated": "2014-12-11T07:11:00Z",
    "SubmissionStatusTypeID": 100
}