{
    "IsRecentlyVerified": false,
    "ID": 158710,
    "UUID": "143DB0B1-9D27-4391-AB7E-1C442093F045",
    "DataProviderID": 2,
    "DataProvidersReference": "153667",
    "OperatorID": 89,
    "UsageTypeID": 1,
    "AddressInfo": {
        "ID": 159067,
        "Title": "1747 S Barrington Ave",
        "AddressLine1": "1747 S Barrington Ave",
        "Town": "Los Angeles",
        "StateOrProvince": "CA",
        "Postcode": "90025",
        "CountryID": 2,
        "Latitude": 34.04016503,
        "Longitude": -118.4531084,
        "ContactTelephone1": "888-356-8911",
        "AccessComments": "24 hours daily",
        "RelatedURL": "https://flo.ca/",
        "DistanceUnit": 0
    },
    "Connections": [
        {
            "ID": 228734,
            "ConnectionTypeID": 1,
            "LevelID": 2,
            "Amps": 16,
            "Voltage": 230,
            "PowerKW": 3.7,
            "CurrentTypeID": 10,
            "Quantity": 1
        }
    ],
    "StatusTypeID": 50,
    "DateLastStatusUpdate": "2020-06-26T02:56:00Z",
    "DataQualityLevel": 3,
    "DateCreated": "2020-06-26T02:56:00Z",
    "SubmissionStatusTypeID": 100
}