{
    "IsRecentlyVerified": true,
    "DateLastVerified": "2021-10-24T06:22:00Z",
    "ID": 189672,
    "UUID": "8050FAB1-2D5C-4CF7-AC70-798F403F4A5E",
    "DataProviderID": 1,
    "OperatorID": 3271,
    "UsageTypeID": 4,
    "UsageCost": "1.95 RON/kWh DC, 1.45 RON/kWh AC",
    "AddressInfo": {
        "ID": 190031,
        "Title": "Kaufland Strada Narciselor",
        "AddressLine1": "Strada Narciselor",
        "Town": "Bacău",
        "StateOrProvince": "Bacău",
        "Postcode": "600339",
        "CountryID": 184,
        "Latitude": 46.53858439752162,
        "Longitude": 26.911845514914376,
        "DistanceUnit": 0
    },
    "Connections": [
        {
            "ID": 306834,
            "ConnectionTypeID": 25,
            "StatusTypeID": 50,
            "LevelID": 2,
            "Amps": 32,
            "Voltage": 400,
            "PowerKW": 22,
            "CurrentTypeID": 20,
            "Quantity": 2
        },
        {
            "ID": 306835,
            "ConnectionTypeID": 2,
            "StatusTypeID": 50,
            "LevelID": 3,
            "Amps": 120,
            "Voltage": 500,
            "PowerKW": 50,
            "CurrentTypeID": 30,
            "Quantity": 1
        },
        {
            "ID": 306836,
            "ConnectionTypeID": 33,
            "StatusTypeID": 50,
            "LevelID": 3,
            "Amps": 120,
            "Voltage": 500,
            "PowerKW": 50,
            "CurrentTypeID": 30,
            "Quantity": 1
        }
    ],
    "NumberOfPoints": 2,
    "StatusTypeID": 50,
    "DateLastStatusUpdate": "2021-10-24T22:19:00Z",
    "DataQualityLevel": 1,
    "DateCreated": "2021-10-24T06:22:00Z",
    "SubmissionStatusTypeID": 200
}