{
    "MediaItems": [
        {
            "ID": 19573,
            "ChargePointID": 131798,
            "ItemURL": "https://s3-ap-southeast-2.amazonaws.com/openchargemap/images/GB/OCM131798/OCM-131798.orig.2019091512154243.png",
            "ItemThumbnailURL": "https://s3-ap-southeast-2.amazonaws.com/openchargemap/images/GB/OCM131798/OCM-131798.thmb.2019091512154243.png",
            "Comment": "",
            "IsEnabled": true,
            "IsVideo": false,
            "IsFeaturedItem": false,
            "IsExternalResource": false,
            "User": {
                "ID": 22283,
                "Username": "nweddie"
            },
            "DateCreated": "2019-09-15T12:16:00Z"
        },
        {
            "ID": 19574,
            "ChargePointID": 131798,
            "ItemURL": "https://s3-ap-southeast-2.amazonaws.com/openchargemap/images/GB/OCM131798/OCM-131798.orig.2019091512160728.png",
            "ItemThumbnailURL": "https://s3-ap-southeast-2.amazonaws.com/openchargemap/images/GB/OCM131798/OCM-131798.thmb.2019091512160728.png",
            "Comment": "",
            "IsEnabled": true,
            "IsVideo": false,
            "IsFeaturedItem": false,
            "IsExternalResource": false,
            "User": {
                "ID": 22283,
                "Username": "nweddie"
            },
            "DateCreated": "2019-09-15T12:16:00Z"
        }
    ],
    "IsRecentlyVerified": false,
    "ID": 131798,
    "UUID": "FF4A637B-FD0F-411F-8877-893D0D948B75",
    "DataProviderID": 1,
    "OperatorID": 32,
    "OperatorsReference": "24593",
    "UsageTypeID": 5,
    "UsageCost": "£0.30/kWh; other tariffs available",
    "AddressInfo": {
        "ID": 132144,
        "Title": "Co-op",
        "AddressLine1": "16 High Street",
        "AddressLine2": "Caistor TC",
        "Town": "West Lindsey",
        "StateOrProvince": "Lincolnshire",
        "Postcode": "LN7 6BX",
        "CountryID": 1,
        "Latitude": 53.4982284474127,
        "Longitude": -0.315838835567092,
        "DistanceUnit": 0
    },
    "Connections": [
        {
            "ID": 184452,
            "ConnectionTypeID": 2,
            "StatusTypeID": 50,
            "LevelID": 3,
            "PowerKW": 50,
            "CurrentTypeID": 30,
            "Quantity": 1
        },
        {
            "ID": 184453,
            "ConnectionTypeID": 33,
            "StatusTypeID": 50,
            "LevelID": 3,
            "PowerKW": 50,
            "CurrentTypeID": 30,
            "Quantity": 1
        },
        {
            "ID": 184454,
            "ConnectionTypeID": 1036,
            "StatusTypeID": 50,
            "LevelID": 3,
            "Amps": 63,
            "Voltage": 400,
            "PowerKW": 43,
            "CurrentTypeID": 20,
            "Quantity": 1
        }
    ],
    "NumberOfPoints": 1,
    "GeneralComments": "Contactless payment terminal fitted, also available for Polar Plus members and Polar-instant pre-payment customers at lower tariffs.",
    "StatusTypeID": 50,
    "DateLastStatusUpdate": "2020-01-10T15:08:00Z",
    "DataQualityLevel": 1,
    "DateCreated": "2019-09-13T09:44:00Z",
    "SubmissionStatusTypeID": 200
}