{
    "IsRecentlyVerified": false,
    "ID": 138147,
    "UUID": "1F18AF35-4A71-42FC-AF58-D1A02BA8EA20",
    "DataProviderID": 2,
    "DataProvidersReference": "149053",
    "OperatorID": 39,
    "UsageTypeID": 1,
    "AddressInfo": {
        "ID": 138496,
        "Title": "Villa Regina Association",
        "AddressLine1": "1581 Brickell Avenue",
        "Town": "Miami",
        "StateOrProvince": "FL",
        "Postcode": "33129",
        "CountryID": 2,
        "Latitude": 25.7563377,
        "Longitude": -80.1934818,
        "ContactTelephone1": "800-663-5633",
        "AccessComments": "MO: Not Specified; TU: Not Specified; WE: Not Specified; TH: Not Specified; FR: Not Specified; SA: Not Specified; SU: Not Specified",
        "RelatedURL": "http://www.semacharge.com/",
        "DistanceUnit": 0
    },
    "Connections": [
        {
            "ID": 193209,
            "ConnectionTypeID": 1,
            "LevelID": 2,
            "Amps": 16,
            "Voltage": 230,
            "PowerKW": 3.7,
            "CurrentTypeID": 10,
            "Quantity": 1
        }
    ],
    "StatusTypeID": 50,
    "DateLastStatusUpdate": "2020-06-26T02:52:00Z",
    "DataQualityLevel": 3,
    "DateCreated": "2019-12-24T09:08:00Z",
    "SubmissionStatusTypeID": 100
}