{
    "IsRecentlyVerified": false,
    "ID": 113352,
    "UUID": "77E76201-864E-4CA8-A9B5-BFE2F55BB81F",
    "DataProviderID": 1,
    "OperatorID": 1,
    "UsageTypeID": 6,
    "UsageCost": "0",
    "AddressInfo": {
        "ID": 113698,
        "Title": "David L. Lawrence Convention Center Parking Garage",
        "AddressLine1": "1000 Ft. Duquesne Blvd",
        "Town": "Pittsburgh",
        "StateOrProvince": "PA",
        "Postcode": "15222",
        "CountryID": 2,
        "Latitude": 40.44510498342296,
        "Longitude": -79.99530905753329,
        "DistanceUnit": 0
    },
    "Connections": [
        {
            "ID": 159634,
            "ConnectionTypeID": 1,
            "StatusTypeID": 50,
            "LevelID": 2,
            "Quantity": 4
        },
        {
            "ID": 159635,
            "ConnectionTypeID": 8,
            "LevelID": 2,
            "Quantity": 4
        }
    ],
    "NumberOfPoints": 8,
    "GeneralComments": "4 Level 2 Universal Chargers and 4 Level 2 Tesla chargers",
    "StatusTypeID": 50,
    "DateLastStatusUpdate": "2018-12-05T20:20:00Z",
    "DataQualityLevel": 1,
    "DateCreated": "2018-12-04T13:26:00Z",
    "SubmissionStatusTypeID": 200
}