{
    "IsRecentlyVerified": false,
    "ID": 126225,
    "UUID": "EADF7C26-ABC4-4C8F-8828-FC48FF31B6FC",
    "DataProviderID": 1,
    "OperatorID": 3,
    "OperatorsReference": "PG-81846",
    "UsageTypeID": 4,
    "UsageCost": "£1.00/hour",
    "AddressInfo": {
        "ID": 126571,
        "Title": "Silver Sands Holiday Park",
        "AddressLine1": "Covesea West Beach",
        "Town": "Lossiemouth",
        "StateOrProvince": "Moray",
        "Postcode": "IV31 6SP",
        "CountryID": 1,
        "Latitude": 57.721317,
        "Longitude": -3.334746,
        "DistanceUnit": 0
    },
    "Connections": [
        {
            "ID": 176907,
            "ConnectionTypeID": 25,
            "StatusTypeID": 50,
            "LevelID": 2,
            "Amps": 32,
            "Voltage": 230,
            "PowerKW": 7,
            "CurrentTypeID": 10,
            "Quantity": 2
        }
    ],
    "NumberOfPoints": 2,
    "GeneralComments": "This is an open charge unit installed at the Silver Sands Holiday Park in Covesea West Beach, Lossiemouth, Moray",
    "StatusTypeID": 50,
    "DateLastStatusUpdate": "2019-05-13T14:55:00Z",
    "DataQualityLevel": 1,
    "DateCreated": "2019-05-13T14:55:00Z",
    "SubmissionStatusTypeID": 200
}