{
    "IsRecentlyVerified": false,
    "ID": 173811,
    "UUID": "F25DB46F-0F08-4826-A0AD-18627025F646",
    "DataProviderID": 19,
    "DataProvidersReference": "6980",
    "AddressInfo": {
        "ID": 174170,
        "Title": "Selfoss (Olís)",
        "AddressLine1": "Arnberg ",
        "Town": "Selfossi",
        "StateOrProvince": "Suðurland",
        "Postcode": "800",
        "CountryID": 105,
        "Latitude": 63.943806,
        "Longitude": -21.0086,
        "AccessComments": "",
        "DistanceUnit": 0
    },
    "Connections": [
        {
            "ID": 267240,
            "ConnectionTypeID": 25,
            "Reference": "1",
            "LevelID": 3,
            "Amps": 32,
            "Voltage": 400,
            "PowerKW": 22,
            "CurrentTypeID": 30,
            "Comments": "Mode 3"
        },
        {
            "ID": 267241,
            "ConnectionTypeID": 2,
            "Reference": "2",
            "LevelID": 3,
            "Amps": 100,
            "Voltage": 500,
            "PowerKW": 50,
            "CurrentTypeID": 30,
            "Comments": "Mode 4"
        },
        {
            "ID": 267242,
            "ConnectionTypeID": 33,
            "Reference": "3",
            "LevelID": 3,
            "Amps": 100,
            "Voltage": 500,
            "PowerKW": 50,
            "CurrentTypeID": 30,
            "Comments": "Mode 4"
        }
    ],
    "NumberOfPoints": 3,
    "StatusTypeID": 0,
    "DateLastStatusUpdate": "2021-03-04T05:39:00Z",
    "DataQualityLevel": 2,
    "DateCreated": "2021-03-04T05:39:00Z",
    "SubmissionStatusTypeID": 100
}