{
    "IsRecentlyVerified": false,
    "ID": 75096,
    "UUID": "ABEB4711-FE9A-40C2-91C0-62E65D8694E0",
    "DataProviderID": 1,
    "OperatorID": 23,
    "OperatorsReference": "21446",
    "UsageTypeID": 6,
    "UsageCost": "Free",
    "AddressInfo": {
        "ID": 75442,
        "Title": "Sinatur Hotel Haraldskær",
        "AddressLine1": "140 Skibetvej",
        "Town": "Vejle",
        "Postcode": "7100",
        "CountryID": 65,
        "Latitude": 55.702401,
        "Longitude": 9.439544,
        "ContactTelephone1": "+45 76 49 60 00",
        "DistanceUnit": 0
    },
    "Connections": [
        {
            "ID": 108298,
            "ConnectionTypeID": 30,
            "StatusTypeID": 50,
            "LevelID": 2,
            "Amps": 32,
            "Voltage": 400,
            "PowerKW": 22,
            "CurrentTypeID": 20,
            "Quantity": 1
        }
    ],
    "NumberOfPoints": 1,
    "GeneralComments": "1 Tesla Connector, up to 22kW.Available for patrons only. Please call ahead.",
    "StatusTypeID": 50,
    "DateLastStatusUpdate": "2018-10-03T15:27:00Z",
    "DataQualityLevel": 1,
    "DateCreated": "2016-12-11T18:19:00Z",
    "SubmissionStatusTypeID": 200
}