{
    "IsRecentlyVerified": false,
    "ID": 131714,
    "UUID": "DF4D1F94-2CAF-436A-A1CE-3DA475F807F9",
    "DataProviderID": 1,
    "OperatorID": 80,
    "UsageTypeID": 4,
    "AddressInfo": {
        "ID": 132060,
        "Title": "U2 Supermercato Magnago | EnelX",
        "AddressLine1": "Via Guglielmo Marconi, 93/95",
        "Town": "Magnago",
        "StateOrProvince": "MI",
        "Postcode": "20020",
        "CountryID": 112,
        "Latitude": 45.5771594513833,
        "Longitude": 8.79297739560127,
        "RelatedURL": "https://www.enelx.com/it/it/emobility",
        "DistanceUnit": 0
    },
    "Connections": [
        {
            "ID": 184351,
            "ConnectionTypeID": 25,
            "StatusTypeID": 50,
            "LevelID": 2,
            "Amps": 32,
            "Voltage": 400,
            "PowerKW": 22,
            "CurrentTypeID": 20,
            "Quantity": 3
        },
        {
            "ID": 184352,
            "ConnectionTypeID": 36,
            "StatusTypeID": 50,
            "LevelID": 2,
            "Amps": 16,
            "Voltage": 240,
            "PowerKW": 3.7,
            "CurrentTypeID": 10,
            "Quantity": 1
        }
    ],
    "NumberOfPoints": 4,
    "GeneralComments": "LUN -SAB 08:00 - 20:00 ; DOM 08:30 -13:00",
    "StatusTypeID": 50,
    "DateLastStatusUpdate": "2019-09-11T13:40:00Z",
    "DataQualityLevel": 1,
    "DateCreated": "2019-09-11T13:39:00Z",
    "SubmissionStatusTypeID": 200
}