{
    "IsRecentlyVerified": false,
    "ID": 188341,
    "UUID": "BF34FD86-BFEB-45B4-A22A-0BC45034C24F",
    "DataProviderID": 1,
    "OperatorID": 21,
    "UsageTypeID": 4,
    "UsageCost": "Mobi.E compatible card or App",
    "AddressInfo": {
        "ID": 188700,
        "Title": "AMR-00004 - Intermarché",
        "AddressLine1": "Intermarché",
        "Town": "Amares",
        "StateOrProvince": "Braga",
        "Postcode": "4720",
        "CountryID": 180,
        "Latitude": 41.62570579548182,
        "Longitude": -8.360414345785557,
        "DistanceUnit": 0
    },
    "Connections": [
        {
            "ID": 304065,
            "ConnectionTypeID": 25,
            "StatusTypeID": 50,
            "LevelID": 2,
            "Amps": 32,
            "Voltage": 400,
            "PowerKW": 22,
            "CurrentTypeID": 20,
            "Quantity": 2
        }
    ],
    "NumberOfPoints": 2,
    "StatusTypeID": 50,
    "DateLastStatusUpdate": "2021-07-18T13:50:00Z",
    "DataQualityLevel": 1,
    "DateCreated": "2021-07-18T13:50:00Z",
    "SubmissionStatusTypeID": 200
}