{
    "UserComments": [
        {
            "ID": 4214,
            "ChargePointID": 18350,
            "CommentTypeID": 10,
            "UserName": "Nick_T",
            "Comment": "",
            "Rating": 5,
            "DateCreated": "2015-04-13T02:44:03.63Z",
            "User": {
                "ID": 4509,
                "Username": "Nick_T"
            },
            "CheckinStatusTypeID": 140
        }
    ],
    "MediaItems": [
        {
            "ID": 1206,
            "ChargePointID": 18350,
            "ItemURL": "https://s3-ap-southeast-2.amazonaws.com/openchargemap/images/US/OCM18350/OCM-18350.orig.2015041302243130.jpg",
            "ItemThumbnailURL": "https://s3-ap-southeast-2.amazonaws.com/openchargemap/images/US/OCM18350/OCM-18350.thmb.2015041302243130.jpg",
            "Comment": "",
            "IsEnabled": true,
            "IsVideo": false,
            "IsFeaturedItem": false,
            "IsExternalResource": false,
            "User": {
                "ID": 4509,
                "Username": "Nick_T"
            },
            "DateCreated": "2015-04-13T02:25:00Z"
        },
        {
            "ID": 1207,
            "ChargePointID": 18350,
            "ItemURL": "https://s3-ap-southeast-2.amazonaws.com/openchargemap/images/US/OCM18350/OCM-18350.orig.2015041302251514.jpg",
            "ItemThumbnailURL": "https://s3-ap-southeast-2.amazonaws.com/openchargemap/images/US/OCM18350/OCM-18350.thmb.2015041302251514.jpg",
            "Comment": "",
            "IsEnabled": true,
            "IsVideo": false,
            "IsFeaturedItem": false,
            "IsExternalResource": false,
            "User": {
                "ID": 4509,
                "Username": "Nick_T"
            },
            "DateCreated": "2015-04-13T02:25:00Z"
        }
    ],
    "IsRecentlyVerified": false,
    "ID": 18350,
    "UUID": "D5589FDE-AE62-49A5-B31E-A5CBE4C8665B",
    "DataProviderID": 1,
    "OperatorID": 23,
    "OperatorsReference": "6326",
    "UsageTypeID": 1,
    "UsageCost": "$0.25/kWh; other tariffs for older cars",
    "AddressInfo": {
        "ID": 18695,
        "Title": "Burlington Supercharger",
        "AddressLine1": "9384 Old Highway 99",
        "Town": "North Burlington",
        "StateOrProvince": "Washington State",
        "Postcode": "98233",
        "CountryID": 2,
        "Latitude": 48.509771,
        "Longitude": -122.338627,
        "ContactEmail": "supercharger@teslamotors.com",
        "AccessComments": "From I-5 N  :  Take exit 232 for Cook Rd toward Sedro-Woolley;     Turn right onto Cook Rd;     Take the 1st left onto Burlington Alger Rd;     Turn left into second driveway toward Fairfield Inn;     Supercharger will be on the left.     /   From I-5S :      Take exit 232 for Cook Rd toward Sedro-Woolley;     Turn left onto Cook Rd;     Take the 2nd left onto Burlington Alger Rd;     Turn left into second driveway toward Fairfield Inn;     Supercharger will be on the left.",
        "RelatedURL": "http://www.teslamotors.com/supercharger",
        "DistanceUnit": 0
    },
    "Connections": [
        {
            "ID": 18572,
            "ConnectionTypeID": 27,
            "StatusTypeID": 50,
            "LevelID": 3,
            "Amps": 225,
            "Voltage": 400,
            "PowerKW": 120,
            "CurrentTypeID": 30,
            "Quantity": 8
        }
    ],
    "NumberOfPoints": 8,
    "GeneralComments": "24 hrs/day",
    "StatusTypeID": 50,
    "DateLastStatusUpdate": "2018-03-13T14:00:00Z",
    "DataQualityLevel": 1,
    "DateCreated": "2013-07-18T23:06:00Z",
    "SubmissionStatusTypeID": 200
}