{
    "IsRecentlyVerified": false,
    "ID": 137840,
    "UUID": "48E38632-8F55-4D10-BA59-F1C909CD3A6C",
    "DataProviderID": 2,
    "DataProvidersReference": "95906",
    "OperatorID": 9,
    "UsageTypeID": 1,
    "AddressInfo": {
        "ID": 138189,
        "Title": "Comfort Suites - Las Colinas Center",
        "AddressLine1": "1223 Greenway Drive",
        "Town": "Irving",
        "StateOrProvince": "TX",
        "Postcode": "75038",
        "CountryID": 2,
        "Latitude": 32.88996,
        "Longitude": -96.966552,
        "ContactTelephone1": "888-998-2546",
        "AccessComments": "MON: 24 hours | TUE: 24 hours | WED: 24 hours | THU: 24 hours | FRI: 24 hours | SAT: 24 hours | SUN: 24 hours",
        "RelatedURL": "http://www.blinkcharging.com/",
        "DistanceUnit": 0
    },
    "Connections": [
        {
            "ID": 192852,
            "ConnectionTypeID": 1,
            "LevelID": 2,
            "Amps": 16,
            "Voltage": 230,
            "PowerKW": 3,
            "CurrentTypeID": 10,
            "Quantity": 2
        }
    ],
    "StatusTypeID": 50,
    "DateLastStatusUpdate": "2019-12-24T09:06:00Z",
    "DataQualityLevel": 3,
    "DateCreated": "2019-12-24T09:06:00Z",
    "SubmissionStatusTypeID": 100
}