{
    "IsRecentlyVerified": true,
    "DateLastVerified": "2021-09-01T20:09:00Z",
    "ID": 189025,
    "UUID": "AF0AD4ED-679B-4B2C-A64E-ED6D4BAC2EC1",
    "DataProviderID": 1,
    "OperatorID": 3471,
    "UsageTypeID": 5,
    "UsageCost": "£0.39/kWh",
    "AddressInfo": {
        "ID": 189384,
        "Title": "MFG Eastern Avenue",
        "AddressLine1": "Eastern Avenue",
        "AddressLine2": "Redbridge",
        "Town": "London",
        "StateOrProvince": "England",
        "Postcode": "IG4 5AQ",
        "CountryID": 1,
        "Latitude": 51.5757770196617,
        "Longitude": 0.04634397637414622,
        "DistanceUnit": 0
    },
    "Connections": [
        {
            "ID": 305530,
            "ConnectionTypeID": 33,
            "StatusTypeID": 50,
            "LevelID": 3,
            "PowerKW": 150,
            "CurrentTypeID": 30,
            "Quantity": 5
        },
        {
            "ID": 305531,
            "ConnectionTypeID": 2,
            "StatusTypeID": 50,
            "LevelID": 3,
            "PowerKW": 100,
            "CurrentTypeID": 30,
            "Quantity": 5
        }
    ],
    "NumberOfPoints": 5,
    "StatusTypeID": 50,
    "DateLastStatusUpdate": "2021-09-01T20:09:00Z",
    "DataQualityLevel": 1,
    "DateCreated": "2021-09-01T20:09:00Z",
    "SubmissionStatusTypeID": 200
}