{
    "IsRecentlyVerified": false,
    "ID": 123362,
    "UUID": "2504A949-BF81-4E1D-BA9A-78FA72B7C5D5",
    "DataProviderID": 2,
    "DataProvidersReference": "65453",
    "OperatorID": 5,
    "UsageTypeID": 1,
    "AddressInfo": {
        "ID": 123708,
        "Title": "UNLV",
        "AddressLine1": "859-899 NV-592",
        "Town": "Las Vegas",
        "StateOrProvince": "NV",
        "Postcode": "89119",
        "CountryID": 2,
        "Latitude": 36.1136107,
        "Longitude": -115.1448857,
        "ContactTelephone1": "888-758-4389",
        "AccessComments": "24 hours daily",
        "RelatedURL": "http://www.chargepoint.com/",
        "DistanceUnit": 0
    },
    "Connections": [
        {
            "ID": 173330,
            "ConnectionTypeID": 1,
            "LevelID": 2,
            "Amps": 16,
            "Voltage": 230,
            "PowerKW": 3,
            "CurrentTypeID": 10,
            "Quantity": 2
        }
    ],
    "DateLastStatusUpdate": "2019-04-06T05:03:00Z",
    "DataQualityLevel": 3,
    "DateCreated": "2019-04-06T05:03:00Z",
    "SubmissionStatusTypeID": 100
}