{
    "IsRecentlyVerified": false,
    "ID": 186726,
    "UUID": "0B432B9D-BA14-402C-A177-5D80AEFE06A1",
    "DataProviderID": 29,
    "DataProvidersReference": "20172",
    "OperatorID": 45,
    "AddressInfo": {
        "ID": 187085,
        "Title": "Fichtenbreite 5",
        "AddressLine1": "Fichtenbreite 5",
        "Town": "Coswig",
        "Postcode": "06869",
        "CountryID": 87,
        "Latitude": 51.887723,
        "Longitude": 12.405792,
        "DistanceUnit": 0
    },
    "Connections": [
        {
            "ID": 300001,
            "ConnectionTypeID": 25,
            "StatusTypeID": 50,
            "LevelID": 2,
            "PowerKW": 22,
            "CurrentTypeID": 20
        },
        {
            "ID": 300002,
            "ConnectionTypeID": 1036,
            "StatusTypeID": 50,
            "LevelID": 2,
            "PowerKW": 22,
            "CurrentTypeID": 20
        }
    ],
    "StatusTypeID": 50,
    "DateLastStatusUpdate": "2021-07-12T02:48:00Z",
    "MetadataValues": [
        {
            "ID": 18967,
            "MetadataFieldID": 4,
            "ItemValue": "Data from the German chargepoint registry provided by Bundesnetzagentur.de under the CC-BY 4.0 license"
        }
    ],
    "DataQualityLevel": 3,
    "DateCreated": "2021-07-12T02:48:00Z",
    "SubmissionStatusTypeID": 100
}