{
    "IsRecentlyVerified": false,
    "ID": 185332,
    "UUID": "5F94522C-90BB-4F05-99CD-90D240FF4231",
    "DataProviderID": 29,
    "DataProvidersReference": "18038",
    "OperatorID": 154,
    "AddressInfo": {
        "ID": 185691,
        "Title": "Fischerweg 408",
        "AddressLine1": "Fischerweg 408",
        "Town": "Rostock",
        "Postcode": "18069",
        "CountryID": 87,
        "Latitude": 54.117541,
        "Longitude": 12.084576,
        "DistanceUnit": 0
    },
    "Connections": [
        {
            "ID": 294691,
            "ConnectionTypeID": 25,
            "StatusTypeID": 50,
            "LevelID": 2,
            "PowerKW": 22,
            "CurrentTypeID": 20
        },
        {
            "ID": 294692,
            "ConnectionTypeID": 25,
            "StatusTypeID": 50,
            "LevelID": 2,
            "PowerKW": 22,
            "CurrentTypeID": 20
        }
    ],
    "StatusTypeID": 50,
    "DateLastStatusUpdate": "2021-07-09T03:30:00Z",
    "MetadataValues": [
        {
            "ID": 17623,
            "MetadataFieldID": 4,
            "ItemValue": "Data from the German chargepoint registry provided by Bundesnetzagentur.de under the CC-BY 4.0 license"
        }
    ],
    "DataQualityLevel": 3,
    "DateCreated": "2021-07-08T10:06:00Z",
    "SubmissionStatusTypeID": 100
}