{
    "IsRecentlyVerified": false,
    "ID": 45721,
    "UUID": "C3C0F58C-EC37-41A8-B82A-71B20FAA7B56",
    "DataProviderID": 1,
    "DataProvidersReference": "1258",
    "AddressInfo": {
        "ID": 46067,
        "Title": "Dahlske VGS",
        "AddressLine1": "Terje Løvås vei ",
        "Town": "GRIMSTAD",
        "StateOrProvince": "Agder",
        "Postcode": "4877",
        "CountryID": 168,
        "Latitude": 58.339022,
        "Longitude": 8.577835,
        "AccessComments": "",
        "DistanceUnit": 0
    },
    "Connections": [
        {
            "ID": 56384,
            "ConnectionTypeID": 0,
            "Reference": "3",
            "LevelID": 2,
            "Amps": 32,
            "Voltage": 230,
            "PowerKW": 7.4,
            "Comments": "Mode 3"
        },
        {
            "ID": 87955,
            "ConnectionTypeID": 0,
            "Reference": "4",
            "LevelID": 2,
            "Amps": 32,
            "Voltage": 230,
            "PowerKW": 7.4,
            "Comments": "Mode 3"
        },
        {
            "ID": 221647,
            "ConnectionTypeID": 0,
            "Reference": "5",
            "LevelID": 2,
            "Amps": 32,
            "Voltage": 230,
            "PowerKW": 7.4,
            "Comments": "Mode 3"
        },
        {
            "ID": 221648,
            "ConnectionTypeID": 0,
            "Reference": "6",
            "LevelID": 2,
            "Amps": 32,
            "Voltage": 230,
            "PowerKW": 7.4,
            "Comments": "Mode 3"
        }
    ],
    "NumberOfPoints": 6,
    "DateLastStatusUpdate": "2020-05-26T08:22:00Z",
    "DataQualityLevel": 2,
    "DateCreated": "2015-05-03T00:54:00Z",
    "SubmissionStatusTypeID": 100
}