{
    "IsRecentlyVerified": false,
    "ID": 154285,
    "UUID": "D6D8D59B-5992-4BA2-8D78-22CA6C66C986",
    "DataProviderID": 28,
    "DataProvidersReference": "FR*S27*PCONTEVILLE*PRESBYTERE",
    "UsageTypeID": 5,
    "AddressInfo": {
        "ID": 154638,
        "Title": "900028",
        "AddressLine1": "Place du Prebytere Conteville",
        "CountryID": 80,
        "Latitude": 49.417993,
        "Longitude": 0.397276,
        "AccessComments": "24/24 7/7 jours",
        "DistanceUnit": 0
    },
    "Connections": [
        {
            "ID": 216894,
            "ConnectionTypeID": 28,
            "StatusTypeID": 50,
            "LevelID": 2,
            "PowerKW": 22,
            "CurrentTypeID": 10
        },
        {
            "ID": 216895,
            "ConnectionTypeID": 1036,
            "StatusTypeID": 50,
            "LevelID": 2,
            "PowerKW": 22,
            "CurrentTypeID": 20
        }
    ],
    "GeneralComments": "Borne en service",
    "StatusTypeID": 50,
    "DateLastStatusUpdate": "2020-08-27T05:16:00Z",
    "DataQualityLevel": 2,
    "DateCreated": "2020-03-15T10:55:00Z",
    "SubmissionStatusTypeID": 100
}