{
    "IsRecentlyVerified": false,
    "ID": 122324,
    "UUID": "F0E9521C-E63C-40A8-928F-C69128E3D9F4",
    "DataProviderID": 2,
    "DataProvidersReference": "99260",
    "OperatorID": 59,
    "UsageTypeID": 1,
    "AddressInfo": {
        "ID": 122670,
        "Title": "Greenlots - 122050",
        "AddressLine1": "218 N Larchmont Blvd",
        "Town": "LA",
        "StateOrProvince": "CA",
        "Postcode": "90004",
        "CountryID": 2,
        "Latitude": 34.075465,
        "Longitude": -118.32344,
        "ContactTelephone1": "855-900-7584",
        "AccessComments": "24 hours daily",
        "RelatedURL": "http://greenlots.com/",
        "DistanceUnit": 0
    },
    "Connections": [
        {
            "ID": 172206,
            "ConnectionTypeID": 1,
            "LevelID": 2,
            "Amps": 16,
            "Voltage": 230,
            "PowerKW": 3.7,
            "CurrentTypeID": 10,
            "Quantity": 2
        }
    ],
    "DateLastStatusUpdate": "2020-06-26T02:57:00Z",
    "DataQualityLevel": 3,
    "DateCreated": "2019-04-06T05:03:00Z",
    "SubmissionStatusTypeID": 100
}