{
    "IsRecentlyVerified": false,
    "ID": 70102,
    "UUID": "82AF3FB2-90BD-4F7D-A769-87FA073793A0",
    "DataProviderID": 1,
    "OperatorID": 214,
    "UsageTypeID": 4,
    "AddressInfo": {
        "ID": 70448,
        "Title": "Andreasstraße",
        "AddressLine1": "Andreasstraße 47",
        "StateOrProvince": "Berlin",
        "Postcode": "10243",
        "CountryID": 87,
        "Latitude": 52.51705,
        "Longitude": 13.432329999999979,
        "AccessComments": "24/7 nutzbar mit The New Motion Karte, PlugSurfing Keyhanger u.a. Karten\r\n",
        "DistanceUnit": 0
    },
    "Connections": [
        {
            "ID": 100013,
            "ConnectionTypeID": 25,
            "StatusTypeID": 50,
            "LevelID": 2,
            "Amps": 16,
            "Voltage": 400,
            "PowerKW": 11,
            "CurrentTypeID": 20,
            "Quantity": 2
        }
    ],
    "NumberOfPoints": 2,
    "StatusTypeID": 50,
    "DateLastStatusUpdate": "2016-07-07T15:06:00Z",
    "DataQualityLevel": 1,
    "DateCreated": "2016-07-07T15:06:00Z",
    "SubmissionStatusTypeID": 200
}