{
    "IsRecentlyVerified": false,
    "ID": 89959,
    "UUID": "B3B5B707-9DB2-4555-8858-C45A4FEA8B62",
    "DataProviderID": 1,
    "OperatorID": 45,
    "UsageTypeID": 1,
    "AddressInfo": {
        "ID": 90305,
        "Title": "Stoppustöð Sundlaugin Þorlákshöfn",
        "AddressLine1": "Hafnarberg 43",
        "Town": "Þorlákshöfn",
        "CountryID": 105,
        "Latitude": 63.852464,
        "Longitude": -21.382501,
        "ContactTelephone1": "480 3800",
        "DistanceUnit": 0
    },
    "Connections": [
        {
            "ID": 127515,
            "ConnectionTypeID": 25,
            "StatusTypeID": 50,
            "LevelID": 2,
            "PowerKW": 22,
            "CurrentTypeID": 20
        }
    ],
    "NumberOfPoints": 1,
    "GeneralComments": "Það þarf kort sem er í afgreiðslu sundlaugar",
    "StatusTypeID": 50,
    "DateLastStatusUpdate": "2017-07-01T23:24:00Z",
    "DataQualityLevel": 1,
    "DateCreated": "2017-07-01T22:50:00Z",
    "SubmissionStatusTypeID": 200
}