{
    "IsRecentlyVerified": false,
    "ID": 94041,
    "UUID": "2027F386-4D93-4C85-B28F-F26A34D0F983",
    "DataProviderID": 1,
    "OperatorID": 23,
    "OperatorsReference": "36266",
    "UsageTypeID": 6,
    "AddressInfo": {
        "ID": 94387,
        "Title": "Hotel Verona",
        "AddressLine1": "Corso Porta Nuova",
        "Town": "47",
        "StateOrProvince": "Verona",
        "Postcode": "37122",
        "CountryID": 112,
        "Latitude": 45.435417,
        "Longitude": 10.990417,
        "ContactTelephone1": "+39 0455 959 44",
        "DistanceUnit": 0
    },
    "Connections": [
        {
            "ID": 133095,
            "ConnectionTypeID": 30,
            "StatusTypeID": 50,
            "LevelID": 2,
            "Amps": 16,
            "Voltage": 400,
            "PowerKW": 11,
            "CurrentTypeID": 20,
            "Quantity": 1
        }
    ],
    "NumberOfPoints": 1,
    "GeneralComments": "1 Tesla Connector, up to 11kW.Available for patrons only. Please call ahead.",
    "StatusTypeID": 50,
    "DateLastStatusUpdate": "2018-10-03T14:04:00Z",
    "DataQualityLevel": 1,
    "DateCreated": "2017-10-14T05:42:00Z",
    "SubmissionStatusTypeID": 200
}