{
    "IsRecentlyVerified": false,
    "ID": 160083,
    "UUID": "A0302A3F-396D-440B-B323-A931EC5D72CB",
    "DataProviderID": 2,
    "DataProvidersReference": "155617",
    "OperatorID": 5,
    "UsageTypeID": 1,
    "AddressInfo": {
        "ID": 160440,
        "Title": "MARKET 32 EV",
        "AddressLine1": "461 Nott St",
        "Town": "Schenectady",
        "StateOrProvince": "NY",
        "Postcode": "12308",
        "CountryID": 2,
        "Latitude": 42.821842,
        "Longitude": -73.932663,
        "ContactTelephone1": "888-758-4389",
        "AccessComments": "24 hours daily",
        "RelatedURL": "http://www.chargepoint.com/",
        "DistanceUnit": 0
    },
    "Connections": [
        {
            "ID": 230319,
            "ConnectionTypeID": 1,
            "LevelID": 2,
            "Amps": 16,
            "Voltage": 230,
            "PowerKW": 3.7,
            "CurrentTypeID": 10,
            "Quantity": 4
        }
    ],
    "StatusTypeID": 50,
    "DateLastStatusUpdate": "2020-06-26T03:06:00Z",
    "DataQualityLevel": 3,
    "DateCreated": "2020-06-26T03:06:00Z",
    "SubmissionStatusTypeID": 100
}