{
    "IsRecentlyVerified": false,
    "ID": 176808,
    "UUID": "01D14DE4-B85B-4730-B5FC-F36F450E911D",
    "DataProviderID": 29,
    "DataProvidersReference": "5500",
    "OperatorID": 86,
    "AddressInfo": {
        "ID": 177167,
        "Title": "Kirchplatz 4",
        "AddressLine1": "Kirchplatz 4",
        "Town": "Wolpertswende",
        "Postcode": "88284",
        "CountryID": 87,
        "Latitude": 47.89436,
        "Longitude": 9.61259,
        "DistanceUnit": 0
    },
    "Connections": [
        {
            "ID": 275168,
            "ConnectionTypeID": 25,
            "StatusTypeID": 50,
            "LevelID": 2,
            "PowerKW": 22,
            "CurrentTypeID": 20
        },
        {
            "ID": 275169,
            "ConnectionTypeID": 25,
            "StatusTypeID": 50,
            "LevelID": 2,
            "PowerKW": 22,
            "CurrentTypeID": 20
        }
    ],
    "StatusTypeID": 0,
    "DateLastStatusUpdate": "2021-07-09T03:10:00Z",
    "MetadataValues": [
        {
            "ID": 9103,
            "MetadataFieldID": 4,
            "ItemValue": "Data from the German chargepoint registry provided by Bundesnetzagentur.de under the CC-BY 4.0 license"
        }
    ],
    "DataQualityLevel": 3,
    "DateCreated": "2021-07-08T09:48:00Z",
    "SubmissionStatusTypeID": 100
}