{
    "IsRecentlyVerified": false,
    "ID": 179871,
    "UUID": "CF4D377A-7FE1-41A7-92FC-F381C4997C84",
    "DataProviderID": 29,
    "DataProvidersReference": "10423",
    "OperatorID": 1240,
    "AddressInfo": {
        "ID": 180230,
        "Title": "Hauptstraße 18",
        "AddressLine1": "Hauptstraße 18",
        "Town": "Enkenbach-Alsenborn",
        "Postcode": "67677",
        "CountryID": 87,
        "Latitude": 49.486911,
        "Longitude": 7.897609,
        "DistanceUnit": 0
    },
    "Connections": [
        {
            "ID": 282257,
            "ConnectionTypeID": 25,
            "StatusTypeID": 50,
            "LevelID": 2,
            "PowerKW": 22,
            "CurrentTypeID": 20
        },
        {
            "ID": 282258,
            "ConnectionTypeID": 33,
            "StatusTypeID": 50,
            "LevelID": 3,
            "PowerKW": 50,
            "CurrentTypeID": 30
        }
    ],
    "StatusTypeID": 50,
    "DateLastStatusUpdate": "2021-07-09T03:17:00Z",
    "MetadataValues": [
        {
            "ID": 12165,
            "MetadataFieldID": 4,
            "ItemValue": "Data from the German chargepoint registry provided by Bundesnetzagentur.de under the CC-BY 4.0 license"
        }
    ],
    "DataQualityLevel": 3,
    "DateCreated": "2021-07-08T10:00:00Z",
    "SubmissionStatusTypeID": 100
}