{
    "IsRecentlyVerified": false,
    "ID": 171981,
    "UUID": "032FE284-47FD-413F-A68C-3DE4360F72B4",
    "DataProviderID": 1,
    "OperatorID": 3279,
    "UsageTypeID": 4,
    "UsageCost": "€0/kWh",
    "AddressInfo": {
        "ID": 172340,
        "Title": "Pdr estacion teruel",
        "AddressLine1": "Camino de la Estación",
        "Town": "Teruel",
        "StateOrProvince": "Aragon",
        "Postcode": "44003",
        "CountryID": 210,
        "Latitude": 40.34100181257105,
        "Longitude": -1.1088821087269025,
        "DistanceUnit": 0
    },
    "Connections": [
        {
            "ID": 262840,
            "ConnectionTypeID": 25,
            "StatusTypeID": 150,
            "LevelID": 2,
            "Amps": 32,
            "Voltage": 400,
            "PowerKW": 22,
            "CurrentTypeID": 20,
            "Quantity": 2
        }
    ],
    "NumberOfPoints": 2,
    "StatusTypeID": 150,
    "DateLastStatusUpdate": "2021-01-10T12:32:00Z",
    "DataQualityLevel": 1,
    "DateCreated": "2021-01-10T12:32:00Z",
    "SubmissionStatusTypeID": 200
}