{
    "MediaItems": [
        {
            "ID": 22248,
            "ChargePointID": 146672,
            "ItemURL": "https://s3-ap-southeast-2.amazonaws.com/openchargemap/images/IT/OCM146672/OCM-146672.orig.2020050907072790.jpg",
            "ItemThumbnailURL": "https://s3-ap-southeast-2.amazonaws.com/openchargemap/images/IT/OCM146672/OCM-146672.thmb.2020050907072790.jpg",
            "Comment": "",
            "IsEnabled": true,
            "IsVideo": false,
            "IsFeaturedItem": false,
            "IsExternalResource": false,
            "User": {
                "ID": 25708,
                "Username": "MaxMax2020"
            },
            "DateCreated": "2020-05-09T07:07:00Z"
        }
    ],
    "IsRecentlyVerified": false,
    "ID": 146672,
    "UUID": "BC7CAAA7-5A2E-4357-BF85-0C381F5C4C5A",
    "DataProviderID": 1,
    "OperatorID": 3327,
    "UsageTypeID": 4,
    "AddressInfo": {
        "ID": 147024,
        "Title": "VIGONZA Costituzione | BECHARGE",
        "AddressLine1": "Via della Costituzione",
        "Town": "Vigonza",
        "StateOrProvince": "PD",
        "Postcode": "35010",
        "CountryID": 112,
        "Latitude": 45.442531307756184,
        "Longitude": 11.984523449424842,
        "ContactTelephone1": "02-49527730",
        "ContactEmail": "emobility@buildingenergy.it",
        "RelatedURL": "https://www.bec.energy/",
        "DistanceUnit": 0
    },
    "Connections": [
        {
            "ID": 203942,
            "ConnectionTypeID": 25,
            "StatusTypeID": 50,
            "LevelID": 2,
            "Amps": 32,
            "Voltage": 400,
            "PowerKW": 22,
            "CurrentTypeID": 20,
            "Quantity": 4
        }
    ],
    "NumberOfPoints": 4,
    "StatusTypeID": 50,
    "DateLastStatusUpdate": "2020-05-09T09:01:00Z",
    "DataQualityLevel": 1,
    "DateCreated": "2020-01-13T14:05:00Z",
    "SubmissionStatusTypeID": 200
}