{
    "IsRecentlyVerified": false,
    "ID": 133033,
    "UUID": "04C9FB2B-5081-415F-A547-856C4599207B",
    "DataProviderID": 1,
    "OperatorID": 23,
    "OperatorsReference": "52054",
    "UsageTypeID": 4,
    "AddressInfo": {
        "ID": 133379,
        "Title": "Omni Bedford Springs Resort & Spa",
        "AddressLine1": "2138 Business Route 220",
        "Town": "Bedford",
        "StateOrProvince": "Pennsylvania",
        "Postcode": "15522",
        "CountryID": 2,
        "Latitude": 39.996246,
        "Longitude": -78.507402,
        "ContactTelephone1": "(866) 703-8446 ",
        "DistanceUnit": 0
    },
    "Connections": [
        {
            "ID": 186314,
            "ConnectionTypeID": 30,
            "StatusTypeID": 50,
            "LevelID": 2,
            "PowerKW": 14,
            "CurrentTypeID": 20,
            "Quantity": 2
        }
    ],
    "NumberOfPoints": 2,
    "GeneralComments": "2 Tesla Connectors, up to 14kW.Available to the public. Please see valet.",
    "StatusTypeID": 50,
    "DateLastStatusUpdate": "2019-10-12T05:43:00Z",
    "DataQualityLevel": 1,
    "DateCreated": "2019-10-12T05:43:00Z",
    "SubmissionStatusTypeID": 200
}