{
    "IsRecentlyVerified": false,
    "ID": 140142,
    "UUID": "EA60BBD6-3961-4A29-AD35-2960684026C4",
    "DataProviderID": 2,
    "DataProvidersReference": "95762",
    "OperatorID": 9,
    "UsageTypeID": 1,
    "AddressInfo": {
        "ID": 140494,
        "Title": "Memphis Bioworks Foundation",
        "AddressLine1": "20 South Dudley St., Suite 900",
        "Town": "Memphis",
        "StateOrProvince": "TN",
        "Postcode": "38103",
        "CountryID": 2,
        "Latitude": 35.139481,
        "Longitude": -90.029555,
        "ContactTelephone1": "888-998-2546",
        "AccessComments": "MON: 24 hours | TUE: 24 hours | WED: 24 hours | THU: 24 hours | FRI: 24 hours | SAT: 24 hours | SUN: 24 hours",
        "RelatedURL": "http://www.blinkcharging.com/",
        "DistanceUnit": 0
    },
    "Connections": [
        {
            "ID": 195701,
            "ConnectionTypeID": 1,
            "LevelID": 2,
            "Amps": 16,
            "Voltage": 230,
            "PowerKW": 3.7,
            "CurrentTypeID": 10,
            "Quantity": 2
        }
    ],
    "StatusTypeID": 50,
    "DateLastStatusUpdate": "2020-06-26T02:57:00Z",
    "DataQualityLevel": 3,
    "DateCreated": "2019-12-24T09:12:00Z",
    "SubmissionStatusTypeID": 100
}