{
    "MediaItems": [
        {
            "ID": 15132,
            "ChargePointID": 91634,
            "ItemURL": "https://s3-ap-southeast-2.amazonaws.com/openchargemap/images/DE/OCM91634/OCM-91634.orig.2018030118154689.jpeg",
            "ItemThumbnailURL": "https://s3-ap-southeast-2.amazonaws.com/openchargemap/images/DE/OCM91634/OCM-91634.thmb.2018030118154689.jpeg",
            "Comment": "",
            "IsEnabled": true,
            "IsVideo": false,
            "IsFeaturedItem": false,
            "IsExternalResource": false,
            "User": {
                "ID": 18073,
                "Username": "Dopes"
            },
            "DateCreated": "2018-03-01T18:16:00Z"
        }
    ],
    "IsRecentlyVerified": false,
    "ID": 91634,
    "UUID": "E2596DD5-1EC8-4C3B-882E-E708965BB1B2",
    "DataProviderID": 1,
    "OperatorID": 3248,
    "UsageTypeID": 1,
    "AddressInfo": {
        "ID": 91980,
        "Title": "Rasthof Eifel West",
        "AddressLine1": "A1",
        "Town": "Niederöfflingen",
        "StateOrProvince": "Wittlich-Land",
        "Postcode": "54533",
        "CountryID": 87,
        "Latitude": 50.069064604193,
        "Longitude": 6.87973307295532,
        "AccessComments": "24/7 nutzbar",
        "RelatedURL": "http://tank.rast.de/emobility",
        "DistanceUnit": 0
    },
    "Connections": [
        {
            "ID": 129908,
            "ConnectionTypeID": 2,
            "StatusTypeID": 50,
            "LevelID": 3,
            "PowerKW": 50,
            "CurrentTypeID": 30,
            "Quantity": 1
        },
        {
            "ID": 129909,
            "ConnectionTypeID": 33,
            "StatusTypeID": 50,
            "LevelID": 3,
            "PowerKW": 50,
            "CurrentTypeID": 30,
            "Quantity": 1
        },
        {
            "ID": 129910,
            "ConnectionTypeID": 1036,
            "StatusTypeID": 50,
            "LevelID": 2,
            "Amps": 32,
            "Voltage": 400,
            "PowerKW": 22,
            "CurrentTypeID": 20,
            "Quantity": 1
        }
    ],
    "NumberOfPoints": 3,
    "GeneralComments": "Inbetriebnahme 01.09.2017",
    "StatusTypeID": 50,
    "DateLastStatusUpdate": "2018-03-01T18:16:00Z",
    "DataQualityLevel": 1,
    "DateCreated": "2017-08-09T11:52:00Z",
    "SubmissionStatusTypeID": 200
}