{
    "IsRecentlyVerified": false,
    "ID": 182482,
    "UUID": "57B70417-369E-46A8-BA52-88431904B28F",
    "DataProviderID": 29,
    "DataProvidersReference": "4410",
    "OperatorID": 69,
    "AddressInfo": {
        "ID": 182841,
        "Title": "Güterhallenstraße 15",
        "AddressLine1": "Güterhallenstraße 15",
        "Town": "Freiburg im Breisgau",
        "Postcode": "79106",
        "CountryID": 87,
        "Latitude": 48.01257,
        "Longitude": 7.849605,
        "DistanceUnit": 0
    },
    "Connections": [
        {
            "ID": 288284,
            "ConnectionTypeID": 25,
            "StatusTypeID": 50,
            "LevelID": 2,
            "PowerKW": 22,
            "CurrentTypeID": 20
        },
        {
            "ID": 288285,
            "ConnectionTypeID": 25,
            "StatusTypeID": 50,
            "LevelID": 2,
            "PowerKW": 22,
            "CurrentTypeID": 20
        }
    ],
    "StatusTypeID": 50,
    "DateLastStatusUpdate": "2021-07-12T02:40:00Z",
    "MetadataValues": [
        {
            "ID": 14775,
            "MetadataFieldID": 4,
            "ItemValue": "Data from the German chargepoint registry provided by Bundesnetzagentur.de under the CC-BY 4.0 license"
        }
    ],
    "DataQualityLevel": 3,
    "DateCreated": "2021-07-08T10:03:00Z",
    "SubmissionStatusTypeID": 100
}