{
    "IsRecentlyVerified": false,
    "ID": 67023,
    "UUID": "4219282E-7ADC-45AE-9C7F-572C4693C834",
    "DataProviderID": 2,
    "DataProvidersReference": "75102",
    "OperatorID": 5,
    "UsageTypeID": 1,
    "AddressInfo": {
        "ID": 67369,
        "Title": "DC SOLAR",
        "AddressLine1": "18238-18298 Halsted St",
        "Town": "Los Angeles",
        "StateOrProvince": "CA",
        "Postcode": "91325",
        "CountryID": 2,
        "Latitude": 34.244372,
        "Longitude": -118.532171,
        "ContactTelephone1": "888-758-4389",
        "AccessComments": "24 hours daily",
        "RelatedURL": "http://www.chargepoint.com/",
        "DistanceUnit": 0
    },
    "Connections": [
        {
            "ID": 92517,
            "ConnectionTypeID": 1,
            "LevelID": 2,
            "Amps": 16,
            "Voltage": 230,
            "PowerKW": 3,
            "CurrentTypeID": 10,
            "Quantity": 2
        }
    ],
    "DateLastStatusUpdate": "2019-04-06T04:02:00Z",
    "DataQualityLevel": 3,
    "DateCreated": "2016-05-29T02:04:00Z",
    "SubmissionStatusTypeID": 100
}