{
    "IsRecentlyVerified": false,
    "ID": 163395,
    "UUID": "D442934C-FFB1-40AB-A61A-D353D062D72D",
    "DataProviderID": 1,
    "OperatorID": 21,
    "UsageTypeID": 4,
    "UsageCost": "Mobi.E compatible card",
    "AddressInfo": {
        "ID": 163752,
        "Title": "CLB-00001",
        "AddressLine1": "A25 km 146",
        "Town": "Celorico",
        "StateOrProvince": "Centro",
        "Postcode": "",
        "CountryID": 180,
        "Latitude": 40.6295444212364,
        "Longitude": -7.356813655810583,
        "AccessComments": "Eastbound",
        "DistanceUnit": 0
    },
    "Connections": [
        {
            "ID": 234965,
            "ConnectionTypeID": 2,
            "StatusTypeID": 50,
            "LevelID": 3,
            "Amps": 120,
            "Voltage": 500,
            "PowerKW": 50,
            "CurrentTypeID": 30,
            "Quantity": 1
        },
        {
            "ID": 234966,
            "ConnectionTypeID": 33,
            "StatusTypeID": 50,
            "LevelID": 3,
            "Amps": 125,
            "Voltage": 500,
            "PowerKW": 50,
            "CurrentTypeID": 30,
            "Quantity": 1
        },
        {
            "ID": 234967,
            "ConnectionTypeID": 1036,
            "StatusTypeID": 50,
            "LevelID": 3,
            "Amps": 64,
            "Voltage": 400,
            "PowerKW": 43,
            "CurrentTypeID": 20,
            "Quantity": 1
        }
    ],
    "NumberOfPoints": 2,
    "StatusTypeID": 150,
    "DateLastStatusUpdate": "2020-08-23T15:44:00Z",
    "DataQualityLevel": 1,
    "DateCreated": "2020-08-23T15:44:00Z",
    "SubmissionStatusTypeID": 200
}