{
    "IsRecentlyVerified": false,
    "ID": 130614,
    "UUID": "BE50239C-504F-40C5-BF7C-74E79D58DD29",
    "DataProviderID": 1,
    "OperatorID": 3315,
    "OperatorsReference": "52034",
    "UsageTypeID": 4,
    "UsageCost": "Free",
    "AddressInfo": {
        "ID": 130960,
        "Title": "Glaisnock Street, Cumnock",
        "AddressLine1": "Glaisnock Street, Cumnock",
        "Postcode": "KA18 1JS",
        "CountryID": 1,
        "Latitude": 55.4525,
        "Longitude": -4.26337,
        "DistanceUnit": 0
    },
    "Connections": [
        {
            "ID": 182849,
            "ConnectionTypeID": 25,
            "StatusTypeID": 50,
            "LevelID": 2,
            "Amps": 32,
            "Voltage": 400,
            "PowerKW": 22,
            "CurrentTypeID": 20,
            "Quantity": 2
        }
    ],
    "NumberOfPoints": 2,
    "StatusTypeID": 50,
    "DateLastStatusUpdate": "2019-08-08T05:23:00Z",
    "DataQualityLevel": 1,
    "DateCreated": "2019-08-08T05:23:00Z",
    "SubmissionStatusTypeID": 200
}