{
    "IsRecentlyVerified": false,
    "ID": 105267,
    "UUID": "168533BF-5315-4013-AE8F-07F07AD51A62",
    "DataProviderID": 1,
    "OperatorID": 45,
    "UsageTypeID": 4,
    "AddressInfo": {
        "ID": 105613,
        "Title": "PHV-Dialysezentrum",
        "AddressLine1": "Kantensiek 25",
        "Town": "Bielefeld",
        "StateOrProvince": "Nordrhein-Westfalen",
        "Postcode": "33617",
        "CountryID": 87,
        "Latitude": 52.01243455080928,
        "Longitude": 8.527670439147983,
        "AccessComments": "24/7 kostenlos und ohne Ladekarte nutzbar.",
        "RelatedURL": "https://www.stadtwerke-bielefeld.de/privatkunden/dienstleistungen/elektromobilitaet.html",
        "DistanceUnit": 0
    },
    "Connections": [
        {
            "ID": 148393,
            "ConnectionTypeID": 25,
            "StatusTypeID": 50,
            "LevelID": 2,
            "Amps": 32,
            "Voltage": 400,
            "PowerKW": 22,
            "CurrentTypeID": 20,
            "Quantity": 2
        }
    ],
    "NumberOfPoints": 2,
    "StatusTypeID": 50,
    "DateLastStatusUpdate": "2018-06-04T06:47:00Z",
    "DataQualityLevel": 1,
    "DateCreated": "2018-06-04T06:47:00Z",
    "SubmissionStatusTypeID": 200
}