{
    "IsRecentlyVerified": false,
    "ID": 137802,
    "UUID": "10D07ECD-293A-4C03-9382-2CAD557921F7",
    "DataProviderID": 2,
    "DataProvidersReference": "146901",
    "OperatorID": 5,
    "UsageTypeID": 1,
    "AddressInfo": {
        "ID": 138151,
        "Title": "HDQ",
        "AddressLine1": "2432 Wyman",
        "Town": "Dallas",
        "StateOrProvince": "TX",
        "Postcode": "75235",
        "CountryID": 2,
        "Latitude": 32.841906,
        "Longitude": -96.864489,
        "ContactTelephone1": "888-758-4389",
        "AccessComments": "24 hours daily",
        "RelatedURL": "http://www.chargepoint.com/",
        "DistanceUnit": 0
    },
    "Connections": [
        {
            "ID": 192807,
            "ConnectionTypeID": 1,
            "LevelID": 2,
            "Amps": 16,
            "Voltage": 230,
            "PowerKW": 3,
            "CurrentTypeID": 10,
            "Quantity": 4
        }
    ],
    "StatusTypeID": 50,
    "DateLastStatusUpdate": "2019-12-24T09:06:00Z",
    "DataQualityLevel": 3,
    "DateCreated": "2019-12-24T09:06:00Z",
    "SubmissionStatusTypeID": 100
}