{
    "IsRecentlyVerified": false,
    "ID": 153154,
    "UUID": "30E9189C-18B1-48FA-A9BD-E305E11DBAE7",
    "DataProviderID": 28,
    "DataProvidersReference": "FR S89 P89073 A",
    "UsageTypeID": 5,
    "AddressInfo": {
        "ID": 153507,
        "Title": "Parking",
        "AddressLine1": "129 Avenue Saint Michel - CHAMPIGNELLES",
        "CountryID": 80,
        "Latitude": 47.7785205942,
        "Longitude": 3.0776033832,
        "AccessComments": "24/24 - 7/7",
        "DistanceUnit": 0
    },
    "Connections": [
        {
            "ID": 214717,
            "ConnectionTypeID": 1036,
            "StatusTypeID": 50,
            "LevelID": 2,
            "PowerKW": 22,
            "CurrentTypeID": 20
        },
        {
            "ID": 214718,
            "ConnectionTypeID": 28,
            "StatusTypeID": 50,
            "LevelID": 2,
            "PowerKW": 22,
            "CurrentTypeID": 10
        },
        {
            "ID": 248079,
            "ConnectionTypeID": 1036,
            "StatusTypeID": 50,
            "LevelID": 2,
            "PowerKW": 22,
            "CurrentTypeID": 20
        },
        {
            "ID": 248080,
            "ConnectionTypeID": 28,
            "StatusTypeID": 50,
            "LevelID": 2,
            "PowerKW": 22,
            "CurrentTypeID": 10
        }
    ],
    "GeneralComments": "En service",
    "StatusTypeID": 50,
    "DateLastStatusUpdate": "2020-08-27T05:14:00Z",
    "DataQualityLevel": 2,
    "DateCreated": "2020-03-15T10:54:00Z",
    "SubmissionStatusTypeID": 100
}