{
    "IsRecentlyVerified": false,
    "ID": 29957,
    "UUID": "2CE96DB0-5834-47D7-AE33-08D2F28E309A",
    "DataProviderID": 15,
    "DataProvidersReference": "24533",
    "OperatorID": 1,
    "UsageTypeID": 1,
    "AddressInfo": {
        "ID": 30303,
        "Title": "1501 Cedar Street",
        "AddressLine1": "1501 Cedar Street",
        "Town": "Helena",
        "StateOrProvince": "MT",
        "Postcode": "59601",
        "CountryID": 2,
        "Latitude": 46.60623,
        "Longitude": -112.01487,
        "ContactTelephone1": "(406) 558-4830",
        "RelatedURL": "http://carstations.com/24533",
        "DistanceUnit": 0
    },
    "Connections": [
        {
            "ID": 32942,
            "ConnectionTypeID": 1,
            "Reference": "J1772",
            "LevelID": 2
        }
    ],
    "NumberOfPoints": 1,
    "StatusTypeID": 0,
    "DateLastStatusUpdate": "2017-11-04T14:05:00Z",
    "DataQualityLevel": 2,
    "DateCreated": "2014-11-29T05:39:00Z",
    "SubmissionStatusTypeID": 100
}