{
    "IsRecentlyVerified": false,
    "ID": 145013,
    "UUID": "4C55E598-97AC-48F0-BCFA-339623F73898",
    "DataProviderID": 2,
    "DataProvidersReference": "124684",
    "OperatorID": 3318,
    "UsageTypeID": 1,
    "AddressInfo": {
        "ID": 145365,
        "Title": "Three Rivers Mall",
        "AddressLine1": "351 Three Rivers Dr.",
        "Town": "Kelso",
        "StateOrProvince": "WA",
        "Postcode": "98626",
        "CountryID": 2,
        "Latitude": 46.139875,
        "Longitude": -122.901263,
        "ContactTelephone1": "833-632-2778",
        "AccessComments": "24 hours daily",
        "RelatedURL": "https://www.electrifyamerica.com/",
        "DistanceUnit": 0
    },
    "Connections": [
        {
            "ID": 201589,
            "ConnectionTypeID": 2,
            "LevelID": 3,
            "Amps": 100,
            "Voltage": 400,
            "PowerKW": 40,
            "CurrentTypeID": 30,
            "Quantity": 1
        },
        {
            "ID": 201590,
            "ConnectionTypeID": 32,
            "LevelID": 3,
            "Amps": 100,
            "Voltage": 400,
            "PowerKW": 40,
            "CurrentTypeID": 30,
            "Quantity": 1
        }
    ],
    "StatusTypeID": 50,
    "DateLastStatusUpdate": "2020-06-26T03:10:00Z",
    "DataQualityLevel": 3,
    "DateCreated": "2019-12-24T09:24:00Z",
    "SubmissionStatusTypeID": 100
}