{
    "IsRecentlyVerified": false,
    "ID": 33465,
    "UUID": "0E39C269-0211-41C7-8564-284B767EE07B",
    "DataProviderID": 26,
    "DataProvidersReference": "48137",
    "OperatorID": 178,
    "OperatorsReference": "EVnetNL EV0018",
    "UsageCost": "0.00 jaarabonnement",
    "AddressInfo": {
        "ID": 33811,
        "Title": "Weteringplein 1",
        "AddressLine1": "Weteringplein 1",
        "Town": "Loon op Zand",
        "Postcode": "5175 BZ",
        "CountryID": 159,
        "Latitude": 51.627008,
        "Longitude": 5.075265,
        "ContactTelephone1": "0800-3522365",
        "RelatedURL": "http://www.evnet.nl",
        "DistanceUnit": 0
    },
    "Connections": [
        {
            "ID": 36976,
            "ConnectionTypeID": 25,
            "LevelID": 2,
            "PowerKW": 11,
            "CurrentTypeID": 10
        }
    ],
    "NumberOfPoints": 1,
    "StatusTypeID": 50,
    "DateLastStatusUpdate": "2016-06-04T02:39:00Z",
    "DataQualityLevel": 3,
    "DateCreated": "2015-01-09T06:04:00Z",
    "SubmissionStatusTypeID": 100
}