{
    "IsRecentlyVerified": false,
    "ID": 17150,
    "UUID": "136D9F38-B9F4-4EEA-9E0F-DEAA3B4C1F90",
    "DataProviderID": 22,
    "DataProvidersReference": "EEF87E2FABA9E4BC03A10CDBB383798B",
    "AddressInfo": {
        "ID": 17495,
        "Title": "ＥＮＥＯＳ　Ｄｒ．Ｄｒｉｖｅセルフ寒川店",
        "AddressLine1": "神奈川県高座郡寒川町宮山405-1",
        "CountryID": 114,
        "Latitude": 35.37689443,
        "Longitude": 139.3848696,
        "ContactTelephone1": "0467-75-6651",
        "DistanceUnit": 0
    },
    "Connections": [
        {
            "ID": 17391,
            "ConnectionTypeID": 2,
            "LevelID": 2,
            "Amps": 100,
            "Voltage": 480,
            "PowerKW": 48,
            "Quantity": 1
        }
    ],
    "DateLastStatusUpdate": "2013-06-29T08:54:00Z",
    "DataQualityLevel": 2,
    "DateCreated": "2013-06-29T08:54:00Z",
    "SubmissionStatusTypeID": 200
}