{
    "IsRecentlyVerified": false,
    "ID": 63258,
    "UUID": "A0D95163-EC7A-46D0-8388-84B698E7D253",
    "DataProviderID": 26,
    "DataProvidersReference": "75150",
    "OperatorID": 73,
    "OperatorsReference": "EV-Box EVB-P1525019",
    "UsageCost": "0.00 jaarabonnement",
    "AddressInfo": {
        "ID": 63604,
        "Title": "Waterwerk 91",
        "AddressLine1": "Waterwerk 91",
        "Town": "Rotterdam",
        "Postcode": "3063 HB",
        "CountryID": 159,
        "Latitude": 51.91319,
        "Longitude": 4.51877,
        "RelatedURL": "http://www.ev-box.nl",
        "DistanceUnit": 0
    },
    "Connections": [
        {
            "ID": 80578,
            "ConnectionTypeID": 25,
            "LevelID": 2,
            "PowerKW": 11,
            "CurrentTypeID": 10
        },
        {
            "ID": 80579,
            "ConnectionTypeID": 25,
            "LevelID": 2,
            "PowerKW": 11,
            "CurrentTypeID": 10
        }
    ],
    "NumberOfPoints": 1,
    "StatusTypeID": 50,
    "DateLastStatusUpdate": "2016-06-04T02:42:00Z",
    "DataQualityLevel": 3,
    "DateCreated": "2016-03-03T12:30:00Z",
    "SubmissionStatusTypeID": 100
}