{
    "IsRecentlyVerified": false,
    "ID": 31716,
    "UUID": "2A251172-CE3A-4FBD-81A9-FFF5D3D79AA8",
    "DataProviderID": 26,
    "DataProvidersReference": "30342",
    "OperatorID": 86,
    "OperatorsReference": "EnWB Rathausplatz ",
    "UsageCost": "0.00 afhankelijk van pas",
    "AddressInfo": {
        "ID": 32062,
        "Title": "Rathausplatz 6",
        "AddressLine1": "Rathausplatz 6",
        "Town": "Lahr/Schwarzwald",
        "Postcode": "77933",
        "CountryID": 87,
        "Latitude": 48.338073,
        "Longitude": 7.871123,
        "ContactTelephone1": "0800 3629-000",
        "ContactEmail": "-",
        "RelatedURL": "http://www.enbw.com/",
        "DistanceUnit": 0
    },
    "Connections": [
        {
            "ID": 35227,
            "ConnectionTypeID": 25,
            "LevelID": 2,
            "PowerKW": 5,
            "CurrentTypeID": 10
        }
    ],
    "NumberOfPoints": 2,
    "StatusTypeID": 50,
    "DateLastStatusUpdate": "2016-03-03T12:34:00Z",
    "DataQualityLevel": 3,
    "DateCreated": "2015-01-09T06:03:00Z",
    "SubmissionStatusTypeID": 100
}