{
    "IsRecentlyVerified": false,
    "ID": 14670,
    "UUID": "A336B6FB-1B60-474E-89BB-76D6179C3BD9",
    "DataProviderID": 2,
    "DataProvidersReference": "49708",
    "UsageTypeID": 7,
    "AddressInfo": {
        "ID": 14567,
        "Title": "Langway Nissan of Newport",
        "AddressLine1": "295 E Main Rd",
        "Town": "Middletown",
        "StateOrProvince": "RI",
        "Postcode": "02842",
        "CountryID": 2,
        "Latitude": 41.51931,
        "Longitude": -71.290753,
        "ContactTelephone1": "401-619-5050",
        "AccessComments": "Dealership business hours\r\nPublic - Call ahead",
        "RelatedURL": "",
        "DistanceUnit": 0
    },
    "Connections": [
        {
            "ID": 16774,
            "ConnectionTypeID": 1,
            "LevelID": 2,
            "Amps": 16,
            "Voltage": 230,
            "PowerKW": 3.7,
            "CurrentTypeID": 10,
            "Quantity": 1
        },
        {
            "ID": 21944,
            "ConnectionTypeID": 2,
            "LevelID": 3,
            "Amps": 100,
            "Voltage": 400,
            "PowerKW": 40,
            "CurrentTypeID": 30,
            "Quantity": 1
        }
    ],
    "DateLastStatusUpdate": "2020-06-26T03:04:00Z",
    "DataQualityLevel": 3,
    "DateCreated": "2012-12-06T16:50:00Z",
    "SubmissionStatusTypeID": 100
}