{
    "IsRecentlyVerified": false,
    "ID": 123658,
    "UUID": "06D637C8-4417-4EE9-BF62-BEB8DD9D2C8E",
    "DataProviderID": 2,
    "DataProvidersReference": "62154",
    "OperatorID": 39,
    "UsageTypeID": 1,
    "AddressInfo": {
        "ID": 124004,
        "Title": "City Center Merchants Walk Garage",
        "AddressLine1": "11860 Merchants Walk",
        "Town": "Newport News",
        "StateOrProvince": "VA",
        "Postcode": "23606",
        "CountryID": 2,
        "Latitude": 37.087066,
        "Longitude": -76.475128,
        "ContactTelephone1": "800-663-5633",
        "AccessComments": "MO: Not Specified; TU: Not Specified; WE: Not Specified; TH: Not Specified; FR: Not Specified; SA: Not Specified; SU: Not Specified",
        "RelatedURL": "http://www.semacharge.com/",
        "DistanceUnit": 0
    },
    "Connections": [
        {
            "ID": 173674,
            "ConnectionTypeID": 1,
            "LevelID": 2,
            "Amps": 16,
            "Voltage": 230,
            "PowerKW": 3,
            "CurrentTypeID": 10,
            "Quantity": 2
        }
    ],
    "DateLastStatusUpdate": "2019-04-06T05:03:00Z",
    "DataQualityLevel": 3,
    "DateCreated": "2019-04-06T05:03:00Z",
    "SubmissionStatusTypeID": 100
}