{
    "IsRecentlyVerified": false,
    "ID": 109058,
    "UUID": "16789F61-2721-490B-A3B1-9C16DC1BDB13",
    "DataProviderID": 1,
    "OperatorID": 23,
    "OperatorsReference": "44593",
    "UsageTypeID": 4,
    "AddressInfo": {
        "ID": 109404,
        "Title": "Hotel Mon Pays Bellaria",
        "AddressLine1": "Viale G Pascoli",
        "Town": "3",
        "StateOrProvince": "Bellaria Igea Marina",
        "Postcode": "47814",
        "CountryID": 112,
        "Latitude": 44.14926,
        "Longitude": 12.463707,
        "ContactTelephone1": "+39 366 124 4288",
        "DistanceUnit": 0
    },
    "Connections": [
        {
            "ID": 154176,
            "ConnectionTypeID": 30,
            "StatusTypeID": 50,
            "LevelID": 2,
            "Amps": 16,
            "Voltage": 400,
            "PowerKW": 11,
            "CurrentTypeID": 20,
            "Quantity": 2
        }
    ],
    "NumberOfPoints": 2,
    "GeneralComments": "2 Tesla Connectors, up to 11kW.Available for customers. Please call ahead.",
    "StatusTypeID": 50,
    "DateLastStatusUpdate": "2018-10-11T13:29:00Z",
    "DataQualityLevel": 1,
    "DateCreated": "2018-10-11T13:29:00Z",
    "SubmissionStatusTypeID": 200
}