{
    "IsRecentlyVerified": false,
    "ID": 90270,
    "UUID": "9E73D026-4B0B-47A8-98D8-89E23E9695F2",
    "DataProviderID": 1,
    "OperatorID": 23,
    "OperatorsReference": "31122",
    "UsageTypeID": 4,
    "AddressInfo": {
        "ID": 90616,
        "Title": "Rapidpark 906 Union Street",
        "AddressLine1": "906 Union St",
        "Town": "Brooklyn",
        "StateOrProvince": "New York",
        "Postcode": "11215",
        "CountryID": 2,
        "Latitude": 40.672884,
        "Longitude": -73.971541,
        "ContactTelephone1": "(718) 622-4867",
        "DistanceUnit": 0
    },
    "Connections": [
        {
            "ID": 127923,
            "ConnectionTypeID": 30,
            "StatusTypeID": 50,
            "LevelID": 2,
            "PowerKW": 16,
            "CurrentTypeID": 20,
            "Quantity": 2
        }
    ],
    "NumberOfPoints": 2,
    "GeneralComments": "2 Tesla Connectors, up to 16kW.Available to the public. Please see valet.",
    "StatusTypeID": 50,
    "DateLastStatusUpdate": "2017-07-13T14:34:00Z",
    "DataQualityLevel": 1,
    "DateCreated": "2017-07-13T14:34:00Z",
    "SubmissionStatusTypeID": 200
}