{
    "IsRecentlyVerified": false,
    "ID": 34440,
    "UUID": "405BF8DA-D43C-4B96-BEB4-AE60D68DA78B",
    "DataProviderID": 1,
    "OperatorID": 156,
    "OperatorsReference": "NewMotion 02009194",
    "UsageTypeID": 4,
    "UsageCost": "",
    "AddressInfo": {
        "ID": 34786,
        "Title": "Stadtring Nordhorn",
        "AddressLine1": "Stadtring Nordhorn",
        "AddressLine2": "",
        "Town": "Gütersloh",
        "StateOrProvince": "",
        "Postcode": "33332",
        "CountryID": 87,
        "Latitude": 51.92607,
        "Longitude": 8.40745000000004,
        "ContactTelephone1": "",
        "ContactTelephone2": "",
        "ContactEmail": "",
        "AccessComments": "",
        "RelatedURL": "",
        "DistanceUnit": 0
    },
    "Connections": [
        {
            "ID": 37951,
            "ConnectionTypeID": 25,
            "StatusTypeID": 0,
            "LevelID": 2,
            "PowerKW": 37,
            "CurrentTypeID": 10
        }
    ],
    "NumberOfPoints": 1,
    "GeneralComments": "",
    "StatusTypeID": 50,
    "DateLastStatusUpdate": "2015-06-12T21:58:00Z",
    "DataQualityLevel": 3,
    "DateCreated": "2015-01-09T06:04:00Z",
    "SubmissionStatusTypeID": 200
}