{
    "IsRecentlyVerified": false,
    "ID": 158580,
    "UUID": "652D824F-5B53-4687-BFA7-D8B314684B09",
    "DataProviderID": 2,
    "DataProvidersReference": "155557",
    "OperatorID": 3318,
    "UsageTypeID": 1,
    "AddressInfo": {
        "ID": 158937,
        "Title": "Walmart 2242 Anaheim",
        "AddressLine1": "440 N. Euclid St.",
        "Town": "Anaheim",
        "StateOrProvince": "CA",
        "Postcode": "92801",
        "CountryID": 2,
        "Latitude": 33.836039,
        "Longitude": -117.93942,
        "ContactTelephone1": "833-632-2778",
        "AccessComments": "24 hours daily",
        "RelatedURL": "https://www.electrifyamerica.com/",
        "DistanceUnit": 0
    },
    "Connections": [
        {
            "ID": 228588,
            "ConnectionTypeID": 2,
            "LevelID": 3,
            "Amps": 100,
            "Voltage": 400,
            "PowerKW": 40,
            "CurrentTypeID": 30,
            "Quantity": 1
        },
        {
            "ID": 228589,
            "ConnectionTypeID": 32,
            "LevelID": 3,
            "Amps": 100,
            "Voltage": 400,
            "PowerKW": 40,
            "CurrentTypeID": 30,
            "Quantity": 1
        }
    ],
    "StatusTypeID": 50,
    "DateLastStatusUpdate": "2020-06-26T02:56:00Z",
    "DataQualityLevel": 3,
    "DateCreated": "2020-06-26T02:56:00Z",
    "SubmissionStatusTypeID": 100
}