{
    "IsRecentlyVerified": false,
    "ID": 68265,
    "UUID": "2A1B4AF7-D130-460A-9CF1-162821F96F12",
    "DataProviderID": 26,
    "DataProvidersReference": "93740",
    "OperatorID": 157,
    "OperatorsReference": "NewMotion 03006956",
    "UsageCost": "0.00 jaarabonnement",
    "AddressInfo": {
        "ID": 68611,
        "Title": "Raiffeisenstraat 2",
        "AddressLine1": "Raiffeisenstraat 2",
        "Town": "Dalfsen",
        "Postcode": "7711 JH",
        "CountryID": 159,
        "Latitude": 52.5879213,
        "Longitude": 6.283228,
        "ContactTelephone1": "088 0109500",
        "RelatedURL": "http://thenewmotion.nl/",
        "DistanceUnit": 0
    },
    "Connections": [
        {
            "ID": 95164,
            "ConnectionTypeID": 25,
            "LevelID": 2,
            "PowerKW": 11,
            "CurrentTypeID": 10
        },
        {
            "ID": 95165,
            "ConnectionTypeID": 25,
            "LevelID": 2,
            "PowerKW": 11,
            "CurrentTypeID": 10
        }
    ],
    "NumberOfPoints": 1,
    "StatusTypeID": 50,
    "DateLastStatusUpdate": "2016-06-04T02:37:00Z",
    "DataQualityLevel": 3,
    "DateCreated": "2016-06-04T02:37:00Z",
    "SubmissionStatusTypeID": 100
}