{
    "IsRecentlyVerified": false,
    "ID": 173055,
    "UUID": "FB617F78-897C-4FBB-974D-49DB1FB28A7B",
    "DataProviderID": 1,
    "OperatorID": 3,
    "OperatorsReference": "PG-70423,PG-86125",
    "UsageTypeID": 4,
    "UsageCost": "Free,£0.27/kWh",
    "AddressInfo": {
        "ID": 173414,
        "Title": "Tesco Superstore-Fareham",
        "AddressLine1": "Quay Street",
        "Town": "Fareham",
        "Postcode": "PO16 0LE",
        "CountryID": 1,
        "Latitude": 50.850639,
        "Longitude": -1.17587,
        "DistanceUnit": 0
    },
    "Connections": [
        {
            "ID": 264784,
            "ConnectionTypeID": 25,
            "StatusTypeID": 50,
            "LevelID": 2,
            "Amps": 32,
            "Voltage": 400,
            "PowerKW": 22,
            "CurrentTypeID": 20,
            "Quantity": 2
        },
        {
            "ID": 270091,
            "ConnectionTypeID": 25,
            "StatusTypeID": 50,
            "LevelID": 2,
            "Amps": 32,
            "Voltage": 230,
            "PowerKW": 7,
            "CurrentTypeID": 10,
            "Quantity": 2
        }
    ],
    "NumberOfPoints": 2,
    "GeneralComments": "This is an open charge unit installed at the Tesco super store at Quay Street, Fareham",
    "StatusTypeID": 50,
    "DateLastStatusUpdate": "2021-03-27T06:22:00Z",
    "DataQualityLevel": 1,
    "DateCreated": "2021-03-02T21:02:00Z",
    "SubmissionStatusTypeID": 200
}