{
    "IsRecentlyVerified": false,
    "ID": 35617,
    "UUID": "AFAD3DB7-B485-49C6-AC52-CF7B96A0D168",
    "DataProviderID": 26,
    "DataProvidersReference": "50779",
    "OperatorID": 180,
    "OperatorsReference": "Alfen GDH1551",
    "UsageCost": "0.00 jaarabonnement",
    "AddressInfo": {
        "ID": 35963,
        "Title": "Laan van Meerdervoort 1229",
        "AddressLine1": "Laan van Meerdervoort 1229",
        "Town": "Den Haag",
        "Postcode": "2555 BD",
        "CountryID": 159,
        "Latitude": 52.066146,
        "Longitude": 4.240035,
        "ContactTelephone1": "036 - 549 34 00",
        "RelatedURL": "http://www.icu-charging-stations.com/",
        "DistanceUnit": 0
    },
    "Connections": [
        {
            "ID": 39128,
            "ConnectionTypeID": 25,
            "LevelID": 2,
            "PowerKW": 11,
            "CurrentTypeID": 10
        },
        {
            "ID": 47973,
            "ConnectionTypeID": 25,
            "LevelID": 2,
            "PowerKW": 11,
            "CurrentTypeID": 10
        }
    ],
    "NumberOfPoints": 1,
    "StatusTypeID": 50,
    "DateLastStatusUpdate": "2016-06-04T02:45:00Z",
    "DataQualityLevel": 3,
    "DateCreated": "2015-01-09T06:05:00Z",
    "SubmissionStatusTypeID": 100
}