{
    "IsRecentlyVerified": false,
    "ID": 181632,
    "UUID": "C9CFA595-394C-4644-9629-F5AC72B335C0",
    "DataProviderID": 29,
    "DataProvidersReference": "10978",
    "AddressInfo": {
        "ID": 181991,
        "Title": "Heiligenangerstraße 2",
        "AddressLine1": "Heiligenangerstraße 2",
        "Town": "Bad Pyrmont",
        "Postcode": "31812",
        "CountryID": 87,
        "Latitude": 51.9849891662597,
        "Longitude": 9.25328826904296,
        "DistanceUnit": 0
    },
    "Connections": [
        {
            "ID": 286227,
            "ConnectionTypeID": 25,
            "StatusTypeID": 50,
            "LevelID": 2,
            "PowerKW": 22,
            "CurrentTypeID": 20
        },
        {
            "ID": 286228,
            "ConnectionTypeID": 25,
            "StatusTypeID": 50,
            "LevelID": 2,
            "PowerKW": 22,
            "CurrentTypeID": 20
        }
    ],
    "StatusTypeID": 50,
    "DateLastStatusUpdate": "2021-07-12T02:48:00Z",
    "MetadataValues": [
        {
            "ID": 13926,
            "MetadataFieldID": 4,
            "ItemValue": "Data from the German chargepoint registry provided by Bundesnetzagentur.de under the CC-BY 4.0 license"
        }
    ],
    "DataQualityLevel": 3,
    "DateCreated": "2021-07-08T10:02:00Z",
    "SubmissionStatusTypeID": 100
}