{
    "IsRecentlyVerified": false,
    "ID": 100638,
    "UUID": "2D7E844D-C5A3-4011-90B1-31EB8D0614C2",
    "DataProviderID": 1,
    "OperatorID": 25,
    "OperatorsReference": "bromley-elmfieldparkroad",
    "UsageTypeID": 4,
    "UsageCost": "£0.059/minute; min £1.18; other tariffs available",
    "AddressInfo": {
        "ID": 100984,
        "Title": "Elmfield Park Road",
        "AddressLine1": "Elmfield Road South Junction Elmfield Park",
        "Town": "Bromley",
        "Postcode": "BR1 1NX",
        "CountryID": 1,
        "Latitude": 51.400333,
        "Longitude": 0.018438,
        "DistanceUnit": 0
    },
    "Connections": [
        {
            "ID": 142152,
            "ConnectionTypeID": 25,
            "StatusTypeID": 50,
            "LevelID": 2,
            "Amps": 32,
            "Voltage": 400,
            "PowerKW": 22,
            "CurrentTypeID": 20,
            "Quantity": 1
        },
        {
            "ID": 142153,
            "ConnectionTypeID": 1,
            "StatusTypeID": 150,
            "LevelID": 2,
            "Amps": 16,
            "Voltage": 230,
            "PowerKW": 4,
            "CurrentTypeID": 10,
            "Quantity": 1
        }
    ],
    "NumberOfPoints": 1,
    "StatusTypeID": 50,
    "DateLastStatusUpdate": "2018-07-23T15:42:00Z",
    "DataQualityLevel": 1,
    "DateCreated": "2018-03-03T10:02:00Z",
    "SubmissionStatusTypeID": 200
}