{
    "IsRecentlyVerified": false,
    "ID": 110610,
    "UUID": "BC87F7E7-48F9-4CC7-9EF1-2C67FC38A609",
    "DataProviderID": 2,
    "DataProvidersReference": "103824",
    "OperatorID": 5,
    "UsageTypeID": 1,
    "AddressInfo": {
        "ID": 110956,
        "Title": "CT RAIL",
        "AddressLine1": "51 Depot Rd",
        "Town": "Berlin",
        "StateOrProvince": "CT",
        "Postcode": "06037",
        "CountryID": 2,
        "Latitude": 41.6356154,
        "Longitude": -72.7653384,
        "ContactTelephone1": "888-758-4389",
        "AccessComments": "24 hours daily",
        "RelatedURL": "http://www.chargepoint.com/",
        "DistanceUnit": 0
    },
    "Connections": [
        {
            "ID": 155878,
            "ConnectionTypeID": 1,
            "LevelID": 2,
            "Amps": 16,
            "Voltage": 230,
            "PowerKW": 3.7,
            "CurrentTypeID": 10,
            "Quantity": 2
        }
    ],
    "DateLastStatusUpdate": "2020-06-26T03:04:00Z",
    "DataQualityLevel": 3,
    "DateCreated": "2018-10-18T23:36:00Z",
    "SubmissionStatusTypeID": 100
}