{
    "IsRecentlyVerified": false,
    "ID": 136728,
    "UUID": "CA130752-07C5-40E2-BF8A-7750F9B76322",
    "DataProviderID": 18,
    "DataProvidersReference": "ea9c07b5d0be2b8ee4631ee110f97fb4",
    "UsageTypeID": 4,
    "AddressInfo": {
        "ID": 137074,
        "Title": "Level 1A near pay and display machines",
        "AddressLine1": "Victoria Road",
        "Town": "Sutton Coldfield",
        "Postcode": "B73 6EJ",
        "CountryID": 1,
        "Latitude": 52.562366,
        "Longitude": -1.821778,
        "AccessComments": "Level 1A near pay and display machines. Parking fees apply. Fitted under Midlands PiP",
        "RelatedURL": "http://www.national-charge-point-registry.uk/",
        "DistanceUnit": 0
    },
    "Connections": [
        {
            "ID": 191289,
            "ConnectionTypeID": 25,
            "Reference": "0",
            "StatusTypeID": 50,
            "LevelID": 2,
            "Amps": 32,
            "Voltage": 400,
            "PowerKW": 22,
            "CurrentTypeID": 20
        },
        {
            "ID": 191290,
            "ConnectionTypeID": 25,
            "Reference": "1",
            "StatusTypeID": 50,
            "LevelID": 2,
            "Amps": 32,
            "Voltage": 400,
            "PowerKW": 22,
            "CurrentTypeID": 20
        }
    ],
    "StatusTypeID": 0,
    "DateLastStatusUpdate": "2020-06-25T10:00:00Z",
    "MetadataValues": [
        {
            "ID": 6580,
            "MetadataFieldID": 4,
            "ItemValue": "Contains public sector information licensed under the Open Government Licence v2.0. http://www.nationalarchives.gov.uk/doc/open-government-licence/version/2/"
        }
    ],
    "DataQualityLevel": 3,
    "DateCreated": "2019-12-24T05:23:00Z",
    "SubmissionStatusTypeID": 100
}