{
    "IsRecentlyVerified": false,
    "ID": 114193,
    "UUID": "A957A76B-0882-449B-BE2A-B48671B24422",
    "DataProviderID": 1,
    "OperatorID": 23,
    "OperatorsReference": "47821",
    "UsageTypeID": 4,
    "AddressInfo": {
        "ID": 114539,
        "Title": "Hotel Andreas Hofer",
        "AddressLine1": "Georg-Pirmoser-Strasse 8",
        "Town": "Kufstein",
        "Postcode": "6330",
        "CountryID": 19,
        "Latitude": 47.582541,
        "Longitude": 12.172452,
        "ContactTelephone1": " +43 5372 6980",
        "DistanceUnit": 0
    },
    "Connections": [
        {
            "ID": 160763,
            "ConnectionTypeID": 30,
            "StatusTypeID": 50,
            "LevelID": 2,
            "Amps": 16,
            "Voltage": 400,
            "PowerKW": 11,
            "CurrentTypeID": 20,
            "Quantity": 1
        }
    ],
    "NumberOfPoints": 1,
    "GeneralComments": "1 Tesla Connector, up to 11kW.Available for customers. Please see front desk.",
    "StatusTypeID": 50,
    "DateLastStatusUpdate": "2019-01-03T08:11:00Z",
    "DataQualityLevel": 1,
    "DateCreated": "2019-01-03T08:11:00Z",
    "SubmissionStatusTypeID": 200
}