{
    "IsRecentlyVerified": false,
    "ID": 165239,
    "UUID": "022CD3CF-F83F-4512-AF11-85A928DD2778",
    "DataProviderID": 1,
    "DataProvidersReference": "TR-IST-088",
    "OperatorID": 70,
    "UsageTypeID": 1,
    "AddressInfo": {
        "ID": 165598,
        "Title": "Eşarj - Total, Tayakadın, İstanbul",
        "AddressLine1": "Tayakadın Mah. Kuzey Marmara Otoyolu, Arnavutköy",
        "Town": "İstanbul",
        "StateOrProvince": "İstanbul",
        "Postcode": "34277",
        "CountryID": 229,
        "Latitude": 41.245239,
        "Longitude": 28.702338,
        "ContactTelephone1": "+90 (850) 433 72 75",
        "ContactEmail": "destek@esarj.com",
        "RelatedURL": "https://esarj.com/en/map?s=TR-IST-088",
        "DistanceUnit": 0
    },
    "Connections": [
        {
            "ID": 236906,
            "ConnectionTypeID": 25,
            "LevelID": 2,
            "Amps": 32,
            "Voltage": 380,
            "PowerKW": 22,
            "Quantity": 2
        }
    ],
    "GeneralComments": "Eşarj Charging Systems",
    "StatusTypeID": 50,
    "DateLastStatusUpdate": "2020-08-26T08:19:00Z",
    "DataQualityLevel": 3,
    "DateCreated": "2020-08-26T08:19:00Z",
    "SubmissionStatusTypeID": 200
}