{
    "IsRecentlyVerified": false,
    "ID": 115852,
    "UUID": "7DA5B9E9-1AEC-4516-A4B3-4D257E5C6CBD",
    "DataProviderID": 2,
    "DataProvidersReference": "114793",
    "OperatorID": 23,
    "UsageTypeID": 2,
    "AddressInfo": {
        "ID": 116198,
        "Title": "Airbnb - Princeton - Tesla Destination",
        "AddressLine1": "62 Cherry Hill Rd",
        "Town": "Princeton",
        "StateOrProvince": "NJ",
        "Postcode": "08540",
        "CountryID": 2,
        "Latitude": 40.363039,
        "Longitude": -74.667672,
        "ContactTelephone1": "",
        "AccessComments": "For Tesla use only; reservation required ",
        "RelatedURL": "https://www.tesla.com/destination-charging",
        "DistanceUnit": 0
    },
    "Connections": [
        {
            "ID": 162894,
            "ConnectionTypeID": 0,
            "LevelID": 2,
            "Amps": 16,
            "Voltage": 230,
            "PowerKW": 3,
            "CurrentTypeID": 10,
            "Quantity": 1
        }
    ],
    "DateLastStatusUpdate": "2019-04-06T05:04:00Z",
    "DataQualityLevel": 3,
    "DateCreated": "2019-02-11T07:13:00Z",
    "SubmissionStatusTypeID": 100
}