{
    "IsRecentlyVerified": false,
    "ID": 36336,
    "UUID": "DA9A680D-2CAE-44DF-AC81-8F123B202C4B",
    "DataProviderID": 26,
    "DataProvidersReference": "46204",
    "OperatorID": 73,
    "OperatorsReference": "EV-Box EVB-P1402044",
    "UsageCost": "0.00 jaarabonnement",
    "AddressInfo": {
        "ID": 36682,
        "Title": "Fleurstraat 20",
        "AddressLine1": "Fleurstraat 20",
        "Town": "Nieuwkoop",
        "Postcode": "2421 JC",
        "CountryID": 159,
        "Latitude": 52.14228,
        "Longitude": 4.76716,
        "RelatedURL": "http://www.ev-box.nl",
        "DistanceUnit": 0
    },
    "Connections": [
        {
            "ID": 39847,
            "ConnectionTypeID": 25,
            "LevelID": 2,
            "PowerKW": 5,
            "CurrentTypeID": 10
        }
    ],
    "NumberOfPoints": 1,
    "StatusTypeID": 50,
    "DateLastStatusUpdate": "2016-06-04T02:50:00Z",
    "DataQualityLevel": 3,
    "DateCreated": "2015-01-09T06:05:00Z",
    "SubmissionStatusTypeID": 100
}