{
    "IsRecentlyVerified": false,
    "ID": 139588,
    "UUID": "445C6B55-D3D7-455C-8E24-13510AA6D023",
    "DataProviderID": 2,
    "DataProvidersReference": "144997",
    "OperatorID": 5,
    "UsageTypeID": 1,
    "AddressInfo": {
        "ID": 139940,
        "Title": "NEPTUNE MARINA",
        "AddressLine1": "14130 Marquesas Way",
        "Town": "Marina del Rey",
        "StateOrProvince": "CA",
        "Postcode": "90292",
        "CountryID": 2,
        "Latitude": 33.9764404,
        "Longitude": -118.4584011,
        "ContactTelephone1": "888-758-4389",
        "AccessComments": "24 hours daily",
        "RelatedURL": "http://www.chargepoint.com/",
        "DistanceUnit": 0
    },
    "Connections": [
        {
            "ID": 194998,
            "ConnectionTypeID": 1,
            "LevelID": 2,
            "Amps": 16,
            "Voltage": 230,
            "PowerKW": 3,
            "CurrentTypeID": 10,
            "Quantity": 2
        }
    ],
    "StatusTypeID": 50,
    "DateLastStatusUpdate": "2019-12-24T09:11:00Z",
    "DataQualityLevel": 3,
    "DateCreated": "2019-12-24T09:11:00Z",
    "SubmissionStatusTypeID": 100
}