{
    "IsRecentlyVerified": false,
    "ID": 15760,
    "UUID": "E8114835-FD90-4B24-89F2-6530F880A4DC",
    "DataProviderID": 1,
    "OperatorID": 56,
    "UsageTypeID": 4,
    "UsageCost": "Free",
    "AddressInfo": {
        "ID": 16105,
        "Title": "Stalingrad",
        "AddressLine1": "43 boulevard Stalingrad",
        "Town": "NICE",
        "Postcode": "06300",
        "CountryID": 80,
        "Latitude": 43.69590059999999,
        "Longitude": 7.286773799999992,
        "DistanceUnit": 0
    },
    "Connections": [
        {
            "ID": 14105,
            "ConnectionTypeID": 13,
            "StatusTypeID": 0,
            "LevelID": 2,
            "Amps": 16,
            "Voltage": 220,
            "PowerKW": 4,
            "CurrentTypeID": 20,
            "Quantity": 2
        }
    ],
    "NumberOfPoints": 2,
    "StatusTypeID": 50,
    "DateLastStatusUpdate": "2017-04-21T20:02:00Z",
    "DataQualityLevel": 1,
    "DateCreated": "2013-01-21T18:07:00Z",
    "SubmissionStatusTypeID": 200
}