{
    "IsRecentlyVerified": false,
    "ID": 182313,
    "UUID": "A37442A9-53F8-4EC3-A922-5EFA2375A88D",
    "DataProviderID": 29,
    "DataProvidersReference": "9361",
    "OperatorID": 220,
    "AddressInfo": {
        "ID": 182672,
        "Title": "Sand ggü. 12",
        "AddressLine1": "Sand ggü. 12",
        "Town": "Hamburg",
        "Postcode": "21073",
        "CountryID": 87,
        "Latitude": 53.461533,
        "Longitude": 9.980743,
        "DistanceUnit": 0
    },
    "Connections": [
        {
            "ID": 287901,
            "ConnectionTypeID": 28,
            "StatusTypeID": 50,
            "LevelID": 2,
            "PowerKW": 22,
            "CurrentTypeID": 20
        },
        {
            "ID": 287902,
            "ConnectionTypeID": 25,
            "StatusTypeID": 50,
            "LevelID": 2,
            "PowerKW": 22,
            "CurrentTypeID": 20
        },
        {
            "ID": 301340,
            "ConnectionTypeID": 28,
            "StatusTypeID": 50,
            "LevelID": 2,
            "PowerKW": 22,
            "CurrentTypeID": 20
        },
        {
            "ID": 301341,
            "ConnectionTypeID": 25,
            "StatusTypeID": 50,
            "LevelID": 2,
            "PowerKW": 22,
            "CurrentTypeID": 20
        }
    ],
    "StatusTypeID": 50,
    "DateLastStatusUpdate": "2021-07-12T02:51:00Z",
    "MetadataValues": [
        {
            "ID": 14607,
            "MetadataFieldID": 4,
            "ItemValue": "Data from the German chargepoint registry provided by Bundesnetzagentur.de under the CC-BY 4.0 license"
        }
    ],
    "DataQualityLevel": 3,
    "DateCreated": "2021-07-08T10:02:00Z",
    "SubmissionStatusTypeID": 100
}