{
    "IsRecentlyVerified": false,
    "ID": 148249,
    "UUID": "CBCFFE3F-BB4B-4B9E-A3CC-2345431BD729",
    "DataProviderID": 1,
    "OperatorID": 80,
    "UsageTypeID": 4,
    "AddressInfo": {
        "ID": 148601,
        "Title": "Centro Commerciale Airone Bellinzago | EnelX",
        "AddressLine1": "Via della Libertà, 254",
        "Town": "Bellinzago Novarese",
        "StateOrProvince": "NO",
        "Postcode": "28043",
        "CountryID": 112,
        "Latitude": 45.554397570471366,
        "Longitude": 8.640524812644344,
        "ContactTelephone1": "800.069.850",
        "RelatedURL": "https://www.enelx.com/it/it/emobility",
        "DistanceUnit": 0
    },
    "Connections": [
        {
            "ID": 205823,
            "ConnectionTypeID": 25,
            "StatusTypeID": 50,
            "LevelID": 2,
            "Amps": 32,
            "Voltage": 400,
            "PowerKW": 22,
            "CurrentTypeID": 20,
            "Quantity": 4
        }
    ],
    "NumberOfPoints": 4,
    "StatusTypeID": 50,
    "DateLastStatusUpdate": "2020-01-28T15:10:00Z",
    "DataQualityLevel": 1,
    "DateCreated": "2020-01-28T15:10:00Z",
    "SubmissionStatusTypeID": 200
}