{
    "IsRecentlyVerified": false,
    "ID": 38919,
    "UUID": "F3EECA05-F94B-4673-A118-98504C8C5828",
    "DataProviderID": 26,
    "DataProvidersReference": "25702",
    "OperatorID": 78,
    "OperatorsReference": "Essent EM-NL-00000086-01-00001",
    "UsageCost": "0.00 jaarabonnement",
    "AddressInfo": {
        "ID": 39265,
        "Title": "Visserwei 33",
        "AddressLine1": "Visserwei 33",
        "Town": "Opsterland",
        "Postcode": "8407 EZ",
        "CountryID": 159,
        "Latitude": 53.017786,
        "Longitude": 6.053207,
        "RelatedURL": "http://www.essent.nl",
        "DistanceUnit": 0
    },
    "Connections": [
        {
            "ID": 42430,
            "ConnectionTypeID": 25,
            "LevelID": 2,
            "PowerKW": 11,
            "CurrentTypeID": 10
        },
        {
            "ID": 49811,
            "ConnectionTypeID": 25,
            "LevelID": 2,
            "PowerKW": 11,
            "CurrentTypeID": 10
        }
    ],
    "NumberOfPoints": 1,
    "StatusTypeID": 50,
    "DateLastStatusUpdate": "2016-06-04T02:56:00Z",
    "DataQualityLevel": 3,
    "DateCreated": "2015-01-09T06:08:00Z",
    "SubmissionStatusTypeID": 100
}