{
    "IsRecentlyVerified": false,
    "ID": 27777,
    "UUID": "E9282943-5A97-4AB6-8673-CB74EC2FA884",
    "DataProviderID": 2,
    "DataProvidersReference": "63199",
    "OperatorID": 5,
    "UsageTypeID": 1,
    "AddressInfo": {
        "ID": 28123,
        "Title": "SNG-18",
        "AddressLine1": "500 R St",
        "Town": "Sacramento",
        "StateOrProvince": "CA",
        "Postcode": "95811",
        "CountryID": 2,
        "Latitude": 38.572757,
        "Longitude": -121.503397,
        "ContactTelephone1": "888-758-4389",
        "AccessComments": "24 hours daily",
        "RelatedURL": "http://www.chargepoint.com/",
        "DistanceUnit": 0
    },
    "Connections": [
        {
            "ID": 30491,
            "ConnectionTypeID": 1,
            "LevelID": 2,
            "Amps": 16,
            "Voltage": 230,
            "PowerKW": 3,
            "CurrentTypeID": 10,
            "Quantity": 7
        }
    ],
    "DateLastStatusUpdate": "2019-04-06T04:03:00Z",
    "DataQualityLevel": 3,
    "DateCreated": "2014-11-28T03:38:00Z",
    "SubmissionStatusTypeID": 100
}