{
    "IsRecentlyVerified": false,
    "ID": 123504,
    "UUID": "49709C83-0DEB-4DF3-9E01-3EA1141667F9",
    "DataProviderID": 1,
    "UsageTypeID": 1,
    "UsageCost": "Free",
    "AddressInfo": {
        "ID": 123850,
        "Title": "City of Danville - Farmers' Market",
        "AddressLine1": "629 Craghead St",
        "Town": "Danville",
        "StateOrProvince": "VA",
        "Postcode": "24541",
        "CountryID": 2,
        "Latitude": 36.585241,
        "Longitude": -79.384187,
        "ContactTelephone1": "434-799-5245",
        "AccessComments": "24 hours daily; maximum session time of one hour",
        "DistanceUnit": 0
    },
    "Connections": [
        {
            "ID": 173490,
            "ConnectionTypeID": 1,
            "LevelID": 2,
            "Amps": 32,
            "Voltage": 208,
            "PowerKW": 6.5,
            "CurrentTypeID": 10,
            "Quantity": 1
        }
    ],
    "StatusTypeID": 0,
    "DateLastStatusUpdate": "2019-08-14T21:46:00Z",
    "DataQualityLevel": 3,
    "DateCreated": "2019-04-06T05:03:00Z",
    "SubmissionStatusTypeID": 100
}