{
    "IsRecentlyVerified": false,
    "ID": 154687,
    "UUID": "9FD75005-F228-47D6-BB99-8574AD2CEB34",
    "DataProviderID": 1,
    "OperatorID": 3392,
    "UsageTypeID": 1,
    "AddressInfo": {
        "ID": 155040,
        "Title": "Crewe Toll",
        "AddressLine1": "Crewe Toll",
        "Town": "Edinburgh",
        "Postcode": "EH4 2NT",
        "CountryID": 1,
        "Latitude": 55.967531,
        "Longitude": -3.235827,
        "AccessComments": "",
        "RelatedURL": "http://www.shell.co.uk/motorist/welcome-to-shell-recharge.html",
        "DistanceUnit": 0
    },
    "Connections": [
        {
            "ID": 217639,
            "ConnectionTypeID": 1036,
            "Reference": "1",
            "StatusTypeID": 50,
            "LevelID": 3,
            "Amps": 63,
            "Voltage": 400,
            "PowerKW": 43,
            "CurrentTypeID": 20,
            "Quantity": 1
        },
        {
            "ID": 217640,
            "ConnectionTypeID": 33,
            "Reference": "2",
            "StatusTypeID": 50,
            "LevelID": 3,
            "Amps": 125,
            "Voltage": 400,
            "PowerKW": 50,
            "CurrentTypeID": 30,
            "Quantity": 1
        },
        {
            "ID": 217641,
            "ConnectionTypeID": 2,
            "Reference": "3",
            "StatusTypeID": 50,
            "LevelID": 3,
            "Amps": 125,
            "Voltage": 400,
            "PowerKW": 50,
            "CurrentTypeID": 30,
            "Quantity": 1
        }
    ],
    "StatusTypeID": 50,
    "DateLastStatusUpdate": "2020-10-12T17:53:00Z",
    "MetadataValues": [
        {
            "ID": 7239,
            "MetadataFieldID": 4,
            "ItemValue": "Contains public sector information licensed under the Open Government Licence v2.0. http://www.nationalarchives.gov.uk/doc/open-government-licence/version/2/"
        }
    ],
    "DataQualityLevel": 3,
    "DateCreated": "2020-03-17T08:15:00Z",
    "SubmissionStatusTypeID": 100
}