{
    "IsRecentlyVerified": false,
    "ID": 122156,
    "UUID": "8BBAC2C0-E040-4D4E-A072-7E574C715159",
    "DataProviderID": 2,
    "DataProvidersReference": "99294",
    "OperatorID": 59,
    "UsageTypeID": 1,
    "AddressInfo": {
        "ID": 122502,
        "Title": "Greenlots - 53205",
        "AddressLine1": "1955 Workman Mill Rd.",
        "Town": "Whittier",
        "StateOrProvince": "CA",
        "Postcode": "90601",
        "CountryID": 2,
        "Latitude": 34.03229,
        "Longitude": -118.021989,
        "ContactTelephone1": "855-900-7584",
        "AccessComments": "24 hours daily",
        "RelatedURL": "http://greenlots.com/",
        "DistanceUnit": 0
    },
    "Connections": [
        {
            "ID": 172023,
            "ConnectionTypeID": 1,
            "LevelID": 2,
            "Amps": 16,
            "Voltage": 230,
            "PowerKW": 3.7,
            "CurrentTypeID": 10,
            "Quantity": 24
        },
        {
            "ID": 195117,
            "ConnectionTypeID": 2,
            "LevelID": 3,
            "Amps": 100,
            "Voltage": 400,
            "PowerKW": 40,
            "CurrentTypeID": 30,
            "Quantity": 1
        },
        {
            "ID": 195118,
            "ConnectionTypeID": 32,
            "LevelID": 3,
            "Amps": 100,
            "Voltage": 400,
            "PowerKW": 40,
            "CurrentTypeID": 30,
            "Quantity": 1
        }
    ],
    "DateLastStatusUpdate": "2020-06-26T02:56:00Z",
    "DataQualityLevel": 3,
    "DateCreated": "2019-04-06T05:02:00Z",
    "SubmissionStatusTypeID": 100
}