{
    "IsRecentlyVerified": false,
    "ID": 110379,
    "UUID": "F56C38ED-D20B-401B-96E1-A8DFAA99A9C4",
    "DataProviderID": 2,
    "DataProvidersReference": "98837",
    "UsageTypeID": 1,
    "AddressInfo": {
        "ID": 110725,
        "Title": "Millie's Road House Bar",
        "AddressLine1": "200 Old Ocean Gateway",
        "Town": "Vienna",
        "StateOrProvince": "MD",
        "Postcode": "21869",
        "CountryID": 2,
        "Latitude": 38.485086,
        "Longitude": -75.823956,
        "ContactTelephone1": "410-685-1109  410-376-3130",
        "AccessComments": "24 hours daily",
        "RelatedURL": "",
        "DistanceUnit": 0
    },
    "Connections": [
        {
            "ID": 155628,
            "ConnectionTypeID": 1,
            "LevelID": 2,
            "Amps": 16,
            "Voltage": 230,
            "PowerKW": 3.7,
            "CurrentTypeID": 10,
            "Quantity": 2
        }
    ],
    "DateLastStatusUpdate": "2020-06-26T03:00:00Z",
    "DataQualityLevel": 3,
    "DateCreated": "2018-10-18T23:36:00Z",
    "SubmissionStatusTypeID": 100
}