{
    "IsRecentlyVerified": false,
    "ID": 121257,
    "UUID": "538E5F54-21F6-42BB-9D1A-475064F683F9",
    "DataProviderID": 2,
    "DataProvidersReference": "121058",
    "OperatorID": 5,
    "UsageTypeID": 1,
    "AddressInfo": {
        "ID": 121603,
        "Title": "SALT LAKE CITY",
        "AddressLine1": "475 S 300 E",
        "Town": "Salt Lake City",
        "StateOrProvince": "UT",
        "Postcode": "84111",
        "CountryID": 2,
        "Latitude": 40.763073,
        "Longitude": -111.877095,
        "ContactTelephone1": "888-758-4389",
        "AccessComments": "24 hours daily",
        "RelatedURL": "http://www.chargepoint.com/",
        "DistanceUnit": 0
    },
    "Connections": [
        {
            "ID": 170697,
            "ConnectionTypeID": 1,
            "LevelID": 2,
            "Amps": 16,
            "Voltage": 230,
            "PowerKW": 3.7,
            "CurrentTypeID": 10,
            "Quantity": 4
        }
    ],
    "DateLastStatusUpdate": "2020-06-26T03:03:00Z",
    "DataQualityLevel": 3,
    "DateCreated": "2019-04-01T05:00:00Z",
    "SubmissionStatusTypeID": 100
}