{
    "IsRecentlyVerified": false,
    "ID": 104980,
    "UUID": "9970968C-E84C-4F96-B56A-9586EDCB4187",
    "DataProviderID": 1,
    "OperatorID": 23,
    "OperatorsReference": "43373",
    "UsageTypeID": 4,
    "AddressInfo": {
        "ID": 105326,
        "Title": "Hotel und Restaurant Casanotte & Da Franco",
        "AddressLine1": "Frankenstr. 37",
        "Town": "Reken",
        "Postcode": "48734",
        "CountryID": 87,
        "Latitude": 51.8046836,
        "Longitude": 7.0233475,
        "ContactTelephone1": "+49 2864 3681364",
        "DistanceUnit": 0
    },
    "Connections": [
        {
            "ID": 148053,
            "ConnectionTypeID": 30,
            "StatusTypeID": 50,
            "LevelID": 2,
            "Amps": 32,
            "Voltage": 400,
            "PowerKW": 22,
            "CurrentTypeID": 20,
            "Quantity": 1
        }
    ],
    "NumberOfPoints": 1,
    "GeneralComments": "1 Tesla Connector, up to 22kW.Available for customers. Please see front desk.",
    "StatusTypeID": 50,
    "DateLastStatusUpdate": "2018-10-03T17:13:00Z",
    "DataQualityLevel": 1,
    "DateCreated": "2018-05-26T05:42:00Z",
    "SubmissionStatusTypeID": 200
}