{
    "MediaItems": [
        {
            "ID": 20772,
            "ChargePointID": 145939,
            "ItemURL": "https://s3-ap-southeast-2.amazonaws.com/openchargemap/images/IT/OCM145939/OCM-145939.orig.2019123007573004.jpg",
            "ItemThumbnailURL": "https://s3-ap-southeast-2.amazonaws.com/openchargemap/images/IT/OCM145939/OCM-145939.thmb.2019123007573004.jpg",
            "Comment": "",
            "IsEnabled": true,
            "IsVideo": false,
            "IsFeaturedItem": false,
            "IsExternalResource": false,
            "User": {
                "ID": 19496,
                "Username": "ECOGY"
            },
            "DateCreated": "2019-12-30T07:58:00Z"
        },
        {
            "ID": 20773,
            "ChargePointID": 145939,
            "ItemURL": "https://s3-ap-southeast-2.amazonaws.com/openchargemap/images/IT/OCM145939/OCM-145939.orig.2019123007574827.jpg",
            "ItemThumbnailURL": "https://s3-ap-southeast-2.amazonaws.com/openchargemap/images/IT/OCM145939/OCM-145939.thmb.2019123007574827.jpg",
            "Comment": "",
            "IsEnabled": true,
            "IsVideo": false,
            "IsFeaturedItem": false,
            "IsExternalResource": false,
            "User": {
                "ID": 19496,
                "Username": "ECOGY"
            },
            "DateCreated": "2019-12-30T07:58:00Z"
        },
        {
            "ID": 20771,
            "ChargePointID": 145939,
            "ItemURL": "https://s3-ap-southeast-2.amazonaws.com/openchargemap/images/IT/OCM145939/OCM-145939.orig.2019123007565867.jpg",
            "ItemThumbnailURL": "https://s3-ap-southeast-2.amazonaws.com/openchargemap/images/IT/OCM145939/OCM-145939.thmb.2019123007565867.jpg",
            "Comment": "",
            "IsEnabled": true,
            "IsVideo": false,
            "IsFeaturedItem": false,
            "IsExternalResource": false,
            "User": {
                "ID": 19496,
                "Username": "ECOGY"
            },
            "DateCreated": "2019-12-30T07:57:00Z"
        }
    ],
    "IsRecentlyVerified": false,
    "ID": 145939,
    "UUID": "9DD4D89D-A0F4-4408-A5E0-0F963CF6EEF5",
    "DataProviderID": 1,
    "OperatorID": 45,
    "UsageTypeID": 4,
    "AddressInfo": {
        "ID": 146291,
        "Title": "Pra Palmer  the green B&B",
        "AddressLine1": "Str. Promeneda 5",
        "Town": "St. Ulrich – Gröden - Gardena ",
        "StateOrProvince": "Bozen",
        "Postcode": "39040",
        "CountryID": 112,
        "Latitude": 46.570789697788285,
        "Longitude": 11.677173134067289,
        "ContactTelephone1": "+39 0471 796 710",
        "ContactEmail": "info@prapalmer.com",
        "AccessComments": "Für Hotelkunden mittels RFID Karte\r\nEcogy 11 kW",
        "RelatedURL": "https://www.prapalmer.com/",
        "DistanceUnit": 0
    },
    "Connections": [
        {
            "ID": 202811,
            "ConnectionTypeID": 25,
            "StatusTypeID": 50,
            "LevelID": 2,
            "Amps": 16,
            "Voltage": 400,
            "PowerKW": 11,
            "CurrentTypeID": 20,
            "Quantity": 1
        }
    ],
    "NumberOfPoints": 1,
    "GeneralComments": "Die Ladestation befindet sich auf dem Kundenparkplatz",
    "StatusTypeID": 50,
    "DateLastStatusUpdate": "2019-12-30T07:58:00Z",
    "DataQualityLevel": 1,
    "DateCreated": "2019-12-30T07:56:00Z",
    "SubmissionStatusTypeID": 200
}