{
    "IsRecentlyVerified": false,
    "ID": 93998,
    "UUID": "5B373222-7A5B-4216-B258-BF20B87EF5D0",
    "DataProviderID": 1,
    "OperatorID": 23,
    "OperatorsReference": "36250",
    "UsageTypeID": 4,
    "AddressInfo": {
        "ID": 94344,
        "Title": "La Mazatleca",
        "AddressLine1": "Av Camaron Sabalo 1303 Las Gaviotas",
        "Town": "Mazatlan",
        "StateOrProvince": "Sinaloa",
        "Postcode": "82110",
        "CountryID": 146,
        "Latitude": 23.257417,
        "Longitude": -106.461811,
        "ContactTelephone1": "+52 669 913 1666",
        "DistanceUnit": 0
    },
    "Connections": [
        {
            "ID": 133052,
            "ConnectionTypeID": 30,
            "StatusTypeID": 50,
            "LevelID": 2,
            "PowerKW": 18,
            "CurrentTypeID": 20,
            "Quantity": 2
        }
    ],
    "NumberOfPoints": 2,
    "GeneralComments": "2 Tesla Connectors, up to 18kW.Available for customers. Self park.",
    "StatusTypeID": 50,
    "DateLastStatusUpdate": "2017-10-14T05:35:00Z",
    "DataQualityLevel": 1,
    "DateCreated": "2017-10-14T05:35:00Z",
    "SubmissionStatusTypeID": 200
}