{
    "IsRecentlyVerified": false,
    "ID": 107823,
    "UUID": "547B8C0A-B5DA-441A-BAEE-EE2912CF64D2",
    "DataProviderID": 1,
    "OperatorID": 3319,
    "UsageTypeID": 1,
    "UsageCost": "Free",
    "AddressInfo": {
        "ID": 108169,
        "Title": "Budapest, Rózsakert Bevásárlóközpont",
        "AddressLine1": "Gábor Áron utca 74.",
        "AddressLine2": "",
        "Town": "Budapest",
        "StateOrProvince": "Budapest",
        "Postcode": "1026",
        "CountryID": 104,
        "Latitude": 47.5225859,
        "Longitude": 19.015259,
        "ContactTelephone1": "",
        "ContactTelephone2": "",
        "ContactEmail": "",
        "AccessComments": "Főbejárat előtti járda mellet",
        "RelatedURL": "",
        "DistanceUnit": 0
    },
    "Connections": [
        {
            "ID": 152249,
            "ConnectionTypeID": 25,
            "StatusTypeID": 50,
            "LevelID": 2,
            "Amps": 32,
            "Voltage": 400,
            "PowerKW": 22,
            "CurrentTypeID": 20,
            "Quantity": 2
        }
    ],
    "NumberOfPoints": 2,
    "GeneralComments": "",
    "StatusTypeID": 50,
    "DateLastStatusUpdate": "2018-08-22T09:30:00Z",
    "DataQualityLevel": 1,
    "DateCreated": "2018-08-11T15:50:00Z",
    "SubmissionStatusTypeID": 200
}