{
    "IsRecentlyVerified": false,
    "ID": 87490,
    "UUID": "21163E91-967A-4E76-A968-70AF0131E483",
    "DataProviderID": 1,
    "OperatorID": 69,
    "UsageTypeID": 4,
    "AddressInfo": {
        "ID": 87836,
        "Title": "Ligsalzstraße",
        "AddressLine1": "Ligsalzstraße 44",
        "Town": "München",
        "StateOrProvince": "Bayern",
        "Postcode": "80339",
        "CountryID": 87,
        "Latitude": 48.134116,
        "Longitude": 11.541715199999999,
        "AccessComments": "24/7 nutzbar mit 4 kostenplosen Parkplätzen direkt am Eingang zur U-Bahn Schwanthalerhöhe.",
        "DistanceUnit": 0
    },
    "Connections": [
        {
            "ID": 124027,
            "ConnectionTypeID": 25,
            "StatusTypeID": 50,
            "LevelID": 2,
            "Amps": 32,
            "Voltage": 400,
            "PowerKW": 22,
            "CurrentTypeID": 20,
            "Quantity": 4
        }
    ],
    "NumberOfPoints": 4,
    "StatusTypeID": 50,
    "DateLastStatusUpdate": "2017-05-11T07:03:00Z",
    "DataQualityLevel": 1,
    "DateCreated": "2017-05-11T07:03:00Z",
    "SubmissionStatusTypeID": 200
}