{
    "IsRecentlyVerified": false,
    "ID": 110031,
    "UUID": "B0D311D0-0B44-417D-A054-DE486537CBF7",
    "DataProviderID": 2,
    "DataProvidersReference": "88652",
    "OperatorID": 5,
    "UsageTypeID": 1,
    "AddressInfo": {
        "ID": 110377,
        "Title": "SOCO",
        "AddressLine1": "3525 Colonnade Pkwy",
        "Town": "Birmingham",
        "StateOrProvince": "AL",
        "Postcode": "35243",
        "CountryID": 2,
        "Latitude": 33.435679,
        "Longitude": -86.728304,
        "ContactTelephone1": "888-758-4389",
        "AccessComments": "24 hours daily",
        "RelatedURL": "http://www.chargepoint.com/",
        "DistanceUnit": 0
    },
    "Connections": [
        {
            "ID": 155259,
            "ConnectionTypeID": 1,
            "LevelID": 2,
            "Amps": 16,
            "Voltage": 230,
            "PowerKW": 3,
            "CurrentTypeID": 10,
            "Quantity": 8
        }
    ],
    "DateLastStatusUpdate": "2019-04-06T04:01:00Z",
    "DataQualityLevel": 3,
    "DateCreated": "2018-10-18T23:35:00Z",
    "SubmissionStatusTypeID": 100
}