{
    "IsRecentlyVerified": false,
    "ID": 154603,
    "UUID": "E121D808-CFE0-4F38-8084-69808688C7B9",
    "DataProviderID": 1,
    "OperatorID": 150,
    "UsageTypeID": 5,
    "AddressInfo": {
        "ID": 154956,
        "Title": "Portway",
        "AddressLine1": "Portway",
        "Town": "Bristol",
        "Postcode": "BS11 9QE",
        "CountryID": 1,
        "Latitude": 51.491501,
        "Longitude": -2.689291,
        "AccessComments": "",
        "RelatedURL": "http://www.chargepointservices.com/",
        "DistanceUnit": 0
    },
    "Connections": [
        {
            "ID": 217468,
            "ConnectionTypeID": 25,
            "Reference": "1",
            "StatusTypeID": 50,
            "LevelID": 2,
            "Amps": 32,
            "Voltage": 230,
            "PowerKW": 7,
            "CurrentTypeID": 10,
            "Quantity": 1
        },
        {
            "ID": 217469,
            "ConnectionTypeID": 25,
            "Reference": "2",
            "StatusTypeID": 50,
            "LevelID": 2,
            "Amps": 32,
            "Voltage": 230,
            "PowerKW": 7,
            "CurrentTypeID": 10,
            "Quantity": 1
        }
    ],
    "StatusTypeID": 50,
    "DateLastStatusUpdate": "2020-10-19T19:57:00Z",
    "MetadataValues": [
        {
            "ID": 7155,
            "MetadataFieldID": 4,
            "ItemValue": "Contains public sector information licensed under the Open Government Licence v2.0. http://www.nationalarchives.gov.uk/doc/open-government-licence/version/2/"
        }
    ],
    "DataQualityLevel": 3,
    "DateCreated": "2020-03-17T08:15:00Z",
    "SubmissionStatusTypeID": 100
}