{
    "IsRecentlyVerified": false,
    "ID": 89481,
    "UUID": "2B73CF7D-F108-4E13-8971-77AAA434C756",
    "DataProviderID": 2,
    "DataProvidersReference": "63477",
    "UsageTypeID": 1,
    "AddressInfo": {
        "ID": 89827,
        "Title": "Fort Ross State Historic Park",
        "AddressLine1": "19005 Coast Hwy",
        "Town": "Jenner",
        "StateOrProvince": "CA",
        "Postcode": "95450",
        "CountryID": 2,
        "Latitude": 38.5159746604047,
        "Longitude": -123.246708949738,
        "ContactTelephone1": "707-847-3437",
        "AccessComments": "10AM-4:30PM daily",
        "RelatedURL": "",
        "DistanceUnit": 0
    },
    "Connections": [
        {
            "ID": 126883,
            "ConnectionTypeID": 1,
            "LevelID": 2,
            "Amps": 16,
            "Voltage": 230,
            "PowerKW": 3.7,
            "CurrentTypeID": 10,
            "Quantity": 2
        }
    ],
    "DateLastStatusUpdate": "2020-06-26T03:00:00Z",
    "DataQualityLevel": 3,
    "DateCreated": "2017-06-22T08:16:00Z",
    "SubmissionStatusTypeID": 100
}