{
    "IsRecentlyVerified": false,
    "ID": 47933,
    "UUID": "911CEDE9-82B8-4274-AA3D-774B9801232E",
    "DataProviderID": 1,
    "OperatorID": 105,
    "UsageTypeID": 4,
    "AddressInfo": {
        "ID": 48279,
        "Title": "Vaillant",
        "AddressLine1": "Berghauser Straße 40",
        "AddressLine2": "Lüttringhausen",
        "Town": "Remscheid",
        "StateOrProvince": "Remscheid",
        "Postcode": "42859",
        "CountryID": 87,
        "Latitude": 51.1712086,
        "Longitude": 7.21115359999999,
        "AccessComments": "Vertrag von RWE oder Roamingpartnern BEW, LübbeckeStrom eMobil, Plugsurfing etc. erforderlich.",
        "DistanceUnit": 0
    },
    "Connections": [
        {
            "ID": 59123,
            "ConnectionTypeID": 25,
            "StatusTypeID": 50,
            "LevelID": 2,
            "Amps": 32,
            "Voltage": 400,
            "PowerKW": 22,
            "CurrentTypeID": 20,
            "Quantity": 2
        }
    ],
    "NumberOfPoints": 2,
    "StatusTypeID": 50,
    "DateLastStatusUpdate": "2015-06-17T07:43:00Z",
    "DataQualityLevel": 1,
    "DateCreated": "2015-06-17T07:15:00Z",
    "SubmissionStatusTypeID": 200
}