{
    "IsRecentlyVerified": false,
    "ID": 97853,
    "UUID": "15DAA2F6-57C1-4B3B-99DF-E59A81784283",
    "DataProviderID": 1,
    "OperatorID": 23,
    "OperatorsReference": "38817",
    "UsageTypeID": 7,
    "AddressInfo": {
        "ID": 98199,
        "Title": "Holiday Inn Hamburg",
        "AddressLine1": "Billwerder Beuer Deich 14",
        "Town": "Hamburg",
        "Postcode": "20539",
        "CountryID": 87,
        "Latitude": 53.535419,
        "Longitude": 10.029984,
        "ContactTelephone1": "+49 4078840",
        "DistanceUnit": 0
    },
    "Connections": [
        {
            "ID": 138761,
            "ConnectionTypeID": 30,
            "StatusTypeID": 50,
            "LevelID": 2,
            "Amps": 32,
            "Voltage": 400,
            "PowerKW": 22,
            "CurrentTypeID": 20,
            "Quantity": 3
        }
    ],
    "NumberOfPoints": 3,
    "GeneralComments": "3 Tesla Connectors, up to 22kW.Available by reservation only. Please see front desk.",
    "StatusTypeID": 50,
    "DateLastStatusUpdate": "2018-10-03T21:09:00Z",
    "DataQualityLevel": 1,
    "DateCreated": "2018-01-21T16:49:00Z",
    "SubmissionStatusTypeID": 200
}