{
    "IsRecentlyVerified": false,
    "ID": 119463,
    "UUID": "BC8D35DB-D1B5-4D17-AFED-04220E789E05",
    "DataProviderID": 2,
    "DataProvidersReference": "66910",
    "OperatorID": 107,
    "UsageTypeID": 1,
    "AddressInfo": {
        "ID": 119809,
        "Title": "Aloha Stadium",
        "AddressLine1": "99-500 Salt Lake Blvd",
        "Town": "Honolulu",
        "StateOrProvince": "HI",
        "Postcode": "96818",
        "CountryID": 2,
        "Latitude": 21.37145,
        "Longitude": -157.93084,
        "ContactTelephone1": "808-483-2500",
        "AccessComments": "6am-12pm daily",
        "RelatedURL": "http://www.opconnect.com/",
        "DistanceUnit": 0
    },
    "Connections": [
        {
            "ID": 168726,
            "ConnectionTypeID": 1,
            "LevelID": 2,
            "Amps": 16,
            "Voltage": 230,
            "PowerKW": 3.7,
            "CurrentTypeID": 10,
            "Quantity": 2
        }
    ],
    "DateLastStatusUpdate": "2020-06-26T02:52:00Z",
    "DataQualityLevel": 3,
    "DateCreated": "2019-04-01T04:59:00Z",
    "SubmissionStatusTypeID": 100
}