{
    "IsRecentlyVerified": false,
    "ID": 112212,
    "UUID": "65B1321C-55A1-4480-9ABA-EA61FD9A7CD5",
    "DataProviderID": 2,
    "DataProvidersReference": "83807",
    "UsageTypeID": 2,
    "AddressInfo": {
        "ID": 112558,
        "Title": "Edmonton Remand Centre",
        "AddressLine1": "18415 127 St NW",
        "Town": "Edmonton",
        "StateOrProvince": "AB",
        "Postcode": "T6V 1B1",
        "CountryID": 44,
        "Latitude": 53.6453302432142,
        "Longitude": -113.538869212896,
        "ContactTelephone1": "",
        "AccessComments": "For employee use only",
        "RelatedURL": "",
        "DistanceUnit": 0
    },
    "Connections": [
        {
            "ID": 157764,
            "ConnectionTypeID": 1,
            "LevelID": 2,
            "Amps": 16,
            "Voltage": 230,
            "PowerKW": 3.7,
            "CurrentTypeID": 10,
            "Quantity": 1
        }
    ],
    "DateLastStatusUpdate": "2020-06-26T03:12:00Z",
    "DataQualityLevel": 3,
    "DateCreated": "2018-10-18T23:37:00Z",
    "SubmissionStatusTypeID": 100
}