{
    "IsRecentlyVerified": false,
    "ID": 112749,
    "UUID": "795FC990-B6E5-4023-B8AE-1DFEB222E28D",
    "DataProviderID": 1,
    "OperatorID": 80,
    "UsageTypeID": 4,
    "AddressInfo": {
        "ID": 113095,
        "Title": "Porto Salvo Via Roma | EnelX",
        "AddressLine1": "Via Roma",
        "Town": "Vibo Valentia",
        "StateOrProvince": "VV",
        "Postcode": "89900 ",
        "CountryID": 112,
        "Latitude": 38.7092673580545,
        "Longitude": 16.0761265903937,
        "ContactTelephone1": "800.069.850",
        "RelatedURL": "https://www.enelx.com/it/it/emobility",
        "DistanceUnit": 0
    },
    "Connections": [
        {
            "ID": 158762,
            "ConnectionTypeID": 25,
            "StatusTypeID": 50,
            "LevelID": 2,
            "Amps": 32,
            "Voltage": 400,
            "PowerKW": 22,
            "CurrentTypeID": 20,
            "Quantity": 1
        },
        {
            "ID": 158763,
            "ConnectionTypeID": 36,
            "StatusTypeID": 50,
            "LevelID": 2,
            "Amps": 16,
            "Voltage": 240,
            "PowerKW": 3.7,
            "CurrentTypeID": 20,
            "Quantity": 1
        }
    ],
    "NumberOfPoints": 2,
    "StatusTypeID": 50,
    "DateLastStatusUpdate": "2019-01-07T14:34:00Z",
    "DataQualityLevel": 1,
    "DateCreated": "2018-11-13T10:33:00Z",
    "SubmissionStatusTypeID": 200
}