{
    "IsRecentlyVerified": false,
    "ID": 111764,
    "UUID": "9E96BC54-3A04-42A0-A666-C1477CDC1A30",
    "DataProviderID": 2,
    "DataProvidersReference": "83162",
    "UsageTypeID": 1,
    "AddressInfo": {
        "ID": 112110,
        "Title": "Lake Shore GM",
        "AddressLine1": "1155 Government Rd",
        "Town": "West Kirkland Lake",
        "StateOrProvince": "ON",
        "Postcode": "P2N 3K4",
        "CountryID": 44,
        "Latitude": 48.131962,
        "Longitude": -80.067984,
        "ContactTelephone1": "705-567-9271",
        "AccessComments": "24 hours daily",
        "RelatedURL": "",
        "DistanceUnit": 0
    },
    "Connections": [
        {
            "ID": 157258,
            "ConnectionTypeID": 1,
            "LevelID": 2,
            "Amps": 16,
            "Voltage": 230,
            "PowerKW": 3.7,
            "CurrentTypeID": 10,
            "Quantity": 1
        }
    ],
    "DateLastStatusUpdate": "2020-06-26T03:11:00Z",
    "DataQualityLevel": 3,
    "DateCreated": "2018-10-18T23:37:00Z",
    "SubmissionStatusTypeID": 100
}