{
    "MediaItems": [
        {
            "ID": 15600,
            "ChargePointID": 105439,
            "ItemURL": "https://s3-ap-southeast-2.amazonaws.com/openchargemap/images/HU/OCM105439/OCM-105439.orig.2018060618570632.jpg",
            "ItemThumbnailURL": "https://s3-ap-southeast-2.amazonaws.com/openchargemap/images/HU/OCM105439/OCM-105439.thmb.2018060618570632.jpg",
            "Comment": "",
            "IsEnabled": true,
            "IsVideo": false,
            "IsFeaturedItem": false,
            "IsExternalResource": false,
            "User": {
                "ID": 18427,
                "Username": "mmkriszti"
            },
            "DateCreated": "2018-06-06T18:57:00Z"
        }
    ],
    "IsRecentlyVerified": false,
    "ID": 105439,
    "UUID": "219DBE55-22F8-4C42-B89D-A6F6D83D056E",
    "DataProviderID": 1,
    "OperatorID": 1,
    "UsageTypeID": 1,
    "UsageCost": "egyelőre ingyenes",
    "AddressInfo": {
        "ID": 105785,
        "Title": "Szabadbattyán, Avia kút",
        "AddressLine1": "Emmaróza 70-es út",
        "Town": "Szabadbattyán",
        "StateOrProvince": "Fejér megye",
        "Postcode": "8151",
        "CountryID": 104,
        "Latitude": 47.1343248945396,
        "Longitude": 18.382915335582,
        "DistanceUnit": 0
    },
    "Connections": [
        {
            "ID": 148610,
            "ConnectionTypeID": 25,
            "StatusTypeID": 50,
            "LevelID": 2,
            "Amps": 32,
            "Voltage": 400,
            "PowerKW": 22,
            "CurrentTypeID": 20,
            "Quantity": 2
        }
    ],
    "NumberOfPoints": 2,
    "GeneralComments": "A kutas indítja, RFID kártyával. Jelenleg ingyenes, később várhatóan 500 Ft/töltés, ami a shopban levásárolható.",
    "StatusTypeID": 50,
    "DateLastStatusUpdate": "2018-06-06T20:01:00Z",
    "DataQualityLevel": 1,
    "DateCreated": "2018-06-06T18:57:00Z",
    "SubmissionStatusTypeID": 200
}