{
    "IsRecentlyVerified": false,
    "ID": 122051,
    "UUID": "7954F9AD-F676-4EB1-880B-AC3613B53F55",
    "DataProviderID": 2,
    "DataProvidersReference": "117709",
    "OperatorID": 9,
    "UsageTypeID": 1,
    "AddressInfo": {
        "ID": 122397,
        "Title": "Bexco Enterprises",
        "AddressLine1": "8700 Rex Rd",
        "Town": "Pico Rivera",
        "StateOrProvince": "CA",
        "Postcode": "90660",
        "CountryID": 2,
        "Latitude": 33.979264,
        "Longitude": -118.105339,
        "ContactTelephone1": "888-998-2546",
        "AccessComments": "MON: 24 hours | TUE: 24 hours | WED: 24 hours | THU: 24 hours | FRI: 24 hours | SAT: 24 hours | SUN: 24 hours",
        "RelatedURL": "http://www.blinkcharging.com/",
        "DistanceUnit": 0
    },
    "Connections": [
        {
            "ID": 171902,
            "ConnectionTypeID": 1,
            "LevelID": 2,
            "Amps": 16,
            "Voltage": 230,
            "PowerKW": 3.7,
            "CurrentTypeID": 10,
            "Quantity": 3
        }
    ],
    "DateLastStatusUpdate": "2020-06-26T02:56:00Z",
    "DataQualityLevel": 3,
    "DateCreated": "2019-04-06T05:02:00Z",
    "SubmissionStatusTypeID": 100
}