{
    "IsRecentlyVerified": false,
    "ID": 104067,
    "UUID": "201D49DD-F3D5-40D6-98D3-496A28A0E3A3",
    "DataProviderID": 1,
    "OperatorID": 80,
    "UsageTypeID": 4,
    "AddressInfo": {
        "ID": 104413,
        "Title": "EnelX EVA+ Conad Taverna di Montalto",
        "AddressLine1": "Via A. Manzoni",
        "AddressLine2": "Taverna ",
        "Town": "Montalto Uffugo",
        "StateOrProvince": "CS",
        "Postcode": "87040",
        "CountryID": 112,
        "Latitude": 39.4297926366391,
        "Longitude": 16.2252077873342,
        "RelatedURL": "https://www.enelx.com/it/it/emobility",
        "DistanceUnit": 0
    },
    "Connections": [
        {
            "ID": 146898,
            "ConnectionTypeID": 33,
            "StatusTypeID": 50,
            "LevelID": 3,
            "Amps": 120,
            "Voltage": 500,
            "PowerKW": 50,
            "CurrentTypeID": 30,
            "Quantity": 1
        },
        {
            "ID": 146899,
            "ConnectionTypeID": 2,
            "StatusTypeID": 50,
            "LevelID": 3,
            "Amps": 120,
            "Voltage": 500,
            "PowerKW": 50,
            "CurrentTypeID": 30,
            "Quantity": 1
        },
        {
            "ID": 146900,
            "ConnectionTypeID": 1036,
            "StatusTypeID": 50,
            "LevelID": 3,
            "Amps": 64,
            "Voltage": 400,
            "PowerKW": 43,
            "CurrentTypeID": 20,
            "Quantity": 1
        }
    ],
    "NumberOfPoints": 2,
    "StatusTypeID": 50,
    "DateLastStatusUpdate": "2019-08-09T08:35:00Z",
    "DataQualityLevel": 1,
    "DateCreated": "2018-05-15T14:26:00Z",
    "SubmissionStatusTypeID": 200
}