{
    "IsRecentlyVerified": false,
    "ID": 65694,
    "UUID": "1243BB3D-6E1E-47F9-A11A-5850CC1623C9",
    "DataProviderID": 26,
    "DataProvidersReference": "85187",
    "OperatorID": 103,
    "OperatorsReference": "Allego NLALLEGO0006312",
    "UsageCost": "0.00 jaarabonnement",
    "AddressInfo": {
        "ID": 66040,
        "Title": "Lange Heul 181",
        "AddressLine1": "Lange Heul 181",
        "Town": "Gooise Meren",
        "Postcode": "1403 NH",
        "CountryID": 159,
        "Latitude": 52.26180876,
        "Longitude": 5.16934397,
        "ContactTelephone1": "0800-3745337",
        "RelatedURL": "http://www.allego.eu/",
        "DistanceUnit": 0
    },
    "Connections": [
        {
            "ID": 90662,
            "ConnectionTypeID": 25,
            "LevelID": 2,
            "PowerKW": 11,
            "CurrentTypeID": 10
        },
        {
            "ID": 90663,
            "ConnectionTypeID": 25,
            "LevelID": 2,
            "PowerKW": 11,
            "CurrentTypeID": 10
        }
    ],
    "NumberOfPoints": 1,
    "StatusTypeID": 50,
    "DateLastStatusUpdate": "2016-06-04T02:52:00Z",
    "DataQualityLevel": 3,
    "DateCreated": "2016-04-27T09:42:00Z",
    "SubmissionStatusTypeID": 100
}