{
    "UserComments": [
        {
            "ID": 22163,
            "ChargePointID": 137553,
            "CommentTypeID": 50,
            "UserName": "EnviroTex",
            "Comment": "tried to get to this location but could not. it either doesn't exist or is inside a gated apartment complex",
            "DateCreated": "2020-02-17T03:58:05.897Z",
            "User": {
                "ID": 25065,
                "Username": "EnviroTex"
            },
            "CheckinStatusTypeID": 120,
            "IsActionedByEditor": false
        }
    ],
    "IsRecentlyVerified": false,
    "ID": 137553,
    "UUID": "B27108DC-35A7-4FE2-9CC3-11F37A93B5D5",
    "DataProviderID": 2,
    "DataProvidersReference": "81113",
    "OperatorID": 5,
    "UsageTypeID": 1,
    "AddressInfo": {
        "ID": 137899,
        "Title": "WALLERCREEKSIDE",
        "AddressLine1": "102-104 E 50th St",
        "Town": "Austin",
        "StateOrProvince": "TX",
        "Postcode": "78751",
        "CountryID": 2,
        "Latitude": 30.3152291,
        "Longitude": -97.7243951,
        "ContactTelephone1": "888-758-4389",
        "AccessComments": "24 hours daily",
        "RelatedURL": "http://www.chargepoint.com/",
        "DistanceUnit": 0
    },
    "Connections": [
        {
            "ID": 192487,
            "ConnectionTypeID": 1,
            "LevelID": 2,
            "Amps": 16,
            "Voltage": 230,
            "PowerKW": 3,
            "CurrentTypeID": 10,
            "Quantity": 1
        }
    ],
    "StatusTypeID": 50,
    "DateLastStatusUpdate": "2020-02-17T03:58:00Z",
    "DataQualityLevel": 3,
    "DateCreated": "2019-12-24T09:05:00Z",
    "SubmissionStatusTypeID": 100
}