{
    "IsRecentlyVerified": false,
    "ID": 148905,
    "UUID": "DC512DCB-B98F-4CEB-9C96-DBEB9C925614",
    "DataProviderID": 1,
    "OperatorID": 23,
    "OperatorsReference": "43590",
    "UsageTypeID": 4,
    "UsageCost": "$0.22/kWh; other tariffs for older cars",
    "AddressInfo": {
        "ID": 149258,
        "Title": "Idaho Springs, Co Supercharger",
        "AddressLine1": "1319 Miner Street",
        "Town": "Idaho Springs",
        "StateOrProvince": "CO",
        "Postcode": "80452",
        "CountryID": 2,
        "Latitude": 39.741722,
        "Longitude": -105.518318,
        "DistanceUnit": 0
    },
    "Connections": [
        {
            "ID": 206783,
            "ConnectionTypeID": 27,
            "StatusTypeID": 50,
            "LevelID": 3,
            "PowerKW": 120,
            "CurrentTypeID": 30,
            "Quantity": 8
        }
    ],
    "NumberOfPoints": 8,
    "GeneralComments": "Charging8 Superchargers, available 24/7, up to 250kW",
    "StatusTypeID": 50,
    "DateLastStatusUpdate": "2020-02-13T06:43:00Z",
    "DataQualityLevel": 1,
    "DateCreated": "2020-02-13T06:43:00Z",
    "SubmissionStatusTypeID": 200
}