{
    "IsRecentlyVerified": false,
    "ID": 155576,
    "UUID": "ED8EBA4C-FF1A-4683-BF1C-394E948F63B3",
    "DataProviderID": 1,
    "OperatorID": 3389,
    "UsageTypeID": 1,
    "UsageCost": "$1.00 to Connect, $0.21 per minute",
    "AddressInfo": {
        "ID": 155930,
        "Title": "Target - Francis Energy",
        "AddressLine1": "Great Clips",
        "Town": "Knollwood Estates",
        "StateOrProvince": "OK",
        "Postcode": "74133",
        "CountryID": 2,
        "Latitude": 36.018168727402966,
        "Longitude": -95.88485716535627,
        "RelatedURL": "https://francis.energy/",
        "DistanceUnit": 0
    },
    "Connections": [
        {
            "ID": 219008,
            "ConnectionTypeID": 32,
            "StatusTypeID": 50,
            "LevelID": 3,
            "Amps": 350,
            "Voltage": 950,
            "PowerKW": 200,
            "CurrentTypeID": 30,
            "Quantity": 2,
            "Comments": " BTCPower EVDSP-350-5-120-0-2-C-4-0"
        },
        {
            "ID": 219009,
            "ConnectionTypeID": 2,
            "StatusTypeID": 50,
            "LevelID": 3,
            "Amps": 200,
            "Voltage": 500,
            "PowerKW": 100,
            "CurrentTypeID": 30,
            "Quantity": 2,
            "Comments": " BTCPower EVDSP-350-5-120-0-2-C-4-0"
        }
    ],
    "NumberOfPoints": 2,
    "GeneralComments": "Use EVGateway App to manage charging",
    "StatusTypeID": 50,
    "DateLastStatusUpdate": "2020-04-20T20:01:00Z",
    "DataQualityLevel": 1,
    "DateCreated": "2020-04-19T13:43:00Z",
    "SubmissionStatusTypeID": 200
}