{
    "IsRecentlyVerified": false,
    "ID": 65844,
    "UUID": "E93AFF3F-E05E-4312-879B-21040456771D",
    "DataProviderID": 1,
    "OperatorID": 3,
    "OperatorsReference": "PG-80365",
    "UsageTypeID": 4,
    "UsageCost": "1",
    "AddressInfo": {
        "ID": 66190,
        "Title": "Ribby Hall Village",
        "AddressLine1": "Ribby Road",
        "Town": "Fylde",
        "StateOrProvince": "Lancashire",
        "Postcode": "PR4 2PR",
        "CountryID": 1,
        "Latitude": 53.7775879,
        "Longitude": -2.89452069999993,
        "RelatedURL": "http://www.ribbyhall.co.uk/",
        "DistanceUnit": 0
    },
    "Connections": [
        {
            "ID": 91009,
            "ConnectionTypeID": 25,
            "StatusTypeID": 50,
            "LevelID": 2,
            "Amps": 32,
            "Voltage": 400,
            "PowerKW": 22,
            "CurrentTypeID": 20,
            "Quantity": 1
        },
        {
            "ID": 125769,
            "ConnectionTypeID": 25,
            "StatusTypeID": 50,
            "LevelID": 2,
            "Amps": 32,
            "Voltage": 230,
            "PowerKW": 7,
            "CurrentTypeID": 10,
            "Quantity": 2
        }
    ],
    "NumberOfPoints": 2,
    "GeneralComments": "Pod-Point model T7-S charge point. Web / app login required for continued charging.",
    "StatusTypeID": 50,
    "DateLastStatusUpdate": "2020-04-20T05:27:00Z",
    "DataQualityLevel": 1,
    "DateCreated": "2016-04-28T14:14:00Z",
    "SubmissionStatusTypeID": 200
}