{
    "UserComments": [
        {
            "ID": 24751,
            "ChargePointID": 167673,
            "CommentTypeID": 10,
            "UserName": "ForumElettrico.it",
            "Comment": "Tutto ok con app NextCharge e ricarica a 75 kW pieni. Leggi la recensione completa qui >  https://www.forumelettrico.it/forum/post231227.html#p231227",
            "RelatedURL": "https://www.forumelettrico.it/forum/post231227.html#p231227",
            "DateCreated": "2021-08-20T13:48:36.683Z",
            "User": {
                "ID": 11749,
                "Username": "ForumElettrico.it"
            },
            "CheckinStatusTypeID": 10,
            "IsActionedByEditor": false
        },
        {
            "ID": 24431,
            "ChargePointID": 167673,
            "CommentTypeID": 10,
            "UserName": "ForumElettrico.it",
            "Comment": "Si trova sulla destra del parcheggio auto prima dell'autogrill. Leggi la recensione completa qui >   https://www.forumelettrico.it/forum/colonnina-blitz-power-area-di-servizio-castagnolo-est-t10515.html",
            "RelatedURL": "https://www.forumelettrico.it/forum/colonnina-blitz-power-area-di-servizio-castagnolo-est-t10515.html",
            "DateCreated": "2021-06-01T05:43:03.153Z",
            "User": {
                "ID": 11749,
                "Username": "ForumElettrico.it"
            },
            "CheckinStatusTypeID": 10,
            "IsActionedByEditor": false
        }
    ],
    "MediaItems": [
        {
            "ID": 29043,
            "ChargePointID": 167673,
            "ItemURL": "https://s3-ap-southeast-2.amazonaws.com/openchargemap/images/IT/OCM167673/OCM-167673.orig.2021082013484607.jpg",
            "ItemThumbnailURL": "https://s3-ap-southeast-2.amazonaws.com/openchargemap/images/IT/OCM167673/OCM-167673.thmb.2021082013484607.jpg",
            "Comment": "",
            "IsEnabled": true,
            "IsVideo": false,
            "IsFeaturedItem": false,
            "IsExternalResource": false,
            "User": {
                "ID": 11749,
                "Username": "ForumElettrico.it"
            },
            "DateCreated": "2021-08-20T13:49:00Z"
        },
        {
            "ID": 29044,
            "ChargePointID": 167673,
            "ItemURL": "https://s3-ap-southeast-2.amazonaws.com/openchargemap/images/IT/OCM167673/OCM-167673.orig.2021082013485154.jpg",
            "ItemThumbnailURL": "https://s3-ap-southeast-2.amazonaws.com/openchargemap/images/IT/OCM167673/OCM-167673.thmb.2021082013485154.jpg",
            "Comment": "",
            "IsEnabled": true,
            "IsVideo": false,
            "IsFeaturedItem": false,
            "IsExternalResource": false,
            "User": {
                "ID": 11749,
                "Username": "ForumElettrico.it"
            },
            "DateCreated": "2021-08-20T13:49:00Z"
        },
        {
            "ID": 29045,
            "ChargePointID": 167673,
            "ItemURL": "https://s3-ap-southeast-2.amazonaws.com/openchargemap/images/IT/OCM167673/OCM-167673.orig.2021082013485749.jpg",
            "ItemThumbnailURL": "https://s3-ap-southeast-2.amazonaws.com/openchargemap/images/IT/OCM167673/OCM-167673.thmb.2021082013485749.jpg",
            "Comment": "",
            "IsEnabled": true,
            "IsVideo": false,
            "IsFeaturedItem": false,
            "IsExternalResource": false,
            "User": {
                "ID": 11749,
                "Username": "ForumElettrico.it"
            },
            "DateCreated": "2021-08-20T13:49:00Z"
        },
        {
            "ID": 29046,
            "ChargePointID": 167673,
            "ItemURL": "https://s3-ap-southeast-2.amazonaws.com/openchargemap/images/IT/OCM167673/OCM-167673.orig.2021082013490392.jpg",
            "ItemThumbnailURL": "https://s3-ap-southeast-2.amazonaws.com/openchargemap/images/IT/OCM167673/OCM-167673.thmb.2021082013490392.jpg",
            "Comment": "",
            "IsEnabled": true,
            "IsVideo": false,
            "IsFeaturedItem": false,
            "IsExternalResource": false,
            "User": {
                "ID": 11749,
                "Username": "ForumElettrico.it"
            },
            "DateCreated": "2021-08-20T13:49:00Z"
        },
        {
            "ID": 29047,
            "ChargePointID": 167673,
            "ItemURL": "https://s3-ap-southeast-2.amazonaws.com/openchargemap/images/IT/OCM167673/OCM-167673.orig.2021082013490957.jpg",
            "ItemThumbnailURL": "https://s3-ap-southeast-2.amazonaws.com/openchargemap/images/IT/OCM167673/OCM-167673.thmb.2021082013490957.jpg",
            "Comment": "",
            "IsEnabled": true,
            "IsVideo": false,
            "IsFeaturedItem": false,
            "IsExternalResource": false,
            "User": {
                "ID": 11749,
                "Username": "ForumElettrico.it"
            },
            "DateCreated": "2021-08-20T13:49:00Z"
        },
        {
            "ID": 27966,
            "ChargePointID": 167673,
            "ItemURL": "https://s3-ap-southeast-2.amazonaws.com/openchargemap/images/IT/OCM167673/OCM-167673.orig.2021060105433616.jpg",
            "ItemThumbnailURL": "https://s3-ap-southeast-2.amazonaws.com/openchargemap/images/IT/OCM167673/OCM-167673.thmb.2021060105433616.jpg",
            "Comment": "",
            "IsEnabled": true,
            "IsVideo": false,
            "IsFeaturedItem": false,
            "IsExternalResource": false,
            "User": {
                "ID": 11749,
                "Username": "ForumElettrico.it"
            },
            "DateCreated": "2021-06-01T05:44:00Z"
        },
        {
            "ID": 27963,
            "ChargePointID": 167673,
            "ItemURL": "https://s3-ap-southeast-2.amazonaws.com/openchargemap/images/IT/OCM167673/OCM-167673.orig.2021060105431383.jpg",
            "ItemThumbnailURL": "https://s3-ap-southeast-2.amazonaws.com/openchargemap/images/IT/OCM167673/OCM-167673.thmb.2021060105431383.jpg",
            "Comment": "",
            "IsEnabled": true,
            "IsVideo": false,
            "IsFeaturedItem": false,
            "IsExternalResource": false,
            "User": {
                "ID": 11749,
                "Username": "ForumElettrico.it"
            },
            "DateCreated": "2021-06-01T05:43:00Z"
        },
        {
            "ID": 27964,
            "ChargePointID": 167673,
            "ItemURL": "https://s3-ap-southeast-2.amazonaws.com/openchargemap/images/IT/OCM167673/OCM-167673.orig.2021060105432057.jpg",
            "ItemThumbnailURL": "https://s3-ap-southeast-2.amazonaws.com/openchargemap/images/IT/OCM167673/OCM-167673.thmb.2021060105432057.jpg",
            "Comment": "",
            "IsEnabled": true,
            "IsVideo": false,
            "IsFeaturedItem": false,
            "IsExternalResource": false,
            "User": {
                "ID": 11749,
                "Username": "ForumElettrico.it"
            },
            "DateCreated": "2021-06-01T05:43:00Z"
        },
        {
            "ID": 27965,
            "ChargePointID": 167673,
            "ItemURL": "https://s3-ap-southeast-2.amazonaws.com/openchargemap/images/IT/OCM167673/OCM-167673.orig.2021060105432746.jpg",
            "ItemThumbnailURL": "https://s3-ap-southeast-2.amazonaws.com/openchargemap/images/IT/OCM167673/OCM-167673.thmb.2021060105432746.jpg",
            "Comment": "",
            "IsEnabled": true,
            "IsVideo": false,
            "IsFeaturedItem": false,
            "IsExternalResource": false,
            "User": {
                "ID": 11749,
                "Username": "ForumElettrico.it"
            },
            "DateCreated": "2021-06-01T05:43:00Z"
        }
    ],
    "IsRecentlyVerified": false,
    "ID": 167673,
    "UUID": "B891B3E5-FB40-4FB2-82B8-7B648AC80256",
    "DataProviderID": 1,
    "OperatorID": 1,
    "UsageTypeID": 4,
    "AddressInfo": {
        "ID": 168032,
        "Title": "ADS Castagnolo est | Blitz Power",
        "AddressLine1": "A12 Autostrada Azzurra km 163.512 ",
        "Town": "San Piero A Grado",
        "StateOrProvince": "PI",
        "Postcode": "56122 ",
        "CountryID": 112,
        "Latitude": 43.669310648071644,
        "Longitude": 10.359981197171123,
        "RelatedURL": "https://www.ivpc.com/gruppo/blitz-power/",
        "DistanceUnit": 0
    },
    "Connections": [
        {
            "ID": 254611,
            "ConnectionTypeID": 33,
            "StatusTypeID": 50,
            "LevelID": 3,
            "PowerKW": 95,
            "CurrentTypeID": 30,
            "Quantity": 1
        },
        {
            "ID": 254612,
            "ConnectionTypeID": 2,
            "StatusTypeID": 50,
            "LevelID": 3,
            "PowerKW": 62,
            "CurrentTypeID": 30,
            "Quantity": 1
        },
        {
            "ID": 254613,
            "ConnectionTypeID": 25,
            "StatusTypeID": 50,
            "LevelID": 2,
            "Amps": 32,
            "Voltage": 400,
            "PowerKW": 22,
            "CurrentTypeID": 20,
            "Quantity": 1
        }
    ],
    "NumberOfPoints": 2,
    "StatusTypeID": 50,
    "DateLastStatusUpdate": "2021-08-20T13:49:00Z",
    "DataQualityLevel": 1,
    "DateCreated": "2020-09-09T15:54:00Z",
    "SubmissionStatusTypeID": 200
}