{
    "IsRecentlyVerified": false,
    "ID": 153695,
    "UUID": "76A4830E-A6D9-4BCE-90CC-76604604D788",
    "DataProviderID": 28,
    "DataProvidersReference": "FR*S53*P53185*001",
    "UsageTypeID": 5,
    "AddressInfo": {
        "ID": 154048,
        "Title": "PRE EN PAIL - Rue Des Troenes",
        "AddressLine1": "Rue Des Troenes 53140 PRE EN PAIL",
        "CountryID": 80,
        "Latitude": 48.460889,
        "Longitude": -0.198609,
        "AccessComments": "24h/24 7j/7",
        "DistanceUnit": 0
    },
    "Connections": [
        {
            "ID": 215768,
            "ConnectionTypeID": 26,
            "StatusTypeID": 50,
            "LevelID": 2,
            "PowerKW": 18
        },
        {
            "ID": 215769,
            "ConnectionTypeID": 28,
            "StatusTypeID": 50,
            "LevelID": 2,
            "PowerKW": 18,
            "CurrentTypeID": 10
        },
        {
            "ID": 249474,
            "ConnectionTypeID": 26,
            "StatusTypeID": 50,
            "LevelID": 2,
            "PowerKW": 18
        },
        {
            "ID": 249475,
            "ConnectionTypeID": 28,
            "StatusTypeID": 50,
            "LevelID": 2,
            "PowerKW": 18,
            "CurrentTypeID": 10
        }
    ],
    "GeneralComments": "Recharge par badge et avec une application smartphone",
    "StatusTypeID": 50,
    "DateLastStatusUpdate": "2020-08-27T05:15:00Z",
    "DataQualityLevel": 2,
    "DateCreated": "2020-03-15T10:54:00Z",
    "SubmissionStatusTypeID": 100
}