{
    "IsRecentlyVerified": false,
    "ID": 105294,
    "UUID": "EB4BFE38-D5A5-4E01-8A2F-B2981F5B647E",
    "DataProviderID": 1,
    "OperatorID": 32,
    "OperatorsReference": "24287",
    "UsageTypeID": 4,
    "UsageCost": "£0.108/kWh; for Polar Plus subscription members only",
    "AddressInfo": {
        "ID": 105640,
        "Title": "333 Bromley Road",
        "AddressLine1": "333 Bromley Road",
        "Town": "Outside Catford Police station",
        "StateOrProvince": "London",
        "Postcode": "SE6 2TE",
        "CountryID": 1,
        "Latitude": 51.430439,
        "Longitude": -0.014853,
        "DistanceUnit": 0
    },
    "Connections": [
        {
            "ID": 148439,
            "ConnectionTypeID": 33,
            "StatusTypeID": 50,
            "LevelID": 3,
            "PowerKW": 50,
            "CurrentTypeID": 30,
            "Quantity": 1
        },
        {
            "ID": 148440,
            "ConnectionTypeID": 2,
            "StatusTypeID": 50,
            "LevelID": 3,
            "PowerKW": 50,
            "CurrentTypeID": 30,
            "Quantity": 1
        },
        {
            "ID": 148441,
            "ConnectionTypeID": 1036,
            "StatusTypeID": 50,
            "LevelID": 3,
            "PowerKW": 43,
            "CurrentTypeID": 20,
            "Quantity": 1
        }
    ],
    "NumberOfPoints": 1,
    "StatusTypeID": 50,
    "DateLastStatusUpdate": "2019-06-24T05:15:00Z",
    "DataQualityLevel": 1,
    "DateCreated": "2018-06-04T19:51:00Z",
    "SubmissionStatusTypeID": 200
}