{
    "IsRecentlyVerified": false,
    "ID": 182291,
    "UUID": "C0925D53-5ADF-4A9E-95E6-875A889DDCA2",
    "DataProviderID": 29,
    "DataProvidersReference": "9439",
    "OperatorID": 184,
    "AddressInfo": {
        "ID": 182650,
        "Title": "Thomasstr. 18",
        "AddressLine1": "Thomasstr. 18",
        "Town": "Halver",
        "Postcode": "58553",
        "CountryID": 87,
        "Latitude": 51.188657,
        "Longitude": 7.503802,
        "DistanceUnit": 0
    },
    "Connections": [
        {
            "ID": 287850,
            "ConnectionTypeID": 25,
            "StatusTypeID": 50,
            "LevelID": 2,
            "PowerKW": 22,
            "CurrentTypeID": 20
        },
        {
            "ID": 287851,
            "ConnectionTypeID": 25,
            "StatusTypeID": 50,
            "LevelID": 2,
            "PowerKW": 22,
            "CurrentTypeID": 20
        }
    ],
    "StatusTypeID": 50,
    "DateLastStatusUpdate": "2021-07-09T03:22:00Z",
    "MetadataValues": [
        {
            "ID": 14585,
            "MetadataFieldID": 4,
            "ItemValue": "Data from the German chargepoint registry provided by Bundesnetzagentur.de under the CC-BY 4.0 license"
        }
    ],
    "DataQualityLevel": 3,
    "DateCreated": "2021-07-08T10:02:00Z",
    "SubmissionStatusTypeID": 100
}