{
    "IsRecentlyVerified": false,
    "ID": 136112,
    "UUID": "62C7FE06-8787-481F-AABE-6FF92CB9B8CA",
    "DataProviderID": 18,
    "DataProvidersReference": "26ce6bf04f7e981f1c05b50dcfe42fc4",
    "OperatorID": 2244,
    "UsageTypeID": 5,
    "AddressInfo": {
        "ID": 136458,
        "Title": "St George's Drive",
        "AddressLine1": "St George's Drive",
        "Town": "London",
        "Postcode": "SW1V 4BP",
        "CountryID": 1,
        "Latitude": 51.490384,
        "Longitude": -0.142807,
        "AccessComments": "",
        "RelatedURL": "https://www.ubitricity.com",
        "DistanceUnit": 0
    },
    "Connections": [
        {
            "ID": 190539,
            "ConnectionTypeID": 25,
            "Reference": "suby1100003290",
            "StatusTypeID": 50,
            "LevelID": 2,
            "Amps": 16,
            "Voltage": 230,
            "PowerKW": 3.7,
            "CurrentTypeID": 10
        }
    ],
    "StatusTypeID": 0,
    "DateLastStatusUpdate": "2021-04-25T05:46:00Z",
    "MetadataValues": [
        {
            "ID": 5964,
            "MetadataFieldID": 4,
            "ItemValue": "Contains public sector information licensed under the Open Government Licence v2.0. http://www.nationalarchives.gov.uk/doc/open-government-licence/version/2/"
        }
    ],
    "DataQualityLevel": 3,
    "DateCreated": "2019-12-24T05:22:00Z",
    "SubmissionStatusTypeID": 100
}