{
    "IsRecentlyVerified": false,
    "ID": 63408,
    "UUID": "1BBF853D-0943-4056-BC18-5FA31A16F8F8",
    "DataProviderID": 26,
    "DataProvidersReference": "75739",
    "OperatorID": 73,
    "OperatorsReference": "EV-Box EVB-P1419189",
    "UsageCost": "0.00 jaarabonnement",
    "AddressInfo": {
        "ID": 63754,
        "Title": "Broekweg 5a",
        "AddressLine1": "Broekweg 5a",
        "Town": "Utrechtse Heuvelrug",
        "Postcode": "3956 NE",
        "CountryID": 159,
        "Latitude": 52.01464,
        "Longitude": 5.37958,
        "RelatedURL": "http://www.ev-box.nl",
        "DistanceUnit": 0
    },
    "Connections": [
        {
            "ID": 80846,
            "ConnectionTypeID": 25,
            "LevelID": 2,
            "PowerKW": 11,
            "CurrentTypeID": 10
        },
        {
            "ID": 80847,
            "ConnectionTypeID": 25,
            "LevelID": 2,
            "PowerKW": 11,
            "CurrentTypeID": 10
        }
    ],
    "NumberOfPoints": 1,
    "StatusTypeID": 50,
    "DateLastStatusUpdate": "2016-06-04T02:44:00Z",
    "DataQualityLevel": 3,
    "DateCreated": "2016-03-03T12:30:00Z",
    "SubmissionStatusTypeID": 100
}