{
    "IsRecentlyVerified": false,
    "ID": 61377,
    "UUID": "27F92A20-1D8B-495A-A300-09E213075A44",
    "DataProviderID": 1,
    "DataProvidersReference": "3215",
    "AddressInfo": {
        "ID": 61723,
        "Title": "Møller Bil Sandnes og Jæren, Ganddal",
        "AddressLine1": "Kvålveien 1",
        "Town": "SANDNES",
        "StateOrProvince": "Rogaland",
        "Postcode": "4323",
        "CountryID": 168,
        "Latitude": 58.81867,
        "Longitude": 5.71905,
        "AccessComments": "Volkswagen forhandler Møller Bil Sandnes og Jæren",
        "DistanceUnit": 0
    },
    "Connections": [
        {
            "ID": 78173,
            "ConnectionTypeID": 0,
            "Reference": "1",
            "LevelID": 2,
            "Amps": 100,
            "Voltage": 500,
            "PowerKW": 50,
            "Comments": "Mode 4"
        },
        {
            "ID": 88011,
            "ConnectionTypeID": 0,
            "Reference": "2",
            "LevelID": 2,
            "Amps": 32,
            "Voltage": 400,
            "PowerKW": 22,
            "Comments": "Mode 3"
        }
    ],
    "NumberOfPoints": 2,
    "DateLastStatusUpdate": "2020-05-26T08:22:00Z",
    "DataQualityLevel": 2,
    "DateCreated": "2016-02-27T02:32:00Z",
    "SubmissionStatusTypeID": 100
}