{
    "IsRecentlyVerified": false,
    "ID": 103509,
    "UUID": "4F096503-2A07-4FAA-A9FE-E54E615911EC",
    "DataProviderID": 1,
    "OperatorID": 23,
    "OperatorsReference": "42683",
    "UsageTypeID": 4,
    "AddressInfo": {
        "ID": 103855,
        "Title": "Buergenstock Hotel & Alpine Spa",
        "AddressLine1": "Buergenstock 17",
        "Town": "Obbuergen",
        "Postcode": "6363",
        "CountryID": 217,
        "Latitude": 46.996772,
        "Longitude": 8.379379,
        "ContactTelephone1": "+41 4161 26000",
        "DistanceUnit": 0
    },
    "Connections": [
        {
            "ID": 146176,
            "ConnectionTypeID": 30,
            "StatusTypeID": 50,
            "LevelID": 2,
            "Voltage": 230,
            "PowerKW": 6,
            "CurrentTypeID": 10,
            "Quantity": 2
        }
    ],
    "NumberOfPoints": 2,
    "GeneralComments": "2 Tesla Connectors, up to 6kW.Available for customers. Please see front desk.",
    "StatusTypeID": 50,
    "DateLastStatusUpdate": "2018-10-03T14:31:00Z",
    "DataQualityLevel": 1,
    "DateCreated": "2018-05-04T05:32:00Z",
    "SubmissionStatusTypeID": 200
}