{
    "IsRecentlyVerified": false,
    "ID": 88689,
    "UUID": "F7D2F6F4-89EE-4512-AA20-035B5AD9AA88",
    "DataProviderID": 1,
    "OperatorID": 93,
    "OperatorsReference": "SC22",
    "UsageTypeID": 4,
    "UsageCost": "Free. Parking fees apply.",
    "AddressInfo": {
        "ID": 89035,
        "Title": "Victoria Street Car Park",
        "AddressLine1": "Little Victoria Street",
        "Town": "Belfast",
        "Postcode": "BT2 7JH",
        "CountryID": 1,
        "Latitude": 54.5927429134063,
        "Longitude": -5.933427964418,
        "DistanceUnit": 0
    },
    "Connections": [
        {
            "ID": 125799,
            "ConnectionTypeID": 25,
            "StatusTypeID": 50,
            "LevelID": 2,
            "Amps": 32,
            "Voltage": 400,
            "PowerKW": 22,
            "CurrentTypeID": 20,
            "Quantity": 2
        }
    ],
    "NumberOfPoints": 2,
    "StatusTypeID": 50,
    "DateLastStatusUpdate": "2019-06-26T05:38:00Z",
    "DataQualityLevel": 1,
    "DateCreated": "2017-06-08T15:35:00Z",
    "SubmissionStatusTypeID": 200
}