{
    "IsRecentlyVerified": false,
    "ID": 29543,
    "UUID": "5CB1D1D5-CC6A-4F84-9EBC-C9940446B100",
    "DataProviderID": 15,
    "DataProvidersReference": "7712",
    "OperatorID": 5,
    "UsageTypeID": 1,
    "AddressInfo": {
        "ID": 29889,
        "Title": "2100 Barton Spring Rd",
        "AddressLine1": "2100 Barton Spring Rd",
        "Town": "Austin",
        "StateOrProvince": "Texas",
        "Postcode": "78704",
        "CountryID": 2,
        "Latitude": 30.26523,
        "Longitude": -97.7692,
        "ContactTelephone1": "888-758-4389 ",
        "RelatedURL": "http://carstations.com/7712",
        "DistanceUnit": 0
    },
    "Connections": [
        {
            "ID": 32528,
            "ConnectionTypeID": 1,
            "Reference": "J1772",
            "LevelID": 2
        }
    ],
    "NumberOfPoints": 1,
    "StatusTypeID": 0,
    "DateLastStatusUpdate": "2017-11-04T14:03:00Z",
    "DataQualityLevel": 2,
    "DateCreated": "2014-11-29T05:39:00Z",
    "SubmissionStatusTypeID": 100
}