{
    "IsRecentlyVerified": false,
    "ID": 60229,
    "UUID": "65CCA60A-C96F-422F-9FA6-8ACFF74C2719",
    "DataProviderID": 1,
    "OperatorID": 3,
    "OperatorsReference": "PG-80633",
    "UsageTypeID": 4,
    "UsageCost": "Free",
    "AddressInfo": {
        "ID": 60575,
        "Title": "Sainsbury's Dudley Pensnett",
        "AddressLine1": "High Street",
        "AddressLine2": "Pensett",
        "Town": "Dudley",
        "StateOrProvince": "West Midlands",
        "Postcode": "DY5 4RH",
        "CountryID": 1,
        "Latitude": 52.5013217927203,
        "Longitude": -2.13623840146635,
        "DistanceUnit": 0
    },
    "Connections": [
        {
            "ID": 76230,
            "ConnectionTypeID": 25,
            "StatusTypeID": 50,
            "LevelID": 2,
            "Amps": 32,
            "Voltage": 230,
            "PowerKW": 3,
            "CurrentTypeID": 10,
            "Quantity": 2
        }
    ],
    "NumberOfPoints": 2,
    "StatusTypeID": 50,
    "DateLastStatusUpdate": "2019-05-13T12:58:00Z",
    "DataQualityLevel": 1,
    "DateCreated": "2016-01-16T21:13:00Z",
    "SubmissionStatusTypeID": 200
}