{
    "MediaItems": [
        {
            "ID": 17908,
            "ChargePointID": 118685,
            "ItemURL": "https://s3-ap-southeast-2.amazonaws.com/openchargemap/images/GR/OCM118685/OCM-118685.orig.2019032813391476.jpg",
            "ItemThumbnailURL": "https://s3-ap-southeast-2.amazonaws.com/openchargemap/images/GR/OCM118685/OCM-118685.thmb.2019032813391476.jpg",
            "Comment": "Solar EV Charging Station",
            "IsEnabled": true,
            "IsVideo": false,
            "IsFeaturedItem": false,
            "IsExternalResource": false,
            "User": {
                "ID": 20293,
                "Username": "Sealab UNIWA"
            },
            "DateCreated": "2019-03-28T13:39:00Z"
        }
    ],
    "IsRecentlyVerified": false,
    "ID": 118685,
    "UUID": "8EA44452-E8DC-495E-9989-17131A2C6629",
    "DataProviderID": 1,
    "OperatorID": 45,
    "UsageTypeID": 7,
    "UsageCost": "0",
    "AddressInfo": {
        "ID": 119031,
        "Title": "Πέτρου Ράλλη",
        "AddressLine1": "Πέτρου Ράλλη",
        "Town": "Municipal Unit of Nikaia",
        "StateOrProvince": "Municipality of Nikaia-Agios Ioannis Rentis",
        "Postcode": "18121",
        "CountryID": 90,
        "Latitude": 37.97863317742751,
        "Longitude": 23.67272389593245,
        "ContactTelephone1": "+302105381237",
        "ContactEmail": "geospyrop@uniwa.gr",
        "AccessComments": "Soft Energy Applications and Environmental Protection Laboratory,\r\nMechanical Engineering Department\r\nUniversity of West Attica\r\nContact: Spyropoulos Georgios",
        "RelatedURL": "http://www.sealab.gr",
        "DistanceUnit": 0
    },
    "Connections": [
        {
            "ID": 167859,
            "ConnectionTypeID": 13,
            "StatusTypeID": 50,
            "LevelID": 2,
            "Amps": 16,
            "Voltage": 230,
            "PowerKW": 3.7,
            "CurrentTypeID": 10,
            "Quantity": 1
        },
        {
            "ID": 186969,
            "ConnectionTypeID": 25,
            "StatusTypeID": 50,
            "LevelID": 2,
            "Amps": 16,
            "Voltage": 380,
            "PowerKW": 22,
            "CurrentTypeID": 20,
            "Quantity": 1
        }
    ],
    "NumberOfPoints": 1,
    "GeneralComments": "Free for charging during weekdays from 9:00 to 18:00. Please contact us first for availability. ",
    "StatusTypeID": 50,
    "DateLastStatusUpdate": "2019-10-21T12:35:00Z",
    "DataQualityLevel": 1,
    "DateCreated": "2019-03-28T13:37:00Z",
    "SubmissionStatusTypeID": 200
}