{
    "UserComments": [
        {
            "ID": 24542,
            "ChargePointID": 176147,
            "CommentTypeID": 10,
            "UserName": "עמדות טעינה",
            "Rating": 5,
            "DateCreated": "2021-07-02T00:27:39.197Z",
            "User": {
                "ID": 30531,
                "Username": "עמדות טעינה"
            },
            "CheckinStatusTypeID": 10,
            "IsActionedByEditor": false
        }
    ],
    "MediaItems": [
        {
            "ID": 28735,
            "ChargePointID": 176147,
            "ItemURL": "https://s3-ap-southeast-2.amazonaws.com/openchargemap/images/IL/OCM176147/OCM-176147.orig.2021072318225855.jpg",
            "ItemThumbnailURL": "https://s3-ap-southeast-2.amazonaws.com/openchargemap/images/IL/OCM176147/OCM-176147.thmb.2021072318225855.jpg",
            "Comment": "",
            "IsEnabled": true,
            "IsVideo": false,
            "IsFeaturedItem": false,
            "IsExternalResource": false,
            "User": {
                "ID": 30531,
                "Username": "עמדות טעינה"
            },
            "DateCreated": "2021-07-23T18:23:00Z"
        }
    ],
    "IsRecentlyVerified": false,
    "ID": 176147,
    "UUID": "99BCB944-DB51-443B-9AE5-10BF6C9674A1",
    "DataProviderID": 1,
    "OperatorID": 23,
    "UsageTypeID": 4,
    "UsageCost": "1₪ per kWh",
    "AddressInfo": {
        "ID": 176506,
        "Title": "ביג, אילת",
        "AddressLine1": "הסתת",
        "AddressLine2": "אזור תעשייה חדש",
        "Town": "אילת",
        "StateOrProvince": "נפת באר שבע",
        "Postcode": "no",
        "CountryID": 111,
        "Latitude": 29.56753960770216,
        "Longitude": 34.95951801958245,
        "AccessComments": "BIG, Eilat",
        "RelatedURL": "https://www.tesla.com/he_IL/findus/location/supercharger/Eilatilsupercharger",
        "DistanceUnit": 0
    },
    "Connections": [
        {
            "ID": 273692,
            "ConnectionTypeID": 27,
            "StatusTypeID": 50,
            "LevelID": 3,
            "PowerKW": 250,
            "CurrentTypeID": 30,
            "Quantity": 6
        }
    ],
    "NumberOfPoints": 6,
    "GeneralComments": "שעות פעילות\r\nראשון-חמישי – 06:00 עד חצות\r\nשישי – 06:00-20:00\r\nשבת – 08:00-23:00",
    "StatusTypeID": 50,
    "DateLastStatusUpdate": "2021-08-11T04:18:00Z",
    "DataQualityLevel": 1,
    "DateCreated": "2021-06-27T14:31:00Z",
    "SubmissionStatusTypeID": 200
}