{
    "IsRecentlyVerified": false,
    "ID": 172621,
    "UUID": "2504B7C0-9FD7-4093-B706-86BA4D2949DF",
    "DataProviderID": 1,
    "OperatorID": 1,
    "UsageTypeID": 4,
    "AddressInfo": {
        "ID": 172980,
        "Title": "RCP Parking",
        "AddressLine1": "Angel Street",
        "Town": "Manchester",
        "StateOrProvince": "England",
        "Postcode": "M4 1EH",
        "CountryID": 1,
        "Latitude": 53.488083526696556,
        "Longitude": -2.236699025514781,
        "ContactTelephone1": "0800 917 3208",
        "RelatedURL": "https://be-ev.co.uk/",
        "DistanceUnit": 0
    },
    "Connections": [
        {
            "ID": 263946,
            "ConnectionTypeID": 33,
            "StatusTypeID": 50,
            "LevelID": 3,
            "PowerKW": 50,
            "CurrentTypeID": 30,
            "Quantity": 1
        },
        {
            "ID": 263947,
            "ConnectionTypeID": 2,
            "StatusTypeID": 50,
            "LevelID": 3,
            "PowerKW": 50,
            "CurrentTypeID": 30,
            "Quantity": 1
        },
        {
            "ID": 263948,
            "ConnectionTypeID": 1036,
            "StatusTypeID": 50,
            "LevelID": 3,
            "PowerKW": 43,
            "CurrentTypeID": 20,
            "Quantity": 1
        }
    ],
    "NumberOfPoints": 1,
    "GeneralComments": "Registration is free of charge and will ensure you will have access to future Be.EV membership benefits and offers. The sign-up process should only take a couple of minutes and our app is accessible on the chargers immediately",
    "StatusTypeID": 50,
    "DateLastStatusUpdate": "2021-02-11T04:32:00Z",
    "DataQualityLevel": 1,
    "DateCreated": "2021-02-11T04:32:00Z",
    "SubmissionStatusTypeID": 200
}