{
    "UserComments": [
        {
            "ID": 21097,
            "ChargePointID": 127727,
            "CommentTypeID": 10,
            "UserName": "ForumElettrico.it",
            "RelatedURL": "https://www.forumelettrico.it/forum/colonnina-evlink-presso-distributore-carburanti-riccione-t3423.html",
            "DateCreated": "2019-06-10T16:14:49.9Z",
            "User": {
                "ID": 11749,
                "Username": "ForumElettrico.it"
            },
            "CheckinStatusTypeID": 10
        }
    ],
    "MediaItems": [
        {
            "ID": 18616,
            "ChargePointID": 127727,
            "ItemURL": "https://s3-ap-southeast-2.amazonaws.com/openchargemap/images/IT/OCM127727/OCM-127727.orig.2019061016150417.jpg",
            "ItemThumbnailURL": "https://s3-ap-southeast-2.amazonaws.com/openchargemap/images/IT/OCM127727/OCM-127727.thmb.2019061016150417.jpg",
            "Comment": "",
            "IsEnabled": true,
            "IsVideo": false,
            "IsFeaturedItem": false,
            "IsExternalResource": false,
            "User": {
                "ID": 11749,
                "Username": "ForumElettrico.it"
            },
            "DateCreated": "2019-06-10T16:15:00Z"
        },
        {
            "ID": 18617,
            "ChargePointID": 127727,
            "ItemURL": "https://s3-ap-southeast-2.amazonaws.com/openchargemap/images/IT/OCM127727/OCM-127727.orig.2019061016151601.jpg",
            "ItemThumbnailURL": "https://s3-ap-southeast-2.amazonaws.com/openchargemap/images/IT/OCM127727/OCM-127727.thmb.2019061016151601.jpg",
            "Comment": "",
            "IsEnabled": true,
            "IsVideo": false,
            "IsFeaturedItem": false,
            "IsExternalResource": false,
            "User": {
                "ID": 11749,
                "Username": "ForumElettrico.it"
            },
            "DateCreated": "2019-06-10T16:15:00Z"
        }
    ],
    "IsRecentlyVerified": false,
    "ID": 127727,
    "UUID": "B2F78AEF-4F13-4615-8909-9AACBACAF07F",
    "DataProviderID": 1,
    "OperatorID": 1,
    "UsageTypeID": 1,
    "AddressInfo": {
        "ID": 128073,
        "Title": "Distributore e+",
        "AddressLine1": "Viale Mestre 11",
        "Town": "Riccione",
        "StateOrProvince": "RN",
        "CountryID": 112,
        "Latitude": 43.991397,
        "Longitude": 12.622846,
        "RelatedURL": "https://www.forumelettrico.it/forum/colonnina-evlink-presso-distributore-carburanti-riccione-t3423.html",
        "DistanceUnit": 0
    },
    "Connections": [
        {
            "ID": 178807,
            "ConnectionTypeID": 25,
            "StatusTypeID": 50,
            "LevelID": 2,
            "Amps": 32,
            "Voltage": 400,
            "PowerKW": 22,
            "CurrentTypeID": 20,
            "Quantity": 2
        }
    ],
    "NumberOfPoints": 2,
    "StatusTypeID": 50,
    "DateLastStatusUpdate": "2019-06-10T16:48:00Z",
    "DataQualityLevel": 1,
    "DateCreated": "2019-06-10T16:15:00Z",
    "SubmissionStatusTypeID": 200
}