{
    "IsRecentlyVerified": false,
    "ID": 21293,
    "UUID": "A8162D94-14AC-467A-ACE3-D79046ACB01C",
    "DataProviderID": 1,
    "OperatorID": 5,
    "UsageTypeID": 1,
    "UsageCost": "free",
    "AddressInfo": {
        "ID": 21638,
        "Title": "SIPROTEC / OMB1",
        "AddressLine1": "Via Dalmazia, 45",
        "AddressLine2": "Circoscrizione Brescia Sud",
        "Town": "Brescia",
        "StateOrProvince": "Brescia",
        "Postcode": "25125",
        "CountryID": 112,
        "Latitude": 45.529105149534175,
        "Longitude": 10.19756050847401,
        "RelatedURL": "https://www.chargepoint.eu",
        "DistanceUnit": 0
    },
    "Connections": [
        {
            "ID": 23141,
            "ConnectionTypeID": 28,
            "StatusTypeID": 50,
            "LevelID": 2,
            "Amps": 16,
            "Voltage": 230,
            "PowerKW": 3,
            "CurrentTypeID": 10,
            "Quantity": 1
        }
    ],
    "NumberOfPoints": 1,
    "StatusTypeID": 50,
    "DateLastStatusUpdate": "2014-03-20T17:14:00Z",
    "DataQualityLevel": 1,
    "DateCreated": "2014-03-20T17:14:00Z",
    "SubmissionStatusTypeID": 200
}