{
    "IsRecentlyVerified": false,
    "ID": 103578,
    "UUID": "3FF7E647-BBC7-41F0-8EBE-A7F60843389E",
    "DataProviderID": 1,
    "OperatorID": 23,
    "OperatorsReference": "42478",
    "UsageTypeID": 4,
    "AddressInfo": {
        "ID": 103924,
        "Title": "Blue Peter Seaside Restaurant",
        "AddressLine1": "Vattuniemen Puistotie 1",
        "Town": "Helsinki",
        "Postcode": "210",
        "CountryID": 79,
        "Latitude": 60.151746,
        "Longitude": 24.891274,
        "ContactTelephone1": "+358 04249800",
        "DistanceUnit": 0
    },
    "Connections": [
        {
            "ID": 146245,
            "ConnectionTypeID": 30,
            "StatusTypeID": 50,
            "LevelID": 2,
            "Amps": 16,
            "Voltage": 400,
            "PowerKW": 11,
            "CurrentTypeID": 20,
            "Quantity": 1
        }
    ],
    "NumberOfPoints": 1,
    "GeneralComments": "1 Tesla Connector, up to 11kW.Available for customers. Self park.",
    "StatusTypeID": 50,
    "DateLastStatusUpdate": "2018-10-03T15:49:00Z",
    "DataQualityLevel": 1,
    "DateCreated": "2018-05-04T05:43:00Z",
    "SubmissionStatusTypeID": 200
}