{
    "IsRecentlyVerified": false,
    "ID": 110891,
    "UUID": "10AD1849-3D93-45FE-BEF4-FAD77A6A182E",
    "DataProviderID": 2,
    "DataProvidersReference": "92594",
    "OperatorID": 5,
    "UsageTypeID": 1,
    "AddressInfo": {
        "ID": 111237,
        "Title": "IESO",
        "AddressLine1": "2635 Lakeshore Rd W",
        "Town": "Mississauga",
        "StateOrProvince": "ON",
        "Postcode": "L5J 4T5",
        "CountryID": 44,
        "Latitude": 43.48431,
        "Longitude": -79.626987,
        "ContactTelephone1": "888-758-4389",
        "AccessComments": "24 hours daily",
        "RelatedURL": "http://www.chargepoint.com/",
        "DistanceUnit": 0
    },
    "Connections": [
        {
            "ID": 156204,
            "ConnectionTypeID": 1,
            "LevelID": 2,
            "Amps": 16,
            "Voltage": 230,
            "PowerKW": 3,
            "CurrentTypeID": 10,
            "Quantity": 6
        }
    ],
    "DateLastStatusUpdate": "2019-12-24T09:21:00Z",
    "DataQualityLevel": 3,
    "DateCreated": "2018-10-18T23:36:00Z",
    "SubmissionStatusTypeID": 100
}