{
    "IsRecentlyVerified": false,
    "ID": 75085,
    "UUID": "45D72536-0AE0-413B-8C62-5A42B0129E6C",
    "DataProviderID": 1,
    "OperatorID": 23,
    "OperatorsReference": "6937",
    "UsageTypeID": 4,
    "UsageCost": "SEK 2.56/kWh; andra taxor möjligt för äldre bilar",
    "AddressInfo": {
        "ID": 75431,
        "Title": "Ödeshög Supercharger",
        "AddressLine1": "Liljekonvaljvägen 1",
        "Town": "Ödeshög",
        "Postcode": "599 31",
        "CountryID": 216,
        "Latitude": 58.227074,
        "Longitude": 14.668253,
        "DistanceUnit": 0
    },
    "Connections": [
        {
            "ID": 108288,
            "ConnectionTypeID": 27,
            "StatusTypeID": 50,
            "LevelID": 3,
            "PowerKW": 120,
            "CurrentTypeID": 30,
            "Quantity": 14
        }
    ],
    "NumberOfPoints": 14,
    "GeneralComments": "4 Superchargers, available 24/7",
    "StatusTypeID": 50,
    "DateLastStatusUpdate": "2019-03-22T18:23:00Z",
    "DataQualityLevel": 1,
    "DateCreated": "2016-12-11T18:10:00Z",
    "SubmissionStatusTypeID": 200
}