{
    "IsRecentlyVerified": false,
    "ID": 181717,
    "UUID": "C90A838C-60F1-4098-9F34-A41369AD22F4",
    "DataProviderID": 29,
    "DataProvidersReference": "9672",
    "AddressInfo": {
        "ID": 182076,
        "Title": "Geistmarkt 24z",
        "AddressLine1": "Geistmarkt 24z",
        "Town": "Emmerich am Rhein",
        "Postcode": "46449",
        "CountryID": 87,
        "Latitude": 51.83177,
        "Longitude": 6.23811,
        "DistanceUnit": 0
    },
    "Connections": [
        {
            "ID": 286419,
            "ConnectionTypeID": 25,
            "StatusTypeID": 50,
            "LevelID": 2,
            "PowerKW": 22,
            "CurrentTypeID": 20
        },
        {
            "ID": 286420,
            "ConnectionTypeID": 25,
            "StatusTypeID": 50,
            "LevelID": 2,
            "PowerKW": 22,
            "CurrentTypeID": 20
        }
    ],
    "StatusTypeID": 50,
    "DateLastStatusUpdate": "2021-07-12T02:48:00Z",
    "MetadataValues": [
        {
            "ID": 14011,
            "MetadataFieldID": 4,
            "ItemValue": "Data from the German chargepoint registry provided by Bundesnetzagentur.de under the CC-BY 4.0 license"
        }
    ],
    "DataQualityLevel": 3,
    "DateCreated": "2021-07-08T10:02:00Z",
    "SubmissionStatusTypeID": 100
}