{
    "IsRecentlyVerified": false,
    "ID": 8528,
    "UUID": "E68D6AC1-747E-43B6-A347-C3F978570D42",
    "DataProviderID": 15,
    "DataProvidersReference": "729",
    "OperatorID": 31,
    "UsageTypeID": 1,
    "AddressInfo": {
        "ID": 8425,
        "Title": "150 S. Los Robles",
        "AddressLine1": "150 S. Los Robles",
        "Town": "Pasadena",
        "StateOrProvince": "California",
        "Postcode": "91101",
        "CountryID": 2,
        "Latitude": 34.14289,
        "Longitude": -118.14111,
        "ContactTelephone1": "(626) 577-1000",
        "RelatedURL": "http://carstations.com/729",
        "DistanceUnit": 0
    },
    "Connections": [
        {
            "ID": 5952,
            "ConnectionTypeID": 0,
            "Reference": "LPI",
            "Quantity": 1
        },
        {
            "ID": 14935,
            "ConnectionTypeID": 1,
            "Reference": "J1772",
            "LevelID": 2
        }
    ],
    "NumberOfPoints": 2,
    "StatusTypeID": 0,
    "DateLastStatusUpdate": "2017-11-04T14:04:00Z",
    "DataQualityLevel": 1,
    "DateCreated": "2011-11-11T12:06:00Z",
    "SubmissionStatusTypeID": 100
}