{
    "IsRecentlyVerified": false,
    "ID": 181194,
    "UUID": "7C863F36-51CD-4E3B-A9F0-2AAD4B31F146",
    "DataProviderID": 29,
    "DataProvidersReference": "10940",
    "AddressInfo": {
        "ID": 181553,
        "Title": "Pforzheimer Str. 20",
        "AddressLine1": "Pforzheimer Str. 20",
        "Town": "Neuhausen",
        "Postcode": "75242",
        "CountryID": 87,
        "Latitude": 48.792601,
        "Longitude": 8.779299,
        "DistanceUnit": 0
    },
    "Connections": [
        {
            "ID": 285201,
            "ConnectionTypeID": 28,
            "StatusTypeID": 50,
            "LevelID": 2,
            "PowerKW": 22,
            "CurrentTypeID": 20
        },
        {
            "ID": 285202,
            "ConnectionTypeID": 25,
            "StatusTypeID": 50,
            "LevelID": 2,
            "PowerKW": 22,
            "CurrentTypeID": 20
        },
        {
            "ID": 296191,
            "ConnectionTypeID": 28,
            "StatusTypeID": 50,
            "LevelID": 2,
            "PowerKW": 22,
            "CurrentTypeID": 20
        },
        {
            "ID": 296192,
            "ConnectionTypeID": 25,
            "StatusTypeID": 50,
            "LevelID": 2,
            "PowerKW": 22,
            "CurrentTypeID": 20
        }
    ],
    "StatusTypeID": 50,
    "DateLastStatusUpdate": "2021-07-12T02:41:00Z",
    "MetadataValues": [
        {
            "ID": 13488,
            "MetadataFieldID": 4,
            "ItemValue": "Data from the German chargepoint registry provided by Bundesnetzagentur.de under the CC-BY 4.0 license"
        }
    ],
    "DataQualityLevel": 3,
    "DateCreated": "2021-07-08T10:01:00Z",
    "SubmissionStatusTypeID": 100
}