{
    "IsRecentlyVerified": false,
    "ID": 97742,
    "UUID": "E89D2956-3C62-42A0-8B81-EC4CF33C2E6F",
    "DataProviderID": 1,
    "OperatorID": 23,
    "OperatorsReference": "39299",
    "UsageTypeID": 4,
    "AddressInfo": {
        "ID": 98088,
        "Title": "Walmart Satelite",
        "AddressLine1": "Cto Centro Comercial 19 CD. Satelite",
        "Town": "Naucalpan de Juarez",
        "StateOrProvince": "Estado de Mexico",
        "Postcode": "53100",
        "CountryID": 146,
        "Latitude": 19.515237,
        "Longitude": -99.231548,
        "ContactTelephone1": "+52 55 5562 1500",
        "DistanceUnit": 0
    },
    "Connections": [
        {
            "ID": 138650,
            "ConnectionTypeID": 30,
            "StatusTypeID": 50,
            "LevelID": 2,
            "PowerKW": 18,
            "CurrentTypeID": 20,
            "Quantity": 2
        }
    ],
    "NumberOfPoints": 2,
    "GeneralComments": "2 Tesla Connectors, up to 18kW.Available to the public. Self park.",
    "StatusTypeID": 50,
    "DateLastStatusUpdate": "2018-01-21T16:32:00Z",
    "DataQualityLevel": 1,
    "DateCreated": "2018-01-21T16:32:00Z",
    "SubmissionStatusTypeID": 200
}