{
    "IsRecentlyVerified": false,
    "ID": 148986,
    "UUID": "69B920DB-F1B7-4D47-9A7A-0B68078B6A4D",
    "DataProviderID": 1,
    "OperatorID": 3,
    "OperatorsReference": "PG-70149,PG-84262",
    "UsageTypeID": 4,
    "UsageCost": "Free",
    "AddressInfo": {
        "ID": 149339,
        "Title": "Tesco Superstore-Gosport",
        "AddressLine1": "1 Alver Village Square",
        "Town": "Grange Road",
        "StateOrProvince": "Gosport",
        "Postcode": "PO13 8ZW",
        "CountryID": 1,
        "Latitude": 50.802799,
        "Longitude": -1.166418,
        "DistanceUnit": 0
    },
    "Connections": [
        {
            "ID": 206900,
            "ConnectionTypeID": 25,
            "StatusTypeID": 50,
            "LevelID": 2,
            "Amps": 32,
            "Voltage": 230,
            "PowerKW": 7,
            "CurrentTypeID": 10,
            "Quantity": 4
        }
    ],
    "NumberOfPoints": 4,
    "GeneralComments": "This is an open charge unit installed at the Tesco super store at the Alver Village Square, Grange Road, Gosport",
    "StatusTypeID": 50,
    "DateLastStatusUpdate": "2020-02-14T17:33:00Z",
    "DataQualityLevel": 1,
    "DateCreated": "2020-02-14T16:03:00Z",
    "SubmissionStatusTypeID": 200
}