{
    "IsRecentlyVerified": false,
    "ID": 141976,
    "UUID": "1DBC8B11-66C4-4C13-831D-7AC6367C2F66",
    "DataProviderID": 2,
    "DataProvidersReference": "96643",
    "OperatorID": 9,
    "UsageTypeID": 1,
    "AddressInfo": {
        "ID": 142328,
        "Title": "AAA - Clifton Heights",
        "AddressLine1": "5233 W. Baltimore Avenue",
        "Town": "Clifton Heights",
        "StateOrProvince": "PA",
        "Postcode": "19018",
        "CountryID": 2,
        "Latitude": 39.9255069,
        "Longitude": -75.308621,
        "ContactTelephone1": "888-998-2546",
        "AccessComments": "MON: 24 hours | TUE: 24 hours | WED: 24 hours | THU: 24 hours | FRI: 24 hours | SAT: 24 hours | SUN: 24 hours",
        "RelatedURL": "http://www.blinkcharging.com/",
        "DistanceUnit": 0
    },
    "Connections": [
        {
            "ID": 198023,
            "ConnectionTypeID": 1,
            "LevelID": 2,
            "Amps": 16,
            "Voltage": 230,
            "PowerKW": 3.7,
            "CurrentTypeID": 10,
            "Quantity": 2
        }
    ],
    "StatusTypeID": 50,
    "DateLastStatusUpdate": "2020-06-26T03:02:00Z",
    "DataQualityLevel": 3,
    "DateCreated": "2019-12-24T09:16:00Z",
    "SubmissionStatusTypeID": 100
}