{
    "IsRecentlyVerified": false,
    "ID": 73521,
    "UUID": "F8B7493C-7AE3-4A86-A80C-0DE3DF3B0530",
    "DataProviderID": 1,
    "OperatorID": 45,
    "UsageTypeID": 1,
    "AddressInfo": {
        "ID": 73867,
        "Title": "E-Bike Station Bahnhofstraße",
        "AddressLine1": "Bahnhofstraße 4",
        "Town": "Vorra",
        "StateOrProvince": "Velden (VGem)",
        "Postcode": "91247",
        "CountryID": 87,
        "Latitude": 49.5580981,
        "Longitude": 11.492433,
        "RelatedURL": "http://www.bike-energy.com/",
        "DistanceUnit": 0
    },
    "Connections": [
        {
            "ID": 105760,
            "ConnectionTypeID": 0,
            "StatusTypeID": 50,
            "LevelID": 1,
            "Amps": 6,
            "Voltage": 45,
            "PowerKW": 0.3,
            "CurrentTypeID": 30,
            "Quantity": 3
        },
        {
            "ID": 105761,
            "ConnectionTypeID": 28,
            "StatusTypeID": 50,
            "LevelID": 1,
            "Amps": 10,
            "Voltage": 230,
            "PowerKW": 2.3,
            "CurrentTypeID": 10,
            "Quantity": 3
        }
    ],
    "NumberOfPoints": 6,
    "GeneralComments": "Bike-energy LINE L3B - Anschluß für 3 E-Bikes & zusätzlich 3 Schukosteckdosen. Gesamtbelastbarkeit 3.7kW.",
    "StatusTypeID": 50,
    "DateLastStatusUpdate": "2016-11-23T08:05:00Z",
    "DataQualityLevel": 1,
    "DateCreated": "2016-11-23T08:05:00Z",
    "SubmissionStatusTypeID": 200
}