{
    "IsRecentlyVerified": false,
    "ID": 158622,
    "UUID": "87C6009D-9CBA-4308-A6CB-28837B301CA2",
    "DataProviderID": 2,
    "DataProvidersReference": "152726",
    "OperatorID": 3293,
    "UsageTypeID": 1,
    "AddressInfo": {
        "ID": 158979,
        "Title": "Galleria at Tyler - Macy’s",
        "AddressLine1": "1299 Galleria at Tyler",
        "Town": "Riverside",
        "StateOrProvince": "CA",
        "Postcode": "92503",
        "CountryID": 2,
        "Latitude": 33.909367,
        "Longitude": -117.455924,
        "ContactTelephone1": "888-264-2208",
        "AccessComments": "6am-12pm daily",
        "RelatedURL": "https://voltacharging.com/",
        "DistanceUnit": 0
    },
    "Connections": [
        {
            "ID": 228633,
            "ConnectionTypeID": 1,
            "LevelID": 2,
            "Amps": 16,
            "Voltage": 230,
            "PowerKW": 3.7,
            "CurrentTypeID": 10,
            "Quantity": 2
        }
    ],
    "StatusTypeID": 50,
    "DateLastStatusUpdate": "2020-06-26T02:56:00Z",
    "DataQualityLevel": 3,
    "DateCreated": "2020-06-26T02:56:00Z",
    "SubmissionStatusTypeID": 100
}