{
    "IsRecentlyVerified": false,
    "ID": 170243,
    "UUID": "248E151D-C9AD-4869-8783-4B89BEBAC4E6",
    "DataProviderID": 1,
    "OperatorID": 3377,
    "UsageTypeID": 4,
    "UsageCost": "Free",
    "AddressInfo": {
        "ID": 170602,
        "Title": "Muralla de la Presó",
        "AddressLine1": "Muralla de la Presó, 14",
        "Town": "Mataró",
        "StateOrProvince": "Catalonia",
        "Postcode": "08301",
        "CountryID": 210,
        "Latitude": 41.541459405523426,
        "Longitude": 2.4430186506154996,
        "ContactTelephone1": "010",
        "RelatedURL": "https://www.etecnic.es/",
        "DistanceUnit": 0
    },
    "Connections": [
        {
            "ID": 259591,
            "ConnectionTypeID": 25,
            "StatusTypeID": 50,
            "LevelID": 2,
            "Amps": 30,
            "PowerKW": 22,
            "CurrentTypeID": 20,
            "Quantity": 2
        }
    ],
    "NumberOfPoints": 2,
    "StatusTypeID": 50,
    "DateLastStatusUpdate": "2020-11-21T23:39:00Z",
    "DataQualityLevel": 1,
    "DateCreated": "2020-11-21T13:57:00Z",
    "SubmissionStatusTypeID": 200
}