{
    "IsRecentlyVerified": false,
    "ID": 71806,
    "UUID": "FCBDB5D5-CEC2-40A7-9F34-7F86DF7739B9",
    "DataProviderID": 1,
    "OperatorID": 45,
    "UsageTypeID": 1,
    "AddressInfo": {
        "ID": 72152,
        "Title": "E-Bike Station Asklepios Klinik",
        "AddressLine1": "Am Kurpark 6",
        "Town": "Bad Schwartau",
        "StateOrProvince": "Kreis Ostholstein",
        "Postcode": "23611",
        "CountryID": 87,
        "Latitude": 53.9220999892879,
        "Longitude": 10.699402842327922,
        "AccessComments": "Vor dem Eingang von Haus IV (genaue Lage leider nicht bekannt) am Fahrradständer direkt daneben",
        "DistanceUnit": 0
    },
    "Connections": [
        {
            "ID": 102849,
            "ConnectionTypeID": 28,
            "StatusTypeID": 50,
            "LevelID": 1,
            "Amps": 10,
            "Voltage": 230,
            "PowerKW": 2.3,
            "CurrentTypeID": 10,
            "Quantity": 6
        }
    ],
    "NumberOfPoints": 6,
    "StatusTypeID": 50,
    "DateLastStatusUpdate": "2016-09-12T06:13:00Z",
    "DataQualityLevel": 1,
    "DateCreated": "2016-09-12T06:13:00Z",
    "SubmissionStatusTypeID": 200
}