{
    "IsRecentlyVerified": false,
    "ID": 139888,
    "UUID": "0106AB24-BD03-4814-926E-9878D543F8EC",
    "DataProviderID": 2,
    "DataProvidersReference": "72420",
    "OperatorID": 5,
    "UsageTypeID": 1,
    "AddressInfo": {
        "ID": 140240,
        "Title": "STUDIO",
        "AddressLine1": "3783-3799 Barham Blvd",
        "Town": "Los Angeles",
        "StateOrProvince": "CA",
        "Postcode": "90068",
        "CountryID": 2,
        "Latitude": 34.1427506,
        "Longitude": -118.3419559,
        "ContactTelephone1": "888-758-4389",
        "AccessComments": "24 hours daily",
        "RelatedURL": "http://www.chargepoint.com/",
        "DistanceUnit": 0
    },
    "Connections": [
        {
            "ID": 195381,
            "ConnectionTypeID": 1,
            "LevelID": 2,
            "Amps": 16,
            "Voltage": 230,
            "PowerKW": 3,
            "CurrentTypeID": 10,
            "Quantity": 2
        }
    ],
    "StatusTypeID": 50,
    "DateLastStatusUpdate": "2019-12-24T09:11:00Z",
    "DataQualityLevel": 3,
    "DateCreated": "2019-12-24T09:11:00Z",
    "SubmissionStatusTypeID": 100
}