{
    "IsRecentlyVerified": false,
    "ID": 172958,
    "UUID": "5ED442A7-A13F-486B-8FAE-9EC0F06F0B4C",
    "DataProviderID": 1,
    "OperatorID": 23,
    "OperatorsReference": "33316",
    "UsageTypeID": 4,
    "AddressInfo": {
        "ID": 173317,
        "Title": "Los Amigos: Central Park Tulum",
        "AddressLine1": "Calle 4 sur Mza 20 Lote 1 Zona1",
        "Town": "Tulum",
        "Postcode": "77780",
        "CountryID": 146,
        "Latitude": 20.2015678,
        "Longitude": -87.4705092,
        "ContactTelephone1": "+52 984 871 2984",
        "DistanceUnit": 0
    },
    "Connections": [
        {
            "ID": 264592,
            "ConnectionTypeID": 30,
            "StatusTypeID": 50,
            "LevelID": 2,
            "PowerKW": 18,
            "CurrentTypeID": 20,
            "Quantity": 2
        }
    ],
    "NumberOfPoints": 2,
    "GeneralComments": "2 Tesla Connectors, up to 18kW.Available for customers. Self park.",
    "StatusTypeID": 50,
    "DateLastStatusUpdate": "2021-02-23T06:26:00Z",
    "DataQualityLevel": 1,
    "DateCreated": "2021-02-23T06:26:00Z",
    "SubmissionStatusTypeID": 200
}