{
    "IsRecentlyVerified": false,
    "ID": 77074,
    "UUID": "E1C44454-FC68-48CC-BD1B-6F9C010D7E68",
    "DataProviderID": 1,
    "OperatorID": 45,
    "UsageTypeID": 1,
    "AddressInfo": {
        "ID": 77420,
        "Title": "Am kleinen Theater",
        "AddressLine1": "Waldstraße 16",
        "Town": "Wahlstedt",
        "StateOrProvince": "Kreis Segeberg",
        "Postcode": "23812",
        "CountryID": 87,
        "Latitude": 53.952,
        "Longitude": 10.20893000000001,
        "ContactTelephone1": "+49 4639 700",
        "RelatedURL": "http://www.eksh.org/foerderung/ladesaeulen-programm/?no_cache=1",
        "DistanceUnit": 0
    },
    "Connections": [
        {
            "ID": 110717,
            "ConnectionTypeID": 25,
            "StatusTypeID": 50,
            "LevelID": 2,
            "Amps": 32,
            "Voltage": 400,
            "PowerKW": 22,
            "CurrentTypeID": 20,
            "Quantity": 2
        }
    ],
    "NumberOfPoints": 4,
    "StatusTypeID": 50,
    "DateLastStatusUpdate": "2016-12-28T23:49:00Z",
    "DataQualityLevel": 1,
    "DateCreated": "2016-12-28T23:49:00Z",
    "SubmissionStatusTypeID": 200
}