{
    "IsRecentlyVerified": false,
    "ID": 131177,
    "UUID": "F347F8AF-969A-41E9-B1D6-42CE779881C5",
    "DataProviderID": 2,
    "DataProvidersReference": "143529",
    "OperatorID": 5,
    "UsageTypeID": 1,
    "AddressInfo": {
        "ID": 131523,
        "Title": "MOBILE",
        "AddressLine1": "Water NB at Dauphin St",
        "Town": "Mobile",
        "StateOrProvince": "AL",
        "Postcode": "36602",
        "CountryID": 2,
        "Latitude": 30.6925018,
        "Longitude": -88.0389883,
        "ContactTelephone1": "888-758-4389",
        "AccessComments": "24 hours daily",
        "RelatedURL": "http://www.chargepoint.com/",
        "DistanceUnit": 0
    },
    "Connections": [
        {
            "ID": 183676,
            "ConnectionTypeID": 1,
            "LevelID": 2,
            "Amps": 16,
            "Voltage": 230,
            "PowerKW": 3.7,
            "CurrentTypeID": 10,
            "Quantity": 2
        }
    ],
    "DateLastStatusUpdate": "2020-06-26T02:54:00Z",
    "DataQualityLevel": 3,
    "DateCreated": "2019-08-29T08:33:00Z",
    "SubmissionStatusTypeID": 100
}