{
    "IsRecentlyVerified": false,
    "ID": 156536,
    "UUID": "7F5195E7-B9BB-4A92-96CD-6E9A9C76D381",
    "DataProviderID": 19,
    "DataProvidersReference": "5365",
    "AddressInfo": {
        "ID": 156890,
        "Title": "Elineberg Centrum",
        "AddressLine1": "Elineberg Centrum ",
        "Town": "HELSINGBORG",
        "StateOrProvince": "SKÅNE",
        "Postcode": "25659",
        "CountryID": 216,
        "Latitude": 56.02896,
        "Longitude": 12.72518,
        "AccessComments": "Elineberg Centrum",
        "DistanceUnit": 0
    },
    "Connections": [
        {
            "ID": 220486,
            "ConnectionTypeID": 25,
            "Reference": "1",
            "LevelID": 3,
            "Amps": 32,
            "Voltage": 400,
            "PowerKW": 22,
            "CurrentTypeID": 30,
            "Comments": "Mode 3"
        },
        {
            "ID": 220487,
            "ConnectionTypeID": 25,
            "Reference": "2",
            "LevelID": 3,
            "Amps": 32,
            "Voltage": 400,
            "PowerKW": 22,
            "CurrentTypeID": 30,
            "Comments": "Mode 3"
        }
    ],
    "NumberOfPoints": 2,
    "StatusTypeID": 0,
    "DateLastStatusUpdate": "2021-03-24T05:10:00Z",
    "DataQualityLevel": 2,
    "DateCreated": "2020-05-26T08:21:00Z",
    "SubmissionStatusTypeID": 100
}