{
    "UserComments": [
        {
            "ID": 22314,
            "ChargePointID": 125058,
            "CommentTypeID": 10,
            "UserName": "ForumElettrico.it",
            "Comment": "E' una delle 16 postazioni del servizio di noleggio \"VENICE IN BIKE\" gestito dal Comune di Venezia. Leggi la recensione completa qui > https://www.forumelettrico.it/forum/colonnina-22-kw-enel-x-via-santa-maria-dei-battuti-mestre-t5805.html",
            "RelatedURL": "https://www.forumelettrico.it/forum/colonnina-22-kw-enel-x-via-santa-maria-dei-battuti-mestre-t5805.html",
            "DateCreated": "2020-03-19T08:43:16.08Z",
            "User": {
                "ID": 11749,
                "Username": "ForumElettrico.it"
            },
            "CheckinStatusTypeID": 140,
            "IsActionedByEditor": false
        }
    ],
    "MediaItems": [
        {
            "ID": 21624,
            "ChargePointID": 125058,
            "ItemURL": "https://s3-ap-southeast-2.amazonaws.com/openchargemap/images/IT/OCM125058/OCM-125058.orig.2020031908432882.jpg",
            "ItemThumbnailURL": "https://s3-ap-southeast-2.amazonaws.com/openchargemap/images/IT/OCM125058/OCM-125058.thmb.2020031908432882.jpg",
            "Comment": "",
            "IsEnabled": true,
            "IsVideo": false,
            "IsFeaturedItem": false,
            "IsExternalResource": false,
            "User": {
                "ID": 11749,
                "Username": "ForumElettrico.it"
            },
            "DateCreated": "2020-03-19T08:44:00Z"
        },
        {
            "ID": 21625,
            "ChargePointID": 125058,
            "ItemURL": "https://s3-ap-southeast-2.amazonaws.com/openchargemap/images/IT/OCM125058/OCM-125058.orig.2020031908433468.jpg",
            "ItemThumbnailURL": "https://s3-ap-southeast-2.amazonaws.com/openchargemap/images/IT/OCM125058/OCM-125058.thmb.2020031908433468.jpg",
            "Comment": "",
            "IsEnabled": true,
            "IsVideo": false,
            "IsFeaturedItem": false,
            "IsExternalResource": false,
            "User": {
                "ID": 11749,
                "Username": "ForumElettrico.it"
            },
            "DateCreated": "2020-03-19T08:44:00Z"
        },
        {
            "ID": 21626,
            "ChargePointID": 125058,
            "ItemURL": "https://s3-ap-southeast-2.amazonaws.com/openchargemap/images/IT/OCM125058/OCM-125058.orig.2020031908434341.jpg",
            "ItemThumbnailURL": "https://s3-ap-southeast-2.amazonaws.com/openchargemap/images/IT/OCM125058/OCM-125058.thmb.2020031908434341.jpg",
            "Comment": "",
            "IsEnabled": true,
            "IsVideo": false,
            "IsFeaturedItem": false,
            "IsExternalResource": false,
            "User": {
                "ID": 11749,
                "Username": "ForumElettrico.it"
            },
            "DateCreated": "2020-03-19T08:44:00Z"
        }
    ],
    "IsRecentlyVerified": false,
    "ID": 125058,
    "UUID": "51F16B21-D65F-4DC3-ABF2-B2225FEC137D",
    "DataProviderID": 1,
    "OperatorID": 80,
    "UsageTypeID": 4,
    "AddressInfo": {
        "ID": 125404,
        "Title": "Parcheggio scambiatore Santa Maria dei Battuti | EnelX",
        "AddressLine1": "Via Santa Maria dei Battuti",
        "AddressLine2": "Mestre",
        "Town": "Venezia",
        "StateOrProvince": "VE",
        "Postcode": "30174",
        "CountryID": 112,
        "Latitude": 45.50314048788911,
        "Longitude": 12.24554974638761,
        "ContactTelephone1": "800.069.850",
        "RelatedURL": "https://www.enelx.com/it/it/emobility",
        "DistanceUnit": 0
    },
    "Connections": [
        {
            "ID": 175268,
            "ConnectionTypeID": 25,
            "StatusTypeID": 50,
            "LevelID": 2,
            "Amps": 32,
            "Voltage": 400,
            "PowerKW": 22,
            "CurrentTypeID": 20,
            "Quantity": 1
        },
        {
            "ID": 175269,
            "ConnectionTypeID": 36,
            "StatusTypeID": 50,
            "LevelID": 2,
            "Amps": 16,
            "Voltage": 240,
            "PowerKW": 3.7,
            "CurrentTypeID": 10,
            "Quantity": 1
        }
    ],
    "NumberOfPoints": 2,
    "StatusTypeID": 50,
    "DateLastStatusUpdate": "2020-03-19T08:44:00Z",
    "DataQualityLevel": 1,
    "DateCreated": "2019-04-08T06:25:00Z",
    "SubmissionStatusTypeID": 200
}