{
    "IsRecentlyVerified": false,
    "ID": 41953,
    "UUID": "C7820773-928E-4328-97B9-DDD89655404A",
    "DataProviderID": 1,
    "OperatorID": 23,
    "OperatorsReference": "7564",
    "UsageTypeID": 1,
    "UsageCost": "$0.20/min >=60kW; $0.10/min <60kW; other tariffs for older cars",
    "AddressInfo": {
        "ID": 42299,
        "Title": "Acadian Village Shopping Center - Tesla",
        "AddressLine1": "3535 Perkins Rd",
        "Town": "Baton Rouge",
        "StateOrProvince": "LA",
        "Postcode": "70808",
        "CountryID": 2,
        "Latitude": 30.4226856,
        "Longitude": -91.153792,
        "ContactTelephone1": "877-798-3752",
        "AccessComments": "24 hours daily; for Tesla use only",
        "RelatedURL": "http://www.teslamotors.com/supercharger",
        "DistanceUnit": 0
    },
    "Connections": [
        {
            "ID": 50322,
            "ConnectionTypeID": 27,
            "StatusTypeID": 50,
            "LevelID": 3,
            "Amps": 100,
            "Voltage": 400,
            "PowerKW": 120,
            "CurrentTypeID": 30,
            "Quantity": 6
        }
    ],
    "NumberOfPoints": 6,
    "StatusTypeID": 50,
    "DateLastStatusUpdate": "2018-03-13T13:58:00Z",
    "DataQualityLevel": 3,
    "DateCreated": "2015-02-23T02:09:00Z",
    "SubmissionStatusTypeID": 100
}