{
    "IsRecentlyVerified": false,
    "ID": 72272,
    "UUID": "8DDC333D-C449-4E92-A025-DA1BC513E046",
    "DataProviderID": 2,
    "DataProvidersReference": "78888",
    "OperatorID": 39,
    "UsageTypeID": 1,
    "AddressInfo": {
        "ID": 72618,
        "Title": "Modera Lofts",
        "AddressLine1": "350 Warren ST",
        "Town": "Jersey City",
        "StateOrProvince": "NJ",
        "Postcode": "07302",
        "CountryID": 2,
        "Latitude": 40.719871,
        "Longitude": -74.0381811,
        "ContactTelephone1": "800-663-5633",
        "AccessComments": "MO: Not Specified; TU: Not Specified; WE: Not Specified; TH: Not Specified; FR: Not Specified; SA: Not Specified; SU: Not Specified",
        "RelatedURL": "http://www.semacharge.com/",
        "DistanceUnit": 0
    },
    "Connections": [
        {
            "ID": 103577,
            "ConnectionTypeID": 1,
            "LevelID": 2,
            "Amps": 16,
            "Voltage": 230,
            "PowerKW": 3,
            "CurrentTypeID": 10,
            "Quantity": 2
        }
    ],
    "DateLastStatusUpdate": "2019-04-06T05:04:00Z",
    "DataQualityLevel": 3,
    "DateCreated": "2016-10-09T02:45:00Z",
    "SubmissionStatusTypeID": 100
}