{
    "IsRecentlyVerified": false,
    "ID": 96330,
    "UUID": "B55136A3-F392-41BE-95E9-ECBBDBDB015A",
    "DataProviderID": 1,
    "OperatorID": 46,
    "UsageTypeID": 4,
    "AddressInfo": {
        "ID": 96676,
        "Title": "Wilhelm Schäfer Kraftfahrzeugreparaturen (Mercedes-Benz)",
        "AddressLine1": "Hessenring 3",
        "Town": "Eschwege",
        "StateOrProvince": "Werra-Meißner-Kreis",
        "Postcode": "37269",
        "CountryID": 87,
        "Latitude": 51.17541,
        "Longitude": 10.030129999999986,
        "ContactTelephone1": "+49 5651 335420",
        "AccessComments": "Nach Anmeldung bzw. Nachfrage im Geschäft kann geladen werden; zu den Öffnungszeiten.",
        "DistanceUnit": 0
    },
    "Connections": [
        {
            "ID": 136482,
            "ConnectionTypeID": 25,
            "StatusTypeID": 50,
            "LevelID": 2,
            "Amps": 16,
            "Voltage": 400,
            "PowerKW": 11,
            "CurrentTypeID": 20,
            "Quantity": 1
        }
    ],
    "NumberOfPoints": 1,
    "StatusTypeID": 50,
    "DateLastStatusUpdate": "2017-12-21T08:18:00Z",
    "DataQualityLevel": 1,
    "DateCreated": "2017-12-21T08:18:00Z",
    "SubmissionStatusTypeID": 200
}