{
    "IsRecentlyVerified": false,
    "ID": 56707,
    "UUID": "D83432AD-38A0-4759-AF94-F0CE4F8023C0",
    "DataProviderID": 1,
    "DataProvidersReference": "3094",
    "AddressInfo": {
        "ID": 57053,
        "Title": "Hämeenkatu 8",
        "AddressLine1": "Hämeenkatu 8",
        "Town": "Vesilinna",
        "StateOrProvince": "Varsinais-Suomi",
        "Postcode": "20500",
        "CountryID": 79,
        "Latitude": 60.452184,
        "Longitude": 22.283361,
        "AccessComments": "Kadun varrella",
        "DistanceUnit": 0
    },
    "Connections": [
        {
            "ID": 71506,
            "ConnectionTypeID": 0,
            "LevelID": 2,
            "Amps": 16,
            "Voltage": 230,
            "PowerKW": 3.68
        },
        {
            "ID": 89051,
            "ConnectionTypeID": 0,
            "Reference": "1",
            "LevelID": 2,
            "Amps": 32,
            "Voltage": 400,
            "PowerKW": 22,
            "Comments": "Mode 3"
        },
        {
            "ID": 225403,
            "ConnectionTypeID": 0,
            "LevelID": 2,
            "Amps": 16,
            "Voltage": 230,
            "PowerKW": 3.68
        },
        {
            "ID": 225404,
            "ConnectionTypeID": 0,
            "Reference": "2",
            "LevelID": 2,
            "Amps": 32,
            "Voltage": 400,
            "PowerKW": 22,
            "Comments": "Mode 3"
        }
    ],
    "NumberOfPoints": 2,
    "DateLastStatusUpdate": "2020-05-26T08:24:00Z",
    "DataQualityLevel": 2,
    "DateCreated": "2015-11-06T03:39:00Z",
    "SubmissionStatusTypeID": 100
}