{
    "IsRecentlyVerified": false,
    "ID": 181247,
    "UUID": "15FF35BC-568E-4DAA-A43F-FC9CF39676F7",
    "DataProviderID": 29,
    "DataProvidersReference": "7087",
    "OperatorID": 45,
    "AddressInfo": {
        "ID": 181606,
        "Title": "Feytalstr. 19",
        "AddressLine1": "Feytalstr. 19",
        "Town": "Mechernich",
        "Postcode": "53894",
        "CountryID": 87,
        "Latitude": 50.5910817,
        "Longitude": 6.6650356,
        "DistanceUnit": 0
    },
    "Connections": [
        {
            "ID": 285334,
            "ConnectionTypeID": 25,
            "StatusTypeID": 50,
            "LevelID": 2,
            "PowerKW": 22,
            "CurrentTypeID": 20
        },
        {
            "ID": 285335,
            "ConnectionTypeID": 25,
            "StatusTypeID": 50,
            "LevelID": 2,
            "PowerKW": 22,
            "CurrentTypeID": 20
        }
    ],
    "StatusTypeID": 50,
    "DateLastStatusUpdate": "2021-07-09T03:19:00Z",
    "MetadataValues": [
        {
            "ID": 13541,
            "MetadataFieldID": 4,
            "ItemValue": "Data from the German chargepoint registry provided by Bundesnetzagentur.de under the CC-BY 4.0 license"
        }
    ],
    "DataQualityLevel": 3,
    "DateCreated": "2021-07-08T10:01:00Z",
    "SubmissionStatusTypeID": 100
}