{
    "IsRecentlyVerified": false,
    "ID": 100921,
    "UUID": "AD073E08-EAC0-4206-99C6-D9DEE79C85FE",
    "DataProviderID": 1,
    "OperatorID": 3261,
    "UsageTypeID": 4,
    "AddressInfo": {
        "ID": 101267,
        "Title": "Parkplatz Schmiedweg ",
        "AddressLine1": "Breitbrunner Straße",
        "Town": "Gstadt am Chiemsee",
        "StateOrProvince": "Landkreis Rosenheim",
        "Postcode": "83257",
        "CountryID": 87,
        "Latitude": 47.885112585511095,
        "Longitude": 12.417346576196223,
        "AccessComments": "Täglich von 8-22Uhr geöffneter Parkplatz mit weißer ICU EVE Ladesäule an einem Pfahl. 22kW Ladeleistung werden ggf. aufgeteilt.",
        "RelatedURL": "http://www.gstadt.de/",
        "DistanceUnit": 0
    },
    "Connections": [
        {
            "ID": 142510,
            "ConnectionTypeID": 25,
            "StatusTypeID": 50,
            "LevelID": 2,
            "Amps": 32,
            "Voltage": 400,
            "PowerKW": 22,
            "CurrentTypeID": 20,
            "Quantity": 2
        }
    ],
    "NumberOfPoints": 2,
    "StatusTypeID": 50,
    "DateLastStatusUpdate": "2018-03-12T09:35:00Z",
    "DataQualityLevel": 1,
    "DateCreated": "2018-03-12T09:35:00Z",
    "SubmissionStatusTypeID": 200
}