{
    "IsRecentlyVerified": false,
    "ID": 65289,
    "UUID": "F57A34A0-2BDC-4F9F-97EB-3CB8805A0D94",
    "DataProviderID": 1,
    "OperatorID": 45,
    "UsageTypeID": 6,
    "AddressInfo": {
        "ID": 65635,
        "Title": "Restaurant & Café Forsthaus Friedrichsruh",
        "AddressLine1": "Ödendorfer Weg 5",
        "Town": "Aumühle",
        "StateOrProvince": "Hohe Elbgeest",
        "Postcode": "21521",
        "CountryID": 87,
        "Latitude": 53.530791718912766,
        "Longitude": 10.340673325001827,
        "ContactTelephone1": "+49 41046992899",
        "AccessComments": "Tesla Destination Charging location nur für Gäste.",
        "RelatedURL": "http://www.forsthausfriedrichsruh.de/",
        "DistanceUnit": 0
    },
    "Connections": [
        {
            "ID": 89906,
            "ConnectionTypeID": 25,
            "StatusTypeID": 50,
            "LevelID": 2,
            "Amps": 32,
            "Voltage": 400,
            "PowerKW": 22,
            "CurrentTypeID": 20,
            "Quantity": 2
        }
    ],
    "NumberOfPoints": 2,
    "StatusTypeID": 50,
    "DateLastStatusUpdate": "2016-04-26T08:40:00Z",
    "DataQualityLevel": 1,
    "DateCreated": "2016-04-26T08:40:00Z",
    "SubmissionStatusTypeID": 200
}