{
    "IsRecentlyVerified": false,
    "ID": 60919,
    "UUID": "B4102D4D-3194-4883-BB94-A90829D0D29C",
    "DataProviderID": 27,
    "DataProvidersReference": "259",
    "UsageTypeID": 1,
    "AddressInfo": {
        "ID": 61265,
        "Title": "Estación María Zambrano",
        "AddressLine1": "Calle Mendívil, 9",
        "Town": "Málaga",
        "StateOrProvince": "Málaga",
        "Postcode": "29002",
        "CountryID": 210,
        "Latitude": 36.712716,
        "Longitude": -4.432233,
        "ContactTelephone1": "+34 952 04 09 15 ó 9",
        "DistanceUnit": 0
    },
    "Connections": [
        {
            "ID": 77289,
            "ConnectionTypeID": 28
        },
        {
            "ID": 77290,
            "ConnectionTypeID": 25
        }
    ],
    "DateLastStatusUpdate": "2016-02-13T00:23:00Z",
    "DataQualityLevel": 3,
    "DateCreated": "2016-02-13T00:23:00Z",
    "SubmissionStatusTypeID": 200
}