{
    "IsRecentlyVerified": false,
    "ID": 159505,
    "UUID": "40804AD6-F400-4A20-A6EB-912E23226ACD",
    "DataProviderID": 2,
    "DataProvidersReference": "156193",
    "OperatorID": 9,
    "UsageTypeID": 1,
    "AddressInfo": {
        "ID": 159862,
        "Title": "Blessing Health Center",
        "AddressLine1": "48th and Maine",
        "Town": "Quincy",
        "StateOrProvince": "IL",
        "Postcode": "62301",
        "CountryID": 2,
        "Latitude": 39.930421,
        "Longitude": -91.341143,
        "ContactTelephone1": "888-998-2546",
        "AccessComments": "MON: 24 hours | TUE: 24 hours | WED: 24 hours | THU: 24 hours | FRI: 24 hours | SAT: 24 hours | SUN: 24 hours",
        "RelatedURL": "http://www.blinkcharging.com/",
        "DistanceUnit": 0
    },
    "Connections": [
        {
            "ID": 229693,
            "ConnectionTypeID": 1,
            "LevelID": 2,
            "Amps": 16,
            "Voltage": 230,
            "PowerKW": 3.7,
            "CurrentTypeID": 10,
            "Quantity": 4
        }
    ],
    "StatusTypeID": 50,
    "DateLastStatusUpdate": "2020-06-26T03:02:00Z",
    "DataQualityLevel": 3,
    "DateCreated": "2020-06-26T03:02:00Z",
    "SubmissionStatusTypeID": 100
}