{
    "IsRecentlyVerified": false,
    "ID": 179653,
    "UUID": "CE358BDB-A476-4B1C-AF86-735F592E7F31",
    "DataProviderID": 29,
    "DataProvidersReference": "19259",
    "AddressInfo": {
        "ID": 180012,
        "Title": "Frickentalplatz",
        "AddressLine1": "Frickentalplatz",
        "Town": "Niederstetten",
        "Postcode": "97996",
        "CountryID": 87,
        "Latitude": 49.400383,
        "Longitude": 9.915173,
        "DistanceUnit": 0
    },
    "Connections": [
        {
            "ID": 281746,
            "ConnectionTypeID": 25,
            "StatusTypeID": 50,
            "LevelID": 2,
            "PowerKW": 22,
            "CurrentTypeID": 20
        },
        {
            "ID": 281747,
            "ConnectionTypeID": 25,
            "StatusTypeID": 50,
            "LevelID": 2,
            "PowerKW": 22,
            "CurrentTypeID": 20
        }
    ],
    "StatusTypeID": 50,
    "DateLastStatusUpdate": "2021-07-09T03:16:00Z",
    "MetadataValues": [
        {
            "ID": 11947,
            "MetadataFieldID": 4,
            "ItemValue": "Data from the German chargepoint registry provided by Bundesnetzagentur.de under the CC-BY 4.0 license"
        }
    ],
    "DataQualityLevel": 3,
    "DateCreated": "2021-07-08T09:59:00Z",
    "SubmissionStatusTypeID": 100
}