{
    "IsRecentlyVerified": false,
    "ID": 99445,
    "UUID": "0B627C8F-26FD-44CF-85EB-353A7E3BBD09",
    "DataProviderID": 1,
    "OperatorID": 23,
    "OperatorsReference": "40086",
    "UsageTypeID": 4,
    "AddressInfo": {
        "ID": 99791,
        "Title": "Embassy Suites Phoenix-Scottsdale",
        "AddressLine1": "4415 E Paradise Village Pkwy S",
        "Town": "Phoenix",
        "StateOrProvince": "Arizona",
        "Postcode": "85032",
        "CountryID": 2,
        "Latitude": 33.595732,
        "Longitude": -111.985693,
        "ContactTelephone1": "(602) 765-5800",
        "DistanceUnit": 0
    },
    "Connections": [
        {
            "ID": 140534,
            "ConnectionTypeID": 30,
            "StatusTypeID": 50,
            "LevelID": 2,
            "PowerKW": 16,
            "CurrentTypeID": 20,
            "Quantity": 3
        }
    ],
    "NumberOfPoints": 3,
    "GeneralComments": "3 Tesla Connectors, up to 16kW.Available for customers. Please see front desk.",
    "StatusTypeID": 50,
    "DateLastStatusUpdate": "2018-01-26T06:50:00Z",
    "DataQualityLevel": 1,
    "DateCreated": "2018-01-26T06:50:00Z",
    "SubmissionStatusTypeID": 200
}