{
    "IsRecentlyVerified": false,
    "ID": 124081,
    "UUID": "661C5527-84F0-44F0-AD91-373AFFBF7368",
    "DataProviderID": 2,
    "DataProvidersReference": "81325",
    "OperatorID": 1242,
    "UsageTypeID": 1,
    "AddressInfo": {
        "ID": 124427,
        "Title": "Station 313",
        "AddressLine1": "4569-C Las Positas Rd",
        "Town": "Livermore",
        "StateOrProvince": "CA",
        "Postcode": "94551",
        "CountryID": 2,
        "Latitude": 37.69435,
        "Longitude": -121.74205,
        "ContactTelephone1": "855-443-3873",
        "AccessComments": "24 hours daily",
        "RelatedURL": "https://www.gewattstation.com",
        "DistanceUnit": 0
    },
    "Connections": [
        {
            "ID": 174131,
            "ConnectionTypeID": 1,
            "LevelID": 2,
            "Amps": 16,
            "Voltage": 230,
            "PowerKW": 3.7,
            "CurrentTypeID": 10,
            "Quantity": 1
        }
    ],
    "DateLastStatusUpdate": "2020-06-26T02:59:00Z",
    "DataQualityLevel": 3,
    "DateCreated": "2019-04-06T05:03:00Z",
    "SubmissionStatusTypeID": 100
}