{
    "IsRecentlyVerified": false,
    "ID": 104503,
    "UUID": "344C9CE4-D8C2-4836-8C91-2695E55D610C",
    "DataProviderID": 1,
    "OperatorID": 3296,
    "UsageTypeID": 5,
    "UsageCost": "£0.35/kWh",
    "AddressInfo": {
        "ID": 104849,
        "Title": "Culm Valley Sports Centre",
        "AddressLine1": "Meadow Lane",
        "Town": "Cullompton",
        "StateOrProvince": "Devon",
        "Postcode": "EX15 1LL",
        "CountryID": 1,
        "Latitude": 50.851141,
        "Longitude": -3.391091,
        "DistanceUnit": 0
    },
    "Connections": [
        {
            "ID": 147504,
            "ConnectionTypeID": 33,
            "StatusTypeID": 50,
            "LevelID": 3,
            "PowerKW": 50,
            "CurrentTypeID": 30,
            "Quantity": 2
        },
        {
            "ID": 147505,
            "ConnectionTypeID": 2,
            "StatusTypeID": 50,
            "LevelID": 3,
            "PowerKW": 50,
            "CurrentTypeID": 30,
            "Quantity": 2
        }
    ],
    "NumberOfPoints": 2,
    "StatusTypeID": 50,
    "DateLastStatusUpdate": "2018-05-20T21:33:00Z",
    "DataQualityLevel": 1,
    "DateCreated": "2018-05-20T14:39:00Z",
    "SubmissionStatusTypeID": 200
}