{
    "IsRecentlyVerified": false,
    "ID": 29402,
    "UUID": "0194491F-B063-48AC-9237-38F53053360D",
    "DataProviderID": 2,
    "DataProvidersReference": "44162",
    "UsageTypeID": 2,
    "AddressInfo": {
        "ID": 29748,
        "Title": "City of Seattle - Seattle Water Ops",
        "AddressLine1": "2700 Airport Way S",
        "Town": "Seattle",
        "StateOrProvince": "WA",
        "Postcode": "98134",
        "CountryID": 2,
        "Latitude": 47.57952,
        "Longitude": -122.321401,
        "ContactTelephone1": "",
        "AccessComments": "",
        "RelatedURL": "",
        "DistanceUnit": 0
    },
    "Connections": [
        {
            "ID": 32334,
            "ConnectionTypeID": 1,
            "LevelID": 2,
            "Amps": 16,
            "Voltage": 230,
            "PowerKW": 3.7,
            "CurrentTypeID": 10,
            "Quantity": 4
        }
    ],
    "DateLastStatusUpdate": "2020-06-26T03:11:00Z",
    "DataQualityLevel": 3,
    "DateCreated": "2014-11-28T03:39:00Z",
    "SubmissionStatusTypeID": 100
}