{
    "IsRecentlyVerified": false,
    "ID": 37003,
    "UUID": "0177897A-A18F-4AA5-A1F0-D45871A64FC2",
    "DataProviderID": 26,
    "DataProvidersReference": "48197",
    "OperatorID": 178,
    "OperatorsReference": "EVnetNL EV0081",
    "UsageCost": "0.00 jaarabonnement",
    "AddressInfo": {
        "ID": 37349,
        "Title": "Femina Mullerstraat 92",
        "AddressLine1": "Femina Mullerstraat 92",
        "Town": "Haarlemmermeer",
        "Postcode": "2135 MS",
        "CountryID": 159,
        "Latitude": 52.2961,
        "Longitude": 4.668983,
        "ContactTelephone1": "0800-3522365",
        "RelatedURL": "http://www.evnet.nl",
        "DistanceUnit": 0
    },
    "Connections": [
        {
            "ID": 40514,
            "ConnectionTypeID": 25,
            "LevelID": 2,
            "PowerKW": 11,
            "CurrentTypeID": 10
        }
    ],
    "NumberOfPoints": 1,
    "StatusTypeID": 50,
    "DateLastStatusUpdate": "2016-06-04T02:52:00Z",
    "DataQualityLevel": 3,
    "DateCreated": "2015-01-09T06:07:00Z",
    "SubmissionStatusTypeID": 100
}