{
    "IsRecentlyVerified": false,
    "ID": 159798,
    "UUID": "16D1FD5B-C9AE-4C0D-A4E2-764E4A98783E",
    "DataProviderID": 2,
    "DataProvidersReference": "156264",
    "UsageTypeID": 1,
    "AddressInfo": {
        "ID": 160155,
        "Title": "Genesis Medical Center - East Rusholme Street, Davenport",
        "AddressLine1": "1227 E Rusholme St",
        "Town": "Davenport",
        "StateOrProvince": "IA",
        "Postcode": "52803",
        "CountryID": 2,
        "Latitude": 41.542219,
        "Longitude": -90.555205,
        "ContactTelephone1": "563-421-1000",
        "AccessComments": "24 hours daily",
        "RelatedURL": "",
        "DistanceUnit": 0
    },
    "Connections": [
        {
            "ID": 230014,
            "ConnectionTypeID": 1,
            "LevelID": 2,
            "Amps": 16,
            "Voltage": 230,
            "PowerKW": 3.7,
            "CurrentTypeID": 10,
            "Quantity": 2
        }
    ],
    "StatusTypeID": 50,
    "DateLastStatusUpdate": "2020-06-26T03:04:00Z",
    "DataQualityLevel": 3,
    "DateCreated": "2020-06-26T03:04:00Z",
    "SubmissionStatusTypeID": 100
}