{
    "IsRecentlyVerified": false,
    "ID": 90961,
    "UUID": "7726E148-B669-4ADC-BF3F-5939315E041B",
    "DataProviderID": 1,
    "OperatorID": 23,
    "OperatorsReference": "32404",
    "UsageTypeID": 6,
    "AddressInfo": {
        "ID": 91307,
        "Title": "Greenstorm E-Bikes",
        "AddressLine1": "Auwinkl 10b/c",
        "Town": "Ellmau",
        "StateOrProvince": "Tirol",
        "Postcode": "6352",
        "CountryID": 19,
        "Latitude": 47.519865,
        "Longitude": 12.275659,
        "ContactTelephone1": "+43 6648 8231121",
        "DistanceUnit": 0
    },
    "Connections": [
        {
            "ID": 129016,
            "ConnectionTypeID": 30,
            "StatusTypeID": 50,
            "LevelID": 2,
            "Amps": 16,
            "Voltage": 400,
            "PowerKW": 11,
            "CurrentTypeID": 20,
            "Quantity": 1
        }
    ],
    "NumberOfPoints": 1,
    "GeneralComments": "1 Tesla Connector, up to 11kW.Available for patrons only. Please call ahead.",
    "StatusTypeID": 50,
    "DateLastStatusUpdate": "2018-10-03T15:41:00Z",
    "DataQualityLevel": 1,
    "DateCreated": "2017-07-28T05:31:00Z",
    "SubmissionStatusTypeID": 200
}