{
    "IsRecentlyVerified": false,
    "ID": 180315,
    "UUID": "1B4F9909-5788-468B-B59D-72D1EF541F77",
    "DataProviderID": 29,
    "DataProvidersReference": "19758",
    "AddressInfo": {
        "ID": 180674,
        "Title": "Burgweg 12",
        "AddressLine1": "Burgweg 12",
        "Town": "Oberschwarzach",
        "Postcode": "97516",
        "CountryID": 87,
        "Latitude": 49.86263,
        "Longitude": 10.41149,
        "DistanceUnit": 0
    },
    "Connections": [
        {
            "ID": 283226,
            "ConnectionTypeID": 25,
            "StatusTypeID": 50,
            "LevelID": 2,
            "PowerKW": 22,
            "CurrentTypeID": 20
        },
        {
            "ID": 283227,
            "ConnectionTypeID": 25,
            "StatusTypeID": 50,
            "LevelID": 2,
            "PowerKW": 22,
            "CurrentTypeID": 20
        }
    ],
    "StatusTypeID": 50,
    "DateLastStatusUpdate": "2021-07-09T03:18:00Z",
    "MetadataValues": [
        {
            "ID": 12609,
            "MetadataFieldID": 4,
            "ItemValue": "Data from the German chargepoint registry provided by Bundesnetzagentur.de under the CC-BY 4.0 license"
        }
    ],
    "DataQualityLevel": 3,
    "DateCreated": "2021-07-08T10:00:00Z",
    "SubmissionStatusTypeID": 100
}