{
    "IsRecentlyVerified": false,
    "ID": 121311,
    "UUID": "36812875-27F7-4925-96EC-11E741341049",
    "DataProviderID": 2,
    "DataProvidersReference": "120916",
    "OperatorID": 3372,
    "UsageTypeID": 5,
    "AddressInfo": {
        "ID": 121657,
        "Title": "Gallagher Ramp",
        "AddressLine1": "499 Elmwood Ave",
        "Town": "Buffalo",
        "StateOrProvince": "NY",
        "Postcode": "14222",
        "CountryID": 2,
        "Latitude": 42.910491,
        "Longitude": -78.876035,
        "ContactTelephone1": "716-849-5812  866-816-7584",
        "AccessComments": "24 hours daily; must use EVConnect app for payment\r\nPublic - Credit card at all times",
        "RelatedURL": "http://evconnect.com/",
        "DistanceUnit": 0
    },
    "Connections": [
        {
            "ID": 170754,
            "ConnectionTypeID": 1,
            "LevelID": 2,
            "Amps": 16,
            "Voltage": 230,
            "PowerKW": 3.7,
            "CurrentTypeID": 10,
            "Quantity": 1
        }
    ],
    "DateLastStatusUpdate": "2020-06-26T03:06:00Z",
    "DataQualityLevel": 3,
    "DateCreated": "2019-04-01T05:00:00Z",
    "SubmissionStatusTypeID": 100
}