{
    "IsRecentlyVerified": false,
    "ID": 159853,
    "UUID": "AD0BA940-EF52-4710-A0F7-4E1B1480C9C9",
    "DataProviderID": 2,
    "DataProvidersReference": "151737",
    "OperatorID": 3293,
    "UsageTypeID": 1,
    "AddressInfo": {
        "ID": 160210,
        "Title": "Fox Valley Mall - NW Entrance",
        "AddressLine1": "195 Fox Valley Center",
        "Town": "Aurora",
        "StateOrProvince": "IL",
        "Postcode": "60504",
        "CountryID": 2,
        "Latitude": 41.759295,
        "Longitude": -88.214535,
        "ContactTelephone1": "888-264-2208",
        "AccessComments": "6am-12am daily",
        "RelatedURL": "https://voltacharging.com/",
        "DistanceUnit": 0
    },
    "Connections": [
        {
            "ID": 230074,
            "ConnectionTypeID": 1,
            "LevelID": 2,
            "Amps": 16,
            "Voltage": 230,
            "PowerKW": 3.7,
            "CurrentTypeID": 10,
            "Quantity": 2
        }
    ],
    "StatusTypeID": 50,
    "DateLastStatusUpdate": "2020-06-26T03:05:00Z",
    "DataQualityLevel": 3,
    "DateCreated": "2020-06-26T03:05:00Z",
    "SubmissionStatusTypeID": 100
}