{
    "IsRecentlyVerified": false,
    "ID": 66319,
    "UUID": "FA47DDBA-046C-4679-BB24-CC07B8ADCF2E",
    "DataProviderID": 1,
    "OperatorID": 164,
    "UsageTypeID": 4,
    "AddressInfo": {
        "ID": 66665,
        "Title": "Lana Centro | Neogy",
        "AddressLine1": "Johann-Kravogl-Straße, 3",
        "Town": "Lana",
        "StateOrProvince": "BZ",
        "Postcode": "39011",
        "CountryID": 112,
        "Latitude": 46.6162193600369,
        "Longitude": 11.1445245200274,
        "DistanceUnit": 0
    },
    "Connections": [
        {
            "ID": 91688,
            "ConnectionTypeID": 25,
            "StatusTypeID": 50,
            "LevelID": 2,
            "Amps": 32,
            "Voltage": 400,
            "PowerKW": 22,
            "CurrentTypeID": 20,
            "Quantity": 2
        }
    ],
    "NumberOfPoints": 2,
    "StatusTypeID": 50,
    "DateLastStatusUpdate": "2019-07-14T17:21:00Z",
    "DataQualityLevel": 1,
    "DateCreated": "2016-05-18T08:34:00Z",
    "SubmissionStatusTypeID": 200
}