{
    "IsRecentlyVerified": false,
    "ID": 74001,
    "UUID": "41AE44F6-75E0-4136-B596-8FB3FE1ACB94",
    "DataProviderID": 1,
    "OperatorID": 89,
    "OperatorsReference": "CEA-265",
    "UsageTypeID": 4,
    "UsageCost": "CAD 2.50",
    "AddressInfo": {
        "ID": 74347,
        "Title": "Ville de Saguenay-Stat. Jacques-Cartier-Morin",
        "AddressLine1": "Coin Jacques-Cartier-Morin",
        "Town": "Chicoutimi",
        "StateOrProvince": "QC",
        "Postcode": "G7H 5B8",
        "CountryID": 44,
        "Latitude": 48.426909,
        "Longitude": -71.066321,
        "DistanceUnit": 0
    },
    "Connections": [
        {
            "ID": 106315,
            "ConnectionTypeID": 1,
            "StatusTypeID": 50,
            "LevelID": 2,
            "Amps": 32,
            "Voltage": 230,
            "PowerKW": 7,
            "CurrentTypeID": 10,
            "Quantity": 1
        }
    ],
    "NumberOfPoints": 1,
    "StatusTypeID": 50,
    "DateLastStatusUpdate": "2016-11-27T16:45:00Z",
    "DataQualityLevel": 1,
    "DateCreated": "2016-11-23T23:54:00Z",
    "SubmissionStatusTypeID": 200
}