{
    "IsRecentlyVerified": false,
    "ID": 62190,
    "UUID": "42AD8E10-C32F-4124-909A-F8FB055A6631",
    "DataProviderID": 2,
    "DataProvidersReference": "73848",
    "UsageTypeID": 1,
    "AddressInfo": {
        "ID": 62536,
        "Title": "Town of Beacon Falls - Commuter Lot",
        "AddressLine1": "105 N Main St",
        "Town": "Beacon Falls",
        "StateOrProvince": "CT",
        "Postcode": "06403",
        "CountryID": 2,
        "Latitude": 41.445481,
        "Longitude": -73.065583,
        "ContactTelephone1": "203-729-4340",
        "AccessComments": "24 hours daily",
        "RelatedURL": "",
        "DistanceUnit": 0
    },
    "Connections": [
        {
            "ID": 79093,
            "ConnectionTypeID": 1,
            "LevelID": 2,
            "Amps": 16,
            "Voltage": 230,
            "PowerKW": 3.7,
            "CurrentTypeID": 10,
            "Quantity": 1
        }
    ],
    "DateLastStatusUpdate": "2020-06-26T03:04:00Z",
    "DataQualityLevel": 3,
    "DateCreated": "2016-03-03T11:38:00Z",
    "SubmissionStatusTypeID": 100
}