{
    "IsRecentlyVerified": false,
    "ID": 18213,
    "UUID": "26CCF840-B73A-4116-885C-AC9D6A1A9693",
    "DataProviderID": 15,
    "DataProvidersReference": "32355",
    "OperatorID": 1,
    "AddressInfo": {
        "ID": 18558,
        "Title": "Bergerstrasse 7a",
        "AddressLine1": "Bergerstrasse 7a",
        "Town": "Weissbad",
        "StateOrProvince": "AI",
        "Postcode": "9057",
        "CountryID": 217,
        "Latitude": 47.30501,
        "Longitude": 9.43815,
        "ContactTelephone1": "+41795739030",
        "RelatedURL": "http://carstations.com/32355",
        "DistanceUnit": 0
    },
    "Connections": [],
    "StatusTypeID": 0,
    "DateLastStatusUpdate": "2014-03-22T04:39:00Z",
    "DataQualityLevel": 2,
    "DateCreated": "2013-07-09T03:41:00Z",
    "SubmissionStatusTypeID": 200
}