{
    "IsRecentlyVerified": false,
    "ID": 77613,
    "UUID": "9094C0D1-0F56-4BEF-8556-CF61D1BBE475",
    "DataProviderID": 1,
    "OperatorID": 3,
    "OperatorsReference": "PG-90844",
    "UsageTypeID": 6,
    "UsageCost": "1",
    "AddressInfo": {
        "ID": 77959,
        "Title": "Belmont House",
        "AddressLine1": "Belmont Road",
        "AddressLine2": "Hillingdon",
        "Town": "London",
        "StateOrProvince": "England",
        "Postcode": "UB8 1SA",
        "CountryID": 1,
        "Latitude": 51.547441,
        "Longitude": -0.478992,
        "AccessComments": "Workplace charging",
        "DistanceUnit": 0
    },
    "Connections": [
        {
            "ID": 112127,
            "ConnectionTypeID": 25,
            "StatusTypeID": 50,
            "LevelID": 2,
            "Amps": 32,
            "Voltage": 230,
            "PowerKW": 7,
            "CurrentTypeID": 10,
            "Quantity": 1
        }
    ],
    "NumberOfPoints": 12,
    "StatusTypeID": 0,
    "DateLastStatusUpdate": "2020-01-13T09:10:00Z",
    "DataQualityLevel": 1,
    "DateCreated": "2017-01-20T07:23:00Z",
    "SubmissionStatusTypeID": 200
}