{
    "IsRecentlyVerified": false,
    "ID": 13927,
    "UUID": "E9F307BD-4D78-4075-8F8A-77323484675A",
    "DataProviderID": 2,
    "DataProvidersReference": "42412",
    "UsageTypeID": 1,
    "AddressInfo": {
        "ID": 13824,
        "Title": "Kwik Trip #434",
        "AddressLine1": "903 S Green Bay Rd",
        "Town": "Neenah",
        "StateOrProvince": "WI",
        "Postcode": "54956",
        "CountryID": 2,
        "Latitude": 44.175548,
        "Longitude": -88.486274,
        "ContactTelephone1": "920-729-0918",
        "AccessComments": "24 hours daily",
        "RelatedURL": "",
        "DistanceUnit": 0
    },
    "Connections": [
        {
            "ID": 11356,
            "ConnectionTypeID": 9,
            "LevelID": 1,
            "Amps": 16,
            "Voltage": 120,
            "PowerKW": 1.9,
            "CurrentTypeID": 10,
            "Quantity": 1
        }
    ],
    "DateLastStatusUpdate": "2020-06-26T03:07:00Z",
    "DataQualityLevel": 3,
    "DateCreated": "2012-12-06T16:48:00Z",
    "SubmissionStatusTypeID": 100
}