{
    "IsRecentlyVerified": false,
    "ID": 17909,
    "UUID": "0F4D0B02-80E1-4671-B6BA-FC407B7F4712",
    "DataProviderID": 22,
    "DataProvidersReference": "DF64DC2EB4A0B85091DD31EB4923EAAC",
    "AddressInfo": {
        "ID": 18254,
        "Title": "丹波マーケス",
        "AddressLine1": "京都府船井郡京丹波町須知色紙田3-5",
        "CountryID": 114,
        "Latitude": 35.15529068,
        "Longitude": 135.4279362,
        "ContactTelephone1": "0771-82-3180",
        "DistanceUnit": 0
    },
    "Connections": [
        {
            "ID": 18150,
            "ConnectionTypeID": 2,
            "LevelID": 2,
            "Amps": 100,
            "Voltage": 480,
            "PowerKW": 48,
            "Quantity": 1
        }
    ],
    "DateLastStatusUpdate": "2013-06-29T09:04:00Z",
    "DataQualityLevel": 2,
    "DateCreated": "2013-06-29T09:04:00Z",
    "SubmissionStatusTypeID": 200
}