{
    "IsRecentlyVerified": false,
    "ID": 139681,
    "UUID": "2B22607F-1635-4B45-9A09-A885EC947AFA",
    "DataProviderID": 2,
    "DataProvidersReference": "98924",
    "OperatorID": 59,
    "UsageTypeID": 1,
    "AddressInfo": {
        "ID": 140033,
        "Title": "Greenlots - 33051",
        "AddressLine1": "8 Rio Rancho Rd",
        "Town": "Pomona",
        "StateOrProvince": "CA",
        "Postcode": "91766",
        "CountryID": 2,
        "Latitude": 34.0323715209961,
        "Longitude": -117.756607055664,
        "ContactTelephone1": "855-900-7584",
        "AccessComments": "24 hours daily",
        "RelatedURL": "http://greenlots.com/",
        "DistanceUnit": 0
    },
    "Connections": [
        {
            "ID": 195119,
            "ConnectionTypeID": 2,
            "LevelID": 3,
            "Amps": 100,
            "Voltage": 400,
            "PowerKW": 40,
            "CurrentTypeID": 30,
            "Quantity": 1
        },
        {
            "ID": 195120,
            "ConnectionTypeID": 32,
            "LevelID": 3,
            "Amps": 100,
            "Voltage": 400,
            "PowerKW": 40,
            "CurrentTypeID": 30,
            "Quantity": 1
        }
    ],
    "StatusTypeID": 50,
    "DateLastStatusUpdate": "2020-06-26T02:56:00Z",
    "DataQualityLevel": 3,
    "DateCreated": "2019-12-24T09:11:00Z",
    "SubmissionStatusTypeID": 100
}