{
    "IsRecentlyVerified": false,
    "ID": 73941,
    "UUID": "5EBCE384-64A7-4C13-A346-7C7EEA2C0468",
    "DataProviderID": 1,
    "OperatorID": 89,
    "OperatorsReference": "CEA-462",
    "UsageTypeID": 4,
    "UsageCost": "CAD 2.50",
    "AddressInfo": {
        "ID": 74287,
        "Title": "Cégep John Abbott College",
        "AddressLine1": "21275 rue Lakeshore",
        "Town": "Sainte-Anne-de-Bellevue",
        "StateOrProvince": "QC",
        "Postcode": "H9X 3L9",
        "CountryID": 44,
        "Latitude": 45.404823,
        "Longitude": -73.94195,
        "DistanceUnit": 0
    },
    "Connections": [
        {
            "ID": 106254,
            "ConnectionTypeID": 1,
            "StatusTypeID": 50,
            "LevelID": 2,
            "Amps": 32,
            "Voltage": 230,
            "PowerKW": 7,
            "CurrentTypeID": 10,
            "Quantity": 1
        }
    ],
    "NumberOfPoints": 1,
    "StatusTypeID": 50,
    "DateLastStatusUpdate": "2017-01-22T19:31:00Z",
    "DataQualityLevel": 1,
    "DateCreated": "2016-11-23T23:40:00Z",
    "SubmissionStatusTypeID": 200
}