{
    "IsRecentlyVerified": false,
    "ID": 137712,
    "UUID": "409B023F-ECC0-44BB-917A-DB62D0D04345",
    "DataProviderID": 2,
    "DataProvidersReference": "123153",
    "OperatorID": 3372,
    "UsageTypeID": 1,
    "AddressInfo": {
        "ID": 138060,
        "Title": "Obstetrix Medical Group",
        "AddressLine1": "1325 Pennsylvania Ave",
        "Town": "Fort Worth",
        "StateOrProvince": "TX",
        "Postcode": "76104",
        "CountryID": 2,
        "Latitude": 32.7370959,
        "Longitude": -97.3391657999999,
        "ContactTelephone1": "866-816-7584",
        "AccessComments": "24 hours daily",
        "RelatedURL": "http://evconnect.com/",
        "DistanceUnit": 0
    },
    "Connections": [
        {
            "ID": 192685,
            "ConnectionTypeID": 1,
            "LevelID": 2,
            "Amps": 16,
            "Voltage": 230,
            "PowerKW": 3,
            "CurrentTypeID": 10,
            "Quantity": 1
        }
    ],
    "StatusTypeID": 50,
    "DateLastStatusUpdate": "2019-12-24T09:06:00Z",
    "DataQualityLevel": 3,
    "DateCreated": "2019-12-24T09:06:00Z",
    "SubmissionStatusTypeID": 100
}