{
    "IsRecentlyVerified": false,
    "ID": 138496,
    "UUID": "2E75A83E-8B84-43CB-B1D5-0F7DFF96F4C1",
    "DataProviderID": 2,
    "DataProvidersReference": "63236",
    "OperatorID": 5,
    "UsageTypeID": 1,
    "AddressInfo": {
        "ID": 138845,
        "Title": "TOM BUSH BMW",
        "AddressLine1": "9876 Atlantic Blvd",
        "Town": "Jacksonville",
        "StateOrProvince": "FL",
        "Postcode": "32225",
        "CountryID": 2,
        "Latitude": 30.3219435,
        "Longitude": -81.5426986,
        "ContactTelephone1": "888-758-4389",
        "AccessComments": "24 hours daily",
        "RelatedURL": "http://www.chargepoint.com/",
        "DistanceUnit": 0
    },
    "Connections": [
        {
            "ID": 193625,
            "ConnectionTypeID": 1,
            "LevelID": 2,
            "Amps": 16,
            "Voltage": 230,
            "PowerKW": 3,
            "CurrentTypeID": 10,
            "Quantity": 2
        }
    ],
    "StatusTypeID": 50,
    "DateLastStatusUpdate": "2019-12-24T09:08:00Z",
    "DataQualityLevel": 3,
    "DateCreated": "2019-12-24T09:08:00Z",
    "SubmissionStatusTypeID": 100
}