{
    "IsRecentlyVerified": false,
    "ID": 173072,
    "UUID": "6BAE910D-7288-4701-A36A-0CC48F5B4B4C",
    "DataProviderID": 1,
    "OperatorID": 3,
    "OperatorsReference": "PG-70283,PG-85198",
    "UsageTypeID": 4,
    "UsageCost": "Free",
    "AddressInfo": {
        "ID": 173431,
        "Title": "Tesco Superstore-Mold",
        "AddressLine1": "Chester Street",
        "Town": "Ponterwyl",
        "StateOrProvince": "Mold",
        "Postcode": "CH7 1UB",
        "CountryID": 1,
        "Latitude": 53.16683,
        "Longitude": -3.136646,
        "DistanceUnit": 0
    },
    "Connections": [
        {
            "ID": 264813,
            "ConnectionTypeID": 25,
            "StatusTypeID": 50,
            "LevelID": 2,
            "Amps": 32,
            "Voltage": 230,
            "PowerKW": 7,
            "CurrentTypeID": 10,
            "Quantity": 4
        }
    ],
    "NumberOfPoints": 4,
    "GeneralComments": "This is an open charge unit installed at the Tesco super store at Chester Street, Ponterwyl, Mold",
    "StatusTypeID": 50,
    "DateLastStatusUpdate": "2021-03-02T22:01:00Z",
    "DataQualityLevel": 1,
    "DateCreated": "2021-03-02T21:25:00Z",
    "SubmissionStatusTypeID": 200
}