{
    "IsRecentlyVerified": false,
    "ID": 128557,
    "UUID": "660CFFE6-2DB9-48ED-A1AA-633C83FB7B32",
    "DataProviderID": 1,
    "OperatorID": 80,
    "UsageTypeID": 4,
    "AddressInfo": {
        "ID": 128903,
        "Title": "Genova Nervi Duca degli Abruzzi | EnelX",
        "AddressLine1": "Piazza Duca degli Abruzzi",
        "AddressLine2": "Nervi",
        "Town": "Genova",
        "StateOrProvince": "GE",
        "Postcode": "16167",
        "CountryID": 112,
        "Latitude": 44.3851279144265,
        "Longitude": 9.03560126158652,
        "RelatedURL": "https://www.enelx.com/it/it/emobility",
        "DistanceUnit": 0
    },
    "Connections": [
        {
            "ID": 179945,
            "ConnectionTypeID": 25,
            "StatusTypeID": 50,
            "LevelID": 2,
            "Amps": 32,
            "Voltage": 400,
            "PowerKW": 22,
            "CurrentTypeID": 20,
            "Quantity": 2
        }
    ],
    "NumberOfPoints": 2,
    "StatusTypeID": 50,
    "DateLastStatusUpdate": "2019-06-26T10:14:00Z",
    "DataQualityLevel": 1,
    "DateCreated": "2019-06-26T10:14:00Z",
    "SubmissionStatusTypeID": 200
}