{
    "IsRecentlyVerified": false,
    "ID": 98050,
    "UUID": "E830FEB8-0706-4714-A858-1A5F24799A2D",
    "DataProviderID": 1,
    "OperatorID": 23,
    "OperatorsReference": "39175",
    "UsageTypeID": 4,
    "AddressInfo": {
        "ID": 98396,
        "Title": "Patio Plaza los Cabos",
        "AddressLine1": "Carr. Todos Santos - los Cabos los Aguajitos",
        "Town": "Cabo San Lucas",
        "StateOrProvince": "Baja California Sur",
        "Postcode": "23473",
        "CountryID": 146,
        "Latitude": 22.904598,
        "Longitude": -109.933184,
        "ContactTelephone1": "+52 624 146 4547",
        "DistanceUnit": 0
    },
    "Connections": [
        {
            "ID": 138958,
            "ConnectionTypeID": 30,
            "StatusTypeID": 50,
            "LevelID": 2,
            "PowerKW": 18,
            "CurrentTypeID": 20,
            "Quantity": 2
        }
    ],
    "NumberOfPoints": 2,
    "GeneralComments": "2 Tesla Connectors, up to 18kW.Available to the public. Self park.",
    "StatusTypeID": 50,
    "DateLastStatusUpdate": "2018-01-21T17:40:00Z",
    "DataQualityLevel": 1,
    "DateCreated": "2018-01-21T17:40:00Z",
    "SubmissionStatusTypeID": 200
}