{
    "IsRecentlyVerified": false,
    "ID": 44691,
    "UUID": "81206188-0D3C-43FE-ABA9-334FE2A871BA",
    "DataProviderID": 26,
    "DataProvidersReference": "61256",
    "OperatorID": 73,
    "OperatorsReference": "EV-Box EVB-P1412022",
    "UsageCost": "0.00 jaarabonnement",
    "AddressInfo": {
        "ID": 45037,
        "Title": "H.A. Lorentzstraat 7",
        "AddressLine1": "H.A. Lorentzstraat 7",
        "Town": "Zwijndrecht",
        "Postcode": "3331 EE",
        "CountryID": 159,
        "Latitude": 51.81673,
        "Longitude": 4.63173,
        "RelatedURL": "http://www.ev-box.nl",
        "DistanceUnit": 0
    },
    "Connections": [
        {
            "ID": 54887,
            "ConnectionTypeID": 25,
            "LevelID": 2,
            "PowerKW": 11,
            "CurrentTypeID": 10
        },
        {
            "ID": 54888,
            "ConnectionTypeID": 25,
            "LevelID": 2,
            "PowerKW": 11,
            "CurrentTypeID": 10
        }
    ],
    "NumberOfPoints": 1,
    "StatusTypeID": 50,
    "DateLastStatusUpdate": "2016-06-04T02:40:00Z",
    "DataQualityLevel": 3,
    "DateCreated": "2015-04-18T13:02:00Z",
    "SubmissionStatusTypeID": 100
}