{
    "IsRecentlyVerified": false,
    "ID": 141247,
    "UUID": "3888FED6-AAE9-41C5-8A8A-2C57C8D4B0B3",
    "DataProviderID": 2,
    "DataProvidersReference": "143993",
    "UsageTypeID": 1,
    "AddressInfo": {
        "ID": 141599,
        "Title": "El Dorado County - Veterans Services",
        "AddressLine1": "130 Placerville Dr",
        "Town": "Placerville",
        "StateOrProvince": "CA",
        "Postcode": "95667",
        "CountryID": 2,
        "Latitude": 38.666747,
        "Longitude": -120.937469,
        "ContactTelephone1": "530-621-5892",
        "AccessComments": "24 hours daily",
        "RelatedURL": "",
        "DistanceUnit": 0
    },
    "Connections": [
        {
            "ID": 197128,
            "ConnectionTypeID": 1,
            "LevelID": 2,
            "Amps": 16,
            "Voltage": 230,
            "PowerKW": 3.7,
            "CurrentTypeID": 10,
            "Quantity": 1
        }
    ],
    "StatusTypeID": 50,
    "DateLastStatusUpdate": "2020-06-26T03:00:00Z",
    "DataQualityLevel": 3,
    "DateCreated": "2019-12-24T09:15:00Z",
    "SubmissionStatusTypeID": 100
}