{
    "IsRecentlyVerified": false,
    "ID": 173288,
    "UUID": "9670C22B-2844-4BF4-8C19-5B42291ED6F3",
    "DataProviderID": 19,
    "DataProvidersReference": "7335",
    "AddressInfo": {
        "ID": 173647,
        "Title": "Strangata",
        "AddressLine1": "Strangata 9",
        "Town": "RØRVIK",
        "StateOrProvince": "Trøndelag",
        "Postcode": "7900",
        "CountryID": 168,
        "Latitude": 64.86067,
        "Longitude": 11.23663,
        "AccessComments": "",
        "DistanceUnit": 0
    },
    "Connections": [
        {
            "ID": 266177,
            "ConnectionTypeID": 33,
            "Reference": "1",
            "LevelID": 3,
            "Amps": 100,
            "Voltage": 500,
            "PowerKW": 50,
            "CurrentTypeID": 30,
            "Comments": "Mode 4"
        },
        {
            "ID": 266178,
            "ConnectionTypeID": 2,
            "Reference": "2",
            "LevelID": 3,
            "Amps": 100,
            "Voltage": 500,
            "PowerKW": 50,
            "CurrentTypeID": 30,
            "Comments": "Mode 4"
        },
        {
            "ID": 266179,
            "ConnectionTypeID": 25,
            "Reference": "3",
            "LevelID": 3,
            "Amps": 32,
            "Voltage": 400,
            "PowerKW": 22,
            "CurrentTypeID": 30,
            "Comments": "Mode 3"
        }
    ],
    "NumberOfPoints": 3,
    "StatusTypeID": 0,
    "DateLastStatusUpdate": "2021-03-24T05:12:00Z",
    "DataQualityLevel": 2,
    "DateCreated": "2021-03-03T09:03:00Z",
    "SubmissionStatusTypeID": 100
}