{
    "IsRecentlyVerified": false,
    "ID": 120235,
    "UUID": "81C3F6F8-E3BC-416E-BBCB-1F04BCDF37DD",
    "DataProviderID": 2,
    "DataProvidersReference": "98807",
    "OperatorID": 39,
    "UsageTypeID": 1,
    "AddressInfo": {
        "ID": 120581,
        "Title": "Leroy Collins Leon County Public Library",
        "AddressLine1": "200 West Park Avenue",
        "Town": "Tallahassee",
        "StateOrProvince": "FL",
        "Postcode": "32301",
        "CountryID": 2,
        "Latitude": 30.4426561,
        "Longitude": -84.2837558,
        "ContactTelephone1": "800-663-5633",
        "AccessComments": "MO: 10:00am-09:00pm; TU: 10:00am-09:00pm; WE: 10:00am-09:00pm; TH: 10:00am-09:00pm; FR: 10:00am-06:00pm; SA: 10:00am-05:00pm; SU: 01:00pm-06:00pm",
        "RelatedURL": "http://www.semacharge.com/",
        "DistanceUnit": 0
    },
    "Connections": [
        {
            "ID": 169564,
            "ConnectionTypeID": 1,
            "LevelID": 2,
            "Amps": 16,
            "Voltage": 230,
            "PowerKW": 3,
            "CurrentTypeID": 10,
            "Quantity": 1
        }
    ],
    "DateLastStatusUpdate": "2019-04-01T04:59:00Z",
    "DataQualityLevel": 3,
    "DateCreated": "2019-04-01T04:59:00Z",
    "SubmissionStatusTypeID": 100
}