{
    "IsRecentlyVerified": false,
    "ID": 140810,
    "UUID": "B3876A85-6412-4D97-9556-284B72CC13C3",
    "DataProviderID": 2,
    "DataProvidersReference": "78959",
    "OperatorID": 5,
    "UsageTypeID": 1,
    "AddressInfo": {
        "ID": 141162,
        "Title": "PUBLIC STATIONS",
        "AddressLine1": "39550 Liberty St",
        "Town": "Fremont",
        "StateOrProvince": "CA",
        "Postcode": "94538",
        "CountryID": 2,
        "Latitude": 37.5480804,
        "Longitude": -121.9763515,
        "ContactTelephone1": "888-758-4389",
        "AccessComments": "24 hours daily",
        "RelatedURL": "http://www.chargepoint.com/",
        "DistanceUnit": 0
    },
    "Connections": [
        {
            "ID": 196545,
            "ConnectionTypeID": 1,
            "LevelID": 2,
            "Amps": 16,
            "Voltage": 230,
            "PowerKW": 3,
            "CurrentTypeID": 10,
            "Quantity": 2
        }
    ],
    "StatusTypeID": 50,
    "DateLastStatusUpdate": "2019-12-24T09:14:00Z",
    "DataQualityLevel": 3,
    "DateCreated": "2019-12-24T09:14:00Z",
    "SubmissionStatusTypeID": 100
}