{
    "IsRecentlyVerified": false,
    "ID": 177205,
    "UUID": "3814B55F-5C65-469D-9934-BC35D7F77DFF",
    "DataProviderID": 29,
    "DataProvidersReference": "13384",
    "OperatorID": 69,
    "AddressInfo": {
        "ID": 177564,
        "Title": "Eissporthalle",
        "AddressLine1": "Eissporthalle",
        "Town": "Ilmenau",
        "Postcode": "98693",
        "CountryID": 87,
        "Latitude": 50.68246,
        "Longitude": 10.92088,
        "DistanceUnit": 0
    },
    "Connections": [
        {
            "ID": 276069,
            "ConnectionTypeID": 25,
            "StatusTypeID": 50,
            "LevelID": 2,
            "PowerKW": 22,
            "CurrentTypeID": 20
        },
        {
            "ID": 276070,
            "ConnectionTypeID": 25,
            "StatusTypeID": 50,
            "LevelID": 2,
            "PowerKW": 22,
            "CurrentTypeID": 20
        }
    ],
    "StatusTypeID": 0,
    "DateLastStatusUpdate": "2021-07-12T02:45:00Z",
    "MetadataValues": [
        {
            "ID": 9499,
            "MetadataFieldID": 4,
            "ItemValue": "Data from the German chargepoint registry provided by Bundesnetzagentur.de under the CC-BY 4.0 license"
        }
    ],
    "DataQualityLevel": 3,
    "DateCreated": "2021-07-08T09:48:00Z",
    "SubmissionStatusTypeID": 100
}