{
    "IsRecentlyVerified": false,
    "ID": 187634,
    "UUID": "58417DA7-A66D-405D-92C5-02D2FFE4A312",
    "DataProviderID": 18,
    "DataProvidersReference": "41b91e10770cd11978002012d62c1eec",
    "OperatorID": 3345,
    "UsageTypeID": 5,
    "AddressInfo": {
        "ID": 187993,
        "Title": "SW19 1PA",
        "AddressLine1": "",
        "Town": "London",
        "Postcode": "SW19 1PA",
        "CountryID": 1,
        "Latitude": 51.417058,
        "Longitude": -0.201446,
        "AccessComments": "",
        "RelatedURL": "https://char.gy",
        "DistanceUnit": 0
    },
    "Connections": [
        {
            "ID": 302845,
            "ConnectionTypeID": 25,
            "Reference": "613",
            "StatusTypeID": 50,
            "LevelID": 2,
            "Amps": 16,
            "Voltage": 230,
            "PowerKW": 3.7,
            "CurrentTypeID": 10
        }
    ],
    "StatusTypeID": 0,
    "DateLastStatusUpdate": "2021-07-12T03:38:00Z",
    "MetadataValues": [
        {
            "ID": 19874,
            "MetadataFieldID": 4,
            "ItemValue": "Contains public sector information licensed under the Open Government Licence v2.0. http://www.nationalarchives.gov.uk/doc/open-government-licence/version/2/"
        }
    ],
    "DataQualityLevel": 3,
    "DateCreated": "2021-07-12T03:38:00Z",
    "SubmissionStatusTypeID": 100
}