{
    "IsRecentlyVerified": false,
    "ID": 145265,
    "UUID": "E4FD6270-B87C-4A1D-9900-D7E71D5FA7EC",
    "DataProviderID": 2,
    "DataProvidersReference": "99067",
    "OperatorID": 59,
    "UsageTypeID": 1,
    "AddressInfo": {
        "ID": 145617,
        "Title": "Greenlots - 63129",
        "AddressLine1": "111 Valley Ave NE",
        "Town": "Puyallup",
        "StateOrProvince": "WA",
        "Postcode": "98372",
        "CountryID": 2,
        "Latitude": 47.2066383361816,
        "Longitude": -122.29222869873,
        "ContactTelephone1": "855-900-7584",
        "AccessComments": "24 hours daily",
        "RelatedURL": "http://greenlots.com/",
        "DistanceUnit": 0
    },
    "Connections": [
        {
            "ID": 201893,
            "ConnectionTypeID": 2,
            "LevelID": 3,
            "Amps": 100,
            "Voltage": 400,
            "PowerKW": 40,
            "CurrentTypeID": 30,
            "Quantity": 1
        },
        {
            "ID": 201894,
            "ConnectionTypeID": 32,
            "LevelID": 3,
            "Amps": 100,
            "Voltage": 400,
            "PowerKW": 40,
            "CurrentTypeID": 30,
            "Quantity": 1
        }
    ],
    "StatusTypeID": 50,
    "DateLastStatusUpdate": "2020-06-26T03:10:00Z",
    "DataQualityLevel": 3,
    "DateCreated": "2019-12-24T09:24:00Z",
    "SubmissionStatusTypeID": 100
}