{
    "IsRecentlyVerified": false,
    "ID": 95220,
    "UUID": "720A26EB-881B-4A88-9D34-ECBC7DD6026B",
    "DataProviderID": 1,
    "OperatorID": 23,
    "OperatorsReference": "37192",
    "UsageTypeID": 4,
    "AddressInfo": {
        "ID": 95566,
        "Title": "Taj Mall",
        "AddressLine1": "PR. Hashim St",
        "Town": "Amman",
        "CountryID": 116,
        "Latitude": 31.941387,
        "Longitude": 35.88807,
        "ContactTelephone1": "+962 6 592 1122",
        "DistanceUnit": 0
    },
    "Connections": [
        {
            "ID": 134888,
            "ConnectionTypeID": 1036,
            "StatusTypeID": 50,
            "LevelID": 2,
            "Amps": 32,
            "Voltage": 400,
            "PowerKW": 22,
            "CurrentTypeID": 20,
            "Quantity": 1
        }
    ],
    "NumberOfPoints": 1,
    "GeneralComments": "1 Tesla Connector, up to 22kW.Available for customers. Self park.",
    "StatusTypeID": 50,
    "DateLastStatusUpdate": "2017-11-05T06:57:00Z",
    "DataQualityLevel": 1,
    "DateCreated": "2017-11-05T06:57:00Z",
    "SubmissionStatusTypeID": 200
}