{
    "IsRecentlyVerified": false,
    "ID": 184877,
    "UUID": "6C744AD0-0977-4DAD-BE70-7CAC49EF7B85",
    "DataProviderID": 29,
    "DataProvidersReference": "6627",
    "OperatorID": 103,
    "AddressInfo": {
        "ID": 185236,
        "Title": "Sonderburger Str. 26",
        "AddressLine1": "Sonderburger Str. 26",
        "Town": "Berlin",
        "Postcode": "13357",
        "CountryID": 87,
        "Latitude": 52.554776,
        "Longitude": 13.394007,
        "DistanceUnit": 0
    },
    "Connections": [
        {
            "ID": 293690,
            "ConnectionTypeID": 25,
            "StatusTypeID": 50,
            "LevelID": 2,
            "PowerKW": 11,
            "CurrentTypeID": 20
        },
        {
            "ID": 293691,
            "ConnectionTypeID": 25,
            "StatusTypeID": 50,
            "LevelID": 2,
            "PowerKW": 11,
            "CurrentTypeID": 20
        }
    ],
    "StatusTypeID": 50,
    "DateLastStatusUpdate": "2021-07-12T02:50:00Z",
    "MetadataValues": [
        {
            "ID": 17168,
            "MetadataFieldID": 4,
            "ItemValue": "Data from the German chargepoint registry provided by Bundesnetzagentur.de under the CC-BY 4.0 license"
        }
    ],
    "DataQualityLevel": 3,
    "DateCreated": "2021-07-08T10:06:00Z",
    "SubmissionStatusTypeID": 100
}