{
    "IsRecentlyVerified": false,
    "ID": 139429,
    "UUID": "6ECE02AA-6CBD-4010-9756-3913832C3529",
    "DataProviderID": 2,
    "DataProvidersReference": "93120",
    "OperatorID": 15,
    "UsageTypeID": 4,
    "AddressInfo": {
        "ID": 139781,
        "Title": "Coffee Bean",
        "AddressLine1": "18201 Crenshaw Blvd",
        "Town": "Torrance",
        "StateOrProvince": "CA",
        "Postcode": "90504",
        "CountryID": 2,
        "Latitude": 33.86545,
        "Longitude": -118.3268,
        "ContactTelephone1": "877-455-3833",
        "AccessComments": "24 hours daily\r\nPublic - Card key at all times",
        "RelatedURL": "https://www.evgo.com/",
        "DistanceUnit": 0
    },
    "Connections": [
        {
            "ID": 194790,
            "ConnectionTypeID": 1,
            "LevelID": 2,
            "Amps": 16,
            "Voltage": 230,
            "PowerKW": 3.7,
            "CurrentTypeID": 10,
            "Quantity": 1
        }
    ],
    "StatusTypeID": 50,
    "DateLastStatusUpdate": "2020-06-26T02:56:00Z",
    "DataQualityLevel": 3,
    "DateCreated": "2019-12-24T09:10:00Z",
    "SubmissionStatusTypeID": 100
}