{
    "IsRecentlyVerified": false,
    "ID": 144668,
    "UUID": "83CC14CE-67BD-4DD3-B711-EDF379CEDA71",
    "DataProviderID": 2,
    "DataProvidersReference": "130742",
    "OperatorID": 90,
    "UsageTypeID": 1,
    "AddressInfo": {
        "ID": 145020,
        "Title": "10905 rue Basile Routhier : Parc Basile Routhier",
        "AddressLine1": "10905A rue Basile Routhier",
        "Town": "Montréal",
        "StateOrProvince": "QC",
        "Postcode": "H2C 3H5",
        "CountryID": 44,
        "Latitude": 45.557084,
        "Longitude": -73.671649,
        "ContactTelephone1": "877-505-2674",
        "AccessComments": "24 hours daily",
        "RelatedURL": "https://lecircuitelectrique.com/",
        "DistanceUnit": 0
    },
    "Connections": [
        {
            "ID": 201182,
            "ConnectionTypeID": 1,
            "LevelID": 2,
            "Amps": 16,
            "Voltage": 230,
            "PowerKW": 3.7,
            "CurrentTypeID": 10,
            "Quantity": 4
        }
    ],
    "StatusTypeID": 50,
    "DateLastStatusUpdate": "2020-06-26T03:09:00Z",
    "DataQualityLevel": 3,
    "DateCreated": "2019-12-24T09:23:00Z",
    "SubmissionStatusTypeID": 100
}