{
    "IsRecentlyVerified": false,
    "ID": 115182,
    "UUID": "2B4F220E-0E29-4C37-9560-3F32B284492F",
    "DataProviderID": 1,
    "OperatorID": 213,
    "UsageTypeID": 4,
    "AddressInfo": {
        "ID": 115528,
        "Title": "Aire de Saint-Éloi",
        "AddressLine1": "A25",
        "Town": "STEENVOORDE",
        "Postcode": "59114",
        "CountryID": 80,
        "Latitude": 50.82995100000001,
        "Longitude": 2.5798180000000173,
        "DistanceUnit": 0
    },
    "Connections": [
        {
            "ID": 162126,
            "ConnectionTypeID": 2,
            "StatusTypeID": 50,
            "LevelID": 3,
            "Amps": 120,
            "Voltage": 400,
            "PowerKW": 50,
            "CurrentTypeID": 30
        },
        {
            "ID": 162127,
            "ConnectionTypeID": 33,
            "StatusTypeID": 50,
            "LevelID": 3,
            "Amps": 120,
            "Voltage": 400,
            "PowerKW": 43,
            "CurrentTypeID": 30
        },
        {
            "ID": 162128,
            "ConnectionTypeID": 25,
            "StatusTypeID": 50,
            "LevelID": 3,
            "Amps": 63,
            "Voltage": 400,
            "PowerKW": 43,
            "CurrentTypeID": 20
        },
        {
            "ID": 162129,
            "ConnectionTypeID": 28,
            "StatusTypeID": 50,
            "LevelID": 2,
            "Amps": 16,
            "Voltage": 220,
            "PowerKW": 3,
            "CurrentTypeID": 10
        }
    ],
    "NumberOfPoints": 1,
    "StatusTypeID": 50,
    "DateLastStatusUpdate": "2019-02-04T13:45:00Z",
    "DataQualityLevel": 1,
    "DateCreated": "2019-02-04T13:45:00Z",
    "SubmissionStatusTypeID": 200
}