{
    "IsRecentlyVerified": false,
    "ID": 111966,
    "UUID": "DC4D0B6A-852E-41AE-9F66-C3C2DE199F0D",
    "DataProviderID": 2,
    "DataProvidersReference": "91319",
    "OperatorID": 5,
    "UsageTypeID": 1,
    "AddressInfo": {
        "ID": 112312,
        "Title": "CLARKDALE VW",
        "AddressLine1": "4575 Main St",
        "Town": "Vancouver",
        "StateOrProvince": "BC",
        "Postcode": "V5V 3R4",
        "CountryID": 44,
        "Latitude": 49.243757,
        "Longitude": -123.101675,
        "ContactTelephone1": "888-758-4389",
        "AccessComments": "24 hours daily",
        "RelatedURL": "http://www.chargepoint.com/",
        "DistanceUnit": 0
    },
    "Connections": [
        {
            "ID": 157488,
            "ConnectionTypeID": 1,
            "LevelID": 2,
            "Amps": 16,
            "Voltage": 230,
            "PowerKW": 3,
            "CurrentTypeID": 10,
            "Quantity": 2
        }
    ],
    "DateLastStatusUpdate": "2019-12-24T09:25:00Z",
    "DataQualityLevel": 3,
    "DateCreated": "2018-10-18T23:37:00Z",
    "SubmissionStatusTypeID": 100
}