{
    "IsRecentlyVerified": false,
    "ID": 180038,
    "UUID": "449628C3-4210-4615-8C65-04E8ECC4B568",
    "DataProviderID": 29,
    "DataProvidersReference": "16854",
    "OperatorID": 103,
    "AddressInfo": {
        "ID": 180397,
        "Title": "Clausewitzstr. ggü. 5A",
        "AddressLine1": "Clausewitzstr. ggü. 5A",
        "Town": "Berlin",
        "Postcode": "10629",
        "CountryID": 87,
        "Latitude": 52.500502,
        "Longitude": 13.309256,
        "DistanceUnit": 0
    },
    "Connections": [
        {
            "ID": 282649,
            "ConnectionTypeID": 25,
            "StatusTypeID": 50,
            "LevelID": 2,
            "PowerKW": 11,
            "CurrentTypeID": 20
        },
        {
            "ID": 282650,
            "ConnectionTypeID": 25,
            "StatusTypeID": 50,
            "LevelID": 2,
            "PowerKW": 11,
            "CurrentTypeID": 20
        }
    ],
    "StatusTypeID": 50,
    "DateLastStatusUpdate": "2021-07-12T02:49:00Z",
    "MetadataValues": [
        {
            "ID": 12332,
            "MetadataFieldID": 4,
            "ItemValue": "Data from the German chargepoint registry provided by Bundesnetzagentur.de under the CC-BY 4.0 license"
        }
    ],
    "DataQualityLevel": 3,
    "DateCreated": "2021-07-08T10:00:00Z",
    "SubmissionStatusTypeID": 100
}