{
    "IsRecentlyVerified": false,
    "ID": 107372,
    "UUID": "2BF65B1C-B0E0-4347-9826-58AEE6DCF124",
    "DataProviderID": 1,
    "OperatorID": 1,
    "UsageTypeID": 5,
    "AddressInfo": {
        "ID": 107718,
        "Title": "Tim Horton's DCFC",
        "AddressLine1": "Notre Dame Street East",
        "Town": "Greater Sudbury",
        "StateOrProvince": "Ontario",
        "Postcode": "P0M 1B0",
        "CountryID": 44,
        "Latitude": 46.5469168920944,
        "Longitude": -81.0963136543201,
        "AccessComments": "Parking lot",
        "RelatedURL": "https://kobensystems.com/myevroute/",
        "DistanceUnit": 0
    },
    "Connections": [
        {
            "ID": 151497,
            "ConnectionTypeID": 2,
            "StatusTypeID": 100,
            "LevelID": 3,
            "PowerKW": 30,
            "CurrentTypeID": 30,
            "Quantity": 1
        },
        {
            "ID": 151498,
            "ConnectionTypeID": 32,
            "StatusTypeID": 100,
            "LevelID": 3,
            "PowerKW": 30,
            "CurrentTypeID": 30,
            "Quantity": 1
        }
    ],
    "NumberOfPoints": 2,
    "GeneralComments": "On the myEVroute network. Use RFIC, app or credit card for payment.",
    "StatusTypeID": 100,
    "DateLastStatusUpdate": "2019-12-31T09:48:00Z",
    "DataQualityLevel": 1,
    "DateCreated": "2018-07-26T14:37:00Z",
    "SubmissionStatusTypeID": 200
}