{
    "IsRecentlyVerified": false,
    "ID": 174140,
    "UUID": "7C5A0375-5E56-4D85-9CC3-3916F47EB8BD",
    "DataProviderID": 1,
    "OperatorID": 103,
    "UsageTypeID": 4,
    "AddressInfo": {
        "ID": 174499,
        "Title": "Putte  Bibliotheek",
        "AddressLine1": "Gemeenteplein",
        "Town": "Putte",
        "StateOrProvince": "Flanders",
        "Postcode": "2580",
        "CountryID": 26,
        "Latitude": 51.057049490466056,
        "Longitude": 4.627921468274735,
        "DistanceUnit": 0
    },
    "Connections": [
        {
            "ID": 269110,
            "ConnectionTypeID": 25,
            "StatusTypeID": 50,
            "LevelID": 2,
            "PowerKW": 11,
            "CurrentTypeID": 20,
            "Quantity": 2
        }
    ],
    "NumberOfPoints": 1,
    "StatusTypeID": 50,
    "DateLastStatusUpdate": "2021-03-18T12:37:00Z",
    "DataQualityLevel": 1,
    "DateCreated": "2021-03-18T07:38:00Z",
    "SubmissionStatusTypeID": 200
}