{
    "IsRecentlyVerified": false,
    "ID": 135450,
    "UUID": "47E65A7E-2BC5-42E3-8BAA-7817E8EF6FEF",
    "DataProviderID": 1,
    "OperatorID": 3,
    "OperatorsReference": "PG-70121,PG-83908",
    "UsageTypeID": 4,
    "UsageCost": "Free",
    "AddressInfo": {
        "ID": 135796,
        "Title": "Tesco Superstore-Padiham",
        "AddressLine1": "Wyre Street",
        "Town": "Padiham",
        "StateOrProvince": "Lancashire",
        "Postcode": "BB12 8DQ",
        "CountryID": 1,
        "Latitude": 53.80051,
        "Longitude": -2.310313,
        "DistanceUnit": 0
    },
    "Connections": [
        {
            "ID": 189780,
            "ConnectionTypeID": 25,
            "StatusTypeID": 50,
            "LevelID": 2,
            "Amps": 32,
            "Voltage": 230,
            "PowerKW": 7,
            "CurrentTypeID": 10,
            "Quantity": 4
        }
    ],
    "NumberOfPoints": 4,
    "GeneralComments": "This is an open charge unit installed at the Tesco super store at Wyre Street, Padiham",
    "StatusTypeID": 50,
    "DateLastStatusUpdate": "2019-12-26T23:52:00Z",
    "DataQualityLevel": 1,
    "DateCreated": "2019-12-21T17:32:00Z",
    "SubmissionStatusTypeID": 200
}