{
    "IsRecentlyVerified": false,
    "ID": 135111,
    "UUID": "42B48ABB-C8D8-4F42-83E7-CCB950FE7330",
    "DataProviderID": 1,
    "OperatorID": 5,
    "UsageTypeID": 5,
    "UsageCost": "$1.00 per hour for first four hours, $3.00 per hour thereafter",
    "AddressInfo": {
        "ID": 135457,
        "Title": "Santa Fe County Administrative Complex",
        "AddressLine1": "100 Catron Street",
        "Town": "Santa Fe",
        "StateOrProvince": "NM",
        "Postcode": "87501",
        "CountryID": 2,
        "Latitude": 35.69051119589189,
        "Longitude": -105.94089108052532,
        "ContactTelephone1": "505-986-6200",
        "AccessComments": "Access parking ramp from Grant Street",
        "DistanceUnit": 0
    },
    "Connections": [
        {
            "ID": 189106,
            "ConnectionTypeID": 1,
            "StatusTypeID": 50,
            "LevelID": 2,
            "PowerKW": 7,
            "CurrentTypeID": 20,
            "Quantity": 4
        }
    ],
    "NumberOfPoints": 2,
    "StatusTypeID": 50,
    "DateLastStatusUpdate": "2019-12-05T19:46:00Z",
    "DataQualityLevel": 1,
    "DateCreated": "2019-12-05T18:24:00Z",
    "SubmissionStatusTypeID": 200
}