{
    "IsRecentlyVerified": false,
    "ID": 27921,
    "UUID": "8DFA34D5-4BFA-4922-8964-43DB0373AE27",
    "DataProviderID": 2,
    "DataProvidersReference": "63514",
    "OperatorID": 5,
    "UsageTypeID": 1,
    "AddressInfo": {
        "ID": 28267,
        "Title": "LIBERTY",
        "AddressLine1": "933 Eloise Ave",
        "Town": "South Lake Tahoe",
        "StateOrProvince": "CA",
        "Postcode": "96150",
        "CountryID": 2,
        "Latitude": 38.9170997,
        "Longitude": -120.0058067,
        "ContactTelephone1": "888-758-4389",
        "AccessComments": "24 hours daily",
        "RelatedURL": "http://www.chargepoint.com/",
        "DistanceUnit": 0
    },
    "Connections": [
        {
            "ID": 30666,
            "ConnectionTypeID": 1,
            "LevelID": 2,
            "Amps": 16,
            "Voltage": 230,
            "PowerKW": 3,
            "CurrentTypeID": 10,
            "Quantity": 2
        }
    ],
    "DateLastStatusUpdate": "2019-04-06T04:03:00Z",
    "DataQualityLevel": 3,
    "DateCreated": "2014-11-28T03:38:00Z",
    "SubmissionStatusTypeID": 100
}