{
    "IsRecentlyVerified": false,
    "ID": 89500,
    "UUID": "61128AE1-F76F-41C9-97C3-9345C6663E92",
    "DataProviderID": 2,
    "DataProvidersReference": "80264",
    "OperatorID": 5,
    "UsageTypeID": 1,
    "AddressInfo": {
        "ID": 89846,
        "Title": "EVERGY",
        "AddressLine1": "8314 W 135th St @ Sams Club #4707",
        "Town": "Overland Park",
        "StateOrProvince": "KS",
        "Postcode": "66223",
        "CountryID": 2,
        "Latitude": 38.8848085,
        "Longitude": -94.6836238,
        "ContactTelephone1": "888-758-4389",
        "AccessComments": "24 hours daily",
        "RelatedURL": "http://www.chargepoint.com/",
        "DistanceUnit": 0
    },
    "Connections": [
        {
            "ID": 126908,
            "ConnectionTypeID": 1,
            "LevelID": 2,
            "Amps": 16,
            "Voltage": 230,
            "PowerKW": 3.7,
            "CurrentTypeID": 10,
            "Quantity": 6
        }
    ],
    "DateLastStatusUpdate": "2020-06-26T03:00:00Z",
    "DataQualityLevel": 3,
    "DateCreated": "2017-06-22T08:16:00Z",
    "SubmissionStatusTypeID": 100
}