{
    "IsRecentlyVerified": false,
    "ID": 123857,
    "UUID": "C8B14725-EE21-44A9-A189-2B69C2E5A3AE",
    "DataProviderID": 2,
    "DataProvidersReference": "72277",
    "OperatorID": 39,
    "UsageTypeID": 4,
    "AddressInfo": {
        "ID": 124203,
        "Title": "Anton 1101 Apartments",
        "AddressLine1": "1101 North Fair Oaks Avenue",
        "Town": "Sunnyvale",
        "StateOrProvince": "CA",
        "Postcode": "94089",
        "CountryID": 2,
        "Latitude": 37.4009562,
        "Longitude": -122.0121754,
        "ContactTelephone1": "800-663-5633",
        "AccessComments": "MO: Not Specified; TU: Not Specified; WE: Not Specified; TH: Not Specified; FR: Not Specified; SA: Not Specified; SU: Not Specified",
        "RelatedURL": "http://www.semacharge.com/",
        "DistanceUnit": 0
    },
    "Connections": [
        {
            "ID": 173888,
            "ConnectionTypeID": 1,
            "LevelID": 2,
            "Amps": 16,
            "Voltage": 230,
            "PowerKW": 3,
            "CurrentTypeID": 10,
            "Quantity": 1
        }
    ],
    "DateLastStatusUpdate": "2019-04-06T05:03:00Z",
    "DataQualityLevel": 3,
    "DateCreated": "2019-04-06T05:03:00Z",
    "SubmissionStatusTypeID": 100
}