{
    "IsRecentlyVerified": false,
    "ID": 64463,
    "UUID": "7C67AFFA-F74D-4F9A-A042-B2F080DD4471",
    "DataProviderID": 1,
    "OperatorID": 1,
    "UsageTypeID": 6,
    "AddressInfo": {
        "ID": 64809,
        "Title": " Istituto Italiano di Tecnologia",
        "AddressLine1": "Via Morego, 30",
        "Town": "Genova",
        "StateOrProvince": "GE",
        "Postcode": "16163",
        "CountryID": 112,
        "Latitude": 44.4747122823925,
        "Longitude": 8.90681009312241,
        "RelatedURL": "https://www.iit.it/centers/iit-central-research-laboratory",
        "DistanceUnit": 0
    },
    "Connections": [
        {
            "ID": 82709,
            "ConnectionTypeID": 36,
            "StatusTypeID": 0,
            "LevelID": 1,
            "CurrentTypeID": 10,
            "Quantity": 2
        }
    ],
    "NumberOfPoints": 2,
    "GeneralComments": "Solo per scooter",
    "StatusTypeID": 50,
    "DateLastStatusUpdate": "2016-08-10T12:21:00Z",
    "DataQualityLevel": 1,
    "DateCreated": "2016-03-07T15:43:00Z",
    "SubmissionStatusTypeID": 200
}