{
    "MediaItems": [
        {
            "ID": 6002,
            "ChargePointID": 44926,
            "ItemURL": "https://s3-ap-southeast-2.amazonaws.com/openchargemap/images/GB/OCM44926/OCM-44926.orig.2016022913320417.jpg",
            "ItemThumbnailURL": "https://s3-ap-southeast-2.amazonaws.com/openchargemap/images/GB/OCM44926/OCM-44926.thmb.2016022913320417.jpg",
            "Comment": "Photo of the bays",
            "IsEnabled": true,
            "IsVideo": false,
            "IsFeaturedItem": false,
            "IsExternalResource": false,
            "User": {
                "ID": 9036,
                "Username": "UoB Parking"
            },
            "DateCreated": "2016-02-29T13:32:00Z"
        }
    ],
    "IsRecentlyVerified": false,
    "ID": 44926,
    "UUID": "22B4656B-2B96-424C-AF24-62949BD3D1EE",
    "DataProviderID": 1,
    "OperatorID": 3,
    "OperatorsReference": "PG-80038,PG-80040,PG-80043,PG-82362",
    "UsageTypeID": 4,
    "UsageCost": "Free",
    "AddressInfo": {
        "ID": 45272,
        "Title": "University of Bath East Car Park",
        "AddressLine1": "Convocation Avenue",
        "AddressLine2": "Claverton Down",
        "Town": "Bath",
        "Postcode": "BA2 7PJ",
        "CountryID": 1,
        "Latitude": 51.378869,
        "Longitude": -2.324367,
        "ContactEmail": "security-car-parking@rt.bath.ac.uk",
        "AccessComments": "Restricted access for the use of University staff, students and visitors from Monday - FridayVisitors must pay and display.",
        "RelatedURL": "http://www.bath.ac.uk/security/parking/electric-vehicles/index.html",
        "DistanceUnit": 0
    },
    "Connections": [
        {
            "ID": 55249,
            "ConnectionTypeID": 25,
            "StatusTypeID": 50,
            "LevelID": 2,
            "Amps": 32,
            "Voltage": 230,
            "PowerKW": 7,
            "CurrentTypeID": 10,
            "Quantity": 8
        }
    ],
    "NumberOfPoints": 8,
    "GeneralComments": "Pod-Point T7-S points. Web or app login required for charge sessions over 15 minutes.",
    "StatusTypeID": 50,
    "DateLastStatusUpdate": "2020-06-02T09:15:00Z",
    "MetadataValues": [
        {
            "ID": 1356,
            "MetadataFieldID": 4,
            "ItemValue": "Contains public sector information licensed under the Open Government Licence v2.0. http://www.nationalarchives.gov.uk/doc/open-government-licence/version/2/"
        }
    ],
    "DataQualityLevel": 3,
    "DateCreated": "2015-04-22T03:02:00Z",
    "SubmissionStatusTypeID": 200
}