{
    "IsRecentlyVerified": false,
    "ID": 28872,
    "UUID": "32E4F67C-A2F7-45A9-8742-9FFD61BB70EF",
    "DataProviderID": 2,
    "DataProvidersReference": "63614",
    "UsageTypeID": 1,
    "AddressInfo": {
        "ID": 29218,
        "Title": "Acton Ford",
        "AddressLine1": "76 Powdermill Rd",
        "Town": "Acton",
        "StateOrProvince": "MA",
        "Postcode": "01720",
        "CountryID": 2,
        "Latitude": 42.441386,
        "Longitude": -71.430141,
        "ContactTelephone1": "978-897-7000",
        "AccessComments": "Dealership business hours",
        "RelatedURL": "",
        "DistanceUnit": 0
    },
    "Connections": [
        {
            "ID": 31724,
            "ConnectionTypeID": 1,
            "LevelID": 2,
            "Amps": 16,
            "Voltage": 230,
            "PowerKW": 3.7,
            "CurrentTypeID": 10,
            "Quantity": 2
        }
    ],
    "DateLastStatusUpdate": "2020-06-26T03:06:00Z",
    "DataQualityLevel": 3,
    "DateCreated": "2014-11-28T03:38:00Z",
    "SubmissionStatusTypeID": 100
}