{
    "IsRecentlyVerified": false,
    "ID": 91904,
    "UUID": "E9FCF3CF-251A-4B46-B7EB-3E91F73036ED",
    "DataProviderID": 1,
    "DataProvidersReference": "4241",
    "AddressInfo": {
        "ID": 92250,
        "Title": "Vattenfall InCharge Snabbladdning",
        "AddressLine1": "Runebergsgatan 2",
        "Town": "STOCKHOLM",
        "StateOrProvince": "STOCKHOLM",
        "Postcode": "11429",
        "CountryID": 216,
        "Latitude": 59.34083,
        "Longitude": 18.06719,
        "AccessComments": "På parkeringsytan som är omringad av buskage.",
        "DistanceUnit": 0
    },
    "Connections": [
        {
            "ID": 130268,
            "ConnectionTypeID": 0,
            "Reference": "1",
            "LevelID": 2,
            "Amps": 100,
            "Voltage": 500,
            "PowerKW": 50,
            "Comments": "Mode 4"
        },
        {
            "ID": 130269,
            "ConnectionTypeID": 0,
            "Reference": "2",
            "LevelID": 2,
            "Amps": 100,
            "Voltage": 500,
            "PowerKW": 50,
            "Comments": "Mode 4"
        },
        {
            "ID": 130270,
            "ConnectionTypeID": 0,
            "Reference": "3",
            "LevelID": 2,
            "Amps": 63,
            "Voltage": 400,
            "PowerKW": 43,
            "Comments": "Mode 3"
        }
    ],
    "NumberOfPoints": 3,
    "DateLastStatusUpdate": "2020-05-26T08:22:00Z",
    "DataQualityLevel": 2,
    "DateCreated": "2017-08-20T15:59:00Z",
    "SubmissionStatusTypeID": 100
}