{
    "UserComments": [
        {
            "ID": 20251,
            "ChargePointID": 73420,
            "CommentTypeID": 10,
            "UserName": "polianto",
            "Comment": "https://www.forumelettrico.it/forum/colonnina-gardauno-7kwac-limone-del-garda-parcheggio-lungolago-guglielmo-marconi-t3742.html",
            "Rating": 4,
            "RelatedURL": "https://www.forumelettrico.it/forum/colonnina-gardauno-7kwac-limone-del-garda-parcheggio-lungolago-guglielmo-marconi-t3742.html",
            "DateCreated": "2018-09-30T16:38:16.91Z",
            "User": {
                "ID": 1606,
                "Username": "polianto"
            },
            "CheckinStatusTypeID": 10
        },
        {
            "ID": 17359,
            "ChargePointID": 73420,
            "CommentTypeID": 10,
            "UserName": "Alvin",
            "Comment": "Attenzione. Si trova in area ztl. Ho preferito non rischiare.",
            "DateCreated": "2017-06-01T12:19:22.617Z",
            "User": {
                "ID": 12180,
                "Username": "Alvin"
            },
            "CheckinStatusTypeID": 0
        }
    ],
    "MediaItems": [
        {
            "ID": 17898,
            "ChargePointID": 73420,
            "ItemURL": "https://s3-ap-southeast-2.amazonaws.com/openchargemap/images/IT/OCM73420/OCM-73420.orig.2019032608282089.jpg",
            "ItemThumbnailURL": "https://s3-ap-southeast-2.amazonaws.com/openchargemap/images/IT/OCM73420/OCM-73420.thmb.2019032608282089.jpg",
            "Comment": "",
            "IsEnabled": true,
            "IsVideo": false,
            "IsFeaturedItem": false,
            "IsExternalResource": false,
            "User": {
                "ID": 11749,
                "Username": "ForumElettrico.it"
            },
            "DateCreated": "2019-03-26T08:29:00Z"
        },
        {
            "ID": 17899,
            "ChargePointID": 73420,
            "ItemURL": "https://s3-ap-southeast-2.amazonaws.com/openchargemap/images/IT/OCM73420/OCM-73420.orig.2019032608282788.jpg",
            "ItemThumbnailURL": "https://s3-ap-southeast-2.amazonaws.com/openchargemap/images/IT/OCM73420/OCM-73420.thmb.2019032608282788.jpg",
            "Comment": "",
            "IsEnabled": true,
            "IsVideo": false,
            "IsFeaturedItem": false,
            "IsExternalResource": false,
            "User": {
                "ID": 11749,
                "Username": "ForumElettrico.it"
            },
            "DateCreated": "2019-03-26T08:29:00Z"
        },
        {
            "ID": 17896,
            "ChargePointID": 73420,
            "ItemURL": "https://s3-ap-southeast-2.amazonaws.com/openchargemap/images/IT/OCM73420/OCM-73420.orig.2019032608280829.jpg",
            "ItemThumbnailURL": "https://s3-ap-southeast-2.amazonaws.com/openchargemap/images/IT/OCM73420/OCM-73420.thmb.2019032608280829.jpg",
            "Comment": "",
            "IsEnabled": true,
            "IsVideo": false,
            "IsFeaturedItem": false,
            "IsExternalResource": false,
            "User": {
                "ID": 11749,
                "Username": "ForumElettrico.it"
            },
            "DateCreated": "2019-03-26T08:28:00Z"
        },
        {
            "ID": 17897,
            "ChargePointID": 73420,
            "ItemURL": "https://s3-ap-southeast-2.amazonaws.com/openchargemap/images/IT/OCM73420/OCM-73420.orig.2019032608281443.jpg",
            "ItemThumbnailURL": "https://s3-ap-southeast-2.amazonaws.com/openchargemap/images/IT/OCM73420/OCM-73420.thmb.2019032608281443.jpg",
            "Comment": "",
            "IsEnabled": true,
            "IsVideo": false,
            "IsFeaturedItem": false,
            "IsExternalResource": false,
            "User": {
                "ID": 11749,
                "Username": "ForumElettrico.it"
            },
            "DateCreated": "2019-03-26T08:28:00Z"
        },
        {
            "ID": 16699,
            "ChargePointID": 73420,
            "ItemURL": "https://s3-ap-southeast-2.amazonaws.com/openchargemap/images/IT/OCM73420/OCM-73420.orig.2018093016272658.jpg",
            "ItemThumbnailURL": "https://s3-ap-southeast-2.amazonaws.com/openchargemap/images/IT/OCM73420/OCM-73420.thmb.2018093016272658.jpg",
            "Comment": "",
            "IsEnabled": true,
            "IsVideo": false,
            "IsFeaturedItem": false,
            "IsExternalResource": false,
            "User": {
                "ID": 1606,
                "Username": "polianto"
            },
            "DateCreated": "2018-09-30T16:28:00Z"
        },
        {
            "ID": 16697,
            "ChargePointID": 73420,
            "ItemURL": "https://s3-ap-southeast-2.amazonaws.com/openchargemap/images/IT/OCM73420/OCM-73420.orig.2018093016263797.jpg",
            "ItemThumbnailURL": "https://s3-ap-southeast-2.amazonaws.com/openchargemap/images/IT/OCM73420/OCM-73420.thmb.2018093016263797.jpg",
            "Comment": "",
            "IsEnabled": true,
            "IsVideo": false,
            "IsFeaturedItem": false,
            "IsExternalResource": false,
            "User": {
                "ID": 1606,
                "Username": "polianto"
            },
            "DateCreated": "2018-09-30T16:27:00Z"
        },
        {
            "ID": 16698,
            "ChargePointID": 73420,
            "ItemURL": "https://s3-ap-southeast-2.amazonaws.com/openchargemap/images/IT/OCM73420/OCM-73420.orig.2018093016270781.jpg",
            "ItemThumbnailURL": "https://s3-ap-southeast-2.amazonaws.com/openchargemap/images/IT/OCM73420/OCM-73420.thmb.2018093016270781.jpg",
            "Comment": "",
            "IsEnabled": true,
            "IsVideo": false,
            "IsFeaturedItem": false,
            "IsExternalResource": false,
            "User": {
                "ID": 1606,
                "Username": "polianto"
            },
            "DateCreated": "2018-09-30T16:27:00Z"
        },
        {
            "ID": 12983,
            "ChargePointID": 73420,
            "ItemURL": "https://s3-ap-southeast-2.amazonaws.com/openchargemap/images/IT/OCM73420/OCM-73420.orig.2017071215165317.jpg",
            "ItemThumbnailURL": "https://s3-ap-southeast-2.amazonaws.com/openchargemap/images/IT/OCM73420/OCM-73420.thmb.2017071215165317.jpg",
            "Comment": "",
            "IsEnabled": true,
            "IsVideo": false,
            "IsFeaturedItem": false,
            "IsExternalResource": false,
            "User": {
                "ID": 15775,
                "Username": "mario's i3"
            },
            "DateCreated": "2017-07-12T15:17:00Z"
        },
        {
            "ID": 9108,
            "ChargePointID": 73420,
            "ItemURL": "https://s3-ap-southeast-2.amazonaws.com/openchargemap/images/IT/OCM73420/OCM-73420.orig.2017011511345532.jpg",
            "ItemThumbnailURL": "https://s3-ap-southeast-2.amazonaws.com/openchargemap/images/IT/OCM73420/OCM-73420.thmb.2017011511345532.jpg",
            "Comment": "",
            "IsEnabled": true,
            "IsVideo": false,
            "IsFeaturedItem": false,
            "IsExternalResource": false,
            "User": {
                "ID": 12207,
                "Username": "aldodal"
            },
            "DateCreated": "2017-01-15T11:35:00Z"
        }
    ],
    "IsRecentlyVerified": false,
    "ID": 73420,
    "UUID": "E8ED10DC-9130-4FBF-905A-13786C94DAD9",
    "DataProviderID": 1,
    "OperatorID": 204,
    "UsageTypeID": 4,
    "UsageCost": "Sosta con Ricarica Auto 1,00 €/h - altre tariffe sul sito",
    "AddressInfo": {
        "ID": 73766,
        "Title": "Gardauno Parcheggio Lungolago",
        "AddressLine1": "Lungolago Marconi, 50",
        "Town": "Limone sul Garda",
        "StateOrProvince": "BS",
        "CountryID": 112,
        "Latitude": 45.81217505854711,
        "Longitude": 10.793968797799627,
        "ContactTelephone1": "800-601 328",
        "RelatedURL": "http://www.gardauno.it/la-mappa-dei-punti-di-ricarica/",
        "DistanceUnit": 0
    },
    "Connections": [
        {
            "ID": 105626,
            "ConnectionTypeID": 25,
            "StatusTypeID": 50,
            "LevelID": 2,
            "Amps": 32,
            "Voltage": 240,
            "PowerKW": 7,
            "CurrentTypeID": 10,
            "Quantity": 2
        },
        {
            "ID": 105627,
            "ConnectionTypeID": 36,
            "StatusTypeID": 50,
            "LevelID": 2,
            "Amps": 16,
            "Voltage": 240,
            "PowerKW": 3.5,
            "CurrentTypeID": 10,
            "Quantity": 2
        }
    ],
    "NumberOfPoints": 4,
    "GeneralComments": "http://www.gardauno.it/modulo-richiesta-mobility-card/",
    "StatusTypeID": 50,
    "DateLastStatusUpdate": "2019-03-26T08:29:00Z",
    "DataQualityLevel": 1,
    "DateCreated": "2016-11-22T08:29:00Z",
    "SubmissionStatusTypeID": 200
}