{
    "IsRecentlyVerified": false,
    "ID": 153459,
    "UUID": "1B30E9AB-DCAD-4362-A41F-D1051AF92A82",
    "DataProviderID": 28,
    "DataProvidersReference": "FR*S10*P10034A",
    "UsageTypeID": 5,
    "AddressInfo": {
        "ID": 153812,
        "Title": "BAR SUR SEINE",
        "AddressLine1": "2 Rue du Stade 10110 BAR SUR SEINE",
        "CountryID": 80,
        "Latitude": 48.121911,
        "Longitude": 4.372186,
        "AccessComments": "",
        "DistanceUnit": 0
    },
    "Connections": [
        {
            "ID": 215301,
            "ConnectionTypeID": 28,
            "StatusTypeID": 50,
            "LevelID": 2,
            "PowerKW": 18,
            "CurrentTypeID": 10
        },
        {
            "ID": 215302,
            "ConnectionTypeID": 25,
            "StatusTypeID": 50,
            "LevelID": 2,
            "PowerKW": 18,
            "CurrentTypeID": 20
        },
        {
            "ID": 248746,
            "ConnectionTypeID": 28,
            "StatusTypeID": 50,
            "LevelID": 2,
            "PowerKW": 18,
            "CurrentTypeID": 10
        },
        {
            "ID": 248747,
            "ConnectionTypeID": 25,
            "StatusTypeID": 50,
            "LevelID": 2,
            "PowerKW": 18,
            "CurrentTypeID": 20
        }
    ],
    "GeneralComments": "\"Une unité = 6kWh de recharge. Utilisateur abonné : 1€/unité",
    "StatusTypeID": 50,
    "DateLastStatusUpdate": "2020-08-27T05:14:00Z",
    "DataQualityLevel": 2,
    "DateCreated": "2020-03-15T10:54:00Z",
    "SubmissionStatusTypeID": 100
}