{
    "IsRecentlyVerified": false,
    "ID": 56289,
    "UUID": "FE79002B-CA3F-45F9-BBDE-1B83E5975C1F",
    "DataProviderID": 1,
    "OperatorID": 80,
    "UsageTypeID": 4,
    "UsageCost": "0,45 €/kW",
    "AddressInfo": {
        "ID": 56635,
        "Title": "Park Brennero | EnelX",
        "AddressLine1": "Via Alberto Paparelli",
        "Town": "Pisa",
        "StateOrProvince": "PI",
        "Postcode": "56127",
        "CountryID": 112,
        "Latitude": 43.7244026466503,
        "Longitude": 10.4106163820106,
        "RelatedURL": "https://www.enelx.com/it/en/electric-mobility",
        "DistanceUnit": 0
    },
    "Connections": [
        {
            "ID": 70986,
            "ConnectionTypeID": 25,
            "StatusTypeID": 50,
            "LevelID": 2,
            "Amps": 32,
            "Voltage": 400,
            "PowerKW": 22,
            "CurrentTypeID": 20,
            "Quantity": 3
        },
        {
            "ID": 70987,
            "ConnectionTypeID": 36,
            "StatusTypeID": 50,
            "LevelID": 2,
            "Amps": 16,
            "Voltage": 240,
            "PowerKW": 3.7,
            "CurrentTypeID": 10,
            "Quantity": 3
        }
    ],
    "NumberOfPoints": 3,
    "StatusTypeID": 50,
    "DateLastStatusUpdate": "2019-03-28T20:23:00Z",
    "DataQualityLevel": 1,
    "DateCreated": "2015-10-27T15:59:00Z",
    "SubmissionStatusTypeID": 200
}