{
    "MediaItems": [
        {
            "ID": 19286,
            "ChargePointID": 115219,
            "ItemURL": "https://s3-ap-southeast-2.amazonaws.com/openchargemap/images/ES/OCM115219/OCM-115219.orig.2019082119553267.jpeg",
            "ItemThumbnailURL": "https://s3-ap-southeast-2.amazonaws.com/openchargemap/images/ES/OCM115219/OCM-115219.thmb.2019082119553267.jpeg",
            "Comment": "",
            "IsEnabled": true,
            "IsVideo": false,
            "IsFeaturedItem": false,
            "IsExternalResource": false,
            "User": {
                "ID": 22010,
                "Username": "andygi"
            },
            "DateCreated": "2019-08-21T19:56:00Z"
        }
    ],
    "IsRecentlyVerified": false,
    "ID": 115219,
    "UUID": "F6B1B0A5-FC47-4CBC-992B-E401CA7078AF",
    "DataProviderID": 1,
    "OperatorID": 1,
    "UsageTypeID": 1,
    "AddressInfo": {
        "ID": 115565,
        "Title": "Avenida Fray Luis Amigo",
        "AddressLine1": "Avenida Fray Luis Amigo 14",
        "Town": "Segorbe",
        "StateOrProvince": "Valencian Community",
        "Postcode": "12400",
        "CountryID": 210,
        "Latitude": 39.84834816160972,
        "Longitude": -0.4891379379788532,
        "DistanceUnit": 0
    },
    "Connections": [
        {
            "ID": 162202,
            "ConnectionTypeID": 33,
            "LevelID": 2,
            "PowerKW": 25,
            "Quantity": 1
        },
        {
            "ID": 183271,
            "ConnectionTypeID": 2,
            "StatusTypeID": 50,
            "LevelID": 3,
            "PowerKW": 45,
            "CurrentTypeID": 30,
            "Quantity": 1
        },
        {
            "ID": 183272,
            "ConnectionTypeID": 25,
            "StatusTypeID": 50,
            "LevelID": 3,
            "PowerKW": 43,
            "CurrentTypeID": 20
        }
    ],
    "NumberOfPoints": 2,
    "StatusTypeID": 50,
    "DateLastStatusUpdate": "2020-08-11T15:50:00Z",
    "DataQualityLevel": 1,
    "DateCreated": "2019-02-09T00:18:00Z",
    "SubmissionStatusTypeID": 200
}