{
    "IsRecentlyVerified": false,
    "ID": 143986,
    "UUID": "8989CB25-E65A-4904-BBC0-99230FB5BDE0",
    "DataProviderID": 2,
    "DataProvidersReference": "129614",
    "OperatorID": 89,
    "UsageTypeID": 1,
    "AddressInfo": {
        "ID": 144338,
        "Title": "NBCC  - St. Andrews",
        "AddressLine1": "99 Augustus St",
        "Town": "Saint Andrews",
        "StateOrProvince": "NB",
        "Postcode": "E5B 1J8",
        "CountryID": 44,
        "Latitude": 45.073188,
        "Longitude": -67.043252,
        "ContactTelephone1": "888-356-8911",
        "AccessComments": "24 hours daily",
        "RelatedURL": "https://flo.ca/",
        "DistanceUnit": 0
    },
    "Connections": [
        {
            "ID": 200435,
            "ConnectionTypeID": 1,
            "LevelID": 2,
            "Amps": 16,
            "Voltage": 230,
            "PowerKW": 3.7,
            "CurrentTypeID": 10,
            "Quantity": 1
        }
    ],
    "StatusTypeID": 50,
    "DateLastStatusUpdate": "2020-06-26T03:08:00Z",
    "DataQualityLevel": 3,
    "DateCreated": "2019-12-24T09:22:00Z",
    "SubmissionStatusTypeID": 100
}