{
    "IsRecentlyVerified": false,
    "ID": 43155,
    "UUID": "E303F42A-46B4-4EF4-BC64-7F4FBAA8F193",
    "DataProviderID": 1,
    "DataProvidersReference": "2658",
    "AddressInfo": {
        "ID": 43501,
        "Title": "St. Olofsgatan",
        "AddressLine1": "Sankt Olofsgatan 7",
        "Town": "UPPSALA",
        "StateOrProvince": "UPPSALA",
        "Postcode": "75311",
        "CountryID": 216,
        "Latitude": 59.8594,
        "Longitude": 17.63211,
        "AccessComments": "I korsningen St.Olofsgatan - Sysslomansgatan.",
        "DistanceUnit": 0
    },
    "Connections": [
        {
            "ID": 52323,
            "ConnectionTypeID": 0,
            "Reference": "1",
            "LevelID": 2,
            "Amps": 16,
            "Voltage": 230,
            "PowerKW": 3.7,
            "Comments": "Mode 3"
        },
        {
            "ID": 88489,
            "ConnectionTypeID": 0,
            "Reference": "2",
            "LevelID": 2,
            "Amps": 16,
            "Voltage": 230,
            "PowerKW": 3.7,
            "Comments": "Mode 3"
        }
    ],
    "NumberOfPoints": 2,
    "DateLastStatusUpdate": "2020-05-26T08:23:00Z",
    "DataQualityLevel": 2,
    "DateCreated": "2015-03-25T04:33:00Z",
    "SubmissionStatusTypeID": 100
}