{
    "IsRecentlyVerified": false,
    "ID": 133798,
    "UUID": "A9B742E6-B152-41F6-8352-A06673C05A12",
    "DataProviderID": 1,
    "OperatorID": 5,
    "UsageTypeID": 1,
    "AddressInfo": {
        "ID": 134144,
        "Title": "7-Eleven, Inc. 20101Pomona",
        "AddressLine1": "808 N. Indian Hill Blvd.",
        "Town": "Pomona",
        "StateOrProvince": "California",
        "Postcode": "91767",
        "CountryID": 2,
        "Latitude": 34.0672761895796,
        "Longitude": -117.718868279708,
        "DistanceUnit": 0
    },
    "Connections": [
        {
            "ID": 187250,
            "ConnectionTypeID": 32,
            "StatusTypeID": 50,
            "LevelID": 3,
            "PowerKW": 62,
            "CurrentTypeID": 30,
            "Quantity": 2
        }
    ],
    "NumberOfPoints": 2,
    "GeneralComments": "24 hours/7 days a week.  In front of 7-Eleven",
    "StatusTypeID": 50,
    "DateLastStatusUpdate": "2019-11-01T11:29:00Z",
    "DataQualityLevel": 1,
    "DateCreated": "2019-10-26T19:20:00Z",
    "SubmissionStatusTypeID": 200
}