{
    "IsRecentlyVerified": false,
    "ID": 85553,
    "UUID": "3BA3E748-C653-40C2-97EC-CE31ABE145BD",
    "DataProviderID": 1,
    "OperatorID": 45,
    "UsageTypeID": 6,
    "UsageCost": "Free",
    "AddressInfo": {
        "ID": 85899,
        "Title": "Hotel Restaurant Talblick",
        "AddressLine1": "Ditzenbacher Straße 85",
        "Town": "Bad Ditzenbach",
        "StateOrProvince": "Vereinbarte Verwaltungsgemeinschaft der Gemeinde Deggingen",
        "Postcode": "73342",
        "CountryID": 87,
        "Latitude": 48.60987,
        "Longitude": 9.679820000000063,
        "ContactTelephone1": "+497334921230",
        "ContactEmail": "info@talblick-auendorf.de",
        "AccessComments": "Free charging for guests and residents after reservation.",
        "RelatedURL": "http://www.talblick-auendorf.de/",
        "DistanceUnit": 0
    },
    "Connections": [
        {
            "ID": 121654,
            "ConnectionTypeID": 1036,
            "StatusTypeID": 50,
            "LevelID": 2,
            "Amps": 16,
            "Voltage": 230,
            "PowerKW": 22,
            "CurrentTypeID": 10,
            "Quantity": 2
        }
    ],
    "NumberOfPoints": 2,
    "StatusTypeID": 50,
    "DateLastStatusUpdate": "2020-01-29T04:47:00Z",
    "DataQualityLevel": 1,
    "DateCreated": "2017-04-07T07:23:00Z",
    "SubmissionStatusTypeID": 200
}