{
    "IsRecentlyVerified": false,
    "ID": 110259,
    "UUID": "2F7E3512-0B27-4EAB-833C-8FB7888C7B6E",
    "DataProviderID": 2,
    "DataProvidersReference": "102678",
    "OperatorID": 5,
    "UsageTypeID": 1,
    "AddressInfo": {
        "ID": 110605,
        "Title": "SWC STATION 3&4",
        "AddressLine1": "4400 Chandler Ridge Cir Wake Tech College",
        "Town": "Raleigh",
        "StateOrProvince": "NC",
        "Postcode": "27603",
        "CountryID": 2,
        "Latitude": 35.6521409,
        "Longitude": -78.7060333,
        "ContactTelephone1": "888-758-4389",
        "AccessComments": "24 hours daily",
        "RelatedURL": "http://www.chargepoint.com/",
        "DistanceUnit": 0
    },
    "Connections": [
        {
            "ID": 155498,
            "ConnectionTypeID": 1,
            "LevelID": 2,
            "Amps": 16,
            "Voltage": 230,
            "PowerKW": 3,
            "CurrentTypeID": 10,
            "Quantity": 2
        }
    ],
    "DateLastStatusUpdate": "2019-04-06T04:02:00Z",
    "DataQualityLevel": 3,
    "DateCreated": "2018-10-18T23:36:00Z",
    "SubmissionStatusTypeID": 100
}