{
    "UserComments": [
        {
            "ID": 23825,
            "ChargePointID": 145964,
            "CommentTypeID": 10,
            "UserName": "TeslaTrav",
            "Comment": "Good, works!",
            "Rating": 5,
            "DateCreated": "2021-01-28T17:02:00.117Z",
            "User": {
                "ID": 29404,
                "Username": "TeslaTrav"
            },
            "CheckinStatusTypeID": 10,
            "IsActionedByEditor": false
        }
    ],
    "IsRecentlyVerified": false,
    "ID": 145964,
    "UUID": "19B87CFB-3326-4546-A839-AEB45F89236F",
    "DataProviderID": 1,
    "OperatorID": 1,
    "UsageTypeID": 1,
    "UsageCost": "$1.00 + $0.21/min",
    "AddressInfo": {
        "ID": 146316,
        "Title": "Downtown Woodward",
        "AddressLine1": "905 Main St",
        "Town": "Woodward",
        "StateOrProvince": "OK",
        "Postcode": "73801",
        "CountryID": 2,
        "Latitude": 36.43510983974379,
        "Longitude": -99.39064350395552,
        "RelatedURL": "https://www.plugshare.com/location/219638",
        "DistanceUnit": 0
    },
    "Connections": [
        {
            "ID": 202852,
            "ConnectionTypeID": 32,
            "StatusTypeID": 50,
            "LevelID": 3,
            "Amps": 350,
            "Voltage": 950,
            "PowerKW": 200,
            "CurrentTypeID": 30,
            "Quantity": 4
        },
        {
            "ID": 202971,
            "ConnectionTypeID": 2,
            "StatusTypeID": 50,
            "LevelID": 3,
            "Amps": 200,
            "Voltage": 500,
            "PowerKW": 100,
            "CurrentTypeID": 30,
            "Quantity": 4
        }
    ],
    "NumberOfPoints": 4,
    "GeneralComments": "Four Stations--Each with CCS/CHAdeMO",
    "StatusTypeID": 50,
    "DateLastStatusUpdate": "2021-01-28T17:02:00Z",
    "DataQualityLevel": 1,
    "DateCreated": "2019-12-30T20:54:00Z",
    "SubmissionStatusTypeID": 200
}