{
    "IsRecentlyVerified": false,
    "ID": 144613,
    "UUID": "6754A0B0-1BF8-4247-A8EB-E586CD2D091B",
    "DataProviderID": 2,
    "DataProvidersReference": "123290",
    "UsageTypeID": 2,
    "AddressInfo": {
        "ID": 144965,
        "Title": "Nike - Zoom Flight",
        "AddressLine1": "3300-3342 NW Aloclek Dr",
        "Town": "Hillsboro",
        "StateOrProvince": "OR",
        "Postcode": "97124",
        "CountryID": 2,
        "Latitude": 45.543685,
        "Longitude": -122.891197,
        "ContactTelephone1": "",
        "AccessComments": "For employee use only",
        "RelatedURL": "",
        "DistanceUnit": 0
    },
    "Connections": [
        {
            "ID": 201126,
            "ConnectionTypeID": 1,
            "LevelID": 2,
            "Amps": 16,
            "Voltage": 230,
            "PowerKW": 3.7,
            "CurrentTypeID": 10,
            "Quantity": 4
        }
    ],
    "StatusTypeID": 50,
    "DateLastStatusUpdate": "2020-06-26T03:09:00Z",
    "DataQualityLevel": 3,
    "DateCreated": "2019-12-24T09:23:00Z",
    "SubmissionStatusTypeID": 100
}