{
    "IsRecentlyVerified": false,
    "ID": 48034,
    "UUID": "B28D8D33-C4E4-4824-91EE-EE1B8BC485B0",
    "DataProviderID": 1,
    "OperatorID": 45,
    "UsageTypeID": 1,
    "UsageCost": "0",
    "AddressInfo": {
        "ID": 48380,
        "Title": "Autohaus Burmeister",
        "AddressLine1": "Automeile 7",
        "Town": "Prenzlau",
        "StateOrProvince": "Landkreis Uckermark",
        "Postcode": "17291",
        "CountryID": 87,
        "Latitude": 53.34399,
        "Longitude": 13.8722,
        "AccessComments": "Es gibt 2 durchgängig und kostenlos nutzbare Wallboxen. Eine neben dem Rolltor \"Dialogannahme\" und eine auf der Hinterseite des VW Autohauses.",
        "RelatedURL": "http://www.autohaus-burmeister.de/",
        "DistanceUnit": 0
    },
    "Connections": [
        {
            "ID": 59320,
            "ConnectionTypeID": 25,
            "StatusTypeID": 50,
            "LevelID": 2,
            "Amps": 16,
            "Voltage": 230,
            "PowerKW": 3.7,
            "CurrentTypeID": 10,
            "Quantity": 2
        }
    ],
    "NumberOfPoints": 2,
    "StatusTypeID": 50,
    "DateLastStatusUpdate": "2015-06-23T08:53:00Z",
    "DataQualityLevel": 1,
    "DateCreated": "2015-06-23T07:47:00Z",
    "SubmissionStatusTypeID": 200
}