{
    "IsRecentlyVerified": false,
    "ID": 45148,
    "UUID": "8F9C7A59-807D-4FD5-A831-9E7653F440A1",
    "DataProviderID": 1,
    "OperatorID": 1,
    "UsageTypeID": 4,
    "UsageCost": "0",
    "AddressInfo": {
        "ID": 45494,
        "Title": "Versorgungsbetriebe Bordesholm",
        "AddressLine1": "Bahnhofstraße 13",
        "Town": "Bordesholm",
        "StateOrProvince": "Bordesholm",
        "Postcode": "24582",
        "CountryID": 87,
        "Latitude": 54.17443,
        "Longitude": 10.04872,
        "ContactTelephone1": "+49-4322-6977-0",
        "ContactEmail": "info@vb-bordesholm-gmbh.de",
        "AccessComments": "Direkt neben der RWE Ladesäule. Ladekarte der Versorgungsbetriebe Bordesholm nötig.",
        "RelatedURL": "http://www.vb-bordesholm.de",
        "DistanceUnit": 0
    },
    "Connections": [
        {
            "ID": 55642,
            "ConnectionTypeID": 28,
            "StatusTypeID": 50,
            "LevelID": 2,
            "Amps": 16,
            "Voltage": 230,
            "PowerKW": 3.7,
            "CurrentTypeID": 10,
            "Quantity": 1
        }
    ],
    "NumberOfPoints": 1,
    "StatusTypeID": 50,
    "DateLastStatusUpdate": "2015-04-26T15:54:00Z",
    "DataQualityLevel": 1,
    "DateCreated": "2015-04-26T09:58:00Z",
    "SubmissionStatusTypeID": 200
}