{
    "IsRecentlyVerified": false,
    "ID": 180192,
    "UUID": "B2DAAE87-7865-4E24-ADAC-35AEB8921E7B",
    "DataProviderID": 29,
    "DataProvidersReference": "14959",
    "OperatorID": 163,
    "AddressInfo": {
        "ID": 180551,
        "Title": "Bickenbacher Str. 6",
        "AddressLine1": "Bickenbacher Str. 6",
        "Town": "Alsbach-Hähnlein",
        "Postcode": "64665",
        "CountryID": 87,
        "Latitude": 49.741427,
        "Longitude": 8.622191,
        "DistanceUnit": 0
    },
    "Connections": [
        {
            "ID": 282965,
            "ConnectionTypeID": 25,
            "StatusTypeID": 50,
            "LevelID": 2,
            "PowerKW": 22,
            "CurrentTypeID": 20
        }
    ],
    "StatusTypeID": 50,
    "DateLastStatusUpdate": "2021-07-09T03:17:00Z",
    "MetadataValues": [
        {
            "ID": 12486,
            "MetadataFieldID": 4,
            "ItemValue": "Data from the German chargepoint registry provided by Bundesnetzagentur.de under the CC-BY 4.0 license"
        }
    ],
    "DataQualityLevel": 3,
    "DateCreated": "2021-07-08T10:00:00Z",
    "SubmissionStatusTypeID": 100
}