{
    "IsRecentlyVerified": false,
    "ID": 135617,
    "UUID": "05150E12-4028-48DE-BFAF-0159A7697EB4",
    "DataProviderID": 18,
    "DataProvidersReference": "5cc93ee3a3614810c43e3e9785185742",
    "OperatorID": 2244,
    "UsageTypeID": 5,
    "AddressInfo": {
        "ID": 135963,
        "Title": "Harborough Road",
        "AddressLine1": "Harborough Road",
        "Town": "London",
        "Postcode": "SW16 2XW",
        "CountryID": 1,
        "Latitude": 51.429939,
        "Longitude": -0.120668,
        "AccessComments": "",
        "RelatedURL": "https://www.ubitricity.com",
        "DistanceUnit": 0
    },
    "Connections": [
        {
            "ID": 190025,
            "ConnectionTypeID": 25,
            "Reference": "suby1100001724",
            "StatusTypeID": 50,
            "LevelID": 2,
            "Amps": 16,
            "Voltage": 230,
            "PowerKW": 3.7,
            "CurrentTypeID": 10
        }
    ],
    "StatusTypeID": 0,
    "DateLastStatusUpdate": "2021-04-25T05:46:00Z",
    "MetadataValues": [
        {
            "ID": 5469,
            "MetadataFieldID": 4,
            "ItemValue": "Contains public sector information licensed under the Open Government Licence v2.0. http://www.nationalarchives.gov.uk/doc/open-government-licence/version/2/"
        }
    ],
    "DataQualityLevel": 3,
    "DateCreated": "2019-12-24T05:22:00Z",
    "SubmissionStatusTypeID": 100
}