{
    "IsRecentlyVerified": false,
    "ID": 162590,
    "UUID": "FF8DE351-DAEF-4486-9650-5F1303A091A3",
    "DataProviderID": 1,
    "OperatorID": 45,
    "UsageTypeID": 6,
    "AddressInfo": {
        "ID": 162947,
        "Title": "Parkhotel Berghölzchen",
        "AddressLine1": "Am Berghölzchen 1",
        "Town": "Hildesheim",
        "StateOrProvince": "Landkreis Hildesheim",
        "Postcode": "31139",
        "CountryID": 87,
        "Latitude": 52.145307380140366,
        "Longitude": 9.926905551589925,
        "ContactTelephone1": "+49 5121 9790",
        "AccessComments": "Zwei durchgehend nutzbare Ladepunkte an der Hauswand für Restaurant- und Hotelgäste. Zufahrt: Erst rechts am Hotel vorbei, dann links, die Lageboxen sind an der Wand montiert.",
        "RelatedURL": "http://www.berghoelzchen.de/",
        "DistanceUnit": 0
    },
    "Connections": [
        {
            "ID": 234010,
            "ConnectionTypeID": 25,
            "StatusTypeID": 50,
            "LevelID": 2,
            "Amps": 32,
            "Voltage": 400,
            "PowerKW": 22,
            "CurrentTypeID": 20,
            "Quantity": 1
        },
        {
            "ID": 234011,
            "ConnectionTypeID": 1036,
            "StatusTypeID": 50,
            "LevelID": 2,
            "Amps": 32,
            "Voltage": 400,
            "PowerKW": 22,
            "CurrentTypeID": 20,
            "Quantity": 1
        }
    ],
    "NumberOfPoints": 2,
    "StatusTypeID": 50,
    "DateLastStatusUpdate": "2020-08-12T08:23:00Z",
    "DataQualityLevel": 1,
    "DateCreated": "2020-08-12T08:23:00Z",
    "SubmissionStatusTypeID": 200
}