{
    "IsRecentlyVerified": false,
    "ID": 156487,
    "UUID": "26FF2AA7-FA72-4408-B0C0-C6E7D26367D4",
    "DataProviderID": 1,
    "OperatorID": 3332,
    "UsageTypeID": 4,
    "AddressInfo": {
        "ID": 156841,
        "Title": "IPERAL  Treviolo",
        "AddressLine1": "Viale Europa, 4",
        "Town": "Treviolo",
        "StateOrProvince": "BG",
        "Postcode": "24048",
        "CountryID": 112,
        "Latitude": 45.67647473671366,
        "Longitude": 9.632952613700581,
        "RelatedURL": "https://www.iperal.it/IL-MONDO-IPERAL/Territorio/BERGAMO/Treviolo",
        "DistanceUnit": 0
    },
    "Connections": [
        {
            "ID": 220219,
            "ConnectionTypeID": 25,
            "StatusTypeID": 50,
            "LevelID": 2,
            "Amps": 32,
            "Voltage": 400,
            "PowerKW": 22,
            "CurrentTypeID": 20,
            "Quantity": 2
        }
    ],
    "NumberOfPoints": 2,
    "StatusTypeID": 50,
    "DateLastStatusUpdate": "2020-05-26T06:25:00Z",
    "DataQualityLevel": 1,
    "DateCreated": "2020-05-26T06:25:00Z",
    "SubmissionStatusTypeID": 200
}