{
    "IsRecentlyVerified": false,
    "ID": 125329,
    "UUID": "9BFA5101-C7A4-45DA-A74A-B26504968A44",
    "DataProviderID": 1,
    "OperatorID": 45,
    "UsageTypeID": 6,
    "UsageCost": "0,00",
    "AddressInfo": {
        "ID": 125675,
        "Title": "ALDI Süd St. Augustin",
        "AddressLine1": "Im Mittelfeld 7",
        "Town": "Buisdorf",
        "StateOrProvince": "Rhein-Sieg-Kreis",
        "Postcode": "53757",
        "CountryID": 87,
        "Latitude": 50.7777511391209,
        "Longitude": 7.2308446543334,
        "ContactTelephone1": "+49 800 2255793",
        "AccessComments": "Laden kostenlos\r\n\r\nParken kostenlos\r\nFreischaltung / Bezahlung\r\n\r\nSpontanladen (adhoc) ohne vorherige Registrierung ist hier möglich\r\n\r\nohne Authentifizierung",
        "RelatedURL": "https://www.aldi-sued.de",
        "DistanceUnit": 0
    },
    "Connections": [
        {
            "ID": 175636,
            "ConnectionTypeID": 33,
            "StatusTypeID": 50,
            "LevelID": 3,
            "Amps": 120,
            "Voltage": 500,
            "PowerKW": 50,
            "CurrentTypeID": 30,
            "Quantity": 1
        },
        {
            "ID": 175637,
            "ConnectionTypeID": 2,
            "StatusTypeID": 50,
            "LevelID": 3,
            "Amps": 120,
            "Voltage": 500,
            "PowerKW": 50,
            "CurrentTypeID": 30,
            "Quantity": 1
        },
        {
            "ID": 175638,
            "ConnectionTypeID": 1036,
            "StatusTypeID": 50,
            "LevelID": 3,
            "Amps": 63,
            "Voltage": 400,
            "PowerKW": 43,
            "CurrentTypeID": 20,
            "Quantity": 1
        }
    ],
    "NumberOfPoints": 1,
    "GeneralComments": "Laden nur während der Öffnungszeiten der Filiale. Die Ladedauer ist auf maximal eine Stunde begrenzt. Alle Ladevorgänge, die vor weniger als einer Stunde vor dem Ladenschluss der Filiale gestartet wurden, werden zum Zeitpunkt des Ladenschlusses automatisch beendet.\r\nMontag von 8:00 bis 20:00 Uhr\r\nDienstag von 8:00 bis 20:00 Uhr\r\nMittwoch von 8:00 bis 20:00 Uhr\r\nDonnerstag von 8:00 bis 20:00 Uhr\r\nFreitag von 8:00 bis 20:00 Uhr\r\nSamstag von 8:00 bis 20:00 Uhr",
    "StatusTypeID": 50,
    "DateLastStatusUpdate": "2019-05-01T18:42:00Z",
    "DataQualityLevel": 1,
    "DateCreated": "2019-04-14T21:17:00Z",
    "SubmissionStatusTypeID": 200
}