{
    "IsRecentlyVerified": false,
    "ID": 62584,
    "UUID": "557F1F56-A6B3-4938-8625-C3C19AFCD2FB",
    "DataProviderID": 26,
    "DataProvidersReference": "22356",
    "OperatorID": 162,
    "OperatorsReference": "浜松日産自動車㈱磐田上岡田店",
    "UsageCost": "0.00 onbekend",
    "AddressInfo": {
        "ID": 62930,
        "Title": "磐田停車場長野線",
        "AddressLine1": "磐田停車場長野線",
        "Town": "磐田市",
        "Postcode": "4380811",
        "CountryID": 114,
        "Latitude": 34.702602,
        "Longitude": 137.85054,
        "DistanceUnit": 0
    },
    "Connections": [
        {
            "ID": 79505,
            "ConnectionTypeID": 2,
            "LevelID": 3,
            "PowerKW": 50,
            "CurrentTypeID": 30
        }
    ],
    "NumberOfPoints": 1,
    "StatusTypeID": 50,
    "DateLastStatusUpdate": "2016-03-03T12:28:00Z",
    "DataQualityLevel": 3,
    "DateCreated": "2016-03-03T12:28:00Z",
    "SubmissionStatusTypeID": 100
}