{
    "IsRecentlyVerified": false,
    "ID": 92365,
    "UUID": "F6731A19-BCDE-43A2-860F-2C17488368F9",
    "DataProviderID": 1,
    "OperatorID": 3315,
    "OperatorsReference": "52505",
    "UsageTypeID": 4,
    "UsageCost": "Free",
    "AddressInfo": {
        "ID": 92711,
        "Title": "Bathgate Railway Station, Bathgate",
        "AddressLine1": "Bathgate Railway Station",
        "Town": "Bathgate",
        "StateOrProvince": "West Lothian",
        "Postcode": "EH48 1BA",
        "CountryID": 1,
        "Latitude": 55.89778,
        "Longitude": -3.63701,
        "DistanceUnit": 0
    },
    "Connections": [
        {
            "ID": 130930,
            "ConnectionTypeID": 25,
            "StatusTypeID": 50,
            "LevelID": 2,
            "Amps": 32,
            "Voltage": 400,
            "PowerKW": 22,
            "CurrentTypeID": 20,
            "Quantity": 2
        }
    ],
    "NumberOfPoints": 2,
    "StatusTypeID": 50,
    "DateLastStatusUpdate": "2018-11-07T06:14:00Z",
    "DataQualityLevel": 1,
    "DateCreated": "2017-09-01T20:41:00Z",
    "SubmissionStatusTypeID": 200
}