{
    "IsRecentlyVerified": false,
    "ID": 159379,
    "UUID": "3CC6A426-D961-4D56-B750-B427F841C61C",
    "DataProviderID": 2,
    "DataProvidersReference": "151788",
    "OperatorID": 3293,
    "UsageTypeID": 1,
    "AddressInfo": {
        "ID": 159736,
        "Title": "King Farm Village Center",
        "AddressLine1": "402 Redland Blvd",
        "Town": "Rockville",
        "StateOrProvince": "MD",
        "Postcode": "20850",
        "CountryID": 2,
        "Latitude": 39.113259,
        "Longitude": -77.172553,
        "ContactTelephone1": "888-264-2208",
        "AccessComments": "6am-12am daily",
        "RelatedURL": "https://voltacharging.com/",
        "DistanceUnit": 0
    },
    "Connections": [
        {
            "ID": 229538,
            "ConnectionTypeID": 1,
            "LevelID": 2,
            "Amps": 16,
            "Voltage": 230,
            "PowerKW": 3.7,
            "CurrentTypeID": 10,
            "Quantity": 2
        }
    ],
    "StatusTypeID": 50,
    "DateLastStatusUpdate": "2020-06-26T03:01:00Z",
    "DataQualityLevel": 3,
    "DateCreated": "2020-06-26T03:01:00Z",
    "SubmissionStatusTypeID": 100
}