{
    "IsRecentlyVerified": false,
    "ID": 176624,
    "UUID": "C75CDA76-3787-420F-90C8-934ACA5A364E",
    "DataProviderID": 29,
    "DataProvidersReference": "13067",
    "AddressInfo": {
        "ID": 176983,
        "Title": "Neuhausen 2",
        "AddressLine1": "Neuhausen 2",
        "Town": "Heldenstein",
        "Postcode": "84431",
        "CountryID": 87,
        "Latitude": 48.225,
        "Longitude": 12.304,
        "DistanceUnit": 0
    },
    "Connections": [
        {
            "ID": 274747,
            "ConnectionTypeID": 28,
            "StatusTypeID": 50,
            "LevelID": 2,
            "PowerKW": 22,
            "CurrentTypeID": 20
        },
        {
            "ID": 274748,
            "ConnectionTypeID": 25,
            "StatusTypeID": 50,
            "LevelID": 2,
            "PowerKW": 22,
            "CurrentTypeID": 20
        }
    ],
    "StatusTypeID": 0,
    "DateLastStatusUpdate": "2021-07-12T02:40:00Z",
    "MetadataValues": [
        {
            "ID": 8919,
            "MetadataFieldID": 4,
            "ItemValue": "Data from the German chargepoint registry provided by Bundesnetzagentur.de under the CC-BY 4.0 license"
        }
    ],
    "DataQualityLevel": 3,
    "DateCreated": "2021-07-08T09:48:00Z",
    "SubmissionStatusTypeID": 100
}