{
    "IsRecentlyVerified": false,
    "ID": 46444,
    "UUID": "3AE97A4D-83B8-41E5-AE12-C58D99295FB3",
    "DataProviderID": 1,
    "DataProvidersReference": "146",
    "AddressInfo": {
        "ID": 46790,
        "Title": "Jevnaker Samfunnshus",
        "AddressLine1": "Kirkegata 6",
        "Town": "JEVNAKER",
        "StateOrProvince": "Viken",
        "Postcode": "3520",
        "CountryID": 168,
        "Latitude": 60.23989,
        "Longitude": 10.38596,
        "AccessComments": "Parkeringsplass ved Samfunnshuset.",
        "DistanceUnit": 0
    },
    "Connections": [
        {
            "ID": 57107,
            "ConnectionTypeID": 0,
            "Reference": "1",
            "LevelID": 2,
            "Amps": 16,
            "Voltage": 230,
            "PowerKW": 3.7,
            "Comments": "Mode 1"
        },
        {
            "ID": 88928,
            "ConnectionTypeID": 0,
            "Reference": "2",
            "LevelID": 2,
            "Amps": 16,
            "Voltage": 230,
            "PowerKW": 3.7,
            "Comments": "Mode 1"
        }
    ],
    "NumberOfPoints": 2,
    "DateLastStatusUpdate": "2020-05-26T08:24:00Z",
    "DataQualityLevel": 2,
    "DateCreated": "2015-05-03T00:54:00Z",
    "SubmissionStatusTypeID": 100
}