{
    "IsRecentlyVerified": false,
    "ID": 96992,
    "UUID": "A60C0196-2D5A-4E4F-B8A5-AE842E75AEA1",
    "DataProviderID": 1,
    "DataProvidersReference": "4485",
    "AddressInfo": {
        "ID": 97338,
        "Title": "Torget Hyltebruk",
        "AddressLine1": "Storgatan 15",
        "Town": "HYLTEBRUK",
        "StateOrProvince": "HALLAND",
        "Postcode": "31431",
        "CountryID": 216,
        "Latitude": 56.9986,
        "Longitude": 13.2392,
        "AccessComments": "Står på torget i Hyltebruk, några minuters körning från Nissastigen (RV26) och går att nå från både norra och södra infarten till Hyltebruk. Står mellan Coop och ICA Supermarket, så ser ni någon av dessa butiker är ni nära.",
        "DistanceUnit": 0
    },
    "Connections": [
        {
            "ID": 137403,
            "ConnectionTypeID": 0,
            "Reference": "1",
            "LevelID": 2,
            "Amps": 100,
            "Voltage": 500,
            "PowerKW": 50,
            "Comments": "Mode 4"
        },
        {
            "ID": 137404,
            "ConnectionTypeID": 0,
            "Reference": "2",
            "LevelID": 2,
            "Amps": 100,
            "Voltage": 500,
            "PowerKW": 50,
            "Comments": "Mode 4"
        },
        {
            "ID": 137405,
            "ConnectionTypeID": 0,
            "Reference": "3",
            "LevelID": 2,
            "Amps": 63,
            "Voltage": 400,
            "PowerKW": 43,
            "Comments": "Mode 3"
        }
    ],
    "NumberOfPoints": 3,
    "DateLastStatusUpdate": "2020-05-26T08:21:00Z",
    "DataQualityLevel": 2,
    "DateCreated": "2018-01-04T08:28:00Z",
    "SubmissionStatusTypeID": 100
}