{
    "IsRecentlyVerified": false,
    "ID": 153888,
    "UUID": "3115596B-D8E9-4BDC-9EAD-B0BA83920FAC",
    "DataProviderID": 28,
    "DataProvidersReference": "FR*A07*PCCHVC04",
    "AddressInfo": {
        "ID": 154241,
        "Title": "CCHVC 4 - Choisel - Parking mairie - EF + T2 (2)",
        "AddressLine1": "1 Route de la Grange aux Moines, Choisel",
        "CountryID": 80,
        "Latitude": 48.686673,
        "Longitude": 2.017795,
        "AccessComments": "24h/24 7j/7",
        "DistanceUnit": 0
    },
    "Connections": [
        {
            "ID": 216155,
            "ConnectionTypeID": 1036,
            "StatusTypeID": 50,
            "LevelID": 2,
            "PowerKW": 22,
            "CurrentTypeID": 20
        },
        {
            "ID": 216156,
            "ConnectionTypeID": 28,
            "StatusTypeID": 50,
            "LevelID": 2,
            "PowerKW": 22,
            "CurrentTypeID": 10
        },
        {
            "ID": 250068,
            "ConnectionTypeID": 1036,
            "StatusTypeID": 50,
            "LevelID": 2,
            "PowerKW": 22,
            "CurrentTypeID": 20
        },
        {
            "ID": 250069,
            "ConnectionTypeID": 28,
            "StatusTypeID": 50,
            "LevelID": 2,
            "PowerKW": 22,
            "CurrentTypeID": 10
        }
    ],
    "GeneralComments": "Recharge normale et accélérée, accessible par badge après réservation sur le site internet cchvc.clem.mobi ou depuis l'application mobile Clem' Ecomobilité -Informations sur le site : cchvc.clem.mobi",
    "StatusTypeID": 50,
    "DateLastStatusUpdate": "2020-08-27T05:15:00Z",
    "DataQualityLevel": 2,
    "DateCreated": "2020-03-15T10:54:00Z",
    "SubmissionStatusTypeID": 100
}