{
    "IsRecentlyVerified": false,
    "ID": 187756,
    "UUID": "B7AD16B1-3BAD-4739-ACC3-40F5DF6ACCA1",
    "DataProviderID": 18,
    "DataProvidersReference": "31877f582e3919b904dacb0bb73e5fa1",
    "OperatorID": 2244,
    "UsageTypeID": 5,
    "AddressInfo": {
        "ID": 188115,
        "Title": "243 Kensal Road",
        "AddressLine1": "243 Kensal Road",
        "Town": "London",
        "Postcode": "W10 5AR",
        "CountryID": 1,
        "Latitude": 51.526189,
        "Longitude": -0.21019,
        "AccessComments": "",
        "RelatedURL": "https://www.ubitricity.com",
        "DistanceUnit": 0
    },
    "Connections": [
        {
            "ID": 302998,
            "ConnectionTypeID": 25,
            "Reference": "suby1100007484",
            "StatusTypeID": 50,
            "LevelID": 2,
            "Amps": 16,
            "Voltage": 230,
            "PowerKW": 3.7,
            "CurrentTypeID": 10
        }
    ],
    "StatusTypeID": 0,
    "DateLastStatusUpdate": "2021-07-12T03:38:00Z",
    "MetadataValues": [
        {
            "ID": 19996,
            "MetadataFieldID": 4,
            "ItemValue": "Contains public sector information licensed under the Open Government Licence v2.0. http://www.nationalarchives.gov.uk/doc/open-government-licence/version/2/"
        }
    ],
    "DataQualityLevel": 3,
    "DateCreated": "2021-07-12T03:38:00Z",
    "SubmissionStatusTypeID": 100
}