{
    "IsRecentlyVerified": false,
    "ID": 3456,
    "UUID": "C33D66BD-EA39-4669-A8DB-1D7B265C8F43",
    "DataProviderID": 1,
    "OperatorID": 1,
    "AddressInfo": {
        "ID": 3457,
        "Title": "Spinx",
        "AddressLine1": "507 Bypass 123",
        "Town": "Seneca",
        "StateOrProvince": "SC",
        "Postcode": "29678",
        "CountryID": 2,
        "Latitude": 34.69649506,
        "Longitude": -82.95207977,
        "ContactTelephone1": "888-758-4389",
        "AccessComments": "Located behind building on rear wall",
        "DistanceUnit": 0
    },
    "Connections": [],
    "NumberOfPoints": 1,
    "GeneralComments": "Cost To Charge: ChargePoint Access Hours: 7am-8pm",
    "DateLastStatusUpdate": "2019-12-15T06:07:00Z",
    "DateCreated": "2010-02-28T00:00:00Z",
    "SubmissionStatusTypeID": 200
}