{
    "MediaItems": [
        {
            "ID": 28195,
            "ChargePointID": 174864,
            "ItemURL": "https://s3-ap-southeast-2.amazonaws.com/openchargemap/images/IT/OCM174864/OCM-174864.orig.2021061907142969.jpg",
            "ItemThumbnailURL": "https://s3-ap-southeast-2.amazonaws.com/openchargemap/images/IT/OCM174864/OCM-174864.thmb.2021061907142969.jpg",
            "Comment": "",
            "IsEnabled": true,
            "IsVideo": false,
            "IsFeaturedItem": false,
            "IsExternalResource": false,
            "User": {
                "ID": 32866,
                "Username": "gcannata"
            },
            "DateCreated": "2021-06-19T07:15:00Z"
        }
    ],
    "IsRecentlyVerified": false,
    "ID": 174864,
    "UUID": "2C78EB6E-8396-43D7-B93F-7F63A76B9F2A",
    "DataProviderID": 1,
    "OperatorID": 3327,
    "UsageTypeID": 1,
    "UsageCost": "0.45",
    "AddressInfo": {
        "ID": 175223,
        "Title": "Via Castel dell'Alpi",
        "AddressLine1": "Via Castel dell'Alpi",
        "AddressLine2": "parcheggio pubblico",
        "Town": "San Benedetto Val di Sambro",
        "StateOrProvince": "Emilia-Romagna",
        "Postcode": "40032",
        "CountryID": 112,
        "Latitude": 44.21638185354951,
        "Longitude": 11.235316185214629,
        "DistanceUnit": 0
    },
    "Connections": [
        {
            "ID": 270963,
            "ConnectionTypeID": 25,
            "StatusTypeID": 50,
            "LevelID": 2,
            "PowerKW": 22
        }
    ],
    "NumberOfPoints": 2,
    "StatusTypeID": 50,
    "DateLastStatusUpdate": "2021-06-19T07:15:00Z",
    "DataQualityLevel": 1,
    "DateCreated": "2021-04-15T21:00:00Z",
    "SubmissionStatusTypeID": 200
}