{
    "IsRecentlyVerified": false,
    "ID": 87642,
    "UUID": "256F6A26-E355-4898-A4D6-F2AB80257109",
    "DataProviderID": 1,
    "OperatorID": 156,
    "UsageTypeID": 4,
    "AddressInfo": {
        "ID": 87988,
        "Title": "Bahnhof",
        "AddressLine1": "Bahnhofstraße 117",
        "Town": "Maintal",
        "StateOrProvince": "Main-Kinzig-Kreis",
        "Postcode": "63477",
        "CountryID": 87,
        "Latitude": 50.1418472,
        "Longitude": 8.83631939999998,
        "AccessComments": "2 durchgehend nutzbare New Motion lolo Boxen auf Pfählen am Straßenrand um den weißen Stromkasten herum, der an der Fußgängerunterführung steht. ",
        "DistanceUnit": 0
    },
    "Connections": [
        {
            "ID": 124245,
            "ConnectionTypeID": 25,
            "StatusTypeID": 50,
            "LevelID": 2,
            "Amps": 32,
            "Voltage": 400,
            "PowerKW": 22,
            "CurrentTypeID": 20,
            "Quantity": 2
        }
    ],
    "NumberOfPoints": 2,
    "StatusTypeID": 50,
    "DateLastStatusUpdate": "2017-05-15T07:17:00Z",
    "DataQualityLevel": 1,
    "DateCreated": "2017-05-15T07:17:00Z",
    "SubmissionStatusTypeID": 200
}