{
    "IsRecentlyVerified": false,
    "ID": 101486,
    "UUID": "A21B65F9-19D0-4118-8993-CD64DC9E6D95",
    "DataProviderID": 1,
    "OperatorID": 23,
    "OperatorsReference": "41772",
    "UsageTypeID": 7,
    "AddressInfo": {
        "ID": 101832,
        "Title": "Naturhotel Lechlife",
        "AddressLine1": "Holz 1a",
        "Town": "Waengle",
        "StateOrProvince": "Tirol",
        "Postcode": "6610",
        "CountryID": 19,
        "Latitude": 47.481479,
        "Longitude": 10.680931,
        "ContactTelephone1": "+43 5672 64234",
        "DistanceUnit": 0
    },
    "Connections": [
        {
            "ID": 143295,
            "ConnectionTypeID": 30,
            "StatusTypeID": 50,
            "LevelID": 2,
            "Amps": 32,
            "Voltage": 230,
            "PowerKW": 17,
            "CurrentTypeID": 20,
            "Quantity": 1
        }
    ],
    "NumberOfPoints": 1,
    "GeneralComments": "1 Tesla Connector, up to 17kW.Available by reservation only. Please see front desk.",
    "StatusTypeID": 50,
    "DateLastStatusUpdate": "2018-10-03T21:57:00Z",
    "DataQualityLevel": 1,
    "DateCreated": "2018-03-30T05:42:00Z",
    "SubmissionStatusTypeID": 200
}