{
    "IsRecentlyVerified": false,
    "ID": 119805,
    "UUID": "8CFB6F17-37B7-4C83-B38E-DB890C6AF6EA",
    "DataProviderID": 2,
    "DataProvidersReference": "62803",
    "OperatorID": 5,
    "UsageTypeID": 1,
    "AddressInfo": {
        "ID": 120151,
        "Title": "PASCO COUNTY",
        "AddressLine1": "38425 McDonald St",
        "Town": "Dade City",
        "StateOrProvince": "FL",
        "Postcode": "33525",
        "CountryID": 2,
        "Latitude": 28.3383082,
        "Longitude": -82.1824875,
        "ContactTelephone1": "888-758-4389",
        "AccessComments": "24 hours daily",
        "RelatedURL": "http://www.chargepoint.com/",
        "DistanceUnit": 0
    },
    "Connections": [
        {
            "ID": 169094,
            "ConnectionTypeID": 9,
            "LevelID": 1,
            "Amps": 16,
            "Voltage": 120,
            "PowerKW": 1,
            "CurrentTypeID": 10,
            "Quantity": 4
        },
        {
            "ID": 169095,
            "ConnectionTypeID": 1,
            "LevelID": 2,
            "Amps": 16,
            "Voltage": 230,
            "PowerKW": 3,
            "CurrentTypeID": 10,
            "Quantity": 4
        }
    ],
    "DateLastStatusUpdate": "2019-12-24T09:08:00Z",
    "DataQualityLevel": 3,
    "DateCreated": "2019-04-01T04:59:00Z",
    "SubmissionStatusTypeID": 100
}