{
    "IsRecentlyVerified": false,
    "ID": 28916,
    "UUID": "18EF0472-82A1-4D32-83AF-984DA809CA4B",
    "DataProviderID": 2,
    "DataProvidersReference": "62201",
    "OperatorID": 5,
    "UsageTypeID": 1,
    "AddressInfo": {
        "ID": 29262,
        "Title": "CITY LOWELL MA",
        "AddressLine1": "135 Middlesex St",
        "Town": "Lowell",
        "StateOrProvince": "MA",
        "Postcode": "01852",
        "CountryID": 2,
        "Latitude": 42.6418155,
        "Longitude": -71.3101491,
        "ContactTelephone1": "888-758-4389",
        "AccessComments": "24 hours daily",
        "RelatedURL": "http://www.chargepoint.com/",
        "DistanceUnit": 0
    },
    "Connections": [
        {
            "ID": 31775,
            "ConnectionTypeID": 1,
            "LevelID": 2,
            "Amps": 16,
            "Voltage": 230,
            "PowerKW": 3.7,
            "CurrentTypeID": 10,
            "Quantity": 2
        }
    ],
    "DateLastStatusUpdate": "2020-06-26T03:06:00Z",
    "DataQualityLevel": 3,
    "DateCreated": "2014-11-28T03:38:00Z",
    "SubmissionStatusTypeID": 100
}