{
    "UserComments": [
        {
            "ID": 22894,
            "ChargePointID": 148246,
            "CommentTypeID": 10,
            "UserName": "polianto",
            "Comment": "Tutto ok, attivata con app Wroom    \r\nhttps://www.forumelettrico.it/forum/colonnina-ressolar-ac-22kw-muncipio-di-predore-piazza-vittorio-veneto-t11393.html",
            "Rating": 4,
            "RelatedURL": "https://www.forumelettrico.it/forum/colonnina-ressolar-ac-22kw-muncipio-di-predore-piazza-vittorio-veneto-t11393.html",
            "DateCreated": "2020-07-11T16:34:39.037Z",
            "User": {
                "ID": 1606,
                "Username": "polianto"
            },
            "CheckinStatusTypeID": 10,
            "IsActionedByEditor": false
        }
    ],
    "MediaItems": [
        {
            "ID": 23017,
            "ChargePointID": 148246,
            "ItemURL": "https://s3-ap-southeast-2.amazonaws.com/openchargemap/images/IT/OCM148246/OCM-148246.orig.2020071116203055.jpg",
            "ItemThumbnailURL": "https://s3-ap-southeast-2.amazonaws.com/openchargemap/images/IT/OCM148246/OCM-148246.thmb.2020071116203055.jpg",
            "Comment": "",
            "IsEnabled": true,
            "IsVideo": false,
            "IsFeaturedItem": false,
            "IsExternalResource": false,
            "User": {
                "ID": 1606,
                "Username": "polianto"
            },
            "DateCreated": "2020-07-11T16:21:00Z"
        },
        {
            "ID": 23014,
            "ChargePointID": 148246,
            "ItemURL": "https://s3-ap-southeast-2.amazonaws.com/openchargemap/images/IT/OCM148246/OCM-148246.orig.2020071116194171.jpg",
            "ItemThumbnailURL": "https://s3-ap-southeast-2.amazonaws.com/openchargemap/images/IT/OCM148246/OCM-148246.thmb.2020071116194171.jpg",
            "Comment": "",
            "IsEnabled": true,
            "IsVideo": false,
            "IsFeaturedItem": false,
            "IsExternalResource": false,
            "User": {
                "ID": 1606,
                "Username": "polianto"
            },
            "DateCreated": "2020-07-11T16:20:00Z"
        },
        {
            "ID": 23015,
            "ChargePointID": 148246,
            "ItemURL": "https://s3-ap-southeast-2.amazonaws.com/openchargemap/images/IT/OCM148246/OCM-148246.orig.2020071116200062.jpg",
            "ItemThumbnailURL": "https://s3-ap-southeast-2.amazonaws.com/openchargemap/images/IT/OCM148246/OCM-148246.thmb.2020071116200062.jpg",
            "Comment": "",
            "IsEnabled": true,
            "IsVideo": false,
            "IsFeaturedItem": false,
            "IsExternalResource": false,
            "User": {
                "ID": 1606,
                "Username": "polianto"
            },
            "DateCreated": "2020-07-11T16:20:00Z"
        },
        {
            "ID": 23016,
            "ChargePointID": 148246,
            "ItemURL": "https://s3-ap-southeast-2.amazonaws.com/openchargemap/images/IT/OCM148246/OCM-148246.orig.2020071116201381.jpg",
            "ItemThumbnailURL": "https://s3-ap-southeast-2.amazonaws.com/openchargemap/images/IT/OCM148246/OCM-148246.thmb.2020071116201381.jpg",
            "Comment": "",
            "IsEnabled": true,
            "IsVideo": false,
            "IsFeaturedItem": false,
            "IsExternalResource": false,
            "User": {
                "ID": 1606,
                "Username": "polianto"
            },
            "DateCreated": "2020-07-11T16:20:00Z"
        }
    ],
    "IsRecentlyVerified": false,
    "ID": 148246,
    "UUID": "B3D30EB8-9D0B-478C-9DCB-D9496390E3B3",
    "DataProviderID": 1,
    "OperatorID": 3382,
    "UsageTypeID": 4,
    "AddressInfo": {
        "ID": 148598,
        "Title": "Municipio di Predore | RESSOLAR",
        "AddressLine1": " Piazza Vittorio Veneto",
        "Town": "Predore",
        "StateOrProvince": "BG",
        "Postcode": "24060",
        "CountryID": 112,
        "Latitude": 45.680691797237756,
        "Longitude": 10.019812791999584,
        "ContactTelephone1": "+39 035 36 92 145",
        "ContactEmail": "info@ressolar.it",
        "RelatedURL": "https://www.ressolar.it/mobilita-sostenibile/",
        "DistanceUnit": 0
    },
    "Connections": [
        {
            "ID": 205820,
            "ConnectionTypeID": 25,
            "StatusTypeID": 50,
            "LevelID": 2,
            "Amps": 32,
            "Voltage": 400,
            "PowerKW": 22,
            "CurrentTypeID": 20,
            "Quantity": 2
        }
    ],
    "NumberOfPoints": 2,
    "GeneralComments": "Si attiva con l'App Wroom",
    "StatusTypeID": 50,
    "DateLastStatusUpdate": "2020-07-11T16:35:00Z",
    "DataQualityLevel": 1,
    "DateCreated": "2020-01-28T12:00:00Z",
    "SubmissionStatusTypeID": 200
}