{
    "IsRecentlyVerified": false,
    "ID": 84508,
    "UUID": "DC28635C-0B58-45BF-871C-4628803BE0F5",
    "DataProviderID": 1,
    "OperatorID": 45,
    "OperatorsReference": "25370",
    "UsageTypeID": 6,
    "AddressInfo": {
        "ID": 84854,
        "Title": "Best Western Plus Executive Hotel & Suites Torino",
        "AddressLine1": "Via Nizza, 28",
        "Town": "Torino",
        "StateOrProvince": "TO",
        "Postcode": "10123",
        "CountryID": 112,
        "Latitude": 45.055359,
        "Longitude": 7.675923,
        "ContactTelephone1": "+39 011 650 77 07",
        "ContactEmail": "executive.to@bestwestern.it",
        "RelatedURL": "http://www.hotelexecutivetorino.com/",
        "DistanceUnit": 0
    },
    "Connections": [
        {
            "ID": 119983,
            "ConnectionTypeID": 1036,
            "StatusTypeID": 50,
            "LevelID": 2,
            "Amps": 16,
            "Voltage": 400,
            "PowerKW": 11,
            "CurrentTypeID": 20,
            "Quantity": 1
        }
    ],
    "NumberOfPoints": 1,
    "GeneralComments": "1 Tesla Connector, up to 11kW.Available for customers. Please call ahead.",
    "StatusTypeID": 50,
    "DateLastStatusUpdate": "2017-03-06T17:11:00Z",
    "DataQualityLevel": 1,
    "DateCreated": "2017-03-02T06:38:00Z",
    "SubmissionStatusTypeID": 200
}