{
    "IsRecentlyVerified": false,
    "ID": 62579,
    "UUID": "64970E8A-0F0B-49E0-8374-43FF13AC3AE4",
    "DataProviderID": 26,
    "DataProvidersReference": "22414",
    "OperatorID": 162,
    "OperatorsReference": "静岡県下田総合庁舎 ",
    "UsageCost": "0.00 onbekend",
    "AddressInfo": {
        "ID": 62925,
        "Title": "414",
        "AddressLine1": "414",
        "Town": "下田市",
        "Postcode": "",
        "CountryID": 114,
        "Latitude": 34.682743,
        "Longitude": 138.950516,
        "DistanceUnit": 0
    },
    "Connections": [
        {
            "ID": 79500,
            "ConnectionTypeID": 2,
            "LevelID": 3,
            "PowerKW": 50,
            "CurrentTypeID": 30
        }
    ],
    "NumberOfPoints": 1,
    "StatusTypeID": 50,
    "DateLastStatusUpdate": "2016-03-03T12:28:00Z",
    "DataQualityLevel": 3,
    "DateCreated": "2016-03-03T12:28:00Z",
    "SubmissionStatusTypeID": 100
}