{
    "IsRecentlyVerified": false,
    "ID": 31087,
    "UUID": "32659FD9-CC94-4A95-ABF2-9D55E8EF0B7F",
    "DataProviderID": 1,
    "OperatorID": 23,
    "UsageTypeID": 1,
    "AddressInfo": {
        "ID": 31433,
        "Title": "Storjord Supercharger",
        "AddressLine1": "Saltdal Turistsenter",
        "Town": "RØKLAND",
        "StateOrProvince": "Nordland",
        "Postcode": "8255",
        "CountryID": 168,
        "Latitude": 66.81404,
        "Longitude": 15.4005,
        "ContactTelephone1": "+4723960285",
        "AccessComments": "Utenfor Saltdal Turistsenter",
        "DistanceUnit": 0
    },
    "Connections": [
        {
            "ID": 34316,
            "ConnectionTypeID": 27,
            "Reference": "1",
            "StatusTypeID": 50,
            "LevelID": 3,
            "Amps": 270,
            "Voltage": 480,
            "PowerKW": 129,
            "CurrentTypeID": 30,
            "Quantity": 4,
            "Comments": "Mode 4"
        }
    ],
    "NumberOfPoints": 4,
    "StatusTypeID": 50,
    "DateLastStatusUpdate": "2020-05-29T08:28:00Z",
    "DataQualityLevel": 2,
    "DateCreated": "2014-12-09T09:01:00Z",
    "SubmissionStatusTypeID": 200
}