{
    "UserComments": [
        {
            "ID": 24737,
            "ChargePointID": 188804,
            "CommentTypeID": 10,
            "UserName": "ForumElettrico.it",
            "Comment": "Di fronte c'è un bel bar con tanti tavolini all'aperto, proprio a pochi metri dalla colonnina. Leggi la recensione completa qui > https://www.forumelettrico.it/forum/enelfast-brugnato-p-za-comune-t16337.html",
            "RelatedURL": "https://www.forumelettrico.it/forum/enelfast-brugnato-p-za-comune-t16337.html",
            "DateCreated": "2021-08-18T14:43:29.097Z",
            "User": {
                "ID": 11749,
                "Username": "ForumElettrico.it"
            },
            "CheckinStatusTypeID": 10,
            "IsActionedByEditor": false
        }
    ],
    "MediaItems": [
        {
            "ID": 28996,
            "ChargePointID": 188804,
            "ItemURL": "https://s3-ap-southeast-2.amazonaws.com/openchargemap/images/IT/OCM188804/OCM-188804.orig.2021081814433931.jpg",
            "ItemThumbnailURL": "https://s3-ap-southeast-2.amazonaws.com/openchargemap/images/IT/OCM188804/OCM-188804.thmb.2021081814433931.jpg",
            "Comment": "",
            "IsEnabled": true,
            "IsVideo": false,
            "IsFeaturedItem": false,
            "IsExternalResource": false,
            "User": {
                "ID": 11749,
                "Username": "ForumElettrico.it"
            },
            "DateCreated": "2021-08-18T14:44:00Z"
        },
        {
            "ID": 28997,
            "ChargePointID": 188804,
            "ItemURL": "https://s3-ap-southeast-2.amazonaws.com/openchargemap/images/IT/OCM188804/OCM-188804.orig.2021081814434574.jpg",
            "ItemThumbnailURL": "https://s3-ap-southeast-2.amazonaws.com/openchargemap/images/IT/OCM188804/OCM-188804.thmb.2021081814434574.jpg",
            "Comment": "",
            "IsEnabled": true,
            "IsVideo": false,
            "IsFeaturedItem": false,
            "IsExternalResource": false,
            "User": {
                "ID": 11749,
                "Username": "ForumElettrico.it"
            },
            "DateCreated": "2021-08-18T14:44:00Z"
        },
        {
            "ID": 28998,
            "ChargePointID": 188804,
            "ItemURL": "https://s3-ap-southeast-2.amazonaws.com/openchargemap/images/IT/OCM188804/OCM-188804.orig.2021081814435130.jpg",
            "ItemThumbnailURL": "https://s3-ap-southeast-2.amazonaws.com/openchargemap/images/IT/OCM188804/OCM-188804.thmb.2021081814435130.jpg",
            "Comment": "",
            "IsEnabled": true,
            "IsVideo": false,
            "IsFeaturedItem": false,
            "IsExternalResource": false,
            "User": {
                "ID": 11749,
                "Username": "ForumElettrico.it"
            },
            "DateCreated": "2021-08-18T14:44:00Z"
        },
        {
            "ID": 28999,
            "ChargePointID": 188804,
            "ItemURL": "https://s3-ap-southeast-2.amazonaws.com/openchargemap/images/IT/OCM188804/OCM-188804.orig.2021081814435782.jpg",
            "ItemThumbnailURL": "https://s3-ap-southeast-2.amazonaws.com/openchargemap/images/IT/OCM188804/OCM-188804.thmb.2021081814435782.jpg",
            "Comment": "",
            "IsEnabled": true,
            "IsVideo": false,
            "IsFeaturedItem": false,
            "IsExternalResource": false,
            "User": {
                "ID": 11749,
                "Username": "ForumElettrico.it"
            },
            "DateCreated": "2021-08-18T14:44:00Z"
        },
        {
            "ID": 29000,
            "ChargePointID": 188804,
            "ItemURL": "https://s3-ap-southeast-2.amazonaws.com/openchargemap/images/IT/OCM188804/OCM-188804.orig.2021081814440424.jpg",
            "ItemThumbnailURL": "https://s3-ap-southeast-2.amazonaws.com/openchargemap/images/IT/OCM188804/OCM-188804.thmb.2021081814440424.jpg",
            "Comment": "",
            "IsEnabled": true,
            "IsVideo": false,
            "IsFeaturedItem": false,
            "IsExternalResource": false,
            "User": {
                "ID": 11749,
                "Username": "ForumElettrico.it"
            },
            "DateCreated": "2021-08-18T14:44:00Z"
        }
    ],
    "IsRecentlyVerified": true,
    "DateLastVerified": "2021-08-18T14:23:00Z",
    "ID": 188804,
    "UUID": "D17CF44A-A148-496A-955D-D18E2C5CD043",
    "DataProviderID": 1,
    "OperatorID": 80,
    "UsageTypeID": 1,
    "AddressInfo": {
        "ID": 189163,
        "Title": "Enel X Municipio",
        "AddressLine1": "Piazza Martiri 1",
        "Town": "Brugnato",
        "StateOrProvince": "SP",
        "CountryID": 112,
        "Latitude": 44.236722,
        "Longitude": 9.725218,
        "RelatedURL": "https://www.forumelettrico.it/forum/enelfast-brugnato-p-za-comune-t16337.html",
        "DistanceUnit": 0
    },
    "Connections": [
        {
            "ID": 305050,
            "ConnectionTypeID": 33,
            "LevelID": 2,
            "PowerKW": 50
        },
        {
            "ID": 305051,
            "ConnectionTypeID": 2,
            "LevelID": 2,
            "PowerKW": 50
        },
        {
            "ID": 305052,
            "ConnectionTypeID": 1036,
            "LevelID": 2,
            "PowerKW": 43
        }
    ],
    "NumberOfPoints": 1,
    "StatusTypeID": 50,
    "DateLastStatusUpdate": "2021-08-18T14:44:00Z",
    "DataQualityLevel": 1,
    "DateCreated": "2021-08-18T14:23:00Z",
    "SubmissionStatusTypeID": 200
}