{
    "IsRecentlyVerified": false,
    "ID": 122962,
    "UUID": "B4265DD4-3B9B-4866-8C1E-B251E3264310",
    "DataProviderID": 2,
    "DataProvidersReference": "21713",
    "UsageTypeID": 1,
    "AddressInfo": {
        "ID": 123308,
        "Title": "San Luis Obispo County Air Pollution Control District",
        "AddressLine1": "3433 Roberto Ct",
        "Town": "San Luis Obispo",
        "StateOrProvince": "CA",
        "Postcode": "93401",
        "CountryID": 2,
        "Latitude": 35.25939,
        "Longitude": -120.64492,
        "ContactTelephone1": "805-781-5912",
        "AccessComments": "8am-5pm M-F; see front desk for code",
        "RelatedURL": "",
        "DistanceUnit": 0
    },
    "Connections": [
        {
            "ID": 172891,
            "ConnectionTypeID": 9,
            "LevelID": 1,
            "Amps": 16,
            "Voltage": 120,
            "PowerKW": 1.9,
            "CurrentTypeID": 10,
            "Quantity": 1
        },
        {
            "ID": 172892,
            "ConnectionTypeID": 1,
            "LevelID": 2,
            "Amps": 16,
            "Voltage": 230,
            "PowerKW": 3.7,
            "CurrentTypeID": 10,
            "Quantity": 1
        }
    ],
    "DateLastStatusUpdate": "2020-06-26T02:58:00Z",
    "DataQualityLevel": 3,
    "DateCreated": "2019-04-06T05:03:00Z",
    "SubmissionStatusTypeID": 100
}