{
    "IsRecentlyVerified": false,
    "ID": 23162,
    "UUID": "C4DDB081-F05D-4AB5-8A63-3723DBED2FDC",
    "DataProviderID": 1,
    "OperatorID": 76,
    "UsageTypeID": 1,
    "UsageCost": "5€ /up to 60min of loading",
    "AddressInfo": {
        "ID": 23507,
        "Title": "Lümanda",
        "AddressLine1": "Mustjala - Kihelkonna - Tehumardi road",
        "AddressLine2": "GPS: 58.286; 22,024",
        "Town": "Lümanda",
        "StateOrProvince": "Saaremaa island",
        "Postcode": "93301",
        "CountryID": 74,
        "Latitude": 58.2861376522388,
        "Longitude": 22.0245819057005,
        "ContactTelephone1": "+372 6511911",
        "ContactEmail": "tugi@elmo.ee",
        "RelatedURL": "http://www.elmo.ee/en",
        "DistanceUnit": 0
    },
    "Connections": [
        {
            "ID": 24923,
            "ConnectionTypeID": 2,
            "StatusTypeID": 50,
            "LevelID": 3,
            "Amps": 120,
            "Voltage": 500,
            "PowerKW": 50,
            "CurrentTypeID": 30,
            "Quantity": 1
        },
        {
            "ID": 24924,
            "ConnectionTypeID": 25,
            "StatusTypeID": 50,
            "LevelID": 2,
            "Amps": 32,
            "Voltage": 400,
            "PowerKW": 22,
            "CurrentTypeID": 20,
            "Quantity": 1
        }
    ],
    "NumberOfPoints": 1,
    "GeneralComments": "Opened 24h (automatic). \r\nReal-time condition information (operational/not operational/free) - www.elmo.ee \r\nCan pay with client card, SMS or mobile application. \r\nCharger number 74122",
    "StatusTypeID": 50,
    "DateLastStatusUpdate": "2014-04-19T19:53:00Z",
    "DataQualityLevel": 1,
    "DateCreated": "2014-04-19T18:57:00Z",
    "SubmissionStatusTypeID": 200
}