{
    "IsRecentlyVerified": false,
    "ID": 123603,
    "UUID": "26C2DD15-9E9A-401D-B0F1-52036038C223",
    "DataProviderID": 2,
    "DataProvidersReference": "80570",
    "UsageTypeID": 2,
    "AddressInfo": {
        "ID": 123949,
        "Title": "Hall Chevrolet",
        "AddressLine1": "6412 Western Branch",
        "Town": "Chesapeake",
        "StateOrProvince": "VA",
        "Postcode": "23321",
        "CountryID": 2,
        "Latitude": 36.866677206177,
        "Longitude": -76.4172706724609,
        "ContactTelephone1": "",
        "AccessComments": "Service center use only",
        "RelatedURL": "",
        "DistanceUnit": 0
    },
    "Connections": [
        {
            "ID": 173611,
            "ConnectionTypeID": 1,
            "LevelID": 2,
            "Amps": 16,
            "Voltage": 230,
            "PowerKW": 3.7,
            "CurrentTypeID": 10,
            "Quantity": 1
        }
    ],
    "DateLastStatusUpdate": "2020-06-26T02:59:00Z",
    "DataQualityLevel": 3,
    "DateCreated": "2019-04-06T05:03:00Z",
    "SubmissionStatusTypeID": 100
}