{
    "IsRecentlyVerified": false,
    "ID": 30059,
    "UUID": "D46C26C5-E7B0-4B67-AD3A-01E6B007B720",
    "DataProviderID": 1,
    "DataProvidersReference": "CSC-00011",
    "OperatorID": 21,
    "UsageTypeID": 2,
    "AddressInfo": {
        "ID": 30405,
        "Title": "CSC-00011",
        "AddressLine1": "Estrada de Manique 1830",
        "Town": "Cascais",
        "Postcode": "2755-182",
        "CountryID": 180,
        "Latitude": 38.736197,
        "Longitude": -9.386233,
        "AccessComments": "Private",
        "RelatedURL": "http://www.mobie.pt",
        "DistanceUnit": 0
    },
    "Connections": [
        {
            "ID": 33044,
            "ConnectionTypeID": 25,
            "StatusTypeID": 50,
            "LevelID": 2,
            "Amps": 16,
            "Voltage": 230,
            "PowerKW": 3.7,
            "CurrentTypeID": 10,
            "Quantity": 4
        }
    ],
    "NumberOfPoints": 4,
    "StatusTypeID": 30,
    "DateLastStatusUpdate": "2020-08-09T14:34:00Z",
    "DataQualityLevel": 3,
    "DateCreated": "2014-11-29T14:48:00Z",
    "SubmissionStatusTypeID": 100
}