{
    "IsRecentlyVerified": false,
    "ID": 167869,
    "UUID": "582B0A26-D04D-4AF8-B8DA-81E96D32ACFD",
    "DataProviderID": 1,
    "OperatorID": 1,
    "UsageTypeID": 4,
    "UsageCost": "free",
    "AddressInfo": {
        "ID": 168228,
        "Title": "Ayuntamiento Reocin",
        "AddressLine1": "Barrio Puente San Miguel, 95",
        "Town": "Puente San Miguel",
        "StateOrProvince": "Cantabria",
        "Postcode": "39530",
        "CountryID": 210,
        "Latitude": 43.35982471121321,
        "Longitude": -4.086576552670181,
        "DistanceUnit": 0
    },
    "Connections": [
        {
            "ID": 254876,
            "ConnectionTypeID": 25,
            "StatusTypeID": 50,
            "LevelID": 2,
            "Amps": 32,
            "Voltage": 230,
            "PowerKW": 7,
            "CurrentTypeID": 10,
            "Quantity": 2
        }
    ],
    "NumberOfPoints": 2,
    "StatusTypeID": 50,
    "DateLastStatusUpdate": "2021-05-30T11:30:00Z",
    "DataQualityLevel": 1,
    "DateCreated": "2020-09-15T20:39:00Z",
    "SubmissionStatusTypeID": 200
}