{
    "IsRecentlyVerified": false,
    "ID": 70545,
    "UUID": "24EC5B90-E93A-42AF-85F1-E5814FE3F464",
    "DataProviderID": 1,
    "OperatorID": 1,
    "UsageTypeID": 1,
    "AddressInfo": {
        "ID": 70891,
        "Title": "Hamilton Stage- Union County Performing Arts Center",
        "AddressLine1": "360 Hamilton Street",
        "Town": "Rahway",
        "StateOrProvince": "NJ",
        "Postcode": "07065",
        "CountryID": 2,
        "Latitude": 40.6115606,
        "Longitude": -74.2798535,
        "DistanceUnit": 0
    },
    "Connections": [
        {
            "ID": 100974,
            "ConnectionTypeID": 32,
            "LevelID": 2,
            "Amps": 32,
            "Voltage": 240,
            "PowerKW": 7.2,
            "CurrentTypeID": 10,
            "Quantity": 2
        }
    ],
    "NumberOfPoints": 2,
    "GeneralComments": "Two EV Wall-Mounted Charging Stations (Level 2, 7.2kW Capacity) located in the parking lot behind Hamilton Stage (southwest corner of the building)",
    "StatusTypeID": 50,
    "DateLastStatusUpdate": "2016-08-01T07:37:00Z",
    "DataQualityLevel": 1,
    "DateCreated": "2016-07-25T02:45:00Z",
    "SubmissionStatusTypeID": 200
}