{
    "IsRecentlyVerified": false,
    "ID": 13779,
    "UUID": "55F3EE7A-ECD9-4B5F-A330-CAE66C04331E",
    "DataProviderID": 15,
    "DataProvidersReference": "20267",
    "OperatorID": 1,
    "AddressInfo": {
        "ID": 13676,
        "Title": "275 Rainer Ave S",
        "AddressLine1": "275 Rainer Ave S",
        "Town": "Renton",
        "StateOrProvince": "WA",
        "Postcode": "98056",
        "CountryID": 2,
        "Latitude": 47.480555,
        "Longitude": -122.217987,
        "ContactTelephone1": "425-277-0212",
        "RelatedURL": "http://carstations.com/20267",
        "DistanceUnit": 0
    },
    "Connections": [
        {
            "ID": 11226,
            "ConnectionTypeID": 1,
            "Reference": "J1772",
            "LevelID": 2
        }
    ],
    "StatusTypeID": 0,
    "DateLastStatusUpdate": "2017-11-04T14:05:00Z",
    "DataQualityLevel": 2,
    "DateCreated": "2012-12-06T11:08:00Z",
    "SubmissionStatusTypeID": 100
}