{
    "IsRecentlyVerified": false,
    "ID": 62859,
    "UUID": "B1D35126-1C57-49BB-87F9-0C2703495F04",
    "DataProviderID": 26,
    "DataProvidersReference": "73702",
    "OperatorID": 73,
    "OperatorsReference": "EV-Box EVB-P1418197",
    "UsageCost": "0.00 jaarabonnement",
    "AddressInfo": {
        "ID": 63205,
        "Title": "Gastelseweg 68",
        "AddressLine1": "Gastelseweg 68",
        "Town": "Cranendonck",
        "Postcode": "6021 GM",
        "CountryID": 159,
        "Latitude": 51.2793,
        "Longitude": 5.56672,
        "RelatedURL": "http://www.ev-box.nl",
        "DistanceUnit": 0
    },
    "Connections": [
        {
            "ID": 79846,
            "ConnectionTypeID": 25,
            "LevelID": 2,
            "PowerKW": 11,
            "CurrentTypeID": 10
        },
        {
            "ID": 79847,
            "ConnectionTypeID": 25,
            "LevelID": 2,
            "PowerKW": 11,
            "CurrentTypeID": 10
        }
    ],
    "NumberOfPoints": 1,
    "StatusTypeID": 50,
    "DateLastStatusUpdate": "2016-06-04T02:38:00Z",
    "DataQualityLevel": 3,
    "DateCreated": "2016-03-03T12:29:00Z",
    "SubmissionStatusTypeID": 100
}