{
    "IsRecentlyVerified": false,
    "ID": 167066,
    "UUID": "596E8928-B064-45B2-AE5C-D5C84D09B077",
    "DataProviderID": 18,
    "DataProvidersReference": "f6534fa336c9a3808af36dd3f81ef136",
    "OperatorID": 3345,
    "UsageTypeID": 5,
    "AddressInfo": {
        "ID": 167425,
        "Title": "CV2 5FT",
        "AddressLine1": "",
        "Town": "Coventry",
        "Postcode": "CV2 5FT",
        "CountryID": 1,
        "Latitude": 52.409586,
        "Longitude": -1.456048,
        "AccessComments": "",
        "RelatedURL": "https://char.gy",
        "DistanceUnit": 0
    },
    "Connections": [
        {
            "ID": 252976,
            "ConnectionTypeID": 25,
            "Reference": "00444",
            "StatusTypeID": 50,
            "LevelID": 2,
            "Amps": 16,
            "Voltage": 230,
            "PowerKW": 3.7,
            "CurrentTypeID": 10
        }
    ],
    "StatusTypeID": 0,
    "DateLastStatusUpdate": "2020-08-27T08:10:00Z",
    "MetadataValues": [
        {
            "ID": 7823,
            "MetadataFieldID": 4,
            "ItemValue": "Contains public sector information licensed under the Open Government Licence v2.0. http://www.nationalarchives.gov.uk/doc/open-government-licence/version/2/"
        }
    ],
    "DataQualityLevel": 3,
    "DateCreated": "2020-08-27T08:10:00Z",
    "SubmissionStatusTypeID": 100
}