{
    "IsRecentlyVerified": false,
    "ID": 42758,
    "UUID": "73073166-DB39-4598-A354-49A9FEB82DB5",
    "DataProviderID": 1,
    "OperatorID": 1,
    "UsageTypeID": 5,
    "UsageCost": "0,50€/kWh",
    "AddressInfo": {
        "ID": 43104,
        "Title": "Wohnmobil-Stellplatz am Parkstadion",
        "AddressLine1": "Am Parkstadion",
        "AddressLine2": "Altenbauna",
        "Town": "Baunatal",
        "StateOrProvince": "Landkreis Kassel",
        "Postcode": "34225",
        "CountryID": 87,
        "Latitude": 51.2576502829609,
        "Longitude": 9.39906568704623,
        "AccessComments": "Auf dem Gelände nach ganz hinten Richtung Reisemobilstation durchfahren und dann weiter auf den letzten Parkplatz , 4 rote Säulen sind auf dem Parkplatz verteilt. 50Cent Münzeinwurf.",
        "RelatedURL": "http://www.stadtmarketing-baunatal.de/baunatal/wohnmobilstellplatz-baunatal-und-weltkulturerbe-kassel.php",
        "DistanceUnit": 0
    },
    "Connections": [
        {
            "ID": 51602,
            "ConnectionTypeID": 28,
            "StatusTypeID": 50,
            "LevelID": 2,
            "Amps": 16,
            "Voltage": 230,
            "PowerKW": 3.7,
            "CurrentTypeID": 10,
            "Quantity": 16
        }
    ],
    "NumberOfPoints": 16,
    "StatusTypeID": 50,
    "DateLastStatusUpdate": "2015-03-23T12:22:00Z",
    "DataQualityLevel": 1,
    "DateCreated": "2015-03-23T11:49:00Z",
    "SubmissionStatusTypeID": 200
}