{
    "UserComments": [
        {
            "ID": 14705,
            "ChargePointID": 22637,
            "CommentTypeID": 1000,
            "UserName": "karlkb15",
            "Comment": "Does not work, glows blue from road side but as soon as you try to swipe it it goes red. ",
            "Rating": 1,
            "DateCreated": "2016-12-16T19:08:59.34Z",
            "User": {
                "ID": 6381,
                "Username": "karlkb15"
            },
            "CheckinStatusTypeID": 20
        },
        {
            "ID": 6783,
            "ChargePointID": 22637,
            "CommentTypeID": 50,
            "UserName": "Sandy Ritchie",
            "Comment": "Shows a time/date error (I've been informed by a local this happens when there is a power cut, They dont have a key to open unit to reset time and post installer won't supply a key). Regardless the unit approved my CYC card and I charged to 99% from 68%. Good handy chargers there's.",
            "Rating": 4,
            "DateCreated": "2015-10-14T21:54:12.76Z",
            "User": {
                "ID": 4778,
                "Username": "Sandy Ritchie"
            },
            "CheckinStatusTypeID": 10
        },
        {
            "ID": 6773,
            "ChargePointID": 22637,
            "CommentTypeID": 10,
            "UserName": "Sandy Ritchie",
            "Comment": "Post flashes orange/red, but it read my CYC card (never used post before) and went blue. Connected up to my Zoe and charged 1.\n5kwh in a test. I'll be dropping by again soon before my trip home from Leaplish holiday.",
            "Rating": 4,
            "DateCreated": "2015-10-13T20:29:49.093Z",
            "User": {
                "ID": 4778,
                "Username": "Sandy Ritchie"
            },
            "CheckinStatusTypeID": 10
        },
        {
            "ID": 6523,
            "ChargePointID": 22637,
            "CommentTypeID": 1000,
            "UserName": "karlkb15",
            "Comment": "This charger does not work, has not worked since kielder valley services parted company with charge your car last year. Flashes orange and red and needs date and time set. Woman in house opposite called Cathy is on the committee responsible for fixing it, but just fobs me off when I complain. ",
            "Rating": 1,
            "DateCreated": "2015-09-20T13:38:43.647Z",
            "User": {
                "ID": 6381,
                "Username": "karlkb15"
            },
            "CheckinStatusTypeID": 25
        },
        {
            "ID": 6361,
            "ChargePointID": 22637,
            "CommentTypeID": 10,
            "UserName": "Sandy Ritchie",
            "Comment": "Did you log a call to have it repaired.  I'm going to need this charger in October and it would be good to know if a repair is scheduled.",
            "DateCreated": "2015-08-31T10:59:04.603Z",
            "User": {
                "ID": 4778,
                "Username": "Sandy Ritchie"
            },
            "CheckinStatusTypeID": 0
        },
        {
            "ID": 905,
            "ChargePointID": 22637,
            "CommentTypeID": 50,
            "UserName": "PeterChowney",
            "Comment": "",
            "Rating": 1,
            "DateCreated": "2014-06-18T11:24:58.28Z",
            "User": {
                "ID": 1264,
                "Username": "PeterChowney"
            },
            "CheckinStatusTypeID": 20
        },
        {
            "ID": 818,
            "ChargePointID": 22637,
            "CommentTypeID": 10,
            "UserName": "keithlatty",
            "DateCreated": "2014-05-14T08:15:41.017Z",
            "User": {
                "ID": 1543,
                "Username": "keithlatty"
            },
            "CheckinStatusTypeID": 10
        }
    ],
    "MediaItems": [
        {
            "ID": 3412,
            "ChargePointID": 22637,
            "ItemURL": "https://s3-ap-southeast-2.amazonaws.com/openchargemap/images/GB/OCM22637/OCM-22637.orig.2015101421555457.jpg",
            "ItemThumbnailURL": "https://s3-ap-southeast-2.amazonaws.com/openchargemap/images/GB/OCM22637/OCM-22637.thmb.2015101421555457.jpg",
            "Comment": "",
            "IsEnabled": true,
            "IsVideo": false,
            "IsFeaturedItem": false,
            "IsExternalResource": false,
            "User": {
                "ID": 4778,
                "Username": "Sandy Ritchie"
            },
            "DateCreated": "2015-10-14T21:56:00Z"
        },
        {
            "ID": 3399,
            "ChargePointID": 22637,
            "ItemURL": "https://s3-ap-southeast-2.amazonaws.com/openchargemap/images/GB/OCM22637/OCM-22637.orig.2015101320315631.jpg",
            "ItemThumbnailURL": "https://s3-ap-southeast-2.amazonaws.com/openchargemap/images/GB/OCM22637/OCM-22637.thmb.2015101320315631.jpg",
            "Comment": "Post worked in a short test today.",
            "IsEnabled": true,
            "IsVideo": false,
            "IsFeaturedItem": false,
            "IsExternalResource": false,
            "User": {
                "ID": 4778,
                "Username": "Sandy Ritchie"
            },
            "DateCreated": "2015-10-13T20:32:00Z"
        }
    ],
    "IsRecentlyVerified": false,
    "ID": 22637,
    "UUID": "82F72B74-1896-4CD2-91E7-C71C1FC2F6B9",
    "DataProviderID": 1,
    "OperatorID": 20,
    "UsageTypeID": 4,
    "AddressInfo": {
        "ID": 22982,
        "Title": "Kielder Valley Services Limited",
        "AddressLine1": "Kielder Valley Services Limited",
        "AddressLine2": "Kielder",
        "Town": "Hexham",
        "Postcode": "NE48 1HX",
        "CountryID": 1,
        "Latitude": 55.234174,
        "Longitude": -2.588823,
        "RelatedURL": "http://www.chargeyourcar.org.uk",
        "DistanceUnit": 0
    },
    "Connections": [
        {
            "ID": 24318,
            "ConnectionTypeID": 25,
            "Reference": "0",
            "StatusTypeID": 50,
            "LevelID": 2,
            "Amps": 32,
            "Voltage": 230,
            "PowerKW": 7,
            "CurrentTypeID": 10
        }
    ],
    "StatusTypeID": 100,
    "DateLastStatusUpdate": "2017-06-09T09:03:00Z",
    "MetadataValues": [
        {
            "ID": 624,
            "MetadataFieldID": 4,
            "ItemValue": "Contains public sector information licensed under the Open Government Licence v2.0. http://www.nationalarchives.gov.uk/doc/open-government-licence/version/2/"
        }
    ],
    "DataQualityLevel": 3,
    "DateCreated": "2014-03-22T08:41:00Z",
    "SubmissionStatusTypeID": 100
}