{
    "IsRecentlyVerified": false,
    "ID": 129403,
    "UUID": "DA973C97-433F-4235-94DF-D2923C451EDD",
    "DataProviderID": 1,
    "OperatorID": 80,
    "UsageTypeID": 4,
    "AddressInfo": {
        "ID": 129749,
        "Title": "Santo Stefano Gerbino | EnelX",
        "AddressLine1": "Piazza Liborio Gerbino",
        "AddressLine2": "accesso da Via Umberto I",
        "Town": "Santo Stefano di Camastra",
        "StateOrProvince": "ME",
        "Postcode": "98077",
        "CountryID": 112,
        "Latitude": 38.0146663483523,
        "Longitude": 14.3520609643261,
        "RelatedURL": "https://www.enelx.com/it/it/emobility",
        "DistanceUnit": 0
    },
    "Connections": [
        {
            "ID": 181103,
            "ConnectionTypeID": 25,
            "StatusTypeID": 50,
            "LevelID": 2,
            "Amps": 32,
            "Voltage": 400,
            "PowerKW": 22,
            "CurrentTypeID": 20,
            "Quantity": 2
        }
    ],
    "NumberOfPoints": 2,
    "StatusTypeID": 50,
    "DateLastStatusUpdate": "2019-07-19T12:25:00Z",
    "DataQualityLevel": 1,
    "DateCreated": "2019-07-19T12:25:00Z",
    "SubmissionStatusTypeID": 200
}