{
    "IsRecentlyVerified": false,
    "ID": 14633,
    "UUID": "66ED45A2-A402-4769-A76F-F11C6554522F",
    "DataProviderID": 2,
    "DataProvidersReference": "49404",
    "UsageTypeID": 1,
    "AddressInfo": {
        "ID": 14530,
        "Title": "City Market - Onion River Co-Op",
        "AddressLine1": "82 S Winooski Ave",
        "Town": "Burlington",
        "StateOrProvince": "VT",
        "Postcode": "05401",
        "CountryID": 2,
        "Latitude": 44.478,
        "Longitude": -73.21038,
        "ContactTelephone1": "802-861-9700",
        "AccessComments": "7am-11pm daily; see customer service for assistance; maximum session time of 4 hours",
        "RelatedURL": "",
        "DistanceUnit": 0
    },
    "Connections": [
        {
            "ID": 16754,
            "ConnectionTypeID": 1,
            "LevelID": 2,
            "Amps": 16,
            "Voltage": 230,
            "PowerKW": 3.7,
            "CurrentTypeID": 10,
            "Quantity": 1
        },
        {
            "ID": 21912,
            "ConnectionTypeID": 1,
            "LevelID": 2,
            "Quantity": 1
        }
    ],
    "DateLastStatusUpdate": "2020-06-26T03:08:00Z",
    "DataQualityLevel": 3,
    "DateCreated": "2012-12-06T16:50:00Z",
    "SubmissionStatusTypeID": 100
}