{
    "IsRecentlyVerified": false,
    "ID": 178701,
    "UUID": "552BD916-087E-407B-86D5-5756EFA961F6",
    "DataProviderID": 29,
    "DataProvidersReference": "15133",
    "AddressInfo": {
        "ID": 179060,
        "Title": "Am Markt 19-23",
        "AddressLine1": "Am Markt 19-23",
        "Town": "Ellrich",
        "Postcode": "99755",
        "CountryID": 87,
        "Latitude": 51.586888,
        "Longitude": 10.664389,
        "DistanceUnit": 0
    },
    "Connections": [
        {
            "ID": 279462,
            "ConnectionTypeID": 25,
            "StatusTypeID": 50,
            "LevelID": 2,
            "PowerKW": 22,
            "CurrentTypeID": 20
        },
        {
            "ID": 279463,
            "ConnectionTypeID": 25,
            "StatusTypeID": 50,
            "LevelID": 2,
            "PowerKW": 22,
            "CurrentTypeID": 20
        }
    ],
    "StatusTypeID": 0,
    "DateLastStatusUpdate": "2021-07-12T02:48:00Z",
    "MetadataValues": [
        {
            "ID": 10995,
            "MetadataFieldID": 4,
            "ItemValue": "Data from the German chargepoint registry provided by Bundesnetzagentur.de under the CC-BY 4.0 license"
        }
    ],
    "DataQualityLevel": 3,
    "DateCreated": "2021-07-08T09:50:00Z",
    "SubmissionStatusTypeID": 100
}