{
    "IsRecentlyVerified": false,
    "ID": 126949,
    "UUID": "75FC4722-22F4-4808-B767-A1F4F31C2694",
    "DataProviderID": 1,
    "OperatorID": 3315,
    "OperatorsReference": "51856",
    "UsageTypeID": 4,
    "UsageCost": "Free",
    "AddressInfo": {
        "ID": 127295,
        "Title": "Skyeskyns",
        "AddressLine1": "MacLeods Terrace",
        "Town": "Hallin",
        "StateOrProvince": "Isle of Skye",
        "Postcode": "IV55 8GD",
        "CountryID": 1,
        "Latitude": 57.5191917195984,
        "Longitude": -6.57107991765588,
        "DistanceUnit": 0
    },
    "Connections": [
        {
            "ID": 177796,
            "ConnectionTypeID": 25,
            "StatusTypeID": 100,
            "LevelID": 2,
            "Amps": 32,
            "Voltage": 230,
            "PowerKW": 7,
            "CurrentTypeID": 10,
            "Quantity": 2
        }
    ],
    "NumberOfPoints": 2,
    "StatusTypeID": 100,
    "DateLastStatusUpdate": "2020-04-02T05:18:00Z",
    "DataQualityLevel": 1,
    "DateCreated": "2019-05-23T12:39:00Z",
    "SubmissionStatusTypeID": 200
}