{
    "IsRecentlyVerified": false,
    "ID": 56522,
    "UUID": "0EC9D7B3-90B8-4430-9231-1BE7645DB92F",
    "DataProviderID": 1,
    "OperatorID": 23,
    "OperatorsReference": "6709",
    "UsageTypeID": 1,
    "UsageCost": "Free",
    "AddressInfo": {
        "ID": 56868,
        "Title": "ZD Wines - Tesla",
        "AddressLine1": "8383 Silverado Trail",
        "Town": "Napa",
        "StateOrProvince": "CA",
        "Postcode": "94558",
        "CountryID": 2,
        "Latitude": 38.476281,
        "Longitude": -122.3892037,
        "ContactTelephone1": "800-487-7757  877-798-3752",
        "AccessComments": "24 hours daily; for Tesla use only; for guest use only; see front desk for access",
        "RelatedURL": "http://www.teslamotors.com/supercharger",
        "DistanceUnit": 0
    },
    "Connections": [
        {
            "ID": 71280,
            "ConnectionTypeID": 30,
            "StatusTypeID": 50,
            "LevelID": 2,
            "Amps": 16,
            "Voltage": 230,
            "PowerKW": 13,
            "CurrentTypeID": 10,
            "Quantity": 2
        }
    ],
    "NumberOfPoints": 2,
    "StatusTypeID": 50,
    "DateLastStatusUpdate": "2017-01-31T22:19:00Z",
    "DataQualityLevel": 3,
    "DateCreated": "2015-11-04T08:42:00Z",
    "SubmissionStatusTypeID": 100
}