{
    "IsRecentlyVerified": false,
    "ID": 125172,
    "UUID": "4D1F96FF-2834-4646-8319-2BF6118CE3B6",
    "DataProviderID": 1,
    "OperatorID": 23,
    "OperatorsReference": "49698",
    "UsageTypeID": 4,
    "AddressInfo": {
        "ID": 125518,
        "Title": "Sylvan Parking 837 Jersey Avenue",
        "AddressLine1": "837 Jersey Ave",
        "Town": "Jersey City",
        "StateOrProvince": "New Jersey",
        "Postcode": "07310",
        "CountryID": 2,
        "Latitude": 40.734819,
        "Longitude": -74.045186,
        "ContactTelephone1": "(201) 659-4111",
        "DistanceUnit": 0
    },
    "Connections": [
        {
            "ID": 175428,
            "ConnectionTypeID": 30,
            "StatusTypeID": 50,
            "LevelID": 2,
            "PowerKW": 10,
            "CurrentTypeID": 10,
            "Quantity": 4
        }
    ],
    "NumberOfPoints": 4,
    "GeneralComments": "4 Tesla Connectors, up to 10kW.Parking fees will apply. Please see valet.",
    "StatusTypeID": 50,
    "DateLastStatusUpdate": "2019-04-11T06:07:00Z",
    "DataQualityLevel": 1,
    "DateCreated": "2019-04-11T06:07:00Z",
    "SubmissionStatusTypeID": 200
}