{
    "IsRecentlyVerified": false,
    "ID": 29117,
    "UUID": "63DA83F4-F1BD-4C8B-961D-C0B51D2EA203",
    "DataProviderID": 2,
    "DataProvidersReference": "58299",
    "OperatorID": 5,
    "UsageTypeID": 1,
    "AddressInfo": {
        "ID": 29463,
        "Title": "PARKING LOT #4",
        "AddressLine1": "120 Washington St",
        "Town": "Hart",
        "StateOrProvince": "MI",
        "Postcode": "49420",
        "CountryID": 2,
        "Latitude": 43.7019647,
        "Longitude": -86.3646528,
        "ContactTelephone1": "888-758-4389",
        "AccessComments": "24 hours daily",
        "RelatedURL": "http://www.chargepoint.com/",
        "DistanceUnit": 0
    },
    "Connections": [
        {
            "ID": 31996,
            "ConnectionTypeID": 1,
            "LevelID": 2,
            "Amps": 16,
            "Voltage": 230,
            "PowerKW": 3.7,
            "CurrentTypeID": 10,
            "Quantity": 2
        }
    ],
    "DateLastStatusUpdate": "2020-06-26T03:07:00Z",
    "DataQualityLevel": 3,
    "DateCreated": "2014-11-28T03:39:00Z",
    "SubmissionStatusTypeID": 100
}