{
    "IsRecentlyVerified": false,
    "ID": 134773,
    "UUID": "48D4ABAB-CC6D-4313-9FE2-2F71824CA326",
    "DataProviderID": 1,
    "OperatorID": 80,
    "UsageTypeID": 4,
    "AddressInfo": {
        "ID": 135119,
        "Title": "Genova Ghiglione | EnelX",
        "AddressLine1": "Piazzale Attilio Ghiglione",
        "AddressLine2": "Via Vittorio Poggi",
        "Town": "Genova",
        "StateOrProvince": "GE",
        "Postcode": "16164",
        "CountryID": 112,
        "Latitude": 44.496171730678356,
        "Longitude": 8.902048547774484,
        "RelatedURL": "https://www.enelx.com/it/it/emobility",
        "DistanceUnit": 0
    },
    "Connections": [
        {
            "ID": 188574,
            "ConnectionTypeID": 25,
            "StatusTypeID": 50,
            "LevelID": 2,
            "Amps": 32,
            "Voltage": 400,
            "PowerKW": 22,
            "CurrentTypeID": 20,
            "Quantity": 1
        },
        {
            "ID": 188575,
            "ConnectionTypeID": 36,
            "StatusTypeID": 50,
            "LevelID": 2,
            "Amps": 16,
            "Voltage": 240,
            "PowerKW": 3.7,
            "CurrentTypeID": 10,
            "Quantity": 1
        }
    ],
    "NumberOfPoints": 2,
    "StatusTypeID": 50,
    "DateLastStatusUpdate": "2019-11-21T11:30:00Z",
    "DataQualityLevel": 1,
    "DateCreated": "2019-11-21T11:30:00Z",
    "SubmissionStatusTypeID": 200
}