{
    "IsRecentlyVerified": false,
    "ID": 60979,
    "UUID": "5DD57E95-BF82-43CD-99DB-B90C664805CC",
    "DataProviderID": 27,
    "DataProvidersReference": "67",
    "UsageTypeID": 1,
    "AddressInfo": {
        "ID": 61325,
        "Title": "Piscina San Roque",
        "AddressLine1": "Calle Eugenio García Estop, 54",
        "Town": "Badajoz",
        "StateOrProvince": "Badajoz",
        "Postcode": "06008",
        "CountryID": 210,
        "Latitude": 38.87781,
        "Longitude": -6.94924,
        "DistanceUnit": 0
    },
    "Connections": [
        {
            "ID": 77405,
            "ConnectionTypeID": 28
        },
        {
            "ID": 77406,
            "ConnectionTypeID": 25
        }
    ],
    "StatusTypeID": 0,
    "DateLastStatusUpdate": "2016-02-13T00:23:00Z",
    "DataQualityLevel": 3,
    "DateCreated": "2016-02-13T00:23:00Z",
    "SubmissionStatusTypeID": 200
}