{
    "IsRecentlyVerified": false,
    "ID": 66089,
    "UUID": "2036F2DF-BAC2-406D-A663-D497A07D73CB",
    "DataProviderID": 1,
    "OperatorID": 1240,
    "UsageTypeID": 1,
    "AddressInfo": {
        "ID": 66435,
        "Title": "E-Bike Station Cafe Anno Dazumal",
        "AddressLine1": "Oberstraße 14",
        "Town": "Dannenfels",
        "StateOrProvince": "Donnersbergkreis",
        "Postcode": "67814",
        "CountryID": 87,
        "Latitude": 49.6264352,
        "Longitude": 7.94325950000007,
        "RelatedURL": "https://www.pfalzwerke.de/energieberatung/9244.php",
        "DistanceUnit": 0
    },
    "Connections": [
        {
            "ID": 91379,
            "ConnectionTypeID": 28,
            "StatusTypeID": 50,
            "LevelID": 1,
            "Amps": 10,
            "Voltage": 230,
            "PowerKW": 2.3,
            "CurrentTypeID": 10,
            "Quantity": 4
        }
    ],
    "NumberOfPoints": 4,
    "StatusTypeID": 50,
    "DateLastStatusUpdate": "2016-05-12T06:03:00Z",
    "DataQualityLevel": 1,
    "DateCreated": "2016-05-11T14:57:00Z",
    "SubmissionStatusTypeID": 200
}