{
    "IsRecentlyVerified": false,
    "ID": 182479,
    "UUID": "C63B96E7-758B-47BD-B8AC-F3DBD916126D",
    "DataProviderID": 29,
    "DataProvidersReference": "16967",
    "OperatorID": 103,
    "AddressInfo": {
        "ID": 182838,
        "Title": "Großgörschenstr. Vor 1",
        "AddressLine1": "Großgörschenstr. Vor 1",
        "Town": "Berlin",
        "Postcode": "10827",
        "CountryID": 87,
        "Latitude": 52.491234,
        "Longitude": 13.361049,
        "DistanceUnit": 0
    },
    "Connections": [
        {
            "ID": 288278,
            "ConnectionTypeID": 25,
            "StatusTypeID": 50,
            "LevelID": 2,
            "PowerKW": 11,
            "CurrentTypeID": 20
        },
        {
            "ID": 288279,
            "ConnectionTypeID": 25,
            "StatusTypeID": 50,
            "LevelID": 2,
            "PowerKW": 11,
            "CurrentTypeID": 20
        }
    ],
    "StatusTypeID": 50,
    "DateLastStatusUpdate": "2021-07-12T02:49:00Z",
    "MetadataValues": [
        {
            "ID": 14772,
            "MetadataFieldID": 4,
            "ItemValue": "Data from the German chargepoint registry provided by Bundesnetzagentur.de under the CC-BY 4.0 license"
        }
    ],
    "DataQualityLevel": 3,
    "DateCreated": "2021-07-08T10:03:00Z",
    "SubmissionStatusTypeID": 100
}