{
    "UserComments": [
        {
            "ID": 23318,
            "ChargePointID": 126654,
            "CommentTypeID": 10,
            "UserName": "ForumElettrico.it",
            "Comment": "La presa davanti è rotta mentre quella dietro ancora funziona. Leggi la recensione completa qui > https://www.forumelettrico.it/forum/post142082.html#p142082",
            "RelatedURL": "https://www.forumelettrico.it/forum/post142082.html#p142082",
            "DateCreated": "2020-10-03T09:41:54.683Z",
            "User": {
                "ID": 11749,
                "Username": "ForumElettrico.it"
            },
            "CheckinStatusTypeID": 10,
            "IsActionedByEditor": false
        },
        {
            "ID": 21924,
            "ChargePointID": 126654,
            "CommentTypeID": 10,
            "UserName": "ForumElettrico.it",
            "RelatedURL": "https://www.forumelettrico.it/forum/colonnina-axpo-22-kw-x-service-cavezzo-mo-via-eugenio-curiel-4-t8388.html",
            "DateCreated": "2019-12-21T10:43:46.883Z",
            "User": {
                "ID": 11749,
                "Username": "ForumElettrico.it"
            },
            "CheckinStatusTypeID": 10,
            "IsActionedByEditor": false
        }
    ],
    "MediaItems": [
        {
            "ID": 24888,
            "ChargePointID": 126654,
            "ItemURL": "https://s3-ap-southeast-2.amazonaws.com/openchargemap/images/IT/OCM126654/OCM-126654.orig.2020100309420446.jpg",
            "ItemThumbnailURL": "https://s3-ap-southeast-2.amazonaws.com/openchargemap/images/IT/OCM126654/OCM-126654.thmb.2020100309420446.jpg",
            "Comment": "",
            "IsEnabled": true,
            "IsVideo": false,
            "IsFeaturedItem": false,
            "IsExternalResource": false,
            "User": {
                "ID": 11749,
                "Username": "ForumElettrico.it"
            },
            "DateCreated": "2020-10-03T09:42:00Z"
        },
        {
            "ID": 24889,
            "ChargePointID": 126654,
            "ItemURL": "https://s3-ap-southeast-2.amazonaws.com/openchargemap/images/IT/OCM126654/OCM-126654.orig.2020100309421033.jpg",
            "ItemThumbnailURL": "https://s3-ap-southeast-2.amazonaws.com/openchargemap/images/IT/OCM126654/OCM-126654.thmb.2020100309421033.jpg",
            "Comment": "",
            "IsEnabled": true,
            "IsVideo": false,
            "IsFeaturedItem": false,
            "IsExternalResource": false,
            "User": {
                "ID": 11749,
                "Username": "ForumElettrico.it"
            },
            "DateCreated": "2020-10-03T09:42:00Z"
        },
        {
            "ID": 20658,
            "ChargePointID": 126654,
            "ItemURL": "https://s3-ap-southeast-2.amazonaws.com/openchargemap/images/IT/OCM126654/OCM-126654.orig.2019122110435785.jpg",
            "ItemThumbnailURL": "https://s3-ap-southeast-2.amazonaws.com/openchargemap/images/IT/OCM126654/OCM-126654.thmb.2019122110435785.jpg",
            "Comment": "",
            "IsEnabled": true,
            "IsVideo": false,
            "IsFeaturedItem": false,
            "IsExternalResource": false,
            "User": {
                "ID": 11749,
                "Username": "ForumElettrico.it"
            },
            "DateCreated": "2019-12-21T10:44:00Z"
        },
        {
            "ID": 20659,
            "ChargePointID": 126654,
            "ItemURL": "https://s3-ap-southeast-2.amazonaws.com/openchargemap/images/IT/OCM126654/OCM-126654.orig.2019122110440437.jpg",
            "ItemThumbnailURL": "https://s3-ap-southeast-2.amazonaws.com/openchargemap/images/IT/OCM126654/OCM-126654.thmb.2019122110440437.jpg",
            "Comment": "",
            "IsEnabled": true,
            "IsVideo": false,
            "IsFeaturedItem": false,
            "IsExternalResource": false,
            "User": {
                "ID": 11749,
                "Username": "ForumElettrico.it"
            },
            "DateCreated": "2019-12-21T10:44:00Z"
        },
        {
            "ID": 20660,
            "ChargePointID": 126654,
            "ItemURL": "https://s3-ap-southeast-2.amazonaws.com/openchargemap/images/IT/OCM126654/OCM-126654.orig.2019122110441125.jpg",
            "ItemThumbnailURL": "https://s3-ap-southeast-2.amazonaws.com/openchargemap/images/IT/OCM126654/OCM-126654.thmb.2019122110441125.jpg",
            "Comment": "",
            "IsEnabled": true,
            "IsVideo": false,
            "IsFeaturedItem": false,
            "IsExternalResource": false,
            "User": {
                "ID": 11749,
                "Username": "ForumElettrico.it"
            },
            "DateCreated": "2019-12-21T10:44:00Z"
        },
        {
            "ID": 20661,
            "ChargePointID": 126654,
            "ItemURL": "https://s3-ap-southeast-2.amazonaws.com/openchargemap/images/IT/OCM126654/OCM-126654.orig.2019122110441840.jpg",
            "ItemThumbnailURL": "https://s3-ap-southeast-2.amazonaws.com/openchargemap/images/IT/OCM126654/OCM-126654.thmb.2019122110441840.jpg",
            "Comment": "",
            "IsEnabled": true,
            "IsVideo": false,
            "IsFeaturedItem": false,
            "IsExternalResource": false,
            "User": {
                "ID": 11749,
                "Username": "ForumElettrico.it"
            },
            "DateCreated": "2019-12-21T10:44:00Z"
        },
        {
            "ID": 20662,
            "ChargePointID": 126654,
            "ItemURL": "https://s3-ap-southeast-2.amazonaws.com/openchargemap/images/IT/OCM126654/OCM-126654.orig.2019122110442448.jpg",
            "ItemThumbnailURL": "https://s3-ap-southeast-2.amazonaws.com/openchargemap/images/IT/OCM126654/OCM-126654.thmb.2019122110442448.jpg",
            "Comment": "",
            "IsEnabled": true,
            "IsVideo": false,
            "IsFeaturedItem": false,
            "IsExternalResource": false,
            "User": {
                "ID": 11749,
                "Username": "ForumElettrico.it"
            },
            "DateCreated": "2019-12-21T10:44:00Z"
        }
    ],
    "IsRecentlyVerified": false,
    "ID": 126654,
    "UUID": "93867D35-3F13-4C07-8BCA-88FEF13BE6DA",
    "DataProviderID": 1,
    "UsageTypeID": 4,
    "UsageCost": "0.45 eur/kWh",
    "AddressInfo": {
        "ID": 127000,
        "Title": "Axpo - XService",
        "AddressLine1": "Via Curiel 3",
        "Town": "Cavezzo",
        "StateOrProvince": "Modena",
        "Postcode": "41032",
        "CountryID": 112,
        "Latitude": 44.8380159,
        "Longitude": 11.0293427,
        "ContactEmail": "xservice@xservice.it",
        "RelatedURL": "https://www.xservice.it/home/",
        "DistanceUnit": 0
    },
    "Connections": [
        {
            "ID": 177395,
            "ConnectionTypeID": 25,
            "StatusTypeID": 50,
            "LevelID": 2,
            "Amps": 32,
            "Voltage": 400,
            "PowerKW": 22,
            "CurrentTypeID": 20,
            "Quantity": 2
        }
    ],
    "NumberOfPoints": 2,
    "GeneralComments": "Ricarica tramite APP certificate su Hubject o RFID di XService",
    "StatusTypeID": 50,
    "DateLastStatusUpdate": "2020-10-03T09:42:00Z",
    "DataQualityLevel": 1,
    "DateCreated": "2019-05-16T07:02:00Z",
    "SubmissionStatusTypeID": 200
}