{
    "IsRecentlyVerified": false,
    "ID": 138245,
    "UUID": "2BC15AA7-02C1-474B-80E4-E9FE2811DDB0",
    "DataProviderID": 2,
    "DataProvidersReference": "113939",
    "OperatorID": 23,
    "UsageTypeID": 1,
    "AddressInfo": {
        "ID": 138594,
        "Title": "Streamsong Resort Golf & Spa - Tesla Destination",
        "AddressLine1": "1000 Streamsong Dr",
        "Town": "Streamsong",
        "StateOrProvince": "FL",
        "Postcode": "33834",
        "CountryID": 2,
        "Latitude": 27.693302,
        "Longitude": -81.936386,
        "ContactTelephone1": "863-428-1000  877-798-3752",
        "AccessComments": "24 hours daily; for customer use only; see valet for access",
        "RelatedURL": "https://www.tesla.com/destination-charging",
        "DistanceUnit": 0
    },
    "Connections": [
        {
            "ID": 193319,
            "ConnectionTypeID": 30,
            "LevelID": 2,
            "Amps": 16,
            "Voltage": 230,
            "PowerKW": 3.7,
            "CurrentTypeID": 10,
            "Quantity": 2
        }
    ],
    "StatusTypeID": 50,
    "DateLastStatusUpdate": "2020-06-26T02:52:00Z",
    "DataQualityLevel": 3,
    "DateCreated": "2019-12-24T09:08:00Z",
    "SubmissionStatusTypeID": 100
}