{
    "IsRecentlyVerified": false,
    "ID": 42025,
    "UUID": "DDC4F6A2-3CD5-4C90-85C1-72485E63723A",
    "DataProviderID": 2,
    "DataProvidersReference": "65652",
    "OperatorID": 5,
    "UsageTypeID": 1,
    "AddressInfo": {
        "ID": 42371,
        "Title": "FREEDOM SQUARE",
        "AddressLine1": "35 5th Ave",
        "Town": "Troy",
        "StateOrProvince": "NY",
        "Postcode": "12180",
        "CountryID": 2,
        "Latitude": 42.7540047,
        "Longitude": -73.6817323,
        "ContactTelephone1": "888-758-4389",
        "AccessComments": "24 hours daily",
        "RelatedURL": "http://www.chargepoint.com/",
        "DistanceUnit": 0
    },
    "Connections": [
        {
            "ID": 50403,
            "ConnectionTypeID": 1,
            "LevelID": 2,
            "Amps": 16,
            "Voltage": 230,
            "PowerKW": 3,
            "CurrentTypeID": 10,
            "Quantity": 2
        }
    ],
    "DateLastStatusUpdate": "2019-12-24T09:20:00Z",
    "DataQualityLevel": 3,
    "DateCreated": "2015-02-23T02:10:00Z",
    "SubmissionStatusTypeID": 100
}