{
    "IsRecentlyVerified": false,
    "ID": 104155,
    "UUID": "469000B2-43F3-45BD-A0E9-6DF1FC11DEE0",
    "DataProviderID": 1,
    "OperatorID": 45,
    "UsageTypeID": 1,
    "AddressInfo": {
        "ID": 104501,
        "Title": "Parkhaus Garhammer",
        "AddressLine1": "Marktplatz 28",
        "Town": "Waldkirchen",
        "StateOrProvince": "Landkreis Freyung-Grafenau",
        "Postcode": "94065",
        "CountryID": 87,
        "Latitude": 48.72953,
        "Longitude": 13.600969999999961,
        "AccessComments": "Die Ladestation befindet sich gleich nach der Einfahrt ins Parkhaus Garhammer. Zur Freischaltung einfach ins Kaufhaus rübergehen und sich an der Kasse melden. Geöffnet zu den Öffnungszeiten, mindestens 9-18Uhr.",
        "RelatedURL": "https://www.garhammer.de/",
        "DistanceUnit": 0
    },
    "Connections": [
        {
            "ID": 147086,
            "ConnectionTypeID": 25,
            "StatusTypeID": 50,
            "LevelID": 2,
            "Amps": 32,
            "Voltage": 400,
            "PowerKW": 22,
            "CurrentTypeID": 20,
            "Quantity": 2
        }
    ],
    "NumberOfPoints": 2,
    "StatusTypeID": 50,
    "DateLastStatusUpdate": "2018-05-16T13:25:00Z",
    "DataQualityLevel": 1,
    "DateCreated": "2018-05-16T13:25:00Z",
    "SubmissionStatusTypeID": 200
}