{
    "IsRecentlyVerified": false,
    "ID": 18812,
    "UUID": "597AC297-F81A-429C-BFF3-1300899AF2D6",
    "DataProviderID": 15,
    "DataProvidersReference": "30516",
    "OperatorID": 1,
    "UsageTypeID": 1,
    "AddressInfo": {
        "ID": 19157,
        "Title": "????????????",
        "AddressLine1": "????????????",
        "Town": "??",
        "StateOrProvince": "",
        "Postcode": "518116",
        "CountryID": 50,
        "Latitude": 22.683004,
        "Longitude": 114.263434,
        "ContactTelephone1": "",
        "RelatedURL": "http://carstations.com/30516",
        "DistanceUnit": 0
    },
    "Connections": [
        {
            "ID": 19045,
            "ConnectionTypeID": 1,
            "Reference": "J1772",
            "LevelID": 2,
            "Quantity": 1
        }
    ],
    "NumberOfPoints": 1,
    "StatusTypeID": 0,
    "DateLastStatusUpdate": "2014-03-22T04:39:00Z",
    "DataQualityLevel": 2,
    "DateCreated": "2013-08-25T03:32:00Z",
    "SubmissionStatusTypeID": 200
}