{
    "IsRecentlyVerified": false,
    "ID": 87264,
    "UUID": "2F45DA93-FB8F-435E-BFCD-3C2747108860",
    "DataProviderID": 1,
    "OperatorID": 23,
    "OperatorsReference": "29217",
    "UsageTypeID": 6,
    "AddressInfo": {
        "ID": 87610,
        "Title": "Volsdalen Camping",
        "AddressLine1": "1 Sjömannsvegen",
        "Town": "Ålesund",
        "Postcode": "6008",
        "CountryID": 168,
        "Latitude": 62.469574,
        "Longitude": 6.198118,
        "ContactTelephone1": "+47 70 12 58 90",
        "DistanceUnit": 0
    },
    "Connections": [
        {
            "ID": 123700,
            "ConnectionTypeID": 30,
            "StatusTypeID": 50,
            "LevelID": 2,
            "Amps": 32,
            "Voltage": 400,
            "PowerKW": 22,
            "CurrentTypeID": 20,
            "Quantity": 2
        }
    ],
    "NumberOfPoints": 2,
    "GeneralComments": "2 Tesla Connectors, up to 22kW.Available for patrons only. Please see front desk.",
    "StatusTypeID": 50,
    "DateLastStatusUpdate": "2020-08-24T09:11:00Z",
    "DataQualityLevel": 1,
    "DateCreated": "2017-05-03T05:28:00Z",
    "SubmissionStatusTypeID": 200
}