{
    "UserComments": [
        {
            "ID": 24206,
            "ChargePointID": 103219,
            "CommentTypeID": 10,
            "UserName": "ForumElettrico.it",
            "Comment": "2 Pole Station Enel X imboscate infondo al piano -2. Leggi la recensione completa qui >  https://www.forumelettrico.it/forum/colonnine-enel-x-22-kw-esselunga-moncalieri-via-sestriere-13-1-t11055.html",
            "RelatedURL": "https://www.forumelettrico.it/forum/colonnine-enel-x-22-kw-esselunga-moncalieri-via-sestriere-13-1-t11055.html",
            "DateCreated": "2021-04-18T14:25:43.527Z",
            "User": {
                "ID": 11749,
                "Username": "ForumElettrico.it"
            },
            "CheckinStatusTypeID": 10,
            "IsActionedByEditor": false
        }
    ],
    "MediaItems": [
        {
            "ID": 27316,
            "ChargePointID": 103219,
            "ItemURL": "https://s3-ap-southeast-2.amazonaws.com/openchargemap/images/IT/OCM103219/OCM-103219.orig.2021041814255306.jpg",
            "ItemThumbnailURL": "https://s3-ap-southeast-2.amazonaws.com/openchargemap/images/IT/OCM103219/OCM-103219.thmb.2021041814255306.jpg",
            "Comment": "",
            "IsEnabled": true,
            "IsVideo": false,
            "IsFeaturedItem": false,
            "IsExternalResource": false,
            "User": {
                "ID": 11749,
                "Username": "ForumElettrico.it"
            },
            "DateCreated": "2021-04-18T14:26:00Z"
        },
        {
            "ID": 27317,
            "ChargePointID": 103219,
            "ItemURL": "https://s3-ap-southeast-2.amazonaws.com/openchargemap/images/IT/OCM103219/OCM-103219.orig.2021041814260003.jpg",
            "ItemThumbnailURL": "https://s3-ap-southeast-2.amazonaws.com/openchargemap/images/IT/OCM103219/OCM-103219.thmb.2021041814260003.jpg",
            "Comment": "",
            "IsEnabled": true,
            "IsVideo": false,
            "IsFeaturedItem": false,
            "IsExternalResource": false,
            "User": {
                "ID": 11749,
                "Username": "ForumElettrico.it"
            },
            "DateCreated": "2021-04-18T14:26:00Z"
        },
        {
            "ID": 27318,
            "ChargePointID": 103219,
            "ItemURL": "https://s3-ap-southeast-2.amazonaws.com/openchargemap/images/IT/OCM103219/OCM-103219.orig.2021041814260647.jpg",
            "ItemThumbnailURL": "https://s3-ap-southeast-2.amazonaws.com/openchargemap/images/IT/OCM103219/OCM-103219.thmb.2021041814260647.jpg",
            "Comment": "",
            "IsEnabled": true,
            "IsVideo": false,
            "IsFeaturedItem": false,
            "IsExternalResource": false,
            "User": {
                "ID": 11749,
                "Username": "ForumElettrico.it"
            },
            "DateCreated": "2021-04-18T14:26:00Z"
        }
    ],
    "IsRecentlyVerified": false,
    "ID": 103219,
    "UUID": "643851BC-ACC6-461B-BEE2-8009FAE32A74",
    "DataProviderID": 1,
    "OperatorID": 80,
    "UsageTypeID": 4,
    "AddressInfo": {
        "ID": 103565,
        "Title": "Eneldrive Esselunga di Moncalieri",
        "AddressLine1": "Via Sestriere, 13/1",
        "Town": "Moncalieri ",
        "StateOrProvince": "TO",
        "Postcode": "10024 ",
        "CountryID": 112,
        "Latitude": 45.0095692743781,
        "Longitude": 7.65763034018846,
        "RelatedURL": "https://www.esselunga.it",
        "DistanceUnit": 0
    },
    "Connections": [
        {
            "ID": 145833,
            "ConnectionTypeID": 25,
            "StatusTypeID": 50,
            "LevelID": 2,
            "Amps": 32,
            "Voltage": 400,
            "PowerKW": 22,
            "CurrentTypeID": 20,
            "Quantity": 2
        },
        {
            "ID": 145834,
            "ConnectionTypeID": 36,
            "StatusTypeID": 50,
            "LevelID": 2,
            "Amps": 16,
            "Voltage": 240,
            "PowerKW": 3.7,
            "CurrentTypeID": 10,
            "Quantity": 2
        }
    ],
    "NumberOfPoints": 4,
    "GeneralComments": "Posizione esatta da confermare",
    "StatusTypeID": 50,
    "DateLastStatusUpdate": "2021-04-18T14:26:00Z",
    "DataQualityLevel": 1,
    "DateCreated": "2018-04-24T13:54:00Z",
    "SubmissionStatusTypeID": 200
}