{
    "IsRecentlyVerified": false,
    "ID": 103446,
    "UUID": "EF758FE8-E4B5-4F8D-B6C5-C739F1112FD3",
    "DataProviderID": 1,
    "OperatorID": 23,
    "OperatorsReference": "42558",
    "UsageTypeID": 4,
    "AddressInfo": {
        "ID": 103792,
        "Title": "Cityplace",
        "AddressLine1": "700 S Rosemary Ave",
        "Town": "West Palm Beach",
        "StateOrProvince": "Florida",
        "Postcode": "33401",
        "CountryID": 2,
        "Latitude": 26.707605,
        "Longitude": -80.05679,
        "ContactTelephone1": "(561) 366-1000",
        "DistanceUnit": 0
    },
    "Connections": [
        {
            "ID": 146110,
            "ConnectionTypeID": 30,
            "StatusTypeID": 50,
            "LevelID": 2,
            "PowerKW": 16,
            "CurrentTypeID": 20,
            "Quantity": 6
        }
    ],
    "NumberOfPoints": 6,
    "GeneralComments": "6 Tesla Connectors, up to 16kW.Available to the public. Self park.",
    "StatusTypeID": 50,
    "DateLastStatusUpdate": "2018-05-03T06:07:00Z",
    "DataQualityLevel": 1,
    "DateCreated": "2018-05-03T06:07:00Z",
    "SubmissionStatusTypeID": 200
}