{
    "IsRecentlyVerified": false,
    "ID": 113313,
    "UUID": "11DBFA3B-F5E1-42CE-B251-D5769DBE3070",
    "DataProviderID": 1,
    "UsageTypeID": 4,
    "UsageCost": "£0.25/kWh",
    "AddressInfo": {
        "ID": 113659,
        "Title": "16 Gleneagle Road",
        "AddressLine1": "Gleneagle Road",
        "Town": "London",
        "Postcode": "SW16 6AB",
        "CountryID": 1,
        "Latitude": 51.426938,
        "Longitude": -0.131952,
        "DistanceUnit": 0
    },
    "Connections": [
        {
            "ID": 159543,
            "ConnectionTypeID": 2,
            "StatusTypeID": 50,
            "LevelID": 3,
            "PowerKW": 50,
            "CurrentTypeID": 30,
            "Quantity": 1
        },
        {
            "ID": 159544,
            "ConnectionTypeID": 33,
            "StatusTypeID": 50,
            "LevelID": 3,
            "PowerKW": 50,
            "CurrentTypeID": 30,
            "Quantity": 1
        },
        {
            "ID": 159545,
            "ConnectionTypeID": 1036,
            "StatusTypeID": 50,
            "LevelID": 3,
            "PowerKW": 43,
            "CurrentTypeID": 20,
            "Quantity": 1
        }
    ],
    "NumberOfPoints": 1,
    "GeneralComments": "ESB charger.",
    "StatusTypeID": 50,
    "DateLastStatusUpdate": "2018-11-30T17:46:00Z",
    "DataQualityLevel": 1,
    "DateCreated": "2018-11-30T17:45:00Z",
    "SubmissionStatusTypeID": 200
}