{
    "IsRecentlyVerified": false,
    "ID": 183429,
    "UUID": "DC46341B-B7DD-49F2-8CC7-08065A9A92A9",
    "DataProviderID": 29,
    "DataProvidersReference": "1675",
    "OperatorID": 44,
    "AddressInfo": {
        "ID": 183788,
        "Title": "Karl-Marx-Str. 129",
        "AddressLine1": "Karl-Marx-Str. 129",
        "Town": "Calau",
        "Postcode": "03205",
        "CountryID": 87,
        "Latitude": 51.744891,
        "Longitude": 13.958071,
        "DistanceUnit": 0
    },
    "Connections": [
        {
            "ID": 290405,
            "ConnectionTypeID": 17,
            "StatusTypeID": 50,
            "LevelID": 2,
            "PowerKW": 22,
            "CurrentTypeID": 20
        },
        {
            "ID": 290406,
            "ConnectionTypeID": 17,
            "StatusTypeID": 50,
            "LevelID": 2,
            "PowerKW": 22,
            "CurrentTypeID": 20
        }
    ],
    "StatusTypeID": 50,
    "DateLastStatusUpdate": "2021-07-09T03:24:00Z",
    "MetadataValues": [
        {
            "ID": 15722,
            "MetadataFieldID": 4,
            "ItemValue": "Data from the German chargepoint registry provided by Bundesnetzagentur.de under the CC-BY 4.0 license"
        }
    ],
    "DataQualityLevel": 3,
    "DateCreated": "2021-07-08T10:04:00Z",
    "SubmissionStatusTypeID": 100
}