{
    "IsRecentlyVerified": false,
    "ID": 187918,
    "UUID": "21212D90-7F56-4372-96EA-0E23545E2168",
    "DataProviderID": 18,
    "DataProvidersReference": "c2f36d2c5b0275f02b88264fe029e9ca",
    "OperatorID": 3345,
    "UsageTypeID": 5,
    "AddressInfo": {
        "ID": 188277,
        "Title": "CV5 8GF",
        "AddressLine1": "",
        "Town": "Coventry",
        "Postcode": "CV5 8GF",
        "CountryID": 1,
        "Latitude": 52.414662,
        "Longitude": -1.550259,
        "AccessComments": "",
        "RelatedURL": "https://char.gy",
        "DistanceUnit": 0
    },
    "Connections": [
        {
            "ID": 303247,
            "ConnectionTypeID": 25,
            "Reference": "656",
            "StatusTypeID": 50,
            "LevelID": 2,
            "Amps": 16,
            "Voltage": 230,
            "PowerKW": 3.7,
            "CurrentTypeID": 10
        }
    ],
    "StatusTypeID": 0,
    "DateLastStatusUpdate": "2021-07-12T03:39:00Z",
    "MetadataValues": [
        {
            "ID": 20158,
            "MetadataFieldID": 4,
            "ItemValue": "Contains public sector information licensed under the Open Government Licence v2.0. http://www.nationalarchives.gov.uk/doc/open-government-licence/version/2/"
        }
    ],
    "DataQualityLevel": 3,
    "DateCreated": "2021-07-12T03:39:00Z",
    "SubmissionStatusTypeID": 100
}