{
    "IsRecentlyVerified": false,
    "ID": 22950,
    "UUID": "115F64BC-D57D-44AF-9096-B9BC9A915155",
    "DataProviderID": 1,
    "OperatorID": 1,
    "UsageTypeID": 0,
    "AddressInfo": {
        "ID": 23295,
        "Title": "PWC",
        "AddressLine1": "Route d'Esch 400",
        "AddressLine2": "Gasperich",
        "Town": "Luxemburg",
        "StateOrProvince": "Luxembourg",
        "Postcode": "L-2530",
        "CountryID": 132,
        "Latitude": 49.5827074772722,
        "Longitude": 6.11450364760743,
        "ContactTelephone1": " [352] 49 48 48 1",
        "RelatedURL": "http://www.pwc.com/gx/en/office-locations/luxembourg.jhtml",
        "DistanceUnit": 0
    },
    "Connections": [
        {
            "ID": 24635,
            "ConnectionTypeID": 2,
            "LevelID": 3,
            "CurrentTypeID": 30,
            "Quantity": 1
        }
    ],
    "NumberOfPoints": 1,
    "StatusTypeID": 50,
    "DateLastStatusUpdate": "2014-03-23T12:50:00Z",
    "DataQualityLevel": 1,
    "DateCreated": "2014-03-23T12:49:00Z",
    "SubmissionStatusTypeID": 200
}