{
    "IsRecentlyVerified": false,
    "ID": 67299,
    "UUID": "73EF9785-DA48-41EE-8E2C-BBDA75D1E791",
    "DataProviderID": 2,
    "DataProvidersReference": "75597",
    "OperatorID": 5,
    "UsageTypeID": 1,
    "AddressInfo": {
        "ID": 67645,
        "Title": "FASTPARK",
        "AddressLine1": "8550 Stansted Dr",
        "Town": "Indianapolis",
        "StateOrProvince": "IN",
        "Postcode": "46241",
        "CountryID": 2,
        "Latitude": 39.675328,
        "Longitude": -86.31444,
        "ContactTelephone1": "888-758-4389",
        "AccessComments": "24 hours daily",
        "RelatedURL": "http://www.chargepoint.com/",
        "DistanceUnit": 0
    },
    "Connections": [
        {
            "ID": 92801,
            "ConnectionTypeID": 1,
            "LevelID": 2,
            "Amps": 16,
            "Voltage": 230,
            "PowerKW": 3.7,
            "CurrentTypeID": 10,
            "Quantity": 8
        }
    ],
    "DateLastStatusUpdate": "2020-06-26T03:02:00Z",
    "DataQualityLevel": 3,
    "DateCreated": "2016-05-29T02:05:00Z",
    "SubmissionStatusTypeID": 100
}