{
    "IsRecentlyVerified": false,
    "ID": 144398,
    "UUID": "05830FE8-556C-49F9-BFBA-4C5AAE9CE257",
    "DataProviderID": 2,
    "DataProvidersReference": "96065",
    "OperatorID": 9,
    "UsageTypeID": 1,
    "AddressInfo": {
        "ID": 144750,
        "Title": "Suntek Business Center - NPM",
        "AddressLine1": "9450 SW Barnes Rd",
        "Town": "Portland",
        "StateOrProvince": "OR",
        "Postcode": "97086",
        "CountryID": 2,
        "Latitude": 45.508692,
        "Longitude": -122.774947,
        "ContactTelephone1": "888-998-2546",
        "AccessComments": "MON: 24 hours | TUE: 24 hours | WED: 24 hours | THU: 24 hours | FRI: 24 hours | SAT: 24 hours | SUN: 24 hours",
        "RelatedURL": "http://www.blinkcharging.com/",
        "DistanceUnit": 0
    },
    "Connections": [
        {
            "ID": 200901,
            "ConnectionTypeID": 1,
            "LevelID": 2,
            "Amps": 16,
            "Voltage": 230,
            "PowerKW": 3.7,
            "CurrentTypeID": 10,
            "Quantity": 4
        }
    ],
    "StatusTypeID": 50,
    "DateLastStatusUpdate": "2020-06-26T03:09:00Z",
    "DataQualityLevel": 3,
    "DateCreated": "2019-12-24T09:23:00Z",
    "SubmissionStatusTypeID": 100
}