{
    "IsRecentlyVerified": false,
    "ID": 11820,
    "UUID": "BE96CCC3-5303-46D3-BE95-D680768E612B",
    "DataProviderID": 15,
    "DataProvidersReference": "20854",
    "OperatorID": 94,
    "UsageTypeID": 1,
    "AddressInfo": {
        "ID": 11717,
        "Title": "East Wooster and Alumni Drive",
        "AddressLine1": "East Wooster and Alumni Drive",
        "Town": "Bowling Green",
        "StateOrProvince": "Ohio",
        "Postcode": "43403",
        "CountryID": 2,
        "Latitude": 41.375356,
        "Longitude": -83.623162,
        "ContactTelephone1": "4193727602",
        "RelatedURL": "http://carstations.com/20854",
        "DistanceUnit": 0
    },
    "Connections": [
        {
            "ID": 9226,
            "ConnectionTypeID": 1,
            "Reference": "J1772",
            "LevelID": 2
        }
    ],
    "NumberOfPoints": 1,
    "StatusTypeID": 50,
    "DateLastStatusUpdate": "2017-11-04T14:04:00Z",
    "DataQualityLevel": 2,
    "DateCreated": "2012-07-21T04:32:00Z",
    "SubmissionStatusTypeID": 100
}