{
    "IsRecentlyVerified": false,
    "ID": 42302,
    "UUID": "4E05C4D2-19D4-4BFE-A93B-C2A5C25FF911",
    "DataProviderID": 2,
    "DataProvidersReference": "65940",
    "OperatorID": 5,
    "UsageTypeID": 1,
    "AddressInfo": {
        "ID": 42648,
        "Title": "TERMINUS",
        "AddressLine1": "3280 Peachtree Road",
        "Town": "Atlanta",
        "StateOrProvince": "GA",
        "Postcode": "30305",
        "CountryID": 2,
        "Latitude": 33.8451438,
        "Longitude": -84.3716642,
        "ContactTelephone1": "888-758-4389",
        "AccessComments": "24 hours daily",
        "RelatedURL": "http://www.chargepoint.com/",
        "DistanceUnit": 0
    },
    "Connections": [
        {
            "ID": 50873,
            "ConnectionTypeID": 1,
            "LevelID": 2,
            "Amps": 16,
            "Voltage": 230,
            "PowerKW": 3,
            "CurrentTypeID": 10,
            "Quantity": 2
        }
    ],
    "DateLastStatusUpdate": "2019-12-24T09:10:00Z",
    "DataQualityLevel": 3,
    "DateCreated": "2015-03-06T06:27:00Z",
    "SubmissionStatusTypeID": 100
}