{
    "IsRecentlyVerified": false,
    "ID": 103698,
    "UUID": "17977CA5-B751-445A-B496-5874E69462A7",
    "DataProviderID": 1,
    "OperatorID": 23,
    "OperatorsReference": "42453",
    "UsageTypeID": 4,
    "AddressInfo": {
        "ID": 104044,
        "Title": "The Nook",
        "AddressLine1": "Saunders Way",
        "Town": "Cullompton",
        "Postcode": "EX151B",
        "CountryID": 1,
        "Latitude": 50.86183,
        "Longitude": -3.379127,
        "ContactTelephone1": "+44 188 430 8547",
        "DistanceUnit": 0
    },
    "Connections": [
        {
            "ID": 146368,
            "ConnectionTypeID": 30,
            "StatusTypeID": 50,
            "LevelID": 2,
            "Amps": 32,
            "Voltage": 230,
            "PowerKW": 13,
            "CurrentTypeID": 20,
            "Quantity": 1
        }
    ],
    "NumberOfPoints": 1,
    "GeneralComments": "1 Tesla Connector, up to 13kW.Available for customers. Please see front desk.",
    "StatusTypeID": 50,
    "DateLastStatusUpdate": "2018-10-03T18:34:00Z",
    "DataQualityLevel": 1,
    "DateCreated": "2018-05-05T05:55:00Z",
    "SubmissionStatusTypeID": 200
}