{
    "IsRecentlyVerified": false,
    "ID": 71143,
    "UUID": "AA348AFF-A358-411B-BACF-E2B7C965F9CC",
    "DataProviderID": 1,
    "OperatorID": 105,
    "UsageTypeID": 4,
    "AddressInfo": {
        "ID": 71489,
        "Title": "Parkplatz am See",
        "AddressLine1": "Lübecker Straße 20",
        "Town": "Plön",
        "StateOrProvince": "Kreis Plön",
        "Postcode": "24306",
        "CountryID": 87,
        "Latitude": 54.159089222049104,
        "Longitude": 10.421187465290135,
        "AccessComments": "24/7 nutzbar mit 2 reservierten Parkplätzen vor der Ladesäule. Mit Blick auf den Großen Plöner See, in Sichtweite zum Bahnhof.",
        "RelatedURL": "http://www.stadtwerke-ploen.de/",
        "DistanceUnit": 0
    },
    "Connections": [
        {
            "ID": 101938,
            "ConnectionTypeID": 25,
            "StatusTypeID": 50,
            "LevelID": 2,
            "Amps": 32,
            "Voltage": 400,
            "PowerKW": 22,
            "CurrentTypeID": 20,
            "Quantity": 2
        }
    ],
    "NumberOfPoints": 2,
    "StatusTypeID": 50,
    "DateLastStatusUpdate": "2016-09-01T05:54:00Z",
    "DataQualityLevel": 1,
    "DateCreated": "2016-09-01T05:54:00Z",
    "SubmissionStatusTypeID": 200
}