{
    "IsRecentlyVerified": false,
    "ID": 165258,
    "UUID": "DEB667D0-FF60-4F49-935A-D6630212F9A6",
    "DataProviderID": 1,
    "DataProvidersReference": "TR-IZM-013",
    "OperatorID": 70,
    "UsageTypeID": 1,
    "AddressInfo": {
        "ID": 165617,
        "Title": "Eşarj - Cadde Plus AVM, Çeşme",
        "AddressLine1": "Sakarya Mah. 2001 Sok. No: 119/S, Çeşme",
        "Town": "İzmir",
        "StateOrProvince": "İzmir",
        "Postcode": "35930",
        "CountryID": 229,
        "Latitude": 38.328241,
        "Longitude": 26.313124,
        "ContactTelephone1": "+90 (850) 433 72 75",
        "ContactEmail": "destek@esarj.com",
        "RelatedURL": "https://esarj.com/en/map?s=TR-IZM-013",
        "DistanceUnit": 0
    },
    "Connections": [
        {
            "ID": 236936,
            "ConnectionTypeID": 2,
            "LevelID": 2,
            "Amps": 125,
            "Voltage": 500,
            "PowerKW": 45,
            "Quantity": 1
        },
        {
            "ID": 236937,
            "ConnectionTypeID": 2,
            "LevelID": 2,
            "Amps": 120,
            "Voltage": 500,
            "PowerKW": 45,
            "Quantity": 1
        },
        {
            "ID": 236938,
            "ConnectionTypeID": 2,
            "LevelID": 2,
            "Amps": 32,
            "Voltage": 380,
            "PowerKW": 22,
            "Quantity": 1
        }
    ],
    "GeneralComments": "Eşarj Charging Systems",
    "StatusTypeID": 50,
    "DateLastStatusUpdate": "2020-08-26T08:19:00Z",
    "DataQualityLevel": 3,
    "DateCreated": "2020-08-26T08:19:00Z",
    "SubmissionStatusTypeID": 200
}