{
    "MediaItems": [
        {
            "ID": 28726,
            "ChargePointID": 175372,
            "ItemURL": "https://s3-ap-southeast-2.amazonaws.com/openchargemap/images/UA/OCM175372/OCM-175372.orig.2021072211122911.jpg",
            "ItemThumbnailURL": "https://s3-ap-southeast-2.amazonaws.com/openchargemap/images/UA/OCM175372/OCM-175372.thmb.2021072211122911.jpg",
            "Comment": "",
            "IsEnabled": true,
            "IsVideo": false,
            "IsFeaturedItem": false,
            "IsExternalResource": false,
            "User": {
                "ID": 26318,
                "Username": "EugeneUA"
            },
            "DateCreated": "2021-07-22T11:13:00Z"
        },
        {
            "ID": 28725,
            "ChargePointID": 175372,
            "ItemURL": "https://s3-ap-southeast-2.amazonaws.com/openchargemap/images/UA/OCM175372/OCM-175372.orig.2021072211120302.jpg",
            "ItemThumbnailURL": "https://s3-ap-southeast-2.amazonaws.com/openchargemap/images/UA/OCM175372/OCM-175372.thmb.2021072211120302.jpg",
            "Comment": "",
            "IsEnabled": true,
            "IsVideo": false,
            "IsFeaturedItem": false,
            "IsExternalResource": false,
            "User": {
                "ID": 26318,
                "Username": "EugeneUA"
            },
            "DateCreated": "2021-07-22T11:12:00Z"
        }
    ],
    "IsRecentlyVerified": false,
    "ID": 175372,
    "UUID": "C72A2885-45D7-4C54-A15E-A18353859D88",
    "DataProviderID": 1,
    "OperatorID": 3390,
    "UsageTypeID": 4,
    "UsageCost": "4.50 UAH / kWh",
    "AddressInfo": {
        "ID": 175731,
        "Title": "AE #2931",
        "AddressLine1": "",
        "Town": "",
        "StateOrProvince": "Kyiv Oblast",
        "Postcode": "08400",
        "CountryID": 234,
        "Latitude": 50.049014025202865,
        "Longitude": 31.486207557965827,
        "DistanceUnit": 0
    },
    "Connections": [
        {
            "ID": 272049,
            "ConnectionTypeID": 2,
            "StatusTypeID": 50,
            "Amps": 112,
            "CurrentTypeID": 30,
            "Quantity": 1
        },
        {
            "ID": 272050,
            "ConnectionTypeID": 32,
            "StatusTypeID": 50,
            "LevelID": 2,
            "PowerKW": 112,
            "Quantity": 1
        },
        {
            "ID": 272051,
            "ConnectionTypeID": 33,
            "StatusTypeID": 50,
            "Amps": 112,
            "Quantity": 1
        },
        {
            "ID": 272052,
            "ConnectionTypeID": 1036,
            "StatusTypeID": 50,
            "LevelID": 2,
            "Amps": 32,
            "PowerKW": 22,
            "CurrentTypeID": 20,
            "Quantity": 1
        },
        {
            "ID": 272053,
            "ConnectionTypeID": 1,
            "StatusTypeID": 50,
            "LevelID": 2,
            "Amps": 40,
            "PowerKW": 7,
            "Quantity": 1
        }
    ],
    "NumberOfPoints": 1,
    "StatusTypeID": 50,
    "DateLastStatusUpdate": "2021-07-22T11:13:00Z",
    "DataQualityLevel": 1,
    "DateCreated": "2021-05-15T06:02:00Z",
    "SubmissionStatusTypeID": 200
}