{
    "IsRecentlyVerified": false,
    "ID": 122123,
    "UUID": "08D9C41D-8911-4822-B912-6B45B8CAACCA",
    "DataProviderID": 2,
    "DataProvidersReference": "62346",
    "OperatorID": 5,
    "UsageTypeID": 1,
    "AddressInfo": {
        "ID": 122469,
        "Title": "USC CAMPUS",
        "AddressLine1": "649 W 34th St",
        "Town": "Los Angeles",
        "StateOrProvince": "CA",
        "Postcode": "90089",
        "CountryID": 2,
        "Latitude": 34.022117,
        "Longitude": -118.282162,
        "ContactTelephone1": "888-758-4389",
        "AccessComments": "24 hours daily",
        "RelatedURL": "http://www.chargepoint.com/",
        "DistanceUnit": 0
    },
    "Connections": [
        {
            "ID": 171985,
            "ConnectionTypeID": 1,
            "LevelID": 2,
            "Amps": 16,
            "Voltage": 230,
            "PowerKW": 3,
            "CurrentTypeID": 10,
            "Quantity": 6
        }
    ],
    "DateLastStatusUpdate": "2019-12-24T09:11:00Z",
    "DataQualityLevel": 3,
    "DateCreated": "2019-04-06T05:02:00Z",
    "SubmissionStatusTypeID": 100
}