{
    "IsRecentlyVerified": false,
    "ID": 160237,
    "UUID": "E28AA24D-B7EC-442F-A27A-F10047597EEA",
    "DataProviderID": 2,
    "DataProvidersReference": "154920",
    "OperatorID": 3372,
    "UsageTypeID": 1,
    "AddressInfo": {
        "ID": 160594,
        "Title": "Long View Lodge",
        "AddressLine1": "681 Deerland Rd",
        "Town": "Long Lake",
        "StateOrProvince": "NY",
        "Postcode": "12847",
        "CountryID": 2,
        "Latitude": 43.9488105,
        "Longitude": -74.4514296,
        "ContactTelephone1": "866-816-7584",
        "AccessComments": "24 hours daily; Also accepts Paypal",
        "RelatedURL": "http://evconnect.com/",
        "DistanceUnit": 0
    },
    "Connections": [
        {
            "ID": 230541,
            "ConnectionTypeID": 1,
            "LevelID": 2,
            "Amps": 16,
            "Voltage": 230,
            "PowerKW": 3.7,
            "CurrentTypeID": 10,
            "Quantity": 2
        }
    ],
    "StatusTypeID": 50,
    "DateLastStatusUpdate": "2020-06-26T03:07:00Z",
    "DataQualityLevel": 3,
    "DateCreated": "2020-06-26T03:07:00Z",
    "SubmissionStatusTypeID": 100
}