{
    "IsRecentlyVerified": false,
    "ID": 122118,
    "UUID": "A2DADC81-7445-4686-8820-F089088180EF",
    "DataProviderID": 2,
    "DataProvidersReference": "76970",
    "OperatorID": 5,
    "UsageTypeID": 1,
    "AddressInfo": {
        "ID": 122464,
        "Title": "BROADCOM",
        "AddressLine1": "4385 River Green Pkwy",
        "Town": "Duluth",
        "StateOrProvince": "GA",
        "Postcode": "30096",
        "CountryID": 2,
        "Latitude": 34.0209909,
        "Longitude": -84.1671485,
        "ContactTelephone1": "888-758-4389",
        "AccessComments": "24 hours daily",
        "RelatedURL": "http://www.chargepoint.com/",
        "DistanceUnit": 0
    },
    "Connections": [
        {
            "ID": 171980,
            "ConnectionTypeID": 1,
            "LevelID": 2,
            "Amps": 16,
            "Voltage": 230,
            "PowerKW": 3,
            "CurrentTypeID": 10,
            "Quantity": 2
        }
    ],
    "DateLastStatusUpdate": "2019-12-24T09:11:00Z",
    "DataQualityLevel": 3,
    "DateCreated": "2019-04-06T05:02:00Z",
    "SubmissionStatusTypeID": 100
}