{
    "IsRecentlyVerified": false,
    "ID": 108194,
    "UUID": "055BF959-03D2-4FE8-AE77-3E7302E1557A",
    "DataProviderID": 1,
    "OperatorID": 164,
    "UsageTypeID": 4,
    "AddressInfo": {
        "ID": 108540,
        "Title": "Parcheggio Hilpold  | Neogy",
        "AddressLine1": "Via Principale, 3",
        "Town": "Tirolo",
        "StateOrProvince": "BZ",
        "Postcode": "39019",
        "CountryID": 112,
        "Latitude": 46.6916270512782,
        "Longitude": 11.1544739541719,
        "DistanceUnit": 0
    },
    "Connections": [
        {
            "ID": 152876,
            "ConnectionTypeID": 25,
            "StatusTypeID": 50,
            "LevelID": 2,
            "Amps": 32,
            "Voltage": 400,
            "PowerKW": 22,
            "CurrentTypeID": 20,
            "Quantity": 2
        }
    ],
    "NumberOfPoints": 2,
    "GeneralComments": "Parcheggio pubblico a pagamento\r\n",
    "StatusTypeID": 50,
    "DateLastStatusUpdate": "2019-07-14T17:01:00Z",
    "DataQualityLevel": 1,
    "DateCreated": "2018-09-12T12:32:00Z",
    "SubmissionStatusTypeID": 200
}