{
    "IsRecentlyVerified": false,
    "ID": 53641,
    "UUID": "5F6A6DAA-8E60-426B-A375-6F4E78774216",
    "DataProviderID": 26,
    "DataProvidersReference": "68706",
    "OperatorsReference": "VIB - ENECO",
    "UsageCost": "0.00 jaarabonnement",
    "AddressInfo": {
        "ID": 53987,
        "Title": "Tramstraat",
        "AddressLine1": "Tramstraat",
        "Town": "Gent",
        "Postcode": "9052",
        "CountryID": 26,
        "Latitude": 51.008732479399,
        "Longitude": 3.7028002738953,
        "DistanceUnit": 0
    },
    "Connections": [
        {
            "ID": 66843,
            "ConnectionTypeID": 25,
            "LevelID": 2,
            "PowerKW": 22,
            "CurrentTypeID": 10
        }
    ],
    "NumberOfPoints": 2,
    "StatusTypeID": 50,
    "DateLastStatusUpdate": "2016-06-04T02:38:00Z",
    "DataQualityLevel": 3,
    "DateCreated": "2015-09-20T11:50:00Z",
    "SubmissionStatusTypeID": 100
}