{
    "IsRecentlyVerified": false,
    "ID": 141671,
    "UUID": "0E34F4EF-1A6B-436F-8FD3-EC8E14C4B90D",
    "DataProviderID": 2,
    "DataProvidersReference": "68814",
    "OperatorID": 5,
    "UsageTypeID": 1,
    "AddressInfo": {
        "ID": 142023,
        "Title": "MTA",
        "AddressLine1": "5833 SOUTHWESTERN BLVD",
        "Town": "HALETHORPE",
        "StateOrProvince": "MD",
        "Postcode": "21227",
        "CountryID": 2,
        "Latitude": 39.2318484,
        "Longitude": -76.6921705,
        "ContactTelephone1": "888-758-4389",
        "AccessComments": "24 hours daily",
        "RelatedURL": "http://www.chargepoint.com/",
        "DistanceUnit": 0
    },
    "Connections": [
        {
            "ID": 197651,
            "ConnectionTypeID": 1,
            "LevelID": 2,
            "Amps": 16,
            "Voltage": 230,
            "PowerKW": 3.7,
            "CurrentTypeID": 10,
            "Quantity": 2
        }
    ],
    "StatusTypeID": 50,
    "DateLastStatusUpdate": "2020-06-26T03:01:00Z",
    "DataQualityLevel": 3,
    "DateCreated": "2019-12-24T09:16:00Z",
    "SubmissionStatusTypeID": 100
}