{
    "IsRecentlyVerified": false,
    "ID": 94101,
    "UUID": "FFCD7DAD-1A8C-42A0-B478-ADF9498A3519",
    "DataProviderID": 1,
    "OperatorID": 1,
    "UsageTypeID": 4,
    "AddressInfo": {
        "ID": 94447,
        "Title": "Hotel Althoff Fürstenhof",
        "AddressLine1": "Hannoversche Straße 55/56",
        "Town": "Celle",
        "StateOrProvince": "Landkreis Celle",
        "Postcode": "29221",
        "CountryID": 87,
        "Latitude": 52.6206533,
        "Longitude": 10.0745228000001,
        "ContactTelephone1": " +49 5141-2010",
        "ContactEmail": "info@fuerstenhof-celle.com",
        "AccessComments": "Für Gäste des Hotels. Verbund Digital Energy Solutions - mit New Motion oder PlugSurfing aktivierbar.",
        "RelatedURL": "https://www.fuerstenhof-celle.com",
        "DistanceUnit": 0
    },
    "Connections": [
        {
            "ID": 133183,
            "ConnectionTypeID": 25,
            "StatusTypeID": 50,
            "LevelID": 2,
            "Amps": 16,
            "Voltage": 400,
            "PowerKW": 11,
            "CurrentTypeID": 20,
            "Quantity": 2
        }
    ],
    "NumberOfPoints": 2,
    "StatusTypeID": 50,
    "DateLastStatusUpdate": "2018-07-04T06:42:00Z",
    "DataQualityLevel": 1,
    "DateCreated": "2017-10-17T06:08:00Z",
    "SubmissionStatusTypeID": 200
}