{
    "IsRecentlyVerified": false,
    "ID": 71334,
    "UUID": "6051A7A8-0476-49ED-8BE4-4938A4CABEA2",
    "DataProviderID": 2,
    "DataProvidersReference": "77367",
    "OperatorID": 5,
    "UsageTypeID": 1,
    "AddressInfo": {
        "ID": 71680,
        "Title": "CARTA",
        "AddressLine1": "200 West 38th Street",
        "Town": "Chattanooga",
        "StateOrProvince": "TN",
        "Postcode": "37410",
        "CountryID": 2,
        "Latitude": 35.0057326,
        "Longitude": -85.3119105,
        "ContactTelephone1": "888-758-4389",
        "AccessComments": "24 hours daily",
        "RelatedURL": "http://www.chargepoint.com/",
        "DistanceUnit": 0
    },
    "Connections": [
        {
            "ID": 102145,
            "ConnectionTypeID": 1,
            "LevelID": 2,
            "Amps": 16,
            "Voltage": 230,
            "PowerKW": 3,
            "CurrentTypeID": 10,
            "Quantity": 2
        }
    ],
    "DateLastStatusUpdate": "2019-04-06T04:02:00Z",
    "DataQualityLevel": 3,
    "DateCreated": "2016-09-02T10:14:00Z",
    "SubmissionStatusTypeID": 100
}