{
    "IsRecentlyVerified": false,
    "ID": 36548,
    "UUID": "98F77EAD-E12F-45DB-AD6E-D64915098330",
    "DataProviderID": 26,
    "DataProvidersReference": "46590",
    "OperatorID": 73,
    "OperatorsReference": "EV-Box EVB-P1407239",
    "UsageCost": "0.00 jaarabonnement",
    "AddressInfo": {
        "ID": 36894,
        "Title": "Spaceshuttle 18",
        "AddressLine1": "Spaceshuttle 18",
        "Town": "Amersfoort",
        "Postcode": "3824 ML",
        "CountryID": 159,
        "Latitude": 52.19682,
        "Longitude": 5.39435,
        "RelatedURL": "http://www.ev-box.nl",
        "DistanceUnit": 0
    },
    "Connections": [
        {
            "ID": 40059,
            "ConnectionTypeID": 25,
            "LevelID": 2,
            "PowerKW": 11,
            "CurrentTypeID": 10
        },
        {
            "ID": 48403,
            "ConnectionTypeID": 25,
            "LevelID": 2,
            "PowerKW": 11,
            "CurrentTypeID": 10
        },
        {
            "ID": 48404,
            "ConnectionTypeID": 25,
            "LevelID": 2,
            "PowerKW": 11,
            "CurrentTypeID": 10
        },
        {
            "ID": 48405,
            "ConnectionTypeID": 25,
            "LevelID": 2,
            "PowerKW": 11,
            "CurrentTypeID": 10
        }
    ],
    "NumberOfPoints": 1,
    "StatusTypeID": 50,
    "DateLastStatusUpdate": "2016-06-04T02:51:00Z",
    "DataQualityLevel": 3,
    "DateCreated": "2015-01-09T06:05:00Z",
    "SubmissionStatusTypeID": 100
}