{
    "IsRecentlyVerified": false,
    "ID": 122744,
    "UUID": "08579A12-B77A-45B4-A910-9BF41D1B116E",
    "DataProviderID": 2,
    "DataProvidersReference": "80917",
    "OperatorID": 5,
    "UsageTypeID": 1,
    "AddressInfo": {
        "ID": 123090,
        "Title": "AVUHSD",
        "AddressLine1": "6340 W Avenue L",
        "Town": "Lancaster",
        "StateOrProvince": "CA",
        "Postcode": "93536",
        "CountryID": 2,
        "Latitude": 34.65998,
        "Longitude": -118.244417,
        "ContactTelephone1": "888-758-4389",
        "AccessComments": "24 hours daily",
        "RelatedURL": "http://www.chargepoint.com/",
        "DistanceUnit": 0
    },
    "Connections": [
        {
            "ID": 172658,
            "ConnectionTypeID": 1,
            "LevelID": 2,
            "Amps": 16,
            "Voltage": 230,
            "PowerKW": 3,
            "CurrentTypeID": 10,
            "Quantity": 2
        }
    ],
    "DateLastStatusUpdate": "2019-12-24T09:12:00Z",
    "DataQualityLevel": 3,
    "DateCreated": "2019-04-06T05:03:00Z",
    "SubmissionStatusTypeID": 100
}