{
    "IsRecentlyVerified": false,
    "ID": 41291,
    "UUID": "00DFA722-0915-4CA3-99CD-43CBDE3DE8B1",
    "DataProviderID": 1,
    "OperatorID": 128,
    "UsageTypeID": 4,
    "UsageCost": "0",
    "AddressInfo": {
        "ID": 41637,
        "Title": "Star Tankstelle",
        "AddressLine1": "Vorsfelder Straße 9",
        "Town": "Velpke",
        "StateOrProvince": "Samtgemeinde Velpke",
        "Postcode": "38458",
        "CountryID": 87,
        "Latitude": 52.40942,
        "Longitude": 10.9319800000001,
        "ContactTelephone1": "05364 967288",
        "AccessComments": "1 kostenloser Parkplatz mit Ladesäule auf Tankstellengelände. Immer nutzbar. RFID Karte der LSW Energie notwendig, kann auch in der Tankstelle ausgeliehen werden.",
        "RelatedURL": "http://www.lsw.de/CMS/privatkunden/strom/unterwegs_mit_strom_1099.aspx",
        "DistanceUnit": 0
    },
    "Connections": [
        {
            "ID": 45094,
            "ConnectionTypeID": 25,
            "StatusTypeID": 50,
            "LevelID": 2,
            "Amps": 32,
            "Voltage": 400,
            "PowerKW": 22,
            "CurrentTypeID": 20,
            "Quantity": 1
        },
        {
            "ID": 45095,
            "ConnectionTypeID": 28,
            "StatusTypeID": 50,
            "LevelID": 2,
            "Amps": 16,
            "Voltage": 230,
            "PowerKW": 3.7,
            "CurrentTypeID": 10,
            "Quantity": 1
        }
    ],
    "NumberOfPoints": 2,
    "StatusTypeID": 50,
    "DateLastStatusUpdate": "2015-01-31T15:27:00Z",
    "DataQualityLevel": 1,
    "DateCreated": "2015-01-30T08:34:00Z",
    "SubmissionStatusTypeID": 200
}