{
    "IsRecentlyVerified": false,
    "ID": 18806,
    "UUID": "96BD6259-56F0-4CBB-84BC-86AD95E1D377",
    "DataProviderID": 15,
    "DataProvidersReference": "30261",
    "OperatorID": 1,
    "UsageTypeID": 1,
    "AddressInfo": {
        "ID": 19151,
        "Title": "????????????????",
        "AddressLine1": "????????????????",
        "Town": "??",
        "StateOrProvince": "",
        "Postcode": "545026",
        "CountryID": 50,
        "Latitude": 24.347233,
        "Longitude": 109.428549,
        "ContactTelephone1": "",
        "RelatedURL": "http://carstations.com/30261",
        "DistanceUnit": 0
    },
    "Connections": [
        {
            "ID": 19039,
            "ConnectionTypeID": 1,
            "Reference": "J1772",
            "LevelID": 2,
            "Quantity": 1
        }
    ],
    "NumberOfPoints": 1,
    "StatusTypeID": 0,
    "DateLastStatusUpdate": "2014-03-22T04:39:00Z",
    "DataQualityLevel": 2,
    "DateCreated": "2013-08-25T03:32:00Z",
    "SubmissionStatusTypeID": 200
}