{
    "IsRecentlyVerified": false,
    "ID": 114658,
    "UUID": "6CCD56C4-8845-4FE1-970C-B7F5E5C94266",
    "DataProviderID": 1,
    "OperatorID": 23,
    "OperatorsReference": "48189",
    "UsageTypeID": 6,
    "AddressInfo": {
        "ID": 115004,
        "Title": "Avalon Hotel Bad Reichenhall",
        "AddressLine1": "Bahnhofplatz 14",
        "Town": "Bad Reichenhall",
        "Postcode": "83435",
        "CountryID": 87,
        "Latitude": 47.730357,
        "Longitude": 12.882566,
        "ContactTelephone1": "+49 8651 7630",
        "DistanceUnit": 0
    },
    "Connections": [
        {
            "ID": 161378,
            "ConnectionTypeID": 30,
            "StatusTypeID": 50,
            "LevelID": 2,
            "Amps": 16,
            "Voltage": 400,
            "PowerKW": 11,
            "CurrentTypeID": 20,
            "Quantity": 1
        }
    ],
    "NumberOfPoints": 1,
    "GeneralComments": "1 Tesla Connector, up to 11kW.Available for patrons only. Please see front desk.",
    "StatusTypeID": 50,
    "DateLastStatusUpdate": "2020-08-18T05:57:00Z",
    "DataQualityLevel": 1,
    "DateCreated": "2019-01-13T06:38:00Z",
    "SubmissionStatusTypeID": 200
}