{
    "IsRecentlyVerified": false,
    "ID": 183047,
    "UUID": "DCF2EA2D-35D1-46A3-A69B-E3C7A58ACBDC",
    "DataProviderID": 29,
    "DataProvidersReference": "20468",
    "OperatorID": 127,
    "AddressInfo": {
        "ID": 183406,
        "Title": "Prötzeler Chaussee",
        "AddressLine1": "Prötzeler Chaussee",
        "Town": "Strausberg",
        "Postcode": "15344",
        "CountryID": 87,
        "Latitude": 52.590525283886,
        "Longitude": 13.908272981644,
        "DistanceUnit": 0
    },
    "Connections": [
        {
            "ID": 289546,
            "ConnectionTypeID": 25,
            "StatusTypeID": 50,
            "LevelID": 2,
            "PowerKW": 22,
            "CurrentTypeID": 20
        },
        {
            "ID": 289547,
            "ConnectionTypeID": 25,
            "StatusTypeID": 50,
            "LevelID": 2,
            "PowerKW": 22,
            "CurrentTypeID": 20
        }
    ],
    "StatusTypeID": 50,
    "DateLastStatusUpdate": "2021-07-12T02:50:00Z",
    "MetadataValues": [
        {
            "ID": 15340,
            "MetadataFieldID": 4,
            "ItemValue": "Data from the German chargepoint registry provided by Bundesnetzagentur.de under the CC-BY 4.0 license"
        }
    ],
    "DataQualityLevel": 3,
    "DateCreated": "2021-07-08T10:03:00Z",
    "SubmissionStatusTypeID": 100
}