{
    "IsRecentlyVerified": false,
    "ID": 137535,
    "UUID": "EF0C76E1-5278-4E0A-A116-D00654651CAE",
    "DataProviderID": 2,
    "DataProvidersReference": "144215",
    "OperatorID": 5,
    "UsageTypeID": 1,
    "AddressInfo": {
        "ID": 137881,
        "Title": "AMD GO GREEN",
        "AddressLine1": "7171 Southwest Pkwy",
        "Town": "Austin",
        "StateOrProvince": "TX",
        "Postcode": "78735",
        "CountryID": 2,
        "Latitude": 30.251065,
        "Longitude": -97.862935,
        "ContactTelephone1": "888-758-4389",
        "AccessComments": "24 hours daily",
        "RelatedURL": "http://www.chargepoint.com/",
        "DistanceUnit": 0
    },
    "Connections": [
        {
            "ID": 192463,
            "ConnectionTypeID": 1,
            "LevelID": 2,
            "Amps": 16,
            "Voltage": 230,
            "PowerKW": 3,
            "CurrentTypeID": 10,
            "Quantity": 8
        }
    ],
    "StatusTypeID": 50,
    "DateLastStatusUpdate": "2019-12-24T09:05:00Z",
    "DataQualityLevel": 3,
    "DateCreated": "2019-12-24T09:05:00Z",
    "SubmissionStatusTypeID": 100
}