{
    "IsRecentlyVerified": false,
    "ID": 63803,
    "UUID": "DC1917EE-6434-4AA8-B4F3-AA5BAE554B38",
    "DataProviderID": 26,
    "DataProvidersReference": "75696",
    "OperatorID": 73,
    "OperatorsReference": "EV-Box EVB-P1536325",
    "UsageCost": "0.00 jaarabonnement",
    "AddressInfo": {
        "ID": 64149,
        "Title": "'s-Gravesandelaan 40",
        "AddressLine1": "'s-Gravesandelaan 40",
        "Town": "Hilversum",
        "Postcode": "1222 TA",
        "CountryID": 159,
        "Latitude": 52.2323,
        "Longitude": 5.18037,
        "RelatedURL": "http://www.ev-box.nl",
        "DistanceUnit": 0
    },
    "Connections": [
        {
            "ID": 81502,
            "ConnectionTypeID": 25,
            "LevelID": 2,
            "PowerKW": 5,
            "CurrentTypeID": 10
        }
    ],
    "NumberOfPoints": 1,
    "StatusTypeID": 50,
    "DateLastStatusUpdate": "2016-06-04T02:52:00Z",
    "DataQualityLevel": 3,
    "DateCreated": "2016-03-03T12:32:00Z",
    "SubmissionStatusTypeID": 100
}