{
    "IsRecentlyVerified": false,
    "ID": 75827,
    "UUID": "371A899A-7C8F-4639-A023-0AD6C7C4798A",
    "DataProviderID": 2,
    "DataProvidersReference": "80100",
    "OperatorID": 5,
    "UsageTypeID": 1,
    "AddressInfo": {
        "ID": 76173,
        "Title": "PROMETHEUS",
        "AddressLine1": "10159 S Blaney Ave",
        "Town": "Cupertino",
        "StateOrProvince": "CA",
        "Postcode": "95014",
        "CountryID": 2,
        "Latitude": 37.3208153,
        "Longitude": -122.0235768,
        "ContactTelephone1": "888-758-4389",
        "AccessComments": "24 hours daily",
        "RelatedURL": "http://www.chargepoint.com/",
        "DistanceUnit": 0
    },
    "Connections": [
        {
            "ID": 109333,
            "ConnectionTypeID": 1,
            "LevelID": 2,
            "Amps": 16,
            "Voltage": 230,
            "PowerKW": 3,
            "CurrentTypeID": 10,
            "Quantity": 2
        }
    ],
    "DateLastStatusUpdate": "2019-04-06T04:02:00Z",
    "DataQualityLevel": 3,
    "DateCreated": "2016-12-23T01:25:00Z",
    "SubmissionStatusTypeID": 100
}