{
    "IsRecentlyVerified": false,
    "ID": 75416,
    "UUID": "9D3FD011-526E-4425-9CC0-DFB517BB3508",
    "DataProviderID": 1,
    "OperatorID": 23,
    "OperatorsReference": "18400",
    "UsageTypeID": 4,
    "UsageCost": "€0.37/kWh; Autres tarifs pour les voitures anciennes",
    "AddressInfo": {
        "ID": 75762,
        "Title": "Mougins Supercharger",
        "AddressLine1": "205 avenue du Golf",
        "AddressLine2": "Hôtel de Mougins",
        "Town": "Mougins",
        "Postcode": "06250",
        "CountryID": 80,
        "Latitude": 43.603659,
        "Longitude": 7.011155,
        "DistanceUnit": 0
    },
    "Connections": [
        {
            "ID": 108721,
            "ConnectionTypeID": 27,
            "StatusTypeID": 50,
            "LevelID": 3,
            "PowerKW": 150,
            "CurrentTypeID": 30,
            "Quantity": 4
        }
    ],
    "NumberOfPoints": 4,
    "GeneralComments": "4 Superchargers, available 24/7",
    "StatusTypeID": 50,
    "DateLastStatusUpdate": "2021-11-04T22:56:00Z",
    "DataQualityLevel": 1,
    "DateCreated": "2016-12-14T19:59:00Z",
    "SubmissionStatusTypeID": 200
}