{
    "IsRecentlyVerified": false,
    "ID": 33990,
    "UUID": "35697997-1CA0-402D-902F-0BCCD0CCFAB2",
    "DataProviderID": 26,
    "DataProvidersReference": "32759",
    "OperatorID": 157,
    "OperatorsReference": "NewMotion 02005192",
    "UsageCost": "0.00 jaarabonnement",
    "AddressInfo": {
        "ID": 34336,
        "Title": "Willem van der Zaanstraat 20",
        "AddressLine1": "Willem van der Zaanstraat 20",
        "Town": "Hellevoetsluis",
        "Postcode": "3223 SN",
        "CountryID": 159,
        "Latitude": 51.8402175,
        "Longitude": 4.14582,
        "ContactTelephone1": "088 0109500",
        "RelatedURL": "http://thenewmotion.nl/",
        "DistanceUnit": 0
    },
    "Connections": [
        {
            "ID": 37501,
            "ConnectionTypeID": 25,
            "LevelID": 2,
            "PowerKW": 3.7,
            "CurrentTypeID": 10
        }
    ],
    "NumberOfPoints": 1,
    "StatusTypeID": 50,
    "DateLastStatusUpdate": "2016-06-04T02:41:00Z",
    "DataQualityLevel": 3,
    "DateCreated": "2015-01-09T06:04:00Z",
    "SubmissionStatusTypeID": 100
}