{
    "IsRecentlyVerified": false,
    "ID": 52443,
    "UUID": "18190915-A791-45EE-A590-75504C3776FE",
    "DataProviderID": 1,
    "OperatorID": 105,
    "UsageTypeID": 1,
    "AddressInfo": {
        "ID": 52789,
        "Title": "E-Bike Station Tourist-Information",
        "AddressLine1": "Hahnplatz 1",
        "Town": "Prüm",
        "Postcode": "54595",
        "CountryID": 87,
        "Latitude": 50.207142,
        "Longitude": 6.423722,
        "RelatedURL": "http://www.rwe.com/web/cms/de/494436/e-bikes-on-tour/ladestationen/",
        "DistanceUnit": 0
    },
    "Connections": [
        {
            "ID": 65096,
            "ConnectionTypeID": 28,
            "StatusTypeID": 50,
            "LevelID": 1,
            "Amps": 10,
            "Voltage": 230,
            "PowerKW": 2.3,
            "CurrentTypeID": 10,
            "Quantity": 3
        }
    ],
    "NumberOfPoints": 3,
    "StatusTypeID": 50,
    "DateLastStatusUpdate": "2015-08-29T07:16:00Z",
    "DataQualityLevel": 1,
    "DateCreated": "2015-08-28T22:00:00Z",
    "SubmissionStatusTypeID": 200
}