{
    "IsRecentlyVerified": false,
    "ID": 62408,
    "UUID": "FF63E613-1A8C-4128-9448-38B41AD00A22",
    "DataProviderID": 2,
    "DataProvidersReference": "71650",
    "UsageTypeID": 1,
    "AddressInfo": {
        "ID": 62754,
        "Title": "Kwik Trip #297",
        "AddressLine1": "1499 Appleton Rd",
        "Town": "Menasha",
        "StateOrProvince": "WI",
        "Postcode": "54952",
        "CountryID": 2,
        "Latitude": 44.229449,
        "Longitude": -88.4231,
        "ContactTelephone1": "920-729-4851",
        "AccessComments": "24 hours daily",
        "RelatedURL": "",
        "DistanceUnit": 0
    },
    "Connections": [
        {
            "ID": 79313,
            "ConnectionTypeID": 9,
            "LevelID": 1,
            "Amps": 16,
            "Voltage": 120,
            "PowerKW": 1.9,
            "CurrentTypeID": 10,
            "Quantity": 1
        }
    ],
    "DateLastStatusUpdate": "2020-06-26T03:07:00Z",
    "DataQualityLevel": 3,
    "DateCreated": "2016-03-03T11:39:00Z",
    "SubmissionStatusTypeID": 100
}