{
    "IsRecentlyVerified": false,
    "ID": 152087,
    "UUID": "3C78ED4C-3D30-4E25-BFE1-E7D5ED047F68",
    "DataProviderID": 28,
    "DataProvidersReference": "FR*S86*PSORE*B072",
    "UsageTypeID": 5,
    "AddressInfo": {
        "ID": 152440,
        "Title": "B072",
        "AddressLine1": "39-43, boulevard de Strasbourg - 86500 - Montmorillon",
        "CountryID": 80,
        "Latitude": 46.42582,
        "Longitude": 0.86969,
        "AccessComments": "24/24 7/7 jours",
        "DistanceUnit": 0
    },
    "Connections": [
        {
            "ID": 212756,
            "ConnectionTypeID": 28,
            "StatusTypeID": 50,
            "LevelID": 2,
            "PowerKW": 18,
            "CurrentTypeID": 10
        },
        {
            "ID": 212757,
            "ConnectionTypeID": 25,
            "StatusTypeID": 50,
            "LevelID": 2,
            "PowerKW": 18,
            "CurrentTypeID": 20
        },
        {
            "ID": 245613,
            "ConnectionTypeID": 28,
            "StatusTypeID": 50,
            "LevelID": 2,
            "PowerKW": 18,
            "CurrentTypeID": 10
        },
        {
            "ID": 245614,
            "ConnectionTypeID": 25,
            "StatusTypeID": 50,
            "LevelID": 2,
            "PowerKW": 18,
            "CurrentTypeID": 20
        }
    ],
    "GeneralComments": "",
    "StatusTypeID": 50,
    "DateLastStatusUpdate": "2020-08-27T05:12:00Z",
    "DataQualityLevel": 2,
    "DateCreated": "2020-03-15T10:53:00Z",
    "SubmissionStatusTypeID": 100
}