{
    "IsRecentlyVerified": false,
    "ID": 54645,
    "UUID": "B3DBC5F0-0681-4A12-BA22-9A29ACE74A27",
    "DataProviderID": 26,
    "DataProvidersReference": "71007",
    "OperatorID": 103,
    "OperatorsReference": "Allego NLALLEGO0002432",
    "UsageCost": "0.00 jaarabonnement",
    "AddressInfo": {
        "ID": 54991,
        "Title": "Omhoeken 11",
        "AddressLine1": "Omhoeken 11",
        "Town": "Zaltbommel",
        "Postcode": "5301 BD",
        "CountryID": 159,
        "Latitude": 51.8110791,
        "Longitude": 5.24987859,
        "ContactTelephone1": "0800-3745337",
        "RelatedURL": "http://www.allego.eu/",
        "DistanceUnit": 0
    },
    "Connections": [
        {
            "ID": 68980,
            "ConnectionTypeID": 25,
            "LevelID": 2,
            "PowerKW": 11,
            "CurrentTypeID": 10
        },
        {
            "ID": 68981,
            "ConnectionTypeID": 25,
            "LevelID": 2,
            "PowerKW": 11,
            "CurrentTypeID": 10
        }
    ],
    "NumberOfPoints": 1,
    "StatusTypeID": 50,
    "DateLastStatusUpdate": "2016-06-04T02:40:00Z",
    "DataQualityLevel": 3,
    "DateCreated": "2015-10-09T06:18:00Z",
    "SubmissionStatusTypeID": 100
}