{
    "UserComments": [
        {
            "ID": 10406,
            "ChargePointID": 60829,
            "CommentTypeID": 10,
            "UserName": "Alan Brown",
            "Comment": "Successful Tesla CHAdeMO session",
            "Rating": 3,
            "DateCreated": "2016-05-14T12:56:55.217Z",
            "User": {
                "ID": 2055,
                "Username": "Alan Brown"
            },
            "CheckinStatusTypeID": 10
        },
        {
            "ID": 10000,
            "ChargePointID": 60829,
            "CommentTypeID": 10,
            "UserName": "Anon74856763534",
            "Comment": "",
            "DateCreated": "2016-03-26T21:49:18.29Z",
            "User": {
                "ID": 1192,
                "Username": "Anon74856763534"
            },
            "CheckinStatusTypeID": 10
        }
    ],
    "MediaItems": [
        {
            "ID": 6439,
            "ChargePointID": 60829,
            "ItemURL": "https://s3-ap-southeast-2.amazonaws.com/openchargemap/images/GB/OCM60829/OCM-60829.orig.2016051412571863.jpeg",
            "ItemThumbnailURL": "https://s3-ap-southeast-2.amazonaws.com/openchargemap/images/GB/OCM60829/OCM-60829.thmb.2016051412571863.jpeg",
            "Comment": "",
            "IsEnabled": true,
            "IsVideo": false,
            "IsFeaturedItem": false,
            "IsExternalResource": false,
            "User": {
                "ID": 2055,
                "Username": "Alan Brown"
            },
            "DateCreated": "2016-05-14T12:58:00Z"
        }
    ],
    "IsRecentlyVerified": false,
    "ID": 60829,
    "UUID": "E67F97B1-DE4B-4A2F-9912-495BC3FFD130",
    "DataProviderID": 1,
    "OperatorID": 3315,
    "OperatorsReference": "51078",
    "UsageTypeID": 4,
    "UsageCost": "Free",
    "AddressInfo": {
        "ID": 61175,
        "Title": "Village Car Park",
        "AddressLine1": "Watchmaker's Lane",
        "Town": "Alford",
        "StateOrProvince": "Aberdeenshire",
        "Postcode": "AB33 8AE",
        "CountryID": 1,
        "Latitude": 57.2319592,
        "Longitude": -2.70027030000006,
        "DistanceUnit": 0
    },
    "Connections": [
        {
            "ID": 77119,
            "ConnectionTypeID": 2,
            "StatusTypeID": 50,
            "LevelID": 3,
            "Amps": 125,
            "Voltage": 400,
            "PowerKW": 50,
            "CurrentTypeID": 30,
            "Quantity": 1
        },
        {
            "ID": 77120,
            "ConnectionTypeID": 1036,
            "StatusTypeID": 50,
            "LevelID": 3,
            "Amps": 63,
            "Voltage": 400,
            "PowerKW": 43,
            "CurrentTypeID": 20,
            "Quantity": 1
        },
        {
            "ID": 77121,
            "ConnectionTypeID": 33,
            "StatusTypeID": 100,
            "LevelID": 3,
            "Amps": 125,
            "Voltage": 400,
            "PowerKW": 50,
            "CurrentTypeID": 30,
            "Quantity": 1
        }
    ],
    "NumberOfPoints": 2,
    "StatusTypeID": 50,
    "DateLastStatusUpdate": "2018-12-20T06:25:00Z",
    "DataQualityLevel": 1,
    "DateCreated": "2016-02-09T14:47:00Z",
    "SubmissionStatusTypeID": 200
}