{
    "IsRecentlyVerified": false,
    "ID": 140989,
    "UUID": "BCEE0C57-4507-425F-B034-A2D6619F2C0A",
    "DataProviderID": 2,
    "DataProvidersReference": "68029",
    "UsageTypeID": 7,
    "AddressInfo": {
        "ID": 141341,
        "Title": "Autocom Nissan Of Walnut Creek",
        "AddressLine1": "1840 N Main St",
        "Town": "Walnut Creek",
        "StateOrProvince": "CA",
        "Postcode": "94596",
        "CountryID": 2,
        "Latitude": 37.904258,
        "Longitude": -122.062644,
        "ContactTelephone1": "925-968-4203",
        "AccessComments": "Dealership business hours\r\nPublic - Call ahead",
        "RelatedURL": "",
        "DistanceUnit": 0
    },
    "Connections": [
        {
            "ID": 196782,
            "ConnectionTypeID": 1,
            "LevelID": 2,
            "Amps": 16,
            "Voltage": 230,
            "PowerKW": 3,
            "CurrentTypeID": 10,
            "Quantity": 1
        }
    ],
    "StatusTypeID": 50,
    "DateLastStatusUpdate": "2019-12-24T09:14:00Z",
    "DataQualityLevel": 3,
    "DateCreated": "2019-12-24T09:14:00Z",
    "SubmissionStatusTypeID": 100
}