{
    "IsRecentlyVerified": false,
    "ID": 119610,
    "UUID": "9E0C5780-3483-434E-AC03-589F4DB25D88",
    "DataProviderID": 2,
    "DataProvidersReference": "77852",
    "UsageTypeID": 2,
    "AddressInfo": {
        "ID": 119956,
        "Title": "Florida Power & Light - Sunrise (Central Broward) Service Center",
        "AddressLine1": "4401 NW 112th Ave",
        "Town": "Sunrise",
        "StateOrProvince": "FL",
        "Postcode": "33323",
        "CountryID": 2,
        "Latitude": 26.1796897410923,
        "Longitude": -80.3001173812286,
        "ContactTelephone1": "",
        "AccessComments": "Fleet use only",
        "RelatedURL": "",
        "DistanceUnit": 0
    },
    "Connections": [
        {
            "ID": 168888,
            "ConnectionTypeID": 9,
            "LevelID": 1,
            "Amps": 16,
            "Voltage": 120,
            "PowerKW": 1.9,
            "CurrentTypeID": 10,
            "Quantity": 2
        }
    ],
    "DateLastStatusUpdate": "2020-06-26T02:52:00Z",
    "DataQualityLevel": 3,
    "DateCreated": "2019-04-01T04:59:00Z",
    "SubmissionStatusTypeID": 100
}