{
    "IsRecentlyVerified": false,
    "ID": 123569,
    "UUID": "6F053B9C-516E-43B4-AC79-6CC792BCB49F",
    "DataProviderID": 2,
    "DataProvidersReference": "71887",
    "UsageTypeID": 2,
    "AddressInfo": {
        "ID": 123915,
        "Title": "Caltrans - District 6",
        "AddressLine1": "2015 E Shields Ave",
        "Town": "Fresno",
        "StateOrProvince": "CA",
        "Postcode": "93703",
        "CountryID": 2,
        "Latitude": 36.779877,
        "Longitude": -119.787778,
        "ContactTelephone1": "",
        "AccessComments": "Employee and state vehicle use only",
        "RelatedURL": "",
        "DistanceUnit": 0
    },
    "Connections": [
        {
            "ID": 173572,
            "ConnectionTypeID": 1,
            "LevelID": 2,
            "Amps": 16,
            "Voltage": 230,
            "PowerKW": 3.7,
            "CurrentTypeID": 10,
            "Quantity": 1
        }
    ],
    "DateLastStatusUpdate": "2020-06-26T02:58:00Z",
    "DataQualityLevel": 3,
    "DateCreated": "2019-04-06T05:03:00Z",
    "SubmissionStatusTypeID": 100
}