{
    "IsRecentlyVerified": false,
    "ID": 143366,
    "UUID": "F7745F2A-5CEA-4A06-9FF3-CB6C56C4E541",
    "DataProviderID": 2,
    "DataProvidersReference": "148074",
    "OperatorID": 39,
    "UsageTypeID": 1,
    "AddressInfo": {
        "ID": 143718,
        "Title": "Commercial Street Lot",
        "AddressLine1": "Gilbo Avenue",
        "Town": "Keene",
        "StateOrProvince": "NH",
        "Postcode": "03431",
        "CountryID": 2,
        "Latitude": 42.9319208,
        "Longitude": -72.2819404,
        "ContactTelephone1": "800-663-5633",
        "AccessComments": "MO: Not Specified; TU: Not Specified; WE: Not Specified; TH: Not Specified; FR: Not Specified; SA: Not Specified; SU: Not Specified",
        "RelatedURL": "http://www.semacharge.com/",
        "DistanceUnit": 0
    },
    "Connections": [
        {
            "ID": 199669,
            "ConnectionTypeID": 1,
            "LevelID": 2,
            "Amps": 16,
            "Voltage": 230,
            "PowerKW": 3.7,
            "CurrentTypeID": 10,
            "Quantity": 2
        }
    ],
    "StatusTypeID": 50,
    "DateLastStatusUpdate": "2020-06-26T03:06:00Z",
    "DataQualityLevel": 3,
    "DateCreated": "2019-12-24T09:21:00Z",
    "SubmissionStatusTypeID": 100
}