{
    "IsRecentlyVerified": false,
    "ID": 120358,
    "UUID": "E48AA837-D5C5-4C94-B803-7DC42603CAB7",
    "DataProviderID": 2,
    "DataProvidersReference": "49805",
    "UsageTypeID": 7,
    "AddressInfo": {
        "ID": 120704,
        "Title": "Orr Nissan South",
        "AddressLine1": "1240 E Bert Kouns Industrial Loop",
        "Town": "Shreveport",
        "StateOrProvince": "LA",
        "Postcode": "71105",
        "CountryID": 2,
        "Latitude": 32.421925,
        "Longitude": -93.720713,
        "ContactTelephone1": "318-797-2424",
        "AccessComments": "Dealership business hours\r\nPublic - Call ahead",
        "RelatedURL": "",
        "DistanceUnit": 0
    },
    "Connections": [
        {
            "ID": 169700,
            "ConnectionTypeID": 1,
            "LevelID": 2,
            "Amps": 16,
            "Voltage": 230,
            "PowerKW": 3.7,
            "CurrentTypeID": 10,
            "Quantity": 1
        }
    ],
    "DateLastStatusUpdate": "2020-06-26T02:54:00Z",
    "DataQualityLevel": 3,
    "DateCreated": "2019-04-01T04:59:00Z",
    "SubmissionStatusTypeID": 100
}