{
    "IsRecentlyVerified": false,
    "ID": 127442,
    "UUID": "C61D02C1-674C-42F3-B8E6-0DCF093118B3",
    "DataProviderID": 1,
    "OperatorID": 22,
    "OperatorsReference": "C2QDS-A/B",
    "UsageTypeID": 4,
    "AddressInfo": {
        "ID": 127788,
        "Title": "Town Centre Car Park",
        "AddressLine1": "Off Main Street",
        "Town": "Roscommon Town",
        "StateOrProvince": "County Roscommon",
        "CountryID": 3,
        "Latitude": 53.630905,
        "Longitude": -8.188676,
        "DistanceUnit": 0
    },
    "Connections": [
        {
            "ID": 178415,
            "ConnectionTypeID": 25,
            "StatusTypeID": 50,
            "LevelID": 2,
            "Amps": 32,
            "Voltage": 400,
            "PowerKW": 22,
            "CurrentTypeID": 20,
            "Quantity": 2
        }
    ],
    "NumberOfPoints": 2,
    "StatusTypeID": 50,
    "DateLastStatusUpdate": "2019-06-04T06:04:00Z",
    "DataQualityLevel": 1,
    "DateCreated": "2019-06-03T11:00:00Z",
    "SubmissionStatusTypeID": 200
}