{
    "IsRecentlyVerified": false,
    "ID": 67343,
    "UUID": "E25D298A-D472-47F2-AA8B-8B2D7D15E450",
    "DataProviderID": 1,
    "OperatorID": 23,
    "OperatorsReference": "14356",
    "UsageTypeID": 1,
    "UsageCost": "$0.24/min >=60kW; $0.12/min <60kW; other tariffs for older cars",
    "AddressInfo": {
        "ID": 67689,
        "Title": "Tilghman Square Shopping Center - Tesla",
        "AddressLine1": "4680 Broadway",
        "Town": "Allentown",
        "StateOrProvince": "PA",
        "Postcode": "18104",
        "CountryID": 2,
        "Latitude": 40.5884531,
        "Longitude": -75.5610309,
        "ContactTelephone1": "877-798-3752",
        "AccessComments": "24 hours daily; for Tesla use only",
        "RelatedURL": "http://www.teslamotors.com/supercharger",
        "DistanceUnit": 0
    },
    "Connections": [
        {
            "ID": 92847,
            "ConnectionTypeID": 27,
            "StatusTypeID": 50,
            "LevelID": 3,
            "Amps": 100,
            "Voltage": 400,
            "PowerKW": 120,
            "CurrentTypeID": 30,
            "Quantity": 8
        }
    ],
    "NumberOfPoints": 8,
    "StatusTypeID": 50,
    "DateLastStatusUpdate": "2018-03-13T13:21:00Z",
    "DataQualityLevel": 3,
    "DateCreated": "2016-05-29T02:05:00Z",
    "SubmissionStatusTypeID": 100
}