{
    "UserComments": [
        {
            "ID": 22048,
            "ChargePointID": 146698,
            "CommentTypeID": 10,
            "UserName": "Dylan_Hudson",
            "DateCreated": "2020-01-13T21:25:21.327Z",
            "User": {
                "ID": 23370,
                "Username": "Dylan_Hudson"
            },
            "CheckinStatusTypeID": 140,
            "IsActionedByEditor": false
        }
    ],
    "MediaItems": [
        {
            "ID": 20977,
            "ChargePointID": 146698,
            "ItemURL": "https://s3-ap-southeast-2.amazonaws.com/openchargemap/images/GB/OCM146698/OCM-146698.orig.2020011321251283.jpg",
            "ItemThumbnailURL": "https://s3-ap-southeast-2.amazonaws.com/openchargemap/images/GB/OCM146698/OCM-146698.thmb.2020011321251283.jpg",
            "Comment": "",
            "IsEnabled": true,
            "IsVideo": false,
            "IsFeaturedItem": false,
            "IsExternalResource": false,
            "User": {
                "ID": 23370,
                "Username": "Dylan_Hudson"
            },
            "DateCreated": "2020-01-13T21:25:00Z"
        }
    ],
    "IsRecentlyVerified": false,
    "ID": 146698,
    "UUID": "AFB392BA-D4F5-4232-881F-7316E833C9E6",
    "DataProviderID": 1,
    "OperatorID": 3296,
    "UsageTypeID": 5,
    "UsageCost": "£0.40/kWh",
    "AddressInfo": {
        "ID": 147050,
        "Title": "Booths Ripon",
        "AddressLine1": "Marshall Way",
        "Town": "Ripon",
        "StateOrProvince": "North Yorkshire",
        "Postcode": "HG4 2BT",
        "CountryID": 1,
        "Latitude": 54.13751441886768,
        "Longitude": -1.525037594571586,
        "ContactTelephone1": "+44 808 281 4444",
        "DistanceUnit": 0
    },
    "Connections": [
        {
            "ID": 203995,
            "ConnectionTypeID": 2,
            "StatusTypeID": 50,
            "LevelID": 3,
            "PowerKW": 50,
            "CurrentTypeID": 30,
            "Quantity": 4
        },
        {
            "ID": 203996,
            "ConnectionTypeID": 33,
            "StatusTypeID": 50,
            "LevelID": 3,
            "PowerKW": 50,
            "CurrentTypeID": 30,
            "Quantity": 4
        }
    ],
    "NumberOfPoints": 4,
    "GeneralComments": "Activation via contactless payment card",
    "StatusTypeID": 50,
    "DateLastStatusUpdate": "2021-05-26T10:22:00Z",
    "DataQualityLevel": 1,
    "DateCreated": "2020-01-13T21:25:00Z",
    "SubmissionStatusTypeID": 200
}