{
    "IsRecentlyVerified": false,
    "ID": 16512,
    "UUID": "237AAF73-8238-4BCC-864A-BD189D998578",
    "DataProviderID": 15,
    "DataProvidersReference": "30648",
    "OperatorID": 31,
    "UsageTypeID": 1,
    "AddressInfo": {
        "ID": 16857,
        "Title": "1025 W Erie Avenue",
        "AddressLine1": "1025 W Erie Avenue",
        "Town": "Lorain",
        "StateOrProvince": "OH",
        "Postcode": "44052",
        "CountryID": 2,
        "Latitude": 41.467067,
        "Longitude": -82.181513,
        "ContactTelephone1": "440-246-5220",
        "RelatedURL": "http://carstations.com/30648",
        "DistanceUnit": 0
    },
    "Connections": [
        {
            "ID": 14941,
            "ConnectionTypeID": 1,
            "Reference": "J1772",
            "LevelID": 2
        },
        {
            "ID": 14998,
            "ConnectionTypeID": 9,
            "Reference": "NEMA5",
            "LevelID": 1,
            "Quantity": 1
        }
    ],
    "NumberOfPoints": 1,
    "StatusTypeID": 0,
    "DateLastStatusUpdate": "2017-11-04T14:04:00Z",
    "DataQualityLevel": 2,
    "DateCreated": "2013-05-03T04:35:00Z",
    "SubmissionStatusTypeID": 100
}