{
    "IsRecentlyVerified": false,
    "ID": 62961,
    "UUID": "D51B010E-4CD7-441D-ABE1-F4F4D9753695",
    "DataProviderID": 26,
    "DataProvidersReference": "76330",
    "OperatorID": 178,
    "OperatorsReference": "EVnetNL PNB-ENO049",
    "UsageCost": "0.00 jaarabonnement",
    "AddressInfo": {
        "ID": 63307,
        "Title": "Geldropstraat 10",
        "AddressLine1": "Geldropstraat 10",
        "Town": "Gemert-Bakel",
        "Postcode": "5423 TV",
        "CountryID": 159,
        "Latitude": 51.579831,
        "Longitude": 5.712073,
        "ContactTelephone1": "0800-3522365",
        "RelatedURL": "http://www.evnet.nl",
        "DistanceUnit": 0
    },
    "Connections": [
        {
            "ID": 80033,
            "ConnectionTypeID": 25,
            "LevelID": 2,
            "PowerKW": 11,
            "CurrentTypeID": 10
        }
    ],
    "NumberOfPoints": 2,
    "StatusTypeID": 50,
    "DateLastStatusUpdate": "2016-06-04T02:39:00Z",
    "DataQualityLevel": 3,
    "DateCreated": "2016-03-03T12:29:00Z",
    "SubmissionStatusTypeID": 100
}