{
    "IsRecentlyVerified": false,
    "ID": 20386,
    "UUID": "6979538D-C110-424A-9A9A-08E53F746296",
    "DataProviderID": 1,
    "OperatorID": 1,
    "UsageTypeID": 0,
    "UsageCost": "",
    "AddressInfo": {
        "ID": 20731,
        "Title": " AutoBleue Provona Leyni",
        "AddressLine1": "3 Rue Provana de Leyni ",
        "AddressLine2": "",
        "Town": "Nice",
        "StateOrProvince": "",
        "Postcode": "06000",
        "CountryID": 80,
        "Latitude": 43.70257,
        "Longitude": 7.27126,
        "ContactTelephone1": "",
        "ContactTelephone2": "",
        "ContactEmail": "",
        "AccessComments": "Réservé aux membres",
        "RelatedURL": "",
        "DistanceUnit": 0
    },
    "Connections": [],
    "GeneralComments": "",
    "StatusTypeID": 50,
    "DateLastStatusUpdate": "2013-11-13T13:29:00Z",
    "DataQualityLevel": 1,
    "DateCreated": "2013-11-13T11:36:00Z",
    "SubmissionStatusTypeID": 200
}