{
    "IsRecentlyVerified": false,
    "ID": 29725,
    "UUID": "46A4029C-3009-4029-AF31-87A9D67DDE77",
    "DataProviderID": 15,
    "DataProvidersReference": "8591",
    "OperatorID": 41,
    "UsageTypeID": 1,
    "AddressInfo": {
        "ID": 30071,
        "Title": "2077 Airport Blvd",
        "AddressLine1": "2077 Airport Blvd",
        "Town": "San Jose",
        "StateOrProvince": "CA",
        "Postcode": "95110",
        "CountryID": 2,
        "Latitude": 37.37028,
        "Longitude": -121.92931,
        "ContactTelephone1": "408-392-3600",
        "RelatedURL": "http://carstations.com/8591",
        "DistanceUnit": 0
    },
    "Connections": [
        {
            "ID": 32710,
            "ConnectionTypeID": 0,
            "Reference": "SPI"
        }
    ],
    "NumberOfPoints": 2,
    "StatusTypeID": 50,
    "DateLastStatusUpdate": "2017-11-04T14:04:00Z",
    "DataQualityLevel": 2,
    "DateCreated": "2014-11-29T05:39:00Z",
    "SubmissionStatusTypeID": 100
}