{
    "IsRecentlyVerified": false,
    "ID": 120227,
    "UUID": "C554FDFC-E1ED-4B60-8AB6-D819252D53A4",
    "DataProviderID": 2,
    "DataProvidersReference": "105153",
    "OperatorID": 5,
    "UsageTypeID": 1,
    "AddressInfo": {
        "ID": 120573,
        "Title": "3600WESTPARMER!",
        "AddressLine1": "3600 W Parmer Ln",
        "Town": "Austin",
        "StateOrProvince": "TX",
        "Postcode": "78727",
        "CountryID": 2,
        "Latitude": 30.4240459,
        "Longitude": -97.7104311,
        "ContactTelephone1": "888-758-4389",
        "AccessComments": "24 hours daily",
        "RelatedURL": "http://www.chargepoint.com/",
        "DistanceUnit": 0
    },
    "Connections": [
        {
            "ID": 169555,
            "ConnectionTypeID": 1,
            "LevelID": 2,
            "Amps": 16,
            "Voltage": 230,
            "PowerKW": 3.7,
            "CurrentTypeID": 10,
            "Quantity": 2
        }
    ],
    "DateLastStatusUpdate": "2020-06-26T02:54:00Z",
    "DataQualityLevel": 3,
    "DateCreated": "2019-04-01T04:59:00Z",
    "SubmissionStatusTypeID": 100
}