{
    "IsRecentlyVerified": false,
    "ID": 90019,
    "UUID": "6A75372D-5037-46F9-9224-DA01E9046E68",
    "DataProviderID": 1,
    "OperatorID": 45,
    "UsageTypeID": 1,
    "AddressInfo": {
        "ID": 90365,
        "Title": "Betriebsgelände AWR",
        "AddressLine1": "Borgstedtfelde 15",
        "Town": "Borgstedt",
        "StateOrProvince": "Hüttener Berge",
        "Postcode": "24794",
        "CountryID": 87,
        "Latitude": 54.34715,
        "Longitude": 9.691980000000058,
        "ContactTelephone1": "+49 4331 345 - 123",
        "AccessComments": "Die Säule ist nutzbar von Mo-Fr 07:00 bis 17:00 Uhr , Sa: 09:00 bis 13:00 Uhr auf dem Betriebsgelände der AWR.\r\n",
        "RelatedURL": "http://www.awr.de/ueber-uns/das-sind-wir/news/detail/artikel/awr-eroeffnet-e-ladesaeule",
        "DistanceUnit": 0
    },
    "Connections": [
        {
            "ID": 127614,
            "ConnectionTypeID": 25,
            "StatusTypeID": 50,
            "LevelID": 2,
            "Amps": 32,
            "Voltage": 400,
            "PowerKW": 22,
            "CurrentTypeID": 20,
            "Quantity": 4
        }
    ],
    "NumberOfPoints": 4,
    "StatusTypeID": 50,
    "DateLastStatusUpdate": "2017-07-04T09:53:00Z",
    "DataQualityLevel": 1,
    "DateCreated": "2017-07-04T09:53:00Z",
    "SubmissionStatusTypeID": 200
}