{
    "IsRecentlyVerified": false,
    "ID": 121448,
    "UUID": "723373DD-472A-4D9A-AA7F-E6A1B819AACD",
    "DataProviderID": 1,
    "OperatorID": 3315,
    "OperatorsReference": "51852",
    "UsageTypeID": 4,
    "UsageCost": "Free",
    "AddressInfo": {
        "ID": 121794,
        "Title": "Graham Avenue, Clydebank",
        "AddressLine1": "La Scala Apartments",
        "Town": "Graham Avenue",
        "StateOrProvince": "West Dunbartonshire",
        "Postcode": "G81 3AG",
        "CountryID": 1,
        "Latitude": 55.90878,
        "Longitude": -4.40482,
        "DistanceUnit": 0
    },
    "Connections": [
        {
            "ID": 171111,
            "ConnectionTypeID": 25,
            "StatusTypeID": 50,
            "LevelID": 2,
            "Amps": 32,
            "Voltage": 230,
            "PowerKW": 7,
            "CurrentTypeID": 10,
            "Quantity": 2
        }
    ],
    "NumberOfPoints": 2,
    "StatusTypeID": 50,
    "DateLastStatusUpdate": "2019-06-14T05:14:00Z",
    "DataQualityLevel": 1,
    "DateCreated": "2019-04-02T05:16:00Z",
    "SubmissionStatusTypeID": 200
}