{
    "MediaItems": [
        {
            "ID": 23711,
            "ChargePointID": 162174,
            "ItemURL": "https://s3-ap-southeast-2.amazonaws.com/openchargemap/images/AT/OCM162174/OCM-162174.orig.2020080209163392.jpg",
            "ItemThumbnailURL": "https://s3-ap-southeast-2.amazonaws.com/openchargemap/images/AT/OCM162174/OCM-162174.thmb.2020080209163392.jpg",
            "Comment": "",
            "IsEnabled": true,
            "IsVideo": false,
            "IsFeaturedItem": false,
            "IsExternalResource": false,
            "User": {
                "ID": 26760,
                "Username": "interssl.com"
            },
            "DateCreated": "2020-08-02T09:17:00Z"
        },
        {
            "ID": 23707,
            "ChargePointID": 162174,
            "ItemURL": "https://s3-ap-southeast-2.amazonaws.com/openchargemap/images/AT/OCM162174/OCM-162174.orig.2020080209153343.jpg",
            "ItemThumbnailURL": "https://s3-ap-southeast-2.amazonaws.com/openchargemap/images/AT/OCM162174/OCM-162174.thmb.2020080209153343.jpg",
            "Comment": "",
            "IsEnabled": true,
            "IsVideo": false,
            "IsFeaturedItem": false,
            "IsExternalResource": false,
            "User": {
                "ID": 26760,
                "Username": "interssl.com"
            },
            "DateCreated": "2020-08-02T09:16:00Z"
        },
        {
            "ID": 23708,
            "ChargePointID": 162174,
            "ItemURL": "https://s3-ap-southeast-2.amazonaws.com/openchargemap/images/AT/OCM162174/OCM-162174.orig.2020080209154592.jpg",
            "ItemThumbnailURL": "https://s3-ap-southeast-2.amazonaws.com/openchargemap/images/AT/OCM162174/OCM-162174.thmb.2020080209154592.jpg",
            "Comment": "",
            "IsEnabled": true,
            "IsVideo": false,
            "IsFeaturedItem": false,
            "IsExternalResource": false,
            "User": {
                "ID": 26760,
                "Username": "interssl.com"
            },
            "DateCreated": "2020-08-02T09:16:00Z"
        },
        {
            "ID": 23709,
            "ChargePointID": 162174,
            "ItemURL": "https://s3-ap-southeast-2.amazonaws.com/openchargemap/images/AT/OCM162174/OCM-162174.orig.2020080209160186.jpg",
            "ItemThumbnailURL": "https://s3-ap-southeast-2.amazonaws.com/openchargemap/images/AT/OCM162174/OCM-162174.thmb.2020080209160186.jpg",
            "Comment": "",
            "IsEnabled": true,
            "IsVideo": false,
            "IsFeaturedItem": false,
            "IsExternalResource": false,
            "User": {
                "ID": 26760,
                "Username": "interssl.com"
            },
            "DateCreated": "2020-08-02T09:16:00Z"
        },
        {
            "ID": 23710,
            "ChargePointID": 162174,
            "ItemURL": "https://s3-ap-southeast-2.amazonaws.com/openchargemap/images/AT/OCM162174/OCM-162174.orig.2020080209161530.jpg",
            "ItemThumbnailURL": "https://s3-ap-southeast-2.amazonaws.com/openchargemap/images/AT/OCM162174/OCM-162174.thmb.2020080209161530.jpg",
            "Comment": "",
            "IsEnabled": true,
            "IsVideo": false,
            "IsFeaturedItem": false,
            "IsExternalResource": false,
            "User": {
                "ID": 26760,
                "Username": "interssl.com"
            },
            "DateCreated": "2020-08-02T09:16:00Z"
        },
        {
            "ID": 23706,
            "ChargePointID": 162174,
            "ItemURL": "https://s3-ap-southeast-2.amazonaws.com/openchargemap/images/AT/OCM162174/OCM-162174.orig.2020080209152069.jpg",
            "ItemThumbnailURL": "https://s3-ap-southeast-2.amazonaws.com/openchargemap/images/AT/OCM162174/OCM-162174.thmb.2020080209152069.jpg",
            "Comment": "",
            "IsEnabled": true,
            "IsVideo": false,
            "IsFeaturedItem": false,
            "IsExternalResource": false,
            "User": {
                "ID": 26760,
                "Username": "interssl.com"
            },
            "DateCreated": "2020-08-02T09:15:00Z"
        }
    ],
    "IsRecentlyVerified": false,
    "ID": 162174,
    "UUID": "B5F3A9AC-6568-4F92-976F-0E6BB1D02147",
    "DataProviderID": 1,
    "OperatorID": 3261,
    "UsageTypeID": 1,
    "UsageCost": "paid",
    "AddressInfo": {
        "ID": 162531,
        "Title": "Schwimmbad Schwaz",
        "AddressLine1": "Innsbrucker Straße 72",
        "Town": "Stadt Schwaz",
        "StateOrProvince": "Bezirk Schwaz",
        "Postcode": "6130",
        "CountryID": 19,
        "Latitude": 47.3365962536447,
        "Longitude": 11.705197624381071,
        "DistanceUnit": 0
    },
    "Connections": [
        {
            "ID": 233390,
            "ConnectionTypeID": 25,
            "StatusTypeID": 50,
            "LevelID": 2,
            "Amps": 32,
            "PowerKW": 22,
            "CurrentTypeID": 20,
            "Quantity": 1
        }
    ],
    "NumberOfPoints": 1,
    "GeneralComments": "4h free parking.  NO CASH PAYMENT, credit card or maestro/debit card payments only !",
    "StatusTypeID": 50,
    "DateLastStatusUpdate": "2020-08-04T09:44:00Z",
    "DataQualityLevel": 1,
    "DateCreated": "2020-08-02T09:15:00Z",
    "SubmissionStatusTypeID": 200
}