{
    "IsRecentlyVerified": false,
    "ID": 175725,
    "UUID": "DA5E2676-320D-4DAE-B8C6-0F688FDC8BF2",
    "DataProviderID": 1,
    "OperatorID": 3274,
    "UsageTypeID": 1,
    "AddressInfo": {
        "ID": 176084,
        "Title": "Les Champs-Blancs - Chavannes-de-Bogis",
        "AddressLine1": "Les Champs-Blancs Switzerland",
        "Town": "Chavannes-de-Bogis",
        "Postcode": "1279",
        "CountryID": 217,
        "Latitude": 46.334641695756346,
        "Longitude": 6.1614469259375255,
        "DistanceUnit": 0
    },
    "Connections": [
        {
            "ID": 272881,
            "ConnectionTypeID": 33,
            "StatusTypeID": 50,
            "LevelID": 3,
            "PowerKW": 150,
            "CurrentTypeID": 30,
            "Quantity": 2
        },
        {
            "ID": 272882,
            "ConnectionTypeID": 1036,
            "StatusTypeID": 50,
            "LevelID": 2,
            "PowerKW": 11,
            "CurrentTypeID": 20,
            "Quantity": 2
        }
    ],
    "NumberOfPoints": 2,
    "StatusTypeID": 50,
    "DateLastStatusUpdate": "2021-06-09T22:29:00Z",
    "DataQualityLevel": 1,
    "DateCreated": "2021-06-09T09:51:00Z",
    "SubmissionStatusTypeID": 200
}