{
    "IsRecentlyVerified": false,
    "ID": 135746,
    "UUID": "0855EB72-6B58-4B94-838F-7A20680C0D44",
    "DataProviderID": 18,
    "DataProvidersReference": "d4b5ede962d87a4fd0c79272269209b0",
    "OperatorID": 2244,
    "UsageTypeID": 5,
    "AddressInfo": {
        "ID": 136092,
        "Title": "Pellatt Road",
        "AddressLine1": "Pellatt Road",
        "Town": "London",
        "Postcode": "SE22 9JB",
        "CountryID": 1,
        "Latitude": 51.454244,
        "Longitude": -0.075163,
        "AccessComments": "",
        "RelatedURL": "https://www.ubitricity.com",
        "DistanceUnit": 0
    },
    "Connections": [
        {
            "ID": 190166,
            "ConnectionTypeID": 25,
            "Reference": "suby1100001390",
            "StatusTypeID": 50,
            "LevelID": 2,
            "Amps": 16,
            "Voltage": 230,
            "PowerKW": 3.7,
            "CurrentTypeID": 10
        }
    ],
    "StatusTypeID": 0,
    "DateLastStatusUpdate": "2021-04-25T05:46:00Z",
    "MetadataValues": [
        {
            "ID": 5598,
            "MetadataFieldID": 4,
            "ItemValue": "Contains public sector information licensed under the Open Government Licence v2.0. http://www.nationalarchives.gov.uk/doc/open-government-licence/version/2/"
        }
    ],
    "DataQualityLevel": 3,
    "DateCreated": "2019-12-24T05:22:00Z",
    "SubmissionStatusTypeID": 100
}