{
    "IsRecentlyVerified": false,
    "ID": 145842,
    "UUID": "0B66D7EC-9FB5-4232-BA1B-DE9C9351ABD3",
    "DataProviderID": 2,
    "DataProvidersReference": "83806",
    "UsageTypeID": 4,
    "AddressInfo": {
        "ID": 146194,
        "Title": "Edmonton Public Library - Mill Woods Branch",
        "AddressLine1": "2610 Hewes Way NW",
        "Town": "Edmonton",
        "StateOrProvince": "AB",
        "Postcode": "T6L 0A9",
        "CountryID": 44,
        "Latitude": 53.4566,
        "Longitude": -113.427401,
        "ContactTelephone1": "780-496-1818",
        "AccessComments": "10am-9pm M-Th, 10am-6pm F-Sat, 1pm-5pm Sun; Front desk key\r\nPublic - Card key at all times",
        "RelatedURL": "",
        "DistanceUnit": 0
    },
    "Connections": [
        {
            "ID": 202614,
            "ConnectionTypeID": 1,
            "LevelID": 2,
            "Amps": 16,
            "Voltage": 230,
            "PowerKW": 3.7,
            "CurrentTypeID": 10,
            "Quantity": 3
        }
    ],
    "StatusTypeID": 50,
    "DateLastStatusUpdate": "2020-06-26T03:12:00Z",
    "DataQualityLevel": 3,
    "DateCreated": "2019-12-24T09:25:00Z",
    "SubmissionStatusTypeID": 100
}