{
    "IsRecentlyVerified": false,
    "ID": 28010,
    "UUID": "D02EA284-EB96-4BE5-92E4-738E26DB5B2F",
    "DataProviderID": 2,
    "DataProvidersReference": "58331",
    "OperatorID": 5,
    "UsageTypeID": 1,
    "AddressInfo": {
        "ID": 28356,
        "Title": "CARSON CITY",
        "AddressLine1": "905 N Roop St",
        "Town": "Carson City",
        "StateOrProvince": "NV",
        "Postcode": "89701",
        "CountryID": 2,
        "Latitude": 39.1691251,
        "Longitude": -119.7608219,
        "ContactTelephone1": "888-758-4389",
        "AccessComments": "24 hours daily",
        "RelatedURL": "http://www.chargepoint.com/",
        "DistanceUnit": 0
    },
    "Connections": [
        {
            "ID": 30770,
            "ConnectionTypeID": 1,
            "LevelID": 2,
            "Amps": 16,
            "Voltage": 230,
            "PowerKW": 3,
            "CurrentTypeID": 10,
            "Quantity": 2
        }
    ],
    "DateLastStatusUpdate": "2019-04-06T04:03:00Z",
    "DataQualityLevel": 3,
    "DateCreated": "2014-11-28T03:38:00Z",
    "SubmissionStatusTypeID": 100
}