{
    "IsRecentlyVerified": false,
    "ID": 145695,
    "UUID": "BA77E250-FACB-4486-8AFB-30FEFCD9BE74",
    "DataProviderID": 2,
    "DataProvidersReference": "129984",
    "OperatorID": 89,
    "UsageTypeID": 1,
    "AddressInfo": {
        "ID": 146047,
        "Title": "Kwantlen Polytechnic University - 5600 Kwantlen Street",
        "AddressLine1": "5600 Kwantlen St.",
        "Town": "Richmond",
        "StateOrProvince": "BC",
        "Postcode": "V6X 2X9",
        "CountryID": 44,
        "Latitude": 49.175378,
        "Longitude": -123.128088,
        "ContactTelephone1": "888-356-8911",
        "AccessComments": "24 hours daily",
        "RelatedURL": "https://flo.ca/",
        "DistanceUnit": 0
    },
    "Connections": [
        {
            "ID": 202418,
            "ConnectionTypeID": 1,
            "LevelID": 2,
            "Amps": 16,
            "Voltage": 230,
            "PowerKW": 3.7,
            "CurrentTypeID": 10,
            "Quantity": 6
        }
    ],
    "StatusTypeID": 50,
    "DateLastStatusUpdate": "2020-06-26T03:11:00Z",
    "DataQualityLevel": 3,
    "DateCreated": "2019-12-24T09:25:00Z",
    "SubmissionStatusTypeID": 100
}