{
    "IsRecentlyVerified": false,
    "ID": 93743,
    "UUID": "24096C3A-D62F-4E68-B818-62FF047D7C47",
    "DataProviderID": 1,
    "OperatorID": 25,
    "OperatorsReference": "camden-goldhurstterrace",
    "UsageTypeID": 4,
    "UsageCost": "£0.073/minute; min £1.38; other tariffs available",
    "AddressInfo": {
        "ID": 94089,
        "Title": "Goldhurst Terrace",
        "AddressLine1": "2 Goldhurst Terrace",
        "Town": "LONDON",
        "Postcode": "NW6 3HD",
        "CountryID": 1,
        "Latitude": 51.5454845806,
        "Longitude": -0.179941745799,
        "DistanceUnit": 0
    },
    "Connections": [
        {
            "ID": 132723,
            "ConnectionTypeID": 25,
            "StatusTypeID": 50,
            "LevelID": 2,
            "Amps": 32,
            "Voltage": 230,
            "PowerKW": 7,
            "CurrentTypeID": 10,
            "Quantity": 1
        },
        {
            "ID": 132724,
            "ConnectionTypeID": 1,
            "StatusTypeID": 50,
            "LevelID": 2,
            "Amps": 16,
            "Voltage": 230,
            "PowerKW": 4,
            "CurrentTypeID": 10,
            "Quantity": 1
        }
    ],
    "NumberOfPoints": 1,
    "StatusTypeID": 50,
    "DateLastStatusUpdate": "2019-05-12T05:26:00Z",
    "DataQualityLevel": 1,
    "DateCreated": "2017-10-07T05:26:00Z",
    "SubmissionStatusTypeID": 200
}