{
    "IsRecentlyVerified": false,
    "ID": 3614,
    "UUID": "49BDE199-D462-44A3-B697-BA0566D03781",
    "DataProviderID": 1,
    "OperatorID": 5,
    "UsageTypeID": 1,
    "AddressInfo": {
        "ID": 3615,
        "Title": "Bellevue City Hall",
        "AddressLine1": "450 110th Ave NE",
        "Town": "Bellevue",
        "StateOrProvince": "WA",
        "Postcode": "98004",
        "CountryID": 2,
        "Latitude": 47.61480331,
        "Longitude": -122.193222,
        "ContactTelephone1": "888-758-4389",
        "DistanceUnit": 0
    },
    "Connections": [
        {
            "ID": 129,
            "ConnectionTypeID": 1,
            "Quantity": 1
        }
    ],
    "NumberOfPoints": 1,
    "DateLastStatusUpdate": "2019-12-15T06:07:00Z",
    "DateCreated": "2010-02-28T00:00:00Z",
    "SubmissionStatusTypeID": 200
}