{
    "IsRecentlyVerified": false,
    "ID": 9571,
    "UUID": "F316F7D3-2B7D-4787-BE48-463D1E56AEE0",
    "DataProviderID": 15,
    "DataProvidersReference": "14648",
    "OperatorID": 94,
    "UsageTypeID": 2,
    "AddressInfo": {
        "ID": 9468,
        "Title": "5306 Hollister Street",
        "AddressLine1": "5306 Hollister Street",
        "Town": "Houston",
        "StateOrProvince": "Texas",
        "Postcode": "77040",
        "CountryID": 2,
        "Latitude": 29.84505,
        "Longitude": -95.50603,
        "ContactTelephone1": "713-430-3000",
        "RelatedURL": "http://carstations.com/14648",
        "DistanceUnit": 0
    },
    "Connections": [
        {
            "ID": 7279,
            "ConnectionTypeID": 1,
            "Reference": "J1772",
            "LevelID": 2
        }
    ],
    "NumberOfPoints": 12,
    "StatusTypeID": 0,
    "DateLastStatusUpdate": "2017-11-04T14:03:00Z",
    "DataQualityLevel": 2,
    "DateCreated": "2012-02-26T15:07:00Z",
    "SubmissionStatusTypeID": 100
}