{
    "UserComments": [
        {
            "ID": 21026,
            "ChargePointID": 121393,
            "CommentTypeID": 10,
            "UserName": "Erna_Schleck",
            "Comment": "Leicht zu finden, man fährt darauf zu. Mitten im Wohngebiet ",
            "Rating": 5,
            "DateCreated": "2019-05-20T08:09:15.437Z",
            "User": {
                "ID": 4573,
                "Username": "Erna_Schleck"
            }
        }
    ],
    "IsRecentlyVerified": false,
    "ID": 121393,
    "UUID": "7E785E75-E1C8-4203-8061-DB58CE6362C2",
    "DataProviderID": 1,
    "OperatorID": 105,
    "UsageTypeID": 4,
    "UsageCost": "kostenlos, free",
    "AddressInfo": {
        "ID": 121739,
        "Title": "Autobahnkirche Exter",
        "AddressLine1": "Alter Schulweg 7",
        "AddressLine2": "Exter",
        "Town": "Vlotho",
        "StateOrProvince": "Kreis Herford",
        "Postcode": "32602",
        "CountryID": 87,
        "Latitude": 52.1397950272835,
        "Longitude": 8.78037936493615,
        "AccessComments": "24/7 verfügbare Ladesäule vom RWE Typ an der Autobahnkirche Exter auf dem Parkplatz, davor, BAB 2 Ausfahrt Vlotho-West. ",
        "DistanceUnit": 0
    },
    "Connections": [
        {
            "ID": 170870,
            "ConnectionTypeID": 25,
            "StatusTypeID": 50,
            "LevelID": 2,
            "Amps": 32,
            "Voltage": 400,
            "PowerKW": 22,
            "CurrentTypeID": 20,
            "Quantity": 2
        }
    ],
    "NumberOfPoints": 2,
    "StatusTypeID": 50,
    "DateLastStatusUpdate": "2019-05-20T08:25:00Z",
    "DataQualityLevel": 1,
    "DateCreated": "2019-04-01T10:53:00Z",
    "SubmissionStatusTypeID": 200
}