{
    "MediaItems": [
        {
            "ID": 1631,
            "ChargePointID": 47782,
            "ItemURL": "https://s3-ap-southeast-2.amazonaws.com/openchargemap/images/US/OCM47782/OCM-47782.orig.2015070323462708.jpg",
            "ItemThumbnailURL": "https://s3-ap-southeast-2.amazonaws.com/openchargemap/images/US/OCM47782/OCM-47782.thmb.2015070323462708.jpg",
            "Comment": "View of the garage door at 226 N Commerce Street. Chargers inside....call 815 275 9469 for acess",
            "IsEnabled": true,
            "IsVideo": false,
            "IsFeaturedItem": false,
            "IsExternalResource": false,
            "User": {
                "ID": 4936,
                "Username": "Galenabrewery"
            },
            "DateCreated": "2015-07-03T23:47:00Z"
        }
    ],
    "IsRecentlyVerified": false,
    "ID": 47782,
    "UUID": "9672A0DC-58B3-410D-8808-CD0B0DCEE3B2",
    "DataProviderID": 1,
    "OperatorID": 23,
    "UsageTypeID": 5,
    "UsageCost": "Free",
    "AddressInfo": {
        "ID": 48128,
        "Title": "Galena Brewing Company",
        "AddressLine1": "226 North Commerce Street",
        "Town": "Galena",
        "StateOrProvince": "Il",
        "Postcode": "61036",
        "CountryID": 2,
        "Latitude": 42.4167688,
        "Longitude": -90.4259958,
        "ContactTelephone1": "8152759469",
        "ContactTelephone2": "8157769917",
        "ContactEmail": "info@galenabrewery.com",
        "AccessComments": "Access door (large garage door) at 226 North Commerce Street opposite the Galena Lumber Yard",
        "RelatedURL": "http://www.galenabrewery.com",
        "DistanceUnit": 0
    },
    "Connections": [
        {
            "ID": 58921,
            "ConnectionTypeID": 30,
            "StatusTypeID": 50,
            "LevelID": 2,
            "Amps": 80,
            "Voltage": 240,
            "PowerKW": 20,
            "CurrentTypeID": 10,
            "Quantity": 2
        },
        {
            "ID": 58922,
            "ConnectionTypeID": 1,
            "StatusTypeID": 50,
            "LevelID": 2,
            "Amps": 60,
            "Voltage": 240,
            "PowerKW": 15.5,
            "CurrentTypeID": 10,
            "Quantity": 1
        }
    ],
    "NumberOfPoints": 2,
    "GeneralComments": "2 Tesla 80A 20kW High Powered Wall Chargers, 1 SAE 1772 60A 15.5kW charger",
    "StatusTypeID": 50,
    "DateLastStatusUpdate": "2015-07-03T23:47:00Z",
    "DataQualityLevel": 1,
    "DateCreated": "2015-06-09T16:10:00Z",
    "SubmissionStatusTypeID": 200
}