{
    "IsRecentlyVerified": false,
    "ID": 32340,
    "UUID": "23B12BF6-E45C-434D-9D4E-2C6874254F34",
    "DataProviderID": 1,
    "OperatorID": 105,
    "OperatorsReference": "Essent EM-DE-05382036-01-00002",
    "UsageTypeID": 4,
    "AddressInfo": {
        "ID": 32686,
        "Title": "Auf dem Bonnenfeld",
        "AddressLine1": "Auf dem Bonnenfeld",
        "Town": "Much",
        "Postcode": "53804",
        "CountryID": 87,
        "Latitude": 50.903591,
        "Longitude": 7.399863,
        "DistanceUnit": 0
    },
    "Connections": [
        {
            "ID": 35851,
            "ConnectionTypeID": 25,
            "LevelID": 2,
            "PowerKW": 11
        },
        {
            "ID": 46345,
            "ConnectionTypeID": 25,
            "LevelID": 2,
            "PowerKW": 11
        }
    ],
    "NumberOfPoints": 1,
    "StatusTypeID": 50,
    "DateLastStatusUpdate": "2015-04-13T17:30:00Z",
    "DataQualityLevel": 3,
    "DateCreated": "2015-01-09T06:03:00Z",
    "SubmissionStatusTypeID": 200
}