{
    "IsRecentlyVerified": false,
    "ID": 63915,
    "UUID": "68A14F33-D311-47CF-B8D7-BD80B1D701E7",
    "DataProviderID": 26,
    "DataProvidersReference": "77681",
    "OperatorID": 73,
    "OperatorsReference": "EV-Box EVB-P1449068",
    "UsageCost": "0.00 jaarabonnement",
    "AddressInfo": {
        "ID": 64261,
        "Title": "Stammerkamp 1-TRAF",
        "AddressLine1": "Stammerkamp 1-TRAF",
        "Town": "Diemen",
        "Postcode": "1112 VE",
        "CountryID": 159,
        "Latitude": 52.33315,
        "Longitude": 4.98594,
        "RelatedURL": "http://www.ev-box.nl",
        "DistanceUnit": 0
    },
    "Connections": [
        {
            "ID": 81679,
            "ConnectionTypeID": 25,
            "LevelID": 2,
            "PowerKW": 11,
            "CurrentTypeID": 10
        },
        {
            "ID": 81680,
            "ConnectionTypeID": 25,
            "LevelID": 2,
            "PowerKW": 11,
            "CurrentTypeID": 10
        }
    ],
    "NumberOfPoints": 1,
    "StatusTypeID": 50,
    "DateLastStatusUpdate": "2016-06-04T02:53:00Z",
    "DataQualityLevel": 3,
    "DateCreated": "2016-03-03T12:32:00Z",
    "SubmissionStatusTypeID": 100
}