{
    "IsRecentlyVerified": false,
    "ID": 126162,
    "UUID": "074A11C6-CA0D-4C2E-A674-7AF4CEBB6548",
    "DataProviderID": 1,
    "OperatorID": 3,
    "OperatorsReference": "PG-82077..PG-82079,PG-83116",
    "UsageTypeID": 4,
    "UsageCost": "£0.20/kWh",
    "AddressInfo": {
        "ID": 126508,
        "Title": "Cloth Halls",
        "AddressLine1": "Spinning Acres Lane",
        "Town": "Headingley",
        "StateOrProvince": "Leeds",
        "Postcode": "LS6 4FF",
        "CountryID": 1,
        "Latitude": 53.8268626646955,
        "Longitude": -1.57868050648835,
        "DistanceUnit": 0
    },
    "Connections": [
        {
            "ID": 176815,
            "ConnectionTypeID": 25,
            "StatusTypeID": 50,
            "LevelID": 2,
            "Amps": 32,
            "Voltage": 230,
            "PowerKW": 7,
            "CurrentTypeID": 10,
            "Quantity": 6
        },
        {
            "ID": 231540,
            "ConnectionTypeID": 25,
            "StatusTypeID": 50,
            "LevelID": 2,
            "Amps": 16,
            "Voltage": 230,
            "PowerKW": 3,
            "CurrentTypeID": 10,
            "Quantity": 2
        }
    ],
    "NumberOfPoints": 12,
    "GeneralComments": "This is an open charge unit installed at the Cloth Halls site at Spinning Acres Lane, Headingley, Leeds",
    "StatusTypeID": 50,
    "DateLastStatusUpdate": "2021-03-15T06:32:00Z",
    "DataQualityLevel": 1,
    "DateCreated": "2019-05-13T13:17:00Z",
    "SubmissionStatusTypeID": 200
}