{
    "IsRecentlyVerified": false,
    "ID": 153911,
    "UUID": "7DF0651C-06D5-406E-BE06-F2FF40BE3B3A",
    "DataProviderID": 28,
    "DataProvidersReference": "FR*A07*PCCHVC01",
    "AddressInfo": {
        "ID": 154264,
        "Title": "CCHVC 1 - Chevreuse - Parc des Sports - EF + T2 (2)",
        "AddressLine1": "10 Rue Charles Michels, Chevreuse",
        "CountryID": 80,
        "Latitude": 48.705908,
        "Longitude": 2.045842,
        "AccessComments": "24h/24 7j/7",
        "DistanceUnit": 0
    },
    "Connections": [
        {
            "ID": 216201,
            "ConnectionTypeID": 1036,
            "StatusTypeID": 50,
            "LevelID": 2,
            "PowerKW": 22,
            "CurrentTypeID": 20
        },
        {
            "ID": 216202,
            "ConnectionTypeID": 28,
            "StatusTypeID": 50,
            "LevelID": 2,
            "PowerKW": 22,
            "CurrentTypeID": 10
        },
        {
            "ID": 250163,
            "ConnectionTypeID": 1036,
            "StatusTypeID": 50,
            "LevelID": 2,
            "PowerKW": 22,
            "CurrentTypeID": 20
        },
        {
            "ID": 250164,
            "ConnectionTypeID": 28,
            "StatusTypeID": 50,
            "LevelID": 2,
            "PowerKW": 22,
            "CurrentTypeID": 10
        }
    ],
    "GeneralComments": "Recharge normale et accélérée, accessible par badge après réservation sur le site internet cchvc.clem.mobi ou depuis l'application mobile Clem' Ecomobilité -Informations sur le site : cchvc.clem.mobi",
    "StatusTypeID": 50,
    "DateLastStatusUpdate": "2020-08-27T05:15:00Z",
    "DataQualityLevel": 2,
    "DateCreated": "2020-03-15T10:54:00Z",
    "SubmissionStatusTypeID": 100
}