{
    "IsRecentlyVerified": false,
    "ID": 185205,
    "UUID": "288F4987-B3C3-4EDC-B8EF-492DE5958936",
    "DataProviderID": 29,
    "DataProvidersReference": "1979",
    "OperatorID": 220,
    "AddressInfo": {
        "ID": 185564,
        "Title": "Schellingstraße 23",
        "AddressLine1": "Schellingstraße 23",
        "Town": "Hamburg",
        "Postcode": "22089",
        "CountryID": 87,
        "Latitude": 53.569286,
        "Longitude": 10.047905,
        "DistanceUnit": 0
    },
    "Connections": [
        {
            "ID": 294375,
            "ConnectionTypeID": 28,
            "StatusTypeID": 50,
            "LevelID": 2,
            "PowerKW": 22,
            "CurrentTypeID": 20
        },
        {
            "ID": 294376,
            "ConnectionTypeID": 25,
            "StatusTypeID": 50,
            "LevelID": 2,
            "PowerKW": 22,
            "CurrentTypeID": 20
        },
        {
            "ID": 301745,
            "ConnectionTypeID": 28,
            "StatusTypeID": 50,
            "LevelID": 2,
            "PowerKW": 22,
            "CurrentTypeID": 20
        },
        {
            "ID": 301746,
            "ConnectionTypeID": 25,
            "StatusTypeID": 50,
            "LevelID": 2,
            "PowerKW": 22,
            "CurrentTypeID": 20
        }
    ],
    "StatusTypeID": 50,
    "DateLastStatusUpdate": "2021-07-12T02:51:00Z",
    "MetadataValues": [
        {
            "ID": 17496,
            "MetadataFieldID": 4,
            "ItemValue": "Data from the German chargepoint registry provided by Bundesnetzagentur.de under the CC-BY 4.0 license"
        }
    ],
    "DataQualityLevel": 3,
    "DateCreated": "2021-07-08T10:06:00Z",
    "SubmissionStatusTypeID": 100
}