{
    "UserComments": [
        {
            "ID": 13751,
            "ChargePointID": 47956,
            "CommentTypeID": 10,
            "UserName": "Robert Malcolm Kay",
            "Comment": "",
            "Rating": 5,
            "DateCreated": "2016-07-02T14:46:32.883Z",
            "User": {
                "ID": 4751,
                "Username": "Robert Malcolm Kay"
            },
            "CheckinStatusTypeID": 10
        },
        {
            "ID": 13750,
            "ChargePointID": 47956,
            "CommentTypeID": 10,
            "UserName": "Robert Malcolm Kay",
            "Comment": "In the ferry car park: appears to be free of parking charges. Danger of ICING as the signage is poor and the location is busy: needs green paint marking.",
            "Rating": 5,
            "DateCreated": "2016-07-02T14:45:05.137Z",
            "User": {
                "ID": 4751,
                "Username": "Robert Malcolm Kay"
            },
            "CheckinStatusTypeID": 10
        }
    ],
    "MediaItems": [
        {
            "ID": 7699,
            "ChargePointID": 47956,
            "ItemURL": "https://s3-ap-southeast-2.amazonaws.com/openchargemap/images/GB/OCM47956/OCM-47956.orig.2016070214454774.jpg",
            "ItemThumbnailURL": "https://s3-ap-southeast-2.amazonaws.com/openchargemap/images/GB/OCM47956/OCM-47956.thmb.2016070214454774.jpg",
            "Comment": "",
            "IsEnabled": true,
            "IsVideo": false,
            "IsFeaturedItem": false,
            "IsExternalResource": false,
            "User": {
                "ID": 4751,
                "Username": "Robert Malcolm Kay"
            },
            "DateCreated": "2016-07-02T14:46:00Z"
        }
    ],
    "IsRecentlyVerified": false,
    "ID": 47956,
    "UUID": "79F5888D-97F3-4DC0-AC50-FF6571BF0E3C",
    "DataProviderID": 1,
    "OperatorID": 3315,
    "OperatorsReference": "51090",
    "UsageTypeID": 4,
    "UsageCost": "Free",
    "AddressInfo": {
        "ID": 48302,
        "Title": "Shell Street Car Park",
        "AddressLine1": "Stornoway Port Authority",
        "AddressLine2": "Esplanade Quay",
        "Town": "Eilean Siar",
        "StateOrProvince": "Isle of Lewis",
        "Postcode": "HS1 2BS",
        "CountryID": 1,
        "Latitude": 58.20789,
        "Longitude": -6.39157,
        "DistanceUnit": 0
    },
    "Connections": [
        {
            "ID": 59163,
            "ConnectionTypeID": 2,
            "StatusTypeID": 50,
            "LevelID": 3,
            "PowerKW": 50,
            "CurrentTypeID": 30,
            "Quantity": 1
        },
        {
            "ID": 59164,
            "ConnectionTypeID": 1036,
            "StatusTypeID": 100,
            "LevelID": 3,
            "Amps": 63,
            "Voltage": 400,
            "PowerKW": 43,
            "CurrentTypeID": 20,
            "Quantity": 1
        }
    ],
    "NumberOfPoints": 1,
    "StatusTypeID": 75,
    "DateLastStatusUpdate": "2020-01-10T09:55:00Z",
    "DataQualityLevel": 1,
    "DateCreated": "2015-06-19T12:13:00Z",
    "SubmissionStatusTypeID": 100
}