{
    "IsRecentlyVerified": false,
    "ID": 143584,
    "UUID": "5924EC78-1816-4B28-9689-3B20BD805E85",
    "DataProviderID": 2,
    "DataProvidersReference": "129507",
    "OperatorID": 89,
    "UsageTypeID": 1,
    "AddressInfo": {
        "ID": 143936,
        "Title": "Wilfrid Laurier University",
        "AddressLine1": "75 University Ave W",
        "Town": "Waterloo",
        "StateOrProvince": "ON",
        "Postcode": "N2L 3C5",
        "CountryID": 44,
        "Latitude": 43.474038,
        "Longitude": -80.527807,
        "ContactTelephone1": "888-356-8911",
        "AccessComments": "24 hours daily",
        "RelatedURL": "https://flo.ca/",
        "DistanceUnit": 0
    },
    "Connections": [
        {
            "ID": 199936,
            "ConnectionTypeID": 1,
            "LevelID": 2,
            "Amps": 16,
            "Voltage": 230,
            "PowerKW": 3.7,
            "CurrentTypeID": 10,
            "Quantity": 4
        }
    ],
    "StatusTypeID": 50,
    "DateLastStatusUpdate": "2020-06-26T03:07:00Z",
    "DataQualityLevel": 3,
    "DateCreated": "2019-12-24T09:21:00Z",
    "SubmissionStatusTypeID": 100
}