{
    "IsRecentlyVerified": false,
    "ID": 124492,
    "UUID": "683F8823-FDDE-4618-93A7-3497BEA499DD",
    "DataProviderID": 2,
    "DataProvidersReference": "62045",
    "UsageTypeID": 1,
    "AddressInfo": {
        "ID": 124838,
        "Title": "Trillium - Yolo County Transportation District",
        "AddressLine1": "350 Industrial Way",
        "Town": "Woodland",
        "StateOrProvince": "CA",
        "Postcode": "95776",
        "CountryID": 2,
        "Latitude": 38.679225,
        "Longitude": -121.753508,
        "ContactTelephone1": "800-920-1166  530-661-0816",
        "AccessComments": "24 hours daily",
        "RelatedURL": "",
        "DistanceUnit": 0
    },
    "Connections": [
        {
            "ID": 174599,
            "ConnectionTypeID": 1,
            "LevelID": 2,
            "Amps": 16,
            "Voltage": 230,
            "PowerKW": 3.7,
            "CurrentTypeID": 10,
            "Quantity": 2
        }
    ],
    "DateLastStatusUpdate": "2020-06-26T03:00:00Z",
    "DataQualityLevel": 3,
    "DateCreated": "2019-04-06T05:03:00Z",
    "SubmissionStatusTypeID": 100
}