{
    "IsRecentlyVerified": false,
    "ID": 43616,
    "UUID": "03A94974-FF80-4299-9DB6-514811C0DF72",
    "DataProviderID": 1,
    "OperatorID": 45,
    "UsageTypeID": 6,
    "UsageCost": "0",
    "AddressInfo": {
        "ID": 43962,
        "Title": "Parkhaus Jahrhunderthalle",
        "AddressLine1": "An der Jahrhunderthalle 1",
        "AddressLine2": "Mitte",
        "Town": "Bochum",
        "StateOrProvince": "Bochum",
        "Postcode": "44793",
        "CountryID": 87,
        "Latitude": 51.4792189445826,
        "Longitude": 7.19663105487825,
        "ContactTelephone1": "0234 307990",
        "AccessComments": "Das Parkhaus ist nur bei Veranstaltungen in der Jahrhunderthalle geöffnet. 2 kostenlose Parkplätze an der Ausfahrt, Pförtner trägt ein, wer wann wieviel geladen hat.",
        "RelatedURL": "http://www.stadtwerke-bochum.de/privatkunden/energie_zukunft/Mobilitaet/elektromobilitaet/nutzungshinweise.",
        "DistanceUnit": 0
    },
    "Connections": [
        {
            "ID": 52919,
            "ConnectionTypeID": 25,
            "StatusTypeID": 50,
            "LevelID": 2,
            "Amps": 32,
            "Voltage": 400,
            "PowerKW": 22,
            "CurrentTypeID": 20,
            "Quantity": 2
        },
        {
            "ID": 52920,
            "ConnectionTypeID": 28,
            "StatusTypeID": 50,
            "LevelID": 2,
            "Amps": 16,
            "Voltage": 230,
            "PowerKW": 3.7,
            "CurrentTypeID": 10,
            "Quantity": 2
        }
    ],
    "NumberOfPoints": 2,
    "StatusTypeID": 50,
    "DateLastStatusUpdate": "2015-04-08T09:30:00Z",
    "DataQualityLevel": 1,
    "DateCreated": "2015-04-08T09:20:00Z",
    "SubmissionStatusTypeID": 200
}