{
    "IsRecentlyVerified": false,
    "ID": 42938,
    "UUID": "EC3587EB-000A-4269-9312-06F939CFDDDC",
    "DataProviderID": 26,
    "DataProvidersReference": "60433",
    "OperatorID": 180,
    "OperatorsReference": "Alfen RHL02132",
    "UsageCost": "0.00 jaarabonnement",
    "AddressInfo": {
        "ID": 43284,
        "Title": "Eikenlaan 95",
        "AddressLine1": "Eikenlaan 95",
        "Town": "Westland",
        "Postcode": "2691 EA",
        "CountryID": 159,
        "Latitude": 51.997226,
        "Longitude": 4.168294,
        "ContactTelephone1": "036 - 549 34 00",
        "RelatedURL": "http://www.icu-charging-stations.com/",
        "DistanceUnit": 0
    },
    "Connections": [
        {
            "ID": 51898,
            "ConnectionTypeID": 25,
            "LevelID": 2,
            "PowerKW": 11,
            "CurrentTypeID": 10
        },
        {
            "ID": 51899,
            "ConnectionTypeID": 25,
            "LevelID": 2,
            "PowerKW": 11,
            "CurrentTypeID": 10
        }
    ],
    "NumberOfPoints": 1,
    "StatusTypeID": 50,
    "DateLastStatusUpdate": "2016-06-04T02:43:00Z",
    "DataQualityLevel": 3,
    "DateCreated": "2015-03-25T02:49:00Z",
    "SubmissionStatusTypeID": 100
}