{
    "UserComments": [
        {
            "ID": 22964,
            "ChargePointID": 109062,
            "CommentTypeID": 10,
            "UserName": "interssl.com",
            "Comment": "Great charging location at a shopping mall. Left charger is for all EVs, the two charger on the right are Tesla only.",
            "DateCreated": "2020-07-28T05:41:02.343Z",
            "User": {
                "ID": 26760,
                "Username": "interssl.com"
            },
            "CheckinStatusTypeID": 10,
            "IsActionedByEditor": false
        }
    ],
    "MediaItems": [
        {
            "ID": 23249,
            "ChargePointID": 109062,
            "ItemURL": "https://s3-ap-southeast-2.amazonaws.com/openchargemap/images/AT/OCM109062/OCM-109062.orig.2020072718273152.jpg",
            "ItemThumbnailURL": "https://s3-ap-southeast-2.amazonaws.com/openchargemap/images/AT/OCM109062/OCM-109062.thmb.2020072718273152.jpg",
            "Comment": "",
            "IsEnabled": true,
            "IsVideo": false,
            "IsFeaturedItem": false,
            "IsExternalResource": false,
            "User": {
                "ID": 26760,
                "Username": "interssl.com"
            },
            "DateCreated": "2020-07-27T18:28:00Z"
        },
        {
            "ID": 23248,
            "ChargePointID": 109062,
            "ItemURL": "https://s3-ap-southeast-2.amazonaws.com/openchargemap/images/AT/OCM109062/OCM-109062.orig.2020072718271485.jpg",
            "ItemThumbnailURL": "https://s3-ap-southeast-2.amazonaws.com/openchargemap/images/AT/OCM109062/OCM-109062.thmb.2020072718271485.jpg",
            "Comment": "",
            "IsEnabled": true,
            "IsVideo": false,
            "IsFeaturedItem": false,
            "IsExternalResource": false,
            "User": {
                "ID": 26760,
                "Username": "interssl.com"
            },
            "DateCreated": "2020-07-27T18:27:00Z"
        }
    ],
    "IsRecentlyVerified": false,
    "ID": 109062,
    "UUID": "CFB72EA8-9B11-4870-BE25-6575CC4F6F34",
    "DataProviderID": 1,
    "OperatorID": 23,
    "OperatorsReference": "44972",
    "UsageTypeID": 4,
    "AddressInfo": {
        "ID": 109408,
        "Title": "Stadtgalerien Schwaz (Shopping Mall)",
        "AddressLine1": "Stadtgalerien Schwaz",
        "Postcode": "6130",
        "CountryID": 19,
        "Latitude": 47.347217,
        "Longitude": 11.707369,
        "DistanceUnit": 0
    },
    "Connections": [
        {
            "ID": 154180,
            "ConnectionTypeID": 30,
            "StatusTypeID": 50,
            "LevelID": 2,
            "Amps": 32,
            "Voltage": 400,
            "PowerKW": 22,
            "CurrentTypeID": 20,
            "Quantity": 2
        },
        {
            "ID": 233551,
            "ConnectionTypeID": 1036,
            "StatusTypeID": 50,
            "LevelID": 2,
            "Amps": 32,
            "Voltage": 400,
            "PowerKW": 22,
            "CurrentTypeID": 20,
            "Quantity": 1,
            "Comments": "Type 2 connector for Non-Tesla EVs"
        }
    ],
    "NumberOfPoints": 2,
    "GeneralComments": "2 Tesla Connectors, up to 22kW.Available for customers. Self park.",
    "StatusTypeID": 50,
    "DateLastStatusUpdate": "2020-08-07T05:29:00Z",
    "DataQualityLevel": 1,
    "DateCreated": "2018-10-11T13:30:00Z",
    "SubmissionStatusTypeID": 200
}