{
    "IsRecentlyVerified": false,
    "ID": 74985,
    "UUID": "59A21A72-C5E4-45C1-BDA1-4ECD2537FB9E",
    "DataProviderID": 1,
    "OperatorID": 45,
    "UsageTypeID": 6,
    "AddressInfo": {
        "ID": 75331,
        "Title": "Byrdir Self Catering Cottages",
        "AddressLine1": "Byrdir",
        "Town": "Dyffryn Ardudwy",
        "StateOrProvince": "Gwynedd",
        "Postcode": "LL44 2EA",
        "CountryID": 1,
        "Latitude": 52.797666,
        "Longitude": -4.08135,
        "DistanceUnit": 0
    },
    "Connections": [
        {
            "ID": 108178,
            "ConnectionTypeID": 25,
            "StatusTypeID": 50,
            "LevelID": 2,
            "Amps": 32,
            "Voltage": 230,
            "PowerKW": 7,
            "CurrentTypeID": 10,
            "Quantity": 1
        }
    ],
    "NumberOfPoints": 1,
    "StatusTypeID": 50,
    "DateLastStatusUpdate": "2016-12-10T10:40:00Z",
    "DataQualityLevel": 1,
    "DateCreated": "2016-12-10T10:40:00Z",
    "SubmissionStatusTypeID": 200
}