{
    "IsRecentlyVerified": false,
    "ID": 183736,
    "UUID": "BE45B275-01F7-4233-B4BD-4812E0C03BA4",
    "DataProviderID": 29,
    "DataProvidersReference": "3784",
    "AddressInfo": {
        "ID": 184095,
        "Title": "Forstweg 17",
        "AddressLine1": "Forstweg 17",
        "Town": "Bad Pyrmont",
        "Postcode": "31812",
        "CountryID": 87,
        "Latitude": 51.99103424,
        "Longitude": 9.25788787,
        "DistanceUnit": 0
    },
    "Connections": [
        {
            "ID": 291088,
            "ConnectionTypeID": 25,
            "StatusTypeID": 50,
            "LevelID": 2,
            "PowerKW": 22,
            "CurrentTypeID": 20
        },
        {
            "ID": 291089,
            "ConnectionTypeID": 25,
            "StatusTypeID": 50,
            "LevelID": 2,
            "PowerKW": 22,
            "CurrentTypeID": 20
        }
    ],
    "StatusTypeID": 50,
    "DateLastStatusUpdate": "2021-07-09T03:25:00Z",
    "MetadataValues": [
        {
            "ID": 16029,
            "MetadataFieldID": 4,
            "ItemValue": "Data from the German chargepoint registry provided by Bundesnetzagentur.de under the CC-BY 4.0 license"
        }
    ],
    "DataQualityLevel": 3,
    "DateCreated": "2021-07-08T10:04:00Z",
    "SubmissionStatusTypeID": 100
}