{
    "IsRecentlyVerified": false,
    "ID": 185394,
    "UUID": "9DCD9196-C132-426C-BC98-C9BD95CDF5E0",
    "DataProviderID": 1,
    "OperatorID": 45,
    "AddressInfo": {
        "ID": 185753,
        "Title": "Hindenburgstraße 8",
        "AddressLine1": "Hindenburgstraße 8",
        "Town": "Freudenstadt",
        "Postcode": "72250",
        "CountryID": 87,
        "Latitude": 48.468054943322784,
        "Longitude": 8.412340908939427,
        "DistanceUnit": 0
    },
    "Connections": [
        {
            "ID": 294841,
            "ConnectionTypeID": 25,
            "StatusTypeID": 50,
            "LevelID": 2,
            "PowerKW": 22,
            "CurrentTypeID": 20
        },
        {
            "ID": 294842,
            "ConnectionTypeID": 25,
            "StatusTypeID": 50,
            "LevelID": 2,
            "PowerKW": 22,
            "CurrentTypeID": 20
        }
    ],
    "StatusTypeID": 50,
    "DateLastStatusUpdate": "2021-09-27T20:54:00Z",
    "MetadataValues": [
        {
            "ID": 17685,
            "MetadataFieldID": 4,
            "ItemValue": "Data from the German chargepoint registry provided by Bundesnetzagentur.de under the CC-BY 4.0 license"
        }
    ],
    "DataQualityLevel": 3,
    "DateCreated": "2021-07-08T10:06:00Z",
    "SubmissionStatusTypeID": 100
}