{
    "MediaItems": [
        {
            "ID": 25712,
            "ChargePointID": 105328,
            "ItemURL": "https://s3-ap-southeast-2.amazonaws.com/openchargemap/images/AT/OCM105328/OCM-105328.orig.2020120615412372.jpg",
            "ItemThumbnailURL": "https://s3-ap-southeast-2.amazonaws.com/openchargemap/images/AT/OCM105328/OCM-105328.thmb.2020120615412372.jpg",
            "Comment": "",
            "IsEnabled": true,
            "IsVideo": false,
            "IsFeaturedItem": false,
            "IsExternalResource": false,
            "User": {
                "ID": 28017,
                "Username": "peter_w"
            },
            "DateCreated": "2020-12-06T15:41:00Z"
        }
    ],
    "IsRecentlyVerified": false,
    "ID": 105328,
    "UUID": "348DCDE0-1ED1-4AAD-ADD6-954BEC28F4C8",
    "DataProviderID": 1,
    "OperatorID": 1,
    "UsageTypeID": 4,
    "AddressInfo": {
        "ID": 105674,
        "Title": "Peter Wörz Installations GmbH",
        "AddressLine1": "Reuttener Str. 11",
        "Town": "Lermoos",
        "Postcode": "6631 ",
        "CountryID": 19,
        "Latitude": 47.404752634629176,
        "Longitude": 10.877820058763746,
        "ContactTelephone1": "+436643410692",
        "DistanceUnit": 0
    },
    "Connections": [
        {
            "ID": 258231,
            "ConnectionTypeID": 33,
            "StatusTypeID": 50,
            "LevelID": 3,
            "PowerKW": 100,
            "CurrentTypeID": 30,
            "Quantity": 1
        },
        {
            "ID": 258232,
            "ConnectionTypeID": 33,
            "StatusTypeID": 50,
            "LevelID": 3,
            "PowerKW": 100,
            "CurrentTypeID": 30,
            "Quantity": 1
        },
        {
            "ID": 260764,
            "ConnectionTypeID": 25,
            "StatusTypeID": 50,
            "LevelID": 2,
            "PowerKW": 22,
            "CurrentTypeID": 20,
            "Quantity": 1
        }
    ],
    "NumberOfPoints": 2,
    "StatusTypeID": 50,
    "DateLastStatusUpdate": "2020-12-06T17:39:00Z",
    "DataQualityLevel": 1,
    "DateCreated": "2018-06-05T11:19:00Z",
    "SubmissionStatusTypeID": 200
}