{
    "IsRecentlyVerified": false,
    "ID": 175671,
    "UUID": "B8305222-6C5A-4B13-8AE8-AC9DA354CF86",
    "DataProviderID": 1,
    "OperatorID": 121,
    "UsageTypeID": 4,
    "UsageCost": "0,35€/kWh (+2c/min von 8-22Uhr)",
    "AddressInfo": {
        "ID": 176030,
        "Title": "Stüvestraße ",
        "AddressLine1": "10 Stüvestraße",
        "AddressLine2": "Am Bertha von Suttner Platz",
        "Town": "Hanover",
        "StateOrProvince": "Lower Saxony",
        "Postcode": "30173",
        "CountryID": 87,
        "Latitude": 52.359611711034376,
        "Longitude": 9.758091005562392,
        "DistanceUnit": 0
    },
    "Connections": [
        {
            "ID": 272771,
            "ConnectionTypeID": 25,
            "StatusTypeID": 50,
            "LevelID": 2,
            "Amps": 32,
            "Voltage": 400,
            "PowerKW": 22,
            "CurrentTypeID": 20,
            "Quantity": 2
        }
    ],
    "NumberOfPoints": 1,
    "GeneralComments": "24/7 verfügbare Ladesäule ",
    "StatusTypeID": 50,
    "DateLastStatusUpdate": "2021-06-06T14:20:00Z",
    "DataQualityLevel": 1,
    "DateCreated": "2021-06-06T14:20:00Z",
    "SubmissionStatusTypeID": 200
}