{
    "IsRecentlyVerified": false,
    "ID": 82313,
    "UUID": "835D35C2-084C-4C63-A647-475B10EDE731",
    "DataProviderID": 1,
    "OperatorID": 23,
    "OperatorsReference": "20903",
    "UsageTypeID": 6,
    "AddressInfo": {
        "ID": 82659,
        "Title": "Bomans Hotel",
        "AddressLine1": "Östra Hamnplan 1",
        "Town": "Trosa",
        "Postcode": "619 30",
        "CountryID": 216,
        "Latitude": 58.894391,
        "Longitude": 17.552241,
        "ContactTelephone1": "+46 156 525 00",
        "DistanceUnit": 0
    },
    "Connections": [
        {
            "ID": 117079,
            "ConnectionTypeID": 30,
            "StatusTypeID": 50,
            "LevelID": 2,
            "Amps": 16,
            "Voltage": 400,
            "PowerKW": 11,
            "CurrentTypeID": 20,
            "Quantity": 2
        }
    ],
    "NumberOfPoints": 2,
    "GeneralComments": "2 Tesla Connectors, up to 11kW.Available for patrons only. Please see front desk.",
    "StatusTypeID": 50,
    "DateLastStatusUpdate": "2018-10-03T21:43:00Z",
    "DataQualityLevel": 1,
    "DateCreated": "2017-02-03T15:32:00Z",
    "SubmissionStatusTypeID": 200
}