{
    "IsRecentlyVerified": false,
    "ID": 170358,
    "UUID": "1E5D61AF-72FA-4D06-9492-AD4E8E79517E",
    "DataProviderID": 1,
    "OperatorID": 3327,
    "UsageTypeID": 4,
    "AddressInfo": {
        "ID": 170717,
        "Title": "BECHARGE Hotel Ristorante la Perla Camerano",
        "AddressLine1": "Via Direttissima del Conero, 1/3",
        "Town": "Camerano",
        "StateOrProvince": "AN",
        "Postcode": "60021",
        "CountryID": 112,
        "Latitude": 43.53238899042728,
        "Longitude": 13.525426862939412,
        "ContactTelephone1": "02-49527730",
        "ContactEmail": "emobility@buildingenergy.it",
        "RelatedURL": "https://www.bec.energy/",
        "DistanceUnit": 0
    },
    "Connections": [
        {
            "ID": 259856,
            "ConnectionTypeID": 25,
            "StatusTypeID": 50,
            "LevelID": 2,
            "Amps": 32,
            "Voltage": 400,
            "PowerKW": 22,
            "CurrentTypeID": 20,
            "Quantity": 2
        }
    ],
    "NumberOfPoints": 2,
    "StatusTypeID": 50,
    "DateLastStatusUpdate": "2020-11-24T16:48:00Z",
    "DataQualityLevel": 1,
    "DateCreated": "2020-11-24T16:47:00Z",
    "SubmissionStatusTypeID": 200
}