{
    "IsRecentlyVerified": false,
    "ID": 88529,
    "UUID": "52308212-5AD2-44D7-A0EC-EB65CEEBD328",
    "DataProviderID": 1,
    "OperatorID": 23,
    "OperatorsReference": "28883",
    "UsageTypeID": 4,
    "UsageCost": "CHF 0.30/kWh; Andere Tarife für ältere Autos/Autres tarifs pour les voitures anciennes/altre tariffe per le auto più vecchie",
    "AddressInfo": {
        "ID": 88875,
        "Title": "Schaffhausen Supercharger",
        "AddressLine1": "20 Schweizersbildstrasse",
        "Town": "Schaffhausen",
        "Postcode": "8207",
        "CountryID": 217,
        "Latitude": 47.720985,
        "Longitude": 8.646664,
        "DistanceUnit": 0
    },
    "Connections": [
        {
            "ID": 125579,
            "ConnectionTypeID": 27,
            "StatusTypeID": 50,
            "LevelID": 3,
            "PowerKW": 120,
            "CurrentTypeID": 30,
            "Quantity": 8
        }
    ],
    "NumberOfPoints": 8,
    "GeneralComments": "Charging8 Superchargers, available 24/7",
    "StatusTypeID": 50,
    "DateLastStatusUpdate": "2019-03-22T18:20:00Z",
    "DataQualityLevel": 1,
    "DateCreated": "2017-06-01T06:14:00Z",
    "SubmissionStatusTypeID": 200
}