{
    "IsRecentlyVerified": false,
    "ID": 157111,
    "UUID": "533B540C-642A-4A70-817F-EE4B1AF907EE",
    "DataProviderID": 19,
    "DataProvidersReference": "5467",
    "AddressInfo": {
        "ID": 157465,
        "Title": "Värnäsmon 25",
        "AddressLine1": "Värnäsmon 25",
        "Town": "STÖLLET",
        "StateOrProvince": "VÄRMLAND",
        "Postcode": "68051",
        "CountryID": 216,
        "Latitude": 60.42304,
        "Longitude": 13.25879,
        "AccessComments": "Bredvid toalettbyggnaden",
        "DistanceUnit": 0
    },
    "Connections": [
        {
            "ID": 225388,
            "ConnectionTypeID": 25,
            "Reference": "1",
            "LevelID": 3,
            "Amps": 32,
            "Voltage": 400,
            "PowerKW": 22,
            "CurrentTypeID": 30,
            "Comments": "Mode 3"
        },
        {
            "ID": 225389,
            "ConnectionTypeID": 25,
            "Reference": "2",
            "LevelID": 3,
            "Amps": 32,
            "Voltage": 400,
            "PowerKW": 22,
            "CurrentTypeID": 30,
            "Comments": "Mode 3"
        }
    ],
    "NumberOfPoints": 2,
    "StatusTypeID": 0,
    "DateLastStatusUpdate": "2021-03-24T05:12:00Z",
    "DataQualityLevel": 2,
    "DateCreated": "2020-05-26T08:24:00Z",
    "SubmissionStatusTypeID": 100
}