{
    "IsRecentlyVerified": false,
    "ID": 177457,
    "UUID": "F2551EC5-50B6-4AAA-BB0B-E47DDA2D344D",
    "DataProviderID": 29,
    "DataProvidersReference": "11183",
    "OperatorID": 86,
    "AddressInfo": {
        "ID": 177816,
        "Title": "Franz Sigel Straße 59a",
        "AddressLine1": "Franz Sigel Straße 59a",
        "Town": "Bruchsal",
        "Postcode": "76646",
        "CountryID": 87,
        "Latitude": 49.110596,
        "Longitude": 8.568308,
        "DistanceUnit": 0
    },
    "Connections": [
        {
            "ID": 276615,
            "ConnectionTypeID": 28,
            "StatusTypeID": 50,
            "LevelID": 2,
            "PowerKW": 22,
            "CurrentTypeID": 20
        },
        {
            "ID": 276616,
            "ConnectionTypeID": 25,
            "StatusTypeID": 50,
            "LevelID": 2,
            "PowerKW": 22,
            "CurrentTypeID": 20
        },
        {
            "ID": 296609,
            "ConnectionTypeID": 28,
            "StatusTypeID": 50,
            "LevelID": 3,
            "PowerKW": 22,
            "CurrentTypeID": 30
        },
        {
            "ID": 296610,
            "ConnectionTypeID": 25,
            "StatusTypeID": 50,
            "LevelID": 3,
            "PowerKW": 22,
            "CurrentTypeID": 30
        },
        {
            "ID": 296611,
            "ConnectionTypeID": 33,
            "StatusTypeID": 50,
            "LevelID": 3,
            "PowerKW": 22,
            "CurrentTypeID": 30
        }
    ],
    "StatusTypeID": 0,
    "DateLastStatusUpdate": "2021-07-12T02:42:00Z",
    "MetadataValues": [
        {
            "ID": 9751,
            "MetadataFieldID": 4,
            "ItemValue": "Data from the German chargepoint registry provided by Bundesnetzagentur.de under the CC-BY 4.0 license"
        }
    ],
    "DataQualityLevel": 3,
    "DateCreated": "2021-07-08T09:49:00Z",
    "SubmissionStatusTypeID": 100
}