{
    "IsRecentlyVerified": false,
    "ID": 150571,
    "UUID": "B24B13E6-8C73-40B8-9C14-31BB24D1B812",
    "DataProviderID": 28,
    "DataProvidersReference": "FR*M13*P13071*002",
    "UsageTypeID": 5,
    "AddressInfo": {
        "ID": 150924,
        "Title": "LES PENNES-MIRABEAU - Vieille Route De La Gavotte - Parking Square Jean Moulin",
        "AddressLine1": "Vieille Route De La Gavotte - Parking Square Jean Moulin 13170 LES PENNES-MIRABEAU",
        "CountryID": 80,
        "Latitude": 43.380874,
        "Longitude": 5.348994,
        "AccessComments": "24h/24 7j/7",
        "DistanceUnit": 0
    },
    "Connections": [
        {
            "ID": 209477,
            "ConnectionTypeID": 28,
            "StatusTypeID": 50,
            "LevelID": 2,
            "PowerKW": 22,
            "CurrentTypeID": 10
        },
        {
            "ID": 209478,
            "ConnectionTypeID": 1036,
            "StatusTypeID": 50,
            "LevelID": 2,
            "PowerKW": 22,
            "CurrentTypeID": 20
        },
        {
            "ID": 238720,
            "ConnectionTypeID": 28,
            "StatusTypeID": 50,
            "LevelID": 2,
            "PowerKW": 22,
            "CurrentTypeID": 10
        },
        {
            "ID": 238721,
            "ConnectionTypeID": 1036,
            "StatusTypeID": 50,
            "LevelID": 2,
            "PowerKW": 22,
            "CurrentTypeID": 20
        }
    ],
    "GeneralComments": "Recharge par badge et avec une application smartphone",
    "StatusTypeID": 50,
    "DateLastStatusUpdate": "2020-08-27T05:10:00Z",
    "DataQualityLevel": 2,
    "DateCreated": "2020-03-15T06:17:00Z",
    "SubmissionStatusTypeID": 100
}