{
    "IsRecentlyVerified": false,
    "ID": 138409,
    "UUID": "5F5EA522-036B-416E-8EE7-5D4C6485B7E0",
    "DataProviderID": 2,
    "DataProvidersReference": "148892",
    "OperatorID": 39,
    "UsageTypeID": 1,
    "AddressInfo": {
        "ID": 138758,
        "Title": "430502 - Gables River Oaks",
        "AddressLine1": "2724 Kipling Street",
        "Town": "Houston",
        "StateOrProvince": "TX",
        "Postcode": "77098",
        "CountryID": 2,
        "Latitude": 29.7406008,
        "Longitude": -95.4203014,
        "ContactTelephone1": "800-663-5633",
        "AccessComments": "MO: 12:00am-12:00am; TU: 12:00am-12:00am; WE: 12:00am-12:00am; TH: 12:00am-12:00am; FR: 12:00am-12:00am; SA: 12:00am-12:00am; SU: 12:00am-12:00am",
        "RelatedURL": "http://www.semacharge.com/",
        "DistanceUnit": 0
    },
    "Connections": [
        {
            "ID": 193522,
            "ConnectionTypeID": 1,
            "LevelID": 2,
            "Amps": 16,
            "Voltage": 230,
            "PowerKW": 3.7,
            "CurrentTypeID": 10,
            "Quantity": 4
        }
    ],
    "StatusTypeID": 50,
    "DateLastStatusUpdate": "2020-06-26T02:53:00Z",
    "DataQualityLevel": 3,
    "DateCreated": "2019-12-24T09:08:00Z",
    "SubmissionStatusTypeID": 100
}