{
    "IsRecentlyVerified": false,
    "ID": 140564,
    "UUID": "105C3332-D00D-4559-B2F7-691022B56EF8",
    "DataProviderID": 2,
    "DataProvidersReference": "149588",
    "OperatorID": 59,
    "UsageTypeID": 1,
    "AddressInfo": {
        "ID": 140916,
        "Title": "Greenlots - 53086",
        "AddressLine1": "1057 S. Lower Flat Top Dr. Unit A",
        "Town": "Mesquite",
        "StateOrProvince": "NV",
        "Postcode": "89027",
        "CountryID": 2,
        "Latitude": 36.8047561645508,
        "Longitude": -114.137649536133,
        "ContactTelephone1": "855-900-7584",
        "AccessComments": "24 hours daily",
        "RelatedURL": "http://greenlots.com/",
        "DistanceUnit": 0
    },
    "Connections": [
        {
            "ID": 196226,
            "ConnectionTypeID": 2,
            "LevelID": 3,
            "Amps": 100,
            "Voltage": 400,
            "PowerKW": 40,
            "CurrentTypeID": 30,
            "Quantity": 1
        },
        {
            "ID": 196227,
            "ConnectionTypeID": 32,
            "LevelID": 3,
            "Amps": 100,
            "Voltage": 400,
            "PowerKW": 40,
            "CurrentTypeID": 30,
            "Quantity": 1
        }
    ],
    "StatusTypeID": 50,
    "DateLastStatusUpdate": "2020-06-26T02:58:00Z",
    "DataQualityLevel": 3,
    "DateCreated": "2019-12-24T09:13:00Z",
    "SubmissionStatusTypeID": 100
}