{
    "IsRecentlyVerified": false,
    "ID": 183701,
    "UUID": "1F86DEC6-BEDF-467F-8320-A36EA6000965",
    "DataProviderID": 29,
    "DataProvidersReference": "15412",
    "OperatorID": 45,
    "AddressInfo": {
        "ID": 184060,
        "Title": "Hagenauer Straße 40",
        "AddressLine1": "Hagenauer Straße 40",
        "Town": "Wiesbaden-Biebrich",
        "Postcode": "65203",
        "CountryID": 87,
        "Latitude": 50.048154,
        "Longitude": 8.217435,
        "DistanceUnit": 0
    },
    "Connections": [
        {
            "ID": 291012,
            "ConnectionTypeID": 33,
            "StatusTypeID": 50,
            "LevelID": 3,
            "PowerKW": 50,
            "CurrentTypeID": 30
        },
        {
            "ID": 291013,
            "ConnectionTypeID": 33,
            "StatusTypeID": 50,
            "LevelID": 3,
            "PowerKW": 50,
            "CurrentTypeID": 30
        },
        {
            "ID": 297528,
            "ConnectionTypeID": 25,
            "StatusTypeID": 50,
            "LevelID": 2,
            "PowerKW": 22,
            "CurrentTypeID": 20
        }
    ],
    "StatusTypeID": 50,
    "DateLastStatusUpdate": "2021-07-12T02:44:00Z",
    "MetadataValues": [
        {
            "ID": 15994,
            "MetadataFieldID": 4,
            "ItemValue": "Data from the German chargepoint registry provided by Bundesnetzagentur.de under the CC-BY 4.0 license"
        }
    ],
    "DataQualityLevel": 3,
    "DateCreated": "2021-07-08T10:04:00Z",
    "SubmissionStatusTypeID": 100
}