{
    "IsRecentlyVerified": false,
    "ID": 16029,
    "UUID": "90A8B378-E5B2-44AC-9069-D40295776FB5",
    "DataProviderID": 1,
    "OperatorID": 1,
    "UsageTypeID": 1,
    "UsageCost": "",
    "AddressInfo": {
        "ID": 16374,
        "Title": "Abode Chester",
        "AddressLine1": "Grosvenor Road,",
        "AddressLine2": "",
        "Town": "Chester",
        "StateOrProvince": "",
        "Postcode": "CH1 2DJ",
        "CountryID": 1,
        "Latitude": 53.1854161,
        "Longitude": -2.894694999999956,
        "ContactTelephone1": "01244 347000",
        "ContactTelephone2": "",
        "ContactEmail": "reservationschester@abodehotels.co.uk",
        "AccessComments": "",
        "RelatedURL": "",
        "DistanceUnit": 0
    },
    "Connections": [
        {
            "ID": 14429,
            "ConnectionTypeID": 25,
            "StatusTypeID": 50,
            "LevelID": 2,
            "Amps": 32,
            "Voltage": 230,
            "PowerKW": 7.4,
            "Quantity": 1
        }
    ],
    "NumberOfPoints": 1,
    "GeneralComments": "",
    "StatusTypeID": 50,
    "DateLastStatusUpdate": "2013-02-28T07:34:00Z",
    "DataQualityLevel": 1,
    "DateCreated": "2013-02-25T11:10:00Z",
    "SubmissionStatusTypeID": 200
}