{
    "UserComments": [
        {
            "ID": 24360,
            "ChargePointID": 175409,
            "CommentTypeID": 10,
            "UserName": "ForumElettrico.it",
            "Comment": "Sotto una pensilina, appena all'ingresso dell'AdS sui parcheggi auto che ci trovano sulla destra. Leggi la recensione completa qui >   https://www.forumelettrico.it/forum/colonnina-enel-x-fast-ads-flaminia-est-magliano-sabina-ri-t12634.html\r\n",
            "RelatedURL": "https://www.forumelettrico.it/forum/colonnina-enel-x-fast-ads-flaminia-est-magliano-sabina-ri-t12634.html",
            "DateCreated": "2021-05-18T05:12:11.73Z",
            "User": {
                "ID": 11749,
                "Username": "ForumElettrico.it"
            },
            "CheckinStatusTypeID": 140,
            "IsActionedByEditor": false
        }
    ],
    "MediaItems": [
        {
            "ID": 27743,
            "ChargePointID": 175409,
            "ItemURL": "https://s3-ap-southeast-2.amazonaws.com/openchargemap/images/IT/OCM175409/OCM-175409.orig.2021051805123427.jpg",
            "ItemThumbnailURL": "https://s3-ap-southeast-2.amazonaws.com/openchargemap/images/IT/OCM175409/OCM-175409.thmb.2021051805123427.jpg",
            "Comment": "",
            "IsEnabled": true,
            "IsVideo": false,
            "IsFeaturedItem": false,
            "IsExternalResource": false,
            "User": {
                "ID": 11749,
                "Username": "ForumElettrico.it"
            },
            "DateCreated": "2021-05-18T05:13:00Z"
        },
        {
            "ID": 27744,
            "ChargePointID": 175409,
            "ItemURL": "https://s3-ap-southeast-2.amazonaws.com/openchargemap/images/IT/OCM175409/OCM-175409.orig.2021051805124012.jpg",
            "ItemThumbnailURL": "https://s3-ap-southeast-2.amazonaws.com/openchargemap/images/IT/OCM175409/OCM-175409.thmb.2021051805124012.jpg",
            "Comment": "",
            "IsEnabled": true,
            "IsVideo": false,
            "IsFeaturedItem": false,
            "IsExternalResource": false,
            "User": {
                "ID": 11749,
                "Username": "ForumElettrico.it"
            },
            "DateCreated": "2021-05-18T05:13:00Z"
        },
        {
            "ID": 27745,
            "ChargePointID": 175409,
            "ItemURL": "https://s3-ap-southeast-2.amazonaws.com/openchargemap/images/IT/OCM175409/OCM-175409.orig.2021051805124711.jpg",
            "ItemThumbnailURL": "https://s3-ap-southeast-2.amazonaws.com/openchargemap/images/IT/OCM175409/OCM-175409.thmb.2021051805124711.jpg",
            "Comment": "",
            "IsEnabled": true,
            "IsVideo": false,
            "IsFeaturedItem": false,
            "IsExternalResource": false,
            "User": {
                "ID": 11749,
                "Username": "ForumElettrico.it"
            },
            "DateCreated": "2021-05-18T05:13:00Z"
        },
        {
            "ID": 27741,
            "ChargePointID": 175409,
            "ItemURL": "https://s3-ap-southeast-2.amazonaws.com/openchargemap/images/IT/OCM175409/OCM-175409.orig.2021051805122108.jpg",
            "ItemThumbnailURL": "https://s3-ap-southeast-2.amazonaws.com/openchargemap/images/IT/OCM175409/OCM-175409.thmb.2021051805122108.jpg",
            "Comment": "",
            "IsEnabled": true,
            "IsVideo": false,
            "IsFeaturedItem": false,
            "IsExternalResource": false,
            "User": {
                "ID": 11749,
                "Username": "ForumElettrico.it"
            },
            "DateCreated": "2021-05-18T05:12:00Z"
        },
        {
            "ID": 27742,
            "ChargePointID": 175409,
            "ItemURL": "https://s3-ap-southeast-2.amazonaws.com/openchargemap/images/IT/OCM175409/OCM-175409.orig.2021051805122718.jpg",
            "ItemThumbnailURL": "https://s3-ap-southeast-2.amazonaws.com/openchargemap/images/IT/OCM175409/OCM-175409.thmb.2021051805122718.jpg",
            "Comment": "",
            "IsEnabled": true,
            "IsVideo": false,
            "IsFeaturedItem": false,
            "IsExternalResource": false,
            "User": {
                "ID": 11749,
                "Username": "ForumElettrico.it"
            },
            "DateCreated": "2021-05-18T05:12:00Z"
        }
    ],
    "IsRecentlyVerified": false,
    "ID": 175409,
    "UUID": "9ADACC35-C645-4170-BABF-A013197F68C1",
    "DataProviderID": 1,
    "OperatorID": 1,
    "UsageTypeID": 1,
    "AddressInfo": {
        "ID": 175768,
        "Title": "Free to X AdS Flaminia Est",
        "AddressLine1": "A1 km 509,1",
        "Town": "Magliano Sabina",
        "StateOrProvince": "RI",
        "CountryID": 112,
        "Latitude": 42.316281,
        "Longitude": 12.493233,
        "RelatedURL": "https://www.forumelettrico.it/forum/colonnina-enel-x-fast-ads-flaminia-est-magliano-sabina-ri-t12634.html",
        "DistanceUnit": 0
    },
    "Connections": [
        {
            "ID": 272141,
            "ConnectionTypeID": 33,
            "LevelID": 2,
            "PowerKW": 300,
            "Quantity": 4
        },
        {
            "ID": 272142,
            "ConnectionTypeID": 2,
            "LevelID": 2,
            "PowerKW": 100,
            "Quantity": 2
        }
    ],
    "NumberOfPoints": 2,
    "StatusTypeID": 50,
    "DateLastStatusUpdate": "2021-08-17T13:47:00Z",
    "DataQualityLevel": 1,
    "DateCreated": "2021-05-18T05:11:00Z",
    "SubmissionStatusTypeID": 200
}