{
    "IsRecentlyVerified": false,
    "ID": 19835,
    "UUID": "E028F26D-352D-4829-A938-EBFD6E264F72",
    "DataProviderID": 2,
    "DataProvidersReference": "44317",
    "UsageTypeID": 7,
    "AddressInfo": {
        "ID": 20180,
        "Title": "Destination Nissan",
        "AddressLine1": "770 Central Ave",
        "Town": "Albany",
        "StateOrProvince": "NY",
        "Postcode": "12206",
        "CountryID": 2,
        "Latitude": 42.676971,
        "Longitude": -73.787334,
        "ContactTelephone1": "518-438-8461",
        "AccessComments": "Dealership business hours\r\nPublic - Call ahead",
        "RelatedURL": "",
        "DistanceUnit": 0
    },
    "Connections": [
        {
            "ID": 19920,
            "ConnectionTypeID": 1,
            "LevelID": 2,
            "Amps": 16,
            "Voltage": 230,
            "PowerKW": 3.7,
            "CurrentTypeID": 10,
            "Quantity": 1
        },
        {
            "ID": 21462,
            "ConnectionTypeID": 1,
            "LevelID": 2,
            "Quantity": 1
        }
    ],
    "DateLastStatusUpdate": "2020-06-26T03:06:00Z",
    "DataQualityLevel": 3,
    "DateCreated": "2013-10-19T03:48:00Z",
    "SubmissionStatusTypeID": 100
}