{
    "IsRecentlyVerified": false,
    "ID": 28613,
    "UUID": "F54566FD-E364-45E1-8727-25863EE09744",
    "DataProviderID": 2,
    "DataProvidersReference": "60765",
    "UsageTypeID": 2,
    "AddressInfo": {
        "ID": 28959,
        "Title": "Gengras Ford",
        "AddressLine1": "225 New Britain Ave",
        "Town": "Plainville",
        "StateOrProvince": "CT",
        "Postcode": "06062",
        "CountryID": 2,
        "Latitude": 41.676993,
        "Longitude": -72.842319,
        "ContactTelephone1": "",
        "AccessComments": "Service center use only",
        "RelatedURL": "",
        "DistanceUnit": 0
    },
    "Connections": [
        {
            "ID": 31436,
            "ConnectionTypeID": 1,
            "LevelID": 2,
            "Amps": 16,
            "Voltage": 230,
            "PowerKW": 3.7,
            "CurrentTypeID": 10,
            "Quantity": 1
        }
    ],
    "DateLastStatusUpdate": "2020-06-26T03:04:00Z",
    "DataQualityLevel": 3,
    "DateCreated": "2014-11-28T03:38:00Z",
    "SubmissionStatusTypeID": 100
}