{
    "IsRecentlyVerified": false,
    "ID": 75607,
    "UUID": "5022B7BA-A704-4189-80E6-E838F2050610",
    "DataProviderID": 1,
    "OperatorID": 142,
    "OperatorsReference": "50",
    "UsageTypeID": 4,
    "AddressInfo": {
        "ID": 75953,
        "Title": "Wipark Garage Freyung",
        "AddressLine1": "Freyung 5/Herrengasse 23",
        "Town": "Wien",
        "Postcode": "1010",
        "CountryID": 19,
        "Latitude": 48.211598,
        "Longitude": 16.364844,
        "AccessComments": "Details zum Elektrotankstellenort: \r\nTiefgarage, Abfahrtsebene",
        "DistanceUnit": 0
    },
    "Connections": [
        {
            "ID": 109011,
            "ConnectionTypeID": 25,
            "StatusTypeID": 50,
            "LevelID": 2,
            "Amps": 16,
            "Voltage": 400,
            "PowerKW": 11,
            "CurrentTypeID": 20,
            "Quantity": 4
        },
        {
            "ID": 109012,
            "ConnectionTypeID": 28,
            "StatusTypeID": 50,
            "LevelID": 2,
            "Amps": 16,
            "Voltage": 230,
            "PowerKW": 4,
            "CurrentTypeID": 10,
            "Quantity": 8
        }
    ],
    "NumberOfPoints": 8,
    "GeneralComments": "Wien Energie Tanke-Karte; WienMobil-Karte; BMW i-ChargeNow-Karte; intercharge-App",
    "StatusTypeID": 50,
    "DateLastStatusUpdate": "2016-12-16T19:59:00Z",
    "DataQualityLevel": 1,
    "DateCreated": "2016-12-16T19:59:00Z",
    "SubmissionStatusTypeID": 200
}