{
    "IsRecentlyVerified": false,
    "ID": 127101,
    "UUID": "B6113336-F5B5-4AAA-A9A2-AB4F5AE2D9F8",
    "DataProviderID": 1,
    "OperatorID": 3356,
    "OperatorsReference": "UK*HUB*E000331,UK*HUB*E000332",
    "UsageTypeID": 0,
    "UsageCost": "£0.46/kWh",
    "AddressInfo": {
        "ID": 127447,
        "Title": "Keltbray Holdings Group",
        "AddressLine1": "Thames Road",
        "AddressLine2": "Silvertown",
        "Town": "London",
        "StateOrProvince": "England",
        "Postcode": "E16 2EZ",
        "CountryID": 1,
        "Latitude": 51.501932,
        "Longitude": 0.041578,
        "DistanceUnit": 0
    },
    "Connections": [
        {
            "ID": 177978,
            "ConnectionTypeID": 25,
            "StatusTypeID": 50,
            "LevelID": 2,
            "Amps": 32,
            "Voltage": 230,
            "PowerKW": 7,
            "CurrentTypeID": 10,
            "Quantity": 2
        }
    ],
    "NumberOfPoints": 2,
    "StatusTypeID": 50,
    "DateLastStatusUpdate": "2019-05-27T10:07:00Z",
    "DataQualityLevel": 1,
    "DateCreated": "2019-05-27T10:07:00Z",
    "SubmissionStatusTypeID": 200
}