{
    "IsRecentlyVerified": false,
    "ID": 65280,
    "UUID": "00019B6A-4CEC-47CC-BB63-27986E1A416D",
    "DataProviderID": 1,
    "OperatorID": 45,
    "UsageTypeID": 6,
    "UsageCost": "0",
    "AddressInfo": {
        "ID": 65626,
        "Title": " Hotel Arctic Light",
        "AddressLine1": "Valtakatu 18",
        "Town": "Rovaniemi",
        "StateOrProvince": "Lappland",
        "Postcode": "96200",
        "CountryID": 79,
        "Latitude": 66.50134,
        "Longitude": 25.7344623,
        "ContactTelephone1": "+358201710100",
        "AccessComments": "For guests only; please ask at the reception.\r\n",
        "RelatedURL": "http://arcticlighthotel.fi/",
        "DistanceUnit": 0
    },
    "Connections": [
        {
            "ID": 89894,
            "ConnectionTypeID": 30,
            "StatusTypeID": 50,
            "LevelID": 2,
            "Amps": 32,
            "Voltage": 400,
            "PowerKW": 22,
            "CurrentTypeID": 20,
            "Quantity": 2
        }
    ],
    "NumberOfPoints": 2,
    "StatusTypeID": 50,
    "DateLastStatusUpdate": "2020-07-16T17:25:00Z",
    "DataQualityLevel": 1,
    "DateCreated": "2016-04-26T07:38:00Z",
    "SubmissionStatusTypeID": 200
}