{
    "IsRecentlyVerified": false,
    "ID": 34378,
    "UUID": "952A0671-5628-4AB1-BE65-A4A5AD368A74",
    "DataProviderID": 26,
    "DataProvidersReference": "50985",
    "OperatorID": 180,
    "OperatorsReference": "Alfen BRS_0321",
    "UsageCost": "0.00 jaarabonnement",
    "AddressInfo": {
        "ID": 34724,
        "Title": "Willemsplein 100",
        "AddressLine1": "Willemsplein 100",
        "Town": "Rotterdam",
        "Postcode": "3016 DR",
        "CountryID": 159,
        "Latitude": 51.911271,
        "Longitude": 4.482545,
        "ContactTelephone1": "036 - 549 34 00",
        "RelatedURL": "http://www.icu-charging-stations.com/",
        "DistanceUnit": 0
    },
    "Connections": [
        {
            "ID": 37889,
            "ConnectionTypeID": 25,
            "LevelID": 2,
            "PowerKW": 11,
            "CurrentTypeID": 10
        },
        {
            "ID": 47219,
            "ConnectionTypeID": 25,
            "LevelID": 2,
            "PowerKW": 11,
            "CurrentTypeID": 10
        }
    ],
    "NumberOfPoints": 1,
    "StatusTypeID": 50,
    "DateLastStatusUpdate": "2016-06-04T02:42:00Z",
    "DataQualityLevel": 3,
    "DateCreated": "2015-01-09T06:04:00Z",
    "SubmissionStatusTypeID": 100
}