{
    "IsRecentlyVerified": false,
    "ID": 100408,
    "UUID": "73F221CD-6E5E-4155-9192-BCF6B082529F",
    "DataProviderID": 1,
    "OperatorID": 23,
    "OperatorsReference": "40910",
    "UsageTypeID": 4,
    "AddressInfo": {
        "ID": 100754,
        "Title": "Sierra Meadows",
        "AddressLine1": "46516 Opah DR",
        "Town": "Ahwahnee",
        "StateOrProvince": "California",
        "Postcode": "93601",
        "CountryID": 2,
        "Latitude": 37.3634,
        "Longitude": -119.700191,
        "ContactTelephone1": "(559) 580-8085",
        "DistanceUnit": 0
    },
    "Connections": [
        {
            "ID": 141827,
            "ConnectionTypeID": 30,
            "StatusTypeID": 50,
            "LevelID": 2,
            "PowerKW": 16,
            "CurrentTypeID": 20,
            "Quantity": 10
        }
    ],
    "NumberOfPoints": 10,
    "GeneralComments": "10 Tesla Connectors, up to 16kW.Available for customers. Please see front desk.",
    "StatusTypeID": 50,
    "DateLastStatusUpdate": "2018-02-23T07:03:00Z",
    "DataQualityLevel": 1,
    "DateCreated": "2018-02-23T07:03:00Z",
    "SubmissionStatusTypeID": 200
}