{
    "UserComments": [
        {
            "ID": 21811,
            "ChargePointID": 101054,
            "CommentTypeID": 10,
            "UserName": "RLNicoll",
            "Comment": "",
            "DateCreated": "2019-11-11T19:51:23.103Z",
            "User": {
                "ID": 22981,
                "Username": "RLNicoll"
            },
            "CheckinStatusTypeID": 10,
            "IsActionedByEditor": false
        }
    ],
    "IsRecentlyVerified": false,
    "ID": 101054,
    "UUID": "C699DC1A-CA97-4683-97F4-012D5E8C935D",
    "DataProviderID": 1,
    "OperatorID": 23,
    "OperatorsReference": "34313",
    "UsageTypeID": 4,
    "UsageCost": "£0.24/kWh;other tariffs for older cars",
    "AddressInfo": {
        "ID": 101400,
        "Title": "Fleet Supercharger (Eastbound)",
        "AddressLine1": "M3 Junction 4a/5 Eastbound",
        "Town": "Fleet",
        "Postcode": "GU51 1AA",
        "CountryID": 1,
        "Latitude": 51.296116,
        "Longitude": -0.857413,
        "DistanceUnit": 0
    },
    "Connections": [
        {
            "ID": 142677,
            "ConnectionTypeID": 27,
            "StatusTypeID": 50,
            "LevelID": 3,
            "PowerKW": 120,
            "CurrentTypeID": 30,
            "Quantity": 8
        }
    ],
    "NumberOfPoints": 8,
    "GeneralComments": "Charging8 Superchargers, available 24/7, up to 120kW",
    "StatusTypeID": 50,
    "DateLastStatusUpdate": "2019-11-11T19:51:00Z",
    "DataQualityLevel": 1,
    "DateCreated": "2018-03-16T06:45:00Z",
    "SubmissionStatusTypeID": 200
}