{
    "IsRecentlyVerified": false,
    "ID": 179900,
    "UUID": "CD4FFA45-6D81-41AF-AA85-E383867C491C",
    "DataProviderID": 29,
    "DataProvidersReference": "16098",
    "OperatorID": 45,
    "AddressInfo": {
        "ID": 180259,
        "Title": "Oeserstr. 155",
        "AddressLine1": "Oeserstr. 155",
        "Town": "Frankfurt",
        "Postcode": "65934",
        "CountryID": 87,
        "Latitude": 50.107564,
        "Longitude": 8.587532,
        "DistanceUnit": 0
    },
    "Connections": [
        {
            "ID": 282339,
            "ConnectionTypeID": 25,
            "StatusTypeID": 50,
            "LevelID": 2,
            "PowerKW": 22,
            "CurrentTypeID": 20
        },
        {
            "ID": 282340,
            "ConnectionTypeID": 1036,
            "StatusTypeID": 50,
            "LevelID": 2,
            "PowerKW": 22,
            "CurrentTypeID": 20
        },
        {
            "ID": 297569,
            "ConnectionTypeID": 25,
            "StatusTypeID": 50,
            "LevelID": 2,
            "PowerKW": 22,
            "CurrentTypeID": 20
        },
        {
            "ID": 297570,
            "ConnectionTypeID": 1036,
            "StatusTypeID": 50,
            "LevelID": 2,
            "PowerKW": 22,
            "CurrentTypeID": 20
        }
    ],
    "StatusTypeID": 50,
    "DateLastStatusUpdate": "2021-07-12T02:44:00Z",
    "MetadataValues": [
        {
            "ID": 12194,
            "MetadataFieldID": 4,
            "ItemValue": "Data from the German chargepoint registry provided by Bundesnetzagentur.de under the CC-BY 4.0 license"
        }
    ],
    "DataQualityLevel": 3,
    "DateCreated": "2021-07-08T10:00:00Z",
    "SubmissionStatusTypeID": 100
}