{
    "IsRecentlyVerified": false,
    "ID": 173882,
    "UUID": "5D498A59-9EC0-416A-ACCD-C7E92F5B944D",
    "DataProviderID": 1,
    "OperatorID": 3,
    "OperatorsReference": "PG-70286,PG-84549",
    "UsageTypeID": 4,
    "UsageCost": "Free",
    "AddressInfo": {
        "ID": 174241,
        "Title": "Tesco Extra-Gatwick",
        "AddressLine1": "Reigate Road",
        "Town": "Hookwood",
        "StateOrProvince": "Horley",
        "Postcode": "RH6 0AT",
        "CountryID": 1,
        "Latitude": 51.168527,
        "Longitude": -0.185032,
        "DistanceUnit": 0
    },
    "Connections": [
        {
            "ID": 267489,
            "ConnectionTypeID": 25,
            "StatusTypeID": 50,
            "LevelID": 2,
            "Amps": 32,
            "Voltage": 230,
            "PowerKW": 7,
            "CurrentTypeID": 10,
            "Quantity": 4
        }
    ],
    "NumberOfPoints": 4,
    "GeneralComments": "This is an open charge unit installed at the Tesco Extra super store at Reigate Road, Hookwood, Horley",
    "StatusTypeID": 50,
    "DateLastStatusUpdate": "2021-03-06T06:21:00Z",
    "DataQualityLevel": 1,
    "DateCreated": "2021-03-05T06:22:00Z",
    "SubmissionStatusTypeID": 200
}