{
    "IsRecentlyVerified": false,
    "ID": 159260,
    "UUID": "EE8CC1C7-49C7-4F41-9D60-5D5F9EA446F8",
    "DataProviderID": 2,
    "DataProvidersReference": "152228",
    "OperatorID": 5,
    "UsageTypeID": 1,
    "AddressInfo": {
        "ID": 159617,
        "Title": "KENTFIELD",
        "AddressLine1": "1800 Ignacio Blvd",
        "Town": "Novato",
        "StateOrProvince": "CA",
        "Postcode": "94949",
        "CountryID": 2,
        "Latitude": 38.076397,
        "Longitude": -122.574403,
        "ContactTelephone1": "888-758-4389",
        "AccessComments": "24 hours daily",
        "RelatedURL": "http://www.chargepoint.com/",
        "DistanceUnit": 0
    },
    "Connections": [
        {
            "ID": 229396,
            "ConnectionTypeID": 1,
            "LevelID": 2,
            "Amps": 16,
            "Voltage": 230,
            "PowerKW": 3.7,
            "CurrentTypeID": 10,
            "Quantity": 16
        }
    ],
    "StatusTypeID": 50,
    "DateLastStatusUpdate": "2020-06-26T02:59:00Z",
    "DataQualityLevel": 3,
    "DateCreated": "2020-06-26T02:59:00Z",
    "SubmissionStatusTypeID": 100
}