{
    "IsRecentlyVerified": false,
    "ID": 95914,
    "UUID": "F3BF61EB-1E04-44F0-91B3-2C7BF4CB8C4D",
    "DataProviderID": 1,
    "OperatorID": 3,
    "OperatorsReference": "PG-81611",
    "UsageTypeID": 4,
    "UsageCost": "Free",
    "AddressInfo": {
        "ID": 96260,
        "Title": "Magdalen Street Car Park",
        "AddressLine1": "Magdalen Street",
        "Town": "Exeter",
        "Postcode": "EX2 4HZ",
        "CountryID": 1,
        "Latitude": 50.7200844,
        "Longitude": -3.5274008,
        "DistanceUnit": 0
    },
    "Connections": [
        {
            "ID": 135869,
            "ConnectionTypeID": 25,
            "StatusTypeID": 50,
            "LevelID": 2,
            "Amps": 32,
            "Voltage": 400,
            "PowerKW": 22,
            "CurrentTypeID": 20,
            "Quantity": 2
        }
    ],
    "NumberOfPoints": 2,
    "GeneralComments": "This is an open charge unit located at Magdelene Street Car Park",
    "StatusTypeID": 50,
    "DateLastStatusUpdate": "2017-11-30T15:41:00Z",
    "DataQualityLevel": 1,
    "DateCreated": "2017-11-30T15:41:00Z",
    "SubmissionStatusTypeID": 200
}