{
    "IsRecentlyVerified": false,
    "ID": 123938,
    "UUID": "1A28E6FA-6533-4A2C-AC96-1221E3E5235B",
    "DataProviderID": 2,
    "DataProvidersReference": "88981",
    "UsageTypeID": 2,
    "AddressInfo": {
        "ID": 124284,
        "Title": "Grail Biotech",
        "AddressLine1": "1525 O'Brien Dr",
        "Town": "Menlo Park",
        "StateOrProvince": "CA",
        "Postcode": "94025",
        "CountryID": 2,
        "Latitude": 37.47705,
        "Longitude": -122.14088,
        "ContactTelephone1": "",
        "AccessComments": "For tenant use only",
        "RelatedURL": "",
        "DistanceUnit": 0
    },
    "Connections": [
        {
            "ID": 173972,
            "ConnectionTypeID": 1,
            "LevelID": 2,
            "Amps": 16,
            "Voltage": 230,
            "PowerKW": 3.7,
            "CurrentTypeID": 10,
            "Quantity": 2
        }
    ],
    "DateLastStatusUpdate": "2020-06-26T02:59:00Z",
    "DataQualityLevel": 3,
    "DateCreated": "2019-04-06T05:03:00Z",
    "SubmissionStatusTypeID": 100
}