{
    "IsRecentlyVerified": false,
    "ID": 87538,
    "UUID": "DCF91821-49A2-47B0-B2F7-A97F36BC57DF",
    "DataProviderID": 1,
    "UsageCost": "$2.50/h",
    "AddressInfo": {
        "ID": 87884,
        "Title": "Pukenui Holiday Park",
        "AddressLine1": "34 Lamb Rd ",
        "Town": "Pukenui",
        "StateOrProvince": "Northland",
        "Postcode": "0484",
        "CountryID": 161,
        "Latitude": -34.8170064,
        "Longitude": 173.11539990000006,
        "DistanceUnit": 0
    },
    "Connections": [
        {
            "ID": 124091,
            "ConnectionTypeID": 4
        }
    ],
    "NumberOfPoints": 1,
    "GeneralComments": "8am-8pm\r\nBlue Commando",
    "StatusTypeID": 50,
    "DateLastStatusUpdate": "2017-05-12T08:56:00Z",
    "DataQualityLevel": 1,
    "DateCreated": "2017-05-12T08:56:00Z",
    "SubmissionStatusTypeID": 200
}