{
    "IsRecentlyVerified": false,
    "ID": 150410,
    "UUID": "074952CE-E9B9-48D6-AA22-1511DFA6CC50",
    "DataProviderID": 28,
    "DataProvidersReference": "FR*S11*P11069*007",
    "OperatorID": 3257,
    "UsageTypeID": 5,
    "AddressInfo": {
        "ID": 150763,
        "Title": "CARCASSONNE - Allée Raymond Courrière",
        "AddressLine1": "Allée Raymond Courrière 11000 CARCASSONNE",
        "CountryID": 80,
        "Latitude": 43.230585,
        "Longitude": 2.353487,
        "AccessComments": "24h/24 7j/7",
        "DistanceUnit": 0
    },
    "Connections": [
        {
            "ID": 209111,
            "ConnectionTypeID": 28,
            "StatusTypeID": 50,
            "LevelID": 2,
            "PowerKW": 22,
            "CurrentTypeID": 10
        },
        {
            "ID": 209112,
            "ConnectionTypeID": 1036,
            "StatusTypeID": 50,
            "LevelID": 2,
            "PowerKW": 22,
            "CurrentTypeID": 20
        },
        {
            "ID": 209113,
            "ConnectionTypeID": 26,
            "StatusTypeID": 50,
            "LevelID": 2,
            "PowerKW": 22
        }
    ],
    "GeneralComments": "Recharge par badge et avec une application smartphone",
    "StatusTypeID": 50,
    "DateLastStatusUpdate": "2020-08-27T05:10:00Z",
    "DataQualityLevel": 2,
    "DateCreated": "2020-03-15T06:17:00Z",
    "SubmissionStatusTypeID": 100
}