{
    "IsRecentlyVerified": false,
    "ID": 16955,
    "UUID": "4F36D3D5-A868-48D8-A753-8AD27BCCC42D",
    "DataProviderID": 22,
    "DataProvidersReference": "F38575EE8AF23BA6D923C0D98EE767FC",
    "AddressInfo": {
        "ID": 17300,
        "Title": "山形日産自動車天童店",
        "AddressLine1": "山形県天童市大字貫津字石橋2407-1",
        "CountryID": 114,
        "Latitude": 38.35615997,
        "Longitude": 140.3889768,
        "ContactTelephone1": "023-653-7111",
        "DistanceUnit": 0
    },
    "Connections": [
        {
            "ID": 17196,
            "ConnectionTypeID": 2,
            "LevelID": 2,
            "Amps": 100,
            "Voltage": 480,
            "PowerKW": 48,
            "Quantity": 1
        }
    ],
    "DateLastStatusUpdate": "2013-06-29T08:51:00Z",
    "DataQualityLevel": 2,
    "DateCreated": "2013-06-29T08:51:00Z",
    "SubmissionStatusTypeID": 200
}