{
    "IsRecentlyVerified": false,
    "ID": 15608,
    "UUID": "56A55D18-D9C6-4304-9B8C-F565878543F6",
    "DataProviderID": 1,
    "OperatorID": 23,
    "UsageTypeID": 7,
    "UsageCost": "Free",
    "AddressInfo": {
        "ID": 15953,
        "Title": "Tesla Service Center Eindhoven",
        "AddressLine1": "Ekkersrijt 4505 ",
        "AddressLine2": "",
        "Town": "Son en Breugel",
        "StateOrProvince": "",
        "Postcode": "5692 DN",
        "CountryID": 159,
        "Latitude": 51.5002201,
        "Longitude": 5.465445600000066,
        "ContactTelephone1": "+31499 462990",
        "ContactTelephone2": "",
        "ContactEmail": "",
        "AccessComments": "Available from 8 till 18 h",
        "RelatedURL": "",
        "DistanceUnit": 0
    },
    "Connections": [
        {
            "ID": 13930,
            "ConnectionTypeID": 8,
            "StatusTypeID": 0,
            "LevelID": 2,
            "Amps": 70,
            "Voltage": 240,
            "PowerKW": 16.8,
            "CurrentTypeID": 10,
            "Quantity": 1
        }
    ],
    "NumberOfPoints": 1,
    "GeneralComments": "",
    "StatusTypeID": 50,
    "DateLastStatusUpdate": "2013-01-14T17:40:00Z",
    "DataQualityLevel": 1,
    "DateCreated": "2013-01-14T17:40:00Z",
    "SubmissionStatusTypeID": 200
}