{
    "IsRecentlyVerified": false,
    "ID": 121853,
    "UUID": "FC683A69-89AB-4012-864C-8A7B8E93B20D",
    "DataProviderID": 2,
    "DataProvidersReference": "104664",
    "OperatorID": 5,
    "UsageTypeID": 1,
    "AddressInfo": {
        "ID": 122199,
        "Title": "SEAPATH ON 67TH",
        "AddressLine1": "604 67th Ave N",
        "Town": "Myrtle Beach",
        "StateOrProvince": "SC",
        "Postcode": "29572",
        "CountryID": 2,
        "Latitude": 33.742045,
        "Longitude": -78.829562,
        "ContactTelephone1": "888-758-4389",
        "AccessComments": "24 hours daily",
        "RelatedURL": "http://www.chargepoint.com/",
        "DistanceUnit": 0
    },
    "Connections": [
        {
            "ID": 171685,
            "ConnectionTypeID": 1,
            "LevelID": 2,
            "Amps": 16,
            "Voltage": 230,
            "PowerKW": 3.7,
            "CurrentTypeID": 10,
            "Quantity": 4
        }
    ],
    "DateLastStatusUpdate": "2020-06-26T02:56:00Z",
    "DataQualityLevel": 3,
    "DateCreated": "2019-04-06T05:02:00Z",
    "SubmissionStatusTypeID": 100
}