{
    "IsRecentlyVerified": false,
    "ID": 68894,
    "UUID": "FAC64502-41DF-4D19-ACF6-213CB8CCE5B1",
    "DataProviderID": 1,
    "OperatorID": 23,
    "OperatorsReference": "19191",
    "UsageTypeID": 1,
    "UsageCost": "Free",
    "AddressInfo": {
        "ID": 69240,
        "Title": "New York State Solar Farm",
        "AddressLine1": "1938 Route 44",
        "Town": "Modena",
        "StateOrProvince": "NY",
        "Postcode": "12548",
        "CountryID": 2,
        "Latitude": 41.667817,
        "Longitude": -74.105784,
        "ContactTelephone1": "877-467-6527",
        "AccessComments": "24 hours daily",
        "RelatedURL": "http://www.teslamotors.com/supercharger",
        "DistanceUnit": 0
    },
    "Connections": [
        {
            "ID": 96597,
            "ConnectionTypeID": 30,
            "StatusTypeID": 50,
            "LevelID": 2,
            "Amps": 16,
            "Voltage": 230,
            "PowerKW": 16,
            "CurrentTypeID": 10,
            "Quantity": 5
        }
    ],
    "NumberOfPoints": 5,
    "StatusTypeID": 50,
    "DateLastStatusUpdate": "2017-01-31T18:30:00Z",
    "DataQualityLevel": 3,
    "DateCreated": "2016-06-25T03:36:00Z",
    "SubmissionStatusTypeID": 100
}