{
    "IsRecentlyVerified": false,
    "ID": 113060,
    "UUID": "0DE6D6A2-4FC7-4456-9CC1-5615E2091458",
    "DataProviderID": 1,
    "OperatorID": 23,
    "OperatorsReference": "34249",
    "UsageTypeID": 1,
    "UsageCost": "$0.26/kWh; other tariffs for older cars",
    "AddressInfo": {
        "ID": 113406,
        "Title": "Serramonte Center - Tesla Supercharger",
        "AddressLine1": "3 Serramonte Center",
        "Town": "Daly City",
        "StateOrProvince": "CA",
        "Postcode": "94015",
        "CountryID": 2,
        "Latitude": 37.673993,
        "Longitude": -122.472065,
        "ContactTelephone1": "877-798-3752",
        "AccessComments": "24 hours daily; for Tesla use only",
        "RelatedURL": "http://www.teslamotors.com/supercharger",
        "DistanceUnit": 0
    },
    "Connections": [
        {
            "ID": 159224,
            "ConnectionTypeID": 27,
            "StatusTypeID": 50,
            "LevelID": 3,
            "Amps": 100,
            "Voltage": 400,
            "PowerKW": 120,
            "CurrentTypeID": 30,
            "Quantity": 40
        }
    ],
    "NumberOfPoints": 40,
    "StatusTypeID": 50,
    "DateLastStatusUpdate": "2019-01-03T06:33:00Z",
    "DataQualityLevel": 3,
    "DateCreated": "2018-11-28T02:04:00Z",
    "SubmissionStatusTypeID": 100
}