{
    "IsRecentlyVerified": false,
    "ID": 116920,
    "UUID": "C80254C1-20AA-4F96-B48B-E42C99AEF021",
    "DataProviderID": 1,
    "OperatorID": 23,
    "OperatorsReference": "48878",
    "UsageTypeID": 4,
    "UsageCost": "$0.26/kWh; other tariffs for older cars",
    "AddressInfo": {
        "ID": 117266,
        "Title": "San Jose, Ca - Valet - Santana Row Supercharger",
        "AddressLine1": "330 South Winchester Santana Row",
        "Town": "San Jose",
        "StateOrProvince": "CA",
        "Postcode": "95128",
        "CountryID": 2,
        "Latitude": 37.321981,
        "Longitude": -121.948644,
        "DistanceUnit": 0
    },
    "Connections": [
        {
            "ID": 165506,
            "ConnectionTypeID": 27,
            "StatusTypeID": 50,
            "LevelID": 3,
            "PowerKW": 120,
            "CurrentTypeID": 30,
            "Quantity": 10
        }
    ],
    "NumberOfPoints": 10,
    "GeneralComments": "Charging10 Superchargers, available 11:00am – 10:00pm, up to 72kW",
    "StatusTypeID": 50,
    "DateLastStatusUpdate": "2019-02-14T06:35:00Z",
    "DataQualityLevel": 1,
    "DateCreated": "2019-02-14T06:35:00Z",
    "SubmissionStatusTypeID": 200
}