{
    "IsRecentlyVerified": false,
    "ID": 20209,
    "UUID": "4A0D2486-AF38-41CA-A952-C2ADB2F9091A",
    "DataProviderID": 1,
    "OperatorID": 1,
    "UsageTypeID": 0,
    "UsageCost": "",
    "AddressInfo": {
        "ID": 20554,
        "Title": "Renault - Condom",
        "AddressLine1": "",
        "AddressLine2": "",
        "Town": "",
        "StateOrProvince": "Condom",
        "Postcode": "32100",
        "CountryID": 80,
        "Latitude": 43.95047,
        "Longitude": 0.36307,
        "ContactTelephone1": "",
        "ContactTelephone2": "",
        "ContactEmail": "",
        "AccessComments": "Réservé aux clients de l'établissement",
        "RelatedURL": "",
        "DistanceUnit": 0
    },
    "Connections": [],
    "GeneralComments": "",
    "StatusTypeID": 50,
    "DateLastStatusUpdate": "2013-11-06T21:14:00Z",
    "DataQualityLevel": 1,
    "DateCreated": "2013-11-06T11:50:00Z",
    "SubmissionStatusTypeID": 200
}