{
    "IsRecentlyVerified": false,
    "ID": 122938,
    "UUID": "AE959F6F-0A57-490B-9005-239A55AB4C02",
    "DataProviderID": 2,
    "DataProvidersReference": "49877",
    "UsageTypeID": 1,
    "AddressInfo": {
        "ID": 123284,
        "Title": "Village of Pinehurst",
        "AddressLine1": "178 Village Green St W",
        "Town": "Pinehurst",
        "StateOrProvince": "NC",
        "Postcode": "28374",
        "CountryID": 2,
        "Latitude": 35.203956,
        "Longitude": -79.469927,
        "ContactTelephone1": "910-295-1900",
        "AccessComments": "24 hours daily",
        "RelatedURL": "",
        "DistanceUnit": 0
    },
    "Connections": [
        {
            "ID": 172867,
            "ConnectionTypeID": 1,
            "LevelID": 2,
            "Amps": 16,
            "Voltage": 230,
            "PowerKW": 3,
            "CurrentTypeID": 10,
            "Quantity": 2
        }
    ],
    "DateLastStatusUpdate": "2019-04-06T05:03:00Z",
    "DataQualityLevel": 3,
    "DateCreated": "2019-04-06T05:03:00Z",
    "SubmissionStatusTypeID": 100
}