{
    "IsRecentlyVerified": false,
    "ID": 88408,
    "UUID": "6A51F880-13E6-49F0-A649-57A968E7A138",
    "DataProviderID": 1,
    "UsageCost": "$8 flat fee",
    "AddressInfo": {
        "ID": 88754,
        "Title": "Luggate‎ Camp Ground",
        "AddressLine1": "105 Main Road",
        "Town": "Otago, Luggate",
        "Postcode": "9383",
        "CountryID": 161,
        "Latitude": -44.74770001340777,
        "Longitude": 169.268695291996,
        "DistanceUnit": 0
    },
    "Connections": [
        {
            "ID": 125387,
            "ConnectionTypeID": 4
        }
    ],
    "NumberOfPoints": 1,
    "GeneralComments": "Luggate camp ground just near bridge\r\n",
    "StatusTypeID": 50,
    "DateLastStatusUpdate": "2017-05-29T09:35:00Z",
    "DataQualityLevel": 1,
    "DateCreated": "2017-05-29T09:35:00Z",
    "SubmissionStatusTypeID": 200
}