{
    "IsRecentlyVerified": false,
    "ID": 120216,
    "UUID": "87A12C0A-3175-4C0A-B698-0A91EBD8F379",
    "DataProviderID": 2,
    "DataProvidersReference": "87462",
    "OperatorID": 5,
    "UsageTypeID": 1,
    "AddressInfo": {
        "ID": 120562,
        "Title": "PIE AE",
        "AddressLine1": "Campus Dr",
        "Town": "Austin",
        "StateOrProvince": "TX",
        "Postcode": "78758",
        "CountryID": 2,
        "Latitude": 30.4041937,
        "Longitude": -97.7054647,
        "ContactTelephone1": "888-758-4389",
        "AccessComments": "24 hours daily",
        "RelatedURL": "http://www.chargepoint.com/",
        "DistanceUnit": 0
    },
    "Connections": [
        {
            "ID": 169544,
            "ConnectionTypeID": 1,
            "LevelID": 2,
            "Amps": 16,
            "Voltage": 230,
            "PowerKW": 3,
            "CurrentTypeID": 10,
            "Quantity": 4
        }
    ],
    "DateLastStatusUpdate": "2019-12-24T09:09:00Z",
    "DataQualityLevel": 3,
    "DateCreated": "2019-04-01T04:59:00Z",
    "SubmissionStatusTypeID": 100
}