{
    "IsRecentlyVerified": false,
    "ID": 158585,
    "UUID": "2396A795-F15F-4F18-BFED-2028A8E5AC61",
    "DataProviderID": 2,
    "DataProvidersReference": "155053",
    "OperatorID": 3372,
    "UsageTypeID": 2,
    "AddressInfo": {
        "ID": 158942,
        "Title": "Bobit Business Media",
        "AddressLine1": "3520 Challenger St",
        "Town": "Torrance",
        "StateOrProvince": "CA",
        "Postcode": "90503",
        "CountryID": 2,
        "Latitude": 33.8505282,
        "Longitude": -118.3481124,
        "ContactTelephone1": "",
        "AccessComments": "24 hours daily; Also accepts Paypal",
        "RelatedURL": "http://evconnect.com/",
        "DistanceUnit": 0
    },
    "Connections": [
        {
            "ID": 228594,
            "ConnectionTypeID": 1,
            "LevelID": 2,
            "Amps": 16,
            "Voltage": 230,
            "PowerKW": 3.7,
            "CurrentTypeID": 10,
            "Quantity": 6
        }
    ],
    "StatusTypeID": 50,
    "DateLastStatusUpdate": "2020-06-26T02:56:00Z",
    "DataQualityLevel": 3,
    "DateCreated": "2020-06-26T02:56:00Z",
    "SubmissionStatusTypeID": 100
}