{
    "IsRecentlyVerified": false,
    "ID": 61178,
    "UUID": "3015B35B-E54A-4A80-B19C-ADF031AB62B8",
    "DataProviderID": 1,
    "OperatorID": 44,
    "UsageTypeID": 1,
    "AddressInfo": {
        "ID": 61524,
        "Title": "Ladepunkt Hungen",
        "AddressLine1": "Tannenweg 5",
        "AddressLine2": "Ringelshausen",
        "Town": "Hungen",
        "StateOrProvince": "Landkreis Gießen",
        "Postcode": "35410",
        "CountryID": 87,
        "Latitude": 50.44958565208091,
        "Longitude": 8.949202926966343,
        "ContactTelephone1": "+49 6402 508127",
        "AccessComments": "Die Steckdose befindet sich auf der Vorderseite des Hauses, rechts neben dem Hauseingang zwischen den beiden oberen Briefkästen. Falls möglich bitte auf der Straße parken. Betreiber ist Herr Pavlovic.",
        "DistanceUnit": 0
    },
    "Connections": [
        {
            "ID": 77858,
            "ConnectionTypeID": 28,
            "StatusTypeID": 50,
            "LevelID": 2,
            "Amps": 16,
            "Voltage": 230,
            "PowerKW": 3.7,
            "CurrentTypeID": 10,
            "Quantity": 1
        }
    ],
    "NumberOfPoints": 1,
    "StatusTypeID": 50,
    "DateLastStatusUpdate": "2016-02-14T11:06:00Z",
    "DataQualityLevel": 1,
    "DateCreated": "2016-02-14T11:06:00Z",
    "SubmissionStatusTypeID": 200
}