{
    "IsRecentlyVerified": false,
    "ID": 186394,
    "UUID": "63865010-CADE-44B9-B52D-42AC19CB996F",
    "DataProviderID": 29,
    "DataProvidersReference": "15286",
    "OperatorID": 45,
    "AddressInfo": {
        "ID": 186753,
        "Title": "Viersener Straße 103",
        "AddressLine1": "Viersener Straße 103",
        "Town": "Viersen",
        "Postcode": "41751",
        "CountryID": 87,
        "Latitude": 51.254579,
        "Longitude": 6.345871,
        "DistanceUnit": 0
    },
    "Connections": [
        {
            "ID": 298999,
            "ConnectionTypeID": 25,
            "StatusTypeID": 50,
            "LevelID": 2,
            "PowerKW": 22,
            "CurrentTypeID": 20
        },
        {
            "ID": 299000,
            "ConnectionTypeID": 25,
            "StatusTypeID": 50,
            "LevelID": 2,
            "PowerKW": 22,
            "CurrentTypeID": 20
        }
    ],
    "StatusTypeID": 50,
    "DateLastStatusUpdate": "2021-07-12T02:47:00Z",
    "MetadataValues": [
        {
            "ID": 18635,
            "MetadataFieldID": 4,
            "ItemValue": "Data from the German chargepoint registry provided by Bundesnetzagentur.de under the CC-BY 4.0 license"
        }
    ],
    "DataQualityLevel": 3,
    "DateCreated": "2021-07-12T02:47:00Z",
    "SubmissionStatusTypeID": 100
}