{
    "IsRecentlyVerified": false,
    "ID": 122401,
    "UUID": "6A6D92D1-E739-47D8-9918-F466E7156749",
    "DataProviderID": 2,
    "DataProvidersReference": "80763",
    "UsageTypeID": 2,
    "AddressInfo": {
        "ID": 122747,
        "Title": "Rick Hendrick Chevrolet of Buford",
        "AddressLine1": "4490 S Lee St",
        "Town": "Buford",
        "StateOrProvince": "GA",
        "Postcode": "30518",
        "CountryID": 2,
        "Latitude": 34.107015,
        "Longitude": -84.003655,
        "ContactTelephone1": "",
        "AccessComments": "Service center use only",
        "RelatedURL": "",
        "DistanceUnit": 0
    },
    "Connections": [
        {
            "ID": 172289,
            "ConnectionTypeID": 1,
            "LevelID": 2,
            "Amps": 16,
            "Voltage": 230,
            "PowerKW": 3,
            "CurrentTypeID": 10,
            "Quantity": 2
        }
    ],
    "DateLastStatusUpdate": "2019-04-06T05:03:00Z",
    "DataQualityLevel": 3,
    "DateCreated": "2019-04-06T05:03:00Z",
    "SubmissionStatusTypeID": 100
}