{
    "IsRecentlyVerified": false,
    "ID": 83524,
    "UUID": "7E7F7393-DC2C-4D24-BC17-2726BCEA9E46",
    "DataProviderID": 1,
    "OperatorID": 25,
    "OperatorsReference": "wandsworth-hillburyroad",
    "UsageTypeID": 4,
    "UsageCost": "£0.059/minute; min £1.18; other tariffs available",
    "AddressInfo": {
        "ID": 83870,
        "Title": "Hillbury Road",
        "AddressLine1": "Opposite 19 Hillbury Road",
        "Town": "LONDON",
        "Postcode": "SW17 8JT",
        "CountryID": 1,
        "Latitude": 51.4348982166,
        "Longitude": -0.148573645746,
        "DistanceUnit": 0
    },
    "Connections": [
        {
            "ID": 118351,
            "ConnectionTypeID": 25,
            "StatusTypeID": 50,
            "LevelID": 2,
            "Amps": 32,
            "Voltage": 230,
            "PowerKW": 7,
            "CurrentTypeID": 10,
            "Quantity": 3
        },
        {
            "ID": 118352,
            "ConnectionTypeID": 1,
            "StatusTypeID": 50,
            "LevelID": 2,
            "Amps": 16,
            "Voltage": 230,
            "PowerKW": 4,
            "CurrentTypeID": 10,
            "Quantity": 3
        }
    ],
    "NumberOfPoints": 3,
    "StatusTypeID": 50,
    "DateLastStatusUpdate": "2018-01-03T06:30:00Z",
    "DataQualityLevel": 1,
    "DateCreated": "2017-02-09T17:00:00Z",
    "SubmissionStatusTypeID": 200
}