{
    "IsRecentlyVerified": false,
    "ID": 122400,
    "UUID": "9CE88936-B9BF-4D96-82F7-FECA8D8650F7",
    "DataProviderID": 2,
    "DataProvidersReference": "100023",
    "OperatorID": 9,
    "UsageTypeID": 1,
    "AddressInfo": {
        "ID": 122746,
        "Title": "WSS",
        "AddressLine1": "660 W. Foothill Blvd",
        "Town": "Rialto",
        "StateOrProvince": "CA",
        "Postcode": "92376",
        "CountryID": 2,
        "Latitude": 34.106957,
        "Longitude": -117.382616,
        "ContactTelephone1": "888-998-2546",
        "AccessComments": "MON: 24 hours | TUE: 24 hours | WED: 24 hours | THU: 24 hours | FRI: 24 hours | SAT: 24 hours | SUN: 24 hours",
        "RelatedURL": "http://www.blinkcharging.com/",
        "DistanceUnit": 0
    },
    "Connections": [
        {
            "ID": 172288,
            "ConnectionTypeID": 1,
            "LevelID": 2,
            "Amps": 16,
            "Voltage": 230,
            "PowerKW": 3.7,
            "CurrentTypeID": 10,
            "Quantity": 3
        }
    ],
    "DateLastStatusUpdate": "2020-06-26T02:57:00Z",
    "DataQualityLevel": 3,
    "DateCreated": "2019-04-06T05:03:00Z",
    "SubmissionStatusTypeID": 100
}