{
    "IsRecentlyVerified": false,
    "ID": 110117,
    "UUID": "3F0183C8-44F7-4F8E-A50D-DAA7E7C39F12",
    "DataProviderID": 2,
    "DataProvidersReference": "103787",
    "UsageTypeID": 1,
    "AddressInfo": {
        "ID": 110463,
        "Title": "LADWP - West Slauson Avenue",
        "AddressLine1": "664 7/8 W Slauson Ave",
        "Town": "Los Angeles",
        "StateOrProvince": "CA",
        "Postcode": "90044",
        "CountryID": 2,
        "Latitude": 33.988889,
        "Longitude": -118.285476,
        "ContactTelephone1": "800-342-5397",
        "AccessComments": "24 hours daily",
        "RelatedURL": "",
        "DistanceUnit": 0
    },
    "Connections": [
        {
            "ID": 155349,
            "ConnectionTypeID": 1,
            "LevelID": 2,
            "Amps": 16,
            "Voltage": 230,
            "PowerKW": 3,
            "CurrentTypeID": 10,
            "Quantity": 1
        }
    ],
    "DateLastStatusUpdate": "2019-04-06T04:01:00Z",
    "DataQualityLevel": 3,
    "DateCreated": "2018-10-18T23:35:00Z",
    "SubmissionStatusTypeID": 100
}