{
    "IsRecentlyVerified": false,
    "ID": 46884,
    "UUID": "6210C7CE-FE39-4596-837B-4F0C409392E1",
    "DataProviderID": 1,
    "OperatorID": 189,
    "UsageTypeID": 1,
    "AddressInfo": {
        "ID": 47230,
        "Title": "Parkplatz Stadthalle in Vilsbiburg",
        "AddressLine1": "Pfarrbrückenweg 9",
        "Town": "Vilsbiburg",
        "Postcode": "84137",
        "CountryID": 87,
        "Latitude": 48.4487596254962,
        "Longitude": 12.3587465938766,
        "AccessComments": "Freischaltung via SMS, Ladekarte der Stadtwerke Vilsbiburg oder E-Wald Karte.",
        "DistanceUnit": 0
    },
    "Connections": [
        {
            "ID": 57683,
            "ConnectionTypeID": 25,
            "StatusTypeID": 50,
            "LevelID": 2,
            "Amps": 32,
            "Voltage": 400,
            "PowerKW": 22,
            "CurrentTypeID": 20,
            "Quantity": 2
        },
        {
            "ID": 57684,
            "ConnectionTypeID": 28,
            "StatusTypeID": 50,
            "LevelID": 2,
            "Amps": 16,
            "Voltage": 230,
            "PowerKW": 3.7,
            "CurrentTypeID": 10,
            "Quantity": 2
        }
    ],
    "NumberOfPoints": 2,
    "StatusTypeID": 50,
    "DateLastStatusUpdate": "2015-05-08T21:37:00Z",
    "DataQualityLevel": 1,
    "DateCreated": "2015-05-08T21:20:00Z",
    "SubmissionStatusTypeID": 200
}