{
    "IsRecentlyVerified": false,
    "ID": 187071,
    "UUID": "DCC2BBB2-D787-4A81-B407-8390FE23EE9E",
    "DataProviderID": 29,
    "DataProvidersReference": "15759",
    "OperatorID": 3403,
    "AddressInfo": {
        "ID": 187430,
        "Title": "Heinestr. 1",
        "AddressLine1": "Heinestr. 1",
        "Town": "Templin",
        "Postcode": "17268",
        "CountryID": 87,
        "Latitude": 53.11859,
        "Longitude": 13.50433,
        "DistanceUnit": 0
    },
    "Connections": [
        {
            "ID": 301137,
            "ConnectionTypeID": 25,
            "StatusTypeID": 50,
            "LevelID": 2,
            "PowerKW": 22,
            "CurrentTypeID": 20
        },
        {
            "ID": 301138,
            "ConnectionTypeID": 25,
            "StatusTypeID": 50,
            "LevelID": 2,
            "PowerKW": 22,
            "CurrentTypeID": 20
        }
    ],
    "StatusTypeID": 50,
    "DateLastStatusUpdate": "2021-07-12T02:50:00Z",
    "MetadataValues": [
        {
            "ID": 19311,
            "MetadataFieldID": 4,
            "ItemValue": "Data from the German chargepoint registry provided by Bundesnetzagentur.de under the CC-BY 4.0 license"
        }
    ],
    "DataQualityLevel": 3,
    "DateCreated": "2021-07-12T02:50:00Z",
    "SubmissionStatusTypeID": 100
}