{
    "IsRecentlyVerified": false,
    "ID": 166505,
    "UUID": "253F202E-92E5-4D23-898B-D2BF343D82BD",
    "DataProviderID": 28,
    "DataProvidersReference": "FR*S28*PSDE28*BROU1",
    "UsageTypeID": 5,
    "AddressInfo": {
        "ID": 166864,
        "Title": "Brou | Place de L'Hôtel de ville",
        "AddressLine1": "Place de L'Hôtel de ville 28160 Brou",
        "CountryID": 80,
        "Latitude": 48.210938,
        "Longitude": 1.165922,
        "AccessComments": "24/24 7/7",
        "DistanceUnit": 0
    },
    "Connections": [
        {
            "ID": 248878,
            "ConnectionTypeID": 1036,
            "StatusTypeID": 50,
            "LevelID": 2,
            "PowerKW": 22,
            "CurrentTypeID": 20
        },
        {
            "ID": 248879,
            "ConnectionTypeID": 26,
            "StatusTypeID": 50,
            "LevelID": 2,
            "PowerKW": 22
        },
        {
            "ID": 248880,
            "ConnectionTypeID": 28,
            "StatusTypeID": 50,
            "LevelID": 2,
            "PowerKW": 22,
            "CurrentTypeID": 10
        }
    ],
    "GeneralComments": "",
    "StatusTypeID": 50,
    "DateLastStatusUpdate": "2020-08-27T05:14:00Z",
    "DataQualityLevel": 2,
    "DateCreated": "2020-08-27T05:14:00Z",
    "SubmissionStatusTypeID": 100
}