{
    "IsRecentlyVerified": false,
    "ID": 163742,
    "UUID": "F76F0DAC-AAA2-4150-BB9A-7FBFD927C75F",
    "DataProviderID": 1,
    "OperatorID": 23,
    "OperatorsReference": "44575",
    "UsageTypeID": 4,
    "AddressInfo": {
        "ID": 164099,
        "Title": "Hotel Spa Terraza",
        "AddressLine1": "Avgda. de Rhode",
        "Town": "32",
        "StateOrProvince": "Roses",
        "Postcode": "17480",
        "CountryID": 210,
        "Latitude": 42.265609,
        "Longitude": 3.167589,
        "ContactTelephone1": "+34 972 256 154",
        "DistanceUnit": 0
    },
    "Connections": [
        {
            "ID": 235339,
            "ConnectionTypeID": 30,
            "StatusTypeID": 50,
            "LevelID": 2,
            "PowerKW": 5,
            "CurrentTypeID": 20,
            "Quantity": 1
        }
    ],
    "NumberOfPoints": 1,
    "GeneralComments": "1 Tesla Connector, up to 5kW.Available for customers. Please see front desk.",
    "StatusTypeID": 50,
    "DateLastStatusUpdate": "2020-08-24T15:54:00Z",
    "DataQualityLevel": 1,
    "DateCreated": "2020-08-24T15:53:00Z",
    "SubmissionStatusTypeID": 200
}