{
    "IsRecentlyVerified": false,
    "ID": 100607,
    "UUID": "362D57C8-3676-4263-955B-EC6D5C454DA5",
    "DataProviderID": 1,
    "OperatorID": 23,
    "OperatorsReference": "41075",
    "UsageTypeID": 4,
    "UsageCost": "$0.22/kWh; other tariffs for older cars",
    "AddressInfo": {
        "ID": 100953,
        "Title": "Tampa, FL Supercharger",
        "AddressLine1": "2502 North 50th Street",
        "Town": "Tampa",
        "StateOrProvince": "FL",
        "Postcode": "33619-2742",
        "CountryID": 2,
        "Latitude": 27.965335,
        "Longitude": -82.402003,
        "DistanceUnit": 0
    },
    "Connections": [
        {
            "ID": 142100,
            "ConnectionTypeID": 27,
            "StatusTypeID": 50,
            "LevelID": 3,
            "PowerKW": 120,
            "CurrentTypeID": 30,
            "Quantity": 8
        }
    ],
    "NumberOfPoints": 8,
    "GeneralComments": "Charging8 Superchargers, available 24/7, up to 120kW",
    "StatusTypeID": 50,
    "DateLastStatusUpdate": "2018-03-13T08:54:00Z",
    "DataQualityLevel": 1,
    "DateCreated": "2018-03-02T06:56:00Z",
    "SubmissionStatusTypeID": 200
}