{
    "IsRecentlyVerified": false,
    "ID": 63087,
    "UUID": "EC8AD984-6D30-4F8B-9461-143745AF4483",
    "DataProviderID": 26,
    "DataProvidersReference": "73233",
    "OperatorID": 73,
    "OperatorsReference": "EV-Box EVB-P1424180",
    "UsageCost": "0.00 jaarabonnement",
    "AddressInfo": {
        "ID": 63433,
        "Title": "Aldenhof 7014",
        "AddressLine1": "Aldenhof 7014",
        "Town": "Nijmegen",
        "Postcode": "6537 DW",
        "CountryID": 159,
        "Latitude": 51.80921,
        "Longitude": 5.80221,
        "RelatedURL": "http://www.ev-box.nl",
        "DistanceUnit": 0
    },
    "Connections": [
        {
            "ID": 80218,
            "ConnectionTypeID": 25,
            "LevelID": 2,
            "PowerKW": 5,
            "CurrentTypeID": 10
        }
    ],
    "NumberOfPoints": 1,
    "StatusTypeID": 50,
    "DateLastStatusUpdate": "2016-06-04T02:40:00Z",
    "DataQualityLevel": 3,
    "DateCreated": "2016-03-03T12:29:00Z",
    "SubmissionStatusTypeID": 100
}