{
    "IsRecentlyVerified": false,
    "ID": 174671,
    "UUID": "C9E570F3-B47A-4AFC-A551-67E4C61FE54D",
    "DataProviderID": 1,
    "OperatorID": 3439,
    "UsageTypeID": 4,
    "AddressInfo": {
        "ID": 175030,
        "Title": "Voltrun - E-POwer",
        "AddressLine1": "Ankara - Kırıkkale yolu",
        "Town": "Irmak",
        "StateOrProvince": "Kırıkkale",
        "Postcode": "",
        "CountryID": 229,
        "Latitude": 39.92475171107486,
        "Longitude": 33.37689567463201,
        "DistanceUnit": 0
    },
    "Connections": [
        {
            "ID": 270647,
            "ConnectionTypeID": 25,
            "StatusTypeID": 50,
            "LevelID": 2,
            "PowerKW": 22,
            "CurrentTypeID": 20,
            "Quantity": 1
        }
    ],
    "NumberOfPoints": 1,
    "StatusTypeID": 50,
    "DateLastStatusUpdate": "2021-04-11T12:47:00Z",
    "DataQualityLevel": 1,
    "DateCreated": "2021-04-10T20:02:00Z",
    "SubmissionStatusTypeID": 200
}