{
    "IsRecentlyVerified": false,
    "ID": 160060,
    "UUID": "2E79D9D8-3772-446B-91B1-CE68F7A1A19C",
    "DataProviderID": 2,
    "DataProvidersReference": "153259",
    "OperatorID": 5,
    "UsageTypeID": 1,
    "AddressInfo": {
        "ID": 160417,
        "Title": "WILLIAMS COLLEG",
        "AddressLine1": "973 Main St",
        "Town": "Williamstown",
        "StateOrProvince": "MA",
        "Postcode": "01267",
        "CountryID": 2,
        "Latitude": 42.7124064,
        "Longitude": -73.2071107,
        "ContactTelephone1": "888-758-4389",
        "AccessComments": "24 hours daily",
        "RelatedURL": "http://www.chargepoint.com/",
        "DistanceUnit": 0
    },
    "Connections": [
        {
            "ID": 230296,
            "ConnectionTypeID": 1,
            "LevelID": 2,
            "Amps": 16,
            "Voltage": 230,
            "PowerKW": 3.7,
            "CurrentTypeID": 10,
            "Quantity": 2
        }
    ],
    "StatusTypeID": 50,
    "DateLastStatusUpdate": "2020-06-26T03:06:00Z",
    "DataQualityLevel": 3,
    "DateCreated": "2020-06-26T03:06:00Z",
    "SubmissionStatusTypeID": 100
}