{
    "IsRecentlyVerified": false,
    "ID": 121904,
    "UUID": "CD4A1D0B-3098-4E72-AE62-6DC34767A4F7",
    "DataProviderID": 2,
    "DataProvidersReference": "113215",
    "OperatorID": 23,
    "UsageTypeID": 2,
    "AddressInfo": {
        "ID": 122250,
        "Title": "Airbnb - Chili's Retreat - Tesla Destination",
        "AddressLine1": "695 S Vista Oro",
        "Town": "Palm Springs",
        "StateOrProvince": "CA",
        "Postcode": "92264",
        "CountryID": 2,
        "Latitude": 33.812509,
        "Longitude": -116.539712,
        "ContactTelephone1": "",
        "AccessComments": "Available for Airbnb patrons only; for Tesla use only",
        "RelatedURL": "https://www.tesla.com/destination-charging",
        "DistanceUnit": 0
    },
    "Connections": [
        {
            "ID": 171744,
            "ConnectionTypeID": 0,
            "LevelID": 2,
            "Amps": 16,
            "Voltage": 230,
            "PowerKW": 3,
            "CurrentTypeID": 10,
            "Quantity": 1
        }
    ],
    "DateLastStatusUpdate": "2019-04-06T05:02:00Z",
    "DataQualityLevel": 3,
    "DateCreated": "2019-04-06T05:02:00Z",
    "SubmissionStatusTypeID": 100
}