{
    "IsRecentlyVerified": false,
    "ID": 162124,
    "UUID": "2A915724-CEE3-4B7A-B3F9-EE71A372B591",
    "DataProviderID": 1,
    "OperatorID": 23,
    "OperatorsReference": "43469",
    "UsageTypeID": 4,
    "UsageCost": "€0.37/kWh; Autres tarifs pour les voitures anciennes",
    "AddressInfo": {
        "ID": 162481,
        "Title": "Angoulême Supercharger",
        "AddressLine1": "122 Rue des Meneaux",
        "Town": "Angoulême",
        "Postcode": "16430",
        "CountryID": 80,
        "Latitude": 45.69450182505014,
        "Longitude": 0.17891341929220062,
        "DistanceUnit": 0
    },
    "Connections": [
        {
            "ID": 233333,
            "ConnectionTypeID": 27,
            "StatusTypeID": 50,
            "LevelID": 3,
            "PowerKW": 250,
            "CurrentTypeID": 30,
            "Quantity": 8
        }
    ],
    "NumberOfPoints": 8,
    "GeneralComments": "8 Superchargers, available 24/7",
    "StatusTypeID": 50,
    "DateLastStatusUpdate": "2021-11-03T02:40:00Z",
    "DataQualityLevel": 1,
    "DateCreated": "2020-08-02T05:35:00Z",
    "SubmissionStatusTypeID": 200
}