{
    "IsRecentlyVerified": false,
    "ID": 36901,
    "UUID": "1F3FA109-3FFA-4768-97EC-52114CA35586",
    "DataProviderID": 26,
    "DataProvidersReference": "47313",
    "OperatorID": 178,
    "OperatorsReference": "EVnetNL AL469",
    "UsageCost": "0.00 jaarabonnement",
    "AddressInfo": {
        "ID": 37247,
        "Title": "Veldweg 28",
        "AddressLine1": "Veldweg 28",
        "Town": "Bussum",
        "Postcode": "1404 CV",
        "CountryID": 159,
        "Latitude": 52.274542,
        "Longitude": 5.160836,
        "ContactTelephone1": "0800-3522365",
        "RelatedURL": "http://www.evnet.nl",
        "DistanceUnit": 0
    },
    "Connections": [
        {
            "ID": 40412,
            "ConnectionTypeID": 25,
            "LevelID": 2,
            "PowerKW": 11,
            "CurrentTypeID": 10
        }
    ],
    "NumberOfPoints": 2,
    "StatusTypeID": 50,
    "DateLastStatusUpdate": "2016-06-04T02:52:00Z",
    "DataQualityLevel": 3,
    "DateCreated": "2015-01-09T06:07:00Z",
    "SubmissionStatusTypeID": 100
}