{
    "IsRecentlyVerified": false,
    "ID": 115897,
    "UUID": "AE379BA9-18B4-46BA-A3F3-7F2ACB416C7F",
    "DataProviderID": 2,
    "DataProvidersReference": "117237",
    "UsageTypeID": 2,
    "AddressInfo": {
        "ID": 116243,
        "Title": "Delaware Water Gap National Recreation Area",
        "AddressLine1": "1978 River Rd",
        "Town": "Bushkill",
        "StateOrProvince": "PA",
        "Postcode": "18324",
        "CountryID": 2,
        "Latitude": 41.0964968,
        "Longitude": -74.9958207,
        "ContactTelephone1": "",
        "AccessComments": "Fleet use only",
        "RelatedURL": "",
        "DistanceUnit": 0
    },
    "Connections": [
        {
            "ID": 162941,
            "ConnectionTypeID": 1,
            "LevelID": 2,
            "Amps": 16,
            "Voltage": 230,
            "PowerKW": 3.7,
            "CurrentTypeID": 10,
            "Quantity": 1
        }
    ],
    "DateLastStatusUpdate": "2020-06-26T03:04:00Z",
    "DataQualityLevel": 3,
    "DateCreated": "2019-02-11T07:13:00Z",
    "SubmissionStatusTypeID": 100
}