{
    "IsRecentlyVerified": false,
    "ID": 28511,
    "UUID": "00AE1E5A-55DB-4F11-A242-F81EFE8C6DD4",
    "DataProviderID": 2,
    "DataProvidersReference": "61756",
    "UsageTypeID": 7,
    "AddressInfo": {
        "ID": 28857,
        "Title": "Aitoro Appliance",
        "AddressLine1": "401 Westport Ave",
        "Town": "Norwalk",
        "StateOrProvince": "CT",
        "Postcode": "06851",
        "CountryID": 2,
        "Latitude": 41.126373,
        "Longitude": -73.390319,
        "ContactTelephone1": "203-847-2471",
        "AccessComments": "Store business hours; see inside for access\r\nPublic - Call ahead",
        "RelatedURL": "",
        "DistanceUnit": 0
    },
    "Connections": [
        {
            "ID": 31332,
            "ConnectionTypeID": 1,
            "LevelID": 2,
            "Amps": 16,
            "Voltage": 230,
            "PowerKW": 3.7,
            "CurrentTypeID": 10,
            "Quantity": 1
        }
    ],
    "DateLastStatusUpdate": "2020-06-26T03:04:00Z",
    "DataQualityLevel": 3,
    "DateCreated": "2014-11-28T03:38:00Z",
    "SubmissionStatusTypeID": 100
}