{
    "IsRecentlyVerified": false,
    "ID": 19663,
    "UUID": "DF48F9E9-DA30-4B74-AB5E-78A31D6F3A30",
    "DataProviderID": 1,
    "OperatorID": 32,
    "OperatorsReference": "1771",
    "UsageTypeID": 6,
    "UsageCost": "Inclusive; for Polar Plus subscription members only",
    "AddressInfo": {
        "ID": 20008,
        "Title": "Glyn Hopkin Nissan",
        "AddressLine1": "12 Bilton Road",
        "Town": "Chelmsford",
        "StateOrProvince": "Essex",
        "Postcode": "CM1 2UP",
        "CountryID": 1,
        "Latitude": 51.7289725904498,
        "Longitude": 0.454273228161583,
        "ContactTelephone1": "08446922907",
        "RelatedURL": "http://www.glynhopkin.com/contact-us/12/nissan-chelmsford",
        "DistanceUnit": 0
    },
    "Connections": [
        {
            "ID": 34790,
            "ConnectionTypeID": 25,
            "StatusTypeID": 50,
            "LevelID": 2,
            "Amps": 32,
            "Voltage": 230,
            "PowerKW": 7,
            "CurrentTypeID": 10,
            "Quantity": 2
        }
    ],
    "NumberOfPoints": 2,
    "GeneralComments": "Chargemaster post. Formerly on Source East.",
    "StatusTypeID": 50,
    "DateLastStatusUpdate": "2019-03-07T06:40:00Z",
    "MetadataValues": [
        {
            "ID": 246,
            "MetadataFieldID": 4,
            "ItemValue": "Data © OpenStreetMap contributors, ODbL 1.0. http://www.openstreetmap.org/copyright"
        }
    ],
    "DataQualityLevel": 1,
    "DateCreated": "2013-10-09T17:33:00Z",
    "SubmissionStatusTypeID": 200
}