{
    "IsRecentlyVerified": false,
    "ID": 103191,
    "UUID": "073815B7-EC4B-42B8-AA30-6731A70A544A",
    "DataProviderID": 1,
    "OperatorID": 3279,
    "OperatorsReference": "0217",
    "UsageTypeID": 4,
    "UsageCost": "€0/kWh",
    "AddressInfo": {
        "ID": 103537,
        "Title": "Campo Futbol Pina",
        "AddressLine1": "Camí Son Perot 07210",
        "Town": "ALGAIDA",
        "StateOrProvince": "Baleares",
        "Postcode": "07210",
        "CountryID": 210,
        "Latitude": 39.595813,
        "Longitude": 2.925869,
        "DistanceUnit": 0
    },
    "Connections": [
        {
            "ID": 145785,
            "ConnectionTypeID": 25,
            "StatusTypeID": 50,
            "LevelID": 2,
            "Amps": 32,
            "Voltage": 400,
            "PowerKW": 22,
            "CurrentTypeID": 20,
            "Quantity": 1
        }
    ],
    "NumberOfPoints": 1,
    "StatusTypeID": 50,
    "DateLastStatusUpdate": "2018-07-12T05:35:00Z",
    "DataQualityLevel": 1,
    "DateCreated": "2018-04-24T06:21:00Z",
    "SubmissionStatusTypeID": 200
}