{
    "IsRecentlyVerified": false,
    "ID": 54457,
    "UUID": "5C48D451-8D9D-4EE9-9EF1-97E4DE9DC458",
    "DataProviderID": 1,
    "OperatorID": 45,
    "UsageTypeID": 7,
    "AddressInfo": {
        "ID": 54803,
        "Title": "Jugendherberge Boglerhaus",
        "AddressLine1": "Friedrich-Bogler-Straße 2",
        "Town": "Schwarzenborn",
        "StateOrProvince": "Schwalm-Eder-Kreis",
        "Postcode": "34639",
        "CountryID": 87,
        "Latitude": 50.9124454,
        "Longitude": 9.41868550000004,
        "ContactTelephone1": "05686 367",
        "AccessComments": "Das Boglerhaus liegt auf 660m Höhe und ist eine Jugendherberge mit angegliedertem Restaurant. Zum Laden in der Jugendherberge anmelden.\r\n",
        "RelatedURL": "http://www.boglerhaus.de",
        "DistanceUnit": 0
    },
    "Connections": [
        {
            "ID": 68682,
            "ConnectionTypeID": 25,
            "StatusTypeID": 50,
            "LevelID": 2,
            "Amps": 32,
            "Voltage": 400,
            "PowerKW": 22,
            "CurrentTypeID": 20,
            "Quantity": 2
        },
        {
            "ID": 68683,
            "ConnectionTypeID": 28,
            "StatusTypeID": 50,
            "LevelID": 2,
            "Amps": 16,
            "Voltage": 230,
            "PowerKW": 3.7,
            "CurrentTypeID": 10,
            "Quantity": 3
        }
    ],
    "NumberOfPoints": 5,
    "StatusTypeID": 50,
    "DateLastStatusUpdate": "2015-10-04T07:37:00Z",
    "DataQualityLevel": 1,
    "DateCreated": "2015-10-03T09:39:00Z",
    "SubmissionStatusTypeID": 200
}