{
    "IsRecentlyVerified": false,
    "ID": 107074,
    "UUID": "0C658A86-AF87-44E5-8193-E9A62EA002EE",
    "DataProviderID": 1,
    "OperatorID": 72,
    "UsageTypeID": 4,
    "AddressInfo": {
        "ID": 107420,
        "Title": "Geestemünder Straße",
        "AddressLine1": "Geestemünder Straße 18",
        "Town": "Köln",
        "StateOrProvince": "Nordrhein-Westfalen",
        "Postcode": "50735",
        "CountryID": 87,
        "Latitude": 50.99868905848245,
        "Longitude": 6.939397523803677,
        "AccessComments": "24/7 nutzbar mit e-regio oder Tank-E App",
        "DistanceUnit": 0
    },
    "Connections": [
        {
            "ID": 150959,
            "ConnectionTypeID": 25,
            "StatusTypeID": 50,
            "LevelID": 2,
            "Amps": 32,
            "Voltage": 400,
            "PowerKW": 22,
            "CurrentTypeID": 20,
            "Quantity": 2
        }
    ],
    "NumberOfPoints": 2,
    "StatusTypeID": 50,
    "DateLastStatusUpdate": "2018-07-17T05:12:00Z",
    "DataQualityLevel": 1,
    "DateCreated": "2018-07-17T05:12:00Z",
    "SubmissionStatusTypeID": 200
}