{
    "IsRecentlyVerified": false,
    "ID": 115481,
    "UUID": "F2F17DCB-BBE4-4D29-B18F-6FBFEAB2FEBF",
    "DataProviderID": 2,
    "DataProvidersReference": "117026",
    "OperatorID": 5,
    "UsageTypeID": 1,
    "AddressInfo": {
        "ID": 115827,
        "Title": "TMT",
        "AddressLine1": "11107 Ramona Blvd",
        "Town": "El Monte",
        "StateOrProvince": "CA",
        "Postcode": "91731",
        "CountryID": 2,
        "Latitude": 34.0730762,
        "Longitude": -118.0318875,
        "ContactTelephone1": "888-758-4389",
        "AccessComments": "24 hours daily",
        "RelatedURL": "http://www.chargepoint.com/",
        "DistanceUnit": 0
    },
    "Connections": [
        {
            "ID": 162493,
            "ConnectionTypeID": 1,
            "LevelID": 2,
            "Amps": 16,
            "Voltage": 230,
            "PowerKW": 3,
            "CurrentTypeID": 10,
            "Quantity": 2
        }
    ],
    "DateLastStatusUpdate": "2019-04-06T04:01:00Z",
    "DataQualityLevel": 3,
    "DateCreated": "2019-02-11T07:13:00Z",
    "SubmissionStatusTypeID": 100
}