{
    "IsRecentlyVerified": false,
    "ID": 109146,
    "UUID": "A51F7688-72C3-4DF4-AB51-1A6A2BA33412",
    "DataProviderID": 1,
    "OperatorID": 23,
    "OperatorsReference": "45128",
    "UsageTypeID": 4,
    "AddressInfo": {
        "ID": 109492,
        "Title": "Relais du Silence Domaine du Normandoux",
        "AddressLine1": "Rue des Sapins",
        "Town": "T",
        "StateOrProvince": "Tercé",
        "Postcode": "86800",
        "CountryID": 80,
        "Latitude": 46.523535,
        "Longitude": 0.55924,
        "ContactTelephone1": " +33 5 49 01 02 01",
        "DistanceUnit": 0
    },
    "Connections": [
        {
            "ID": 154264,
            "ConnectionTypeID": 30,
            "StatusTypeID": 50,
            "LevelID": 2,
            "PowerKW": 14,
            "CurrentTypeID": 20,
            "Quantity": 2
        }
    ],
    "NumberOfPoints": 2,
    "GeneralComments": "2 Tesla Connectors, up to 14kW.Available for customers. Please see front desk.",
    "StatusTypeID": 50,
    "DateLastStatusUpdate": "2018-10-11T13:45:00Z",
    "DataQualityLevel": 1,
    "DateCreated": "2018-10-11T13:45:00Z",
    "SubmissionStatusTypeID": 200
}