{
    "IsRecentlyVerified": false,
    "ID": 67932,
    "UUID": "2FF8BD1C-EE59-49BE-9A48-7525E688B2B2",
    "DataProviderID": 26,
    "DataProvidersReference": "91512",
    "OperatorID": 73,
    "OperatorsReference": "EV-Box EVB-P1541506",
    "UsageCost": "0.00 jaarabonnement",
    "AddressInfo": {
        "ID": 68278,
        "Title": "Ooststraat 44",
        "AddressLine1": "Ooststraat 44",
        "Town": "Schouwen-Duiveland",
        "Postcode": "4306 AC",
        "CountryID": 159,
        "Latitude": 51.64825,
        "Longitude": 4.00893,
        "RelatedURL": "http://www.ev-box.nl",
        "DistanceUnit": 0
    },
    "Connections": [
        {
            "ID": 94548,
            "ConnectionTypeID": 25,
            "LevelID": 2,
            "PowerKW": 5,
            "CurrentTypeID": 10
        }
    ],
    "NumberOfPoints": 1,
    "StatusTypeID": 50,
    "DateLastStatusUpdate": "2016-06-04T02:37:00Z",
    "DataQualityLevel": 3,
    "DateCreated": "2016-06-04T02:37:00Z",
    "SubmissionStatusTypeID": 100
}