{
    "IsRecentlyVerified": false,
    "ID": 62975,
    "UUID": "3C46D9BD-706E-4E5A-9B57-1ABD9DA6E3BC",
    "DataProviderID": 26,
    "DataProvidersReference": "77066",
    "OperatorID": 157,
    "OperatorsReference": "NewMotion 03002986",
    "UsageCost": "0.00 jaarabonnement",
    "AddressInfo": {
        "ID": 63321,
        "Title": "'s-Gravenkreek 47",
        "AddressLine1": "'s-Gravenkreek 47",
        "Town": "Tholen",
        "Postcode": "4697 DD",
        "CountryID": 159,
        "Latitude": 51.5961522,
        "Longitude": 4.1005437,
        "ContactTelephone1": "088 0109500",
        "RelatedURL": "http://thenewmotion.nl/",
        "DistanceUnit": 0
    },
    "Connections": [
        {
            "ID": 80062,
            "ConnectionTypeID": 25,
            "LevelID": 2,
            "PowerKW": 22,
            "CurrentTypeID": 10
        }
    ],
    "NumberOfPoints": 1,
    "StatusTypeID": 50,
    "DateLastStatusUpdate": "2016-06-04T02:39:00Z",
    "DataQualityLevel": 3,
    "DateCreated": "2016-03-03T12:29:00Z",
    "SubmissionStatusTypeID": 100
}