{
    "UserComments": [
        {
            "ID": 20042,
            "ChargePointID": 93529,
            "CommentTypeID": 10,
            "UserName": "ForumElettrico.it",
            "RelatedURL": "https://www.forumelettrico.it/forum/nuova-enel-fast-a-chianciano-terme-si-t1839.html",
            "DateCreated": "2018-08-20T06:24:11.83Z",
            "User": {
                "ID": 11749,
                "Username": "ForumElettrico.it"
            },
            "CheckinStatusTypeID": 10
        },
        {
            "ID": 19940,
            "ChargePointID": 93529,
            "CommentTypeID": 50,
            "UserName": "PowerCruiseControl",
            "Comment": "Charging point located inside the Grand Hotel Terme parking behind postal office ",
            "Rating": 5,
            "DateCreated": "2018-07-30T09:28:31.557Z",
            "User": {
                "ID": 18504,
                "Username": "PowerCruiseControl"
            },
            "CheckinStatusTypeID": 10
        }
    ],
    "MediaItems": [
        {
            "ID": 19382,
            "ChargePointID": 93529,
            "ItemURL": "https://s3-ap-southeast-2.amazonaws.com/openchargemap/images/IT/OCM93529/OCM-93529.orig.2019082714363624.jpg",
            "ItemThumbnailURL": "https://s3-ap-southeast-2.amazonaws.com/openchargemap/images/IT/OCM93529/OCM-93529.thmb.2019082714363624.jpg",
            "Comment": "",
            "IsEnabled": true,
            "IsVideo": false,
            "IsFeaturedItem": false,
            "IsExternalResource": false,
            "User": {
                "ID": 11749,
                "Username": "ForumElettrico.it"
            },
            "DateCreated": "2019-08-27T14:37:00Z"
        },
        {
            "ID": 19383,
            "ChargePointID": 93529,
            "ItemURL": "https://s3-ap-southeast-2.amazonaws.com/openchargemap/images/IT/OCM93529/OCM-93529.orig.2019082714364360.jpg",
            "ItemThumbnailURL": "https://s3-ap-southeast-2.amazonaws.com/openchargemap/images/IT/OCM93529/OCM-93529.thmb.2019082714364360.jpg",
            "Comment": "",
            "IsEnabled": true,
            "IsVideo": false,
            "IsFeaturedItem": false,
            "IsExternalResource": false,
            "User": {
                "ID": 11749,
                "Username": "ForumElettrico.it"
            },
            "DateCreated": "2019-08-27T14:37:00Z"
        },
        {
            "ID": 19384,
            "ChargePointID": 93529,
            "ItemURL": "https://s3-ap-southeast-2.amazonaws.com/openchargemap/images/IT/OCM93529/OCM-93529.orig.2019082714365113.jpg",
            "ItemThumbnailURL": "https://s3-ap-southeast-2.amazonaws.com/openchargemap/images/IT/OCM93529/OCM-93529.thmb.2019082714365113.jpg",
            "Comment": "",
            "IsEnabled": true,
            "IsVideo": false,
            "IsFeaturedItem": false,
            "IsExternalResource": false,
            "User": {
                "ID": 11749,
                "Username": "ForumElettrico.it"
            },
            "DateCreated": "2019-08-27T14:37:00Z"
        },
        {
            "ID": 19385,
            "ChargePointID": 93529,
            "ItemURL": "https://s3-ap-southeast-2.amazonaws.com/openchargemap/images/IT/OCM93529/OCM-93529.orig.2019082714365816.jpg",
            "ItemThumbnailURL": "https://s3-ap-southeast-2.amazonaws.com/openchargemap/images/IT/OCM93529/OCM-93529.thmb.2019082714365816.jpg",
            "Comment": "",
            "IsEnabled": true,
            "IsVideo": false,
            "IsFeaturedItem": false,
            "IsExternalResource": false,
            "User": {
                "ID": 11749,
                "Username": "ForumElettrico.it"
            },
            "DateCreated": "2019-08-27T14:37:00Z"
        },
        {
            "ID": 18439,
            "ChargePointID": 93529,
            "ItemURL": "https://s3-ap-southeast-2.amazonaws.com/openchargemap/images/IT/OCM93529/OCM-93529.orig.2019051814152332.jpg",
            "ItemThumbnailURL": "https://s3-ap-southeast-2.amazonaws.com/openchargemap/images/IT/OCM93529/OCM-93529.thmb.2019051814152332.jpg",
            "Comment": "",
            "IsEnabled": true,
            "IsVideo": false,
            "IsFeaturedItem": false,
            "IsExternalResource": false,
            "User": {
                "ID": 1606,
                "Username": "polianto"
            },
            "DateCreated": "2019-05-18T14:16:00Z"
        },
        {
            "ID": 18440,
            "ChargePointID": 93529,
            "ItemURL": "https://s3-ap-southeast-2.amazonaws.com/openchargemap/images/IT/OCM93529/OCM-93529.orig.2019051814154953.jpg",
            "ItemThumbnailURL": "https://s3-ap-southeast-2.amazonaws.com/openchargemap/images/IT/OCM93529/OCM-93529.thmb.2019051814154953.jpg",
            "Comment": "",
            "IsEnabled": true,
            "IsVideo": false,
            "IsFeaturedItem": false,
            "IsExternalResource": false,
            "User": {
                "ID": 1606,
                "Username": "polianto"
            },
            "DateCreated": "2019-05-18T14:16:00Z"
        },
        {
            "ID": 18437,
            "ChargePointID": 93529,
            "ItemURL": "https://s3-ap-southeast-2.amazonaws.com/openchargemap/images/IT/OCM93529/OCM-93529.orig.2019051814145217.jpg",
            "ItemThumbnailURL": "https://s3-ap-southeast-2.amazonaws.com/openchargemap/images/IT/OCM93529/OCM-93529.thmb.2019051814145217.jpg",
            "Comment": "",
            "IsEnabled": true,
            "IsVideo": false,
            "IsFeaturedItem": false,
            "IsExternalResource": false,
            "User": {
                "ID": 1606,
                "Username": "polianto"
            },
            "DateCreated": "2019-05-18T14:15:00Z"
        },
        {
            "ID": 18438,
            "ChargePointID": 93529,
            "ItemURL": "https://s3-ap-southeast-2.amazonaws.com/openchargemap/images/IT/OCM93529/OCM-93529.orig.2019051814150679.jpg",
            "ItemThumbnailURL": "https://s3-ap-southeast-2.amazonaws.com/openchargemap/images/IT/OCM93529/OCM-93529.thmb.2019051814150679.jpg",
            "Comment": "",
            "IsEnabled": true,
            "IsVideo": false,
            "IsFeaturedItem": false,
            "IsExternalResource": false,
            "User": {
                "ID": 1606,
                "Username": "polianto"
            },
            "DateCreated": "2019-05-18T14:15:00Z"
        },
        {
            "ID": 16320,
            "ChargePointID": 93529,
            "ItemURL": "https://s3-ap-southeast-2.amazonaws.com/openchargemap/images/IT/OCM93529/OCM-93529.orig.2018082006242632.jpg",
            "ItemThumbnailURL": "https://s3-ap-southeast-2.amazonaws.com/openchargemap/images/IT/OCM93529/OCM-93529.thmb.2018082006242632.jpg",
            "Comment": "",
            "IsEnabled": true,
            "IsVideo": false,
            "IsFeaturedItem": false,
            "IsExternalResource": false,
            "User": {
                "ID": 11749,
                "Username": "ForumElettrico.it"
            },
            "DateCreated": "2018-08-20T06:25:00Z"
        },
        {
            "ID": 16068,
            "ChargePointID": 93529,
            "ItemURL": "https://s3-ap-southeast-2.amazonaws.com/openchargemap/images/IT/OCM93529/OCM-93529.orig.2018073009312998.jpg",
            "ItemThumbnailURL": "https://s3-ap-southeast-2.amazonaws.com/openchargemap/images/IT/OCM93529/OCM-93529.thmb.2018073009312998.jpg",
            "Comment": "",
            "IsEnabled": true,
            "IsVideo": false,
            "IsFeaturedItem": false,
            "IsExternalResource": false,
            "User": {
                "ID": 18504,
                "Username": "PowerCruiseControl"
            },
            "DateCreated": "2018-07-30T09:32:00Z"
        },
        {
            "ID": 16067,
            "ChargePointID": 93529,
            "ItemURL": "https://s3-ap-southeast-2.amazonaws.com/openchargemap/images/IT/OCM93529/OCM-93529.orig.2018073009310640.jpg",
            "ItemThumbnailURL": "https://s3-ap-southeast-2.amazonaws.com/openchargemap/images/IT/OCM93529/OCM-93529.thmb.2018073009310640.jpg",
            "Comment": "",
            "IsEnabled": true,
            "IsVideo": false,
            "IsFeaturedItem": false,
            "IsExternalResource": false,
            "User": {
                "ID": 18504,
                "Username": "PowerCruiseControl"
            },
            "DateCreated": "2018-07-30T09:31:00Z"
        }
    ],
    "IsRecentlyVerified": false,
    "ID": 93529,
    "UUID": "976075B6-BCFD-4A47-A6E0-736B7FDA87DE",
    "DataProviderID": 1,
    "OperatorID": 80,
    "UsageTypeID": 4,
    "UsageCost": "0,40 €/kWh",
    "AddressInfo": {
        "ID": 93875,
        "Title": "EnelX EVA+ Chianciano Terme",
        "AddressLine1": "Piazza Italia",
        "AddressLine2": "Viale della Pineta ",
        "Town": "Chianciano Terme",
        "StateOrProvince": "SI",
        "Postcode": "53042",
        "CountryID": 112,
        "Latitude": 43.0446597749621,
        "Longitude": 11.8130113288041,
        "RelatedURL": "http://eneldrive.it",
        "DistanceUnit": 0
    },
    "Connections": [
        {
            "ID": 132458,
            "ConnectionTypeID": 33,
            "StatusTypeID": 50,
            "LevelID": 3,
            "PowerKW": 50,
            "CurrentTypeID": 30,
            "Quantity": 1
        },
        {
            "ID": 132459,
            "ConnectionTypeID": 2,
            "StatusTypeID": 50,
            "LevelID": 3,
            "PowerKW": 50,
            "CurrentTypeID": 30,
            "Quantity": 1
        },
        {
            "ID": 132460,
            "ConnectionTypeID": 1036,
            "StatusTypeID": 50,
            "LevelID": 3,
            "Amps": 64,
            "Voltage": 400,
            "PowerKW": 43,
            "CurrentTypeID": 20,
            "Quantity": 1
        }
    ],
    "NumberOfPoints": 2,
    "StatusTypeID": 50,
    "DateLastStatusUpdate": "2019-08-27T14:37:00Z",
    "DataQualityLevel": 1,
    "DateCreated": "2017-09-30T15:24:00Z",
    "SubmissionStatusTypeID": 200
}