{
    "IsRecentlyVerified": false,
    "ID": 149317,
    "UUID": "7DE6CE05-51E1-4617-B265-E90C8590C55F",
    "DataProviderID": 1,
    "DataProvidersReference": "VLF-00001",
    "OperatorID": 21,
    "UsageTypeID": 4,
    "UsageCost": "Mobi.E compatible card",
    "AddressInfo": {
        "ID": 149670,
        "Title": "VLF-00001",
        "AddressLine1": "RuaPadre Castilho",
        "Town": "Vila Nova de Foz Côa",
        "Postcode": "5150-616",
        "CountryID": 180,
        "Latitude": 41.082877,
        "Longitude": -7.142016,
        "RelatedURL": "http://www.mobie.pt",
        "DistanceUnit": 0
    },
    "Connections": [
        {
            "ID": 207328,
            "ConnectionTypeID": 25,
            "StatusTypeID": 50,
            "LevelID": 2,
            "Amps": 32,
            "Voltage": 400,
            "PowerKW": 22,
            "CurrentTypeID": 20,
            "Quantity": 2
        }
    ],
    "NumberOfPoints": 2,
    "StatusTypeID": 50,
    "DateLastStatusUpdate": "2020-09-09T20:58:00Z",
    "DataQualityLevel": 3,
    "DateCreated": "2020-02-22T15:42:00Z",
    "SubmissionStatusTypeID": 100
}