{
    "IsRecentlyVerified": false,
    "ID": 32494,
    "UUID": "FCACC6F4-C34E-44A0-8FE6-2E38E1954263",
    "DataProviderID": 1,
    "OperatorID": 105,
    "OperatorsReference": "Essent EM-DE-14729320-01-00001",
    "UsageTypeID": 4,
    "AddressInfo": {
        "ID": 32840,
        "Title": "Markt 17",
        "AddressLine1": "Markt 17",
        "Town": "Neukieritzsch",
        "Postcode": "4575",
        "CountryID": 87,
        "Latitude": 51.151322,
        "Longitude": 12.409514,
        "DistanceUnit": 0
    },
    "Connections": [
        {
            "ID": 36005,
            "ConnectionTypeID": 25,
            "LevelID": 2,
            "PowerKW": 11
        },
        {
            "ID": 46398,
            "ConnectionTypeID": 25,
            "LevelID": 2,
            "PowerKW": 11
        }
    ],
    "NumberOfPoints": 1,
    "StatusTypeID": 50,
    "DateLastStatusUpdate": "2015-04-13T19:13:00Z",
    "DataQualityLevel": 3,
    "DateCreated": "2015-01-09T06:03:00Z",
    "SubmissionStatusTypeID": 200
}