{
    "IsRecentlyVerified": false,
    "ID": 105414,
    "UUID": "2DBC2D78-28A6-4AC6-AE52-556189453C1F",
    "DataProviderID": 1,
    "OperatorID": 23,
    "OperatorsReference": "43982",
    "UsageTypeID": 4,
    "AddressInfo": {
        "ID": 105760,
        "Title": "Sonne Lifestyle Resort Bregenzerwald",
        "AddressLine1": "Uebermellen 65",
        "Town": "Mellau",
        "Postcode": "6881",
        "CountryID": 19,
        "Latitude": 47.351814,
        "Longitude": 9.88221,
        "ContactTelephone1": "+43 5518 20100",
        "DistanceUnit": 0
    },
    "Connections": [
        {
            "ID": 148578,
            "ConnectionTypeID": 30,
            "StatusTypeID": 50,
            "LevelID": 2,
            "Amps": 16,
            "Voltage": 400,
            "PowerKW": 11,
            "CurrentTypeID": 20,
            "Quantity": 2
        }
    ],
    "NumberOfPoints": 2,
    "GeneralComments": "2 Tesla Connectors, up to 11kW.Available for customers. Please see front desk.",
    "StatusTypeID": 50,
    "DateLastStatusUpdate": "2018-10-03T16:07:00Z",
    "DataQualityLevel": 1,
    "DateCreated": "2018-06-06T05:40:00Z",
    "SubmissionStatusTypeID": 200
}