{
    "IsRecentlyVerified": false,
    "ID": 8430,
    "UUID": "BE18698B-02EA-44F7-BE7C-D3AF02C84F35",
    "DataProviderID": 15,
    "DataProvidersReference": "11314",
    "OperatorID": 5,
    "AddressInfo": {
        "ID": 8327,
        "Title": "1140 N. 94th Street",
        "AddressLine1": "1140 N. 94th Street",
        "Town": "Seattle",
        "StateOrProvince": "Washington",
        "Postcode": "98103",
        "CountryID": 2,
        "Latitude": 47.69737244,
        "Longitude": -122.3431473,
        "ContactTelephone1": "",
        "RelatedURL": "http://carstations.com/11314",
        "DistanceUnit": 0
    },
    "Connections": [
        {
            "ID": 5857,
            "ConnectionTypeID": 1,
            "Reference": "J1772",
            "LevelID": 2
        },
        {
            "ID": 7841,
            "ConnectionTypeID": 9,
            "Reference": "NEMA5",
            "LevelID": 1,
            "Quantity": 1
        }
    ],
    "StatusTypeID": 0,
    "DateLastStatusUpdate": "2017-11-04T14:05:00Z",
    "DataQualityLevel": 1,
    "DateCreated": "2011-11-11T12:06:00Z",
    "SubmissionStatusTypeID": 100
}