{
    "IsRecentlyVerified": false,
    "ID": 129269,
    "UUID": "06B2E393-3091-48F5-818C-713D997C4A45",
    "DataProviderID": 1,
    "OperatorID": 3,
    "OperatorsReference": "PG-82427,PG-82430,PG-82437,PG-82438,PG-82439",
    "UsageTypeID": 4,
    "UsageCost": "1,Free",
    "AddressInfo": {
        "ID": 129615,
        "Title": "Union Square",
        "AddressLine1": "Guild Square",
        "Town": "Aberdeen",
        "Postcode": "AB11 5RG",
        "CountryID": 1,
        "Latitude": 57.144716,
        "Longitude": -2.096545,
        "DistanceUnit": 0
    },
    "Connections": [
        {
            "ID": 180930,
            "ConnectionTypeID": 25,
            "StatusTypeID": 50,
            "LevelID": 2,
            "Amps": 32,
            "Voltage": 230,
            "PowerKW": 7,
            "CurrentTypeID": 10,
            "Quantity": 10
        }
    ],
    "NumberOfPoints": 10,
    "GeneralComments": "This is an open charge unit installed at the Union Square site at Guild Square, Aberdeen",
    "StatusTypeID": 50,
    "DateLastStatusUpdate": "2020-04-28T05:27:00Z",
    "DataQualityLevel": 1,
    "DateCreated": "2019-07-16T08:23:00Z",
    "SubmissionStatusTypeID": 200
}