{
    "IsRecentlyVerified": false,
    "ID": 127965,
    "UUID": "8CD44B27-E1FC-4385-B91D-E53084D81B1E",
    "DataProviderID": 1,
    "OperatorID": 3253,
    "OperatorsReference": "AT*SMA*EIT1802108*001AC",
    "UsageTypeID": 1,
    "UsageCost": "€0,04/min ; Andere Tarife möglich",
    "AddressInfo": {
        "ID": 128311,
        "Title": "Ladestation Hotel Bamboo",
        "AddressLine1": "Schanzenstraße 5",
        "Town": "Goldrain",
        "StateOrProvince": "Trentino-Südtirol",
        "Postcode": "39021",
        "CountryID": 112,
        "Latitude": 46.619116,
        "Longitude": 10.825421,
        "DistanceUnit": 0
    },
    "Connections": [
        {
            "ID": 179083,
            "ConnectionTypeID": 1036,
            "StatusTypeID": 50,
            "LevelID": 2,
            "Amps": 16,
            "Voltage": 400,
            "PowerKW": 11,
            "CurrentTypeID": 20,
            "Quantity": 1
        }
    ],
    "NumberOfPoints": 1,
    "StatusTypeID": 50,
    "DateLastStatusUpdate": "2019-06-12T14:16:00Z",
    "DataQualityLevel": 1,
    "DateCreated": "2019-06-12T14:16:00Z",
    "SubmissionStatusTypeID": 200
}