{
    "IsRecentlyVerified": false,
    "ID": 28562,
    "UUID": "D982935C-9B8F-49DA-9B44-C77E3662861E",
    "DataProviderID": 2,
    "DataProvidersReference": "62408",
    "OperatorID": 5,
    "UsageTypeID": 1,
    "AddressInfo": {
        "ID": 28908,
        "Title": "GANLEY BMW",
        "AddressLine1": "6976 Pearl Rd",
        "Town": "Middleburg Heights",
        "StateOrProvince": "OH",
        "Postcode": "44130",
        "CountryID": 2,
        "Latitude": 41.3768817,
        "Longitude": -81.7952962,
        "ContactTelephone1": "888-758-4389",
        "AccessComments": "24 hours daily",
        "RelatedURL": "http://www.chargepoint.com/",
        "DistanceUnit": 0
    },
    "Connections": [
        {
            "ID": 31384,
            "ConnectionTypeID": 1,
            "LevelID": 2,
            "Amps": 16,
            "Voltage": 230,
            "PowerKW": 3.7,
            "CurrentTypeID": 10,
            "Quantity": 1
        }
    ],
    "DateLastStatusUpdate": "2020-06-26T03:04:00Z",
    "DataQualityLevel": 3,
    "DateCreated": "2014-11-28T03:38:00Z",
    "SubmissionStatusTypeID": 100
}