{
    "IsRecentlyVerified": false,
    "ID": 158916,
    "UUID": "8BE0F5BB-35BA-4D70-BFBD-0023A6EEE3AF",
    "DataProviderID": 2,
    "DataProvidersReference": "151943",
    "UsageTypeID": 1,
    "AddressInfo": {
        "ID": 159273,
        "Title": "Pulse Instruments",
        "AddressLine1": "943 Flynn Rd",
        "Town": "Camarillo",
        "StateOrProvince": "CA",
        "Postcode": "93012",
        "CountryID": 2,
        "Latitude": 34.225992,
        "Longitude": -119.021061,
        "ContactTelephone1": "800-462-1926",
        "AccessComments": "24 hours daily",
        "RelatedURL": "",
        "DistanceUnit": 0
    },
    "Connections": [
        {
            "ID": 228953,
            "ConnectionTypeID": 1,
            "LevelID": 2,
            "Amps": 16,
            "Voltage": 230,
            "PowerKW": 3.7,
            "CurrentTypeID": 10,
            "Quantity": 1
        }
    ],
    "StatusTypeID": 50,
    "DateLastStatusUpdate": "2020-06-26T02:57:00Z",
    "DataQualityLevel": 3,
    "DateCreated": "2020-06-26T02:57:00Z",
    "SubmissionStatusTypeID": 100
}