{
    "IsRecentlyVerified": false,
    "ID": 68836,
    "UUID": "247B3082-5D0C-47D7-B3FD-DA253D72EE4E",
    "DataProviderID": 2,
    "DataProvidersReference": "76199",
    "OperatorID": 5,
    "UsageTypeID": 1,
    "AddressInfo": {
        "ID": 69182,
        "Title": "GERMANTOWN",
        "AddressLine1": "1100 3rd Ave N",
        "Town": "Nashville",
        "StateOrProvince": "TN",
        "Postcode": "37208",
        "CountryID": 2,
        "Latitude": 36.175901,
        "Longitude": -86.784639,
        "ContactTelephone1": "888-758-4389",
        "AccessComments": "24 hours daily",
        "RelatedURL": "http://www.chargepoint.com/",
        "DistanceUnit": 0
    },
    "Connections": [
        {
            "ID": 96537,
            "ConnectionTypeID": 1,
            "LevelID": 2,
            "Amps": 16,
            "Voltage": 230,
            "PowerKW": 3,
            "CurrentTypeID": 10,
            "Quantity": 3
        }
    ],
    "DateLastStatusUpdate": "2019-04-06T04:02:00Z",
    "DataQualityLevel": 3,
    "DateCreated": "2016-06-25T03:36:00Z",
    "SubmissionStatusTypeID": 100
}