{
    "IsRecentlyVerified": false,
    "ID": 53300,
    "UUID": "7068D665-4F9B-40D2-9B7D-6ECF257CCB8F",
    "DataProviderID": 2,
    "DataProvidersReference": "69901",
    "OperatorID": 5,
    "UsageTypeID": 1,
    "AddressInfo": {
        "ID": 53646,
        "Title": "CITYOFBERKELEY",
        "AddressLine1": "235 University Ave",
        "Town": "Berkeley",
        "StateOrProvince": "CA",
        "Postcode": "94710",
        "CountryID": 2,
        "Latitude": 37.8645697,
        "Longitude": -122.3128646,
        "ContactTelephone1": "888-758-4389",
        "AccessComments": "24 hours daily",
        "RelatedURL": "http://www.chargepoint.com/",
        "DistanceUnit": 0
    },
    "Connections": [
        {
            "ID": 66413,
            "ConnectionTypeID": 1,
            "LevelID": 2,
            "Amps": 16,
            "Voltage": 230,
            "PowerKW": 3,
            "CurrentTypeID": 10,
            "Quantity": 2
        }
    ],
    "DateLastStatusUpdate": "2019-04-06T04:02:00Z",
    "DataQualityLevel": 3,
    "DateCreated": "2015-09-20T11:18:00Z",
    "SubmissionStatusTypeID": 100
}