{
    "IsRecentlyVerified": false,
    "ID": 177839,
    "UUID": "EF1E3106-3784-4154-A7FF-6BFEC9A10E12",
    "DataProviderID": 29,
    "DataProvidersReference": "20878",
    "OperatorID": 86,
    "AddressInfo": {
        "ID": 178198,
        "Title": "Auf der Lach 8",
        "AddressLine1": "Auf der Lach 8",
        "Town": "Rüdesheim",
        "Postcode": "65385",
        "CountryID": 87,
        "Latitude": 49.97929,
        "Longitude": 7.93391,
        "DistanceUnit": 0
    },
    "Connections": [
        {
            "ID": 277503,
            "ConnectionTypeID": 1036,
            "StatusTypeID": 50,
            "LevelID": 3,
            "PowerKW": 43,
            "CurrentTypeID": 20
        },
        {
            "ID": 277504,
            "ConnectionTypeID": 33,
            "StatusTypeID": 50,
            "LevelID": 3,
            "PowerKW": 50,
            "CurrentTypeID": 30
        },
        {
            "ID": 297450,
            "ConnectionTypeID": 2,
            "StatusTypeID": 50,
            "LevelID": 3,
            "PowerKW": 50,
            "CurrentTypeID": 30
        }
    ],
    "StatusTypeID": 0,
    "DateLastStatusUpdate": "2021-07-12T02:44:00Z",
    "MetadataValues": [
        {
            "ID": 10133,
            "MetadataFieldID": 4,
            "ItemValue": "Data from the German chargepoint registry provided by Bundesnetzagentur.de under the CC-BY 4.0 license"
        }
    ],
    "DataQualityLevel": 3,
    "DateCreated": "2021-07-08T09:49:00Z",
    "SubmissionStatusTypeID": 100
}