{
    "IsRecentlyVerified": false,
    "ID": 169880,
    "UUID": "62F9898A-41C9-4307-B09F-873BCDF1AAB6",
    "DataProviderID": 1,
    "OperatorID": 80,
    "UsageTypeID": 4,
    "AddressInfo": {
        "ID": 170239,
        "Title": "LEVERANO Caracciolo | ENELX",
        "AddressLine1": "Via Sindaco Caracciolo",
        "Town": "Leverano",
        "StateOrProvince": "LE",
        "Postcode": "73045",
        "CountryID": 112,
        "Latitude": 40.29010969328431,
        "Longitude": 18.00024566811112,
        "ContactTelephone1": "800.069.850",
        "RelatedURL": "https://www.enelx.com/it/it/emobility",
        "DistanceUnit": 0
    },
    "Connections": [
        {
            "ID": 258878,
            "ConnectionTypeID": 25,
            "StatusTypeID": 50,
            "LevelID": 2,
            "Amps": 32,
            "Voltage": 400,
            "PowerKW": 22,
            "CurrentTypeID": 20,
            "Quantity": 2
        }
    ],
    "NumberOfPoints": 2,
    "StatusTypeID": 50,
    "DateLastStatusUpdate": "2020-11-12T14:42:00Z",
    "DataQualityLevel": 1,
    "DateCreated": "2020-11-12T14:42:00Z",
    "SubmissionStatusTypeID": 200
}