{
    "IsRecentlyVerified": false,
    "ID": 111077,
    "UUID": "3BA31037-FCE0-4FF7-88B0-B9969437A3D7",
    "DataProviderID": 2,
    "DataProvidersReference": "91394",
    "OperatorID": 5,
    "UsageTypeID": 1,
    "AddressInfo": {
        "ID": 111423,
        "Title": "FONTANAMARKHAM",
        "AddressLine1": "99 S Town Centre Blvd",
        "Town": "Markham",
        "StateOrProvince": "ON",
        "Postcode": "L6G",
        "CountryID": 44,
        "Latitude": 43.851758,
        "Longitude": -79.337025,
        "ContactTelephone1": "888-758-4389",
        "AccessComments": "24 hours daily",
        "RelatedURL": "http://www.chargepoint.com/",
        "DistanceUnit": 0
    },
    "Connections": [
        {
            "ID": 156432,
            "ConnectionTypeID": 1,
            "LevelID": 2,
            "Amps": 16,
            "Voltage": 230,
            "PowerKW": 3,
            "CurrentTypeID": 10,
            "Quantity": 6
        }
    ],
    "DateLastStatusUpdate": "2019-12-24T09:22:00Z",
    "DataQualityLevel": 3,
    "DateCreated": "2018-10-18T23:36:00Z",
    "SubmissionStatusTypeID": 100
}