{
    "IsRecentlyVerified": false,
    "ID": 180985,
    "UUID": "58075E6A-751F-4F44-B43A-CF96C5FD0F53",
    "DataProviderID": 29,
    "DataProvidersReference": "9594",
    "OperatorID": 45,
    "AddressInfo": {
        "ID": 181344,
        "Title": "Gerauer Str. 46-48",
        "AddressLine1": "Gerauer Str. 46-48",
        "Town": "Mörfelden-Walldorf",
        "Postcode": "64546",
        "CountryID": 87,
        "Latitude": 49.96829,
        "Longitude": 8.56141,
        "DistanceUnit": 0
    },
    "Connections": [
        {
            "ID": 284743,
            "ConnectionTypeID": 25,
            "StatusTypeID": 50,
            "LevelID": 2,
            "PowerKW": 22,
            "CurrentTypeID": 20
        },
        {
            "ID": 284744,
            "ConnectionTypeID": 25,
            "StatusTypeID": 50,
            "LevelID": 2,
            "PowerKW": 22,
            "CurrentTypeID": 20
        }
    ],
    "StatusTypeID": 50,
    "DateLastStatusUpdate": "2021-07-12T02:44:00Z",
    "MetadataValues": [
        {
            "ID": 13279,
            "MetadataFieldID": 4,
            "ItemValue": "Data from the German chargepoint registry provided by Bundesnetzagentur.de under the CC-BY 4.0 license"
        }
    ],
    "DataQualityLevel": 3,
    "DateCreated": "2021-07-08T10:01:00Z",
    "SubmissionStatusTypeID": 100
}