{
    "IsRecentlyVerified": false,
    "ID": 170828,
    "UUID": "5F658AE8-5552-4085-BDB2-D444C7E2BDCB",
    "DataProviderID": 1,
    "OperatorID": 3327,
    "UsageTypeID": 4,
    "AddressInfo": {
        "ID": 171187,
        "Title": "BECHARGE SIRIO Hotel Dormelletto",
        "AddressLine1": "Corso Camillo Benso Cavour",
        "Town": "Dormelletto",
        "StateOrProvince": "NO",
        "Postcode": "28040",
        "CountryID": 112,
        "Latitude": 45.7241515982667,
        "Longitude": 8.582218555758345,
        "ContactTelephone1": "02-49527730",
        "ContactEmail": "emobility@buildingenergy.it",
        "RelatedURL": "https://www.bec.energy/",
        "DistanceUnit": 0
    },
    "Connections": [
        {
            "ID": 261020,
            "ConnectionTypeID": 25,
            "StatusTypeID": 50,
            "LevelID": 2,
            "Amps": 32,
            "Voltage": 400,
            "PowerKW": 22,
            "CurrentTypeID": 20,
            "Quantity": 2
        }
    ],
    "NumberOfPoints": 2,
    "StatusTypeID": 50,
    "DateLastStatusUpdate": "2020-12-10T14:16:00Z",
    "DataQualityLevel": 1,
    "DateCreated": "2020-12-10T14:16:00Z",
    "SubmissionStatusTypeID": 200
}