{
    "UserComments": [
        {
            "ID": 17720,
            "ChargePointID": 19240,
            "CommentTypeID": 10,
            "UserName": "Ianyek",
            "Comment": "Working fine",
            "Rating": 4,
            "DateCreated": "2017-09-18T20:33:37.037Z",
            "User": {
                "ID": 16046,
                "Username": "Ianyek"
            },
            "CheckinStatusTypeID": 10
        },
        {
            "ID": 17642,
            "ChargePointID": 19240,
            "CommentTypeID": 10,
            "UserName": "Ianyek",
            "Comment": "Working fine located next to disabled bays right outside store",
            "Rating": 4,
            "DateCreated": "2017-08-28T14:06:47.603Z",
            "User": {
                "ID": 16046,
                "Username": "Ianyek"
            },
            "CheckinStatusTypeID": 10
        },
        {
            "ID": 11517,
            "ChargePointID": 19240,
            "CommentTypeID": 10,
            "UserName": "CraigT",
            "Comment": "All working again ",
            "DateCreated": "2016-05-29T08:16:26.72Z",
            "User": {
                "ID": 6478,
                "Username": "CraigT"
            },
            "CheckinStatusTypeID": 10
        },
        {
            "ID": 11516,
            "ChargePointID": 19240,
            "CommentTypeID": 10,
            "UserName": "CraigT",
            "Comment": "Appears to be all working again ",
            "DateCreated": "2016-05-29T08:13:59.92Z",
            "User": {
                "ID": 6478,
                "Username": "CraigT"
            },
            "CheckinStatusTypeID": 10
        },
        {
            "ID": 10452,
            "ChargePointID": 19240,
            "CommentTypeID": 10,
            "UserName": "CraigT",
            "Comment": "Only AC currently working. \"Card In\" error displayed. Called Polar, they are already aware. Let's see how long it takes to fix",
            "DateCreated": "2016-05-20T01:05:46.503Z",
            "User": {
                "ID": 6478,
                "Username": "CraigT"
            },
            "CheckinStatusTypeID": 20
        },
        {
            "ID": 10169,
            "ChargePointID": 19240,
            "CommentTypeID": 10,
            "UserName": "QUARK24",
            "Comment": "As Craig has said, the Waitrose charging point has been replaced with one that has 3 plug types, and for the first time in 18 months we were able to charge our Nissan Leaf on 2 saturdays",
            "Rating": 4,
            "DateCreated": "2016-04-13T09:11:59.253Z",
            "User": {
                "ID": 9232,
                "Username": "QUARK24"
            },
            "CheckinStatusTypeID": 10
        },
        {
            "ID": 9984,
            "ChargePointID": 19240,
            "CommentTypeID": 50,
            "UserName": "CraigT",
            "Comment": "Unable to charge without presenting chargemaster card now :-(",
            "DateCreated": "2016-03-24T22:49:39.783Z",
            "User": {
                "ID": 6478,
                "Username": "CraigT"
            },
            "CheckinStatusTypeID": 200
        },
        {
            "ID": 9889,
            "ChargePointID": 19240,
            "CommentTypeID": 10,
            "UserName": "CraigT",
            "Comment": "Charger unit has been replaced. Was able to operate the Chademo without presenting any card. Noticed the connection to the Internet was crossed out, therefore the reason no card required?",
            "DateCreated": "2016-03-08T00:24:51.563Z",
            "User": {
                "ID": 6478,
                "Username": "CraigT"
            },
            "CheckinStatusTypeID": 10
        },
        {
            "ID": 7821,
            "ChargePointID": 19240,
            "CommentTypeID": 10,
            "UserName": "CraigT",
            "Comment": "Neither chargers working. Display says updating/restarting. Been like this since 09/10/15",
            "DateCreated": "2015-10-18T22:28:49.453Z",
            "User": {
                "ID": 6478,
                "Username": "CraigT"
            },
            "CheckinStatusTypeID": 20
        },
        {
            "ID": 6633,
            "ChargePointID": 19240,
            "CommentTypeID": 10,
            "UserName": "scoobyt555",
            "Comment": "used the chargemaster app, bit delayed but charged on AC twice now since 24th",
            "Rating": 4,
            "DateCreated": "2015-09-28T21:58:49.9Z",
            "User": {
                "ID": 6316,
                "Username": "scoobyt555"
            },
            "CheckinStatusTypeID": 10
        },
        {
            "ID": 6400,
            "ChargePointID": 19240,
            "CommentTypeID": 50,
            "UserName": "scoobyt555",
            "Comment": "charger still taped up ",
            "DateCreated": "2015-09-03T20:59:37.783Z",
            "User": {
                "ID": 6316,
                "Username": "scoobyt555"
            },
            "CheckinStatusTypeID": 20
        },
        {
            "ID": 5990,
            "ChargePointID": 19240,
            "CommentTypeID": 100,
            "UserName": "CoWplagued",
            "Comment": "Charger covered in out of service stickers. Local Nissan garage said the charger is now out of warranty and has a fault. Waitrose have not yet agreed to have it repaired or replaced yet. Would advise calling before a visit.",
            "DateCreated": "2015-07-22T11:24:13.67Z",
            "User": {
                "ID": 5023,
                "Username": "CoWplagued"
            },
            "CheckinStatusTypeID": 20
        },
        {
            "ID": 4268,
            "ChargePointID": 19240,
            "CommentTypeID": 100,
            "UserName": "",
            "Comment": "This post is marked as 7Kw (AC), however I charged my Model S here on Saturday and it was definitely 22Kw on the AC side! Very handy.",
            "Rating": 4,
            "DateCreated": "2015-04-20T07:20:08.933Z",
            "CheckinStatusTypeID": 10
        },
        {
            "ID": 3843,
            "ChargePointID": 19240,
            "CommentTypeID": 10,
            "UserName": "Tim Chadbourne",
            "Comment": "Used this charger twinge on the weekend Feb 21/22 2015",
            "DateCreated": "2015-02-22T09:15:32.757Z",
            "User": {
                "ID": 4620,
                "Username": "Tim Chadbourne"
            },
            "CheckinStatusTypeID": 10
        },
        {
            "ID": 3637,
            "ChargePointID": 19240,
            "CommentTypeID": 10,
            "UserName": "",
            "Comment": "Worked perfectly. Used PiM card.",
            "Rating": 5,
            "DateCreated": "2015-01-24T19:21:47.287Z",
            "CheckinStatusTypeID": 10
        },
        {
            "ID": 2369,
            "ChargePointID": 19240,
            "CommentTypeID": 10,
            "UserName": "Noiseboi",
            "Comment": "",
            "DateCreated": "2014-11-10T23:18:28.733Z",
            "User": {
                "ID": 1660,
                "Username": "Noiseboi"
            },
            "CheckinStatusTypeID": 25
        },
        {
            "ID": 1345,
            "ChargePointID": 19240,
            "CommentTypeID": 100,
            "UserName": "Noiseboi",
            "Comment": "This Is a Rapid Charger run by Chargemaster. It has one Chademo DC and one Mennekes AC Plug.  The DC is at least 12KW",
            "Rating": 5,
            "DateCreated": "2014-11-03T12:30:53.877Z",
            "User": {
                "ID": 1660,
                "Username": "Noiseboi"
            },
            "CheckinStatusTypeID": 15
        }
    ],
    "MediaItems": [
        {
            "ID": 1021,
            "ChargePointID": 19240,
            "ItemURL": "https://s3-ap-southeast-2.amazonaws.com/openchargemap/images/GB/OCM19240/OCM-19240.orig.2015022209142275.jpg",
            "ItemThumbnailURL": "https://s3-ap-southeast-2.amazonaws.com/openchargemap/images/GB/OCM19240/OCM-19240.thmb.2015022209142275.jpg",
            "Comment": "",
            "IsEnabled": true,
            "IsVideo": false,
            "IsFeaturedItem": false,
            "IsExternalResource": false,
            "User": {
                "ID": 4620,
                "Username": "Tim Chadbourne"
            },
            "DateCreated": "2015-02-22T09:15:00Z"
        }
    ],
    "IsRecentlyVerified": false,
    "ID": 19240,
    "UUID": "9624D32E-F200-415D-A9C2-4AB5D3AA222C",
    "DataProviderID": 1,
    "OperatorID": 32,
    "OperatorsReference": "21043",
    "UsageTypeID": 4,
    "UsageCost": "Inclusive; for Polar Plus subscription members only",
    "AddressInfo": {
        "ID": 19585,
        "Title": "Waitrose Lichfield",
        "AddressLine1": "Darwin Park",
        "Town": "Lichfield",
        "Postcode": "WS13 6RX",
        "CountryID": 1,
        "Latitude": 52.674,
        "Longitude": -1.84305,
        "DistanceUnit": 0
    },
    "Connections": [
        {
            "ID": 19521,
            "ConnectionTypeID": 1036,
            "StatusTypeID": 50,
            "LevelID": 3,
            "Amps": 63,
            "Voltage": 400,
            "PowerKW": 43,
            "CurrentTypeID": 20,
            "Quantity": 1
        },
        {
            "ID": 26994,
            "ConnectionTypeID": 2,
            "StatusTypeID": 50,
            "LevelID": 3,
            "Amps": 125,
            "Voltage": 400,
            "PowerKW": 50,
            "CurrentTypeID": 30,
            "Quantity": 1
        },
        {
            "ID": 83242,
            "ConnectionTypeID": 33,
            "StatusTypeID": 50,
            "LevelID": 3,
            "Amps": 125,
            "Voltage": 400,
            "PowerKW": 50,
            "CurrentTypeID": 30,
            "Quantity": 1
        }
    ],
    "NumberOfPoints": 1,
    "GeneralComments": "Chargemaster managed charge point 20004. Plugged in Midlands and Polar Network cards accepted.DBT AC/Chademo charge point.",
    "StatusTypeID": 50,
    "DateLastStatusUpdate": "2019-06-13T05:17:00Z",
    "DataQualityLevel": 1,
    "DateCreated": "2013-09-16T14:57:00Z",
    "SubmissionStatusTypeID": 200
}