{
    "IsRecentlyVerified": false,
    "ID": 62896,
    "UUID": "7FAAF291-A1CA-4419-97A6-2B7C70D957BB",
    "DataProviderID": 26,
    "DataProvidersReference": "73103",
    "OperatorID": 73,
    "OperatorsReference": "EV-Box EVB-P1536686",
    "UsageCost": "0.00 jaarabonnement",
    "AddressInfo": {
        "ID": 63242,
        "Title": "Pastoor Petersstraat 154",
        "AddressLine1": "Pastoor Petersstraat 154",
        "Town": "Eindhoven",
        "Postcode": "5612 LV",
        "CountryID": 159,
        "Latitude": 51.4447263604078,
        "Longitude": 5.47302603721619,
        "RelatedURL": "http://www.ev-box.nl",
        "DistanceUnit": 0
    },
    "Connections": [
        {
            "ID": 79929,
            "ConnectionTypeID": 25,
            "LevelID": 2,
            "PowerKW": 11,
            "CurrentTypeID": 10
        },
        {
            "ID": 79930,
            "ConnectionTypeID": 25,
            "LevelID": 2,
            "PowerKW": 11,
            "CurrentTypeID": 10
        }
    ],
    "NumberOfPoints": 1,
    "StatusTypeID": 50,
    "DateLastStatusUpdate": "2016-06-04T02:39:00Z",
    "DataQualityLevel": 3,
    "DateCreated": "2016-03-03T12:29:00Z",
    "SubmissionStatusTypeID": 100
}