{
    "IsRecentlyVerified": false,
    "ID": 175204,
    "UUID": "DBDBF140-D9BE-433F-A53B-4C2CDF87F977",
    "DataProviderID": 1,
    "OperatorID": 21,
    "UsageTypeID": 4,
    "UsageCost": "Mobi.E compatible card or App",
    "AddressInfo": {
        "ID": 175563,
        "Title": "LSB-00328 - Repsol",
        "AddressLine1": "Avenida Carlos Pinhão",
        "Town": "Lisbon",
        "StateOrProvince": "Lisboa",
        "Postcode": "1950-354 Marvila",
        "CountryID": 180,
        "Latitude": 38.74169015831055,
        "Longitude": -9.11840132405473,
        "DistanceUnit": 0
    },
    "Connections": [
        {
            "ID": 271647,
            "ConnectionTypeID": 2,
            "StatusTypeID": 50,
            "LevelID": 3,
            "Amps": 120,
            "Voltage": 500,
            "PowerKW": 50,
            "CurrentTypeID": 20,
            "Quantity": 1
        },
        {
            "ID": 271648,
            "ConnectionTypeID": 33,
            "StatusTypeID": 50,
            "LevelID": 3,
            "Amps": 125,
            "Voltage": 500,
            "PowerKW": 50,
            "CurrentTypeID": 20,
            "Quantity": 1
        },
        {
            "ID": 271649,
            "ConnectionTypeID": 1036,
            "StatusTypeID": 50,
            "LevelID": 3,
            "Amps": 63,
            "Voltage": 400,
            "PowerKW": 43,
            "CurrentTypeID": 20,
            "Quantity": 1
        }
    ],
    "NumberOfPoints": 2,
    "StatusTypeID": 50,
    "DateLastStatusUpdate": "2021-05-01T12:23:00Z",
    "DataQualityLevel": 1,
    "DateCreated": "2021-05-01T12:23:00Z",
    "SubmissionStatusTypeID": 200
}