{
    "IsRecentlyVerified": false,
    "ID": 138325,
    "UUID": "235E56A2-F04D-4C38-89CA-8A8A605F86F6",
    "DataProviderID": 2,
    "DataProvidersReference": "88104",
    "OperatorID": 5,
    "UsageTypeID": 1,
    "AddressInfo": {
        "ID": 138674,
        "Title": "OUC",
        "AddressLine1": "300 Liberty Ave",
        "Town": "Orlando",
        "StateOrProvince": "FL",
        "Postcode": "32801",
        "CountryID": 2,
        "Latitude": 28.5389747,
        "Longitude": -81.3756164,
        "ContactTelephone1": "888-758-4389",
        "AccessComments": "24 hours daily",
        "RelatedURL": "http://www.chargepoint.com/",
        "DistanceUnit": 0
    },
    "Connections": [
        {
            "ID": 193423,
            "ConnectionTypeID": 1,
            "LevelID": 2,
            "Amps": 16,
            "Voltage": 230,
            "PowerKW": 3.7,
            "CurrentTypeID": 10,
            "Quantity": 2
        }
    ],
    "StatusTypeID": 50,
    "DateLastStatusUpdate": "2020-06-26T02:52:00Z",
    "DataQualityLevel": 3,
    "DateCreated": "2019-12-24T09:08:00Z",
    "SubmissionStatusTypeID": 100
}