{
    "IsRecentlyVerified": false,
    "ID": 56822,
    "UUID": "67E1B78A-E23F-4A0D-873A-4525770C2481",
    "DataProviderID": 1,
    "OperatorID": 80,
    "UsageTypeID": 4,
    "UsageCost": "0,40 €/kW",
    "AddressInfo": {
        "ID": 57168,
        "Title": "Eneldrive Palazzo della Provincia",
        "AddressLine1": "Via Palermo",
        "Town": "Perugia",
        "StateOrProvince": "PG",
        "Postcode": "06126",
        "CountryID": 112,
        "Latitude": 43.096422092237,
        "Longitude": 12.3858467025832,
        "RelatedURL": "http://eneldrive.it",
        "DistanceUnit": 0
    },
    "Connections": [
        {
            "ID": 71699,
            "ConnectionTypeID": 25,
            "StatusTypeID": 50,
            "LevelID": 2,
            "Amps": 32,
            "Voltage": 400,
            "PowerKW": 22,
            "CurrentTypeID": 20,
            "Quantity": 1
        },
        {
            "ID": 71700,
            "ConnectionTypeID": 36,
            "StatusTypeID": 50,
            "LevelID": 2,
            "Amps": 16,
            "Voltage": 240,
            "PowerKW": 3.7,
            "CurrentTypeID": 10,
            "Quantity": 1
        }
    ],
    "NumberOfPoints": 1,
    "StatusTypeID": 50,
    "DateLastStatusUpdate": "2019-08-06T14:25:00Z",
    "DataQualityLevel": 1,
    "DateCreated": "2015-11-11T15:59:00Z",
    "SubmissionStatusTypeID": 200
}