{
    "IsRecentlyVerified": false,
    "ID": 158987,
    "UUID": "A6E78AF1-A788-44CF-9554-80D7929EF444",
    "DataProviderID": 2,
    "DataProvidersReference": "153183",
    "OperatorID": 5,
    "UsageTypeID": 1,
    "AddressInfo": {
        "ID": 159344,
        "Title": "LOS LUNAS DC",
        "AddressLine1": "4250 messenger loop",
        "Town": "Los Lunas",
        "StateOrProvince": "NM",
        "Postcode": "87031",
        "CountryID": 2,
        "Latitude": 34.828503,
        "Longitude": -106.77954,
        "ContactTelephone1": "888-758-4389",
        "AccessComments": "24 hours daily",
        "RelatedURL": "http://www.chargepoint.com/",
        "DistanceUnit": 0
    },
    "Connections": [
        {
            "ID": 229036,
            "ConnectionTypeID": 1,
            "LevelID": 2,
            "Amps": 16,
            "Voltage": 230,
            "PowerKW": 3.7,
            "CurrentTypeID": 10,
            "Quantity": 4
        }
    ],
    "StatusTypeID": 50,
    "DateLastStatusUpdate": "2020-06-26T02:57:00Z",
    "DataQualityLevel": 3,
    "DateCreated": "2020-06-26T02:57:00Z",
    "SubmissionStatusTypeID": 100
}