{
    "IsRecentlyVerified": false,
    "ID": 31736,
    "UUID": "E4D6107D-F971-4842-B1BA-DF0B4ECCA44E",
    "DataProviderID": 1,
    "OperatorID": 105,
    "OperatorsReference": "Essent EM-DE-08237028-01-00001",
    "UsageTypeID": 4,
    "AddressInfo": {
        "ID": 32082,
        "Title": "Stuttgarter Straße 109",
        "AddressLine1": "Stuttgarter Straße 109",
        "Town": "Freudenstadt",
        "Postcode": "72250",
        "CountryID": 87,
        "Latitude": 48.465779,
        "Longitude": 8.42454,
        "DistanceUnit": 0
    },
    "Connections": [
        {
            "ID": 35247,
            "ConnectionTypeID": 25,
            "LevelID": 2,
            "PowerKW": 11
        },
        {
            "ID": 46088,
            "ConnectionTypeID": 25,
            "LevelID": 2,
            "PowerKW": 11
        }
    ],
    "NumberOfPoints": 1,
    "StatusTypeID": 50,
    "DateLastStatusUpdate": "2015-04-13T22:29:00Z",
    "DataQualityLevel": 3,
    "DateCreated": "2015-01-09T06:03:00Z",
    "SubmissionStatusTypeID": 200
}