{
    "IsRecentlyVerified": false,
    "ID": 96923,
    "UUID": "1F3D552C-45D6-4134-A6EB-24ADD8FAC1D4",
    "DataProviderID": 1,
    "OperatorID": 69,
    "UsageTypeID": 4,
    "AddressInfo": {
        "ID": 97269,
        "Title": "Engelsburg",
        "AddressLine1": "Engelsburg 10",
        "Town": "Nordhausen",
        "StateOrProvince": "Landkreis Nordhausen",
        "Postcode": "99734",
        "CountryID": 87,
        "Latitude": 51.5031817,
        "Longitude": 10.793374099999937,
        "ContactTelephone1": "+49 3631 634-5",
        "RelatedURL": "http://www.energie-nordhausen.de/",
        "DistanceUnit": 0
    },
    "Connections": [
        {
            "ID": 137295,
            "ConnectionTypeID": 1036,
            "StatusTypeID": 50,
            "LevelID": 2,
            "Amps": 32,
            "Voltage": 400,
            "PowerKW": 22,
            "CurrentTypeID": 20,
            "Quantity": 1
        },
        {
            "ID": 137296,
            "ConnectionTypeID": 2,
            "StatusTypeID": 50,
            "LevelID": 3,
            "PowerKW": 50,
            "CurrentTypeID": 30,
            "Quantity": 1
        },
        {
            "ID": 137297,
            "ConnectionTypeID": 33,
            "StatusTypeID": 50,
            "LevelID": 3,
            "PowerKW": 50,
            "CurrentTypeID": 30,
            "Quantity": 1
        }
    ],
    "NumberOfPoints": 3,
    "GeneralComments": "24/7 nutzbare Ladesäule auf dem Parkplatz am Pferdemarkt-Kreisel\r\n\r\n\r\n",
    "StatusTypeID": 50,
    "DateLastStatusUpdate": "2018-01-02T14:10:00Z",
    "DataQualityLevel": 1,
    "DateCreated": "2018-01-02T14:10:00Z",
    "SubmissionStatusTypeID": 200
}