{
    "IsRecentlyVerified": false,
    "ID": 84410,
    "UUID": "B75CBF02-7C95-4125-986C-FF0FA3781513",
    "DataProviderID": 1,
    "OperatorID": 23,
    "OperatorsReference": "25225",
    "UsageTypeID": 6,
    "AddressInfo": {
        "ID": 84756,
        "Title": "Grand Vista Hotel Grand Junction",
        "AddressLine1": "2790 Crossroads BLVD",
        "Town": "Grand Junction",
        "StateOrProvince": "Colorado",
        "Postcode": "81506",
        "CountryID": 2,
        "Latitude": 39.115307,
        "Longitude": -108.535576,
        "ContactTelephone1": "(970) 241-8411",
        "DistanceUnit": 0
    },
    "Connections": [
        {
            "ID": 119856,
            "ConnectionTypeID": 30,
            "StatusTypeID": 50,
            "LevelID": 2,
            "PowerKW": 8,
            "CurrentTypeID": 10,
            "Quantity": 1
        }
    ],
    "NumberOfPoints": 1,
    "GeneralComments": "1 Tesla Connector, up to 8kW.Available for patrons only. Please see front desk.",
    "StatusTypeID": 50,
    "DateLastStatusUpdate": "2017-06-09T13:24:00Z",
    "DataQualityLevel": 1,
    "DateCreated": "2017-02-24T06:37:00Z",
    "SubmissionStatusTypeID": 200
}