{
    "IsRecentlyVerified": false,
    "ID": 72402,
    "UUID": "EBAFAFEC-8209-4891-AF8C-CF5B326DA41B",
    "DataProviderID": 1,
    "OperatorID": 234,
    "UsageTypeID": 4,
    "AddressInfo": {
        "ID": 72748,
        "Title": " Bahnhof",
        "AddressLine1": "Forther Hauptstraße 1A",
        "Town": "Eckental",
        "StateOrProvince": "Landkreis Erlangen-Höchstadt",
        "Postcode": "90542",
        "CountryID": 87,
        "Latitude": 49.59160801690026,
        "Longitude": 11.220856188885472,
        "AccessComments": "24/7 nutzbar auf dem Kiss & Ride Parkplatz am Bahnhof.",
        "DistanceUnit": 0
    },
    "Connections": [
        {
            "ID": 103732,
            "ConnectionTypeID": 25,
            "StatusTypeID": 50,
            "LevelID": 2,
            "Amps": 32,
            "Voltage": 400,
            "PowerKW": 22,
            "CurrentTypeID": 20,
            "Quantity": 2
        }
    ],
    "NumberOfPoints": 2,
    "StatusTypeID": 50,
    "DateLastStatusUpdate": "2016-10-12T09:10:00Z",
    "DataQualityLevel": 1,
    "DateCreated": "2016-10-12T09:10:00Z",
    "SubmissionStatusTypeID": 200
}