{
    "IsRecentlyVerified": false,
    "ID": 181525,
    "UUID": "2858DCD9-3FA6-413F-8FCE-43947B4E71C9",
    "DataProviderID": 29,
    "DataProvidersReference": "8823",
    "OperatorID": 153,
    "AddressInfo": {
        "ID": 181884,
        "Title": "Gustower Weg 3",
        "AddressLine1": "Gustower Weg 3",
        "Town": "Stralsund",
        "Postcode": "18439",
        "CountryID": 87,
        "Latitude": 54.271138,
        "Longitude": 13.114643,
        "DistanceUnit": 0
    },
    "Connections": [
        {
            "ID": 285977,
            "ConnectionTypeID": 25,
            "StatusTypeID": 50,
            "LevelID": 2,
            "PowerKW": 22,
            "CurrentTypeID": 20
        },
        {
            "ID": 285978,
            "ConnectionTypeID": 25,
            "StatusTypeID": 50,
            "LevelID": 2,
            "PowerKW": 22,
            "CurrentTypeID": 20
        },
        {
            "ID": 285979,
            "ConnectionTypeID": 28,
            "StatusTypeID": 50,
            "LevelID": 2,
            "PowerKW": 22,
            "CurrentTypeID": 10
        },
        {
            "ID": 285980,
            "ConnectionTypeID": 28,
            "StatusTypeID": 50,
            "LevelID": 2,
            "PowerKW": 22,
            "CurrentTypeID": 10
        }
    ],
    "StatusTypeID": 50,
    "DateLastStatusUpdate": "2021-07-12T02:52:00Z",
    "MetadataValues": [
        {
            "ID": 13819,
            "MetadataFieldID": 4,
            "ItemValue": "Data from the German chargepoint registry provided by Bundesnetzagentur.de under the CC-BY 4.0 license"
        }
    ],
    "DataQualityLevel": 3,
    "DateCreated": "2021-07-08T10:01:00Z",
    "SubmissionStatusTypeID": 100
}