{
    "IsRecentlyVerified": false,
    "ID": 105663,
    "UUID": "C9335E48-8915-4460-ABA8-6F064D880B48",
    "DataProviderID": 2,
    "DataProvidersReference": "98405",
    "OperatorID": 5,
    "UsageTypeID": 1,
    "AddressInfo": {
        "ID": 106009,
        "Title": "SF CITY EV",
        "AddressLine1": "1120 Truman St",
        "Town": "San Fernando",
        "StateOrProvince": "CA",
        "Postcode": "91340",
        "CountryID": 2,
        "Latitude": 34.2840554,
        "Longitude": -118.4419903,
        "ContactTelephone1": "888-758-4389",
        "AccessComments": "24 hours daily",
        "RelatedURL": "http://www.chargepoint.com/",
        "DistanceUnit": 0
    },
    "Connections": [
        {
            "ID": 148854,
            "ConnectionTypeID": 1,
            "LevelID": 2,
            "Amps": 16,
            "Voltage": 230,
            "PowerKW": 3,
            "CurrentTypeID": 10,
            "Quantity": 2
        }
    ],
    "DateLastStatusUpdate": "2019-04-06T04:02:00Z",
    "DataQualityLevel": 3,
    "DateCreated": "2018-06-09T04:01:00Z",
    "SubmissionStatusTypeID": 100
}