{
    "IsRecentlyVerified": false,
    "ID": 124135,
    "UUID": "83DE8D18-8AA7-4645-BE60-B482A14A956F",
    "DataProviderID": 2,
    "DataProvidersReference": "96912",
    "OperatorID": 5,
    "UsageTypeID": 1,
    "AddressInfo": {
        "ID": 124481,
        "Title": "WESTAR ENERGY",
        "AddressLine1": "3830 N Toben St",
        "Town": "Wichita",
        "StateOrProvince": "KS",
        "Postcode": "67226",
        "CountryID": 2,
        "Latitude": 37.755177,
        "Longitude": -97.231398,
        "ContactTelephone1": "888-758-4389",
        "AccessComments": "24 hours daily",
        "RelatedURL": "http://www.chargepoint.com/",
        "DistanceUnit": 0
    },
    "Connections": [
        {
            "ID": 174194,
            "ConnectionTypeID": 1,
            "LevelID": 2,
            "Amps": 16,
            "Voltage": 230,
            "PowerKW": 3.7,
            "CurrentTypeID": 10,
            "Quantity": 18
        }
    ],
    "DateLastStatusUpdate": "2020-06-26T02:59:00Z",
    "DataQualityLevel": 3,
    "DateCreated": "2019-04-06T05:03:00Z",
    "SubmissionStatusTypeID": 100
}