{
    "UserComments": [
        {
            "ID": 8060,
            "ChargePointID": 48365,
            "CommentTypeID": 10,
            "UserName": "Christopher Cook",
            "Comment": "Great location and priority parking. Equipment was in good condition. Emergency stop had been activated but reset process was easy using on screen instructions.",
            "Rating": 5,
            "DateCreated": "2015-11-22T14:24:48.023Z",
            "User": {
                "ID": 1000,
                "Username": "Christopher Cook"
            },
            "CheckinStatusTypeID": 140
        }
    ],
    "MediaItems": [
        {
            "ID": 25936,
            "ChargePointID": 48365,
            "ItemURL": "https://s3-ap-southeast-2.amazonaws.com/openchargemap/images/AU/OCM48365/OCM-48365.orig.2020122500575593.jpg",
            "ItemThumbnailURL": "https://s3-ap-southeast-2.amazonaws.com/openchargemap/images/AU/OCM48365/OCM-48365.thmb.2020122500575593.jpg",
            "Comment": "",
            "IsEnabled": true,
            "IsVideo": false,
            "IsFeaturedItem": false,
            "IsExternalResource": false,
            "User": {
                "ID": 24819,
                "Username": "Wild Rice"
            },
            "DateCreated": "2020-12-25T00:58:00Z"
        },
        {
            "ID": 3519,
            "ChargePointID": 48365,
            "ItemURL": "https://s3-ap-southeast-2.amazonaws.com/openchargemap/images/AU/OCM48365/OCM-48365.orig.2015112214264428.jpg",
            "ItemThumbnailURL": "https://s3-ap-southeast-2.amazonaws.com/openchargemap/images/AU/OCM48365/OCM-48365.thmb.2015112214264428.jpg",
            "Comment": "",
            "IsEnabled": true,
            "IsVideo": false,
            "IsFeaturedItem": false,
            "IsExternalResource": false,
            "User": {
                "ID": 1000,
                "Username": "Christopher Cook"
            },
            "DateCreated": "2015-11-22T14:27:00Z"
        }
    ],
    "IsRecentlyVerified": false,
    "ID": 48365,
    "UUID": "D0947B06-5E16-45A9-B168-DD704FEDF3EC",
    "DataProviderID": 1,
    "OperatorID": 3339,
    "UsageTypeID": 4,
    "UsageCost": "See operators website",
    "AddressInfo": {
        "ID": 48711,
        "Title": "Busselton RAC",
        "AddressLine1": "880 Geographe Bay Rd",
        "AddressLine2": "West Busselton",
        "Town": "Busselton",
        "StateOrProvince": "Western Australia",
        "Postcode": "6280",
        "CountryID": 18,
        "Latitude": -33.645748046681014,
        "Longitude": 115.3418423700889,
        "DistanceUnit": 0
    },
    "Connections": [
        {
            "ID": 59796,
            "ConnectionTypeID": 25,
            "StatusTypeID": 50,
            "LevelID": 3,
            "Amps": 63,
            "Voltage": 400,
            "PowerKW": 43,
            "CurrentTypeID": 20,
            "Quantity": 1
        },
        {
            "ID": 59797,
            "ConnectionTypeID": 2,
            "StatusTypeID": 50,
            "LevelID": 3,
            "Amps": 120,
            "Voltage": 500,
            "PowerKW": 50,
            "CurrentTypeID": 30,
            "Quantity": 1
        },
        {
            "ID": 59798,
            "ConnectionTypeID": 33,
            "StatusTypeID": 50,
            "LevelID": 3,
            "Amps": 120,
            "Voltage": 500,
            "PowerKW": 50,
            "CurrentTypeID": 30,
            "Quantity": 1
        },
        {
            "ID": 59799,
            "ConnectionTypeID": 1,
            "StatusTypeID": 50,
            "LevelID": 2,
            "Amps": 32,
            "Voltage": 230,
            "PowerKW": 7.2,
            "CurrentTypeID": 10,
            "Quantity": 1
        }
    ],
    "NumberOfPoints": 1,
    "StatusTypeID": 50,
    "DateLastStatusUpdate": "2021-09-03T01:56:00Z",
    "DataQualityLevel": 1,
    "DateCreated": "2015-06-25T06:12:00Z",
    "SubmissionStatusTypeID": 200
}