{
    "IsRecentlyVerified": false,
    "ID": 111927,
    "UUID": "F433A9A7-B498-4E49-88F8-CF4C35A2517F",
    "DataProviderID": 1,
    "UsageTypeID": 1,
    "AddressInfo": {
        "ID": 112273,
        "Title": "Woodward Auto Group",
        "AddressLine1": "9A Trans Canada Hwy",
        "Town": "Deer Lake",
        "StateOrProvince": "NL",
        "Postcode": "A8A 2E5",
        "CountryID": 44,
        "Latitude": 49.189317,
        "Longitude": -57.426532,
        "ContactTelephone1": "709-635-4800",
        "AccessComments": "8am-5pm M-F, 9am-3pm Sat",
        "DistanceUnit": 0
    },
    "Connections": [
        {
            "ID": 157443,
            "ConnectionTypeID": 1,
            "LevelID": 2,
            "Amps": 60,
            "Voltage": 230,
            "PowerKW": 3,
            "CurrentTypeID": 10,
            "Quantity": 1
        }
    ],
    "StatusTypeID": 0,
    "DateLastStatusUpdate": "2019-05-18T18:43:00Z",
    "DataQualityLevel": 3,
    "DateCreated": "2018-10-18T23:37:00Z",
    "SubmissionStatusTypeID": 100
}