{
    "MediaItems": [
        {
            "ID": 23795,
            "ChargePointID": 149503,
            "ItemURL": "https://s3-ap-southeast-2.amazonaws.com/openchargemap/images/PL/OCM149503/OCM-149503.orig.2020080310284690.jpg",
            "ItemThumbnailURL": "https://s3-ap-southeast-2.amazonaws.com/openchargemap/images/PL/OCM149503/OCM-149503.thmb.2020080310284690.jpg",
            "Comment": "",
            "IsEnabled": true,
            "IsVideo": false,
            "IsFeaturedItem": false,
            "IsExternalResource": false,
            "User": {
                "ID": 26760,
                "Username": "interssl.com"
            },
            "DateCreated": "2020-08-03T10:29:00Z"
        },
        {
            "ID": 23796,
            "ChargePointID": 149503,
            "ItemURL": "https://s3-ap-southeast-2.amazonaws.com/openchargemap/images/PL/OCM149503/OCM-149503.orig.2020080310285747.jpg",
            "ItemThumbnailURL": "https://s3-ap-southeast-2.amazonaws.com/openchargemap/images/PL/OCM149503/OCM-149503.thmb.2020080310285747.jpg",
            "Comment": "",
            "IsEnabled": true,
            "IsVideo": false,
            "IsFeaturedItem": false,
            "IsExternalResource": false,
            "User": {
                "ID": 26760,
                "Username": "interssl.com"
            },
            "DateCreated": "2020-08-03T10:29:00Z"
        }
    ],
    "IsRecentlyVerified": false,
    "ID": 149503,
    "UUID": "9D66F914-1287-43C3-B1B0-F2756FE66A07",
    "DataProviderID": 1,
    "OperatorID": 23,
    "OperatorsReference": "52890",
    "UsageTypeID": 4,
    "UsageCost": "PLN 1.24/kWh; Możliwe inne taryfy dla starszych samochodów",
    "AddressInfo": {
        "ID": 149856,
        "Title": "Warsaw Supercharger",
        "AddressLine1": "Belwederska 23",
        "Town": "Warsaw",
        "Postcode": "00-761",
        "CountryID": 179,
        "Latitude": 52.207854,
        "Longitude": 21.029565,
        "DistanceUnit": 0
    },
    "Connections": [
        {
            "ID": 207573,
            "ConnectionTypeID": 27,
            "StatusTypeID": 50,
            "LevelID": 3,
            "PowerKW": 120,
            "CurrentTypeID": 30,
            "Quantity": 2
        }
    ],
    "NumberOfPoints": 2,
    "GeneralComments": "Charging2 Superchargers, available 24/7, up to 150kW",
    "StatusTypeID": 50,
    "DateLastStatusUpdate": "2020-08-03T10:29:00Z",
    "DataQualityLevel": 1,
    "DateCreated": "2020-02-27T06:54:00Z",
    "SubmissionStatusTypeID": 200
}