{
    "IsRecentlyVerified": false,
    "ID": 143966,
    "UUID": "CC4AE09B-38C8-4992-B615-825B6631AFF7",
    "DataProviderID": 2,
    "DataProvidersReference": "145115",
    "OperatorID": 5,
    "UsageTypeID": 1,
    "AddressInfo": {
        "ID": 144318,
        "Title": "ZVAGO SAP",
        "AddressLine1": "2235 W Luther Pl",
        "Town": "Saint Paul",
        "StateOrProvince": "MN",
        "Postcode": "55108",
        "CountryID": 2,
        "Latitude": 44.98344,
        "Longitude": -93.195645,
        "ContactTelephone1": "888-758-4389",
        "AccessComments": "24 hours daily",
        "RelatedURL": "http://www.chargepoint.com/",
        "DistanceUnit": 0
    },
    "Connections": [
        {
            "ID": 200405,
            "ConnectionTypeID": 1,
            "LevelID": 2,
            "Amps": 16,
            "Voltage": 230,
            "PowerKW": 3.7,
            "CurrentTypeID": 10,
            "Quantity": 4
        }
    ],
    "StatusTypeID": 50,
    "DateLastStatusUpdate": "2020-06-26T03:08:00Z",
    "DataQualityLevel": 3,
    "DateCreated": "2019-12-24T09:22:00Z",
    "SubmissionStatusTypeID": 100
}