{
    "IsRecentlyVerified": false,
    "ID": 176892,
    "UUID": "77F10E57-8023-41DA-B634-BEAAC3003FB2",
    "DataProviderID": 29,
    "DataProvidersReference": "6723",
    "AddressInfo": {
        "ID": 177251,
        "Title": "Schloßberg 4",
        "AddressLine1": "Schloßberg 4",
        "Town": "Unterdießen",
        "Postcode": "86944",
        "CountryID": 87,
        "Latitude": 47.979474,
        "Longitude": 10.827395,
        "DistanceUnit": 0
    },
    "Connections": [
        {
            "ID": 275361,
            "ConnectionTypeID": 25,
            "StatusTypeID": 50,
            "LevelID": 2,
            "PowerKW": 22,
            "CurrentTypeID": 20
        },
        {
            "ID": 275362,
            "ConnectionTypeID": 25,
            "StatusTypeID": 50,
            "LevelID": 2,
            "PowerKW": 22,
            "CurrentTypeID": 20
        }
    ],
    "StatusTypeID": 0,
    "DateLastStatusUpdate": "2021-07-09T03:11:00Z",
    "MetadataValues": [
        {
            "ID": 9187,
            "MetadataFieldID": 4,
            "ItemValue": "Data from the German chargepoint registry provided by Bundesnetzagentur.de under the CC-BY 4.0 license"
        }
    ],
    "DataQualityLevel": 3,
    "DateCreated": "2021-07-08T09:48:00Z",
    "SubmissionStatusTypeID": 100
}