{
    "IsRecentlyVerified": false,
    "ID": 173138,
    "UUID": "641E53B8-E42D-41BA-8E95-5DF51C1BF44F",
    "DataProviderID": 19,
    "DataProvidersReference": "7323",
    "AddressInfo": {
        "ID": 173497,
        "Title": "Kongerødvegen 40",
        "AddressLine1": "Kongerødvegen 40",
        "Town": "SKIEN",
        "StateOrProvince": "Vestfold og Telemark",
        "Postcode": "3737",
        "CountryID": 168,
        "Latitude": 59.14941,
        "Longitude": 9.61933,
        "AccessComments": "Laderne er plassert på parkeringsplassen i Kongerødveien 40 ved avfallsanlegg og transformator.",
        "DistanceUnit": 0
    },
    "Connections": [
        {
            "ID": 265295,
            "ConnectionTypeID": 25,
            "Reference": "1",
            "LevelID": 2,
            "Amps": 32,
            "Voltage": 230,
            "PowerKW": 12.7,
            "CurrentTypeID": 20,
            "Comments": "Mode 3"
        },
        {
            "ID": 265296,
            "ConnectionTypeID": 25,
            "Reference": "2",
            "LevelID": 2,
            "Amps": 32,
            "Voltage": 230,
            "PowerKW": 12.7,
            "CurrentTypeID": 20,
            "Comments": "Mode 3"
        },
        {
            "ID": 265297,
            "ConnectionTypeID": 25,
            "Reference": "3",
            "LevelID": 2,
            "Amps": 32,
            "Voltage": 230,
            "PowerKW": 12.7,
            "CurrentTypeID": 20,
            "Comments": "Mode 3"
        },
        {
            "ID": 265298,
            "ConnectionTypeID": 25,
            "Reference": "4",
            "LevelID": 2,
            "Amps": 32,
            "Voltage": 230,
            "PowerKW": 12.7,
            "CurrentTypeID": 20,
            "Comments": "Mode 3"
        },
        {
            "ID": 265299,
            "ConnectionTypeID": 25,
            "Reference": "5",
            "LevelID": 2,
            "Amps": 32,
            "Voltage": 230,
            "PowerKW": 12.7,
            "CurrentTypeID": 20,
            "Comments": "Mode 3"
        }
    ],
    "NumberOfPoints": 5,
    "StatusTypeID": 0,
    "DateLastStatusUpdate": "2021-03-24T05:11:00Z",
    "DataQualityLevel": 2,
    "DateCreated": "2021-03-03T09:01:00Z",
    "SubmissionStatusTypeID": 100
}