{
    "IsRecentlyVerified": false,
    "ID": 109911,
    "UUID": "7A89DB90-A5C3-4016-ACC3-0D3280E399B5",
    "DataProviderID": 1,
    "OperatorID": 3315,
    "OperatorsReference": "51404",
    "UsageTypeID": 4,
    "UsageCost": "Free",
    "AddressInfo": {
        "ID": 110257,
        "Title": "Davidson House",
        "AddressLine1": "Davidson House",
        "Town": "Campus 1 Balgownie Road",
        "StateOrProvince": "Aberdeen",
        "Postcode": "AB22 8GT",
        "CountryID": 1,
        "Latitude": 57.1813016067533,
        "Longitude": -2.11901402331353,
        "DistanceUnit": 0
    },
    "Connections": [
        {
            "ID": 155112,
            "ConnectionTypeID": 25,
            "StatusTypeID": 50,
            "LevelID": 2,
            "Amps": 32,
            "Voltage": 400,
            "PowerKW": 7,
            "CurrentTypeID": 20,
            "Quantity": 2
        }
    ],
    "NumberOfPoints": 2,
    "StatusTypeID": 50,
    "DateLastStatusUpdate": "2018-12-15T06:17:00Z",
    "DataQualityLevel": 1,
    "DateCreated": "2018-10-18T05:16:00Z",
    "SubmissionStatusTypeID": 200
}