{
    "IsRecentlyVerified": false,
    "ID": 161553,
    "UUID": "60B7A723-82D1-4439-9DF3-A88BCB60C740",
    "DataProviderID": 1,
    "OperatorID": 3396,
    "UsageTypeID": 1,
    "AddressInfo": {
        "ID": 161910,
        "Title": "PKN Orlen",
        "AddressLine1": "Roździeńskiego 102",
        "Town": "Katowice",
        "Postcode": "40-226",
        "CountryID": 179,
        "Latitude": 50.26236162833732,
        "Longitude": 19.043632959275783,
        "ContactTelephone1": "+48583251077",
        "ContactTelephone2": "+48583251017",
        "RelatedURL": "https://orlencharge.orlen.pl/",
        "DistanceUnit": 0
    },
    "Connections": [
        {
            "ID": 232487,
            "ConnectionTypeID": 33,
            "StatusTypeID": 50,
            "LevelID": 3,
            "PowerKW": 100,
            "CurrentTypeID": 30,
            "Quantity": 1
        },
        {
            "ID": 232488,
            "ConnectionTypeID": 2,
            "StatusTypeID": 50,
            "LevelID": 3,
            "PowerKW": 50,
            "CurrentTypeID": 30,
            "Quantity": 1
        },
        {
            "ID": 232489,
            "ConnectionTypeID": 1036,
            "StatusTypeID": 50,
            "LevelID": 3,
            "PowerKW": 44,
            "CurrentTypeID": 20,
            "Quantity": 1
        }
    ],
    "NumberOfPoints": 2,
    "StatusTypeID": 50,
    "DateLastStatusUpdate": "2020-07-16T08:40:00Z",
    "DataQualityLevel": 1,
    "DateCreated": "2020-07-16T08:08:00Z",
    "SubmissionStatusTypeID": 200
}