{
    "IsRecentlyVerified": false,
    "ID": 93341,
    "UUID": "682F18D7-C113-4A94-A044-74A334D2D1C1",
    "DataProviderID": 1,
    "OperatorID": 23,
    "OperatorsReference": "35816",
    "UsageTypeID": 6,
    "AddressInfo": {
        "ID": 93687,
        "Title": "l'Assiette Champenoise",
        "AddressLine1": "40 Avenue Paul Vaillant-Couturier",
        "Town": "Tinqueux",
        "Postcode": "51430",
        "CountryID": 80,
        "Latitude": 49.247959,
        "Longitude": 4.003977,
        "ContactTelephone1": "+33 3 26 84 64 64",
        "DistanceUnit": 0
    },
    "Connections": [
        {
            "ID": 132218,
            "ConnectionTypeID": 30,
            "StatusTypeID": 50,
            "LevelID": 2,
            "Amps": 16,
            "Voltage": 400,
            "PowerKW": 11,
            "CurrentTypeID": 20,
            "Quantity": 2
        }
    ],
    "NumberOfPoints": 2,
    "GeneralComments": "2 Tesla Connectors, up to 11kW.Available for patrons only. Please see valet.",
    "StatusTypeID": 50,
    "DateLastStatusUpdate": "2018-10-03T15:23:00Z",
    "DataQualityLevel": 1,
    "DateCreated": "2017-09-27T19:19:00Z",
    "SubmissionStatusTypeID": 200
}