{
    "IsRecentlyVerified": false,
    "ID": 182435,
    "UUID": "CD2D0716-9813-4A55-8B54-58F3A72D3103",
    "DataProviderID": 29,
    "DataProvidersReference": "7540",
    "AddressInfo": {
        "ID": 182794,
        "Title": "Willettstr. 7",
        "AddressLine1": "Willettstr. 7",
        "Town": "Mettmann",
        "Postcode": "40822",
        "CountryID": 87,
        "Latitude": 51.254774,
        "Longitude": 6.952045,
        "DistanceUnit": 0
    },
    "Connections": [
        {
            "ID": 288181,
            "ConnectionTypeID": 25,
            "StatusTypeID": 50,
            "LevelID": 2,
            "PowerKW": 22,
            "CurrentTypeID": 20
        },
        {
            "ID": 288182,
            "ConnectionTypeID": 25,
            "StatusTypeID": 50,
            "LevelID": 2,
            "PowerKW": 22,
            "CurrentTypeID": 20
        }
    ],
    "StatusTypeID": 50,
    "DateLastStatusUpdate": "2021-07-09T03:22:00Z",
    "MetadataValues": [
        {
            "ID": 14728,
            "MetadataFieldID": 4,
            "ItemValue": "Data from the German chargepoint registry provided by Bundesnetzagentur.de under the CC-BY 4.0 license"
        }
    ],
    "DataQualityLevel": 3,
    "DateCreated": "2021-07-08T10:03:00Z",
    "SubmissionStatusTypeID": 100
}