{
    "IsRecentlyVerified": false,
    "ID": 153589,
    "UUID": "CD0FC779-B0FC-48B8-8DB9-459205D159A5",
    "DataProviderID": 28,
    "DataProvidersReference": "FR*S10*P10297D",
    "UsageTypeID": 5,
    "AddressInfo": {
        "ID": 153942,
        "Title": "PONT SAINTE MARIE",
        "AddressLine1": "44 Avenue Jules Guesdes 10150 PONT SAINTE MARIE",
        "CountryID": 80,
        "Latitude": 48.31798,
        "Longitude": 4.104369,
        "AccessComments": "",
        "DistanceUnit": 0
    },
    "Connections": [
        {
            "ID": 215557,
            "ConnectionTypeID": 28,
            "StatusTypeID": 50,
            "LevelID": 2,
            "PowerKW": 18,
            "CurrentTypeID": 10
        },
        {
            "ID": 215558,
            "ConnectionTypeID": 25,
            "StatusTypeID": 50,
            "LevelID": 2,
            "PowerKW": 18,
            "CurrentTypeID": 20
        },
        {
            "ID": 249100,
            "ConnectionTypeID": 28,
            "StatusTypeID": 50,
            "LevelID": 2,
            "PowerKW": 18,
            "CurrentTypeID": 10
        },
        {
            "ID": 249101,
            "ConnectionTypeID": 25,
            "StatusTypeID": 50,
            "LevelID": 2,
            "PowerKW": 18,
            "CurrentTypeID": 20
        }
    ],
    "GeneralComments": "\"Une unité = 6kWh de recharge. Utilisateur abonné : 1€/unité",
    "StatusTypeID": 50,
    "DateLastStatusUpdate": "2020-08-27T05:14:00Z",
    "DataQualityLevel": 2,
    "DateCreated": "2020-03-15T10:54:00Z",
    "SubmissionStatusTypeID": 100
}