{
    "IsRecentlyVerified": false,
    "ID": 15649,
    "UUID": "13213C10-75E0-48CE-8338-51FF93E3FD3A",
    "DataProviderID": 1,
    "OperatorID": 1,
    "UsageTypeID": 0,
    "UsageCost": "Free",
    "AddressInfo": {
        "ID": 15994,
        "Title": "Residence Inn by Marriott-Concord",
        "AddressLine1": "7601 Scott Padgett Parkway",
        "AddressLine2": "",
        "Town": " Concord",
        "StateOrProvince": "",
        "Postcode": "\t28027 ",
        "CountryID": 2,
        "Latitude": 35.364309,
        "Longitude": -80.70312100000001,
        "ContactTelephone1": "    1-704-454-7862",
        "ContactTelephone2": "    1-704-453-2900",
        "ContactEmail": "",
        "AccessComments": "",
        "RelatedURL": "http://www.marriott.com/hotels/travel/cltcn-residence-inn-charlotte-concord/",
        "DistanceUnit": 0
    },
    "Connections": [],
    "NumberOfPoints": 4,
    "GeneralComments": "",
    "StatusTypeID": 50,
    "DateLastStatusUpdate": "2013-01-20T14:46:00Z",
    "DataQualityLevel": 1,
    "DateCreated": "2013-01-20T14:46:00Z",
    "SubmissionStatusTypeID": 200
}