{
    "IsRecentlyVerified": false,
    "ID": 163933,
    "UUID": "B42F3333-7DA7-466E-B46B-9D96F2FC105E",
    "DataProviderID": 1,
    "OperatorID": 23,
    "OperatorsReference": "40891",
    "UsageTypeID": 4,
    "AddressInfo": {
        "ID": 164292,
        "Title": "Bodega los Aljibes",
        "AddressLine1": "Camino de Chinchilla A Pinilla",
        "Town": "Chinchilla de Monte-Aragón",
        "Postcode": "2520",
        "CountryID": 210,
        "Latitude": 38.779279,
        "Longitude": -1.589638,
        "ContactTelephone1": "+34 967 260 015",
        "DistanceUnit": 0
    },
    "Connections": [
        {
            "ID": 235531,
            "ConnectionTypeID": 30,
            "StatusTypeID": 50,
            "LevelID": 2,
            "PowerKW": 11,
            "CurrentTypeID": 20,
            "Quantity": 1
        }
    ],
    "NumberOfPoints": 1,
    "GeneralComments": "1 Tesla Connector, up to 11kW.Available for customers. Please call ahead.",
    "StatusTypeID": 50,
    "DateLastStatusUpdate": "2020-08-24T23:28:00Z",
    "DataQualityLevel": 1,
    "DateCreated": "2020-08-24T23:27:00Z",
    "SubmissionStatusTypeID": 200
}