{
    "MediaItems": [
        {
            "ID": 23024,
            "ChargePointID": 112898,
            "ItemURL": "https://s3-ap-southeast-2.amazonaws.com/openchargemap/images/IT/OCM112898/OCM-112898.orig.2020071117572652.jpg",
            "ItemThumbnailURL": "https://s3-ap-southeast-2.amazonaws.com/openchargemap/images/IT/OCM112898/OCM-112898.thmb.2020071117572652.jpg",
            "Comment": "",
            "IsEnabled": true,
            "IsVideo": false,
            "IsFeaturedItem": false,
            "IsExternalResource": false,
            "User": {
                "ID": 1606,
                "Username": "polianto"
            },
            "DateCreated": "2020-07-11T17:57:00Z"
        }
    ],
    "IsRecentlyVerified": false,
    "ID": 112898,
    "UUID": "10F601BE-AE34-40CE-BCCE-FB9AC884E52E",
    "DataProviderID": 1,
    "OperatorID": 38,
    "UsageTypeID": 1,
    "UsageCost": "free",
    "AddressInfo": {
        "ID": 113244,
        "Title": "LIDL Grumello del Monte",
        "AddressLine1": "Via Alessandro Volta",
        "Town": "Grumello del Monte",
        "StateOrProvince": "BG",
        "Postcode": "24064",
        "CountryID": 112,
        "Latitude": 45.6326224597311,
        "Longitude": 9.86273616207828,
        "RelatedURL": "https://www.lidl.it",
        "DistanceUnit": 0
    },
    "Connections": [
        {
            "ID": 159014,
            "ConnectionTypeID": 25,
            "StatusTypeID": 50,
            "LevelID": 2,
            "Amps": 32,
            "Voltage": 400,
            "PowerKW": 22,
            "CurrentTypeID": 20,
            "Quantity": 2
        }
    ],
    "NumberOfPoints": 2,
    "StatusTypeID": 50,
    "DateLastStatusUpdate": "2020-07-11T17:57:00Z",
    "DataQualityLevel": 1,
    "DateCreated": "2018-11-22T17:02:00Z",
    "SubmissionStatusTypeID": 200
}