{
    "IsRecentlyVerified": false,
    "ID": 27072,
    "UUID": "AD6BF4BA-F14A-4A4C-AB37-DFCAB09BBFB4",
    "DataProviderID": 2,
    "DataProvidersReference": "21607",
    "UsageTypeID": 1,
    "AddressInfo": {
        "ID": 27418,
        "Title": "Ventura County Air Pollution Control District",
        "AddressLine1": "669 County Square Dr",
        "Town": "Ventura",
        "StateOrProvince": "CA",
        "Postcode": "93003",
        "CountryID": 2,
        "Latitude": 34.268756,
        "Longitude": -119.2154,
        "ContactTelephone1": "805-645-1400",
        "AccessComments": "8am-5pm daily",
        "RelatedURL": "",
        "DistanceUnit": 0
    },
    "Connections": [
        {
            "ID": 29643,
            "ConnectionTypeID": 1,
            "LevelID": 2,
            "Amps": 16,
            "Voltage": 230,
            "PowerKW": 3,
            "CurrentTypeID": 10,
            "Quantity": 3
        }
    ],
    "DateLastStatusUpdate": "2019-04-06T04:02:00Z",
    "DataQualityLevel": 3,
    "DateCreated": "2014-11-28T03:37:00Z",
    "SubmissionStatusTypeID": 100
}