{
    "UserComments": [
        {
            "ID": 24808,
            "ChargePointID": 189042,
            "CommentTypeID": 10,
            "UserName": "ForumElettrico.it",
            "Comment": "Dalla parte opposta del complesso dietro la colonnina, c'è un bar ottimo per una sosta. Leggi la recensione completa qui:  https://www.forumelettrico.it/forum/colonnina-fast-a2a-conad-gussago-viale-italia-t17745.html",
            "RelatedURL": "https://www.forumelettrico.it/forum/colonnina-fast-a2a-conad-gussago-viale-italia-t17745.html",
            "DateCreated": "2021-09-03T05:42:01.587Z",
            "User": {
                "ID": 11749,
                "Username": "ForumElettrico.it"
            },
            "CheckinStatusTypeID": 140,
            "IsActionedByEditor": false
        }
    ],
    "MediaItems": [
        {
            "ID": 29195,
            "ChargePointID": 189042,
            "ItemURL": "https://s3-ap-southeast-2.amazonaws.com/openchargemap/images/IT/OCM189042/OCM-189042.orig.2021090305421016.jpg",
            "ItemThumbnailURL": "https://s3-ap-southeast-2.amazonaws.com/openchargemap/images/IT/OCM189042/OCM-189042.thmb.2021090305421016.jpg",
            "Comment": "",
            "IsEnabled": true,
            "IsVideo": false,
            "IsFeaturedItem": false,
            "IsExternalResource": false,
            "User": {
                "ID": 11749,
                "Username": "ForumElettrico.it"
            },
            "DateCreated": "2021-09-03T05:42:00Z"
        },
        {
            "ID": 29196,
            "ChargePointID": 189042,
            "ItemURL": "https://s3-ap-southeast-2.amazonaws.com/openchargemap/images/IT/OCM189042/OCM-189042.orig.2021090305421573.jpg",
            "ItemThumbnailURL": "https://s3-ap-southeast-2.amazonaws.com/openchargemap/images/IT/OCM189042/OCM-189042.thmb.2021090305421573.jpg",
            "Comment": "",
            "IsEnabled": true,
            "IsVideo": false,
            "IsFeaturedItem": false,
            "IsExternalResource": false,
            "User": {
                "ID": 11749,
                "Username": "ForumElettrico.it"
            },
            "DateCreated": "2021-09-03T05:42:00Z"
        }
    ],
    "IsRecentlyVerified": true,
    "DateLastVerified": "2021-09-03T05:42:00Z",
    "ID": 189042,
    "UUID": "EC4D230C-51EF-4752-A7E6-4EF5D8FEFC92",
    "DataProviderID": 1,
    "OperatorID": 82,
    "UsageTypeID": 1,
    "AddressInfo": {
        "ID": 189401,
        "Title": "A2A Conad",
        "AddressLine1": "Viale Italia 17",
        "Town": "Gussago",
        "StateOrProvince": "BS",
        "CountryID": 112,
        "Latitude": 45.581457,
        "Longitude": 10.15821,
        "RelatedURL": "https://www.forumelettrico.it/forum/colonnina-fast-a2a-conad-gussago-viale-italia-t17745.html",
        "DistanceUnit": 0
    },
    "Connections": [
        {
            "ID": 305563,
            "ConnectionTypeID": 33,
            "LevelID": 2,
            "PowerKW": 50
        },
        {
            "ID": 305564,
            "ConnectionTypeID": 2,
            "LevelID": 2,
            "PowerKW": 50
        },
        {
            "ID": 305565,
            "ConnectionTypeID": 25,
            "LevelID": 2,
            "PowerKW": 22
        }
    ],
    "NumberOfPoints": 1,
    "StatusTypeID": 50,
    "DateLastStatusUpdate": "2021-09-03T05:42:00Z",
    "DataQualityLevel": 1,
    "DateCreated": "2021-09-03T05:42:00Z",
    "SubmissionStatusTypeID": 200
}