{
    "IsRecentlyVerified": false,
    "ID": 17264,
    "UUID": "7D9C7ADB-F3E5-4290-B498-80895174B09B",
    "DataProviderID": 22,
    "DataProvidersReference": "65F675B3CF48B79D1D4FE970F1688C6B",
    "AddressInfo": {
        "ID": 17609,
        "Title": "東愛知日産自動車豊橋岩屋店",
        "AddressLine1": "愛知県豊橋市岩屋町字岩屋西5-5",
        "CountryID": 114,
        "Latitude": 34.73887007,
        "Longitude": 137.4231091,
        "ContactTelephone1": "0532-63-1511",
        "DistanceUnit": 0
    },
    "Connections": [
        {
            "ID": 17505,
            "ConnectionTypeID": 2,
            "LevelID": 2,
            "Amps": 100,
            "Voltage": 480,
            "PowerKW": 48,
            "Quantity": 1
        }
    ],
    "DateLastStatusUpdate": "2013-06-29T08:56:00Z",
    "DataQualityLevel": 2,
    "DateCreated": "2013-06-29T08:56:00Z",
    "SubmissionStatusTypeID": 200
}