{
    "IsRecentlyVerified": false,
    "ID": 101562,
    "UUID": "CFFD1397-19A5-47C2-B87D-A03E9668D509",
    "DataProviderID": 1,
    "OperatorID": 23,
    "OperatorsReference": "41784",
    "UsageTypeID": 4,
    "AddressInfo": {
        "ID": 101908,
        "Title": "Citipark Church Watford",
        "AddressLine1": "Citipark Church Exchange Road",
        "Town": "Watford",
        "Postcode": "WD18 0BU",
        "CountryID": 1,
        "Latitude": 51.654712,
        "Longitude": -0.397127,
        "ContactTelephone1": "+44 333 344 4949",
        "DistanceUnit": 0
    },
    "Connections": [
        {
            "ID": 143371,
            "ConnectionTypeID": 30,
            "StatusTypeID": 50,
            "LevelID": 2,
            "Amps": 16,
            "Voltage": 400,
            "PowerKW": 11,
            "CurrentTypeID": 20,
            "Quantity": 2
        }
    ],
    "NumberOfPoints": 2,
    "GeneralComments": "2 Tesla Connectors, up to 11kW.Available to the public. Self park.",
    "StatusTypeID": 50,
    "DateLastStatusUpdate": "2018-10-03T18:15:00Z",
    "DataQualityLevel": 1,
    "DateCreated": "2018-03-30T05:55:00Z",
    "SubmissionStatusTypeID": 200
}