{
    "IsRecentlyVerified": false,
    "ID": 112304,
    "UUID": "E8B04ABA-50F5-4232-B580-21C6C8FF6310",
    "DataProviderID": 1,
    "OperatorID": 20,
    "OperatorsReference": "80867,80868",
    "UsageTypeID": 4,
    "UsageCost": "£0.20/kWh;min £1.00",
    "AddressInfo": {
        "ID": 112650,
        "Title": "Djanogly Leisure Centre, Nottingham",
        "AddressLine1": "Djanogly Leisure Centre",
        "Town": "Forest Fields",
        "StateOrProvince": "Nottingham",
        "Postcode": "NG7 6ND",
        "CountryID": 1,
        "Latitude": 52.96742,
        "Longitude": -1.164,
        "DistanceUnit": 0
    },
    "Connections": [
        {
            "ID": 157924,
            "ConnectionTypeID": 25,
            "StatusTypeID": 50,
            "LevelID": 2,
            "Amps": 32,
            "Voltage": 230,
            "PowerKW": 7,
            "CurrentTypeID": 10,
            "Quantity": 4
        }
    ],
    "NumberOfPoints": 4,
    "StatusTypeID": 50,
    "DateLastStatusUpdate": "2018-10-26T05:27:00Z",
    "DataQualityLevel": 1,
    "DateCreated": "2018-10-24T05:27:00Z",
    "SubmissionStatusTypeID": 200
}