{
    "IsRecentlyVerified": false,
    "ID": 32394,
    "UUID": "A133A54A-0654-477A-AE2B-6C9E01951F40",
    "DataProviderID": 1,
    "OperatorID": 105,
    "OperatorsReference": "Essent EM-DE-05970024-01-00003",
    "UsageTypeID": 4,
    "AddressInfo": {
        "ID": 32740,
        "Title": "Marburger Straße 38",
        "AddressLine1": "Marburger Straße 38",
        "Town": "Kreuztal",
        "Postcode": "57223",
        "CountryID": 87,
        "Latitude": 50.961367,
        "Longitude": 7.994433,
        "DistanceUnit": 0
    },
    "Connections": [
        {
            "ID": 35905,
            "ConnectionTypeID": 25,
            "LevelID": 2,
            "PowerKW": 11
        },
        {
            "ID": 46362,
            "ConnectionTypeID": 25,
            "LevelID": 2,
            "PowerKW": 11
        }
    ],
    "NumberOfPoints": 1,
    "StatusTypeID": 50,
    "DateLastStatusUpdate": "2015-04-13T23:46:00Z",
    "DataQualityLevel": 3,
    "DateCreated": "2015-01-09T06:03:00Z",
    "SubmissionStatusTypeID": 200
}