{
    "IsRecentlyVerified": false,
    "ID": 121948,
    "UUID": "4B5CEAE5-050B-4932-BC37-3FF533B537CF",
    "DataProviderID": 2,
    "DataProvidersReference": "94744",
    "OperatorID": 3372,
    "UsageTypeID": 2,
    "AddressInfo": {
        "ID": 122294,
        "Title": "Office Building",
        "AddressLine1": "1960 E Grand Ave",
        "Town": "El Segundo",
        "StateOrProvince": "CA",
        "Postcode": "90245",
        "CountryID": 2,
        "Latitude": 33.918849,
        "Longitude": -118.392951,
        "ContactTelephone1": "",
        "AccessComments": "Employee use only",
        "RelatedURL": "http://evconnect.com/",
        "DistanceUnit": 0
    },
    "Connections": [
        {
            "ID": 171793,
            "ConnectionTypeID": 1,
            "LevelID": 2,
            "Amps": 16,
            "Voltage": 230,
            "PowerKW": 3.7,
            "CurrentTypeID": 10,
            "Quantity": 6
        }
    ],
    "DateLastStatusUpdate": "2020-06-26T02:56:00Z",
    "DataQualityLevel": 3,
    "DateCreated": "2019-04-06T05:02:00Z",
    "SubmissionStatusTypeID": 100
}