{
    "IsRecentlyVerified": false,
    "ID": 141908,
    "UUID": "AE2B5A48-7233-4440-8C26-FDBA7AF7B0C5",
    "DataProviderID": 2,
    "DataProvidersReference": "147962",
    "OperatorID": 39,
    "UsageTypeID": 1,
    "AddressInfo": {
        "ID": 142260,
        "Title": "Confluence Apartments",
        "AddressLine1": "1441 Little Raven St",
        "Town": "Denver",
        "StateOrProvince": "CO",
        "Postcode": "80202",
        "CountryID": 2,
        "Latitude": 39.7542338,
        "Longitude": -105.0072998,
        "ContactTelephone1": "800-663-5633",
        "AccessComments": "MO: Not Specified; TU: Not Specified; WE: Not Specified; TH: Not Specified; FR: Not Specified; SA: Not Specified; SU: Not Specified",
        "RelatedURL": "http://www.semacharge.com/",
        "DistanceUnit": 0
    },
    "Connections": [
        {
            "ID": 197946,
            "ConnectionTypeID": 1,
            "LevelID": 2,
            "Amps": 16,
            "Voltage": 230,
            "PowerKW": 3,
            "CurrentTypeID": 10,
            "Quantity": 3
        }
    ],
    "StatusTypeID": 50,
    "DateLastStatusUpdate": "2019-12-24T09:16:00Z",
    "DataQualityLevel": 3,
    "DateCreated": "2019-12-24T09:16:00Z",
    "SubmissionStatusTypeID": 100
}