{
    "IsRecentlyVerified": false,
    "ID": 113222,
    "UUID": "E064CB09-9D75-45E2-BC2D-F85A2D19E773",
    "DataProviderID": 2,
    "DataProvidersReference": "104524",
    "OperatorID": 5,
    "UsageTypeID": 1,
    "AddressInfo": {
        "ID": 113568,
        "Title": "KRP PROPERTIES",
        "AddressLine1": "300 March Rd",
        "Town": "Ottawa",
        "StateOrProvince": "ON",
        "Postcode": "K2K 2E2",
        "CountryID": 44,
        "Latitude": 45.3360266,
        "Longitude": -75.9062453,
        "ContactTelephone1": "888-758-4389",
        "AccessComments": "24 hours daily",
        "RelatedURL": "http://www.chargepoint.com/",
        "DistanceUnit": 0
    },
    "Connections": [
        {
            "ID": 159412,
            "ConnectionTypeID": 1,
            "LevelID": 2,
            "Amps": 16,
            "Voltage": 230,
            "PowerKW": 3.7,
            "CurrentTypeID": 10,
            "Quantity": 2
        }
    ],
    "DateLastStatusUpdate": "2020-06-26T03:08:00Z",
    "DataQualityLevel": 3,
    "DateCreated": "2018-11-28T02:04:00Z",
    "SubmissionStatusTypeID": 100
}