{
    "IsRecentlyVerified": false,
    "ID": 116971,
    "UUID": "31CD2F0A-FD5E-46D6-9E39-22D930434013",
    "DataProviderID": 1,
    "OperatorID": 3332,
    "UsageTypeID": 1,
    "UsageCost": "Costo al min. €0,20 Costo prenotazione €5,50",
    "AddressInfo": {
        "ID": 117317,
        "Title": "Alessandria Retail Park Ovest | Driwe",
        "AddressLine1": "Via Marengo ",
        "AddressLine2": "San Maggiore",
        "Town": "Alessandria",
        "StateOrProvince": "AL",
        "Postcode": "15121",
        "CountryID": 112,
        "Latitude": 44.90860430429106,
        "Longitude": 8.634278797463594,
        "ContactTelephone1": "04451620036",
        "ContactEmail": "charge@driwe.eu",
        "AccessComments": "E' dall'altra parte del Toy Center",
        "RelatedURL": "https://www.driwe.eu/",
        "DistanceUnit": 0
    },
    "Connections": [
        {
            "ID": 165576,
            "ConnectionTypeID": 1036,
            "StatusTypeID": 50,
            "LevelID": 2,
            "Amps": 32,
            "Voltage": 400,
            "PowerKW": 22,
            "CurrentTypeID": 20,
            "Quantity": 2
        }
    ],
    "NumberOfPoints": 6,
    "StatusTypeID": 50,
    "DateLastStatusUpdate": "2019-08-02T10:37:00Z",
    "DataQualityLevel": 1,
    "DateCreated": "2019-02-15T15:16:00Z",
    "SubmissionStatusTypeID": 200
}