{
    "IsRecentlyVerified": false,
    "ID": 110808,
    "UUID": "75D0DF01-B96F-4213-8E88-AB3EE1BDB3EB",
    "DataProviderID": 2,
    "DataProvidersReference": "84081",
    "UsageTypeID": 1,
    "AddressInfo": {
        "ID": 111154,
        "Title": "Hidden Bench Estate Winery",
        "AddressLine1": "4152 Locust Ln",
        "Town": "Lincoln",
        "StateOrProvince": "ON",
        "Postcode": "L0R 1B0",
        "CountryID": 44,
        "Latitude": 43.159694,
        "Longitude": -79.493709,
        "ContactTelephone1": "905-563-8700",
        "AccessComments": "10am-5pm daily; for guest use only",
        "RelatedURL": "",
        "DistanceUnit": 0
    },
    "Connections": [
        {
            "ID": 156103,
            "ConnectionTypeID": 1,
            "LevelID": 2,
            "Amps": 16,
            "Voltage": 230,
            "PowerKW": 3.7,
            "CurrentTypeID": 10,
            "Quantity": 1
        }
    ],
    "DateLastStatusUpdate": "2020-06-26T03:06:00Z",
    "DataQualityLevel": 3,
    "DateCreated": "2018-10-18T23:36:00Z",
    "SubmissionStatusTypeID": 100
}