{
    "IsRecentlyVerified": false,
    "ID": 56350,
    "UUID": "F5C7206F-BA13-437A-97D3-8B1BB72B2560",
    "DataProviderID": 1,
    "OperatorID": 156,
    "UsageTypeID": 4,
    "AddressInfo": {
        "ID": 56696,
        "Title": "Ladepunkt Ellrich",
        "AddressLine1": "Nordhäuser Straße 46A",
        "Town": "Ellrich",
        "StateOrProvince": "Landkreis Nordhausen",
        "Postcode": "99755",
        "CountryID": 87,
        "Latitude": 51.58414,
        "Longitude": 10.665849999999978,
        "ContactTelephone1": "+491712748920",
        "AccessComments": "24/7 nutzbarer Ladepunkt; bitte ggf. bei Herrn Eckehard Peter Paul Meitz anmelden. Die Schukodose ist kostenlos und ohne Ladekarte benutzbar.",
        "DistanceUnit": 0
    },
    "Connections": [
        {
            "ID": 71084,
            "ConnectionTypeID": 28,
            "StatusTypeID": 50,
            "LevelID": 2,
            "Amps": 16,
            "Voltage": 230,
            "PowerKW": 3.7,
            "CurrentTypeID": 10,
            "Quantity": 1
        },
        {
            "ID": 140632,
            "ConnectionTypeID": 25,
            "StatusTypeID": 50,
            "LevelID": 2,
            "Amps": 16,
            "Voltage": 230,
            "PowerKW": 3.7,
            "CurrentTypeID": 10,
            "Quantity": 1
        }
    ],
    "NumberOfPoints": 2,
    "StatusTypeID": 50,
    "DateLastStatusUpdate": "2018-01-29T07:43:00Z",
    "DataQualityLevel": 1,
    "DateCreated": "2015-10-30T21:45:00Z",
    "SubmissionStatusTypeID": 200
}