{
    "IsRecentlyVerified": false,
    "ID": 176860,
    "UUID": "E831B53E-FCCD-430C-AFE2-D7131A69F93F",
    "DataProviderID": 29,
    "DataProvidersReference": "19120",
    "AddressInfo": {
        "ID": 177219,
        "Title": "Landweg 1-3",
        "AddressLine1": "Landweg 1-3",
        "Town": "Künzell",
        "Postcode": "36093",
        "CountryID": 87,
        "Latitude": 50.52888563,
        "Longitude": 9.73138412,
        "DistanceUnit": 0
    },
    "Connections": [
        {
            "ID": 275287,
            "ConnectionTypeID": 25,
            "StatusTypeID": 50,
            "LevelID": 2,
            "PowerKW": 11,
            "CurrentTypeID": 20
        },
        {
            "ID": 275288,
            "ConnectionTypeID": 25,
            "StatusTypeID": 50,
            "LevelID": 2,
            "PowerKW": 11,
            "CurrentTypeID": 20
        }
    ],
    "StatusTypeID": 0,
    "DateLastStatusUpdate": "2021-07-12T02:45:00Z",
    "MetadataValues": [
        {
            "ID": 9155,
            "MetadataFieldID": 4,
            "ItemValue": "Data from the German chargepoint registry provided by Bundesnetzagentur.de under the CC-BY 4.0 license"
        }
    ],
    "DataQualityLevel": 3,
    "DateCreated": "2021-07-08T09:48:00Z",
    "SubmissionStatusTypeID": 100
}