{
    "IsRecentlyVerified": false,
    "ID": 154850,
    "UUID": "638A735F-33DC-409D-8A93-457DD515C298",
    "DataProviderID": 1,
    "OperatorID": 80,
    "UsageTypeID": 4,
    "AddressInfo": {
        "ID": 155203,
        "Title": "Salve Dante  | EnelX",
        "AddressLine1": "Piazza Dante Alighieri",
        "Town": "Salve",
        "StateOrProvince": "LE",
        "Postcode": "73050",
        "CountryID": 112,
        "Latitude": 39.86013568745312,
        "Longitude": 18.299443506004764,
        "ContactTelephone1": "800.069.850",
        "RelatedURL": "https://www.enelx.com/it/it/emobility",
        "DistanceUnit": 0
    },
    "Connections": [
        {
            "ID": 217921,
            "ConnectionTypeID": 25,
            "StatusTypeID": 50,
            "LevelID": 2,
            "Amps": 32,
            "Voltage": 400,
            "PowerKW": 22,
            "CurrentTypeID": 20,
            "Quantity": 1
        },
        {
            "ID": 217922,
            "ConnectionTypeID": 36,
            "StatusTypeID": 50,
            "LevelID": 2,
            "Amps": 16,
            "Voltage": 240,
            "PowerKW": 3.7,
            "CurrentTypeID": 10,
            "Quantity": 1
        }
    ],
    "NumberOfPoints": 2,
    "StatusTypeID": 50,
    "DateLastStatusUpdate": "2020-03-20T17:50:00Z",
    "DataQualityLevel": 1,
    "DateCreated": "2020-03-20T17:50:00Z",
    "SubmissionStatusTypeID": 200
}