{
    "IsRecentlyVerified": false,
    "ID": 107958,
    "UUID": "F59B5C3F-1596-4BB1-AF02-4FE62E5BAEEC",
    "DataProviderID": 1,
    "OperatorID": 70,
    "UsageTypeID": 4,
    "AddressInfo": {
        "ID": 108304,
        "Title": "EŞARJ - Aytemiz Petrol Şişli",
        "AddressLine1": "Kaptanpaşa Mah. Darülcaze yanı No:274 Şişli, 34384 İstanbul / Türkiye",
        "Town": "Istanbul",
        "CountryID": 229,
        "Latitude": 41.059464,
        "Longitude": 28.9761063999999,
        "RelatedURL": "http://esarj.com/harita?s=TR-IST-063",
        "DistanceUnit": 0
    },
    "Connections": [
        {
            "ID": 152469,
            "ConnectionTypeID": 2,
            "StatusTypeID": 50,
            "LevelID": 3,
            "PowerKW": 45,
            "CurrentTypeID": 30,
            "Quantity": 1
        },
        {
            "ID": 152470,
            "ConnectionTypeID": 33,
            "StatusTypeID": 50,
            "LevelID": 3,
            "PowerKW": 45,
            "CurrentTypeID": 30,
            "Quantity": 1
        },
        {
            "ID": 152471,
            "ConnectionTypeID": 25,
            "StatusTypeID": 50,
            "LevelID": 2,
            "Amps": 32,
            "Voltage": 400,
            "PowerKW": 22,
            "CurrentTypeID": 20,
            "Quantity": 1
        }
    ],
    "NumberOfPoints": 1,
    "StatusTypeID": 50,
    "DateLastStatusUpdate": "2020-01-09T16:28:00Z",
    "DataQualityLevel": 1,
    "DateCreated": "2018-08-22T07:12:00Z",
    "SubmissionStatusTypeID": 200
}