{
    "IsRecentlyVerified": false,
    "ID": 185179,
    "UUID": "C77A0C57-B2B4-42FC-8BF5-258AE11A58A0",
    "DataProviderID": 29,
    "DataProvidersReference": "20318",
    "OperatorID": 220,
    "AddressInfo": {
        "ID": 185538,
        "Title": "Lütjenmoor 15",
        "AddressLine1": "Lütjenmoor 15",
        "Town": "Norderstedt",
        "Postcode": "22850",
        "CountryID": 87,
        "Latitude": 53.68578,
        "Longitude": 9.98838,
        "DistanceUnit": 0
    },
    "Connections": [
        {
            "ID": 294315,
            "ConnectionTypeID": 28,
            "StatusTypeID": 50,
            "LevelID": 2,
            "PowerKW": 22,
            "CurrentTypeID": 10
        },
        {
            "ID": 294316,
            "ConnectionTypeID": 28,
            "StatusTypeID": 50,
            "LevelID": 2,
            "PowerKW": 22,
            "CurrentTypeID": 10
        }
    ],
    "StatusTypeID": 50,
    "DateLastStatusUpdate": "2021-07-09T03:30:00Z",
    "MetadataValues": [
        {
            "ID": 17470,
            "MetadataFieldID": 4,
            "ItemValue": "Data from the German chargepoint registry provided by Bundesnetzagentur.de under the CC-BY 4.0 license"
        }
    ],
    "DataQualityLevel": 3,
    "DateCreated": "2021-07-08T10:06:00Z",
    "SubmissionStatusTypeID": 100
}