{
    "IsRecentlyVerified": false,
    "ID": 30079,
    "UUID": "9D6CC443-FF23-414A-85D5-EF2636D61BFE",
    "DataProviderID": 1,
    "DataProvidersReference": "LSB-00089",
    "OperatorID": 21,
    "UsageTypeID": 4,
    "UsageCost": "Mobi.E compatible card",
    "AddressInfo": {
        "ID": 30425,
        "Title": "LSB-00089",
        "AddressLine1": "Rua Manuel Marques 6",
        "Town": "Lisboa",
        "Postcode": "1750-171",
        "CountryID": 180,
        "Latitude": 38.765,
        "Longitude": -9.153611,
        "RelatedURL": "http://www.mobie.pt",
        "DistanceUnit": 0
    },
    "Connections": [
        {
            "ID": 33064,
            "ConnectionTypeID": 25,
            "StatusTypeID": 50,
            "LevelID": 2,
            "Amps": 16,
            "Voltage": 230,
            "PowerKW": 3.7,
            "CurrentTypeID": 10,
            "Quantity": 2
        }
    ],
    "NumberOfPoints": 2,
    "StatusTypeID": 50,
    "DateLastStatusUpdate": "2020-08-16T09:51:00Z",
    "DataQualityLevel": 3,
    "DateCreated": "2014-11-29T14:48:00Z",
    "SubmissionStatusTypeID": 100
}