{
    "IsRecentlyVerified": false,
    "ID": 85239,
    "UUID": "93F27BF9-AA39-4467-8DA9-9CFBEC970426",
    "DataProviderID": 1,
    "OperatorID": 15,
    "UsageTypeID": 1,
    "UsageCost": "$9.95 flat fee",
    "AddressInfo": {
        "ID": 85585,
        "Title": "Southshore Plaza",
        "AddressLine1": "250 Granite Street",
        "Town": "Braintree",
        "StateOrProvince": "MA",
        "Postcode": "02184",
        "CountryID": 2,
        "Latitude": 42.2200675,
        "Longitude": -71.0226979,
        "DistanceUnit": 0
    },
    "Connections": [
        {
            "ID": 121036,
            "ConnectionTypeID": 32,
            "StatusTypeID": 50,
            "LevelID": 3,
            "PowerKW": 60,
            "CurrentTypeID": 30,
            "Quantity": 1
        },
        {
            "ID": 121037,
            "ConnectionTypeID": 2,
            "StatusTypeID": 50,
            "LevelID": 3,
            "PowerKW": 60,
            "CurrentTypeID": 30,
            "Quantity": 1
        }
    ],
    "NumberOfPoints": 1,
    "StatusTypeID": 50,
    "DateLastStatusUpdate": "2017-03-30T12:40:00Z",
    "DataQualityLevel": 1,
    "DateCreated": "2017-03-30T02:15:00Z",
    "SubmissionStatusTypeID": 200
}