{
    "IsRecentlyVerified": false,
    "ID": 173375,
    "UUID": "DE33FA5A-8F94-44EA-BE42-DE8D816FB913",
    "DataProviderID": 18,
    "DataProvidersReference": "a30d5726c8973287be07619a601a3713",
    "OperatorID": 2244,
    "UsageTypeID": 1,
    "AddressInfo": {
        "ID": 173734,
        "Title": "11B Arkwright Road",
        "AddressLine1": "11B Arkwright Road",
        "Town": "London",
        "Postcode": "NW3 6BB",
        "CountryID": 1,
        "Latitude": -0.178557,
        "Longitude": 51.552627,
        "AccessComments": "",
        "RelatedURL": "https://www.ubitricity.com",
        "DistanceUnit": 0
    },
    "Connections": [
        {
            "ID": 266400,
            "ConnectionTypeID": 25,
            "Reference": "suby1100005313",
            "StatusTypeID": 50,
            "LevelID": 2,
            "Amps": 16,
            "Voltage": 230,
            "PowerKW": 3.7,
            "CurrentTypeID": 10
        }
    ],
    "StatusTypeID": 0,
    "DateLastStatusUpdate": "2021-07-12T03:38:00Z",
    "MetadataValues": [
        {
            "ID": 8297,
            "MetadataFieldID": 4,
            "ItemValue": "Contains public sector information licensed under the Open Government Licence v2.0. http://www.nationalarchives.gov.uk/doc/open-government-licence/version/2/"
        }
    ],
    "DataQualityLevel": 3,
    "DateCreated": "2021-03-03T11:24:00Z",
    "SubmissionStatusTypeID": 100
}