{
    "IsRecentlyVerified": false,
    "ID": 107104,
    "UUID": "6F24893B-07A5-4921-ADF3-097C18A28E4F",
    "DataProviderID": 1,
    "OperatorID": 32,
    "OperatorsReference": "22041",
    "UsageTypeID": 4,
    "UsageCost": "£0.108/kWh; for Polar Plus subscription members only",
    "AddressInfo": {
        "ID": 107450,
        "Title": "Cofferidge Close Car Park",
        "AddressLine1": "Cofferidge Close Car Park",
        "Town": "Cofferidge Close",
        "StateOrProvince": "Stoney Stratford",
        "Postcode": "MK11 1YA",
        "CountryID": 1,
        "Latitude": 52.056198,
        "Longitude": -0.852845,
        "DistanceUnit": 0
    },
    "Connections": [
        {
            "ID": 151007,
            "ConnectionTypeID": 2,
            "StatusTypeID": 50,
            "LevelID": 3,
            "PowerKW": 50,
            "CurrentTypeID": 30,
            "Quantity": 1
        },
        {
            "ID": 151008,
            "ConnectionTypeID": 33,
            "StatusTypeID": 50,
            "LevelID": 3,
            "PowerKW": 50,
            "CurrentTypeID": 30,
            "Quantity": 1
        },
        {
            "ID": 151009,
            "ConnectionTypeID": 1036,
            "StatusTypeID": 50,
            "LevelID": 3,
            "PowerKW": 43,
            "CurrentTypeID": 20,
            "Quantity": 1
        }
    ],
    "NumberOfPoints": 1,
    "GeneralComments": "Long Stay",
    "StatusTypeID": 50,
    "DateLastStatusUpdate": "2019-06-21T05:25:00Z",
    "DataQualityLevel": 1,
    "DateCreated": "2018-07-19T05:14:00Z",
    "SubmissionStatusTypeID": 200
}