{
    "IsRecentlyVerified": false,
    "ID": 32988,
    "UUID": "54F1E746-F2A3-468B-A968-6DE4B2D97B3A",
    "DataProviderID": 26,
    "DataProvidersReference": "47145",
    "OperatorID": 178,
    "OperatorsReference": "EVnetNL AL293",
    "UsageCost": "0.00 jaarabonnement",
    "AddressInfo": {
        "ID": 33334,
        "Title": "Pietersbergweg 31",
        "AddressLine1": "Pietersbergweg 31",
        "Town": "Eindhoven",
        "Postcode": "5628 BS",
        "CountryID": 159,
        "Latitude": 51.48117,
        "Longitude": 5.46013,
        "ContactTelephone1": "0800-3522365",
        "RelatedURL": "http://www.evnet.nl",
        "DistanceUnit": 0
    },
    "Connections": [
        {
            "ID": 36499,
            "ConnectionTypeID": 25,
            "LevelID": 2,
            "PowerKW": 11,
            "CurrentTypeID": 10
        }
    ],
    "NumberOfPoints": 2,
    "StatusTypeID": 50,
    "DateLastStatusUpdate": "2016-06-04T02:39:00Z",
    "DataQualityLevel": 3,
    "DateCreated": "2015-01-09T06:03:00Z",
    "SubmissionStatusTypeID": 100
}