{
    "IsRecentlyVerified": false,
    "ID": 96900,
    "UUID": "B8336754-6DED-46C8-8EAC-8240F2CE76D1",
    "DataProviderID": 1,
    "OperatorID": 3297,
    "UsageTypeID": 4,
    "AddressInfo": {
        "ID": 97246,
        "Title": "Rathaus",
        "AddressLine1": "Wilhelminenstraße 4",
        "Town": "Höchst im Odenwald",
        "StateOrProvince": "Odenwaldkreis",
        "Postcode": "64739",
        "CountryID": 87,
        "Latitude": 49.79799999999999,
        "Longitude": 8.993650000000002,
        "DistanceUnit": 0
    },
    "Connections": [
        {
            "ID": 137258,
            "ConnectionTypeID": 25,
            "StatusTypeID": 50,
            "LevelID": 2,
            "Amps": 32,
            "Voltage": 400,
            "PowerKW": 22,
            "CurrentTypeID": 20,
            "Quantity": 2
        }
    ],
    "NumberOfPoints": 2,
    "GeneralComments": "24/7 nutzbar. Freischaltung mit jeder Ladekarte der Entega (Verbund LastMileSolutions), z.B. New Motion oder PlugSurfing.",
    "StatusTypeID": 50,
    "DateLastStatusUpdate": "2018-01-02T13:05:00Z",
    "DataQualityLevel": 1,
    "DateCreated": "2018-01-02T13:05:00Z",
    "SubmissionStatusTypeID": 200
}