{
    "IsRecentlyVerified": false,
    "ID": 64049,
    "UUID": "B03F9C7A-29DB-423C-9919-D74D09E18041",
    "DataProviderID": 26,
    "DataProvidersReference": "79256",
    "OperatorID": 73,
    "OperatorsReference": "EV-Box EVB-P1449021",
    "UsageCost": "0.00 jaarabonnement",
    "AddressInfo": {
        "ID": 64395,
        "Title": "Hertenkamplaan 13",
        "AddressLine1": "Hertenkamplaan 13",
        "Town": "Dronten",
        "Postcode": "8255 BA",
        "CountryID": 159,
        "Latitude": 52.5655,
        "Longitude": 5.63604,
        "RelatedURL": "http://www.ev-box.nl",
        "DistanceUnit": 0
    },
    "Connections": [
        {
            "ID": 81899,
            "ConnectionTypeID": 25,
            "LevelID": 2,
            "PowerKW": 5,
            "CurrentTypeID": 10
        }
    ],
    "NumberOfPoints": 1,
    "StatusTypeID": 50,
    "DateLastStatusUpdate": "2016-06-04T02:55:00Z",
    "DataQualityLevel": 3,
    "DateCreated": "2016-03-03T12:32:00Z",
    "SubmissionStatusTypeID": 100
}