{
    "IsRecentlyVerified": false,
    "ID": 166497,
    "UUID": "83B19CCD-CE0F-4A32-B23D-BA73AED3AB97",
    "DataProviderID": 28,
    "DataProvidersReference": "FR*S28*PSDE28*ORG1",
    "UsageTypeID": 5,
    "AddressInfo": {
        "ID": 166856,
        "Title": "Orgères-en-Beauce | Rue de l'Arsenal 2",
        "AddressLine1": "2 Rue de l'Arsenal 28140 Orgères-en-Beauce",
        "CountryID": 80,
        "Latitude": 48.14618,
        "Longitude": 1.682806,
        "AccessComments": "24/24 7/7",
        "DistanceUnit": 0
    },
    "Connections": [
        {
            "ID": 248781,
            "ConnectionTypeID": 1036,
            "StatusTypeID": 50,
            "LevelID": 2,
            "PowerKW": 22,
            "CurrentTypeID": 20
        },
        {
            "ID": 248782,
            "ConnectionTypeID": 28,
            "StatusTypeID": 50,
            "LevelID": 2,
            "PowerKW": 22,
            "CurrentTypeID": 10
        },
        {
            "ID": 248783,
            "ConnectionTypeID": 26,
            "StatusTypeID": 50,
            "LevelID": 2,
            "PowerKW": 22
        }
    ],
    "GeneralComments": "",
    "StatusTypeID": 50,
    "DateLastStatusUpdate": "2020-08-27T05:14:00Z",
    "DataQualityLevel": 2,
    "DateCreated": "2020-08-27T05:14:00Z",
    "SubmissionStatusTypeID": 100
}