{
    "MediaItems": [
        {
            "ID": 12793,
            "ChargePointID": 15432,
            "ItemURL": "https://s3-ap-southeast-2.amazonaws.com/openchargemap/images/CA/OCM15432/OCM-15432.orig.2017060500371027.jpg",
            "ItemThumbnailURL": "https://s3-ap-southeast-2.amazonaws.com/openchargemap/images/CA/OCM15432/OCM-15432.thmb.2017060500371027.jpg",
            "Comment": "June, 2017",
            "IsEnabled": true,
            "IsVideo": false,
            "IsFeaturedItem": false,
            "IsExternalResource": false,
            "User": {
                "ID": 15665,
                "Username": "cdnjay"
            },
            "DateCreated": "2017-06-05T00:37:00Z"
        }
    ],
    "IsRecentlyVerified": false,
    "ID": 15432,
    "UUID": "266313F9-15A9-4F35-BD8D-F7181C534B14",
    "DataProviderID": 1,
    "OperatorID": 51,
    "UsageTypeID": 0,
    "UsageCost": "Free",
    "AddressInfo": {
        "ID": 15778,
        "Title": "Hotel Delta Bessborough",
        "AddressLine1": "601 Spadina Crescent East",
        "AddressLine2": "",
        "Town": "Saskatoon",
        "StateOrProvince": "SK ",
        "Postcode": "S7K 3G8",
        "CountryID": 44,
        "Latitude": 52.1262961,
        "Longitude": -106.65939349999996,
        "ContactTelephone1": "+1 306-244-5521",
        "ContactTelephone2": " 888-890-3222",
        "ContactEmail": "",
        "AccessComments": "",
        "RelatedURL": "https://www.deltahotels.com/Hotels/Delta-Bessborough-Hotel",
        "DistanceUnit": 0
    },
    "Connections": [
        {
            "ID": 13741,
            "ConnectionTypeID": 1,
            "StatusTypeID": 0,
            "LevelID": 2,
            "Amps": 32,
            "Voltage": 240,
            "PowerKW": 7.7,
            "Quantity": 1
        }
    ],
    "NumberOfPoints": 1,
    "GeneralComments": "",
    "StatusTypeID": 50,
    "DateLastStatusUpdate": "2017-06-05T00:37:00Z",
    "DataQualityLevel": 1,
    "DateCreated": "2013-01-09T18:13:00Z",
    "SubmissionStatusTypeID": 200
}