{
    "IsRecentlyVerified": false,
    "ID": 123526,
    "UUID": "817A2B2F-BA2E-48F7-A2B6-8554622A013F",
    "DataProviderID": 2,
    "DataProvidersReference": "85583",
    "UsageTypeID": 1,
    "AddressInfo": {
        "ID": 123872,
        "Title": "City of Orange Cove - City Hall",
        "AddressLine1": "633 6th St",
        "Town": "Orange Cove",
        "StateOrProvince": "CA",
        "Postcode": "93646",
        "CountryID": 2,
        "Latitude": 36.623959,
        "Longitude": -119.312389,
        "ContactTelephone1": "559-891-2200 x3403",
        "AccessComments": "8am-5pm daily; maximum session time of 3 hours",
        "RelatedURL": "",
        "DistanceUnit": 0
    },
    "Connections": [
        {
            "ID": 173521,
            "ConnectionTypeID": 1,
            "LevelID": 2,
            "Amps": 16,
            "Voltage": 230,
            "PowerKW": 3.7,
            "CurrentTypeID": 10,
            "Quantity": 1
        }
    ],
    "DateLastStatusUpdate": "2020-06-26T02:58:00Z",
    "DataQualityLevel": 3,
    "DateCreated": "2019-04-06T05:03:00Z",
    "SubmissionStatusTypeID": 100
}