{
    "IsRecentlyVerified": false,
    "ID": 113108,
    "UUID": "21FFFC50-BA22-42B1-A6F7-CC64449AA521",
    "DataProviderID": 2,
    "DataProvidersReference": "104716",
    "OperatorID": 5,
    "UsageTypeID": 1,
    "AddressInfo": {
        "ID": 113454,
        "Title": "OHIO STATE UNV",
        "AddressLine1": "630 Trumbull Ct",
        "Town": "Columbus",
        "StateOrProvince": "OH",
        "Postcode": "43210",
        "CountryID": 2,
        "Latitude": 40.014371,
        "Longitude": -83.027077,
        "ContactTelephone1": "888-758-4389",
        "AccessComments": "24 hours daily",
        "RelatedURL": "http://www.chargepoint.com/",
        "DistanceUnit": 0
    },
    "Connections": [
        {
            "ID": 159276,
            "ConnectionTypeID": 1,
            "LevelID": 2,
            "Amps": 16,
            "Voltage": 230,
            "PowerKW": 3.7,
            "CurrentTypeID": 10,
            "Quantity": 5
        }
    ],
    "DateLastStatusUpdate": "2020-06-26T03:02:00Z",
    "DataQualityLevel": 3,
    "DateCreated": "2018-11-28T02:04:00Z",
    "SubmissionStatusTypeID": 100
}