{
    "IsRecentlyVerified": false,
    "ID": 136871,
    "UUID": "516751E9-30B1-4724-ADC3-3E511421CA99",
    "DataProviderID": 1,
    "OperatorID": 3,
    "OperatorsReference": "PG-70259,PG-85050",
    "UsageTypeID": 4,
    "UsageCost": "Free",
    "AddressInfo": {
        "ID": 137217,
        "Title": "Tesco Extra - Newton Aycliffe",
        "AddressLine1": " Greenwell Road",
        "Town": "Newton Aycliffe",
        "StateOrProvince": "England",
        "Postcode": "DL5 4DH",
        "CountryID": 1,
        "Latitude": 54.6219802106544,
        "Longitude": -1.56781535214839,
        "AccessComments": "Mon-Sat 6am-Midnight, Sun 10am-4pm *3HRS MAX PARKING - ANPR £70 FINE*",
        "RelatedURL": "https://pod-point.com/",
        "DistanceUnit": 0
    },
    "Connections": [
        {
            "ID": 191539,
            "ConnectionTypeID": 25,
            "Reference": "0",
            "StatusTypeID": 50,
            "LevelID": 2,
            "Amps": 32,
            "Voltage": 230,
            "PowerKW": 7,
            "CurrentTypeID": 10,
            "Quantity": 4
        }
    ],
    "NumberOfPoints": 4,
    "StatusTypeID": 50,
    "DateLastStatusUpdate": "2021-03-15T06:33:00Z",
    "MetadataValues": [
        {
            "ID": 6723,
            "MetadataFieldID": 4,
            "ItemValue": "Contains public sector information licensed under the Open Government Licence v2.0. http://www.nationalarchives.gov.uk/doc/open-government-licence/version/2/"
        }
    ],
    "DataQualityLevel": 3,
    "DateCreated": "2019-12-24T05:23:00Z",
    "SubmissionStatusTypeID": 100
}