{
    "UserComments": [
        {
            "ID": 14662,
            "ChargePointID": 31328,
            "CommentTypeID": 10,
            "UserName": "Simon Hewison",
            "Comment": "Pod-Point report that they've upgraded this to a new model, and claim to be 7kW. ",
            "RelatedURL": "https://twitter.com/POD_Point/status/806819084373544960",
            "DateCreated": "2016-12-09T12:08:56.543Z",
            "User": {
                "ID": 4575,
                "Username": "Simon Hewison"
            },
            "CheckinStatusTypeID": 0
        },
        {
            "ID": 4227,
            "ChargePointID": 31328,
            "CommentTypeID": 50,
            "UserName": "",
            "Comment": "Only powered at 16A therefore not capable of delivering 7kW as advertised. (info from PodPoint). May be upgraded at some point in the future. Take note - these are SLOW.",
            "Rating": 3,
            "DateCreated": "2015-04-13T19:48:42.233Z",
            "CheckinStatusTypeID": 10
        }
    ],
    "IsRecentlyVerified": false,
    "ID": 31328,
    "UUID": "D6C52374-C5C0-424C-B822-B567A0AA9215",
    "DataProviderID": 1,
    "OperatorID": 3,
    "OperatorsReference": "PG-80684",
    "UsageTypeID": 4,
    "UsageCost": "1",
    "AddressInfo": {
        "ID": 31674,
        "Title": "Sainsburys Superstore Rustington",
        "AddressLine1": "Rustington Retail Park",
        "AddressLine2": "New Road",
        "Town": "Rustington",
        "StateOrProvince": "West Sussex",
        "Postcode": "BN16 3RT",
        "CountryID": 1,
        "Latitude": 50.8177276417065,
        "Longitude": -0.496444353731482,
        "DistanceUnit": 0
    },
    "Connections": [
        {
            "ID": 34744,
            "ConnectionTypeID": 25,
            "StatusTypeID": 50,
            "LevelID": 2,
            "Amps": 32,
            "Voltage": 230,
            "PowerKW": 7,
            "CurrentTypeID": 10,
            "Quantity": 2
        }
    ],
    "NumberOfPoints": 2,
    "StatusTypeID": 50,
    "DateLastStatusUpdate": "2021-03-04T06:21:00Z",
    "DataQualityLevel": 1,
    "DateCreated": "2015-01-03T10:46:00Z",
    "SubmissionStatusTypeID": 200
}