{
    "IsRecentlyVerified": false,
    "ID": 187699,
    "UUID": "FF0CC617-16E2-4E33-A40E-464E87A23DA3",
    "DataProviderID": 18,
    "DataProvidersReference": "fa18eb058670acd86dd276f1d863367e",
    "OperatorID": 2244,
    "UsageTypeID": 5,
    "AddressInfo": {
        "ID": 188058,
        "Title": "13 Vincent Square",
        "AddressLine1": "13 Vincent Square",
        "Town": "London",
        "Postcode": "SW1P 2LX",
        "CountryID": 1,
        "Latitude": 51.49312,
        "Longitude": -0.133628,
        "AccessComments": "",
        "RelatedURL": "https://www.ubitricity.com",
        "DistanceUnit": 0
    },
    "Connections": [
        {
            "ID": 302936,
            "ConnectionTypeID": 25,
            "Reference": "suby1100007812",
            "StatusTypeID": 50,
            "LevelID": 2,
            "Amps": 16,
            "Voltage": 230,
            "PowerKW": 3.7,
            "CurrentTypeID": 10
        }
    ],
    "StatusTypeID": 0,
    "DateLastStatusUpdate": "2021-07-12T03:38:00Z",
    "MetadataValues": [
        {
            "ID": 19939,
            "MetadataFieldID": 4,
            "ItemValue": "Contains public sector information licensed under the Open Government Licence v2.0. http://www.nationalarchives.gov.uk/doc/open-government-licence/version/2/"
        }
    ],
    "DataQualityLevel": 3,
    "DateCreated": "2021-07-12T03:38:00Z",
    "SubmissionStatusTypeID": 100
}