{
    "IsRecentlyVerified": false,
    "ID": 48102,
    "UUID": "BFEE1144-A1C4-44B3-9249-465B5BB6567C",
    "DataProviderID": 2,
    "DataProvidersReference": "67659",
    "OperatorID": 5,
    "UsageTypeID": 1,
    "AddressInfo": {
        "ID": 48448,
        "Title": "TANGERMBHWY501",
        "AddressLine1": "4620 Factory Stores Blvd",
        "Town": "Myrtle Beach",
        "StateOrProvince": "SC",
        "Postcode": "29579",
        "CountryID": 2,
        "Latitude": 33.750666,
        "Longitude": -78.957168,
        "ContactTelephone1": "888-758-4389",
        "AccessComments": "24 hours daily",
        "RelatedURL": "http://www.chargepoint.com/",
        "DistanceUnit": 0
    },
    "Connections": [
        {
            "ID": 59467,
            "ConnectionTypeID": 1,
            "LevelID": 2,
            "Amps": 16,
            "Voltage": 230,
            "PowerKW": 3.7,
            "CurrentTypeID": 10,
            "Quantity": 4
        }
    ],
    "DateLastStatusUpdate": "2020-06-26T02:56:00Z",
    "DataQualityLevel": 3,
    "DateCreated": "2015-06-24T11:44:00Z",
    "SubmissionStatusTypeID": 100
}