{
    "IsRecentlyVerified": false,
    "ID": 138912,
    "UUID": "DB2996AB-DA80-4611-8216-48AD0CA52A64",
    "DataProviderID": 2,
    "DataProvidersReference": "143624",
    "OperatorID": 5,
    "UsageTypeID": 1,
    "AddressInfo": {
        "ID": 139264,
        "Title": "ELEVATE",
        "AddressLine1": "6023 Innovation Way",
        "Town": "Carlsbad",
        "StateOrProvince": "CA",
        "Postcode": "92009",
        "CountryID": 2,
        "Latitude": 33.127753,
        "Longitude": -117.259498,
        "ContactTelephone1": "888-758-4389",
        "AccessComments": "24 hours daily",
        "RelatedURL": "http://www.chargepoint.com/",
        "DistanceUnit": 0
    },
    "Connections": [
        {
            "ID": 194141,
            "ConnectionTypeID": 1,
            "LevelID": 2,
            "Amps": 16,
            "Voltage": 230,
            "PowerKW": 3,
            "CurrentTypeID": 10,
            "Quantity": 7
        }
    ],
    "StatusTypeID": 50,
    "DateLastStatusUpdate": "2019-12-24T09:09:00Z",
    "DataQualityLevel": 3,
    "DateCreated": "2019-12-24T09:09:00Z",
    "SubmissionStatusTypeID": 100
}