{
    "IsRecentlyVerified": false,
    "ID": 134531,
    "UUID": "BDE69121-2DA8-412D-9DB6-A056B29998EF",
    "DataProviderID": 1,
    "OperatorID": 3357,
    "OperatorsReference": "UC1NV9,UC1HVP",
    "UsageTypeID": 4,
    "UsageCost": "£0.29/kWh",
    "AddressInfo": {
        "ID": 134877,
        "Title": "Lockhurst Lane",
        "AddressLine1": "Lockhurst Lane",
        "AddressLine2": "Foleshill",
        "Town": "Coventry",
        "StateOrProvince": "West Midlands Combined Authority",
        "Postcode": "CV6 5NY",
        "CountryID": 1,
        "Latitude": 52.42903105344388,
        "Longitude": -1.5029520220576842,
        "DistanceUnit": 0
    },
    "Connections": [
        {
            "ID": 188296,
            "ConnectionTypeID": 2,
            "StatusTypeID": 50,
            "LevelID": 3,
            "PowerKW": 50,
            "CurrentTypeID": 30,
            "Quantity": 2
        },
        {
            "ID": 188297,
            "ConnectionTypeID": 33,
            "StatusTypeID": 50,
            "LevelID": 3,
            "PowerKW": 50,
            "CurrentTypeID": 30,
            "Quantity": 2
        },
        {
            "ID": 188298,
            "ConnectionTypeID": 1036,
            "StatusTypeID": 50,
            "LevelID": 3,
            "Amps": 63,
            "Voltage": 400,
            "PowerKW": 43,
            "CurrentTypeID": 20,
            "Quantity": 2
        }
    ],
    "NumberOfPoints": 2,
    "StatusTypeID": 50,
    "DateLastStatusUpdate": "2019-11-18T14:56:00Z",
    "DataQualityLevel": 1,
    "DateCreated": "2019-11-18T09:48:00Z",
    "SubmissionStatusTypeID": 200
}