{
    "IsRecentlyVerified": false,
    "ID": 177495,
    "UUID": "8C133322-A57D-44F0-B101-10204C0ABADE",
    "DataProviderID": 29,
    "DataProvidersReference": "15656",
    "AddressInfo": {
        "ID": 177854,
        "Title": "Parkplatz Jahnstraße geg. Jahnstr. 29",
        "AddressLine1": "Parkplatz Jahnstraße geg. Jahnstr. 29",
        "Town": "Radevormwald",
        "Postcode": "42477",
        "CountryID": 87,
        "Latitude": 51.20958,
        "Longitude": 7.35587,
        "DistanceUnit": 0
    },
    "Connections": [
        {
            "ID": 276691,
            "ConnectionTypeID": 25,
            "StatusTypeID": 50,
            "LevelID": 2,
            "PowerKW": 22,
            "CurrentTypeID": 20
        },
        {
            "ID": 276692,
            "ConnectionTypeID": 25,
            "StatusTypeID": 50,
            "LevelID": 2,
            "PowerKW": 22,
            "CurrentTypeID": 20
        }
    ],
    "StatusTypeID": 0,
    "DateLastStatusUpdate": "2021-07-12T02:46:00Z",
    "MetadataValues": [
        {
            "ID": 9789,
            "MetadataFieldID": 4,
            "ItemValue": "Data from the German chargepoint registry provided by Bundesnetzagentur.de under the CC-BY 4.0 license"
        }
    ],
    "DataQualityLevel": 3,
    "DateCreated": "2021-07-08T09:49:00Z",
    "SubmissionStatusTypeID": 100
}