{
    "IsRecentlyVerified": false,
    "ID": 154426,
    "UUID": "C5DE51D3-6F89-4594-B92D-0820D3B5FAF1",
    "DataProviderID": 28,
    "DataProvidersReference": "FR*SOD*P*SDE7*53*_*_*_",
    "OperatorID": 3262,
    "UsageTypeID": 5,
    "AddressInfo": {
        "ID": 154779,
        "Title": "Biville sur Mer",
        "AddressLine1": "Avenue de l'Europe",
        "CountryID": 80,
        "Latitude": 49.896453,
        "Longitude": 1.265101,
        "AccessComments": "24/24 7/7",
        "DistanceUnit": 0
    },
    "Connections": [
        {
            "ID": 217158,
            "ConnectionTypeID": 28,
            "StatusTypeID": 50,
            "LevelID": 2,
            "PowerKW": 22,
            "CurrentTypeID": 10
        },
        {
            "ID": 217159,
            "ConnectionTypeID": 1036,
            "StatusTypeID": 50,
            "LevelID": 2,
            "PowerKW": 22,
            "CurrentTypeID": 20
        }
    ],
    "GeneralComments": "RFID et application",
    "StatusTypeID": 50,
    "DateLastStatusUpdate": "2020-08-27T05:16:00Z",
    "DataQualityLevel": 2,
    "DateCreated": "2020-03-15T10:55:00Z",
    "SubmissionStatusTypeID": 100
}