{
    "MediaItems": [
        {
            "ID": 20394,
            "ChargePointID": 106114,
            "ItemURL": "https://s3-ap-southeast-2.amazonaws.com/openchargemap/images/CH/OCM106114/OCM-106114.orig.2019111816222747.jpg",
            "ItemThumbnailURL": "https://s3-ap-southeast-2.amazonaws.com/openchargemap/images/CH/OCM106114/OCM-106114.thmb.2019111816222747.jpg",
            "Comment": "",
            "IsEnabled": true,
            "IsVideo": false,
            "IsFeaturedItem": false,
            "IsExternalResource": false,
            "User": {
                "ID": 22944,
                "Username": "Zero"
            },
            "DateCreated": "2019-11-18T16:23:00Z"
        }
    ],
    "IsRecentlyVerified": false,
    "ID": 106114,
    "UUID": "907E54F2-9EE9-4F23-9A47-4EC490EB3D9C",
    "DataProviderID": 1,
    "OperatorID": 3280,
    "UsageTypeID": 4,
    "AddressInfo": {
        "ID": 106460,
        "Title": " IN LAIN Hotel Cadonau",
        "AddressLine1": "Crusch Plantaun",
        "Town": "Brail",
        "StateOrProvince": "Regione Engiadina Bassa",
        "Postcode": "7527",
        "CountryID": 217,
        "Latitude": 46.652732009219854,
        "Longitude": 10.032353703741023,
        "RelatedURL": "http://www.inlain.ch/en/",
        "DistanceUnit": 0
    },
    "Connections": [
        {
            "ID": 149439,
            "ConnectionTypeID": 25,
            "StatusTypeID": 50,
            "LevelID": 2,
            "Amps": 32,
            "Voltage": 400,
            "PowerKW": 22,
            "CurrentTypeID": 20,
            "Quantity": 2
        }
    ],
    "NumberOfPoints": 2,
    "StatusTypeID": 50,
    "DateLastStatusUpdate": "2019-11-18T16:23:00Z",
    "DataQualityLevel": 1,
    "DateCreated": "2018-06-15T14:57:00Z",
    "SubmissionStatusTypeID": 200
}