{
    "IsRecentlyVerified": false,
    "ID": 179397,
    "UUID": "EBD796BE-61DA-4768-BCA2-7F4A50E63322",
    "DataProviderID": 29,
    "DataProvidersReference": "824",
    "OperatorID": 86,
    "AddressInfo": {
        "ID": 179756,
        "Title": "Coubronplatz 1",
        "AddressLine1": "Coubronplatz 1",
        "Town": "Berkheim",
        "Postcode": "88450",
        "CountryID": 87,
        "Latitude": 48.042221,
        "Longitude": 10.081933,
        "DistanceUnit": 0
    },
    "Connections": [
        {
            "ID": 281169,
            "ConnectionTypeID": 28,
            "StatusTypeID": 50,
            "LevelID": 2,
            "PowerKW": 22,
            "CurrentTypeID": 20
        },
        {
            "ID": 281170,
            "ConnectionTypeID": 25,
            "StatusTypeID": 50,
            "LevelID": 2,
            "PowerKW": 22,
            "CurrentTypeID": 20
        },
        {
            "ID": 295472,
            "ConnectionTypeID": 28,
            "StatusTypeID": 50,
            "LevelID": 2,
            "PowerKW": 22,
            "CurrentTypeID": 20
        },
        {
            "ID": 295473,
            "ConnectionTypeID": 25,
            "StatusTypeID": 50,
            "LevelID": 2,
            "PowerKW": 22,
            "CurrentTypeID": 20
        }
    ],
    "StatusTypeID": 50,
    "DateLastStatusUpdate": "2021-07-12T02:40:00Z",
    "MetadataValues": [
        {
            "ID": 11691,
            "MetadataFieldID": 4,
            "ItemValue": "Data from the German chargepoint registry provided by Bundesnetzagentur.de under the CC-BY 4.0 license"
        }
    ],
    "DataQualityLevel": 3,
    "DateCreated": "2021-07-08T09:59:00Z",
    "SubmissionStatusTypeID": 100
}