{
    "IsRecentlyVerified": false,
    "ID": 158030,
    "UUID": "EA7DFFEC-411A-4FC5-A469-20C9E8B477F8",
    "DataProviderID": 1,
    "OperatorID": 8,
    "UsageTypeID": 4,
    "UsageCost": "Contactless payment = £0.30 kWh  £1.50 minimum ",
    "AddressInfo": {
        "ID": 158384,
        "Title": "The Oak and Acorn",
        "AddressLine1": "Danebridge Cres",
        "Town": "Derby",
        "StateOrProvince": "England",
        "Postcode": " DE21 2HT",
        "CountryID": 1,
        "Latitude": 52.94142983429097,
        "Longitude": -1.4313807750320393,
        "RelatedURL": "https://network.bppulse.co.uk/",
        "DistanceUnit": 0
    },
    "Connections": [
        {
            "ID": 227809,
            "ConnectionTypeID": 2,
            "Reference": "1",
            "StatusTypeID": 50,
            "LevelID": 3,
            "Amps": 125,
            "Voltage": 400,
            "PowerKW": 50,
            "CurrentTypeID": 30,
            "Quantity": 1
        },
        {
            "ID": 227810,
            "ConnectionTypeID": 33,
            "Reference": "2",
            "StatusTypeID": 50,
            "LevelID": 3,
            "Amps": 125,
            "Voltage": 400,
            "PowerKW": 50,
            "CurrentTypeID": 30,
            "Quantity": 1
        },
        {
            "ID": 263912,
            "ConnectionTypeID": 1036,
            "StatusTypeID": 50,
            "LevelID": 3,
            "PowerKW": 43,
            "CurrentTypeID": 20,
            "Quantity": 1
        }
    ],
    "GeneralComments": "Please note that an overstay fee of £10 per hour after 90 minutes stay applies to this site.",
    "StatusTypeID": 50,
    "DateLastStatusUpdate": "2021-02-09T19:04:00Z",
    "MetadataValues": [
        {
            "ID": 7563,
            "MetadataFieldID": 4,
            "ItemValue": "Contains public sector information licensed under the Open Government Licence v2.0. http://www.nationalarchives.gov.uk/doc/open-government-licence/version/2/"
        }
    ],
    "DataQualityLevel": 3,
    "DateCreated": "2020-06-25T10:00:00Z",
    "SubmissionStatusTypeID": 100
}