{
    "IsRecentlyVerified": false,
    "ID": 186879,
    "UUID": "6ADC389B-ECCB-4357-B820-C9D71D459977",
    "DataProviderID": 29,
    "DataProvidersReference": "16138",
    "OperatorID": 121,
    "AddressInfo": {
        "ID": 187238,
        "Title": "Wegsfeld (Davenstedter Markt)",
        "AddressLine1": "Wegsfeld (Davenstedter Markt)",
        "Town": "Hannover",
        "Postcode": "30445",
        "CountryID": 87,
        "Latitude": 52.36324,
        "Longitude": 9.67388,
        "DistanceUnit": 0
    },
    "Connections": [
        {
            "ID": 300454,
            "ConnectionTypeID": 25,
            "StatusTypeID": 50,
            "LevelID": 2,
            "PowerKW": 22,
            "CurrentTypeID": 20
        },
        {
            "ID": 300455,
            "ConnectionTypeID": 25,
            "StatusTypeID": 50,
            "LevelID": 2,
            "PowerKW": 22,
            "CurrentTypeID": 20
        }
    ],
    "StatusTypeID": 50,
    "DateLastStatusUpdate": "2021-07-12T02:49:00Z",
    "MetadataValues": [
        {
            "ID": 19119,
            "MetadataFieldID": 4,
            "ItemValue": "Data from the German chargepoint registry provided by Bundesnetzagentur.de under the CC-BY 4.0 license"
        }
    ],
    "DataQualityLevel": 3,
    "DateCreated": "2021-07-12T02:49:00Z",
    "SubmissionStatusTypeID": 100
}