{
    "IsRecentlyVerified": false,
    "ID": 124438,
    "UUID": "8973C34B-89B6-44CD-8B0F-05CDF4A7B08C",
    "DataProviderID": 2,
    "DataProvidersReference": "42974",
    "OperatorID": 39,
    "UsageTypeID": 4,
    "AddressInfo": {
        "ID": 124784,
        "Title": "Walgreens - Santa Rosa, CA #3297",
        "AddressLine1": "3093 Marlow Rd",
        "Town": "Santa Rosa",
        "StateOrProvince": "CA",
        "Postcode": "95403",
        "CountryID": 2,
        "Latitude": 38.4661834,
        "Longitude": -122.7512085,
        "ContactTelephone1": "800-663-5633",
        "AccessComments": "MO: Not Specified; TU: Not Specified; WE: Not Specified; TH: Not Specified; FR: Not Specified; SA: Not Specified; SU: Not Specified",
        "RelatedURL": "http://www.semacharge.com/",
        "DistanceUnit": 0
    },
    "Connections": [
        {
            "ID": 174536,
            "ConnectionTypeID": 1,
            "LevelID": 2,
            "Amps": 16,
            "Voltage": 230,
            "PowerKW": 3,
            "CurrentTypeID": 10,
            "Quantity": 1
        }
    ],
    "DateLastStatusUpdate": "2019-04-06T05:03:00Z",
    "DataQualityLevel": 3,
    "DateCreated": "2019-04-06T05:03:00Z",
    "SubmissionStatusTypeID": 100
}