{
    "IsRecentlyVerified": false,
    "ID": 113052,
    "UUID": "6696B056-AA95-4672-AE64-FA6C6CA6337F",
    "DataProviderID": 2,
    "DataProvidersReference": "92291",
    "OperatorID": 5,
    "UsageTypeID": 1,
    "AddressInfo": {
        "ID": 113398,
        "Title": "MINETA",
        "AddressLine1": "1661 Airport Blvd",
        "Town": "San Jose",
        "StateOrProvince": "CA",
        "Postcode": "95110",
        "CountryID": 2,
        "Latitude": 37.357818,
        "Longitude": -121.917322,
        "ContactTelephone1": "888-758-4389",
        "AccessComments": "24 hours daily",
        "RelatedURL": "http://www.chargepoint.com/",
        "DistanceUnit": 0
    },
    "Connections": [
        {
            "ID": 159216,
            "ConnectionTypeID": 1,
            "LevelID": 2,
            "Amps": 16,
            "Voltage": 230,
            "PowerKW": 3,
            "CurrentTypeID": 10,
            "Quantity": 8
        }
    ],
    "DateLastStatusUpdate": "2019-04-06T04:02:00Z",
    "DataQualityLevel": 3,
    "DateCreated": "2018-11-28T02:04:00Z",
    "SubmissionStatusTypeID": 100
}