{
    "IsRecentlyVerified": false,
    "ID": 27736,
    "UUID": "B0B16D4F-1326-4F92-96FE-9387245DD354",
    "DataProviderID": 2,
    "DataProvidersReference": "53927",
    "UsageTypeID": 1,
    "AddressInfo": {
        "ID": 28082,
        "Title": "Solano County - Public Health",
        "AddressLine1": "1119 E Monte Vista",
        "Town": "Vacaville",
        "StateOrProvince": "CA",
        "Postcode": "95688",
        "CountryID": 2,
        "Latitude": 38.361235,
        "Longitude": -121.975962,
        "ContactTelephone1": "707-469-4670",
        "AccessComments": "24 hours daily",
        "RelatedURL": "",
        "DistanceUnit": 0
    },
    "Connections": [
        {
            "ID": 30439,
            "ConnectionTypeID": 1,
            "LevelID": 2,
            "Amps": 16,
            "Voltage": 230,
            "PowerKW": 3,
            "CurrentTypeID": 10,
            "Quantity": 2
        }
    ],
    "DateLastStatusUpdate": "2019-04-06T04:03:00Z",
    "DataQualityLevel": 3,
    "DateCreated": "2014-11-28T03:38:00Z",
    "SubmissionStatusTypeID": 100
}