{
    "MediaItems": [
        {
            "ID": 3133,
            "ChargePointID": 23098,
            "ItemURL": "https://s3-ap-southeast-2.amazonaws.com/openchargemap/images/IT/OCM23098/OCM-23098.orig.2015083015135540.jpg",
            "ItemThumbnailURL": "https://s3-ap-southeast-2.amazonaws.com/openchargemap/images/IT/OCM23098/OCM-23098.thmb.2015083015135540.jpg",
            "Comment": "",
            "IsEnabled": true,
            "IsVideo": false,
            "IsFeaturedItem": false,
            "IsExternalResource": false,
            "User": {
                "ID": 1606,
                "Username": "polianto"
            },
            "DateCreated": "2015-08-30T15:14:00Z"
        },
        {
            "ID": 3134,
            "ChargePointID": 23098,
            "ItemURL": "https://s3-ap-southeast-2.amazonaws.com/openchargemap/images/IT/OCM23098/OCM-23098.orig.2015083015141641.jpg",
            "ItemThumbnailURL": "https://s3-ap-southeast-2.amazonaws.com/openchargemap/images/IT/OCM23098/OCM-23098.thmb.2015083015141641.jpg",
            "Comment": "",
            "IsEnabled": true,
            "IsVideo": false,
            "IsFeaturedItem": false,
            "IsExternalResource": false,
            "User": {
                "ID": 1606,
                "Username": "polianto"
            },
            "DateCreated": "2015-08-30T15:14:00Z"
        }
    ],
    "IsRecentlyVerified": false,
    "ID": 23098,
    "UUID": "EEA70033-5B4B-438D-B77D-9960CAD4552B",
    "DataProviderID": 1,
    "UsageTypeID": 1,
    "UsageCost": "free",
    "AddressInfo": {
        "ID": 23443,
        "Title": "Loreto",
        "AddressLine1": "Via Sisto V",
        "Town": "Loreto",
        "StateOrProvince": "AN",
        "CountryID": 112,
        "Latitude": 43.4400753512969,
        "Longitude": 13.6065552341272,
        "ContactTelephone1": "071.7247.1",
        "ContactEmail": "danilo.salvi@gruppoastea.it",
        "AccessComments": "All'inizio della ZTL, di fronte alla freccia tricolore",
        "RelatedURL": "http://www.asteaenergia.it/",
        "DistanceUnit": 0
    },
    "Connections": [
        {
            "ID": 24806,
            "ConnectionTypeID": 36,
            "StatusTypeID": 50,
            "LevelID": 2,
            "Amps": 16,
            "Voltage": 240,
            "PowerKW": 3.4,
            "CurrentTypeID": 10,
            "Quantity": 1
        },
        {
            "ID": 83745,
            "ConnectionTypeID": 16,
            "StatusTypeID": 50,
            "LevelID": 2,
            "Amps": 16,
            "Voltage": 240,
            "PowerKW": 3.4,
            "CurrentTypeID": 10,
            "Quantity": 1
        }
    ],
    "NumberOfPoints": 1,
    "GeneralComments": "Prese tipo SCAME 3A",
    "StatusTypeID": 50,
    "DateLastStatusUpdate": "2016-04-06T09:56:00Z",
    "DataQualityLevel": 1,
    "DateCreated": "2014-04-12T15:16:00Z",
    "SubmissionStatusTypeID": 200
}