{
    "IsRecentlyVerified": false,
    "ID": 8045,
    "UUID": "176A73BF-8716-4DDC-94FB-F4782E970664",
    "DataProviderID": 15,
    "DataProvidersReference": "10693",
    "OperatorID": 31,
    "UsageTypeID": 1,
    "AddressInfo": {
        "ID": 7942,
        "Title": "120 W Edenton St.",
        "AddressLine1": "120 W Edenton St.",
        "Town": "Raleigh",
        "StateOrProvince": "NC",
        "Postcode": "27603",
        "CountryID": 2,
        "Latitude": 35.78133,
        "Longitude": -78.64107,
        "ContactTelephone1": "(919) 807-2408",
        "RelatedURL": "http://carstations.com/10693",
        "DistanceUnit": 0
    },
    "Connections": [
        {
            "ID": 5474,
            "ConnectionTypeID": 1,
            "Reference": "J1772",
            "LevelID": 2
        }
    ],
    "NumberOfPoints": 5,
    "StatusTypeID": 0,
    "DateLastStatusUpdate": "2017-11-04T14:04:00Z",
    "DataQualityLevel": 1,
    "DateCreated": "2011-11-11T12:05:00Z",
    "SubmissionStatusTypeID": 100
}