{
    "IsRecentlyVerified": false,
    "ID": 100725,
    "UUID": "1BFBA035-47CB-41CF-B589-B4AA198DBFDB",
    "DataProviderID": 1,
    "OperatorID": 1,
    "OperatorsReference": "0364",
    "UsageTypeID": 4,
    "UsageCost": "7,75€ por día",
    "AddressInfo": {
        "ID": 101071,
        "Title": "Carretera de Madrid",
        "AddressLine1": "Carretera de Madrid",
        "Town": "Ávila",
        "StateOrProvince": "Ávila",
        "Postcode": "05005",
        "CountryID": 210,
        "Latitude": 40.66210582871934,
        "Longitude": -4.712055687061856,
        "DistanceUnit": 0
    },
    "Connections": [
        {
            "ID": 142270,
            "ConnectionTypeID": 25,
            "StatusTypeID": 50,
            "LevelID": 2,
            "Amps": 20,
            "Voltage": 220,
            "PowerKW": 13,
            "Quantity": 1
        }
    ],
    "NumberOfPoints": 1,
    "StatusTypeID": 50,
    "DateLastStatusUpdate": "2018-12-29T16:49:00Z",
    "DataQualityLevel": 1,
    "DateCreated": "2018-03-08T07:22:00Z",
    "SubmissionStatusTypeID": 200
}