{
    "IsRecentlyVerified": false,
    "ID": 107868,
    "UUID": "F64CE2EF-BD04-46F6-B8EB-C8F339C84A6E",
    "DataProviderID": 1,
    "OperatorID": 46,
    "UsageTypeID": 4,
    "AddressInfo": {
        "ID": 108214,
        "Title": "Touristeninformation",
        "AddressLine1": "Im Tölletal",
        "Town": "Wolfshagen im Harz",
        "StateOrProvince": "Landkreis Goslar",
        "Postcode": "38685",
        "CountryID": 87,
        "Latitude": 51.910681288977386,
        "Longitude": 10.320400047256044,
        "AccessComments": "24/7 nutzbare grüne Avacon Ladesäule auf dem Parkplatz an der Touristeninformation",
        "RelatedURL": "https://www.avacon.de/de/ueber-uns/newsroom/pressemitteilungen/neue-stromtankstelle-in-wolfshagen-und-liebenburg.html",
        "DistanceUnit": 0
    },
    "Connections": [
        {
            "ID": 152324,
            "ConnectionTypeID": 25,
            "StatusTypeID": 50,
            "LevelID": 2,
            "Amps": 32,
            "Voltage": 400,
            "PowerKW": 22,
            "CurrentTypeID": 20,
            "Quantity": 2
        }
    ],
    "NumberOfPoints": 2,
    "StatusTypeID": 50,
    "DateLastStatusUpdate": "2018-08-15T06:22:00Z",
    "DataQualityLevel": 1,
    "DateCreated": "2018-08-15T06:22:00Z",
    "SubmissionStatusTypeID": 200
}