{
    "IsRecentlyVerified": false,
    "ID": 148054,
    "UUID": "1EC7C184-0F0B-4847-A849-4DB2ECBFECFF",
    "DataProviderID": 1,
    "OperatorID": 3315,
    "OperatorsReference": "52468,52469",
    "UsageTypeID": 4,
    "UsageCost": "Free",
    "AddressInfo": {
        "ID": 148406,
        "Title": "Isles of Glencoe Hotel, Ballachulish",
        "AddressLine1": "Glencoe",
        "Town": "Ballachulish",
        "Postcode": "PH49 4HL",
        "CountryID": 1,
        "Latitude": 56.67987,
        "Longitude": -5.13104,
        "DistanceUnit": 0
    },
    "Connections": [
        {
            "ID": 205548,
            "ConnectionTypeID": 25,
            "StatusTypeID": 50,
            "LevelID": 2,
            "Amps": 32,
            "Voltage": 400,
            "PowerKW": 22,
            "CurrentTypeID": 20,
            "Quantity": 4
        }
    ],
    "NumberOfPoints": 4,
    "StatusTypeID": 50,
    "DateLastStatusUpdate": "2020-01-26T06:14:00Z",
    "DataQualityLevel": 1,
    "DateCreated": "2020-01-24T06:25:00Z",
    "SubmissionStatusTypeID": 200
}