{
    "IsRecentlyVerified": false,
    "ID": 117964,
    "UUID": "6D9586B6-1F30-43DD-86C9-D620ECA94E38",
    "DataProviderID": 1,
    "OperatorID": 45,
    "UsageTypeID": 6,
    "AddressInfo": {
        "ID": 118310,
        "Title": "Wellness Hotel Lužan",
        "AddressLine1": "Lužické náměstí 212",
        "Town": "Rumburk",
        "StateOrProvince": "okres Děčín",
        "Postcode": "40801",
        "CountryID": 64,
        "Latitude": 50.9510450955315,
        "Longitude": 14.5583894593103,
        "ContactTelephone1": "+420602111777",
        "ContactEmail": "info@hotelluzan.cz",
        "RelatedURL": "http://www.hotelluzan.cz",
        "DistanceUnit": 0
    },
    "Connections": [
        {
            "ID": 166975,
            "ConnectionTypeID": 17,
            "StatusTypeID": 50,
            "LevelID": 2,
            "Amps": 16,
            "Voltage": 400,
            "PowerKW": 11,
            "CurrentTypeID": 20,
            "Quantity": 1
        }
    ],
    "NumberOfPoints": 1,
    "GeneralComments": "For electric car owners, we offer the option to charge the vehicle via our 16-pole (red) 3-phase socket. You need an adapter that the hotel does not provide.\r\nWe recommend that you contact the hotel reception in advance at +420 602 111 777 or send an e-mail to info@hotelluzan.cz. ",
    "StatusTypeID": 50,
    "DateLastStatusUpdate": "2019-03-14T09:50:00Z",
    "DataQualityLevel": 1,
    "DateCreated": "2019-03-14T04:48:00Z",
    "SubmissionStatusTypeID": 200
}