{
    "IsRecentlyVerified": false,
    "ID": 52141,
    "UUID": "5B2420E7-549F-493D-976E-33B72BC01C1F",
    "DataProviderID": 1,
    "OperatorID": 1,
    "UsageTypeID": 4,
    "AddressInfo": {
        "ID": 52487,
        "Title": "Hotel/Restaurant Sol i Vi",
        "AddressLine1": "C-243a km. 4, 08739 Lavern, Barcelona, España",
        "Town": "Barcelona",
        "StateOrProvince": "Barcelona",
        "Postcode": "08739",
        "CountryID": 210,
        "Latitude": 41.4018130926627,
        "Longitude": 1.75765411586919,
        "ContactTelephone1": "938993204",
        "ContactEmail": "info@solivi.com",
        "AccessComments": "Tarjeta metropolitana de Barcelona",
        "RelatedURL": "http://www.solivi.com/",
        "DistanceUnit": 0
    },
    "Connections": [
        {
            "ID": 64683,
            "ConnectionTypeID": 25,
            "StatusTypeID": 50,
            "Quantity": 1
        },
        {
            "ID": 64684,
            "ConnectionTypeID": 28,
            "StatusTypeID": 50,
            "Quantity": 1
        }
    ],
    "NumberOfPoints": 2,
    "StatusTypeID": 50,
    "DateLastStatusUpdate": "2015-09-04T19:37:00Z",
    "DataQualityLevel": 1,
    "DateCreated": "2015-08-19T19:53:00Z",
    "SubmissionStatusTypeID": 200
}