{
    "IsRecentlyVerified": false,
    "ID": 185353,
    "UUID": "67467EA7-F49E-4291-BEA7-0A6BA47867D2",
    "DataProviderID": 29,
    "DataProvidersReference": "5344,19571",
    "AddressInfo": {
        "ID": 185712,
        "Title": "Fritz-Thiedemann-Ring 20",
        "AddressLine1": "Fritz-Thiedemann-Ring 20",
        "Town": "Heide",
        "Postcode": "25746",
        "CountryID": 87,
        "Latitude": 54.195946,
        "Longitude": 9.121534,
        "DistanceUnit": 0
    },
    "Connections": [
        {
            "ID": 294735,
            "ConnectionTypeID": 25,
            "StatusTypeID": 50,
            "LevelID": 2,
            "PowerKW": 22,
            "CurrentTypeID": 20
        },
        {
            "ID": 294736,
            "ConnectionTypeID": 25,
            "StatusTypeID": 50,
            "LevelID": 2,
            "PowerKW": 22,
            "CurrentTypeID": 20
        },
        {
            "ID": 294737,
            "ConnectionTypeID": 25,
            "StatusTypeID": 50,
            "LevelID": 2,
            "PowerKW": 22,
            "CurrentTypeID": 20
        },
        {
            "ID": 294738,
            "ConnectionTypeID": 25,
            "StatusTypeID": 50,
            "LevelID": 2,
            "PowerKW": 22,
            "CurrentTypeID": 20
        }
    ],
    "StatusTypeID": 50,
    "DateLastStatusUpdate": "2021-07-09T03:30:00Z",
    "MetadataValues": [
        {
            "ID": 17644,
            "MetadataFieldID": 4,
            "ItemValue": "Data from the German chargepoint registry provided by Bundesnetzagentur.de under the CC-BY 4.0 license"
        }
    ],
    "DataQualityLevel": 3,
    "DateCreated": "2021-07-08T10:06:00Z",
    "SubmissionStatusTypeID": 100
}