{
    "UserComments": [
        {
            "ID": 20926,
            "ChargePointID": 117856,
            "CommentTypeID": 10,
            "UserName": "ForumElettrico.it",
            "RelatedURL": "https://www.forumelettrico.it/forum/colonnina-enel-x-22-kw-savignano-sul-panaro-mo-via-dell-artigianato-395-di-garofano-t5448.html",
            "DateCreated": "2019-04-25T16:36:18.117Z",
            "User": {
                "ID": 11749,
                "Username": "ForumElettrico.it"
            },
            "CheckinStatusTypeID": 10
        }
    ],
    "MediaItems": [
        {
            "ID": 18155,
            "ChargePointID": 117856,
            "ItemURL": "https://s3-ap-southeast-2.amazonaws.com/openchargemap/images/IT/OCM117856/OCM-117856.orig.2019042516363323.jpg",
            "ItemThumbnailURL": "https://s3-ap-southeast-2.amazonaws.com/openchargemap/images/IT/OCM117856/OCM-117856.thmb.2019042516363323.jpg",
            "Comment": "",
            "IsEnabled": true,
            "IsVideo": false,
            "IsFeaturedItem": false,
            "IsExternalResource": false,
            "User": {
                "ID": 11749,
                "Username": "ForumElettrico.it"
            },
            "DateCreated": "2019-04-25T16:37:00Z"
        },
        {
            "ID": 18156,
            "ChargePointID": 117856,
            "ItemURL": "https://s3-ap-southeast-2.amazonaws.com/openchargemap/images/IT/OCM117856/OCM-117856.orig.2019042516363979.jpg",
            "ItemThumbnailURL": "https://s3-ap-southeast-2.amazonaws.com/openchargemap/images/IT/OCM117856/OCM-117856.thmb.2019042516363979.jpg",
            "Comment": "",
            "IsEnabled": true,
            "IsVideo": false,
            "IsFeaturedItem": false,
            "IsExternalResource": false,
            "User": {
                "ID": 11749,
                "Username": "ForumElettrico.it"
            },
            "DateCreated": "2019-04-25T16:37:00Z"
        },
        {
            "ID": 18157,
            "ChargePointID": 117856,
            "ItemURL": "https://s3-ap-southeast-2.amazonaws.com/openchargemap/images/IT/OCM117856/OCM-117856.orig.2019042516364670.jpg",
            "ItemThumbnailURL": "https://s3-ap-southeast-2.amazonaws.com/openchargemap/images/IT/OCM117856/OCM-117856.thmb.2019042516364670.jpg",
            "Comment": "",
            "IsEnabled": true,
            "IsVideo": false,
            "IsFeaturedItem": false,
            "IsExternalResource": false,
            "User": {
                "ID": 11749,
                "Username": "ForumElettrico.it"
            },
            "DateCreated": "2019-04-25T16:37:00Z"
        },
        {
            "ID": 18158,
            "ChargePointID": 117856,
            "ItemURL": "https://s3-ap-southeast-2.amazonaws.com/openchargemap/images/IT/OCM117856/OCM-117856.orig.2019042516365424.jpg",
            "ItemThumbnailURL": "https://s3-ap-southeast-2.amazonaws.com/openchargemap/images/IT/OCM117856/OCM-117856.thmb.2019042516365424.jpg",
            "Comment": "",
            "IsEnabled": true,
            "IsVideo": false,
            "IsFeaturedItem": false,
            "IsExternalResource": false,
            "User": {
                "ID": 11749,
                "Username": "ForumElettrico.it"
            },
            "DateCreated": "2019-04-25T16:37:00Z"
        }
    ],
    "IsRecentlyVerified": false,
    "ID": 117856,
    "UUID": "D3A5114B-85CA-40A2-AA74-3FEAB08DFBAD",
    "DataProviderID": 1,
    "OperatorID": 80,
    "UsageTypeID": 4,
    "AddressInfo": {
        "ID": 118202,
        "Title": "Savignano sul Panaro Artigianato | EnelX",
        "AddressLine1": "Via dell'Artigianato",
        "Town": "Savignano sul Panaro",
        "StateOrProvince": "MO",
        "Postcode": "41056",
        "CountryID": 112,
        "Latitude": 44.4604570826848,
        "Longitude": 10.9957942804222,
        "ContactTelephone1": "800.069.850",
        "RelatedURL": "https://www.enelx.com/it/it/emobility",
        "DistanceUnit": 0
    },
    "Connections": [
        {
            "ID": 166784,
            "ConnectionTypeID": 25,
            "StatusTypeID": 150,
            "LevelID": 2,
            "Amps": 32,
            "Voltage": 400,
            "PowerKW": 22,
            "CurrentTypeID": 20,
            "Quantity": 2
        }
    ],
    "NumberOfPoints": 2,
    "StatusTypeID": 50,
    "DateLastStatusUpdate": "2019-04-26T09:37:00Z",
    "DataQualityLevel": 1,
    "DateCreated": "2019-03-05T15:21:00Z",
    "SubmissionStatusTypeID": 200
}