{
    "UserComments": [
        {
            "ID": 24523,
            "ChargePointID": 148874,
            "CommentTypeID": 10,
            "UserName": "sdlra1",
            "Comment": "",
            "Rating": 4,
            "DateCreated": "2021-06-27T07:27:33.583Z",
            "User": {
                "ID": 6716,
                "Username": "sdlra1"
            },
            "CheckinStatusTypeID": 10,
            "IsActionedByEditor": false
        }
    ],
    "IsRecentlyVerified": false,
    "ID": 148874,
    "UUID": "0BE316F9-380F-4E9E-BDB8-C986F126EE8A",
    "DataProviderID": 1,
    "OperatorID": 3,
    "OperatorsReference": "PG-70211,PG-85402",
    "UsageTypeID": 4,
    "UsageCost": "Free",
    "AddressInfo": {
        "ID": 149226,
        "Title": "Tesco Superstore-Kinson",
        "AddressLine1": "1585 Wimborne Road",
        "Town": "Kinson",
        "Postcode": "BH10 7BB",
        "CountryID": 1,
        "Latitude": 50.769728,
        "Longitude": -1.899761,
        "DistanceUnit": 0
    },
    "Connections": [
        {
            "ID": 206734,
            "ConnectionTypeID": 25,
            "StatusTypeID": 50,
            "LevelID": 2,
            "Amps": 32,
            "Voltage": 400,
            "PowerKW": 22,
            "CurrentTypeID": 20,
            "Quantity": 2
        },
        {
            "ID": 269975,
            "ConnectionTypeID": 25,
            "StatusTypeID": 50,
            "LevelID": 2,
            "Amps": 32,
            "Voltage": 230,
            "PowerKW": 7,
            "CurrentTypeID": 10,
            "Quantity": 2
        }
    ],
    "NumberOfPoints": 4,
    "GeneralComments": "This is an open charge unit installed at the Tesco super store at Wimborne Road, Kinson",
    "StatusTypeID": 50,
    "DateLastStatusUpdate": "2021-06-27T07:28:00Z",
    "DataQualityLevel": 1,
    "DateCreated": "2020-02-12T06:32:00Z",
    "SubmissionStatusTypeID": 200
}