{
    "UserComments": [
        {
            "ID": 10087,
            "ChargePointID": 59149,
            "CommentTypeID": 10,
            "UserName": "stickybit",
            "Comment": "",
            "Rating": 5,
            "DateCreated": "2016-04-04T16:50:59.503Z",
            "User": {
                "ID": 6738,
                "Username": "stickybit"
            },
            "CheckinStatusTypeID": 10
        }
    ],
    "MediaItems": [
        {
            "ID": 6156,
            "ChargePointID": 59149,
            "ItemURL": "https://s3-ap-southeast-2.amazonaws.com/openchargemap/images/NL/OCM59149/OCM-59149.orig.2016040416511674.jpeg",
            "ItemThumbnailURL": "https://s3-ap-southeast-2.amazonaws.com/openchargemap/images/NL/OCM59149/OCM-59149.thmb.2016040416511674.jpeg",
            "Comment": "",
            "IsEnabled": true,
            "IsVideo": false,
            "IsFeaturedItem": false,
            "IsExternalResource": false,
            "User": {
                "ID": 6738,
                "Username": "stickybit"
            },
            "DateCreated": "2016-04-04T16:52:00Z"
        }
    ],
    "IsRecentlyVerified": false,
    "ID": 59149,
    "UUID": "06A1E6F7-A86B-45AE-B13F-2229BD70151F",
    "DataProviderID": 1,
    "OperatorID": 23,
    "OperatorsReference": "6704",
    "UsageTypeID": 4,
    "UsageCost": "€0.25/kWh; andere tarieven voor oudere auto's",
    "AddressInfo": {
        "ID": 59495,
        "Title": "Tesla Supercharger Zwolle",
        "AddressLine1": "Van der Valk Hotel Zwolle, Nieuwleusenerdijk 1",
        "Town": "Zwolle",
        "StateOrProvince": "Overijssel",
        "Postcode": "8028 PH",
        "CountryID": 159,
        "Latitude": 52.5322920549193,
        "Longitude": 6.15845918655396,
        "RelatedURL": "http://www.teslamotors.com",
        "DistanceUnit": 0
    },
    "Connections": [
        {
            "ID": 75090,
            "ConnectionTypeID": 27,
            "StatusTypeID": 50,
            "LevelID": 3,
            "Voltage": 400,
            "PowerKW": 120,
            "CurrentTypeID": 30,
            "Quantity": 24
        }
    ],
    "NumberOfPoints": 24,
    "GeneralComments": "Only available for Tesla owners",
    "StatusTypeID": 50,
    "DateLastStatusUpdate": "2020-11-18T06:47:00Z",
    "DataQualityLevel": 1,
    "DateCreated": "2016-01-09T00:02:00Z",
    "SubmissionStatusTypeID": 200
}