{
    "IsRecentlyVerified": false,
    "ID": 142613,
    "UUID": "27151A49-3E12-44B2-B532-AB44FC51E9E3",
    "DataProviderID": 2,
    "DataProvidersReference": "122632",
    "OperatorID": 5,
    "UsageTypeID": 1,
    "AddressInfo": {
        "ID": 142965,
        "Title": "SHELDON SUFFERN",
        "AddressLine1": "128 Orange Ave",
        "Town": "Suffern",
        "StateOrProvince": "NY",
        "Postcode": "10901",
        "CountryID": 2,
        "Latitude": 41.115126,
        "Longitude": -74.153754,
        "ContactTelephone1": "888-758-4389",
        "AccessComments": "24 hours daily",
        "RelatedURL": "http://www.chargepoint.com/",
        "DistanceUnit": 0
    },
    "Connections": [
        {
            "ID": 198785,
            "ConnectionTypeID": 1,
            "LevelID": 2,
            "Amps": 16,
            "Voltage": 230,
            "PowerKW": 3.7,
            "CurrentTypeID": 10,
            "Quantity": 4
        }
    ],
    "StatusTypeID": 50,
    "DateLastStatusUpdate": "2020-06-26T03:04:00Z",
    "DataQualityLevel": 3,
    "DateCreated": "2019-12-24T09:18:00Z",
    "SubmissionStatusTypeID": 100
}