{
    "IsRecentlyVerified": false,
    "ID": 135116,
    "UUID": "984D2621-4728-4903-897F-BD526CF09B3F",
    "DataProviderID": 1,
    "OperatorID": 3359,
    "UsageTypeID": 1,
    "AddressInfo": {
        "ID": 135462,
        "Title": "Veszprém ALDI, Kistó utca",
        "AddressLine1": "Kistó u. 4",
        "Town": "Veszprém",
        "CountryID": 104,
        "Latitude": 47.10672,
        "Longitude": 17.895559,
        "DistanceUnit": 0
    },
    "Connections": [
        {
            "ID": 189114,
            "ConnectionTypeID": 25,
            "StatusTypeID": 50,
            "LevelID": 2,
            "Amps": 32,
            "Voltage": 400,
            "PowerKW": 22,
            "CurrentTypeID": 20,
            "Quantity": 2
        }
    ],
    "NumberOfPoints": 2,
    "StatusTypeID": 50,
    "DateLastStatusUpdate": "2019-12-06T13:14:00Z",
    "DataQualityLevel": 1,
    "DateCreated": "2019-12-06T12:48:00Z",
    "SubmissionStatusTypeID": 200
}