{
    "IsRecentlyVerified": false,
    "ID": 79027,
    "UUID": "718D2278-DF42-40C4-B64D-BD31209B4439",
    "DataProviderID": 1,
    "OperatorID": 23,
    "OperatorsReference": "10537",
    "UsageTypeID": 6,
    "UsageCost": "Free",
    "AddressInfo": {
        "ID": 79373,
        "Title": "Fairview Mountain Golf",
        "AddressLine1": "933 Old Golf Course Road",
        "Town": "Oliver",
        "StateOrProvince": "BC",
        "Postcode": "V0H 1T0",
        "CountryID": 44,
        "Latitude": 49.164643,
        "Longitude": -119.593912,
        "ContactTelephone1": "(250) 809-1815",
        "DistanceUnit": 0
    },
    "Connections": [
        {
            "ID": 113646,
            "ConnectionTypeID": 30,
            "StatusTypeID": 50,
            "LevelID": 2,
            "PowerKW": 13,
            "CurrentTypeID": 20,
            "Quantity": 1
        }
    ],
    "NumberOfPoints": 1,
    "GeneralComments": "1 Tesla Connector, up to 13kW.Available for patrons only. Self park.",
    "StatusTypeID": 50,
    "DateLastStatusUpdate": "2017-01-26T19:07:00Z",
    "DataQualityLevel": 1,
    "DateCreated": "2017-01-26T19:07:00Z",
    "SubmissionStatusTypeID": 200
}