{
    "IsRecentlyVerified": false,
    "ID": 158127,
    "UUID": "5DFCDD9E-49EA-4B23-8D10-D49B5CDE94FF",
    "DataProviderID": 1,
    "OperatorID": 8,
    "UsageTypeID": 4,
    "AddressInfo": {
        "ID": 158481,
        "Title": "First On Scene Training",
        "AddressLine1": "82 Headingley Lane",
        "Town": "Leeds",
        "Postcode": "LS6 2DH",
        "CountryID": 1,
        "Latitude": 53.819513078358796,
        "Longitude": -1.5748266012790282,
        "AccessComments": "",
        "RelatedURL": "https://www.bpchargemaster.com",
        "DistanceUnit": 0
    },
    "Connections": [
        {
            "ID": 228007,
            "ConnectionTypeID": 25,
            "Reference": "1",
            "StatusTypeID": 50,
            "LevelID": 2,
            "Amps": 32,
            "Voltage": 230,
            "PowerKW": 7,
            "CurrentTypeID": 10,
            "Quantity": 2
        }
    ],
    "StatusTypeID": 50,
    "DateLastStatusUpdate": "2020-10-10T20:17:00Z",
    "MetadataValues": [
        {
            "ID": 7660,
            "MetadataFieldID": 4,
            "ItemValue": "Contains public sector information licensed under the Open Government Licence v2.0. http://www.nationalarchives.gov.uk/doc/open-government-licence/version/2/"
        }
    ],
    "DataQualityLevel": 3,
    "DateCreated": "2020-06-25T10:00:00Z",
    "SubmissionStatusTypeID": 100
}