{
    "UserComments": [
        {
            "ID": 23330,
            "ChargePointID": 103914,
            "CommentTypeID": 10,
            "UserName": "ForumElettrico.it",
            "Comment": "Il costo è di 2 €/h indipendentemente dall'energia erogata. Leggi la recensione completa qui > https://www.forumelettrico.it/forum/4-nuove-colonnine-all-europa-park-di-la-spezia-t1743.html",
            "RelatedURL": "https://www.forumelettrico.it/forum/4-nuove-colonnine-all-europa-park-di-la-spezia-t1743.html",
            "DateCreated": "2020-10-05T14:14:17.57Z",
            "User": {
                "ID": 11749,
                "Username": "ForumElettrico.it"
            },
            "CheckinStatusTypeID": 140,
            "IsActionedByEditor": false
        }
    ],
    "MediaItems": [
        {
            "ID": 24947,
            "ChargePointID": 103914,
            "ItemURL": "https://s3-ap-southeast-2.amazonaws.com/openchargemap/images/IT/OCM103914/OCM-103914.orig.2020100514142934.jpg",
            "ItemThumbnailURL": "https://s3-ap-southeast-2.amazonaws.com/openchargemap/images/IT/OCM103914/OCM-103914.thmb.2020100514142934.jpg",
            "Comment": "",
            "IsEnabled": true,
            "IsVideo": false,
            "IsFeaturedItem": false,
            "IsExternalResource": false,
            "User": {
                "ID": 11749,
                "Username": "ForumElettrico.it"
            },
            "DateCreated": "2020-10-05T14:15:00Z"
        },
        {
            "ID": 24948,
            "ChargePointID": 103914,
            "ItemURL": "https://s3-ap-southeast-2.amazonaws.com/openchargemap/images/IT/OCM103914/OCM-103914.orig.2020100514143544.jpg",
            "ItemThumbnailURL": "https://s3-ap-southeast-2.amazonaws.com/openchargemap/images/IT/OCM103914/OCM-103914.thmb.2020100514143544.jpg",
            "Comment": "",
            "IsEnabled": true,
            "IsVideo": false,
            "IsFeaturedItem": false,
            "IsExternalResource": false,
            "User": {
                "ID": 11749,
                "Username": "ForumElettrico.it"
            },
            "DateCreated": "2020-10-05T14:15:00Z"
        },
        {
            "ID": 24949,
            "ChargePointID": 103914,
            "ItemURL": "https://s3-ap-southeast-2.amazonaws.com/openchargemap/images/IT/OCM103914/OCM-103914.orig.2020100514144160.jpg",
            "ItemThumbnailURL": "https://s3-ap-southeast-2.amazonaws.com/openchargemap/images/IT/OCM103914/OCM-103914.thmb.2020100514144160.jpg",
            "Comment": "",
            "IsEnabled": true,
            "IsVideo": false,
            "IsFeaturedItem": false,
            "IsExternalResource": false,
            "User": {
                "ID": 11749,
                "Username": "ForumElettrico.it"
            },
            "DateCreated": "2020-10-05T14:15:00Z"
        },
        {
            "ID": 24950,
            "ChargePointID": 103914,
            "ItemURL": "https://s3-ap-southeast-2.amazonaws.com/openchargemap/images/IT/OCM103914/OCM-103914.orig.2020100514144790.jpg",
            "ItemThumbnailURL": "https://s3-ap-southeast-2.amazonaws.com/openchargemap/images/IT/OCM103914/OCM-103914.thmb.2020100514144790.jpg",
            "Comment": "",
            "IsEnabled": true,
            "IsVideo": false,
            "IsFeaturedItem": false,
            "IsExternalResource": false,
            "User": {
                "ID": 11749,
                "Username": "ForumElettrico.it"
            },
            "DateCreated": "2020-10-05T14:15:00Z"
        }
    ],
    "IsRecentlyVerified": false,
    "ID": 103914,
    "UUID": "03BD0F3E-F9AE-479B-A72D-F2843BA5C2F8",
    "DataProviderID": 1,
    "OperatorID": 45,
    "UsageTypeID": 1,
    "UsageCost": "Ricarica gratuita parcheggio a pagamento 1,50€/h - 0,60€/h",
    "AddressInfo": {
        "ID": 104260,
        "Title": "Europa Park ",
        "AddressLine1": "Piazza Europa ",
        "Town": "La Spezia",
        "StateOrProvince": "SP",
        "Postcode": "19124 ",
        "CountryID": 112,
        "Latitude": 44.10809585335837,
        "Longitude": 9.828351034517254,
        "ContactTelephone1": "0187/728240/398",
        "RelatedURL": "http://www.europaparksrl.it",
        "DistanceUnit": 0
    },
    "Connections": [
        {
            "ID": 146687,
            "ConnectionTypeID": 25,
            "StatusTypeID": 50,
            "LevelID": 2,
            "Quantity": 4
        }
    ],
    "NumberOfPoints": 4,
    "StatusTypeID": 50,
    "DateLastStatusUpdate": "2020-10-05T14:15:00Z",
    "DataQualityLevel": 1,
    "DateCreated": "2018-05-11T15:08:00Z",
    "SubmissionStatusTypeID": 200
}