{
    "UserComments": [
        {
            "ID": 13878,
            "ChargePointID": 60774,
            "CommentTypeID": 10,
            "UserName": "Zyg0te",
            "Comment": "Innkjøringen er litt vanskelig å finne men kom deg til MAX så er du på riktig sted. ",
            "Rating": 5,
            "DateCreated": "2016-07-24T07:46:59.663Z",
            "User": {
                "ID": 7885,
                "Username": "Zyg0te"
            }
        },
        {
            "ID": 11681,
            "ChargePointID": 60774,
            "CommentTypeID": 10,
            "UserName": "Zyg0te",
            "Comment": "Ganske populær superlader men man får stort sett plass uten opphold her.",
            "Rating": 5,
            "DateCreated": "2016-06-22T02:55:46.033Z",
            "User": {
                "ID": 7885,
                "Username": "Zyg0te"
            },
            "CheckinStatusTypeID": 10
        }
    ],
    "MediaItems": [
        {
            "ID": 6653,
            "ChargePointID": 60774,
            "ItemURL": "https://s3-ap-southeast-2.amazonaws.com/openchargemap/images/NO/OCM60774/OCM-60774.orig.2016062202542086.jpg",
            "ItemThumbnailURL": "https://s3-ap-southeast-2.amazonaws.com/openchargemap/images/NO/OCM60774/OCM-60774.thmb.2016062202542086.jpg",
            "Comment": "",
            "IsEnabled": true,
            "IsVideo": false,
            "IsFeaturedItem": false,
            "IsExternalResource": false,
            "User": {
                "ID": 7885,
                "Username": "Zyg0te"
            },
            "DateCreated": "2016-06-22T02:55:00Z"
        }
    ],
    "IsRecentlyVerified": false,
    "ID": 60774,
    "UUID": "70959F11-CACA-4A05-9F7E-D841CBE11461",
    "DataProviderID": 1,
    "OperatorID": 23,
    "OperatorsReference": "6562",
    "UsageTypeID": 1,
    "UsageCost": "NKR 1.70/kWh; andre tariffer for eldre biler",
    "AddressInfo": {
        "ID": 61120,
        "Title": "Lier North Supercharger",
        "AddressLine1": "82 Ringeriksveien",
        "Town": "Lier",
        "StateOrProvince": "Buskerud",
        "Postcode": "3402",
        "CountryID": 168,
        "Latitude": 59.770939,
        "Longitude": 10.262024,
        "ContactTelephone1": "23 96 02 85",
        "AccessComments": "Rett på baksiden av MAX Lier.",
        "DistanceUnit": 0
    },
    "Connections": [
        {
            "ID": 77048,
            "ConnectionTypeID": 27,
            "StatusTypeID": 50,
            "LevelID": 3,
            "Amps": 200,
            "Voltage": 500,
            "PowerKW": 120,
            "CurrentTypeID": 30,
            "Quantity": 8
        }
    ],
    "NumberOfPoints": 8,
    "StatusTypeID": 50,
    "DateLastStatusUpdate": "2020-08-24T09:11:00Z",
    "DataQualityLevel": 1,
    "DateCreated": "2016-02-08T03:17:00Z",
    "SubmissionStatusTypeID": 200
}