{
    "IsRecentlyVerified": false,
    "ID": 48028,
    "UUID": "A927565B-308E-414A-B01B-A1E1DD0A9332",
    "DataProviderID": 1,
    "OperatorID": 45,
    "UsageTypeID": 1,
    "UsageCost": "0",
    "AddressInfo": {
        "ID": 48374,
        "Title": "Supermarkt Aldi",
        "AddressLine1": "Schorner Straße 5",
        "Town": "Baierbrunn",
        "Postcode": "82065",
        "CountryID": 87,
        "Latitude": 48.0159982,
        "Longitude": 11.4771217,
        "AccessComments": "Kostenloses Laden und Parken (max. 1 Stunde) während der Öffnungszeiten Mo-Sa 8-20Uhr. Es kann nur an einem der Anschlüsse geladen werden. ",
        "RelatedURL": "http://www.aldi-sued.de/de/aldi-sued-a-bis-z/aldi-sued-a-bis-z/e/elektrotankstellen",
        "DistanceUnit": 0
    },
    "Connections": [
        {
            "ID": 59306,
            "ConnectionTypeID": 2,
            "LevelID": 3,
            "PowerKW": 20,
            "CurrentTypeID": 30,
            "Quantity": 1
        },
        {
            "ID": 59307,
            "ConnectionTypeID": 33,
            "LevelID": 3,
            "PowerKW": 20,
            "CurrentTypeID": 30,
            "Quantity": 1
        },
        {
            "ID": 59308,
            "ConnectionTypeID": 25,
            "StatusTypeID": 50,
            "LevelID": 2,
            "Amps": 32,
            "Voltage": 400,
            "PowerKW": 22,
            "CurrentTypeID": 20,
            "Quantity": 1
        },
        {
            "ID": 59309,
            "ConnectionTypeID": 28,
            "StatusTypeID": 50,
            "LevelID": 2,
            "Amps": 16,
            "Voltage": 230,
            "PowerKW": 3.7,
            "CurrentTypeID": 10,
            "Quantity": 0
        }
    ],
    "NumberOfPoints": 1,
    "StatusTypeID": 50,
    "DateLastStatusUpdate": "2015-06-23T08:55:00Z",
    "DataQualityLevel": 1,
    "DateCreated": "2015-06-23T06:52:00Z",
    "SubmissionStatusTypeID": 200
}