{
    "IsRecentlyVerified": false,
    "ID": 51483,
    "UUID": "97FD2F5A-AA93-4F8F-BD0B-545D79C0983B",
    "DataProviderID": 1,
    "OperatorID": 69,
    "UsageTypeID": 4,
    "UsageCost": "",
    "AddressInfo": {
        "ID": 51829,
        "Title": "Münchner Freiheit",
        "AddressLine1": "Leopoldstraße 84",
        "AddressLine2": "Bezirksteil Münchner Freiheit",
        "Town": "München",
        "StateOrProvince": "Bayern",
        "Postcode": "80802",
        "CountryID": 87,
        "Latitude": 48.1632243665483,
        "Longitude": 11.5866087209015,
        "ContactTelephone1": "",
        "ContactTelephone2": "",
        "ContactEmail": "",
        "AccessComments": "24/ 7 nutzbare Ladesäule, Registrierung bei Ladenetz oder Karte von WSW, ladeticket, EWE, TheNewMotion oder Charge&Fuel nötig. ACHTUNG: Nur für Carsharer, damit leider keine öffentliche Ladestation.",
        "RelatedURL": "http://www.swm.de/privatkunden/m-strom/autofahren.html",
        "DistanceUnit": 0
    },
    "Connections": [
        {
            "ID": 63782,
            "ConnectionTypeID": 25,
            "StatusTypeID": 50,
            "LevelID": 2,
            "Amps": 32,
            "Voltage": 400,
            "PowerKW": 22,
            "CurrentTypeID": 20,
            "Quantity": 2
        }
    ],
    "NumberOfPoints": 2,
    "GeneralComments": "",
    "StatusTypeID": 50,
    "DateLastStatusUpdate": "2017-01-04T19:13:00Z",
    "DataQualityLevel": 1,
    "DateCreated": "2015-07-27T08:22:00Z",
    "SubmissionStatusTypeID": 200
}