{
    "MediaItems": [
        {
            "ID": 25526,
            "ChargePointID": 161800,
            "ItemURL": "https://s3-ap-southeast-2.amazonaws.com/openchargemap/images/PT/OCM161800/OCM-161800.orig.2020112114340169.jpg",
            "ItemThumbnailURL": "https://s3-ap-southeast-2.amazonaws.com/openchargemap/images/PT/OCM161800/OCM-161800.thmb.2020112114340169.jpg",
            "Comment": "",
            "IsEnabled": true,
            "IsVideo": false,
            "IsFeaturedItem": false,
            "IsExternalResource": false,
            "User": {
                "ID": 9177,
                "Username": "AlexMol"
            },
            "DateCreated": "2020-11-21T14:34:00Z"
        }
    ],
    "IsRecentlyVerified": false,
    "ID": 161800,
    "UUID": "BE6E0469-9F77-4293-814C-E9039065FA38",
    "DataProviderID": 1,
    "OperatorID": 21,
    "UsageTypeID": 4,
    "UsageCost": "Mobi.E compatible card",
    "AddressInfo": {
        "ID": 162157,
        "Title": "SBA - Lidl",
        "AddressLine1": "LIDL",
        "Town": "São Brás de Alportel",
        "StateOrProvince": "Algarve",
        "Postcode": "",
        "CountryID": 180,
        "Latitude": 37.149725000177995,
        "Longitude": -7.893891874638143,
        "DistanceUnit": 0
    },
    "Connections": [
        {
            "ID": 232813,
            "ConnectionTypeID": 2,
            "StatusTypeID": 50,
            "LevelID": 3,
            "Amps": 120,
            "Voltage": 500,
            "PowerKW": 50,
            "CurrentTypeID": 30,
            "Quantity": 1
        },
        {
            "ID": 232814,
            "ConnectionTypeID": 33,
            "StatusTypeID": 50,
            "LevelID": 3,
            "Amps": 125,
            "Voltage": 500,
            "PowerKW": 50,
            "CurrentTypeID": 30,
            "Quantity": 1
        },
        {
            "ID": 232815,
            "ConnectionTypeID": 1036,
            "StatusTypeID": 50,
            "LevelID": 3,
            "Amps": 64,
            "Voltage": 400,
            "PowerKW": 43,
            "CurrentTypeID": 20,
            "Quantity": 1
        }
    ],
    "NumberOfPoints": 2,
    "StatusTypeID": 50,
    "DateLastStatusUpdate": "2020-11-21T14:34:00Z",
    "DataQualityLevel": 1,
    "DateCreated": "2020-07-25T08:30:00Z",
    "SubmissionStatusTypeID": 200
}