{
    "IsRecentlyVerified": false,
    "ID": 166651,
    "UUID": "5AA5B87C-BA86-4D5E-8DC9-A17F0C4F1E36",
    "DataProviderID": 28,
    "DataProvidersReference": "FR*S61*P61070A",
    "UsageTypeID": 5,
    "AddressInfo": {
        "ID": 167010,
        "Title": "Caligny | Le Bourg 24",
        "AddressLine1": "24 Le Bourg 61100 Caligny",
        "CountryID": 80,
        "Latitude": 48.808292,
        "Longitude": -0.595259,
        "AccessComments": "24/24 7/7",
        "DistanceUnit": 0
    },
    "Connections": [
        {
            "ID": 250378,
            "ConnectionTypeID": 26,
            "StatusTypeID": 50,
            "LevelID": 2,
            "PowerKW": 22
        },
        {
            "ID": 250379,
            "ConnectionTypeID": 28,
            "StatusTypeID": 50,
            "LevelID": 2,
            "PowerKW": 22,
            "CurrentTypeID": 10
        },
        {
            "ID": 250380,
            "ConnectionTypeID": 1036,
            "StatusTypeID": 50,
            "LevelID": 2,
            "PowerKW": 22,
            "CurrentTypeID": 20
        },
        {
            "ID": 250381,
            "ConnectionTypeID": 28,
            "StatusTypeID": 50,
            "LevelID": 2,
            "PowerKW": 22,
            "CurrentTypeID": 10
        }
    ],
    "GeneralComments": "",
    "StatusTypeID": 50,
    "DateLastStatusUpdate": "2020-08-27T05:15:00Z",
    "DataQualityLevel": 2,
    "DateCreated": "2020-08-27T05:15:00Z",
    "SubmissionStatusTypeID": 100
}