{
    "IsRecentlyVerified": false,
    "ID": 133750,
    "UUID": "DAF1C41D-0EE3-421F-B14E-1511AA7ED588",
    "DataProviderID": 1,
    "OperatorID": 80,
    "UsageTypeID": 4,
    "AddressInfo": {
        "ID": 134096,
        "Title": "Curcuris Mandorli | EnelX",
        "AddressLine1": "Via dei Mandorli",
        "Town": "Curcuris",
        "StateOrProvince": "OR",
        "Postcode": "09090",
        "CountryID": 112,
        "Latitude": 39.74470968949964,
        "Longitude": 8.832632159982836,
        "RelatedURL": "https://www.enelx.com/it/it/emobility",
        "DistanceUnit": 0
    },
    "Connections": [
        {
            "ID": 187190,
            "ConnectionTypeID": 25,
            "StatusTypeID": 50,
            "LevelID": 2,
            "Amps": 32,
            "Voltage": 400,
            "PowerKW": 22,
            "CurrentTypeID": 20,
            "Quantity": 2
        }
    ],
    "NumberOfPoints": 2,
    "StatusTypeID": 50,
    "DateLastStatusUpdate": "2019-10-25T14:23:00Z",
    "DataQualityLevel": 1,
    "DateCreated": "2019-10-25T14:23:00Z",
    "SubmissionStatusTypeID": 200
}