{
    "IsRecentlyVerified": false,
    "ID": 46629,
    "UUID": "F4C62D38-93E1-4CF1-8C31-7B34E1D3C437",
    "DataProviderID": 1,
    "DataProvidersReference": "506",
    "AddressInfo": {
        "ID": 46975,
        "Title": "Brundalen HVFS, Trondheim",
        "AddressLine1": "Yrkesskolevegen 22",
        "Town": "JAKOBSLI",
        "StateOrProvince": "Trøndelag",
        "Postcode": "7058",
        "CountryID": 168,
        "Latitude": 63.41895,
        "Longitude": 10.48995,
        "AccessComments": "Følg hovedinnkjørsel til helse- og velferdssenteret, ladepunkt inntil vegg på hovedbygg.",
        "DistanceUnit": 0
    },
    "Connections": [
        {
            "ID": 57292,
            "ConnectionTypeID": 0,
            "Reference": "1",
            "LevelID": 2,
            "Amps": 16,
            "Voltage": 230,
            "PowerKW": 3.7,
            "Comments": "Mode 1"
        }
    ],
    "NumberOfPoints": 1,
    "DateLastStatusUpdate": "2020-05-26T08:25:00Z",
    "DataQualityLevel": 2,
    "DateCreated": "2015-05-03T00:54:00Z",
    "SubmissionStatusTypeID": 100
}