{
    "IsRecentlyVerified": false,
    "ID": 100783,
    "UUID": "B4ADD111-2F56-402E-AFCB-108E22A5EC00",
    "DataProviderID": 1,
    "OperatorID": 23,
    "OperatorsReference": "41334",
    "UsageTypeID": 4,
    "AddressInfo": {
        "ID": 101129,
        "Title": "Jake's Quechee Market",
        "AddressLine1": "7161 Woodstock RD",
        "Town": "Quechee",
        "StateOrProvince": "Vermont",
        "Postcode": "05059",
        "CountryID": 2,
        "Latitude": 43.644698,
        "Longitude": -72.4246438,
        "ContactTelephone1": "(802) 291-9900",
        "DistanceUnit": 0
    },
    "Connections": [
        {
            "ID": 142363,
            "ConnectionTypeID": 30,
            "StatusTypeID": 50,
            "LevelID": 2,
            "PowerKW": 16,
            "CurrentTypeID": 20,
            "Quantity": 3
        }
    ],
    "NumberOfPoints": 3,
    "GeneralComments": "3 Tesla Connectors, up to 16kW.Available for customers. Self park.",
    "StatusTypeID": 50,
    "DateLastStatusUpdate": "2018-03-10T06:48:00Z",
    "DataQualityLevel": 1,
    "DateCreated": "2018-03-10T06:48:00Z",
    "SubmissionStatusTypeID": 200
}