{
    "IsRecentlyVerified": false,
    "ID": 64760,
    "UUID": "E7E0DA65-6DA1-4A80-82F2-489EC026F7C4",
    "DataProviderID": 1,
    "OperatorID": 86,
    "UsageTypeID": 4,
    "AddressInfo": {
        "ID": 65106,
        "Title": "Kulturforum Offenburg",
        "AddressLine1": "Weingartenstraße",
        "AddressLine2": "Ecke Amand-Goegg-Straße",
        "Town": "Offenburg",
        "StateOrProvince": "Ortenaukreis",
        "Postcode": "77654",
        "CountryID": 87,
        "Latitude": 48.4690617,
        "Longitude": 7.95576959999994,
        "AccessComments": "Carsharing Ladestation, daher beim Auto bleiben oder Rufnummer hinterlassen. Zugang mit Ladekarte EnBW, Ladenetz, PlugSurfing, The New Motion u.a.",
        "DistanceUnit": 0
    },
    "Connections": [
        {
            "ID": 83259,
            "ConnectionTypeID": 25,
            "StatusTypeID": 50,
            "LevelID": 2,
            "Amps": 32,
            "Voltage": 400,
            "PowerKW": 22,
            "CurrentTypeID": 20,
            "Quantity": 2
        }
    ],
    "NumberOfPoints": 2,
    "StatusTypeID": 50,
    "DateLastStatusUpdate": "2016-03-17T07:51:00Z",
    "DataQualityLevel": 1,
    "DateCreated": "2016-03-17T07:51:00Z",
    "SubmissionStatusTypeID": 200
}