{
    "IsRecentlyVerified": false,
    "ID": 157271,
    "UUID": "D4AE348B-463D-4AC9-91D3-5C1DD69C57FA",
    "DataProviderID": 19,
    "DataProvidersReference": "3682",
    "AddressInfo": {
        "ID": 157625,
        "Title": "Käyrämön Keidas",
        "AddressLine1": "Sodankyläntie 6810",
        "Town": "Tiainen",
        "StateOrProvince": "Lappi",
        "Postcode": "97540",
        "CountryID": 79,
        "Latitude": 66.95108,
        "Longitude": 26.29963,
        "AccessComments": "Hotellin tai ravintolan parkkialueella tai -hallissa",
        "DistanceUnit": 0
    },
    "Connections": [
        {
            "ID": 226351,
            "ConnectionTypeID": 25,
            "Reference": "1",
            "LevelID": 3,
            "Amps": 32,
            "Voltage": 400,
            "PowerKW": 22,
            "CurrentTypeID": 30,
            "Comments": "Mode 3"
        },
        {
            "ID": 226352,
            "ConnectionTypeID": 25,
            "Reference": "2",
            "LevelID": 3,
            "Amps": 32,
            "Voltage": 400,
            "PowerKW": 22,
            "CurrentTypeID": 30,
            "Comments": "Mode 3"
        }
    ],
    "NumberOfPoints": 2,
    "StatusTypeID": 0,
    "DateLastStatusUpdate": "2021-03-24T05:12:00Z",
    "DataQualityLevel": 2,
    "DateCreated": "2020-05-26T08:25:00Z",
    "SubmissionStatusTypeID": 100
}