{
    "IsRecentlyVerified": false,
    "ID": 144981,
    "UUID": "E8AA76A4-9C48-4220-BF82-7198CDDBC431",
    "DataProviderID": 2,
    "DataProvidersReference": "144986",
    "OperatorID": 90,
    "UsageTypeID": 1,
    "AddressInfo": {
        "ID": 145333,
        "Title": "Desjardins - Bois-Francs",
        "AddressLine1": "300 boul. des Bois-Francs Sud",
        "Town": "Victoriaville",
        "StateOrProvince": "QC",
        "Postcode": "G6P 7W7",
        "CountryID": 44,
        "Latitude": 46.054522,
        "Longitude": -71.941621,
        "ContactTelephone1": "877-505-2674",
        "AccessComments": "24 hours daily",
        "RelatedURL": "https://lecircuitelectrique.com/",
        "DistanceUnit": 0
    },
    "Connections": [
        {
            "ID": 201547,
            "ConnectionTypeID": 1,
            "LevelID": 2,
            "Amps": 16,
            "Voltage": 230,
            "PowerKW": 3.7,
            "CurrentTypeID": 10,
            "Quantity": 1
        }
    ],
    "StatusTypeID": 50,
    "DateLastStatusUpdate": "2020-06-26T03:10:00Z",
    "DataQualityLevel": 3,
    "DateCreated": "2019-12-24T09:24:00Z",
    "SubmissionStatusTypeID": 100
}