{
    "IsRecentlyVerified": false,
    "ID": 45120,
    "UUID": "E1D42073-FAE4-427A-93DF-312DB8E4F792",
    "DataProviderID": 1,
    "OperatorID": 98,
    "UsageTypeID": 4,
    "AddressInfo": {
        "ID": 45466,
        "Title": "Ahlert Mineralöle",
        "AddressLine1": "Saerbecker Straße 130",
        "Town": "Greven",
        "Postcode": "48268",
        "CountryID": 87,
        "Latitude": 52.10985,
        "Longitude": 7.61266000000001,
        "ContactTelephone1": "+492571 57799-0",
        "AccessComments": "Täglich von 7-22Uhr geöffnet, 2 Parkplätze. ",
        "DistanceUnit": 0
    },
    "Connections": [
        {
            "ID": 55559,
            "ConnectionTypeID": 16,
            "StatusTypeID": 50,
            "LevelID": 2,
            "Amps": 16,
            "Voltage": 230,
            "PowerKW": 3.7,
            "CurrentTypeID": 10,
            "Quantity": 1
        },
        {
            "ID": 55560,
            "ConnectionTypeID": 17,
            "StatusTypeID": 50,
            "LevelID": 2,
            "Amps": 16,
            "Voltage": 400,
            "PowerKW": 11,
            "CurrentTypeID": 20,
            "Quantity": 1
        },
        {
            "ID": 55561,
            "ConnectionTypeID": 28,
            "StatusTypeID": 50,
            "LevelID": 2,
            "Amps": 16,
            "Voltage": 230,
            "PowerKW": 3.7,
            "CurrentTypeID": 10,
            "Quantity": 1
        }
    ],
    "NumberOfPoints": 3,
    "StatusTypeID": 50,
    "DateLastStatusUpdate": "2015-04-25T13:59:00Z",
    "DataQualityLevel": 1,
    "DateCreated": "2015-04-25T11:04:00Z",
    "SubmissionStatusTypeID": 200
}