{
    "IsRecentlyVerified": false,
    "ID": 106868,
    "UUID": "723F34B9-5C9F-49B0-AE87-CD779B9039F4",
    "DataProviderID": 1,
    "OperatorID": 3296,
    "UsageTypeID": 5,
    "UsageCost": "£0.35/kWh",
    "AddressInfo": {
        "ID": 107214,
        "Title": "Gulf Universe Station",
        "AddressLine1": "Paisley Road West",
        "Town": "Glasgow",
        "Postcode": "G52 3PF",
        "CountryID": 1,
        "Latitude": 55.845618,
        "Longitude": -4.356121,
        "DistanceUnit": 0
    },
    "Connections": [
        {
            "ID": 150648,
            "ConnectionTypeID": 2,
            "StatusTypeID": 50,
            "LevelID": 3,
            "PowerKW": 50,
            "CurrentTypeID": 30,
            "Quantity": 2
        },
        {
            "ID": 150649,
            "ConnectionTypeID": 33,
            "StatusTypeID": 50,
            "LevelID": 3,
            "PowerKW": 50,
            "CurrentTypeID": 30,
            "Quantity": 2
        }
    ],
    "NumberOfPoints": 2,
    "StatusTypeID": 50,
    "DateLastStatusUpdate": "2018-07-06T05:16:00Z",
    "DataQualityLevel": 1,
    "DateCreated": "2018-07-05T19:57:00Z",
    "SubmissionStatusTypeID": 200
}