{
    "IsRecentlyVerified": false,
    "ID": 173125,
    "UUID": "F3CE1D09-AA09-4DC9-9ED1-F2EA1683B185",
    "DataProviderID": 19,
    "DataProvidersReference": "7299",
    "AddressInfo": {
        "ID": 173484,
        "Title": "Stavtjørn Alpin",
        "AddressLine1": "FV117 ",
        "Town": "VIKESÅ",
        "StateOrProvince": "Rogaland",
        "Postcode": "4389",
        "CountryID": 168,
        "Latitude": 58.70016,
        "Longitude": 6.36473,
        "AccessComments": "",
        "DistanceUnit": 0
    },
    "Connections": [
        {
            "ID": 265223,
            "ConnectionTypeID": 25,
            "Reference": "1",
            "LevelID": 2,
            "Amps": 32,
            "Voltage": 230,
            "PowerKW": 7.4,
            "CurrentTypeID": 10
        },
        {
            "ID": 265224,
            "ConnectionTypeID": 25,
            "Reference": "2",
            "LevelID": 2,
            "Amps": 32,
            "Voltage": 230,
            "PowerKW": 7.4,
            "CurrentTypeID": 10
        }
    ],
    "NumberOfPoints": 2,
    "StatusTypeID": 0,
    "DateLastStatusUpdate": "2021-03-24T05:11:00Z",
    "DataQualityLevel": 2,
    "DateCreated": "2021-03-03T09:01:00Z",
    "SubmissionStatusTypeID": 100
}