{
    "IsRecentlyVerified": false,
    "ID": 106126,
    "UUID": "191745E5-4365-42F9-B596-576539667670",
    "DataProviderID": 1,
    "OperatorID": 32,
    "OperatorsReference": "10781,10782",
    "UsageTypeID": 4,
    "UsageCost": "£0.108/kWh; for Polar Plus subscription members only",
    "AddressInfo": {
        "ID": 106472,
        "Title": "Milton Road Park & Ride",
        "AddressLine1": "Milton Road Park & Ride",
        "Town": "Butt Lane",
        "StateOrProvince": "Cambridge",
        "Postcode": "CB24 6DQ",
        "CountryID": 1,
        "Latitude": 52.245247,
        "Longitude": 0.150349,
        "DistanceUnit": 0
    },
    "Connections": [
        {
            "ID": 149458,
            "ConnectionTypeID": 25,
            "StatusTypeID": 75,
            "LevelID": 2,
            "Amps": 32,
            "Voltage": 230,
            "PowerKW": 7,
            "CurrentTypeID": 10,
            "Quantity": 4
        }
    ],
    "NumberOfPoints": 4,
    "GeneralComments": "GROUND",
    "StatusTypeID": 75,
    "DateLastStatusUpdate": "2019-03-21T06:17:00Z",
    "DataQualityLevel": 1,
    "DateCreated": "2018-06-16T05:15:00Z",
    "SubmissionStatusTypeID": 200
}