{
    "IsRecentlyVerified": false,
    "ID": 174703,
    "UUID": "189D563A-5C7E-4B05-82AF-E9C3F98FC4A7",
    "DataProviderID": 1,
    "OperatorID": 125,
    "UsageTypeID": 4,
    "AddressInfo": {
        "ID": 175062,
        "Title": "Konsul-Smidt-Straße",
        "AddressLine1": "Konsul-Smidt-Straße 11",
        "AddressLine2": "Walle",
        "Town": "Bremen",
        "StateOrProvince": "Free Hanseatic City of Bremen",
        "Postcode": "28217",
        "CountryID": 87,
        "Latitude": 53.0895096155503,
        "Longitude": 8.777992910734383,
        "DistanceUnit": 0
    },
    "Connections": [
        {
            "ID": 270709,
            "ConnectionTypeID": 1036,
            "StatusTypeID": 50,
            "LevelID": 3,
            "Amps": 63,
            "Voltage": 400,
            "PowerKW": 43,
            "CurrentTypeID": 20,
            "Quantity": 1
        },
        {
            "ID": 270710,
            "ConnectionTypeID": 33,
            "StatusTypeID": 50,
            "LevelID": 3,
            "PowerKW": 50,
            "CurrentTypeID": 30,
            "Quantity": 1
        },
        {
            "ID": 270711,
            "ConnectionTypeID": 2,
            "StatusTypeID": 50,
            "LevelID": 3,
            "PowerKW": 50,
            "CurrentTypeID": 30,
            "Quantity": 1
        }
    ],
    "NumberOfPoints": 2,
    "GeneralComments": "In Höhe der Hafenfachschule steht am linken Straßenrand ein durchgehend verfügbarer rot-weißer Triplecharger.",
    "StatusTypeID": 50,
    "DateLastStatusUpdate": "2021-04-11T11:53:00Z",
    "DataQualityLevel": 1,
    "DateCreated": "2021-04-11T11:53:00Z",
    "SubmissionStatusTypeID": 200
}