{
    "IsRecentlyVerified": false,
    "ID": 84691,
    "UUID": "45A1EC96-D08A-4259-B10D-CC3DFDC9E779",
    "DataProviderID": 1,
    "OperatorID": 69,
    "UsageTypeID": 4,
    "AddressInfo": {
        "ID": 85037,
        "Title": "Parkhaus am Flughafen",
        "AddressLine1": "Binderslebener Landstraße 100",
        "Town": "Erfurt",
        "StateOrProvince": "Erfurt",
        "Postcode": "99092",
        "CountryID": 87,
        "Latitude": 50.97495998982526,
        "Longitude": 10.958986356066948,
        "ContactTelephone1": "+49 361 561 1010",
        "AccessComments": "Rechts neben der Einfahrt zum Parkhaus; also nicht im Parkhaus gelegen. ",
        "RelatedURL": "http://www.stadtwerke-erfurt.de/pb/site/swegruppe/node/319881/Lde/index.html",
        "DistanceUnit": 0
    },
    "Connections": [
        {
            "ID": 120299,
            "ConnectionTypeID": 25,
            "StatusTypeID": 50,
            "LevelID": 2,
            "Amps": 32,
            "Voltage": 400,
            "PowerKW": 22,
            "CurrentTypeID": 20,
            "Quantity": 2
        },
        {
            "ID": 120300,
            "ConnectionTypeID": 28,
            "StatusTypeID": 50,
            "LevelID": 2,
            "Amps": 16,
            "Voltage": 230,
            "PowerKW": 3.7,
            "CurrentTypeID": 10,
            "Quantity": 2
        }
    ],
    "NumberOfPoints": 2,
    "StatusTypeID": 50,
    "DateLastStatusUpdate": "2017-03-09T07:57:00Z",
    "DataQualityLevel": 1,
    "DateCreated": "2017-03-09T07:57:00Z",
    "SubmissionStatusTypeID": 200
}