{
    "IsRecentlyVerified": false,
    "ID": 68549,
    "UUID": "5A2B636F-D10B-4CDF-9F12-C1F53DBF8005",
    "DataProviderID": 1,
    "OperatorID": 2245,
    "UsageTypeID": 4,
    "AddressInfo": {
        "ID": 68895,
        "Title": "Parkplatz Albwerk",
        "AddressLine1": "Eybstraße 100",
        "Town": "Geislingen",
        "Postcode": "73312",
        "CountryID": 87,
        "Latitude": 48.62474,
        "Longitude": 9.835659999999962,
        "ContactTelephone1": "+49 7331 209-0",
        "AccessComments": "Rund um die Uhr (24/7) nutzbar. Position: auf dem Parkplatz des Albwerks, gegenüber dem Verwaltungsgebäude. Umgebung:Einkaufszentrum \"Nel Mezzo\" in der Nähe\r\n",
        "RelatedURL": "http://www.albwerk.de/",
        "DistanceUnit": 0
    },
    "Connections": [
        {
            "ID": 95943,
            "ConnectionTypeID": 28,
            "StatusTypeID": 50,
            "LevelID": 2,
            "Amps": 16,
            "Voltage": 230,
            "PowerKW": 3.7,
            "CurrentTypeID": 10,
            "Quantity": 2
        },
        {
            "ID": 95944,
            "ConnectionTypeID": 25,
            "StatusTypeID": 50,
            "LevelID": 2,
            "PowerKW": 11,
            "CurrentTypeID": 20,
            "Quantity": 2
        },
        {
            "ID": 95945,
            "ConnectionTypeID": 16,
            "StatusTypeID": 50,
            "LevelID": 2,
            "Amps": 16,
            "Voltage": 230,
            "PowerKW": 3.7,
            "CurrentTypeID": 10,
            "Quantity": 0
        },
        {
            "ID": 95946,
            "ConnectionTypeID": 17,
            "Quantity": 0
        }
    ],
    "NumberOfPoints": 4,
    "StatusTypeID": 50,
    "DateLastStatusUpdate": "2016-06-12T11:09:00Z",
    "DataQualityLevel": 1,
    "DateCreated": "2016-06-12T11:09:00Z",
    "SubmissionStatusTypeID": 200
}