{
    "MediaItems": [
        {
            "ID": 6267,
            "ChargePointID": 19085,
            "ItemURL": "https://s3-ap-southeast-2.amazonaws.com/openchargemap/images/GB/OCM19085/OCM-19085.orig.2016041917070101.jpeg",
            "ItemThumbnailURL": "https://s3-ap-southeast-2.amazonaws.com/openchargemap/images/GB/OCM19085/OCM-19085.thmb.2016041917070101.jpeg",
            "Comment": "",
            "IsEnabled": true,
            "IsVideo": false,
            "IsFeaturedItem": false,
            "IsExternalResource": false,
            "User": {
                "ID": 6406,
                "Username": "ajkelly"
            },
            "DateCreated": "2016-04-19T17:07:00Z"
        },
        {
            "ID": 533,
            "ChargePointID": 19085,
            "ItemURL": "https://s3-ap-southeast-2.amazonaws.com/openchargemap/images/GB/OCM19085/OCM-19085.orig.2014071619330162.jpg",
            "ItemThumbnailURL": "https://s3-ap-southeast-2.amazonaws.com/openchargemap/images/GB/OCM19085/OCM-19085.thmb.2014071619330162.jpg",
            "Comment": "",
            "IsEnabled": true,
            "IsVideo": false,
            "IsFeaturedItem": false,
            "IsExternalResource": false,
            "User": {
                "ID": 1088,
                "Username": "Buzby"
            },
            "DateCreated": "2014-07-16T19:33:00Z"
        },
        {
            "ID": 120,
            "ChargePointID": 19085,
            "ItemURL": "https://s3-ap-southeast-2.amazonaws.com/openchargemap/images/GB/OCM19085/OCM-19085.orig.2013101413403664.jpg",
            "ItemThumbnailURL": "https://s3-ap-southeast-2.amazonaws.com/openchargemap/images/GB/OCM19085/OCM-19085.thmb.2013101413403664.jpg",
            "Comment": "",
            "IsEnabled": true,
            "IsVideo": false,
            "IsFeaturedItem": false,
            "IsExternalResource": false,
            "User": {
                "ID": 1192,
                "Username": "Anon74856763534"
            },
            "DateCreated": "2013-10-14T13:41:00Z"
        }
    ],
    "IsRecentlyVerified": false,
    "ID": 19085,
    "UUID": "3F44D72E-A768-4252-AE89-98AEE7EFA033",
    "DataProviderID": 1,
    "OperatorID": 3315,
    "OperatorsReference": "50218,50224,50226",
    "UsageTypeID": 4,
    "UsageCost": "Free",
    "AddressInfo": {
        "ID": 19430,
        "Title": "Kilncraigs Car Park",
        "AddressLine1": "Greenside Street",
        "Town": "Alloa",
        "StateOrProvince": "Scotland",
        "Postcode": "FK10 1EB",
        "CountryID": 1,
        "Latitude": 56.11322,
        "Longitude": -3.78987,
        "RelatedURL": "http://chargeyourcar.org.uk/ev-driver/",
        "DistanceUnit": 0
    },
    "Connections": [
        {
            "ID": 19326,
            "ConnectionTypeID": 25,
            "StatusTypeID": 50,
            "LevelID": 2,
            "Amps": 32,
            "Voltage": 240,
            "PowerKW": 7,
            "CurrentTypeID": 10,
            "Quantity": 6
        }
    ],
    "NumberOfPoints": 6,
    "StatusTypeID": 50,
    "DateLastStatusUpdate": "2020-04-16T05:16:00Z",
    "DataQualityLevel": 3,
    "DateCreated": "2013-09-11T03:42:00Z",
    "SubmissionStatusTypeID": 200
}