{
    "IsRecentlyVerified": false,
    "ID": 82327,
    "UUID": "F017231A-E152-445E-BEA0-972DF82C9945",
    "DataProviderID": 1,
    "OperatorID": 23,
    "OperatorsReference": "23141",
    "UsageTypeID": 4,
    "AddressInfo": {
        "ID": 82673,
        "Title": "Ledreborg Palace Golf Club",
        "AddressLine1": "12 Skottehusvej",
        "Town": "Lejre",
        "Postcode": "4320",
        "CountryID": 65,
        "Latitude": 55.606843,
        "Longitude": 11.947801,
        "ContactTelephone1": "+45 4646 1630",
        "DistanceUnit": 0
    },
    "Connections": [
        {
            "ID": 117093,
            "ConnectionTypeID": 30,
            "StatusTypeID": 50,
            "LevelID": 2,
            "Amps": 16,
            "Voltage": 400,
            "PowerKW": 11,
            "CurrentTypeID": 20,
            "Quantity": 2
        }
    ],
    "NumberOfPoints": 2,
    "GeneralComments": "2 Tesla Connectors, up to 11kW.Available for customers. Please see front desk.",
    "StatusTypeID": 50,
    "DateLastStatusUpdate": "2018-10-03T14:35:00Z",
    "DataQualityLevel": 1,
    "DateCreated": "2017-02-03T15:35:00Z",
    "SubmissionStatusTypeID": 200
}