{
    "IsRecentlyVerified": false,
    "ID": 22455,
    "UUID": "FA608564-49D5-4C7D-8C91-7941BF89D8B7",
    "DataProviderID": 1,
    "OperatorID": 20,
    "OperatorsReference": "10070,10071,70779,70780,70937,70938",
    "UsageTypeID": 4,
    "UsageCost": "Free",
    "AddressInfo": {
        "ID": 22800,
        "Title": "Northern Design Centre",
        "AddressLine1": "Abbotts Hill",
        "AddressLine2": "Gateshead",
        "Town": "Tyne and Wear",
        "Postcode": "NE8 3DF",
        "CountryID": 1,
        "Latitude": 54.966678,
        "Longitude": -1.59466,
        "DistanceUnit": 0
    },
    "Connections": [
        {
            "ID": 24136,
            "ConnectionTypeID": 25,
            "StatusTypeID": 75,
            "LevelID": 2,
            "Amps": 32,
            "Voltage": 250,
            "PowerKW": 7,
            "CurrentTypeID": 10,
            "Quantity": 6
        }
    ],
    "NumberOfPoints": 6,
    "StatusTypeID": 75,
    "DateLastStatusUpdate": "2017-08-23T21:34:00Z",
    "MetadataValues": [
        {
            "ID": 442,
            "MetadataFieldID": 4,
            "ItemValue": "Contains public sector information licensed under the Open Government Licence v2.0. http://www.nationalarchives.gov.uk/doc/open-government-licence/version/2/"
        }
    ],
    "DataQualityLevel": 3,
    "DateCreated": "2014-03-22T08:41:00Z",
    "SubmissionStatusTypeID": 200
}