{
    "IsRecentlyVerified": false,
    "ID": 113967,
    "UUID": "37F4631A-F191-4BFD-BAF7-BB2F3ED5B1B4",
    "DataProviderID": 1,
    "OperatorID": 23,
    "OperatorsReference": "46881",
    "UsageTypeID": 4,
    "AddressInfo": {
        "ID": 114313,
        "Title": "Beechfield House Hotel",
        "AddressLine1": "Beanacre",
        "Town": "Melksham",
        "Postcode": "SN12 7PU",
        "CountryID": 1,
        "Latitude": 51.390026,
        "Longitude": -2.140125,
        "ContactTelephone1": "+44 122 570 3700",
        "DistanceUnit": 0
    },
    "Connections": [
        {
            "ID": 160537,
            "ConnectionTypeID": 30,
            "StatusTypeID": 50,
            "LevelID": 2,
            "Amps": 16,
            "Voltage": 400,
            "PowerKW": 11,
            "CurrentTypeID": 20,
            "Quantity": 2
        }
    ],
    "NumberOfPoints": 2,
    "GeneralComments": "2 Tesla Connectors, up to 11kW.Available for customers. Please see front desk.",
    "StatusTypeID": 50,
    "DateLastStatusUpdate": "2019-01-02T22:05:00Z",
    "DataQualityLevel": 1,
    "DateCreated": "2019-01-02T22:05:00Z",
    "SubmissionStatusTypeID": 200
}