{
    "IsRecentlyVerified": false,
    "ID": 121797,
    "UUID": "FC344046-42D6-4504-9CB7-9331EE274D93",
    "DataProviderID": 2,
    "DataProvidersReference": "117220",
    "OperatorID": 5,
    "UsageTypeID": 1,
    "AddressInfo": {
        "ID": 122143,
        "Title": "HONDACONYERS",
        "AddressLine1": "1860 GA-20",
        "Town": "Conyers",
        "StateOrProvince": "GA",
        "Postcode": "30013",
        "CountryID": 2,
        "Latitude": 33.639097,
        "Longitude": -84.013425,
        "ContactTelephone1": "888-758-4389",
        "AccessComments": "24 hours daily",
        "RelatedURL": "http://www.chargepoint.com/",
        "DistanceUnit": 0
    },
    "Connections": [
        {
            "ID": 171626,
            "ConnectionTypeID": 1,
            "LevelID": 2,
            "Amps": 16,
            "Voltage": 230,
            "PowerKW": 3,
            "CurrentTypeID": 10,
            "Quantity": 2
        }
    ],
    "DateLastStatusUpdate": "2019-04-06T05:02:00Z",
    "DataQualityLevel": 3,
    "DateCreated": "2019-04-06T05:02:00Z",
    "SubmissionStatusTypeID": 100
}