{
    "IsRecentlyVerified": false,
    "ID": 118067,
    "UUID": "9F6103E8-5CDD-4DB6-B433-946CB91D999D",
    "DataProviderID": 1,
    "OperatorID": 23,
    "OperatorsReference": "49018",
    "UsageTypeID": 4,
    "AddressInfo": {
        "ID": 118413,
        "Title": "Delta Shebrooke",
        "AddressLine1": "2685 Rue King Ouest",
        "Town": "Sherbrooke",
        "StateOrProvince": "Quebec",
        "Postcode": "J1l 1C1",
        "CountryID": 44,
        "Latitude": 45.398536,
        "Longitude": -71.939706,
        "ContactTelephone1": "(819) 822-1989",
        "DistanceUnit": 0
    },
    "Connections": [
        {
            "ID": 167086,
            "ConnectionTypeID": 30,
            "StatusTypeID": 50,
            "LevelID": 2,
            "PowerKW": 16,
            "CurrentTypeID": 20,
            "Quantity": 2
        }
    ],
    "NumberOfPoints": 2,
    "GeneralComments": "2 Tesla Connectors, up to 16kW.Available for customers. Please see front desk.",
    "StatusTypeID": 50,
    "DateLastStatusUpdate": "2019-03-14T23:25:00Z",
    "DataQualityLevel": 1,
    "DateCreated": "2019-03-14T23:25:00Z",
    "SubmissionStatusTypeID": 200
}