{
    "IsRecentlyVerified": false,
    "ID": 176925,
    "UUID": "6235627E-81DD-401B-88E4-BBDD22EE890C",
    "DataProviderID": 29,
    "DataProvidersReference": "5525",
    "OperatorID": 69,
    "AddressInfo": {
        "ID": 177284,
        "Title": "Hugstetter Straße 64",
        "AddressLine1": "Hugstetter Straße 64",
        "Town": "Freiburg im Breisgau",
        "Postcode": "79106",
        "CountryID": 87,
        "Latitude": 48.005265,
        "Longitude": 7.839595,
        "DistanceUnit": 0
    },
    "Connections": [
        {
            "ID": 275457,
            "ConnectionTypeID": 25,
            "StatusTypeID": 50,
            "LevelID": 2,
            "PowerKW": 22,
            "CurrentTypeID": 20
        },
        {
            "ID": 275458,
            "ConnectionTypeID": 25,
            "StatusTypeID": 50,
            "LevelID": 2,
            "PowerKW": 22,
            "CurrentTypeID": 20
        }
    ],
    "StatusTypeID": 0,
    "DateLastStatusUpdate": "2021-07-09T03:11:00Z",
    "MetadataValues": [
        {
            "ID": 9220,
            "MetadataFieldID": 4,
            "ItemValue": "Data from the German chargepoint registry provided by Bundesnetzagentur.de under the CC-BY 4.0 license"
        }
    ],
    "DataQualityLevel": 3,
    "DateCreated": "2021-07-08T09:48:00Z",
    "SubmissionStatusTypeID": 100
}