{
    "IsRecentlyVerified": false,
    "ID": 179494,
    "UUID": "4A1B240E-D983-4187-838D-FC4D60C93003",
    "DataProviderID": 29,
    "DataProvidersReference": "9684",
    "AddressInfo": {
        "ID": 179853,
        "Title": "Blaulstraße 4",
        "AddressLine1": "Blaulstraße 4",
        "Town": "Speyer",
        "Postcode": "67346",
        "CountryID": 87,
        "Latitude": 49.3234,
        "Longitude": 8.4263,
        "DistanceUnit": 0
    },
    "Connections": [
        {
            "ID": 281389,
            "ConnectionTypeID": 25,
            "StatusTypeID": 50,
            "LevelID": 2,
            "PowerKW": 22,
            "CurrentTypeID": 20
        },
        {
            "ID": 281390,
            "ConnectionTypeID": 25,
            "StatusTypeID": 50,
            "LevelID": 2,
            "PowerKW": 22,
            "CurrentTypeID": 20
        }
    ],
    "StatusTypeID": 50,
    "DateLastStatusUpdate": "2021-07-09T03:16:00Z",
    "MetadataValues": [
        {
            "ID": 11788,
            "MetadataFieldID": 4,
            "ItemValue": "Data from the German chargepoint registry provided by Bundesnetzagentur.de under the CC-BY 4.0 license"
        }
    ],
    "DataQualityLevel": 3,
    "DateCreated": "2021-07-08T09:59:00Z",
    "SubmissionStatusTypeID": 100
}