{
    "IsRecentlyVerified": false,
    "ID": 107266,
    "UUID": "0BA36467-EF71-4A0B-AB53-1241D938F01B",
    "DataProviderID": 1,
    "OperatorID": 25,
    "OperatorsReference": "brent-stpaulsavenue",
    "UsageTypeID": 4,
    "UsageCost": "£0.059/minute; min £1.18; other tariffs available",
    "AddressInfo": {
        "ID": 107612,
        "Title": "St Pauls Avenue",
        "AddressLine1": "1 St Pauls Avenue",
        "Town": "London",
        "Postcode": "NW2 5SR",
        "CountryID": 1,
        "Latitude": 51.548666,
        "Longitude": -0.222075,
        "DistanceUnit": 0
    },
    "Connections": [
        {
            "ID": 151306,
            "ConnectionTypeID": 25,
            "StatusTypeID": 50,
            "LevelID": 2,
            "Amps": 32,
            "Voltage": 230,
            "PowerKW": 7,
            "CurrentTypeID": 10,
            "Quantity": 1
        },
        {
            "ID": 151307,
            "ConnectionTypeID": 1,
            "StatusTypeID": 50,
            "LevelID": 2,
            "Amps": 16,
            "Voltage": 230,
            "PowerKW": 4,
            "CurrentTypeID": 10,
            "Quantity": 1
        }
    ],
    "NumberOfPoints": 1,
    "StatusTypeID": 50,
    "DateLastStatusUpdate": "2019-01-08T08:24:00Z",
    "DataQualityLevel": 1,
    "DateCreated": "2018-07-23T15:34:00Z",
    "SubmissionStatusTypeID": 200
}