{
    "IsRecentlyVerified": false,
    "ID": 129275,
    "UUID": "F5181B57-330D-4449-BE50-E050FE0F227E",
    "DataProviderID": 1,
    "OperatorID": 3,
    "OperatorsReference": "PG-94836,PG-94881",
    "UsageTypeID": 4,
    "UsageCost": "1",
    "AddressInfo": {
        "ID": 129621,
        "Title": "British Valve & Actuator Association",
        "AddressLine1": "1a Banbury Office Village",
        "Town": "Noral Way",
        "StateOrProvince": "Banbury",
        "Postcode": "OX16 2SB",
        "CountryID": 1,
        "Latitude": 52.082734,
        "Longitude": -1.336076,
        "DistanceUnit": 0
    },
    "Connections": [
        {
            "ID": 180936,
            "ConnectionTypeID": 25,
            "StatusTypeID": 50,
            "LevelID": 2,
            "Amps": 32,
            "Voltage": 230,
            "PowerKW": 7,
            "CurrentTypeID": 10,
            "Quantity": 2
        }
    ],
    "NumberOfPoints": 2,
    "GeneralComments": "This is an open charge unit installed at the British Valve & Actuator Association site at Banbury Office Village, Noral Way, Banbury",
    "StatusTypeID": 50,
    "DateLastStatusUpdate": "2020-04-05T05:26:00Z",
    "DataQualityLevel": 1,
    "DateCreated": "2019-07-16T08:28:00Z",
    "SubmissionStatusTypeID": 200
}