{
    "IsRecentlyVerified": false,
    "ID": 175692,
    "UUID": "1A50FEF7-F153-407E-A6D9-FC7D06F26D5A",
    "DataProviderID": 1,
    "OperatorID": 45,
    "UsageTypeID": 1,
    "UsageCost": "Kostenlos",
    "AddressInfo": {
        "ID": 176051,
        "Title": "Dassower Straße",
        "AddressLine1": "Dassower Straße 3",
        "Town": "Kalkhorst",
        "StateOrProvince": "Mecklenburg-Vorpommern",
        "Postcode": "23942",
        "CountryID": 87,
        "Latitude": 53.956582018287975,
        "Longitude": 11.020486579287308,
        "ContactTelephone1": "01714115771",
        "RelatedURL": "http://www.windpark-kalkhorst.de/",
        "DistanceUnit": 0
    },
    "Connections": [
        {
            "ID": 272806,
            "ConnectionTypeID": 0,
            "StatusTypeID": 50,
            "LevelID": 2,
            "Amps": 32,
            "Voltage": 400,
            "PowerKW": 22,
            "CurrentTypeID": 20,
            "Quantity": 1
        }
    ],
    "NumberOfPoints": 1,
    "GeneralComments": "24/7 nutzbare wallb-e Box am grünen Schild Stromtankstelle. Alles kostenlos!",
    "StatusTypeID": 50,
    "DateLastStatusUpdate": "2021-06-07T10:17:00Z",
    "DataQualityLevel": 1,
    "DateCreated": "2021-06-07T10:17:00Z",
    "SubmissionStatusTypeID": 200
}