{
    "IsRecentlyVerified": false,
    "ID": 178253,
    "UUID": "39DE0EBF-8050-4D55-BB0D-F1A2DE33ED5C",
    "DataProviderID": 29,
    "DataProvidersReference": "10932",
    "OperatorID": 69,
    "AddressInfo": {
        "ID": 178612,
        "Title": "Alfred-Schmidt-Str. 34",
        "AddressLine1": "Alfred-Schmidt-Str. 34",
        "Town": "München",
        "Postcode": "81379",
        "CountryID": 87,
        "Latitude": 48.102953,
        "Longitude": 11.546325,
        "DistanceUnit": 0
    },
    "Connections": [
        {
            "ID": 278416,
            "ConnectionTypeID": 25,
            "StatusTypeID": 50,
            "LevelID": 2,
            "PowerKW": 22,
            "CurrentTypeID": 20
        },
        {
            "ID": 278417,
            "ConnectionTypeID": 25,
            "StatusTypeID": 50,
            "LevelID": 2,
            "PowerKW": 22,
            "CurrentTypeID": 20
        }
    ],
    "StatusTypeID": 0,
    "DateLastStatusUpdate": "2021-07-12T02:40:00Z",
    "MetadataValues": [
        {
            "ID": 10547,
            "MetadataFieldID": 4,
            "ItemValue": "Data from the German chargepoint registry provided by Bundesnetzagentur.de under the CC-BY 4.0 license"
        }
    ],
    "DataQualityLevel": 3,
    "DateCreated": "2021-07-08T09:49:00Z",
    "SubmissionStatusTypeID": 100
}