{
    "IsRecentlyVerified": false,
    "ID": 98172,
    "UUID": "AD439859-E355-4247-9A5C-DADAC5E4235E",
    "DataProviderID": 1,
    "OperatorID": 86,
    "UsageTypeID": 4,
    "AddressInfo": {
        "ID": 98518,
        "Title": "Rasthof Rölvedermühle West",
        "AddressLine1": "A 45",
        "Town": "Schalksmühle",
        "StateOrProvince": "Hagen",
        "Postcode": "58579",
        "CountryID": 87,
        "Latitude": 51.288155643113726,
        "Longitude": 7.5685552410003565,
        "AccessComments": "24/7 verfügbar",
        "RelatedURL": "http://www.allego.eu/de",
        "DistanceUnit": 0
    },
    "Connections": [
        {
            "ID": 139090,
            "ConnectionTypeID": 1036,
            "StatusTypeID": 50,
            "LevelID": 2,
            "Amps": 32,
            "Voltage": 400,
            "PowerKW": 22,
            "CurrentTypeID": 20,
            "Quantity": 1
        },
        {
            "ID": 139091,
            "ConnectionTypeID": 2,
            "StatusTypeID": 50,
            "LevelID": 3,
            "PowerKW": 50,
            "CurrentTypeID": 30,
            "Quantity": 1
        },
        {
            "ID": 139092,
            "ConnectionTypeID": 33,
            "StatusTypeID": 50,
            "LevelID": 3,
            "PowerKW": 50,
            "CurrentTypeID": 30,
            "Quantity": 1
        }
    ],
    "NumberOfPoints": 3,
    "StatusTypeID": 50,
    "DateLastStatusUpdate": "2018-01-22T10:04:00Z",
    "DataQualityLevel": 1,
    "DateCreated": "2018-01-22T10:04:00Z",
    "SubmissionStatusTypeID": 200
}