{
    "IsRecentlyVerified": false,
    "ID": 98146,
    "UUID": "46A0D9E1-40DB-43C8-A452-7694E847BB31",
    "DataProviderID": 1,
    "OperatorID": 156,
    "UsageTypeID": 4,
    "AddressInfo": {
        "ID": 98492,
        "Title": "Parkhaus Bahnhof",
        "AddressLine1": "Graupfortstraße 7",
        "Town": "Limburg",
        "StateOrProvince": "Landkreis Limburg-Weilburg",
        "Postcode": "65549",
        "CountryID": 87,
        "Latitude": 50.38520724206751,
        "Longitude": 8.064454242922228,
        "ContactTelephone1": "+49643129030",
        "AccessComments": "24/7 nutzbar mit 2 gebührenpflichtigen Parkplätzen",
        "RelatedURL": "http://www.evl.de/",
        "DistanceUnit": 0
    },
    "Connections": [
        {
            "ID": 139057,
            "ConnectionTypeID": 25,
            "StatusTypeID": 50,
            "LevelID": 2,
            "Amps": 16,
            "Voltage": 400,
            "PowerKW": 11,
            "CurrentTypeID": 20,
            "Quantity": 2
        }
    ],
    "NumberOfPoints": 2,
    "StatusTypeID": 50,
    "DateLastStatusUpdate": "2018-01-22T07:14:00Z",
    "DataQualityLevel": 1,
    "DateCreated": "2018-01-22T07:14:00Z",
    "SubmissionStatusTypeID": 200
}