{
    "IsRecentlyVerified": false,
    "ID": 77168,
    "UUID": "442C8770-11BD-4BAB-9457-626CD87F58AA",
    "DataProviderID": 1,
    "OperatorID": 45,
    "UsageTypeID": 6,
    "AddressInfo": {
        "ID": 77514,
        "Title": "Hotel München Palace",
        "AddressLine1": "Trogerstraße 21",
        "Town": "München",
        "StateOrProvince": "Bayern",
        "Postcode": "81675",
        "CountryID": 87,
        "Latitude": 48.14003,
        "Longitude": 11.601260000000025,
        "ContactTelephone1": "+49 8941 9710",
        "AccessComments": "Tesla Destination Charging für Gäste nach Reservierung",
        "RelatedURL": "http://hotel-muenchen-palace.de/",
        "DistanceUnit": 0
    },
    "Connections": [
        {
            "ID": 110870,
            "ConnectionTypeID": 25,
            "StatusTypeID": 50,
            "LevelID": 2,
            "Amps": 16,
            "Voltage": 400,
            "PowerKW": 11,
            "CurrentTypeID": 20,
            "Quantity": 2
        }
    ],
    "NumberOfPoints": 2,
    "StatusTypeID": 50,
    "DateLastStatusUpdate": "2017-01-05T07:34:00Z",
    "DataQualityLevel": 1,
    "DateCreated": "2017-01-05T07:34:00Z",
    "SubmissionStatusTypeID": 200
}