{
    "IsRecentlyVerified": false,
    "ID": 17485,
    "UUID": "3422EB65-1058-47EF-B1E1-7A33911CB7B0",
    "DataProviderID": 22,
    "DataProvidersReference": "106D6A60386B448F80D401758C203F54",
    "AddressInfo": {
        "ID": 17830,
        "Title": "日産サティオ高知安芸店",
        "AddressLine1": "高知県安芸市伊尾木492-15",
        "CountryID": 114,
        "Latitude": 33.4935255,
        "Longitude": 133.9245709,
        "ContactTelephone1": "0887-34-3518",
        "DistanceUnit": 0
    },
    "Connections": [
        {
            "ID": 17726,
            "ConnectionTypeID": 2,
            "LevelID": 2,
            "Amps": 100,
            "Voltage": 480,
            "PowerKW": 48,
            "Quantity": 1
        }
    ],
    "DateLastStatusUpdate": "2013-06-29T08:59:00Z",
    "DataQualityLevel": 2,
    "DateCreated": "2013-06-29T08:59:00Z",
    "SubmissionStatusTypeID": 200
}