{
    "IsRecentlyVerified": false,
    "ID": 75450,
    "UUID": "F3E3F292-93F7-44FB-ABDE-7C37B7E675D8",
    "DataProviderID": 1,
    "OperatorID": 3315,
    "OperatorsReference": "50548",
    "UsageTypeID": 4,
    "UsageCost": "Free",
    "AddressInfo": {
        "ID": 75796,
        "Title": "Deanside, Belsize Road",
        "AddressLine1": "Deanside, Belsize Road",
        "Town": "Dundee",
        "Postcode": "DD5 1NF",
        "CountryID": 1,
        "Latitude": 56.47007,
        "Longitude": -2.911415,
        "DistanceUnit": 0
    },
    "Connections": [
        {
            "ID": 108765,
            "ConnectionTypeID": 25,
            "StatusTypeID": 50,
            "LevelID": 2,
            "Amps": 32,
            "Voltage": 230,
            "PowerKW": 7,
            "CurrentTypeID": 10,
            "Quantity": 2
        }
    ],
    "NumberOfPoints": 2,
    "StatusTypeID": 50,
    "DateLastStatusUpdate": "2018-06-09T05:29:00Z",
    "DataQualityLevel": 1,
    "DateCreated": "2016-12-14T23:28:00Z",
    "SubmissionStatusTypeID": 200
}