{
    "IsRecentlyVerified": false,
    "ID": 177132,
    "UUID": "C4F65FD7-F678-413D-B5A8-05FE9AA5C719",
    "DataProviderID": 29,
    "DataProvidersReference": "1296",
    "OperatorID": 103,
    "AddressInfo": {
        "ID": 177491,
        "Title": "Klaus-Conrad-Straße 2 A",
        "AddressLine1": "Klaus-Conrad-Straße 2 A",
        "Town": "Wernberg-Köblitz",
        "Postcode": "92533",
        "CountryID": 87,
        "Latitude": 49.532213,
        "Longitude": 12.1353,
        "DistanceUnit": 0
    },
    "Connections": [
        {
            "ID": 275908,
            "ConnectionTypeID": 33,
            "StatusTypeID": 50,
            "LevelID": 3,
            "PowerKW": 50,
            "CurrentTypeID": 30
        },
        {
            "ID": 275909,
            "ConnectionTypeID": 2,
            "StatusTypeID": 50,
            "LevelID": 3,
            "PowerKW": 50,
            "CurrentTypeID": 30
        },
        {
            "ID": 297145,
            "ConnectionTypeID": 1036,
            "StatusTypeID": 50,
            "LevelID": 3,
            "PowerKW": 43,
            "CurrentTypeID": 20
        }
    ],
    "StatusTypeID": 0,
    "DateLastStatusUpdate": "2021-07-12T02:43:00Z",
    "MetadataValues": [
        {
            "ID": 9426,
            "MetadataFieldID": 4,
            "ItemValue": "Data from the German chargepoint registry provided by Bundesnetzagentur.de under the CC-BY 4.0 license"
        }
    ],
    "DataQualityLevel": 3,
    "DateCreated": "2021-07-08T09:48:00Z",
    "SubmissionStatusTypeID": 100
}