{
    "IsRecentlyVerified": false,
    "ID": 63777,
    "UUID": "68397D6B-D6DF-48E0-BBE3-BA7A676BE006",
    "DataProviderID": 26,
    "DataProvidersReference": "77180",
    "OperatorID": 157,
    "OperatorsReference": "NewMotion 02013964",
    "UsageCost": "0.00 jaarabonnement",
    "AddressInfo": {
        "ID": 64123,
        "Title": "Van Linschotenlaan",
        "AddressLine1": "Van Linschotenlaan",
        "Town": "Hilversum",
        "Postcode": "1212 DN",
        "CountryID": 159,
        "Latitude": 52.2167202,
        "Longitude": 5.2020552,
        "ContactTelephone1": "088 0109500",
        "RelatedURL": "http://thenewmotion.nl/",
        "DistanceUnit": 0
    },
    "Connections": [
        {
            "ID": 81465,
            "ConnectionTypeID": 25,
            "LevelID": 2,
            "PowerKW": 3.7,
            "CurrentTypeID": 10
        },
        {
            "ID": 81466,
            "ConnectionTypeID": 25,
            "LevelID": 2,
            "PowerKW": 3.7,
            "CurrentTypeID": 10
        }
    ],
    "NumberOfPoints": 1,
    "StatusTypeID": 50,
    "DateLastStatusUpdate": "2016-06-04T02:51:00Z",
    "DataQualityLevel": 3,
    "DateCreated": "2016-03-03T12:32:00Z",
    "SubmissionStatusTypeID": 100
}