{
    "UserComments": [
        {
            "ID": 17622,
            "ChargePointID": 32052,
            "CommentTypeID": 10,
            "UserName": "Erna_Schleck",
            "Comment": "Rwe Säule funktioniert einwandfrei, Mitarbeiter des Toom Baumarktes sind hilfsbereit und fahren auch das dort geparkte Firmenfahrzeug gleich weg.",
            "Rating": 4,
            "DateCreated": "2017-08-22T08:57:34.673Z",
            "User": {
                "ID": 4573,
                "Username": "Erna_Schleck"
            },
            "CheckinStatusTypeID": 10
        }
    ],
    "IsRecentlyVerified": false,
    "ID": 32052,
    "UUID": "9D160D45-EC7A-4264-AF06-484F1F36A7A5",
    "DataProviderID": 1,
    "OperatorID": 105,
    "OperatorsReference": "Essent EM-DE-09461000-01-00004",
    "UsageTypeID": 4,
    "UsageCost": "",
    "AddressInfo": {
        "ID": 32398,
        "Title": "Baumarkt Toom",
        "AddressLine1": "Geisfelder Straße 4",
        "AddressLine2": "",
        "Town": "Bamberg",
        "StateOrProvince": "",
        "Postcode": "96050",
        "CountryID": 87,
        "Latitude": 49.889829,
        "Longitude": 10.91386,
        "ContactTelephone1": "",
        "ContactTelephone2": "",
        "ContactEmail": "",
        "AccessComments": "An der Parkplatzeinfahrt rechts sind 2 reservierte Parkplätze vor einer RWE Ladesäule. Mit Twe eKwh App freischaltbar.",
        "RelatedURL": "",
        "DistanceUnit": 0
    },
    "Connections": [
        {
            "ID": 35563,
            "ConnectionTypeID": 25,
            "StatusTypeID": 50,
            "LevelID": 2,
            "Amps": 32,
            "Voltage": 400,
            "PowerKW": 22,
            "CurrentTypeID": 20,
            "Quantity": 2
        }
    ],
    "NumberOfPoints": 2,
    "GeneralComments": "",
    "StatusTypeID": 50,
    "DateLastStatusUpdate": "2017-08-22T09:01:00Z",
    "DataQualityLevel": 3,
    "DateCreated": "2015-01-09T06:03:00Z",
    "SubmissionStatusTypeID": 200
}