{
    "IsRecentlyVerified": false,
    "ID": 116914,
    "UUID": "83852F6F-15F6-40BF-AB0D-E3541ED39854",
    "DataProviderID": 1,
    "OperatorID": 32,
    "OperatorsReference": "11487",
    "UsageTypeID": 4,
    "UsageCost": "£0.108/kWh; for Polar Plus subscription members only",
    "AddressInfo": {
        "ID": 117260,
        "Title": "Future Wolverton LTD",
        "AddressLine1": "Future Wolverton LTD",
        "Town": "Old School House Community Centre",
        "StateOrProvince": "Wolverton",
        "Postcode": "MK12 5NH",
        "CountryID": 1,
        "Latitude": 52.062698,
        "Longitude": -0.8282,
        "DistanceUnit": 0
    },
    "Connections": [
        {
            "ID": 165500,
            "ConnectionTypeID": 25,
            "StatusTypeID": 50,
            "LevelID": 2,
            "Amps": 32,
            "Voltage": 230,
            "PowerKW": 7,
            "CurrentTypeID": 10,
            "Quantity": 2
        }
    ],
    "NumberOfPoints": 2,
    "GeneralComments": "Unit located in Front of the building.",
    "StatusTypeID": 50,
    "DateLastStatusUpdate": "2019-03-07T06:14:00Z",
    "DataQualityLevel": 1,
    "DateCreated": "2019-02-14T06:15:00Z",
    "SubmissionStatusTypeID": 200
}