{
    "IsRecentlyVerified": false,
    "ID": 8236,
    "UUID": "6939E6AA-BB09-44EE-822B-23A974A14738",
    "DataProviderID": 15,
    "DataProvidersReference": "7118",
    "OperatorID": 26,
    "AddressInfo": {
        "ID": 8133,
        "Title": "1025 E Bismarck Expy",
        "AddressLine1": "1025 E Bismarck Expy",
        "Town": "Bismarck",
        "StateOrProvince": "ND",
        "Postcode": "58504",
        "CountryID": 2,
        "Latitude": 46.79477,
        "Longitude": -100.77563,
        "ContactTelephone1": " (701) 258-1944",
        "RelatedURL": "http://carstations.com/7118",
        "DistanceUnit": 0
    },
    "Connections": [
        {
            "ID": 5665,
            "ConnectionTypeID": 1,
            "Reference": "J1772",
            "LevelID": 2
        }
    ],
    "StatusTypeID": 0,
    "DateLastStatusUpdate": "2017-11-04T14:05:00Z",
    "DataQualityLevel": 1,
    "DateCreated": "2011-11-11T12:06:00Z",
    "SubmissionStatusTypeID": 100
}