{
    "IsRecentlyVerified": false,
    "ID": 35912,
    "UUID": "6E547310-43B9-41D5-84FB-C8308A65A106",
    "DataProviderID": 26,
    "DataProvidersReference": "54117",
    "OperatorID": 180,
    "OperatorsReference": "Alfen GDH2422",
    "UsageCost": "0.00 jaarabonnement",
    "AddressInfo": {
        "ID": 36258,
        "Title": "De Sillestraat",
        "AddressLine1": "De Sillestraat",
        "Town": "Den Haag",
        "Postcode": "2593 VE",
        "CountryID": 159,
        "Latitude": 52.086633,
        "Longitude": 4.347089,
        "ContactTelephone1": "036 - 549 34 00",
        "RelatedURL": "http://www.icu-charging-stations.com/",
        "DistanceUnit": 0
    },
    "Connections": [
        {
            "ID": 39423,
            "ConnectionTypeID": 25,
            "LevelID": 2,
            "PowerKW": 11,
            "CurrentTypeID": 10
        },
        {
            "ID": 48113,
            "ConnectionTypeID": 25,
            "LevelID": 2,
            "PowerKW": 11,
            "CurrentTypeID": 10
        }
    ],
    "NumberOfPoints": 1,
    "StatusTypeID": 50,
    "DateLastStatusUpdate": "2016-06-04T02:50:00Z",
    "DataQualityLevel": 3,
    "DateCreated": "2015-01-09T06:05:00Z",
    "SubmissionStatusTypeID": 100
}