{
    "IsRecentlyVerified": false,
    "ID": 57042,
    "UUID": "75EDF954-260B-4690-9C49-F970DEBF0D7A",
    "DataProviderID": 1,
    "OperatorID": 69,
    "UsageTypeID": 4,
    "UsageCost": "",
    "AddressInfo": {
        "ID": 57388,
        "Title": "SWM Zentrale",
        "AddressLine1": "Agnes-Pockels-Bogen",
        "AddressLine2": "",
        "Town": "München",
        "StateOrProvince": "Bayern",
        "Postcode": "80992",
        "CountryID": 87,
        "Latitude": 48.17321930585383,
        "Longitude": 11.532415151596068,
        "ContactTelephone1": "+49 89 3810101",
        "ContactTelephone2": "",
        "ContactEmail": "",
        "AccessComments": "2 kostenlose 24/7 nutzbare Ladeplätze. Ladekarte der SWM im Verbund Ladenetz oder Roamingpartnern Charge&Pay, SUN, Vattenfall, The New Motion o.a. nötig.",
        "RelatedURL": "http://www.swm.de/",
        "DistanceUnit": 0
    },
    "Connections": [
        {
            "ID": 72052,
            "ConnectionTypeID": 25,
            "StatusTypeID": 50,
            "LevelID": 2,
            "Amps": 32,
            "Voltage": 400,
            "PowerKW": 22,
            "CurrentTypeID": 20,
            "Quantity": 2
        },
        {
            "ID": 72053,
            "ConnectionTypeID": 28,
            "StatusTypeID": 50,
            "LevelID": 2,
            "Amps": 16,
            "Voltage": 230,
            "PowerKW": 3.7,
            "CurrentTypeID": 10,
            "Quantity": 2
        }
    ],
    "NumberOfPoints": 2,
    "GeneralComments": "",
    "StatusTypeID": 50,
    "DateLastStatusUpdate": "2016-12-13T11:44:00Z",
    "DataQualityLevel": 1,
    "DateCreated": "2015-11-21T10:16:00Z",
    "SubmissionStatusTypeID": 200
}