{
    "IsRecentlyVerified": false,
    "ID": 128125,
    "UUID": "6908597B-8C38-4E1D-A1DD-787EC4DB0B70",
    "DataProviderID": 1,
    "OperatorID": 23,
    "OperatorsReference": "46179",
    "UsageTypeID": 6,
    "AddressInfo": {
        "ID": 128471,
        "Title": "Wellness Hotel Babylon",
        "AddressLine1": "Nitranska 1",
        "Town": "Liberec",
        "Postcode": "460 12",
        "CountryID": 64,
        "Latitude": 50.758842,
        "Longitude": 15.051705,
        "ContactTelephone1": "+42 0485 249593",
        "DistanceUnit": 0
    },
    "Connections": [
        {
            "ID": 179296,
            "ConnectionTypeID": 30,
            "StatusTypeID": 50,
            "LevelID": 2,
            "PowerKW": 14,
            "CurrentTypeID": 20,
            "Quantity": 2
        }
    ],
    "NumberOfPoints": 2,
    "GeneralComments": "2 Tesla Connectors, up to 14kW.Available for patrons only. Self park.",
    "StatusTypeID": 50,
    "DateLastStatusUpdate": "2019-06-15T06:23:00Z",
    "DataQualityLevel": 1,
    "DateCreated": "2019-06-15T06:23:00Z",
    "SubmissionStatusTypeID": 200
}