{
    "IsRecentlyVerified": false,
    "ID": 176050,
    "UUID": "4E8EC312-604D-4BD8-B3B1-AFEB782F5BF2",
    "DataProviderID": 1,
    "DataProvidersReference": "7",
    "OperatorID": 3425,
    "UsageTypeID": 1,
    "AddressInfo": {
        "ID": 176409,
        "Title": "ART NOUVEAU PALACE HOTEL",
        "AddressLine1": "Panská 897/12",
        "Town": "110 00  Praha",
        "CountryID": 64,
        "Latitude": 50.084103,
        "Longitude": 14.427439,
        "DistanceUnit": 0
    },
    "Connections": [
        {
            "ID": 273498,
            "ConnectionTypeID": 25,
            "LevelID": 2,
            "Amps": 32,
            "Voltage": 230,
            "PowerKW": 22
        },
        {
            "ID": 273773,
            "ConnectionTypeID": 1,
            "StatusTypeID": 50,
            "LevelID": 2,
            "Amps": 32,
            "Voltage": 230,
            "PowerKW": 22,
            "Quantity": 1
        }
    ],
    "NumberOfPoints": 2,
    "StatusTypeID": 50,
    "DateLastStatusUpdate": "2021-06-29T09:11:00Z",
    "DataQualityLevel": 3,
    "DateCreated": "2021-06-24T08:43:00Z",
    "SubmissionStatusTypeID": 200
}