{
    "IsRecentlyVerified": false,
    "ID": 71128,
    "UUID": "592A9899-7083-48A8-B150-9B31E263EC8C",
    "DataProviderID": 1,
    "OperatorID": 23,
    "OperatorsReference": "19551",
    "UsageTypeID": 6,
    "UsageCost": "Free",
    "AddressInfo": {
        "ID": 71474,
        "Title": "Una Poggio Dei Medici",
        "AddressLine1": "Via di S. Gavino, 27",
        "AddressLine2": "località Gabbiano",
        "Town": "San Piero a Sieve",
        "StateOrProvince": "FI",
        "Postcode": "50038 ",
        "CountryID": 112,
        "Latitude": 43.9963308081748,
        "Longitude": 11.3313499702774,
        "ContactTelephone1": "+39 055 84350",
        "ContactEmail": "una.poggiodeimedici@unahotels.it",
        "RelatedURL": "http://www.unahotels.it/it/una_poggio_dei_medici/hotel_toscana_golf.htm",
        "DistanceUnit": 0
    },
    "Connections": [
        {
            "ID": 101918,
            "ConnectionTypeID": 30,
            "StatusTypeID": 50,
            "LevelID": 2,
            "Amps": 32,
            "Voltage": 400,
            "PowerKW": 22,
            "CurrentTypeID": 20,
            "Quantity": 1
        }
    ],
    "NumberOfPoints": 1,
    "GeneralComments": "Tesla Destination Charger",
    "StatusTypeID": 50,
    "DateLastStatusUpdate": "2018-10-03T23:49:00Z",
    "DataQualityLevel": 1,
    "DateCreated": "2016-08-30T15:49:00Z",
    "SubmissionStatusTypeID": 200
}