{
    "IsRecentlyVerified": false,
    "ID": 182039,
    "UUID": "BC6660BD-A2E4-4468-9916-BF04A9C48936",
    "DataProviderID": 29,
    "DataProvidersReference": "20697",
    "OperatorID": 103,
    "AddressInfo": {
        "ID": 182398,
        "Title": "Berliner Straße 61",
        "AddressLine1": "Berliner Straße 61",
        "Town": "Halle/Saale ",
        "Postcode": "06116",
        "CountryID": 87,
        "Latitude": 51.495797,
        "Longitude": 12.010145,
        "DistanceUnit": 0
    },
    "Connections": [
        {
            "ID": 287271,
            "ConnectionTypeID": 33,
            "StatusTypeID": 50,
            "LevelID": 3,
            "PowerKW": 50,
            "CurrentTypeID": 30
        },
        {
            "ID": 287272,
            "ConnectionTypeID": 2,
            "StatusTypeID": 50,
            "LevelID": 3,
            "PowerKW": 50,
            "CurrentTypeID": 30
        },
        {
            "ID": 299522,
            "ConnectionTypeID": 1036,
            "StatusTypeID": 50,
            "LevelID": 3,
            "PowerKW": 43,
            "CurrentTypeID": 20
        }
    ],
    "StatusTypeID": 50,
    "DateLastStatusUpdate": "2021-07-12T02:47:00Z",
    "MetadataValues": [
        {
            "ID": 14333,
            "MetadataFieldID": 4,
            "ItemValue": "Data from the German chargepoint registry provided by Bundesnetzagentur.de under the CC-BY 4.0 license"
        }
    ],
    "DataQualityLevel": 3,
    "DateCreated": "2021-07-08T10:02:00Z",
    "SubmissionStatusTypeID": 100
}