{
    "IsRecentlyVerified": false,
    "ID": 176982,
    "UUID": "22CEF1F2-A6B5-4679-84A1-0A255BD2A9E3",
    "DataProviderID": 29,
    "DataProvidersReference": "9367",
    "AddressInfo": {
        "ID": 177341,
        "Title": "Am Banhof 8",
        "AddressLine1": "Am Banhof 8",
        "Town": "March",
        "Postcode": "79232",
        "CountryID": 87,
        "Latitude": 48.0478,
        "Longitude": 7.78543,
        "DistanceUnit": 0
    },
    "Connections": [
        {
            "ID": 275587,
            "ConnectionTypeID": 28,
            "StatusTypeID": 50,
            "LevelID": 2,
            "PowerKW": 22,
            "CurrentTypeID": 10
        },
        {
            "ID": 275588,
            "ConnectionTypeID": 28,
            "StatusTypeID": 50,
            "LevelID": 2,
            "PowerKW": 22,
            "CurrentTypeID": 10
        }
    ],
    "StatusTypeID": 0,
    "DateLastStatusUpdate": "2021-07-09T03:11:00Z",
    "MetadataValues": [
        {
            "ID": 9276,
            "MetadataFieldID": 4,
            "ItemValue": "Data from the German chargepoint registry provided by Bundesnetzagentur.de under the CC-BY 4.0 license"
        }
    ],
    "DataQualityLevel": 3,
    "DateCreated": "2021-07-08T09:48:00Z",
    "SubmissionStatusTypeID": 100
}