{
    "IsRecentlyVerified": false,
    "ID": 161733,
    "UUID": "763B0EE9-8C5E-4F70-ADDD-4DB0312E6802",
    "DataProviderID": 1,
    "OperatorID": 21,
    "UsageTypeID": 4,
    "UsageCost": "Mobi.E card or App",
    "AddressInfo": {
        "ID": 162090,
        "Title": "LGA-00008 - Auchan ",
        "AddressLine1": "",
        "Town": "Lagoa",
        "StateOrProvince": "Algarve",
        "Postcode": "8400",
        "CountryID": 180,
        "Latitude": 37.13718283366744,
        "Longitude": -8.464273194632256,
        "DistanceUnit": 0
    },
    "Connections": [
        {
            "ID": 232722,
            "ConnectionTypeID": 2,
            "StatusTypeID": 50,
            "LevelID": 3,
            "Amps": 120,
            "Voltage": 500,
            "PowerKW": 50,
            "CurrentTypeID": 30,
            "Quantity": 1
        },
        {
            "ID": 232723,
            "ConnectionTypeID": 33,
            "StatusTypeID": 50,
            "LevelID": 3,
            "Amps": 125,
            "Voltage": 500,
            "PowerKW": 50,
            "CurrentTypeID": 30,
            "Quantity": 1
        },
        {
            "ID": 232724,
            "ConnectionTypeID": 1036,
            "StatusTypeID": 50,
            "LevelID": 3,
            "Amps": 64,
            "Voltage": 400,
            "PowerKW": 43,
            "CurrentTypeID": 20,
            "Quantity": 1
        }
    ],
    "NumberOfPoints": 2,
    "StatusTypeID": 50,
    "DateLastStatusUpdate": "2021-08-08T13:46:00Z",
    "DataQualityLevel": 1,
    "DateCreated": "2020-07-22T10:03:00Z",
    "SubmissionStatusTypeID": 200
}