{
    "IsRecentlyVerified": false,
    "ID": 15627,
    "UUID": "42D71CB3-7DE2-4C4F-9F65-F1E3AE6398B9",
    "DataProviderID": 1,
    "OperatorID": 45,
    "UsageTypeID": 1,
    "UsageCost": "Free",
    "AddressInfo": {
        "ID": 15972,
        "Title": "Solarchargepoint Michelhausen",
        "AddressLine1": "Ecke Friedhofgasse / Kindergartengasse -- Crossing Friedhofgasse and Kindergartengasse",
        "AddressLine2": "",
        "Town": "Michelhausen",
        "StateOrProvince": "NOE",
        "Postcode": "A-3451",
        "CountryID": 19,
        "Latitude": 48.17227,
        "Longitude": 15.562871,
        "ContactTelephone1": "+43-2275-5241",
        "ContactTelephone2": "",
        "ContactEmail": "",
        "AccessComments": "Open 0-24h / Immer geöffnet",
        "RelatedURL": "http://www.michelhausen.at",
        "DistanceUnit": 0
    },
    "Connections": [
        {
            "ID": 13943,
            "ConnectionTypeID": 28,
            "StatusTypeID": 50,
            "LevelID": 2,
            "Amps": 16,
            "Voltage": 230,
            "PowerKW": 3.7,
            "Quantity": 2
        },
        {
            "ID": 13944,
            "ConnectionTypeID": 0,
            "StatusTypeID": 50,
            "Quantity": 1
        },
        {
            "ID": 13945,
            "ConnectionTypeID": 0,
            "StatusTypeID": 50,
            "Quantity": 1
        }
    ],
    "NumberOfPoints": 1,
    "GeneralComments": "",
    "StatusTypeID": 50,
    "DateLastStatusUpdate": "2013-01-19T19:34:00Z",
    "DataQualityLevel": 1,
    "DateCreated": "2013-01-17T20:49:00Z",
    "SubmissionStatusTypeID": 200
}