{
    "IsRecentlyVerified": false,
    "ID": 151448,
    "UUID": "8346F408-0FFC-492D-B56A-772EC583C236",
    "DataProviderID": 28,
    "DataProvidersReference": "FR*S05*P05040*A",
    "OperatorID": 3408,
    "UsageTypeID": 5,
    "AddressInfo": {
        "ID": 151801,
        "Title": "CHORGES_Place du Grand Logis",
        "AddressLine1": "Place du Grand Logis 05230 CHORGES",
        "CountryID": 80,
        "Latitude": 44.547316,
        "Longitude": 6.277534,
        "AccessComments": "24/24 7/7 jours",
        "DistanceUnit": 0
    },
    "Connections": [
        {
            "ID": 211514,
            "ConnectionTypeID": 28,
            "StatusTypeID": 50,
            "LevelID": 2,
            "PowerKW": 22,
            "CurrentTypeID": 10
        },
        {
            "ID": 211515,
            "ConnectionTypeID": 1036,
            "StatusTypeID": 50,
            "LevelID": 2,
            "PowerKW": 22,
            "CurrentTypeID": 20
        },
        {
            "ID": 242228,
            "ConnectionTypeID": 28,
            "StatusTypeID": 50,
            "LevelID": 2,
            "PowerKW": 22,
            "CurrentTypeID": 10
        },
        {
            "ID": 242229,
            "ConnectionTypeID": 1036,
            "StatusTypeID": 50,
            "LevelID": 2,
            "PowerKW": 22,
            "CurrentTypeID": 20
        }
    ],
    "GeneralComments": "",
    "StatusTypeID": 50,
    "DateLastStatusUpdate": "2020-08-27T05:11:00Z",
    "DataQualityLevel": 2,
    "DateCreated": "2020-03-15T10:53:00Z",
    "SubmissionStatusTypeID": 100
}