{
    "IsRecentlyVerified": false,
    "ID": 28514,
    "UUID": "85C8F6E4-0C68-4D35-A33D-D91442E0C589",
    "DataProviderID": 2,
    "DataProvidersReference": "60757",
    "UsageTypeID": 1,
    "AddressInfo": {
        "ID": 28860,
        "Title": "Tri-Town Teachers Federal Credit Union",
        "AddressLine1": "61 Jessup Rd",
        "Town": "Westport",
        "StateOrProvince": "CT",
        "Postcode": "06880",
        "CountryID": 2,
        "Latitude": 41.140188,
        "Longitude": -73.358893,
        "ContactTelephone1": "877-315-8480",
        "AccessComments": "24 hours daily",
        "RelatedURL": "",
        "DistanceUnit": 0
    },
    "Connections": [
        {
            "ID": 31335,
            "ConnectionTypeID": 1,
            "LevelID": 2,
            "Amps": 16,
            "Voltage": 230,
            "PowerKW": 3.7,
            "CurrentTypeID": 10,
            "Quantity": 2
        }
    ],
    "DateLastStatusUpdate": "2020-06-26T03:04:00Z",
    "DataQualityLevel": 3,
    "DateCreated": "2014-11-28T03:38:00Z",
    "SubmissionStatusTypeID": 100
}