{
    "IsRecentlyVerified": false,
    "ID": 36210,
    "UUID": "628E6248-C054-4E4D-9AD3-1D05994C0B2C",
    "DataProviderID": 1,
    "OperatorID": 105,
    "OperatorsReference": "Essent EM-DE-03459015-01-00001",
    "UsageTypeID": 4,
    "AddressInfo": {
        "ID": 36556,
        "Title": "Bahnhofstraße 59",
        "AddressLine1": "Bahnhofstraße 59",
        "Town": "Dissen a.T.W.",
        "Postcode": "49201",
        "CountryID": 87,
        "Latitude": 52.112733,
        "Longitude": 8.18335,
        "DistanceUnit": 0
    },
    "Connections": [
        {
            "ID": 39721,
            "ConnectionTypeID": 25,
            "LevelID": 2,
            "PowerKW": 11
        },
        {
            "ID": 48284,
            "ConnectionTypeID": 25,
            "LevelID": 2,
            "PowerKW": 11
        }
    ],
    "NumberOfPoints": 1,
    "StatusTypeID": 50,
    "DateLastStatusUpdate": "2015-04-12T21:42:00Z",
    "DataQualityLevel": 3,
    "DateCreated": "2015-01-09T06:05:00Z",
    "SubmissionStatusTypeID": 200
}