{
    "IsRecentlyVerified": false,
    "ID": 35792,
    "UUID": "653B0979-B768-4824-BE6B-B4BFB4671DF9",
    "DataProviderID": 26,
    "DataProvidersReference": "56012",
    "OperatorID": 180,
    "OperatorsReference": "Alfen GDH2512",
    "UsageCost": "0.00 jaarabonnement",
    "AddressInfo": {
        "ID": 36138,
        "Title": "Wilgstraat 59",
        "AddressLine1": "Wilgstraat 59",
        "Town": "Den Haag",
        "Postcode": "2565 MB",
        "CountryID": 159,
        "Latitude": 52.080101,
        "Longitude": 4.271785,
        "ContactTelephone1": "036 - 549 34 00",
        "RelatedURL": "http://www.icu-charging-stations.com/",
        "DistanceUnit": 0
    },
    "Connections": [
        {
            "ID": 39303,
            "ConnectionTypeID": 25,
            "LevelID": 2,
            "PowerKW": 11,
            "CurrentTypeID": 10
        },
        {
            "ID": 48062,
            "ConnectionTypeID": 25,
            "LevelID": 2,
            "PowerKW": 11,
            "CurrentTypeID": 10
        }
    ],
    "NumberOfPoints": 1,
    "StatusTypeID": 50,
    "DateLastStatusUpdate": "2016-06-04T02:49:00Z",
    "DataQualityLevel": 3,
    "DateCreated": "2015-01-09T06:05:00Z",
    "SubmissionStatusTypeID": 100
}