{
    "IsRecentlyVerified": false,
    "ID": 80312,
    "UUID": "D73DF3FD-BF18-4542-813A-C1B99A547A72",
    "DataProviderID": 2,
    "DataProvidersReference": "80624",
    "UsageTypeID": 7,
    "AddressInfo": {
        "ID": 80658,
        "Title": "Cascade Audi",
        "AddressLine1": "4151 State Rd",
        "Town": "Cuyahoga Falls",
        "StateOrProvince": "OH",
        "Postcode": "44223",
        "CountryID": 2,
        "Latitude": 41.18485,
        "Longitude": -81.508228,
        "ContactTelephone1": "888-415-1142",
        "AccessComments": "24 hours daily\r\nPublic - Call ahead",
        "RelatedURL": "",
        "DistanceUnit": 0
    },
    "Connections": [
        {
            "ID": 114986,
            "ConnectionTypeID": 1,
            "LevelID": 2,
            "Amps": 16,
            "Voltage": 230,
            "PowerKW": 3.7,
            "CurrentTypeID": 10,
            "Quantity": 1
        }
    ],
    "DateLastStatusUpdate": "2020-06-26T03:04:00Z",
    "DataQualityLevel": 3,
    "DateCreated": "2017-01-31T01:05:00Z",
    "SubmissionStatusTypeID": 100
}