{
    "IsRecentlyVerified": false,
    "ID": 186115,
    "UUID": "5B99604F-666E-43C7-9F98-20DA08EDA6E1",
    "DataProviderID": 29,
    "DataProvidersReference": "1165",
    "AddressInfo": {
        "ID": 186474,
        "Title": "Mauerstraße",
        "AddressLine1": "Mauerstraße",
        "Town": "Weilburg",
        "Postcode": "35781",
        "CountryID": 87,
        "Latitude": 50.484211,
        "Longitude": 8.259067,
        "DistanceUnit": 0
    },
    "Connections": [
        {
            "ID": 297821,
            "ConnectionTypeID": 25,
            "StatusTypeID": 50,
            "LevelID": 2,
            "PowerKW": 22,
            "CurrentTypeID": 20
        },
        {
            "ID": 297822,
            "ConnectionTypeID": 25,
            "StatusTypeID": 50,
            "LevelID": 2,
            "PowerKW": 22,
            "CurrentTypeID": 20
        }
    ],
    "StatusTypeID": 50,
    "DateLastStatusUpdate": "2021-07-12T02:45:00Z",
    "MetadataValues": [
        {
            "ID": 18357,
            "MetadataFieldID": 4,
            "ItemValue": "Data from the German chargepoint registry provided by Bundesnetzagentur.de under the CC-BY 4.0 license"
        }
    ],
    "DataQualityLevel": 3,
    "DateCreated": "2021-07-12T02:45:00Z",
    "SubmissionStatusTypeID": 100
}