{
    "IsRecentlyVerified": false,
    "ID": 179558,
    "UUID": "0E048CD3-19C8-422E-BDDE-092CCB91DB02",
    "DataProviderID": 29,
    "DataProvidersReference": "13844,9633",
    "OperatorID": 234,
    "AddressInfo": {
        "ID": 179917,
        "Title": "Rothenburger Str. 11",
        "AddressLine1": "Rothenburger Str. 11",
        "Town": "Colmberg",
        "Postcode": "91598",
        "CountryID": 87,
        "Latitude": 49.35567,
        "Longitude": 10.40809,
        "DistanceUnit": 0
    },
    "Connections": [
        {
            "ID": 281533,
            "ConnectionTypeID": 25,
            "StatusTypeID": 50,
            "LevelID": 2,
            "PowerKW": 22,
            "CurrentTypeID": 20
        },
        {
            "ID": 281534,
            "ConnectionTypeID": 25,
            "StatusTypeID": 50,
            "LevelID": 2,
            "PowerKW": 22,
            "CurrentTypeID": 20
        },
        {
            "ID": 281535,
            "ConnectionTypeID": 25,
            "StatusTypeID": 50,
            "LevelID": 2,
            "PowerKW": 22,
            "CurrentTypeID": 20
        },
        {
            "ID": 281536,
            "ConnectionTypeID": 25,
            "StatusTypeID": 50,
            "LevelID": 2,
            "PowerKW": 22,
            "CurrentTypeID": 20
        }
    ],
    "StatusTypeID": 50,
    "DateLastStatusUpdate": "2021-07-09T03:16:00Z",
    "MetadataValues": [
        {
            "ID": 11852,
            "MetadataFieldID": 4,
            "ItemValue": "Data from the German chargepoint registry provided by Bundesnetzagentur.de under the CC-BY 4.0 license"
        }
    ],
    "DataQualityLevel": 3,
    "DateCreated": "2021-07-08T09:59:00Z",
    "SubmissionStatusTypeID": 100
}