{
    "IsRecentlyVerified": false,
    "ID": 15411,
    "UUID": "D381DF93-EC7C-4B94-9C40-A454C5F3DDA4",
    "DataProviderID": 1,
    "OperatorID": 51,
    "UsageTypeID": 0,
    "UsageCost": "Free",
    "AddressInfo": {
        "ID": 15757,
        "Title": "Sun Country Highway",
        "AddressLine1": "7600 London Road",
        "AddressLine2": "",
        "Town": "Brucefield",
        "StateOrProvince": "ON",
        "Postcode": "N0M 1J0",
        "CountryID": 44,
        "Latitude": 43.5255929,
        "Longitude": -81.51735080000003,
        "ContactTelephone1": "",
        "ContactTelephone2": "",
        "ContactEmail": "",
        "AccessComments": "",
        "RelatedURL": "",
        "DistanceUnit": 0
    },
    "Connections": [
        {
            "ID": 13719,
            "ConnectionTypeID": 1,
            "StatusTypeID": 0,
            "LevelID": 2,
            "Amps": 72,
            "Voltage": 240,
            "PowerKW": 17.3,
            "Quantity": 1
        }
    ],
    "NumberOfPoints": 1,
    "GeneralComments": "",
    "StatusTypeID": 50,
    "DateLastStatusUpdate": "2013-01-09T15:28:00Z",
    "DataQualityLevel": 1,
    "DateCreated": "2013-01-09T15:28:00Z",
    "SubmissionStatusTypeID": 200
}