{
    "IsRecentlyVerified": false,
    "ID": 137550,
    "UUID": "A248415D-F90D-4F8E-9ABF-99B66EBE03E4",
    "DataProviderID": 2,
    "DataProvidersReference": "145177",
    "UsageTypeID": 7,
    "AddressInfo": {
        "ID": 137896,
        "Title": "AISD Performing Arts Center",
        "AddressLine1": "1500 Barbara Jordan Blvd",
        "Town": "Austin",
        "StateOrProvince": "TX",
        "Postcode": "78723",
        "CountryID": 2,
        "Latitude": 30.304121,
        "Longitude": -97.702978,
        "ContactTelephone1": "512-414-4761",
        "AccessComments": "After school hours only\r\nPublic - Call ahead",
        "RelatedURL": "",
        "DistanceUnit": 0
    },
    "Connections": [
        {
            "ID": 192483,
            "ConnectionTypeID": 1,
            "LevelID": 2,
            "Amps": 16,
            "Voltage": 230,
            "PowerKW": 3,
            "CurrentTypeID": 10,
            "Quantity": 5
        }
    ],
    "StatusTypeID": 50,
    "DateLastStatusUpdate": "2019-12-24T09:05:00Z",
    "DataQualityLevel": 3,
    "DateCreated": "2019-12-24T09:05:00Z",
    "SubmissionStatusTypeID": 100
}