{
    "IsRecentlyVerified": false,
    "ID": 113401,
    "UUID": "9E0C993F-5D4D-47C3-86FB-DDE9503D8C37",
    "DataProviderID": 1,
    "OperatorID": 45,
    "UsageTypeID": 1,
    "AddressInfo": {
        "ID": 113747,
        "Title": "Bahnhofsplatz",
        "AddressLine1": "Bahnhofsplatz",
        "Town": "Hameln",
        "StateOrProvince": "Landkreis Hameln-Pyrmont",
        "Postcode": "31785",
        "CountryID": 87,
        "Latitude": 52.101272982618944,
        "Longitude": 9.37427262460631,
        "ContactTelephone1": "+49 5151 788-333",
        "AccessComments": "24/7 kostenlos und ohne Ladekarte nutzbare Ladesäule der GWS Stadtwerke Hameln. Die Säule steht im hintersten Winkel des Kurzparkzonenbereichs.",
        "RelatedURL": "http://stadtwerke-hameln.de/",
        "DistanceUnit": 0
    },
    "Connections": [
        {
            "ID": 159734,
            "ConnectionTypeID": 2,
            "StatusTypeID": 50,
            "LevelID": 3,
            "PowerKW": 50,
            "CurrentTypeID": 30,
            "Quantity": 1
        },
        {
            "ID": 159735,
            "ConnectionTypeID": 33,
            "StatusTypeID": 50,
            "LevelID": 3,
            "PowerKW": 50,
            "CurrentTypeID": 30,
            "Quantity": 1
        },
        {
            "ID": 159736,
            "ConnectionTypeID": 1036,
            "StatusTypeID": 50,
            "LevelID": 3,
            "Amps": 63,
            "Voltage": 400,
            "PowerKW": 43,
            "CurrentTypeID": 20,
            "Quantity": 1
        }
    ],
    "NumberOfPoints": 3,
    "GeneralComments": "Stand 10.12.18: Säule aufgestellt, geht wohl erst Anfang 2019  in Betrieb",
    "StatusTypeID": 30,
    "DateLastStatusUpdate": "2018-12-10T08:38:00Z",
    "DataQualityLevel": 1,
    "DateCreated": "2018-12-10T08:38:00Z",
    "SubmissionStatusTypeID": 200
}