{
    "IsRecentlyVerified": false,
    "ID": 67307,
    "UUID": "1238C877-1753-4F0D-9888-095793CCA77D",
    "DataProviderID": 1,
    "OperatorID": 23,
    "OperatorsReference": "14672",
    "UsageTypeID": 1,
    "UsageCost": "Free",
    "AddressInfo": {
        "ID": 67653,
        "Title": "Inn at Herr Ridge - Tesla",
        "AddressLine1": "900 Chambersburg Rd",
        "Town": "Gettysburg",
        "StateOrProvince": "PA",
        "Postcode": "17325",
        "CountryID": 2,
        "Latitude": 39.8423436,
        "Longitude": -77.2618187,
        "ContactTelephone1": "717-334-4332  877-798-3752",
        "AccessComments": "24 hours daily; for Tesla use only; for guest use only; see front desk for access",
        "RelatedURL": "http://www.teslamotors.com/supercharger",
        "DistanceUnit": 0
    },
    "Connections": [
        {
            "ID": 92809,
            "ConnectionTypeID": 30,
            "StatusTypeID": 50,
            "LevelID": 2,
            "Amps": 16,
            "Voltage": 230,
            "PowerKW": 8,
            "CurrentTypeID": 10,
            "Quantity": 1
        }
    ],
    "NumberOfPoints": 1,
    "StatusTypeID": 50,
    "DateLastStatusUpdate": "2017-01-26T01:28:00Z",
    "DataQualityLevel": 3,
    "DateCreated": "2016-05-29T02:05:00Z",
    "SubmissionStatusTypeID": 100
}