{
    "IsRecentlyVerified": false,
    "ID": 183351,
    "UUID": "B3FF7444-1F41-4154-B989-4272E03DE9FE",
    "DataProviderID": 29,
    "DataProvidersReference": "12264",
    "OperatorID": 69,
    "AddressInfo": {
        "ID": 183710,
        "Title": "Badtsraße 13",
        "AddressLine1": "Badtsraße 13",
        "Town": "Nürtingen",
        "Postcode": "72622",
        "CountryID": 87,
        "Latitude": 48.6321,
        "Longitude": 9.32724,
        "DistanceUnit": 0
    },
    "Connections": [
        {
            "ID": 290232,
            "ConnectionTypeID": 25,
            "StatusTypeID": 50,
            "LevelID": 2,
            "PowerKW": 22,
            "CurrentTypeID": 20
        },
        {
            "ID": 290233,
            "ConnectionTypeID": 25,
            "StatusTypeID": 50,
            "LevelID": 2,
            "PowerKW": 22,
            "CurrentTypeID": 20
        }
    ],
    "StatusTypeID": 50,
    "DateLastStatusUpdate": "2021-07-12T02:41:00Z",
    "MetadataValues": [
        {
            "ID": 15644,
            "MetadataFieldID": 4,
            "ItemValue": "Data from the German chargepoint registry provided by Bundesnetzagentur.de under the CC-BY 4.0 license"
        }
    ],
    "DataQualityLevel": 3,
    "DateCreated": "2021-07-08T10:03:00Z",
    "SubmissionStatusTypeID": 100
}