{
    "IsRecentlyVerified": false,
    "ID": 104403,
    "UUID": "0CC7A592-7C48-4E4D-9F6A-D382E4D60CE7",
    "DataProviderID": 1,
    "OperatorID": 23,
    "OperatorsReference": "43206",
    "UsageTypeID": 4,
    "AddressInfo": {
        "ID": 104749,
        "Title": "Harlingen Garden Apartment",
        "AddressLine1": "Harlingersstraatweg 52a",
        "Town": "Midlum",
        "Postcode": "8872NB",
        "CountryID": 159,
        "Latitude": 53.182109,
        "Longitude": 5.434368,
        "ContactTelephone1": "+31610951274",
        "DistanceUnit": 0
    },
    "Connections": [
        {
            "ID": 147398,
            "ConnectionTypeID": 30,
            "StatusTypeID": 50,
            "LevelID": 2,
            "Amps": 16,
            "Voltage": 400,
            "PowerKW": 11,
            "CurrentTypeID": 20,
            "Quantity": 1
        }
    ],
    "NumberOfPoints": 1,
    "GeneralComments": "1 Tesla Connector, up to 11kW.Available for customers. Please see front desk.",
    "StatusTypeID": 50,
    "DateLastStatusUpdate": "2018-10-03T22:10:00Z",
    "DataQualityLevel": 1,
    "DateCreated": "2018-05-20T05:30:00Z",
    "SubmissionStatusTypeID": 200
}