{
    "IsRecentlyVerified": false,
    "ID": 158811,
    "UUID": "7CB36AC1-D7F7-4532-B100-029D30778A04",
    "DataProviderID": 2,
    "DataProvidersReference": "158526",
    "OperatorID": 5,
    "UsageTypeID": 1,
    "AddressInfo": {
        "ID": 159168,
        "Title": "CY AGOURA HILLS",
        "AddressLine1": "2905 Agoura Rd",
        "Town": "Agoura Hills",
        "StateOrProvince": "CA",
        "Postcode": "91301",
        "CountryID": 2,
        "Latitude": 34.1436858,
        "Longitude": -118.7582938,
        "ContactTelephone1": "888-758-4389",
        "AccessComments": "24 hours daily",
        "RelatedURL": "http://www.chargepoint.com/",
        "DistanceUnit": 0
    },
    "Connections": [
        {
            "ID": 228845,
            "ConnectionTypeID": 1,
            "LevelID": 2,
            "Amps": 16,
            "Voltage": 230,
            "PowerKW": 3.7,
            "CurrentTypeID": 10,
            "Quantity": 2
        }
    ],
    "StatusTypeID": 50,
    "DateLastStatusUpdate": "2020-06-26T02:57:00Z",
    "DataQualityLevel": 3,
    "DateCreated": "2020-06-26T02:57:00Z",
    "SubmissionStatusTypeID": 100
}