{
    "IsRecentlyVerified": false,
    "ID": 21185,
    "UUID": "AA684CBE-FD84-40C8-81C0-4B5F4857ED28",
    "DataProviderID": 1,
    "OperatorID": 1,
    "UsageTypeID": 5,
    "AddressInfo": {
        "ID": 21530,
        "Title": "AUTORIMESSA SEMPIONE 76",
        "AddressLine1": "Via Mussi 14",
        "Town": "Milano",
        "StateOrProvince": "Milano",
        "Postcode": "20154",
        "CountryID": 112,
        "Latitude": 45.4822220589399,
        "Longitude": 9.16632309420517,
        "ContactTelephone1": "0233106451",
        "RelatedURL": "http://www.autorimessa-sempione-76.it/",
        "DistanceUnit": 0
    },
    "Connections": [],
    "NumberOfPoints": 1,
    "GeneralComments": "Autorimessa a pagamento con servizio di ricarica batterie per veicoli elettrici. ",
    "StatusTypeID": 50,
    "DateLastStatusUpdate": "2014-03-04T21:50:00Z",
    "DataQualityLevel": 1,
    "DateCreated": "2014-03-04T11:48:00Z",
    "SubmissionStatusTypeID": 200
}