{
    "IsRecentlyVerified": false,
    "ID": 10680,
    "UUID": "B06071A7-2FC8-4D65-848E-D62DA35D4F2B",
    "DataProviderID": 1,
    "OperatorID": 202,
    "UsageTypeID": 5,
    "AddressInfo": {
        "ID": 10577,
        "Title": "Fortum Hurtigladestasjon Værnes Lufthavn",
        "AddressLine1": "Trondheim Lufthavn Værnes ",
        "Town": "Stjørdal",
        "StateOrProvince": "Nord-Trøndelag",
        "Postcode": "7500",
        "CountryID": 168,
        "Latitude": 63.451216,
        "Longitude": 10.919549,
        "AccessComments": "Ved rundkjøring ved innkjøring til Trondheim Lufthavn, Værnes",
        "DistanceUnit": 0
    },
    "Connections": [
        {
            "ID": 34356,
            "ConnectionTypeID": 2,
            "Reference": "1",
            "StatusTypeID": 50,
            "LevelID": 3,
            "Amps": 125,
            "Voltage": 400,
            "PowerKW": 50,
            "CurrentTypeID": 30,
            "Quantity": 3,
            "Comments": "Mode 4"
        },
        {
            "ID": 93222,
            "ConnectionTypeID": 33,
            "Reference": "2",
            "StatusTypeID": 50,
            "LevelID": 3,
            "Amps": 125,
            "Voltage": 400,
            "PowerKW": 50,
            "CurrentTypeID": 30,
            "Quantity": 3,
            "Comments": "Mode 4"
        },
        {
            "ID": 93223,
            "ConnectionTypeID": 25,
            "Reference": "3",
            "StatusTypeID": 50,
            "LevelID": 2,
            "Amps": 32,
            "Voltage": 400,
            "PowerKW": 12,
            "CurrentTypeID": 20,
            "Quantity": 3,
            "Comments": "Mode 3"
        }
    ],
    "NumberOfPoints": 9,
    "StatusTypeID": 50,
    "DateLastStatusUpdate": "2016-07-14T17:58:00Z",
    "DataQualityLevel": 2,
    "DateCreated": "2012-06-02T11:55:00Z",
    "SubmissionStatusTypeID": 200
}