{
    "IsRecentlyVerified": false,
    "ID": 84695,
    "UUID": "C330A29E-5272-45DF-96DA-9A2DA3E9A1F5",
    "DataProviderID": 1,
    "OperatorID": 45,
    "UsageTypeID": 1,
    "AddressInfo": {
        "ID": 85041,
        "Title": "Banner Batterien",
        "AddressLine1": "Kesselbodenstraße 3",
        "Town": "Allershausen",
        "StateOrProvince": "Allershausen (VGem)",
        "Postcode": "85391",
        "CountryID": 87,
        "Latitude": 48.43014420802702,
        "Longitude": 11.579490455294813,
        "ContactTelephone1": "+49 8166 68690",
        "AccessComments": "24/7 kostenlos nutzbare Steckdosen an der \"Banner Tankstelle\", die sich links von der Lagerhalle mit dem roten Vordach befindet. Es sind 3 Wandsteckdosen vorhanden.",
        "RelatedURL": "http://bannerbatterien.com/",
        "DistanceUnit": 0
    },
    "Connections": [
        {
            "ID": 120304,
            "ConnectionTypeID": 17,
            "StatusTypeID": 50,
            "LevelID": 2,
            "Amps": 16,
            "Voltage": 400,
            "PowerKW": 11,
            "CurrentTypeID": 20,
            "Quantity": 1
        },
        {
            "ID": 120305,
            "ConnectionTypeID": 28,
            "StatusTypeID": 50,
            "LevelID": 2,
            "Amps": 16,
            "Voltage": 230,
            "PowerKW": 3.7,
            "CurrentTypeID": 10,
            "Quantity": 2
        }
    ],
    "NumberOfPoints": 3,
    "StatusTypeID": 50,
    "DateLastStatusUpdate": "2017-03-09T08:06:00Z",
    "DataQualityLevel": 1,
    "DateCreated": "2017-03-09T08:06:00Z",
    "SubmissionStatusTypeID": 200
}