{
    "IsRecentlyVerified": false,
    "ID": 113301,
    "UUID": "505EA943-3618-4F54-AE98-2F60892C0F18",
    "DataProviderID": 1,
    "OperatorID": 80,
    "UsageTypeID": 4,
    "AddressInfo": {
        "ID": 113647,
        "Title": "Cornaredo Vittorio Veneto | EnelX",
        "AddressLine1": "Via Vittorio Veneto, 16-20",
        "Town": "Cornaredo",
        "StateOrProvince": "MI",
        "Postcode": "20010 ",
        "CountryID": 112,
        "Latitude": 45.4889368225453,
        "Longitude": 9.0114853531675,
        "ContactTelephone1": "800.069.850",
        "RelatedURL": "https://www.enelx.com/it/it/emobility",
        "DistanceUnit": 0
    },
    "Connections": [
        {
            "ID": 159522,
            "ConnectionTypeID": 25,
            "StatusTypeID": 50,
            "LevelID": 2,
            "Amps": 32,
            "Voltage": 400,
            "PowerKW": 22,
            "CurrentTypeID": 20,
            "Quantity": 2
        }
    ],
    "NumberOfPoints": 2,
    "StatusTypeID": 50,
    "DateLastStatusUpdate": "2019-03-04T15:41:00Z",
    "DataQualityLevel": 1,
    "DateCreated": "2018-11-29T15:33:00Z",
    "SubmissionStatusTypeID": 200
}