{
    "IsRecentlyVerified": false,
    "ID": 9755,
    "UUID": "DAC8E8DA-3567-4C61-8A3C-3E692E902F8C",
    "DataProviderID": 15,
    "DataProvidersReference": "16901",
    "OperatorID": 5,
    "AddressInfo": {
        "ID": 9652,
        "Title": "Melrose Pl",
        "AddressLine1": "Melrose Pl",
        "Town": "San Antonio",
        "StateOrProvince": "Texas",
        "Postcode": "78212",
        "CountryID": 2,
        "Latitude": 29.4699688,
        "Longitude": -98.49695587,
        "ContactTelephone1": "(210) 829-7373",
        "RelatedURL": "http://carstations.com/16901",
        "DistanceUnit": 0
    },
    "Connections": [
        {
            "ID": 7562,
            "ConnectionTypeID": 1,
            "Reference": "J1772",
            "LevelID": 2
        }
    ],
    "StatusTypeID": 0,
    "DateLastStatusUpdate": "2017-11-04T14:03:00Z",
    "DataQualityLevel": 2,
    "DateCreated": "2012-04-16T15:46:00Z",
    "SubmissionStatusTypeID": 100
}