{
    "IsRecentlyVerified": false,
    "ID": 15407,
    "UUID": "9B27FC8A-4B30-4480-B44C-D5B295B43E5D",
    "DataProviderID": 1,
    "OperatorID": 51,
    "UsageTypeID": 0,
    "UsageCost": "Free",
    "AddressInfo": {
        "ID": 15753,
        "Title": "Stone Road Mall",
        "AddressLine1": "435 Stone Road West",
        "AddressLine2": "",
        "Town": "Guelph",
        "StateOrProvince": "ON",
        "Postcode": "N1G 2X6",
        "CountryID": 44,
        "Latitude": 43.5186739,
        "Longitude": -80.23797489999998,
        "ContactTelephone1": "",
        "ContactTelephone2": "",
        "ContactEmail": "",
        "AccessComments": "station is located on Stone Road West between Sears & Old Navy",
        "RelatedURL": "http://www.stoneroadmall.ca",
        "DistanceUnit": 0
    },
    "Connections": [
        {
            "ID": 13715,
            "ConnectionTypeID": 1,
            "StatusTypeID": 0,
            "LevelID": 2,
            "Amps": 32,
            "Voltage": 240,
            "PowerKW": 7.7,
            "Quantity": 1
        }
    ],
    "NumberOfPoints": 1,
    "GeneralComments": "",
    "StatusTypeID": 50,
    "DateLastStatusUpdate": "2013-01-09T15:04:00Z",
    "DataQualityLevel": 1,
    "DateCreated": "2013-01-09T15:04:00Z",
    "SubmissionStatusTypeID": 200
}