{
    "IsRecentlyVerified": false,
    "ID": 177738,
    "UUID": "4A06E4FE-2E76-444A-BFE3-1A1379422380",
    "DataProviderID": 29,
    "DataProvidersReference": "4025",
    "OperatorID": 103,
    "AddressInfo": {
        "ID": 178097,
        "Title": "Hufelandstraße 53",
        "AddressLine1": "Hufelandstraße 53",
        "Town": "Essen",
        "Postcode": "45147",
        "CountryID": 87,
        "Latitude": 51.436199,
        "Longitude": 6.991285,
        "DistanceUnit": 0
    },
    "Connections": [
        {
            "ID": 277243,
            "ConnectionTypeID": 25,
            "StatusTypeID": 50,
            "LevelID": 2,
            "PowerKW": 22,
            "CurrentTypeID": 20
        },
        {
            "ID": 277244,
            "ConnectionTypeID": 25,
            "StatusTypeID": 50,
            "LevelID": 2,
            "PowerKW": 22,
            "CurrentTypeID": 20
        }
    ],
    "StatusTypeID": 0,
    "DateLastStatusUpdate": "2021-07-12T02:47:00Z",
    "MetadataValues": [
        {
            "ID": 10032,
            "MetadataFieldID": 4,
            "ItemValue": "Data from the German chargepoint registry provided by Bundesnetzagentur.de under the CC-BY 4.0 license"
        }
    ],
    "DataQualityLevel": 3,
    "DateCreated": "2021-07-08T09:49:00Z",
    "SubmissionStatusTypeID": 100
}