{
    "IsRecentlyVerified": false,
    "ID": 61272,
    "UUID": "15FD396F-DE19-4D0F-9C90-BDDAB4001B09",
    "DataProviderID": 1,
    "OperatorID": 105,
    "UsageTypeID": 4,
    "AddressInfo": {
        "ID": 61618,
        "Title": "Monheimer Elektrizitäts- und Gasversorgung (MEGA)",
        "AddressLine1": "Rheinpromenade 3a",
        "AddressLine2": "Baumberg",
        "Town": "Monheim",
        "StateOrProvince": "Kreis Mettmann",
        "Postcode": "40789",
        "CountryID": 87,
        "Latitude": 51.104113911283,
        "Longitude": 6.88822823042028,
        "ContactTelephone1": "02173 952095",
        "AccessComments": "Die Säule befindet sich auf dem Besucherparkplatz vor dem Kundencenter der Monheimer Elektrizitäts- und Gasversorgung GmbH (MEGA). Parkplätze sind kostenlos, aber nicht als Ladeplatz gekennzeichnet. Der linke Ladeplatz ist auf dem Boden als Behinderten-Parkplatz gekennzeichnet. Die Säule befindet sich nach Angaben von MEGA dauerhaft im Messe Modus, das Laden ist derzeit kostenlos. Ladekarte von RWE oder Roamingpartner BEW, LübbeckeStrom eMobil, ChargeNow oder PlugSurfing App notwendig. ",
        "RelatedURL": "http://www.mega-monheim.de/",
        "DistanceUnit": 0
    },
    "Connections": [
        {
            "ID": 78002,
            "ConnectionTypeID": 25,
            "StatusTypeID": 50,
            "LevelID": 2,
            "Amps": 32,
            "Voltage": 400,
            "PowerKW": 22,
            "CurrentTypeID": 20,
            "Quantity": 2
        }
    ],
    "NumberOfPoints": 2,
    "GeneralComments": "Stand 03/2015: Säule ist im Messemodus, Laden kostenlos",
    "StatusTypeID": 50,
    "DateLastStatusUpdate": "2017-01-18T06:57:00Z",
    "DataQualityLevel": 1,
    "DateCreated": "2016-02-21T11:11:00Z",
    "SubmissionStatusTypeID": 200
}