{
    "IsRecentlyVerified": false,
    "ID": 65807,
    "UUID": "75CD4429-EEF5-4C69-AD0A-4D5FE01334C2",
    "DataProviderID": 26,
    "DataProvidersReference": "84846",
    "OperatorID": 103,
    "OperatorsReference": "Allego NLALLEGO0001682",
    "UsageCost": "0.00 jaarabonnement",
    "AddressInfo": {
        "ID": 66153,
        "Title": "Damsterwaard 20",
        "AddressLine1": "Damsterwaard 20",
        "Town": "Groningen",
        "Postcode": "9734 CK",
        "CountryID": 159,
        "Latitude": 53.22827781,
        "Longitude": 6.61553201,
        "ContactTelephone1": "0800-3745337",
        "RelatedURL": "http://www.allego.eu/",
        "DistanceUnit": 0
    },
    "Connections": [
        {
            "ID": 90888,
            "ConnectionTypeID": 25,
            "LevelID": 2,
            "PowerKW": 11,
            "CurrentTypeID": 10
        },
        {
            "ID": 90889,
            "ConnectionTypeID": 25,
            "LevelID": 2,
            "PowerKW": 11,
            "CurrentTypeID": 10
        }
    ],
    "NumberOfPoints": 1,
    "StatusTypeID": 50,
    "DateLastStatusUpdate": "2016-06-04T02:56:00Z",
    "DataQualityLevel": 3,
    "DateCreated": "2016-04-27T09:42:00Z",
    "SubmissionStatusTypeID": 100
}