{
    "IsRecentlyVerified": false,
    "ID": 183009,
    "UUID": "21FCB6F3-6761-4C21-B36C-09BC5A8AC977",
    "DataProviderID": 29,
    "DataProvidersReference": "17615",
    "AddressInfo": {
        "ID": 183368,
        "Title": "Anne-Frank-Straße 7",
        "AddressLine1": "Anne-Frank-Straße 7",
        "Town": "Schwarzheide",
        "Postcode": "01987",
        "CountryID": 87,
        "Latitude": 51.474618,
        "Longitude": 13.857247,
        "DistanceUnit": 0
    },
    "Connections": [
        {
            "ID": 289451,
            "ConnectionTypeID": 25,
            "StatusTypeID": 50,
            "LevelID": 2,
            "PowerKW": 22,
            "CurrentTypeID": 20
        },
        {
            "ID": 289452,
            "ConnectionTypeID": 25,
            "StatusTypeID": 50,
            "LevelID": 2,
            "PowerKW": 22,
            "CurrentTypeID": 20
        }
    ],
    "StatusTypeID": 50,
    "DateLastStatusUpdate": "2021-07-09T03:24:00Z",
    "MetadataValues": [
        {
            "ID": 15302,
            "MetadataFieldID": 4,
            "ItemValue": "Data from the German chargepoint registry provided by Bundesnetzagentur.de under the CC-BY 4.0 license"
        }
    ],
    "DataQualityLevel": 3,
    "DateCreated": "2021-07-08T10:03:00Z",
    "SubmissionStatusTypeID": 100
}