{
    "IsRecentlyVerified": false,
    "ID": 110625,
    "UUID": "F0B31923-6870-4E6E-BF08-BE9A5E9305FA",
    "DataProviderID": 2,
    "DataProvidersReference": "99317",
    "OperatorID": 5,
    "UsageTypeID": 1,
    "AddressInfo": {
        "ID": 110971,
        "Title": "NATIONAL GRID",
        "AddressLine1": "1 Richmond St",
        "Town": "Providence",
        "StateOrProvince": "RI",
        "Postcode": "02903",
        "CountryID": 2,
        "Latitude": 41.8209229,
        "Longitude": -71.412417,
        "ContactTelephone1": "888-758-4389",
        "AccessComments": "24 hours daily",
        "RelatedURL": "http://www.chargepoint.com/",
        "DistanceUnit": 0
    },
    "Connections": [
        {
            "ID": 155894,
            "ConnectionTypeID": 1,
            "LevelID": 2,
            "Amps": 16,
            "Voltage": 230,
            "PowerKW": 3,
            "CurrentTypeID": 10,
            "Quantity": 2
        }
    ],
    "DateLastStatusUpdate": "2019-04-06T05:05:00Z",
    "DataQualityLevel": 3,
    "DateCreated": "2018-10-18T23:36:00Z",
    "SubmissionStatusTypeID": 100
}