{
    "IsRecentlyVerified": false,
    "ID": 68819,
    "UUID": "8F6FB9ED-2FF4-46D6-B5DC-D56C7A646782",
    "DataProviderID": 2,
    "DataProvidersReference": "76221",
    "OperatorID": 5,
    "UsageTypeID": 1,
    "AddressInfo": {
        "ID": 69165,
        "Title": "LCF PARK&RIDE;",
        "AddressLine1": "1310 Foothill Blvd",
        "Town": "La CaÃ±ada Flintridge",
        "StateOrProvince": "CA",
        "Postcode": "91011",
        "CountryID": 2,
        "Latitude": 34.2070849,
        "Longitude": -118.2064219,
        "ContactTelephone1": "888-758-4389",
        "AccessComments": "24 hours daily",
        "RelatedURL": "http://www.chargepoint.com/",
        "DistanceUnit": 0
    },
    "Connections": [
        {
            "ID": 96520,
            "ConnectionTypeID": 1,
            "LevelID": 2,
            "Amps": 16,
            "Voltage": 230,
            "PowerKW": 3,
            "CurrentTypeID": 10,
            "Quantity": 2
        }
    ],
    "DateLastStatusUpdate": "2019-04-06T04:02:00Z",
    "DataQualityLevel": 3,
    "DateCreated": "2016-06-25T03:36:00Z",
    "SubmissionStatusTypeID": 100
}