{
    "IsRecentlyVerified": false,
    "ID": 60556,
    "UUID": "2C7C1EFC-3A58-4475-AAE0-96BF7C22E590",
    "DataProviderID": 1,
    "OperatorID": 80,
    "UsageTypeID": 4,
    "UsageCost": "0,40 €/kW",
    "AddressInfo": {
        "ID": 60902,
        "Title": "Eneldrive (ex SILFI) Santa Trinita",
        "AddressLine1": "Lungarno Guicciardini, 1",
        "Town": "Firenze",
        "StateOrProvince": "FI",
        "Postcode": "50125",
        "CountryID": 112,
        "Latitude": 43.76861530781787,
        "Longitude": 11.249686133309762,
        "RelatedURL": "http://eneldrive.it",
        "DistanceUnit": 0
    },
    "Connections": [
        {
            "ID": 76731,
            "ConnectionTypeID": 36,
            "StatusTypeID": 50,
            "LevelID": 2,
            "Amps": 16,
            "Voltage": 240,
            "PowerKW": 3,
            "CurrentTypeID": 10,
            "Quantity": 2
        }
    ],
    "NumberOfPoints": 2,
    "StatusTypeID": 50,
    "DateLastStatusUpdate": "2016-02-01T16:48:00Z",
    "DataQualityLevel": 1,
    "DateCreated": "2016-02-01T16:48:00Z",
    "SubmissionStatusTypeID": 200
}