{
    "IsRecentlyVerified": false,
    "ID": 39112,
    "UUID": "C829C497-E7B9-42B6-9416-C22FA9EB7A92",
    "DataProviderID": 26,
    "DataProvidersReference": "35538",
    "OperatorsReference": "Grarage Ter Veld Grijpskerk",
    "UsageCost": "0.00 jaarabonnement",
    "AddressInfo": {
        "ID": 39458,
        "Title": "Stationsstraat",
        "AddressLine1": "Stationsstraat",
        "Town": "Zuidhorn",
        "Postcode": "9843 AG",
        "CountryID": 159,
        "Latitude": 53.259888057636,
        "Longitude": 6.311377286911,
        "RelatedURL": "http://www.terveld.nl",
        "DistanceUnit": 0
    },
    "Connections": [
        {
            "ID": 42623,
            "ConnectionTypeID": 25,
            "LevelID": 2,
            "PowerKW": 11,
            "CurrentTypeID": 10
        }
    ],
    "NumberOfPoints": 2,
    "StatusTypeID": 50,
    "DateLastStatusUpdate": "2016-06-04T02:56:00Z",
    "DataQualityLevel": 3,
    "DateCreated": "2015-01-09T06:08:00Z",
    "SubmissionStatusTypeID": 100
}