{
    "IsRecentlyVerified": false,
    "ID": 112943,
    "UUID": "A8480F20-84A2-4C2F-AC65-42C171F59D7B",
    "DataProviderID": 1,
    "OperatorID": 45,
    "OperatorsReference": "Corbett Court",
    "UsageTypeID": 4,
    "AddressInfo": {
        "ID": 113289,
        "Title": "Corbett Court",
        "AddressLine1": "Corbett Court",
        "Town": "Fermoy",
        "StateOrProvince": "County Cork",
        "CountryID": 3,
        "Latitude": 52.20325,
        "Longitude": -8.26889,
        "DistanceUnit": 0
    },
    "Connections": [
        {
            "ID": 159081,
            "ConnectionTypeID": 25,
            "StatusTypeID": 50,
            "LevelID": 2,
            "Amps": 32,
            "Voltage": 400,
            "PowerKW": 22,
            "CurrentTypeID": 20,
            "Quantity": 2
        }
    ],
    "NumberOfPoints": 2,
    "StatusTypeID": 50,
    "DateLastStatusUpdate": "2018-11-27T12:41:00Z",
    "DataQualityLevel": 1,
    "DateCreated": "2018-11-27T12:40:00Z",
    "SubmissionStatusTypeID": 200
}