{
    "IsRecentlyVerified": false,
    "ID": 79942,
    "UUID": "DB4BE6AC-2338-4702-A680-328180293C49",
    "DataProviderID": 1,
    "OperatorID": 23,
    "OperatorsReference": "12325",
    "UsageTypeID": 4,
    "UsageCost": "$0.24/kWh; other tariffs for older cars",
    "AddressInfo": {
        "ID": 80288,
        "Title": "Sandy Supercharger",
        "AddressLine1": "16625 Se 362nd DR.",
        "Town": "Sandy",
        "StateOrProvince": "OR",
        "Postcode": "97055",
        "CountryID": 2,
        "Latitude": 45.402786,
        "Longitude": -122.294371,
        "DistanceUnit": 0
    },
    "Connections": [
        {
            "ID": 114591,
            "ConnectionTypeID": 27,
            "StatusTypeID": 50,
            "LevelID": 3,
            "PowerKW": 120,
            "CurrentTypeID": 30,
            "Quantity": 8
        }
    ],
    "NumberOfPoints": 8,
    "GeneralComments": "8 Superchargers, available 24/7",
    "StatusTypeID": 50,
    "DateLastStatusUpdate": "2018-03-13T13:34:00Z",
    "DataQualityLevel": 1,
    "DateCreated": "2017-01-30T18:00:00Z",
    "SubmissionStatusTypeID": 200
}