{
    "IsRecentlyVerified": false,
    "ID": 93730,
    "UUID": "ECBA849B-8885-483A-917D-0D59F6810EDB",
    "DataProviderID": 1,
    "OperatorID": 59,
    "UsageTypeID": 4,
    "AddressInfo": {
        "ID": 94076,
        "Title": "BCA Academy",
        "AddressLine1": "Braddell Road",
        "Town": "Toa Payoh",
        "StateOrProvince": "Central",
        "Postcode": "310221",
        "CountryID": 202,
        "Latitude": 1.343664,
        "Longitude": 103.857987,
        "DistanceUnit": 0
    },
    "Connections": [
        {
            "ID": 132701,
            "ConnectionTypeID": 1,
            "StatusTypeID": 50,
            "LevelID": 2,
            "CurrentTypeID": 10,
            "Quantity": 1
        }
    ],
    "NumberOfPoints": 1,
    "StatusTypeID": 50,
    "DateLastStatusUpdate": "2017-10-06T09:21:00Z",
    "DataQualityLevel": 1,
    "DateCreated": "2017-10-06T09:21:00Z",
    "SubmissionStatusTypeID": 200
}