{
    "IsRecentlyVerified": false,
    "ID": 140573,
    "UUID": "00CEF82C-844B-48D8-8490-E5A9701D3CA5",
    "DataProviderID": 2,
    "DataProvidersReference": "143473",
    "OperatorID": 5,
    "UsageTypeID": 1,
    "AddressInfo": {
        "ID": 140925,
        "Title": "RAMADA FRESNO",
        "AddressLine1": "324 E Shaw Ave",
        "Town": "Fresno",
        "StateOrProvince": "CA",
        "Postcode": "93710",
        "CountryID": 2,
        "Latitude": 36.8096354,
        "Longitude": -119.7830888,
        "ContactTelephone1": "888-758-4389",
        "AccessComments": "24 hours daily",
        "RelatedURL": "http://www.chargepoint.com/",
        "DistanceUnit": 0
    },
    "Connections": [
        {
            "ID": 196241,
            "ConnectionTypeID": 1,
            "LevelID": 2,
            "Amps": 16,
            "Voltage": 230,
            "PowerKW": 3,
            "CurrentTypeID": 10,
            "Quantity": 2
        }
    ],
    "StatusTypeID": 50,
    "DateLastStatusUpdate": "2019-12-24T09:13:00Z",
    "DataQualityLevel": 3,
    "DateCreated": "2019-12-24T09:13:00Z",
    "SubmissionStatusTypeID": 100
}