{
    "IsRecentlyVerified": false,
    "ID": 85333,
    "UUID": "B1089BE3-F22C-445B-94A0-0832899D145A",
    "DataProviderID": 1,
    "DataProvidersReference": "3839",
    "AddressInfo": {
        "ID": 85679,
        "Title": "Lindebostäder",
        "AddressLine1": "Banvägen 28",
        "Town": "LINDESBERG",
        "StateOrProvince": "ÖREBRO",
        "Postcode": "71131",
        "CountryID": 216,
        "Latitude": 59.599554,
        "Longitude": 15.224948,
        "AccessComments": "Kundparkering vid LIBO",
        "DistanceUnit": 0
    },
    "Connections": [
        {
            "ID": 121268,
            "ConnectionTypeID": 0,
            "Reference": "1",
            "LevelID": 2,
            "Amps": 32,
            "Voltage": 400,
            "PowerKW": 22,
            "Comments": "Mode 3"
        },
        {
            "ID": 121269,
            "ConnectionTypeID": 0,
            "Reference": "2",
            "LevelID": 2,
            "Amps": 32,
            "Voltage": 400,
            "PowerKW": 22,
            "Comments": "Mode 3"
        }
    ],
    "NumberOfPoints": 2,
    "DateLastStatusUpdate": "2020-05-26T08:23:00Z",
    "DataQualityLevel": 2,
    "DateCreated": "2017-04-01T15:08:00Z",
    "SubmissionStatusTypeID": 100
}