{
    "IsRecentlyVerified": false,
    "ID": 47143,
    "UUID": "373CB4D4-106A-46FE-8ED2-83D6A644E929",
    "DataProviderID": 1,
    "OperatorID": 32,
    "OperatorsReference": "2544,2545",
    "UsageTypeID": 4,
    "UsageCost": "Inclusive; for Polar Plus subscription members only",
    "AddressInfo": {
        "ID": 47489,
        "Title": "ASDA Swinton Supermarket",
        "AddressLine1": "15 Wellington Road",
        "Town": "Swinton",
        "Postcode": "M27 4BR",
        "CountryID": 1,
        "Latitude": 53.51269734750781,
        "Longitude": -2.3373470846487407,
        "ContactTelephone1": "0161 9147266 ",
        "RelatedURL": "http://storelocator.asda.com/store/swinton",
        "DistanceUnit": 0
    },
    "Connections": [
        {
            "ID": 58096,
            "ConnectionTypeID": 25,
            "StatusTypeID": 50,
            "LevelID": 2,
            "Amps": 32,
            "Voltage": 230,
            "PowerKW": 7,
            "CurrentTypeID": 10,
            "Quantity": 4
        }
    ],
    "NumberOfPoints": 4,
    "StatusTypeID": 50,
    "DateLastStatusUpdate": "2020-11-17T23:19:00Z",
    "DataQualityLevel": 1,
    "DateCreated": "2015-05-14T12:40:00Z",
    "SubmissionStatusTypeID": 200
}