{
    "IsRecentlyVerified": false,
    "ID": 134106,
    "UUID": "EE30D4C6-839A-4606-AF46-45AC96D6CE6A",
    "DataProviderID": 1,
    "OperatorID": 3315,
    "OperatorsReference": "51186,51718",
    "UsageTypeID": 4,
    "UsageCost": "Free",
    "AddressInfo": {
        "ID": 134452,
        "Title": "Station Road Library, Ellon",
        "AddressLine1": "24 Slater Court",
        "Town": "Ellon",
        "StateOrProvince": "Aberdeenshire",
        "Postcode": "AB41 9AE",
        "CountryID": 1,
        "Latitude": 57.365693033352,
        "Longitude": -2.07260369899745,
        "DistanceUnit": 0
    },
    "Connections": [
        {
            "ID": 187655,
            "ConnectionTypeID": 25,
            "StatusTypeID": 75,
            "LevelID": 2,
            "Amps": 32,
            "Voltage": 400,
            "PowerKW": 22,
            "CurrentTypeID": 20,
            "Quantity": 3
        }
    ],
    "NumberOfPoints": 3,
    "StatusTypeID": 75,
    "DateLastStatusUpdate": "2020-05-21T05:15:00Z",
    "DataQualityLevel": 1,
    "DateCreated": "2019-11-03T06:21:00Z",
    "SubmissionStatusTypeID": 200
}