{
    "IsRecentlyVerified": false,
    "ID": 75781,
    "UUID": "71C3FEAD-BF3B-455B-8D5B-DAC8EA167E8D",
    "DataProviderID": 1,
    "OperatorID": 23,
    "OperatorsReference": "22185",
    "UsageTypeID": 1,
    "UsageCost": "Free",
    "AddressInfo": {
        "ID": 76127,
        "Title": "Grand Bohemian Hotel - Tesla",
        "AddressLine1": "2655 Lane Park Rd",
        "Town": "Birmingham",
        "StateOrProvince": "AL",
        "Postcode": "35223",
        "CountryID": 2,
        "Latitude": 33.4877887,
        "Longitude": -86.7739922,
        "ContactTelephone1": "205-414-0505  877-798-3752",
        "AccessComments": "24 hours daily; for Tesla use only; for guest use only; see valet for access",
        "RelatedURL": "http://www.teslamotors.com/supercharger",
        "DistanceUnit": 0
    },
    "Connections": [
        {
            "ID": 109280,
            "ConnectionTypeID": 30,
            "StatusTypeID": 50,
            "LevelID": 2,
            "Amps": 16,
            "Voltage": 230,
            "PowerKW": 8,
            "CurrentTypeID": 10,
            "Quantity": 2
        }
    ],
    "NumberOfPoints": 2,
    "StatusTypeID": 50,
    "DateLastStatusUpdate": "2017-01-31T20:16:00Z",
    "DataQualityLevel": 3,
    "DateCreated": "2016-12-23T01:25:00Z",
    "SubmissionStatusTypeID": 100
}