{
    "MediaItems": [
        {
            "ID": 21037,
            "ChargePointID": 143281,
            "ItemURL": "https://s3-ap-southeast-2.amazonaws.com/openchargemap/images/US/OCM143281/OCM-143281.orig.2020011901001574.jpg",
            "ItemThumbnailURL": "https://s3-ap-southeast-2.amazonaws.com/openchargemap/images/US/OCM143281/OCM-143281.thmb.2020011901001574.jpg",
            "Comment": "",
            "IsEnabled": true,
            "IsVideo": false,
            "IsFeaturedItem": false,
            "IsExternalResource": false,
            "User": {
                "ID": 24654,
                "Username": "MI Bolt"
            },
            "DateCreated": "2020-01-19T01:00:00Z"
        }
    ],
    "IsRecentlyVerified": false,
    "ID": 143281,
    "UUID": "2DD4C86D-4B92-4AAE-B5CE-5AC513157CEA",
    "DataProviderID": 2,
    "DataProvidersReference": "117819",
    "OperatorID": 5,
    "UsageTypeID": 1,
    "AddressInfo": {
        "ID": 143633,
        "Title": "MSU",
        "AddressLine1": "909 Fee Rd",
        "Town": "East Lansing",
        "StateOrProvince": "MI",
        "Postcode": "48825",
        "CountryID": 2,
        "Latitude": 42.7229447,
        "Longitude": -84.4667238,
        "ContactTelephone1": "888-758-4389",
        "AccessComments": "24 hours daily",
        "RelatedURL": "http://www.chargepoint.com/",
        "DistanceUnit": 0
    },
    "Connections": [
        {
            "ID": 199577,
            "ConnectionTypeID": 1,
            "LevelID": 2,
            "Amps": 16,
            "Voltage": 230,
            "PowerKW": 3.7,
            "CurrentTypeID": 10,
            "Quantity": 2
        }
    ],
    "StatusTypeID": 50,
    "DateLastStatusUpdate": "2020-06-26T03:06:00Z",
    "DataQualityLevel": 3,
    "DateCreated": "2019-12-24T09:20:00Z",
    "SubmissionStatusTypeID": 100
}