{
    "IsRecentlyVerified": false,
    "ID": 113671,
    "UUID": "67E31E61-66D2-41E9-9E07-77C58404266F",
    "DataProviderID": 1,
    "OperatorID": 80,
    "UsageTypeID": 4,
    "AddressInfo": {
        "ID": 114017,
        "Title": "Reggio Calabria Spanò | EnelX",
        "AddressLine1": "Via Spanò",
        "Town": "Reggio Calabria",
        "StateOrProvince": "RC",
        "Postcode": "89128 ",
        "CountryID": 112,
        "Latitude": 38.103053385090014,
        "Longitude": 15.64189551408016,
        "ContactTelephone1": "800.069.850",
        "RelatedURL": "https://www.enelx.com/it/it/emobility",
        "DistanceUnit": 0
    },
    "Connections": [
        {
            "ID": 160208,
            "ConnectionTypeID": 25,
            "StatusTypeID": 150,
            "LevelID": 2,
            "Amps": 32,
            "Voltage": 400,
            "PowerKW": 22,
            "CurrentTypeID": 20,
            "Quantity": 1
        },
        {
            "ID": 160209,
            "ConnectionTypeID": 36,
            "StatusTypeID": 150,
            "LevelID": 2,
            "Amps": 16,
            "Voltage": 240,
            "PowerKW": 3.7,
            "CurrentTypeID": 10,
            "Quantity": 1
        }
    ],
    "NumberOfPoints": 2,
    "StatusTypeID": 150,
    "DateLastStatusUpdate": "2018-12-29T15:23:00Z",
    "DataQualityLevel": 1,
    "DateCreated": "2018-12-29T15:23:00Z",
    "SubmissionStatusTypeID": 200
}