{
    "IsRecentlyVerified": false,
    "ID": 74709,
    "UUID": "FBD51B21-AED0-4C6E-98F8-7AC3D7792222",
    "DataProviderID": 1,
    "DataProvidersReference": "3637",
    "AddressInfo": {
        "ID": 75055,
        "Title": "City Gross Värmdö",
        "AddressLine1": "Gustavsbergsvägen 34D",
        "Town": "GUSTAVSBERG",
        "StateOrProvince": "STOCKHOLM",
        "Postcode": "13439",
        "CountryID": 216,
        "Latitude": 59.30953,
        "Longitude": 18.38356,
        "AccessComments": "Utanför entrén till City Gross.",
        "DistanceUnit": 0
    },
    "Connections": [
        {
            "ID": 107448,
            "ConnectionTypeID": 0,
            "Reference": "1",
            "LevelID": 2,
            "Amps": 16,
            "Voltage": 230,
            "PowerKW": 3.7,
            "Comments": "Mode 3"
        },
        {
            "ID": 107449,
            "ConnectionTypeID": 0,
            "Reference": "2",
            "LevelID": 2,
            "Amps": 16,
            "Voltage": 230,
            "PowerKW": 3.7,
            "Comments": "Mode 3"
        },
        {
            "ID": 107450,
            "ConnectionTypeID": 0,
            "Reference": "3",
            "LevelID": 2,
            "Amps": 16,
            "Voltage": 230,
            "PowerKW": 3.7,
            "Comments": "Mode 3"
        },
        {
            "ID": 107451,
            "ConnectionTypeID": 0,
            "Reference": "4",
            "LevelID": 2,
            "Amps": 16,
            "Voltage": 230,
            "PowerKW": 3.7,
            "Comments": "Mode 3"
        }
    ],
    "NumberOfPoints": 4,
    "DateLastStatusUpdate": "2020-05-26T08:22:00Z",
    "DataQualityLevel": 2,
    "DateCreated": "2016-12-03T02:36:00Z",
    "SubmissionStatusTypeID": 100
}