{
    "MediaItems": [
        {
            "ID": 26107,
            "ChargePointID": 171480,
            "ItemURL": "https://s3-ap-southeast-2.amazonaws.com/openchargemap/images/CR/OCM171480/OCM-171480.orig.2021010502584728.jpg",
            "ItemThumbnailURL": "https://s3-ap-southeast-2.amazonaws.com/openchargemap/images/CR/OCM171480/OCM-171480.thmb.2021010502584728.jpg",
            "Comment": "",
            "IsEnabled": true,
            "IsVideo": false,
            "IsFeaturedItem": false,
            "IsExternalResource": false,
            "User": {
                "ID": 29037,
                "Username": "Geo36"
            },
            "DateCreated": "2021-01-05T02:59:00Z"
        }
    ],
    "IsRecentlyVerified": false,
    "ID": 171480,
    "UUID": "E4EDEDB5-BC96-461C-AEB1-5435099BE122",
    "DataProviderID": 1,
    "OperatorID": 3404,
    "UsageTypeID": 1,
    "AddressInfo": {
        "ID": 171839,
        "Title": "Moligas San Ramon",
        "AddressLine1": "Servicentro Molina",
        "Town": "San ramon",
        "StateOrProvince": "Alajuela",
        "Postcode": "20203",
        "CountryID": 58,
        "Latitude": 10.098774576815131,
        "Longitude": -84.46861341065483,
        "DistanceUnit": 0
    },
    "Connections": [
        {
            "ID": 262173,
            "ConnectionTypeID": 2,
            "StatusTypeID": 50,
            "LevelID": 3,
            "PowerKW": 50,
            "CurrentTypeID": 30,
            "Quantity": 1
        },
        {
            "ID": 262174,
            "ConnectionTypeID": 32,
            "StatusTypeID": 50,
            "LevelID": 3,
            "PowerKW": 50,
            "CurrentTypeID": 30,
            "Quantity": 1
        },
        {
            "ID": 262175,
            "ConnectionTypeID": 1040,
            "StatusTypeID": 50,
            "LevelID": 3,
            "PowerKW": 50,
            "CurrentTypeID": 30,
            "Quantity": 1
        }
    ],
    "NumberOfPoints": 2,
    "StatusTypeID": 50,
    "DateLastStatusUpdate": "2021-07-23T14:44:00Z",
    "DataQualityLevel": 1,
    "DateCreated": "2021-01-02T22:15:00Z",
    "SubmissionStatusTypeID": 200
}