{
    "IsRecentlyVerified": false,
    "ID": 51841,
    "UUID": "CCCC5229-AB91-4361-A8FF-45E43CD9D7BE",
    "DataProviderID": 1,
    "OperatorID": 23,
    "OperatorsReference": "6598",
    "UsageTypeID": 6,
    "UsageCost": "Free",
    "AddressInfo": {
        "ID": 52187,
        "Title": "Four Seasons Resort The Biltmore - Tesla",
        "AddressLine1": "1260 Channel Dr",
        "Town": "Santa Barbara",
        "StateOrProvince": "CA",
        "Postcode": "93108",
        "CountryID": 2,
        "Latitude": 34.4172489,
        "Longitude": -119.6418849,
        "ContactTelephone1": "805-969-2261  877-798-3752",
        "AccessComments": "24 hours daily; for Tesla use only; for guest use only; see valet for access",
        "RelatedURL": "http://www.teslamotors.com/supercharger",
        "DistanceUnit": 0
    },
    "Connections": [
        {
            "ID": 64318,
            "ConnectionTypeID": 30,
            "StatusTypeID": 50,
            "LevelID": 2,
            "Amps": 16,
            "Voltage": 230,
            "PowerKW": 16,
            "CurrentTypeID": 10,
            "Quantity": 4
        }
    ],
    "NumberOfPoints": 4,
    "GeneralComments": "Available for patrons only. Please see valet.",
    "StatusTypeID": 50,
    "DateLastStatusUpdate": "2018-10-03T15:34:00Z",
    "DataQualityLevel": 3,
    "DateCreated": "2015-08-13T03:43:00Z",
    "SubmissionStatusTypeID": 100
}