{
    "IsRecentlyVerified": false,
    "ID": 41026,
    "UUID": "D225DC56-055F-4D13-AFC2-12931E4ABB89",
    "DataProviderID": 1,
    "OperatorID": 101,
    "UsageTypeID": 1,
    "AddressInfo": {
        "ID": 41372,
        "Title": "Bahnhof Uelzen",
        "AddressLine1": "Friedensreich-Hundertwasser-Platz 1,",
        "Town": "Uelzen",
        "StateOrProvince": "Landkreis Uelzen",
        "Postcode": "29525",
        "CountryID": 87,
        "Latitude": 52.97074,
        "Longitude": 10.55375,
        "ContactTelephone1": "0581 9600",
        "AccessComments": "Ladesäule am Schild \"Parken nur für Elektrofahrzeuge\" am Bahnhof. Immer nutzbar. Freischaltung mit SMS oder RFID Karte, die am Bahnhof ausgeliehen werden kann, oder Karte von The New Motion, PlugSurfing oder ChargeNow.",
        "RelatedURL": "http://www.stadtwerke-uelzen.de/",
        "DistanceUnit": 0
    },
    "Connections": [
        {
            "ID": 44745,
            "ConnectionTypeID": 28,
            "StatusTypeID": 50,
            "LevelID": 2,
            "Amps": 16,
            "Voltage": 230,
            "PowerKW": 3.7,
            "CurrentTypeID": 10,
            "Quantity": 1
        },
        {
            "ID": 44746,
            "ConnectionTypeID": 25,
            "StatusTypeID": 50,
            "LevelID": 2,
            "Amps": 16,
            "Voltage": 400,
            "PowerKW": 11,
            "CurrentTypeID": 20,
            "Quantity": 1
        }
    ],
    "NumberOfPoints": 2,
    "GeneralComments": "auch möglich: Premium-SMS 841122 mit Text \"utspe\" senden ",
    "StatusTypeID": 50,
    "DateLastStatusUpdate": "2015-01-22T20:50:00Z",
    "DataQualityLevel": 1,
    "DateCreated": "2015-01-22T12:19:00Z",
    "SubmissionStatusTypeID": 200
}