{
    "IsRecentlyVerified": false,
    "ID": 63937,
    "UUID": "F86F9544-0D95-4E20-AE72-5DB95C4CDD73",
    "DataProviderID": 26,
    "DataProvidersReference": "82680",
    "OperatorID": 103,
    "OperatorsReference": "Allego NLALLEGO0004931",
    "UsageCost": "0.00 jaarabonnement",
    "AddressInfo": {
        "ID": 64283,
        "Title": "A. Roland Holststraat 37",
        "AddressLine1": "A. Roland Holststraat 37",
        "Town": "Almere",
        "Postcode": "1321 TP",
        "CountryID": 159,
        "Latitude": 52.35879109,
        "Longitude": 5.1758937,
        "ContactTelephone1": "0800-3745337",
        "RelatedURL": "http://www.allego.eu/",
        "DistanceUnit": 0
    },
    "Connections": [
        {
            "ID": 81717,
            "ConnectionTypeID": 25,
            "LevelID": 2,
            "PowerKW": 11,
            "CurrentTypeID": 10
        },
        {
            "ID": 81718,
            "ConnectionTypeID": 25,
            "LevelID": 2,
            "PowerKW": 11,
            "CurrentTypeID": 10
        }
    ],
    "NumberOfPoints": 1,
    "StatusTypeID": 50,
    "DateLastStatusUpdate": "2016-06-04T02:53:00Z",
    "DataQualityLevel": 3,
    "DateCreated": "2016-03-03T12:32:00Z",
    "SubmissionStatusTypeID": 100
}