{
    "IsRecentlyVerified": false,
    "ID": 157570,
    "UUID": "3F776783-3DE5-4ADE-AA5A-A3D7A3DCBDBE",
    "DataProviderID": 1,
    "OperatorID": 80,
    "UsageTypeID": 4,
    "AddressInfo": {
        "ID": 157924,
        "Title": "De Stefani S.p.A. - Concessionaria Mercedes-Benz e smart | ENELX",
        "AddressLine1": "Via Ravennate, 1550",
        "Town": "Cesena",
        "StateOrProvince": "FC",
        "Postcode": "47522",
        "CountryID": 112,
        "Latitude": 44.16198864671344,
        "Longitude": 12.243331897940266,
        "ContactTelephone1": "800.069.850",
        "RelatedURL": "https://www.enelx.com/it/it/emobility",
        "DistanceUnit": 0
    },
    "Connections": [
        {
            "ID": 227001,
            "ConnectionTypeID": 25,
            "StatusTypeID": 50,
            "LevelID": 2,
            "Amps": 32,
            "Voltage": 400,
            "PowerKW": 22,
            "CurrentTypeID": 20,
            "Quantity": 2
        }
    ],
    "NumberOfPoints": 2,
    "StatusTypeID": 50,
    "DateLastStatusUpdate": "2020-06-16T15:13:00Z",
    "DataQualityLevel": 1,
    "DateCreated": "2020-06-16T15:13:00Z",
    "SubmissionStatusTypeID": 200
}