{
    "IsRecentlyVerified": false,
    "ID": 54094,
    "UUID": "7B0B9EAE-F96E-4C56-8A9B-2FF6D69B8031",
    "DataProviderID": 1,
    "OperatorID": 101,
    "UsageTypeID": 4,
    "AddressInfo": {
        "ID": 54440,
        "Title": "Sparkasse",
        "AddressLine1": "Poststraße 10-12",
        "Town": "Rotenburg a. d. Fulda",
        "Postcode": "36199",
        "CountryID": 87,
        "Latitude": 50.9972443,
        "Longitude": 9.73214519999999,
        "ContactTelephone1": "+49 800 6621850",
        "AccessComments": "Die Säule ist nutzbar: Mo: von 09:00 bis 17:00 Uhr Di: von 09:00 bis 17:00 Uhr Mi: von 09:00 bis 17:00 Uhr Do: von 09:00 bis 18:00 Uhr Fr: von 09:00 bis 17:00 Uhr Sa: geschlossen So: geschlossen Die Säule liefert auf der Typ2-Dose dreiphasig 20A, also ca. 14kW.\r\n",
        "RelatedURL": "http://www.spk-hef.de/module/ihre_sparkasse/filialfinder/index.php?n=%2Fmodule%2Fihre_sparkasse%2Ffilialfin",
        "DistanceUnit": 0
    },
    "Connections": [
        {
            "ID": 67808,
            "ConnectionTypeID": 28,
            "StatusTypeID": 50,
            "LevelID": 2,
            "PowerKW": 3.7,
            "CurrentTypeID": 10,
            "Quantity": 1
        },
        {
            "ID": 67809,
            "ConnectionTypeID": 25,
            "StatusTypeID": 50,
            "LevelID": 2,
            "PowerKW": 11,
            "CurrentTypeID": 20,
            "Quantity": 1
        },
        {
            "ID": 67810,
            "ConnectionTypeID": 16,
            "StatusTypeID": 50,
            "LevelID": 2,
            "PowerKW": 3.7,
            "CurrentTypeID": 10,
            "Quantity": 0
        },
        {
            "ID": 67811,
            "ConnectionTypeID": 17,
            "StatusTypeID": 50,
            "LevelID": 2,
            "PowerKW": 0,
            "CurrentTypeID": 20,
            "Quantity": 0
        },
        {
            "ID": 67812,
            "ConnectionTypeID": 2,
            "StatusTypeID": 50,
            "LevelID": 2,
            "PowerKW": 0,
            "CurrentTypeID": 30,
            "Quantity": 0
        },
        {
            "ID": 67813,
            "ConnectionTypeID": 33,
            "StatusTypeID": 50,
            "LevelID": 2,
            "PowerKW": 0,
            "CurrentTypeID": 30,
            "Quantity": 0
        }
    ],
    "NumberOfPoints": 2,
    "StatusTypeID": 50,
    "DateLastStatusUpdate": "2015-09-23T19:09:00Z",
    "DataQualityLevel": 1,
    "DateCreated": "2015-09-22T21:15:00Z",
    "SubmissionStatusTypeID": 200
}