{
    "IsRecentlyVerified": false,
    "ID": 8221,
    "UUID": "E70F9417-1B79-49E4-BCB9-20A8F9B62696",
    "DataProviderID": 15,
    "DataProvidersReference": "5877",
    "OperatorID": 26,
    "AddressInfo": {
        "ID": 8118,
        "Title": "120 East 23RD St",
        "AddressLine1": "120 East 23RD St",
        "Town": "Panama City",
        "StateOrProvince": "FL",
        "Postcode": "32405",
        "CountryID": 2,
        "Latitude": 30.18905,
        "Longitude": -85.65742,
        "ContactTelephone1": " (850) 785-9561",
        "RelatedURL": "http://carstations.com/5877",
        "DistanceUnit": 0
    },
    "Connections": [
        {
            "ID": 5650,
            "ConnectionTypeID": 1,
            "Reference": "J1772",
            "LevelID": 2
        }
    ],
    "StatusTypeID": 0,
    "DateLastStatusUpdate": "2017-11-04T14:03:00Z",
    "DataQualityLevel": 1,
    "DateCreated": "2011-11-11T12:06:00Z",
    "SubmissionStatusTypeID": 100
}