{
    "UserComments": [
        {
            "ID": 21300,
            "ChargePointID": 130541,
            "CommentTypeID": 10,
            "UserName": "Jordanaous",
            "Comment": "This location is currently not operational, but there's a sign on the machine saying that it should be available soon. There are two parking spaces, with support for DC and AC fast charging. Sign also points to £1.80 connection fee with 30p/kWh charging. ",
            "DateCreated": "2019-08-06T10:23:55.447Z",
            "User": {
                "ID": 21820,
                "Username": "Jordanaous"
            },
            "CheckinStatusTypeID": 140
        }
    ],
    "IsRecentlyVerified": false,
    "ID": 130541,
    "UUID": "51DC68FC-958F-4872-9C8D-5B76E088C080",
    "DataProviderID": 1,
    "OperatorID": 150,
    "UsageTypeID": 4,
    "UsageCost": "£1.80 + £0.30/kWh",
    "AddressInfo": {
        "ID": 130887,
        "Title": "Morrisons Strood",
        "AddressLine1": "Morrisons, Knight Road",
        "Town": "Strood",
        "StateOrProvince": "Kent",
        "Postcode": "ME2 2AA",
        "CountryID": 1,
        "Latitude": 51.3930428411291,
        "Longitude": 0.492176631398934,
        "DistanceUnit": 0
    },
    "Connections": [
        {
            "ID": 182744,
            "ConnectionTypeID": 33,
            "StatusTypeID": 50,
            "LevelID": 3,
            "PowerKW": 50,
            "CurrentTypeID": 30,
            "Quantity": 1
        },
        {
            "ID": 182745,
            "ConnectionTypeID": 1036,
            "StatusTypeID": 50,
            "LevelID": 3,
            "Amps": 63,
            "Voltage": 400,
            "PowerKW": 43,
            "CurrentTypeID": 20,
            "Quantity": 1
        },
        {
            "ID": 182746,
            "ConnectionTypeID": 2,
            "StatusTypeID": 50,
            "LevelID": 3,
            "PowerKW": 50,
            "CurrentTypeID": 30,
            "Quantity": 1
        }
    ],
    "NumberOfPoints": 2,
    "GeneralComments": "Construction almost finished, should be operational soon. ",
    "StatusTypeID": 50,
    "DateLastStatusUpdate": "2019-12-04T10:52:00Z",
    "DataQualityLevel": 1,
    "DateCreated": "2019-08-06T10:21:00Z",
    "SubmissionStatusTypeID": 200
}