{
    "IsRecentlyVerified": false,
    "ID": 186190,
    "UUID": "67AE254F-624B-41C7-AAA2-F3E61FF1AD4B",
    "DataProviderID": 29,
    "DataProvidersReference": "6139",
    "OperatorID": 2243,
    "AddressInfo": {
        "ID": 186549,
        "Title": "Marie-Tilch-Str. 2a",
        "AddressLine1": "Marie-Tilch-Str. 2a",
        "Town": "Chemnitz",
        "Postcode": "09123",
        "CountryID": 87,
        "Latitude": 50.78326,
        "Longitude": 12.87729,
        "DistanceUnit": 0
    },
    "Connections": [
        {
            "ID": 298170,
            "ConnectionTypeID": 28,
            "StatusTypeID": 50,
            "LevelID": 2,
            "PowerKW": 22,
            "CurrentTypeID": 20
        },
        {
            "ID": 298171,
            "ConnectionTypeID": 25,
            "StatusTypeID": 50,
            "LevelID": 2,
            "PowerKW": 22,
            "CurrentTypeID": 20
        },
        {
            "ID": 298172,
            "ConnectionTypeID": 28,
            "StatusTypeID": 50,
            "LevelID": 2,
            "PowerKW": 22,
            "CurrentTypeID": 20
        },
        {
            "ID": 298173,
            "ConnectionTypeID": 25,
            "StatusTypeID": 50,
            "LevelID": 2,
            "PowerKW": 22,
            "CurrentTypeID": 20
        }
    ],
    "StatusTypeID": 50,
    "DateLastStatusUpdate": "2021-07-12T02:45:00Z",
    "MetadataValues": [
        {
            "ID": 18432,
            "MetadataFieldID": 4,
            "ItemValue": "Data from the German chargepoint registry provided by Bundesnetzagentur.de under the CC-BY 4.0 license"
        }
    ],
    "DataQualityLevel": 3,
    "DateCreated": "2021-07-12T02:45:00Z",
    "SubmissionStatusTypeID": 100
}