{
    "IsRecentlyVerified": false,
    "ID": 35301,
    "UUID": "DED4593F-0A1C-4824-8DC4-05934D264487",
    "DataProviderID": 26,
    "DataProvidersReference": "50893",
    "OperatorID": 180,
    "OperatorsReference": "Alfen GDH2041",
    "UsageCost": "0.00 jaarabonnement",
    "AddressInfo": {
        "ID": 35647,
        "Title": "Waterlandsingel 154",
        "AddressLine1": "Waterlandsingel 154",
        "Town": "Den Haag",
        "Postcode": "2548 TB",
        "CountryID": 159,
        "Latitude": 52.02453,
        "Longitude": 4.291592,
        "ContactTelephone1": "036 - 549 34 00",
        "RelatedURL": "http://www.icu-charging-stations.com/",
        "DistanceUnit": 0
    },
    "Connections": [
        {
            "ID": 38812,
            "ConnectionTypeID": 25,
            "LevelID": 2,
            "PowerKW": 11,
            "CurrentTypeID": 10
        },
        {
            "ID": 47798,
            "ConnectionTypeID": 25,
            "LevelID": 2,
            "PowerKW": 11,
            "CurrentTypeID": 10
        }
    ],
    "NumberOfPoints": 1,
    "StatusTypeID": 50,
    "DateLastStatusUpdate": "2016-06-04T02:44:00Z",
    "DataQualityLevel": 3,
    "DateCreated": "2015-01-09T06:04:00Z",
    "SubmissionStatusTypeID": 100
}