{
    "IsRecentlyVerified": false,
    "ID": 154189,
    "UUID": "6D48EA8F-1F9C-443E-857E-3239292EF2C2",
    "DataProviderID": 28,
    "DataProvidersReference": "FR*S27*PPHILBERTRISLE*INTER",
    "UsageTypeID": 5,
    "AddressInfo": {
        "ID": 154542,
        "Title": "900050",
        "AddressLine1": "Intermarché- médiathèque St Phibert sur Risle",
        "CountryID": 80,
        "Latitude": 49.293963,
        "Longitude": 0.659175,
        "AccessComments": "24/24 7/7 jours",
        "DistanceUnit": 0
    },
    "Connections": [
        {
            "ID": 216721,
            "ConnectionTypeID": 28,
            "StatusTypeID": 50,
            "LevelID": 2,
            "PowerKW": 22,
            "CurrentTypeID": 10
        },
        {
            "ID": 216722,
            "ConnectionTypeID": 26,
            "StatusTypeID": 50,
            "LevelID": 2,
            "PowerKW": 22
        },
        {
            "ID": 251088,
            "ConnectionTypeID": 28,
            "StatusTypeID": 50,
            "LevelID": 2,
            "PowerKW": 22,
            "CurrentTypeID": 10
        },
        {
            "ID": 251089,
            "ConnectionTypeID": 26,
            "StatusTypeID": 50,
            "LevelID": 2,
            "PowerKW": 22
        }
    ],
    "GeneralComments": "Borne en service",
    "StatusTypeID": 50,
    "DateLastStatusUpdate": "2020-08-27T05:16:00Z",
    "DataQualityLevel": 2,
    "DateCreated": "2020-03-15T10:55:00Z",
    "SubmissionStatusTypeID": 100
}