{
    "IsRecentlyVerified": false,
    "ID": 38006,
    "UUID": "21E4144F-1A6B-42F1-91C2-867DD50867AF",
    "DataProviderID": 26,
    "DataProvidersReference": "25970",
    "OperatorID": 78,
    "OperatorsReference": "Essent EM-NL-00000363-06-00001",
    "UsageCost": "0.00 jaarabonnement",
    "AddressInfo": {
        "ID": 38352,
        "Title": "Kamillestraat 1",
        "AddressLine1": "Kamillestraat 1",
        "Town": "Amsterdam",
        "Postcode": "1032 VV",
        "CountryID": 159,
        "Latitude": 52.398727,
        "Longitude": 4.918056,
        "RelatedURL": "http://www.essent.nl",
        "DistanceUnit": 0
    },
    "Connections": [
        {
            "ID": 41517,
            "ConnectionTypeID": 25,
            "LevelID": 2,
            "PowerKW": 11,
            "CurrentTypeID": 10
        },
        {
            "ID": 49419,
            "ConnectionTypeID": 25,
            "LevelID": 2,
            "PowerKW": 11,
            "CurrentTypeID": 10
        },
        {
            "ID": 49420,
            "ConnectionTypeID": 25,
            "LevelID": 2,
            "PowerKW": 11,
            "CurrentTypeID": 10
        },
        {
            "ID": 49421,
            "ConnectionTypeID": 25,
            "LevelID": 2,
            "PowerKW": 11,
            "CurrentTypeID": 10
        }
    ],
    "NumberOfPoints": 1,
    "StatusTypeID": 50,
    "DateLastStatusUpdate": "2016-06-04T02:54:00Z",
    "DataQualityLevel": 3,
    "DateCreated": "2015-01-09T06:07:00Z",
    "SubmissionStatusTypeID": 100
}