{
    "IsRecentlyVerified": false,
    "ID": 71910,
    "UUID": "0212DC6D-F8D2-4953-9338-83619B97E592",
    "DataProviderID": 1,
    "UsageTypeID": 4,
    "AddressInfo": {
        "ID": 72256,
        "Title": "eBorn SDE07 - Place Pécourte",
        "AddressLine1": "Place Pécourte",
        "Town": "Aubenas",
        "Postcode": "07200",
        "CountryID": 80,
        "Latitude": 44.619606,
        "Longitude": 4.387481,
        "RelatedURL": "http://www.sde07.com/",
        "DistanceUnit": 0
    },
    "Connections": [
        {
            "ID": 103052,
            "ConnectionTypeID": 25,
            "StatusTypeID": 50,
            "LevelID": 2,
            "Amps": 32,
            "Voltage": 400,
            "PowerKW": 22,
            "CurrentTypeID": 20,
            "Quantity": 2
        },
        {
            "ID": 103053,
            "ConnectionTypeID": 23,
            "StatusTypeID": 50,
            "LevelID": 2,
            "Amps": 16,
            "Voltage": 230,
            "PowerKW": 3,
            "CurrentTypeID": 10,
            "Quantity": 2
        }
    ],
    "NumberOfPoints": 2,
    "GeneralComments": "Nécessite le badge SDE07.\r\nFormulaire de demande de badge disponible à l'adresse suivante: http://www.sde07.com/communes-collectivites-ardeche/bornes-de-charges-vehicules-hybrides-electriques/",
    "StatusTypeID": 50,
    "DateLastStatusUpdate": "2016-09-25T14:29:00Z",
    "DataQualityLevel": 1,
    "DateCreated": "2016-09-22T14:05:00Z",
    "SubmissionStatusTypeID": 200
}