{
    "IsRecentlyVerified": false,
    "ID": 142681,
    "UUID": "A7E45ECF-5057-4B9F-B405-ADE05A40C738",
    "DataProviderID": 2,
    "DataProvidersReference": "123098",
    "OperatorID": 3372,
    "UsageTypeID": 1,
    "AddressInfo": {
        "ID": 143033,
        "Title": "Bear Mountain Inn and Overlook Lodge",
        "AddressLine1": "3020 Seven Lakes Dr",
        "Town": "Bear Mountain",
        "StateOrProvince": "NY",
        "Postcode": "10911",
        "CountryID": 2,
        "Latitude": 41.3130514,
        "Longitude": -73.9898898,
        "ContactTelephone1": "866-816-7584",
        "AccessComments": "24 hours daily",
        "RelatedURL": "http://evconnect.com/",
        "DistanceUnit": 0
    },
    "Connections": [
        {
            "ID": 198868,
            "ConnectionTypeID": 1,
            "LevelID": 2,
            "Amps": 16,
            "Voltage": 230,
            "PowerKW": 3.7,
            "CurrentTypeID": 10,
            "Quantity": 4
        }
    ],
    "StatusTypeID": 50,
    "DateLastStatusUpdate": "2020-06-26T03:04:00Z",
    "DataQualityLevel": 3,
    "DateCreated": "2019-12-24T09:18:00Z",
    "SubmissionStatusTypeID": 100
}