{
    "IsRecentlyVerified": false,
    "ID": 46815,
    "UUID": "49118FF8-E6F3-457B-ABF7-63F2222617AA",
    "DataProviderID": 1,
    "OperatorID": 189,
    "UsageTypeID": 4,
    "AddressInfo": {
        "ID": 47161,
        "Title": "E-Wald Ladesäule in Kirchroth",
        "AddressLine1": "Otto-Hiendl-Str.",
        "Town": "Kirchroth",
        "Postcode": "94356",
        "CountryID": 87,
        "Latitude": 48.9482141443696,
        "Longitude": 12.5463132186219,
        "DistanceUnit": 0
    },
    "Connections": [
        {
            "ID": 57551,
            "ConnectionTypeID": 25,
            "StatusTypeID": 50,
            "LevelID": 2,
            "Amps": 32,
            "Voltage": 400,
            "PowerKW": 22,
            "CurrentTypeID": 20,
            "Quantity": 2
        },
        {
            "ID": 57552,
            "ConnectionTypeID": 28,
            "StatusTypeID": 50,
            "LevelID": 2,
            "Amps": 16,
            "Voltage": 230,
            "PowerKW": 3.7,
            "CurrentTypeID": 10,
            "Quantity": 2
        }
    ],
    "NumberOfPoints": 2,
    "StatusTypeID": 50,
    "DateLastStatusUpdate": "2015-05-08T07:39:00Z",
    "DataQualityLevel": 1,
    "DateCreated": "2015-05-07T16:58:00Z",
    "SubmissionStatusTypeID": 200
}