{
    "IsRecentlyVerified": false,
    "ID": 93831,
    "UUID": "D57561DA-C796-4942-AB1E-10694FA05C86",
    "DataProviderID": 1,
    "OperatorID": 80,
    "UsageTypeID": 4,
    "UsageCost": "0,40 €/kWh",
    "AddressInfo": {
        "ID": 94177,
        "Title": "Eneldrive Vieste Lungomare Mattei",
        "AddressLine1": "Lungomare Enrico Mattei",
        "Town": "Vieste",
        "StateOrProvince": "FG",
        "Postcode": "71019",
        "CountryID": 112,
        "Latitude": 41.87811743884266,
        "Longitude": 16.176226173199424,
        "RelatedURL": "http://eneldrive.it",
        "DistanceUnit": 0
    },
    "Connections": [
        {
            "ID": 132830,
            "ConnectionTypeID": 25,
            "StatusTypeID": 50,
            "LevelID": 2,
            "Amps": 32,
            "Voltage": 400,
            "PowerKW": 22,
            "CurrentTypeID": 20,
            "Quantity": 1
        },
        {
            "ID": 132831,
            "ConnectionTypeID": 36,
            "StatusTypeID": 50,
            "LevelID": 2,
            "Amps": 16,
            "Voltage": 240,
            "PowerKW": 3,
            "CurrentTypeID": 10,
            "Quantity": 1
        }
    ],
    "NumberOfPoints": 2,
    "StatusTypeID": 50,
    "DateLastStatusUpdate": "2017-10-10T09:30:00Z",
    "DataQualityLevel": 1,
    "DateCreated": "2017-10-10T09:30:00Z",
    "SubmissionStatusTypeID": 200
}