{
    "IsRecentlyVerified": false,
    "ID": 179509,
    "UUID": "00F3B944-53DD-4371-AC37-CDC73A648354",
    "DataProviderID": 29,
    "DataProvidersReference": "14275",
    "OperatorID": 86,
    "AddressInfo": {
        "ID": 179868,
        "Title": "Bahnhofstr. 6A ",
        "AddressLine1": "Bahnhofstr. 6A ",
        "Town": "Ebelsbach ",
        "Postcode": "97500",
        "CountryID": 87,
        "Latitude": 49.984833,
        "Longitude": 10.668524,
        "DistanceUnit": 0
    },
    "Connections": [
        {
            "ID": 281421,
            "ConnectionTypeID": 33,
            "StatusTypeID": 50,
            "LevelID": 3,
            "PowerKW": 300,
            "CurrentTypeID": 30
        },
        {
            "ID": 281422,
            "ConnectionTypeID": 33,
            "StatusTypeID": 50,
            "LevelID": 3,
            "PowerKW": 300,
            "CurrentTypeID": 30
        }
    ],
    "StatusTypeID": 50,
    "DateLastStatusUpdate": "2021-07-12T02:44:00Z",
    "MetadataValues": [
        {
            "ID": 11803,
            "MetadataFieldID": 4,
            "ItemValue": "Data from the German chargepoint registry provided by Bundesnetzagentur.de under the CC-BY 4.0 license"
        }
    ],
    "DataQualityLevel": 3,
    "DateCreated": "2021-07-08T09:59:00Z",
    "SubmissionStatusTypeID": 100
}