{
    "IsRecentlyVerified": false,
    "ID": 17478,
    "UUID": "0A6BBFE3-804B-478F-ADA2-4254DB9B35B2",
    "DataProviderID": 22,
    "DataProvidersReference": "B91D12ADF38B1A2C446579B64E7C5A7C",
    "AddressInfo": {
        "ID": 17823,
        "Title": "日産プリンス愛媛販売松山支店",
        "AddressLine1": "愛媛県松山市福音寺町261",
        "CountryID": 114,
        "Latitude": 33.82203172,
        "Longitude": 132.7933747,
        "ContactTelephone1": "089-975-0211",
        "DistanceUnit": 0
    },
    "Connections": [
        {
            "ID": 17719,
            "ConnectionTypeID": 2,
            "LevelID": 2,
            "Amps": 100,
            "Voltage": 480,
            "PowerKW": 48,
            "Quantity": 1
        }
    ],
    "DateLastStatusUpdate": "2013-06-29T08:58:00Z",
    "DataQualityLevel": 2,
    "DateCreated": "2013-06-29T08:58:00Z",
    "SubmissionStatusTypeID": 200
}