{
    "MediaItems": [
        {
            "ID": 22867,
            "ChargePointID": 160857,
            "ItemURL": "https://s3-ap-southeast-2.amazonaws.com/openchargemap/images/PT/OCM160857/OCM-160857.orig.2020070119005642.jpg",
            "ItemThumbnailURL": "https://s3-ap-southeast-2.amazonaws.com/openchargemap/images/PT/OCM160857/OCM-160857.thmb.2020070119005642.jpg",
            "Comment": "",
            "IsEnabled": true,
            "IsVideo": false,
            "IsFeaturedItem": false,
            "IsExternalResource": false,
            "User": {
                "ID": 9177,
                "Username": "AlexMol"
            },
            "DateCreated": "2020-07-01T19:01:00Z"
        }
    ],
    "IsRecentlyVerified": false,
    "ID": 160857,
    "UUID": "269C8628-BE9A-4346-AB74-55004CAA720D",
    "DataProviderID": 1,
    "OperatorID": 21,
    "UsageTypeID": 4,
    "UsageCost": "0.102€ per minute + energy cost",
    "AddressInfo": {
        "ID": 161214,
        "Title": "LGA-00004",
        "AddressLine1": "Sítio do Vale de Deus",
        "Town": "Lagoa",
        "StateOrProvince": "Algarve",
        "Postcode": "8400-123",
        "CountryID": 180,
        "Latitude": 37.136443315658695,
        "Longitude": -8.466488197753733,
        "DistanceUnit": 0
    },
    "Connections": [
        {
            "ID": 231536,
            "ConnectionTypeID": 2,
            "StatusTypeID": 50,
            "LevelID": 3,
            "Amps": 120,
            "Voltage": 500,
            "PowerKW": 50,
            "CurrentTypeID": 30,
            "Quantity": 1
        },
        {
            "ID": 231537,
            "ConnectionTypeID": 33,
            "StatusTypeID": 50,
            "LevelID": 3,
            "Amps": 125,
            "Voltage": 500,
            "PowerKW": 50,
            "CurrentTypeID": 30,
            "Quantity": 1
        }
    ],
    "NumberOfPoints": 2,
    "StatusTypeID": 50,
    "DateLastStatusUpdate": "2020-07-23T08:48:00Z",
    "DataQualityLevel": 1,
    "DateCreated": "2020-07-01T19:00:00Z",
    "SubmissionStatusTypeID": 200
}