{
    "IsRecentlyVerified": false,
    "ID": 87767,
    "UUID": "74352482-EF8A-409B-937C-39273126C8AC",
    "DataProviderID": 1,
    "DataProvidersReference": "3977",
    "AddressInfo": {
        "ID": 88113,
        "Title": "ICA Supermarket: Helsingborg Gustavslund",
        "AddressLine1": "Mangårdsgatan 71",
        "Town": "HELSINGBORG",
        "StateOrProvince": "SKÅNE",
        "Postcode": "25664",
        "CountryID": 216,
        "Latitude": 56.03901,
        "Longitude": 12.75478,
        "AccessComments": "",
        "DistanceUnit": 0
    },
    "Connections": [
        {
            "ID": 124397,
            "ConnectionTypeID": 0,
            "Reference": "1",
            "LevelID": 2,
            "Amps": 16,
            "Voltage": 400,
            "PowerKW": 11,
            "Comments": "Mode 3"
        },
        {
            "ID": 124398,
            "ConnectionTypeID": 0,
            "Reference": "2",
            "LevelID": 2,
            "Amps": 16,
            "Voltage": 400,
            "PowerKW": 11,
            "Comments": "Mode 3"
        },
        {
            "ID": 124399,
            "ConnectionTypeID": 0,
            "Reference": "3",
            "LevelID": 2,
            "Amps": 16,
            "Voltage": 400,
            "PowerKW": 11,
            "Comments": "Mode 3"
        },
        {
            "ID": 124400,
            "ConnectionTypeID": 0,
            "Reference": "4",
            "LevelID": 2,
            "Amps": 16,
            "Voltage": 400,
            "PowerKW": 11,
            "Comments": "Mode 3"
        }
    ],
    "NumberOfPoints": 4,
    "DateLastStatusUpdate": "2020-05-26T08:21:00Z",
    "DataQualityLevel": 2,
    "DateCreated": "2017-05-16T11:07:00Z",
    "SubmissionStatusTypeID": 100
}