{
    "IsRecentlyVerified": false,
    "ID": 62137,
    "UUID": "E9F30D67-B959-4C84-BE39-23BBC03A97D5",
    "DataProviderID": 2,
    "DataProvidersReference": "71872",
    "UsageTypeID": 2,
    "AddressInfo": {
        "ID": 62483,
        "Title": "Caltrans - District 2",
        "AddressLine1": "1000 Center St",
        "Town": "Redding",
        "StateOrProvince": "CA",
        "Postcode": "96001",
        "CountryID": 2,
        "Latitude": 40.589165,
        "Longitude": -122.396782,
        "ContactTelephone1": "",
        "AccessComments": "Employee and state vehicle use only",
        "RelatedURL": "",
        "DistanceUnit": 0
    },
    "Connections": [
        {
            "ID": 79040,
            "ConnectionTypeID": 1,
            "LevelID": 2,
            "Amps": 16,
            "Voltage": 230,
            "PowerKW": 3.7,
            "CurrentTypeID": 10,
            "Quantity": 6
        }
    ],
    "DateLastStatusUpdate": "2020-06-26T03:03:00Z",
    "DataQualityLevel": 3,
    "DateCreated": "2016-03-03T11:38:00Z",
    "SubmissionStatusTypeID": 100
}