{
    "IsRecentlyVerified": false,
    "ID": 182825,
    "UUID": "9A82E0FA-39A0-452F-93D3-20D96D260D89",
    "DataProviderID": 29,
    "DataProvidersReference": "18979",
    "AddressInfo": {
        "ID": 183184,
        "Title": "Mühleneschweg 9",
        "AddressLine1": "Mühleneschweg 9",
        "Town": "Osnabrück",
        "Postcode": "49090",
        "CountryID": 87,
        "Latitude": 52.293118,
        "Longitude": 8.033266,
        "DistanceUnit": 0
    },
    "Connections": [
        {
            "ID": 289042,
            "ConnectionTypeID": 33,
            "StatusTypeID": 50,
            "LevelID": 3,
            "PowerKW": 22,
            "CurrentTypeID": 30
        },
        {
            "ID": 289043,
            "ConnectionTypeID": 25,
            "StatusTypeID": 50,
            "LevelID": 2,
            "PowerKW": 11,
            "CurrentTypeID": 20
        }
    ],
    "StatusTypeID": 50,
    "DateLastStatusUpdate": "2021-07-12T02:49:00Z",
    "MetadataValues": [
        {
            "ID": 15118,
            "MetadataFieldID": 4,
            "ItemValue": "Data from the German chargepoint registry provided by Bundesnetzagentur.de under the CC-BY 4.0 license"
        }
    ],
    "DataQualityLevel": 3,
    "DateCreated": "2021-07-08T10:03:00Z",
    "SubmissionStatusTypeID": 100
}