{
    "IsRecentlyVerified": false,
    "ID": 41908,
    "UUID": "48F328C6-717F-4762-93E3-1F9031C1D7D1",
    "DataProviderID": 1,
    "OperatorID": 44,
    "UsageTypeID": 3,
    "UsageCost": "Free",
    "AddressInfo": {
        "ID": 42254,
        "Title": "Marlot",
        "AddressLine1": "Van Hoeylaan 40",
        "AddressLine2": "",
        "Town": "Den Haag",
        "StateOrProvince": "ZH",
        "Postcode": "2594 CS",
        "CountryID": 159,
        "Latitude": 52.1020588,
        "Longitude": 4.3604792,
        "ContactTelephone1": "+31654947900",
        "ContactTelephone2": "",
        "ContactEmail": "info@tirion.nu",
        "AccessComments": "On the premises, behind a gate.",
        "RelatedURL": "http://www.tirion.nu",
        "DistanceUnit": 0
    },
    "Connections": [
        {
            "ID": 50266,
            "ConnectionTypeID": 25,
            "StatusTypeID": 50,
            "LevelID": 2,
            "Amps": 25,
            "Voltage": 230,
            "PowerKW": 17,
            "CurrentTypeID": 20,
            "Quantity": 1
        }
    ],
    "NumberOfPoints": 1,
    "GeneralComments": "",
    "StatusTypeID": 50,
    "DateLastStatusUpdate": "2015-04-17T19:32:00Z",
    "DataQualityLevel": 1,
    "DateCreated": "2015-02-18T14:56:00Z",
    "SubmissionStatusTypeID": 200
}