{
    "IsRecentlyVerified": false,
    "ID": 79811,
    "UUID": "CE4038E5-AF78-4D75-853D-60F1DA28B6C8",
    "DataProviderID": 1,
    "OperatorID": 23,
    "OperatorsReference": "9097",
    "UsageTypeID": 4,
    "UsageCost": "Free",
    "AddressInfo": {
        "ID": 80157,
        "Title": "Trois Tilleuls Hotel & Spa",
        "AddressLine1": "290 Rue Richelieu",
        "Town": "Saint-Marc-sur-Richelieu",
        "StateOrProvince": "QC",
        "Postcode": "J0L 2E0",
        "CountryID": 44,
        "Latitude": 45.648162,
        "Longitude": -73.206113,
        "ContactTelephone1": "(514) 856-7787",
        "DistanceUnit": 0
    },
    "Connections": [
        {
            "ID": 114458,
            "ConnectionTypeID": 30,
            "StatusTypeID": 50,
            "LevelID": 2,
            "PowerKW": 16,
            "CurrentTypeID": 20,
            "Quantity": 1
        }
    ],
    "NumberOfPoints": 1,
    "GeneralComments": "1 Tesla Connector, up to 16kW.Available to the public. Self park.",
    "StatusTypeID": 50,
    "DateLastStatusUpdate": "2017-01-30T13:20:00Z",
    "DataQualityLevel": 1,
    "DateCreated": "2017-01-30T13:20:00Z",
    "SubmissionStatusTypeID": 200
}