{
    "IsRecentlyVerified": false,
    "ID": 124078,
    "UUID": "BDF76761-BC79-4D76-93E7-59AD75F19A8D",
    "DataProviderID": 2,
    "DataProvidersReference": "117538",
    "OperatorID": 5,
    "UsageTypeID": 1,
    "AddressInfo": {
        "ID": 124424,
        "Title": "RICO EV CHARGER",
        "AddressLine1": "2 S Commercial St",
        "Town": "Rico",
        "StateOrProvince": "CO",
        "Postcode": "81332",
        "CountryID": 2,
        "Latitude": 37.692933,
        "Longitude": -108.0303393,
        "ContactTelephone1": "888-758-4389",
        "AccessComments": "24 hours daily",
        "RelatedURL": "http://www.chargepoint.com/",
        "DistanceUnit": 0
    },
    "Connections": [
        {
            "ID": 174128,
            "ConnectionTypeID": 1,
            "LevelID": 2,
            "Amps": 16,
            "Voltage": 230,
            "PowerKW": 3.7,
            "CurrentTypeID": 10,
            "Quantity": 2
        }
    ],
    "DateLastStatusUpdate": "2020-06-26T02:59:00Z",
    "DataQualityLevel": 3,
    "DateCreated": "2019-04-06T05:03:00Z",
    "SubmissionStatusTypeID": 100
}