{
    "IsRecentlyVerified": false,
    "ID": 123290,
    "UUID": "56011CB1-B459-4A79-AB26-B398EC1039F1",
    "DataProviderID": 2,
    "DataProvidersReference": "103860",
    "OperatorID": 5,
    "UsageTypeID": 1,
    "AddressInfo": {
        "ID": 123636,
        "Title": "DC SOLAR",
        "AddressLine1": "12325 NV-160",
        "Town": "Las Vegas",
        "StateOrProvince": "NV",
        "Postcode": "89161",
        "CountryID": 2,
        "Latitude": 36.0345511,
        "Longitude": -115.3595251,
        "ContactTelephone1": "888-758-4389",
        "AccessComments": "24 hours daily",
        "RelatedURL": "http://www.chargepoint.com/",
        "DistanceUnit": 0
    },
    "Connections": [
        {
            "ID": 173251,
            "ConnectionTypeID": 1,
            "LevelID": 2,
            "Amps": 16,
            "Voltage": 230,
            "PowerKW": 3,
            "CurrentTypeID": 10,
            "Quantity": 1
        }
    ],
    "DateLastStatusUpdate": "2019-12-24T09:12:00Z",
    "DataQualityLevel": 3,
    "DateCreated": "2019-04-06T05:03:00Z",
    "SubmissionStatusTypeID": 100
}