{
    "IsRecentlyVerified": false,
    "ID": 43550,
    "UUID": "A59AF731-C100-46DA-8651-DF7150C76945",
    "DataProviderID": 1,
    "OperatorID": 32,
    "OperatorsReference": "1779",
    "UsageTypeID": 4,
    "UsageCost": "Inclusive; for Polar Plus subscription members only",
    "AddressInfo": {
        "ID": 43896,
        "Title": "Fitzroy Court Student Village",
        "AddressLine1": "Lea Road",
        "Town": "Luton",
        "StateOrProvince": "Bedfordshire",
        "Postcode": "LU1 3HZ",
        "CountryID": 1,
        "Latitude": 51.877427,
        "Longitude": -0.408774,
        "AccessComments": "Rear of Fitzroy Court",
        "DistanceUnit": 0
    },
    "Connections": [
        {
            "ID": 52825,
            "ConnectionTypeID": 25,
            "StatusTypeID": 50,
            "LevelID": 2,
            "Amps": 32,
            "Voltage": 230,
            "PowerKW": 7,
            "CurrentTypeID": 10,
            "Quantity": 2
        }
    ],
    "NumberOfPoints": 2,
    "GeneralComments": "Chargemaster post 1779. Formerly on Source East.",
    "StatusTypeID": 50,
    "DateLastStatusUpdate": "2019-03-08T06:13:00Z",
    "DataQualityLevel": 1,
    "DateCreated": "2015-04-03T20:57:00Z",
    "SubmissionStatusTypeID": 200
}