{
    "IsRecentlyVerified": false,
    "ID": 101649,
    "UUID": "E1CF7D06-46D7-49E5-9F75-689F58A0EAC1",
    "DataProviderID": 1,
    "OperatorID": 156,
    "UsageTypeID": 4,
    "AddressInfo": {
        "ID": 101995,
        "Title": "Theodor-Heuss-Straße 40",
        "AddressLine1": "Theodor-Heuss-Straße 40",
        "AddressLine2": "Unter-Hambach",
        "Town": "Heppenheim",
        "StateOrProvince": "Kreis Bergstraße",
        "Postcode": "64646",
        "CountryID": 87,
        "Latitude": 49.635332077784895,
        "Longitude": 8.621664818179966,
        "AccessComments": "24/7 nutzbar auf nicht reserviertem Parkplatz.",
        "DistanceUnit": 0
    },
    "Connections": [
        {
            "ID": 143493,
            "ConnectionTypeID": 25,
            "StatusTypeID": 50,
            "LevelID": 2,
            "Amps": 32,
            "Voltage": 400,
            "PowerKW": 22,
            "CurrentTypeID": 20,
            "Quantity": 1
        }
    ],
    "NumberOfPoints": 1,
    "StatusTypeID": 50,
    "DateLastStatusUpdate": "2018-04-03T12:25:00Z",
    "DataQualityLevel": 1,
    "DateCreated": "2018-04-03T12:25:00Z",
    "SubmissionStatusTypeID": 200
}