{
    "IsRecentlyVerified": false,
    "ID": 94100,
    "UUID": "0ED0F539-CF33-4259-8FED-76B7CC81B555",
    "DataProviderID": 1,
    "OperatorID": 220,
    "OperatorsReference": "4724,4725",
    "UsageTypeID": 1,
    "UsageCost": "€1.73 + €0.3213/kWh; Andere Tarife möglich",
    "AddressInfo": {
        "ID": 94446,
        "Title": "Frohmestraße 16",
        "AddressLine1": "Frohmestraße 16",
        "Town": "Eimsbüttel",
        "StateOrProvince": "Hamburg",
        "Postcode": "22457",
        "CountryID": 87,
        "Latitude": 53.63462,
        "Longitude": 9.9192,
        "DistanceUnit": 0
    },
    "Connections": [
        {
            "ID": 133182,
            "ConnectionTypeID": 25,
            "StatusTypeID": 50,
            "LevelID": 2,
            "Amps": 32,
            "Voltage": 400,
            "PowerKW": 22,
            "CurrentTypeID": 20,
            "Quantity": 2
        }
    ],
    "NumberOfPoints": 2,
    "StatusTypeID": 50,
    "DateLastStatusUpdate": "2017-10-18T05:39:00Z",
    "DataQualityLevel": 1,
    "DateCreated": "2017-10-17T05:40:00Z",
    "SubmissionStatusTypeID": 200
}