{
    "IsRecentlyVerified": false,
    "ID": 43528,
    "UUID": "F2F4DBBE-AFD5-46E6-AF84-1C441B44964C",
    "DataProviderID": 1,
    "OperatorID": 19,
    "UsageTypeID": 1,
    "UsageCost": "",
    "AddressInfo": {
        "ID": 43874,
        "Title": "Haworth Old Hall ",
        "AddressLine1": "Sun Street ",
        "AddressLine2": "",
        "Town": "Haworth ",
        "StateOrProvince": "West Yorkshire ",
        "Postcode": "BD22 8BP",
        "CountryID": 1,
        "Latitude": 53.8283444742648,
        "Longitude": -1.9538283348083494,
        "ContactTelephone1": "01535 642 709",
        "ContactTelephone2": "",
        "ContactEmail": "info@hawortholdhall.co.uk",
        "AccessComments": "",
        "RelatedURL": "http://www.hawortholdhall.co.uk/",
        "DistanceUnit": 0
    },
    "Connections": [
        {
            "ID": 52793,
            "ConnectionTypeID": 25,
            "StatusTypeID": 50,
            "LevelID": 2,
            "Amps": 32,
            "Voltage": 230,
            "PowerKW": 7,
            "CurrentTypeID": 10,
            "Quantity": 1
        }
    ],
    "NumberOfPoints": 1,
    "GeneralComments": "",
    "StatusTypeID": 50,
    "DateLastStatusUpdate": "2017-10-27T10:33:00Z",
    "DataQualityLevel": 1,
    "DateCreated": "2015-03-26T08:45:00Z",
    "SubmissionStatusTypeID": 200
}