{
    "IsRecentlyVerified": false,
    "ID": 97929,
    "UUID": "3F98C088-84BE-4D7D-B0CD-39D4A232F2AA",
    "DataProviderID": 1,
    "OperatorID": 23,
    "OperatorsReference": "38734",
    "UsageTypeID": 4,
    "AddressInfo": {
        "ID": 98275,
        "Title": "Red Roof Inn Little Rock",
        "AddressLine1": "8115 Frenchmans LN",
        "Town": "Little Rock",
        "StateOrProvince": "Arkansas",
        "Postcode": "72209",
        "CountryID": 2,
        "Latitude": 34.677106,
        "Longitude": -92.3467039,
        "ContactTelephone1": "(501) 562-9383",
        "DistanceUnit": 0
    },
    "Connections": [
        {
            "ID": 138837,
            "ConnectionTypeID": 30,
            "StatusTypeID": 50,
            "LevelID": 2,
            "PowerKW": 8,
            "CurrentTypeID": 10,
            "Quantity": 1
        }
    ],
    "NumberOfPoints": 1,
    "GeneralComments": "1 Tesla Connector, up to 8kW.Available for customers. Please see front desk.",
    "StatusTypeID": 50,
    "DateLastStatusUpdate": "2018-01-21T17:01:00Z",
    "DataQualityLevel": 1,
    "DateCreated": "2018-01-21T17:01:00Z",
    "SubmissionStatusTypeID": 200
}