{
    "IsRecentlyVerified": false,
    "ID": 65738,
    "UUID": "E0FA2345-35C5-4548-B9FC-18ED3F3EAA88",
    "DataProviderID": 26,
    "DataProvidersReference": "84214",
    "OperatorID": 103,
    "OperatorsReference": "Allego NLALLEGO0006342",
    "UsageCost": "0.00 jaarabonnement",
    "AddressInfo": {
        "ID": 66084,
        "Title": "Paul Kleestraat 17",
        "AddressLine1": "Paul Kleestraat 17",
        "Town": "Almere",
        "Postcode": "1328 HC",
        "CountryID": 159,
        "Latitude": 52.37333761,
        "Longitude": 5.25941077,
        "ContactTelephone1": "0800-3745337",
        "RelatedURL": "http://www.allego.eu/",
        "DistanceUnit": 0
    },
    "Connections": [
        {
            "ID": 90762,
            "ConnectionTypeID": 25,
            "LevelID": 2,
            "PowerKW": 11,
            "CurrentTypeID": 10
        },
        {
            "ID": 90763,
            "ConnectionTypeID": 25,
            "LevelID": 2,
            "PowerKW": 11,
            "CurrentTypeID": 10
        }
    ],
    "NumberOfPoints": 1,
    "StatusTypeID": 50,
    "DateLastStatusUpdate": "2016-06-04T02:53:00Z",
    "DataQualityLevel": 3,
    "DateCreated": "2016-04-27T09:42:00Z",
    "SubmissionStatusTypeID": 100
}