{
    "IsRecentlyVerified": false,
    "ID": 121811,
    "UUID": "C491D53B-1953-46E8-A812-BC5FF6BC4F9E",
    "DataProviderID": 2,
    "DataProvidersReference": "100369",
    "OperatorID": 5,
    "UsageTypeID": 1,
    "AddressInfo": {
        "ID": 122157,
        "Title": "DELTA AIR LINES",
        "AddressLine1": "1021 N Outer Loop Rd",
        "Town": "Atlanta",
        "StateOrProvince": "GA",
        "Postcode": "30320",
        "CountryID": 2,
        "Latitude": 33.658477,
        "Longitude": -84.423953,
        "ContactTelephone1": "888-758-4389",
        "AccessComments": "24 hours daily",
        "RelatedURL": "http://www.chargepoint.com/",
        "DistanceUnit": 0
    },
    "Connections": [
        {
            "ID": 171642,
            "ConnectionTypeID": 1,
            "LevelID": 2,
            "Amps": 16,
            "Voltage": 230,
            "PowerKW": 3.7,
            "CurrentTypeID": 10,
            "Quantity": 8
        }
    ],
    "DateLastStatusUpdate": "2020-06-26T02:55:00Z",
    "DataQualityLevel": 3,
    "DateCreated": "2019-04-06T05:02:00Z",
    "SubmissionStatusTypeID": 100
}