{
    "UserComments": [
        {
            "ID": 22572,
            "ChargePointID": 132637,
            "CommentTypeID": 10,
            "UserName": "ForumElettrico.it",
            "Comment": "Due posti ben delimitati e segnati, pericolosamente vicino all'ingresso, quindi a rischio abusivi. Leggi la recensione completa qui > \r\nhttps://www.forumelettrico.it/forum/lidl-22-22-kw-via-cattaneo-1-t7321.html",
            "RelatedURL": "https://www.forumelettrico.it/forum/lidl-22-22-kw-via-cattaneo-1-t7321.html",
            "DateCreated": "2020-05-10T14:39:05.213Z",
            "User": {
                "ID": 11749,
                "Username": "ForumElettrico.it"
            },
            "CheckinStatusTypeID": 10,
            "IsActionedByEditor": false
        }
    ],
    "MediaItems": [
        {
            "ID": 22263,
            "ChargePointID": 132637,
            "ItemURL": "https://s3-ap-southeast-2.amazonaws.com/openchargemap/images/IT/OCM132637/OCM-132637.orig.2020051014393467.jpg",
            "ItemThumbnailURL": "https://s3-ap-southeast-2.amazonaws.com/openchargemap/images/IT/OCM132637/OCM-132637.thmb.2020051014393467.jpg",
            "Comment": "",
            "IsEnabled": true,
            "IsVideo": false,
            "IsFeaturedItem": false,
            "IsExternalResource": false,
            "User": {
                "ID": 11749,
                "Username": "ForumElettrico.it"
            },
            "DateCreated": "2020-05-10T14:40:00Z"
        },
        {
            "ID": 22264,
            "ChargePointID": 132637,
            "ItemURL": "https://s3-ap-southeast-2.amazonaws.com/openchargemap/images/IT/OCM132637/OCM-132637.orig.2020051014394514.jpg",
            "ItemThumbnailURL": "https://s3-ap-southeast-2.amazonaws.com/openchargemap/images/IT/OCM132637/OCM-132637.thmb.2020051014394514.jpg",
            "Comment": "",
            "IsEnabled": true,
            "IsVideo": false,
            "IsFeaturedItem": false,
            "IsExternalResource": false,
            "User": {
                "ID": 11749,
                "Username": "ForumElettrico.it"
            },
            "DateCreated": "2020-05-10T14:40:00Z"
        },
        {
            "ID": 22260,
            "ChargePointID": 132637,
            "ItemURL": "https://s3-ap-southeast-2.amazonaws.com/openchargemap/images/IT/OCM132637/OCM-132637.orig.2020051014391562.jpg",
            "ItemThumbnailURL": "https://s3-ap-southeast-2.amazonaws.com/openchargemap/images/IT/OCM132637/OCM-132637.thmb.2020051014391562.jpg",
            "Comment": "",
            "IsEnabled": true,
            "IsVideo": false,
            "IsFeaturedItem": false,
            "IsExternalResource": false,
            "User": {
                "ID": 11749,
                "Username": "ForumElettrico.it"
            },
            "DateCreated": "2020-05-10T14:39:00Z"
        },
        {
            "ID": 22261,
            "ChargePointID": 132637,
            "ItemURL": "https://s3-ap-southeast-2.amazonaws.com/openchargemap/images/IT/OCM132637/OCM-132637.orig.2020051014392208.jpg",
            "ItemThumbnailURL": "https://s3-ap-southeast-2.amazonaws.com/openchargemap/images/IT/OCM132637/OCM-132637.thmb.2020051014392208.jpg",
            "Comment": "",
            "IsEnabled": true,
            "IsVideo": false,
            "IsFeaturedItem": false,
            "IsExternalResource": false,
            "User": {
                "ID": 11749,
                "Username": "ForumElettrico.it"
            },
            "DateCreated": "2020-05-10T14:39:00Z"
        },
        {
            "ID": 22262,
            "ChargePointID": 132637,
            "ItemURL": "https://s3-ap-southeast-2.amazonaws.com/openchargemap/images/IT/OCM132637/OCM-132637.orig.2020051014392865.jpg",
            "ItemThumbnailURL": "https://s3-ap-southeast-2.amazonaws.com/openchargemap/images/IT/OCM132637/OCM-132637.thmb.2020051014392865.jpg",
            "Comment": "",
            "IsEnabled": true,
            "IsVideo": false,
            "IsFeaturedItem": false,
            "IsExternalResource": false,
            "User": {
                "ID": 11749,
                "Username": "ForumElettrico.it"
            },
            "DateCreated": "2020-05-10T14:39:00Z"
        }
    ],
    "IsRecentlyVerified": false,
    "ID": 132637,
    "UUID": "DB766D1B-83FE-4816-BB09-936FB7C6FE71",
    "DataProviderID": 1,
    "OperatorID": 38,
    "UsageTypeID": 1,
    "UsageCost": "free",
    "AddressInfo": {
        "ID": 132983,
        "Title": "LIDL Bollate",
        "AddressLine1": "Via Carlo Cattaneo",
        "Town": "Bollate",
        "StateOrProvince": "MI",
        "Postcode": "20021",
        "CountryID": 112,
        "Latitude": 45.540990182812635,
        "Longitude": 9.108436423270973,
        "RelatedURL": "https://www.lidl.it",
        "DistanceUnit": 0
    },
    "Connections": [
        {
            "ID": 185697,
            "ConnectionTypeID": 25,
            "StatusTypeID": 50,
            "LevelID": 2,
            "Amps": 32,
            "Voltage": 400,
            "PowerKW": 22,
            "CurrentTypeID": 20,
            "Quantity": 2
        }
    ],
    "NumberOfPoints": 2,
    "StatusTypeID": 50,
    "DateLastStatusUpdate": "2020-05-10T14:40:00Z",
    "DataQualityLevel": 1,
    "DateCreated": "2019-10-04T12:23:00Z",
    "SubmissionStatusTypeID": 200
}