{
    "MediaItems": [
        {
            "ID": 2975,
            "ChargePointID": 51572,
            "ItemURL": "https://s3-ap-southeast-2.amazonaws.com/openchargemap/images/NO/OCM51572/OCM-51572.orig.2015080621085840.jpg",
            "ItemThumbnailURL": "https://s3-ap-southeast-2.amazonaws.com/openchargemap/images/NO/OCM51572/OCM-51572.thmb.2015080621085840.jpg",
            "Comment": "",
            "IsEnabled": true,
            "IsVideo": false,
            "IsFeaturedItem": false,
            "IsExternalResource": false,
            "User": {
                "ID": 4803,
                "Username": "Pudderjagar"
            },
            "DateCreated": "2015-08-06T21:09:00Z"
        },
        {
            "ID": 2974,
            "ChargePointID": 51572,
            "ItemURL": "https://s3-ap-southeast-2.amazonaws.com/openchargemap/images/NO/OCM51572/OCM-51572.orig.2015080621062487.jpg",
            "ItemThumbnailURL": "https://s3-ap-southeast-2.amazonaws.com/openchargemap/images/NO/OCM51572/OCM-51572.thmb.2015080621062487.jpg",
            "Comment": "",
            "IsEnabled": true,
            "IsVideo": false,
            "IsFeaturedItem": false,
            "IsExternalResource": false,
            "User": {
                "ID": 4803,
                "Username": "Pudderjagar"
            },
            "DateCreated": "2015-08-06T21:07:00Z"
        }
    ],
    "IsRecentlyVerified": false,
    "ID": 51572,
    "UUID": "E49F1114-6255-490F-AED8-5916D506FA9E",
    "DataProviderID": 1,
    "OperatorID": 202,
    "UsageTypeID": 1,
    "UsageCost": "Rfid eller sms",
    "AddressInfo": {
        "ID": 51918,
        "Title": "Bryne Fortum hurtiglader",
        "AddressLine1": "Solaveien 27",
        "Town": "Kleppe",
        "StateOrProvince": "Rogaland",
        "CountryID": 168,
        "Latitude": 58.7781708,
        "Longitude": 5.6259443,
        "ContactTelephone1": "22555424",
        "AccessComments": "Ved McDonald tett i hovedvegen. Lader zoe",
        "RelatedURL": "http://www.fortum.no/hurtigladere",
        "DistanceUnit": 0
    },
    "Connections": [
        {
            "ID": 63943,
            "ConnectionTypeID": 32,
            "StatusTypeID": 50,
            "LevelID": 3,
            "PowerKW": 50,
            "CurrentTypeID": 30
        },
        {
            "ID": 63944,
            "ConnectionTypeID": 2,
            "StatusTypeID": 50,
            "LevelID": 3,
            "PowerKW": 50,
            "CurrentTypeID": 30
        },
        {
            "ID": 63945,
            "ConnectionTypeID": 25,
            "StatusTypeID": 50,
            "LevelID": 2,
            "Amps": 32,
            "Voltage": 400,
            "PowerKW": 22,
            "CurrentTypeID": 20,
            "Quantity": 2
        }
    ],
    "NumberOfPoints": 14,
    "StatusTypeID": 50,
    "DateLastStatusUpdate": "2015-08-06T21:09:00Z",
    "DataQualityLevel": 1,
    "DateCreated": "2015-07-29T15:38:00Z",
    "SubmissionStatusTypeID": 200
}