{
    "IsRecentlyVerified": false,
    "ID": 152377,
    "UUID": "42D9F44D-F9FC-41DC-BDC4-40F166041164",
    "DataProviderID": 28,
    "DataProvidersReference": "FRSEOPAB18024A",
    "OperatorID": 3383,
    "UsageTypeID": 5,
    "AddressInfo": {
        "ID": 152730,
        "Title": "R‚seau AlterBase - Thouars / Ste Radegonde -  agence S‚olis",
        "AddressLine1": "2 rue du G‚n‚ral Lescure - Ste Radegonde - 79100 THOUARS",
        "CountryID": 80,
        "Latitude": 46.99604,
        "Longitude": -0.244574,
        "AccessComments": "08/24 5/7 jours",
        "DistanceUnit": 0
    },
    "Connections": [
        {
            "ID": 213302,
            "ConnectionTypeID": 28,
            "StatusTypeID": 50,
            "LevelID": 2,
            "PowerKW": 3.18,
            "CurrentTypeID": 10
        },
        {
            "ID": 213303,
            "ConnectionTypeID": 25,
            "StatusTypeID": 50,
            "LevelID": 2,
            "PowerKW": 3.18,
            "CurrentTypeID": 10
        },
        {
            "ID": 246182,
            "ConnectionTypeID": 25,
            "StatusTypeID": 50,
            "LevelID": 2,
            "PowerKW": 3.18,
            "CurrentTypeID": 10
        },
        {
            "ID": 246183,
            "ConnectionTypeID": 28,
            "StatusTypeID": 50,
            "LevelID": 2,
            "PowerKW": 3.18,
            "CurrentTypeID": 10
        }
    ],
    "GeneralComments": "www.alterbase.fr",
    "StatusTypeID": 50,
    "DateLastStatusUpdate": "2020-08-27T05:13:00Z",
    "DataQualityLevel": 2,
    "DateCreated": "2020-03-15T10:53:00Z",
    "SubmissionStatusTypeID": 100
}