{
    "IsRecentlyVerified": false,
    "ID": 62225,
    "UUID": "C08AFE68-8C91-4986-90C3-D42A8703D060",
    "DataProviderID": 2,
    "DataProvidersReference": "73375",
    "UsageTypeID": 2,
    "AddressInfo": {
        "ID": 62571,
        "Title": "ComEd",
        "AddressLine1": "1353 W 35th St",
        "Town": "Chicago",
        "StateOrProvince": "IL",
        "Postcode": "60609",
        "CountryID": 2,
        "Latitude": 41.830491,
        "Longitude": -87.659405,
        "ContactTelephone1": "",
        "AccessComments": "Employee use only",
        "RelatedURL": "",
        "DistanceUnit": 0
    },
    "Connections": [
        {
            "ID": 79128,
            "ConnectionTypeID": 1,
            "LevelID": 2,
            "Amps": 16,
            "Voltage": 230,
            "PowerKW": 3.7,
            "CurrentTypeID": 10,
            "Quantity": 2
        }
    ],
    "DateLastStatusUpdate": "2020-06-26T03:05:00Z",
    "DataQualityLevel": 3,
    "DateCreated": "2016-03-03T11:38:00Z",
    "SubmissionStatusTypeID": 100
}