{
    "IsRecentlyVerified": false,
    "ID": 173435,
    "UUID": "E3E49943-E854-4D58-8BC2-71FA499A91A6",
    "DataProviderID": 18,
    "DataProvidersReference": "877364d5dfccab34e248f361435753ce",
    "OperatorID": 2244,
    "UsageTypeID": 1,
    "AddressInfo": {
        "ID": 173794,
        "Title": "10 Rochester Terrace",
        "AddressLine1": "10 Rochester Terrace",
        "Town": "London",
        "Postcode": "NW1 9JN",
        "CountryID": 1,
        "Latitude": -0.138982,
        "Longitude": 51.544858,
        "AccessComments": "",
        "RelatedURL": "https://www.ubitricity.com",
        "DistanceUnit": 0
    },
    "Connections": [
        {
            "ID": 266460,
            "ConnectionTypeID": 25,
            "Reference": "suby1100005064",
            "StatusTypeID": 50,
            "LevelID": 2,
            "Amps": 16,
            "Voltage": 230,
            "PowerKW": 3.7,
            "CurrentTypeID": 10
        }
    ],
    "StatusTypeID": 0,
    "DateLastStatusUpdate": "2021-07-12T03:38:00Z",
    "MetadataValues": [
        {
            "ID": 8357,
            "MetadataFieldID": 4,
            "ItemValue": "Contains public sector information licensed under the Open Government Licence v2.0. http://www.nationalarchives.gov.uk/doc/open-government-licence/version/2/"
        }
    ],
    "DataQualityLevel": 3,
    "DateCreated": "2021-03-03T11:25:00Z",
    "SubmissionStatusTypeID": 100
}