{
    "IsRecentlyVerified": false,
    "ID": 8336,
    "UUID": "DEFCEAFE-B8E8-492E-A192-22D56FE4CE7F",
    "DataProviderID": 15,
    "DataProvidersReference": "10839",
    "OperatorID": 5,
    "UsageTypeID": 1,
    "AddressInfo": {
        "ID": 8233,
        "Title": "12138 N Lamar Blvd",
        "AddressLine1": "12138 N Lamar Blvd",
        "Town": "Austin",
        "StateOrProvince": "Texas",
        "Postcode": "78753",
        "CountryID": 2,
        "Latitude": 30.39849663,
        "Longitude": -97.67983246,
        "ContactTelephone1": "",
        "RelatedURL": "http://carstations.com/10839",
        "DistanceUnit": 0
    },
    "Connections": [
        {
            "ID": 5765,
            "ConnectionTypeID": 1,
            "Reference": "J1772",
            "LevelID": 2
        },
        {
            "ID": 6939,
            "ConnectionTypeID": 9,
            "Reference": "NEMA5",
            "LevelID": 1,
            "Quantity": 1
        }
    ],
    "NumberOfPoints": 1,
    "StatusTypeID": 0,
    "DateLastStatusUpdate": "2017-11-04T14:03:00Z",
    "DataQualityLevel": 1,
    "DateCreated": "2011-11-11T12:06:00Z",
    "SubmissionStatusTypeID": 100
}