{
    "IsRecentlyVerified": false,
    "ID": 41698,
    "UUID": "37898026-B427-4BEF-B751-BF61B931A646",
    "DataProviderID": 26,
    "DataProvidersReference": "59004",
    "OperatorID": 73,
    "OperatorsReference": "EV-Box EVB-P1430241",
    "UsageCost": "0.00 jaarabonnement",
    "AddressInfo": {
        "ID": 42044,
        "Title": "Teleportboulevard",
        "AddressLine1": "Teleportboulevard",
        "Town": "Amsterdam",
        "Postcode": "1043 EJ",
        "CountryID": 159,
        "Latitude": 52.388122,
        "Longitude": 4.8417883,
        "RelatedURL": "http://www.ev-box.nl",
        "DistanceUnit": 0
    },
    "Connections": [
        {
            "ID": 45732,
            "ConnectionTypeID": 25,
            "LevelID": 2,
            "PowerKW": 11,
            "CurrentTypeID": 10
        },
        {
            "ID": 45733,
            "ConnectionTypeID": 25,
            "LevelID": 2,
            "PowerKW": 11,
            "CurrentTypeID": 10
        }
    ],
    "NumberOfPoints": 1,
    "StatusTypeID": 50,
    "DateLastStatusUpdate": "2016-06-04T02:54:00Z",
    "DataQualityLevel": 3,
    "DateCreated": "2015-02-09T03:25:00Z",
    "SubmissionStatusTypeID": 100
}