{
    "UserComments": [
        {
            "ID": 4550,
            "ChargePointID": 19131,
            "CommentTypeID": 10,
            "UserName": "loinnsigh",
            "Comment": "All good. Charge point access card not required.",
            "Rating": 5,
            "DateCreated": "2015-05-25T09:52:49.07Z",
            "User": {
                "ID": 1979,
                "Username": "loinnsigh"
            },
            "CheckinStatusTypeID": 10
        }
    ],
    "IsRecentlyVerified": false,
    "ID": 19131,
    "UUID": "7851D9DF-21F0-4ED9-A5A6-A17F397C3855",
    "DataProviderID": 1,
    "OperatorID": 22,
    "OperatorsReference": "C9YQN",
    "UsageTypeID": 4,
    "UsageCost": "Free",
    "AddressInfo": {
        "ID": 19476,
        "Title": "Applegreen Castlebellingham (M1 Southbound)",
        "AddressLine1": "Commins",
        "Town": "Dromiskin",
        "StateOrProvince": "County Louth",
        "CountryID": 3,
        "Latitude": 53.92335,
        "Longitude": -6.41164,
        "AccessComments": "24 hour access",
        "DistanceUnit": 0
    },
    "Connections": [
        {
            "ID": 19397,
            "ConnectionTypeID": 2,
            "StatusTypeID": 50,
            "LevelID": 3,
            "Amps": 100,
            "Voltage": 400,
            "PowerKW": 50,
            "CurrentTypeID": 30,
            "Quantity": 1
        },
        {
            "ID": 101516,
            "ConnectionTypeID": 1036,
            "StatusTypeID": 0,
            "LevelID": 3,
            "Voltage": 400,
            "PowerKW": 43,
            "CurrentTypeID": 20,
            "Quantity": 1
        },
        {
            "ID": 101517,
            "ConnectionTypeID": 33,
            "StatusTypeID": 50,
            "LevelID": 3,
            "Voltage": 400,
            "PowerKW": 50,
            "CurrentTypeID": 30,
            "Quantity": 1
        }
    ],
    "NumberOfPoints": 2,
    "GeneralComments": "efacec QC45",
    "StatusTypeID": 50,
    "DateLastStatusUpdate": "2019-06-03T11:01:00Z",
    "DataQualityLevel": 1,
    "DateCreated": "2013-09-12T11:51:00Z",
    "SubmissionStatusTypeID": 200
}