{
    "IsRecentlyVerified": false,
    "ID": 5179,
    "UUID": "CF3B7F98-091F-4832-AC38-8A00AED61F11",
    "DataProviderID": 2,
    "DataProvidersReference": "40593",
    "UsageTypeID": 1,
    "AddressInfo": {
        "ID": 5119,
        "Title": "Victor Building Parking Garage",
        "AddressLine1": "750 9th St NW",
        "Town": "Washington",
        "StateOrProvince": "DC",
        "Postcode": "20001",
        "CountryID": 2,
        "Latitude": 38.899392,
        "Longitude": -77.024385,
        "ContactTelephone1": "202-638-0253",
        "AccessComments": "24 hours daily; pay lot",
        "RelatedURL": "",
        "DistanceUnit": 0
    },
    "Connections": [
        {
            "ID": 16162,
            "ConnectionTypeID": 22,
            "LevelID": 1,
            "Amps": 16,
            "Voltage": 120,
            "PowerKW": 1,
            "CurrentTypeID": 10,
            "Quantity": 1
        },
        {
            "ID": 16163,
            "ConnectionTypeID": 1,
            "LevelID": 2,
            "Amps": 16,
            "Voltage": 230,
            "PowerKW": 3,
            "CurrentTypeID": 10,
            "Quantity": 1
        },
        {
            "ID": 21142,
            "ConnectionTypeID": 1,
            "LevelID": 2,
            "Quantity": 1
        }
    ],
    "DateLastConfirmed": "2011-07-31T00:00:00Z",
    "StatusTypeID": 0,
    "DateLastStatusUpdate": "2019-04-06T04:03:00Z",
    "DataQualityLevel": 1,
    "DateCreated": "2011-08-19T14:07:00Z",
    "SubmissionStatusTypeID": 100
}