{
    "IsRecentlyVerified": false,
    "ID": 137263,
    "UUID": "74876C0C-64DA-4D57-AEFE-5CB7B11C7F73",
    "DataProviderID": 2,
    "DataProvidersReference": "148987",
    "OperatorID": 39,
    "UsageTypeID": 1,
    "AddressInfo": {
        "ID": 137609,
        "Title": "Performing Arts & Science Garage",
        "AddressLine1": "101 SW 5th Ave.",
        "Town": "Fort Lauderdale",
        "StateOrProvince": "FL",
        "Postcode": "33312",
        "CountryID": 2,
        "Latitude": 26.1215874,
        "Longitude": -80.1485639,
        "ContactTelephone1": "800-663-5633",
        "AccessComments": "MO: Not Specified; TU: Not Specified; WE: Not Specified; TH: Not Specified; FR: Not Specified; SA: Not Specified; SU: Not Specified",
        "RelatedURL": "http://www.semacharge.com/",
        "DistanceUnit": 0
    },
    "Connections": [
        {
            "ID": 192133,
            "ConnectionTypeID": 1,
            "LevelID": 2,
            "Amps": 16,
            "Voltage": 230,
            "PowerKW": 3,
            "CurrentTypeID": 10,
            "Quantity": 2
        }
    ],
    "StatusTypeID": 50,
    "DateLastStatusUpdate": "2019-12-24T09:04:00Z",
    "DataQualityLevel": 3,
    "DateCreated": "2019-12-24T09:04:00Z",
    "SubmissionStatusTypeID": 100
}