{
    "IsRecentlyVerified": false,
    "ID": 64613,
    "UUID": "005DBBE1-F464-4A72-8D81-10DAE4CB5C3B",
    "DataProviderID": 1,
    "OperatorID": 20,
    "OperatorsReference": "60222,60223",
    "UsageTypeID": 4,
    "UsageCost": "Free",
    "AddressInfo": {
        "ID": 64959,
        "Title": "Wythenshawe Forum",
        "AddressLine1": "Forum Square",
        "AddressLine2": "Woodhouse Park",
        "Town": "Manchester",
        "StateOrProvince": "Greater Manchester",
        "Postcode": "M22 5RX",
        "CountryID": 1,
        "Latitude": 53.3810896,
        "Longitude": -2.26503439999999,
        "DistanceUnit": 0
    },
    "Connections": [
        {
            "ID": 83043,
            "ConnectionTypeID": 25,
            "StatusTypeID": 75,
            "LevelID": 2,
            "Amps": 32,
            "Voltage": 230,
            "PowerKW": 7,
            "CurrentTypeID": 10,
            "Quantity": 2
        }
    ],
    "NumberOfPoints": 2,
    "StatusTypeID": 75,
    "DateLastStatusUpdate": "2020-01-10T09:58:00Z",
    "DataQualityLevel": 1,
    "DateCreated": "2016-03-15T13:22:00Z",
    "SubmissionStatusTypeID": 200
}