{
    "IsRecentlyVerified": false,
    "ID": 169024,
    "UUID": "EACEF4E5-28BD-4853-A234-311D54AFF285",
    "DataProviderID": 1,
    "OperatorID": 44,
    "UsageTypeID": 1,
    "UsageCost": "free but parking fee required",
    "AddressInfo": {
        "ID": 169383,
        "Title": "Aino Shopping center",
        "AddressLine1": "Länsituulentie 7",
        "Town": "Espoo",
        "StateOrProvince": "Southern Finland",
        "Postcode": "02100",
        "CountryID": 79,
        "Latitude": 60.17561813893519,
        "Longitude": 24.805169875647607,
        "DistanceUnit": 0
    },
    "Connections": [
        {
            "ID": 257108,
            "ConnectionTypeID": 25,
            "StatusTypeID": 50,
            "LevelID": 2,
            "Amps": 32,
            "Voltage": 400,
            "PowerKW": 22,
            "CurrentTypeID": 20,
            "Quantity": 5
        }
    ],
    "NumberOfPoints": 5,
    "StatusTypeID": 50,
    "DateLastStatusUpdate": "2020-10-12T07:46:00Z",
    "DataQualityLevel": 1,
    "DateCreated": "2020-10-09T17:34:00Z",
    "SubmissionStatusTypeID": 200
}