{
    "IsRecentlyVerified": false,
    "ID": 166703,
    "UUID": "3614859F-1D56-4684-AC6C-F1765DDE21B8",
    "DataProviderID": 28,
    "DataProvidersReference": "FR*H02*P59543*001",
    "OperatorID": 3409,
    "UsageTypeID": 5,
    "AddressInfo": {
        "ID": 167062,
        "Title": "SAINT-RÉMY-DU-NORD - Rue de la Place",
        "AddressLine1": "Rue de la Place 59330 SAINT-RÉMY-DU-NORD",
        "CountryID": 80,
        "Latitude": 50.231396,
        "Longitude": 3.905528,
        "AccessComments": "24h/24 7j/7",
        "DistanceUnit": 0
    },
    "Connections": [
        {
            "ID": 251709,
            "ConnectionTypeID": 28,
            "StatusTypeID": 50,
            "LevelID": 2,
            "PowerKW": 22,
            "CurrentTypeID": 10
        },
        {
            "ID": 251710,
            "ConnectionTypeID": 1036,
            "StatusTypeID": 50,
            "LevelID": 2,
            "PowerKW": 22,
            "CurrentTypeID": 20
        },
        {
            "ID": 251711,
            "ConnectionTypeID": 28,
            "StatusTypeID": 50,
            "LevelID": 2,
            "PowerKW": 22,
            "CurrentTypeID": 10
        },
        {
            "ID": 251712,
            "ConnectionTypeID": 1036,
            "StatusTypeID": 50,
            "LevelID": 2,
            "PowerKW": 22,
            "CurrentTypeID": 20
        }
    ],
    "GeneralComments": "Recharge par badge et avec une application smartphone",
    "StatusTypeID": 50,
    "DateLastStatusUpdate": "2020-08-27T05:16:00Z",
    "DataQualityLevel": 2,
    "DateCreated": "2020-08-27T05:16:00Z",
    "SubmissionStatusTypeID": 100
}