{
    "UserComments": [
        {
            "ID": 15966,
            "ChargePointID": 77123,
            "CommentTypeID": 10,
            "UserName": "steev8",
            "Comment": "",
            "Rating": 5,
            "DateCreated": "2017-02-25T13:21:49.767Z",
            "User": {
                "ID": 1867,
                "Username": "steev8"
            },
            "CheckinStatusTypeID": 10
        }
    ],
    "IsRecentlyVerified": false,
    "ID": 77123,
    "UUID": "F56B1366-41A7-42F0-8C37-3632C2694A8A",
    "DataProviderID": 1,
    "OperatorID": 32,
    "OperatorsReference": "3206",
    "UsageTypeID": 4,
    "UsageCost": "Inclusive; for Polar Plus subscription members only",
    "AddressInfo": {
        "ID": 77469,
        "Title": "Trowbridge County Hall - Bythesea Road",
        "AddressLine1": "Mortimer Street",
        "AddressLine2": "Trowbridge",
        "Town": "Wiltshire",
        "StateOrProvince": "Wiltshire",
        "Postcode": "BA14 8JN",
        "CountryID": 1,
        "Latitude": 51.316338,
        "Longitude": -2.209705,
        "AccessComments": "3206 is the only public post. Outside library.  Enter from Mortimer St and turn right.  For visitors to County Hall or library, who must register at reception, 2hr limit.  Appears to be unrestricted evenings & weekends.",
        "DistanceUnit": 0
    },
    "Connections": [
        {
            "ID": 110785,
            "ConnectionTypeID": 25,
            "StatusTypeID": 50,
            "LevelID": 2,
            "Amps": 32,
            "Voltage": 230,
            "PowerKW": 7,
            "CurrentTypeID": 10,
            "Quantity": 2
        }
    ],
    "NumberOfPoints": 2,
    "StatusTypeID": 50,
    "DateLastStatusUpdate": "2019-03-09T06:17:00Z",
    "DataQualityLevel": 1,
    "DateCreated": "2017-01-02T09:22:00Z",
    "SubmissionStatusTypeID": 200
}