{
    "IsRecentlyVerified": false,
    "ID": 184208,
    "UUID": "F392D7F3-DFA1-4741-A33A-07654CB0F69C",
    "DataProviderID": 29,
    "DataProvidersReference": "13254",
    "AddressInfo": {
        "ID": 184567,
        "Title": "Berliner Platz 1",
        "AddressLine1": "Berliner Platz 1",
        "Town": "Miltenberg",
        "Postcode": "63897",
        "CountryID": 87,
        "Latitude": 49.705396,
        "Longitude": 9.249174,
        "DistanceUnit": 0
    },
    "Connections": [
        {
            "ID": 292163,
            "ConnectionTypeID": 25,
            "StatusTypeID": 50,
            "LevelID": 2,
            "PowerKW": 22,
            "CurrentTypeID": 20
        },
        {
            "ID": 292164,
            "ConnectionTypeID": 25,
            "StatusTypeID": 50,
            "LevelID": 2,
            "PowerKW": 22,
            "CurrentTypeID": 20
        }
    ],
    "StatusTypeID": 50,
    "DateLastStatusUpdate": "2021-07-12T02:43:00Z",
    "MetadataValues": [
        {
            "ID": 16500,
            "MetadataFieldID": 4,
            "ItemValue": "Data from the German chargepoint registry provided by Bundesnetzagentur.de under the CC-BY 4.0 license"
        }
    ],
    "DataQualityLevel": 3,
    "DateCreated": "2021-07-08T10:05:00Z",
    "SubmissionStatusTypeID": 100
}