{
    "IsRecentlyVerified": false,
    "ID": 177448,
    "UUID": "D2394540-2FE9-48B0-887B-ECE8EF0D0E14",
    "DataProviderID": 29,
    "DataProvidersReference": "9489",
    "OperatorID": 3403,
    "AddressInfo": {
        "ID": 177807,
        "Title": "Budrio-Allee 2",
        "AddressLine1": "Budrio-Allee 2",
        "Town": "Eichenau",
        "Postcode": "82223",
        "CountryID": 87,
        "Latitude": 48.167526,
        "Longitude": 11.312681,
        "DistanceUnit": 0
    },
    "Connections": [
        {
            "ID": 276597,
            "ConnectionTypeID": 1036,
            "StatusTypeID": 50,
            "LevelID": 2,
            "PowerKW": 22,
            "CurrentTypeID": 20
        },
        {
            "ID": 276598,
            "ConnectionTypeID": 33,
            "StatusTypeID": 50,
            "LevelID": 3,
            "PowerKW": 50,
            "CurrentTypeID": 30
        }
    ],
    "StatusTypeID": 0,
    "DateLastStatusUpdate": "2021-07-09T03:11:00Z",
    "MetadataValues": [
        {
            "ID": 9742,
            "MetadataFieldID": 4,
            "ItemValue": "Data from the German chargepoint registry provided by Bundesnetzagentur.de under the CC-BY 4.0 license"
        }
    ],
    "DataQualityLevel": 3,
    "DateCreated": "2021-07-08T09:49:00Z",
    "SubmissionStatusTypeID": 100
}