{
    "IsRecentlyVerified": false,
    "ID": 166979,
    "UUID": "1540EFB1-7D39-4FBF-A211-38B7BCC22E3C",
    "DataProviderID": 1,
    "OperatorID": 21,
    "UsageTypeID": 6,
    "UsageCost": "Mobi.E compatible card",
    "AddressInfo": {
        "ID": 167338,
        "Title": "MTS-00025/26",
        "AddressLine1": "Makro Matosinhos",
        "Town": "Matosinhos",
        "Postcode": "4465-026",
        "CountryID": 180,
        "Latitude": 41.201361,
        "Longitude": -8.625354,
        "RelatedURL": "https://www.mobie.pt",
        "DistanceUnit": 0
    },
    "Connections": [
        {
            "ID": 252782,
            "ConnectionTypeID": 25,
            "StatusTypeID": 50,
            "LevelID": 2,
            "Amps": 16,
            "Voltage": 400,
            "PowerKW": 11,
            "CurrentTypeID": 20,
            "Quantity": 4
        }
    ],
    "NumberOfPoints": 4,
    "StatusTypeID": 50,
    "DateLastStatusUpdate": "2020-10-02T19:47:00Z",
    "DataQualityLevel": 3,
    "DateCreated": "2020-08-27T06:37:00Z",
    "SubmissionStatusTypeID": 100
}