{
    "IsRecentlyVerified": false,
    "ID": 38957,
    "UUID": "D772B70C-8704-4FFF-9D38-BEAB5D274D18",
    "DataProviderID": 1,
    "OperatorID": 125,
    "OperatorsReference": "Essent EM-DE-04011000-01-00001",
    "UsageTypeID": 4,
    "AddressInfo": {
        "ID": 39303,
        "Title": "ADAC",
        "AddressLine1": "Bennigsenstrasse 2-6",
        "Town": "Bremen",
        "Postcode": "28207",
        "CountryID": 87,
        "Latitude": 53.0707943229212,
        "Longitude": 8.85760538888553,
        "ContactTelephone1": "+49 4214 994200",
        "AccessComments": "24/7 nutzbare rotweiße Ladesäule auf dem Besucherparkpltz hinter dem Haus.",
        "RelatedURL": "http://adac-bremen.de/geschaeftsstelle-bremen",
        "DistanceUnit": 0
    },
    "Connections": [
        {
            "ID": 42468,
            "ConnectionTypeID": 25,
            "StatusTypeID": 50,
            "LevelID": 2,
            "Amps": 32,
            "Voltage": 400,
            "PowerKW": 22,
            "CurrentTypeID": 20,
            "Quantity": 2
        }
    ],
    "NumberOfPoints": 2,
    "StatusTypeID": 50,
    "DateLastStatusUpdate": "2017-07-11T07:39:00Z",
    "DataQualityLevel": 3,
    "DateCreated": "2015-01-09T06:08:00Z",
    "SubmissionStatusTypeID": 200
}