{
    "IsRecentlyVerified": false,
    "ID": 14330,
    "UUID": "FE45CB91-6111-4032-BA44-5AB82F922E83",
    "DataProviderID": 2,
    "DataProvidersReference": "47024",
    "UsageTypeID": 7,
    "AddressInfo": {
        "ID": 14227,
        "Title": "Reidsville Nissan",
        "AddressLine1": "1123 Freeway Dr",
        "Town": "Reidsville",
        "StateOrProvince": "NC",
        "Postcode": "27320",
        "CountryID": 2,
        "Latitude": 36.323241,
        "Longitude": -79.686657,
        "ContactTelephone1": "336-342-5741",
        "AccessComments": "Dealership business hours\r\nPublic - Call ahead",
        "RelatedURL": "",
        "DistanceUnit": 0
    },
    "Connections": [
        {
            "ID": 16555,
            "ConnectionTypeID": 1,
            "LevelID": 2,
            "Amps": 16,
            "Voltage": 230,
            "PowerKW": 3.7,
            "CurrentTypeID": 10,
            "Quantity": 1
        },
        {
            "ID": 21672,
            "ConnectionTypeID": 1,
            "LevelID": 2,
            "Quantity": 1
        }
    ],
    "DateLastStatusUpdate": "2020-06-26T02:58:00Z",
    "DataQualityLevel": 3,
    "DateCreated": "2012-12-06T16:49:00Z",
    "SubmissionStatusTypeID": 100
}