{
    "IsRecentlyVerified": false,
    "ID": 71336,
    "UUID": "825FA657-9927-470B-A380-F5A023BB4979",
    "DataProviderID": 2,
    "DataProvidersReference": "77366",
    "OperatorID": 5,
    "UsageTypeID": 1,
    "AddressInfo": {
        "ID": 71682,
        "Title": "CARTA",
        "AddressLine1": "2120 Hamilton Pl Blvd",
        "Town": "Chattanooga",
        "StateOrProvince": "TN",
        "Postcode": "37421",
        "CountryID": 2,
        "Latitude": 35.0356937,
        "Longitude": -85.1577697,
        "ContactTelephone1": "888-758-4389",
        "AccessComments": "24 hours daily",
        "RelatedURL": "http://www.chargepoint.com/",
        "DistanceUnit": 0
    },
    "Connections": [
        {
            "ID": 102147,
            "ConnectionTypeID": 1,
            "LevelID": 2,
            "Amps": 16,
            "Voltage": 230,
            "PowerKW": 3,
            "CurrentTypeID": 10,
            "Quantity": 2
        }
    ],
    "DateLastStatusUpdate": "2019-04-06T04:02:00Z",
    "DataQualityLevel": 3,
    "DateCreated": "2016-09-02T10:14:00Z",
    "SubmissionStatusTypeID": 100
}