{
    "IsRecentlyVerified": false,
    "ID": 17465,
    "UUID": "54E4C6DD-7275-4C40-90BD-878FC876F27F",
    "DataProviderID": 22,
    "DataProvidersReference": "F38575EE8AF23BA6D923C0D98EE767FC",
    "AddressInfo": {
        "ID": 17810,
        "Title": "徳島日産自動車阿南店",
        "AddressLine1": "徳島県阿南市見能林町大作半15-1",
        "CountryID": 114,
        "Latitude": 33.90516669,
        "Longitude": 134.6686235,
        "ContactTelephone1": "0884-22-2415",
        "DistanceUnit": 0
    },
    "Connections": [
        {
            "ID": 17706,
            "ConnectionTypeID": 2,
            "LevelID": 2,
            "Amps": 100,
            "Voltage": 480,
            "PowerKW": 48,
            "Quantity": 1
        }
    ],
    "DateLastStatusUpdate": "2013-06-29T08:58:00Z",
    "DataQualityLevel": 2,
    "DateCreated": "2013-06-29T08:58:00Z",
    "SubmissionStatusTypeID": 200
}