{
    "UserComments": [
        {
            "ID": 24719,
            "ChargePointID": 169505,
            "CommentTypeID": 10,
            "UserName": "Ngingino",
            "Comment": "L'unica Zapgrid a pagamento. Fino a fine giugno era gratuita. Per questo do 2 stelle anche se funziona benissimo.",
            "Rating": 2,
            "DateCreated": "2021-08-12T21:48:51.207Z",
            "User": {
                "ID": 31376,
                "Username": "Ngingino"
            },
            "CheckinStatusTypeID": 10,
            "IsActionedByEditor": false
        }
    ],
    "IsRecentlyVerified": false,
    "ID": 169505,
    "UUID": "B3EA174C-11E5-4012-81C9-0A04A09AC705",
    "DataProviderID": 1,
    "OperatorID": 3328,
    "UsageTypeID": 4,
    "AddressInfo": {
        "ID": 169864,
        "Title": "Comune di Grosotto ",
        "AddressLine1": "Via Roma",
        "Town": "Grosotto",
        "StateOrProvince": "Lombardy",
        "Postcode": "23034",
        "CountryID": 112,
        "Latitude": 46.27984474626237,
        "Longitude": 10.25742812362455,
        "DistanceUnit": 0
    },
    "Connections": [
        {
            "ID": 257986,
            "ConnectionTypeID": 25,
            "StatusTypeID": 50,
            "LevelID": 2,
            "PowerKW": 22,
            "CurrentTypeID": 20,
            "Quantity": 1
        }
    ],
    "NumberOfPoints": 1,
    "StatusTypeID": 50,
    "DateLastStatusUpdate": "2021-08-12T21:49:00Z",
    "DataQualityLevel": 1,
    "DateCreated": "2020-10-20T13:20:00Z",
    "SubmissionStatusTypeID": 200
}