{
    "UserComments": [
        {
            "ID": 22893,
            "ChargePointID": 161425,
            "CommentTypeID": 50,
            "UserName": "Longarone Fiere",
            "Comment": "Fantastic",
            "Rating": 5,
            "RelatedURL": "https://www.longaronefiere.it",
            "DateCreated": "2020-07-11T14:42:06.497Z",
            "User": {
                "ID": 26493,
                "Username": "Longarone Fiere"
            },
            "CheckinStatusTypeID": 10,
            "IsActionedByEditor": false
        }
    ],
    "MediaItems": [
        {
            "ID": 23013,
            "ChargePointID": 161425,
            "ItemURL": "https://s3-ap-southeast-2.amazonaws.com/openchargemap/images/IT/OCM161425/OCM-161425.orig.2020071114394905.jpg",
            "ItemThumbnailURL": "https://s3-ap-southeast-2.amazonaws.com/openchargemap/images/IT/OCM161425/OCM-161425.thmb.2020071114394905.jpg",
            "Comment": "4 electric car charging stations facing the road - TYPE 2 connection - near the main entrance of the Longarone Exhibition Center at the foot of the Dolomites, available 24 hours a day on the route for Cadore - Cortina - Comelico - Auronzo - Misurina. 4 parking spaces available for parking electric cars for recharging even during the Longarone Fiere Dolomiti trade fairs such as Arredamont, MIG - International Exhibition of Artisan Gelato, Ri-Costruire 3.0, Agrimont, Forest Fair & Festival, Expo Dolomiti HoReCa, etc. ...",
            "IsEnabled": true,
            "IsVideo": false,
            "IsFeaturedItem": false,
            "IsExternalResource": false,
            "User": {
                "ID": 26493,
                "Username": "Longarone Fiere"
            },
            "DateCreated": "2020-07-11T14:40:00Z"
        }
    ],
    "IsRecentlyVerified": false,
    "ID": 161425,
    "UUID": "C00EB5F1-5701-4B50-ACF9-8158F21652EF",
    "DataProviderID": 1,
    "OperatorID": 44,
    "UsageTypeID": 5,
    "UsageCost": "Standard",
    "AddressInfo": {
        "ID": 161782,
        "Title": "Longarone Fiere Dolomiti",
        "AddressLine1": "Via del Parco 3",
        "Town": "Longarone",
        "StateOrProvince": "Belluno",
        "Postcode": "32013",
        "CountryID": 112,
        "Latitude": 46.26874557166795,
        "Longitude": 12.303689272439783,
        "ContactTelephone1": "+390437577577",
        "ContactEmail": "fiera@longaronefiere.it",
        "AccessComments": "4 electric car charging stations facing the road - TYPE 2 connection - near the main entrance of the Longarone Exhibition Center at the foot of the Dolomites, available 24 hours a day on the route for Cadore - Cortina - Comelico - Auronzo - Misurina. 4 parking spaces available for parking electric cars for recharging even during the Longarone Fiere Dolomiti trade fairs such as Arredamont, MIG - International Exhibition of Artisan Gelato, Ri-Costruire 3.0, Agrimont, Forest Fair & Festival, Expo Dolomiti HoReCa, etc. ...",
        "RelatedURL": "https://www.longaronefiere.it",
        "DistanceUnit": 0
    },
    "Connections": [
        {
            "ID": 232320,
            "ConnectionTypeID": 25,
            "StatusTypeID": 50,
            "LevelID": 2,
            "PowerKW": 25,
            "CurrentTypeID": 20,
            "Quantity": 4
        }
    ],
    "NumberOfPoints": 4,
    "GeneralComments": "4 electric car charging stations facing the road - TYPE 2 connection - near the main entrance of the Longarone Exhibition Center at the foot of the Dolomites, available 24 hours a day on the route for Cadore - Cortina - Comelico - Auronzo - Misurina. 4 parking spaces available for parking electric cars for recharging even during the Longarone Fiere Dolomiti trade fairs such as Arredamont, MIG - International Exhibition of Artisan Gelato, Ri-Costruire 3.0, Agrimont, Forest Fair & Festival, Expo Dolomiti HoReCa, etc. ...",
    "StatusTypeID": 50,
    "DateLastStatusUpdate": "2020-07-11T15:54:00Z",
    "DataQualityLevel": 1,
    "DateCreated": "2020-07-11T14:36:00Z",
    "SubmissionStatusTypeID": 200
}