{
    "IsRecentlyVerified": false,
    "ID": 162784,
    "UUID": "9FC81D6B-40C1-4AEF-9F02-12CCB34FE833",
    "DataProviderID": 1,
    "OperatorID": 21,
    "UsageTypeID": 4,
    "UsageCost": "Mobi.E compatible card",
    "AddressInfo": {
        "ID": 163141,
        "Title": "LSB-00108",
        "AddressLine1": "Campo das Amoreiras",
        "Town": "Lisbon",
        "StateOrProvince": "Lisboa",
        "Postcode": "1700",
        "CountryID": 180,
        "Latitude": 38.7860988650005,
        "Longitude": -9.142422842896394,
        "DistanceUnit": 0
    },
    "Connections": [
        {
            "ID": 234305,
            "ConnectionTypeID": 25,
            "StatusTypeID": 50,
            "LevelID": 2,
            "Amps": 16,
            "Voltage": 230,
            "PowerKW": 3.7,
            "CurrentTypeID": 10,
            "Quantity": 4
        }
    ],
    "NumberOfPoints": 4,
    "StatusTypeID": 50,
    "DateLastStatusUpdate": "2020-08-16T11:02:00Z",
    "DataQualityLevel": 1,
    "DateCreated": "2020-08-16T11:02:00Z",
    "SubmissionStatusTypeID": 200
}