{
    "IsRecentlyVerified": false,
    "ID": 187882,
    "UUID": "904D725C-9D67-45DF-B70D-D773391276FA",
    "DataProviderID": 18,
    "DataProvidersReference": "38b70bc4e5dd6c315c3acbe51c86820c",
    "OperatorID": 3345,
    "UsageTypeID": 5,
    "AddressInfo": {
        "ID": 188241,
        "Title": "CV5 8BH",
        "AddressLine1": "",
        "Town": "Coventry",
        "Postcode": "CV5 8BH",
        "CountryID": 1,
        "Latitude": 52.408334,
        "Longitude": -1.55548,
        "AccessComments": "",
        "RelatedURL": "https://char.gy",
        "DistanceUnit": 0
    },
    "Connections": [
        {
            "ID": 303210,
            "ConnectionTypeID": 25,
            "Reference": "667",
            "StatusTypeID": 50,
            "LevelID": 2,
            "Amps": 16,
            "Voltage": 230,
            "PowerKW": 3.7,
            "CurrentTypeID": 10
        }
    ],
    "StatusTypeID": 0,
    "DateLastStatusUpdate": "2021-07-12T03:39:00Z",
    "MetadataValues": [
        {
            "ID": 20122,
            "MetadataFieldID": 4,
            "ItemValue": "Contains public sector information licensed under the Open Government Licence v2.0. http://www.nationalarchives.gov.uk/doc/open-government-licence/version/2/"
        }
    ],
    "DataQualityLevel": 3,
    "DateCreated": "2021-07-12T03:39:00Z",
    "SubmissionStatusTypeID": 100
}