{
    "IsRecentlyVerified": false,
    "ID": 166577,
    "UUID": "CD78B7C8-3CB4-4362-B53E-26B90CB75161",
    "DataProviderID": 28,
    "DataProvidersReference": "FR*S61*P61324A",
    "UsageTypeID": 5,
    "AddressInfo": {
        "ID": 166936,
        "Title": "Passais Villages | Place des Justes",
        "AddressLine1": "Place des Justes 61350 Passais Villages",
        "CountryID": 80,
        "Latitude": 48.5181,
        "Longitude": -0.75724,
        "AccessComments": "24/24 7/7",
        "DistanceUnit": 0
    },
    "Connections": [
        {
            "ID": 249608,
            "ConnectionTypeID": 26,
            "StatusTypeID": 50,
            "LevelID": 2,
            "PowerKW": 18
        },
        {
            "ID": 249609,
            "ConnectionTypeID": 28,
            "StatusTypeID": 50,
            "LevelID": 2,
            "PowerKW": 18,
            "CurrentTypeID": 10
        },
        {
            "ID": 249610,
            "ConnectionTypeID": 25,
            "StatusTypeID": 50,
            "LevelID": 2,
            "PowerKW": 18,
            "CurrentTypeID": 20
        },
        {
            "ID": 249611,
            "ConnectionTypeID": 28,
            "StatusTypeID": 50,
            "LevelID": 2,
            "PowerKW": 18,
            "CurrentTypeID": 10
        }
    ],
    "GeneralComments": "",
    "StatusTypeID": 50,
    "DateLastStatusUpdate": "2020-08-27T05:15:00Z",
    "DataQualityLevel": 2,
    "DateCreated": "2020-08-27T05:15:00Z",
    "SubmissionStatusTypeID": 100
}