{
    "IsRecentlyVerified": false,
    "ID": 61341,
    "UUID": "02FC08C5-099A-40B8-93AF-E98CA3C659AD",
    "DataProviderID": 1,
    "OperatorID": 59,
    "UsageTypeID": 1,
    "UsageCost": "Temporarily Free",
    "AddressInfo": {
        "ID": 61687,
        "Title": "RCEA EV Network - Trinidad Library",
        "AddressLine1": "380 Janis Court",
        "Town": "Trinidad",
        "StateOrProvince": "CA",
        "Postcode": "95570",
        "CountryID": 2,
        "Latitude": 41.0623439205486,
        "Longitude": -124.140643291175,
        "ContactTelephone1": "(707)269-1700",
        "ContactEmail": "ev@redwoodenergy.org",
        "RelatedURL": "http://www.redwoodenergy.org",
        "DistanceUnit": 0
    },
    "Connections": [
        {
            "ID": 78118,
            "ConnectionTypeID": 1,
            "StatusTypeID": 50,
            "LevelID": 2,
            "Voltage": 220,
            "CurrentTypeID": 10,
            "Quantity": 2
        },
        {
            "ID": 78119,
            "ConnectionTypeID": 1,
            "StatusTypeID": 50,
            "LevelID": 1,
            "Voltage": 120,
            "CurrentTypeID": 10,
            "Quantity": 1
        }
    ],
    "NumberOfPoints": 3,
    "GeneralComments": "To start a free charging session press the ON button to release the charging cable. Plug the cable into your vehicle and charge. to retract the cable press the OFF button",
    "StatusTypeID": 50,
    "DateLastStatusUpdate": "2016-02-26T00:18:00Z",
    "DataQualityLevel": 1,
    "DateCreated": "2016-02-24T22:09:00Z",
    "SubmissionStatusTypeID": 200
}