{
    "IsRecentlyVerified": false,
    "ID": 123719,
    "UUID": "E2F925FD-FDCD-47E8-B012-74B775E58BE0",
    "DataProviderID": 2,
    "DataProvidersReference": "48147",
    "OperatorID": 5,
    "UsageTypeID": 1,
    "AddressInfo": {
        "ID": 124065,
        "Title": "SARATOGA CITY",
        "AddressLine1": "13777 Fruitvale Ave",
        "Town": "Saratoga",
        "StateOrProvince": "CA",
        "Postcode": "95070",
        "CountryID": 2,
        "Latitude": 37.268306,
        "Longitude": -122.01418,
        "ContactTelephone1": "888-758-4389",
        "AccessComments": "24 hours daily",
        "RelatedURL": "http://www.chargepoint.com/",
        "DistanceUnit": 0
    },
    "Connections": [
        {
            "ID": 173741,
            "ConnectionTypeID": 1,
            "LevelID": 2,
            "Amps": 16,
            "Voltage": 230,
            "PowerKW": 3,
            "CurrentTypeID": 10,
            "Quantity": 4
        }
    ],
    "DateLastStatusUpdate": "2019-04-06T05:03:00Z",
    "DataQualityLevel": 3,
    "DateCreated": "2019-04-06T05:03:00Z",
    "SubmissionStatusTypeID": 100
}