{
    "IsRecentlyVerified": false,
    "ID": 165675,
    "UUID": "AA507221-6551-44F5-933F-F43675253AC6",
    "DataProviderID": 28,
    "DataProvidersReference": "FR*S40*PMB40*42",
    "OperatorID": 3407,
    "UsageTypeID": 5,
    "AddressInfo": {
        "ID": 166034,
        "Title": "SORE - Parking Place De La Poste",
        "AddressLine1": "Parking Place De La Poste 40430 SORE",
        "CountryID": 80,
        "Latitude": 44.32295311,
        "Longitude": -0.581231797,
        "AccessComments": "24h/24 7j/7",
        "DistanceUnit": 0
    },
    "Connections": [
        {
            "ID": 241694,
            "ConnectionTypeID": 25,
            "StatusTypeID": 50,
            "LevelID": 2,
            "PowerKW": 18,
            "CurrentTypeID": 20
        },
        {
            "ID": 241695,
            "ConnectionTypeID": 28,
            "StatusTypeID": 50,
            "LevelID": 2,
            "PowerKW": 18,
            "CurrentTypeID": 10
        },
        {
            "ID": 241696,
            "ConnectionTypeID": 25,
            "StatusTypeID": 50,
            "LevelID": 2,
            "PowerKW": 18,
            "CurrentTypeID": 20
        },
        {
            "ID": 241697,
            "ConnectionTypeID": 28,
            "StatusTypeID": 50,
            "LevelID": 2,
            "PowerKW": 18,
            "CurrentTypeID": 10
        }
    ],
    "GeneralComments": "Recharge par badge et avec une application smartphone",
    "StatusTypeID": 50,
    "DateLastStatusUpdate": "2020-08-27T05:11:00Z",
    "DataQualityLevel": 2,
    "DateCreated": "2020-08-27T05:11:00Z",
    "SubmissionStatusTypeID": 100
}