{
    "IsRecentlyVerified": false,
    "ID": 176953,
    "UUID": "684B9A74-8A43-4EF3-BA74-094C8E1D177A",
    "DataProviderID": 29,
    "DataProvidersReference": "7792",
    "OperatorID": 45,
    "AddressInfo": {
        "ID": 177312,
        "Title": "Hugo-Junkers-Str. 2",
        "AddressLine1": "Hugo-Junkers-Str. 2",
        "Town": "Gifhorn",
        "Postcode": "38518",
        "CountryID": 87,
        "Latitude": 52.459143,
        "Longitude": 10.540598,
        "DistanceUnit": 0
    },
    "Connections": [
        {
            "ID": 275521,
            "ConnectionTypeID": 25,
            "StatusTypeID": 50,
            "LevelID": 2,
            "PowerKW": 11,
            "CurrentTypeID": 20
        },
        {
            "ID": 275522,
            "ConnectionTypeID": 25,
            "StatusTypeID": 50,
            "LevelID": 2,
            "PowerKW": 11,
            "CurrentTypeID": 20
        }
    ],
    "StatusTypeID": 0,
    "DateLastStatusUpdate": "2021-07-12T02:49:00Z",
    "MetadataValues": [
        {
            "ID": 9247,
            "MetadataFieldID": 4,
            "ItemValue": "Data from the German chargepoint registry provided by Bundesnetzagentur.de under the CC-BY 4.0 license"
        }
    ],
    "DataQualityLevel": 3,
    "DateCreated": "2021-07-08T09:48:00Z",
    "SubmissionStatusTypeID": 100
}