{
    "IsRecentlyVerified": false,
    "ID": 56164,
    "UUID": "AFADC5CA-113D-49CD-BB54-B498FA782214",
    "DataProviderID": 1,
    "OperatorID": 80,
    "UsageTypeID": 4,
    "AddressInfo": {
        "ID": 56510,
        "Title": "Parcheggio Stadio Arena Garibaldi | EnelX",
        "AddressLine1": "Via Pasquale Galluppi",
        "Town": "Pisa",
        "StateOrProvince": "PI",
        "Postcode": "56123",
        "CountryID": 112,
        "Latitude": 43.725824232921525,
        "Longitude": 10.398524376652972,
        "RelatedURL": "https://www.enelx.com/it/it/emobility",
        "DistanceUnit": 0
    },
    "Connections": [
        {
            "ID": 70753,
            "ConnectionTypeID": 25,
            "StatusTypeID": 50,
            "LevelID": 2,
            "Amps": 32,
            "Voltage": 400,
            "PowerKW": 22,
            "CurrentTypeID": 20,
            "Quantity": 2
        },
        {
            "ID": 70754,
            "ConnectionTypeID": 36,
            "StatusTypeID": 50,
            "LevelID": 2,
            "Amps": 16,
            "Voltage": 240,
            "PowerKW": 3.7,
            "CurrentTypeID": 10,
            "Quantity": 2
        }
    ],
    "NumberOfPoints": 4,
    "StatusTypeID": 50,
    "DateLastStatusUpdate": "2020-12-04T14:34:00Z",
    "DataQualityLevel": 1,
    "DateCreated": "2015-10-18T16:38:00Z",
    "SubmissionStatusTypeID": 200
}