{
    "IsRecentlyVerified": false,
    "ID": 67790,
    "UUID": "3FFB1CAF-19AC-415E-9A63-4CA9EFEB9AF2",
    "DataProviderID": 1,
    "OperatorID": 214,
    "UsageTypeID": 4,
    "AddressInfo": {
        "ID": 68136,
        "Title": "Voßstraße",
        "AddressLine1": "Voßstraße 24",
        "AddressLine2": "Mitte",
        "Town": "Berlin",
        "StateOrProvince": "Berlin",
        "Postcode": "10117",
        "CountryID": 87,
        "Latitude": 52.51085187787503,
        "Longitude": 13.379071665606727,
        "AccessComments": "Zwei durchgehend nutzbare Parkplätze. Freischaltung mit The New Motion Ladekarte.",
        "DistanceUnit": 0
    },
    "Connections": [
        {
            "ID": 94319,
            "ConnectionTypeID": 25,
            "StatusTypeID": 50,
            "LevelID": 2,
            "Amps": 16,
            "Voltage": 400,
            "PowerKW": 11,
            "CurrentTypeID": 20,
            "Quantity": 2
        }
    ],
    "NumberOfPoints": 2,
    "StatusTypeID": 50,
    "DateLastStatusUpdate": "2016-06-01T05:54:00Z",
    "DataQualityLevel": 1,
    "DateCreated": "2016-06-01T05:54:00Z",
    "SubmissionStatusTypeID": 200
}