{
    "IsRecentlyVerified": false,
    "ID": 32552,
    "UUID": "A721D8B1-6331-4FEF-AA3A-052E262908E8",
    "DataProviderID": 1,
    "OperatorID": 105,
    "OperatorsReference": "Essent EM-DE-05111000-02-00006",
    "UsageTypeID": 4,
    "AddressInfo": {
        "ID": 32898,
        "Title": "Metro Straße 8",
        "AddressLine1": "Metro Straße 8",
        "Town": "Düsseldorf",
        "Postcode": "40235",
        "CountryID": 87,
        "Latitude": 51.234722,
        "Longitude": 6.822778,
        "DistanceUnit": 0
    },
    "Connections": [
        {
            "ID": 36063,
            "ConnectionTypeID": 25,
            "LevelID": 2,
            "PowerKW": 11
        },
        {
            "ID": 46422,
            "ConnectionTypeID": 25,
            "LevelID": 2,
            "PowerKW": 11
        }
    ],
    "NumberOfPoints": 1,
    "StatusTypeID": 50,
    "DateLastStatusUpdate": "2015-04-13T20:30:00Z",
    "DataQualityLevel": 3,
    "DateCreated": "2015-01-09T06:03:00Z",
    "SubmissionStatusTypeID": 200
}