{
    "IsRecentlyVerified": false,
    "ID": 177477,
    "UUID": "E432B452-AF59-498F-B7E7-3E07FBD4524E",
    "DataProviderID": 29,
    "DataProvidersReference": "2803",
    "AddressInfo": {
        "ID": 177836,
        "Title": "Großostheimer Str. 90",
        "AddressLine1": "Großostheimer Str. 90",
        "Town": "Aschaffenburg",
        "Postcode": "63741",
        "CountryID": 87,
        "Latitude": 49.959566,
        "Longitude": 9.123806,
        "DistanceUnit": 0
    },
    "Connections": [
        {
            "ID": 276653,
            "ConnectionTypeID": 25,
            "StatusTypeID": 50,
            "LevelID": 2,
            "PowerKW": 22,
            "CurrentTypeID": 20
        },
        {
            "ID": 276654,
            "ConnectionTypeID": 25,
            "StatusTypeID": 50,
            "LevelID": 2,
            "PowerKW": 22,
            "CurrentTypeID": 20
        }
    ],
    "StatusTypeID": 0,
    "DateLastStatusUpdate": "2021-07-12T02:44:00Z",
    "MetadataValues": [
        {
            "ID": 9771,
            "MetadataFieldID": 4,
            "ItemValue": "Data from the German chargepoint registry provided by Bundesnetzagentur.de under the CC-BY 4.0 license"
        }
    ],
    "DataQualityLevel": 3,
    "DateCreated": "2021-07-08T09:49:00Z",
    "SubmissionStatusTypeID": 100
}