{
    "IsRecentlyVerified": false,
    "ID": 18343,
    "UUID": "1AB682A5-4DD9-4A22-8F2E-CBE04028C217",
    "DataProviderID": 2,
    "DataProvidersReference": "52290",
    "OperatorID": 5,
    "UsageTypeID": 1,
    "AddressInfo": {
        "ID": 18688,
        "Title": "MP 225 LLC",
        "AddressLine1": "225 Rector Pl",
        "Town": "New York",
        "StateOrProvince": "NY",
        "Postcode": "10280",
        "CountryID": 2,
        "Latitude": 40.7092248,
        "Longitude": -74.0161545,
        "ContactTelephone1": "888-758-4389",
        "AccessComments": "24 hours daily",
        "RelatedURL": "http://www.chargepoint.com/",
        "DistanceUnit": 0
    },
    "Connections": [
        {
            "ID": 18565,
            "ConnectionTypeID": 1,
            "LevelID": 2,
            "Amps": 16,
            "Voltage": 230,
            "PowerKW": 3,
            "CurrentTypeID": 10,
            "Quantity": 2
        },
        {
            "ID": 22282,
            "ConnectionTypeID": 1,
            "LevelID": 2,
            "Quantity": 2
        }
    ],
    "DateLastStatusUpdate": "2019-12-24T09:17:00Z",
    "DataQualityLevel": 3,
    "DateCreated": "2013-07-18T05:22:00Z",
    "SubmissionStatusTypeID": 200
}