{
    "IsRecentlyVerified": false,
    "ID": 131614,
    "UUID": "D2CBC4A7-23ED-4BA6-8057-BC92B7DD3EF4",
    "DataProviderID": 1,
    "OperatorID": 80,
    "UsageTypeID": 4,
    "AddressInfo": {
        "ID": 131960,
        "Title": "Municipio di Fiumicino | EnelX",
        "AddressLine1": "Via della Stazione di Fiumicino",
        "Town": "Fiumicino",
        "StateOrProvince": "RM",
        "Postcode": "00054",
        "CountryID": 112,
        "Latitude": 41.7731082052113,
        "Longitude": 12.2370248162656,
        "ContactTelephone1": "800.069.850",
        "RelatedURL": "https://www.enelx.com/it/it/emobility",
        "DistanceUnit": 0
    },
    "Connections": [
        {
            "ID": 184196,
            "ConnectionTypeID": 25,
            "StatusTypeID": 50,
            "LevelID": 2,
            "Amps": 32,
            "Voltage": 400,
            "PowerKW": 22,
            "CurrentTypeID": 20,
            "Quantity": 1
        },
        {
            "ID": 184197,
            "ConnectionTypeID": 36,
            "StatusTypeID": 50,
            "LevelID": 2,
            "Amps": 16,
            "Voltage": 240,
            "PowerKW": 3.7,
            "CurrentTypeID": 10,
            "Quantity": 1
        }
    ],
    "NumberOfPoints": 2,
    "StatusTypeID": 50,
    "DateLastStatusUpdate": "2019-09-10T13:26:00Z",
    "DataQualityLevel": 1,
    "DateCreated": "2019-09-10T13:26:00Z",
    "SubmissionStatusTypeID": 200
}