{
    "IsRecentlyVerified": false,
    "ID": 174515,
    "UUID": "30D54EB8-ACD3-442E-A59B-8D788F7D92B2",
    "DataProviderID": 1,
    "OperatorID": 21,
    "UsageTypeID": 4,
    "UsageCost": "Mobi.E compatible card or App",
    "AddressInfo": {
        "ID": 174874,
        "Title": "VBP-00006 - Intermarché",
        "AddressLine1": "",
        "Town": "Sagres",
        "StateOrProvince": "Faro",
        "Postcode": "8650-366",
        "CountryID": 180,
        "Latitude": 37.014983743375396,
        "Longitude": -8.941309137162307,
        "DistanceUnit": 0
    },
    "Connections": [
        {
            "ID": 270367,
            "ConnectionTypeID": 25,
            "StatusTypeID": 50,
            "LevelID": 2,
            "Amps": 32,
            "Voltage": 400,
            "PowerKW": 22,
            "CurrentTypeID": 20,
            "Quantity": 2
        }
    ],
    "NumberOfPoints": 2,
    "StatusTypeID": 50,
    "DateLastStatusUpdate": "2021-04-04T09:47:00Z",
    "DataQualityLevel": 1,
    "DateCreated": "2021-04-04T09:47:00Z",
    "SubmissionStatusTypeID": 200
}