{
    "IsRecentlyVerified": false,
    "ID": 97779,
    "UUID": "0F6F4FBB-6200-4D8E-8920-14A7DBD350C6",
    "DataProviderID": 1,
    "OperatorID": 23,
    "OperatorsReference": "39825",
    "UsageTypeID": 4,
    "AddressInfo": {
        "ID": 98125,
        "Title": "Icon Parking Sutton 53",
        "AddressLine1": "417 E 53RD St",
        "Town": "New York",
        "StateOrProvince": "New York",
        "Postcode": "10022",
        "CountryID": 2,
        "Latitude": 40.755363,
        "Longitude": -73.963841,
        "ContactTelephone1": "(212) 644-6312",
        "DistanceUnit": 0
    },
    "Connections": [
        {
            "ID": 138687,
            "ConnectionTypeID": 30,
            "StatusTypeID": 50,
            "LevelID": 2,
            "PowerKW": 8,
            "CurrentTypeID": 10,
            "Quantity": 2
        }
    ],
    "NumberOfPoints": 2,
    "GeneralComments": "2 Tesla Connectors, up to 8kW.Parking fees will apply. Please see valet.",
    "StatusTypeID": 50,
    "DateLastStatusUpdate": "2018-01-21T16:38:00Z",
    "DataQualityLevel": 1,
    "DateCreated": "2018-01-21T16:38:00Z",
    "SubmissionStatusTypeID": 200
}