{
    "IsRecentlyVerified": false,
    "ID": 91164,
    "UUID": "87BFA9A3-EC59-492E-9A91-BF5FC033002F",
    "DataProviderID": 1,
    "OperatorID": 45,
    "UsageTypeID": 6,
    "AddressInfo": {
        "ID": 91510,
        "Title": "Parkhotel Surenburg (mit E-Bike Station)",
        "AddressLine1": "Surenburg 13",
        "Town": "Hörstel",
        "StateOrProvince": "Kreis Steinfurt",
        "Postcode": "48477",
        "CountryID": 87,
        "Latitude": 52.2537429,
        "Longitude": 7.598432900000034,
        "ContactTelephone1": "+49 5454 93380",
        "AccessComments": "24/7 nutzbar für Gäste des Hotels oder Restaurants. Die CEE 16A-Steckdosen befinden sich im grauen Verteilerkasten neben der Fahrrad-Ladestation am dunkelgrünen Trafohäuschen. Auf Nachfrage öffnet das Rezeptions-Personal den Kasten!",
        "RelatedURL": "http://www.parkhotel-surenburg.com/",
        "DistanceUnit": 0
    },
    "Connections": [
        {
            "ID": 129281,
            "ConnectionTypeID": 17,
            "StatusTypeID": 50,
            "LevelID": 2,
            "Amps": 16,
            "Voltage": 400,
            "PowerKW": 11,
            "CurrentTypeID": 20,
            "Quantity": 5
        },
        {
            "ID": 129282,
            "ConnectionTypeID": 28,
            "StatusTypeID": 50,
            "LevelID": 1,
            "Amps": 10,
            "Voltage": 230,
            "PowerKW": 2.3,
            "CurrentTypeID": 10,
            "Quantity": 3
        }
    ],
    "NumberOfPoints": 8,
    "StatusTypeID": 50,
    "DateLastStatusUpdate": "2017-08-01T07:44:00Z",
    "DataQualityLevel": 1,
    "DateCreated": "2017-08-01T07:44:00Z",
    "SubmissionStatusTypeID": 200
}