{
    "IsRecentlyVerified": false,
    "ID": 178526,
    "UUID": "27FAFB27-087B-452B-A34B-E0C9CCE95CD8",
    "DataProviderID": 29,
    "DataProvidersReference": "403,14309",
    "AddressInfo": {
        "ID": 178885,
        "Title": "Ferdinand-Porsche-Weg 1",
        "AddressLine1": "Ferdinand-Porsche-Weg 1",
        "Town": "Schwäbisch Gmünd",
        "Postcode": "73529",
        "CountryID": 87,
        "Latitude": 48.7913594796692,
        "Longitude": 9.77286565180062,
        "DistanceUnit": 0
    },
    "Connections": [
        {
            "ID": 279064,
            "ConnectionTypeID": 33,
            "StatusTypeID": 50,
            "LevelID": 3,
            "PowerKW": 320,
            "CurrentTypeID": 30
        },
        {
            "ID": 279065,
            "ConnectionTypeID": 33,
            "StatusTypeID": 50,
            "LevelID": 3,
            "PowerKW": 320,
            "CurrentTypeID": 30
        }
    ],
    "StatusTypeID": 0,
    "DateLastStatusUpdate": "2021-07-09T03:13:00Z",
    "MetadataValues": [
        {
            "ID": 10820,
            "MetadataFieldID": 4,
            "ItemValue": "Data from the German chargepoint registry provided by Bundesnetzagentur.de under the CC-BY 4.0 license"
        }
    ],
    "DataQualityLevel": 3,
    "DateCreated": "2021-07-08T09:50:00Z",
    "SubmissionStatusTypeID": 100
}