{
    "IsRecentlyVerified": false,
    "ID": 143481,
    "UUID": "6C5F7050-9142-4AAB-AF2C-46BA66E60468",
    "DataProviderID": 2,
    "DataProvidersReference": "123610",
    "OperatorID": 9,
    "UsageTypeID": 1,
    "AddressInfo": {
        "ID": 143833,
        "Title": "Turning Stone Resort Casino (Garage)",
        "AddressLine1": "5218 Patrick Rd",
        "Town": "Verona",
        "StateOrProvince": "NY",
        "Postcode": "13478",
        "CountryID": 2,
        "Latitude": 43.113421,
        "Longitude": -75.588756,
        "ContactTelephone1": "888-998-2546",
        "AccessComments": "MON: 24 hours | TUE: 24 hours | WED: 24 hours | THU: 24 hours | FRI: 24 hours | SAT: 24 hours | SUN: 24 hours",
        "RelatedURL": "http://www.blinkcharging.com/",
        "DistanceUnit": 0
    },
    "Connections": [
        {
            "ID": 199806,
            "ConnectionTypeID": 1,
            "LevelID": 2,
            "Amps": 16,
            "Voltage": 230,
            "PowerKW": 3,
            "CurrentTypeID": 10,
            "Quantity": 1
        }
    ],
    "StatusTypeID": 50,
    "DateLastStatusUpdate": "2019-12-24T09:21:00Z",
    "DataQualityLevel": 3,
    "DateCreated": "2019-12-24T09:21:00Z",
    "SubmissionStatusTypeID": 100
}