{
    "IsRecentlyVerified": false,
    "ID": 26050,
    "UUID": "E9DCEFB2-2069-4461-9C70-0C173D7639BD",
    "DataProviderID": 1,
    "OperatorID": 1,
    "UsageTypeID": 5,
    "UsageCost": "1,90€/2h",
    "AddressInfo": {
        "ID": 26396,
        "Title": "Tulkkilantie 1",
        "AddressLine1": "Tulkkilantie 1",
        "Town": "Kokemäki",
        "StateOrProvince": "Satakunta",
        "CountryID": 79,
        "Latitude": 61.2587674,
        "Longitude": 22.348536700000068,
        "DistanceUnit": 0
    },
    "Connections": [
        {
            "ID": 28410,
            "ConnectionTypeID": 25,
            "StatusTypeID": 50,
            "LevelID": 2,
            "Amps": 32,
            "Voltage": 400,
            "PowerKW": 22,
            "CurrentTypeID": 20,
            "Quantity": 1
        },
        {
            "ID": 28411,
            "ConnectionTypeID": 28,
            "StatusTypeID": 50,
            "LevelID": 2,
            "Amps": 16,
            "Voltage": 230,
            "PowerKW": 3,
            "CurrentTypeID": 10,
            "Quantity": 1
        }
    ],
    "NumberOfPoints": 1,
    "GeneralComments": "Sms",
    "StatusTypeID": 50,
    "DateLastStatusUpdate": "2014-11-27T13:18:00Z",
    "DataQualityLevel": 1,
    "DateCreated": "2014-11-27T13:18:00Z",
    "SubmissionStatusTypeID": 200
}