{
    "UserComments": [
        {
            "ID": 23898,
            "ChargePointID": 52954,
            "CommentTypeID": 10,
            "UserName": "ForumElettrico.it",
            "Comment": "Situata fra la darsena e la stazione FS. Leggi la recensione completa qui > https://www.forumelettrico.it/forum/colonnina-enel-x-22-kw-darsena-ravenna-ra-via-magazzini-anteriori-30-t15827.html",
            "RelatedURL": "https://www.forumelettrico.it/forum/colonnina-enel-x-22-kw-darsena-ravenna-ra-via-magazzini-anteriori-30-t15827.html",
            "DateCreated": "2021-02-15T15:53:13.433Z",
            "User": {
                "ID": 11749,
                "Username": "ForumElettrico.it"
            },
            "CheckinStatusTypeID": 10,
            "IsActionedByEditor": false
        }
    ],
    "MediaItems": [
        {
            "ID": 26553,
            "ChargePointID": 52954,
            "ItemURL": "https://s3-ap-southeast-2.amazonaws.com/openchargemap/images/IT/OCM52954/OCM-52954.orig.2021021515532905.jpg",
            "ItemThumbnailURL": "https://s3-ap-southeast-2.amazonaws.com/openchargemap/images/IT/OCM52954/OCM-52954.thmb.2021021515532905.jpg",
            "Comment": "",
            "IsEnabled": true,
            "IsVideo": false,
            "IsFeaturedItem": false,
            "IsExternalResource": false,
            "User": {
                "ID": 11749,
                "Username": "ForumElettrico.it"
            },
            "DateCreated": "2021-02-15T15:54:00Z"
        },
        {
            "ID": 26554,
            "ChargePointID": 52954,
            "ItemURL": "https://s3-ap-southeast-2.amazonaws.com/openchargemap/images/IT/OCM52954/OCM-52954.orig.2021021515533544.jpg",
            "ItemThumbnailURL": "https://s3-ap-southeast-2.amazonaws.com/openchargemap/images/IT/OCM52954/OCM-52954.thmb.2021021515533544.jpg",
            "Comment": "",
            "IsEnabled": true,
            "IsVideo": false,
            "IsFeaturedItem": false,
            "IsExternalResource": false,
            "User": {
                "ID": 11749,
                "Username": "ForumElettrico.it"
            },
            "DateCreated": "2021-02-15T15:54:00Z"
        },
        {
            "ID": 26555,
            "ChargePointID": 52954,
            "ItemURL": "https://s3-ap-southeast-2.amazonaws.com/openchargemap/images/IT/OCM52954/OCM-52954.orig.2021021515534292.jpg",
            "ItemThumbnailURL": "https://s3-ap-southeast-2.amazonaws.com/openchargemap/images/IT/OCM52954/OCM-52954.thmb.2021021515534292.jpg",
            "Comment": "",
            "IsEnabled": true,
            "IsVideo": false,
            "IsFeaturedItem": false,
            "IsExternalResource": false,
            "User": {
                "ID": 11749,
                "Username": "ForumElettrico.it"
            },
            "DateCreated": "2021-02-15T15:54:00Z"
        },
        {
            "ID": 26556,
            "ChargePointID": 52954,
            "ItemURL": "https://s3-ap-southeast-2.amazonaws.com/openchargemap/images/IT/OCM52954/OCM-52954.orig.2021021515534825.jpg",
            "ItemThumbnailURL": "https://s3-ap-southeast-2.amazonaws.com/openchargemap/images/IT/OCM52954/OCM-52954.thmb.2021021515534825.jpg",
            "Comment": "",
            "IsEnabled": true,
            "IsVideo": false,
            "IsFeaturedItem": false,
            "IsExternalResource": false,
            "User": {
                "ID": 11749,
                "Username": "ForumElettrico.it"
            },
            "DateCreated": "2021-02-15T15:54:00Z"
        },
        {
            "ID": 26557,
            "ChargePointID": 52954,
            "ItemURL": "https://s3-ap-southeast-2.amazonaws.com/openchargemap/images/IT/OCM52954/OCM-52954.orig.2021021515535603.jpg",
            "ItemThumbnailURL": "https://s3-ap-southeast-2.amazonaws.com/openchargemap/images/IT/OCM52954/OCM-52954.thmb.2021021515535603.jpg",
            "Comment": "",
            "IsEnabled": true,
            "IsVideo": false,
            "IsFeaturedItem": false,
            "IsExternalResource": false,
            "User": {
                "ID": 11749,
                "Username": "ForumElettrico.it"
            },
            "DateCreated": "2021-02-15T15:54:00Z"
        },
        {
            "ID": 26552,
            "ChargePointID": 52954,
            "ItemURL": "https://s3-ap-southeast-2.amazonaws.com/openchargemap/images/IT/OCM52954/OCM-52954.orig.2021021515532189.jpg",
            "ItemThumbnailURL": "https://s3-ap-southeast-2.amazonaws.com/openchargemap/images/IT/OCM52954/OCM-52954.thmb.2021021515532189.jpg",
            "Comment": "",
            "IsEnabled": true,
            "IsVideo": false,
            "IsFeaturedItem": false,
            "IsExternalResource": false,
            "User": {
                "ID": 11749,
                "Username": "ForumElettrico.it"
            },
            "DateCreated": "2021-02-15T15:53:00Z"
        }
    ],
    "IsRecentlyVerified": false,
    "ID": 52954,
    "UUID": "D2AFD2B1-6C8E-48D7-9D0C-83BD4304008B",
    "DataProviderID": 1,
    "OperatorID": 80,
    "UsageTypeID": 4,
    "UsageCost": "0,40 €/kW",
    "AddressInfo": {
        "ID": 53300,
        "Title": "Eneldrive Parcheggio Stazione degli Autobus",
        "AddressLine1": "Via Magazzini Anteriori",
        "Town": "Ravenna",
        "StateOrProvince": "RA",
        "Postcode": "48100",
        "CountryID": 112,
        "Latitude": 44.418164391786,
        "Longitude": 12.2094316009372,
        "RelatedURL": "http://eneldrive.it",
        "DistanceUnit": 0
    },
    "Connections": [
        {
            "ID": 65948,
            "ConnectionTypeID": 25,
            "StatusTypeID": 50,
            "LevelID": 2,
            "Amps": 32,
            "Voltage": 400,
            "PowerKW": 22,
            "CurrentTypeID": 20,
            "Quantity": 1
        },
        {
            "ID": 65949,
            "ConnectionTypeID": 36,
            "StatusTypeID": 50,
            "LevelID": 2,
            "Amps": 13,
            "Voltage": 240,
            "PowerKW": 3,
            "CurrentTypeID": 10,
            "Quantity": 1
        }
    ],
    "NumberOfPoints": 1,
    "StatusTypeID": 50,
    "DateLastStatusUpdate": "2021-02-15T15:54:00Z",
    "DataQualityLevel": 1,
    "DateCreated": "2015-09-15T13:52:00Z",
    "SubmissionStatusTypeID": 200
}