{
    "IsRecentlyVerified": false,
    "ID": 184383,
    "UUID": "605BE79B-8EB2-4235-BD61-65517B883C88",
    "DataProviderID": 29,
    "DataProvidersReference": "12825",
    "OperatorID": 3403,
    "AddressInfo": {
        "ID": 184742,
        "Title": "Hohenwulscher Bahnhof bei 1",
        "AddressLine1": "Hohenwulscher Bahnhof bei 1",
        "Town": "Bismark",
        "Postcode": "39629",
        "CountryID": 87,
        "Latitude": 52.667327,
        "Longitude": 11.594808,
        "DistanceUnit": 0
    },
    "Connections": [
        {
            "ID": 292610,
            "ConnectionTypeID": 25,
            "StatusTypeID": 50,
            "LevelID": 2,
            "PowerKW": 11,
            "CurrentTypeID": 20
        },
        {
            "ID": 292611,
            "ConnectionTypeID": 25,
            "StatusTypeID": 50,
            "LevelID": 2,
            "PowerKW": 22,
            "CurrentTypeID": 20
        }
    ],
    "StatusTypeID": 50,
    "DateLastStatusUpdate": "2021-07-12T02:50:00Z",
    "MetadataValues": [
        {
            "ID": 16674,
            "MetadataFieldID": 4,
            "ItemValue": "Data from the German chargepoint registry provided by Bundesnetzagentur.de under the CC-BY 4.0 license"
        }
    ],
    "DataQualityLevel": 3,
    "DateCreated": "2021-07-08T10:05:00Z",
    "SubmissionStatusTypeID": 100
}