{
    "IsRecentlyVerified": false,
    "ID": 140673,
    "UUID": "ECF56C96-94B8-49F1-A985-6E5083C99BAF",
    "DataProviderID": 2,
    "DataProvidersReference": "70555",
    "OperatorID": 5,
    "UsageTypeID": 1,
    "AddressInfo": {
        "ID": 141025,
        "Title": "SANTA CLARA U.",
        "AddressLine1": "455 El Camino Real",
        "Town": "Santa Clara",
        "StateOrProvince": "CA",
        "Postcode": "95050",
        "CountryID": 2,
        "Latitude": 37.350579,
        "Longitude": -121.933846,
        "ContactTelephone1": "888-758-4389",
        "AccessComments": "24 hours daily",
        "RelatedURL": "http://www.chargepoint.com/",
        "DistanceUnit": 0
    },
    "Connections": [
        {
            "ID": 196375,
            "ConnectionTypeID": 1,
            "LevelID": 2,
            "Amps": 16,
            "Voltage": 230,
            "PowerKW": 3,
            "CurrentTypeID": 10,
            "Quantity": 4
        }
    ],
    "StatusTypeID": 50,
    "DateLastStatusUpdate": "2019-12-24T09:13:00Z",
    "DataQualityLevel": 3,
    "DateCreated": "2019-12-24T09:13:00Z",
    "SubmissionStatusTypeID": 100
}