{
    "IsRecentlyVerified": false,
    "ID": 47057,
    "UUID": "302C5AAC-E8FE-4B88-933E-3637871E9D80",
    "DataProviderID": 1,
    "OperatorID": 45,
    "UsageTypeID": 3,
    "UsageCost": "0",
    "AddressInfo": {
        "ID": 47403,
        "Title": "Dorstener Arbeit gem. Gesellschaft",
        "AddressLine1": "Wienbachstraße 21",
        "AddressLine2": "Wulfen",
        "Town": "Dorsten",
        "StateOrProvince": "Kreis Recklinghausen",
        "Postcode": "46286",
        "CountryID": 87,
        "Latitude": 51.71876,
        "Longitude": 7.00364999999999,
        "ContactTelephone1": "+49 236974190",
        "AccessComments": "Kostenfreies Laden nach Anmeldung zu den Öffnungszeiten Mo-Do 8-16, Fr. 8-13Uhr. Keine Karte nötig.",
        "RelatedURL": "http://www.dorstener-arbeit.de/",
        "DistanceUnit": 0
    },
    "Connections": [
        {
            "ID": 57940,
            "ConnectionTypeID": 25,
            "StatusTypeID": 50,
            "LevelID": 2,
            "Amps": 32,
            "Voltage": 400,
            "PowerKW": 22,
            "CurrentTypeID": 20,
            "Quantity": 1
        },
        {
            "ID": 57941,
            "ConnectionTypeID": 28,
            "StatusTypeID": 50,
            "LevelID": 2,
            "Amps": 16,
            "Voltage": 230,
            "PowerKW": 3.7,
            "CurrentTypeID": 10,
            "Quantity": 1
        }
    ],
    "NumberOfPoints": 2,
    "StatusTypeID": 50,
    "DateLastStatusUpdate": "2015-05-11T16:24:00Z",
    "DataQualityLevel": 1,
    "DateCreated": "2015-05-11T12:58:00Z",
    "SubmissionStatusTypeID": 200
}