{
    "IsRecentlyVerified": false,
    "ID": 150404,
    "UUID": "ACC67630-29FF-4BB4-9BD8-AEF24BC08BF8",
    "DataProviderID": 28,
    "DataProvidersReference": "FR*09*PPDB*0011",
    "UsageTypeID": 5,
    "AddressInfo": {
        "ID": 150757,
        "Title": "Club 55 ",
        "AddressLine1": "45 Boulevard Patch 83350 Ramatuelle",
        "CountryID": 80,
        "Latitude": 43.227475,
        "Longitude": 6.661056,
        "AccessComments": "24/24 7/7 jours ",
        "DistanceUnit": 0
    },
    "Connections": [
        {
            "ID": 209098,
            "ConnectionTypeID": 25,
            "LevelID": 2,
            "PowerKW": 22,
            "CurrentTypeID": 10
        }
    ],
    "GeneralComments": "Badges et application PlugSurfing, Badges KiWhi et partenaires, Badges Sodetrel (Zen et Premium), Abonnés Plus de Bornes ",
    "StatusTypeID": 50,
    "DateLastStatusUpdate": "2020-03-15T06:17:00Z",
    "DataQualityLevel": 2,
    "DateCreated": "2020-03-15T06:17:00Z",
    "SubmissionStatusTypeID": 100
}