{
    "IsRecentlyVerified": false,
    "ID": 105558,
    "UUID": "6A2E747B-F493-4D7D-AE49-3D33AEAF5E37",
    "DataProviderID": 1,
    "OperatorID": 23,
    "OperatorsReference": "44108",
    "UsageTypeID": 4,
    "AddressInfo": {
        "ID": 105904,
        "Title": "Springbank Medical Centre",
        "AddressLine1": "460 Springbank Drive",
        "Town": "London",
        "StateOrProvince": "Ontario",
        "Postcode": "N6J 1H1",
        "CountryID": 44,
        "Latitude": 42.966456,
        "Longitude": -81.285532,
        "ContactTelephone1": "(519) 657-8952",
        "DistanceUnit": 0
    },
    "Connections": [
        {
            "ID": 148740,
            "ConnectionTypeID": 30,
            "StatusTypeID": 50,
            "LevelID": 2,
            "PowerKW": 16,
            "CurrentTypeID": 20,
            "Quantity": 12
        }
    ],
    "NumberOfPoints": 12,
    "GeneralComments": "12 Tesla Connectors, up to 16kW.Parking fees will apply. Self park.",
    "StatusTypeID": 50,
    "DateLastStatusUpdate": "2018-06-08T05:39:00Z",
    "DataQualityLevel": 1,
    "DateCreated": "2018-06-08T05:39:00Z",
    "SubmissionStatusTypeID": 200
}