{
    "IsRecentlyVerified": false,
    "ID": 109344,
    "UUID": "8BF4963A-0B8D-4131-B98D-A63C1BB5C922",
    "DataProviderID": 1,
    "OperatorID": 23,
    "OperatorsReference": "44993",
    "UsageTypeID": 4,
    "AddressInfo": {
        "ID": 109690,
        "Title": "Monte Giner Active Hotel and Residence",
        "AddressLine1": "Via 4 Novembre",
        "Town": "Mezzana",
        "Postcode": "38020",
        "CountryID": 112,
        "Latitude": 46.316515,
        "Longitude": 10.799037,
        "ContactTelephone1": " +39 046 375 7105",
        "DistanceUnit": 0
    },
    "Connections": [
        {
            "ID": 154462,
            "ConnectionTypeID": 30,
            "StatusTypeID": 50,
            "LevelID": 2,
            "Amps": 32,
            "Voltage": 400,
            "PowerKW": 22,
            "CurrentTypeID": 20,
            "Quantity": 1
        }
    ],
    "NumberOfPoints": 1,
    "GeneralComments": "1 Tesla Connector, up to 22kW.Available to the public. Please call ahead.",
    "StatusTypeID": 50,
    "DateLastStatusUpdate": "2018-10-11T14:30:00Z",
    "DataQualityLevel": 1,
    "DateCreated": "2018-10-11T14:30:00Z",
    "SubmissionStatusTypeID": 200
}