{
    "IsRecentlyVerified": false,
    "ID": 107230,
    "UUID": "FF69A77B-1AC4-423C-A308-060FC5F43E79",
    "DataProviderID": 1,
    "OperatorID": 45,
    "UsageTypeID": 1,
    "AddressInfo": {
        "ID": 107576,
        "Title": "Stoppustuð Dalvík",
        "AddressLine1": "Svarfaðarbraut 34",
        "Town": "Dalvík",
        "StateOrProvince": "Dalvík",
        "Postcode": "620",
        "CountryID": 105,
        "Latitude": 65.966895,
        "Longitude": -18.536438,
        "DistanceUnit": 0
    },
    "Connections": [
        {
            "ID": 151240,
            "ConnectionTypeID": 25,
            "StatusTypeID": 50,
            "LevelID": 2,
            "Amps": 32,
            "Voltage": 400,
            "PowerKW": 22,
            "CurrentTypeID": 20,
            "Quantity": 1
        }
    ],
    "NumberOfPoints": 1,
    "StatusTypeID": 50,
    "DateLastStatusUpdate": "2018-07-23T09:32:00Z",
    "DataQualityLevel": 1,
    "DateCreated": "2018-07-23T09:32:00Z",
    "SubmissionStatusTypeID": 200
}