{
    "IsRecentlyVerified": false,
    "ID": 101828,
    "UUID": "D2CFBC57-0DC8-437F-96AB-A0D95B28495B",
    "DataProviderID": 1,
    "OperatorID": 3,
    "OperatorsReference": "PG-80999,PG-81001",
    "UsageTypeID": 6,
    "UsageCost": "Free",
    "AddressInfo": {
        "ID": 102174,
        "Title": "Forrest Joinery & Construction",
        "AddressLine1": "Ramsgreave Business Park",
        "Town": "Blackburn",
        "Postcode": "BB1 8QW",
        "CountryID": 1,
        "Latitude": 53.773187,
        "Longitude": -2.484947,
        "DistanceUnit": 0
    },
    "Connections": [
        {
            "ID": 143741,
            "ConnectionTypeID": 25,
            "StatusTypeID": 50,
            "LevelID": 2,
            "Amps": 32,
            "Voltage": 230,
            "PowerKW": 7,
            "CurrentTypeID": 10,
            "Quantity": 4
        }
    ],
    "NumberOfPoints": 4,
    "GeneralComments": "This is an open charge unit installed at the Forrest Joinery & Construction site in Ramsgreave Business Park, Pleckgate Road, Blackburn",
    "StatusTypeID": 50,
    "DateLastStatusUpdate": "2018-04-12T05:35:00Z",
    "DataQualityLevel": 1,
    "DateCreated": "2018-04-11T05:35:00Z",
    "SubmissionStatusTypeID": 200
}