{
    "IsRecentlyVerified": false,
    "ID": 168331,
    "UUID": "7AEC13A2-2C2C-41F0-8FE4-3BFBAAFAD27D",
    "DataProviderID": 1,
    "OperatorID": 23,
    "OperatorsReference": "54565",
    "UsageTypeID": 4,
    "UsageCost": "€0.33/kWh; Andere Tarife für ältere Autos",
    "AddressInfo": {
        "ID": 168690,
        "Title": "Berlin - Euref-Campus Supercharger",
        "AddressLine1": "Euref-Campus 1-25",
        "Town": "Berlin",
        "Postcode": "10829",
        "CountryID": 87,
        "Latitude": 52.480891,
        "Longitude": 13.355927,
        "DistanceUnit": 0
    },
    "Connections": [
        {
            "ID": 255646,
            "ConnectionTypeID": 27,
            "StatusTypeID": 50,
            "LevelID": 3,
            "PowerKW": 120,
            "CurrentTypeID": 30,
            "Quantity": 12
        }
    ],
    "NumberOfPoints": 12,
    "GeneralComments": "Charging12 superchargers, available 24/7, up to 250kW",
    "StatusTypeID": 50,
    "DateLastStatusUpdate": "2020-09-23T05:27:00Z",
    "DataQualityLevel": 1,
    "DateCreated": "2020-09-22T05:30:00Z",
    "SubmissionStatusTypeID": 200
}