{
    "IsRecentlyVerified": false,
    "ID": 131668,
    "UUID": "E47438B2-F1C6-42D8-BBC9-CD31D1C3FDA9",
    "DataProviderID": 1,
    "OperatorID": 3315,
    "OperatorsReference": "51581,51582",
    "UsageTypeID": 4,
    "UsageCost": "Free",
    "AddressInfo": {
        "ID": 132014,
        "Title": "Fisherrow Car Park Charging Hub, Musselburgh",
        "AddressLine1": "Fisherrow Car Park",
        "Town": "Musselburgh",
        "Postcode": "EH21 6DH",
        "CountryID": 1,
        "Latitude": 55.945018,
        "Longitude": -3.068937,
        "DistanceUnit": 0
    },
    "Connections": [
        {
            "ID": 184282,
            "ConnectionTypeID": 25,
            "StatusTypeID": 50,
            "LevelID": 2,
            "Amps": 32,
            "Voltage": 400,
            "PowerKW": 22,
            "CurrentTypeID": 20,
            "Quantity": 4
        }
    ],
    "NumberOfPoints": 4,
    "StatusTypeID": 50,
    "DateLastStatusUpdate": "2019-09-10T13:53:00Z",
    "DataQualityLevel": 1,
    "DateCreated": "2019-09-10T13:47:00Z",
    "SubmissionStatusTypeID": 200
}