{
    "IsRecentlyVerified": false,
    "ID": 65188,
    "UUID": "05FFB99A-7021-42A6-926E-2A5B2B8DBC93",
    "DataProviderID": 1,
    "OperatorID": 45,
    "UsageTypeID": 6,
    "UsageCost": "5,95€ pro Ladung + 1€ pro Stunde Parkgebühr",
    "AddressInfo": {
        "ID": 65534,
        "Title": "acom Hotel",
        "AddressLine1": "Leipziger Platz",
        "Town": "Nürnberg",
        "StateOrProvince": "Bayern",
        "Postcode": "90491",
        "CountryID": 87,
        "Latitude": 49.47302130832107,
        "Longitude": 11.103675940475467,
        "ContactTelephone1": "+49 911 6505990",
        "AccessComments": "Nähe Nordostbahnhof in der Hoteltiefgarage. Park+Ladegebühren fallen an. 24/7 nutzbar.",
        "RelatedURL": "http://acomhotel-nuernberg.de/",
        "DistanceUnit": 0
    },
    "Connections": [
        {
            "ID": 89743,
            "ConnectionTypeID": 25,
            "StatusTypeID": 50,
            "LevelID": 2,
            "Amps": 32,
            "Voltage": 400,
            "PowerKW": 22,
            "CurrentTypeID": 20,
            "Quantity": 1
        },
        {
            "ID": 89744,
            "ConnectionTypeID": 28,
            "StatusTypeID": 50,
            "LevelID": 2,
            "Amps": 16,
            "Voltage": 230,
            "PowerKW": 3.7,
            "CurrentTypeID": 10,
            "Quantity": 2
        }
    ],
    "NumberOfPoints": 3,
    "StatusTypeID": 50,
    "DateLastStatusUpdate": "2016-04-19T08:25:00Z",
    "DataQualityLevel": 1,
    "DateCreated": "2016-04-19T08:25:00Z",
    "SubmissionStatusTypeID": 200
}