{
    "IsRecentlyVerified": false,
    "ID": 64793,
    "UUID": "7A94E02D-24C2-4B6D-B2C0-05E6E971A9E6",
    "DataProviderID": 1,
    "OperatorID": 20,
    "OperatorsReference": "70203",
    "UsageTypeID": 7,
    "UsageCost": "£1.00/charge admin fee. Parking fees apply.",
    "AddressInfo": {
        "ID": 65139,
        "Title": "Woodhouse Lane Car Park",
        "AddressLine1": "Woodhouse Lane",
        "AddressLine2": "Woodhouse",
        "Town": "Leeds",
        "StateOrProvince": "England",
        "Postcode": "LS2 8BN",
        "CountryID": 1,
        "Latitude": 53.8048681,
        "Longitude": -1.54671770000004,
        "ContactEmail": "car.parking.seniors@leeds.gov.uk",
        "DistanceUnit": 0
    },
    "Connections": [
        {
            "ID": 83304,
            "ConnectionTypeID": 25,
            "StatusTypeID": 50,
            "LevelID": 2,
            "Amps": 32,
            "Voltage": 230,
            "PowerKW": 7,
            "CurrentTypeID": 10,
            "Quantity": 2
        }
    ],
    "NumberOfPoints": 14,
    "GeneralComments": "Charge point must be pre-booked, before use. E-mail: car.parking.seniors@leeds.gov.uk the day before you want to charge, in order to ensure an EV bay is reserved for you.",
    "StatusTypeID": 50,
    "DateLastStatusUpdate": "2020-05-14T05:14:00Z",
    "DataQualityLevel": 1,
    "DateCreated": "2016-03-21T18:32:00Z",
    "SubmissionStatusTypeID": 200
}