{
    "IsRecentlyVerified": false,
    "ID": 75044,
    "UUID": "191F0128-A9BE-4F69-B504-C84E5A64D7CC",
    "DataProviderID": 1,
    "OperatorID": 23,
    "OperatorsReference": "19728",
    "UsageTypeID": 6,
    "UsageCost": "Free",
    "AddressInfo": {
        "ID": 75390,
        "Title": "Worldhotel Wings",
        "AddressLine1": "Rotterdam Airportplein 55",
        "Town": "Rotterdam",
        "StateOrProvince": "Zuid-Holland",
        "Postcode": "3045 AP",
        "CountryID": 159,
        "Latitude": 51.947716,
        "Longitude": 4.436052,
        "ContactTelephone1": "+31 10 79 99 090",
        "DistanceUnit": 0
    },
    "Connections": [
        {
            "ID": 108237,
            "ConnectionTypeID": 30,
            "StatusTypeID": 50,
            "LevelID": 2,
            "Amps": 32,
            "Voltage": 400,
            "PowerKW": 22,
            "CurrentTypeID": 20,
            "Quantity": 2
        }
    ],
    "NumberOfPoints": 2,
    "GeneralComments": "2 Tesla Connector, up to 22kW.Available for patrons only. Self park.",
    "StatusTypeID": 50,
    "DateLastStatusUpdate": "2018-10-03T23:27:00Z",
    "DataQualityLevel": 1,
    "DateCreated": "2016-12-11T14:28:00Z",
    "SubmissionStatusTypeID": 200
}