{
    "IsRecentlyVerified": false,
    "ID": 137892,
    "UUID": "B4B65F1A-1A72-4554-8EE9-BADCA4D3A8FB",
    "DataProviderID": 2,
    "DataProvidersReference": "105432",
    "OperatorID": 5,
    "UsageTypeID": 1,
    "AddressInfo": {
        "ID": 138241,
        "Title": "BARONA",
        "AddressLine1": "Barona Rd",
        "Town": "Lakeside",
        "StateOrProvince": "CA",
        "Postcode": "92040",
        "CountryID": 2,
        "Latitude": 32.9397267,
        "Longitude": -116.8760909,
        "ContactTelephone1": "888-758-4389",
        "AccessComments": "24 hours daily",
        "RelatedURL": "http://www.chargepoint.com/",
        "DistanceUnit": 0
    },
    "Connections": [
        {
            "ID": 192914,
            "ConnectionTypeID": 1,
            "LevelID": 2,
            "Amps": 16,
            "Voltage": 230,
            "PowerKW": 3,
            "CurrentTypeID": 10,
            "Quantity": 16
        }
    ],
    "StatusTypeID": 50,
    "DateLastStatusUpdate": "2019-12-24T09:06:00Z",
    "DataQualityLevel": 3,
    "DateCreated": "2019-12-24T09:06:00Z",
    "SubmissionStatusTypeID": 100
}