{
    "IsRecentlyVerified": false,
    "ID": 100602,
    "UUID": "5707F93E-938F-410F-BCA9-096B6D9F7367",
    "DataProviderID": 1,
    "OperatorID": 23,
    "OperatorsReference": "41116",
    "UsageTypeID": 4,
    "AddressInfo": {
        "ID": 100948,
        "Title": "Doubletree Inn At the Colonnade",
        "AddressLine1": "4 W University Pkwy",
        "Town": "Baltimore",
        "StateOrProvince": "Maryland",
        "Postcode": "21218",
        "CountryID": 2,
        "Latitude": 39.334176,
        "Longitude": -76.619561,
        "ContactTelephone1": "(410) 235-5400",
        "DistanceUnit": 0
    },
    "Connections": [
        {
            "ID": 142094,
            "ConnectionTypeID": 30,
            "StatusTypeID": 50,
            "LevelID": 2,
            "PowerKW": 16,
            "CurrentTypeID": 20,
            "Quantity": 4
        }
    ],
    "NumberOfPoints": 4,
    "GeneralComments": "4 Tesla Connectors, up to 16kW.Available for customers. Please see front desk.",
    "StatusTypeID": 50,
    "DateLastStatusUpdate": "2018-03-02T06:56:00Z",
    "DataQualityLevel": 1,
    "DateCreated": "2018-03-02T06:56:00Z",
    "SubmissionStatusTypeID": 200
}