{
    "IsRecentlyVerified": false,
    "ID": 85028,
    "UUID": "C31CE654-BB79-49AE-938B-A70299C672D6",
    "DataProviderID": 1,
    "OperatorID": 23,
    "OperatorsReference": "26011",
    "UsageTypeID": 4,
    "AddressInfo": {
        "ID": 85374,
        "Title": "Gamma Torreon",
        "AddressLine1": "Calz. Jose Vasconcelos # 1935 Col. Residencial Tecnologico",
        "Town": "Torreon",
        "StateOrProvince": "Coahuila",
        "Postcode": "27272",
        "CountryID": 146,
        "Latitude": 25.51629,
        "Longitude": -103.396047,
        "ContactTelephone1": "+52 871 222 5800",
        "DistanceUnit": 0
    },
    "Connections": [
        {
            "ID": 120779,
            "ConnectionTypeID": 30,
            "StatusTypeID": 50,
            "LevelID": 2,
            "PowerKW": 18,
            "CurrentTypeID": 20,
            "Quantity": 2
        }
    ],
    "NumberOfPoints": 2,
    "GeneralComments": "2 Tesla Connectors, up to 18kW.Available for customers. Please see front desk.",
    "StatusTypeID": 50,
    "DateLastStatusUpdate": "2017-03-24T06:28:00Z",
    "DataQualityLevel": 1,
    "DateCreated": "2017-03-24T06:28:00Z",
    "SubmissionStatusTypeID": 200
}