{
    "IsRecentlyVerified": false,
    "ID": 157985,
    "UUID": "0C66282D-FD10-4E0F-98AF-9441DD12763D",
    "DataProviderID": 18,
    "DataProvidersReference": "6d976d9cf79d3fabe1fa74135531e7f7",
    "UsageTypeID": 5,
    "AddressInfo": {
        "ID": 158339,
        "Title": "Upper Galdeford",
        "AddressLine1": "Upper Galdeford",
        "Town": "Ludlow",
        "Postcode": "SY8 1QF",
        "CountryID": 1,
        "Latitude": 52.369024,
        "Longitude": -2.716292,
        "AccessComments": "",
        "RelatedURL": "http://www.ev-dot.co.uk/",
        "DistanceUnit": 0
    },
    "Connections": [
        {
            "ID": 227718,
            "ConnectionTypeID": 1036,
            "Reference": "Connector 1",
            "StatusTypeID": 50,
            "LevelID": 3,
            "Amps": 63,
            "Voltage": 400,
            "PowerKW": 43,
            "CurrentTypeID": 20
        },
        {
            "ID": 227719,
            "ConnectionTypeID": 2,
            "Reference": "Connector 2",
            "StatusTypeID": 50,
            "LevelID": 3,
            "Amps": 125,
            "Voltage": 400,
            "PowerKW": 50,
            "CurrentTypeID": 30
        },
        {
            "ID": 227720,
            "ConnectionTypeID": 1036,
            "Reference": "Connector 3",
            "StatusTypeID": 50,
            "LevelID": 3,
            "Amps": 125,
            "Voltage": 400,
            "PowerKW": 50,
            "CurrentTypeID": 30
        }
    ],
    "StatusTypeID": 0,
    "DateLastStatusUpdate": "2021-07-12T03:39:00Z",
    "MetadataValues": [
        {
            "ID": 7518,
            "MetadataFieldID": 4,
            "ItemValue": "Contains public sector information licensed under the Open Government Licence v2.0. http://www.nationalarchives.gov.uk/doc/open-government-licence/version/2/"
        }
    ],
    "DataQualityLevel": 3,
    "DateCreated": "2020-06-25T10:00:00Z",
    "SubmissionStatusTypeID": 100
}