{
    "IsRecentlyVerified": false,
    "ID": 63123,
    "UUID": "147612F1-6661-4681-83D6-891CAC33021C",
    "DataProviderID": 26,
    "DataProvidersReference": "72840",
    "OperatorID": 103,
    "OperatorsReference": "Allego NLALLEGO0000942",
    "UsageCost": "0.00 jaarabonnement",
    "AddressInfo": {
        "ID": 63469,
        "Title": "Kweeklust",
        "AddressLine1": "Kweeklust",
        "Town": "Gorinchem",
        "Postcode": "4201 LC",
        "CountryID": 159,
        "Latitude": 51.8329827,
        "Longitude": 4.97354989,
        "ContactTelephone1": "0800-3745337",
        "RelatedURL": "http://www.allego.eu/",
        "DistanceUnit": 0
    },
    "Connections": [
        {
            "ID": 80272,
            "ConnectionTypeID": 25,
            "LevelID": 2,
            "PowerKW": 22,
            "CurrentTypeID": 10
        },
        {
            "ID": 80273,
            "ConnectionTypeID": 25,
            "LevelID": 2,
            "PowerKW": 22,
            "CurrentTypeID": 10
        }
    ],
    "NumberOfPoints": 1,
    "StatusTypeID": 50,
    "DateLastStatusUpdate": "2016-06-04T02:41:00Z",
    "DataQualityLevel": 3,
    "DateCreated": "2016-03-03T12:29:00Z",
    "SubmissionStatusTypeID": 100
}