{
    "IsRecentlyVerified": false,
    "ID": 92338,
    "UUID": "8601AC9F-4FF3-438E-B6F4-A9FF78067B77",
    "DataProviderID": 1,
    "OperatorID": 23,
    "OperatorsReference": "33341",
    "UsageTypeID": 4,
    "AddressInfo": {
        "ID": 92684,
        "Title": "Storm King Golf Club",
        "AddressLine1": "18 Ridge RD",
        "Town": "Cornwall",
        "StateOrProvince": "New York",
        "Postcode": "12518",
        "CountryID": 2,
        "Latitude": 41.429539,
        "Longitude": -74.02842,
        "ContactTelephone1": "(845) 534-3899",
        "DistanceUnit": 0
    },
    "Connections": [
        {
            "ID": 130881,
            "ConnectionTypeID": 30,
            "StatusTypeID": 50,
            "LevelID": 2,
            "PowerKW": 16,
            "CurrentTypeID": 20,
            "Quantity": 2
        }
    ],
    "NumberOfPoints": 2,
    "GeneralComments": "Available to the public. Self Park. ",
    "StatusTypeID": 50,
    "DateLastStatusUpdate": "2018-07-22T22:55:00Z",
    "DataQualityLevel": 1,
    "DateCreated": "2017-09-01T05:46:00Z",
    "SubmissionStatusTypeID": 200
}