{
    "IsRecentlyVerified": false,
    "ID": 150909,
    "UUID": "681EC961-8544-4808-A7EB-F5E0D457A4CD",
    "DataProviderID": 28,
    "DataProvidersReference": "FR*A16*P*WIIZ*64*_*_*_",
    "UsageTypeID": 5,
    "AddressInfo": {
        "ID": 151262,
        "Title": "Grasse Parking la Chesnaie",
        "AddressLine1": "Route d'Auribeau",
        "CountryID": 80,
        "Latitude": 43.639103,
        "Longitude": 6.911085,
        "AccessComments": "24h/24",
        "DistanceUnit": 0
    },
    "Connections": [
        {
            "ID": 210250,
            "ConnectionTypeID": 28,
            "StatusTypeID": 50,
            "LevelID": 2,
            "PowerKW": 22,
            "CurrentTypeID": 10
        },
        {
            "ID": 210251,
            "ConnectionTypeID": 1036,
            "StatusTypeID": 50,
            "LevelID": 2,
            "PowerKW": 22,
            "CurrentTypeID": 20
        },
        {
            "ID": 240018,
            "ConnectionTypeID": 28,
            "StatusTypeID": 50,
            "LevelID": 2,
            "PowerKW": 22,
            "CurrentTypeID": 10
        },
        {
            "ID": 240019,
            "ConnectionTypeID": 1036,
            "StatusTypeID": 50,
            "LevelID": 2,
            "PowerKW": 22,
            "CurrentTypeID": 20
        }
    ],
    "GeneralComments": "badge, appli et QR code",
    "StatusTypeID": 50,
    "DateLastStatusUpdate": "2020-08-27T05:11:00Z",
    "DataQualityLevel": 2,
    "DateCreated": "2020-03-15T06:17:00Z",
    "SubmissionStatusTypeID": 100
}