{
    "IsRecentlyVerified": false,
    "ID": 60287,
    "UUID": "5B8F8DC5-E61F-4E08-9170-23C81D1F0458",
    "DataProviderID": 1,
    "OperatorID": 45,
    "UsageTypeID": 3,
    "AddressInfo": {
        "ID": 60633,
        "Title": "EGT Unternehmensgruppe",
        "AddressLine1": "Schonacher Straße 2",
        "Town": "Triberg im Schwarzwald",
        "StateOrProvince": "Schwarzwald-Baar-Kreis",
        "Postcode": "78098",
        "CountryID": 87,
        "Latitude": 48.1334115,
        "Longitude": 8.221283299999982,
        "ContactTelephone1": "+49 77 22 918100",
        "RelatedURL": "https://www.egt.de/unternehmen/verantwortung-csr/umweltschutz/elektromobil.html",
        "DistanceUnit": 0
    },
    "Connections": [
        {
            "ID": 76321,
            "ConnectionTypeID": 25,
            "StatusTypeID": 50,
            "LevelID": 2,
            "Amps": 32,
            "Voltage": 400,
            "PowerKW": 22,
            "CurrentTypeID": 20,
            "Quantity": 1
        },
        {
            "ID": 76322,
            "ConnectionTypeID": 28,
            "StatusTypeID": 50,
            "LevelID": 2,
            "Amps": 16,
            "Voltage": 230,
            "PowerKW": 3.7,
            "CurrentTypeID": 10,
            "Quantity": 1
        }
    ],
    "NumberOfPoints": 2,
    "StatusTypeID": 50,
    "DateLastStatusUpdate": "2016-01-19T07:00:00Z",
    "DataQualityLevel": 1,
    "DateCreated": "2016-01-19T07:00:00Z",
    "SubmissionStatusTypeID": 200
}