{
    "IsRecentlyVerified": false,
    "ID": 186019,
    "UUID": "70C8D051-7827-4354-ABC3-8275DCFE36F7",
    "DataProviderID": 29,
    "DataProvidersReference": "21426",
    "OperatorID": 44,
    "AddressInfo": {
        "ID": 186378,
        "Title": "Raiffeisenstr. 96",
        "AddressLine1": "Raiffeisenstr. 96",
        "Town": "Koblenz",
        "Postcode": "56072",
        "CountryID": 87,
        "Latitude": 50,
        "Longitude": 7,
        "DistanceUnit": 0
    },
    "Connections": [
        {
            "ID": 297485,
            "ConnectionTypeID": 25,
            "StatusTypeID": 50,
            "LevelID": 2,
            "PowerKW": 22,
            "CurrentTypeID": 20
        }
    ],
    "StatusTypeID": 50,
    "DateLastStatusUpdate": "2021-07-12T02:44:00Z",
    "MetadataValues": [
        {
            "ID": 18261,
            "MetadataFieldID": 4,
            "ItemValue": "Data from the German chargepoint registry provided by Bundesnetzagentur.de under the CC-BY 4.0 license"
        }
    ],
    "DataQualityLevel": 3,
    "DateCreated": "2021-07-12T02:44:00Z",
    "SubmissionStatusTypeID": 100
}