{
    "IsRecentlyVerified": false,
    "ID": 45210,
    "UUID": "C58D22B5-00D2-4640-96B9-F9C1C9CF0524",
    "DataProviderID": 1,
    "OperatorID": 105,
    "UsageTypeID": 1,
    "UsageCost": "0",
    "AddressInfo": {
        "ID": 45556,
        "Title": "E-Bike Station Rathaus",
        "AddressLine1": "Liesborner Straße 5",
        "Town": "Wadersloh",
        "Postcode": "59329",
        "CountryID": 87,
        "Latitude": 51.7347227181618,
        "Longitude": 8.24820499326724,
        "RelatedURL": "http://www.rwe.com/web/cms/de/494436/e-bikes-on-tour/ladestationen/",
        "DistanceUnit": 0
    },
    "Connections": [
        {
            "ID": 55727,
            "ConnectionTypeID": 28,
            "StatusTypeID": 50,
            "LevelID": 1,
            "Amps": 10,
            "Voltage": 230,
            "PowerKW": 2.3,
            "CurrentTypeID": 10,
            "Quantity": 3
        }
    ],
    "NumberOfPoints": 3,
    "StatusTypeID": 50,
    "DateLastStatusUpdate": "2015-04-28T16:01:00Z",
    "DataQualityLevel": 1,
    "DateCreated": "2015-04-28T08:36:00Z",
    "SubmissionStatusTypeID": 200
}