{
    "IsRecentlyVerified": false,
    "ID": 41311,
    "UUID": "CB463F08-DCB7-4E5C-BA88-F43CFA8B6C1B",
    "DataProviderID": 1,
    "UsageTypeID": 1,
    "UsageCost": "0",
    "AddressInfo": {
        "ID": 41657,
        "Title": "Autohaus Kath",
        "AddressLine1": "Andreas-Clausen-Straße",
        "Town": "Husum",
        "StateOrProvince": "Kreis Nordfriesland",
        "Postcode": "25813",
        "CountryID": 87,
        "Latitude": 54.49367,
        "Longitude": 9.08307000000002,
        "ContactTelephone1": "04841 83530",
        "AccessComments": "E-Station auf dem Hof des VW-Autohauses, immer zugänglich. Zufahrt am besten von der Robert-Koch-Straße. Strom kostenlos.",
        "RelatedURL": "http://www.kath-gruppe.de",
        "DistanceUnit": 0
    },
    "Connections": [
        {
            "ID": 45131,
            "ConnectionTypeID": 25,
            "StatusTypeID": 50,
            "LevelID": 2,
            "Amps": 16,
            "Voltage": 400,
            "PowerKW": 3.7,
            "CurrentTypeID": 10,
            "Quantity": 2
        }
    ],
    "NumberOfPoints": 2,
    "GeneralComments": "2x Typ2 Kabel mit Kupplung.",
    "StatusTypeID": 50,
    "DateLastStatusUpdate": "2016-12-11T17:57:00Z",
    "DataQualityLevel": 1,
    "DateCreated": "2015-01-31T11:05:00Z",
    "SubmissionStatusTypeID": 200
}