{
    "IsRecentlyVerified": false,
    "ID": 141789,
    "UUID": "59F2FED5-4037-403B-B130-86A003C88CEE",
    "DataProviderID": 2,
    "DataProvidersReference": "150454",
    "UsageTypeID": 2,
    "AddressInfo": {
        "ID": 142141,
        "Title": "The Landis Sewerage Authority",
        "AddressLine1": "1776 S Mill Rd",
        "Town": "Vineland",
        "StateOrProvince": "NJ",
        "Postcode": "08360",
        "CountryID": 2,
        "Latitude": 39.45803,
        "Longitude": -75.061244,
        "ContactTelephone1": "",
        "AccessComments": "",
        "RelatedURL": "",
        "DistanceUnit": 0
    },
    "Connections": [
        {
            "ID": 197801,
            "ConnectionTypeID": 1,
            "LevelID": 2,
            "Amps": 16,
            "Voltage": 230,
            "PowerKW": 3.7,
            "CurrentTypeID": 10,
            "Quantity": 2
        }
    ],
    "StatusTypeID": 50,
    "DateLastStatusUpdate": "2020-06-26T03:01:00Z",
    "DataQualityLevel": 3,
    "DateCreated": "2019-12-24T09:16:00Z",
    "SubmissionStatusTypeID": 100
}