{
    "IsRecentlyVerified": false,
    "ID": 128818,
    "UUID": "2D93ABC0-CB1C-4100-9216-475E75E925F0",
    "DataProviderID": 1,
    "OperatorID": 3354,
    "UsageTypeID": 1,
    "UsageCost": "Registered user: Fast charging: 0.2€/min. Type 2: free. Without registration: Fast charging 1€+0.2€/min. Type 2: 1€ per started charge.",
    "AddressInfo": {
        "ID": 129164,
        "Title": "K-Citymarket Linnainmaa",
        "AddressLine1": "Mäentakusenkatu 1",
        "Town": "Tampere",
        "Postcode": "33580",
        "CountryID": 79,
        "Latitude": 61.4967307107766,
        "Longitude": 23.8882935527292,
        "AccessComments": "mon-sat 8-21\r\nsun 10-21",
        "DistanceUnit": 0
    },
    "Connections": [
        {
            "ID": 180236,
            "ConnectionTypeID": 25,
            "StatusTypeID": 50,
            "LevelID": 2,
            "PowerKW": 22,
            "CurrentTypeID": 20,
            "Quantity": 4
        },
        {
            "ID": 180237,
            "ConnectionTypeID": 2,
            "StatusTypeID": 50,
            "LevelID": 3,
            "PowerKW": 50,
            "CurrentTypeID": 30,
            "Quantity": 2
        },
        {
            "ID": 180238,
            "ConnectionTypeID": 33,
            "StatusTypeID": 50,
            "LevelID": 3,
            "PowerKW": 50,
            "CurrentTypeID": 30,
            "Quantity": 2
        }
    ],
    "NumberOfPoints": 6,
    "StatusTypeID": 50,
    "DateLastStatusUpdate": "2019-07-01T05:35:00Z",
    "DataQualityLevel": 1,
    "DateCreated": "2019-06-29T20:56:00Z",
    "SubmissionStatusTypeID": 200
}