{
    "IsRecentlyVerified": false,
    "ID": 183982,
    "UUID": "4336967E-E97E-4A4E-A862-F145FD850E9B",
    "DataProviderID": 29,
    "DataProvidersReference": "16199",
    "AddressInfo": {
        "ID": 184341,
        "Title": "Weilheimer Str. 33",
        "AddressLine1": "Weilheimer Str. 33",
        "Town": "Pöcking",
        "Postcode": "82343",
        "CountryID": 87,
        "Latitude": 47.962543,
        "Longitude": 11.291013,
        "DistanceUnit": 0
    },
    "Connections": [
        {
            "ID": 291642,
            "ConnectionTypeID": 25,
            "StatusTypeID": 50,
            "LevelID": 2,
            "PowerKW": 22,
            "CurrentTypeID": 20
        },
        {
            "ID": 291643,
            "ConnectionTypeID": 25,
            "StatusTypeID": 50,
            "LevelID": 2,
            "PowerKW": 22,
            "CurrentTypeID": 20
        }
    ],
    "StatusTypeID": 50,
    "DateLastStatusUpdate": "2021-07-12T02:40:00Z",
    "MetadataValues": [
        {
            "ID": 16275,
            "MetadataFieldID": 4,
            "ItemValue": "Data from the German chargepoint registry provided by Bundesnetzagentur.de under the CC-BY 4.0 license"
        }
    ],
    "DataQualityLevel": 3,
    "DateCreated": "2021-07-08T10:04:00Z",
    "SubmissionStatusTypeID": 100
}