{
    "IsRecentlyVerified": false,
    "ID": 35403,
    "UUID": "2AEECB14-F72B-4547-920C-D7CEFCF9EED7",
    "DataProviderID": 26,
    "DataProvidersReference": "57914",
    "OperatorID": 180,
    "OperatorsReference": "Alfen RHL07052",
    "UsageCost": "0.00 jaarabonnement",
    "AddressInfo": {
        "ID": 35749,
        "Title": "Dr H. Colijnlaan 430",
        "AddressLine1": "Dr H. Colijnlaan 430",
        "Town": "Rijswijk",
        "Postcode": "2283 ZC",
        "CountryID": 159,
        "Latitude": 52.040361,
        "Longitude": 4.319913,
        "ContactTelephone1": "036 - 549 34 00",
        "RelatedURL": "http://www.icu-charging-stations.com/",
        "DistanceUnit": 0
    },
    "Connections": [
        {
            "ID": 38914,
            "ConnectionTypeID": 25,
            "LevelID": 2,
            "PowerKW": 11,
            "CurrentTypeID": 10
        },
        {
            "ID": 47846,
            "ConnectionTypeID": 25,
            "LevelID": 2,
            "PowerKW": 11,
            "CurrentTypeID": 10
        }
    ],
    "NumberOfPoints": 1,
    "StatusTypeID": 50,
    "DateLastStatusUpdate": "2016-06-04T02:44:00Z",
    "DataQualityLevel": 3,
    "DateCreated": "2015-01-09T06:04:00Z",
    "SubmissionStatusTypeID": 100
}