{
    "IsRecentlyVerified": false,
    "ID": 122116,
    "UUID": "67A87DB6-BCC4-4025-AA4B-810CEAEA10C6",
    "DataProviderID": 2,
    "DataProvidersReference": "117221",
    "OperatorID": 5,
    "UsageTypeID": 1,
    "AddressInfo": {
        "ID": 122462,
        "Title": "ONE CULVER",
        "AddressLine1": "10000 Washington Blvd",
        "Town": "Culver City",
        "StateOrProvince": "CA",
        "Postcode": "90232",
        "CountryID": 2,
        "Latitude": 34.020683,
        "Longitude": -118.39779,
        "ContactTelephone1": "888-758-4389",
        "AccessComments": "24 hours daily",
        "RelatedURL": "http://www.chargepoint.com/",
        "DistanceUnit": 0
    },
    "Connections": [
        {
            "ID": 171978,
            "ConnectionTypeID": 1,
            "LevelID": 2,
            "Amps": 16,
            "Voltage": 230,
            "PowerKW": 3,
            "CurrentTypeID": 10,
            "Quantity": 10
        }
    ],
    "DateLastStatusUpdate": "2019-12-24T09:11:00Z",
    "DataQualityLevel": 3,
    "DateCreated": "2019-04-06T05:02:00Z",
    "SubmissionStatusTypeID": 100
}