{
    "IsRecentlyVerified": false,
    "ID": 172545,
    "UUID": "1869785C-840F-4A2D-AD72-624E0037DF7C",
    "DataProviderID": 1,
    "OperatorID": 38,
    "UsageTypeID": 1,
    "UsageCost": "Free",
    "AddressInfo": {
        "ID": 172904,
        "Title": "Lidl Covasna",
        "AddressLine1": "Covasna 525200",
        "Town": "Covasna",
        "StateOrProvince": "Covasna",
        "CountryID": 184,
        "Latitude": 45.848264325675984,
        "Longitude": 26.169999176396686,
        "DistanceUnit": 0
    },
    "Connections": [
        {
            "ID": 263821,
            "ConnectionTypeID": 25,
            "StatusTypeID": 50,
            "LevelID": 2,
            "PowerKW": 22,
            "CurrentTypeID": 20,
            "Quantity": 2
        }
    ],
    "NumberOfPoints": 2,
    "StatusTypeID": 50,
    "DateLastStatusUpdate": "2021-02-07T18:53:00Z",
    "DataQualityLevel": 1,
    "DateCreated": "2021-02-07T13:45:00Z",
    "SubmissionStatusTypeID": 200
}