{
    "IsRecentlyVerified": false,
    "ID": 155680,
    "UUID": "BF9C3AD7-0B05-41B5-82C9-193845807141",
    "DataProviderID": 1,
    "OperatorID": 3372,
    "UsageTypeID": 1,
    "UsageCost": "per EV Connect App",
    "AddressInfo": {
        "ID": 156034,
        "Title": "Libby’s Café",
        "AddressLine1": "111 North Main Street",
        "Town": "Goldsby",
        "StateOrProvince": "OK",
        "Postcode": "73093",
        "CountryID": 2,
        "Latitude": 35.146416065827154,
        "Longitude": -97.47645607870913,
        "ContactTelephone1": "+1 866-816-7584",
        "DistanceUnit": 0
    },
    "Connections": [
        {
            "ID": 219219,
            "ConnectionTypeID": 32,
            "StatusTypeID": 50,
            "LevelID": 3,
            "PowerKW": 50,
            "CurrentTypeID": 30,
            "Quantity": 2,
            "Comments": "ABB 50kW"
        },
        {
            "ID": 219220,
            "ConnectionTypeID": 2,
            "StatusTypeID": 50,
            "LevelID": 3,
            "PowerKW": 50,
            "CurrentTypeID": 30,
            "Quantity": 2,
            "Comments": "ABB 50kW"
        }
    ],
    "NumberOfPoints": 2,
    "StatusTypeID": 50,
    "DateLastStatusUpdate": "2020-04-21T17:36:00Z",
    "DataQualityLevel": 1,
    "DateCreated": "2020-04-21T04:15:00Z",
    "SubmissionStatusTypeID": 200
}