{
    "MediaItems": [
        {
            "ID": 25889,
            "ChargePointID": 149921,
            "ItemURL": "https://s3-ap-southeast-2.amazonaws.com/openchargemap/images/SE/OCM149921/OCM-149921.orig.2020122116173779.jpg",
            "ItemThumbnailURL": "https://s3-ap-southeast-2.amazonaws.com/openchargemap/images/SE/OCM149921/OCM-149921.thmb.2020122116173779.jpg",
            "Comment": "",
            "IsEnabled": true,
            "IsVideo": false,
            "IsFeaturedItem": false,
            "IsExternalResource": false,
            "User": {
                "ID": 28876,
                "Username": "Ronny Karlsson"
            },
            "DateCreated": "2020-12-21T16:18:00Z"
        }
    ],
    "IsRecentlyVerified": false,
    "ID": 149921,
    "UUID": "B406AAEC-31F0-466A-B612-F433647413A7",
    "DataProviderID": 1,
    "DataProvidersReference": "163",
    "OperatorID": 3299,
    "UsageTypeID": 1,
    "AddressInfo": {
        "ID": 150274,
        "Title": "IONITY Sundsvall",
        "AddressLine1": "Kemivägen 3",
        "Town": "Sundsvall",
        "Postcode": "854 67",
        "CountryID": 216,
        "Latitude": 62.33874,
        "Longitude": 17.3538,
        "DistanceUnit": 0
    },
    "Connections": [
        {
            "ID": 208150,
            "ConnectionTypeID": 33,
            "LevelID": 3,
            "PowerKW": 350,
            "CurrentTypeID": 30
        }
    ],
    "NumberOfPoints": 4,
    "StatusTypeID": 50,
    "DateLastStatusUpdate": "2020-12-22T09:43:00Z",
    "DataQualityLevel": 3,
    "DateCreated": "2020-03-09T06:29:00Z",
    "SubmissionStatusTypeID": 200
}