{
    "IsRecentlyVerified": false,
    "ID": 175152,
    "UUID": "7F1D3BC7-8E2B-4218-B64C-E1E2E4F3FD04",
    "DataProviderID": 1,
    "OperatorID": 3,
    "OperatorsReference": "PG-86127,PG-70437",
    "UsageTypeID": 4,
    "UsageCost": "Free",
    "AddressInfo": {
        "ID": 175511,
        "Title": "Tesco Extra Telford",
        "AddressLine1": "Wrenkin Retail Park",
        "AddressLine2": "Wellington",
        "Town": "Wellington",
        "StateOrProvince": "England",
        "Postcode": "TF1 2DE",
        "CountryID": 1,
        "Latitude": 52.68960347026808,
        "Longitude": -2.4918664903032095,
        "ContactTelephone1": "+44 20 7247 4114",
        "RelatedURL": "https://charge.pod-point.com/",
        "DistanceUnit": 0
    },
    "Connections": [
        {
            "ID": 271511,
            "ConnectionTypeID": 25,
            "Reference": "PG-86115",
            "StatusTypeID": 50,
            "LevelID": 2,
            "Amps": 32,
            "Voltage": 230,
            "PowerKW": 7,
            "CurrentTypeID": 10,
            "Quantity": 2
        },
        {
            "ID": 271512,
            "ConnectionTypeID": 25,
            "Reference": "PG-86127",
            "StatusTypeID": 50,
            "LevelID": 2,
            "PowerKW": 22,
            "CurrentTypeID": 20,
            "Quantity": 2
        }
    ],
    "NumberOfPoints": 1,
    "GeneralComments": "Type 2 free, use Pod Point app or webpage charge.pod-point.com to confirm charge within 15 mins",
    "StatusTypeID": 50,
    "DateLastStatusUpdate": "2021-05-12T20:45:00Z",
    "DataQualityLevel": 1,
    "DateCreated": "2021-04-28T17:41:00Z",
    "SubmissionStatusTypeID": 200
}