{
    "IsRecentlyVerified": false,
    "ID": 41854,
    "UUID": "425359DF-45CC-403C-B924-3BC572014A2B",
    "DataProviderID": 1,
    "OperatorID": 44,
    "UsageTypeID": 5,
    "UsageCost": "0,25€/kWh Spende",
    "AddressInfo": {
        "ID": 42200,
        "Title": "Crowdfunding Box Bad Fallingbostel",
        "AddressLine1": "Adolf-Kolping-Weg 6 ",
        "AddressLine2": "",
        "Town": "Bad Fallingbostel",
        "StateOrProvince": "",
        "Postcode": "29664",
        "CountryID": 87,
        "Latitude": 52.8770683981785,
        "Longitude": 9.7004354153413,
        "ContactTelephone1": "",
        "ContactTelephone2": "+49 5162 2480",
        "ContactEmail": "",
        "AccessComments": "Zufahrt über Sackgasse, am Ende ist ein Haus mit Holzverkleidung des 1.OG und Carport auf linker Seite. Spende bitte in Briefkasten oder per Paypal QR Code. Ladepunkt ist ohne Ladekarte/Schlüssel durchgehend nutzbar.",
        "RelatedURL": "",
        "DistanceUnit": 0
    },
    "Connections": [
        {
            "ID": 50165,
            "ConnectionTypeID": 16,
            "StatusTypeID": 50,
            "LevelID": 2,
            "Amps": 16,
            "Voltage": 230,
            "PowerKW": 3.7,
            "CurrentTypeID": 10,
            "Quantity": 2
        },
        {
            "ID": 50166,
            "ConnectionTypeID": 17,
            "StatusTypeID": 50,
            "LevelID": 2,
            "Amps": 32,
            "Voltage": 400,
            "PowerKW": 22,
            "CurrentTypeID": 20,
            "Quantity": 1
        },
        {
            "ID": 55167,
            "ConnectionTypeID": 1036,
            "StatusTypeID": 50,
            "LevelID": 3,
            "Amps": 63,
            "Voltage": 400,
            "PowerKW": 43,
            "CurrentTypeID": 20,
            "Quantity": 1
        }
    ],
    "NumberOfPoints": 1,
    "GeneralComments": "Anschlußbelastung zur Zeit max. 50A insgesamt für alle Anschlüsse, Erweiterung auf 63A in Arbeit...Technik arbeitet mit OpenEVSE und wurde als Crowdfunding von Mitgliedern des goingelectric.de Forums erbaut.",
    "StatusTypeID": 50,
    "DateLastStatusUpdate": "2016-10-28T05:13:00Z",
    "DataQualityLevel": 1,
    "DateCreated": "2015-02-13T12:58:00Z",
    "SubmissionStatusTypeID": 200
}