{
    "IsRecentlyVerified": false,
    "ID": 166521,
    "UUID": "01AA3442-14F1-4DF3-8DE5-EC45E8666CD0",
    "DataProviderID": 28,
    "DataProvidersReference": "FR*S28*PSDE28*CDCP1",
    "UsageTypeID": 5,
    "AddressInfo": {
        "ID": 166880,
        "Title": "Nogent-le-Rotrou | Rue du Château",
        "AddressLine1": "Rue du Château 28400 Nogent-le-Rotrou",
        "CountryID": 80,
        "Latitude": 48.31977,
        "Longitude": 0.822642,
        "AccessComments": "24/24 7/7",
        "DistanceUnit": 0
    },
    "Connections": [
        {
            "ID": 249102,
            "ConnectionTypeID": 26,
            "StatusTypeID": 50,
            "LevelID": 2,
            "PowerKW": 22
        },
        {
            "ID": 249103,
            "ConnectionTypeID": 28,
            "StatusTypeID": 50,
            "LevelID": 2,
            "PowerKW": 22,
            "CurrentTypeID": 10
        },
        {
            "ID": 249104,
            "ConnectionTypeID": 1036,
            "StatusTypeID": 50,
            "LevelID": 2,
            "PowerKW": 22,
            "CurrentTypeID": 20
        }
    ],
    "GeneralComments": "",
    "StatusTypeID": 50,
    "DateLastStatusUpdate": "2020-08-27T05:14:00Z",
    "DataQualityLevel": 2,
    "DateCreated": "2020-08-27T05:14:00Z",
    "SubmissionStatusTypeID": 100
}