{
    "IsRecentlyVerified": false,
    "ID": 29458,
    "UUID": "304D5D4A-4933-4D72-8EDB-FA244AEDC9AB",
    "DataProviderID": 2,
    "DataProvidersReference": "63828",
    "OperatorID": 39,
    "UsageTypeID": 4,
    "AddressInfo": {
        "ID": 29804,
        "Title": "Array Apartments",
        "AddressLine1": "14027 Lake City Way NE",
        "Town": "Seattle",
        "StateOrProvince": "WA",
        "Postcode": "98125",
        "CountryID": 2,
        "Latitude": 47.731273,
        "Longitude": -122.293062,
        "ContactTelephone1": "800-663-5633",
        "AccessComments": "MO: 09:00am-06:00pm; TU: 09:00am-06:00pm; WE: 09:00am-06:00pm; TH: 09:00am-06:00pm; FR: 09:00am-06:00pm; SA: 09:00am-06:00pm; SU: Closed",
        "RelatedURL": "http://www.semacharge.com/",
        "DistanceUnit": 0
    },
    "Connections": [
        {
            "ID": 32398,
            "ConnectionTypeID": 1,
            "LevelID": 2,
            "Amps": 16,
            "Voltage": 230,
            "PowerKW": 3,
            "CurrentTypeID": 10,
            "Quantity": 1
        }
    ],
    "DateLastStatusUpdate": "2019-04-06T05:07:00Z",
    "DataQualityLevel": 3,
    "DateCreated": "2014-11-28T03:39:00Z",
    "SubmissionStatusTypeID": 100
}