{
    "UserComments": [
        {
            "ID": 23803,
            "ChargePointID": 172192,
            "CommentTypeID": 10,
            "UserName": "ForumElettrico.it",
            "Comment": "Nel piccolo parcheggio vicino al Teatro, una tipo 3A ed una tipo 2 da 22 kW. Leggi la recensione completa qui > https://www.forumelettrico.it/forum/colonnine-enelx-a-viterbo-citta-via-cassia-incrocio-via-fratelli-roselli-t9374.html",
            "RelatedURL": "https://www.forumelettrico.it/forum/colonnine-enelx-a-viterbo-citta-via-cassia-incrocio-via-fratelli-roselli-t9374.html",
            "DateCreated": "2021-01-20T16:41:32.903Z",
            "User": {
                "ID": 11749,
                "Username": "ForumElettrico.it"
            },
            "CheckinStatusTypeID": 140,
            "IsActionedByEditor": false
        }
    ],
    "MediaItems": [
        {
            "ID": 26240,
            "ChargePointID": 172192,
            "ItemURL": "https://s3-ap-southeast-2.amazonaws.com/openchargemap/images/IT/OCM172192/OCM-172192.orig.2021012016414222.jpg",
            "ItemThumbnailURL": "https://s3-ap-southeast-2.amazonaws.com/openchargemap/images/IT/OCM172192/OCM-172192.thmb.2021012016414222.jpg",
            "Comment": "",
            "IsEnabled": true,
            "IsVideo": false,
            "IsFeaturedItem": false,
            "IsExternalResource": false,
            "User": {
                "ID": 11749,
                "Username": "ForumElettrico.it"
            },
            "DateCreated": "2021-01-20T16:42:00Z"
        }
    ],
    "IsRecentlyVerified": false,
    "ID": 172192,
    "UUID": "E91F6417-B4ED-4AF0-8998-CD6DCE907157",
    "DataProviderID": 1,
    "OperatorID": 80,
    "UsageTypeID": 4,
    "AddressInfo": {
        "ID": 172551,
        "Title": "Viterbo Rosselli | EnelX",
        "AddressLine1": "Parcheggio Via Fratelli Rosselli 1 angolo SP6",
        "AddressLine2": "Ingresso da Via Zelli Pazzaglia",
        "Town": "Viterbo",
        "StateOrProvince": "VT",
        "Postcode": "01100",
        "CountryID": 112,
        "Latitude": 42.421688,
        "Longitude": 12.109457,
        "RelatedURL": "https://www.forumelettrico.it/forum/colonnine-enelx-a-viterbo-citta-via-cassia-incrocio-via-fratelli-roselli-t9374.html",
        "DistanceUnit": 0
    },
    "Connections": [
        {
            "ID": 263195,
            "ConnectionTypeID": 25,
            "StatusTypeID": 30,
            "LevelID": 2,
            "Amps": 32,
            "Voltage": 400,
            "PowerKW": 22,
            "CurrentTypeID": 20,
            "Quantity": 1
        },
        {
            "ID": 263196,
            "ConnectionTypeID": 36,
            "StatusTypeID": 30,
            "LevelID": 2,
            "Amps": 16,
            "Voltage": 240,
            "PowerKW": 3,
            "CurrentTypeID": 10,
            "Quantity": 1
        }
    ],
    "NumberOfPoints": 2,
    "StatusTypeID": 30,
    "DateLastStatusUpdate": "2021-01-27T13:39:00Z",
    "DataQualityLevel": 1,
    "DateCreated": "2021-01-20T16:41:00Z",
    "SubmissionStatusTypeID": 200
}