{
    "IsRecentlyVerified": false,
    "ID": 71104,
    "UUID": "806CD8B4-BA18-4724-9C10-4C4F5FAEFEA3",
    "DataProviderID": 1,
    "OperatorID": 44,
    "UsageTypeID": 3,
    "AddressInfo": {
        "ID": 71450,
        "Title": "Laedpunkt Heierngasse",
        "AddressLine1": "Heierngasse 28a",
        "Town": "Otzberg",
        "StateOrProvince": "Landkreis Darmstadt-Dieburg",
        "Postcode": "64853",
        "CountryID": 87,
        "Latitude": 49.83665999999999,
        "Longitude": 8.908260000000041,
        "ContactTelephone1": "+49 6162-915856",
        "AccessComments": "24/7 nutzbar nach Anmeldung. Blauer Stromverteiler links vom Gartenhaus an der Treppe. Laden für Pedelecs/E-Bikes, Twizy, City-ELs.",
        "DistanceUnit": 0
    },
    "Connections": [
        {
            "ID": 101888,
            "ConnectionTypeID": 28,
            "StatusTypeID": 50,
            "LevelID": 2,
            "Amps": 16,
            "Voltage": 230,
            "PowerKW": 3.7,
            "CurrentTypeID": 10,
            "Quantity": 4
        }
    ],
    "NumberOfPoints": 4,
    "GeneralComments": "Es sind vier Dosen, jedoch nur insgesamt mit 16A belastbar! Eigene Solar-Anlage!",
    "StatusTypeID": 50,
    "DateLastStatusUpdate": "2016-08-29T06:20:00Z",
    "DataQualityLevel": 1,
    "DateCreated": "2016-08-29T06:20:00Z",
    "SubmissionStatusTypeID": 200
}