{
    "UserComments": [
        {
            "ID": 24593,
            "ChargePointID": 52563,
            "CommentTypeID": 1000,
            "UserName": "MarkRot",
            "Comment": "The charging station is permanently out of order",
            "DateCreated": "2021-07-15T14:10:13.05Z",
            "User": {
                "ID": 33367,
                "Username": "MarkRot"
            },
            "CheckinStatusTypeID": 160,
            "IsActionedByEditor": false
        }
    ],
    "IsRecentlyVerified": false,
    "ID": 52563,
    "UUID": "1414ADEE-CDCB-4206-A277-BE6E1BFA8E9B",
    "DataProviderID": 1,
    "OperatorID": 1,
    "UsageTypeID": 1,
    "AddressInfo": {
        "ID": 52909,
        "Title": "Freudenstädter Straße",
        "AddressLine1": "Freudenstädter Straße 12",
        "Town": "Baiersbronn",
        "StateOrProvince": "Landkreis Freudenstadt",
        "Postcode": "72270",
        "CountryID": 87,
        "Latitude": 48.5086321,
        "Longitude": 8.37045820000003,
        "ContactTelephone1": "+49 7442842340",
        "AccessComments": "Graublaue Ladesäule  zwischen Straße und Parkplatz. Kostenloses Laden 24/7, mit beliebiger Ladekarte freischaltbar. Betreiber sind die Gemeindewerke Baiersbronn",
        "RelatedURL": "http://www.gemeindewerke-baiersbronn.de/",
        "DistanceUnit": 0
    },
    "Connections": [
        {
            "ID": 65282,
            "ConnectionTypeID": 25,
            "StatusTypeID": 50,
            "LevelID": 2,
            "Amps": 32,
            "Voltage": 400,
            "PowerKW": 22,
            "CurrentTypeID": 20,
            "Quantity": 2
        },
        {
            "ID": 65283,
            "ConnectionTypeID": 28,
            "StatusTypeID": 50,
            "LevelID": 2,
            "Amps": 16,
            "Voltage": 230,
            "PowerKW": 3.7,
            "CurrentTypeID": 10,
            "Quantity": 2
        }
    ],
    "NumberOfPoints": 2,
    "StatusTypeID": 50,
    "DateLastStatusUpdate": "2021-07-15T14:10:00Z",
    "DataQualityLevel": 1,
    "DateCreated": "2015-09-03T11:31:00Z",
    "SubmissionStatusTypeID": 200
}