{
    "IsRecentlyVerified": false,
    "ID": 17574,
    "UUID": "94F4651E-63EA-42A4-A040-85C7C0058963",
    "DataProviderID": 22,
    "DataProvidersReference": "106D6A60386B448F80D401758C203F54",
    "AddressInfo": {
        "ID": 17919,
        "Title": "コクワエナジー牧港ＳＳ",
        "AddressLine1": "沖縄県浦添市牧港5丁目3-7",
        "CountryID": 114,
        "Latitude": 26.26758162,
        "Longitude": 127.7169331,
        "ContactTelephone1": "098-860-1181",
        "DistanceUnit": 0
    },
    "Connections": [
        {
            "ID": 17815,
            "ConnectionTypeID": 2,
            "LevelID": 2,
            "Amps": 100,
            "Voltage": 480,
            "PowerKW": 48,
            "Quantity": 1
        }
    ],
    "DateLastStatusUpdate": "2013-06-29T09:00:00Z",
    "DataQualityLevel": 2,
    "DateCreated": "2013-06-29T09:00:00Z",
    "SubmissionStatusTypeID": 200
}