{
    "IsRecentlyVerified": false,
    "ID": 131821,
    "UUID": "871703F1-DBD3-41E1-97A4-BB43A652EADA",
    "DataProviderID": 1,
    "OperatorID": 80,
    "UsageTypeID": 4,
    "AddressInfo": {
        "ID": 132167,
        "Title": "Roma Zaccagnini | EnelX",
        "AddressLine1": "Via Carlo Zaccagnini, 79",
        "Town": "Roma",
        "StateOrProvince": "RM",
        "Postcode": "00128",
        "CountryID": 112,
        "Latitude": 41.79293006296524,
        "Longitude": 12.448279279351368,
        "ContactTelephone1": "800.069.850",
        "RelatedURL": "https://www.enelx.com/it/it/emobility",
        "DistanceUnit": 0
    },
    "Connections": [
        {
            "ID": 184479,
            "ConnectionTypeID": 25,
            "StatusTypeID": 50,
            "LevelID": 2,
            "Amps": 32,
            "Voltage": 400,
            "PowerKW": 22,
            "CurrentTypeID": 20,
            "Quantity": 2
        },
        {
            "ID": 184480,
            "ConnectionTypeID": 36,
            "StatusTypeID": 50,
            "LevelID": 2,
            "Amps": 16,
            "Voltage": 240,
            "PowerKW": 3.7,
            "CurrentTypeID": 10,
            "Quantity": 2
        }
    ],
    "NumberOfPoints": 4,
    "StatusTypeID": 50,
    "DateLastStatusUpdate": "2019-09-13T10:24:00Z",
    "DataQualityLevel": 1,
    "DateCreated": "2019-09-13T10:24:00Z",
    "SubmissionStatusTypeID": 200
}