{
    "UserComments": [
        {
            "ID": 17614,
            "ChargePointID": 31980,
            "CommentTypeID": 10,
            "UserName": "HybridStutensee",
            "Comment": "Charging via Intercharge / Novofleet RFID card worked without any problem.",
            "Rating": 4,
            "DateCreated": "2017-08-20T16:51:23.843Z",
            "User": {
                "ID": 15747,
                "Username": "HybridStutensee"
            },
            "CheckinStatusTypeID": 10
        }
    ],
    "IsRecentlyVerified": false,
    "ID": 31980,
    "UUID": "031ADFE4-7511-41C5-B322-E2D0F3A75249",
    "DataProviderID": 1,
    "OperatorID": 86,
    "OperatorsReference": "EnWB Campus Süd (gegenüber)",
    "UsageTypeID": 4,
    "AddressInfo": {
        "ID": 32326,
        "Title": "Uni Campus Süd",
        "AddressLine1": "Hertzstraße 16",
        "Town": "Karlsruhe",
        "Postcode": "76187",
        "CountryID": 87,
        "Latitude": 49.021181889989066,
        "Longitude": 8.365536513877808,
        "ContactTelephone1": "+49 800 3629001",
        "ContactTelephone2": "+49 800 3629477",
        "AccessComments": "Mehr schräg gegenüber vom Campus auf einem öffentlichen Parkplatz, der entsprechend für Elektrofahrzeuge reserviert ist. Zwischen der Einmündung Karlsruher Weg / Hertzstr. und der Einmündung Campus/Hertzstr.\r\n",
        "RelatedURL": "http://www.enbw.com/emobilitaet",
        "DistanceUnit": 0
    },
    "Connections": [
        {
            "ID": 35491,
            "ConnectionTypeID": 25,
            "StatusTypeID": 50,
            "LevelID": 2,
            "Amps": 32,
            "Voltage": 400,
            "PowerKW": 22,
            "CurrentTypeID": 20,
            "Quantity": 2
        }
    ],
    "NumberOfPoints": 2,
    "GeneralComments": "Ladesäule oft defekt, Störungsnummer unter Weitere Kontakt Telefonnummer.",
    "StatusTypeID": 50,
    "DateLastStatusUpdate": "2017-08-20T17:02:00Z",
    "DataQualityLevel": 3,
    "DateCreated": "2015-01-09T06:03:00Z",
    "SubmissionStatusTypeID": 200
}