{
    "IsRecentlyVerified": false,
    "ID": 17637,
    "UUID": "DCA95659-258F-4F9B-99DA-683BEBD3A920",
    "DataProviderID": 22,
    "DataProvidersReference": "980017891FF67CF8A20F23AA810E7B5A",
    "AddressInfo": {
        "ID": 17982,
        "Title": "道の駅しもつけ",
        "AddressLine1": "栃木県下野市薬師寺41",
        "CountryID": 114,
        "Latitude": 36.39646631,
        "Longitude": 139.8838257,
        "ContactTelephone1": "0285-38-6631",
        "DistanceUnit": 0
    },
    "Connections": [
        {
            "ID": 17878,
            "ConnectionTypeID": 2,
            "LevelID": 2,
            "Amps": 100,
            "Voltage": 480,
            "PowerKW": 48,
            "Quantity": 1
        }
    ],
    "DateLastStatusUpdate": "2013-06-29T09:01:00Z",
    "DataQualityLevel": 2,
    "DateCreated": "2013-06-29T09:01:00Z",
    "SubmissionStatusTypeID": 200
}