{
    "UserComments": [
        {
            "ID": 14483,
            "ChargePointID": 43397,
            "CommentTypeID": 10,
            "UserName": "Simon Hewison",
            "Comment": "This charge point (formerly on Source East / Chargemaster) has been replaced with an evolt charger on Chargepoint Genie.",
            "DateCreated": "2016-10-29T19:21:24.177Z",
            "User": {
                "ID": 4575,
                "Username": "Simon Hewison"
            },
            "CheckinStatusTypeID": 0
        },
        {
            "ID": 6460,
            "ChargePointID": 43397,
            "CommentTypeID": 1000,
            "UserName": "Jason Hockley",
            "Comment": "There was a car charging there already when I arrived, so I parked in the other space. Every time I presented my card, it tried to tell me to disconnect the other car despite there being another 7kw socket available.",
            "Rating": 1,
            "DateCreated": "2015-09-10T13:38:08.693Z",
            "User": {
                "ID": 6275,
                "Username": "Jason Hockley"
            },
            "CheckinStatusTypeID": 25
        },
        {
            "ID": 4103,
            "ChargePointID": 43397,
            "CommentTypeID": 50,
            "UserName": "Simon Hewison",
            "Comment": "One bay is reserved to e-car club, the other bay was also used by another e-car club vehicle, which supposedly is \"homed\" at Watford Town Hall car park, where there is no charge point.\nCharging had finished on both e-car club vehicles, but their cables were locked into the post, and even if they weren't, you'd have to park in a disabled bay for your cable to reach.\nDo not arrive here expecting the chargepoint to be available without first checking the Polar Instant live availability https://www.polarinstant.com/map",
            "Rating": 2,
            "DateCreated": "2015-03-29T21:30:14.633Z",
            "User": {
                "ID": 4575,
                "Username": "Simon Hewison"
            },
            "CheckinStatusTypeID": 100
        }
    ],
    "MediaItems": [
        {
            "ID": 3530,
            "ChargePointID": 43397,
            "ItemURL": "https://s3-ap-southeast-2.amazonaws.com/openchargemap/images/GB/OCM43397/OCM-43397.orig.2015112812380545.jpg",
            "ItemThumbnailURL": "https://s3-ap-southeast-2.amazonaws.com/openchargemap/images/GB/OCM43397/OCM-43397.thmb.2015112812380545.jpg",
            "Comment": "",
            "IsEnabled": true,
            "IsVideo": false,
            "IsFeaturedItem": false,
            "IsExternalResource": false,
            "User": {
                "ID": 4938,
                "Username": "Richard Butler "
            },
            "DateCreated": "2015-11-28T12:38:00Z"
        }
    ],
    "IsRecentlyVerified": false,
    "ID": 43397,
    "UUID": "40CF2F01-C222-470A-85AC-2E2D173C453D",
    "DataProviderID": 1,
    "OperatorID": 150,
    "OperatorsReference": "The Avenue Car Park",
    "UsageTypeID": 4,
    "UsageCost": "Â£0.50 + Â£0.30/kWh. Parking fees apply",
    "AddressInfo": {
        "ID": 43743,
        "Title": "The Avenue Car Park",
        "AddressLine1": "Hempstead Road",
        "Town": "Watford",
        "StateOrProvince": "Hertfordshire",
        "Postcode": "WD17 3EX",
        "CountryID": 1,
        "Latitude": 51.6606404183899,
        "Longitude": -0.404182076454163,
        "ContactTelephone1": "+44 1908 265265 Watford Car Parks",
        "AccessComments": "two bays. one reserved for e-Car club. in practice,  often both bays in use by e-car club vehicles. Parking fees apply 7 days a week. 07:00-00:00",
        "RelatedURL": "http://www.watford.gov.uk/ccm/navigation/transport-and-streets/parking/car-parks/",
        "DistanceUnit": 0
    },
    "Connections": [
        {
            "ID": 52595,
            "ConnectionTypeID": 25,
            "StatusTypeID": 50,
            "LevelID": 2,
            "Amps": 32,
            "Voltage": 230,
            "PowerKW": 7,
            "CurrentTypeID": 10,
            "Quantity": 2
        }
    ],
    "NumberOfPoints": 2,
    "StatusTypeID": 0,
    "DateLastStatusUpdate": "2018-11-02T08:48:00Z",
    "DataQualityLevel": 1,
    "DateCreated": "2015-03-29T14:57:00Z",
    "SubmissionStatusTypeID": 200
}