{
    "IsRecentlyVerified": false,
    "ID": 63450,
    "UUID": "E462E25D-796D-42FE-8937-E9E3532A1272",
    "DataProviderID": 26,
    "DataProvidersReference": "77263",
    "OperatorID": 103,
    "OperatorsReference": "Allego NLALLEGO0005721",
    "UsageCost": "0.00 jaarabonnement",
    "AddressInfo": {
        "ID": 63796,
        "Title": "Poldermolen 1",
        "AddressLine1": "Poldermolen 1",
        "Town": "Houten",
        "Postcode": "3994 DD",
        "CountryID": 159,
        "Latitude": 52.0276047,
        "Longitude": 5.17552948,
        "ContactTelephone1": "0800-3745337",
        "RelatedURL": "http://www.allego.eu/",
        "DistanceUnit": 0
    },
    "Connections": [
        {
            "ID": 80918,
            "ConnectionTypeID": 25,
            "LevelID": 2,
            "PowerKW": 11,
            "CurrentTypeID": 10
        },
        {
            "ID": 80919,
            "ConnectionTypeID": 25,
            "LevelID": 2,
            "PowerKW": 11,
            "CurrentTypeID": 10
        }
    ],
    "NumberOfPoints": 1,
    "StatusTypeID": 50,
    "DateLastStatusUpdate": "2016-06-04T02:44:00Z",
    "DataQualityLevel": 3,
    "DateCreated": "2016-03-03T12:30:00Z",
    "SubmissionStatusTypeID": 100
}