{
    "UserComments": [
        {
            "ID": 19862,
            "ChargePointID": 107196,
            "CommentTypeID": 10,
            "UserName": "Someone_Just_",
            "Rating": 4,
            "DateCreated": "2018-07-22T19:40:24.287Z",
            "User": {
                "ID": 1107,
                "Username": "Someone_Just_"
            },
            "CheckinStatusTypeID": 140
        }
    ],
    "MediaItems": [
        {
            "ID": 15982,
            "ChargePointID": 107196,
            "ItemURL": "https://s3-ap-southeast-2.amazonaws.com/openchargemap/images/BE/OCM107196/OCM-107196.orig.2018072219413243.jpg",
            "ItemThumbnailURL": "https://s3-ap-southeast-2.amazonaws.com/openchargemap/images/BE/OCM107196/OCM-107196.thmb.2018072219413243.jpg",
            "Comment": "instructions",
            "IsEnabled": true,
            "IsVideo": false,
            "IsFeaturedItem": false,
            "IsExternalResource": false,
            "User": {
                "ID": 1107,
                "Username": "Someone_Just_"
            },
            "DateCreated": "2018-07-22T19:42:00Z"
        },
        {
            "ID": 15980,
            "ChargePointID": 107196,
            "ItemURL": "https://s3-ap-southeast-2.amazonaws.com/openchargemap/images/BE/OCM107196/OCM-107196.orig.2018072219394058.jpg",
            "ItemThumbnailURL": "https://s3-ap-southeast-2.amazonaws.com/openchargemap/images/BE/OCM107196/OCM-107196.thmb.2018072219394058.jpg",
            "Comment": "2 places for cars",
            "IsEnabled": true,
            "IsVideo": false,
            "IsFeaturedItem": false,
            "IsExternalResource": false,
            "User": {
                "ID": 1107,
                "Username": "Someone_Just_"
            },
            "DateCreated": "2018-07-22T19:40:00Z"
        }
    ],
    "IsRecentlyVerified": false,
    "ID": 107196,
    "UUID": "CD8BE5A7-BE52-46B3-9A10-A949FF830308",
    "DataProviderID": 1,
    "OperatorID": 36,
    "UsageTypeID": 1,
    "AddressInfo": {
        "ID": 107542,
        "Title": "Canadalaan 152 Antwerpen",
        "AddressLine1": "Canadalaan 152",
        "Town": "Antwerpen",
        "Postcode": "2000",
        "CountryID": 26,
        "Latitude": 51.24990804045626,
        "Longitude": 4.421972761953953,
        "DistanceUnit": 0
    },
    "Connections": [
        {
            "ID": 151174,
            "ConnectionTypeID": 25,
            "StatusTypeID": 50,
            "LevelID": 2,
            "Amps": 32,
            "Voltage": 400,
            "PowerKW": 22,
            "CurrentTypeID": 20,
            "Quantity": 2
        }
    ],
    "NumberOfPoints": 2,
    "StatusTypeID": 50,
    "DateLastStatusUpdate": "2018-07-22T19:42:00Z",
    "DataQualityLevel": 1,
    "DateCreated": "2018-07-22T19:39:00Z",
    "SubmissionStatusTypeID": 200
}