{
    "IsRecentlyVerified": false,
    "ID": 185987,
    "UUID": "969FB408-563E-4287-A6C0-0AA3D6F0D468",
    "DataProviderID": 29,
    "DataProvidersReference": "8488",
    "AddressInfo": {
        "ID": 186346,
        "Title": "Dr.-Georg-Schäfer-Straße 8",
        "AddressLine1": "Dr.-Georg-Schäfer-Straße 8",
        "Town": "Gerolzhofen",
        "Postcode": "97447",
        "CountryID": 87,
        "Latitude": 49.90576,
        "Longitude": 10.34495,
        "DistanceUnit": 0
    },
    "Connections": [
        {
            "ID": 297395,
            "ConnectionTypeID": 25,
            "StatusTypeID": 50,
            "LevelID": 2,
            "PowerKW": 22,
            "CurrentTypeID": 20
        },
        {
            "ID": 297396,
            "ConnectionTypeID": 25,
            "StatusTypeID": 50,
            "LevelID": 2,
            "PowerKW": 22,
            "CurrentTypeID": 20
        }
    ],
    "StatusTypeID": 50,
    "DateLastStatusUpdate": "2021-07-12T02:44:00Z",
    "MetadataValues": [
        {
            "ID": 18229,
            "MetadataFieldID": 4,
            "ItemValue": "Data from the German chargepoint registry provided by Bundesnetzagentur.de under the CC-BY 4.0 license"
        }
    ],
    "DataQualityLevel": 3,
    "DateCreated": "2021-07-12T02:44:00Z",
    "SubmissionStatusTypeID": 100
}