{
    "IsRecentlyVerified": false,
    "ID": 102700,
    "UUID": "6B40CAC7-2AAA-49C1-8683-D21E7A6FBC42",
    "DataProviderID": 2,
    "DataProvidersReference": "88367",
    "OperatorID": 39,
    "UsageTypeID": 1,
    "AddressInfo": {
        "ID": 103046,
        "Title": "District Wharf Parking Garage",
        "AddressLine1": "800 Maine Avenue Southwest",
        "Town": "Washington",
        "StateOrProvince": "DC",
        "Postcode": "20024",
        "CountryID": 2,
        "Latitude": 38.8781511,
        "Longitude": -77.0223675,
        "ContactTelephone1": "800-663-5633",
        "AccessComments": "MO: Not Specified; TU: Not Specified; WE: Not Specified; TH: Not Specified; FR: Not Specified; SA: Not Specified; SU: Not Specified",
        "RelatedURL": "http://www.semacharge.com/",
        "DistanceUnit": 0
    },
    "Connections": [
        {
            "ID": 144818,
            "ConnectionTypeID": 1,
            "LevelID": 2,
            "Amps": 16,
            "Voltage": 230,
            "PowerKW": 3,
            "CurrentTypeID": 10,
            "Quantity": 11
        }
    ],
    "DateLastStatusUpdate": "2019-04-06T05:04:00Z",
    "DataQualityLevel": 3,
    "DateCreated": "2018-04-21T04:13:00Z",
    "SubmissionStatusTypeID": 100
}