{
    "IsRecentlyVerified": false,
    "ID": 106367,
    "UUID": "EBFAF76E-98C0-4098-BB03-3E2D18542B1F",
    "DataProviderID": 1,
    "OperatorID": 105,
    "UsageTypeID": 4,
    "AddressInfo": {
        "ID": 106713,
        "Title": "Schwimmbad De Bütt",
        "AddressLine1": "Zum Schwimmbad 1",
        "Town": "Willich",
        "StateOrProvince": "Kreis Viersen",
        "Postcode": "47877",
        "CountryID": 87,
        "Latitude": 51.2603850442398,
        "Longitude": 6.546078215869102,
        "AccessComments": "24/7 nutzbare orange Ladesäule mit 2 markierten Parkplätzen davor.",
        "DistanceUnit": 0
    },
    "Connections": [
        {
            "ID": 149733,
            "ConnectionTypeID": 25,
            "StatusTypeID": 50,
            "LevelID": 2,
            "Amps": 32,
            "Voltage": 400,
            "PowerKW": 22,
            "CurrentTypeID": 20,
            "Quantity": 2
        }
    ],
    "NumberOfPoints": 2,
    "StatusTypeID": 50,
    "DateLastStatusUpdate": "2018-06-21T07:18:00Z",
    "DataQualityLevel": 1,
    "DateCreated": "2018-06-21T07:18:00Z",
    "SubmissionStatusTypeID": 200
}