{
    "IsRecentlyVerified": false,
    "ID": 187416,
    "UUID": "A5A30322-3A55-40A0-A075-92975987A634",
    "DataProviderID": 18,
    "DataProvidersReference": "185fb97cf60d29cc561a42817ec2f3b9",
    "OperatorID": 2244,
    "UsageTypeID": 5,
    "AddressInfo": {
        "ID": 187775,
        "Title": "19 York Road",
        "AddressLine1": "19 York Road",
        "Town": "London",
        "Postcode": "TW11 8SL",
        "CountryID": 1,
        "Latitude": -0.34457,
        "Longitude": 51.43157,
        "AccessComments": "",
        "RelatedURL": "https://www.ubitricity.com",
        "DistanceUnit": 0
    },
    "Connections": [
        {
            "ID": 302550,
            "ConnectionTypeID": 25,
            "Reference": "suby1100005345",
            "StatusTypeID": 50,
            "LevelID": 2,
            "Amps": 16,
            "Voltage": 230,
            "PowerKW": 3.7,
            "CurrentTypeID": 10
        }
    ],
    "StatusTypeID": 0,
    "DateLastStatusUpdate": "2021-07-12T03:38:00Z",
    "MetadataValues": [
        {
            "ID": 19656,
            "MetadataFieldID": 4,
            "ItemValue": "Contains public sector information licensed under the Open Government Licence v2.0. http://www.nationalarchives.gov.uk/doc/open-government-licence/version/2/"
        }
    ],
    "DataQualityLevel": 3,
    "DateCreated": "2021-07-12T03:38:00Z",
    "SubmissionStatusTypeID": 100
}