{
    "IsRecentlyVerified": false,
    "ID": 57071,
    "UUID": "6041FC48-227B-4E1A-86C3-714E56704C2F",
    "DataProviderID": 1,
    "OperatorID": 45,
    "UsageTypeID": 5,
    "AddressInfo": {
        "ID": 57417,
        "Title": "Parkhaus P20 Flughafen München",
        "AddressLine1": "Terminalstraße Mitte",
        "Town": "Oberding",
        "StateOrProvince": "Oberding (VGem)",
        "Postcode": "85356",
        "CountryID": 87,
        "Latitude": 48.35230232032456,
        "Longitude": 11.788300544982908,
        "ContactTelephone1": "+49 89 975-00",
        "AccessComments": "Im P20 auf Ebene 05 (Abflugebene). 24/7 geöffnet, 4€ pro Stunde Parkgebühren, die bei mehr als 20€ EInkauf erlassen werden, wenn man sich an der Info einen Gutschein holt. Achtung_ Nur die \"P-Charge\" Typ2 Buchsen haben Strom.",
        "RelatedURL": "http://www.munich-airport.de/de/consumer/anab/auto/parken/zusatzleistung/elektro/index.jsp",
        "DistanceUnit": 0
    },
    "Connections": [
        {
            "ID": 72105,
            "ConnectionTypeID": 25,
            "StatusTypeID": 50,
            "LevelID": 2,
            "Amps": 16,
            "Voltage": 400,
            "PowerKW": 11,
            "CurrentTypeID": 20,
            "Quantity": 3
        },
        {
            "ID": 72106,
            "ConnectionTypeID": 28,
            "StatusTypeID": 50,
            "LevelID": 2,
            "Amps": 16,
            "Voltage": 230,
            "PowerKW": 3.7,
            "CurrentTypeID": 10,
            "Quantity": 9
        }
    ],
    "NumberOfPoints": 12,
    "StatusTypeID": 50,
    "DateLastStatusUpdate": "2015-11-21T21:33:00Z",
    "DataQualityLevel": 1,
    "DateCreated": "2015-11-21T21:33:00Z",
    "SubmissionStatusTypeID": 200
}