{
    "IsRecentlyVerified": false,
    "ID": 14731,
    "UUID": "185A315F-B61B-43DC-B0DB-ABE47ECCCD59",
    "DataProviderID": 2,
    "DataProvidersReference": "49858",
    "UsageTypeID": 7,
    "AddressInfo": {
        "ID": 14628,
        "Title": "Lupient Nissan",
        "AddressLine1": "4642 Highway 52 N",
        "Town": "Rochester",
        "StateOrProvince": "MN",
        "Postcode": "55901",
        "CountryID": 2,
        "Latitude": 44.071507,
        "Longitude": -92.499454,
        "ContactTelephone1": "507-252-5577",
        "AccessComments": "Dealership business hours\r\nPublic - Call ahead",
        "RelatedURL": "",
        "DistanceUnit": 0
    },
    "Connections": [
        {
            "ID": 16805,
            "ConnectionTypeID": 1,
            "LevelID": 2,
            "Amps": 16,
            "Voltage": 230,
            "PowerKW": 3.7,
            "CurrentTypeID": 10,
            "Quantity": 1
        },
        {
            "ID": 21981,
            "ConnectionTypeID": 1,
            "LevelID": 2,
            "Quantity": 1
        }
    ],
    "DateLastStatusUpdate": "2020-06-26T03:07:00Z",
    "DataQualityLevel": 3,
    "DateCreated": "2012-12-06T16:50:00Z",
    "SubmissionStatusTypeID": 100
}