{
    "UserComments": [
        {
            "ID": 19366,
            "ChargePointID": 52227,
            "CommentTypeID": 10,
            "UserName": "GeoffT",
            "Comment": "Post recently reinstated after removal to make way for the new Orchard Centre Redevelopment.",
            "DateCreated": "2018-04-02T10:40:34.797Z",
            "User": {
                "ID": 18179,
                "Username": "GeoffT"
            },
            "CheckinStatusTypeID": 140
        }
    ],
    "MediaItems": [
        {
            "ID": 15229,
            "ChargePointID": 52227,
            "ItemURL": "https://s3-ap-southeast-2.amazonaws.com/openchargemap/images/GB/OCM52227/OCM-52227.orig.2018040210422728.jpg",
            "ItemThumbnailURL": "https://s3-ap-southeast-2.amazonaws.com/openchargemap/images/GB/OCM52227/OCM-52227.thmb.2018040210422728.jpg",
            "Comment": "In front of the Costa Cafe at the South Eastern corner of the Orchard Centre car park.",
            "IsEnabled": true,
            "IsVideo": false,
            "IsFeaturedItem": false,
            "IsExternalResource": false,
            "User": {
                "ID": 18179,
                "Username": "GeoffT"
            },
            "DateCreated": "2018-04-02T10:43:00Z"
        }
    ],
    "IsRecentlyVerified": false,
    "ID": 52227,
    "UUID": "8AF4E21C-7EC8-413E-8AFA-D2976563F443",
    "DataProviderID": 1,
    "OperatorID": 32,
    "OperatorsReference": "1296",
    "UsageTypeID": 4,
    "UsageCost": "£0.108/kWh; for Polar Plus subscription members only. £1.70 per hour for type 2",
    "AddressInfo": {
        "ID": 52573,
        "Title": "The Orchard Centre, Didcot",
        "AddressLine1": "Station Road",
        "Town": "Didcot",
        "StateOrProvince": "Oxfordshire",
        "Postcode": "OX11 7LL",
        "CountryID": 1,
        "Latitude": 51.607359088977,
        "Longitude": -1.2369353390643,
        "DistanceUnit": 0
    },
    "Connections": [
        {
            "ID": 64854,
            "ConnectionTypeID": 25,
            "StatusTypeID": 50,
            "LevelID": 2,
            "Amps": 32,
            "Voltage": 230,
            "PowerKW": 7,
            "CurrentTypeID": 10,
            "Quantity": 1
        },
        {
            "ID": 64855,
            "ConnectionTypeID": 3,
            "StatusTypeID": 50,
            "LevelID": 2,
            "Amps": 13,
            "Voltage": 230,
            "PowerKW": 3,
            "CurrentTypeID": 10,
            "Quantity": 1
        }
    ],
    "NumberOfPoints": 2,
    "StatusTypeID": 50,
    "DateLastStatusUpdate": "2019-04-24T05:19:00Z",
    "DataQualityLevel": 1,
    "DateCreated": "2015-08-25T10:56:00Z",
    "SubmissionStatusTypeID": 200
}