{
    "IsRecentlyVerified": false,
    "ID": 68057,
    "UUID": "0B027625-70E4-41BC-898C-DFCEB1EA75DC",
    "DataProviderID": 26,
    "DataProvidersReference": "92608",
    "OperatorID": 103,
    "OperatorsReference": "Allego NLALLEGO0009452",
    "UsageCost": "0.00 jaarabonnement",
    "AddressInfo": {
        "ID": 68403,
        "Title": "Valkenburgerlaan 40",
        "AddressLine1": "Valkenburgerlaan 40",
        "Town": "Alphen aan den Rijn",
        "Postcode": "2771 DA",
        "CountryID": 159,
        "Latitude": 52.0757907,
        "Longitude": 4.6692032,
        "ContactTelephone1": "0800-3745337",
        "RelatedURL": "http://www.allego.eu/",
        "DistanceUnit": 0
    },
    "Connections": [
        {
            "ID": 94768,
            "ConnectionTypeID": 25,
            "LevelID": 2,
            "PowerKW": 11,
            "CurrentTypeID": 10
        },
        {
            "ID": 94769,
            "ConnectionTypeID": 25,
            "LevelID": 2,
            "PowerKW": 11,
            "CurrentTypeID": 10
        }
    ],
    "NumberOfPoints": 1,
    "StatusTypeID": 50,
    "DateLastStatusUpdate": "2016-06-04T02:37:00Z",
    "DataQualityLevel": 3,
    "DateCreated": "2016-06-04T02:37:00Z",
    "SubmissionStatusTypeID": 100
}