{
    "IsRecentlyVerified": false,
    "ID": 73317,
    "UUID": "01037886-DD42-4375-BD71-D10B8FF3A3CF",
    "DataProviderID": 1,
    "OperatorID": 3,
    "OperatorsReference": "PG-80293",
    "UsageTypeID": 6,
    "UsageCost": "Free",
    "AddressInfo": {
        "ID": 73663,
        "Title": "Central Custody Suite ( Perry Bar )",
        "AddressLine1": "Holford Drive",
        "AddressLine2": "Digbeth",
        "Town": "Birmingham",
        "StateOrProvince": "England",
        "Postcode": "B42 2TU",
        "CountryID": 1,
        "Latitude": 52.4844193844677,
        "Longitude": -1.89292863425442,
        "AccessComments": "Behind barrier in police car park",
        "DistanceUnit": 0
    },
    "Connections": [
        {
            "ID": 105501,
            "ConnectionTypeID": 25,
            "StatusTypeID": 50,
            "LevelID": 2,
            "Amps": 32,
            "Voltage": 230,
            "PowerKW": 7,
            "CurrentTypeID": 10,
            "Quantity": 2
        }
    ],
    "NumberOfPoints": 4,
    "StatusTypeID": 50,
    "DateLastStatusUpdate": "2017-12-20T11:51:00Z",
    "DataQualityLevel": 1,
    "DateCreated": "2016-11-19T09:53:00Z",
    "SubmissionStatusTypeID": 200
}