{
    "IsRecentlyVerified": false,
    "ID": 29897,
    "UUID": "612C3763-B8E8-4298-8CEB-EABBDD810DD3",
    "DataProviderID": 15,
    "DataProvidersReference": "10911",
    "OperatorID": 5,
    "UsageTypeID": 1,
    "AddressInfo": {
        "ID": 30243,
        "Title": "10000 Bessie Coleman Dr",
        "AddressLine1": "10000 Bessie Coleman Dr",
        "Town": "Chicago",
        "StateOrProvince": "Illinois",
        "Postcode": "60666",
        "CountryID": 2,
        "Latitude": 41.9856367,
        "Longitude": -87.885092,
        "ContactTelephone1": "888-833-2148 ",
        "RelatedURL": "http://carstations.com/10911",
        "DistanceUnit": 0
    },
    "Connections": [
        {
            "ID": 32882,
            "ConnectionTypeID": 1,
            "Reference": "J1772",
            "LevelID": 2
        }
    ],
    "NumberOfPoints": 2,
    "StatusTypeID": 0,
    "DateLastStatusUpdate": "2017-11-04T14:04:00Z",
    "DataQualityLevel": 2,
    "DateCreated": "2014-11-29T05:39:00Z",
    "SubmissionStatusTypeID": 100
}