{
    "IsRecentlyVerified": false,
    "ID": 141549,
    "UUID": "E9342CF1-D64A-432E-92CF-43449DD27B2B",
    "DataProviderID": 2,
    "DataProvidersReference": "121771",
    "OperatorID": 3318,
    "UsageTypeID": 1,
    "AddressInfo": {
        "ID": 141901,
        "Title": "Target T1201 - Independence, MO",
        "AddressLine1": "17810 E 39th St",
        "Town": "Independence",
        "StateOrProvince": "MO",
        "Postcode": "64055",
        "CountryID": 2,
        "Latitude": 39.049541,
        "Longitude": -94.370211,
        "ContactTelephone1": "833-632-2778",
        "AccessComments": "24 hours daily",
        "RelatedURL": "https://www.electrifyamerica.com/",
        "DistanceUnit": 0
    },
    "Connections": [
        {
            "ID": 197497,
            "ConnectionTypeID": 2,
            "LevelID": 3,
            "Amps": 100,
            "Voltage": 400,
            "PowerKW": 40,
            "CurrentTypeID": 30,
            "Quantity": 1
        },
        {
            "ID": 197498,
            "ConnectionTypeID": 32,
            "LevelID": 3,
            "Amps": 100,
            "Voltage": 400,
            "PowerKW": 40,
            "CurrentTypeID": 30,
            "Quantity": 1
        }
    ],
    "StatusTypeID": 50,
    "DateLastStatusUpdate": "2020-06-26T03:01:00Z",
    "DataQualityLevel": 3,
    "DateCreated": "2019-12-24T09:15:00Z",
    "SubmissionStatusTypeID": 100
}