{
    "IsRecentlyVerified": false,
    "ID": 32905,
    "UUID": "D3592792-9CB8-4798-A70B-ECAF79F57D68",
    "DataProviderID": 26,
    "DataProvidersReference": "40519",
    "OperatorID": 157,
    "OperatorsReference": "NewMotion 02009434",
    "UsageCost": "0.00 jaarabonnement",
    "AddressInfo": {
        "ID": 33251,
        "Title": "Meienvoort 38",
        "AddressLine1": "Meienvoort 38",
        "Town": "Helmond",
        "Postcode": "5706 HK",
        "CountryID": 159,
        "Latitude": 51.4593889512797,
        "Longitude": 5.62165880203247,
        "ContactTelephone1": "088 0109500",
        "RelatedURL": "http://thenewmotion.nl/",
        "DistanceUnit": 0
    },
    "Connections": [
        {
            "ID": 36416,
            "ConnectionTypeID": 25,
            "LevelID": 2,
            "PowerKW": 3.7,
            "CurrentTypeID": 10
        }
    ],
    "NumberOfPoints": 1,
    "StatusTypeID": 50,
    "DateLastStatusUpdate": "2016-06-04T02:39:00Z",
    "DataQualityLevel": 3,
    "DateCreated": "2015-01-09T06:03:00Z",
    "SubmissionStatusTypeID": 100
}