{
    "IsRecentlyVerified": false,
    "ID": 161814,
    "UUID": "F8D40DE1-6732-4B6B-8C4B-5A7543F6630D",
    "DataProviderID": 1,
    "OperatorID": 63,
    "UsageTypeID": 5,
    "AddressInfo": {
        "ID": 162171,
        "Title": "Jetse laan",
        "AddressLine1": "Jetse laan",
        "StateOrProvince": "Brussels-Capital",
        "Postcode": "1083",
        "CountryID": 26,
        "Latitude": 50.869341,
        "Longitude": 4.325947,
        "RelatedURL": "https://www.charge.brussels/",
        "DistanceUnit": 0
    },
    "Connections": [
        {
            "ID": 232834,
            "ConnectionTypeID": 25,
            "StatusTypeID": 50,
            "LevelID": 2,
            "PowerKW": 22,
            "CurrentTypeID": 20
        }
    ],
    "NumberOfPoints": 2,
    "GeneralComments": "Regional charging station.",
    "StatusTypeID": 50,
    "DateLastStatusUpdate": "2020-07-26T08:56:00Z",
    "DataQualityLevel": 1,
    "DateCreated": "2020-07-25T14:06:00Z",
    "SubmissionStatusTypeID": 200
}