{
    "IsRecentlyVerified": false,
    "ID": 122257,
    "UUID": "042BB480-2155-455B-BFD3-E24109E1A222",
    "DataProviderID": 2,
    "DataProvidersReference": "94764",
    "OperatorID": 3372,
    "UsageTypeID": 1,
    "AddressInfo": {
        "ID": 122603,
        "Title": "Los Angeles County",
        "AddressLine1": "470 Bauchet St",
        "Town": "Los Angeles",
        "StateOrProvince": "CA",
        "Postcode": "90012",
        "CountryID": 2,
        "Latitude": 34.060066,
        "Longitude": -118.22932,
        "ContactTelephone1": "866-816-7584",
        "AccessComments": "24 hours daily",
        "RelatedURL": "http://evconnect.com/",
        "DistanceUnit": 0
    },
    "Connections": [
        {
            "ID": 172132,
            "ConnectionTypeID": 1,
            "LevelID": 2,
            "Amps": 16,
            "Voltage": 230,
            "PowerKW": 3.7,
            "CurrentTypeID": 10,
            "Quantity": 2
        }
    ],
    "DateLastStatusUpdate": "2020-06-26T02:56:00Z",
    "DataQualityLevel": 3,
    "DateCreated": "2019-04-06T05:02:00Z",
    "SubmissionStatusTypeID": 100
}