{
    "IsRecentlyVerified": false,
    "ID": 107924,
    "UUID": "3B0C4F1B-7448-48AC-AD69-9F17AAF04ACC",
    "DataProviderID": 1,
    "OperatorID": 1,
    "UsageTypeID": 1,
    "UsageCost": "free",
    "AddressInfo": {
        "ID": 108270,
        "Title": "Debrecen, Főnix Csarnok parkolója",
        "AddressLine1": "Pattantyús utca",
        "Town": "Debrecen",
        "StateOrProvince": "Hajdú-Bihar megye",
        "Postcode": "4028",
        "CountryID": 104,
        "Latitude": 47.54623046447452,
        "Longitude": 21.641174056188902,
        "DistanceUnit": 0
    },
    "Connections": [
        {
            "ID": 152414,
            "ConnectionTypeID": 25,
            "StatusTypeID": 150,
            "LevelID": 2,
            "Amps": 32,
            "Voltage": 400,
            "PowerKW": 22,
            "CurrentTypeID": 20,
            "Quantity": 2
        }
    ],
    "NumberOfPoints": 2,
    "StatusTypeID": 150,
    "DateLastStatusUpdate": "2018-08-19T12:58:00Z",
    "DataQualityLevel": 1,
    "DateCreated": "2018-08-19T12:58:00Z",
    "SubmissionStatusTypeID": 200
}