{
    "IsRecentlyVerified": false,
    "ID": 122383,
    "UUID": "F561B747-D996-4C6C-886C-672F1F5F0D94",
    "DataProviderID": 2,
    "DataProvidersReference": "80762",
    "UsageTypeID": 2,
    "AddressInfo": {
        "ID": 122729,
        "Title": "Mall of Georgia Ford",
        "AddressLine1": "4525 Nelson Brogdon Blvd",
        "Town": "Buford",
        "StateOrProvince": "GA",
        "Postcode": "30518",
        "CountryID": 2,
        "Latitude": 34.099866,
        "Longitude": -84.016663,
        "ContactTelephone1": "",
        "AccessComments": "For service center use only; very limited public use",
        "RelatedURL": "",
        "DistanceUnit": 0
    },
    "Connections": [
        {
            "ID": 172270,
            "ConnectionTypeID": 1,
            "LevelID": 2,
            "Amps": 16,
            "Voltage": 230,
            "PowerKW": 3.7,
            "CurrentTypeID": 10,
            "Quantity": 1
        }
    ],
    "DateLastStatusUpdate": "2020-06-26T02:57:00Z",
    "DataQualityLevel": 3,
    "DateCreated": "2019-04-06T05:03:00Z",
    "SubmissionStatusTypeID": 100
}