{
    "IsRecentlyVerified": false,
    "ID": 185194,
    "UUID": "19DB6C7F-626D-416D-9A00-FA785AD7C56F",
    "DataProviderID": 29,
    "DataProvidersReference": "6626",
    "OperatorID": 69,
    "AddressInfo": {
        "ID": 185553,
        "Title": "Bahnhofstr.",
        "AddressLine1": "Bahnhofstr.",
        "Town": "Murnau",
        "Postcode": "82418",
        "CountryID": 87,
        "Latitude": 47.679474,
        "Longitude": 11.198178,
        "DistanceUnit": 0
    },
    "Connections": [
        {
            "ID": 294355,
            "ConnectionTypeID": 1036,
            "StatusTypeID": 50,
            "LevelID": 3,
            "PowerKW": 43,
            "CurrentTypeID": 20
        },
        {
            "ID": 294356,
            "ConnectionTypeID": 33,
            "StatusTypeID": 50,
            "LevelID": 3,
            "PowerKW": 50,
            "CurrentTypeID": 30
        },
        {
            "ID": 295302,
            "ConnectionTypeID": 2,
            "StatusTypeID": 50,
            "LevelID": 3,
            "PowerKW": 50,
            "CurrentTypeID": 30
        }
    ],
    "StatusTypeID": 50,
    "DateLastStatusUpdate": "2021-07-12T02:39:00Z",
    "MetadataValues": [
        {
            "ID": 17485,
            "MetadataFieldID": 4,
            "ItemValue": "Data from the German chargepoint registry provided by Bundesnetzagentur.de under the CC-BY 4.0 license"
        }
    ],
    "DataQualityLevel": 3,
    "DateCreated": "2021-07-08T10:06:00Z",
    "SubmissionStatusTypeID": 100
}