{
    "IsRecentlyVerified": false,
    "ID": 27542,
    "UUID": "FE2ECBA0-19B0-4505-A4D2-1FB265D61540",
    "DataProviderID": 2,
    "DataProvidersReference": "56446",
    "OperatorID": 5,
    "UsageTypeID": 1,
    "AddressInfo": {
        "ID": 27888,
        "Title": "PLEASANTONEVSTN",
        "AddressLine1": "200 Old Bernal Ave",
        "Town": "Pleasanton",
        "StateOrProvince": "CA",
        "Postcode": "94566",
        "CountryID": 2,
        "Latitude": 37.658152,
        "Longitude": -121.87876,
        "ContactTelephone1": "888-758-4389",
        "AccessComments": "24 hours daily",
        "RelatedURL": "http://www.chargepoint.com/",
        "DistanceUnit": 0
    },
    "Connections": [
        {
            "ID": 30194,
            "ConnectionTypeID": 1,
            "LevelID": 2,
            "Amps": 16,
            "Voltage": 230,
            "PowerKW": 3,
            "CurrentTypeID": 10,
            "Quantity": 4
        }
    ],
    "DateLastStatusUpdate": "2019-04-06T04:02:00Z",
    "DataQualityLevel": 3,
    "DateCreated": "2014-11-28T03:38:00Z",
    "SubmissionStatusTypeID": 100
}