{
    "IsRecentlyVerified": false,
    "ID": 70619,
    "UUID": "5A584AFC-3F78-4A44-85B1-857E32352486",
    "DataProviderID": 1,
    "OperatorID": 45,
    "UsageTypeID": 3,
    "AddressInfo": {
        "ID": 70965,
        "Title": "E-Bike Station Wunschbecher Keramikwerkstatt",
        "AddressLine1": "Am Fürstenburgwall 11",
        "Town": "Friedrichstadt",
        "StateOrProvince": "Kreis Nordfriesland",
        "Postcode": "25840",
        "CountryID": 87,
        "Latitude": 54.37449942129954,
        "Longitude": 9.08619455092618,
        "ContactTelephone1": "+49-4881-9371973",
        "AccessComments": "Lademöglichkeit im Geschäft während der Öffnungszeiten.",
        "RelatedURL": "http://der.wunschbecher.de",
        "DistanceUnit": 0
    },
    "Connections": [
        {
            "ID": 101103,
            "ConnectionTypeID": 28,
            "StatusTypeID": 50,
            "LevelID": 1,
            "Amps": 10,
            "Voltage": 230,
            "PowerKW": 2.3,
            "CurrentTypeID": 10,
            "Quantity": 2
        }
    ],
    "NumberOfPoints": 2,
    "StatusTypeID": 50,
    "DateLastStatusUpdate": "2016-07-28T13:10:00Z",
    "DataQualityLevel": 1,
    "DateCreated": "2016-07-28T13:10:00Z",
    "SubmissionStatusTypeID": 200
}