{
    "IsRecentlyVerified": false,
    "ID": 114019,
    "UUID": "545C32BF-52C4-4BAF-85CA-52C5B4E2C03E",
    "DataProviderID": 1,
    "OperatorID": 23,
    "OperatorsReference": "47342",
    "UsageTypeID": 4,
    "AddressInfo": {
        "ID": 114365,
        "Title": "Wanderhotel Gassner",
        "AddressLine1": "Hadergasse 167",
        "Town": "Neukirchen a. Gr./Ven.",
        "Postcode": "5741",
        "CountryID": 19,
        "Latitude": 47.254184,
        "Longitude": 12.271526,
        "ContactTelephone1": " +43 6565 6232",
        "DistanceUnit": 0
    },
    "Connections": [
        {
            "ID": 160589,
            "ConnectionTypeID": 30,
            "StatusTypeID": 50,
            "LevelID": 2,
            "Amps": 32,
            "Voltage": 400,
            "PowerKW": 22,
            "CurrentTypeID": 20,
            "Quantity": 1
        }
    ],
    "NumberOfPoints": 1,
    "GeneralComments": "1 Tesla Connector, up to 22kW.Available for customers. Please see front desk.",
    "StatusTypeID": 50,
    "DateLastStatusUpdate": "2019-01-03T06:35:00Z",
    "DataQualityLevel": 1,
    "DateCreated": "2019-01-03T06:35:00Z",
    "SubmissionStatusTypeID": 200
}