{
    "IsRecentlyVerified": false,
    "ID": 97323,
    "UUID": "ED78484C-C2A3-4CEA-AA84-A6B0BD45DACC",
    "DataProviderID": 1,
    "OperatorID": 3,
    "OperatorsReference": "PG-92343",
    "UsageTypeID": 6,
    "UsageCost": "1",
    "AddressInfo": {
        "ID": 97669,
        "Title": "Wavin LTD-Wiltshire",
        "AddressLine1": "Parsonage Way",
        "Town": "Wiltshire",
        "Postcode": "SN15 5PN",
        "CountryID": 1,
        "Latitude": 51.470384,
        "Longitude": -2.106172,
        "DistanceUnit": 0
    },
    "Connections": [
        {
            "ID": 138216,
            "ConnectionTypeID": 25,
            "StatusTypeID": 50,
            "LevelID": 2,
            "Amps": 32,
            "Voltage": 230,
            "PowerKW": 7,
            "CurrentTypeID": 10,
            "Quantity": 1
        }
    ],
    "NumberOfPoints": 1,
    "GeneralComments": "This is an open charge unit installed at the Wavin Ltd site in - Parsonage Way, Chippenham, Wiltshire",
    "StatusTypeID": 0,
    "DateLastStatusUpdate": "2020-02-07T06:32:00Z",
    "DataQualityLevel": 1,
    "DateCreated": "2018-01-18T06:33:00Z",
    "SubmissionStatusTypeID": 200
}