{
    "IsRecentlyVerified": false,
    "ID": 87973,
    "UUID": "625E0C60-02A6-4D7D-A6F5-CDC371AB940A",
    "DataProviderID": 1,
    "OperatorID": 45,
    "UsageTypeID": 6,
    "UsageCost": "0",
    "AddressInfo": {
        "ID": 88319,
        "Title": "Skatt Øst",
        "AddressLine1": "Rådmann Siras vei",
        "AddressLine2": "Grålum",
        "Town": "Sarpsborg",
        "StateOrProvince": "Sarpsborg",
        "Postcode": "1712",
        "CountryID": 168,
        "Latitude": 59.2957304380964,
        "Longitude": 11.0610287420502,
        "ContactTelephone1": "Unknown",
        "ContactTelephone2": "Unknown",
        "AccessComments": "Chargers for customers of Skatt Øst (Skatteetaten)",
        "RelatedURL": "https://www.skatteetaten.no",
        "DistanceUnit": 0
    },
    "Connections": [
        {
            "ID": 124799,
            "ConnectionTypeID": 28,
            "StatusTypeID": 50,
            "LevelID": 1,
            "Amps": 10,
            "Voltage": 230,
            "PowerKW": 2,
            "CurrentTypeID": 10,
            "Quantity": 4
        }
    ],
    "NumberOfPoints": 4,
    "GeneralComments": "Chargers are placed on the left side of the building (main entrance).",
    "StatusTypeID": 50,
    "DateLastStatusUpdate": "2017-05-19T08:09:00Z",
    "DataQualityLevel": 1,
    "DateCreated": "2017-05-18T21:04:00Z",
    "SubmissionStatusTypeID": 200
}