{
    "IsRecentlyVerified": true,
    "DateLastVerified": "2021-09-19T17:38:00Z",
    "ID": 189297,
    "UUID": "2D5AEAE0-130B-4281-A682-AB780D735845",
    "DataProviderID": 1,
    "OperatorID": 21,
    "UsageTypeID": 4,
    "UsageCost": "Mobi.E compatible card or App",
    "AddressInfo": {
        "ID": 189656,
        "Title": "VCD-00007 - Lidl",
        "AddressLine1": "LIDL",
        "Town": "Vila do Conde",
        "StateOrProvince": "Porto",
        "Postcode": "",
        "CountryID": 180,
        "Latitude": 41.34848100545807,
        "Longitude": -8.747143547212772,
        "DistanceUnit": 0
    },
    "Connections": [
        {
            "ID": 306108,
            "ConnectionTypeID": 2,
            "StatusTypeID": 50,
            "LevelID": 3,
            "Amps": 120,
            "Voltage": 500,
            "PowerKW": 50,
            "CurrentTypeID": 30,
            "Quantity": 1
        },
        {
            "ID": 306109,
            "ConnectionTypeID": 33,
            "StatusTypeID": 50,
            "LevelID": 3,
            "Amps": 125,
            "Voltage": 500,
            "PowerKW": 50,
            "CurrentTypeID": 30,
            "Quantity": 1
        },
        {
            "ID": 306110,
            "ConnectionTypeID": 1036,
            "StatusTypeID": 50,
            "LevelID": 3,
            "Amps": 64,
            "Voltage": 400,
            "PowerKW": 43,
            "CurrentTypeID": 20,
            "Quantity": 1
        }
    ],
    "NumberOfPoints": 2,
    "StatusTypeID": 50,
    "DateLastStatusUpdate": "2021-09-19T17:38:00Z",
    "DataQualityLevel": 1,
    "DateCreated": "2021-09-19T17:38:00Z",
    "SubmissionStatusTypeID": 200
}