{
    "IsRecentlyVerified": false,
    "ID": 127207,
    "UUID": "68ADEE3E-8602-4494-BA1B-46BC7EF15624",
    "DataProviderID": 1,
    "OperatorID": 32,
    "OperatorsReference": "12052",
    "UsageTypeID": 4,
    "UsageCost": "£0.108/kWh; for Polar Plus subscription members only",
    "AddressInfo": {
        "ID": 127553,
        "Title": "Albrighton Fire Station-Shropshire FRS",
        "AddressLine1": "Newport Road",
        "Town": "Donington",
        "StateOrProvince": "Shropshire",
        "Postcode": "WV7 3EW",
        "CountryID": 1,
        "Latitude": 52.639523,
        "Longitude": -2.288458,
        "DistanceUnit": 0
    },
    "Connections": [
        {
            "ID": 178123,
            "ConnectionTypeID": 25,
            "StatusTypeID": 50,
            "LevelID": 2,
            "Amps": 32,
            "Voltage": 230,
            "PowerKW": 7,
            "CurrentTypeID": 10,
            "Quantity": 2
        }
    ],
    "NumberOfPoints": 2,
    "GeneralComments": "Unit located on the left of the main entrance.",
    "StatusTypeID": 50,
    "DateLastStatusUpdate": "2019-05-30T07:15:00Z",
    "DataQualityLevel": 1,
    "DateCreated": "2019-05-30T05:17:00Z",
    "SubmissionStatusTypeID": 200
}