{
    "IsRecentlyVerified": false,
    "ID": 100402,
    "UUID": "7D6752C6-090C-4C3D-85DF-AA8B53747B3E",
    "DataProviderID": 1,
    "OperatorID": 23,
    "OperatorsReference": "40906",
    "UsageTypeID": 4,
    "AddressInfo": {
        "ID": 100748,
        "Title": "The Cottage At Winjes Farm",
        "AddressLine1": "45875 County RD 1",
        "Town": "Lake City",
        "StateOrProvince": "California",
        "Postcode": "96115",
        "CountryID": 2,
        "Latitude": 41.740992,
        "Longitude": -120.194759,
        "ContactTelephone1": "(530) 279-2371",
        "DistanceUnit": 0
    },
    "Connections": [
        {
            "ID": 141821,
            "ConnectionTypeID": 30,
            "StatusTypeID": 50,
            "LevelID": 2,
            "PowerKW": 16,
            "CurrentTypeID": 20,
            "Quantity": 2
        }
    ],
    "NumberOfPoints": 2,
    "GeneralComments": "2 Tesla Connectors, up to 16kW.Available to the public. Please see front desk.",
    "StatusTypeID": 50,
    "DateLastStatusUpdate": "2018-02-23T07:01:00Z",
    "DataQualityLevel": 1,
    "DateCreated": "2018-02-23T07:01:00Z",
    "SubmissionStatusTypeID": 200
}