{
    "IsRecentlyVerified": true,
    "DateLastVerified": "2021-08-24T09:05:00Z",
    "ID": 188896,
    "UUID": "35D289BA-5984-4B40-94ED-D2E59305C764",
    "DataProviderID": 1,
    "OperatorID": 1,
    "UsageTypeID": 1,
    "UsageCost": "Free",
    "AddressInfo": {
        "ID": 189255,
        "Title": "Очёр АЗС Лукойл N80",
        "AddressLine1": "",
        "Town": "Павловское городское поселение",
        "StateOrProvince": "Perm Krai",
        "Postcode": "",
        "CountryID": 185,
        "Latitude": 57.86887106994078,
        "Longitude": 54.78505079968181,
        "ContactTelephone1": "+7 902 471-74-19",
        "AccessComments": "24/7",
        "DistanceUnit": 0
    },
    "Connections": [
        {
            "ID": 305253,
            "ConnectionTypeID": 25,
            "StatusTypeID": 50,
            "LevelID": 2,
            "Amps": 32,
            "Voltage": 400,
            "PowerKW": 22,
            "CurrentTypeID": 20,
            "Quantity": 1
        }
    ],
    "NumberOfPoints": 1,
    "StatusTypeID": 50,
    "DateLastStatusUpdate": "2021-08-24T19:47:00Z",
    "DataQualityLevel": 1,
    "DateCreated": "2021-08-24T09:05:00Z",
    "SubmissionStatusTypeID": 200
}