{
    "IsRecentlyVerified": false,
    "ID": 127223,
    "UUID": "18748B3C-E070-45F6-8126-01FAAC3DF2BA",
    "DataProviderID": 1,
    "OperatorID": 80,
    "UsageTypeID": 4,
    "AddressInfo": {
        "ID": 127569,
        "Title": "Laconi Garibaldi | EnelX",
        "AddressLine1": "Corso Garibaldi, 15",
        "Town": "Laconi",
        "StateOrProvince": "OR",
        "Postcode": "08034",
        "CountryID": 112,
        "Latitude": 39.8529984315535,
        "Longitude": 9.05565659620004,
        "RelatedURL": "https://www.enelx.com/it/it/emobility",
        "DistanceUnit": 0
    },
    "Connections": [
        {
            "ID": 178143,
            "ConnectionTypeID": 25,
            "StatusTypeID": 50,
            "LevelID": 2,
            "Amps": 32,
            "Voltage": 400,
            "PowerKW": 22,
            "CurrentTypeID": 20,
            "Quantity": 4
        }
    ],
    "NumberOfPoints": 4,
    "StatusTypeID": 50,
    "DateLastStatusUpdate": "2019-05-30T14:50:00Z",
    "DataQualityLevel": 1,
    "DateCreated": "2019-05-30T14:48:00Z",
    "SubmissionStatusTypeID": 200
}