{
    "IsRecentlyVerified": false,
    "ID": 142144,
    "UUID": "28DF0B53-8993-4323-A717-14610A649E14",
    "DataProviderID": 2,
    "DataProvidersReference": "145069",
    "UsageTypeID": 1,
    "AddressInfo": {
        "ID": 142496,
        "Title": "Lewis County Rural Electric Co-op",
        "AddressLine1": "18256 MO-16",
        "Town": "Lewistown",
        "StateOrProvince": "MO",
        "Postcode": "63452",
        "CountryID": 2,
        "Latitude": 40.085915,
        "Longitude": -91.771911,
        "ContactTelephone1": "573-215-4000",
        "AccessComments": "24 hours daily",
        "RelatedURL": "",
        "DistanceUnit": 0
    },
    "Connections": [
        {
            "ID": 198219,
            "ConnectionTypeID": 1,
            "LevelID": 2,
            "Amps": 16,
            "Voltage": 230,
            "PowerKW": 3.7,
            "CurrentTypeID": 10,
            "Quantity": 1
        }
    ],
    "StatusTypeID": 50,
    "DateLastStatusUpdate": "2020-06-26T03:02:00Z",
    "DataQualityLevel": 3,
    "DateCreated": "2019-12-24T09:17:00Z",
    "SubmissionStatusTypeID": 100
}