{
    "IsRecentlyVerified": false,
    "ID": 91767,
    "UUID": "B3C5E6F6-F41C-430E-88E8-CD17B40D232C",
    "DataProviderID": 1,
    "OperatorID": 47,
    "OperatorsReference": "UTPITEN057",
    "UsageTypeID": 1,
    "UsageCost": "Free",
    "AddressInfo": {
        "ID": 92113,
        "Title": "J. M. De Muinck Keizerlaan 27",
        "AddressLine1": "Keizerlaan 27",
        "Town": "Utrecht ",
        "Postcode": "3555 JT",
        "CountryID": 159,
        "Latitude": 52.116711,
        "Longitude": 5.0844572,
        "DistanceUnit": 0
    },
    "Connections": [
        {
            "ID": 130096,
            "ConnectionTypeID": 25,
            "StatusTypeID": 50,
            "LevelID": 2,
            "Amps": 16,
            "Voltage": 400,
            "PowerKW": 11,
            "CurrentTypeID": 20,
            "Quantity": 1
        }
    ],
    "NumberOfPoints": 2,
    "StatusTypeID": 50,
    "DateLastStatusUpdate": "2017-08-17T17:03:00Z",
    "DataQualityLevel": 1,
    "DateCreated": "2017-08-17T10:30:00Z",
    "SubmissionStatusTypeID": 200
}