{
    "IsRecentlyVerified": false,
    "ID": 85493,
    "UUID": "99BC8EA4-807E-4F01-A8D6-D55A3D5C5E7B",
    "DataProviderID": 1,
    "OperatorID": 23,
    "OperatorsReference": "26424",
    "UsageTypeID": 6,
    "AddressInfo": {
        "ID": 85839,
        "Title": "The Dragon Hotel",
        "AddressLine1": "39 the Kingsway",
        "Town": "Swansea",
        "Postcode": "SA1 5LS",
        "CountryID": 1,
        "Latitude": 51.621436,
        "Longitude": -3.944424,
        "ContactTelephone1": "+44 179 265 7100",
        "DistanceUnit": 0
    },
    "Connections": [
        {
            "ID": 121574,
            "ConnectionTypeID": 30,
            "StatusTypeID": 50,
            "LevelID": 2,
            "Amps": 32,
            "Voltage": 400,
            "PowerKW": 22,
            "CurrentTypeID": 20,
            "Quantity": 2
        }
    ],
    "NumberOfPoints": 2,
    "GeneralComments": "2 Tesla Connectors, up to 22kW.Available for patrons only. Self park.",
    "StatusTypeID": 50,
    "DateLastStatusUpdate": "2018-10-03T21:08:00Z",
    "DataQualityLevel": 1,
    "DateCreated": "2017-04-06T05:41:00Z",
    "SubmissionStatusTypeID": 200
}