{
    "IsRecentlyVerified": false,
    "ID": 90710,
    "UUID": "7A634D06-8720-4A6C-8AB7-5CAF6A17512B",
    "DataProviderID": 1,
    "OperatorID": 23,
    "OperatorsReference": "32103",
    "UsageTypeID": 4,
    "AddressInfo": {
        "ID": 91056,
        "Title": "Quikpark 173 W 12th Street",
        "AddressLine1": "173 W 12th St",
        "Town": "New York",
        "StateOrProvince": "New York",
        "Postcode": "10011",
        "CountryID": 2,
        "Latitude": 40.737108,
        "Longitude": -74.000358,
        "ContactTelephone1": "(646) 336-6225",
        "DistanceUnit": 0
    },
    "Connections": [
        {
            "ID": 128433,
            "ConnectionTypeID": 30,
            "StatusTypeID": 50,
            "LevelID": 2,
            "PowerKW": 16,
            "CurrentTypeID": 20,
            "Quantity": 2
        }
    ],
    "NumberOfPoints": 2,
    "GeneralComments": "2 Tesla Connectors, up to 16kW.Available to the public. Please see valet.",
    "StatusTypeID": 50,
    "DateLastStatusUpdate": "2017-07-22T05:36:00Z",
    "DataQualityLevel": 1,
    "DateCreated": "2017-07-22T05:36:00Z",
    "SubmissionStatusTypeID": 200
}