{
    "IsRecentlyVerified": true,
    "DateLastVerified": "2021-10-23T21:30:00Z",
    "ID": 189659,
    "UUID": "077349C1-AB28-480A-A793-1DF38A7388A4",
    "DataProviderID": 1,
    "OperatorID": 21,
    "UsageTypeID": 4,
    "UsageCost": "Mobi.E compatible card or App",
    "AddressInfo": {
        "ID": 190018,
        "Title": "ODV-00007 - Pingo Doce",
        "AddressLine1": "Rua Júlio Borba",
        "Town": "Póvoa de Santo Adrião",
        "StateOrProvince": "Lisboa",
        "Postcode": "2620-036",
        "CountryID": 180,
        "Latitude": 38.794928909287336,
        "Longitude": -9.16763546906327,
        "DistanceUnit": 0
    },
    "Connections": [
        {
            "ID": 306806,
            "ConnectionTypeID": 33,
            "StatusTypeID": 50,
            "LevelID": 3,
            "Amps": 125,
            "Voltage": 500,
            "PowerKW": 50,
            "CurrentTypeID": 30,
            "Quantity": 1
        },
        {
            "ID": 306807,
            "ConnectionTypeID": 2,
            "StatusTypeID": 50,
            "LevelID": 3,
            "Amps": 120,
            "Voltage": 500,
            "PowerKW": 50,
            "CurrentTypeID": 30,
            "Quantity": 1
        },
        {
            "ID": 306808,
            "ConnectionTypeID": 1036,
            "StatusTypeID": 50,
            "LevelID": 3,
            "Amps": 64,
            "Voltage": 400,
            "PowerKW": 43,
            "CurrentTypeID": 20,
            "Quantity": 1
        }
    ],
    "NumberOfPoints": 2,
    "StatusTypeID": 50,
    "DateLastStatusUpdate": "2021-10-23T21:30:00Z",
    "DataQualityLevel": 1,
    "DateCreated": "2021-10-23T21:30:00Z",
    "SubmissionStatusTypeID": 200
}