{
    "IsRecentlyVerified": false,
    "ID": 157993,
    "UUID": "67ACC3AB-D75F-4CB0-8236-350DF13321BE",
    "DataProviderID": 1,
    "OperatorID": 3326,
    "UsageTypeID": 5,
    "AddressInfo": {
        "ID": 158347,
        "Title": "Anthony Motors Ltd",
        "AddressLine1": "Llanbadarn Road",
        "Town": "Aberystwyth",
        "Postcode": "SY23 3QP",
        "CountryID": 1,
        "Latitude": 52.410449,
        "Longitude": -4.066136,
        "RelatedURL": "http://www.alfapower.co.uk/",
        "DistanceUnit": 0
    },
    "Connections": [
        {
            "ID": 227734,
            "ConnectionTypeID": 33,
            "Reference": "B",
            "StatusTypeID": 50,
            "LevelID": 3,
            "Amps": 60,
            "Voltage": 400,
            "PowerKW": 22,
            "CurrentTypeID": 30
        },
        {
            "ID": 227735,
            "ConnectionTypeID": 2,
            "Reference": "A",
            "StatusTypeID": 50,
            "LevelID": 3,
            "Amps": 60,
            "Voltage": 400,
            "PowerKW": 22,
            "CurrentTypeID": 30
        }
    ],
    "StatusTypeID": 0,
    "DateLastStatusUpdate": "2021-05-17T15:04:00Z",
    "MetadataValues": [
        {
            "ID": 7526,
            "MetadataFieldID": 4,
            "ItemValue": "Contains public sector information licensed under the Open Government Licence v2.0. http://www.nationalarchives.gov.uk/doc/open-government-licence/version/2/"
        }
    ],
    "DataQualityLevel": 3,
    "DateCreated": "2020-06-25T10:00:00Z",
    "SubmissionStatusTypeID": 100
}