{
    "MediaItems": [
        {
            "ID": 12537,
            "ChargePointID": 88268,
            "ItemURL": "https://s3-ap-southeast-2.amazonaws.com/openchargemap/images/NZ/OCM88268/OCM-88268.orig.2017052512423093.jpg",
            "ItemThumbnailURL": "https://s3-ap-southeast-2.amazonaws.com/openchargemap/images/NZ/OCM88268/OCM-88268.thmb.2017052512423093.jpg",
            "Comment": "",
            "IsEnabled": true,
            "IsVideo": false,
            "IsFeaturedItem": false,
            "IsExternalResource": false,
            "User": {
                "ID": 15365,
                "Username": "sliday"
            },
            "DateCreated": "2017-05-25T12:43:00Z"
        },
        {
            "ID": 12538,
            "ChargePointID": 88268,
            "ItemURL": "https://s3-ap-southeast-2.amazonaws.com/openchargemap/images/NZ/OCM88268/OCM-88268.orig.2017052512424364.jpg",
            "ItemThumbnailURL": "https://s3-ap-southeast-2.amazonaws.com/openchargemap/images/NZ/OCM88268/OCM-88268.thmb.2017052512424364.jpg",
            "Comment": "",
            "IsEnabled": true,
            "IsVideo": false,
            "IsFeaturedItem": false,
            "IsExternalResource": false,
            "User": {
                "ID": 15365,
                "Username": "sliday"
            },
            "DateCreated": "2017-05-25T12:43:00Z"
        }
    ],
    "IsRecentlyVerified": false,
    "ID": 88268,
    "UUID": "565A7488-33ED-4856-A5F0-B46BAD22E335",
    "DataProviderID": 1,
    "OperatorID": 1,
    "AddressInfo": {
        "ID": 88614,
        "Title": "The Plaza Shopping Centre",
        "AddressLine1": "Cnr Ferguson & Ashley Street",
        "Town": "Palmerston North",
        "Postcode": "4410",
        "CountryID": 161,
        "Latitude": -40.358525266637635,
        "Longitude": 175.61511126643987,
        "ContactTelephone1": "063581989",
        "DistanceUnit": 0
    },
    "Connections": [
        {
            "ID": 125215,
            "ConnectionTypeID": 1,
            "LevelID": 2,
            "Amps": 32,
            "PowerKW": 7
        },
        {
            "ID": 305191,
            "ConnectionTypeID": 1036,
            "StatusTypeID": 50,
            "LevelID": 2,
            "PowerKW": 7.4,
            "CurrentTypeID": 10,
            "Quantity": 3
        }
    ],
    "NumberOfPoints": 4,
    "GeneralComments": "Mon - Wed & Sat: 7AM - 6:45PM, Thurs: 7AM - 10PM, Fri: 7AM - 8PM, Sun: 7AM - 5:45PM\r\n4 x JuicePoint 7kw (32 Amp) Meridian EV Charging Unit with J1772 plugs. Ferguson Street carpark - Ground level by main entry door. Note there are two separate Plaza carparks adjoining Fergusson St and you want the one to the west nearer Fitzherbert Ave.\r\n",
    "StatusTypeID": 50,
    "DateLastStatusUpdate": "2021-08-22T07:25:00Z",
    "DataQualityLevel": 1,
    "DateCreated": "2017-05-25T12:42:00Z",
    "SubmissionStatusTypeID": 200
}