{
    "IsRecentlyVerified": false,
    "ID": 107268,
    "UUID": "85A940ED-A967-49A3-B6B6-32B58DDDD086",
    "DataProviderID": 1,
    "OperatorID": 25,
    "OperatorsReference": "islington-stgeorgesavenue",
    "UsageTypeID": 4,
    "UsageCost": "£0.059/minute; min £1.18; other tariffs available",
    "AddressInfo": {
        "ID": 107614,
        "Title": "St George's Avenue",
        "AddressLine1": "2 St George's Avenue",
        "Town": "London",
        "Postcode": "N7 0EX",
        "CountryID": 1,
        "Latitude": 51.55689,
        "Longitude": -0.127568,
        "DistanceUnit": 0
    },
    "Connections": [
        {
            "ID": 151312,
            "ConnectionTypeID": 25,
            "StatusTypeID": 50,
            "LevelID": 2,
            "Amps": 32,
            "Voltage": 230,
            "PowerKW": 7,
            "CurrentTypeID": 10,
            "Quantity": 2
        },
        {
            "ID": 151313,
            "ConnectionTypeID": 1,
            "StatusTypeID": 50,
            "LevelID": 2,
            "Amps": 16,
            "Voltage": 230,
            "PowerKW": 4,
            "CurrentTypeID": 10,
            "Quantity": 2
        }
    ],
    "NumberOfPoints": 2,
    "StatusTypeID": 50,
    "DateLastStatusUpdate": "2019-01-08T08:24:00Z",
    "DataQualityLevel": 1,
    "DateCreated": "2018-07-23T15:39:00Z",
    "SubmissionStatusTypeID": 200
}