{
    "IsRecentlyVerified": false,
    "ID": 52647,
    "UUID": "FA485810-400F-472E-A104-A3E496E05F00",
    "DataProviderID": 1,
    "OperatorID": 83,
    "UsageTypeID": 1,
    "AddressInfo": {
        "ID": 52993,
        "Title": "Pista Cilabile",
        "AddressLine1": "Via Giuseppe Verdi",
        "Town": "Gualdo Tadino",
        "StateOrProvince": "PG",
        "Postcode": "06023",
        "CountryID": 112,
        "Latitude": 43.228616316628,
        "Longitude": 12.7684547456636,
        "ContactTelephone1": "39 0464 401121",
        "ContactEmail": "info@ecospazio.it",
        "RelatedURL": "http://www.ecospazio.it/",
        "DistanceUnit": 0
    },
    "Connections": [
        {
            "ID": 65404,
            "ConnectionTypeID": 25,
            "StatusTypeID": 50,
            "LevelID": 2,
            "CurrentTypeID": 10,
            "Quantity": 1
        },
        {
            "ID": 65405,
            "ConnectionTypeID": 36,
            "StatusTypeID": 50,
            "LevelID": 2,
            "PowerKW": 3,
            "CurrentTypeID": 10,
            "Quantity": 1
        }
    ],
    "NumberOfPoints": 2,
    "GeneralComments": "http://www.ecospazio.it/installazioni/colonnine_ricarica_comune_di_gualdo_tadino.php",
    "StatusTypeID": 50,
    "DateLastStatusUpdate": "2016-08-10T12:06:00Z",
    "DataQualityLevel": 1,
    "DateCreated": "2015-09-06T09:19:00Z",
    "SubmissionStatusTypeID": 200
}