{
    "IsRecentlyVerified": false,
    "ID": 85718,
    "UUID": "BA1FED63-471F-46E8-86FB-416B4F42F5A8",
    "DataProviderID": 1,
    "OperatorID": 23,
    "OperatorsReference": "26639",
    "UsageTypeID": 4,
    "AddressInfo": {
        "ID": 86064,
        "Title": "Red Lion Hotel Redding",
        "AddressLine1": "1830 Hill Top DR",
        "Town": "Redding",
        "StateOrProvince": "California",
        "Postcode": "96002",
        "CountryID": 2,
        "Latitude": 40.5811735,
        "Longitude": -122.3582499,
        "ContactTelephone1": "(530) 221-8700",
        "DistanceUnit": 0
    },
    "Connections": [
        {
            "ID": 121859,
            "ConnectionTypeID": 30,
            "StatusTypeID": 50,
            "LevelID": 2,
            "PowerKW": 8,
            "CurrentTypeID": 10,
            "Quantity": 2
        }
    ],
    "NumberOfPoints": 2,
    "GeneralComments": "2 Tesla Connectors, up to 8kW.Available for customers. Please call ahead.",
    "StatusTypeID": 50,
    "DateLastStatusUpdate": "2017-06-09T15:02:00Z",
    "DataQualityLevel": 1,
    "DateCreated": "2017-04-13T05:45:00Z",
    "SubmissionStatusTypeID": 200
}