{
    "IsRecentlyVerified": false,
    "ID": 159724,
    "UUID": "38A9AE53-CA3E-4213-B7E4-894D9E0456A0",
    "DataProviderID": 2,
    "DataProvidersReference": "154702",
    "OperatorID": 5,
    "UsageTypeID": 1,
    "AddressInfo": {
        "ID": 160081,
        "Title": "CG TOWN HALL",
        "AddressLine1": "525 Pompton Ave",
        "Town": "Cedar Grove",
        "StateOrProvince": "NJ",
        "Postcode": "07009",
        "CountryID": 2,
        "Latitude": 40.851303,
        "Longitude": -74.2286,
        "ContactTelephone1": "888-758-4389",
        "AccessComments": "24 hours daily",
        "RelatedURL": "http://www.chargepoint.com/",
        "DistanceUnit": 0
    },
    "Connections": [
        {
            "ID": 229932,
            "ConnectionTypeID": 1,
            "LevelID": 2,
            "Amps": 16,
            "Voltage": 230,
            "PowerKW": 3.7,
            "CurrentTypeID": 10,
            "Quantity": 2
        }
    ],
    "StatusTypeID": 50,
    "DateLastStatusUpdate": "2020-06-26T03:03:00Z",
    "DataQualityLevel": 3,
    "DateCreated": "2020-06-26T03:03:00Z",
    "SubmissionStatusTypeID": 100
}