{
    "IsRecentlyVerified": false,
    "ID": 159710,
    "UUID": "90F85CC4-EE6D-4B30-B80B-3F3901976D51",
    "DataProviderID": 2,
    "DataProvidersReference": "158621",
    "OperatorID": 5,
    "UsageTypeID": 1,
    "AddressInfo": {
        "ID": 160067,
        "Title": "JETRO 1",
        "AddressLine1": "17-10 Whitestone Expy",
        "Town": "Whitestone",
        "StateOrProvince": "NY",
        "Postcode": "11357",
        "CountryID": 2,
        "Latitude": 40.778008,
        "Longitude": -73.82635,
        "ContactTelephone1": "888-758-4389",
        "AccessComments": "24 hours daily",
        "RelatedURL": "http://www.chargepoint.com/",
        "DistanceUnit": 0
    },
    "Connections": [
        {
            "ID": 229916,
            "ConnectionTypeID": 1,
            "LevelID": 2,
            "Amps": 16,
            "Voltage": 230,
            "PowerKW": 3.7,
            "CurrentTypeID": 10,
            "Quantity": 2
        }
    ],
    "StatusTypeID": 50,
    "DateLastStatusUpdate": "2020-06-26T03:03:00Z",
    "DataQualityLevel": 3,
    "DateCreated": "2020-06-26T03:03:00Z",
    "SubmissionStatusTypeID": 100
}