{
    "IsRecentlyVerified": false,
    "ID": 179014,
    "UUID": "6A1EAD80-FA77-40A4-82BB-4016ED793F81",
    "DataProviderID": 29,
    "DataProvidersReference": "7754",
    "AddressInfo": {
        "ID": 179373,
        "Title": "Untrbrunner Str. 17",
        "AddressLine1": "Untrbrunner Str. 17",
        "Town": "Gauting",
        "Postcode": "82131",
        "CountryID": 87,
        "Latitude": 48.071464,
        "Longitude": 11.369695,
        "DistanceUnit": 0
    },
    "Connections": [
        {
            "ID": 280221,
            "ConnectionTypeID": 25,
            "StatusTypeID": 50,
            "LevelID": 2,
            "PowerKW": 22,
            "CurrentTypeID": 20
        },
        {
            "ID": 280222,
            "ConnectionTypeID": 25,
            "StatusTypeID": 50,
            "LevelID": 2,
            "PowerKW": 22,
            "CurrentTypeID": 20
        }
    ],
    "StatusTypeID": 50,
    "DateLastStatusUpdate": "2021-07-12T02:40:00Z",
    "MetadataValues": [
        {
            "ID": 11308,
            "MetadataFieldID": 4,
            "ItemValue": "Data from the German chargepoint registry provided by Bundesnetzagentur.de under the CC-BY 4.0 license"
        }
    ],
    "DataQualityLevel": 3,
    "DateCreated": "2021-07-08T09:59:00Z",
    "SubmissionStatusTypeID": 100
}