{
    "IsRecentlyVerified": false,
    "ID": 150072,
    "UUID": "3D368EBD-8748-4E77-8941-E7017073B10F",
    "DataProviderID": 18,
    "DataProvidersReference": "d07eb0b09b59e22f194840d223129e4f",
    "OperatorID": 3391,
    "UsageTypeID": 1,
    "AddressInfo": {
        "ID": 150425,
        "Title": "Harrington Villas",
        "AddressLine1": "Harrington Villas",
        "Town": "Brighton",
        "Postcode": "BN3 6HH",
        "CountryID": 1,
        "Latitude": 50.844741,
        "Longitude": -0.147096,
        "AccessComments": "",
        "RelatedURL": "https://www.electricblueuk.com/",
        "DistanceUnit": 0
    },
    "Connections": [
        {
            "ID": 208358,
            "ConnectionTypeID": 25,
            "Reference": "62196-2 (SINGLE PHASE)",
            "StatusTypeID": 50,
            "LevelID": 2,
            "Amps": 16,
            "Voltage": 230,
            "PowerKW": 3.7,
            "CurrentTypeID": 10
        }
    ],
    "StatusTypeID": 0,
    "DateLastStatusUpdate": "2020-03-17T08:53:00Z",
    "MetadataValues": [
        {
            "ID": 7099,
            "MetadataFieldID": 4,
            "ItemValue": "Contains public sector information licensed under the Open Government Licence v2.0. http://www.nationalarchives.gov.uk/doc/open-government-licence/version/2/"
        }
    ],
    "DataQualityLevel": 3,
    "DateCreated": "2020-03-12T15:48:00Z",
    "SubmissionStatusTypeID": 100
}