{
    "IsRecentlyVerified": false,
    "ID": 146322,
    "UUID": "DBDA95F2-10A5-422B-BA7A-0BB0A8A45D1F",
    "DataProviderID": 1,
    "OperatorID": 70,
    "UsageTypeID": 4,
    "AddressInfo": {
        "ID": 146674,
        "Title": "EŞARJ - Midtown AVM Bodrum",
        "AddressLine1": "Ortakent Kemer Mevkii Cumhuriyet Cad. ",
        "Town": "Bodrum",
        "Postcode": "48420",
        "CountryID": 229,
        "Latitude": 37.0574061231174,
        "Longitude": 27.35892401454248,
        "AccessComments": "Parking P2(-2), Orange Floor, column A5",
        "RelatedURL": "https://esarj.com/harita?s=TR-MUG-006",
        "DistanceUnit": 0
    },
    "Connections": [
        {
            "ID": 203403,
            "ConnectionTypeID": 2,
            "StatusTypeID": 50,
            "LevelID": 3,
            "Amps": 125,
            "Voltage": 400,
            "PowerKW": 45,
            "CurrentTypeID": 30,
            "Quantity": 1
        },
        {
            "ID": 203404,
            "ConnectionTypeID": 33,
            "StatusTypeID": 50,
            "LevelID": 3,
            "Amps": 120,
            "Voltage": 400,
            "PowerKW": 45,
            "CurrentTypeID": 30,
            "Quantity": 1
        },
        {
            "ID": 203405,
            "ConnectionTypeID": 25,
            "StatusTypeID": 50,
            "LevelID": 2,
            "Amps": 32,
            "Voltage": 400,
            "PowerKW": 22,
            "CurrentTypeID": 20,
            "Quantity": 1
        }
    ],
    "NumberOfPoints": 1,
    "GeneralComments": "Everyday 10:00 - 22:00. Check esarj.com for membership and pricing info.",
    "StatusTypeID": 50,
    "DateLastStatusUpdate": "2020-01-09T16:31:00Z",
    "DataQualityLevel": 1,
    "DateCreated": "2020-01-06T16:56:00Z",
    "SubmissionStatusTypeID": 200
}