{
    "MediaItems": [
        {
            "ID": 12812,
            "ChargePointID": 88686,
            "ItemURL": "https://s3-ap-southeast-2.amazonaws.com/openchargemap/images/HU/OCM88686/OCM-88686.orig.2017060813415304.jpg",
            "ItemThumbnailURL": "https://s3-ap-southeast-2.amazonaws.com/openchargemap/images/HU/OCM88686/OCM-88686.thmb.2017060813415304.jpg",
            "Comment": "",
            "IsEnabled": true,
            "IsVideo": false,
            "IsFeaturedItem": false,
            "IsExternalResource": false,
            "User": {
                "ID": 4438,
                "Username": "tibor.antaloczy"
            },
            "DateCreated": "2017-06-08T13:42:00Z"
        },
        {
            "ID": 12811,
            "ChargePointID": 88686,
            "ItemURL": "https://s3-ap-southeast-2.amazonaws.com/openchargemap/images/HU/OCM88686/OCM-88686.orig.2017060813403358.jpg",
            "ItemThumbnailURL": "https://s3-ap-southeast-2.amazonaws.com/openchargemap/images/HU/OCM88686/OCM-88686.thmb.2017060813403358.jpg",
            "Comment": "",
            "IsEnabled": true,
            "IsVideo": false,
            "IsFeaturedItem": false,
            "IsExternalResource": false,
            "User": {
                "ID": 4438,
                "Username": "tibor.antaloczy"
            },
            "DateCreated": "2017-06-08T13:41:00Z"
        },
        {
            "ID": 12810,
            "ChargePointID": 88686,
            "ItemURL": "https://s3-ap-southeast-2.amazonaws.com/openchargemap/images/HU/OCM88686/OCM-88686.orig.2017060813400209.jpg",
            "ItemThumbnailURL": "https://s3-ap-southeast-2.amazonaws.com/openchargemap/images/HU/OCM88686/OCM-88686.thmb.2017060813400209.jpg",
            "Comment": "",
            "IsEnabled": true,
            "IsVideo": false,
            "IsFeaturedItem": false,
            "IsExternalResource": false,
            "User": {
                "ID": 4438,
                "Username": "tibor.antaloczy"
            },
            "DateCreated": "2017-06-08T13:40:00Z"
        }
    ],
    "IsRecentlyVerified": false,
    "ID": 88686,
    "UUID": "C01B46A8-D920-428C-97DA-11CB6D22D42F",
    "DataProviderID": 1,
    "OperatorID": 45,
    "UsageTypeID": 1,
    "UsageCost": "free",
    "AddressInfo": {
        "ID": 89032,
        "Title": "Budapest, Soroksári IKEA",
        "AddressLine1": "Bevásárló utca",
        "Town": "Budapest",
        "StateOrProvince": "Budapest",
        "Postcode": "1238",
        "CountryID": 104,
        "Latitude": 47.4124369023977,
        "Longitude": 19.1604137620407,
        "AccessComments": "Chargers are located in the first row of parking places near the main entrance. Service is available 24/7, although the store is only open from 9 am to 9 pm. / A töltők a parkoló első sorában a főbejárat közelében találhatók. A szolgáltatás a nap 24 órájában elérhető, de az üzlet csak 9 és 21 óra között van nyitva.",
        "RelatedURL": "http://www.ikea.com/hu/hu/store/soroksar/store_info",
        "DistanceUnit": 0
    },
    "Connections": [
        {
            "ID": 125794,
            "ConnectionTypeID": 25,
            "StatusTypeID": 50,
            "LevelID": 2,
            "Amps": 32,
            "Voltage": 400,
            "PowerKW": 22,
            "CurrentTypeID": 20,
            "Quantity": 4
        }
    ],
    "NumberOfPoints": 4,
    "StatusTypeID": 50,
    "DateLastStatusUpdate": "2017-06-17T13:27:00Z",
    "DataQualityLevel": 1,
    "DateCreated": "2017-06-08T13:39:00Z",
    "SubmissionStatusTypeID": 200
}