{
    "IsRecentlyVerified": false,
    "ID": 72012,
    "UUID": "F1F7D545-11D7-4231-B552-72624AAB0CC4",
    "DataProviderID": 1,
    "OperatorID": 20,
    "OperatorsReference": "30115",
    "UsageTypeID": 4,
    "UsageCost": "£1.00/charge admin fee",
    "AddressInfo": {
        "ID": 72358,
        "Title": "Stadium of Light Metro",
        "AddressLine1": "Newcastle Road",
        "Town": "Sunderland",
        "StateOrProvince": "Tyne and Wear",
        "Postcode": "SR5 1JE",
        "CountryID": 1,
        "Latitude": 54.918674,
        "Longitude": -1.383305,
        "DistanceUnit": 0
    },
    "Connections": [
        {
            "ID": 103257,
            "ConnectionTypeID": 3,
            "StatusTypeID": 50,
            "LevelID": 2,
            "Amps": 32,
            "Voltage": 230,
            "PowerKW": 3,
            "CurrentTypeID": 10,
            "Quantity": 1
        }
    ],
    "NumberOfPoints": 1,
    "StatusTypeID": 50,
    "DateLastStatusUpdate": "2017-10-25T05:16:00Z",
    "DataQualityLevel": 1,
    "DateCreated": "2016-09-28T11:33:00Z",
    "SubmissionStatusTypeID": 200
}