{
    "IsRecentlyVerified": false,
    "ID": 45876,
    "UUID": "1A405524-D641-48A3-81B7-52C517014863",
    "DataProviderID": 1,
    "DataProvidersReference": "2267",
    "OperatorID": 1,
    "AddressInfo": {
        "ID": 46222,
        "Title": "Fortum McD Örebro",
        "AddressLine1": "Västhagagatan 3",
        "Town": "ÖREBRO",
        "StateOrProvince": "ÖREBRO",
        "Postcode": "70346",
        "CountryID": 216,
        "Latitude": 59.27229,
        "Longitude": 15.17578,
        "AccessComments": "Laddstolpe på McDonalds parkering i Örebro.",
        "DistanceUnit": 0
    },
    "Connections": [
        {
            "ID": 56539,
            "ConnectionTypeID": 0,
            "Reference": "1",
            "LevelID": 2,
            "Amps": 100,
            "Voltage": 500,
            "PowerKW": 50,
            "Comments": "Mode 4"
        },
        {
            "ID": 84450,
            "ConnectionTypeID": 0,
            "Reference": "2",
            "LevelID": 2,
            "Amps": 100,
            "Voltage": 500,
            "PowerKW": 50,
            "Comments": "Mode 4"
        },
        {
            "ID": 88168,
            "ConnectionTypeID": 0,
            "Reference": "3",
            "LevelID": 2,
            "Amps": 32,
            "Voltage": 400,
            "PowerKW": 22,
            "Comments": "Mode 3"
        }
    ],
    "NumberOfPoints": 3,
    "StatusTypeID": 100,
    "DateLastStatusUpdate": "2021-01-06T15:45:00Z",
    "DataQualityLevel": 2,
    "DateCreated": "2015-05-03T00:54:00Z",
    "SubmissionStatusTypeID": 100
}