{
    "IsRecentlyVerified": false,
    "ID": 152811,
    "UUID": "0E058573-7C4D-492D-A034-B8FE8069184C",
    "DataProviderID": 28,
    "DataProvidersReference": "FR*S49*P49007*016",
    "UsageTypeID": 5,
    "AddressInfo": {
        "ID": 153164,
        "Title": "ANGERS - Rue De Rennes",
        "AddressLine1": "Rue De Rennes 49000 ANGERS",
        "CountryID": 80,
        "Latitude": 47.477254,
        "Longitude": -0.549208,
        "AccessComments": "24h/24 7j/7",
        "DistanceUnit": 0
    },
    "Connections": [
        {
            "ID": 214094,
            "ConnectionTypeID": 25,
            "StatusTypeID": 50,
            "LevelID": 2,
            "PowerKW": 18,
            "CurrentTypeID": 20
        },
        {
            "ID": 214095,
            "ConnectionTypeID": 28,
            "StatusTypeID": 50,
            "LevelID": 2,
            "PowerKW": 18,
            "CurrentTypeID": 10
        },
        {
            "ID": 247316,
            "ConnectionTypeID": 25,
            "StatusTypeID": 50,
            "LevelID": 2,
            "PowerKW": 18,
            "CurrentTypeID": 20
        },
        {
            "ID": 247317,
            "ConnectionTypeID": 28,
            "StatusTypeID": 50,
            "LevelID": 2,
            "PowerKW": 18,
            "CurrentTypeID": 10
        }
    ],
    "GeneralComments": "Recharge par badge et avec une application smartphone",
    "StatusTypeID": 50,
    "DateLastStatusUpdate": "2020-08-27T05:13:00Z",
    "DataQualityLevel": 2,
    "DateCreated": "2020-03-15T10:54:00Z",
    "SubmissionStatusTypeID": 100
}