{
    "IsRecentlyVerified": false,
    "ID": 48933,
    "UUID": "AA311914-52DB-4FD7-85C1-7CF6B705D90E",
    "DataProviderID": 1,
    "UsageTypeID": 1,
    "UsageCost": "free",
    "AddressInfo": {
        "ID": 49279,
        "Title": "Bükkábrány, Polgármesteri Hivatal",
        "AddressLine1": "II András tér 1.",
        "Town": "Bükkábrány",
        "StateOrProvince": "Borsod-Abaúj-Zemplén megye",
        "Postcode": "3422",
        "CountryID": 104,
        "Latitude": 47.887192,
        "Longitude": 20.683761,
        "AccessComments": "A működéshez RFID kártya szükséges. / RFID card is required for the operation.",
        "DistanceUnit": 0
    },
    "Connections": [
        {
            "ID": 60473,
            "ConnectionTypeID": 25,
            "StatusTypeID": 30,
            "LevelID": 2,
            "CurrentTypeID": 20,
            "Quantity": 1
        }
    ],
    "NumberOfPoints": 1,
    "StatusTypeID": 50,
    "DateLastStatusUpdate": "2015-07-06T11:03:00Z",
    "DataQualityLevel": 1,
    "DateCreated": "2015-07-06T11:03:00Z",
    "SubmissionStatusTypeID": 200
}