{
    "IsRecentlyVerified": false,
    "ID": 177910,
    "UUID": "92451E3A-9A76-4886-BC95-A83ED2C875B0",
    "DataProviderID": 29,
    "DataProvidersReference": "5873",
    "AddressInfo": {
        "ID": 178269,
        "Title": "Duisburger Str. 103",
        "AddressLine1": "Duisburger Str. 103",
        "Town": "Dinslaken",
        "Postcode": "46537",
        "CountryID": 87,
        "Latitude": 51.557456,
        "Longitude": 6.732027,
        "DistanceUnit": 0
    },
    "Connections": [
        {
            "ID": 277645,
            "ConnectionTypeID": 25,
            "StatusTypeID": 50,
            "LevelID": 2,
            "PowerKW": 22,
            "CurrentTypeID": 20
        },
        {
            "ID": 277646,
            "ConnectionTypeID": 1036,
            "StatusTypeID": 50,
            "LevelID": 2,
            "PowerKW": 22,
            "CurrentTypeID": 20
        },
        {
            "ID": 299647,
            "ConnectionTypeID": 25,
            "StatusTypeID": 50,
            "LevelID": 2,
            "PowerKW": 22,
            "CurrentTypeID": 20
        },
        {
            "ID": 299648,
            "ConnectionTypeID": 1036,
            "StatusTypeID": 50,
            "LevelID": 2,
            "PowerKW": 22,
            "CurrentTypeID": 20
        }
    ],
    "StatusTypeID": 0,
    "DateLastStatusUpdate": "2021-07-12T02:48:00Z",
    "MetadataValues": [
        {
            "ID": 10204,
            "MetadataFieldID": 4,
            "ItemValue": "Data from the German chargepoint registry provided by Bundesnetzagentur.de under the CC-BY 4.0 license"
        }
    ],
    "DataQualityLevel": 3,
    "DateCreated": "2021-07-08T09:49:00Z",
    "SubmissionStatusTypeID": 100
}