{
    "IsRecentlyVerified": false,
    "ID": 141729,
    "UUID": "93DB4882-FAF2-486F-8BDC-32C83834798B",
    "DataProviderID": 2,
    "DataProvidersReference": "78139",
    "OperatorID": 5,
    "UsageTypeID": 1,
    "AddressInfo": {
        "ID": 142081,
        "Title": "ROYAL FARMS",
        "AddressLine1": "6201 Pulaski Highway",
        "Town": "Baltimore",
        "StateOrProvince": "MD",
        "Postcode": "21205",
        "CountryID": 2,
        "Latitude": 39.3019263,
        "Longitude": -76.5438163,
        "ContactTelephone1": "888-758-4389",
        "AccessComments": "24 hours daily",
        "RelatedURL": "http://www.chargepoint.com/",
        "DistanceUnit": 0
    },
    "Connections": [
        {
            "ID": 197725,
            "ConnectionTypeID": 2,
            "LevelID": 3,
            "Amps": 100,
            "Voltage": 400,
            "PowerKW": 40,
            "CurrentTypeID": 30,
            "Quantity": 1
        },
        {
            "ID": 197726,
            "ConnectionTypeID": 32,
            "LevelID": 3,
            "Amps": 100,
            "Voltage": 400,
            "PowerKW": 40,
            "CurrentTypeID": 30,
            "Quantity": 1
        }
    ],
    "StatusTypeID": 50,
    "DateLastStatusUpdate": "2020-06-26T03:01:00Z",
    "DataQualityLevel": 3,
    "DateCreated": "2019-12-24T09:16:00Z",
    "SubmissionStatusTypeID": 100
}