{
    "IsRecentlyVerified": false,
    "ID": 135435,
    "UUID": "C821A42C-698F-4A9C-8FB7-898102EB99B0",
    "DataProviderID": 1,
    "OperatorID": 3404,
    "UsageTypeID": 1,
    "AddressInfo": {
        "ID": 135781,
        "Title": "Agencia ICE, Liberia",
        "AddressLine1": "Avenida 11",
        "AddressLine2": "Los Ángeles",
        "Town": "Liberia",
        "StateOrProvince": "Guanacaste",
        "Postcode": "50101",
        "CountryID": 58,
        "Latitude": 10.632849,
        "Longitude": -85.442635,
        "DistanceUnit": 0
    },
    "Connections": [
        {
            "ID": 189762,
            "ConnectionTypeID": 32,
            "StatusTypeID": 50,
            "LevelID": 3,
            "Amps": 50,
            "Voltage": 480,
            "PowerKW": 50,
            "CurrentTypeID": 30,
            "Quantity": 1
        },
        {
            "ID": 189763,
            "ConnectionTypeID": 2,
            "StatusTypeID": 50,
            "LevelID": 3,
            "Amps": 50,
            "Voltage": 480,
            "PowerKW": 50,
            "CurrentTypeID": 30,
            "Quantity": 1
        }
    ],
    "NumberOfPoints": 1,
    "StatusTypeID": 50,
    "DateLastStatusUpdate": "2021-01-06T09:06:00Z",
    "DataQualityLevel": 1,
    "DateCreated": "2019-12-20T21:35:00Z",
    "SubmissionStatusTypeID": 200
}