{
    "IsRecentlyVerified": false,
    "ID": 110351,
    "UUID": "7F000EA1-9B37-47A6-8FC3-88A0C6630EAA",
    "DataProviderID": 2,
    "DataProvidersReference": "100471",
    "OperatorID": 5,
    "UsageTypeID": 1,
    "AddressInfo": {
        "ID": 110697,
        "Title": "BLVD",
        "AddressLine1": "5875 Arnold Rd",
        "Town": "Dublin",
        "StateOrProvince": "CA",
        "Postcode": "94568",
        "CountryID": 2,
        "Latitude": 37.7116879,
        "Longitude": -121.8935408,
        "ContactTelephone1": "888-758-4389",
        "AccessComments": "24 hours daily",
        "RelatedURL": "http://www.chargepoint.com/",
        "DistanceUnit": 0
    },
    "Connections": [
        {
            "ID": 155596,
            "ConnectionTypeID": 1,
            "LevelID": 2,
            "Amps": 16,
            "Voltage": 230,
            "PowerKW": 3,
            "CurrentTypeID": 10,
            "Quantity": 2
        }
    ],
    "DateLastStatusUpdate": "2019-04-06T04:02:00Z",
    "DataQualityLevel": 3,
    "DateCreated": "2018-10-18T23:36:00Z",
    "SubmissionStatusTypeID": 100
}