{
    "IsRecentlyVerified": false,
    "ID": 142383,
    "UUID": "0E554C1E-FCAA-41F4-8840-CA79369A155C",
    "DataProviderID": 2,
    "DataProvidersReference": "123263",
    "OperatorID": 3372,
    "UsageTypeID": 1,
    "AddressInfo": {
        "ID": 142735,
        "Title": "Molloy College",
        "AddressLine1": "1000 Hempstead Ave",
        "Town": "Rockville Centre",
        "StateOrProvince": "NY",
        "Postcode": "11571",
        "CountryID": 2,
        "Latitude": 40.6861460999999,
        "Longitude": -73.6249835,
        "ContactTelephone1": "866-816-7584",
        "AccessComments": "24 hours daily",
        "RelatedURL": "http://evconnect.com/",
        "DistanceUnit": 0
    },
    "Connections": [
        {
            "ID": 198508,
            "ConnectionTypeID": 1,
            "LevelID": 2,
            "Amps": 16,
            "Voltage": 230,
            "PowerKW": 3.7,
            "CurrentTypeID": 10,
            "Quantity": 2
        }
    ],
    "StatusTypeID": 50,
    "DateLastStatusUpdate": "2020-06-26T03:03:00Z",
    "DataQualityLevel": 3,
    "DateCreated": "2019-12-24T09:17:00Z",
    "SubmissionStatusTypeID": 100
}