{
    "IsRecentlyVerified": false,
    "ID": 20208,
    "UUID": "926E8784-245A-426E-8824-21DD8810924F",
    "DataProviderID": 1,
    "OperatorID": 1,
    "UsageTypeID": 6,
    "UsageCost": "",
    "AddressInfo": {
        "ID": 20553,
        "Title": "Nissan - Mont de Marsan",
        "AddressLine1": "432 Rue de la Ferme de Carboue",
        "AddressLine2": "",
        "Town": "Mont-de-Marsan",
        "StateOrProvince": "",
        "Postcode": "40000",
        "CountryID": 80,
        "Latitude": 43.90449,
        "Longitude": -0.46833,
        "ContactTelephone1": "",
        "ContactTelephone2": "",
        "ContactEmail": "",
        "AccessComments": "Réservé aux clients de l'établissement",
        "RelatedURL": "",
        "DistanceUnit": 0
    },
    "Connections": [],
    "GeneralComments": "",
    "StatusTypeID": 50,
    "DateLastStatusUpdate": "2013-11-06T20:44:00Z",
    "DataQualityLevel": 1,
    "DateCreated": "2013-11-06T11:50:00Z",
    "SubmissionStatusTypeID": 200
}