{
    "IsRecentlyVerified": false,
    "ID": 139245,
    "UUID": "1FECC440-FE3B-472F-98F0-41BED426E02E",
    "DataProviderID": 2,
    "DataProvidersReference": "121555",
    "OperatorID": 15,
    "UsageTypeID": 4,
    "AddressInfo": {
        "ID": 139597,
        "Title": "Courtyard by Marriott Costa Mesa",
        "AddressLine1": "3002 S Harbor Blvd",
        "Town": "Santa Ana",
        "StateOrProvince": "CA",
        "Postcode": "92704",
        "CountryID": 2,
        "Latitude": 33.706839,
        "Longitude": -117.920023,
        "ContactTelephone1": "877-455-3833",
        "AccessComments": "24 hours daily\r\nPublic - Card key at all times",
        "RelatedURL": "https://www.evgo.com/",
        "DistanceUnit": 0
    },
    "Connections": [
        {
            "ID": 194534,
            "ConnectionTypeID": 2,
            "LevelID": 3,
            "Amps": 100,
            "Voltage": 400,
            "PowerKW": 40,
            "CurrentTypeID": 30,
            "Quantity": 1
        },
        {
            "ID": 194535,
            "ConnectionTypeID": 32,
            "LevelID": 3,
            "Amps": 100,
            "Voltage": 400,
            "PowerKW": 40,
            "CurrentTypeID": 30,
            "Quantity": 1
        }
    ],
    "StatusTypeID": 50,
    "DateLastStatusUpdate": "2020-06-26T02:55:00Z",
    "DataQualityLevel": 3,
    "DateCreated": "2019-12-24T09:10:00Z",
    "SubmissionStatusTypeID": 100
}