{
    "UserComments": [
        {
            "ID": 10269,
            "ChargePointID": 64536,
            "CommentTypeID": 10,
            "UserName": "Nurgus",
            "Comment": "It took me 2 attempts to detatch my cable from the machine. It really matters what order you do it in! No key or card needed and you get a reserved spot right at the front of this otherwise often full car park. Overall very good if you're shopping in Doncaster.",
            "Rating": 4,
            "DateCreated": "2016-05-01T11:58:55.347Z",
            "User": {
                "ID": 9198,
                "Username": "Nurgus"
            },
            "CheckinStatusTypeID": 10
        }
    ],
    "MediaItems": [
        {
            "ID": 6524,
            "ChargePointID": 64536,
            "ItemURL": "https://s3-ap-southeast-2.amazonaws.com/openchargemap/images/GB/OCM64536/OCM-64536.orig.2016052710065546.jpg",
            "ItemThumbnailURL": "https://s3-ap-southeast-2.amazonaws.com/openchargemap/images/GB/OCM64536/OCM-64536.thmb.2016052710065546.jpg",
            "Comment": "",
            "IsEnabled": true,
            "IsVideo": false,
            "IsFeaturedItem": false,
            "IsExternalResource": false,
            "User": {
                "ID": 9198,
                "Username": "Nurgus"
            },
            "DateCreated": "2016-05-27T10:07:00Z"
        }
    ],
    "IsRecentlyVerified": false,
    "ID": 64536,
    "UUID": "7FE42F28-194D-4E47-B57B-EE716032E226",
    "DataProviderID": 1,
    "OperatorID": 104,
    "UsageTypeID": 1,
    "UsageCost": "Free",
    "AddressInfo": {
        "ID": 64882,
        "Title": "Doncaster Market",
        "AddressLine1": "Church Way",
        "AddressLine2": "Hyde Park",
        "Town": "Doncaster",
        "Postcode": "DN1 1QZ",
        "CountryID": 1,
        "Latitude": 53.525983664386,
        "Longitude": -1.13276876983639,
        "AccessComments": "Max stay 2 hours",
        "RelatedURL": "http://www.evinmotion.co.uk/available-chargers.php",
        "DistanceUnit": 0
    },
    "Connections": [
        {
            "ID": 82876,
            "ConnectionTypeID": 25,
            "StatusTypeID": 50,
            "LevelID": 2,
            "Amps": 32,
            "Voltage": 400,
            "PowerKW": 22,
            "CurrentTypeID": 10,
            "Quantity": 2
        }
    ],
    "NumberOfPoints": 2,
    "StatusTypeID": 50,
    "DateLastStatusUpdate": "2016-05-27T10:07:00Z",
    "DataQualityLevel": 1,
    "DateCreated": "2016-03-09T16:13:00Z",
    "SubmissionStatusTypeID": 200
}