{
    "IsRecentlyVerified": false,
    "ID": 148131,
    "UUID": "52E6717D-5C25-4081-9D08-2EF0F454E188",
    "DataProviderID": 1,
    "OperatorID": 20,
    "OperatorsReference": "62017,62018,62037",
    "UsageTypeID": 2,
    "UsageCost": "",
    "AddressInfo": {
        "ID": 148483,
        "Title": "Askham Bar Park & Ride",
        "AddressLine1": "Askham Bar Park and Ride",
        "Town": "A64",
        "StateOrProvince": "York",
        "Postcode": "YO24 1LW",
        "CountryID": 1,
        "Latitude": 53.931580668176224,
        "Longitude": -1.11521839170382,
        "DistanceUnit": 0
    },
    "Connections": [
        {
            "ID": 256545,
            "ConnectionTypeID": 3,
            "StatusTypeID": 50,
            "Quantity": 1
        }
    ],
    "NumberOfPoints": 1,
    "StatusTypeID": 210,
    "DateLastStatusUpdate": "2020-10-05T19:21:00Z",
    "DataQualityLevel": 1,
    "DateCreated": "2020-01-26T06:14:00Z",
    "SubmissionStatusTypeID": 200
}