{
    "IsRecentlyVerified": false,
    "ID": 8177,
    "UUID": "CC197776-C9AA-4FD1-A8AE-81364D1C5131",
    "DataProviderID": 15,
    "DataProvidersReference": "6974",
    "OperatorID": 26,
    "UsageTypeID": 1,
    "AddressInfo": {
        "ID": 8074,
        "Title": "2627 Kendra Lane",
        "AddressLine1": "2627 Kendra Lane",
        "Town": "Lincoln",
        "StateOrProvince": "NE",
        "Postcode": "68512",
        "CountryID": 2,
        "Latitude": 40.73673,
        "Longitude": -96.68484,
        "ContactTelephone1": "(402) 464-6500 or (8",
        "RelatedURL": "http://carstations.com/6974",
        "DistanceUnit": 0
    },
    "Connections": [
        {
            "ID": 5606,
            "ConnectionTypeID": 1,
            "Reference": "J1772",
            "LevelID": 2
        }
    ],
    "NumberOfPoints": 2,
    "StatusTypeID": 0,
    "DateLastStatusUpdate": "2017-11-04T14:04:00Z",
    "DataQualityLevel": 1,
    "DateCreated": "2011-11-11T12:06:00Z",
    "SubmissionStatusTypeID": 100
}