{
    "IsRecentlyVerified": false,
    "ID": 94288,
    "UUID": "FF72F34A-13A4-40B7-9144-60254A6AA5CA",
    "DataProviderID": 2,
    "DataProvidersReference": "86705",
    "OperatorID": 5,
    "UsageTypeID": 1,
    "AddressInfo": {
        "ID": 94634,
        "Title": "VALLEY FAIR",
        "AddressLine1": "2855 Stevens Creek Blvd",
        "Town": "San Jose",
        "StateOrProvince": "CA",
        "Postcode": "95050",
        "CountryID": 2,
        "Latitude": 37.323664,
        "Longitude": -121.944472,
        "ContactTelephone1": "888-758-4389",
        "AccessComments": "24 hours daily",
        "RelatedURL": "http://www.chargepoint.com/",
        "DistanceUnit": 0
    },
    "Connections": [
        {
            "ID": 133387,
            "ConnectionTypeID": 1,
            "LevelID": 2,
            "Amps": 16,
            "Voltage": 230,
            "PowerKW": 3,
            "CurrentTypeID": 10,
            "Quantity": 4
        }
    ],
    "DateLastStatusUpdate": "2019-04-06T04:02:00Z",
    "DataQualityLevel": 3,
    "DateCreated": "2017-10-19T02:06:00Z",
    "SubmissionStatusTypeID": 100
}