{
    "IsRecentlyVerified": false,
    "ID": 18957,
    "UUID": "9E6D40FC-5E16-4170-8423-98CC75A2F1AC",
    "DataProviderID": 1,
    "OperatorID": 93,
    "OperatorsReference": "SC98",
    "UsageTypeID": 4,
    "AddressInfo": {
        "ID": 19302,
        "Title": "DRD Carpark  Harrier Way Ballyclare",
        "AddressLine1": "County Antrim",
        "Town": "Antrim",
        "Postcode": "BT39 9AA",
        "CountryID": 1,
        "Latitude": 54.7502,
        "Longitude": -5.9988,
        "DistanceUnit": 0
    },
    "Connections": [
        {
            "ID": 125759,
            "ConnectionTypeID": 25,
            "StatusTypeID": 50,
            "LevelID": 2,
            "Amps": 32,
            "Voltage": 400,
            "PowerKW": 22,
            "CurrentTypeID": 20,
            "Quantity": 2
        }
    ],
    "NumberOfPoints": 2,
    "StatusTypeID": 50,
    "DateLastStatusUpdate": "2019-06-04T06:00:00Z",
    "DataQualityLevel": 2,
    "DateCreated": "2013-09-05T03:51:00Z",
    "SubmissionStatusTypeID": 200
}