{
    "IsRecentlyVerified": false,
    "ID": 160478,
    "UUID": "D497607B-68C0-468B-9322-2A07098080AE",
    "DataProviderID": 2,
    "DataProvidersReference": "153071",
    "OperatorID": 90,
    "UsageTypeID": 1,
    "AddressInfo": {
        "ID": 160835,
        "Title": "BRCC - Victoriaville - Shell",
        "AddressLine1": "464 Notre-Dame Ouest",
        "Town": "Victoriaville",
        "StateOrProvince": "QC",
        "Postcode": "G6P 1S9",
        "CountryID": 44,
        "Latitude": 46.0584,
        "Longitude": -71.9706,
        "ContactTelephone1": "877-505-2674",
        "AccessComments": "24 hours daily",
        "RelatedURL": "https://lecircuitelectrique.com/",
        "DistanceUnit": 0
    },
    "Connections": [
        {
            "ID": 230898,
            "ConnectionTypeID": 2,
            "LevelID": 3,
            "Amps": 100,
            "Voltage": 400,
            "PowerKW": 40,
            "CurrentTypeID": 30,
            "Quantity": 1
        },
        {
            "ID": 230899,
            "ConnectionTypeID": 32,
            "LevelID": 3,
            "Amps": 100,
            "Voltage": 400,
            "PowerKW": 40,
            "CurrentTypeID": 30,
            "Quantity": 1
        }
    ],
    "StatusTypeID": 50,
    "DateLastStatusUpdate": "2020-06-26T03:10:00Z",
    "DataQualityLevel": 3,
    "DateCreated": "2020-06-26T03:10:00Z",
    "SubmissionStatusTypeID": 100
}