{
    "IsRecentlyVerified": false,
    "ID": 139277,
    "UUID": "849E4B68-4FEB-425E-81E2-5683D3E25062",
    "DataProviderID": 2,
    "DataProvidersReference": "146914",
    "OperatorID": 59,
    "UsageTypeID": 1,
    "AddressInfo": {
        "ID": 139629,
        "Title": "Greenlots - 12595",
        "AddressLine1": "1000 S Western Ave",
        "Town": "San Pedro",
        "StateOrProvince": "CA",
        "Postcode": "90732",
        "CountryID": 2,
        "Latitude": 33.7526817321777,
        "Longitude": -118.308776855469,
        "ContactTelephone1": "855-900-7584",
        "AccessComments": "24 hours daily",
        "RelatedURL": "http://greenlots.com/",
        "DistanceUnit": 0
    },
    "Connections": [
        {
            "ID": 194580,
            "ConnectionTypeID": 1,
            "LevelID": 2,
            "Amps": 16,
            "Voltage": 230,
            "PowerKW": 3.7,
            "CurrentTypeID": 10,
            "Quantity": 1
        }
    ],
    "StatusTypeID": 50,
    "DateLastStatusUpdate": "2020-06-26T02:56:00Z",
    "DataQualityLevel": 3,
    "DateCreated": "2019-12-24T09:10:00Z",
    "SubmissionStatusTypeID": 100
}