{
    "IsRecentlyVerified": false,
    "ID": 165120,
    "UUID": "A1DF8A7A-4979-4E6F-A4C9-A55993C92B29",
    "DataProviderID": 1,
    "OperatorID": 1,
    "UsageTypeID": 1,
    "UsageCost": "£0.85 Connection £0.25 kWh",
    "AddressInfo": {
        "ID": 165479,
        "Title": "Mount Street Car Park",
        "AddressLine1": "Mount Street",
        "Town": "Llanidloes",
        "StateOrProvince": "Powys",
        "Postcode": "SY18 6BZ",
        "CountryID": 1,
        "Latitude": 52.44769951399198,
        "Longitude": -3.5396362,
        "AccessComments": "///imprints.resettle.shield",
        "RelatedURL": "",
        "DistanceUnit": 0
    },
    "Connections": [
        {
            "ID": 236730,
            "ConnectionTypeID": 25,
            "StatusTypeID": 50,
            "LevelID": 2,
            "PowerKW": 22,
            "CurrentTypeID": 20,
            "Quantity": 4
        }
    ],
    "NumberOfPoints": 4,
    "StatusTypeID": 50,
    "DateLastStatusUpdate": "2020-08-25T22:57:00Z",
    "DataQualityLevel": 1,
    "DateCreated": "2020-08-25T17:52:00Z",
    "SubmissionStatusTypeID": 200
}