{
    "IsRecentlyVerified": false,
    "ID": 19996,
    "UUID": "2D23F796-B5B8-42B4-A4C6-DF5A4E75A02A",
    "DataProviderID": 1,
    "OperatorID": 19,
    "UsageTypeID": 1,
    "AddressInfo": {
        "ID": 20341,
        "Title": "Woodbury Park Hotel & Golf Club",
        "AddressLine1": "Woodbury Castle",
        "AddressLine2": "Woodbury",
        "Town": "Exeter",
        "StateOrProvince": "Devon",
        "Postcode": "EX5 1JJ",
        "CountryID": 1,
        "Latitude": 50.685887,
        "Longitude": -3.36856,
        "ContactTelephone1": "01395 233382  ",
        "ContactEmail": "reception1@woodburypark.co.uk",
        "RelatedURL": "http://www.woodburypark.co.uk",
        "DistanceUnit": 0
    },
    "Connections": [
        {
            "ID": 19975,
            "ConnectionTypeID": 3,
            "StatusTypeID": 50,
            "LevelID": 2,
            "Amps": 13,
            "Voltage": 230,
            "PowerKW": 3,
            "CurrentTypeID": 10,
            "Quantity": 1
        },
        {
            "ID": 19976,
            "ConnectionTypeID": 25,
            "StatusTypeID": 50,
            "LevelID": 2,
            "Amps": 32,
            "Voltage": 230,
            "PowerKW": 7,
            "CurrentTypeID": 10,
            "Quantity": 1
        }
    ],
    "NumberOfPoints": 2,
    "StatusTypeID": 50,
    "DateLastStatusUpdate": "2014-12-21T12:28:00Z",
    "DataQualityLevel": 1,
    "DateCreated": "2013-10-24T04:12:00Z",
    "SubmissionStatusTypeID": 200
}