{
    "IsRecentlyVerified": false,
    "ID": 177639,
    "UUID": "BEC0A55D-D67F-49CC-93A0-447CD54AE0A5",
    "DataProviderID": 29,
    "DataProvidersReference": "12554,15411,17676",
    "AddressInfo": {
        "ID": 177998,
        "Title": "Bahnhofstraße",
        "AddressLine1": "Bahnhofstraße",
        "Town": "Simbach am Inn",
        "Postcode": "84359",
        "CountryID": 87,
        "Latitude": 48.263992,
        "Longitude": 13.024844,
        "DistanceUnit": 0
    },
    "Connections": [
        {
            "ID": 277014,
            "ConnectionTypeID": 25,
            "StatusTypeID": 50,
            "LevelID": 2,
            "PowerKW": 22,
            "CurrentTypeID": 20
        },
        {
            "ID": 277015,
            "ConnectionTypeID": 25,
            "StatusTypeID": 50,
            "LevelID": 2,
            "PowerKW": 22,
            "CurrentTypeID": 20
        },
        {
            "ID": 277016,
            "ConnectionTypeID": 25,
            "StatusTypeID": 50,
            "LevelID": 2,
            "PowerKW": 22,
            "CurrentTypeID": 20
        },
        {
            "ID": 277017,
            "ConnectionTypeID": 25,
            "StatusTypeID": 50,
            "LevelID": 2,
            "PowerKW": 22,
            "CurrentTypeID": 20
        },
        {
            "ID": 277018,
            "ConnectionTypeID": 25,
            "StatusTypeID": 50,
            "LevelID": 2,
            "PowerKW": 22,
            "CurrentTypeID": 20
        },
        {
            "ID": 277019,
            "ConnectionTypeID": 25,
            "StatusTypeID": 50,
            "LevelID": 2,
            "PowerKW": 22,
            "CurrentTypeID": 20
        }
    ],
    "StatusTypeID": 0,
    "DateLastStatusUpdate": "2021-07-09T03:12:00Z",
    "MetadataValues": [
        {
            "ID": 9933,
            "MetadataFieldID": 4,
            "ItemValue": "Data from the German chargepoint registry provided by Bundesnetzagentur.de under the CC-BY 4.0 license"
        }
    ],
    "DataQualityLevel": 3,
    "DateCreated": "2021-07-08T09:49:00Z",
    "SubmissionStatusTypeID": 100
}