{
    "IsRecentlyVerified": false,
    "ID": 65437,
    "UUID": "8ECFF8A7-214B-473D-B633-517D66CB4A42",
    "DataProviderID": 26,
    "DataProvidersReference": "85307",
    "OperatorID": 179,
    "OperatorsReference": "Ecotap 1701400",
    "UsageCost": "0.00 afhankelijk van pas",
    "AddressInfo": {
        "ID": 65783,
        "Title": "Bredaseweg",
        "AddressLine1": "Bredaseweg",
        "Town": "Tilburg",
        "Postcode": "5037 GG",
        "CountryID": 159,
        "Latitude": 51.559644,
        "Longitude": 5.035166,
        "RelatedURL": "http://www.ecotap.nl",
        "DistanceUnit": 0
    },
    "Connections": [
        {
            "ID": 90170,
            "ConnectionTypeID": 25,
            "LevelID": 2,
            "PowerKW": 22,
            "CurrentTypeID": 10
        }
    ],
    "NumberOfPoints": 2,
    "StatusTypeID": 50,
    "DateLastStatusUpdate": "2016-06-04T02:39:00Z",
    "DataQualityLevel": 3,
    "DateCreated": "2016-04-27T09:41:00Z",
    "SubmissionStatusTypeID": 100
}