{
    "IsRecentlyVerified": false,
    "ID": 179629,
    "UUID": "83959528-49D8-4919-9888-814980DAED7C",
    "DataProviderID": 29,
    "DataProvidersReference": "12882,12248,18689",
    "OperatorID": 3403,
    "AddressInfo": {
        "ID": 179988,
        "Title": "Viktor-Koch-Straße 4",
        "AddressLine1": "Viktor-Koch-Straße 4",
        "Town": "Schwarzenfeld",
        "Postcode": "92521",
        "CountryID": 87,
        "Latitude": 49.38931,
        "Longitude": 12.13557,
        "DistanceUnit": 0
    },
    "Connections": [
        {
            "ID": 281696,
            "ConnectionTypeID": 25,
            "StatusTypeID": 50,
            "LevelID": 2,
            "PowerKW": 11,
            "CurrentTypeID": 20
        },
        {
            "ID": 281697,
            "ConnectionTypeID": 25,
            "StatusTypeID": 50,
            "LevelID": 2,
            "PowerKW": 22,
            "CurrentTypeID": 20
        },
        {
            "ID": 281698,
            "ConnectionTypeID": 25,
            "StatusTypeID": 50,
            "LevelID": 2,
            "PowerKW": 11,
            "CurrentTypeID": 20
        },
        {
            "ID": 281699,
            "ConnectionTypeID": 25,
            "StatusTypeID": 50,
            "LevelID": 2,
            "PowerKW": 22,
            "CurrentTypeID": 20
        },
        {
            "ID": 281700,
            "ConnectionTypeID": 25,
            "StatusTypeID": 50,
            "LevelID": 2,
            "PowerKW": 11,
            "CurrentTypeID": 20
        },
        {
            "ID": 281701,
            "ConnectionTypeID": 25,
            "StatusTypeID": 50,
            "LevelID": 2,
            "PowerKW": 22,
            "CurrentTypeID": 20
        }
    ],
    "StatusTypeID": 50,
    "DateLastStatusUpdate": "2021-07-09T03:16:00Z",
    "MetadataValues": [
        {
            "ID": 11923,
            "MetadataFieldID": 4,
            "ItemValue": "Data from the German chargepoint registry provided by Bundesnetzagentur.de under the CC-BY 4.0 license"
        }
    ],
    "DataQualityLevel": 3,
    "DateCreated": "2021-07-08T09:59:00Z",
    "SubmissionStatusTypeID": 100
}