{
    "IsRecentlyVerified": false,
    "ID": 9573,
    "UUID": "37800B42-3DC4-4D77-BEF0-4CE38568B235",
    "DataProviderID": 15,
    "DataProvidersReference": "15058",
    "OperatorID": 5,
    "AddressInfo": {
        "ID": 9470,
        "Title": "4201 Ed Bluestein Blvd",
        "AddressLine1": "4201 Ed Bluestein Blvd",
        "Town": "Austin",
        "StateOrProvince": "Texas",
        "Postcode": "78725",
        "CountryID": 2,
        "Latitude": 30.27768135,
        "Longitude": -97.66633606,
        "ContactTelephone1": "",
        "RelatedURL": "http://carstations.com/15058",
        "DistanceUnit": 0
    },
    "Connections": [
        {
            "ID": 7281,
            "ConnectionTypeID": 1,
            "Reference": "J1772",
            "LevelID": 2
        },
        {
            "ID": 8339,
            "ConnectionTypeID": 9,
            "Reference": "NEMA5",
            "LevelID": 1,
            "Quantity": 1
        }
    ],
    "StatusTypeID": 0,
    "DateLastStatusUpdate": "2017-11-04T14:03:00Z",
    "DataQualityLevel": 2,
    "DateCreated": "2012-02-26T15:07:00Z",
    "SubmissionStatusTypeID": 100
}