{
    "IsRecentlyVerified": false,
    "ID": 118012,
    "UUID": "3B97C62A-BE2D-451E-B6C4-C9CC95A4D3A1",
    "DataProviderID": 1,
    "OperatorID": 23,
    "OperatorsReference": "28610",
    "UsageTypeID": 4,
    "UsageCost": "$0.24/min >=60kW; $0.12/min <60kW; other tariffs for older cars",
    "AddressInfo": {
        "ID": 118358,
        "Title": "Parsippany, NJ Supercharger",
        "AddressLine1": "350 New Road",
        "Town": "Parsippany",
        "StateOrProvince": "NJ",
        "Postcode": "07054",
        "CountryID": 2,
        "Latitude": 40.849718,
        "Longitude": -74.351359,
        "DistanceUnit": 0
    },
    "Connections": [
        {
            "ID": 167031,
            "ConnectionTypeID": 27,
            "StatusTypeID": 50,
            "LevelID": 3,
            "PowerKW": 120,
            "CurrentTypeID": 30,
            "Quantity": 8
        }
    ],
    "NumberOfPoints": 8,
    "GeneralComments": "Charging8 Superchargers, available 24/7, up to 120kW",
    "StatusTypeID": 50,
    "DateLastStatusUpdate": "2019-03-14T23:14:00Z",
    "DataQualityLevel": 1,
    "DateCreated": "2019-03-14T23:14:00Z",
    "SubmissionStatusTypeID": 200
}