{
    "IsRecentlyVerified": false,
    "ID": 173331,
    "UUID": "D5194A08-1CD2-4026-A639-0444AC3C6092",
    "DataProviderID": 18,
    "DataProvidersReference": "42cbaece0f8e48e7b8c957679e2402c8",
    "OperatorID": 2244,
    "UsageTypeID": 1,
    "AddressInfo": {
        "ID": 173690,
        "Title": "3 Asmara Road",
        "AddressLine1": "3 Asmara Road",
        "Town": "London",
        "Postcode": "NW2 3SS",
        "CountryID": 1,
        "Latitude": -0.205322,
        "Longitude": 51.553684,
        "AccessComments": "",
        "RelatedURL": "https://www.ubitricity.com",
        "DistanceUnit": 0
    },
    "Connections": [
        {
            "ID": 266356,
            "ConnectionTypeID": 25,
            "Reference": "suby1100005149",
            "StatusTypeID": 50,
            "LevelID": 2,
            "Amps": 16,
            "Voltage": 230,
            "PowerKW": 3.7,
            "CurrentTypeID": 10
        }
    ],
    "StatusTypeID": 0,
    "DateLastStatusUpdate": "2021-07-12T03:38:00Z",
    "MetadataValues": [
        {
            "ID": 8253,
            "MetadataFieldID": 4,
            "ItemValue": "Contains public sector information licensed under the Open Government Licence v2.0. http://www.nationalarchives.gov.uk/doc/open-government-licence/version/2/"
        }
    ],
    "DataQualityLevel": 3,
    "DateCreated": "2021-03-03T11:24:00Z",
    "SubmissionStatusTypeID": 100
}