{
    "IsRecentlyVerified": false,
    "ID": 89865,
    "UUID": "D38238B8-627F-4861-913A-2DFAC079069E",
    "DataProviderID": 1,
    "OperatorID": 1,
    "UsageTypeID": 1,
    "UsageCost": "Free",
    "AddressInfo": {
        "ID": 90211,
        "Title": "Stadtplatz Klosterneuburg",
        "AddressLine1": "Stadtplatz 16",
        "Town": "Klosterneuburg",
        "CountryID": 19,
        "Latitude": 48.3098486,
        "Longitude": 16.3239629,
        "DistanceUnit": 0
    },
    "Connections": [
        {
            "ID": 127391,
            "ConnectionTypeID": 25,
            "StatusTypeID": 50,
            "LevelID": 2,
            "Amps": 32,
            "Voltage": 400,
            "PowerKW": 22,
            "CurrentTypeID": 20,
            "Quantity": 1
        },
        {
            "ID": 127392,
            "ConnectionTypeID": 4,
            "StatusTypeID": 50,
            "LevelID": 2,
            "Amps": 16,
            "Voltage": 230,
            "PowerKW": 3.6,
            "CurrentTypeID": 10,
            "Quantity": 1
        },
        {
            "ID": 127393,
            "ConnectionTypeID": 28,
            "StatusTypeID": 50,
            "LevelID": 2,
            "Amps": 16,
            "Voltage": 230,
            "PowerKW": 3.6,
            "CurrentTypeID": 10,
            "Quantity": 2
        }
    ],
    "NumberOfPoints": 1,
    "StatusTypeID": 50,
    "DateLastStatusUpdate": "2017-06-27T17:09:00Z",
    "DataQualityLevel": 1,
    "DateCreated": "2017-06-27T13:11:00Z",
    "SubmissionStatusTypeID": 200
}