{
    "IsRecentlyVerified": false,
    "ID": 168523,
    "UUID": "0025B327-DC68-4730-8559-2DF7443AB26E",
    "DataProviderID": 1,
    "OperatorID": 32,
    "UsageTypeID": 5,
    "UsageCost": "£0.30/kWh (Contactless Payment); £0.15/kWh (Polar Plus subscription); £0.25/kWh (Polar Instant app)",
    "AddressInfo": {
        "ID": 168882,
        "Title": "Hailgate Car Park",
        "AddressLine1": "Charles Briggs Avenue",
        "Town": "Howden",
        "StateOrProvince": "UK",
        "Postcode": " DN14 7GQ",
        "CountryID": 1,
        "Latitude": 53.74548323279842,
        "Longitude": -0.8644028410367355,
        "ContactTelephone1": "    0330 016 5126",
        "DistanceUnit": 0
    },
    "Connections": [
        {
            "ID": 255949,
            "ConnectionTypeID": 33,
            "StatusTypeID": 50,
            "LevelID": 3,
            "PowerKW": 50,
            "CurrentTypeID": 30,
            "Quantity": 1
        },
        {
            "ID": 255950,
            "ConnectionTypeID": 2,
            "StatusTypeID": 50,
            "LevelID": 3,
            "PowerKW": 50,
            "CurrentTypeID": 30,
            "Quantity": 1
        },
        {
            "ID": 255951,
            "ConnectionTypeID": 1036,
            "StatusTypeID": 50,
            "LevelID": 3,
            "PowerKW": 43,
            "CurrentTypeID": 20,
            "Quantity": 1
        }
    ],
    "NumberOfPoints": 1,
    "GeneralComments": "Free Parking While Charging",
    "StatusTypeID": 50,
    "DateLastStatusUpdate": "2020-09-30T20:16:00Z",
    "DataQualityLevel": 1,
    "DateCreated": "2020-09-30T16:24:00Z",
    "SubmissionStatusTypeID": 200
}