{
    "IsRecentlyVerified": false,
    "ID": 65486,
    "UUID": "B176F723-9560-4165-BDB1-BEC14BDC0BB6",
    "DataProviderID": 26,
    "DataProvidersReference": "86155",
    "OperatorID": 103,
    "OperatorsReference": "Allego NLALLEGO0010381",
    "UsageCost": "0.00 jaarabonnement",
    "AddressInfo": {
        "ID": 65832,
        "Title": "Pieter de Hooghlaan 29",
        "AddressLine1": "Pieter de Hooghlaan 29",
        "Town": "Oud-Beijerland",
        "Postcode": "3262 RD",
        "CountryID": 159,
        "Latitude": 51.81741274,
        "Longitude": 4.41114551,
        "ContactTelephone1": "0800-3745337",
        "RelatedURL": "http://www.allego.eu/",
        "DistanceUnit": 0
    },
    "Connections": [
        {
            "ID": 90250,
            "ConnectionTypeID": 25,
            "LevelID": 2,
            "PowerKW": 11,
            "CurrentTypeID": 10
        },
        {
            "ID": 90251,
            "ConnectionTypeID": 25,
            "LevelID": 2,
            "PowerKW": 11,
            "CurrentTypeID": 10
        }
    ],
    "NumberOfPoints": 1,
    "StatusTypeID": 50,
    "DateLastStatusUpdate": "2016-06-04T02:40:00Z",
    "DataQualityLevel": 3,
    "DateCreated": "2016-04-27T09:41:00Z",
    "SubmissionStatusTypeID": 100
}