{
    "IsRecentlyVerified": false,
    "ID": 97417,
    "UUID": "0FE46307-B8E7-45A4-A7D5-E1FEEEB63F17",
    "DataProviderID": 1,
    "OperatorID": 23,
    "OperatorsReference": "38842",
    "UsageTypeID": 4,
    "AddressInfo": {
        "ID": 97763,
        "Title": "Centre Commercial les Eléis",
        "AddressLine1": "Quai de l'Entrepôt",
        "Town": "Cherbourg-en-Cotentin",
        "Postcode": "50100",
        "CountryID": 80,
        "Latitude": 49.634823,
        "Longitude": -1.617891,
        "ContactTelephone1": "+33 2 33 71 62 80",
        "DistanceUnit": 0
    },
    "Connections": [
        {
            "ID": 138324,
            "ConnectionTypeID": 30,
            "StatusTypeID": 50,
            "LevelID": 2,
            "Amps": 32,
            "Voltage": 230,
            "PowerKW": 14,
            "CurrentTypeID": 20,
            "Quantity": 2
        }
    ],
    "NumberOfPoints": 2,
    "GeneralComments": "2 Tesla Connectors, up to 14kW.Available to the public. Self park.",
    "StatusTypeID": 50,
    "DateLastStatusUpdate": "2018-10-03T20:40:00Z",
    "DataQualityLevel": 1,
    "DateCreated": "2018-01-21T15:22:00Z",
    "SubmissionStatusTypeID": 200
}