{
    "IsRecentlyVerified": false,
    "ID": 109140,
    "UUID": "2CB30FF1-9742-4A68-967E-4557E7D94E06",
    "DataProviderID": 1,
    "OperatorID": 23,
    "OperatorsReference": "44977",
    "UsageTypeID": 4,
    "AddressInfo": {
        "ID": 109486,
        "Title": "The Steam Hotel",
        "AddressLine1": "Ångkraftsvägen 14",
        "StateOrProvince": "Västerås",
        "Postcode": "721 31",
        "CountryID": 216,
        "Latitude": 59.607897,
        "Longitude": 16.568372,
        "ContactTelephone1": " +46 214759900",
        "DistanceUnit": 0
    },
    "Connections": [
        {
            "ID": 154258,
            "ConnectionTypeID": 30,
            "StatusTypeID": 50,
            "LevelID": 2,
            "Amps": 32,
            "Voltage": 400,
            "PowerKW": 22,
            "CurrentTypeID": 20,
            "Quantity": 2
        }
    ],
    "NumberOfPoints": 2,
    "GeneralComments": "2 Tesla Connectors, up to 22kW.Available for customers. Please call ahead.",
    "StatusTypeID": 50,
    "DateLastStatusUpdate": "2018-10-11T13:44:00Z",
    "DataQualityLevel": 1,
    "DateCreated": "2018-10-11T13:44:00Z",
    "SubmissionStatusTypeID": 200
}