{
    "IsRecentlyVerified": false,
    "ID": 71607,
    "UUID": "24B03826-C7A8-4B62-9778-50DD2AEDD55C",
    "DataProviderID": 2,
    "DataProvidersReference": "78241",
    "OperatorID": 5,
    "UsageTypeID": 1,
    "AddressInfo": {
        "ID": 71953,
        "Title": "LUTHER WESTSIDE",
        "AddressLine1": "2370 Hwy 100 S",
        "Town": "Saint Louis Park",
        "StateOrProvince": "MN",
        "Postcode": "55416",
        "CountryID": 2,
        "Latitude": 44.9600821,
        "Longitude": -93.3462198,
        "ContactTelephone1": "888-758-4389",
        "AccessComments": "24 hours daily",
        "RelatedURL": "http://www.chargepoint.com/",
        "DistanceUnit": 0
    },
    "Connections": [
        {
            "ID": 102435,
            "ConnectionTypeID": 1,
            "LevelID": 2,
            "Amps": 16,
            "Voltage": 230,
            "PowerKW": 3.7,
            "CurrentTypeID": 10,
            "Quantity": 2
        }
    ],
    "DateLastStatusUpdate": "2020-06-26T03:08:00Z",
    "DataQualityLevel": 3,
    "DateCreated": "2016-09-02T10:15:00Z",
    "SubmissionStatusTypeID": 100
}