{
    "IsRecentlyVerified": false,
    "ID": 87632,
    "UUID": "6322BFE1-1373-4442-9284-77FE56375414",
    "DataProviderID": 1,
    "OperatorID": 105,
    "UsageTypeID": 4,
    "AddressInfo": {
        "ID": 87978,
        "Title": "Santander Bank",
        "AddressLine1": "Santander-Platz 1",
        "Town": "Mönchengladbach",
        "StateOrProvince": "Mönchengladbach",
        "Postcode": "41061",
        "CountryID": 87,
        "Latitude": 51.19537607763734,
        "Longitude": 6.424127357672087,
        "AccessComments": "24/7 nutzbar",
        "DistanceUnit": 0
    },
    "Connections": [
        {
            "ID": 124230,
            "ConnectionTypeID": 2,
            "StatusTypeID": 100,
            "LevelID": 3,
            "Amps": 50,
            "Voltage": 400,
            "PowerKW": 50,
            "CurrentTypeID": 30,
            "Quantity": 1
        },
        {
            "ID": 124231,
            "ConnectionTypeID": 1036,
            "StatusTypeID": 100,
            "LevelID": 3,
            "Amps": 63,
            "Voltage": 400,
            "PowerKW": 43,
            "CurrentTypeID": 20,
            "Quantity": 1
        },
        {
            "ID": 124232,
            "ConnectionTypeID": 33,
            "StatusTypeID": 100,
            "LevelID": 3,
            "Amps": 63,
            "Voltage": 400,
            "PowerKW": 50,
            "CurrentTypeID": 30
        }
    ],
    "NumberOfPoints": 3,
    "StatusTypeID": 100,
    "DateLastStatusUpdate": "2017-05-15T06:38:00Z",
    "DataQualityLevel": 1,
    "DateCreated": "2017-05-15T06:38:00Z",
    "SubmissionStatusTypeID": 200
}