{
    "IsRecentlyVerified": false,
    "ID": 101063,
    "UUID": "B8D792EE-C78E-4918-98A9-EDDA7D763C69",
    "DataProviderID": 1,
    "OperatorID": 23,
    "OperatorsReference": "41526",
    "UsageTypeID": 4,
    "AddressInfo": {
        "ID": 101409,
        "Title": "Espace Montagne Grenoble",
        "AddressLine1": "5 Rue Charles Darwin - Zac Porte du Gresivaudan",
        "Town": "Saint-Martin-d'Heres",
        "Postcode": "38400",
        "CountryID": 80,
        "Latitude": 45.182658,
        "Longitude": 5.771293,
        "ContactTelephone1": "+33 4 38 37 40 40",
        "DistanceUnit": 0
    },
    "Connections": [
        {
            "ID": 142691,
            "ConnectionTypeID": 30,
            "StatusTypeID": 50,
            "LevelID": 2,
            "Amps": 16,
            "Voltage": 400,
            "PowerKW": 11,
            "CurrentTypeID": 20,
            "Quantity": 2
        }
    ],
    "NumberOfPoints": 2,
    "GeneralComments": "2 Tesla Connectors, up to 11kW.Available for customers. Self park.",
    "StatusTypeID": 50,
    "DateLastStatusUpdate": "2018-10-03T21:54:00Z",
    "DataQualityLevel": 1,
    "DateCreated": "2018-03-17T07:02:00Z",
    "SubmissionStatusTypeID": 200
}