{
    "IsRecentlyVerified": false,
    "ID": 166663,
    "UUID": "E1270511-BB3C-4107-BC45-BAE6B8C66E3A",
    "DataProviderID": 28,
    "DataProvidersReference": "FR*SIP*P92044*001",
    "OperatorID": 3410,
    "UsageTypeID": 5,
    "AddressInfo": {
        "ID": 167022,
        "Title": "LEVALLOIS PERRET - Place de la République",
        "AddressLine1": "Place de la République 92300 LEVALLOIS PERRET",
        "CountryID": 80,
        "Latitude": 48.893227,
        "Longitude": 2.288733,
        "AccessComments": "24h/24 7j/7",
        "DistanceUnit": 0
    },
    "Connections": [
        {
            "ID": 250534,
            "ConnectionTypeID": 1036,
            "StatusTypeID": 50,
            "LevelID": 2,
            "PowerKW": 22,
            "CurrentTypeID": 20
        },
        {
            "ID": 250535,
            "ConnectionTypeID": 28,
            "StatusTypeID": 50,
            "LevelID": 2,
            "PowerKW": 22,
            "CurrentTypeID": 10
        },
        {
            "ID": 250536,
            "ConnectionTypeID": 1036,
            "StatusTypeID": 50,
            "LevelID": 2,
            "PowerKW": 22,
            "CurrentTypeID": 20
        },
        {
            "ID": 250537,
            "ConnectionTypeID": 28,
            "StatusTypeID": 50,
            "LevelID": 2,
            "PowerKW": 22,
            "CurrentTypeID": 10
        }
    ],
    "GeneralComments": "Recharge par badge et avec une application smartphone",
    "StatusTypeID": 50,
    "DateLastStatusUpdate": "2020-08-27T05:15:00Z",
    "DataQualityLevel": 2,
    "DateCreated": "2020-08-27T05:15:00Z",
    "SubmissionStatusTypeID": 100
}