{
    "IsRecentlyVerified": false,
    "ID": 20193,
    "UUID": "8331F130-E4E1-45A5-A916-5C75DD74D850",
    "DataProviderID": 1,
    "OperatorID": 1,
    "UsageTypeID": 7,
    "UsageCost": "",
    "AddressInfo": {
        "ID": 20538,
        "Title": "Mairie de Bordeaux - Annexe",
        "AddressLine1": "2 Rue Joseph de Carayon Latour",
        "AddressLine2": "",
        "Town": "Bordeaux",
        "StateOrProvince": "",
        "Postcode": "33000",
        "CountryID": 80,
        "Latitude": 44.8372,
        "Longitude": -0.58125,
        "ContactTelephone1": "",
        "ContactTelephone2": "",
        "ContactEmail": "",
        "AccessComments": "Réservé aux personnes identifiées",
        "RelatedURL": "",
        "DistanceUnit": 0
    },
    "Connections": [],
    "GeneralComments": "",
    "StatusTypeID": 50,
    "DateLastStatusUpdate": "2013-11-06T19:58:00Z",
    "DataQualityLevel": 1,
    "DateCreated": "2013-11-06T11:50:00Z",
    "SubmissionStatusTypeID": 200
}