{
    "IsRecentlyVerified": false,
    "ID": 180111,
    "UUID": "B269E536-4572-413A-9D88-45ECE3ED0E1F",
    "DataProviderID": 29,
    "DataProvidersReference": "13406",
    "AddressInfo": {
        "ID": 180470,
        "Title": "Mergentheimer Str.",
        "AddressLine1": "Mergentheimer Str.",
        "Town": "Kirchheim",
        "Postcode": "97268",
        "CountryID": 87,
        "Latitude": 49.651369,
        "Longitude": 9.854235,
        "DistanceUnit": 0
    },
    "Connections": [
        {
            "ID": 282793,
            "ConnectionTypeID": 25,
            "StatusTypeID": 50,
            "LevelID": 2,
            "PowerKW": 22,
            "CurrentTypeID": 20
        },
        {
            "ID": 282794,
            "ConnectionTypeID": 25,
            "StatusTypeID": 50,
            "LevelID": 2,
            "PowerKW": 22,
            "CurrentTypeID": 20
        }
    ],
    "StatusTypeID": 50,
    "DateLastStatusUpdate": "2021-07-09T03:17:00Z",
    "MetadataValues": [
        {
            "ID": 12405,
            "MetadataFieldID": 4,
            "ItemValue": "Data from the German chargepoint registry provided by Bundesnetzagentur.de under the CC-BY 4.0 license"
        }
    ],
    "DataQualityLevel": 3,
    "DateCreated": "2021-07-08T10:00:00Z",
    "SubmissionStatusTypeID": 100
}