{
    "MediaItems": [
        {
            "ID": 9145,
            "ChargePointID": 57198,
            "ItemURL": "https://s3-ap-southeast-2.amazonaws.com/openchargemap/images/IT/OCM57198/OCM-57198.orig.2017011515473314.jpg",
            "ItemThumbnailURL": "https://s3-ap-southeast-2.amazonaws.com/openchargemap/images/IT/OCM57198/OCM-57198.thmb.2017011515473314.jpg",
            "Comment": "",
            "IsEnabled": true,
            "IsVideo": false,
            "IsFeaturedItem": false,
            "IsExternalResource": false,
            "User": {
                "ID": 12207,
                "Username": "aldodal"
            },
            "DateCreated": "2017-01-15T15:48:00Z"
        },
        {
            "ID": 9146,
            "ChargePointID": 57198,
            "ItemURL": "https://s3-ap-southeast-2.amazonaws.com/openchargemap/images/IT/OCM57198/OCM-57198.orig.2017011515474871.jpg",
            "ItemThumbnailURL": "https://s3-ap-southeast-2.amazonaws.com/openchargemap/images/IT/OCM57198/OCM-57198.thmb.2017011515474871.jpg",
            "Comment": "",
            "IsEnabled": true,
            "IsVideo": false,
            "IsFeaturedItem": false,
            "IsExternalResource": false,
            "User": {
                "ID": 12207,
                "Username": "aldodal"
            },
            "DateCreated": "2017-01-15T15:48:00Z"
        },
        {
            "ID": 9147,
            "ChargePointID": 57198,
            "ItemURL": "https://s3-ap-southeast-2.amazonaws.com/openchargemap/images/IT/OCM57198/OCM-57198.orig.2017011515480142.jpg",
            "ItemThumbnailURL": "https://s3-ap-southeast-2.amazonaws.com/openchargemap/images/IT/OCM57198/OCM-57198.thmb.2017011515480142.jpg",
            "Comment": "",
            "IsEnabled": true,
            "IsVideo": false,
            "IsFeaturedItem": false,
            "IsExternalResource": false,
            "User": {
                "ID": 12207,
                "Username": "aldodal"
            },
            "DateCreated": "2017-01-15T15:48:00Z"
        },
        {
            "ID": 9148,
            "ChargePointID": 57198,
            "ItemURL": "https://s3-ap-southeast-2.amazonaws.com/openchargemap/images/IT/OCM57198/OCM-57198.orig.2017011515481341.jpg",
            "ItemThumbnailURL": "https://s3-ap-southeast-2.amazonaws.com/openchargemap/images/IT/OCM57198/OCM-57198.thmb.2017011515481341.jpg",
            "Comment": "",
            "IsEnabled": true,
            "IsVideo": false,
            "IsFeaturedItem": false,
            "IsExternalResource": false,
            "User": {
                "ID": 12207,
                "Username": "aldodal"
            },
            "DateCreated": "2017-01-15T15:48:00Z"
        }
    ],
    "IsRecentlyVerified": false,
    "ID": 57198,
    "UUID": "955500BB-2363-4F60-BD5E-80546179D137",
    "DataProviderID": 1,
    "OperatorID": 1,
    "UsageTypeID": 1,
    "UsageCost": "15€ cauzione tessera",
    "AddressInfo": {
        "ID": 57544,
        "Title": "APS Obrizzi",
        "AddressLine1": "Largo degli Obizzi",
        "Town": "Albignasego ",
        "StateOrProvince": "PD",
        "Postcode": "35125",
        "CountryID": 112,
        "Latitude": 45.344504946312625,
        "Longitude": 11.867913163012211,
        "ContactTelephone1": "049 20111",
        "ContactEmail": "info@apsopere.it",
        "RelatedURL": "http://www.parcheggipadova.it/index.php/colonnine-di-ricarica",
        "DistanceUnit": 0
    },
    "Connections": [
        {
            "ID": 72288,
            "ConnectionTypeID": 25,
            "StatusTypeID": 50,
            "LevelID": 2,
            "PowerKW": 22,
            "CurrentTypeID": 20,
            "Quantity": 2
        }
    ],
    "NumberOfPoints": 2,
    "GeneralComments": "Ricarica gratuita si paga solo il costo del parcheggio",
    "StatusTypeID": 50,
    "DateLastStatusUpdate": "2017-01-15T15:48:00Z",
    "DataQualityLevel": 1,
    "DateCreated": "2015-11-27T13:45:00Z",
    "SubmissionStatusTypeID": 200
}