{
    "IsRecentlyVerified": false,
    "ID": 91967,
    "UUID": "42BF9DC5-0076-4710-A06F-0E7CA74AB035",
    "DataProviderID": 1,
    "OperatorID": 21,
    "UsageTypeID": 4,
    "UsageCost": "Mobi.E card",
    "AddressInfo": {
        "ID": 92313,
        "Title": "PLM-00002",
        "AddressLine1": "A2 km 31.2 Southbound (Sentido Norte/Sul)",
        "Town": "Palmela",
        "Postcode": "2951-901 ",
        "CountryID": 180,
        "Latitude": 38.584397426961274,
        "Longitude": -8.930731690198286,
        "RelatedURL": "http://www.mobie.pt",
        "DistanceUnit": 0
    },
    "Connections": [
        {
            "ID": 130395,
            "ConnectionTypeID": 2,
            "StatusTypeID": 50,
            "LevelID": 3,
            "Amps": 120,
            "Voltage": 500,
            "PowerKW": 50,
            "CurrentTypeID": 30,
            "Quantity": 1
        },
        {
            "ID": 148152,
            "ConnectionTypeID": 33,
            "StatusTypeID": 50,
            "LevelID": 3,
            "Amps": 125,
            "Voltage": 500,
            "PowerKW": 50,
            "CurrentTypeID": 30,
            "Quantity": 1
        },
        {
            "ID": 148153,
            "ConnectionTypeID": 25,
            "StatusTypeID": 50,
            "LevelID": 3,
            "Amps": 64,
            "Voltage": 400,
            "PowerKW": 43,
            "CurrentTypeID": 20,
            "Quantity": 1
        }
    ],
    "NumberOfPoints": 2,
    "StatusTypeID": 50,
    "DateLastStatusUpdate": "2020-08-04T20:34:00Z",
    "DataQualityLevel": 3,
    "DateCreated": "2017-08-22T13:38:00Z",
    "SubmissionStatusTypeID": 100
}