{
    "IsRecentlyVerified": false,
    "ID": 111891,
    "UUID": "4CDE24B3-CBA8-4604-B495-14BE72D81338",
    "DataProviderID": 2,
    "DataProvidersReference": "99965",
    "OperatorID": 39,
    "UsageTypeID": 4,
    "AddressInfo": {
        "ID": 112237,
        "Title": "EPS 2990 - EVOQUE",
        "AddressLine1": "15177 60 Avenue",
        "Town": "Surrey",
        "StateOrProvince": "BC",
        "Postcode": "V3S1S1",
        "CountryID": 44,
        "Latitude": 49.1122964,
        "Longitude": -122.8024577,
        "ContactTelephone1": "800-663-5633",
        "AccessComments": "MO: Not Specified; TU: Not Specified; WE: Not Specified; TH: Not Specified; FR: Not Specified; SA: Not Specified; SU: Not Specified",
        "RelatedURL": "http://www.semacharge.com/",
        "DistanceUnit": 0
    },
    "Connections": [
        {
            "ID": 157402,
            "ConnectionTypeID": 1,
            "LevelID": 2,
            "Amps": 16,
            "Voltage": 230,
            "PowerKW": 3,
            "CurrentTypeID": 10,
            "Quantity": 2
        }
    ],
    "DateLastStatusUpdate": "2019-04-06T05:07:00Z",
    "DataQualityLevel": 3,
    "DateCreated": "2018-10-18T23:37:00Z",
    "SubmissionStatusTypeID": 100
}