{
    "IsRecentlyVerified": false,
    "ID": 47418,
    "UUID": "8B4682E9-20D9-4A74-AD94-821560912332",
    "DataProviderID": 1,
    "OperatorID": 23,
    "OperatorsReference": "8195",
    "UsageTypeID": 7,
    "UsageCost": "Free",
    "AddressInfo": {
        "ID": 47764,
        "Title": "White Oak Inn - Tesla ",
        "AddressLine1": "29683 Walhonding Rd",
        "Town": "Danville",
        "StateOrProvince": "OH",
        "Postcode": "43014",
        "CountryID": 2,
        "Latitude": 40.3832914,
        "Longitude": -82.2117206,
        "ContactTelephone1": "740-599-6107  877-798-3752",
        "AccessComments": "24 hours daily; for Tesla guest use only",
        "RelatedURL": "http://www.teslamotors.com/supercharger",
        "DistanceUnit": 0
    },
    "Connections": [
        {
            "ID": 58457,
            "ConnectionTypeID": 30,
            "StatusTypeID": 50,
            "LevelID": 2,
            "Amps": 16,
            "Voltage": 230,
            "PowerKW": 16,
            "CurrentTypeID": 10,
            "Quantity": 1
        }
    ],
    "NumberOfPoints": 1,
    "StatusTypeID": 50,
    "DateLastStatusUpdate": "2017-01-26T16:15:00Z",
    "DataQualityLevel": 3,
    "DateCreated": "2015-05-27T08:51:00Z",
    "SubmissionStatusTypeID": 100
}