{
    "IsRecentlyVerified": false,
    "ID": 136726,
    "UUID": "93616681-B919-4E8C-A798-6CC9928B5F30",
    "DataProviderID": 18,
    "DataProvidersReference": "45fc396a0bff9c4d9f8554e6cdaa578c",
    "OperatorID": 20,
    "UsageTypeID": 1,
    "AddressInfo": {
        "ID": 137072,
        "Title": "Stafford Street Dudley",
        "AddressLine1": "Stafford Street Dudley",
        "Town": "Dudley",
        "Postcode": "DY1 1RT",
        "CountryID": 1,
        "Latitude": 52.52929,
        "Longitude": -2.08884,
        "AccessComments": "",
        "RelatedURL": "http://www.chargeyourcar.org.uk",
        "DistanceUnit": 0
    },
    "Connections": [
        {
            "ID": 191284,
            "ConnectionTypeID": 2,
            "Reference": "1",
            "StatusTypeID": 50,
            "LevelID": 3,
            "Amps": 125,
            "Voltage": 400,
            "PowerKW": 50,
            "CurrentTypeID": 30
        },
        {
            "ID": 191285,
            "ConnectionTypeID": 1036,
            "Reference": "2",
            "StatusTypeID": 50,
            "LevelID": 3,
            "Amps": 125,
            "Voltage": 400,
            "PowerKW": 50,
            "CurrentTypeID": 30
        },
        {
            "ID": 191286,
            "ConnectionTypeID": 1036,
            "Reference": "3",
            "StatusTypeID": 50,
            "LevelID": 3,
            "Amps": 63,
            "Voltage": 400,
            "PowerKW": 43,
            "CurrentTypeID": 20
        }
    ],
    "StatusTypeID": 0,
    "DateLastStatusUpdate": "2021-07-12T03:39:00Z",
    "MetadataValues": [
        {
            "ID": 6578,
            "MetadataFieldID": 4,
            "ItemValue": "Contains public sector information licensed under the Open Government Licence v2.0. http://www.nationalarchives.gov.uk/doc/open-government-licence/version/2/"
        }
    ],
    "DataQualityLevel": 3,
    "DateCreated": "2019-12-24T05:23:00Z",
    "SubmissionStatusTypeID": 100
}