{
    "IsRecentlyVerified": false,
    "ID": 18934,
    "UUID": "79E1F441-33A3-40DA-88D7-1AC6B065907F",
    "DataProviderID": 1,
    "OperatorID": 19,
    "UsageTypeID": 1,
    "UsageCost": "",
    "AddressInfo": {
        "ID": 19279,
        "Title": "Luxury Lodges Wales  ",
        "AddressLine1": "Luxury Lodges Wales  ",
        "AddressLine2": "Trefeglwys",
        "Town": "Caersws",
        "StateOrProvince": "Powys",
        "Postcode": "SY17 5PU",
        "CountryID": 1,
        "Latitude": 52.500142,
        "Longitude": -3.5297553000000335,
        "ContactTelephone1": "01686 430491",
        "ContactTelephone2": "",
        "ContactEmail": "mandy@luxurylodgeswales.co.uk",
        "AccessComments": "",
        "RelatedURL": "http://www.luxurylodgeswales.co.uk  ",
        "DistanceUnit": 0
    },
    "Connections": [
        {
            "ID": 19191,
            "ConnectionTypeID": 3,
            "StatusTypeID": 50,
            "LevelID": 2,
            "Amps": 13,
            "Voltage": 230,
            "PowerKW": 3,
            "CurrentTypeID": 10,
            "Quantity": 1
        },
        {
            "ID": 19192,
            "ConnectionTypeID": 25,
            "StatusTypeID": 50,
            "LevelID": 2,
            "Amps": 32,
            "Voltage": 230,
            "PowerKW": 7,
            "CurrentTypeID": 10,
            "Quantity": 1
        }
    ],
    "NumberOfPoints": 2,
    "GeneralComments": "",
    "StatusTypeID": 50,
    "DateLastStatusUpdate": "2013-08-30T16:34:00Z",
    "DataQualityLevel": 1,
    "DateCreated": "2013-08-30T16:34:00Z",
    "SubmissionStatusTypeID": 200
}