{
    "IsRecentlyVerified": false,
    "ID": 55055,
    "UUID": "7747BAE1-F4CE-4261-92A8-1B799DF181D0",
    "DataProviderID": 1,
    "OperatorID": 23,
    "OperatorsReference": "9246",
    "UsageTypeID": 1,
    "UsageCost": "€0.33/kWh; Andere Tarife für ältere Autos",
    "AddressInfo": {
        "ID": 55401,
        "Title": "Tesla Supercharger Geiselwind",
        "AddressLine1": "Scheinfelder Straße 15",
        "Town": "Geiselwind",
        "StateOrProvince": "Landkreis Kitzingen",
        "Postcode": "96160",
        "CountryID": 87,
        "Latitude": 49.7690881,
        "Longitude": 10.4701748,
        "AccessComments": "Rund um die Uhr (24/7) nutzbar. Position: Durch die Total Tankstelle hindurch fahren, dann kommt man direkt auf die Supercharger zu. Umgebung:KFC, Burgerking, McDonald's, Subway, Hotel Strohofer, Music Hall, Fleischerei mit diversen Imbiss-Artikeln\r\n",
        "DistanceUnit": 0
    },
    "Connections": [
        {
            "ID": 69583,
            "ConnectionTypeID": 27,
            "StatusTypeID": 50,
            "LevelID": 3,
            "PowerKW": 135,
            "CurrentTypeID": 30,
            "Quantity": 6
        },
        {
            "ID": 69584,
            "ConnectionTypeID": 25,
            "StatusTypeID": 50,
            "LevelID": 2,
            "Amps": 32,
            "Voltage": 400,
            "PowerKW": 11,
            "CurrentTypeID": 20,
            "Quantity": 1
        }
    ],
    "NumberOfPoints": 6,
    "StatusTypeID": 50,
    "DateLastStatusUpdate": "2019-05-12T19:38:00Z",
    "DataQualityLevel": 1,
    "DateCreated": "2015-10-13T11:36:00Z",
    "SubmissionStatusTypeID": 200
}