{
    "UserComments": [
        {
            "ID": 23820,
            "ChargePointID": 171991,
            "CommentTypeID": 1000,
            "UserName": "Didier_",
            "Comment": "La borne du milieu est en panne. Les autres fonctionnent bien.",
            "Rating": 5,
            "DateCreated": "2021-01-28T12:37:32.4Z",
            "User": {
                "ID": 29148,
                "Username": "Didier_"
            },
            "CheckinStatusTypeID": 10,
            "IsActionedByEditor": false
        }
    ],
    "IsRecentlyVerified": false,
    "ID": 171991,
    "UUID": "59C2B2BA-3AB2-45CE-A021-BE337DF12981",
    "DataProviderID": 1,
    "OperatorID": 175,
    "UsageTypeID": 6,
    "UsageCost": "Free",
    "AddressInfo": {
        "ID": 172350,
        "Title": "Leclerc",
        "AddressLine1": "Avenue Paul Desfarges",
        "Town": "Angoulême",
        "StateOrProvince": "Aquitaine-Limousin-Poitou-Charentes",
        "Postcode": "16000",
        "CountryID": 80,
        "Latitude": 45.65634478394804,
        "Longitude": 0.18271291291989655,
        "DistanceUnit": 0
    },
    "Connections": [
        {
            "ID": 262860,
            "ConnectionTypeID": 25,
            "StatusTypeID": 50,
            "LevelID": 2,
            "PowerKW": 22,
            "CurrentTypeID": 20,
            "Quantity": 3
        },
        {
            "ID": 262861,
            "ConnectionTypeID": 26,
            "StatusTypeID": 50,
            "LevelID": 2,
            "PowerKW": 22,
            "CurrentTypeID": 20,
            "Quantity": 3
        },
        {
            "ID": 262862,
            "ConnectionTypeID": 28,
            "StatusTypeID": 50,
            "Quantity": 3
        }
    ],
    "NumberOfPoints": 3,
    "StatusTypeID": 50,
    "DateLastStatusUpdate": "2021-01-28T12:38:00Z",
    "DataQualityLevel": 1,
    "DateCreated": "2021-01-10T19:29:00Z",
    "SubmissionStatusTypeID": 200
}