{
    "IsRecentlyVerified": false,
    "ID": 137596,
    "UUID": "266182DF-CEB6-4D5C-9E20-5B2469377B63",
    "DataProviderID": 2,
    "DataProvidersReference": "144145",
    "OperatorID": 5,
    "UsageTypeID": 1,
    "AddressInfo": {
        "ID": 137942,
        "Title": "USA CHARGING",
        "AddressLine1": "150 Jaguar Dr",
        "Town": "Mobile",
        "StateOrProvince": "AL",
        "Postcode": "36608",
        "CountryID": 2,
        "Latitude": 30.6916221,
        "Longitude": -88.1763862,
        "ContactTelephone1": "888-758-4389",
        "AccessComments": "24 hours daily",
        "RelatedURL": "http://www.chargepoint.com/",
        "DistanceUnit": 0
    },
    "Connections": [
        {
            "ID": 192540,
            "ConnectionTypeID": 1,
            "LevelID": 2,
            "Amps": 16,
            "Voltage": 230,
            "PowerKW": 3,
            "CurrentTypeID": 10,
            "Quantity": 2
        }
    ],
    "StatusTypeID": 50,
    "DateLastStatusUpdate": "2019-12-24T09:05:00Z",
    "DataQualityLevel": 3,
    "DateCreated": "2019-12-24T09:05:00Z",
    "SubmissionStatusTypeID": 100
}