{
    "MediaItems": [
        {
            "ID": 15500,
            "ChargePointID": 88452,
            "ItemURL": "https://s3-ap-southeast-2.amazonaws.com/openchargemap/images/IT/OCM88452/OCM-88452.orig.2018051620213837.jpeg",
            "ItemThumbnailURL": "https://s3-ap-southeast-2.amazonaws.com/openchargemap/images/IT/OCM88452/OCM-88452.thmb.2018051620213837.jpeg",
            "Comment": "",
            "IsEnabled": true,
            "IsVideo": false,
            "IsFeaturedItem": false,
            "IsExternalResource": false,
            "User": {
                "ID": 18306,
                "Username": "markvs"
            },
            "DateCreated": "2018-05-16T20:22:00Z"
        },
        {
            "ID": 15498,
            "ChargePointID": 88452,
            "ItemURL": "https://s3-ap-southeast-2.amazonaws.com/openchargemap/images/IT/OCM88452/OCM-88452.orig.2018051617142731.jpeg",
            "ItemThumbnailURL": "https://s3-ap-southeast-2.amazonaws.com/openchargemap/images/IT/OCM88452/OCM-88452.thmb.2018051617142731.jpeg",
            "Comment": "",
            "IsEnabled": true,
            "IsVideo": false,
            "IsFeaturedItem": false,
            "IsExternalResource": false,
            "User": {
                "ID": 18306,
                "Username": "markvs"
            },
            "DateCreated": "2018-05-16T17:15:00Z"
        },
        {
            "ID": 15499,
            "ChargePointID": 88452,
            "ItemURL": "https://s3-ap-southeast-2.amazonaws.com/openchargemap/images/IT/OCM88452/OCM-88452.orig.2018051617144948.jpeg",
            "ItemThumbnailURL": "https://s3-ap-southeast-2.amazonaws.com/openchargemap/images/IT/OCM88452/OCM-88452.thmb.2018051617144948.jpeg",
            "Comment": "",
            "IsEnabled": true,
            "IsVideo": false,
            "IsFeaturedItem": false,
            "IsExternalResource": false,
            "User": {
                "ID": 18306,
                "Username": "markvs"
            },
            "DateCreated": "2018-05-16T17:15:00Z"
        }
    ],
    "IsRecentlyVerified": false,
    "ID": 88452,
    "UUID": "6CCB84DD-186F-450D-A09A-2672758BE651",
    "DataProviderID": 1,
    "OperatorID": 23,
    "OperatorsReference": "30039",
    "UsageTypeID": 6,
    "AddressInfo": {
        "ID": 88798,
        "Title": "Alpin Panorama Hotel Hubertus",
        "AddressLine1": "Via Furcia 5",
        "Town": "Valdaora",
        "StateOrProvince": "Alto Adige",
        "Postcode": "39030",
        "CountryID": 112,
        "Latitude": 46.75349,
        "Longitude": 12.009803,
        "ContactTelephone1": "+39 0474 592 104",
        "ContactEmail": "info@hotel-hubertus.com",
        "RelatedURL": "http://www.hotel-hubertus.com",
        "DistanceUnit": 0
    },
    "Connections": [
        {
            "ID": 125461,
            "ConnectionTypeID": 30,
            "StatusTypeID": 50,
            "LevelID": 2,
            "Amps": 32,
            "Voltage": 400,
            "PowerKW": 17,
            "CurrentTypeID": 20,
            "Quantity": 1
        }
    ],
    "NumberOfPoints": 5,
    "GeneralComments": "2x Tesla Destination Charger up to 22kW + 3x Type 2 up to 22kW",
    "StatusTypeID": 50,
    "DateLastStatusUpdate": "2018-10-03T15:50:00Z",
    "DataQualityLevel": 1,
    "DateCreated": "2017-05-30T05:54:00Z",
    "SubmissionStatusTypeID": 200
}