{
    "IsRecentlyVerified": false,
    "ID": 126161,
    "UUID": "2EF7BF6C-7413-4A2C-876D-80CD1857B136",
    "DataProviderID": 1,
    "OperatorID": 3,
    "OperatorsReference": "PG-90290",
    "UsageTypeID": 6,
    "UsageCost": "1",
    "AddressInfo": {
        "ID": 126507,
        "Title": "Story Contracting Limited",
        "AddressLine1": "Story Contracting Limited",
        "Postcode": "CA2 7NA",
        "CountryID": 1,
        "Latitude": 54.89832,
        "Longitude": -2.97416,
        "DistanceUnit": 0
    },
    "Connections": [
        {
            "ID": 176814,
            "ConnectionTypeID": 25,
            "StatusTypeID": 50,
            "LevelID": 2,
            "Amps": 32,
            "Voltage": 230,
            "PowerKW": 7,
            "CurrentTypeID": 10,
            "Quantity": 1
        }
    ],
    "NumberOfPoints": 1,
    "GeneralComments": "This unit is located at the Story Contracting Limited in Burgh Road Industrial Estate, Cumbria",
    "StatusTypeID": 0,
    "DateLastStatusUpdate": "2020-01-18T06:33:00Z",
    "DataQualityLevel": 1,
    "DateCreated": "2019-05-13T13:17:00Z",
    "SubmissionStatusTypeID": 200
}