{
    "IsRecentlyVerified": false,
    "ID": 158226,
    "UUID": "2AE85F1B-EF06-4CCC-A553-D54541503461",
    "DataProviderID": 2,
    "DataProvidersReference": "153943",
    "OperatorID": 39,
    "UsageTypeID": 1,
    "AddressInfo": {
        "ID": 158580,
        "Title": "Third Floor Stations",
        "AddressLine1": "848 Brickell Key Drive\nSuite 503",
        "Town": "Miami",
        "StateOrProvince": "FL",
        "Postcode": "33131",
        "CountryID": 2,
        "Latitude": 25.7692838,
        "Longitude": -80.1837141,
        "ContactTelephone1": "800-663-5633",
        "AccessComments": "MO: Not Specified; TU: Not Specified; WE: Not Specified; TH: Not Specified; FR: Not Specified; SA: Not Specified; SU: Not Specified",
        "RelatedURL": "http://www.semacharge.com/",
        "DistanceUnit": 0
    },
    "Connections": [
        {
            "ID": 228180,
            "ConnectionTypeID": 1,
            "LevelID": 2,
            "Amps": 16,
            "Voltage": 230,
            "PowerKW": 3.7,
            "CurrentTypeID": 10,
            "Quantity": 2
        }
    ],
    "StatusTypeID": 50,
    "DateLastStatusUpdate": "2020-06-26T02:52:00Z",
    "DataQualityLevel": 3,
    "DateCreated": "2020-06-26T02:52:00Z",
    "SubmissionStatusTypeID": 100
}