{
    "IsRecentlyVerified": false,
    "ID": 65614,
    "UUID": "00F9A093-9945-42C7-9015-45875B2078B5",
    "DataProviderID": 26,
    "DataProvidersReference": "83889",
    "OperatorID": 157,
    "OperatorsReference": "NewMotion 03001549",
    "UsageCost": "0.00 jaarabonnement",
    "AddressInfo": {
        "ID": 65960,
        "Title": "De Duiker 51",
        "AddressLine1": "De Duiker 51",
        "Town": "Montfoort",
        "Postcode": "3461 HP",
        "CountryID": 159,
        "Latitude": 52.0662377,
        "Longitude": 4.9159342,
        "ContactTelephone1": "088 0109500",
        "RelatedURL": "http://thenewmotion.nl/",
        "DistanceUnit": 0
    },
    "Connections": [
        {
            "ID": 90532,
            "ConnectionTypeID": 25,
            "LevelID": 2,
            "PowerKW": 22,
            "CurrentTypeID": 10
        }
    ],
    "NumberOfPoints": 1,
    "StatusTypeID": 50,
    "DateLastStatusUpdate": "2016-06-04T02:45:00Z",
    "DataQualityLevel": 3,
    "DateCreated": "2016-04-27T09:42:00Z",
    "SubmissionStatusTypeID": 100
}