{
    "IsRecentlyVerified": false,
    "ID": 136150,
    "UUID": "9D45482B-E9EF-4274-A009-62B1821DD0FC",
    "DataProviderID": 18,
    "DataProvidersReference": "fca0113e8cf114d0ebc907bdd0157f05",
    "OperatorID": 2244,
    "UsageTypeID": 4,
    "AddressInfo": {
        "ID": 136496,
        "Title": "Thornton Avenue",
        "AddressLine1": "Thornton Avenue",
        "Town": "London",
        "Postcode": "W4 1QG",
        "CountryID": 1,
        "Latitude": 51.493966,
        "Longitude": -0.252509,
        "AccessComments": "",
        "RelatedURL": "https://www.ubitricity.com",
        "DistanceUnit": 0
    },
    "Connections": [
        {
            "ID": 190578,
            "ConnectionTypeID": 25,
            "Reference": "steob100000625",
            "StatusTypeID": 50,
            "LevelID": 2,
            "Amps": 16,
            "Voltage": 230,
            "PowerKW": 3.7,
            "CurrentTypeID": 10
        }
    ],
    "StatusTypeID": 0,
    "DateLastStatusUpdate": "2021-04-25T05:46:00Z",
    "MetadataValues": [
        {
            "ID": 6002,
            "MetadataFieldID": 4,
            "ItemValue": "Contains public sector information licensed under the Open Government Licence v2.0. http://www.nationalarchives.gov.uk/doc/open-government-licence/version/2/"
        }
    ],
    "DataQualityLevel": 3,
    "DateCreated": "2019-12-24T05:22:00Z",
    "SubmissionStatusTypeID": 100
}