{
    "IsRecentlyVerified": false,
    "ID": 170402,
    "UUID": "E1824EA3-CBCD-4C54-B391-FA37249B83BE",
    "DataProviderID": 1,
    "OperatorID": 23,
    "OperatorsReference": "34578",
    "UsageTypeID": 4,
    "UsageCost": "$0.26/kWh; other tariffs for older cars",
    "AddressInfo": {
        "ID": 170761,
        "Title": "Oakland, Ca - 2ND Street Supercharger",
        "AddressLine1": "255 2ND Street",
        "Town": "Oakland",
        "StateOrProvince": "CA",
        "Postcode": "94607",
        "CountryID": 2,
        "Latitude": 37.794181,
        "Longitude": -122.272388,
        "DistanceUnit": 0
    },
    "Connections": [
        {
            "ID": 259955,
            "ConnectionTypeID": 27,
            "StatusTypeID": 50,
            "LevelID": 3,
            "PowerKW": 120,
            "CurrentTypeID": 30,
            "Quantity": 12
        }
    ],
    "NumberOfPoints": 12,
    "GeneralComments": "Charging12 Superchargers, available 24/7, up to 72kW",
    "StatusTypeID": 50,
    "DateLastStatusUpdate": "2020-11-26T06:54:00Z",
    "DataQualityLevel": 1,
    "DateCreated": "2020-11-26T06:54:00Z",
    "SubmissionStatusTypeID": 200
}