{
    "IsRecentlyVerified": false,
    "ID": 74708,
    "UUID": "4AC430EB-831E-49DF-9568-E4EC7840B941",
    "DataProviderID": 1,
    "DataProvidersReference": "3634",
    "AddressInfo": {
        "ID": 75054,
        "Title": "Sätterstrand",
        "AddressLine1": "Svampstigen 105",
        "Town": "HAMMARÖ",
        "StateOrProvince": "VÄRMLAND",
        "Postcode": "66391",
        "CountryID": 216,
        "Latitude": 59.304855,
        "Longitude": 13.541463,
        "AccessComments": "Sätterstrands parkering längst in på parkeringen",
        "DistanceUnit": 0
    },
    "Connections": [
        {
            "ID": 107444,
            "ConnectionTypeID": 0,
            "Reference": "1",
            "LevelID": 2,
            "Amps": 16,
            "Voltage": 400,
            "PowerKW": 11,
            "Comments": "Mode 3"
        },
        {
            "ID": 107445,
            "ConnectionTypeID": 0,
            "Reference": "2",
            "LevelID": 2,
            "Amps": 16,
            "Voltage": 400,
            "PowerKW": 11,
            "Comments": "Mode 3"
        },
        {
            "ID": 107446,
            "ConnectionTypeID": 0,
            "Reference": "3",
            "LevelID": 2,
            "Amps": 16,
            "Voltage": 400,
            "PowerKW": 11,
            "Comments": "Mode 3"
        },
        {
            "ID": 107447,
            "ConnectionTypeID": 0,
            "Reference": "4",
            "LevelID": 2,
            "Amps": 16,
            "Voltage": 400,
            "PowerKW": 11,
            "Comments": "Mode 3"
        }
    ],
    "NumberOfPoints": 4,
    "DateLastStatusUpdate": "2020-05-26T08:22:00Z",
    "DataQualityLevel": 2,
    "DateCreated": "2016-12-03T02:36:00Z",
    "SubmissionStatusTypeID": 100
}