{
    "IsRecentlyVerified": false,
    "ID": 95859,
    "UUID": "6E7E5029-5BC6-46F6-8AE6-C99D8617724A",
    "DataProviderID": 1,
    "OperatorID": 45,
    "UsageTypeID": 6,
    "AddressInfo": {
        "ID": 96205,
        "Title": "Wangerooge Garagen",
        "AddressLine1": "Am Harlesiel 1",
        "Town": "Wittmund",
        "StateOrProvince": "Landkreis Wittmund",
        "Postcode": "26409",
        "CountryID": 87,
        "Latitude": 53.70553,
        "Longitude": 7.81093999999996,
        "ContactTelephone1": "+49 4464 355",
        "AccessComments": "In des Garagenstellplätzen sind oft Schukodosen vorhanden.",
        "RelatedURL": "http://www.wangerooge-garagen.de/inselparker/inselparker-harle.html",
        "DistanceUnit": 0
    },
    "Connections": [
        {
            "ID": 135789,
            "ConnectionTypeID": 28,
            "StatusTypeID": 50,
            "LevelID": 2,
            "Amps": 16,
            "Voltage": 230,
            "PowerKW": 3.7,
            "CurrentTypeID": 10,
            "Quantity": 4
        }
    ],
    "NumberOfPoints": 4,
    "StatusTypeID": 50,
    "DateLastStatusUpdate": "2017-11-28T07:26:00Z",
    "DataQualityLevel": 1,
    "DateCreated": "2017-11-28T07:26:00Z",
    "SubmissionStatusTypeID": 200
}