{
    "UserComments": [
        {
            "ID": 6028,
            "ChargePointID": 48041,
            "CommentTypeID": 10,
            "UserName": "Claus Steen Hansen",
            "Comment": "Easy to find, need to bring Type 2 cable",
            "Rating": 5,
            "DateCreated": "2015-07-26T08:19:39.397Z",
            "User": {
                "ID": 6138,
                "Username": "Claus Steen Hansen"
            },
            "CheckinStatusTypeID": 10
        }
    ],
    "MediaItems": [
        {
            "ID": 2874,
            "ChargePointID": 48041,
            "ItemURL": "https://s3-ap-southeast-2.amazonaws.com/openchargemap/images/DE/OCM48041/OCM-48041.orig.2015072608180087.jpg",
            "ItemThumbnailURL": "https://s3-ap-southeast-2.amazonaws.com/openchargemap/images/DE/OCM48041/OCM-48041.thmb.2015072608180087.jpg",
            "Comment": "",
            "IsEnabled": true,
            "IsVideo": false,
            "IsFeaturedItem": false,
            "IsExternalResource": false,
            "User": {
                "ID": 6138,
                "Username": "Claus Steen Hansen"
            },
            "DateCreated": "2015-07-26T08:18:00Z"
        }
    ],
    "IsRecentlyVerified": false,
    "ID": 48041,
    "UUID": "888A3C26-751B-44FF-B38A-4702D94FD0B3",
    "DataProviderID": 1,
    "OperatorID": 45,
    "UsageTypeID": 1,
    "AddressInfo": {
        "ID": 48387,
        "Title": "SCM Solar",
        "AddressLine1": "Heiligenhäger Straße 15",
        "Town": "Satow",
        "StateOrProvince": "Landkreis Rostock",
        "Postcode": "18239",
        "CountryID": 87,
        "Latitude": 54.0075624061143,
        "Longitude": 11.9338382825562,
        "ContactTelephone1": "+49 38295 18980",
        "AccessComments": "2 kostenlose Parkplätze am Haus mit den Solarpanels, 24/7 nutzbar. Keine Ladekarte, einfach einstecken.",
        "RelatedURL": "http://www.scm-solar.de/unternehmen/niederlassungen/niederlassung-rostock",
        "DistanceUnit": 0
    },
    "Connections": [
        {
            "ID": 59328,
            "ConnectionTypeID": 25,
            "StatusTypeID": 50,
            "LevelID": 2,
            "Amps": 32,
            "Voltage": 400,
            "PowerKW": 22,
            "CurrentTypeID": 20,
            "Quantity": 2
        }
    ],
    "NumberOfPoints": 2,
    "StatusTypeID": 50,
    "DateLastStatusUpdate": "2015-07-26T08:20:00Z",
    "DataQualityLevel": 1,
    "DateCreated": "2015-06-23T08:07:00Z",
    "SubmissionStatusTypeID": 200
}