{
    "IsRecentlyVerified": false,
    "ID": 184603,
    "UUID": "7FBA1573-2CE1-4C52-8C69-5B113888BB00",
    "DataProviderID": 29,
    "DataProvidersReference": "3132",
    "OperatorID": 159,
    "AddressInfo": {
        "ID": 184962,
        "Title": "Bommerfelder Ring 108",
        "AddressLine1": "Bommerfelder Ring 108",
        "Town": "Witten",
        "Postcode": "58452",
        "CountryID": 87,
        "Latitude": 51.418151,
        "Longitude": 7.339768,
        "DistanceUnit": 0
    },
    "Connections": [
        {
            "ID": 293066,
            "ConnectionTypeID": 25,
            "StatusTypeID": 50,
            "LevelID": 2,
            "PowerKW": 22,
            "CurrentTypeID": 20
        },
        {
            "ID": 293067,
            "ConnectionTypeID": 25,
            "StatusTypeID": 50,
            "LevelID": 2,
            "PowerKW": 22,
            "CurrentTypeID": 20
        }
    ],
    "StatusTypeID": 50,
    "DateLastStatusUpdate": "2021-07-12T02:47:00Z",
    "MetadataValues": [
        {
            "ID": 16894,
            "MetadataFieldID": 4,
            "ItemValue": "Data from the German chargepoint registry provided by Bundesnetzagentur.de under the CC-BY 4.0 license"
        }
    ],
    "DataQualityLevel": 3,
    "DateCreated": "2021-07-08T10:05:00Z",
    "SubmissionStatusTypeID": 100
}