{
    "IsRecentlyVerified": false,
    "ID": 89752,
    "UUID": "E9A90594-0810-4466-9A0B-D4E0C254564A",
    "DataProviderID": 2,
    "DataProvidersReference": "81540",
    "OperatorID": 39,
    "UsageTypeID": 4,
    "AddressInfo": {
        "ID": 90098,
        "Title": "9th & Front",
        "AddressLine1": "321 South 9th Street",
        "Town": "Boise",
        "StateOrProvince": "ID",
        "Postcode": "83702",
        "CountryID": 2,
        "Latitude": 43.6142903,
        "Longitude": -116.2065179,
        "ContactTelephone1": "800-663-5633",
        "AccessComments": "MO: 12:00am-12:00am; TU: 12:00am-12:00am; WE: 12:00am-12:00am; TH: 12:00am-12:00am; FR: 12:00am-12:00am; SA: 12:00am-12:00am; SU: 12:00am-12:00am",
        "RelatedURL": "http://www.semacharge.com/",
        "DistanceUnit": 0
    },
    "Connections": [
        {
            "ID": 127192,
            "ConnectionTypeID": 1,
            "LevelID": 2,
            "Amps": 16,
            "Voltage": 230,
            "PowerKW": 3,
            "CurrentTypeID": 10,
            "Quantity": 3
        }
    ],
    "DateLastStatusUpdate": "2019-04-06T05:06:00Z",
    "DataQualityLevel": 3,
    "DateCreated": "2017-06-22T08:16:00Z",
    "SubmissionStatusTypeID": 100
}