{
    "IsRecentlyVerified": false,
    "ID": 56185,
    "UUID": "5E2259AB-135D-43B4-ACE1-1AD3CC5AE469",
    "DataProviderID": 1,
    "OperatorID": 3,
    "OperatorsReference": "PG-80190",
    "UsageTypeID": 4,
    "UsageCost": "1",
    "AddressInfo": {
        "ID": 56531,
        "Title": "Nissan Barnard & Brough Haywards Heath",
        "AddressLine1": "Blackmores",
        "Town": "Lewes",
        "StateOrProvince": "East Sussex",
        "Postcode": "RH17 7QB",
        "CountryID": 1,
        "Latitude": 50.966764,
        "Longitude": -0.089055,
        "DistanceUnit": 0
    },
    "Connections": [
        {
            "ID": 70801,
            "ConnectionTypeID": 25,
            "StatusTypeID": 50,
            "LevelID": 2,
            "Amps": 32,
            "Voltage": 230,
            "PowerKW": 7,
            "CurrentTypeID": 10,
            "Quantity": 2
        }
    ],
    "NumberOfPoints": 2,
    "GeneralComments": "Pod-Point T7-S charge point. Open charge, no authentication required. Worth checking with dealership before use.",
    "StatusTypeID": 50,
    "DateLastStatusUpdate": "2020-01-13T21:11:00Z",
    "DataQualityLevel": 1,
    "DateCreated": "2015-10-19T14:08:00Z",
    "SubmissionStatusTypeID": 200
}