{
    "IsRecentlyVerified": false,
    "ID": 145635,
    "UUID": "4D708E6E-2B0F-4740-ADF1-08A6F806EFE3",
    "DataProviderID": 2,
    "DataProvidersReference": "145490",
    "OperatorID": 90,
    "UsageTypeID": 1,
    "AddressInfo": {
        "ID": 145987,
        "Title": "Bibliothèque - Saint-David-de-Falardeau",
        "AddressLine1": "124 Boulevard Saint-David",
        "Town": "Saint-David-de Falardeau",
        "StateOrProvince": "QC",
        "Postcode": "G0V 1C0",
        "CountryID": 44,
        "Latitude": 48.620838,
        "Longitude": -71.1105,
        "ContactTelephone1": "877-505-2674",
        "AccessComments": "24 hours daily",
        "RelatedURL": "https://lecircuitelectrique.com/",
        "DistanceUnit": 0
    },
    "Connections": [
        {
            "ID": 202348,
            "ConnectionTypeID": 1,
            "LevelID": 2,
            "Amps": 16,
            "Voltage": 230,
            "PowerKW": 3.7,
            "CurrentTypeID": 10,
            "Quantity": 1
        }
    ],
    "StatusTypeID": 50,
    "DateLastStatusUpdate": "2020-06-26T03:11:00Z",
    "DataQualityLevel": 3,
    "DateCreated": "2019-12-24T09:25:00Z",
    "SubmissionStatusTypeID": 100
}