{
    "IsRecentlyVerified": false,
    "ID": 132462,
    "UUID": "12D6EED5-E35E-4DE8-A10E-C1F996C56B39",
    "DataProviderID": 1,
    "OperatorID": 3341,
    "OperatorsReference": "SEC20007",
    "UsageTypeID": 5,
    "UsageCost": "£0.31/kWh",
    "AddressInfo": {
        "ID": 132808,
        "Title": "Penylan Library Car Park - Cardiff",
        "AddressLine1": "Penylan Library Car Park",
        "Town": "Cardiff",
        "Postcode": "CF23 5HW",
        "CountryID": 1,
        "Latitude": 51.49677,
        "Longitude": -3.1645,
        "RelatedURL": "http://www.aptcontrols.co.uk",
        "DistanceUnit": 0
    },
    "Connections": [
        {
            "ID": 185460,
            "ConnectionTypeID": 25,
            "Reference": "1",
            "StatusTypeID": 50,
            "LevelID": 2,
            "Amps": 32,
            "Voltage": 230,
            "PowerKW": 7,
            "CurrentTypeID": 10,
            "Quantity": 2
        }
    ],
    "NumberOfPoints": 2,
    "StatusTypeID": 50,
    "DateLastStatusUpdate": "2019-10-02T08:58:00Z",
    "MetadataValues": [
        {
            "ID": 4962,
            "MetadataFieldID": 4,
            "ItemValue": "Contains public sector information licensed under the Open Government Licence v2.0. http://www.nationalarchives.gov.uk/doc/open-government-licence/version/2/"
        }
    ],
    "DataQualityLevel": 3,
    "DateCreated": "2019-09-30T18:20:00Z",
    "SubmissionStatusTypeID": 100
}