{
    "IsRecentlyVerified": false,
    "ID": 122953,
    "UUID": "8A4B99A8-B30C-4762-8489-9F9D8BCCF957",
    "DataProviderID": 2,
    "DataProvidersReference": "113354",
    "OperatorID": 23,
    "UsageTypeID": 1,
    "AddressInfo": {
        "ID": 123299,
        "Title": "Tolosa Winery - Tesla Destination",
        "AddressLine1": "4910 Edna Rd",
        "Town": "San Luis Obispo",
        "StateOrProvince": "CA",
        "Postcode": "94301",
        "CountryID": 2,
        "Latitude": 35.235912,
        "Longitude": -120.621362,
        "ContactTelephone1": "805-782-0500  877-798-3752",
        "AccessComments": "24 hours daily; for customer use only; see front desk for access",
        "RelatedURL": "https://www.tesla.com/destination-charging",
        "DistanceUnit": 0
    },
    "Connections": [
        {
            "ID": 172882,
            "ConnectionTypeID": 30,
            "LevelID": 2,
            "Amps": 16,
            "Voltage": 230,
            "PowerKW": 3.7,
            "CurrentTypeID": 10,
            "Quantity": 2
        }
    ],
    "DateLastStatusUpdate": "2020-06-26T02:58:00Z",
    "DataQualityLevel": 3,
    "DateCreated": "2019-04-06T05:03:00Z",
    "SubmissionStatusTypeID": 100
}