{
    "IsRecentlyVerified": false,
    "ID": 75615,
    "UUID": "A3BAA168-6471-47DE-ADA9-2E8B435953A1",
    "DataProviderID": 1,
    "OperatorID": 142,
    "OperatorsReference": "3345208",
    "UsageTypeID": 4,
    "AddressInfo": {
        "ID": 75961,
        "Title": "Apcoa P+R Perfektastraße",
        "AddressLine1": "Herziggasse 14",
        "Town": "Wien",
        "Postcode": "1230",
        "CountryID": 19,
        "Latitude": 48.138722,
        "Longitude": 16.312367,
        "DistanceUnit": 0
    },
    "Connections": [
        {
            "ID": 109027,
            "ConnectionTypeID": 25,
            "StatusTypeID": 50,
            "LevelID": 2,
            "Amps": 16,
            "Voltage": 400,
            "PowerKW": 11,
            "CurrentTypeID": 20,
            "Quantity": 8
        },
        {
            "ID": 109028,
            "ConnectionTypeID": 28,
            "StatusTypeID": 50,
            "LevelID": 2,
            "Amps": 16,
            "Voltage": 230,
            "PowerKW": 4,
            "CurrentTypeID": 10,
            "Quantity": 4
        }
    ],
    "NumberOfPoints": 8,
    "GeneralComments": "Wien Energie Tanke-Karte; WienMobil-Karte; BMW i-ChargeNow-Karte; intercharge-App",
    "StatusTypeID": 50,
    "DateLastStatusUpdate": "2018-05-31T14:37:00Z",
    "DataQualityLevel": 1,
    "DateCreated": "2016-12-16T20:00:00Z",
    "SubmissionStatusTypeID": 200
}