{
    "IsRecentlyVerified": false,
    "ID": 91701,
    "UUID": "19629B23-302A-412B-8DE1-C8D783F258F3",
    "DataProviderID": 1,
    "OperatorID": 45,
    "UsageTypeID": 1,
    "UsageCost": "Frei",
    "AddressInfo": {
        "ID": 92047,
        "Title": "Restaurant Checkpoint Harry",
        "AddressLine1": "Am Elbberg 37",
        "Town": "Boizenburg/Elbe",
        "StateOrProvince": "Landkreis Ludwigslust-Parchim",
        "Postcode": "19258",
        "CountryID": 87,
        "Latitude": 53.37549785634254,
        "Longitude": 10.69863868577077,
        "ContactTelephone1": "+49 800 6648919",
        "AccessComments": "24/7 nutzbare weiße Ladesäule am Restaurant, mit beliebiger Ladekarte freischaltbar. Keine markierten Parkplätze! ",
        "RelatedURL": "http://www.versorgungsbetriebe-elbe.de/",
        "DistanceUnit": 0
    },
    "Connections": [
        {
            "ID": 130024,
            "ConnectionTypeID": 25,
            "StatusTypeID": 50,
            "LevelID": 2,
            "Amps": 32,
            "Voltage": 400,
            "PowerKW": 22,
            "CurrentTypeID": 20,
            "Quantity": 2
        },
        {
            "ID": 130025,
            "ConnectionTypeID": 28,
            "StatusTypeID": 50,
            "LevelID": 2,
            "Amps": 16,
            "Voltage": 230,
            "PowerKW": 3.7,
            "CurrentTypeID": 10,
            "Quantity": 2
        }
    ],
    "NumberOfPoints": 4,
    "GeneralComments": "Betreiber sind die Versorgungsbetriebe Elbe GmbH.",
    "StatusTypeID": 50,
    "DateLastStatusUpdate": "2017-08-14T07:43:00Z",
    "DataQualityLevel": 1,
    "DateCreated": "2017-08-14T07:43:00Z",
    "SubmissionStatusTypeID": 200
}