{
    "IsRecentlyVerified": false,
    "ID": 9846,
    "UUID": "4CA78F6E-488C-486E-AA74-058C21146A55",
    "DataProviderID": 15,
    "DataProvidersReference": "16348",
    "OperatorID": 1,
    "UsageTypeID": 1,
    "AddressInfo": {
        "ID": 9743,
        "Title": "400 Premium Outlet Dr",
        "AddressLine1": "400 Premium Outlet Dr",
        "Town": "Monroe",
        "StateOrProvince": "OH",
        "Postcode": "45050",
        "CountryID": 2,
        "Latitude": 39.436,
        "Longitude": -84.33668,
        "ContactTelephone1": "513-539-0710",
        "RelatedURL": "http://carstations.com/16348",
        "DistanceUnit": 0
    },
    "Connections": [
        {
            "ID": 7699,
            "ConnectionTypeID": 1,
            "Reference": "J1772",
            "LevelID": 2
        }
    ],
    "NumberOfPoints": 2,
    "StatusTypeID": 50,
    "DateLastStatusUpdate": "2017-11-04T14:04:00Z",
    "DataQualityLevel": 2,
    "DateCreated": "2012-05-01T20:37:00Z",
    "SubmissionStatusTypeID": 100
}