{
    "IsRecentlyVerified": false,
    "ID": 63585,
    "UUID": "DC57EFAF-99C0-4CE1-8CE0-318B58CFD290",
    "DataProviderID": 26,
    "DataProvidersReference": "82457",
    "OperatorsReference": "LomboXnet 1601403",
    "UsageCost": "0.00 afhankelijk van pas",
    "AddressInfo": {
        "ID": 63931,
        "Title": "Bakhuizen van den Brinkstraat 49-BS",
        "AddressLine1": "Bakhuizen van den Brinkstraat 49-BS",
        "Town": "Utrecht",
        "Postcode": "3532 GD",
        "CountryID": 159,
        "Latitude": 52.094417,
        "Longitude": 5.094847,
        "RelatedURL": "http://www.lomboxnet.nl/",
        "DistanceUnit": 0
    },
    "Connections": [
        {
            "ID": 81142,
            "ConnectionTypeID": 25,
            "LevelID": 2,
            "PowerKW": 22,
            "CurrentTypeID": 10
        }
    ],
    "NumberOfPoints": 2,
    "StatusTypeID": 50,
    "DateLastStatusUpdate": "2016-06-04T02:50:00Z",
    "DataQualityLevel": 3,
    "DateCreated": "2016-03-03T12:31:00Z",
    "SubmissionStatusTypeID": 100
}