{
    "IsRecentlyVerified": false,
    "ID": 134370,
    "UUID": "0FF0872A-96A6-4D29-AA62-E47A590A81B8",
    "DataProviderID": 1,
    "OperatorID": 3,
    "OperatorsReference": "PG-83714",
    "UsageTypeID": 4,
    "UsageCost": "Free",
    "AddressInfo": {
        "ID": 134716,
        "Title": "The White Hart (customer Use Only)",
        "AddressLine1": "High Street",
        "Town": "Stockbridge",
        "Postcode": "SO20 6HF",
        "CountryID": 1,
        "Latitude": 51.113251,
        "Longitude": -1.488272,
        "DistanceUnit": 0
    },
    "Connections": [
        {
            "ID": 188059,
            "ConnectionTypeID": 25,
            "StatusTypeID": 50,
            "LevelID": 2,
            "Amps": 32,
            "Voltage": 230,
            "PowerKW": 7,
            "CurrentTypeID": 10,
            "Quantity": 2
        }
    ],
    "NumberOfPoints": 2,
    "GeneralComments": "This is an open charge unit installed at The White Hart at High Street, Stockbridge",
    "StatusTypeID": 50,
    "DateLastStatusUpdate": "2019-11-11T06:52:00Z",
    "DataQualityLevel": 1,
    "DateCreated": "2019-11-11T06:52:00Z",
    "SubmissionStatusTypeID": 200
}