{
    "IsRecentlyVerified": false,
    "ID": 28588,
    "UUID": "2A7C49A6-DB2D-4B54-A427-5C1B171C42DC",
    "DataProviderID": 2,
    "DataProvidersReference": "61621",
    "UsageTypeID": 1,
    "AddressInfo": {
        "ID": 28934,
        "Title": "Illiano's Restaurant",
        "AddressLine1": "257 W Town St",
        "Town": "Yantic",
        "StateOrProvince": "CT",
        "Postcode": "06389",
        "CountryID": 2,
        "Latitude": 41.55775,
        "Longitude": -72.113144,
        "ContactTelephone1": "860-889-6165",
        "AccessComments": "11am-10pm daily",
        "RelatedURL": "",
        "DistanceUnit": 0
    },
    "Connections": [
        {
            "ID": 31410,
            "ConnectionTypeID": 1,
            "LevelID": 2,
            "Amps": 16,
            "Voltage": 230,
            "PowerKW": 3.7,
            "CurrentTypeID": 10,
            "Quantity": 1
        }
    ],
    "DateLastStatusUpdate": "2020-06-26T03:04:00Z",
    "DataQualityLevel": 3,
    "DateCreated": "2014-11-28T03:38:00Z",
    "SubmissionStatusTypeID": 100
}