{
    "IsRecentlyVerified": false,
    "ID": 157923,
    "UUID": "EA44DB34-DE27-4F97-9226-3DD1A2534179",
    "DataProviderID": 18,
    "DataProvidersReference": "919f1088f253af27dcd27c45e6b8b723",
    "OperatorID": 8,
    "UsageTypeID": 4,
    "AddressInfo": {
        "ID": 158277,
        "Title": "Barkingside Station Car Park",
        "AddressLine1": "Barkingside Station Car Park",
        "Town": "Ilford",
        "Postcode": "IG6 1NE",
        "CountryID": 1,
        "Latitude": 51.586868,
        "Longitude": 0.087291,
        "AccessComments": "",
        "RelatedURL": "https://www.bpchargemaster.com",
        "DistanceUnit": 0
    },
    "Connections": [
        {
            "ID": 227599,
            "ConnectionTypeID": 2,
            "Reference": "1",
            "StatusTypeID": 50,
            "LevelID": 3,
            "Amps": 125,
            "Voltage": 400,
            "PowerKW": 50,
            "CurrentTypeID": 30
        },
        {
            "ID": 227600,
            "ConnectionTypeID": 2,
            "Reference": "2",
            "StatusTypeID": 50,
            "LevelID": 3,
            "Amps": 125,
            "Voltage": 400,
            "PowerKW": 50,
            "CurrentTypeID": 30
        },
        {
            "ID": 257355,
            "ConnectionTypeID": 1036,
            "StatusTypeID": 50,
            "LevelID": 3,
            "PowerKW": 43,
            "CurrentTypeID": 20,
            "Quantity": 1
        }
    ],
    "StatusTypeID": 50,
    "DateLastStatusUpdate": "2021-03-03T11:25:00Z",
    "MetadataValues": [
        {
            "ID": 7456,
            "MetadataFieldID": 4,
            "ItemValue": "Contains public sector information licensed under the Open Government Licence v2.0. http://www.nationalarchives.gov.uk/doc/open-government-licence/version/2/"
        }
    ],
    "DataQualityLevel": 3,
    "DateCreated": "2020-06-25T10:00:00Z",
    "SubmissionStatusTypeID": 100
}