{
    "IsRecentlyVerified": false,
    "ID": 122955,
    "UUID": "2EAE0AD1-09BE-4706-AC83-E4623A90A9FE",
    "DataProviderID": 2,
    "DataProvidersReference": "98612",
    "OperatorID": 5,
    "UsageTypeID": 1,
    "AddressInfo": {
        "ID": 123301,
        "Title": "NPS BUILDING",
        "AddressLine1": "6400 N Hwy 89",
        "Town": "Flagstaff",
        "StateOrProvince": "AZ",
        "Postcode": "86004",
        "CountryID": 2,
        "Latitude": 35.238961,
        "Longitude": -111.570754,
        "ContactTelephone1": "888-758-4389",
        "AccessComments": "24 hours daily",
        "RelatedURL": "http://www.chargepoint.com/",
        "DistanceUnit": 0
    },
    "Connections": [
        {
            "ID": 172884,
            "ConnectionTypeID": 1,
            "LevelID": 2,
            "Amps": 16,
            "Voltage": 230,
            "PowerKW": 3.7,
            "CurrentTypeID": 10,
            "Quantity": 4
        }
    ],
    "DateLastStatusUpdate": "2020-06-26T02:58:00Z",
    "DataQualityLevel": 3,
    "DateCreated": "2019-04-06T05:03:00Z",
    "SubmissionStatusTypeID": 100
}