{
    "MediaItems": [
        {
            "ID": 12898,
            "ChargePointID": 77155,
            "ItemURL": "https://s3-ap-southeast-2.amazonaws.com/openchargemap/images/CH/OCM77155/OCM-77155.orig.2017062706414402.jpg",
            "ItemThumbnailURL": "https://s3-ap-southeast-2.amazonaws.com/openchargemap/images/CH/OCM77155/OCM-77155.thmb.2017062706414402.jpg",
            "Comment": "",
            "IsEnabled": true,
            "IsVideo": false,
            "IsFeaturedItem": false,
            "IsExternalResource": false,
            "User": {
                "ID": 12055,
                "Username": "Erich Camenisch"
            },
            "DateCreated": "2017-06-27T06:42:00Z"
        },
        {
            "ID": 12897,
            "ChargePointID": 77155,
            "ItemURL": "https://s3-ap-southeast-2.amazonaws.com/openchargemap/images/CH/OCM77155/OCM-77155.orig.2017062706411350.jpg",
            "ItemThumbnailURL": "https://s3-ap-southeast-2.amazonaws.com/openchargemap/images/CH/OCM77155/OCM-77155.thmb.2017062706411350.jpg",
            "Comment": "",
            "IsEnabled": true,
            "IsVideo": false,
            "IsFeaturedItem": false,
            "IsExternalResource": false,
            "User": {
                "ID": 12055,
                "Username": "Erich Camenisch"
            },
            "DateCreated": "2017-06-27T06:41:00Z"
        }
    ],
    "IsRecentlyVerified": false,
    "ID": 77155,
    "UUID": "A54D765E-4FA2-407D-BAB0-EAF109FF9122",
    "DataProviderID": 1,
    "OperatorID": 45,
    "UsageTypeID": 5,
    "AddressInfo": {
        "ID": 77501,
        "Title": "Pratteln TRITEC AG",
        "AddressLine1": "Hohenrainstrasse 10",
        "Town": "Pratteln ",
        "StateOrProvince": "Basel-Landschaft ",
        "Postcode": "CH-4133 ",
        "CountryID": 217,
        "Latitude": 47.5255381504365,
        "Longitude": 7.69312554395583,
        "ContactTelephone1": "+41615337520",
        "ContactEmail": "basel@tritec.ch",
        "RelatedURL": "http://www.tritec.ch",
        "DistanceUnit": 0
    },
    "Connections": [
        {
            "ID": 110852,
            "ConnectionTypeID": 25,
            "StatusTypeID": 50,
            "LevelID": 2,
            "Amps": 32,
            "Voltage": 400,
            "PowerKW": 22,
            "CurrentTypeID": 20,
            "Quantity": 2
        }
    ],
    "NumberOfPoints": 2,
    "StatusTypeID": 50,
    "DateLastStatusUpdate": "2017-06-27T06:42:00Z",
    "DataQualityLevel": 1,
    "DateCreated": "2017-01-04T08:30:00Z",
    "SubmissionStatusTypeID": 200
}