{
    "IsRecentlyVerified": false,
    "ID": 34262,
    "UUID": "0B0964ED-B360-40DC-8C23-BA7762BDC1A2",
    "DataProviderID": 26,
    "DataProvidersReference": "51413",
    "OperatorID": 178,
    "OperatorsReference": "EVnetNL GOIJ-DB0001",
    "UsageCost": "0.00 jaarabonnement",
    "AddressInfo": {
        "ID": 34608,
        "Title": "Hutteweg 26",
        "AddressLine1": "Hutteweg 26",
        "Town": "Oude IJsselstreek",
        "Postcode": "7071 BV",
        "CountryID": 159,
        "Latitude": 51.895597,
        "Longitude": 6.383475,
        "ContactTelephone1": "0800-3522365",
        "RelatedURL": "http://www.evnet.nl",
        "DistanceUnit": 0
    },
    "Connections": [
        {
            "ID": 37773,
            "ConnectionTypeID": 25,
            "LevelID": 2,
            "PowerKW": 11,
            "CurrentTypeID": 10
        }
    ],
    "NumberOfPoints": 2,
    "StatusTypeID": 50,
    "DateLastStatusUpdate": "2016-06-04T02:42:00Z",
    "DataQualityLevel": 3,
    "DateCreated": "2015-01-09T06:04:00Z",
    "SubmissionStatusTypeID": 100
}