{
    "IsRecentlyVerified": false,
    "ID": 109131,
    "UUID": "FC041359-13D6-4F8C-A2BB-B44ED968D805",
    "DataProviderID": 1,
    "OperatorID": 23,
    "OperatorsReference": "43286",
    "UsageTypeID": 4,
    "UsageCost": "€0.37/kWh; Autres tarifs pour les voitures anciennes",
    "AddressInfo": {
        "ID": 109477,
        "Title": "Besançon Supercharger",
        "AddressLine1": "1 Bis Rue Victor Considérant",
        "AddressLine2": "Hôtel Akena Besançon",
        "Town": "Chemaudin et Vaux",
        "Postcode": "25770",
        "CountryID": 80,
        "Latitude": 47.234539,
        "Longitude": 5.901153,
        "DistanceUnit": 0
    },
    "Connections": [
        {
            "ID": 154249,
            "ConnectionTypeID": 27,
            "StatusTypeID": 50,
            "LevelID": 3,
            "PowerKW": 150,
            "CurrentTypeID": 30,
            "Quantity": 8
        }
    ],
    "NumberOfPoints": 8,
    "GeneralComments": "8 Superchargers, available 24/7",
    "StatusTypeID": 50,
    "DateLastStatusUpdate": "2021-11-03T12:46:00Z",
    "DataQualityLevel": 1,
    "DateCreated": "2018-10-11T13:42:00Z",
    "SubmissionStatusTypeID": 200
}