{
    "IsRecentlyVerified": false,
    "ID": 186042,
    "UUID": "BC9F3694-803B-48AE-AF4A-D1979A49457C",
    "DataProviderID": 29,
    "DataProvidersReference": "2695",
    "AddressInfo": {
        "ID": 186401,
        "Title": "Industriestraße 1",
        "AddressLine1": "Industriestraße 1",
        "Town": "Schöllkrippen",
        "Postcode": "63826",
        "CountryID": 87,
        "Latitude": 50.086782,
        "Longitude": 9.2466,
        "DistanceUnit": 0
    },
    "Connections": [
        {
            "ID": 297559,
            "ConnectionTypeID": 25,
            "StatusTypeID": 50,
            "LevelID": 2,
            "PowerKW": 22,
            "CurrentTypeID": 20
        },
        {
            "ID": 297560,
            "ConnectionTypeID": 25,
            "StatusTypeID": 50,
            "LevelID": 2,
            "PowerKW": 22,
            "CurrentTypeID": 20
        }
    ],
    "StatusTypeID": 50,
    "DateLastStatusUpdate": "2021-07-12T02:44:00Z",
    "MetadataValues": [
        {
            "ID": 18284,
            "MetadataFieldID": 4,
            "ItemValue": "Data from the German chargepoint registry provided by Bundesnetzagentur.de under the CC-BY 4.0 license"
        }
    ],
    "DataQualityLevel": 3,
    "DateCreated": "2021-07-12T02:44:00Z",
    "SubmissionStatusTypeID": 100
}