{
    "IsRecentlyVerified": false,
    "ID": 64926,
    "UUID": "BCBBFD75-CF73-46E7-B76D-F37B497A72B8",
    "DataProviderID": 1,
    "OperatorID": 1,
    "UsageTypeID": 1,
    "AddressInfo": {
        "ID": 65272,
        "Title": "Am Rathausplatz",
        "AddressLine1": "Hohenzollernstraße",
        "Town": "Völklingen",
        "StateOrProvince": "Regionalverband Saarbrücken",
        "Postcode": "66333",
        "CountryID": 87,
        "Latitude": 49.2518003236916,
        "Longitude": 6.860092280950978,
        "AccessComments": "2 kostenlose reservierte durchgehend verfügbare Parkplätze vor der Ladesäule. Betreiber ist e-mobil Saar; Zugang mit EC oder Kreditkarte (kostenlos, keine Abrechnung).",
        "RelatedURL": "http://www.saarland.de/dokumente/thema_elektromobilitaet/e-Mobil_Saar-Zugang_Ladesaeulen.pdf",
        "DistanceUnit": 0
    },
    "Connections": [
        {
            "ID": 83555,
            "ConnectionTypeID": 25,
            "StatusTypeID": 50,
            "LevelID": 2,
            "Amps": 16,
            "Voltage": 400,
            "PowerKW": 11,
            "CurrentTypeID": 20,
            "Quantity": 2
        }
    ],
    "NumberOfPoints": 2,
    "StatusTypeID": 50,
    "DateLastStatusUpdate": "2016-04-01T05:40:00Z",
    "DataQualityLevel": 1,
    "DateCreated": "2016-04-01T05:40:00Z",
    "SubmissionStatusTypeID": 200
}