{
    "IsRecentlyVerified": false,
    "ID": 75465,
    "UUID": "B1843786-9E4E-4C5B-A526-992892D58400",
    "DataProviderID": 1,
    "OperatorID": 3265,
    "UsageTypeID": 4,
    "AddressInfo": {
        "ID": 75811,
        "Title": "Park & Ride Parkplatz Continental Arena",
        "AddressLine1": "Unterislinger Weg 53",
        "Town": "Regensburg",
        "StateOrProvince": "Regensburg",
        "Postcode": "93053",
        "CountryID": 87,
        "Latitude": 48.9912781939052,
        "Longitude": 12.1123504980087,
        "DistanceUnit": 0
    },
    "Connections": [
        {
            "ID": 108780,
            "ConnectionTypeID": 25,
            "StatusTypeID": 50,
            "LevelID": 2,
            "Amps": 16,
            "Voltage": 400,
            "PowerKW": 11,
            "CurrentTypeID": 20,
            "Quantity": 2
        }
    ],
    "NumberOfPoints": 2,
    "GeneralComments": "Betreiber sind die Stadtwerke Regensburg (REWAG). Ladekarte Rewario oder Charge&Pay, New Motion oder PlugSurfing zur Freischaltung.",
    "StatusTypeID": 50,
    "DateLastStatusUpdate": "2017-01-30T07:03:00Z",
    "DataQualityLevel": 1,
    "DateCreated": "2016-12-15T07:13:00Z",
    "SubmissionStatusTypeID": 200
}