{
    "IsRecentlyVerified": false,
    "ID": 151662,
    "UUID": "FB75EE8B-64D3-44C3-8274-139DEFECFE37",
    "DataProviderID": 28,
    "DataProvidersReference": "FR*S38*P38225*A",
    "OperatorID": 3408,
    "UsageTypeID": 5,
    "AddressInfo": {
        "ID": 152015,
        "Title": "AUTRANS MEAUDRE EN VERCORS_Place G?rard Clet",
        "AddressLine1": "Place G?rard Clet 38880 AUTRANS MEAUDRE EN VERCORS",
        "CountryID": 80,
        "Latitude": 45.1274889,
        "Longitude": 5.527525,
        "AccessComments": "24/24 7/7 jours",
        "DistanceUnit": 0
    },
    "Connections": [
        {
            "ID": 211902,
            "ConnectionTypeID": 28,
            "StatusTypeID": 50,
            "LevelID": 2,
            "PowerKW": 22,
            "CurrentTypeID": 10
        },
        {
            "ID": 211903,
            "ConnectionTypeID": 1036,
            "StatusTypeID": 50,
            "LevelID": 2,
            "PowerKW": 22,
            "CurrentTypeID": 20
        },
        {
            "ID": 243871,
            "ConnectionTypeID": 28,
            "StatusTypeID": 50,
            "LevelID": 2,
            "PowerKW": 22,
            "CurrentTypeID": 10
        },
        {
            "ID": 243872,
            "ConnectionTypeID": 1036,
            "StatusTypeID": 50,
            "LevelID": 2,
            "PowerKW": 22,
            "CurrentTypeID": 20
        }
    ],
    "GeneralComments": "",
    "StatusTypeID": 50,
    "DateLastStatusUpdate": "2020-08-27T05:12:00Z",
    "DataQualityLevel": 2,
    "DateCreated": "2020-03-15T10:53:00Z",
    "SubmissionStatusTypeID": 100
}