{
    "UserComments": [
        {
            "ID": 8205,
            "ChargePointID": 9275,
            "CommentTypeID": 50,
            "UserName": "Someone_Just_",
            "Comment": "No power, Parking Steenplein is use for a Christmas market till 3 January ",
            "Rating": 1,
            "DateCreated": "2015-12-11T23:04:24.747Z",
            "User": {
                "ID": 1107,
                "Username": "Someone_Just_"
            },
            "CheckinStatusTypeID": 20
        },
        {
            "ID": 3934,
            "ChargePointID": 9275,
            "CommentTypeID": 10,
            "UserName": "Someone_Just_",
            "Comment": "No power, no charging possible... ",
            "Rating": 1,
            "DateCreated": "2015-03-06T18:01:24.693Z",
            "User": {
                "ID": 1107,
                "Username": "Someone_Just_"
            },
            "CheckinStatusTypeID": 25
        }
    ],
    "MediaItems": [
        {
            "ID": 3600,
            "ChargePointID": 9275,
            "ItemURL": "https://s3-ap-southeast-2.amazonaws.com/openchargemap/images/BE/OCM9275/OCM-9275.orig.2015121122582101.jpg",
            "ItemThumbnailURL": "https://s3-ap-southeast-2.amazonaws.com/openchargemap/images/BE/OCM9275/OCM-9275.thmb.2015121122582101.jpg",
            "Comment": "No power...",
            "IsEnabled": true,
            "IsVideo": false,
            "IsFeaturedItem": false,
            "IsExternalResource": false,
            "User": {
                "ID": 1107,
                "Username": "Someone_Just_"
            },
            "DateCreated": "2015-12-11T22:59:00Z"
        },
        {
            "ID": 82,
            "ChargePointID": 9275,
            "ItemURL": "https://s3-ap-southeast-2.amazonaws.com/openchargemap/images/BE/OCM9275/OCM-9275.orig.2013090221541839.jpg",
            "ItemThumbnailURL": "https://s3-ap-southeast-2.amazonaws.com/openchargemap/images/BE/OCM9275/OCM-9275.thmb.2013090221541839.jpg",
            "Comment": "Code needed for paying charge by sms: ANTE1",
            "IsEnabled": true,
            "IsVideo": false,
            "IsFeaturedItem": false,
            "IsExternalResource": false,
            "User": {
                "ID": 1107,
                "Username": "Someone_Just_"
            },
            "DateCreated": "2013-09-02T21:54:00Z"
        }
    ],
    "IsRecentlyVerified": false,
    "ID": 9275,
    "UUID": "863D33B4-1E2E-470A-9AA2-7E897EAE04BE",
    "DataProviderID": 1,
    "OperatorID": 35,
    "UsageTypeID": 5,
    "UsageCost": "Pay by SMS or buy a card.",
    "AddressInfo": {
        "ID": 9172,
        "Title": "Steenplein",
        "AddressLine1": "Steenplein",
        "Town": "Antwerpen",
        "CountryID": 26,
        "Latitude": 51.222072438367,
        "Longitude": 4.3968123283662,
        "ContactTelephone1": "+32 (0)3 727 16 60",
        "ContactEmail": "info@gapa.antwerpen.be",
        "RelatedURL": "http://www.parkereninantwerpen.be/publieke-oplaadpalen",
        "DistanceUnit": 0
    },
    "Connections": [
        {
            "ID": 23104,
            "ConnectionTypeID": 23,
            "StatusTypeID": 50,
            "LevelID": 2,
            "Amps": 16,
            "Voltage": 220,
            "PowerKW": 3.5,
            "CurrentTypeID": 10,
            "Quantity": 1
        }
    ],
    "NumberOfPoints": 1,
    "GeneralComments": "Er zijn 3 manieren om op te laden:  1. Sms (beschikbaar voor alle Belgische gsm-providers; 0,15 euro per verzonden/ontvangen sms)       Opladen starten: u stuurt een bericht met het nummer van de paal, gevolgd door een spatie en uw volledige nummerplaat (zonder spaties) naar 4242.      Opladen stoppen: u stuurt een bericht met ‘Q' naar 4242.  2.  QR-Code (beschikbaar voor alle Belgische gsm-providers; 0,15 euro per verzonden/ontvangen sms)      Opladen starten: u scant de QR-code op de paal, waarna u via de 4242 applicatie het opladen eenvoudig kan starten door uw nummerplaat in te geven.      Opladen stoppen: ‘Stop' aanklikken in de 4242 applicatie.  Deze applicatie is al beschikbaar voor de Android-markt, eind januari 2012 volgt de iPhone App Store.  3.  Badge (te koop bij het Parkeerbedrijf voor 20 euro)      Opladen starten en stoppen: kaart tegen de kaartlezer houden. (geen kosten)                De stopcontacten op de palen zijn van het ‘type E'.   http://electricaloutlet.org/type-e",
    "StatusTypeID": 50,
    "DateLastStatusUpdate": "2015-12-11T23:04:00Z",
    "DataQualityLevel": 1,
    "DateCreated": "2012-02-07T11:03:00Z",
    "SubmissionStatusTypeID": 200
}