{
    "IsRecentlyVerified": false,
    "ID": 109306,
    "UUID": "A762D527-097F-4128-8762-EE88BE952ADE",
    "DataProviderID": 1,
    "OperatorID": 23,
    "OperatorsReference": "44969",
    "UsageTypeID": 4,
    "AddressInfo": {
        "ID": 109652,
        "Title": "Hôtel Castel Burgond",
        "AddressLine1": "3 Route de Troyes",
        "Town": "Da",
        "StateOrProvince": "Daix",
        "Postcode": "21121",
        "CountryID": 80,
        "Latitude": 47.34303,
        "Longitude": 5.000764,
        "ContactTelephone1": " +33 3 80 56 59 72",
        "DistanceUnit": 0
    },
    "Connections": [
        {
            "ID": 154424,
            "ConnectionTypeID": 30,
            "StatusTypeID": 50,
            "LevelID": 2,
            "Amps": 16,
            "Voltage": 400,
            "PowerKW": 11,
            "CurrentTypeID": 20,
            "Quantity": 2
        }
    ],
    "NumberOfPoints": 2,
    "GeneralComments": "2 Tesla Connectors, up to 11kW.Available for customers. Please see front desk.",
    "StatusTypeID": 50,
    "DateLastStatusUpdate": "2018-10-11T14:16:00Z",
    "DataQualityLevel": 1,
    "DateCreated": "2018-10-11T14:16:00Z",
    "SubmissionStatusTypeID": 200
}