{
    "IsRecentlyVerified": false,
    "ID": 142744,
    "UUID": "E89CF4C0-BFD3-46E2-A1D7-B051527B7367",
    "DataProviderID": 2,
    "DataProvidersReference": "93702",
    "OperatorID": 15,
    "UsageTypeID": 4,
    "AddressInfo": {
        "ID": 143096,
        "Title": "Fairfield Plaza",
        "AddressLine1": "116 Danbury Rd",
        "Town": "New Milford",
        "StateOrProvince": "CT",
        "Postcode": "06776",
        "CountryID": 2,
        "Latitude": 41.55735,
        "Longitude": -73.41763,
        "ContactTelephone1": "877-455-3833",
        "AccessComments": "24 hours daily\r\nPublic - Card key at all times",
        "RelatedURL": "https://www.evgo.com/",
        "DistanceUnit": 0
    },
    "Connections": [
        {
            "ID": 198951,
            "ConnectionTypeID": 2,
            "LevelID": 3,
            "Amps": 100,
            "Voltage": 400,
            "PowerKW": 40,
            "CurrentTypeID": 30,
            "Quantity": 1
        },
        {
            "ID": 198952,
            "ConnectionTypeID": 32,
            "LevelID": 3,
            "Amps": 100,
            "Voltage": 400,
            "PowerKW": 40,
            "CurrentTypeID": 30,
            "Quantity": 1
        }
    ],
    "StatusTypeID": 50,
    "DateLastStatusUpdate": "2020-06-26T03:04:00Z",
    "DataQualityLevel": 3,
    "DateCreated": "2019-12-24T09:18:00Z",
    "SubmissionStatusTypeID": 100
}