{
    "IsRecentlyVerified": false,
    "ID": 77338,
    "UUID": "DEC16D8F-F501-4C65-B7B2-8F6B17A492A6",
    "DataProviderID": 1,
    "OperatorID": 3253,
    "OperatorsReference": "AT*SMA*EAT0301369*001AC,AT*SMA*EAT0301369*002AC",
    "UsageTypeID": 1,
    "UsageCost": "€0,15/min ; Andere Tarife möglich",
    "AddressInfo": {
        "ID": 77684,
        "Title": "Ladestation Gottwald",
        "AddressLine1": "Wiener Straße 99",
        "Town": "Melk",
        "StateOrProvince": "Niederösterreich",
        "Postcode": "3390",
        "CountryID": 19,
        "Latitude": 48.22514,
        "Longitude": 15.349178,
        "DistanceUnit": 0
    },
    "Connections": [
        {
            "ID": 111420,
            "ConnectionTypeID": 25,
            "StatusTypeID": 50,
            "LevelID": 2,
            "Amps": 32,
            "Voltage": 400,
            "PowerKW": 22,
            "CurrentTypeID": 20,
            "Quantity": 2
        }
    ],
    "NumberOfPoints": 6,
    "StatusTypeID": 50,
    "DateLastStatusUpdate": "2018-07-23T13:13:00Z",
    "DataQualityLevel": 1,
    "DateCreated": "2017-01-09T09:46:00Z",
    "SubmissionStatusTypeID": 200
}