{
    "IsRecentlyVerified": false,
    "ID": 28992,
    "UUID": "B75B45C6-AD88-4822-B526-B8CEB4D9C755",
    "DataProviderID": 2,
    "DataProvidersReference": "44313",
    "UsageTypeID": 7,
    "AddressInfo": {
        "ID": 29338,
        "Title": "Nissan of Keene",
        "AddressLine1": "544 Monadnock Hwy",
        "Town": "Swanzey",
        "StateOrProvince": "NH",
        "Postcode": "03446",
        "CountryID": 2,
        "Latitude": 42.878599,
        "Longitude": -72.233177,
        "ContactTelephone1": "603-357-7945",
        "AccessComments": "Dealership business hours\r\nPublic - Call ahead",
        "RelatedURL": "",
        "DistanceUnit": 0
    },
    "Connections": [
        {
            "ID": 31855,
            "ConnectionTypeID": 1,
            "LevelID": 2,
            "Amps": 16,
            "Voltage": 230,
            "PowerKW": 3.7,
            "CurrentTypeID": 10,
            "Quantity": 1
        }
    ],
    "DateLastStatusUpdate": "2020-06-26T03:06:00Z",
    "DataQualityLevel": 3,
    "DateCreated": "2014-11-28T03:38:00Z",
    "SubmissionStatusTypeID": 100
}