{
    "IsRecentlyVerified": false,
    "ID": 27693,
    "UUID": "59F0893C-8AB8-4A42-9F82-ACD278E0B710",
    "DataProviderID": 2,
    "DataProvidersReference": "51952",
    "UsageTypeID": 1,
    "AddressInfo": {
        "ID": 28039,
        "Title": "Mark Day School",
        "AddressLine1": "39 Trellis Dr",
        "Town": "San Rafael",
        "StateOrProvince": "CA",
        "Postcode": "94903",
        "CountryID": 2,
        "Latitude": 38.007147,
        "Longitude": -122.554769,
        "ContactTelephone1": "415-472-8000",
        "AccessComments": "24 hours daily",
        "RelatedURL": "",
        "DistanceUnit": 0
    },
    "Connections": [
        {
            "ID": 30384,
            "ConnectionTypeID": 1,
            "LevelID": 2,
            "Amps": 16,
            "Voltage": 230,
            "PowerKW": 3,
            "CurrentTypeID": 10,
            "Quantity": 2
        }
    ],
    "DateLastStatusUpdate": "2019-04-06T04:02:00Z",
    "DataQualityLevel": 3,
    "DateCreated": "2014-11-28T03:38:00Z",
    "SubmissionStatusTypeID": 100
}