{
    "IsRecentlyVerified": false,
    "ID": 115461,
    "UUID": "69556D7B-FAB6-471C-BEF3-FC84866B7D82",
    "DataProviderID": 2,
    "DataProvidersReference": "112953",
    "OperatorID": 23,
    "UsageTypeID": 1,
    "AddressInfo": {
        "ID": 115807,
        "Title": "Two Bunch Palms Resort & Spa - Tesla Destination",
        "AddressLine1": "67425 Two Bunch Palms Trail",
        "Town": "Desert Hot Springs",
        "StateOrProvince": "CA",
        "Postcode": "92240",
        "CountryID": 2,
        "Latitude": 33.945224,
        "Longitude": -116.487266,
        "ContactTelephone1": "760-329-8791  877-798-3752",
        "AccessComments": "24 hours daily; for Tesla use only; for guest use only; see front desk for access",
        "RelatedURL": "https://www.tesla.com/destination-charging",
        "DistanceUnit": 0
    },
    "Connections": [
        {
            "ID": 162473,
            "ConnectionTypeID": 0,
            "LevelID": 2,
            "Amps": 16,
            "Voltage": 230,
            "PowerKW": 3,
            "CurrentTypeID": 10,
            "Quantity": 2
        }
    ],
    "DateLastStatusUpdate": "2019-04-06T04:01:00Z",
    "DataQualityLevel": 3,
    "DateCreated": "2019-02-11T07:13:00Z",
    "SubmissionStatusTypeID": 100
}