{
    "IsRecentlyVerified": false,
    "ID": 188133,
    "UUID": "53E7E753-6C08-4641-8D89-D0AD28601EE3",
    "DataProviderID": 18,
    "DataProvidersReference": "a8e498830f4ca868f47fc120305eec0f",
    "OperatorID": 20,
    "UsageTypeID": 1,
    "AddressInfo": {
        "ID": 188492,
        "Title": "Beacon Street",
        "AddressLine1": "Beacon Street",
        "Town": "South Shields",
        "Postcode": "NE33 2AQ",
        "CountryID": 1,
        "Latitude": 55.005656,
        "Longitude": -1.43069,
        "AccessComments": "",
        "RelatedURL": "http://www.chargeyourcar.org.uk",
        "DistanceUnit": 0
    },
    "Connections": [
        {
            "ID": 303617,
            "ConnectionTypeID": 25,
            "Reference": "1",
            "StatusTypeID": 50,
            "LevelID": 2,
            "Amps": 32,
            "Voltage": 230,
            "PowerKW": 7,
            "CurrentTypeID": 10
        },
        {
            "ID": 303618,
            "ConnectionTypeID": 25,
            "Reference": "2",
            "StatusTypeID": 50,
            "LevelID": 2,
            "Amps": 32,
            "Voltage": 230,
            "PowerKW": 7,
            "CurrentTypeID": 10
        }
    ],
    "StatusTypeID": 0,
    "DateLastStatusUpdate": "2021-07-12T03:39:00Z",
    "MetadataValues": [
        {
            "ID": 20373,
            "MetadataFieldID": 4,
            "ItemValue": "Contains public sector information licensed under the Open Government Licence v2.0. http://www.nationalarchives.gov.uk/doc/open-government-licence/version/2/"
        }
    ],
    "DataQualityLevel": 3,
    "DateCreated": "2021-07-12T03:39:00Z",
    "SubmissionStatusTypeID": 100
}