{
    "IsRecentlyVerified": false,
    "ID": 121646,
    "UUID": "70F15647-8768-4E12-B112-76F8F8330433",
    "DataProviderID": 2,
    "DataProvidersReference": "121153",
    "OperatorID": 3318,
    "UsageTypeID": 1,
    "AddressInfo": {
        "ID": 121992,
        "Title": "Walmart Sams Club 8297 (Rockford, IL)",
        "AddressLine1": "7151 Walton St",
        "Town": "Rockford",
        "StateOrProvince": "IL",
        "Postcode": "61108",
        "CountryID": 2,
        "Latitude": 42.26657,
        "Longitude": -88.978293,
        "ContactTelephone1": "833-632-2778",
        "AccessComments": "24 hours daily",
        "RelatedURL": "https://www.electrifyamerica.com/",
        "DistanceUnit": 0
    },
    "Connections": [
        {
            "ID": 171434,
            "ConnectionTypeID": 2,
            "LevelID": 2,
            "Amps": 100,
            "Voltage": 400,
            "PowerKW": 40,
            "CurrentTypeID": 10,
            "Quantity": 1
        },
        {
            "ID": 171435,
            "ConnectionTypeID": 32,
            "LevelID": 2,
            "Amps": 100,
            "Voltage": 400,
            "PowerKW": 40,
            "CurrentTypeID": 10,
            "Quantity": 1
        }
    ],
    "DateLastStatusUpdate": "2019-04-06T04:01:00Z",
    "DataQualityLevel": 3,
    "DateCreated": "2019-04-06T04:01:00Z",
    "SubmissionStatusTypeID": 100
}