{
    "IsRecentlyVerified": false,
    "ID": 107532,
    "UUID": "3FB1B014-B906-44E6-8919-F50281A23BDA",
    "DataProviderID": 1,
    "OperatorID": 1,
    "UsageTypeID": 1,
    "UsageCost": "Free",
    "AddressInfo": {
        "ID": 107878,
        "Title": "King Street Car Park",
        "AddressLine1": "7 Seddon Lane",
        "Town": "Pukekohe",
        "Postcode": "2120",
        "CountryID": 161,
        "Latitude": -37.199889,
        "Longitude": 174.902775,
        "DistanceUnit": 0
    },
    "Connections": [
        {
            "ID": 151721,
            "ConnectionTypeID": 2,
            "StatusTypeID": 50,
            "LevelID": 3,
            "PowerKW": 50,
            "CurrentTypeID": 30,
            "Quantity": 1
        },
        {
            "ID": 151722,
            "ConnectionTypeID": 33,
            "StatusTypeID": 50,
            "LevelID": 3,
            "PowerKW": 50,
            "CurrentTypeID": 30,
            "Quantity": 1
        }
    ],
    "NumberOfPoints": 1,
    "StatusTypeID": 50,
    "DateLastStatusUpdate": "2018-08-01T20:08:00Z",
    "DataQualityLevel": 1,
    "DateCreated": "2018-08-01T09:23:00Z",
    "SubmissionStatusTypeID": 200
}