{
    "IsRecentlyVerified": false,
    "ID": 160305,
    "UUID": "F0AAE063-44C8-4A6E-BA32-FBF32DE5C792",
    "DataProviderID": 2,
    "DataProvidersReference": "154172",
    "OperatorID": 5,
    "UsageTypeID": 1,
    "AddressInfo": {
        "ID": 160662,
        "Title": "ECONOLODGE",
        "AddressLine1": "237 W Main St",
        "Town": "Malone",
        "StateOrProvince": "NY",
        "Postcode": "12953",
        "CountryID": 2,
        "Latitude": 44.848682,
        "Longitude": -74.30688,
        "ContactTelephone1": "888-758-4389",
        "AccessComments": "24 hours daily",
        "RelatedURL": "http://www.chargepoint.com/",
        "DistanceUnit": 0
    },
    "Connections": [
        {
            "ID": 230650,
            "ConnectionTypeID": 1,
            "LevelID": 2,
            "Amps": 16,
            "Voltage": 230,
            "PowerKW": 3.7,
            "CurrentTypeID": 10,
            "Quantity": 2
        }
    ],
    "StatusTypeID": 50,
    "DateLastStatusUpdate": "2020-06-26T03:08:00Z",
    "DataQualityLevel": 3,
    "DateCreated": "2020-06-26T03:08:00Z",
    "SubmissionStatusTypeID": 100
}