{
    "IsRecentlyVerified": false,
    "ID": 160510,
    "UUID": "4B735620-F368-4CAC-9B10-F871C46B2CEB",
    "DataProviderID": 2,
    "DataProvidersReference": "86834",
    "UsageTypeID": 1,
    "AddressInfo": {
        "ID": 160867,
        "Title": "St. Eleanor Community Centre",
        "AddressLine1": "1 West Dr",
        "Town": "Summerside",
        "StateOrProvince": "PE",
        "Postcode": "C1N 6T6",
        "CountryID": 44,
        "Latitude": 46.422161,
        "Longitude": -63.811473,
        "ContactTelephone1": "902-432-1287",
        "AccessComments": "24 hours daily",
        "RelatedURL": "",
        "DistanceUnit": 0
    },
    "Connections": [
        {
            "ID": 230951,
            "ConnectionTypeID": 1,
            "LevelID": 2,
            "Amps": 16,
            "Voltage": 230,
            "PowerKW": 3.7,
            "CurrentTypeID": 10,
            "Quantity": 1
        }
    ],
    "StatusTypeID": 50,
    "DateLastStatusUpdate": "2020-06-26T03:10:00Z",
    "DataQualityLevel": 3,
    "DateCreated": "2020-06-26T03:10:00Z",
    "SubmissionStatusTypeID": 100
}