{
    "IsRecentlyVerified": false,
    "ID": 63663,
    "UUID": "23CB685C-7DC5-43DF-8561-DC2471AA7687",
    "DataProviderID": 26,
    "DataProvidersReference": "75495",
    "OperatorID": 73,
    "OperatorsReference": "EV-Box EVB-P1450017",
    "UsageCost": "0.00 jaarabonnement",
    "AddressInfo": {
        "ID": 64009,
        "Title": "Reeënbergweg 18-1",
        "AddressLine1": "Reeënbergweg 18-1",
        "Town": "Apeldoorn",
        "Postcode": "7361 GR",
        "CountryID": 159,
        "Latitude": 52.14049,
        "Longitude": 5.99775,
        "RelatedURL": "http://www.ev-box.nl",
        "DistanceUnit": 0
    },
    "Connections": [
        {
            "ID": 81260,
            "ConnectionTypeID": 25,
            "LevelID": 2,
            "PowerKW": 5,
            "CurrentTypeID": 10
        }
    ],
    "NumberOfPoints": 1,
    "StatusTypeID": 50,
    "DateLastStatusUpdate": "2016-06-04T02:50:00Z",
    "DataQualityLevel": 3,
    "DateCreated": "2016-03-03T12:31:00Z",
    "SubmissionStatusTypeID": 100
}