{
    "IsRecentlyVerified": false,
    "ID": 136024,
    "UUID": "7287254C-F339-4164-87A6-3C169D1B8903",
    "DataProviderID": 18,
    "DataProvidersReference": "85fe1639a19f0e3e064ff2ea6ba590ed",
    "OperatorID": 2244,
    "UsageTypeID": 5,
    "AddressInfo": {
        "ID": 136370,
        "Title": "20 Sedlescombe Road",
        "AddressLine1": "20 Sedlescombe Road",
        "Town": "London",
        "Postcode": "SW6 1RD",
        "CountryID": 1,
        "Latitude": 51.484694,
        "Longitude": -0.200908,
        "AccessComments": "",
        "RelatedURL": "https://www.ubitricity.com",
        "DistanceUnit": 0
    },
    "Connections": [
        {
            "ID": 190451,
            "ConnectionTypeID": 25,
            "Reference": "suby1100001683",
            "StatusTypeID": 50,
            "LevelID": 2,
            "Amps": 16,
            "Voltage": 230,
            "PowerKW": 3.7,
            "CurrentTypeID": 10
        }
    ],
    "StatusTypeID": 0,
    "DateLastStatusUpdate": "2021-04-25T05:46:00Z",
    "MetadataValues": [
        {
            "ID": 5876,
            "MetadataFieldID": 4,
            "ItemValue": "Contains public sector information licensed under the Open Government Licence v2.0. http://www.nationalarchives.gov.uk/doc/open-government-licence/version/2/"
        }
    ],
    "DataQualityLevel": 3,
    "DateCreated": "2019-12-24T05:22:00Z",
    "SubmissionStatusTypeID": 100
}