{
    "IsRecentlyVerified": false,
    "ID": 75939,
    "UUID": "A3555E6A-8663-4DCF-874D-2C078A4905F9",
    "DataProviderID": 1,
    "DataProvidersReference": "3725",
    "OperatorID": 1,
    "UsageTypeID": 5,
    "AddressInfo": {
        "ID": 76285,
        "Title": "Circle K Vinstra",
        "AddressLine1": "Rustvegen 79",
        "Town": "VINSTRA",
        "StateOrProvince": "Innlandet",
        "Postcode": "2640",
        "CountryID": 168,
        "Latitude": 61.59216,
        "Longitude": 9.72421,
        "AccessComments": "",
        "DistanceUnit": 0
    },
    "Connections": [
        {
            "ID": 109555,
            "ConnectionTypeID": 33,
            "Reference": "1",
            "StatusTypeID": 50,
            "LevelID": 3,
            "Amps": 100,
            "Voltage": 500,
            "PowerKW": 50,
            "CurrentTypeID": 30,
            "Quantity": 2,
            "Comments": "Mode 4"
        },
        {
            "ID": 109557,
            "ConnectionTypeID": 2,
            "Reference": "3",
            "StatusTypeID": 50,
            "LevelID": 3,
            "Amps": 100,
            "Voltage": 500,
            "PowerKW": 50,
            "CurrentTypeID": 30,
            "Quantity": 2,
            "Comments": "Mode 4"
        },
        {
            "ID": 109559,
            "ConnectionTypeID": 25,
            "Reference": "5",
            "StatusTypeID": 50,
            "LevelID": 2,
            "Amps": 32,
            "Voltage": 400,
            "PowerKW": 22,
            "CurrentTypeID": 20,
            "Quantity": 2,
            "Comments": "Mode 3"
        }
    ],
    "NumberOfPoints": 6,
    "DateLastStatusUpdate": "2020-08-27T18:14:00Z",
    "DataQualityLevel": 2,
    "DateCreated": "2016-12-23T04:08:00Z",
    "SubmissionStatusTypeID": 100
}