{
    "IsRecentlyVerified": false,
    "ID": 116899,
    "UUID": "5960B5B1-97B4-4F40-BD9D-1CD86FF666F6",
    "DataProviderID": 1,
    "OperatorID": 80,
    "UsageTypeID": 4,
    "AddressInfo": {
        "ID": 117245,
        "Title": "Arpino SP 92 | EnelX",
        "AddressLine1": "Strada Provinciale 92 - Via Latina",
        "Town": "Arpino",
        "StateOrProvince": "FR",
        "Postcode": "03033",
        "CountryID": 112,
        "Latitude": 41.649504563215146,
        "Longitude": 13.609141045771139,
        "RelatedURL": "https://www.enelx.com/it/it/emobility",
        "DistanceUnit": 0
    },
    "Connections": [
        {
            "ID": 165472,
            "ConnectionTypeID": 25,
            "StatusTypeID": 50,
            "LevelID": 2,
            "Amps": 32,
            "Voltage": 400,
            "PowerKW": 22,
            "CurrentTypeID": 20,
            "Quantity": 1
        },
        {
            "ID": 165473,
            "ConnectionTypeID": 36,
            "StatusTypeID": 50,
            "LevelID": 2,
            "Amps": 16,
            "Voltage": 240,
            "PowerKW": 3.7,
            "CurrentTypeID": 10,
            "Quantity": 1
        }
    ],
    "NumberOfPoints": 2,
    "StatusTypeID": 50,
    "DateLastStatusUpdate": "2019-02-13T11:43:00Z",
    "DataQualityLevel": 1,
    "DateCreated": "2019-02-13T11:43:00Z",
    "SubmissionStatusTypeID": 200
}