{
    "IsRecentlyVerified": false,
    "ID": 63306,
    "UUID": "80F6BD48-AC71-473D-A0E3-A34D0F83F848",
    "DataProviderID": 26,
    "DataProvidersReference": "72300",
    "OperatorID": 73,
    "OperatorsReference": "EV-Box EVB-P1516005",
    "UsageCost": "0.00 jaarabonnement",
    "AddressInfo": {
        "ID": 63652,
        "Title": "Philip Vingboonsstraat 21",
        "AddressLine1": "Philip Vingboonsstraat 21",
        "Town": "Rotterdam",
        "Postcode": "3067 ZA",
        "CountryID": 159,
        "Latitude": 51.93923,
        "Longitude": 4.54058,
        "RelatedURL": "http://www.ev-box.nl",
        "DistanceUnit": 0
    },
    "Connections": [
        {
            "ID": 80669,
            "ConnectionTypeID": 25,
            "LevelID": 2,
            "PowerKW": 11,
            "CurrentTypeID": 10
        },
        {
            "ID": 80670,
            "ConnectionTypeID": 25,
            "LevelID": 2,
            "PowerKW": 11,
            "CurrentTypeID": 10
        }
    ],
    "NumberOfPoints": 1,
    "StatusTypeID": 50,
    "DateLastStatusUpdate": "2016-06-04T02:42:00Z",
    "DataQualityLevel": 3,
    "DateCreated": "2016-03-03T12:30:00Z",
    "SubmissionStatusTypeID": 100
}