{
    "IsRecentlyVerified": false,
    "ID": 142834,
    "UUID": "1BD8B067-A84B-4AD7-973A-7FB46CB7282D",
    "DataProviderID": 2,
    "DataProvidersReference": "143798",
    "UsageTypeID": 2,
    "AddressInfo": {
        "ID": 143186,
        "Title": "MetLife - Bloomfield",
        "AddressLine1": "1300 Hall Blvd",
        "Town": "Bloomfield",
        "StateOrProvince": "CT",
        "Postcode": "06002",
        "CountryID": 2,
        "Latitude": 41.805926,
        "Longitude": -72.750437,
        "ContactTelephone1": "860-656-3008",
        "AccessComments": "Employee Use Only",
        "RelatedURL": "",
        "DistanceUnit": 0
    },
    "Connections": [
        {
            "ID": 199060,
            "ConnectionTypeID": 1,
            "LevelID": 2,
            "Amps": 16,
            "Voltage": 230,
            "PowerKW": 3.7,
            "CurrentTypeID": 10,
            "Quantity": 2
        }
    ],
    "StatusTypeID": 50,
    "DateLastStatusUpdate": "2020-06-26T03:05:00Z",
    "DataQualityLevel": 3,
    "DateCreated": "2019-12-24T09:19:00Z",
    "SubmissionStatusTypeID": 100
}