{
    "IsRecentlyVerified": false,
    "ID": 120528,
    "UUID": "94B2E5FA-AA0D-42E0-BABE-A5E5C2181332",
    "DataProviderID": 2,
    "DataProvidersReference": "87997",
    "OperatorID": 5,
    "UsageTypeID": 1,
    "AddressInfo": {
        "ID": 120874,
        "Title": "UTC",
        "AddressLine1": "9001-9065 Genesee Ave",
        "Town": "San Diego",
        "StateOrProvince": "CA",
        "Postcode": "92122",
        "CountryID": 2,
        "Latitude": 32.87049,
        "Longitude": -117.2132196,
        "ContactTelephone1": "888-758-4389",
        "AccessComments": "24 hours daily",
        "RelatedURL": "http://www.chargepoint.com/",
        "DistanceUnit": 0
    },
    "Connections": [
        {
            "ID": 169882,
            "ConnectionTypeID": 1,
            "LevelID": 2,
            "Amps": 16,
            "Voltage": 230,
            "PowerKW": 3,
            "CurrentTypeID": 10,
            "Quantity": 2
        }
    ],
    "DateLastStatusUpdate": "2019-12-24T09:09:00Z",
    "DataQualityLevel": 3,
    "DateCreated": "2019-04-01T04:59:00Z",
    "SubmissionStatusTypeID": 100
}