{
    "IsRecentlyVerified": false,
    "ID": 176244,
    "UUID": "9E918118-F9D5-4F38-99B4-49FCECFB0E0C",
    "DataProviderID": 1,
    "OperatorID": 3455,
    "UsageTypeID": 4,
    "AddressInfo": {
        "ID": 176603,
        "Title": "Aral Alleringersleben",
        "AddressLine1": "Aral",
        "Town": "Alleringersleben",
        "StateOrProvince": "Saxony-Anhalt",
        "Postcode": "39343",
        "CountryID": 87,
        "Latitude": 52.20953964090273,
        "Longitude": 11.133194163507369,
        "DistanceUnit": 0
    },
    "Connections": [
        {
            "ID": 273898,
            "ConnectionTypeID": 33,
            "Reference": "DE*BPE*E0FM13*01*01",
            "StatusTypeID": 50,
            "LevelID": 3,
            "Amps": 500,
            "Voltage": 1000,
            "PowerKW": 300,
            "CurrentTypeID": 30,
            "Quantity": 1
        },
        {
            "ID": 273899,
            "ConnectionTypeID": 33,
            "Reference": "DE*BPE*E0FM13*01*03",
            "StatusTypeID": 50,
            "LevelID": 3,
            "Amps": 500,
            "Voltage": 1000,
            "PowerKW": 300,
            "CurrentTypeID": 30,
            "Quantity": 1
        },
        {
            "ID": 273900,
            "ConnectionTypeID": 2,
            "Reference": "DE*BPE*E0FM13*01*02",
            "StatusTypeID": 50,
            "LevelID": 3,
            "Amps": 500,
            "Voltage": 1000,
            "PowerKW": 300,
            "CurrentTypeID": 30,
            "Quantity": 1
        },
        {
            "ID": 273901,
            "ConnectionTypeID": 33,
            "Reference": "DE*BPE*E0FM13*02*04",
            "StatusTypeID": 50,
            "LevelID": 3,
            "Amps": 500,
            "Voltage": 1000,
            "PowerKW": 300,
            "CurrentTypeID": 30,
            "Quantity": 1
        },
        {
            "ID": 273902,
            "ConnectionTypeID": 33,
            "Reference": "DE*BPE*E0FM13*02*06",
            "StatusTypeID": 50,
            "LevelID": 3,
            "Amps": 500,
            "Voltage": 1000,
            "PowerKW": 300,
            "CurrentTypeID": 30,
            "Quantity": 1
        },
        {
            "ID": 273903,
            "ConnectionTypeID": 2,
            "Reference": "DE*BPE*E0FM13*02*05",
            "StatusTypeID": 50,
            "LevelID": 3,
            "Amps": 500,
            "Voltage": 1000,
            "PowerKW": 300,
            "CurrentTypeID": 30,
            "Quantity": 1
        }
    ],
    "NumberOfPoints": 4,
    "StatusTypeID": 50,
    "DateLastStatusUpdate": "2021-07-03T13:29:00Z",
    "DataQualityLevel": 1,
    "DateCreated": "2021-07-01T22:28:00Z",
    "SubmissionStatusTypeID": 200
}