{
    "IsRecentlyVerified": false,
    "ID": 89294,
    "UUID": "D64AFC4D-F007-4A6E-8861-B0DCBDF1191F",
    "DataProviderID": 2,
    "DataProvidersReference": "81371",
    "UsageTypeID": 1,
    "AddressInfo": {
        "ID": 89640,
        "Title": "Skirball Cultural Center",
        "AddressLine1": "2701 N Sepulveda Blvd",
        "Town": "Los Angeles",
        "StateOrProvince": "CA",
        "Postcode": "90049",
        "CountryID": 2,
        "Latitude": 34.124839,
        "Longitude": -118.479053,
        "ContactTelephone1": "310-440-4500",
        "AccessComments": "12pm-5pm T-F, 10am-5pm Sat-Sun",
        "RelatedURL": "",
        "DistanceUnit": 0
    },
    "Connections": [
        {
            "ID": 126675,
            "ConnectionTypeID": 1,
            "LevelID": 2,
            "Amps": 16,
            "Voltage": 230,
            "PowerKW": 3,
            "CurrentTypeID": 10,
            "Quantity": 6
        }
    ],
    "DateLastStatusUpdate": "2019-04-06T04:01:00Z",
    "DataQualityLevel": 3,
    "DateCreated": "2017-06-22T08:16:00Z",
    "SubmissionStatusTypeID": 100
}