{
    "IsRecentlyVerified": false,
    "ID": 9721,
    "UUID": "021FABB5-47A0-4E60-8B50-0EFD3025DDB4",
    "DataProviderID": 15,
    "DataProvidersReference": "16806",
    "OperatorID": 1,
    "AddressInfo": {
        "ID": 9618,
        "Title": "2220 Hewatt Rd",
        "AddressLine1": "2220 Hewatt Rd",
        "Town": "Snellville",
        "StateOrProvince": "GA",
        "Postcode": "30039",
        "CountryID": 2,
        "Latitude": 33.841685,
        "Longitude": -84.059536,
        "ContactTelephone1": "(770) 978-6276",
        "RelatedURL": "http://carstations.com/16806",
        "DistanceUnit": 0
    },
    "Connections": [
        {
            "ID": 7528,
            "ConnectionTypeID": 1,
            "Reference": "J1772",
            "LevelID": 2
        }
    ],
    "StatusTypeID": 0,
    "DateLastStatusUpdate": "2017-11-04T14:04:00Z",
    "DataQualityLevel": 2,
    "DateCreated": "2012-04-16T15:46:00Z",
    "SubmissionStatusTypeID": 100
}