{
    "UserComments": [
        {
            "ID": 23164,
            "ChargePointID": 167219,
            "CommentTypeID": 10,
            "UserName": "ForumElettrico.it",
            "Comment": "Proprio di fronte vi è un ristorante, uno dei pochi aperti ed attivi in zona. Leggi la recensione completa qui > https://www.forumelettrico.it/forum/colonnina-enel-x-22-kw-malalbergo-bo-via-nazionale-1-pegola-t12357.html",
            "RelatedURL": "https://www.forumelettrico.it/forum/colonnina-enel-x-22-kw-malalbergo-bo-via-nazionale-1-pegola-t12357.html",
            "DateCreated": "2020-08-30T16:42:03.377Z",
            "User": {
                "ID": 11749,
                "Username": "ForumElettrico.it"
            },
            "CheckinStatusTypeID": 10,
            "IsActionedByEditor": false
        }
    ],
    "MediaItems": [
        {
            "ID": 24539,
            "ChargePointID": 167219,
            "ItemURL": "https://s3-ap-southeast-2.amazonaws.com/openchargemap/images/IT/OCM167219/OCM-167219.orig.2020083016423388.jpg",
            "ItemThumbnailURL": "https://s3-ap-southeast-2.amazonaws.com/openchargemap/images/IT/OCM167219/OCM-167219.thmb.2020083016423388.jpg",
            "Comment": "",
            "IsEnabled": true,
            "IsVideo": false,
            "IsFeaturedItem": false,
            "IsExternalResource": false,
            "User": {
                "ID": 11749,
                "Username": "ForumElettrico.it"
            },
            "DateCreated": "2020-08-30T16:43:00Z"
        },
        {
            "ID": 24540,
            "ChargePointID": 167219,
            "ItemURL": "https://s3-ap-southeast-2.amazonaws.com/openchargemap/images/IT/OCM167219/OCM-167219.orig.2020083016423952.jpg",
            "ItemThumbnailURL": "https://s3-ap-southeast-2.amazonaws.com/openchargemap/images/IT/OCM167219/OCM-167219.thmb.2020083016423952.jpg",
            "Comment": "",
            "IsEnabled": true,
            "IsVideo": false,
            "IsFeaturedItem": false,
            "IsExternalResource": false,
            "User": {
                "ID": 11749,
                "Username": "ForumElettrico.it"
            },
            "DateCreated": "2020-08-30T16:43:00Z"
        },
        {
            "ID": 24536,
            "ChargePointID": 167219,
            "ItemURL": "https://s3-ap-southeast-2.amazonaws.com/openchargemap/images/IT/OCM167219/OCM-167219.orig.2020083016421470.jpg",
            "ItemThumbnailURL": "https://s3-ap-southeast-2.amazonaws.com/openchargemap/images/IT/OCM167219/OCM-167219.thmb.2020083016421470.jpg",
            "Comment": "",
            "IsEnabled": true,
            "IsVideo": false,
            "IsFeaturedItem": false,
            "IsExternalResource": false,
            "User": {
                "ID": 11749,
                "Username": "ForumElettrico.it"
            },
            "DateCreated": "2020-08-30T16:42:00Z"
        },
        {
            "ID": 24537,
            "ChargePointID": 167219,
            "ItemURL": "https://s3-ap-southeast-2.amazonaws.com/openchargemap/images/IT/OCM167219/OCM-167219.orig.2020083016422094.jpg",
            "ItemThumbnailURL": "https://s3-ap-southeast-2.amazonaws.com/openchargemap/images/IT/OCM167219/OCM-167219.thmb.2020083016422094.jpg",
            "Comment": "",
            "IsEnabled": true,
            "IsVideo": false,
            "IsFeaturedItem": false,
            "IsExternalResource": false,
            "User": {
                "ID": 11749,
                "Username": "ForumElettrico.it"
            },
            "DateCreated": "2020-08-30T16:42:00Z"
        },
        {
            "ID": 24538,
            "ChargePointID": 167219,
            "ItemURL": "https://s3-ap-southeast-2.amazonaws.com/openchargemap/images/IT/OCM167219/OCM-167219.orig.2020083016422764.jpg",
            "ItemThumbnailURL": "https://s3-ap-southeast-2.amazonaws.com/openchargemap/images/IT/OCM167219/OCM-167219.thmb.2020083016422764.jpg",
            "Comment": "",
            "IsEnabled": true,
            "IsVideo": false,
            "IsFeaturedItem": false,
            "IsExternalResource": false,
            "User": {
                "ID": 11749,
                "Username": "ForumElettrico.it"
            },
            "DateCreated": "2020-08-30T16:42:00Z"
        }
    ],
    "IsRecentlyVerified": false,
    "ID": 167219,
    "UUID": "CF9F5270-50BA-491D-A8E0-A2BDF699F1DC",
    "DataProviderID": 1,
    "OperatorID": 80,
    "UsageTypeID": 4,
    "AddressInfo": {
        "ID": 167578,
        "Title": "Pegola | EnelX",
        "AddressLine1": "Via Nazionale 1",
        "AddressLine2": "frazione Pegola ",
        "Town": "Malalbergo",
        "StateOrProvince": "BO",
        "Postcode": "40051",
        "CountryID": 112,
        "Latitude": 44.690434,
        "Longitude": 11.502526,
        "RelatedURL": "https://www.forumelettrico.it/forum/colonnina-enel-x-22-kw-malalbergo-bo-via-nazionale-1-pegola-t12357.html",
        "DistanceUnit": 0
    },
    "Connections": [
        {
            "ID": 253240,
            "ConnectionTypeID": 25,
            "StatusTypeID": 50,
            "LevelID": 2,
            "Amps": 32,
            "Voltage": 400,
            "PowerKW": 22,
            "CurrentTypeID": 20,
            "Quantity": 2
        }
    ],
    "NumberOfPoints": 2,
    "StatusTypeID": 50,
    "DateLastStatusUpdate": "2020-09-01T15:00:00Z",
    "DataQualityLevel": 1,
    "DateCreated": "2020-08-30T16:42:00Z",
    "SubmissionStatusTypeID": 200
}