{
    "IsRecentlyVerified": false,
    "ID": 141532,
    "UUID": "04584D1C-B729-408E-B4A4-40AFD83E3150",
    "DataProviderID": 2,
    "DataProvidersReference": "112925",
    "OperatorID": 23,
    "UsageTypeID": 1,
    "AddressInfo": {
        "ID": 141884,
        "Title": "Stonehouse Cellars - Tesla Destination",
        "AddressLine1": "500 Old Long Valley Rd",
        "Town": "Clearlake Oaks",
        "StateOrProvince": "CA",
        "Postcode": "95423",
        "CountryID": 2,
        "Latitude": 39.029607,
        "Longitude": -122.582891,
        "ContactTelephone1": "707-998-3378  877-798-3752",
        "AccessComments": "24 hours daily",
        "RelatedURL": "https://www.tesla.com/destination-charging",
        "DistanceUnit": 0
    },
    "Connections": [
        {
            "ID": 197475,
            "ConnectionTypeID": 30,
            "LevelID": 2,
            "Amps": 16,
            "Voltage": 230,
            "PowerKW": 3.7,
            "CurrentTypeID": 10,
            "Quantity": 3
        }
    ],
    "StatusTypeID": 50,
    "DateLastStatusUpdate": "2020-06-26T03:01:00Z",
    "DataQualityLevel": 3,
    "DateCreated": "2019-12-24T09:15:00Z",
    "SubmissionStatusTypeID": 100
}