{
    "IsRecentlyVerified": false,
    "ID": 174386,
    "UUID": "D3642553-7A82-49EF-B850-FEFBAC6C7158",
    "DataProviderID": 1,
    "OperatorID": 3371,
    "UsageTypeID": 4,
    "UsageCost": "0,30 €/kWh",
    "AddressInfo": {
        "ID": 174745,
        "Title": "Rest. El Maragato",
        "AddressLine1": "Carretera Madrid - La Coruña, km 326",
        "Town": "Astorga",
        "StateOrProvince": "Castile and León",
        "Postcode": "24700",
        "CountryID": 210,
        "Latitude": 42.46513767545417,
        "Longitude": -6.07357706756261,
        "DistanceUnit": 0
    },
    "Connections": [
        {
            "ID": 270108,
            "ConnectionTypeID": 33,
            "StatusTypeID": 50,
            "LevelID": 3,
            "PowerKW": 50,
            "CurrentTypeID": 30,
            "Quantity": 1
        },
        {
            "ID": 270109,
            "ConnectionTypeID": 2,
            "StatusTypeID": 50,
            "LevelID": 3,
            "PowerKW": 50,
            "CurrentTypeID": 30,
            "Quantity": 1
        },
        {
            "ID": 270110,
            "ConnectionTypeID": 25,
            "StatusTypeID": 50,
            "LevelID": 2,
            "PowerKW": 22,
            "Quantity": 1
        }
    ],
    "NumberOfPoints": 2,
    "StatusTypeID": 50,
    "DateLastStatusUpdate": "2021-03-28T12:19:00Z",
    "DataQualityLevel": 1,
    "DateCreated": "2021-03-27T21:04:00Z",
    "SubmissionStatusTypeID": 200
}