{
    "IsRecentlyVerified": false,
    "ID": 33712,
    "UUID": "877AA520-EA40-4403-8FF4-D1A799E14349",
    "DataProviderID": 26,
    "DataProvidersReference": "46267",
    "OperatorID": 73,
    "OperatorsReference": "EV-Box EVB-P1402352",
    "UsageCost": "0.00 jaarabonnement",
    "AddressInfo": {
        "ID": 34058,
        "Title": "Nico Staalstraat 6",
        "AddressLine1": "Nico Staalstraat 6",
        "Town": "Werkendam",
        "Postcode": "4273 GT",
        "CountryID": 159,
        "Latitude": 51.73279,
        "Longitude": 4.89387,
        "RelatedURL": "http://www.ev-box.nl",
        "DistanceUnit": 0
    },
    "Connections": [
        {
            "ID": 37223,
            "ConnectionTypeID": 25,
            "LevelID": 2,
            "PowerKW": 5,
            "CurrentTypeID": 10
        }
    ],
    "NumberOfPoints": 1,
    "StatusTypeID": 50,
    "DateLastStatusUpdate": "2016-06-04T02:40:00Z",
    "DataQualityLevel": 3,
    "DateCreated": "2015-01-09T06:04:00Z",
    "SubmissionStatusTypeID": 100
}