{
    "IsRecentlyVerified": false,
    "ID": 185462,
    "UUID": "3AE4FB00-8B99-44FF-8679-7A5D8FEEE300",
    "DataProviderID": 29,
    "DataProvidersReference": "16924",
    "AddressInfo": {
        "ID": 185821,
        "Title": "Am Stadtgut",
        "AddressLine1": "Am Stadtgut",
        "Town": "Uelzen",
        "Postcode": "29525",
        "CountryID": 87,
        "Latitude": 52.972334,
        "Longitude": 10.543573,
        "DistanceUnit": 0
    },
    "Connections": [
        {
            "ID": 294988,
            "ConnectionTypeID": 33,
            "StatusTypeID": 50,
            "LevelID": 3,
            "PowerKW": 150,
            "CurrentTypeID": 30
        },
        {
            "ID": 294989,
            "ConnectionTypeID": 2,
            "StatusTypeID": 50,
            "LevelID": 3,
            "PowerKW": 150,
            "CurrentTypeID": 30
        },
        {
            "ID": 301012,
            "ConnectionTypeID": 1036,
            "StatusTypeID": 50,
            "LevelID": 3,
            "PowerKW": 43,
            "CurrentTypeID": 20
        },
        {
            "ID": 301013,
            "ConnectionTypeID": 25,
            "StatusTypeID": 50,
            "LevelID": 2,
            "PowerKW": 22,
            "CurrentTypeID": 20
        }
    ],
    "StatusTypeID": 50,
    "DateLastStatusUpdate": "2021-07-12T02:50:00Z",
    "MetadataValues": [
        {
            "ID": 17753,
            "MetadataFieldID": 4,
            "ItemValue": "Data from the German chargepoint registry provided by Bundesnetzagentur.de under the CC-BY 4.0 license"
        }
    ],
    "DataQualityLevel": 3,
    "DateCreated": "2021-07-08T10:07:00Z",
    "SubmissionStatusTypeID": 100
}