{
    "UserComments": [
        {
            "ID": 10258,
            "ChargePointID": 65850,
            "CommentTypeID": 10,
            "UserName": "Familie van der Heide",
            "Comment": "",
            "Rating": 5,
            "DateCreated": "2016-04-29T05:41:18.003Z",
            "User": {
                "ID": 9294,
                "Username": "Familie van der Heide"
            },
            "CheckinStatusTypeID": 10
        }
    ],
    "IsRecentlyVerified": false,
    "ID": 65850,
    "UUID": "EFC62B1C-7FAA-488F-BCA8-EBD0E2B803E5",
    "DataProviderID": 1,
    "OperatorID": 73,
    "UsageTypeID": 6,
    "UsageCost": "€ 0,29 per kWh",
    "AddressInfo": {
        "ID": 66196,
        "Title": "Boskalis employees",
        "AddressLine1": "Rosmolenweg 20",
        "AddressLine2": "",
        "Town": "Papendrecht",
        "StateOrProvince": "",
        "Postcode": "",
        "CountryID": 159,
        "Latitude": 51.824963448690255,
        "Longitude": 4.726760387420653,
        "ContactTelephone1": "",
        "ContactTelephone2": "",
        "ContactEmail": "",
        "AccessComments": "",
        "RelatedURL": "",
        "DistanceUnit": 0
    },
    "Connections": [
        {
            "ID": 91022,
            "ConnectionTypeID": 25,
            "StatusTypeID": 50,
            "LevelID": 2,
            "PowerKW": 11
        },
        {
            "ID": 91023,
            "ConnectionTypeID": 25,
            "StatusTypeID": 50,
            "LevelID": 2,
            "PowerKW": 11
        }
    ],
    "NumberOfPoints": 10,
    "GeneralComments": "",
    "StatusTypeID": 50,
    "DateLastStatusUpdate": "2016-04-29T05:41:00Z",
    "DataQualityLevel": 1,
    "DateCreated": "2016-04-28T06:30:00Z",
    "SubmissionStatusTypeID": 200
}