{
    "IsRecentlyVerified": false,
    "ID": 122472,
    "UUID": "C1AACBA7-7BEF-49D5-92BA-A47EA4C17535",
    "DataProviderID": 2,
    "DataProvidersReference": "65916",
    "OperatorID": 107,
    "UsageTypeID": 1,
    "AddressInfo": {
        "ID": 122818,
        "Title": "PR 35 North Lake",
        "AddressLine1": "35 N Lake Ave",
        "Town": "Pasadena",
        "StateOrProvince": "CA",
        "Postcode": "91101",
        "CountryID": 2,
        "Latitude": 34.146953,
        "Longitude": -118.1327,
        "ContactTelephone1": "855-885-9571",
        "AccessComments": "24 hours daily",
        "RelatedURL": "http://www.opconnect.com/",
        "DistanceUnit": 0
    },
    "Connections": [
        {
            "ID": 172365,
            "ConnectionTypeID": 1,
            "LevelID": 2,
            "Amps": 16,
            "Voltage": 230,
            "PowerKW": 3.7,
            "CurrentTypeID": 10,
            "Quantity": 1
        }
    ],
    "DateLastStatusUpdate": "2020-06-26T02:57:00Z",
    "DataQualityLevel": 3,
    "DateCreated": "2019-04-06T05:03:00Z",
    "SubmissionStatusTypeID": 100
}