{
    "IsRecentlyVerified": false,
    "ID": 73584,
    "UUID": "005BC852-9071-4F23-A783-A7E7C2E20D77",
    "DataProviderID": 1,
    "OperatorID": 89,
    "OperatorsReference": "AAB-10471",
    "UsageTypeID": 4,
    "UsageCost": "Free",
    "AddressInfo": {
        "ID": 73930,
        "Title": "Ville de Delson",
        "AddressLine1": "50 Rue Sainte Thérèse",
        "Town": "Delson",
        "StateOrProvince": "QC",
        "Postcode": "J5B 2B2",
        "CountryID": 44,
        "Latitude": 45.375719,
        "Longitude": -73.541884,
        "DistanceUnit": 0
    },
    "Connections": [
        {
            "ID": 105873,
            "ConnectionTypeID": 1,
            "StatusTypeID": 50,
            "LevelID": 2,
            "Amps": 32,
            "Voltage": 230,
            "PowerKW": 7,
            "CurrentTypeID": 10,
            "Quantity": 1
        }
    ],
    "NumberOfPoints": 1,
    "StatusTypeID": 50,
    "DateLastStatusUpdate": "2016-11-27T21:12:00Z",
    "DataQualityLevel": 1,
    "DateCreated": "2016-11-23T22:19:00Z",
    "SubmissionStatusTypeID": 200
}