{
    "IsRecentlyVerified": false,
    "ID": 141345,
    "UUID": "02A216C4-90F0-49FC-9FE5-BB7D537185F4",
    "DataProviderID": 2,
    "DataProvidersReference": "96568",
    "OperatorID": 9,
    "UsageTypeID": 2,
    "AddressInfo": {
        "ID": 141697,
        "Title": "Arris",
        "AddressLine1": "1331 4th Street SE",
        "Town": "Washington",
        "StateOrProvince": "DC",
        "Postcode": "20003",
        "CountryID": 2,
        "Latitude": 38.874742,
        "Longitude": -77.000797,
        "ContactTelephone1": "888-998-2546",
        "AccessComments": "MON: 24 hours | TUE: 24 hours | WED: 24 hours | THU: 24 hours | FRI: 24 hours | SAT: 24 hours | SUN: 24 hours",
        "RelatedURL": "http://www.blinkcharging.com/",
        "DistanceUnit": 0
    },
    "Connections": [
        {
            "ID": 197262,
            "ConnectionTypeID": 1,
            "LevelID": 2,
            "Amps": 16,
            "Voltage": 230,
            "PowerKW": 3.7,
            "CurrentTypeID": 10,
            "Quantity": 2
        }
    ],
    "StatusTypeID": 50,
    "DateLastStatusUpdate": "2020-06-26T03:00:00Z",
    "DataQualityLevel": 3,
    "DateCreated": "2019-12-24T09:15:00Z",
    "SubmissionStatusTypeID": 100
}