{
    "IsRecentlyVerified": false,
    "ID": 67564,
    "UUID": "7227F9E0-9F3F-4167-AC80-C128358294C7",
    "DataProviderID": 2,
    "DataProvidersReference": "75651",
    "OperatorID": 5,
    "UsageTypeID": 1,
    "AddressInfo": {
        "ID": 67910,
        "Title": "STOWE ELECTRIC",
        "AddressLine1": "1333 Luce Hill Rd",
        "Town": "Stowe",
        "StateOrProvince": "VT",
        "Postcode": "05672",
        "CountryID": 2,
        "Latitude": 44.4710719,
        "Longitude": -72.7346084,
        "ContactTelephone1": "888-758-4389",
        "AccessComments": "24 hours daily",
        "RelatedURL": "http://www.chargepoint.com/",
        "DistanceUnit": 0
    },
    "Connections": [
        {
            "ID": 93069,
            "ConnectionTypeID": 1,
            "LevelID": 2,
            "Amps": 16,
            "Voltage": 230,
            "PowerKW": 3.7,
            "CurrentTypeID": 10,
            "Quantity": 2
        }
    ],
    "DateLastStatusUpdate": "2020-06-26T03:08:00Z",
    "DataQualityLevel": 3,
    "DateCreated": "2016-05-29T02:05:00Z",
    "SubmissionStatusTypeID": 100
}