{
    "IsRecentlyVerified": false,
    "ID": 179817,
    "UUID": "37419BFA-0B41-4EDD-8E8D-8A679C2583BA",
    "DataProviderID": 29,
    "DataProvidersReference": "10310",
    "AddressInfo": {
        "ID": 180176,
        "Title": "Dr.-Mack-Straße 88",
        "AddressLine1": "Dr.-Mack-Straße 88",
        "Town": "Fürth",
        "Postcode": "90762",
        "CountryID": 87,
        "Latitude": 49.468298,
        "Longitude": 11.010118,
        "DistanceUnit": 0
    },
    "Connections": [
        {
            "ID": 282143,
            "ConnectionTypeID": 25,
            "StatusTypeID": 50,
            "LevelID": 2,
            "PowerKW": 22,
            "CurrentTypeID": 20
        },
        {
            "ID": 282144,
            "ConnectionTypeID": 25,
            "StatusTypeID": 50,
            "LevelID": 2,
            "PowerKW": 22,
            "CurrentTypeID": 20
        }
    ],
    "StatusTypeID": 50,
    "DateLastStatusUpdate": "2021-07-09T03:17:00Z",
    "MetadataValues": [
        {
            "ID": 12111,
            "MetadataFieldID": 4,
            "ItemValue": "Data from the German chargepoint registry provided by Bundesnetzagentur.de under the CC-BY 4.0 license"
        }
    ],
    "DataQualityLevel": 3,
    "DateCreated": "2021-07-08T09:59:00Z",
    "SubmissionStatusTypeID": 100
}