{
    "IsRecentlyVerified": false,
    "ID": 137290,
    "UUID": "5E34DCDD-1121-441F-AF99-BF18EFB10A11",
    "DataProviderID": 2,
    "DataProvidersReference": "148955",
    "OperatorID": 39,
    "UsageTypeID": 1,
    "AddressInfo": {
        "ID": 137636,
        "Title": "530708 : West Palm Beach Professional Center",
        "AddressLine1": "5601 Corporate Way",
        "Town": "West Palm Beach",
        "StateOrProvince": "FL",
        "Postcode": "33407",
        "CountryID": 2,
        "Latitude": 26.7603082,
        "Longitude": -80.089809,
        "ContactTelephone1": "800-663-5633",
        "AccessComments": "MO: Not Specified; TU: Not Specified; WE: Not Specified; TH: Not Specified; FR: Not Specified; SA: Not Specified; SU: Not Specified",
        "RelatedURL": "http://www.semacharge.com/",
        "DistanceUnit": 0
    },
    "Connections": [
        {
            "ID": 192165,
            "ConnectionTypeID": 1,
            "LevelID": 2,
            "Amps": 16,
            "Voltage": 230,
            "PowerKW": 3,
            "CurrentTypeID": 10,
            "Quantity": 4
        }
    ],
    "StatusTypeID": 50,
    "DateLastStatusUpdate": "2019-12-24T09:04:00Z",
    "DataQualityLevel": 3,
    "DateCreated": "2019-12-24T09:04:00Z",
    "SubmissionStatusTypeID": 100
}