{
    "IsRecentlyVerified": false,
    "ID": 116482,
    "UUID": "B45C8B3E-738C-449C-A988-35707BF3B006",
    "DataProviderID": 1,
    "DataProvidersReference": "4963",
    "AddressInfo": {
        "ID": 116828,
        "Title": "Samverkanskontoret Sysslebäck",
        "AddressLine1": "Torget 5",
        "Town": "SYSSLEBÄCK",
        "StateOrProvince": "VÄRMLAND",
        "Postcode": "68060",
        "CountryID": 216,
        "Latitude": 60.73061,
        "Longitude": 12.87118,
        "AccessComments": "På parkeringen framför samverkanskontoret",
        "DistanceUnit": 0
    },
    "Connections": [
        {
            "ID": 164705,
            "ConnectionTypeID": 0,
            "Reference": "1",
            "LevelID": 2,
            "Amps": 32,
            "Voltage": 400,
            "PowerKW": 22,
            "Comments": "Mode 3"
        },
        {
            "ID": 164706,
            "ConnectionTypeID": 0,
            "Reference": "2",
            "LevelID": 2,
            "Amps": 32,
            "Voltage": 400,
            "PowerKW": 22,
            "Comments": "Mode 3"
        }
    ],
    "NumberOfPoints": 2,
    "DateLastStatusUpdate": "2020-05-26T08:24:00Z",
    "DataQualityLevel": 2,
    "DateCreated": "2019-02-11T09:16:00Z",
    "SubmissionStatusTypeID": 100
}