{
    "IsRecentlyVerified": false,
    "ID": 134387,
    "UUID": "A0EE1333-12E9-45D8-8780-C7CB07AA9129",
    "DataProviderID": 1,
    "OperatorID": 80,
    "UsageTypeID": 4,
    "UsageCost": "0,45 €/kW",
    "AddressInfo": {
        "ID": 134733,
        "Title": "SAN LAZZARO DI SAVENA Bellaria | ENELX",
        "AddressLine1": "Via Bellaria",
        "Town": "San Lazzaro di Savena",
        "StateOrProvince": "BO",
        "Postcode": "40068",
        "CountryID": 112,
        "Latitude": 44.46411959126482,
        "Longitude": 11.401121160242269,
        "RelatedURL": "https://www.enelx.com/it/it/emobility",
        "DistanceUnit": 0
    },
    "Connections": [
        {
            "ID": 188099,
            "ConnectionTypeID": 25,
            "StatusTypeID": 50,
            "LevelID": 2,
            "Amps": 32,
            "Voltage": 400,
            "PowerKW": 22,
            "CurrentTypeID": 20,
            "Quantity": 2
        }
    ],
    "NumberOfPoints": 2,
    "StatusTypeID": 50,
    "DateLastStatusUpdate": "2019-11-11T09:24:00Z",
    "DataQualityLevel": 1,
    "DateCreated": "2019-11-11T09:24:00Z",
    "SubmissionStatusTypeID": 200
}