{
    "IsRecentlyVerified": false,
    "ID": 65112,
    "UUID": "39319A57-67CA-4C12-A53B-11A92B49F2FA",
    "DataProviderID": 1,
    "OperatorID": 3,
    "OperatorsReference": "PG-90456",
    "UsageTypeID": 6,
    "UsageCost": "1",
    "AddressInfo": {
        "ID": 65458,
        "Title": "Performance Car Hire LTD",
        "AddressLine1": "PCH House",
        "AddressLine2": "Unit 5 Finway Road",
        "Town": "Hemel Hempstead",
        "StateOrProvince": "Hertfordshire",
        "Postcode": "HP2 7PT",
        "CountryID": 1,
        "Latitude": 51.7715636,
        "Longitude": -0.440476999999987,
        "DistanceUnit": 0
    },
    "Connections": [
        {
            "ID": 89621,
            "ConnectionTypeID": 25,
            "StatusTypeID": 50,
            "LevelID": 2,
            "Amps": 32,
            "Voltage": 230,
            "PowerKW": 7,
            "CurrentTypeID": 10,
            "Quantity": 1
        }
    ],
    "NumberOfPoints": 1,
    "StatusTypeID": 0,
    "DateLastStatusUpdate": "2020-03-14T06:28:00Z",
    "DataQualityLevel": 1,
    "DateCreated": "2016-04-12T11:33:00Z",
    "SubmissionStatusTypeID": 200
}