{
    "IsRecentlyVerified": false,
    "ID": 31552,
    "UUID": "7067F752-2467-4C81-A8CE-357463100CC4",
    "DataProviderID": 26,
    "DataProvidersReference": "55856",
    "OperatorID": 78,
    "OperatorsReference": "Essent EM-CH-00005451-01-00001",
    "UsageCost": "0.00 jaarabonnement",
    "AddressInfo": {
        "ID": 31898,
        "Title": "Impasse de la Plaine",
        "AddressLine1": "Impasse de la Plaine",
        "Town": "Avenches",
        "Postcode": "1580",
        "CountryID": 217,
        "Latitude": 46.893546,
        "Longitude": 7.04722,
        "RelatedURL": "http://www.essent.nl",
        "DistanceUnit": 0
    },
    "Connections": [
        {
            "ID": 35063,
            "ConnectionTypeID": 25,
            "LevelID": 2,
            "PowerKW": 11,
            "CurrentTypeID": 10
        }
    ],
    "NumberOfPoints": 1,
    "StatusTypeID": 50,
    "DateLastStatusUpdate": "2016-06-04T02:37:00Z",
    "DataQualityLevel": 3,
    "DateCreated": "2015-01-09T06:03:00Z",
    "SubmissionStatusTypeID": 100
}