{
    "IsRecentlyVerified": false,
    "ID": 185016,
    "UUID": "B2A66558-388D-478F-B830-A5B1C36F834A",
    "DataProviderID": 29,
    "DataProvidersReference": "13028",
    "AddressInfo": {
        "ID": 185375,
        "Title": "Marschallstr. 3",
        "AddressLine1": "Marschallstr. 3",
        "Town": "Dinslaken",
        "Postcode": "46537",
        "CountryID": 87,
        "Latitude": 51.561865,
        "Longitude": 6.763936,
        "DistanceUnit": 0
    },
    "Connections": [
        {
            "ID": 293981,
            "ConnectionTypeID": 25,
            "StatusTypeID": 50,
            "LevelID": 2,
            "PowerKW": 22,
            "CurrentTypeID": 20
        },
        {
            "ID": 293982,
            "ConnectionTypeID": 1036,
            "StatusTypeID": 50,
            "LevelID": 2,
            "PowerKW": 22,
            "CurrentTypeID": 20
        },
        {
            "ID": 299656,
            "ConnectionTypeID": 25,
            "StatusTypeID": 50,
            "LevelID": 2,
            "PowerKW": 22,
            "CurrentTypeID": 20
        },
        {
            "ID": 299657,
            "ConnectionTypeID": 1036,
            "StatusTypeID": 50,
            "LevelID": 2,
            "PowerKW": 22,
            "CurrentTypeID": 20
        }
    ],
    "StatusTypeID": 50,
    "DateLastStatusUpdate": "2021-07-12T02:48:00Z",
    "MetadataValues": [
        {
            "ID": 17307,
            "MetadataFieldID": 4,
            "ItemValue": "Data from the German chargepoint registry provided by Bundesnetzagentur.de under the CC-BY 4.0 license"
        }
    ],
    "DataQualityLevel": 3,
    "DateCreated": "2021-07-08T10:06:00Z",
    "SubmissionStatusTypeID": 100
}