{
    "IsRecentlyVerified": false,
    "ID": 96222,
    "UUID": "75D4C6A2-472D-4C77-8B1A-7423D8876F2F",
    "DataProviderID": 1,
    "OperatorID": 31,
    "UsageTypeID": 6,
    "UsageCost": "Free",
    "AddressInfo": {
        "ID": 96568,
        "Title": "Greystone Farms",
        "AddressLine1": "7401 Blackmon Rd",
        "Town": "Columbus",
        "StateOrProvince": "GA",
        "Postcode": "31909",
        "CountryID": 2,
        "Latitude": 32.5504495,
        "Longitude": -84.89911,
        "ContactTelephone1": "706-221-9200",
        "ContactEmail": "greystonefarms@greystoneproperties.net",
        "AccessComments": "Two Clipper Creek Charging Stations 32-Amp. Works with ALL plug-in vehicles including the Chevy Bolt, Tesla Model 3, Chevy Volt, Nissan Leaf, Kia Soul, Ford C Max, etc. Located near grill at phase 1 pool.\r\nAvailable to Greystone Farms Residents Only.",
        "RelatedURL": "https://www.greystoneproperties.net",
        "DistanceUnit": 0
    },
    "Connections": [
        {
            "ID": 136329,
            "ConnectionTypeID": 1,
            "StatusTypeID": 50,
            "LevelID": 2
        }
    ],
    "NumberOfPoints": 2,
    "StatusTypeID": 50,
    "DateLastStatusUpdate": "2017-12-22T11:56:00Z",
    "DataQualityLevel": 1,
    "DateCreated": "2017-12-15T14:50:00Z",
    "SubmissionStatusTypeID": 200
}