{
    "IsRecentlyVerified": false,
    "ID": 56928,
    "UUID": "53A337D4-81BB-4E48-9C76-2AA1008B3C7A",
    "DataProviderID": 1,
    "OperatorID": 156,
    "UsageTypeID": 4,
    "AddressInfo": {
        "ID": 57274,
        "Title": "The New Motion Ladepunkt Kienberg",
        "AddressLine1": "Heretsham 7",
        "Town": "Kienberg",
        "StateOrProvince": "Obing (VGem)",
        "Postcode": "83361",
        "CountryID": 87,
        "Latitude": 48.05137,
        "Longitude": 12.497540000000072,
        "DistanceUnit": 0
    },
    "Connections": [
        {
            "ID": 71865,
            "ConnectionTypeID": 25,
            "StatusTypeID": 50,
            "LevelID": 2,
            "Amps": 32,
            "Voltage": 400,
            "PowerKW": 22,
            "CurrentTypeID": 20,
            "Quantity": 1
        }
    ],
    "NumberOfPoints": 1,
    "StatusTypeID": 50,
    "DateLastStatusUpdate": "2015-11-17T12:49:00Z",
    "DataQualityLevel": 1,
    "DateCreated": "2015-11-17T12:49:00Z",
    "SubmissionStatusTypeID": 200
}