{
    "IsRecentlyVerified": false,
    "ID": 187524,
    "UUID": "F2718421-E96B-43FA-B360-E1E04AC4BB8F",
    "DataProviderID": 18,
    "DataProvidersReference": "30a4b413c498af1136d7cfd906adc48b",
    "OperatorID": 150,
    "UsageTypeID": 5,
    "AddressInfo": {
        "ID": 187883,
        "Title": "Blackwater",
        "AddressLine1": "Blackwater",
        "Town": "Truro",
        "Postcode": "TR4 8UN",
        "CountryID": 1,
        "Latitude": 50.286641,
        "Longitude": -5.153925,
        "AccessComments": "",
        "RelatedURL": "http://www.chargepointservices.com/",
        "DistanceUnit": 0
    },
    "Connections": [
        {
            "ID": 302662,
            "ConnectionTypeID": 1036,
            "Reference": "1",
            "StatusTypeID": 50,
            "LevelID": 3,
            "Amps": 63,
            "Voltage": 400,
            "PowerKW": 43,
            "CurrentTypeID": 20
        },
        {
            "ID": 302663,
            "ConnectionTypeID": 2,
            "Reference": "2",
            "StatusTypeID": 50,
            "LevelID": 3,
            "Amps": 125,
            "Voltage": 400,
            "PowerKW": 50,
            "CurrentTypeID": 30
        },
        {
            "ID": 302664,
            "ConnectionTypeID": 1036,
            "Reference": "3",
            "StatusTypeID": 50,
            "LevelID": 3,
            "Amps": 125,
            "Voltage": 400,
            "PowerKW": 50,
            "CurrentTypeID": 30
        }
    ],
    "StatusTypeID": 0,
    "DateLastStatusUpdate": "2021-07-12T03:38:00Z",
    "MetadataValues": [
        {
            "ID": 19764,
            "MetadataFieldID": 4,
            "ItemValue": "Contains public sector information licensed under the Open Government Licence v2.0. http://www.nationalarchives.gov.uk/doc/open-government-licence/version/2/"
        }
    ],
    "DataQualityLevel": 3,
    "DateCreated": "2021-07-12T03:38:00Z",
    "SubmissionStatusTypeID": 100
}