{
    "IsRecentlyVerified": false,
    "ID": 178852,
    "UUID": "76F1A2B5-3ADE-4E7F-88ED-5F165D8B3685",
    "DataProviderID": 1,
    "OperatorID": 3466,
    "AddressInfo": {
        "ID": 179211,
        "Title": "Middelkerkerstraße",
        "AddressLine1": "Middelkerkerstraße",
        "Town": "Ettlingen",
        "StateOrProvince": "Baden-Württemberg",
        "Postcode": "76275",
        "CountryID": 87,
        "Latitude": 48.937277,
        "Longitude": 8.399829,
        "DistanceUnit": 0
    },
    "Connections": [
        {
            "ID": 279824,
            "ConnectionTypeID": 28,
            "StatusTypeID": 50,
            "LevelID": 2,
            "Amps": 16,
            "Voltage": 230,
            "PowerKW": 3.7,
            "CurrentTypeID": 10,
            "Quantity": 1
        },
        {
            "ID": 279825,
            "ConnectionTypeID": 28,
            "StatusTypeID": 50,
            "LevelID": 2,
            "Amps": 16,
            "Voltage": 230,
            "PowerKW": 3.7,
            "CurrentTypeID": 10,
            "Quantity": 1
        },
        {
            "ID": 304909,
            "ConnectionTypeID": 25,
            "StatusTypeID": 50,
            "LevelID": 2,
            "Amps": 32,
            "Voltage": 400,
            "PowerKW": 22,
            "CurrentTypeID": 20,
            "Quantity": 1
        },
        {
            "ID": 304910,
            "ConnectionTypeID": 25,
            "StatusTypeID": 50,
            "LevelID": 2,
            "Amps": 32,
            "Voltage": 400,
            "PowerKW": 22,
            "CurrentTypeID": 20,
            "Quantity": 1
        }
    ],
    "StatusTypeID": 0,
    "DateLastStatusUpdate": "2021-08-13T07:45:00Z",
    "MetadataValues": [
        {
            "ID": 11146,
            "MetadataFieldID": 4,
            "ItemValue": "Data from the German chargepoint registry provided by Bundesnetzagentur.de under the CC-BY 4.0 license"
        }
    ],
    "DataQualityLevel": 3,
    "DateCreated": "2021-07-08T09:50:00Z",
    "SubmissionStatusTypeID": 100
}