{
    "IsRecentlyVerified": false,
    "ID": 32064,
    "UUID": "9171D7B7-2F26-4D3E-BFBA-0E9AD9356330",
    "DataProviderID": 1,
    "OperatorID": 105,
    "OperatorsReference": "Essent EM-DE-09671155-01-00001",
    "UsageTypeID": 4,
    "AddressInfo": {
        "ID": 32410,
        "Title": "Bahnhofstraße 1",
        "AddressLine1": "Bahnhofstraße 1",
        "Town": "Stockstadt",
        "Postcode": "63811",
        "CountryID": 87,
        "Latitude": 49.977204,
        "Longitude": 9.06415,
        "DistanceUnit": 0
    },
    "Connections": [
        {
            "ID": 35575,
            "ConnectionTypeID": 25,
            "LevelID": 2,
            "PowerKW": 11
        },
        {
            "ID": 46172,
            "ConnectionTypeID": 25,
            "LevelID": 2,
            "PowerKW": 11
        }
    ],
    "NumberOfPoints": 1,
    "StatusTypeID": 50,
    "DateLastStatusUpdate": "2015-04-13T16:20:00Z",
    "DataQualityLevel": 3,
    "DateCreated": "2015-01-09T06:03:00Z",
    "SubmissionStatusTypeID": 200
}