{
    "IsRecentlyVerified": false,
    "ID": 160021,
    "UUID": "8B239DD3-95C8-47D5-8858-5DC47ED5E31B",
    "DataProviderID": 2,
    "DataProvidersReference": "151780",
    "OperatorID": 3293,
    "UsageTypeID": 1,
    "AddressInfo": {
        "ID": 160378,
        "Title": "AMC Burlington Cinema 10",
        "AddressLine1": "20 South Ave",
        "Town": "Burlington",
        "StateOrProvince": "MA",
        "Postcode": "01803",
        "CountryID": 2,
        "Latitude": 42.481195,
        "Longitude": -71.219152,
        "ContactTelephone1": "888-264-2208",
        "AccessComments": "6am-12am daily",
        "RelatedURL": "https://voltacharging.com/",
        "DistanceUnit": 0
    },
    "Connections": [
        {
            "ID": 230255,
            "ConnectionTypeID": 1,
            "LevelID": 2,
            "Amps": 16,
            "Voltage": 230,
            "PowerKW": 3.7,
            "CurrentTypeID": 10,
            "Quantity": 2
        }
    ],
    "StatusTypeID": 50,
    "DateLastStatusUpdate": "2020-06-26T03:06:00Z",
    "DataQualityLevel": 3,
    "DateCreated": "2020-06-26T03:06:00Z",
    "SubmissionStatusTypeID": 100
}