{
    "IsRecentlyVerified": false,
    "ID": 24658,
    "UUID": "F55930F4-7464-49F6-893F-9B6B09F9621E",
    "DataProviderID": 1,
    "OperatorID": 136,
    "UsageTypeID": 1,
    "UsageCost": "0,25€/kWh + 0,30€/h",
    "AddressInfo": {
        "ID": 25004,
        "Title": "Tikkuparkki Oy Vantaa",
        "AddressLine1": "Lummekuja 5",
        "Town": "Vantaa",
        "CountryID": 79,
        "Latitude": 60.2945323,
        "Longitude": 25.0391566,
        "AccessComments": "Parking",
        "RelatedURL": "http://www.virta.fi",
        "DistanceUnit": 0
    },
    "Connections": [
        {
            "ID": 26956,
            "ConnectionTypeID": 25,
            "StatusTypeID": 50,
            "LevelID": 2,
            "Amps": 16,
            "Voltage": 400,
            "PowerKW": 11,
            "CurrentTypeID": 20,
            "Quantity": 1
        },
        {
            "ID": 219597,
            "ConnectionTypeID": 25,
            "StatusTypeID": 50,
            "LevelID": 2,
            "Amps": 32,
            "Voltage": 400,
            "PowerKW": 22,
            "CurrentTypeID": 20,
            "Quantity": 5
        }
    ],
    "NumberOfPoints": 6,
    "StatusTypeID": 50,
    "DateLastStatusUpdate": "2020-05-02T07:48:00Z",
    "MetadataValues": [
        {
            "ID": 1052,
            "MetadataFieldID": 4,
            "ItemValue": "Data © OpenStreetMap contributors, ODbL 1.0. http://www.openstreetmap.org/copyright"
        }
    ],
    "DataQualityLevel": 1,
    "DateCreated": "2014-10-26T02:00:00Z",
    "SubmissionStatusTypeID": 200
}