{
    "IsRecentlyVerified": false,
    "ID": 101910,
    "UUID": "EA20FF67-4ED7-4D41-A508-CEDCF6DD7715",
    "DataProviderID": 1,
    "OperatorID": 3,
    "OperatorsReference": "t53_hu1_4717_002",
    "UsageTypeID": 4,
    "UsageCost": "£0.25/kWh",
    "AddressInfo": {
        "ID": 102256,
        "Title": "Lidl-Stanningley",
        "AddressLine1": "Town Street",
        "Town": "Stanningley",
        "Postcode": "LS28 6HB",
        "CountryID": 1,
        "Latitude": 53.807226,
        "Longitude": -1.661348,
        "DistanceUnit": 0
    },
    "Connections": [
        {
            "ID": 143887,
            "ConnectionTypeID": 2,
            "StatusTypeID": 50,
            "LevelID": 3,
            "PowerKW": 50,
            "CurrentTypeID": 30,
            "Quantity": 1
        },
        {
            "ID": 143888,
            "ConnectionTypeID": 33,
            "StatusTypeID": 50,
            "LevelID": 3,
            "PowerKW": 50,
            "CurrentTypeID": 30,
            "Quantity": 1
        },
        {
            "ID": 143891,
            "ConnectionTypeID": 1036,
            "StatusTypeID": 50,
            "LevelID": 3,
            "Amps": 63,
            "Voltage": 400,
            "PowerKW": 43,
            "CurrentTypeID": 20,
            "Quantity": 1
        }
    ],
    "NumberOfPoints": 6,
    "GeneralComments": "This is a POD Point rapid charge unit installed at the Lidl superstore in Town Street, Stanningley",
    "StatusTypeID": 50,
    "DateLastStatusUpdate": "2021-03-22T19:39:00Z",
    "DataQualityLevel": 1,
    "DateCreated": "2018-04-15T05:41:00Z",
    "SubmissionStatusTypeID": 200
}