{
    "IsRecentlyVerified": false,
    "ID": 182454,
    "UUID": "39B7509C-7CA2-44C3-BD0C-21DE396B7F75",
    "DataProviderID": 29,
    "DataProvidersReference": "5614",
    "AddressInfo": {
        "ID": 182813,
        "Title": "Hospitalstraße 15",
        "AddressLine1": "Hospitalstraße 15",
        "Town": "Sondershausen",
        "Postcode": "99706",
        "CountryID": 87,
        "Latitude": 51.373293,
        "Longitude": 10.877816,
        "DistanceUnit": 0
    },
    "Connections": [
        {
            "ID": 288221,
            "ConnectionTypeID": 25,
            "StatusTypeID": 50,
            "LevelID": 2,
            "PowerKW": 22,
            "CurrentTypeID": 20
        },
        {
            "ID": 288222,
            "ConnectionTypeID": 25,
            "StatusTypeID": 50,
            "LevelID": 2,
            "PowerKW": 22,
            "CurrentTypeID": 20
        }
    ],
    "StatusTypeID": 50,
    "DateLastStatusUpdate": "2021-07-12T02:47:00Z",
    "MetadataValues": [
        {
            "ID": 14747,
            "MetadataFieldID": 4,
            "ItemValue": "Data from the German chargepoint registry provided by Bundesnetzagentur.de under the CC-BY 4.0 license"
        }
    ],
    "DataQualityLevel": 3,
    "DateCreated": "2021-07-08T10:03:00Z",
    "SubmissionStatusTypeID": 100
}