{
    "IsRecentlyVerified": false,
    "ID": 33214,
    "UUID": "F21B5108-EAC1-4CB4-9DE3-9C00D9960240",
    "DataProviderID": 26,
    "DataProvidersReference": "36201",
    "OperatorID": 157,
    "OperatorsReference": "NewMotion 02007892",
    "UsageCost": "0.00 jaarabonnement",
    "AddressInfo": {
        "ID": 33560,
        "Title": "Anjerstraat 22",
        "AddressLine1": "Anjerstraat 22",
        "Town": "Tholen",
        "Postcode": "4695 HJ",
        "CountryID": 159,
        "Latitude": 51.5512046813965,
        "Longitude": 4.07244491577148,
        "ContactTelephone1": "088 0109500",
        "RelatedURL": "http://thenewmotion.nl/",
        "DistanceUnit": 0
    },
    "Connections": [
        {
            "ID": 36725,
            "ConnectionTypeID": 25,
            "LevelID": 2,
            "PowerKW": 3.7,
            "CurrentTypeID": 10
        }
    ],
    "NumberOfPoints": 1,
    "StatusTypeID": 50,
    "DateLastStatusUpdate": "2016-06-04T02:39:00Z",
    "DataQualityLevel": 3,
    "DateCreated": "2015-01-09T06:04:00Z",
    "SubmissionStatusTypeID": 100
}