{
    "IsRecentlyVerified": false,
    "ID": 63783,
    "UUID": "A488F949-243D-4804-A451-6380F5058259",
    "DataProviderID": 26,
    "DataProvidersReference": "73196",
    "OperatorID": 157,
    "OperatorsReference": "NewMotion 02012833",
    "UsageCost": "0.00 jaarabonnement",
    "AddressInfo": {
        "ID": 64129,
        "Title": "Lavendelstraat 17",
        "AddressLine1": "Lavendelstraat 17",
        "Town": "Apeldoorn",
        "Postcode": "7322 PA",
        "CountryID": 159,
        "Latitude": 52.2195394,
        "Longitude": 5.9938045,
        "ContactTelephone1": "088 0109500",
        "RelatedURL": "http://thenewmotion.nl/",
        "DistanceUnit": 0
    },
    "Connections": [
        {
            "ID": 81474,
            "ConnectionTypeID": 25,
            "LevelID": 2,
            "PowerKW": 3.7,
            "CurrentTypeID": 10
        }
    ],
    "NumberOfPoints": 1,
    "StatusTypeID": 50,
    "DateLastStatusUpdate": "2016-06-04T02:51:00Z",
    "DataQualityLevel": 3,
    "DateCreated": "2016-03-03T12:32:00Z",
    "SubmissionStatusTypeID": 100
}