{
    "IsRecentlyVerified": false,
    "ID": 175991,
    "UUID": "C7981A3D-9EDC-468C-A161-0AAB4D69C529",
    "DataProviderID": 1,
    "OperatorID": 3378,
    "UsageTypeID": 1,
    "UsageCost": "DC: 1.95RON/kWh AC: 1.5RON/kWh TIME:0.05RON/min, first 30min free",
    "AddressInfo": {
        "ID": 176350,
        "Title": "Mol Arad",
        "AddressLine1": "Calea Aurel Vlaicu",
        "AddressLine2": "Aurel Vlaicu",
        "Town": "Arad",
        "StateOrProvince": "Arad",
        "Postcode": "310375",
        "CountryID": 184,
        "Latitude": 46.20132861243019,
        "Longitude": 21.292229384016082,
        "DistanceUnit": 0
    },
    "Connections": [
        {
            "ID": 273376,
            "ConnectionTypeID": 33,
            "StatusTypeID": 50,
            "LevelID": 3,
            "PowerKW": 50,
            "CurrentTypeID": 30,
            "Quantity": 1
        },
        {
            "ID": 273377,
            "ConnectionTypeID": 2,
            "StatusTypeID": 50,
            "LevelID": 3,
            "PowerKW": 50,
            "CurrentTypeID": 30,
            "Quantity": 1
        },
        {
            "ID": 273378,
            "ConnectionTypeID": 25,
            "StatusTypeID": 50,
            "LevelID": 2,
            "PowerKW": 22,
            "CurrentTypeID": 20,
            "Quantity": 1
        }
    ],
    "NumberOfPoints": 2,
    "StatusTypeID": 50,
    "DateLastStatusUpdate": "2021-10-01T10:13:00Z",
    "DataQualityLevel": 1,
    "DateCreated": "2021-06-21T09:57:00Z",
    "SubmissionStatusTypeID": 200
}