{
    "IsRecentlyVerified": false,
    "ID": 144790,
    "UUID": "B6C87921-E8E1-4586-8DC9-F0DC12A70E7C",
    "DataProviderID": 2,
    "DataProvidersReference": "146966",
    "OperatorID": 5,
    "UsageTypeID": 1,
    "AddressInfo": {
        "ID": 145142,
        "Title": "CPU PUBLIC",
        "AddressLine1": "850 Officers Row",
        "Town": "Vancouver",
        "StateOrProvince": "WA",
        "Postcode": "98661",
        "CountryID": 2,
        "Latitude": 45.628176,
        "Longitude": -122.660028,
        "ContactTelephone1": "888-758-4389",
        "AccessComments": "24 hours daily",
        "RelatedURL": "http://www.chargepoint.com/",
        "DistanceUnit": 0
    },
    "Connections": [
        {
            "ID": 201322,
            "ConnectionTypeID": 1,
            "LevelID": 2,
            "Amps": 16,
            "Voltage": 230,
            "PowerKW": 3,
            "CurrentTypeID": 10,
            "Quantity": 2
        }
    ],
    "StatusTypeID": 50,
    "DateLastStatusUpdate": "2019-12-24T09:23:00Z",
    "DataQualityLevel": 3,
    "DateCreated": "2019-12-24T09:23:00Z",
    "SubmissionStatusTypeID": 100
}