{
    "IsRecentlyVerified": false,
    "ID": 172943,
    "UUID": "C9EEF880-D44D-49FD-8EE8-EDC2223F933B",
    "DataProviderID": 1,
    "OperatorID": 23,
    "OperatorsReference": "46177",
    "UsageTypeID": 4,
    "AddressInfo": {
        "ID": 173302,
        "Title": "Nouvel Hôtel",
        "AddressLine1": "31 Rue René Nicod",
        "Town": "Oyonnax",
        "Postcode": "1100",
        "CountryID": 80,
        "Latitude": 46.261265,
        "Longitude": 5.656009,
        "ContactTelephone1": " +33 4 74 77 28 11",
        "DistanceUnit": 0
    },
    "Connections": [
        {
            "ID": 264577,
            "ConnectionTypeID": 30,
            "StatusTypeID": 50,
            "LevelID": 2,
            "PowerKW": 14,
            "CurrentTypeID": 20,
            "Quantity": 1
        }
    ],
    "NumberOfPoints": 1,
    "GeneralComments": "1 Tesla Connector, up to 14kW.Available for customers. Please see front desk.",
    "StatusTypeID": 50,
    "DateLastStatusUpdate": "2021-02-23T06:24:00Z",
    "DataQualityLevel": 1,
    "DateCreated": "2021-02-23T06:24:00Z",
    "SubmissionStatusTypeID": 200
}