{
    "IsRecentlyVerified": false,
    "ID": 122909,
    "UUID": "AAD18D13-2F00-4016-8334-ED8B169514D2",
    "DataProviderID": 2,
    "DataProvidersReference": "86117",
    "UsageTypeID": 2,
    "AddressInfo": {
        "ID": 123255,
        "Title": "Duke Energy",
        "AddressLine1": "3308 Highway 5",
        "Town": "Aberdeen",
        "StateOrProvince": "NC",
        "Postcode": "28315",
        "CountryID": 2,
        "Latitude": 35.137358,
        "Longitude": -79.437643,
        "ContactTelephone1": "",
        "AccessComments": "Employee and fleet vehicle use only",
        "RelatedURL": "",
        "DistanceUnit": 0
    },
    "Connections": [
        {
            "ID": 172837,
            "ConnectionTypeID": 1,
            "LevelID": 2,
            "Amps": 16,
            "Voltage": 230,
            "PowerKW": 3.7,
            "CurrentTypeID": 10,
            "Quantity": 2
        }
    ],
    "DateLastStatusUpdate": "2020-06-26T02:57:00Z",
    "DataQualityLevel": 3,
    "DateCreated": "2019-04-06T05:03:00Z",
    "SubmissionStatusTypeID": 100
}