{
    "IsRecentlyVerified": false,
    "ID": 182409,
    "UUID": "0689EE5A-7262-4723-8FB7-817CD4C88859",
    "DataProviderID": 29,
    "DataProvidersReference": "1529",
    "OperatorID": 45,
    "AddressInfo": {
        "ID": 182768,
        "Title": "Niedereimerfeld 16",
        "AddressLine1": "Niedereimerfeld 16",
        "Town": "Arnsberg",
        "Postcode": "59823",
        "CountryID": 87,
        "Latitude": 51.42162,
        "Longitude": 8.036497,
        "DistanceUnit": 0
    },
    "Connections": [
        {
            "ID": 288100,
            "ConnectionTypeID": 25,
            "StatusTypeID": 50,
            "LevelID": 2,
            "PowerKW": 22,
            "CurrentTypeID": 20
        },
        {
            "ID": 288101,
            "ConnectionTypeID": 25,
            "StatusTypeID": 50,
            "LevelID": 2,
            "PowerKW": 22,
            "CurrentTypeID": 20
        },
        {
            "ID": 288102,
            "ConnectionTypeID": 25,
            "StatusTypeID": 50,
            "LevelID": 2,
            "PowerKW": 22,
            "CurrentTypeID": 20
        },
        {
            "ID": 288103,
            "ConnectionTypeID": 25,
            "StatusTypeID": 50,
            "LevelID": 2,
            "PowerKW": 22,
            "CurrentTypeID": 20
        }
    ],
    "StatusTypeID": 50,
    "DateLastStatusUpdate": "2021-07-12T02:47:00Z",
    "MetadataValues": [
        {
            "ID": 14703,
            "MetadataFieldID": 4,
            "ItemValue": "Data from the German chargepoint registry provided by Bundesnetzagentur.de under the CC-BY 4.0 license"
        }
    ],
    "DataQualityLevel": 3,
    "DateCreated": "2021-07-08T10:03:00Z",
    "SubmissionStatusTypeID": 100
}