{
    "IsRecentlyVerified": false,
    "ID": 29501,
    "UUID": "DAAB0364-EAC5-4886-8A1D-425E6C53CAA7",
    "DataProviderID": 15,
    "DataProvidersReference": "219",
    "OperatorID": 5,
    "UsageTypeID": 1,
    "AddressInfo": {
        "ID": 29847,
        "Title": "49 SE Park St",
        "AddressLine1": "49 SE Park St",
        "Town": "Dania Beach",
        "StateOrProvince": "Florida",
        "Postcode": "33004",
        "CountryID": 2,
        "Latitude": 26.05106163,
        "Longitude": -80.14485168,
        "ContactTelephone1": "",
        "RelatedURL": "http://carstations.com/219",
        "DistanceUnit": 0
    },
    "Connections": [
        {
            "ID": 32486,
            "ConnectionTypeID": 9,
            "Reference": "NEMA5",
            "LevelID": 1
        }
    ],
    "NumberOfPoints": 4,
    "StatusTypeID": 0,
    "DateLastStatusUpdate": "2017-11-04T14:03:00Z",
    "DataQualityLevel": 2,
    "DateCreated": "2014-11-29T05:39:00Z",
    "SubmissionStatusTypeID": 100
}