{
    "IsRecentlyVerified": false,
    "ID": 63529,
    "UUID": "B2DA262D-C3C7-4E24-BE3F-B6ABF2DC868E",
    "DataProviderID": 26,
    "DataProvidersReference": "71818",
    "OperatorID": 157,
    "OperatorsReference": "NewMotion 03002580",
    "UsageCost": "0.00 jaarabonnement",
    "AddressInfo": {
        "ID": 63875,
        "Title": "Supernovaweg",
        "AddressLine1": "Supernovaweg",
        "Town": "Den Haag",
        "Postcode": "2516 AV",
        "CountryID": 159,
        "Latitude": 52.0719386,
        "Longitude": 4.3367729,
        "ContactTelephone1": "088 0109500",
        "RelatedURL": "http://thenewmotion.nl/",
        "DistanceUnit": 0
    },
    "Connections": [
        {
            "ID": 81070,
            "ConnectionTypeID": 25,
            "LevelID": 2,
            "PowerKW": 22,
            "CurrentTypeID": 10
        }
    ],
    "NumberOfPoints": 1,
    "StatusTypeID": 50,
    "DateLastStatusUpdate": "2016-06-04T02:46:00Z",
    "DataQualityLevel": 3,
    "DateCreated": "2016-03-03T12:31:00Z",
    "SubmissionStatusTypeID": 100
}