{
    "IsRecentlyVerified": false,
    "ID": 96200,
    "UUID": "ED7DD7F7-8DE1-41D3-BA85-50A259C732C8",
    "DataProviderID": 1,
    "OperatorID": 3248,
    "UsageTypeID": 1,
    "AddressInfo": {
        "ID": 96546,
        "Title": "Rasthof Am Biggenkopf Nord",
        "AddressLine1": "A44",
        "Town": "Diemelstadt",
        "StateOrProvince": "Landkreis Waldeck-Frankenberg",
        "Postcode": "34474",
        "CountryID": 87,
        "Latitude": 51.499071642857544,
        "Longitude": 8.98684675330355,
        "AccessComments": "24/7 nutzbar",
        "DistanceUnit": 0
    },
    "Connections": [
        {
            "ID": 136298,
            "ConnectionTypeID": 1036,
            "StatusTypeID": 50,
            "LevelID": 3,
            "Amps": 63,
            "Voltage": 400,
            "PowerKW": 43,
            "CurrentTypeID": 20,
            "Quantity": 1
        },
        {
            "ID": 136299,
            "ConnectionTypeID": 2,
            "StatusTypeID": 50,
            "LevelID": 3,
            "PowerKW": 50,
            "CurrentTypeID": 30,
            "Quantity": 1
        },
        {
            "ID": 136300,
            "ConnectionTypeID": 33,
            "StatusTypeID": 50,
            "LevelID": 3,
            "PowerKW": 50,
            "CurrentTypeID": 30,
            "Quantity": 1
        }
    ],
    "NumberOfPoints": 3,
    "StatusTypeID": 50,
    "DateLastStatusUpdate": "2017-12-14T13:37:00Z",
    "DataQualityLevel": 1,
    "DateCreated": "2017-12-14T13:37:00Z",
    "SubmissionStatusTypeID": 200
}