{
    "IsRecentlyVerified": false,
    "ID": 128284,
    "UUID": "60A253B8-362B-4566-AB21-4C6894DAF471",
    "DataProviderID": 1,
    "OperatorID": 23,
    "OperatorsReference": "50851",
    "UsageTypeID": 4,
    "UsageCost": "CHF 0.30/kWh; Andere Tarife für ältere Autos/Autres tarifs pour les voitures anciennes/altre tariffe per le auto più vecchie",
    "AddressInfo": {
        "ID": 128630,
        "Title": "Bussigny Supercharger",
        "AddressLine1": "35 Route de Condémine",
        "Town": "Bussigny",
        "StateOrProvince": "VD",
        "Postcode": "1030",
        "CountryID": 217,
        "Latitude": 46.555642,
        "Longitude": 6.561004,
        "DistanceUnit": 0
    },
    "Connections": [
        {
            "ID": 179573,
            "ConnectionTypeID": 27,
            "StatusTypeID": 50,
            "LevelID": 3,
            "PowerKW": 120,
            "CurrentTypeID": 30,
            "Quantity": 14
        }
    ],
    "NumberOfPoints": 14,
    "GeneralComments": "14 Superchargers, available 24/7, up to 120kW",
    "StatusTypeID": 50,
    "DateLastStatusUpdate": "2019-06-22T05:55:00Z",
    "DataQualityLevel": 1,
    "DateCreated": "2019-06-21T06:03:00Z",
    "SubmissionStatusTypeID": 200
}