{
    "IsRecentlyVerified": false,
    "ID": 172845,
    "UUID": "9D81983F-BA58-47DC-9A38-93ED5DD1CDA0",
    "DataProviderID": 1,
    "OperatorID": 3334,
    "UsageTypeID": 4,
    "AddressInfo": {
        "ID": 173204,
        "Title": "צים סנטר נתיבות",
        "AddressLine1": "צים סנטר נתיבות",
        "Town": "Netivot",
        "StateOrProvince": "South District",
        "Postcode": "",
        "CountryID": 111,
        "Latitude": 31.417222162404276,
        "Longitude": 34.593694304804465,
        "DistanceUnit": 0
    },
    "Connections": [
        {
            "ID": 264386,
            "ConnectionTypeID": 2,
            "StatusTypeID": 50,
            "LevelID": 3,
            "PowerKW": 50,
            "CurrentTypeID": 30,
            "Quantity": 1
        },
        {
            "ID": 264387,
            "ConnectionTypeID": 33,
            "StatusTypeID": 50,
            "LevelID": 3,
            "PowerKW": 50,
            "CurrentTypeID": 30,
            "Quantity": 1
        },
        {
            "ID": 264388,
            "ConnectionTypeID": 1036,
            "StatusTypeID": 50,
            "LevelID": 3,
            "PowerKW": 43,
            "CurrentTypeID": 20,
            "Quantity": 1
        }
    ],
    "NumberOfPoints": 1,
    "StatusTypeID": 50,
    "DateLastStatusUpdate": "2021-02-19T15:40:00Z",
    "DataQualityLevel": 1,
    "DateCreated": "2021-02-19T12:13:00Z",
    "SubmissionStatusTypeID": 200
}