{
    "IsRecentlyVerified": false,
    "ID": 122559,
    "UUID": "7B73AC28-9CAB-41BA-8ECA-02083959BAA9",
    "DataProviderID": 2,
    "DataProvidersReference": "100063",
    "OperatorID": 59,
    "UsageTypeID": 1,
    "AddressInfo": {
        "ID": 122905,
        "Title": "Greenlots - 12908",
        "AddressLine1": "16851 Victory Blvd",
        "Town": "Los Angeles",
        "StateOrProvince": "CA",
        "Postcode": "91406",
        "CountryID": 2,
        "Latitude": 34.1868743896484,
        "Longitude": -118.500465393066,
        "ContactTelephone1": "855-900-7584",
        "AccessComments": "24 hours daily",
        "RelatedURL": "http://greenlots.com/",
        "DistanceUnit": 0
    },
    "Connections": [
        {
            "ID": 172456,
            "ConnectionTypeID": 1,
            "LevelID": 2,
            "Amps": 16,
            "Voltage": 230,
            "PowerKW": 3.7,
            "CurrentTypeID": 10,
            "Quantity": 1
        }
    ],
    "DateLastStatusUpdate": "2020-06-26T02:57:00Z",
    "DataQualityLevel": 3,
    "DateCreated": "2019-04-06T05:03:00Z",
    "SubmissionStatusTypeID": 100
}