{
    "IsRecentlyVerified": false,
    "ID": 45720,
    "UUID": "FFEBD1CA-FE2D-4652-85E1-A91A9B6CB5A6",
    "DataProviderID": 1,
    "DataProvidersReference": "2020",
    "AddressInfo": {
        "ID": 46066,
        "Title": "UiA Grimstad",
        "AddressLine1": "Jon Lilletunsvei 9",
        "Town": "GRIMSTAD",
        "StateOrProvince": "Agder",
        "Postcode": "4898",
        "CountryID": 168,
        "Latitude": 58.33465,
        "Longitude": 8.57575,
        "AccessComments": "Kunn for UiA sin internebruk",
        "DistanceUnit": 0
    },
    "Connections": [
        {
            "ID": 56383,
            "ConnectionTypeID": 0,
            "Reference": "1",
            "LevelID": 2,
            "Amps": 32,
            "Voltage": 400,
            "PowerKW": 22,
            "Comments": "Mode 3"
        },
        {
            "ID": 87954,
            "ConnectionTypeID": 0,
            "Reference": "2",
            "LevelID": 2,
            "Amps": 32,
            "Voltage": 400,
            "PowerKW": 22,
            "Comments": "Mode 3"
        }
    ],
    "NumberOfPoints": 2,
    "DateLastStatusUpdate": "2020-05-26T08:22:00Z",
    "DataQualityLevel": 2,
    "DateCreated": "2015-05-03T00:54:00Z",
    "SubmissionStatusTypeID": 100
}