{
    "IsRecentlyVerified": false,
    "ID": 112176,
    "UUID": "E013F006-C220-47AB-AC90-C629E1867F1F",
    "DataProviderID": 2,
    "DataProvidersReference": "83941",
    "UsageTypeID": 1,
    "AddressInfo": {
        "ID": 112522,
        "Title": "Peavey Mart",
        "AddressLine1": "4815 66 St",
        "Town": "Camrose",
        "StateOrProvince": "AB",
        "Postcode": "T4V 4M7",
        "CountryID": 44,
        "Latitude": 53.019296,
        "Longitude": -112.854188,
        "ContactTelephone1": "780-672-5116",
        "AccessComments": "24 hours daily",
        "RelatedURL": "",
        "DistanceUnit": 0
    },
    "Connections": [
        {
            "ID": 157727,
            "ConnectionTypeID": 1,
            "LevelID": 2,
            "Amps": 16,
            "Voltage": 230,
            "PowerKW": 3.7,
            "CurrentTypeID": 10,
            "Quantity": 1
        }
    ],
    "DateLastStatusUpdate": "2020-06-26T03:12:00Z",
    "DataQualityLevel": 3,
    "DateCreated": "2018-10-18T23:37:00Z",
    "SubmissionStatusTypeID": 100
}