{
    "IsRecentlyVerified": false,
    "ID": 89487,
    "UUID": "707A4A6E-7800-4CAF-9431-63DB2BA6AE31",
    "DataProviderID": 2,
    "DataProvidersReference": "81638",
    "OperatorID": 5,
    "UsageTypeID": 1,
    "AddressInfo": {
        "ID": 89833,
        "Title": "CLUBHOUSE",
        "AddressLine1": "3340 McKinley Village Way",
        "Town": "Sacramento",
        "StateOrProvince": "CA",
        "Postcode": "95816",
        "CountryID": 2,
        "Latitude": 38.583371,
        "Longitude": -121.4565508,
        "ContactTelephone1": "888-758-4389",
        "AccessComments": "24 hours daily",
        "RelatedURL": "http://www.chargepoint.com/",
        "DistanceUnit": 0
    },
    "Connections": [
        {
            "ID": 126891,
            "ConnectionTypeID": 1,
            "LevelID": 2,
            "Amps": 16,
            "Voltage": 230,
            "PowerKW": 3,
            "CurrentTypeID": 10,
            "Quantity": 2
        }
    ],
    "DateLastStatusUpdate": "2019-12-24T09:15:00Z",
    "DataQualityLevel": 3,
    "DateCreated": "2017-06-22T08:16:00Z",
    "SubmissionStatusTypeID": 100
}