{
    "IsRecentlyVerified": false,
    "ID": 47415,
    "UUID": "B3BFADB5-63D7-4A4F-98A2-2A718C0E4B2F",
    "DataProviderID": 2,
    "DataProvidersReference": "67114",
    "OperatorID": 5,
    "UsageTypeID": 1,
    "AddressInfo": {
        "ID": 47761,
        "Title": "WASHINGTON",
        "AddressLine1": "2200 Tanger Blvd",
        "Town": "Washington",
        "StateOrProvince": "PA",
        "Postcode": "15301",
        "CountryID": 2,
        "Latitude": 40.2161373,
        "Longitude": -80.2108053,
        "ContactTelephone1": "888-758-4389",
        "AccessComments": "24 hours daily",
        "RelatedURL": "http://www.chargepoint.com/",
        "DistanceUnit": 0
    },
    "Connections": [
        {
            "ID": 58454,
            "ConnectionTypeID": 1,
            "LevelID": 2,
            "Amps": 16,
            "Voltage": 230,
            "PowerKW": 3.7,
            "CurrentTypeID": 10,
            "Quantity": 2
        }
    ],
    "DateLastStatusUpdate": "2020-06-26T03:02:00Z",
    "DataQualityLevel": 3,
    "DateCreated": "2015-05-27T08:51:00Z",
    "SubmissionStatusTypeID": 100
}