{
    "IsRecentlyVerified": false,
    "ID": 75190,
    "UUID": "9646D8EA-2A6C-41B3-955C-0461837EB51A",
    "DataProviderID": 1,
    "OperatorID": 23,
    "OperatorsReference": "19699",
    "UsageTypeID": 6,
    "UsageCost": "Free",
    "AddressInfo": {
        "ID": 75536,
        "Title": "Le Saint-James",
        "AddressLine1": "3 Place Camille Hostein",
        "Town": "Bouliac",
        "Postcode": "33270",
        "CountryID": 80,
        "Latitude": 44.81457,
        "Longitude": -0.504041,
        "ContactTelephone1": "+33 5 57 97 06 00​",
        "DistanceUnit": 0
    },
    "Connections": [
        {
            "ID": 108444,
            "ConnectionTypeID": 30,
            "StatusTypeID": 50,
            "LevelID": 2,
            "Amps": 32,
            "Voltage": 230,
            "PowerKW": 14,
            "CurrentTypeID": 20,
            "Quantity": 1
        }
    ],
    "NumberOfPoints": 1,
    "GeneralComments": "1 Tesla Connector, up to 14kW.Available for patrons only. Please see front desk.",
    "StatusTypeID": 50,
    "DateLastStatusUpdate": "2018-10-03T22:31:00Z",
    "DataQualityLevel": 1,
    "DateCreated": "2016-12-13T20:55:00Z",
    "SubmissionStatusTypeID": 200
}