{
    "IsRecentlyVerified": false,
    "ID": 145614,
    "UUID": "48D4DFED-CF0D-46C3-BB7C-9CB2F5FF7A41",
    "DataProviderID": 2,
    "DataProvidersReference": "143974",
    "OperatorID": 89,
    "UsageTypeID": 1,
    "AddressInfo": {
        "ID": 145966,
        "Title": "Centennial Park",
        "AddressLine1": "27 Kingham Pl",
        "Town": "Victoria",
        "StateOrProvince": "BC",
        "Postcode": "V9B 1L9",
        "CountryID": 44,
        "Latitude": 48.46168,
        "Longitude": -123.43027,
        "ContactTelephone1": "888-356-8911",
        "AccessComments": "24 hours daily",
        "RelatedURL": "https://flo.ca/",
        "DistanceUnit": 0
    },
    "Connections": [
        {
            "ID": 202327,
            "ConnectionTypeID": 1,
            "LevelID": 2,
            "Amps": 16,
            "Voltage": 230,
            "PowerKW": 3.7,
            "CurrentTypeID": 10,
            "Quantity": 1
        }
    ],
    "StatusTypeID": 50,
    "DateLastStatusUpdate": "2020-06-26T03:11:00Z",
    "DataQualityLevel": 3,
    "DateCreated": "2019-12-24T09:25:00Z",
    "SubmissionStatusTypeID": 100
}