{
    "IsRecentlyVerified": false,
    "ID": 185595,
    "UUID": "C8BCB564-7D2A-475F-A2A2-57B8D9389582",
    "DataProviderID": 29,
    "DataProvidersReference": "10333",
    "AddressInfo": {
        "ID": 185954,
        "Title": "Bertha-von-Suttner-Straße 14",
        "AddressLine1": "Bertha-von-Suttner-Straße 14",
        "Town": "Freiburg im Breisgau",
        "Postcode": "79111",
        "CountryID": 87,
        "Latitude": 47.997777,
        "Longitude": 7.79368,
        "DistanceUnit": 0
    },
    "Connections": [
        {
            "ID": 295451,
            "ConnectionTypeID": 25,
            "StatusTypeID": 50,
            "LevelID": 2,
            "PowerKW": 22,
            "CurrentTypeID": 20
        },
        {
            "ID": 295452,
            "ConnectionTypeID": 25,
            "StatusTypeID": 50,
            "LevelID": 2,
            "PowerKW": 22,
            "CurrentTypeID": 20
        }
    ],
    "StatusTypeID": 50,
    "DateLastStatusUpdate": "2021-07-12T02:40:00Z",
    "MetadataValues": [
        {
            "ID": 17839,
            "MetadataFieldID": 4,
            "ItemValue": "Data from the German chargepoint registry provided by Bundesnetzagentur.de under the CC-BY 4.0 license"
        }
    ],
    "DataQualityLevel": 3,
    "DateCreated": "2021-07-12T02:40:00Z",
    "SubmissionStatusTypeID": 100
}