{
    "IsRecentlyVerified": false,
    "ID": 123962,
    "UUID": "520C47E4-3785-42BF-986B-7B6F1E6DC402",
    "DataProviderID": 2,
    "DataProvidersReference": "68403",
    "UsageTypeID": 7,
    "AddressInfo": {
        "ID": 124308,
        "Title": "Smith Chevrolet Cadillac",
        "AddressLine1": "1601 Auto Mall Dr",
        "Town": "Turlock",
        "StateOrProvince": "CA",
        "Postcode": "95380",
        "CountryID": 2,
        "Latitude": 37.508226,
        "Longitude": -120.882066,
        "ContactTelephone1": "209-202-4942",
        "AccessComments": "Dealership business hours\r\nPublic - Call ahead",
        "RelatedURL": "",
        "DistanceUnit": 0
    },
    "Connections": [
        {
            "ID": 174002,
            "ConnectionTypeID": 1,
            "LevelID": 2,
            "Amps": 16,
            "Voltage": 230,
            "PowerKW": 3.7,
            "CurrentTypeID": 10,
            "Quantity": 1
        }
    ],
    "DateLastStatusUpdate": "2020-06-26T02:59:00Z",
    "DataQualityLevel": 3,
    "DateCreated": "2019-04-06T05:03:00Z",
    "SubmissionStatusTypeID": 100
}