{
    "IsRecentlyVerified": false,
    "ID": 157395,
    "UUID": "A36C8E86-5D46-46F1-A324-E05985812A22",
    "DataProviderID": 1,
    "OperatorID": 1,
    "UsageTypeID": 2,
    "AddressInfo": {
        "ID": 157749,
        "Title": "Carrer de Pau Casals",
        "AddressLine1": "Carrer de Pau Casals",
        "Town": "Castellterçol",
        "StateOrProvince": "Catalonia",
        "Postcode": "08183",
        "CountryID": 210,
        "Latitude": 41.74979968924583,
        "Longitude": 2.122481899347349,
        "DistanceUnit": 0
    },
    "Connections": [
        {
            "ID": 226697,
            "ConnectionTypeID": 1036,
            "StatusTypeID": 50,
            "LevelID": 2,
            "Voltage": 220,
            "PowerKW": 7,
            "CurrentTypeID": 20,
            "Quantity": 1
        }
    ],
    "NumberOfPoints": 1,
    "StatusTypeID": 50,
    "DateLastStatusUpdate": "2020-06-08T10:05:00Z",
    "DataQualityLevel": 1,
    "DateCreated": "2020-06-02T06:00:00Z",
    "SubmissionStatusTypeID": 200
}