{
    "IsRecentlyVerified": false,
    "ID": 27864,
    "UUID": "AEF0A7F3-EB8E-422D-94AC-8FA4ABE25188",
    "DataProviderID": 2,
    "DataProvidersReference": "63931",
    "UsageTypeID": 1,
    "AddressInfo": {
        "ID": 28210,
        "Title": "National Great Rivers Research and Education Center",
        "AddressLine1": "1 Confluence Way",
        "Town": "East Alton",
        "StateOrProvince": "IL",
        "Postcode": "62002",
        "CountryID": 2,
        "Latitude": 38.866724,
        "Longitude": -90.140662,
        "ContactTelephone1": "618-468-2782",
        "AccessComments": "24 hours daily",
        "RelatedURL": "",
        "DistanceUnit": 0
    },
    "Connections": [
        {
            "ID": 30599,
            "ConnectionTypeID": 1,
            "LevelID": 2,
            "Amps": 16,
            "Voltage": 230,
            "PowerKW": 3,
            "CurrentTypeID": 10,
            "Quantity": 1
        }
    ],
    "DateLastStatusUpdate": "2019-04-06T04:03:00Z",
    "DataQualityLevel": 3,
    "DateCreated": "2014-11-28T03:38:00Z",
    "SubmissionStatusTypeID": 100
}