{
    "IsRecentlyVerified": false,
    "ID": 173277,
    "UUID": "B5A9F6C3-D110-48A4-AAE7-400B37A5F360",
    "DataProviderID": 19,
    "DataProvidersReference": "6987",
    "AddressInfo": {
        "ID": 173636,
        "Title": "Þingvellir (Upplýsingamiðstöð)",
        "AddressLine1": "Þingvellir - upplýsingamiðstöð ",
        "Town": "Selfossi",
        "StateOrProvince": "Suðurland",
        "Postcode": "801",
        "CountryID": 105,
        "Latitude": 64.279652,
        "Longitude": -21.089164,
        "AccessComments": "",
        "DistanceUnit": 0
    },
    "Connections": [
        {
            "ID": 266140,
            "ConnectionTypeID": 25,
            "Reference": "1",
            "LevelID": 3,
            "Amps": 32,
            "Voltage": 400,
            "PowerKW": 22,
            "CurrentTypeID": 30,
            "Comments": "Mode 3"
        },
        {
            "ID": 266141,
            "ConnectionTypeID": 2,
            "Reference": "2",
            "LevelID": 3,
            "Amps": 100,
            "Voltage": 500,
            "PowerKW": 50,
            "CurrentTypeID": 30,
            "Comments": "Mode 4"
        },
        {
            "ID": 266142,
            "ConnectionTypeID": 33,
            "Reference": "3",
            "LevelID": 3,
            "Amps": 100,
            "Voltage": 500,
            "PowerKW": 50,
            "CurrentTypeID": 30,
            "Comments": "Mode 4"
        },
        {
            "ID": 266143,
            "ConnectionTypeID": 25,
            "Reference": "4",
            "LevelID": 3,
            "Amps": 32,
            "Voltage": 400,
            "PowerKW": 22,
            "CurrentTypeID": 30,
            "Comments": "Mode 3"
        },
        {
            "ID": 266144,
            "ConnectionTypeID": 25,
            "Reference": "5",
            "LevelID": 3,
            "Amps": 32,
            "Voltage": 400,
            "PowerKW": 22,
            "CurrentTypeID": 30,
            "Comments": "Mode 3"
        }
    ],
    "NumberOfPoints": 5,
    "StatusTypeID": 0,
    "DateLastStatusUpdate": "2021-03-03T09:03:00Z",
    "DataQualityLevel": 2,
    "DateCreated": "2021-03-03T09:03:00Z",
    "SubmissionStatusTypeID": 100
}