{
    "IsRecentlyVerified": false,
    "ID": 15065,
    "UUID": "56834D2E-FBF9-4CDF-BCCE-A0015C49ED3C",
    "DataProviderID": 23,
    "DataProvidersReference": "8FAAB828E858BDF555CC62298C331E26",
    "AddressInfo": {
        "ID": 15411,
        "Title": "19-31 Adelaide Road",
        "AddressLine1": "19-31 Adelaide Road, Dublin 2",
        "Town": "Dublin",
        "CountryID": 3,
        "Latitude": 53.3322,
        "Longitude": -6.25558,
        "DistanceUnit": 0
    },
    "Connections": [],
    "StatusTypeID": 50,
    "DateLastStatusUpdate": "2013-07-23T05:28:00Z",
    "DataQualityLevel": 2,
    "DateCreated": "2012-12-11T15:08:00Z",
    "SubmissionStatusTypeID": 100
}