{
    "IsRecentlyVerified": false,
    "ID": 85700,
    "UUID": "C02C1440-EDEC-43F0-8DEB-79A86E643CA5",
    "DataProviderID": 1,
    "OperatorID": 23,
    "OperatorsReference": "26341",
    "UsageTypeID": 4,
    "AddressInfo": {
        "ID": 86046,
        "Title": "Hotel One Reynosa Valle Alto",
        "AddressLine1": "Av. de los Encinos No. 1000 Lomas del Real de Jaranchinas",
        "Town": "Reynosa",
        "StateOrProvince": "Tamaulipas",
        "Postcode": "88730",
        "CountryID": 146,
        "Latitude": 26.056496,
        "Longitude": -98.363687,
        "ContactTelephone1": "+52  899 909 6600",
        "DistanceUnit": 0
    },
    "Connections": [
        {
            "ID": 121835,
            "ConnectionTypeID": 30,
            "StatusTypeID": 50,
            "LevelID": 2,
            "PowerKW": 18,
            "CurrentTypeID": 20,
            "Quantity": 2
        }
    ],
    "NumberOfPoints": 2,
    "GeneralComments": "2 Tesla Connectors, up to 18kW.Available for customers. Please see front desk.",
    "StatusTypeID": 50,
    "DateLastStatusUpdate": "2017-04-12T05:41:00Z",
    "DataQualityLevel": 1,
    "DateCreated": "2017-04-12T05:41:00Z",
    "SubmissionStatusTypeID": 200
}