{
    "IsRecentlyVerified": false,
    "ID": 32316,
    "UUID": "122FF456-DAFA-42EB-8A03-B99B3C62C396",
    "DataProviderID": 1,
    "OperatorID": 105,
    "OperatorsReference": "Essent EM-DE-05970040-01-00002",
    "UsageTypeID": 4,
    "AddressInfo": {
        "ID": 32662,
        "Title": "RWE Gebäude (mit E-Bike Station)",
        "AddressLine1": "Friedrichstrasse 60",
        "Town": "Siegen",
        "Postcode": "57072",
        "CountryID": 87,
        "Latitude": 50.877778,
        "Longitude": 8.025556,
        "AccessComments": "Für die E-Bike Station ist keine Ladekarte erforderlich!",
        "DistanceUnit": 0
    },
    "Connections": [
        {
            "ID": 35827,
            "ConnectionTypeID": 25,
            "LevelID": 2,
            "Amps": 16,
            "Voltage": 400,
            "PowerKW": 11,
            "CurrentTypeID": 20,
            "Quantity": 1
        },
        {
            "ID": 46339,
            "ConnectionTypeID": 25,
            "LevelID": 2,
            "Amps": 16,
            "Voltage": 400,
            "PowerKW": 11,
            "CurrentTypeID": 20,
            "Quantity": 1
        },
        {
            "ID": 64984,
            "ConnectionTypeID": 28,
            "StatusTypeID": 50,
            "LevelID": 1,
            "Amps": 10,
            "Voltage": 230,
            "PowerKW": 2.3,
            "CurrentTypeID": 10,
            "Quantity": 3
        }
    ],
    "NumberOfPoints": 5,
    "StatusTypeID": 50,
    "DateLastStatusUpdate": "2015-08-28T09:07:00Z",
    "DataQualityLevel": 3,
    "DateCreated": "2015-01-09T06:03:00Z",
    "SubmissionStatusTypeID": 200
}