{
    "IsRecentlyVerified": false,
    "ID": 183342,
    "UUID": "74684758-A18A-4479-96D7-CEDA23E057F6",
    "DataProviderID": 29,
    "DataProvidersReference": "16132",
    "OperatorID": 45,
    "AddressInfo": {
        "ID": 183701,
        "Title": "Stuttgarter Str. 87",
        "AddressLine1": "Stuttgarter Str. 87",
        "Town": "Leinfelden-Echterdingen",
        "Postcode": "70711",
        "CountryID": 87,
        "Latitude": 48.702103,
        "Longitude": 9.140427,
        "DistanceUnit": 0
    },
    "Connections": [
        {
            "ID": 290213,
            "ConnectionTypeID": 25,
            "StatusTypeID": 50,
            "LevelID": 2,
            "PowerKW": 22,
            "CurrentTypeID": 20
        },
        {
            "ID": 290214,
            "ConnectionTypeID": 25,
            "StatusTypeID": 50,
            "LevelID": 2,
            "PowerKW": 22,
            "CurrentTypeID": 20
        }
    ],
    "StatusTypeID": 50,
    "DateLastStatusUpdate": "2021-07-12T02:41:00Z",
    "MetadataValues": [
        {
            "ID": 15635,
            "MetadataFieldID": 4,
            "ItemValue": "Data from the German chargepoint registry provided by Bundesnetzagentur.de under the CC-BY 4.0 license"
        }
    ],
    "DataQualityLevel": 3,
    "DateCreated": "2021-07-08T10:03:00Z",
    "SubmissionStatusTypeID": 100
}