{
    "IsRecentlyVerified": false,
    "ID": 182605,
    "UUID": "1547612E-69AE-40A0-9D81-D867C5E418F5",
    "DataProviderID": 29,
    "DataProvidersReference": "2991",
    "AddressInfo": {
        "ID": 182964,
        "Title": "Am Plan 4-6",
        "AddressLine1": "Am Plan 4-6",
        "Town": "Gochsheim",
        "Postcode": "97469",
        "CountryID": 87,
        "Latitude": 50.018893,
        "Longitude": 10.281254,
        "DistanceUnit": 0
    },
    "Connections": [
        {
            "ID": 288557,
            "ConnectionTypeID": 25,
            "StatusTypeID": 50,
            "LevelID": 2,
            "PowerKW": 11,
            "CurrentTypeID": 20
        },
        {
            "ID": 288558,
            "ConnectionTypeID": 25,
            "StatusTypeID": 50,
            "LevelID": 2,
            "PowerKW": 11,
            "CurrentTypeID": 20
        }
    ],
    "StatusTypeID": 50,
    "DateLastStatusUpdate": "2021-07-12T02:44:00Z",
    "MetadataValues": [
        {
            "ID": 14898,
            "MetadataFieldID": 4,
            "ItemValue": "Data from the German chargepoint registry provided by Bundesnetzagentur.de under the CC-BY 4.0 license"
        }
    ],
    "DataQualityLevel": 3,
    "DateCreated": "2021-07-08T10:03:00Z",
    "SubmissionStatusTypeID": 100
}