{
    "IsRecentlyVerified": false,
    "ID": 123426,
    "UUID": "1385B766-4E9B-4997-91EF-7B69A0372891",
    "DataProviderID": 2,
    "DataProvidersReference": "63368",
    "UsageTypeID": 1,
    "AddressInfo": {
        "ID": 123772,
        "Title": "Appalachian State University - Rivers Street Parking Deck",
        "AddressLine1": "461 Rivers St",
        "Town": "Boone",
        "StateOrProvince": "NC",
        "Postcode": "28608",
        "CountryID": 2,
        "Latitude": 36.212469,
        "Longitude": -81.680442,
        "ContactTelephone1": "828-262-2878",
        "AccessComments": "Garage business hours",
        "RelatedURL": "",
        "DistanceUnit": 0
    },
    "Connections": [
        {
            "ID": 173401,
            "ConnectionTypeID": 1,
            "LevelID": 2,
            "Amps": 16,
            "Voltage": 230,
            "PowerKW": 3.7,
            "CurrentTypeID": 10,
            "Quantity": 1
        }
    ],
    "DateLastStatusUpdate": "2020-06-26T02:58:00Z",
    "DataQualityLevel": 3,
    "DateCreated": "2019-04-06T05:03:00Z",
    "SubmissionStatusTypeID": 100
}