{
    "IsRecentlyVerified": false,
    "ID": 99630,
    "UUID": "57120CB2-75EF-46D9-867E-80D7292FE471",
    "DataProviderID": 1,
    "OperatorID": 23,
    "OperatorsReference": "40188",
    "UsageTypeID": 4,
    "AddressInfo": {
        "ID": 99976,
        "Title": "Intercontinental London Park Lane",
        "AddressLine1": "1 Hamilton Place",
        "Town": "London",
        "Postcode": "W1J 7QY",
        "CountryID": 1,
        "Latitude": 51.503851,
        "Longitude": -0.150187,
        "ContactTelephone1": "+44 207 409 3131",
        "DistanceUnit": 0
    },
    "Connections": [
        {
            "ID": 140775,
            "ConnectionTypeID": 30,
            "StatusTypeID": 50,
            "LevelID": 2,
            "Amps": 32,
            "Voltage": 230,
            "PowerKW": 13,
            "CurrentTypeID": 20,
            "Quantity": 2
        }
    ],
    "NumberOfPoints": 2,
    "GeneralComments": "2 Tesla Connectors, up to 13kW.Available for customers. Please see front desk.",
    "StatusTypeID": 50,
    "DateLastStatusUpdate": "2018-10-03T19:33:00Z",
    "DataQualityLevel": 1,
    "DateCreated": "2018-02-01T07:02:00Z",
    "SubmissionStatusTypeID": 200
}