{
    "IsRecentlyVerified": false,
    "ID": 112704,
    "UUID": "43DD69C3-0AE8-4B4F-A800-98195D27C0FC",
    "DataProviderID": 1,
    "OperatorID": 45,
    "UsageTypeID": 6,
    "UsageCost": "Free for SPOT members and visitors",
    "AddressInfo": {
        "ID": 113050,
        "Title": "SPOT cowork",
        "AddressLine1": "600 Fishers Station Drive",
        "Town": "Victor",
        "StateOrProvince": "NY",
        "Postcode": "14564",
        "CountryID": 2,
        "Latitude": 43.0087164,
        "Longitude": -77.44998369999996,
        "ContactTelephone1": "585-401-7768",
        "ContactEmail": "meetme@SPOTcowork.com",
        "AccessComments": "600 Fishers Station Dr",
        "RelatedURL": "http://www.SPOTcowork.com",
        "DistanceUnit": 0
    },
    "Connections": [
        {
            "ID": 158695,
            "ConnectionTypeID": 1,
            "StatusTypeID": 50,
            "LevelID": 2,
            "Amps": 20,
            "Voltage": 208,
            "PowerKW": 4.1,
            "CurrentTypeID": 10,
            "Quantity": 2
        }
    ],
    "NumberOfPoints": 2,
    "GeneralComments": "SPOT cowork is a flex office environment for workers on the go.  You can rent offices & meeting rooms by the hour, day or month.  EV Charging stations provided for all SPOT members.",
    "StatusTypeID": 50,
    "DateLastStatusUpdate": "2018-11-12T16:06:00Z",
    "DataQualityLevel": 1,
    "DateCreated": "2018-11-11T14:38:00Z",
    "SubmissionStatusTypeID": 200
}