{
    "IsRecentlyVerified": false,
    "ID": 111358,
    "UUID": "8E7BE7CF-3E2E-4BB1-A902-D463F4174739",
    "DataProviderID": 2,
    "DataProvidersReference": "84697",
    "UsageTypeID": 2,
    "AddressInfo": {
        "ID": 111704,
        "Title": "Marieville Construction Inc",
        "AddressLine1": "2010 rue du Pont",
        "Town": "Marieville",
        "StateOrProvince": "QC",
        "Postcode": "J3M 1J9",
        "CountryID": 44,
        "Latitude": 45.432682,
        "Longitude": -73.156635,
        "ContactTelephone1": "",
        "AccessComments": "For employee use only",
        "RelatedURL": "",
        "DistanceUnit": 0
    },
    "Connections": [
        {
            "ID": 156769,
            "ConnectionTypeID": 1,
            "LevelID": 2,
            "Amps": 16,
            "Voltage": 230,
            "PowerKW": 3.7,
            "CurrentTypeID": 10,
            "Quantity": 2
        }
    ],
    "DateLastStatusUpdate": "2020-06-26T03:09:00Z",
    "DataQualityLevel": 3,
    "DateCreated": "2018-10-18T23:37:00Z",
    "SubmissionStatusTypeID": 100
}