{
    "IsRecentlyVerified": false,
    "ID": 180649,
    "UUID": "5674F5D1-299D-4864-9F60-EBB09630EFC7",
    "DataProviderID": 29,
    "DataProvidersReference": "20716",
    "AddressInfo": {
        "ID": 181008,
        "Title": "Marktplatz 1",
        "AddressLine1": "Marktplatz 1",
        "Town": "Schonungen",
        "Postcode": "97453",
        "CountryID": 87,
        "Latitude": 50.05127,
        "Longitude": 10.05124,
        "DistanceUnit": 0
    },
    "Connections": [
        {
            "ID": 283991,
            "ConnectionTypeID": 25,
            "StatusTypeID": 50,
            "LevelID": 2,
            "PowerKW": 22,
            "CurrentTypeID": 20
        },
        {
            "ID": 283992,
            "ConnectionTypeID": 25,
            "StatusTypeID": 50,
            "LevelID": 2,
            "PowerKW": 22,
            "CurrentTypeID": 20
        }
    ],
    "StatusTypeID": 50,
    "DateLastStatusUpdate": "2021-07-09T03:18:00Z",
    "MetadataValues": [
        {
            "ID": 12943,
            "MetadataFieldID": 4,
            "ItemValue": "Data from the German chargepoint registry provided by Bundesnetzagentur.de under the CC-BY 4.0 license"
        }
    ],
    "DataQualityLevel": 3,
    "DateCreated": "2021-07-08T10:00:00Z",
    "SubmissionStatusTypeID": 100
}