{
    "IsRecentlyVerified": false,
    "ID": 104389,
    "UUID": "643A40A4-E9D8-4845-9B56-C2B8A904F92D",
    "DataProviderID": 1,
    "OperatorID": 23,
    "OperatorsReference": "43243",
    "UsageTypeID": 6,
    "AddressInfo": {
        "ID": 104735,
        "Title": "Hotel-Restaurant Goldener Engel",
        "AddressLine1": "Grosser Markt 2",
        "Town": "Heppenheim",
        "Postcode": "64646",
        "CountryID": 87,
        "Latitude": 49.64136,
        "Longitude": 8.644938,
        "ContactTelephone1": "+49 6252 2563",
        "DistanceUnit": 0
    },
    "Connections": [
        {
            "ID": 147384,
            "ConnectionTypeID": 30,
            "StatusTypeID": 50,
            "LevelID": 2,
            "Amps": 16,
            "Voltage": 400,
            "PowerKW": 11,
            "CurrentTypeID": 20,
            "Quantity": 2
        }
    ],
    "NumberOfPoints": 2,
    "GeneralComments": "2 Tesla Connectors, up to 11kW.Available for patrons only. Please see front desk.",
    "StatusTypeID": 50,
    "DateLastStatusUpdate": "2018-10-03T16:41:00Z",
    "DataQualityLevel": 1,
    "DateCreated": "2018-05-20T05:28:00Z",
    "SubmissionStatusTypeID": 200
}