{
    "IsRecentlyVerified": false,
    "ID": 28330,
    "UUID": "3546DAEB-FC05-4308-8E19-A0D4B3ECFC54",
    "DataProviderID": 2,
    "DataProvidersReference": "61478",
    "UsageTypeID": 1,
    "AddressInfo": {
        "ID": 28676,
        "Title": "Twin City Wood Recycling",
        "AddressLine1": "1606 W Oakland",
        "Town": "Bloomington",
        "StateOrProvince": "IL",
        "Postcode": "61701",
        "CountryID": 2,
        "Latitude": 40.472258,
        "Longitude": -89.018004,
        "ContactTelephone1": "309-827-9663",
        "AccessComments": "24 hours daily",
        "RelatedURL": "",
        "DistanceUnit": 0
    },
    "Connections": [
        {
            "ID": 31127,
            "ConnectionTypeID": 1,
            "LevelID": 2,
            "Amps": 16,
            "Voltage": 230,
            "PowerKW": 3,
            "CurrentTypeID": 10,
            "Quantity": 1
        }
    ],
    "DateLastStatusUpdate": "2019-04-06T04:03:00Z",
    "DataQualityLevel": 3,
    "DateCreated": "2014-11-28T03:38:00Z",
    "SubmissionStatusTypeID": 100
}