{
    "IsRecentlyVerified": false,
    "ID": 95766,
    "UUID": "615EB904-AF4E-430A-A2C6-4CD581D161B9",
    "DataProviderID": 1,
    "OperatorID": 69,
    "UsageTypeID": 4,
    "AddressInfo": {
        "ID": 96112,
        "Title": "Dorfgemeinschaftshaus",
        "AddressLine1": "Gernsheimer Straße 42",
        "Town": "Alsbach-Hähnlein",
        "StateOrProvince": "Landkreis Darmstadt-Dieburg",
        "Postcode": "64665",
        "CountryID": 87,
        "Latitude": 49.73605802704731,
        "Longitude": 8.572800912495046,
        "AccessComments": "24/7 verfügbare Säule auf dem Parkplatz im Zentrum von Hähnlein.",
        "RelatedURL": "http://www.ggew.de/",
        "DistanceUnit": 0
    },
    "Connections": [
        {
            "ID": 135662,
            "ConnectionTypeID": 25,
            "StatusTypeID": 50,
            "LevelID": 2,
            "Amps": 32,
            "Voltage": 400,
            "PowerKW": 22,
            "CurrentTypeID": 20,
            "Quantity": 2
        },
        {
            "ID": 135663,
            "ConnectionTypeID": 28,
            "StatusTypeID": 50,
            "LevelID": 2,
            "Amps": 16,
            "Voltage": 230,
            "PowerKW": 3.7,
            "CurrentTypeID": 10,
            "Quantity": 2
        }
    ],
    "NumberOfPoints": 4,
    "StatusTypeID": 50,
    "DateLastStatusUpdate": "2017-11-24T06:21:00Z",
    "DataQualityLevel": 1,
    "DateCreated": "2017-11-24T06:21:00Z",
    "SubmissionStatusTypeID": 200
}