{
    "IsRecentlyVerified": false,
    "ID": 5904,
    "UUID": "1E058068-1231-48A2-8D5F-1FD007671749",
    "DataProviderID": 1,
    "OperatorID": 1,
    "UsageTypeID": 1,
    "AddressInfo": {
        "ID": 5826,
        "Title": "Bakersfield River Run RV Park",
        "Town": "Bakersfield",
        "StateOrProvince": "California",
        "CountryID": 2,
        "Latitude": 35.3798130706042,
        "Longitude": -119.049568176269,
        "DistanceUnit": 0
    },
    "Connections": [
        {
            "ID": 651,
            "ConnectionTypeID": 11,
            "LevelID": 2,
            "Quantity": 1
        }
    ],
    "NumberOfPoints": 1,
    "StatusTypeID": 50,
    "DateLastStatusUpdate": "2010-11-22T00:00:00Z",
    "DateCreated": "2011-09-13T12:41:00Z",
    "SubmissionStatusTypeID": 200
}