{
    "IsRecentlyVerified": false,
    "ID": 85518,
    "UUID": "4864BB7A-84C2-4CD1-9D2F-5628BADB6C42",
    "DataProviderID": 1,
    "OperatorID": 1,
    "UsageTypeID": 6,
    "UsageCost": "Free",
    "AddressInfo": {
        "ID": 85864,
        "Title": "El Corte Ingles - Hipercor Córdoba Ronda Norte",
        "AddressLine1": "Ronda de Poniente - Ctra Sta. Mª de Trassiera, s/n",
        "Town": "Córdoba",
        "StateOrProvince": "Córdoba",
        "Postcode": "14011",
        "CountryID": 210,
        "Latitude": 37.8950073,
        "Longitude": -4.80908009999996,
        "DistanceUnit": 0
    },
    "Connections": [
        {
            "ID": 121610,
            "ConnectionTypeID": 28,
            "StatusTypeID": 50,
            "LevelID": 2,
            "Quantity": 3
        },
        {
            "ID": 121611,
            "ConnectionTypeID": 25,
            "StatusTypeID": 50,
            "LevelID": 2,
            "Quantity": 3
        }
    ],
    "NumberOfPoints": 3,
    "GeneralComments": "Planta 1º del parking C.C. El Corte Inglés-Hipercor Ronda Oeste",
    "StatusTypeID": 50,
    "DateLastStatusUpdate": "2017-04-09T17:56:00Z",
    "DataQualityLevel": 1,
    "DateCreated": "2017-04-06T16:38:00Z",
    "SubmissionStatusTypeID": 200
}