{
    "IsRecentlyVerified": false,
    "ID": 48759,
    "UUID": "69DC12D8-2F1E-48E9-9EAB-7BA4BB2A26C7",
    "DataProviderID": 1,
    "OperatorID": 156,
    "UsageTypeID": 4,
    "AddressInfo": {
        "ID": 49105,
        "Title": "Musikhaus Thomann",
        "AddressLine1": "Hans-Thomann-Straße Süd",
        "Town": "Burgebrach",
        "Postcode": "96138",
        "CountryID": 87,
        "Latitude": 49.8021202813007,
        "Longitude": 10.7294749887467,
        "ContactTelephone1": "+49 9546 9223-0",
        "AccessComments": "Während der Öffnungszeiten vom Thomann kann beim Infocenter eine Karte ausgeliehen werden. Mit TheNewMotion Karte (oder: ladeticket, PlugSurfing, Smametrics, SUN) rund um die Uhr nutzbar. Ein Ladeplatz ganz hinten beim \"Audio-Zentrum\" vom Thomann. In der Parkreihe hinter dem letzten Gebäude (links der Straße) hochfahren, Gebäude links liegen lassen, dann dort auf der rechten Seite.",
        "RelatedURL": "http://www.thomann.de/",
        "DistanceUnit": 0
    },
    "Connections": [
        {
            "ID": 60221,
            "ConnectionTypeID": 25,
            "StatusTypeID": 50,
            "LevelID": 2,
            "Amps": 16,
            "Voltage": 400,
            "PowerKW": 11,
            "CurrentTypeID": 20,
            "Quantity": 1
        },
        {
            "ID": 60222,
            "ConnectionTypeID": 28,
            "StatusTypeID": 50,
            "LevelID": 2,
            "Amps": 16,
            "Voltage": 230,
            "PowerKW": 3.7,
            "CurrentTypeID": 10,
            "Quantity": 1
        }
    ],
    "NumberOfPoints": 1,
    "GeneralComments": "Unter der Box ist in dem Standfuß noch eine Schuko-Dose, die immer Strom liefert ohne Ladekarte.",
    "StatusTypeID": 50,
    "DateLastStatusUpdate": "2015-07-01T06:24:00Z",
    "DataQualityLevel": 1,
    "DateCreated": "2015-06-30T06:24:00Z",
    "SubmissionStatusTypeID": 200
}