{
    "IsRecentlyVerified": false,
    "ID": 175669,
    "UUID": "9B11213D-9E17-4418-85F1-7E9C217A9876",
    "DataProviderID": 1,
    "OperatorID": 121,
    "UsageTypeID": 4,
    "UsageCost": "0,35€/kWh (+2c/min von 8-22Uhr)",
    "AddressInfo": {
        "ID": 176028,
        "Title": "Kokenstraße",
        "AddressLine1": "5 Kokenstraße",
        "Town": "Hanover",
        "StateOrProvince": "Lower Saxony",
        "Postcode": "30159",
        "CountryID": 87,
        "Latitude": 52.37072668165541,
        "Longitude": 9.753285624254545,
        "DistanceUnit": 0
    },
    "Connections": [
        {
            "ID": 272769,
            "ConnectionTypeID": 25,
            "StatusTypeID": 50,
            "LevelID": 2,
            "Amps": 32,
            "Voltage": 400,
            "PowerKW": 22,
            "CurrentTypeID": 20,
            "Quantity": 2
        }
    ],
    "NumberOfPoints": 2,
    "GeneralComments": "Durchgehend verfügbare Ladesäule mit 2 Parkplätzen",
    "StatusTypeID": 50,
    "DateLastStatusUpdate": "2021-06-06T14:17:00Z",
    "DataQualityLevel": 1,
    "DateCreated": "2021-06-06T14:17:00Z",
    "SubmissionStatusTypeID": 200
}