{
    "IsRecentlyVerified": false,
    "ID": 154302,
    "UUID": "794E17DC-8030-4B77-A953-1F67CD649DD2",
    "DataProviderID": 28,
    "DataProvidersReference": "FR*C01*P76540*017",
    "OperatorID": 3410,
    "UsageTypeID": 5,
    "AddressInfo": {
        "ID": 154655,
        "Title": "ROUEN - Hangar 106 - Borne n°1",
        "AddressLine1": "Hangar 106 - Borne n°1 76000 ROUEN",
        "CountryID": 80,
        "Latitude": 49.440045,
        "Longitude": 1.075262,
        "AccessComments": "24h/24 7j/7",
        "DistanceUnit": 0
    },
    "Connections": [
        {
            "ID": 216921,
            "ConnectionTypeID": 1036,
            "StatusTypeID": 50,
            "LevelID": 2,
            "PowerKW": 22,
            "CurrentTypeID": 20
        },
        {
            "ID": 216922,
            "ConnectionTypeID": 28,
            "StatusTypeID": 50,
            "LevelID": 2,
            "PowerKW": 22,
            "CurrentTypeID": 10
        },
        {
            "ID": 251305,
            "ConnectionTypeID": 1036,
            "StatusTypeID": 50,
            "LevelID": 2,
            "PowerKW": 22,
            "CurrentTypeID": 20
        },
        {
            "ID": 251306,
            "ConnectionTypeID": 28,
            "StatusTypeID": 50,
            "LevelID": 2,
            "PowerKW": 22,
            "CurrentTypeID": 10
        }
    ],
    "GeneralComments": "Recharge par badge et avec une application smartphone",
    "StatusTypeID": 50,
    "DateLastStatusUpdate": "2020-08-27T05:16:00Z",
    "DataQualityLevel": 2,
    "DateCreated": "2020-03-15T10:55:00Z",
    "SubmissionStatusTypeID": 100
}