{
    "IsRecentlyVerified": false,
    "ID": 180837,
    "UUID": "DF1A05A6-43F2-4090-966B-19BD7B2B4AE7",
    "DataProviderID": 29,
    "DataProvidersReference": "16765",
    "OperatorID": 3253,
    "AddressInfo": {
        "ID": 181196,
        "Title": "Georg-Rückert-Straße 2",
        "AddressLine1": "Georg-Rückert-Straße 2",
        "Town": "Bad Soden",
        "Postcode": "65812",
        "CountryID": 87,
        "Latitude": 50.15312,
        "Longitude": 8.503799,
        "DistanceUnit": 0
    },
    "Connections": [
        {
            "ID": 284434,
            "ConnectionTypeID": 25,
            "StatusTypeID": 50,
            "LevelID": 2,
            "PowerKW": 22,
            "CurrentTypeID": 20
        },
        {
            "ID": 284435,
            "ConnectionTypeID": 25,
            "StatusTypeID": 50,
            "LevelID": 2,
            "PowerKW": 22,
            "CurrentTypeID": 20
        }
    ],
    "StatusTypeID": 50,
    "DateLastStatusUpdate": "2021-07-09T03:19:00Z",
    "MetadataValues": [
        {
            "ID": 13131,
            "MetadataFieldID": 4,
            "ItemValue": "Data from the German chargepoint registry provided by Bundesnetzagentur.de under the CC-BY 4.0 license"
        }
    ],
    "DataQualityLevel": 3,
    "DateCreated": "2021-07-08T10:01:00Z",
    "SubmissionStatusTypeID": 100
}