{
    "IsRecentlyVerified": false,
    "ID": 42759,
    "UUID": "5BE2D97B-B684-406D-9377-E99B8E547D6B",
    "DataProviderID": 1,
    "OperatorID": 45,
    "UsageTypeID": 7,
    "AddressInfo": {
        "ID": 43105,
        "Title": "Autohaus Spreckelsen GmbH",
        "AddressLine1": "Schiffertorsstraße 11",
        "AddressLine2": "Schölisch",
        "Town": " Stade",
        "StateOrProvince": "Landkreis Stade",
        "Postcode": "21682",
        "CountryID": 87,
        "Latitude": 53.60183,
        "Longitude": 9.46956999999998,
        "ContactTelephone1": "+49 4141 79490",
        "AccessComments": "3 kostenlose Parkplätze am VW/Audi/Skoda/Opel Autohaus. Laden während der Öffnungszeiten Mo-Fr. 7:15-18, Sa 9-13Uhr. ",
        "RelatedURL": "http://www.spreckelsen.de/emobility.php",
        "DistanceUnit": 0
    },
    "Connections": [
        {
            "ID": 51603,
            "ConnectionTypeID": 25,
            "StatusTypeID": 50,
            "LevelID": 2,
            "Amps": 16,
            "Voltage": 230,
            "PowerKW": 3.7,
            "CurrentTypeID": 10,
            "Quantity": 2
        },
        {
            "ID": 51604,
            "ConnectionTypeID": 33,
            "LevelID": 2,
            "PowerKW": 20,
            "Quantity": 1
        }
    ],
    "NumberOfPoints": 3,
    "StatusTypeID": 50,
    "DateLastStatusUpdate": "2015-03-23T12:21:00Z",
    "DataQualityLevel": 1,
    "DateCreated": "2015-03-23T11:53:00Z",
    "SubmissionStatusTypeID": 200
}