{
    "UserComments": [
        {
            "ID": 3586,
            "ChargePointID": 36736,
            "CommentTypeID": 10,
            "UserName": "",
            "Comment": "On a company parking lot. But friendly people, no problems.",
            "DateCreated": "2015-01-14T08:37:51.89Z",
            "CheckinStatusTypeID": 10
        }
    ],
    "IsRecentlyVerified": false,
    "ID": 36736,
    "UUID": "666394F7-79AF-482C-B739-397DCE05A430",
    "DataProviderID": 26,
    "DataProvidersReference": "38329",
    "OperatorsReference": "RM-support/ IM-Supply ",
    "UsageCost": "0.00 jaarabonnement",
    "AddressInfo": {
        "ID": 37082,
        "Title": "Aquamarijnstraat 104",
        "AddressLine1": "Aquamarijnstraat 104",
        "Town": "Hengelo",
        "Postcode": "7554 NT",
        "CountryID": 159,
        "Latitude": 52.23766653209,
        "Longitude": 6.7681092023849,
        "RelatedURL": "http://www.rm-support.nl",
        "DistanceUnit": 0
    },
    "Connections": [
        {
            "ID": 40247,
            "ConnectionTypeID": 25,
            "LevelID": 2,
            "PowerKW": 22,
            "CurrentTypeID": 10
        }
    ],
    "NumberOfPoints": 1,
    "StatusTypeID": 50,
    "DateLastStatusUpdate": "2016-06-04T02:52:00Z",
    "DataQualityLevel": 3,
    "DateCreated": "2015-01-09T06:07:00Z",
    "SubmissionStatusTypeID": 100
}