{
    "IsRecentlyVerified": false,
    "ID": 106952,
    "UUID": "83D7307E-122F-4468-AECC-F208393227EF",
    "DataProviderID": 1,
    "OperatorID": 86,
    "UsageTypeID": 4,
    "AddressInfo": {
        "ID": 107298,
        "Title": "SM!GHT Laterne Rathaus",
        "AddressLine1": "Überlinger Straße 11",
        "Town": "Uhldingen-Mühlhofen",
        "StateOrProvince": "Bodenseekreis",
        "Postcode": "88690",
        "CountryID": 87,
        "Latitude": 47.7351007414451,
        "Longitude": 9.242112999405663,
        "AccessComments": "Dort sind eine Sm!ght Ladelaterne auf dem Rathausparkplatz sowie eine Wallbox (ohne Authentifizierung, einfach einstecken) auf dem Parkplatz am Kreisverkehr, an einem Trafohäuschen.",
        "DistanceUnit": 0
    },
    "Connections": [
        {
            "ID": 150776,
            "ConnectionTypeID": 25,
            "StatusTypeID": 50,
            "LevelID": 2,
            "Amps": 32,
            "Voltage": 400,
            "PowerKW": 22,
            "CurrentTypeID": 20,
            "Quantity": 3
        },
        {
            "ID": 150777,
            "ConnectionTypeID": 28,
            "StatusTypeID": 50,
            "LevelID": 2,
            "Amps": 16,
            "Voltage": 230,
            "PowerKW": 3.7,
            "CurrentTypeID": 10,
            "Quantity": 2
        }
    ],
    "NumberOfPoints": 3,
    "StatusTypeID": 50,
    "DateLastStatusUpdate": "2018-07-10T13:52:00Z",
    "DataQualityLevel": 1,
    "DateCreated": "2018-07-10T13:52:00Z",
    "SubmissionStatusTypeID": 200
}