{
    "IsRecentlyVerified": false,
    "ID": 84258,
    "UUID": "53DFBEB7-4591-4279-9419-5A430BEA9D5C",
    "DataProviderID": 1,
    "OperatorID": 23,
    "OperatorsReference": "24447",
    "UsageTypeID": 4,
    "AddressInfo": {
        "ID": 84604,
        "Title": "Icon Parking 111 8th Ave Parking",
        "AddressLine1": "385 W 15th St",
        "Town": "New York",
        "StateOrProvince": "New York",
        "Postcode": "10011",
        "CountryID": 2,
        "Latitude": 40.741515,
        "Longitude": -74.004608,
        "ContactTelephone1": "(212) 929-8164",
        "DistanceUnit": 0
    },
    "Connections": [
        {
            "ID": 119659,
            "ConnectionTypeID": 30,
            "StatusTypeID": 50,
            "LevelID": 2,
            "PowerKW": 17,
            "CurrentTypeID": 20,
            "Quantity": 4
        }
    ],
    "NumberOfPoints": 4,
    "GeneralComments": "4 Tesla Connectors, up to 17kW.Available to the public. Please see valet.",
    "StatusTypeID": 50,
    "DateLastStatusUpdate": "2017-02-16T17:26:00Z",
    "DataQualityLevel": 1,
    "DateCreated": "2017-02-16T17:26:00Z",
    "SubmissionStatusTypeID": 200
}