{
    "IsRecentlyVerified": false,
    "ID": 138681,
    "UUID": "980B5635-5216-4AF9-8DA9-1E8F1CF5D054",
    "DataProviderID": 2,
    "DataProvidersReference": "95693",
    "OperatorID": 9,
    "UsageTypeID": 1,
    "AddressInfo": {
        "ID": 139033,
        "Title": "University of San Diego - Acala Vista",
        "AddressLine1": "1520 Via Las Cumbres",
        "Town": "San Diego",
        "StateOrProvince": "CA",
        "Postcode": "92110",
        "CountryID": 2,
        "Latitude": 32.774056,
        "Longitude": -117.180542,
        "ContactTelephone1": "888-998-2546",
        "AccessComments": "MON: 24 hours | TUE: 24 hours | WED: 24 hours | THU: 24 hours | FRI: 24 hours | SAT: 24 hours | SUN: 24 hours",
        "RelatedURL": "http://www.blinkcharging.com/",
        "DistanceUnit": 0
    },
    "Connections": [
        {
            "ID": 193865,
            "ConnectionTypeID": 1,
            "LevelID": 2,
            "Amps": 16,
            "Voltage": 230,
            "PowerKW": 3.7,
            "CurrentTypeID": 10,
            "Quantity": 5
        }
    ],
    "StatusTypeID": 50,
    "DateLastStatusUpdate": "2020-06-26T02:55:00Z",
    "DataQualityLevel": 3,
    "DateCreated": "2019-12-24T09:09:00Z",
    "SubmissionStatusTypeID": 100
}