{
    "IsRecentlyVerified": false,
    "ID": 107503,
    "UUID": "E9AACC2D-8E51-44A8-8AF8-06479DD80C68",
    "DataProviderID": 1,
    "OperatorID": 1,
    "UsageTypeID": 1,
    "UsageCost": "free",
    "AddressInfo": {
        "ID": 107849,
        "Title": "Alcsútdoboz, Polgármesteri Hivatal",
        "AddressLine1": "Szabadság utca 105.",
        "Town": "Alcsútdoboz",
        "StateOrProvince": "Fejér megye",
        "Postcode": "8087",
        "CountryID": 104,
        "Latitude": 47.42618419999999,
        "Longitude": 18.602165499999956,
        "DistanceUnit": 0
    },
    "Connections": [
        {
            "ID": 151671,
            "ConnectionTypeID": 25,
            "StatusTypeID": 50,
            "LevelID": 2,
            "Amps": 32,
            "Voltage": 400,
            "PowerKW": 22,
            "CurrentTypeID": 20,
            "Quantity": 1
        },
        {
            "ID": 151672,
            "ConnectionTypeID": 1036,
            "StatusTypeID": 50,
            "LevelID": 2,
            "Amps": 32,
            "Voltage": 400,
            "PowerKW": 22,
            "CurrentTypeID": 20,
            "Quantity": 1
        }
    ],
    "NumberOfPoints": 2,
    "GeneralComments": "There are two outlets on the charger (plug and a socket), but they do not operate at the same time. / A töltőn két kimenet van (egy aljzat és egy csatlakozó), de a kettő nem használható egyszerre.",
    "StatusTypeID": 50,
    "DateLastStatusUpdate": "2018-07-30T14:44:00Z",
    "DataQualityLevel": 1,
    "DateCreated": "2018-07-30T14:44:00Z",
    "SubmissionStatusTypeID": 200
}