{
    "IsRecentlyVerified": false,
    "ID": 103274,
    "UUID": "13696F31-CE0A-423B-978A-225C11FD6F02",
    "DataProviderID": 1,
    "OperatorID": 25,
    "OperatorsReference": "islington-mildmayroad",
    "UsageTypeID": 4,
    "UsageCost": "£0.059/minute; min £1.18; other tariffs available",
    "AddressInfo": {
        "ID": 103620,
        "Title": "Mildmay Road",
        "AddressLine1": "15 Mildmay Road",
        "Town": "London",
        "Postcode": "N1 4NH",
        "CountryID": 1,
        "Latitude": 51.54944,
        "Longitude": -0.078877,
        "DistanceUnit": 0
    },
    "Connections": [
        {
            "ID": 145907,
            "ConnectionTypeID": 25,
            "StatusTypeID": 50,
            "LevelID": 2,
            "Amps": 32,
            "Voltage": 230,
            "PowerKW": 7,
            "CurrentTypeID": 10,
            "Quantity": 2
        },
        {
            "ID": 145908,
            "ConnectionTypeID": 1,
            "StatusTypeID": 50,
            "LevelID": 2,
            "Amps": 16,
            "Voltage": 230,
            "PowerKW": 4,
            "CurrentTypeID": 10,
            "Quantity": 2
        }
    ],
    "NumberOfPoints": 2,
    "StatusTypeID": 50,
    "DateLastStatusUpdate": "2019-01-08T08:30:00Z",
    "DataQualityLevel": 1,
    "DateCreated": "2018-04-26T05:41:00Z",
    "SubmissionStatusTypeID": 200
}