{
    "IsRecentlyVerified": false,
    "ID": 104863,
    "UUID": "8BD2A0BF-C45A-4020-9C7F-B5C3D6FDFAC2",
    "DataProviderID": 1,
    "OperatorID": 20,
    "OperatorsReference": "80259",
    "UsageTypeID": 4,
    "UsageCost": "Free",
    "AddressInfo": {
        "ID": 105209,
        "Title": "Ipswich Hospital, Heath Road",
        "AddressLine1": "Ipswich Hospital, Heath Road",
        "Town": "Ipswich",
        "StateOrProvince": "Suffolk",
        "Postcode": "IP4 5PD",
        "CountryID": 1,
        "Latitude": 52.05684,
        "Longitude": 1.19791,
        "DistanceUnit": 0
    },
    "Connections": [
        {
            "ID": 147917,
            "ConnectionTypeID": 25,
            "StatusTypeID": 100,
            "LevelID": 2,
            "Amps": 32,
            "Voltage": 230,
            "PowerKW": 7,
            "CurrentTypeID": 10,
            "Quantity": 2
        }
    ],
    "NumberOfPoints": 2,
    "StatusTypeID": 100,
    "DateLastStatusUpdate": "2020-01-02T08:20:00Z",
    "DataQualityLevel": 1,
    "DateCreated": "2018-05-25T05:17:00Z",
    "SubmissionStatusTypeID": 200
}