{
    "IsRecentlyVerified": false,
    "ID": 59041,
    "UUID": "1059462C-5F6D-48BE-8F77-3F7113B07DE5",
    "DataProviderID": 1,
    "OperatorID": 45,
    "UsageTypeID": 2,
    "AddressInfo": {
        "ID": 59387,
        "Title": "Obeta electro GmbH",
        "AddressLine1": "Bessemerstraße 23",
        "AddressLine2": "Schöneberg",
        "Town": "Berlin",
        "StateOrProvince": "Berlin",
        "Postcode": "12103",
        "CountryID": 87,
        "Latitude": 52.46451839015518,
        "Longitude": 13.367119133065772,
        "ContactTelephone1": "030-7579710",
        "AccessComments": "Nutzung nur für Mitarbeiter!",
        "RelatedURL": "http://www.obeta.de/standorte",
        "DistanceUnit": 0
    },
    "Connections": [
        {
            "ID": 74894,
            "ConnectionTypeID": 25,
            "StatusTypeID": 50,
            "LevelID": 2,
            "Amps": 32,
            "Voltage": 400,
            "PowerKW": 22,
            "CurrentTypeID": 20,
            "Quantity": 1
        },
        {
            "ID": 74895,
            "ConnectionTypeID": 25,
            "StatusTypeID": 50,
            "LevelID": 2,
            "Amps": 16,
            "Voltage": 400,
            "PowerKW": 11,
            "CurrentTypeID": 20,
            "Quantity": 1
        },
        {
            "ID": 74896,
            "ConnectionTypeID": 28,
            "StatusTypeID": 50,
            "LevelID": 2,
            "Amps": 16,
            "Voltage": 230,
            "PowerKW": 3.7,
            "CurrentTypeID": 10,
            "Quantity": 2
        }
    ],
    "NumberOfPoints": 2,
    "GeneralComments": "",
    "StatusTypeID": 50,
    "DateLastStatusUpdate": "2020-02-21T12:27:00Z",
    "DataQualityLevel": 1,
    "DateCreated": "2016-01-06T07:56:00Z",
    "SubmissionStatusTypeID": 200
}