{
    "MediaItems": [
        {
            "ID": 10558,
            "ChargePointID": 74314,
            "ItemURL": "https://s3-ap-southeast-2.amazonaws.com/openchargemap/images/DE/OCM74314/OCM-74314.orig.2017030209140020.jpg",
            "ItemThumbnailURL": "https://s3-ap-southeast-2.amazonaws.com/openchargemap/images/DE/OCM74314/OCM-74314.thmb.2017030209140020.jpg",
            "Comment": "",
            "IsEnabled": true,
            "IsVideo": false,
            "IsFeaturedItem": false,
            "IsExternalResource": false,
            "User": {
                "ID": 4573,
                "Username": "Erna_Schleck"
            },
            "DateCreated": "2017-03-02T09:14:00Z"
        }
    ],
    "IsRecentlyVerified": false,
    "ID": 74314,
    "UUID": "84DA5D34-0F5F-41FE-9285-30C64EB90003",
    "DataProviderID": 1,
    "OperatorID": 156,
    "UsageTypeID": 4,
    "UsageCost": "",
    "AddressInfo": {
        "ID": 74660,
        "Title": "AWO Betreuungsdienst",
        "AddressLine1": "Berliner Straße 11",
        "AddressLine2": "",
        "Town": "Friesack",
        "StateOrProvince": "Friesack",
        "Postcode": "14662",
        "CountryID": 87,
        "Latitude": 52.73929056793709,
        "Longitude": 12.580078992729238,
        "ContactTelephone1": "",
        "ContactTelephone2": "",
        "ContactEmail": "",
        "AccessComments": "Am Fachwerkhaus auf den Hof fahren. The New Motion lolo duo Box auf dem Hofparkplatz (montiert am Zaun) mit The New Motion oder PlugSurfing Ladekarten. ",
        "RelatedURL": "",
        "DistanceUnit": 0
    },
    "Connections": [
        {
            "ID": 106867,
            "ConnectionTypeID": 25,
            "StatusTypeID": 50,
            "LevelID": 2,
            "Amps": 32,
            "Voltage": 400,
            "PowerKW": 22,
            "CurrentTypeID": 20,
            "Quantity": 2
        }
    ],
    "NumberOfPoints": 2,
    "GeneralComments": "",
    "StatusTypeID": 50,
    "DateLastStatusUpdate": "2017-03-02T09:15:00Z",
    "DataQualityLevel": 1,
    "DateCreated": "2016-11-30T08:45:00Z",
    "SubmissionStatusTypeID": 200
}