{
    "UserComments": [
        {
            "ID": 23350,
            "ChargePointID": 169007,
            "CommentTypeID": 10,
            "UserName": "Sparks",
            "Rating": 5,
            "DateCreated": "2020-10-09T14:37:15.187Z",
            "User": {
                "ID": 20277,
                "Username": "Sparks"
            },
            "CheckinStatusTypeID": 10,
            "IsActionedByEditor": false
        }
    ],
    "IsRecentlyVerified": false,
    "ID": 169007,
    "UUID": "ACAD8BFF-2B7B-4977-AF48-5663C5882E80",
    "DataProviderID": 1,
    "OperatorID": 45,
    "UsageTypeID": 1,
    "UsageCost": "0",
    "AddressInfo": {
        "ID": 169366,
        "Title": "Criswell Chevrolet",
        "AddressLine1": "Frederick Road",
        "Town": "Thurmont",
        "StateOrProvince": "Maryland",
        "Postcode": "21788",
        "CountryID": 2,
        "Latitude": 39.617281258907354,
        "Longitude": -77.41685485704664,
        "DistanceUnit": 0
    },
    "Connections": [
        {
            "ID": 257070,
            "ConnectionTypeID": 1,
            "StatusTypeID": 50,
            "LevelID": 2,
            "CurrentTypeID": 10,
            "Quantity": 1
        },
        {
            "ID": 257071,
            "ConnectionTypeID": 1,
            "StatusTypeID": 50,
            "LevelID": 2,
            "CurrentTypeID": 10,
            "Quantity": 1
        }
    ],
    "NumberOfPoints": 2,
    "StatusTypeID": 50,
    "DateLastStatusUpdate": "2020-10-12T07:53:00Z",
    "DataQualityLevel": 1,
    "DateCreated": "2020-10-09T14:37:00Z",
    "SubmissionStatusTypeID": 200
}