{
    "MediaItems": [
        {
            "ID": 26726,
            "ChargePointID": 172388,
            "ItemURL": "https://s3-ap-southeast-2.amazonaws.com/openchargemap/images/PT/OCM172388/OCM-172388.orig.2021030116524958.jpg",
            "ItemThumbnailURL": "https://s3-ap-southeast-2.amazonaws.com/openchargemap/images/PT/OCM172388/OCM-172388.thmb.2021030116524958.jpg",
            "Comment": "",
            "IsEnabled": true,
            "IsVideo": false,
            "IsFeaturedItem": false,
            "IsExternalResource": false,
            "User": {
                "ID": 28510,
                "Username": "Filipe Esteves"
            },
            "DateCreated": "2021-03-01T16:53:00Z"
        }
    ],
    "IsRecentlyVerified": false,
    "ID": 172388,
    "UUID": "DA7AEF6E-C711-49D5-B4F0-ED80E284F043",
    "DataProviderID": 1,
    "OperatorID": 3431,
    "UsageTypeID": 4,
    "UsageCost": "0.18€ / kWh",
    "AddressInfo": {
        "ID": 172747,
        "Title": "Continente Portimão Cabeço do Mocho",
        "AddressLine1": "Continente Cabeço do Mocho",
        "Town": "Portimão",
        "StateOrProvince": "Faro",
        "Postcode": "8500-420",
        "CountryID": 180,
        "Latitude": 37.151693205085635,
        "Longitude": -8.553285042277366,
        "AccessComments": "09:00>21:00",
        "RelatedURL": "https://plugcharge.continente.pt/",
        "DistanceUnit": 0
    },
    "Connections": [
        {
            "ID": 263575,
            "ConnectionTypeID": 25,
            "StatusTypeID": 50,
            "LevelID": 2,
            "Amps": 32,
            "Voltage": 400,
            "PowerKW": 22,
            "CurrentTypeID": 20,
            "Quantity": 4
        },
        {
            "ID": 263576,
            "ConnectionTypeID": 2,
            "StatusTypeID": 50,
            "LevelID": 3,
            "Amps": 120,
            "Voltage": 500,
            "PowerKW": 50,
            "CurrentTypeID": 30,
            "Quantity": 1
        },
        {
            "ID": 263577,
            "ConnectionTypeID": 33,
            "StatusTypeID": 50,
            "LevelID": 3,
            "Amps": 120,
            "Voltage": 500,
            "PowerKW": 50,
            "CurrentTypeID": 30,
            "Quantity": 1
        }
    ],
    "NumberOfPoints": 5,
    "GeneralComments": "Continente Plug&Charge APP needed",
    "StatusTypeID": 50,
    "DateLastStatusUpdate": "2021-03-01T16:53:00Z",
    "DataQualityLevel": 1,
    "DateCreated": "2021-01-31T17:33:00Z",
    "SubmissionStatusTypeID": 200
}