{
    "IsRecentlyVerified": false,
    "ID": 156927,
    "UUID": "2B28022C-DB30-4F37-B46E-B717293F0881",
    "DataProviderID": 19,
    "DataProvidersReference": "6412",
    "AddressInfo": {
        "ID": 157281,
        "Title": "Väsbyhem Bills Backe",
        "AddressLine1": "Bills backe 3",
        "Town": "UPPLANDS VÄSBY",
        "StateOrProvince": "STOCKHOLM",
        "Postcode": "19440",
        "CountryID": 216,
        "Latitude": 59.52014,
        "Longitude": 17.89565,
        "AccessComments": "",
        "DistanceUnit": 0
    },
    "Connections": [
        {
            "ID": 223069,
            "ConnectionTypeID": 25,
            "Reference": "1",
            "LevelID": 2,
            "Amps": 16,
            "Voltage": 230,
            "PowerKW": 3.7,
            "CurrentTypeID": 10,
            "Comments": "Mode 3"
        },
        {
            "ID": 223070,
            "ConnectionTypeID": 25,
            "Reference": "2",
            "LevelID": 2,
            "Amps": 16,
            "Voltage": 230,
            "PowerKW": 3.7,
            "CurrentTypeID": 10,
            "Comments": "Mode 3"
        },
        {
            "ID": 223071,
            "ConnectionTypeID": 25,
            "Reference": "3",
            "LevelID": 2,
            "Amps": 16,
            "Voltage": 230,
            "PowerKW": 3.7,
            "CurrentTypeID": 10,
            "Comments": "Mode 3"
        },
        {
            "ID": 223072,
            "ConnectionTypeID": 25,
            "Reference": "4",
            "LevelID": 2,
            "Amps": 16,
            "Voltage": 230,
            "PowerKW": 3.7,
            "CurrentTypeID": 10,
            "Comments": "Mode 3"
        }
    ],
    "NumberOfPoints": 4,
    "StatusTypeID": 0,
    "DateLastStatusUpdate": "2021-03-24T05:11:00Z",
    "DataQualityLevel": 2,
    "DateCreated": "2020-05-26T08:23:00Z",
    "SubmissionStatusTypeID": 100
}