{
    "UserComments": [
        {
            "ID": 19138,
            "ChargePointID": 95131,
            "CommentTypeID": 10,
            "UserName": "PIERANGELO78",
            "Comment": "Funziona perfettamente sono 2 colonnine e caricano a oltre 21kwh Zoe  ",
            "Rating": 5,
            "DateCreated": "2018-01-28T22:25:52.577Z",
            "User": {
                "ID": 17970,
                "Username": "PIERANGELO78"
            },
            "CheckinStatusTypeID": 10
        },
        {
            "ID": 18003,
            "ChargePointID": 95131,
            "CommentTypeID": 10,
            "UserName": "ForumElettrico.it",
            "RelatedURL": "https://www.forumelettrico.it/forum/colonnina-lidl-verbania-t1984.html",
            "DateCreated": "2017-12-05T18:54:51.93Z",
            "User": {
                "ID": 11749,
                "Username": "ForumElettrico.it"
            },
            "CheckinStatusTypeID": 10
        }
    ],
    "MediaItems": [
        {
            "ID": 15014,
            "ChargePointID": 95131,
            "ItemURL": "https://s3-ap-southeast-2.amazonaws.com/openchargemap/images/IT/OCM95131/OCM-95131.orig.2018012822272019.jpg",
            "ItemThumbnailURL": "https://s3-ap-southeast-2.amazonaws.com/openchargemap/images/IT/OCM95131/OCM-95131.thmb.2018012822272019.jpg",
            "Comment": "",
            "IsEnabled": true,
            "IsVideo": false,
            "IsFeaturedItem": false,
            "IsExternalResource": false,
            "User": {
                "ID": 17970,
                "Username": "PIERANGELO78"
            },
            "DateCreated": "2018-01-28T22:28:00Z"
        },
        {
            "ID": 13769,
            "ChargePointID": 95131,
            "ItemURL": "https://s3-ap-southeast-2.amazonaws.com/openchargemap/images/IT/OCM95131/OCM-95131.orig.2017120518550989.jpg",
            "ItemThumbnailURL": "https://s3-ap-southeast-2.amazonaws.com/openchargemap/images/IT/OCM95131/OCM-95131.thmb.2017120518550989.jpg",
            "Comment": "",
            "IsEnabled": true,
            "IsVideo": false,
            "IsFeaturedItem": false,
            "IsExternalResource": false,
            "User": {
                "ID": 11749,
                "Username": "ForumElettrico.it"
            },
            "DateCreated": "2017-12-05T18:55:00Z"
        }
    ],
    "IsRecentlyVerified": false,
    "ID": 95131,
    "UUID": "C96BC0EE-F080-493D-A885-928B087AF1F1",
    "DataProviderID": 1,
    "OperatorID": 38,
    "UsageTypeID": 1,
    "UsageCost": "free",
    "AddressInfo": {
        "ID": 95477,
        "Title": " Lidl Verbania",
        "AddressLine1": "Corso Nazioni Unite, 5",
        "AddressLine2": "Pallanza",
        "Town": "Verbania",
        "StateOrProvince": "VB",
        "Postcode": "28925",
        "CountryID": 112,
        "Latitude": 45.9287094749928,
        "Longitude": 8.55155431657183,
        "RelatedURL": "https://www.lidl.it",
        "DistanceUnit": 0
    },
    "Connections": [
        {
            "ID": 134795,
            "ConnectionTypeID": 25,
            "StatusTypeID": 50,
            "LevelID": 2,
            "Amps": 32,
            "Voltage": 400,
            "PowerKW": 22,
            "CurrentTypeID": 20,
            "Quantity": 2
        }
    ],
    "NumberOfPoints": 2,
    "StatusTypeID": 50,
    "DateLastStatusUpdate": "2021-06-01T18:18:00Z",
    "DataQualityLevel": 1,
    "DateCreated": "2017-11-03T16:54:00Z",
    "SubmissionStatusTypeID": 200
}