{
    "IsRecentlyVerified": false,
    "ID": 85915,
    "UUID": "39AA1462-3F2F-40A0-9E08-03324809FC8D",
    "DataProviderID": 1,
    "OperatorID": 23,
    "OperatorsReference": "27513",
    "UsageTypeID": 4,
    "AddressInfo": {
        "ID": 86261,
        "Title": "Amara Resort and Spa",
        "AddressLine1": "100 Amara LN",
        "Town": "Sedona",
        "StateOrProvince": "Arizona",
        "Postcode": "86336",
        "CountryID": 2,
        "Latitude": 34.869604,
        "Longitude": -111.758506,
        "ContactTelephone1": "(928) 282-4828",
        "DistanceUnit": 0
    },
    "Connections": [
        {
            "ID": 122119,
            "ConnectionTypeID": 30,
            "StatusTypeID": 50,
            "LevelID": 2,
            "PowerKW": 16,
            "CurrentTypeID": 20,
            "Quantity": 2
        }
    ],
    "NumberOfPoints": 2,
    "GeneralComments": "2 Tesla Connectors, up to 16kW.Available for customers. Please see valet.",
    "StatusTypeID": 50,
    "DateLastStatusUpdate": "2017-04-20T07:34:00Z",
    "DataQualityLevel": 1,
    "DateCreated": "2017-04-20T07:34:00Z",
    "SubmissionStatusTypeID": 200
}