{
    "IsRecentlyVerified": false,
    "ID": 99296,
    "UUID": "4177A086-ECFF-4813-ADDE-8551192332EC",
    "DataProviderID": 1,
    "OperatorID": 3279,
    "OperatorsReference": "0136",
    "UsageTypeID": 4,
    "UsageCost": "€0/kWh",
    "AddressInfo": {
        "ID": 99642,
        "Title": "Electricidad Juan Bernabeu",
        "AddressLine1": "Electricidad Juan Bernabeu",
        "Town": "Ibi",
        "StateOrProvince": "Alicante",
        "Postcode": "03440",
        "CountryID": 210,
        "Latitude": 38.612524,
        "Longitude": -0.588866,
        "DistanceUnit": 0
    },
    "Connections": [
        {
            "ID": 140294,
            "ConnectionTypeID": 25,
            "StatusTypeID": 50,
            "LevelID": 2,
            "Amps": 32,
            "Voltage": 230,
            "PowerKW": 7,
            "CurrentTypeID": 10,
            "Quantity": 1
        },
        {
            "ID": 140295,
            "ConnectionTypeID": 28,
            "StatusTypeID": 50,
            "LevelID": 1,
            "Voltage": 230,
            "PowerKW": 2.3,
            "CurrentTypeID": 10,
            "Quantity": 1
        }
    ],
    "NumberOfPoints": 1,
    "GeneralComments": "Solicitar acceso con anterioridad escribiendo a: info@grupobernabeu.com",
    "StatusTypeID": 50,
    "DateLastStatusUpdate": "2019-12-18T20:20:00Z",
    "DataQualityLevel": 1,
    "DateCreated": "2018-01-25T18:54:00Z",
    "SubmissionStatusTypeID": 200
}