{
    "IsRecentlyVerified": false,
    "ID": 73251,
    "UUID": "3DB627AF-0256-41FD-979B-D2E98879E5D6",
    "DataProviderID": 1,
    "OperatorID": 25,
    "OperatorsReference": "hammersmithandfulham-wormholroad",
    "UsageTypeID": 4,
    "UsageCost": "£0.059/minute; min £1.18; other tariffs available",
    "AddressInfo": {
        "ID": 73597,
        "Title": "Wormholt Road",
        "AddressLine1": "Wormholt Road",
        "AddressLine2": "West Kensington Park",
        "Town": "London",
        "StateOrProvince": "England",
        "Postcode": "W12 0NJ",
        "CountryID": 1,
        "Latitude": 51.5068221,
        "Longitude": -0.2404697,
        "DistanceUnit": 0
    },
    "Connections": [
        {
            "ID": 105406,
            "ConnectionTypeID": 25,
            "StatusTypeID": 50,
            "LevelID": 2,
            "Amps": 32,
            "Voltage": 230,
            "PowerKW": 7,
            "CurrentTypeID": 10,
            "Quantity": 4
        },
        {
            "ID": 105407,
            "ConnectionTypeID": 1,
            "StatusTypeID": 50,
            "LevelID": 2,
            "Amps": 16,
            "Voltage": 230,
            "PowerKW": 4,
            "CurrentTypeID": 10,
            "Quantity": 4
        }
    ],
    "NumberOfPoints": 4,
    "StatusTypeID": 50,
    "DateLastStatusUpdate": "2017-04-27T14:05:00Z",
    "DataQualityLevel": 1,
    "DateCreated": "2016-11-16T10:57:00Z",
    "SubmissionStatusTypeID": 200
}