{
    "IsRecentlyVerified": false,
    "ID": 153398,
    "UUID": "9200718B-087A-40CC-B23E-D23B17B0F133",
    "DataProviderID": 28,
    "DataProvidersReference": "FR*S56*P56057*A",
    "OperatorID": 3379,
    "UsageTypeID": 5,
    "AddressInfo": {
        "ID": 153751,
        "Title": "Rue Cours Carré",
        "AddressLine1": "Rue Cours Carré 56320 Faouët",
        "CountryID": 80,
        "Latitude": 48.032159,
        "Longitude": -3.499354,
        "AccessComments": "24/24 7/7 jours",
        "DistanceUnit": 0
    },
    "Connections": [
        {
            "ID": 215185,
            "ConnectionTypeID": 25,
            "StatusTypeID": 50,
            "LevelID": 2,
            "PowerKW": 18,
            "CurrentTypeID": 20
        },
        {
            "ID": 215186,
            "ConnectionTypeID": 28,
            "StatusTypeID": 50,
            "LevelID": 2,
            "PowerKW": 18,
            "CurrentTypeID": 10
        },
        {
            "ID": 248583,
            "ConnectionTypeID": 25,
            "StatusTypeID": 50,
            "LevelID": 2,
            "PowerKW": 18,
            "CurrentTypeID": 20
        },
        {
            "ID": 248584,
            "ConnectionTypeID": 28,
            "StatusTypeID": 50,
            "LevelID": 2,
            "PowerKW": 18,
            "CurrentTypeID": 10
        }
    ],
    "GeneralComments": "Tarif abonné Morbihan Energies: 18€ ttc/an, puis 0,25€ ttc/kWh consommé. Non abonné: 2€ ttc/charge (3€ sur bornes rapides), puis 0,25€ ttc/kWh consommé. Pénalités applicables au temps si branchement > 6 heures (2 heures sur bornes rapides) : 5€ ttc/heure",
    "StatusTypeID": 50,
    "DateLastStatusUpdate": "2020-08-27T05:14:00Z",
    "DataQualityLevel": 2,
    "DateCreated": "2020-03-15T10:54:00Z",
    "SubmissionStatusTypeID": 100
}