{
    "IsRecentlyVerified": false,
    "ID": 181729,
    "UUID": "756B4D54-618A-4E21-ADD6-2A478C391A15",
    "DataProviderID": 29,
    "DataProvidersReference": "17582,8084",
    "AddressInfo": {
        "ID": 182088,
        "Title": "Kapsgraben 13",
        "AddressLine1": "Kapsgraben 13",
        "Town": "Schmölln",
        "Postcode": "04626",
        "CountryID": 87,
        "Latitude": 50.893235,
        "Longitude": 12.332975,
        "DistanceUnit": 0
    },
    "Connections": [
        {
            "ID": 286448,
            "ConnectionTypeID": 25,
            "StatusTypeID": 50,
            "LevelID": 2,
            "PowerKW": 11,
            "CurrentTypeID": 20
        },
        {
            "ID": 286449,
            "ConnectionTypeID": 33,
            "StatusTypeID": 50,
            "LevelID": 3,
            "PowerKW": 22,
            "CurrentTypeID": 30
        },
        {
            "ID": 286450,
            "ConnectionTypeID": 25,
            "StatusTypeID": 50,
            "LevelID": 2,
            "PowerKW": 11,
            "CurrentTypeID": 20
        }
    ],
    "StatusTypeID": 50,
    "DateLastStatusUpdate": "2021-07-09T03:21:00Z",
    "MetadataValues": [
        {
            "ID": 14023,
            "MetadataFieldID": 4,
            "ItemValue": "Data from the German chargepoint registry provided by Bundesnetzagentur.de under the CC-BY 4.0 license"
        }
    ],
    "DataQualityLevel": 3,
    "DateCreated": "2021-07-08T10:02:00Z",
    "SubmissionStatusTypeID": 100
}