{
    "IsRecentlyVerified": false,
    "ID": 113151,
    "UUID": "4668DE3F-C4B0-4835-8925-2C67A706BFCA",
    "DataProviderID": 2,
    "DataProvidersReference": "104270",
    "UsageTypeID": 1,
    "AddressInfo": {
        "ID": 113497,
        "Title": "Four Winds Casino South Bend - East Lot",
        "AddressLine1": "3000 Prairie Ave",
        "Town": "South Bend",
        "StateOrProvince": "IN",
        "Postcode": "46614",
        "CountryID": 2,
        "Latitude": 41.642423,
        "Longitude": -86.288396,
        "ContactTelephone1": "866-494-6371",
        "AccessComments": "24 hours daily",
        "RelatedURL": "",
        "DistanceUnit": 0
    },
    "Connections": [
        {
            "ID": 159329,
            "ConnectionTypeID": 1,
            "LevelID": 2,
            "Amps": 16,
            "Voltage": 230,
            "PowerKW": 3.7,
            "CurrentTypeID": 10,
            "Quantity": 4
        }
    ],
    "DateLastStatusUpdate": "2020-06-26T03:04:00Z",
    "DataQualityLevel": 3,
    "DateCreated": "2018-11-28T02:04:00Z",
    "SubmissionStatusTypeID": 100
}