{
    "IsRecentlyVerified": false,
    "ID": 109301,
    "UUID": "78C4CCAB-7CEF-4263-A048-213F03581E08",
    "DataProviderID": 1,
    "OperatorID": 23,
    "OperatorsReference": "46065",
    "UsageTypeID": 4,
    "AddressInfo": {
        "ID": 109647,
        "Title": "The Address Boulevard",
        "AddressLine1": "The Address Boulevard",
        "Town": "Downtown",
        "StateOrProvince": "Dubai",
        "Postcode": "99440",
        "CountryID": 235,
        "Latitude": 25.200881,
        "Longitude": 55.276203,
        "ContactTelephone1": "+971 4 561 8888",
        "DistanceUnit": 0
    },
    "Connections": [
        {
            "ID": 154419,
            "ConnectionTypeID": 30,
            "StatusTypeID": 50,
            "LevelID": 2,
            "Amps": 16,
            "Voltage": 400,
            "PowerKW": 11,
            "CurrentTypeID": 20,
            "Quantity": 2
        }
    ],
    "NumberOfPoints": 2,
    "GeneralComments": "2 Tesla Connectors, up to 11kW.Available for customers. Please see valet.",
    "StatusTypeID": 50,
    "DateLastStatusUpdate": "2018-10-11T14:15:00Z",
    "DataQualityLevel": 1,
    "DateCreated": "2018-10-11T14:15:00Z",
    "SubmissionStatusTypeID": 200
}