{
    "IsRecentlyVerified": false,
    "ID": 63945,
    "UUID": "DD204981-A4E6-4F53-8519-AEBDFC60C979",
    "DataProviderID": 26,
    "DataProvidersReference": "77547",
    "OperatorID": 73,
    "OperatorsReference": "EV-Box EVB-P1430389",
    "UsageCost": "0.00 jaarabonnement",
    "AddressInfo": {
        "ID": 64291,
        "Title": "Marke Hasselo 10",
        "AddressLine1": "Marke Hasselo 10",
        "Town": "Almelo",
        "Postcode": "7603 GH",
        "CountryID": 159,
        "Latitude": 52.37038,
        "Longitude": 6.69836,
        "RelatedURL": "http://www.ev-box.nl",
        "DistanceUnit": 0
    },
    "Connections": [
        {
            "ID": 81729,
            "ConnectionTypeID": 25,
            "LevelID": 2,
            "PowerKW": 5,
            "CurrentTypeID": 10
        }
    ],
    "NumberOfPoints": 1,
    "StatusTypeID": 50,
    "DateLastStatusUpdate": "2016-06-04T02:53:00Z",
    "DataQualityLevel": 3,
    "DateCreated": "2016-03-03T12:32:00Z",
    "SubmissionStatusTypeID": 100
}