{
    "IsRecentlyVerified": false,
    "ID": 185100,
    "UUID": "18836CD7-42D2-462E-9F81-76FC0FC49D08",
    "DataProviderID": 29,
    "DataProvidersReference": "11396",
    "OperatorID": 69,
    "AddressInfo": {
        "ID": 185459,
        "Title": "Heinrich-Rau-Straße 3",
        "AddressLine1": "Heinrich-Rau-Straße 3",
        "Town": "Neuruppin",
        "Postcode": "16816",
        "CountryID": 87,
        "Latitude": 52.910475,
        "Longitude": 12.797373,
        "DistanceUnit": 0
    },
    "Connections": [
        {
            "ID": 294156,
            "ConnectionTypeID": 25,
            "StatusTypeID": 50,
            "LevelID": 2,
            "PowerKW": 22,
            "CurrentTypeID": 20
        },
        {
            "ID": 294157,
            "ConnectionTypeID": 25,
            "StatusTypeID": 50,
            "LevelID": 2,
            "PowerKW": 22,
            "CurrentTypeID": 20
        }
    ],
    "StatusTypeID": 50,
    "DateLastStatusUpdate": "2021-07-12T02:50:00Z",
    "MetadataValues": [
        {
            "ID": 17391,
            "MetadataFieldID": 4,
            "ItemValue": "Data from the German chargepoint registry provided by Bundesnetzagentur.de under the CC-BY 4.0 license"
        }
    ],
    "DataQualityLevel": 3,
    "DateCreated": "2021-07-08T10:06:00Z",
    "SubmissionStatusTypeID": 100
}