{
    "IsRecentlyVerified": false,
    "ID": 47749,
    "UUID": "ABA4AE90-6E88-4ECF-8C98-67F243300CE2",
    "DataProviderID": 1,
    "OperatorID": 45,
    "UsageTypeID": 1,
    "AddressInfo": {
        "ID": 48095,
        "Title": "Autohaus Nolte",
        "AddressLine1": "Mendener Straße 17-23",
        "Town": "Iserlohn",
        "StateOrProvince": "Märkischer Kreis",
        "Postcode": "58636",
        "CountryID": 87,
        "Latitude": 51.3747660450819,
        "Longitude": 7.70414489061318,
        "AccessComments": "Kostenloses Laden am VW/Opel Autohaus. Betreiber sind die Stadtwerke Iserlohn (also keine Markenbindung, frei für alle!).  Ladekabel mit Steckern an den beiden Wallboxen!",
        "RelatedURL": "http://www.nolte-gruppe.de/unternehmen/nachrichten/detail/datum/2015/05/20/zwei-neue-ladestationen-fuer-e-fahrzeuge-bei-gebrueder-nolte-volkswagen-an-der-seeuferstrasse.html",
        "DistanceUnit": 0
    },
    "Connections": [
        {
            "ID": 58875,
            "ConnectionTypeID": 25,
            "StatusTypeID": 50,
            "LevelID": 2,
            "Amps": 16,
            "Voltage": 230,
            "PowerKW": 3.7,
            "CurrentTypeID": 10,
            "Quantity": 2
        }
    ],
    "NumberOfPoints": 2,
    "StatusTypeID": 50,
    "DateLastStatusUpdate": "2015-06-08T15:09:00Z",
    "DataQualityLevel": 1,
    "DateCreated": "2015-06-08T12:21:00Z",
    "SubmissionStatusTypeID": 200
}