{
    "IsRecentlyVerified": false,
    "ID": 36119,
    "UUID": "CAC935BB-7EF1-4CE1-B3E7-EBF33455A1E4",
    "DataProviderID": 26,
    "DataProvidersReference": "50651",
    "OperatorID": 180,
    "OperatorsReference": "Alfen GDH0861",
    "UsageCost": "0.00 jaarabonnement",
    "AddressInfo": {
        "ID": 36465,
        "Title": "Van Hogenhoucklaan",
        "AddressLine1": "Van Hogenhoucklaan",
        "Town": "Den Haag",
        "Postcode": "2596 TG",
        "CountryID": 159,
        "Latitude": 52.099916,
        "Longitude": 4.316856,
        "ContactTelephone1": "036 - 549 34 00",
        "RelatedURL": "http://www.icu-charging-stations.com/",
        "DistanceUnit": 0
    },
    "Connections": [
        {
            "ID": 39630,
            "ConnectionTypeID": 25,
            "LevelID": 2,
            "PowerKW": 11,
            "CurrentTypeID": 10
        },
        {
            "ID": 48242,
            "ConnectionTypeID": 25,
            "LevelID": 2,
            "PowerKW": 11,
            "CurrentTypeID": 10
        }
    ],
    "NumberOfPoints": 1,
    "StatusTypeID": 50,
    "DateLastStatusUpdate": "2016-06-04T02:50:00Z",
    "DataQualityLevel": 3,
    "DateCreated": "2015-01-09T06:05:00Z",
    "SubmissionStatusTypeID": 100
}