{
    "IsRecentlyVerified": false,
    "ID": 106057,
    "UUID": "E9D64723-5249-43D0-A5EB-C1CD37098562",
    "DataProviderID": 1,
    "OperatorID": 45,
    "UsageTypeID": 6,
    "AddressInfo": {
        "ID": 106403,
        "Title": " Centro Commerciale Costaverde",
        "AddressLine1": "SS16 Adriatica",
        "AddressLine2": "Contrada Padula",
        "Town": "Montenero di Bisaccia ",
        "StateOrProvince": "CB",
        "Postcode": "86036 ",
        "CountryID": 112,
        "Latitude": 42.06221675755483,
        "Longitude": 14.779700524278951,
        "ContactTelephone1": "+ 39 0873 809172",
        "ContactEmail": "info@centrocostaverde.com",
        "RelatedURL": "http://www.centrocostaverde.com/",
        "DistanceUnit": 0
    },
    "Connections": [
        {
            "ID": 149366,
            "ConnectionTypeID": 25,
            "StatusTypeID": 0,
            "LevelID": 2,
            "Quantity": 2
        }
    ],
    "NumberOfPoints": 2,
    "StatusTypeID": 50,
    "DateLastStatusUpdate": "2018-06-14T14:10:00Z",
    "DataQualityLevel": 1,
    "DateCreated": "2018-06-14T14:10:00Z",
    "SubmissionStatusTypeID": 200
}