{
    "IsRecentlyVerified": false,
    "ID": 91335,
    "UUID": "5590E715-1532-4F05-B346-CB0F15FB847B",
    "DataProviderID": 2,
    "DataProvidersReference": "85796",
    "OperatorID": 5,
    "UsageTypeID": 1,
    "AddressInfo": {
        "ID": 91681,
        "Title": "HIE LOMA LINDA",
        "AddressLine1": "25222 Redlands Blvd",
        "Town": "Loma Linda",
        "StateOrProvince": "CA",
        "Postcode": "92354",
        "CountryID": 2,
        "Latitude": 34.06474,
        "Longitude": -117.253206,
        "ContactTelephone1": "888-758-4389",
        "AccessComments": "24 hours daily",
        "RelatedURL": "http://www.chargepoint.com/",
        "DistanceUnit": 0
    },
    "Connections": [
        {
            "ID": 129487,
            "ConnectionTypeID": 1,
            "LevelID": 2,
            "Amps": 16,
            "Voltage": 230,
            "PowerKW": 3,
            "CurrentTypeID": 10,
            "Quantity": 4
        }
    ],
    "DateLastStatusUpdate": "2019-04-06T04:01:00Z",
    "DataQualityLevel": 3,
    "DateCreated": "2017-08-03T12:24:00Z",
    "SubmissionStatusTypeID": 100
}