{
    "IsRecentlyVerified": false,
    "ID": 75807,
    "UUID": "65575FBE-1809-44B5-AF58-B75F919E62D7",
    "DataProviderID": 1,
    "OperatorID": 23,
    "OperatorsReference": "22340",
    "UsageTypeID": 1,
    "AddressInfo": {
        "ID": 76153,
        "Title": "Courtyard Marriott - Tesla",
        "AddressLine1": "4105 W State Route 89A",
        "Town": "Sedona",
        "StateOrProvince": "AZ",
        "Postcode": "86336",
        "CountryID": 2,
        "Latitude": 34.8527822,
        "Longitude": -111.825062,
        "ContactTelephone1": "928-325-0055  877-798-3752",
        "AccessComments": "24 hours daily; for Tesla use only; for guest use only",
        "RelatedURL": "http://www.teslamotors.com/supercharger",
        "DistanceUnit": 0
    },
    "Connections": [
        {
            "ID": 109313,
            "ConnectionTypeID": 30,
            "StatusTypeID": 50,
            "LevelID": 2,
            "Amps": 16,
            "Voltage": 230,
            "PowerKW": 16,
            "CurrentTypeID": 10,
            "Quantity": 2
        }
    ],
    "NumberOfPoints": 2,
    "StatusTypeID": 50,
    "DateLastStatusUpdate": "2017-02-02T22:32:00Z",
    "DataQualityLevel": 3,
    "DateCreated": "2016-12-23T01:25:00Z",
    "SubmissionStatusTypeID": 100
}