{
    "IsRecentlyVerified": false,
    "ID": 180095,
    "UUID": "7F106C72-F0AC-4416-93EB-B274D2B532B0",
    "DataProviderID": 29,
    "DataProvidersReference": "3309",
    "OperatorID": 86,
    "AddressInfo": {
        "ID": 180454,
        "Title": "BAB 6; Raststätte Kraichgau-Süd",
        "AddressLine1": "BAB 6; Raststätte Kraichgau-Süd",
        "Town": "Sinsheim",
        "Postcode": "74889",
        "CountryID": 87,
        "Latitude": 49.2409723865224,
        "Longitude": 8.87991140988803,
        "DistanceUnit": 0
    },
    "Connections": [
        {
            "ID": 282761,
            "ConnectionTypeID": 33,
            "StatusTypeID": 50,
            "LevelID": 3,
            "PowerKW": 300,
            "CurrentTypeID": 30
        },
        {
            "ID": 282762,
            "ConnectionTypeID": 33,
            "StatusTypeID": 50,
            "LevelID": 3,
            "PowerKW": 300,
            "CurrentTypeID": 30
        }
    ],
    "StatusTypeID": 50,
    "DateLastStatusUpdate": "2021-07-12T02:42:00Z",
    "MetadataValues": [
        {
            "ID": 12389,
            "MetadataFieldID": 4,
            "ItemValue": "Data from the German chargepoint registry provided by Bundesnetzagentur.de under the CC-BY 4.0 license"
        }
    ],
    "DataQualityLevel": 3,
    "DateCreated": "2021-07-08T10:00:00Z",
    "SubmissionStatusTypeID": 100
}