{
    "IsRecentlyVerified": false,
    "ID": 41630,
    "UUID": "6253C257-97D5-4888-B55C-E7BB8D646815",
    "DataProviderID": 26,
    "DataProvidersReference": "58900",
    "OperatorID": 73,
    "OperatorsReference": "EV-Box EVB-P1430204",
    "UsageCost": "0.00 jaarabonnement",
    "AddressInfo": {
        "ID": 41976,
        "Title": "Capelseweg 41",
        "AddressLine1": "Capelseweg 41",
        "Town": "Capelle aan den IJssel",
        "Postcode": "2907 XA",
        "CountryID": 159,
        "Latitude": 51.94127,
        "Longitude": 4.57442,
        "RelatedURL": "http://www.ev-box.nl",
        "DistanceUnit": 0
    },
    "Connections": [
        {
            "ID": 45605,
            "ConnectionTypeID": 25,
            "LevelID": 2,
            "PowerKW": 11,
            "CurrentTypeID": 10
        },
        {
            "ID": 45606,
            "ConnectionTypeID": 25,
            "LevelID": 2,
            "PowerKW": 11,
            "CurrentTypeID": 10
        },
        {
            "ID": 45607,
            "ConnectionTypeID": 25,
            "LevelID": 2,
            "PowerKW": 11,
            "CurrentTypeID": 10
        },
        {
            "ID": 45608,
            "ConnectionTypeID": 25,
            "LevelID": 2,
            "PowerKW": 11,
            "CurrentTypeID": 10
        }
    ],
    "NumberOfPoints": 1,
    "StatusTypeID": 50,
    "DateLastStatusUpdate": "2016-06-04T02:42:00Z",
    "DataQualityLevel": 3,
    "DateCreated": "2015-02-09T03:25:00Z",
    "SubmissionStatusTypeID": 100
}