{
    "IsRecentlyVerified": false,
    "ID": 19202,
    "UUID": "1B6B3204-9E5A-4E9D-82BF-689D8C9C6C6A",
    "DataProviderID": 2,
    "DataProvidersReference": "52794",
    "OperatorID": 5,
    "UsageTypeID": 1,
    "AddressInfo": {
        "ID": 19547,
        "Title": "CARCHARGING",
        "AddressLine1": "969 Main St",
        "Town": "Weymouth",
        "StateOrProvince": "MA",
        "Postcode": "02190",
        "CountryID": 2,
        "Latitude": 42.1717602,
        "Longitude": -70.9559355,
        "ContactTelephone1": "888-758-4389",
        "AccessComments": "24 hours daily",
        "RelatedURL": "http://www.chargepoint.com/",
        "DistanceUnit": 0
    },
    "Connections": [
        {
            "ID": 19478,
            "ConnectionTypeID": 9,
            "LevelID": 1,
            "Amps": 16,
            "Voltage": 120,
            "PowerKW": 1,
            "CurrentTypeID": 10,
            "Quantity": 1
        },
        {
            "ID": 19479,
            "ConnectionTypeID": 1,
            "LevelID": 2,
            "Amps": 16,
            "Voltage": 230,
            "PowerKW": 3,
            "CurrentTypeID": 10,
            "Quantity": 1
        },
        {
            "ID": 22333,
            "ConnectionTypeID": 1,
            "LevelID": 2,
            "Quantity": 1
        }
    ],
    "DateLastStatusUpdate": "2019-12-24T09:19:00Z",
    "DataQualityLevel": 3,
    "DateCreated": "2013-09-15T03:45:00Z",
    "SubmissionStatusTypeID": 200
}