{
    "IsRecentlyVerified": false,
    "ID": 135784,
    "UUID": "316561A2-E3D4-45E2-9F4D-D01FC892BEBE",
    "DataProviderID": 18,
    "DataProvidersReference": "4ad97e7cc7b3c38ed9c2e469510869e4",
    "OperatorID": 3345,
    "UsageTypeID": 5,
    "AddressInfo": {
        "ID": 136130,
        "Title": "Shawbury Road",
        "AddressLine1": "Shawbury Road",
        "Town": "East Dulwicj ",
        "Postcode": "SE22 9DH",
        "CountryID": 1,
        "Latitude": 51.457137,
        "Longitude": -0.074379,
        "AccessComments": "",
        "RelatedURL": "https://char.gy",
        "DistanceUnit": 0
    },
    "Connections": [
        {
            "ID": 190204,
            "ConnectionTypeID": 25,
            "Reference": "00034",
            "StatusTypeID": 50,
            "LevelID": 2,
            "Amps": 16,
            "Voltage": 230,
            "PowerKW": 3.7,
            "CurrentTypeID": 10
        }
    ],
    "StatusTypeID": 0,
    "DateLastStatusUpdate": "2019-12-24T05:22:00Z",
    "MetadataValues": [
        {
            "ID": 5636,
            "MetadataFieldID": 4,
            "ItemValue": "Contains public sector information licensed under the Open Government Licence v2.0. http://www.nationalarchives.gov.uk/doc/open-government-licence/version/2/"
        }
    ],
    "DataQualityLevel": 3,
    "DateCreated": "2019-12-24T05:22:00Z",
    "SubmissionStatusTypeID": 100
}