{
    "IsRecentlyVerified": false,
    "ID": 35918,
    "UUID": "CA885B9A-4D39-4CD9-BC31-3F1175054A46",
    "DataProviderID": 26,
    "DataProvidersReference": "45930",
    "OperatorID": 73,
    "OperatorsReference": "EV-Box EVB-P1349054",
    "UsageCost": "0.00 jaarabonnement",
    "AddressInfo": {
        "ID": 36264,
        "Title": "Daltonlaan 300",
        "AddressLine1": "Daltonlaan 300",
        "Town": "Utrecht",
        "Postcode": "3584 BK",
        "CountryID": 159,
        "Latitude": 52.08709,
        "Longitude": 5.16066,
        "RelatedURL": "http://www.ev-box.nl",
        "DistanceUnit": 0
    },
    "Connections": [
        {
            "ID": 39429,
            "ConnectionTypeID": 25,
            "LevelID": 2,
            "PowerKW": 11,
            "CurrentTypeID": 10
        },
        {
            "ID": 48118,
            "ConnectionTypeID": 25,
            "LevelID": 2,
            "PowerKW": 11,
            "CurrentTypeID": 10
        }
    ],
    "NumberOfPoints": 1,
    "StatusTypeID": 50,
    "DateLastStatusUpdate": "2016-06-04T02:50:00Z",
    "DataQualityLevel": 3,
    "DateCreated": "2015-01-09T06:05:00Z",
    "SubmissionStatusTypeID": 100
}