{
    "IsRecentlyVerified": false,
    "ID": 130998,
    "UUID": "BA9CBA0D-EE9C-4C4C-B979-2188CA19BFBF",
    "DataProviderID": 1,
    "OperatorID": 23,
    "OperatorsReference": "51534",
    "UsageTypeID": 4,
    "AddressInfo": {
        "ID": 131344,
        "Title": "Hotel Domestique",
        "AddressLine1": "10 Road of Vines",
        "Town": "Travelers Rest",
        "StateOrProvince": "South Carolina",
        "Postcode": "29690",
        "CountryID": 2,
        "Latitude": 35.103215,
        "Longitude": -82.444143,
        "ContactTelephone1": "(864) 516-1715",
        "DistanceUnit": 0
    },
    "Connections": [
        {
            "ID": 183493,
            "ConnectionTypeID": 30,
            "StatusTypeID": 50,
            "LevelID": 2,
            "PowerKW": 10,
            "CurrentTypeID": 20,
            "Quantity": 2
        }
    ],
    "NumberOfPoints": 2,
    "GeneralComments": "2 Tesla Connectors, up to 10kW.Available for customers. Self park.",
    "StatusTypeID": 50,
    "DateLastStatusUpdate": "2019-08-28T19:54:00Z",
    "DataQualityLevel": 1,
    "DateCreated": "2019-08-28T19:54:00Z",
    "SubmissionStatusTypeID": 200
}