{
    "IsRecentlyVerified": true,
    "DateLastVerified": "2021-10-25T14:35:00Z",
    "ID": 189685,
    "UUID": "97D926E7-E57F-48E5-B208-58152536E9CA",
    "DataProviderID": 1,
    "OperatorID": 1,
    "UsageTypeID": 4,
    "UsageCost": "0,35 €/kWh",
    "AddressInfo": {
        "ID": 190044,
        "Title": "Hotel & Gasthof zum Hirschen",
        "AddressLine1": "Schrann 9/C",
        "Town": "Jenesien",
        "StateOrProvince": "Bozen - Südtirol",
        "Postcode": "39050 ",
        "CountryID": 112,
        "Latitude": 46.53512760789911,
        "Longitude": 11.332097142268168,
        "ContactTelephone1": "+39 0471 354 195",
        "AccessComments": "For guest. RFID card available at office",
        "RelatedURL": "https://www.hirschenwirt.it/",
        "DistanceUnit": 0
    },
    "Connections": [
        {
            "ID": 306869,
            "ConnectionTypeID": 33,
            "StatusTypeID": 50,
            "LevelID": 2,
            "Amps": 16,
            "Voltage": 400,
            "PowerKW": 11,
            "CurrentTypeID": 20,
            "Quantity": 1
        },
        {
            "ID": 306870,
            "ConnectionTypeID": 33,
            "StatusTypeID": 50,
            "LevelID": 2,
            "Amps": 16,
            "Voltage": 400,
            "PowerKW": 11,
            "CurrentTypeID": 20,
            "Quantity": 1
        }
    ],
    "NumberOfPoints": 1,
    "GeneralComments": "The charging station are in the parking lot",
    "StatusTypeID": 50,
    "DateLastStatusUpdate": "2021-10-25T14:35:00Z",
    "DataQualityLevel": 1,
    "DateCreated": "2021-10-25T14:35:00Z",
    "SubmissionStatusTypeID": 200
}