{
    "IsRecentlyVerified": false,
    "ID": 91393,
    "UUID": "61283785-499D-4E65-A1B7-B76442E58735",
    "DataProviderID": 1,
    "OperatorID": 5,
    "UsageTypeID": 1,
    "AddressInfo": {
        "ID": 91739,
        "Title": "MAVERIK",
        "AddressLine1": "980 Hoodoo way",
        "Town": "Washington",
        "StateOrProvince": "UT",
        "Postcode": "84780",
        "CountryID": 2,
        "Latitude": 37.1446880411876,
        "Longitude": -113.487354424105,
        "ContactTelephone1": "888-758-4389",
        "AccessComments": "24 hours daily",
        "RelatedURL": "http://www.chargepoint.com/",
        "DistanceUnit": 0
    },
    "Connections": [
        {
            "ID": 129546,
            "ConnectionTypeID": 1,
            "LevelID": 2,
            "Amps": 16,
            "Voltage": 230,
            "PowerKW": 3,
            "CurrentTypeID": 10,
            "Quantity": 1
        },
        {
            "ID": 129547,
            "ConnectionTypeID": 2,
            "LevelID": 2,
            "Amps": 100,
            "Voltage": 400,
            "PowerKW": 40,
            "CurrentTypeID": 10,
            "Quantity": 1
        },
        {
            "ID": 129548,
            "ConnectionTypeID": 32,
            "LevelID": 3,
            "Amps": 125,
            "Voltage": 400,
            "PowerKW": 40,
            "CurrentTypeID": 30,
            "Quantity": 1
        }
    ],
    "StatusTypeID": 0,
    "DateLastStatusUpdate": "2019-05-01T12:10:00Z",
    "DataQualityLevel": 3,
    "DateCreated": "2017-08-03T12:25:00Z",
    "SubmissionStatusTypeID": 100
}