{
    "IsRecentlyVerified": false,
    "ID": 186811,
    "UUID": "6B66BD82-18A8-44E2-9421-4743E68C7071",
    "DataProviderID": 29,
    "DataProvidersReference": "2399",
    "AddressInfo": {
        "ID": 187170,
        "Title": "Am Kalkberg 6",
        "AddressLine1": "Am Kalkberg 6",
        "Town": "Brück",
        "Postcode": "14822",
        "CountryID": 87,
        "Latitude": 52.15925,
        "Longitude": 12.776496,
        "DistanceUnit": 0
    },
    "Connections": [
        {
            "ID": 300240,
            "ConnectionTypeID": 33,
            "StatusTypeID": 50,
            "LevelID": 3,
            "PowerKW": 50,
            "CurrentTypeID": 30
        },
        {
            "ID": 300241,
            "ConnectionTypeID": 2,
            "StatusTypeID": 50,
            "LevelID": 3,
            "PowerKW": 50,
            "CurrentTypeID": 30
        },
        {
            "ID": 300242,
            "ConnectionTypeID": 25,
            "StatusTypeID": 50,
            "LevelID": 2,
            "PowerKW": 22,
            "CurrentTypeID": 20
        },
        {
            "ID": 300243,
            "ConnectionTypeID": 25,
            "StatusTypeID": 50,
            "LevelID": 2,
            "PowerKW": 22,
            "CurrentTypeID": 20
        },
        {
            "ID": 300244,
            "ConnectionTypeID": 25,
            "StatusTypeID": 50,
            "LevelID": 2,
            "PowerKW": 22,
            "CurrentTypeID": 20
        }
    ],
    "StatusTypeID": 50,
    "DateLastStatusUpdate": "2021-07-12T02:49:00Z",
    "MetadataValues": [
        {
            "ID": 19052,
            "MetadataFieldID": 4,
            "ItemValue": "Data from the German chargepoint registry provided by Bundesnetzagentur.de under the CC-BY 4.0 license"
        }
    ],
    "DataQualityLevel": 3,
    "DateCreated": "2021-07-12T02:49:00Z",
    "SubmissionStatusTypeID": 100
}