{
    "UserComments": [
        {
            "ID": 23680,
            "ChargePointID": 93530,
            "CommentTypeID": 10,
            "UserName": "ForumElettrico.it",
            "Comment": "Tutto ok con card Hera anche su CCS Combo 2, e l'unico Tesla Destination Charging aperto a tutti è il primo di sinistra, quello con cartello rosso (e non quello con cartello bianco in mezzo, probabilmente sono invertiti). Leggi la recensione completa qui > https://www.forumelettrico.it/forum/post162623.html#p162623",
            "RelatedURL": "https://www.forumelettrico.it/forum/post162623.html#p162623",
            "DateCreated": "2020-12-22T17:21:04.027Z",
            "User": {
                "ID": 11749,
                "Username": "ForumElettrico.it"
            },
            "CheckinStatusTypeID": 10,
            "IsActionedByEditor": false
        },
        {
            "ID": 22756,
            "ChargePointID": 93530,
            "CommentTypeID": 10,
            "UserName": "ForumElettrico.it",
            "Comment": "Qui i tempi sono cambiati: arrivato presto ma il bar di fonte alla colonnina è chiuso a tempo indeterminato. Leggi la recensione completa https://www.forumelettrico.it/forum/eneldrive-fast-fidenza-village-t1572-180.html#p111569",
            "RelatedURL": "https://www.forumelettrico.it/forum/eneldrive-fast-fidenza-village-t1572-180.html#p111569",
            "DateCreated": "2020-06-07T15:26:51.167Z",
            "User": {
                "ID": 11749,
                "Username": "ForumElettrico.it"
            },
            "CheckinStatusTypeID": 10,
            "IsActionedByEditor": false
        },
        {
            "ID": 22157,
            "ChargePointID": 93530,
            "CommentTypeID": 10,
            "UserName": "ForumElettrico.it",
            "Comment": "Tutto ok su CHAdeMO. Leggi la recensione completa qui > https://www.forumelettrico.it/forum/eneldrive-fast-fidenza-village-t1572.html\r\n",
            "RelatedURL": "https://www.forumelettrico.it/forum/eneldrive-fast-fidenza-village-t1572.html",
            "DateCreated": "2020-02-16T17:04:59.903Z",
            "User": {
                "ID": 11749,
                "Username": "ForumElettrico.it"
            },
            "CheckinStatusTypeID": 0,
            "IsActionedByEditor": false
        },
        {
            "ID": 21559,
            "ChargePointID": 93530,
            "CommentTypeID": 10,
            "UserName": "et42",
            "Comment": "Charged successfully on Sept 16",
            "Rating": 5,
            "DateCreated": "2019-09-26T13:12:36.01Z",
            "User": {
                "ID": 21695,
                "Username": "et42"
            },
            "CheckinStatusTypeID": 10
        },
        {
            "ID": 20174,
            "ChargePointID": 93530,
            "CommentTypeID": 10,
            "UserName": "PowerCruiseControl",
            "Comment": "All ok",
            "Rating": 5,
            "DateCreated": "2018-09-19T12:16:50.87Z",
            "User": {
                "ID": 18504,
                "Username": "PowerCruiseControl"
            },
            "CheckinStatusTypeID": 10
        },
        {
            "ID": 17765,
            "ChargePointID": 93530,
            "CommentTypeID": 10,
            "UserName": "ForumElettrico.it",
            "Comment": "Tutto ok! http://www.forumelettrico.it/forum/eneldrive-fast-fidenza-village-t1572.html",
            "DateCreated": "2017-10-04T15:42:30.627Z",
            "User": {
                "ID": 11749,
                "Username": "ForumElettrico.it"
            },
            "CheckinStatusTypeID": 10
        }
    ],
    "MediaItems": [
        {
            "ID": 25919,
            "ChargePointID": 93530,
            "ItemURL": "https://s3-ap-southeast-2.amazonaws.com/openchargemap/images/IT/OCM93530/OCM-93530.orig.2020122217211404.jpg",
            "ItemThumbnailURL": "https://s3-ap-southeast-2.amazonaws.com/openchargemap/images/IT/OCM93530/OCM-93530.thmb.2020122217211404.jpg",
            "Comment": "",
            "IsEnabled": true,
            "IsVideo": false,
            "IsFeaturedItem": false,
            "IsExternalResource": false,
            "User": {
                "ID": 11749,
                "Username": "ForumElettrico.it"
            },
            "DateCreated": "2020-12-22T17:21:00Z"
        },
        {
            "ID": 25920,
            "ChargePointID": 93530,
            "ItemURL": "https://s3-ap-southeast-2.amazonaws.com/openchargemap/images/IT/OCM93530/OCM-93530.orig.2020122217212036.jpg",
            "ItemThumbnailURL": "https://s3-ap-southeast-2.amazonaws.com/openchargemap/images/IT/OCM93530/OCM-93530.thmb.2020122217212036.jpg",
            "Comment": "",
            "IsEnabled": true,
            "IsVideo": false,
            "IsFeaturedItem": false,
            "IsExternalResource": false,
            "User": {
                "ID": 11749,
                "Username": "ForumElettrico.it"
            },
            "DateCreated": "2020-12-22T17:21:00Z"
        },
        {
            "ID": 22600,
            "ChargePointID": 93530,
            "ItemURL": "https://s3-ap-southeast-2.amazonaws.com/openchargemap/images/IT/OCM93530/OCM-93530.orig.2020060715270280.jpg",
            "ItemThumbnailURL": "https://s3-ap-southeast-2.amazonaws.com/openchargemap/images/IT/OCM93530/OCM-93530.thmb.2020060715270280.jpg",
            "Comment": "",
            "IsEnabled": true,
            "IsVideo": false,
            "IsFeaturedItem": false,
            "IsExternalResource": false,
            "User": {
                "ID": 11749,
                "Username": "ForumElettrico.it"
            },
            "DateCreated": "2020-06-07T15:27:00Z"
        },
        {
            "ID": 22601,
            "ChargePointID": 93530,
            "ItemURL": "https://s3-ap-southeast-2.amazonaws.com/openchargemap/images/IT/OCM93530/OCM-93530.orig.2020060715270937.jpg",
            "ItemThumbnailURL": "https://s3-ap-southeast-2.amazonaws.com/openchargemap/images/IT/OCM93530/OCM-93530.thmb.2020060715270937.jpg",
            "Comment": "",
            "IsEnabled": true,
            "IsVideo": false,
            "IsFeaturedItem": false,
            "IsExternalResource": false,
            "User": {
                "ID": 11749,
                "Username": "ForumElettrico.it"
            },
            "DateCreated": "2020-06-07T15:27:00Z"
        },
        {
            "ID": 22602,
            "ChargePointID": 93530,
            "ItemURL": "https://s3-ap-southeast-2.amazonaws.com/openchargemap/images/IT/OCM93530/OCM-93530.orig.2020060715271671.jpg",
            "ItemThumbnailURL": "https://s3-ap-southeast-2.amazonaws.com/openchargemap/images/IT/OCM93530/OCM-93530.thmb.2020060715271671.jpg",
            "Comment": "",
            "IsEnabled": true,
            "IsVideo": false,
            "IsFeaturedItem": false,
            "IsExternalResource": false,
            "User": {
                "ID": 11749,
                "Username": "ForumElettrico.it"
            },
            "DateCreated": "2020-06-07T15:27:00Z"
        },
        {
            "ID": 21255,
            "ChargePointID": 93530,
            "ItemURL": "https://s3-ap-southeast-2.amazonaws.com/openchargemap/images/IT/OCM93530/OCM-93530.orig.2020021617051187.jpg",
            "ItemThumbnailURL": "https://s3-ap-southeast-2.amazonaws.com/openchargemap/images/IT/OCM93530/OCM-93530.thmb.2020021617051187.jpg",
            "Comment": "",
            "IsEnabled": true,
            "IsVideo": false,
            "IsFeaturedItem": false,
            "IsExternalResource": false,
            "User": {
                "ID": 11749,
                "Username": "ForumElettrico.it"
            },
            "DateCreated": "2020-02-16T17:05:00Z"
        },
        {
            "ID": 19815,
            "ChargePointID": 93530,
            "ItemURL": "https://s3-ap-southeast-2.amazonaws.com/openchargemap/images/IT/OCM93530/OCM-93530.orig.2019100413155517.jpeg",
            "ItemThumbnailURL": "https://s3-ap-southeast-2.amazonaws.com/openchargemap/images/IT/OCM93530/OCM-93530.thmb.2019100413155517.jpeg",
            "Comment": "",
            "IsEnabled": true,
            "IsVideo": false,
            "IsFeaturedItem": false,
            "IsExternalResource": false,
            "User": {
                "ID": 21695,
                "Username": "et42"
            },
            "DateCreated": "2019-10-04T13:16:00Z"
        },
        {
            "ID": 15790,
            "ChargePointID": 93530,
            "ItemURL": "https://s3-ap-southeast-2.amazonaws.com/openchargemap/images/IT/OCM93530/OCM-93530.orig.2018062912495753.jpg",
            "ItemThumbnailURL": "https://s3-ap-southeast-2.amazonaws.com/openchargemap/images/IT/OCM93530/OCM-93530.thmb.2018062912495753.jpg",
            "Comment": "Good GPS positioning\r\nwww.powercruisecontrol.com",
            "IsEnabled": true,
            "IsVideo": false,
            "IsFeaturedItem": false,
            "IsExternalResource": false,
            "User": {
                "ID": 18504,
                "Username": "PowerCruiseControl"
            },
            "DateCreated": "2018-06-29T12:50:00Z"
        },
        {
            "ID": 13413,
            "ChargePointID": 93530,
            "ItemURL": "https://s3-ap-southeast-2.amazonaws.com/openchargemap/images/IT/OCM93530/OCM-93530.orig.2017100415432561.jpg",
            "ItemThumbnailURL": "https://s3-ap-southeast-2.amazonaws.com/openchargemap/images/IT/OCM93530/OCM-93530.thmb.2017100415432561.jpg",
            "Comment": "",
            "IsEnabled": true,
            "IsVideo": false,
            "IsFeaturedItem": false,
            "IsExternalResource": false,
            "User": {
                "ID": 11749,
                "Username": "ForumElettrico.it"
            },
            "DateCreated": "2017-10-04T15:44:00Z"
        },
        {
            "ID": 13414,
            "ChargePointID": 93530,
            "ItemURL": "https://s3-ap-southeast-2.amazonaws.com/openchargemap/images/IT/OCM93530/OCM-93530.orig.2017100415433676.jpg",
            "ItemThumbnailURL": "https://s3-ap-southeast-2.amazonaws.com/openchargemap/images/IT/OCM93530/OCM-93530.thmb.2017100415433676.jpg",
            "Comment": "",
            "IsEnabled": true,
            "IsVideo": false,
            "IsFeaturedItem": false,
            "IsExternalResource": false,
            "User": {
                "ID": 11749,
                "Username": "ForumElettrico.it"
            },
            "DateCreated": "2017-10-04T15:44:00Z"
        },
        {
            "ID": 13410,
            "ChargePointID": 93530,
            "ItemURL": "https://s3-ap-southeast-2.amazonaws.com/openchargemap/images/IT/OCM93530/OCM-93530.orig.2017100415425497.jpg",
            "ItemThumbnailURL": "https://s3-ap-southeast-2.amazonaws.com/openchargemap/images/IT/OCM93530/OCM-93530.thmb.2017100415425497.jpg",
            "Comment": "",
            "IsEnabled": true,
            "IsVideo": false,
            "IsFeaturedItem": false,
            "IsExternalResource": false,
            "User": {
                "ID": 11749,
                "Username": "ForumElettrico.it"
            },
            "DateCreated": "2017-10-04T15:43:00Z"
        },
        {
            "ID": 13411,
            "ChargePointID": 93530,
            "ItemURL": "https://s3-ap-southeast-2.amazonaws.com/openchargemap/images/IT/OCM93530/OCM-93530.orig.2017100415430530.jpg",
            "ItemThumbnailURL": "https://s3-ap-southeast-2.amazonaws.com/openchargemap/images/IT/OCM93530/OCM-93530.thmb.2017100415430530.jpg",
            "Comment": "",
            "IsEnabled": true,
            "IsVideo": false,
            "IsFeaturedItem": false,
            "IsExternalResource": false,
            "User": {
                "ID": 11749,
                "Username": "ForumElettrico.it"
            },
            "DateCreated": "2017-10-04T15:43:00Z"
        },
        {
            "ID": 13412,
            "ChargePointID": 93530,
            "ItemURL": "https://s3-ap-southeast-2.amazonaws.com/openchargemap/images/IT/OCM93530/OCM-93530.orig.2017100415431456.jpg",
            "ItemThumbnailURL": "https://s3-ap-southeast-2.amazonaws.com/openchargemap/images/IT/OCM93530/OCM-93530.thmb.2017100415431456.jpg",
            "Comment": "",
            "IsEnabled": true,
            "IsVideo": false,
            "IsFeaturedItem": false,
            "IsExternalResource": false,
            "User": {
                "ID": 11749,
                "Username": "ForumElettrico.it"
            },
            "DateCreated": "2017-10-04T15:43:00Z"
        }
    ],
    "IsRecentlyVerified": false,
    "ID": 93530,
    "UUID": "CE98149B-A3C2-448C-A6A9-89A9A8583C75",
    "DataProviderID": 1,
    "OperatorID": 80,
    "UsageTypeID": 4,
    "UsageCost": "0,50 €/kWh",
    "AddressInfo": {
        "ID": 93876,
        "Title": "EnelX EVA+ Fidenza Shopping Park",
        "AddressLine1": "Via San Michele Campagna",
        "Town": "Chiusa Ferranda",
        "StateOrProvince": "PR",
        "Postcode": "43036 ",
        "CountryID": 112,
        "Latitude": 44.8824597726674,
        "Longitude": 10.0902848963696,
        "AccessComments": "Good GPS positioning",
        "RelatedURL": "http://eneldrive.it",
        "DistanceUnit": 0
    },
    "Connections": [
        {
            "ID": 132461,
            "ConnectionTypeID": 33,
            "StatusTypeID": 50,
            "LevelID": 3,
            "Amps": 120,
            "Voltage": 500,
            "PowerKW": 50,
            "CurrentTypeID": 30,
            "Quantity": 1
        },
        {
            "ID": 132462,
            "ConnectionTypeID": 2,
            "StatusTypeID": 50,
            "LevelID": 3,
            "Amps": 120,
            "Voltage": 500,
            "PowerKW": 50,
            "CurrentTypeID": 30,
            "Quantity": 1
        },
        {
            "ID": 132463,
            "ConnectionTypeID": 1036,
            "StatusTypeID": 50,
            "LevelID": 3,
            "Amps": 64,
            "Voltage": 400,
            "PowerKW": 43,
            "CurrentTypeID": 20,
            "Quantity": 1
        }
    ],
    "NumberOfPoints": 1,
    "GeneralComments": "http://www.forumelettrico.it/forum/eneldrive-fast-fidenza-village-t1572-20.html#p9529",
    "StatusTypeID": 50,
    "DateLastStatusUpdate": "2020-12-22T17:21:00Z",
    "DataQualityLevel": 1,
    "DateCreated": "2017-09-30T15:29:00Z",
    "SubmissionStatusTypeID": 200
}