{
    "IsRecentlyVerified": false,
    "ID": 99177,
    "UUID": "DB85F7B3-EF94-40C5-8464-17B14EA7D329",
    "DataProviderID": 1,
    "OperatorID": 25,
    "OperatorsReference": "barkinganddagenham-dagenhamroadcarpark",
    "UsageTypeID": 4,
    "UsageCost": "£0.059/minute; min £1.18; other tariffs available",
    "AddressInfo": {
        "ID": 99523,
        "Title": "Dagenham Road Car Park",
        "AddressLine1": "104a Dagenham Road Car Park",
        "Town": "ROMFORD",
        "Postcode": "RM7 0TJ",
        "CountryID": 1,
        "Latitude": 51.5644817285,
        "Longitude": 0.175700427791,
        "DistanceUnit": 0
    },
    "Connections": [
        {
            "ID": 140102,
            "ConnectionTypeID": 25,
            "StatusTypeID": 50,
            "LevelID": 2,
            "Amps": 32,
            "Voltage": 230,
            "PowerKW": 7,
            "CurrentTypeID": 10,
            "Quantity": 3
        },
        {
            "ID": 140103,
            "ConnectionTypeID": 1,
            "StatusTypeID": 50,
            "LevelID": 2,
            "Amps": 16,
            "Voltage": 230,
            "PowerKW": 4,
            "CurrentTypeID": 10,
            "Quantity": 3
        }
    ],
    "NumberOfPoints": 3,
    "StatusTypeID": 50,
    "DateLastStatusUpdate": "2018-05-02T05:42:00Z",
    "DataQualityLevel": 1,
    "DateCreated": "2018-01-23T07:08:00Z",
    "SubmissionStatusTypeID": 200
}