{
    "IsRecentlyVerified": false,
    "ID": 167384,
    "UUID": "92284740-8532-4927-9658-EF0D67C84368",
    "DataProviderID": 18,
    "DataProvidersReference": "db92620d3ccfb474aec36f8ce82be1a5",
    "OperatorID": 3345,
    "UsageTypeID": 5,
    "AddressInfo": {
        "ID": 167743,
        "Title": "Caulfield Road",
        "AddressLine1": "Caulfield Road",
        "Town": "London",
        "Postcode": "SE152DE",
        "CountryID": 1,
        "Latitude": 51.470158,
        "Longitude": -0.059119,
        "AccessComments": "",
        "RelatedURL": "https://char.gy",
        "DistanceUnit": 0
    },
    "Connections": [
        {
            "ID": 253503,
            "ConnectionTypeID": 25,
            "Reference": "389",
            "StatusTypeID": 50,
            "LevelID": 2,
            "Amps": 16,
            "Voltage": 230,
            "PowerKW": 3.7,
            "CurrentTypeID": 10
        }
    ],
    "StatusTypeID": 0,
    "DateLastStatusUpdate": "2020-09-08T02:47:00Z",
    "MetadataValues": [
        {
            "ID": 7925,
            "MetadataFieldID": 4,
            "ItemValue": "Contains public sector information licensed under the Open Government Licence v2.0. http://www.nationalarchives.gov.uk/doc/open-government-licence/version/2/"
        }
    ],
    "DataQualityLevel": 3,
    "DateCreated": "2020-09-08T02:47:00Z",
    "SubmissionStatusTypeID": 100
}