{
    "MediaItems": [
        {
            "ID": 9027,
            "ChargePointID": 47999,
            "ItemURL": "https://s3-ap-southeast-2.amazonaws.com/openchargemap/images/IT/OCM47999/OCM-47999.orig.2017011411394781.jpg",
            "ItemThumbnailURL": "https://s3-ap-southeast-2.amazonaws.com/openchargemap/images/IT/OCM47999/OCM-47999.thmb.2017011411394781.jpg",
            "Comment": "",
            "IsEnabled": true,
            "IsVideo": false,
            "IsFeaturedItem": false,
            "IsExternalResource": false,
            "User": {
                "ID": 12207,
                "Username": "aldodal"
            },
            "DateCreated": "2017-01-14T11:40:00Z"
        }
    ],
    "IsRecentlyVerified": false,
    "ID": 47999,
    "UUID": "5F1F4AB6-C67C-4CF0-B448-34AF0838BC19",
    "DataProviderID": 1,
    "OperatorID": 80,
    "UsageTypeID": 4,
    "UsageCost": "0,40€/kW",
    "AddressInfo": {
        "ID": 48345,
        "Title": "Rho Biblioteca Comunale",
        "AddressLine1": "Corso Europa",
        "Town": "Rho",
        "StateOrProvince": "Milano",
        "Postcode": "20017",
        "CountryID": 112,
        "Latitude": 45.53360201996982,
        "Longitude": 9.029181369587706,
        "RelatedURL": "https://www.eneldrive.it/",
        "DistanceUnit": 0
    },
    "Connections": [
        {
            "ID": 59237,
            "ConnectionTypeID": 25,
            "StatusTypeID": 50,
            "LevelID": 2,
            "PowerKW": 22,
            "CurrentTypeID": 20,
            "Quantity": 1
        }
    ],
    "NumberOfPoints": 1,
    "StatusTypeID": 50,
    "DateLastStatusUpdate": "2017-01-14T11:40:00Z",
    "DataQualityLevel": 1,
    "DateCreated": "2015-06-20T18:09:00Z",
    "SubmissionStatusTypeID": 200
}