{
    "IsRecentlyVerified": false,
    "ID": 139700,
    "UUID": "CDD5D0B6-878B-40C6-B682-5C8460177452",
    "DataProviderID": 2,
    "DataProvidersReference": "144505",
    "OperatorID": 5,
    "UsageTypeID": 1,
    "AddressInfo": {
        "ID": 140052,
        "Title": "H&S ENERGY",
        "AddressLine1": "1105 Santa Anita Ave",
        "Town": "South El Monte",
        "StateOrProvince": "CA",
        "Postcode": "91733",
        "CountryID": 2,
        "Latitude": 34.041329,
        "Longitude": -118.050004,
        "ContactTelephone1": "888-758-4389",
        "AccessComments": "24 hours daily",
        "RelatedURL": "http://www.chargepoint.com/",
        "DistanceUnit": 0
    },
    "Connections": [
        {
            "ID": 195141,
            "ConnectionTypeID": 2,
            "LevelID": 3,
            "Amps": 100,
            "Voltage": 400,
            "PowerKW": 40,
            "CurrentTypeID": 30,
            "Quantity": 1
        },
        {
            "ID": 195142,
            "ConnectionTypeID": 32,
            "LevelID": 3,
            "Amps": 100,
            "Voltage": 400,
            "PowerKW": 40,
            "CurrentTypeID": 30,
            "Quantity": 1
        }
    ],
    "StatusTypeID": 50,
    "DateLastStatusUpdate": "2019-12-24T09:11:00Z",
    "DataQualityLevel": 3,
    "DateCreated": "2019-12-24T09:11:00Z",
    "SubmissionStatusTypeID": 100
}