{
    "IsRecentlyVerified": false,
    "ID": 173131,
    "UUID": "599EDC41-35E6-4076-8DC7-D863BC58D37D",
    "DataProviderID": 19,
    "DataProvidersReference": "7346",
    "AddressInfo": {
        "ID": 173490,
        "Title": "Torsten Karlssons Väg 8A",
        "AddressLine1": "Torsten Karlssons Väg 8A",
        "Town": "ASKERSUND",
        "StateOrProvince": "ÖREBRO",
        "Postcode": "69633",
        "CountryID": 216,
        "Latitude": 58.88793,
        "Longitude": 14.91214,
        "AccessComments": "Torsten Karlssons Väg 8A. Åk in mellan Coop och Frendo och bort mot den stora parkeringen så finns laddplatserna där. fasadmonterade med skyltar.\r\r58.88793, 14.912224",
        "DistanceUnit": 0
    },
    "Connections": [
        {
            "ID": 265244,
            "ConnectionTypeID": 25,
            "Reference": "1",
            "LevelID": 2,
            "Amps": 16,
            "Voltage": 400,
            "PowerKW": 11,
            "CurrentTypeID": 20
        },
        {
            "ID": 265245,
            "ConnectionTypeID": 25,
            "Reference": "2",
            "LevelID": 2,
            "Amps": 16,
            "Voltage": 400,
            "PowerKW": 11,
            "CurrentTypeID": 20
        },
        {
            "ID": 265246,
            "ConnectionTypeID": 25,
            "Reference": "3",
            "LevelID": 2,
            "Amps": 16,
            "Voltage": 400,
            "PowerKW": 11,
            "CurrentTypeID": 20
        }
    ],
    "NumberOfPoints": 3,
    "StatusTypeID": 0,
    "DateLastStatusUpdate": "2021-03-24T05:11:00Z",
    "DataQualityLevel": 2,
    "DateCreated": "2021-03-03T09:01:00Z",
    "SubmissionStatusTypeID": 100
}