{
    "IsRecentlyVerified": false,
    "ID": 15869,
    "UUID": "6056D892-BFFC-47C8-BB84-01B04DFFD199",
    "DataProviderID": 1,
    "OperatorID": 1,
    "UsageTypeID": 0,
    "UsageCost": "Free",
    "AddressInfo": {
        "ID": 16214,
        "Title": "Stadsbestuur Antwerpen",
        "AddressLine1": "Paleisstraat 108 ",
        "AddressLine2": "",
        "Town": "Antwerpen ",
        "StateOrProvince": "",
        "Postcode": "2018 ",
        "CountryID": 26,
        "Latitude": 51.2058822,
        "Longitude": 4.397778300000027,
        "ContactTelephone1": "",
        "ContactTelephone2": "",
        "ContactEmail": "",
        "AccessComments": "",
        "RelatedURL": "",
        "DistanceUnit": 0
    },
    "Connections": [
        {
            "ID": 14227,
            "ConnectionTypeID": 23,
            "StatusTypeID": 0,
            "LevelID": 2,
            "Amps": 16,
            "Voltage": 220,
            "PowerKW": 3.5,
            "Quantity": 1
        }
    ],
    "NumberOfPoints": 20,
    "GeneralComments": "",
    "StatusTypeID": 50,
    "DateLastStatusUpdate": "2013-02-07T15:57:00Z",
    "DataQualityLevel": 1,
    "DateCreated": "2013-02-07T15:57:00Z",
    "SubmissionStatusTypeID": 200
}