{
    "IsRecentlyVerified": false,
    "ID": 154958,
    "UUID": "44819D4C-1542-46B0-BDE0-21BE12DAC798",
    "DataProviderID": 1,
    "OperatorID": 45,
    "UsageTypeID": 6,
    "UsageCost": "Free",
    "AddressInfo": {
        "ID": 155312,
        "Title": "Nutgrove Retail Park",
        "AddressLine1": "Nutgrove Avenue",
        "Town": "Dundrum",
        "StateOrProvince": "",
        "Postcode": "D14 DD88",
        "CountryID": 3,
        "Latitude": 53.29174370069987,
        "Longitude": -6.266848071195682,
        "AccessComments": "Underground car park",
        "DistanceUnit": 0
    },
    "Connections": [
        {
            "ID": 218099,
            "ConnectionTypeID": 25,
            "StatusTypeID": 50,
            "LevelID": 2,
            "PowerKW": 22,
            "Quantity": 2
        },
        {
            "ID": 218100,
            "ConnectionTypeID": 25,
            "StatusTypeID": 50,
            "LevelID": 2,
            "PowerKW": 22,
            "Quantity": 2
        }
    ],
    "NumberOfPoints": 4,
    "StatusTypeID": 50,
    "DateLastStatusUpdate": "2020-03-23T12:04:00Z",
    "DataQualityLevel": 1,
    "DateCreated": "2020-03-22T11:45:00Z",
    "SubmissionStatusTypeID": 200
}