{
    "IsRecentlyVerified": false,
    "ID": 48500,
    "UUID": "D6D22B2E-DEC0-4351-A97C-5880FE00826F",
    "DataProviderID": 1,
    "OperatorID": 3,
    "OperatorsReference": "PP-10003",
    "UsageTypeID": 6,
    "UsageCost": "Free",
    "AddressInfo": {
        "ID": 48846,
        "Title": "Tesco Head Office (Welwyn) - Private Site no public access",
        "AddressLine1": "Falcon Way",
        "AddressLine2": "Haldens",
        "Town": "Welwyn Garden City",
        "StateOrProvince": "Hertfordshire",
        "Postcode": "AL7 1AB",
        "CountryID": 1,
        "Latitude": 51.809,
        "Longitude": -0.197,
        "AccessComments": "This POD Point is sited at Tesco's Offices in Welwyn and available to those on site conducting business with Tesco (sorry but shopping at Tesco doesn't count)",
        "RelatedURL": "http://pod-point.com/",
        "DistanceUnit": 0
    },
    "Connections": [
        {
            "ID": 59955,
            "ConnectionTypeID": 3,
            "Reference": "0",
            "StatusTypeID": 50,
            "LevelID": 2,
            "Amps": 13,
            "Voltage": 230,
            "PowerKW": 3,
            "CurrentTypeID": 10,
            "Quantity": 2
        }
    ],
    "NumberOfPoints": 2,
    "StatusTypeID": 0,
    "DateLastStatusUpdate": "2019-05-01T05:32:00Z",
    "MetadataValues": [
        {
            "ID": 1507,
            "MetadataFieldID": 4,
            "ItemValue": "Contains public sector information licensed under the Open Government Licence v2.0. http://www.nationalarchives.gov.uk/doc/open-government-licence/version/2/"
        }
    ],
    "DataQualityLevel": 3,
    "DateCreated": "2015-06-27T07:22:00Z",
    "SubmissionStatusTypeID": 100
}