{
    "IsRecentlyVerified": false,
    "ID": 165661,
    "UUID": "FD3B80D0-6E49-42ED-9A11-79D1FE480762",
    "DataProviderID": 28,
    "DataProvidersReference": "FR*S47*PMB47*34",
    "OperatorID": 3407,
    "UsageTypeID": 5,
    "AddressInfo": {
        "ID": 166020,
        "Title": "PORT SAINTE MARIE - Parking Rue Pasteur",
        "AddressLine1": "Parking Rue Pasteur 47130 PORT SAINTE MARIE",
        "CountryID": 80,
        "Latitude": 44.2497222,
        "Longitude": 0.39916667,
        "AccessComments": "24h/24 7j/7",
        "DistanceUnit": 0
    },
    "Connections": [
        {
            "ID": 241579,
            "ConnectionTypeID": 25,
            "StatusTypeID": 50,
            "LevelID": 2,
            "PowerKW": 18,
            "CurrentTypeID": 20
        },
        {
            "ID": 241580,
            "ConnectionTypeID": 28,
            "StatusTypeID": 50,
            "LevelID": 2,
            "PowerKW": 18,
            "CurrentTypeID": 10
        },
        {
            "ID": 241581,
            "ConnectionTypeID": 25,
            "StatusTypeID": 50,
            "LevelID": 2,
            "PowerKW": 18,
            "CurrentTypeID": 20
        },
        {
            "ID": 241582,
            "ConnectionTypeID": 28,
            "StatusTypeID": 50,
            "LevelID": 2,
            "PowerKW": 18,
            "CurrentTypeID": 10
        }
    ],
    "GeneralComments": "Recharge par badge et avec une application smartphone",
    "StatusTypeID": 50,
    "DateLastStatusUpdate": "2020-08-27T05:11:00Z",
    "DataQualityLevel": 2,
    "DateCreated": "2020-08-27T05:11:00Z",
    "SubmissionStatusTypeID": 100
}