{
    "IsRecentlyVerified": false,
    "ID": 104146,
    "UUID": "2B525C06-671C-4695-8FA1-389F68262C5B",
    "DataProviderID": 1,
    "OperatorID": 214,
    "UsageTypeID": 4,
    "AddressInfo": {
        "ID": 104492,
        "Title": "Straßburger Straße",
        "AddressLine1": "Straßburger Straße 2",
        "AddressLine2": "Stadtteil Prenzlauer Berg",
        "Town": "Berlin",
        "StateOrProvince": "Berlin",
        "Postcode": "10405",
        "CountryID": 87,
        "Latitude": 52.52861,
        "Longitude": 13.41245989999993,
        "AccessComments": "24/7 open",
        "DistanceUnit": 0
    },
    "Connections": [
        {
            "ID": 147072,
            "ConnectionTypeID": 25,
            "StatusTypeID": 50,
            "LevelID": 2,
            "Amps": 16,
            "Voltage": 400,
            "PowerKW": 11,
            "CurrentTypeID": 20,
            "Quantity": 2
        }
    ],
    "NumberOfPoints": 2,
    "StatusTypeID": 50,
    "DateLastStatusUpdate": "2018-05-16T12:20:00Z",
    "DataQualityLevel": 1,
    "DateCreated": "2018-05-16T12:20:00Z",
    "SubmissionStatusTypeID": 200
}