{
    "IsRecentlyVerified": false,
    "ID": 36576,
    "UUID": "715F3DDA-9FD4-4FDC-B986-E0F7A4702D25",
    "DataProviderID": 26,
    "DataProvidersReference": "47382",
    "OperatorID": 178,
    "OperatorsReference": "EVnetNL AL540",
    "UsageCost": "0.00 jaarabonnement",
    "AddressInfo": {
        "ID": 36922,
        "Title": "Hofland",
        "AddressLine1": "Hofland",
        "Town": "Kaag en Braassem",
        "Postcode": "2371 AS",
        "CountryID": 159,
        "Latitude": 52.20249,
        "Longitude": 4.631,
        "ContactTelephone1": "0800-3522365",
        "RelatedURL": "http://www.evnet.nl",
        "DistanceUnit": 0
    },
    "Connections": [
        {
            "ID": 40087,
            "ConnectionTypeID": 25,
            "LevelID": 2,
            "PowerKW": 11,
            "CurrentTypeID": 10
        }
    ],
    "NumberOfPoints": 2,
    "StatusTypeID": 50,
    "DateLastStatusUpdate": "2016-06-04T02:51:00Z",
    "DataQualityLevel": 3,
    "DateCreated": "2015-01-09T06:05:00Z",
    "SubmissionStatusTypeID": 100
}