{
    "UserComments": [
        {
            "ID": 17599,
            "ChargePointID": 50344,
            "CommentTypeID": 10,
            "UserName": "craig_taylor99",
            "Comment": "Free charging\n",
            "Rating": 3,
            "DateCreated": "2017-08-18T22:13:14.65Z",
            "User": {
                "ID": 16017,
                "Username": "craig_taylor99"
            },
            "CheckinStatusTypeID": 10
        }
    ],
    "IsRecentlyVerified": false,
    "ID": 50344,
    "UUID": "C0C3A4D5-E693-4502-ACF4-C78813CF526C",
    "DataProviderID": 1,
    "DataProvidersReference": "GB100,GB105",
    "OperatorID": 203,
    "OperatorsReference": "10021,10022",
    "UsageTypeID": 5,
    "UsageCost": "£4.00",
    "AddressInfo": {
        "ID": 50690,
        "Title": "Princess Street Car Park",
        "AddressLine1": "Princess Street",
        "Town": "Congleton",
        "Postcode": "CW12 1DF",
        "CountryID": 1,
        "Latitude": 53.165011,
        "Longitude": -2.213048,
        "AccessComments": "Princess Street car park",
        "RelatedURL": "http://engenie.co.uk",
        "DistanceUnit": 0
    },
    "Connections": [
        {
            "ID": 62016,
            "ConnectionTypeID": 2,
            "Reference": "1",
            "StatusTypeID": 50,
            "LevelID": 3,
            "Amps": 125,
            "Voltage": 400,
            "PowerKW": 50,
            "CurrentTypeID": 30,
            "Quantity": 2
        },
        {
            "ID": 63239,
            "ConnectionTypeID": 33,
            "StatusTypeID": 50,
            "LevelID": 3,
            "Amps": 125,
            "Voltage": 400,
            "PowerKW": 50,
            "CurrentTypeID": 30,
            "Quantity": 2
        },
        {
            "ID": 63240,
            "ConnectionTypeID": 1036,
            "StatusTypeID": 50,
            "LevelID": 3,
            "Amps": 63,
            "Voltage": 400,
            "PowerKW": 43,
            "CurrentTypeID": 20,
            "Quantity": 2
        }
    ],
    "NumberOfPoints": 2,
    "GeneralComments": "Tariff due to change by May 2018",
    "StatusTypeID": 50,
    "DateLastStatusUpdate": "2018-03-19T18:43:00Z",
    "MetadataValues": [
        {
            "ID": 1708,
            "MetadataFieldID": 4,
            "ItemValue": "Contains public sector information licensed under the Open Government Licence v2.0. http://www.nationalarchives.gov.uk/doc/open-government-licence/version/2/"
        }
    ],
    "DataQualityLevel": 3,
    "DateCreated": "2015-07-22T08:34:00Z",
    "SubmissionStatusTypeID": 200
}