{
    "IsRecentlyVerified": false,
    "ID": 84990,
    "UUID": "6EF9C52F-D37B-4673-B770-25DFF6C7A5A1",
    "DataProviderID": 1,
    "OperatorID": 23,
    "OperatorsReference": "25849",
    "UsageTypeID": 4,
    "AddressInfo": {
        "ID": 85336,
        "Title": "Holiday Inn Express Mentor",
        "AddressLine1": "5785 Heisley RD",
        "Town": "Mentor",
        "StateOrProvince": "Ohio",
        "Postcode": "44060",
        "CountryID": 2,
        "Latitude": 41.713716,
        "Longitude": -81.299007,
        "ContactTelephone1": "(440) 357-0384",
        "DistanceUnit": 0
    },
    "Connections": [
        {
            "ID": 120739,
            "ConnectionTypeID": 30,
            "StatusTypeID": 50,
            "LevelID": 2,
            "PowerKW": 16,
            "CurrentTypeID": 20,
            "Quantity": 2
        }
    ],
    "NumberOfPoints": 2,
    "GeneralComments": "2 Tesla Connectors, up to 16kW.Available for customers. Please see front desk.",
    "StatusTypeID": 50,
    "DateLastStatusUpdate": "2017-03-23T06:28:00Z",
    "DataQualityLevel": 1,
    "DateCreated": "2017-03-23T06:28:00Z",
    "SubmissionStatusTypeID": 200
}