{
    "IsRecentlyVerified": false,
    "ID": 176457,
    "UUID": "64F7D147-FE9A-4A10-BC4B-B0DEA100B2CA",
    "DataProviderID": 29,
    "DataProvidersReference": "10673",
    "AddressInfo": {
        "ID": 176816,
        "Title": "Bahnhofstraße 27",
        "AddressLine1": "Bahnhofstraße 27",
        "Town": "Donauwörth",
        "Postcode": "86609",
        "CountryID": 87,
        "Latitude": 48.715132,
        "Longitude": 10.772296,
        "DistanceUnit": 0
    },
    "Connections": [
        {
            "ID": 274397,
            "ConnectionTypeID": 25,
            "StatusTypeID": 50,
            "LevelID": 2,
            "PowerKW": 11,
            "CurrentTypeID": 20
        },
        {
            "ID": 274398,
            "ConnectionTypeID": 25,
            "StatusTypeID": 50,
            "LevelID": 2,
            "PowerKW": 22,
            "CurrentTypeID": 20
        }
    ],
    "StatusTypeID": 0,
    "DateLastStatusUpdate": "2021-07-12T02:41:00Z",
    "MetadataValues": [
        {
            "ID": 8752,
            "MetadataFieldID": 4,
            "ItemValue": "Data from the German chargepoint registry provided by Bundesnetzagentur.de under the CC-BY 4.0 license"
        }
    ],
    "DataQualityLevel": 3,
    "DateCreated": "2021-07-08T09:48:00Z",
    "SubmissionStatusTypeID": 100
}