{
    "IsRecentlyVerified": false,
    "ID": 166718,
    "UUID": "6D61F1FB-2AB9-4D90-9AB0-2DED5D35D52C",
    "DataProviderID": 28,
    "DataProvidersReference": "FR*H02*P59392*005",
    "OperatorID": 3409,
    "UsageTypeID": 5,
    "AddressInfo": {
        "ID": 167077,
        "Title": "MAUBEUGE - Avenue de France",
        "AddressLine1": "Avenue de France 59600 MAUBEUGE",
        "CountryID": 80,
        "Latitude": 50.272541,
        "Longitude": 3.97243,
        "AccessComments": "24h/24 7j/7",
        "DistanceUnit": 0
    },
    "Connections": [
        {
            "ID": 251769,
            "ConnectionTypeID": 28,
            "StatusTypeID": 50,
            "LevelID": 2,
            "PowerKW": 22,
            "CurrentTypeID": 10
        },
        {
            "ID": 251770,
            "ConnectionTypeID": 1036,
            "StatusTypeID": 50,
            "LevelID": 2,
            "PowerKW": 22,
            "CurrentTypeID": 20
        },
        {
            "ID": 251771,
            "ConnectionTypeID": 28,
            "StatusTypeID": 50,
            "LevelID": 2,
            "PowerKW": 22,
            "CurrentTypeID": 10
        },
        {
            "ID": 251772,
            "ConnectionTypeID": 1036,
            "StatusTypeID": 50,
            "LevelID": 2,
            "PowerKW": 22,
            "CurrentTypeID": 20
        }
    ],
    "GeneralComments": "Recharge par badge et avec une application smartphone",
    "StatusTypeID": 50,
    "DateLastStatusUpdate": "2020-08-27T05:16:00Z",
    "DataQualityLevel": 2,
    "DateCreated": "2020-08-27T05:16:00Z",
    "SubmissionStatusTypeID": 100
}