{
    "IsRecentlyVerified": false,
    "ID": 51181,
    "UUID": "2E411131-2389-4B77-BCBF-3DBC8FF744C9",
    "DataProviderID": 1,
    "DataProvidersReference": "2864",
    "AddressInfo": {
        "ID": 51527,
        "Title": "Ruthensparre",
        "AddressLine1": "Östra Hamngatan 28",
        "Town": "KARLSKRONA",
        "StateOrProvince": "BLEKINGE",
        "Postcode": "37123",
        "CountryID": 216,
        "Latitude": 56.16292,
        "Longitude": 15.59616,
        "AccessComments": "Parkering utanför Karlskrona Kommuns entré",
        "DistanceUnit": 0
    },
    "Connections": [
        {
            "ID": 63343,
            "ConnectionTypeID": 0,
            "Reference": "1",
            "LevelID": 2,
            "Amps": 32,
            "Voltage": 400,
            "PowerKW": 22,
            "Comments": "Mode 3"
        }
    ],
    "NumberOfPoints": 1,
    "DateLastStatusUpdate": "2020-05-26T08:21:00Z",
    "DataQualityLevel": 2,
    "DateCreated": "2015-07-24T02:17:00Z",
    "SubmissionStatusTypeID": 100
}