{
    "IsRecentlyVerified": false,
    "ID": 100804,
    "UUID": "07D7A2B7-7BD7-4B1A-9697-172C5A59ADA6",
    "DataProviderID": 1,
    "OperatorID": 23,
    "OperatorsReference": "41237",
    "UsageTypeID": 4,
    "AddressInfo": {
        "ID": 101150,
        "Title": "The Georgia Sea Turtle Center",
        "AddressLine1": "214 Stable RD",
        "Town": "Jekyll Island",
        "StateOrProvince": "Georgia",
        "Postcode": "31527",
        "CountryID": 2,
        "Latitude": 31.0598463,
        "Longitude": -81.4197261,
        "ContactTelephone1": "(912) 635-4444",
        "DistanceUnit": 0
    },
    "Connections": [
        {
            "ID": 142384,
            "ConnectionTypeID": 30,
            "StatusTypeID": 50,
            "LevelID": 2,
            "PowerKW": 16,
            "CurrentTypeID": 20,
            "Quantity": 4
        }
    ],
    "NumberOfPoints": 4,
    "GeneralComments": "4 Tesla Connectors, up to 16kW.Available to the public. Self park.",
    "StatusTypeID": 50,
    "DateLastStatusUpdate": "2018-03-10T06:51:00Z",
    "DataQualityLevel": 1,
    "DateCreated": "2018-03-10T06:51:00Z",
    "SubmissionStatusTypeID": 200
}