{
    "IsRecentlyVerified": false,
    "ID": 177763,
    "UUID": "4DF97CFF-1E18-4485-A728-BDB23876491B",
    "DataProviderID": 29,
    "DataProvidersReference": "5332",
    "AddressInfo": {
        "ID": 178122,
        "Title": "Untertorstrasse 19",
        "AddressLine1": "Untertorstrasse 19",
        "Town": "Leinfelden-Echterdingen",
        "Postcode": "70771",
        "CountryID": 87,
        "Latitude": 48.6849650056872,
        "Longitude": 9.16839232320122,
        "DistanceUnit": 0
    },
    "Connections": [
        {
            "ID": 277313,
            "ConnectionTypeID": 25,
            "StatusTypeID": 50,
            "LevelID": 2,
            "PowerKW": 11,
            "CurrentTypeID": 20
        },
        {
            "ID": 277314,
            "ConnectionTypeID": 25,
            "StatusTypeID": 50,
            "LevelID": 2,
            "PowerKW": 22,
            "CurrentTypeID": 20
        }
    ],
    "StatusTypeID": 0,
    "DateLastStatusUpdate": "2021-07-12T02:41:00Z",
    "MetadataValues": [
        {
            "ID": 10057,
            "MetadataFieldID": 4,
            "ItemValue": "Data from the German chargepoint registry provided by Bundesnetzagentur.de under the CC-BY 4.0 license"
        }
    ],
    "DataQualityLevel": 3,
    "DateCreated": "2021-07-08T09:49:00Z",
    "SubmissionStatusTypeID": 100
}