{
    "IsRecentlyVerified": false,
    "ID": 47578,
    "UUID": "E726DBB0-9330-4B8A-A63B-A1E410402C4B",
    "DataProviderID": 1,
    "DataProvidersReference": "2794",
    "AddressInfo": {
        "ID": 47924,
        "Title": "Enskedehallen",
        "AddressLine1": "Simlångsvägen ",
        "Town": "JOHANNESHOV",
        "StateOrProvince": "STOCKHOLM",
        "Postcode": "12143",
        "CountryID": 216,
        "Latitude": 59.29986,
        "Longitude": 18.07851,
        "AccessComments": "Parkeringsplatser mot byggnad Enskedehallen.",
        "DistanceUnit": 0
    },
    "Connections": [
        {
            "ID": 58658,
            "ConnectionTypeID": 0,
            "Reference": "1",
            "LevelID": 2,
            "Amps": 16,
            "Voltage": 230,
            "PowerKW": 3.7,
            "Comments": "Mode 3"
        },
        {
            "ID": 84512,
            "ConnectionTypeID": 0,
            "Reference": "2",
            "LevelID": 2,
            "Amps": 16,
            "Voltage": 230,
            "PowerKW": 3.7,
            "Comments": "Mode 3"
        },
        {
            "ID": 84513,
            "ConnectionTypeID": 0,
            "Reference": "3",
            "LevelID": 2,
            "Amps": 16,
            "Voltage": 230,
            "PowerKW": 3.7,
            "Comments": "Mode 3"
        },
        {
            "ID": 88186,
            "ConnectionTypeID": 0,
            "Reference": "4",
            "LevelID": 2,
            "Amps": 16,
            "Voltage": 230,
            "PowerKW": 3.7,
            "Comments": "Mode 3"
        }
    ],
    "NumberOfPoints": 4,
    "DateLastStatusUpdate": "2020-05-26T08:22:00Z",
    "DataQualityLevel": 2,
    "DateCreated": "2015-06-01T10:34:00Z",
    "SubmissionStatusTypeID": 100
}