{
    "IsRecentlyVerified": false,
    "ID": 57380,
    "UUID": "BF2B0EF5-29FC-4B8C-ACC3-31B6FFA3EF8B",
    "DataProviderID": 2,
    "DataProvidersReference": "70531",
    "UsageTypeID": 1,
    "AddressInfo": {
        "ID": 57726,
        "Title": "Highland Park Market",
        "AddressLine1": "317 Highland St",
        "Town": "Manchester",
        "StateOrProvince": "CT",
        "Postcode": "06040",
        "CountryID": 2,
        "Latitude": 41.766005,
        "Longitude": -72.490259,
        "ContactTelephone1": "860-646-4277",
        "AccessComments": "24 hours daily",
        "RelatedURL": "",
        "DistanceUnit": 0
    },
    "Connections": [
        {
            "ID": 72486,
            "ConnectionTypeID": 1,
            "LevelID": 2,
            "Amps": 16,
            "Voltage": 230,
            "PowerKW": 3.7,
            "CurrentTypeID": 10,
            "Quantity": 2
        }
    ],
    "DateLastStatusUpdate": "2020-06-26T03:05:00Z",
    "DataQualityLevel": 3,
    "DateCreated": "2015-11-30T11:50:00Z",
    "SubmissionStatusTypeID": 100
}