{
    "IsRecentlyVerified": false,
    "ID": 153571,
    "UUID": "AF868234-BE1F-45B3-B8E2-D411618AB578",
    "DataProviderID": 28,
    "DataProvidersReference": "FR*S53*P53096*002",
    "UsageTypeID": 5,
    "AddressInfo": {
        "ID": 153924,
        "Title": "ERNEE - Place De L'Hôtel De Ville",
        "AddressLine1": "Place De L'Hôtel De Ville 53500 ERNEE",
        "CountryID": 80,
        "Latitude": 48.296963,
        "Longitude": -0.93954,
        "AccessComments": "24h/24 7j/7",
        "DistanceUnit": 0
    },
    "Connections": [
        {
            "ID": 215523,
            "ConnectionTypeID": 28,
            "StatusTypeID": 50,
            "LevelID": 2,
            "PowerKW": 4,
            "CurrentTypeID": 10
        },
        {
            "ID": 249039,
            "ConnectionTypeID": 33,
            "StatusTypeID": 50,
            "LevelID": 3,
            "PowerKW": 50,
            "CurrentTypeID": 30
        },
        {
            "ID": 249040,
            "ConnectionTypeID": 1036,
            "StatusTypeID": 50,
            "LevelID": 3,
            "PowerKW": 43,
            "CurrentTypeID": 20
        },
        {
            "ID": 249041,
            "ConnectionTypeID": 28,
            "StatusTypeID": 50,
            "LevelID": 2,
            "PowerKW": 4,
            "CurrentTypeID": 10
        }
    ],
    "GeneralComments": "Recharge par badge et avec une application smartphone",
    "StatusTypeID": 50,
    "DateLastStatusUpdate": "2020-08-27T05:14:00Z",
    "DataQualityLevel": 2,
    "DateCreated": "2020-03-15T10:54:00Z",
    "SubmissionStatusTypeID": 100
}