{
    "IsRecentlyVerified": false,
    "ID": 84166,
    "UUID": "31469F90-29EA-4BC1-ADA3-C780CFCC663E",
    "DataProviderID": 1,
    "OperatorID": 23,
    "OperatorsReference": "24355",
    "UsageTypeID": 4,
    "AddressInfo": {
        "ID": 84512,
        "Title": "Wild Mountain Ski & Snow Board Area",
        "AddressLine1": "37200 Wild Mountain RD",
        "Town": "Taylors Falls",
        "StateOrProvince": "Minnesota",
        "Postcode": "55084",
        "CountryID": 2,
        "Latitude": 45.488811,
        "Longitude": -92.705093,
        "ContactTelephone1": "(651) 465-6365",
        "DistanceUnit": 0
    },
    "Connections": [
        {
            "ID": 119567,
            "ConnectionTypeID": 30,
            "StatusTypeID": 50,
            "LevelID": 2,
            "PowerKW": 16,
            "CurrentTypeID": 20,
            "Quantity": 2
        }
    ],
    "NumberOfPoints": 2,
    "GeneralComments": "2 Tesla Connectors, up to 16kW.Available to the public. Self park.",
    "StatusTypeID": 50,
    "DateLastStatusUpdate": "2017-02-16T17:05:00Z",
    "DataQualityLevel": 1,
    "DateCreated": "2017-02-16T17:05:00Z",
    "SubmissionStatusTypeID": 200
}