{
    "IsRecentlyVerified": false,
    "ID": 160622,
    "UUID": "F1DDC3F3-6844-4799-877A-5233B6869E7F",
    "DataProviderID": 2,
    "DataProvidersReference": "157713",
    "UsageTypeID": 2,
    "AddressInfo": {
        "ID": 160979,
        "Title": "2587265 Ontario Inc",
        "AddressLine1": "535 Moneta Ave",
        "Town": "Timmins",
        "StateOrProvince": "ON",
        "Postcode": "P4N 2N9",
        "CountryID": 44,
        "Latitude": 48.47,
        "Longitude": -81.32,
        "ContactTelephone1": "",
        "AccessComments": "",
        "RelatedURL": "",
        "DistanceUnit": 0
    },
    "Connections": [
        {
            "ID": 231114,
            "ConnectionTypeID": 2,
            "LevelID": 3,
            "Amps": 100,
            "Voltage": 400,
            "PowerKW": 40,
            "CurrentTypeID": 30,
            "Quantity": 1
        },
        {
            "ID": 231115,
            "ConnectionTypeID": 32,
            "LevelID": 3,
            "Amps": 100,
            "Voltage": 400,
            "PowerKW": 40,
            "CurrentTypeID": 30,
            "Quantity": 1
        }
    ],
    "GeneralComments": "Planned for future date. Not Operational.",
    "DatePlanned": "2020-09-01T00:00:00Z",
    "StatusTypeID": 150,
    "DateLastStatusUpdate": "2020-06-26T03:11:00Z",
    "DataQualityLevel": 3,
    "DateCreated": "2020-06-26T03:11:00Z",
    "SubmissionStatusTypeID": 100
}