{
    "IsRecentlyVerified": false,
    "ID": 37505,
    "UUID": "F9976B46-BD16-49B9-8772-02EE59AEA573",
    "DataProviderID": 26,
    "DataProvidersReference": "20526",
    "OperatorsReference": "Wellnessresort de Zwaluwhoeve",
    "UsageCost": "0.00 gratis",
    "AddressInfo": {
        "ID": 37851,
        "Title": "Zuiderzeestraatweg 108",
        "AddressLine1": "Zuiderzeestraatweg 108",
        "Town": "Harderwijk",
        "Postcode": "3849 AJ",
        "CountryID": 159,
        "Latitude": 52.355435983145,
        "Longitude": 5.6755264920655,
        "RelatedURL": "http://www.zwaluwhoeve.nl",
        "DistanceUnit": 0
    },
    "Connections": [
        {
            "ID": 41016,
            "ConnectionTypeID": 25,
            "LevelID": 2,
            "PowerKW": 11,
            "CurrentTypeID": 10
        }
    ],
    "NumberOfPoints": 2,
    "StatusTypeID": 50,
    "DateLastStatusUpdate": "2016-06-04T02:53:00Z",
    "DataQualityLevel": 3,
    "DateCreated": "2015-01-09T06:07:00Z",
    "SubmissionStatusTypeID": 100
}