{
    "IsRecentlyVerified": false,
    "ID": 132347,
    "UUID": "27F11AC6-16B2-46FE-AB06-F0E7FE943BC8",
    "DataProviderID": 1,
    "OperatorID": 45,
    "UsageTypeID": 1,
    "AddressInfo": {
        "ID": 132693,
        "Title": "Great Western Tiers Visitor Centre",
        "AddressLine1": "98 Emu Bay Rd",
        "Town": "Deloraine",
        "StateOrProvince": "Tasmania",
        "Postcode": "7304",
        "CountryID": 18,
        "Latitude": -41.5235226403948,
        "Longitude": 146.651256368762,
        "RelatedURL": "http://www.greatwesterntiers.net.au/",
        "DistanceUnit": 0
    },
    "Connections": [
        {
            "ID": 185234,
            "ConnectionTypeID": 25,
            "StatusTypeID": 50,
            "LevelID": 2,
            "PowerKW": 22,
            "CurrentTypeID": 20,
            "Quantity": 1
        }
    ],
    "NumberOfPoints": 1,
    "StatusTypeID": 50,
    "DateLastStatusUpdate": "2019-09-27T07:30:00Z",
    "DataQualityLevel": 1,
    "DateCreated": "2019-09-27T06:37:00Z",
    "SubmissionStatusTypeID": 200
}