{
    "IsRecentlyVerified": false,
    "ID": 37172,
    "UUID": "84BC3C78-1033-4AB1-85A9-ECEC557A5B6D",
    "DataProviderID": 26,
    "DataProvidersReference": "25992",
    "OperatorID": 78,
    "OperatorsReference": "Essent EM-NL-00000363-07-00003",
    "UsageCost": "0.00 jaarabonnement",
    "AddressInfo": {
        "ID": 37518,
        "Title": "Bijlmerdreef",
        "AddressLine1": "Bijlmerdreef",
        "Town": "Amsterdam Zuidoost",
        "Postcode": "1103 JZ",
        "CountryID": 159,
        "Latitude": 52.322663,
        "Longitude": 4.973384,
        "RelatedURL": "http://www.essent.nl",
        "DistanceUnit": 0
    },
    "Connections": [
        {
            "ID": 40683,
            "ConnectionTypeID": 25,
            "LevelID": 2,
            "PowerKW": 11,
            "CurrentTypeID": 10
        },
        {
            "ID": 48705,
            "ConnectionTypeID": 25,
            "LevelID": 2,
            "PowerKW": 11,
            "CurrentTypeID": 10
        }
    ],
    "NumberOfPoints": 1,
    "StatusTypeID": 50,
    "DateLastStatusUpdate": "2016-06-04T02:53:00Z",
    "DataQualityLevel": 3,
    "DateCreated": "2015-01-09T06:07:00Z",
    "SubmissionStatusTypeID": 100
}