{
    "IsRecentlyVerified": false,
    "ID": 142349,
    "UUID": "9F4BDCC4-03D7-4683-AC23-D821C5CBD640",
    "DataProviderID": 2,
    "DataProvidersReference": "143205",
    "OperatorID": 5,
    "UsageTypeID": 1,
    "AddressInfo": {
        "ID": 142701,
        "Title": "HANNUM'S H-D",
        "AddressLine1": "12 W Milton Ave",
        "Town": "Rahway",
        "StateOrProvince": "NJ",
        "Postcode": "07065",
        "CountryID": 2,
        "Latitude": 40.6056698,
        "Longitude": -74.2781772,
        "ContactTelephone1": "888-758-4389",
        "AccessComments": "24 hours daily",
        "RelatedURL": "http://www.chargepoint.com/",
        "DistanceUnit": 0
    },
    "Connections": [
        {
            "ID": 198470,
            "ConnectionTypeID": 32,
            "LevelID": 3,
            "Amps": 100,
            "Voltage": 400,
            "PowerKW": 40,
            "CurrentTypeID": 30,
            "Quantity": 1
        }
    ],
    "StatusTypeID": 50,
    "DateLastStatusUpdate": "2020-06-26T03:03:00Z",
    "DataQualityLevel": 3,
    "DateCreated": "2019-12-24T09:17:00Z",
    "SubmissionStatusTypeID": 100
}