{
    "IsRecentlyVerified": false,
    "ID": 102498,
    "UUID": "A18607F1-7217-40C2-A5BD-F9B550D6ACA8",
    "DataProviderID": 2,
    "DataProvidersReference": "94771",
    "UsageTypeID": 1,
    "AddressInfo": {
        "ID": 102844,
        "Title": "Ontario Convention Center",
        "AddressLine1": "2000 E Convention Center Way",
        "Town": "Ontario",
        "StateOrProvince": "CA",
        "Postcode": "91764",
        "CountryID": 2,
        "Latitude": 34.06525,
        "Longitude": -117.606877,
        "ContactTelephone1": "866-816-7584",
        "AccessComments": "Center business hours",
        "RelatedURL": "http://evconnect.com/",
        "DistanceUnit": 0
    },
    "Connections": [
        {
            "ID": 144580,
            "ConnectionTypeID": 1,
            "LevelID": 2,
            "Amps": 16,
            "Voltage": 230,
            "PowerKW": 3,
            "CurrentTypeID": 10,
            "Quantity": 5
        }
    ],
    "DateLastStatusUpdate": "2019-04-06T04:01:00Z",
    "DataQualityLevel": 3,
    "DateCreated": "2018-04-21T04:13:00Z",
    "SubmissionStatusTypeID": 100
}