{
    "IsRecentlyVerified": false,
    "ID": 113298,
    "UUID": "5E41468B-C231-4B4A-ACA0-E5BD483EFC0A",
    "DataProviderID": 1,
    "OperatorID": 80,
    "UsageTypeID": 4,
    "AddressInfo": {
        "ID": 113644,
        "Title": "Civita Arberia | EnelX",
        "AddressLine1": "Viale Arberia",
        "Town": "Civita",
        "StateOrProvince": "CS",
        "Postcode": "87010 ",
        "CountryID": 112,
        "Latitude": 39.8264327276744,
        "Longitude": 16.3152486127214,
        "ContactTelephone1": "800.069.850",
        "RelatedURL": "https://www.enelx.com/it/it/emobility",
        "DistanceUnit": 0
    },
    "Connections": [
        {
            "ID": 159518,
            "ConnectionTypeID": 25,
            "StatusTypeID": 50,
            "LevelID": 2,
            "Amps": 32,
            "Voltage": 400,
            "PowerKW": 22,
            "CurrentTypeID": 20,
            "Quantity": 1
        },
        {
            "ID": 159519,
            "ConnectionTypeID": 36,
            "StatusTypeID": 50,
            "LevelID": 2,
            "Amps": 16,
            "Voltage": 240,
            "PowerKW": 3.7,
            "CurrentTypeID": 10,
            "Quantity": 1
        }
    ],
    "NumberOfPoints": 2,
    "StatusTypeID": 50,
    "DateLastStatusUpdate": "2019-09-09T09:54:00Z",
    "DataQualityLevel": 1,
    "DateCreated": "2018-11-29T15:17:00Z",
    "SubmissionStatusTypeID": 200
}