{
    "IsRecentlyVerified": false,
    "ID": 45276,
    "UUID": "E5BB09CA-921E-4FDC-AC93-81A1660DE21B",
    "DataProviderID": 1,
    "OperatorID": 45,
    "UsageTypeID": 6,
    "AddressInfo": {
        "ID": 45622,
        "Title": "Kloster Marienhöh - Hideaway & Spa",
        "AddressLine1": "Marienhöh 2-10",
        "Town": "Langweiler",
        "StateOrProvince": "Herrstein",
        "Postcode": "55758",
        "CountryID": 87,
        "Latitude": 49.78321,
        "Longitude": 7.18515000000002,
        "ContactTelephone1": "+49 6786 292990",
        "ContactEmail": "info@www.hideawaykloster.de",
        "AccessComments": "Kabel wird im Hof bereit gestellt. CEE 16A Stecker. Um Voranmeldung wird gebeten.",
        "RelatedURL": "http://www.hideawaykloster.de/",
        "DistanceUnit": 0
    },
    "Connections": [
        {
            "ID": 55811,
            "ConnectionTypeID": 17,
            "StatusTypeID": 50,
            "LevelID": 2,
            "Amps": 16,
            "Voltage": 400,
            "PowerKW": 11,
            "CurrentTypeID": 20,
            "Quantity": 1
        }
    ],
    "NumberOfPoints": 1,
    "StatusTypeID": 50,
    "DateLastStatusUpdate": "2015-04-29T14:04:00Z",
    "DataQualityLevel": 1,
    "DateCreated": "2015-04-29T12:37:00Z",
    "SubmissionStatusTypeID": 200
}