{
    "IsRecentlyVerified": false,
    "ID": 88842,
    "UUID": "39BA7442-A113-4E83-B496-266CD2F236C7",
    "DataProviderID": 1,
    "OperatorID": 23,
    "OperatorsReference": "30382",
    "UsageTypeID": 6,
    "AddressInfo": {
        "ID": 89188,
        "Title": "Urban Chestnut Brewing Company",
        "AddressLine1": "3229 Washington Ave",
        "Town": "St. Louis",
        "StateOrProvince": "Missouri",
        "Postcode": "63103",
        "CountryID": 2,
        "Latitude": 38.637906,
        "Longitude": -90.2258,
        "ContactTelephone1": "(314) 222-0143",
        "DistanceUnit": 0
    },
    "Connections": [
        {
            "ID": 126090,
            "ConnectionTypeID": 30,
            "StatusTypeID": 0,
            "LevelID": 2,
            "PowerKW": 8,
            "CurrentTypeID": 10,
            "Quantity": 2
        }
    ],
    "NumberOfPoints": 2,
    "GeneralComments": "2 Tesla Connectors, up to 8kW.Available for patrons only. Please see front desk.",
    "StatusTypeID": 0,
    "DateLastStatusUpdate": "2018-05-11T05:31:00Z",
    "DataQualityLevel": 1,
    "DateCreated": "2017-06-09T14:37:00Z",
    "SubmissionStatusTypeID": 200
}