{
    "IsRecentlyVerified": false,
    "ID": 181343,
    "UUID": "3D61D866-426A-46BF-BD5D-812C4D394B2C",
    "DataProviderID": 29,
    "DataProvidersReference": "11683",
    "OperatorID": 105,
    "AddressInfo": {
        "ID": 181702,
        "Title": "Friedrich-Ebert-Str. 60",
        "AddressLine1": "Friedrich-Ebert-Str. 60",
        "Town": "Essen",
        "Postcode": "45127",
        "CountryID": 87,
        "Latitude": 51.460196,
        "Longitude": 7.008922,
        "DistanceUnit": 0
    },
    "Connections": [
        {
            "ID": 285539,
            "ConnectionTypeID": 25,
            "StatusTypeID": 50,
            "LevelID": 2,
            "PowerKW": 22,
            "CurrentTypeID": 20
        },
        {
            "ID": 285540,
            "ConnectionTypeID": 25,
            "StatusTypeID": 50,
            "LevelID": 2,
            "PowerKW": 22,
            "CurrentTypeID": 20
        }
    ],
    "StatusTypeID": 50,
    "DateLastStatusUpdate": "2021-07-12T02:47:00Z",
    "MetadataValues": [
        {
            "ID": 13637,
            "MetadataFieldID": 4,
            "ItemValue": "Data from the German chargepoint registry provided by Bundesnetzagentur.de under the CC-BY 4.0 license"
        }
    ],
    "DataQualityLevel": 3,
    "DateCreated": "2021-07-08T10:01:00Z",
    "SubmissionStatusTypeID": 100
}