{
    "IsRecentlyVerified": false,
    "ID": 165171,
    "UUID": "DDA5F3CC-8BDB-4556-BFFB-B07C689758BB",
    "DataProviderID": 1,
    "DataProvidersReference": "TR-ANT-008",
    "OperatorID": 70,
    "UsageTypeID": 1,
    "AddressInfo": {
        "ID": 165530,
        "Title": "Eşarj - Erasta AVM, Antalya",
        "AddressLine1": "Fabrikalar, Dumlupınar Blv. No:49, Kepez",
        "Town": "Antalya",
        "StateOrProvince": "Antalya",
        "Postcode": "7090",
        "CountryID": 229,
        "Latitude": 36.907186,
        "Longitude": 30.665064,
        "ContactTelephone1": "+90 (850) 433 72 75",
        "ContactEmail": "destek@esarj.com",
        "RelatedURL": "https://esarj.com/en/map?s=TR-ANT-008",
        "DistanceUnit": 0
    },
    "Connections": [
        {
            "ID": 236807,
            "ConnectionTypeID": 25,
            "LevelID": 2,
            "Amps": 32,
            "Voltage": 380,
            "PowerKW": 22,
            "Quantity": 1
        },
        {
            "ID": 236808,
            "ConnectionTypeID": 25,
            "LevelID": 2,
            "Amps": 125,
            "Voltage": 500,
            "PowerKW": 45,
            "Quantity": 1
        },
        {
            "ID": 236809,
            "ConnectionTypeID": 25,
            "LevelID": 2,
            "Amps": 120,
            "Voltage": 500,
            "PowerKW": 45,
            "Quantity": 1
        }
    ],
    "GeneralComments": "Eşarj Charging Systems",
    "StatusTypeID": 50,
    "DateLastStatusUpdate": "2020-08-26T08:19:00Z",
    "DataQualityLevel": 3,
    "DateCreated": "2020-08-26T08:19:00Z",
    "SubmissionStatusTypeID": 200
}