{
    "IsRecentlyVerified": false,
    "ID": 36677,
    "UUID": "907187F4-26B9-4280-9909-A240ABAC52F6",
    "DataProviderID": 26,
    "DataProvidersReference": "47016",
    "OperatorID": 178,
    "OperatorsReference": "EVnetNL AL153",
    "UsageCost": "0.00 jaarabonnement",
    "AddressInfo": {
        "ID": 37023,
        "Title": "Stationsplein",
        "AddressLine1": "Stationsplein",
        "Town": "Enschede",
        "Postcode": "7511 JA",
        "CountryID": 159,
        "Latitude": 52.222613,
        "Longitude": 6.892248,
        "ContactTelephone1": "0800-3522365",
        "RelatedURL": "http://www.evnet.nl",
        "DistanceUnit": 0
    },
    "Connections": [
        {
            "ID": 40188,
            "ConnectionTypeID": 25,
            "LevelID": 2,
            "PowerKW": 11,
            "CurrentTypeID": 10
        }
    ],
    "NumberOfPoints": 1,
    "StatusTypeID": 50,
    "DateLastStatusUpdate": "2016-06-04T02:52:00Z",
    "DataQualityLevel": 3,
    "DateCreated": "2015-01-09T06:07:00Z",
    "SubmissionStatusTypeID": 100
}