{
    "IsRecentlyVerified": false,
    "ID": 75933,
    "UUID": "04D9879D-7A39-4E93-9540-FA1A63DA7F5A",
    "DataProviderID": 1,
    "DataProvidersReference": "3718",
    "AddressInfo": {
        "ID": 76279,
        "Title": "IKEA Vantaa",
        "AddressLine1": "Porttisuontie 18",
        "Town": "Hakunila",
        "StateOrProvince": "Uusimaa",
        "Postcode": "01200",
        "CountryID": 79,
        "Latitude": 60.27675,
        "Longitude": 25.08482,
        "AccessComments": "IKEA Vantaan parkkialue",
        "DistanceUnit": 0
    },
    "Connections": [
        {
            "ID": 109538,
            "ConnectionTypeID": 0,
            "Reference": "1",
            "LevelID": 2,
            "Amps": 16,
            "Voltage": 230,
            "PowerKW": 3.7,
            "Comments": "Mode 3"
        },
        {
            "ID": 109539,
            "ConnectionTypeID": 0,
            "Reference": "2",
            "LevelID": 2,
            "Amps": 16,
            "Voltage": 230,
            "PowerKW": 3.7,
            "Comments": "Mode 3"
        }
    ],
    "NumberOfPoints": 2,
    "DateLastStatusUpdate": "2020-05-26T08:24:00Z",
    "DataQualityLevel": 2,
    "DateCreated": "2016-12-23T04:08:00Z",
    "SubmissionStatusTypeID": 100
}