{
    "MediaItems": [
        {
            "ID": 16353,
            "ChargePointID": 107988,
            "ItemURL": "https://s3-ap-southeast-2.amazonaws.com/openchargemap/images/IT/OCM107988/OCM-107988.orig.2018082404011424.jpg",
            "ItemThumbnailURL": "https://s3-ap-southeast-2.amazonaws.com/openchargemap/images/IT/OCM107988/OCM-107988.thmb.2018082404011424.jpg",
            "Comment": "panorama fiew",
            "IsEnabled": true,
            "IsVideo": false,
            "IsFeaturedItem": false,
            "IsExternalResource": false,
            "User": {
                "ID": 18870,
                "Username": "ECOGY"
            },
            "DateCreated": "2018-08-24T04:01:00Z"
        }
    ],
    "IsRecentlyVerified": false,
    "ID": 107988,
    "UUID": "699FCDCE-C4B9-499E-B0FB-E888359BCB4D",
    "DataProviderID": 1,
    "OperatorID": 45,
    "UsageTypeID": 6,
    "UsageCost": "0,25 €/kWh",
    "AddressInfo": {
        "ID": 108334,
        "Title": "Hotel Bauhof",
        "AddressLine1": "Mareinerstr. 1",
        "Town": "Kastelbell - Castelbello",
        "StateOrProvince": "BZ",
        "Postcode": "39020",
        "CountryID": 112,
        "Latitude": 46.6270898826274,
        "Longitude": 10.9005039307688,
        "ContactTelephone1": "+39 0473 624145",
        "ContactEmail": "info@hotel-bauhof.com",
        "AccessComments": "for hotel guests - für Hotelgäste - per ospiti dell'Hotel",
        "RelatedURL": "http://www.hotel-bauhof.com",
        "DistanceUnit": 0
    },
    "Connections": [
        {
            "ID": 152524,
            "ConnectionTypeID": 25,
            "StatusTypeID": 50,
            "LevelID": 2,
            "Amps": 16,
            "Voltage": 400,
            "PowerKW": 11,
            "CurrentTypeID": 20,
            "Quantity": 1
        }
    ],
    "NumberOfPoints": 1,
    "GeneralComments": "Wallbe / ECOGY",
    "StatusTypeID": 50,
    "DateLastStatusUpdate": "2018-08-24T18:31:00Z",
    "DataQualityLevel": 1,
    "DateCreated": "2018-08-24T04:00:00Z",
    "SubmissionStatusTypeID": 200
}