{
    "IsRecentlyVerified": false,
    "ID": 96896,
    "UUID": "0807203E-A0A5-4AFC-9E02-0134F0FD7AF3",
    "DataProviderID": 1,
    "OperatorID": 3297,
    "UsageTypeID": 4,
    "AddressInfo": {
        "ID": 97242,
        "Title": "Nieder-Ramstädter Straße",
        "AddressLine1": "Nieder-Ramstädter Straße 170b",
        "Town": "Darmstadt",
        "StateOrProvince": "Landkreis Darmstadt-Dieburg",
        "Postcode": "64372",
        "CountryID": 87,
        "Latitude": 49.8305223,
        "Longitude": 8.745499399999972,
        "DistanceUnit": 0
    },
    "Connections": [
        {
            "ID": 137254,
            "ConnectionTypeID": 25,
            "StatusTypeID": 50,
            "LevelID": 2,
            "Amps": 32,
            "Voltage": 400,
            "PowerKW": 22,
            "CurrentTypeID": 20,
            "Quantity": 2
        }
    ],
    "NumberOfPoints": 2,
    "GeneralComments": "24/7 nutzbar. Freischaltung mit jeder Ladekarte der Entega (Verbund LastMileSolutions), z.B. New Motion oder PlugSurfing.",
    "StatusTypeID": 50,
    "DateLastStatusUpdate": "2018-01-02T13:02:00Z",
    "DataQualityLevel": 1,
    "DateCreated": "2018-01-02T13:02:00Z",
    "SubmissionStatusTypeID": 200
}