{
    "IsRecentlyVerified": false,
    "ID": 66861,
    "UUID": "008E5ECB-926E-4E36-8CDD-BDEB83551B54",
    "DataProviderID": 1,
    "OperatorID": 23,
    "OperatorsReference": "10716",
    "UsageTypeID": 1,
    "UsageCost": "Free",
    "AddressInfo": {
        "ID": 67207,
        "Title": "Hampton Inn - Tesla",
        "AddressLine1": "2 Via De Luna Dr",
        "Town": "Pensacola Beach",
        "StateOrProvince": "FL",
        "Postcode": "32561",
        "CountryID": 2,
        "Latitude": 30.3322428,
        "Longitude": -87.1384337,
        "ContactTelephone1": "850-932-6800  877-798-3752",
        "AccessComments": "24 hours daily; for Tesla use only; for guest use only; see front desk for access",
        "RelatedURL": "http://www.teslamotors.com/supercharger",
        "DistanceUnit": 0
    },
    "Connections": [
        {
            "ID": 92349,
            "ConnectionTypeID": 30,
            "StatusTypeID": 50,
            "LevelID": 2,
            "Amps": 16,
            "Voltage": 230,
            "PowerKW": 16,
            "CurrentTypeID": 10,
            "Quantity": 1
        }
    ],
    "NumberOfPoints": 1,
    "StatusTypeID": 50,
    "DateLastStatusUpdate": "2017-01-26T03:40:00Z",
    "DataQualityLevel": 3,
    "DateCreated": "2016-05-29T02:04:00Z",
    "SubmissionStatusTypeID": 100
}