{
    "IsRecentlyVerified": false,
    "ID": 73381,
    "UUID": "08CC5A8F-D8EF-4A0B-954A-3FFD886E8B16",
    "DataProviderID": 1,
    "OperatorID": 45,
    "UsageTypeID": 1,
    "AddressInfo": {
        "ID": 73727,
        "Title": "E-Bike Station Kloster Scheyern",
        "AddressLine1": "Schyrenplatz 1",
        "Town": "Scheyern",
        "StateOrProvince": "Landkreis Pfaffenhofen an der Ilm",
        "Postcode": "85298",
        "CountryID": 87,
        "Latitude": 48.50113909518465,
        "Longitude": 11.451633039672839,
        "ContactTelephone1": "+49 8441 75220 Pater Wirth",
        "AccessComments": "5 Lademöglichkeiten an Steckdosenleiste. Öffnungszeiten des Klosterladens Mo 13-18Uhr, Di-So 9-12,13-18Uhr.",
        "RelatedURL": "http://www.stromtreter.de/verkehr/kloster_scheyern-7962/",
        "DistanceUnit": 0
    },
    "Connections": [
        {
            "ID": 105581,
            "ConnectionTypeID": 28,
            "StatusTypeID": 50,
            "LevelID": 1,
            "Amps": 10,
            "Voltage": 230,
            "PowerKW": 2.3,
            "CurrentTypeID": 10,
            "Quantity": 5
        }
    ],
    "NumberOfPoints": 5,
    "StatusTypeID": 50,
    "DateLastStatusUpdate": "2016-11-21T14:17:00Z",
    "DataQualityLevel": 1,
    "DateCreated": "2016-11-21T14:17:00Z",
    "SubmissionStatusTypeID": 200
}