{
    "UserComments": [
        {
            "ID": 14334,
            "ChargePointID": 31336,
            "CommentTypeID": 10,
            "UserName": "Simon Hewison",
            "Comment": "CHAdeMO charged okay ",
            "Rating": 4,
            "DateCreated": "2016-09-30T11:12:47.47Z",
            "User": {
                "ID": 4575,
                "Username": "Simon Hewison"
            },
            "CheckinStatusTypeID": 10
        },
        {
            "ID": 7969,
            "ChargePointID": 31336,
            "CommentTypeID": 50,
            "UserName": "Paul Bedworth",
            "Comment": "cHademo working only on one unit, the other in error",
            "Rating": 4,
            "DateCreated": "2015-11-10T17:08:27.233Z",
            "User": {
                "ID": 6335,
                "Username": "Paul Bedworth"
            },
            "CheckinStatusTypeID": 10
        },
        {
            "ID": 6610,
            "ChargePointID": 31336,
            "CommentTypeID": 10,
            "UserName": "Simon Hewison",
            "Comment": "Chademo charged ok. CYC card.  AC looks good on both units. Chademo and CCS down on triple head unit due to card in error. ",
            "DateCreated": "2015-09-27T22:34:07.94Z",
            "User": {
                "ID": 4575,
                "Username": "Simon Hewison"
            },
            "CheckinStatusTypeID": 10
        },
        {
            "ID": 6281,
            "ChargePointID": 31336,
            "CommentTypeID": 50,
            "UserName": "markdl1969",
            "Comment": "One unit was turned off, the other wasn't working and continued to say card not recognized. ",
            "Rating": 1,
            "DateCreated": "2015-08-23T18:07:37.383Z",
            "User": {
                "ID": 4634,
                "Username": "markdl1969"
            },
            "CheckinStatusTypeID": 20
        },
        {
            "ID": 6044,
            "ChargePointID": 31336,
            "CommentTypeID": 10,
            "UserName": "Simon Hewison",
            "Comment": "Chademo/ac unit working. Triple-headed unit no power",
            "DateCreated": "2015-07-27T21:16:36.277Z",
            "User": {
                "ID": 4575,
                "Username": "Simon Hewison"
            },
            "CheckinStatusTypeID": 10
        },
        {
            "ID": 4038,
            "ChargePointID": 31336,
            "CommentTypeID": 10,
            "UserName": "markdl1969",
            "Comment": "Wouldn't charge both machines where saying fault and that my card wasnt recognised",
            "Rating": 1,
            "DateCreated": "2015-03-19T21:35:16.907Z",
            "User": {
                "ID": 4634,
                "Username": "markdl1969"
            },
            "CheckinStatusTypeID": 20
        }
    ],
    "IsRecentlyVerified": false,
    "ID": 31336,
    "UUID": "E51972B2-DF45-4CEB-B99D-329D74205ADD",
    "DataProviderID": 1,
    "OperatorID": 24,
    "OperatorsReference": "GB*GFX*EGS10196*1*1,GB*GFX*EGS10197*1*1",
    "UsageTypeID": 5,
    "UsageCost": "£0.30/kWh",
    "AddressInfo": {
        "ID": 31682,
        "Title": "Knutsford Moto M6 (N) Services",
        "AddressLine1": "M6 J18/19",
        "AddressLine2": "Northwich Road",
        "Town": "Knutsford",
        "StateOrProvince": "Cheshire",
        "Postcode": "WA16 0TL",
        "CountryID": 1,
        "Latitude": 53.300346,
        "Longitude": -2.401642,
        "DistanceUnit": 0
    },
    "Connections": [
        {
            "ID": 34764,
            "ConnectionTypeID": 2,
            "Reference": "GB*GFX*EGS10196*2",
            "StatusTypeID": 50,
            "LevelID": 3,
            "Amps": 200,
            "Voltage": 500,
            "PowerKW": 60,
            "CurrentTypeID": 30,
            "Quantity": 1
        },
        {
            "ID": 34765,
            "ConnectionTypeID": 33,
            "Reference": "GB*GFX*EGS10196*1",
            "StatusTypeID": 50,
            "LevelID": 3,
            "Amps": 200,
            "Voltage": 920,
            "PowerKW": 60,
            "CurrentTypeID": 30,
            "Quantity": 2
        },
        {
            "ID": 34766,
            "ConnectionTypeID": 33,
            "Reference": "GB*GFX*EGS10197*1",
            "StatusTypeID": 50,
            "LevelID": 3,
            "PowerKW": 60,
            "CurrentTypeID": 30,
            "Quantity": 1
        },
        {
            "ID": 304594,
            "ConnectionTypeID": 33,
            "Reference": "GB*GFX*EGS10197*2",
            "StatusTypeID": 50,
            "LevelID": 3,
            "Amps": 200,
            "Voltage": 920,
            "PowerKW": 60,
            "CurrentTypeID": 30,
            "Quantity": 1
        }
    ],
    "NumberOfPoints": 4,
    "StatusTypeID": 50,
    "DateLastStatusUpdate": "2021-08-03T09:23:00Z",
    "DataQualityLevel": 1,
    "DateCreated": "2015-01-03T16:20:00Z",
    "SubmissionStatusTypeID": 200
}