{
    "IsRecentlyVerified": false,
    "ID": 7814,
    "UUID": "64DF50FF-B5F9-4DD2-AD6C-E920614DF48D",
    "DataProviderID": 15,
    "DataProvidersReference": "6881",
    "OperatorID": 26,
    "AddressInfo": {
        "ID": 7711,
        "Title": "1220 Versailles Rd",
        "AddressLine1": "1220 Versailles Rd",
        "Town": "Frankfort",
        "StateOrProvince": "KY",
        "Postcode": "40601",
        "CountryID": 2,
        "Latitude": 38.18325,
        "Longitude": -84.81753,
        "ContactTelephone1": "(502) 848-0002",
        "RelatedURL": "http://carstations.com/6881",
        "DistanceUnit": 0
    },
    "Connections": [
        {
            "ID": 5244,
            "ConnectionTypeID": 1,
            "Reference": "J1772",
            "LevelID": 2
        }
    ],
    "StatusTypeID": 0,
    "DateLastStatusUpdate": "2017-11-04T14:04:00Z",
    "DataQualityLevel": 1,
    "DateCreated": "2011-11-11T12:05:00Z",
    "SubmissionStatusTypeID": 100
}