{
    "IsRecentlyVerified": false,
    "ID": 55112,
    "UUID": "B1EB6892-21FB-4186-831B-4E14C6048569",
    "DataProviderID": 1,
    "OperatorID": 23,
    "UsageTypeID": 6,
    "UsageCost": "Free",
    "AddressInfo": {
        "ID": 55458,
        "Title": "ブリック＆ウッドクラブ",
        "AddressLine1": "山口",
        "Town": "市原市",
        "StateOrProvince": "千葉県",
        "Postcode": "290-0558",
        "CountryID": 114,
        "Latitude": 35.35057,
        "Longitude": 140.134328,
        "ContactTelephone1": "0436-98-1330",
        "ContactTelephone2": "0120-975-214",
        "RelatedURL": "http://www.brickandwood.jp/",
        "DistanceUnit": 0
    },
    "Connections": [
        {
            "ID": 69672,
            "ConnectionTypeID": 0,
            "StatusTypeID": 50,
            "LevelID": 2,
            "Amps": 100,
            "CurrentTypeID": 10
        }
    ],
    "NumberOfPoints": 1,
    "StatusTypeID": 50,
    "DateLastStatusUpdate": "2015-10-15T14:31:00Z",
    "DataQualityLevel": 1,
    "DateCreated": "2015-10-15T14:06:00Z",
    "SubmissionStatusTypeID": 200
}