{
    "IsRecentlyVerified": false,
    "ID": 182239,
    "UUID": "5185C1B5-495F-4855-BEBE-570D30E74627",
    "DataProviderID": 29,
    "DataProvidersReference": "17623",
    "OperatorID": 45,
    "AddressInfo": {
        "ID": 182598,
        "Title": "Chemnitzer Straße 65",
        "AddressLine1": "Chemnitzer Straße 65",
        "Town": "Chemnitz",
        "Postcode": "09123",
        "CountryID": 87,
        "Latitude": 50.783715,
        "Longitude": 12.895356,
        "DistanceUnit": 0
    },
    "Connections": [
        {
            "ID": 287735,
            "ConnectionTypeID": 1036,
            "StatusTypeID": 50,
            "LevelID": 3,
            "PowerKW": 43,
            "CurrentTypeID": 20
        },
        {
            "ID": 287736,
            "ConnectionTypeID": 33,
            "StatusTypeID": 50,
            "LevelID": 3,
            "PowerKW": 50,
            "CurrentTypeID": 30
        },
        {
            "ID": 298178,
            "ConnectionTypeID": 2,
            "StatusTypeID": 50,
            "LevelID": 3,
            "PowerKW": 50,
            "CurrentTypeID": 30
        }
    ],
    "StatusTypeID": 50,
    "DateLastStatusUpdate": "2021-07-12T02:45:00Z",
    "MetadataValues": [
        {
            "ID": 14533,
            "MetadataFieldID": 4,
            "ItemValue": "Data from the German chargepoint registry provided by Bundesnetzagentur.de under the CC-BY 4.0 license"
        }
    ],
    "DataQualityLevel": 3,
    "DateCreated": "2021-07-08T10:02:00Z",
    "SubmissionStatusTypeID": 100
}