{
    "IsRecentlyVerified": false,
    "ID": 177317,
    "UUID": "8025C86A-53D3-4A7F-AD11-8E0A3ABBB84E",
    "DataProviderID": 29,
    "DataProvidersReference": "8234",
    "AddressInfo": {
        "ID": 177676,
        "Title": "Niels-Bohr-Str. 2",
        "AddressLine1": "Niels-Bohr-Str. 2",
        "Town": "Bitterfeld-Wolfen",
        "Postcode": "06749",
        "CountryID": 87,
        "Latitude": 51.62455,
        "Longitude": 12.307835,
        "DistanceUnit": 0
    },
    "Connections": [
        {
            "ID": 276330,
            "ConnectionTypeID": 33,
            "StatusTypeID": 50,
            "LevelID": 3,
            "PowerKW": 50,
            "CurrentTypeID": 30
        },
        {
            "ID": 276331,
            "ConnectionTypeID": 2,
            "StatusTypeID": 50,
            "LevelID": 3,
            "PowerKW": 50,
            "CurrentTypeID": 30
        },
        {
            "ID": 299747,
            "ConnectionTypeID": 25,
            "StatusTypeID": 50,
            "LevelID": 2,
            "PowerKW": 22,
            "CurrentTypeID": 20
        }
    ],
    "StatusTypeID": 0,
    "DateLastStatusUpdate": "2021-07-12T02:48:00Z",
    "MetadataValues": [
        {
            "ID": 9611,
            "MetadataFieldID": 4,
            "ItemValue": "Data from the German chargepoint registry provided by Bundesnetzagentur.de under the CC-BY 4.0 license"
        }
    ],
    "DataQualityLevel": 3,
    "DateCreated": "2021-07-08T09:48:00Z",
    "SubmissionStatusTypeID": 100
}