{
    "IsRecentlyVerified": false,
    "ID": 182496,
    "UUID": "D0ACD43C-90A2-4CAC-919F-F0B515427AFC",
    "DataProviderID": 29,
    "DataProvidersReference": "9227",
    "AddressInfo": {
        "ID": 182855,
        "Title": "Schloßstr. 19",
        "AddressLine1": "Schloßstr. 19",
        "Town": "Rietheim",
        "Postcode": "78604",
        "CountryID": 87,
        "Latitude": 48.036328,
        "Longitude": 8.781681,
        "DistanceUnit": 0
    },
    "Connections": [
        {
            "ID": 288314,
            "ConnectionTypeID": 33,
            "StatusTypeID": 50,
            "LevelID": 3,
            "PowerKW": 150,
            "CurrentTypeID": 30
        },
        {
            "ID": 288315,
            "ConnectionTypeID": 25,
            "StatusTypeID": 50,
            "LevelID": 2,
            "PowerKW": 22,
            "CurrentTypeID": 20
        },
        {
            "ID": 288316,
            "ConnectionTypeID": 28,
            "StatusTypeID": 50,
            "LevelID": 2,
            "PowerKW": 3.7,
            "CurrentTypeID": 10
        },
        {
            "ID": 288317,
            "ConnectionTypeID": 28,
            "StatusTypeID": 50,
            "LevelID": 2,
            "PowerKW": 3.7,
            "CurrentTypeID": 10
        }
    ],
    "StatusTypeID": 50,
    "DateLastStatusUpdate": "2021-07-12T02:40:00Z",
    "MetadataValues": [
        {
            "ID": 14789,
            "MetadataFieldID": 4,
            "ItemValue": "Data from the German chargepoint registry provided by Bundesnetzagentur.de under the CC-BY 4.0 license"
        }
    ],
    "DataQualityLevel": 3,
    "DateCreated": "2021-07-08T10:03:00Z",
    "SubmissionStatusTypeID": 100
}