{
    "IsRecentlyVerified": false,
    "ID": 17854,
    "UUID": "0C25A639-BF7B-4EAA-AD62-614FD55C80F8",
    "DataProviderID": 22,
    "DataProvidersReference": "65F675B3CF48B79D1D4FE970F1688C6B",
    "AddressInfo": {
        "ID": 18199,
        "Title": "松本市役所東庁舎北側駐車場",
        "AddressLine1": "長野県松本市丸の内3-7",
        "CountryID": 114,
        "Latitude": 36.23812764,
        "Longitude": 137.9725861,
        "ContactTelephone1": "0263-34-8301",
        "DistanceUnit": 0
    },
    "Connections": [
        {
            "ID": 18095,
            "ConnectionTypeID": 2,
            "LevelID": 2,
            "Amps": 100,
            "Voltage": 480,
            "PowerKW": 48,
            "Quantity": 1
        }
    ],
    "DateLastStatusUpdate": "2013-06-29T09:04:00Z",
    "DataQualityLevel": 2,
    "DateCreated": "2013-06-29T09:04:00Z",
    "SubmissionStatusTypeID": 200
}