{
    "IsRecentlyVerified": false,
    "ID": 114738,
    "UUID": "2875E473-4FB9-412C-95B4-B62E5D2CA3CC",
    "DataProviderID": 1,
    "OperatorID": 1,
    "OperatorsReference": "BEALLEGO000904",
    "UsageTypeID": 6,
    "AddressInfo": {
        "ID": 115084,
        "Title": "Battmobiel Blauwstraat ",
        "AddressLine1": "Blauwstraat 104",
        "Town": "GENT",
        "StateOrProvince": "Oost-Vlaanderen",
        "Postcode": "9000",
        "CountryID": 26,
        "Latitude": 51.0858787,
        "Longitude": 3.70612989999995,
        "AccessComments": "Eén van de laadpunten is voorbehouden voor klanten van Battmobiel",
        "DistanceUnit": 0
    },
    "Connections": [
        {
            "ID": 161477,
            "ConnectionTypeID": 25,
            "StatusTypeID": 50,
            "LevelID": 2,
            "Amps": 16,
            "Voltage": 400,
            "PowerKW": 11,
            "CurrentTypeID": 20,
            "Quantity": 2
        }
    ],
    "NumberOfPoints": 2,
    "StatusTypeID": 50,
    "DateLastStatusUpdate": "2019-01-15T15:14:00Z",
    "DataQualityLevel": 1,
    "DateCreated": "2019-01-14T15:05:00Z",
    "SubmissionStatusTypeID": 200
}