{
    "IsRecentlyVerified": false,
    "ID": 67113,
    "UUID": "C17E7512-E8EE-4738-93E2-1DD254641DAF",
    "DataProviderID": 1,
    "OperatorID": 23,
    "OperatorsReference": "17772",
    "UsageTypeID": 1,
    "UsageCost": "Free",
    "AddressInfo": {
        "ID": 67459,
        "Title": "DoubleTree by Hilton Fresno Convention Center - Tesla",
        "AddressLine1": "2233 Ventura St",
        "Town": "Fresno",
        "StateOrProvince": "CA",
        "Postcode": "93720",
        "CountryID": 2,
        "Latitude": 36.7329917,
        "Longitude": -119.7846156,
        "ContactTelephone1": "559-268-1000  877-798-3752",
        "AccessComments": "24 hours daily; for Tesla use only; for guest use only",
        "RelatedURL": "http://www.teslamotors.com/supercharger",
        "DistanceUnit": 0
    },
    "Connections": [
        {
            "ID": 92608,
            "ConnectionTypeID": 30,
            "StatusTypeID": 50,
            "LevelID": 2,
            "Amps": 16,
            "Voltage": 230,
            "PowerKW": 8,
            "CurrentTypeID": 10,
            "Quantity": 2
        }
    ],
    "NumberOfPoints": 2,
    "StatusTypeID": 50,
    "DateLastStatusUpdate": "2017-01-31T18:46:00Z",
    "DataQualityLevel": 3,
    "DateCreated": "2016-05-29T02:04:00Z",
    "SubmissionStatusTypeID": 100
}