{
    "IsRecentlyVerified": false,
    "ID": 37047,
    "UUID": "327960C4-ABC3-44F6-939B-1695D7870D96",
    "DataProviderID": 26,
    "DataProvidersReference": "47251",
    "OperatorID": 178,
    "OperatorsReference": "EVnetNL AL407",
    "UsageCost": "0.00 jaarabonnement",
    "AddressInfo": {
        "ID": 37393,
        "Title": "De Parelvisserslaan 1",
        "AddressLine1": "De Parelvisserslaan 1",
        "Town": "Amstelveen",
        "Postcode": "1183 RH",
        "CountryID": 159,
        "Latitude": 52.302096,
        "Longitude": 4.873364,
        "ContactTelephone1": "0800-3522365",
        "RelatedURL": "http://www.evnet.nl",
        "DistanceUnit": 0
    },
    "Connections": [
        {
            "ID": 40558,
            "ConnectionTypeID": 25,
            "LevelID": 1,
            "PowerKW": 2.3,
            "CurrentTypeID": 10
        }
    ],
    "NumberOfPoints": 2,
    "StatusTypeID": 50,
    "DateLastStatusUpdate": "2016-06-04T02:52:00Z",
    "DataQualityLevel": 3,
    "DateCreated": "2015-01-09T06:07:00Z",
    "SubmissionStatusTypeID": 100
}