{
    "IsRecentlyVerified": false,
    "ID": 178108,
    "UUID": "E17E4184-A0DD-4588-BC76-41E02675FEDB",
    "DataProviderID": 29,
    "DataProvidersReference": "4348,13788",
    "OperatorID": 45,
    "AddressInfo": {
        "ID": 178467,
        "Title": "Mariakirchner Str. 34",
        "AddressLine1": "Mariakirchner Str. 34",
        "Town": "Arnstorf",
        "Postcode": "94424",
        "CountryID": 87,
        "Latitude": 48.564391,
        "Longitude": 12.825205,
        "DistanceUnit": 0
    },
    "Connections": [
        {
            "ID": 278101,
            "ConnectionTypeID": 25,
            "StatusTypeID": 50,
            "LevelID": 2,
            "PowerKW": 22,
            "CurrentTypeID": 20
        },
        {
            "ID": 278102,
            "ConnectionTypeID": 25,
            "StatusTypeID": 50,
            "LevelID": 2,
            "PowerKW": 22,
            "CurrentTypeID": 20
        },
        {
            "ID": 278103,
            "ConnectionTypeID": 25,
            "StatusTypeID": 50,
            "LevelID": 2,
            "PowerKW": 22,
            "CurrentTypeID": 20
        },
        {
            "ID": 278104,
            "ConnectionTypeID": 25,
            "StatusTypeID": 50,
            "LevelID": 2,
            "PowerKW": 22,
            "CurrentTypeID": 20
        }
    ],
    "StatusTypeID": 0,
    "DateLastStatusUpdate": "2021-07-09T03:13:00Z",
    "MetadataValues": [
        {
            "ID": 10402,
            "MetadataFieldID": 4,
            "ItemValue": "Data from the German chargepoint registry provided by Bundesnetzagentur.de under the CC-BY 4.0 license"
        }
    ],
    "DataQualityLevel": 3,
    "DateCreated": "2021-07-08T09:49:00Z",
    "SubmissionStatusTypeID": 100
}