{
    "IsRecentlyVerified": false,
    "ID": 52901,
    "UUID": "129E4BC9-5214-4EE1-A66A-C32CD5123040",
    "DataProviderID": 1,
    "OperatorID": 32,
    "OperatorsReference": "1816",
    "UsageTypeID": 6,
    "UsageCost": "Inclusive; for Polar Plus subscription members only",
    "AddressInfo": {
        "ID": 53247,
        "Title": "Fish Brothers Toyota",
        "AddressLine1": "Penzance Drive",
        "AddressLine2": "Churchward Park",
        "Town": "Swindon",
        "StateOrProvince": "Wiltshire",
        "Postcode": "SN5 7RX",
        "CountryID": 1,
        "Latitude": 51.5555,
        "Longitude": -1.81003,
        "DistanceUnit": 0
    },
    "Connections": [
        {
            "ID": 65844,
            "ConnectionTypeID": 25,
            "StatusTypeID": 50,
            "LevelID": 2,
            "Amps": 32,
            "Voltage": 230,
            "PowerKW": 7,
            "CurrentTypeID": 10,
            "Quantity": 2
        }
    ],
    "NumberOfPoints": 2,
    "StatusTypeID": 50,
    "DateLastStatusUpdate": "2019-03-10T06:25:00Z",
    "DataQualityLevel": 1,
    "DateCreated": "2015-09-13T21:37:00Z",
    "SubmissionStatusTypeID": 200
}