{
    "IsRecentlyVerified": false,
    "ID": 130491,
    "UUID": "AA49206C-FD17-4AC3-8013-61FBED7EBBE6",
    "DataProviderID": 1,
    "OperatorID": 80,
    "UsageTypeID": 4,
    "UsageCost": "0.45€/KWh",
    "AddressInfo": {
        "ID": 130837,
        "Title": "Roma Edimburgo | EnelX",
        "AddressLine1": "Via Edimburgo, 3",
        "Town": "Roma",
        "StateOrProvince": "RM",
        "Postcode": "00144",
        "CountryID": 112,
        "Latitude": 41.81960224653744,
        "Longitude": 12.453396144527801,
        "RelatedURL": "https://www.enelx.com/it/it/emobility",
        "DistanceUnit": 0
    },
    "Connections": [
        {
            "ID": 182676,
            "ConnectionTypeID": 25,
            "StatusTypeID": 50,
            "LevelID": 2,
            "Amps": 32,
            "Voltage": 400,
            "PowerKW": 22,
            "CurrentTypeID": 20,
            "Quantity": 2
        },
        {
            "ID": 182677,
            "ConnectionTypeID": 36,
            "StatusTypeID": 50,
            "LevelID": 2,
            "Amps": 16,
            "Voltage": 240,
            "PowerKW": 3.7,
            "CurrentTypeID": 10,
            "Quantity": 2
        }
    ],
    "NumberOfPoints": 4,
    "StatusTypeID": 50,
    "DateLastStatusUpdate": "2019-08-06T07:01:00Z",
    "DataQualityLevel": 1,
    "DateCreated": "2019-08-06T07:01:00Z",
    "SubmissionStatusTypeID": 200
}