{
    "IsRecentlyVerified": false,
    "ID": 182332,
    "UUID": "B9EF3F51-ECEF-47A4-A580-6CD1E375C5F7",
    "DataProviderID": 29,
    "DataProvidersReference": "11090",
    "AddressInfo": {
        "ID": 182691,
        "Title": "Alwin-Klein-Str. 11",
        "AddressLine1": "Alwin-Klein-Str. 11",
        "Town": "Lengerich",
        "Postcode": "49525",
        "CountryID": 87,
        "Latitude": 52.188455,
        "Longitude": 7.855715,
        "DistanceUnit": 0
    },
    "Connections": [
        {
            "ID": 287937,
            "ConnectionTypeID": 25,
            "StatusTypeID": 50,
            "LevelID": 2,
            "PowerKW": 22,
            "CurrentTypeID": 20
        },
        {
            "ID": 287938,
            "ConnectionTypeID": 25,
            "StatusTypeID": 50,
            "LevelID": 2,
            "PowerKW": 22,
            "CurrentTypeID": 20
        }
    ],
    "StatusTypeID": 50,
    "DateLastStatusUpdate": "2021-07-12T02:49:00Z",
    "MetadataValues": [
        {
            "ID": 14626,
            "MetadataFieldID": 4,
            "ItemValue": "Data from the German chargepoint registry provided by Bundesnetzagentur.de under the CC-BY 4.0 license"
        }
    ],
    "DataQualityLevel": 3,
    "DateCreated": "2021-07-08T10:02:00Z",
    "SubmissionStatusTypeID": 100
}