{
    "IsRecentlyVerified": false,
    "ID": 186550,
    "UUID": "75198456-D1D3-4ACB-87DF-686805572670",
    "DataProviderID": 29,
    "DataProvidersReference": "20337",
    "AddressInfo": {
        "ID": 186909,
        "Title": "Auenweg 1",
        "AddressLine1": "Auenweg 1",
        "Town": "Sangerhausen",
        "Postcode": "06526",
        "CountryID": 87,
        "Latitude": 51.462223,
        "Longitude": 11.26781,
        "DistanceUnit": 0
    },
    "Connections": [
        {
            "ID": 299451,
            "ConnectionTypeID": 25,
            "StatusTypeID": 50,
            "LevelID": 2,
            "PowerKW": 11,
            "CurrentTypeID": 20
        },
        {
            "ID": 299452,
            "ConnectionTypeID": 25,
            "StatusTypeID": 50,
            "LevelID": 2,
            "PowerKW": 11,
            "CurrentTypeID": 20
        }
    ],
    "StatusTypeID": 50,
    "DateLastStatusUpdate": "2021-07-12T02:47:00Z",
    "MetadataValues": [
        {
            "ID": 18791,
            "MetadataFieldID": 4,
            "ItemValue": "Data from the German chargepoint registry provided by Bundesnetzagentur.de under the CC-BY 4.0 license"
        }
    ],
    "DataQualityLevel": 3,
    "DateCreated": "2021-07-12T02:47:00Z",
    "SubmissionStatusTypeID": 100
}