{
    "IsRecentlyVerified": false,
    "ID": 15422,
    "UUID": "CF049C8C-5276-4468-9917-0411D03C3DD4",
    "DataProviderID": 1,
    "OperatorID": 51,
    "UsageTypeID": 0,
    "UsageCost": "Free",
    "AddressInfo": {
        "ID": 15768,
        "Title": "Valhalla Inn",
        "AddressLine1": "1 Valhalla Inn Rd.",
        "AddressLine2": "",
        "Town": "Thunder Bay",
        "StateOrProvince": "ON",
        "Postcode": "",
        "CountryID": 44,
        "Latitude": 48.37948069999999,
        "Longitude": -89.3060266,
        "ContactTelephone1": " (807) 577-1121",
        "ContactTelephone2": "1-800-964-1121",
        "ContactEmail": "reservations@valhallainn.com",
        "AccessComments": "From U.S.A. / Canada Border      Drive North on HWY 61 for 57.6km     Turn Left at Arthur St     Continue West on Arthur St for 0.3km     Turn Left at Valhalla Inn Road.  From Dryden      Drive East on HWY 17 for 337km     Exit Right onto HWY 130 South for 2km, then continue     on Arthur Street for 8 km     Turn Right at Valhalla Inn Road  From Sault Ste Marie      Drive North on HWY 17 for 698km     Turn Right at Arthur St     Continue West on Arthur St for 0.3km     Turn Left at Valhalla Inn Road",
        "RelatedURL": "http://www.valhallainn.com",
        "DistanceUnit": 0
    },
    "Connections": [
        {
            "ID": 13731,
            "ConnectionTypeID": 1,
            "StatusTypeID": 0,
            "LevelID": 2,
            "Amps": 72,
            "Voltage": 240,
            "PowerKW": 17.3,
            "Quantity": 1
        }
    ],
    "NumberOfPoints": 1,
    "GeneralComments": "",
    "StatusTypeID": 50,
    "DateLastStatusUpdate": "2013-01-09T16:52:00Z",
    "DataQualityLevel": 1,
    "DateCreated": "2013-01-09T16:52:00Z",
    "SubmissionStatusTypeID": 200
}