{
    "IsRecentlyVerified": false,
    "ID": 105506,
    "UUID": "A74A1308-1C13-4AB2-A359-8BF864C27740",
    "DataProviderID": 1,
    "OperatorID": 23,
    "OperatorsReference": "44157",
    "UsageTypeID": 4,
    "AddressInfo": {
        "ID": 105852,
        "Title": "Château Soutard",
        "AddressLine1": "1 Lieu-Dit Soutard",
        "Town": "Saint-Emilion",
        "Postcode": "33330",
        "CountryID": 80,
        "Latitude": 44.89803,
        "Longitude": -0.150278,
        "ContactTelephone1": "+33 5 57 24 71 41",
        "DistanceUnit": 0
    },
    "Connections": [
        {
            "ID": 148688,
            "ConnectionTypeID": 30,
            "StatusTypeID": 50,
            "LevelID": 2,
            "Amps": 16,
            "Voltage": 400,
            "PowerKW": 11,
            "CurrentTypeID": 20,
            "Quantity": 2
        }
    ],
    "NumberOfPoints": 2,
    "GeneralComments": "2 Tesla Connectors, up to 11kW.Available for customers. Please see front desk.",
    "StatusTypeID": 50,
    "DateLastStatusUpdate": "2018-10-03T14:17:00Z",
    "DataQualityLevel": 1,
    "DateCreated": "2018-06-08T05:30:00Z",
    "SubmissionStatusTypeID": 200
}