{
    "IsRecentlyVerified": false,
    "ID": 51064,
    "UUID": "B45C8EF8-BFE7-4F52-B7D9-48AAFAE1F394",
    "DataProviderID": 26,
    "DataProvidersReference": "65372",
    "OperatorID": 103,
    "OperatorsReference": "Allego NLALLEGO0002132",
    "UsageCost": "0.00 jaarabonnement",
    "AddressInfo": {
        "ID": 51410,
        "Title": "Rijweg 18",
        "AddressLine1": "Rijweg 18",
        "Town": "Ooststellingwerf",
        "Postcode": "8431 KL",
        "CountryID": 159,
        "Latitude": 52.9929,
        "Longitude": 6.29563,
        "ContactTelephone1": "0800-3745337",
        "RelatedURL": "http://www.allego.eu/",
        "DistanceUnit": 0
    },
    "Connections": [
        {
            "ID": 63125,
            "ConnectionTypeID": 25,
            "LevelID": 2,
            "PowerKW": 11,
            "CurrentTypeID": 10
        },
        {
            "ID": 63126,
            "ConnectionTypeID": 25,
            "LevelID": 2,
            "PowerKW": 11,
            "CurrentTypeID": 10
        }
    ],
    "NumberOfPoints": 1,
    "StatusTypeID": 50,
    "DateLastStatusUpdate": "2016-06-04T02:55:00Z",
    "DataQualityLevel": 3,
    "DateCreated": "2015-07-22T09:54:00Z",
    "SubmissionStatusTypeID": 100
}