{
    "IsRecentlyVerified": false,
    "ID": 143977,
    "UUID": "463CFBC7-D66C-4A92-A077-818D68773BE9",
    "DataProviderID": 2,
    "DataProvidersReference": "130165",
    "OperatorID": 90,
    "UsageTypeID": 1,
    "AddressInfo": {
        "ID": 144329,
        "Title": "Sur Rue - Musée du Granit",
        "AddressLine1": "14 boul. Notre-Dame O",
        "Town": "Stanstead",
        "StateOrProvince": "QC",
        "Postcode": "J0B 3E2",
        "CountryID": 44,
        "Latitude": 45.008103,
        "Longitude": -72.097269,
        "ContactTelephone1": "877-505-2674",
        "AccessComments": "24 hours daily",
        "RelatedURL": "https://lecircuitelectrique.com/",
        "DistanceUnit": 0
    },
    "Connections": [
        {
            "ID": 200418,
            "ConnectionTypeID": 1,
            "LevelID": 2,
            "Amps": 16,
            "Voltage": 230,
            "PowerKW": 3.7,
            "CurrentTypeID": 10,
            "Quantity": 2
        }
    ],
    "StatusTypeID": 50,
    "DateLastStatusUpdate": "2020-06-26T03:08:00Z",
    "DataQualityLevel": 3,
    "DateCreated": "2019-12-24T09:22:00Z",
    "SubmissionStatusTypeID": 100
}