{
    "IsRecentlyVerified": false,
    "ID": 153209,
    "UUID": "429EBD34-C6D8-4792-ABF1-FF027FC720E4",
    "DataProviderID": 28,
    "DataProvidersReference": "FR*S56*P56172*A",
    "OperatorID": 3379,
    "UsageTypeID": 5,
    "AddressInfo": {
        "ID": 153562,
        "Title": "Rue des Martyrs de la Résistance",
        "AddressLine1": "Rue des Martyrs de la Résistance 56420 Plumelec",
        "CountryID": 80,
        "Latitude": 47.838044,
        "Longitude": -2.641815,
        "AccessComments": "24/24 7/7 jours",
        "DistanceUnit": 0
    },
    "Connections": [
        {
            "ID": 214825,
            "ConnectionTypeID": 25,
            "StatusTypeID": 50,
            "LevelID": 2,
            "PowerKW": 18,
            "CurrentTypeID": 20
        },
        {
            "ID": 214826,
            "ConnectionTypeID": 28,
            "StatusTypeID": 50,
            "LevelID": 2,
            "PowerKW": 18,
            "CurrentTypeID": 10
        },
        {
            "ID": 248195,
            "ConnectionTypeID": 25,
            "StatusTypeID": 50,
            "LevelID": 2,
            "PowerKW": 18,
            "CurrentTypeID": 20
        },
        {
            "ID": 248196,
            "ConnectionTypeID": 28,
            "StatusTypeID": 50,
            "LevelID": 2,
            "PowerKW": 18,
            "CurrentTypeID": 10
        }
    ],
    "GeneralComments": "Tarif abonné Morbihan Energies: 18€ ttc/an, puis 0,25€ ttc/kWh consommé. Non abonné: 2€ ttc/charge (3€ sur bornes rapides), puis 0,25€ ttc/kWh consommé. Pénalités applicables au temps si branchement > 6 heures (2 heures sur bornes rapides) : 5€ ttc/heure",
    "StatusTypeID": 50,
    "DateLastStatusUpdate": "2020-08-27T05:14:00Z",
    "DataQualityLevel": 2,
    "DateCreated": "2020-03-15T10:54:00Z",
    "SubmissionStatusTypeID": 100
}