{
    "IsRecentlyVerified": false,
    "ID": 144235,
    "UUID": "1019362B-5C81-4EBE-B0E2-C8FF8A6C28F7",
    "DataProviderID": 2,
    "DataProvidersReference": "130362",
    "OperatorID": 90,
    "UsageTypeID": 1,
    "AddressInfo": {
        "ID": 144587,
        "Title": "5301 Wellington",
        "AddressLine1": "5301 Rue Wellington",
        "Town": "Montréal",
        "StateOrProvince": "QC",
        "Postcode": "H4H 1N3",
        "CountryID": 44,
        "Latitude": 45.453552,
        "Longitude": -73.568077,
        "ContactTelephone1": "877-505-2674",
        "AccessComments": "24 hours daily",
        "RelatedURL": "https://lecircuitelectrique.com/",
        "DistanceUnit": 0
    },
    "Connections": [
        {
            "ID": 200724,
            "ConnectionTypeID": 1,
            "LevelID": 2,
            "Amps": 16,
            "Voltage": 230,
            "PowerKW": 3.7,
            "CurrentTypeID": 10,
            "Quantity": 2
        }
    ],
    "StatusTypeID": 50,
    "DateLastStatusUpdate": "2020-06-26T03:09:00Z",
    "DataQualityLevel": 3,
    "DateCreated": "2019-12-24T09:23:00Z",
    "SubmissionStatusTypeID": 100
}