{
    "IsRecentlyVerified": false,
    "ID": 176676,
    "UUID": "09349DCC-4981-4456-B975-706E6D63C3FB",
    "DataProviderID": 29,
    "DataProvidersReference": "5267",
    "OperatorID": 86,
    "AddressInfo": {
        "ID": 177035,
        "Title": "Am Windfeld 8",
        "AddressLine1": "Am Windfeld 8",
        "Town": "Miesbach",
        "Postcode": "83714",
        "CountryID": 87,
        "Latitude": 47.793573,
        "Longitude": 11.838587,
        "DistanceUnit": 0
    },
    "Connections": [
        {
            "ID": 274872,
            "ConnectionTypeID": 1036,
            "StatusTypeID": 50,
            "LevelID": 3,
            "PowerKW": 43,
            "CurrentTypeID": 20
        },
        {
            "ID": 274873,
            "ConnectionTypeID": 33,
            "StatusTypeID": 50,
            "LevelID": 3,
            "PowerKW": 50,
            "CurrentTypeID": 30
        }
    ],
    "StatusTypeID": 0,
    "DateLastStatusUpdate": "2021-07-09T03:10:00Z",
    "MetadataValues": [
        {
            "ID": 8971,
            "MetadataFieldID": 4,
            "ItemValue": "Data from the German chargepoint registry provided by Bundesnetzagentur.de under the CC-BY 4.0 license"
        }
    ],
    "DataQualityLevel": 3,
    "DateCreated": "2021-07-08T09:48:00Z",
    "SubmissionStatusTypeID": 100
}