{
    "IsRecentlyVerified": false,
    "ID": 124755,
    "UUID": "4B893102-063B-4B00-AAC6-EF5F81DE9B19",
    "DataProviderID": 2,
    "DataProvidersReference": "48628",
    "OperatorID": 5,
    "UsageTypeID": 1,
    "AddressInfo": {
        "ID": 125101,
        "Title": "PARKWAY",
        "AddressLine1": "300 S Broad St",
        "Town": "Philadelphia",
        "StateOrProvince": "PA",
        "Postcode": "19102",
        "CountryID": 2,
        "Latitude": 39.9467392,
        "Longitude": -75.165062,
        "ContactTelephone1": "888-758-4389",
        "AccessComments": "24 hours daily",
        "RelatedURL": "http://www.chargepoint.com/",
        "DistanceUnit": 0
    },
    "Connections": [
        {
            "ID": 174896,
            "ConnectionTypeID": 1,
            "LevelID": 2,
            "Amps": 16,
            "Voltage": 230,
            "PowerKW": 3,
            "CurrentTypeID": 10,
            "Quantity": 1
        }
    ],
    "DateLastStatusUpdate": "2019-12-24T09:16:00Z",
    "DataQualityLevel": 3,
    "DateCreated": "2019-04-06T05:04:00Z",
    "SubmissionStatusTypeID": 100
}