{
    "IsRecentlyVerified": false,
    "ID": 128089,
    "UUID": "A39F8E92-2927-4044-A0A3-4DA09D8D9968",
    "DataProviderID": 1,
    "OperatorID": 3296,
    "UsageTypeID": 5,
    "UsageCost": "£0.35/kWh",
    "AddressInfo": {
        "ID": 128435,
        "Title": "Booths, Kirkby Lonsdale",
        "AddressLine1": "Dodgson Croft",
        "Town": "Kirkby Lonsdale",
        "StateOrProvince": "Carnforth",
        "Postcode": "LA6 2HG",
        "CountryID": 1,
        "Latitude": 54.2014039820013,
        "Longitude": -2.60007330406563,
        "AccessComments": "24/7",
        "DistanceUnit": 0
    },
    "Connections": [
        {
            "ID": 179248,
            "ConnectionTypeID": 33,
            "StatusTypeID": 50,
            "LevelID": 3,
            "PowerKW": 50,
            "CurrentTypeID": 30,
            "Quantity": 4
        },
        {
            "ID": 179249,
            "ConnectionTypeID": 2,
            "StatusTypeID": 50,
            "LevelID": 3,
            "PowerKW": 50,
            "CurrentTypeID": 30,
            "Quantity": 4
        }
    ],
    "NumberOfPoints": 4,
    "StatusTypeID": 50,
    "DateLastStatusUpdate": "2019-06-14T08:15:00Z",
    "DataQualityLevel": 1,
    "DateCreated": "2019-06-14T07:22:00Z",
    "SubmissionStatusTypeID": 200
}