{
    "IsRecentlyVerified": false,
    "ID": 44834,
    "UUID": "15BDAA3A-6674-4517-A719-DCA88FE9F65A",
    "DataProviderID": 1,
    "DataProvidersReference": "2735",
    "AddressInfo": {
        "ID": 45180,
        "Title": "Brennes Auto Moss",
        "AddressLine1": "Høydaveien 7",
        "Town": "MOSS",
        "StateOrProvince": "Viken",
        "Postcode": "1526",
        "CountryID": 168,
        "Latitude": 59.4192,
        "Longitude": 10.68024,
        "AccessComments": "Utenfor butikk",
        "DistanceUnit": 0
    },
    "Connections": [
        {
            "ID": 55129,
            "ConnectionTypeID": 0,
            "Reference": "1",
            "LevelID": 2,
            "Amps": 100,
            "Voltage": 500,
            "PowerKW": 50,
            "Comments": "Mode 4"
        }
    ],
    "NumberOfPoints": 1,
    "DateLastStatusUpdate": "2020-05-26T08:23:00Z",
    "DataQualityLevel": 2,
    "DateCreated": "2015-04-19T05:51:00Z",
    "SubmissionStatusTypeID": 100
}