{
    "IsRecentlyVerified": false,
    "ID": 169150,
    "UUID": "B2412691-C27C-4CE0-87DD-32A5557A92E7",
    "DataProviderID": 1,
    "OperatorID": 23,
    "OperatorsReference": "54671",
    "UsageTypeID": 4,
    "UsageCost": "$0.26/kWh; other tariffs for older cars",
    "AddressInfo": {
        "ID": 169509,
        "Title": "Hawthorne, Ca - West 120th Street Supercharger",
        "AddressLine1": "2700 West 120th Avenue",
        "Town": "Hawthorne",
        "StateOrProvince": "CA",
        "Postcode": "90250",
        "CountryID": 2,
        "Latitude": 33.922601,
        "Longitude": -118.322054,
        "DistanceUnit": 0
    },
    "Connections": [
        {
            "ID": 257328,
            "ConnectionTypeID": 27,
            "StatusTypeID": 50,
            "LevelID": 3,
            "PowerKW": 120,
            "CurrentTypeID": 30,
            "Quantity": 16
        }
    ],
    "NumberOfPoints": 16,
    "GeneralComments": "16 superchargers, available 24/7, up to 150kW",
    "StatusTypeID": 50,
    "DateLastStatusUpdate": "2020-10-11T05:34:00Z",
    "DataQualityLevel": 1,
    "DateCreated": "2020-10-11T05:34:00Z",
    "SubmissionStatusTypeID": 200
}