{
    "IsRecentlyVerified": false,
    "ID": 57179,
    "UUID": "351000BE-6393-44B3-8DB7-C64D25684832",
    "DataProviderID": 1,
    "OperatorID": 45,
    "UsageTypeID": 3,
    "AddressInfo": {
        "ID": 57525,
        "Title": "Kia Autohaus Engbert",
        "AddressLine1": "Castroper Straße 349",
        "AddressLine2": "Emscher-Lippe",
        "Town": "Datteln",
        "StateOrProvince": "Kreis Recklinghausen",
        "Postcode": "45711",
        "CountryID": 87,
        "Latitude": 51.62823,
        "Longitude": 7.32444020000003,
        "AccessComments": "Die Säule ist nutzbar: Mo-Fr: von 08:00-18:00 Uhr, Sa: von 10:00 bis 13:00 Uhr\r\n\r\n\r\n",
        "RelatedURL": "http://kia-engbert-datteln.de",
        "DistanceUnit": 0
    },
    "Connections": [
        {
            "ID": 72251,
            "ConnectionTypeID": 2,
            "StatusTypeID": 50,
            "LevelID": 3,
            "PowerKW": 50,
            "CurrentTypeID": 30,
            "Quantity": 1
        },
        {
            "ID": 72252,
            "ConnectionTypeID": 33,
            "StatusTypeID": 50,
            "LevelID": 3,
            "PowerKW": 20,
            "CurrentTypeID": 30,
            "Quantity": 1
        }
    ],
    "NumberOfPoints": 2,
    "StatusTypeID": 50,
    "DateLastStatusUpdate": "2015-11-27T18:03:00Z",
    "DataQualityLevel": 1,
    "DateCreated": "2015-11-27T12:16:00Z",
    "SubmissionStatusTypeID": 200
}