{
    "IsRecentlyVerified": false,
    "ID": 20019,
    "UUID": "11297149-5569-46BA-9EA0-7040A6FF760F",
    "DataProviderID": 1,
    "OperatorID": 1,
    "UsageTypeID": 0,
    "UsageCost": "",
    "AddressInfo": {
        "ID": 20364,
        "Title": "Hôtel du Département",
        "AddressLine1": "27 Boulevard de Strasbourg",
        "AddressLine2": "",
        "Town": "",
        "StateOrProvince": "Alençon",
        "Postcode": "61000",
        "CountryID": 80,
        "Latitude": 48.43592,
        "Longitude": 0.08908,
        "ContactTelephone1": "",
        "ContactTelephone2": "",
        "ContactEmail": "",
        "AccessComments": "Ouvert à tous",
        "RelatedURL": "",
        "DistanceUnit": 0
    },
    "Connections": [],
    "GeneralComments": "",
    "StatusTypeID": 50,
    "DateLastStatusUpdate": "2013-10-24T17:11:00Z",
    "DataQualityLevel": 1,
    "DateCreated": "2013-10-24T13:09:00Z",
    "SubmissionStatusTypeID": 200
}