{
    "IsRecentlyVerified": false,
    "ID": 145020,
    "UUID": "ABCB65BB-BFA6-4257-82B4-9FBA27BFBABE",
    "DataProviderID": 2,
    "DataProvidersReference": "131052",
    "OperatorID": 90,
    "UsageTypeID": 1,
    "AddressInfo": {
        "ID": 145372,
        "Title": "Les Espaces D'Amico Marcoux - Espace Notre-Dame",
        "AddressLine1": "111 30e rue",
        "Town": "Notre-Dame-des-Pins",
        "StateOrProvince": "QC",
        "Postcode": "G0M 1K0",
        "CountryID": 44,
        "Latitude": 46.181673,
        "Longitude": -70.717977,
        "ContactTelephone1": "877-505-2674",
        "AccessComments": "24 hours daily",
        "RelatedURL": "https://lecircuitelectrique.com/",
        "DistanceUnit": 0
    },
    "Connections": [
        {
            "ID": 201599,
            "ConnectionTypeID": 1,
            "LevelID": 2,
            "Amps": 16,
            "Voltage": 230,
            "PowerKW": 3.7,
            "CurrentTypeID": 10,
            "Quantity": 2
        }
    ],
    "StatusTypeID": 50,
    "DateLastStatusUpdate": "2020-06-26T03:10:00Z",
    "DataQualityLevel": 3,
    "DateCreated": "2019-12-24T09:24:00Z",
    "SubmissionStatusTypeID": 100
}