{
    "IsRecentlyVerified": false,
    "ID": 181300,
    "UUID": "0BF754BE-6977-4F01-BAC6-5F0B72838097",
    "DataProviderID": 29,
    "DataProvidersReference": "20595",
    "OperatorID": 45,
    "AddressInfo": {
        "ID": 181659,
        "Title": "Im Sandbrinke 14",
        "AddressLine1": "Im Sandbrinke 14",
        "Town": "Wunstorf",
        "Postcode": "31515",
        "CountryID": 87,
        "Latitude": 52.451025,
        "Longitude": 9.355221,
        "DistanceUnit": 0
    },
    "Connections": [
        {
            "ID": 285438,
            "ConnectionTypeID": 33,
            "StatusTypeID": 50,
            "LevelID": 3,
            "PowerKW": 22,
            "CurrentTypeID": 30
        },
        {
            "ID": 285439,
            "ConnectionTypeID": 25,
            "StatusTypeID": 50,
            "LevelID": 2,
            "PowerKW": 11,
            "CurrentTypeID": 20
        }
    ],
    "StatusTypeID": 50,
    "DateLastStatusUpdate": "2021-07-12T02:49:00Z",
    "MetadataValues": [
        {
            "ID": 13594,
            "MetadataFieldID": 4,
            "ItemValue": "Data from the German chargepoint registry provided by Bundesnetzagentur.de under the CC-BY 4.0 license"
        }
    ],
    "DataQualityLevel": 3,
    "DateCreated": "2021-07-08T10:01:00Z",
    "SubmissionStatusTypeID": 100
}