{
    "IsRecentlyVerified": false,
    "ID": 141223,
    "UUID": "30932B5D-FA00-49CA-9225-156553D9F8DF",
    "DataProviderID": 2,
    "DataProvidersReference": "147639",
    "OperatorID": 5,
    "UsageTypeID": 1,
    "AddressInfo": {
        "ID": 141575,
        "Title": "ST. LOUIS CC",
        "AddressLine1": "5600 Oakland Ave",
        "Town": "St. Louis",
        "StateOrProvince": "MO",
        "Postcode": "63110",
        "CountryID": 2,
        "Latitude": 38.629303,
        "Longitude": -90.278436,
        "ContactTelephone1": "888-758-4389",
        "AccessComments": "24 hours daily",
        "RelatedURL": "http://www.chargepoint.com/",
        "DistanceUnit": 0
    },
    "Connections": [
        {
            "ID": 197093,
            "ConnectionTypeID": 1,
            "LevelID": 2,
            "Amps": 16,
            "Voltage": 230,
            "PowerKW": 3.7,
            "CurrentTypeID": 10,
            "Quantity": 3
        }
    ],
    "StatusTypeID": 50,
    "DateLastStatusUpdate": "2020-06-26T03:00:00Z",
    "DataQualityLevel": 3,
    "DateCreated": "2019-12-24T09:15:00Z",
    "SubmissionStatusTypeID": 100
}