{
    "IsRecentlyVerified": false,
    "ID": 44062,
    "UUID": "A355E14F-BCC2-4C91-A04F-9AD717255BCE",
    "DataProviderID": 1,
    "OperatorID": 1,
    "UsageTypeID": 1,
    "UsageCost": "0",
    "AddressInfo": {
        "ID": 44408,
        "Title": "Carrer de Cèsar Martorell",
        "AddressLine1": "Carrer de Cèsar Martorell",
        "Town": "San Cugat",
        "StateOrProvince": "Barcelona",
        "Postcode": "08172",
        "CountryID": 210,
        "Latitude": 41.4697958,
        "Longitude": 2.08703590000005,
        "ContactTelephone1": "6600086",
        "ContactTelephone2": "6600086",
        "ContactEmail": "creandomomentos@gmail.com",
        "DistanceUnit": 0
    },
    "Connections": [
        {
            "ID": 53774,
            "ConnectionTypeID": 29,
            "StatusTypeID": 50,
            "LevelID": 2,
            "Amps": 16,
            "Voltage": 220,
            "PowerKW": 3.5,
            "CurrentTypeID": 10,
            "Quantity": 2
        }
    ],
    "NumberOfPoints": 2,
    "StatusTypeID": 50,
    "DateLastStatusUpdate": "2015-04-17T19:35:00Z",
    "DataQualityLevel": 1,
    "DateCreated": "2015-04-13T16:08:00Z",
    "SubmissionStatusTypeID": 200
}