{
    "IsRecentlyVerified": false,
    "ID": 166657,
    "UUID": "89837894-5905-4585-8B3E-36D84A9424FD",
    "DataProviderID": 28,
    "DataProvidersReference": "FR*55C*P92380*GAR*GAULLE",
    "UsageTypeID": 5,
    "AddressInfo": {
        "ID": 167016,
        "Title": "Garche",
        "AddressLine1": "BOULEVARD DU GENERAL DE GAULLE",
        "CountryID": 80,
        "Latitude": 48.838587,
        "Longitude": 2.18696,
        "AccessComments": "24/24 7/7 jours",
        "DistanceUnit": 0
    },
    "Connections": [
        {
            "ID": 250463,
            "ConnectionTypeID": 25,
            "StatusTypeID": 50,
            "LevelID": 2,
            "PowerKW": 7,
            "CurrentTypeID": 10
        }
    ],
    "GeneralComments": "Badges et application PlugSurfing, Badges KiWhi et partenaires, Badges Sodetrel (Zen et Premium), Abonnés Plus de Bornes",
    "StatusTypeID": 50,
    "DateLastStatusUpdate": "2020-08-27T05:15:00Z",
    "DataQualityLevel": 2,
    "DateCreated": "2020-08-27T05:15:00Z",
    "SubmissionStatusTypeID": 100
}