{
    "IsRecentlyVerified": false,
    "ID": 29131,
    "UUID": "3FD7EF18-F183-4384-A457-DF4716195A55",
    "DataProviderID": 2,
    "DataProvidersReference": "60796",
    "UsageTypeID": 7,
    "AddressInfo": {
        "ID": 29477,
        "Title": "Indian Head Resort",
        "AddressLine1": "664 US Route 3",
        "Town": "Lincoln",
        "StateOrProvince": "NH",
        "Postcode": "03251",
        "CountryID": 2,
        "Latitude": 44.085084,
        "Longitude": -71.684773,
        "ContactTelephone1": "603-745-8000",
        "AccessComments": "24 hours daily\r\nPublic - Call ahead",
        "RelatedURL": "",
        "DistanceUnit": 0
    },
    "Connections": [
        {
            "ID": 32012,
            "ConnectionTypeID": 1,
            "LevelID": 2,
            "Amps": 16,
            "Voltage": 230,
            "PowerKW": 3.7,
            "CurrentTypeID": 10,
            "Quantity": 1
        }
    ],
    "DateLastStatusUpdate": "2020-06-26T03:07:00Z",
    "DataQualityLevel": 3,
    "DateCreated": "2014-11-28T03:39:00Z",
    "SubmissionStatusTypeID": 100
}