{
    "IsRecentlyVerified": false,
    "ID": 131801,
    "UUID": "5139BFAC-7A81-4FDB-B9F0-9F524F4316EE",
    "DataProviderID": 1,
    "OperatorID": 80,
    "UsageTypeID": 4,
    "AddressInfo": {
        "ID": 132147,
        "Title": "Rapolla Garibaldi | EnelX",
        "AddressLine1": "Piazza Garibaldi",
        "Town": "Rapolla",
        "StateOrProvince": "PZ",
        "Postcode": "85027",
        "CountryID": 112,
        "Latitude": 40.97694436979185,
        "Longitude": 15.674897540978009,
        "ContactTelephone1": "800.069.850",
        "RelatedURL": "https://www.enelx.com/it/it/emobility",
        "DistanceUnit": 0
    },
    "Connections": [
        {
            "ID": 184458,
            "ConnectionTypeID": 25,
            "StatusTypeID": 50,
            "LevelID": 2,
            "Amps": 32,
            "Voltage": 400,
            "PowerKW": 22,
            "CurrentTypeID": 20,
            "Quantity": 1
        },
        {
            "ID": 184459,
            "ConnectionTypeID": 36,
            "StatusTypeID": 50,
            "LevelID": 2,
            "Amps": 16,
            "Voltage": 240,
            "PowerKW": 3.7,
            "CurrentTypeID": 10,
            "Quantity": 1
        }
    ],
    "NumberOfPoints": 2,
    "StatusTypeID": 50,
    "DateLastStatusUpdate": "2019-09-13T10:06:00Z",
    "DataQualityLevel": 1,
    "DateCreated": "2019-09-13T10:06:00Z",
    "SubmissionStatusTypeID": 200
}