{
    "IsRecentlyVerified": false,
    "ID": 121907,
    "UUID": "EF244FB1-32C2-402C-9927-A8B46AB556AD",
    "DataProviderID": 2,
    "DataProvidersReference": "105501",
    "OperatorID": 5,
    "UsageTypeID": 1,
    "AddressInfo": {
        "ID": 122253,
        "Title": "TERMINAL AT DP",
        "AddressLine1": "4265 East Conant Street",
        "Town": "Long Beach",
        "StateOrProvince": "CA",
        "Postcode": "90808",
        "CountryID": 2,
        "Latitude": 33.8257543,
        "Longitude": -118.1434753,
        "ContactTelephone1": "888-758-4389",
        "AccessComments": "24 hours daily",
        "RelatedURL": "http://www.chargepoint.com/",
        "DistanceUnit": 0
    },
    "Connections": [
        {
            "ID": 171747,
            "ConnectionTypeID": 1,
            "LevelID": 2,
            "Amps": 16,
            "Voltage": 230,
            "PowerKW": 3,
            "CurrentTypeID": 10,
            "Quantity": 1
        }
    ],
    "DateLastStatusUpdate": "2019-04-06T05:02:00Z",
    "DataQualityLevel": 3,
    "DateCreated": "2019-04-06T05:02:00Z",
    "SubmissionStatusTypeID": 100
}