{
    "IsRecentlyVerified": false,
    "ID": 60587,
    "UUID": "5715D358-05B1-436C-BA14-6BE0DE1FD192",
    "DataProviderID": 1,
    "OperatorID": 80,
    "UsageTypeID": 4,
    "UsageCost": "0,40 €/kW",
    "AddressInfo": {
        "ID": 60933,
        "Title": "Eneldrive (ex SILFI) Brunelleschi",
        "AddressLine1": "Piazza Brunelleschi, 6",
        "Town": "Firenze",
        "StateOrProvince": "FI",
        "Postcode": "50121",
        "CountryID": 112,
        "Latitude": 43.77482418279932,
        "Longitude": 11.259867798730294,
        "RelatedURL": "http://eneldrive.it",
        "DistanceUnit": 0
    },
    "Connections": [
        {
            "ID": 76783,
            "ConnectionTypeID": 36,
            "StatusTypeID": 50,
            "LevelID": 2,
            "Amps": 16,
            "Voltage": 240,
            "PowerKW": 3,
            "CurrentTypeID": 10,
            "Quantity": 3
        },
        {
            "ID": 76784,
            "ConnectionTypeID": 25,
            "StatusTypeID": 50,
            "LevelID": 2,
            "Amps": 32,
            "Voltage": 400,
            "PowerKW": 22,
            "CurrentTypeID": 20,
            "Quantity": 1
        }
    ],
    "NumberOfPoints": 4,
    "StatusTypeID": 50,
    "DateLastStatusUpdate": "2016-02-03T17:03:00Z",
    "DataQualityLevel": 1,
    "DateCreated": "2016-02-03T17:03:00Z",
    "SubmissionStatusTypeID": 200
}