{
    "IsRecentlyVerified": false,
    "ID": 34917,
    "UUID": "7D3C4F4C-6E28-40F2-907C-C0F914023994",
    "DataProviderID": 26,
    "DataProvidersReference": "48705",
    "OperatorID": 178,
    "OperatorsReference": "EVnetNL REE584",
    "UsageCost": "0.00 jaarabonnement",
    "AddressInfo": {
        "ID": 35263,
        "Title": "Meidoornplantsoen 39",
        "AddressLine1": "Meidoornplantsoen 39",
        "Town": "Wageningen",
        "Postcode": "6706 DB",
        "CountryID": 159,
        "Latitude": 51.972921,
        "Longitude": 5.679711,
        "ContactTelephone1": "0800-3522365",
        "RelatedURL": "http://www.evnet.nl",
        "DistanceUnit": 0
    },
    "Connections": [
        {
            "ID": 38428,
            "ConnectionTypeID": 25,
            "LevelID": 1,
            "PowerKW": 2.3,
            "CurrentTypeID": 10
        }
    ],
    "NumberOfPoints": 1,
    "StatusTypeID": 50,
    "DateLastStatusUpdate": "2016-06-04T02:43:00Z",
    "DataQualityLevel": 3,
    "DateCreated": "2015-01-09T06:04:00Z",
    "SubmissionStatusTypeID": 100
}