{
    "IsRecentlyVerified": false,
    "ID": 140784,
    "UUID": "0EAC58FB-A491-4B20-BB10-F222BC11DFA1",
    "DataProviderID": 2,
    "DataProvidersReference": "149739",
    "OperatorID": 59,
    "UsageTypeID": 2,
    "AddressInfo": {
        "ID": 141136,
        "Title": "Greenlots - 112121U",
        "AddressLine1": "225 Clifford Avenue",
        "Town": "Redwood City",
        "StateOrProvince": "CA",
        "Postcode": "94062",
        "CountryID": 2,
        "Latitude": 37.481527,
        "Longitude": -122.262787,
        "ContactTelephone1": "855-900-7584",
        "AccessComments": "24 hours daily",
        "RelatedURL": "http://greenlots.com/",
        "DistanceUnit": 0
    },
    "Connections": [
        {
            "ID": 196510,
            "ConnectionTypeID": 1,
            "LevelID": 2,
            "Amps": 16,
            "Voltage": 230,
            "PowerKW": 3.7,
            "CurrentTypeID": 10,
            "Quantity": 25
        }
    ],
    "StatusTypeID": 50,
    "DateLastStatusUpdate": "2020-06-26T02:59:00Z",
    "DataQualityLevel": 3,
    "DateCreated": "2019-12-24T09:13:00Z",
    "SubmissionStatusTypeID": 100
}