{
    "IsRecentlyVerified": false,
    "ID": 180954,
    "UUID": "417A187F-C6CA-4F0D-9E08-294A73D2F665",
    "DataProviderID": 29,
    "DataProvidersReference": "2438",
    "OperatorID": 3403,
    "AddressInfo": {
        "ID": 181313,
        "Title": "Bühleck Nord BAB44 ",
        "AddressLine1": "Bühleck Nord BAB44 ",
        "Town": "Zierenberg",
        "Postcode": "34289",
        "CountryID": 87,
        "Latitude": 51.38209,
        "Longitude": 9.24886,
        "DistanceUnit": 0
    },
    "Connections": [
        {
            "ID": 284678,
            "ConnectionTypeID": 1036,
            "StatusTypeID": 50,
            "LevelID": 3,
            "PowerKW": 50,
            "CurrentTypeID": 20
        },
        {
            "ID": 284679,
            "ConnectionTypeID": 33,
            "StatusTypeID": 50,
            "LevelID": 3,
            "PowerKW": 43,
            "CurrentTypeID": 30
        },
        {
            "ID": 299263,
            "ConnectionTypeID": 2,
            "StatusTypeID": 50,
            "LevelID": 3,
            "PowerKW": 43,
            "CurrentTypeID": 30
        }
    ],
    "StatusTypeID": 50,
    "DateLastStatusUpdate": "2021-07-12T02:47:00Z",
    "MetadataValues": [
        {
            "ID": 13248,
            "MetadataFieldID": 4,
            "ItemValue": "Data from the German chargepoint registry provided by Bundesnetzagentur.de under the CC-BY 4.0 license"
        }
    ],
    "DataQualityLevel": 3,
    "DateCreated": "2021-07-08T10:01:00Z",
    "SubmissionStatusTypeID": 100
}