{
    "IsRecentlyVerified": false,
    "ID": 173085,
    "UUID": "AE4B1F36-F5B7-4503-BAA5-228BA0F0B649",
    "DataProviderID": 1,
    "OperatorID": 3378,
    "UsageTypeID": 1,
    "AddressInfo": {
        "ID": 173444,
        "Title": "MOL Plugee Mosonmagyaróvár M1 N",
        "AddressLine1": "",
        "Town": "Mosonmagyaróvár",
        "Postcode": "",
        "CountryID": 104,
        "Latitude": 47.87153982838791,
        "Longitude": 17.21696448841294,
        "ContactTelephone1": "+36 (1) 998 9888",
        "RelatedURL": "https://molplugee.hu/hu",
        "DistanceUnit": 0
    },
    "Connections": [
        {
            "ID": 264868,
            "ConnectionTypeID": 33,
            "StatusTypeID": 50,
            "LevelID": 3,
            "PowerKW": 75,
            "CurrentTypeID": 30,
            "Quantity": 1
        },
        {
            "ID": 264869,
            "ConnectionTypeID": 2,
            "StatusTypeID": 50,
            "LevelID": 3,
            "PowerKW": 75,
            "CurrentTypeID": 30,
            "Quantity": 1
        },
        {
            "ID": 264870,
            "ConnectionTypeID": 33,
            "StatusTypeID": 50,
            "LevelID": 3,
            "PowerKW": 50,
            "CurrentTypeID": 30,
            "Quantity": 1
        },
        {
            "ID": 264871,
            "ConnectionTypeID": 2,
            "StatusTypeID": 50,
            "LevelID": 3,
            "PowerKW": 50,
            "CurrentTypeID": 30,
            "Quantity": 1
        },
        {
            "ID": 264872,
            "ConnectionTypeID": 1036,
            "StatusTypeID": 50,
            "LevelID": 3,
            "PowerKW": 43,
            "CurrentTypeID": 20,
            "Quantity": 1
        }
    ],
    "NumberOfPoints": 2,
    "StatusTypeID": 50,
    "DateLastStatusUpdate": "2021-03-03T10:12:00Z",
    "DataQualityLevel": 1,
    "DateCreated": "2021-03-03T08:22:00Z",
    "SubmissionStatusTypeID": 200
}