{
    "IsRecentlyVerified": false,
    "ID": 184093,
    "UUID": "1A5CAF45-24F8-46E8-B112-D6A426CCB49A",
    "DataProviderID": 29,
    "DataProvidersReference": "15714",
    "OperatorID": 220,
    "AddressInfo": {
        "ID": 184452,
        "Title": "Sportallee 81",
        "AddressLine1": "Sportallee 81",
        "Town": "Hamburg",
        "Postcode": "22335",
        "CountryID": 87,
        "Latitude": 53.6176,
        "Longitude": 10.00038,
        "DistanceUnit": 0
    },
    "Connections": [
        {
            "ID": 291887,
            "ConnectionTypeID": 28,
            "StatusTypeID": 50,
            "LevelID": 2,
            "PowerKW": 22,
            "CurrentTypeID": 20
        },
        {
            "ID": 291888,
            "ConnectionTypeID": 25,
            "StatusTypeID": 50,
            "LevelID": 2,
            "PowerKW": 22,
            "CurrentTypeID": 20
        },
        {
            "ID": 302036,
            "ConnectionTypeID": 28,
            "StatusTypeID": 50,
            "LevelID": 2,
            "PowerKW": 22,
            "CurrentTypeID": 20
        },
        {
            "ID": 302037,
            "ConnectionTypeID": 25,
            "StatusTypeID": 50,
            "LevelID": 2,
            "PowerKW": 22,
            "CurrentTypeID": 20
        }
    ],
    "StatusTypeID": 50,
    "DateLastStatusUpdate": "2021-07-12T02:51:00Z",
    "MetadataValues": [
        {
            "ID": 16385,
            "MetadataFieldID": 4,
            "ItemValue": "Data from the German chargepoint registry provided by Bundesnetzagentur.de under the CC-BY 4.0 license"
        }
    ],
    "DataQualityLevel": 3,
    "DateCreated": "2021-07-08T10:04:00Z",
    "SubmissionStatusTypeID": 100
}