{
    "IsRecentlyVerified": false,
    "ID": 144156,
    "UUID": "CA89627A-CBC5-4D8F-A61A-0290C879F098",
    "DataProviderID": 2,
    "DataProvidersReference": "147387",
    "OperatorID": 90,
    "UsageTypeID": 1,
    "AddressInfo": {
        "ID": 144508,
        "Title": "Hôtel de ville - Sainte-Catherine",
        "AddressLine1": "5465 Boulevard Marie-Victorin",
        "Town": "Sainte-Catherine",
        "StateOrProvince": "QC",
        "Postcode": "J5C 1M1",
        "CountryID": 44,
        "Latitude": 45.405253,
        "Longitude": -73.57169,
        "ContactTelephone1": "877-505-2674",
        "AccessComments": "24 hours daily",
        "RelatedURL": "https://lecircuitelectrique.com/",
        "DistanceUnit": 0
    },
    "Connections": [
        {
            "ID": 200637,
            "ConnectionTypeID": 1,
            "LevelID": 2,
            "Amps": 16,
            "Voltage": 230,
            "PowerKW": 3.7,
            "CurrentTypeID": 10,
            "Quantity": 2
        }
    ],
    "StatusTypeID": 50,
    "DateLastStatusUpdate": "2020-06-26T03:09:00Z",
    "DataQualityLevel": 3,
    "DateCreated": "2019-12-24T09:23:00Z",
    "SubmissionStatusTypeID": 100
}