{
    "IsRecentlyVerified": false,
    "ID": 134290,
    "UUID": "044C90F4-373B-4D91-A8C2-D42D405C6073",
    "DataProviderID": 1,
    "OperatorID": 80,
    "UsageTypeID": 4,
    "AddressInfo": {
        "ID": 134636,
        "Title": "CONAD SUPERSTORE Pontecagnano | EnelX",
        "AddressLine1": "Via Aldo Moro",
        "Town": "Pontecagnano Faiano",
        "StateOrProvince": "SA",
        "Postcode": "84098",
        "CountryID": 112,
        "Latitude": 40.6398377916189,
        "Longitude": 14.8765281821026,
        "ContactTelephone1": "800.069.850",
        "RelatedURL": "https://www.enelx.com/it/it/emobility",
        "DistanceUnit": 0
    },
    "Connections": [
        {
            "ID": 187931,
            "ConnectionTypeID": 25,
            "StatusTypeID": 50,
            "LevelID": 2,
            "Amps": 32,
            "Voltage": 400,
            "PowerKW": 22,
            "CurrentTypeID": 20,
            "Quantity": 1
        },
        {
            "ID": 187932,
            "ConnectionTypeID": 36,
            "StatusTypeID": 50,
            "LevelID": 2,
            "Amps": 16,
            "Voltage": 240,
            "PowerKW": 3.7,
            "CurrentTypeID": 10,
            "Quantity": 1
        }
    ],
    "NumberOfPoints": 2,
    "StatusTypeID": 50,
    "DateLastStatusUpdate": "2019-11-07T11:46:00Z",
    "DataQualityLevel": 1,
    "DateCreated": "2019-11-07T11:46:00Z",
    "SubmissionStatusTypeID": 200
}