{
    "IsRecentlyVerified": false,
    "ID": 112787,
    "UUID": "E6D2C35B-BA48-4F2E-901E-03224AA047D1",
    "DataProviderID": 1,
    "OperatorID": 26,
    "UsageTypeID": 1,
    "UsageCost": "Free",
    "AddressInfo": {
        "ID": 113133,
        "Title": "Holiday Inn Hattiesburg",
        "AddressLine1": "6553 US-49",
        "Town": "Hattiesburg",
        "StateOrProvince": "MS",
        "Postcode": "39401",
        "CountryID": 2,
        "Latitude": 31.34937451712601,
        "Longitude": -89.33967345412509,
        "ContactTelephone1": "601.990.9340",
        "ContactEmail": "Sales@hihattiesburg.com",
        "AccessComments": "Charging Station access available 24/7",
        "RelatedURL": "https://www.ihg.com/holidayinn/hotels/us/en/hattiesburg/hbghb/hoteldetail?qDest=Hattiesburg,%20Mississippi,%20United%20States&qCiD=14&qCoD=15&qCiMy=102018&qCoMy=102018&qAdlt=1&qChld=0&qRms=1&qWch=0&qSmP=1&qIta=99801505&qRtP=6CBARC&qAAR=6CBARC&qAkamaiCC=US&srb_u=1&qRad=30&qRdU=mi&presentationViewType=null&qSrt=sDD&qBrs=re.ic.in.vn.cp.vx.hi.ex.rs.cv.sb.cw.ma.ul.ki.va",
        "DistanceUnit": 0
    },
    "Connections": [
        {
            "ID": 158826,
            "ConnectionTypeID": 1,
            "StatusTypeID": 50,
            "LevelID": 2,
            "Amps": 32,
            "Voltage": 240,
            "PowerKW": 7.7,
            "Quantity": 2
        }
    ],
    "NumberOfPoints": 2,
    "StatusTypeID": 50,
    "DateLastStatusUpdate": "2018-11-14T17:06:00Z",
    "DataQualityLevel": 1,
    "DateCreated": "2018-11-14T16:45:00Z",
    "SubmissionStatusTypeID": 200
}