{
    "IsRecentlyVerified": false,
    "ID": 137901,
    "UUID": "E628BA9C-8E86-4D3E-9208-5F2EC8E8146D",
    "DataProviderID": 2,
    "DataProvidersReference": "147142",
    "OperatorID": 9,
    "UsageTypeID": 2,
    "AddressInfo": {
        "ID": 138250,
        "Title": "The Irvine Group",
        "AddressLine1": "12544 High Bluff Drive",
        "Town": "San Diego",
        "StateOrProvince": "CA",
        "Postcode": "92130",
        "CountryID": 2,
        "Latitude": 32.9464065,
        "Longitude": -117.2406343,
        "ContactTelephone1": "888-998-2546",
        "AccessComments": "MON: 24 hours | TUE: 24 hours | WED: 24 hours | THU: 24 hours | FRI: 24 hours | SAT: 24 hours | SUN: 24 hours",
        "RelatedURL": "http://www.blinkcharging.com/",
        "DistanceUnit": 0
    },
    "Connections": [
        {
            "ID": 192923,
            "ConnectionTypeID": 1,
            "LevelID": 2,
            "Amps": 16,
            "Voltage": 230,
            "PowerKW": 3,
            "CurrentTypeID": 10,
            "Quantity": 3
        }
    ],
    "StatusTypeID": 50,
    "DateLastStatusUpdate": "2019-12-24T09:06:00Z",
    "DataQualityLevel": 3,
    "DateCreated": "2019-12-24T09:06:00Z",
    "SubmissionStatusTypeID": 100
}