{
    "IsRecentlyVerified": false,
    "ID": 148735,
    "UUID": "0462BB95-E860-406C-9664-0053C390C589",
    "DataProviderID": 1,
    "OperatorID": 3,
    "OperatorsReference": "PG-70190,PG-84426",
    "UsageTypeID": 4,
    "UsageCost": "Free",
    "AddressInfo": {
        "ID": 149087,
        "Title": "Tesco Superstore-Windsor",
        "AddressLine1": "Dedworth Road",
        "Town": "Windsor",
        "Postcode": "SL4 4JT",
        "CountryID": 1,
        "Latitude": 51.478031,
        "Longitude": -0.649666,
        "DistanceUnit": 0
    },
    "Connections": [
        {
            "ID": 206524,
            "ConnectionTypeID": 25,
            "StatusTypeID": 50,
            "LevelID": 2,
            "Amps": 32,
            "Voltage": 230,
            "PowerKW": 7,
            "CurrentTypeID": 10,
            "Quantity": 4
        }
    ],
    "NumberOfPoints": 4,
    "GeneralComments": "This is an open charge unit installed at the Tesco super store at Dedworth Road, Windsor",
    "StatusTypeID": 50,
    "DateLastStatusUpdate": "2020-02-10T06:26:00Z",
    "DataQualityLevel": 1,
    "DateCreated": "2020-02-09T22:24:00Z",
    "SubmissionStatusTypeID": 200
}