{
    "IsRecentlyVerified": false,
    "ID": 100864,
    "UUID": "4268265D-7BBB-47DE-8893-D33D3BB3D11B",
    "DataProviderID": 1,
    "OperatorID": 23,
    "OperatorsReference": "41229",
    "UsageTypeID": 4,
    "AddressInfo": {
        "ID": 101210,
        "Title": "Merchants Garage",
        "AddressLine1": "31 S Meridian St",
        "Town": "Indianapolis",
        "StateOrProvince": "Indiana",
        "Postcode": "46204",
        "CountryID": 2,
        "Latitude": 39.766066,
        "Longitude": -86.157421,
        "ContactTelephone1": "(317) 638-8062",
        "DistanceUnit": 0
    },
    "Connections": [
        {
            "ID": 142444,
            "ConnectionTypeID": 30,
            "StatusTypeID": 50,
            "LevelID": 2,
            "PowerKW": 16,
            "CurrentTypeID": 20,
            "Quantity": 7
        }
    ],
    "NumberOfPoints": 7,
    "GeneralComments": "7 Tesla Connectors, up to 16kW.Available to the public. Self park.",
    "StatusTypeID": 50,
    "DateLastStatusUpdate": "2018-03-10T07:01:00Z",
    "DataQualityLevel": 1,
    "DateCreated": "2018-03-10T07:01:00Z",
    "SubmissionStatusTypeID": 200
}