{
    "IsRecentlyVerified": false,
    "ID": 171382,
    "UUID": "29EBA2E7-5507-4852-BC1D-860C10FB9A97",
    "DataProviderID": 1,
    "OperatorID": 23,
    "OperatorsReference": "55409",
    "UsageTypeID": 4,
    "UsageCost": "$0.26/kWh; other tariffs for older cars",
    "AddressInfo": {
        "ID": 171741,
        "Title": "Irvine, Ca - Main Street Supercharger",
        "AddressLine1": "1920 Main Street",
        "Town": "Irvine",
        "StateOrProvince": "CA",
        "Postcode": "92614",
        "CountryID": 2,
        "Latitude": 33.68459,
        "Longitude": -117.851932,
        "DistanceUnit": 0
    },
    "Connections": [
        {
            "ID": 262016,
            "ConnectionTypeID": 27,
            "StatusTypeID": 50,
            "LevelID": 3,
            "PowerKW": 120,
            "CurrentTypeID": 30,
            "Quantity": 24
        }
    ],
    "NumberOfPoints": 24,
    "GeneralComments": "Charging24 Superchargers, available 24/7, up to 72kW",
    "StatusTypeID": 50,
    "DateLastStatusUpdate": "2020-12-31T06:36:00Z",
    "DataQualityLevel": 1,
    "DateCreated": "2020-12-31T06:36:00Z",
    "SubmissionStatusTypeID": 200
}