{
    "IsRecentlyVerified": false,
    "ID": 28753,
    "UUID": "B6C983C4-EA97-4987-BB1D-D57889CF248B",
    "DataProviderID": 2,
    "DataProvidersReference": "55685",
    "OperatorID": 5,
    "UsageTypeID": 1,
    "AddressInfo": {
        "ID": 29099,
        "Title": "CORP CENTER 1&2",
        "AddressLine1": "1101 Skokie Blvd.",
        "Town": "Northbrook",
        "StateOrProvince": "IL",
        "Postcode": "60062",
        "CountryID": 2,
        "Latitude": 42.1317468,
        "Longitude": -87.7859592,
        "ContactTelephone1": "888-758-4389",
        "AccessComments": "24 hours daily",
        "RelatedURL": "http://www.chargepoint.com/",
        "DistanceUnit": 0
    },
    "Connections": [
        {
            "ID": 31581,
            "ConnectionTypeID": 1,
            "LevelID": 2,
            "Amps": 16,
            "Voltage": 230,
            "PowerKW": 3.7,
            "CurrentTypeID": 10,
            "Quantity": 2
        }
    ],
    "DateLastStatusUpdate": "2020-06-26T03:05:00Z",
    "DataQualityLevel": 3,
    "DateCreated": "2014-11-28T03:38:00Z",
    "SubmissionStatusTypeID": 100
}