{
    "IsRecentlyVerified": false,
    "ID": 133469,
    "UUID": "91CC3E8B-E43A-48B5-BBC7-8FB249495191",
    "DataProviderID": 1,
    "OperatorID": 80,
    "UsageTypeID": 4,
    "AddressInfo": {
        "ID": 133815,
        "Title": "Casalbeltrame Impianti Sportivi | EnelX",
        "AddressLine1": "Via Giuseppe Bermani",
        "Town": "Casalbeltrame",
        "StateOrProvince": "NO",
        "Postcode": "28060",
        "CountryID": 112,
        "Latitude": 45.4374441878154,
        "Longitude": 8.46445859887581,
        "ContactTelephone1": "800.069.850",
        "RelatedURL": "https://www.enelx.com/it/it/emobility",
        "DistanceUnit": 0
    },
    "Connections": [
        {
            "ID": 186828,
            "ConnectionTypeID": 25,
            "StatusTypeID": 50,
            "LevelID": 2,
            "Amps": 32,
            "Voltage": 400,
            "PowerKW": 22,
            "CurrentTypeID": 20,
            "Quantity": 2
        }
    ],
    "NumberOfPoints": 2,
    "StatusTypeID": 50,
    "DateLastStatusUpdate": "2019-10-18T15:10:00Z",
    "DataQualityLevel": 1,
    "DateCreated": "2019-10-18T15:10:00Z",
    "SubmissionStatusTypeID": 200
}