{
    "IsRecentlyVerified": false,
    "ID": 53534,
    "UUID": "38ADD777-6C8A-4684-9072-A4326FAF8A7A",
    "DataProviderID": 1,
    "DataProvidersReference": "2954",
    "AddressInfo": {
        "ID": 53880,
        "Title": "Säkylän S-marketin parkkipaikka",
        "AddressLine1": "Pyhäjärventie 16",
        "Town": "Säkylä Keskus",
        "StateOrProvince": "Satakunta",
        "Postcode": "27800",
        "CountryID": 79,
        "Latitude": 61.048559,
        "Longitude": 22.350025,
        "AccessComments": "Säkylän S-market",
        "DistanceUnit": 0
    },
    "Connections": [
        {
            "ID": 66655,
            "ConnectionTypeID": 0,
            "LevelID": 2,
            "Amps": 16,
            "Voltage": 230,
            "PowerKW": 3.68
        },
        {
            "ID": 225587,
            "ConnectionTypeID": 0,
            "Reference": "1",
            "LevelID": 2,
            "Amps": 32,
            "Voltage": 230,
            "PowerKW": 7.4,
            "Comments": "Mode 3"
        }
    ],
    "NumberOfPoints": 1,
    "DateLastStatusUpdate": "2020-05-26T08:24:00Z",
    "DataQualityLevel": 2,
    "DateCreated": "2015-09-20T11:33:00Z",
    "SubmissionStatusTypeID": 100
}