{
    "IsRecentlyVerified": false,
    "ID": 79217,
    "UUID": "7AA2A911-6285-4D91-A295-5B043F6756AF",
    "DataProviderID": 1,
    "OperatorID": 23,
    "OperatorsReference": "7834",
    "UsageTypeID": 6,
    "UsageCost": "Free",
    "AddressInfo": {
        "ID": 79563,
        "Title": "Inn At the Quay",
        "AddressLine1": "900 Quayside DR",
        "Town": "New Westminster",
        "StateOrProvince": "BC",
        "Postcode": "V3M 6G2",
        "CountryID": 44,
        "Latitude": 49.199792,
        "Longitude": -122.912603,
        "ContactTelephone1": "(800) 663-2001",
        "DistanceUnit": 0
    },
    "Connections": [
        {
            "ID": 113836,
            "ConnectionTypeID": 30,
            "StatusTypeID": 50,
            "LevelID": 2,
            "PowerKW": 13,
            "CurrentTypeID": 20,
            "Quantity": 1
        }
    ],
    "NumberOfPoints": 1,
    "GeneralComments": "1 Tesla Connector, up to 13kW.Available for patrons only. Please see front desk.",
    "StatusTypeID": 50,
    "DateLastStatusUpdate": "2017-01-26T21:09:00Z",
    "DataQualityLevel": 1,
    "DateCreated": "2017-01-26T21:09:00Z",
    "SubmissionStatusTypeID": 200
}