{
    "UserComments": [
        {
            "ID": 143,
            "ChargePointID": 11714,
            "CommentTypeID": 10,
            "UserName": "H.Savelberg",
            "Comment": "Connector is Mode 3 instead of Mode 2",
            "DateCreated": "2012-07-03T16:19:13.68Z"
        }
    ],
    "IsRecentlyVerified": false,
    "ID": 11714,
    "UUID": "C9612D3F-B401-4B8A-834C-3314A560D39F",
    "DataProviderID": 1,
    "OperatorID": 1,
    "UsageTypeID": 5,
    "UsageCost": "Free if Guest",
    "AddressInfo": {
        "ID": 11611,
        "Title": "Wirtzfeld Valley Guest House",
        "AddressLine1": "Wirtzfeld",
        "AddressLine2": "Zur Holzwarche 29",
        "Town": "Büllingen",
        "StateOrProvince": "Walloon Region",
        "Postcode": "4761",
        "CountryID": 26,
        "Latitude": 50.4236809,
        "Longitude": 6.261177099999941,
        "ContactTelephone1": "+3280642793",
        "ContactTelephone2": "+32495223251",
        "ContactEmail": "info@wirtzfeld-valley.be",
        "AccessComments": "Gps Systems do not always find the new street names , you can also search for Wirtzfeld 140",
        "RelatedURL": "http://www.wirtzfeldvalley.com",
        "DistanceUnit": 0
    },
    "Connections": [
        {
            "ID": 9065,
            "ConnectionTypeID": 1,
            "StatusTypeID": 50,
            "LevelID": 2,
            "Amps": 16,
            "Voltage": 220,
            "PowerKW": 3.5,
            "Quantity": 1
        }
    ],
    "NumberOfPoints": 1,
    "GeneralComments": "Other people pay for electricity",
    "StatusTypeID": 50,
    "DateLastStatusUpdate": "2012-11-17T14:04:00Z",
    "DataQualityLevel": 1,
    "DateCreated": "2012-06-19T14:45:00Z",
    "SubmissionStatusTypeID": 200
}