{
    "IsRecentlyVerified": false,
    "ID": 8242,
    "UUID": "B9EEE6C2-2FE2-4EF9-BFA7-2FF32375C8E2",
    "DataProviderID": 15,
    "DataProvidersReference": "7310",
    "OperatorID": 26,
    "AddressInfo": {
        "ID": 8139,
        "Title": "2010 US Highway 75 North",
        "AddressLine1": "2010 US Highway 75 North",
        "Town": "Denison",
        "StateOrProvince": "TX",
        "Postcode": "75020",
        "CountryID": 2,
        "Latitude": 33.77965,
        "Longitude": -96.58343,
        "ContactTelephone1": " (903) 463-9800",
        "RelatedURL": "http://carstations.com/7310",
        "DistanceUnit": 0
    },
    "Connections": [
        {
            "ID": 5671,
            "ConnectionTypeID": 1,
            "Reference": "J1772",
            "LevelID": 2
        }
    ],
    "StatusTypeID": 0,
    "DateLastStatusUpdate": "2017-11-04T14:04:00Z",
    "DataQualityLevel": 1,
    "DateCreated": "2011-11-11T12:06:00Z",
    "SubmissionStatusTypeID": 100
}