{
    "IsRecentlyVerified": false,
    "ID": 170953,
    "UUID": "71E258B5-BBC3-44B9-847D-3EBD4A58CDEE",
    "DataProviderID": 1,
    "OperatorID": 80,
    "UsageTypeID": 4,
    "AddressInfo": {
        "ID": 171312,
        "Title": "Quattromiglia Brodolini | EnelX",
        "AddressLine1": "Via Giacomo Brodolini",
        "AddressLine2": "Quattromiglia ",
        "Town": "Rende",
        "StateOrProvince": "CS",
        "Postcode": "87036",
        "CountryID": 112,
        "Latitude": 39.32883562842298,
        "Longitude": 16.244008719480462,
        "ContactTelephone1": "800.069.850",
        "RelatedURL": "https://www.enelx.com/it/it/emobility",
        "DistanceUnit": 0
    },
    "Connections": [
        {
            "ID": 261192,
            "ConnectionTypeID": 25,
            "StatusTypeID": 50,
            "LevelID": 2,
            "Amps": 32,
            "Voltage": 400,
            "PowerKW": 22,
            "CurrentTypeID": 20,
            "Quantity": 2
        }
    ],
    "NumberOfPoints": 2,
    "StatusTypeID": 50,
    "DateLastStatusUpdate": "2020-12-14T16:25:00Z",
    "DataQualityLevel": 1,
    "DateCreated": "2020-12-14T16:25:00Z",
    "SubmissionStatusTypeID": 200
}