{
    "IsRecentlyVerified": false,
    "ID": 66456,
    "UUID": "2B098974-0524-414C-9E24-789EE185EA73",
    "DataProviderID": 1,
    "OperatorID": 1,
    "UsageTypeID": 1,
    "UsageCost": "Frei",
    "AddressInfo": {
        "ID": 66802,
        "Title": "E-Bike Station Gemeindezentrum Emmaus",
        "AddressLine1": "Hauptstraße 27",
        "Town": "Wuppertal",
        "StateOrProvince": "Wuppertal",
        "Postcode": "42349",
        "CountryID": 87,
        "Latitude": 51.20639,
        "Longitude": 7.132100000000037,
        "AccessComments": "3 Ladefächer nutzbar täglich von 7-22Uhr, Betreiber sind die Wuppertaler Stadtwerke WSW. ",
        "RelatedURL": "http://www.wsw-online.de/wsw-energie-wasser/privatkunden/services/aktuelles/artikel/detail/pedelecs-auftanken-an-der-sambatrasse/",
        "DistanceUnit": 0
    },
    "Connections": [
        {
            "ID": 91833,
            "ConnectionTypeID": 28,
            "StatusTypeID": 50,
            "LevelID": 1,
            "Amps": 10,
            "Voltage": 230,
            "PowerKW": 2.3,
            "CurrentTypeID": 10,
            "Quantity": 3
        }
    ],
    "NumberOfPoints": 3,
    "StatusTypeID": 50,
    "DateLastStatusUpdate": "2016-05-20T11:39:00Z",
    "DataQualityLevel": 1,
    "DateCreated": "2016-05-20T11:39:00Z",
    "SubmissionStatusTypeID": 200
}