{
    "IsRecentlyVerified": false,
    "ID": 116370,
    "UUID": "53A4444F-DF08-403E-A559-F1BFC304DF96",
    "DataProviderID": 1,
    "DataProvidersReference": "5232",
    "AddressInfo": {
        "ID": 116716,
        "Title": "Kundparkering på ICA Maxi i Södertälje",
        "AddressLine1": "Genetaleden 9",
        "Town": "SÖDERTÄLJE",
        "StateOrProvince": "STOCKHOLM",
        "Postcode": "15159",
        "CountryID": 216,
        "Latitude": 59.18692,
        "Longitude": 17.5782,
        "AccessComments": "Kundparkering på ICA Maxi i Södertälje",
        "DistanceUnit": 0
    },
    "Connections": [
        {
            "ID": 164007,
            "ConnectionTypeID": 0,
            "Reference": "1",
            "LevelID": 2,
            "Amps": 32,
            "Voltage": 400,
            "PowerKW": 22,
            "Comments": "Mode 3"
        },
        {
            "ID": 164008,
            "ConnectionTypeID": 0,
            "Reference": "2",
            "LevelID": 2,
            "Amps": 32,
            "Voltage": 400,
            "PowerKW": 22,
            "Comments": "Mode 3"
        },
        {
            "ID": 164009,
            "ConnectionTypeID": 0,
            "Reference": "3",
            "LevelID": 2,
            "Amps": 32,
            "Voltage": 400,
            "PowerKW": 22,
            "Comments": "Mode 3"
        },
        {
            "ID": 164010,
            "ConnectionTypeID": 0,
            "Reference": "4",
            "LevelID": 2,
            "Amps": 32,
            "Voltage": 400,
            "PowerKW": 22,
            "Comments": "Mode 3"
        }
    ],
    "NumberOfPoints": 4,
    "DateLastStatusUpdate": "2020-05-26T08:22:00Z",
    "DataQualityLevel": 2,
    "DateCreated": "2019-02-11T09:16:00Z",
    "SubmissionStatusTypeID": 100
}