{
    "IsRecentlyVerified": false,
    "ID": 148968,
    "UUID": "2D21F359-C2C1-41BB-AAC3-1AFD01DB0C78",
    "DataProviderID": 18,
    "DataProvidersReference": "346c40ce756706548fbb20e9a9233b51",
    "OperatorID": 3341,
    "UsageTypeID": 1,
    "AddressInfo": {
        "ID": 149321,
        "Title": "Out Westgate",
        "AddressLine1": "Out Westgate",
        "Town": "Bury St Edmunds",
        "Postcode": "IP33 3NZ",
        "CountryID": 1,
        "Latitude": 52.240279,
        "Longitude": 0.70902,
        "AccessComments": "",
        "RelatedURL": "http://www.aptcontrols.co.uk",
        "DistanceUnit": 0
    },
    "Connections": [
        {
            "ID": 206869,
            "ConnectionTypeID": 25,
            "Reference": "1",
            "StatusTypeID": 50,
            "LevelID": 2,
            "Amps": 16,
            "Voltage": 230,
            "PowerKW": 3.7,
            "CurrentTypeID": 10
        }
    ],
    "StatusTypeID": 0,
    "DateLastStatusUpdate": "2021-07-12T03:39:00Z",
    "MetadataValues": [
        {
            "ID": 7007,
            "MetadataFieldID": 4,
            "ItemValue": "Contains public sector information licensed under the Open Government Licence v2.0. http://www.nationalarchives.gov.uk/doc/open-government-licence/version/2/"
        }
    ],
    "DataQualityLevel": 3,
    "DateCreated": "2020-02-14T12:01:00Z",
    "SubmissionStatusTypeID": 100
}