{
    "IsRecentlyVerified": false,
    "ID": 166874,
    "UUID": "783612BD-67B1-4637-9B16-B15620526C5C",
    "DataProviderID": 28,
    "DataProvidersReference": "FR*H05*P62300*001",
    "OperatorID": 3409,
    "UsageTypeID": 5,
    "AddressInfo": {
        "ID": 167233,
        "Title": "ÉQUIHEN-PLAGE - Rue Charles Cazin",
        "AddressLine1": "Rue Charles Cazin 62224 ÉQUIHEN-PLAGE",
        "CountryID": 80,
        "Latitude": 50.673531,
        "Longitude": 1.5713,
        "AccessComments": "24h/24 7j/7",
        "DistanceUnit": 0
    },
    "Connections": [
        {
            "ID": 252449,
            "ConnectionTypeID": 28,
            "StatusTypeID": 50,
            "LevelID": 2,
            "PowerKW": 22,
            "CurrentTypeID": 10
        },
        {
            "ID": 252450,
            "ConnectionTypeID": 1036,
            "StatusTypeID": 50,
            "LevelID": 2,
            "PowerKW": 22,
            "CurrentTypeID": 20
        },
        {
            "ID": 252451,
            "ConnectionTypeID": 28,
            "StatusTypeID": 50,
            "LevelID": 2,
            "PowerKW": 22,
            "CurrentTypeID": 10
        },
        {
            "ID": 252452,
            "ConnectionTypeID": 1036,
            "StatusTypeID": 50,
            "LevelID": 2,
            "PowerKW": 22,
            "CurrentTypeID": 20
        }
    ],
    "GeneralComments": "Recharge par badge et avec une application smartphone",
    "StatusTypeID": 50,
    "DateLastStatusUpdate": "2020-08-27T05:16:00Z",
    "DataQualityLevel": 2,
    "DateCreated": "2020-08-27T05:16:00Z",
    "SubmissionStatusTypeID": 100
}