{
    "IsRecentlyVerified": false,
    "ID": 176751,
    "UUID": "E4F29A7D-B1E6-4A06-9120-79CF7AE3269D",
    "DataProviderID": 29,
    "DataProvidersReference": "10108",
    "OperatorID": 45,
    "AddressInfo": {
        "ID": 177110,
        "Title": "Jahnstraße 41",
        "AddressLine1": "Jahnstraße 41",
        "Town": "Engen",
        "Postcode": "78234",
        "CountryID": 87,
        "Latitude": 47.856282,
        "Longitude": 8.7918,
        "DistanceUnit": 0
    },
    "Connections": [
        {
            "ID": 275024,
            "ConnectionTypeID": 33,
            "StatusTypeID": 50,
            "LevelID": 3,
            "PowerKW": 22,
            "CurrentTypeID": 30
        },
        {
            "ID": 275025,
            "ConnectionTypeID": 25,
            "StatusTypeID": 50,
            "LevelID": 2,
            "PowerKW": 11,
            "CurrentTypeID": 20
        }
    ],
    "StatusTypeID": 0,
    "DateLastStatusUpdate": "2021-07-09T03:10:00Z",
    "MetadataValues": [
        {
            "ID": 9046,
            "MetadataFieldID": 4,
            "ItemValue": "Data from the German chargepoint registry provided by Bundesnetzagentur.de under the CC-BY 4.0 license"
        }
    ],
    "DataQualityLevel": 3,
    "DateCreated": "2021-07-08T09:48:00Z",
    "SubmissionStatusTypeID": 100
}