{
    "IsRecentlyVerified": false,
    "ID": 180065,
    "UUID": "68778333-EDA0-4407-841D-952CB788C7F9",
    "DataProviderID": 29,
    "DataProvidersReference": "7075",
    "OperatorID": 234,
    "AddressInfo": {
        "ID": 180424,
        "Title": "Zu den Heuwiesen 4",
        "AddressLine1": "Zu den Heuwiesen 4",
        "Town": "Neunkirchen am Brand",
        "Postcode": "91077",
        "CountryID": 87,
        "Latitude": 49.60936,
        "Longitude": 11.123,
        "DistanceUnit": 0
    },
    "Connections": [
        {
            "ID": 282701,
            "ConnectionTypeID": 25,
            "StatusTypeID": 50,
            "LevelID": 2,
            "PowerKW": 22,
            "CurrentTypeID": 20
        },
        {
            "ID": 282702,
            "ConnectionTypeID": 25,
            "StatusTypeID": 50,
            "LevelID": 2,
            "PowerKW": 22,
            "CurrentTypeID": 20
        }
    ],
    "StatusTypeID": 50,
    "DateLastStatusUpdate": "2021-07-09T03:17:00Z",
    "MetadataValues": [
        {
            "ID": 12359,
            "MetadataFieldID": 4,
            "ItemValue": "Data from the German chargepoint registry provided by Bundesnetzagentur.de under the CC-BY 4.0 license"
        }
    ],
    "DataQualityLevel": 3,
    "DateCreated": "2021-07-08T10:00:00Z",
    "SubmissionStatusTypeID": 100
}