{
    "IsRecentlyVerified": false,
    "ID": 35636,
    "UUID": "887FA59A-337C-4AE3-AB84-0465F15FE89C",
    "DataProviderID": 26,
    "DataProvidersReference": "50747",
    "OperatorID": 180,
    "OperatorsReference": "Alfen GDH1392",
    "UsageCost": "0.00 jaarabonnement",
    "AddressInfo": {
        "ID": 35982,
        "Title": "Lavendelstraat 96",
        "AddressLine1": "Lavendelstraat 96",
        "Town": "Den Haag",
        "Postcode": "2563 PT",
        "CountryID": 159,
        "Latitude": 52.067602,
        "Longitude": 4.270189,
        "ContactTelephone1": "036 - 549 34 00",
        "RelatedURL": "http://www.icu-charging-stations.com/",
        "DistanceUnit": 0
    },
    "Connections": [
        {
            "ID": 39147,
            "ConnectionTypeID": 25,
            "LevelID": 2,
            "PowerKW": 11,
            "CurrentTypeID": 10
        },
        {
            "ID": 47982,
            "ConnectionTypeID": 25,
            "LevelID": 2,
            "PowerKW": 11,
            "CurrentTypeID": 10
        }
    ],
    "NumberOfPoints": 1,
    "StatusTypeID": 50,
    "DateLastStatusUpdate": "2016-06-04T02:45:00Z",
    "DataQualityLevel": 3,
    "DateCreated": "2015-01-09T06:05:00Z",
    "SubmissionStatusTypeID": 100
}