{
    "IsRecentlyVerified": false,
    "ID": 159673,
    "UUID": "A4975E67-83F0-4D4E-ACEB-4C8E3334F42A",
    "DataProviderID": 2,
    "DataProvidersReference": "158373",
    "UsageTypeID": 1,
    "AddressInfo": {
        "ID": 160030,
        "Title": "Fondulac District Library",
        "AddressLine1": "400 Richland St",
        "Town": "East Peorria",
        "StateOrProvince": "IL",
        "Postcode": "61611",
        "CountryID": 2,
        "Latitude": 40.670658,
        "Longitude": -89.586583,
        "ContactTelephone1": "309-699-3917",
        "AccessComments": "24 hours daily",
        "RelatedURL": "",
        "DistanceUnit": 0
    },
    "Connections": [
        {
            "ID": 229877,
            "ConnectionTypeID": 1,
            "LevelID": 2,
            "Amps": 16,
            "Voltage": 230,
            "PowerKW": 3.7,
            "CurrentTypeID": 10,
            "Quantity": 2
        }
    ],
    "StatusTypeID": 50,
    "DateLastStatusUpdate": "2020-06-26T03:03:00Z",
    "DataQualityLevel": 3,
    "DateCreated": "2020-06-26T03:03:00Z",
    "SubmissionStatusTypeID": 100
}