{
    "IsRecentlyVerified": false,
    "ID": 157439,
    "UUID": "26BA706E-83B5-42C3-AD05-3E16DFB07417",
    "DataProviderID": 1,
    "OperatorID": 3384,
    "UsageTypeID": 1,
    "UsageCost": "2,98 HRK per kWh",
    "AddressInfo": {
        "ID": 157793,
        "Title": "Konzum centar Sarajevska",
        "AddressLine1": "6 Sarajevska cesta",
        "Town": "Zagreb",
        "StateOrProvince": "",
        "Postcode": "10000",
        "CountryID": 60,
        "Latitude": 45.77050804774066,
        "Longitude": 16.003827510625797,
        "DistanceUnit": 0
    },
    "Connections": [
        {
            "ID": 226782,
            "ConnectionTypeID": 33,
            "StatusTypeID": 50,
            "LevelID": 3,
            "PowerKW": 150,
            "CurrentTypeID": 30,
            "Quantity": 1
        },
        {
            "ID": 226783,
            "ConnectionTypeID": 2,
            "StatusTypeID": 50,
            "LevelID": 3,
            "PowerKW": 150,
            "CurrentTypeID": 30,
            "Quantity": 1
        }
    ],
    "NumberOfPoints": 1,
    "GeneralComments": "activate with plugsurfing or HT RFID",
    "StatusTypeID": 50,
    "DateLastStatusUpdate": "2020-06-10T20:28:00Z",
    "DataQualityLevel": 1,
    "DateCreated": "2020-06-06T08:46:00Z",
    "SubmissionStatusTypeID": 200
}