{
    "IsRecentlyVerified": false,
    "ID": 136802,
    "UUID": "5ACC44E1-0604-4C0C-9FA6-EE5D025B2E7E",
    "DataProviderID": 1,
    "OperatorID": 150,
    "UsageTypeID": 5,
    "UsageCost": "£1.00 Connection Fee then 30p per kWh",
    "AddressInfo": {
        "ID": 137148,
        "Title": "Morrisons St Helens",
        "AddressLine1": "Baxter's lane",
        "Town": "St. Helens",
        "Postcode": "WA9 3DU",
        "CountryID": 1,
        "Latitude": 53.441982,
        "Longitude": -2.71277,
        "AccessComments": "Geniepoint Network https://www.cpsgenie.com/ds Located behind car wash & petrol station",
        "RelatedURL": "https://www.cpsgenie.com/ds",
        "DistanceUnit": 0
    },
    "Connections": [
        {
            "ID": 191403,
            "ConnectionTypeID": 1036,
            "Reference": "1",
            "StatusTypeID": 50,
            "LevelID": 3,
            "Amps": 63,
            "Voltage": 400,
            "PowerKW": 43,
            "CurrentTypeID": 20,
            "Quantity": 1
        },
        {
            "ID": 191404,
            "ConnectionTypeID": 2,
            "Reference": "2",
            "StatusTypeID": 50,
            "LevelID": 3,
            "Amps": 125,
            "Voltage": 400,
            "PowerKW": 50,
            "CurrentTypeID": 30,
            "Quantity": 1
        },
        {
            "ID": 191405,
            "ConnectionTypeID": 33,
            "Reference": "3",
            "StatusTypeID": 50,
            "LevelID": 3,
            "Amps": 125,
            "Voltage": 400,
            "PowerKW": 50,
            "CurrentTypeID": 30,
            "Quantity": 1
        }
    ],
    "GeneralComments": "£10.00 overstay fee after 95 mins ,then £10.00 every subsequent 95 mins",
    "StatusTypeID": 50,
    "DateLastStatusUpdate": "2020-10-04T22:23:00Z",
    "MetadataValues": [
        {
            "ID": 6654,
            "MetadataFieldID": 4,
            "ItemValue": "Contains public sector information licensed under the Open Government Licence v2.0. http://www.nationalarchives.gov.uk/doc/open-government-licence/version/2/"
        }
    ],
    "DataQualityLevel": 3,
    "DateCreated": "2019-12-24T05:23:00Z",
    "SubmissionStatusTypeID": 100
}