{
    "IsRecentlyVerified": false,
    "ID": 14324,
    "UUID": "CEEA2F94-402F-427E-A96F-F1463C4F143C",
    "DataProviderID": 2,
    "DataProvidersReference": "47013",
    "UsageTypeID": 7,
    "AddressInfo": {
        "ID": 14221,
        "Title": "Don Williamson Nissan",
        "AddressLine1": "310 Western Blvd",
        "Town": "Jacksonville",
        "StateOrProvince": "NC",
        "Postcode": "28546",
        "CountryID": 2,
        "Latitude": 34.761337,
        "Longitude": -77.381386,
        "ContactTelephone1": "910-353-7700",
        "AccessComments": "Dealership business hours\r\nPublic - Call ahead",
        "RelatedURL": "",
        "DistanceUnit": 0
    },
    "Connections": [
        {
            "ID": 16552,
            "ConnectionTypeID": 1,
            "LevelID": 2,
            "Amps": 16,
            "Voltage": 230,
            "PowerKW": 3.7,
            "CurrentTypeID": 10,
            "Quantity": 1
        },
        {
            "ID": 21668,
            "ConnectionTypeID": 1,
            "LevelID": 2,
            "Quantity": 1
        }
    ],
    "DateLastStatusUpdate": "2020-06-26T02:57:00Z",
    "DataQualityLevel": 3,
    "DateCreated": "2012-12-06T16:49:00Z",
    "SubmissionStatusTypeID": 100
}