{
    "IsRecentlyVerified": false,
    "ID": 123099,
    "UUID": "CC257A60-A037-4C03-8073-215A5EB4CA7F",
    "DataProviderID": 2,
    "DataProvidersReference": "66409",
    "UsageTypeID": 1,
    "AddressInfo": {
        "ID": 123445,
        "Title": "Ingles Market",
        "AddressLine1": "915 Merrimon Ave",
        "Town": "Asheville",
        "StateOrProvince": "NC",
        "Postcode": "28804",
        "CountryID": 2,
        "Latitude": 35.62983,
        "Longitude": -82.552775,
        "ContactTelephone1": "828-253-1326",
        "AccessComments": "24 hours daily",
        "RelatedURL": "",
        "DistanceUnit": 0
    },
    "Connections": [
        {
            "ID": 173037,
            "ConnectionTypeID": 1,
            "LevelID": 2,
            "Amps": 16,
            "Voltage": 230,
            "PowerKW": 3.7,
            "CurrentTypeID": 10,
            "Quantity": 3
        }
    ],
    "DateLastStatusUpdate": "2020-06-26T02:58:00Z",
    "DataQualityLevel": 3,
    "DateCreated": "2019-04-06T05:03:00Z",
    "SubmissionStatusTypeID": 100
}