{
    "IsRecentlyVerified": false,
    "ID": 167825,
    "UUID": "7D95C12D-6A23-4F4A-BA1C-AA5BEDEA4553",
    "DataProviderID": 1,
    "OperatorID": 21,
    "UsageTypeID": 4,
    "UsageCost": "Mobi.E compatible card",
    "AddressInfo": {
        "ID": 168184,
        "Title": "ESP-00001",
        "AddressLine1": "Av.24 ",
        "Town": "Espinho",
        "StateOrProvince": "Aveiro",
        "Postcode": "4500-217 Espinho",
        "CountryID": 180,
        "Latitude": 41.01035008590554,
        "Longitude": -8.638266838516643,
        "DistanceUnit": 0
    },
    "Connections": [
        {
            "ID": 254811,
            "ConnectionTypeID": 25,
            "StatusTypeID": 50,
            "LevelID": 2,
            "Amps": 32,
            "Voltage": 400,
            "PowerKW": 22,
            "CurrentTypeID": 20,
            "Quantity": 2
        }
    ],
    "NumberOfPoints": 2,
    "StatusTypeID": 50,
    "DateLastStatusUpdate": "2021-01-22T18:59:00Z",
    "DataQualityLevel": 1,
    "DateCreated": "2020-09-14T19:26:00Z",
    "SubmissionStatusTypeID": 200
}