{
    "IsRecentlyVerified": false,
    "ID": 57208,
    "UUID": "CA56F04E-10A1-4C7B-B199-57E731E79956",
    "DataProviderID": 1,
    "OperatorID": 45,
    "UsageTypeID": 7,
    "UsageCost": "1€/24h",
    "AddressInfo": {
        "ID": 57554,
        "Title": "Wohnmobilstellplatz Öllingen",
        "AddressLine1": "Hauptstraße 42",
        "Town": "Öllingen",
        "StateOrProvince": "Alb-Donau-Kreis",
        "Postcode": "89129",
        "CountryID": 87,
        "Latitude": 48.52844009808594,
        "Longitude": 10.148379589705442,
        "ContactTelephone1": " 07345 / 75 02",
        "ContactEmail": "info@oellingen-albdonau.de",
        "AccessComments": "4 kostenlose Plätze, mit Stromkasten, Wasser und WC-Station. Strom muss vorher angemeldet werden",
        "RelatedURL": "http://www.oellingen.de/sehenswuerdigkeiten/camperparkplatz.php",
        "DistanceUnit": 0
    },
    "Connections": [
        {
            "ID": 72300,
            "ConnectionTypeID": 16,
            "StatusTypeID": 50,
            "Voltage": 230,
            "CurrentTypeID": 10,
            "Quantity": 4
        }
    ],
    "NumberOfPoints": 4,
    "StatusTypeID": 50,
    "DateLastStatusUpdate": "2015-11-28T15:48:00Z",
    "DataQualityLevel": 1,
    "DateCreated": "2015-11-28T15:48:00Z",
    "SubmissionStatusTypeID": 200
}