{
    "IsRecentlyVerified": false,
    "ID": 29798,
    "UUID": "F848D010-D977-4C7A-AFA4-8A9F3CE56AD8",
    "DataProviderID": 15,
    "DataProvidersReference": "15698",
    "OperatorID": 5,
    "AddressInfo": {
        "ID": 30144,
        "Title": "Paint Branch Dr",
        "AddressLine1": "Paint Branch Dr",
        "Town": "College Park",
        "StateOrProvince": "Maryland",
        "Postcode": "20740",
        "CountryID": 2,
        "Latitude": 38.98944092,
        "Longitude": -76.93730164,
        "ContactTelephone1": "",
        "RelatedURL": "http://carstations.com/15698",
        "DistanceUnit": 0
    },
    "Connections": [
        {
            "ID": 32783,
            "ConnectionTypeID": 1,
            "Reference": "J1772",
            "LevelID": 2
        }
    ],
    "StatusTypeID": 0,
    "DateLastStatusUpdate": "2017-11-04T14:04:00Z",
    "DataQualityLevel": 2,
    "DateCreated": "2014-11-29T05:39:00Z",
    "SubmissionStatusTypeID": 100
}