{
    "IsRecentlyVerified": false,
    "ID": 98037,
    "UUID": "DF76FCD4-3FC2-4026-AC6D-4D514F4BCCD3",
    "DataProviderID": 1,
    "OperatorID": 23,
    "OperatorsReference": "38589",
    "UsageTypeID": 4,
    "AddressInfo": {
        "ID": 98383,
        "Title": "Hotel Alpenhof",
        "AddressLine1": "Knoblachergasse 4",
        "Town": "Bad Hofgastein",
        "Postcode": "5630",
        "CountryID": 19,
        "Latitude": 47.172603,
        "Longitude": 13.104047,
        "ContactTelephone1": "+43 64326430",
        "DistanceUnit": 0
    },
    "Connections": [
        {
            "ID": 138945,
            "ConnectionTypeID": 30,
            "StatusTypeID": 50,
            "LevelID": 2,
            "Amps": 32,
            "Voltage": 400,
            "PowerKW": 22,
            "CurrentTypeID": 20,
            "Quantity": 1
        }
    ],
    "NumberOfPoints": 1,
    "GeneralComments": "1 Tesla Connector, up to 22kW.Available for customers. Please call ahead.",
    "StatusTypeID": 50,
    "DateLastStatusUpdate": "2018-10-03T16:32:00Z",
    "DataQualityLevel": 1,
    "DateCreated": "2018-01-21T17:38:00Z",
    "SubmissionStatusTypeID": 200
}