{
    "UserComments": [
        {
            "ID": 6118,
            "ChargePointID": 49264,
            "CommentTypeID": 10,
            "UserName": "Mo",
            "Comment": "Own cable require ",
            "Rating": 3,
            "DateCreated": "2015-08-04T10:43:23.43Z",
            "User": {
                "ID": 5084,
                "Username": "Mo"
            },
            "CheckinStatusTypeID": 10
        },
        {
            "ID": 6117,
            "ChargePointID": 49264,
            "CommentTypeID": 10,
            "UserName": "Mo",
            "Comment": "Used ok on a couple of occasions when   \nI did'nt have enough charge to reach a Rapid, charged ok but slow as only 7Kw",
            "Rating": 3,
            "DateCreated": "2015-08-04T10:40:05.857Z",
            "User": {
                "ID": 5084,
                "Username": "Mo"
            },
            "CheckinStatusTypeID": 10
        }
    ],
    "IsRecentlyVerified": false,
    "ID": 49264,
    "UUID": "F1CD2F21-2491-4720-A8CE-33E5709CDFCC",
    "DataProviderID": 1,
    "OperatorID": 3315,
    "OperatorsReference": "50269",
    "UsageTypeID": 4,
    "UsageCost": "Free",
    "AddressInfo": {
        "ID": 49610,
        "Title": "Housing Office East",
        "AddressLine1": "Pitkerro Road",
        "Town": "Dundee",
        "Postcode": "DD4 8ES",
        "CountryID": 1,
        "Latitude": 56.482233,
        "Longitude": -2.9359596,
        "DistanceUnit": 0
    },
    "Connections": [
        {
            "ID": 60901,
            "ConnectionTypeID": 25,
            "StatusTypeID": 50,
            "LevelID": 2,
            "Amps": 32,
            "Voltage": 230,
            "PowerKW": 7,
            "CurrentTypeID": 10,
            "Quantity": 2
        }
    ],
    "NumberOfPoints": 2,
    "StatusTypeID": 50,
    "DateLastStatusUpdate": "2020-01-02T08:22:00Z",
    "DataQualityLevel": 1,
    "DateCreated": "2015-07-16T08:37:00Z",
    "SubmissionStatusTypeID": 200
}