{
    "IsRecentlyVerified": false,
    "ID": 97594,
    "UUID": "2022D81B-60B2-419C-B2BE-44A4D5309DD6",
    "DataProviderID": 1,
    "OperatorID": 23,
    "OperatorsReference": "39656",
    "UsageTypeID": 4,
    "AddressInfo": {
        "ID": 97940,
        "Title": "Vincent Hill Station",
        "AddressLine1": "553 Sierra Hwy",
        "Town": "Acton",
        "StateOrProvince": "California",
        "Postcode": "93510",
        "CountryID": 2,
        "Latitude": 34.50141,
        "Longitude": -118.118245,
        "ContactTelephone1": "(661) 272-4799",
        "DistanceUnit": 0
    },
    "Connections": [
        {
            "ID": 138501,
            "ConnectionTypeID": 30,
            "StatusTypeID": 50,
            "LevelID": 2,
            "PowerKW": 16,
            "CurrentTypeID": 20,
            "Quantity": 3
        }
    ],
    "NumberOfPoints": 3,
    "GeneralComments": "3 Tesla Connectors, up to 16kW.Available for customers. Self park.",
    "StatusTypeID": 50,
    "DateLastStatusUpdate": "2018-01-21T15:50:00Z",
    "DataQualityLevel": 1,
    "DateCreated": "2018-01-21T15:50:00Z",
    "SubmissionStatusTypeID": 200
}