{
    "IsRecentlyVerified": false,
    "ID": 158691,
    "UUID": "CD5CC486-733A-4212-A56B-888D161049F2",
    "DataProviderID": 2,
    "DataProvidersReference": "154607",
    "OperatorID": 89,
    "UsageTypeID": 1,
    "AddressInfo": {
        "ID": 159048,
        "Title": "10215 Palms Blvd",
        "AddressLine1": "10215 Palms Blvd",
        "Town": "Los Angeles",
        "StateOrProvince": "CA",
        "Postcode": "90034",
        "CountryID": 2,
        "Latitude": 34.02727963,
        "Longitude": -118.4067137,
        "ContactTelephone1": "888-356-8911",
        "AccessComments": "24 hours daily",
        "RelatedURL": "https://flo.ca/",
        "DistanceUnit": 0
    },
    "Connections": [
        {
            "ID": 228711,
            "ConnectionTypeID": 1,
            "LevelID": 2,
            "Amps": 16,
            "Voltage": 230,
            "PowerKW": 3.7,
            "CurrentTypeID": 10,
            "Quantity": 1
        }
    ],
    "StatusTypeID": 50,
    "DateLastStatusUpdate": "2020-06-26T02:56:00Z",
    "DataQualityLevel": 3,
    "DateCreated": "2020-06-26T02:56:00Z",
    "SubmissionStatusTypeID": 100
}