{
    "UserComments": [
        {
            "ID": 21476,
            "ChargePointID": 131456,
            "CommentTypeID": 10,
            "UserName": "Someone_Just_",
            "Rating": 4,
            "DateCreated": "2019-09-07T17:19:47.973Z",
            "User": {
                "ID": 1107,
                "Username": "Someone_Just_"
            },
            "CheckinStatusTypeID": 140
        }
    ],
    "MediaItems": [
        {
            "ID": 19499,
            "ChargePointID": 131456,
            "ItemURL": "https://s3-ap-southeast-2.amazonaws.com/openchargemap/images/BE/OCM131456/OCM-131456.orig.2019090717202871.jpg",
            "ItemThumbnailURL": "https://s3-ap-southeast-2.amazonaws.com/openchargemap/images/BE/OCM131456/OCM-131456.thmb.2019090717202871.jpg",
            "Comment": "",
            "IsEnabled": true,
            "IsVideo": false,
            "IsFeaturedItem": false,
            "IsExternalResource": false,
            "User": {
                "ID": 1107,
                "Username": "Someone_Just_"
            },
            "DateCreated": "2019-09-07T17:21:00Z"
        }
    ],
    "IsRecentlyVerified": false,
    "ID": 131456,
    "UUID": "09F8C8B6-3272-4AEE-95F3-878FE94A7F96",
    "DataProviderID": 1,
    "OperatorID": 103,
    "UsageTypeID": 1,
    "AddressInfo": {
        "ID": 131802,
        "Title": "Kalmthout Statieplein 7",
        "AddressLine1": "Statieplein 7",
        "Town": "Kalmthout",
        "Postcode": "2920",
        "CountryID": 26,
        "Latitude": 51.390778203164416,
        "Longitude": 4.467043352148494,
        "DistanceUnit": 0
    },
    "Connections": [
        {
            "ID": 184021,
            "ConnectionTypeID": 25,
            "StatusTypeID": 50,
            "LevelID": 2,
            "PowerKW": 11,
            "CurrentTypeID": 20,
            "Quantity": 2
        }
    ],
    "NumberOfPoints": 2,
    "StatusTypeID": 50,
    "DateLastStatusUpdate": "2019-09-07T17:21:00Z",
    "DataQualityLevel": 1,
    "DateCreated": "2019-09-07T17:19:00Z",
    "SubmissionStatusTypeID": 200
}