{
    "IsRecentlyVerified": false,
    "ID": 60862,
    "UUID": "62DA1163-1DD1-4E7B-900C-3DBD093F4918",
    "DataProviderID": 1,
    "OperatorID": 80,
    "UsageTypeID": 4,
    "UsageCost": "0,40 €/kW",
    "AddressInfo": {
        "ID": 61208,
        "Title": "Eneldrive (ex SILFI) dell'Elba",
        "AddressLine1": "Piazza dell'Elba, 3",
        "Town": "Firenze",
        "StateOrProvince": "FI",
        "Postcode": "50127",
        "CountryID": 112,
        "Latitude": 43.793514701013564,
        "Longitude": 11.220767896815698,
        "RelatedURL": "http://eneldrive.it",
        "DistanceUnit": 0
    },
    "Connections": [
        {
            "ID": 77173,
            "ConnectionTypeID": 36,
            "StatusTypeID": 50,
            "LevelID": 2,
            "Amps": 16,
            "Voltage": 240,
            "PowerKW": 3,
            "CurrentTypeID": 10,
            "Quantity": 3
        },
        {
            "ID": 77174,
            "ConnectionTypeID": 25,
            "StatusTypeID": 50,
            "LevelID": 2,
            "Amps": 32,
            "Voltage": 400,
            "PowerKW": 22,
            "CurrentTypeID": 20,
            "Quantity": 1
        }
    ],
    "NumberOfPoints": 4,
    "StatusTypeID": 50,
    "DateLastStatusUpdate": "2016-02-10T17:18:00Z",
    "DataQualityLevel": 1,
    "DateCreated": "2016-02-10T17:18:00Z",
    "SubmissionStatusTypeID": 200
}