{
    "IsRecentlyVerified": false,
    "ID": 77771,
    "UUID": "E5D278AE-0C6B-4FA2-B612-E5136AF05D6A",
    "DataProviderID": 1,
    "OperatorID": 45,
    "UsageTypeID": 6,
    "AddressInfo": {
        "ID": 78117,
        "Title": " Maison d'Hôtes Le Clos d'Anbot",
        "AddressLine1": "Frazione Pont Suaz, 126",
        "Town": "Charvensod",
        "StateOrProvince": "AO",
        "Postcode": "11020 ",
        "CountryID": 112,
        "Latitude": 45.72802806501664,
        "Longitude": 7.320110185915625,
        "RelatedURL": "http://www.leclosdanbot.eu/",
        "DistanceUnit": 0
    },
    "Connections": [
        {
            "ID": 112353,
            "ConnectionTypeID": 1036,
            "StatusTypeID": 50,
            "LevelID": 2,
            "Amps": 32,
            "Voltage": 400,
            "PowerKW": 22,
            "CurrentTypeID": 20,
            "Quantity": 1
        }
    ],
    "NumberOfPoints": 1,
    "GeneralComments": "Tesla Destination Charging\r\n",
    "StatusTypeID": 50,
    "DateLastStatusUpdate": "2017-01-23T16:11:00Z",
    "DataQualityLevel": 1,
    "DateCreated": "2017-01-23T16:11:00Z",
    "SubmissionStatusTypeID": 200
}