{
    "IsRecentlyVerified": false,
    "ID": 127648,
    "UUID": "F1D9C098-57FD-4823-92E2-86D2AEAFAA63",
    "DataProviderID": 1,
    "OperatorID": 25,
    "OperatorsReference": "camden-holmesroad",
    "UsageTypeID": 4,
    "UsageCost": "£0.073/minute; min £1.38; other tariffs available",
    "AddressInfo": {
        "ID": 127994,
        "Title": "Holmes Road",
        "AddressLine1": "88 Holmes Road",
        "Town": "London",
        "Postcode": "NW5 3AX",
        "CountryID": 1,
        "Latitude": 51.549044,
        "Longitude": -0.145934,
        "DistanceUnit": 0
    },
    "Connections": [
        {
            "ID": 178696,
            "ConnectionTypeID": 25,
            "StatusTypeID": 50,
            "LevelID": 2,
            "Amps": 32,
            "Voltage": 400,
            "PowerKW": 22,
            "CurrentTypeID": 20,
            "Quantity": 1
        }
    ],
    "NumberOfPoints": 1,
    "StatusTypeID": 50,
    "DateLastStatusUpdate": "2019-06-07T05:39:00Z",
    "DataQualityLevel": 1,
    "DateCreated": "2019-06-07T05:39:00Z",
    "SubmissionStatusTypeID": 200
}