{
    "IsRecentlyVerified": false,
    "ID": 59115,
    "UUID": "90ACC367-60FC-4852-AD16-898B26E11F02",
    "DataProviderID": 1,
    "OperatorID": 235,
    "UsageTypeID": 1,
    "UsageCost": "0",
    "AddressInfo": {
        "ID": 59461,
        "Title": "SWD Landhotel \"Am Zault\" E-Bike-Ladestation",
        "AddressLine1": "Gerresheimer Landstraße 400",
        "AddressLine2": "Unterbach",
        "Town": "Düsseldorf",
        "Postcode": "40627",
        "CountryID": 87,
        "Latitude": 51.200608,
        "Longitude": 6.905316,
        "ContactTelephone1": "0211/821-8210",
        "ContactTelephone2": "0211/821-4093",
        "ContactEmail": "elektromobilitaet@swd-ag.de",
        "AccessComments": "E-Bike-Ladestation\r\nRund um die Uhr (24/7) nutzbar. ",
        "RelatedURL": "http://www.emobil-nrw.de",
        "DistanceUnit": 0
    },
    "Connections": [
        {
            "ID": 75018,
            "ConnectionTypeID": 28,
            "StatusTypeID": 50,
            "LevelID": 2,
            "Amps": 16,
            "Voltage": 230,
            "PowerKW": 3.7,
            "CurrentTypeID": 10,
            "Quantity": 4
        }
    ],
    "NumberOfPoints": 4,
    "GeneralComments": "E-Bike-Ladestation",
    "StatusTypeID": 50,
    "DateLastStatusUpdate": "2016-01-12T12:59:00Z",
    "DataQualityLevel": 1,
    "DateCreated": "2016-01-07T13:49:00Z",
    "SubmissionStatusTypeID": 200
}