{
    "IsRecentlyVerified": false,
    "ID": 136274,
    "UUID": "11D74D49-5F40-481D-A427-010EEF4F8419",
    "DataProviderID": 18,
    "DataProvidersReference": "03cdda6a0113c0d0e84605d82a245bd4",
    "OperatorID": 2244,
    "UsageTypeID": 5,
    "AddressInfo": {
        "ID": 136620,
        "Title": "Kensington Gardens Square",
        "AddressLine1": "Kensington Gardens Square",
        "Town": "London",
        "Postcode": "W2 4BE",
        "CountryID": 1,
        "Latitude": 51.513792,
        "Longitude": -0.190341,
        "AccessComments": "",
        "RelatedURL": "https://www.ubitricity.com",
        "DistanceUnit": 0
    },
    "Connections": [
        {
            "ID": 190710,
            "ConnectionTypeID": 25,
            "Reference": "suby1100002510",
            "StatusTypeID": 50,
            "LevelID": 2,
            "Amps": 16,
            "Voltage": 230,
            "PowerKW": 3.7,
            "CurrentTypeID": 10
        }
    ],
    "StatusTypeID": 0,
    "DateLastStatusUpdate": "2021-04-25T05:46:00Z",
    "MetadataValues": [
        {
            "ID": 6126,
            "MetadataFieldID": 4,
            "ItemValue": "Contains public sector information licensed under the Open Government Licence v2.0. http://www.nationalarchives.gov.uk/doc/open-government-licence/version/2/"
        }
    ],
    "DataQualityLevel": 3,
    "DateCreated": "2019-12-24T05:22:00Z",
    "SubmissionStatusTypeID": 100
}