{
    "IsRecentlyVerified": false,
    "ID": 121228,
    "UUID": "DABA5793-D1DE-4D52-9DEA-31313C61F3EF",
    "DataProviderID": 2,
    "DataProvidersReference": "118893",
    "OperatorID": 5,
    "UsageTypeID": 1,
    "AddressInfo": {
        "ID": 121574,
        "Title": "HUNTINGTON",
        "AddressLine1": "1555 W 5th Ave",
        "Town": "Columbus",
        "StateOrProvince": "OH",
        "Postcode": "43212",
        "CountryID": 2,
        "Latitude": 39.98876,
        "Longitude": -83.0477211,
        "ContactTelephone1": "888-758-4389",
        "AccessComments": "24 hours daily",
        "RelatedURL": "http://www.chargepoint.com/",
        "DistanceUnit": 0
    },
    "Connections": [
        {
            "ID": 170668,
            "ConnectionTypeID": 1,
            "LevelID": 2,
            "Amps": 16,
            "Voltage": 230,
            "PowerKW": 3.7,
            "CurrentTypeID": 10,
            "Quantity": 1
        }
    ],
    "DateLastStatusUpdate": "2020-06-26T03:02:00Z",
    "DataQualityLevel": 3,
    "DateCreated": "2019-04-01T05:00:00Z",
    "SubmissionStatusTypeID": 100
}