{
    "IsRecentlyVerified": false,
    "ID": 160099,
    "UUID": "30A2DE01-4552-4F22-9D2B-4E4926C5AF0B",
    "DataProviderID": 2,
    "DataProvidersReference": "153230",
    "OperatorID": 5,
    "UsageTypeID": 1,
    "AddressInfo": {
        "ID": 160456,
        "Title": "ATRIUM EVCHARGE",
        "AddressLine1": "10 Maxwell Dr",
        "Town": "Clifton Park",
        "StateOrProvince": "NY",
        "Postcode": "12065",
        "CountryID": 2,
        "Latitude": 42.867884,
        "Longitude": -73.781791,
        "ContactTelephone1": "888-758-4389",
        "AccessComments": "24 hours daily",
        "RelatedURL": "http://www.chargepoint.com/",
        "DistanceUnit": 0
    },
    "Connections": [
        {
            "ID": 230337,
            "ConnectionTypeID": 1,
            "LevelID": 2,
            "Amps": 16,
            "Voltage": 230,
            "PowerKW": 3.7,
            "CurrentTypeID": 10,
            "Quantity": 8
        }
    ],
    "StatusTypeID": 50,
    "DateLastStatusUpdate": "2020-06-26T03:06:00Z",
    "DataQualityLevel": 3,
    "DateCreated": "2020-06-26T03:06:00Z",
    "SubmissionStatusTypeID": 100
}