{
    "IsRecentlyVerified": false,
    "ID": 184613,
    "UUID": "143C2757-E391-40B8-9430-66E78EB4F79A",
    "DataProviderID": 29,
    "DataProvidersReference": "17879",
    "OperatorID": 127,
    "AddressInfo": {
        "ID": 184972,
        "Title": "Margarete-Steiff-Allee 4",
        "AddressLine1": "Margarete-Steiff-Allee 4",
        "Town": "Achim",
        "Postcode": "28832",
        "CountryID": 87,
        "Latitude": 53.018894607072,
        "Longitude": 9.069020748138,
        "DistanceUnit": 0
    },
    "Connections": [
        {
            "ID": 293085,
            "ConnectionTypeID": 33,
            "StatusTypeID": 50,
            "LevelID": 3,
            "PowerKW": 150,
            "CurrentTypeID": 30
        },
        {
            "ID": 293086,
            "ConnectionTypeID": 33,
            "StatusTypeID": 50,
            "LevelID": 3,
            "PowerKW": 150,
            "CurrentTypeID": 30
        }
    ],
    "StatusTypeID": 50,
    "DateLastStatusUpdate": "2021-07-09T03:28:00Z",
    "MetadataValues": [
        {
            "ID": 16904,
            "MetadataFieldID": 4,
            "ItemValue": "Data from the German chargepoint registry provided by Bundesnetzagentur.de under the CC-BY 4.0 license"
        }
    ],
    "DataQualityLevel": 3,
    "DateCreated": "2021-07-08T10:05:00Z",
    "SubmissionStatusTypeID": 100
}