{
    "IsRecentlyVerified": false,
    "ID": 172840,
    "UUID": "18BFEC30-1C3B-499E-A155-1B7A974A3802",
    "DataProviderID": 1,
    "OperatorID": 3334,
    "UsageTypeID": 4,
    "AddressInfo": {
        "ID": 173199,
        "Title": "צומת כ\"ח",
        "AddressLine1": "Aroma",
        "Town": "Mevoot HaHermon Regional Council",
        "StateOrProvince": "North District",
        "Postcode": "",
        "CountryID": 111,
        "Latitude": 33.125047047940484,
        "Longitude": 35.570323640469155,
        "DistanceUnit": 0
    },
    "Connections": [
        {
            "ID": 264374,
            "ConnectionTypeID": 33,
            "StatusTypeID": 50,
            "LevelID": 3,
            "PowerKW": 50,
            "CurrentTypeID": 30,
            "Quantity": 1
        },
        {
            "ID": 264375,
            "ConnectionTypeID": 2,
            "StatusTypeID": 50,
            "LevelID": 3,
            "PowerKW": 50,
            "CurrentTypeID": 30,
            "Quantity": 1
        }
    ],
    "NumberOfPoints": 1,
    "StatusTypeID": 50,
    "DateLastStatusUpdate": "2021-02-19T15:40:00Z",
    "DataQualityLevel": 1,
    "DateCreated": "2021-02-19T11:54:00Z",
    "SubmissionStatusTypeID": 200
}