{
    "IsRecentlyVerified": false,
    "ID": 67114,
    "UUID": "5B871FF9-D032-4871-B00F-870A15DFD917",
    "DataProviderID": 2,
    "DataProvidersReference": "74645",
    "UsageTypeID": 2,
    "AddressInfo": {
        "ID": 67460,
        "Title": "United Parcel Service",
        "AddressLine1": "1601 W McKinley Ave",
        "Town": "Fresno",
        "StateOrProvince": "CA",
        "Postcode": "93728",
        "CountryID": 2,
        "Latitude": 36.763773,
        "Longitude": -119.831517,
        "ContactTelephone1": "",
        "AccessComments": "",
        "RelatedURL": "",
        "DistanceUnit": 0
    },
    "Connections": [
        {
            "ID": 92609,
            "ConnectionTypeID": 1,
            "LevelID": 2,
            "Amps": 16,
            "Voltage": 230,
            "PowerKW": 3,
            "CurrentTypeID": 10,
            "Quantity": 10
        }
    ],
    "DateLastStatusUpdate": "2019-04-06T04:02:00Z",
    "DataQualityLevel": 3,
    "DateCreated": "2016-05-29T02:04:00Z",
    "SubmissionStatusTypeID": 100
}