{
    "IsRecentlyVerified": false,
    "ID": 95614,
    "UUID": "F7B268B7-B148-47B5-BA3B-F751713C6565",
    "DataProviderID": 1,
    "OperatorID": 156,
    "UsageTypeID": 4,
    "AddressInfo": {
        "ID": 95960,
        "Title": "Dirk Görner GmbH",
        "AddressLine1": "Friedrich-List-Straße 9",
        "Town": "Potsdam",
        "StateOrProvince": "Brandenburg",
        "Postcode": "14482",
        "CountryID": 87,
        "Latitude": 52.39222946690562,
        "Longitude": 13.085110992729158,
        "AccessComments": "Die New Motion lolo Wallbox befindet sich rechts neben der Annahme an der Hauswand der Werkstatt auf dem Gelände zwischen der HEM-Tankstelle und dem Supermarkt Netto. Sollte dort ein Fahrzeug während der Öffnungszeiten der Görner GmbH Kfz-Klimaanlagen stehen, bitte kurz im Büro melden.",
        "RelatedURL": "http://www.eisfrei.com/",
        "DistanceUnit": 0
    },
    "Connections": [
        {
            "ID": 135433,
            "ConnectionTypeID": 25,
            "StatusTypeID": 50,
            "LevelID": 2,
            "Amps": 32,
            "Voltage": 400,
            "PowerKW": 22,
            "CurrentTypeID": 20,
            "Quantity": 1
        }
    ],
    "NumberOfPoints": 1,
    "StatusTypeID": 50,
    "DateLastStatusUpdate": "2017-11-15T07:03:00Z",
    "DataQualityLevel": 1,
    "DateCreated": "2017-11-15T07:03:00Z",
    "SubmissionStatusTypeID": 200
}