{
    "IsRecentlyVerified": false,
    "ID": 185069,
    "UUID": "A56893BD-B8A6-409D-82E0-B6FE9792F6EC",
    "DataProviderID": 29,
    "DataProvidersReference": "5262",
    "OperatorID": 45,
    "AddressInfo": {
        "ID": 185428,
        "Title": "Heinrich-Hertz-Straße 4",
        "AddressLine1": "Heinrich-Hertz-Straße 4",
        "Town": "Villingen-Schwenningen",
        "Postcode": "78052",
        "CountryID": 87,
        "Latitude": 48.080871,
        "Longitude": 8.447021,
        "DistanceUnit": 0
    },
    "Connections": [
        {
            "ID": 294093,
            "ConnectionTypeID": 33,
            "StatusTypeID": 50,
            "LevelID": 3,
            "PowerKW": 22,
            "CurrentTypeID": 30
        },
        {
            "ID": 294094,
            "ConnectionTypeID": 25,
            "StatusTypeID": 50,
            "LevelID": 2,
            "PowerKW": 11,
            "CurrentTypeID": 20
        },
        {
            "ID": 294095,
            "ConnectionTypeID": 1036,
            "StatusTypeID": 50,
            "LevelID": 3,
            "PowerKW": 50,
            "CurrentTypeID": 20
        }
    ],
    "StatusTypeID": 50,
    "DateLastStatusUpdate": "2021-07-12T02:40:00Z",
    "MetadataValues": [
        {
            "ID": 17360,
            "MetadataFieldID": 4,
            "ItemValue": "Data from the German chargepoint registry provided by Bundesnetzagentur.de under the CC-BY 4.0 license"
        }
    ],
    "DataQualityLevel": 3,
    "DateCreated": "2021-07-08T10:06:00Z",
    "SubmissionStatusTypeID": 100
}