{
    "UserComments": [
        {
            "ID": 23311,
            "ChargePointID": 168591,
            "CommentTypeID": 10,
            "UserName": "xester",
            "DateCreated": "2020-10-02T08:12:58.157Z",
            "User": {
                "ID": 6169,
                "Username": "xester"
            },
            "CheckinStatusTypeID": 10,
            "IsActionedByEditor": false
        }
    ],
    "IsRecentlyVerified": false,
    "ID": 168591,
    "UUID": "75C577DF-DBC5-40D6-BA9B-E1DAF36F5BF1",
    "DataProviderID": 1,
    "OperatorID": 45,
    "UsageTypeID": 6,
    "AddressInfo": {
        "ID": 168950,
        "Title": "Porsche DC - Hotel Vincci Porto ",
        "AddressLine1": "Alameda de Basílio Teles 29",
        "AddressLine2": "Hotel Vincci Porto",
        "Town": "Porto",
        "StateOrProvince": "Porto",
        "Postcode": "4150-127",
        "CountryID": 180,
        "Latitude": 41.14700210487439,
        "Longitude": -8.63223115696519,
        "ContactTelephone1": "+351 22 04 39 620",
        "AccessComments": "Only for customers",
        "RelatedURL": "http://www.porsche.es",
        "DistanceUnit": 0
    },
    "Connections": [
        {
            "ID": 256081,
            "ConnectionTypeID": 1036,
            "StatusTypeID": 50,
            "LevelID": 2,
            "Amps": 16,
            "Voltage": 400,
            "PowerKW": 11,
            "CurrentTypeID": 20,
            "Quantity": 2
        }
    ],
    "NumberOfPoints": 2,
    "StatusTypeID": 50,
    "DateLastStatusUpdate": "2020-10-09T20:21:00Z",
    "DataQualityLevel": 1,
    "DateCreated": "2020-10-02T08:13:00Z",
    "SubmissionStatusTypeID": 200
}