{
    "IsRecentlyVerified": false,
    "ID": 112621,
    "UUID": "390AE2EE-A4AB-43D6-82C6-8AD274981D4C",
    "DataProviderID": 1,
    "OperatorID": 80,
    "UsageTypeID": 4,
    "AddressInfo": {
        "ID": 112967,
        "Title": "Magnago Leopardi | EnelX",
        "AddressLine1": "Via Giacomo Leopardi",
        "Town": "Magnago",
        "StateOrProvince": "MI",
        "Postcode": "200102",
        "CountryID": 112,
        "Latitude": 45.5775394468715,
        "Longitude": 8.81842411690798,
        "ContactTelephone1": "800.069.850",
        "RelatedURL": "https://www.enelx.com/it/it/emobility",
        "DistanceUnit": 0
    },
    "Connections": [
        {
            "ID": 158463,
            "ConnectionTypeID": 25,
            "StatusTypeID": 50,
            "LevelID": 2,
            "Amps": 32,
            "Voltage": 400,
            "PowerKW": 22,
            "CurrentTypeID": 20,
            "Quantity": 2
        }
    ],
    "NumberOfPoints": 2,
    "StatusTypeID": 50,
    "DateLastStatusUpdate": "2019-03-17T15:55:00Z",
    "DataQualityLevel": 1,
    "DateCreated": "2018-11-09T13:58:00Z",
    "SubmissionStatusTypeID": 200
}