{
    "IsRecentlyVerified": false,
    "ID": 175273,
    "UUID": "CE6E1E0C-DEAE-4C38-AB3A-DE0B94FCD056",
    "DataProviderID": 1,
    "OperatorID": 3362,
    "UsageTypeID": 4,
    "AddressInfo": {
        "ID": 175632,
        "Title": "Autoenterprise 3456 ",
        "AddressLine1": "Khmelnytskogo 1",
        "Town": "Chahor",
        "StateOrProvince": "Chernivtsi Oblast",
        "Postcode": "60410",
        "CountryID": 234,
        "Latitude": 48.230859106229474,
        "Longitude": 25.97824245094023,
        "RelatedURL": "http://www.autoenterprise.com.ua/zapravki_autoenterprise/.",
        "DistanceUnit": 0
    },
    "Connections": [
        {
            "ID": 271804,
            "ConnectionTypeID": 2,
            "StatusTypeID": 50,
            "LevelID": 2,
            "Amps": 110,
            "PowerKW": 50,
            "Quantity": 1
        },
        {
            "ID": 271805,
            "ConnectionTypeID": 33,
            "StatusTypeID": 50,
            "LevelID": 3,
            "Amps": 200,
            "PowerKW": 80,
            "CurrentTypeID": 30
        },
        {
            "ID": 271806,
            "ConnectionTypeID": 1,
            "StatusTypeID": 50
        },
        {
            "ID": 271807,
            "ConnectionTypeID": 1036,
            "StatusTypeID": 50
        }
    ],
    "NumberOfPoints": 1,
    "StatusTypeID": 50,
    "DateLastStatusUpdate": "2021-05-04T16:10:00Z",
    "DataQualityLevel": 1,
    "DateCreated": "2021-05-04T13:56:00Z",
    "SubmissionStatusTypeID": 200
}