{
    "IsRecentlyVerified": false,
    "ID": 108099,
    "UUID": "45D2AD3B-C54F-419F-95BA-FE912345921E",
    "DataProviderID": 1,
    "OperatorID": 3315,
    "OperatorsReference": "50603",
    "UsageTypeID": 4,
    "UsageCost": "Free",
    "AddressInfo": {
        "ID": 108445,
        "Title": "Westpoint House, East Kilbride",
        "AddressLine1": "Redwood Place",
        "Town": "East Kilbride",
        "StateOrProvince": "South Lanarkshire",
        "Postcode": "G74 5PB",
        "CountryID": 1,
        "Latitude": 55.768053,
        "Longitude": -4.223646,
        "DistanceUnit": 0
    },
    "Connections": [
        {
            "ID": 152701,
            "ConnectionTypeID": 25,
            "StatusTypeID": 50,
            "LevelID": 2,
            "Amps": 32,
            "Voltage": 400,
            "PowerKW": 22,
            "CurrentTypeID": 20,
            "Quantity": 6
        }
    ],
    "NumberOfPoints": 6,
    "StatusTypeID": 50,
    "DateLastStatusUpdate": "2019-10-15T05:15:00Z",
    "DataQualityLevel": 1,
    "DateCreated": "2018-09-04T05:17:00Z",
    "SubmissionStatusTypeID": 200
}