{
    "IsRecentlyVerified": false,
    "ID": 73534,
    "UUID": "76AF0BB8-0BD8-4121-9477-AE3CB4F655A7",
    "DataProviderID": 1,
    "OperatorID": 45,
    "UsageTypeID": 1,
    "UsageCost": "Free",
    "AddressInfo": {
        "ID": 73880,
        "Title": "E-Bike Station Tourist-Information",
        "AddressLine1": "Marktstraße 9",
        "Town": "Wassertrüdingen",
        "StateOrProvince": "Landkreis Ansbach",
        "Postcode": "91717",
        "CountryID": 87,
        "Latitude": 49.04009,
        "Longitude": 10.59783200000004,
        "RelatedURL": "http://www.bike-energy.com/",
        "DistanceUnit": 0
    },
    "Connections": [
        {
            "ID": 105788,
            "ConnectionTypeID": 28,
            "StatusTypeID": 50,
            "LevelID": 1,
            "Amps": 10,
            "Voltage": 230,
            "PowerKW": 2.3,
            "CurrentTypeID": 10,
            "Quantity": 3
        },
        {
            "ID": 105789,
            "ConnectionTypeID": 0,
            "StatusTypeID": 50,
            "LevelID": 1,
            "Amps": 6,
            "Voltage": 50,
            "PowerKW": 0.3,
            "CurrentTypeID": 30,
            "Quantity": 3
        }
    ],
    "NumberOfPoints": 6,
    "GeneralComments": "Bike-energy LINE L3B - Anschluß für 3 E-Bikes & zusätzlich 3 Schukosteckdosen. Gesamtbelastbarkeit 3.7kW.",
    "StatusTypeID": 50,
    "DateLastStatusUpdate": "2016-11-23T08:30:00Z",
    "DataQualityLevel": 1,
    "DateCreated": "2016-11-23T08:30:00Z",
    "SubmissionStatusTypeID": 200
}