{
    "IsRecentlyVerified": false,
    "ID": 46082,
    "UUID": "1712A911-10DC-44A6-A117-EFDEF8EFB02E",
    "DataProviderID": 1,
    "DataProvidersReference": "1693",
    "AddressInfo": {
        "ID": 46428,
        "Title": "Langebru gjestegård",
        "AddressLine1": "Meierigata 1",
        "Town": "HOKKSUND",
        "StateOrProvince": "Viken",
        "Postcode": "3300",
        "CountryID": 168,
        "Latitude": 59.76288,
        "Longitude": 9.89668,
        "AccessComments": "Ved Shell/7-Eleven Langebru.",
        "DistanceUnit": 0
    },
    "Connections": [
        {
            "ID": 56745,
            "ConnectionTypeID": 0,
            "Reference": "1",
            "LevelID": 2,
            "Amps": 100,
            "Voltage": 500,
            "PowerKW": 50,
            "Comments": "Mode 4"
        },
        {
            "ID": 88439,
            "ConnectionTypeID": 0,
            "Reference": "2",
            "LevelID": 2,
            "Amps": 100,
            "Voltage": 500,
            "PowerKW": 50,
            "Comments": "Mode 4"
        }
    ],
    "NumberOfPoints": 2,
    "DateLastStatusUpdate": "2020-05-26T08:23:00Z",
    "DataQualityLevel": 2,
    "DateCreated": "2015-05-03T00:54:00Z",
    "SubmissionStatusTypeID": 100
}