{
    "IsRecentlyVerified": false,
    "ID": 91375,
    "UUID": "F2E7A8B9-2051-421D-8DD9-B0250205548A",
    "DataProviderID": 2,
    "DataProvidersReference": "86206",
    "OperatorID": 5,
    "UsageTypeID": 1,
    "AddressInfo": {
        "ID": 91721,
        "Title": "DOWNTOWN",
        "AddressLine1": "941 Randolph Street Thomasville Chamber of Commerce",
        "Town": "Thomasville",
        "StateOrProvince": "NC",
        "Postcode": "27360",
        "CountryID": 2,
        "Latitude": 35.8688836,
        "Longitude": -80.0731947,
        "ContactTelephone1": "888-758-4389",
        "AccessComments": "24 hours daily",
        "RelatedURL": "http://www.chargepoint.com/",
        "DistanceUnit": 0
    },
    "Connections": [
        {
            "ID": 129527,
            "ConnectionTypeID": 1,
            "LevelID": 2,
            "Amps": 16,
            "Voltage": 230,
            "PowerKW": 3,
            "CurrentTypeID": 10,
            "Quantity": 1
        }
    ],
    "DateLastStatusUpdate": "2019-04-06T04:02:00Z",
    "DataQualityLevel": 3,
    "DateCreated": "2017-08-03T12:25:00Z",
    "SubmissionStatusTypeID": 100
}