{
    "IsRecentlyVerified": false,
    "ID": 94371,
    "UUID": "3B06FF62-8361-4BC9-8BC9-A51C500C953D",
    "DataProviderID": 2,
    "DataProvidersReference": "87921",
    "UsageTypeID": 2,
    "AddressInfo": {
        "ID": 94717,
        "Title": "Weirton Medical Center - Medical Office Building",
        "AddressLine1": "651 Colliers Way",
        "Town": "Weirton",
        "StateOrProvince": "WV",
        "Postcode": "26062",
        "CountryID": 2,
        "Latitude": 40.3919,
        "Longitude": -80.527567,
        "ContactTelephone1": "304-797-6000",
        "AccessComments": "24 hours daily",
        "RelatedURL": "",
        "DistanceUnit": 0
    },
    "Connections": [
        {
            "ID": 133475,
            "ConnectionTypeID": 11,
            "LevelID": 1,
            "Amps": 16,
            "Voltage": 120,
            "PowerKW": 1.9,
            "CurrentTypeID": 10,
            "Quantity": 4
        },
        {
            "ID": 133476,
            "ConnectionTypeID": 30,
            "LevelID": 2,
            "Amps": 16,
            "Voltage": 230,
            "PowerKW": 3.7,
            "CurrentTypeID": 10,
            "Quantity": 3
        }
    ],
    "DateLastStatusUpdate": "2020-06-26T03:03:00Z",
    "DataQualityLevel": 3,
    "DateCreated": "2017-10-19T02:06:00Z",
    "SubmissionStatusTypeID": 100
}