{
    "IsRecentlyVerified": false,
    "ID": 104549,
    "UUID": "A6BE1950-3F60-4A7C-B507-0B092B6262B5",
    "DataProviderID": 1,
    "OperatorID": 45,
    "UsageTypeID": 4,
    "AddressInfo": {
        "ID": 104895,
        "Title": "Möbelhaus Kohler natürlich einrichten",
        "AddressLine1": "Keplerstraße 26",
        "Town": "Erolzheim",
        "StateOrProvince": "Gemeindeverwaltungsverband Illertal",
        "Postcode": "88453",
        "CountryID": 87,
        "Latitude": 48.08639676096472,
        "Longitude": 10.08190969259033,
        "AccessComments": "Kostenlos laden zu den Öffnungszeiten. Die Ladestation ist mitten auf dem Parkplatz und den Solardächern.",
        "RelatedURL": "http://www.kohler-naturmoebel.de/",
        "DistanceUnit": 0
    },
    "Connections": [
        {
            "ID": 147560,
            "ConnectionTypeID": 25,
            "StatusTypeID": 50,
            "LevelID": 2,
            "Amps": 32,
            "Voltage": 230,
            "PowerKW": 7.4,
            "CurrentTypeID": 10,
            "Quantity": 1
        },
        {
            "ID": 147561,
            "ConnectionTypeID": 25,
            "StatusTypeID": 50,
            "LevelID": 2,
            "Amps": 16,
            "Voltage": 230,
            "PowerKW": 3.7,
            "CurrentTypeID": 10,
            "Quantity": 1
        }
    ],
    "NumberOfPoints": 2,
    "StatusTypeID": 50,
    "DateLastStatusUpdate": "2018-05-22T06:53:00Z",
    "DataQualityLevel": 1,
    "DateCreated": "2018-05-22T06:53:00Z",
    "SubmissionStatusTypeID": 200
}