{
    "UserComments": [
        {
            "ID": 20005,
            "ChargePointID": 101905,
            "CommentTypeID": 10,
            "UserName": "Hypermile",
            "Comment": "You will need to immediately turn left as you enter the lot, in order to access it.  If arriving via Northbound I-45, take the third, or outside left-turn lane to best access.",
            "DateCreated": "2018-08-08T21:02:33.017Z",
            "User": {
                "ID": 11824,
                "Username": "Hypermile"
            },
            "CheckinStatusTypeID": 10
        }
    ],
    "MediaItems": [
        {
            "ID": 16218,
            "ChargePointID": 101905,
            "ItemURL": "https://s3-ap-southeast-2.amazonaws.com/openchargemap/images/US/OCM101905/OCM-101905.orig.2018080821001924.jpg",
            "ItemThumbnailURL": "https://s3-ap-southeast-2.amazonaws.com/openchargemap/images/US/OCM101905/OCM-101905.thmb.2018080821001924.jpg",
            "Comment": "",
            "IsEnabled": true,
            "IsVideo": false,
            "IsFeaturedItem": false,
            "IsExternalResource": false,
            "User": {
                "ID": 11824,
                "Username": "Hypermile"
            },
            "DateCreated": "2018-08-08T21:01:00Z"
        },
        {
            "ID": 16219,
            "ChargePointID": 101905,
            "ItemURL": "https://s3-ap-southeast-2.amazonaws.com/openchargemap/images/US/OCM101905/OCM-101905.orig.2018080821004091.jpg",
            "ItemThumbnailURL": "https://s3-ap-southeast-2.amazonaws.com/openchargemap/images/US/OCM101905/OCM-101905.thmb.2018080821004091.jpg",
            "Comment": "",
            "IsEnabled": true,
            "IsVideo": false,
            "IsFeaturedItem": false,
            "IsExternalResource": false,
            "User": {
                "ID": 11824,
                "Username": "Hypermile"
            },
            "DateCreated": "2018-08-08T21:01:00Z"
        },
        {
            "ID": 16220,
            "ChargePointID": 101905,
            "ItemURL": "https://s3-ap-southeast-2.amazonaws.com/openchargemap/images/US/OCM101905/OCM-101905.orig.2018080821005855.jpg",
            "ItemThumbnailURL": "https://s3-ap-southeast-2.amazonaws.com/openchargemap/images/US/OCM101905/OCM-101905.thmb.2018080821005855.jpg",
            "Comment": "",
            "IsEnabled": true,
            "IsVideo": false,
            "IsFeaturedItem": false,
            "IsExternalResource": false,
            "User": {
                "ID": 11824,
                "Username": "Hypermile"
            },
            "DateCreated": "2018-08-08T21:01:00Z"
        },
        {
            "ID": 16221,
            "ChargePointID": 101905,
            "ItemURL": "https://s3-ap-southeast-2.amazonaws.com/openchargemap/images/US/OCM101905/OCM-101905.orig.2018080821011515.jpg",
            "ItemThumbnailURL": "https://s3-ap-southeast-2.amazonaws.com/openchargemap/images/US/OCM101905/OCM-101905.thmb.2018080821011515.jpg",
            "Comment": "",
            "IsEnabled": true,
            "IsVideo": false,
            "IsFeaturedItem": false,
            "IsExternalResource": false,
            "User": {
                "ID": 11824,
                "Username": "Hypermile"
            },
            "DateCreated": "2018-08-08T21:01:00Z"
        }
    ],
    "IsRecentlyVerified": false,
    "ID": 101905,
    "UUID": "6007505E-AEE8-4564-9278-5A5D3E776C56",
    "DataProviderID": 1,
    "OperatorID": 15,
    "UsageTypeID": 1,
    "UsageCost": "$0.25/min; other tariffs available",
    "AddressInfo": {
        "ID": 102251,
        "Title": "EVGo HEB",
        "AddressLine1": "130 Sawdust Road",
        "Town": "Spring",
        "StateOrProvince": "TX",
        "Postcode": "77380",
        "CountryID": 2,
        "Latitude": 30.126869521526945,
        "Longitude": -95.44533753275152,
        "RelatedURL": "https://www.evgo.com/",
        "DistanceUnit": 0
    },
    "Connections": [
        {
            "ID": 143872,
            "ConnectionTypeID": 32,
            "StatusTypeID": 50,
            "LevelID": 3,
            "PowerKW": 50,
            "CurrentTypeID": 30,
            "Quantity": 1
        },
        {
            "ID": 143873,
            "ConnectionTypeID": 2,
            "StatusTypeID": 50,
            "LevelID": 3,
            "PowerKW": 50,
            "CurrentTypeID": 30,
            "Quantity": 1
        },
        {
            "ID": 143874,
            "ConnectionTypeID": 1,
            "StatusTypeID": 50,
            "LevelID": 2,
            "PowerKW": 7.2,
            "CurrentTypeID": 10,
            "Quantity": 1
        }
    ],
    "NumberOfPoints": 3,
    "GeneralComments": "Two bays at South end of the lot, second entrance from the East.",
    "StatusTypeID": 50,
    "DateLastStatusUpdate": "2018-08-09T19:36:00Z",
    "DataQualityLevel": 1,
    "DateCreated": "2018-04-14T20:01:00Z",
    "SubmissionStatusTypeID": 200
}