{
    "IsRecentlyVerified": false,
    "ID": 143012,
    "UUID": "113F953A-0D84-473E-AC25-1B33DE0BCE4C",
    "DataProviderID": 2,
    "DataProvidersReference": "121292",
    "OperatorID": 5,
    "UsageTypeID": 1,
    "AddressInfo": {
        "ID": 143364,
        "Title": "LAKE ZURICH",
        "AddressLine1": "70 E Main St",
        "Town": "Lake Zurich",
        "StateOrProvince": "IL",
        "Postcode": "60047",
        "CountryID": 2,
        "Latitude": 42.197709,
        "Longitude": -88.09147,
        "ContactTelephone1": "888-758-4389",
        "AccessComments": "24 hours daily",
        "RelatedURL": "http://www.chargepoint.com/",
        "DistanceUnit": 0
    },
    "Connections": [
        {
            "ID": 199265,
            "ConnectionTypeID": 1,
            "LevelID": 2,
            "Amps": 16,
            "Voltage": 230,
            "PowerKW": 3.7,
            "CurrentTypeID": 10,
            "Quantity": 2
        }
    ],
    "StatusTypeID": 50,
    "DateLastStatusUpdate": "2020-06-26T03:05:00Z",
    "DataQualityLevel": 3,
    "DateCreated": "2019-12-24T09:19:00Z",
    "SubmissionStatusTypeID": 100
}