{
    "UserComments": [
        {
            "ID": 23936,
            "ChargePointID": 170161,
            "CommentTypeID": 10,
            "UserName": "ForumElettrico.it",
            "Comment": "Situate a 3,5 Km di distanza dall'uscita autostradale di Dalmine sulla A4 Torino-Trieste. Leggi la recensione completa qui > https://www.forumelettrico.it/forum/colonnina-fast-becharge-e-quick-dalmine-bg-piazza-giacomo-matteotti-t15811.html",
            "RelatedURL": "https://www.forumelettrico.it/forum/colonnina-fast-becharge-e-quick-dalmine-bg-piazza-giacomo-matteotti-t15811.html",
            "DateCreated": "2021-02-23T06:44:22.093Z",
            "User": {
                "ID": 11749,
                "Username": "ForumElettrico.it"
            },
            "CheckinStatusTypeID": 10,
            "IsActionedByEditor": false
        }
    ],
    "MediaItems": [
        {
            "ID": 26644,
            "ChargePointID": 170161,
            "ItemURL": "https://s3-ap-southeast-2.amazonaws.com/openchargemap/images/IT/OCM170161/OCM-170161.orig.2021022306443358.jpg",
            "ItemThumbnailURL": "https://s3-ap-southeast-2.amazonaws.com/openchargemap/images/IT/OCM170161/OCM-170161.thmb.2021022306443358.jpg",
            "Comment": "",
            "IsEnabled": true,
            "IsVideo": false,
            "IsFeaturedItem": false,
            "IsExternalResource": false,
            "User": {
                "ID": 11749,
                "Username": "ForumElettrico.it"
            },
            "DateCreated": "2021-02-23T06:45:00Z"
        },
        {
            "ID": 26645,
            "ChargePointID": 170161,
            "ItemURL": "https://s3-ap-southeast-2.amazonaws.com/openchargemap/images/IT/OCM170161/OCM-170161.orig.2021022306444058.jpg",
            "ItemThumbnailURL": "https://s3-ap-southeast-2.amazonaws.com/openchargemap/images/IT/OCM170161/OCM-170161.thmb.2021022306444058.jpg",
            "Comment": "",
            "IsEnabled": true,
            "IsVideo": false,
            "IsFeaturedItem": false,
            "IsExternalResource": false,
            "User": {
                "ID": 11749,
                "Username": "ForumElettrico.it"
            },
            "DateCreated": "2021-02-23T06:45:00Z"
        },
        {
            "ID": 26646,
            "ChargePointID": 170161,
            "ItemURL": "https://s3-ap-southeast-2.amazonaws.com/openchargemap/images/IT/OCM170161/OCM-170161.orig.2021022306444703.jpg",
            "ItemThumbnailURL": "https://s3-ap-southeast-2.amazonaws.com/openchargemap/images/IT/OCM170161/OCM-170161.thmb.2021022306444703.jpg",
            "Comment": "",
            "IsEnabled": true,
            "IsVideo": false,
            "IsFeaturedItem": false,
            "IsExternalResource": false,
            "User": {
                "ID": 11749,
                "Username": "ForumElettrico.it"
            },
            "DateCreated": "2021-02-23T06:45:00Z"
        }
    ],
    "IsRecentlyVerified": false,
    "ID": 170161,
    "UUID": "5931937F-D25A-4F16-AC4F-F71BAD5779D0",
    "DataProviderID": 1,
    "OperatorID": 3327,
    "UsageTypeID": 4,
    "AddressInfo": {
        "ID": 170520,
        "Title": "BECHARGE Dalmine Matteotti",
        "AddressLine1": "Piazza Giacomo Matteotti",
        "AddressLine2": "ingresso da Via Cavour",
        "Town": "Dalmine",
        "StateOrProvince": "BG",
        "Postcode": "24044",
        "CountryID": 112,
        "Latitude": 45.64646050565844,
        "Longitude": 9.598494455832792,
        "ContactTelephone1": "02-49527730",
        "ContactEmail": "emobility@buildingenergy.it",
        "RelatedURL": "https://www.bec.energy/",
        "DistanceUnit": 0
    },
    "Connections": [
        {
            "ID": 259414,
            "ConnectionTypeID": 33,
            "StatusTypeID": 50,
            "LevelID": 3,
            "PowerKW": 75,
            "CurrentTypeID": 30,
            "Quantity": 1
        },
        {
            "ID": 259415,
            "ConnectionTypeID": 2,
            "StatusTypeID": 50,
            "LevelID": 3,
            "PowerKW": 50,
            "CurrentTypeID": 30,
            "Quantity": 1
        },
        {
            "ID": 259416,
            "ConnectionTypeID": 25,
            "StatusTypeID": 50,
            "LevelID": 2,
            "Amps": 32,
            "Voltage": 400,
            "PowerKW": 22,
            "CurrentTypeID": 20,
            "Quantity": 1
        },
        {
            "ID": 259417,
            "ConnectionTypeID": 25,
            "StatusTypeID": 50,
            "LevelID": 2,
            "Amps": 22,
            "Voltage": 400,
            "PowerKW": 22,
            "CurrentTypeID": 20,
            "Quantity": 2
        }
    ],
    "NumberOfPoints": 4,
    "StatusTypeID": 50,
    "DateLastStatusUpdate": "2021-02-23T06:45:00Z",
    "DataQualityLevel": 1,
    "DateCreated": "2020-11-19T17:11:00Z",
    "SubmissionStatusTypeID": 200
}