{
    "IsRecentlyVerified": false,
    "ID": 14744,
    "UUID": "ACC4BA60-EEEC-4391-8AD2-63DEA24481D2",
    "DataProviderID": 2,
    "DataProvidersReference": "49882",
    "UsageTypeID": 1,
    "AddressInfo": {
        "ID": 14641,
        "Title": "Town of Southern Pines - Library",
        "AddressLine1": "170 W Connecticut Ave",
        "Town": "Southern Pines",
        "StateOrProvince": "NC",
        "Postcode": "28387",
        "CountryID": 2,
        "Latitude": 35.176173,
        "Longitude": -79.390553,
        "ContactTelephone1": "910-692-8235",
        "AccessComments": "24 hours daily",
        "RelatedURL": "",
        "DistanceUnit": 0
    },
    "Connections": [
        {
            "ID": 12244,
            "ConnectionTypeID": 1,
            "LevelID": 2,
            "Amps": 16,
            "Voltage": 230,
            "PowerKW": 3,
            "CurrentTypeID": 10,
            "Quantity": 2
        },
        {
            "ID": 21989,
            "ConnectionTypeID": 1,
            "LevelID": 2,
            "Quantity": 2
        }
    ],
    "DateLastStatusUpdate": "2019-04-06T04:02:00Z",
    "DataQualityLevel": 3,
    "DateCreated": "2012-12-06T16:50:00Z",
    "SubmissionStatusTypeID": 100
}