{
    "IsRecentlyVerified": false,
    "ID": 9206,
    "UUID": "A6485AD2-749D-4C08-A9B7-B5AC5B877296",
    "DataProviderID": 15,
    "DataProvidersReference": "13902",
    "OperatorID": 94,
    "UsageTypeID": 2,
    "AddressInfo": {
        "ID": 9103,
        "Title": "30690 Hill Street",
        "AddressLine1": "30690 Hill Street",
        "Town": "Thousand Palms",
        "StateOrProvince": "California",
        "Postcode": "92276",
        "CountryID": 2,
        "Latitude": 33.826281,
        "Longitude": -116.402599,
        "ContactTelephone1": "800-624-0860",
        "RelatedURL": "http://carstations.com/13902",
        "DistanceUnit": 0
    },
    "Connections": [
        {
            "ID": 6887,
            "ConnectionTypeID": 1,
            "Reference": "J1772",
            "LevelID": 2
        }
    ],
    "NumberOfPoints": 1,
    "StatusTypeID": 0,
    "DateLastStatusUpdate": "2017-11-04T14:04:00Z",
    "DataQualityLevel": 2,
    "DateCreated": "2012-01-23T15:12:00Z",
    "SubmissionStatusTypeID": 100
}