{
    "IsRecentlyVerified": false,
    "ID": 6732,
    "UUID": "3A1AE108-3C15-4470-926F-B91FB60D9522",
    "DataProviderID": 2,
    "DataProvidersReference": "39882",
    "UsageTypeID": 7,
    "AddressInfo": {
        "ID": 3492,
        "Title": "Orange Coast Nissan",
        "AddressLine1": "2850 Harbor Blvd",
        "Town": "Costa Mesa",
        "StateOrProvince": "CA",
        "Postcode": "92626",
        "CountryID": 2,
        "Latitude": 33.675397,
        "Longitude": -117.918684,
        "ContactTelephone1": "714-681-1738",
        "AccessComments": "Dealership business hours\r\nPublic - Call ahead",
        "RelatedURL": "",
        "DistanceUnit": 0
    },
    "Connections": [
        {
            "ID": 15893,
            "ConnectionTypeID": 1,
            "LevelID": 2,
            "Amps": 16,
            "Voltage": 230,
            "PowerKW": 3.7,
            "CurrentTypeID": 10,
            "Quantity": 2
        },
        {
            "ID": 20866,
            "ConnectionTypeID": 2,
            "LevelID": 2,
            "Amps": 100,
            "Voltage": 400,
            "PowerKW": 40,
            "CurrentTypeID": 10,
            "Quantity": 1
        }
    ],
    "DateLastConfirmed": "2011-05-31T00:00:00Z",
    "StatusTypeID": 0,
    "DateLastStatusUpdate": "2020-06-26T02:55:00Z",
    "DataQualityLevel": 1,
    "DateCreated": "2011-10-10T12:26:00Z",
    "SubmissionStatusTypeID": 100
}