{
    "IsRecentlyVerified": false,
    "ID": 23253,
    "UUID": "09462E19-F174-4782-936F-8403F876D87B",
    "DataProviderID": 1,
    "OperatorID": 1,
    "UsageTypeID": 1,
    "AddressInfo": {
        "ID": 23598,
        "Title": "Parcheggio Serraglio",
        "AddressLine1": "Via Felice Cavallotti 42",
        "Town": "Prato",
        "StateOrProvince": "PO",
        "Postcode": "59100",
        "CountryID": 112,
        "Latitude": 43.8849941984471,
        "Longitude": 11.0998880001806,
        "ContactTelephone1": "+39 0574.401621",
        "ContactEmail": "info@essegiemme.it",
        "AccessComments": "Ingresso da Via Galileo Galilei",
        "RelatedURL": "http://www.essegiemme.it",
        "DistanceUnit": 0
    },
    "Connections": [
        {
            "ID": 25077,
            "ConnectionTypeID": 36,
            "StatusTypeID": 50,
            "LevelID": 2,
            "Amps": 16,
            "Voltage": 240,
            "PowerKW": 3.6,
            "CurrentTypeID": 10,
            "Quantity": 2
        }
    ],
    "NumberOfPoints": 2,
    "StatusTypeID": 50,
    "DateLastStatusUpdate": "2016-12-10T21:47:00Z",
    "DataQualityLevel": 1,
    "DateCreated": "2014-05-08T18:00:00Z",
    "SubmissionStatusTypeID": 200
}