{
    "IsRecentlyVerified": false,
    "ID": 173245,
    "UUID": "DC6F1CF5-5085-4105-8D32-03708BF6C054",
    "DataProviderID": 19,
    "DataProvidersReference": "7298",
    "AddressInfo": {
        "ID": 173604,
        "Title": "Hellsenteret ladestasjon",
        "AddressLine1": "Sandfærhus 24 ",
        "Town": "STJØRDAL",
        "StateOrProvince": "Trøndelag",
        "Postcode": "7500",
        "CountryID": 168,
        "Latitude": 63.44782,
        "Longitude": 10.91071,
        "AccessComments": "",
        "DistanceUnit": 0
    },
    "Connections": [
        {
            "ID": 266032,
            "ConnectionTypeID": 25,
            "Reference": "10",
            "LevelID": 3,
            "Amps": 32,
            "Voltage": 400,
            "PowerKW": 22,
            "CurrentTypeID": 30
        },
        {
            "ID": 266033,
            "ConnectionTypeID": 25,
            "Reference": "11",
            "LevelID": 3,
            "Amps": 32,
            "Voltage": 400,
            "PowerKW": 22,
            "CurrentTypeID": 30
        },
        {
            "ID": 266034,
            "ConnectionTypeID": 25,
            "Reference": "12",
            "LevelID": 3,
            "Amps": 32,
            "Voltage": 400,
            "PowerKW": 22,
            "CurrentTypeID": 30
        },
        {
            "ID": 266035,
            "ConnectionTypeID": 25,
            "Reference": "13",
            "LevelID": 3,
            "Amps": 32,
            "Voltage": 400,
            "PowerKW": 22,
            "CurrentTypeID": 30
        },
        {
            "ID": 266036,
            "ConnectionTypeID": 25,
            "Reference": "14",
            "LevelID": 3,
            "Amps": 32,
            "Voltage": 400,
            "PowerKW": 22,
            "CurrentTypeID": 30
        },
        {
            "ID": 266037,
            "ConnectionTypeID": 25,
            "Reference": "15",
            "LevelID": 3,
            "Amps": 32,
            "Voltage": 400,
            "PowerKW": 22,
            "CurrentTypeID": 30
        },
        {
            "ID": 266038,
            "ConnectionTypeID": 25,
            "Reference": "16",
            "LevelID": 3,
            "Amps": 32,
            "Voltage": 400,
            "PowerKW": 22,
            "CurrentTypeID": 30
        },
        {
            "ID": 266039,
            "ConnectionTypeID": 25,
            "Reference": "17",
            "LevelID": 3,
            "Amps": 32,
            "Voltage": 400,
            "PowerKW": 22,
            "CurrentTypeID": 30
        },
        {
            "ID": 266040,
            "ConnectionTypeID": 33,
            "Reference": "9",
            "LevelID": 3,
            "Amps": 100,
            "Voltage": 500,
            "PowerKW": 50,
            "CurrentTypeID": 30,
            "Comments": "Mode 4"
        }
    ],
    "NumberOfPoints": 17,
    "StatusTypeID": 0,
    "DateLastStatusUpdate": "2021-03-24T05:12:00Z",
    "DataQualityLevel": 2,
    "DateCreated": "2021-03-03T09:03:00Z",
    "SubmissionStatusTypeID": 100
}