{
    "IsRecentlyVerified": false,
    "ID": 122098,
    "UUID": "33812DCF-0B7D-482D-A7D5-DB328E0350FB",
    "DataProviderID": 2,
    "DataProvidersReference": "78834",
    "UsageTypeID": 1,
    "AddressInfo": {
        "ID": 122444,
        "Title": "LADWP - Crenshaw",
        "AddressLine1": "4030 Crenshaw Blvd",
        "Town": "Los Angeles",
        "StateOrProvince": "CA",
        "Postcode": "90012",
        "CountryID": 2,
        "Latitude": 34.0117844,
        "Longitude": -118.3346573,
        "ContactTelephone1": "800-342-5397",
        "AccessComments": "24 hours daily",
        "RelatedURL": "",
        "DistanceUnit": 0
    },
    "Connections": [
        {
            "ID": 171956,
            "ConnectionTypeID": 1,
            "LevelID": 2,
            "Amps": 16,
            "Voltage": 230,
            "PowerKW": 3.7,
            "CurrentTypeID": 10,
            "Quantity": 16
        },
        {
            "ID": 171957,
            "ConnectionTypeID": 2,
            "LevelID": 3,
            "Amps": 100,
            "Voltage": 400,
            "PowerKW": 40,
            "CurrentTypeID": 30,
            "Quantity": 1
        },
        {
            "ID": 171958,
            "ConnectionTypeID": 32,
            "LevelID": 3,
            "Amps": 100,
            "Voltage": 400,
            "PowerKW": 40,
            "CurrentTypeID": 30,
            "Quantity": 1
        }
    ],
    "DateLastStatusUpdate": "2020-06-26T02:56:00Z",
    "DataQualityLevel": 3,
    "DateCreated": "2019-04-06T05:02:00Z",
    "SubmissionStatusTypeID": 100
}