{
    "IsRecentlyVerified": false,
    "ID": 44988,
    "UUID": "C27D8732-C7F2-4670-8D01-5CBE01192284",
    "DataProviderID": 1,
    "OperatorID": 41,
    "AddressInfo": {
        "ID": 45334,
        "Title": "Orthodyne Electronics",
        "AddressLine1": "16700 Red Hill Ave",
        "Town": "Irvine",
        "StateOrProvince": "California",
        "Postcode": "92606",
        "CountryID": 2,
        "Latitude": 33.70267,
        "Longitude": -117.84491,
        "RelatedURL": "http://carstations.com/1156",
        "DistanceUnit": 0
    },
    "Connections": [
        {
            "ID": 55311,
            "ConnectionTypeID": 6,
            "Reference": "SPI",
            "StatusTypeID": 0,
            "LevelID": 2,
            "CurrentTypeID": 10
        }
    ],
    "StatusTypeID": 0,
    "DateLastStatusUpdate": "2016-02-09T17:25:00Z",
    "DataQualityLevel": 2,
    "DateCreated": "2015-04-22T03:24:00Z",
    "SubmissionStatusTypeID": 100
}