{
    "IsRecentlyVerified": false,
    "ID": 36833,
    "UUID": "408F7E89-EFE6-436B-B11B-0BCF58D4112E",
    "DataProviderID": 26,
    "DataProvidersReference": "46183",
    "OperatorID": 73,
    "OperatorsReference": "EV-Box EVB-P1351203",
    "UsageCost": "0.00 jaarabonnement",
    "AddressInfo": {
        "ID": 37179,
        "Title": "Luzernestraat 9",
        "AddressLine1": "Luzernestraat 9",
        "Town": "Haarlemmermeer",
        "Postcode": "2153 GM",
        "CountryID": 159,
        "Latitude": 52.26256,
        "Longitude": 4.64874,
        "RelatedURL": "http://www.ev-box.nl",
        "DistanceUnit": 0
    },
    "Connections": [
        {
            "ID": 40344,
            "ConnectionTypeID": 25,
            "LevelID": 2,
            "PowerKW": 11,
            "CurrentTypeID": 10
        },
        {
            "ID": 48505,
            "ConnectionTypeID": 25,
            "LevelID": 2,
            "PowerKW": 11,
            "CurrentTypeID": 10
        }
    ],
    "NumberOfPoints": 1,
    "StatusTypeID": 50,
    "DateLastStatusUpdate": "2016-06-04T02:52:00Z",
    "DataQualityLevel": 3,
    "DateCreated": "2015-01-09T06:07:00Z",
    "SubmissionStatusTypeID": 100
}