{
    "IsRecentlyVerified": false,
    "ID": 119968,
    "UUID": "020313A2-ACE7-4C1C-A243-97EFBCCFD7BD",
    "DataProviderID": 2,
    "DataProvidersReference": "88155",
    "OperatorID": 5,
    "UsageTypeID": 1,
    "AddressInfo": {
        "ID": 120314,
        "Title": "UNIV OF FLORIDA",
        "AddressLine1": "2046 NE Waldo Rd",
        "Town": "Gainesville",
        "StateOrProvince": "FL",
        "Postcode": "32609",
        "CountryID": 2,
        "Latitude": 29.6723906,
        "Longitude": -82.299321,
        "ContactTelephone1": "888-758-4389",
        "AccessComments": "24 hours daily",
        "RelatedURL": "http://www.chargepoint.com/",
        "DistanceUnit": 0
    },
    "Connections": [
        {
            "ID": 169274,
            "ConnectionTypeID": 1,
            "LevelID": 2,
            "Amps": 16,
            "Voltage": 230,
            "PowerKW": 3.7,
            "CurrentTypeID": 10,
            "Quantity": 2
        }
    ],
    "DateLastStatusUpdate": "2020-06-26T02:53:00Z",
    "DataQualityLevel": 3,
    "DateCreated": "2019-04-01T04:59:00Z",
    "SubmissionStatusTypeID": 100
}