{
    "IsRecentlyVerified": false,
    "ID": 107554,
    "UUID": "5193FCD9-96DD-4192-8D8D-F4326CAF792A",
    "DataProviderID": 1,
    "OperatorID": 3319,
    "UsageTypeID": 1,
    "UsageCost": "bruttó 80 Ft/kWh",
    "AddressInfo": {
        "ID": 107900,
        "Title": "Vácrátót, Szentháromság templom",
        "AddressLine1": "Petőfi tér 8.",
        "Town": "Vácrátót",
        "StateOrProvince": "Pest megye",
        "Postcode": "2163",
        "CountryID": 104,
        "Latitude": 47.709883399158215,
        "Longitude": 19.23371413788982,
        "ContactTelephone1": "+36 80 21-00-12",
        "ContactEmail": "kommunikacio@e-mobi.hu",
        "RelatedURL": "https://e-mobi.hu",
        "DistanceUnit": 0
    },
    "Connections": [
        {
            "ID": 151769,
            "ConnectionTypeID": 25,
            "StatusTypeID": 150,
            "LevelID": 2,
            "Amps": 32,
            "Voltage": 400,
            "PowerKW": 22,
            "CurrentTypeID": 20,
            "Quantity": 2
        }
    ],
    "NumberOfPoints": 2,
    "GeneralComments": "",
    "StatusTypeID": 150,
    "DateLastStatusUpdate": "2020-05-09T09:03:00Z",
    "DataQualityLevel": 1,
    "DateCreated": "2018-08-01T13:43:00Z",
    "SubmissionStatusTypeID": 200
}