{
    "IsRecentlyVerified": false,
    "ID": 185899,
    "UUID": "AFB223A7-04D3-4EA5-A4BB-E3CCA7347878",
    "DataProviderID": 29,
    "DataProvidersReference": "19397",
    "OperatorID": 234,
    "AddressInfo": {
        "ID": 186258,
        "Title": "Am Dorfplatz 9",
        "AddressLine1": "Am Dorfplatz 9",
        "Town": "Veitsbronn",
        "Postcode": "90587",
        "CountryID": 87,
        "Latitude": 49.511553,
        "Longitude": 10.884477,
        "DistanceUnit": 0
    },
    "Connections": [
        {
            "ID": 297134,
            "ConnectionTypeID": 25,
            "StatusTypeID": 50,
            "LevelID": 2,
            "PowerKW": 22,
            "CurrentTypeID": 20
        },
        {
            "ID": 297135,
            "ConnectionTypeID": 25,
            "StatusTypeID": 50,
            "LevelID": 2,
            "PowerKW": 22,
            "CurrentTypeID": 20
        }
    ],
    "StatusTypeID": 50,
    "DateLastStatusUpdate": "2021-07-12T02:43:00Z",
    "MetadataValues": [
        {
            "ID": 18141,
            "MetadataFieldID": 4,
            "ItemValue": "Data from the German chargepoint registry provided by Bundesnetzagentur.de under the CC-BY 4.0 license"
        }
    ],
    "DataQualityLevel": 3,
    "DateCreated": "2021-07-12T02:43:00Z",
    "SubmissionStatusTypeID": 100
}