{
    "UserComments": [
        {
            "ID": 14435,
            "ChargePointID": 72401,
            "CommentTypeID": 10,
            "UserName": "GUN-ZE1",
            "Rating": 3,
            "DateCreated": "2016-10-21T10:18:10.84Z",
            "User": {
                "ID": 9368,
                "Username": "GUN-ZE1"
            },
            "CheckinStatusTypeID": 10
        }
    ],
    "MediaItems": [
        {
            "ID": 8474,
            "ChargePointID": 72401,
            "ItemURL": "https://s3-ap-southeast-2.amazonaws.com/openchargemap/images/DE/OCM72401/OCM-72401.orig.2016102110171974.jpg",
            "ItemThumbnailURL": "https://s3-ap-southeast-2.amazonaws.com/openchargemap/images/DE/OCM72401/OCM-72401.thmb.2016102110171974.jpg",
            "Comment": "",
            "IsEnabled": true,
            "IsVideo": false,
            "IsFeaturedItem": false,
            "IsExternalResource": false,
            "User": {
                "ID": 9368,
                "Username": "GUN-ZE1"
            },
            "DateCreated": "2016-10-21T10:18:00Z"
        },
        {
            "ID": 8475,
            "ChargePointID": 72401,
            "ItemURL": "https://s3-ap-southeast-2.amazonaws.com/openchargemap/images/DE/OCM72401/OCM-72401.orig.2016102110173054.jpg",
            "ItemThumbnailURL": "https://s3-ap-southeast-2.amazonaws.com/openchargemap/images/DE/OCM72401/OCM-72401.thmb.2016102110173054.jpg",
            "Comment": "",
            "IsEnabled": true,
            "IsVideo": false,
            "IsFeaturedItem": false,
            "IsExternalResource": false,
            "User": {
                "ID": 9368,
                "Username": "GUN-ZE1"
            },
            "DateCreated": "2016-10-21T10:18:00Z"
        },
        {
            "ID": 8476,
            "ChargePointID": 72401,
            "ItemURL": "https://s3-ap-southeast-2.amazonaws.com/openchargemap/images/DE/OCM72401/OCM-72401.orig.2016102110174229.jpg",
            "ItemThumbnailURL": "https://s3-ap-southeast-2.amazonaws.com/openchargemap/images/DE/OCM72401/OCM-72401.thmb.2016102110174229.jpg",
            "Comment": "",
            "IsEnabled": true,
            "IsVideo": false,
            "IsFeaturedItem": false,
            "IsExternalResource": false,
            "User": {
                "ID": 9368,
                "Username": "GUN-ZE1"
            },
            "DateCreated": "2016-10-21T10:18:00Z"
        }
    ],
    "IsRecentlyVerified": false,
    "ID": 72401,
    "UUID": "284080DD-92CF-4C47-8D51-2846F87038AE",
    "DataProviderID": 1,
    "OperatorID": 234,
    "UsageTypeID": 4,
    "AddressInfo": {
        "ID": 72747,
        "Title": "N-Ergieladesäule Bechhofen an der Heide",
        "AddressLine1": "Schloßstraße 11",
        "Town": "Bechhofen an der Heide",
        "StateOrProvince": "Bayern",
        "Postcode": "91572",
        "CountryID": 87,
        "Latitude": 49.1573923077885,
        "Longitude": 10.5504431816147,
        "AccessComments": "24/7 nutzbar.",
        "RelatedURL": "http://n-ergie.de",
        "DistanceUnit": 0
    },
    "Connections": [
        {
            "ID": 103731,
            "ConnectionTypeID": 25,
            "StatusTypeID": 50,
            "LevelID": 2,
            "Amps": 32,
            "Voltage": 400,
            "PowerKW": 22,
            "CurrentTypeID": 20,
            "Quantity": 2
        }
    ],
    "NumberOfPoints": 2,
    "GeneralComments": "Am Parkplatz beim Rathaushof; Zufahrt gegenüber von Haus Schlossstraße 11.\r\nStellplätze nicht für E-Fahrzeuge reserviert, Parken kostenlos.\r\nDerzeit noch kostenlos ohne Anmeldung nutzbar.\r\nAbrechnungssystem ist im Verbund Franken+ künftig geplant.",
    "StatusTypeID": 50,
    "DateLastStatusUpdate": "2016-10-21T10:18:00Z",
    "DataQualityLevel": 1,
    "DateCreated": "2016-10-12T09:07:00Z",
    "SubmissionStatusTypeID": 200
}