{
    "IsRecentlyVerified": false,
    "ID": 174299,
    "UUID": "0ADF4C0F-573D-4932-941E-1E8F843A2BD3",
    "DataProviderID": 19,
    "DataProvidersReference": "6973",
    "AddressInfo": {
        "ID": 174658,
        "Title": "Borg í Grímsnesi",
        "AddressLine1": "Borg ",
        "Town": "Selfossi",
        "StateOrProvince": "Suðurland",
        "Postcode": "801",
        "CountryID": 105,
        "Latitude": 64.07536,
        "Longitude": -20.769112,
        "AccessComments": "",
        "DistanceUnit": 0
    },
    "Connections": [
        {
            "ID": 269771,
            "ConnectionTypeID": 25,
            "Reference": "1",
            "LevelID": 3,
            "Amps": 32,
            "Voltage": 400,
            "PowerKW": 22,
            "CurrentTypeID": 30,
            "Comments": "Mode 3"
        },
        {
            "ID": 269772,
            "ConnectionTypeID": 2,
            "Reference": "2",
            "LevelID": 3,
            "Amps": 100,
            "Voltage": 500,
            "PowerKW": 50,
            "CurrentTypeID": 30,
            "Comments": "Mode 4"
        },
        {
            "ID": 269773,
            "ConnectionTypeID": 33,
            "Reference": "3",
            "LevelID": 3,
            "Amps": 100,
            "Voltage": 500,
            "PowerKW": 50,
            "CurrentTypeID": 30,
            "Comments": "Mode 4"
        }
    ],
    "NumberOfPoints": 3,
    "StatusTypeID": 0,
    "DateLastStatusUpdate": "2021-03-24T05:12:00Z",
    "DataQualityLevel": 2,
    "DateCreated": "2021-03-24T05:12:00Z",
    "SubmissionStatusTypeID": 100
}