{
    "MediaItems": [
        {
            "ID": 19178,
            "ChargePointID": 107099,
            "ItemURL": "https://s3-ap-southeast-2.amazonaws.com/openchargemap/images/IT/OCM107099/OCM-107099.orig.2019081112384113.png",
            "ItemThumbnailURL": "https://s3-ap-southeast-2.amazonaws.com/openchargemap/images/IT/OCM107099/OCM-107099.thmb.2019081112384113.png",
            "Comment": "",
            "IsEnabled": true,
            "IsVideo": false,
            "IsFeaturedItem": false,
            "IsExternalResource": false,
            "User": {
                "ID": 21871,
                "Username": "elialitem"
            },
            "DateCreated": "2019-08-11T12:39:00Z"
        },
        {
            "ID": 19177,
            "ChargePointID": 107099,
            "ItemURL": "https://s3-ap-southeast-2.amazonaws.com/openchargemap/images/IT/OCM107099/OCM-107099.orig.2019081112375620.png",
            "ItemThumbnailURL": "https://s3-ap-southeast-2.amazonaws.com/openchargemap/images/IT/OCM107099/OCM-107099.thmb.2019081112375620.png",
            "Comment": "",
            "IsEnabled": true,
            "IsVideo": false,
            "IsFeaturedItem": false,
            "IsExternalResource": false,
            "User": {
                "ID": 21871,
                "Username": "elialitem"
            },
            "DateCreated": "2019-08-11T12:38:00Z"
        }
    ],
    "IsRecentlyVerified": false,
    "ID": 107099,
    "UUID": "DAAAF08B-4393-42FD-8CC4-B5B7B8C15B16",
    "DataProviderID": 1,
    "OperatorID": 80,
    "UsageTypeID": 4,
    "AddressInfo": {
        "ID": 107445,
        "Title": "EnelX Terrasini Vittorio Emanuele",
        "AddressLine1": "Corso Vittorio Emanuele",
        "Town": "Terrasini",
        "StateOrProvince": "PA",
        "Postcode": "90049 ",
        "CountryID": 112,
        "Latitude": 38.14856377559756,
        "Longitude": 13.085071293997885,
        "ContactTelephone1": "800.069.850",
        "RelatedURL": "https://www.enelx.com/it/it/emobility",
        "DistanceUnit": 0
    },
    "Connections": [
        {
            "ID": 150999,
            "ConnectionTypeID": 25,
            "StatusTypeID": 50,
            "LevelID": 2,
            "Amps": 32,
            "Voltage": 400,
            "PowerKW": 22,
            "CurrentTypeID": 20,
            "Quantity": 1
        },
        {
            "ID": 151000,
            "ConnectionTypeID": 36,
            "StatusTypeID": 50,
            "LevelID": 2,
            "Amps": 16,
            "Voltage": 240,
            "PowerKW": 3.7,
            "CurrentTypeID": 10,
            "Quantity": 1
        }
    ],
    "NumberOfPoints": 2,
    "StatusTypeID": 50,
    "DateLastStatusUpdate": "2019-08-11T12:39:00Z",
    "DataQualityLevel": 1,
    "DateCreated": "2018-07-18T12:08:00Z",
    "SubmissionStatusTypeID": 200
}