{
    "IsRecentlyVerified": false,
    "ID": 102761,
    "UUID": "C67713F2-DED9-402A-985D-F65ED63F026E",
    "DataProviderID": 2,
    "DataProvidersReference": "86837",
    "OperatorID": 39,
    "UsageTypeID": 4,
    "AddressInfo": {
        "ID": 103107,
        "Title": "Greenwood Plaza",
        "AddressLine1": "6570 Greenwood Plaza Boulevard",
        "Town": "Englewood",
        "StateOrProvince": "CO",
        "Postcode": "80111",
        "CountryID": 2,
        "Latitude": 39.5973808,
        "Longitude": -104.8945002,
        "ContactTelephone1": "800-663-5633",
        "AccessComments": "MO: 12:00am-12:00am; TU: 12:00am-12:00am; WE: 12:00am-12:00am; TH: 12:00am-12:00am; FR: 12:00am-12:00am; SA: 12:00am-12:00am; SU: 12:00am-12:00am",
        "RelatedURL": "http://www.semacharge.com/",
        "DistanceUnit": 0
    },
    "Connections": [
        {
            "ID": 144884,
            "ConnectionTypeID": 1,
            "LevelID": 2,
            "Amps": 16,
            "Voltage": 230,
            "PowerKW": 3,
            "CurrentTypeID": 10,
            "Quantity": 2
        }
    ],
    "DateLastStatusUpdate": "2019-04-06T05:04:00Z",
    "DataQualityLevel": 3,
    "DateCreated": "2018-04-21T04:13:00Z",
    "SubmissionStatusTypeID": 100
}