{
    "IsRecentlyVerified": false,
    "ID": 122685,
    "UUID": "086D6783-5727-4855-A94B-B8096930BA07",
    "DataProviderID": 2,
    "DataProvidersReference": "72944",
    "OperatorID": 1242,
    "UsageTypeID": 2,
    "AddressInfo": {
        "ID": 123031,
        "Title": "27200 Lower Parking",
        "AddressLine1": "27200  Tourney Rd",
        "Town": "Santa Clarita",
        "StateOrProvince": "CA",
        "Postcode": "91355",
        "CountryID": 2,
        "Latitude": 34.4168272,
        "Longitude": -118.5752694,
        "ContactTelephone1": "855-443-3873",
        "AccessComments": "",
        "RelatedURL": "https://www.gewattstation.com",
        "DistanceUnit": 0
    },
    "Connections": [
        {
            "ID": 172596,
            "ConnectionTypeID": 1,
            "LevelID": 2,
            "Amps": 16,
            "Voltage": 230,
            "PowerKW": 3.7,
            "CurrentTypeID": 10,
            "Quantity": 1
        }
    ],
    "DateLastStatusUpdate": "2020-06-26T02:57:00Z",
    "DataQualityLevel": 3,
    "DateCreated": "2019-04-06T05:03:00Z",
    "SubmissionStatusTypeID": 100
}