{
    "IsRecentlyVerified": false,
    "ID": 41066,
    "UUID": "E4B35DDD-C097-4414-A98C-92A463441252",
    "DataProviderID": 1,
    "OperatorID": 45,
    "UsageTypeID": 7,
    "AddressInfo": {
        "ID": 41412,
        "Title": "Autohaus Stein",
        "AddressLine1": "Hamburger Straße 11-19",
        "Town": "Lüneburg",
        "StateOrProvince": "Landkreis Lüneburg",
        "Postcode": "21339",
        "CountryID": 87,
        "Latitude": 53.2676685,
        "Longitude": 10.4047704,
        "ContactTelephone1": "04131 300031",
        "AccessComments": "Auf dem Parkplatz des Renault/Dacia/Nissan Autohauses. Für Kunden kostenlos, sonst 5€ Parkgebühr. Öffnungszeiten Mo-Fr 7:00-18:30, Sa 9-13Uhr",
        "RelatedURL": "http://www.autohaus-stein.de/",
        "DistanceUnit": 0
    },
    "Connections": [
        {
            "ID": 44806,
            "ConnectionTypeID": 25,
            "StatusTypeID": 50,
            "LevelID": 2,
            "Amps": 32,
            "Voltage": 400,
            "PowerKW": 22,
            "CurrentTypeID": 20,
            "Quantity": 2
        }
    ],
    "NumberOfPoints": 2,
    "StatusTypeID": 50,
    "DateLastStatusUpdate": "2015-01-25T10:18:00Z",
    "DataQualityLevel": 1,
    "DateCreated": "2015-01-25T10:10:00Z",
    "SubmissionStatusTypeID": 200
}