{
    "IsRecentlyVerified": false,
    "ID": 173090,
    "UUID": "871E403D-1BA9-4092-96C1-848B3037B953",
    "DataProviderID": 19,
    "DataProvidersReference": "6879",
    "AddressInfo": {
        "ID": 173449,
        "Title": "Knut den Stores väg 43 (Privatpersons bostad)",
        "AddressLine1": "Knut den Stores väg 43",
        "Town": "KRISTIANSTAD",
        "StateOrProvince": "SKÅNE",
        "Postcode": "29166",
        "CountryID": 216,
        "Latitude": 56.00969,
        "Longitude": 14.08675,
        "AccessComments": "11 radhuset grå fasad",
        "DistanceUnit": 0
    },
    "Connections": [
        {
            "ID": 264988,
            "ConnectionTypeID": 25,
            "Reference": "1",
            "LevelID": 2,
            "Amps": 16,
            "Voltage": 400,
            "PowerKW": 11,
            "CurrentTypeID": 20
        }
    ],
    "NumberOfPoints": 1,
    "StatusTypeID": 0,
    "DateLastStatusUpdate": "2021-03-24T05:10:00Z",
    "DataQualityLevel": 2,
    "DateCreated": "2021-03-03T09:01:00Z",
    "SubmissionStatusTypeID": 100
}