{
    "IsRecentlyVerified": false,
    "ID": 148852,
    "UUID": "A18B91E2-48A3-4439-BE1B-5CE7264B7E67",
    "DataProviderID": 1,
    "OperatorID": 150,
    "UsageTypeID": 4,
    "UsageCost": "£1.00 + £0.30 / kWh. £10.00 overstay fee after 95 mins, then £10.00 every subsequent 95 mins",
    "AddressInfo": {
        "ID": 149204,
        "Title": "Morrisons Hereford",
        "AddressLine1": "Station Approach",
        "Town": "Hereford",
        "Postcode": "HR1 1DN",
        "CountryID": 1,
        "Latitude": 52.060294,
        "Longitude": -2.709236,
        "RelatedURL": "http://www.chargepointservices.com/",
        "DistanceUnit": 0
    },
    "Connections": [
        {
            "ID": 206698,
            "ConnectionTypeID": 1036,
            "Reference": "1",
            "StatusTypeID": 50,
            "LevelID": 3,
            "Amps": 63,
            "Voltage": 400,
            "PowerKW": 43,
            "CurrentTypeID": 20,
            "Quantity": 1
        },
        {
            "ID": 206699,
            "ConnectionTypeID": 2,
            "Reference": "2",
            "StatusTypeID": 50,
            "LevelID": 3,
            "Amps": 125,
            "Voltage": 400,
            "PowerKW": 50,
            "CurrentTypeID": 30,
            "Quantity": 1
        },
        {
            "ID": 206700,
            "ConnectionTypeID": 33,
            "Reference": "3",
            "StatusTypeID": 50,
            "LevelID": 3,
            "Amps": 125,
            "Voltage": 400,
            "PowerKW": 50,
            "CurrentTypeID": 30,
            "Quantity": 1
        }
    ],
    "NumberOfPoints": 2,
    "StatusTypeID": 50,
    "DateLastStatusUpdate": "2020-02-11T14:03:00Z",
    "MetadataValues": [
        {
            "ID": 7000,
            "MetadataFieldID": 4,
            "ItemValue": "Contains public sector information licensed under the Open Government Licence v2.0. http://www.nationalarchives.gov.uk/doc/open-government-licence/version/2/"
        }
    ],
    "DataQualityLevel": 3,
    "DateCreated": "2020-02-11T13:52:00Z",
    "SubmissionStatusTypeID": 100
}