{
    "IsRecentlyVerified": false,
    "ID": 90190,
    "UUID": "ABBB2004-5262-48A4-9409-A32B4204A8A5",
    "DataProviderID": 1,
    "OperatorID": 23,
    "OperatorsReference": "31302",
    "UsageTypeID": 4,
    "AddressInfo": {
        "ID": 90536,
        "Title": "Doubletree By Hilton Mahwah",
        "AddressLine1": "180 Route 17 S",
        "Town": "Mahwah",
        "StateOrProvince": "New Jersey",
        "Postcode": "07430",
        "CountryID": 2,
        "Latitude": 41.096589,
        "Longitude": -74.159129,
        "ContactTelephone1": "(201) 529-5880",
        "DistanceUnit": 0
    },
    "Connections": [
        {
            "ID": 127843,
            "ConnectionTypeID": 30,
            "StatusTypeID": 50,
            "LevelID": 2,
            "PowerKW": 16,
            "CurrentTypeID": 20,
            "Quantity": 1
        }
    ],
    "NumberOfPoints": 1,
    "GeneralComments": "1 Tesla Connector, up to 16kW.Available for customers. Please see front desk.",
    "StatusTypeID": 50,
    "DateLastStatusUpdate": "2017-07-13T14:10:00Z",
    "DataQualityLevel": 1,
    "DateCreated": "2017-07-13T14:10:00Z",
    "SubmissionStatusTypeID": 200
}