{
    "IsRecentlyVerified": false,
    "ID": 169073,
    "UUID": "9EA7708E-49B7-4F94-9F91-3485501798E6",
    "DataProviderID": 1,
    "OperatorID": 3247,
    "UsageTypeID": 1,
    "AddressInfo": {
        "ID": 169432,
        "Title": "Aspøya Fjordsenter",
        "AddressLine1": "",
        "Town": "Boksaspa",
        "StateOrProvince": "Møre og Romsdal",
        "Postcode": "6670",
        "CountryID": 168,
        "Latitude": 63.011624738087505,
        "Longitude": 7.976664870251852,
        "DistanceUnit": 0
    },
    "Connections": [
        {
            "ID": 257186,
            "ConnectionTypeID": 2,
            "StatusTypeID": 50,
            "LevelID": 2,
            "Amps": 100,
            "Voltage": 500,
            "PowerKW": 50,
            "Quantity": 2
        },
        {
            "ID": 257187,
            "ConnectionTypeID": 33,
            "StatusTypeID": 50,
            "LevelID": 3,
            "Amps": 100,
            "Voltage": 500,
            "PowerKW": 50,
            "CurrentTypeID": 30,
            "Quantity": 2
        },
        {
            "ID": 257188,
            "ConnectionTypeID": 25,
            "StatusTypeID": 50,
            "LevelID": 2,
            "Amps": 32,
            "Voltage": 400,
            "PowerKW": 22,
            "CurrentTypeID": 20,
            "Quantity": 2
        }
    ],
    "NumberOfPoints": 4,
    "StatusTypeID": 50,
    "DateLastStatusUpdate": "2020-10-10T18:39:00Z",
    "DataQualityLevel": 1,
    "DateCreated": "2020-10-10T18:39:00Z",
    "SubmissionStatusTypeID": 200
}