{
    "IsRecentlyVerified": false,
    "ID": 186025,
    "UUID": "1A1EF273-C1EF-48FC-8BA1-87157BF07EA0",
    "DataProviderID": 29,
    "DataProvidersReference": "4615",
    "AddressInfo": {
        "ID": 186384,
        "Title": "Berliner Straße 3",
        "AddressLine1": "Berliner Straße 3",
        "Town": "Budenheim",
        "Postcode": "55257",
        "CountryID": 87,
        "Latitude": 50.021611,
        "Longitude": 8.166655,
        "DistanceUnit": 0
    },
    "Connections": [
        {
            "ID": 297503,
            "ConnectionTypeID": 25,
            "StatusTypeID": 50,
            "LevelID": 2,
            "PowerKW": 22,
            "CurrentTypeID": 20
        },
        {
            "ID": 297504,
            "ConnectionTypeID": 25,
            "StatusTypeID": 50,
            "LevelID": 2,
            "PowerKW": 22,
            "CurrentTypeID": 20
        }
    ],
    "StatusTypeID": 50,
    "DateLastStatusUpdate": "2021-07-12T02:44:00Z",
    "MetadataValues": [
        {
            "ID": 18267,
            "MetadataFieldID": 4,
            "ItemValue": "Data from the German chargepoint registry provided by Bundesnetzagentur.de under the CC-BY 4.0 license"
        }
    ],
    "DataQualityLevel": 3,
    "DateCreated": "2021-07-12T02:44:00Z",
    "SubmissionStatusTypeID": 100
}