{
    "UserComments": [
        {
            "ID": 13919,
            "ChargePointID": 43503,
            "CommentTypeID": 50,
            "UserName": "dexter",
            "Comment": "Achtung: die Ladestation wird derzeit repariert (wurde umgefahren), soll ab Mitte August (2016) wieder verfügbar sein, aktueller Stand s. Betreiber-Website (oder Anruf bei der Hotline). Die Hotline ist super und lässt einen zur Not auch bei den Stadtwerken an eine Steckdose.\n\nDie Station ist übrigens nicht direkt am Willy-Brandt-Platz, sondern um die Ecke Im Hagen 7 (51.615134, 7.520976) an der Einfahrt zum Saturn-Parkhaus (mit Parkplatz-Reservierung für E-Mobile).\n\nOrt ist perfekt.\n",
            "Rating": 5,
            "DateCreated": "2016-07-30T18:25:22.803Z",
            "User": {
                "ID": 4520,
                "Username": "dexter"
            },
            "CheckinStatusTypeID": 20
        }
    ],
    "IsRecentlyVerified": false,
    "ID": 43503,
    "UUID": "772992FC-3F76-4241-88C9-B68AE98D8670",
    "DataProviderID": 1,
    "OperatorID": 1,
    "UsageTypeID": 7,
    "UsageCost": "0",
    "AddressInfo": {
        "ID": 43849,
        "Title": "Rathaus Lünen",
        "AddressLine1": "Im Hagen 7",
        "AddressLine2": "",
        "Town": "Lünen",
        "StateOrProvince": "Kreis Unna",
        "Postcode": "44532",
        "CountryID": 87,
        "Latitude": 51.615134,
        "Longitude": 7.520976,
        "ContactTelephone1": "+49 2306 707 105",
        "ContactTelephone2": "",
        "ContactEmail": "",
        "AccessComments": "Immer nutzbar mit Ladekarte der Stadtwerke Lünen oder nach telefonischer Freischaltung (24/7 besetzt), siehe Kontakt-Telefonnummer. 1 Parkplatz.",
        "RelatedURL": "http://www.stadtwerke-luenen.de/service/energieberatung/elektromobilitaet",
        "DistanceUnit": 0
    },
    "Connections": [
        {
            "ID": 52744,
            "ConnectionTypeID": 25,
            "StatusTypeID": 50,
            "LevelID": 2,
            "Amps": 32,
            "Voltage": 400,
            "PowerKW": 22,
            "CurrentTypeID": 20,
            "Quantity": 1
        },
        {
            "ID": 52745,
            "ConnectionTypeID": 28,
            "StatusTypeID": 50,
            "LevelID": 2,
            "Amps": 16,
            "Voltage": 230,
            "PowerKW": 3.7,
            "CurrentTypeID": 10,
            "Quantity": 1
        }
    ],
    "NumberOfPoints": 1,
    "GeneralComments": "",
    "StatusTypeID": 50,
    "DateLastStatusUpdate": "2016-07-30T18:27:00Z",
    "DataQualityLevel": 1,
    "DateCreated": "2015-04-02T06:31:00Z",
    "SubmissionStatusTypeID": 200
}