{
    "IsRecentlyVerified": false,
    "ID": 184807,
    "UUID": "F2D9B709-3896-48AC-974F-EB14F3768705",
    "DataProviderID": 29,
    "DataProvidersReference": "6165,13937",
    "AddressInfo": {
        "ID": 185166,
        "Title": "Winsener Landstr. 13",
        "AddressLine1": "Winsener Landstr. 13",
        "Town": "Winsen",
        "Postcode": "21423",
        "CountryID": 87,
        "Latitude": 53.339145,
        "Longitude": 10.203519,
        "DistanceUnit": 0
    },
    "Connections": [
        {
            "ID": 293532,
            "ConnectionTypeID": 25,
            "StatusTypeID": 50,
            "LevelID": 2,
            "PowerKW": 22,
            "CurrentTypeID": 20
        },
        {
            "ID": 293533,
            "ConnectionTypeID": 25,
            "StatusTypeID": 50,
            "LevelID": 2,
            "PowerKW": 22,
            "CurrentTypeID": 20
        },
        {
            "ID": 293534,
            "ConnectionTypeID": 25,
            "StatusTypeID": 50,
            "LevelID": 2,
            "PowerKW": 22,
            "CurrentTypeID": 20
        },
        {
            "ID": 293535,
            "ConnectionTypeID": 25,
            "StatusTypeID": 50,
            "LevelID": 2,
            "PowerKW": 22,
            "CurrentTypeID": 20
        }
    ],
    "StatusTypeID": 50,
    "DateLastStatusUpdate": "2021-07-09T03:29:00Z",
    "MetadataValues": [
        {
            "ID": 17098,
            "MetadataFieldID": 4,
            "ItemValue": "Data from the German chargepoint registry provided by Bundesnetzagentur.de under the CC-BY 4.0 license"
        }
    ],
    "DataQualityLevel": 3,
    "DateCreated": "2021-07-08T10:05:00Z",
    "SubmissionStatusTypeID": 100
}