{
    "IsRecentlyVerified": false,
    "ID": 84117,
    "UUID": "59B64EAE-DC42-4F3B-B725-C2CD3948515E",
    "DataProviderID": 1,
    "OperatorID": 23,
    "OperatorsReference": "24819",
    "UsageTypeID": 6,
    "AddressInfo": {
        "ID": 84463,
        "Title": "Anticavilla Restaurant, Hotel & Spa",
        "AddressLine1": "Anticavilla Restaurant, Hotel & Spa",
        "Postcode": "62290",
        "CountryID": 146,
        "Latitude": 18.936452,
        "Longitude": -99.223552,
        "ContactTelephone1": "+52 777 313 3131",
        "DistanceUnit": 0
    },
    "Connections": [
        {
            "ID": 119518,
            "ConnectionTypeID": 30,
            "StatusTypeID": 50,
            "LevelID": 2,
            "PowerKW": 18,
            "CurrentTypeID": 20,
            "Quantity": 2
        }
    ],
    "NumberOfPoints": 2,
    "GeneralComments": "2 Tesla Connectors, up to 18kW.Available for patrons only. Self park.",
    "StatusTypeID": 50,
    "DateLastStatusUpdate": "2017-02-16T16:50:00Z",
    "DataQualityLevel": 1,
    "DateCreated": "2017-02-16T16:50:00Z",
    "SubmissionStatusTypeID": 200
}