{
    "IsRecentlyVerified": false,
    "ID": 102735,
    "UUID": "6EF28DC2-9788-4BBC-BD4E-7C86CA7E49E7",
    "DataProviderID": 2,
    "DataProvidersReference": "87402",
    "OperatorID": 5,
    "UsageTypeID": 1,
    "AddressInfo": {
        "ID": 103081,
        "Title": "EVERGY",
        "AddressLine1": "300 W 9th St @ 9th Street Parking Garage",
        "Town": "Kansas City",
        "StateOrProvince": "MO",
        "Postcode": "64105",
        "CountryID": 2,
        "Latitude": 39.1038365,
        "Longitude": -94.5867334,
        "ContactTelephone1": "888-758-4389",
        "AccessComments": "24 hours daily",
        "RelatedURL": "http://www.chargepoint.com/",
        "DistanceUnit": 0
    },
    "Connections": [
        {
            "ID": 144855,
            "ConnectionTypeID": 1,
            "LevelID": 2,
            "Amps": 16,
            "Voltage": 230,
            "PowerKW": 3.7,
            "CurrentTypeID": 10,
            "Quantity": 8
        }
    ],
    "DateLastStatusUpdate": "2020-06-26T03:01:00Z",
    "DataQualityLevel": 3,
    "DateCreated": "2018-04-21T04:13:00Z",
    "SubmissionStatusTypeID": 100
}