{
    "IsRecentlyVerified": false,
    "ID": 179943,
    "UUID": "5E6616E9-94C5-4260-A32E-FE7FFBDBB7D5",
    "DataProviderID": 29,
    "DataProvidersReference": "7400",
    "OperatorID": 44,
    "AddressInfo": {
        "ID": 180302,
        "Title": "Oberfeldstraße 85",
        "AddressLine1": "Oberfeldstraße 85",
        "Town": "Dortmund",
        "Postcode": "44369",
        "CountryID": 87,
        "Latitude": 51.531187,
        "Longitude": 7.406094,
        "DistanceUnit": 0
    },
    "Connections": [
        {
            "ID": 282437,
            "ConnectionTypeID": 28,
            "StatusTypeID": 50,
            "LevelID": 2,
            "PowerKW": 7.1,
            "CurrentTypeID": 10
        },
        {
            "ID": 282438,
            "ConnectionTypeID": 25,
            "StatusTypeID": 50,
            "LevelID": 2,
            "PowerKW": 7.1,
            "CurrentTypeID": 10
        }
    ],
    "StatusTypeID": 50,
    "DateLastStatusUpdate": "2021-07-12T02:48:00Z",
    "MetadataValues": [
        {
            "ID": 12237,
            "MetadataFieldID": 4,
            "ItemValue": "Data from the German chargepoint registry provided by Bundesnetzagentur.de under the CC-BY 4.0 license"
        }
    ],
    "DataQualityLevel": 3,
    "DateCreated": "2021-07-08T10:00:00Z",
    "SubmissionStatusTypeID": 100
}