{
    "IsRecentlyVerified": false,
    "ID": 187016,
    "UUID": "2B288002-F9F9-4ABD-A47A-C25F8327F89B",
    "DataProviderID": 29,
    "DataProvidersReference": "16194",
    "AddressInfo": {
        "ID": 187375,
        "Title": "Brunnenstr. 26",
        "AddressLine1": "Brunnenstr. 26",
        "Town": "Eberswalde",
        "Postcode": "16225",
        "CountryID": 87,
        "Latitude": 52.82693,
        "Longitude": 13.80602,
        "DistanceUnit": 0
    },
    "Connections": [
        {
            "ID": 300956,
            "ConnectionTypeID": 25,
            "StatusTypeID": 50,
            "LevelID": 2,
            "PowerKW": 22,
            "CurrentTypeID": 20
        },
        {
            "ID": 300957,
            "ConnectionTypeID": 25,
            "StatusTypeID": 50,
            "LevelID": 2,
            "PowerKW": 22,
            "CurrentTypeID": 20
        }
    ],
    "StatusTypeID": 50,
    "DateLastStatusUpdate": "2021-07-12T02:50:00Z",
    "MetadataValues": [
        {
            "ID": 19256,
            "MetadataFieldID": 4,
            "ItemValue": "Data from the German chargepoint registry provided by Bundesnetzagentur.de under the CC-BY 4.0 license"
        }
    ],
    "DataQualityLevel": 3,
    "DateCreated": "2021-07-12T02:50:00Z",
    "SubmissionStatusTypeID": 100
}