{
    "IsRecentlyVerified": false,
    "ID": 124120,
    "UUID": "E874B703-5554-4C44-871E-469A53CF86AF",
    "DataProviderID": 2,
    "DataProvidersReference": "66693",
    "OperatorID": 5,
    "UsageTypeID": 1,
    "AddressInfo": {
        "ID": 124466,
        "Title": "SAN LEANDRO",
        "AddressLine1": "120 Estudillo Ave",
        "Town": "San Leandro",
        "StateOrProvince": "CA",
        "Postcode": "94577",
        "CountryID": 2,
        "Latitude": 37.725635,
        "Longitude": -122.1556,
        "ContactTelephone1": "888-758-4389",
        "AccessComments": "24 hours daily",
        "RelatedURL": "http://www.chargepoint.com/",
        "DistanceUnit": 0
    },
    "Connections": [
        {
            "ID": 174177,
            "ConnectionTypeID": 1,
            "LevelID": 2,
            "Amps": 16,
            "Voltage": 230,
            "PowerKW": 3,
            "CurrentTypeID": 10,
            "Quantity": 4
        }
    ],
    "DateLastStatusUpdate": "2019-12-24T09:14:00Z",
    "DataQualityLevel": 3,
    "DateCreated": "2019-04-06T05:03:00Z",
    "SubmissionStatusTypeID": 100
}