{
    "IsRecentlyVerified": false,
    "ID": 42239,
    "UUID": "B89614A0-4166-4F90-B7A5-2BC62A7AC5A8",
    "DataProviderID": 1,
    "OperatorID": 160,
    "UsageTypeID": 4,
    "UsageCost": "0",
    "AddressInfo": {
        "ID": 42585,
        "Title": "Rark & Ride Parkplatz Bahnhof Tharandt",
        "AddressLine1": "Dresdner Straße 26",
        "Town": "Tharandt",
        "StateOrProvince": "Tharandt",
        "Postcode": "01737",
        "CountryID": 87,
        "Latitude": 50.9829384581265,
        "Longitude": 13.5887007522322,
        "ContactTelephone1": "0800 0320020",
        "AccessComments": "2 immer nutzbare kostenlose Parkplätze auf dem Parkplatz zwischen Netto Markt und Bahnhof. Anmeldung bei StromTicket notwendig, Freischaltung per Smartphone App / Internet. ",
        "RelatedURL": "http://stromticket.de/",
        "DistanceUnit": 0
    },
    "Connections": [
        {
            "ID": 50777,
            "ConnectionTypeID": 25,
            "StatusTypeID": 50,
            "LevelID": 2,
            "Amps": 16,
            "Voltage": 400,
            "PowerKW": 11,
            "CurrentTypeID": 20,
            "Quantity": 2
        },
        {
            "ID": 50778,
            "ConnectionTypeID": 28,
            "StatusTypeID": 50,
            "LevelID": 2,
            "Amps": 16,
            "Voltage": 230,
            "PowerKW": 3.7,
            "CurrentTypeID": 10,
            "Quantity": 2
        }
    ],
    "NumberOfPoints": 4,
    "StatusTypeID": 50,
    "DateLastStatusUpdate": "2015-03-03T16:52:00Z",
    "DataQualityLevel": 1,
    "DateCreated": "2015-03-02T10:01:00Z",
    "SubmissionStatusTypeID": 200
}