{
    "IsRecentlyVerified": false,
    "ID": 159380,
    "UUID": "A26C0ABA-F9C6-4ACA-982F-E5B3F3470AFF",
    "DataProviderID": 2,
    "DataProvidersReference": "152427",
    "OperatorID": 39,
    "UsageTypeID": 1,
    "AddressInfo": {
        "ID": 159737,
        "Title": "26300",
        "AddressLine1": "133 National Business Parkway",
        "Town": "Annapolis Junction",
        "StateOrProvince": "MD",
        "Postcode": "20701",
        "CountryID": 2,
        "Latitude": 39.1243889,
        "Longitude": -76.774318,
        "ContactTelephone1": "800-663-5633",
        "AccessComments": "MO: Not Specified; TU: Not Specified; WE: Not Specified; TH: Not Specified; FR: Not Specified; SA: Not Specified; SU: Not Specified",
        "RelatedURL": "http://www.semacharge.com/",
        "DistanceUnit": 0
    },
    "Connections": [
        {
            "ID": 229539,
            "ConnectionTypeID": 1,
            "LevelID": 2,
            "Amps": 16,
            "Voltage": 230,
            "PowerKW": 3.7,
            "CurrentTypeID": 10,
            "Quantity": 2
        }
    ],
    "StatusTypeID": 50,
    "DateLastStatusUpdate": "2020-06-26T03:01:00Z",
    "DataQualityLevel": 3,
    "DateCreated": "2020-06-26T03:01:00Z",
    "SubmissionStatusTypeID": 100
}