{
    "IsRecentlyVerified": false,
    "ID": 178147,
    "UUID": "BC8D3EFE-7A07-4FF5-BB56-C2DAE9676AC1",
    "DataProviderID": 29,
    "DataProvidersReference": "17239",
    "OperatorID": 103,
    "AddressInfo": {
        "ID": 178506,
        "Title": "Brennerstr. 90",
        "AddressLine1": "Brennerstr. 90",
        "Town": "Berlin",
        "Postcode": "13187",
        "CountryID": 87,
        "Latitude": 52.558692,
        "Longitude": 13.412595,
        "DistanceUnit": 0
    },
    "Connections": [
        {
            "ID": 278188,
            "ConnectionTypeID": 25,
            "StatusTypeID": 50,
            "LevelID": 2,
            "PowerKW": 11,
            "CurrentTypeID": 20
        },
        {
            "ID": 278189,
            "ConnectionTypeID": 25,
            "StatusTypeID": 50,
            "LevelID": 2,
            "PowerKW": 11,
            "CurrentTypeID": 20
        }
    ],
    "StatusTypeID": 0,
    "DateLastStatusUpdate": "2021-07-12T02:50:00Z",
    "MetadataValues": [
        {
            "ID": 10441,
            "MetadataFieldID": 4,
            "ItemValue": "Data from the German chargepoint registry provided by Bundesnetzagentur.de under the CC-BY 4.0 license"
        }
    ],
    "DataQualityLevel": 3,
    "DateCreated": "2021-07-08T09:49:00Z",
    "SubmissionStatusTypeID": 100
}