{
    "IsRecentlyVerified": false,
    "ID": 17053,
    "UUID": "116A9E63-FC4F-48F0-A65C-C5D2188A9175",
    "DataProviderID": 22,
    "DataProvidersReference": "106D6A60386B448F80D401758C203F54",
    "AddressInfo": {
        "ID": 17398,
        "Title": "埼玉日産自動車春日部店",
        "AddressLine1": "埼玉県春日部市八丁目454",
        "CountryID": 114,
        "Latitude": 35.98721623,
        "Longitude": 139.7584244,
        "ContactTelephone1": "048-754-4123",
        "DistanceUnit": 0
    },
    "Connections": [
        {
            "ID": 17294,
            "ConnectionTypeID": 2,
            "LevelID": 2,
            "Amps": 100,
            "Voltage": 480,
            "PowerKW": 48,
            "Quantity": 1
        }
    ],
    "DateLastStatusUpdate": "2013-06-29T08:53:00Z",
    "DataQualityLevel": 2,
    "DateCreated": "2013-06-29T08:53:00Z",
    "SubmissionStatusTypeID": 200
}