{
    "IsRecentlyVerified": false,
    "ID": 178411,
    "UUID": "136293EE-9296-4890-BB51-93BF6012595C",
    "DataProviderID": 29,
    "DataProvidersReference": "6523",
    "AddressInfo": {
        "ID": 178770,
        "Title": "Am Heilbrunnen 140",
        "AddressLine1": "Am Heilbrunnen 140",
        "Town": "Reutlingen",
        "Postcode": "72766",
        "CountryID": 87,
        "Latitude": 48.512332,
        "Longitude": 9.230772,
        "DistanceUnit": 0
    },
    "Connections": [
        {
            "ID": 278778,
            "ConnectionTypeID": 25,
            "StatusTypeID": 50,
            "LevelID": 2,
            "PowerKW": 22,
            "CurrentTypeID": 20
        },
        {
            "ID": 278779,
            "ConnectionTypeID": 25,
            "StatusTypeID": 50,
            "LevelID": 2,
            "PowerKW": 22,
            "CurrentTypeID": 20
        }
    ],
    "StatusTypeID": 0,
    "DateLastStatusUpdate": "2021-07-12T02:41:00Z",
    "MetadataValues": [
        {
            "ID": 10705,
            "MetadataFieldID": 4,
            "ItemValue": "Data from the German chargepoint registry provided by Bundesnetzagentur.de under the CC-BY 4.0 license"
        }
    ],
    "DataQualityLevel": 3,
    "DateCreated": "2021-07-08T09:50:00Z",
    "SubmissionStatusTypeID": 100
}