{
    "IsRecentlyVerified": false,
    "ID": 145572,
    "UUID": "BF85CB77-85F3-40BF-BC3F-8EE07D13EF74",
    "DataProviderID": 2,
    "DataProvidersReference": "147478",
    "OperatorID": 5,
    "UsageTypeID": 1,
    "AddressInfo": {
        "ID": 145924,
        "Title": "MITSU",
        "AddressLine1": "445 Boulevard Rene Levesque O",
        "Town": "Chandler",
        "StateOrProvince": "QC",
        "Postcode": "G0C 1K0",
        "CountryID": 44,
        "Latitude": 48.3489283,
        "Longitude": -64.6974393,
        "ContactTelephone1": "888-758-4389",
        "AccessComments": "24 hours daily",
        "RelatedURL": "http://www.chargepoint.com/",
        "DistanceUnit": 0
    },
    "Connections": [
        {
            "ID": 202283,
            "ConnectionTypeID": 1,
            "LevelID": 2,
            "Amps": 16,
            "Voltage": 230,
            "PowerKW": 3.7,
            "CurrentTypeID": 10,
            "Quantity": 2
        }
    ],
    "StatusTypeID": 50,
    "DateLastStatusUpdate": "2020-06-26T03:11:00Z",
    "DataQualityLevel": 3,
    "DateCreated": "2019-12-24T09:25:00Z",
    "SubmissionStatusTypeID": 100
}