{
    "IsRecentlyVerified": false,
    "ID": 17512,
    "UUID": "A7F2B8A3-56BF-4145-AC2F-FE03F1E48244",
    "DataProviderID": 22,
    "DataProvidersReference": "65F675B3CF48B79D1D4FE970F1688C6B",
    "AddressInfo": {
        "ID": 17857,
        "Title": "日産プリンス大分販売三重店",
        "AddressLine1": "大分県豊後大野市三重町赤嶺1044",
        "CountryID": 114,
        "Latitude": 32.98438935,
        "Longitude": 131.5997347,
        "ContactTelephone1": "0974-22-2332",
        "DistanceUnit": 0
    },
    "Connections": [
        {
            "ID": 17753,
            "ConnectionTypeID": 2,
            "LevelID": 2,
            "Amps": 100,
            "Voltage": 480,
            "PowerKW": 48,
            "Quantity": 1
        }
    ],
    "DateLastStatusUpdate": "2013-06-29T08:59:00Z",
    "DataQualityLevel": 2,
    "DateCreated": "2013-06-29T08:59:00Z",
    "SubmissionStatusTypeID": 200
}