{
    "IsRecentlyVerified": false,
    "ID": 88871,
    "UUID": "4450A794-6899-4A91-8084-874FCBEEFCA2",
    "DataProviderID": 1,
    "OperatorID": 23,
    "OperatorsReference": "30558",
    "UsageTypeID": 6,
    "AddressInfo": {
        "ID": 89217,
        "Title": "Hôtel les Lodges Sainte Victoire",
        "AddressLine1": "2250 Route Cézanne",
        "Town": "Le Tholonet",
        "Postcode": "13100",
        "CountryID": 80,
        "Latitude": 43.523426,
        "Longitude": 5.500318,
        "ContactTelephone1": "+33 4 42 24 80 40",
        "DistanceUnit": 0
    },
    "Connections": [
        {
            "ID": 126119,
            "ConnectionTypeID": 30,
            "StatusTypeID": 50,
            "LevelID": 2,
            "Amps": 32,
            "Voltage": 400,
            "PowerKW": 22,
            "CurrentTypeID": 20,
            "Quantity": 1
        }
    ],
    "NumberOfPoints": 1,
    "GeneralComments": "1 Tesla Connector, up to 22kW.Available for patrons only. Please see valet.",
    "StatusTypeID": 50,
    "DateLastStatusUpdate": "2018-10-03T22:29:00Z",
    "DataQualityLevel": 1,
    "DateCreated": "2017-06-09T15:12:00Z",
    "SubmissionStatusTypeID": 200
}