{
    "IsRecentlyVerified": false,
    "ID": 160364,
    "UUID": "64E41F3D-C1A6-43B3-B949-3D1501F19650",
    "DataProviderID": 2,
    "DataProvidersReference": "151867",
    "OperatorID": 3293,
    "UsageTypeID": 1,
    "AddressInfo": {
        "ID": 160721,
        "Title": "Walgreens #9544",
        "AddressLine1": "10903 SE Oak St",
        "Town": "Milwaukie",
        "StateOrProvince": "OR",
        "Postcode": "97222",
        "CountryID": 2,
        "Latitude": 45.444009,
        "Longitude": -122.629551,
        "ContactTelephone1": "888-264-2208",
        "AccessComments": "6am-12am daily",
        "RelatedURL": "https://voltacharging.com/",
        "DistanceUnit": 0
    },
    "Connections": [
        {
            "ID": 230737,
            "ConnectionTypeID": 1,
            "LevelID": 2,
            "Amps": 16,
            "Voltage": 230,
            "PowerKW": 3.7,
            "CurrentTypeID": 10,
            "Quantity": 2
        }
    ],
    "StatusTypeID": 50,
    "DateLastStatusUpdate": "2020-06-26T03:09:00Z",
    "DataQualityLevel": 3,
    "DateCreated": "2020-06-26T03:09:00Z",
    "SubmissionStatusTypeID": 100
}