{
    "IsRecentlyVerified": false,
    "ID": 145407,
    "UUID": "15EC320E-BEE7-4FBC-A6EB-212DEB302C45",
    "DataProviderID": 2,
    "DataProvidersReference": "60241",
    "OperatorID": 5,
    "UsageTypeID": 1,
    "AddressInfo": {
        "ID": 145759,
        "Title": "PARKMETRO1",
        "AddressLine1": "11101 NE 12th St",
        "Town": "Bellevue",
        "StateOrProvince": "WA",
        "Postcode": "98004",
        "CountryID": 2,
        "Latitude": 47.6207931,
        "Longitude": -122.1924689,
        "ContactTelephone1": "888-758-4389",
        "AccessComments": "24 hours daily",
        "RelatedURL": "http://www.chargepoint.com/",
        "DistanceUnit": 0
    },
    "Connections": [
        {
            "ID": 202074,
            "ConnectionTypeID": 1,
            "LevelID": 2,
            "Amps": 16,
            "Voltage": 230,
            "PowerKW": 3.7,
            "CurrentTypeID": 10,
            "Quantity": 2
        }
    ],
    "StatusTypeID": 50,
    "DateLastStatusUpdate": "2020-06-26T03:11:00Z",
    "DataQualityLevel": 3,
    "DateCreated": "2019-12-24T09:24:00Z",
    "SubmissionStatusTypeID": 100
}