{
    "IsRecentlyVerified": false,
    "ID": 19421,
    "UUID": "420D4CCB-289C-4554-AB24-8583E4FCF966",
    "DataProviderID": 18,
    "DataProvidersReference": "9d82620296a1e1fb76c64302dc3d77ba",
    "OperatorID": 20,
    "UsageTypeID": 4,
    "AddressInfo": {
        "ID": 19766,
        "Title": "Hexham",
        "AddressLine1": "Linden House",
        "Town": "Hexham",
        "Postcode": "NE46 4AG",
        "CountryID": 1,
        "Latitude": 55.03571,
        "Longitude": -2.126786,
        "AccessComments": "Humshaugh Village Hall",
        "RelatedURL": "http://www.chargeyourcar.org.uk",
        "DistanceUnit": 0
    },
    "Connections": [
        {
            "ID": 19725,
            "ConnectionTypeID": 25,
            "Reference": "0",
            "StatusTypeID": 50,
            "LevelID": 2,
            "Amps": 32,
            "Voltage": 230,
            "PowerKW": 7,
            "CurrentTypeID": 10
        }
    ],
    "DateLastStatusUpdate": "2020-03-12T15:48:00Z",
    "DataQualityLevel": 3,
    "DateCreated": "2013-09-26T03:45:00Z",
    "SubmissionStatusTypeID": 200
}