{
    "UserComments": [
        {
            "ID": 24030,
            "ChargePointID": 167205,
            "CommentTypeID": 10,
            "UserName": "Raule_19",
            "Comment": "super capados,a 16A",
            "Rating": 2,
            "DateCreated": "2021-03-18T17:56:59.86Z",
            "User": {
                "ID": 19690,
                "Username": "Raule_19"
            },
            "CheckinStatusTypeID": 10,
            "IsActionedByEditor": false
        },
        {
            "ID": 23169,
            "ChargePointID": 167205,
            "CommentTypeID": 10,
            "UserName": "Raule_19",
            "Rating": 3,
            "DateCreated": "2020-08-31T09:56:22.763Z",
            "User": {
                "ID": 19690,
                "Username": "Raule_19"
            },
            "CheckinStatusTypeID": 10,
            "IsActionedByEditor": false
        },
        {
            "ID": 23168,
            "ChargePointID": 167205,
            "CommentTypeID": 10,
            "UserName": "Raule_19",
            "Rating": 3,
            "DateCreated": "2020-08-31T09:55:49.837Z",
            "User": {
                "ID": 19690,
                "Username": "Raule_19"
            },
            "CheckinStatusTypeID": 10,
            "IsActionedByEditor": false
        }
    ],
    "MediaItems": [
        {
            "ID": 24547,
            "ChargePointID": 167205,
            "ItemURL": "https://s3-ap-southeast-2.amazonaws.com/openchargemap/images/ES/OCM167205/OCM-167205.orig.2020083109552732.jpg",
            "ItemThumbnailURL": "https://s3-ap-southeast-2.amazonaws.com/openchargemap/images/ES/OCM167205/OCM-167205.thmb.2020083109552732.jpg",
            "Comment": "",
            "IsEnabled": true,
            "IsVideo": false,
            "IsFeaturedItem": false,
            "IsExternalResource": false,
            "User": {
                "ID": 19690,
                "Username": "Raule_19"
            },
            "DateCreated": "2020-08-31T09:56:00Z"
        },
        {
            "ID": 24545,
            "ChargePointID": 167205,
            "ItemURL": "https://s3-ap-southeast-2.amazonaws.com/openchargemap/images/ES/OCM167205/OCM-167205.orig.2020083109545779.jpg",
            "ItemThumbnailURL": "https://s3-ap-southeast-2.amazonaws.com/openchargemap/images/ES/OCM167205/OCM-167205.thmb.2020083109545779.jpg",
            "Comment": "",
            "IsEnabled": true,
            "IsVideo": false,
            "IsFeaturedItem": false,
            "IsExternalResource": false,
            "User": {
                "ID": 19690,
                "Username": "Raule_19"
            },
            "DateCreated": "2020-08-31T09:55:00Z"
        },
        {
            "ID": 24546,
            "ChargePointID": 167205,
            "ItemURL": "https://s3-ap-southeast-2.amazonaws.com/openchargemap/images/ES/OCM167205/OCM-167205.orig.2020083109552212.jpg",
            "ItemThumbnailURL": "https://s3-ap-southeast-2.amazonaws.com/openchargemap/images/ES/OCM167205/OCM-167205.thmb.2020083109552212.jpg",
            "Comment": "",
            "IsEnabled": true,
            "IsVideo": false,
            "IsFeaturedItem": false,
            "IsExternalResource": false,
            "User": {
                "ID": 19690,
                "Username": "Raule_19"
            },
            "DateCreated": "2020-08-31T09:55:00Z"
        }
    ],
    "IsRecentlyVerified": false,
    "ID": 167205,
    "UUID": "4ABBF2F3-06A8-4175-9B40-3120B627F1C3",
    "DataProviderID": 1,
    "OperatorID": 1,
    "UsageTypeID": 1,
    "UsageCost": "Free",
    "AddressInfo": {
        "ID": 167564,
        "Title": "PDR Mercadona",
        "AddressLine1": "Ronda de Tolosa",
        "Town": "Barcelona",
        "StateOrProvince": "Barcelona",
        "Postcode": "08211",
        "CountryID": 210,
        "Latitude": 41.6041490855917,
        "Longitude": 2.0870026638185664,
        "DistanceUnit": 0
    },
    "Connections": [
        {
            "ID": 253210,
            "ConnectionTypeID": 25,
            "StatusTypeID": 50,
            "LevelID": 2,
            "Voltage": 380,
            "PowerKW": 9,
            "CurrentTypeID": 20,
            "Quantity": 5
        }
    ],
    "NumberOfPoints": 5,
    "GeneralComments": "carga super lenta a 1 fase",
    "StatusTypeID": 50,
    "DateLastStatusUpdate": "2021-03-18T17:58:00Z",
    "DataQualityLevel": 1,
    "DateCreated": "2020-08-29T13:16:00Z",
    "SubmissionStatusTypeID": 200
}