{
    "IsRecentlyVerified": false,
    "ID": 148877,
    "UUID": "5D7095BE-08DB-472B-96D5-ECD4EC821916",
    "DataProviderID": 1,
    "OperatorID": 80,
    "UsageTypeID": 4,
    "AddressInfo": {
        "ID": 149229,
        "Title": "Maxi Futura di Grottaminarda | EnelX",
        "AddressLine1": "SP36 - Via dei Cipressi,",
        "Town": "Grottaminarda",
        "StateOrProvince": "AV",
        "Postcode": "83035",
        "CountryID": 112,
        "Latitude": 41.06409570933096,
        "Longitude": 15.056271614904972,
        "ContactTelephone1": "800.069.850",
        "RelatedURL": "https://www.enelx.com/it/it/emobility",
        "DistanceUnit": 0
    },
    "Connections": [
        {
            "ID": 206740,
            "ConnectionTypeID": 25,
            "StatusTypeID": 50,
            "LevelID": 2,
            "Amps": 32,
            "Voltage": 400,
            "PowerKW": 22,
            "CurrentTypeID": 20,
            "Quantity": 2
        }
    ],
    "NumberOfPoints": 2,
    "StatusTypeID": 50,
    "DateLastStatusUpdate": "2020-02-12T10:54:00Z",
    "DataQualityLevel": 1,
    "DateCreated": "2020-02-12T10:54:00Z",
    "SubmissionStatusTypeID": 200
}