{
    "IsRecentlyVerified": false,
    "ID": 137093,
    "UUID": "80B982E1-BBAA-460E-B3BF-F9D55ABEA716",
    "DataProviderID": 1,
    "DataProvidersReference": "SVC-00002",
    "AddressInfo": {
        "ID": 137439,
        "Title": "Estrada Regional 104",
        "AddressLine1": "Estrada Regional 104",
        "Town": "São Vicente",
        "Postcode": "9240-000",
        "CountryID": 180,
        "Latitude": 32.807708,
        "Longitude": -17.04768,
        "RelatedURL": "http://www.mobie.pt",
        "DistanceUnit": 0
    },
    "Connections": [
        {
            "ID": 191950,
            "ConnectionTypeID": 0,
            "LevelID": 2,
            "Amps": 75,
            "Voltage": 400,
            "PowerKW": 30
        }
    ],
    "NumberOfPoints": 3,
    "StatusTypeID": 50,
    "DateLastStatusUpdate": "2020-02-22T15:42:00Z",
    "DataQualityLevel": 3,
    "DateCreated": "2019-12-24T08:08:00Z",
    "SubmissionStatusTypeID": 100
}