{
    "IsRecentlyVerified": false,
    "ID": 139537,
    "UUID": "126D76E4-1D11-45CB-A065-F0114B5221AF",
    "DataProviderID": 2,
    "DataProvidersReference": "95901",
    "OperatorID": 9,
    "UsageTypeID": 1,
    "AddressInfo": {
        "ID": 139889,
        "Title": "Carl's Jr - 9002 Firestone",
        "AddressLine1": "9002 Firestone",
        "Town": "Downey",
        "StateOrProvince": "CA",
        "Postcode": "90241",
        "CountryID": 2,
        "Latitude": 33.93519,
        "Longitude": -118.12389,
        "ContactTelephone1": "888-998-2546",
        "AccessComments": "MON: 24 hours | TUE: 24 hours | WED: 24 hours | THU: 24 hours | FRI: 24 hours | SAT: 24 hours | SUN: 24 hours",
        "RelatedURL": "http://www.blinkcharging.com/",
        "DistanceUnit": 0
    },
    "Connections": [
        {
            "ID": 194935,
            "ConnectionTypeID": 1,
            "LevelID": 2,
            "Amps": 16,
            "Voltage": 230,
            "PowerKW": 3.7,
            "CurrentTypeID": 10,
            "Quantity": 2
        }
    ],
    "StatusTypeID": 50,
    "DateLastStatusUpdate": "2020-06-26T02:56:00Z",
    "DataQualityLevel": 3,
    "DateCreated": "2019-12-24T09:11:00Z",
    "SubmissionStatusTypeID": 100
}