{
    "IsRecentlyVerified": false,
    "ID": 111175,
    "UUID": "A411343D-0351-4585-9BF4-17C13055BF96",
    "DataProviderID": 2,
    "DataProvidersReference": "94490",
    "UsageTypeID": 1,
    "AddressInfo": {
        "ID": 111521,
        "Title": "Scotiabank",
        "AddressLine1": "114 High St",
        "Town": "Sutton West",
        "StateOrProvince": "ON",
        "Postcode": "L0M 1S0",
        "CountryID": 44,
        "Latitude": 44.303621,
        "Longitude": -79.3585685,
        "ContactTelephone1": "905-722-6591",
        "AccessComments": "24 hours daily",
        "RelatedURL": "",
        "DistanceUnit": 0
    },
    "Connections": [
        {
            "ID": 156548,
            "ConnectionTypeID": 1,
            "LevelID": 2,
            "Amps": 16,
            "Voltage": 230,
            "PowerKW": 3.7,
            "CurrentTypeID": 10,
            "Quantity": 1
        }
    ],
    "DateLastStatusUpdate": "2020-06-26T03:07:00Z",
    "DataQualityLevel": 3,
    "DateCreated": "2018-10-18T23:36:00Z",
    "SubmissionStatusTypeID": 100
}