{
    "IsRecentlyVerified": false,
    "ID": 111539,
    "UUID": "A9A67723-DEFF-4723-A805-3E4F06278265",
    "DataProviderID": 2,
    "DataProvidersReference": "82912",
    "UsageTypeID": 1,
    "AddressInfo": {
        "ID": 111885,
        "Title": "BMR Yamachiche",
        "AddressLine1": "1031 boul. Duchesne",
        "Town": "Yamachiche",
        "StateOrProvince": "QC",
        "Postcode": "G0X 3L0",
        "CountryID": 44,
        "Latitude": 46.2901373412201,
        "Longitude": -72.836292170639,
        "ContactTelephone1": "819-296-3713",
        "AccessComments": "24 hours daily; for client use only",
        "RelatedURL": "",
        "DistanceUnit": 0
    },
    "Connections": [
        {
            "ID": 156992,
            "ConnectionTypeID": 1,
            "LevelID": 2,
            "Amps": 16,
            "Voltage": 230,
            "PowerKW": 3.7,
            "CurrentTypeID": 10,
            "Quantity": 1
        }
    ],
    "DateLastStatusUpdate": "2020-06-26T03:10:00Z",
    "DataQualityLevel": 3,
    "DateCreated": "2018-10-18T23:37:00Z",
    "SubmissionStatusTypeID": 100
}