{
    "UserComments": [
        {
            "ID": 21429,
            "ChargePointID": 104610,
            "CommentTypeID": 10,
            "UserName": "ForumElettrico.it",
            "RelatedURL": "https://www.forumelettrico.it/forum/colonnina-enelx-via-spiaggia-lido-degli-estensi-fe-t6321.html",
            "DateCreated": "2019-08-29T07:47:00.167Z",
            "User": {
                "ID": 11749,
                "Username": "ForumElettrico.it"
            },
            "CheckinStatusTypeID": 25
        }
    ],
    "MediaItems": [
        {
            "ID": 19399,
            "ChargePointID": 104610,
            "ItemURL": "https://s3-ap-southeast-2.amazonaws.com/openchargemap/images/IT/OCM104610/OCM-104610.orig.2019082907471129.jpg",
            "ItemThumbnailURL": "https://s3-ap-southeast-2.amazonaws.com/openchargemap/images/IT/OCM104610/OCM-104610.thmb.2019082907471129.jpg",
            "Comment": "",
            "IsEnabled": true,
            "IsVideo": false,
            "IsFeaturedItem": false,
            "IsExternalResource": false,
            "User": {
                "ID": 11749,
                "Username": "ForumElettrico.it"
            },
            "DateCreated": "2019-08-29T07:47:00Z"
        },
        {
            "ID": 19400,
            "ChargePointID": 104610,
            "ItemURL": "https://s3-ap-southeast-2.amazonaws.com/openchargemap/images/IT/OCM104610/OCM-104610.orig.2019082907471678.jpg",
            "ItemThumbnailURL": "https://s3-ap-southeast-2.amazonaws.com/openchargemap/images/IT/OCM104610/OCM-104610.thmb.2019082907471678.jpg",
            "Comment": "",
            "IsEnabled": true,
            "IsVideo": false,
            "IsFeaturedItem": false,
            "IsExternalResource": false,
            "User": {
                "ID": 11749,
                "Username": "ForumElettrico.it"
            },
            "DateCreated": "2019-08-29T07:47:00Z"
        }
    ],
    "IsRecentlyVerified": false,
    "ID": 104610,
    "UUID": "2782D426-1E3F-4D82-987B-4CB3D4F16489",
    "DataProviderID": 1,
    "OperatorID": 80,
    "UsageTypeID": 4,
    "UsageCost": "0,40 €/kWh",
    "AddressInfo": {
        "ID": 104956,
        "Title": "Eneldrive Spiaggia",
        "AddressLine1": "Via Spiaggia 13",
        "Town": "Lido degli Estensi",
        "StateOrProvince": "FE",
        "Postcode": "44024",
        "CountryID": 112,
        "Latitude": 44.6681824028808,
        "Longitude": 12.2468095470874,
        "RelatedURL": "http://eneldrive.it",
        "DistanceUnit": 0
    },
    "Connections": [
        {
            "ID": 147646,
            "ConnectionTypeID": 25,
            "StatusTypeID": 50,
            "LevelID": 2,
            "Amps": 32,
            "Voltage": 400,
            "PowerKW": 22,
            "CurrentTypeID": 20,
            "Quantity": 1
        },
        {
            "ID": 147647,
            "ConnectionTypeID": 36,
            "StatusTypeID": 50,
            "LevelID": 2,
            "Amps": 16,
            "Voltage": 240,
            "PowerKW": 3,
            "CurrentTypeID": 10,
            "Quantity": 1
        }
    ],
    "NumberOfPoints": 2,
    "StatusTypeID": 50,
    "DateLastStatusUpdate": "2019-08-29T07:47:00Z",
    "DataQualityLevel": 1,
    "DateCreated": "2018-05-22T15:56:00Z",
    "SubmissionStatusTypeID": 200
}