{
    "IsRecentlyVerified": false,
    "ID": 61237,
    "UUID": "6105AAA7-FB4E-4C33-8255-CEF0FF2C4D58",
    "DataProviderID": 1,
    "OperatorID": 45,
    "UsageTypeID": 1,
    "AddressInfo": {
        "ID": 61583,
        "Title": "E-Bike Station am Rathaus",
        "AddressLine1": "Marktplatz 10",
        "Town": "Neukirchen",
        "StateOrProvince": "Landkreis Cham",
        "Postcode": "93453",
        "CountryID": 87,
        "Latitude": 49.2582,
        "Longitude": 12.97049000000004,
        "AccessComments": "24/7 nutzbar ohne Ladekarte. 3 Schukodosen frei verfügbar, Verlängerungskabel könnte nützlich sein. Absicherung der Steckdosen nicht bekannt.",
        "RelatedURL": "http://www.neukirchen.bayern/de/tourismus-information/aktuell/537.html",
        "DistanceUnit": 0
    },
    "Connections": [
        {
            "ID": 77947,
            "ConnectionTypeID": 28,
            "StatusTypeID": 50,
            "LevelID": 1,
            "Amps": 10,
            "Voltage": 230,
            "PowerKW": 2.3,
            "CurrentTypeID": 10,
            "Quantity": 3
        }
    ],
    "NumberOfPoints": 3,
    "StatusTypeID": 50,
    "DateLastStatusUpdate": "2016-02-17T07:26:00Z",
    "DataQualityLevel": 1,
    "DateCreated": "2016-02-17T07:26:00Z",
    "SubmissionStatusTypeID": 200
}