{
    "IsRecentlyVerified": false,
    "ID": 102759,
    "UUID": "5E535360-D3BE-486B-A511-E83A8AB33410",
    "DataProviderID": 2,
    "DataProvidersReference": "91984",
    "UsageTypeID": 2,
    "AddressInfo": {
        "ID": 103105,
        "Title": "Penguin Random House",
        "AddressLine1": "400 Hahn Rd",
        "Town": "Westminster",
        "StateOrProvince": "MD",
        "Postcode": "21157",
        "CountryID": 2,
        "Latitude": 39.585868,
        "Longitude": -76.980374,
        "ContactTelephone1": "",
        "AccessComments": "24 hours daily",
        "RelatedURL": "",
        "DistanceUnit": 0
    },
    "Connections": [
        {
            "ID": 144882,
            "ConnectionTypeID": 1,
            "LevelID": 2,
            "Amps": 16,
            "Voltage": 230,
            "PowerKW": 3.7,
            "CurrentTypeID": 10,
            "Quantity": 1
        }
    ],
    "DateLastStatusUpdate": "2020-06-26T03:02:00Z",
    "DataQualityLevel": 3,
    "DateCreated": "2018-04-21T04:13:00Z",
    "SubmissionStatusTypeID": 100
}