{
    "IsRecentlyVerified": false,
    "ID": 73600,
    "UUID": "BB2F4DA2-62FF-403D-92B2-1818BAD0384A",
    "DataProviderID": 1,
    "OperatorID": 89,
    "OperatorsReference": "CEA-10246",
    "UsageTypeID": 4,
    "UsageCost": "CAD 1.00/hour",
    "AddressInfo": {
        "ID": 73946,
        "Title": "MRC Coaticook-Saint-Malo",
        "AddressLine1": "224 route 253 Sud",
        "Town": "Saint-Malo",
        "StateOrProvince": "QC",
        "Postcode": "J0B 2Y0",
        "CountryID": 44,
        "Latitude": 45.197645,
        "Longitude": -71.500718,
        "DistanceUnit": 0
    },
    "Connections": [
        {
            "ID": 105890,
            "ConnectionTypeID": 1,
            "StatusTypeID": 50,
            "LevelID": 2,
            "Amps": 32,
            "Voltage": 230,
            "PowerKW": 7,
            "CurrentTypeID": 10,
            "Quantity": 1
        }
    ],
    "NumberOfPoints": 1,
    "StatusTypeID": 50,
    "DateLastStatusUpdate": "2017-01-24T09:58:00Z",
    "DataQualityLevel": 1,
    "DateCreated": "2016-11-23T22:22:00Z",
    "SubmissionStatusTypeID": 200
}