{
    "IsRecentlyVerified": false,
    "ID": 160103,
    "UUID": "7F24A5F4-52E0-4508-8271-0BEF6A12C5B3",
    "DataProviderID": 2,
    "DataProvidersReference": "152043",
    "OperatorID": 5,
    "UsageTypeID": 1,
    "AddressInfo": {
        "ID": 160460,
        "Title": "CONSUMERSENERGY",
        "AddressLine1": "4000 Clay Ave SW",
        "Town": "Grand Rapids",
        "StateOrProvince": "MI",
        "Postcode": "49548",
        "CountryID": 2,
        "Latitude": 42.889633,
        "Longitude": -85.676626,
        "ContactTelephone1": "888-758-4389",
        "AccessComments": "24 hours daily",
        "RelatedURL": "http://www.chargepoint.com/",
        "DistanceUnit": 0
    },
    "Connections": [
        {
            "ID": 230342,
            "ConnectionTypeID": 1,
            "LevelID": 2,
            "Amps": 16,
            "Voltage": 230,
            "PowerKW": 3.7,
            "CurrentTypeID": 10,
            "Quantity": 4
        }
    ],
    "StatusTypeID": 50,
    "DateLastStatusUpdate": "2020-06-26T03:06:00Z",
    "DataQualityLevel": 3,
    "DateCreated": "2020-06-26T03:06:00Z",
    "SubmissionStatusTypeID": 100
}