{
    "IsRecentlyVerified": false,
    "ID": 102568,
    "UUID": "C2D60AEB-1EF0-4C40-9014-DDB13A7553A2",
    "DataProviderID": 2,
    "DataProvidersReference": "92444",
    "OperatorID": 5,
    "UsageTypeID": 1,
    "AddressInfo": {
        "ID": 102914,
        "Title": "RCC COLLEGE",
        "AddressLine1": "1333 Jake Alexander Blvd. S",
        "Town": "Salisbury",
        "StateOrProvince": "NC",
        "Postcode": "28146",
        "CountryID": 2,
        "Latitude": 35.639123,
        "Longitude": -80.4831782,
        "ContactTelephone1": "888-758-4389",
        "AccessComments": "24 hours daily",
        "RelatedURL": "http://www.chargepoint.com/",
        "DistanceUnit": 0
    },
    "Connections": [
        {
            "ID": 144656,
            "ConnectionTypeID": 1,
            "LevelID": 2,
            "Amps": 16,
            "Voltage": 230,
            "PowerKW": 3,
            "CurrentTypeID": 10,
            "Quantity": 2
        }
    ],
    "DateLastStatusUpdate": "2019-04-06T04:02:00Z",
    "DataQualityLevel": 3,
    "DateCreated": "2018-04-21T04:13:00Z",
    "SubmissionStatusTypeID": 100
}