{
    "IsRecentlyVerified": false,
    "ID": 100285,
    "UUID": "F43AFEDD-30D1-4521-A264-8445D83C92BE",
    "DataProviderID": 1,
    "OperatorID": 235,
    "UsageTypeID": 4,
    "AddressInfo": {
        "ID": 100631,
        "Title": "Bergstation Hilden",
        "AddressLine1": "Bahnhofsallee 35",
        "Town": "Hilden",
        "StateOrProvince": "Kreis Mettmann",
        "Postcode": "40721",
        "CountryID": 87,
        "Latitude": 51.17024109076149,
        "Longitude": 6.917348655155934,
        "AccessComments": "Die durchgehend nutzbare Ladesäule ist auf dem Parkplatz der Bergstation Hilden. ",
        "DistanceUnit": 0
    },
    "Connections": [
        {
            "ID": 141664,
            "ConnectionTypeID": 25,
            "StatusTypeID": 50,
            "LevelID": 2,
            "Amps": 32,
            "Voltage": 400,
            "PowerKW": 22,
            "CurrentTypeID": 20,
            "Quantity": 2
        },
        {
            "ID": 141665,
            "ConnectionTypeID": 28,
            "StatusTypeID": 50,
            "LevelID": 2,
            "Amps": 16,
            "Voltage": 230,
            "PowerKW": 3.7,
            "CurrentTypeID": 10,
            "Quantity": 2
        }
    ],
    "NumberOfPoints": 4,
    "StatusTypeID": 50,
    "DateLastStatusUpdate": "2018-02-20T11:03:00Z",
    "DataQualityLevel": 1,
    "DateCreated": "2018-02-20T11:03:00Z",
    "SubmissionStatusTypeID": 200
}