{
    "UserComments": [
        {
            "ID": 14028,
            "ChargePointID": 32413,
            "CommentTypeID": 10,
            "UserName": "e_revo2k16",
            "Comment": "22KW AC, 63KW DC\nOpening of Parking not 24/7 please Look for times over the day. Park Kost 1€/h\n\nLoading with RFID Card ladenetz.de or Thenewmotion",
            "Rating": 4,
            "DateCreated": "2016-08-11T12:55:29.813Z",
            "User": {
                "ID": 9121,
                "Username": "e_revo2k16"
            },
            "CheckinStatusTypeID": 15
        }
    ],
    "IsRecentlyVerified": false,
    "ID": 32413,
    "UUID": "35DF90C5-72F4-4A53-9D4C-F287E39C4232",
    "DataProviderID": 26,
    "DataProvidersReference": "29002",
    "OperatorID": 69,
    "OperatorsReference": "Stadtwerke Weimar Weimarhalle",
    "UsageCost": "0.00 onbekend",
    "AddressInfo": {
        "ID": 32759,
        "Title": "Unesco-Platz 1",
        "AddressLine1": "Unesco-Platz 1",
        "Town": "Weimar",
        "Postcode": "99423",
        "CountryID": 87,
        "Latitude": 50.984,
        "Longitude": 11.325,
        "RelatedURL": "http://www.ladenetz.de",
        "DistanceUnit": 0
    },
    "Connections": [
        {
            "ID": 35924,
            "ConnectionTypeID": 25,
            "LevelID": 2,
            "PowerKW": 11,
            "CurrentTypeID": 10
        }
    ],
    "NumberOfPoints": 2,
    "StatusTypeID": 50,
    "DateLastStatusUpdate": "2016-08-11T12:55:00Z",
    "DataQualityLevel": 3,
    "DateCreated": "2015-01-09T06:03:00Z",
    "SubmissionStatusTypeID": 100
}