{
    "IsRecentlyVerified": false,
    "ID": 135863,
    "UUID": "5618CB07-083B-4266-9453-BE63208B2A91",
    "DataProviderID": 18,
    "DataProvidersReference": "1394033bf37247ea56b42fe86c24013a",
    "OperatorID": 2244,
    "UsageTypeID": 5,
    "AddressInfo": {
        "ID": 136209,
        "Title": "Scylla Road",
        "AddressLine1": "Scylla Road",
        "Town": "London",
        "Postcode": "SE15 3NN",
        "CountryID": 1,
        "Latitude": 51.46508,
        "Longitude": -0.065106,
        "AccessComments": "",
        "RelatedURL": "https://www.ubitricity.com",
        "DistanceUnit": 0
    },
    "Connections": [
        {
            "ID": 190284,
            "ConnectionTypeID": 25,
            "Reference": "suby1100001391",
            "StatusTypeID": 50,
            "LevelID": 2,
            "Amps": 16,
            "Voltage": 230,
            "PowerKW": 3.7,
            "CurrentTypeID": 10
        }
    ],
    "StatusTypeID": 0,
    "DateLastStatusUpdate": "2021-04-25T05:46:00Z",
    "MetadataValues": [
        {
            "ID": 5715,
            "MetadataFieldID": 4,
            "ItemValue": "Contains public sector information licensed under the Open Government Licence v2.0. http://www.nationalarchives.gov.uk/doc/open-government-licence/version/2/"
        }
    ],
    "DataQualityLevel": 3,
    "DateCreated": "2019-12-24T05:22:00Z",
    "SubmissionStatusTypeID": 100
}