{
    "IsRecentlyVerified": false,
    "ID": 116052,
    "UUID": "DB553515-832A-486C-A4ED-9B117EB4456C",
    "DataProviderID": 2,
    "DataProvidersReference": "116040",
    "OperatorID": 23,
    "UsageTypeID": 7,
    "AddressInfo": {
        "ID": 116398,
        "Title": "Mountain Top Inn & Resort - Tesla Destination",
        "AddressLine1": "195 Mountain Top Rd",
        "Town": "Chittenden",
        "StateOrProvince": "VT",
        "Postcode": "05737",
        "CountryID": 2,
        "Latitude": 43.729854,
        "Longitude": -72.93785,
        "ContactTelephone1": " 802-483-2311  877-798-3752",
        "AccessComments": "24 hours daily; available with reservation only\r\nPublic - Call ahead",
        "RelatedURL": "https://www.tesla.com/destination-charging",
        "DistanceUnit": 0
    },
    "Connections": [
        {
            "ID": 163112,
            "ConnectionTypeID": 30,
            "LevelID": 2,
            "Amps": 16,
            "Voltage": 230,
            "PowerKW": 3.7,
            "CurrentTypeID": 10,
            "Quantity": 1
        }
    ],
    "DateLastStatusUpdate": "2020-06-26T03:07:00Z",
    "DataQualityLevel": 3,
    "DateCreated": "2019-02-11T07:13:00Z",
    "SubmissionStatusTypeID": 100
}