{
    "IsRecentlyVerified": false,
    "ID": 48881,
    "UUID": "0CC1F0CE-E7DB-44BF-9ED3-F627CF01A765",
    "DataProviderID": 1,
    "OperatorID": 20,
    "OperatorsReference": "70821,CM12281",
    "UsageTypeID": 4,
    "UsageCost": "£1.00/charge admin fee,Free. Parking fees apply.",
    "AddressInfo": {
        "ID": 49227,
        "Title": "Liverpool Women's Hospital",
        "AddressLine1": "Upper Huskisson Street",
        "Town": "Liverpool",
        "Postcode": "L8 7SS",
        "CountryID": 1,
        "Latitude": 53.398273,
        "Longitude": -2.959982,
        "AccessComments": "Charge points are located behind a ticket controlled barrier. No eligibility restrictions. Site parking fees & restrictions apply.",
        "DistanceUnit": 0
    },
    "Connections": [
        {
            "ID": 60399,
            "ConnectionTypeID": 25,
            "StatusTypeID": 50,
            "LevelID": 2,
            "Amps": 32,
            "Voltage": 230,
            "PowerKW": 7,
            "CurrentTypeID": 10,
            "Quantity": 4
        }
    ],
    "NumberOfPoints": 4,
    "StatusTypeID": 50,
    "DateLastStatusUpdate": "2020-05-27T05:21:00Z",
    "MetadataValues": [
        {
            "ID": 1700,
            "MetadataFieldID": 4,
            "ItemValue": "Contains public sector information licensed under the Open Government Licence v2.0. http://www.nationalarchives.gov.uk/doc/open-government-licence/version/2/"
        }
    ],
    "DataQualityLevel": 3,
    "DateCreated": "2015-07-04T08:17:00Z",
    "SubmissionStatusTypeID": 100
}