{
    "IsRecentlyVerified": false,
    "ID": 161702,
    "UUID": "BB220C19-5B23-4C8B-BD79-25A8A4A5AEDC",
    "DataProviderID": 1,
    "OperatorID": 70,
    "UsageTypeID": 2,
    "AddressInfo": {
        "ID": 162059,
        "Title": "Assos Kervansaray Hotel",
        "AddressLine1": "Assos Kervansaray Hotel",
        "Town": "Behramkale",
        "StateOrProvince": "Çanakkale",
        "Postcode": "",
        "CountryID": 229,
        "Latitude": 39.4863771723746,
        "Longitude": 26.341167506853026,
        "DistanceUnit": 0
    },
    "Connections": [
        {
            "ID": 232684,
            "ConnectionTypeID": 2,
            "StatusTypeID": 50,
            "Quantity": 1
        }
    ],
    "NumberOfPoints": 1,
    "StatusTypeID": 100,
    "DateLastStatusUpdate": "2020-09-12T08:53:00Z",
    "DataQualityLevel": 1,
    "DateCreated": "2020-07-21T20:46:00Z",
    "SubmissionStatusTypeID": 200
}