{
    "IsRecentlyVerified": false,
    "ID": 73844,
    "UUID": "67EA9712-A019-4436-BBFF-2F4311073650",
    "DataProviderID": 1,
    "OperatorID": 89,
    "OperatorsReference": "CEB-10125,CEB-10129",
    "UsageTypeID": 4,
    "UsageCost": "CAD 2.50",
    "AddressInfo": {
        "ID": 74190,
        "Title": "Amt-Gare Saint-Bruno",
        "AddressLine1": "1200 rue Lenoir",
        "Town": "Saint-Bruno",
        "StateOrProvince": "QC",
        "Postcode": "J3V 4P6",
        "CountryID": 44,
        "Latitude": 45.5122604370117,
        "Longitude": -73.3739929199219,
        "DistanceUnit": 0
    },
    "Connections": [
        {
            "ID": 106153,
            "ConnectionTypeID": 1,
            "StatusTypeID": 50,
            "LevelID": 2,
            "Amps": 32,
            "Voltage": 230,
            "PowerKW": 7,
            "CurrentTypeID": 10,
            "Quantity": 2
        }
    ],
    "NumberOfPoints": 2,
    "StatusTypeID": 50,
    "DateLastStatusUpdate": "2017-12-16T06:43:00Z",
    "DataQualityLevel": 1,
    "DateCreated": "2016-11-23T23:18:00Z",
    "SubmissionStatusTypeID": 200
}