{
    "IsRecentlyVerified": false,
    "ID": 14146,
    "UUID": "7C8FD63E-3AB0-42B9-8E26-B41883D912F8",
    "DataProviderID": 2,
    "DataProvidersReference": "45756",
    "UsageTypeID": 7,
    "AddressInfo": {
        "ID": 14043,
        "Title": "I-90 Nissan",
        "AddressLine1": "5013 Detroit Rd",
        "Town": "Sheffield Village",
        "StateOrProvince": "OH",
        "Postcode": "44054",
        "CountryID": 2,
        "Latitude": 41.423584,
        "Longitude": -82.088115,
        "ContactTelephone1": "440-934-6001",
        "AccessComments": "Dealership business hours\r\nPublic - Call ahead",
        "RelatedURL": "",
        "DistanceUnit": 0
    },
    "Connections": [
        {
            "ID": 16471,
            "ConnectionTypeID": 1,
            "LevelID": 2,
            "Amps": 16,
            "Voltage": 230,
            "PowerKW": 3.7,
            "CurrentTypeID": 10,
            "Quantity": 1
        },
        {
            "ID": 21548,
            "ConnectionTypeID": 1,
            "LevelID": 2,
            "Quantity": 1
        }
    ],
    "DateLastStatusUpdate": "2020-06-26T03:04:00Z",
    "DataQualityLevel": 3,
    "DateCreated": "2012-12-06T16:49:00Z",
    "SubmissionStatusTypeID": 100
}