{
    "IsRecentlyVerified": false,
    "ID": 140892,
    "UUID": "C8639B61-9598-43A5-AE04-EF0E06D54F83",
    "DataProviderID": 2,
    "DataProvidersReference": "50736",
    "UsageTypeID": 1,
    "AddressInfo": {
        "ID": 141244,
        "Title": "Oakland International Airport - Economy Lot",
        "AddressLine1": "1 Airport Dr",
        "Town": "Oakland",
        "StateOrProvince": "CA",
        "Postcode": "94621",
        "CountryID": 2,
        "Latitude": 37.7153,
        "Longitude": -122.2145,
        "ContactTelephone1": "510-563-3361",
        "AccessComments": "24 hours daily; pay lot",
        "RelatedURL": "",
        "DistanceUnit": 0
    },
    "Connections": [
        {
            "ID": 196660,
            "ConnectionTypeID": 1,
            "LevelID": 2,
            "Amps": 16,
            "Voltage": 230,
            "PowerKW": 3.7,
            "CurrentTypeID": 10,
            "Quantity": 2
        }
    ],
    "GeneralComments": "1 SP Inductive",
    "StatusTypeID": 50,
    "DateLastStatusUpdate": "2020-06-26T02:59:00Z",
    "DataQualityLevel": 3,
    "DateCreated": "2019-12-24T09:14:00Z",
    "SubmissionStatusTypeID": 100
}