{
    "IsRecentlyVerified": false,
    "ID": 139694,
    "UUID": "C97499D2-A876-4AD8-BAD2-372B023BD2FB",
    "DataProviderID": 2,
    "DataProvidersReference": "148796",
    "OperatorID": 39,
    "UsageTypeID": 1,
    "AddressInfo": {
        "ID": 140046,
        "Title": "Kaiser Permenente - West LA Medical Center |P6787",
        "AddressLine1": "6041 Cadillac Avenue",
        "Town": "Los Angeles",
        "StateOrProvince": "CA",
        "Postcode": "90034",
        "CountryID": 2,
        "Latitude": 34.0383466,
        "Longitude": -118.3759001,
        "ContactTelephone1": "800-663-5633",
        "AccessComments": "MO: 12:00am-12:00am; TU: 12:00am-12:00am; WE: 12:00am-12:00am; TH: 12:00am-12:00am; FR: 12:00am-12:00am; SA: 12:00am-12:00am; SU: 12:00am-12:00am",
        "RelatedURL": "http://www.semacharge.com/",
        "DistanceUnit": 0
    },
    "Connections": [
        {
            "ID": 195134,
            "ConnectionTypeID": 1,
            "LevelID": 2,
            "Amps": 16,
            "Voltage": 230,
            "PowerKW": 3.7,
            "CurrentTypeID": 10,
            "Quantity": 6
        }
    ],
    "StatusTypeID": 50,
    "DateLastStatusUpdate": "2020-06-26T02:56:00Z",
    "DataQualityLevel": 3,
    "DateCreated": "2019-12-24T09:11:00Z",
    "SubmissionStatusTypeID": 100
}