{
    "IsRecentlyVerified": false,
    "ID": 172266,
    "UUID": "39DB7E6A-8AB5-4F98-8678-F9895D653963",
    "DataProviderID": 1,
    "OperatorID": 203,
    "UsageTypeID": 5,
    "UsageCost": "£0.35/kWh Contactless",
    "AddressInfo": {
        "ID": 172625,
        "Title": "The Meteor Centre",
        "AddressLine1": "Wheatcroft Way",
        "AddressLine2": "Darley Abbey",
        "Town": "Derby",
        "StateOrProvince": "Derby",
        "Postcode": "DE21 4SY",
        "CountryID": 1,
        "Latitude": 52.942566941791625,
        "Longitude": -1.4632221379512202,
        "RelatedURL": "https://ospreycharging.co.uk/ev-drivers/",
        "DistanceUnit": 0
    },
    "Connections": [
        {
            "ID": 263377,
            "ConnectionTypeID": 25,
            "StatusTypeID": 50,
            "LevelID": 2,
            "Amps": 32,
            "Voltage": 400,
            "PowerKW": 22,
            "CurrentTypeID": 20,
            "Quantity": 2
        },
        {
            "ID": 263378,
            "ConnectionTypeID": 2,
            "StatusTypeID": 50,
            "LevelID": 3,
            "Amps": 125,
            "Voltage": 400,
            "PowerKW": 50,
            "CurrentTypeID": 30,
            "Quantity": 2
        },
        {
            "ID": 263379,
            "ConnectionTypeID": 33,
            "StatusTypeID": 50,
            "LevelID": 3,
            "Amps": 125,
            "Voltage": 400,
            "PowerKW": 50,
            "CurrentTypeID": 30,
            "Quantity": 2
        }
    ],
    "NumberOfPoints": 3,
    "GeneralComments": "50kW rapid. AC is 22kW socket",
    "StatusTypeID": 50,
    "DateLastStatusUpdate": "2021-01-27T16:41:00Z",
    "DataQualityLevel": 1,
    "DateCreated": "2021-01-27T16:41:00Z",
    "SubmissionStatusTypeID": 200
}