{
    "IsRecentlyVerified": false,
    "ID": 81642,
    "UUID": "B0EA4EDE-C25F-4800-B569-29DB74DF97B7",
    "DataProviderID": 1,
    "OperatorID": 23,
    "OperatorsReference": "20959",
    "UsageTypeID": 4,
    "AddressInfo": {
        "ID": 81988,
        "Title": "Municipalite Saint-Adelphe",
        "AddressLine1": "150 Rue Baillargeon",
        "Town": "Saint-Adelphe",
        "StateOrProvince": "Quebec",
        "Postcode": "G0X 2G0",
        "CountryID": 44,
        "Latitude": 46.734465,
        "Longitude": -72.43188,
        "ContactTelephone1": "(418) 322-5721",
        "DistanceUnit": 0
    },
    "Connections": [
        {
            "ID": 116390,
            "ConnectionTypeID": 30,
            "StatusTypeID": 50,
            "LevelID": 2,
            "PowerKW": 16,
            "CurrentTypeID": 20,
            "Quantity": 2
        }
    ],
    "NumberOfPoints": 2,
    "GeneralComments": "2 Tesla Connectors, up to 16kW.Available to the public. Self park.",
    "StatusTypeID": 50,
    "DateLastStatusUpdate": "2017-02-03T09:12:00Z",
    "DataQualityLevel": 1,
    "DateCreated": "2017-02-03T09:12:00Z",
    "SubmissionStatusTypeID": 200
}