{
    "IsRecentlyVerified": false,
    "ID": 124498,
    "UUID": "9F3159A8-1B5F-4446-83CE-12EA08EB081B",
    "DataProviderID": 2,
    "DataProvidersReference": "25507",
    "UsageTypeID": 1,
    "AddressInfo": {
        "ID": 124844,
        "Title": "Mosquito Road Park and Ride",
        "AddressLine1": "Mosquito Rd & Clay St",
        "Town": "Placerville",
        "StateOrProvince": "CA",
        "Postcode": "95667",
        "CountryID": 2,
        "Latitude": 38.73323,
        "Longitude": -120.78962,
        "ContactTelephone1": "530-642-5383",
        "AccessComments": "Lot business hours; overnight parking prohibited",
        "RelatedURL": "",
        "DistanceUnit": 0
    },
    "Connections": [
        {
            "ID": 174605,
            "ConnectionTypeID": 1,
            "LevelID": 2,
            "Amps": 16,
            "Voltage": 230,
            "PowerKW": 3.7,
            "CurrentTypeID": 10,
            "Quantity": 2
        }
    ],
    "DateLastStatusUpdate": "2020-06-26T03:00:00Z",
    "DataQualityLevel": 3,
    "DateCreated": "2019-04-06T05:03:00Z",
    "SubmissionStatusTypeID": 100
}