{
    "IsRecentlyVerified": false,
    "ID": 135923,
    "UUID": "A4ED8A92-9377-4332-B54E-2A730C1FEA6A",
    "DataProviderID": 18,
    "DataProvidersReference": "85d297fa7d4eabbce321215f0d45cb58",
    "OperatorID": 2244,
    "UsageTypeID": 5,
    "AddressInfo": {
        "ID": 136269,
        "Title": "Ingelow Road",
        "AddressLine1": "Ingelow Road",
        "Town": "London",
        "Postcode": "SW8 3PF",
        "CountryID": 1,
        "Latitude": 51.46967,
        "Longitude": -0.150611,
        "AccessComments": "",
        "RelatedURL": "https://www.ubitricity.com",
        "DistanceUnit": 0
    },
    "Connections": [
        {
            "ID": 190346,
            "ConnectionTypeID": 25,
            "Reference": "suby1100000829",
            "StatusTypeID": 50,
            "LevelID": 2,
            "Amps": 16,
            "Voltage": 230,
            "PowerKW": 3.7,
            "CurrentTypeID": 10
        }
    ],
    "StatusTypeID": 0,
    "DateLastStatusUpdate": "2021-04-25T05:46:00Z",
    "MetadataValues": [
        {
            "ID": 5775,
            "MetadataFieldID": 4,
            "ItemValue": "Contains public sector information licensed under the Open Government Licence v2.0. http://www.nationalarchives.gov.uk/doc/open-government-licence/version/2/"
        }
    ],
    "DataQualityLevel": 3,
    "DateCreated": "2019-12-24T05:22:00Z",
    "SubmissionStatusTypeID": 100
}