{
    "IsRecentlyVerified": false,
    "ID": 17180,
    "UUID": "410E418E-A6F1-4B48-BB87-BBAF3D5DFC13",
    "DataProviderID": 22,
    "DataProvidersReference": "B91D12ADF38B1A2C446579B64E7C5A7C",
    "AddressInfo": {
        "ID": 17525,
        "Title": "日産プリンス神奈川販売日野店",
        "AddressLine1": "神奈川県横浜市港南区日野南5-1-9",
        "CountryID": 114,
        "Latitude": 35.37628102,
        "Longitude": 139.5674322,
        "ContactTelephone1": "045-843-2341",
        "DistanceUnit": 0
    },
    "Connections": [
        {
            "ID": 17421,
            "ConnectionTypeID": 2,
            "LevelID": 2,
            "Amps": 100,
            "Voltage": 480,
            "PowerKW": 48,
            "Quantity": 1
        }
    ],
    "DateLastStatusUpdate": "2013-06-29T08:54:00Z",
    "DataQualityLevel": 2,
    "DateCreated": "2013-06-29T08:54:00Z",
    "SubmissionStatusTypeID": 200
}