{
    "IsRecentlyVerified": false,
    "ID": 123413,
    "UUID": "71D9F429-A284-452D-8C70-11E11FF241EB",
    "DataProviderID": 2,
    "DataProvidersReference": "68034",
    "OperatorID": 5,
    "UsageTypeID": 1,
    "AddressInfo": {
        "ID": 123759,
        "Title": "METRO NASHVILLE",
        "AddressLine1": "621 Howerton St",
        "Town": "Nashville",
        "StateOrProvince": "TN",
        "Postcode": "37206",
        "CountryID": 2,
        "Latitude": 36.1760565,
        "Longitude": -86.7620384,
        "ContactTelephone1": "888-758-4389",
        "AccessComments": "24 hours daily",
        "RelatedURL": "http://www.chargepoint.com/",
        "DistanceUnit": 0
    },
    "Connections": [
        {
            "ID": 173386,
            "ConnectionTypeID": 1,
            "LevelID": 2,
            "Amps": 16,
            "Voltage": 230,
            "PowerKW": 3.7,
            "CurrentTypeID": 10,
            "Quantity": 2
        }
    ],
    "DateLastStatusUpdate": "2020-06-26T02:58:00Z",
    "DataQualityLevel": 3,
    "DateCreated": "2019-04-06T05:03:00Z",
    "SubmissionStatusTypeID": 100
}