{
    "IsRecentlyVerified": false,
    "ID": 103719,
    "UUID": "A467D0E6-4F9B-46AC-B6CE-3B09E7548001",
    "DataProviderID": 1,
    "OperatorID": 23,
    "OperatorsReference": "42452",
    "UsageTypeID": 4,
    "AddressInfo": {
        "ID": 104065,
        "Title": "Logis Hotel-Restaurant Zur Alten Muhle",
        "AddressLine1": "Stupbach 7",
        "Town": "Luetzkampen",
        "Postcode": "54617",
        "CountryID": 87,
        "Latitude": 50.1760468,
        "Longitude": 6.1460482,
        "ContactTelephone1": "+49 6559 223",
        "DistanceUnit": 0
    },
    "Connections": [
        {
            "ID": 146389,
            "ConnectionTypeID": 30,
            "StatusTypeID": 50,
            "LevelID": 2,
            "Amps": 32,
            "Voltage": 400,
            "PowerKW": 22,
            "CurrentTypeID": 20,
            "Quantity": 1
        }
    ],
    "NumberOfPoints": 1,
    "GeneralComments": "1 Tesla Connector, up to 22kW.Available for customers. Please see front desk.",
    "StatusTypeID": 50,
    "DateLastStatusUpdate": "2018-10-03T15:12:00Z",
    "DataQualityLevel": 1,
    "DateCreated": "2018-05-05T05:59:00Z",
    "SubmissionStatusTypeID": 200
}