{
    "IsRecentlyVerified": false,
    "ID": 179839,
    "UUID": "D6C00F0C-F899-4214-B6F1-202E6E57E039",
    "DataProviderID": 29,
    "DataProvidersReference": "2710",
    "OperatorID": 86,
    "AddressInfo": {
        "ID": 180198,
        "Title": "Aüßere Bayreuther Strasse 134",
        "AddressLine1": "Aüßere Bayreuther Strasse 134",
        "Town": "Nürnberg",
        "Postcode": "90411",
        "CountryID": 87,
        "Latitude": 49.47527,
        "Longitude": 11.104245,
        "DistanceUnit": 0
    },
    "Connections": [
        {
            "ID": 282193,
            "ConnectionTypeID": 33,
            "StatusTypeID": 50,
            "LevelID": 3,
            "PowerKW": 300,
            "CurrentTypeID": 30
        },
        {
            "ID": 282194,
            "ConnectionTypeID": 33,
            "StatusTypeID": 50,
            "LevelID": 3,
            "PowerKW": 300,
            "CurrentTypeID": 30
        }
    ],
    "StatusTypeID": 50,
    "DateLastStatusUpdate": "2021-07-09T03:17:00Z",
    "MetadataValues": [
        {
            "ID": 12133,
            "MetadataFieldID": 4,
            "ItemValue": "Data from the German chargepoint registry provided by Bundesnetzagentur.de under the CC-BY 4.0 license"
        }
    ],
    "DataQualityLevel": 3,
    "DateCreated": "2021-07-08T10:00:00Z",
    "SubmissionStatusTypeID": 100
}