{
    "IsRecentlyVerified": false,
    "ID": 109159,
    "UUID": "6A52148F-8CE1-4F62-83B6-858A0DBDEAD8",
    "DataProviderID": 1,
    "OperatorID": 23,
    "OperatorsReference": "45869",
    "UsageTypeID": 6,
    "AddressInfo": {
        "ID": 109505,
        "Title": "Melia Ria Hotel & Spa",
        "AddressLine1": "Hotel Melia Ria and Spa",
        "Town": "Aveiro",
        "Postcode": "3810-200",
        "CountryID": 180,
        "Latitude": 40.638359,
        "Longitude": -8.645191,
        "ContactTelephone1": " +351 23 440 1000",
        "AccessComments": "Only by reservation",
        "DistanceUnit": 0
    },
    "Connections": [
        {
            "ID": 154277,
            "ConnectionTypeID": 30,
            "StatusTypeID": 50,
            "LevelID": 2,
            "PowerKW": 17,
            "CurrentTypeID": 20,
            "Quantity": 1
        }
    ],
    "NumberOfPoints": 1,
    "GeneralComments": "1 Tesla Connector, up to 17kW.Available by reservation only. Please call ahead.",
    "StatusTypeID": 50,
    "DateLastStatusUpdate": "2020-09-12T13:28:00Z",
    "DataQualityLevel": 1,
    "DateCreated": "2018-10-11T13:47:00Z",
    "SubmissionStatusTypeID": 200
}