{
    "UserComments": [
        {
            "ID": 22014,
            "ChargePointID": 130281,
            "CommentTypeID": 10,
            "UserName": "ForumElettrico.it",
            "RelatedURL": "https://www.forumelettrico.it/forum/colonnine-duferco-fast-coop-i-leudi-carasco-ge-via-montanaro-disma-85-t8545.html",
            "DateCreated": "2020-01-10T13:59:29.973Z",
            "User": {
                "ID": 11749,
                "Username": "ForumElettrico.it"
            },
            "CheckinStatusTypeID": 10,
            "IsActionedByEditor": false
        }
    ],
    "MediaItems": [
        {
            "ID": 20887,
            "ChargePointID": 130281,
            "ItemURL": "https://s3-ap-southeast-2.amazonaws.com/openchargemap/images/IT/OCM130281/OCM-130281.orig.2020011013594047.jpg",
            "ItemThumbnailURL": "https://s3-ap-southeast-2.amazonaws.com/openchargemap/images/IT/OCM130281/OCM-130281.thmb.2020011013594047.jpg",
            "Comment": "",
            "IsEnabled": true,
            "IsVideo": false,
            "IsFeaturedItem": false,
            "IsExternalResource": false,
            "User": {
                "ID": 11749,
                "Username": "ForumElettrico.it"
            },
            "DateCreated": "2020-01-10T14:00:00Z"
        },
        {
            "ID": 20888,
            "ChargePointID": 130281,
            "ItemURL": "https://s3-ap-southeast-2.amazonaws.com/openchargemap/images/IT/OCM130281/OCM-130281.orig.2020011013594761.jpg",
            "ItemThumbnailURL": "https://s3-ap-southeast-2.amazonaws.com/openchargemap/images/IT/OCM130281/OCM-130281.thmb.2020011013594761.jpg",
            "Comment": "",
            "IsEnabled": true,
            "IsVideo": false,
            "IsFeaturedItem": false,
            "IsExternalResource": false,
            "User": {
                "ID": 11749,
                "Username": "ForumElettrico.it"
            },
            "DateCreated": "2020-01-10T14:00:00Z"
        },
        {
            "ID": 20889,
            "ChargePointID": 130281,
            "ItemURL": "https://s3-ap-southeast-2.amazonaws.com/openchargemap/images/IT/OCM130281/OCM-130281.orig.2020011013595504.jpg",
            "ItemThumbnailURL": "https://s3-ap-southeast-2.amazonaws.com/openchargemap/images/IT/OCM130281/OCM-130281.thmb.2020011013595504.jpg",
            "Comment": "",
            "IsEnabled": true,
            "IsVideo": false,
            "IsFeaturedItem": false,
            "IsExternalResource": false,
            "User": {
                "ID": 11749,
                "Username": "ForumElettrico.it"
            },
            "DateCreated": "2020-01-10T14:00:00Z"
        },
        {
            "ID": 20890,
            "ChargePointID": 130281,
            "ItemURL": "https://s3-ap-southeast-2.amazonaws.com/openchargemap/images/IT/OCM130281/OCM-130281.orig.2020011014000148.jpg",
            "ItemThumbnailURL": "https://s3-ap-southeast-2.amazonaws.com/openchargemap/images/IT/OCM130281/OCM-130281.thmb.2020011014000148.jpg",
            "Comment": "",
            "IsEnabled": true,
            "IsVideo": false,
            "IsFeaturedItem": false,
            "IsExternalResource": false,
            "User": {
                "ID": 11749,
                "Username": "ForumElettrico.it"
            },
            "DateCreated": "2020-01-10T14:00:00Z"
        }
    ],
    "IsRecentlyVerified": false,
    "ID": 130281,
    "UUID": "942719C9-5572-4AB8-870B-C71829DB9B5A",
    "DataProviderID": 1,
    "OperatorID": 3267,
    "UsageTypeID": 4,
    "AddressInfo": {
        "ID": 130627,
        "Title": "COOP CC I Leudi by Duferco",
        "AddressLine1": "Via Mulinetti, 5",
        "Town": "Carasco",
        "StateOrProvince": "GE",
        "Postcode": "16042",
        "CountryID": 112,
        "Latitude": 44.3484787820342,
        "Longitude": 9.35022010784974,
        "RelatedURL": "https://www.ileudicarasco.it/",
        "DistanceUnit": 0
    },
    "Connections": [
        {
            "ID": 182364,
            "ConnectionTypeID": 25,
            "StatusTypeID": 50,
            "LevelID": 2,
            "Amps": 32,
            "Voltage": 400,
            "PowerKW": 22,
            "CurrentTypeID": 20,
            "Quantity": 3
        },
        {
            "ID": 182365,
            "ConnectionTypeID": 36,
            "StatusTypeID": 50,
            "LevelID": 2,
            "Amps": 16,
            "Voltage": 240,
            "PowerKW": 3.5,
            "CurrentTypeID": 10,
            "Quantity": 2
        },
        {
            "ID": 182366,
            "ConnectionTypeID": 33,
            "StatusTypeID": 50,
            "LevelID": 3,
            "PowerKW": 50,
            "CurrentTypeID": 30,
            "Quantity": 1
        },
        {
            "ID": 182367,
            "ConnectionTypeID": 2,
            "StatusTypeID": 50,
            "LevelID": 3,
            "PowerKW": 50,
            "CurrentTypeID": 30,
            "Quantity": 1
        }
    ],
    "NumberOfPoints": 4,
    "StatusTypeID": 50,
    "DateLastStatusUpdate": "2020-01-10T14:00:00Z",
    "DataQualityLevel": 1,
    "DateCreated": "2019-08-02T10:58:00Z",
    "SubmissionStatusTypeID": 200
}