{
    "IsRecentlyVerified": false,
    "ID": 110715,
    "UUID": "13CE7B82-EA5C-4601-8A1E-C372C821EEC0",
    "DataProviderID": 2,
    "DataProvidersReference": "99451",
    "OperatorID": 5,
    "UsageTypeID": 1,
    "AddressInfo": {
        "ID": 111061,
        "Title": "DEERFIELD ACDMY",
        "AddressLine1": "14 Albany Rd",
        "Town": "Deerfield",
        "StateOrProvince": "MA",
        "Postcode": "01342",
        "CountryID": 2,
        "Latitude": 42.5469123,
        "Longitude": -72.606543,
        "ContactTelephone1": "888-758-4389",
        "AccessComments": "24 hours daily",
        "RelatedURL": "http://www.chargepoint.com/",
        "DistanceUnit": 0
    },
    "Connections": [
        {
            "ID": 155993,
            "ConnectionTypeID": 1,
            "LevelID": 2,
            "Amps": 16,
            "Voltage": 230,
            "PowerKW": 3,
            "CurrentTypeID": 10,
            "Quantity": 2
        }
    ],
    "DateLastStatusUpdate": "2019-04-06T05:05:00Z",
    "DataQualityLevel": 3,
    "DateCreated": "2018-10-18T23:36:00Z",
    "SubmissionStatusTypeID": 100
}