{
    "IsRecentlyVerified": false,
    "ID": 74172,
    "UUID": "6A96E20F-5687-493E-A093-6F002B34133D",
    "DataProviderID": 1,
    "OperatorID": 89,
    "OperatorsReference": "CEA-388",
    "UsageTypeID": 4,
    "UsageCost": "CAD 2.50",
    "AddressInfo": {
        "ID": 74518,
        "Title": "Cégep de Chicoutimi",
        "AddressLine1": "534 rue Jacques-Cartier est",
        "Town": "Chicoutimi",
        "StateOrProvince": "QC",
        "Postcode": "G7H 1Z6",
        "CountryID": 44,
        "Latitude": 48.424435996927,
        "Longitude": -71.054717870994,
        "DistanceUnit": 0
    },
    "Connections": [
        {
            "ID": 106515,
            "ConnectionTypeID": 1,
            "StatusTypeID": 50,
            "LevelID": 2,
            "Amps": 32,
            "Voltage": 230,
            "PowerKW": 7,
            "CurrentTypeID": 10,
            "Quantity": 1
        }
    ],
    "NumberOfPoints": 1,
    "StatusTypeID": 50,
    "DateLastStatusUpdate": "2017-01-22T19:34:00Z",
    "DataQualityLevel": 1,
    "DateCreated": "2016-11-24T14:19:00Z",
    "SubmissionStatusTypeID": 200
}