{
    "IsRecentlyVerified": false,
    "ID": 183138,
    "UUID": "F3814676-B0CD-4C58-8D3E-CCF98ACE75F0",
    "DataProviderID": 29,
    "DataProvidersReference": "10198",
    "AddressInfo": {
        "ID": 183497,
        "Title": "Burgplatz",
        "AddressLine1": "Burgplatz",
        "Town": "Hohenberg a. d. Eger",
        "Postcode": "95691",
        "CountryID": 87,
        "Latitude": 50.09735,
        "Longitude": 12.22343,
        "DistanceUnit": 0
    },
    "Connections": [
        {
            "ID": 289752,
            "ConnectionTypeID": 25,
            "StatusTypeID": 50,
            "LevelID": 2,
            "PowerKW": 22,
            "CurrentTypeID": 20
        },
        {
            "ID": 289753,
            "ConnectionTypeID": 25,
            "StatusTypeID": 50,
            "LevelID": 2,
            "PowerKW": 22,
            "CurrentTypeID": 20
        }
    ],
    "StatusTypeID": 50,
    "DateLastStatusUpdate": "2021-07-12T02:44:00Z",
    "MetadataValues": [
        {
            "ID": 15431,
            "MetadataFieldID": 4,
            "ItemValue": "Data from the German chargepoint registry provided by Bundesnetzagentur.de under the CC-BY 4.0 license"
        }
    ],
    "DataQualityLevel": 3,
    "DateCreated": "2021-07-08T10:03:00Z",
    "SubmissionStatusTypeID": 100
}