{
    "IsRecentlyVerified": false,
    "ID": 115807,
    "UUID": "C08826A7-C2F6-4CF9-AE91-431AD4DC49F8",
    "DataProviderID": 2,
    "DataProvidersReference": "81061",
    "OperatorID": 5,
    "UsageTypeID": 1,
    "AddressInfo": {
        "ID": 116153,
        "Title": "MOLLYS",
        "AddressLine1": "4801 Fenton St",
        "Town": "Denver",
        "StateOrProvince": "CO",
        "Postcode": "80212",
        "CountryID": 2,
        "Latitude": 39.7789756,
        "Longitude": -105.0598826,
        "ContactTelephone1": "888-758-4389",
        "AccessComments": "24 hours daily",
        "RelatedURL": "http://www.chargepoint.com/",
        "DistanceUnit": 0
    },
    "Connections": [
        {
            "ID": 162848,
            "ConnectionTypeID": 1,
            "LevelID": 2,
            "Amps": 16,
            "Voltage": 230,
            "PowerKW": 3.7,
            "CurrentTypeID": 10,
            "Quantity": 2
        }
    ],
    "DateLastStatusUpdate": "2020-06-26T03:02:00Z",
    "DataQualityLevel": 3,
    "DateCreated": "2019-02-11T07:13:00Z",
    "SubmissionStatusTypeID": 100
}