{
    "IsRecentlyVerified": false,
    "ID": 90773,
    "UUID": "2712999D-E983-4519-B428-770BFB850262",
    "DataProviderID": 1,
    "OperatorID": 156,
    "UsageTypeID": 4,
    "UsageCost": "0,45€/kWh",
    "AddressInfo": {
        "ID": 91119,
        "Title": "Soerendaniel Designagentur",
        "AddressLine1": "Hauptstraße 104",
        "Town": "Langenbernsdorf",
        "StateOrProvince": "Landkreis Zwickau",
        "Postcode": "08428",
        "CountryID": 87,
        "Latitude": 50.752499,
        "Longitude": 12.311751800000025,
        "ContactTelephone1": "+49 1781682343",
        "AccessComments": "24/7 nutzbar direkt am Parkplatz an der Hauptstraße (bepflanzter Steingarten).",
        "RelatedURL": "http://soerendaniel.de/",
        "DistanceUnit": 0
    },
    "Connections": [
        {
            "ID": 128506,
            "ConnectionTypeID": 25,
            "StatusTypeID": 50,
            "LevelID": 2,
            "Amps": 32,
            "Voltage": 400,
            "PowerKW": 22,
            "CurrentTypeID": 20,
            "Quantity": 1
        }
    ],
    "NumberOfPoints": 1,
    "StatusTypeID": 50,
    "DateLastStatusUpdate": "2017-07-24T07:37:00Z",
    "DataQualityLevel": 1,
    "DateCreated": "2017-07-24T07:37:00Z",
    "SubmissionStatusTypeID": 200
}