{
    "IsRecentlyVerified": false,
    "ID": 107210,
    "UUID": "3507F85F-9D3A-4A1A-A7D6-01915FCC7EE7",
    "DataProviderID": 1,
    "OperatorID": 1,
    "UsageTypeID": 4,
    "AddressInfo": {
        "ID": 107556,
        "Title": "Autohaus Schräpler (BMW)",
        "AddressLine1": "Hagenburger Straße 46",
        "Town": "Wunstorf",
        "StateOrProvince": "Region Hannover",
        "Postcode": "31515",
        "CountryID": 87,
        "Latitude": 52.428164389785664,
        "Longitude": 9.412038483991978,
        "AccessComments": "Keine weiteren Infos vorhanden.",
        "RelatedURL": "https://www.bmw-schraepler.de/",
        "DistanceUnit": 0
    },
    "Connections": [
        {
            "ID": 151203,
            "ConnectionTypeID": 25,
            "StatusTypeID": 50,
            "LevelID": 2,
            "Amps": 32,
            "Voltage": 400,
            "PowerKW": 22,
            "CurrentTypeID": 20,
            "Quantity": 2
        }
    ],
    "NumberOfPoints": 2,
    "GeneralComments": "Verbund \"Digital Energy Solutions\"; Freischaltung mit Connect Ladekarte, EinfachStromLaden, New Motion, PlugSurfing u.v.a.",
    "StatusTypeID": 50,
    "DateLastStatusUpdate": "2018-07-23T06:14:00Z",
    "DataQualityLevel": 1,
    "DateCreated": "2018-07-23T06:14:00Z",
    "SubmissionStatusTypeID": 200
}