{
    "IsRecentlyVerified": false,
    "ID": 74924,
    "UUID": "1819F65F-AEED-4939-9E16-2DD3D4D537B1",
    "DataProviderID": 1,
    "OperatorID": 1,
    "UsageTypeID": 4,
    "AddressInfo": {
        "ID": 75270,
        "Title": "Stadtverwaltung ",
        "AddressLine1": "Domäne 3",
        "Town": "Schieder-Schwalenberg",
        "StateOrProvince": "Kreis Lippe",
        "Postcode": "32816",
        "CountryID": 87,
        "Latitude": 51.91540999999999,
        "Longitude": 9.149639999999977,
        "AccessComments": "24/7 nutzbar mit PlugSurfing Keyhanger oder App. Betreiber ist die Westfalen Weser Netz.",
        "RelatedURL": "http://ww-netz.com/",
        "DistanceUnit": 0
    },
    "Connections": [
        {
            "ID": 108099,
            "ConnectionTypeID": 25,
            "StatusTypeID": 50,
            "LevelID": 2,
            "Amps": 32,
            "Voltage": 400,
            "PowerKW": 22,
            "CurrentTypeID": 20,
            "Quantity": 2
        }
    ],
    "NumberOfPoints": 2,
    "StatusTypeID": 50,
    "DateLastStatusUpdate": "2016-12-08T07:45:00Z",
    "DataQualityLevel": 1,
    "DateCreated": "2016-12-08T07:45:00Z",
    "SubmissionStatusTypeID": 200
}