{
    "IsRecentlyVerified": false,
    "ID": 73944,
    "UUID": "4C073518-057A-4D06-989F-0348F2362D5B",
    "DataProviderID": 1,
    "OperatorID": 89,
    "OperatorsReference": "CEA-10170",
    "UsageTypeID": 4,
    "UsageCost": "CAD 2.50",
    "AddressInfo": {
        "ID": 74290,
        "Title": "Ville de Labelle-Bibliothèque",
        "AddressLine1": "7393 boulevard du Curé-Labelle",
        "Town": "Labelle",
        "StateOrProvince": "QC",
        "Postcode": "J0T 1H0",
        "CountryID": 44,
        "Latitude": 46.2803075296295,
        "Longitude": -74.7347995264587,
        "DistanceUnit": 0
    },
    "Connections": [
        {
            "ID": 106258,
            "ConnectionTypeID": 1,
            "StatusTypeID": 50,
            "LevelID": 2,
            "Amps": 32,
            "Voltage": 230,
            "PowerKW": 7,
            "CurrentTypeID": 10,
            "Quantity": 1
        }
    ],
    "NumberOfPoints": 1,
    "StatusTypeID": 50,
    "DateLastStatusUpdate": "2017-04-26T05:21:00Z",
    "DataQualityLevel": 1,
    "DateCreated": "2016-11-23T23:41:00Z",
    "SubmissionStatusTypeID": 200
}