{
    "IsRecentlyVerified": false,
    "ID": 102658,
    "UUID": "F4CB54A2-C6F9-4BCA-8C30-7D16A66DE8D3",
    "DataProviderID": 2,
    "DataProvidersReference": "94699",
    "UsageTypeID": 1,
    "AddressInfo": {
        "ID": 103004,
        "Title": "Best Western - Woodford",
        "AddressLine1": "5211 Mudd Tavern Rd",
        "Town": "Woodford",
        "StateOrProvince": "VA",
        "Postcode": "22580",
        "CountryID": 2,
        "Latitude": 38.1334351604344,
        "Longitude": -77.5149322724915,
        "ContactTelephone1": "540-805-5023",
        "AccessComments": "24 hours daily; for guest use only",
        "RelatedURL": "",
        "DistanceUnit": 0
    },
    "Connections": [
        {
            "ID": 144765,
            "ConnectionTypeID": 1,
            "LevelID": 2,
            "Amps": 16,
            "Voltage": 230,
            "PowerKW": 3,
            "CurrentTypeID": 10,
            "Quantity": 1
        }
    ],
    "DateLastStatusUpdate": "2019-04-06T04:02:00Z",
    "DataQualityLevel": 3,
    "DateCreated": "2018-04-21T04:13:00Z",
    "SubmissionStatusTypeID": 100
}