{
    "UserComments": [
        {
            "ID": 24448,
            "ChargePointID": 65044,
            "CommentTypeID": 10,
            "UserName": "My_Leaf",
            "Comment": "",
            "DateCreated": "2021-06-05T13:35:56.167Z",
            "User": {
                "ID": 4511,
                "Username": "My_Leaf"
            },
            "CheckinStatusTypeID": 10,
            "IsActionedByEditor": false
        },
        {
            "ID": 10102,
            "ChargePointID": 65044,
            "CommentTypeID": 10,
            "UserName": "stickybit",
            "Comment": "",
            "Rating": 5,
            "DateCreated": "2016-04-06T06:43:42.447Z",
            "User": {
                "ID": 6738,
                "Username": "stickybit"
            },
            "CheckinStatusTypeID": 10
        }
    ],
    "MediaItems": [
        {
            "ID": 28024,
            "ChargePointID": 65044,
            "ItemURL": "https://s3-ap-southeast-2.amazonaws.com/openchargemap/images/NL/OCM65044/OCM-65044.orig.2021060513353646.jpg",
            "ItemThumbnailURL": "https://s3-ap-southeast-2.amazonaws.com/openchargemap/images/NL/OCM65044/OCM-65044.thmb.2021060513353646.jpg",
            "Comment": "",
            "IsEnabled": true,
            "IsVideo": false,
            "IsFeaturedItem": false,
            "IsExternalResource": false,
            "User": {
                "ID": 4511,
                "Username": "My_Leaf"
            },
            "DateCreated": "2021-06-05T13:36:00Z"
        },
        {
            "ID": 6166,
            "ChargePointID": 65044,
            "ItemURL": "https://s3-ap-southeast-2.amazonaws.com/openchargemap/images/NL/OCM65044/OCM-65044.orig.2016040606425929.jpg",
            "ItemThumbnailURL": "https://s3-ap-southeast-2.amazonaws.com/openchargemap/images/NL/OCM65044/OCM-65044.thmb.2016040606425929.jpg",
            "Comment": "Snow Tesla charging ",
            "IsEnabled": true,
            "IsVideo": false,
            "IsFeaturedItem": false,
            "IsExternalResource": false,
            "User": {
                "ID": 6738,
                "Username": "stickybit"
            },
            "DateCreated": "2016-04-06T06:43:00Z"
        }
    ],
    "IsRecentlyVerified": false,
    "ID": 65044,
    "UUID": "7356F36C-AF37-4B75-8AA4-6EF14E42F80B",
    "DataProviderID": 1,
    "OperatorID": 103,
    "UsageTypeID": 4,
    "UsageCost": "Free",
    "AddressInfo": {
        "ID": 65390,
        "Title": "Bisde",
        "AddressLine1": "",
        "AddressLine2": "",
        "Town": "Beesd",
        "StateOrProvince": "",
        "Postcode": "",
        "CountryID": 159,
        "Latitude": 51.91146290146136,
        "Longitude": 5.178701877593994,
        "ContactTelephone1": "",
        "ContactTelephone2": "",
        "ContactEmail": "",
        "AccessComments": "",
        "RelatedURL": "",
        "DistanceUnit": 0
    },
    "Connections": [
        {
            "ID": 83717,
            "ConnectionTypeID": 2,
            "StatusTypeID": 50,
            "LevelID": 3,
            "Amps": 120,
            "Voltage": 350,
            "PowerKW": 42,
            "CurrentTypeID": 30,
            "Quantity": 1
        },
        {
            "ID": 83718,
            "ConnectionTypeID": 33,
            "StatusTypeID": 50,
            "CurrentTypeID": 30
        },
        {
            "ID": 83719,
            "ConnectionTypeID": 7,
            "StatusTypeID": 0
        }
    ],
    "NumberOfPoints": 1,
    "GeneralComments": "",
    "StatusTypeID": 50,
    "DateLastStatusUpdate": "2021-06-05T13:36:00Z",
    "DataQualityLevel": 1,
    "DateCreated": "2016-04-05T23:01:00Z",
    "SubmissionStatusTypeID": 200
}