{
    "IsRecentlyVerified": false,
    "ID": 120375,
    "UUID": "688B09F7-412E-4E16-9508-AF95663031C2",
    "DataProviderID": 2,
    "DataProvidersReference": "49960",
    "UsageTypeID": 7,
    "AddressInfo": {
        "ID": 120721,
        "Title": "Dublin Nissan",
        "AddressLine1": "2046 Veterans Blvd",
        "Town": "Dublin",
        "StateOrProvince": "GA",
        "Postcode": "31021",
        "CountryID": 2,
        "Latitude": 32.54118,
        "Longitude": -82.953347,
        "ContactTelephone1": "478-275-2660",
        "AccessComments": "Dealership business hours\r\nPublic - Call ahead",
        "RelatedURL": "",
        "DistanceUnit": 0
    },
    "Connections": [
        {
            "ID": 169717,
            "ConnectionTypeID": 1,
            "LevelID": 2,
            "Amps": 16,
            "Voltage": 230,
            "PowerKW": 3.7,
            "CurrentTypeID": 10,
            "Quantity": 3
        },
        {
            "ID": 169718,
            "ConnectionTypeID": 2,
            "LevelID": 3,
            "Amps": 100,
            "Voltage": 400,
            "PowerKW": 40,
            "CurrentTypeID": 30,
            "Quantity": 1
        }
    ],
    "DateLastStatusUpdate": "2020-06-26T02:54:00Z",
    "DataQualityLevel": 3,
    "DateCreated": "2019-04-01T04:59:00Z",
    "SubmissionStatusTypeID": 100
}