{
    "IsRecentlyVerified": false,
    "ID": 128275,
    "UUID": "CC979956-AE21-4A0C-BF8E-D555494F1C3F",
    "DataProviderID": 1,
    "OperatorID": 25,
    "OperatorsReference": "merton-victoriaroad",
    "UsageTypeID": 4,
    "UsageCost": "£0.059/minute; min £1.18; other tariffs available",
    "AddressInfo": {
        "ID": 128621,
        "Title": "Victoria Road",
        "AddressLine1": "Victoria Road Lavender Fields",
        "Town": "Croydon",
        "Postcode": "CR4 3RL",
        "CountryID": 1,
        "Latitude": 51.415167,
        "Longitude": -0.171992,
        "DistanceUnit": 0
    },
    "Connections": [
        {
            "ID": 179560,
            "ConnectionTypeID": 25,
            "StatusTypeID": 50,
            "LevelID": 2,
            "Amps": 32,
            "Voltage": 230,
            "PowerKW": 7,
            "CurrentTypeID": 10,
            "Quantity": 3
        },
        {
            "ID": 179561,
            "ConnectionTypeID": 1,
            "StatusTypeID": 50,
            "LevelID": 2,
            "Voltage": 230,
            "PowerKW": 4,
            "CurrentTypeID": 10,
            "Quantity": 3
        },
        {
            "ID": 179562,
            "ConnectionTypeID": 25,
            "StatusTypeID": 50,
            "LevelID": 2,
            "Amps": 32,
            "Voltage": 230,
            "PowerKW": 7,
            "CurrentTypeID": 10,
            "Quantity": 3
        },
        {
            "ID": 179563,
            "ConnectionTypeID": 1,
            "StatusTypeID": 50,
            "LevelID": 2,
            "Voltage": 230,
            "PowerKW": 4,
            "CurrentTypeID": 10,
            "Quantity": 3
        },
        {
            "ID": 179564,
            "ConnectionTypeID": 25,
            "StatusTypeID": 50,
            "LevelID": 2,
            "Amps": 32,
            "Voltage": 230,
            "PowerKW": 7,
            "CurrentTypeID": 10,
            "Quantity": 3
        }
    ],
    "NumberOfPoints": 3,
    "StatusTypeID": 50,
    "DateLastStatusUpdate": "2019-06-22T05:30:00Z",
    "DataQualityLevel": 1,
    "DateCreated": "2019-06-21T05:42:00Z",
    "SubmissionStatusTypeID": 200
}