{
    "IsRecentlyVerified": false,
    "ID": 13729,
    "UUID": "E751C9D4-FEAA-410B-9C45-E4C845F875F6",
    "DataProviderID": 15,
    "DataProvidersReference": "23515",
    "OperatorID": 5,
    "AddressInfo": {
        "ID": 13626,
        "Title": "5651 N Dixie Dr",
        "AddressLine1": "5651 N Dixie Dr",
        "Town": "Dayton",
        "StateOrProvince": "Ohio",
        "Postcode": "45414",
        "CountryID": 2,
        "Latitude": 39.81912994,
        "Longitude": -84.19894409,
        "ContactTelephone1": "(937) 276-3091",
        "RelatedURL": "http://carstations.com/23515",
        "DistanceUnit": 0
    },
    "Connections": [
        {
            "ID": 11178,
            "ConnectionTypeID": 1,
            "Reference": "J1772",
            "LevelID": 2
        }
    ],
    "StatusTypeID": 0,
    "DateLastStatusUpdate": "2017-11-04T14:04:00Z",
    "DataQualityLevel": 2,
    "DateCreated": "2012-12-06T11:08:00Z",
    "SubmissionStatusTypeID": 100
}