{
    "IsRecentlyVerified": false,
    "ID": 80295,
    "UUID": "2CCB6315-E6BA-4E94-BF3F-E088A9A45962",
    "DataProviderID": 2,
    "DataProvidersReference": "80834",
    "OperatorID": 5,
    "UsageTypeID": 1,
    "AddressInfo": {
        "ID": 80641,
        "Title": "DEPOT SQ BLDR",
        "AddressLine1": "2280 Junction Pl",
        "Town": "Boulder",
        "StateOrProvince": "CO",
        "Postcode": "80301",
        "CountryID": 2,
        "Latitude": 40.024197,
        "Longitude": -105.2517611,
        "ContactTelephone1": "888-758-4389",
        "AccessComments": "24 hours daily",
        "RelatedURL": "http://www.chargepoint.com/",
        "DistanceUnit": 0
    },
    "Connections": [
        {
            "ID": 114969,
            "ConnectionTypeID": 1,
            "LevelID": 2,
            "Amps": 16,
            "Voltage": 230,
            "PowerKW": 3.7,
            "CurrentTypeID": 10,
            "Quantity": 2
        }
    ],
    "DateLastStatusUpdate": "2020-06-26T03:02:00Z",
    "DataQualityLevel": 3,
    "DateCreated": "2017-01-31T01:05:00Z",
    "SubmissionStatusTypeID": 100
}