{
    "IsRecentlyVerified": false,
    "ID": 183215,
    "UUID": "7FCD1E44-9313-4440-B54F-0029780EFB84",
    "DataProviderID": 29,
    "DataProvidersReference": "16448",
    "AddressInfo": {
        "ID": 183574,
        "Title": "Rosa-Luxemburg-Platz 16",
        "AddressLine1": "Rosa-Luxemburg-Platz 16",
        "Town": "Torgau",
        "Postcode": "04860",
        "CountryID": 87,
        "Latitude": 51.560962,
        "Longitude": 13.003521,
        "DistanceUnit": 0
    },
    "Connections": [
        {
            "ID": 289923,
            "ConnectionTypeID": 25,
            "StatusTypeID": 50,
            "LevelID": 2,
            "PowerKW": 22,
            "CurrentTypeID": 20
        },
        {
            "ID": 289924,
            "ConnectionTypeID": 25,
            "StatusTypeID": 50,
            "LevelID": 2,
            "PowerKW": 22,
            "CurrentTypeID": 20
        }
    ],
    "StatusTypeID": 50,
    "DateLastStatusUpdate": "2021-07-09T03:24:00Z",
    "MetadataValues": [
        {
            "ID": 15508,
            "MetadataFieldID": 4,
            "ItemValue": "Data from the German chargepoint registry provided by Bundesnetzagentur.de under the CC-BY 4.0 license"
        }
    ],
    "DataQualityLevel": 3,
    "DateCreated": "2021-07-08T10:03:00Z",
    "SubmissionStatusTypeID": 100
}