{
    "IsRecentlyVerified": false,
    "ID": 87616,
    "UUID": "98D67194-1E52-46EC-A61B-4A7C3BC86BF4",
    "DataProviderID": 1,
    "OperatorID": 23,
    "OperatorsReference": "29576",
    "UsageTypeID": 6,
    "AddressInfo": {
        "ID": 87962,
        "Title": "Grillrestaurant Burgi's Burehof",
        "AddressLine1": "29 Euthalerstrasse",
        "Town": "Euthal",
        "Postcode": "8844",
        "CountryID": 217,
        "Latitude": 47.096984,
        "Longitude": 8.814409,
        "ContactTelephone1": "+41 5541 22417",
        "DistanceUnit": 0
    },
    "Connections": [
        {
            "ID": 124209,
            "ConnectionTypeID": 30,
            "StatusTypeID": 50,
            "LevelID": 2,
            "Amps": 32,
            "Voltage": 230,
            "PowerKW": 17,
            "CurrentTypeID": 20,
            "Quantity": 1
        }
    ],
    "NumberOfPoints": 1,
    "GeneralComments": "1 Tesla Connector, up to 17kW.Available for patrons only. Self park.",
    "StatusTypeID": 50,
    "DateLastStatusUpdate": "2018-10-03T16:27:00Z",
    "DataQualityLevel": 1,
    "DateCreated": "2017-05-15T05:31:00Z",
    "SubmissionStatusTypeID": 200
}