{
    "IsRecentlyVerified": false,
    "ID": 110407,
    "UUID": "A5A9A0CD-2004-4AED-95AE-545EF828589C",
    "DataProviderID": 2,
    "DataProvidersReference": "95003",
    "OperatorID": 5,
    "UsageTypeID": 1,
    "AddressInfo": {
        "ID": 110753,
        "Title": "KCPL",
        "AddressLine1": "215 Locust Hill Rd @ KCP&amp;L Belton Service Center",
        "Town": "Belton",
        "StateOrProvince": "MO",
        "Postcode": "64012",
        "CountryID": 2,
        "Latitude": 38.8303411,
        "Longitude": -94.5292374,
        "ContactTelephone1": "888-758-4389",
        "AccessComments": "24 hours daily",
        "RelatedURL": "http://www.chargepoint.com/",
        "DistanceUnit": 0
    },
    "Connections": [
        {
            "ID": 155657,
            "ConnectionTypeID": 1,
            "LevelID": 2,
            "Amps": 16,
            "Voltage": 230,
            "PowerKW": 3,
            "CurrentTypeID": 10,
            "Quantity": 4
        }
    ],
    "DateLastStatusUpdate": "2019-04-06T05:04:00Z",
    "DataQualityLevel": 3,
    "DateCreated": "2018-10-18T23:36:00Z",
    "SubmissionStatusTypeID": 100
}