{
    "IsRecentlyVerified": false,
    "ID": 101866,
    "UUID": "534D4467-E157-42BA-9ACB-974BD28594ED",
    "DataProviderID": 1,
    "OperatorID": 45,
    "UsageTypeID": 1,
    "AddressInfo": {
        "ID": 102212,
        "Title": "E-Bike Station Stadtverwaltung Andernach Rathaus",
        "AddressLine1": "Läufstr 11",
        "Town": "Andernach",
        "StateOrProvince": "Landkreis Mayen-Koblenz",
        "Postcode": "56626",
        "CountryID": 87,
        "Latitude": 50.4394016,
        "Longitude": 7.401995599999964,
        "AccessComments": "Drei durchgehend kostenlos nutzbare Schließfächer mit jeweils zwei Schuko-Steckdosen im weißen Metallkasten mit der Aufschrift E-Bike-Ladebox gegenüber dem Eingang des Rathauses",
        "DistanceUnit": 0
    },
    "Connections": [
        {
            "ID": 143800,
            "ConnectionTypeID": 28,
            "StatusTypeID": 50,
            "LevelID": 2,
            "Amps": 16,
            "Voltage": 230,
            "PowerKW": 3.7,
            "CurrentTypeID": 10,
            "Quantity": 6
        }
    ],
    "NumberOfPoints": 6,
    "StatusTypeID": 50,
    "DateLastStatusUpdate": "2018-04-12T13:03:00Z",
    "DataQualityLevel": 1,
    "DateCreated": "2018-04-12T13:03:00Z",
    "SubmissionStatusTypeID": 200
}