{
    "MediaItems": [
        {
            "ID": 15150,
            "ChargePointID": 100710,
            "ItemURL": "https://s3-ap-southeast-2.amazonaws.com/openchargemap/images/SK/OCM100710/OCM-100710.orig.2018030713443494.jpg",
            "ItemThumbnailURL": "https://s3-ap-southeast-2.amazonaws.com/openchargemap/images/SK/OCM100710/OCM-100710.thmb.2018030713443494.jpg",
            "Comment": "",
            "IsEnabled": true,
            "IsVideo": false,
            "IsFeaturedItem": false,
            "IsExternalResource": false,
            "User": {
                "ID": 6224,
                "Username": "ozana"
            },
            "DateCreated": "2018-03-07T13:45:00Z"
        },
        {
            "ID": 15149,
            "ChargePointID": 100710,
            "ItemURL": "https://s3-ap-southeast-2.amazonaws.com/openchargemap/images/SK/OCM100710/OCM-100710.orig.2018030713441155.jpg",
            "ItemThumbnailURL": "https://s3-ap-southeast-2.amazonaws.com/openchargemap/images/SK/OCM100710/OCM-100710.thmb.2018030713441155.jpg",
            "Comment": "",
            "IsEnabled": true,
            "IsVideo": false,
            "IsFeaturedItem": false,
            "IsExternalResource": false,
            "User": {
                "ID": 6224,
                "Username": "ozana"
            },
            "DateCreated": "2018-03-07T13:44:00Z"
        }
    ],
    "IsRecentlyVerified": false,
    "ID": 100710,
    "UUID": "A2259C55-1870-4765-A37E-EE79279DF158",
    "DataProviderID": 1,
    "OperatorID": 1,
    "UsageTypeID": 1,
    "AddressInfo": {
        "ID": 101056,
        "Title": "GreenWay, TESCO Žilina ",
        "AddressLine1": "Košická 1367/3",
        "Town": "Žilina",
        "StateOrProvince": "Žilinský kraj",
        "Postcode": "01001",
        "CountryID": 204,
        "Latitude": 49.221463,
        "Longitude": 18.758309,
        "ContactTelephone1": "+421 2 330 56 236",
        "ContactEmail": "info@greenway.sk",
        "AccessComments": "Na vonkajšom parkovisku pred Tesco Hypermarketom, oproti predajni Dráčik (2 parkovacie miesta)\r\n\r\nOn the outside parking lot in front of Tesco Hypermarket, opposite the Dráčik store (2 parking spaces)",
        "RelatedURL": "https://greenway.sk",
        "DistanceUnit": 0
    },
    "Connections": [
        {
            "ID": 142250,
            "ConnectionTypeID": 2,
            "StatusTypeID": 50,
            "LevelID": 3,
            "PowerKW": 50,
            "CurrentTypeID": 30,
            "Quantity": 1
        },
        {
            "ID": 142251,
            "ConnectionTypeID": 33,
            "StatusTypeID": 50,
            "LevelID": 3,
            "PowerKW": 50,
            "CurrentTypeID": 30,
            "Quantity": 1
        },
        {
            "ID": 142252,
            "ConnectionTypeID": 1036,
            "StatusTypeID": 50,
            "LevelID": 2,
            "Amps": 63,
            "Voltage": 400,
            "PowerKW": 22,
            "CurrentTypeID": 20,
            "Quantity": 1
        }
    ],
    "NumberOfPoints": 1,
    "StatusTypeID": 50,
    "DateLastStatusUpdate": "2019-09-20T16:13:00Z",
    "DataQualityLevel": 1,
    "DateCreated": "2018-03-07T13:42:00Z",
    "SubmissionStatusTypeID": 200
}