{
    "IsRecentlyVerified": false,
    "ID": 99189,
    "UUID": "4B42444C-6495-4E91-9813-4879D970521C",
    "DataProviderID": 1,
    "OperatorID": 2243,
    "UsageTypeID": 4,
    "AddressInfo": {
        "ID": 99535,
        "Title": "Further Straße",
        "AddressLine1": "Further Straße 41",
        "Town": "Chemnitz",
        "StateOrProvince": "Chemnitz",
        "Postcode": "09113",
        "CountryID": 87,
        "Latitude": 50.8494559,
        "Longitude": 12.926334300000008,
        "AccessComments": "24/7 nutzbar",
        "DistanceUnit": 0
    },
    "Connections": [
        {
            "ID": 140125,
            "ConnectionTypeID": 25,
            "StatusTypeID": 50,
            "LevelID": 2,
            "Amps": 32,
            "Voltage": 400,
            "PowerKW": 22,
            "CurrentTypeID": 20,
            "Quantity": 2
        }
    ],
    "NumberOfPoints": 2,
    "StatusTypeID": 50,
    "DateLastStatusUpdate": "2018-01-24T06:11:00Z",
    "DataQualityLevel": 1,
    "DateCreated": "2018-01-24T06:11:00Z",
    "SubmissionStatusTypeID": 200
}