{
    "IsRecentlyVerified": false,
    "ID": 3621,
    "UUID": "064EE73F-88F9-4C7E-8B1C-9A73D3CA97FE",
    "DataProviderID": 1,
    "OperatorID": 5,
    "UsageTypeID": 1,
    "UsageCost": "",
    "AddressInfo": {
        "ID": 3622,
        "Title": "Toyota Museum",
        "AddressLine1": "19600 Van Ness Ave",
        "AddressLine2": "",
        "Town": "Torrance",
        "StateOrProvince": "CA",
        "Postcode": "90501",
        "CountryID": 2,
        "Latitude": 33.85150909,
        "Longitude": -118.3174133,
        "ContactTelephone1": "888-758-4389",
        "ContactTelephone2": "",
        "ContactEmail": "",
        "AccessComments": "",
        "RelatedURL": "",
        "DistanceUnit": 0
    },
    "Connections": [
        {
            "ID": 136,
            "ConnectionTypeID": 1,
            "StatusTypeID": 0,
            "LevelID": 2,
            "Quantity": 1
        }
    ],
    "NumberOfPoints": 1,
    "GeneralComments": "",
    "StatusTypeID": 50,
    "DateLastStatusUpdate": "2013-01-20T14:17:00Z",
    "DataQualityLevel": 1,
    "DateCreated": "2013-01-20T14:17:00Z",
    "SubmissionStatusTypeID": 200
}