{
    "IsRecentlyVerified": false,
    "ID": 33199,
    "UUID": "A9DEE347-4857-49BC-BAC3-6444E5063FC1",
    "DataProviderID": 26,
    "DataProvidersReference": "48412",
    "OperatorID": 178,
    "OperatorsReference": "EVnetNL PNB-REE0049",
    "UsageCost": "0.00 jaarabonnement",
    "AddressInfo": {
        "ID": 33545,
        "Title": "Leijparkweg 72",
        "AddressLine1": "Leijparkweg 72",
        "Town": "Tilburg",
        "Postcode": "5022 AD",
        "CountryID": 159,
        "Latitude": 51.543472,
        "Longitude": 5.100788,
        "ContactTelephone1": "0800-3522365",
        "RelatedURL": "http://www.evnet.nl",
        "DistanceUnit": 0
    },
    "Connections": [
        {
            "ID": 36710,
            "ConnectionTypeID": 25,
            "LevelID": 1,
            "PowerKW": 2.3,
            "CurrentTypeID": 10
        }
    ],
    "NumberOfPoints": 1,
    "StatusTypeID": 50,
    "DateLastStatusUpdate": "2016-06-04T02:39:00Z",
    "DataQualityLevel": 3,
    "DateCreated": "2015-01-09T06:04:00Z",
    "SubmissionStatusTypeID": 100
}