{
    "IsRecentlyVerified": false,
    "ID": 159767,
    "UUID": "0572DA78-2E33-4407-9DDA-8B644869F563",
    "DataProviderID": 2,
    "DataProvidersReference": "154069",
    "OperatorID": 5,
    "UsageTypeID": 1,
    "AddressInfo": {
        "ID": 160124,
        "Title": "FRANKLIN DECK",
        "AddressLine1": "142 Franklin St SW",
        "Town": "Warren",
        "StateOrProvince": "OH",
        "Postcode": "44481",
        "CountryID": 2,
        "Latitude": 41.2350418,
        "Longitude": -80.8189875,
        "ContactTelephone1": "888-758-4389",
        "AccessComments": "24 hours daily",
        "RelatedURL": "http://www.chargepoint.com/",
        "DistanceUnit": 0
    },
    "Connections": [
        {
            "ID": 229981,
            "ConnectionTypeID": 1,
            "LevelID": 2,
            "Amps": 16,
            "Voltage": 230,
            "PowerKW": 3.7,
            "CurrentTypeID": 10,
            "Quantity": 2
        }
    ],
    "StatusTypeID": 50,
    "DateLastStatusUpdate": "2020-06-26T03:04:00Z",
    "DataQualityLevel": 3,
    "DateCreated": "2020-06-26T03:04:00Z",
    "SubmissionStatusTypeID": 100
}