{
    "IsRecentlyVerified": false,
    "ID": 158237,
    "UUID": "735E7526-A696-432E-A612-60412AF9E58B",
    "DataProviderID": 2,
    "DataProvidersReference": "156127",
    "OperatorID": 9,
    "UsageTypeID": 1,
    "AddressInfo": {
        "ID": 158591,
        "Title": "Nevada Street Parking Garage",
        "AddressLine1": "327 Nebraska St",
        "Town": "Hollywood",
        "StateOrProvince": "FL",
        "Postcode": "33019",
        "CountryID": 2,
        "Latitude": 26.025623,
        "Longitude": -80.116068,
        "ContactTelephone1": "888-998-2546",
        "AccessComments": "MON: 24 hours | TUE: 24 hours | WED: 24 hours | THU: 24 hours | FRI: 24 hours | SAT: 24 hours | SUN: 24 hours",
        "RelatedURL": "http://www.blinkcharging.com/",
        "DistanceUnit": 0
    },
    "Connections": [
        {
            "ID": 228191,
            "ConnectionTypeID": 1,
            "LevelID": 2,
            "Amps": 16,
            "Voltage": 230,
            "PowerKW": 3.7,
            "CurrentTypeID": 10,
            "Quantity": 4
        }
    ],
    "StatusTypeID": 50,
    "DateLastStatusUpdate": "2020-06-26T02:52:00Z",
    "DataQualityLevel": 3,
    "DateCreated": "2020-06-26T02:52:00Z",
    "SubmissionStatusTypeID": 100
}