{
    "MediaItems": [
        {
            "ID": 15509,
            "ChargePointID": 64449,
            "ItemURL": "https://s3-ap-southeast-2.amazonaws.com/openchargemap/images/DE/OCM64449/OCM-64449.orig.2018051806265635.jpg",
            "ItemThumbnailURL": "https://s3-ap-southeast-2.amazonaws.com/openchargemap/images/DE/OCM64449/OCM-64449.thmb.2018051806265635.jpg",
            "Comment": "",
            "IsEnabled": true,
            "IsVideo": false,
            "IsFeaturedItem": false,
            "IsExternalResource": false,
            "User": {
                "ID": 18284,
                "Username": "Stromer"
            },
            "DateCreated": "2018-05-18T06:27:00Z"
        },
        {
            "ID": 15451,
            "ChargePointID": 64449,
            "ItemURL": "https://s3-ap-southeast-2.amazonaws.com/openchargemap/images/DE/OCM64449/OCM-64449.orig.2018051215592704.jpg",
            "ItemThumbnailURL": "https://s3-ap-southeast-2.amazonaws.com/openchargemap/images/DE/OCM64449/OCM-64449.thmb.2018051215592704.jpg",
            "Comment": "",
            "IsEnabled": true,
            "IsVideo": false,
            "IsFeaturedItem": false,
            "IsExternalResource": false,
            "User": {
                "ID": 18284,
                "Username": "Stromer"
            },
            "DateCreated": "2018-05-12T16:00:00Z"
        },
        {
            "ID": 15452,
            "ChargePointID": 64449,
            "ItemURL": "https://s3-ap-southeast-2.amazonaws.com/openchargemap/images/DE/OCM64449/OCM-64449.orig.2018051216000927.jpg",
            "ItemThumbnailURL": "https://s3-ap-southeast-2.amazonaws.com/openchargemap/images/DE/OCM64449/OCM-64449.thmb.2018051216000927.jpg",
            "Comment": "",
            "IsEnabled": true,
            "IsVideo": false,
            "IsFeaturedItem": false,
            "IsExternalResource": false,
            "User": {
                "ID": 18284,
                "Username": "Stromer"
            },
            "DateCreated": "2018-05-12T16:00:00Z"
        }
    ],
    "IsRecentlyVerified": false,
    "ID": 64449,
    "UUID": "FE0D53DA-DC25-4AD2-9419-04B09BEF24C1",
    "DataProviderID": 1,
    "OperatorID": 45,
    "UsageTypeID": 1,
    "AddressInfo": {
        "ID": 64795,
        "Title": "Volksbank",
        "AddressLine1": "Südstraße 15",
        "AddressLine2": "Dalmer",
        "Town": "Beckum",
        "StateOrProvince": "Kreis Warendorf",
        "Postcode": "59269",
        "CountryID": 87,
        "Latitude": 51.75416005486942,
        "Longitude": 8.03910839175216,
        "ContactTelephone1": "+49 252184040",
        "AccessComments": "Auf dem Parkplatz der Volksbank (neben Hausdach mit Solarpanels) sind zwei Parkbuchten vor der Ladesäule. 24/7 nutzbar, alles kostenlos",
        "RelatedURL": "http://www.voba-bl.de/wir_fuer_sie/presse/pressemitteilung/pm_2015211.html",
        "DistanceUnit": 0
    },
    "Connections": [
        {
            "ID": 82689,
            "ConnectionTypeID": 25,
            "StatusTypeID": 50,
            "LevelID": 2,
            "Amps": 16,
            "Voltage": 400,
            "PowerKW": 11,
            "CurrentTypeID": 20,
            "Quantity": 2
        }
    ],
    "NumberOfPoints": 2,
    "GeneralComments": "Zentral gelegen an der Fußgängerzone.",
    "StatusTypeID": 50,
    "DateLastStatusUpdate": "2018-05-18T06:27:00Z",
    "DataQualityLevel": 1,
    "DateCreated": "2016-03-07T09:33:00Z",
    "SubmissionStatusTypeID": 200
}