{
    "IsRecentlyVerified": false,
    "ID": 117909,
    "UUID": "F9D78EC1-628A-472F-8FF5-FEF46370A58B",
    "DataProviderID": 1,
    "OperatorID": 156,
    "UsageTypeID": 4,
    "UsageCost": "5,8 Cent/Minute",
    "AddressInfo": {
        "ID": 118255,
        "Title": " Park & Ride Parkplatz Empelde / Stadtbahnhaltestelle",
        "AddressLine1": "Nenndorfer Straße 47",
        "AddressLine2": "Ecke Auf dem Rade 3",
        "Town": "Ronnenberg Ortsteil Empelde",
        "StateOrProvince": "Region Hannover",
        "Postcode": "30952",
        "CountryID": 87,
        "Latitude": 52.3438416974989,
        "Longitude": 9.66563398850678,
        "AccessComments": "24/7 nutzbare Ladesäule der Enercity im Verbund New Motion auf dem Parkplatz neben der Stadtbahn-Endhaltestelle. Parken ist kostenlos. Die Ladesäule ist am Parkplatzrand, der der Nenndorfer Straße am Nächsten ist. Direkt gegenüber der Tankstelle.\r\nAktivierung mit New Motion, PlugSurfing, EnbW, SUN und vielen anderen Ladekarten",
        "DistanceUnit": 0
    },
    "Connections": [
        {
            "ID": 166884,
            "ConnectionTypeID": 25,
            "StatusTypeID": 50,
            "LevelID": 2,
            "Amps": 32,
            "Voltage": 400,
            "PowerKW": 22,
            "CurrentTypeID": 20,
            "Quantity": 2
        }
    ],
    "NumberOfPoints": 2,
    "StatusTypeID": 50,
    "DateLastStatusUpdate": "2019-03-10T11:20:00Z",
    "DataQualityLevel": 1,
    "DateCreated": "2019-03-10T11:20:00Z",
    "SubmissionStatusTypeID": 200
}