{
    "IsRecentlyVerified": false,
    "ID": 62889,
    "UUID": "7A7992F5-86BB-4982-BE13-A7CFFFD76863",
    "DataProviderID": 26,
    "DataProvidersReference": "79727",
    "OperatorID": 178,
    "OperatorsReference": "EVnetNL AL268",
    "UsageCost": "0.00 jaarabonnement",
    "AddressInfo": {
        "ID": 63235,
        "Title": "Wekkerstraat 25",
        "AddressLine1": "Wekkerstraat 25",
        "Town": "Eindhoven",
        "Postcode": "5652 AN",
        "CountryID": 159,
        "Latitude": 51.431825,
        "Longitude": 5.428635,
        "ContactTelephone1": "0800-3522365",
        "RelatedURL": "http://www.evnet.nl",
        "DistanceUnit": 0
    },
    "Connections": [
        {
            "ID": 79921,
            "ConnectionTypeID": 25,
            "LevelID": 2,
            "PowerKW": 11,
            "CurrentTypeID": 10
        }
    ],
    "NumberOfPoints": 2,
    "StatusTypeID": 50,
    "DateLastStatusUpdate": "2016-06-04T02:39:00Z",
    "DataQualityLevel": 3,
    "DateCreated": "2016-03-03T12:29:00Z",
    "SubmissionStatusTypeID": 100
}