{
    "IsRecentlyVerified": false,
    "ID": 184114,
    "UUID": "E42C4C9F-340B-4DBD-9BF8-689C321F4FD8",
    "DataProviderID": 29,
    "DataProvidersReference": "16240,12574,11973",
    "OperatorID": 69,
    "AddressInfo": {
        "ID": 184473,
        "Title": "B.-Kellermann-Straße 20",
        "AddressLine1": "B.-Kellermann-Straße 20",
        "Town": "Werder (Havel)",
        "Postcode": "14542",
        "CountryID": 87,
        "Latitude": 52.377727,
        "Longitude": 12.936169,
        "DistanceUnit": 0
    },
    "Connections": [
        {
            "ID": 291933,
            "ConnectionTypeID": 25,
            "StatusTypeID": 50,
            "LevelID": 2,
            "PowerKW": 22,
            "CurrentTypeID": 20
        },
        {
            "ID": 291934,
            "ConnectionTypeID": 25,
            "StatusTypeID": 50,
            "LevelID": 2,
            "PowerKW": 22,
            "CurrentTypeID": 20
        },
        {
            "ID": 291935,
            "ConnectionTypeID": 25,
            "StatusTypeID": 50,
            "LevelID": 2,
            "PowerKW": 22,
            "CurrentTypeID": 20
        },
        {
            "ID": 291936,
            "ConnectionTypeID": 25,
            "StatusTypeID": 50,
            "LevelID": 2,
            "PowerKW": 22,
            "CurrentTypeID": 20
        },
        {
            "ID": 291937,
            "ConnectionTypeID": 25,
            "StatusTypeID": 50,
            "LevelID": 2,
            "PowerKW": 22,
            "CurrentTypeID": 20
        },
        {
            "ID": 291938,
            "ConnectionTypeID": 25,
            "StatusTypeID": 50,
            "LevelID": 2,
            "PowerKW": 22,
            "CurrentTypeID": 20
        }
    ],
    "StatusTypeID": 50,
    "DateLastStatusUpdate": "2021-07-09T03:27:00Z",
    "MetadataValues": [
        {
            "ID": 16406,
            "MetadataFieldID": 4,
            "ItemValue": "Data from the German chargepoint registry provided by Bundesnetzagentur.de under the CC-BY 4.0 license"
        }
    ],
    "DataQualityLevel": 3,
    "DateCreated": "2021-07-08T10:05:00Z",
    "SubmissionStatusTypeID": 100
}