{
    "IsRecentlyVerified": false,
    "ID": 71956,
    "UUID": "7C3AE561-E262-4955-9323-C06A37708A6F",
    "DataProviderID": 1,
    "OperatorID": 1,
    "UsageTypeID": 1,
    "AddressInfo": {
        "ID": 72302,
        "Title": "Tognetti Auto in Gordola",
        "AddressLine1": "Via Francesca 63",
        "Town": "Gordola",
        "StateOrProvince": "Switzerland",
        "Postcode": "6596",
        "CountryID": 217,
        "Latitude": 46.1777392123834,
        "Longitude": 8.87695848941803,
        "ContactTelephone1": "+41 091 7351550",
        "RelatedURL": "http://www.goingelectric.de/stromtankstellen/Schweiz/Gordola/Tognetti-Auto-San-Gotthardo-139/6116/",
        "DistanceUnit": 0
    },
    "Connections": [
        {
            "ID": 103151,
            "ConnectionTypeID": 33,
            "StatusTypeID": 50,
            "LevelID": 3,
            "Amps": 20,
            "PowerKW": 22,
            "CurrentTypeID": 30,
            "Quantity": 1
        },
        {
            "ID": 103152,
            "ConnectionTypeID": 25,
            "StatusTypeID": 50,
            "LevelID": 2,
            "PowerKW": 22,
            "CurrentTypeID": 20
        }
    ],
    "NumberOfPoints": 2,
    "GeneralComments": "2 free parking.",
    "StatusTypeID": 50,
    "DateLastStatusUpdate": "2016-09-26T17:02:00Z",
    "DataQualityLevel": 1,
    "DateCreated": "2016-09-26T02:45:00Z",
    "SubmissionStatusTypeID": 200
}