{
    "IsRecentlyVerified": false,
    "ID": 120396,
    "UUID": "BBF585E9-1B68-495D-8A96-2373AA9406E9",
    "DataProviderID": 2,
    "DataProvidersReference": "48693",
    "OperatorID": 107,
    "UsageTypeID": 2,
    "AddressInfo": {
        "ID": 120742,
        "Title": "San Diego Naval Base - Barrio Logan",
        "AddressLine1": "2730 McKean St",
        "Town": "San Diego",
        "StateOrProvince": "CA",
        "Postcode": "92136",
        "CountryID": 2,
        "Latitude": 32.68556,
        "Longitude": -117.122617,
        "ContactTelephone1": "",
        "AccessComments": "",
        "RelatedURL": "http://www.opconnect.com/",
        "DistanceUnit": 0
    },
    "Connections": [
        {
            "ID": 169740,
            "ConnectionTypeID": 9,
            "LevelID": 1,
            "Amps": 16,
            "Voltage": 120,
            "PowerKW": 1,
            "CurrentTypeID": 10,
            "Quantity": 2
        },
        {
            "ID": 169741,
            "ConnectionTypeID": 1,
            "LevelID": 2,
            "Amps": 16,
            "Voltage": 230,
            "PowerKW": 3,
            "CurrentTypeID": 10,
            "Quantity": 2
        }
    ],
    "DateLastStatusUpdate": "2019-04-01T04:59:00Z",
    "DataQualityLevel": 3,
    "DateCreated": "2019-04-01T04:59:00Z",
    "SubmissionStatusTypeID": 100
}