{
    "IsRecentlyVerified": false,
    "ID": 181226,
    "UUID": "680942B9-D3A4-4EFB-8D0D-B7A1F9E9E3ED",
    "DataProviderID": 29,
    "DataProvidersReference": "2543",
    "AddressInfo": {
        "ID": 181585,
        "Title": "Bahnhofstraße 1",
        "AddressLine1": "Bahnhofstraße 1",
        "Town": "Cursdorf",
        "Postcode": "98744",
        "CountryID": 87,
        "Latitude": 50.571578,
        "Longitude": 11.128857,
        "DistanceUnit": 0
    },
    "Connections": [
        {
            "ID": 285276,
            "ConnectionTypeID": 25,
            "StatusTypeID": 50,
            "LevelID": 2,
            "PowerKW": 22,
            "CurrentTypeID": 20
        },
        {
            "ID": 285277,
            "ConnectionTypeID": 25,
            "StatusTypeID": 50,
            "LevelID": 2,
            "PowerKW": 22,
            "CurrentTypeID": 20
        }
    ],
    "StatusTypeID": 50,
    "DateLastStatusUpdate": "2021-07-09T03:19:00Z",
    "MetadataValues": [
        {
            "ID": 13520,
            "MetadataFieldID": 4,
            "ItemValue": "Data from the German chargepoint registry provided by Bundesnetzagentur.de under the CC-BY 4.0 license"
        }
    ],
    "DataQualityLevel": 3,
    "DateCreated": "2021-07-08T10:01:00Z",
    "SubmissionStatusTypeID": 100
}