{
    "IsRecentlyVerified": false,
    "ID": 2818,
    "UUID": "1430A4E5-E181-484E-BA4A-3A8CF081F348",
    "DataProviderID": 2,
    "DataProvidersReference": "34857",
    "UsageTypeID": 1,
    "AddressInfo": {
        "ID": 2819,
        "Title": "Kruse Woods Corporate Park",
        "AddressLine1": "5500 SW Meadows Rd",
        "Town": "Lake Oswego",
        "StateOrProvince": "OR",
        "Postcode": "97035",
        "CountryID": 2,
        "Latitude": 45.416826,
        "Longitude": -122.734498,
        "ContactTelephone1": "503-619-3200",
        "AccessComments": "24 hours daily",
        "RelatedURL": "",
        "DistanceUnit": 0
    },
    "Connections": [
        {
            "ID": 12477,
            "ConnectionTypeID": 9,
            "LevelID": 1,
            "Amps": 16,
            "Voltage": 120,
            "PowerKW": 1.9,
            "CurrentTypeID": 10,
            "Quantity": 4
        }
    ],
    "DateLastConfirmed": "2011-08-31T00:00:00Z",
    "StatusTypeID": 0,
    "DateLastStatusUpdate": "2020-06-26T03:09:00Z",
    "DataQualityLevel": 1,
    "DateCreated": "2011-01-31T00:00:00Z",
    "SubmissionStatusTypeID": 100
}