{
    "IsRecentlyVerified": false,
    "ID": 156380,
    "UUID": "384F3A3B-4FE7-44F6-8192-12BFEBBC59A8",
    "DataProviderID": 1,
    "OperatorID": 3,
    "OperatorsReference": "PG-84718",
    "UsageTypeID": 4,
    "UsageCost": "Free",
    "AddressInfo": {
        "ID": 156734,
        "Title": "Aldi-Barnsley",
        "AddressLine1": "High Street",
        "Town": "Royston",
        "StateOrProvince": "Barnsley",
        "Postcode": "S71 4RF",
        "CountryID": 1,
        "Latitude": 53.5,
        "Longitude": -1.45,
        "DistanceUnit": 0
    },
    "Connections": [
        {
            "ID": 220050,
            "ConnectionTypeID": 25,
            "StatusTypeID": 50,
            "LevelID": 2,
            "Amps": 32,
            "Voltage": 230,
            "PowerKW": 7,
            "CurrentTypeID": 10,
            "Quantity": 2
        }
    ],
    "NumberOfPoints": 2,
    "GeneralComments": "This is an open charge unit installed at the Aldi Stores in Royston, Barnsley",
    "StatusTypeID": 50,
    "DateLastStatusUpdate": "2020-05-19T05:37:00Z",
    "DataQualityLevel": 1,
    "DateCreated": "2020-05-19T05:37:00Z",
    "SubmissionStatusTypeID": 200
}