{
    "IsRecentlyVerified": false,
    "ID": 134893,
    "UUID": "06018E83-C8F1-4AB7-96AF-351F8348E4FD",
    "DataProviderID": 1,
    "OperatorID": 31,
    "UsageTypeID": 5,
    "UsageCost": "$3.00 parking fee",
    "AddressInfo": {
        "ID": 135239,
        "Title": "Valencia Boulevard",
        "AddressLine1": "Valencia Boulevard",
        "AddressLine2": "Valencia",
        "Town": "Santa Clarita",
        "StateOrProvince": "California",
        "Postcode": "91355",
        "CountryID": 2,
        "Latitude": 34.407815058237574,
        "Longitude": -118.56899693319485,
        "AccessComments": "at the corner of Valencia Blvd and Rockwell Canyon",
        "DistanceUnit": 0
    },
    "Connections": [
        {
            "ID": 188738,
            "ConnectionTypeID": 1,
            "StatusTypeID": 50,
            "LevelID": 2,
            "Amps": 32,
            "Voltage": 220,
            "PowerKW": 7,
            "Quantity": 50
        }
    ],
    "NumberOfPoints": 50,
    "GeneralComments": "one charger on top level, over 20 on the second and third levels each",
    "StatusTypeID": 50,
    "DateLastStatusUpdate": "2019-11-29T12:19:00Z",
    "DataQualityLevel": 1,
    "DateCreated": "2019-11-29T02:53:00Z",
    "SubmissionStatusTypeID": 200
}