{
    "IsRecentlyVerified": false,
    "ID": 166580,
    "UUID": "295107EF-159D-4027-9441-9D80FFD8D806",
    "DataProviderID": 28,
    "DataProvidersReference": "FR*S61*P61096A",
    "UsageTypeID": 5,
    "AddressInfo": {
        "ID": 166939,
        "Title": "Rives d'Andaine | Rue de Domfront",
        "AddressLine1": "Rue de Domfront 61140 Rives d'Andaine",
        "CountryID": 80,
        "Latitude": 48.53418,
        "Longitude": -0.481497,
        "AccessComments": "24/24 7/7",
        "DistanceUnit": 0
    },
    "Connections": [
        {
            "ID": 249650,
            "ConnectionTypeID": 25,
            "StatusTypeID": 50,
            "LevelID": 2,
            "PowerKW": 18,
            "CurrentTypeID": 20
        },
        {
            "ID": 249651,
            "ConnectionTypeID": 28,
            "StatusTypeID": 50,
            "LevelID": 2,
            "PowerKW": 18,
            "CurrentTypeID": 10
        },
        {
            "ID": 249652,
            "ConnectionTypeID": 26,
            "StatusTypeID": 50,
            "LevelID": 2,
            "PowerKW": 18
        },
        {
            "ID": 249653,
            "ConnectionTypeID": 28,
            "StatusTypeID": 50,
            "LevelID": 2,
            "PowerKW": 18,
            "CurrentTypeID": 10
        }
    ],
    "GeneralComments": "",
    "StatusTypeID": 50,
    "DateLastStatusUpdate": "2020-08-27T05:15:00Z",
    "DataQualityLevel": 2,
    "DateCreated": "2020-08-27T05:15:00Z",
    "SubmissionStatusTypeID": 100
}