{
    "IsRecentlyVerified": false,
    "ID": 165138,
    "UUID": "93037F1B-5096-4212-8E3C-9BAA7325CF94",
    "DataProviderID": 1,
    "DataProvidersReference": "TR-AFY-001",
    "OperatorID": 70,
    "UsageTypeID": 1,
    "AddressInfo": {
        "ID": 165497,
        "Title": "Eşarj - İkbal Thermal Hotel, Afyonkarahisar",
        "AddressLine1": "Dörtyol Mahallesi Kütahya Yolu Bulvarı No:2 / 3, Merkez",
        "Town": "Afyonkarahisar",
        "StateOrProvince": "Afyonkarahisar",
        "Postcode": "3096",
        "CountryID": 229,
        "Latitude": 38.793282,
        "Longitude": 30.457851,
        "ContactTelephone1": "+90 (850) 433 72 75",
        "ContactEmail": "destek@esarj.com",
        "RelatedURL": "https://esarj.com/en/map?s=TR-AFY-001",
        "DistanceUnit": 0
    },
    "Connections": [
        {
            "ID": 236761,
            "ConnectionTypeID": 2,
            "LevelID": 3,
            "Amps": 125,
            "Voltage": 500,
            "PowerKW": 45,
            "CurrentTypeID": 30,
            "Quantity": 1
        },
        {
            "ID": 236762,
            "ConnectionTypeID": 33,
            "LevelID": 3,
            "Amps": 120,
            "Voltage": 500,
            "PowerKW": 45,
            "CurrentTypeID": 30,
            "Quantity": 1
        },
        {
            "ID": 236763,
            "ConnectionTypeID": 25,
            "LevelID": 2,
            "Amps": 32,
            "Voltage": 380,
            "PowerKW": 22,
            "CurrentTypeID": 20,
            "Quantity": 1
        }
    ],
    "GeneralComments": "Eşarj Charging Systems",
    "StatusTypeID": 50,
    "DateLastStatusUpdate": "2021-08-26T13:35:00Z",
    "DataQualityLevel": 3,
    "DateCreated": "2020-08-26T08:19:00Z",
    "SubmissionStatusTypeID": 200
}