{
    "IsRecentlyVerified": false,
    "ID": 102513,
    "UUID": "366F1B44-FDE8-44D7-9174-5628912AA0EA",
    "DataProviderID": 2,
    "DataProvidersReference": "69074",
    "OperatorID": 5,
    "UsageTypeID": 1,
    "AddressInfo": {
        "ID": 102859,
        "Title": "STUDIO",
        "AddressLine1": "515-699 James Stewart Ave",
        "Town": "Universal City",
        "StateOrProvince": "CA",
        "Postcode": "91602",
        "CountryID": 2,
        "Latitude": 34.1415807,
        "Longitude": -118.3532802,
        "ContactTelephone1": "888-758-4389",
        "AccessComments": "24 hours daily",
        "RelatedURL": "http://www.chargepoint.com/",
        "DistanceUnit": 0
    },
    "Connections": [
        {
            "ID": 144597,
            "ConnectionTypeID": 1,
            "LevelID": 2,
            "Amps": 16,
            "Voltage": 230,
            "PowerKW": 3,
            "CurrentTypeID": 10,
            "Quantity": 6
        }
    ],
    "DateLastStatusUpdate": "2019-04-06T04:01:00Z",
    "DataQualityLevel": 3,
    "DateCreated": "2018-04-21T04:13:00Z",
    "SubmissionStatusTypeID": 100
}