{
    "MediaItems": [
        {
            "ID": 10902,
            "ChargePointID": 21170,
            "ItemURL": "https://s3-ap-southeast-2.amazonaws.com/openchargemap/images/IT/OCM21170/OCM-21170.orig.2017042910225202.jpg",
            "ItemThumbnailURL": "https://s3-ap-southeast-2.amazonaws.com/openchargemap/images/IT/OCM21170/OCM-21170.thmb.2017042910225202.jpg",
            "Comment": "",
            "IsEnabled": true,
            "IsVideo": false,
            "IsFeaturedItem": false,
            "IsExternalResource": false,
            "User": {
                "ID": 1606,
                "Username": "polianto"
            },
            "DateCreated": "2017-04-29T10:23:00Z"
        },
        {
            "ID": 271,
            "ChargePointID": 21170,
            "ItemURL": "https://s3-ap-southeast-2.amazonaws.com/openchargemap/images/IT/OCM21170/OCM-21170.orig.2014030209365592.jpg",
            "ItemThumbnailURL": "https://s3-ap-southeast-2.amazonaws.com/openchargemap/images/IT/OCM21170/OCM-21170.thmb.2014030209365592.jpg",
            "Comment": "",
            "IsEnabled": true,
            "IsVideo": false,
            "IsFeaturedItem": false,
            "IsExternalResource": false,
            "User": {
                "ID": 1606,
                "Username": "polianto"
            },
            "DateCreated": "2014-03-02T09:37:00Z"
        }
    ],
    "IsRecentlyVerified": false,
    "ID": 21170,
    "UUID": "1B7613B4-9170-4AB5-825F-F533454041FD",
    "DataProviderID": 1,
    "OperatorID": 82,
    "UsageTypeID": 4,
    "UsageCost": "15€ for 3months",
    "AddressInfo": {
        "ID": 21515,
        "Title": "A2A Via Manin",
        "AddressLine1": "Via Daniele Manin 37",
        "Town": "Milano",
        "StateOrProvince": "Milano",
        "Postcode": "20124",
        "CountryID": 112,
        "Latitude": 45.4769961085806,
        "Longitude": 9.19830185653859,
        "ContactTelephone1": "800.035.151",
        "RelatedURL": "http://www.e-moving.it/",
        "DistanceUnit": 0
    },
    "Connections": [
        {
            "ID": 23037,
            "ConnectionTypeID": 25,
            "StatusTypeID": 50,
            "LevelID": 2,
            "Amps": 32,
            "Voltage": 400,
            "PowerKW": 22,
            "CurrentTypeID": 20,
            "Quantity": 1
        },
        {
            "ID": 89833,
            "ConnectionTypeID": 33,
            "StatusTypeID": 50,
            "LevelID": 3,
            "PowerKW": 40,
            "CurrentTypeID": 30,
            "Quantity": 1
        },
        {
            "ID": 89834,
            "ConnectionTypeID": 2,
            "StatusTypeID": 50,
            "LevelID": 3,
            "PowerKW": 40,
            "CurrentTypeID": 30,
            "Quantity": 1
        }
    ],
    "NumberOfPoints": 2,
    "GeneralComments": "In corso di aggiornamento a Fast Charge Tristandard",
    "StatusTypeID": 50,
    "DateLastStatusUpdate": "2017-04-29T10:23:00Z",
    "DataQualityLevel": 1,
    "DateCreated": "2014-03-01T16:40:00Z",
    "SubmissionStatusTypeID": 200
}