{
    "IsRecentlyVerified": false,
    "ID": 157214,
    "UUID": "854120A8-B11D-4669-9B23-AA4CC8F23D6E",
    "DataProviderID": 19,
    "DataProvidersReference": "4724",
    "AddressInfo": {
        "ID": 157568,
        "Title": "TrP Munkegata",
        "AddressLine1": "Munkegata 40",
        "Town": "TRONDHEIM",
        "StateOrProvince": "Trøndelag",
        "Postcode": "7011",
        "CountryID": 168,
        "Latitude": 63.43163,
        "Longitude": 10.39431,
        "AccessComments": "",
        "DistanceUnit": 0
    },
    "Connections": [
        {
            "ID": 225991,
            "ConnectionTypeID": 25,
            "Reference": "1",
            "LevelID": 3,
            "Amps": 32,
            "Voltage": 400,
            "PowerKW": 22,
            "CurrentTypeID": 30,
            "Comments": "Mode 3"
        },
        {
            "ID": 225992,
            "ConnectionTypeID": 25,
            "Reference": "2",
            "LevelID": 3,
            "Amps": 32,
            "Voltage": 400,
            "PowerKW": 22,
            "CurrentTypeID": 30,
            "Comments": "Mode 3"
        },
        {
            "ID": 225993,
            "ConnectionTypeID": 25,
            "Reference": "3",
            "LevelID": 3,
            "Amps": 32,
            "Voltage": 400,
            "PowerKW": 22,
            "CurrentTypeID": 30,
            "Comments": "Mode 3"
        },
        {
            "ID": 225994,
            "ConnectionTypeID": 25,
            "Reference": "4",
            "LevelID": 3,
            "Amps": 32,
            "Voltage": 400,
            "PowerKW": 22,
            "CurrentTypeID": 30,
            "Comments": "Mode 3"
        }
    ],
    "NumberOfPoints": 4,
    "StatusTypeID": 0,
    "DateLastStatusUpdate": "2021-03-24T05:12:00Z",
    "DataQualityLevel": 2,
    "DateCreated": "2020-05-26T08:25:00Z",
    "SubmissionStatusTypeID": 100
}