{
    "IsRecentlyVerified": false,
    "ID": 46282,
    "UUID": "BFBC3508-00E4-4305-87CC-24E1DB8479C3",
    "DataProviderID": 1,
    "DataProvidersReference": "1055",
    "AddressInfo": {
        "ID": 46628,
        "Title": "Askekroken, Oslo",
        "AddressLine1": "Askekroken ",
        "Town": "OSLO",
        "StateOrProvince": "Oslo",
        "Postcode": "0276",
        "CountryID": 168,
        "Latitude": 59.92327,
        "Longitude": 10.68135,
        "AccessComments": "",
        "DistanceUnit": 0
    },
    "Connections": [
        {
            "ID": 56945,
            "ConnectionTypeID": 0,
            "Reference": "1",
            "LevelID": 2,
            "Amps": 16,
            "Voltage": 230,
            "PowerKW": 3.7,
            "Comments": "Mode 1"
        },
        {
            "ID": 85939,
            "ConnectionTypeID": 0,
            "Reference": "2",
            "LevelID": 2,
            "Amps": 16,
            "Voltage": 230,
            "PowerKW": 3.7,
            "Comments": "Mode 1"
        },
        {
            "ID": 85940,
            "ConnectionTypeID": 0,
            "Reference": "3",
            "LevelID": 2,
            "Amps": 16,
            "Voltage": 230,
            "PowerKW": 3.7,
            "Comments": "Mode 1"
        },
        {
            "ID": 88671,
            "ConnectionTypeID": 0,
            "Reference": "4",
            "LevelID": 2,
            "Amps": 16,
            "Voltage": 230,
            "PowerKW": 3.7,
            "Comments": "Mode 1"
        }
    ],
    "NumberOfPoints": 4,
    "DateLastStatusUpdate": "2020-05-26T08:23:00Z",
    "DataQualityLevel": 2,
    "DateCreated": "2015-05-03T00:54:00Z",
    "SubmissionStatusTypeID": 100
}