{
    "IsRecentlyVerified": false,
    "ID": 47487,
    "UUID": "33F886DE-FE1D-455E-AFAA-0DA47C023AF8",
    "DataProviderID": 1,
    "OperatorID": 45,
    "UsageTypeID": 1,
    "UsageCost": "0",
    "AddressInfo": {
        "ID": 47833,
        "Title": "Parkplatz Von Günther Platz in Hammelburg",
        "AddressLine1": "Bahnhofstraße 57",
        "Town": "Hammelburg",
        "StateOrProvince": "Bayern",
        "CountryID": 87,
        "Latitude": 50.11776906982362,
        "Longitude": 9.887676537036896,
        "AccessComments": "Auf dem Parkplatz P5. Öffentlich 24/7 nutzbar, kostenloser strom, freischaltbar mit jeder Ladekarte public access and with energy free of charge, activate with any RFID card. ",
        "RelatedURL": "https://www.hammelburg.de/images/fachgebiet/stadtinfo_kultur/Parkplatzplan_-_Endfassung.pdf",
        "DistanceUnit": 0
    },
    "Connections": [
        {
            "ID": 58531,
            "ConnectionTypeID": 25,
            "StatusTypeID": 50,
            "LevelID": 2,
            "Amps": 32,
            "Voltage": 400,
            "PowerKW": 22,
            "CurrentTypeID": 20,
            "Quantity": 1
        },
        {
            "ID": 58532,
            "ConnectionTypeID": 28,
            "StatusTypeID": 50,
            "LevelID": 2,
            "Amps": 16,
            "Voltage": 230,
            "PowerKW": 3.7,
            "CurrentTypeID": 10,
            "Quantity": 1
        }
    ],
    "NumberOfPoints": 2,
    "GeneralComments": "Random RFID chip required, beliebiger RFID Chip erforderlich zum freischalten (z.B. neuer Personalausweis / EC- oder Kreditkarte mit kontaktloser Bezahloption / wahrscheinlich funktioniert sogar ein RFID Chip aus Klamotten)",
    "StatusTypeID": 50,
    "DateLastStatusUpdate": "2015-05-28T05:27:00Z",
    "DataQualityLevel": 1,
    "DateCreated": "2015-05-27T15:07:00Z",
    "SubmissionStatusTypeID": 200
}