{
    "IsRecentlyVerified": false,
    "ID": 179843,
    "UUID": "9807C5A0-49B5-4BA9-A1AC-DF84006C307B",
    "DataProviderID": 29,
    "DataProvidersReference": "2579",
    "OperatorID": 45,
    "AddressInfo": {
        "ID": 180202,
        "Title": "Atterstraße 25",
        "AddressLine1": "Atterstraße 25",
        "Town": "Lotte",
        "Postcode": "49504",
        "CountryID": 87,
        "Latitude": 52.305965,
        "Longitude": 7.955623,
        "DistanceUnit": 0
    },
    "Connections": [
        {
            "ID": 282201,
            "ConnectionTypeID": 33,
            "StatusTypeID": 50,
            "LevelID": 3,
            "PowerKW": 22,
            "CurrentTypeID": 30
        },
        {
            "ID": 282202,
            "ConnectionTypeID": 25,
            "StatusTypeID": 50,
            "LevelID": 2,
            "PowerKW": 11,
            "CurrentTypeID": 20
        }
    ],
    "StatusTypeID": 50,
    "DateLastStatusUpdate": "2021-07-12T02:49:00Z",
    "MetadataValues": [
        {
            "ID": 12137,
            "MetadataFieldID": 4,
            "ItemValue": "Data from the German chargepoint registry provided by Bundesnetzagentur.de under the CC-BY 4.0 license"
        }
    ],
    "DataQualityLevel": 3,
    "DateCreated": "2021-07-08T10:00:00Z",
    "SubmissionStatusTypeID": 100
}