{
    "IsRecentlyVerified": false,
    "ID": 39121,
    "UUID": "8A067E1C-4F49-4C99-8A2C-D0EEA301BB45",
    "DataProviderID": 26,
    "DataProvidersReference": "54845",
    "OperatorID": 178,
    "OperatorsReference": "EVnetNL REE599",
    "UsageCost": "0.00 jaarabonnement",
    "AddressInfo": {
        "ID": 39467,
        "Title": "Hynsteblom 1",
        "AddressLine1": "Hynsteblom 1",
        "Town": "Dantumadiel",
        "Postcode": "9104 BP",
        "CountryID": 159,
        "Latitude": 53.290561,
        "Longitude": 5.994715,
        "ContactTelephone1": "0800-3522365",
        "RelatedURL": "http://www.evnet.nl",
        "DistanceUnit": 0
    },
    "Connections": [
        {
            "ID": 42632,
            "ConnectionTypeID": 25,
            "LevelID": 1,
            "PowerKW": 2.3,
            "CurrentTypeID": 10
        }
    ],
    "NumberOfPoints": 1,
    "StatusTypeID": 50,
    "DateLastStatusUpdate": "2016-06-04T02:56:00Z",
    "DataQualityLevel": 3,
    "DateCreated": "2015-01-09T06:08:00Z",
    "SubmissionStatusTypeID": 100
}