{
    "IsRecentlyVerified": false,
    "ID": 127474,
    "UUID": "42F8866B-DE53-4464-A297-65CC7D6358AA",
    "DataProviderID": 1,
    "OperatorID": 22,
    "OperatorsReference": "C34YV-A/B",
    "UsageTypeID": 4,
    "AddressInfo": {
        "ID": 127820,
        "Title": "Irish Rail Coolmine Train Station",
        "AddressLine1": "Carpenterstown Road",
        "Town": "Dublin 15",
        "StateOrProvince": "County Dublin",
        "CountryID": 3,
        "Latitude": 53.377326,
        "Longitude": -6.391846,
        "DistanceUnit": 0
    },
    "Connections": [
        {
            "ID": 178447,
            "ConnectionTypeID": 25,
            "StatusTypeID": 50,
            "LevelID": 2,
            "Amps": 32,
            "Voltage": 400,
            "PowerKW": 22,
            "CurrentTypeID": 20,
            "Quantity": 2
        }
    ],
    "NumberOfPoints": 2,
    "StatusTypeID": 50,
    "DateLastStatusUpdate": "2019-06-22T05:31:00Z",
    "DataQualityLevel": 1,
    "DateCreated": "2019-06-03T11:28:00Z",
    "SubmissionStatusTypeID": 200
}