{
    "UserComments": [
        {
            "ID": 4203,
            "ChargePointID": 4127,
            "CommentTypeID": 10,
            "UserName": "pwrkiter",
            "Comment": "Rapid Charger now operational and has been for a number of months.",
            "Rating": 4,
            "DateCreated": "2015-04-11T22:30:51.21Z",
            "User": {
                "ID": 2071,
                "Username": "pwrkiter"
            },
            "CheckinStatusTypeID": 10
        },
        {
            "ID": 178,
            "ChargePointID": 4127,
            "CommentTypeID": 10,
            "UserName": "Paul",
            "Comment": "They only have the low power charger available during office hours and the fast charger is not operational. ",
            "Rating": 3,
            "DateCreated": "2012-10-19T07:26:39.157Z"
        }
    ],
    "IsRecentlyVerified": false,
    "ID": 4127,
    "UUID": "F218CB90-634D-46B2-96C1-6DEA7C9B97BC",
    "DataProviderID": 1,
    "OperatorID": 7,
    "UsageTypeID": 1,
    "AddressInfo": {
        "ID": 4127,
        "Title": "West Way Manchester Nissan",
        "AddressLine1": "Chancellor Lane",
        "AddressLine2": "Ardwick",
        "Town": "Manchester",
        "StateOrProvince": "Greater Manchester",
        "Postcode": "M12 6JZ",
        "CountryID": 1,
        "Latitude": 53.473846457782045,
        "Longitude": -2.21687784921266,
        "ContactTelephone1": "0161 273 2400",
        "AccessComments": "Check with dealer for access.",
        "RelatedURL": "http://www.westwaynissan.co.uk/westway-manchester",
        "DistanceUnit": 0
    },
    "Connections": [
        {
            "ID": 157,
            "ConnectionTypeID": 2,
            "StatusTypeID": 50,
            "LevelID": 3,
            "Amps": 125,
            "Voltage": 500,
            "PowerKW": 62.5,
            "CurrentTypeID": 30,
            "Quantity": 1
        },
        {
            "ID": 6668,
            "ConnectionTypeID": 3,
            "StatusTypeID": 50,
            "LevelID": 2,
            "Amps": 13,
            "Voltage": 230,
            "PowerKW": 3,
            "CurrentTypeID": 10,
            "Quantity": 2
        }
    ],
    "NumberOfPoints": 3,
    "GeneralComments": "Inside Nissan dealer. Only available when dealer open",
    "DateLastConfirmed": "2011-04-15T00:00:00Z",
    "StatusTypeID": 75,
    "DateLastStatusUpdate": "2017-04-21T19:49:00Z",
    "DataQualityLevel": 1,
    "DateCreated": "2011-04-15T00:00:00Z",
    "SubmissionStatusTypeID": 200
}