{
    "IsRecentlyVerified": false,
    "ID": 90188,
    "UUID": "53EA47FE-750D-40B5-BF4D-BEF982D45891",
    "DataProviderID": 1,
    "OperatorID": 23,
    "OperatorsReference": "39668",
    "UsageTypeID": 4,
    "AddressInfo": {
        "ID": 90534,
        "Title": "Okemo Mountain Resort",
        "AddressLine1": "1524 Okemo Ridge RD",
        "Town": "Ludlow",
        "StateOrProvince": "Vermont",
        "Postcode": "05149",
        "CountryID": 2,
        "Latitude": 43.401829,
        "Longitude": -72.717064,
        "ContactTelephone1": "(802) 228-4041",
        "DistanceUnit": 0
    },
    "Connections": [
        {
            "ID": 127841,
            "ConnectionTypeID": 30,
            "StatusTypeID": 50,
            "LevelID": 2,
            "PowerKW": 17,
            "CurrentTypeID": 20,
            "Quantity": 8
        }
    ],
    "NumberOfPoints": 8,
    "GeneralComments": "8 Tesla Connectors, up to 17kW.Available for customers. Please call ahead.",
    "StatusTypeID": 50,
    "DateLastStatusUpdate": "2018-01-21T16:52:00Z",
    "DataQualityLevel": 1,
    "DateCreated": "2017-07-13T14:09:00Z",
    "SubmissionStatusTypeID": 200
}