{
    "IsRecentlyVerified": false,
    "ID": 140138,
    "UUID": "C654C576-211D-4F24-B594-159B4A0E44FC",
    "DataProviderID": 2,
    "DataProvidersReference": "144981",
    "OperatorID": 5,
    "UsageTypeID": 1,
    "AddressInfo": {
        "ID": 140490,
        "Title": "SD3#1",
        "AddressLine1": "2820 Campus Ridge Rd",
        "Town": "Matthews",
        "StateOrProvince": "NC",
        "Postcode": "28105",
        "CountryID": 2,
        "Latitude": 35.105824,
        "Longitude": -80.69647,
        "ContactTelephone1": "888-758-4389",
        "AccessComments": "24 hours daily",
        "RelatedURL": "http://www.chargepoint.com/",
        "DistanceUnit": 0
    },
    "Connections": [
        {
            "ID": 195695,
            "ConnectionTypeID": 1,
            "LevelID": 2,
            "Amps": 16,
            "Voltage": 230,
            "PowerKW": 3.7,
            "CurrentTypeID": 10,
            "Quantity": 2
        }
    ],
    "StatusTypeID": 50,
    "DateLastStatusUpdate": "2020-06-26T02:57:00Z",
    "DataQualityLevel": 3,
    "DateCreated": "2019-12-24T09:12:00Z",
    "SubmissionStatusTypeID": 100
}