{
    "IsRecentlyVerified": false,
    "ID": 141557,
    "UUID": "D0B3A181-3995-4E3F-9692-91607821B684",
    "DataProviderID": 2,
    "DataProvidersReference": "148286",
    "OperatorID": 39,
    "UsageTypeID": 1,
    "AddressInfo": {
        "ID": 141909,
        "Title": "Tower 2",
        "AddressLine1": "2000 Tower Oaks Blvd",
        "Town": "Rockville",
        "StateOrProvince": "MD",
        "Postcode": "20852",
        "CountryID": 2,
        "Latitude": 39.066178,
        "Longitude": -77.153254,
        "ContactTelephone1": "800-663-5633",
        "AccessComments": "MO: Not Specified; TU: Not Specified; WE: Not Specified; TH: Not Specified; FR: Not Specified; SA: Not Specified; SU: Not Specified",
        "RelatedURL": "http://www.semacharge.com/",
        "DistanceUnit": 0
    },
    "Connections": [
        {
            "ID": 197509,
            "ConnectionTypeID": 1,
            "LevelID": 2,
            "Amps": 16,
            "Voltage": 230,
            "PowerKW": 3.7,
            "CurrentTypeID": 10,
            "Quantity": 1
        }
    ],
    "StatusTypeID": 50,
    "DateLastStatusUpdate": "2020-06-26T03:01:00Z",
    "DataQualityLevel": 3,
    "DateCreated": "2019-12-24T09:15:00Z",
    "SubmissionStatusTypeID": 100
}