{
    "IsRecentlyVerified": false,
    "ID": 63728,
    "UUID": "3E1AF0CE-CD19-438A-8CC2-87A75207650D",
    "DataProviderID": 26,
    "DataProvidersReference": "78361",
    "OperatorID": 73,
    "OperatorsReference": "EV-Box EVB-P1449038",
    "UsageCost": "0.00 jaarabonnement",
    "AddressInfo": {
        "ID": 64074,
        "Title": "Prins Bernhardlaan 70",
        "AddressLine1": "Prins Bernhardlaan 70",
        "Town": "Katwijk",
        "Postcode": "2231 VN",
        "CountryID": 159,
        "Latitude": 52.18451,
        "Longitude": 4.43753,
        "RelatedURL": "http://www.ev-box.nl",
        "DistanceUnit": 0
    },
    "Connections": [
        {
            "ID": 81394,
            "ConnectionTypeID": 25,
            "LevelID": 2,
            "PowerKW": 5,
            "CurrentTypeID": 10
        }
    ],
    "NumberOfPoints": 1,
    "StatusTypeID": 50,
    "DateLastStatusUpdate": "2016-06-04T02:51:00Z",
    "DataQualityLevel": 3,
    "DateCreated": "2016-03-03T12:31:00Z",
    "SubmissionStatusTypeID": 100
}