{
    "IsRecentlyVerified": false,
    "ID": 35968,
    "UUID": "1713AB45-29FA-41B5-B4A1-ADD19B9A5E84",
    "DataProviderID": 26,
    "DataProvidersReference": "50905",
    "OperatorID": 180,
    "OperatorsReference": "Alfen GDH2092",
    "UsageCost": "0.00 jaarabonnement",
    "AddressInfo": {
        "ID": 36314,
        "Title": "Haverkamp 226",
        "AddressLine1": "Haverkamp 226",
        "Town": "Den Haag",
        "Postcode": "2592 BM",
        "CountryID": 159,
        "Latitude": 52.089722,
        "Longitude": 4.350146,
        "ContactTelephone1": "036 - 549 34 00",
        "RelatedURL": "http://www.icu-charging-stations.com/",
        "DistanceUnit": 0
    },
    "Connections": [
        {
            "ID": 39479,
            "ConnectionTypeID": 25,
            "LevelID": 2,
            "PowerKW": 11,
            "CurrentTypeID": 10
        },
        {
            "ID": 48155,
            "ConnectionTypeID": 25,
            "LevelID": 2,
            "PowerKW": 11,
            "CurrentTypeID": 10
        }
    ],
    "NumberOfPoints": 1,
    "StatusTypeID": 50,
    "DateLastStatusUpdate": "2016-06-04T02:50:00Z",
    "DataQualityLevel": 3,
    "DateCreated": "2015-01-09T06:05:00Z",
    "SubmissionStatusTypeID": 100
}