{
    "IsRecentlyVerified": false,
    "ID": 73593,
    "UUID": "D2402FA9-1CBA-4E0B-9DCB-DC1E2C21AFF5",
    "DataProviderID": 1,
    "OperatorID": 89,
    "OperatorsReference": "CEA-10162",
    "UsageTypeID": 4,
    "UsageCost": "CAD 1.00/hour",
    "AddressInfo": {
        "ID": 73939,
        "Title": "Sur Rue-Ville-Marie-Rue Frontenac",
        "AddressLine1": "1956 Rue Frontenac",
        "Town": "Montréal",
        "StateOrProvince": "QC",
        "Postcode": "H2K 2Z1",
        "CountryID": 44,
        "Latitude": 45.532725,
        "Longitude": -73.552184,
        "DistanceUnit": 0
    },
    "Connections": [
        {
            "ID": 105883,
            "ConnectionTypeID": 1,
            "StatusTypeID": 50,
            "LevelID": 2,
            "Amps": 32,
            "Voltage": 230,
            "PowerKW": 7,
            "CurrentTypeID": 10,
            "Quantity": 1
        }
    ],
    "NumberOfPoints": 1,
    "StatusTypeID": 50,
    "DateLastStatusUpdate": "2017-02-10T08:52:00Z",
    "DataQualityLevel": 1,
    "DateCreated": "2016-11-23T22:20:00Z",
    "SubmissionStatusTypeID": 200
}