{
    "IsRecentlyVerified": false,
    "ID": 163638,
    "UUID": "767697B3-1F6F-4889-99DC-6CF8895B1CC8",
    "DataProviderID": 1,
    "OperatorID": 23,
    "OperatorsReference": "52330",
    "UsageTypeID": 4,
    "AddressInfo": {
        "ID": 163995,
        "Title": "Sercotel Portales",
        "AddressLine1": "Calle Portales",
        "Town": "Logrono",
        "StateOrProvince": "La Rioja",
        "Postcode": "26001",
        "CountryID": 210,
        "Latitude": 42.466184,
        "Longitude": -2.450468,
        "ContactTelephone1": "+34 941 50 27 94 ",
        "DistanceUnit": 0
    },
    "Connections": [
        {
            "ID": 235235,
            "ConnectionTypeID": 30,
            "StatusTypeID": 50,
            "LevelID": 2,
            "PowerKW": 7,
            "CurrentTypeID": 20,
            "Quantity": 1
        }
    ],
    "NumberOfPoints": 1,
    "GeneralComments": "1 Tesla Connector, up to 7kW.Available for customers. Please call ahead.",
    "StatusTypeID": 50,
    "DateLastStatusUpdate": "2020-08-24T13:48:00Z",
    "DataQualityLevel": 1,
    "DateCreated": "2020-08-24T13:48:00Z",
    "SubmissionStatusTypeID": 200
}