{
    "IsRecentlyVerified": false,
    "ID": 107233,
    "UUID": "65E6A63F-603A-4427-8B40-DA76932E8E6C",
    "DataProviderID": 1,
    "OperatorID": 45,
    "UsageTypeID": 1,
    "AddressInfo": {
        "ID": 107579,
        "Title": "ON Skjöldólfsstöðum",
        "AddressLine1": "Skjöldólfsstöðum",
        "Town": "Egilsstöðum",
        "StateOrProvince": "Egilsstöðum",
        "Postcode": "701",
        "CountryID": 105,
        "Latitude": 65.316545,
        "Longitude": -15.118921,
        "DistanceUnit": 0
    },
    "Connections": [
        {
            "ID": 151243,
            "ConnectionTypeID": 25,
            "StatusTypeID": 50,
            "LevelID": 2,
            "Amps": 32,
            "Voltage": 220,
            "PowerKW": 7,
            "CurrentTypeID": 10
        },
        {
            "ID": 151244,
            "ConnectionTypeID": 1,
            "StatusTypeID": 50,
            "LevelID": 2,
            "Amps": 32,
            "Voltage": 220,
            "PowerKW": 7,
            "CurrentTypeID": 10,
            "Quantity": 1
        }
    ],
    "NumberOfPoints": 1,
    "StatusTypeID": 50,
    "DateLastStatusUpdate": "2018-07-23T09:41:00Z",
    "DataQualityLevel": 1,
    "DateCreated": "2018-07-23T09:41:00Z",
    "SubmissionStatusTypeID": 200
}