{
    "IsRecentlyVerified": false,
    "ID": 34727,
    "UUID": "A4C1AD55-39E6-4713-8387-46A06432F585",
    "DataProviderID": 26,
    "DataProvidersReference": "38287",
    "OperatorID": 73,
    "OperatorsReference": "EV-Box EVB-P1321137",
    "UsageCost": "0.00 jaarabonnement",
    "AddressInfo": {
        "ID": 35073,
        "Title": "Oudsmidsestraat 50a",
        "AddressLine1": "Oudsmidsestraat 50a",
        "Town": "Buren",
        "Postcode": "4033 AZ",
        "CountryID": 159,
        "Latitude": 51.94549,
        "Longitude": 5.52633,
        "RelatedURL": "http://www.ev-box.nl",
        "DistanceUnit": 0
    },
    "Connections": [
        {
            "ID": 38238,
            "ConnectionTypeID": 25,
            "LevelID": 2,
            "PowerKW": 5,
            "CurrentTypeID": 10
        },
        {
            "ID": 47473,
            "ConnectionTypeID": 25,
            "LevelID": 2,
            "PowerKW": 5,
            "CurrentTypeID": 10
        }
    ],
    "NumberOfPoints": 1,
    "StatusTypeID": 50,
    "DateLastStatusUpdate": "2016-06-04T02:43:00Z",
    "DataQualityLevel": 3,
    "DateCreated": "2015-01-09T06:04:00Z",
    "SubmissionStatusTypeID": 100
}