{
    "IsRecentlyVerified": false,
    "ID": 18109,
    "UUID": "7FF486DD-3764-46D1-B011-DEB9FE745F28",
    "DataProviderID": 22,
    "DataProvidersReference": "F715A9E9CD2D204E923097A90821D98F",
    "AddressInfo": {
        "ID": 18454,
        "Title": "道の駅　フレッシュあさご（朝来SA内）",
        "AddressLine1": "兵庫県朝来市岩津９６",
        "CountryID": 114,
        "Latitude": 35.2126699,
        "Longitude": 134.7945519,
        "ContactTelephone1": "079-670-4120",
        "DistanceUnit": 0
    },
    "Connections": [
        {
            "ID": 18350,
            "ConnectionTypeID": 2,
            "LevelID": 2,
            "Amps": 100,
            "Voltage": 480,
            "PowerKW": 48,
            "Quantity": 1
        }
    ],
    "DateLastStatusUpdate": "2013-06-29T09:07:00Z",
    "DataQualityLevel": 2,
    "DateCreated": "2013-06-29T09:07:00Z",
    "SubmissionStatusTypeID": 200
}