{
    "IsRecentlyVerified": false,
    "ID": 177721,
    "UUID": "E3E42EF3-2661-4B5E-8390-9B5EB5298106",
    "DataProviderID": 29,
    "DataProvidersReference": "13257",
    "OperatorID": 45,
    "AddressInfo": {
        "ID": 178080,
        "Title": "Unterer Talweg 111",
        "AddressLine1": "Unterer Talweg 111",
        "Town": "Augsburg",
        "Postcode": "86179",
        "CountryID": 87,
        "Latitude": 48.314465,
        "Longitude": 10.890441,
        "DistanceUnit": 0
    },
    "Connections": [
        {
            "ID": 277200,
            "ConnectionTypeID": 25,
            "StatusTypeID": 50,
            "LevelID": 2,
            "PowerKW": 22,
            "CurrentTypeID": 20
        },
        {
            "ID": 277201,
            "ConnectionTypeID": 25,
            "StatusTypeID": 50,
            "LevelID": 2,
            "PowerKW": 22,
            "CurrentTypeID": 20
        }
    ],
    "StatusTypeID": 0,
    "DateLastStatusUpdate": "2021-07-09T03:12:00Z",
    "MetadataValues": [
        {
            "ID": 10015,
            "MetadataFieldID": 4,
            "ItemValue": "Data from the German chargepoint registry provided by Bundesnetzagentur.de under the CC-BY 4.0 license"
        }
    ],
    "DataQualityLevel": 3,
    "DateCreated": "2021-07-08T09:49:00Z",
    "SubmissionStatusTypeID": 100
}