{
    "IsRecentlyVerified": false,
    "ID": 13571,
    "UUID": "C7630810-25A5-4F6A-9FD2-6F9223BE5881",
    "DataProviderID": 1,
    "OperatorID": 1,
    "UsageTypeID": 1,
    "UsageCost": "Not Free",
    "AddressInfo": {
        "ID": 13468,
        "Title": "Energy and Technology Museum",
        "AddressLine1": "Rinktinės g. 2",
        "AddressLine2": "",
        "Town": "Vilnius ",
        "StateOrProvince": "",
        "Postcode": "09312 ",
        "CountryID": 131,
        "Latitude": 54.690131,
        "Longitude": 25.288011,
        "ContactTelephone1": "",
        "ContactTelephone2": "",
        "ContactEmail": "",
        "AccessComments": "",
        "RelatedURL": "http://translate.google.com/translate?sl=lt&tl=en&js=n&prev=_t&hl=en&ie=UTF-8&layout=2&eotf=1&u=http%3A%2F%2Fe-motion.lt%2F2011%2F06%2F03%2Fispudziai-is-alt-2011-litexpo%2F&act=url",
        "DistanceUnit": 0
    },
    "Connections": [
        {
            "ID": 11028,
            "ConnectionTypeID": 25,
            "StatusTypeID": 10,
            "LevelID": 2,
            "Amps": 32,
            "Voltage": 220,
            "PowerKW": 7,
            "Quantity": 1
        },
        {
            "ID": 11029,
            "ConnectionTypeID": 23,
            "StatusTypeID": 0,
            "LevelID": 2,
            "Amps": 16,
            "Voltage": 220,
            "PowerKW": 3.5,
            "Quantity": 1
        }
    ],
    "NumberOfPoints": 1,
    "GeneralComments": "",
    "StatusTypeID": 50,
    "DateLastStatusUpdate": "2012-11-12T21:11:00Z",
    "DataQualityLevel": 1,
    "DateCreated": "2012-11-10T11:18:00Z",
    "SubmissionStatusTypeID": 200
}