{
    "IsRecentlyVerified": false,
    "ID": 155666,
    "UUID": "3DC3025A-8A87-490A-9B97-472C02288DB8",
    "DataProviderID": 1,
    "OperatorID": 3389,
    "UsageTypeID": 1,
    "UsageCost": "$1.00/session+$0.21/minute",
    "AddressInfo": {
        "ID": 156020,
        "Title": "Crest Foods - Francis Energy",
        "AddressLine1": "7212 E Reno Ave",
        "Town": "Oklahoma City",
        "StateOrProvince": "OK",
        "Postcode": "73110",
        "CountryID": 2,
        "Latitude": 35.463967644728,
        "Longitude": -97.40268896135632,
        "AccessComments": "Use EVGateway App to manage charging ",
        "RelatedURL": "https://francis.energy/",
        "DistanceUnit": 0
    },
    "Connections": [
        {
            "ID": 219190,
            "ConnectionTypeID": 32,
            "StatusTypeID": 50,
            "LevelID": 3,
            "PowerKW": 50,
            "CurrentTypeID": 30,
            "Quantity": 2,
            "Comments": "BTCPower 50kW"
        },
        {
            "ID": 219191,
            "ConnectionTypeID": 2,
            "StatusTypeID": 50,
            "LevelID": 3,
            "PowerKW": 50,
            "CurrentTypeID": 30,
            "Quantity": 2,
            "Comments": "BTCPower 50kW"
        }
    ],
    "NumberOfPoints": 2,
    "GeneralComments": "50kW DC Fast Chargers Provided by Francis Energy",
    "StatusTypeID": 50,
    "DateLastStatusUpdate": "2020-04-21T17:45:00Z",
    "DataQualityLevel": 1,
    "DateCreated": "2020-04-21T03:21:00Z",
    "SubmissionStatusTypeID": 200
}