{
    "IsRecentlyVerified": false,
    "ID": 115210,
    "UUID": "8625F4E4-E30C-4557-B89C-A49E261ECD9D",
    "DataProviderID": 1,
    "OperatorID": 80,
    "UsageTypeID": 4,
    "AddressInfo": {
        "ID": 115556,
        "Title": "Comer Sud S.p.A. Aragona | EnelX",
        "AddressLine1": "Via S. Benedetto, 15",
        "AddressLine2": "Zona Industriale Aragona",
        "Town": "Aragona",
        "StateOrProvince": "AG",
        "Postcode": "92100 ",
        "CountryID": 112,
        "Latitude": 37.354030091967466,
        "Longitude": 13.619741895351495,
        "RelatedURL": "https://www.enelx.com/it/it/emobility",
        "DistanceUnit": 0
    },
    "Connections": [
        {
            "ID": 162184,
            "ConnectionTypeID": 25,
            "StatusTypeID": 50,
            "LevelID": 2,
            "Amps": 32,
            "Voltage": 400,
            "PowerKW": 22,
            "CurrentTypeID": 20,
            "Quantity": 2
        }
    ],
    "NumberOfPoints": 2,
    "GeneralComments": "Lun-Ven 8-13/15-19 Sab 8-13 Dom Chiuso",
    "StatusTypeID": 50,
    "DateLastStatusUpdate": "2019-02-08T13:21:00Z",
    "DataQualityLevel": 1,
    "DateCreated": "2019-02-08T13:21:00Z",
    "SubmissionStatusTypeID": 200
}