{
    "IsRecentlyVerified": false,
    "ID": 116022,
    "UUID": "AB633307-C725-405E-81BF-324C993A5911",
    "DataProviderID": 2,
    "DataProvidersReference": "105070",
    "OperatorID": 5,
    "UsageTypeID": 1,
    "AddressInfo": {
        "ID": 116368,
        "Title": "OPG",
        "AddressLine1": "7400 Niagara Pkwy",
        "Town": "Niagara Falls",
        "StateOrProvince": "ON",
        "Postcode": "L2G 1R6",
        "CountryID": 44,
        "Latitude": 43.0696807,
        "Longitude": -79.059351,
        "ContactTelephone1": "888-758-4389",
        "AccessComments": "24 hours daily",
        "RelatedURL": "http://www.chargepoint.com/",
        "DistanceUnit": 0
    },
    "Connections": [
        {
            "ID": 163080,
            "ConnectionTypeID": 1,
            "LevelID": 2,
            "Amps": 16,
            "Voltage": 230,
            "PowerKW": 3,
            "CurrentTypeID": 10,
            "Quantity": 2
        }
    ],
    "DateLastStatusUpdate": "2019-04-06T05:06:00Z",
    "DataQualityLevel": 3,
    "DateCreated": "2019-02-11T07:13:00Z",
    "SubmissionStatusTypeID": 100
}