{
    "IsRecentlyVerified": false,
    "ID": 97955,
    "UUID": "3D75BF15-FD3C-4BD4-86DB-7B557ECEB227",
    "DataProviderID": 1,
    "OperatorID": 23,
    "OperatorsReference": "39810",
    "UsageTypeID": 4,
    "AddressInfo": {
        "ID": 98301,
        "Title": "Greenline Hotel Im Schuetzenhof",
        "AddressLine1": "Schuetzenhofstrasse 47",
        "Town": "Jever",
        "Postcode": "26441",
        "CountryID": 87,
        "Latitude": 53.56384,
        "Longitude": 7.885819,
        "ContactTelephone1": "+49 044619370",
        "DistanceUnit": 0
    },
    "Connections": [
        {
            "ID": 138863,
            "ConnectionTypeID": 30,
            "StatusTypeID": 50,
            "LevelID": 2,
            "Amps": 32,
            "Voltage": 400,
            "PowerKW": 22,
            "CurrentTypeID": 20,
            "Quantity": 1
        }
    ],
    "NumberOfPoints": 1,
    "GeneralComments": "1 Tesla Connector, up to 22kW.Available for customers. Self park.",
    "StatusTypeID": 50,
    "DateLastStatusUpdate": "2018-10-03T20:04:00Z",
    "DataQualityLevel": 1,
    "DateCreated": "2018-01-21T17:23:00Z",
    "SubmissionStatusTypeID": 200
}