{
    "IsRecentlyVerified": false,
    "ID": 144700,
    "UUID": "8C0473ED-9573-4F9C-9CCE-9CF02232060C",
    "DataProviderID": 2,
    "DataProvidersReference": "130775",
    "OperatorID": 90,
    "UsageTypeID": 1,
    "AddressInfo": {
        "ID": 145052,
        "Title": "Centre culturel St-Benoit",
        "AddressLine1": "9175 Rue Dumouchel",
        "Town": "Mirabel",
        "StateOrProvince": "QC",
        "Postcode": "J7N 2S2",
        "CountryID": 44,
        "Latitude": 45.5666744,
        "Longitude": -74.0968151,
        "ContactTelephone1": "877-505-2674",
        "AccessComments": "24 hours daily",
        "RelatedURL": "https://lecircuitelectrique.com/",
        "DistanceUnit": 0
    },
    "Connections": [
        {
            "ID": 201215,
            "ConnectionTypeID": 1,
            "LevelID": 2,
            "Amps": 16,
            "Voltage": 230,
            "PowerKW": 3.7,
            "CurrentTypeID": 10,
            "Quantity": 1
        }
    ],
    "StatusTypeID": 50,
    "DateLastStatusUpdate": "2020-06-26T03:09:00Z",
    "DataQualityLevel": 3,
    "DateCreated": "2019-12-24T09:23:00Z",
    "SubmissionStatusTypeID": 100
}