{
    "IsRecentlyVerified": false,
    "ID": 167134,
    "UUID": "2D99429F-6632-4A3D-A3AE-7A72BD3A08BE",
    "DataProviderID": 7,
    "DataProvidersReference": "LSB-01080",
    "OperatorID": 21,
    "UsageTypeID": 4,
    "UsageCost": "Mobi.E compatible card",
    "AddressInfo": {
        "ID": 167493,
        "Title": "LSB-00106 - Parque SABA Alto do Parque",
        "AddressLine1": "Rua Marquês de Fronteira",
        "Town": "Lisboa",
        "StateOrProvince": "Lisboa",
        "Postcode": "1070-296",
        "CountryID": 180,
        "Latitude": 38.730469284629265,
        "Longitude": -9.15686000291089,
        "AccessComments": "Underground parking",
        "DistanceUnit": 0
    },
    "Connections": [
        {
            "ID": 253100,
            "ConnectionTypeID": 25,
            "StatusTypeID": 50,
            "LevelID": 2,
            "Amps": 32,
            "Voltage": 400,
            "PowerKW": 22,
            "CurrentTypeID": 20,
            "Quantity": 2
        }
    ],
    "NumberOfPoints": 2,
    "GeneralComments": "Paid parking",
    "StatusTypeID": 50,
    "DateLastStatusUpdate": "2020-11-23T14:53:00Z",
    "DataQualityLevel": 3,
    "DateCreated": "2020-08-27T11:56:00Z",
    "SubmissionStatusTypeID": 100
}