{
    "UserComments": [
        {
            "ID": 17707,
            "ChargePointID": 64825,
            "CommentTypeID": 10,
            "UserName": "Simon Hewison",
            "Comment": "Still free.",
            "Rating": 5,
            "DateCreated": "2017-09-15T08:28:00.647Z",
            "User": {
                "ID": 4575,
                "Username": "Simon Hewison"
            },
            "CheckinStatusTypeID": 10
        },
        {
            "ID": 16079,
            "ChargePointID": 64825,
            "CommentTypeID": 10,
            "UserName": "Simon Hewison",
            "Comment": "Chademo charged successfully. Still free",
            "Rating": 5,
            "DateCreated": "2017-03-21T09:58:58.96Z",
            "User": {
                "ID": 4575,
                "Username": "Simon Hewison"
            },
            "CheckinStatusTypeID": 10
        },
        {
            "ID": 14730,
            "ChargePointID": 64825,
            "CommentTypeID": 10,
            "UserName": "Simon Hewison",
            "Comment": "Very busy ",
            "Rating": 4,
            "DateCreated": "2016-12-23T16:51:06.23Z",
            "User": {
                "ID": 4575,
                "Username": "Simon Hewison"
            },
            "CheckinStatusTypeID": 10
        },
        {
            "ID": 14710,
            "ChargePointID": 64825,
            "CommentTypeID": 50,
            "UserName": "Steve Forster",
            "Comment": "Very clear.  Free till Jan 2017. Really easy to use charger. No additional parking cost - included whilst charging.  Max 1hr or high penalty charge though so keep it short. Penalty if parked and not actively charging. ",
            "Rating": 5,
            "DateCreated": "2016-12-18T11:26:51.997Z",
            "User": {
                "ID": 2030,
                "Username": "Steve Forster"
            },
            "CheckinStatusTypeID": 10
        }
    ],
    "MediaItems": [
        {
            "ID": 8832,
            "ChargePointID": 64825,
            "ItemURL": "https://s3-ap-southeast-2.amazonaws.com/openchargemap/images/GB/OCM64825/OCM-64825.orig.2016121811241783.jpg",
            "ItemThumbnailURL": "https://s3-ap-southeast-2.amazonaws.com/openchargemap/images/GB/OCM64825/OCM-64825.thmb.2016121811241783.jpg",
            "Comment": "",
            "IsEnabled": true,
            "IsVideo": false,
            "IsFeaturedItem": false,
            "IsExternalResource": false,
            "User": {
                "ID": 2030,
                "Username": "Steve Forster"
            },
            "DateCreated": "2016-12-18T11:25:00Z"
        }
    ],
    "IsRecentlyVerified": false,
    "ID": 64825,
    "UUID": "8A97201A-BB04-480D-98A8-6EB2652CB792",
    "DataProviderID": 1,
    "OperatorID": 203,
    "OperatorsReference": "GB106",
    "UsageTypeID": 5,
    "UsageCost": "£4.00",
    "AddressInfo": {
        "ID": 65171,
        "Title": "Church Road Car Park (Engenie)",
        "AddressLine1": "Church Road",
        "Town": "Fleet",
        "StateOrProvince": "Hampshire",
        "Postcode": "GU51 3BN",
        "CountryID": 1,
        "Latitude": 51.2830973261972,
        "Longitude": -0.842461647082482,
        "RelatedURL": "http://www.hart.gov.uk/the-council/news/new-vehicle-charging-points-arrive-hart",
        "DistanceUnit": 0
    },
    "Connections": [
        {
            "ID": 83346,
            "ConnectionTypeID": 2,
            "StatusTypeID": 50,
            "LevelID": 3,
            "Amps": 125,
            "Voltage": 400,
            "PowerKW": 50,
            "CurrentTypeID": 30,
            "Quantity": 1
        },
        {
            "ID": 83347,
            "ConnectionTypeID": 1036,
            "StatusTypeID": 50,
            "LevelID": 3,
            "Amps": 63,
            "Voltage": 400,
            "PowerKW": 43,
            "CurrentTypeID": 20,
            "Quantity": 1
        },
        {
            "ID": 83348,
            "ConnectionTypeID": 33,
            "StatusTypeID": 50,
            "LevelID": 3,
            "Amps": 125,
            "Voltage": 400,
            "PowerKW": 50,
            "CurrentTypeID": 30,
            "Quantity": 1
        }
    ],
    "NumberOfPoints": 1,
    "GeneralComments": "Tariff due to change by May 2018",
    "StatusTypeID": 50,
    "DateLastStatusUpdate": "2020-09-30T09:46:00Z",
    "DataQualityLevel": 1,
    "DateCreated": "2016-03-23T22:35:00Z",
    "SubmissionStatusTypeID": 200
}