{
    "IsRecentlyVerified": false,
    "ID": 124952,
    "UUID": "A709C794-5F9A-45B6-AED5-43EFF301B9DF",
    "DataProviderID": 1,
    "OperatorID": 80,
    "UsageTypeID": 4,
    "AddressInfo": {
        "ID": 125298,
        "Title": "Genova Caprera | EnelX",
        "AddressLine1": "Via Caprera",
        "Town": "Genova",
        "StateOrProvince": "GE",
        "Postcode": "16146",
        "CountryID": 112,
        "Latitude": 44.3954254949126,
        "Longitude": 8.97478723814982,
        "RelatedURL": "https://www.enelx.com/it/it/emobility",
        "DistanceUnit": 0
    },
    "Connections": [
        {
            "ID": 175136,
            "ConnectionTypeID": 25,
            "StatusTypeID": 50,
            "LevelID": 2,
            "Amps": 32,
            "Voltage": 400,
            "PowerKW": 22,
            "CurrentTypeID": 20,
            "Quantity": 2
        }
    ],
    "NumberOfPoints": 2,
    "StatusTypeID": 50,
    "DateLastStatusUpdate": "2019-04-06T17:04:00Z",
    "DataQualityLevel": 1,
    "DateCreated": "2019-04-06T17:04:00Z",
    "SubmissionStatusTypeID": 200
}