{
    "IsRecentlyVerified": false,
    "ID": 152384,
    "UUID": "2F66DDF5-5673-47C4-A4CD-84BBF231C99F",
    "DataProviderID": 28,
    "DataProvidersReference": "FR*S85*P85224*001",
    "UsageTypeID": 5,
    "AddressInfo": {
        "ID": 152737,
        "Title": "SAINT HILAIRE DE LOULAY - Rue L Abee Rene Giraudet",
        "AddressLine1": "Rue L Abee Rene Giraudet 85600 SAINT HILAIRE DE LOULAY",
        "CountryID": 80,
        "Latitude": 47.00351,
        "Longitude": -1.33125,
        "AccessComments": "24h/24 7j/7",
        "DistanceUnit": 0
    },
    "Connections": [
        {
            "ID": 213314,
            "ConnectionTypeID": 28,
            "StatusTypeID": 50,
            "LevelID": 2,
            "PowerKW": 18,
            "CurrentTypeID": 10
        },
        {
            "ID": 213315,
            "ConnectionTypeID": 25,
            "StatusTypeID": 50,
            "LevelID": 2,
            "PowerKW": 18,
            "CurrentTypeID": 20
        },
        {
            "ID": 246197,
            "ConnectionTypeID": 28,
            "StatusTypeID": 50,
            "LevelID": 2,
            "PowerKW": 18,
            "CurrentTypeID": 10
        },
        {
            "ID": 246198,
            "ConnectionTypeID": 25,
            "StatusTypeID": 50,
            "LevelID": 2,
            "PowerKW": 18,
            "CurrentTypeID": 20
        }
    ],
    "GeneralComments": "Recharge par badge et avec une application smartphone",
    "StatusTypeID": 50,
    "DateLastStatusUpdate": "2020-08-27T05:13:00Z",
    "DataQualityLevel": 2,
    "DateCreated": "2020-03-15T10:53:00Z",
    "SubmissionStatusTypeID": 100
}