{
    "IsRecentlyVerified": false,
    "ID": 20075,
    "UUID": "41B31299-FDB1-47AF-90D1-5827161F513C",
    "DataProviderID": 1,
    "OperatorID": 1,
    "UsageTypeID": 0,
    "UsageCost": "",
    "AddressInfo": {
        "ID": 20420,
        "Title": "Nissan - Dreux",
        "AddressLine1": "1, rue René Miet - Zone Commerciale Nord",
        "AddressLine2": "",
        "Town": "Dreux",
        "StateOrProvince": "",
        "Postcode": "28100",
        "CountryID": 80,
        "Latitude": 48.74609,
        "Longitude": 1.34312,
        "ContactTelephone1": "+33 2 37 64 85 60",
        "ContactTelephone2": "",
        "ContactEmail": "",
        "AccessComments": "Ouvert à tous",
        "RelatedURL": "",
        "DistanceUnit": 0
    },
    "Connections": [],
    "GeneralComments": "",
    "StatusTypeID": 50,
    "DateLastStatusUpdate": "2013-11-01T11:27:00Z",
    "DataQualityLevel": 1,
    "DateCreated": "2013-10-28T13:27:00Z",
    "SubmissionStatusTypeID": 200
}