{
    "IsRecentlyVerified": false,
    "ID": 137401,
    "UUID": "9B6E9B62-9823-4D2D-BF23-137A7A990AF8",
    "DataProviderID": 2,
    "DataProvidersReference": "88157",
    "OperatorID": 5,
    "UsageTypeID": 1,
    "AddressInfo": {
        "ID": 137747,
        "Title": "WINTER PARK",
        "AddressLine1": "401 S Park Ave",
        "Town": "Winter Park",
        "StateOrProvince": "FL",
        "Postcode": "32789",
        "CountryID": 2,
        "Latitude": 28.5945595,
        "Longitude": -81.3520818,
        "ContactTelephone1": "888-758-4389",
        "AccessComments": "24 hours daily",
        "RelatedURL": "http://www.chargepoint.com/",
        "DistanceUnit": 0
    },
    "Connections": [
        {
            "ID": 192305,
            "ConnectionTypeID": 1,
            "LevelID": 2,
            "Amps": 16,
            "Voltage": 230,
            "PowerKW": 3,
            "CurrentTypeID": 10,
            "Quantity": 2
        }
    ],
    "StatusTypeID": 50,
    "DateLastStatusUpdate": "2019-12-24T09:05:00Z",
    "DataQualityLevel": 3,
    "DateCreated": "2019-12-24T09:05:00Z",
    "SubmissionStatusTypeID": 100
}