{
    "IsRecentlyVerified": false,
    "ID": 34635,
    "UUID": "4F66228B-3874-48D9-BBF6-1571C1654847",
    "DataProviderID": 26,
    "DataProvidersReference": "48531",
    "OperatorID": 178,
    "OperatorsReference": "EVnetNL REE093",
    "UsageCost": "0.00 jaarabonnement",
    "AddressInfo": {
        "ID": 34981,
        "Title": "Marconistraat 19",
        "AddressLine1": "Marconistraat 19",
        "Town": "Zevenaar",
        "Postcode": "6902 PC",
        "CountryID": 159,
        "Latitude": 51.932597,
        "Longitude": 6.093107,
        "ContactTelephone1": "0800-3522365",
        "RelatedURL": "http://www.evnet.nl",
        "DistanceUnit": 0
    },
    "Connections": [
        {
            "ID": 38146,
            "ConnectionTypeID": 25,
            "LevelID": 1,
            "PowerKW": 2.3,
            "CurrentTypeID": 10
        }
    ],
    "NumberOfPoints": 2,
    "StatusTypeID": 50,
    "DateLastStatusUpdate": "2016-06-04T02:42:00Z",
    "DataQualityLevel": 3,
    "DateCreated": "2015-01-09T06:04:00Z",
    "SubmissionStatusTypeID": 100
}