{
    "IsRecentlyVerified": false,
    "ID": 171486,
    "UUID": "9C488DA4-FEB5-48EE-89E6-5115C813149C",
    "DataProviderID": 1,
    "OperatorID": 3404,
    "UsageTypeID": 1,
    "AddressInfo": {
        "ID": 171845,
        "Title": "estacion eusse",
        "AddressLine1": "servicios eusse",
        "Town": "Jiménez",
        "StateOrProvince": "Limón",
        "Postcode": "70201",
        "CountryID": 58,
        "Latitude": 10.204036180529727,
        "Longitude": -83.77427334543233,
        "DistanceUnit": 0
    },
    "Connections": [
        {
            "ID": 262187,
            "ConnectionTypeID": 2,
            "StatusTypeID": 50,
            "LevelID": 3,
            "Amps": 50,
            "Voltage": 480,
            "PowerKW": 50,
            "CurrentTypeID": 30,
            "Quantity": 1
        },
        {
            "ID": 262188,
            "ConnectionTypeID": 32,
            "StatusTypeID": 50,
            "LevelID": 3,
            "Amps": 50,
            "Voltage": 480,
            "PowerKW": 50,
            "CurrentTypeID": 30,
            "Quantity": 1
        },
        {
            "ID": 262189,
            "ConnectionTypeID": 1040,
            "StatusTypeID": 50,
            "LevelID": 3,
            "Amps": 50,
            "Voltage": 480,
            "PowerKW": 50,
            "CurrentTypeID": 30,
            "Quantity": 1
        }
    ],
    "NumberOfPoints": 2,
    "StatusTypeID": 50,
    "DateLastStatusUpdate": "2021-05-06T22:52:00Z",
    "DataQualityLevel": 1,
    "DateCreated": "2021-01-03T01:35:00Z",
    "SubmissionStatusTypeID": 200
}