{
    "IsRecentlyVerified": false,
    "ID": 110201,
    "UUID": "2BF8AC4B-15C8-4BC0-9556-F56FBE0A0ACB",
    "DataProviderID": 2,
    "DataProvidersReference": "99249",
    "OperatorID": 59,
    "UsageTypeID": 1,
    "AddressInfo": {
        "ID": 110547,
        "Title": "Greenlots - 122296",
        "AddressLine1": "21501 Schoenborn St",
        "Town": "Canoga Park",
        "StateOrProvince": "CA",
        "Postcode": "91304",
        "CountryID": 2,
        "Latitude": 34.22112,
        "Longitude": -118.599544,
        "ContactTelephone1": "855-900-7584",
        "AccessComments": "24 hours daily",
        "RelatedURL": "http://greenlots.com/",
        "DistanceUnit": 0
    },
    "Connections": [
        {
            "ID": 155437,
            "ConnectionTypeID": 1,
            "LevelID": 2,
            "Amps": 16,
            "Voltage": 230,
            "PowerKW": 3,
            "CurrentTypeID": 10,
            "Quantity": 2
        }
    ],
    "DateLastStatusUpdate": "2019-04-06T04:02:00Z",
    "DataQualityLevel": 3,
    "DateCreated": "2018-10-18T23:35:00Z",
    "SubmissionStatusTypeID": 100
}