{
    "IsRecentlyVerified": false,
    "ID": 35556,
    "UUID": "4CFEDEB0-E70F-436D-B223-20C3C96F1432",
    "DataProviderID": 26,
    "DataProvidersReference": "48500",
    "OperatorID": 178,
    "OperatorsReference": "EVnetNL REE058",
    "UsageCost": "0.00 jaarabonnement",
    "AddressInfo": {
        "ID": 35902,
        "Title": "Nieuwe Zandweg",
        "AddressLine1": "Nieuwe Zandweg",
        "Town": "Montfoort",
        "Postcode": "3461 AG",
        "CountryID": 159,
        "Latitude": 52.060517,
        "Longitude": 4.917331,
        "ContactTelephone1": "0800-3522365",
        "RelatedURL": "http://www.evnet.nl",
        "DistanceUnit": 0
    },
    "Connections": [
        {
            "ID": 39067,
            "ConnectionTypeID": 25,
            "LevelID": 2,
            "PowerKW": 11,
            "CurrentTypeID": 10
        }
    ],
    "NumberOfPoints": 2,
    "StatusTypeID": 50,
    "DateLastStatusUpdate": "2016-06-04T02:45:00Z",
    "DataQualityLevel": 3,
    "DateCreated": "2015-01-09T06:05:00Z",
    "SubmissionStatusTypeID": 100
}