{
    "UserComments": [
        {
            "ID": 21627,
            "ChargePointID": 132718,
            "CommentTypeID": 10,
            "UserName": "et42",
            "Comment": "Charged successfully with CCS in August.",
            "Rating": 5,
            "DateCreated": "2019-10-06T21:30:35.1Z",
            "User": {
                "ID": 21695,
                "Username": "et42"
            },
            "CheckinStatusTypeID": 10
        }
    ],
    "MediaItems": [
        {
            "ID": 19886,
            "ChargePointID": 132718,
            "ItemURL": "https://s3-ap-southeast-2.amazonaws.com/openchargemap/images/DE/OCM132718/OCM-132718.orig.2019100621285937.jpeg",
            "ItemThumbnailURL": "https://s3-ap-southeast-2.amazonaws.com/openchargemap/images/DE/OCM132718/OCM-132718.thmb.2019100621285937.jpeg",
            "Comment": "",
            "IsEnabled": true,
            "IsVideo": false,
            "IsFeaturedItem": false,
            "IsExternalResource": false,
            "User": {
                "ID": 21695,
                "Username": "et42"
            },
            "DateCreated": "2019-10-06T21:29:00Z"
        }
    ],
    "IsRecentlyVerified": false,
    "ID": 132718,
    "UUID": "3E08A3F6-5262-4A12-917C-A38175226E4B",
    "DataProviderID": 1,
    "OperatorID": 103,
    "UsageTypeID": 4,
    "AddressInfo": {
        "ID": 133064,
        "Title": "HEM Tankstelle",
        "AddressLine1": "Akazienstraße 1",
        "Town": "Dorf Mecklenburg",
        "Postcode": "23972",
        "CountryID": 87,
        "Latitude": 53.8522842889596,
        "Longitude": 11.4569459674947,
        "RelatedURL": "https://www.allego.eu",
        "DistanceUnit": 0
    },
    "Connections": [
        {
            "ID": 185820,
            "ConnectionTypeID": 33,
            "StatusTypeID": 50,
            "LevelID": 3,
            "PowerKW": 50,
            "CurrentTypeID": 30,
            "Quantity": 1
        },
        {
            "ID": 185821,
            "ConnectionTypeID": 2,
            "StatusTypeID": 50,
            "LevelID": 3,
            "PowerKW": 50,
            "CurrentTypeID": 30,
            "Quantity": 1
        },
        {
            "ID": 185822,
            "ConnectionTypeID": 1036,
            "StatusTypeID": 50,
            "LevelID": 3,
            "PowerKW": 43,
            "CurrentTypeID": 20,
            "Quantity": 1
        }
    ],
    "NumberOfPoints": 1,
    "StatusTypeID": 50,
    "DateLastStatusUpdate": "2019-10-07T07:37:00Z",
    "DataQualityLevel": 1,
    "DateCreated": "2019-10-06T21:27:00Z",
    "SubmissionStatusTypeID": 200
}