{
    "IsRecentlyVerified": false,
    "ID": 112675,
    "UUID": "23B3E560-9C58-465D-8B3E-01D2C4418E82",
    "DataProviderID": 1,
    "OperatorID": 3319,
    "UsageTypeID": 5,
    "UsageCost": "0.15€/min",
    "AddressInfo": {
        "ID": 113021,
        "Title": "e-mobi - Vītrupes stāvlaukums",
        "AddressLine1": "Vītrupes stāvlaukums",
        "Town": "Vītrupe",
        "Postcode": "LV-4050",
        "CountryID": 125,
        "Latitude": 57.622075271844466,
        "Longitude": 24.386487377557955,
        "ContactTelephone1": "+371 22001859",
        "RelatedURL": "https://portal.e-mobi.lv",
        "DistanceUnit": 0
    },
    "Connections": [
        {
            "ID": 158614,
            "ConnectionTypeID": 2,
            "StatusTypeID": 50,
            "LevelID": 3,
            "PowerKW": 50,
            "CurrentTypeID": 30,
            "Quantity": 1
        },
        {
            "ID": 158615,
            "ConnectionTypeID": 33,
            "StatusTypeID": 50,
            "LevelID": 3,
            "PowerKW": 50,
            "CurrentTypeID": 30,
            "Quantity": 1
        },
        {
            "ID": 158616,
            "ConnectionTypeID": 25,
            "StatusTypeID": 50,
            "LevelID": 3,
            "PowerKW": 43,
            "CurrentTypeID": 20
        }
    ],
    "NumberOfPoints": 2,
    "StatusTypeID": 50,
    "DateLastStatusUpdate": "2018-11-10T09:16:00Z",
    "DataQualityLevel": 1,
    "DateCreated": "2018-11-09T21:36:00Z",
    "SubmissionStatusTypeID": 200
}