{
    "IsRecentlyVerified": false,
    "ID": 137785,
    "UUID": "42AE33D6-07B9-408B-8E12-25C488920056",
    "DataProviderID": 2,
    "DataProvidersReference": "143472",
    "OperatorID": 5,
    "UsageTypeID": 1,
    "AddressInfo": {
        "ID": 138134,
        "Title": "AMERICANAIRLINE",
        "AddressLine1": "100 Skyview Drive",
        "Town": "Fort Worth",
        "StateOrProvince": "TX",
        "Postcode": "76155",
        "CountryID": 2,
        "Latitude": 32.8239268,
        "Longitude": -97.0668036,
        "ContactTelephone1": "888-758-4389",
        "AccessComments": "24 hours daily",
        "RelatedURL": "http://www.chargepoint.com/",
        "DistanceUnit": 0
    },
    "Connections": [
        {
            "ID": 192780,
            "ConnectionTypeID": 1,
            "LevelID": 2,
            "Amps": 16,
            "Voltage": 230,
            "PowerKW": 3,
            "CurrentTypeID": 10,
            "Quantity": 12
        }
    ],
    "StatusTypeID": 50,
    "DateLastStatusUpdate": "2019-12-24T09:06:00Z",
    "DataQualityLevel": 3,
    "DateCreated": "2019-12-24T09:06:00Z",
    "SubmissionStatusTypeID": 100
}