{
    "IsRecentlyVerified": false,
    "ID": 122469,
    "UUID": "1EF9C4AD-3CE5-449F-994B-39E412B4EB99",
    "DataProviderID": 2,
    "DataProvidersReference": "65915",
    "OperatorID": 107,
    "UsageTypeID": 1,
    "AddressInfo": {
        "ID": 122815,
        "Title": "PR 790 East Colorado",
        "AddressLine1": "790 E Colorado Blvd",
        "Town": "Pasadena",
        "StateOrProvince": "CA",
        "Postcode": "91101",
        "CountryID": 2,
        "Latitude": 34.145799,
        "Longitude": -118.134166,
        "ContactTelephone1": "855-885-9571",
        "AccessComments": "24 hours daily",
        "RelatedURL": "http://www.opconnect.com/",
        "DistanceUnit": 0
    },
    "Connections": [
        {
            "ID": 172362,
            "ConnectionTypeID": 1,
            "LevelID": 2,
            "Amps": 16,
            "Voltage": 230,
            "PowerKW": 3.7,
            "CurrentTypeID": 10,
            "Quantity": 1
        }
    ],
    "DateLastStatusUpdate": "2020-06-26T02:57:00Z",
    "DataQualityLevel": 3,
    "DateCreated": "2019-04-06T05:03:00Z",
    "SubmissionStatusTypeID": 100
}