{
    "IsRecentlyVerified": false,
    "ID": 29631,
    "UUID": "5A921446-FEF0-4D49-98E3-6E57123441BC",
    "DataProviderID": 15,
    "DataProvidersReference": "737",
    "OperatorID": 43,
    "UsageTypeID": 1,
    "AddressInfo": {
        "ID": 29977,
        "Title": "2244 Walnut Grove Ave",
        "AddressLine1": "2244 Walnut Grove Ave",
        "Town": "Rosemead",
        "StateOrProvince": "California",
        "Postcode": "91770",
        "CountryID": 2,
        "Latitude": 34.052948,
        "Longitude": -118.079422,
        "ContactTelephone1": "800-438-4636 ",
        "RelatedURL": "http://carstations.com/737",
        "DistanceUnit": 0
    },
    "Connections": [
        {
            "ID": 32616,
            "ConnectionTypeID": 0,
            "Reference": "SPI"
        }
    ],
    "NumberOfPoints": 4,
    "StatusTypeID": 50,
    "DateLastStatusUpdate": "2017-11-04T14:04:00Z",
    "DataQualityLevel": 2,
    "DateCreated": "2014-11-29T05:39:00Z",
    "SubmissionStatusTypeID": 100
}