{
    "IsRecentlyVerified": false,
    "ID": 14336,
    "UUID": "4BAC0077-FEF8-4492-851B-6E45FE3B60A7",
    "DataProviderID": 2,
    "DataProvidersReference": "47036",
    "UsageTypeID": 7,
    "AddressInfo": {
        "ID": 14233,
        "Title": "Pinehurst Nissan",
        "AddressLine1": "10910 S US Highway 15-501",
        "Town": "Southern Pines",
        "StateOrProvince": "NC",
        "Postcode": "28387",
        "CountryID": 2,
        "Latitude": 35.161067,
        "Longitude": -79.421191,
        "ContactTelephone1": "910-684-1010",
        "AccessComments": "Dealership business hours\r\nPublic - Call ahead",
        "RelatedURL": "",
        "DistanceUnit": 0
    },
    "Connections": [
        {
            "ID": 16558,
            "ConnectionTypeID": 1,
            "LevelID": 2,
            "Amps": 16,
            "Voltage": 230,
            "PowerKW": 3.7,
            "CurrentTypeID": 10,
            "Quantity": 1
        },
        {
            "ID": 21675,
            "ConnectionTypeID": 1,
            "LevelID": 2,
            "Quantity": 1
        }
    ],
    "DateLastStatusUpdate": "2020-06-26T02:57:00Z",
    "DataQualityLevel": 3,
    "DateCreated": "2012-12-06T16:49:00Z",
    "SubmissionStatusTypeID": 100
}