{
    "IsRecentlyVerified": false,
    "ID": 87238,
    "UUID": "6FE88A32-9DB2-489B-ABEB-51EF50F9EBA9",
    "DataProviderID": 1,
    "OperatorID": 45,
    "UsageTypeID": 6,
    "AddressInfo": {
        "ID": 87584,
        "Title": " Lokanda Devetak",
        "AddressLine1": "Via Brezici, 22",
        "Town": "San Michele del Carso ",
        "StateOrProvince": "GO",
        "Postcode": "34070 ",
        "CountryID": 112,
        "Latitude": 45.88469267938332,
        "Longitude": 13.560307153683073,
        "ContactTelephone1": "+39 0481 882756",
        "RelatedURL": "http://www.devetak.com",
        "DistanceUnit": 0
    },
    "Connections": [
        {
            "ID": 123659,
            "ConnectionTypeID": 25,
            "StatusTypeID": 50,
            "LevelID": 2,
            "Quantity": 1
        }
    ],
    "NumberOfPoints": 1,
    "GeneralComments": "http://www.devetak.com/2017/04/19/novita-colonnina-elettrica/",
    "StatusTypeID": 50,
    "DateLastStatusUpdate": "2017-05-02T09:27:00Z",
    "DataQualityLevel": 1,
    "DateCreated": "2017-05-02T09:27:00Z",
    "SubmissionStatusTypeID": 200
}