{
    "UserComments": [
        {
            "ID": 21532,
            "ChargePointID": 129722,
            "CommentTypeID": 10,
            "UserName": "JanG",
            "Comment": "Clean",
            "DateCreated": "2019-09-20T07:34:15.71Z",
            "User": {
                "ID": 22426,
                "Username": "JanG"
            },
            "CheckinStatusTypeID": 0
        }
    ],
    "IsRecentlyVerified": false,
    "ID": 129722,
    "UUID": "FE5AB83F-1CD1-4D60-A10A-CB9183A37B37",
    "DataProviderID": 1,
    "OperatorID": 198,
    "UsageTypeID": 1,
    "AddressInfo": {
        "ID": 130068,
        "Title": "Neste Aapiskukko, Pälkäne",
        "AddressLine1": "Valtatie 12",
        "Town": "Pälkäne",
        "Postcode": "36600",
        "CountryID": 79,
        "Latitude": 61.3472146532768,
        "Longitude": 24.2573409480467,
        "ContactTelephone1": "035343075",
        "ContactEmail": "aapiskukko@aapiskukko.fi",
        "RelatedURL": "https://aapiskukko.fi/",
        "DistanceUnit": 0
    },
    "Connections": [
        {
            "ID": 181574,
            "ConnectionTypeID": 33,
            "StatusTypeID": 50,
            "LevelID": 3,
            "Amps": 125,
            "Voltage": 500,
            "PowerKW": 50,
            "CurrentTypeID": 30,
            "Quantity": 1
        },
        {
            "ID": 181575,
            "ConnectionTypeID": 2,
            "StatusTypeID": 50,
            "LevelID": 3,
            "Amps": 125,
            "Voltage": 500,
            "PowerKW": 50,
            "CurrentTypeID": 30,
            "Quantity": 1
        },
        {
            "ID": 181576,
            "ConnectionTypeID": 25,
            "StatusTypeID": 50,
            "LevelID": 2,
            "Amps": 32,
            "Voltage": 400,
            "PowerKW": 22,
            "CurrentTypeID": 20,
            "Quantity": 2
        }
    ],
    "NumberOfPoints": 3,
    "StatusTypeID": 50,
    "DateLastStatusUpdate": "2019-09-20T07:34:00Z",
    "DataQualityLevel": 1,
    "DateCreated": "2019-07-24T14:27:00Z",
    "SubmissionStatusTypeID": 200
}