{
    "IsRecentlyVerified": false,
    "ID": 91396,
    "UUID": "50B48858-522D-4619-8E44-DC3073DBA75A",
    "DataProviderID": 2,
    "DataProvidersReference": "85789",
    "OperatorID": 5,
    "UsageTypeID": 1,
    "AddressInfo": {
        "ID": 91742,
        "Title": "LPEA PARKING",
        "AddressLine1": "1-29 Stewart St",
        "Town": "Durango",
        "StateOrProvince": "CO",
        "Postcode": "81303",
        "CountryID": 2,
        "Latitude": 37.244574,
        "Longitude": -107.8736,
        "ContactTelephone1": "888-758-4389",
        "AccessComments": "24 hours daily",
        "RelatedURL": "http://www.chargepoint.com/",
        "DistanceUnit": 0
    },
    "Connections": [
        {
            "ID": 129551,
            "ConnectionTypeID": 1,
            "LevelID": 2,
            "Amps": 16,
            "Voltage": 230,
            "PowerKW": 3,
            "CurrentTypeID": 10,
            "Quantity": 4
        }
    ],
    "DateLastStatusUpdate": "2019-04-06T04:02:00Z",
    "DataQualityLevel": 3,
    "DateCreated": "2017-08-03T12:25:00Z",
    "SubmissionStatusTypeID": 100
}