{
    "IsRecentlyVerified": false,
    "ID": 92907,
    "UUID": "29F18816-FD14-4F5B-84AC-8ED1835BDB10",
    "DataProviderID": 1,
    "OperatorID": 3293,
    "UsageTypeID": 4,
    "AddressInfo": {
        "ID": 93253,
        "Title": "Holiday Inn Cairo - Citystars",
        "AddressLine1": "Fatma Bint Mubarak",
        "AddressLine2": "Nasr City",
        "Town": "Cairo",
        "StateOrProvince": "Cairo Governorate",
        "Postcode": "11371",
        "CountryID": 70,
        "Latitude": 30.0747146,
        "Longitude": 31.3439731999999,
        "AccessComments": "On level 3",
        "DistanceUnit": 0
    },
    "Connections": [
        {
            "ID": 131618,
            "ConnectionTypeID": 25,
            "StatusTypeID": 50,
            "LevelID": 2,
            "Amps": 32,
            "Voltage": 230,
            "PowerKW": 7,
            "CurrentTypeID": 10,
            "Quantity": 2
        }
    ],
    "NumberOfPoints": 2,
    "StatusTypeID": 50,
    "DateLastStatusUpdate": "2017-09-13T13:56:00Z",
    "DataQualityLevel": 1,
    "DateCreated": "2017-09-13T13:55:00Z",
    "SubmissionStatusTypeID": 200
}