{
    "IsRecentlyVerified": false,
    "ID": 88080,
    "UUID": "BFCD9641-02FD-45A4-88DD-4DB3128EE124",
    "DataProviderID": 1,
    "OperatorID": 1,
    "UsageTypeID": 0,
    "AddressInfo": {
        "ID": 88426,
        "Title": " PENNY Market",
        "AddressLine1": "Via 4 Novembre, 42",
        "Town": "Campobasso",
        "StateOrProvince": "CB",
        "Postcode": "86100",
        "CountryID": 112,
        "Latitude": 41.56660619728485,
        "Longitude": 14.670062670491818,
        "RelatedURL": "http://www.pennymarket.it",
        "DistanceUnit": 0
    },
    "Connections": [
        {
            "ID": 124943,
            "ConnectionTypeID": 25,
            "StatusTypeID": 50,
            "LevelID": 2,
            "Quantity": 1
        },
        {
            "ID": 124944,
            "ConnectionTypeID": 36,
            "StatusTypeID": 50,
            "LevelID": 2,
            "Amps": 16,
            "Voltage": 240,
            "PowerKW": 3.6,
            "CurrentTypeID": 10,
            "Quantity": 1
        }
    ],
    "NumberOfPoints": 2,
    "StatusTypeID": 50,
    "DateLastStatusUpdate": "2017-05-21T09:13:00Z",
    "DataQualityLevel": 1,
    "DateCreated": "2017-05-21T09:13:00Z",
    "SubmissionStatusTypeID": 200
}