{
    "IsRecentlyVerified": false,
    "ID": 109339,
    "UUID": "BB50AD66-DE80-47C4-8D3B-01DC65076746",
    "DataProviderID": 1,
    "OperatorID": 23,
    "OperatorsReference": "45001",
    "UsageTypeID": 6,
    "AddressInfo": {
        "ID": 109685,
        "Title": "Quinta das Soizas",
        "AddressLine1": "Quinta das Soizas",
        "Town": "Alfeizerão",
        "Postcode": "2460-115",
        "CountryID": 180,
        "Latitude": 39.503587,
        "Longitude": -9.104798,
        "ContactTelephone1": "351913129074",
        "AccessComments": "Only for customers",
        "DistanceUnit": 0
    },
    "Connections": [
        {
            "ID": 154457,
            "ConnectionTypeID": 30,
            "StatusTypeID": 50,
            "LevelID": 2,
            "PowerKW": 17,
            "CurrentTypeID": 20,
            "Quantity": 1
        }
    ],
    "NumberOfPoints": 1,
    "GeneralComments": "1 Tesla Connector, up to 17kW.Available for customers. Please call ahead.",
    "StatusTypeID": 50,
    "DateLastStatusUpdate": "2020-08-19T20:08:00Z",
    "DataQualityLevel": 1,
    "DateCreated": "2018-10-11T14:27:00Z",
    "SubmissionStatusTypeID": 200
}