{
    "IsRecentlyVerified": false,
    "ID": 120464,
    "UUID": "1074F7E3-A4A2-4C93-9BF1-19483142B357",
    "DataProviderID": 2,
    "DataProvidersReference": "72535",
    "OperatorID": 39,
    "UsageTypeID": 4,
    "AddressInfo": {
        "ID": 120810,
        "Title": "Kaiser San Diego Medical Center",
        "AddressLine1": "4647 Zion Avenue",
        "Town": "San Diego",
        "StateOrProvince": "CA",
        "Postcode": "92120",
        "CountryID": 2,
        "Latitude": 32.7913395,
        "Longitude": -117.0951878,
        "ContactTelephone1": "800-663-5633",
        "AccessComments": "MO: Not Specified; TU: Not Specified; WE: Not Specified; TH: Not Specified; FR: Not Specified; SA: Not Specified; SU: Not Specified",
        "RelatedURL": "http://www.semacharge.com/",
        "DistanceUnit": 0
    },
    "Connections": [
        {
            "ID": 169814,
            "ConnectionTypeID": 1,
            "LevelID": 2,
            "Amps": 16,
            "Voltage": 230,
            "PowerKW": 3,
            "CurrentTypeID": 10,
            "Quantity": 8
        }
    ],
    "DateLastStatusUpdate": "2019-04-01T04:59:00Z",
    "DataQualityLevel": 3,
    "DateCreated": "2019-04-01T04:59:00Z",
    "SubmissionStatusTypeID": 100
}