{
    "MediaItems": [
        {
            "ID": 27513,
            "ChargePointID": 157364,
            "ItemURL": "https://s3-ap-southeast-2.amazonaws.com/openchargemap/images/GB/OCM157364/OCM-157364.orig.2021050314103047.jpg",
            "ItemThumbnailURL": "https://s3-ap-southeast-2.amazonaws.com/openchargemap/images/GB/OCM157364/OCM-157364.thmb.2021050314103047.jpg",
            "Comment": "Teesside Shopping Park charging stations",
            "IsEnabled": true,
            "IsVideo": false,
            "IsFeaturedItem": false,
            "IsExternalResource": false,
            "User": {
                "ID": 26009,
                "Username": "mcv84"
            },
            "DateCreated": "2021-05-03T14:11:00Z"
        },
        {
            "ID": 27510,
            "ChargePointID": 157364,
            "ItemURL": "https://s3-ap-southeast-2.amazonaws.com/openchargemap/images/GB/OCM157364/OCM-157364.orig.2021050314082759.jpg",
            "ItemThumbnailURL": "https://s3-ap-southeast-2.amazonaws.com/openchargemap/images/GB/OCM157364/OCM-157364.thmb.2021050314082759.jpg",
            "Comment": "Teesside Shopping Park terms and conditions",
            "IsEnabled": true,
            "IsVideo": false,
            "IsFeaturedItem": false,
            "IsExternalResource": false,
            "User": {
                "ID": 26009,
                "Username": "mcv84"
            },
            "DateCreated": "2021-05-03T14:09:00Z"
        },
        {
            "ID": 27511,
            "ChargePointID": 157364,
            "ItemURL": "https://s3-ap-southeast-2.amazonaws.com/openchargemap/images/GB/OCM157364/OCM-157364.orig.2021050314085377.jpg",
            "ItemThumbnailURL": "https://s3-ap-southeast-2.amazonaws.com/openchargemap/images/GB/OCM157364/OCM-157364.thmb.2021050314085377.jpg",
            "Comment": "Teesside Shopping Park 22 kW charging station",
            "IsEnabled": true,
            "IsVideo": false,
            "IsFeaturedItem": false,
            "IsExternalResource": false,
            "User": {
                "ID": 26009,
                "Username": "mcv84"
            },
            "DateCreated": "2021-05-03T14:09:00Z"
        },
        {
            "ID": 27512,
            "ChargePointID": 157364,
            "ItemURL": "https://s3-ap-southeast-2.amazonaws.com/openchargemap/images/GB/OCM157364/OCM-157364.orig.2021050314091739.jpg",
            "ItemThumbnailURL": "https://s3-ap-southeast-2.amazonaws.com/openchargemap/images/GB/OCM157364/OCM-157364.thmb.2021050314091739.jpg",
            "Comment": "Teesside Shopping Park 7 kW charging station",
            "IsEnabled": true,
            "IsVideo": false,
            "IsFeaturedItem": false,
            "IsExternalResource": false,
            "User": {
                "ID": 26009,
                "Username": "mcv84"
            },
            "DateCreated": "2021-05-03T14:09:00Z"
        }
    ],
    "IsRecentlyVerified": false,
    "ID": 157364,
    "UUID": "9DBE4F6B-15FA-4BF4-A338-AADD122E35C7",
    "DataProviderID": 1,
    "OperatorID": 3,
    "OperatorsReference": "PG-84300,PG-84396,PG-84437,PG-84886,PG-84898,PG-84899,PG-84900,PG-84923,PG-84924",
    "UsageTypeID": 1,
    "UsageCost": "£0.25/kWh",
    "AddressInfo": {
        "ID": 157718,
        "Title": "Teesside Shopping Park",
        "AddressLine1": "Goodwood Square",
        "Town": "Stockton-on-Tees",
        "Postcode": "TS17 7BW",
        "CountryID": 1,
        "Latitude": 54.55708546333187,
        "Longitude": -1.2752517890335184,
        "DistanceUnit": 0
    },
    "Connections": [
        {
            "ID": 226665,
            "ConnectionTypeID": 25,
            "StatusTypeID": 50,
            "LevelID": 2,
            "Amps": 32,
            "Voltage": 400,
            "PowerKW": 22,
            "CurrentTypeID": 20,
            "Quantity": 8
        },
        {
            "ID": 231784,
            "ConnectionTypeID": 25,
            "StatusTypeID": 50,
            "LevelID": 2,
            "Amps": 16,
            "Voltage": 230,
            "PowerKW": 7,
            "CurrentTypeID": 10,
            "Quantity": 10
        }
    ],
    "NumberOfPoints": 18,
    "GeneralComments": "This is an open charge unit installed at the Teesside Shopping Park at Goodwood Square, Stockton-on-Tees",
    "StatusTypeID": 50,
    "DateLastStatusUpdate": "2021-05-05T12:11:00Z",
    "DataQualityLevel": 1,
    "DateCreated": "2020-06-02T05:37:00Z",
    "SubmissionStatusTypeID": 200
}