{
    "IsRecentlyVerified": false,
    "ID": 171563,
    "UUID": "7C93979D-7769-4761-B24D-17620B88B655",
    "DataProviderID": 1,
    "OperatorID": 23,
    "OperatorsReference": "55416",
    "UsageTypeID": 4,
    "UsageCost": "$0.24/min >=60kW; $0.12/min <60kW; other tariffs for older cars",
    "AddressInfo": {
        "ID": 171922,
        "Title": "Wells, NV Supercharger",
        "AddressLine1": "1440 6th Street",
        "Town": "Wells",
        "StateOrProvince": "NV",
        "Postcode": "89835",
        "CountryID": 2,
        "Latitude": 41.101277,
        "Longitude": -114.956743,
        "DistanceUnit": 0
    },
    "Connections": [
        {
            "ID": 262361,
            "ConnectionTypeID": 27,
            "StatusTypeID": 50,
            "LevelID": 3,
            "PowerKW": 120,
            "CurrentTypeID": 30,
            "Quantity": 8
        }
    ],
    "NumberOfPoints": 8,
    "GeneralComments": "Charging8 Superchargers, available 24/7, up to 250kW",
    "StatusTypeID": 50,
    "DateLastStatusUpdate": "2021-01-05T06:44:00Z",
    "DataQualityLevel": 1,
    "DateCreated": "2021-01-05T06:44:00Z",
    "SubmissionStatusTypeID": 200
}