{
    "IsRecentlyVerified": false,
    "ID": 174812,
    "UUID": "F251DD1C-7104-4635-9B24-B981735B4CD4",
    "DataProviderID": 1,
    "OperatorID": 21,
    "UsageTypeID": 4,
    "UsageCost": "Mobi.E compatible card or App",
    "AddressInfo": {
        "ID": 175171,
        "Title": "IDN-00001",
        "AddressLine1": "Largo do Municipio",
        "Town": "Idanha-a-Nova",
        "StateOrProvince": "Castelo Branco",
        "Postcode": "6060-146",
        "CountryID": 180,
        "Latitude": 39.92303216643961,
        "Longitude": -7.241753143028518,
        "DistanceUnit": 0
    },
    "Connections": [
        {
            "ID": 270878,
            "ConnectionTypeID": 25,
            "StatusTypeID": 50,
            "LevelID": 2,
            "Amps": 32,
            "Voltage": 400,
            "PowerKW": 22,
            "CurrentTypeID": 20,
            "Quantity": 2
        }
    ],
    "NumberOfPoints": 2,
    "StatusTypeID": 50,
    "DateLastStatusUpdate": "2021-04-13T20:35:00Z",
    "DataQualityLevel": 1,
    "DateCreated": "2021-04-13T20:35:00Z",
    "SubmissionStatusTypeID": 200
}