{
    "IsRecentlyVerified": false,
    "ID": 181789,
    "UUID": "BB0D5BAB-6BB0-4256-A36A-6567399F54C2",
    "DataProviderID": 29,
    "DataProvidersReference": "17711",
    "OperatorID": 127,
    "AddressInfo": {
        "ID": 182148,
        "Title": "Zum Hafen 3",
        "AddressLine1": "Zum Hafen 3",
        "Town": "Wangerland",
        "Postcode": "26434",
        "CountryID": 87,
        "Latitude": 53.686016,
        "Longitude": 8.017576,
        "DistanceUnit": 0
    },
    "Connections": [
        {
            "ID": 286606,
            "ConnectionTypeID": 25,
            "StatusTypeID": 50,
            "LevelID": 2,
            "PowerKW": 22,
            "CurrentTypeID": 20
        },
        {
            "ID": 286607,
            "ConnectionTypeID": 25,
            "StatusTypeID": 50,
            "LevelID": 2,
            "PowerKW": 22,
            "CurrentTypeID": 20
        }
    ],
    "StatusTypeID": 50,
    "DateLastStatusUpdate": "2021-07-12T02:52:00Z",
    "MetadataValues": [
        {
            "ID": 14083,
            "MetadataFieldID": 4,
            "ItemValue": "Data from the German chargepoint registry provided by Bundesnetzagentur.de under the CC-BY 4.0 license"
        }
    ],
    "DataQualityLevel": 3,
    "DateCreated": "2021-07-08T10:02:00Z",
    "SubmissionStatusTypeID": 100
}