{
    "IsRecentlyVerified": false,
    "ID": 110959,
    "UUID": "0883F797-8B97-4A52-B9E3-51574162D678",
    "DataProviderID": 2,
    "DataProvidersReference": "84140",
    "UsageTypeID": 1,
    "AddressInfo": {
        "ID": 111305,
        "Title": "ImPark - Citibank Building",
        "AddressLine1": "123 Front St W",
        "Town": "Toronto",
        "StateOrProvince": "ON",
        "Postcode": "M5J 2M3",
        "CountryID": 44,
        "Latitude": 43.645275,
        "Longitude": -79.38256,
        "ContactTelephone1": "416-864-0848",
        "AccessComments": "24 hours daily",
        "RelatedURL": "",
        "DistanceUnit": 0
    },
    "Connections": [
        {
            "ID": 156286,
            "ConnectionTypeID": 2,
            "LevelID": 3,
            "Amps": 100,
            "Voltage": 400,
            "PowerKW": 40,
            "CurrentTypeID": 30,
            "Quantity": 1
        },
        {
            "ID": 156287,
            "ConnectionTypeID": 32,
            "LevelID": 3,
            "Amps": 100,
            "Voltage": 400,
            "PowerKW": 40,
            "CurrentTypeID": 30,
            "Quantity": 1
        },
        {
            "ID": 156288,
            "ConnectionTypeID": 32,
            "LevelID": 3,
            "Amps": 100,
            "Voltage": 400,
            "PowerKW": 40,
            "CurrentTypeID": 30,
            "Quantity": 1
        }
    ],
    "DateLastStatusUpdate": "2020-06-26T03:07:00Z",
    "DataQualityLevel": 3,
    "DateCreated": "2018-10-18T23:36:00Z",
    "SubmissionStatusTypeID": 100
}