{
    "IsRecentlyVerified": false,
    "ID": 95873,
    "UUID": "1C3AB6D6-E688-4122-8634-EECCF02B5375",
    "DataProviderID": 1,
    "OperatorID": 156,
    "UsageTypeID": 4,
    "AddressInfo": {
        "ID": 96219,
        "Title": "HTW Campus Wilhelminenhof",
        "AddressLine1": "Wilhelminenhofstraße",
        "Town": "Berlin",
        "StateOrProvince": "Berlin",
        "Postcode": "12459",
        "CountryID": 87,
        "Latitude": 52.45537461057698,
        "Longitude": 13.52553572750855,
        "ContactTelephone1": "+493050192777",
        "AccessComments": "Auf dem Campus auf dem PArkplatz vor dem schwarzen 2 stöckigen Gebäude mit Leuchtreklame sind 2 New Motion lolo Boxen an einem Pfahl. Daneben 2 kostenlose Parkplätze.",
        "RelatedURL": "https://www.htw-berlin.de/campus/campus-wilhelminenhof/",
        "DistanceUnit": 0
    },
    "Connections": [
        {
            "ID": 135808,
            "ConnectionTypeID": 25,
            "StatusTypeID": 50,
            "LevelID": 2,
            "Amps": 16,
            "Voltage": 400,
            "PowerKW": 11,
            "CurrentTypeID": 20,
            "Quantity": 2
        }
    ],
    "NumberOfPoints": 2,
    "StatusTypeID": 50,
    "DateLastStatusUpdate": "2017-11-28T14:52:00Z",
    "DataQualityLevel": 1,
    "DateCreated": "2017-11-28T14:52:00Z",
    "SubmissionStatusTypeID": 200
}