{
    "IsRecentlyVerified": false,
    "ID": 180846,
    "UUID": "E5BA7903-48B8-4F75-B5E1-254946691979",
    "DataProviderID": 29,
    "DataProvidersReference": "2947",
    "OperatorID": 105,
    "AddressInfo": {
        "ID": 181205,
        "Title": "Sauerstaden 31",
        "AddressLine1": "Sauerstaden 31",
        "Town": "Bollendorf",
        "Postcode": "54669",
        "CountryID": 87,
        "Latitude": 49.8512496,
        "Longitude": 6.3586157,
        "DistanceUnit": 0
    },
    "Connections": [
        {
            "ID": 284450,
            "ConnectionTypeID": 25,
            "StatusTypeID": 50,
            "LevelID": 2,
            "PowerKW": 22,
            "CurrentTypeID": 20
        },
        {
            "ID": 297356,
            "ConnectionTypeID": 25,
            "StatusTypeID": 50,
            "LevelID": 2,
            "PowerKW": 22,
            "CurrentTypeID": 20
        }
    ],
    "StatusTypeID": 50,
    "DateLastStatusUpdate": "2021-07-12T02:44:00Z",
    "MetadataValues": [
        {
            "ID": 13140,
            "MetadataFieldID": 4,
            "ItemValue": "Data from the German chargepoint registry provided by Bundesnetzagentur.de under the CC-BY 4.0 license"
        }
    ],
    "DataQualityLevel": 3,
    "DateCreated": "2021-07-08T10:01:00Z",
    "SubmissionStatusTypeID": 100
}