{
    "IsRecentlyVerified": false,
    "ID": 110054,
    "UUID": "2FDC61AC-F5C3-4448-BE08-6F3094B34868",
    "DataProviderID": 2,
    "DataProvidersReference": "103547",
    "OperatorID": 5,
    "UsageTypeID": 1,
    "AddressInfo": {
        "ID": 110400,
        "Title": "ATRIUM PS",
        "AddressLine1": "18925 Bardeen Ave",
        "Town": "Irvine",
        "StateOrProvince": "CA",
        "Postcode": "92612",
        "CountryID": 2,
        "Latitude": 33.669285,
        "Longitude": -117.856951,
        "ContactTelephone1": "888-758-4389",
        "AccessComments": "24 hours daily",
        "RelatedURL": "http://www.chargepoint.com/",
        "DistanceUnit": 0
    },
    "Connections": [
        {
            "ID": 155283,
            "ConnectionTypeID": 1,
            "LevelID": 2,
            "Amps": 16,
            "Voltage": 230,
            "PowerKW": 3,
            "CurrentTypeID": 10,
            "Quantity": 5
        }
    ],
    "DateLastStatusUpdate": "2019-04-06T04:01:00Z",
    "DataQualityLevel": 3,
    "DateCreated": "2018-10-18T23:35:00Z",
    "SubmissionStatusTypeID": 100
}