{
    "IsRecentlyVerified": false,
    "ID": 99368,
    "UUID": "F17E06E7-3BDC-46DD-A76C-4C8A1D8F0AAC",
    "DataProviderID": 1,
    "OperatorID": 3279,
    "OperatorsReference": "0178",
    "UsageTypeID": 4,
    "UsageCost": "€0/kWh",
    "AddressInfo": {
        "ID": 99714,
        "Title": "Poligono Industrial el Pla",
        "AddressLine1": "Av. del Textil 41 - 46870",
        "Town": "ONTINYENT",
        "StateOrProvince": "Valencia",
        "Postcode": "4146870",
        "CountryID": 210,
        "Latitude": 38.827176,
        "Longitude": -0.588583,
        "DistanceUnit": 0
    },
    "Connections": [
        {
            "ID": 140427,
            "ConnectionTypeID": 25,
            "StatusTypeID": 50,
            "LevelID": 2,
            "Amps": 32,
            "Voltage": 230,
            "PowerKW": 7,
            "CurrentTypeID": 10,
            "Quantity": 1
        },
        {
            "ID": 140428,
            "ConnectionTypeID": 28,
            "StatusTypeID": 50,
            "LevelID": 1,
            "Voltage": 230,
            "PowerKW": 2.3,
            "CurrentTypeID": 10,
            "Quantity": 1
        }
    ],
    "NumberOfPoints": 1,
    "StatusTypeID": 50,
    "DateLastStatusUpdate": "2018-07-13T05:26:00Z",
    "DataQualityLevel": 1,
    "DateCreated": "2018-01-25T19:04:00Z",
    "SubmissionStatusTypeID": 200
}