{
    "IsRecentlyVerified": false,
    "ID": 122843,
    "UUID": "7450C220-EBA4-4B58-9E9F-C8F9704253A8",
    "DataProviderID": 2,
    "DataProvidersReference": "45779",
    "UsageTypeID": 1,
    "AddressInfo": {
        "ID": 123189,
        "Title": "City of Rock Hill - YMCA",
        "AddressLine1": "998 Riverwalk Pkwy",
        "Town": "Rock Hill",
        "StateOrProvince": "SC",
        "Postcode": "29730",
        "CountryID": 2,
        "Latitude": 34.977,
        "Longitude": -80.9771,
        "ContactTelephone1": "803-325-2505",
        "AccessComments": "24 hours daily",
        "RelatedURL": "",
        "DistanceUnit": 0
    },
    "Connections": [
        {
            "ID": 172766,
            "ConnectionTypeID": 1,
            "LevelID": 2,
            "Amps": 16,
            "Voltage": 230,
            "PowerKW": 3.7,
            "CurrentTypeID": 10,
            "Quantity": 2
        }
    ],
    "DateLastStatusUpdate": "2020-06-26T02:57:00Z",
    "DataQualityLevel": 3,
    "DateCreated": "2019-04-06T05:03:00Z",
    "SubmissionStatusTypeID": 100
}