{
    "IsRecentlyVerified": false,
    "ID": 28150,
    "UUID": "CDDB1D64-F2EE-4240-9382-D3094189D28B",
    "DataProviderID": 2,
    "DataProvidersReference": "51697",
    "UsageTypeID": 1,
    "AddressInfo": {
        "ID": 28496,
        "Title": "Bob Boyd Ford",
        "AddressLine1": "2840 N Columbus St",
        "Town": "Lancaster",
        "StateOrProvince": "OH",
        "Postcode": "43130",
        "CountryID": 2,
        "Latitude": 39.746087,
        "Longitude": -82.647696,
        "ContactTelephone1": "740-654-1122",
        "AccessComments": "24 hours daily",
        "RelatedURL": "",
        "DistanceUnit": 0
    },
    "Connections": [
        {
            "ID": 30935,
            "ConnectionTypeID": 1,
            "LevelID": 2,
            "Amps": 16,
            "Voltage": 230,
            "PowerKW": 3,
            "CurrentTypeID": 10,
            "Quantity": 2
        }
    ],
    "DateLastStatusUpdate": "2019-04-06T04:03:00Z",
    "DataQualityLevel": 3,
    "DateCreated": "2014-11-28T03:38:00Z",
    "SubmissionStatusTypeID": 100
}