{
    "IsRecentlyVerified": false,
    "ID": 65684,
    "UUID": "3D2A7916-F127-4A1A-8B7A-AD8DCC43DF1D",
    "DataProviderID": 26,
    "DataProvidersReference": "86335",
    "OperatorID": 157,
    "OperatorsReference": "NewMotion 03005821",
    "UsageCost": "0.00 jaarabonnement",
    "AddressInfo": {
        "ID": 66030,
        "Title": "Jaagpad 4",
        "AddressLine1": "Jaagpad 4",
        "Town": "Uithoorn",
        "Postcode": "1424 PT",
        "CountryID": 159,
        "Latitude": 52.2290109,
        "Longitude": 4.7799179,
        "ContactTelephone1": "088 0109500",
        "RelatedURL": "http://thenewmotion.nl/",
        "DistanceUnit": 0
    },
    "Connections": [
        {
            "ID": 90644,
            "ConnectionTypeID": 25,
            "LevelID": 2,
            "PowerKW": 22,
            "CurrentTypeID": 10
        }
    ],
    "NumberOfPoints": 1,
    "StatusTypeID": 50,
    "DateLastStatusUpdate": "2016-06-04T02:52:00Z",
    "DataQualityLevel": 3,
    "DateCreated": "2016-04-27T09:42:00Z",
    "SubmissionStatusTypeID": 100
}