{
    "IsRecentlyVerified": false,
    "ID": 84435,
    "UUID": "DCC5EB28-473D-4401-85C2-538C724C9A72",
    "DataProviderID": 1,
    "OperatorID": 23,
    "OperatorsReference": "25249",
    "UsageTypeID": 4,
    "AddressInfo": {
        "ID": 84781,
        "Title": "Grand Hotel Bernardin",
        "AddressLine1": "2 Obala",
        "Town": "Portoroz",
        "Postcode": "6320",
        "CountryID": 205,
        "Latitude": 45.516987,
        "Longitude": 13.56952,
        "ContactTelephone1": "+386 5 690 70 00",
        "DistanceUnit": 0
    },
    "Connections": [
        {
            "ID": 119887,
            "ConnectionTypeID": 30,
            "StatusTypeID": 50,
            "LevelID": 2,
            "Amps": 32,
            "Voltage": 400,
            "PowerKW": 22,
            "CurrentTypeID": 20,
            "Quantity": 1
        }
    ],
    "NumberOfPoints": 1,
    "GeneralComments": "1 Tesla Connector, up to 22kW.Available for customers. Please see front desk.",
    "StatusTypeID": 50,
    "DateLastStatusUpdate": "2018-10-03T18:37:00Z",
    "DataQualityLevel": 1,
    "DateCreated": "2017-02-25T06:38:00Z",
    "SubmissionStatusTypeID": 200
}