{
    "IsRecentlyVerified": false,
    "ID": 68775,
    "UUID": "8AC751C4-5748-48CD-A5DC-1907F66CF280",
    "DataProviderID": 1,
    "OperatorID": 202,
    "UsageTypeID": 1,
    "AddressInfo": {
        "ID": 69121,
        "Title": "TP Storo Storsenter",
        "AddressLine1": "Vitaminveien 7",
        "Town": "Oslo",
        "StateOrProvince": "Oslo",
        "Postcode": "0485",
        "CountryID": 168,
        "Latitude": 59.946715774390256,
        "Longitude": 10.77549544180295,
        "ContactTelephone1": "22 55 54 24",
        "DistanceUnit": 0
    },
    "Connections": [
        {
            "ID": 96468,
            "ConnectionTypeID": 25,
            "StatusTypeID": 50,
            "LevelID": 2,
            "Amps": 16,
            "Voltage": 230,
            "PowerKW": 4,
            "CurrentTypeID": 20,
            "Quantity": 5
        }
    ],
    "NumberOfPoints": 5,
    "StatusTypeID": 50,
    "DateLastStatusUpdate": "2016-06-23T22:08:00Z",
    "DataQualityLevel": 1,
    "DateCreated": "2016-06-23T22:08:00Z",
    "SubmissionStatusTypeID": 200
}