{
    "UserComments": [
        {
            "ID": 3524,
            "ChargePointID": 31317,
            "CommentTypeID": 10,
            "UserName": "Anon74856763534",
            "Comment": "Reported as being temporarily offline.",
            "DateCreated": "2015-01-04T18:29:09.47Z",
            "User": {
                "ID": 1192,
                "Username": "Anon74856763534"
            },
            "CheckinStatusTypeID": 0
        }
    ],
    "MediaItems": [
        {
            "ID": 845,
            "ChargePointID": 31317,
            "ItemURL": "https://s3-ap-southeast-2.amazonaws.com/openchargemap/images/GB/OCM31317/OCM-31317.orig.2015010418302793.jpg",
            "ItemThumbnailURL": "https://s3-ap-southeast-2.amazonaws.com/openchargemap/images/GB/OCM31317/OCM-31317.thmb.2015010418302793.jpg",
            "Comment": "",
            "IsEnabled": true,
            "IsVideo": false,
            "IsFeaturedItem": false,
            "IsExternalResource": false,
            "User": {
                "ID": 1192,
                "Username": "Anon74856763534"
            },
            "DateCreated": "2015-01-04T18:31:00Z"
        }
    ],
    "IsRecentlyVerified": false,
    "ID": 31317,
    "UUID": "EC38AFCA-E3F1-4BCB-A86A-0BE8569AF7FC",
    "DataProviderID": 1,
    "OperatorID": 3315,
    "OperatorsReference": "50117,50754",
    "UsageTypeID": 4,
    "UsageCost": "Free",
    "AddressInfo": {
        "ID": 31663,
        "Title": "High Street Coldstream",
        "AddressLine1": "87 High Street",
        "Town": "Coldstream",
        "StateOrProvince": "Borders",
        "Postcode": "TD12 4AE",
        "CountryID": 1,
        "Latitude": 55.6520844726167,
        "Longitude": -2.25039977088625,
        "AccessComments": "One tight bay reserved for charging. ",
        "DistanceUnit": 0
    },
    "Connections": [
        {
            "ID": 34706,
            "ConnectionTypeID": 2,
            "StatusTypeID": 50,
            "LevelID": 3,
            "PowerKW": 50,
            "CurrentTypeID": 30,
            "Quantity": 1
        },
        {
            "ID": 34745,
            "ConnectionTypeID": 1036,
            "StatusTypeID": 50,
            "LevelID": 3,
            "Voltage": 400,
            "PowerKW": 43,
            "CurrentTypeID": 20,
            "Quantity": 1
        },
        {
            "ID": 34746,
            "ConnectionTypeID": 33,
            "StatusTypeID": 50,
            "LevelID": 3,
            "PowerKW": 50,
            "CurrentTypeID": 30,
            "Quantity": 1
        },
        {
            "ID": 64504,
            "ConnectionTypeID": 3,
            "StatusTypeID": 50,
            "LevelID": 2,
            "Amps": 13,
            "Voltage": 230,
            "PowerKW": 3,
            "CurrentTypeID": 10,
            "Quantity": 1
        }
    ],
    "NumberOfPoints": 4,
    "GeneralComments": "No parking fees. Siemens unit (triple-head charger).",
    "StatusTypeID": 50,
    "DateLastStatusUpdate": "2020-07-03T10:03:00Z",
    "DataQualityLevel": 1,
    "DateCreated": "2015-01-02T20:25:00Z",
    "SubmissionStatusTypeID": 200
}