{
    "IsRecentlyVerified": false,
    "ID": 110460,
    "UUID": "9E72F268-B5DF-4360-990A-096289E8D537",
    "DataProviderID": 2,
    "DataProvidersReference": "102641",
    "UsageTypeID": 2,
    "AddressInfo": {
        "ID": 110806,
        "Title": "Fort Leavenworth",
        "AddressLine1": "851 Riley Ave",
        "Town": "Fort Leavenworth",
        "StateOrProvince": "KS",
        "Postcode": "66027",
        "CountryID": 2,
        "Latitude": 39.361578,
        "Longitude": -94.920141,
        "ContactTelephone1": "",
        "AccessComments": "",
        "RelatedURL": "",
        "DistanceUnit": 0
    },
    "Connections": [
        {
            "ID": 155713,
            "ConnectionTypeID": 1,
            "LevelID": 2,
            "Amps": 16,
            "Voltage": 230,
            "PowerKW": 3.7,
            "CurrentTypeID": 10,
            "Quantity": 1
        }
    ],
    "DateLastStatusUpdate": "2020-06-26T03:01:00Z",
    "DataQualityLevel": 3,
    "DateCreated": "2018-10-18T23:36:00Z",
    "SubmissionStatusTypeID": 100
}