{
    "IsRecentlyVerified": false,
    "ID": 9668,
    "UUID": "312279FF-ED62-406B-AF1E-CF74D908E904",
    "DataProviderID": 1,
    "OperatorID": 19,
    "UsageTypeID": 6,
    "UsageCost": "Free",
    "AddressInfo": {
        "ID": 9565,
        "Title": "Millbrook Cottages",
        "AddressLine1": "Millbrook",
        "AddressLine2": "High Bickington",
        "StateOrProvince": "Devon",
        "Postcode": "EX37 9BX",
        "CountryID": 1,
        "Latitude": 50.965331,
        "Longitude": -4.02285,
        "ContactTelephone1": "01769 561901",
        "ContactEmail": "bob@millbrookcottages.co.uk",
        "RelatedURL": "http://www.millbrookcottages.co.uk",
        "DistanceUnit": 0
    },
    "Connections": [
        {
            "ID": 7472,
            "ConnectionTypeID": 30,
            "StatusTypeID": 50,
            "LevelID": 2,
            "Amps": 32,
            "Voltage": 230,
            "PowerKW": 13,
            "CurrentTypeID": 10,
            "Quantity": 1
        },
        {
            "ID": 7473,
            "ConnectionTypeID": 30,
            "StatusTypeID": 50,
            "LevelID": 2,
            "Amps": 32,
            "Voltage": 230,
            "PowerKW": 13,
            "CurrentTypeID": 20,
            "Quantity": 1
        },
        {
            "ID": 171116,
            "ConnectionTypeID": 1,
            "StatusTypeID": 50,
            "LevelID": 2,
            "Amps": 32,
            "Voltage": 230,
            "PowerKW": 7,
            "CurrentTypeID": 10,
            "Quantity": 1
        }
    ],
    "NumberOfPoints": 3,
    "StatusTypeID": 50,
    "DateLastStatusUpdate": "2019-04-02T11:12:00Z",
    "DataQualityLevel": 1,
    "DateCreated": "2012-04-12T10:47:00Z",
    "SubmissionStatusTypeID": 200
}