{
    "IsRecentlyVerified": false,
    "ID": 136125,
    "UUID": "0C165DDC-4B67-4C0F-853A-06E675A8258F",
    "DataProviderID": 18,
    "DataProvidersReference": "20168047a2debfec6314fb6f6cc4b5c7",
    "OperatorID": 2244,
    "UsageTypeID": 5,
    "AddressInfo": {
        "ID": 136471,
        "Title": "Penywern Road",
        "AddressLine1": "Penywern Road",
        "Town": "London",
        "Postcode": "SW5 9SU",
        "CountryID": 1,
        "Latitude": 51.491149,
        "Longitude": -0.193257,
        "AccessComments": "",
        "RelatedURL": "https://www.ubitricity.com",
        "DistanceUnit": 0
    },
    "Connections": [
        {
            "ID": 190552,
            "ConnectionTypeID": 25,
            "Reference": "suby1100003130",
            "StatusTypeID": 50,
            "LevelID": 2,
            "Amps": 16,
            "Voltage": 230,
            "PowerKW": 3.7,
            "CurrentTypeID": 10
        }
    ],
    "StatusTypeID": 0,
    "DateLastStatusUpdate": "2021-04-25T05:46:00Z",
    "MetadataValues": [
        {
            "ID": 5977,
            "MetadataFieldID": 4,
            "ItemValue": "Contains public sector information licensed under the Open Government Licence v2.0. http://www.nationalarchives.gov.uk/doc/open-government-licence/version/2/"
        }
    ],
    "DataQualityLevel": 3,
    "DateCreated": "2019-12-24T05:22:00Z",
    "SubmissionStatusTypeID": 100
}