{
    "UserComments": [
        {
            "ID": 19645,
            "ChargePointID": 104562,
            "CommentTypeID": 100,
            "UserName": "marcus_mang",
            "Comment": "Could _not_ use this station with any of the cards/apps available to me:\nEinfachStromLaden card\nNewMotion card\nPlugSurfing app\n\nThe station seemed to be operational, though, since a BMW PHEV was loading. Station may work with the intercharge network (has their logo and QR codes) as well as ChargeNow (BMW-specific)",
            "DateCreated": "2018-06-13T22:40:47.163Z",
            "User": {
                "ID": 18450,
                "Username": "marcus_mang"
            },
            "CheckinStatusTypeID": 40
        }
    ],
    "MediaItems": [
        {
            "ID": 15651,
            "ChargePointID": 104562,
            "ItemURL": "https://s3-ap-southeast-2.amazonaws.com/openchargemap/images/DE/OCM104562/OCM-104562.orig.2018061412425333.jpeg",
            "ItemThumbnailURL": "https://s3-ap-southeast-2.amazonaws.com/openchargemap/images/DE/OCM104562/OCM-104562.thmb.2018061412425333.jpeg",
            "Comment": "",
            "IsEnabled": true,
            "IsVideo": false,
            "IsFeaturedItem": false,
            "IsExternalResource": false,
            "User": {
                "ID": 18450,
                "Username": "marcus_mang"
            },
            "DateCreated": "2018-06-14T12:43:00Z"
        },
        {
            "ID": 15652,
            "ChargePointID": 104562,
            "ItemURL": "https://s3-ap-southeast-2.amazonaws.com/openchargemap/images/DE/OCM104562/OCM-104562.orig.2018061412430873.jpeg",
            "ItemThumbnailURL": "https://s3-ap-southeast-2.amazonaws.com/openchargemap/images/DE/OCM104562/OCM-104562.thmb.2018061412430873.jpeg",
            "Comment": "",
            "IsEnabled": true,
            "IsVideo": false,
            "IsFeaturedItem": false,
            "IsExternalResource": false,
            "User": {
                "ID": 18450,
                "Username": "marcus_mang"
            },
            "DateCreated": "2018-06-14T12:43:00Z"
        }
    ],
    "IsRecentlyVerified": false,
    "ID": 104562,
    "UUID": "7716DF06-29F8-40DA-943B-4FBCFF7E8A1E",
    "DataProviderID": 1,
    "OperatorID": 173,
    "UsageTypeID": 4,
    "UsageCost": "",
    "AddressInfo": {
        "ID": 104908,
        "Title": "Autohaus Netuschil",
        "AddressLine1": "Herrenberger Straße 60",
        "AddressLine2": "",
        "Town": "Böblingen",
        "StateOrProvince": "Landkreis Böblingen",
        "Postcode": "71034",
        "CountryID": 87,
        "Latitude": 48.68227727604171,
        "Longitude": 8.997776864334808,
        "ContactTelephone1": "",
        "ContactTelephone2": "",
        "ContactEmail": "",
        "AccessComments": "Access via ChargeNow, entry to the station via Schlotterbeckstr.",
        "RelatedURL": "",
        "DistanceUnit": 0
    },
    "Connections": [
        {
            "ID": 147576,
            "ConnectionTypeID": 25,
            "StatusTypeID": 50,
            "LevelID": 2,
            "Amps": 32,
            "Voltage": 400,
            "PowerKW": 22,
            "CurrentTypeID": 20,
            "Quantity": 2
        }
    ],
    "NumberOfPoints": 2,
    "GeneralComments": "",
    "StatusTypeID": 50,
    "DateLastStatusUpdate": "2018-06-14T19:57:00Z",
    "DataQualityLevel": 1,
    "DateCreated": "2018-05-22T08:11:00Z",
    "SubmissionStatusTypeID": 200
}