{
    "IsRecentlyVerified": false,
    "ID": 71557,
    "UUID": "27BB180F-59B2-40AF-853C-BC405D8ADB91",
    "DataProviderID": 1,
    "OperatorID": 23,
    "OperatorsReference": "18201",
    "UsageTypeID": 1,
    "UsageCost": "$0.24/min >=60kW; $0.12/min <60kW; other tariffs for older cars",
    "AddressInfo": {
        "ID": 71903,
        "Title": "Hilton Garden Inn Erie - Tesla",
        "AddressLine1": "2225 Down Dr",
        "Town": "Erie",
        "StateOrProvince": "PA",
        "Postcode": "16509",
        "CountryID": 2,
        "Latitude": 42.0499838,
        "Longitude": -80.0852803,
        "ContactTelephone1": "877-798-3752",
        "AccessComments": "24 hours daily; for Tesla use only",
        "RelatedURL": "http://www.teslamotors.com/supercharger",
        "DistanceUnit": 0
    },
    "Connections": [
        {
            "ID": 102381,
            "ConnectionTypeID": 27,
            "StatusTypeID": 50,
            "LevelID": 3,
            "Amps": 100,
            "Voltage": 400,
            "PowerKW": 120,
            "CurrentTypeID": 30,
            "Quantity": 8
        }
    ],
    "NumberOfPoints": 8,
    "StatusTypeID": 50,
    "DateLastStatusUpdate": "2018-03-13T13:52:00Z",
    "DataQualityLevel": 3,
    "DateCreated": "2016-09-02T10:15:00Z",
    "SubmissionStatusTypeID": 100
}