{
    "IsRecentlyVerified": false,
    "ID": 96853,
    "UUID": "07268441-79DF-4C20-B0C4-A256AC863762",
    "DataProviderID": 1,
    "OperatorID": 1,
    "UsageTypeID": 1,
    "AddressInfo": {
        "ID": 97199,
        "Title": "E-Bike Station",
        "AddressLine1": "Bergstraße 58",
        "Town": "Koblenz",
        "StateOrProvince": "Koblenz",
        "Postcode": "56077",
        "CountryID": 87,
        "Latitude": 50.36696439876367,
        "Longitude": 7.617391485113547,
        "AccessComments": "24/7 nutzbarer Ladeschrank neben den Parkuhren auf der Seite der Ausfahrt mittig vom Parkplatz.\r\n",
        "DistanceUnit": 0
    },
    "Connections": [
        {
            "ID": 137184,
            "ConnectionTypeID": 28,
            "StatusTypeID": 50,
            "LevelID": 1,
            "Amps": 10,
            "Voltage": 230,
            "PowerKW": 2.3,
            "CurrentTypeID": 10,
            "Quantity": 3
        }
    ],
    "NumberOfPoints": 3,
    "StatusTypeID": 50,
    "DateLastStatusUpdate": "2018-01-02T07:44:00Z",
    "DataQualityLevel": 1,
    "DateCreated": "2018-01-02T07:44:00Z",
    "SubmissionStatusTypeID": 200
}