{
    "IsRecentlyVerified": false,
    "ID": 8129,
    "UUID": "6DD58E9F-73ED-43D1-A35C-BD7AD1996ED1",
    "DataProviderID": 15,
    "DataProvidersReference": "6088",
    "OperatorID": 26,
    "AddressInfo": {
        "ID": 8026,
        "Title": "431 Washington St",
        "AddressLine1": "431 Washington St",
        "Town": "Newton",
        "StateOrProvince": "MA",
        "Postcode": "2458",
        "CountryID": 2,
        "Latitude": 42.3561,
        "Longitude": -71.19009,
        "ContactTelephone1": " (617) 964-3000",
        "RelatedURL": "http://carstations.com/6088",
        "DistanceUnit": 0
    },
    "Connections": [
        {
            "ID": 5558,
            "ConnectionTypeID": 1,
            "Reference": "J1772",
            "LevelID": 2
        }
    ],
    "StatusTypeID": 0,
    "DateLastStatusUpdate": "2017-11-04T14:04:00Z",
    "DataQualityLevel": 1,
    "DateCreated": "2011-11-11T12:06:00Z",
    "SubmissionStatusTypeID": 100
}