{
    "IsRecentlyVerified": false,
    "ID": 177524,
    "UUID": "01F66ABF-8DC2-4337-85DF-6B3D2C936FE7",
    "DataProviderID": 29,
    "DataProvidersReference": "19436",
    "AddressInfo": {
        "ID": 177883,
        "Title": "Berliner Platz 12",
        "AddressLine1": "Berliner Platz 12",
        "Town": "Heilbronn",
        "Postcode": "74072",
        "CountryID": 87,
        "Latitude": 49.1453981,
        "Longitude": 9.22124020000001,
        "DistanceUnit": 0
    },
    "Connections": [
        {
            "ID": 276772,
            "ConnectionTypeID": 25,
            "StatusTypeID": 50,
            "LevelID": 2,
            "PowerKW": 11,
            "CurrentTypeID": 20
        },
        {
            "ID": 276773,
            "ConnectionTypeID": 25,
            "StatusTypeID": 50,
            "LevelID": 2,
            "PowerKW": 11,
            "CurrentTypeID": 20
        }
    ],
    "StatusTypeID": 0,
    "DateLastStatusUpdate": "2021-07-12T02:42:00Z",
    "MetadataValues": [
        {
            "ID": 9818,
            "MetadataFieldID": 4,
            "ItemValue": "Data from the German chargepoint registry provided by Bundesnetzagentur.de under the CC-BY 4.0 license"
        }
    ],
    "DataQualityLevel": 3,
    "DateCreated": "2021-07-08T09:49:00Z",
    "SubmissionStatusTypeID": 100
}