{
    "IsRecentlyVerified": false,
    "ID": 8280,
    "UUID": "70364C48-900D-4DBD-B755-8521249D26C4",
    "DataProviderID": 15,
    "DataProvidersReference": "7142",
    "OperatorID": 26,
    "AddressInfo": {
        "ID": 8177,
        "Title": "404 Cambell St",
        "AddressLine1": "404 Cambell St",
        "Town": "Rapid City",
        "StateOrProvince": "SD",
        "Postcode": "57701",
        "CountryID": 2,
        "Latitude": 44.08045,
        "Longitude": -103.19077,
        "ContactTelephone1": " (605) 342-3400",
        "RelatedURL": "http://carstations.com/7142",
        "DistanceUnit": 0
    },
    "Connections": [
        {
            "ID": 5709,
            "ConnectionTypeID": 1,
            "Reference": "J1772",
            "LevelID": 2
        }
    ],
    "StatusTypeID": 0,
    "DateLastStatusUpdate": "2017-11-04T14:04:00Z",
    "DataQualityLevel": 1,
    "DateCreated": "2011-11-11T12:06:00Z",
    "SubmissionStatusTypeID": 100
}