{
    "IsRecentlyVerified": false,
    "ID": 121109,
    "UUID": "37C23914-DE8A-4A29-8A61-FF5063884B22",
    "DataProviderID": 2,
    "DataProvidersReference": "89949",
    "OperatorID": 5,
    "UsageTypeID": 1,
    "AddressInfo": {
        "ID": 121455,
        "Title": "CNTYOFRIVERSIDE",
        "AddressLine1": "1475-1591 S Hargrave St",
        "Town": "Banning",
        "StateOrProvince": "CA",
        "Postcode": "92220",
        "CountryID": 2,
        "Latitude": 33.9114673,
        "Longitude": -116.8683712,
        "ContactTelephone1": "888-758-4389",
        "AccessComments": "24 hours daily",
        "RelatedURL": "http://www.chargepoint.com/",
        "DistanceUnit": 0
    },
    "Connections": [
        {
            "ID": 170540,
            "ConnectionTypeID": 1,
            "LevelID": 2,
            "Amps": 16,
            "Voltage": 230,
            "PowerKW": 3,
            "CurrentTypeID": 10,
            "Quantity": 2
        }
    ],
    "DateLastStatusUpdate": "2019-12-24T09:11:00Z",
    "DataQualityLevel": 3,
    "DateCreated": "2019-04-01T04:59:00Z",
    "SubmissionStatusTypeID": 100
}