{
    "IsRecentlyVerified": false,
    "ID": 104444,
    "UUID": "4A61327A-8974-4C01-A2B4-B9B1D306F26E",
    "DataProviderID": 1,
    "OperatorID": 23,
    "OperatorsReference": "43232",
    "UsageTypeID": 4,
    "AddressInfo": {
        "ID": 104790,
        "Title": "One & Only Royal Mirage Hotel",
        "AddressLine1": "Al Sufouh RD",
        "Town": "Dubai",
        "Postcode": "Dubai",
        "CountryID": 235,
        "Latitude": 25.097763,
        "Longitude": 55.152912,
        "ContactTelephone1": "+971 4 399 9999",
        "DistanceUnit": 0
    },
    "Connections": [
        {
            "ID": 147439,
            "ConnectionTypeID": 30,
            "StatusTypeID": 50,
            "LevelID": 2,
            "Amps": 32,
            "Voltage": 230,
            "PowerKW": 13,
            "CurrentTypeID": 20,
            "Quantity": 1
        }
    ],
    "NumberOfPoints": 1,
    "GeneralComments": "1 Tesla Connector, up to 13kW.Available for customers. Self park.",
    "StatusTypeID": 50,
    "DateLastStatusUpdate": "2018-10-04T06:17:00Z",
    "DataQualityLevel": 1,
    "DateCreated": "2018-05-20T05:37:00Z",
    "SubmissionStatusTypeID": 200
}