{
    "IsRecentlyVerified": false,
    "ID": 154092,
    "UUID": "AF38BA73-67BD-4D01-BA00-0611DDC6E82E",
    "DataProviderID": 28,
    "DataProvidersReference": "FR*S27*PTHIBERVILLE*ECOLES",
    "UsageTypeID": 5,
    "AddressInfo": {
        "ID": 154445,
        "Title": "900009",
        "AddressLine1": "Place des Ecoles Thiberville",
        "CountryID": 80,
        "Latitude": 49.135919,
        "Longitude": 0.457547,
        "AccessComments": "24/24 7/7 jours",
        "DistanceUnit": 0
    },
    "Connections": [
        {
            "ID": 216559,
            "ConnectionTypeID": 28,
            "StatusTypeID": 50,
            "LevelID": 2,
            "PowerKW": 22,
            "CurrentTypeID": 10
        },
        {
            "ID": 216560,
            "ConnectionTypeID": 26,
            "StatusTypeID": 50,
            "LevelID": 2,
            "PowerKW": 22
        },
        {
            "ID": 250892,
            "ConnectionTypeID": 26,
            "StatusTypeID": 50,
            "LevelID": 2,
            "PowerKW": 22
        },
        {
            "ID": 250893,
            "ConnectionTypeID": 28,
            "StatusTypeID": 50,
            "LevelID": 2,
            "PowerKW": 22,
            "CurrentTypeID": 10
        }
    ],
    "GeneralComments": "Borne en service",
    "StatusTypeID": 50,
    "DateLastStatusUpdate": "2020-08-27T05:16:00Z",
    "DataQualityLevel": 2,
    "DateCreated": "2020-03-15T10:54:00Z",
    "SubmissionStatusTypeID": 100
}