{
    "IsRecentlyVerified": false,
    "ID": 171323,
    "UUID": "D1907A7F-2C88-4640-ABA7-1A9CB8AB26C3",
    "DataProviderID": 1,
    "OperatorID": 173,
    "UsageTypeID": 4,
    "UsageCost": "R0 for BMW ChargeNow card holders",
    "AddressInfo": {
        "ID": 171682,
        "Title": "SMG Cape Town",
        "AddressLine1": "1 Century Way",
        "AddressLine2": "Century City",
        "Town": "Milnerton, Cape Town",
        "StateOrProvince": "WC",
        "CountryID": 208,
        "Latitude": -33.89314726070135,
        "Longitude": 18.505223096986583,
        "AccessComments": "Outside SMG Cape Town - the BMW dealer",
        "DistanceUnit": 0
    },
    "Connections": [
        {
            "ID": 261862,
            "ConnectionTypeID": 33,
            "StatusTypeID": 50,
            "LevelID": 3,
            "Amps": 125,
            "Voltage": 400,
            "PowerKW": 50,
            "CurrentTypeID": 20,
            "Quantity": 1
        },
        {
            "ID": 261863,
            "ConnectionTypeID": 2
        }
    ],
    "NumberOfPoints": 1,
    "GeneralComments": "Free charging for those with a BMW Chargenow card.\r\nMay become available to Gridcars users at some point",
    "StatusTypeID": 50,
    "DateLastStatusUpdate": "2021-01-01T09:25:00Z",
    "DataQualityLevel": 1,
    "DateCreated": "2020-12-30T13:40:00Z",
    "SubmissionStatusTypeID": 200
}