{
    "IsRecentlyVerified": false,
    "ID": 141822,
    "UUID": "59939652-441B-4AC6-AEFC-FCCD15973C25",
    "DataProviderID": 2,
    "DataProvidersReference": "122913",
    "OperatorID": 5,
    "UsageTypeID": 1,
    "AddressInfo": {
        "ID": 142174,
        "Title": "FRISCO",
        "AddressLine1": "99 S 3rd St",
        "Town": "Frisco",
        "StateOrProvince": "CO",
        "Postcode": "80443",
        "CountryID": 2,
        "Latitude": 39.5750098,
        "Longitude": -106.0989902,
        "ContactTelephone1": "888-758-4389",
        "AccessComments": "24 hours daily",
        "RelatedURL": "http://www.chargepoint.com/",
        "DistanceUnit": 0
    },
    "Connections": [
        {
            "ID": 197846,
            "ConnectionTypeID": 1,
            "LevelID": 2,
            "Amps": 16,
            "Voltage": 230,
            "PowerKW": 3.7,
            "CurrentTypeID": 10,
            "Quantity": 2
        }
    ],
    "StatusTypeID": 50,
    "DateLastStatusUpdate": "2020-06-26T03:02:00Z",
    "DataQualityLevel": 3,
    "DateCreated": "2019-12-24T09:16:00Z",
    "SubmissionStatusTypeID": 100
}