{
    "IsRecentlyVerified": false,
    "ID": 51628,
    "UUID": "E811D8D5-9D9B-49AD-A166-3E6493DE2160",
    "DataProviderID": 1,
    "OperatorID": 24,
    "OperatorsReference": "1030",
    "UsageTypeID": 4,
    "UsageCost": "£0.30/kWh; £0.15/kWh for Ecotricity energy customers",
    "AddressInfo": {
        "ID": 51974,
        "Title": "Welcome Break, Hartshead Moor M62 Eastbound (N.bound)",
        "AddressLine1": "M62 Motorway Northbound",
        "Town": "Brighouse",
        "StateOrProvince": "West Yorkshire",
        "Postcode": "HD6 4JX",
        "CountryID": 1,
        "Latitude": 53.71261,
        "Longitude": -1.74629,
        "DistanceUnit": 0
    },
    "Connections": [
        {
            "ID": 64026,
            "ConnectionTypeID": 2,
            "StatusTypeID": 50,
            "LevelID": 3,
            "PowerKW": 50,
            "CurrentTypeID": 30,
            "Quantity": 1
        },
        {
            "ID": 64027,
            "ConnectionTypeID": 33,
            "StatusTypeID": 50,
            "LevelID": 3,
            "PowerKW": 50,
            "CurrentTypeID": 30,
            "Quantity": 1
        },
        {
            "ID": 64028,
            "ConnectionTypeID": 1036,
            "StatusTypeID": 50,
            "LevelID": 3,
            "Voltage": 400,
            "PowerKW": 43,
            "CurrentTypeID": 20,
            "Quantity": 1
        }
    ],
    "NumberOfPoints": 2,
    "StatusTypeID": 50,
    "DateLastStatusUpdate": "2021-03-03T06:14:00Z",
    "DataQualityLevel": 1,
    "DateCreated": "2015-08-07T09:51:00Z",
    "SubmissionStatusTypeID": 200
}