{
    "IsRecentlyVerified": false,
    "ID": 47960,
    "UUID": "7BC50864-6412-4B2E-8DB0-8C434C0AD60B",
    "DataProviderID": 1,
    "OperatorID": 80,
    "UsageTypeID": 4,
    "UsageCost": "0,40 €/kW",
    "AddressInfo": {
        "ID": 48306,
        "Title": "MACHIAVELLI PARKING ",
        "AddressLine1": "Via Camillo Finocchiaro Aprile, 1",
        "AddressLine2": "Zona 2",
        "Town": "Milano",
        "StateOrProvince": "Milano",
        "Postcode": "20124",
        "CountryID": 112,
        "Latitude": 45.47795421657035,
        "Longitude": 9.201483528102923,
        "ContactTelephone1": "02 6592625",
        "DistanceUnit": 0
    },
    "Connections": [
        {
            "ID": 59168,
            "ConnectionTypeID": 25,
            "StatusTypeID": 50,
            "LevelID": 2,
            "PowerKW": 22,
            "CurrentTypeID": 20,
            "Quantity": 2
        }
    ],
    "NumberOfPoints": 2,
    "StatusTypeID": 50,
    "DateLastStatusUpdate": "2015-06-19T12:53:00Z",
    "DataQualityLevel": 1,
    "DateCreated": "2015-06-19T12:53:00Z",
    "SubmissionStatusTypeID": 200
}