{
    "IsRecentlyVerified": false,
    "ID": 186199,
    "UUID": "2A2F4DB5-5917-4A67-ADF0-1844F24FB62D",
    "DataProviderID": 29,
    "DataProvidersReference": "16479",
    "AddressInfo": {
        "ID": 186558,
        "Title": "Hermann-Ehlers-Str.",
        "AddressLine1": "Hermann-Ehlers-Str.",
        "Town": "Troisdorf",
        "Postcode": "53840",
        "CountryID": 87,
        "Latitude": 50.8061,
        "Longitude": 7.152,
        "DistanceUnit": 0
    },
    "Connections": [
        {
            "ID": 298225,
            "ConnectionTypeID": 28,
            "StatusTypeID": 50,
            "LevelID": 2,
            "PowerKW": 22,
            "CurrentTypeID": 20
        },
        {
            "ID": 298226,
            "ConnectionTypeID": 25,
            "StatusTypeID": 50,
            "LevelID": 2,
            "PowerKW": 22,
            "CurrentTypeID": 20
        },
        {
            "ID": 298227,
            "ConnectionTypeID": 28,
            "StatusTypeID": 50,
            "LevelID": 2,
            "PowerKW": 22,
            "CurrentTypeID": 20
        },
        {
            "ID": 298228,
            "ConnectionTypeID": 25,
            "StatusTypeID": 50,
            "LevelID": 2,
            "PowerKW": 22,
            "CurrentTypeID": 20
        }
    ],
    "StatusTypeID": 50,
    "DateLastStatusUpdate": "2021-07-12T02:45:00Z",
    "MetadataValues": [
        {
            "ID": 18440,
            "MetadataFieldID": 4,
            "ItemValue": "Data from the German chargepoint registry provided by Bundesnetzagentur.de under the CC-BY 4.0 license"
        }
    ],
    "DataQualityLevel": 3,
    "DateCreated": "2021-07-12T02:45:00Z",
    "SubmissionStatusTypeID": 100
}