{
    "IsRecentlyVerified": false,
    "ID": 50676,
    "UUID": "762B78BD-CB19-402B-999C-F995FD9D8DEB",
    "DataProviderID": 26,
    "DataProvidersReference": "63460",
    "OperatorID": 179,
    "OperatorsReference": "Ecotap 1500253",
    "UsageCost": "0.00 afhankelijk van pas",
    "AddressInfo": {
        "ID": 51022,
        "Title": "Cereslaan 9",
        "AddressLine1": "Cereslaan 9",
        "Town": "Bernheze",
        "Postcode": "5384 VT",
        "CountryID": 159,
        "Latitude": 51.732478,
        "Longitude": 5.508352,
        "RelatedURL": "http://www.ecotap.nl",
        "DistanceUnit": 0
    },
    "Connections": [
        {
            "ID": 62462,
            "ConnectionTypeID": 25,
            "LevelID": 2,
            "PowerKW": 22,
            "CurrentTypeID": 10
        },
        {
            "ID": 62463,
            "ConnectionTypeID": 25,
            "LevelID": 2,
            "PowerKW": 22,
            "CurrentTypeID": 10
        }
    ],
    "NumberOfPoints": 2,
    "StatusTypeID": 50,
    "DateLastStatusUpdate": "2016-06-04T02:40:00Z",
    "DataQualityLevel": 3,
    "DateCreated": "2015-07-22T09:53:00Z",
    "SubmissionStatusTypeID": 100
}