{
    "IsRecentlyVerified": false,
    "ID": 87285,
    "UUID": "33D12564-2BC6-4645-BE87-E692B0C955DB",
    "DataProviderID": 1,
    "OperatorID": 32,
    "OperatorsReference": "3615",
    "UsageTypeID": 4,
    "UsageCost": "£0.108/kWh; for Polar Plus subscription members only",
    "AddressInfo": {
        "ID": 87631,
        "Title": "Kilmarnock College",
        "AddressLine1": "Hill Street",
        "Town": "Kilmarnock",
        "StateOrProvince": "East Ayrshire",
        "Postcode": "KA3 7AT",
        "CountryID": 1,
        "Latitude": 55.614155,
        "Longitude": -4.500185,
        "AccessComments": "opposite bicycle sheds",
        "DistanceUnit": 0
    },
    "Connections": [
        {
            "ID": 123726,
            "ConnectionTypeID": 25,
            "StatusTypeID": 50,
            "LevelID": 2,
            "Amps": 32,
            "Voltage": 230,
            "PowerKW": 7,
            "CurrentTypeID": 10,
            "Quantity": 2
        }
    ],
    "NumberOfPoints": 2,
    "StatusTypeID": 50,
    "DateLastStatusUpdate": "2019-03-09T06:40:00Z",
    "DataQualityLevel": 1,
    "DateCreated": "2017-05-03T10:00:00Z",
    "SubmissionStatusTypeID": 100
}