{
    "IsRecentlyVerified": false,
    "ID": 2758,
    "UUID": "485F91A6-CC5F-4BA5-AF7E-F9DB4A7BBB4C",
    "DataProviderID": 2,
    "DataProvidersReference": "33557",
    "UsageTypeID": 1,
    "AddressInfo": {
        "ID": 2759,
        "Title": "University of California - Davis",
        "AddressLine1": "6 Howard Way",
        "Town": "Davis",
        "StateOrProvince": "CA",
        "Postcode": "95616",
        "CountryID": 2,
        "Latitude": 38.543997,
        "Longitude": -121.75014,
        "ContactTelephone1": "530-752-8277",
        "AccessComments": "24 hours daily; pay lot; permit required 7am-10pm M-F",
        "RelatedURL": "",
        "DistanceUnit": 0
    },
    "Connections": [
        {
            "ID": 15280,
            "ConnectionTypeID": 9,
            "LevelID": 1,
            "Amps": 16,
            "Voltage": 120,
            "PowerKW": 1.9,
            "CurrentTypeID": 10,
            "Quantity": 2
        },
        {
            "ID": 20257,
            "ConnectionTypeID": 1,
            "LevelID": 2,
            "Amps": 16,
            "Voltage": 230,
            "PowerKW": 3.7,
            "CurrentTypeID": 10,
            "Quantity": 4
        }
    ],
    "DateLastConfirmed": "2010-08-31T00:00:00Z",
    "StatusTypeID": 0,
    "DateLastStatusUpdate": "2020-06-26T03:00:00Z",
    "DataQualityLevel": 1,
    "DateCreated": "2010-08-31T00:00:00Z",
    "SubmissionStatusTypeID": 100
}