{
    "IsRecentlyVerified": false,
    "ID": 183799,
    "UUID": "E897B890-7113-47B4-BED6-9BD1EDAF2B3D",
    "DataProviderID": 29,
    "DataProvidersReference": "8310",
    "AddressInfo": {
        "ID": 184158,
        "Title": "Ahnepaule 1",
        "AddressLine1": "Ahnepaule 1",
        "Town": "Bad Salzdetfurth",
        "Postcode": "31162",
        "CountryID": 87,
        "Latitude": 52.048298,
        "Longitude": 10.005978,
        "DistanceUnit": 0
    },
    "Connections": [
        {
            "ID": 291233,
            "ConnectionTypeID": 33,
            "StatusTypeID": 50,
            "LevelID": 3,
            "PowerKW": 22,
            "CurrentTypeID": 30
        },
        {
            "ID": 291234,
            "ConnectionTypeID": 25,
            "StatusTypeID": 50,
            "LevelID": 2,
            "PowerKW": 11,
            "CurrentTypeID": 20
        }
    ],
    "StatusTypeID": 50,
    "DateLastStatusUpdate": "2021-07-09T03:25:00Z",
    "MetadataValues": [
        {
            "ID": 16092,
            "MetadataFieldID": 4,
            "ItemValue": "Data from the German chargepoint registry provided by Bundesnetzagentur.de under the CC-BY 4.0 license"
        }
    ],
    "DataQualityLevel": 3,
    "DateCreated": "2021-07-08T10:04:00Z",
    "SubmissionStatusTypeID": 100
}