{
    "IsRecentlyVerified": false,
    "ID": 61735,
    "UUID": "8FD91873-F7C1-4CF5-B3B5-829295FF9BD0",
    "DataProviderID": 2,
    "DataProvidersReference": "72542",
    "OperatorID": 5,
    "UsageTypeID": 1,
    "AddressInfo": {
        "ID": 62081,
        "Title": "USC CAMPUS",
        "AddressLine1": "1630 San Pablo St",
        "Town": "Los Angeles",
        "StateOrProvince": "CA",
        "Postcode": "90033",
        "CountryID": 2,
        "Latitude": 34.064349,
        "Longitude": -118.200481,
        "ContactTelephone1": "888-758-4389",
        "AccessComments": "24 hours daily",
        "RelatedURL": "http://www.chargepoint.com/",
        "DistanceUnit": 0
    },
    "Connections": [
        {
            "ID": 78624,
            "ConnectionTypeID": 1,
            "LevelID": 2,
            "Amps": 16,
            "Voltage": 230,
            "PowerKW": 3,
            "CurrentTypeID": 10,
            "Quantity": 32
        }
    ],
    "DateLastStatusUpdate": "2019-04-06T04:01:00Z",
    "DataQualityLevel": 3,
    "DateCreated": "2016-03-03T11:38:00Z",
    "SubmissionStatusTypeID": 100
}