{
    "IsRecentlyVerified": false,
    "ID": 121750,
    "UUID": "939EB022-AB69-43F4-9993-7990E519BFB2",
    "DataProviderID": 2,
    "DataProvidersReference": "92438",
    "OperatorID": 5,
    "UsageTypeID": 1,
    "AddressInfo": {
        "ID": 122096,
        "Title": "DC SOLAR",
        "AddressLine1": "7602 S Avondale Blvd",
        "Town": "Avondale",
        "StateOrProvince": "AZ",
        "Postcode": "85323",
        "CountryID": 2,
        "Latitude": 33.3740167,
        "Longitude": -112.3194835,
        "ContactTelephone1": "888-758-4389",
        "AccessComments": "24 hours daily",
        "RelatedURL": "http://www.chargepoint.com/",
        "DistanceUnit": 0
    },
    "Connections": [
        {
            "ID": 171569,
            "ConnectionTypeID": 1,
            "LevelID": 2,
            "Amps": 16,
            "Voltage": 230,
            "PowerKW": 3,
            "CurrentTypeID": 10,
            "Quantity": 1
        }
    ],
    "DateLastStatusUpdate": "2019-12-24T09:09:00Z",
    "DataQualityLevel": 3,
    "DateCreated": "2019-04-06T05:02:00Z",
    "SubmissionStatusTypeID": 100
}