{
    "IsRecentlyVerified": false,
    "ID": 47675,
    "UUID": "457BF770-74AE-4AF7-8713-F4F40DC732AA",
    "DataProviderID": 1,
    "OperatorID": 3315,
    "OperatorsReference": "50904",
    "UsageTypeID": 1,
    "UsageCost": "free",
    "AddressInfo": {
        "ID": 48021,
        "Title": "Leverburgh Waiting Room",
        "AddressLine1": "1 Ferry Road",
        "Town": "Isle of Harris",
        "Postcode": "HS5 3UA",
        "CountryID": 1,
        "Latitude": 57.7666942019306,
        "Longitude": -7.02467373022454,
        "ContactTelephone1": "0800 066 5000 Calmac",
        "RelatedURL": "http://www.chargeyourcar.org.uk",
        "DistanceUnit": 0
    },
    "Connections": [
        {
            "ID": 58785,
            "ConnectionTypeID": 25,
            "StatusTypeID": 100,
            "LevelID": 2,
            "Amps": 32,
            "Voltage": 400,
            "PowerKW": 22,
            "CurrentTypeID": 20,
            "Quantity": 2
        }
    ],
    "NumberOfPoints": 2,
    "GeneralComments": "APT Charger",
    "StatusTypeID": 100,
    "DateLastStatusUpdate": "2020-03-08T06:14:00Z",
    "MetadataValues": [
        {
            "ID": 1455,
            "MetadataFieldID": 4,
            "ItemValue": "Contains public sector information licensed under the Open Government Licence v2.0. http://www.nationalarchives.gov.uk/doc/open-government-licence/version/2/"
        }
    ],
    "DataQualityLevel": 3,
    "DateCreated": "2015-06-05T08:10:00Z",
    "SubmissionStatusTypeID": 100
}