{
    "IsRecentlyVerified": false,
    "ID": 115161,
    "UUID": "611FB47E-B6DF-4282-8EDF-48CC56F116D7",
    "DataProviderID": 1,
    "DataProvidersReference": "CLD-00007",
    "OperatorID": 21,
    "UsageTypeID": 4,
    "UsageCost": "Mobi.E compatible card",
    "AddressInfo": {
        "ID": 115507,
        "Title": "CLD-00007",
        "AddressLine1": "Rua Isidoro Inácio Alves de Carvalho Campus 3",
        "Town": "Caldas da Rainha",
        "Postcode": "2500 - 321",
        "CountryID": 180,
        "Latitude": 39.395324,
        "Longitude": -9.135525,
        "AccessComments": "IPL Campus 3",
        "RelatedURL": "http://www.mobie.pt",
        "DistanceUnit": 0
    },
    "Connections": [
        {
            "ID": 162095,
            "ConnectionTypeID": 25,
            "StatusTypeID": 50,
            "LevelID": 2,
            "Amps": 32,
            "Voltage": 400,
            "PowerKW": 22,
            "CurrentTypeID": 20,
            "Quantity": 2
        }
    ],
    "NumberOfPoints": 2,
    "StatusTypeID": 50,
    "DateLastStatusUpdate": "2020-08-19T20:56:00Z",
    "DataQualityLevel": 3,
    "DateCreated": "2019-02-02T22:37:00Z",
    "SubmissionStatusTypeID": 100
}