{
    "IsRecentlyVerified": false,
    "ID": 179166,
    "UUID": "AFF19152-A82F-4ABD-B2D3-1AF92F23EA28",
    "DataProviderID": 29,
    "DataProvidersReference": "10428",
    "OperatorID": 86,
    "AddressInfo": {
        "ID": 179525,
        "Title": "Mühlhaldenstr. 109",
        "AddressLine1": "Mühlhaldenstr. 109",
        "Town": "Denkendorf",
        "Postcode": "73770",
        "CountryID": 87,
        "Latitude": 48.701083,
        "Longitude": 9.308387,
        "DistanceUnit": 0
    },
    "Connections": [
        {
            "ID": 280597,
            "ConnectionTypeID": 25,
            "StatusTypeID": 50,
            "LevelID": 2,
            "PowerKW": 22,
            "CurrentTypeID": 20
        },
        {
            "ID": 280598,
            "ConnectionTypeID": 25,
            "StatusTypeID": 50,
            "LevelID": 2,
            "PowerKW": 22,
            "CurrentTypeID": 20
        }
    ],
    "StatusTypeID": 50,
    "DateLastStatusUpdate": "2021-07-12T02:41:00Z",
    "MetadataValues": [
        {
            "ID": 11460,
            "MetadataFieldID": 4,
            "ItemValue": "Data from the German chargepoint registry provided by Bundesnetzagentur.de under the CC-BY 4.0 license"
        }
    ],
    "DataQualityLevel": 3,
    "DateCreated": "2021-07-08T09:59:00Z",
    "SubmissionStatusTypeID": 100
}