{
    "IsRecentlyVerified": false,
    "ID": 43385,
    "UUID": "07432268-E661-4F6C-8E75-8AA0FAA1D42A",
    "DataProviderID": 1,
    "OperatorID": 45,
    "UsageTypeID": 3,
    "UsageCost": "0,50€/kWh",
    "AddressInfo": {
        "ID": 43731,
        "Title": "Park and Ride Parkplatz Adenauerring",
        "AddressLine1": "Adenauerring",
        "Town": "Duderstadt",
        "StateOrProvince": "Landkreis Göttingen",
        "Postcode": "37115",
        "CountryID": 87,
        "Latitude": 51.5102444825632,
        "Longitude": 10.2725275011309,
        "AccessComments": "Öffentlicher kostenloses Parkplatz mit Camper-Stellplätzen und Chip-Stromsäule. Die Chips gibt es für 0,50€/kWh im 200m entfernten Supermarkt am Lottostand oder bei der Touristinformation.",
        "DistanceUnit": 0
    },
    "Connections": [
        {
            "ID": 52580,
            "ConnectionTypeID": 16,
            "StatusTypeID": 50,
            "LevelID": 2,
            "Amps": 16,
            "Voltage": 230,
            "PowerKW": 3.7,
            "CurrentTypeID": 10,
            "Quantity": 8
        }
    ],
    "NumberOfPoints": 8,
    "StatusTypeID": 50,
    "DateLastStatusUpdate": "2015-03-29T13:51:00Z",
    "DataQualityLevel": 1,
    "DateCreated": "2015-03-29T12:46:00Z",
    "SubmissionStatusTypeID": 200
}