{
    "UserComments": [
        {
            "ID": 3711,
            "ChargePointID": 4608,
            "CommentTypeID": 50,
            "UserName": "Andrew Bissell",
            "Comment": "This Tesla Roadster HPC EXISTS and WORKS\n\nTested on 7 February 2015\n\n70A charging was achieved \n\nThe only problem is that the connector is stiff in both turning and sliding the switch. This is due to it lying on the ground. \n\nPLEASE re-holster\n\n\n\n\n",
            "Rating": 4,
            "DateCreated": "2015-02-07T16:48:05.12Z",
            "CheckinStatusTypeID": 0
        },
        {
            "ID": 784,
            "ChargePointID": 4608,
            "CommentTypeID": 50,
            "UserName": "belbrown27",
            "Comment": "The is no charging point at this location now.  The staff have confirmed this.",
            "DateCreated": "2014-04-29T20:24:35.857Z",
            "User": {
                "ID": 1837,
                "Username": "belbrown27"
            },
            "CheckinStatusTypeID": 50
        },
        {
            "ID": 260,
            "ChargePointID": 4608,
            "CommentTypeID": 50,
            "UserName": "Andrew Bissell",
            "Comment": "This charger works despite being listed as not operational it is in fact working. ",
            "Rating": 4,
            "DateCreated": "2013-03-09T22:11:02.187Z",
            "User": {
                "ID": 1003,
                "Username": "Andrew Bissell"
            }
        },
        {
            "ID": 53,
            "ChargePointID": 4608,
            "CommentTypeID": 10,
            "UserName": "Andrew Bissell",
            "Comment": "Charged here on 25 November 2011 while presenting at Thrive for Energy. ",
            "DateCreated": "2011-12-07T00:06:06.05Z",
            "User": {
                "ID": 1003,
                "Username": "Andrew Bissell"
            }
        },
        {
            "ID": 18,
            "ChargePointID": 4608,
            "CommentTypeID": 10,
            "UserName": "Andrew Bissell",
            "Comment": "Used this Tesla HPC to charge in latr September 2011. All working great. Was told by the concierge that they are planning to permanently mark the space. At present it is unmarked hence easily ICEd. \n\nIf ICEd, here is the workaround used by me on several occasions:\nDrive past the charger space and turn immediately right onto footpath/golf cart track. \nDrive onto grass and park by charger\nCharge!\nGet coffee, lunch, whatever and tell Dalmahoy how much you appreciate the facility\n\nA request: Please roll up the cable after use and push the \"nozzle\" up into the hole under the charger unit. This keeps grass and muck out of it  ",
            "Rating": 4,
            "DateCreated": "2011-10-05T22:15:39.453Z",
            "User": {
                "ID": 1003,
                "Username": "Andrew Bissell"
            }
        }
    ],
    "IsRecentlyVerified": false,
    "ID": 4608,
    "UUID": "BEE73D8D-E8CA-48C1-AC64-FB697EFAD2DD",
    "DataProviderID": 1,
    "OperatorID": 19,
    "UsageTypeID": 1,
    "UsageCost": "Please spend some money with the Hotel and Country Club, e.g. a coffee, a snack or a round of golf",
    "AddressInfo": {
        "ID": 4553,
        "Title": "Dalmahoy Marriott Hotel & Country Club",
        "AddressLine1": "Kirknewton",
        "Town": "Edinburgh",
        "StateOrProvince": "Midlothian",
        "Postcode": "EH27 8EB",
        "CountryID": 1,
        "Latitude": 55.902951,
        "Longitude": -3.371006,
        "ContactTelephone1": "01313 331845",
        "ContactEmail": "frontdesk@dalmahoyhotelandcountryclub.co.uk",
        "AccessComments": "Speak to hotel concierge",
        "RelatedURL": "http://www.dalmahoyhotelandcountryclub.co.uk",
        "DistanceUnit": 0
    },
    "Connections": [
        {
            "ID": 3323,
            "ConnectionTypeID": 8,
            "StatusTypeID": 50,
            "LevelID": 2,
            "Amps": 70,
            "Voltage": 230,
            "PowerKW": 16,
            "CurrentTypeID": 10,
            "Quantity": 1
        }
    ],
    "NumberOfPoints": 1,
    "GeneralComments": "70A Tesla HPC - tested on a half dozen occasions. A great gateway to Edinburgh and the rest of Scotland for Tesla Roadster drivers. The coordinates represent the space with the Tesla HPC adjacent. It will be worth calling ahead to ask for the space to be coned off, especially on weekends when use of adjacent golf facilities is intensive and the space is often in use. Please when visiting inform the concierge and spend some money to thank the Marriot Dalmahoy Hotel and Country Club for the investment they put into creating this facility. This location was visited during the first John O'Groats to Lands End drive End-to-End of the UK by a production electric vehicle using public charging (search \"Tesla End-to-End\").",
    "DateLastConfirmed": "2011-06-05T17:22:00Z",
    "StatusTypeID": 100,
    "DateLastStatusUpdate": "2019-07-15T09:01:00Z",
    "DataQualityLevel": 1,
    "DateCreated": "2011-06-05T17:22:00Z",
    "SubmissionStatusTypeID": 200
}