{
    "IsRecentlyVerified": false,
    "ID": 53370,
    "UUID": "E1D56D14-40CF-4FBA-B036-90D16FC2BACF",
    "DataProviderID": 2,
    "DataProvidersReference": "69192",
    "OperatorID": 5,
    "UsageTypeID": 1,
    "AddressInfo": {
        "ID": 53716,
        "Title": "DISTRICT 214",
        "AddressLine1": "2901 Central Rd",
        "Town": "Rolling Meadows",
        "StateOrProvince": "IL",
        "Postcode": "60008",
        "CountryID": 2,
        "Latitude": 42.0658412,
        "Longitude": -88.0162886,
        "ContactTelephone1": "888-758-4389",
        "AccessComments": "24 hours daily",
        "RelatedURL": "http://www.chargepoint.com/",
        "DistanceUnit": 0
    },
    "Connections": [
        {
            "ID": 66485,
            "ConnectionTypeID": 1,
            "LevelID": 2,
            "Amps": 16,
            "Voltage": 230,
            "PowerKW": 3.7,
            "CurrentTypeID": 10,
            "Quantity": 2
        }
    ],
    "DateLastStatusUpdate": "2020-06-26T03:05:00Z",
    "DataQualityLevel": 3,
    "DateCreated": "2015-09-20T11:18:00Z",
    "SubmissionStatusTypeID": 100
}