{
    "IsRecentlyVerified": false,
    "ID": 75635,
    "UUID": "04C757E1-8029-4751-B5DD-8E014CB61506",
    "DataProviderID": 1,
    "OperatorID": 32,
    "OperatorsReference": "3991",
    "UsageTypeID": 4,
    "UsageCost": "Inclusive; for Polar Plus subscription members only. Parking fees apply",
    "AddressInfo": {
        "ID": 75981,
        "Title": "Newlands Shopping Centre",
        "AddressLine1": "Gold Street",
        "AddressLine2": "Leisure Village",
        "Town": "Kettering",
        "StateOrProvince": "Northamptonshire",
        "Postcode": "NN16 8AQ",
        "CountryID": 1,
        "Latitude": 52.401203,
        "Longitude": -0.726977,
        "RelatedURL": "http://www.newlandsshopping.com/Content.aspx?ContentName=Car-Park",
        "DistanceUnit": 0
    },
    "Connections": [
        {
            "ID": 109074,
            "ConnectionTypeID": 25,
            "StatusTypeID": 50,
            "LevelID": 2,
            "Amps": 16,
            "Voltage": 230,
            "PowerKW": 4,
            "CurrentTypeID": 10,
            "Quantity": 2
        }
    ],
    "NumberOfPoints": 2,
    "StatusTypeID": 50,
    "DateLastStatusUpdate": "2019-03-09T06:34:00Z",
    "DataQualityLevel": 1,
    "DateCreated": "2016-12-18T15:31:00Z",
    "SubmissionStatusTypeID": 200
}