{
    "MediaItems": [
        {
            "ID": 1078,
            "ChargePointID": 32393,
            "ItemURL": "https://s3-ap-southeast-2.amazonaws.com/openchargemap/images/NL/OCM32393/OCM-32393.orig.2015030919550613.jpg",
            "ItemThumbnailURL": "https://s3-ap-southeast-2.amazonaws.com/openchargemap/images/NL/OCM32393/OCM-32393.thmb.2015030919550613.jpg",
            "Comment": "",
            "IsEnabled": true,
            "IsVideo": false,
            "IsFeaturedItem": false,
            "IsExternalResource": false,
            "User": {
                "ID": 1107,
                "Username": "Someone_Just_"
            },
            "DateCreated": "2015-03-09T19:55:00Z"
        },
        {
            "ID": 1077,
            "ChargePointID": 32393,
            "ItemURL": "https://s3-ap-southeast-2.amazonaws.com/openchargemap/images/NL/OCM32393/OCM-32393.orig.2015030919541306.jpg",
            "ItemThumbnailURL": "https://s3-ap-southeast-2.amazonaws.com/openchargemap/images/NL/OCM32393/OCM-32393.thmb.2015030919541306.jpg",
            "Comment": "",
            "IsEnabled": true,
            "IsVideo": false,
            "IsFeaturedItem": false,
            "IsExternalResource": false,
            "User": {
                "ID": 1107,
                "Username": "Someone_Just_"
            },
            "DateCreated": "2015-03-09T19:54:00Z"
        }
    ],
    "IsRecentlyVerified": false,
    "ID": 32393,
    "UUID": "EC2D3E85-F114-4A55-AD46-0643C86182E9",
    "DataProviderID": 1,
    "OperatorID": 157,
    "OperatorsReference": "NewMotion ICUEVE000200",
    "UsageTypeID": 4,
    "UsageCost": "0.00 jaarabonnement",
    "AddressInfo": {
        "ID": 32739,
        "Title": "Verffabriek Los Blancos",
        "AddressLine1": "Wijngaardveld 15",
        "Town": "Aalst",
        "Postcode": "9300",
        "CountryID": 26,
        "Latitude": 50.96109902400943,
        "Longitude": 4.046413421630857,
        "ContactTelephone1": "088 0109500",
        "RelatedURL": "http://thenewmotion.nl/",
        "DistanceUnit": 0
    },
    "Connections": [
        {
            "ID": 35904,
            "ConnectionTypeID": 25,
            "StatusTypeID": 50,
            "LevelID": 2,
            "Amps": 16,
            "Voltage": 380,
            "PowerKW": 11,
            "CurrentTypeID": 20,
            "Quantity": 2
        }
    ],
    "NumberOfPoints": 2,
    "StatusTypeID": 50,
    "DateLastStatusUpdate": "2015-03-09T20:05:00Z",
    "DataQualityLevel": 3,
    "DateCreated": "2015-01-09T06:03:00Z",
    "SubmissionStatusTypeID": 100
}