{
    "IsRecentlyVerified": false,
    "ID": 90130,
    "UUID": "1F573EC8-08D4-40DA-B713-07F946BC82B3",
    "DataProviderID": 1,
    "OperatorID": 45,
    "UsageTypeID": 5,
    "AddressInfo": {
        "ID": 90476,
        "Title": "Marktangergarage",
        "AddressLine1": "Mühlenweg 5",
        "Town": "Sonthofen",
        "StateOrProvince": "Landkreis Oberallgäu",
        "Postcode": "87527",
        "CountryID": 87,
        "Latitude": 47.512982016375055,
        "Longitude": 10.28276916508184,
        "AccessComments": "Direkt nach der Einfahrt eine Wandseite mit 2 Wallboxen sowie 2 Schuko. Ab 30 min Parkgebühren 0,50€ pro 30 Minuten. 24/7 nutzbar.",
        "DistanceUnit": 0
    },
    "Connections": [
        {
            "ID": 127761,
            "ConnectionTypeID": 25,
            "StatusTypeID": 50,
            "LevelID": 2,
            "Amps": 32,
            "Voltage": 230,
            "PowerKW": 7.4,
            "CurrentTypeID": 10,
            "Quantity": 2
        },
        {
            "ID": 127762,
            "ConnectionTypeID": 28,
            "StatusTypeID": 50,
            "LevelID": 2,
            "Amps": 16,
            "Voltage": 230,
            "PowerKW": 3.7,
            "CurrentTypeID": 10,
            "Quantity": 2
        }
    ],
    "NumberOfPoints": 4,
    "StatusTypeID": 50,
    "DateLastStatusUpdate": "2017-07-11T08:43:00Z",
    "DataQualityLevel": 1,
    "DateCreated": "2017-07-11T08:43:00Z",
    "SubmissionStatusTypeID": 200
}