{
    "IsRecentlyVerified": false,
    "ID": 119994,
    "UUID": "3B73534A-8EAC-4C83-AAAE-138590AF0E5C",
    "DataProviderID": 2,
    "DataProvidersReference": "105054",
    "OperatorID": 5,
    "UsageTypeID": 1,
    "AddressInfo": {
        "ID": 120340,
        "Title": "LATITUDE MED",
        "AddressLine1": "1850 Old Main St",
        "Town": "Houston",
        "StateOrProvince": "TX",
        "Postcode": "77030",
        "CountryID": 2,
        "Latitude": 29.750758,
        "Longitude": -95.370187,
        "ContactTelephone1": "888-758-4389",
        "AccessComments": "24 hours daily",
        "RelatedURL": "http://www.chargepoint.com/",
        "DistanceUnit": 0
    },
    "Connections": [
        {
            "ID": 169301,
            "ConnectionTypeID": 1,
            "LevelID": 2,
            "Amps": 16,
            "Voltage": 230,
            "PowerKW": 3.7,
            "CurrentTypeID": 10,
            "Quantity": 4
        }
    ],
    "DateLastStatusUpdate": "2020-06-26T02:53:00Z",
    "DataQualityLevel": 3,
    "DateCreated": "2019-04-01T04:59:00Z",
    "SubmissionStatusTypeID": 100
}