{
    "IsRecentlyVerified": false,
    "ID": 116348,
    "UUID": "6B8687B3-5F3A-4AF1-9C0B-31E8954C3B9D",
    "DataProviderID": 1,
    "DataProvidersReference": "4977",
    "AddressInfo": {
        "ID": 116694,
        "Title": "Trollhättan Energi Grävlingen framsida",
        "AddressLine1": "Förrådsgatan 2",
        "Town": "TROLLHÄTTAN",
        "StateOrProvince": "VÄSTRA GÖTALAND",
        "Postcode": "46132",
        "CountryID": 216,
        "Latitude": 58.282467,
        "Longitude": 12.303506,
        "AccessComments": "Besöksparkering framför Trollhättan Energis reception",
        "DistanceUnit": 0
    },
    "Connections": [
        {
            "ID": 163882,
            "ConnectionTypeID": 0,
            "Reference": "1",
            "LevelID": 2,
            "Amps": 16,
            "Voltage": 400,
            "PowerKW": 11,
            "Comments": "Mode 3"
        },
        {
            "ID": 163883,
            "ConnectionTypeID": 0,
            "Reference": "2",
            "LevelID": 2,
            "Amps": 16,
            "Voltage": 400,
            "PowerKW": 11,
            "Comments": "Mode 3"
        },
        {
            "ID": 163884,
            "ConnectionTypeID": 0,
            "Reference": "3",
            "LevelID": 2,
            "Amps": 16,
            "Voltage": 400,
            "PowerKW": 11,
            "Comments": "Mode 3"
        },
        {
            "ID": 163885,
            "ConnectionTypeID": 0,
            "Reference": "4",
            "LevelID": 2,
            "Amps": 16,
            "Voltage": 400,
            "PowerKW": 11,
            "Comments": "Mode 3"
        },
        {
            "ID": 163886,
            "ConnectionTypeID": 0,
            "Reference": "5",
            "LevelID": 2,
            "Amps": 16,
            "Voltage": 400,
            "PowerKW": 11,
            "Comments": "Mode 3"
        }
    ],
    "NumberOfPoints": 5,
    "DateLastStatusUpdate": "2020-05-26T08:22:00Z",
    "DataQualityLevel": 2,
    "DateCreated": "2019-02-11T09:16:00Z",
    "SubmissionStatusTypeID": 100
}