{
    "IsRecentlyVerified": false,
    "ID": 116499,
    "UUID": "7688D338-DE8D-4917-9EE3-836C70A6314C",
    "DataProviderID": 1,
    "DataProvidersReference": "4917",
    "AddressInfo": {
        "ID": 116845,
        "Title": "Bilprovningen Sundsvall",
        "AddressLine1": "Tegelvägen 12",
        "Town": "SUNDSVALL",
        "StateOrProvince": "VÄSTERNORRLAND",
        "Postcode": "85350",
        "CountryID": 216,
        "Latitude": 62.40028,
        "Longitude": 17.24866,
        "AccessComments": "Bilprovningen i Sundsvall, laddstationen finns strax utanför entrén.",
        "DistanceUnit": 0
    },
    "Connections": [
        {
            "ID": 164769,
            "ConnectionTypeID": 0,
            "Reference": "1",
            "LevelID": 2,
            "Amps": 16,
            "Voltage": 400,
            "PowerKW": 11,
            "Comments": "Mode 3"
        },
        {
            "ID": 164770,
            "ConnectionTypeID": 0,
            "Reference": "2",
            "LevelID": 2,
            "Amps": 16,
            "Voltage": 400,
            "PowerKW": 11,
            "Comments": "Mode 3"
        }
    ],
    "NumberOfPoints": 2,
    "DateLastStatusUpdate": "2020-05-26T08:25:00Z",
    "DataQualityLevel": 2,
    "DateCreated": "2019-02-11T09:16:00Z",
    "SubmissionStatusTypeID": 100
}