{
    "IsRecentlyVerified": false,
    "ID": 4959,
    "UUID": "E640CD94-1E39-40EB-BD06-1B6DED901DE1",
    "DataProviderID": 2,
    "DataProvidersReference": "40004",
    "OperatorID": 39,
    "UsageTypeID": 1,
    "AddressInfo": {
        "ID": 4899,
        "Title": "BWI Airport - Daily Ground Floor",
        "AddressLine1": "7062 Elm Road",
        "Town": "Baltimore",
        "StateOrProvince": "MD",
        "Postcode": "21240",
        "CountryID": 2,
        "Latitude": 39.1869346,
        "Longitude": -76.6776287,
        "ContactTelephone1": "800-663-5633",
        "AccessComments": "MO: 12:00am-12:00am; TU: 12:00am-12:00am; WE: 12:00am-12:00am; TH: 12:00am-12:00am; FR: 12:00am-12:00am; SA: 12:00am-12:00am; SU: 12:00am-12:00am",
        "RelatedURL": "http://www.semacharge.com/",
        "DistanceUnit": 0
    },
    "Connections": [
        {
            "ID": 3288,
            "ConnectionTypeID": 1,
            "LevelID": 2,
            "Amps": 16,
            "Voltage": 230,
            "PowerKW": 3,
            "CurrentTypeID": 10,
            "Quantity": 4
        },
        {
            "ID": 20977,
            "ConnectionTypeID": 1,
            "LevelID": 2,
            "Quantity": 4
        }
    ],
    "DateLastConfirmed": "2011-05-31T00:00:00Z",
    "StatusTypeID": 0,
    "DateLastStatusUpdate": "2019-04-06T04:03:00Z",
    "DataQualityLevel": 1,
    "DateCreated": "2011-07-04T18:02:00Z",
    "SubmissionStatusTypeID": 100
}