{
    "IsRecentlyVerified": false,
    "ID": 74902,
    "UUID": "4BCE7630-9389-460F-B8BC-B13CE86F5FAF",
    "DataProviderID": 1,
    "OperatorID": 45,
    "UsageTypeID": 5,
    "AddressInfo": {
        "ID": 75248,
        "Title": "Tiefgarage St. Josef Hospital",
        "AddressLine1": "Solmsstraße 15",
        "Town": "Wiesbaden",
        "StateOrProvince": "Hessen",
        "Postcode": "65189",
        "CountryID": 87,
        "Latitude": 50.07633,
        "Longitude": 8.25473999999997,
        "AccessComments": "Am Ende der durchgehend nutzbaren Tiefgarage sind zwei rot markierte Parkplätze vor der roten Ladesäule.",
        "DistanceUnit": 0
    },
    "Connections": [
        {
            "ID": 108067,
            "ConnectionTypeID": 25,
            "StatusTypeID": 50,
            "LevelID": 2,
            "Amps": 32,
            "Voltage": 400,
            "PowerKW": 22,
            "CurrentTypeID": 20,
            "Quantity": 2
        },
        {
            "ID": 108068,
            "ConnectionTypeID": 28,
            "StatusTypeID": 50,
            "LevelID": 2,
            "Amps": 16,
            "Voltage": 230,
            "PowerKW": 3.7,
            "CurrentTypeID": 10,
            "Quantity": 2
        }
    ],
    "NumberOfPoints": 2,
    "StatusTypeID": 50,
    "DateLastStatusUpdate": "2016-12-07T12:43:00Z",
    "DataQualityLevel": 1,
    "DateCreated": "2016-12-07T12:43:00Z",
    "SubmissionStatusTypeID": 200
}