{
    "IsRecentlyVerified": false,
    "ID": 6933,
    "UUID": "212AF522-A2F8-4286-BA43-C2EBF9FD4B0B",
    "DataProviderID": 1,
    "UsageTypeID": 1,
    "UsageCost": "Free",
    "AddressInfo": {
        "ID": 6834,
        "Title": "Parking Soufflot-Panthéon",
        "AddressLine1": "22, Rue Soufflot",
        "AddressLine2": "",
        "Town": "Paris",
        "StateOrProvince": "",
        "Postcode": " 75005",
        "CountryID": 80,
        "Latitude": 48.8472745,
        "Longitude": 2.3417546000000584,
        "ContactTelephone1": "+33 1 43 26 15 54",
        "ContactTelephone2": "",
        "ContactEmail": "p750501@vincipark.com",
        "AccessComments": "",
        "DistanceUnit": 0
    },
    "Connections": [],
    "NumberOfPoints": 1,
    "GeneralComments": "",
    "DateLastConfirmed": "2011-10-10T18:48:00Z",
    "StatusTypeID": 0,
    "DateLastStatusUpdate": "2011-10-10T18:48:00Z",
    "DataQualityLevel": 1,
    "DateCreated": "2011-10-10T18:48:00Z",
    "SubmissionStatusTypeID": 200
}