{
    "IsRecentlyVerified": false,
    "ID": 188128,
    "UUID": "7F7B9995-D2BD-465D-A538-B95980FA27E4",
    "DataProviderID": 18,
    "DataProvidersReference": "892690ce6f290b95b763398d21584f85",
    "OperatorID": 3,
    "UsageTypeID": 1,
    "AddressInfo": {
        "ID": 188487,
        "Title": "Newcastle General Hospital, Biomedical Research Centre, Nuns Moor Rd",
        "AddressLine1": "Newcastle General Hospital, Biomedical Research Centre, Nuns Moor Rd",
        "Town": "Newcastle",
        "Postcode": "NE4 6BE",
        "CountryID": 1,
        "Latitude": 54.978794,
        "Longitude": -1.643839,
        "AccessComments": "",
        "RelatedURL": "http://pod-point.com",
        "DistanceUnit": 0
    },
    "Connections": [
        {
            "ID": 303607,
            "ConnectionTypeID": 25,
            "Reference": "0",
            "StatusTypeID": 50,
            "LevelID": 2,
            "Amps": 32,
            "Voltage": 230,
            "PowerKW": 7,
            "CurrentTypeID": 10
        },
        {
            "ID": 303608,
            "ConnectionTypeID": 3,
            "Reference": "1",
            "StatusTypeID": 50,
            "LevelID": 2,
            "Amps": 16,
            "Voltage": 230,
            "PowerKW": 3.7,
            "CurrentTypeID": 10
        }
    ],
    "StatusTypeID": 0,
    "DateLastStatusUpdate": "2021-07-12T03:39:00Z",
    "MetadataValues": [
        {
            "ID": 20368,
            "MetadataFieldID": 4,
            "ItemValue": "Contains public sector information licensed under the Open Government Licence v2.0. http://www.nationalarchives.gov.uk/doc/open-government-licence/version/2/"
        }
    ],
    "DataQualityLevel": 3,
    "DateCreated": "2021-07-12T03:39:00Z",
    "SubmissionStatusTypeID": 100
}