{
    "IsRecentlyVerified": true,
    "DateLastVerified": "2021-08-19T08:53:00Z",
    "ID": 188826,
    "UUID": "E346C161-5EA9-4D59-A44B-6C705D3ED240",
    "DataProviderID": 1,
    "OperatorID": 3429,
    "UsageTypeID": 1,
    "UsageCost": "0,39",
    "AddressInfo": {
        "ID": 189185,
        "Title": "Q1 Autostrom - Osnabrück, Bürener Str.",
        "AddressLine1": "",
        "Town": "Osnabrück",
        "StateOrProvince": "Niedersachsen",
        "Postcode": "49090",
        "CountryID": 87,
        "Latitude": 52.304352620640486,
        "Longitude": 8.018269359794886,
        "ContactTelephone1": "0541602800",
        "DistanceUnit": 0
    },
    "Connections": [
        {
            "ID": 305093,
            "ConnectionTypeID": 25,
            "StatusTypeID": 50,
            "LevelID": 2,
            "PowerKW": 22,
            "CurrentTypeID": 20,
            "Quantity": 1
        }
    ],
    "NumberOfPoints": 1,
    "StatusTypeID": 150,
    "DateLastStatusUpdate": "2021-08-30T08:38:00Z",
    "DataQualityLevel": 1,
    "DateCreated": "2021-08-19T08:53:00Z",
    "SubmissionStatusTypeID": 200
}