{
    "IsRecentlyVerified": false,
    "ID": 173076,
    "UUID": "08E391C6-F4CC-4478-AB02-59D30FF6AAB5",
    "DataProviderID": 1,
    "OperatorID": 3,
    "OperatorsReference": "t54_hu1_4019_011",
    "UsageTypeID": 4,
    "UsageCost": "£0.25/kWh",
    "AddressInfo": {
        "ID": 173435,
        "Title": "Lidl-Torquay",
        "AddressLine1": "St Marychurch Road",
        "Town": "Torquay",
        "Postcode": "TQ1 3HL",
        "CountryID": 1,
        "Latitude": 50.47474,
        "Longitude": -3.53023,
        "DistanceUnit": 0
    },
    "Connections": [
        {
            "ID": 264820,
            "ConnectionTypeID": 1036,
            "StatusTypeID": 50,
            "LevelID": 3,
            "PowerKW": 43,
            "CurrentTypeID": 20,
            "Quantity": 1
        },
        {
            "ID": 264823,
            "ConnectionTypeID": 33,
            "StatusTypeID": 50,
            "LevelID": 3,
            "PowerKW": 50,
            "CurrentTypeID": 30,
            "Quantity": 1
        },
        {
            "ID": 264824,
            "ConnectionTypeID": 2,
            "StatusTypeID": 50,
            "LevelID": 3,
            "PowerKW": 50,
            "CurrentTypeID": 30,
            "Quantity": 1
        }
    ],
    "NumberOfPoints": 3,
    "GeneralComments": "This is a Pod Point rapid charger installed at the Lidl super store at St Marychurch Road, Torquay",
    "StatusTypeID": 50,
    "DateLastStatusUpdate": "2021-03-22T19:33:00Z",
    "DataQualityLevel": 1,
    "DateCreated": "2021-03-02T22:01:00Z",
    "SubmissionStatusTypeID": 200
}