{
    "IsRecentlyVerified": false,
    "ID": 16940,
    "UUID": "47046E48-80C0-4953-B1C9-25420ED038C5",
    "DataProviderID": 22,
    "DataProvidersReference": "980017891FF67CF8A20F23AA810E7B5A",
    "AddressInfo": {
        "ID": 17285,
        "Title": "秋田三菱能代店",
        "AddressLine1": "秋田県能代市下古川布20-13",
        "CountryID": 114,
        "Latitude": 40.18691368,
        "Longitude": 140.0437823,
        "ContactTelephone1": "0185-52-7153",
        "DistanceUnit": 0
    },
    "Connections": [
        {
            "ID": 17181,
            "ConnectionTypeID": 2,
            "LevelID": 2,
            "Amps": 100,
            "Voltage": 480,
            "PowerKW": 48,
            "Quantity": 1
        }
    ],
    "DateLastStatusUpdate": "2013-06-29T08:51:00Z",
    "DataQualityLevel": 2,
    "DateCreated": "2013-06-29T08:51:00Z",
    "SubmissionStatusTypeID": 200
}