{
    "IsRecentlyVerified": false,
    "ID": 128283,
    "UUID": "0D3D2B85-DCFC-483C-9A41-22E7A8CCBAC9",
    "DataProviderID": 1,
    "OperatorID": 23,
    "OperatorsReference": "50735",
    "UsageTypeID": 4,
    "AddressInfo": {
        "ID": 128629,
        "Title": "City Center Garage",
        "AddressLine1": "125 N Dixie Hwy",
        "Town": "West Palm Beach",
        "StateOrProvince": "Florida",
        "Postcode": "33401",
        "CountryID": 2,
        "Latitude": 26.714202,
        "Longitude": -80.053767,
        "ContactTelephone1": "(561) 822-1500",
        "DistanceUnit": 0
    },
    "Connections": [
        {
            "ID": 179572,
            "ConnectionTypeID": 30,
            "StatusTypeID": 50,
            "LevelID": 2,
            "PowerKW": 13,
            "CurrentTypeID": 20,
            "Quantity": 6
        }
    ],
    "NumberOfPoints": 6,
    "GeneralComments": "6 Tesla Connectors, up to 13kW.Available to the public. Self park.",
    "StatusTypeID": 50,
    "DateLastStatusUpdate": "2019-06-21T06:03:00Z",
    "DataQualityLevel": 1,
    "DateCreated": "2019-06-21T06:03:00Z",
    "SubmissionStatusTypeID": 200
}