{
    "UserComments": [
        {
            "ID": 21445,
            "ChargePointID": 130778,
            "CommentTypeID": 10,
            "UserName": "Erna_Schleck",
            "Comment": "Am Sonntag dort geladen",
            "Rating": 5,
            "DateCreated": "2019-09-01T11:52:46.277Z",
            "User": {
                "ID": 4573,
                "Username": "Erna_Schleck"
            },
            "CheckinStatusTypeID": 10
        }
    ],
    "MediaItems": [
        {
            "ID": 19251,
            "ChargePointID": 130778,
            "ItemURL": "https://s3-ap-southeast-2.amazonaws.com/openchargemap/images/DE/OCM130778/OCM-130778.orig.2019081617595025.jpg",
            "ItemThumbnailURL": "https://s3-ap-southeast-2.amazonaws.com/openchargemap/images/DE/OCM130778/OCM-130778.thmb.2019081617595025.jpg",
            "Comment": "Grauer Stromverteiler zwischen den Parkplatzreihen",
            "IsEnabled": true,
            "IsVideo": false,
            "IsFeaturedItem": false,
            "IsExternalResource": false,
            "User": {
                "ID": 4573,
                "Username": "Erna_Schleck"
            },
            "DateCreated": "2019-08-16T18:00:00Z"
        }
    ],
    "IsRecentlyVerified": false,
    "ID": 130778,
    "UUID": "D81C7EB9-2589-42B7-B1F0-600DCF5CBBC8",
    "DataProviderID": 1,
    "OperatorID": 45,
    "UsageTypeID": 0,
    "AddressInfo": {
        "ID": 131124,
        "Title": "Supermarkt Rewe Notladepunkt",
        "AddressLine1": "Vor dem Kampe 1",
        "Town": "Groß Förste",
        "StateOrProvince": "Landkreis Hildesheim",
        "Postcode": "31180",
        "CountryID": 87,
        "Latitude": 52.2029834459639,
        "Longitude": 9.91534804612934,
        "AccessComments": "Auf dem Parkplatz des Rewe Supermarkts am straßenseitigen Rand ist im Grünstreifen ein Stromkasten mit 2 x CEE blau und einer roten CEE Dose. Wird z.B. vom Hähnchenbrater Max und Moritz genutzt. Es ist unbekannt, ob der Strom für alle freigegeben ist, daher Verwendung als Notladepunkt!",
        "DistanceUnit": 0
    },
    "Connections": [
        {
            "ID": 183103,
            "ConnectionTypeID": 28,
            "StatusTypeID": 50,
            "LevelID": 2,
            "Amps": 16,
            "Voltage": 230,
            "PowerKW": 3.7,
            "CurrentTypeID": 10,
            "Quantity": 3
        },
        {
            "ID": 183104,
            "ConnectionTypeID": 17,
            "StatusTypeID": 50,
            "LevelID": 2,
            "Amps": 32,
            "Voltage": 400,
            "PowerKW": 22,
            "CurrentTypeID": 20,
            "Quantity": 1
        }
    ],
    "NumberOfPoints": 3,
    "StatusTypeID": 50,
    "DateLastStatusUpdate": "2019-09-06T21:35:00Z",
    "DataQualityLevel": 1,
    "DateCreated": "2019-08-16T05:18:00Z",
    "SubmissionStatusTypeID": 200
}