{
    "IsRecentlyVerified": false,
    "ID": 32621,
    "UUID": "8AE63418-59BC-49B0-AC93-0453701FC8FA",
    "DataProviderID": 26,
    "DataProvidersReference": "47670",
    "OperatorID": 178,
    "OperatorsReference": "EVnetNL AL821",
    "UsageCost": "0.00 jaarabonnement",
    "AddressInfo": {
        "ID": 32967,
        "Title": "Sint Annastraat",
        "AddressLine1": "Sint Annastraat",
        "Town": "Sluis",
        "Postcode": "4524 JA",
        "CountryID": 159,
        "Latitude": 51.309259,
        "Longitude": 3.382141,
        "ContactTelephone1": "0800-3522365",
        "RelatedURL": "http://www.evnet.nl",
        "DistanceUnit": 0
    },
    "Connections": [
        {
            "ID": 36132,
            "ConnectionTypeID": 25,
            "LevelID": 2,
            "PowerKW": 11,
            "CurrentTypeID": 10
        }
    ],
    "NumberOfPoints": 2,
    "StatusTypeID": 50,
    "DateLastStatusUpdate": "2016-06-04T02:38:00Z",
    "DataQualityLevel": 3,
    "DateCreated": "2015-01-09T06:03:00Z",
    "SubmissionStatusTypeID": 100
}