{
    "IsRecentlyVerified": false,
    "ID": 5926,
    "UUID": "713DC27E-203A-47E0-B362-000ABC1F033A",
    "DataProviderID": 1,
    "OperatorID": 1,
    "UsageTypeID": 1,
    "AddressInfo": {
        "ID": 5848,
        "Title": "Castle Air Museum",
        "AddressLine1": "5050 Santa Fe Drive",
        "Town": "Atwater",
        "StateOrProvince": "California",
        "CountryID": 2,
        "Latitude": 37.3652457378772,
        "Longitude": -120.578298568725,
        "DistanceUnit": 0
    },
    "Connections": [
        {
            "ID": 673,
            "ConnectionTypeID": 11,
            "LevelID": 2,
            "Quantity": 1
        }
    ],
    "NumberOfPoints": 1,
    "StatusTypeID": 50,
    "DateLastStatusUpdate": "2011-06-24T00:00:00Z",
    "DateCreated": "2011-09-13T12:41:00Z",
    "SubmissionStatusTypeID": 200
}