{
    "IsRecentlyVerified": false,
    "ID": 20146,
    "UUID": "3B97DB38-6613-4130-BAD1-6606BAE5887E",
    "DataProviderID": 1,
    "OperatorID": 1,
    "UsageTypeID": 0,
    "UsageCost": "",
    "AddressInfo": {
        "ID": 20491,
        "Title": "Athome",
        "AddressLine1": "4 Rue Jacques Terrier",
        "AddressLine2": "",
        "Town": "",
        "StateOrProvince": "Pau",
        "Postcode": "64000",
        "CountryID": 80,
        "Latitude": 43.29755,
        "Longitude": -0.36113,
        "ContactTelephone1": "",
        "ContactTelephone2": "",
        "ContactEmail": "",
        "AccessComments": "Ouvert à tous",
        "RelatedURL": "",
        "DistanceUnit": 0
    },
    "Connections": [],
    "GeneralComments": "",
    "StatusTypeID": 50,
    "DateLastStatusUpdate": "2013-11-04T21:22:00Z",
    "DataQualityLevel": 1,
    "DateCreated": "2013-11-04T00:02:00Z",
    "SubmissionStatusTypeID": 200
}