{
    "IsRecentlyVerified": false,
    "ID": 17948,
    "UUID": "119F8725-482F-4400-A134-A7D039DE4706",
    "DataProviderID": 22,
    "DataProvidersReference": "A90218782025C48E09BA0436CF30D029",
    "AddressInfo": {
        "ID": 18293,
        "Title": "倉吉市役所",
        "AddressLine1": "鳥取県倉吉市葵町727-2",
        "CountryID": 114,
        "Latitude": 35.42975556,
        "Longitude": 133.8255066,
        "ContactTelephone1": "0858-22-8168",
        "DistanceUnit": 0
    },
    "Connections": [
        {
            "ID": 18189,
            "ConnectionTypeID": 2,
            "LevelID": 2,
            "Amps": 100,
            "Voltage": 480,
            "PowerKW": 48,
            "Quantity": 1
        }
    ],
    "DateLastStatusUpdate": "2013-06-29T09:05:00Z",
    "DataQualityLevel": 2,
    "DateCreated": "2013-06-29T09:05:00Z",
    "SubmissionStatusTypeID": 200
}