{
    "IsRecentlyVerified": false,
    "ID": 149962,
    "UUID": "176CFA05-48A0-41BE-A6E8-5FFA93E95C07",
    "DataProviderID": 1,
    "OperatorID": 80,
    "UsageTypeID": 4,
    "AddressInfo": {
        "ID": 150315,
        "Title": "U2 Supermercato Cuggiono | EnelX",
        "AddressLine1": "Via Giuseppe Parini, 9",
        "Town": "Cuggiono",
        "StateOrProvince": "MI",
        "Postcode": "20012",
        "CountryID": 112,
        "Latitude": 45.51393364486373,
        "Longitude": 8.8072851848367,
        "ContactTelephone1": "800.069.850",
        "RelatedURL": "https://www.enelx.com/it/it/emobility",
        "DistanceUnit": 0
    },
    "Connections": [
        {
            "ID": 208196,
            "ConnectionTypeID": 25,
            "StatusTypeID": 50,
            "LevelID": 2,
            "Amps": 32,
            "Voltage": 400,
            "PowerKW": 22,
            "CurrentTypeID": 20,
            "Quantity": 2
        }
    ],
    "NumberOfPoints": 2,
    "GeneralComments": "\tLUN -SAB 08:00 -20:00 / DOM 08:30 - 13:00",
    "StatusTypeID": 50,
    "DateLastStatusUpdate": "2020-03-09T17:36:00Z",
    "DataQualityLevel": 1,
    "DateCreated": "2020-03-09T17:36:00Z",
    "SubmissionStatusTypeID": 200
}