{
    "IsRecentlyVerified": false,
    "ID": 111788,
    "UUID": "E34CFD36-E22D-4464-9009-16D0136E7598",
    "DataProviderID": 2,
    "DataProvidersReference": "92568",
    "OperatorID": 5,
    "UsageTypeID": 1,
    "AddressInfo": {
        "ID": 112134,
        "Title": "DEALERSHIP80423",
        "AddressLine1": "872 Copper Crescent",
        "Town": "Thunder Bay",
        "StateOrProvince": "ON",
        "Postcode": "P7B",
        "CountryID": 44,
        "Latitude": 48.4148606,
        "Longitude": -89.256877,
        "ContactTelephone1": "888-758-4389",
        "AccessComments": "24 hours daily",
        "RelatedURL": "http://www.chargepoint.com/",
        "DistanceUnit": 0
    },
    "Connections": [
        {
            "ID": 157287,
            "ConnectionTypeID": 1,
            "LevelID": 2,
            "Amps": 16,
            "Voltage": 230,
            "PowerKW": 3,
            "CurrentTypeID": 10,
            "Quantity": 2
        }
    ],
    "DateLastStatusUpdate": "2019-12-24T09:25:00Z",
    "DataQualityLevel": 3,
    "DateCreated": "2018-10-18T23:37:00Z",
    "SubmissionStatusTypeID": 100
}