{
    "IsRecentlyVerified": false,
    "ID": 118274,
    "UUID": "A211A315-463C-46AB-AAB3-94A5559A233A",
    "DataProviderID": 1,
    "OperatorID": 80,
    "UsageTypeID": 4,
    "AddressInfo": {
        "ID": 118620,
        "Title": "Castellaneta Europa Unita | EnelX",
        "AddressLine1": "Piazza dell'Europa Unita",
        "Town": "Castellaneta",
        "StateOrProvince": "TA",
        "Postcode": "74011",
        "CountryID": 112,
        "Latitude": 40.62694381913437,
        "Longitude": 16.93463589675548,
        "ContactTelephone1": "800.069.850",
        "RelatedURL": "https://www.enelx.com/it/it/emobility",
        "DistanceUnit": 0
    },
    "Connections": [
        {
            "ID": 167349,
            "ConnectionTypeID": 25,
            "StatusTypeID": 50,
            "LevelID": 2,
            "Amps": 32,
            "Voltage": 400,
            "PowerKW": 22,
            "CurrentTypeID": 20,
            "Quantity": 2
        }
    ],
    "NumberOfPoints": 2,
    "StatusTypeID": 50,
    "DateLastStatusUpdate": "2019-03-20T17:22:00Z",
    "DataQualityLevel": 1,
    "DateCreated": "2019-03-20T17:22:00Z",
    "SubmissionStatusTypeID": 200
}