{
    "IsRecentlyVerified": false,
    "ID": 65292,
    "UUID": "5B06D5EC-2C5E-4C46-B51F-E4ECCC0FD2F7",
    "DataProviderID": 1,
    "OperatorID": 45,
    "UsageTypeID": 6,
    "AddressInfo": {
        "ID": 65638,
        "Title": "Hotel Dannegarden",
        "AddressLine1": "Strandgatan 32",
        "Town": "Trelleborg",
        "StateOrProvince": "Trelleborg",
        "Postcode": "23162",
        "CountryID": 216,
        "Latitude": 55.37411809042945,
        "Longitude": 13.147288661772443,
        "ContactTelephone1": "+4641048180",
        "AccessComments": "För gäst! Informationen pa receptionen. Tesla Destination Charging location.",
        "RelatedURL": "http://www.dannegarden.se/",
        "DistanceUnit": 0
    },
    "Connections": [
        {
            "ID": 89909,
            "ConnectionTypeID": 25,
            "StatusTypeID": 50,
            "LevelID": 2,
            "Amps": 16,
            "Voltage": 400,
            "PowerKW": 11,
            "CurrentTypeID": 20,
            "Quantity": 1
        }
    ],
    "NumberOfPoints": 1,
    "StatusTypeID": 50,
    "DateLastStatusUpdate": "2016-04-26T09:13:00Z",
    "DataQualityLevel": 1,
    "DateCreated": "2016-04-26T09:13:00Z",
    "SubmissionStatusTypeID": 200
}