{
    "IsRecentlyVerified": false,
    "ID": 68942,
    "UUID": "C737EAD9-C658-4275-8A28-0934BC48C0B6",
    "DataProviderID": 1,
    "DataProvidersReference": "3429",
    "AddressInfo": {
        "ID": 69288,
        "Title": "Göteborg Energi - Linnéplatsen",
        "AddressLine1": "Linnéplatsen 1",
        "Town": "GÖTEBORG",
        "StateOrProvince": "VÄSTRA GÖTALAND",
        "Postcode": "41310",
        "CountryID": 216,
        "Latitude": 57.6907,
        "Longitude": 11.95114,
        "AccessComments": "Parkeringen vid Lilla Soffbutiken",
        "DistanceUnit": 0
    },
    "Connections": [
        {
            "ID": 96667,
            "ConnectionTypeID": 0,
            "Reference": "1",
            "LevelID": 2,
            "Amps": 100,
            "Voltage": 500,
            "PowerKW": 50,
            "Comments": "Mode 4"
        },
        {
            "ID": 96668,
            "ConnectionTypeID": 0,
            "Reference": "2",
            "LevelID": 2,
            "Amps": 100,
            "Voltage": 500,
            "PowerKW": 50,
            "Comments": "Mode 4"
        },
        {
            "ID": 96669,
            "ConnectionTypeID": 0,
            "Reference": "3",
            "LevelID": 2,
            "Amps": 32,
            "Voltage": 400,
            "PowerKW": 22,
            "Comments": "Mode 3"
        }
    ],
    "NumberOfPoints": 3,
    "DateLastStatusUpdate": "2020-05-26T08:21:00Z",
    "DataQualityLevel": 2,
    "DateCreated": "2016-06-25T03:52:00Z",
    "SubmissionStatusTypeID": 100
}