{
    "IsRecentlyVerified": false,
    "ID": 13753,
    "UUID": "87357853-97C7-436F-A6BF-242A91229772",
    "DataProviderID": 15,
    "DataProvidersReference": "11780",
    "OperatorID": 5,
    "AddressInfo": {
        "ID": 13650,
        "Title": "292-350 Grasmere Ave",
        "AddressLine1": "292-350 Grasmere Ave",
        "Town": "Fairfield",
        "StateOrProvince": "Connecticut",
        "Postcode": "6824",
        "CountryID": 2,
        "Latitude": 41.15805,
        "Longitude": -73.24037,
        "ContactTelephone1": "(203) 319-9544",
        "RelatedURL": "http://carstations.com/11780",
        "DistanceUnit": 0
    },
    "Connections": [
        {
            "ID": 11202,
            "ConnectionTypeID": 1,
            "Reference": "J1772",
            "LevelID": 2
        }
    ],
    "StatusTypeID": 0,
    "DateLastStatusUpdate": "2017-11-04T14:04:00Z",
    "DataQualityLevel": 2,
    "DateCreated": "2012-12-06T11:08:00Z",
    "SubmissionStatusTypeID": 100
}