{
    "IsRecentlyVerified": false,
    "ID": 101291,
    "UUID": "C010E5CD-C8A2-4C6D-A8F5-E13823564F4F",
    "DataProviderID": 1,
    "OperatorID": 69,
    "UsageTypeID": 4,
    "AddressInfo": {
        "ID": 101637,
        "Title": "Mitarbeiterparkplatz ÜZ Lülsfeld",
        "AddressLine1": "Schallfelder Straße 12",
        "Town": "Lülsfeld",
        "StateOrProvince": "Gerolzhofen (VGem)",
        "Postcode": "97511",
        "CountryID": 87,
        "Latitude": 49.86757265169183,
        "Longitude": 10.327201282070178,
        "ContactTelephone1": "+49 9382 / 6040",
        "AccessComments": "6 x 22kW Ladestationen mit einer Anschlussleistung von 43kW, die mit Lastmanagement verteilt wird. Sollten die Plätze belegt sein, so steht die Säule am Haupteingang zur Verfügung.",
        "RelatedURL": "http://www.uez.de/",
        "DistanceUnit": 0
    },
    "Connections": [
        {
            "ID": 143009,
            "ConnectionTypeID": 25,
            "StatusTypeID": 50,
            "LevelID": 2,
            "Amps": 32,
            "Voltage": 400,
            "PowerKW": 22,
            "CurrentTypeID": 20,
            "Quantity": 6
        }
    ],
    "NumberOfPoints": 6,
    "StatusTypeID": 50,
    "DateLastStatusUpdate": "2018-03-23T13:19:00Z",
    "DataQualityLevel": 1,
    "DateCreated": "2018-03-23T13:19:00Z",
    "SubmissionStatusTypeID": 200
}