{
    "IsRecentlyVerified": false,
    "ID": 13800,
    "UUID": "D4A406D2-4013-4C4D-B12B-39755C85ADF9",
    "DataProviderID": 15,
    "DataProvidersReference": "24828",
    "OperatorID": 31,
    "UsageTypeID": 1,
    "AddressInfo": {
        "ID": 13697,
        "Title": "19800 S. Vermont Ave.",
        "AddressLine1": "19800 S. Vermont Ave.",
        "Town": "Torrance",
        "StateOrProvince": "CA",
        "Postcode": "90502",
        "CountryID": 2,
        "Latitude": 33.8507,
        "Longitude": -118.29031,
        "ContactTelephone1": "(310) 781-9100",
        "RelatedURL": "http://carstations.com/24828",
        "DistanceUnit": 0
    },
    "Connections": [
        {
            "ID": 11247,
            "ConnectionTypeID": 0,
            "Reference": "SPI",
            "Quantity": 1
        },
        {
            "ID": 13229,
            "ConnectionTypeID": 1,
            "Reference": "J1772",
            "LevelID": 2
        }
    ],
    "NumberOfPoints": 2,
    "StatusTypeID": 0,
    "DateLastStatusUpdate": "2017-11-04T14:04:00Z",
    "DataQualityLevel": 2,
    "DateCreated": "2012-12-06T11:08:00Z",
    "SubmissionStatusTypeID": 100
}