{
    "IsRecentlyVerified": false,
    "ID": 180115,
    "UUID": "C9CF7120-C7BA-4251-A390-6856FD734440",
    "DataProviderID": 29,
    "DataProvidersReference": "16952",
    "OperatorID": 45,
    "AddressInfo": {
        "ID": 180474,
        "Title": "Mittenfeldstraße 64",
        "AddressLine1": "Mittenfeldstraße 64",
        "Town": "Stuttgart",
        "Postcode": "70499",
        "CountryID": 87,
        "Latitude": 48.804998,
        "Longitude": 9.090199,
        "DistanceUnit": 0
    },
    "Connections": [
        {
            "ID": 282802,
            "ConnectionTypeID": 25,
            "StatusTypeID": 50,
            "LevelID": 2,
            "PowerKW": 22,
            "CurrentTypeID": 20
        },
        {
            "ID": 282803,
            "ConnectionTypeID": 25,
            "StatusTypeID": 50,
            "LevelID": 2,
            "PowerKW": 22,
            "CurrentTypeID": 20
        }
    ],
    "StatusTypeID": 50,
    "DateLastStatusUpdate": "2021-07-12T02:41:00Z",
    "MetadataValues": [
        {
            "ID": 12409,
            "MetadataFieldID": 4,
            "ItemValue": "Data from the German chargepoint registry provided by Bundesnetzagentur.de under the CC-BY 4.0 license"
        }
    ],
    "DataQualityLevel": 3,
    "DateCreated": "2021-07-08T10:00:00Z",
    "SubmissionStatusTypeID": 100
}