{
    "IsRecentlyVerified": false,
    "ID": 74857,
    "UUID": "AA8AA23A-A4E6-4CE0-86DB-69F5D3CEB07F",
    "DataProviderID": 1,
    "OperatorID": 45,
    "UsageTypeID": 3,
    "AddressInfo": {
        "ID": 75203,
        "Title": "Euronics Speidel",
        "AddressLine1": "Pfarrstraße 21",
        "Town": "Göppingen",
        "StateOrProvince": "Göppingen",
        "Postcode": "73033",
        "CountryID": 87,
        "Latitude": 48.70469435791205,
        "Longitude": 9.652615608004016,
        "AccessComments": "Die Säule muß vom Personal freigeschaltet werden. Der Parkplatz wird nach Geschäftsschluß verschlossen.",
        "RelatedURL": "http://www.speidel.de/handel",
        "DistanceUnit": 0
    },
    "Connections": [
        {
            "ID": 107999,
            "ConnectionTypeID": 25,
            "StatusTypeID": 50,
            "LevelID": 2,
            "Amps": 32,
            "Voltage": 400,
            "PowerKW": 22,
            "CurrentTypeID": 20,
            "Quantity": 2
        }
    ],
    "NumberOfPoints": 2,
    "StatusTypeID": 50,
    "DateLastStatusUpdate": "2016-12-05T09:49:00Z",
    "DataQualityLevel": 1,
    "DateCreated": "2016-12-05T09:49:00Z",
    "SubmissionStatusTypeID": 200
}