{
    "IsRecentlyVerified": false,
    "ID": 5196,
    "UUID": "84479E82-028F-4A7B-8E51-2A7E7D76BE72",
    "DataProviderID": 2,
    "DataProvidersReference": "40610",
    "UsageTypeID": 1,
    "AddressInfo": {
        "ID": 5136,
        "Title": "City of Saline - City Parking Lot #2",
        "AddressLine1": "101 E Henry St",
        "Town": "Saline",
        "StateOrProvince": "MI",
        "Postcode": "48176",
        "CountryID": 2,
        "Latitude": 42.166498,
        "Longitude": -83.780162,
        "ContactTelephone1": "734-429-4907",
        "AccessComments": "24 hours daily",
        "RelatedURL": "",
        "DistanceUnit": 0
    },
    "Connections": [
        {
            "ID": 16168,
            "ConnectionTypeID": 1,
            "LevelID": 2,
            "Amps": 16,
            "Voltage": 230,
            "PowerKW": 3.7,
            "CurrentTypeID": 10,
            "Quantity": 1
        },
        {
            "ID": 21159,
            "ConnectionTypeID": 1,
            "LevelID": 2,
            "Quantity": 1
        }
    ],
    "DateLastConfirmed": "2011-07-31T00:00:00Z",
    "StatusTypeID": 0,
    "DateLastStatusUpdate": "2020-06-26T03:05:00Z",
    "DataQualityLevel": 1,
    "DateCreated": "2011-08-19T14:07:00Z",
    "SubmissionStatusTypeID": 100
}