{
    "IsRecentlyVerified": false,
    "ID": 79706,
    "UUID": "E8FBE604-95E1-4600-B9EA-6900ED57F168",
    "DataProviderID": 1,
    "OperatorID": 23,
    "OperatorsReference": "6846",
    "UsageTypeID": 4,
    "UsageCost": "£0.24/kWh;other tariffs for older cars",
    "AddressInfo": {
        "ID": 80052,
        "Title": "Bristol - Cribbs Causeway Supercharger",
        "AddressLine1": "John Lewis",
        "Town": "Bristol",
        "Postcode": "BS34 5QU",
        "CountryID": 1,
        "Latitude": 51.5266939,
        "Longitude": -2.5998056,
        "DistanceUnit": 0
    },
    "Connections": [
        {
            "ID": 114350,
            "ConnectionTypeID": 27,
            "StatusTypeID": 50,
            "LevelID": 3,
            "PowerKW": 120,
            "CurrentTypeID": 30,
            "Quantity": 2
        }
    ],
    "NumberOfPoints": 2,
    "GeneralComments": "2 Superchargers, available 24/7",
    "StatusTypeID": 50,
    "DateLastStatusUpdate": "2019-03-22T18:57:00Z",
    "DataQualityLevel": 1,
    "DateCreated": "2017-01-30T12:14:00Z",
    "SubmissionStatusTypeID": 200
}