{
    "MediaItems": [
        {
            "ID": 456,
            "ChargePointID": 24057,
            "ItemURL": "https://s3-ap-southeast-2.amazonaws.com/openchargemap/images/CA/OCM24057/OCM-24057.orig.2014063011393645.jpg",
            "ItemThumbnailURL": "https://s3-ap-southeast-2.amazonaws.com/openchargemap/images/CA/OCM24057/OCM-24057.thmb.2014063011393645.jpg",
            "Comment": "Plugging in a Chevy Volt at the EV charging station at Bare Oaks Family Naturist Park.",
            "IsEnabled": true,
            "IsVideo": false,
            "IsFeaturedItem": false,
            "IsExternalResource": false,
            "User": {
                "ID": 2086,
                "Username": "BareOaksPark"
            },
            "DateCreated": "2014-06-30T11:40:00Z"
        }
    ],
    "IsRecentlyVerified": false,
    "ID": 24057,
    "UUID": "4C5421DC-1D2E-4B1F-B4E6-905273354F25",
    "DataProviderID": 1,
    "OperatorID": 5,
    "UsageTypeID": 5,
    "UsageCost": "$1/hour, free for registered visitors and members.",
    "AddressInfo": {
        "ID": 24402,
        "Title": "Bare Oaks Family Naturist Park",
        "AddressLine1": "20237 Kennedy Road",
        "AddressLine2": "",
        "Town": "East Gwillimbury",
        "StateOrProvince": "Ontario",
        "Postcode": "L0G1V0",
        "CountryID": 44,
        "Latitude": 44.148215,
        "Longitude": -79.372201,
        "ContactTelephone1": "9054736060",
        "ContactTelephone2": "",
        "ContactEmail": "info@BareOaks.ca",
        "AccessComments": "In front parking lot at the main office.",
        "RelatedURL": "http://www.BareOaks.ca",
        "DistanceUnit": 0
    },
    "Connections": [
        {
            "ID": 26060,
            "ConnectionTypeID": 1,
            "StatusTypeID": 50,
            "LevelID": 2,
            "Amps": 40,
            "Voltage": 240,
            "PowerKW": 9.6,
            "CurrentTypeID": 10,
            "Quantity": 2
        }
    ],
    "NumberOfPoints": 2,
    "GeneralComments": "Located inside a naturist park. Do not enter if offended by nudity.",
    "StatusTypeID": 50,
    "DateLastStatusUpdate": "2014-08-24T18:18:00Z",
    "DataQualityLevel": 1,
    "DateCreated": "2014-06-09T11:40:00Z",
    "SubmissionStatusTypeID": 200
}