{
    "IsRecentlyVerified": false,
    "ID": 140058,
    "UUID": "663CDF75-EC0E-44C5-A913-7AFC424B949B",
    "DataProviderID": 2,
    "DataProvidersReference": "144515",
    "OperatorID": 5,
    "UsageTypeID": 1,
    "AddressInfo": {
        "ID": 140410,
        "Title": "REDSTONE HD",
        "AddressLine1": "15100 AL-20",
        "Town": "Madison",
        "StateOrProvince": "AL",
        "Postcode": "35756",
        "CountryID": 2,
        "Latitude": 34.639034,
        "Longitude": -86.85275,
        "ContactTelephone1": "888-758-4389",
        "AccessComments": "24 hours daily",
        "RelatedURL": "http://www.chargepoint.com/",
        "DistanceUnit": 0
    },
    "Connections": [
        {
            "ID": 195600,
            "ConnectionTypeID": 32,
            "LevelID": 3,
            "Amps": 100,
            "Voltage": 400,
            "PowerKW": 40,
            "CurrentTypeID": 30,
            "Quantity": 1
        }
    ],
    "StatusTypeID": 50,
    "DateLastStatusUpdate": "2020-06-26T02:57:00Z",
    "DataQualityLevel": 3,
    "DateCreated": "2019-12-24T09:12:00Z",
    "SubmissionStatusTypeID": 100
}