{
    "IsRecentlyVerified": false,
    "ID": 113213,
    "UUID": "D79DC708-CDCF-46AF-BBD9-F357193D785E",
    "DataProviderID": 2,
    "DataProvidersReference": "104743",
    "UsageTypeID": 1,
    "AddressInfo": {
        "ID": 113559,
        "Title": "Whole in the Wall",
        "AddressLine1": "114 W Main St",
        "Town": "Mitchell",
        "StateOrProvince": "OR",
        "Postcode": "97750",
        "CountryID": 2,
        "Latitude": 44.566585,
        "Longitude": -120.155408,
        "ContactTelephone1": "541-462-3663",
        "AccessComments": "24 hours daily; for Tesla use only",
        "RelatedURL": "",
        "DistanceUnit": 0
    },
    "Connections": [
        {
            "ID": 159402,
            "ConnectionTypeID": 30,
            "LevelID": 2,
            "Amps": 16,
            "Voltage": 230,
            "PowerKW": 3.7,
            "CurrentTypeID": 10,
            "Quantity": 1
        }
    ],
    "DateLastStatusUpdate": "2020-06-26T03:08:00Z",
    "DataQualityLevel": 3,
    "DateCreated": "2018-11-28T02:04:00Z",
    "SubmissionStatusTypeID": 100
}