{
    "IsRecentlyVerified": false,
    "ID": 100414,
    "UUID": "1831E567-FE1D-48C9-B20A-10E8B28CDC41",
    "DataProviderID": 1,
    "OperatorID": 3315,
    "OperatorsReference": "52546",
    "UsageTypeID": 4,
    "UsageCost": "Free",
    "AddressInfo": {
        "ID": 100760,
        "Title": "North Berwick Railway Station, North Berwick",
        "AddressLine1": "Station Road",
        "Town": "North Berwick",
        "StateOrProvince": "East Lothian",
        "Postcode": "EH9 4BY",
        "CountryID": 1,
        "Latitude": 56.05709,
        "Longitude": -2.72972,
        "DistanceUnit": 0
    },
    "Connections": [
        {
            "ID": 141836,
            "ConnectionTypeID": 25,
            "StatusTypeID": 50,
            "LevelID": 2,
            "Amps": 32,
            "Voltage": 230,
            "PowerKW": 7,
            "CurrentTypeID": 10,
            "Quantity": 2
        }
    ],
    "NumberOfPoints": 2,
    "StatusTypeID": 50,
    "DateLastStatusUpdate": "2020-02-22T06:16:00Z",
    "DataQualityLevel": 1,
    "DateCreated": "2018-02-23T11:03:00Z",
    "SubmissionStatusTypeID": 200
}