{
    "IsRecentlyVerified": false,
    "ID": 5404,
    "UUID": "E3A2DCAE-B2E8-401D-98DB-9FD5E6EC5AC8",
    "DataProviderID": 1,
    "DataProvidersReference": "LRS-00030",
    "OperatorID": 21,
    "UsageTypeID": 4,
    "UsageCost": "Mobi.E compatible card",
    "AddressInfo": {
        "ID": 5343,
        "Title": "LRS-00030",
        "AddressLine1": "Avenida dos Descobrimentos",
        "Town": "Loures",
        "Postcode": "2685-194",
        "CountryID": 180,
        "Latitude": 38.78135,
        "Longitude": -9.109267,
        "RelatedURL": "http://www.mobie.pt",
        "DistanceUnit": 0
    },
    "Connections": [
        {
            "ID": 33316,
            "ConnectionTypeID": 25,
            "StatusTypeID": 50,
            "LevelID": 2,
            "Amps": 16,
            "Voltage": 230,
            "PowerKW": 3.7,
            "CurrentTypeID": 10,
            "Quantity": 2
        }
    ],
    "NumberOfPoints": 2,
    "StatusTypeID": 50,
    "DateLastStatusUpdate": "2020-08-11T20:48:00Z",
    "DataQualityLevel": 1,
    "DateCreated": "2011-08-25T12:48:00Z",
    "SubmissionStatusTypeID": 100
}