{
    "IsRecentlyVerified": false,
    "ID": 131164,
    "UUID": "45B327FA-7BC4-4E0A-82B7-AC6C1F09BB95",
    "DataProviderID": 2,
    "DataProvidersReference": "143824",
    "OperatorID": 5,
    "UsageTypeID": 1,
    "AddressInfo": {
        "ID": 131510,
        "Title": "MANCUSO CENTRAL",
        "AddressLine1": "18205 I-45",
        "Town": "Houston",
        "StateOrProvince": "TX",
        "Postcode": "77090",
        "CountryID": 2,
        "Latitude": 30.031683,
        "Longitude": -95.42991,
        "ContactTelephone1": "888-758-4389",
        "AccessComments": "24 hours daily",
        "RelatedURL": "http://www.chargepoint.com/",
        "DistanceUnit": 0
    },
    "Connections": [
        {
            "ID": 183663,
            "ConnectionTypeID": 32,
            "LevelID": 3,
            "Amps": 100,
            "Voltage": 400,
            "PowerKW": 40,
            "CurrentTypeID": 30,
            "Quantity": 1
        }
    ],
    "DateLastStatusUpdate": "2020-06-26T02:54:00Z",
    "DataQualityLevel": 3,
    "DateCreated": "2019-08-29T08:33:00Z",
    "SubmissionStatusTypeID": 100
}