{
    "UserComments": [
        {
            "ID": 22401,
            "ChargePointID": 155361,
            "CommentTypeID": 10,
            "UserName": "ForumElettrico.it",
            "Comment": "A fianco dell'ufficio postale. Leggi la recensione completa qui > https://www.forumelettrico.it/forum/colonnina-enel-x-macerata-via-lorenzoni-t6742.html",
            "RelatedURL": "https://www.forumelettrico.it/forum/colonnina-enel-x-macerata-via-lorenzoni-t6742.html",
            "DateCreated": "2020-04-08T09:32:04.48Z",
            "User": {
                "ID": 11749,
                "Username": "ForumElettrico.it"
            },
            "CheckinStatusTypeID": 140,
            "IsActionedByEditor": false
        }
    ],
    "MediaItems": [
        {
            "ID": 21871,
            "ChargePointID": 155361,
            "ItemURL": "https://s3-ap-southeast-2.amazonaws.com/openchargemap/images/IT/OCM155361/OCM-155361.orig.2020040809321469.jpg",
            "ItemThumbnailURL": "https://s3-ap-southeast-2.amazonaws.com/openchargemap/images/IT/OCM155361/OCM-155361.thmb.2020040809321469.jpg",
            "Comment": "",
            "IsEnabled": true,
            "IsVideo": false,
            "IsFeaturedItem": false,
            "IsExternalResource": false,
            "User": {
                "ID": 11749,
                "Username": "ForumElettrico.it"
            },
            "DateCreated": "2020-04-08T09:32:00Z"
        },
        {
            "ID": 21872,
            "ChargePointID": 155361,
            "ItemURL": "https://s3-ap-southeast-2.amazonaws.com/openchargemap/images/IT/OCM155361/OCM-155361.orig.2020040809322307.jpg",
            "ItemThumbnailURL": "https://s3-ap-southeast-2.amazonaws.com/openchargemap/images/IT/OCM155361/OCM-155361.thmb.2020040809322307.jpg",
            "Comment": "",
            "IsEnabled": true,
            "IsVideo": false,
            "IsFeaturedItem": false,
            "IsExternalResource": false,
            "User": {
                "ID": 11749,
                "Username": "ForumElettrico.it"
            },
            "DateCreated": "2020-04-08T09:32:00Z"
        }
    ],
    "IsRecentlyVerified": false,
    "ID": 155361,
    "UUID": "4C667F94-F6F1-4AEA-8054-A0478A35C5A2",
    "DataProviderID": 1,
    "OperatorID": 80,
    "UsageTypeID": 4,
    "AddressInfo": {
        "ID": 155715,
        "Title": "Macerata Lorenzoni | EnelX",
        "AddressLine1": "Via Tina Maria Lorenzoni 60",
        "Town": "Macerata",
        "StateOrProvince": "MC",
        "Postcode": "62100",
        "CountryID": 112,
        "Latitude": 43.299028,
        "Longitude": 13.426433,
        "RelatedURL": "https://www.forumelettrico.it/forum/colonnina-enel-x-macerata-via-lorenzoni-t6742.html",
        "DistanceUnit": 0
    },
    "Connections": [
        {
            "ID": 218739,
            "ConnectionTypeID": 25,
            "StatusTypeID": 50,
            "LevelID": 2,
            "Amps": 1,
            "Voltage": 400,
            "PowerKW": 22,
            "CurrentTypeID": 20,
            "Quantity": 1
        },
        {
            "ID": 218740,
            "ConnectionTypeID": 25,
            "StatusTypeID": 50,
            "LevelID": 2,
            "Amps": 16,
            "Voltage": 240,
            "PowerKW": 3,
            "CurrentTypeID": 10,
            "Quantity": 1
        }
    ],
    "NumberOfPoints": 2,
    "StatusTypeID": 50,
    "DateLastStatusUpdate": "2020-04-11T13:05:00Z",
    "DataQualityLevel": 1,
    "DateCreated": "2020-04-08T09:32:00Z",
    "SubmissionStatusTypeID": 200
}