{
    "IsRecentlyVerified": false,
    "ID": 85453,
    "UUID": "87DDDDE3-BA8E-44D8-897B-73A3B02731C2",
    "DataProviderID": 1,
    "OperatorID": 5,
    "UsageTypeID": 1,
    "UsageCost": "Free",
    "AddressInfo": {
        "ID": 85799,
        "Title": "City of Wilson Customer Service Parking Lot",
        "AddressLine1": "208 Nash Street East",
        "Town": "Wilson",
        "StateOrProvince": "NC",
        "Postcode": "27893",
        "CountryID": 2,
        "Latitude": 35.7280031484476,
        "Longitude": -77.9120989035654,
        "AccessComments": "Located behind the customer service building",
        "DistanceUnit": 0
    },
    "Connections": [
        {
            "ID": 121529,
            "ConnectionTypeID": 1,
            "StatusTypeID": 50,
            "LevelID": 2,
            "Voltage": 240,
            "CurrentTypeID": 10,
            "Quantity": 1
        }
    ],
    "NumberOfPoints": 1,
    "GeneralComments": "Station behind the customer service center.",
    "StatusTypeID": 50,
    "DateLastStatusUpdate": "2017-04-21T19:46:00Z",
    "DataQualityLevel": 1,
    "DateCreated": "2017-04-05T02:57:00Z",
    "SubmissionStatusTypeID": 200
}