{
    "IsRecentlyVerified": false,
    "ID": 20231,
    "UUID": "5E4734CE-09E9-436C-982C-6692D872893F",
    "DataProviderID": 1,
    "OperatorID": 1,
    "UsageTypeID": 6,
    "UsageCost": "Free",
    "AddressInfo": {
        "ID": 20576,
        "Title": "Summerhill B&B",
        "AddressLine1": "7 Highfield Road",
        "Town": "Sedbergh",
        "StateOrProvince": "Cumbria",
        "Postcode": "LA10 5DH",
        "CountryID": 1,
        "Latitude": 54.3239035,
        "Longitude": -2.5306019,
        "ContactTelephone1": "015396 20360",
        "ContactTelephone2": "07884 292 882",
        "ContactEmail": "alibramall@gmail.com",
        "AccessComments": "Stay at our B&B and charge up for free",
        "DistanceUnit": 0
    },
    "Connections": [],
    "NumberOfPoints": 1,
    "StatusTypeID": 50,
    "DateLastStatusUpdate": "2013-11-10T10:22:00Z",
    "MetadataValues": [
        {
            "ID": 372,
            "MetadataFieldID": 4,
            "ItemValue": "Data © OpenStreetMap contributors, ODbL 1.0. http://www.openstreetmap.org/copyright"
        }
    ],
    "DataQualityLevel": 1,
    "DateCreated": "2013-11-07T15:25:00Z",
    "SubmissionStatusTypeID": 200
}