{
    "IsRecentlyVerified": false,
    "ID": 114448,
    "UUID": "2FBC8B7D-845A-4F34-A31F-7537707724DC",
    "DataProviderID": 1,
    "OperatorID": 156,
    "UsageTypeID": 4,
    "UsageCost": "AC:4,95€, DC: 8,95€",
    "AddressInfo": {
        "ID": 114794,
        "Title": "Schnellladesäule Oldenstadt",
        "AddressLine1": "Klosterstraße 4",
        "Town": "Uelzen",
        "StateOrProvince": "Uelzen",
        "Postcode": "29525",
        "CountryID": 87,
        "Latitude": 52.97271582628369,
        "Longitude": 10.589870226914154,
        "AccessComments": "24/7 nutzbar mit New Motion oder Ladenetz Ladekarten. Auf dem Parkplatz Klosterstraße.",
        "RelatedURL": "https://www.stadtwerke-uelzen.de/E-Mobilitaet/",
        "DistanceUnit": 0
    },
    "Connections": [
        {
            "ID": 161103,
            "ConnectionTypeID": 2,
            "StatusTypeID": 50,
            "LevelID": 3,
            "PowerKW": 63,
            "CurrentTypeID": 30,
            "Quantity": 1
        },
        {
            "ID": 161104,
            "ConnectionTypeID": 33,
            "StatusTypeID": 50,
            "LevelID": 3,
            "PowerKW": 150,
            "CurrentTypeID": 30,
            "Quantity": 1
        },
        {
            "ID": 161105,
            "ConnectionTypeID": 1036,
            "StatusTypeID": 50,
            "LevelID": 3,
            "Amps": 63,
            "Voltage": 400,
            "PowerKW": 43,
            "CurrentTypeID": 20,
            "Quantity": 1
        },
        {
            "ID": 161106,
            "ConnectionTypeID": 25,
            "StatusTypeID": 50,
            "LevelID": 2,
            "Amps": 32,
            "Voltage": 400,
            "PowerKW": 22,
            "CurrentTypeID": 20,
            "Quantity": 1
        }
    ],
    "NumberOfPoints": 4,
    "StatusTypeID": 50,
    "DateLastStatusUpdate": "2019-01-08T06:43:00Z",
    "DataQualityLevel": 1,
    "DateCreated": "2019-01-08T06:43:00Z",
    "SubmissionStatusTypeID": 200
}