{
    "IsRecentlyVerified": false,
    "ID": 126694,
    "UUID": "53D69830-C19F-4578-924F-5F4103D10C24",
    "DataProviderID": 1,
    "OperatorID": 150,
    "UsageTypeID": 4,
    "UsageCost": "£0.85 + £0.25/kWh",
    "AddressInfo": {
        "ID": 127040,
        "Title": "Charles Street",
        "AddressLine1": "Charles Street",
        "Town": "Milford Haven",
        "StateOrProvince": "Pembrokeshire",
        "Postcode": "SA73 2DS",
        "CountryID": 1,
        "Latitude": 51.713482,
        "Longitude": -5.038737,
        "DistanceUnit": 0
    },
    "Connections": [
        {
            "ID": 177469,
            "ConnectionTypeID": 25,
            "StatusTypeID": 50,
            "LevelID": 2,
            "Amps": 32,
            "Voltage": 400,
            "PowerKW": 22,
            "CurrentTypeID": 20,
            "Quantity": 4
        }
    ],
    "NumberOfPoints": 4,
    "StatusTypeID": 50,
    "DateLastStatusUpdate": "2019-06-24T11:39:00Z",
    "DataQualityLevel": 1,
    "DateCreated": "2019-05-17T12:57:00Z",
    "SubmissionStatusTypeID": 200
}