{
    "MediaItems": [
        {
            "ID": 12089,
            "ChargePointID": 87684,
            "ItemURL": "https://s3-ap-southeast-2.amazonaws.com/openchargemap/images/NZ/OCM87684/OCM-87684.orig.2017051512451000.jpg",
            "ItemThumbnailURL": "https://s3-ap-southeast-2.amazonaws.com/openchargemap/images/NZ/OCM87684/OCM-87684.thmb.2017051512451000.jpg",
            "Comment": "",
            "IsEnabled": true,
            "IsVideo": false,
            "IsFeaturedItem": false,
            "IsExternalResource": false,
            "User": {
                "ID": 15365,
                "Username": "sliday"
            },
            "DateCreated": "2017-05-15T12:45:00Z"
        }
    ],
    "IsRecentlyVerified": false,
    "ID": 87684,
    "UUID": "C81969E8-89B8-450E-A168-7BF4C4FC197C",
    "DataProviderID": 1,
    "AddressInfo": {
        "ID": 88030,
        "Title": "Otematata Holiday Park and Lodge",
        "AddressLine1": "1 East Road",
        "Town": "Otematata ",
        "Postcode": "9412",
        "CountryID": 161,
        "Latitude": -44.6053678952785,
        "Longitude": 170.194654681079,
        "ContactTelephone1": "(643) 438-7826",
        "DistanceUnit": 0
    },
    "Connections": [
        {
            "ID": 124292,
            "ConnectionTypeID": 4,
            "StatusTypeID": 50,
            "LevelID": 2,
            "Amps": 16,
            "Voltage": 230,
            "PowerKW": 3.6,
            "CurrentTypeID": 10,
            "Quantity": 2
        }
    ],
    "NumberOfPoints": 2,
    "StatusTypeID": 50,
    "DateLastStatusUpdate": "2017-05-15T13:36:00Z",
    "DataQualityLevel": 1,
    "DateCreated": "2017-05-15T12:44:00Z",
    "SubmissionStatusTypeID": 200
}