{
    "IsRecentlyVerified": false,
    "ID": 87829,
    "UUID": "D8A60511-05C6-4EC7-BB31-32EE791D2721",
    "DataProviderID": 1,
    "DataProvidersReference": "3989",
    "AddressInfo": {
        "ID": 88175,
        "Title": "Sandvik: Huvudkontor",
        "AddressLine1": "Storgatan 2",
        "Town": "SANDVIKEN",
        "StateOrProvince": "GÄVLEBORG",
        "Postcode": "81181",
        "CountryID": 216,
        "Latitude": 60.61704,
        "Longitude": 16.78636,
        "AccessComments": "",
        "DistanceUnit": 0
    },
    "Connections": [
        {
            "ID": 124562,
            "ConnectionTypeID": 0,
            "Reference": "1",
            "LevelID": 2,
            "Amps": 16,
            "Voltage": 400,
            "PowerKW": 11,
            "Comments": "Mode 3"
        },
        {
            "ID": 124563,
            "ConnectionTypeID": 0,
            "Reference": "2",
            "LevelID": 2,
            "Amps": 16,
            "Voltage": 400,
            "PowerKW": 11,
            "Comments": "Mode 3"
        }
    ],
    "NumberOfPoints": 2,
    "DateLastStatusUpdate": "2020-05-26T08:24:00Z",
    "DataQualityLevel": 2,
    "DateCreated": "2017-05-16T11:07:00Z",
    "SubmissionStatusTypeID": 100
}