{
    "IsRecentlyVerified": false,
    "ID": 157702,
    "UUID": "FC3E1585-5F08-4F11-B419-8EAA0E23856C",
    "DataProviderID": 1,
    "OperatorID": 21,
    "UsageTypeID": 4,
    "UsageCost": "Mobi.E compatible card",
    "AddressInfo": {
        "ID": 158056,
        "Title": "LRA-00014",
        "AddressLine1": "Rua da Maceira",
        "Town": "Azóia",
        "StateOrProvince": "Centro",
        "Postcode": "2400-823",
        "CountryID": 180,
        "Latitude": 39.714655817538414,
        "Longitude": -8.83169779131208,
        "DistanceUnit": 0
    },
    "Connections": [
        {
            "ID": 227216,
            "ConnectionTypeID": 2,
            "StatusTypeID": 50,
            "LevelID": 3,
            "Amps": 120,
            "Voltage": 500,
            "PowerKW": 50,
            "CurrentTypeID": 30,
            "Quantity": 1
        },
        {
            "ID": 233132,
            "ConnectionTypeID": 33,
            "StatusTypeID": 50,
            "LevelID": 3,
            "Amps": 125,
            "Voltage": 500,
            "PowerKW": 50,
            "CurrentTypeID": 30,
            "Quantity": 1
        },
        {
            "ID": 233133,
            "ConnectionTypeID": 1036,
            "StatusTypeID": 50,
            "LevelID": 3,
            "Amps": 64,
            "Voltage": 400,
            "PowerKW": 43,
            "CurrentTypeID": 20,
            "Quantity": 1
        }
    ],
    "NumberOfPoints": 2,
    "GeneralComments": "No simultaneous AC and DC charging",
    "StatusTypeID": 50,
    "DateLastStatusUpdate": "2020-08-20T22:13:00Z",
    "DataQualityLevel": 3,
    "DateCreated": "2020-06-25T05:42:00Z",
    "SubmissionStatusTypeID": 100
}