{
    "MediaItems": [
        {
            "ID": 6139,
            "ChargePointID": 61325,
            "ItemURL": "https://s3-ap-southeast-2.amazonaws.com/openchargemap/images/IT/OCM61325/OCM-61325.orig.2016040216283430.jpg",
            "ItemThumbnailURL": "https://s3-ap-southeast-2.amazonaws.com/openchargemap/images/IT/OCM61325/OCM-61325.thmb.2016040216283430.jpg",
            "Comment": "",
            "IsEnabled": true,
            "IsVideo": false,
            "IsFeaturedItem": false,
            "IsExternalResource": false,
            "User": {
                "ID": 1606,
                "Username": "polianto"
            },
            "DateCreated": "2016-04-02T16:29:00Z"
        }
    ],
    "IsRecentlyVerified": false,
    "ID": 61325,
    "UUID": "4B061F84-DD53-4708-9F5A-AD21F457E912",
    "DataProviderID": 1,
    "OperatorID": 82,
    "UsageTypeID": 4,
    "UsageCost": "15,10€ per 3 mesi",
    "AddressInfo": {
        "ID": 61671,
        "Title": "A2A  Isola Digitale Porta Venezia",
        "AddressLine1": "Piazza Guglielmo Oberdan",
        "Town": "Milano",
        "StateOrProvince": "MI",
        "Postcode": "20129",
        "CountryID": 112,
        "Latitude": 45.474703147703174,
        "Longitude": 9.204557606026457,
        "ContactTelephone1": "800 035151",
        "ContactEmail": "e-moving@a2a.eu",
        "RelatedURL": "http://www.e-moving.it/",
        "DistanceUnit": 0
    },
    "Connections": [
        {
            "ID": 78102,
            "ConnectionTypeID": 36,
            "StatusTypeID": 50,
            "LevelID": 2,
            "Amps": 16,
            "Voltage": 240,
            "PowerKW": 3.4,
            "CurrentTypeID": 10,
            "Quantity": 4
        }
    ],
    "NumberOfPoints": 4,
    "StatusTypeID": 50,
    "DateLastStatusUpdate": "2016-04-02T16:29:00Z",
    "DataQualityLevel": 1,
    "DateCreated": "2016-02-24T14:34:00Z",
    "SubmissionStatusTypeID": 200
}