{
    "IsRecentlyVerified": false,
    "ID": 90452,
    "UUID": "0B6B3555-DC33-4C3A-B2DE-F2C07C79D0A5",
    "DataProviderID": 1,
    "OperatorID": 23,
    "OperatorsReference": "30112",
    "UsageTypeID": 6,
    "AddressInfo": {
        "ID": 90798,
        "Title": "Hotel la Favorita",
        "AddressLine1": "1 Via Salvatore Cognetti de Martiis",
        "Town": "Mantova",
        "Postcode": "46100",
        "CountryID": 112,
        "Latitude": 45.165875,
        "Longitude": 10.828913,
        "ContactTelephone1": "+39 0376 254 711",
        "DistanceUnit": 0
    },
    "Connections": [
        {
            "ID": 128105,
            "ConnectionTypeID": 30,
            "StatusTypeID": 50,
            "LevelID": 2,
            "Amps": 32,
            "Voltage": 400,
            "PowerKW": 22,
            "CurrentTypeID": 20,
            "Quantity": 1
        }
    ],
    "NumberOfPoints": 1,
    "GeneralComments": "1 Tesla Connector, up to 22kW.Available for patrons only. Please call ahead.",
    "StatusTypeID": 50,
    "DateLastStatusUpdate": "2018-10-03T23:44:00Z",
    "DataQualityLevel": 1,
    "DateCreated": "2017-07-13T15:25:00Z",
    "SubmissionStatusTypeID": 200
}