{
    "IsRecentlyVerified": false,
    "ID": 142261,
    "UUID": "DC5EAC36-9D55-41B1-97B4-8EA3295BA437",
    "DataProviderID": 1,
    "OperatorID": 5,
    "UsageTypeID": 1,
    "AddressInfo": {
        "ID": 142613,
        "Title": "THUNDER MTN H-D",
        "AddressLine1": "4250 Byrd Dr",
        "Town": "Loveland",
        "StateOrProvince": "CO",
        "Postcode": "80538",
        "CountryID": 2,
        "Latitude": 40.43803639999942,
        "Longitude": -104.99410760000012,
        "ContactTelephone1": "888-758-4389",
        "AccessComments": "24 hours daily",
        "RelatedURL": "http://www.chargepoint.com/",
        "DistanceUnit": 0
    },
    "Connections": [
        {
            "ID": 198362,
            "ConnectionTypeID": 32,
            "LevelID": 3,
            "Amps": 100,
            "Voltage": 400,
            "PowerKW": 25,
            "CurrentTypeID": 30,
            "Quantity": 1
        }
    ],
    "StatusTypeID": 50,
    "DateLastStatusUpdate": "2020-07-06T17:28:00Z",
    "DataQualityLevel": 3,
    "DateCreated": "2019-12-24T09:17:00Z",
    "SubmissionStatusTypeID": 100
}