{
    "IsRecentlyVerified": false,
    "ID": 68769,
    "UUID": "DA983DEA-713A-4AFB-B869-04CF14245452",
    "DataProviderID": 1,
    "OperatorID": 45,
    "UsageTypeID": 6,
    "AddressInfo": {
        "ID": 69115,
        "Title": " Camping Villaggio L' Ultima Spiaggia",
        "AddressLine1": "Località Planargia SNC",
        "AddressLine2": "Strada Comunale Sa Marina",
        "Town": "Bari Sardo",
        "StateOrProvince": "OG",
        "Postcode": "08042",
        "CountryID": 112,
        "Latitude": 39.818321607122485,
        "Longitude": 9.672142279450995,
        "ContactTelephone1": "+39 0782 29 363",
        "ContactEmail": "info@campingultimaspiaggia.it",
        "RelatedURL": "http://www.campingultimaspiaggia.it/",
        "DistanceUnit": 0
    },
    "Connections": [
        {
            "ID": 96458,
            "ConnectionTypeID": 25,
            "StatusTypeID": 50,
            "LevelID": 2,
            "Amps": 32,
            "Voltage": 400,
            "PowerKW": 22,
            "CurrentTypeID": 20,
            "Quantity": 1
        },
        {
            "ID": 96459,
            "ConnectionTypeID": 36,
            "StatusTypeID": 50,
            "LevelID": 2,
            "Amps": 16,
            "Voltage": 240,
            "PowerKW": 3.7,
            "CurrentTypeID": 10,
            "Quantity": 1
        }
    ],
    "NumberOfPoints": 2,
    "StatusTypeID": 50,
    "DateLastStatusUpdate": "2016-06-23T10:45:00Z",
    "DataQualityLevel": 1,
    "DateCreated": "2016-06-23T10:45:00Z",
    "SubmissionStatusTypeID": 200
}