{
    "IsRecentlyVerified": false,
    "ID": 154122,
    "UUID": "9932548B-6876-4089-A66E-D55D0C5843D7",
    "DataProviderID": 28,
    "DataProvidersReference": "FR*S60*PAMBLAINVILLE",
    "OperatorID": 3379,
    "UsageTypeID": 5,
    "AddressInfo": {
        "ID": 154475,
        "Title": "Amblainville, Nationale",
        "AddressLine1": "51 route Nationale 60110 Amblainville",
        "CountryID": 80,
        "Latitude": 49.2017,
        "Longitude": 2.11993,
        "AccessComments": "24h/24 7j/7",
        "DistanceUnit": 0
    },
    "Connections": [
        {
            "ID": 216605,
            "ConnectionTypeID": 1036,
            "StatusTypeID": 50,
            "LevelID": 2,
            "PowerKW": 22,
            "CurrentTypeID": 20
        },
        {
            "ID": 250968,
            "ConnectionTypeID": 1036,
            "StatusTypeID": 50,
            "LevelID": 2,
            "PowerKW": 22,
            "CurrentTypeID": 20
        }
    ],
    "GeneralComments": "",
    "StatusTypeID": 50,
    "DateLastStatusUpdate": "2020-08-27T05:16:00Z",
    "DataQualityLevel": 2,
    "DateCreated": "2020-03-15T10:54:00Z",
    "SubmissionStatusTypeID": 100
}