{
    "IsRecentlyVerified": false,
    "ID": 61932,
    "UUID": "96A43A22-C31B-4CE0-A172-9E956F8A64C7",
    "DataProviderID": 1,
    "OperatorID": 23,
    "OperatorsReference": "10400",
    "UsageTypeID": 1,
    "UsageCost": "$0.26/kWh; other tariffs for older cars",
    "AddressInfo": {
        "ID": 62278,
        "Title": "Tesla Dublin",
        "AddressLine1": "6701 Amador Plaza Rd",
        "Town": "Dublin",
        "StateOrProvince": "CA",
        "Postcode": "94568",
        "CountryID": 2,
        "Latitude": 37.7027671,
        "Longitude": -121.9249649,
        "ContactTelephone1": "925-361-1173  877-798-3752",
        "AccessComments": "24 hours daily; for Tesla use only",
        "RelatedURL": "http://www.teslamotors.com/supercharger",
        "DistanceUnit": 0
    },
    "Connections": [
        {
            "ID": 78828,
            "ConnectionTypeID": 27,
            "StatusTypeID": 50,
            "LevelID": 3,
            "Amps": 100,
            "Voltage": 400,
            "PowerKW": 120,
            "CurrentTypeID": 30,
            "Quantity": 16
        }
    ],
    "NumberOfPoints": 16,
    "StatusTypeID": 50,
    "DateLastStatusUpdate": "2020-04-05T08:53:00Z",
    "DataQualityLevel": 3,
    "DateCreated": "2016-03-03T11:38:00Z",
    "SubmissionStatusTypeID": 100
}