{
    "IsRecentlyVerified": false,
    "ID": 92154,
    "UUID": "72D60105-F219-4F46-8849-9801CAB40EA1",
    "DataProviderID": 1,
    "OperatorID": 45,
    "UsageTypeID": 6,
    "AddressInfo": {
        "ID": 92500,
        "Title": " Residence Ca´del Lago",
        "AddressLine1": "Via Gabriele D'Annunzio, 17",
        "Town": "Torri del Benaco",
        "StateOrProvince": "VR",
        "Postcode": "37010 ",
        "CountryID": 112,
        "Latitude": 45.60565110779434,
        "Longitude": 10.688386710155093,
        "ContactTelephone1": "+39 045 6296716",
        "ContactEmail": "info@residencecadellago.it",
        "RelatedURL": "http://residencecadellago.it",
        "DistanceUnit": 0
    },
    "Connections": [
        {
            "ID": 130655,
            "ConnectionTypeID": 25,
            "StatusTypeID": 50,
            "LevelID": 2,
            "Amps": 32,
            "Voltage": 400,
            "PowerKW": 22,
            "CurrentTypeID": 20,
            "Quantity": 1
        }
    ],
    "NumberOfPoints": 1,
    "StatusTypeID": 50,
    "DateLastStatusUpdate": "2017-08-29T12:31:00Z",
    "DataQualityLevel": 1,
    "DateCreated": "2017-08-29T12:31:00Z",
    "SubmissionStatusTypeID": 200
}