{
    "IsRecentlyVerified": false,
    "ID": 9754,
    "UUID": "C0F129B1-5F95-47BB-9887-814FF1C5C0BD",
    "DataProviderID": 15,
    "DataProvidersReference": "16652",
    "OperatorID": 5,
    "AddressInfo": {
        "ID": 9651,
        "Title": "ONE UTSA circle",
        "AddressLine1": "ONE UTSA circle",
        "Town": "San Antonio",
        "StateOrProvince": "Texas",
        "Postcode": "78249",
        "CountryID": 2,
        "Latitude": 29.58097839,
        "Longitude": -98.62429047,
        "ContactTelephone1": "",
        "RelatedURL": "http://carstations.com/16652",
        "DistanceUnit": 0
    },
    "Connections": [
        {
            "ID": 7561,
            "ConnectionTypeID": 1,
            "Reference": "J1772",
            "LevelID": 2
        }
    ],
    "StatusTypeID": 0,
    "DateLastStatusUpdate": "2017-11-04T14:03:00Z",
    "DataQualityLevel": 2,
    "DateCreated": "2012-04-16T15:46:00Z",
    "SubmissionStatusTypeID": 100
}