{
    "IsRecentlyVerified": false,
    "ID": 37835,
    "UUID": "EEB85851-15FD-4D18-9935-A602C1FB331F",
    "DataProviderID": 26,
    "DataProvidersReference": "16531",
    "OperatorID": 162,
    "OperatorsReference": "Parkeergarage Piet Hein",
    "UsageCost": "0.00 gratis",
    "AddressInfo": {
        "ID": 38181,
        "Title": "Piet Heinkade",
        "AddressLine1": "Piet Heinkade",
        "Town": "Amsterdam",
        "Postcode": "1019 GM",
        "CountryID": 159,
        "Latitude": 52.377388,
        "Longitude": 4.917375,
        "DistanceUnit": 0
    },
    "Connections": [
        {
            "ID": 41346,
            "ConnectionTypeID": 28,
            "LevelID": 1,
            "PowerKW": 2.3,
            "CurrentTypeID": 10
        }
    ],
    "NumberOfPoints": 1,
    "StatusTypeID": 50,
    "DateLastStatusUpdate": "2016-06-04T02:54:00Z",
    "DataQualityLevel": 3,
    "DateCreated": "2015-01-09T06:07:00Z",
    "SubmissionStatusTypeID": 100
}