{
    "IsRecentlyVerified": false,
    "ID": 34415,
    "UUID": "36951CD0-C138-4B66-BF65-73E8A3DB6F08",
    "DataProviderID": 26,
    "DataProvidersReference": "49818",
    "OperatorID": 157,
    "OperatorsReference": "NewMotion 02008991",
    "UsageCost": "0.00 jaarabonnement",
    "AddressInfo": {
        "ID": 34761,
        "Title": "Willem Beukelszstraat 36",
        "AddressLine1": "Willem Beukelszstraat 36",
        "Town": "Rotterdam",
        "Postcode": "3027 CM",
        "CountryID": 159,
        "Latitude": 51.9143409729004,
        "Longitude": 4.43640518188477,
        "ContactTelephone1": "088 0109500",
        "RelatedURL": "http://thenewmotion.nl/",
        "DistanceUnit": 0
    },
    "Connections": [
        {
            "ID": 37926,
            "ConnectionTypeID": 25,
            "LevelID": 2,
            "PowerKW": 3.7,
            "CurrentTypeID": 10
        }
    ],
    "NumberOfPoints": 1,
    "StatusTypeID": 50,
    "DateLastStatusUpdate": "2016-06-04T02:42:00Z",
    "DataQualityLevel": 3,
    "DateCreated": "2015-01-09T06:04:00Z",
    "SubmissionStatusTypeID": 100
}