{
    "IsRecentlyVerified": false,
    "ID": 62849,
    "UUID": "10A864A5-D247-411A-B5A2-C4C4D25A7DDB",
    "DataProviderID": 26,
    "DataProvidersReference": "76109",
    "OperatorID": 157,
    "OperatorsReference": "NewMotion 03003037",
    "UsageCost": "0.00 jaarabonnement",
    "AddressInfo": {
        "ID": 63195,
        "Title": "Nieuwstraat",
        "AddressLine1": "Nieuwstraat",
        "Town": "Knesselare",
        "Postcode": "9910",
        "CountryID": 26,
        "Latitude": 51.1428086,
        "Longitude": 3.41660520000005,
        "ContactTelephone1": "088 0109500",
        "RelatedURL": "http://thenewmotion.nl/",
        "DistanceUnit": 0
    },
    "Connections": [
        {
            "ID": 79836,
            "ConnectionTypeID": 25,
            "LevelID": 2,
            "PowerKW": 22,
            "CurrentTypeID": 10
        }
    ],
    "NumberOfPoints": 1,
    "StatusTypeID": 50,
    "DateLastStatusUpdate": "2016-06-04T02:38:00Z",
    "DataQualityLevel": 3,
    "DateCreated": "2016-03-03T12:29:00Z",
    "SubmissionStatusTypeID": 100
}