{
    "IsRecentlyVerified": false,
    "ID": 176812,
    "UUID": "5A134962-81DE-4A9D-BB8E-FB557B4F68BE",
    "DataProviderID": 29,
    "DataProvidersReference": "8215",
    "AddressInfo": {
        "ID": 177171,
        "Title": "Josef-Willmann-Straße",
        "AddressLine1": "Josef-Willmann-Straße",
        "Town": "Nüdlingen",
        "Postcode": "97720",
        "CountryID": 87,
        "Latitude": 50.22099,
        "Longitude": 10.12961,
        "DistanceUnit": 0
    },
    "Connections": [
        {
            "ID": 275180,
            "ConnectionTypeID": 25,
            "StatusTypeID": 50,
            "LevelID": 2,
            "PowerKW": 22,
            "CurrentTypeID": 20
        },
        {
            "ID": 275181,
            "ConnectionTypeID": 25,
            "StatusTypeID": 50,
            "LevelID": 2,
            "PowerKW": 22,
            "CurrentTypeID": 20
        }
    ],
    "StatusTypeID": 0,
    "DateLastStatusUpdate": "2021-07-12T02:44:00Z",
    "MetadataValues": [
        {
            "ID": 9107,
            "MetadataFieldID": 4,
            "ItemValue": "Data from the German chargepoint registry provided by Bundesnetzagentur.de under the CC-BY 4.0 license"
        }
    ],
    "DataQualityLevel": 3,
    "DateCreated": "2021-07-08T09:48:00Z",
    "SubmissionStatusTypeID": 100
}