{
    "IsRecentlyVerified": false,
    "ID": 130583,
    "UUID": "07217854-DC3E-4EA1-AB6F-75225B684933",
    "DataProviderID": 1,
    "OperatorID": 80,
    "UsageTypeID": 4,
    "AddressInfo": {
        "ID": 130929,
        "Title": "CONAD Popoli | EnelX",
        "AddressLine1": "Via Papa Giovanni XXIII, 61",
        "Town": "Popoli",
        "StateOrProvince": "PE",
        "Postcode": "65026",
        "CountryID": 112,
        "Latitude": 42.1694831335865,
        "Longitude": 13.8319544950198,
        "ContactTelephone1": "800.069.850",
        "RelatedURL": "https://www.enelx.com/it/it/emobility",
        "DistanceUnit": 0
    },
    "Connections": [
        {
            "ID": 182804,
            "ConnectionTypeID": 25,
            "StatusTypeID": 50,
            "LevelID": 2,
            "Amps": 32,
            "Voltage": 400,
            "PowerKW": 22,
            "CurrentTypeID": 20,
            "Quantity": 1
        },
        {
            "ID": 182805,
            "ConnectionTypeID": 36,
            "StatusTypeID": 50,
            "LevelID": 2,
            "Amps": 16,
            "Voltage": 240,
            "PowerKW": 3.7,
            "CurrentTypeID": 10,
            "Quantity": 1
        }
    ],
    "NumberOfPoints": 2,
    "StatusTypeID": 50,
    "DateLastStatusUpdate": "2019-08-07T08:26:00Z",
    "DataQualityLevel": 1,
    "DateCreated": "2019-08-07T08:26:00Z",
    "SubmissionStatusTypeID": 200
}