{
    "IsRecentlyVerified": false,
    "ID": 166468,
    "UUID": "28971968-1C8C-46A8-B6C5-0B941F39F012",
    "DataProviderID": 28,
    "DataProvidersReference": "FR*S44*P44051A",
    "OperatorID": 3412,
    "UsageTypeID": 5,
    "AddressInfo": {
        "ID": 166827,
        "Title": "Derval | Place de la Grée",
        "AddressLine1": "Place de la Grée 44590 Derval",
        "CountryID": 80,
        "Latitude": 47.667198,
        "Longitude": -1.674989,
        "AccessComments": "24/24 7/7",
        "DistanceUnit": 0
    },
    "Connections": [
        {
            "ID": 247817,
            "ConnectionTypeID": 25,
            "StatusTypeID": 50,
            "LevelID": 2,
            "PowerKW": 18,
            "CurrentTypeID": 20
        },
        {
            "ID": 247818,
            "ConnectionTypeID": 28,
            "StatusTypeID": 50,
            "LevelID": 2,
            "PowerKW": 18,
            "CurrentTypeID": 10
        },
        {
            "ID": 247819,
            "ConnectionTypeID": 25,
            "StatusTypeID": 50,
            "LevelID": 2,
            "PowerKW": 18,
            "CurrentTypeID": 20
        },
        {
            "ID": 247820,
            "ConnectionTypeID": 28,
            "StatusTypeID": 50,
            "LevelID": 2,
            "PowerKW": 18,
            "CurrentTypeID": 10
        }
    ],
    "GeneralComments": "",
    "StatusTypeID": 50,
    "DateLastStatusUpdate": "2020-08-27T05:14:00Z",
    "DataQualityLevel": 2,
    "DateCreated": "2020-08-27T05:14:00Z",
    "SubmissionStatusTypeID": 100
}