{
    "IsRecentlyVerified": false,
    "ID": 77703,
    "UUID": "DF3165F4-965B-4FAC-BC30-9CF039F5BB5B",
    "DataProviderID": 1,
    "OperatorID": 3266,
    "UsageTypeID": 4,
    "AddressInfo": {
        "ID": 78049,
        "Title": "Stadtverwaltung",
        "AddressLine1": "Weserstraße 12",
        "Town": "Beverungen",
        "StateOrProvince": "Kreis Höxter",
        "Postcode": "37688",
        "CountryID": 87,
        "Latitude": 51.6637362632432,
        "Longitude": 9.37444116683001,
        "ContactTelephone1": "+49 5251 5034367",
        "AccessComments": "24/7 nutzbare grüne Säule auf dem Parkplatz der Stadtverwaltung",
        "RelatedURL": "http://www.beste-stadtwerke.de/Produkte/Strom/Strom-Tankstelle",
        "DistanceUnit": 0
    },
    "Connections": [
        {
            "ID": 112260,
            "ConnectionTypeID": 25,
            "StatusTypeID": 50,
            "LevelID": 2,
            "Amps": 32,
            "Voltage": 400,
            "PowerKW": 22,
            "CurrentTypeID": 20,
            "Quantity": 2
        }
    ],
    "NumberOfPoints": 2,
    "StatusTypeID": 50,
    "DateLastStatusUpdate": "2017-01-30T07:19:00Z",
    "DataQualityLevel": 1,
    "DateCreated": "2017-01-23T07:11:00Z",
    "SubmissionStatusTypeID": 200
}