{
    "MediaItems": [
        {
            "ID": 23238,
            "ChargePointID": 161889,
            "ItemURL": "https://s3-ap-southeast-2.amazonaws.com/openchargemap/images/DE/OCM161889/OCM-161889.orig.2020072717401114.jpg",
            "ItemThumbnailURL": "https://s3-ap-southeast-2.amazonaws.com/openchargemap/images/DE/OCM161889/OCM-161889.thmb.2020072717401114.jpg",
            "Comment": "",
            "IsEnabled": true,
            "IsVideo": false,
            "IsFeaturedItem": false,
            "IsExternalResource": false,
            "User": {
                "ID": 21695,
                "Username": "et42"
            },
            "DateCreated": "2020-07-27T17:40:00Z"
        },
        {
            "ID": 23239,
            "ChargePointID": 161889,
            "ItemURL": "https://s3-ap-southeast-2.amazonaws.com/openchargemap/images/DE/OCM161889/OCM-161889.orig.2020072717402281.jpg",
            "ItemThumbnailURL": "https://s3-ap-southeast-2.amazonaws.com/openchargemap/images/DE/OCM161889/OCM-161889.thmb.2020072717402281.jpg",
            "Comment": "",
            "IsEnabled": true,
            "IsVideo": false,
            "IsFeaturedItem": false,
            "IsExternalResource": false,
            "User": {
                "ID": 21695,
                "Username": "et42"
            },
            "DateCreated": "2020-07-27T17:40:00Z"
        }
    ],
    "IsRecentlyVerified": false,
    "ID": 161889,
    "UUID": "A8BDC881-E50A-437E-83F6-7934F8681D5D",
    "DataProviderID": 1,
    "OperatorID": 163,
    "UsageTypeID": 4,
    "AddressInfo": {
        "ID": 162246,
        "Title": "Ladepark Stubenwald",
        "AddressLine1": "Stubenwald-Allee 21",
        "Town": "Bensheim",
        "StateOrProvince": "Hesse",
        "Postcode": "64625",
        "CountryID": 87,
        "Latitude": 49.6726387207072,
        "Longitude": 8.584924961876595,
        "DistanceUnit": 0
    },
    "Connections": [
        {
            "ID": 232986,
            "ConnectionTypeID": 25,
            "StatusTypeID": 50,
            "LevelID": 2,
            "Amps": 32,
            "Voltage": 400,
            "PowerKW": 22,
            "CurrentTypeID": 20,
            "Quantity": 8
        }
    ],
    "NumberOfPoints": 8,
    "GeneralComments": "Charging must be started with RFID card, as cable will not unlock otherwise.",
    "StatusTypeID": 50,
    "DateLastStatusUpdate": "2020-07-27T17:40:00Z",
    "DataQualityLevel": 1,
    "DateCreated": "2020-07-27T17:36:00Z",
    "SubmissionStatusTypeID": 200
}