{
    "IsRecentlyVerified": false,
    "ID": 121079,
    "UUID": "71A6EAA8-924A-4825-8A34-F3593E706DFB",
    "DataProviderID": 2,
    "DataProvidersReference": "61079",
    "OperatorID": 5,
    "UsageTypeID": 1,
    "AddressInfo": {
        "ID": 121425,
        "Title": "CERRITOS CC",
        "AddressLine1": "11110 Alondra Blvd",
        "Town": "Cerritos",
        "StateOrProvince": "CA",
        "Postcode": "90703",
        "CountryID": 2,
        "Latitude": 33.8834622,
        "Longitude": -118.0961911,
        "ContactTelephone1": "888-758-4389",
        "AccessComments": "24 hours daily",
        "RelatedURL": "http://www.chargepoint.com/",
        "DistanceUnit": 0
    },
    "Connections": [
        {
            "ID": 170507,
            "ConnectionTypeID": 1,
            "LevelID": 2,
            "Amps": 16,
            "Voltage": 230,
            "PowerKW": 3,
            "CurrentTypeID": 10,
            "Quantity": 4
        }
    ],
    "DateLastStatusUpdate": "2019-12-24T09:10:00Z",
    "DataQualityLevel": 3,
    "DateCreated": "2019-04-01T04:59:00Z",
    "SubmissionStatusTypeID": 100
}