{
    "IsRecentlyVerified": false,
    "ID": 103131,
    "UUID": "6EE6F0CE-9873-446D-A6B6-F9D71B476834",
    "DataProviderID": 1,
    "DataProvidersReference": "4652",
    "OperatorID": 1,
    "UsageTypeID": 5,
    "AddressInfo": {
        "ID": 103477,
        "Title": "Amfi Havnesenteret",
        "AddressLine1": "Storgata 58",
        "Town": "BRØNNØYSUND",
        "StateOrProvince": "Nordland",
        "Postcode": "8900",
        "CountryID": 168,
        "Latitude": 65.47296,
        "Longitude": 12.20712,
        "AccessComments": "",
        "DistanceUnit": 0
    },
    "Connections": [
        {
            "ID": 145618,
            "ConnectionTypeID": 2,
            "Reference": "1",
            "StatusTypeID": 50,
            "LevelID": 3,
            "Amps": 100,
            "Voltage": 500,
            "PowerKW": 50,
            "CurrentTypeID": 30,
            "Comments": "Mode 4"
        },
        {
            "ID": 145619,
            "ConnectionTypeID": 33,
            "Reference": "2",
            "StatusTypeID": 50,
            "LevelID": 2,
            "Amps": 100,
            "Voltage": 500,
            "PowerKW": 50,
            "Comments": "Mode 4"
        },
        {
            "ID": 145620,
            "ConnectionTypeID": 25,
            "Reference": "3",
            "StatusTypeID": 50,
            "LevelID": 2,
            "Amps": 32,
            "Voltage": 400,
            "PowerKW": 22,
            "Quantity": 2,
            "Comments": "Mode 3"
        }
    ],
    "NumberOfPoints": 4,
    "StatusTypeID": 50,
    "DateLastStatusUpdate": "2020-08-27T20:01:00Z",
    "DataQualityLevel": 2,
    "DateCreated": "2018-04-21T06:52:00Z",
    "SubmissionStatusTypeID": 100
}