{
    "IsRecentlyVerified": false,
    "ID": 33606,
    "UUID": "306024CD-14D1-457D-830C-582CA827E7F1",
    "DataProviderID": 26,
    "DataProvidersReference": "22811",
    "OperatorID": 157,
    "OperatorsReference": "NewMotion 02000195",
    "UsageCost": "0.00 jaarabonnement",
    "AddressInfo": {
        "ID": 33952,
        "Title": "Kerkstraat 30",
        "AddressLine1": "Kerkstraat 30",
        "Town": "Heusden",
        "Postcode": "5253 AP",
        "CountryID": 159,
        "Latitude": 51.6943168640137,
        "Longitude": 5.17680168151855,
        "ContactTelephone1": "088 0109500",
        "RelatedURL": "http://thenewmotion.nl/",
        "DistanceUnit": 0
    },
    "Connections": [
        {
            "ID": 37117,
            "ConnectionTypeID": 25,
            "LevelID": 2,
            "PowerKW": 3.7,
            "CurrentTypeID": 10
        },
        {
            "ID": 46860,
            "ConnectionTypeID": 25,
            "LevelID": 2,
            "PowerKW": 3.7,
            "CurrentTypeID": 10
        }
    ],
    "NumberOfPoints": 1,
    "StatusTypeID": 50,
    "DateLastStatusUpdate": "2016-06-04T02:40:00Z",
    "DataQualityLevel": 3,
    "DateCreated": "2015-01-09T06:04:00Z",
    "SubmissionStatusTypeID": 100
}