{
    "IsRecentlyVerified": false,
    "ID": 126971,
    "UUID": "8C9A4790-6540-4F28-A1C8-B8A82D239035",
    "DataProviderID": 1,
    "OperatorID": 3349,
    "UsageTypeID": 5,
    "UsageCost": "£0.34/kWh",
    "AddressInfo": {
        "ID": 127317,
        "Title": "Lamp column on Ravenscroft Park",
        "AddressLine1": "Ravenscroft Park",
        "AddressLine2": "High Barnet",
        "Town": "London",
        "StateOrProvince": "England",
        "Postcode": "EN5 4NJ",
        "CountryID": 1,
        "Latitude": 51.6545,
        "Longitude": -0.20936,
        "DistanceUnit": 0
    },
    "Connections": [
        {
            "ID": 177822,
            "ConnectionTypeID": 25,
            "StatusTypeID": 50,
            "LevelID": 2,
            "Amps": 16,
            "Voltage": 230,
            "PowerKW": 3.6,
            "CurrentTypeID": 10,
            "Quantity": 1
        }
    ],
    "NumberOfPoints": 1,
    "GeneralComments": "Contactless payment or Plugsurfing / Roaming parters",
    "StatusTypeID": 50,
    "DateLastStatusUpdate": "2019-05-24T12:22:00Z",
    "DataQualityLevel": 1,
    "DateCreated": "2019-05-24T12:22:00Z",
    "SubmissionStatusTypeID": 200
}