{
    "IsRecentlyVerified": false,
    "ID": 148142,
    "UUID": "72D156C0-B643-4CDD-AACB-EA795702E3B5",
    "DataProviderID": 1,
    "OperatorID": 3375,
    "UsageTypeID": 1,
    "UsageCost": "0.33 per minute",
    "AddressInfo": {
        "ID": 148494,
        "Title": "Petro Canada - Medicine Hat",
        "AddressLine1": "2900 Box Springs Blvd NW",
        "StateOrProvince": "British Columbia",
        "Postcode": "T1C 0C8",
        "CountryID": 44,
        "Latitude": 50.07223343012018,
        "Longitude": -110.75400330213682,
        "ContactTelephone1": "800-668-0220",
        "DistanceUnit": 0
    },
    "Connections": [
        {
            "ID": 205676,
            "ConnectionTypeID": 2,
            "StatusTypeID": 50,
            "LevelID": 3,
            "PowerKW": 100,
            "CurrentTypeID": 30,
            "Quantity": 2
        },
        {
            "ID": 205677,
            "ConnectionTypeID": 32,
            "StatusTypeID": 50,
            "LevelID": 3,
            "PowerKW": 200,
            "CurrentTypeID": 30,
            "Quantity": 2
        }
    ],
    "NumberOfPoints": 2,
    "StatusTypeID": 50,
    "DateLastStatusUpdate": "2020-01-27T15:22:00Z",
    "DataQualityLevel": 1,
    "DateCreated": "2020-01-26T18:11:00Z",
    "SubmissionStatusTypeID": 200
}