{
    "IsRecentlyVerified": false,
    "ID": 129336,
    "UUID": "82605BDA-7C77-4AE7-8B68-8715BDF3C602",
    "DataProviderID": 1,
    "OperatorID": 3,
    "OperatorsReference": "PG-95337,PG-95342",
    "UsageTypeID": 4,
    "UsageCost": "Free",
    "AddressInfo": {
        "ID": 129682,
        "Title": "The Maypole At Wellow",
        "AddressLine1": "Newark Road",
        "Town": "Wellow",
        "StateOrProvince": "Newark",
        "Postcode": "NG22 0EA",
        "CountryID": 1,
        "Latitude": 53.189136,
        "Longitude": -0.998757,
        "DistanceUnit": 0
    },
    "Connections": [
        {
            "ID": 181016,
            "ConnectionTypeID": 25,
            "StatusTypeID": 50,
            "LevelID": 2,
            "Amps": 32,
            "Voltage": 230,
            "PowerKW": 7,
            "CurrentTypeID": 10,
            "Quantity": 2
        }
    ],
    "NumberOfPoints": 2,
    "GeneralComments": "This is an open charge unit installed at The Maypole at Wellow site at Newark Road, Wellow, Newark",
    "StatusTypeID": 50,
    "DateLastStatusUpdate": "2019-07-19T05:28:00Z",
    "DataQualityLevel": 1,
    "DateCreated": "2019-07-18T05:27:00Z",
    "SubmissionStatusTypeID": 200
}