{
    "IsRecentlyVerified": false,
    "ID": 146201,
    "UUID": "99E86186-2723-4D83-8528-779876B928C3",
    "DataProviderID": 1,
    "OperatorID": 3315,
    "OperatorsReference": "52409",
    "UsageTypeID": 4,
    "UsageCost": "£0.20/kWh; min £1.00; Overstay charge of £5.00 after 3 hours",
    "AddressInfo": {
        "ID": 146553,
        "Title": "Great Western Road Car Park Ac22 Dual (3)",
        "AddressLine1": "Great Western Road Car Park",
        "Town": "Kirkwall",
        "StateOrProvince": "Orkney",
        "Postcode": "KW15 1BX",
        "CountryID": 1,
        "Latitude": 58.9811,
        "Longitude": -2.96492,
        "DistanceUnit": 0
    },
    "Connections": [
        {
            "ID": 203149,
            "ConnectionTypeID": 25,
            "StatusTypeID": 50,
            "LevelID": 2,
            "Amps": 32,
            "Voltage": 400,
            "PowerKW": 22,
            "CurrentTypeID": 20,
            "Quantity": 2
        }
    ],
    "NumberOfPoints": 2,
    "StatusTypeID": 50,
    "DateLastStatusUpdate": "2020-04-16T05:14:00Z",
    "DataQualityLevel": 1,
    "DateCreated": "2020-01-02T08:30:00Z",
    "SubmissionStatusTypeID": 200
}