{
    "IsRecentlyVerified": false,
    "ID": 88195,
    "UUID": "B252B0AA-737B-4FBD-B18F-556BF46DB90B",
    "DataProviderID": 1,
    "OperatorID": 32,
    "OperatorsReference": "4215,4216",
    "UsageTypeID": 4,
    "UsageCost": "Inclusive; for Polar Plus subscription members only. Parking fees apply",
    "AddressInfo": {
        "ID": 88541,
        "Title": "Preston City Council",
        "AddressLine1": "Avenham Street Car Park",
        "AddressLine2": "Avenham",
        "Town": "Preston",
        "StateOrProvince": "Lancashire",
        "Postcode": "PR1 2AH",
        "CountryID": 1,
        "Latitude": 53.756809,
        "Longitude": -2.69741,
        "AccessComments": "Ground floor Level",
        "DistanceUnit": 0
    },
    "Connections": [
        {
            "ID": 125097,
            "ConnectionTypeID": 25,
            "StatusTypeID": 50,
            "LevelID": 2,
            "Amps": 32,
            "Voltage": 230,
            "PowerKW": 7,
            "CurrentTypeID": 10,
            "Quantity": 4
        }
    ],
    "NumberOfPoints": 4,
    "StatusTypeID": 50,
    "DateLastStatusUpdate": "2019-03-05T06:21:00Z",
    "DataQualityLevel": 1,
    "DateCreated": "2017-05-24T06:07:00Z",
    "SubmissionStatusTypeID": 200
}