{
    "IsRecentlyVerified": false,
    "ID": 188070,
    "UUID": "08D6A685-3B1A-4B69-B92A-7080AAFCC614",
    "DataProviderID": 18,
    "DataProvidersReference": "598013f5d1f1d2fdbfb43a7251fdb3a0",
    "OperatorID": 3298,
    "UsageTypeID": 5,
    "AddressInfo": {
        "ID": 188429,
        "Title": "Tarnbrook Road",
        "AddressLine1": "Tarnbrook Road",
        "Town": "Heysham",
        "Postcode": "LA3 2EJ",
        "CountryID": 1,
        "Latitude": 54.04913,
        "Longitude": -2.88806,
        "AccessComments": "",
        "RelatedURL": "http://www.eocharging.com",
        "DistanceUnit": 0
    },
    "Connections": [
        {
            "ID": 303499,
            "ConnectionTypeID": 25,
            "Reference": "EG-04814",
            "StatusTypeID": 50,
            "LevelID": 2,
            "Amps": 32,
            "Voltage": 400,
            "PowerKW": 22,
            "CurrentTypeID": 20
        },
        {
            "ID": 303500,
            "ConnectionTypeID": 25,
            "Reference": "EG-04893",
            "StatusTypeID": 50,
            "LevelID": 2,
            "Amps": 32,
            "Voltage": 400,
            "PowerKW": 22,
            "CurrentTypeID": 20
        }
    ],
    "StatusTypeID": 0,
    "DateLastStatusUpdate": "2021-07-12T03:39:00Z",
    "MetadataValues": [
        {
            "ID": 20310,
            "MetadataFieldID": 4,
            "ItemValue": "Contains public sector information licensed under the Open Government Licence v2.0. http://www.nationalarchives.gov.uk/doc/open-government-licence/version/2/"
        }
    ],
    "DataQualityLevel": 3,
    "DateCreated": "2021-07-12T03:39:00Z",
    "SubmissionStatusTypeID": 100
}