{
    "IsRecentlyVerified": false,
    "ID": 92439,
    "UUID": "05CA11BF-D33C-4034-8089-B3B0AA5681EA",
    "DataProviderID": 1,
    "OperatorID": 3330,
    "UsageTypeID": 6,
    "AddressInfo": {
        "ID": 92785,
        "Title": " QC Terme Bagni di Bormio Bagni Nuovi",
        "AddressLine1": "Via Bagni Nuovi, 7",
        "Town": "Valdidentro",
        "StateOrProvince": "SO",
        "Postcode": "23038 ",
        "CountryID": 112,
        "Latitude": 46.4859572695434,
        "Longitude": 10.3613343527054,
        "ContactTelephone1": "+39 0342 910131",
        "ContactEmail": "info@bagnidibormio.it",
        "RelatedURL": "https://www.qcterme.com/it/bormio/hotel-bagni-nuovi",
        "DistanceUnit": 0
    },
    "Connections": [
        {
            "ID": 131037,
            "ConnectionTypeID": 25,
            "StatusTypeID": 50,
            "LevelID": 2,
            "Amps": 32,
            "Voltage": 400,
            "PowerKW": 22,
            "CurrentTypeID": 20,
            "Quantity": 2
        }
    ],
    "NumberOfPoints": 2,
    "GeneralComments": "https://energiachetiserve.repower.com/ricarica101/",
    "StatusTypeID": 50,
    "DateLastStatusUpdate": "2019-01-13T17:48:00Z",
    "DataQualityLevel": 1,
    "DateCreated": "2017-09-06T13:49:00Z",
    "SubmissionStatusTypeID": 200
}