{
    "IsRecentlyVerified": false,
    "ID": 42263,
    "UUID": "021472CA-5B40-4302-88D5-65173460C5EE",
    "DataProviderID": 1,
    "OperatorID": 45,
    "UsageTypeID": 1,
    "UsageCost": "0",
    "AddressInfo": {
        "ID": 42609,
        "Title": "Elektromobilcenter Haberbauer",
        "AddressLine1": "Juri-Gagarin-Ring 11",
        "AddressLine2": "Neustädter Feld",
        "Town": "Parchim",
        "StateOrProvince": "Landkreis Ludwigslust-Parchim",
        "Postcode": "19370",
        "CountryID": 87,
        "Latitude": 53.4195730927585,
        "Longitude": 11.8210666420459,
        "AccessComments": "Immer verfügbare Steckdose am Betriebsgelände des CityEL Händlers. Strom kostenlos. ",
        "RelatedURL": "http://www.elektromobilcenter.com",
        "DistanceUnit": 0
    },
    "Connections": [
        {
            "ID": 50813,
            "ConnectionTypeID": 28,
            "StatusTypeID": 50,
            "LevelID": 2,
            "Amps": 16,
            "Voltage": 230,
            "PowerKW": 3.7,
            "CurrentTypeID": 10,
            "Quantity": 1
        }
    ],
    "NumberOfPoints": 1,
    "StatusTypeID": 50,
    "DateLastStatusUpdate": "2015-03-05T20:32:00Z",
    "DataQualityLevel": 1,
    "DateCreated": "2015-03-05T07:15:00Z",
    "SubmissionStatusTypeID": 200
}