{
    "IsRecentlyVerified": false,
    "ID": 175041,
    "UUID": "2672B1E2-265C-458B-83FD-0D2C8E1F805B",
    "DataProviderID": 1,
    "OperatorID": 3299,
    "UsageTypeID": 1,
    "AddressInfo": {
        "ID": 175400,
        "Title": "IONITY Saint-Rambert Ouest",
        "AddressLine1": "Aire de Saint-Rambert-d'Albon Ouest",
        "AddressLine2": "A7",
        "Town": "Saint-Rambert-d'Albon",
        "Postcode": "26140",
        "CountryID": 80,
        "Latitude": 45.275563,
        "Longitude": 4.825571,
        "DistanceUnit": 0
    },
    "Connections": [
        {
            "ID": 271288,
            "ConnectionTypeID": 33,
            "StatusTypeID": 50,
            "LevelID": 2,
            "PowerKW": 350
        }
    ],
    "NumberOfPoints": 4,
    "StatusTypeID": 50,
    "DateLastStatusUpdate": "2021-04-28T14:53:00Z",
    "DataQualityLevel": 1,
    "DateCreated": "2021-04-25T14:40:00Z",
    "SubmissionStatusTypeID": 200
}