{
    "IsRecentlyVerified": false,
    "ID": 143294,
    "UUID": "C89D9FFE-6E35-4113-B5A8-65E46AC0EB14",
    "DataProviderID": 2,
    "DataProvidersReference": "100350",
    "OperatorID": 5,
    "UsageTypeID": 1,
    "AddressInfo": {
        "ID": 143646,
        "Title": "NATIONAL GRID",
        "AddressLine1": "15-25 4th St",
        "Town": "Troy",
        "StateOrProvince": "NY",
        "Postcode": "12180",
        "CountryID": 2,
        "Latitude": 42.733036,
        "Longitude": -73.689266,
        "ContactTelephone1": "888-758-4389",
        "AccessComments": "24 hours daily",
        "RelatedURL": "http://www.chargepoint.com/",
        "DistanceUnit": 0
    },
    "Connections": [
        {
            "ID": 199590,
            "ConnectionTypeID": 1,
            "LevelID": 2,
            "Amps": 16,
            "Voltage": 230,
            "PowerKW": 3,
            "CurrentTypeID": 10,
            "Quantity": 4
        }
    ],
    "StatusTypeID": 50,
    "DateLastStatusUpdate": "2019-12-24T09:20:00Z",
    "DataQualityLevel": 3,
    "DateCreated": "2019-12-24T09:20:00Z",
    "SubmissionStatusTypeID": 100
}