{
    "IsRecentlyVerified": false,
    "ID": 42980,
    "UUID": "115CC1F3-400F-43DD-ADC8-FF7DEBE78B97",
    "DataProviderID": 26,
    "DataProvidersReference": "59974",
    "OperatorID": 180,
    "OperatorsReference": "Alfen RHL08041",
    "UsageCost": "0.00 jaarabonnement",
    "AddressInfo": {
        "ID": 43326,
        "Title": "Van Oldenbarneveltweg 36",
        "AddressLine1": "Van Oldenbarneveltweg 36",
        "Town": "Wassenaar",
        "Postcode": "2242 BB",
        "CountryID": 159,
        "Latitude": 52.142596,
        "Longitude": 4.401148,
        "ContactTelephone1": "036 - 549 34 00",
        "RelatedURL": "http://www.icu-charging-stations.com/",
        "DistanceUnit": 0
    },
    "Connections": [
        {
            "ID": 51972,
            "ConnectionTypeID": 25,
            "LevelID": 2,
            "PowerKW": 11,
            "CurrentTypeID": 10
        },
        {
            "ID": 51973,
            "ConnectionTypeID": 25,
            "LevelID": 2,
            "PowerKW": 11,
            "CurrentTypeID": 10
        }
    ],
    "NumberOfPoints": 1,
    "StatusTypeID": 50,
    "DateLastStatusUpdate": "2016-06-04T02:50:00Z",
    "DataQualityLevel": 3,
    "DateCreated": "2015-03-25T02:49:00Z",
    "SubmissionStatusTypeID": 100
}