{
    "IsRecentlyVerified": false,
    "ID": 114890,
    "UUID": "EF07AD0C-6C78-4BB0-B9F4-33EDB64F6B43",
    "DataProviderID": 1,
    "OperatorID": 23,
    "OperatorsReference": "48342",
    "UsageTypeID": 4,
    "AddressInfo": {
        "ID": 115236,
        "Title": "Gold 1 Garage",
        "AddressLine1": "792 W General Robinson St",
        "Town": "Pittsburgh",
        "StateOrProvince": "Pennsylvania",
        "Postcode": "15212",
        "CountryID": 2,
        "Latitude": 40.4477164,
        "Longitude": -80.0124669,
        "ContactTelephone1": "(412) 323-4455",
        "DistanceUnit": 0
    },
    "Connections": [
        {
            "ID": 161665,
            "ConnectionTypeID": 30,
            "StatusTypeID": 50,
            "LevelID": 2,
            "PowerKW": 16,
            "CurrentTypeID": 20,
            "Quantity": 4
        }
    ],
    "NumberOfPoints": 4,
    "GeneralComments": "4 Tesla Connectors, up to 16kW.Parking fees will apply. Self park.",
    "StatusTypeID": 50,
    "DateLastStatusUpdate": "2019-01-19T06:35:00Z",
    "DataQualityLevel": 1,
    "DateCreated": "2019-01-19T06:35:00Z",
    "SubmissionStatusTypeID": 200
}