{
    "IsRecentlyVerified": false,
    "ID": 99766,
    "UUID": "59A24664-DE26-4ABE-908C-59E168B59D6E",
    "DataProviderID": 1,
    "OperatorID": 3279,
    "OperatorsReference": "0047,0048",
    "UsageTypeID": 4,
    "UsageCost": "€0/kWh",
    "AddressInfo": {
        "ID": 100112,
        "Title": "Ajuntament d'Eivissa",
        "AddressLine1": "Ajuntament d'Eivissa",
        "Town": "Eivissa",
        "StateOrProvince": "Eivissa",
        "Postcode": "07800",
        "CountryID": 210,
        "Latitude": 38.911867,
        "Longitude": 1.421969,
        "DistanceUnit": 0
    },
    "Connections": [
        {
            "ID": 140960,
            "ConnectionTypeID": 25,
            "StatusTypeID": 100,
            "LevelID": 2,
            "Amps": 32,
            "Voltage": 400,
            "PowerKW": 22,
            "CurrentTypeID": 20,
            "Quantity": 2
        },
        {
            "ID": 140961,
            "ConnectionTypeID": 28,
            "StatusTypeID": 100,
            "LevelID": 1,
            "Voltage": 230,
            "PowerKW": 2.3,
            "CurrentTypeID": 10,
            "Quantity": 2
        }
    ],
    "NumberOfPoints": 2,
    "GeneralComments": "Acceso exclusivo con tarjeta del ayto de Ibiza. Pedir en C/Carlos III, nº6, sexta planta, área de Medio Ambiente. (971199635)",
    "StatusTypeID": 100,
    "DateLastStatusUpdate": "2019-12-18T19:48:00Z",
    "DataQualityLevel": 1,
    "DateCreated": "2018-02-03T15:30:00Z",
    "SubmissionStatusTypeID": 200
}