{
    "IsRecentlyVerified": false,
    "ID": 95888,
    "UUID": "0F989766-E4F9-43F1-8B25-D6A2C136CFE5",
    "DataProviderID": 1,
    "OperatorID": 156,
    "UsageTypeID": 4,
    "AddressInfo": {
        "ID": 96234,
        "Title": "Autohaus E. Funke (Hyundai & Mitsubishi)",
        "AddressLine1": "Fuldaer Straße 3",
        "Town": "Kirchhain",
        "StateOrProvince": "Landkreis Marburg-Biedenkopf",
        "Postcode": "35274",
        "CountryID": 87,
        "Latitude": 50.8183195,
        "Longitude": 8.94083390000003,
        "AccessComments": "2 durchgehend nutzbare New Motion lolo Wallboxen links vom Plakat \"E- Funke\" an der Hauswand des weißen Gebäudes an der Fuldaer Straße 3. Einkaufszentrum Herkulescenter in der Nähe",
        "RelatedURL": "http://www.e-funke.de/",
        "DistanceUnit": 0
    },
    "Connections": [
        {
            "ID": 135833,
            "ConnectionTypeID": 1036,
            "StatusTypeID": 50,
            "LevelID": 2,
            "Amps": 32,
            "Voltage": 400,
            "PowerKW": 22,
            "CurrentTypeID": 20,
            "Quantity": 2
        }
    ],
    "NumberOfPoints": 2,
    "StatusTypeID": 50,
    "DateLastStatusUpdate": "2017-11-29T10:44:00Z",
    "DataQualityLevel": 1,
    "DateCreated": "2017-11-29T10:44:00Z",
    "SubmissionStatusTypeID": 200
}