{
    "UserComments": [
        {
            "ID": 10137,
            "ChargePointID": 32125,
            "CommentTypeID": 100,
            "UserName": "Uli",
            "Comment": "Schwalbacher Straße \nRWE Vertrag notwendig\n24h/7d",
            "Rating": 5,
            "DateCreated": "2016-04-10T08:57:13.683Z",
            "User": {
                "ID": 9218,
                "Username": "Uli"
            },
            "CheckinStatusTypeID": 10
        }
    ],
    "IsRecentlyVerified": false,
    "ID": 32125,
    "UUID": "79A0F4E6-D620-4B75-AC58-9BC90FDED227",
    "DataProviderID": 1,
    "OperatorID": 105,
    "OperatorsReference": "Essent EM-DE-06439016-01-00001",
    "UsageTypeID": 4,
    "AddressInfo": {
        "ID": 32471,
        "Title": "Schalbacher Straße 26",
        "AddressLine1": "Schalbacher Straße 26",
        "Town": "Waldems",
        "Postcode": "65529",
        "CountryID": 87,
        "Latitude": 50.250053,
        "Longitude": 8.312911,
        "AccessComments": "Zugang 24/7, Freischaltung mit RWE Vertrag oder von Roamingpartnern, z.B. BEW, LübbeckeStrom emobil, Plugsurfing.",
        "DistanceUnit": 0
    },
    "Connections": [
        {
            "ID": 35636,
            "ConnectionTypeID": 25,
            "StatusTypeID": 50,
            "LevelID": 2,
            "PowerKW": 11,
            "CurrentTypeID": 20,
            "Quantity": 1
        },
        {
            "ID": 46226,
            "ConnectionTypeID": 25,
            "StatusTypeID": 50,
            "LevelID": 2,
            "Amps": 1,
            "PowerKW": 11,
            "CurrentTypeID": 20
        }
    ],
    "NumberOfPoints": 2,
    "StatusTypeID": 50,
    "DateLastStatusUpdate": "2016-04-10T19:48:00Z",
    "DataQualityLevel": 3,
    "DateCreated": "2015-01-09T06:03:00Z",
    "SubmissionStatusTypeID": 200
}