{
    "IsRecentlyVerified": false,
    "ID": 133938,
    "UUID": "64444386-5522-4522-BFB1-438820142300",
    "DataProviderID": 1,
    "OperatorID": 80,
    "UsageTypeID": 4,
    "AddressInfo": {
        "ID": 134284,
        "Title": "Fiano Romano Pasolini | EnelX",
        "AddressLine1": "Via Pier Paolo Pasolini",
        "Town": "Fiano Romano",
        "StateOrProvince": "RM",
        "Postcode": "00065",
        "CountryID": 112,
        "Latitude": 42.1586973434485,
        "Longitude": 12.5891619125759,
        "RelatedURL": "https://www.enelx.com/it/it/emobility",
        "DistanceUnit": 0
    },
    "Connections": [
        {
            "ID": 187420,
            "ConnectionTypeID": 25,
            "StatusTypeID": 50,
            "LevelID": 2,
            "Amps": 32,
            "Voltage": 400,
            "PowerKW": 22,
            "CurrentTypeID": 20,
            "Quantity": 1
        },
        {
            "ID": 187421,
            "ConnectionTypeID": 36,
            "StatusTypeID": 50,
            "LevelID": 2,
            "Amps": 16,
            "Voltage": 240,
            "PowerKW": 3.7,
            "CurrentTypeID": 10,
            "Quantity": 1
        }
    ],
    "NumberOfPoints": 2,
    "StatusTypeID": 50,
    "DateLastStatusUpdate": "2019-10-30T16:58:00Z",
    "DataQualityLevel": 1,
    "DateCreated": "2019-10-30T16:58:00Z",
    "SubmissionStatusTypeID": 200
}