{
    "IsRecentlyVerified": false,
    "ID": 74117,
    "UUID": "381B6E2F-B401-4DC9-ACDB-887F8353F9DD",
    "DataProviderID": 1,
    "OperatorID": 89,
    "OperatorsReference": "CEA-490",
    "UsageTypeID": 4,
    "UsageCost": "CAD 1.00/hour",
    "AddressInfo": {
        "ID": 74463,
        "Title": "St-Hubert-Cowansville",
        "AddressLine1": "1616 Rue du Sud",
        "Town": "Cowansville",
        "StateOrProvince": "QC",
        "Postcode": "J2K 0A9",
        "CountryID": 44,
        "Latitude": 45.191137,
        "Longitude": -72.75558,
        "DistanceUnit": 0
    },
    "Connections": [
        {
            "ID": 106442,
            "ConnectionTypeID": 1,
            "StatusTypeID": 50,
            "LevelID": 2,
            "Amps": 32,
            "Voltage": 230,
            "PowerKW": 7,
            "CurrentTypeID": 10,
            "Quantity": 1
        }
    ],
    "NumberOfPoints": 1,
    "StatusTypeID": 50,
    "DateLastStatusUpdate": "2016-11-27T11:43:00Z",
    "DataQualityLevel": 1,
    "DateCreated": "2016-11-24T00:21:00Z",
    "SubmissionStatusTypeID": 200
}