{
    "IsRecentlyVerified": false,
    "ID": 96633,
    "UUID": "E2952D5A-AA90-4D4C-97DF-B544FA0229C2",
    "DataProviderID": 2,
    "DataProvidersReference": "88977",
    "UsageTypeID": 1,
    "AddressInfo": {
        "ID": 96979,
        "Title": "Living Spaces",
        "AddressLine1": "49088 Fremont Blvd",
        "Town": "Fremont",
        "StateOrProvince": "CA",
        "Postcode": "94538",
        "CountryID": 2,
        "Latitude": 37.456813,
        "Longitude": -121.925174,
        "ContactTelephone1": "877-266-7300",
        "AccessComments": "10am-9pm M-F, 9am-9pm Sat-Sun; see front desk for access",
        "RelatedURL": "",
        "DistanceUnit": 0
    },
    "Connections": [
        {
            "ID": 136902,
            "ConnectionTypeID": 1,
            "LevelID": 2,
            "Amps": 16,
            "Voltage": 230,
            "PowerKW": 3,
            "CurrentTypeID": 10,
            "Quantity": 1
        }
    ],
    "DateLastStatusUpdate": "2019-04-06T04:02:00Z",
    "DataQualityLevel": 3,
    "DateCreated": "2017-12-29T21:01:00Z",
    "SubmissionStatusTypeID": 100
}