{
    "IsRecentlyVerified": false,
    "ID": 181163,
    "UUID": "D2A9D7B0-7137-4DCF-85E4-6F3A8FA4793F",
    "DataProviderID": 29,
    "DataProvidersReference": "11007",
    "OperatorID": 224,
    "AddressInfo": {
        "ID": 181522,
        "Title": "Kaiserstrasse 120",
        "AddressLine1": "Kaiserstrasse 120",
        "Town": "Pfullingen",
        "Postcode": "72793",
        "CountryID": 87,
        "Latitude": 48.477085,
        "Longitude": 9.231041,
        "DistanceUnit": 0
    },
    "Connections": [
        {
            "ID": 285130,
            "ConnectionTypeID": 28,
            "StatusTypeID": 50,
            "LevelID": 2,
            "PowerKW": 22,
            "CurrentTypeID": 20
        },
        {
            "ID": 285131,
            "ConnectionTypeID": 25,
            "StatusTypeID": 50,
            "LevelID": 2,
            "PowerKW": 22,
            "CurrentTypeID": 20
        },
        {
            "ID": 295851,
            "ConnectionTypeID": 25,
            "StatusTypeID": 50,
            "LevelID": 2,
            "PowerKW": 22,
            "CurrentTypeID": 20
        }
    ],
    "StatusTypeID": 50,
    "DateLastStatusUpdate": "2021-07-12T02:41:00Z",
    "MetadataValues": [
        {
            "ID": 13457,
            "MetadataFieldID": 4,
            "ItemValue": "Data from the German chargepoint registry provided by Bundesnetzagentur.de under the CC-BY 4.0 license"
        }
    ],
    "DataQualityLevel": 3,
    "DateCreated": "2021-07-08T10:01:00Z",
    "SubmissionStatusTypeID": 100
}