{
    "IsRecentlyVerified": false,
    "ID": 91354,
    "UUID": "2F3EEABE-0A05-4610-8E6A-0437679726A9",
    "DataProviderID": 2,
    "DataProvidersReference": "85877",
    "OperatorID": 5,
    "UsageTypeID": 1,
    "AddressInfo": {
        "ID": 91700,
        "Title": "CARTA",
        "AddressLine1": "601-699 S Hawthorne St",
        "Town": "Chattanooga",
        "StateOrProvince": "TN",
        "Postcode": "37404",
        "CountryID": 2,
        "Latitude": 35.0336671,
        "Longitude": -85.2776439,
        "ContactTelephone1": "888-758-4389",
        "AccessComments": "24 hours daily",
        "RelatedURL": "http://www.chargepoint.com/",
        "DistanceUnit": 0
    },
    "Connections": [
        {
            "ID": 129506,
            "ConnectionTypeID": 1,
            "LevelID": 2,
            "Amps": 16,
            "Voltage": 230,
            "PowerKW": 3,
            "CurrentTypeID": 10,
            "Quantity": 2
        }
    ],
    "DateLastStatusUpdate": "2019-04-06T04:02:00Z",
    "DataQualityLevel": 3,
    "DateCreated": "2017-08-03T12:25:00Z",
    "SubmissionStatusTypeID": 100
}