{
    "IsRecentlyVerified": false,
    "ID": 168985,
    "UUID": "8B7CE5CC-7E93-4326-8E55-4BC91BB86F74",
    "DataProviderID": 1,
    "OperatorID": 3296,
    "UsageTypeID": 5,
    "UsageCost": "£0.40/kWh",
    "AddressInfo": {
        "ID": 169344,
        "Title": "Heron Farm",
        "AddressLine1": "1 Weston Lane",
        "Town": "Honiton",
        "StateOrProvince": "Devon",
        "Postcode": "EX14 3PA",
        "CountryID": 1,
        "Latitude": 50.79668006468978,
        "Longitude": -3.2176377003357857,
        "DistanceUnit": 0
    },
    "Connections": [
        {
            "ID": 257765,
            "ConnectionTypeID": 33,
            "StatusTypeID": 50,
            "LevelID": 3,
            "PowerKW": 50,
            "CurrentTypeID": 30,
            "Quantity": 2
        },
        {
            "ID": 257766,
            "ConnectionTypeID": 2,
            "StatusTypeID": 50,
            "LevelID": 3,
            "PowerKW": 50,
            "CurrentTypeID": 30,
            "Quantity": 2
        }
    ],
    "NumberOfPoints": 2,
    "StatusTypeID": 50,
    "DateLastStatusUpdate": "2021-05-26T10:01:00Z",
    "DataQualityLevel": 1,
    "DateCreated": "2020-10-08T13:07:00Z",
    "SubmissionStatusTypeID": 200
}