{
    "IsRecentlyVerified": false,
    "ID": 143761,
    "UUID": "65A77833-94B8-49E6-8A61-C894289DD00B",
    "DataProviderID": 2,
    "DataProvidersReference": "123607",
    "UsageTypeID": 1,
    "AddressInfo": {
        "ID": 144113,
        "Title": "Town of Warren - Municipal Parking Lot",
        "AddressLine1": "Cemetery Rd",
        "Town": "Warren",
        "StateOrProvince": "VT",
        "Postcode": "05674",
        "CountryID": 2,
        "Latitude": 44.1131386878501,
        "Longitude": -72.8552841951065,
        "ContactTelephone1": "802-496-2709",
        "AccessComments": "24 hours daily",
        "RelatedURL": "",
        "DistanceUnit": 0
    },
    "Connections": [
        {
            "ID": 200153,
            "ConnectionTypeID": 1,
            "LevelID": 2,
            "Amps": 16,
            "Voltage": 230,
            "PowerKW": 3.7,
            "CurrentTypeID": 10,
            "Quantity": 2
        }
    ],
    "StatusTypeID": 50,
    "DateLastStatusUpdate": "2020-06-26T03:07:00Z",
    "DataQualityLevel": 3,
    "DateCreated": "2019-12-24T09:22:00Z",
    "SubmissionStatusTypeID": 100
}