{
    "IsRecentlyVerified": false,
    "ID": 21070,
    "UUID": "18EEA793-38A1-4489-953A-DE028DC0FCCA",
    "DataProviderID": 1,
    "OperatorID": 22,
    "OperatorsReference": "C3RQP-A/B",
    "AddressInfo": {
        "ID": 21415,
        "Title": "Clifton House",
        "AddressLine1": "11A Fitzwilliam Street Lower",
        "AddressLine2": "Dublin 2",
        "Town": "Dublin",
        "StateOrProvince": "County Dublin",
        "CountryID": 3,
        "Latitude": 53.337122,
        "Longitude": -6.248843,
        "DistanceUnit": 0
    },
    "Connections": [
        {
            "ID": 22932,
            "ConnectionTypeID": 25,
            "StatusTypeID": 75,
            "LevelID": 2,
            "Amps": 32,
            "Voltage": 400,
            "PowerKW": 22,
            "CurrentTypeID": 20,
            "Quantity": 2
        }
    ],
    "NumberOfPoints": 2,
    "StatusTypeID": 75,
    "DateLastStatusUpdate": "2019-06-25T05:31:00Z",
    "DataQualityLevel": 2,
    "DateCreated": "2014-02-14T04:50:00Z",
    "SubmissionStatusTypeID": 100
}