{
    "IsRecentlyVerified": false,
    "ID": 101632,
    "UUID": "8F045576-0733-4E99-87C4-F87684E67BAF",
    "DataProviderID": 1,
    "OperatorID": 69,
    "UsageTypeID": 4,
    "AddressInfo": {
        "ID": 101978,
        "Title": "Elisabethstraße",
        "AddressLine1": "Elisabethstraße",
        "AddressLine2": "Westerland",
        "Town": "Sylt",
        "StateOrProvince": "Kreis Nordfriesland",
        "Postcode": "25980",
        "CountryID": 87,
        "Latitude": 54.907586374078434,
        "Longitude": 8.300983403670102,
        "AccessComments": "Rund um die Uhr (24/7) nutzbare Ladesäule an der Ecke Elisabethstraße und Friedrichstraße. Parken mit Parkscheibe max. 2 Stunden ",
        "DistanceUnit": 0
    },
    "Connections": [
        {
            "ID": 143470,
            "ConnectionTypeID": 25,
            "StatusTypeID": 50,
            "LevelID": 2,
            "Amps": 32,
            "Voltage": 400,
            "PowerKW": 22,
            "CurrentTypeID": 20,
            "Quantity": 2
        },
        {
            "ID": 143471,
            "ConnectionTypeID": 28,
            "StatusTypeID": 50,
            "LevelID": 2,
            "Amps": 16,
            "Voltage": 230,
            "PowerKW": 3.7,
            "CurrentTypeID": 10,
            "Quantity": 2
        }
    ],
    "NumberOfPoints": 4,
    "StatusTypeID": 50,
    "DateLastStatusUpdate": "2018-04-03T09:08:00Z",
    "DataQualityLevel": 1,
    "DateCreated": "2018-04-03T09:08:00Z",
    "SubmissionStatusTypeID": 200
}