{
    "UserComments": [
        {
            "ID": 11534,
            "ChargePointID": 18986,
            "CommentTypeID": 10,
            "UserName": "Zyg0te",
            "Comment": "Ligger flott til og passer bra med pause på Marche elle bensinstasjonen i nærheten. ",
            "Rating": 5,
            "DateCreated": "2016-05-31T19:36:57.013Z",
            "User": {
                "ID": 7885,
                "Username": "Zyg0te"
            },
            "CheckinStatusTypeID": 10
        }
    ],
    "MediaItems": [
        {
            "ID": 7746,
            "ChargePointID": 18986,
            "ItemURL": "https://s3-ap-southeast-2.amazonaws.com/openchargemap/images/NO/OCM18986/OCM-18986.orig.2016071210284576.jpg",
            "ItemThumbnailURL": "https://s3-ap-southeast-2.amazonaws.com/openchargemap/images/NO/OCM18986/OCM-18986.thmb.2016071210284576.jpg",
            "Comment": "",
            "IsEnabled": true,
            "IsVideo": false,
            "IsFeaturedItem": false,
            "IsExternalResource": false,
            "User": {
                "ID": 7885,
                "Username": "Zyg0te"
            },
            "DateCreated": "2016-07-12T10:29:00Z"
        }
    ],
    "IsRecentlyVerified": false,
    "ID": 18986,
    "UUID": "A8E66235-4A5A-4AB9-99AD-E9ED311E328F",
    "DataProviderID": 1,
    "OperatorID": 23,
    "OperatorsReference": "6421",
    "UsageTypeID": 1,
    "UsageCost": "NKR 1.70/kWh; andre tariffer for eldre biler",
    "AddressInfo": {
        "ID": 19331,
        "Title": "Lillehammer Supercharger",
        "AddressLine1": "Korgvegen 37",
        "Town": "Lillehammer",
        "Postcode": "2619",
        "CountryID": 168,
        "Latitude": 61.130464,
        "Longitude": 10.434918,
        "ContactTelephone1": "80011093",
        "RelatedURL": "http://www.teslamotors.com/supercharger/lillehammer",
        "DistanceUnit": 0
    },
    "Connections": [
        {
            "ID": 22539,
            "ConnectionTypeID": 27,
            "StatusTypeID": 0,
            "LevelID": 3,
            "Amps": 270,
            "Voltage": 480,
            "PowerKW": 135,
            "CurrentTypeID": 30,
            "Quantity": 8
        }
    ],
    "NumberOfPoints": 14,
    "StatusTypeID": 50,
    "DateLastStatusUpdate": "2020-08-21T07:28:00Z",
    "DataQualityLevel": 2,
    "DateCreated": "2013-09-06T03:34:00Z",
    "SubmissionStatusTypeID": 200
}