{
    "IsRecentlyVerified": false,
    "ID": 138066,
    "UUID": "E55EBB53-A6A7-47F3-8A9B-38AEC4826CF0",
    "DataProviderID": 2,
    "DataProvidersReference": "123506",
    "UsageTypeID": 2,
    "AddressInfo": {
        "ID": 138415,
        "Title": "Bank of America - Buckeye",
        "AddressLine1": "1825 E Buckeye Rd",
        "Town": "Phoenix",
        "StateOrProvince": "AZ",
        "Postcode": "85034",
        "CountryID": 2,
        "Latitude": 33.435308,
        "Longitude": -112.040877,
        "ContactTelephone1": "",
        "AccessComments": "",
        "RelatedURL": "",
        "DistanceUnit": 0
    },
    "Connections": [
        {
            "ID": 193115,
            "ConnectionTypeID": 1,
            "LevelID": 2,
            "Amps": 16,
            "Voltage": 230,
            "PowerKW": 3,
            "CurrentTypeID": 10,
            "Quantity": 4
        }
    ],
    "StatusTypeID": 50,
    "DateLastStatusUpdate": "2019-12-24T09:06:00Z",
    "DataQualityLevel": 3,
    "DateCreated": "2019-12-24T09:06:00Z",
    "SubmissionStatusTypeID": 100
}