{
    "IsRecentlyVerified": false,
    "ID": 102915,
    "UUID": "38974C36-C813-4A17-95B1-F977B4563D2F",
    "DataProviderID": 2,
    "DataProvidersReference": "94816",
    "OperatorID": 3372,
    "UsageTypeID": 2,
    "AddressInfo": {
        "ID": 103261,
        "Title": "ADP - Elk Grove Village",
        "AddressLine1": "100 NW Point Rd",
        "Town": "Elk Grove Villa",
        "StateOrProvince": "IL",
        "Postcode": "60007",
        "CountryID": 2,
        "Latitude": 42.034543,
        "Longitude": -87.977995,
        "ContactTelephone1": "",
        "AccessComments": "Employee use only",
        "RelatedURL": "http://evconnect.com/",
        "DistanceUnit": 0
    },
    "Connections": [
        {
            "ID": 145060,
            "ConnectionTypeID": 1,
            "LevelID": 2,
            "Amps": 16,
            "Voltage": 230,
            "PowerKW": 3.7,
            "CurrentTypeID": 10,
            "Quantity": 1
        }
    ],
    "DateLastStatusUpdate": "2020-06-26T03:05:00Z",
    "DataQualityLevel": 3,
    "DateCreated": "2018-04-21T04:13:00Z",
    "SubmissionStatusTypeID": 100
}