{
    "IsRecentlyVerified": false,
    "ID": 85677,
    "UUID": "A6252C86-F3BE-4C20-8D43-7254D6988868",
    "DataProviderID": 1,
    "OperatorID": 23,
    "OperatorsReference": "26392",
    "UsageTypeID": 6,
    "AddressInfo": {
        "ID": 86023,
        "Title": "Hôtel Restaurant Spa les Peupliers",
        "AddressLine1": "Chemin de Lesdier",
        "Town": "Baratier",
        "Postcode": "5200",
        "CountryID": 80,
        "Latitude": 44.536315,
        "Longitude": 6.491732,
        "ContactTelephone1": "+33 4 92 43 03 47",
        "DistanceUnit": 0
    },
    "Connections": [
        {
            "ID": 121810,
            "ConnectionTypeID": 30,
            "StatusTypeID": 50,
            "LevelID": 2,
            "Amps": 32,
            "Voltage": 230,
            "PowerKW": 17,
            "CurrentTypeID": 20,
            "Quantity": 1
        }
    ],
    "NumberOfPoints": 1,
    "GeneralComments": "1 Tesla Connector, up to 17kW.Available for patrons only. Please call ahead.",
    "StatusTypeID": 50,
    "DateLastStatusUpdate": "2018-10-03T22:32:00Z",
    "DataQualityLevel": 1,
    "DateCreated": "2017-04-11T05:41:00Z",
    "SubmissionStatusTypeID": 200
}