{
    "IsRecentlyVerified": false,
    "ID": 138719,
    "UUID": "D94AF757-0C07-4E6E-B3D7-69BE3190F0AC",
    "DataProviderID": 2,
    "DataProvidersReference": "96031",
    "OperatorID": 9,
    "UsageTypeID": 1,
    "AddressInfo": {
        "ID": 139071,
        "Title": "Irving City Hall",
        "AddressLine1": "825 W Irving Blvd",
        "Town": "Irving",
        "StateOrProvince": "TX",
        "Postcode": "75061",
        "CountryID": 2,
        "Latitude": 32.813932,
        "Longitude": -96.956384,
        "ContactTelephone1": "888-998-2546",
        "AccessComments": "MON: 24 hours | TUE: 24 hours | WED: 24 hours | THU: 24 hours | FRI: 24 hours | SAT: 24 hours | SUN: 24 hours",
        "RelatedURL": "http://www.blinkcharging.com/",
        "DistanceUnit": 0
    },
    "Connections": [
        {
            "ID": 193909,
            "ConnectionTypeID": 1,
            "LevelID": 2,
            "Amps": 16,
            "Voltage": 230,
            "PowerKW": 3.7,
            "CurrentTypeID": 10,
            "Quantity": 2
        }
    ],
    "StatusTypeID": 50,
    "DateLastStatusUpdate": "2020-06-26T02:55:00Z",
    "DataQualityLevel": 3,
    "DateCreated": "2019-12-24T09:09:00Z",
    "SubmissionStatusTypeID": 100
}