{
    "IsRecentlyVerified": false,
    "ID": 23134,
    "UUID": "6809E583-5DFB-4A01-89F2-4E6FDB27DAFF",
    "DataProviderID": 1,
    "OperatorID": 62,
    "UsageTypeID": 4,
    "UsageCost": "",
    "AddressInfo": {
        "ID": 23479,
        "Title": "Auchan CHATEAUROUX",
        "AddressLine1": "Rue des Genièvres",
        "AddressLine2": "Forum",
        "Town": "Le Poinçonnet",
        "StateOrProvince": "Châteauroux",
        "Postcode": "36330",
        "CountryID": 80,
        "Latitude": 46.7918738976843,
        "Longitude": 1.73566614723267,
        "ContactTelephone1": "02.54.53.66.66 ",
        "ContactTelephone2": "",
        "ContactEmail": "",
        "AccessComments": "",
        "RelatedURL": "http://www.auchan.fr/magasins/chateauroux/147/informations-pratiques/",
        "DistanceUnit": 0
    },
    "Connections": [
        {
            "ID": 24874,
            "ConnectionTypeID": 2,
            "StatusTypeID": 0,
            "LevelID": 3,
            "CurrentTypeID": 30,
            "Quantity": 1
        },
        {
            "ID": 24875,
            "ConnectionTypeID": 25,
            "StatusTypeID": 0,
            "LevelID": 3,
            "CurrentTypeID": 20,
            "Quantity": 1
        }
    ],
    "NumberOfPoints": 2,
    "GeneralComments": "",
    "StatusTypeID": 50,
    "DateLastStatusUpdate": "2015-06-03T11:22:00Z",
    "DataQualityLevel": 1,
    "DateCreated": "2014-04-15T16:19:00Z",
    "SubmissionStatusTypeID": 200
}