{
    "IsRecentlyVerified": false,
    "ID": 68509,
    "UUID": "256665BE-1402-4E75-88E9-F3F7321A2174",
    "DataProviderID": 1,
    "OperatorID": 45,
    "UsageTypeID": 1,
    "AddressInfo": {
        "ID": 68855,
        "Title": "Carl's Place",
        "AddressLine1": "1400 East High Street",
        "Town": "Milton",
        "StateOrProvince": "WI",
        "Postcode": "53563",
        "CountryID": 2,
        "Latitude": 42.7725448804406,
        "Longitude": -88.9225480135959,
        "ContactTelephone1": "608-352-0002",
        "ContactTelephone2": "6083520002",
        "ContactEmail": "info@carlofet.com",
        "AccessComments": "Free to the Public",
        "RelatedURL": "http://www.carlofet.com",
        "DistanceUnit": 0
    },
    "Connections": [
        {
            "ID": 95820,
            "ConnectionTypeID": 1,
            "StatusTypeID": 50,
            "LevelID": 2,
            "Amps": 48,
            "Voltage": 240,
            "PowerKW": 11.5,
            "CurrentTypeID": 10,
            "Quantity": 1
        },
        {
            "ID": 95821,
            "ConnectionTypeID": 9,
            "StatusTypeID": 50,
            "LevelID": 1,
            "Voltage": 110,
            "CurrentTypeID": 10,
            "Quantity": 1
        }
    ],
    "NumberOfPoints": 1,
    "GeneralComments": "1 Clipper Creek HCS-60 48 amp/11.5kW Station (J1772) and 1 standard wall outlet. ",
    "StatusTypeID": 50,
    "DateLastStatusUpdate": "2016-06-10T23:28:00Z",
    "DataQualityLevel": 1,
    "DateCreated": "2016-06-10T17:26:00Z",
    "SubmissionStatusTypeID": 200
}