{
    "IsRecentlyVerified": false,
    "ID": 127240,
    "UUID": "E17508A9-46D3-4393-B9D5-34E02493D7ED",
    "DataProviderID": 1,
    "OperatorID": 1,
    "UsageTypeID": 6,
    "UsageCost": "0",
    "AddressInfo": {
        "ID": 127586,
        "Title": "Ru Sans / Top Spice",
        "AddressLine1": "Piedmont Road Northeast",
        "Town": "Atlanta",
        "StateOrProvince": "Fulton County",
        "Postcode": "30324",
        "CountryID": 2,
        "Latitude": 33.7958359671561,
        "Longitude": -84.3691664348758,
        "AccessComments": "In the parking lot, by a wooden fence structure.",
        "DistanceUnit": 0
    },
    "Connections": [
        {
            "ID": 178171,
            "ConnectionTypeID": 1,
            "StatusTypeID": 50,
            "LevelID": 2,
            "Amps": 32,
            "Voltage": 240,
            "PowerKW": 7.6,
            "CurrentTypeID": 10,
            "Quantity": 2
        }
    ],
    "NumberOfPoints": 2,
    "StatusTypeID": 50,
    "DateLastStatusUpdate": "2019-06-02T09:20:00Z",
    "DataQualityLevel": 1,
    "DateCreated": "2019-05-31T20:28:00Z",
    "SubmissionStatusTypeID": 200
}