{
    "IsRecentlyVerified": false,
    "ID": 125840,
    "UUID": "0AB412CD-4211-4474-A3D9-F431B99CBA8C",
    "DataProviderID": 1,
    "OperatorID": 3327,
    "UsageTypeID": 4,
    "AddressInfo": {
        "ID": 126186,
        "Title": "ADS CMF Flaminia Foligno | BeCharge",
        "AddressLine1": "Via Flaminia",
        "Town": "Foligno",
        "StateOrProvince": "PG",
        "Postcode": "06034",
        "CountryID": 112,
        "Latitude": 42.925397260844534,
        "Longitude": 12.72845973874314,
        "ContactTelephone1": "02-49527730",
        "ContactEmail": "emobility@buildingenergy.it",
        "RelatedURL": "https://www.bec.energy/",
        "DistanceUnit": 0
    },
    "Connections": [
        {
            "ID": 176354,
            "ConnectionTypeID": 25,
            "StatusTypeID": 50,
            "LevelID": 2,
            "Amps": 32,
            "Voltage": 400,
            "PowerKW": 22,
            "CurrentTypeID": 20,
            "Quantity": 2
        }
    ],
    "NumberOfPoints": 2,
    "GeneralComments": "\r\n",
    "StatusTypeID": 50,
    "DateLastStatusUpdate": "2019-04-30T13:10:00Z",
    "DataQualityLevel": 1,
    "DateCreated": "2019-04-30T13:10:00Z",
    "SubmissionStatusTypeID": 200
}