{
    "UserComments": [
        {
            "ID": 39,
            "ChargePointID": 5389,
            "CommentTypeID": 110,
            "UserName": "",
            "Comment": "wrong place\ngps point wrong",
            "Rating": 1,
            "DateCreated": "2011-11-26T15:36:25.527Z"
        },
        {
            "ID": 27,
            "ChargePointID": 5389,
            "CommentTypeID": 10,
            "UserName": "",
            "Comment": "wrong lat long",
            "DateCreated": "2011-11-14T20:36:38.13Z"
        }
    ],
    "IsRecentlyVerified": false,
    "ID": 5389,
    "UUID": "8D9B8553-F5DE-4564-9961-0449CE7260B9",
    "DataProviderID": 1,
    "OperatorID": 21,
    "UsageTypeID": 4,
    "UsageCost": "Mobi.E compatible card",
    "AddressInfo": {
        "ID": 5328,
        "Title": "PBL-00002",
        "AddressLine1": "A1 (direcção sul) - Estação de serviço Pombal",
        "Town": "Pombal",
        "Postcode": "0000-000",
        "CountryID": 180,
        "Latitude": 40.015032,
        "Longitude": -8.600399,
        "AccessComments": "Southbound",
        "RelatedURL": "http://www.mobie.pt",
        "DistanceUnit": 0
    },
    "Connections": [
        {
            "ID": 153463,
            "ConnectionTypeID": 2,
            "StatusTypeID": 50,
            "LevelID": 3,
            "Amps": 120,
            "Voltage": 500,
            "PowerKW": 50,
            "CurrentTypeID": 30,
            "Quantity": 1
        },
        {
            "ID": 153464,
            "ConnectionTypeID": 33,
            "StatusTypeID": 50,
            "LevelID": 3,
            "Amps": 125,
            "Voltage": 500,
            "PowerKW": 50,
            "CurrentTypeID": 30,
            "Quantity": 1
        },
        {
            "ID": 153465,
            "ConnectionTypeID": 1036,
            "StatusTypeID": 50,
            "LevelID": 3,
            "Amps": 64,
            "Voltage": 400,
            "PowerKW": 43,
            "CurrentTypeID": 20,
            "Quantity": 1
        }
    ],
    "NumberOfPoints": 2,
    "StatusTypeID": 50,
    "DateLastStatusUpdate": "2020-08-22T21:22:00Z",
    "DataQualityLevel": 1,
    "DateCreated": "2011-08-25T12:48:00Z",
    "SubmissionStatusTypeID": 100
}