{
    "IsRecentlyVerified": false,
    "ID": 91440,
    "UUID": "34946364-C775-40C9-8FEA-1A8E08C34192",
    "DataProviderID": 2,
    "DataProvidersReference": "86082",
    "UsageTypeID": 1,
    "AddressInfo": {
        "ID": 91786,
        "Title": "Middle Branch Park",
        "AddressLine1": "3301 Waterview Ave",
        "Town": "Baltimore",
        "StateOrProvince": "MD",
        "Postcode": "21230",
        "CountryID": 2,
        "Latitude": 39.254879,
        "Longitude": -76.622308,
        "ContactTelephone1": "410-685-1109",
        "AccessComments": "24 hours daily",
        "RelatedURL": "",
        "DistanceUnit": 0
    },
    "Connections": [
        {
            "ID": 129607,
            "ConnectionTypeID": 1,
            "LevelID": 2,
            "Amps": 16,
            "Voltage": 230,
            "PowerKW": 3.7,
            "CurrentTypeID": 10,
            "Quantity": 4
        }
    ],
    "DateLastStatusUpdate": "2020-06-26T03:01:00Z",
    "DataQualityLevel": 3,
    "DateCreated": "2017-08-03T12:25:00Z",
    "SubmissionStatusTypeID": 100
}