{
    "UserComments": [
        {
            "ID": 19148,
            "ChargePointID": 84697,
            "CommentTypeID": 10,
            "UserName": "PatrykS",
            "Comment": "Charging Opel Ampera",
            "Rating": 4,
            "DateCreated": "2018-02-03T12:58:03.707Z",
            "User": {
                "ID": 6418,
                "Username": "PatrykS"
            },
            "CheckinStatusTypeID": 10
        },
        {
            "ID": 18076,
            "ChargePointID": 84697,
            "CommentTypeID": 10,
            "UserName": "PatrykS",
            "Comment": "2018-01-05 12:00 Both bays blocked by ICEs :-(",
            "DateCreated": "2018-01-05T11:36:54.397Z",
            "User": {
                "ID": 6418,
                "Username": "PatrykS"
            }
        },
        {
            "ID": 16037,
            "ChargePointID": 84697,
            "CommentTypeID": 10,
            "UserName": "PatrykS",
            "Comment": "2017-03-09 09:15 Successfully charged Opel Ampera using one of the Mennekes / Type 2 sockets and own Type 2 -> Type 1 cable.",
            "Rating": 4,
            "DateCreated": "2017-03-09T14:49:30.347Z",
            "User": {
                "ID": 6418,
                "Username": "PatrykS"
            },
            "CheckinStatusTypeID": 10
        }
    ],
    "MediaItems": [
        {
            "ID": 10619,
            "ChargePointID": 84697,
            "ItemURL": "https://s3-ap-southeast-2.amazonaws.com/openchargemap/images/PL/OCM84697/OCM-84697.orig.2017030914484928.jpg",
            "ItemThumbnailURL": "https://s3-ap-southeast-2.amazonaws.com/openchargemap/images/PL/OCM84697/OCM-84697.thmb.2017030914484928.jpg",
            "Comment": "One of the stations' sockets.",
            "IsEnabled": true,
            "IsVideo": false,
            "IsFeaturedItem": false,
            "IsExternalResource": false,
            "User": {
                "ID": 6418,
                "Username": "PatrykS"
            },
            "DateCreated": "2017-03-09T14:49:00Z"
        },
        {
            "ID": 10618,
            "ChargePointID": 84697,
            "ItemURL": "https://s3-ap-southeast-2.amazonaws.com/openchargemap/images/PL/OCM84697/OCM-84697.orig.2017030914453842.jpg",
            "ItemThumbnailURL": "https://s3-ap-southeast-2.amazonaws.com/openchargemap/images/PL/OCM84697/OCM-84697.thmb.2017030914453842.jpg",
            "Comment": "Station and two bays",
            "IsEnabled": true,
            "IsVideo": false,
            "IsFeaturedItem": false,
            "IsExternalResource": false,
            "User": {
                "ID": 6418,
                "Username": "PatrykS"
            },
            "DateCreated": "2017-03-09T14:46:00Z"
        },
        {
            "ID": 10617,
            "ChargePointID": 84697,
            "ItemURL": "https://s3-ap-southeast-2.amazonaws.com/openchargemap/images/PL/OCM84697/OCM-84697.orig.2017030914445178.jpg",
            "ItemThumbnailURL": "https://s3-ap-southeast-2.amazonaws.com/openchargemap/images/PL/OCM84697/OCM-84697.thmb.2017030914445178.jpg",
            "Comment": "Station close to the entrance to the shopping center",
            "IsEnabled": true,
            "IsVideo": false,
            "IsFeaturedItem": false,
            "IsExternalResource": false,
            "User": {
                "ID": 6418,
                "Username": "PatrykS"
            },
            "DateCreated": "2017-03-09T14:45:00Z"
        }
    ],
    "IsRecentlyVerified": false,
    "ID": 84697,
    "UUID": "A738E76D-8D1E-4C62-9273-E7C8C5DAF8D4",
    "DataProviderID": 1,
    "OperatorID": 216,
    "UsageTypeID": 1,
    "UsageCost": "Free",
    "AddressInfo": {
        "ID": 85043,
        "Title": "Gdańsk Auchan przy Szczęśliwej",
        "AddressLine1": "Szczęśliwa 3",
        "Town": "Gdańsk",
        "StateOrProvince": "pomorskie",
        "Postcode": "80-190",
        "CountryID": 179,
        "Latitude": 54.350661248241146,
        "Longitude": 18.524470820170343,
        "ContactTelephone1": "+48 58 888 88 00",
        "ContactTelephone2": "+48 785 888 805",
        "ContactEmail": "biuro@enspirion.pl",
        "RelatedURL": "http://emobility.pl/",
        "DistanceUnit": 0
    },
    "Connections": [
        {
            "ID": 120308,
            "ConnectionTypeID": 25,
            "StatusTypeID": 50,
            "LevelID": 2,
            "Amps": 32,
            "Voltage": 400,
            "PowerKW": 22,
            "CurrentTypeID": 20,
            "Quantity": 2
        }
    ],
    "NumberOfPoints": 2,
    "StatusTypeID": 50,
    "DateLastStatusUpdate": "2018-02-03T12:58:00Z",
    "DataQualityLevel": 1,
    "DateCreated": "2017-03-09T14:43:00Z",
    "SubmissionStatusTypeID": 200
}