{
    "UserComments": [
        {
            "ID": 3440,
            "ChargePointID": 26413,
            "CommentTypeID": 100,
            "UserName": "",
            "Comment": "3 Tesla HPWCs for use by hotel guests (see front desk), or $6 for 4 hours (see valet). The HPWC at this site gives 203V at 64A. 2nd level of Parking Garage, next to the elevators.",
            "Rating": 4,
            "DateCreated": "2014-12-14T01:12:54.083Z",
            "CheckinStatusTypeID": 10
        }
    ],
    "IsRecentlyVerified": false,
    "ID": 26413,
    "UUID": "5FE2F020-8035-453A-9C10-09CD8D149ED6",
    "DataProviderID": 1,
    "OperatorID": 5,
    "UsageTypeID": 2,
    "AddressInfo": {
        "ID": 26759,
        "Title": "HYATT AUSTIN",
        "AddressLine1": "208 Barton Springs Rd",
        "Town": "Austin",
        "StateOrProvince": "TX",
        "Postcode": "78704",
        "CountryID": 2,
        "Latitude": 30.2604763,
        "Longitude": -97.7467678,
        "ContactTelephone1": "+1 512 477 1234",
        "AccessComments": "24 hours daily",
        "RelatedURL": "http://www.austin.hyatt.com/",
        "DistanceUnit": 0
    },
    "Connections": [
        {
            "ID": 28869,
            "ConnectionTypeID": 1,
            "LevelID": 2,
            "Amps": 16,
            "Voltage": 230,
            "PowerKW": 3,
            "CurrentTypeID": 10,
            "Quantity": 2
        },
        {
            "ID": 34514,
            "ConnectionTypeID": 30,
            "LevelID": 2,
            "Amps": 63,
            "Voltage": 203,
            "PowerKW": 15,
            "CurrentTypeID": 10,
            "Quantity": 3
        }
    ],
    "GeneralComments": "3 Tesla HPWCs for use by hotel guests (see front desk), or $6 for 4 hours (see valet). The HPWC at this site gives 203V at 64A. 2nd level of Parking Garage, next to the elevators.",
    "StatusTypeID": 0,
    "DateLastStatusUpdate": "2014-12-17T15:33:00Z",
    "DataQualityLevel": 3,
    "DateCreated": "2014-11-28T03:37:00Z",
    "SubmissionStatusTypeID": 200
}