{
    "IsRecentlyVerified": false,
    "ID": 163540,
    "UUID": "B2949260-30BE-4507-8FE8-4EF3A92164F2",
    "DataProviderID": 1,
    "OperatorID": 23,
    "OperatorsReference": "52891",
    "UsageTypeID": 4,
    "UsageCost": "€0.33/kWh; Andere Tarife für ältere Autos",
    "AddressInfo": {
        "ID": 163897,
        "Title": "Pfaffenhofen Supercharger",
        "AddressLine1": "Siebenecken 1",
        "Town": "Pfaffenhofen an der Ilm",
        "Postcode": "85276",
        "CountryID": 87,
        "Latitude": 48.518278,
        "Longitude": 11.562305,
        "DistanceUnit": 0
    },
    "Connections": [
        {
            "ID": 235137,
            "ConnectionTypeID": 27,
            "StatusTypeID": 50,
            "LevelID": 3,
            "PowerKW": 120,
            "CurrentTypeID": 30,
            "Quantity": 8
        }
    ],
    "NumberOfPoints": 8,
    "GeneralComments": "Charging8 Superchargers, available 24/7, up to 150kW",
    "StatusTypeID": 50,
    "DateLastStatusUpdate": "2020-08-25T05:56:00Z",
    "DataQualityLevel": 1,
    "DateCreated": "2020-08-24T12:08:00Z",
    "SubmissionStatusTypeID": 200
}