{
    "IsRecentlyVerified": false,
    "ID": 111982,
    "UUID": "BF0CEE51-29A5-4C85-8D0E-B3FDB82955ED",
    "DataProviderID": 2,
    "DataProvidersReference": "84988",
    "UsageTypeID": 7,
    "AddressInfo": {
        "ID": 112328,
        "Title": "Morrey Nissan",
        "AddressLine1": "4450 Still Creek Dr",
        "Town": "Burnaby",
        "StateOrProvince": "BC",
        "Postcode": "V5C 6C6",
        "CountryID": 44,
        "Latitude": 49.261072,
        "Longitude": -123.004274,
        "ContactTelephone1": "604-291-7261 x1",
        "AccessComments": "24 hours daily; for guest use only\r\nPublic - Call ahead",
        "RelatedURL": "",
        "DistanceUnit": 0
    },
    "Connections": [
        {
            "ID": 157508,
            "ConnectionTypeID": 1,
            "LevelID": 2,
            "Amps": 16,
            "Voltage": 230,
            "PowerKW": 3,
            "CurrentTypeID": 10,
            "Quantity": 1
        }
    ],
    "DateLastStatusUpdate": "2019-12-24T09:25:00Z",
    "DataQualityLevel": 3,
    "DateCreated": "2018-10-18T23:37:00Z",
    "SubmissionStatusTypeID": 100
}