{
    "IsRecentlyVerified": false,
    "ID": 105653,
    "UUID": "B549198B-27CF-43DE-ABFB-B34199B8A372",
    "DataProviderID": 2,
    "DataProvidersReference": "97039",
    "OperatorID": 5,
    "UsageTypeID": 1,
    "AddressInfo": {
        "ID": 105999,
        "Title": "CNTYOFRIVERSIDE",
        "AddressLine1": "4600 Crestmore Rd",
        "Town": "Riverside",
        "StateOrProvince": "CA",
        "Postcode": "92509",
        "CountryID": 2,
        "Latitude": 33.9825038,
        "Longitude": -117.4104621,
        "ContactTelephone1": "888-758-4389",
        "AccessComments": "24 hours daily",
        "RelatedURL": "http://www.chargepoint.com/",
        "DistanceUnit": 0
    },
    "Connections": [
        {
            "ID": 148844,
            "ConnectionTypeID": 1,
            "LevelID": 2,
            "Amps": 16,
            "Voltage": 230,
            "PowerKW": 3,
            "CurrentTypeID": 10,
            "Quantity": 2
        }
    ],
    "DateLastStatusUpdate": "2019-04-06T04:01:00Z",
    "DataQualityLevel": 3,
    "DateCreated": "2018-06-09T04:01:00Z",
    "SubmissionStatusTypeID": 100
}