{
    "IsRecentlyVerified": false,
    "ID": 90398,
    "UUID": "36A25097-39C5-45E4-B5C8-8EBC5006A22F",
    "DataProviderID": 1,
    "OperatorID": 23,
    "OperatorsReference": "31551",
    "UsageTypeID": 6,
    "AddressInfo": {
        "ID": 90744,
        "Title": "Châteaux de la Messardiere",
        "AddressLine1": "2 Route de Tahiti",
        "Town": "Saint-Tropez",
        "Postcode": "83990",
        "CountryID": 80,
        "Latitude": 43.253578,
        "Longitude": 6.657864,
        "ContactTelephone1": "+33 4 94 56 76 00",
        "DistanceUnit": 0
    },
    "Connections": [
        {
            "ID": 128051,
            "ConnectionTypeID": 30,
            "StatusTypeID": 50,
            "LevelID": 2,
            "Amps": 32,
            "Voltage": 400,
            "PowerKW": 22,
            "CurrentTypeID": 20,
            "Quantity": 1
        }
    ],
    "NumberOfPoints": 1,
    "GeneralComments": "1 Tesla Connector, up to 22kW.Available for patrons only. Please see valet.",
    "StatusTypeID": 50,
    "DateLastStatusUpdate": "2018-10-03T15:46:00Z",
    "DataQualityLevel": 1,
    "DateCreated": "2017-07-13T15:09:00Z",
    "SubmissionStatusTypeID": 200
}