{
    "IsRecentlyVerified": false,
    "ID": 52301,
    "UUID": "56F2FBFC-FED2-4D5A-A08D-9417E10778B2",
    "DataProviderID": 1,
    "OperatorID": 105,
    "UsageTypeID": 1,
    "AddressInfo": {
        "ID": 52647,
        "Title": "E-Bike Station Service Radstation / Ruhrtalranger",
        "AddressLine1": "Ruhrstraße 26",
        "AddressLine2": "Obereimer",
        "Town": "Arnsberg",
        "StateOrProvince": "Hochsauerlandkreis",
        "Postcode": "59821",
        "CountryID": 87,
        "Latitude": 51.3985137,
        "Longitude": 8.06582460000004,
        "ContactTelephone1": "0800 99 44 009",
        "RelatedURL": "http://www.rwe.com/web/cms/de/494436/e-bikes-on-tour/ladestationen/",
        "DistanceUnit": 0
    },
    "Connections": [
        {
            "ID": 64952,
            "ConnectionTypeID": 28,
            "StatusTypeID": 50,
            "LevelID": 1,
            "Amps": 10,
            "Voltage": 230,
            "PowerKW": 2.3,
            "CurrentTypeID": 10,
            "Quantity": 3
        }
    ],
    "NumberOfPoints": 3,
    "StatusTypeID": 50,
    "DateLastStatusUpdate": "2015-08-28T09:14:00Z",
    "DataQualityLevel": 1,
    "DateCreated": "2015-08-28T06:57:00Z",
    "SubmissionStatusTypeID": 200
}