{
    "IsRecentlyVerified": false,
    "ID": 133995,
    "UUID": "76C0E5A1-61FB-4A05-BEB7-541E17E8B5F8",
    "DataProviderID": 1,
    "OperatorID": 23,
    "OperatorsReference": "52274",
    "UsageTypeID": 4,
    "AddressInfo": {
        "ID": 134341,
        "Title": "Hampton Inn Durango",
        "AddressLine1": "Av. Heroico Colegio Militar 101 Nueva Vizcaya",
        "Town": "Durango",
        "StateOrProvince": "Durango",
        "Postcode": "34080",
        "CountryID": 146,
        "Latitude": 24.0317,
        "Longitude": -104.641279,
        "ContactTelephone1": "+52 618 150 2000",
        "DistanceUnit": 0
    },
    "Connections": [
        {
            "ID": 187490,
            "ConnectionTypeID": 30,
            "StatusTypeID": 50,
            "LevelID": 2,
            "PowerKW": 9,
            "CurrentTypeID": 20,
            "Quantity": 2
        }
    ],
    "NumberOfPoints": 2,
    "GeneralComments": "2 Tesla Connectors, up to 9kW.Available for customers. Self park.",
    "StatusTypeID": 50,
    "DateLastStatusUpdate": "2019-10-31T06:42:00Z",
    "DataQualityLevel": 1,
    "DateCreated": "2019-10-31T06:42:00Z",
    "SubmissionStatusTypeID": 200
}