{
    "IsRecentlyVerified": false,
    "ID": 91725,
    "UUID": "2E9F74C2-15E5-43A8-9275-E351F7C099C6",
    "DataProviderID": 1,
    "OperatorID": 45,
    "UsageTypeID": 1,
    "UsageCost": "Free",
    "AddressInfo": {
        "ID": 92071,
        "Title": "Stoppustuð Blönduósi",
        "AddressLine1": "Melabraut 2",
        "Town": "Blönduós",
        "Postcode": "540",
        "CountryID": 105,
        "Latitude": 65.660627,
        "Longitude": -20.278951,
        "ContactEmail": "orkusalan@orkusalan.is",
        "DistanceUnit": 0
    },
    "Connections": [
        {
            "ID": 130053,
            "ConnectionTypeID": 25,
            "StatusTypeID": 50,
            "LevelID": 2,
            "Amps": 32,
            "Voltage": 400,
            "PowerKW": 22,
            "CurrentTypeID": 20,
            "Quantity": 1
        }
    ],
    "NumberOfPoints": 1,
    "StatusTypeID": 50,
    "DateLastStatusUpdate": "2017-08-17T17:04:00Z",
    "DataQualityLevel": 1,
    "DateCreated": "2017-08-15T16:09:00Z",
    "SubmissionStatusTypeID": 200
}