{
    "IsRecentlyVerified": false,
    "ID": 181228,
    "UUID": "71D4A411-61B3-4D36-B6CB-61A448D46479",
    "DataProviderID": 29,
    "DataProvidersReference": "15705",
    "OperatorID": 127,
    "AddressInfo": {
        "ID": 181587,
        "Title": "Abschnede 195",
        "AddressLine1": "Abschnede 195",
        "Town": "Cuxhaven",
        "Postcode": "27472",
        "CountryID": 87,
        "Latitude": 53.844136,
        "Longitude": 8.698675,
        "DistanceUnit": 0
    },
    "Connections": [
        {
            "ID": 285294,
            "ConnectionTypeID": 25,
            "StatusTypeID": 50,
            "LevelID": 2,
            "PowerKW": 22,
            "CurrentTypeID": 20
        },
        {
            "ID": 285295,
            "ConnectionTypeID": 25,
            "StatusTypeID": 50,
            "LevelID": 2,
            "PowerKW": 22,
            "CurrentTypeID": 20
        }
    ],
    "StatusTypeID": 50,
    "DateLastStatusUpdate": "2021-07-12T02:52:00Z",
    "MetadataValues": [
        {
            "ID": 13522,
            "MetadataFieldID": 4,
            "ItemValue": "Data from the German chargepoint registry provided by Bundesnetzagentur.de under the CC-BY 4.0 license"
        }
    ],
    "DataQualityLevel": 3,
    "DateCreated": "2021-07-08T10:01:00Z",
    "SubmissionStatusTypeID": 100
}