{
    "UserComments": [
        {
            "ID": 23835,
            "ChargePointID": 172376,
            "CommentTypeID": 10,
            "UserName": "ForumElettrico.it",
            "Comment": "Ci sono 4 colonnine tipo 2 a da 7 kW e 2 da 22 kW. Leggi la recensione completa qui >   https://www.forumelettrico.it/forum/colonnina-parcheggio-degli-archi-ancona-t3684.html",
            "RelatedURL": "https://www.forumelettrico.it/forum/colonnina-parcheggio-degli-archi-ancona-t3684.html",
            "DateCreated": "2021-01-31T07:47:08.56Z",
            "User": {
                "ID": 11749,
                "Username": "ForumElettrico.it"
            },
            "CheckinStatusTypeID": 10,
            "IsActionedByEditor": false
        }
    ],
    "MediaItems": [
        {
            "ID": 26343,
            "ChargePointID": 172376,
            "ItemURL": "https://s3-ap-southeast-2.amazonaws.com/openchargemap/images/IT/OCM172376/OCM-172376.orig.2021013107472996.jpg",
            "ItemThumbnailURL": "https://s3-ap-southeast-2.amazonaws.com/openchargemap/images/IT/OCM172376/OCM-172376.thmb.2021013107472996.jpg",
            "Comment": "",
            "IsEnabled": true,
            "IsVideo": false,
            "IsFeaturedItem": false,
            "IsExternalResource": false,
            "User": {
                "ID": 11749,
                "Username": "ForumElettrico.it"
            },
            "DateCreated": "2021-01-31T07:48:00Z"
        },
        {
            "ID": 26344,
            "ChargePointID": 172376,
            "ItemURL": "https://s3-ap-southeast-2.amazonaws.com/openchargemap/images/IT/OCM172376/OCM-172376.orig.2021013107473533.jpg",
            "ItemThumbnailURL": "https://s3-ap-southeast-2.amazonaws.com/openchargemap/images/IT/OCM172376/OCM-172376.thmb.2021013107473533.jpg",
            "Comment": "",
            "IsEnabled": true,
            "IsVideo": false,
            "IsFeaturedItem": false,
            "IsExternalResource": false,
            "User": {
                "ID": 11749,
                "Username": "ForumElettrico.it"
            },
            "DateCreated": "2021-01-31T07:48:00Z"
        },
        {
            "ID": 26345,
            "ChargePointID": 172376,
            "ItemURL": "https://s3-ap-southeast-2.amazonaws.com/openchargemap/images/IT/OCM172376/OCM-172376.orig.2021013107474102.jpg",
            "ItemThumbnailURL": "https://s3-ap-southeast-2.amazonaws.com/openchargemap/images/IT/OCM172376/OCM-172376.thmb.2021013107474102.jpg",
            "Comment": "",
            "IsEnabled": true,
            "IsVideo": false,
            "IsFeaturedItem": false,
            "IsExternalResource": false,
            "User": {
                "ID": 11749,
                "Username": "ForumElettrico.it"
            },
            "DateCreated": "2021-01-31T07:48:00Z"
        },
        {
            "ID": 26342,
            "ChargePointID": 172376,
            "ItemURL": "https://s3-ap-southeast-2.amazonaws.com/openchargemap/images/IT/OCM172376/OCM-172376.orig.2021013107472310.jpg",
            "ItemThumbnailURL": "https://s3-ap-southeast-2.amazonaws.com/openchargemap/images/IT/OCM172376/OCM-172376.thmb.2021013107472310.jpg",
            "Comment": "",
            "IsEnabled": true,
            "IsVideo": false,
            "IsFeaturedItem": false,
            "IsExternalResource": false,
            "User": {
                "ID": 11749,
                "Username": "ForumElettrico.it"
            },
            "DateCreated": "2021-01-31T07:47:00Z"
        }
    ],
    "IsRecentlyVerified": false,
    "ID": 172376,
    "UUID": "E04378D1-18CB-4D66-BCEF-4CAA1BD68722",
    "DataProviderID": 1,
    "OperatorID": 1,
    "UsageTypeID": 1,
    "AddressInfo": {
        "ID": 172735,
        "Title": "Parcheggio Degli Archi",
        "AddressLine1": "Via Terenzio Mamiani",
        "Town": "Ancona",
        "StateOrProvince": "AN",
        "CountryID": 112,
        "Latitude": 43.609747,
        "Longitude": 13.503665,
        "RelatedURL": "https://www.forumelettrico.it/forum/colonnina-parcheggio-degli-archi-ancona-t3684.html",
        "DistanceUnit": 0
    },
    "Connections": [
        {
            "ID": 263551,
            "ConnectionTypeID": 25,
            "LevelID": 2,
            "PowerKW": 7,
            "Quantity": 4
        },
        {
            "ID": 263552,
            "ConnectionTypeID": 25,
            "LevelID": 2,
            "PowerKW": 22,
            "Quantity": 2
        }
    ],
    "NumberOfPoints": 6,
    "StatusTypeID": 50,
    "DateLastStatusUpdate": "2021-01-31T07:48:00Z",
    "DataQualityLevel": 1,
    "DateCreated": "2021-01-31T07:47:00Z",
    "SubmissionStatusTypeID": 200
}