{
    "IsRecentlyVerified": false,
    "ID": 123075,
    "UUID": "48AA093B-0B49-47D3-A630-06B88F910D0D",
    "DataProviderID": 2,
    "DataProvidersReference": "66610",
    "OperatorID": 39,
    "UsageTypeID": 1,
    "AddressInfo": {
        "ID": 123421,
        "Title": "Bob Barker Company",
        "AddressLine1": "134 North Main Street",
        "Town": "Fuquay Varina",
        "StateOrProvince": "NC",
        "Postcode": "27526",
        "CountryID": 2,
        "Latitude": 35.586162,
        "Longitude": -78.79956,
        "ContactTelephone1": "800-663-5633",
        "AccessComments": "MO: Not Specified; TU: Not Specified; WE: Not Specified; TH: Not Specified; FR: Not Specified; SA: Not Specified; SU: Not Specified",
        "RelatedURL": "http://www.semacharge.com/",
        "DistanceUnit": 0
    },
    "Connections": [
        {
            "ID": 173012,
            "ConnectionTypeID": 1,
            "LevelID": 2,
            "Amps": 16,
            "Voltage": 230,
            "PowerKW": 3,
            "CurrentTypeID": 10,
            "Quantity": 2
        }
    ],
    "DateLastStatusUpdate": "2019-04-06T05:03:00Z",
    "DataQualityLevel": 3,
    "DateCreated": "2019-04-06T05:03:00Z",
    "SubmissionStatusTypeID": 100
}