{
    "IsRecentlyVerified": false,
    "ID": 68869,
    "UUID": "0BBF5CB6-F9F5-4BC0-9FE1-C75453576365",
    "DataProviderID": 2,
    "DataProvidersReference": "76275",
    "OperatorID": 5,
    "UsageTypeID": 1,
    "AddressInfo": {
        "ID": 69215,
        "Title": "EVERGY",
        "AddressLine1": "3221 Indiana Ave @ KCPS Central Academy of Excellence",
        "Town": "Kansas City",
        "StateOrProvince": "MO",
        "Postcode": "64128",
        "CountryID": 2,
        "Latitude": 39.066891,
        "Longitude": -94.543466,
        "ContactTelephone1": "888-758-4389",
        "AccessComments": "24 hours daily",
        "RelatedURL": "http://www.chargepoint.com/",
        "DistanceUnit": 0
    },
    "Connections": [
        {
            "ID": 96571,
            "ConnectionTypeID": 1,
            "LevelID": 2,
            "Amps": 16,
            "Voltage": 230,
            "PowerKW": 3,
            "CurrentTypeID": 10,
            "Quantity": 6
        }
    ],
    "DateLastStatusUpdate": "2019-12-24T09:15:00Z",
    "DataQualityLevel": 3,
    "DateCreated": "2016-06-25T03:36:00Z",
    "SubmissionStatusTypeID": 100
}