{
    "IsRecentlyVerified": false,
    "ID": 141932,
    "UUID": "B88FD43D-DA11-49A4-AA7D-774558529367",
    "DataProviderID": 2,
    "DataProvidersReference": "149130",
    "OperatorID": 39,
    "UsageTypeID": 1,
    "AddressInfo": {
        "ID": 142284,
        "Title": "Hyatt Place - Pena",
        "AddressLine1": "6110 North Panasonic Way",
        "Town": "Denver",
        "StateOrProvince": "CO",
        "Postcode": "80249",
        "CountryID": 2,
        "Latitude": 39.8087177,
        "Longitude": -104.781494,
        "ContactTelephone1": "800-663-5633",
        "AccessComments": "MO: Not Specified; TU: Not Specified; WE: Not Specified; TH: Not Specified; FR: Not Specified; SA: Not Specified; SU: Not Specified",
        "RelatedURL": "http://www.semacharge.com/",
        "DistanceUnit": 0
    },
    "Connections": [
        {
            "ID": 197972,
            "ConnectionTypeID": 1,
            "LevelID": 2,
            "Amps": 16,
            "Voltage": 230,
            "PowerKW": 3.7,
            "CurrentTypeID": 10,
            "Quantity": 2
        }
    ],
    "StatusTypeID": 50,
    "DateLastStatusUpdate": "2020-06-26T03:02:00Z",
    "DataQualityLevel": 3,
    "DateCreated": "2019-12-24T09:16:00Z",
    "SubmissionStatusTypeID": 100
}