{
    "UserComments": [
        {
            "ID": 23015,
            "ChargePointID": 77333,
            "CommentTypeID": 10,
            "UserName": "interssl.com",
            "Comment": "This charger is located in the garage of a shopping mall.",
            "DateCreated": "2020-08-04T03:38:01.143Z",
            "User": {
                "ID": 26760,
                "Username": "interssl.com"
            },
            "CheckinStatusTypeID": 0,
            "IsActionedByEditor": false
        }
    ],
    "MediaItems": [
        {
            "ID": 23965,
            "ChargePointID": 77333,
            "ItemURL": "https://s3-ap-southeast-2.amazonaws.com/openchargemap/images/AT/OCM77333/OCM-77333.orig.2020080718584116.jpg",
            "ItemThumbnailURL": "https://s3-ap-southeast-2.amazonaws.com/openchargemap/images/AT/OCM77333/OCM-77333.thmb.2020080718584116.jpg",
            "Comment": "",
            "IsEnabled": true,
            "IsVideo": false,
            "IsFeaturedItem": false,
            "IsExternalResource": false,
            "User": {
                "ID": 26760,
                "Username": "interssl.com"
            },
            "DateCreated": "2020-08-07T18:59:00Z"
        },
        {
            "ID": 23966,
            "ChargePointID": 77333,
            "ItemURL": "https://s3-ap-southeast-2.amazonaws.com/openchargemap/images/AT/OCM77333/OCM-77333.orig.2020080718585457.jpg",
            "ItemThumbnailURL": "https://s3-ap-southeast-2.amazonaws.com/openchargemap/images/AT/OCM77333/OCM-77333.thmb.2020080718585457.jpg",
            "Comment": "",
            "IsEnabled": true,
            "IsVideo": false,
            "IsFeaturedItem": false,
            "IsExternalResource": false,
            "User": {
                "ID": 26760,
                "Username": "interssl.com"
            },
            "DateCreated": "2020-08-07T18:59:00Z"
        },
        {
            "ID": 23967,
            "ChargePointID": 77333,
            "ItemURL": "https://s3-ap-southeast-2.amazonaws.com/openchargemap/images/AT/OCM77333/OCM-77333.orig.2020080718591073.jpg",
            "ItemThumbnailURL": "https://s3-ap-southeast-2.amazonaws.com/openchargemap/images/AT/OCM77333/OCM-77333.thmb.2020080718591073.jpg",
            "Comment": "",
            "IsEnabled": true,
            "IsVideo": false,
            "IsFeaturedItem": false,
            "IsExternalResource": false,
            "User": {
                "ID": 26760,
                "Username": "interssl.com"
            },
            "DateCreated": "2020-08-07T18:59:00Z"
        },
        {
            "ID": 23964,
            "ChargePointID": 77333,
            "ItemURL": "https://s3-ap-southeast-2.amazonaws.com/openchargemap/images/AT/OCM77333/OCM-77333.orig.2020080718582474.jpg",
            "ItemThumbnailURL": "https://s3-ap-southeast-2.amazonaws.com/openchargemap/images/AT/OCM77333/OCM-77333.thmb.2020080718582474.jpg",
            "Comment": "",
            "IsEnabled": true,
            "IsVideo": false,
            "IsFeaturedItem": false,
            "IsExternalResource": false,
            "User": {
                "ID": 26760,
                "Username": "interssl.com"
            },
            "DateCreated": "2020-08-07T18:58:00Z"
        }
    ],
    "IsRecentlyVerified": false,
    "ID": 77333,
    "UUID": "5CE0D2FF-7CC0-4583-B479-B08D38F9C93E",
    "DataProviderID": 1,
    "OperatorID": 3253,
    "OperatorsReference": "AT*SMA*EAT0700781*001AC,AT*SMA*EAT0700781*002AC",
    "UsageTypeID": 1,
    "UsageCost": "€0,04/min ; Andere Tarife möglich",
    "AddressInfo": {
        "ID": 77679,
        "Title": "SMATRICS \"Das West\" (parking level -2)",
        "AddressLine1": "Höttinger Au 73",
        "Town": "Innsbruck",
        "StateOrProvince": "Tirol",
        "Postcode": "6020",
        "CountryID": 19,
        "Latitude": 47.264888,
        "Longitude": 11.373445,
        "DistanceUnit": 0
    },
    "Connections": [
        {
            "ID": 111415,
            "ConnectionTypeID": 25,
            "StatusTypeID": 50,
            "LevelID": 2,
            "Amps": 16,
            "Voltage": 400,
            "PowerKW": 11,
            "CurrentTypeID": 20,
            "Quantity": 2
        }
    ],
    "NumberOfPoints": 6,
    "StatusTypeID": 50,
    "DateLastStatusUpdate": "2020-08-08T07:07:00Z",
    "DataQualityLevel": 1,
    "DateCreated": "2017-01-09T09:45:00Z",
    "SubmissionStatusTypeID": 200
}