{
    "MediaItems": [
        {
            "ID": 28835,
            "ChargePointID": 188498,
            "ItemURL": "https://s3-ap-southeast-2.amazonaws.com/openchargemap/images/IT/OCM188498/OCM-188498.orig.2021072919074387.jpg",
            "ItemThumbnailURL": "https://s3-ap-southeast-2.amazonaws.com/openchargemap/images/IT/OCM188498/OCM-188498.thmb.2021072919074387.jpg",
            "Comment": "",
            "IsEnabled": true,
            "IsVideo": false,
            "IsFeaturedItem": false,
            "IsExternalResource": false,
            "User": {
                "ID": 33584,
                "Username": "Sfabris"
            },
            "DateCreated": "2021-07-29T19:08:00Z"
        }
    ],
    "IsRecentlyVerified": false,
    "ID": 188498,
    "UUID": "231D06B1-BAF6-458E-A5BA-8FC1E2121A4D",
    "DataProviderID": 1,
    "OperatorID": 3327,
    "UsageTypeID": 4,
    "AddressInfo": {
        "ID": 188857,
        "Title": "Becharge Centrale di Zugliano",
        "AddressLine1": "Piazza Giovanni Paolo II",
        "Town": "Zugliano",
        "StateOrProvince": "Veneto",
        "Postcode": "36010",
        "CountryID": 112,
        "Latitude": 45.72854963797377,
        "Longitude": 11.480223711520239,
        "DistanceUnit": 0
    },
    "Connections": [
        {
            "ID": 304425,
            "ConnectionTypeID": 25,
            "StatusTypeID": 50,
            "LevelID": 2,
            "PowerKW": 11,
            "CurrentTypeID": 20,
            "Quantity": 4
        }
    ],
    "NumberOfPoints": 4,
    "StatusTypeID": 50,
    "DateLastStatusUpdate": "2021-08-01T14:23:00Z",
    "DataQualityLevel": 1,
    "DateCreated": "2021-07-29T14:08:00Z",
    "SubmissionStatusTypeID": 200
}