{
    "IsRecentlyVerified": false,
    "ID": 150382,
    "UUID": "679E3F15-D079-414C-91A1-DA0759FF97F1",
    "DataProviderID": 28,
    "DataProvidersReference": "FR*09*PPDB*0006",
    "UsageTypeID": 5,
    "AddressInfo": {
        "ID": 150735,
        "Title": "LA CROIX VALMER PARKING",
        "AddressLine1": "Rue Louis Martin 83420 LA CROIX VALMER",
        "CountryID": 80,
        "Latitude": 43.207298,
        "Longitude": 6.5687221,
        "AccessComments": "24/24 7/7 jours",
        "DistanceUnit": 0
    },
    "Connections": [
        {
            "ID": 209049,
            "ConnectionTypeID": 1036,
            "StatusTypeID": 50,
            "LevelID": 2,
            "PowerKW": 22,
            "CurrentTypeID": 20
        },
        {
            "ID": 237753,
            "ConnectionTypeID": 1036,
            "StatusTypeID": 50,
            "LevelID": 2,
            "PowerKW": 22,
            "CurrentTypeID": 20
        },
        {
            "ID": 237754,
            "ConnectionTypeID": 1036,
            "StatusTypeID": 50,
            "LevelID": 2,
            "PowerKW": 22,
            "CurrentTypeID": 20
        },
        {
            "ID": 237755,
            "ConnectionTypeID": 1036,
            "StatusTypeID": 50,
            "LevelID": 2,
            "PowerKW": 22,
            "CurrentTypeID": 20
        }
    ],
    "GeneralComments": "Badges et application PlugSurfing, Badges KiWhi et partenaires, Badges Sodetrel (Zen et Premium), Abonns Plus de Bornes",
    "StatusTypeID": 50,
    "DateLastStatusUpdate": "2020-08-27T05:10:00Z",
    "DataQualityLevel": 2,
    "DateCreated": "2020-03-15T06:17:00Z",
    "SubmissionStatusTypeID": 100
}