{
    "IsRecentlyVerified": false,
    "ID": 8732,
    "UUID": "7EEE43AE-8704-4430-82D1-546EABDD70A0",
    "DataProviderID": 15,
    "DataProvidersReference": "10902",
    "OperatorID": 5,
    "UsageTypeID": 1,
    "AddressInfo": {
        "ID": 8629,
        "Title": "92-1185 Aliinui Drive",
        "AddressLine1": "92-1185 Aliinui Drive",
        "Town": "Kapolei",
        "StateOrProvince": "Hawaii",
        "Postcode": "96707",
        "CountryID": 2,
        "Latitude": 21.33979,
        "Longitude": -158.12387,
        "ContactTelephone1": "(714) 520-7001",
        "RelatedURL": "http://carstations.com/10902",
        "DistanceUnit": 0
    },
    "Connections": [
        {
            "ID": 6149,
            "ConnectionTypeID": 9,
            "Reference": "NEMA5",
            "Quantity": 1
        },
        {
            "ID": 6240,
            "ConnectionTypeID": 1,
            "Reference": "J1772",
            "LevelID": 2
        }
    ],
    "NumberOfPoints": 12,
    "StatusTypeID": 0,
    "DateLastStatusUpdate": "2017-11-04T14:03:00Z",
    "DataQualityLevel": 1,
    "DateCreated": "2011-11-11T12:07:00Z",
    "SubmissionStatusTypeID": 100
}