{
    "IsRecentlyVerified": false,
    "ID": 156185,
    "UUID": "DEC4CE03-B7DF-45DA-A05B-2C2A20BEE77E",
    "DataProviderID": 1,
    "OperatorID": 2,
    "UsageTypeID": 4,
    "AddressInfo": {
        "ID": 156539,
        "Title": "Rowland St Car Park - REV subiaco ",
        "AddressLine1": "",
        "CountryID": 18,
        "Latitude": -31.949523738615166,
        "Longitude": 115.82315269868431,
        "DistanceUnit": 0
    },
    "Connections": [
        {
            "ID": 219810,
            "ConnectionTypeID": 25,
            "StatusTypeID": 50,
            "LevelID": 2,
            "PowerKW": 4.8,
            "CurrentTypeID": 10,
            "Quantity": 1
        }
    ],
    "NumberOfPoints": 1,
    "StatusTypeID": 50,
    "DateLastStatusUpdate": "2021-10-13T05:58:00Z",
    "DataQualityLevel": 1,
    "DateCreated": "2020-05-10T08:00:00Z",
    "SubmissionStatusTypeID": 200
}