{
    "IsRecentlyVerified": false,
    "ID": 176440,
    "UUID": "1A4DD54D-2D31-4E1F-B892-F1A8610396F4",
    "DataProviderID": 29,
    "DataProvidersReference": "6628,9125",
    "AddressInfo": {
        "ID": 176799,
        "Title": "Hauptstraße 19",
        "AddressLine1": "Hauptstraße 19",
        "Town": "Kressbronn",
        "Postcode": "88079",
        "CountryID": 87,
        "Latitude": 47.596429,
        "Longitude": 9.599714,
        "DistanceUnit": 0
    },
    "Connections": [
        {
            "ID": 274362,
            "ConnectionTypeID": 25,
            "StatusTypeID": 50,
            "LevelID": 2,
            "PowerKW": 22,
            "CurrentTypeID": 20
        },
        {
            "ID": 274363,
            "ConnectionTypeID": 25,
            "StatusTypeID": 50,
            "LevelID": 2,
            "PowerKW": 22,
            "CurrentTypeID": 20
        }
    ],
    "StatusTypeID": 0,
    "DateLastStatusUpdate": "2021-07-09T03:10:00Z",
    "MetadataValues": [
        {
            "ID": 8735,
            "MetadataFieldID": 4,
            "ItemValue": "Data from the German chargepoint registry provided by Bundesnetzagentur.de under the CC-BY 4.0 license"
        }
    ],
    "DataQualityLevel": 3,
    "DateCreated": "2021-07-08T09:48:00Z",
    "SubmissionStatusTypeID": 100
}