{
    "IsRecentlyVerified": false,
    "ID": 172341,
    "UUID": "8DD1FF6E-598A-4D88-8408-B049D83C0DA1",
    "DataProviderID": 1,
    "OperatorID": 3,
    "UsageTypeID": 4,
    "UsageCost": "Free, use Pod Point app or webpage charge.pod-point.com to confirm cha",
    "AddressInfo": {
        "ID": 172700,
        "Title": "Doughnut Time",
        "AddressLine1": " 24 Robert Cort Industrial Estate",
        "AddressLine2": "Britten Road",
        "Town": "Reading",
        "StateOrProvince": "England",
        "Postcode": "RG2 0AU ",
        "CountryID": 1,
        "Latitude": 51.4422261643528,
        "Longitude": -0.9700897079592323,
        "RelatedURL": "https://pod-point.com/",
        "DistanceUnit": 0
    },
    "Connections": [
        {
            "ID": 263486,
            "ConnectionTypeID": 25,
            "StatusTypeID": 50,
            "LevelID": 2,
            "Amps": 32,
            "Voltage": 230,
            "PowerKW": 7,
            "CurrentTypeID": 10,
            "Quantity": 1
        },
        {
            "ID": 263487,
            "ConnectionTypeID": 25,
            "StatusTypeID": 50,
            "LevelID": 2,
            "PowerKW": 7,
            "CurrentTypeID": 10,
            "Quantity": 1
        }
    ],
    "NumberOfPoints": 1,
    "StatusTypeID": 50,
    "DateLastStatusUpdate": "2021-01-30T17:33:00Z",
    "DataQualityLevel": 1,
    "DateCreated": "2021-01-30T17:33:00Z",
    "SubmissionStatusTypeID": 200
}