{
    "IsRecentlyVerified": false,
    "ID": 62634,
    "UUID": "C320D519-DD93-4AA1-AB06-015AFC3EF09D",
    "DataProviderID": 26,
    "DataProvidersReference": "19765",
    "OperatorID": 162,
    "OperatorsReference": "日産自動車（株）座間事業所",
    "UsageCost": "0.00 onbekend",
    "AddressInfo": {
        "ID": 62980,
        "Title": "鶴間街道",
        "AddressLine1": "鶴間街道",
        "Town": "中郡",
        "Postcode": "242-0028",
        "CountryID": 114,
        "Latitude": 35.498207,
        "Longitude": 139.422577,
        "DistanceUnit": 0
    },
    "Connections": [
        {
            "ID": 79556,
            "ConnectionTypeID": 2,
            "LevelID": 3,
            "PowerKW": 50,
            "CurrentTypeID": 30
        }
    ],
    "NumberOfPoints": 1,
    "StatusTypeID": 50,
    "DateLastStatusUpdate": "2016-03-03T12:29:00Z",
    "DataQualityLevel": 3,
    "DateCreated": "2016-03-03T12:29:00Z",
    "SubmissionStatusTypeID": 100
}