{
    "IsRecentlyVerified": false,
    "ID": 129996,
    "UUID": "1DC2265E-8CEC-48E1-9EAC-8276D67B58E7",
    "DataProviderID": 1,
    "OperatorID": 80,
    "UsageTypeID": 4,
    "AddressInfo": {
        "ID": 130342,
        "Title": "COOP San Casciano in Val di Pesa | EnelX",
        "AddressLine1": "Viale Europa, 20",
        "Town": "San Casciano in Val di Pesa",
        "StateOrProvince": "FI",
        "Postcode": "50026",
        "CountryID": 112,
        "Latitude": 43.660807346673,
        "Longitude": 11.1842137398895,
        "RelatedURL": "https://www.enelx.com/it/it/emobility",
        "DistanceUnit": 0
    },
    "Connections": [
        {
            "ID": 181987,
            "ConnectionTypeID": 25,
            "StatusTypeID": 50,
            "LevelID": 2,
            "Amps": 32,
            "Voltage": 400,
            "PowerKW": 22,
            "CurrentTypeID": 20,
            "Quantity": 4
        }
    ],
    "NumberOfPoints": 4,
    "GeneralComments": "Lun-Sab 8:00-20:30 Dom 8:30-13:30",
    "StatusTypeID": 50,
    "DateLastStatusUpdate": "2019-07-30T10:28:00Z",
    "DataQualityLevel": 1,
    "DateCreated": "2019-07-30T10:28:00Z",
    "SubmissionStatusTypeID": 200
}