{
    "IsRecentlyVerified": false,
    "ID": 137221,
    "UUID": "65CD7EAB-A61C-43A9-9A85-201C1E2D96CE",
    "DataProviderID": 2,
    "DataProvidersReference": "149031",
    "OperatorID": 39,
    "UsageTypeID": 1,
    "AddressInfo": {
        "ID": 137567,
        "Title": "American Airlines Arena",
        "AddressLine1": "601 Biscayne Boulevard",
        "Town": "Miami",
        "StateOrProvince": "FL",
        "Postcode": "33132",
        "CountryID": 2,
        "Latitude": 25.7813496,
        "Longitude": -80.1874406,
        "ContactTelephone1": "800-663-5633",
        "AccessComments": "MO: Not Specified; TU: Not Specified; WE: Not Specified; TH: Not Specified; FR: Not Specified; SA: Not Specified; SU: Not Specified",
        "RelatedURL": "http://www.semacharge.com/",
        "DistanceUnit": 0
    },
    "Connections": [
        {
            "ID": 192088,
            "ConnectionTypeID": 1,
            "LevelID": 2,
            "Amps": 16,
            "Voltage": 230,
            "PowerKW": 3,
            "CurrentTypeID": 10,
            "Quantity": 2
        }
    ],
    "StatusTypeID": 50,
    "DateLastStatusUpdate": "2019-12-24T09:04:00Z",
    "DataQualityLevel": 3,
    "DateCreated": "2019-12-24T09:04:00Z",
    "SubmissionStatusTypeID": 100
}