{
    "IsRecentlyVerified": false,
    "ID": 70111,
    "UUID": "A2A8758B-AD85-4572-8D9E-1910ADB151E0",
    "DataProviderID": 1,
    "OperatorID": 1,
    "UsageTypeID": 6,
    "AddressInfo": {
        "ID": 70457,
        "Title": "Hotel Bernstein",
        "AddressLine1": "Am Hochufer 8",
        "Town": "Sellin",
        "StateOrProvince": "Mönchgut-Granitz",
        "Postcode": "18586",
        "CountryID": 87,
        "Latitude": 54.381695,
        "Longitude": 13.700101000000018,
        "ContactTelephone1": "+4938303-1717",
        "AccessComments": "CEE-Dose am Kurzzeitparkplatz. Ladewunsch bei Reservierung angeben. Zukünftig auch Telsa Destination Charging möglich, Stand bitte erfragen",
        "RelatedURL": "http://www.hotel-bernstein.de/",
        "DistanceUnit": 0
    },
    "Connections": [
        {
            "ID": 100025,
            "ConnectionTypeID": 17,
            "StatusTypeID": 50,
            "LevelID": 2,
            "Amps": 16,
            "Voltage": 400,
            "PowerKW": 11,
            "CurrentTypeID": 20,
            "Quantity": 1
        },
        {
            "ID": 100026,
            "ConnectionTypeID": 28,
            "StatusTypeID": 50,
            "LevelID": 2,
            "Amps": 16,
            "Voltage": 230,
            "PowerKW": 3.7,
            "CurrentTypeID": 10,
            "Quantity": 1
        }
    ],
    "NumberOfPoints": 1,
    "StatusTypeID": 50,
    "DateLastStatusUpdate": "2016-07-07T15:27:00Z",
    "DataQualityLevel": 1,
    "DateCreated": "2016-07-07T15:27:00Z",
    "SubmissionStatusTypeID": 200
}