{
    "IsRecentlyVerified": false,
    "ID": 73646,
    "UUID": "47EC221A-883A-4C99-8F27-1E2DBE58A69D",
    "DataProviderID": 1,
    "OperatorID": 89,
    "OperatorsReference": "CEA-10074",
    "UsageTypeID": 4,
    "UsageCost": "CAD 1.00/hour",
    "AddressInfo": {
        "ID": 73992,
        "Title": "St-Hubert-Rouyn-Noranda",
        "AddressLine1": "60 Avenue Québec",
        "Town": "Rouyn-Noranda",
        "StateOrProvince": "QC",
        "Postcode": "J9X 6P9",
        "CountryID": 44,
        "Latitude": 48.2425400954968,
        "Longitude": -79.0276757146978,
        "DistanceUnit": 0
    },
    "Connections": [
        {
            "ID": 105942,
            "ConnectionTypeID": 1,
            "StatusTypeID": 50,
            "LevelID": 2,
            "Amps": 32,
            "Voltage": 230,
            "PowerKW": 7,
            "CurrentTypeID": 10,
            "Quantity": 1
        }
    ],
    "NumberOfPoints": 1,
    "StatusTypeID": 50,
    "DateLastStatusUpdate": "2016-11-27T20:59:00Z",
    "DataQualityLevel": 1,
    "DateCreated": "2016-11-23T22:32:00Z",
    "SubmissionStatusTypeID": 200
}