{
    "IsRecentlyVerified": false,
    "ID": 82275,
    "UUID": "B1AB40C3-B69C-48E3-9FBA-8DC23A711528",
    "DataProviderID": 1,
    "OperatorID": 23,
    "OperatorsReference": "20413",
    "UsageTypeID": 6,
    "AddressInfo": {
        "ID": 82621,
        "Title": "Hotel-Restaurant Marko",
        "AddressLine1": "70 Kranzlhofenstrasse",
        "Town": "Velden am Wörthersee",
        "StateOrProvince": "Kärnten",
        "Postcode": "9220",
        "CountryID": 19,
        "Latitude": 46.624552,
        "Longitude": 14.034304,
        "ContactTelephone1": "+43 4274 2443",
        "DistanceUnit": 0
    },
    "Connections": [
        {
            "ID": 117041,
            "ConnectionTypeID": 30,
            "StatusTypeID": 50,
            "LevelID": 2,
            "Amps": 32,
            "Voltage": 400,
            "PowerKW": 22,
            "CurrentTypeID": 20,
            "Quantity": 2
        }
    ],
    "NumberOfPoints": 2,
    "GeneralComments": "2 Tesla Connectors, up to 22kW.Available for patrons only. Please call ahead.",
    "StatusTypeID": 50,
    "DateLastStatusUpdate": "2018-10-03T16:37:00Z",
    "DataQualityLevel": 1,
    "DateCreated": "2017-02-03T15:23:00Z",
    "SubmissionStatusTypeID": 200
}