{
    "IsRecentlyVerified": false,
    "ID": 154597,
    "UUID": "4EC86C96-6F93-496C-AFF5-A899B9C7614B",
    "DataProviderID": 18,
    "DataProvidersReference": "427485b4602cafa801fec16ef72fceb4",
    "OperatorID": 2244,
    "UsageTypeID": 4,
    "AddressInfo": {
        "ID": 154950,
        "Title": "null",
        "AddressLine1": "null",
        "Town": "London",
        "Postcode": "SW13 9PN",
        "CountryID": 1,
        "Latitude": 51.480574,
        "Longitude": -0.240188,
        "AccessComments": "",
        "RelatedURL": "https://www.ubitricity.com",
        "DistanceUnit": 0
    },
    "Connections": [
        {
            "ID": 217456,
            "ConnectionTypeID": 25,
            "Reference": "suby1100002069",
            "StatusTypeID": 50,
            "LevelID": 2,
            "Amps": 16,
            "Voltage": 230,
            "PowerKW": 3.7,
            "CurrentTypeID": 10
        }
    ],
    "StatusTypeID": 0,
    "DateLastStatusUpdate": "2021-04-25T05:46:00Z",
    "MetadataValues": [
        {
            "ID": 7149,
            "MetadataFieldID": 4,
            "ItemValue": "Contains public sector information licensed under the Open Government Licence v2.0. http://www.nationalarchives.gov.uk/doc/open-government-licence/version/2/"
        }
    ],
    "DataQualityLevel": 3,
    "DateCreated": "2020-03-17T08:15:00Z",
    "SubmissionStatusTypeID": 100
}