{
    "UserComments": [
        {
            "ID": 14468,
            "ChargePointID": 9301,
            "CommentTypeID": 10,
            "UserName": "Paul R",
            "Comment": "Station worked well.\r\nCHAdeMO ",
            "Rating": 4,
            "DateCreated": "2016-10-27T21:40:29.913Z",
            "User": {
                "ID": 11974,
                "Username": "Paul R"
            },
            "CheckinStatusTypeID": 10
        },
        {
            "ID": 14467,
            "ChargePointID": 9301,
            "CommentTypeID": 10,
            "UserName": "Paul R",
            "Comment": "Station worked well.\r\nCHAdeMO ",
            "Rating": 4,
            "DateCreated": "2016-10-27T21:40:23.613Z",
            "User": {
                "ID": 11974,
                "Username": "Paul R"
            },
            "CheckinStatusTypeID": 10
        }
    ],
    "IsRecentlyVerified": false,
    "ID": 9301,
    "UUID": "E823267C-2980-4787-A7C5-58F37FEA52BA",
    "DataProviderID": 15,
    "DataProvidersReference": "14492",
    "OperatorID": 5,
    "AddressInfo": {
        "ID": 9198,
        "Title": "128 E Brandon Blvd",
        "AddressLine1": "128 E Brandon Blvd",
        "Town": "Brandon",
        "StateOrProvince": "Florida",
        "Postcode": "33510",
        "CountryID": 2,
        "Latitude": 27.93809128,
        "Longitude": -82.28510284,
        "ContactTelephone1": "",
        "RelatedURL": "http://carstations.com/14492",
        "DistanceUnit": 0
    },
    "Connections": [
        {
            "ID": 7015,
            "ConnectionTypeID": 1,
            "Reference": "J1772",
            "LevelID": 2
        },
        {
            "ID": 7431,
            "ConnectionTypeID": 9,
            "Reference": "NEMA5",
            "Quantity": 1
        }
    ],
    "StatusTypeID": 0,
    "DateLastStatusUpdate": "2017-11-04T14:03:00Z",
    "DataQualityLevel": 2,
    "DateCreated": "2012-02-08T14:36:00Z",
    "SubmissionStatusTypeID": 100
}