{
    "UserComments": [
        {
            "ID": 3866,
            "ChargePointID": 41080,
            "CommentTypeID": 10,
            "UserName": "simon.hewison.old",
            "Comment": "Wrong country. Isle of Man is not the United Kingdom.",
            "DateCreated": "2015-02-23T10:39:50.68Z",
            "User": {
                "ID": 4550,
                "Username": "simon.hewison.old"
            },
            "CheckinStatusTypeID": 0
        },
        {
            "ID": 3650,
            "ChargePointID": 41080,
            "CommentTypeID": 10,
            "UserName": "SnaxMuppet",
            "Comment": "This needs verification before going live.",
            "DateCreated": "2015-01-27T01:15:50.733Z",
            "User": {
                "ID": 1009,
                "Username": "SnaxMuppet"
            },
            "CheckinStatusTypeID": 0
        }
    ],
    "MediaItems": [
        {
            "ID": 1433,
            "ChargePointID": 41080,
            "ItemURL": "https://s3-ap-southeast-2.amazonaws.com/openchargemap/images/IM/OCM41080/OCM-41080.orig.2015051723200798.jpg",
            "ItemThumbnailURL": "https://s3-ap-southeast-2.amazonaws.com/openchargemap/images/IM/OCM41080/OCM-41080.thmb.2015051723200798.jpg",
            "Comment": "",
            "IsEnabled": true,
            "IsVideo": false,
            "IsFeaturedItem": false,
            "IsExternalResource": false,
            "User": {
                "ID": 1516,
                "Username": "Dan Brook"
            },
            "DateCreated": "2015-05-17T23:20:00Z"
        }
    ],
    "IsRecentlyVerified": false,
    "ID": 41080,
    "UUID": "33B4BE05-73F0-4810-87FE-C59E369AF4D2",
    "DataProviderID": 1,
    "OperatorID": 1,
    "UsageTypeID": 1,
    "UsageCost": "Free",
    "AddressInfo": {
        "ID": 41426,
        "Title": "Food Park, Peel",
        "AddressLine1": "Food Park",
        "AddressLine2": "",
        "Town": "Peel",
        "StateOrProvince": "",
        "Postcode": "",
        "CountryID": 110,
        "Latitude": 54.220849,
        "Longitude": -4.698886,
        "ContactTelephone1": "",
        "ContactTelephone2": "",
        "ContactEmail": "",
        "AccessComments": "",
        "RelatedURL": "",
        "DistanceUnit": 0
    },
    "Connections": [
        {
            "ID": 44831,
            "ConnectionTypeID": 4,
            "StatusTypeID": 50,
            "LevelID": 1,
            "CurrentTypeID": 10,
            "Quantity": 2
        }
    ],
    "NumberOfPoints": 2,
    "GeneralComments": "Charger is live but a bit out of the way.",
    "StatusTypeID": 50,
    "DateLastStatusUpdate": "2015-05-18T22:20:00Z",
    "DataQualityLevel": 1,
    "DateCreated": "2015-01-23T09:23:00Z",
    "SubmissionStatusTypeID": 200
}