{
    "IsRecentlyVerified": false,
    "ID": 119815,
    "UUID": "5F3BA1D2-872E-4A3B-890C-3235DDF79DCD",
    "DataProviderID": 2,
    "DataProvidersReference": "46600",
    "UsageTypeID": 7,
    "AddressInfo": {
        "ID": 120161,
        "Title": "Marriott Grand Vista",
        "AddressLine1": "5935 Avenida Vista",
        "Town": "Orlando",
        "StateOrProvince": "FL",
        "Postcode": "32822",
        "CountryID": 2,
        "Latitude": 28.3984649,
        "Longitude": -81.4537093,
        "ContactTelephone1": "407-238-7676",
        "AccessComments": "24 hours daily; for guest use only\r\nPublic - Call ahead",
        "RelatedURL": "",
        "DistanceUnit": 0
    },
    "Connections": [
        {
            "ID": 169105,
            "ConnectionTypeID": 1,
            "LevelID": 2,
            "Amps": 16,
            "Voltage": 230,
            "PowerKW": 3.7,
            "CurrentTypeID": 10,
            "Quantity": 2
        }
    ],
    "DateLastStatusUpdate": "2020-06-26T02:52:00Z",
    "DataQualityLevel": 3,
    "DateCreated": "2019-04-01T04:59:00Z",
    "SubmissionStatusTypeID": 100
}