{
    "IsRecentlyVerified": false,
    "ID": 154595,
    "UUID": "2901F9C1-2F2F-4EE4-A104-C79BA042EA1D",
    "DataProviderID": 18,
    "DataProvidersReference": "378f322cfe754a8f5d987afb5faa6312",
    "OperatorID": 20,
    "UsageTypeID": 4,
    "AddressInfo": {
        "ID": 154948,
        "Title": "Redland Hill",
        "AddressLine1": "Redland Hill",
        "Town": "Bristol",
        "Postcode": "BS6 6UT",
        "CountryID": 1,
        "Latitude": 51.47134,
        "Longitude": -2.615144,
        "AccessComments": "Private Business Park",
        "RelatedURL": "http://www.chargeyourcar.org.uk",
        "DistanceUnit": 0
    },
    "Connections": [
        {
            "ID": 217453,
            "ConnectionTypeID": 3,
            "Reference": "SW1",
            "StatusTypeID": 50,
            "LevelID": 2,
            "Amps": 13,
            "Voltage": 230,
            "PowerKW": 3,
            "CurrentTypeID": 10
        },
        {
            "ID": 217454,
            "ConnectionTypeID": 25,
            "Reference": "SW2",
            "StatusTypeID": 50,
            "LevelID": 2,
            "Amps": 32,
            "Voltage": 230,
            "PowerKW": 7,
            "CurrentTypeID": 10
        }
    ],
    "StatusTypeID": 0,
    "DateLastStatusUpdate": "2020-03-17T08:15:00Z",
    "MetadataValues": [
        {
            "ID": 7147,
            "MetadataFieldID": 4,
            "ItemValue": "Contains public sector information licensed under the Open Government Licence v2.0. http://www.nationalarchives.gov.uk/doc/open-government-licence/version/2/"
        }
    ],
    "DataQualityLevel": 3,
    "DateCreated": "2020-03-17T08:15:00Z",
    "SubmissionStatusTypeID": 100
}