{
    "UserComments": [
        {
            "ID": 23340,
            "ChargePointID": 132966,
            "CommentTypeID": 10,
            "UserName": "ForumElettrico.it",
            "Comment": "Nessun problema sulla presa di sinistra con card Hera. Leggi la recensione completa qui > https://www.forumelettrico.it/forum/post142911.html#p142911",
            "RelatedURL": "https://www.forumelettrico.it/forum/post142911.html#p142911",
            "DateCreated": "2020-10-07T07:08:29.447Z",
            "User": {
                "ID": 11749,
                "Username": "ForumElettrico.it"
            },
            "CheckinStatusTypeID": 10,
            "IsActionedByEditor": false
        },
        {
            "ID": 22109,
            "ChargePointID": 132966,
            "CommentTypeID": 10,
            "UserName": "ForumElettrico.it",
            "RelatedURL": "https://www.forumelettrico.it/forum/colonnina-enel-x-22-kw-boretto-re-viale-umberto-i-36-t9096.html",
            "DateCreated": "2020-02-06T17:46:06.103Z",
            "User": {
                "ID": 11749,
                "Username": "ForumElettrico.it"
            },
            "CheckinStatusTypeID": 10,
            "IsActionedByEditor": false
        }
    ],
    "MediaItems": [
        {
            "ID": 24989,
            "ChargePointID": 132966,
            "ItemURL": "https://s3-ap-southeast-2.amazonaws.com/openchargemap/images/IT/OCM132966/OCM-132966.orig.2020100707084107.jpg",
            "ItemThumbnailURL": "https://s3-ap-southeast-2.amazonaws.com/openchargemap/images/IT/OCM132966/OCM-132966.thmb.2020100707084107.jpg",
            "Comment": "",
            "IsEnabled": true,
            "IsVideo": false,
            "IsFeaturedItem": false,
            "IsExternalResource": false,
            "User": {
                "ID": 11749,
                "Username": "ForumElettrico.it"
            },
            "DateCreated": "2020-10-07T07:09:00Z"
        },
        {
            "ID": 21175,
            "ChargePointID": 132966,
            "ItemURL": "https://s3-ap-southeast-2.amazonaws.com/openchargemap/images/IT/OCM132966/OCM-132966.orig.2020020617463124.jpg",
            "ItemThumbnailURL": "https://s3-ap-southeast-2.amazonaws.com/openchargemap/images/IT/OCM132966/OCM-132966.thmb.2020020617463124.jpg",
            "Comment": "",
            "IsEnabled": true,
            "IsVideo": false,
            "IsFeaturedItem": false,
            "IsExternalResource": false,
            "User": {
                "ID": 11749,
                "Username": "ForumElettrico.it"
            },
            "DateCreated": "2020-02-06T17:47:00Z"
        },
        {
            "ID": 21176,
            "ChargePointID": 132966,
            "ItemURL": "https://s3-ap-southeast-2.amazonaws.com/openchargemap/images/IT/OCM132966/OCM-132966.orig.2020020617463729.jpg",
            "ItemThumbnailURL": "https://s3-ap-southeast-2.amazonaws.com/openchargemap/images/IT/OCM132966/OCM-132966.thmb.2020020617463729.jpg",
            "Comment": "",
            "IsEnabled": true,
            "IsVideo": false,
            "IsFeaturedItem": false,
            "IsExternalResource": false,
            "User": {
                "ID": 11749,
                "Username": "ForumElettrico.it"
            },
            "DateCreated": "2020-02-06T17:47:00Z"
        },
        {
            "ID": 21173,
            "ChargePointID": 132966,
            "ItemURL": "https://s3-ap-southeast-2.amazonaws.com/openchargemap/images/IT/OCM132966/OCM-132966.orig.2020020617461669.jpg",
            "ItemThumbnailURL": "https://s3-ap-southeast-2.amazonaws.com/openchargemap/images/IT/OCM132966/OCM-132966.thmb.2020020617461669.jpg",
            "Comment": "",
            "IsEnabled": true,
            "IsVideo": false,
            "IsFeaturedItem": false,
            "IsExternalResource": false,
            "User": {
                "ID": 11749,
                "Username": "ForumElettrico.it"
            },
            "DateCreated": "2020-02-06T17:46:00Z"
        },
        {
            "ID": 21174,
            "ChargePointID": 132966,
            "ItemURL": "https://s3-ap-southeast-2.amazonaws.com/openchargemap/images/IT/OCM132966/OCM-132966.orig.2020020617462468.jpg",
            "ItemThumbnailURL": "https://s3-ap-southeast-2.amazonaws.com/openchargemap/images/IT/OCM132966/OCM-132966.thmb.2020020617462468.jpg",
            "Comment": "",
            "IsEnabled": true,
            "IsVideo": false,
            "IsFeaturedItem": false,
            "IsExternalResource": false,
            "User": {
                "ID": 11749,
                "Username": "ForumElettrico.it"
            },
            "DateCreated": "2020-02-06T17:46:00Z"
        }
    ],
    "IsRecentlyVerified": false,
    "ID": 132966,
    "UUID": "59C48CD3-E4D2-4285-951A-EB6AAA66728A",
    "DataProviderID": 1,
    "OperatorID": 80,
    "UsageTypeID": 4,
    "AddressInfo": {
        "ID": 133312,
        "Title": "Boretto Umberto | EnelX",
        "AddressLine1": "Viale Umberto I",
        "Town": "Boretto",
        "StateOrProvince": "RE",
        "Postcode": "42022",
        "CountryID": 112,
        "Latitude": 44.905246888541,
        "Longitude": 10.5552828191985,
        "ContactTelephone1": "800.069.850",
        "RelatedURL": "https://www.enelx.com/it/it/emobility",
        "DistanceUnit": 0
    },
    "Connections": [
        {
            "ID": 186237,
            "ConnectionTypeID": 25,
            "StatusTypeID": 50,
            "LevelID": 2,
            "Amps": 32,
            "Voltage": 400,
            "PowerKW": 22,
            "CurrentTypeID": 20,
            "Quantity": 2
        }
    ],
    "NumberOfPoints": 2,
    "StatusTypeID": 50,
    "DateLastStatusUpdate": "2020-10-07T07:09:00Z",
    "DataQualityLevel": 1,
    "DateCreated": "2019-10-10T15:53:00Z",
    "SubmissionStatusTypeID": 200
}