{
    "IsRecentlyVerified": false,
    "ID": 89470,
    "UUID": "800BE563-0BB2-4D05-AD07-99F66C285792",
    "DataProviderID": 2,
    "DataProvidersReference": "85616",
    "OperatorID": 5,
    "UsageTypeID": 1,
    "AddressInfo": {
        "ID": 89816,
        "Title": "BMW LOUISVILLE",
        "AddressLine1": "4311 Shelbyville Rd",
        "Town": "Louisville",
        "StateOrProvince": "KY",
        "Postcode": "40207",
        "CountryID": 2,
        "Latitude": 38.251662,
        "Longitude": -85.635937,
        "ContactTelephone1": "888-758-4389",
        "AccessComments": "24 hours daily",
        "RelatedURL": "http://www.chargepoint.com/",
        "DistanceUnit": 0
    },
    "Connections": [
        {
            "ID": 126869,
            "ConnectionTypeID": 1,
            "LevelID": 2,
            "Amps": 16,
            "Voltage": 230,
            "PowerKW": 3,
            "CurrentTypeID": 10,
            "Quantity": 1
        }
    ],
    "DateLastStatusUpdate": "2019-04-06T04:02:00Z",
    "DataQualityLevel": 3,
    "DateCreated": "2017-06-22T08:16:00Z",
    "SubmissionStatusTypeID": 100
}