{
    "IsRecentlyVerified": false,
    "ID": 113201,
    "UUID": "05D86DDD-3B8C-4C65-B0C9-0785F366323A",
    "DataProviderID": 2,
    "DataProvidersReference": "104261",
    "UsageTypeID": 7,
    "AddressInfo": {
        "ID": 113547,
        "Title": "Ken Ware Chevrolet",
        "AddressLine1": "1595 Newmark St",
        "Town": "North Bend",
        "StateOrProvince": "OR",
        "Postcode": "97459",
        "CountryID": 2,
        "Latitude": 43.390905,
        "Longitude": -124.234151,
        "ContactTelephone1": "541-756-1181",
        "AccessComments": "Dealership business hours\r\nPublic - Call ahead",
        "RelatedURL": "",
        "DistanceUnit": 0
    },
    "Connections": [
        {
            "ID": 159387,
            "ConnectionTypeID": 1,
            "LevelID": 2,
            "Amps": 16,
            "Voltage": 230,
            "PowerKW": 3.7,
            "CurrentTypeID": 10,
            "Quantity": 1
        }
    ],
    "DateLastStatusUpdate": "2020-06-26T03:07:00Z",
    "DataQualityLevel": 3,
    "DateCreated": "2018-11-28T02:04:00Z",
    "SubmissionStatusTypeID": 100
}