{
    "IsRecentlyVerified": false,
    "ID": 186769,
    "UUID": "A25BEC9D-129C-47CF-9B2C-1E454C749614",
    "DataProviderID": 29,
    "DataProvidersReference": "20759",
    "AddressInfo": {
        "ID": 187128,
        "Title": "Wiesenstraße 5",
        "AddressLine1": "Wiesenstraße 5",
        "Town": "Versmold",
        "Postcode": "33775",
        "CountryID": 87,
        "Latitude": 52.039185,
        "Longitude": 8.156009,
        "DistanceUnit": 0
    },
    "Connections": [
        {
            "ID": 300121,
            "ConnectionTypeID": 25,
            "StatusTypeID": 50,
            "LevelID": 2,
            "PowerKW": 22,
            "CurrentTypeID": 20
        },
        {
            "ID": 300122,
            "ConnectionTypeID": 25,
            "StatusTypeID": 50,
            "LevelID": 2,
            "PowerKW": 22,
            "CurrentTypeID": 20
        }
    ],
    "StatusTypeID": 50,
    "DateLastStatusUpdate": "2021-07-12T02:48:00Z",
    "MetadataValues": [
        {
            "ID": 19010,
            "MetadataFieldID": 4,
            "ItemValue": "Data from the German chargepoint registry provided by Bundesnetzagentur.de under the CC-BY 4.0 license"
        }
    ],
    "DataQualityLevel": 3,
    "DateCreated": "2021-07-12T02:48:00Z",
    "SubmissionStatusTypeID": 100
}