{
    "UserComments": [
        {
            "ID": 14076,
            "ChargePointID": 16026,
            "CommentTypeID": 10,
            "UserName": "Simon Hewison",
            "Comment": "Only 16A. Two of four bays iced.",
            "Rating": 2,
            "DateCreated": "2016-08-15T17:45:28.633Z",
            "User": {
                "ID": 4575,
                "Username": "Simon Hewison"
            },
            "CheckinStatusTypeID": 10
        }
    ],
    "IsRecentlyVerified": false,
    "ID": 16026,
    "UUID": "2A3A4318-6490-40CA-B550-4141B21B0209",
    "DataProviderID": 1,
    "OperatorID": 32,
    "OperatorsReference": "2060,2076",
    "UsageTypeID": 4,
    "UsageCost": "Inclusive; for Polar Plus subscription members only",
    "AddressInfo": {
        "ID": 16371,
        "Title": "Waitrose",
        "AddressLine1": "Mayne Avenue",
        "Town": "St Albans",
        "Postcode": "AL3 4JZ",
        "CountryID": 1,
        "Latitude": 51.7463558851351,
        "Longitude": -0.360285043716431,
        "ContactTelephone1": "01727 831117  Waitrose",
        "ContactTelephone2": "0330 016 5126 Chargemaster",
        "AccessComments": "Waitrose shoppers car park, open Mo-Fr 08:00-21:00, Sa 08:00-20:00 Su 11:00-17:00. Max stay 2 hours",
        "RelatedURL": "http://www.waitrose.com/bf_home/bf/166.html",
        "DistanceUnit": 0
    },
    "Connections": [
        {
            "ID": 14426,
            "ConnectionTypeID": 25,
            "StatusTypeID": 50,
            "LevelID": 2,
            "Amps": 16,
            "Voltage": 230,
            "PowerKW": 4,
            "CurrentTypeID": 10,
            "Quantity": 4
        }
    ],
    "NumberOfPoints": 4,
    "GeneralComments": "Chargemaster post. No longer accepts Source East / Source London cards",
    "StatusTypeID": 50,
    "DateLastStatusUpdate": "2019-03-06T06:14:00Z",
    "DataQualityLevel": 3,
    "DateCreated": "2013-02-23T04:46:00Z",
    "SubmissionStatusTypeID": 200
}