{
    "IsRecentlyVerified": false,
    "ID": 73934,
    "UUID": "6971017A-5305-4F5C-B707-6FA6491756F6",
    "DataProviderID": 1,
    "OperatorID": 89,
    "OperatorsReference": "CEA-207",
    "UsageTypeID": 4,
    "UsageCost": "CAD 2.50",
    "AddressInfo": {
        "ID": 74280,
        "Title": "Hôtel Chicoutimi",
        "AddressLine1": "460 rue racine Est",
        "Town": "Saquenay",
        "StateOrProvince": "QC",
        "Postcode": "G7H 1T7",
        "CountryID": 44,
        "Latitude": 48.428263,
        "Longitude": -71.05391,
        "DistanceUnit": 0
    },
    "Connections": [
        {
            "ID": 106246,
            "ConnectionTypeID": 1,
            "StatusTypeID": 50,
            "LevelID": 2,
            "Amps": 32,
            "Voltage": 230,
            "PowerKW": 7,
            "CurrentTypeID": 10,
            "Quantity": 1
        }
    ],
    "NumberOfPoints": 1,
    "StatusTypeID": 50,
    "DateLastStatusUpdate": "2016-11-27T17:01:00Z",
    "DataQualityLevel": 1,
    "DateCreated": "2016-11-23T23:39:00Z",
    "SubmissionStatusTypeID": 200
}