{
    "IsRecentlyVerified": false,
    "ID": 173298,
    "UUID": "4292DB62-A639-4B92-B5B3-40B26E81D73A",
    "DataProviderID": 19,
    "DataProvidersReference": "6975",
    "AddressInfo": {
        "ID": 173657,
        "Title": "Blönduós (N1)",
        "AddressLine1": "Blöndós (N1), Norðurlandsvegur 3",
        "Town": "Blönduósi",
        "StateOrProvince": "Norðurland vestra",
        "Postcode": "540",
        "CountryID": 105,
        "Latitude": 65.6602,
        "Longitude": -20.2759,
        "AccessComments": "",
        "DistanceUnit": 0
    },
    "Connections": [
        {
            "ID": 266209,
            "ConnectionTypeID": 25,
            "Reference": "1",
            "LevelID": 3,
            "Amps": 32,
            "Voltage": 400,
            "PowerKW": 22,
            "CurrentTypeID": 30,
            "Comments": "Mode 3"
        },
        {
            "ID": 266210,
            "ConnectionTypeID": 2,
            "Reference": "2",
            "LevelID": 3,
            "Amps": 100,
            "Voltage": 500,
            "PowerKW": 50,
            "CurrentTypeID": 30,
            "Comments": "Mode 4"
        },
        {
            "ID": 266211,
            "ConnectionTypeID": 33,
            "Reference": "3",
            "LevelID": 3,
            "Amps": 100,
            "Voltage": 500,
            "PowerKW": 50,
            "CurrentTypeID": 30,
            "Comments": "Mode 4"
        }
    ],
    "NumberOfPoints": 3,
    "StatusTypeID": 0,
    "DateLastStatusUpdate": "2021-03-03T09:03:00Z",
    "DataQualityLevel": 2,
    "DateCreated": "2021-03-03T09:03:00Z",
    "SubmissionStatusTypeID": 100
}