{
    "IsRecentlyVerified": false,
    "ID": 120248,
    "UUID": "BEFB9FB4-75B0-46BB-994A-FCFC002986A7",
    "DataProviderID": 2,
    "DataProvidersReference": "93756",
    "OperatorID": 5,
    "UsageTypeID": 1,
    "AddressInfo": {
        "ID": 120594,
        "Title": "THE MICHAEL",
        "AddressLine1": "13535 Lyndhurst St",
        "Town": "Austin",
        "StateOrProvince": "TX",
        "Postcode": "78729",
        "CountryID": 2,
        "Latitude": 30.4772328,
        "Longitude": -97.785194,
        "ContactTelephone1": "888-758-4389",
        "AccessComments": "24 hours daily",
        "RelatedURL": "http://www.chargepoint.com/",
        "DistanceUnit": 0
    },
    "Connections": [
        {
            "ID": 169578,
            "ConnectionTypeID": 1,
            "LevelID": 2,
            "Amps": 16,
            "Voltage": 230,
            "PowerKW": 3,
            "CurrentTypeID": 10,
            "Quantity": 2
        }
    ],
    "DateLastStatusUpdate": "2019-12-24T09:09:00Z",
    "DataQualityLevel": 3,
    "DateCreated": "2019-04-01T04:59:00Z",
    "SubmissionStatusTypeID": 100
}