{
    "IsRecentlyVerified": false,
    "ID": 64118,
    "UUID": "FA210E67-CCE0-4113-89C9-ADCE73AC5B8B",
    "DataProviderID": 26,
    "DataProvidersReference": "83017",
    "OperatorID": 73,
    "OperatorsReference": "EV-Box EVB-P1449041",
    "UsageCost": "0.00 jaarabonnement",
    "AddressInfo": {
        "ID": 64464,
        "Title": "Het Schar",
        "AddressLine1": "Het Schar",
        "Town": "Steenwijkerland",
        "Postcode": "8332 CR",
        "CountryID": 159,
        "Latitude": 52.7932,
        "Longitude": 6.13028,
        "RelatedURL": "http://www.ev-box.nl",
        "DistanceUnit": 0
    },
    "Connections": [
        {
            "ID": 82010,
            "ConnectionTypeID": 25,
            "LevelID": 2,
            "PowerKW": 5,
            "CurrentTypeID": 10
        }
    ],
    "NumberOfPoints": 1,
    "StatusTypeID": 50,
    "DateLastStatusUpdate": "2016-06-04T02:55:00Z",
    "DataQualityLevel": 3,
    "DateCreated": "2016-03-03T12:33:00Z",
    "SubmissionStatusTypeID": 100
}