{
    "IsRecentlyVerified": false,
    "ID": 103693,
    "UUID": "3DDC68FB-E60C-425E-A400-2862BD29F7E3",
    "DataProviderID": 1,
    "OperatorID": 23,
    "OperatorsReference": "42557",
    "UsageTypeID": 4,
    "AddressInfo": {
        "ID": 104039,
        "Title": "Super 8 San Bruno /SF Intl Arpt West",
        "AddressLine1": "421 el Camino Real",
        "Town": "San Bruno",
        "StateOrProvince": "California",
        "Postcode": "94066",
        "CountryID": 2,
        "Latitude": 37.621832,
        "Longitude": -122.412209,
        "ContactTelephone1": "(650) 624-0999",
        "DistanceUnit": 0
    },
    "Connections": [
        {
            "ID": 146363,
            "ConnectionTypeID": 30,
            "StatusTypeID": 50,
            "LevelID": 2,
            "PowerKW": 10,
            "CurrentTypeID": 10,
            "Quantity": 2
        }
    ],
    "NumberOfPoints": 2,
    "GeneralComments": "2 Tesla Connectors, up to 10kW.Available for customers. Please see front desk.",
    "StatusTypeID": 50,
    "DateLastStatusUpdate": "2018-05-05T05:54:00Z",
    "DataQualityLevel": 1,
    "DateCreated": "2018-05-05T05:54:00Z",
    "SubmissionStatusTypeID": 200
}