{
    "IsRecentlyVerified": false,
    "ID": 129968,
    "UUID": "6EE073A4-536D-4CFA-8DCD-26748D5C3995",
    "DataProviderID": 1,
    "OperatorID": 23,
    "OperatorsReference": "51214",
    "UsageTypeID": 4,
    "UsageCost": "$0.21/kWh; other tariffs for older cars",
    "AddressInfo": {
        "ID": 130314,
        "Title": "Robbinsdale, MN Supercharger",
        "AddressLine1": "3501 West Broadway Avenue",
        "Town": "Robbinsdale",
        "StateOrProvince": "MN",
        "Postcode": "55422",
        "CountryID": 2,
        "Latitude": 45.019569,
        "Longitude": -93.325799,
        "DistanceUnit": 0
    },
    "Connections": [
        {
            "ID": 181958,
            "ConnectionTypeID": 27,
            "StatusTypeID": 50,
            "LevelID": 3,
            "PowerKW": 120,
            "CurrentTypeID": 30,
            "Quantity": 8
        }
    ],
    "NumberOfPoints": 8,
    "GeneralComments": "Charging8 Superchargers, available 24/7, up to 120kW",
    "StatusTypeID": 50,
    "DateLastStatusUpdate": "2019-07-30T09:29:00Z",
    "DataQualityLevel": 1,
    "DateCreated": "2019-07-30T09:29:00Z",
    "SubmissionStatusTypeID": 200
}