{
    "IsRecentlyVerified": false,
    "ID": 96717,
    "UUID": "A17FB0EE-F2D0-4492-8A2D-FDF1E6D07D77",
    "DataProviderID": 2,
    "DataProvidersReference": "88541",
    "OperatorID": 5,
    "UsageTypeID": 1,
    "AddressInfo": {
        "ID": 97063,
        "Title": "BEDFORDEV",
        "AddressLine1": "60 Haines Rd.",
        "Town": "Bedford Hills",
        "StateOrProvince": "NY",
        "Postcode": "10507",
        "CountryID": 2,
        "Latitude": 41.2341135,
        "Longitude": -73.7066215,
        "ContactTelephone1": "888-758-4389",
        "AccessComments": "24 hours daily",
        "RelatedURL": "http://www.chargepoint.com/",
        "DistanceUnit": 0
    },
    "Connections": [
        {
            "ID": 136993,
            "ConnectionTypeID": 1,
            "LevelID": 2,
            "Amps": 16,
            "Voltage": 230,
            "PowerKW": 3,
            "CurrentTypeID": 10,
            "Quantity": 2
        }
    ],
    "DateLastStatusUpdate": "2019-12-24T09:18:00Z",
    "DataQualityLevel": 3,
    "DateCreated": "2017-12-29T21:01:00Z",
    "SubmissionStatusTypeID": 100
}