{
    "IsRecentlyVerified": false,
    "ID": 178498,
    "UUID": "20ABC462-1200-4FC0-9504-866F543CDB7C",
    "DataProviderID": 29,
    "DataProvidersReference": "18040",
    "OperatorID": 105,
    "AddressInfo": {
        "ID": 178857,
        "Title": "Strandstr. 56Z",
        "AddressLine1": "Strandstr. 56Z",
        "Town": "Timmendorfer Strand",
        "Postcode": "23669",
        "CountryID": 87,
        "Latitude": 53.9926,
        "Longitude": 10.8156,
        "DistanceUnit": 0
    },
    "Connections": [
        {
            "ID": 278998,
            "ConnectionTypeID": 25,
            "StatusTypeID": 50,
            "LevelID": 2,
            "PowerKW": 22,
            "CurrentTypeID": 20
        },
        {
            "ID": 302246,
            "ConnectionTypeID": 25,
            "StatusTypeID": 50,
            "LevelID": 2,
            "PowerKW": 22,
            "CurrentTypeID": 20
        }
    ],
    "StatusTypeID": 0,
    "DateLastStatusUpdate": "2021-07-12T02:52:00Z",
    "MetadataValues": [
        {
            "ID": 10792,
            "MetadataFieldID": 4,
            "ItemValue": "Data from the German chargepoint registry provided by Bundesnetzagentur.de under the CC-BY 4.0 license"
        }
    ],
    "DataQualityLevel": 3,
    "DateCreated": "2021-07-08T09:50:00Z",
    "SubmissionStatusTypeID": 100
}