{
    "IsRecentlyVerified": false,
    "ID": 50888,
    "UUID": "7F18E4A2-38B4-4486-9FBC-E8D44BEFA98B",
    "DataProviderID": 26,
    "DataProvidersReference": "62005",
    "OperatorID": 103,
    "OperatorsReference": "Allego NLALLEGO0001782",
    "UsageCost": "0.00 jaarabonnement",
    "AddressInfo": {
        "ID": 51234,
        "Title": "Nieuwedijk 19",
        "AddressLine1": "Nieuwedijk 19",
        "Town": "Alphen aan den Rijn",
        "Postcode": "2405 XW",
        "CountryID": 159,
        "Latitude": 52.11906795,
        "Longitude": 4.66660974,
        "ContactTelephone1": "0800-3745337",
        "RelatedURL": "http://www.allego.eu/",
        "DistanceUnit": 0
    },
    "Connections": [
        {
            "ID": 62835,
            "ConnectionTypeID": 25,
            "LevelID": 2,
            "PowerKW": 11,
            "CurrentTypeID": 10
        },
        {
            "ID": 62836,
            "ConnectionTypeID": 25,
            "LevelID": 2,
            "PowerKW": 11,
            "CurrentTypeID": 10
        }
    ],
    "NumberOfPoints": 1,
    "StatusTypeID": 50,
    "DateLastStatusUpdate": "2016-06-04T02:50:00Z",
    "DataQualityLevel": 3,
    "DateCreated": "2015-07-22T09:54:00Z",
    "SubmissionStatusTypeID": 100
}