{
    "IsRecentlyVerified": false,
    "ID": 35412,
    "UUID": "195C250A-5C3E-4C87-BE39-BBCC80E76EB9",
    "DataProviderID": 26,
    "DataProvidersReference": "48722",
    "OperatorID": 178,
    "OperatorsReference": "EVnetNL REE608",
    "UsageCost": "0.00 jaarabonnement",
    "AddressInfo": {
        "ID": 35758,
        "Title": "Veraartlaan",
        "AddressLine1": "Veraartlaan",
        "Town": "Rijswijk",
        "Postcode": "2288 GL",
        "CountryID": 159,
        "Latitude": 52.041059,
        "Longitude": 4.337856,
        "ContactTelephone1": "0800-3522365",
        "RelatedURL": "http://www.evnet.nl",
        "DistanceUnit": 0
    },
    "Connections": [
        {
            "ID": 38923,
            "ConnectionTypeID": 25,
            "LevelID": 1,
            "PowerKW": 2.3,
            "CurrentTypeID": 10
        }
    ],
    "NumberOfPoints": 1,
    "StatusTypeID": 50,
    "DateLastStatusUpdate": "2016-06-04T02:44:00Z",
    "DataQualityLevel": 3,
    "DateCreated": "2015-01-09T06:04:00Z",
    "SubmissionStatusTypeID": 100
}