{
    "IsRecentlyVerified": false,
    "ID": 77485,
    "UUID": "B00CC21F-D471-4441-B078-EAA454472555",
    "DataProviderID": 1,
    "OperatorID": 23,
    "OperatorsReference": "23140",
    "UsageTypeID": 6,
    "UsageCost": "Free",
    "AddressInfo": {
        "ID": 77831,
        "Title": "Hotel Ansitz Plantitscherhof",
        "AddressLine1": "Via Dante Alighieri, 56",
        "AddressLine2": "Maia Alta",
        "Town": "Merano",
        "StateOrProvince": "BZ",
        "Postcode": "39012",
        "CountryID": 112,
        "Latitude": 46.6648820869418,
        "Longitude": 11.1766108424763,
        "ContactTelephone1": "+39 (0) 473 / 230577 ",
        "ContactEmail": "info@plantitscherhof.com",
        "RelatedURL": "http://www.plantitscherhof.com/",
        "DistanceUnit": 0
    },
    "Connections": [
        {
            "ID": 111641,
            "ConnectionTypeID": 30,
            "StatusTypeID": 50,
            "LevelID": 2,
            "Amps": 32,
            "Voltage": 400,
            "PowerKW": 22,
            "CurrentTypeID": 20,
            "Quantity": 1
        }
    ],
    "NumberOfPoints": 1,
    "GeneralComments": "Tesla Destination Charging",
    "StatusTypeID": 50,
    "DateLastStatusUpdate": "2018-10-03T15:49:00Z",
    "DataQualityLevel": 1,
    "DateCreated": "2017-01-17T15:33:00Z",
    "SubmissionStatusTypeID": 200
}