{
    "IsRecentlyVerified": false,
    "ID": 87268,
    "UUID": "11013A3D-74BF-4905-AB5A-C1FFB13A556F",
    "DataProviderID": 1,
    "OperatorID": 23,
    "OperatorsReference": "29180",
    "UsageTypeID": 7,
    "AddressInfo": {
        "ID": 87614,
        "Title": "Apartamentos Turusticos Al sur",
        "AddressLine1": "SN Carretera de la Barrosa",
        "Town": "Chiclana de la Frontera",
        "Postcode": "11190",
        "CountryID": 210,
        "Latitude": 36.374181,
        "Longitude": -6.184088,
        "ContactTelephone1": "+34 956 003 990",
        "DistanceUnit": 0
    },
    "Connections": [
        {
            "ID": 123704,
            "ConnectionTypeID": 30,
            "StatusTypeID": 50,
            "LevelID": 2,
            "Amps": 32,
            "Voltage": 230,
            "PowerKW": 17,
            "CurrentTypeID": 20,
            "Quantity": 1
        }
    ],
    "NumberOfPoints": 1,
    "GeneralComments": "1 Tesla Connector, up to 17kW.Available by reservation only. Please see front desk.",
    "StatusTypeID": 50,
    "DateLastStatusUpdate": "2020-08-17T12:13:00Z",
    "DataQualityLevel": 1,
    "DateCreated": "2017-05-03T05:28:00Z",
    "SubmissionStatusTypeID": 200
}