{
    "IsRecentlyVerified": false,
    "ID": 143810,
    "UUID": "82349653-0E25-4298-BFBC-CF438B020E34",
    "DataProviderID": 2,
    "DataProvidersReference": "116535",
    "OperatorID": 23,
    "UsageTypeID": 1,
    "AddressInfo": {
        "ID": 144162,
        "Title": "Waupoos Estate Winery and Gazebo Restaurant - Tesla Destination",
        "AddressLine1": "3016 County Rd 8",
        "Town": "Picton",
        "StateOrProvince": "ON",
        "Postcode": "K0K 2T0",
        "CountryID": 44,
        "Latitude": 44.296024,
        "Longitude": -77.657806,
        "ContactTelephone1": "613-476-8338  877-798-3752",
        "AccessComments": "24 hours daily",
        "RelatedURL": "https://www.tesla.com/destination-charging",
        "DistanceUnit": 0
    },
    "Connections": [
        {
            "ID": 200210,
            "ConnectionTypeID": 30,
            "LevelID": 2,
            "Amps": 16,
            "Voltage": 230,
            "PowerKW": 3.7,
            "CurrentTypeID": 10,
            "Quantity": 2
        }
    ],
    "StatusTypeID": 50,
    "DateLastStatusUpdate": "2020-06-26T03:07:00Z",
    "DataQualityLevel": 3,
    "DateCreated": "2019-12-24T09:22:00Z",
    "SubmissionStatusTypeID": 100
}