{
    "IsRecentlyVerified": false,
    "ID": 141126,
    "UUID": "42FDDCF9-A097-498E-9DD3-1A220D1C2E49",
    "DataProviderID": 2,
    "DataProvidersReference": "148523",
    "OperatorID": 39,
    "UsageTypeID": 1,
    "AddressInfo": {
        "ID": 141478,
        "Title": "Santa Rosa Plaza",
        "AddressLine1": "1071 Santa Rosa Plaza",
        "Town": "Santa Rosa",
        "StateOrProvince": "CA",
        "Postcode": "95401",
        "CountryID": 2,
        "Latitude": 38.4408838,
        "Longitude": -122.7174949,
        "ContactTelephone1": "800-663-5633",
        "AccessComments": "MO: Not Specified; TU: Not Specified; WE: Not Specified; TH: Not Specified; FR: Not Specified; SA: Not Specified; SU: Not Specified",
        "RelatedURL": "http://www.semacharge.com/",
        "DistanceUnit": 0
    },
    "Connections": [
        {
            "ID": 196965,
            "ConnectionTypeID": 1,
            "LevelID": 2,
            "Amps": 16,
            "Voltage": 230,
            "PowerKW": 3.7,
            "CurrentTypeID": 10,
            "Quantity": 1
        }
    ],
    "StatusTypeID": 50,
    "DateLastStatusUpdate": "2020-06-26T03:00:00Z",
    "DataQualityLevel": 3,
    "DateCreated": "2019-12-24T09:14:00Z",
    "SubmissionStatusTypeID": 100
}