{
    "UserComments": [
        {
            "ID": 14500,
            "ChargePointID": 41834,
            "CommentTypeID": 10,
            "UserName": "Bob",
            "Comment": "Appears to have been taken over by chargemaster and CYC or charge lace Scotland cards get an invalid card message",
            "DateCreated": "2016-11-03T21:22:01.877Z",
            "User": {
                "ID": 5013,
                "Username": "Bob"
            },
            "CheckinStatusTypeID": 40
        },
        {
            "ID": 10328,
            "ChargePointID": 41834,
            "CommentTypeID": 10,
            "UserName": "Anon74856763534",
            "Comment": "",
            "DateCreated": "2016-05-07T15:32:29.637Z",
            "User": {
                "ID": 1192,
                "Username": "Anon74856763534"
            },
            "CheckinStatusTypeID": 10
        },
        {
            "ID": 4810,
            "ChargePointID": 41834,
            "CommentTypeID": 10,
            "UserName": "Anon74856763534",
            "Comment": "Yes, should charge Leaf at 3.3kW with no problems!",
            "DateCreated": "2015-06-30T21:02:52.557Z",
            "User": {
                "ID": 1192,
                "Username": "Anon74856763534"
            },
            "CheckinStatusTypeID": 0
        },
        {
            "ID": 4808,
            "ChargePointID": 41834,
            "CommentTypeID": 10,
            "UserName": "ian reeves",
            "Comment": "can this charge an nissan leaf at 16A?",
            "DateCreated": "2015-06-29T16:47:37.957Z",
            "User": {
                "ID": 5012,
                "Username": "ian reeves"
            },
            "CheckinStatusTypeID": 210
        }
    ],
    "IsRecentlyVerified": false,
    "ID": 41834,
    "UUID": "A95B5AB6-76A4-4296-993C-EFBC74FF0FAE",
    "DataProviderID": 1,
    "OperatorID": 3315,
    "OperatorsReference": "51100",
    "UsageTypeID": 4,
    "UsageCost": "Free",
    "AddressInfo": {
        "ID": 42180,
        "Title": "Larbert Railway Station",
        "AddressLine1": "Foundry Loan (East)",
        "Town": "Larbert",
        "Postcode": "FK5 4PJ",
        "CountryID": 1,
        "Latitude": 56.0228192517967,
        "Longitude": -3.83103570000003,
        "DistanceUnit": 0
    },
    "Connections": [
        {
            "ID": 50116,
            "ConnectionTypeID": 25,
            "StatusTypeID": 50,
            "LevelID": 2,
            "Amps": 32,
            "Voltage": 400,
            "PowerKW": 22,
            "CurrentTypeID": 20,
            "Quantity": 2
        }
    ],
    "NumberOfPoints": 2,
    "GeneralComments": "Free parking.",
    "StatusTypeID": 50,
    "DateLastStatusUpdate": "2020-04-09T05:21:00Z",
    "DataQualityLevel": 1,
    "DateCreated": "2015-02-11T16:49:00Z",
    "SubmissionStatusTypeID": 200
}