{
    "IsRecentlyVerified": false,
    "ID": 72902,
    "UUID": "FA381F3F-72D8-43E8-B908-F92F28AE1EC6",
    "DataProviderID": 2,
    "DataProvidersReference": "79153",
    "OperatorID": 5,
    "UsageTypeID": 1,
    "AddressInfo": {
        "ID": 73248,
        "Title": "VELA1",
        "AddressLine1": "555 N College Ave",
        "Town": "Tempe",
        "StateOrProvince": "AZ",
        "Postcode": "85281",
        "CountryID": 2,
        "Latitude": 33.434834,
        "Longitude": -111.930314,
        "ContactTelephone1": "888-758-4389",
        "AccessComments": "24 hours daily",
        "RelatedURL": "http://www.chargepoint.com/",
        "DistanceUnit": 0
    },
    "Connections": [
        {
            "ID": 104572,
            "ConnectionTypeID": 1,
            "LevelID": 2,
            "Amps": 16,
            "Voltage": 230,
            "PowerKW": 3.7,
            "CurrentTypeID": 10,
            "Quantity": 3
        }
    ],
    "DateLastStatusUpdate": "2020-06-26T02:55:00Z",
    "DataQualityLevel": 3,
    "DateCreated": "2016-11-01T13:06:00Z",
    "SubmissionStatusTypeID": 100
}