{
    "IsRecentlyVerified": false,
    "ID": 121603,
    "UUID": "1AA50AAC-5C75-4448-9911-3F91F1DBDBE7",
    "DataProviderID": 2,
    "DataProvidersReference": "121183",
    "OperatorID": 3318,
    "UsageTypeID": 1,
    "AddressInfo": {
        "ID": 121949,
        "Title": "Walmart 50 Vinita",
        "AddressLine1": "268 S. 7th St.",
        "Town": "Vinita",
        "StateOrProvince": "OK",
        "Postcode": "74301",
        "CountryID": 2,
        "Latitude": 36.632015,
        "Longitude": -95.141277,
        "ContactTelephone1": "833-632-2778",
        "AccessComments": "24 hours daily",
        "RelatedURL": "https://www.electrifyamerica.com/",
        "DistanceUnit": 0
    },
    "Connections": [
        {
            "ID": 171361,
            "ConnectionTypeID": 2,
            "LevelID": 2,
            "Amps": 100,
            "Voltage": 400,
            "PowerKW": 40,
            "CurrentTypeID": 10,
            "Quantity": 1
        },
        {
            "ID": 171362,
            "ConnectionTypeID": 32,
            "LevelID": 2,
            "Amps": 100,
            "Voltage": 400,
            "PowerKW": 40,
            "CurrentTypeID": 10,
            "Quantity": 1
        }
    ],
    "DateLastStatusUpdate": "2019-04-06T04:01:00Z",
    "DataQualityLevel": 3,
    "DateCreated": "2019-04-06T04:01:00Z",
    "SubmissionStatusTypeID": 100
}