{
    "IsRecentlyVerified": false,
    "ID": 152062,
    "UUID": "5C269890-D360-452F-AD7C-5DE1BFF9B0BF",
    "DataProviderID": 28,
    "DataProvidersReference": "FRSEOPAB47092A",
    "OperatorID": 3383,
    "UsageTypeID": 5,
    "AddressInfo": {
        "ID": 152415,
        "Title": "Réseau AlterBase - St Rémy - Salle Polyvalente",
        "AddressLine1": "Parking Salle Polyvalente - 79410 ST REMY",
        "CountryID": 80,
        "Latitude": 46.3730661,
        "Longitude": -0.5216527,
        "AccessComments": "24/24 7/7 jours",
        "DistanceUnit": 0
    },
    "Connections": [
        {
            "ID": 212708,
            "ConnectionTypeID": 28,
            "StatusTypeID": 50,
            "LevelID": 2,
            "PowerKW": 3.18,
            "CurrentTypeID": 10
        },
        {
            "ID": 212709,
            "ConnectionTypeID": 26,
            "StatusTypeID": 50,
            "LevelID": 2,
            "PowerKW": 3.18
        },
        {
            "ID": 245564,
            "ConnectionTypeID": 26,
            "StatusTypeID": 50,
            "LevelID": 2,
            "PowerKW": 3.18
        },
        {
            "ID": 245565,
            "ConnectionTypeID": 28,
            "StatusTypeID": 50,
            "LevelID": 2,
            "PowerKW": 3.18,
            "CurrentTypeID": 10
        }
    ],
    "GeneralComments": "www.alterbase.fr",
    "StatusTypeID": 50,
    "DateLastStatusUpdate": "2020-08-27T05:12:00Z",
    "DataQualityLevel": 2,
    "DateCreated": "2020-03-15T10:53:00Z",
    "SubmissionStatusTypeID": 100
}