{
    "IsRecentlyVerified": false,
    "ID": 94480,
    "UUID": "7A2EF7F2-BDE3-47EA-8F3B-3C18A93CA4D5",
    "DataProviderID": 2,
    "DataProvidersReference": "86932",
    "UsageTypeID": 2,
    "AddressInfo": {
        "ID": 94826,
        "Title": "Federal Prison Camp - Duluth",
        "AddressLine1": "4464 Ralston Ave",
        "Town": "Duluth",
        "StateOrProvince": "MN",
        "Postcode": "55811",
        "CountryID": 2,
        "Latitude": 46.836439,
        "Longitude": -92.195922,
        "ContactTelephone1": "",
        "AccessComments": "DOJ fleet use only",
        "RelatedURL": "",
        "DistanceUnit": 0
    },
    "Connections": [
        {
            "ID": 133591,
            "ConnectionTypeID": 1,
            "LevelID": 2,
            "Amps": 16,
            "Voltage": 230,
            "PowerKW": 3.7,
            "CurrentTypeID": 10,
            "Quantity": 1
        }
    ],
    "DateLastStatusUpdate": "2020-06-26T03:10:00Z",
    "DataQualityLevel": 3,
    "DateCreated": "2017-10-19T02:06:00Z",
    "SubmissionStatusTypeID": 100
}