{
    "IsRecentlyVerified": false,
    "ID": 187977,
    "UUID": "CC786CE9-6535-49F1-A8DE-31AE5F2C4174",
    "DataProviderID": 18,
    "DataProvidersReference": "cf5b569c5fe0d6f496bef1d78a603d39",
    "OperatorID": 3,
    "UsageTypeID": 1,
    "AddressInfo": {
        "ID": 188336,
        "Title": "MIRA Technology Park",
        "AddressLine1": "MIRA Technology Park",
        "Town": "Nuneaton",
        "Postcode": "CV10 0UX",
        "CountryID": 1,
        "Latitude": 52.553355,
        "Longitude": -1.460702,
        "AccessComments": "",
        "RelatedURL": "http://pod-point.com",
        "DistanceUnit": 0
    },
    "Connections": [
        {
            "ID": 303313,
            "ConnectionTypeID": 25,
            "Reference": "0",
            "StatusTypeID": 50,
            "LevelID": 2,
            "Amps": 32,
            "Voltage": 400,
            "PowerKW": 22,
            "CurrentTypeID": 20
        }
    ],
    "StatusTypeID": 0,
    "DateLastStatusUpdate": "2021-07-12T03:39:00Z",
    "MetadataValues": [
        {
            "ID": 20217,
            "MetadataFieldID": 4,
            "ItemValue": "Contains public sector information licensed under the Open Government Licence v2.0. http://www.nationalarchives.gov.uk/doc/open-government-licence/version/2/"
        }
    ],
    "DataQualityLevel": 3,
    "DateCreated": "2021-07-12T03:39:00Z",
    "SubmissionStatusTypeID": 100
}