{
    "IsRecentlyVerified": false,
    "ID": 18607,
    "UUID": "EDD8215C-A684-4654-8A4E-C8E6D4F8D2A8",
    "DataProviderID": 15,
    "DataProvidersReference": "32005",
    "OperatorID": 5,
    "AddressInfo": {
        "ID": 18952,
        "Title": "Technology Dr.",
        "AddressLine1": "Technology Dr.",
        "Town": "London",
        "StateOrProvince": "Ontario",
        "Postcode": "N5V 5R6",
        "CountryID": 44,
        "Latitude": 43.01207957,
        "Longitude": -81.20135561,
        "ContactTelephone1": "",
        "RelatedURL": "http://carstations.com/32005",
        "DistanceUnit": 0
    },
    "Connections": [
        {
            "ID": 18840,
            "ConnectionTypeID": 1,
            "Reference": "J1772",
            "LevelID": 2
        },
        {
            "ID": 19391,
            "ConnectionTypeID": 9,
            "Reference": "NEMA5",
            "LevelID": 1,
            "Quantity": 1
        }
    ],
    "StatusTypeID": 0,
    "DateLastStatusUpdate": "2017-11-04T14:04:00Z",
    "DataQualityLevel": 2,
    "DateCreated": "2013-08-25T03:29:00Z",
    "SubmissionStatusTypeID": 200
}