{
    "IsRecentlyVerified": false,
    "ID": 130563,
    "UUID": "4E6C55F1-358B-46AD-B9A2-9070EDFD5D14",
    "DataProviderID": 1,
    "OperatorID": 3299,
    "UsageTypeID": 1,
    "AddressInfo": {
        "ID": 130909,
        "Title": "Ionity - Greve, DK",
        "AddressLine1": "Mosede Landevej 64",
        "Town": "Greve",
        "Postcode": "2670",
        "CountryID": 65,
        "Latitude": 55.5847374120105,
        "Longitude": 12.2576344182219,
        "DistanceUnit": 0
    },
    "Connections": [
        {
            "ID": 182777,
            "ConnectionTypeID": 33,
            "StatusTypeID": 50,
            "LevelID": 3,
            "PowerKW": 350,
            "CurrentTypeID": 30,
            "Quantity": 10
        }
    ],
    "NumberOfPoints": 10,
    "StatusTypeID": 50,
    "DateLastStatusUpdate": "2019-11-16T02:53:00Z",
    "DataQualityLevel": 1,
    "DateCreated": "2019-08-06T18:57:00Z",
    "SubmissionStatusTypeID": 200
}