{
    "IsRecentlyVerified": false,
    "ID": 44563,
    "UUID": "E661D71F-9E66-4129-B4F2-89DC9A7B8714",
    "DataProviderID": 2,
    "DataProvidersReference": "66693",
    "OperatorID": 5,
    "UsageTypeID": 1,
    "AddressInfo": {
        "ID": 44909,
        "Title": "SAN LEANDRO",
        "AddressLine1": "120 Estudillo Ave",
        "Town": "San Leandro",
        "StateOrProvince": "CA",
        "Postcode": "94577",
        "CountryID": 2,
        "Latitude": 37.725635,
        "Longitude": -122.1556,
        "ContactTelephone1": "888-758-4389",
        "AccessComments": "24 hours daily",
        "RelatedURL": "http://www.chargepoint.com/",
        "DistanceUnit": 0
    },
    "Connections": [
        {
            "ID": 54742,
            "ConnectionTypeID": 1,
            "LevelID": 2,
            "Amps": 16,
            "Voltage": 230,
            "PowerKW": 3,
            "CurrentTypeID": 10,
            "Quantity": 4
        }
    ],
    "DateLastStatusUpdate": "2019-04-06T04:02:00Z",
    "DataQualityLevel": 3,
    "DateCreated": "2015-04-17T12:30:00Z",
    "SubmissionStatusTypeID": 100
}