{
    "IsRecentlyVerified": false,
    "ID": 52589,
    "UUID": "7230EC71-E663-487F-AD4C-299B3F55AE86",
    "DataProviderID": 1,
    "OperatorID": 1,
    "UsageTypeID": 0,
    "AddressInfo": {
        "ID": 52935,
        "Title": " Jiří Hořice",
        "AddressLine1": "Seifertova 519/50",
        "AddressLine2": "Lesná",
        "Town": "Brno",
        "StateOrProvince": "okres Brno-město",
        "Postcode": "63800",
        "CountryID": 64,
        "Latitude": 49.2309203,
        "Longitude": 16.6313889,
        "ContactTelephone1": "+420 732 760 188",
        "ContactTelephone2": "+420 732 760 198",
        "ContactEmail": "pavel.horice@seznam.cz",
        "DistanceUnit": 0
    },
    "Connections": [
        {
            "ID": 65315,
            "ConnectionTypeID": 17,
            "StatusTypeID": 0,
            "LevelID": 2,
            "Amps": 16,
            "Voltage": 400,
            "PowerKW": 11,
            "CurrentTypeID": 20
        },
        {
            "ID": 65316,
            "ConnectionTypeID": 23,
            "StatusTypeID": 0,
            "LevelID": 2,
            "Amps": 16,
            "Voltage": 230,
            "PowerKW": 3.6,
            "CurrentTypeID": 10,
            "Quantity": 1
        }
    ],
    "NumberOfPoints": 1,
    "StatusTypeID": 0,
    "DateLastStatusUpdate": "2015-09-03T21:17:00Z",
    "DataQualityLevel": 1,
    "DateCreated": "2015-09-03T20:09:00Z",
    "SubmissionStatusTypeID": 200
}