{
    "IsRecentlyVerified": false,
    "ID": 176881,
    "UUID": "F0D7BF15-8454-4BAB-B81D-B7AF5C44F496",
    "DataProviderID": 29,
    "DataProvidersReference": "9366",
    "AddressInfo": {
        "ID": 177240,
        "Title": "Bahnhofstr. 5",
        "AddressLine1": "Bahnhofstr. 5",
        "Town": "Beckum",
        "Postcode": "59269",
        "CountryID": 87,
        "Latitude": 51.801896,
        "Longitude": 8.022911,
        "DistanceUnit": 0
    },
    "Connections": [
        {
            "ID": 275340,
            "ConnectionTypeID": 25,
            "StatusTypeID": 50,
            "LevelID": 2,
            "PowerKW": 22,
            "CurrentTypeID": 20
        },
        {
            "ID": 275341,
            "ConnectionTypeID": 25,
            "StatusTypeID": 50,
            "LevelID": 2,
            "PowerKW": 22,
            "CurrentTypeID": 20
        }
    ],
    "StatusTypeID": 0,
    "DateLastStatusUpdate": "2021-07-12T02:48:00Z",
    "MetadataValues": [
        {
            "ID": 9176,
            "MetadataFieldID": 4,
            "ItemValue": "Data from the German chargepoint registry provided by Bundesnetzagentur.de under the CC-BY 4.0 license"
        }
    ],
    "DataQualityLevel": 3,
    "DateCreated": "2021-07-08T09:48:00Z",
    "SubmissionStatusTypeID": 100
}