{
    "IsRecentlyVerified": false,
    "ID": 158252,
    "UUID": "30D7051F-2C5A-4553-AB10-F9D438D00594",
    "DataProviderID": 2,
    "DataProvidersReference": "156049",
    "OperatorID": 39,
    "UsageTypeID": 1,
    "AddressInfo": {
        "ID": 158606,
        "Title": "Cabana Auto Wash location",
        "AddressLine1": "12194 Florida A1A Alternate",
        "Town": "Palm Beach Gardens",
        "StateOrProvince": "FL",
        "Postcode": "33410",
        "CountryID": 2,
        "Latitude": 26.8561991,
        "Longitude": -80.0957215,
        "ContactTelephone1": "800-663-5633",
        "AccessComments": "MO: Not Specified; TU: Not Specified; WE: Not Specified; TH: Not Specified; FR: Not Specified; SA: Not Specified; SU: Not Specified",
        "RelatedURL": "http://www.semacharge.com/",
        "DistanceUnit": 0
    },
    "Connections": [
        {
            "ID": 228206,
            "ConnectionTypeID": 1,
            "LevelID": 2,
            "Amps": 16,
            "Voltage": 230,
            "PowerKW": 3.7,
            "CurrentTypeID": 10,
            "Quantity": 2
        }
    ],
    "StatusTypeID": 50,
    "DateLastStatusUpdate": "2020-06-26T02:52:00Z",
    "DataQualityLevel": 3,
    "DateCreated": "2020-06-26T02:52:00Z",
    "SubmissionStatusTypeID": 100
}