{
    "IsRecentlyVerified": false,
    "ID": 111489,
    "UUID": "8959CDDA-1395-465E-ACAB-A90E162C0C78",
    "DataProviderID": 2,
    "DataProvidersReference": "84321",
    "UsageTypeID": 7,
    "AddressInfo": {
        "ID": 111835,
        "Title": "Restaurant Benny",
        "AddressLine1": "515 boul. Dollard",
        "Town": "Joliette",
        "StateOrProvince": "QC",
        "Postcode": "J6E 4M5",
        "CountryID": 44,
        "Latitude": 46.0216889,
        "Longitude": -73.4283795116394,
        "ContactTelephone1": "450-760-9444",
        "AccessComments": "Restaurant business hours\r\nPublic - Call ahead",
        "RelatedURL": "",
        "DistanceUnit": 0
    },
    "Connections": [
        {
            "ID": 156928,
            "ConnectionTypeID": 1,
            "LevelID": 2,
            "Amps": 16,
            "Voltage": 230,
            "PowerKW": 3.7,
            "CurrentTypeID": 10,
            "Quantity": 1
        }
    ],
    "DateLastStatusUpdate": "2020-06-26T03:10:00Z",
    "DataQualityLevel": 3,
    "DateCreated": "2018-10-18T23:37:00Z",
    "SubmissionStatusTypeID": 100
}