{
    "MediaItems": [
        {
            "ID": 17367,
            "ChargePointID": 114330,
            "ItemURL": "https://s3-ap-southeast-2.amazonaws.com/openchargemap/images/SK/OCM114330/OCM-114330.orig.2019010611122058.jpg",
            "ItemThumbnailURL": "https://s3-ap-southeast-2.amazonaws.com/openchargemap/images/SK/OCM114330/OCM-114330.thmb.2019010611122058.jpg",
            "Comment": "",
            "IsEnabled": true,
            "IsVideo": false,
            "IsFeaturedItem": false,
            "IsExternalResource": false,
            "User": {
                "ID": 19703,
                "Username": "Damima"
            },
            "DateCreated": "2019-01-06T11:13:00Z"
        }
    ],
    "IsRecentlyVerified": false,
    "ID": 114330,
    "UUID": "00E037F4-9740-41B1-BA29-9630389AEF20",
    "DataProviderID": 1,
    "OperatorID": 1239,
    "UsageTypeID": 4,
    "AddressInfo": {
        "ID": 114676,
        "Title": "QPC Nitra",
        "AddressLine1": "Nitra",
        "Town": "Nitra",
        "Postcode": "94901",
        "CountryID": 204,
        "Latitude": 48.3306233,
        "Longitude": 18.0576849,
        "DistanceUnit": 0
    },
    "Connections": [
        {
            "ID": 160915,
            "ConnectionTypeID": 2,
            "StatusTypeID": 50,
            "LevelID": 3,
            "PowerKW": 50,
            "CurrentTypeID": 30,
            "Quantity": 1
        },
        {
            "ID": 160916,
            "ConnectionTypeID": 33,
            "StatusTypeID": 50,
            "LevelID": 3,
            "PowerKW": 50,
            "CurrentTypeID": 30,
            "Quantity": 1
        },
        {
            "ID": 160917,
            "ConnectionTypeID": 1036,
            "StatusTypeID": 50,
            "LevelID": 3,
            "Amps": 63,
            "Voltage": 400,
            "PowerKW": 43,
            "CurrentTypeID": 20,
            "Quantity": 1
        }
    ],
    "NumberOfPoints": 1,
    "GeneralComments": "Description/Popis DC: 1xCHAdeMO, 1xCombo 50 kW \r\nAC: 1xTyp-2 43 kW",
    "StatusTypeID": 50,
    "DateLastStatusUpdate": "2019-01-06T11:13:00Z",
    "DataQualityLevel": 1,
    "DateCreated": "2019-01-06T08:25:00Z",
    "SubmissionStatusTypeID": 200
}