{
    "IsRecentlyVerified": false,
    "ID": 132348,
    "UUID": "7C0432DF-62C9-4E7C-B3C3-86F2DD9EB772",
    "DataProviderID": 1,
    "OperatorID": 3310,
    "UsageTypeID": 4,
    "AddressInfo": {
        "ID": 132694,
        "Title": "Mood Food Kempton",
        "AddressLine1": "3001 Midland Hwy",
        "Town": "Kempton",
        "StateOrProvince": "Tasmania",
        "Postcode": "7030",
        "CountryID": 18,
        "Latitude": -42.5132541040641,
        "Longitude": 147.189112740537,
        "AccessComments": "24/7",
        "RelatedURL": "http://www.bennettspetrol.com.au",
        "DistanceUnit": 0
    },
    "Connections": [
        {
            "ID": 185235,
            "ConnectionTypeID": 2,
            "StatusTypeID": 50,
            "LevelID": 3,
            "PowerKW": 50,
            "CurrentTypeID": 30,
            "Quantity": 1
        },
        {
            "ID": 185236,
            "ConnectionTypeID": 33,
            "StatusTypeID": 50,
            "LevelID": 3,
            "PowerKW": 50,
            "CurrentTypeID": 30,
            "Quantity": 1
        }
    ],
    "NumberOfPoints": 1,
    "GeneralComments": "Uses NextCharge app",
    "StatusTypeID": 50,
    "DateLastStatusUpdate": "2021-01-24T02:15:00Z",
    "DataQualityLevel": 1,
    "DateCreated": "2019-09-27T06:44:00Z",
    "SubmissionStatusTypeID": 200
}