{
    "IsRecentlyVerified": false,
    "ID": 123615,
    "UUID": "5D7EE40D-B4CB-4078-BDB7-D2CDF1B071C4",
    "DataProviderID": 2,
    "DataProvidersReference": "88133",
    "OperatorID": 5,
    "UsageTypeID": 1,
    "AddressInfo": {
        "ID": 123961,
        "Title": "UCSC",
        "AddressLine1": "130 McAllister Way",
        "Town": "Santa Cruz",
        "StateOrProvince": "CA",
        "Postcode": "95060",
        "CountryID": 2,
        "Latitude": 36.952209,
        "Longitude": -122.065246,
        "ContactTelephone1": "888-758-4389",
        "AccessComments": "24 hours daily",
        "RelatedURL": "http://www.chargepoint.com/",
        "DistanceUnit": 0
    },
    "Connections": [
        {
            "ID": 173625,
            "ConnectionTypeID": 1,
            "LevelID": 2,
            "Amps": 16,
            "Voltage": 230,
            "PowerKW": 3,
            "CurrentTypeID": 10,
            "Quantity": 6
        }
    ],
    "DateLastStatusUpdate": "2019-12-24T09:13:00Z",
    "DataQualityLevel": 3,
    "DateCreated": "2019-04-06T05:03:00Z",
    "SubmissionStatusTypeID": 100
}