{
    "IsRecentlyVerified": false,
    "ID": 70081,
    "UUID": "81FF3541-8B5A-454B-9913-D2389B90649E",
    "DataProviderID": 1,
    "OperatorID": 1,
    "UsageTypeID": 6,
    "AddressInfo": {
        "ID": 70427,
        "Title": "Kreishaus Landkreis Osterholz",
        "AddressLine1": "Osterholzer Straße 23",
        "AddressLine2": "Scharmbeck",
        "Town": "Osterholz-Scharmbeck",
        "StateOrProvince": "Landkreis Osterholz",
        "Postcode": "27711",
        "CountryID": 87,
        "Latitude": 53.2274,
        "Longitude": 8.804920000000038,
        "AccessComments": "Von der Osterholzer Straße kommend auf dem ersten Parkplatz auf der linken Seite. Die Säule ist nutzbar von Mo-Do. 08:00-16:00 Uhr und Fr. 08:00-12:00 Uhr. RFID-Karte für Besucher der Kreisverwaltung während der Öffnungszeiten ausleihbar.. \r\n",
        "DistanceUnit": 0
    },
    "Connections": [
        {
            "ID": 99978,
            "ConnectionTypeID": 25,
            "StatusTypeID": 50,
            "LevelID": 2,
            "Amps": 32,
            "Voltage": 400,
            "PowerKW": 22,
            "CurrentTypeID": 20,
            "Quantity": 1
        },
        {
            "ID": 99979,
            "ConnectionTypeID": 28,
            "StatusTypeID": 50,
            "LevelID": 2,
            "Amps": 16,
            "Voltage": 230,
            "PowerKW": 3.7,
            "CurrentTypeID": 10,
            "Quantity": 1
        }
    ],
    "NumberOfPoints": 1,
    "StatusTypeID": 50,
    "DateLastStatusUpdate": "2016-07-06T21:24:00Z",
    "DataQualityLevel": 1,
    "DateCreated": "2016-07-06T21:24:00Z",
    "SubmissionStatusTypeID": 200
}