{
    "IsRecentlyVerified": false,
    "ID": 140974,
    "UUID": "F2175D62-542A-4579-A89A-82D7438E8BC9",
    "DataProviderID": 2,
    "DataProvidersReference": "96336",
    "OperatorID": 9,
    "UsageTypeID": 1,
    "AddressInfo": {
        "ID": 141326,
        "Title": "IKEA - Emeryville",
        "AddressLine1": "4400 Shellmound St.",
        "Town": "Emeryville",
        "StateOrProvince": "CA",
        "Postcode": "94608",
        "CountryID": 2,
        "Latitude": 37.831159,
        "Longitude": -122.292474,
        "ContactTelephone1": "888-998-2546",
        "AccessComments": "MON: 24 hours | TUE: 24 hours | WED: 24 hours | THU: 24 hours | FRI: 24 hours | SAT: 24 hours | SUN: 24 hours",
        "RelatedURL": "http://www.blinkcharging.com/",
        "DistanceUnit": 0
    },
    "Connections": [
        {
            "ID": 196766,
            "ConnectionTypeID": 1,
            "LevelID": 2,
            "Amps": 16,
            "Voltage": 230,
            "PowerKW": 3.7,
            "CurrentTypeID": 10,
            "Quantity": 4
        }
    ],
    "StatusTypeID": 50,
    "DateLastStatusUpdate": "2020-06-26T02:59:00Z",
    "DataQualityLevel": 3,
    "DateCreated": "2019-12-24T09:14:00Z",
    "SubmissionStatusTypeID": 100
}