{
    "IsRecentlyVerified": false,
    "ID": 53562,
    "UUID": "4BB630FF-D104-479A-A035-68FEA795D771",
    "DataProviderID": 26,
    "DataProvidersReference": "70211",
    "OperatorID": 78,
    "OperatorsReference": "Essent EM-AT-00020501-01-00001",
    "UsageCost": "0.00 jaarabonnement",
    "AddressInfo": {
        "ID": 53908,
        "Title": "Silberegger Straße",
        "AddressLine1": "Silberegger Straße",
        "Town": "Althofen",
        "Postcode": "9330",
        "CountryID": 19,
        "Latitude": 46.870588,
        "Longitude": 14.470613,
        "RelatedURL": "http://www.essent.nl",
        "DistanceUnit": 0
    },
    "Connections": [
        {
            "ID": 66696,
            "ConnectionTypeID": 25,
            "LevelID": 2,
            "PowerKW": 11,
            "CurrentTypeID": 10
        },
        {
            "ID": 66697,
            "ConnectionTypeID": 25,
            "LevelID": 2,
            "PowerKW": 11,
            "CurrentTypeID": 10
        }
    ],
    "NumberOfPoints": 1,
    "StatusTypeID": 50,
    "DateLastStatusUpdate": "2016-06-04T02:37:00Z",
    "DataQualityLevel": 3,
    "DateCreated": "2015-09-20T11:50:00Z",
    "SubmissionStatusTypeID": 100
}