{
    "IsRecentlyVerified": false,
    "ID": 7947,
    "UUID": "76DB3427-AE8F-4CD5-B1B2-8AA2E531499A",
    "DataProviderID": 15,
    "DataProvidersReference": "6273",
    "OperatorID": 26,
    "AddressInfo": {
        "ID": 7844,
        "Title": "2050 U.S. 130",
        "AddressLine1": "2050 U.S. 130",
        "Town": "Monmouth Junction",
        "StateOrProvince": "NJ",
        "Postcode": "8852",
        "CountryID": 2,
        "Latitude": 40.40922,
        "Longitude": -74.50687,
        "ContactTelephone1": " (732) 821-9300",
        "RelatedURL": "http://carstations.com/6273",
        "DistanceUnit": 0
    },
    "Connections": [
        {
            "ID": 5376,
            "ConnectionTypeID": 1,
            "Reference": "J1772",
            "LevelID": 2
        }
    ],
    "StatusTypeID": 0,
    "DateLastStatusUpdate": "2017-11-04T14:04:00Z",
    "DataQualityLevel": 1,
    "DateCreated": "2011-11-11T12:05:00Z",
    "SubmissionStatusTypeID": 100
}