{
    "IsRecentlyVerified": false,
    "ID": 19515,
    "UUID": "250DDE57-29E2-4CDD-9DD7-BB7AD5A2F67A",
    "DataProviderID": 1,
    "OperatorID": 65,
    "UsageTypeID": 0,
    "UsageCost": "Free",
    "AddressInfo": {
        "ID": 19860,
        "Title": "Wasserkuppe",
        "AddressLine1": "Wasserkuppe 1",
        "AddressLine2": "",
        "Town": "Gersfeld (Rhön)",
        "StateOrProvince": "",
        "Postcode": "36129",
        "CountryID": 87,
        "Latitude": 50.498258,
        "Longitude": 9.946392,
        "ContactTelephone1": "06654 918340",
        "ContactTelephone2": "",
        "ContactEmail": "",
        "AccessComments": "",
        "RelatedURL": "",
        "DistanceUnit": 0
    },
    "Connections": [],
    "NumberOfPoints": 1,
    "GeneralComments": "",
    "StatusTypeID": 50,
    "DateLastStatusUpdate": "2013-10-04T15:44:00Z",
    "MetadataValues": [
        {
            "ID": 123,
            "MetadataFieldID": 4,
            "ItemValue": "Data © OpenStreetMap contributors, ODbL 1.0. http://www.openstreetmap.org/copyright"
        }
    ],
    "DataQualityLevel": 1,
    "DateCreated": "2013-10-04T15:42:00Z",
    "SubmissionStatusTypeID": 200
}