{
    "MediaItems": [
        {
            "ID": 24468,
            "ChargePointID": 165290,
            "ItemURL": "https://s3-ap-southeast-2.amazonaws.com/openchargemap/images/IT/OCM165290/OCM-165290.orig.2020082614573639.png",
            "ItemThumbnailURL": "https://s3-ap-southeast-2.amazonaws.com/openchargemap/images/IT/OCM165290/OCM-165290.thmb.2020082614573639.png",
            "Comment": "",
            "IsEnabled": true,
            "IsVideo": false,
            "IsFeaturedItem": false,
            "IsExternalResource": false,
            "User": {
                "ID": 19496,
                "Username": "ECOGY"
            },
            "DateCreated": "2020-08-26T14:58:00Z"
        },
        {
            "ID": 24466,
            "ChargePointID": 165290,
            "ItemURL": "https://s3-ap-southeast-2.amazonaws.com/openchargemap/images/IT/OCM165290/OCM-165290.orig.2020082614564062.jpg",
            "ItemThumbnailURL": "https://s3-ap-southeast-2.amazonaws.com/openchargemap/images/IT/OCM165290/OCM-165290.thmb.2020082614564062.jpg",
            "Comment": "",
            "IsEnabled": true,
            "IsVideo": false,
            "IsFeaturedItem": false,
            "IsExternalResource": false,
            "User": {
                "ID": 19496,
                "Username": "ECOGY"
            },
            "DateCreated": "2020-08-26T14:57:00Z"
        },
        {
            "ID": 24467,
            "ChargePointID": 165290,
            "ItemURL": "https://s3-ap-southeast-2.amazonaws.com/openchargemap/images/IT/OCM165290/OCM-165290.orig.2020082614570134.jpg",
            "ItemThumbnailURL": "https://s3-ap-southeast-2.amazonaws.com/openchargemap/images/IT/OCM165290/OCM-165290.thmb.2020082614570134.jpg",
            "Comment": "",
            "IsEnabled": true,
            "IsVideo": false,
            "IsFeaturedItem": false,
            "IsExternalResource": false,
            "User": {
                "ID": 19496,
                "Username": "ECOGY"
            },
            "DateCreated": "2020-08-26T14:57:00Z"
        }
    ],
    "IsRecentlyVerified": false,
    "ID": 165290,
    "UUID": "AA2D7215-213D-4D20-878B-C3D3FB265972",
    "DataProviderID": 1,
    "OperatorID": 45,
    "UsageTypeID": 4,
    "UsageCost": "0,30 Euro/ kWh",
    "AddressInfo": {
        "ID": 165649,
        "Title": "Tuscany Hotel Alle Dune ****",
        "AddressLine1": "Via Milano 14",
        "Town": "Marina di Castagneto Carducci (LI)",
        "StateOrProvince": "Livorno",
        "Postcode": "57022",
        "CountryID": 112,
        "Latitude": 43.18460398415891,
        "Longitude": 10.539148145312765,
        "ContactTelephone1": " +39 0565 746611",
        "ContactEmail": "info@alledune.com",
        "AccessComments": "Für Hotelkunden mittels RFID Karte - \r\nEcogy 11 kW -\r\nPer i clienti dell' hotel con la carta RFID ",
        "RelatedURL": "https://www.alledune.com/de/",
        "DistanceUnit": 0
    },
    "Connections": [
        {
            "ID": 236983,
            "ConnectionTypeID": 25,
            "StatusTypeID": 50,
            "LevelID": 2,
            "Amps": 16,
            "Voltage": 400,
            "PowerKW": 11,
            "CurrentTypeID": 20,
            "Quantity": 1
        }
    ],
    "NumberOfPoints": 1,
    "GeneralComments": "Die Ladestation befindet sich auf dem Kundenparkplatz.\r\n\r\nLa colonnina si trova al parcheggio clienti",
    "StatusTypeID": 50,
    "DateLastStatusUpdate": "2020-08-26T15:04:00Z",
    "DataQualityLevel": 1,
    "DateCreated": "2020-08-26T14:54:00Z",
    "SubmissionStatusTypeID": 200
}