{
    "IsRecentlyVerified": false,
    "ID": 72255,
    "UUID": "586F38B3-7249-45ED-9A6D-D5516D9D714C",
    "DataProviderID": 2,
    "DataProvidersReference": "78297",
    "OperatorID": 39,
    "UsageTypeID": 1,
    "AddressInfo": {
        "ID": 72601,
        "Title": "Bel Air Town Center",
        "AddressLine1": "508 Baltimore Pike",
        "Town": "Bel Air",
        "StateOrProvince": "MD",
        "Postcode": "21014",
        "CountryID": 2,
        "Latitude": 39.5270384,
        "Longitude": -76.3547495,
        "ContactTelephone1": "800-663-5633",
        "AccessComments": "MO: 12:00am-12:00am; TU: 12:00am-12:00am; WE: 12:00am-12:00am; TH: 12:00am-12:00am; FR: 12:00am-12:00am; SA: 12:00am-12:00am; SU: 12:00am-12:00am",
        "RelatedURL": "http://www.semacharge.com/",
        "DistanceUnit": 0
    },
    "Connections": [
        {
            "ID": 103560,
            "ConnectionTypeID": 1,
            "LevelID": 2,
            "Amps": 16,
            "Voltage": 230,
            "PowerKW": 3,
            "CurrentTypeID": 10,
            "Quantity": 4
        }
    ],
    "DateLastStatusUpdate": "2019-04-06T05:04:00Z",
    "DataQualityLevel": 3,
    "DateCreated": "2016-10-09T02:45:00Z",
    "SubmissionStatusTypeID": 100
}