{
    "IsRecentlyVerified": false,
    "ID": 78953,
    "UUID": "5A1C2D2B-1C73-40C9-9141-AC88459871FB",
    "DataProviderID": 1,
    "OperatorID": 23,
    "OperatorsReference": "23538",
    "UsageTypeID": 4,
    "UsageCost": "£0.24/kWh;other tariffs for older cars",
    "AddressInfo": {
        "ID": 79299,
        "Title": "Charnock Richard (Northbound) Supercharger",
        "AddressLine1": "Chorley",
        "Town": "Charley",
        "Postcode": "PR7 5LR",
        "CountryID": 1,
        "Latitude": 53.6305,
        "Longitude": -2.692696,
        "DistanceUnit": 0
    },
    "Connections": [
        {
            "ID": 113572,
            "ConnectionTypeID": 27,
            "StatusTypeID": 50,
            "LevelID": 3,
            "PowerKW": 120,
            "CurrentTypeID": 30,
            "Quantity": 12
        }
    ],
    "NumberOfPoints": 12,
    "GeneralComments": "available 24/7",
    "StatusTypeID": 50,
    "DateLastStatusUpdate": "2019-03-22T18:53:00Z",
    "DataQualityLevel": 1,
    "DateCreated": "2017-01-26T17:08:00Z",
    "SubmissionStatusTypeID": 200
}