{
    "IsRecentlyVerified": false,
    "ID": 35408,
    "UUID": "49F9FBC1-9574-4FF2-8B40-AD1EE68C09CD",
    "DataProviderID": 26,
    "DataProvidersReference": "48455",
    "OperatorID": 178,
    "OperatorsReference": "EVnetNL REE009",
    "UsageCost": "0.00 jaarabonnement",
    "AddressInfo": {
        "ID": 35754,
        "Title": "Molenenk",
        "AddressLine1": "Molenenk",
        "Town": "Bronckhorst",
        "Postcode": "7255 AX",
        "CountryID": 159,
        "Latitude": 52.040989,
        "Longitude": 6.306146,
        "ContactTelephone1": "0800-3522365",
        "RelatedURL": "http://www.evnet.nl",
        "DistanceUnit": 0
    },
    "Connections": [
        {
            "ID": 38919,
            "ConnectionTypeID": 25,
            "LevelID": 2,
            "PowerKW": 11,
            "CurrentTypeID": 10
        }
    ],
    "NumberOfPoints": 2,
    "StatusTypeID": 50,
    "DateLastStatusUpdate": "2016-06-04T02:44:00Z",
    "DataQualityLevel": 3,
    "DateCreated": "2015-01-09T06:04:00Z",
    "SubmissionStatusTypeID": 100
}