{
    "IsRecentlyVerified": false,
    "ID": 159638,
    "UUID": "193AA143-0704-4BE8-8DCF-830EF9138069",
    "DataProviderID": 2,
    "DataProvidersReference": "150797",
    "OperatorID": 3318,
    "UsageTypeID": 1,
    "AddressInfo": {
        "ID": 159995,
        "Title": "Safeway 0273 - Anderson, CA",
        "AddressLine1": "2601 Balls Ferry Road",
        "Town": "Anderson",
        "StateOrProvince": "CA",
        "Postcode": "96007",
        "CountryID": 2,
        "Latitude": 40.453456,
        "Longitude": -122.289271,
        "ContactTelephone1": "833-632-2778",
        "AccessComments": "24 hours daily",
        "RelatedURL": "https://www.electrifyamerica.com/",
        "DistanceUnit": 0
    },
    "Connections": [
        {
            "ID": 229838,
            "ConnectionTypeID": 2,
            "LevelID": 3,
            "Amps": 100,
            "Voltage": 400,
            "PowerKW": 40,
            "CurrentTypeID": 30,
            "Quantity": 1
        },
        {
            "ID": 229839,
            "ConnectionTypeID": 32,
            "LevelID": 3,
            "Amps": 100,
            "Voltage": 400,
            "PowerKW": 40,
            "CurrentTypeID": 30,
            "Quantity": 1
        }
    ],
    "StatusTypeID": 50,
    "DateLastStatusUpdate": "2020-06-26T03:03:00Z",
    "DataQualityLevel": 3,
    "DateCreated": "2020-06-26T03:03:00Z",
    "SubmissionStatusTypeID": 100
}