{
    "IsRecentlyVerified": false,
    "ID": 54012,
    "UUID": "FF863C79-CC20-43B0-A048-2BDFD43936EE",
    "DataProviderID": 26,
    "DataProvidersReference": "68530",
    "OperatorID": 78,
    "OperatorsReference": "Essent EM-GB-00000011-01-00005",
    "UsageCost": "0.00 jaarabonnement",
    "AddressInfo": {
        "ID": 54358,
        "Title": "Kendray Street",
        "AddressLine1": "Kendray Street",
        "Town": "Barnsley",
        "Postcode": "S70 1RX",
        "CountryID": 1,
        "Latitude": 53.5526,
        "Longitude": -1.47808,
        "RelatedURL": "http://www.essent.nl",
        "DistanceUnit": 0
    },
    "Connections": [
        {
            "ID": 67541,
            "ConnectionTypeID": 25,
            "LevelID": 2,
            "PowerKW": 11,
            "CurrentTypeID": 10
        },
        {
            "ID": 67542,
            "ConnectionTypeID": 25,
            "LevelID": 2,
            "PowerKW": 11,
            "CurrentTypeID": 10
        }
    ],
    "NumberOfPoints": 1,
    "StatusTypeID": 50,
    "DateLastStatusUpdate": "2016-06-04T02:56:00Z",
    "DataQualityLevel": 3,
    "DateCreated": "2015-09-20T11:50:00Z",
    "SubmissionStatusTypeID": 100
}