{
    "IsRecentlyVerified": false,
    "ID": 41857,
    "UUID": "B5EB4BC1-9108-4568-AF86-54E65CAB954F",
    "DataProviderID": 1,
    "OperatorID": 1,
    "UsageTypeID": 1,
    "UsageCost": "?",
    "AddressInfo": {
        "ID": 42203,
        "Title": "FC Energia latausasema",
        "AddressLine1": "Hoipontie 4",
        "AddressLine2": "",
        "Town": "Äetsä",
        "StateOrProvince": "Pirkanmaa",
        "Postcode": "",
        "CountryID": 79,
        "Latitude": 61.28689739999999,
        "Longitude": 22.707450900000026,
        "ContactTelephone1": "",
        "ContactTelephone2": "",
        "ContactEmail": "",
        "AccessComments": "",
        "RelatedURL": "",
        "DistanceUnit": 0
    },
    "Connections": [
        {
            "ID": 50169,
            "ConnectionTypeID": 1,
            "StatusTypeID": 50,
            "LevelID": 2,
            "Amps": 16,
            "Voltage": 230,
            "PowerKW": 3,
            "CurrentTypeID": 10,
            "Quantity": 1
        }
    ],
    "NumberOfPoints": 1,
    "GeneralComments": "",
    "StatusTypeID": 50,
    "DateLastStatusUpdate": "2015-04-28T10:26:00Z",
    "DataQualityLevel": 1,
    "DateCreated": "2015-02-14T11:02:00Z",
    "SubmissionStatusTypeID": 200
}