{
    "IsRecentlyVerified": false,
    "ID": 124097,
    "UUID": "11BB8F47-857A-437C-BBA2-6AB5330610B3",
    "DataProviderID": 2,
    "DataProvidersReference": "98427",
    "OperatorID": 5,
    "UsageTypeID": 1,
    "AddressInfo": {
        "ID": 124443,
        "Title": "NORCAL",
        "AddressLine1": "901 N Canyons Pkwy",
        "Town": "Livermore",
        "StateOrProvince": "CA",
        "Postcode": "94550",
        "CountryID": 2,
        "Latitude": 37.7034437,
        "Longitude": -121.8221215,
        "ContactTelephone1": "888-758-4389",
        "AccessComments": "24 hours daily",
        "RelatedURL": "http://www.chargepoint.com/",
        "DistanceUnit": 0
    },
    "Connections": [
        {
            "ID": 174152,
            "ConnectionTypeID": 1,
            "LevelID": 2,
            "Amps": 16,
            "Voltage": 230,
            "PowerKW": 3,
            "CurrentTypeID": 10,
            "Quantity": 1
        }
    ],
    "DateLastStatusUpdate": "2019-12-24T09:14:00Z",
    "DataQualityLevel": 3,
    "DateCreated": "2019-04-06T05:03:00Z",
    "SubmissionStatusTypeID": 100
}