{
    "IsRecentlyVerified": false,
    "ID": 123375,
    "UUID": "8D889DE1-BBE7-4ECA-B72E-D929FA6E97D9",
    "DataProviderID": 2,
    "DataProvidersReference": "105377",
    "OperatorID": 5,
    "UsageTypeID": 1,
    "AddressInfo": {
        "ID": 123721,
        "Title": "TERM GARAGE 2",
        "AddressLine1": "Nashville",
        "Town": "Nashville",
        "StateOrProvince": "TN",
        "Postcode": "37214",
        "CountryID": 2,
        "Latitude": 36.1304965,
        "Longitude": -86.6671552,
        "ContactTelephone1": "888-758-4389",
        "AccessComments": "24 hours daily",
        "RelatedURL": "http://www.chargepoint.com/",
        "DistanceUnit": 0
    },
    "Connections": [
        {
            "ID": 173345,
            "ConnectionTypeID": 1,
            "LevelID": 2,
            "Amps": 16,
            "Voltage": 230,
            "PowerKW": 3.7,
            "CurrentTypeID": 10,
            "Quantity": 8
        }
    ],
    "DateLastStatusUpdate": "2020-06-26T02:58:00Z",
    "DataQualityLevel": 3,
    "DateCreated": "2019-04-06T05:03:00Z",
    "SubmissionStatusTypeID": 100
}