{
    "IsRecentlyVerified": false,
    "ID": 7000,
    "UUID": "C58D8540-0DEF-429C-A230-79DA9774D703",
    "DataProviderID": 1,
    "UsageTypeID": 4,
    "UsageCost": "Free",
    "AddressInfo": {
        "ID": 6901,
        "Title": "3 av de la Pte Brancion",
        "AddressLine1": "3 Avenue De La Porte Brancion",
        "AddressLine2": "",
        "Town": "Paris",
        "StateOrProvince": "",
        "Postcode": "",
        "CountryID": 80,
        "Latitude": 48.8283316,
        "Longitude": 2.301616200000012,
        "ContactTelephone1": "+33 01 53 20 09 69 ",
        "ContactTelephone2": "",
        "ContactEmail": "sim@semeru.fayat.com",
        "AccessComments": "http://www.paris.fr/pratique/voitures-deux-roues-motorises/bornes-de-recharge-pour-vehicules-electriques/p5775",
        "DistanceUnit": 0
    },
    "Connections": [],
    "NumberOfPoints": 1,
    "GeneralComments": "Où se procurer la carte pour recharger son véhicule électrique ? La carte est gratuite. Où la trouver ? Espace mobilités électriques 112 quater rue Marcadet (18e)- +33 01 53 20 09 69 ",
    "DateLastConfirmed": "2011-10-12T20:30:00Z",
    "StatusTypeID": 0,
    "DateLastStatusUpdate": "2011-10-12T20:30:00Z",
    "DataQualityLevel": 1,
    "DateCreated": "2011-10-12T20:30:00Z",
    "SubmissionStatusTypeID": 200
}