{
    "IsRecentlyVerified": false,
    "ID": 133571,
    "UUID": "F1546EBB-DE4D-408F-A508-632C231CFC53",
    "DataProviderID": 1,
    "OperatorID": 80,
    "UsageTypeID": 4,
    "AddressInfo": {
        "ID": 133917,
        "Title": "Concessionaria GRIGNOLIO & C. SRL | EnelX",
        "AddressLine1": "Tangenziale Ovest, 66",
        "AddressLine2": "Area Industriale",
        "Town": "Vercelli",
        "StateOrProvince": "VC",
        "Postcode": "13100",
        "CountryID": 112,
        "Latitude": 45.3097336955175,
        "Longitude": 8.39983377976125,
        "ContactTelephone1": "800.069.850",
        "RelatedURL": "https://www.enelx.com/it/it/emobility",
        "DistanceUnit": 0
    },
    "Connections": [
        {
            "ID": 186956,
            "ConnectionTypeID": 25,
            "StatusTypeID": 50,
            "LevelID": 2,
            "Amps": 32,
            "Voltage": 400,
            "PowerKW": 22,
            "CurrentTypeID": 20,
            "Quantity": 2
        }
    ],
    "NumberOfPoints": 2,
    "GeneralComments": "Lun-Ven 8:30-12:30/14:30-19:00 Sab 9:00-12:30/15-19 Dom Chiuso",
    "StatusTypeID": 50,
    "DateLastStatusUpdate": "2019-10-21T09:09:00Z",
    "DataQualityLevel": 1,
    "DateCreated": "2019-10-21T09:09:00Z",
    "SubmissionStatusTypeID": 200
}