{
    "IsRecentlyVerified": false,
    "ID": 32274,
    "UUID": "578D460E-A7EC-46F7-A079-5637B5BF339A",
    "DataProviderID": 26,
    "DataProvidersReference": "47955",
    "OperatorID": 178,
    "OperatorsReference": "EVnetNL DB0194",
    "UsageCost": "0.00 jaarabonnement",
    "AddressInfo": {
        "ID": 32620,
        "Title": "Robert Schumandomein",
        "AddressLine1": "Robert Schumandomein",
        "Town": "Maastricht",
        "Postcode": "6229 ES",
        "CountryID": 159,
        "Latitude": 50.838908,
        "Longitude": 5.714634,
        "ContactTelephone1": "0800-3522365",
        "RelatedURL": "http://www.evnet.nl",
        "DistanceUnit": 0
    },
    "Connections": [
        {
            "ID": 35785,
            "ConnectionTypeID": 25,
            "LevelID": 2,
            "PowerKW": 11,
            "CurrentTypeID": 10
        }
    ],
    "NumberOfPoints": 2,
    "StatusTypeID": 50,
    "DateLastStatusUpdate": "2016-06-04T02:38:00Z",
    "DataQualityLevel": 3,
    "DateCreated": "2015-01-09T06:03:00Z",
    "SubmissionStatusTypeID": 100
}