{
    "IsRecentlyVerified": false,
    "ID": 32799,
    "UUID": "79AEAB71-3AFF-4FE4-9448-0A586D0328AB",
    "DataProviderID": 1,
    "OperatorID": 105,
    "OperatorsReference": "Essent EM-DE-05117000-06-00001",
    "UsageTypeID": 4,
    "AddressInfo": {
        "ID": 33145,
        "Title": "Paul-Kosmalla-Straße 3",
        "AddressLine1": "Paul-Kosmalla-Straße 3",
        "Town": "Mülheim an der Ruhr",
        "Postcode": "45472",
        "CountryID": 87,
        "Latitude": 51.433056,
        "Longitude": 6.925,
        "DistanceUnit": 0
    },
    "Connections": [
        {
            "ID": 36310,
            "ConnectionTypeID": 25,
            "LevelID": 2,
            "PowerKW": 11
        },
        {
            "ID": 46546,
            "ConnectionTypeID": 25,
            "LevelID": 2,
            "PowerKW": 11
        }
    ],
    "NumberOfPoints": 1,
    "StatusTypeID": 50,
    "DateLastStatusUpdate": "2015-04-13T18:22:00Z",
    "DataQualityLevel": 3,
    "DateCreated": "2015-01-09T06:03:00Z",
    "SubmissionStatusTypeID": 200
}