{
    "IsRecentlyVerified": false,
    "ID": 138520,
    "UUID": "A133173D-7C35-4704-B201-9F1A6107990D",
    "DataProviderID": 2,
    "DataProvidersReference": "146799",
    "OperatorID": 5,
    "UsageTypeID": 1,
    "AddressInfo": {
        "ID": 138869,
        "Title": "STADIUM ENCLAVE",
        "AddressLine1": "901 Mosley St",
        "Town": "Tallahassee",
        "StateOrProvince": "FL",
        "Postcode": "32310",
        "CountryID": 2,
        "Latitude": 30.433983,
        "Longitude": -84.299603,
        "ContactTelephone1": "888-758-4389",
        "AccessComments": "24 hours daily",
        "RelatedURL": "http://www.chargepoint.com/",
        "DistanceUnit": 0
    },
    "Connections": [
        {
            "ID": 193654,
            "ConnectionTypeID": 1,
            "LevelID": 2,
            "Amps": 16,
            "Voltage": 230,
            "PowerKW": 3.7,
            "CurrentTypeID": 10,
            "Quantity": 8
        }
    ],
    "StatusTypeID": 50,
    "DateLastStatusUpdate": "2020-06-26T02:54:00Z",
    "DataQualityLevel": 3,
    "DateCreated": "2019-12-24T09:09:00Z",
    "SubmissionStatusTypeID": 100
}