{
    "IsRecentlyVerified": false,
    "ID": 124169,
    "UUID": "7D438624-86E5-46BA-99CA-EF9F5A91C26D",
    "DataProviderID": 2,
    "DataProvidersReference": "62540",
    "OperatorID": 5,
    "UsageTypeID": 1,
    "AddressInfo": {
        "ID": 124515,
        "Title": "55 HARRISON",
        "AddressLine1": "255 2nd St",
        "Town": "Oakland",
        "StateOrProvince": "CA",
        "Postcode": "94607",
        "CountryID": 2,
        "Latitude": 37.7940945,
        "Longitude": -122.2718434,
        "ContactTelephone1": "888-758-4389",
        "AccessComments": "24 hours daily",
        "RelatedURL": "http://www.chargepoint.com/",
        "DistanceUnit": 0
    },
    "Connections": [
        {
            "ID": 174233,
            "ConnectionTypeID": 1,
            "LevelID": 2,
            "Amps": 16,
            "Voltage": 230,
            "PowerKW": 3,
            "CurrentTypeID": 10,
            "Quantity": 2
        }
    ],
    "DateLastStatusUpdate": "2019-12-24T09:14:00Z",
    "DataQualityLevel": 3,
    "DateCreated": "2019-04-06T05:03:00Z",
    "SubmissionStatusTypeID": 100
}