{
    "IsRecentlyVerified": false,
    "ID": 72568,
    "UUID": "4661A9D3-33DA-4F46-9336-058B020CFB68",
    "DataProviderID": 1,
    "OperatorID": 214,
    "UsageTypeID": 4,
    "AddressInfo": {
        "ID": 72914,
        "Title": "Krumme Straße",
        "AddressLine1": "Krumme Straße 85",
        "AddressLine2": "Charlottenburg",
        "Town": "Berlin",
        "StateOrProvince": "Berlin",
        "Postcode": "10585",
        "CountryID": 87,
        "Latitude": 52.514315103119365,
        "Longitude": 13.309598981475798,
        "AccessComments": "24/7 nutzbar",
        "DistanceUnit": 0
    },
    "Connections": [
        {
            "ID": 104017,
            "ConnectionTypeID": 25,
            "StatusTypeID": 50,
            "LevelID": 2,
            "PowerKW": 11,
            "CurrentTypeID": 20,
            "Quantity": 2
        }
    ],
    "NumberOfPoints": 2,
    "StatusTypeID": 50,
    "DateLastStatusUpdate": "2016-10-24T10:44:00Z",
    "DataQualityLevel": 1,
    "DateCreated": "2016-10-24T10:44:00Z",
    "SubmissionStatusTypeID": 200
}