{
    "IsRecentlyVerified": false,
    "ID": 155668,
    "UUID": "73CDA3A9-4577-4B70-B095-F2403DC0A4A1",
    "DataProviderID": 1,
    "OperatorID": 3389,
    "UsageTypeID": 1,
    "UsageCost": "$1.00/session+$0.21/minute",
    "AddressInfo": {
        "ID": 156022,
        "Title": "Orchard Plaza - Francis Energy",
        "AddressLine1": "2150 S Douglas Blvd",
        "Town": "Midwest City",
        "StateOrProvince": "OK",
        "Postcode": "73130",
        "CountryID": 2,
        "Latitude": 35.44435071318746,
        "Longitude": -97.37058919102623,
        "AccessComments": "Use EVGateway App to manage charging ",
        "RelatedURL": "https://francis.energy/",
        "DistanceUnit": 0
    },
    "Connections": [
        {
            "ID": 219194,
            "ConnectionTypeID": 32,
            "StatusTypeID": 50,
            "LevelID": 3,
            "PowerKW": 50,
            "CurrentTypeID": 30,
            "Quantity": 2,
            "Comments": "BTCPower 50kW"
        },
        {
            "ID": 219195,
            "ConnectionTypeID": 2,
            "StatusTypeID": 50,
            "LevelID": 3,
            "PowerKW": 50,
            "CurrentTypeID": 30,
            "Quantity": 2,
            "Comments": "BTCPower 50kW"
        }
    ],
    "NumberOfPoints": 2,
    "GeneralComments": "50kW DC Fast Chargers Provided by Francis Energy",
    "StatusTypeID": 50,
    "DateLastStatusUpdate": "2020-04-21T17:44:00Z",
    "DataQualityLevel": 1,
    "DateCreated": "2020-04-21T03:29:00Z",
    "SubmissionStatusTypeID": 200
}