{
    "IsRecentlyVerified": false,
    "ID": 36028,
    "UUID": "FA02F9D2-021B-438F-9964-59B134661290",
    "DataProviderID": 26,
    "DataProvidersReference": "50687",
    "OperatorID": 180,
    "OperatorsReference": "Alfen GDH1091",
    "UsageCost": "0.00 jaarabonnement",
    "AddressInfo": {
        "ID": 36374,
        "Title": "Koninginnegracht 87",
        "AddressLine1": "Koninginnegracht 87",
        "Town": "Den Haag",
        "Postcode": "2514 AK",
        "CountryID": 159,
        "Latitude": 52.093331,
        "Longitude": 4.308676,
        "ContactTelephone1": "036 - 549 34 00",
        "RelatedURL": "http://www.icu-charging-stations.com/",
        "DistanceUnit": 0
    },
    "Connections": [
        {
            "ID": 39539,
            "ConnectionTypeID": 25,
            "LevelID": 2,
            "PowerKW": 11,
            "CurrentTypeID": 10
        },
        {
            "ID": 48197,
            "ConnectionTypeID": 25,
            "LevelID": 2,
            "PowerKW": 11,
            "CurrentTypeID": 10
        }
    ],
    "NumberOfPoints": 1,
    "StatusTypeID": 50,
    "DateLastStatusUpdate": "2016-06-04T02:50:00Z",
    "DataQualityLevel": 3,
    "DateCreated": "2015-01-09T06:05:00Z",
    "SubmissionStatusTypeID": 100
}