{
    "IsRecentlyVerified": false,
    "ID": 174211,
    "UUID": "82DCB259-3DC1-4147-875B-87C3C383B630",
    "DataProviderID": 1,
    "OperatorID": 1242,
    "UsageTypeID": 1,
    "UsageCost": "0",
    "AddressInfo": {
        "ID": 174570,
        "Title": "Think Whole Person",
        "AddressLine1": "7100 W Center Rd",
        "Town": "Omaha",
        "StateOrProvince": "NE",
        "Postcode": " 68106",
        "CountryID": 2,
        "Latitude": 41.23614260841336,
        "Longitude": -96.02016048154411,
        "AccessComments": "East side of building in open parking lot. On pedestal.",
        "DistanceUnit": 0
    },
    "Connections": [
        {
            "ID": 269346,
            "ConnectionTypeID": 1,
            "StatusTypeID": 50,
            "Quantity": 1
        }
    ],
    "NumberOfPoints": 1,
    "StatusTypeID": 50,
    "DateLastStatusUpdate": "2021-03-24T09:03:00Z",
    "DataQualityLevel": 1,
    "DateCreated": "2021-03-22T16:04:00Z",
    "SubmissionStatusTypeID": 200
}