{
    "IsRecentlyVerified": false,
    "ID": 8546,
    "UUID": "364AAB9A-1D0E-47A6-A42E-54FDC17A9728",
    "DataProviderID": 15,
    "DataProvidersReference": "9395",
    "OperatorID": 42,
    "AddressInfo": {
        "ID": 8443,
        "Title": "810 N. Vignes St.",
        "AddressLine1": "810 N. Vignes St.",
        "Town": "Los Angeles",
        "StateOrProvince": "CA",
        "Postcode": "90012",
        "CountryID": 2,
        "Latitude": 34.055829,
        "Longitude": -118.230996,
        "ContactTelephone1": "",
        "RelatedURL": "http://carstations.com/9395",
        "DistanceUnit": 0
    },
    "Connections": [
        {
            "ID": 5970,
            "ConnectionTypeID": 0,
            "Reference": "SPI",
            "Quantity": 1
        },
        {
            "ID": 7246,
            "ConnectionTypeID": 9,
            "Reference": "NEMA5",
            "LevelID": 1,
            "Quantity": 1
        },
        {
            "ID": 14262,
            "ConnectionTypeID": 7,
            "Reference": "AVCON"
        },
        {
            "ID": 14347,
            "ConnectionTypeID": 1,
            "Reference": "J1772",
            "LevelID": 2,
            "Quantity": 1
        }
    ],
    "StatusTypeID": 0,
    "DateLastStatusUpdate": "2017-11-04T14:04:00Z",
    "DataQualityLevel": 1,
    "DateCreated": "2011-11-11T12:06:00Z",
    "SubmissionStatusTypeID": 100
}