{
    "IsRecentlyVerified": false,
    "ID": 152236,
    "UUID": "DA8C5FF2-9844-466B-BC58-BDE741450F26",
    "DataProviderID": 28,
    "DataProvidersReference": "FR*S85*P85003*002",
    "UsageTypeID": 5,
    "AddressInfo": {
        "ID": 152589,
        "Title": "AIZENAY - Espace Villeneuve",
        "AddressLine1": "Espace Villeneuve 85190 AIZENAY",
        "CountryID": 80,
        "Latitude": 46.74352,
        "Longitude": -1.61386,
        "AccessComments": "24h/24 7j/7",
        "DistanceUnit": 0
    },
    "Connections": [
        {
            "ID": 213042,
            "ConnectionTypeID": 28,
            "StatusTypeID": 50,
            "LevelID": 2,
            "PowerKW": 18,
            "CurrentTypeID": 10
        },
        {
            "ID": 213043,
            "ConnectionTypeID": 26,
            "StatusTypeID": 50,
            "LevelID": 2,
            "PowerKW": 18
        },
        {
            "ID": 245907,
            "ConnectionTypeID": 26,
            "StatusTypeID": 50,
            "LevelID": 2,
            "PowerKW": 18
        },
        {
            "ID": 245908,
            "ConnectionTypeID": 28,
            "StatusTypeID": 50,
            "LevelID": 2,
            "PowerKW": 18,
            "CurrentTypeID": 10
        }
    ],
    "GeneralComments": "Recharge par badge et avec une application smartphone",
    "StatusTypeID": 50,
    "DateLastStatusUpdate": "2020-08-27T05:13:00Z",
    "DataQualityLevel": 2,
    "DateCreated": "2020-03-15T10:53:00Z",
    "SubmissionStatusTypeID": 100
}