{
    "IsRecentlyVerified": false,
    "ID": 17774,
    "UUID": "320AEEF3-2831-4584-9650-5EE16A55E34A",
    "DataProviderID": 22,
    "DataProvidersReference": "AB0DA060030A7EBB157AFCB066303CF0",
    "AddressInfo": {
        "ID": 18119,
        "Title": "神奈川県産業技術総合研究所（神奈川県産業技術センター）",
        "AddressLine1": "神奈川県海老名市下今泉705-1",
        "CountryID": 114,
        "Latitude": 35.46224374,
        "Longitude": 139.3908207,
        "ContactTelephone1": "046-236-1500",
        "DistanceUnit": 0
    },
    "Connections": [
        {
            "ID": 18015,
            "ConnectionTypeID": 2,
            "LevelID": 2,
            "Amps": 100,
            "Voltage": 480,
            "PowerKW": 48,
            "Quantity": 1
        }
    ],
    "DateLastStatusUpdate": "2013-06-29T09:03:00Z",
    "DataQualityLevel": 2,
    "DateCreated": "2013-06-29T09:03:00Z",
    "SubmissionStatusTypeID": 200
}