{
    "IsRecentlyVerified": false,
    "ID": 148072,
    "UUID": "976340DB-C844-404B-8372-C581C37DE914",
    "DataProviderID": 1,
    "OperatorID": 3315,
    "OperatorsReference": "51735",
    "UsageTypeID": 4,
    "UsageCost": "Free",
    "AddressInfo": {
        "ID": 148424,
        "Title": "Loch Centre Rapid Charger",
        "AddressLine1": "Well Wynd",
        "Town": "Tranent",
        "Postcode": "EH33 2JX",
        "CountryID": 1,
        "Latitude": 55.942335,
        "Longitude": -2.950932,
        "DistanceUnit": 0
    },
    "Connections": [
        {
            "ID": 205572,
            "ConnectionTypeID": 33,
            "StatusTypeID": 50,
            "LevelID": 3,
            "PowerKW": 50,
            "CurrentTypeID": 30,
            "Quantity": 1
        },
        {
            "ID": 205573,
            "ConnectionTypeID": 2,
            "StatusTypeID": 50,
            "LevelID": 3,
            "PowerKW": 50,
            "CurrentTypeID": 30,
            "Quantity": 1
        },
        {
            "ID": 205574,
            "ConnectionTypeID": 1036,
            "StatusTypeID": 50,
            "LevelID": 3,
            "PowerKW": 43,
            "CurrentTypeID": 20,
            "Quantity": 1
        }
    ],
    "NumberOfPoints": 1,
    "StatusTypeID": 50,
    "DateLastStatusUpdate": "2020-01-25T06:14:00Z",
    "DataQualityLevel": 1,
    "DateCreated": "2020-01-25T06:14:00Z",
    "SubmissionStatusTypeID": 200
}