{
    "IsRecentlyVerified": false,
    "ID": 142030,
    "UUID": "D99935D1-5A66-487B-8C10-270B40C12F50",
    "DataProviderID": 2,
    "DataProvidersReference": "122526",
    "OperatorID": 23,
    "UsageTypeID": 1,
    "AddressInfo": {
        "ID": 142382,
        "Title": "Philadelphia Museum of Art - Tesla Destination",
        "AddressLine1": "2600 Benjamin Franklin Pkwy",
        "Town": "Philadelphia",
        "StateOrProvince": "PA",
        "Postcode": "19130",
        "CountryID": 2,
        "Latitude": 39.962418,
        "Longitude": -75.177634,
        "ContactTelephone1": "215-763-8100  877-798-3752",
        "AccessComments": "24 hours daily; pay lot",
        "RelatedURL": "https://www.tesla.com/destination-charging",
        "DistanceUnit": 0
    },
    "Connections": [
        {
            "ID": 198087,
            "ConnectionTypeID": 30,
            "LevelID": 2,
            "Amps": 16,
            "Voltage": 230,
            "PowerKW": 3.7,
            "CurrentTypeID": 10,
            "Quantity": 2
        }
    ],
    "StatusTypeID": 50,
    "DateLastStatusUpdate": "2020-06-26T03:02:00Z",
    "DataQualityLevel": 3,
    "DateCreated": "2019-12-24T09:16:00Z",
    "SubmissionStatusTypeID": 100
}