{
    "IsRecentlyVerified": false,
    "ID": 160491,
    "UUID": "30CB3D94-5A2F-4571-85A4-DFEA8C3DDB26",
    "DataProviderID": 2,
    "DataProvidersReference": "158330",
    "UsageTypeID": 1,
    "AddressInfo": {
        "ID": 160848,
        "Title": "Canadian Tire",
        "AddressLine1": "20 Babineau Ave",
        "Town": "Charlottetown",
        "StateOrProvince": "PE",
        "Postcode": "C1A 0C9",
        "CountryID": 44,
        "Latitude": 46.267941,
        "Longitude": -63.146,
        "ContactTelephone1": "902-892-8584",
        "AccessComments": "24 hours daily",
        "RelatedURL": "",
        "DistanceUnit": 0
    },
    "Connections": [
        {
            "ID": 230921,
            "ConnectionTypeID": 2,
            "LevelID": 3,
            "Amps": 100,
            "Voltage": 400,
            "PowerKW": 40,
            "CurrentTypeID": 30,
            "Quantity": 1
        },
        {
            "ID": 230922,
            "ConnectionTypeID": 32,
            "LevelID": 3,
            "Amps": 100,
            "Voltage": 400,
            "PowerKW": 40,
            "CurrentTypeID": 30,
            "Quantity": 1
        }
    ],
    "StatusTypeID": 50,
    "DateLastStatusUpdate": "2020-06-26T03:10:00Z",
    "DataQualityLevel": 3,
    "DateCreated": "2020-06-26T03:10:00Z",
    "SubmissionStatusTypeID": 100
}