{
    "IsRecentlyVerified": false,
    "ID": 150472,
    "UUID": "324E81F0-048C-4C34-8106-BAA13341FF9A",
    "DataProviderID": 28,
    "DataProvidersReference": "FR*M13*P13070*001",
    "UsageTypeID": 5,
    "AddressInfo": {
        "ID": 150825,
        "Title": "LA PENNE-SUR-HUVEAUNE - Boulevard Voltaire",
        "AddressLine1": "Boulevard Voltaire 13821 LA PENNE-SUR-HUVEAUNE",
        "CountryID": 80,
        "Latitude": 43.281395,
        "Longitude": 5.517073,
        "AccessComments": "24h/24 7j/7",
        "DistanceUnit": 0
    },
    "Connections": [
        {
            "ID": 209243,
            "ConnectionTypeID": 28,
            "StatusTypeID": 50,
            "LevelID": 2,
            "PowerKW": 22,
            "CurrentTypeID": 10
        },
        {
            "ID": 209244,
            "ConnectionTypeID": 1036,
            "StatusTypeID": 50,
            "LevelID": 2,
            "PowerKW": 22,
            "CurrentTypeID": 20
        },
        {
            "ID": 238090,
            "ConnectionTypeID": 28,
            "StatusTypeID": 50,
            "LevelID": 2,
            "PowerKW": 22,
            "CurrentTypeID": 10
        },
        {
            "ID": 238091,
            "ConnectionTypeID": 1036,
            "StatusTypeID": 50,
            "LevelID": 2,
            "PowerKW": 22,
            "CurrentTypeID": 20
        }
    ],
    "GeneralComments": "Recharge par badge et avec une application smartphone",
    "StatusTypeID": 50,
    "DateLastStatusUpdate": "2020-08-27T05:10:00Z",
    "DataQualityLevel": 2,
    "DateCreated": "2020-03-15T06:17:00Z",
    "SubmissionStatusTypeID": 100
}