{
    "IsRecentlyVerified": false,
    "ID": 141213,
    "UUID": "EE27E2F6-4EDB-4E6F-9B16-5237D3643E8B",
    "DataProviderID": 2,
    "DataProvidersReference": "148466",
    "OperatorID": 39,
    "UsageTypeID": 1,
    "AddressInfo": {
        "ID": 141565,
        "Title": "Walgreens - Waldorf, MD #9032 |P771",
        "AddressLine1": "25 High Street",
        "Town": "Waldorf",
        "StateOrProvince": "MD",
        "Postcode": "20602",
        "CountryID": 2,
        "Latitude": 38.602321,
        "Longitude": -76.904329,
        "ContactTelephone1": "800-663-5633",
        "AccessComments": "MO: Not Specified; TU: Not Specified; WE: Not Specified; TH: Not Specified; FR: Not Specified; SA: Not Specified; SU: Not Specified",
        "RelatedURL": "http://www.semacharge.com/",
        "DistanceUnit": 0
    },
    "Connections": [
        {
            "ID": 197081,
            "ConnectionTypeID": 1,
            "LevelID": 2,
            "Amps": 16,
            "Voltage": 230,
            "PowerKW": 3.7,
            "CurrentTypeID": 10,
            "Quantity": 1
        }
    ],
    "StatusTypeID": 50,
    "DateLastStatusUpdate": "2020-06-26T03:00:00Z",
    "DataQualityLevel": 3,
    "DateCreated": "2019-12-24T09:15:00Z",
    "SubmissionStatusTypeID": 100
}