{
    "UserComments": [
        {
            "ID": 22458,
            "ChargePointID": 130585,
            "CommentTypeID": 10,
            "UserName": "ForumElettrico.it",
            "Comment": "Nel parcheggio antistante la concessionaria Mercedes GMG. Leggi la recensione qui > https://www.forumelettrico.it/forum/colonnina-enel-via-traversa-fiorentina-po-t7178.html",
            "RelatedURL": "https://www.forumelettrico.it/forum/colonnina-enel-via-traversa-fiorentina-po-t7178.html",
            "DateCreated": "2020-04-18T13:37:50.303Z",
            "User": {
                "ID": 11749,
                "Username": "ForumElettrico.it"
            },
            "CheckinStatusTypeID": 140,
            "IsActionedByEditor": false
        }
    ],
    "MediaItems": [
        {
            "ID": 22004,
            "ChargePointID": 130585,
            "ItemURL": "https://s3-ap-southeast-2.amazonaws.com/openchargemap/images/IT/OCM130585/OCM-130585.orig.2020041813383038.jpg",
            "ItemThumbnailURL": "https://s3-ap-southeast-2.amazonaws.com/openchargemap/images/IT/OCM130585/OCM-130585.thmb.2020041813383038.jpg",
            "Comment": "",
            "IsEnabled": true,
            "IsVideo": false,
            "IsFeaturedItem": false,
            "IsExternalResource": false,
            "User": {
                "ID": 11749,
                "Username": "ForumElettrico.it"
            },
            "DateCreated": "2020-04-18T13:39:00Z"
        },
        {
            "ID": 22000,
            "ChargePointID": 130585,
            "ItemURL": "https://s3-ap-southeast-2.amazonaws.com/openchargemap/images/IT/OCM130585/OCM-130585.orig.2020041813380204.jpg",
            "ItemThumbnailURL": "https://s3-ap-southeast-2.amazonaws.com/openchargemap/images/IT/OCM130585/OCM-130585.thmb.2020041813380204.jpg",
            "Comment": "",
            "IsEnabled": true,
            "IsVideo": false,
            "IsFeaturedItem": false,
            "IsExternalResource": false,
            "User": {
                "ID": 11749,
                "Username": "ForumElettrico.it"
            },
            "DateCreated": "2020-04-18T13:38:00Z"
        },
        {
            "ID": 22001,
            "ChargePointID": 130585,
            "ItemURL": "https://s3-ap-southeast-2.amazonaws.com/openchargemap/images/IT/OCM130585/OCM-130585.orig.2020041813380976.jpg",
            "ItemThumbnailURL": "https://s3-ap-southeast-2.amazonaws.com/openchargemap/images/IT/OCM130585/OCM-130585.thmb.2020041813380976.jpg",
            "Comment": "",
            "IsEnabled": true,
            "IsVideo": false,
            "IsFeaturedItem": false,
            "IsExternalResource": false,
            "User": {
                "ID": 11749,
                "Username": "ForumElettrico.it"
            },
            "DateCreated": "2020-04-18T13:38:00Z"
        },
        {
            "ID": 22002,
            "ChargePointID": 130585,
            "ItemURL": "https://s3-ap-southeast-2.amazonaws.com/openchargemap/images/IT/OCM130585/OCM-130585.orig.2020041813381629.jpg",
            "ItemThumbnailURL": "https://s3-ap-southeast-2.amazonaws.com/openchargemap/images/IT/OCM130585/OCM-130585.thmb.2020041813381629.jpg",
            "Comment": "",
            "IsEnabled": true,
            "IsVideo": false,
            "IsFeaturedItem": false,
            "IsExternalResource": false,
            "User": {
                "ID": 11749,
                "Username": "ForumElettrico.it"
            },
            "DateCreated": "2020-04-18T13:38:00Z"
        },
        {
            "ID": 22003,
            "ChargePointID": 130585,
            "ItemURL": "https://s3-ap-southeast-2.amazonaws.com/openchargemap/images/IT/OCM130585/OCM-130585.orig.2020041813382314.jpg",
            "ItemThumbnailURL": "https://s3-ap-southeast-2.amazonaws.com/openchargemap/images/IT/OCM130585/OCM-130585.thmb.2020041813382314.jpg",
            "Comment": "",
            "IsEnabled": true,
            "IsVideo": false,
            "IsFeaturedItem": false,
            "IsExternalResource": false,
            "User": {
                "ID": 11749,
                "Username": "ForumElettrico.it"
            },
            "DateCreated": "2020-04-18T13:38:00Z"
        }
    ],
    "IsRecentlyVerified": false,
    "ID": 130585,
    "UUID": "81499542-9C2E-4105-9C85-85A06329F2D3",
    "DataProviderID": 1,
    "OperatorID": 80,
    "UsageTypeID": 4,
    "AddressInfo": {
        "ID": 130931,
        "Title": "GMG SPA Concessionaria Mercedes Benz | EnelX",
        "AddressLine1": "Via Traversa Fiorentina, 8",
        "Town": "Prato",
        "StateOrProvince": "PO",
        "Postcode": "59100",
        "CountryID": 112,
        "Latitude": 43.86698653104412,
        "Longitude": 11.0930434702625,
        "RelatedURL": "https://www.enelx.com/it/it/emobility",
        "DistanceUnit": 0
    },
    "Connections": [
        {
            "ID": 182807,
            "ConnectionTypeID": 25,
            "StatusTypeID": 50,
            "LevelID": 2,
            "Amps": 32,
            "Voltage": 400,
            "PowerKW": 22,
            "CurrentTypeID": 20,
            "Quantity": 2
        }
    ],
    "NumberOfPoints": 2,
    "StatusTypeID": 50,
    "DateLastStatusUpdate": "2020-04-18T13:39:00Z",
    "DataQualityLevel": 1,
    "DateCreated": "2019-08-07T08:47:00Z",
    "SubmissionStatusTypeID": 200
}