{
    "IsRecentlyVerified": false,
    "ID": 15134,
    "UUID": "C10D998F-97DC-49E2-B5A9-D84CE38E03C8",
    "DataProviderID": 1,
    "OperatorID": 93,
    "OperatorsReference": "SC35",
    "UsageTypeID": 4,
    "AddressInfo": {
        "ID": 15480,
        "Title": "Cairns Hill Park and Ride",
        "AddressLine1": "Belfast",
        "Town": "Antrim",
        "StateOrProvince": "County Antrim",
        "Postcode": "BT8 7RH",
        "CountryID": 1,
        "Latitude": 54.545896,
        "Longitude": -5.904296,
        "DistanceUnit": 0
    },
    "Connections": [
        {
            "ID": 92060,
            "ConnectionTypeID": 25,
            "StatusTypeID": 100,
            "LevelID": 2,
            "Amps": 32,
            "Voltage": 400,
            "PowerKW": 22,
            "CurrentTypeID": 20,
            "Quantity": 2
        }
    ],
    "NumberOfPoints": 2,
    "StatusTypeID": 100,
    "DateLastStatusUpdate": "2019-06-03T09:00:00Z",
    "DataQualityLevel": 2,
    "DateCreated": "2012-12-11T15:08:00Z",
    "SubmissionStatusTypeID": 100
}