{
    "IsRecentlyVerified": true,
    "DateLastVerified": "2021-08-11T16:08:00Z",
    "ID": 188705,
    "UUID": "CBAEF3C1-EF13-4536-ADD6-A8025890FC19",
    "DataProviderID": 1,
    "OperatorID": 1,
    "UsageTypeID": 4,
    "AddressInfo": {
        "ID": 189064,
        "Title": "Praza da Igrexa",
        "AddressLine1": "Praza da Igrexa",
        "Town": "Lalín",
        "StateOrProvince": "O Deza",
        "Postcode": "36519",
        "CountryID": 210,
        "Latitude": 42.66141,
        "Longitude": -8.11098,
        "DistanceUnit": 0
    },
    "Connections": [
        {
            "ID": 304872,
            "ConnectionTypeID": 0,
            "StatusTypeID": 50,
            "Quantity": 1
        }
    ],
    "NumberOfPoints": 1,
    "StatusTypeID": 50,
    "DateLastStatusUpdate": "2021-08-12T08:06:00Z",
    "DataQualityLevel": 1,
    "DateCreated": "2021-08-11T16:08:00Z",
    "SubmissionStatusTypeID": 200
}