{
    "IsRecentlyVerified": false,
    "ID": 186162,
    "UUID": "DA1FA69F-6D3E-402B-9D64-3056609D4751",
    "DataProviderID": 29,
    "DataProvidersReference": "15767",
    "OperatorID": 45,
    "AddressInfo": {
        "ID": 186521,
        "Title": "Ratsteichstraße 5",
        "AddressLine1": "Ratsteichstraße 5",
        "Town": "Ilmenau",
        "Postcode": "98693",
        "CountryID": 87,
        "Latitude": 50.68967,
        "Longitude": 10.922678,
        "DistanceUnit": 0
    },
    "Connections": [
        {
            "ID": 298026,
            "ConnectionTypeID": 33,
            "StatusTypeID": 50,
            "LevelID": 3,
            "PowerKW": 22,
            "CurrentTypeID": 30
        },
        {
            "ID": 298027,
            "ConnectionTypeID": 25,
            "StatusTypeID": 50,
            "LevelID": 2,
            "PowerKW": 11,
            "CurrentTypeID": 20
        }
    ],
    "StatusTypeID": 50,
    "DateLastStatusUpdate": "2021-07-12T02:45:00Z",
    "MetadataValues": [
        {
            "ID": 18404,
            "MetadataFieldID": 4,
            "ItemValue": "Data from the German chargepoint registry provided by Bundesnetzagentur.de under the CC-BY 4.0 license"
        }
    ],
    "DataQualityLevel": 3,
    "DateCreated": "2021-07-12T02:45:00Z",
    "SubmissionStatusTypeID": 100
}