{
    "UserComments": [
        {
            "ID": 24142,
            "ChargePointID": 116039,
            "CommentTypeID": 10,
            "UserName": "Robert Seemueller",
            "DateCreated": "2021-04-06T01:47:40.343Z",
            "User": {
                "ID": 19108,
                "Username": "Robert Seemueller"
            },
            "CheckinStatusTypeID": 140,
            "IsActionedByEditor": false
        }
    ],
    "MediaItems": [
        {
            "ID": 27182,
            "ChargePointID": 116039,
            "ItemURL": "https://s3-ap-southeast-2.amazonaws.com/openchargemap/images/US/OCM116039/OCM-116039.orig.2021040601321617.jpg",
            "ItemThumbnailURL": "https://s3-ap-southeast-2.amazonaws.com/openchargemap/images/US/OCM116039/OCM-116039.thmb.2021040601321617.jpg",
            "Comment": "",
            "IsEnabled": true,
            "IsVideo": false,
            "IsFeaturedItem": false,
            "IsExternalResource": false,
            "User": {
                "ID": 19108,
                "Username": "Robert Seemueller"
            },
            "DateCreated": "2021-04-06T01:32:00Z"
        }
    ],
    "IsRecentlyVerified": false,
    "ID": 116039,
    "UUID": "EC6779CD-29F3-4BBA-A31F-41AFCE8452C3",
    "DataProviderID": 1,
    "UsageTypeID": 1,
    "UsageCost": "FREE",
    "AddressInfo": {
        "ID": 116385,
        "Title": "Andirondack Travel Center ",
        "AddressLine1": "I-87 MP 40 Northbound.",
        "Town": "Queensbury",
        "StateOrProvince": "NY",
        "Postcode": "12804",
        "CountryID": 2,
        "Latitude": 43.273451,
        "Longitude": -73.674594,
        "ContactTelephone1": "518-457-6195",
        "AccessComments": "24 hours daily",
        "DistanceUnit": 0
    },
    "Connections": [
        {
            "ID": 163098,
            "ConnectionTypeID": 2,
            "StatusTypeID": 50,
            "LevelID": 3,
            "Amps": 100,
            "Voltage": 400,
            "PowerKW": 40,
            "CurrentTypeID": 30,
            "Quantity": 1
        },
        {
            "ID": 163099,
            "ConnectionTypeID": 32,
            "StatusTypeID": 50,
            "LevelID": 3,
            "Amps": 100,
            "Voltage": 400,
            "PowerKW": 40,
            "CurrentTypeID": 30,
            "Quantity": 1
        }
    ],
    "NumberOfPoints": 2,
    "StatusTypeID": 50,
    "DateLastStatusUpdate": "2021-04-06T01:48:00Z",
    "DataQualityLevel": 3,
    "DateCreated": "2019-02-11T07:13:00Z",
    "SubmissionStatusTypeID": 100
}