{
    "IsRecentlyVerified": false,
    "ID": 27338,
    "UUID": "DFAC8721-B163-4D21-A44D-C2EBA07B6282",
    "DataProviderID": 2,
    "DataProvidersReference": "43851",
    "OperatorID": 39,
    "UsageTypeID": 4,
    "AddressInfo": {
        "ID": 27684,
        "Title": "Walgreens - Grandview, MO #1236",
        "AddressLine1": "13000 S US Hwy 71",
        "Town": "Grandview",
        "StateOrProvince": "MO",
        "Postcode": "64030",
        "CountryID": 2,
        "Latitude": 38.888541877478,
        "Longitude": -94.526497826093,
        "ContactTelephone1": "800-663-5633",
        "AccessComments": "MO: 12:00am-12:00am; TU: 12:00am-12:00am; WE: 12:00am-12:00am; TH: 12:00am-12:00am; FR: 12:00am-12:00am; SA: 12:00am-12:00am; SU: 12:00am-12:00am",
        "RelatedURL": "http://www.semacharge.com/",
        "DistanceUnit": 0
    },
    "Connections": [
        {
            "ID": 29949,
            "ConnectionTypeID": 1,
            "LevelID": 2,
            "Amps": 16,
            "Voltage": 230,
            "PowerKW": 3,
            "CurrentTypeID": 10,
            "Quantity": 1
        }
    ],
    "DateLastStatusUpdate": "2019-04-06T04:03:00Z",
    "DataQualityLevel": 3,
    "DateCreated": "2014-11-28T03:37:00Z",
    "SubmissionStatusTypeID": 100
}