{
    "IsRecentlyVerified": false,
    "ID": 152836,
    "UUID": "88195648-8225-468B-8778-0A0F467606DA",
    "DataProviderID": 28,
    "DataProvidersReference": "FR*S49*P49015*001",
    "UsageTypeID": 5,
    "AddressInfo": {
        "ID": 153189,
        "Title": "AVRILLE - Parking Maison Medicale",
        "AddressLine1": "Parking Maison Medicale  49240 AVRILLE",
        "CountryID": 80,
        "Latitude": 47.499568,
        "Longitude": -0.589951,
        "AccessComments": "24h/24 7j/7",
        "DistanceUnit": 0
    },
    "Connections": [
        {
            "ID": 214141,
            "ConnectionTypeID": 25,
            "StatusTypeID": 50,
            "LevelID": 2,
            "PowerKW": 18,
            "CurrentTypeID": 20
        },
        {
            "ID": 214142,
            "ConnectionTypeID": 28,
            "StatusTypeID": 50,
            "LevelID": 2,
            "PowerKW": 18,
            "CurrentTypeID": 10
        },
        {
            "ID": 247376,
            "ConnectionTypeID": 25,
            "StatusTypeID": 50,
            "LevelID": 2,
            "PowerKW": 18,
            "CurrentTypeID": 20
        },
        {
            "ID": 247377,
            "ConnectionTypeID": 28,
            "StatusTypeID": 50,
            "LevelID": 2,
            "PowerKW": 18,
            "CurrentTypeID": 10
        }
    ],
    "GeneralComments": "Recharge par badge et avec une application smartphone",
    "StatusTypeID": 50,
    "DateLastStatusUpdate": "2020-08-27T05:13:00Z",
    "DataQualityLevel": 2,
    "DateCreated": "2020-03-15T10:54:00Z",
    "SubmissionStatusTypeID": 100
}