{
    "IsRecentlyVerified": false,
    "ID": 158391,
    "UUID": "374BBE6F-949E-40C7-96C2-6595CD36EE36",
    "DataProviderID": 2,
    "DataProvidersReference": "155549",
    "OperatorID": 5,
    "UsageTypeID": 1,
    "AddressInfo": {
        "ID": 158745,
        "Title": "VAMC DALLAS",
        "AddressLine1": "Veterans Dr",
        "Town": "Dallas",
        "StateOrProvince": "TX",
        "Postcode": "75216",
        "CountryID": 2,
        "Latitude": 32.6960787,
        "Longitude": -96.7885,
        "ContactTelephone1": "888-758-4389",
        "AccessComments": "24 hours daily",
        "RelatedURL": "http://www.chargepoint.com/",
        "DistanceUnit": 0
    },
    "Connections": [
        {
            "ID": 228367,
            "ConnectionTypeID": 1,
            "LevelID": 2,
            "Amps": 16,
            "Voltage": 230,
            "PowerKW": 3.7,
            "CurrentTypeID": 10,
            "Quantity": 2
        }
    ],
    "StatusTypeID": 50,
    "DateLastStatusUpdate": "2020-06-26T02:55:00Z",
    "DataQualityLevel": 3,
    "DateCreated": "2020-06-26T02:55:00Z",
    "SubmissionStatusTypeID": 100
}