{
    "IsRecentlyVerified": false,
    "ID": 182473,
    "UUID": "747E96D2-E717-4138-9487-D0A38E97F16B",
    "DataProviderID": 29,
    "DataProvidersReference": "14178",
    "OperatorID": 69,
    "AddressInfo": {
        "ID": 182832,
        "Title": "Otl-Aicher-Str. 1",
        "AddressLine1": "Otl-Aicher-Str. 1",
        "Town": "Fürstenfeldbruck",
        "Postcode": "82256",
        "CountryID": 87,
        "Latitude": 48.16212,
        "Longitude": 11.22345,
        "DistanceUnit": 0
    },
    "Connections": [
        {
            "ID": 288265,
            "ConnectionTypeID": 25,
            "StatusTypeID": 50,
            "LevelID": 2,
            "PowerKW": 22,
            "CurrentTypeID": 20
        },
        {
            "ID": 288266,
            "ConnectionTypeID": 25,
            "StatusTypeID": 50,
            "LevelID": 2,
            "PowerKW": 22,
            "CurrentTypeID": 20
        }
    ],
    "StatusTypeID": 50,
    "DateLastStatusUpdate": "2021-07-12T02:40:00Z",
    "MetadataValues": [
        {
            "ID": 14766,
            "MetadataFieldID": 4,
            "ItemValue": "Data from the German chargepoint registry provided by Bundesnetzagentur.de under the CC-BY 4.0 license"
        }
    ],
    "DataQualityLevel": 3,
    "DateCreated": "2021-07-08T10:03:00Z",
    "SubmissionStatusTypeID": 100
}