{
    "IsRecentlyVerified": false,
    "ID": 110018,
    "UUID": "ACDC4C25-231C-45DE-A3B3-72BC9141CCEC",
    "DataProviderID": 2,
    "DataProvidersReference": "99712",
    "UsageTypeID": 1,
    "AddressInfo": {
        "ID": 110364,
        "Title": "Jet Food Stores of Georgia #92",
        "AddressLine1": "4765 Riverside Dr",
        "Town": "Macon",
        "StateOrProvince": "GA",
        "Postcode": "31210",
        "CountryID": 2,
        "Latitude": 32.920767,
        "Longitude": -83.708842,
        "ContactTelephone1": "478-216-5271",
        "AccessComments": "24 hours daily",
        "RelatedURL": "",
        "DistanceUnit": 0
    },
    "Connections": [
        {
            "ID": 155244,
            "ConnectionTypeID": 1,
            "LevelID": 2,
            "Amps": 16,
            "Voltage": 230,
            "PowerKW": 3,
            "CurrentTypeID": 10,
            "Quantity": 2
        }
    ],
    "DateLastStatusUpdate": "2019-04-06T04:01:00Z",
    "DataQualityLevel": 3,
    "DateCreated": "2018-10-18T23:35:00Z",
    "SubmissionStatusTypeID": 100
}