{
    "IsRecentlyVerified": false,
    "ID": 102741,
    "UUID": "77BC127E-37BB-4F1D-941D-7A4EFA20B8B4",
    "DataProviderID": 2,
    "DataProvidersReference": "94821",
    "OperatorID": 3372,
    "UsageTypeID": 2,
    "AddressInfo": {
        "ID": 103087,
        "Title": "Alta Liberty Mill",
        "AddressLine1": "19520 Waters Rd",
        "Town": "Germantown",
        "StateOrProvince": "MD",
        "Postcode": "20874",
        "CountryID": 2,
        "Latitude": 39.177486,
        "Longitude": -77.273301,
        "ContactTelephone1": "866-816-7584",
        "AccessComments": "Business hours",
        "RelatedURL": "http://evconnect.com/",
        "DistanceUnit": 0
    },
    "Connections": [
        {
            "ID": 144861,
            "ConnectionTypeID": 1,
            "LevelID": 2,
            "Amps": 16,
            "Voltage": 230,
            "PowerKW": 3.7,
            "CurrentTypeID": 10,
            "Quantity": 3
        }
    ],
    "DateLastStatusUpdate": "2020-06-26T03:01:00Z",
    "DataQualityLevel": 3,
    "DateCreated": "2018-04-21T04:13:00Z",
    "SubmissionStatusTypeID": 100
}