{
    "IsRecentlyVerified": false,
    "ID": 74175,
    "UUID": "B5D2FE11-B79D-436F-9E67-EEA1B38B982A",
    "DataProviderID": 1,
    "OperatorID": 89,
    "OperatorsReference": "CEC-00024",
    "UsageTypeID": 4,
    "UsageCost": "CAD 10.00/hour",
    "AddressInfo": {
        "ID": 74521,
        "Title": "BRCC-St-Hubert-Piedmont",
        "AddressLine1": "725 rue Jean Adam",
        "Town": "Piedmont",
        "StateOrProvince": "QC",
        "Postcode": "J0R 1R3",
        "CountryID": 44,
        "Latitude": 45.889929,
        "Longitude": -74.145738,
        "DistanceUnit": 0
    },
    "Connections": [
        {
            "ID": 106518,
            "ConnectionTypeID": 2,
            "StatusTypeID": 50,
            "LevelID": 3,
            "PowerKW": 50,
            "CurrentTypeID": 20,
            "Quantity": 1
        },
        {
            "ID": 106519,
            "ConnectionTypeID": 32,
            "StatusTypeID": 50,
            "LevelID": 3,
            "PowerKW": 50,
            "CurrentTypeID": 20,
            "Quantity": 1
        }
    ],
    "NumberOfPoints": 1,
    "StatusTypeID": 50,
    "DateLastStatusUpdate": "2016-11-29T09:17:00Z",
    "DataQualityLevel": 1,
    "DateCreated": "2016-11-24T14:20:00Z",
    "SubmissionStatusTypeID": 200
}