{
    "IsRecentlyVerified": false,
    "ID": 79461,
    "UUID": "F13EC72C-2ECC-4320-B199-2B26415E380A",
    "DataProviderID": 1,
    "OperatorID": 23,
    "OperatorsReference": "13166",
    "UsageTypeID": 6,
    "UsageCost": "Free",
    "AddressInfo": {
        "ID": 79807,
        "Title": "Fairmont Hotel Macdonald",
        "AddressLine1": "10065 100 St",
        "Town": "Edmonton",
        "StateOrProvince": "AB",
        "Postcode": "T5J 0N6",
        "CountryID": 44,
        "Latitude": 53.540495,
        "Longitude": -113.489949,
        "ContactTelephone1": "(780) 424-5181",
        "DistanceUnit": 0
    },
    "Connections": [
        {
            "ID": 114100,
            "ConnectionTypeID": 30,
            "StatusTypeID": 50,
            "LevelID": 2,
            "PowerKW": 8,
            "CurrentTypeID": 10,
            "Quantity": 1
        }
    ],
    "NumberOfPoints": 1,
    "GeneralComments": "1 Tesla Connector, up to 8kW.Available for patrons only. Please see valet.",
    "StatusTypeID": 50,
    "DateLastStatusUpdate": "2017-06-09T14:05:00Z",
    "DataQualityLevel": 1,
    "DateCreated": "2017-01-29T17:18:00Z",
    "SubmissionStatusTypeID": 200
}