{
    "IsRecentlyVerified": false,
    "ID": 47740,
    "UUID": "87F3F09A-4119-4C3B-8419-1E776795E070",
    "DataProviderID": 1,
    "OperatorID": 45,
    "UsageTypeID": 3,
    "AddressInfo": {
        "ID": 48086,
        "Title": "E-Bike Ladestation Supermarkt real",
        "AddressLine1": "Stubbenweg 27",
        "Town": "Oldenburg",
        "StateOrProvince": "Oldenburg",
        "Postcode": "26125",
        "CountryID": 87,
        "Latitude": 53.1834059693667,
        "Longitude": 8.22799022463631,
        "ContactTelephone1": "+49 441 933260",
        "AccessComments": "An der  grünen \"Solarsäule\" rechts neben dem Mutter&Kind Parkplatz ist eine Blechbox mit 2 Ladefächern für Elektrofahrräder. Der Schlüssel muss an der Kundeninfo (geöffnet Mo-Sa 8-22Uhr) entliehen werden. Als E-Autofahrer muss man sich auf den Mutter&Kind Parkplatz stellen, um aufladen zu können; vor der Ladebox sind Fahrradständer. Unbekannt ist die Belastbarkeit des Schukoanschlusses.",
        "DistanceUnit": 0
    },
    "Connections": [
        {
            "ID": 58863,
            "ConnectionTypeID": 28,
            "StatusTypeID": 50,
            "LevelID": 1,
            "Amps": 10,
            "Voltage": 230,
            "PowerKW": 2.3,
            "CurrentTypeID": 10,
            "Quantity": 2
        }
    ],
    "NumberOfPoints": 2,
    "StatusTypeID": 50,
    "DateLastStatusUpdate": "2015-06-08T15:19:00Z",
    "DataQualityLevel": 1,
    "DateCreated": "2015-06-08T11:16:00Z",
    "SubmissionStatusTypeID": 200
}