{
    "IsRecentlyVerified": false,
    "ID": 36592,
    "UUID": "98DE36CC-C5BD-4E53-96CF-5E6415F219E2",
    "DataProviderID": 26,
    "DataProvidersReference": "51758",
    "OperatorID": 73,
    "OperatorsReference": "EV-Box EVB-P1243115",
    "UsageCost": "0.00 jaarabonnement",
    "AddressInfo": {
        "ID": 36938,
        "Title": "Oud-Loosdrechtsedijk 243-ap02",
        "AddressLine1": "Oud-Loosdrechtsedijk 243-ap02",
        "Town": "Wijdemeren",
        "Postcode": "1231 LX",
        "CountryID": 159,
        "Latitude": 52.20641,
        "Longitude": 5.07467,
        "RelatedURL": "http://www.ev-box.nl",
        "DistanceUnit": 0
    },
    "Connections": [
        {
            "ID": 40103,
            "ConnectionTypeID": 25,
            "LevelID": 2,
            "PowerKW": 11,
            "CurrentTypeID": 10
        }
    ],
    "NumberOfPoints": 1,
    "StatusTypeID": 50,
    "DateLastStatusUpdate": "2016-06-04T02:51:00Z",
    "DataQualityLevel": 3,
    "DateCreated": "2015-01-09T06:05:00Z",
    "SubmissionStatusTypeID": 100
}