{
    "IsRecentlyVerified": false,
    "ID": 176400,
    "UUID": "0C0B679D-97D9-43E2-B9FB-CE90ECCCB236",
    "DataProviderID": 29,
    "DataProvidersReference": "6792",
    "AddressInfo": {
        "ID": 176759,
        "Title": "Beim Hammerschmied 5",
        "AddressLine1": "Beim Hammerschmied 5",
        "Town": "Leutkirch im Allgäu",
        "Postcode": "88299",
        "CountryID": 87,
        "Latitude": 47.827768,
        "Longitude": 10.013686,
        "DistanceUnit": 0
    },
    "Connections": [
        {
            "ID": 274262,
            "ConnectionTypeID": 33,
            "StatusTypeID": 50,
            "LevelID": 3,
            "PowerKW": 22,
            "CurrentTypeID": 30
        },
        {
            "ID": 274263,
            "ConnectionTypeID": 25,
            "StatusTypeID": 50,
            "LevelID": 2,
            "PowerKW": 11,
            "CurrentTypeID": 20
        }
    ],
    "StatusTypeID": 0,
    "DateLastStatusUpdate": "2021-07-12T02:39:00Z",
    "MetadataValues": [
        {
            "ID": 8695,
            "MetadataFieldID": 4,
            "ItemValue": "Data from the German chargepoint registry provided by Bundesnetzagentur.de under the CC-BY 4.0 license"
        }
    ],
    "DataQualityLevel": 3,
    "DateCreated": "2021-07-08T09:48:00Z",
    "SubmissionStatusTypeID": 100
}