{
    "IsRecentlyVerified": false,
    "ID": 45736,
    "UUID": "860FD94C-15FE-4DAF-A620-854498B1D33B",
    "DataProviderID": 1,
    "DataProvidersReference": "694",
    "AddressInfo": {
        "ID": 46082,
        "Title": "Sørlandet Sykehus, Arendal",
        "AddressLine1": "Sykehusveien ",
        "Town": "ARENDAL",
        "StateOrProvince": "Agder",
        "Postcode": "4809",
        "CountryID": 168,
        "Latitude": 58.46576,
        "Longitude": 8.75692,
        "AccessComments": "Rett til venstre etter innkjørselen til parkeringshuset.",
        "DistanceUnit": 0
    },
    "Connections": [
        {
            "ID": 56399,
            "ConnectionTypeID": 0,
            "Reference": "1",
            "LevelID": 2,
            "Amps": 16,
            "Voltage": 230,
            "PowerKW": 3.7,
            "Comments": "Mode 1"
        },
        {
            "ID": 84087,
            "ConnectionTypeID": 0,
            "Reference": "2",
            "LevelID": 2,
            "Amps": 16,
            "Voltage": 230,
            "PowerKW": 3.7,
            "Comments": "Mode 1"
        },
        {
            "ID": 84088,
            "ConnectionTypeID": 0,
            "Reference": "3",
            "LevelID": 2,
            "Amps": 16,
            "Voltage": 230,
            "PowerKW": 3.7,
            "Comments": "Mode 1"
        },
        {
            "ID": 87980,
            "ConnectionTypeID": 0,
            "Reference": "4",
            "LevelID": 2,
            "Amps": 16,
            "Voltage": 230,
            "PowerKW": 3.7,
            "Comments": "Mode 1"
        }
    ],
    "NumberOfPoints": 4,
    "DateLastStatusUpdate": "2020-05-26T08:22:00Z",
    "DataQualityLevel": 2,
    "DateCreated": "2015-05-03T00:54:00Z",
    "SubmissionStatusTypeID": 100
}