{
    "IsRecentlyVerified": false,
    "ID": 37137,
    "UUID": "41EE78BB-C3F5-491C-8988-70F6135CF187",
    "DataProviderID": 26,
    "DataProvidersReference": "31508",
    "OperatorID": 157,
    "OperatorsReference": "NewMotion ICUEVE000015",
    "UsageCost": "0.00 jaarabonnement",
    "AddressInfo": {
        "ID": 37483,
        "Title": "Galvanistraat 7",
        "AddressLine1": "Galvanistraat 7",
        "Town": "Rijssen-Holten",
        "Postcode": "7461 JC",
        "CountryID": 159,
        "Latitude": 52.3147939939186,
        "Longitude": 6.51922753453221,
        "ContactTelephone1": "088 0109500",
        "RelatedURL": "http://thenewmotion.nl/",
        "DistanceUnit": 0
    },
    "Connections": [
        {
            "ID": 40648,
            "ConnectionTypeID": 25,
            "LevelID": 2,
            "PowerKW": 22,
            "CurrentTypeID": 10
        }
    ],
    "NumberOfPoints": 2,
    "StatusTypeID": 50,
    "DateLastStatusUpdate": "2016-06-04T02:52:00Z",
    "DataQualityLevel": 3,
    "DateCreated": "2015-01-09T06:07:00Z",
    "SubmissionStatusTypeID": 100
}