{
    "IsRecentlyVerified": false,
    "ID": 111218,
    "UUID": "E075F438-9F91-41A3-8FDE-96DC0D8020A8",
    "DataProviderID": 2,
    "DataProvidersReference": "84320",
    "UsageTypeID": 1,
    "AddressInfo": {
        "ID": 111564,
        "Title": "Saint Mary's University - Arena Parking Lot",
        "AddressLine1": "923 Robie St",
        "Town": "Halifax",
        "StateOrProvince": "NS",
        "Postcode": "B3H 3C3",
        "CountryID": 44,
        "Latitude": 44.63132,
        "Longitude": -63.581704,
        "ContactTelephone1": "902-420-5400",
        "AccessComments": "24 hours daily",
        "RelatedURL": "",
        "DistanceUnit": 0
    },
    "Connections": [
        {
            "ID": 156602,
            "ConnectionTypeID": 1,
            "LevelID": 2,
            "Amps": 16,
            "Voltage": 230,
            "PowerKW": 3.7,
            "CurrentTypeID": 10,
            "Quantity": 1
        }
    ],
    "DateLastStatusUpdate": "2020-06-26T03:08:00Z",
    "DataQualityLevel": 3,
    "DateCreated": "2018-10-18T23:36:00Z",
    "SubmissionStatusTypeID": 100
}