{
    "IsRecentlyVerified": false,
    "ID": 73153,
    "UUID": "1D5F96B0-F7A7-4FF6-BB26-1AFFF921A985",
    "DataProviderID": 1,
    "OperatorID": 105,
    "UsageTypeID": 4,
    "AddressInfo": {
        "ID": 73499,
        "Title": "Hamburger Sparkasse Haspa",
        "AddressLine1": "Norderstraße 2-8",
        "Town": "Geesthacht",
        "StateOrProvince": "Kreis Herzogtum Lauenburg",
        "Postcode": "21502",
        "CountryID": 87,
        "Latitude": 53.4343542316998,
        "Longitude": 10.3722272294998,
        "AccessComments": "24/7 nutzbare Ladesäule auf dem Parkplatz hinter der Sparkasse, nach der Einfahrt von der Norderstraße aus gleich links die ersten beiden Parkbuchten.",
        "DistanceUnit": 0
    },
    "Connections": [
        {
            "ID": 105177,
            "ConnectionTypeID": 25,
            "StatusTypeID": 50,
            "LevelID": 2,
            "Amps": 32,
            "Voltage": 400,
            "PowerKW": 22,
            "CurrentTypeID": 20,
            "Quantity": 2
        }
    ],
    "NumberOfPoints": 2,
    "StatusTypeID": 50,
    "DateLastStatusUpdate": "2016-11-11T07:45:00Z",
    "DataQualityLevel": 1,
    "DateCreated": "2016-11-11T07:44:00Z",
    "SubmissionStatusTypeID": 200
}