{
    "IsRecentlyVerified": false,
    "ID": 75076,
    "UUID": "5A1F82C0-0FBD-4BEF-92BA-4A7447799B13",
    "DataProviderID": 1,
    "OperatorID": 1,
    "UsageTypeID": 0,
    "AddressInfo": {
        "ID": 75422,
        "Title": "Tarasy Zamkowe",
        "AddressLine1": "Aleja Unii Lubelskiej 2",
        "AddressLine2": "Kalinowszczyzna",
        "Town": "Lublin",
        "StateOrProvince": "Lublin",
        "Postcode": "20-121",
        "CountryID": 179,
        "Latitude": 51.2505002,
        "Longitude": 22.575590000000034,
        "DistanceUnit": 0
    },
    "Connections": [],
    "NumberOfPoints": 1,
    "GeneralComments": "Info z http://www.mytesla.com.pl/punkty-ladowania/",
    "StatusTypeID": 50,
    "DateLastStatusUpdate": "2016-12-11T17:52:00Z",
    "DataQualityLevel": 1,
    "DateCreated": "2016-12-11T17:52:00Z",
    "SubmissionStatusTypeID": 200
}