{
    "IsRecentlyVerified": false,
    "ID": 123439,
    "UUID": "6C30606F-2F11-4491-8483-CA4C1009F8C2",
    "DataProviderID": 2,
    "DataProvidersReference": "105370",
    "OperatorID": 5,
    "UsageTypeID": 1,
    "AddressInfo": {
        "ID": 123785,
        "Title": "228",
        "AddressLine1": "916 West Monroe Ave",
        "Town": "Lowell",
        "StateOrProvince": "AR",
        "Postcode": "72745",
        "CountryID": 2,
        "Latitude": 36.2560588,
        "Longitude": -94.1551336,
        "ContactTelephone1": "888-758-4389",
        "AccessComments": "24 hours daily",
        "RelatedURL": "http://www.chargepoint.com/",
        "DistanceUnit": 0
    },
    "Connections": [
        {
            "ID": 173416,
            "ConnectionTypeID": 1,
            "LevelID": 2,
            "Amps": 16,
            "Voltage": 230,
            "PowerKW": 3.7,
            "CurrentTypeID": 10,
            "Quantity": 2
        }
    ],
    "DateLastStatusUpdate": "2020-06-26T02:58:00Z",
    "DataQualityLevel": 3,
    "DateCreated": "2019-04-06T05:03:00Z",
    "SubmissionStatusTypeID": 100
}