{
    "IsRecentlyVerified": false,
    "ID": 79257,
    "UUID": "CF161201-3DA3-4E41-A900-44D69C35211C",
    "DataProviderID": 1,
    "OperatorID": 235,
    "UsageTypeID": 6,
    "AddressInfo": {
        "ID": 79603,
        "Title": "SWD Parkplatz Landtag Nordrhein-Westfalen",
        "AddressLine1": "Platz des Landtags 1",
        "Town": "Düsseldorf",
        "StateOrProvince": "Düsseldorf",
        "Postcode": "40221",
        "CountryID": 87,
        "Latitude": 51.2181215730566,
        "Longitude": 6.76233988878129,
        "ContactTelephone1": "+49 211 821821",
        "AccessComments": "Nicht-öffentliche Ladesäule, nur für Besucher, auf dem öffentlich zugänglichen Parkplatz des Landtages NRW",
        "DistanceUnit": 0
    },
    "Connections": [
        {
            "ID": 113878,
            "ConnectionTypeID": 25,
            "StatusTypeID": 50,
            "LevelID": 2,
            "Amps": 32,
            "Voltage": 400,
            "PowerKW": 22,
            "CurrentTypeID": 20,
            "Quantity": 4
        },
        {
            "ID": 113879,
            "ConnectionTypeID": 28,
            "StatusTypeID": 50,
            "LevelID": 2,
            "Amps": 16,
            "Voltage": 230,
            "PowerKW": 3.7,
            "CurrentTypeID": 10,
            "Quantity": 4
        }
    ],
    "NumberOfPoints": 4,
    "StatusTypeID": 50,
    "DateLastStatusUpdate": "2017-01-27T06:58:00Z",
    "DataQualityLevel": 1,
    "DateCreated": "2017-01-27T06:58:00Z",
    "SubmissionStatusTypeID": 200
}