{
    "IsRecentlyVerified": false,
    "ID": 91362,
    "UUID": "FC0D0181-D3B7-4E67-92F0-E11A9BDE9C36",
    "DataProviderID": 2,
    "DataProvidersReference": "85954",
    "UsageTypeID": 1,
    "AddressInfo": {
        "ID": 91708,
        "Title": "Holiday Inn Express",
        "AddressLine1": "107 Upward Crossing Dr",
        "Town": "Flat Rock",
        "StateOrProvince": "NC",
        "Postcode": "28731",
        "CountryID": 2,
        "Latitude": 35.29856,
        "Longitude": -82.409937,
        "ContactTelephone1": "828-698-8899",
        "AccessComments": "24 hours daily; free for guests",
        "RelatedURL": "",
        "DistanceUnit": 0
    },
    "Connections": [
        {
            "ID": 129514,
            "ConnectionTypeID": 1,
            "LevelID": 2,
            "Amps": 16,
            "Voltage": 230,
            "PowerKW": 3,
            "CurrentTypeID": 10,
            "Quantity": 2
        }
    ],
    "DateLastStatusUpdate": "2019-04-06T04:02:00Z",
    "DataQualityLevel": 3,
    "DateCreated": "2017-08-03T12:25:00Z",
    "SubmissionStatusTypeID": 100
}