{
    "IsRecentlyVerified": false,
    "ID": 110161,
    "UUID": "C71F99C6-67E1-40D8-ADD8-A26E5CC2F7FA",
    "DataProviderID": 2,
    "DataProvidersReference": "99223",
    "OperatorID": 59,
    "UsageTypeID": 1,
    "AddressInfo": {
        "ID": 110507,
        "Title": "Greenlots - 12587",
        "AddressLine1": "5921 Monterey Rd",
        "Town": "Los Angeles",
        "StateOrProvince": "CA",
        "Postcode": "90042",
        "CountryID": 2,
        "Latitude": 34.1049766540527,
        "Longitude": -118.184844970703,
        "ContactTelephone1": "855-900-7584",
        "AccessComments": "24 hours daily",
        "RelatedURL": "http://greenlots.com/",
        "DistanceUnit": 0
    },
    "Connections": [
        {
            "ID": 155394,
            "ConnectionTypeID": 1,
            "LevelID": 2,
            "Amps": 16,
            "Voltage": 230,
            "PowerKW": 3,
            "CurrentTypeID": 10,
            "Quantity": 1
        }
    ],
    "DateLastStatusUpdate": "2019-04-06T04:01:00Z",
    "DataQualityLevel": 3,
    "DateCreated": "2018-10-18T23:35:00Z",
    "SubmissionStatusTypeID": 100
}