{
    "IsRecentlyVerified": false,
    "ID": 50797,
    "UUID": "EA158458-A1DB-4B07-BBC5-ACB3937E4EB0",
    "DataProviderID": 26,
    "DataProvidersReference": "63792",
    "OperatorID": 180,
    "OperatorsReference": "Alfen RHL02122",
    "UsageCost": "0.00 jaarabonnement",
    "AddressInfo": {
        "ID": 51143,
        "Title": "Veilingweg 22",
        "AddressLine1": "Veilingweg 22",
        "Town": "Westland",
        "Postcode": "2678 LN",
        "CountryID": 159,
        "Latitude": 51.98091,
        "Longitude": 4.243452,
        "ContactTelephone1": "036 - 549 34 00",
        "RelatedURL": "http://www.icu-charging-stations.com/",
        "DistanceUnit": 0
    },
    "Connections": [
        {
            "ID": 62675,
            "ConnectionTypeID": 25,
            "LevelID": 2,
            "PowerKW": 11,
            "CurrentTypeID": 10
        },
        {
            "ID": 62676,
            "ConnectionTypeID": 25,
            "LevelID": 2,
            "PowerKW": 11,
            "CurrentTypeID": 10
        }
    ],
    "NumberOfPoints": 1,
    "StatusTypeID": 50,
    "DateLastStatusUpdate": "2016-06-04T02:43:00Z",
    "DataQualityLevel": 3,
    "DateCreated": "2015-07-22T09:53:00Z",
    "SubmissionStatusTypeID": 100
}