{
    "IsRecentlyVerified": false,
    "ID": 142078,
    "UUID": "595BEF6F-8A39-4E77-8DE5-65F98CD05640",
    "DataProviderID": 2,
    "DataProvidersReference": "147926",
    "OperatorID": 39,
    "UsageTypeID": 1,
    "AddressInfo": {
        "ID": 142430,
        "Title": "1050 Walnut Garage",
        "AddressLine1": "1050 Walnut Street",
        "Town": "Boulder",
        "StateOrProvince": "CO",
        "Postcode": "80302",
        "CountryID": 2,
        "Latitude": 40.0162815,
        "Longitude": -105.2813819,
        "ContactTelephone1": "800-663-5633",
        "AccessComments": "MO: Not Specified; TU: Not Specified; WE: Not Specified; TH: Not Specified; FR: Not Specified; SA: Not Specified; SU: Not Specified",
        "RelatedURL": "http://www.semacharge.com/",
        "DistanceUnit": 0
    },
    "Connections": [
        {
            "ID": 198144,
            "ConnectionTypeID": 1,
            "LevelID": 2,
            "Amps": 16,
            "Voltage": 230,
            "PowerKW": 3.7,
            "CurrentTypeID": 10,
            "Quantity": 2
        }
    ],
    "StatusTypeID": 50,
    "DateLastStatusUpdate": "2020-06-26T03:02:00Z",
    "DataQualityLevel": 3,
    "DateCreated": "2019-12-24T09:17:00Z",
    "SubmissionStatusTypeID": 100
}