{
    "UserComments": [
        {
            "ID": 4367,
            "ChargePointID": 5726,
            "CommentTypeID": 10,
            "UserName": "",
            "Comment": "We supply access keys to people who sign up to the scheme. The scheme is £50 for 12 months unlimited use of the charging posts located at the park and ride. \nRobert Powell\nNationwide eBikes LLP (Taunton)",
            "DateCreated": "2015-05-04T17:42:36.973Z",
            "CheckinStatusTypeID": 0
        },
        {
            "ID": 47,
            "ChargePointID": 5726,
            "CommentTypeID": 50,
            "UserName": "Paul Churchley",
            "Comment": "Available only during Park and Ride operational hours",
            "DateCreated": "2011-12-05T08:15:28.893Z"
        }
    ],
    "IsRecentlyVerified": false,
    "ID": 5726,
    "UUID": "0A9CC3EF-6E1A-46C1-A326-EA36170436C5",
    "DataProviderID": 1,
    "OperatorID": 16,
    "UsageTypeID": 4,
    "AddressInfo": {
        "ID": 5648,
        "Title": "Taunton Gateway Park and Ride",
        "AddressLine1": "Junction 25 of M5",
        "Town": "Taunton",
        "StateOrProvince": "Somerset",
        "Postcode": "TA3 5LU",
        "CountryID": 1,
        "Latitude": 51.01610499957861,
        "Longitude": -3.0565330169189386,
        "RelatedURL": "http://www.elektromotive.com/html/index.php",
        "DistanceUnit": 0
    },
    "Connections": [
        {
            "ID": 475,
            "ConnectionTypeID": 3,
            "StatusTypeID": 0,
            "LevelID": 2,
            "Amps": 13,
            "Voltage": 230,
            "PowerKW": 3,
            "CurrentTypeID": 10,
            "Quantity": 2
        }
    ],
    "NumberOfPoints": 2,
    "StatusTypeID": 50,
    "DateLastStatusUpdate": "2016-11-20T13:05:00Z",
    "DataQualityLevel": 1,
    "DateCreated": "2011-09-12T11:40:00Z",
    "SubmissionStatusTypeID": 200
}