{
    "IsRecentlyVerified": false,
    "ID": 145776,
    "UUID": "29A489E5-C646-4F89-A911-B267D3A2E3EB",
    "DataProviderID": 2,
    "DataProvidersReference": "130060",
    "OperatorID": 89,
    "UsageTypeID": 1,
    "AddressInfo": {
        "ID": 146128,
        "Title": "Powell River - Library",
        "AddressLine1": "6975, Alberni Street",
        "Town": "Powell River",
        "StateOrProvince": "BC",
        "Postcode": "V8A 2B8",
        "CountryID": 44,
        "Latitude": 49.845793,
        "Longitude": -124.521818,
        "ContactTelephone1": "888-356-8911",
        "AccessComments": "24 hours daily",
        "RelatedURL": "https://flo.ca/",
        "DistanceUnit": 0
    },
    "Connections": [
        {
            "ID": 202514,
            "ConnectionTypeID": 1,
            "LevelID": 2,
            "Amps": 16,
            "Voltage": 230,
            "PowerKW": 3.7,
            "CurrentTypeID": 10,
            "Quantity": 2
        }
    ],
    "StatusTypeID": 50,
    "DateLastStatusUpdate": "2020-06-26T03:12:00Z",
    "DataQualityLevel": 3,
    "DateCreated": "2019-12-24T09:25:00Z",
    "SubmissionStatusTypeID": 100
}