{
    "IsRecentlyVerified": false,
    "ID": 157534,
    "UUID": "9CCF602B-4162-45F4-8B2D-912DB5631D9F",
    "DataProviderID": 1,
    "OperatorID": 3396,
    "UsageTypeID": 1,
    "AddressInfo": {
        "ID": 157888,
        "Title": "PKN Orlen",
        "AddressLine1": "Lubelska 139",
        "Town": "Kraśnik",
        "Postcode": "23-200 ",
        "CountryID": 179,
        "Latitude": 50.929330753403775,
        "Longitude": 22.24954407508244,
        "RelatedURL": "https://orlencharge.orlen.pl/",
        "DistanceUnit": 0
    },
    "Connections": [
        {
            "ID": 226936,
            "ConnectionTypeID": 33,
            "StatusTypeID": 50,
            "LevelID": 3,
            "PowerKW": 50,
            "CurrentTypeID": 30,
            "Quantity": 1
        },
        {
            "ID": 226937,
            "ConnectionTypeID": 2,
            "StatusTypeID": 50,
            "LevelID": 3,
            "PowerKW": 50,
            "CurrentTypeID": 30,
            "Quantity": 1
        },
        {
            "ID": 226938,
            "ConnectionTypeID": 1036,
            "StatusTypeID": 50,
            "LevelID": 3,
            "PowerKW": 43,
            "CurrentTypeID": 20,
            "Quantity": 1
        }
    ],
    "NumberOfPoints": 2,
    "StatusTypeID": 50,
    "DateLastStatusUpdate": "2020-06-15T17:59:00Z",
    "DataQualityLevel": 1,
    "DateCreated": "2020-06-14T08:39:00Z",
    "SubmissionStatusTypeID": 200
}