{
    "IsRecentlyVerified": false,
    "ID": 130721,
    "UUID": "CEF46720-413D-48C5-83D8-2E21B04286AB",
    "DataProviderID": 1,
    "OperatorID": 3385,
    "UsageTypeID": 1,
    "UsageCost": "0.21",
    "AddressInfo": {
        "ID": 131067,
        "Title": "Rogers Pass Discovery Center",
        "AddressLine1": "9520 TransCanada highway",
        "Town": "Rogers Pass",
        "StateOrProvince": "Bc",
        "Postcode": "V0E 2S0",
        "CountryID": 44,
        "Latitude": 51.30186888208726,
        "Longitude": -117.52179584250143,
        "DistanceUnit": 0
    },
    "Connections": [
        {
            "ID": 182992,
            "ConnectionTypeID": 1,
            "StatusTypeID": 50,
            "LevelID": 2,
            "CurrentTypeID": 10,
            "Quantity": 1
        },
        {
            "ID": 182993,
            "ConnectionTypeID": 2,
            "StatusTypeID": 50,
            "LevelID": 3,
            "CurrentTypeID": 30,
            "Quantity": 1
        },
        {
            "ID": 182994,
            "ConnectionTypeID": 32,
            "StatusTypeID": 50,
            "LevelID": 3,
            "CurrentTypeID": 30,
            "Quantity": 1
        }
    ],
    "NumberOfPoints": 1,
    "StatusTypeID": 50,
    "DateLastStatusUpdate": "2021-05-04T15:33:00Z",
    "DataQualityLevel": 1,
    "DateCreated": "2019-08-10T06:36:00Z",
    "SubmissionStatusTypeID": 200
}