{
    "IsRecentlyVerified": false,
    "ID": 111266,
    "UUID": "0BD40F34-1668-4B6D-BBDB-87432943D2A5",
    "DataProviderID": 2,
    "DataProvidersReference": "98985",
    "OperatorID": 59,
    "UsageTypeID": 1,
    "AddressInfo": {
        "ID": 111612,
        "Title": "Greenlots - 43021",
        "AddressLine1": "7051 W Broadway Ave",
        "Town": "Brooklyn Park",
        "StateOrProvince": "MN",
        "Postcode": "55428",
        "CountryID": 2,
        "Latitude": 45.0827674865723,
        "Longitude": -93.3777923583984,
        "ContactTelephone1": "855-900-7584",
        "AccessComments": "24 hours daily",
        "RelatedURL": "http://greenlots.com/",
        "DistanceUnit": 0
    },
    "Connections": [
        {
            "ID": 156661,
            "ConnectionTypeID": 2,
            "LevelID": 3,
            "Amps": 100,
            "Voltage": 400,
            "PowerKW": 40,
            "CurrentTypeID": 30,
            "Quantity": 1
        },
        {
            "ID": 156662,
            "ConnectionTypeID": 32,
            "LevelID": 3,
            "Amps": 100,
            "Voltage": 400,
            "PowerKW": 40,
            "CurrentTypeID": 30,
            "Quantity": 1
        }
    ],
    "DateLastStatusUpdate": "2020-06-26T03:08:00Z",
    "DataQualityLevel": 3,
    "DateCreated": "2018-10-18T23:36:00Z",
    "SubmissionStatusTypeID": 100
}