{
    "IsRecentlyVerified": false,
    "ID": 118539,
    "UUID": "471AC874-896C-487C-9F3D-786D1D0BF206",
    "DataProviderID": 1,
    "OperatorID": 23,
    "OperatorsReference": "49539",
    "UsageTypeID": 4,
    "AddressInfo": {
        "ID": 118885,
        "Title": "Chateau de Moison",
        "AddressLine1": "Chateau de Moison",
        "Town": "Ivoy le pré",
        "Postcode": "18380",
        "CountryID": 80,
        "Latitude": 47.353564,
        "Longitude": 2.485665,
        "ContactTelephone1": " +33 6 20 65 03 83",
        "DistanceUnit": 0
    },
    "Connections": [
        {
            "ID": 167643,
            "ConnectionTypeID": 30,
            "StatusTypeID": 50,
            "LevelID": 2,
            "Amps": 16,
            "Voltage": 400,
            "PowerKW": 11,
            "CurrentTypeID": 20,
            "Quantity": 2
        }
    ],
    "NumberOfPoints": 2,
    "GeneralComments": "2 Tesla Connectors, up to 11kW.Available for customers. Please call ahead.",
    "StatusTypeID": 50,
    "DateLastStatusUpdate": "2019-03-25T06:56:00Z",
    "DataQualityLevel": 1,
    "DateCreated": "2019-03-25T06:56:00Z",
    "SubmissionStatusTypeID": 200
}