{
    "IsRecentlyVerified": false,
    "ID": 57395,
    "UUID": "F5B14BDB-BD1D-4247-A048-BA89EB7928B4",
    "DataProviderID": 2,
    "DataProvidersReference": "70941",
    "OperatorID": 5,
    "UsageTypeID": 1,
    "AddressInfo": {
        "ID": 57741,
        "Title": "FEST FOODS",
        "AddressLine1": "2233 Humes RD",
        "Town": "Janesville",
        "StateOrProvince": "WI",
        "Postcode": "53545",
        "CountryID": 2,
        "Latitude": 42.7208275,
        "Longitude": -88.9937034,
        "ContactTelephone1": "888-758-4389",
        "AccessComments": "24 hours daily",
        "RelatedURL": "http://www.chargepoint.com/",
        "DistanceUnit": 0
    },
    "Connections": [
        {
            "ID": 72501,
            "ConnectionTypeID": 1,
            "LevelID": 2,
            "Amps": 16,
            "Voltage": 230,
            "PowerKW": 3.7,
            "CurrentTypeID": 10,
            "Quantity": 2
        }
    ],
    "DateLastStatusUpdate": "2020-06-26T03:06:00Z",
    "DataQualityLevel": 3,
    "DateCreated": "2015-11-30T11:50:00Z",
    "SubmissionStatusTypeID": 100
}