{
    "IsRecentlyVerified": false,
    "ID": 156459,
    "UUID": "C0E1FC7A-83E3-4181-96E2-64E4A6C3650E",
    "DataProviderID": 1,
    "OperatorID": 3341,
    "UsageTypeID": 1,
    "UsageCost": "£0.36/kWh",
    "AddressInfo": {
        "ID": 156813,
        "Title": "West Street Car Park SSDC",
        "AddressLine1": "",
        "AddressLine2": "Ilminster",
        "Town": "South Somerset",
        "StateOrProvince": "England",
        "Postcode": "TA19 0DZ",
        "CountryID": 1,
        "Latitude": 50.927626,
        "Longitude": -2.913436,
        "DistanceUnit": 0
    },
    "Connections": [
        {
            "ID": 220165,
            "ConnectionTypeID": 2,
            "StatusTypeID": 50,
            "LevelID": 3,
            "PowerKW": 50,
            "CurrentTypeID": 30,
            "Quantity": 1
        },
        {
            "ID": 220166,
            "ConnectionTypeID": 33,
            "StatusTypeID": 50,
            "LevelID": 3,
            "PowerKW": 50,
            "CurrentTypeID": 30,
            "Quantity": 1
        },
        {
            "ID": 220167,
            "ConnectionTypeID": 1036,
            "StatusTypeID": 50,
            "LevelID": 3,
            "PowerKW": 43,
            "CurrentTypeID": 20,
            "Quantity": 1
        }
    ],
    "NumberOfPoints": 1,
    "StatusTypeID": 50,
    "DateLastStatusUpdate": "2021-05-24T12:41:00Z",
    "DataQualityLevel": 1,
    "DateCreated": "2020-05-21T15:33:00Z",
    "SubmissionStatusTypeID": 200
}