{
    "IsRecentlyVerified": false,
    "ID": 174142,
    "UUID": "316D3D0A-0974-4AC9-B901-CA61FD5D7FD8",
    "DataProviderID": 1,
    "OperatorID": 1,
    "UsageTypeID": 4,
    "UsageCost": "0,37 €/kWh",
    "AddressInfo": {
        "ID": 174501,
        "Title": "Via Lovanio",
        "AddressLine1": "Via Lovanio",
        "Town": "Milan",
        "StateOrProvince": "Lombardy",
        "Postcode": "20121",
        "CountryID": 112,
        "Latitude": 45.47700015239326,
        "Longitude": 9.186097335297404,
        "RelatedURL": "https://www.citycarpoint.it/",
        "DistanceUnit": 0
    },
    "Connections": [
        {
            "ID": 269114,
            "ConnectionTypeID": 25,
            "Reference": "Powerpoint City Car",
            "StatusTypeID": 50,
            "LevelID": 2,
            "PowerKW": 22,
            "Quantity": 2,
            "Comments": "https://www.citycarpoint.it/"
        }
    ],
    "NumberOfPoints": 2,
    "StatusTypeID": 50,
    "DateLastStatusUpdate": "2021-03-18T12:38:00Z",
    "DataQualityLevel": 1,
    "DateCreated": "2021-03-18T09:11:00Z",
    "SubmissionStatusTypeID": 200
}