{
    "IsRecentlyVerified": false,
    "ID": 50836,
    "UUID": "BF77CC2B-DAEF-454C-A7E3-C8F4A3561FF6",
    "DataProviderID": 26,
    "DataProvidersReference": "64167",
    "OperatorID": 180,
    "OperatorsReference": "Alfen GDH3281",
    "UsageCost": "0.00 jaarabonnement",
    "AddressInfo": {
        "ID": 51182,
        "Title": "Jonkheer van Riemsdijklaan 1",
        "AddressLine1": "Jonkheer van Riemsdijklaan 1",
        "Town": "Den Haag",
        "Postcode": "2497 BX",
        "CountryID": 159,
        "Latitude": 52.038313,
        "Longitude": 4.362326,
        "ContactTelephone1": "036 - 549 34 00",
        "RelatedURL": "http://www.icu-charging-stations.com/",
        "DistanceUnit": 0
    },
    "Connections": [
        {
            "ID": 62743,
            "ConnectionTypeID": 25,
            "LevelID": 2,
            "PowerKW": 11,
            "CurrentTypeID": 10
        },
        {
            "ID": 62744,
            "ConnectionTypeID": 25,
            "LevelID": 2,
            "PowerKW": 11,
            "CurrentTypeID": 10
        }
    ],
    "NumberOfPoints": 1,
    "StatusTypeID": 50,
    "DateLastStatusUpdate": "2016-06-04T02:44:00Z",
    "DataQualityLevel": 3,
    "DateCreated": "2015-07-22T09:54:00Z",
    "SubmissionStatusTypeID": 100
}