{
    "IsRecentlyVerified": false,
    "ID": 93241,
    "UUID": "4239DC91-09E4-4CBF-AB46-23EAA8544EF8",
    "DataProviderID": 1,
    "OperatorID": 23,
    "OperatorsReference": "35735",
    "UsageTypeID": 7,
    "AddressInfo": {
        "ID": 93587,
        "Title": "Hotel Manos 1er",
        "AddressLine1": "Chaussée de Charleroi 100-106",
        "Town": "Brussels",
        "Postcode": "1060",
        "CountryID": 26,
        "Latitude": 50.828299,
        "Longitude": 4.355694,
        "ContactTelephone1": "+32 25 33 18 00",
        "DistanceUnit": 0
    },
    "Connections": [
        {
            "ID": 132068,
            "ConnectionTypeID": 30,
            "StatusTypeID": 50,
            "LevelID": 2,
            "Amps": 32,
            "Voltage": 400,
            "PowerKW": 22,
            "CurrentTypeID": 20,
            "Quantity": 1
        }
    ],
    "NumberOfPoints": 1,
    "GeneralComments": "1 Tesla Connector, up to 22kW.Available by reservation only. Please see front desk.",
    "StatusTypeID": 50,
    "DateLastStatusUpdate": "2018-10-03T18:07:00Z",
    "DataQualityLevel": 1,
    "DateCreated": "2017-09-24T05:30:00Z",
    "SubmissionStatusTypeID": 200
}