{
    "IsRecentlyVerified": false,
    "ID": 9192,
    "UUID": "9F4DF2F2-3B2B-4BDE-9FF3-1B48A082D20E",
    "DataProviderID": 15,
    "DataProvidersReference": "13851",
    "OperatorID": 94,
    "UsageTypeID": 1,
    "AddressInfo": {
        "ID": 9089,
        "Title": "2711 Riley Fuzzell Road",
        "AddressLine1": "2711 Riley Fuzzell Road",
        "Town": "Spring",
        "StateOrProvince": "Texas",
        "Postcode": "77386",
        "CountryID": 2,
        "Latitude": 30.110807,
        "Longitude": -95.38792,
        "ContactTelephone1": "",
        "RelatedURL": "http://carstations.com/13851",
        "DistanceUnit": 0
    },
    "Connections": [
        {
            "ID": 6873,
            "ConnectionTypeID": 1,
            "Reference": "J1772",
            "LevelID": 2
        }
    ],
    "NumberOfPoints": 1,
    "StatusTypeID": 0,
    "DateLastStatusUpdate": "2017-11-04T14:03:00Z",
    "DataQualityLevel": 2,
    "DateCreated": "2012-01-23T15:12:00Z",
    "SubmissionStatusTypeID": 100
}