{
    "IsRecentlyVerified": false,
    "ID": 101945,
    "UUID": "A6D7BF97-FF5E-451C-8872-402BD95D4FDC",
    "DataProviderID": 1,
    "OperatorID": 23,
    "OperatorsReference": "42124",
    "UsageTypeID": 4,
    "AddressInfo": {
        "ID": 102291,
        "Title": "Hilton Garden Inn Miami Airport West",
        "AddressLine1": "3550 NW 74th Ave",
        "Town": "Miami",
        "StateOrProvince": "Florida",
        "Postcode": "33122",
        "CountryID": 2,
        "Latitude": 25.807915,
        "Longitude": -80.318257,
        "ContactTelephone1": "(305) 629-7701",
        "DistanceUnit": 0
    },
    "Connections": [
        {
            "ID": 143928,
            "ConnectionTypeID": 30,
            "StatusTypeID": 50,
            "LevelID": 2,
            "PowerKW": 16,
            "CurrentTypeID": 20,
            "Quantity": 4
        }
    ],
    "NumberOfPoints": 4,
    "GeneralComments": "4 Tesla Connectors, up to 16kW.Available for customers. Please see front desk.",
    "StatusTypeID": 50,
    "DateLastStatusUpdate": "2018-04-16T04:40:00Z",
    "DataQualityLevel": 1,
    "DateCreated": "2018-04-16T04:40:00Z",
    "SubmissionStatusTypeID": 200
}