{
    "IsRecentlyVerified": false,
    "ID": 61592,
    "UUID": "41FA6323-6D9E-4AB6-9685-D4AF6F62DF91",
    "DataProviderID": 1,
    "OperatorID": 23,
    "OperatorsReference": "13082",
    "UsageTypeID": 7,
    "UsageCost": "Free",
    "AddressInfo": {
        "ID": 61938,
        "Title": "The Lodge on Little St. Simons Island",
        "AddressLine1": "1000 Hampton River Club Marina Dr",
        "Town": "St. Simons Island",
        "StateOrProvince": "GA",
        "Postcode": "31522",
        "CountryID": 2,
        "Latitude": 31.294609,
        "Longitude": -81.344733,
        "ContactTelephone1": "888-733-5774  877-798-3752",
        "AccessComments": "24 hours daily; for guest use only",
        "RelatedURL": "http://www.teslamotors.com/supercharger",
        "DistanceUnit": 0
    },
    "Connections": [
        {
            "ID": 78481,
            "ConnectionTypeID": 30,
            "StatusTypeID": 50,
            "LevelID": 2,
            "Amps": 16,
            "Voltage": 230,
            "PowerKW": 8,
            "CurrentTypeID": 10,
            "Quantity": 1
        }
    ],
    "NumberOfPoints": 1,
    "StatusTypeID": 50,
    "DateLastStatusUpdate": "2017-01-26T19:42:00Z",
    "DataQualityLevel": 3,
    "DateCreated": "2016-03-03T11:38:00Z",
    "SubmissionStatusTypeID": 100
}