{
    "IsRecentlyVerified": false,
    "ID": 55014,
    "UUID": "F15A9488-30A1-43B1-A3AB-B5FE2E1A3018",
    "DataProviderID": 1,
    "OperatorID": 23,
    "OperatorsReference": "7959",
    "UsageTypeID": 1,
    "UsageCost": "€0.33/kWh; Andere Tarife für ältere Autos",
    "AddressInfo": {
        "ID": 55360,
        "Title": "Tesla Supercharger",
        "AddressLine1": "Am Mittelfeld 5",
        "AddressLine2": "Oberröblingen",
        "Town": "Sangerhausen",
        "Postcode": "06526",
        "CountryID": 87,
        "Latitude": 51.45059,
        "Longitude": 11.3050000000001,
        "AccessComments": "Rund um die Uhr (24/7) nutzbar. Am TOTAL Autohof.\r\n",
        "RelatedURL": "http://www.teslamotors.com/",
        "DistanceUnit": 0
    },
    "Connections": [
        {
            "ID": 69515,
            "ConnectionTypeID": 27,
            "StatusTypeID": 0,
            "LevelID": 3,
            "Voltage": 400,
            "PowerKW": 135,
            "CurrentTypeID": 30,
            "Quantity": 6
        }
    ],
    "NumberOfPoints": 6,
    "StatusTypeID": 50,
    "DateLastStatusUpdate": "2019-10-18T05:53:00Z",
    "DataQualityLevel": 1,
    "DateCreated": "2015-10-12T12:59:00Z",
    "SubmissionStatusTypeID": 200
}