{
    "IsRecentlyVerified": false,
    "ID": 141676,
    "UUID": "A20F44CE-9E25-43B2-A1E8-E67BA57E2438",
    "DataProviderID": 2,
    "DataProvidersReference": "116237",
    "OperatorID": 23,
    "UsageTypeID": 7,
    "AddressInfo": {
        "ID": 142028,
        "Title": "Summit Point Motorsports Park - Tesla Destination",
        "AddressLine1": "201 Motorsports Park Cir",
        "Town": "Summit Point",
        "StateOrProvince": "WV",
        "Postcode": "25446",
        "CountryID": 2,
        "Latitude": 39.241524,
        "Longitude": -77.9756,
        "ContactTelephone1": "304-725-8444  877-798-3752",
        "AccessComments": "24 hours daily; for customer use only\r\nPublic - Call ahead",
        "RelatedURL": "https://www.tesla.com/destination-charging",
        "DistanceUnit": 0
    },
    "Connections": [
        {
            "ID": 197660,
            "ConnectionTypeID": 30,
            "LevelID": 2,
            "Amps": 16,
            "Voltage": 230,
            "PowerKW": 3.7,
            "CurrentTypeID": 10,
            "Quantity": 8
        }
    ],
    "StatusTypeID": 50,
    "DateLastStatusUpdate": "2020-06-26T03:01:00Z",
    "DataQualityLevel": 3,
    "DateCreated": "2019-12-24T09:16:00Z",
    "SubmissionStatusTypeID": 100
}