{
    "IsRecentlyVerified": false,
    "ID": 155125,
    "UUID": "1661F0A9-D76D-44BF-8951-2525B67B1407",
    "DataProviderID": 1,
    "OperatorID": 23,
    "OperatorsReference": "53257",
    "UsageTypeID": 4,
    "UsageCost": "$0.25/kWh; other tariffs for older cars",
    "AddressInfo": {
        "ID": 155479,
        "Title": "Vancouver, Wa - Ne Vancouver Mall Drive Supercharger",
        "AddressLine1": "8700 Ne Vancouver Mall Drive",
        "Town": "Vancouver",
        "StateOrProvince": "WA",
        "Postcode": "98662",
        "CountryID": 2,
        "Latitude": 45.659583,
        "Longitude": -122.583536,
        "DistanceUnit": 0
    },
    "Connections": [
        {
            "ID": 218360,
            "ConnectionTypeID": 27,
            "StatusTypeID": 50,
            "LevelID": 3,
            "PowerKW": 120,
            "CurrentTypeID": 30,
            "Quantity": 8
        }
    ],
    "NumberOfPoints": 8,
    "GeneralComments": "Charging8 Superchargers, available 24/7, up to 250kW",
    "StatusTypeID": 50,
    "DateLastStatusUpdate": "2020-03-27T07:00:00Z",
    "DataQualityLevel": 1,
    "DateCreated": "2020-03-27T07:00:00Z",
    "SubmissionStatusTypeID": 200
}