{
    "IsRecentlyVerified": false,
    "ID": 44543,
    "UUID": "E2B6B9F9-3AF0-4CC3-BA88-6AC2CAC43816",
    "DataProviderID": 2,
    "DataProvidersReference": "66490",
    "OperatorID": 5,
    "UsageTypeID": 1,
    "AddressInfo": {
        "ID": 44889,
        "Title": "CALPOLY",
        "AddressLine1": "University Dr",
        "Town": "San Luis Obispo",
        "StateOrProvince": "CA",
        "Postcode": "93405",
        "CountryID": 2,
        "Latitude": 35.3025526,
        "Longitude": -120.6634882,
        "ContactTelephone1": "888-758-4389",
        "AccessComments": "24 hours daily",
        "RelatedURL": "http://www.chargepoint.com/",
        "DistanceUnit": 0
    },
    "Connections": [
        {
            "ID": 54721,
            "ConnectionTypeID": 1,
            "LevelID": 2,
            "Amps": 16,
            "Voltage": 230,
            "PowerKW": 3,
            "CurrentTypeID": 10,
            "Quantity": 8
        }
    ],
    "DateLastStatusUpdate": "2019-04-06T04:02:00Z",
    "DataQualityLevel": 3,
    "DateCreated": "2015-04-17T12:30:00Z",
    "SubmissionStatusTypeID": 100
}