{
    "IsRecentlyVerified": false,
    "ID": 18015,
    "UUID": "C96CCBD0-61FA-4B3B-91CF-3BE69736D019",
    "DataProviderID": 22,
    "DataProvidersReference": "5C46DFDE90D27CF400999DED4049F356",
    "AddressInfo": {
        "ID": 18360,
        "Title": "今治アーバンホテル",
        "AddressLine1": "愛媛県今治市北宝来町1丁目5-28",
        "CountryID": 114,
        "Latitude": 34.0644482,
        "Longitude": 132.9951663,
        "ContactTelephone1": "0898-22-5311",
        "DistanceUnit": 0
    },
    "Connections": [
        {
            "ID": 18256,
            "ConnectionTypeID": 2,
            "LevelID": 2,
            "Amps": 100,
            "Voltage": 480,
            "PowerKW": 48,
            "Quantity": 1
        }
    ],
    "DateLastStatusUpdate": "2013-06-29T09:06:00Z",
    "DataQualityLevel": 2,
    "DateCreated": "2013-06-29T09:06:00Z",
    "SubmissionStatusTypeID": 200
}