{
    "IsRecentlyVerified": false,
    "ID": 101492,
    "UUID": "6A130652-88D9-4E64-9240-63616CF5B185",
    "DataProviderID": 1,
    "OperatorID": 23,
    "OperatorsReference": "41766",
    "UsageTypeID": 4,
    "AddressInfo": {
        "ID": 101838,
        "Title": "Chukchansi Crossing Fuel Station",
        "AddressLine1": "711 Lucky LN",
        "Town": "Coarsegold",
        "StateOrProvince": "California",
        "Postcode": "93614",
        "CountryID": 2,
        "Latitude": 37.214164,
        "Longitude": -119.708038,
        "ContactTelephone1": "(866) 794-6946",
        "DistanceUnit": 0
    },
    "Connections": [
        {
            "ID": 143301,
            "ConnectionTypeID": 30,
            "StatusTypeID": 50,
            "LevelID": 2,
            "PowerKW": 16,
            "CurrentTypeID": 20,
            "Quantity": 2
        }
    ],
    "NumberOfPoints": 2,
    "GeneralComments": "2 Tesla Connectors, up to 16kW.Available to the public. Self park.",
    "StatusTypeID": 50,
    "DateLastStatusUpdate": "2018-03-30T05:43:00Z",
    "DataQualityLevel": 1,
    "DateCreated": "2018-03-30T05:43:00Z",
    "SubmissionStatusTypeID": 200
}