{
    "IsRecentlyVerified": false,
    "ID": 159821,
    "UUID": "2E18CFDF-EDC1-4F8E-94FD-04B49CE08A74",
    "DataProviderID": 2,
    "DataProvidersReference": "155288",
    "OperatorID": 5,
    "UsageTypeID": 1,
    "AddressInfo": {
        "ID": 160178,
        "Title": "VASSAR COLLEGE",
        "AddressLine1": "Unnamed Road",
        "Town": "Arlington",
        "StateOrProvince": "NY",
        "Postcode": "12603",
        "CountryID": 2,
        "Latitude": 41.681771,
        "Longitude": -73.8946681,
        "ContactTelephone1": "888-758-4389",
        "AccessComments": "24 hours daily",
        "RelatedURL": "http://www.chargepoint.com/",
        "DistanceUnit": 0
    },
    "Connections": [
        {
            "ID": 230040,
            "ConnectionTypeID": 1,
            "LevelID": 2,
            "Amps": 16,
            "Voltage": 230,
            "PowerKW": 3.7,
            "CurrentTypeID": 10,
            "Quantity": 2
        }
    ],
    "StatusTypeID": 50,
    "DateLastStatusUpdate": "2020-06-26T03:04:00Z",
    "DataQualityLevel": 3,
    "DateCreated": "2020-06-26T03:04:00Z",
    "SubmissionStatusTypeID": 100
}