{
    "IsRecentlyVerified": false,
    "ID": 72310,
    "UUID": "D1D3EBAE-024E-4E12-9AE9-54C231813071",
    "DataProviderID": 2,
    "DataProvidersReference": "78806",
    "OperatorID": 5,
    "UsageTypeID": 1,
    "AddressInfo": {
        "ID": 72656,
        "Title": "BOSTON COLLEGE",
        "AddressLine1": "2004 Campanella Way",
        "Town": "Boston",
        "StateOrProvince": "MA",
        "Postcode": "02467",
        "CountryID": 2,
        "Latitude": 42.3370873,
        "Longitude": -71.1686638,
        "ContactTelephone1": "888-758-4389",
        "AccessComments": "24 hours daily",
        "RelatedURL": "http://www.chargepoint.com/",
        "DistanceUnit": 0
    },
    "Connections": [
        {
            "ID": 103617,
            "ConnectionTypeID": 1,
            "LevelID": 2,
            "Amps": 16,
            "Voltage": 230,
            "PowerKW": 3,
            "CurrentTypeID": 10,
            "Quantity": 2
        }
    ],
    "DateLastStatusUpdate": "2019-12-24T09:20:00Z",
    "DataQualityLevel": 3,
    "DateCreated": "2016-10-09T02:45:00Z",
    "SubmissionStatusTypeID": 100
}