{
    "IsRecentlyVerified": false,
    "ID": 79371,
    "UUID": "EDFE74B9-75D4-4363-99C5-26174E6B52F8",
    "DataProviderID": 1,
    "OperatorID": 23,
    "OperatorsReference": "11910",
    "UsageTypeID": 6,
    "UsageCost": "Free",
    "AddressInfo": {
        "ID": 79717,
        "Title": "Microtel Inn & Suites - Fort St. John",
        "AddressLine1": "8407 93RD St",
        "Town": "Fort St John",
        "StateOrProvince": "BC",
        "Postcode": "V1J 6S2",
        "CountryID": 44,
        "Latitude": 56.2317448,
        "Longitude": -120.834124,
        "ContactTelephone1": "(250) 794-3100",
        "DistanceUnit": 0
    },
    "Connections": [
        {
            "ID": 114003,
            "ConnectionTypeID": 30,
            "StatusTypeID": 50,
            "LevelID": 2,
            "PowerKW": 8,
            "CurrentTypeID": 10,
            "Quantity": 1
        }
    ],
    "NumberOfPoints": 1,
    "GeneralComments": "1 Tesla Connector, up to 8kW.Available for patrons only. Please see front desk.",
    "StatusTypeID": 50,
    "DateLastStatusUpdate": "2017-06-09T14:51:00Z",
    "DataQualityLevel": 1,
    "DateCreated": "2017-01-28T13:43:00Z",
    "SubmissionStatusTypeID": 200
}