{
    "IsRecentlyVerified": false,
    "ID": 155227,
    "UUID": "5CD114EF-034E-4F05-A5C1-994CE9DEF977",
    "DataProviderID": 1,
    "OperatorID": 3315,
    "OperatorsReference": "52229",
    "UsageTypeID": 4,
    "UsageCost": "Free",
    "AddressInfo": {
        "ID": 155581,
        "Title": "Barr's Brae Kilmacolm 50 KW",
        "AddressLine1": "Barr's Brae",
        "Town": "Kilmacolm",
        "Postcode": "PA13 4DE",
        "CountryID": 1,
        "Latitude": 55.89462,
        "Longitude": -4.62609,
        "DistanceUnit": 0
    },
    "Connections": [
        {
            "ID": 218511,
            "ConnectionTypeID": 33,
            "StatusTypeID": 50,
            "LevelID": 3,
            "PowerKW": 50,
            "CurrentTypeID": 30,
            "Quantity": 1
        },
        {
            "ID": 218512,
            "ConnectionTypeID": 2,
            "StatusTypeID": 50,
            "LevelID": 3,
            "PowerKW": 50,
            "CurrentTypeID": 30,
            "Quantity": 1
        },
        {
            "ID": 218513,
            "ConnectionTypeID": 1036,
            "StatusTypeID": 50,
            "LevelID": 3,
            "PowerKW": 43,
            "CurrentTypeID": 20,
            "Quantity": 1
        }
    ],
    "NumberOfPoints": 1,
    "StatusTypeID": 50,
    "DateLastStatusUpdate": "2020-04-02T05:15:00Z",
    "DataQualityLevel": 1,
    "DateCreated": "2020-04-02T05:15:00Z",
    "SubmissionStatusTypeID": 200
}