{
    "IsRecentlyVerified": false,
    "ID": 185288,
    "UUID": "E4C39A88-C7AB-4E5F-8439-B3A6C2C77AB8",
    "DataProviderID": 29,
    "DataProvidersReference": "8851",
    "AddressInfo": {
        "ID": 185647,
        "Title": "Treppendorfer Str. 2",
        "AddressLine1": "Treppendorfer Str. 2",
        "Town": "Hollfeld",
        "Postcode": "96142",
        "CountryID": 87,
        "Latitude": 49.928984,
        "Longitude": 11.298139,
        "DistanceUnit": 0
    },
    "Connections": [
        {
            "ID": 294584,
            "ConnectionTypeID": 25,
            "StatusTypeID": 50,
            "LevelID": 2,
            "PowerKW": 22,
            "CurrentTypeID": 20
        },
        {
            "ID": 294585,
            "ConnectionTypeID": 25,
            "StatusTypeID": 50,
            "LevelID": 2,
            "PowerKW": 22,
            "CurrentTypeID": 20
        }
    ],
    "StatusTypeID": 50,
    "DateLastStatusUpdate": "2021-07-12T02:44:00Z",
    "MetadataValues": [
        {
            "ID": 17579,
            "MetadataFieldID": 4,
            "ItemValue": "Data from the German chargepoint registry provided by Bundesnetzagentur.de under the CC-BY 4.0 license"
        }
    ],
    "DataQualityLevel": 3,
    "DateCreated": "2021-07-08T10:06:00Z",
    "SubmissionStatusTypeID": 100
}