{
    "IsRecentlyVerified": false,
    "ID": 173907,
    "UUID": "7108F75F-963F-43AB-94B7-41EEFE72895A",
    "DataProviderID": 1,
    "OperatorID": 44,
    "UsageTypeID": 4,
    "UsageCost": "2.00USD/HR",
    "AddressInfo": {
        "ID": 174266,
        "Title": "Nelson's Shade",
        "AddressLine1": "Dr. Alhaji Kooko Street",
        "AddressLine2": "Meduma Newsite",
        "Town": "Kumasi",
        "StateOrProvince": "Ashanti",
        "CountryID": 88,
        "Latitude": 6.765763371287306,
        "Longitude": -1.603054900565212,
        "ContactTelephone1": "+233244424491",
        "DistanceUnit": 0
    },
    "Connections": [
        {
            "ID": 267538,
            "ConnectionTypeID": 28,
            "StatusTypeID": 50,
            "LevelID": 1,
            "Voltage": 220,
            "PowerKW": 2,
            "CurrentTypeID": 10,
            "Quantity": 5
        }
    ],
    "NumberOfPoints": 5,
    "StatusTypeID": 50,
    "DateLastStatusUpdate": "2021-03-28T12:21:00Z",
    "DataQualityLevel": 1,
    "DateCreated": "2021-03-06T00:08:00Z",
    "SubmissionStatusTypeID": 200
}