{
    "IsRecentlyVerified": false,
    "ID": 28370,
    "UUID": "24594396-3E6D-443F-BB47-D771AFCB9AA5",
    "DataProviderID": 2,
    "DataProvidersReference": "52620",
    "UsageTypeID": 1,
    "AddressInfo": {
        "ID": 28716,
        "Title": "Odell Brewing",
        "AddressLine1": "800 E Lincoln",
        "Town": "Fort Collins",
        "StateOrProvince": "CO",
        "Postcode": "80524",
        "CountryID": 2,
        "Latitude": 40.589483,
        "Longitude": -105.063519,
        "ContactTelephone1": "970-498-9070",
        "AccessComments": "24 hours daily",
        "RelatedURL": "",
        "DistanceUnit": 0
    },
    "Connections": [
        {
            "ID": 31168,
            "ConnectionTypeID": 1,
            "LevelID": 2,
            "Amps": 16,
            "Voltage": 230,
            "PowerKW": 3.7,
            "CurrentTypeID": 10,
            "Quantity": 1
        }
    ],
    "DateLastStatusUpdate": "2020-06-26T03:03:00Z",
    "DataQualityLevel": 3,
    "DateCreated": "2014-11-28T03:38:00Z",
    "SubmissionStatusTypeID": 100
}