{
    "IsRecentlyVerified": false,
    "ID": 107246,
    "UUID": "BA305250-A7D1-455D-B62D-7C1E806BC2F9",
    "DataProviderID": 1,
    "UsageTypeID": 1,
    "UsageCost": "free",
    "AddressInfo": {
        "ID": 107592,
        "Title": "Audi - Campo Carlo Magno",
        "AddressLine1": "Passo Campo Carlo Magno",
        "Town": "Pinzolo",
        "StateOrProvince": "TN",
        "Postcode": "38121 ",
        "CountryID": 112,
        "Latitude": 46.242817057421576,
        "Longitude": 10.839974790337237,
        "DistanceUnit": 0
    },
    "Connections": [
        {
            "ID": 151259,
            "ConnectionTypeID": 25,
            "StatusTypeID": 0,
            "LevelID": 2,
            "Quantity": 2
        },
        {
            "ID": 153176,
            "ConnectionTypeID": 16,
            "StatusTypeID": 0,
            "LevelID": 2,
            "Amps": 16,
            "Voltage": 240,
            "PowerKW": 3.7,
            "CurrentTypeID": 10,
            "Quantity": 1
        },
        {
            "ID": 153177,
            "ConnectionTypeID": 17,
            "StatusTypeID": 0,
            "LevelID": 2,
            "Amps": 16,
            "Voltage": 400,
            "PowerKW": 11,
            "CurrentTypeID": 20,
            "Quantity": 1
        }
    ],
    "NumberOfPoints": 2,
    "StatusTypeID": 0,
    "DateLastStatusUpdate": "2019-11-06T16:49:00Z",
    "DataQualityLevel": 1,
    "DateCreated": "2018-07-23T13:16:00Z",
    "SubmissionStatusTypeID": 200
}