{
    "IsRecentlyVerified": false,
    "ID": 186382,
    "UUID": "7E5CC200-5149-4A54-A413-BAF205DDACA0",
    "DataProviderID": 29,
    "DataProvidersReference": "13470",
    "AddressInfo": {
        "ID": 186741,
        "Title": "Lutherstraße 12",
        "AddressLine1": "Lutherstraße 12",
        "Town": "Lüdenscheid",
        "Postcode": "58507",
        "CountryID": 87,
        "Latitude": 51.2219,
        "Longitude": 7.626942,
        "DistanceUnit": 0
    },
    "Connections": [
        {
            "ID": 298941,
            "ConnectionTypeID": 33,
            "StatusTypeID": 50,
            "LevelID": 3,
            "PowerKW": 22,
            "CurrentTypeID": 30
        },
        {
            "ID": 298942,
            "ConnectionTypeID": 25,
            "StatusTypeID": 50,
            "LevelID": 2,
            "PowerKW": 11,
            "CurrentTypeID": 20
        }
    ],
    "StatusTypeID": 50,
    "DateLastStatusUpdate": "2021-07-12T02:46:00Z",
    "MetadataValues": [
        {
            "ID": 18623,
            "MetadataFieldID": 4,
            "ItemValue": "Data from the German chargepoint registry provided by Bundesnetzagentur.de under the CC-BY 4.0 license"
        }
    ],
    "DataQualityLevel": 3,
    "DateCreated": "2021-07-12T02:46:00Z",
    "SubmissionStatusTypeID": 100
}