{
    "IsRecentlyVerified": false,
    "ID": 94635,
    "UUID": "B7AD7B89-F347-4F39-B792-9BE266645A66",
    "DataProviderID": 1,
    "OperatorID": 23,
    "OperatorsReference": "36852",
    "UsageTypeID": 4,
    "AddressInfo": {
        "ID": 94981,
        "Title": "Aci Marina Slano",
        "AddressLine1": "Slanica 2",
        "Town": "Slano",
        "Postcode": "20232",
        "CountryID": 60,
        "Latitude": 42.7839,
        "Longitude": 17.889723,
        "ContactTelephone1": "+385 20 441 721",
        "DistanceUnit": 0
    },
    "Connections": [
        {
            "ID": 133788,
            "ConnectionTypeID": 30,
            "StatusTypeID": 50,
            "LevelID": 2,
            "Amps": 32,
            "Voltage": 400,
            "PowerKW": 22,
            "CurrentTypeID": 20,
            "Quantity": 2
        }
    ],
    "NumberOfPoints": 2,
    "GeneralComments": "2 Tesla Connectors, up to 22kW.Available for customers. Self park.",
    "StatusTypeID": 50,
    "DateLastStatusUpdate": "2018-10-03T23:05:00Z",
    "DataQualityLevel": 1,
    "DateCreated": "2017-10-22T05:40:00Z",
    "SubmissionStatusTypeID": 200
}