{
    "IsRecentlyVerified": false,
    "ID": 37267,
    "UUID": "B1785C66-755F-41A4-BF61-EC687818FA9E",
    "DataProviderID": 26,
    "DataProvidersReference": "58392",
    "OperatorID": 78,
    "OperatorsReference": "Essent EM-NL-00000363-05-00047",
    "UsageCost": "0.00 jaarabonnement",
    "AddressInfo": {
        "ID": 37613,
        "Title": "Tweede Amstelvlietpad 1",
        "AddressLine1": "Tweede Amstelvlietpad 1",
        "Town": "Amsterdam",
        "Postcode": "1096 GE",
        "CountryID": 159,
        "Latitude": 52.339144,
        "Longitude": 4.917703,
        "RelatedURL": "http://www.essent.nl",
        "DistanceUnit": 0
    },
    "Connections": [
        {
            "ID": 40778,
            "ConnectionTypeID": 25,
            "LevelID": 2,
            "PowerKW": 11,
            "CurrentTypeID": 10
        },
        {
            "ID": 48796,
            "ConnectionTypeID": 25,
            "LevelID": 2,
            "PowerKW": 11,
            "CurrentTypeID": 10
        }
    ],
    "NumberOfPoints": 1,
    "StatusTypeID": 50,
    "DateLastStatusUpdate": "2016-06-04T02:53:00Z",
    "DataQualityLevel": 3,
    "DateCreated": "2015-01-09T06:07:00Z",
    "SubmissionStatusTypeID": 100
}