{
    "IsRecentlyVerified": false,
    "ID": 11891,
    "UUID": "22E1A6E1-C9AE-4D8D-BE47-FCB3DAE8047E",
    "DataProviderID": 1,
    "OperatorID": 36,
    "UsageTypeID": 4,
    "UsageCost": "Free",
    "AddressInfo": {
        "ID": 11788,
        "Title": "Parking bij het Nerocafé",
        "AddressLine1": "Albert Biesmanslaan 2",
        "AddressLine2": "",
        "Town": "Hoeilaart",
        "StateOrProvince": "",
        "Postcode": "1560",
        "CountryID": 26,
        "Latitude": 50.7676206,
        "Longitude": 4.474426200000039,
        "ContactTelephone1": "",
        "ContactTelephone2": "",
        "ContactEmail": "",
        "AccessComments": "",
        "RelatedURL": "",
        "DistanceUnit": 0
    },
    "Connections": [
        {
            "ID": 9315,
            "ConnectionTypeID": 13,
            "StatusTypeID": 0,
            "LevelID": 1,
            "Amps": 10,
            "Voltage": 220,
            "PowerKW": 2.2,
            "Quantity": 1
        },
        {
            "ID": 9316,
            "ConnectionTypeID": 25,
            "StatusTypeID": 0,
            "LevelID": 2,
            "Amps": 16,
            "Voltage": 220,
            "PowerKW": 3.5,
            "Quantity": 1
        }
    ],
    "NumberOfPoints": 1,
    "GeneralComments": "Om het elektrisch vervoer te stimuleren, kunnen de inwoners van Hoeilaart gratis stroom opladen, wanneer zij over een Blue Cornerkaart beschikken om de oplaadpalen te activeren. De Blue Corner-kaarten (www.bluecorner.be) zijn vanaf 15 september 2012 ook te verkrijgen bij de gemeente Hoeilaart: op het gemeentehuis (Onthaal), in het Sociaal Huis, in de sporthal en bij de dienst Cultuur en Toerisme. Voor inwoners van Hoeilaart zijn de kaarten gratis. Elke Hoeilander heeft recht op één kaart, op vertoning van zijn/haar identiteitskaart en van een bewijs dat hij/zij een elektrisch voertuig bezit (bijvoorbeeld aankoopfactuur, gegraveerde fiets, …). Deze kaart is een combikaart, waarmee zowel de fietsoplaadpalen als de wagenoplaadpalen geactiveerd kunnen worden. Ze is geldig voor één jaar, te rekenen vanaf het eerste gebruik. ",
    "StatusTypeID": 50,
    "DateLastStatusUpdate": "2012-08-30T18:11:00Z",
    "DataQualityLevel": 1,
    "DateCreated": "2012-08-30T18:09:00Z",
    "SubmissionStatusTypeID": 200
}