{
    "IsRecentlyVerified": false,
    "ID": 122429,
    "UUID": "20BD6261-BAA8-4B3E-BCF4-72F1ECE10D92",
    "DataProviderID": 2,
    "DataProvidersReference": "73662",
    "OperatorID": 5,
    "UsageTypeID": 1,
    "AddressInfo": {
        "ID": 122775,
        "Title": "EAST PARKING",
        "AddressLine1": "734 Fairmount Ave S",
        "Town": "Pasadena",
        "StateOrProvince": "CA",
        "Postcode": "91105",
        "CountryID": 2,
        "Latitude": 34.133425,
        "Longitude": -118.151594,
        "ContactTelephone1": "888-758-4389",
        "AccessComments": "24 hours daily",
        "RelatedURL": "http://www.chargepoint.com/",
        "DistanceUnit": 0
    },
    "Connections": [
        {
            "ID": 172321,
            "ConnectionTypeID": 1,
            "LevelID": 2,
            "Amps": 16,
            "Voltage": 230,
            "PowerKW": 3,
            "CurrentTypeID": 10,
            "Quantity": 10
        }
    ],
    "DateLastStatusUpdate": "2019-12-24T09:11:00Z",
    "DataQualityLevel": 3,
    "DateCreated": "2019-04-06T05:03:00Z",
    "SubmissionStatusTypeID": 100
}