{
    "IsRecentlyVerified": false,
    "ID": 62410,
    "UUID": "F0D9D7A6-5E47-45BA-B45D-1BF06A0D742C",
    "DataProviderID": 2,
    "DataProvidersReference": "71496",
    "UsageTypeID": 1,
    "AddressInfo": {
        "ID": 62756,
        "Title": "Institute for Sustainable Communities",
        "AddressLine1": "535 Stonecutters Way",
        "Town": "Montpelier",
        "StateOrProvince": "VT",
        "Postcode": "05602",
        "CountryID": 2,
        "Latitude": 44.255416,
        "Longitude": -72.573951,
        "ContactTelephone1": "802-229-2900",
        "AccessComments": "24 hours daily",
        "RelatedURL": "",
        "DistanceUnit": 0
    },
    "Connections": [
        {
            "ID": 79315,
            "ConnectionTypeID": 1,
            "LevelID": 2,
            "Amps": 16,
            "Voltage": 230,
            "PowerKW": 3.7,
            "CurrentTypeID": 10,
            "Quantity": 2
        }
    ],
    "DateLastStatusUpdate": "2020-06-26T03:07:00Z",
    "DataQualityLevel": 3,
    "DateCreated": "2016-03-03T11:39:00Z",
    "SubmissionStatusTypeID": 100
}