{
    "IsRecentlyVerified": false,
    "ID": 156095,
    "UUID": "77756F29-02D3-4965-988A-F59DE5A85C32",
    "DataProviderID": 1,
    "OperatorID": 80,
    "UsageTypeID": 4,
    "UsageCost": "0.45€/KWh",
    "AddressInfo": {
        "ID": 156449,
        "Title": "Sirio - Concessionaria Mercedes-Benz | EnelX",
        "AddressLine1": "Via Italia",
        "AddressLine2": "Mosciano Stazione",
        "Town": "Mosciano Sant'Angelo",
        "StateOrProvince": "TE",
        "Postcode": "64023",
        "CountryID": 112,
        "Latitude": 42.71303814497091,
        "Longitude": 13.907211781436786,
        "RelatedURL": "https://www.enelx.com/it/it/emobility",
        "DistanceUnit": 0
    },
    "Connections": [
        {
            "ID": 219704,
            "ConnectionTypeID": 25,
            "StatusTypeID": 50,
            "LevelID": 2,
            "Amps": 32,
            "Voltage": 400,
            "PowerKW": 22,
            "CurrentTypeID": 20,
            "Quantity": 2
        }
    ],
    "NumberOfPoints": 2,
    "GeneralComments": "Lun-Ven 9-13/15-19 Sab 9.30-13/15.30-19",
    "StatusTypeID": 50,
    "DateLastStatusUpdate": "2020-05-06T15:45:00Z",
    "DataQualityLevel": 1,
    "DateCreated": "2020-05-06T15:45:00Z",
    "SubmissionStatusTypeID": 200
}