{
    "IsRecentlyVerified": false,
    "ID": 137907,
    "UUID": "65688ED7-5060-457F-91D1-904B17F7EEC7",
    "DataProviderID": 2,
    "DataProvidersReference": "148844",
    "OperatorID": 39,
    "UsageTypeID": 1,
    "AddressInfo": {
        "ID": 138256,
        "Title": "Walgreens - Poway, CA #12421",
        "AddressLine1": "13390 Poway Rd",
        "Town": "Poway",
        "StateOrProvince": "CA",
        "Postcode": "92064",
        "CountryID": 2,
        "Latitude": 32.9566887,
        "Longitude": -117.0411735,
        "ContactTelephone1": "800-663-5633",
        "AccessComments": "MO: Not Specified; TU: Not Specified; WE: Not Specified; TH: Not Specified; FR: Not Specified; SA: Not Specified; SU: Not Specified",
        "RelatedURL": "http://www.semacharge.com/",
        "DistanceUnit": 0
    },
    "Connections": [
        {
            "ID": 192929,
            "ConnectionTypeID": 1,
            "LevelID": 2,
            "Amps": 16,
            "Voltage": 230,
            "PowerKW": 3,
            "CurrentTypeID": 10,
            "Quantity": 1
        }
    ],
    "StatusTypeID": 50,
    "DateLastStatusUpdate": "2019-12-24T09:06:00Z",
    "DataQualityLevel": 3,
    "DateCreated": "2019-12-24T09:06:00Z",
    "SubmissionStatusTypeID": 100
}