{
    "IsRecentlyVerified": false,
    "ID": 169418,
    "UUID": "E470CDA4-DF56-4961-98D7-2DCE1F0D6545",
    "DataProviderID": 1,
    "OperatorID": 80,
    "UsageTypeID": 4,
    "AddressInfo": {
        "ID": 169777,
        "Title": "Bologna Irma Bandiera | HERA ",
        "AddressLine1": "Via Irma Bandiera",
        "Town": "Bologna",
        "StateOrProvince": "BO",
        "Postcode": "40134",
        "CountryID": 112,
        "Latitude": 44.49097052320843,
        "Longitude": 11.311904069285902,
        "RelatedURL": "https://heraricarica.gruppohera.it/?_ga=2.118974985.1246949081.1602871543-1358619397.1602871543",
        "DistanceUnit": 0
    },
    "Connections": [
        {
            "ID": 257773,
            "ConnectionTypeID": 25,
            "Reference": "IRMABANDIERA - 19XP22T3KK4AZ00803",
            "StatusTypeID": 50,
            "LevelID": 2,
            "Amps": 32,
            "Voltage": 400,
            "PowerKW": 22,
            "CurrentTypeID": 20,
            "Quantity": 2,
            "Comments": "Operator: Hera"
        }
    ],
    "NumberOfPoints": 2,
    "StatusTypeID": 50,
    "DateLastStatusUpdate": "2020-10-22T08:32:00Z",
    "DataQualityLevel": 1,
    "DateCreated": "2020-10-16T19:06:00Z",
    "SubmissionStatusTypeID": 200
}