{
    "IsRecentlyVerified": false,
    "ID": 51417,
    "UUID": "9EB084CE-CFD6-4E2E-8D5F-26768129A54D",
    "DataProviderID": 1,
    "OperatorID": 167,
    "UsageTypeID": 7,
    "AddressInfo": {
        "ID": 51763,
        "Title": "Autocenter Dresden",
        "AddressLine1": "Bremer Straße 18b",
        "Town": "Dresden",
        "StateOrProvince": "Sachsen",
        "Postcode": "01067",
        "CountryID": 87,
        "Latitude": 51.0617545569948,
        "Longitude": 13.7061267270142,
        "ContactTelephone1": "0351 / 49 18 60",
        "AccessComments": "Kostenloses Laden beim Nissan Autohaus während der Öffnungszeiten Mo-Fr 8:00-19,Sa 9-13Uhr.",
        "RelatedURL": "http://www.autocenter-dresden.de",
        "DistanceUnit": 0
    },
    "Connections": [
        {
            "ID": 63675,
            "ConnectionTypeID": 25,
            "StatusTypeID": 50,
            "LevelID": 2,
            "Amps": 16,
            "Voltage": 230,
            "PowerKW": 3.7,
            "CurrentTypeID": 10,
            "Quantity": 1
        }
    ],
    "NumberOfPoints": 2,
    "StatusTypeID": 50,
    "DateLastStatusUpdate": "2015-07-26T10:35:00Z",
    "DataQualityLevel": 1,
    "DateCreated": "2015-07-26T09:35:00Z",
    "SubmissionStatusTypeID": 200
}