{
    "MediaItems": [
        {
            "ID": 3562,
            "ChargePointID": 44214,
            "ItemURL": "https://s3-ap-southeast-2.amazonaws.com/openchargemap/images/GB/OCM44214/OCM-44214.orig.2015120512303663.jpg",
            "ItemThumbnailURL": "https://s3-ap-southeast-2.amazonaws.com/openchargemap/images/GB/OCM44214/OCM-44214.thmb.2015120512303663.jpg",
            "Comment": "",
            "IsEnabled": true,
            "IsVideo": false,
            "IsFeaturedItem": false,
            "IsExternalResource": false,
            "User": {
                "ID": 6639,
                "Username": "Guillaume Ouellette"
            },
            "DateCreated": "2015-12-05T12:31:00Z"
        },
        {
            "ID": 3561,
            "ChargePointID": 44214,
            "ItemURL": "https://s3-ap-southeast-2.amazonaws.com/openchargemap/images/GB/OCM44214/OCM-44214.orig.2015120512262166.jpg",
            "ItemThumbnailURL": "https://s3-ap-southeast-2.amazonaws.com/openchargemap/images/GB/OCM44214/OCM-44214.thmb.2015120512262166.jpg",
            "Comment": "",
            "IsEnabled": true,
            "IsVideo": false,
            "IsFeaturedItem": false,
            "IsExternalResource": false,
            "User": {
                "ID": 6639,
                "Username": "Guillaume Ouellette"
            },
            "DateCreated": "2015-12-05T12:27:00Z"
        }
    ],
    "IsRecentlyVerified": false,
    "ID": 44214,
    "UUID": "9E52CFFA-C79D-4129-AE5C-FD2D28D4B80C",
    "DataProviderID": 1,
    "OperatorID": 45,
    "OperatorsReference": "1535,1518,21017",
    "UsageTypeID": 4,
    "UsageCost": "£1.20 + £1.00/hour connected; other tariffs available,£1.20 + £12.00/hour connected; other tariffs available",
    "AddressInfo": {
        "ID": 44560,
        "Title": "Oxford Belfry",
        "AddressLine1": "Milton Common",
        "Town": "Thame",
        "StateOrProvince": "Oxfordshire",
        "Postcode": "OX9 2JW",
        "CountryID": 1,
        "Latitude": 51.7271610675532,
        "Longitude": -1.0592794418335,
        "DistanceUnit": 0
    },
    "Connections": [
        {
            "ID": 54091,
            "ConnectionTypeID": 2,
            "StatusTypeID": 100,
            "LevelID": 3,
            "Amps": 125,
            "Voltage": 400,
            "PowerKW": 50,
            "CurrentTypeID": 30,
            "Quantity": 1
        },
        {
            "ID": 54092,
            "ConnectionTypeID": 1036,
            "StatusTypeID": 100,
            "LevelID": 3,
            "Amps": 63,
            "Voltage": 400,
            "PowerKW": 43,
            "CurrentTypeID": 20,
            "Quantity": 1
        },
        {
            "ID": 54093,
            "ConnectionTypeID": 33,
            "StatusTypeID": 100,
            "LevelID": 3,
            "PowerKW": 50,
            "CurrentTypeID": 30,
            "Quantity": 1
        },
        {
            "ID": 69632,
            "ConnectionTypeID": 25,
            "StatusTypeID": 50,
            "LevelID": 2,
            "Amps": 32,
            "Voltage": 230,
            "PowerKW": 7,
            "CurrentTypeID": 10,
            "Quantity": 2
        },
        {
            "ID": 69633,
            "ConnectionTypeID": 3,
            "StatusTypeID": 50,
            "LevelID": 2,
            "Amps": 13,
            "Voltage": 230,
            "PowerKW": 3,
            "CurrentTypeID": 10,
            "Quantity": 2
        }
    ],
    "NumberOfPoints": 3,
    "GeneralComments": "DBT triple-headed charger. Maximum one connection in use at a time. Limited power supply, max 20kW from DC chargers.",
    "StatusTypeID": 50,
    "DateLastStatusUpdate": "2019-08-22T15:13:00Z",
    "DataQualityLevel": 1,
    "DateCreated": "2015-04-13T14:21:00Z",
    "SubmissionStatusTypeID": 200
}