{
    "IsRecentlyVerified": false,
    "ID": 100502,
    "UUID": "578EBDF7-E698-41DB-BBED-32D5C7CE7183",
    "DataProviderID": 1,
    "OperatorID": 45,
    "UsageTypeID": 1,
    "AddressInfo": {
        "ID": 100848,
        "Title": "COR Haus",
        "AddressLine1": "Hauptstraße 74",
        "Town": "Rheda-Wiedenbrück",
        "StateOrProvince": "Kreis Gütersloh",
        "Postcode": "33378",
        "CountryID": 87,
        "Latitude": 51.8384099313765,
        "Longitude": 8.301491286508167,
        "AccessComments": "Kostenlos duchgehend nutzbare Ladesäule, einfach einstecken ",
        "RelatedURL": "http://www2.ostfalia.de/cms/de/cemo/",
        "DistanceUnit": 0
    },
    "Connections": [
        {
            "ID": 141955,
            "ConnectionTypeID": 25,
            "StatusTypeID": 50,
            "LevelID": 2,
            "Amps": 32,
            "Voltage": 400,
            "PowerKW": 22,
            "CurrentTypeID": 20,
            "Quantity": 2
        }
    ],
    "NumberOfPoints": 2,
    "StatusTypeID": 50,
    "DateLastStatusUpdate": "2018-02-27T12:39:00Z",
    "DataQualityLevel": 1,
    "DateCreated": "2018-02-27T12:39:00Z",
    "SubmissionStatusTypeID": 200
}