{
    "IsRecentlyVerified": false,
    "ID": 173880,
    "UUID": "E77CD45E-9689-4F41-B266-55E13C8D53DE",
    "DataProviderID": 1,
    "OperatorID": 3,
    "OperatorsReference": "PG-70320,PG-86170",
    "UsageTypeID": 4,
    "UsageCost": "Free",
    "AddressInfo": {
        "ID": 174239,
        "Title": "Tesco Superstore-Tiverton",
        "AddressLine1": "Blundells Way",
        "Town": "Tiverton",
        "Postcode": "EX16 4DB",
        "CountryID": 1,
        "Latitude": 50.904292,
        "Longitude": -3.48126,
        "DistanceUnit": 0
    },
    "Connections": [
        {
            "ID": 267484,
            "ConnectionTypeID": 25,
            "StatusTypeID": 50,
            "LevelID": 2,
            "Amps": 32,
            "Voltage": 230,
            "PowerKW": 7,
            "CurrentTypeID": 10,
            "Quantity": 4
        }
    ],
    "NumberOfPoints": 4,
    "GeneralComments": "This is an open charge unit installed at the Tesco super store at Blundells Way, Tiverton",
    "StatusTypeID": 50,
    "DateLastStatusUpdate": "2021-03-06T06:20:00Z",
    "DataQualityLevel": 1,
    "DateCreated": "2021-03-05T06:21:00Z",
    "SubmissionStatusTypeID": 200
}