{
    "IsRecentlyVerified": false,
    "ID": 177868,
    "UUID": "2EFC1EA0-03BA-472F-8372-E8C7D46629AF",
    "DataProviderID": 29,
    "DataProvidersReference": "2900",
    "OperatorID": 45,
    "AddressInfo": {
        "ID": 178227,
        "Title": "Industriestraße 39-41",
        "AddressLine1": "Industriestraße 39-41",
        "Town": "Siegburg",
        "Postcode": "53721",
        "CountryID": 87,
        "Latitude": 50.799617,
        "Longitude": 7.195785,
        "DistanceUnit": 0
    },
    "Connections": [
        {
            "ID": 277556,
            "ConnectionTypeID": 25,
            "StatusTypeID": 50,
            "LevelID": 2,
            "PowerKW": 22,
            "CurrentTypeID": 20
        },
        {
            "ID": 277557,
            "ConnectionTypeID": 25,
            "StatusTypeID": 50,
            "LevelID": 2,
            "PowerKW": 22,
            "CurrentTypeID": 20
        }
    ],
    "StatusTypeID": 0,
    "DateLastStatusUpdate": "2021-07-12T02:45:00Z",
    "MetadataValues": [
        {
            "ID": 10162,
            "MetadataFieldID": 4,
            "ItemValue": "Data from the German chargepoint registry provided by Bundesnetzagentur.de under the CC-BY 4.0 license"
        }
    ],
    "DataQualityLevel": 3,
    "DateCreated": "2021-07-08T09:49:00Z",
    "SubmissionStatusTypeID": 100
}