{
    "IsRecentlyVerified": false,
    "ID": 93302,
    "UUID": "CED7635E-3422-4AC4-8587-79FE4495B25C",
    "DataProviderID": 1,
    "OperatorID": 3296,
    "UsageTypeID": 5,
    "UsageCost": "£0.35/kWh",
    "AddressInfo": {
        "ID": 93648,
        "Title": "Exe Valley Leisure Centre",
        "AddressLine1": "Bolham Road",
        "AddressLine2": "Tiverton",
        "Town": "Mid Devon",
        "StateOrProvince": "Devon",
        "Postcode": "EX16 6SG",
        "CountryID": 1,
        "Latitude": 50.909806,
        "Longitude": -3.488931,
        "DistanceUnit": 0
    },
    "Connections": [
        {
            "ID": 132158,
            "ConnectionTypeID": 2,
            "StatusTypeID": 50,
            "LevelID": 3,
            "PowerKW": 50,
            "CurrentTypeID": 30,
            "Quantity": 1
        },
        {
            "ID": 132159,
            "ConnectionTypeID": 33,
            "StatusTypeID": 50,
            "LevelID": 3,
            "PowerKW": 50,
            "CurrentTypeID": 30,
            "Quantity": 1
        }
    ],
    "NumberOfPoints": 1,
    "StatusTypeID": 50,
    "DateLastStatusUpdate": "2017-09-25T21:43:00Z",
    "DataQualityLevel": 1,
    "DateCreated": "2017-09-25T21:26:00Z",
    "SubmissionStatusTypeID": 200
}