{
    "IsRecentlyVerified": false,
    "ID": 186689,
    "UUID": "EA04DE93-2861-4B52-A1B3-0FF69F6C1A85",
    "DataProviderID": 29,
    "DataProvidersReference": "17547",
    "AddressInfo": {
        "ID": 187048,
        "Title": "Theaterstraße 0",
        "AddressLine1": "Theaterstraße 0",
        "Town": "Blankenburg (Harz)",
        "Postcode": "38889",
        "CountryID": 87,
        "Latitude": 51.791164,
        "Longitude": 10.955008,
        "DistanceUnit": 0
    },
    "Connections": [
        {
            "ID": 299895,
            "ConnectionTypeID": 25,
            "StatusTypeID": 50,
            "LevelID": 2,
            "PowerKW": 22,
            "CurrentTypeID": 20
        },
        {
            "ID": 299896,
            "ConnectionTypeID": 25,
            "StatusTypeID": 50,
            "LevelID": 2,
            "PowerKW": 22,
            "CurrentTypeID": 20
        }
    ],
    "StatusTypeID": 50,
    "DateLastStatusUpdate": "2021-07-12T02:48:00Z",
    "MetadataValues": [
        {
            "ID": 18930,
            "MetadataFieldID": 4,
            "ItemValue": "Data from the German chargepoint registry provided by Bundesnetzagentur.de under the CC-BY 4.0 license"
        }
    ],
    "DataQualityLevel": 3,
    "DateCreated": "2021-07-12T02:48:00Z",
    "SubmissionStatusTypeID": 100
}