{
    "IsRecentlyVerified": false,
    "ID": 85905,
    "UUID": "D9467C9F-0653-4655-9D90-B3CDF9286B7F",
    "DataProviderID": 1,
    "OperatorID": 3266,
    "UsageTypeID": 4,
    "AddressInfo": {
        "ID": 86251,
        "Title": "Autohof Freienbrink",
        "AddressLine1": "Birkenstraße",
        "Town": "Grünheide (Mark)",
        "StateOrProvince": "Landkreis Oder-Spree",
        "Postcode": "15537",
        "CountryID": 87,
        "Latitude": 52.3854858,
        "Longitude": 13.80118600000003,
        "AccessComments": "Rund um die Uhr (24/7) nutzbar.\r\n",
        "RelatedURL": "http://www.autohof-freienbrink.com/elektrotankstelle",
        "DistanceUnit": 0
    },
    "Connections": [
        {
            "ID": 122101,
            "ConnectionTypeID": 25,
            "StatusTypeID": 50,
            "LevelID": 2,
            "Amps": 32,
            "Voltage": 400,
            "PowerKW": 22,
            "CurrentTypeID": 20,
            "Quantity": 1
        }
    ],
    "NumberOfPoints": 1,
    "StatusTypeID": 50,
    "DateLastStatusUpdate": "2017-04-20T07:10:00Z",
    "DataQualityLevel": 1,
    "DateCreated": "2017-04-20T07:10:00Z",
    "SubmissionStatusTypeID": 200
}