{
    "IsRecentlyVerified": false,
    "ID": 85069,
    "UUID": "27F8D87F-6F82-4E6A-BCD6-C001B8B66D90",
    "DataProviderID": 1,
    "OperatorID": 23,
    "OperatorsReference": "25815",
    "UsageTypeID": 6,
    "AddressInfo": {
        "ID": 85415,
        "Title": "Tryp By Wyndham Sebastian St. Augustine",
        "AddressLine1": "333 S Ponce de Leon BLVD",
        "Town": "St. Augustine",
        "StateOrProvince": "Florida",
        "Postcode": "32084",
        "CountryID": 2,
        "Latitude": 29.888414,
        "Longitude": -81.323567,
        "ContactTelephone1": "(904) 209-5580",
        "DistanceUnit": 0
    },
    "Connections": [
        {
            "ID": 120827,
            "ConnectionTypeID": 30,
            "StatusTypeID": 50,
            "LevelID": 2,
            "PowerKW": 16,
            "CurrentTypeID": 20,
            "Quantity": 1
        }
    ],
    "NumberOfPoints": 1,
    "GeneralComments": "1 Tesla Connector, up to 16kW.Available for patrons only. Please see front desk.",
    "StatusTypeID": 50,
    "DateLastStatusUpdate": "2017-03-25T06:25:00Z",
    "DataQualityLevel": 1,
    "DateCreated": "2017-03-25T06:25:00Z",
    "SubmissionStatusTypeID": 200
}