{
    "IsRecentlyVerified": false,
    "ID": 155200,
    "UUID": "CACC79EA-AC4E-4121-893B-0929E5B24E5B",
    "DataProviderID": 1,
    "OperatorID": 3299,
    "UsageTypeID": 5,
    "UsageCost": "£0.69p/kWh; other tariffs available",
    "AddressInfo": {
        "ID": 155554,
        "Title": "Ionity Leeds - Skelton Lakes Services",
        "AddressLine1": "M1 Jct 45",
        "Town": "Leeds",
        "StateOrProvince": "England",
        "Postcode": "LS15 0AE",
        "CountryID": 1,
        "Latitude": 53.77436865059477,
        "Longitude": -1.4703148125219059,
        "DistanceUnit": 0
    },
    "Connections": [
        {
            "ID": 218453,
            "ConnectionTypeID": 33,
            "Reference": "GB*ION*E410501",
            "StatusTypeID": 50,
            "LevelID": 3,
            "PowerKW": 350,
            "CurrentTypeID": 30,
            "Quantity": 1
        },
        {
            "ID": 271739,
            "ConnectionTypeID": 33,
            "Reference": "GB*ION*E410502",
            "StatusTypeID": 50,
            "LevelID": 3,
            "PowerKW": 350,
            "CurrentTypeID": 30,
            "Quantity": 1
        },
        {
            "ID": 271740,
            "ConnectionTypeID": 33,
            "Reference": "GB*ION*E410503",
            "StatusTypeID": 50,
            "LevelID": 3,
            "PowerKW": 350,
            "CurrentTypeID": 30,
            "Quantity": 1
        },
        {
            "ID": 271741,
            "ConnectionTypeID": 33,
            "Reference": "GB*ION*E410504",
            "StatusTypeID": 50,
            "LevelID": 3,
            "PowerKW": 350,
            "CurrentTypeID": 30,
            "Quantity": 1
        },
        {
            "ID": 271742,
            "ConnectionTypeID": 33,
            "Reference": "GB*ION*E410505",
            "StatusTypeID": 50,
            "LevelID": 3,
            "PowerKW": 350,
            "CurrentTypeID": 30,
            "Quantity": 1
        },
        {
            "ID": 271743,
            "ConnectionTypeID": 33,
            "Reference": "GB*ION*E410506",
            "StatusTypeID": 50,
            "LevelID": 3,
            "PowerKW": 350,
            "CurrentTypeID": 30,
            "Quantity": 1
        }
    ],
    "NumberOfPoints": 4,
    "StatusTypeID": 50,
    "DateLastStatusUpdate": "2021-05-02T17:38:00Z",
    "DataQualityLevel": 1,
    "DateCreated": "2020-03-30T13:46:00Z",
    "SubmissionStatusTypeID": 200
}