{
    "IsRecentlyVerified": false,
    "ID": 30771,
    "UUID": "FCA63C7E-C9F0-4E3A-8F91-4FBC6F139557",
    "DataProviderID": 1,
    "DataProvidersReference": "1909",
    "AddressInfo": {
        "ID": 31117,
        "Title": "Sloraveien 7",
        "AddressLine1": "Sloraveien 7",
        "Town": "HAKADAL",
        "StateOrProvince": "Viken",
        "Postcode": "1488",
        "CountryID": 168,
        "Latitude": 60.11109,
        "Longitude": 10.85001,
        "AccessComments": "Hakadalshallen god synlig rett ved Rv4.",
        "DistanceUnit": 0
    },
    "Connections": [
        {
            "ID": 34000,
            "ConnectionTypeID": 0,
            "Reference": "1",
            "LevelID": 2,
            "Amps": 16,
            "Voltage": 230,
            "PowerKW": 3.7
        },
        {
            "ID": 86455,
            "ConnectionTypeID": 0,
            "Reference": "2",
            "LevelID": 2,
            "Amps": 16,
            "Voltage": 230,
            "PowerKW": 3.7
        },
        {
            "ID": 86456,
            "ConnectionTypeID": 0,
            "Reference": "3",
            "LevelID": 2,
            "Amps": 16,
            "Voltage": 230,
            "PowerKW": 3.7
        },
        {
            "ID": 88856,
            "ConnectionTypeID": 0,
            "Reference": "4",
            "LevelID": 2,
            "Amps": 16,
            "Voltage": 230,
            "PowerKW": 3.7
        }
    ],
    "NumberOfPoints": 4,
    "DateLastStatusUpdate": "2020-05-26T08:23:00Z",
    "DataQualityLevel": 2,
    "DateCreated": "2014-12-09T09:00:00Z",
    "SubmissionStatusTypeID": 100
}