{
    "IsRecentlyVerified": false,
    "ID": 95218,
    "UUID": "F0AB1F99-A80F-4440-BA36-D3293E143646",
    "DataProviderID": 1,
    "OperatorID": 23,
    "OperatorsReference": "37206",
    "UsageTypeID": 4,
    "AddressInfo": {
        "ID": 95564,
        "Title": "Castello San Marco Charming Hotel & Spa",
        "AddressLine1": "Via San Marco",
        "Town": "40",
        "StateOrProvince": "Calatabiano",
        "Postcode": "95011",
        "CountryID": 112,
        "Latitude": 37.801871,
        "Longitude": 15.247616,
        "ContactTelephone1": "+39 095 641 181",
        "DistanceUnit": 0
    },
    "Connections": [
        {
            "ID": 134886,
            "ConnectionTypeID": 30,
            "StatusTypeID": 50,
            "LevelID": 2,
            "Amps": 32,
            "Voltage": 230,
            "PowerKW": 9,
            "CurrentTypeID": 10,
            "Quantity": 1
        }
    ],
    "NumberOfPoints": 1,
    "GeneralComments": "1 Tesla Connector, up to 9kW.Seasonal Availability Please call ahead.",
    "StatusTypeID": 50,
    "DateLastStatusUpdate": "2018-10-04T06:14:00Z",
    "DataQualityLevel": 1,
    "DateCreated": "2017-11-05T06:57:00Z",
    "SubmissionStatusTypeID": 200
}