{
    "UserComments": [
        {
            "ID": 21162,
            "ChargePointID": 51108,
            "CommentTypeID": 10,
            "UserName": "Raineach",
            "Comment": "Port B trips when initiating charge. Port A works ok",
            "DateCreated": "2019-07-02T09:31:26.35Z",
            "User": {
                "ID": 21388,
                "Username": "Raineach"
            }
        },
        {
            "ID": 10069,
            "ChargePointID": 51108,
            "CommentTypeID": 10,
            "UserName": "Bob",
            "Comment": "Handy for merchant city ",
            "DateCreated": "2016-04-02T12:06:48.607Z",
            "User": {
                "ID": 5013,
                "Username": "Bob"
            },
            "CheckinStatusTypeID": 10
        },
        {
            "ID": 7902,
            "ChargePointID": 51108,
            "CommentTypeID": 10,
            "UserName": "TheScotstounPele",
            "Comment": "Two Type 2 charge points at the southern end of the main car park. Worked well with CYC swipe card. There is no rapid charger though, contrary to some\nWebsites (eg zap-map at time of writing). ",
            "Rating": 4,
            "DateCreated": "2015-11-01T21:09:54.28Z",
            "User": {
                "ID": 6377,
                "Username": "TheScotstounPele"
            },
            "CheckinStatusTypeID": 10
        }
    ],
    "IsRecentlyVerified": false,
    "ID": 51108,
    "UUID": "D88DE32F-B49B-4A75-A9E9-9F73BD6050B6",
    "DataProviderID": 1,
    "OperatorID": 3315,
    "OperatorsReference": "50686",
    "UsageTypeID": 4,
    "UsageCost": "Free",
    "AddressInfo": {
        "ID": 51454,
        "Title": "Glasgow National Hockey Centre",
        "AddressLine1": "Glasgow National Hockey Centre",
        "Town": "Glasgow",
        "Postcode": "G40 1HB",
        "CountryID": 1,
        "Latitude": 55.8458069244511,
        "Longitude": -4.236467648208873,
        "DistanceUnit": 0
    },
    "Connections": [
        {
            "ID": 63221,
            "ConnectionTypeID": 25,
            "StatusTypeID": 50,
            "LevelID": 2,
            "Amps": 32,
            "Voltage": 400,
            "PowerKW": 22,
            "CurrentTypeID": 20,
            "Quantity": 2
        }
    ],
    "NumberOfPoints": 2,
    "StatusTypeID": 50,
    "DateLastStatusUpdate": "2021-01-04T13:25:00Z",
    "DataQualityLevel": 1,
    "DateCreated": "2015-07-22T12:03:00Z",
    "SubmissionStatusTypeID": 200
}