{
    "IsRecentlyVerified": false,
    "ID": 63138,
    "UUID": "3A50B22D-07FA-4C4C-9158-C1DFC4063500",
    "DataProviderID": 26,
    "DataProvidersReference": "72087",
    "OperatorID": 103,
    "OperatorsReference": "Allego NLALLEGO0003211",
    "UsageCost": "0.00 jaarabonnement",
    "AddressInfo": {
        "ID": 63484,
        "Title": "Adriaan Pieterslaan 31",
        "AddressLine1": "Adriaan Pieterslaan 31",
        "Town": "Hendrik-Ido-Ambacht",
        "Postcode": "3342 GW",
        "CountryID": 159,
        "Latitude": 51.84171636,
        "Longitude": 4.62292336,
        "ContactTelephone1": "0800-3745337",
        "RelatedURL": "http://www.allego.eu/",
        "DistanceUnit": 0
    },
    "Connections": [
        {
            "ID": 80368,
            "ConnectionTypeID": 25,
            "LevelID": 2,
            "PowerKW": 11,
            "CurrentTypeID": 10
        },
        {
            "ID": 80369,
            "ConnectionTypeID": 25,
            "LevelID": 2,
            "PowerKW": 11,
            "CurrentTypeID": 10
        }
    ],
    "NumberOfPoints": 1,
    "StatusTypeID": 50,
    "DateLastStatusUpdate": "2016-06-04T02:41:00Z",
    "DataQualityLevel": 3,
    "DateCreated": "2016-03-03T12:29:00Z",
    "SubmissionStatusTypeID": 100
}