{
    "IsRecentlyVerified": false,
    "ID": 14067,
    "UUID": "370A14AF-5D9F-4D70-BE8E-09CD40C29F3C",
    "DataProviderID": 2,
    "DataProvidersReference": "44652",
    "UsageTypeID": 1,
    "AddressInfo": {
        "ID": 13964,
        "Title": "City of Rock Island Parking Ramp",
        "AddressLine1": "16th St & 3rd Ave",
        "Town": "Rock Island",
        "StateOrProvince": "IL",
        "Postcode": "61201",
        "CountryID": 2,
        "Latitude": 41.509406,
        "Longitude": -90.577025,
        "ContactTelephone1": "309-732-2200",
        "AccessComments": "Garage business hours; pay lot",
        "RelatedURL": "",
        "DistanceUnit": 0
    },
    "Connections": [
        {
            "ID": 11511,
            "ConnectionTypeID": 1,
            "LevelID": 2,
            "Amps": 16,
            "Voltage": 230,
            "PowerKW": 3.7,
            "CurrentTypeID": 10,
            "Quantity": 3
        },
        {
            "ID": 21485,
            "ConnectionTypeID": 1,
            "LevelID": 2,
            "Quantity": 2
        }
    ],
    "DateLastStatusUpdate": "2020-06-26T03:04:00Z",
    "DataQualityLevel": 3,
    "DateCreated": "2012-12-06T16:48:00Z",
    "SubmissionStatusTypeID": 100
}