{
    "IsRecentlyVerified": false,
    "ID": 18281,
    "UUID": "91BB382B-7FBA-4A95-8B73-BC3758629B21",
    "DataProviderID": 1,
    "OperatorID": 1,
    "UsageTypeID": 5,
    "UsageCost": "",
    "AddressInfo": {
        "ID": 18626,
        "Title": "Levee Shopping Center EV Charging Stations",
        "AddressLine1": "480 W Washington St",
        "AddressLine2": "",
        "Town": "East Peoria",
        "StateOrProvince": "IL",
        "Postcode": "61611",
        "CountryID": 2,
        "Latitude": 40.671378,
        "Longitude": -89.582993,
        "ContactTelephone1": "",
        "ContactTelephone2": "",
        "ContactEmail": "",
        "AccessComments": "In parking lot near Ulta Beauty",
        "RelatedURL": "",
        "DistanceUnit": 0
    },
    "Connections": [],
    "NumberOfPoints": 2,
    "GeneralComments": "",
    "StatusTypeID": 50,
    "DateLastStatusUpdate": "2013-07-16T21:06:00Z",
    "DataQualityLevel": 1,
    "DateCreated": "2013-07-16T07:15:00Z",
    "SubmissionStatusTypeID": 200
}