{
    "IsRecentlyVerified": false,
    "ID": 177140,
    "UUID": "DC8648B9-8142-4657-B8D2-7B48F2A6076D",
    "DataProviderID": 29,
    "DataProvidersReference": "14738",
    "OperatorID": 86,
    "AddressInfo": {
        "ID": 177499,
        "Title": "In den Petersgärten",
        "AddressLine1": "In den Petersgärten",
        "Town": "Gaiberg",
        "Postcode": "69251",
        "CountryID": 87,
        "Latitude": 49.367868,
        "Longitude": 8.75099,
        "DistanceUnit": 0
    },
    "Connections": [
        {
            "ID": 275928,
            "ConnectionTypeID": 25,
            "StatusTypeID": 50,
            "LevelID": 2,
            "PowerKW": 22,
            "CurrentTypeID": 20
        },
        {
            "ID": 275929,
            "ConnectionTypeID": 25,
            "StatusTypeID": 50,
            "LevelID": 2,
            "PowerKW": 22,
            "CurrentTypeID": 20
        }
    ],
    "StatusTypeID": 0,
    "DateLastStatusUpdate": "2021-07-12T02:43:00Z",
    "MetadataValues": [
        {
            "ID": 9434,
            "MetadataFieldID": 4,
            "ItemValue": "Data from the German chargepoint registry provided by Bundesnetzagentur.de under the CC-BY 4.0 license"
        }
    ],
    "DataQualityLevel": 3,
    "DateCreated": "2021-07-08T09:48:00Z",
    "SubmissionStatusTypeID": 100
}