{
    "IsRecentlyVerified": false,
    "ID": 120855,
    "UUID": "4CDEEFA0-10C0-4828-861C-F970FE5E2ACC",
    "DataProviderID": 2,
    "DataProvidersReference": "64720",
    "OperatorID": 5,
    "UsageTypeID": 1,
    "AddressInfo": {
        "ID": 121201,
        "Title": "PD",
        "AddressLine1": "73170 El Paseo",
        "Town": "Palm Desert",
        "StateOrProvince": "CA",
        "Postcode": "92260",
        "CountryID": 2,
        "Latitude": 33.7202516,
        "Longitude": -116.3878195,
        "ContactTelephone1": "888-758-4389",
        "AccessComments": "24 hours daily",
        "RelatedURL": "http://www.chargepoint.com/",
        "DistanceUnit": 0
    },
    "Connections": [
        {
            "ID": 170257,
            "ConnectionTypeID": 1,
            "LevelID": 2,
            "Amps": 16,
            "Voltage": 230,
            "PowerKW": 3,
            "CurrentTypeID": 10,
            "Quantity": 2
        }
    ],
    "DateLastStatusUpdate": "2019-12-24T09:10:00Z",
    "DataQualityLevel": 3,
    "DateCreated": "2019-04-01T04:59:00Z",
    "SubmissionStatusTypeID": 100
}