{
    "IsRecentlyVerified": false,
    "ID": 124348,
    "UUID": "A025162F-D677-4075-9AE1-9670C9FB5514",
    "DataProviderID": 2,
    "DataProvidersReference": "114566",
    "OperatorID": 23,
    "UsageTypeID": 1,
    "AddressInfo": {
        "ID": 124694,
        "Title": "Sunshine Daydream - Tesla Destination",
        "AddressLine1": "1395 Bagnell Dam blvd.",
        "Town": "Lake Ozark",
        "StateOrProvince": "MO",
        "Postcode": "65049",
        "CountryID": 2,
        "Latitude": 38.198011,
        "Longitude": -92.637613,
        "ContactTelephone1": "573-365-4550  877-798-3752",
        "AccessComments": "24 hours daily; see front desk for access",
        "RelatedURL": "https://www.tesla.com/destination-charging",
        "DistanceUnit": 0
    },
    "Connections": [
        {
            "ID": 174435,
            "ConnectionTypeID": 30,
            "LevelID": 2,
            "Amps": 16,
            "Voltage": 230,
            "PowerKW": 3.7,
            "CurrentTypeID": 10,
            "Quantity": 2
        }
    ],
    "DateLastStatusUpdate": "2020-06-26T02:59:00Z",
    "DataQualityLevel": 3,
    "DateCreated": "2019-04-06T05:03:00Z",
    "SubmissionStatusTypeID": 100
}