{
    "IsRecentlyVerified": false,
    "ID": 88841,
    "UUID": "7D265F28-8C71-4687-9730-35A5AECD7561",
    "DataProviderID": 1,
    "OperatorID": 23,
    "OperatorsReference": "30370",
    "UsageTypeID": 4,
    "AddressInfo": {
        "ID": 89187,
        "Title": "The St Anthony Hotel",
        "AddressLine1": "300 E Travis St",
        "Town": "San Antonio",
        "StateOrProvince": "Texas",
        "Postcode": "78205",
        "CountryID": 2,
        "Latitude": 29.427283,
        "Longitude": -98.489125,
        "ContactTelephone1": "(210) 227-4392",
        "DistanceUnit": 0
    },
    "Connections": [
        {
            "ID": 126089,
            "ConnectionTypeID": 30,
            "StatusTypeID": 50,
            "LevelID": 2,
            "PowerKW": 16,
            "CurrentTypeID": 20,
            "Quantity": 2
        }
    ],
    "NumberOfPoints": 2,
    "GeneralComments": "2 Tesla Connectors, up to 16kW.Available for customers. Please see valet.",
    "StatusTypeID": 50,
    "DateLastStatusUpdate": "2017-06-09T14:36:00Z",
    "DataQualityLevel": 1,
    "DateCreated": "2017-06-09T14:36:00Z",
    "SubmissionStatusTypeID": 200
}