{
    "MediaItems": [
        {
            "ID": 3484,
            "ChargePointID": 40733,
            "ItemURL": "https://s3-ap-southeast-2.amazonaws.com/openchargemap/images/DE/OCM40733/OCM-40733.orig.2015110714493562.jpg",
            "ItemThumbnailURL": "https://s3-ap-southeast-2.amazonaws.com/openchargemap/images/DE/OCM40733/OCM-40733.thmb.2015110714493562.jpg",
            "Comment": "Wallbox mit Anleitung",
            "IsEnabled": true,
            "IsVideo": false,
            "IsFeaturedItem": false,
            "IsExternalResource": false,
            "User": {
                "ID": 4573,
                "Username": "Erna_Schleck"
            },
            "DateCreated": "2015-11-07T14:50:00Z"
        },
        {
            "ID": 3483,
            "ChargePointID": 40733,
            "ItemURL": "https://s3-ap-southeast-2.amazonaws.com/openchargemap/images/DE/OCM40733/OCM-40733.orig.2015110714491476.jpg",
            "ItemThumbnailURL": "https://s3-ap-southeast-2.amazonaws.com/openchargemap/images/DE/OCM40733/OCM-40733.thmb.2015110714491476.jpg",
            "Comment": "4 markierte Parkplätze, die gerne von anderen benutzt werden",
            "IsEnabled": true,
            "IsVideo": false,
            "IsFeaturedItem": false,
            "IsExternalResource": false,
            "User": {
                "ID": 4573,
                "Username": "Erna_Schleck"
            },
            "DateCreated": "2015-11-07T14:49:00Z"
        }
    ],
    "IsRecentlyVerified": false,
    "ID": 40733,
    "UUID": "F19072D5-47A7-4EA5-8E8D-4DC31E70C177",
    "DataProviderID": 1,
    "OperatorID": 45,
    "UsageTypeID": 5,
    "UsageCost": "0",
    "AddressInfo": {
        "ID": 41079,
        "Title": "Parkhaus Andreaestraße",
        "AddressLine1": "Andreaestraße 4",
        "Town": "Hannover",
        "StateOrProvince": "Region Hannover",
        "Postcode": "30159",
        "CountryID": 87,
        "Latitude": 52.3766024,
        "Longitude": 9.73717569999997,
        "AccessComments": "Zur Anfahrt einfach den weißen Schildern \"CO2 frei mobil\" folgen in die 2. Etage. Dort sind ganz hinten 2 grün markierte Plätze (um Platz 2-47) mit 2 Wallboxen. Verfahren wie in allen anderen Parkhäusern in Hannover, 3€ pro Ladevorgang plus Parkgebühr",
        "RelatedURL": "http://www.enercity.de",
        "DistanceUnit": 0
    },
    "Connections": [
        {
            "ID": 44341,
            "ConnectionTypeID": 25,
            "StatusTypeID": 50,
            "LevelID": 2,
            "Amps": 32,
            "Voltage": 400,
            "PowerKW": 22,
            "CurrentTypeID": 20,
            "Quantity": 2
        },
        {
            "ID": 44342,
            "ConnectionTypeID": 28,
            "StatusTypeID": 50,
            "LevelID": 2,
            "Amps": 16,
            "Voltage": 230,
            "PowerKW": 3.7,
            "CurrentTypeID": 10,
            "Quantity": 4
        },
        {
            "ID": 71577,
            "ConnectionTypeID": 29,
            "StatusTypeID": 50,
            "LevelID": 2,
            "Amps": 16,
            "Voltage": 230,
            "PowerKW": 3.7,
            "CurrentTypeID": 10,
            "Quantity": 2
        }
    ],
    "NumberOfPoints": 4,
    "GeneralComments": "Umbau komplett, nun durchgängig bei allen Parkhäusern in Hannover",
    "StatusTypeID": 50,
    "DateLastStatusUpdate": "2016-01-05T07:09:00Z",
    "DataQualityLevel": 1,
    "DateCreated": "2015-01-12T09:16:00Z",
    "SubmissionStatusTypeID": 200
}