{
    "IsRecentlyVerified": false,
    "ID": 105479,
    "UUID": "2D4AFEE9-C46F-40C9-A061-B9245DE9C727",
    "DataProviderID": 1,
    "OperatorID": 32,
    "OperatorsReference": "24273",
    "UsageTypeID": 4,
    "UsageCost": "£0.108/kWh; for Polar Plus subscription members only",
    "AddressInfo": {
        "ID": 105825,
        "Title": "Holiday Inn Express Lincoln City Centre",
        "AddressLine1": "Brayford Enterprise Park",
        "AddressLine2": "Ruston Way",
        "Town": "Lincoln",
        "Postcode": "LN6 7DB",
        "CountryID": 1,
        "Latitude": 53.225899,
        "Longitude": -0.5513,
        "DistanceUnit": 0
    },
    "Connections": [
        {
            "ID": 148659,
            "ConnectionTypeID": 33,
            "StatusTypeID": 50,
            "LevelID": 3,
            "PowerKW": 50,
            "CurrentTypeID": 30,
            "Quantity": 1
        },
        {
            "ID": 148660,
            "ConnectionTypeID": 2,
            "StatusTypeID": 50,
            "LevelID": 3,
            "PowerKW": 50,
            "CurrentTypeID": 30,
            "Quantity": 1
        },
        {
            "ID": 148661,
            "ConnectionTypeID": 1036,
            "StatusTypeID": 50,
            "LevelID": 3,
            "PowerKW": 43,
            "CurrentTypeID": 20,
            "Quantity": 1
        }
    ],
    "NumberOfPoints": 1,
    "StatusTypeID": 50,
    "DateLastStatusUpdate": "2019-06-20T05:32:00Z",
    "DataQualityLevel": 1,
    "DateCreated": "2018-06-08T05:14:00Z",
    "SubmissionStatusTypeID": 200
}