{
    "IsRecentlyVerified": false,
    "ID": 183985,
    "UUID": "7EDC2509-2938-41F8-AB9B-2DCDF8BD0DEA",
    "DataProviderID": 29,
    "DataProvidersReference": "19693",
    "AddressInfo": {
        "ID": 184344,
        "Title": "Am Domänenhof 9",
        "AddressLine1": "Am Domänenhof 9",
        "Town": "Lüneburg",
        "Postcode": "21337",
        "CountryID": 87,
        "Latitude": 53.2614,
        "Longitude": 10.4237,
        "DistanceUnit": 0
    },
    "Connections": [
        {
            "ID": 291648,
            "ConnectionTypeID": 28,
            "StatusTypeID": 50,
            "LevelID": 2,
            "PowerKW": 22,
            "CurrentTypeID": 20
        },
        {
            "ID": 291649,
            "ConnectionTypeID": 25,
            "StatusTypeID": 50,
            "LevelID": 2,
            "PowerKW": 22,
            "CurrentTypeID": 20
        },
        {
            "ID": 301218,
            "ConnectionTypeID": 25,
            "StatusTypeID": 50,
            "LevelID": 2,
            "PowerKW": 22,
            "CurrentTypeID": 20
        }
    ],
    "StatusTypeID": 50,
    "DateLastStatusUpdate": "2021-07-12T02:50:00Z",
    "MetadataValues": [
        {
            "ID": 16278,
            "MetadataFieldID": 4,
            "ItemValue": "Data from the German chargepoint registry provided by Bundesnetzagentur.de under the CC-BY 4.0 license"
        }
    ],
    "DataQualityLevel": 3,
    "DateCreated": "2021-07-08T10:04:00Z",
    "SubmissionStatusTypeID": 100
}