{
    "IsRecentlyVerified": false,
    "ID": 94922,
    "UUID": "0BF21F03-E209-4861-9346-C0F86A717DD8",
    "DataProviderID": 1,
    "DataProvidersReference": "4320",
    "AddressInfo": {
        "ID": 95268,
        "Title": "Onarheim Senter Tysnes",
        "AddressLine1": "Flakkavågsvegen 12",
        "Town": "ONARHEIM",
        "StateOrProvince": "Vestland",
        "Postcode": "5694",
        "CountryID": 168,
        "Latitude": 59.94709,
        "Longitude": 5.62806,
        "AccessComments": "",
        "DistanceUnit": 0
    },
    "Connections": [
        {
            "ID": 134379,
            "ConnectionTypeID": 0,
            "Reference": "1",
            "LevelID": 2,
            "Amps": 100,
            "Voltage": 500,
            "PowerKW": 50,
            "Comments": "Mode 4"
        },
        {
            "ID": 134380,
            "ConnectionTypeID": 0,
            "Reference": "2",
            "LevelID": 2,
            "Amps": 100,
            "Voltage": 500,
            "PowerKW": 50,
            "Comments": "Mode 4"
        },
        {
            "ID": 134381,
            "ConnectionTypeID": 0,
            "Reference": "3",
            "LevelID": 2,
            "Amps": 32,
            "Voltage": 400,
            "PowerKW": 22,
            "Comments": "Mode 4"
        },
        {
            "ID": 134382,
            "ConnectionTypeID": 0,
            "Reference": "4",
            "LevelID": 2,
            "Amps": 32,
            "Voltage": 400,
            "PowerKW": 22,
            "Comments": "Mode 3"
        },
        {
            "ID": 134383,
            "ConnectionTypeID": 0,
            "Reference": "5",
            "LevelID": 2,
            "Amps": 32,
            "Voltage": 400,
            "PowerKW": 22,
            "Comments": "Mode 3"
        }
    ],
    "NumberOfPoints": 5,
    "DateLastStatusUpdate": "2020-05-26T08:23:00Z",
    "DataQualityLevel": 2,
    "DateCreated": "2017-10-28T13:36:00Z",
    "SubmissionStatusTypeID": 100
}