{
    "IsRecentlyVerified": false,
    "ID": 154073,
    "UUID": "E85CDFF4-A348-4A6B-B967-151085162276",
    "DataProviderID": 28,
    "DataProvidersReference": "FR*S27*PGIVERNYTOURISTIQUE2",
    "UsageTypeID": 5,
    "AddressInfo": {
        "ID": 154426,
        "Title": "900047",
        "AddressLine1": "Parking touristique 2eme Giverny",
        "CountryID": 80,
        "Latitude": 49.074712,
        "Longitude": 1.530081,
        "AccessComments": "24/24 7/7 jours",
        "DistanceUnit": 0
    },
    "Connections": [
        {
            "ID": 216525,
            "ConnectionTypeID": 28,
            "StatusTypeID": 50,
            "LevelID": 2,
            "PowerKW": 22,
            "CurrentTypeID": 10
        },
        {
            "ID": 216526,
            "ConnectionTypeID": 26,
            "StatusTypeID": 50,
            "LevelID": 2,
            "PowerKW": 22
        },
        {
            "ID": 250854,
            "ConnectionTypeID": 28,
            "StatusTypeID": 50,
            "LevelID": 2,
            "PowerKW": 22,
            "CurrentTypeID": 10
        },
        {
            "ID": 250855,
            "ConnectionTypeID": 26,
            "StatusTypeID": 50,
            "LevelID": 2,
            "PowerKW": 22
        }
    ],
    "GeneralComments": "Borne en service",
    "StatusTypeID": 50,
    "DateLastStatusUpdate": "2020-08-27T05:16:00Z",
    "DataQualityLevel": 2,
    "DateCreated": "2020-03-15T10:54:00Z",
    "SubmissionStatusTypeID": 100
}