{
    "IsRecentlyVerified": false,
    "ID": 30775,
    "UUID": "CB268494-9064-4048-9652-4983EC3C258B",
    "DataProviderID": 1,
    "DataProvidersReference": "2289",
    "AddressInfo": {
        "ID": 31121,
        "Title": "Ringvegen, Jessheim",
        "AddressLine1": "Ringvegen 7",
        "Town": "JESSHEIM",
        "StateOrProvince": "Viken",
        "Postcode": "2050",
        "CountryID": 168,
        "Latitude": 60.14473,
        "Longitude": 11.17724,
        "AccessComments": "P-plass bak Ullensaker kulturhus, to plasser nærmest Ullensaker Kirke.",
        "DistanceUnit": 0
    },
    "Connections": [
        {
            "ID": 34004,
            "ConnectionTypeID": 0,
            "Reference": "1",
            "LevelID": 2,
            "Amps": 16,
            "Voltage": 230,
            "PowerKW": 3.7,
            "Comments": "Mode 1"
        },
        {
            "ID": 88863,
            "ConnectionTypeID": 0,
            "Reference": "2",
            "LevelID": 2,
            "Amps": 16,
            "Voltage": 230,
            "PowerKW": 3.7,
            "Comments": "Mode 1"
        }
    ],
    "NumberOfPoints": 2,
    "DateLastStatusUpdate": "2020-05-26T08:23:00Z",
    "DataQualityLevel": 2,
    "DateCreated": "2014-12-09T09:00:00Z",
    "SubmissionStatusTypeID": 100
}