{
    "IsRecentlyVerified": false,
    "ID": 64807,
    "UUID": "3BC890F2-FA24-42BD-8B24-DA332FE3B044",
    "DataProviderID": 1,
    "OperatorID": 1,
    "UsageTypeID": 1,
    "UsageCost": "Free",
    "AddressInfo": {
        "ID": 65153,
        "Title": "Basel Garage Keigel AG",
        "AddressLine1": "Hochstrasse 48",
        "Town": "Basel",
        "Postcode": "4053",
        "CountryID": 217,
        "Latitude": 47.5446644,
        "Longitude": 7.5942188,
        "DistanceUnit": 0
    },
    "Connections": [
        {
            "ID": 83321,
            "ConnectionTypeID": 25,
            "StatusTypeID": 50,
            "LevelID": 2,
            "PowerKW": 22,
            "CurrentTypeID": 20
        },
        {
            "ID": 83322,
            "ConnectionTypeID": 25,
            "StatusTypeID": 50,
            "LevelID": 2,
            "PowerKW": 11,
            "CurrentTypeID": 20
        }
    ],
    "NumberOfPoints": 2,
    "StatusTypeID": 50,
    "DateLastStatusUpdate": "2016-03-22T22:18:00Z",
    "DataQualityLevel": 1,
    "DateCreated": "2016-03-22T00:06:00Z",
    "SubmissionStatusTypeID": 200
}