{
    "IsRecentlyVerified": false,
    "ID": 92882,
    "UUID": "5927DA89-673E-4DA2-8F68-8502A661157F",
    "DataProviderID": 1,
    "OperatorID": 3315,
    "OperatorsReference": "50940,51363",
    "UsageTypeID": 4,
    "UsageCost": "Free",
    "AddressInfo": {
        "ID": 93228,
        "Title": "Straiton Park & Ride, Straiton",
        "AddressLine1": "Straiton Park and Ride",
        "Town": "Straiton",
        "StateOrProvince": "Midlothian",
        "Postcode": "EH20 9NP",
        "CountryID": 1,
        "Latitude": 55.886227828156,
        "Longitude": -3.1667986011887,
        "DistanceUnit": 0
    },
    "Connections": [
        {
            "ID": 131560,
            "ConnectionTypeID": 25,
            "StatusTypeID": 50,
            "LevelID": 2,
            "Amps": 32,
            "Voltage": 230,
            "PowerKW": 7,
            "CurrentTypeID": 10,
            "Quantity": 2
        },
        {
            "ID": 131561,
            "ConnectionTypeID": 2,
            "StatusTypeID": 50,
            "LevelID": 3,
            "PowerKW": 50,
            "CurrentTypeID": 30,
            "Quantity": 1
        },
        {
            "ID": 131562,
            "ConnectionTypeID": 1036,
            "StatusTypeID": 50,
            "LevelID": 3,
            "PowerKW": 43,
            "CurrentTypeID": 20,
            "Quantity": 1
        },
        {
            "ID": 131563,
            "ConnectionTypeID": 33,
            "StatusTypeID": 50,
            "LevelID": 3,
            "PowerKW": 50,
            "CurrentTypeID": 30,
            "Quantity": 1
        }
    ],
    "NumberOfPoints": 4,
    "GeneralComments": "Available 24 hours a day.",
    "StatusTypeID": 50,
    "DateLastStatusUpdate": "2020-02-22T10:13:00Z",
    "DataQualityLevel": 1,
    "DateCreated": "2017-09-13T11:16:00Z",
    "SubmissionStatusTypeID": 200
}