{
    "IsRecentlyVerified": false,
    "ID": 33262,
    "UUID": "9EDFF5E9-E2F9-482E-AA75-EA795F912A65",
    "DataProviderID": 26,
    "DataProvidersReference": "48800",
    "OperatorID": 178,
    "OperatorsReference": "EVnetNL PNB-REE0090",
    "UsageCost": "0.00 jaarabonnement",
    "AddressInfo": {
        "ID": 33608,
        "Title": "Bankastraat 9",
        "AddressLine1": "Bankastraat 9",
        "Town": "Tilburg",
        "Postcode": "5014 BW",
        "CountryID": 159,
        "Latitude": 51.564011,
        "Longitude": 5.100479,
        "ContactTelephone1": "0800-3522365",
        "RelatedURL": "http://www.evnet.nl",
        "DistanceUnit": 0
    },
    "Connections": [
        {
            "ID": 36773,
            "ConnectionTypeID": 25,
            "LevelID": 1,
            "PowerKW": 2.3,
            "CurrentTypeID": 10
        }
    ],
    "NumberOfPoints": 1,
    "StatusTypeID": 50,
    "DateLastStatusUpdate": "2016-06-04T02:39:00Z",
    "DataQualityLevel": 3,
    "DateCreated": "2015-01-09T06:04:00Z",
    "SubmissionStatusTypeID": 100
}