{
    "IsRecentlyVerified": false,
    "ID": 117918,
    "UUID": "23289969-5286-414C-9885-013E62DB97D4",
    "DataProviderID": 1,
    "OperatorID": 150,
    "UsageTypeID": 5,
    "UsageCost": "£0.50 + £0.30 / kWh. £10.00 overstay after 245 mins",
    "AddressInfo": {
        "ID": 118264,
        "Title": "Tŷ Mawr Country Park",
        "AddressLine1": "Cae Gwilym Lane",
        "AddressLine2": "Cefn Mawr",
        "Town": "Wrexham",
        "Postcode": "LL14 3PE",
        "CountryID": 1,
        "Latitude": 52.9655,
        "Longitude": -3.06935,
        "RelatedURL": "http://www.chargepointservices.co.uk",
        "DistanceUnit": 0
    },
    "Connections": [
        {
            "ID": 166903,
            "ConnectionTypeID": 25,
            "Reference": "1",
            "StatusTypeID": 50,
            "LevelID": 2,
            "Amps": 32,
            "Voltage": 230,
            "PowerKW": 7,
            "CurrentTypeID": 10,
            "Quantity": 2
        }
    ],
    "NumberOfPoints": 2,
    "StatusTypeID": 50,
    "DateLastStatusUpdate": "2019-03-11T08:03:00Z",
    "MetadataValues": [
        {
            "ID": 4149,
            "MetadataFieldID": 4,
            "ItemValue": "Contains public sector information licensed under the Open Government Licence v2.0. http://www.nationalarchives.gov.uk/doc/open-government-licence/version/2/"
        }
    ],
    "DataQualityLevel": 3,
    "DateCreated": "2019-03-11T07:26:00Z",
    "SubmissionStatusTypeID": 100
}