{
    "IsRecentlyVerified": false,
    "ID": 155881,
    "UUID": "F5711FCF-EB7F-4C94-9EF6-0A7E5BF9272E",
    "DataProviderID": 1,
    "OperatorID": 187,
    "UsageTypeID": 1,
    "UsageCost": "Free",
    "AddressInfo": {
        "ID": 156235,
        "Title": "ELMŰ, Pápay István u. 14. ",
        "AddressLine1": "Pápay István u. 14. ",
        "Town": "Budapest",
        "Postcode": "1097",
        "CountryID": 104,
        "Latitude": 47.474239,
        "Longitude": 19.072079,
        "ContactTelephone1": "+36 1 238 3838",
        "RelatedURL": "https://e-autozas.hu/",
        "DistanceUnit": 0
    },
    "Connections": [
        {
            "ID": 219448,
            "ConnectionTypeID": 25,
            "StatusTypeID": 50,
            "LevelID": 2,
            "Amps": 32,
            "Voltage": 400,
            "PowerKW": 22,
            "CurrentTypeID": 20,
            "Quantity": 2
        }
    ],
    "NumberOfPoints": 2,
    "GeneralComments": "🇭🇺 A töltés indításához előzetes regisztráció szükséges (www.e-autozas.hu). Ezután az eCharge+ applikáción keresztül indítható a töltés.\r\n🇬🇧 Registration required to start charging (www.e-autozas.hu). After that use the eCharge+ application to start charging. (x2)",
    "StatusTypeID": 50,
    "DateLastStatusUpdate": "2020-04-27T18:21:00Z",
    "DataQualityLevel": 1,
    "DateCreated": "2020-04-27T08:26:00Z",
    "SubmissionStatusTypeID": 200
}