{
    "MediaItems": [
        {
            "ID": 1581,
            "ChargePointID": 9267,
            "ItemURL": "https://s3-ap-southeast-2.amazonaws.com/openchargemap/images/BE/OCM9267/OCM-9267.orig.2015062308051191.jpg",
            "ItemThumbnailURL": "https://s3-ap-southeast-2.amazonaws.com/openchargemap/images/BE/OCM9267/OCM-9267.thmb.2015062308051191.jpg",
            "Comment": "",
            "IsEnabled": true,
            "IsVideo": false,
            "IsFeaturedItem": false,
            "IsExternalResource": false,
            "User": {
                "ID": 1507,
                "Username": "Philip Moorthamer"
            },
            "DateCreated": "2015-06-23T08:05:00Z"
        }
    ],
    "IsRecentlyVerified": false,
    "ID": 9267,
    "UUID": "1E9FC3E8-3A2B-4912-B3F4-F2F1A2085231",
    "DataProviderID": 1,
    "OperatorID": 1,
    "UsageTypeID": 1,
    "UsageCost": "Free",
    "AddressInfo": {
        "ID": 9164,
        "Title": "Nissan Group Duyck",
        "AddressLine1": "Bergensesteenweg 770a",
        "AddressLine2": "",
        "Town": "Sint-Pieters-Leeuw",
        "StateOrProvince": "",
        "Postcode": "1800",
        "CountryID": 26,
        "Latitude": 50.75988460000001,
        "Longitude": 4.251542800000038,
        "ContactTelephone1": "+32(0)2 381 17 31",
        "ContactTelephone2": "",
        "ContactEmail": "rudy@nissan-groupduyck.be",
        "AccessComments": "",
        "RelatedURL": "",
        "DistanceUnit": 0
    },
    "Connections": [
        {
            "ID": 6979,
            "ConnectionTypeID": 2,
            "StatusTypeID": 50,
            "LevelID": 3,
            "Quantity": 1
        }
    ],
    "NumberOfPoints": 1,
    "GeneralComments": "",
    "StatusTypeID": 50,
    "DateLastStatusUpdate": "2015-06-23T08:05:00Z",
    "DataQualityLevel": 1,
    "DateCreated": "2012-01-30T14:01:00Z",
    "SubmissionStatusTypeID": 200
}