{
    "IsRecentlyVerified": false,
    "ID": 136094,
    "UUID": "B35E2515-2171-4AA6-800E-E110F0E36EAC",
    "DataProviderID": 18,
    "DataProvidersReference": "bed495e8c39041a30a97924aedac001b",
    "OperatorID": 2244,
    "UsageTypeID": 4,
    "AddressInfo": {
        "ID": 136440,
        "Title": "Wavendon Avenue",
        "AddressLine1": "Wavendon Avenue",
        "Town": "London",
        "Postcode": "W4 4NT",
        "CountryID": 1,
        "Latitude": 51.489463,
        "Longitude": -0.260373,
        "AccessComments": "",
        "RelatedURL": "https://www.ubitricity.com",
        "DistanceUnit": 0
    },
    "Connections": [
        {
            "ID": 190521,
            "ConnectionTypeID": 25,
            "Reference": "steob100000078",
            "StatusTypeID": 50,
            "LevelID": 2,
            "Amps": 16,
            "Voltage": 230,
            "PowerKW": 3.7,
            "CurrentTypeID": 10
        }
    ],
    "StatusTypeID": 0,
    "DateLastStatusUpdate": "2021-04-25T05:46:00Z",
    "MetadataValues": [
        {
            "ID": 5946,
            "MetadataFieldID": 4,
            "ItemValue": "Contains public sector information licensed under the Open Government Licence v2.0. http://www.nationalarchives.gov.uk/doc/open-government-licence/version/2/"
        }
    ],
    "DataQualityLevel": 3,
    "DateCreated": "2019-12-24T05:22:00Z",
    "SubmissionStatusTypeID": 100
}