{
    "IsRecentlyVerified": false,
    "ID": 66306,
    "UUID": "C63DB2F6-D7DF-45DF-A037-23FA56B2A98D",
    "DataProviderID": 1,
    "OperatorID": 45,
    "UsageTypeID": 5,
    "UsageCost": "£2.60",
    "AddressInfo": {
        "ID": 66652,
        "Title": "Addenbrookes' Hospital car park 2",
        "AddressLine1": "Robinson Way",
        "AddressLine2": "Hills Road",
        "Town": "Cambridge",
        "StateOrProvince": "Cambs",
        "Postcode": "CB2 0QQ",
        "CountryID": 1,
        "Latitude": 52.1728333553349,
        "Longitude": 0.137690799019765,
        "ContactEmail": "addenbrookes@vincipark.co.uk",
        "AccessComments": "At the roundabout at the Hill's Road entrance turn left and follow perimeter road bearing right then left, 2nd exit onto round about then straight for 200 yards to car park 2. Take parking ticket and Commando plug chargers are straight ahead. You need to move fencing aside to gain access to parking bay. On return to car park go to ticket office to pay for charge and parking.",
        "DistanceUnit": 0
    },
    "Connections": [
        {
            "ID": 91669,
            "ConnectionTypeID": 4,
            "StatusTypeID": 50,
            "LevelID": 2,
            "Amps": 32,
            "Voltage": 240,
            "PowerKW": 7,
            "CurrentTypeID": 10,
            "Quantity": 6
        }
    ],
    "NumberOfPoints": 8,
    "GeneralComments": "Vincipark.co.uk",
    "StatusTypeID": 50,
    "DateLastStatusUpdate": "2016-05-18T14:39:00Z",
    "DataQualityLevel": 1,
    "DateCreated": "2016-05-17T17:02:00Z",
    "SubmissionStatusTypeID": 200
}