{
    "IsRecentlyVerified": false,
    "ID": 74197,
    "UUID": "58EF377C-ED23-4EC8-8E04-2D4701523946",
    "DataProviderID": 1,
    "OperatorID": 45,
    "UsageTypeID": 1,
    "AddressInfo": {
        "ID": 74543,
        "Title": "E-Bike Station Kirchplatz",
        "AddressLine1": "Kirchplatz 2",
        "Town": "Neustadt/Harz",
        "StateOrProvince": "Hohnstein/Südharz",
        "Postcode": "99762",
        "CountryID": 87,
        "Latitude": 51.56028916122125,
        "Longitude": 10.836209504299195,
        "AccessComments": "Abschließbare Ladefächer mit Kabeldurchführung (Typ Orion Bausysteme Beta EnergySafe) am Fahrradständer mit je 2 Schukodosen (10A belastbar) an der St. Georg Kirche. Gesamtbelastbarkeit 16A.",
        "DistanceUnit": 0
    },
    "Connections": [
        {
            "ID": 106549,
            "ConnectionTypeID": 28,
            "StatusTypeID": 50,
            "LevelID": 1,
            "Amps": 10,
            "Voltage": 230,
            "PowerKW": 2.3,
            "CurrentTypeID": 10,
            "Quantity": 3
        }
    ],
    "NumberOfPoints": 3,
    "StatusTypeID": 50,
    "DateLastStatusUpdate": "2016-11-25T09:57:00Z",
    "DataQualityLevel": 1,
    "DateCreated": "2016-11-25T09:57:00Z",
    "SubmissionStatusTypeID": 200
}