{
    "IsRecentlyVerified": false,
    "ID": 71056,
    "UUID": "624CBD63-F449-4E32-A9E2-2755B567A03B",
    "DataProviderID": 1,
    "OperatorID": 220,
    "OperatorsReference": "2855,2855,2854",
    "UsageTypeID": 4,
    "UsageCost": "€1.73 + €0.3213/kWh; Andere Tarife möglich",
    "AddressInfo": {
        "ID": 71402,
        "Title": "Marktplatz-Galerie",
        "AddressLine1": "Bramfelder Chaussee 242",
        "AddressLine2": "Bramfeld",
        "Town": "Hamburg",
        "StateOrProvince": "Hamburg",
        "Postcode": "22177",
        "CountryID": 87,
        "Latitude": 53.6133012,
        "Longitude": 10.0759156,
        "AccessComments": "24/7 nutzbar mit Ladekarten von Hamburg Energie, Vattenfall, SUN, The New Motion, Charge&Fuel, PlugSurfing u.a. sowie SMS Direct Pay.",
        "DistanceUnit": 0
    },
    "Connections": [
        {
            "ID": 101817,
            "ConnectionTypeID": 25,
            "StatusTypeID": 50,
            "LevelID": 2,
            "Amps": 32,
            "Voltage": 400,
            "PowerKW": 22,
            "CurrentTypeID": 20,
            "Quantity": 2
        },
        {
            "ID": 101818,
            "ConnectionTypeID": 28,
            "StatusTypeID": 50,
            "LevelID": 2,
            "Amps": 16,
            "Voltage": 230,
            "PowerKW": 3.7,
            "CurrentTypeID": 10,
            "Quantity": 2
        }
    ],
    "NumberOfPoints": 2,
    "StatusTypeID": 50,
    "DateLastStatusUpdate": "2017-04-20T22:51:00Z",
    "DataQualityLevel": 1,
    "DateCreated": "2016-08-24T07:16:00Z",
    "SubmissionStatusTypeID": 200
}