{
    "IsRecentlyVerified": false,
    "ID": 62414,
    "UUID": "489E8C82-8BDB-459D-A453-BB3A39CEA263",
    "DataProviderID": 2,
    "DataProvidersReference": "71626",
    "UsageTypeID": 1,
    "AddressInfo": {
        "ID": 62760,
        "Title": "Kwik Trip #209",
        "AddressLine1": "1101 Gertrude St",
        "Town": "Kaukauna",
        "StateOrProvince": "WI",
        "Postcode": "54130",
        "CountryID": 2,
        "Latitude": 44.297129,
        "Longitude": -88.27101,
        "ContactTelephone1": "920-759-1970",
        "AccessComments": "24 hours daily",
        "RelatedURL": "",
        "DistanceUnit": 0
    },
    "Connections": [
        {
            "ID": 79319,
            "ConnectionTypeID": 9,
            "LevelID": 1,
            "Amps": 16,
            "Voltage": 120,
            "PowerKW": 1.9,
            "CurrentTypeID": 10,
            "Quantity": 1
        }
    ],
    "DateLastStatusUpdate": "2020-06-26T03:07:00Z",
    "DataQualityLevel": 3,
    "DateCreated": "2016-03-03T11:39:00Z",
    "SubmissionStatusTypeID": 100
}