{
    "IsRecentlyVerified": false,
    "ID": 107264,
    "UUID": "1136A9A7-E273-409D-B4E9-BA93E7B0E302",
    "DataProviderID": 1,
    "OperatorID": 25,
    "OperatorsReference": "brent-watfordroad",
    "UsageTypeID": 4,
    "UsageCost": "£0.059/minute; min £1.18; other tariffs available",
    "AddressInfo": {
        "ID": 107610,
        "Title": "Watford Road",
        "AddressLine1": "Opposite 32a Watford Road",
        "Town": "Wembley",
        "Postcode": "HA0 3ER",
        "CountryID": 1,
        "Latitude": 51.556797,
        "Longitude": -0.317284,
        "DistanceUnit": 0
    },
    "Connections": [
        {
            "ID": 151302,
            "ConnectionTypeID": 25,
            "StatusTypeID": 50,
            "LevelID": 2,
            "Amps": 32,
            "Voltage": 230,
            "PowerKW": 7,
            "CurrentTypeID": 10,
            "Quantity": 1
        },
        {
            "ID": 151303,
            "ConnectionTypeID": 1,
            "StatusTypeID": 50,
            "LevelID": 2,
            "Amps": 16,
            "Voltage": 230,
            "PowerKW": 4,
            "CurrentTypeID": 10,
            "Quantity": 1
        }
    ],
    "NumberOfPoints": 1,
    "StatusTypeID": 50,
    "DateLastStatusUpdate": "2019-04-01T14:14:00Z",
    "DataQualityLevel": 1,
    "DateCreated": "2018-07-23T15:32:00Z",
    "SubmissionStatusTypeID": 200
}