{
    "IsRecentlyVerified": false,
    "ID": 148985,
    "UUID": "7146E64D-46F9-42BA-86DD-C906D63A1F5E",
    "DataProviderID": 1,
    "OperatorID": 3299,
    "UsageTypeID": 1,
    "UsageCost": "DKK 6.20 per kWh",
    "AddressInfo": {
        "ID": 149338,
        "Title": "Circle K - Fredericia",
        "AddressLine1": "Snaremosevej",
        "AddressLine2": "Nyhave Huse",
        "Town": "Snoghøj",
        "StateOrProvince": "Fredericia Municipality",
        "Postcode": "7000",
        "CountryID": 65,
        "Latitude": 55.536950290136815,
        "Longitude": 9.717774050095727,
        "DistanceUnit": 0
    },
    "Connections": [
        {
            "ID": 206899,
            "ConnectionTypeID": 33,
            "StatusTypeID": 50,
            "LevelID": 3,
            "PowerKW": 350,
            "CurrentTypeID": 30,
            "Quantity": 4
        }
    ],
    "NumberOfPoints": 4,
    "StatusTypeID": 50,
    "DateLastStatusUpdate": "2020-02-15T09:34:00Z",
    "DataQualityLevel": 1,
    "DateCreated": "2020-02-14T15:08:00Z",
    "SubmissionStatusTypeID": 200
}