{
    "IsRecentlyVerified": false,
    "ID": 184610,
    "UUID": "54842BF2-FD9C-455F-8007-5D80138C3596",
    "DataProviderID": 29,
    "DataProvidersReference": "485",
    "OperatorID": 45,
    "AddressInfo": {
        "ID": 184969,
        "Title": "Stuttgarter Str. 141",
        "AddressLine1": "Stuttgarter Str. 141",
        "Town": "Backnang",
        "Postcode": "71522",
        "CountryID": 87,
        "Latitude": 48.936228,
        "Longitude": 9.437821,
        "DistanceUnit": 0
    },
    "Connections": [
        {
            "ID": 293079,
            "ConnectionTypeID": 25,
            "StatusTypeID": 50,
            "LevelID": 2,
            "PowerKW": 22,
            "CurrentTypeID": 20
        },
        {
            "ID": 293080,
            "ConnectionTypeID": 25,
            "StatusTypeID": 50,
            "LevelID": 2,
            "PowerKW": 22,
            "CurrentTypeID": 20
        }
    ],
    "StatusTypeID": 50,
    "DateLastStatusUpdate": "2021-07-12T02:42:00Z",
    "MetadataValues": [
        {
            "ID": 16901,
            "MetadataFieldID": 4,
            "ItemValue": "Data from the German chargepoint registry provided by Bundesnetzagentur.de under the CC-BY 4.0 license"
        }
    ],
    "DataQualityLevel": 3,
    "DateCreated": "2021-07-08T10:05:00Z",
    "SubmissionStatusTypeID": 100
}