{
    "IsRecentlyVerified": false,
    "ID": 13741,
    "UUID": "E8AC9F64-7CA0-4FD2-8A55-1E36BD64169E",
    "DataProviderID": 15,
    "DataProvidersReference": "24186",
    "OperatorID": 42,
    "UsageTypeID": 1,
    "AddressInfo": {
        "ID": 13638,
        "Title": "2407 Beich Road",
        "AddressLine1": "2407 Beich Road",
        "Town": "Bloomington",
        "StateOrProvince": "IL",
        "Postcode": "61705",
        "CountryID": 2,
        "Latitude": 40.4479,
        "Longitude": -89.025,
        "ContactTelephone1": "3098274868",
        "RelatedURL": "http://carstations.com/24186",
        "DistanceUnit": 0
    },
    "Connections": [
        {
            "ID": 11190,
            "ConnectionTypeID": 1,
            "Reference": "J1772",
            "LevelID": 2
        }
    ],
    "NumberOfPoints": 1,
    "StatusTypeID": 50,
    "DateLastStatusUpdate": "2017-11-04T14:04:00Z",
    "DataQualityLevel": 2,
    "DateCreated": "2012-12-06T11:08:00Z",
    "SubmissionStatusTypeID": 100
}