{
    "IsRecentlyVerified": false,
    "ID": 31062,
    "UUID": "6A670402-D2D3-4238-93DE-A66A616E60E3",
    "DataProviderID": 1,
    "DataProvidersReference": "2211",
    "AddressInfo": {
        "ID": 31408,
        "Title": "Coop Extra Inderøy",
        "AddressLine1": "Sundfærveien 2",
        "Town": "INDERØY",
        "StateOrProvince": "Trøndelag",
        "Postcode": "7670",
        "CountryID": 168,
        "Latitude": 63.87357,
        "Longitude": 11.29001,
        "AccessComments": "På veggen til Coop Extra Inderøy",
        "DistanceUnit": 0
    },
    "Connections": [
        {
            "ID": 34291,
            "ConnectionTypeID": 0,
            "Reference": "1",
            "LevelID": 2,
            "Amps": 32,
            "Voltage": 400,
            "PowerKW": 22,
            "Comments": "Mode 3"
        }
    ],
    "NumberOfPoints": 1,
    "DateLastStatusUpdate": "2020-05-26T08:25:00Z",
    "DataQualityLevel": 2,
    "DateCreated": "2014-12-09T09:01:00Z",
    "SubmissionStatusTypeID": 100
}