{
    "IsRecentlyVerified": false,
    "ID": 102697,
    "UUID": "FD69E0D0-B69F-4293-B1AE-280E930C3EF9",
    "DataProviderID": 2,
    "DataProvidersReference": "65688",
    "UsageTypeID": 2,
    "AddressInfo": {
        "ID": 103043,
        "Title": "Smithsonian Museum Support Center",
        "AddressLine1": "4210 Silver Hill Rd",
        "Town": "Camp Springs",
        "StateOrProvince": "MD",
        "Postcode": "20746",
        "CountryID": 2,
        "Latitude": 38.841751,
        "Longitude": -76.938549,
        "ContactTelephone1": "",
        "AccessComments": "",
        "RelatedURL": "",
        "DistanceUnit": 0
    },
    "Connections": [
        {
            "ID": 144813,
            "ConnectionTypeID": 1,
            "LevelID": 2,
            "Amps": 16,
            "Voltage": 230,
            "PowerKW": 3.7,
            "CurrentTypeID": 10,
            "Quantity": 1
        }
    ],
    "DateLastStatusUpdate": "2020-06-26T03:00:00Z",
    "DataQualityLevel": 3,
    "DateCreated": "2018-04-21T04:13:00Z",
    "SubmissionStatusTypeID": 100
}