{
    "IsRecentlyVerified": false,
    "ID": 148471,
    "UUID": "AC2847C7-FB93-4E16-954D-F1B006CAA188",
    "DataProviderID": 1,
    "OperatorID": 103,
    "UsageTypeID": 1,
    "AddressInfo": {
        "ID": 148823,
        "Title": "Fivelgolaan",
        "AddressLine1": "Fivelgolaan",
        "AddressLine2": "West",
        "Town": "Groningen",
        "StateOrProvince": "Groningen",
        "Postcode": "9727DZ",
        "CountryID": 159,
        "Latitude": 53.19893376495949,
        "Longitude": 6.526537179599018,
        "RelatedURL": "https://openbaarladen.nl/",
        "DistanceUnit": 0
    },
    "Connections": [
        {
            "ID": 206126,
            "ConnectionTypeID": 25,
            "StatusTypeID": 50,
            "LevelID": 2,
            "Amps": 16,
            "Voltage": 400,
            "PowerKW": 11,
            "CurrentTypeID": 20,
            "Quantity": 2
        }
    ],
    "NumberOfPoints": 2,
    "StatusTypeID": 50,
    "DateLastStatusUpdate": "2020-02-03T16:45:00Z",
    "DataQualityLevel": 1,
    "DateCreated": "2020-02-03T08:31:00Z",
    "SubmissionStatusTypeID": 200
}