{
    "UserComments": [
        {
            "ID": 16074,
            "ChargePointID": 62945,
            "CommentTypeID": 10,
            "UserName": "Van Den Bossche Peter",
            "Comment": "",
            "Rating": 5,
            "DateCreated": "2017-03-19T15:33:10.63Z",
            "User": {
                "ID": 11673,
                "Username": "Van Den Bossche Peter"
            },
            "CheckinStatusTypeID": 10
        }
    ],
    "MediaItems": [
        {
            "ID": 10656,
            "ChargePointID": 62945,
            "ItemURL": "https://s3-ap-southeast-2.amazonaws.com/openchargemap/images/NL/OCM62945/OCM-62945.orig.2017031915352029.jpg",
            "ItemThumbnailURL": "https://s3-ap-southeast-2.amazonaws.com/openchargemap/images/NL/OCM62945/OCM-62945.thmb.2017031915352029.jpg",
            "Comment": "",
            "IsEnabled": true,
            "IsVideo": false,
            "IsFeaturedItem": false,
            "IsExternalResource": false,
            "User": {
                "ID": 11673,
                "Username": "Van Den Bossche Peter"
            },
            "DateCreated": "2017-03-19T15:36:00Z"
        }
    ],
    "IsRecentlyVerified": false,
    "ID": 62945,
    "UUID": "64AE6C45-04CD-4EB3-A3A7-192CC82AF548",
    "DataProviderID": 26,
    "DataProvidersReference": "75781",
    "OperatorID": 178,
    "OperatorsReference": "EVnetNL PNB-ENO127",
    "UsageCost": "0.00 jaarabonnement",
    "AddressInfo": {
        "ID": 63291,
        "Title": "Stationsplein 3e",
        "AddressLine1": "Stationsplein 3e",
        "Town": "Roosendaal",
        "Postcode": "4702 VX",
        "CountryID": 159,
        "Latitude": 51.54072,
        "Longitude": 4.461065,
        "ContactTelephone1": "0800-3522365",
        "RelatedURL": "http://www.evnet.nl",
        "DistanceUnit": 0
    },
    "Connections": [
        {
            "ID": 80009,
            "ConnectionTypeID": 25,
            "LevelID": 2,
            "PowerKW": 11,
            "CurrentTypeID": 10
        }
    ],
    "NumberOfPoints": 2,
    "StatusTypeID": 50,
    "DateLastStatusUpdate": "2017-03-19T15:36:00Z",
    "DataQualityLevel": 3,
    "DateCreated": "2016-03-03T12:29:00Z",
    "SubmissionStatusTypeID": 100
}