{
    "IsRecentlyVerified": false,
    "ID": 182461,
    "UUID": "1AB43A7C-34BC-4F43-AEE4-D7F5D0250FBB",
    "DataProviderID": 29,
    "DataProvidersReference": "7409",
    "AddressInfo": {
        "ID": 182820,
        "Title": "Gildestr. 26",
        "AddressLine1": "Gildestr. 26",
        "Town": "Werdohl",
        "Postcode": "58791",
        "CountryID": 87,
        "Latitude": 51.261574,
        "Longitude": 7.786229,
        "DistanceUnit": 0
    },
    "Connections": [
        {
            "ID": 288235,
            "ConnectionTypeID": 25,
            "StatusTypeID": 50,
            "LevelID": 2,
            "PowerKW": 22,
            "CurrentTypeID": 20
        },
        {
            "ID": 288236,
            "ConnectionTypeID": 25,
            "StatusTypeID": 50,
            "LevelID": 2,
            "PowerKW": 22,
            "CurrentTypeID": 20
        }
    ],
    "StatusTypeID": 50,
    "DateLastStatusUpdate": "2021-07-09T03:22:00Z",
    "MetadataValues": [
        {
            "ID": 14754,
            "MetadataFieldID": 4,
            "ItemValue": "Data from the German chargepoint registry provided by Bundesnetzagentur.de under the CC-BY 4.0 license"
        }
    ],
    "DataQualityLevel": 3,
    "DateCreated": "2021-07-08T10:03:00Z",
    "SubmissionStatusTypeID": 100
}