{
    "IsRecentlyVerified": false,
    "ID": 97193,
    "UUID": "02797796-DB75-4B2C-A3C9-D286A80C2A51",
    "DataProviderID": 1,
    "OperatorID": 1,
    "UsageTypeID": 0,
    "UsageCost": "Free",
    "AddressInfo": {
        "ID": 97539,
        "Title": "Carrefour Talavera de la Reina",
        "AddressLine1": "Antigua Carretera Nacional V, Km 104",
        "Town": "Talavera de la Reina",
        "StateOrProvince": "Toledo",
        "Postcode": "45600",
        "CountryID": 210,
        "Latitude": 39.9627453,
        "Longitude": -4.7960243,
        "AccessComments": "Inside the Los Alfares mall, look for Carrefour's covered parking. The four charging stations are close to the escalators.",
        "DistanceUnit": 0
    },
    "Connections": [
        {
            "ID": 138016,
            "ConnectionTypeID": 28,
            "LevelID": 2,
            "Amps": 16,
            "Voltage": 230,
            "PowerKW": 3.68,
            "Quantity": 4
        },
        {
            "ID": 138017,
            "ConnectionTypeID": 16,
            "LevelID": 2,
            "Amps": 16,
            "Voltage": 230,
            "PowerKW": 11,
            "Quantity": 3
        },
        {
            "ID": 138018,
            "ConnectionTypeID": 4,
            "LevelID": 2,
            "Amps": 16,
            "Voltage": 230,
            "PowerKW": 3.7,
            "Quantity": 3
        }
    ],
    "NumberOfPoints": 4,
    "GeneralComments": "Free parking, free charging.",
    "StatusTypeID": 50,
    "DateLastStatusUpdate": "2018-01-29T09:40:00Z",
    "DataQualityLevel": 1,
    "DateCreated": "2018-01-10T15:00:00Z",
    "SubmissionStatusTypeID": 200
}