{
    "IsRecentlyVerified": false,
    "ID": 99994,
    "UUID": "C6C47263-6BAB-4EB6-A9C9-FCF7F12B98AB",
    "DataProviderID": 1,
    "OperatorID": 23,
    "OperatorsReference": "40545",
    "UsageTypeID": 4,
    "AddressInfo": {
        "ID": 100340,
        "Title": "Marble Distilling Company",
        "AddressLine1": "150 Main St",
        "Town": "Carbondale",
        "StateOrProvince": "Colorado",
        "Postcode": "81623",
        "CountryID": 2,
        "Latitude": 39.400372,
        "Longitude": -107.207925,
        "ContactTelephone1": "(970) 963-7008",
        "DistanceUnit": 0
    },
    "Connections": [
        {
            "ID": 141246,
            "ConnectionTypeID": 30,
            "StatusTypeID": 50,
            "LevelID": 2,
            "PowerKW": 16,
            "CurrentTypeID": 20,
            "Quantity": 2
        }
    ],
    "NumberOfPoints": 2,
    "GeneralComments": "2 Tesla Connectors, up to 16kW.Available for customers. Please see front desk.",
    "StatusTypeID": 50,
    "DateLastStatusUpdate": "2018-02-09T06:50:00Z",
    "DataQualityLevel": 1,
    "DateCreated": "2018-02-09T06:50:00Z",
    "SubmissionStatusTypeID": 200
}