{
    "IsRecentlyVerified": false,
    "ID": 91111,
    "UUID": "5C9E5E56-16AC-40B9-BA09-369765881117",
    "DataProviderID": 1,
    "OperatorID": 220,
    "OperatorsReference": "4124",
    "UsageTypeID": 1,
    "UsageCost": "€1.73 + €0.3213/kWh; Andere Tarife möglich",
    "AddressInfo": {
        "ID": 91457,
        "Title": "Haubachstrasse 39",
        "AddressLine1": "Haubachstrasse 39",
        "Town": "Altona",
        "StateOrProvince": "Hamburg",
        "Postcode": "22765",
        "CountryID": 87,
        "Latitude": 53.55785,
        "Longitude": 9.93966,
        "DistanceUnit": 0
    },
    "Connections": [
        {
            "ID": 129186,
            "ConnectionTypeID": 25,
            "StatusTypeID": 50,
            "LevelID": 2,
            "Amps": 32,
            "Voltage": 400,
            "PowerKW": 22,
            "CurrentTypeID": 20,
            "Quantity": 2
        },
        {
            "ID": 129212,
            "ConnectionTypeID": 28,
            "StatusTypeID": 50,
            "LevelID": 2,
            "Amps": 16,
            "Voltage": 230,
            "PowerKW": 3.7,
            "CurrentTypeID": 10,
            "Quantity": 2
        }
    ],
    "NumberOfPoints": 2,
    "StatusTypeID": 50,
    "DateLastStatusUpdate": "2017-07-31T05:28:00Z",
    "DataQualityLevel": 1,
    "DateCreated": "2017-07-29T05:31:00Z",
    "SubmissionStatusTypeID": 200
}