{
    "IsRecentlyVerified": false,
    "ID": 64748,
    "UUID": "58DC5F4A-5CB2-4EBA-80CB-FF644532A048",
    "DataProviderID": 1,
    "OperatorID": 1239,
    "UsageTypeID": 4,
    "UsageCost": "7 CZK/kWh bez DPH (w/o VAT 21%)",
    "AddressInfo": {
        "ID": 65094,
        "Title": "Millenium Plaza",
        "AddressLine1": "V Celnici 10",
        "Town": "Praha 1",
        "StateOrProvince": "okres Hlavní město Praha",
        "Postcode": "110 00",
        "CountryID": 64,
        "Latitude": 50.08825,
        "Longitude": 14.43124,
        "ContactTelephone1": "+420 270 007 900",
        "ContactTelephone2": "+420 606 372 323",
        "ContactEmail": "info@polyfazer.cz",
        "AccessComments": "CZ: V garážích Millenium Plaza (-2p, u hotelu Mariott).\r\nEN: In Millenium Plaza garages (floor -2, close to Mariott hotel). ",
        "RelatedURL": "http://polyfazer.cz/",
        "DistanceUnit": 0
    },
    "Connections": [
        {
            "ID": 83240,
            "ConnectionTypeID": 25,
            "StatusTypeID": 50,
            "LevelID": 2,
            "Amps": 32,
            "Voltage": 400,
            "PowerKW": 22,
            "CurrentTypeID": 20,
            "Quantity": 1
        }
    ],
    "NumberOfPoints": 1,
    "GeneralComments": "CZ: Platba kartou prostřednictvím aplikace Polyfazer. \r\nEN: Payment using a debit/credit card via Polyfazer mobile application.",
    "StatusTypeID": 50,
    "DateLastStatusUpdate": "2016-06-27T17:24:00Z",
    "DataQualityLevel": 1,
    "DateCreated": "2016-03-16T15:43:00Z",
    "SubmissionStatusTypeID": 200
}