{
    "UserComments": [
        {
            "ID": 19760,
            "ChargePointID": 91590,
            "CommentTypeID": 10,
            "UserName": "Phevy",
            "Comment": "It's a bit of an odd setup with the charger at the far end of two (potential) parking spots. Only one spot is marked. A second could have easily been added West if it. Now the other charge spot is in a lane-way near the fire station.",
            "Rating": 3,
            "DateCreated": "2018-07-03T03:50:55.333Z",
            "User": {
                "ID": 15969,
                "Username": "Phevy"
            }
        }
    ],
    "MediaItems": [
        {
            "ID": 13134,
            "ChargePointID": 91590,
            "ItemURL": "https://s3-ap-southeast-2.amazonaws.com/openchargemap/images/CA/OCM91590/OCM-91590.orig.2017080803523859.jpg",
            "ItemThumbnailURL": "https://s3-ap-southeast-2.amazonaws.com/openchargemap/images/CA/OCM91590/OCM-91590.thmb.2017080803523859.jpg",
            "Comment": "Making operational.",
            "IsEnabled": true,
            "IsVideo": false,
            "IsFeaturedItem": false,
            "IsExternalResource": false,
            "User": {
                "ID": 15969,
                "Username": "Phevy"
            },
            "DateCreated": "2017-08-08T03:53:00Z"
        },
        {
            "ID": 13135,
            "ChargePointID": 91590,
            "ItemURL": "https://s3-ap-southeast-2.amazonaws.com/openchargemap/images/CA/OCM91590/OCM-91590.orig.2017080803530964.jpg",
            "ItemThumbnailURL": "https://s3-ap-southeast-2.amazonaws.com/openchargemap/images/CA/OCM91590/OCM-91590.thmb.2017080803530964.jpg",
            "Comment": "",
            "IsEnabled": true,
            "IsVideo": false,
            "IsFeaturedItem": false,
            "IsExternalResource": false,
            "User": {
                "ID": 15969,
                "Username": "Phevy"
            },
            "DateCreated": "2017-08-08T03:53:00Z"
        },
        {
            "ID": 13133,
            "ChargePointID": 91590,
            "ItemURL": "https://s3-ap-southeast-2.amazonaws.com/openchargemap/images/CA/OCM91590/OCM-91590.orig.2017080803490672.jpg",
            "ItemThumbnailURL": "https://s3-ap-southeast-2.amazonaws.com/openchargemap/images/CA/OCM91590/OCM-91590.thmb.2017080803490672.jpg",
            "Comment": "Making operational.",
            "IsEnabled": true,
            "IsVideo": false,
            "IsFeaturedItem": false,
            "IsExternalResource": false,
            "User": {
                "ID": 15969,
                "Username": "Phevy"
            },
            "DateCreated": "2017-08-08T03:49:00Z"
        }
    ],
    "IsRecentlyVerified": false,
    "ID": 91590,
    "UUID": "C595A5BA-6258-468C-8F2F-F4BA6CFA34F5",
    "DataProviderID": 1,
    "OperatorID": 1,
    "UsageTypeID": 1,
    "UsageCost": "free",
    "AddressInfo": {
        "ID": 91936,
        "Title": "Emma Street",
        "AddressLine1": "612 Emma Street",
        "Town": "Port Elgin",
        "StateOrProvince": "Ontario",
        "CountryID": 44,
        "Latitude": 44.4349714702614,
        "Longitude": -81.3896969409046,
        "DistanceUnit": 0
    },
    "Connections": [
        {
            "ID": 129839,
            "ConnectionTypeID": 1,
            "StatusTypeID": 50,
            "LevelID": 2,
            "Amps": 30,
            "Voltage": 240,
            "PowerKW": 12.5,
            "CurrentTypeID": 20,
            "Quantity": 2
        }
    ],
    "NumberOfPoints": 2,
    "GeneralComments": "Bruce Power, Plug’n Drive, Owen Sound Nissan and the Town of Saugeen Shores have teamed up to install an Electric Vehicle (EV) charging station beside the fire hall, at 612 Emma St.",
    "StatusTypeID": 50,
    "DateLastStatusUpdate": "2018-07-03T03:51:00Z",
    "DataQualityLevel": 1,
    "DateCreated": "2017-08-08T03:45:00Z",
    "SubmissionStatusTypeID": 200
}