{
    "IsRecentlyVerified": false,
    "ID": 27826,
    "UUID": "CB7EC204-A4A8-4C9F-9EFD-76770C45A8EC",
    "DataProviderID": 2,
    "DataProvidersReference": "43201",
    "OperatorID": 5,
    "UsageTypeID": 1,
    "AddressInfo": {
        "ID": 28172,
        "Title": "EVSP WALGREENS",
        "AddressLine1": "4051 Douglas Blvd",
        "Town": "Granite Bay",
        "StateOrProvince": "CA",
        "Postcode": "95746",
        "CountryID": 2,
        "Latitude": 38.7440723,
        "Longitude": -121.2244833,
        "ContactTelephone1": "888-758-4389",
        "AccessComments": "24 hours daily",
        "RelatedURL": "http://www.chargepoint.com/",
        "DistanceUnit": 0
    },
    "Connections": [
        {
            "ID": 30548,
            "ConnectionTypeID": 1,
            "LevelID": 2,
            "Amps": 16,
            "Voltage": 230,
            "PowerKW": 3,
            "CurrentTypeID": 10,
            "Quantity": 2
        }
    ],
    "DateLastStatusUpdate": "2019-04-06T04:03:00Z",
    "DataQualityLevel": 3,
    "DateCreated": "2014-11-28T03:38:00Z",
    "SubmissionStatusTypeID": 100
}