{
    "IsRecentlyVerified": false,
    "ID": 84619,
    "UUID": "A5E4FEBB-5343-46D2-9DFE-A59599D8B064",
    "DataProviderID": 1,
    "OperatorID": 45,
    "UsageTypeID": 1,
    "AddressInfo": {
        "ID": 84965,
        "Title": "Baumarkt Obi",
        "AddressLine1": "Erbeweg 22",
        "Town": "Porta Westfalica",
        "StateOrProvince": "Kreis Minden-Lübbecke",
        "Postcode": "32457",
        "CountryID": 87,
        "Latitude": 51.4656494,
        "Longitude": 12.648569100000032,
        "ContactTelephone1": "+49 571 64 56 59-0",
        "AccessComments": "Mit Schranke verschlossener Parkplatz, von Mo-Sa 7-20Uhr geöffnet. 2 grün markierte Parkplätze mit oranger Säule direkt am Gebäude. Kostenlos und ohne Ladekarte - einfach der Anleitung an der Säule folgen.",
        "DistanceUnit": 0
    },
    "Connections": [
        {
            "ID": 120191,
            "ConnectionTypeID": 25,
            "StatusTypeID": 50,
            "LevelID": 2,
            "Amps": 16,
            "Voltage": 400,
            "PowerKW": 11,
            "CurrentTypeID": 20,
            "Quantity": 2
        }
    ],
    "NumberOfPoints": 2,
    "GeneralComments": "Leistung unbekannt, daher mit 11 kW eingetragen",
    "StatusTypeID": 50,
    "DateLastStatusUpdate": "2017-03-06T07:21:00Z",
    "DataQualityLevel": 1,
    "DateCreated": "2017-03-06T07:21:00Z",
    "SubmissionStatusTypeID": 200
}