{
    "UserComments": [
        {
            "ID": 23458,
            "ChargePointID": 108402,
            "CommentTypeID": 10,
            "UserName": "MobilitàElettrica RM",
            "Comment": "Colonnina all'interno del parcheggio del Supermercato IN'S, accesso dal lato del comune. Attenzione, segue gli orari del supermercato, non è operativa H24",
            "Rating": 3,
            "DateCreated": "2020-10-29T17:02:08.947Z",
            "User": {
                "ID": 19007,
                "Username": "MobilitàElettrica RM"
            },
            "CheckinStatusTypeID": 10,
            "IsActionedByEditor": false
        }
    ],
    "IsRecentlyVerified": false,
    "ID": 108402,
    "UUID": "1BB0316B-ECE6-415E-B9C9-8CD7BD7C8832",
    "DataProviderID": 1,
    "UsageTypeID": 4,
    "UsageCost": " 4 € / hour",
    "AddressInfo": {
        "ID": 108748,
        "Title": "IN'S Mercato Nettuno| Lampionet",
        "AddressLine1": "Viale Ugo La Malfa, 9",
        "Town": "Nettuno",
        "StateOrProvince": "RM",
        "Postcode": "00048",
        "CountryID": 112,
        "Latitude": 41.464083803379566,
        "Longitude": 12.663522332368984,
        "ContactTelephone1": "3459729074",
        "RelatedURL": "https://insmercato.it",
        "DistanceUnit": 0
    },
    "Connections": [
        {
            "ID": 153266,
            "ConnectionTypeID": 25,
            "StatusTypeID": 50,
            "LevelID": 2,
            "Quantity": 2
        }
    ],
    "NumberOfPoints": 2,
    "GeneralComments": "http://www.lampionet.it",
    "StatusTypeID": 50,
    "DateLastStatusUpdate": "2020-10-29T17:02:00Z",
    "DataQualityLevel": 1,
    "DateCreated": "2018-09-28T12:45:00Z",
    "SubmissionStatusTypeID": 200
}