{
    "IsRecentlyVerified": false,
    "ID": 123129,
    "UUID": "3DD56D01-5654-4B73-95CA-E1DB1F8BF6E1",
    "DataProviderID": 2,
    "DataProvidersReference": "44380",
    "UsageTypeID": 1,
    "AddressInfo": {
        "ID": 123475,
        "Title": "Central Carolina Community College & Community Library",
        "AddressLine1": "764 West St",
        "Town": "Pittsboro",
        "StateOrProvince": "NC",
        "Postcode": "27312",
        "CountryID": 2,
        "Latitude": 35.724183,
        "Longitude": -79.189641,
        "ContactTelephone1": "800-682-8353",
        "AccessComments": "24 hours daily",
        "RelatedURL": "",
        "DistanceUnit": 0
    },
    "Connections": [
        {
            "ID": 173071,
            "ConnectionTypeID": 1,
            "LevelID": 2,
            "Amps": 16,
            "Voltage": 230,
            "PowerKW": 3,
            "CurrentTypeID": 10,
            "Quantity": 2
        }
    ],
    "DateLastStatusUpdate": "2019-04-06T05:03:00Z",
    "DataQualityLevel": 3,
    "DateCreated": "2019-04-06T05:03:00Z",
    "SubmissionStatusTypeID": 100
}