{
    "IsRecentlyVerified": false,
    "ID": 33685,
    "UUID": "101AA185-B6D1-4CC8-BA13-A563F7A5C6F6",
    "DataProviderID": 26,
    "DataProvidersReference": "49261",
    "OperatorID": 157,
    "OperatorsReference": "NewMotion 02008104",
    "UsageCost": "0.00 jaarabonnement",
    "AddressInfo": {
        "ID": 34031,
        "Title": "Larenweg 24",
        "AddressLine1": "Larenweg 24",
        "Town": "'s-Hertogenbosch",
        "Postcode": "5234 KA",
        "CountryID": 159,
        "Latitude": 51.7217933,
        "Longitude": 5.29135220000001,
        "ContactTelephone1": "088 0109500",
        "RelatedURL": "http://thenewmotion.nl/",
        "DistanceUnit": 0
    },
    "Connections": [
        {
            "ID": 37196,
            "ConnectionTypeID": 25,
            "LevelID": 2,
            "PowerKW": 3.7,
            "CurrentTypeID": 10
        }
    ],
    "NumberOfPoints": 1,
    "StatusTypeID": 50,
    "DateLastStatusUpdate": "2016-06-04T02:40:00Z",
    "DataQualityLevel": 3,
    "DateCreated": "2015-01-09T06:04:00Z",
    "SubmissionStatusTypeID": 100
}