{
    "IsRecentlyVerified": false,
    "ID": 97007,
    "UUID": "B0B33DC9-1261-4060-8BCD-D14B4A0CE018",
    "DataProviderID": 1,
    "DataProvidersReference": "4626",
    "AddressInfo": {
        "ID": 97353,
        "Title": "Lillesand Senter",
        "AddressLine1": "Senterveien 30",
        "Town": "LILLESAND",
        "StateOrProvince": "Agder",
        "Postcode": "4790",
        "CountryID": 168,
        "Latitude": 58.26281,
        "Longitude": 8.39591,
        "AccessComments": "",
        "DistanceUnit": 0
    },
    "Connections": [
        {
            "ID": 137449,
            "ConnectionTypeID": 0,
            "Reference": "1",
            "LevelID": 2,
            "Amps": 100,
            "Voltage": 500,
            "PowerKW": 50,
            "Comments": "Mode 4"
        },
        {
            "ID": 145672,
            "ConnectionTypeID": 0,
            "Reference": "2",
            "LevelID": 2,
            "Amps": 100,
            "Voltage": 500,
            "PowerKW": 50,
            "Comments": "Mode 4"
        },
        {
            "ID": 145673,
            "ConnectionTypeID": 0,
            "Reference": "3",
            "LevelID": 2,
            "Amps": 32,
            "Voltage": 400,
            "PowerKW": 22,
            "Comments": "Mode 3"
        },
        {
            "ID": 150394,
            "ConnectionTypeID": 0,
            "Reference": "4",
            "LevelID": 2,
            "Amps": 32,
            "Voltage": 400,
            "PowerKW": 22,
            "Comments": "Mode 3"
        }
    ],
    "NumberOfPoints": 4,
    "DateLastStatusUpdate": "2020-05-26T08:21:00Z",
    "DataQualityLevel": 2,
    "DateCreated": "2018-01-04T08:28:00Z",
    "SubmissionStatusTypeID": 100
}