{
    "IsRecentlyVerified": false,
    "ID": 135977,
    "UUID": "530046FE-9113-4176-AA39-746740CCE594",
    "DataProviderID": 18,
    "DataProvidersReference": "c8fcd3fb8ac2645797d096c8993e066c",
    "OperatorID": 2244,
    "UsageTypeID": 5,
    "AddressInfo": {
        "ID": 136323,
        "Title": "Marlborough Lane",
        "AddressLine1": "Marlborough Lane",
        "Town": "London",
        "Postcode": "SE7 7DE",
        "CountryID": 1,
        "Latitude": 51.477166,
        "Longitude": 0.033252,
        "AccessComments": "",
        "RelatedURL": "https://www.ubitricity.com",
        "DistanceUnit": 0
    },
    "Connections": [
        {
            "ID": 190404,
            "ConnectionTypeID": 25,
            "Reference": "suby1100001005",
            "StatusTypeID": 50,
            "LevelID": 2,
            "Amps": 16,
            "Voltage": 230,
            "PowerKW": 3.7,
            "CurrentTypeID": 10
        }
    ],
    "StatusTypeID": 0,
    "DateLastStatusUpdate": "2021-04-25T05:46:00Z",
    "MetadataValues": [
        {
            "ID": 5829,
            "MetadataFieldID": 4,
            "ItemValue": "Contains public sector information licensed under the Open Government Licence v2.0. http://www.nationalarchives.gov.uk/doc/open-government-licence/version/2/"
        }
    ],
    "DataQualityLevel": 3,
    "DateCreated": "2019-12-24T05:22:00Z",
    "SubmissionStatusTypeID": 100
}