{
    "IsRecentlyVerified": false,
    "ID": 106415,
    "UUID": "1464ED85-38D7-4A9F-A4BA-AC8C15AFA41D",
    "DataProviderID": 1,
    "OperatorID": 101,
    "UsageTypeID": 4,
    "AddressInfo": {
        "ID": 106761,
        "Title": "Oberer Bach",
        "AddressLine1": "Oberer Bach 5",
        "Town": "Künzelsau",
        "StateOrProvince": "Hohenlohekreis",
        "Postcode": "74653",
        "CountryID": 87,
        "Latitude": 49.2774224,
        "Longitude": 9.688912100000039,
        "AccessComments": "24/7 nutzbar direkt neben dem Parkscheinautomaten.",
        "DistanceUnit": 0
    },
    "Connections": [
        {
            "ID": 149786,
            "ConnectionTypeID": 25,
            "StatusTypeID": 50,
            "LevelID": 2,
            "Amps": 32,
            "Voltage": 400,
            "PowerKW": 22,
            "CurrentTypeID": 20,
            "Quantity": 2
        }
    ],
    "NumberOfPoints": 2,
    "StatusTypeID": 50,
    "DateLastStatusUpdate": "2018-06-22T06:49:00Z",
    "DataQualityLevel": 1,
    "DateCreated": "2018-06-22T06:49:00Z",
    "SubmissionStatusTypeID": 200
}