{
    "IsRecentlyVerified": false,
    "ID": 29603,
    "UUID": "0A6BAEA1-7921-4108-A080-ED59AD6DB10C",
    "DataProviderID": 15,
    "DataProvidersReference": "22300",
    "OperatorID": 1,
    "UsageTypeID": 1,
    "AddressInfo": {
        "ID": 29949,
        "Title": "4400 U.S. Highway 78",
        "AddressLine1": "4400 U.S. Highway 78",
        "Town": "Stone Mountain",
        "StateOrProvince": "GA",
        "Postcode": "30087",
        "CountryID": 2,
        "Latitude": 33.833568,
        "Longitude": -84.082559,
        "ContactTelephone1": "800-768-3693",
        "RelatedURL": "http://carstations.com/22300",
        "DistanceUnit": 0
    },
    "Connections": [
        {
            "ID": 32588,
            "ConnectionTypeID": 1,
            "Reference": "J1772",
            "LevelID": 2
        }
    ],
    "NumberOfPoints": 2,
    "StatusTypeID": 50,
    "DateLastStatusUpdate": "2017-11-04T14:04:00Z",
    "DataQualityLevel": 2,
    "DateCreated": "2014-11-29T05:39:00Z",
    "SubmissionStatusTypeID": 100
}