{
    "IsRecentlyVerified": false,
    "ID": 166502,
    "UUID": "3B125A37-CD2E-4BAA-8066-341A876CAD4F",
    "DataProviderID": 28,
    "DataProvidersReference": "FR*S28*PSDE28*AUT1",
    "UsageTypeID": 5,
    "AddressInfo": {
        "ID": 166861,
        "Title": "Authon-du-Perche | Place de la Mairie",
        "AddressLine1": "Place de la Mairie 28330 Authon-du-Perche",
        "CountryID": 80,
        "Latitude": 48.194984,
        "Longitude": 0.896908,
        "AccessComments": "24/24 7/7",
        "DistanceUnit": 0
    },
    "Connections": [
        {
            "ID": 248841,
            "ConnectionTypeID": 1036,
            "StatusTypeID": 50,
            "LevelID": 2,
            "PowerKW": 22,
            "CurrentTypeID": 20
        },
        {
            "ID": 248842,
            "ConnectionTypeID": 26,
            "StatusTypeID": 50,
            "LevelID": 2,
            "PowerKW": 22
        },
        {
            "ID": 248843,
            "ConnectionTypeID": 28,
            "StatusTypeID": 50,
            "LevelID": 2,
            "PowerKW": 22,
            "CurrentTypeID": 10
        }
    ],
    "GeneralComments": "",
    "StatusTypeID": 50,
    "DateLastStatusUpdate": "2020-08-27T05:14:00Z",
    "DataQualityLevel": 2,
    "DateCreated": "2020-08-27T05:14:00Z",
    "SubmissionStatusTypeID": 100
}