{
    "IsRecentlyVerified": false,
    "ID": 64180,
    "UUID": "6B0B62B0-A21B-49DE-9BD9-81AFF1774431",
    "DataProviderID": 26,
    "DataProvidersReference": "76524",
    "OperatorID": 103,
    "OperatorsReference": "Allego NLALLEGO0003792",
    "UsageCost": "0.00 jaarabonnement",
    "AddressInfo": {
        "ID": 64526,
        "Title": "De Citrus 4",
        "AddressLine1": "De Citrus 4",
        "Town": "Leeuwarden",
        "Postcode": "8934 CM",
        "CountryID": 159,
        "Latitude": 53.19233801,
        "Longitude": 5.81411793,
        "ContactTelephone1": "0800-3745337",
        "RelatedURL": "http://www.allego.eu/",
        "DistanceUnit": 0
    },
    "Connections": [
        {
            "ID": 82092,
            "ConnectionTypeID": 25,
            "LevelID": 2,
            "PowerKW": 11,
            "CurrentTypeID": 10
        },
        {
            "ID": 82093,
            "ConnectionTypeID": 25,
            "LevelID": 2,
            "PowerKW": 11,
            "CurrentTypeID": 10
        }
    ],
    "NumberOfPoints": 1,
    "StatusTypeID": 50,
    "DateLastStatusUpdate": "2016-06-04T02:56:00Z",
    "DataQualityLevel": 3,
    "DateCreated": "2016-03-03T12:33:00Z",
    "SubmissionStatusTypeID": 100
}