{
    "IsRecentlyVerified": false,
    "ID": 114767,
    "UUID": "88CFED95-AF43-4A7C-8BF7-BEF4D96A942F",
    "DataProviderID": 1,
    "OperatorID": 203,
    "UsageTypeID": 5,
    "UsageCost": "£0.36/kWh",
    "AddressInfo": {
        "ID": 115113,
        "Title": "The Bobbin Carrier Pub Cleckheaton",
        "AddressLine1": "Centurion Way",
        "Town": "Cleckheaton",
        "Postcode": "BD19 3QE",
        "CountryID": 1,
        "Latitude": 53.735525,
        "Longitude": -1.722818,
        "RelatedURL": "https://ospreycharging.co.uk/ev-drivers/",
        "DistanceUnit": 0
    },
    "Connections": [
        {
            "ID": 161511,
            "ConnectionTypeID": 33,
            "StatusTypeID": 50,
            "LevelID": 3,
            "PowerKW": 50,
            "CurrentTypeID": 30,
            "Quantity": 2
        },
        {
            "ID": 161512,
            "ConnectionTypeID": 2,
            "StatusTypeID": 50,
            "LevelID": 3,
            "PowerKW": 50,
            "CurrentTypeID": 30,
            "Quantity": 2
        },
        {
            "ID": 161513,
            "ConnectionTypeID": 25,
            "StatusTypeID": 50,
            "LevelID": 2,
            "PowerKW": 22,
            "CurrentTypeID": 20,
            "Quantity": 2
        }
    ],
    "NumberOfPoints": 2,
    "StatusTypeID": 50,
    "DateLastStatusUpdate": "2020-10-06T19:04:00Z",
    "DataQualityLevel": 1,
    "DateCreated": "2019-01-14T17:16:00Z",
    "SubmissionStatusTypeID": 200
}