{
    "IsRecentlyVerified": false,
    "ID": 122296,
    "UUID": "3E0C1D1B-A2E9-48E6-B528-9509641FC2B9",
    "DataProviderID": 2,
    "DataProvidersReference": "94736",
    "OperatorID": 3372,
    "UsageTypeID": 1,
    "AddressInfo": {
        "ID": 122642,
        "Title": "LA Fitness",
        "AddressLine1": "13822 Garvey Ave",
        "Town": "Baldwin Park",
        "StateOrProvince": "CA",
        "Postcode": "91706",
        "CountryID": 2,
        "Latitude": 34.069363,
        "Longitude": -117.973954,
        "ContactTelephone1": "866-816-7584",
        "AccessComments": "Business hours",
        "RelatedURL": "http://evconnect.com/",
        "DistanceUnit": 0
    },
    "Connections": [
        {
            "ID": 172177,
            "ConnectionTypeID": 1,
            "LevelID": 2,
            "Amps": 16,
            "Voltage": 230,
            "PowerKW": 3.7,
            "CurrentTypeID": 10,
            "Quantity": 20
        }
    ],
    "DateLastStatusUpdate": "2020-06-26T02:56:00Z",
    "DataQualityLevel": 3,
    "DateCreated": "2019-04-06T05:02:00Z",
    "SubmissionStatusTypeID": 100
}