{
    "IsRecentlyVerified": false,
    "ID": 73754,
    "UUID": "4A8BE7B4-CED0-4494-AB6A-3571AE5B4469",
    "DataProviderID": 1,
    "OperatorID": 89,
    "OperatorsReference": "AAA-241",
    "UsageTypeID": 4,
    "UsageCost": "Free",
    "AddressInfo": {
        "ID": 74100,
        "Title": "Ville de Joliette-614 Rue Manseau",
        "AddressLine1": "614 boul. Manseau",
        "Town": "Joliette",
        "StateOrProvince": "QC",
        "Postcode": "J6E 3E4",
        "CountryID": 44,
        "Latitude": 46.023474,
        "Longitude": -73.442641,
        "DistanceUnit": 0
    },
    "Connections": [
        {
            "ID": 106055,
            "ConnectionTypeID": 1,
            "StatusTypeID": 50,
            "LevelID": 2,
            "Amps": 32,
            "Voltage": 230,
            "PowerKW": 7,
            "CurrentTypeID": 10,
            "Quantity": 1
        }
    ],
    "NumberOfPoints": 1,
    "StatusTypeID": 50,
    "DateLastStatusUpdate": "2017-01-22T19:36:00Z",
    "DataQualityLevel": 1,
    "DateCreated": "2016-11-23T22:58:00Z",
    "SubmissionStatusTypeID": 200
}