{
    "IsRecentlyVerified": false,
    "ID": 92444,
    "UUID": "B78E7880-E649-40D2-AAC1-D73AD7C500F4",
    "DataProviderID": 1,
    "OperatorID": 3,
    "OperatorsReference": "PSL-102615",
    "UsageTypeID": 2,
    "UsageCost": "Free",
    "AddressInfo": {
        "ID": 92790,
        "Title": "Chassis Cab",
        "AddressLine1": "Addison Way",
        "Town": "Ipswich",
        "Postcode": "IP6 0RL",
        "CountryID": 1,
        "Latitude": 52.105428,
        "Longitude": 1.092808,
        "DistanceUnit": 0
    },
    "Connections": [
        {
            "ID": 131045,
            "ConnectionTypeID": 25,
            "StatusTypeID": 50,
            "LevelID": 2,
            "Amps": 32,
            "Voltage": 400,
            "PowerKW": 22,
            "CurrentTypeID": 20,
            "Quantity": 1
        }
    ],
    "NumberOfPoints": 2,
    "GeneralComments": "This is an private Solo unit installed at Ipswich at Chassis Cab Ltd Truck Centre",
    "StatusTypeID": 50,
    "DateLastStatusUpdate": "2018-03-11T06:37:00Z",
    "DataQualityLevel": 1,
    "DateCreated": "2017-09-07T05:29:00Z",
    "SubmissionStatusTypeID": 200
}