{
    "IsRecentlyVerified": false,
    "ID": 139189,
    "UUID": "E24C8529-9F99-44C0-A39B-5F4DBEB14098",
    "DataProviderID": 2,
    "DataProvidersReference": "148834",
    "OperatorID": 39,
    "UsageTypeID": 1,
    "AddressInfo": {
        "ID": 139541,
        "Title": "1500 Quail Property LLC",
        "AddressLine1": "1500 Quail Street",
        "Town": "Newport Beach",
        "StateOrProvince": "CA",
        "Postcode": "92660",
        "CountryID": 2,
        "Latitude": 33.661883,
        "Longitude": -117.8690087,
        "ContactTelephone1": "800-663-5633",
        "AccessComments": "MO: 12:00am-12:00am; TU: 12:00am-12:00am; WE: 12:00am-12:00am; TH: 12:00am-12:00am; FR: 12:00am-12:00am; SA: 12:00am-12:00am; SU: 12:00am-12:00am",
        "RelatedURL": "http://www.semacharge.com/",
        "DistanceUnit": 0
    },
    "Connections": [
        {
            "ID": 194459,
            "ConnectionTypeID": 1,
            "LevelID": 2,
            "Amps": 16,
            "Voltage": 230,
            "PowerKW": 3.7,
            "CurrentTypeID": 10,
            "Quantity": 4
        }
    ],
    "StatusTypeID": 50,
    "DateLastStatusUpdate": "2020-06-26T02:55:00Z",
    "DataQualityLevel": 3,
    "DateCreated": "2019-12-24T09:10:00Z",
    "SubmissionStatusTypeID": 100
}