{
    "UserComments": [
        {
            "ID": 17299,
            "ChargePointID": 57907,
            "CommentTypeID": 10,
            "UserName": "Tolbxela",
            "Comment": "Am 14.05.2017 mit CHAdeMO getankt und kostenlos geparkt. Super zufrieden! :-) Danke Celle! Wir kommen wieder!",
            "Rating": 5,
            "DateCreated": "2017-05-16T16:56:32.993Z",
            "User": {
                "ID": 15481,
                "Username": "Tolbxela"
            },
            "CheckinStatusTypeID": 10
        }
    ],
    "IsRecentlyVerified": false,
    "ID": 57907,
    "UUID": "3A9150FD-593D-431E-BC42-C90C76AC94E4",
    "DataProviderID": 1,
    "OperatorID": 45,
    "UsageTypeID": 1,
    "UsageCost": "0,49/KWh + 0,58/ Session",
    "AddressInfo": {
        "ID": 58253,
        "Title": "Mühlenstraße",
        "AddressLine1": "Mühlenstraße 12",
        "Town": "Celle",
        "StateOrProvince": "Niedersachsen",
        "Postcode": "29221",
        "CountryID": 87,
        "Latitude": 52.6254451,
        "Longitude": 10.077319,
        "AccessComments": "Neben den Behindertenparkplätzen. Typ2 mit Kabel und Stecker. Rund um die Uhr (24/7) , zur Zeit (20.1.16) ohne Ladekarte nutzbar. \r\nKostenlose Parken bis 2 Stunden.",
        "DistanceUnit": 0
    },
    "Connections": [
        {
            "ID": 73466,
            "ConnectionTypeID": 25,
            "StatusTypeID": 50,
            "LevelID": 2,
            "PowerKW": 22,
            "CurrentTypeID": 20,
            "Quantity": 1
        },
        {
            "ID": 75050,
            "ConnectionTypeID": 2,
            "StatusTypeID": 50,
            "LevelID": 3,
            "PowerKW": 20,
            "CurrentTypeID": 30,
            "Quantity": 1
        },
        {
            "ID": 75051,
            "ConnectionTypeID": 33,
            "StatusTypeID": 50,
            "LevelID": 3,
            "PowerKW": 20,
            "CurrentTypeID": 30,
            "Quantity": 1
        }
    ],
    "NumberOfPoints": 3,
    "StatusTypeID": 50,
    "DateLastStatusUpdate": "2021-09-24T16:14:00Z",
    "DataQualityLevel": 1,
    "DateCreated": "2015-12-27T22:58:00Z",
    "SubmissionStatusTypeID": 200
}