{
    "IsRecentlyVerified": false,
    "ID": 90717,
    "UUID": "AB9DEFD4-DC80-4690-95EF-FEEED1B15923",
    "DataProviderID": 1,
    "OperatorID": 23,
    "OperatorsReference": "32081",
    "UsageTypeID": 4,
    "AddressInfo": {
        "ID": 91063,
        "Title": "Homewood Suites Charlotte Ayresly",
        "AddressLine1": "1921 Ayrsley Town BLVD",
        "Town": "Charlotte",
        "StateOrProvince": "North Carolina",
        "Postcode": "28273",
        "CountryID": 2,
        "Latitude": 35.137302,
        "Longitude": -80.931188,
        "ContactTelephone1": "(704) 970-5500",
        "DistanceUnit": 0
    },
    "Connections": [
        {
            "ID": 128440,
            "ConnectionTypeID": 30,
            "StatusTypeID": 50,
            "LevelID": 2,
            "PowerKW": 8,
            "CurrentTypeID": 10,
            "Quantity": 2
        }
    ],
    "NumberOfPoints": 2,
    "GeneralComments": "2 Tesla Connectors, up to 8kW.Available for customers. Please see front desk.",
    "StatusTypeID": 50,
    "DateLastStatusUpdate": "2017-07-22T05:37:00Z",
    "DataQualityLevel": 1,
    "DateCreated": "2017-07-22T05:37:00Z",
    "SubmissionStatusTypeID": 200
}