{
    "IsRecentlyVerified": false,
    "ID": 120468,
    "UUID": "6F4B9D54-D188-4F43-84AE-5735FE1267AF",
    "DataProviderID": 2,
    "DataProvidersReference": "80995",
    "OperatorID": 5,
    "UsageTypeID": 1,
    "AddressInfo": {
        "ID": 120814,
        "Title": "THE ALEXAN",
        "AddressLine1": "3333 Harry Hines Blvd",
        "Town": "Dallas",
        "StateOrProvince": "TX",
        "Postcode": "75201",
        "CountryID": 2,
        "Latitude": 32.797622,
        "Longitude": -96.814159,
        "ContactTelephone1": "888-758-4389",
        "AccessComments": "24 hours daily",
        "RelatedURL": "http://www.chargepoint.com/",
        "DistanceUnit": 0
    },
    "Connections": [
        {
            "ID": 169818,
            "ConnectionTypeID": 1,
            "LevelID": 2,
            "Amps": 16,
            "Voltage": 230,
            "PowerKW": 3,
            "CurrentTypeID": 10,
            "Quantity": 4
        }
    ],
    "DateLastStatusUpdate": "2019-12-24T09:09:00Z",
    "DataQualityLevel": 3,
    "DateCreated": "2019-04-01T04:59:00Z",
    "SubmissionStatusTypeID": 100
}