{
    "IsRecentlyVerified": false,
    "ID": 72603,
    "UUID": "C11D3246-0F86-422F-88DF-2A8C3966D85C",
    "DataProviderID": 1,
    "OperatorID": 45,
    "UsageTypeID": 1,
    "AddressInfo": {
        "ID": 72949,
        "Title": "Supermarkt Lidl",
        "AddressLine1": "Stockholtweg 100",
        "Town": "Mönchengladbach",
        "StateOrProvince": "Mönchengladbach",
        "Postcode": "41238",
        "CountryID": 87,
        "Latitude": 51.1652333329683,
        "Longitude": 6.460652186508233,
        "AccessComments": "Während der Öffnungszeiten nutzbar Mo-Sa 8-21Uhr.",
        "DistanceUnit": 0
    },
    "Connections": [
        {
            "ID": 104074,
            "ConnectionTypeID": 2,
            "StatusTypeID": 50,
            "LevelID": 3,
            "PowerKW": 50,
            "CurrentTypeID": 30,
            "Quantity": 1
        },
        {
            "ID": 104075,
            "ConnectionTypeID": 33,
            "StatusTypeID": 50,
            "LevelID": 3,
            "PowerKW": 50,
            "CurrentTypeID": 30,
            "Quantity": 1
        },
        {
            "ID": 104076,
            "ConnectionTypeID": 1036,
            "StatusTypeID": 50,
            "LevelID": 3,
            "Amps": 63,
            "Voltage": 400,
            "PowerKW": 43,
            "CurrentTypeID": 20,
            "Quantity": 1
        }
    ],
    "NumberOfPoints": 3,
    "GeneralComments": "Neueröffnung am 3.11.2016",
    "StatusTypeID": 50,
    "DateLastStatusUpdate": "2016-10-27T06:50:00Z",
    "DataQualityLevel": 1,
    "DateCreated": "2016-10-27T06:50:00Z",
    "SubmissionStatusTypeID": 200
}