{
    "MediaItems": [
        {
            "ID": 8625,
            "ChargePointID": 73361,
            "ItemURL": "https://s3-ap-southeast-2.amazonaws.com/openchargemap/images/CA/OCM73361/OCM-73361.orig.2016112108595726.jpg",
            "ItemThumbnailURL": "https://s3-ap-southeast-2.amazonaws.com/openchargemap/images/CA/OCM73361/OCM-73361.thmb.2016112108595726.jpg",
            "Comment": "",
            "IsEnabled": true,
            "IsVideo": false,
            "IsFeaturedItem": false,
            "IsExternalResource": false,
            "User": {
                "ID": 12040,
                "Username": "adaviel"
            },
            "DateCreated": "2016-11-21T09:00:00Z"
        }
    ],
    "IsRecentlyVerified": false,
    "ID": 73361,
    "UUID": "2370DA71-D60B-4D5E-995B-2FBF26F51A7F",
    "DataProviderID": 1,
    "OperatorID": 5,
    "UsageTypeID": 6,
    "AddressInfo": {
        "ID": 73707,
        "Title": "BMW",
        "AddressLine1": "13091 Vanier Place",
        "Town": "Richmond",
        "StateOrProvince": "BC",
        "CountryID": 44,
        "Latitude": 49.183979,
        "Longitude": -123.07941,
        "DistanceUnit": 0
    },
    "Connections": [
        {
            "ID": 105555,
            "ConnectionTypeID": 1,
            "StatusTypeID": 50,
            "LevelID": 2,
            "CurrentTypeID": 10,
            "Quantity": 2
        }
    ],
    "NumberOfPoints": 1,
    "StatusTypeID": 50,
    "DateLastStatusUpdate": "2016-11-21T17:00:00Z",
    "DataQualityLevel": 1,
    "DateCreated": "2016-11-21T09:00:00Z",
    "SubmissionStatusTypeID": 200
}