{
    "IsRecentlyVerified": false,
    "ID": 45206,
    "UUID": "48CCAA86-2F58-4B0A-8DC2-89BB8347B350",
    "DataProviderID": 1,
    "OperatorID": 105,
    "UsageTypeID": 1,
    "UsageCost": "0",
    "AddressInfo": {
        "ID": 45552,
        "Title": "E-Bike Station Amigos Café Bar",
        "AddressLine1": "Mühlenstraße 14",
        "Town": "Drensteinfurt",
        "Postcode": "48317",
        "CountryID": 87,
        "Latitude": 51.798291,
        "Longitude": 7.74085679999996,
        "RelatedURL": "http://www.rwe.com/web/cms/de/494436/e-bikes-on-tour/ladestationen/",
        "DistanceUnit": 0
    },
    "Connections": [
        {
            "ID": 55723,
            "ConnectionTypeID": 28,
            "StatusTypeID": 50,
            "LevelID": 1,
            "Amps": 10,
            "Voltage": 230,
            "PowerKW": 2.3,
            "CurrentTypeID": 10,
            "Quantity": 3
        }
    ],
    "NumberOfPoints": 3,
    "StatusTypeID": 50,
    "DateLastStatusUpdate": "2018-07-01T08:24:00Z",
    "DataQualityLevel": 1,
    "DateCreated": "2015-04-28T08:31:00Z",
    "SubmissionStatusTypeID": 200
}