{
    "IsRecentlyVerified": false,
    "ID": 128817,
    "UUID": "B954D138-060C-4023-8F74-90AA166AF7EF",
    "DataProviderID": 1,
    "OperatorID": 1,
    "UsageTypeID": 6,
    "AddressInfo": {
        "ID": 129163,
        "Title": "Halepa Hotel",
        "AddressLine1": "164 El. Venizelou Str",
        "Town": "Chania",
        "StateOrProvince": "Chania",
        "Postcode": "73133",
        "CountryID": 90,
        "Latitude": 35.5179535478866,
        "Longitude": 24.0360609011907,
        "ContactTelephone1": "+302821028440",
        "ContactEmail": "hotel@halepa.com",
        "RelatedURL": "http://www.halepa.com",
        "DistanceUnit": 0
    },
    "Connections": [
        {
            "ID": 180235,
            "ConnectionTypeID": 25,
            "StatusTypeID": 50,
            "LevelID": 2,
            "Amps": 32,
            "Voltage": 400,
            "PowerKW": 22,
            "CurrentTypeID": 20,
            "Quantity": 1
        },
        {
            "ID": 180251,
            "ConnectionTypeID": 17,
            "StatusTypeID": 50,
            "LevelID": 2,
            "Amps": 32,
            "Voltage": 400,
            "PowerKW": 22,
            "CurrentTypeID": 20,
            "Quantity": 1
        }
    ],
    "NumberOfPoints": 1,
    "StatusTypeID": 50,
    "DateLastStatusUpdate": "2019-07-01T05:40:00Z",
    "DataQualityLevel": 1,
    "DateCreated": "2019-06-29T16:35:00Z",
    "SubmissionStatusTypeID": 200
}