{
    "IsRecentlyVerified": false,
    "ID": 107746,
    "UUID": "3FCA8B7D-6F7D-4DEB-8AB2-8E9B3EF96F15",
    "DataProviderID": 1,
    "OperatorID": 45,
    "UsageTypeID": 1,
    "AddressInfo": {
        "ID": 108092,
        "Title": "Nordoel Tankstelle",
        "AddressLine1": "Großenseer Straße 7",
        "Town": "Trittau",
        "StateOrProvince": "Stormarn",
        "Postcode": "22946",
        "CountryID": 87,
        "Latitude": 53.61537830780756,
        "Longitude": 10.399705210630486,
        "AccessComments": "24/7 nutzbar",
        "RelatedURL": "https://nordoel.de/location/tankstelle-trittau/",
        "DistanceUnit": 0
    },
    "Connections": [
        {
            "ID": 152132,
            "ConnectionTypeID": 1036,
            "StatusTypeID": 50,
            "LevelID": 3,
            "Amps": 63,
            "Voltage": 400,
            "PowerKW": 43,
            "CurrentTypeID": 20,
            "Quantity": 1
        },
        {
            "ID": 152133,
            "ConnectionTypeID": 2,
            "StatusTypeID": 50,
            "LevelID": 3,
            "PowerKW": 50,
            "CurrentTypeID": 30,
            "Quantity": 1
        },
        {
            "ID": 152134,
            "ConnectionTypeID": 33,
            "StatusTypeID": 50,
            "LevelID": 3,
            "PowerKW": 50,
            "CurrentTypeID": 30,
            "Quantity": 1
        }
    ],
    "NumberOfPoints": 3,
    "StatusTypeID": 50,
    "DateLastStatusUpdate": "2018-08-08T11:08:00Z",
    "DataQualityLevel": 1,
    "DateCreated": "2018-08-08T11:08:00Z",
    "SubmissionStatusTypeID": 200
}