{
    "UserComments": [
        {
            "ID": 19833,
            "ChargePointID": 92711,
            "CommentTypeID": 10,
            "UserName": "Hypermile",
            "Comment": "These chargers, in the Eastern garage of the CityCentre, are a bit temperamental. Recommend backing off your Amps (for those with dual chargers) to 72A.",
            "Rating": 4,
            "DateCreated": "2018-07-22T16:06:22.08Z",
            "User": {
                "ID": 11824,
                "Username": "Hypermile"
            },
            "CheckinStatusTypeID": 10
        }
    ],
    "IsRecentlyVerified": false,
    "ID": 92711,
    "UUID": "5751FEA7-CEB2-4E9A-9604-ED1931E36EE2",
    "DataProviderID": 1,
    "OperatorID": 23,
    "OperatorsReference": "33619",
    "UsageTypeID": 4,
    "UsageCost": "Parking fee only.",
    "AddressInfo": {
        "ID": 93057,
        "Title": "Sorella Citycentre",
        "AddressLine1": "825 Town and Country LN",
        "Town": "Houston",
        "StateOrProvince": "Texas",
        "Postcode": "77024",
        "CountryID": 2,
        "Latitude": 29.78184,
        "Longitude": -95.559549,
        "ContactTelephone1": "(713) 461-0758",
        "DistanceUnit": 0
    },
    "Connections": [
        {
            "ID": 131317,
            "ConnectionTypeID": 30,
            "StatusTypeID": 50,
            "LevelID": 2,
            "PowerKW": 16,
            "CurrentTypeID": 20,
            "Quantity": 8
        }
    ],
    "NumberOfPoints": 8,
    "GeneralComments": "4 Tesla Connectors, up to 16kW.Available to the public. Self park.  An additional group of WCs are in the garage 2-3 blocks West of this location.",
    "StatusTypeID": 50,
    "DateLastStatusUpdate": "2018-10-03T19:29:00Z",
    "DataQualityLevel": 1,
    "DateCreated": "2017-09-08T05:45:00Z",
    "SubmissionStatusTypeID": 200
}