{
    "IsRecentlyVerified": false,
    "ID": 30072,
    "UUID": "2065C678-6328-4B40-B7D3-68BA45ACDA5C",
    "DataProviderID": 1,
    "DataProvidersReference": "LSB-00010",
    "OperatorID": 21,
    "UsageTypeID": 4,
    "UsageCost": "Mobi.E compatible card",
    "AddressInfo": {
        "ID": 30418,
        "Title": "LSB-00010",
        "AddressLine1": "Rua Jorge Barradas 52",
        "Town": "Lisboa",
        "Postcode": "1500-372",
        "CountryID": 180,
        "Latitude": 38.756272,
        "Longitude": -9.203025,
        "RelatedURL": "http://www.mobie.pt",
        "DistanceUnit": 0
    },
    "Connections": [
        {
            "ID": 33057,
            "ConnectionTypeID": 25,
            "StatusTypeID": 50,
            "LevelID": 2,
            "Amps": 16,
            "Voltage": 230,
            "PowerKW": 3.7,
            "CurrentTypeID": 10,
            "Quantity": 2
        }
    ],
    "NumberOfPoints": 2,
    "StatusTypeID": 50,
    "DateLastStatusUpdate": "2020-08-14T18:49:00Z",
    "DataQualityLevel": 3,
    "DateCreated": "2014-11-29T14:48:00Z",
    "SubmissionStatusTypeID": 100
}