{
    "MediaItems": [
        {
            "ID": 22489,
            "ChargePointID": 157315,
            "ItemURL": "https://s3-ap-southeast-2.amazonaws.com/openchargemap/images/GB/OCM157315/OCM-157315.orig.2020052618083224.jpg",
            "ItemThumbnailURL": "https://s3-ap-southeast-2.amazonaws.com/openchargemap/images/GB/OCM157315/OCM-157315.thmb.2020052618083224.jpg",
            "Comment": "",
            "IsEnabled": true,
            "IsVideo": false,
            "IsFeaturedItem": false,
            "IsExternalResource": false,
            "User": {
                "ID": 26009,
                "Username": "mcv84"
            },
            "DateCreated": "2020-05-26T18:09:00Z"
        },
        {
            "ID": 22486,
            "ChargePointID": 157315,
            "ItemURL": "https://s3-ap-southeast-2.amazonaws.com/openchargemap/images/GB/OCM157315/OCM-157315.orig.2020052618061560.jpg",
            "ItemThumbnailURL": "https://s3-ap-southeast-2.amazonaws.com/openchargemap/images/GB/OCM157315/OCM-157315.thmb.2020052618061560.jpg",
            "Comment": "",
            "IsEnabled": true,
            "IsVideo": false,
            "IsFeaturedItem": false,
            "IsExternalResource": false,
            "User": {
                "ID": 26009,
                "Username": "mcv84"
            },
            "DateCreated": "2020-05-26T18:06:00Z"
        },
        {
            "ID": 22485,
            "ChargePointID": 157315,
            "ItemURL": "https://s3-ap-southeast-2.amazonaws.com/openchargemap/images/GB/OCM157315/OCM-157315.orig.2020052618043920.jpg",
            "ItemThumbnailURL": "https://s3-ap-southeast-2.amazonaws.com/openchargemap/images/GB/OCM157315/OCM-157315.thmb.2020052618043920.jpg",
            "Comment": "",
            "IsEnabled": true,
            "IsVideo": false,
            "IsFeaturedItem": false,
            "IsExternalResource": false,
            "User": {
                "ID": 26009,
                "Username": "mcv84"
            },
            "DateCreated": "2020-05-26T18:05:00Z"
        },
        {
            "ID": 22483,
            "ChargePointID": 157315,
            "ItemURL": "https://s3-ap-southeast-2.amazonaws.com/openchargemap/images/GB/OCM157315/OCM-157315.orig.2020052618034939.jpg",
            "ItemThumbnailURL": "https://s3-ap-southeast-2.amazonaws.com/openchargemap/images/GB/OCM157315/OCM-157315.thmb.2020052618034939.jpg",
            "Comment": "",
            "IsEnabled": true,
            "IsVideo": false,
            "IsFeaturedItem": false,
            "IsExternalResource": false,
            "User": {
                "ID": 26009,
                "Username": "mcv84"
            },
            "DateCreated": "2020-05-26T18:04:00Z"
        }
    ],
    "IsRecentlyVerified": false,
    "ID": 157315,
    "UUID": "2F846940-D2D3-4342-A92C-CD55506C698C",
    "DataProviderID": 1,
    "OperatorID": 3,
    "UsageTypeID": 1,
    "AddressInfo": {
        "ID": 157669,
        "Title": "Kirkleatham Walled Garden",
        "AddressLine1": "Plantation Road",
        "Town": "Redcar",
        "StateOrProvince": "Cleveland",
        "Postcode": "TS10 4QT",
        "CountryID": 1,
        "Latitude": 54.58689963333106,
        "Longitude": -1.0809733321173098,
        "AccessComments": "Access via the link road off the A174 / B1269 Fishponds roundabout. There is no access from Kirkleatham village.",
        "DistanceUnit": 0
    },
    "Connections": [
        {
            "ID": 226573,
            "ConnectionTypeID": 25,
            "StatusTypeID": 50,
            "LevelID": 2,
            "PowerKW": 7,
            "Quantity": 2
        },
        {
            "ID": 226574,
            "ConnectionTypeID": 25,
            "StatusTypeID": 50,
            "LevelID": 2,
            "PowerKW": 7,
            "Quantity": 2
        }
    ],
    "NumberOfPoints": 4,
    "GeneralComments": "Charge point references are Skye-Yoko (PG-83042) and Lena-Cruz (PG-83043)",
    "StatusTypeID": 50,
    "DateLastStatusUpdate": "2020-05-27T14:24:00Z",
    "DataQualityLevel": 1,
    "DateCreated": "2020-05-26T17:41:00Z",
    "SubmissionStatusTypeID": 200
}