{
    "IsRecentlyVerified": false,
    "ID": 28479,
    "UUID": "15B459DE-1E30-4207-A7BF-DB55E40A34C2",
    "DataProviderID": 2,
    "DataProvidersReference": "62804",
    "OperatorID": 5,
    "UsageTypeID": 1,
    "AddressInfo": {
        "ID": 28825,
        "Title": "STONY BROOK UNV",
        "AddressLine1": "Stadium Rd",
        "Town": "Stony Brook",
        "StateOrProvince": "NY",
        "Postcode": "11790",
        "CountryID": 2,
        "Latitude": 40.9187542,
        "Longitude": -73.1236577,
        "ContactTelephone1": "888-758-4389",
        "AccessComments": "24 hours daily",
        "RelatedURL": "http://www.chargepoint.com/",
        "DistanceUnit": 0
    },
    "Connections": [
        {
            "ID": 31298,
            "ConnectionTypeID": 1,
            "LevelID": 2,
            "Amps": 16,
            "Voltage": 230,
            "PowerKW": 3,
            "CurrentTypeID": 10,
            "Quantity": 2
        }
    ],
    "DateLastStatusUpdate": "2019-04-06T05:05:00Z",
    "DataQualityLevel": 3,
    "DateCreated": "2014-11-28T03:38:00Z",
    "SubmissionStatusTypeID": 100
}