{
    "IsRecentlyVerified": false,
    "ID": 142807,
    "UUID": "C1F348A1-1022-4102-B4DD-A5A66D879180",
    "DataProviderID": 2,
    "DataProvidersReference": "88013",
    "OperatorID": 5,
    "UsageTypeID": 1,
    "AddressInfo": {
        "ID": 143159,
        "Title": "NATIONAL GRID",
        "AddressLine1": "180 County Rd",
        "Town": "Barrington",
        "StateOrProvince": "RI",
        "Postcode": "02806",
        "CountryID": 2,
        "Latitude": 41.7368758,
        "Longitude": -71.3056287,
        "ContactTelephone1": "888-758-4389",
        "AccessComments": "24 hours daily",
        "RelatedURL": "http://www.chargepoint.com/",
        "DistanceUnit": 0
    },
    "Connections": [
        {
            "ID": 199027,
            "ConnectionTypeID": 1,
            "LevelID": 2,
            "Amps": 16,
            "Voltage": 230,
            "PowerKW": 3,
            "CurrentTypeID": 10,
            "Quantity": 2
        }
    ],
    "StatusTypeID": 50,
    "DateLastStatusUpdate": "2019-12-24T09:19:00Z",
    "DataQualityLevel": 3,
    "DateCreated": "2019-12-24T09:19:00Z",
    "SubmissionStatusTypeID": 100
}