{
    "IsRecentlyVerified": false,
    "ID": 186411,
    "UUID": "E7B1DCBF-4C59-4081-85D9-C3CDE52A29E7",
    "DataProviderID": 29,
    "DataProvidersReference": "13245",
    "AddressInfo": {
        "ID": 186770,
        "Title": "Königsbrücker Straße 66",
        "AddressLine1": "Königsbrücker Straße 66",
        "Town": "Kamenz",
        "Postcode": "01917",
        "CountryID": 87,
        "Latitude": 51.273439,
        "Longitude": 14.084185,
        "DistanceUnit": 0
    },
    "Connections": [
        {
            "ID": 299053,
            "ConnectionTypeID": 25,
            "StatusTypeID": 50,
            "LevelID": 2,
            "PowerKW": 22,
            "CurrentTypeID": 20
        },
        {
            "ID": 299054,
            "ConnectionTypeID": 25,
            "StatusTypeID": 50,
            "LevelID": 2,
            "PowerKW": 22,
            "CurrentTypeID": 20
        }
    ],
    "StatusTypeID": 50,
    "DateLastStatusUpdate": "2021-07-12T02:47:00Z",
    "MetadataValues": [
        {
            "ID": 18652,
            "MetadataFieldID": 4,
            "ItemValue": "Data from the German chargepoint registry provided by Bundesnetzagentur.de under the CC-BY 4.0 license"
        }
    ],
    "DataQualityLevel": 3,
    "DateCreated": "2021-07-12T02:47:00Z",
    "SubmissionStatusTypeID": 100
}