{
    "IsRecentlyVerified": false,
    "ID": 95610,
    "UUID": "C1C16C03-A35A-43F2-9A5A-42C38BB3BB4B",
    "DataProviderID": 1,
    "OperatorID": 69,
    "UsageTypeID": 4,
    "AddressInfo": {
        "ID": 95956,
        "Title": "Rathaus",
        "AddressLine1": "Berliner Allee 7",
        "Town": "Schönwalde-Glien",
        "StateOrProvince": "Landkreis Havelland",
        "Postcode": "14621",
        "CountryID": 87,
        "Latitude": 52.600792652289286,
        "Longitude": 13.137342125270166,
        "AccessComments": "24/7 nutzbar auf dem Parkplatz rechts neben dem Rathaus.",
        "DistanceUnit": 0
    },
    "Connections": [
        {
            "ID": 135429,
            "ConnectionTypeID": 25,
            "StatusTypeID": 50,
            "LevelID": 2,
            "Amps": 32,
            "Voltage": 400,
            "PowerKW": 22,
            "CurrentTypeID": 20,
            "Quantity": 2
        }
    ],
    "NumberOfPoints": 2,
    "StatusTypeID": 50,
    "DateLastStatusUpdate": "2017-11-15T06:56:00Z",
    "DataQualityLevel": 1,
    "DateCreated": "2017-11-15T06:56:00Z",
    "SubmissionStatusTypeID": 200
}