{
    "IsRecentlyVerified": false,
    "ID": 111761,
    "UUID": "E17478EE-CF88-4D7A-8875-64294095835F",
    "DataProviderID": 2,
    "DataProvidersReference": "104160",
    "OperatorID": 5,
    "UsageTypeID": 1,
    "AddressInfo": {
        "ID": 112107,
        "Title": "CSOB",
        "AddressLine1": "500 6e Avenue",
        "Town": "Val-d'Or",
        "StateOrProvince": "QC",
        "Postcode": "J9P 6T6",
        "CountryID": 44,
        "Latitude": 48.1060062,
        "Longitude": -77.7801504,
        "ContactTelephone1": "888-758-4389",
        "AccessComments": "24 hours daily",
        "RelatedURL": "http://www.chargepoint.com/",
        "DistanceUnit": 0
    },
    "Connections": [
        {
            "ID": 157255,
            "ConnectionTypeID": 1,
            "LevelID": 2,
            "Amps": 16,
            "Voltage": 230,
            "PowerKW": 3,
            "CurrentTypeID": 10,
            "Quantity": 2
        }
    ],
    "DateLastStatusUpdate": "2019-12-24T09:25:00Z",
    "DataQualityLevel": 3,
    "DateCreated": "2018-10-18T23:37:00Z",
    "SubmissionStatusTypeID": 100
}