{
    "IsRecentlyVerified": false,
    "ID": 106745,
    "UUID": "8429CC60-ABC6-498F-A746-8BC84BBB3F2B",
    "DataProviderID": 1,
    "OperatorID": 105,
    "UsageTypeID": 4,
    "AddressInfo": {
        "ID": 107091,
        "Title": "Sporthalle Forstenberg",
        "AddressLine1": "Wittenberger Straße 21",
        "Town": "Meerbusch",
        "StateOrProvince": "Rhein-Kreis Neuss",
        "Postcode": "40668",
        "CountryID": 87,
        "Latitude": 51.30769087928347,
        "Longitude": 6.690167358999588,
        "AccessComments": "24/7 nutzbare Ladesäule vor der Forstenberg-Sporthalle; gegenüber dem Bürgerhaus der Stadt Meerbusch mit 2 markierten Parkplätzen davor",
        "RelatedURL": "https://stadtwerke-meerbusch.de/stm-stw/",
        "DistanceUnit": 0
    },
    "Connections": [
        {
            "ID": 150469,
            "ConnectionTypeID": 25,
            "StatusTypeID": 50,
            "LevelID": 2,
            "Amps": 32,
            "Voltage": 400,
            "PowerKW": 22,
            "CurrentTypeID": 20,
            "Quantity": 2
        }
    ],
    "NumberOfPoints": 2,
    "StatusTypeID": 50,
    "DateLastStatusUpdate": "2018-06-28T09:02:00Z",
    "DataQualityLevel": 1,
    "DateCreated": "2018-06-28T09:02:00Z",
    "SubmissionStatusTypeID": 200
}