{
    "IsRecentlyVerified": false,
    "ID": 144254,
    "UUID": "2967E7B5-A6CC-4144-AD7C-39D37134C999",
    "DataProviderID": 2,
    "DataProvidersReference": "129675",
    "OperatorID": 89,
    "UsageTypeID": 1,
    "AddressInfo": {
        "ID": 144606,
        "Title": "SQI - 1035 rue Galt",
        "AddressLine1": "1035 rue Galt",
        "Town": "Verdun",
        "StateOrProvince": "QC",
        "Postcode": "H4G 2R1",
        "CountryID": 44,
        "Latitude": 45.4629235,
        "Longitude": -73.5779802,
        "ContactTelephone1": "888-356-8911",
        "AccessComments": "24 hours daily",
        "RelatedURL": "https://flo.ca/",
        "DistanceUnit": 0
    },
    "Connections": [
        {
            "ID": 200743,
            "ConnectionTypeID": 1,
            "LevelID": 2,
            "Amps": 16,
            "Voltage": 230,
            "PowerKW": 3.7,
            "CurrentTypeID": 10,
            "Quantity": 1
        }
    ],
    "StatusTypeID": 50,
    "DateLastStatusUpdate": "2020-06-26T03:09:00Z",
    "DataQualityLevel": 3,
    "DateCreated": "2019-12-24T09:23:00Z",
    "SubmissionStatusTypeID": 100
}