{
    "IsRecentlyVerified": false,
    "ID": 14142,
    "UUID": "0F7C8103-A979-4FA8-942A-F86A4074667A",
    "DataProviderID": 2,
    "DataProvidersReference": "45748",
    "UsageTypeID": 7,
    "AddressInfo": {
        "ID": 14039,
        "Title": "Ken Ganley Nissan",
        "AddressLine1": "5180 Montville Dr",
        "Town": "Medina",
        "StateOrProvince": "OH",
        "Postcode": "44256",
        "CountryID": 2,
        "Latitude": 41.134139,
        "Longitude": -81.793566,
        "ContactTelephone1": "330-721-0500",
        "AccessComments": "Dealership business hours\r\nPublic - Call ahead",
        "RelatedURL": "",
        "DistanceUnit": 0
    },
    "Connections": [
        {
            "ID": 16469,
            "ConnectionTypeID": 1,
            "LevelID": 2,
            "Amps": 16,
            "Voltage": 230,
            "PowerKW": 3.7,
            "CurrentTypeID": 10,
            "Quantity": 2
        },
        {
            "ID": 21546,
            "ConnectionTypeID": 2,
            "LevelID": 3,
            "Amps": 100,
            "Voltage": 400,
            "PowerKW": 40,
            "CurrentTypeID": 30,
            "Quantity": 1
        }
    ],
    "DateLastStatusUpdate": "2020-06-26T03:04:00Z",
    "DataQualityLevel": 3,
    "DateCreated": "2012-12-06T16:48:00Z",
    "SubmissionStatusTypeID": 100
}