{
    "IsRecentlyVerified": false,
    "ID": 146065,
    "UUID": "CB0B3E99-894C-4775-9820-908EC8D4344F",
    "DataProviderID": 1,
    "OperatorID": 23,
    "OperatorsReference": "52509",
    "UsageTypeID": 4,
    "AddressInfo": {
        "ID": 146417,
        "Title": "Falcon Beach Ranch",
        "AddressLine1": "Lot 83 Barren Lake RD",
        "Town": "Blake",
        "StateOrProvince": "Manitoba",
        "Postcode": "R0E 0N0",
        "CountryID": 44,
        "Latitude": 49.691061,
        "Longitude": -95.335204,
        "ContactTelephone1": "(204) 349-2410",
        "DistanceUnit": 0
    },
    "Connections": [
        {
            "ID": 202953,
            "ConnectionTypeID": 30,
            "StatusTypeID": 50,
            "LevelID": 2,
            "PowerKW": 8,
            "CurrentTypeID": 20,
            "Quantity": 2
        }
    ],
    "NumberOfPoints": 2,
    "GeneralComments": "2 Tesla Connectors, up to 8kW.Available for customers. Please call ahead.",
    "StatusTypeID": 50,
    "DateLastStatusUpdate": "2019-12-30T21:33:00Z",
    "DataQualityLevel": 1,
    "DateCreated": "2019-12-30T21:33:00Z",
    "SubmissionStatusTypeID": 200
}