{
    "IsRecentlyVerified": false,
    "ID": 90720,
    "UUID": "2D02966C-E9B3-443A-9E7D-60EF182DAB02",
    "DataProviderID": 1,
    "OperatorID": 23,
    "OperatorsReference": "32094",
    "UsageTypeID": 4,
    "AddressInfo": {
        "ID": 91066,
        "Title": "Crowne Plaza Executive Center Baton Rouge",
        "AddressLine1": "4728 Constitution Ave",
        "Town": "Baton Rouge",
        "StateOrProvince": "Louisiana",
        "Postcode": "70808",
        "CountryID": 2,
        "Latitude": 30.421327,
        "Longitude": -91.136015,
        "ContactTelephone1": "(225) 925-2244",
        "DistanceUnit": 0
    },
    "Connections": [
        {
            "ID": 128443,
            "ConnectionTypeID": 30,
            "StatusTypeID": 50,
            "LevelID": 2,
            "PowerKW": 16,
            "CurrentTypeID": 20,
            "Quantity": 4
        }
    ],
    "NumberOfPoints": 4,
    "GeneralComments": "4 Tesla Connectors, up to 16kW.Available for customers. Please see front desk.",
    "StatusTypeID": 50,
    "DateLastStatusUpdate": "2017-07-22T05:38:00Z",
    "DataQualityLevel": 1,
    "DateCreated": "2017-07-22T05:38:00Z",
    "SubmissionStatusTypeID": 200
}