{
    "IsRecentlyVerified": false,
    "ID": 116300,
    "UUID": "255D817F-9860-409B-B977-96EE8771509C",
    "DataProviderID": 1,
    "DataProvidersReference": "5287",
    "AddressInfo": {
        "ID": 116646,
        "Title": "Norra Oskarsgatan",
        "AddressLine1": "Norra Oskarsgatan 66",
        "Town": "HULTSFRED",
        "StateOrProvince": "KALMAR",
        "Postcode": "57739",
        "CountryID": 216,
        "Latitude": 57.49449,
        "Longitude": 15.83787,
        "AccessComments": "-",
        "DistanceUnit": 0
    },
    "Connections": [
        {
            "ID": 163620,
            "ConnectionTypeID": 0,
            "Reference": "1",
            "LevelID": 2,
            "Amps": 32,
            "Voltage": 400,
            "PowerKW": 22,
            "Comments": "Mode 3"
        },
        {
            "ID": 163621,
            "ConnectionTypeID": 0,
            "Reference": "2",
            "LevelID": 2,
            "Amps": 32,
            "Voltage": 400,
            "PowerKW": 22,
            "Comments": "Mode 3"
        }
    ],
    "NumberOfPoints": 2,
    "DateLastStatusUpdate": "2020-05-26T08:21:00Z",
    "DataQualityLevel": 2,
    "DateCreated": "2019-02-11T09:16:00Z",
    "SubmissionStatusTypeID": 100
}