{
    "IsRecentlyVerified": false,
    "ID": 34361,
    "UUID": "DBBD0F66-9BFF-4A75-9120-00319C847269",
    "DataProviderID": 26,
    "DataProvidersReference": "46845",
    "OperatorID": 73,
    "OperatorsReference": "EV-Box EVB-P1415035",
    "UsageCost": "0.00 jaarabonnement",
    "AddressInfo": {
        "ID": 34707,
        "Title": "Rochussenstraat 395A",
        "AddressLine1": "Rochussenstraat 395A",
        "Town": "Rotterdam",
        "Postcode": "3023 DK",
        "CountryID": 159,
        "Latitude": 51.90975,
        "Longitude": 4.45084,
        "RelatedURL": "http://www.ev-box.nl",
        "DistanceUnit": 0
    },
    "Connections": [
        {
            "ID": 37872,
            "ConnectionTypeID": 25,
            "LevelID": 2,
            "PowerKW": 11,
            "CurrentTypeID": 10
        },
        {
            "ID": 47209,
            "ConnectionTypeID": 25,
            "LevelID": 2,
            "PowerKW": 11,
            "CurrentTypeID": 10
        }
    ],
    "NumberOfPoints": 1,
    "StatusTypeID": 50,
    "DateLastStatusUpdate": "2016-06-04T02:42:00Z",
    "DataQualityLevel": 3,
    "DateCreated": "2015-01-09T06:04:00Z",
    "SubmissionStatusTypeID": 100
}