{
    "IsRecentlyVerified": false,
    "ID": 75432,
    "UUID": "15C90943-202B-419B-89A2-37DD8627AF52",
    "DataProviderID": 1,
    "OperatorID": 23,
    "OperatorsReference": "19164",
    "UsageTypeID": 4,
    "UsageCost": "€0.24/kWh; Autres tarifs pour les voitures anciennes",
    "AddressInfo": {
        "ID": 75778,
        "Title": "Aire de Reims-Champagne-Nord Supercharger",
        "AddressLine1": "Aire de Reims-Champagne-Nord",
        "Town": "Les Petites-Loges",
        "Postcode": "51360",
        "CountryID": 80,
        "Latitude": 49.119348,
        "Longitude": 4.245689,
        "DistanceUnit": 0
    },
    "Connections": [
        {
            "ID": 108737,
            "ConnectionTypeID": 27,
            "StatusTypeID": 50,
            "LevelID": 3,
            "PowerKW": 150,
            "CurrentTypeID": 30,
            "Quantity": 6
        }
    ],
    "NumberOfPoints": 6,
    "GeneralComments": "6 Superchargers, available 24/7",
    "StatusTypeID": 50,
    "DateLastStatusUpdate": "2021-11-03T02:39:00Z",
    "DataQualityLevel": 1,
    "DateCreated": "2016-12-14T20:18:00Z",
    "SubmissionStatusTypeID": 200
}