{
    "IsRecentlyVerified": false,
    "ID": 107621,
    "UUID": "E5733ECB-BDED-42B9-8EFA-2819B6779978",
    "DataProviderID": 1,
    "OperatorID": 229,
    "UsageTypeID": 4,
    "UsageCost": "$0.25/kWh + $0.25/min",
    "AddressInfo": {
        "ID": 107967,
        "Title": "Four Square Lawrence",
        "AddressLine1": "19 Ross Place",
        "Town": "Lawrence",
        "Postcode": "9532",
        "CountryID": 161,
        "Latitude": -45.921971,
        "Longitude": 169.686505,
        "DistanceUnit": 0
    },
    "Connections": [
        {
            "ID": 151872,
            "ConnectionTypeID": 2,
            "StatusTypeID": 50,
            "LevelID": 3,
            "PowerKW": 50,
            "CurrentTypeID": 30,
            "Quantity": 1
        },
        {
            "ID": 151873,
            "ConnectionTypeID": 33,
            "StatusTypeID": 50,
            "LevelID": 3,
            "PowerKW": 50,
            "CurrentTypeID": 30,
            "Quantity": 1
        }
    ],
    "NumberOfPoints": 1,
    "StatusTypeID": 50,
    "DateLastStatusUpdate": "2018-08-03T20:06:00Z",
    "DataQualityLevel": 1,
    "DateCreated": "2018-08-03T08:34:00Z",
    "SubmissionStatusTypeID": 200
}