{
    "IsRecentlyVerified": false,
    "ID": 82048,
    "UUID": "BC58B89B-C54F-4E27-83AF-C16788DBAA62",
    "DataProviderID": 1,
    "OperatorID": 23,
    "OperatorsReference": "9276",
    "UsageTypeID": 6,
    "AddressInfo": {
        "ID": 82394,
        "Title": "Hotel le Dauphin Saint-Hyacinthe",
        "AddressLine1": "Hotel le Dauphin Saint",
        "Postcode": "J2S 7K7",
        "CountryID": 44,
        "Latitude": 45.639865,
        "Longitude": -72.968873,
        "ContactTelephone1": "(450) 774-4418",
        "DistanceUnit": 0
    },
    "Connections": [
        {
            "ID": 116808,
            "ConnectionTypeID": 30,
            "StatusTypeID": 50,
            "LevelID": 2,
            "PowerKW": 16,
            "CurrentTypeID": 20,
            "Quantity": 2
        }
    ],
    "NumberOfPoints": 2,
    "GeneralComments": "2 Tesla Connectors, up to 16kW.Available for patrons only. Please see front desk.",
    "StatusTypeID": 50,
    "DateLastStatusUpdate": "2017-02-03T14:33:00Z",
    "DataQualityLevel": 1,
    "DateCreated": "2017-02-03T14:33:00Z",
    "SubmissionStatusTypeID": 200
}