{
    "IsRecentlyVerified": false,
    "ID": 96629,
    "UUID": "FA8D673B-ECD9-49BD-A47D-42B35B1875D3",
    "DataProviderID": 2,
    "DataProvidersReference": "88993",
    "UsageTypeID": 1,
    "AddressInfo": {
        "ID": 96975,
        "Title": "Acterra",
        "AddressLine1": "3921 E Bayshore Rd",
        "Town": "Palo Alto",
        "StateOrProvince": "CA",
        "Postcode": "94303",
        "CountryID": 2,
        "Latitude": 37.430989,
        "Longitude": -122.103339,
        "ContactTelephone1": "650-962-9876",
        "AccessComments": "24 hours daily",
        "RelatedURL": "",
        "DistanceUnit": 0
    },
    "Connections": [
        {
            "ID": 136897,
            "ConnectionTypeID": 1,
            "LevelID": 2,
            "Amps": 16,
            "Voltage": 230,
            "PowerKW": 3,
            "CurrentTypeID": 10,
            "Quantity": 1
        }
    ],
    "DateLastStatusUpdate": "2019-04-06T04:02:00Z",
    "DataQualityLevel": 3,
    "DateCreated": "2017-12-29T21:01:00Z",
    "SubmissionStatusTypeID": 100
}