{
    "IsRecentlyVerified": false,
    "ID": 96188,
    "UUID": "F0E7C139-2A86-42F1-9A55-D0027F8755B5",
    "DataProviderID": 1,
    "OperatorID": 156,
    "UsageTypeID": 4,
    "AddressInfo": {
        "ID": 96534,
        "Title": "Deutsches Museum",
        "AddressLine1": "Ahrstraße 45",
        "Town": "Bonn",
        "StateOrProvince": "Bonn",
        "Postcode": "53175",
        "CountryID": 87,
        "Latitude": 50.699130448368976,
        "Longitude": 7.150662037048261,
        "AccessComments": "24/7 nutzbar",
        "RelatedURL": "http://www.deutsches-museum-bonn.de/",
        "DistanceUnit": 0
    },
    "Connections": [
        {
            "ID": 136281,
            "ConnectionTypeID": 25,
            "StatusTypeID": 50,
            "LevelID": 2,
            "Amps": 32,
            "Voltage": 400,
            "PowerKW": 22,
            "CurrentTypeID": 20,
            "Quantity": 2
        },
        {
            "ID": 136282,
            "ConnectionTypeID": 28,
            "StatusTypeID": 50,
            "LevelID": 2,
            "Amps": 16,
            "Voltage": 230,
            "PowerKW": 3.7,
            "CurrentTypeID": 10,
            "Quantity": 2
        }
    ],
    "NumberOfPoints": 2,
    "StatusTypeID": 50,
    "DateLastStatusUpdate": "2017-12-14T11:56:00Z",
    "DataQualityLevel": 1,
    "DateCreated": "2017-12-14T11:56:00Z",
    "SubmissionStatusTypeID": 200
}