{
    "MediaItems": [
        {
            "ID": 28715,
            "ChargePointID": 175126,
            "ItemURL": "https://s3-ap-southeast-2.amazonaws.com/openchargemap/images/IT/OCM175126/OCM-175126.orig.2021072115190587.jpg",
            "ItemThumbnailURL": "https://s3-ap-southeast-2.amazonaws.com/openchargemap/images/IT/OCM175126/OCM-175126.thmb.2021072115190587.jpg",
            "Comment": "",
            "IsEnabled": true,
            "IsVideo": false,
            "IsFeaturedItem": false,
            "IsExternalResource": false,
            "User": {
                "ID": 19496,
                "Username": "ECOGY"
            },
            "DateCreated": "2021-07-21T15:19:00Z"
        },
        {
            "ID": 28716,
            "ChargePointID": 175126,
            "ItemURL": "https://s3-ap-southeast-2.amazonaws.com/openchargemap/images/IT/OCM175126/OCM-175126.orig.2021072115192266.jpg",
            "ItemThumbnailURL": "https://s3-ap-southeast-2.amazonaws.com/openchargemap/images/IT/OCM175126/OCM-175126.thmb.2021072115192266.jpg",
            "Comment": "",
            "IsEnabled": true,
            "IsVideo": false,
            "IsFeaturedItem": false,
            "IsExternalResource": false,
            "User": {
                "ID": 19496,
                "Username": "ECOGY"
            },
            "DateCreated": "2021-07-21T15:19:00Z"
        }
    ],
    "IsRecentlyVerified": false,
    "ID": 175126,
    "UUID": "CFF2CC14-2E92-4A08-A6EC-7835F7620694",
    "DataProviderID": 1,
    "OperatorID": 1,
    "UsageTypeID": 4,
    "UsageCost": "0,30 €/kWh",
    "AddressInfo": {
        "ID": 175485,
        "Title": "Bonfanti Design Hotel",
        "AddressLine1": "Pustertaler Straße 12",
        "Town": "39030 St. Sigmund",
        "StateOrProvince": "Südtirol - Provinz Bozen",
        "Postcode": "39030 ",
        "CountryID": 112,
        "Latitude": 46.808070081040086,
        "Longitude": 11.809786766542857,
        "ContactTelephone1": "+39 0474 569 563",
        "AccessComments": "Für Hotelkunden mittels RFID Karte",
        "RelatedURL": "https://www.bonfanti-hotel.com/",
        "DistanceUnit": 0
    },
    "Connections": [
        {
            "ID": 271437,
            "ConnectionTypeID": 25,
            "StatusTypeID": 50,
            "LevelID": 2,
            "Amps": 16,
            "Voltage": 400,
            "PowerKW": 11,
            "CurrentTypeID": 20,
            "Quantity": 1
        },
        {
            "ID": 271438,
            "ConnectionTypeID": 25,
            "StatusTypeID": 50,
            "LevelID": 2,
            "Amps": 16,
            "Voltage": 400,
            "PowerKW": 11,
            "CurrentTypeID": 20,
            "Quantity": 1
        }
    ],
    "NumberOfPoints": 1,
    "GeneralComments": "Die Ladestationen befinden sich auf dem Kundenparkplatz",
    "StatusTypeID": 50,
    "DateLastStatusUpdate": "2021-07-21T15:19:00Z",
    "DataQualityLevel": 1,
    "DateCreated": "2021-04-27T13:46:00Z",
    "SubmissionStatusTypeID": 200
}