{
    "IsRecentlyVerified": false,
    "ID": 127493,
    "UUID": "B3CC7759-E5E6-4D32-A731-8FCE785D6847",
    "DataProviderID": 1,
    "OperatorID": 3321,
    "UsageTypeID": 1,
    "AddressInfo": {
        "ID": 127839,
        "Title": "Rue Docteur Nicolas Clasen",
        "AddressLine1": "Rue Docteur Nicolas Clasen",
        "AddressLine2": "Neudorf-Weimershof",
        "Town": "Luxembourg",
        "StateOrProvince": "Canton Luxembourg",
        "Postcode": "2540",
        "CountryID": 132,
        "Latitude": 49.6318136108015,
        "Longitude": 6.17498990998592,
        "DistanceUnit": 0
    },
    "Connections": [
        {
            "ID": 178466,
            "ConnectionTypeID": 25,
            "StatusTypeID": 50,
            "LevelID": 2,
            "CurrentTypeID": 20,
            "Quantity": 4
        }
    ],
    "NumberOfPoints": 4,
    "StatusTypeID": 50,
    "DateLastStatusUpdate": "2019-06-04T06:58:00Z",
    "DataQualityLevel": 1,
    "DateCreated": "2019-06-03T12:26:00Z",
    "SubmissionStatusTypeID": 200
}