{
    "IsRecentlyVerified": false,
    "ID": 73923,
    "UUID": "7F701F18-A167-4607-A586-D353FC88802F",
    "DataProviderID": 1,
    "OperatorID": 89,
    "OperatorsReference": "AAA-401",
    "UsageTypeID": 4,
    "UsageCost": "CAD 1.00/hour",
    "AddressInfo": {
        "ID": 74269,
        "Title": "Ville de St-Jérôme-Rue Labelle",
        "AddressLine1": "255 Rue Labelle",
        "Town": "St-Jérôme",
        "StateOrProvince": "QC",
        "Postcode": "J7Z 5K8",
        "CountryID": 44,
        "Latitude": 45.7746533508809,
        "Longitude": -74.0038779877663,
        "DistanceUnit": 0
    },
    "Connections": [
        {
            "ID": 106235,
            "ConnectionTypeID": 1,
            "StatusTypeID": 50,
            "LevelID": 2,
            "Amps": 32,
            "Voltage": 230,
            "PowerKW": 7,
            "CurrentTypeID": 10,
            "Quantity": 1
        }
    ],
    "NumberOfPoints": 1,
    "StatusTypeID": 50,
    "DateLastStatusUpdate": "2017-09-15T05:23:00Z",
    "DataQualityLevel": 1,
    "DateCreated": "2016-11-23T23:36:00Z",
    "SubmissionStatusTypeID": 200
}