{
    "IsRecentlyVerified": false,
    "ID": 90055,
    "UUID": "AEE294F1-1DC6-4F9A-8CBB-AA546B088EDC",
    "DataProviderID": 1,
    "OperatorID": 45,
    "UsageTypeID": 6,
    "AddressInfo": {
        "ID": 90401,
        "Title": "Hotel Sand",
        "AddressLine1": "Via del Mulino, 2",
        "Town": "Castelbello-Ciardes",
        "StateOrProvince": "BZ",
        "Postcode": "39020",
        "CountryID": 112,
        "Latitude": 46.64040872115,
        "Longitude": 10.9487373811151,
        "ContactTelephone1": " +39 0473 624 130",
        "ContactEmail": "info@hotel-sand.com",
        "RelatedURL": "http://www.hotel-sand.com",
        "DistanceUnit": 0
    },
    "Connections": [
        {
            "ID": 127657,
            "ConnectionTypeID": 25,
            "StatusTypeID": 50,
            "LevelID": 2,
            "Amps": 32,
            "Voltage": 240,
            "PowerKW": 7.4,
            "CurrentTypeID": 10,
            "Quantity": 2
        }
    ],
    "NumberOfPoints": 2,
    "StatusTypeID": 50,
    "DateLastStatusUpdate": "2017-07-04T15:12:00Z",
    "DataQualityLevel": 1,
    "DateCreated": "2017-07-04T15:01:00Z",
    "SubmissionStatusTypeID": 200
}