{
    "IsRecentlyVerified": false,
    "ID": 147833,
    "UUID": "B282D6B9-55CA-4AAC-9A9B-85040028B3A0",
    "DataProviderID": 1,
    "OperatorID": 80,
    "UsageTypeID": 4,
    "AddressInfo": {
        "ID": 148185,
        "Title": "Conad Superstore Cava de' Tirreni | EnelX",
        "AddressLine1": "Viale Riccardo Romano, 32",
        "Town": "Cava de' Tirreni",
        "StateOrProvince": "SA",
        "Postcode": "84013",
        "CountryID": 112,
        "Latitude": 40.71253249847817,
        "Longitude": 14.702050292614558,
        "ContactTelephone1": "800.069.850",
        "RelatedURL": "https://www.enelx.com/it/it/emobility",
        "DistanceUnit": 0
    },
    "Connections": [
        {
            "ID": 205212,
            "ConnectionTypeID": 25,
            "StatusTypeID": 150,
            "LevelID": 2,
            "Amps": 32,
            "Voltage": 400,
            "PowerKW": 22,
            "CurrentTypeID": 20,
            "Quantity": 1
        },
        {
            "ID": 205213,
            "ConnectionTypeID": 36,
            "StatusTypeID": 150,
            "LevelID": 2,
            "Amps": 16,
            "Voltage": 240,
            "PowerKW": 3.7,
            "CurrentTypeID": 10,
            "Quantity": 1
        }
    ],
    "NumberOfPoints": 2,
    "GeneralComments": "LUN-SAB 08.00-20:00 DOM CHIUSO",
    "StatusTypeID": 150,
    "DateLastStatusUpdate": "2020-01-17T11:25:00Z",
    "DataQualityLevel": 1,
    "DateCreated": "2020-01-17T11:25:00Z",
    "SubmissionStatusTypeID": 200
}