{
    "IsRecentlyVerified": false,
    "ID": 141639,
    "UUID": "F6D7F57E-A2ED-429B-A239-3B901105F246",
    "DataProviderID": 2,
    "DataProvidersReference": "123354",
    "UsageTypeID": 2,
    "AddressInfo": {
        "ID": 141991,
        "Title": "Verizon - Hanover",
        "AddressLine1": "7401 Coca Cola Dr",
        "Town": "Hanover",
        "StateOrProvince": "MD",
        "Postcode": "21076",
        "CountryID": 2,
        "Latitude": 39.186028,
        "Longitude": -76.729924,
        "ContactTelephone1": "",
        "AccessComments": "For employee use only",
        "RelatedURL": "",
        "DistanceUnit": 0
    },
    "Connections": [
        {
            "ID": 197614,
            "ConnectionTypeID": 1,
            "LevelID": 2,
            "Amps": 16,
            "Voltage": 230,
            "PowerKW": 3.7,
            "CurrentTypeID": 10,
            "Quantity": 4
        }
    ],
    "StatusTypeID": 50,
    "DateLastStatusUpdate": "2020-06-26T03:01:00Z",
    "DataQualityLevel": 3,
    "DateCreated": "2019-12-24T09:16:00Z",
    "SubmissionStatusTypeID": 100
}