{
    "IsRecentlyVerified": false,
    "ID": 132834,
    "UUID": "E7392E62-61E2-48EE-8A11-39A4739B4DE1",
    "DataProviderID": 1,
    "OperatorID": 1,
    "UsageTypeID": 4,
    "AddressInfo": {
        "ID": 133180,
        "Title": "ANTRAIN - Rue de Fougères",
        "AddressLine1": "Rue de Fougères",
        "AddressLine2": "La Choletais",
        "Town": "Antrain",
        "Postcode": "35004",
        "CountryID": 80,
        "Latitude": 48.4561209845778,
        "Longitude": -1.48040195620615,
        "RelatedURL": "http://ouestcharge.fr/portal/#/",
        "DistanceUnit": 0
    },
    "Connections": [
        {
            "ID": 186070,
            "ConnectionTypeID": 33,
            "StatusTypeID": 50,
            "LevelID": 3,
            "Amps": 120,
            "Voltage": 400,
            "PowerKW": 50,
            "CurrentTypeID": 30,
            "Quantity": 1
        },
        {
            "ID": 186071,
            "ConnectionTypeID": 1036,
            "StatusTypeID": 50,
            "LevelID": 3,
            "Amps": 63,
            "Voltage": 400,
            "PowerKW": 43,
            "CurrentTypeID": 20,
            "Quantity": 1
        },
        {
            "ID": 186072,
            "ConnectionTypeID": 2,
            "StatusTypeID": 50,
            "LevelID": 3,
            "Amps": 120,
            "Voltage": 400,
            "PowerKW": 50,
            "CurrentTypeID": 30,
            "Quantity": 1
        }
    ],
    "NumberOfPoints": 1,
    "StatusTypeID": 50,
    "DateLastStatusUpdate": "2019-10-08T20:28:00Z",
    "DataQualityLevel": 1,
    "DateCreated": "2019-10-08T20:28:00Z",
    "SubmissionStatusTypeID": 200
}