{
    "IsRecentlyVerified": false,
    "ID": 145347,
    "UUID": "85267F43-8B6D-407F-9BF6-24BCFEDC1C48",
    "DataProviderID": 2,
    "DataProvidersReference": "123685",
    "OperatorID": 3318,
    "UsageTypeID": 1,
    "AddressInfo": {
        "ID": 145699,
        "Title": "Walmart 4249 - Smelterville, ID",
        "AddressLine1": "583 Commerce Dr.",
        "Town": "Smelterville",
        "StateOrProvince": "ID",
        "Postcode": "83868",
        "CountryID": 2,
        "Latitude": 47.544139,
        "Longitude": -116.1854,
        "ContactTelephone1": "833-632-2778",
        "AccessComments": "24 hours daily",
        "RelatedURL": "https://www.electrifyamerica.com/",
        "DistanceUnit": 0
    },
    "Connections": [
        {
            "ID": 202003,
            "ConnectionTypeID": 2,
            "LevelID": 3,
            "Amps": 100,
            "Voltage": 400,
            "PowerKW": 40,
            "CurrentTypeID": 30,
            "Quantity": 1
        },
        {
            "ID": 202004,
            "ConnectionTypeID": 32,
            "LevelID": 3,
            "Amps": 100,
            "Voltage": 400,
            "PowerKW": 40,
            "CurrentTypeID": 30,
            "Quantity": 1
        }
    ],
    "StatusTypeID": 50,
    "DateLastStatusUpdate": "2020-06-26T03:10:00Z",
    "DataQualityLevel": 3,
    "DateCreated": "2019-12-24T09:24:00Z",
    "SubmissionStatusTypeID": 100
}