{
    "IsRecentlyVerified": false,
    "ID": 28909,
    "UUID": "014F9B8D-CD10-488C-B064-BC5E98F922A4",
    "DataProviderID": 2,
    "DataProvidersReference": "46768",
    "OperatorID": 5,
    "UsageTypeID": 1,
    "AddressInfo": {
        "ID": 29255,
        "Title": "MT CLEMENS DDA",
        "AddressLine1": "39 N Main St",
        "Town": "Mt Clemens",
        "StateOrProvince": "MI",
        "Postcode": "48043",
        "CountryID": 2,
        "Latitude": 42.5981102,
        "Longitude": -82.8774643,
        "ContactTelephone1": "888-758-4389",
        "AccessComments": "24 hours daily",
        "RelatedURL": "http://www.chargepoint.com/",
        "DistanceUnit": 0
    },
    "Connections": [
        {
            "ID": 31769,
            "ConnectionTypeID": 1,
            "LevelID": 2,
            "Amps": 16,
            "Voltage": 230,
            "PowerKW": 3.7,
            "CurrentTypeID": 10,
            "Quantity": 2
        }
    ],
    "DateLastStatusUpdate": "2020-06-26T03:06:00Z",
    "DataQualityLevel": 3,
    "DateCreated": "2014-11-28T03:38:00Z",
    "SubmissionStatusTypeID": 100
}