{
    "UserComments": [
        {
            "ID": 19420,
            "ChargePointID": 44958,
            "CommentTypeID": 10,
            "UserName": "Ian Atkin",
            "Comment": "Polar Instant app is terrible but charged successfully",
            "Rating": 5,
            "DateCreated": "2018-04-14T15:38:38.58Z",
            "User": {
                "ID": 9337,
                "Username": "Ian Atkin"
            },
            "CheckinStatusTypeID": 10
        }
    ],
    "MediaItems": [
        {
            "ID": 3692,
            "ChargePointID": 44958,
            "ItemURL": "https://s3-ap-southeast-2.amazonaws.com/openchargemap/images/GB/OCM44958/OCM-44958.orig.2015123013260434.jpg",
            "ItemThumbnailURL": "https://s3-ap-southeast-2.amazonaws.com/openchargemap/images/GB/OCM44958/OCM-44958.thmb.2015123013260434.jpg",
            "Comment": "",
            "IsEnabled": true,
            "IsVideo": false,
            "IsFeaturedItem": false,
            "IsExternalResource": false,
            "User": {
                "ID": 6639,
                "Username": "Guillaume Ouellette"
            },
            "DateCreated": "2015-12-30T13:26:00Z"
        }
    ],
    "IsRecentlyVerified": false,
    "ID": 44958,
    "UUID": "BFE8228B-9D59-4D75-9820-FE7686283CDE",
    "DataProviderID": 1,
    "OperatorID": 32,
    "OperatorsReference": "22019",
    "UsageTypeID": 4,
    "UsageCost": "£0.108/kWh; for Polar Plus subscription members only",
    "AddressInfo": {
        "ID": 45304,
        "Title": "Furzton - Shirwell Crescent",
        "AddressLine1": "Shirwell Crescent",
        "AddressLine2": "Furzton",
        "Town": "Milton Keynes",
        "Postcode": "MK4 1LU",
        "CountryID": 1,
        "Latitude": 52.015964,
        "Longitude": -0.769124,
        "AccessComments": "Furzton Lake car park - Parks Trust",
        "RelatedURL": "http://www.chargemasterplc.com",
        "DistanceUnit": 0
    },
    "Connections": [
        {
            "ID": 55281,
            "ConnectionTypeID": 2,
            "StatusTypeID": 50,
            "LevelID": 3,
            "Amps": 125,
            "Voltage": 500,
            "PowerKW": 50,
            "CurrentTypeID": 30,
            "Quantity": 1
        },
        {
            "ID": 55877,
            "ConnectionTypeID": 33,
            "StatusTypeID": 50,
            "LevelID": 3,
            "PowerKW": 50,
            "CurrentTypeID": 30,
            "Quantity": 1
        },
        {
            "ID": 55878,
            "ConnectionTypeID": 1036,
            "StatusTypeID": 50,
            "LevelID": 3,
            "Voltage": 400,
            "PowerKW": 43,
            "CurrentTypeID": 20,
            "Quantity": 1
        }
    ],
    "NumberOfPoints": 1,
    "GeneralComments": "Siemens EFACEC rapid charger",
    "StatusTypeID": 50,
    "DateLastStatusUpdate": "2019-06-20T05:38:00Z",
    "MetadataValues": [
        {
            "ID": 1388,
            "MetadataFieldID": 4,
            "ItemValue": "Contains public sector information licensed under the Open Government Licence v2.0. http://www.nationalarchives.gov.uk/doc/open-government-licence/version/2/"
        }
    ],
    "DataQualityLevel": 3,
    "DateCreated": "2015-04-22T03:02:00Z",
    "SubmissionStatusTypeID": 200
}