{
    "IsRecentlyVerified": false,
    "ID": 176947,
    "UUID": "181852B3-EE82-4C30-AAA8-57C50C13B407",
    "DataProviderID": 29,
    "DataProvidersReference": "5715,16648",
    "AddressInfo": {
        "ID": 177306,
        "Title": "Gutenbergstraße 12",
        "AddressLine1": "Gutenbergstraße 12",
        "Town": "Ungerhausen",
        "Postcode": "87781",
        "CountryID": 87,
        "Latitude": 48.017892,
        "Longitude": 10.272101,
        "DistanceUnit": 0
    },
    "Connections": [
        {
            "ID": 275504,
            "ConnectionTypeID": 25,
            "StatusTypeID": 50,
            "LevelID": 2,
            "PowerKW": 22,
            "CurrentTypeID": 20
        },
        {
            "ID": 275505,
            "ConnectionTypeID": 1036,
            "StatusTypeID": 50,
            "LevelID": 3,
            "PowerKW": 43,
            "CurrentTypeID": 20
        },
        {
            "ID": 275506,
            "ConnectionTypeID": 33,
            "StatusTypeID": 50,
            "LevelID": 3,
            "PowerKW": 120,
            "CurrentTypeID": 30
        },
        {
            "ID": 275507,
            "ConnectionTypeID": 25,
            "StatusTypeID": 50,
            "LevelID": 2,
            "PowerKW": 22,
            "CurrentTypeID": 20
        },
        {
            "ID": 275508,
            "ConnectionTypeID": 1036,
            "StatusTypeID": 50,
            "LevelID": 3,
            "PowerKW": 43,
            "CurrentTypeID": 20
        },
        {
            "ID": 275509,
            "ConnectionTypeID": 33,
            "StatusTypeID": 50,
            "LevelID": 3,
            "PowerKW": 112.5,
            "CurrentTypeID": 30
        },
        {
            "ID": 275510,
            "ConnectionTypeID": 33,
            "StatusTypeID": 50,
            "LevelID": 3,
            "PowerKW": 37.5,
            "CurrentTypeID": 30
        }
    ],
    "StatusTypeID": 0,
    "DateLastStatusUpdate": "2021-07-09T03:11:00Z",
    "MetadataValues": [
        {
            "ID": 9241,
            "MetadataFieldID": 4,
            "ItemValue": "Data from the German chargepoint registry provided by Bundesnetzagentur.de under the CC-BY 4.0 license"
        }
    ],
    "DataQualityLevel": 3,
    "DateCreated": "2021-07-08T09:48:00Z",
    "SubmissionStatusTypeID": 100
}