{
    "IsRecentlyVerified": false,
    "ID": 144624,
    "UUID": "477A8EF5-DCCD-4848-9DFA-BA0257C76205",
    "DataProviderID": 2,
    "DataProvidersReference": "130690",
    "OperatorID": 90,
    "UsageTypeID": 1,
    "AddressInfo": {
        "ID": 144976,
        "Title": "1550 Bélanger",
        "AddressLine1": "1550 rue Bélanger",
        "Town": "Montréal",
        "StateOrProvince": "QC",
        "Postcode": "H2G 1A8",
        "CountryID": 44,
        "Latitude": 45.545299,
        "Longitude": -73.604247,
        "ContactTelephone1": "877-505-2674",
        "AccessComments": "24 hours daily",
        "RelatedURL": "https://lecircuitelectrique.com/",
        "DistanceUnit": 0
    },
    "Connections": [
        {
            "ID": 201137,
            "ConnectionTypeID": 1,
            "LevelID": 2,
            "Amps": 16,
            "Voltage": 230,
            "PowerKW": 3.7,
            "CurrentTypeID": 10,
            "Quantity": 2
        }
    ],
    "StatusTypeID": 50,
    "DateLastStatusUpdate": "2020-06-26T03:09:00Z",
    "DataQualityLevel": 3,
    "DateCreated": "2019-12-24T09:23:00Z",
    "SubmissionStatusTypeID": 100
}