{
    "IsRecentlyVerified": false,
    "ID": 45413,
    "UUID": "F416B883-973A-49FF-9556-DFAF46024CC6",
    "DataProviderID": 2,
    "DataProvidersReference": "66804",
    "OperatorID": 5,
    "UsageTypeID": 1,
    "AddressInfo": {
        "ID": 45759,
        "Title": "SCCC",
        "AddressLine1": "121 Speonk Riverhead Rd",
        "Town": "Riverhead",
        "StateOrProvince": "NY",
        "Postcode": "11901",
        "CountryID": 2,
        "Latitude": 40.865293,
        "Longitude": -72.696524,
        "ContactTelephone1": "888-758-4389",
        "AccessComments": "24 hours daily",
        "RelatedURL": "http://www.chargepoint.com/",
        "DistanceUnit": 0
    },
    "Connections": [
        {
            "ID": 56008,
            "ConnectionTypeID": 1,
            "LevelID": 2,
            "Amps": 16,
            "Voltage": 230,
            "PowerKW": 3,
            "CurrentTypeID": 10,
            "Quantity": 4
        }
    ],
    "DateLastStatusUpdate": "2019-12-24T09:18:00Z",
    "DataQualityLevel": 3,
    "DateCreated": "2015-05-01T04:21:00Z",
    "SubmissionStatusTypeID": 100
}