{
    "IsRecentlyVerified": false,
    "ID": 182403,
    "UUID": "F3F37057-7B0D-4670-B626-F5E5C7EC0FA6",
    "DataProviderID": 29,
    "DataProvidersReference": "11085",
    "OperatorID": 128,
    "AddressInfo": {
        "ID": 182762,
        "Title": "Hugo-Junkers-Weg 11",
        "AddressLine1": "Hugo-Junkers-Weg 11",
        "Town": "Wolfsburg",
        "Postcode": "38440",
        "CountryID": 87,
        "Latitude": 52.4292,
        "Longitude": 10.792956,
        "DistanceUnit": 0
    },
    "Connections": [
        {
            "ID": 288088,
            "ConnectionTypeID": 25,
            "StatusTypeID": 50,
            "LevelID": 2,
            "PowerKW": 22,
            "CurrentTypeID": 20
        },
        {
            "ID": 288089,
            "ConnectionTypeID": 25,
            "StatusTypeID": 50,
            "LevelID": 2,
            "PowerKW": 22,
            "CurrentTypeID": 20
        }
    ],
    "StatusTypeID": 50,
    "DateLastStatusUpdate": "2021-07-12T02:49:00Z",
    "MetadataValues": [
        {
            "ID": 14697,
            "MetadataFieldID": 4,
            "ItemValue": "Data from the German chargepoint registry provided by Bundesnetzagentur.de under the CC-BY 4.0 license"
        }
    ],
    "DataQualityLevel": 3,
    "DateCreated": "2021-07-08T10:03:00Z",
    "SubmissionStatusTypeID": 100
}