{
    "IsRecentlyVerified": false,
    "ID": 184956,
    "UUID": "506CF34B-1695-4193-9A8D-56DE6E1796A4",
    "DataProviderID": 29,
    "DataProvidersReference": "5922",
    "OperatorID": 121,
    "AddressInfo": {
        "ID": 185315,
        "Title": "Stockmeyerstr. 41",
        "AddressLine1": "Stockmeyerstr. 41",
        "Town": "Hamburg",
        "Postcode": "20457",
        "CountryID": 87,
        "Latitude": 53.544226,
        "Longitude": 10.007508,
        "DistanceUnit": 0
    },
    "Connections": [
        {
            "ID": 293858,
            "ConnectionTypeID": 25,
            "StatusTypeID": 50,
            "LevelID": 2,
            "PowerKW": 22,
            "CurrentTypeID": 20
        },
        {
            "ID": 293859,
            "ConnectionTypeID": 25,
            "StatusTypeID": 50,
            "LevelID": 2,
            "PowerKW": 22,
            "CurrentTypeID": 20
        }
    ],
    "StatusTypeID": 50,
    "DateLastStatusUpdate": "2021-07-09T03:29:00Z",
    "MetadataValues": [
        {
            "ID": 17247,
            "MetadataFieldID": 4,
            "ItemValue": "Data from the German chargepoint registry provided by Bundesnetzagentur.de under the CC-BY 4.0 license"
        }
    ],
    "DataQualityLevel": 3,
    "DateCreated": "2021-07-08T10:06:00Z",
    "SubmissionStatusTypeID": 100
}