{
    "IsRecentlyVerified": false,
    "ID": 124391,
    "UUID": "EB88F578-903E-4A37-9B94-364E1400A1C3",
    "DataProviderID": 2,
    "DataProvidersReference": "71655",
    "UsageTypeID": 2,
    "AddressInfo": {
        "ID": 124737,
        "Title": "GeoVera Holdings",
        "AddressLine1": "1455 Oliver Rd",
        "Town": "Fairfield",
        "StateOrProvince": "CA",
        "Postcode": "94534",
        "CountryID": 2,
        "Latitude": 38.258821,
        "Longitude": -122.069527,
        "ContactTelephone1": "",
        "AccessComments": "Employee use only",
        "RelatedURL": "",
        "DistanceUnit": 0
    },
    "Connections": [
        {
            "ID": 174482,
            "ConnectionTypeID": 1,
            "LevelID": 2,
            "Amps": 16,
            "Voltage": 230,
            "PowerKW": 3.7,
            "CurrentTypeID": 10,
            "Quantity": 2
        }
    ],
    "DateLastStatusUpdate": "2020-06-26T02:59:00Z",
    "DataQualityLevel": 3,
    "DateCreated": "2019-04-06T05:03:00Z",
    "SubmissionStatusTypeID": 100
}