{
    "IsRecentlyVerified": false,
    "ID": 156702,
    "UUID": "B76258D9-9310-4EFD-A781-4C9A13B9FAFE",
    "DataProviderID": 19,
    "DataProvidersReference": "5916",
    "AddressInfo": {
        "ID": 157056,
        "Title": "Tanka Borås",
        "AddressLine1": "Hultagatan 51 ",
        "Town": "BORÅS",
        "StateOrProvince": "VÄSTRA GÖTALAND",
        "Postcode": "50750",
        "CountryID": 216,
        "Latitude": 57.72255,
        "Longitude": 12.99064,
        "AccessComments": "Hultagatan 51\r50750 Borås\r57°43U+0026#039;20.8\"N 12°59U+0026#039;23.6\"E",
        "DistanceUnit": 0
    },
    "Connections": [
        {
            "ID": 221372,
            "ConnectionTypeID": 25,
            "Reference": "1",
            "LevelID": 3,
            "Amps": 32,
            "Voltage": 400,
            "PowerKW": 22,
            "CurrentTypeID": 30
        },
        {
            "ID": 221373,
            "ConnectionTypeID": 25,
            "Reference": "2",
            "LevelID": 3,
            "Amps": 32,
            "Voltage": 400,
            "PowerKW": 22,
            "CurrentTypeID": 30
        }
    ],
    "NumberOfPoints": 2,
    "StatusTypeID": 0,
    "DateLastStatusUpdate": "2021-03-24T05:11:00Z",
    "DataQualityLevel": 2,
    "DateCreated": "2020-05-26T08:21:00Z",
    "SubmissionStatusTypeID": 100
}