{
    "IsRecentlyVerified": false,
    "ID": 184108,
    "UUID": "072B7E4D-698B-47EB-9B8E-2C81DE8DACDB",
    "DataProviderID": 1,
    "OperatorID": 3325,
    "AddressInfo": {
        "ID": 184467,
        "Title": "Galileistr. 21",
        "AddressLine1": "Galileistr. 21",
        "Town": "Potsdam",
        "Postcode": "14480",
        "CountryID": 87,
        "Latitude": 52.375649409702135,
        "Longitude": 13.132625332513044,
        "ContactTelephone2": "+49 331 661 3100",
        "AccessComments": "ID 7241, LHP ID 58 ",
        "DistanceUnit": 0
    },
    "Connections": [
        {
            "ID": 291921,
            "ConnectionTypeID": 25,
            "StatusTypeID": 50,
            "LevelID": 2,
            "PowerKW": 22,
            "CurrentTypeID": 20
        },
        {
            "ID": 291922,
            "ConnectionTypeID": 25,
            "StatusTypeID": 50,
            "LevelID": 2,
            "PowerKW": 22,
            "CurrentTypeID": 20
        }
    ],
    "StatusTypeID": 50,
    "DateLastStatusUpdate": "2021-08-25T13:11:00Z",
    "MetadataValues": [
        {
            "ID": 16400,
            "MetadataFieldID": 4,
            "ItemValue": "Data from the German chargepoint registry provided by Bundesnetzagentur.de under the CC-BY 4.0 license"
        }
    ],
    "DataQualityLevel": 3,
    "DateCreated": "2021-07-08T10:05:00Z",
    "SubmissionStatusTypeID": 100
}