{
    "IsRecentlyVerified": false,
    "ID": 104222,
    "UUID": "A63E51C0-3AE2-4F81-8D02-84B0DCEBC18A",
    "DataProviderID": 1,
    "OperatorID": 3272,
    "UsageTypeID": 4,
    "AddressInfo": {
        "ID": 104568,
        "Title": "Emotì Evpass Besazio",
        "AddressLine1": "Piazza Antonio Fontana",
        "Town": "Besazio",
        "StateOrProvince": "Distretto di Mendrisio",
        "Postcode": "6863",
        "CountryID": 217,
        "Latitude": 45.87260917184935,
        "Longitude": 8.950924947667772,
        "ContactTelephone1": "+41 91 946 39 28",
        "ContactTelephone2": "+41 58 221 96 60",
        "RelatedURL": "https://emoti.evpass.ch/",
        "DistanceUnit": 0
    },
    "Connections": [
        {
            "ID": 147175,
            "ConnectionTypeID": 1036,
            "StatusTypeID": 50,
            "LevelID": 2,
            "Amps": 16,
            "Voltage": 400,
            "PowerKW": 11,
            "CurrentTypeID": 20,
            "Quantity": 1
        },
        {
            "ID": 147176,
            "ConnectionTypeID": 1,
            "StatusTypeID": 50,
            "LevelID": 2,
            "Amps": 16,
            "Voltage": 240,
            "PowerKW": 3.7,
            "CurrentTypeID": 10,
            "Quantity": 1
        },
        {
            "ID": 147177,
            "ConnectionTypeID": 1037,
            "StatusTypeID": 50,
            "LevelID": 2,
            "Amps": 16,
            "Voltage": 240,
            "PowerKW": 3.7,
            "CurrentTypeID": 10,
            "Quantity": 1
        }
    ],
    "NumberOfPoints": 1,
    "StatusTypeID": 50,
    "DateLastStatusUpdate": "2018-05-17T14:53:00Z",
    "DataQualityLevel": 1,
    "DateCreated": "2018-05-17T14:53:00Z",
    "SubmissionStatusTypeID": 200
}