{
    "IsRecentlyVerified": false,
    "ID": 160749,
    "UUID": "62E3E47C-B0E0-401F-93ED-C66F21FBDAC7",
    "DataProviderID": 2,
    "DataProvidersReference": "153335",
    "OperatorID": 5,
    "UsageTypeID": 1,
    "AddressInfo": {
        "ID": 161106,
        "Title": "PHU",
        "AddressLine1": "375 2 Ave",
        "Town": "Campbell River",
        "StateOrProvince": "BC",
        "Postcode": "V9W 3V1",
        "CountryID": 44,
        "Latitude": 50.0099,
        "Longitude": -125.24332,
        "ContactTelephone1": "888-758-4389",
        "AccessComments": "24 hours daily",
        "RelatedURL": "http://www.chargepoint.com/",
        "DistanceUnit": 0
    },
    "Connections": [
        {
            "ID": 231338,
            "ConnectionTypeID": 1,
            "LevelID": 2,
            "Amps": 16,
            "Voltage": 230,
            "PowerKW": 3.7,
            "CurrentTypeID": 10,
            "Quantity": 1
        }
    ],
    "StatusTypeID": 50,
    "DateLastStatusUpdate": "2020-06-26T03:12:00Z",
    "DataQualityLevel": 3,
    "DateCreated": "2020-06-26T03:12:00Z",
    "SubmissionStatusTypeID": 100
}