{
    "UserComments": [
        {
            "ID": 17382,
            "ChargePointID": 47529,
            "CommentTypeID": 10,
            "UserName": "kerry.waylen",
            "Comment": "I charged successfully here twice over the weekend of 3-4th June 2017. The machine worked without problems. It is directly opposite the entrance to Aros as you drive in. Note however that the bays beside the charging point are not marked (it is a gravel parking area that cannot be marked) so many normal car users park there without apparently noticing the charging device. So there is a risk that you could find yourself blocked from using the charger.",
            "Rating": 4,
            "DateCreated": "2017-06-08T10:05:34.903Z",
            "User": {
                "ID": 4738,
                "Username": "kerry.waylen"
            },
            "CheckinStatusTypeID": 10
        }
    ],
    "MediaItems": [
        {
            "ID": 12807,
            "ChargePointID": 47529,
            "ItemURL": "https://s3-ap-southeast-2.amazonaws.com/openchargemap/images/GB/OCM47529/OCM-47529.orig.2017060810061717.jpg",
            "ItemThumbnailURL": "https://s3-ap-southeast-2.amazonaws.com/openchargemap/images/GB/OCM47529/OCM-47529.thmb.2017060810061717.jpg",
            "Comment": "",
            "IsEnabled": true,
            "IsVideo": false,
            "IsFeaturedItem": false,
            "IsExternalResource": false,
            "User": {
                "ID": 4738,
                "Username": "kerry.waylen"
            },
            "DateCreated": "2017-06-08T10:06:00Z"
        }
    ],
    "IsRecentlyVerified": false,
    "ID": 47529,
    "UUID": "4510BE64-C66A-4157-8BCD-28549F77C226",
    "DataProviderID": 1,
    "OperatorID": 3315,
    "OperatorsReference": "50973",
    "UsageTypeID": 4,
    "UsageCost": "Free",
    "AddressInfo": {
        "ID": 47875,
        "Title": "The Aros Experience",
        "AddressLine1": "Viewfield Road",
        "Town": "Portree",
        "StateOrProvince": "Highland",
        "Postcode": "IV51 9EU",
        "CountryID": 1,
        "Latitude": 57.40134,
        "Longitude": -6.20139,
        "ContactTelephone1": "+44 1478 613649",
        "AccessComments": "Opposite the entry to the car park",
        "RelatedURL": "http://www.aros.co.uk/",
        "DistanceUnit": 0
    },
    "Connections": [
        {
            "ID": 58585,
            "ConnectionTypeID": 25,
            "StatusTypeID": 50,
            "LevelID": 2,
            "Amps": 32,
            "Voltage": 480,
            "PowerKW": 22,
            "CurrentTypeID": 20,
            "Quantity": 2
        }
    ],
    "NumberOfPoints": 2,
    "StatusTypeID": 50,
    "DateLastStatusUpdate": "2019-07-31T05:23:00Z",
    "DataQualityLevel": 1,
    "DateCreated": "2015-05-29T13:15:00Z",
    "SubmissionStatusTypeID": 200
}