{
    "IsRecentlyVerified": false,
    "ID": 95698,
    "UUID": "21754668-B598-4D05-9FD1-DF519D368CDA",
    "DataProviderID": 1,
    "OperatorID": 125,
    "UsageTypeID": 4,
    "AddressInfo": {
        "ID": 96044,
        "Title": "Autohaus Paul Lüske (Mercedes-Benz)",
        "AddressLine1": "Emsteker Straße 95",
        "Town": "Cloppenburg",
        "StateOrProvince": "Landkreis Cloppenburg",
        "Postcode": "49661",
        "CountryID": 87,
        "Latitude": 52.84108999999999,
        "Longitude": 8.066360000000032,
        "AccessComments": "24/7 nutzbar.",
        "RelatedURL": "https://www.ewe.de/privatkunden/service/ratgeber-smartes/emobility/stromtankstellen",
        "DistanceUnit": 0
    },
    "Connections": [
        {
            "ID": 135566,
            "ConnectionTypeID": 25,
            "StatusTypeID": 50,
            "LevelID": 2,
            "Amps": 32,
            "Voltage": 400,
            "PowerKW": 22,
            "CurrentTypeID": 20,
            "Quantity": 2
        }
    ],
    "NumberOfPoints": 2,
    "StatusTypeID": 50,
    "DateLastStatusUpdate": "2017-11-20T11:44:00Z",
    "DataQualityLevel": 1,
    "DateCreated": "2017-11-20T11:44:00Z",
    "SubmissionStatusTypeID": 200
}