{
    "IsRecentlyVerified": false,
    "ID": 54005,
    "UUID": "33900F91-071F-4DC5-9329-00497BB094FE",
    "DataProviderID": 26,
    "DataProvidersReference": "69858",
    "OperatorID": 157,
    "OperatorsReference": "NewMotion 04000129",
    "UsageCost": "0.00 jaarabonnement",
    "AddressInfo": {
        "ID": 54351,
        "Title": "Zernikepark 12",
        "AddressLine1": "Zernikepark 12",
        "Town": "Groningen",
        "Postcode": "9747 AN",
        "CountryID": 159,
        "Latitude": 53.2446065,
        "Longitude": 6.533665,
        "ContactTelephone1": "088 0109500",
        "RelatedURL": "http://thenewmotion.nl/",
        "DistanceUnit": 0
    },
    "Connections": [
        {
            "ID": 67529,
            "ConnectionTypeID": 25,
            "LevelID": 2,
            "PowerKW": 22,
            "CurrentTypeID": 10
        },
        {
            "ID": 67530,
            "ConnectionTypeID": 25,
            "LevelID": 2,
            "PowerKW": 22,
            "CurrentTypeID": 10
        },
        {
            "ID": 67531,
            "ConnectionTypeID": 25,
            "LevelID": 2,
            "PowerKW": 22,
            "CurrentTypeID": 10
        },
        {
            "ID": 67532,
            "ConnectionTypeID": 25,
            "LevelID": 2,
            "PowerKW": 22,
            "CurrentTypeID": 10
        }
    ],
    "NumberOfPoints": 1,
    "StatusTypeID": 50,
    "DateLastStatusUpdate": "2016-06-04T02:56:00Z",
    "DataQualityLevel": 3,
    "DateCreated": "2015-09-20T11:50:00Z",
    "SubmissionStatusTypeID": 100
}