{
    "IsRecentlyVerified": false,
    "ID": 75745,
    "UUID": "120D71BF-C313-44D1-93C1-321859B74269",
    "DataProviderID": 1,
    "OperatorID": 3,
    "OperatorsReference": "PG-80767",
    "UsageTypeID": 6,
    "UsageCost": "Free",
    "AddressInfo": {
        "ID": 76091,
        "Title": "Cambridge Commodities LTD",
        "AddressLine1": "Lancaster Way Business Park",
        "AddressLine2": "Wellington Road",
        "Town": "Ely",
        "StateOrProvince": "Cambridgeshire",
        "Postcode": "CB6 3NW",
        "CountryID": 1,
        "Latitude": 52.385287,
        "Longitude": 0.229874,
        "DistanceUnit": 0
    },
    "Connections": [
        {
            "ID": 109234,
            "ConnectionTypeID": 25,
            "StatusTypeID": 50,
            "LevelID": 2,
            "Amps": 32,
            "Voltage": 400,
            "PowerKW": 22,
            "CurrentTypeID": 20,
            "Quantity": 2
        }
    ],
    "NumberOfPoints": 2,
    "StatusTypeID": 50,
    "DateLastStatusUpdate": "2017-10-12T15:56:00Z",
    "DataQualityLevel": 1,
    "DateCreated": "2016-12-22T16:36:00Z",
    "SubmissionStatusTypeID": 200
}