{
    "IsRecentlyVerified": false,
    "ID": 126969,
    "UUID": "24D8D8C5-9E70-4498-8C2D-BEACA3FBF3EA",
    "DataProviderID": 1,
    "OperatorID": 3349,
    "UsageTypeID": 1,
    "UsageCost": "Free",
    "AddressInfo": {
        "ID": 127315,
        "Title": "Lamp Column 7, Maresfield Road",
        "AddressLine1": "Maresfield Road",
        "AddressLine2": "Whitehawk",
        "Town": "Brighton",
        "StateOrProvince": "Brighton and Hove",
        "Postcode": "BN2 5ES",
        "CountryID": 1,
        "Latitude": 50.822898,
        "Longitude": -0.111153,
        "DistanceUnit": 0
    },
    "Connections": [
        {
            "ID": 177819,
            "ConnectionTypeID": 25,
            "StatusTypeID": 50,
            "LevelID": 2,
            "Amps": 16,
            "Voltage": 230,
            "PowerKW": 3.6,
            "CurrentTypeID": 10,
            "Quantity": 1
        },
        {
            "ID": 177820,
            "ConnectionTypeID": 25,
            "StatusTypeID": 50,
            "LevelID": 2,
            "Amps": 32,
            "Voltage": 230,
            "PowerKW": 7,
            "CurrentTypeID": 10,
            "Quantity": 1
        }
    ],
    "NumberOfPoints": 2,
    "StatusTypeID": 50,
    "DateLastStatusUpdate": "2019-05-24T12:17:00Z",
    "DataQualityLevel": 1,
    "DateCreated": "2019-05-24T12:17:00Z",
    "SubmissionStatusTypeID": 200
}