{
    "UserComments": [
        {
            "ID": 17799,
            "ChargePointID": 93896,
            "CommentTypeID": 10,
            "UserName": "Bert van Sas",
            "Comment": "ICE parked on this brandnew charging spot...!",
            "Rating": 4,
            "DateCreated": "2017-10-11T20:23:17.583Z",
            "User": {
                "ID": 11617,
                "Username": "Bert van Sas"
            },
            "CheckinStatusTypeID": 10
        }
    ],
    "MediaItems": [
        {
            "ID": 13498,
            "ChargePointID": 93896,
            "ItemURL": "https://s3-ap-southeast-2.amazonaws.com/openchargemap/images/BE/OCM93896/OCM-93896.orig.2017101120222567.jpg",
            "ItemThumbnailURL": "https://s3-ap-southeast-2.amazonaws.com/openchargemap/images/BE/OCM93896/OCM-93896.thmb.2017101120222567.jpg",
            "Comment": "",
            "IsEnabled": true,
            "IsVideo": false,
            "IsFeaturedItem": false,
            "IsExternalResource": false,
            "User": {
                "ID": 11617,
                "Username": "Bert van Sas"
            },
            "DateCreated": "2017-10-11T20:23:00Z"
        },
        {
            "ID": 13499,
            "ChargePointID": 93896,
            "ItemURL": "https://s3-ap-southeast-2.amazonaws.com/openchargemap/images/BE/OCM93896/OCM-93896.orig.2017101120223763.jpg",
            "ItemThumbnailURL": "https://s3-ap-southeast-2.amazonaws.com/openchargemap/images/BE/OCM93896/OCM-93896.thmb.2017101120223763.jpg",
            "Comment": "",
            "IsEnabled": true,
            "IsVideo": false,
            "IsFeaturedItem": false,
            "IsExternalResource": false,
            "User": {
                "ID": 11617,
                "Username": "Bert van Sas"
            },
            "DateCreated": "2017-10-11T20:23:00Z"
        }
    ],
    "IsRecentlyVerified": false,
    "ID": 93896,
    "UUID": "925407E9-A79D-41A3-9FA8-402692BEE975",
    "DataProviderID": 1,
    "OperatorID": 3447,
    "OperatorsReference": "BEALLEGO000043",
    "UsageTypeID": 5,
    "UsageCost": "0,69€/kWh",
    "AddressInfo": {
        "ID": 94242,
        "Title": " Fast E - E17 Total Nazareth-Zuid to Gent Nazareth",
        "AddressLine1": "E17 - Zuid to Gent Nazareth",
        "Town": "Nazareth",
        "Postcode": "9810",
        "CountryID": 26,
        "Latitude": 50.9708875076667,
        "Longitude": 3.61046656966209,
        "AccessComments": "",
        "RelatedURL": "https://apps.total-ev-charge.com/charge-points/TOTAL-NB005632-001",
        "DistanceUnit": 0
    },
    "Connections": [
        {
            "ID": 132919,
            "ConnectionTypeID": 2,
            "StatusTypeID": 50,
            "LevelID": 3,
            "PowerKW": 100,
            "CurrentTypeID": 30,
            "Quantity": 2
        },
        {
            "ID": 132920,
            "ConnectionTypeID": 33,
            "StatusTypeID": 50,
            "LevelID": 3,
            "PowerKW": 175,
            "CurrentTypeID": 30,
            "Quantity": 2
        }
    ],
    "NumberOfPoints": 2,
    "StatusTypeID": 50,
    "DateLastStatusUpdate": "2021-05-21T20:48:00Z",
    "DataQualityLevel": 1,
    "DateCreated": "2017-10-11T20:14:00Z",
    "SubmissionStatusTypeID": 200
}