{
    "IsRecentlyVerified": false,
    "ID": 70242,
    "UUID": "5A51AACF-49C2-42B9-816E-E29440881652",
    "DataProviderID": 2,
    "DataProvidersReference": "76831",
    "OperatorID": 5,
    "UsageTypeID": 1,
    "AddressInfo": {
        "ID": 70588,
        "Title": "BMW FACILITIES",
        "AddressLine1": "5650 Arcturus Avenue",
        "Town": "Oxnard",
        "StateOrProvince": "CA",
        "Postcode": "93033",
        "CountryID": 2,
        "Latitude": 34.1464633,
        "Longitude": -119.1712067,
        "ContactTelephone1": "888-758-4389",
        "AccessComments": "24 hours daily",
        "RelatedURL": "http://www.chargepoint.com/",
        "DistanceUnit": 0
    },
    "Connections": [
        {
            "ID": 100283,
            "ConnectionTypeID": 1,
            "LevelID": 2,
            "Amps": 16,
            "Voltage": 230,
            "PowerKW": 3,
            "CurrentTypeID": 10,
            "Quantity": 1
        }
    ],
    "DateLastStatusUpdate": "2019-04-06T04:01:00Z",
    "DataQualityLevel": 3,
    "DateCreated": "2016-07-14T00:53:00Z",
    "SubmissionStatusTypeID": 100
}