{
    "IsRecentlyVerified": false,
    "ID": 84720,
    "UUID": "E8DB6CDF-589F-487D-AC0A-B4E6183C15B3",
    "DataProviderID": 1,
    "OperatorID": 32,
    "OperatorsReference": "24012",
    "UsageTypeID": 4,
    "UsageCost": "£0.35/kWh (Contactless Payment); £0.23/kWh (bpPulse subscription); £0.29/kWh (bpPulse app)",
    "AddressInfo": {
        "ID": 85066,
        "Title": "The Grove Hotel",
        "AddressLine1": "Grove Hill",
        "Town": "Watford",
        "StateOrProvince": "Hertfordshire",
        "Postcode": "WD3 4TG",
        "CountryID": 1,
        "Latitude": 51.678051,
        "Longitude": -0.43713,
        "RelatedURL": "https://www.thegrove.co.uk/",
        "DistanceUnit": 0
    },
    "Connections": [
        {
            "ID": 120349,
            "ConnectionTypeID": 2,
            "StatusTypeID": 50,
            "LevelID": 3,
            "Amps": 125,
            "Voltage": 400,
            "PowerKW": 50,
            "CurrentTypeID": 30,
            "Quantity": 1
        },
        {
            "ID": 120350,
            "ConnectionTypeID": 33,
            "StatusTypeID": 50,
            "LevelID": 3,
            "Amps": 125,
            "Voltage": 400,
            "PowerKW": 50,
            "CurrentTypeID": 30,
            "Quantity": 1
        },
        {
            "ID": 120351,
            "ConnectionTypeID": 1036,
            "StatusTypeID": 50,
            "LevelID": 3,
            "Amps": 63,
            "Voltage": 400,
            "PowerKW": 43,
            "CurrentTypeID": 20,
            "Quantity": 1
        }
    ],
    "NumberOfPoints": 4,
    "StatusTypeID": 50,
    "DateLastStatusUpdate": "2021-08-24T19:49:00Z",
    "DataQualityLevel": 1,
    "DateCreated": "2017-03-12T11:31:00Z",
    "SubmissionStatusTypeID": 200
}