{
    "IsRecentlyVerified": false,
    "ID": 107149,
    "UUID": "44CE1C75-DE94-4B54-90C4-AF8984B7DCEE",
    "DataProviderID": 1,
    "OperatorID": 3272,
    "UsageTypeID": 4,
    "AddressInfo": {
        "ID": 107495,
        "Title": "Emotì Evpass Parco Bissone",
        "AddressLine1": "Via Maroggia",
        "Town": "Bissone",
        "StateOrProvince": "Distretto di Lugano",
        "Postcode": "6816",
        "CountryID": 217,
        "Latitude": 45.94876416128277,
        "Longitude": 8.966238049190679,
        "ContactTelephone1": "+41 91 946 39 28",
        "ContactTelephone2": "+41 58 221 96 60",
        "RelatedURL": "https://emoti.evpass.ch/",
        "DistanceUnit": 0
    },
    "Connections": [
        {
            "ID": 151087,
            "ConnectionTypeID": 1036,
            "StatusTypeID": 50,
            "LevelID": 2,
            "Amps": 32,
            "Voltage": 400,
            "PowerKW": 22,
            "CurrentTypeID": 20,
            "Quantity": 2
        },
        {
            "ID": 151088,
            "ConnectionTypeID": 1,
            "StatusTypeID": 50,
            "LevelID": 2,
            "Amps": 32,
            "Voltage": 240,
            "PowerKW": 7,
            "CurrentTypeID": 10,
            "Quantity": 2
        },
        {
            "ID": 151089,
            "ConnectionTypeID": 1037,
            "StatusTypeID": 50,
            "LevelID": 2,
            "Amps": 16,
            "Voltage": 240,
            "PowerKW": 3.7,
            "CurrentTypeID": 10,
            "Quantity": 2
        }
    ],
    "NumberOfPoints": 2,
    "StatusTypeID": 50,
    "DateLastStatusUpdate": "2018-07-20T13:00:00Z",
    "DataQualityLevel": 1,
    "DateCreated": "2018-07-20T13:00:00Z",
    "SubmissionStatusTypeID": 200
}