{
    "IsRecentlyVerified": false,
    "ID": 187278,
    "UUID": "7A2B19A3-2C8A-493D-A8EF-76598D7D59F7",
    "DataProviderID": 29,
    "DataProvidersReference": "14143",
    "OperatorID": 3403,
    "AddressInfo": {
        "ID": 187637,
        "Title": "Kirchweg 60",
        "AddressLine1": "Kirchweg 60",
        "Town": "Henstedt-Ulzburg",
        "Postcode": "24558",
        "CountryID": 87,
        "Latitude": 53.79929,
        "Longitude": 9.97917,
        "DistanceUnit": 0
    },
    "Connections": [
        {
            "ID": 302171,
            "ConnectionTypeID": 1036,
            "StatusTypeID": 50,
            "LevelID": 2,
            "PowerKW": 22,
            "CurrentTypeID": 20
        },
        {
            "ID": 302172,
            "ConnectionTypeID": 33,
            "StatusTypeID": 50,
            "LevelID": 3,
            "PowerKW": 50,
            "CurrentTypeID": 30
        },
        {
            "ID": 302173,
            "ConnectionTypeID": 2,
            "StatusTypeID": 50,
            "LevelID": 3,
            "PowerKW": 50,
            "CurrentTypeID": 30
        }
    ],
    "StatusTypeID": 50,
    "DateLastStatusUpdate": "2021-07-12T02:52:00Z",
    "MetadataValues": [
        {
            "ID": 19518,
            "MetadataFieldID": 4,
            "ItemValue": "Data from the German chargepoint registry provided by Bundesnetzagentur.de under the CC-BY 4.0 license"
        }
    ],
    "DataQualityLevel": 3,
    "DateCreated": "2021-07-12T02:52:00Z",
    "SubmissionStatusTypeID": 100
}