{
    "IsRecentlyVerified": false,
    "ID": 90502,
    "UUID": "2E7B5C88-0B3A-47CB-B22F-643B660964AB",
    "DataProviderID": 1,
    "OperatorID": 45,
    "UsageTypeID": 6,
    "AddressInfo": {
        "ID": 90848,
        "Title": "House of Logistics and Mobility ",
        "AddressLine1": "Bessie-Coleman-Straße 7",
        "Town": "Frankfurt am Main",
        "StateOrProvince": "Frankfurt am Main",
        "Postcode": "60549",
        "CountryID": 87,
        "Latitude": 50.056422537319925,
        "Longitude": 8.592544380356566,
        "AccessComments": "Für Gäste ist Laden und Parken kostenlos, die Ladesäule ist rechts neben der Tiefgarageneinfahrt. Freischaltung durch Haustechnik; Einstecken erst nach Freischaltung.",
        "RelatedURL": "http://www.frankfurt-holm.de/de",
        "DistanceUnit": 0
    },
    "Connections": [
        {
            "ID": 128168,
            "ConnectionTypeID": 25,
            "StatusTypeID": 50,
            "LevelID": 2,
            "Amps": 32,
            "Voltage": 400,
            "PowerKW": 22,
            "CurrentTypeID": 20,
            "Quantity": 2
        }
    ],
    "NumberOfPoints": 2,
    "StatusTypeID": 50,
    "DateLastStatusUpdate": "2017-07-14T13:10:00Z",
    "DataQualityLevel": 1,
    "DateCreated": "2017-07-14T13:10:00Z",
    "SubmissionStatusTypeID": 200
}