{
    "IsRecentlyVerified": false,
    "ID": 146516,
    "UUID": "BBF6DCC9-BC5B-4B63-B93B-E8794B7B0BC9",
    "DataProviderID": 1,
    "OperatorID": 203,
    "UsageTypeID": 5,
    "UsageCost": "£0.36/kWh",
    "AddressInfo": {
        "ID": 146868,
        "Title": "The Two Rivers Pub and Restaurant",
        "AddressLine1": "Newport Road",
        "Town": "Chepstow",
        "Postcode": "NP16 5PR",
        "CountryID": 1,
        "Latitude": 51.63726,
        "Longitude": -2.68279,
        "RelatedURL": "https://engenie.co.uk/",
        "DistanceUnit": 0
    },
    "Connections": [
        {
            "ID": 203709,
            "ConnectionTypeID": 25,
            "Reference": "ENG00386-3",
            "StatusTypeID": 50,
            "LevelID": 2,
            "Amps": 32,
            "Voltage": 400,
            "PowerKW": 22,
            "CurrentTypeID": 20
        },
        {
            "ID": 203710,
            "ConnectionTypeID": 2,
            "Reference": "ENG00386-2",
            "StatusTypeID": 50,
            "LevelID": 3,
            "Amps": 125,
            "Voltage": 400,
            "PowerKW": 50,
            "CurrentTypeID": 30
        },
        {
            "ID": 203711,
            "ConnectionTypeID": 33,
            "Reference": "ENG00386-1",
            "StatusTypeID": 50,
            "LevelID": 3,
            "Amps": 125,
            "Voltage": 400,
            "PowerKW": 50,
            "CurrentTypeID": 30
        }
    ],
    "NumberOfPoints": 1,
    "StatusTypeID": 50,
    "DateLastStatusUpdate": "2020-01-10T12:48:00Z",
    "MetadataValues": [
        {
            "ID": 6961,
            "MetadataFieldID": 4,
            "ItemValue": "Contains public sector information licensed under the Open Government Licence v2.0. http://www.nationalarchives.gov.uk/doc/open-government-licence/version/2/"
        }
    ],
    "DataQualityLevel": 3,
    "DateCreated": "2020-01-10T12:27:00Z",
    "SubmissionStatusTypeID": 100
}