{
    "IsRecentlyVerified": false,
    "ID": 166578,
    "UUID": "1EFF88BA-F8C0-43CA-A8E0-D56BD3BBF367",
    "DataProviderID": 28,
    "DataProvidersReference": "FR*S28*PSDE28*GAL2",
    "UsageTypeID": 5,
    "AddressInfo": {
        "ID": 166937,
        "Title": "Gallardon | Rue Guy Pouillé",
        "AddressLine1": "Rue Guy Pouillé 28320 Gallardon",
        "CountryID": 80,
        "Latitude": 48.522625,
        "Longitude": 1.689164,
        "AccessComments": "24/24 7/7",
        "DistanceUnit": 0
    },
    "Connections": [
        {
            "ID": 249624,
            "ConnectionTypeID": 1036,
            "StatusTypeID": 50,
            "LevelID": 2,
            "PowerKW": 22,
            "CurrentTypeID": 20
        },
        {
            "ID": 249625,
            "ConnectionTypeID": 26,
            "StatusTypeID": 50,
            "LevelID": 2,
            "PowerKW": 22
        },
        {
            "ID": 249626,
            "ConnectionTypeID": 28,
            "StatusTypeID": 50,
            "LevelID": 2,
            "PowerKW": 22,
            "CurrentTypeID": 10
        }
    ],
    "GeneralComments": "",
    "StatusTypeID": 50,
    "DateLastStatusUpdate": "2020-08-27T05:15:00Z",
    "DataQualityLevel": 2,
    "DateCreated": "2020-08-27T05:15:00Z",
    "SubmissionStatusTypeID": 100
}