{
    "IsRecentlyVerified": false,
    "ID": 83957,
    "UUID": "5EC3F6F8-B435-4743-9B57-67FEBA150097",
    "DataProviderID": 1,
    "DataProvidersReference": "3782",
    "AddressInfo": {
        "ID": 84303,
        "Title": "Kyrksæterøra",
        "AddressLine1": "Fv 300 ",
        "Town": "KYRKSÆTERØRA",
        "StateOrProvince": "Trøndelag",
        "Postcode": "7200",
        "CountryID": 168,
        "Latitude": 63.32627,
        "Longitude": 9.10858,
        "AccessComments": "Naust rett utenfor Kyrksæterøra, ligger rett ved veien.",
        "DistanceUnit": 0
    },
    "Connections": [
        {
            "ID": 119265,
            "ConnectionTypeID": 0,
            "Reference": "1",
            "LevelID": 2,
            "Amps": 32,
            "Voltage": 230,
            "PowerKW": 7.4,
            "Comments": "Mode 1"
        }
    ],
    "NumberOfPoints": 1,
    "DateLastStatusUpdate": "2020-05-26T08:25:00Z",
    "DataQualityLevel": 2,
    "DateCreated": "2017-02-11T22:03:00Z",
    "SubmissionStatusTypeID": 100
}