{
    "UserComments": [
        {
            "ID": 22774,
            "ChargePointID": 149893,
            "CommentTypeID": 10,
            "UserName": "ForumElettrico.it",
            "Comment": "Il modello di colonnina è quello studiato apposta per Ionity, molto bello esteticamente. Leggi la recensione completa qui > https://www.forumelettrico.it/forum/ionity-eni-binasco-t8514.html",
            "RelatedURL": "https://www.forumelettrico.it/forum/ionity-eni-binasco-t8514.html",
            "DateCreated": "2020-06-13T16:49:26.783Z",
            "User": {
                "ID": 11749,
                "Username": "ForumElettrico.it"
            },
            "CheckinStatusTypeID": 140,
            "IsActionedByEditor": false
        }
    ],
    "MediaItems": [
        {
            "ID": 22628,
            "ChargePointID": 149893,
            "ItemURL": "https://s3-ap-southeast-2.amazonaws.com/openchargemap/images/IT/OCM149893/OCM-149893.orig.2020060919092861.jpg",
            "ItemThumbnailURL": "https://s3-ap-southeast-2.amazonaws.com/openchargemap/images/IT/OCM149893/OCM-149893.thmb.2020060919092861.jpg",
            "Comment": "",
            "IsEnabled": true,
            "IsVideo": false,
            "IsFeaturedItem": false,
            "IsExternalResource": false,
            "User": {
                "ID": 1606,
                "Username": "polianto"
            },
            "DateCreated": "2020-06-09T19:10:00Z"
        },
        {
            "ID": 22629,
            "ChargePointID": 149893,
            "ItemURL": "https://s3-ap-southeast-2.amazonaws.com/openchargemap/images/IT/OCM149893/OCM-149893.orig.2020060919094186.jpg",
            "ItemThumbnailURL": "https://s3-ap-southeast-2.amazonaws.com/openchargemap/images/IT/OCM149893/OCM-149893.thmb.2020060919094186.jpg",
            "Comment": "",
            "IsEnabled": true,
            "IsVideo": false,
            "IsFeaturedItem": false,
            "IsExternalResource": false,
            "User": {
                "ID": 1606,
                "Username": "polianto"
            },
            "DateCreated": "2020-06-09T19:10:00Z"
        },
        {
            "ID": 22626,
            "ChargePointID": 149893,
            "ItemURL": "https://s3-ap-southeast-2.amazonaws.com/openchargemap/images/IT/OCM149893/OCM-149893.orig.2020060919085005.jpg",
            "ItemThumbnailURL": "https://s3-ap-southeast-2.amazonaws.com/openchargemap/images/IT/OCM149893/OCM-149893.thmb.2020060919085005.jpg",
            "Comment": "",
            "IsEnabled": true,
            "IsVideo": false,
            "IsFeaturedItem": false,
            "IsExternalResource": false,
            "User": {
                "ID": 1606,
                "Username": "polianto"
            },
            "DateCreated": "2020-06-09T19:09:00Z"
        },
        {
            "ID": 22627,
            "ChargePointID": 149893,
            "ItemURL": "https://s3-ap-southeast-2.amazonaws.com/openchargemap/images/IT/OCM149893/OCM-149893.orig.2020060919090624.jpg",
            "ItemThumbnailURL": "https://s3-ap-southeast-2.amazonaws.com/openchargemap/images/IT/OCM149893/OCM-149893.thmb.2020060919090624.jpg",
            "Comment": "",
            "IsEnabled": true,
            "IsVideo": false,
            "IsFeaturedItem": false,
            "IsExternalResource": false,
            "User": {
                "ID": 1606,
                "Username": "polianto"
            },
            "DateCreated": "2020-06-09T19:09:00Z"
        }
    ],
    "IsRecentlyVerified": false,
    "ID": 149893,
    "UUID": "0FE270F3-4BC6-40CB-B638-1447E9D47B58",
    "DataProviderID": 1,
    "DataProvidersReference": "174",
    "OperatorID": 3299,
    "UsageTypeID": 1,
    "AddressInfo": {
        "ID": 150246,
        "Title": "IONITY Binasco",
        "AddressLine1": "Strada Statale dei Giovi",
        "AddressLine2": "2",
        "Town": "Binasco MI",
        "Postcode": "20082",
        "CountryID": 112,
        "Latitude": 45.33552,
        "Longitude": 9.10753,
        "DistanceUnit": 0
    },
    "Connections": [
        {
            "ID": 208122,
            "ConnectionTypeID": 33,
            "StatusTypeID": 50,
            "LevelID": 3,
            "PowerKW": 350,
            "CurrentTypeID": 30,
            "Quantity": 4
        }
    ],
    "NumberOfPoints": 4,
    "StatusTypeID": 50,
    "DateLastStatusUpdate": "2020-11-27T11:16:00Z",
    "DataQualityLevel": 3,
    "DateCreated": "2020-03-09T06:29:00Z",
    "SubmissionStatusTypeID": 200
}