{
    "IsRecentlyVerified": false,
    "ID": 37508,
    "UUID": "193FCD82-CDEF-422B-910B-E64C6256EE42",
    "DataProviderID": 26,
    "DataProvidersReference": "53951",
    "OperatorID": 78,
    "OperatorsReference": "Essent EM-NL-00000363-04-00063",
    "UsageCost": "0.00 jaarabonnement",
    "AddressInfo": {
        "ID": 37854,
        "Title": "Nicolaas Maesstraat",
        "AddressLine1": "Nicolaas Maesstraat",
        "Town": "Amsterdam",
        "Postcode": "1072 AM",
        "CountryID": 159,
        "Latitude": 52.35565,
        "Longitude": 4.88565,
        "RelatedURL": "http://www.essent.nl",
        "DistanceUnit": 0
    },
    "Connections": [
        {
            "ID": 41019,
            "ConnectionTypeID": 25,
            "LevelID": 2,
            "PowerKW": 11,
            "CurrentTypeID": 10
        },
        {
            "ID": 49029,
            "ConnectionTypeID": 25,
            "LevelID": 2,
            "PowerKW": 11,
            "CurrentTypeID": 10
        }
    ],
    "NumberOfPoints": 1,
    "StatusTypeID": 50,
    "DateLastStatusUpdate": "2016-06-04T02:53:00Z",
    "DataQualityLevel": 3,
    "DateCreated": "2015-01-09T06:07:00Z",
    "SubmissionStatusTypeID": 100
}