{
    "IsRecentlyVerified": false,
    "ID": 99469,
    "UUID": "7916B6BE-967D-4562-869E-3EFCC11AC6D4",
    "DataProviderID": 1,
    "OperatorID": 45,
    "UsageTypeID": 6,
    "AddressInfo": {
        "ID": 99815,
        "Title": "Hotelrestaurant  Overkamp",
        "AddressLine1": "Am Ellberg 1",
        "Town": "Dortmund",
        "StateOrProvince": "Dortmund",
        "Postcode": "44267",
        "CountryID": 87,
        "Latitude": 51.4499206,
        "Longitude": 7.505885499999977,
        "AccessComments": "Wallbox links neben der Eingangstreppe. Bitte parallel zur Straße parken. Die Ladestation ist nur für Gäste vorgesehen.",
        "RelatedURL": "https://www.overkamp-dortmund.de/",
        "DistanceUnit": 0
    },
    "Connections": [
        {
            "ID": 140558,
            "ConnectionTypeID": 25,
            "StatusTypeID": 50,
            "LevelID": 2,
            "Amps": 16,
            "Voltage": 230,
            "PowerKW": 3.7,
            "CurrentTypeID": 10,
            "Quantity": 1
        }
    ],
    "NumberOfPoints": 1,
    "StatusTypeID": 50,
    "DateLastStatusUpdate": "2018-01-26T07:14:00Z",
    "DataQualityLevel": 1,
    "DateCreated": "2018-01-26T07:14:00Z",
    "SubmissionStatusTypeID": 200
}