{
    "IsRecentlyVerified": false,
    "ID": 136514,
    "UUID": "7F6E6A55-88E3-4088-88FE-1B62AA1417EA",
    "DataProviderID": 18,
    "DataProvidersReference": "ffe51feba7c5e5e7b74db593b0d4f021",
    "OperatorID": 2244,
    "UsageTypeID": 5,
    "AddressInfo": {
        "ID": 136860,
        "Title": "Evering Road",
        "AddressLine1": "Evering Road",
        "Town": "London",
        "Postcode": "N16 7PU",
        "CountryID": 1,
        "Latitude": 51.55759,
        "Longitude": -0.070663,
        "AccessComments": "",
        "RelatedURL": "https://www.ubitricity.com",
        "DistanceUnit": 0
    },
    "Connections": [
        {
            "ID": 190964,
            "ConnectionTypeID": 25,
            "Reference": "suby1100002638",
            "StatusTypeID": 50,
            "LevelID": 2,
            "Amps": 16,
            "Voltage": 230,
            "PowerKW": 3.7,
            "CurrentTypeID": 10
        }
    ],
    "StatusTypeID": 0,
    "DateLastStatusUpdate": "2021-04-25T05:46:00Z",
    "MetadataValues": [
        {
            "ID": 6366,
            "MetadataFieldID": 4,
            "ItemValue": "Contains public sector information licensed under the Open Government Licence v2.0. http://www.nationalarchives.gov.uk/doc/open-government-licence/version/2/"
        }
    ],
    "DataQualityLevel": 3,
    "DateCreated": "2019-12-24T05:22:00Z",
    "SubmissionStatusTypeID": 100
}