{
    "IsRecentlyVerified": false,
    "ID": 116067,
    "UUID": "9CAA9399-4B78-48A7-B15D-EBFF038155E3",
    "DataProviderID": 2,
    "DataProvidersReference": "115351",
    "OperatorID": 23,
    "UsageTypeID": 2,
    "AddressInfo": {
        "ID": 116413,
        "Title": "Airbnb - Bend - Tesla Destination",
        "AddressLine1": "1454 NW Newport Ave",
        "Town": "Bend",
        "StateOrProvince": "OR",
        "Postcode": "97703",
        "CountryID": 2,
        "Latitude": 44.06278,
        "Longitude": -121.332893,
        "ContactTelephone1": "",
        "AccessComments": "For Tesla use only; reservation required ",
        "RelatedURL": "https://www.tesla.com/destination-charging",
        "DistanceUnit": 0
    },
    "Connections": [
        {
            "ID": 163127,
            "ConnectionTypeID": 0,
            "LevelID": 2,
            "Amps": 16,
            "Voltage": 230,
            "PowerKW": 3,
            "CurrentTypeID": 10,
            "Quantity": 1
        }
    ],
    "DateLastStatusUpdate": "2019-04-06T05:06:00Z",
    "DataQualityLevel": 3,
    "DateCreated": "2019-02-11T07:13:00Z",
    "SubmissionStatusTypeID": 100
}