{
    "IsRecentlyVerified": false,
    "ID": 36709,
    "UUID": "2E840CEB-31F9-4743-801A-F3C64C9D446D",
    "DataProviderID": 26,
    "DataProvidersReference": "46595",
    "OperatorID": 73,
    "OperatorsReference": "EV-Box EVB-P1408058",
    "UsageCost": "0.00 jaarabonnement",
    "AddressInfo": {
        "ID": 37055,
        "Title": "Bachstraat 15",
        "AddressLine1": "Bachstraat 15",
        "Town": "Voorst",
        "Postcode": "7391 XA",
        "CountryID": 159,
        "Latitude": 52.23108,
        "Longitude": 6.09531,
        "RelatedURL": "http://www.ev-box.nl",
        "DistanceUnit": 0
    },
    "Connections": [
        {
            "ID": 40220,
            "ConnectionTypeID": 25,
            "LevelID": 2,
            "PowerKW": 11,
            "CurrentTypeID": 10
        },
        {
            "ID": 48448,
            "ConnectionTypeID": 25,
            "LevelID": 2,
            "PowerKW": 11,
            "CurrentTypeID": 10
        }
    ],
    "NumberOfPoints": 1,
    "StatusTypeID": 50,
    "DateLastStatusUpdate": "2016-06-04T02:52:00Z",
    "DataQualityLevel": 3,
    "DateCreated": "2015-01-09T06:07:00Z",
    "SubmissionStatusTypeID": 100
}