{
    "IsRecentlyVerified": false,
    "ID": 35281,
    "UUID": "526861F7-C438-4905-9441-E639E57321F7",
    "DataProviderID": 26,
    "DataProvidersReference": "47602",
    "OperatorID": 178,
    "OperatorsReference": "EVnetNL AL754",
    "UsageCost": "0.00 jaarabonnement",
    "AddressInfo": {
        "ID": 35627,
        "Title": "Kapellestraat 13",
        "AddressLine1": "Kapellestraat 13",
        "Town": "Oudewater",
        "Postcode": "3421 CT",
        "CountryID": 159,
        "Latitude": 52.022121,
        "Longitude": 4.8733,
        "ContactTelephone1": "0800-3522365",
        "RelatedURL": "http://www.evnet.nl",
        "DistanceUnit": 0
    },
    "Connections": [
        {
            "ID": 38792,
            "ConnectionTypeID": 25,
            "LevelID": 2,
            "PowerKW": 11,
            "CurrentTypeID": 10
        }
    ],
    "NumberOfPoints": 2,
    "StatusTypeID": 50,
    "DateLastStatusUpdate": "2016-06-04T02:44:00Z",
    "DataQualityLevel": 3,
    "DateCreated": "2015-01-09T06:04:00Z",
    "SubmissionStatusTypeID": 100
}