{
    "IsRecentlyVerified": false,
    "ID": 107844,
    "UUID": "F88A12A0-1B4C-4D53-878A-E5FE667954B0",
    "DataProviderID": 1,
    "OperatorID": 103,
    "UsageTypeID": 4,
    "AddressInfo": {
        "ID": 108190,
        "Title": "Supermarkt Rewe",
        "AddressLine1": "Hermann-Ritter-Straße 101",
        "Town": "Bremen",
        "StateOrProvince": "Bremen",
        "Postcode": "28197",
        "CountryID": 87,
        "Latitude": 53.0764504,
        "Longitude": 8.774277600000005,
        "AccessComments": "24/7 nutzbarer Triplecharger am Rand des Parkplatzes am Zaun.",
        "DistanceUnit": 0
    },
    "Connections": [
        {
            "ID": 152281,
            "ConnectionTypeID": 1036,
            "StatusTypeID": 50,
            "LevelID": 3,
            "Amps": 63,
            "Voltage": 400,
            "PowerKW": 43,
            "CurrentTypeID": 20,
            "Quantity": 1
        },
        {
            "ID": 152282,
            "ConnectionTypeID": 2,
            "StatusTypeID": 50,
            "LevelID": 3,
            "PowerKW": 50,
            "CurrentTypeID": 30,
            "Quantity": 1
        },
        {
            "ID": 152283,
            "ConnectionTypeID": 33,
            "StatusTypeID": 50,
            "LevelID": 3,
            "PowerKW": 50,
            "CurrentTypeID": 30,
            "Quantity": 1
        }
    ],
    "NumberOfPoints": 3,
    "StatusTypeID": 50,
    "DateLastStatusUpdate": "2018-08-13T06:48:00Z",
    "DataQualityLevel": 1,
    "DateCreated": "2018-08-13T06:48:00Z",
    "SubmissionStatusTypeID": 200
}