{
    "IsRecentlyVerified": false,
    "ID": 159540,
    "UUID": "DAA08EAB-778E-46CD-B826-6BF7BD3FBF48",
    "DataProviderID": 2,
    "DataProvidersReference": "153512",
    "OperatorID": 5,
    "UsageTypeID": 1,
    "AddressInfo": {
        "ID": 159897,
        "Title": "HILLIARD",
        "AddressLine1": "3810 Veterans Memorial Dr",
        "Town": "Hilliard",
        "StateOrProvince": "OH",
        "Postcode": "43026",
        "CountryID": 2,
        "Latitude": 40.02919,
        "Longitude": -83.16833,
        "ContactTelephone1": "888-758-4389",
        "AccessComments": "24 hours daily",
        "RelatedURL": "http://www.chargepoint.com/",
        "DistanceUnit": 0
    },
    "Connections": [
        {
            "ID": 229732,
            "ConnectionTypeID": 1,
            "LevelID": 2,
            "Amps": 16,
            "Voltage": 230,
            "PowerKW": 3.7,
            "CurrentTypeID": 10,
            "Quantity": 2
        }
    ],
    "StatusTypeID": 50,
    "DateLastStatusUpdate": "2020-06-26T03:02:00Z",
    "DataQualityLevel": 3,
    "DateCreated": "2020-06-26T03:02:00Z",
    "SubmissionStatusTypeID": 100
}