{
    "IsRecentlyVerified": false,
    "ID": 150311,
    "UUID": "155F4F73-771A-4C5B-BE9E-45D23907214F",
    "DataProviderID": 28,
    "DataProvidersReference": "FR*S83*P83098*A",
    "UsageTypeID": 5,
    "AddressInfo": {
        "ID": 150664,
        "Title": "LE PRADET_Rue Paulin David",
        "AddressLine1": "Rue Paulin David 83220 LE PRADET",
        "CountryID": 80,
        "Latitude": 43.106136,
        "Longitude": 6.024325,
        "AccessComments": "24/24 7/7 jours",
        "DistanceUnit": 0
    },
    "Connections": [
        {
            "ID": 208883,
            "ConnectionTypeID": 28,
            "StatusTypeID": 50,
            "LevelID": 2,
            "PowerKW": 22,
            "CurrentTypeID": 10
        },
        {
            "ID": 208884,
            "ConnectionTypeID": 1036,
            "StatusTypeID": 50,
            "LevelID": 2,
            "PowerKW": 22,
            "CurrentTypeID": 20
        },
        {
            "ID": 237494,
            "ConnectionTypeID": 28,
            "StatusTypeID": 50,
            "LevelID": 2,
            "PowerKW": 22,
            "CurrentTypeID": 10
        },
        {
            "ID": 237495,
            "ConnectionTypeID": 1036,
            "StatusTypeID": 50,
            "LevelID": 2,
            "PowerKW": 22,
            "CurrentTypeID": 20
        }
    ],
    "GeneralComments": "",
    "StatusTypeID": 50,
    "DateLastStatusUpdate": "2020-08-27T05:10:00Z",
    "DataQualityLevel": 2,
    "DateCreated": "2020-03-15T06:17:00Z",
    "SubmissionStatusTypeID": 100
}