{
    "IsRecentlyVerified": false,
    "ID": 186128,
    "UUID": "6626AF7B-2145-420B-ADDB-1F178642EBA7",
    "DataProviderID": 29,
    "DataProvidersReference": "10371",
    "AddressInfo": {
        "ID": 186487,
        "Title": "Lindenstraße 1",
        "AddressLine1": "Lindenstraße 1",
        "Town": "Rodewisch",
        "Postcode": "08228",
        "CountryID": 87,
        "Latitude": 50.5310053,
        "Longitude": 12.4032027,
        "DistanceUnit": 0
    },
    "Connections": [
        {
            "ID": 297870,
            "ConnectionTypeID": 25,
            "StatusTypeID": 50,
            "LevelID": 2,
            "PowerKW": 22,
            "CurrentTypeID": 20
        },
        {
            "ID": 297871,
            "ConnectionTypeID": 25,
            "StatusTypeID": 50,
            "LevelID": 2,
            "PowerKW": 22,
            "CurrentTypeID": 20
        }
    ],
    "StatusTypeID": 50,
    "DateLastStatusUpdate": "2021-07-12T02:45:00Z",
    "MetadataValues": [
        {
            "ID": 18370,
            "MetadataFieldID": 4,
            "ItemValue": "Data from the German chargepoint registry provided by Bundesnetzagentur.de under the CC-BY 4.0 license"
        }
    ],
    "DataQualityLevel": 3,
    "DateCreated": "2021-07-12T02:45:00Z",
    "SubmissionStatusTypeID": 100
}