{
    "MediaItems": [
        {
            "ID": 26748,
            "ChargePointID": 54486,
            "ItemURL": "https://s3-ap-southeast-2.amazonaws.com/openchargemap/images/CZ/OCM54486/OCM-54486.orig.2021030315233384.jpg",
            "ItemThumbnailURL": "https://s3-ap-southeast-2.amazonaws.com/openchargemap/images/CZ/OCM54486/OCM-54486.thmb.2021030315233384.jpg",
            "Comment": "#pre #zlicinikea #prazskaenergetika #pomala #nabijecka ",
            "IsEnabled": true,
            "IsVideo": false,
            "IsFeaturedItem": false,
            "IsExternalResource": false,
            "User": {
                "ID": 22495,
                "Username": "MAJKL_elektro🔋"
            },
            "DateCreated": "2021-03-03T15:24:00Z"
        },
        {
            "ID": 26745,
            "ChargePointID": 54486,
            "ItemURL": "https://s3-ap-southeast-2.amazonaws.com/openchargemap/images/CZ/OCM54486/OCM-54486.orig.2021030315223482.jpg",
            "ItemThumbnailURL": "https://s3-ap-southeast-2.amazonaws.com/openchargemap/images/CZ/OCM54486/OCM-54486.thmb.2021030315223482.jpg",
            "Comment": "#pre #zlicinikea #prazskaenergetika #pomala #nabijecka ",
            "IsEnabled": true,
            "IsVideo": false,
            "IsFeaturedItem": false,
            "IsExternalResource": false,
            "User": {
                "ID": 22495,
                "Username": "MAJKL_elektro🔋"
            },
            "DateCreated": "2021-03-03T15:23:00Z"
        },
        {
            "ID": 26746,
            "ChargePointID": 54486,
            "ItemURL": "https://s3-ap-southeast-2.amazonaws.com/openchargemap/images/CZ/OCM54486/OCM-54486.orig.2021030315225105.jpg",
            "ItemThumbnailURL": "https://s3-ap-southeast-2.amazonaws.com/openchargemap/images/CZ/OCM54486/OCM-54486.thmb.2021030315225105.jpg",
            "Comment": "#pre #zlicinikea #prazskaenergetika #pomala #nabijecka ",
            "IsEnabled": true,
            "IsVideo": false,
            "IsFeaturedItem": false,
            "IsExternalResource": false,
            "User": {
                "ID": 22495,
                "Username": "MAJKL_elektro🔋"
            },
            "DateCreated": "2021-03-03T15:23:00Z"
        },
        {
            "ID": 26747,
            "ChargePointID": 54486,
            "ItemURL": "https://s3-ap-southeast-2.amazonaws.com/openchargemap/images/CZ/OCM54486/OCM-54486.orig.2021030315231389.jpg",
            "ItemThumbnailURL": "https://s3-ap-southeast-2.amazonaws.com/openchargemap/images/CZ/OCM54486/OCM-54486.thmb.2021030315231389.jpg",
            "Comment": "#pre #zlicinikea #prazskaenergetika #pomala #nabijecka ",
            "IsEnabled": true,
            "IsVideo": false,
            "IsFeaturedItem": false,
            "IsExternalResource": false,
            "User": {
                "ID": 22495,
                "Username": "MAJKL_elektro🔋"
            },
            "DateCreated": "2021-03-03T15:23:00Z"
        },
        {
            "ID": 26744,
            "ChargePointID": 54486,
            "ItemURL": "https://s3-ap-southeast-2.amazonaws.com/openchargemap/images/CZ/OCM54486/OCM-54486.orig.2021030315220904.jpg",
            "ItemThumbnailURL": "https://s3-ap-southeast-2.amazonaws.com/openchargemap/images/CZ/OCM54486/OCM-54486.thmb.2021030315220904.jpg",
            "Comment": "#pre #zlicinikea #prazskaenergetika #pomala #nabijecka ",
            "IsEnabled": true,
            "IsVideo": false,
            "IsFeaturedItem": false,
            "IsExternalResource": false,
            "User": {
                "ID": 22495,
                "Username": "MAJKL_elektro🔋"
            },
            "DateCreated": "2021-03-03T15:22:00Z"
        }
    ],
    "IsRecentlyVerified": false,
    "ID": 54486,
    "UUID": "4F515263-FA6D-40B2-BEBF-34A83D8B5FFE",
    "DataProviderID": 1,
    "OperatorID": 190,
    "UsageTypeID": 4,
    "AddressInfo": {
        "ID": 54832,
        "Title": "PRE Avion Shopping Park Praha Zličín",
        "AddressLine1": "Skandinávská 131/1",
        "Town": "Praha",
        "StateOrProvince": "okres Hlavní město Praha",
        "Postcode": "15521",
        "CountryID": 64,
        "Latitude": 50.051188,
        "Longitude": 14.297401,
        "ContactTelephone1": "+420296777999",
        "RelatedURL": "http://www.prague.avion.cz/",
        "DistanceUnit": 0
    },
    "Connections": [
        {
            "ID": 68736,
            "ConnectionTypeID": 25,
            "StatusTypeID": 50,
            "LevelID": 2,
            "Amps": 32,
            "Voltage": 400,
            "PowerKW": 22,
            "CurrentTypeID": 20,
            "Quantity": 1
        },
        {
            "ID": 68737,
            "ConnectionTypeID": 23,
            "StatusTypeID": 50,
            "LevelID": 2,
            "Amps": 16,
            "Voltage": 230,
            "PowerKW": 3.6,
            "CurrentTypeID": 10,
            "Quantity": 1
        }
    ],
    "NumberOfPoints": 1,
    "GeneralComments": "u východu z IKEA",
    "StatusTypeID": 50,
    "DateLastStatusUpdate": "2021-03-03T15:24:00Z",
    "DataQualityLevel": 1,
    "DateCreated": "2015-10-04T19:03:00Z",
    "SubmissionStatusTypeID": 200
}