{
    "IsRecentlyVerified": false,
    "ID": 142494,
    "UUID": "4754EE54-262C-431D-930C-B7BDF35C2A2E",
    "DataProviderID": 2,
    "DataProvidersReference": "123099",
    "OperatorID": 3372,
    "UsageTypeID": 1,
    "AddressInfo": {
        "ID": 142846,
        "Title": "Moriches Community Center",
        "AddressLine1": "313 Frowein Rd",
        "Town": "Center Moriches",
        "StateOrProvince": "NY",
        "Postcode": "11934",
        "CountryID": 2,
        "Latitude": 40.8049229,
        "Longitude": -72.8076727999999,
        "ContactTelephone1": "866-816-7584",
        "AccessComments": "24 hours daily",
        "RelatedURL": "http://evconnect.com/",
        "DistanceUnit": 0
    },
    "Connections": [
        {
            "ID": 198642,
            "ConnectionTypeID": 1,
            "LevelID": 2,
            "Amps": 16,
            "Voltage": 230,
            "PowerKW": 3.7,
            "CurrentTypeID": 10,
            "Quantity": 2
        }
    ],
    "StatusTypeID": 50,
    "DateLastStatusUpdate": "2020-06-26T03:03:00Z",
    "DataQualityLevel": 3,
    "DateCreated": "2019-12-24T09:18:00Z",
    "SubmissionStatusTypeID": 100
}