{
    "IsRecentlyVerified": false,
    "ID": 28555,
    "UUID": "1DAAD5E6-B5F5-432A-82BD-F22538CD4B22",
    "DataProviderID": 2,
    "DataProvidersReference": "49158",
    "UsageTypeID": 7,
    "AddressInfo": {
        "ID": 28901,
        "Title": "Ridgefield BMW",
        "AddressLine1": "746 Danbury Rd",
        "Town": "Ridgefield",
        "StateOrProvince": "CT",
        "Postcode": "06877",
        "CountryID": 2,
        "Latitude": 41.331117,
        "Longitude": -73.472615,
        "ContactTelephone1": "203-438-0471",
        "AccessComments": "Dealership business hours; for customer use only\r\nPublic - Call ahead",
        "RelatedURL": "",
        "DistanceUnit": 0
    },
    "Connections": [
        {
            "ID": 31376,
            "ConnectionTypeID": 1,
            "LevelID": 2,
            "Amps": 16,
            "Voltage": 230,
            "PowerKW": 3.7,
            "CurrentTypeID": 10,
            "Quantity": 2
        }
    ],
    "DateLastStatusUpdate": "2020-06-26T03:04:00Z",
    "DataQualityLevel": 3,
    "DateCreated": "2014-11-28T03:38:00Z",
    "SubmissionStatusTypeID": 100
}