{
    "IsRecentlyVerified": false,
    "ID": 15181,
    "UUID": "4A1A7FC1-3F9F-4F38-B66B-D7742F92FD8A",
    "DataProviderID": 1,
    "OperatorID": 22,
    "OperatorsReference": "C6L5W",
    "UsageTypeID": 4,
    "AddressInfo": {
        "ID": 15527,
        "Title": "The Square",
        "AddressLine1": "Listowel",
        "Town": "Kerry",
        "StateOrProvince": "County Kerry",
        "CountryID": 3,
        "Latitude": 52.444613,
        "Longitude": -9.485837,
        "DistanceUnit": 0
    },
    "Connections": [
        {
            "ID": 13460,
            "ConnectionTypeID": 25,
            "StatusTypeID": 50,
            "LevelID": 2,
            "Amps": 32,
            "Voltage": 400,
            "PowerKW": 22,
            "CurrentTypeID": 20,
            "Quantity": 2
        }
    ],
    "NumberOfPoints": 2,
    "StatusTypeID": 50,
    "DateLastStatusUpdate": "2017-02-09T22:12:00Z",
    "DataQualityLevel": 2,
    "DateCreated": "2012-12-19T04:51:00Z",
    "SubmissionStatusTypeID": 100
}