{
    "IsRecentlyVerified": false,
    "ID": 62044,
    "UUID": "C9437FC1-190E-4CCD-BC46-7FD520795965",
    "DataProviderID": 2,
    "DataProvidersReference": "72281",
    "OperatorID": 5,
    "UsageTypeID": 1,
    "AddressInfo": {
        "ID": 62390,
        "Title": "CARL'S JR.",
        "AddressLine1": "300 Vann St",
        "Town": "Williams",
        "StateOrProvince": "CA",
        "Postcode": "95987",
        "CountryID": 2,
        "Latitude": 39.1576283255644,
        "Longitude": -122.140704592601,
        "ContactTelephone1": "888-758-4389",
        "AccessComments": "24 hours daily",
        "RelatedURL": "http://www.chargepoint.com/",
        "DistanceUnit": 0
    },
    "Connections": [
        {
            "ID": 78947,
            "ConnectionTypeID": 32,
            "StatusTypeID": 50,
            "LevelID": 3,
            "Amps": 62,
            "Voltage": 400,
            "PowerKW": 25,
            "CurrentTypeID": 30,
            "Quantity": 1
        }
    ],
    "StatusTypeID": 0,
    "DateLastStatusUpdate": "2019-05-16T07:57:00Z",
    "DataQualityLevel": 3,
    "DateCreated": "2016-03-03T11:38:00Z",
    "SubmissionStatusTypeID": 100
}