{
    "IsRecentlyVerified": false,
    "ID": 182079,
    "UUID": "3AA141DB-36C7-4EC6-B945-26DBF174E879",
    "DataProviderID": 29,
    "DataProvidersReference": "19327",
    "OperatorID": 127,
    "AddressInfo": {
        "ID": 182438,
        "Title": "Südstrand",
        "AddressLine1": "Südstrand",
        "Town": "Wilhelmshaven",
        "Postcode": "26382",
        "CountryID": 87,
        "Latitude": 53.523886813118,
        "Longitude": 8.076775074005,
        "DistanceUnit": 0
    },
    "Connections": [
        {
            "ID": 287376,
            "ConnectionTypeID": 25,
            "StatusTypeID": 50,
            "LevelID": 2,
            "PowerKW": 22,
            "CurrentTypeID": 20
        },
        {
            "ID": 287377,
            "ConnectionTypeID": 25,
            "StatusTypeID": 50,
            "LevelID": 2,
            "PowerKW": 22,
            "CurrentTypeID": 20
        }
    ],
    "StatusTypeID": 50,
    "DateLastStatusUpdate": "2021-07-12T02:51:00Z",
    "MetadataValues": [
        {
            "ID": 14373,
            "MetadataFieldID": 4,
            "ItemValue": "Data from the German chargepoint registry provided by Bundesnetzagentur.de under the CC-BY 4.0 license"
        }
    ],
    "DataQualityLevel": 3,
    "DateCreated": "2021-07-08T10:02:00Z",
    "SubmissionStatusTypeID": 100
}