{
    "IsRecentlyVerified": false,
    "ID": 39042,
    "UUID": "9B42A0EC-7807-4420-AA90-197781278535",
    "DataProviderID": 26,
    "DataProvidersReference": "57377",
    "OperatorID": 73,
    "OperatorsReference": "EV-Box EVB-P1430197",
    "UsageCost": "0.00 jaarabonnement",
    "AddressInfo": {
        "ID": 39388,
        "Title": "Zuiderkruisweg",
        "AddressLine1": "Zuiderkruisweg",
        "Town": "Leeuwarden",
        "Postcode": "8938 AL",
        "CountryID": 159,
        "Latitude": 53.1938,
        "Longitude": 5.84415,
        "RelatedURL": "http://www.ev-box.nl",
        "DistanceUnit": 0
    },
    "Connections": [
        {
            "ID": 42553,
            "ConnectionTypeID": 25,
            "LevelID": 2,
            "PowerKW": 11,
            "CurrentTypeID": 10
        },
        {
            "ID": 49845,
            "ConnectionTypeID": 25,
            "LevelID": 2,
            "PowerKW": 11,
            "CurrentTypeID": 10
        }
    ],
    "NumberOfPoints": 1,
    "StatusTypeID": 50,
    "DateLastStatusUpdate": "2016-06-04T02:56:00Z",
    "DataQualityLevel": 3,
    "DateCreated": "2015-01-09T06:08:00Z",
    "SubmissionStatusTypeID": 100
}