{
    "IsRecentlyVerified": false,
    "ID": 55012,
    "UUID": "43F0BDF0-FCAE-4F2C-9562-1B18D441B748",
    "DataProviderID": 1,
    "OperatorID": 219,
    "UsageTypeID": 7,
    "AddressInfo": {
        "ID": 55358,
        "Title": "Hotel Bannwaldsee",
        "AddressLine1": "Sesselbahnstraße 10",
        "Town": "Halblech",
        "StateOrProvince": "Landkreis Ostallgäu",
        "Postcode": "87642",
        "CountryID": 87,
        "Latitude": 47.6125091,
        "Longitude": 10.8037491,
        "ContactTelephone1": "+498368-9280",
        "AccessComments": "Die Ladekarte ist an der Rezeption erhältlich. Betreiber ist die Energieversorgung Buching-Trauchgau GmbH",
        "RelatedURL": "http://ebt-halblech.de/",
        "DistanceUnit": 0
    },
    "Connections": [
        {
            "ID": 69513,
            "ConnectionTypeID": 25,
            "StatusTypeID": 50,
            "LevelID": 2,
            "Amps": 32,
            "Voltage": 400,
            "PowerKW": 22,
            "CurrentTypeID": 20,
            "Quantity": 2
        }
    ],
    "NumberOfPoints": 2,
    "StatusTypeID": 50,
    "DateLastStatusUpdate": "2015-10-12T17:17:00Z",
    "DataQualityLevel": 1,
    "DateCreated": "2015-10-12T06:39:00Z",
    "SubmissionStatusTypeID": 200
}