{
    "IsRecentlyVerified": false,
    "ID": 110199,
    "UUID": "510DCE8B-8D0F-4EE4-ACED-CBEEB36682C7",
    "DataProviderID": 2,
    "DataProvidersReference": "99238",
    "OperatorID": 59,
    "UsageTypeID": 1,
    "AddressInfo": {
        "ID": 110545,
        "Title": "Greenlots - 122404",
        "AddressLine1": "7935 Vineland Ave.",
        "Town": "Sun Valley",
        "StateOrProvince": "CA",
        "Postcode": "91352",
        "CountryID": 2,
        "Latitude": 34.214925,
        "Longitude": -118.370961,
        "ContactTelephone1": "855-900-7584",
        "AccessComments": "24 hours daily",
        "RelatedURL": "http://greenlots.com/",
        "DistanceUnit": 0
    },
    "Connections": [
        {
            "ID": 155435,
            "ConnectionTypeID": 1,
            "LevelID": 2,
            "Amps": 16,
            "Voltage": 230,
            "PowerKW": 3,
            "CurrentTypeID": 10,
            "Quantity": 2
        }
    ],
    "DateLastStatusUpdate": "2019-04-06T04:02:00Z",
    "DataQualityLevel": 3,
    "DateCreated": "2018-10-18T23:35:00Z",
    "SubmissionStatusTypeID": 100
}