{
    "IsRecentlyVerified": false,
    "ID": 51983,
    "UUID": "5FCA4731-30CA-49F0-84A7-CE297B491606",
    "DataProviderID": 2,
    "DataProvidersReference": "68851",
    "OperatorID": 39,
    "UsageTypeID": 4,
    "AddressInfo": {
        "ID": 52329,
        "Title": "Riverbend on the Charles",
        "AddressLine1": "270 Pleasant St.",
        "Town": "Watertown",
        "StateOrProvince": "MA",
        "Postcode": "02472",
        "CountryID": 2,
        "Latitude": 42.367809,
        "Longitude": -71.197059,
        "ContactTelephone1": "800-663-5633",
        "AccessComments": "MO: Not Specified; TU: Not Specified; WE: Not Specified; TH: Not Specified; FR: Not Specified; SA: Not Specified; SU: Not Specified",
        "RelatedURL": "http://www.semacharge.com/",
        "DistanceUnit": 0
    },
    "Connections": [
        {
            "ID": 64468,
            "ConnectionTypeID": 1,
            "LevelID": 2,
            "Amps": 16,
            "Voltage": 230,
            "PowerKW": 3,
            "CurrentTypeID": 10,
            "Quantity": 2
        }
    ],
    "DateLastStatusUpdate": "2019-04-06T05:05:00Z",
    "DataQualityLevel": 3,
    "DateCreated": "2015-08-13T03:43:00Z",
    "SubmissionStatusTypeID": 100
}