{
    "IsRecentlyVerified": false,
    "ID": 121383,
    "UUID": "D78B4574-A217-45BD-804B-36E2FA888DAE",
    "DataProviderID": 2,
    "DataProvidersReference": "118988",
    "OperatorID": 5,
    "UsageTypeID": 1,
    "AddressInfo": {
        "ID": 121729,
        "Title": "ECCC - PESC-01",
        "AddressLine1": "2645 Dollarton Hwy",
        "Town": "North Vancouver",
        "StateOrProvince": "BC",
        "Postcode": "V7H",
        "CountryID": 44,
        "Latitude": 49.3074527,
        "Longitude": -123.0016663,
        "ContactTelephone1": "888-758-4389",
        "AccessComments": "24 hours daily",
        "RelatedURL": "http://www.chargepoint.com/",
        "DistanceUnit": 0
    },
    "Connections": [
        {
            "ID": 170842,
            "ConnectionTypeID": 1,
            "LevelID": 2,
            "Amps": 16,
            "Voltage": 230,
            "PowerKW": 3.7,
            "CurrentTypeID": 10,
            "Quantity": 2
        }
    ],
    "DateLastStatusUpdate": "2020-06-26T03:12:00Z",
    "DataQualityLevel": 3,
    "DateCreated": "2019-04-01T05:00:00Z",
    "SubmissionStatusTypeID": 100
}