{
    "IsRecentlyVerified": false,
    "ID": 14175,
    "UUID": "77960137-8ACF-4249-A7D4-56E9F9578BA2",
    "DataProviderID": 2,
    "DataProvidersReference": "45840",
    "UsageTypeID": 7,
    "AddressInfo": {
        "ID": 14072,
        "Title": "Gray-Daniels Nissan - Jackson",
        "AddressLine1": "6080 I-55 N Frontage Rd",
        "Town": "Jackson",
        "StateOrProvince": "MS",
        "Postcode": "39211",
        "CountryID": 2,
        "Latitude": 32.39278,
        "Longitude": -90.144432,
        "ContactTelephone1": "601-956-7522",
        "AccessComments": "Dealership business hours\r\nPublic - Call ahead",
        "RelatedURL": "",
        "DistanceUnit": 0
    },
    "Connections": [
        {
            "ID": 16482,
            "ConnectionTypeID": 1,
            "LevelID": 2,
            "Amps": 16,
            "Voltage": 230,
            "PowerKW": 3.7,
            "CurrentTypeID": 10,
            "Quantity": 1
        },
        {
            "ID": 21568,
            "ConnectionTypeID": 1,
            "LevelID": 2,
            "Quantity": 1
        }
    ],
    "DateLastStatusUpdate": "2020-06-26T02:54:00Z",
    "DataQualityLevel": 3,
    "DateCreated": "2012-12-06T16:49:00Z",
    "SubmissionStatusTypeID": 100
}