{
    "IsRecentlyVerified": false,
    "ID": 161257,
    "UUID": "9B898A58-D78D-45B3-960D-68F7A41DBC46",
    "DataProviderID": 1,
    "OperatorID": 3390,
    "UsageTypeID": 4,
    "AddressInfo": {
        "ID": 161614,
        "Title": "QuickPower",
        "AddressLine1": "Borshchahivska Street",
        "AddressLine2": "Караваєві дачі",
        "Town": "Kyiv",
        "Postcode": "03058",
        "CountryID": 234,
        "Latitude": 50.44599901379502,
        "Longitude": 30.44339015528942,
        "DistanceUnit": 0
    },
    "Connections": [
        {
            "ID": 232018,
            "ConnectionTypeID": 33,
            "StatusTypeID": 50,
            "LevelID": 3,
            "PowerKW": 50,
            "CurrentTypeID": 30,
            "Quantity": 1
        },
        {
            "ID": 232019,
            "ConnectionTypeID": 2,
            "StatusTypeID": 50,
            "LevelID": 3,
            "PowerKW": 50,
            "CurrentTypeID": 30,
            "Quantity": 1
        },
        {
            "ID": 232020,
            "ConnectionTypeID": 25,
            "StatusTypeID": 50,
            "LevelID": 2,
            "PowerKW": 22,
            "CurrentTypeID": 20,
            "Quantity": 1
        }
    ],
    "NumberOfPoints": 1,
    "StatusTypeID": 50,
    "DateLastStatusUpdate": "2020-07-17T05:55:00Z",
    "DataQualityLevel": 1,
    "DateCreated": "2020-07-07T07:27:00Z",
    "SubmissionStatusTypeID": 200
}