{
    "IsRecentlyVerified": false,
    "ID": 57953,
    "UUID": "262D0B73-CCFB-4D61-9A78-F0169D13F921",
    "DataProviderID": 1,
    "OperatorID": 234,
    "UsageTypeID": 4,
    "UsageCost": "0",
    "AddressInfo": {
        "ID": 58299,
        "Title": "Markgrafenstraße",
        "AddressLine1": "Markgrafenstraße 24 ",
        "Town": "Neustadt a. d. Aisch ",
        "Postcode": "91413   ",
        "CountryID": 87,
        "Latitude": 49.5840893,
        "Longitude": 10.60983740000006,
        "AccessComments": "Rund um die Uhr (24/7) nutzbar. Position: Die Säule steht leider am Ende der Parkbuchten, so daß man für das zweite, weiter entfernte Fahrzeug entweder ein langes Kabel oder eben eine Verlängerung benötigt.\r\n",
        "DistanceUnit": 0
    },
    "Connections": [
        {
            "ID": 73703,
            "ConnectionTypeID": 28,
            "StatusTypeID": 50,
            "LevelID": 2,
            "Amps": 16,
            "Voltage": 230,
            "PowerKW": 3.7,
            "CurrentTypeID": 10,
            "Quantity": 2
        },
        {
            "ID": 73704,
            "ConnectionTypeID": 25,
            "StatusTypeID": 50,
            "LevelID": 2,
            "PowerKW": 11,
            "CurrentTypeID": 20,
            "Quantity": 1
        },
        {
            "ID": 73705,
            "ConnectionTypeID": 16,
            "StatusTypeID": 50,
            "LevelID": 2,
            "Amps": 16,
            "Voltage": 230,
            "PowerKW": 3.7,
            "CurrentTypeID": 10,
            "Quantity": 0
        },
        {
            "ID": 73706,
            "ConnectionTypeID": 17,
            "StatusTypeID": 50,
            "LevelID": 2,
            "PowerKW": 0,
            "CurrentTypeID": 20,
            "Quantity": 0
        },
        {
            "ID": 73707,
            "ConnectionTypeID": 2,
            "StatusTypeID": 50,
            "LevelID": 2,
            "PowerKW": 0,
            "CurrentTypeID": 30,
            "Quantity": 0
        },
        {
            "ID": 73708,
            "ConnectionTypeID": 33,
            "StatusTypeID": 50,
            "LevelID": 2,
            "PowerKW": 0,
            "CurrentTypeID": 30,
            "Quantity": 0
        }
    ],
    "NumberOfPoints": 3,
    "StatusTypeID": 50,
    "DateLastStatusUpdate": "2015-12-29T14:13:00Z",
    "DataQualityLevel": 1,
    "DateCreated": "2015-12-29T14:13:00Z",
    "SubmissionStatusTypeID": 200
}