{
    "IsRecentlyVerified": false,
    "ID": 81854,
    "UUID": "1618F5C2-1867-49DC-9E83-BCD680F12929",
    "DataProviderID": 1,
    "OperatorID": 23,
    "OperatorsReference": "17745",
    "UsageTypeID": 4,
    "AddressInfo": {
        "ID": 82200,
        "Title": "Icon Parking 203 E 61 Street",
        "AddressLine1": "203 E 61 St",
        "Town": "New York",
        "StateOrProvince": "New York",
        "Postcode": "10021",
        "CountryID": 2,
        "Latitude": 40.762678,
        "Longitude": -73.965447,
        "ContactTelephone1": "(212) 308-9248",
        "DistanceUnit": 0
    },
    "Connections": [
        {
            "ID": 116612,
            "ConnectionTypeID": 30,
            "StatusTypeID": 50,
            "LevelID": 2,
            "PowerKW": 8,
            "CurrentTypeID": 10,
            "Quantity": 2
        }
    ],
    "NumberOfPoints": 2,
    "GeneralComments": "2 Tesla Connectors, up to 8kW.Available to the public. Please see valet.",
    "StatusTypeID": 50,
    "DateLastStatusUpdate": "2017-06-09T14:52:00Z",
    "DataQualityLevel": 1,
    "DateCreated": "2017-02-03T13:09:00Z",
    "SubmissionStatusTypeID": 200
}