{
    "IsRecentlyVerified": false,
    "ID": 158771,
    "UUID": "13C0E9EA-9095-4E39-8D5F-7F12C89573A2",
    "DataProviderID": 2,
    "DataProvidersReference": "154267",
    "OperatorID": 3372,
    "UsageTypeID": 5,
    "AddressInfo": {
        "ID": 159128,
        "Title": "GE",
        "AddressLine1": "1411 S Garfield Ave",
        "Town": "Alhambra",
        "StateOrProvince": "CA",
        "Postcode": "91801",
        "CountryID": 2,
        "Latitude": 34.077862,
        "Longitude": -118.123387,
        "ContactTelephone1": "310-237-6883",
        "AccessComments": "24 hours daily\r\nPublic - Credit card at all times",
        "RelatedURL": "http://evconnect.com/",
        "DistanceUnit": 0
    },
    "Connections": [
        {
            "ID": 228798,
            "ConnectionTypeID": 2,
            "LevelID": 3,
            "Amps": 100,
            "Voltage": 400,
            "PowerKW": 40,
            "CurrentTypeID": 30,
            "Quantity": 1
        },
        {
            "ID": 228799,
            "ConnectionTypeID": 32,
            "LevelID": 3,
            "Amps": 100,
            "Voltage": 400,
            "PowerKW": 40,
            "CurrentTypeID": 30,
            "Quantity": 1
        }
    ],
    "StatusTypeID": 50,
    "DateLastStatusUpdate": "2020-06-26T02:57:00Z",
    "DataQualityLevel": 3,
    "DateCreated": "2020-06-26T02:57:00Z",
    "SubmissionStatusTypeID": 100
}