{
    "IsRecentlyVerified": false,
    "ID": 3490,
    "UUID": "2F118CB2-5FDB-43EA-9034-C29DDB1847A5",
    "DataProviderID": 1,
    "OperatorID": 6,
    "UsageTypeID": 1,
    "AddressInfo": {
        "ID": 3491,
        "Title": "Raidon Nissan",
        "AddressLine1": "713 35th Street",
        "Town": "Auburn WA",
        "StateOrProvince": "WA",
        "Postcode": "98002",
        "CountryID": 2,
        "Latitude": 47.3384,
        "Longitude": -122.22,
        "ContactTelephone1": "877-491-8889",
        "DistanceUnit": 0
    },
    "Connections": [
        {
            "ID": 6,
            "ConnectionTypeID": 1,
            "Quantity": 1
        }
    ],
    "NumberOfPoints": 2,
    "DateLastStatusUpdate": "2019-12-15T06:07:00Z",
    "DateCreated": "2010-02-28T00:00:00Z",
    "SubmissionStatusTypeID": 200
}