{
    "IsRecentlyVerified": false,
    "ID": 137680,
    "UUID": "FD5C5ACF-D10B-468D-8062-55DF8199AD4B",
    "DataProviderID": 2,
    "DataProvidersReference": "96078",
    "OperatorID": 9,
    "UsageTypeID": 1,
    "AddressInfo": {
        "ID": 138026,
        "Title": "City of Chula Vista - Parkway Community Center & Gym",
        "AddressLine1": "373 Park Way",
        "Town": "Chula Vista",
        "StateOrProvince": "CA",
        "Postcode": "91910",
        "CountryID": 2,
        "Latitude": 32.637998,
        "Longitude": -117.082687,
        "ContactTelephone1": "888-998-2546",
        "AccessComments": "MON: 24 hours | TUE: 24 hours | WED: 24 hours | THU: 24 hours | FRI: 24 hours | SAT: 24 hours | SUN: 24 hours",
        "RelatedURL": "http://www.blinkcharging.com/",
        "DistanceUnit": 0
    },
    "Connections": [
        {
            "ID": 192642,
            "ConnectionTypeID": 1,
            "LevelID": 2,
            "Amps": 16,
            "Voltage": 230,
            "PowerKW": 3,
            "CurrentTypeID": 10,
            "Quantity": 7
        }
    ],
    "StatusTypeID": 50,
    "DateLastStatusUpdate": "2019-12-24T09:06:00Z",
    "DataQualityLevel": 3,
    "DateCreated": "2019-12-24T09:06:00Z",
    "SubmissionStatusTypeID": 100
}