{
    "IsRecentlyVerified": false,
    "ID": 66765,
    "UUID": "C6A22384-A8D7-44E5-9AEE-4F9C80C04168",
    "DataProviderID": 1,
    "OperatorID": 23,
    "OperatorsReference": "13929",
    "UsageTypeID": 1,
    "UsageCost": "Free",
    "AddressInfo": {
        "ID": 67111,
        "Title": "Embassy Suites - Tesla",
        "AddressLine1": "3974 NW S River Dr",
        "Town": "Miami",
        "StateOrProvince": "FL",
        "Postcode": "33142",
        "CountryID": 2,
        "Latitude": 25.8065961,
        "Longitude": -80.261627,
        "ContactTelephone1": "305-634-5000  877-798-3752",
        "AccessComments": "24 hours daily; for Tesla use only; for guest use only",
        "RelatedURL": "http://www.teslamotors.com/supercharger",
        "DistanceUnit": 0
    },
    "Connections": [
        {
            "ID": 92251,
            "ConnectionTypeID": 30,
            "StatusTypeID": 50,
            "LevelID": 2,
            "Amps": 16,
            "Voltage": 230,
            "PowerKW": 8,
            "CurrentTypeID": 10,
            "Quantity": 1
        }
    ],
    "NumberOfPoints": 1,
    "StatusTypeID": 50,
    "DateLastStatusUpdate": "2017-01-26T02:29:00Z",
    "DataQualityLevel": 3,
    "DateCreated": "2016-05-29T02:04:00Z",
    "SubmissionStatusTypeID": 100
}