{
    "IsRecentlyVerified": false,
    "ID": 123968,
    "UUID": "2E9FFBF4-0C7A-459B-8B0E-47EC5A4A54CE",
    "DataProviderID": 2,
    "DataProvidersReference": "99349",
    "OperatorID": 5,
    "UsageTypeID": 1,
    "AddressInfo": {
        "ID": 124314,
        "Title": "ORACLE RWSHORE",
        "AddressLine1": "1012 Twin Dolphin Dr",
        "Town": "Redwood City",
        "StateOrProvince": "CA",
        "Postcode": "94065",
        "CountryID": 2,
        "Latitude": 37.518626,
        "Longitude": -122.25009,
        "ContactTelephone1": "888-758-4389",
        "AccessComments": "24 hours daily",
        "RelatedURL": "http://www.chargepoint.com/",
        "DistanceUnit": 0
    },
    "Connections": [
        {
            "ID": 174008,
            "ConnectionTypeID": 1,
            "LevelID": 2,
            "Amps": 16,
            "Voltage": 230,
            "PowerKW": 3,
            "CurrentTypeID": 10,
            "Quantity": 9
        }
    ],
    "DateLastStatusUpdate": "2019-12-24T09:13:00Z",
    "DataQualityLevel": 3,
    "DateCreated": "2019-04-06T05:03:00Z",
    "SubmissionStatusTypeID": 100
}