{
    "IsRecentlyVerified": false,
    "ID": 128829,
    "UUID": "28CDE65C-36D2-4F38-87CC-D36056F04EC2",
    "DataProviderID": 1,
    "OperatorID": 45,
    "UsageTypeID": 6,
    "AddressInfo": {
        "ID": 129175,
        "Title": "Hotel MyLago",
        "AddressLine1": "via Franz Kafka 1 ",
        "Town": "Riva del Garda",
        "StateOrProvince": "Trento",
        "Postcode": "38066",
        "CountryID": 112,
        "Latitude": 45.8804085961369,
        "Longitude": 10.8543131508734,
        "ContactTelephone1": "39 0464555420",
        "ContactEmail": "info@mylagohotel.it",
        "RelatedURL": "http://www.mylagohotel.it",
        "DistanceUnit": 0
    },
    "Connections": [
        {
            "ID": 180256,
            "ConnectionTypeID": 25,
            "StatusTypeID": 50,
            "LevelID": 2,
            "Amps": 32,
            "Voltage": 230,
            "PowerKW": 7.4,
            "CurrentTypeID": 10,
            "Quantity": 2
        }
    ],
    "NumberOfPoints": 1,
    "GeneralComments": "detas eV chargers 2x7,4kw type 2 sockets",
    "StatusTypeID": 50,
    "DateLastStatusUpdate": "2019-07-05T14:21:00Z",
    "DataQualityLevel": 1,
    "DateCreated": "2019-07-01T06:35:00Z",
    "SubmissionStatusTypeID": 200
}