{
    "IsRecentlyVerified": false,
    "ID": 138387,
    "UUID": "C0E8C988-CCB9-4CDC-83D4-89D6269236DC",
    "DataProviderID": 2,
    "DataProvidersReference": "96607",
    "OperatorID": 9,
    "UsageTypeID": 1,
    "AddressInfo": {
        "ID": 138736,
        "Title": "Vinson Library",
        "AddressLine1": "3810 W. Fuqua",
        "Town": "Houston",
        "StateOrProvince": "TX",
        "Postcode": "77045",
        "CountryID": 2,
        "Latitude": 29.6135788,
        "Longitude": -95.434037,
        "ContactTelephone1": "888-998-2546",
        "AccessComments": "MON: 24 hours | TUE: 24 hours | WED: 24 hours | THU: 24 hours | FRI: 24 hours | SAT: 24 hours | SUN: 24 hours",
        "RelatedURL": "http://www.blinkcharging.com/",
        "DistanceUnit": 0
    },
    "Connections": [
        {
            "ID": 193498,
            "ConnectionTypeID": 1,
            "LevelID": 2,
            "Amps": 16,
            "Voltage": 230,
            "PowerKW": 3.7,
            "CurrentTypeID": 10,
            "Quantity": 2
        }
    ],
    "StatusTypeID": 50,
    "DateLastStatusUpdate": "2020-06-26T02:53:00Z",
    "DataQualityLevel": 3,
    "DateCreated": "2019-12-24T09:08:00Z",
    "SubmissionStatusTypeID": 100
}