{
    "IsRecentlyVerified": false,
    "ID": 61111,
    "UUID": "EF2784CF-5E17-4755-A889-677F1551A33D",
    "DataProviderID": 27,
    "DataProvidersReference": "301",
    "UsageTypeID": 1,
    "AddressInfo": {
        "ID": 61457,
        "Title": "Parking Paseo de Invierno",
        "AddressLine1": "Calle de Aranaz y Vides, 7a",
        "Town": "Tudela",
        "StateOrProvince": "Tudela",
        "Postcode": "31500",
        "CountryID": 210,
        "Latitude": 42.0602263,
        "Longitude": -1.6023643,
        "ContactTelephone1": "948828693",
        "RelatedURL": "http://www.tudela.com/cas/turismo/0...",
        "DistanceUnit": 0
    },
    "Connections": [
        {
            "ID": 77708,
            "ConnectionTypeID": 28
        },
        {
            "ID": 77709,
            "ConnectionTypeID": 28
        },
        {
            "ID": 77710,
            "ConnectionTypeID": 28
        },
        {
            "ID": 77711,
            "ConnectionTypeID": 28
        },
        {
            "ID": 77712,
            "ConnectionTypeID": 28
        },
        {
            "ID": 77713,
            "ConnectionTypeID": 28
        }
    ],
    "StatusTypeID": 0,
    "DateLastStatusUpdate": "2016-02-13T00:24:00Z",
    "DataQualityLevel": 3,
    "DateCreated": "2016-02-13T00:24:00Z",
    "SubmissionStatusTypeID": 200
}