{
    "IsRecentlyVerified": false,
    "ID": 13819,
    "UUID": "2FEC51FC-25D5-4E95-B676-5EF0B893BFF2",
    "DataProviderID": 15,
    "DataProvidersReference": "23533",
    "OperatorID": 5,
    "AddressInfo": {
        "ID": 13716,
        "Title": "310 Arballo Dr",
        "AddressLine1": "310 Arballo Dr",
        "Town": "San Francisco",
        "StateOrProvince": "California",
        "Postcode": "94132",
        "CountryID": 2,
        "Latitude": 37.72080994,
        "Longitude": -122.483963,
        "ContactTelephone1": "877.243.5544",
        "RelatedURL": "http://carstations.com/23533",
        "DistanceUnit": 0
    },
    "Connections": [
        {
            "ID": 11266,
            "ConnectionTypeID": 1,
            "Reference": "J1772",
            "LevelID": 2
        }
    ],
    "StatusTypeID": 0,
    "DateLastStatusUpdate": "2017-11-04T14:04:00Z",
    "DataQualityLevel": 2,
    "DateCreated": "2012-12-06T11:08:00Z",
    "SubmissionStatusTypeID": 100
}