{
    "IsRecentlyVerified": false,
    "ID": 136280,
    "UUID": "8E8FC3C7-7BDE-43C1-A004-0DCAAFA0EF8C",
    "DataProviderID": 18,
    "DataProvidersReference": "465aed4661aae2ec7be09b3dec166f7a",
    "OperatorID": 2244,
    "UsageTypeID": 5,
    "AddressInfo": {
        "ID": 136626,
        "Title": "Essex Road",
        "AddressLine1": "Essex Road",
        "Town": "London",
        "Postcode": "W3 9JA",
        "CountryID": 1,
        "Latitude": 51.514835,
        "Longitude": -0.269944,
        "AccessComments": "",
        "RelatedURL": "https://www.ubitricity.com",
        "DistanceUnit": 0
    },
    "Connections": [
        {
            "ID": 190716,
            "ConnectionTypeID": 25,
            "Reference": "suby1100002091",
            "StatusTypeID": 50,
            "LevelID": 2,
            "Amps": 16,
            "Voltage": 230,
            "PowerKW": 3.7,
            "CurrentTypeID": 10
        }
    ],
    "StatusTypeID": 0,
    "DateLastStatusUpdate": "2021-04-25T05:46:00Z",
    "MetadataValues": [
        {
            "ID": 6132,
            "MetadataFieldID": 4,
            "ItemValue": "Contains public sector information licensed under the Open Government Licence v2.0. http://www.nationalarchives.gov.uk/doc/open-government-licence/version/2/"
        }
    ],
    "DataQualityLevel": 3,
    "DateCreated": "2019-12-24T05:22:00Z",
    "SubmissionStatusTypeID": 100
}