{
    "IsRecentlyVerified": false,
    "ID": 91770,
    "UUID": "36910DF5-9D42-4E74-8038-7A785AE91A41",
    "DataProviderID": 1,
    "OperatorID": 1,
    "UsageTypeID": 0,
    "UsageCost": "Free",
    "AddressInfo": {
        "ID": 92116,
        "Title": "Fairfield Inn",
        "AddressLine1": "1494 East Oglethorpe Highway",
        "Town": "Fleming",
        "StateOrProvince": "Georgia ",
        "Postcode": "31313",
        "CountryID": 2,
        "Latitude": 31.857874,
        "Longitude": -81.570713,
        "ContactTelephone1": "9128762003",
        "RelatedURL": "http://marriott.com/savhv",
        "DistanceUnit": 0
    },
    "Connections": [
        {
            "ID": 130101,
            "ConnectionTypeID": 1,
            "StatusTypeID": 0,
            "LevelID": 2,
            "CurrentTypeID": 10
        }
    ],
    "NumberOfPoints": 2,
    "StatusTypeID": 50,
    "DateLastStatusUpdate": "2017-08-18T20:19:00Z",
    "DataQualityLevel": 1,
    "DateCreated": "2017-08-17T13:35:00Z",
    "SubmissionStatusTypeID": 200
}