{
    "IsRecentlyVerified": false,
    "ID": 187514,
    "UUID": "0FD56E5C-CC30-4B75-A8B9-0383F052ABEE",
    "DataProviderID": 18,
    "DataProvidersReference": "862d35783c66ae251f1f3dbc9eaddd7d",
    "OperatorID": 2244,
    "UsageTypeID": 5,
    "AddressInfo": {
        "ID": 187873,
        "Title": "45 Ritherdon Road",
        "AddressLine1": "45 Ritherdon Road",
        "Town": "London",
        "Postcode": "SW17 8QG",
        "CountryID": 1,
        "Latitude": -0.151748,
        "Longitude": 51.437585,
        "AccessComments": "",
        "RelatedURL": "https://www.ubitricity.com",
        "DistanceUnit": 0
    },
    "Connections": [
        {
            "ID": 302648,
            "ConnectionTypeID": 25,
            "Reference": "suby1100005424",
            "StatusTypeID": 50,
            "LevelID": 2,
            "Amps": 16,
            "Voltage": 230,
            "PowerKW": 3.7,
            "CurrentTypeID": 10
        }
    ],
    "StatusTypeID": 0,
    "DateLastStatusUpdate": "2021-07-12T03:38:00Z",
    "MetadataValues": [
        {
            "ID": 19754,
            "MetadataFieldID": 4,
            "ItemValue": "Contains public sector information licensed under the Open Government Licence v2.0. http://www.nationalarchives.gov.uk/doc/open-government-licence/version/2/"
        }
    ],
    "DataQualityLevel": 3,
    "DateCreated": "2021-07-12T03:38:00Z",
    "SubmissionStatusTypeID": 100
}