{
    "UserComments": [
        {
            "ID": 21456,
            "ChargePointID": 106896,
            "CommentTypeID": 10,
            "UserName": "ForumElettrico.it",
            "RelatedURL": "https://www.forumelettrico.it/forum/colonnine-tarvisio-via-vittorio-veneto-t3141.html",
            "DateCreated": "2019-09-03T08:01:12.523Z",
            "User": {
                "ID": 11749,
                "Username": "ForumElettrico.it"
            },
            "CheckinStatusTypeID": 10
        }
    ],
    "MediaItems": [
        {
            "ID": 19453,
            "ChargePointID": 106896,
            "ItemURL": "https://s3-ap-southeast-2.amazonaws.com/openchargemap/images/IT/OCM106896/OCM-106896.orig.2019090308020307.jpg",
            "ItemThumbnailURL": "https://s3-ap-southeast-2.amazonaws.com/openchargemap/images/IT/OCM106896/OCM-106896.thmb.2019090308020307.jpg",
            "Comment": "",
            "IsEnabled": true,
            "IsVideo": false,
            "IsFeaturedItem": false,
            "IsExternalResource": false,
            "User": {
                "ID": 11749,
                "Username": "ForumElettrico.it"
            },
            "DateCreated": "2019-09-03T08:02:00Z"
        },
        {
            "ID": 19454,
            "ChargePointID": 106896,
            "ItemURL": "https://s3-ap-southeast-2.amazonaws.com/openchargemap/images/IT/OCM106896/OCM-106896.orig.2019090308020973.jpg",
            "ItemThumbnailURL": "https://s3-ap-southeast-2.amazonaws.com/openchargemap/images/IT/OCM106896/OCM-106896.thmb.2019090308020973.jpg",
            "Comment": "",
            "IsEnabled": true,
            "IsVideo": false,
            "IsFeaturedItem": false,
            "IsExternalResource": false,
            "User": {
                "ID": 11749,
                "Username": "ForumElettrico.it"
            },
            "DateCreated": "2019-09-03T08:02:00Z"
        }
    ],
    "IsRecentlyVerified": false,
    "ID": 106896,
    "UUID": "880693CE-C818-4FEF-A786-212CAF48B962",
    "DataProviderID": 1,
    "OperatorID": 1,
    "UsageTypeID": 5,
    "AddressInfo": {
        "ID": 107242,
        "Title": "Tarvisio Vittorio Veneto",
        "AddressLine1": "Via Vittorio Veneto",
        "Town": "Tarvisio",
        "StateOrProvince": "UD",
        "Postcode": "33018",
        "CountryID": 112,
        "Latitude": 46.5045009339039,
        "Longitude": 13.5768797079157,
        "DistanceUnit": 0
    },
    "Connections": [
        {
            "ID": 150690,
            "ConnectionTypeID": 25,
            "StatusTypeID": 50,
            "LevelID": 2,
            "Quantity": 2
        }
    ],
    "NumberOfPoints": 2,
    "StatusTypeID": 50,
    "DateLastStatusUpdate": "2019-09-03T08:02:00Z",
    "DataQualityLevel": 1,
    "DateCreated": "2018-07-07T19:18:00Z",
    "SubmissionStatusTypeID": 200
}