{
    "IsRecentlyVerified": false,
    "ID": 123063,
    "UUID": "2A328F89-4236-45CB-AB13-3EE79970D50E",
    "DataProviderID": 2,
    "DataProvidersReference": "87652",
    "UsageTypeID": 1,
    "AddressInfo": {
        "ID": 123409,
        "Title": "Ingles Market",
        "AddressLine1": "1572 Sand Hill Rd",
        "Town": "Candler",
        "StateOrProvince": "NC",
        "Postcode": "28715",
        "CountryID": 2,
        "Latitude": 35.544017,
        "Longitude": -82.658267,
        "ContactTelephone1": "828-665-2861",
        "AccessComments": "24 hours daily",
        "RelatedURL": "",
        "DistanceUnit": 0
    },
    "Connections": [
        {
            "ID": 173000,
            "ConnectionTypeID": 1,
            "LevelID": 2,
            "Amps": 16,
            "Voltage": 230,
            "PowerKW": 3.7,
            "CurrentTypeID": 10,
            "Quantity": 2
        }
    ],
    "DateLastStatusUpdate": "2020-06-26T02:58:00Z",
    "DataQualityLevel": 3,
    "DateCreated": "2019-04-06T05:03:00Z",
    "SubmissionStatusTypeID": 100
}