{
    "IsRecentlyVerified": false,
    "ID": 91366,
    "UUID": "E5682563-6819-4073-8843-B617783767DC",
    "DataProviderID": 2,
    "DataProvidersReference": "86129",
    "UsageTypeID": 2,
    "AddressInfo": {
        "ID": 91712,
        "Title": "Duke Energy",
        "AddressLine1": "555 Brevard Rd",
        "Town": "Asheville",
        "StateOrProvince": "NC",
        "Postcode": "28806",
        "CountryID": 2,
        "Latitude": 35.511376,
        "Longitude": -82.600756,
        "ContactTelephone1": "",
        "AccessComments": "Employee and fleet vehicle use only",
        "RelatedURL": "",
        "DistanceUnit": 0
    },
    "Connections": [
        {
            "ID": 129518,
            "ConnectionTypeID": 1,
            "LevelID": 2,
            "Amps": 16,
            "Voltage": 230,
            "PowerKW": 3,
            "CurrentTypeID": 10,
            "Quantity": 2
        }
    ],
    "DateLastStatusUpdate": "2019-04-06T04:02:00Z",
    "DataQualityLevel": 3,
    "DateCreated": "2017-08-03T12:25:00Z",
    "SubmissionStatusTypeID": 100
}