{
    "IsRecentlyVerified": false,
    "ID": 117806,
    "UUID": "8118C33B-1930-44C1-B4B3-8DC052A6BE89",
    "DataProviderID": 1,
    "OperatorID": 229,
    "UsageTypeID": 4,
    "UsageCost": "$0.25/kWh + $0.25/min",
    "AddressInfo": {
        "ID": 118152,
        "Title": "Ohakune",
        "AddressLine1": "30 Ayr Street",
        "Town": "Ohakune",
        "Postcode": "4625",
        "CountryID": 161,
        "Latitude": -39.417303,
        "Longitude": 175.400028,
        "DistanceUnit": 0
    },
    "Connections": [
        {
            "ID": 166701,
            "ConnectionTypeID": 2,
            "StatusTypeID": 50,
            "LevelID": 3,
            "PowerKW": 50,
            "CurrentTypeID": 30,
            "Quantity": 1
        },
        {
            "ID": 166702,
            "ConnectionTypeID": 33,
            "StatusTypeID": 50,
            "LevelID": 3,
            "PowerKW": 50,
            "CurrentTypeID": 30,
            "Quantity": 1
        }
    ],
    "NumberOfPoints": 1,
    "StatusTypeID": 50,
    "DateLastStatusUpdate": "2019-03-02T14:43:00Z",
    "DataQualityLevel": 1,
    "DateCreated": "2019-03-02T14:43:00Z",
    "SubmissionStatusTypeID": 200
}