{
    "IsRecentlyVerified": false,
    "ID": 144151,
    "UUID": "5028E887-9F73-4D8C-84BD-2C0577ADE126",
    "DataProviderID": 2,
    "DataProvidersReference": "129651",
    "OperatorID": 89,
    "UsageTypeID": 1,
    "AddressInfo": {
        "ID": 144503,
        "Title": "Clinique Vaudreuil",
        "AddressLine1": "65, Boulevard Cité des Jeunes",
        "Town": "Vaudreuil",
        "StateOrProvince": "QC",
        "Postcode": "J7V 8C1",
        "CountryID": 44,
        "Latitude": 45.402829,
        "Longitude": -74.037177,
        "ContactTelephone1": "888-356-8911",
        "AccessComments": "24 hours daily",
        "RelatedURL": "https://flo.ca/",
        "DistanceUnit": 0
    },
    "Connections": [
        {
            "ID": 200632,
            "ConnectionTypeID": 1,
            "LevelID": 2,
            "Amps": 16,
            "Voltage": 230,
            "PowerKW": 3.7,
            "CurrentTypeID": 10,
            "Quantity": 4
        }
    ],
    "StatusTypeID": 50,
    "DateLastStatusUpdate": "2020-06-26T03:09:00Z",
    "DataQualityLevel": 3,
    "DateCreated": "2019-12-24T09:23:00Z",
    "SubmissionStatusTypeID": 100
}