{
    "IsRecentlyVerified": false,
    "ID": 12946,
    "UUID": "92B63BA2-9A50-4BFB-ADC6-B91E3BE381B6",
    "DataProviderID": 15,
    "DataProvidersReference": "21511",
    "OperatorID": 26,
    "AddressInfo": {
        "ID": 12843,
        "Title": "1420 Iris Drive SW",
        "AddressLine1": "1420 Iris Drive SW",
        "Town": "Conyers",
        "StateOrProvince": "GA",
        "Postcode": "30094",
        "CountryID": 2,
        "Latitude": 33.66606,
        "Longitude": -84.03479,
        "ContactTelephone1": "888-747-0520",
        "RelatedURL": "http://carstations.com/21511",
        "DistanceUnit": 0
    },
    "Connections": [
        {
            "ID": 10379,
            "ConnectionTypeID": 1,
            "Reference": "J1772",
            "LevelID": 2
        }
    ],
    "StatusTypeID": 50,
    "DateLastStatusUpdate": "2017-11-04T14:04:00Z",
    "DataQualityLevel": 2,
    "DateCreated": "2012-09-07T19:25:00Z",
    "SubmissionStatusTypeID": 100
}