{
    "IsRecentlyVerified": false,
    "ID": 120875,
    "UUID": "630828D1-88A7-4298-AE7E-45369C98BDD0",
    "DataProviderID": 2,
    "DataProvidersReference": "53084",
    "OperatorID": 5,
    "UsageTypeID": 1,
    "AddressInfo": {
        "ID": 121221,
        "Title": "GEORGIA BUILD",
        "AddressLine1": "216 Capitol Avenue SW",
        "Town": "Atlanta",
        "StateOrProvince": "GA",
        "Postcode": "30334",
        "CountryID": 2,
        "Latitude": 33.7476648,
        "Longitude": -84.3872416,
        "ContactTelephone1": "888-758-4389",
        "AccessComments": "24 hours daily",
        "RelatedURL": "http://www.chargepoint.com/",
        "DistanceUnit": 0
    },
    "Connections": [
        {
            "ID": 170278,
            "ConnectionTypeID": 1,
            "LevelID": 2,
            "Amps": 16,
            "Voltage": 230,
            "PowerKW": 3,
            "CurrentTypeID": 10,
            "Quantity": 2
        }
    ],
    "DateLastStatusUpdate": "2019-12-24T09:10:00Z",
    "DataQualityLevel": 3,
    "DateCreated": "2019-04-01T04:59:00Z",
    "SubmissionStatusTypeID": 100
}