{
    "IsRecentlyVerified": false,
    "ID": 9742,
    "UUID": "09CBC48E-5FC0-4F88-8D2B-6D76B59A3B5D",
    "DataProviderID": 15,
    "DataProvidersReference": "16007",
    "OperatorID": 5,
    "UsageTypeID": 1,
    "AddressInfo": {
        "ID": 9639,
        "Title": "3001 17th St",
        "AddressLine1": "3001 17th St",
        "Town": "St Cloud",
        "StateOrProvince": "Florida",
        "Postcode": "34769",
        "CountryID": 2,
        "Latitude": 28.24161,
        "Longitude": -81.3073,
        "ContactTelephone1": "",
        "RelatedURL": "http://carstations.com/16007",
        "DistanceUnit": 0
    },
    "Connections": [
        {
            "ID": 7549,
            "ConnectionTypeID": 1,
            "Reference": "J1772",
            "LevelID": 2
        },
        {
            "ID": 8421,
            "ConnectionTypeID": 9,
            "Reference": "NEMA5",
            "LevelID": 1,
            "Quantity": 1
        }
    ],
    "NumberOfPoints": 1,
    "StatusTypeID": 0,
    "DateLastStatusUpdate": "2017-11-04T14:03:00Z",
    "DataQualityLevel": 2,
    "DateCreated": "2012-04-16T15:46:00Z",
    "SubmissionStatusTypeID": 100
}