{
    "IsRecentlyVerified": false,
    "ID": 152697,
    "UUID": "1A5F70C1-23D5-49A9-B90E-05639CC72EC6",
    "DataProviderID": 28,
    "DataProvidersReference": "",
    "UsageTypeID": 5,
    "AddressInfo": {
        "ID": 153050,
        "Title": "AVRILLE LES PONCEAUX 4748 - Rue basse",
        "AddressLine1": "Rue Basse - 37340 AVRILLE LES PONCEAUX",
        "CountryID": 80,
        "Latitude": 47.395095,
        "Longitude": 0.286574,
        "AccessComments": "24/24 7/7",
        "DistanceUnit": 0
    },
    "Connections": [
        {
            "ID": 213874,
            "ConnectionTypeID": 28,
            "StatusTypeID": 50,
            "LevelID": 2,
            "PowerKW": 18,
            "CurrentTypeID": 10
        },
        {
            "ID": 213875,
            "ConnectionTypeID": 25,
            "StatusTypeID": 50,
            "LevelID": 2,
            "PowerKW": 18,
            "CurrentTypeID": 10
        }
    ],
    "GeneralComments": "www.virtaev.fr",
    "StatusTypeID": 50,
    "DateLastStatusUpdate": "2020-03-15T10:54:00Z",
    "DataQualityLevel": 2,
    "DateCreated": "2020-03-15T10:54:00Z",
    "SubmissionStatusTypeID": 100
}