{
    "IsRecentlyVerified": false,
    "ID": 138104,
    "UUID": "DFA3A75C-1D9C-40F8-BEB3-23334DC59697",
    "DataProviderID": 2,
    "DataProvidersReference": "82388",
    "UsageTypeID": 1,
    "AddressInfo": {
        "ID": 138453,
        "Title": "Target",
        "AddressLine1": "100 Ho'okele St",
        "Town": "Kahului",
        "StateOrProvince": "HI",
        "Postcode": "96732",
        "CountryID": 2,
        "Latitude": 20.87526,
        "Longitude": -156.45665,
        "ContactTelephone1": "808-359-2829",
        "AccessComments": "24 hours daily",
        "RelatedURL": "",
        "DistanceUnit": 0
    },
    "Connections": [
        {
            "ID": 193161,
            "ConnectionTypeID": 1,
            "LevelID": 2,
            "Amps": 16,
            "Voltage": 230,
            "PowerKW": 3.7,
            "CurrentTypeID": 10,
            "Quantity": 1
        }
    ],
    "StatusTypeID": 50,
    "DateLastStatusUpdate": "2020-06-26T02:52:00Z",
    "DataQualityLevel": 3,
    "DateCreated": "2019-12-24T09:07:00Z",
    "SubmissionStatusTypeID": 100
}