{
    "IsRecentlyVerified": false,
    "ID": 27348,
    "UUID": "57F08104-501C-45A4-B0A7-EEF254BA3E28",
    "DataProviderID": 2,
    "DataProvidersReference": "47553",
    "UsageTypeID": 7,
    "AddressInfo": {
        "ID": 27694,
        "Title": "Robert Woodall Nissan",
        "AddressLine1": "132 Union St Bridge Rd",
        "Town": "Danville",
        "StateOrProvince": "VA",
        "Postcode": "24540",
        "CountryID": 2,
        "Latitude": 36.595903,
        "Longitude": -79.397367,
        "ContactTelephone1": "434-797-1411",
        "AccessComments": "Dealership business hours",
        "RelatedURL": "",
        "DistanceUnit": 0
    },
    "Connections": [
        {
            "ID": 29962,
            "ConnectionTypeID": 1,
            "LevelID": 2,
            "Amps": 16,
            "Voltage": 230,
            "PowerKW": 3,
            "CurrentTypeID": 10,
            "Quantity": 1
        }
    ],
    "DateLastStatusUpdate": "2019-04-06T04:02:00Z",
    "DataQualityLevel": 3,
    "DateCreated": "2014-11-28T03:37:00Z",
    "SubmissionStatusTypeID": 100
}