{
    "IsRecentlyVerified": false,
    "ID": 187287,
    "UUID": "983487AD-7BB9-458F-90F0-3AB0ABE1C9F0",
    "DataProviderID": 29,
    "DataProvidersReference": "10115",
    "OperatorID": 45,
    "AddressInfo": {
        "ID": 187646,
        "Title": "Drangstweg 84",
        "AddressLine1": "Drangstweg 84",
        "Town": "Cuxhaven",
        "Postcode": "27474",
        "CountryID": 87,
        "Latitude": 53.850344,
        "Longitude": 8.668507,
        "DistanceUnit": 0
    },
    "Connections": [
        {
            "ID": 302197,
            "ConnectionTypeID": 25,
            "StatusTypeID": 50,
            "LevelID": 2,
            "PowerKW": 11,
            "CurrentTypeID": 20
        },
        {
            "ID": 302198,
            "ConnectionTypeID": 25,
            "StatusTypeID": 50,
            "LevelID": 2,
            "PowerKW": 11,
            "CurrentTypeID": 20
        },
        {
            "ID": 302199,
            "ConnectionTypeID": 25,
            "StatusTypeID": 50,
            "LevelID": 2,
            "PowerKW": 11,
            "CurrentTypeID": 20
        }
    ],
    "StatusTypeID": 50,
    "DateLastStatusUpdate": "2021-07-12T02:52:00Z",
    "MetadataValues": [
        {
            "ID": 19527,
            "MetadataFieldID": 4,
            "ItemValue": "Data from the German chargepoint registry provided by Bundesnetzagentur.de under the CC-BY 4.0 license"
        }
    ],
    "DataQualityLevel": 3,
    "DateCreated": "2021-07-12T02:52:00Z",
    "SubmissionStatusTypeID": 100
}