{
    "IsRecentlyVerified": false,
    "ID": 91718,
    "UUID": "FB866A30-48ED-461D-9F6F-522478EB6FCD",
    "DataProviderID": 1,
    "OperatorID": 45,
    "UsageTypeID": 1,
    "UsageCost": "Free",
    "AddressInfo": {
        "ID": 92064,
        "Title": "Stoppustuð Ólafsfirði",
        "AddressLine1": "Rjúkandavirkjun",
        "Town": "Ólafsfjörður",
        "Postcode": "625",
        "CountryID": 105,
        "Latitude": 64.888215,
        "Longitude": -23.687811,
        "ContactEmail": "orkusalan@orkusalan.is",
        "RelatedURL": "http://www.orkusalan.is",
        "DistanceUnit": 0
    },
    "Connections": [
        {
            "ID": 130044,
            "ConnectionTypeID": 25,
            "StatusTypeID": 50,
            "LevelID": 2,
            "Amps": 32,
            "Voltage": 400,
            "PowerKW": 22,
            "CurrentTypeID": 20,
            "Quantity": 1
        }
    ],
    "NumberOfPoints": 1,
    "StatusTypeID": 50,
    "DateLastStatusUpdate": "2017-08-17T17:22:00Z",
    "DataQualityLevel": 1,
    "DateCreated": "2017-08-15T12:30:00Z",
    "SubmissionStatusTypeID": 200
}