{
    "IsRecentlyVerified": false,
    "ID": 145785,
    "UUID": "913894E9-000D-4CA8-9CE6-35002A9F624D",
    "DataProviderID": 2,
    "DataProvidersReference": "130067",
    "OperatorID": 89,
    "UsageTypeID": 1,
    "AddressInfo": {
        "ID": 146137,
        "Title": "New Denver Recycling Centre",
        "AddressLine1": "712 Kootenay Street",
        "Town": "New Denver",
        "StateOrProvince": "BC",
        "Postcode": "V0G 1S0",
        "CountryID": 44,
        "Latitude": 49.994175,
        "Longitude": -117.370105,
        "ContactTelephone1": "888-356-8911",
        "AccessComments": "24 hours daily",
        "RelatedURL": "https://flo.ca/",
        "DistanceUnit": 0
    },
    "Connections": [
        {
            "ID": 202528,
            "ConnectionTypeID": 1,
            "LevelID": 2,
            "Amps": 16,
            "Voltage": 230,
            "PowerKW": 3.7,
            "CurrentTypeID": 10,
            "Quantity": 1
        }
    ],
    "StatusTypeID": 50,
    "DateLastStatusUpdate": "2020-06-26T03:12:00Z",
    "DataQualityLevel": 3,
    "DateCreated": "2019-12-24T09:25:00Z",
    "SubmissionStatusTypeID": 100
}