{
    "UserComments": [
        {
            "ID": 23811,
            "ChargePointID": 172243,
            "CommentTypeID": 10,
            "UserName": "ForumElettrico.it",
            "Comment": "Di fronte c'è il circolo ufficali dei Carabinieri, ma niente bar o negozi. Leggi la recensione completa qui >  https://www.forumelettrico.it/forum/colonnina-enel-x-fast-piazzale-della-stazione-dell-acqua-acetosa-rm-t14344.html",
            "RelatedURL": "https://www.forumelettrico.it/forum/colonnina-enel-x-fast-piazzale-della-stazione-dell-acqua-acetosa-rm-t14344.html",
            "DateCreated": "2021-01-24T17:27:47.65Z",
            "User": {
                "ID": 11749,
                "Username": "ForumElettrico.it"
            },
            "CheckinStatusTypeID": 140,
            "IsActionedByEditor": false
        }
    ],
    "MediaItems": [
        {
            "ID": 26284,
            "ChargePointID": 172243,
            "ItemURL": "https://s3-ap-southeast-2.amazonaws.com/openchargemap/images/IT/OCM172243/OCM-172243.orig.2021012417283216.jpg",
            "ItemThumbnailURL": "https://s3-ap-southeast-2.amazonaws.com/openchargemap/images/IT/OCM172243/OCM-172243.thmb.2021012417283216.jpg",
            "Comment": "",
            "IsEnabled": true,
            "IsVideo": false,
            "IsFeaturedItem": false,
            "IsExternalResource": false,
            "User": {
                "ID": 11749,
                "Username": "ForumElettrico.it"
            },
            "DateCreated": "2021-01-24T17:29:00Z"
        },
        {
            "ID": 26285,
            "ChargePointID": 172243,
            "ItemURL": "https://s3-ap-southeast-2.amazonaws.com/openchargemap/images/IT/OCM172243/OCM-172243.orig.2021012417283886.jpg",
            "ItemThumbnailURL": "https://s3-ap-southeast-2.amazonaws.com/openchargemap/images/IT/OCM172243/OCM-172243.thmb.2021012417283886.jpg",
            "Comment": "",
            "IsEnabled": true,
            "IsVideo": false,
            "IsFeaturedItem": false,
            "IsExternalResource": false,
            "User": {
                "ID": 11749,
                "Username": "ForumElettrico.it"
            },
            "DateCreated": "2021-01-24T17:29:00Z"
        },
        {
            "ID": 26279,
            "ChargePointID": 172243,
            "ItemURL": "https://s3-ap-southeast-2.amazonaws.com/openchargemap/images/IT/OCM172243/OCM-172243.orig.2021012417275858.jpg",
            "ItemThumbnailURL": "https://s3-ap-southeast-2.amazonaws.com/openchargemap/images/IT/OCM172243/OCM-172243.thmb.2021012417275858.jpg",
            "Comment": "",
            "IsEnabled": true,
            "IsVideo": false,
            "IsFeaturedItem": false,
            "IsExternalResource": false,
            "User": {
                "ID": 11749,
                "Username": "ForumElettrico.it"
            },
            "DateCreated": "2021-01-24T17:28:00Z"
        },
        {
            "ID": 26280,
            "ChargePointID": 172243,
            "ItemURL": "https://s3-ap-southeast-2.amazonaws.com/openchargemap/images/IT/OCM172243/OCM-172243.orig.2021012417280435.jpg",
            "ItemThumbnailURL": "https://s3-ap-southeast-2.amazonaws.com/openchargemap/images/IT/OCM172243/OCM-172243.thmb.2021012417280435.jpg",
            "Comment": "",
            "IsEnabled": true,
            "IsVideo": false,
            "IsFeaturedItem": false,
            "IsExternalResource": false,
            "User": {
                "ID": 11749,
                "Username": "ForumElettrico.it"
            },
            "DateCreated": "2021-01-24T17:28:00Z"
        },
        {
            "ID": 26281,
            "ChargePointID": 172243,
            "ItemURL": "https://s3-ap-southeast-2.amazonaws.com/openchargemap/images/IT/OCM172243/OCM-172243.orig.2021012417281021.jpg",
            "ItemThumbnailURL": "https://s3-ap-southeast-2.amazonaws.com/openchargemap/images/IT/OCM172243/OCM-172243.thmb.2021012417281021.jpg",
            "Comment": "",
            "IsEnabled": true,
            "IsVideo": false,
            "IsFeaturedItem": false,
            "IsExternalResource": false,
            "User": {
                "ID": 11749,
                "Username": "ForumElettrico.it"
            },
            "DateCreated": "2021-01-24T17:28:00Z"
        },
        {
            "ID": 26282,
            "ChargePointID": 172243,
            "ItemURL": "https://s3-ap-southeast-2.amazonaws.com/openchargemap/images/IT/OCM172243/OCM-172243.orig.2021012417281730.jpg",
            "ItemThumbnailURL": "https://s3-ap-southeast-2.amazonaws.com/openchargemap/images/IT/OCM172243/OCM-172243.thmb.2021012417281730.jpg",
            "Comment": "",
            "IsEnabled": true,
            "IsVideo": false,
            "IsFeaturedItem": false,
            "IsExternalResource": false,
            "User": {
                "ID": 11749,
                "Username": "ForumElettrico.it"
            },
            "DateCreated": "2021-01-24T17:28:00Z"
        },
        {
            "ID": 26283,
            "ChargePointID": 172243,
            "ItemURL": "https://s3-ap-southeast-2.amazonaws.com/openchargemap/images/IT/OCM172243/OCM-172243.orig.2021012417282479.jpg",
            "ItemThumbnailURL": "https://s3-ap-southeast-2.amazonaws.com/openchargemap/images/IT/OCM172243/OCM-172243.thmb.2021012417282479.jpg",
            "Comment": "",
            "IsEnabled": true,
            "IsVideo": false,
            "IsFeaturedItem": false,
            "IsExternalResource": false,
            "User": {
                "ID": 11749,
                "Username": "ForumElettrico.it"
            },
            "DateCreated": "2021-01-24T17:28:00Z"
        }
    ],
    "IsRecentlyVerified": false,
    "ID": 172243,
    "UUID": "82AEDF76-0653-4B41-840E-712C5FE175A0",
    "DataProviderID": 1,
    "OperatorID": 80,
    "UsageTypeID": 4,
    "AddressInfo": {
        "ID": 172602,
        "Title": "Roma Stazione dell'Acqua Acetosa | EnelX fast",
        "AddressLine1": "Piazzale della Stazione dell'Acqua Acetosa",
        "Town": "Roma",
        "StateOrProvince": "RM",
        "Postcode": "00197",
        "CountryID": 112,
        "Latitude": 41.931982,
        "Longitude": 12.486731,
        "RelatedURL": "https://www.forumelettrico.it/forum/colonnina-enel-x-fast-piazzale-della-stazione-dell-acqua-acetosa-rm-t14344.html",
        "DistanceUnit": 0
    },
    "Connections": [
        {
            "ID": 263323,
            "ConnectionTypeID": 33,
            "StatusTypeID": 150,
            "LevelID": 3,
            "PowerKW": 50,
            "CurrentTypeID": 30,
            "Quantity": 1
        },
        {
            "ID": 263324,
            "ConnectionTypeID": 2,
            "StatusTypeID": 150,
            "LevelID": 3,
            "PowerKW": 50,
            "CurrentTypeID": 30,
            "Quantity": 1
        },
        {
            "ID": 263325,
            "ConnectionTypeID": 1036,
            "StatusTypeID": 150,
            "LevelID": 3,
            "Amps": 63,
            "Voltage": 400,
            "PowerKW": 43,
            "CurrentTypeID": 20,
            "Quantity": 1
        },
        {
            "ID": 263326,
            "ConnectionTypeID": 25,
            "StatusTypeID": 150,
            "LevelID": 2,
            "Amps": 32,
            "Voltage": 400,
            "PowerKW": 22,
            "CurrentTypeID": 20,
            "Quantity": 2
        },
        {
            "ID": 263327,
            "ConnectionTypeID": 36,
            "StatusTypeID": 150,
            "LevelID": 2,
            "Amps": 16,
            "Voltage": 240,
            "PowerKW": 3,
            "CurrentTypeID": 10,
            "Quantity": 2
        }
    ],
    "NumberOfPoints": 3,
    "StatusTypeID": 150,
    "DateLastStatusUpdate": "2021-02-12T15:50:00Z",
    "DataQualityLevel": 1,
    "DateCreated": "2021-01-24T17:27:00Z",
    "SubmissionStatusTypeID": 200
}