{
    "IsRecentlyVerified": false,
    "ID": 121229,
    "UUID": "3C1A27DD-3C53-4352-9732-5F2778400EEC",
    "DataProviderID": 2,
    "DataProvidersReference": "119021",
    "OperatorID": 5,
    "UsageTypeID": 1,
    "AddressInfo": {
        "ID": 121575,
        "Title": "HUNTINGTON",
        "AddressLine1": "1531 W Lane Ave",
        "Town": "Columbus",
        "StateOrProvince": "OH",
        "Postcode": "43221",
        "CountryID": 2,
        "Latitude": 40.0065682,
        "Longitude": -83.0511932,
        "ContactTelephone1": "888-758-4389",
        "AccessComments": "24 hours daily",
        "RelatedURL": "http://www.chargepoint.com/",
        "DistanceUnit": 0
    },
    "Connections": [
        {
            "ID": 170669,
            "ConnectionTypeID": 1,
            "LevelID": 2,
            "Amps": 16,
            "Voltage": 230,
            "PowerKW": 3.7,
            "CurrentTypeID": 10,
            "Quantity": 1
        }
    ],
    "DateLastStatusUpdate": "2020-06-26T03:02:00Z",
    "DataQualityLevel": 3,
    "DateCreated": "2019-04-01T05:00:00Z",
    "SubmissionStatusTypeID": 100
}