{
    "IsRecentlyVerified": false,
    "ID": 123306,
    "UUID": "E1FCD41D-9C5E-41C0-A98B-2F34C71079F8",
    "DataProviderID": 2,
    "DataProvidersReference": "82568",
    "OperatorID": 5,
    "UsageTypeID": 1,
    "AddressInfo": {
        "ID": 123652,
        "Title": "SEC EVC",
        "AddressLine1": "1921 W Gate City Blvd",
        "Town": "Greensboro",
        "StateOrProvince": "NC",
        "Postcode": "27403",
        "CountryID": 2,
        "Latitude": 36.0577802,
        "Longitude": -79.8265585,
        "ContactTelephone1": "888-758-4389",
        "AccessComments": "24 hours daily",
        "RelatedURL": "http://www.chargepoint.com/",
        "DistanceUnit": 0
    },
    "Connections": [
        {
            "ID": 173270,
            "ConnectionTypeID": 1,
            "LevelID": 2,
            "Amps": 16,
            "Voltage": 230,
            "PowerKW": 3.7,
            "CurrentTypeID": 10,
            "Quantity": 2
        }
    ],
    "DateLastStatusUpdate": "2020-06-26T02:58:00Z",
    "DataQualityLevel": 3,
    "DateCreated": "2019-04-06T05:03:00Z",
    "SubmissionStatusTypeID": 100
}