{
    "IsRecentlyVerified": false,
    "ID": 144744,
    "UUID": "EE2C1D6A-A3BA-407E-BE58-A50EDF38BB6E",
    "DataProviderID": 2,
    "DataProvidersReference": "130826",
    "OperatorID": 90,
    "UsageTypeID": 1,
    "AddressInfo": {
        "ID": 145096,
        "Title": "7070 Jean-Talon",
        "AddressLine1": "7070 rue Jean-Talon Est",
        "Town": "Montréal",
        "StateOrProvince": "QC",
        "Postcode": "H1M 3T4",
        "CountryID": 44,
        "Latitude": 45.597006,
        "Longitude": -73.570005,
        "ContactTelephone1": "877-505-2674",
        "AccessComments": "24 hours daily",
        "RelatedURL": "https://lecircuitelectrique.com/",
        "DistanceUnit": 0
    },
    "Connections": [
        {
            "ID": 201266,
            "ConnectionTypeID": 1,
            "LevelID": 2,
            "Amps": 16,
            "Voltage": 230,
            "PowerKW": 3.7,
            "CurrentTypeID": 10,
            "Quantity": 2
        }
    ],
    "StatusTypeID": 50,
    "DateLastStatusUpdate": "2020-06-26T03:09:00Z",
    "DataQualityLevel": 3,
    "DateCreated": "2019-12-24T09:23:00Z",
    "SubmissionStatusTypeID": 100
}