{
    "IsRecentlyVerified": false,
    "ID": 185658,
    "UUID": "D09C9C3D-5167-4F46-AD3D-B5279BC4E278",
    "DataProviderID": 29,
    "DataProvidersReference": "8473",
    "AddressInfo": {
        "ID": 186017,
        "Title": "Vorderhainberg 10a",
        "AddressLine1": "Vorderhainberg 10a",
        "Town": "Ortenburg",
        "Postcode": "94496",
        "CountryID": 87,
        "Latitude": 48.5439597,
        "Longitude": 13.2260524,
        "DistanceUnit": 0
    },
    "Connections": [
        {
            "ID": 295903,
            "ConnectionTypeID": 25,
            "StatusTypeID": 50,
            "LevelID": 2,
            "PowerKW": 11,
            "CurrentTypeID": 20
        },
        {
            "ID": 295904,
            "ConnectionTypeID": 25,
            "StatusTypeID": 50,
            "LevelID": 2,
            "PowerKW": 11,
            "CurrentTypeID": 20
        }
    ],
    "StatusTypeID": 50,
    "DateLastStatusUpdate": "2021-07-12T02:41:00Z",
    "MetadataValues": [
        {
            "ID": 17902,
            "MetadataFieldID": 4,
            "ItemValue": "Data from the German chargepoint registry provided by Bundesnetzagentur.de under the CC-BY 4.0 license"
        }
    ],
    "DataQualityLevel": 3,
    "DateCreated": "2021-07-12T02:41:00Z",
    "SubmissionStatusTypeID": 100
}