{
    "IsRecentlyVerified": false,
    "ID": 120393,
    "UUID": "E472DD45-42A2-4A16-B6E1-12C12F4058D4",
    "DataProviderID": 2,
    "DataProvidersReference": "39710",
    "UsageTypeID": 7,
    "AddressInfo": {
        "ID": 120739,
        "Title": "Don Davis Nissan",
        "AddressLine1": "1320 E Interstate 20",
        "Town": "Arlington",
        "StateOrProvince": "TX",
        "Postcode": "76018",
        "CountryID": 2,
        "Latitude": 32.676458,
        "Longitude": -97.087169,
        "ContactTelephone1": "817-588-5475",
        "AccessComments": "Dealership business hours\r\nPublic - Call ahead",
        "RelatedURL": "",
        "DistanceUnit": 0
    },
    "Connections": [
        {
            "ID": 169737,
            "ConnectionTypeID": 1,
            "LevelID": 2,
            "Amps": 16,
            "Voltage": 230,
            "PowerKW": 3.7,
            "CurrentTypeID": 10,
            "Quantity": 1
        }
    ],
    "DateLastStatusUpdate": "2020-06-26T02:55:00Z",
    "DataQualityLevel": 3,
    "DateCreated": "2019-04-01T04:59:00Z",
    "SubmissionStatusTypeID": 100
}