{
    "IsRecentlyVerified": false,
    "ID": 172233,
    "UUID": "2B3928A4-B6EB-4C21-AC50-257690677781",
    "DataProviderID": 1,
    "OperatorID": 45,
    "UsageTypeID": 1,
    "UsageCost": "Free",
    "AddressInfo": {
        "ID": 172592,
        "Title": "TasPorts - Hunter Street",
        "AddressLine1": "Hunter Street",
        "Town": "Hobart",
        "StateOrProvince": "Tasmania",
        "Postcode": "7001",
        "CountryID": 18,
        "Latitude": -42.88166757453731,
        "Longitude": 147.33553637293267,
        "DistanceUnit": 0
    },
    "Connections": [
        {
            "ID": 263309,
            "ConnectionTypeID": 25,
            "StatusTypeID": 50,
            "LevelID": 2,
            "PowerKW": 22,
            "CurrentTypeID": 20,
            "Quantity": 1
        }
    ],
    "NumberOfPoints": 1,
    "GeneralComments": "Separate parking fee required",
    "StatusTypeID": 50,
    "DateLastStatusUpdate": "2021-01-24T02:29:00Z",
    "DataQualityLevel": 1,
    "DateCreated": "2021-01-24T02:27:00Z",
    "SubmissionStatusTypeID": 200
}