{
    "IsRecentlyVerified": false,
    "ID": 184661,
    "UUID": "3C25DE8A-510A-4B96-B702-9625640187BC",
    "DataProviderID": 29,
    "DataProvidersReference": "12367",
    "OperatorID": 86,
    "AddressInfo": {
        "ID": 185020,
        "Title": "Hauptstr. 389",
        "AddressLine1": "Hauptstr. 389",
        "Town": "Edingen-Neckarhausen",
        "Postcode": "68535",
        "CountryID": 87,
        "Latitude": 49.46408,
        "Longitude": 8.602485,
        "DistanceUnit": 0
    },
    "Connections": [
        {
            "ID": 293191,
            "ConnectionTypeID": 28,
            "StatusTypeID": 50,
            "LevelID": 2,
            "PowerKW": 22,
            "CurrentTypeID": 20
        },
        {
            "ID": 293192,
            "ConnectionTypeID": 25,
            "StatusTypeID": 50,
            "LevelID": 2,
            "PowerKW": 22,
            "CurrentTypeID": 20
        },
        {
            "ID": 297044,
            "ConnectionTypeID": 28,
            "StatusTypeID": 50,
            "LevelID": 2,
            "PowerKW": 22,
            "CurrentTypeID": 20
        },
        {
            "ID": 297045,
            "ConnectionTypeID": 25,
            "StatusTypeID": 50,
            "LevelID": 2,
            "PowerKW": 22,
            "CurrentTypeID": 20
        }
    ],
    "StatusTypeID": 50,
    "DateLastStatusUpdate": "2021-07-12T02:43:00Z",
    "MetadataValues": [
        {
            "ID": 16952,
            "MetadataFieldID": 4,
            "ItemValue": "Data from the German chargepoint registry provided by Bundesnetzagentur.de under the CC-BY 4.0 license"
        }
    ],
    "DataQualityLevel": 3,
    "DateCreated": "2021-07-08T10:05:00Z",
    "SubmissionStatusTypeID": 100
}