{
    "IsRecentlyVerified": false,
    "ID": 16585,
    "UUID": "F76EB4EB-F750-40E7-85EB-3B5D15ECFEA7",
    "DataProviderID": 1,
    "OperatorID": 45,
    "UsageTypeID": 1,
    "UsageCost": "Free",
    "AddressInfo": {
        "ID": 16930,
        "Title": "Go Solar - Eldorado",
        "AddressLine1": "7 Avenida Vista Grande, suite B3",
        "AddressLine2": "",
        "Town": "Santa Fe",
        "StateOrProvince": "NM",
        "Postcode": "87508",
        "CountryID": 2,
        "Latitude": 35.538268,
        "Longitude": -105.89032500000002,
        "ContactTelephone1": "",
        "ContactTelephone2": "",
        "ContactEmail": "",
        "AccessComments": "",
        "RelatedURL": "",
        "DistanceUnit": 0
    },
    "Connections": [
        {
            "ID": 15054,
            "ConnectionTypeID": 1,
            "StatusTypeID": 50,
            "LevelID": 2,
            "Amps": 30,
            "Voltage": 240,
            "PowerKW": 7.2,
            "Quantity": 1
        }
    ],
    "NumberOfPoints": 1,
    "GeneralComments": "",
    "StatusTypeID": 50,
    "DateLastStatusUpdate": "2013-05-19T00:46:00Z",
    "DataQualityLevel": 1,
    "DateCreated": "2013-05-18T22:49:00Z",
    "SubmissionStatusTypeID": 200
}