{
    "IsRecentlyVerified": false,
    "ID": 52235,
    "UUID": "615CF943-AB23-4C39-A165-31FE4ABE6EC0",
    "DataProviderID": 1,
    "OperatorID": 161,
    "UsageTypeID": 4,
    "AddressInfo": {
        "ID": 52581,
        "Title": "Grünflächenamt",
        "AddressLine1": "Liebenauer Straße 118",
        "Town": "Halle (Saale)",
        "StateOrProvince": "Halle (Saale)",
        "Postcode": "06110",
        "CountryID": 87,
        "Latitude": 51.46386,
        "Longitude": 11.97865,
        "ContactTelephone1": "+49 345 581-2222",
        "AccessComments": "24/7 nutzbar, keine weiteren Infos.",
        "RelatedURL": "http://www.stadtwerke-halle.de/",
        "DistanceUnit": 0
    },
    "Connections": [
        {
            "ID": 64863,
            "ConnectionTypeID": 25,
            "StatusTypeID": 50,
            "LevelID": 2,
            "Amps": 32,
            "Voltage": 400,
            "PowerKW": 22,
            "CurrentTypeID": 20,
            "Quantity": 2
        }
    ],
    "NumberOfPoints": 2,
    "StatusTypeID": 50,
    "DateLastStatusUpdate": "2015-08-26T14:20:00Z",
    "DataQualityLevel": 1,
    "DateCreated": "2015-08-26T05:56:00Z",
    "SubmissionStatusTypeID": 200
}