{
    "IsRecentlyVerified": false,
    "ID": 119998,
    "UUID": "6E688A93-012B-4BA7-BC76-1237912CA0A4",
    "DataProviderID": 2,
    "DataProvidersReference": "81228",
    "OperatorID": 39,
    "UsageTypeID": 1,
    "AddressInfo": {
        "ID": 120344,
        "Title": "The Sovereign",
        "AddressLine1": "3233 W Dallas Street",
        "Town": "Houston",
        "StateOrProvince": "TX",
        "Postcode": "77019",
        "CountryID": 2,
        "Latitude": 29.756767,
        "Longitude": -95.399746,
        "ContactTelephone1": "800-663-5633",
        "AccessComments": "MO: Not Specified; TU: Not Specified; WE: Not Specified; TH: Not Specified; FR: Not Specified; SA: Not Specified; SU: Not Specified",
        "RelatedURL": "http://www.semacharge.com/",
        "DistanceUnit": 0
    },
    "Connections": [
        {
            "ID": 169305,
            "ConnectionTypeID": 1,
            "LevelID": 2,
            "Amps": 16,
            "Voltage": 230,
            "PowerKW": 3,
            "CurrentTypeID": 10,
            "Quantity": 2
        }
    ],
    "DateLastStatusUpdate": "2019-04-01T04:59:00Z",
    "DataQualityLevel": 3,
    "DateCreated": "2019-04-01T04:59:00Z",
    "SubmissionStatusTypeID": 100
}