{
    "IsRecentlyVerified": false,
    "ID": 46900,
    "UUID": "880FCEC7-2F44-48A9-974F-B29A91DFDE14",
    "DataProviderID": 1,
    "OperatorID": 45,
    "UsageTypeID": 1,
    "UsageCost": "0",
    "AddressInfo": {
        "ID": 47246,
        "Title": "Supermarkt Aldi",
        "AddressLine1": "An der Piwipp 86",
        "Town": "Düsseldorf",
        "StateOrProvince": "Düsseldorf",
        "Postcode": "40468",
        "CountryID": 87,
        "Latitude": 51.2625161435832,
        "Longitude": 6.77961757380898,
        "AccessComments": "Laden auf dem Parkplatz während der Öffnungszeiten der Filiale, auf eine Stunde begrenzt, während der Öffnungszeiten Mo-Sa 8-21Uhr. Leider nur ein markierter Parkplatz, aber 6 Lademöglichkeiten.",
        "RelatedURL": "https://www.aldi-sued.de/de/aldi-sued-a-bis-z/aldi-sued-a-bis-z/e/elektrotankstellen/",
        "DistanceUnit": 0
    },
    "Connections": [
        {
            "ID": 57717,
            "ConnectionTypeID": 2,
            "StatusTypeID": 50,
            "LevelID": 2,
            "PowerKW": 20,
            "Quantity": 1
        },
        {
            "ID": 57718,
            "ConnectionTypeID": 33,
            "StatusTypeID": 50,
            "LevelID": 2,
            "PowerKW": 20,
            "Quantity": 1
        },
        {
            "ID": 57719,
            "ConnectionTypeID": 25,
            "StatusTypeID": 50,
            "LevelID": 2,
            "PowerKW": 22,
            "CurrentTypeID": 20,
            "Quantity": 1
        },
        {
            "ID": 57720,
            "ConnectionTypeID": 28,
            "StatusTypeID": 50,
            "LevelID": 2,
            "Amps": 16,
            "Voltage": 230,
            "PowerKW": 3.7,
            "CurrentTypeID": 10,
            "Quantity": 3
        }
    ],
    "NumberOfPoints": 1,
    "StatusTypeID": 50,
    "DateLastStatusUpdate": "2015-05-10T20:18:00Z",
    "DataQualityLevel": 1,
    "DateCreated": "2015-05-10T07:12:00Z",
    "SubmissionStatusTypeID": 200
}