{
    "IsRecentlyVerified": false,
    "ID": 188565,
    "UUID": "65C5241C-23CC-435F-8BE7-D338A9CE404C",
    "DataProviderID": 1,
    "OperatorID": 3338,
    "UsageTypeID": 4,
    "AddressInfo": {
        "ID": 188924,
        "Title": "East Coast Expressway",
        "AddressLine1": "East Coast Expressway",
        "StateOrProvince": "Pahang",
        "CountryID": 137,
        "Latitude": 3.724029651202173,
        "Longitude": 102.91846278106118,
        "DistanceUnit": 0
    },
    "Connections": [
        {
            "ID": 304574,
            "ConnectionTypeID": 25,
            "StatusTypeID": 50,
            "LevelID": 2,
            "Amps": 32,
            "Voltage": 203,
            "PowerKW": 22,
            "CurrentTypeID": 20,
            "Quantity": 1
        }
    ],
    "NumberOfPoints": 1,
    "StatusTypeID": 50,
    "DateLastStatusUpdate": "2021-10-21T16:27:00Z",
    "DataQualityLevel": 1,
    "DateCreated": "2021-08-03T04:53:00Z",
    "SubmissionStatusTypeID": 200
}