{
    "IsRecentlyVerified": false,
    "ID": 81488,
    "UUID": "63186D2C-2E3C-4E61-AC84-FD4AC0122855",
    "DataProviderID": 1,
    "OperatorID": 23,
    "OperatorsReference": "24027",
    "UsageTypeID": 7,
    "UsageCost": "Free",
    "AddressInfo": {
        "ID": 81834,
        "Title": "Hotel Lücke Rheine",
        "AddressLine1": "1a Heiliggeistplatz",
        "Town": "Rheine",
        "Postcode": "48431",
        "CountryID": 87,
        "Latitude": 52.279823,
        "Longitude": 7.439834,
        "ContactTelephone1": "+49 597116180",
        "DistanceUnit": 0
    },
    "Connections": [
        {
            "ID": 116224,
            "ConnectionTypeID": 30,
            "StatusTypeID": 50,
            "LevelID": 2,
            "Amps": 32,
            "Voltage": 230,
            "PowerKW": 17,
            "CurrentTypeID": 20,
            "Quantity": 2
        }
    ],
    "NumberOfPoints": 2,
    "GeneralComments": "2 Tesla Connectors, up to 17kW.Available by reservation only. Please call ahead.",
    "StatusTypeID": 50,
    "DateLastStatusUpdate": "2018-10-03T18:20:00Z",
    "DataQualityLevel": 1,
    "DateCreated": "2017-02-02T17:24:00Z",
    "SubmissionStatusTypeID": 200
}