{
    "IsRecentlyVerified": false,
    "ID": 73940,
    "UUID": "EB7B75C0-6F1C-4270-B532-9C3AB551DA70",
    "DataProviderID": 1,
    "OperatorID": 89,
    "OperatorsReference": "CEA-426",
    "UsageTypeID": 4,
    "UsageCost": "CAD 1.00/hour",
    "AddressInfo": {
        "ID": 74286,
        "Title": "St-Hubert-Côte-des-Neiges",
        "AddressLine1": "5235 Chemin de la Côte-des-Neiges",
        "Town": "Montréal",
        "StateOrProvince": "QC",
        "Postcode": "H3T 1Y1",
        "CountryID": 44,
        "Latitude": 45.4962737196333,
        "Longitude": -73.6211819828034,
        "DistanceUnit": 0
    },
    "Connections": [
        {
            "ID": 106253,
            "ConnectionTypeID": 1,
            "StatusTypeID": 50,
            "LevelID": 2,
            "Amps": 32,
            "Voltage": 230,
            "PowerKW": 7,
            "CurrentTypeID": 10,
            "Quantity": 1
        }
    ],
    "NumberOfPoints": 1,
    "StatusTypeID": 50,
    "DateLastStatusUpdate": "2016-11-27T17:03:00Z",
    "DataQualityLevel": 1,
    "DateCreated": "2016-11-23T23:40:00Z",
    "SubmissionStatusTypeID": 200
}