{
    "IsRecentlyVerified": false,
    "ID": 65886,
    "UUID": "57508F3A-3BA6-4CD7-985B-0C3CCAE61298",
    "DataProviderID": 1,
    "OperatorID": 45,
    "UsageTypeID": 1,
    "AddressInfo": {
        "ID": 66232,
        "Title": "Technische Universität",
        "AddressLine1": "Andreas-Schubert-Straße 23",
        "Town": "Dresden",
        "StateOrProvince": "Sachsen",
        "Postcode": "01069",
        "CountryID": 87,
        "Latitude": 51.0354606,
        "Longitude": 13.736267699999985,
        "ContactTelephone1": "+49 3514622374",
        "AccessComments": "24/7 nutzbar ohne Ladekarte im Wirtschafthof der HTW-Dresden zwischen A-Gebäude und LGS, ggf. Rücksprache mit dem zuständigen Labor der Uni nehmen.",
        "RelatedURL": "http://emob.et.htw-dresden.de/",
        "DistanceUnit": 0
    },
    "Connections": [
        {
            "ID": 91070,
            "ConnectionTypeID": 2,
            "StatusTypeID": 50,
            "LevelID": 3,
            "PowerKW": 50,
            "CurrentTypeID": 30,
            "Quantity": 1
        }
    ],
    "NumberOfPoints": 1,
    "StatusTypeID": 50,
    "DateLastStatusUpdate": "2016-05-04T07:40:00Z",
    "DataQualityLevel": 1,
    "DateCreated": "2016-05-04T07:40:00Z",
    "SubmissionStatusTypeID": 200
}