{
    "IsRecentlyVerified": false,
    "ID": 144193,
    "UUID": "A437A6B8-8ADD-4594-BB85-9CCDF3A8C409",
    "DataProviderID": 2,
    "DataProvidersReference": "130334",
    "OperatorID": 90,
    "UsageTypeID": 1,
    "AddressInfo": {
        "ID": 144545,
        "Title": "FCR - Carrefour du Plateau des Grives",
        "AddressLine1": "205-219 boul. du Plateau",
        "Town": "Gatineau",
        "StateOrProvince": "QC",
        "Postcode": "J9J 0N4",
        "CountryID": 44,
        "Latitude": 45.432609,
        "Longitude": -75.781468,
        "ContactTelephone1": "877-505-2674",
        "AccessComments": "24 hours daily",
        "RelatedURL": "https://lecircuitelectrique.com/",
        "DistanceUnit": 0
    },
    "Connections": [
        {
            "ID": 200678,
            "ConnectionTypeID": 1,
            "LevelID": 2,
            "Amps": 16,
            "Voltage": 230,
            "PowerKW": 3.7,
            "CurrentTypeID": 10,
            "Quantity": 13
        }
    ],
    "StatusTypeID": 50,
    "DateLastStatusUpdate": "2020-06-26T03:09:00Z",
    "DataQualityLevel": 3,
    "DateCreated": "2019-12-24T09:23:00Z",
    "SubmissionStatusTypeID": 100
}