{
    "IsRecentlyVerified": false,
    "ID": 176310,
    "UUID": "EE228079-F5DC-4DFD-871C-1DE35E847EF2",
    "DataProviderID": 1,
    "OperatorID": 21,
    "UsageTypeID": 4,
    "UsageCost": "Parking cost + Mobi.E compatible card or App ",
    "AddressInfo": {
        "ID": 176669,
        "Title": "OVR-00004 - Outrotrevo parking",
        "AddressLine1": "Outrotrevo",
        "Town": "Ovar",
        "StateOrProvince": "Aveiro",
        "Postcode": "",
        "CountryID": 180,
        "Latitude": 40.860496800814985,
        "Longitude": -8.624116835996233,
        "AccessComments": "Mo-Fr 09:00>19:00",
        "DistanceUnit": 0
    },
    "Connections": [
        {
            "ID": 274045,
            "ConnectionTypeID": 25,
            "StatusTypeID": 50,
            "LevelID": 2,
            "Amps": 16,
            "Voltage": 400,
            "PowerKW": 11,
            "CurrentTypeID": 20,
            "Quantity": 1
        }
    ],
    "NumberOfPoints": 1,
    "GeneralComments": "Paid parking",
    "StatusTypeID": 50,
    "DateLastStatusUpdate": "2021-07-04T10:02:00Z",
    "DataQualityLevel": 1,
    "DateCreated": "2021-07-04T09:59:00Z",
    "SubmissionStatusTypeID": 200
}