{
    "IsRecentlyVerified": false,
    "ID": 36386,
    "UUID": "FB30C2D4-B5A4-4D3C-8FAC-B67E1D71D85E",
    "DataProviderID": 26,
    "DataProvidersReference": "49751",
    "OperatorID": 73,
    "OperatorsReference": "EV-Box EVB-P1406164",
    "UsageCost": "0.00 jaarabonnement",
    "AddressInfo": {
        "ID": 36732,
        "Title": "Nieuwe Dolderseweg",
        "AddressLine1": "Nieuwe Dolderseweg",
        "Town": "Zeist",
        "Postcode": "3734 BS",
        "CountryID": 159,
        "Latitude": 52.15231,
        "Longitude": 5.24014,
        "RelatedURL": "http://www.ev-box.nl",
        "DistanceUnit": 0
    },
    "Connections": [
        {
            "ID": 39897,
            "ConnectionTypeID": 25,
            "LevelID": 2,
            "PowerKW": 11,
            "CurrentTypeID": 10
        },
        {
            "ID": 48340,
            "ConnectionTypeID": 25,
            "LevelID": 2,
            "PowerKW": 11,
            "CurrentTypeID": 10
        }
    ],
    "NumberOfPoints": 1,
    "StatusTypeID": 50,
    "DateLastStatusUpdate": "2016-06-04T02:51:00Z",
    "DataQualityLevel": 3,
    "DateCreated": "2015-01-09T06:05:00Z",
    "SubmissionStatusTypeID": 100
}