{
    "IsRecentlyVerified": false,
    "ID": 104473,
    "UUID": "589B817D-1189-423D-BE74-AB107D81B310",
    "DataProviderID": 1,
    "OperatorID": 23,
    "OperatorsReference": "43217",
    "UsageTypeID": 4,
    "AddressInfo": {
        "ID": 104819,
        "Title": "Ballygarry House Hotel & Spa",
        "AddressLine1": "Ballgarry House Hotel and Spa Curraghleha East",
        "Town": "Tralee",
        "StateOrProvince": "Kerry",
        "Postcode": "V92 W279",
        "CountryID": 3,
        "Latitude": 52.261067,
        "Longitude": -9.660155,
        "ContactTelephone1": "+353 66 712 3322",
        "DistanceUnit": 0
    },
    "Connections": [
        {
            "ID": 147468,
            "ConnectionTypeID": 30,
            "StatusTypeID": 50,
            "LevelID": 2,
            "Amps": 32,
            "Voltage": 230,
            "PowerKW": 13,
            "CurrentTypeID": 20,
            "Quantity": 2
        }
    ],
    "NumberOfPoints": 2,
    "GeneralComments": "2 Tesla Connectors, up to 13kW.Available for customers. Please see front desk.",
    "StatusTypeID": 50,
    "DateLastStatusUpdate": "2018-10-03T15:14:00Z",
    "DataQualityLevel": 1,
    "DateCreated": "2018-05-20T05:42:00Z",
    "SubmissionStatusTypeID": 200
}