{
    "IsRecentlyVerified": false,
    "ID": 34573,
    "UUID": "36884801-87E0-4590-B33B-A3F9422D214B",
    "DataProviderID": 1,
    "OperatorID": 105,
    "OperatorsReference": "Essent EM-DE-05570024-01-00002",
    "UsageTypeID": 4,
    "AddressInfo": {
        "ID": 34919,
        "Title": "Am Magnusplatz 30",
        "AddressLine1": "Am Magnusplatz 30",
        "Town": "Everswinkel",
        "Postcode": "48351",
        "CountryID": 87,
        "Latitude": 51.926527,
        "Longitude": 7.846591,
        "DistanceUnit": 0
    },
    "Connections": [
        {
            "ID": 38084,
            "ConnectionTypeID": 25,
            "LevelID": 2,
            "PowerKW": 11
        },
        {
            "ID": 47376,
            "ConnectionTypeID": 25,
            "LevelID": 2,
            "PowerKW": 11
        }
    ],
    "NumberOfPoints": 1,
    "StatusTypeID": 50,
    "DateLastStatusUpdate": "2015-04-13T04:56:00Z",
    "DataQualityLevel": 3,
    "DateCreated": "2015-01-09T06:04:00Z",
    "SubmissionStatusTypeID": 200
}