{
    "IsRecentlyVerified": false,
    "ID": 92431,
    "UUID": "CB7366AC-6921-4425-98D8-41D365BB6F7B",
    "DataProviderID": 1,
    "OperatorID": 3266,
    "UsageTypeID": 4,
    "AddressInfo": {
        "ID": 92777,
        "Title": "GSAB Elektrotechnik",
        "AddressLine1": "Lindenstraße 23",
        "Town": "Greußen",
        "StateOrProvince": "Greußen",
        "Postcode": "99718",
        "CountryID": 87,
        "Latitude": 51.229511,
        "Longitude": 10.9445981,
        "ContactTelephone1": "+49 363676140",
        "AccessComments": "GSAB Schild direkt an der Bundesstraße im Ort. Blaue Ladestation auf Firmenparkplatz, 2 grün markierte Parkplätze. ",
        "RelatedURL": "http://www.gsab.de/",
        "DistanceUnit": 0
    },
    "Connections": [
        {
            "ID": 149357,
            "ConnectionTypeID": 25,
            "StatusTypeID": 50,
            "LevelID": 2,
            "Amps": 32,
            "Voltage": 400,
            "PowerKW": 22,
            "CurrentTypeID": 20,
            "Quantity": 2
        }
    ],
    "NumberOfPoints": 2,
    "StatusTypeID": 50,
    "DateLastStatusUpdate": "2018-06-14T11:33:00Z",
    "DataQualityLevel": 1,
    "DateCreated": "2017-09-06T05:57:00Z",
    "SubmissionStatusTypeID": 200
}