{
    "IsRecentlyVerified": false,
    "ID": 139318,
    "UUID": "89CE0018-1EE8-429D-BAE4-7CE3471981F0",
    "DataProviderID": 2,
    "DataProvidersReference": "69036",
    "OperatorID": 5,
    "UsageTypeID": 1,
    "AddressInfo": {
        "ID": 139670,
        "Title": "CCC",
        "AddressLine1": "12901 S Euclid St",
        "Town": "Garden Grove",
        "StateOrProvince": "CA",
        "Postcode": "92843",
        "CountryID": 2,
        "Latitude": 33.7753558,
        "Longitude": -117.939012,
        "ContactTelephone1": "888-758-4389",
        "AccessComments": "24 hours daily",
        "RelatedURL": "http://www.chargepoint.com/",
        "DistanceUnit": 0
    },
    "Connections": [
        {
            "ID": 194633,
            "ConnectionTypeID": 1,
            "LevelID": 2,
            "Amps": 16,
            "Voltage": 230,
            "PowerKW": 3,
            "CurrentTypeID": 10,
            "Quantity": 2
        }
    ],
    "StatusTypeID": 50,
    "DateLastStatusUpdate": "2019-12-24T09:10:00Z",
    "DataQualityLevel": 3,
    "DateCreated": "2019-12-24T09:10:00Z",
    "SubmissionStatusTypeID": 100
}