{
    "IsRecentlyVerified": false,
    "ID": 138131,
    "UUID": "2113AB20-4ED5-4490-9ACC-33EA4A758DBC",
    "DataProviderID": 2,
    "DataProvidersReference": "95876",
    "OperatorID": 9,
    "UsageTypeID": 1,
    "AddressInfo": {
        "ID": 138480,
        "Title": "Walmart #2308 - Lihue, HI",
        "AddressLine1": "3-3300 Kuhio Hwy",
        "Town": "Lihue",
        "StateOrProvince": "HI",
        "Postcode": "96766",
        "CountryID": 2,
        "Latitude": 21.98252,
        "Longitude": -159.3653348,
        "ContactTelephone1": "888-998-2546",
        "AccessComments": "MON: 24 hours | TUE: 24 hours | WED: 24 hours | THU: 24 hours | FRI: 24 hours | SAT: 24 hours | SUN: 24 hours",
        "RelatedURL": "http://www.blinkcharging.com/",
        "DistanceUnit": 0
    },
    "Connections": [
        {
            "ID": 193188,
            "ConnectionTypeID": 1,
            "LevelID": 2,
            "Amps": 16,
            "Voltage": 230,
            "PowerKW": 3.7,
            "CurrentTypeID": 10,
            "Quantity": 1
        }
    ],
    "StatusTypeID": 50,
    "DateLastStatusUpdate": "2020-06-26T02:52:00Z",
    "DataQualityLevel": 3,
    "DateCreated": "2019-12-24T09:08:00Z",
    "SubmissionStatusTypeID": 100
}