{
    "IsRecentlyVerified": false,
    "ID": 186013,
    "UUID": "48BDA4E2-E75E-4781-9317-956CD6C3E1B9",
    "DataProviderID": 29,
    "DataProvidersReference": "12723",
    "AddressInfo": {
        "ID": 186372,
        "Title": "Jungenfeldplatz",
        "AddressLine1": "Jungenfeldplatz",
        "Town": "Mainz",
        "Postcode": "55126",
        "CountryID": 87,
        "Latitude": 49.986131,
        "Longitude": 8.176091,
        "DistanceUnit": 0
    },
    "Connections": [
        {
            "ID": 297469,
            "ConnectionTypeID": 25,
            "StatusTypeID": 50,
            "LevelID": 2,
            "PowerKW": 22,
            "CurrentTypeID": 20
        },
        {
            "ID": 297470,
            "ConnectionTypeID": 25,
            "StatusTypeID": 50,
            "LevelID": 2,
            "PowerKW": 22,
            "CurrentTypeID": 20
        }
    ],
    "StatusTypeID": 50,
    "DateLastStatusUpdate": "2021-07-12T02:44:00Z",
    "MetadataValues": [
        {
            "ID": 18255,
            "MetadataFieldID": 4,
            "ItemValue": "Data from the German chargepoint registry provided by Bundesnetzagentur.de under the CC-BY 4.0 license"
        }
    ],
    "DataQualityLevel": 3,
    "DateCreated": "2021-07-12T02:44:00Z",
    "SubmissionStatusTypeID": 100
}