{
    "IsRecentlyVerified": false,
    "ID": 31152,
    "UUID": "20F64E2E-6690-48D3-B955-172BCFE64759",
    "DataProviderID": 2,
    "DataProvidersReference": "64508",
    "OperatorID": 5,
    "UsageTypeID": 1,
    "AddressInfo": {
        "ID": 31498,
        "Title": "ILLINI CHARGING",
        "AddressLine1": "601 S Lincoln Ave",
        "Town": "Urbana",
        "StateOrProvince": "IL",
        "Postcode": "61801",
        "CountryID": 2,
        "Latitude": 40.1076676,
        "Longitude": -88.2198843,
        "ContactTelephone1": "888-758-4389",
        "AccessComments": "24 hours daily",
        "RelatedURL": "http://www.chargepoint.com/",
        "DistanceUnit": 0
    },
    "Connections": [
        {
            "ID": 34418,
            "ConnectionTypeID": 1,
            "LevelID": 2,
            "Amps": 16,
            "Voltage": 230,
            "PowerKW": 3.7,
            "CurrentTypeID": 10,
            "Quantity": 2
        }
    ],
    "DateLastStatusUpdate": "2020-06-26T03:02:00Z",
    "DataQualityLevel": 3,
    "DateCreated": "2014-12-11T07:11:00Z",
    "SubmissionStatusTypeID": 100
}