{
    "IsRecentlyVerified": false,
    "ID": 89756,
    "UUID": "F08FB973-99D1-433B-A191-409CA3BEDECF",
    "DataProviderID": 2,
    "DataProvidersReference": "73316",
    "UsageTypeID": 2,
    "AddressInfo": {
        "ID": 90102,
        "Title": "Idaho Power - Payette Operations Center",
        "AddressLine1": "1550 S Main St",
        "Town": "Payette",
        "StateOrProvince": "ID",
        "Postcode": "83661",
        "CountryID": 2,
        "Latitude": 44.057043,
        "Longitude": -116.928333,
        "ContactTelephone1": "",
        "AccessComments": "Idaho Power vehicle use only",
        "RelatedURL": "",
        "DistanceUnit": 0
    },
    "Connections": [
        {
            "ID": 127196,
            "ConnectionTypeID": 1,
            "LevelID": 2,
            "Amps": 16,
            "Voltage": 230,
            "PowerKW": 3.7,
            "CurrentTypeID": 10,
            "Quantity": 1
        }
    ],
    "DateLastStatusUpdate": "2020-06-26T03:07:00Z",
    "DataQualityLevel": 3,
    "DateCreated": "2017-06-22T08:16:00Z",
    "SubmissionStatusTypeID": 100
}