{
    "IsRecentlyVerified": false,
    "ID": 165267,
    "UUID": "8D083C46-E773-4F40-A856-EBF136F99AF8",
    "DataProviderID": 1,
    "DataProvidersReference": "TR-KOC-009",
    "OperatorID": 70,
    "UsageTypeID": 1,
    "AddressInfo": {
        "ID": 165626,
        "Title": "Eşarj - Öztorun Oto, Kocaeli",
        "AddressLine1": "Yenişehir mah. Araç sok. no:55, Bekirpaşa",
        "Town": "Kocaeli",
        "StateOrProvince": "Kocaeli",
        "Postcode": "41050",
        "CountryID": 229,
        "Latitude": 40.773018,
        "Longitude": 29.968559,
        "ContactTelephone1": "+90 (850) 433 72 75",
        "ContactEmail": "destek@esarj.com",
        "RelatedURL": "https://esarj.com/en/map?s=TR-KOC-009",
        "DistanceUnit": 0
    },
    "Connections": [
        {
            "ID": 236947,
            "ConnectionTypeID": 25,
            "LevelID": 2,
            "Amps": 32,
            "Voltage": 380,
            "PowerKW": 22,
            "Quantity": 2
        }
    ],
    "GeneralComments": "Eşarj Charging Systems",
    "StatusTypeID": 50,
    "DateLastStatusUpdate": "2020-08-26T08:19:00Z",
    "DataQualityLevel": 3,
    "DateCreated": "2020-08-26T08:19:00Z",
    "SubmissionStatusTypeID": 200
}