{
    "MediaItems": [
        {
            "ID": 16625,
            "ChargePointID": 47807,
            "ItemURL": "https://s3-ap-southeast-2.amazonaws.com/openchargemap/images/DE/OCM47807/OCM-47807.orig.2018092417594781.jpeg",
            "ItemThumbnailURL": "https://s3-ap-southeast-2.amazonaws.com/openchargemap/images/DE/OCM47807/OCM-47807.thmb.2018092417594781.jpeg",
            "Comment": "",
            "IsEnabled": true,
            "IsVideo": false,
            "IsFeaturedItem": false,
            "IsExternalResource": false,
            "User": {
                "ID": 18450,
                "Username": "marcus_mang"
            },
            "DateCreated": "2018-09-24T18:00:00Z"
        }
    ],
    "IsRecentlyVerified": false,
    "ID": 47807,
    "UUID": "C11C67B5-CEFE-47BA-BD18-6B4F4CB8F5C5",
    "DataProviderID": 1,
    "OperatorID": 45,
    "UsageTypeID": 1,
    "UsageCost": "0",
    "AddressInfo": {
        "ID": 48153,
        "Title": "Supermarkt Aldi (mit E-Bike Ladestation)",
        "AddressLine1": "Adalbert-Stifter-Straße 103",
        "Town": "Stuttgart",
        "Postcode": "70437",
        "CountryID": 87,
        "Latitude": 48.8354915,
        "Longitude": 9.20195139999998,
        "AccessComments": "Ein blau markierter Parkplatz an der Stirnseite des Parkplatzes gegenüber der Einfahrt ganz rechts. Kostenloses Laden für maximal eine Stunde während der Öffnungszeiten Mo-Sa 8-20Uhr.\r\nZusätzlich sind drei Schukosteckdosen (mit 16A abgesichert) am Fahrradständer vorhanden, die jedoch primär für E-Fahrräder gedacht sind.",
        "RelatedURL": "http://www.aldi-sued.de/de/aldi-sued-a-bis-z/aldi-sued-a-bis-z/e/elektrotankstellen",
        "DistanceUnit": 0
    },
    "Connections": [
        {
            "ID": 58964,
            "ConnectionTypeID": 2,
            "StatusTypeID": 50,
            "LevelID": 2,
            "PowerKW": 20,
            "Quantity": 1
        },
        {
            "ID": 58965,
            "ConnectionTypeID": 33,
            "StatusTypeID": 50,
            "LevelID": 2,
            "PowerKW": 20,
            "Quantity": 1
        },
        {
            "ID": 58966,
            "ConnectionTypeID": 25,
            "StatusTypeID": 50,
            "LevelID": 2,
            "Amps": 32,
            "Voltage": 400,
            "PowerKW": 22,
            "CurrentTypeID": 20,
            "Quantity": 1
        },
        {
            "ID": 58967,
            "ConnectionTypeID": 28,
            "StatusTypeID": 50,
            "LevelID": 2,
            "Amps": 16,
            "Voltage": 230,
            "PowerKW": 3.7,
            "CurrentTypeID": 10,
            "Quantity": 3
        }
    ],
    "NumberOfPoints": 4,
    "GeneralComments": "Es kann nur an jeweils einem der Anschlüsse geladen werden, max. 60 Minuten",
    "StatusTypeID": 50,
    "DateLastStatusUpdate": "2018-09-24T18:00:00Z",
    "DataQualityLevel": 1,
    "DateCreated": "2015-06-12T07:12:00Z",
    "SubmissionStatusTypeID": 200
}