{
    "IsRecentlyVerified": false,
    "ID": 81630,
    "UUID": "454EBDDE-BC16-41BA-BAC7-EFCFF3F66034",
    "DataProviderID": 1,
    "OperatorID": 23,
    "OperatorsReference": "23868",
    "UsageTypeID": 6,
    "AddressInfo": {
        "ID": 81976,
        "Title": "Fiesta Inn Toluca Centro",
        "AddressLine1": "Calle Ignacio Allende sur #124 Centro",
        "Town": "Toluca",
        "StateOrProvince": "Estado de Mexico",
        "Postcode": "50000",
        "CountryID": 146,
        "Latitude": 19.288437,
        "Longitude": -99.655865,
        "ContactTelephone1": "+52 722 167 8900",
        "DistanceUnit": 0
    },
    "Connections": [
        {
            "ID": 116378,
            "ConnectionTypeID": 30,
            "StatusTypeID": 50,
            "LevelID": 2,
            "PowerKW": 18,
            "CurrentTypeID": 20,
            "Quantity": 2
        }
    ],
    "NumberOfPoints": 2,
    "GeneralComments": "2 Tesla Connectors, up to 18kW.Available for patrons only. Please see front desk.",
    "StatusTypeID": 50,
    "DateLastStatusUpdate": "2017-02-03T09:10:00Z",
    "DataQualityLevel": 1,
    "DateCreated": "2017-02-03T09:10:00Z",
    "SubmissionStatusTypeID": 200
}