{
    "IsRecentlyVerified": false,
    "ID": 183555,
    "UUID": "666A52F5-C277-4311-B36F-59F1CC854366",
    "DataProviderID": 29,
    "DataProvidersReference": "9424",
    "OperatorID": 3253,
    "AddressInfo": {
        "ID": 183914,
        "Title": "Jaspersstraße 2",
        "AddressLine1": "Jaspersstraße 2",
        "Town": "Heidelberg",
        "Postcode": "69126",
        "CountryID": 87,
        "Latitude": 49.363414,
        "Longitude": 8.7024,
        "DistanceUnit": 0
    },
    "Connections": [
        {
            "ID": 290680,
            "ConnectionTypeID": 25,
            "StatusTypeID": 50,
            "LevelID": 2,
            "PowerKW": 22,
            "CurrentTypeID": 20
        },
        {
            "ID": 290681,
            "ConnectionTypeID": 25,
            "StatusTypeID": 50,
            "LevelID": 2,
            "PowerKW": 22,
            "CurrentTypeID": 20
        }
    ],
    "StatusTypeID": 50,
    "DateLastStatusUpdate": "2021-07-12T02:43:00Z",
    "MetadataValues": [
        {
            "ID": 15848,
            "MetadataFieldID": 4,
            "ItemValue": "Data from the German chargepoint registry provided by Bundesnetzagentur.de under the CC-BY 4.0 license"
        }
    ],
    "DataQualityLevel": 3,
    "DateCreated": "2021-07-08T10:04:00Z",
    "SubmissionStatusTypeID": 100
}