{
    "IsRecentlyVerified": false,
    "ID": 9748,
    "UUID": "A1A2DFC0-D0C9-47CD-A5F6-4FA347BB0900",
    "DataProviderID": 15,
    "DataProvidersReference": "16192",
    "OperatorID": 1,
    "UsageTypeID": 1,
    "AddressInfo": {
        "ID": 9645,
        "Title": "7190 E Hampden Ave",
        "AddressLine1": "7190 E Hampden Ave",
        "Town": "Denver",
        "StateOrProvince": "CO",
        "Postcode": "80224",
        "CountryID": 2,
        "Latitude": 39.65291,
        "Longitude": -104.90526,
        "ContactTelephone1": "(303) 773-6154",
        "RelatedURL": "http://carstations.com/16192",
        "DistanceUnit": 0
    },
    "Connections": [
        {
            "ID": 7555,
            "ConnectionTypeID": 1,
            "Reference": "J1772",
            "LevelID": 2
        }
    ],
    "NumberOfPoints": 1,
    "StatusTypeID": 0,
    "DateLastStatusUpdate": "2017-11-04T14:04:00Z",
    "DataQualityLevel": 2,
    "DateCreated": "2012-04-16T15:46:00Z",
    "SubmissionStatusTypeID": 100
}