{
    "IsRecentlyVerified": false,
    "ID": 95185,
    "UUID": "A7230ED9-E74F-4054-8193-D6BA637C9D92",
    "DataProviderID": 1,
    "OperatorID": 23,
    "OperatorsReference": "37199",
    "UsageTypeID": 4,
    "AddressInfo": {
        "ID": 95531,
        "Title": "Gut Georgenberg",
        "AddressLine1": "Georgenberg 1",
        "Town": "Glonn",
        "Postcode": "85625",
        "CountryID": 87,
        "Latitude": 47.984919,
        "Longitude": 11.898456,
        "ContactTelephone1": "+49 8093 90700",
        "DistanceUnit": 0
    },
    "Connections": [
        {
            "ID": 134853,
            "ConnectionTypeID": 30,
            "StatusTypeID": 50,
            "LevelID": 2,
            "Amps": 16,
            "Voltage": 400,
            "PowerKW": 11,
            "CurrentTypeID": 20,
            "Quantity": 1
        }
    ],
    "NumberOfPoints": 1,
    "GeneralComments": "1 Tesla Connector, up to 11kW.Available for customers. Please see front desk.",
    "StatusTypeID": 50,
    "DateLastStatusUpdate": "2018-10-03T14:35:00Z",
    "DataQualityLevel": 1,
    "DateCreated": "2017-11-05T06:53:00Z",
    "SubmissionStatusTypeID": 200
}