{
    "IsRecentlyVerified": false,
    "ID": 108701,
    "UUID": "5984760E-670E-4D71-B1AA-EFE7F03C0C9E",
    "DataProviderID": 1,
    "OperatorID": 23,
    "OperatorsReference": "45839",
    "UsageTypeID": 4,
    "AddressInfo": {
        "ID": 109047,
        "Title": "Hotel du Clocher Villa Savoy ***",
        "AddressLine1": "110 Impasse de l'Androsace",
        "Town": "Chamonix-Mont-Blanc",
        "Postcode": "74400",
        "CountryID": 80,
        "Latitude": 45.924657,
        "Longitude": 6.868339,
        "ContactTelephone1": " +33 4 50 53 30 27",
        "DistanceUnit": 0
    },
    "Connections": [
        {
            "ID": 153816,
            "ConnectionTypeID": 30,
            "StatusTypeID": 50,
            "LevelID": 2,
            "Amps": 16,
            "Voltage": 400,
            "PowerKW": 11,
            "CurrentTypeID": 20,
            "Quantity": 2
        }
    ],
    "NumberOfPoints": 2,
    "GeneralComments": "2 Tesla Connectors, up to 11kW.Available for customers. Please call ahead.",
    "StatusTypeID": 50,
    "DateLastStatusUpdate": "2018-10-11T12:26:00Z",
    "DataQualityLevel": 1,
    "DateCreated": "2018-10-11T12:26:00Z",
    "SubmissionStatusTypeID": 200
}