{
    "IsRecentlyVerified": false,
    "ID": 85199,
    "UUID": "242AEB9E-4679-4ED7-8C4A-0CC17F0C58A3",
    "DataProviderID": 1,
    "OperatorID": 149,
    "UsageTypeID": 1,
    "UsageCost": "0",
    "AddressInfo": {
        "ID": 85545,
        "Title": "Severinstraße",
        "AddressLine1": "Severinstraße 8",
        "Town": "Soest",
        "StateOrProvince": "Kreis Soest",
        "Postcode": "59494",
        "CountryID": 87,
        "Latitude": 51.5732404552971,
        "Longitude": 8.110299425690854,
        "ContactTelephone1": "+49 2921 392107",
        "ContactTelephone2": "02921 392150",
        "ContactEmail": "info@stadtwerke-soest.de",
        "AccessComments": "Links neben der Einfahrt zum Parkplatz sind 2 ummauerte Parkbuchten an der durchgehend nutzbaren Ladesäule. Freischaltung mit beliebiger RFID Karte",
        "RelatedURL": "http://www.stadtwerke-soest.de/",
        "DistanceUnit": 0
    },
    "Connections": [
        {
            "ID": 120973,
            "ConnectionTypeID": 25,
            "StatusTypeID": 50,
            "LevelID": 2,
            "Amps": 32,
            "Voltage": 400,
            "PowerKW": 22,
            "CurrentTypeID": 20,
            "Quantity": 2
        }
    ],
    "NumberOfPoints": 2,
    "StatusTypeID": 50,
    "DateLastStatusUpdate": "2017-03-29T06:02:00Z",
    "DataQualityLevel": 1,
    "DateCreated": "2017-03-29T06:02:00Z",
    "SubmissionStatusTypeID": 200
}