{
    "UserComments": [
        {
            "ID": 19199,
            "ChargePointID": 92059,
            "CommentTypeID": 10,
            "UserName": "Bss57",
            "Comment": "I really like pod point and this post is in great Nick",
            "DateCreated": "2018-02-17T15:40:18.847Z",
            "User": {
                "ID": 6295,
                "Username": "Bss57"
            },
            "CheckinStatusTypeID": 10
        }
    ],
    "IsRecentlyVerified": false,
    "ID": 92059,
    "UUID": "0F69BB40-76B4-4810-9304-EFC30BFB6B9A",
    "DataProviderID": 1,
    "OperatorID": 3,
    "OperatorsReference": "PG-81249",
    "UsageTypeID": 4,
    "UsageCost": "Free",
    "AddressInfo": {
        "ID": 92405,
        "Title": "Priory Retail Park",
        "AddressLine1": "Christchurch Road",
        "Town": "London",
        "Postcode": "SW19 2PP",
        "CountryID": 1,
        "Latitude": 51.416505,
        "Longitude": -0.178825,
        "DistanceUnit": 0
    },
    "Connections": [
        {
            "ID": 130525,
            "ConnectionTypeID": 25,
            "StatusTypeID": 50,
            "LevelID": 2,
            "Amps": 32,
            "Voltage": 230,
            "PowerKW": 7,
            "CurrentTypeID": 10,
            "Quantity": 2
        }
    ],
    "NumberOfPoints": 2,
    "GeneralComments": "This is an open charge unit installed at the Priory Retail Park site in Christchurch Road, Merton, London",
    "StatusTypeID": 50,
    "DateLastStatusUpdate": "2018-02-17T15:40:00Z",
    "DataQualityLevel": 1,
    "DateCreated": "2017-08-24T15:43:00Z",
    "SubmissionStatusTypeID": 200
}