{
    "IsRecentlyVerified": false,
    "ID": 85403,
    "UUID": "C1F7190D-3058-4162-84EF-D1AC947B5827",
    "DataProviderID": 1,
    "OperatorID": 210,
    "UsageTypeID": 6,
    "UsageCost": "Free",
    "AddressInfo": {
        "ID": 85749,
        "Title": "Calle de Génova 24",
        "AddressLine1": "Calle Génova 24",
        "Town": "Madrid",
        "StateOrProvince": "Madrid",
        "Postcode": "28004",
        "CountryID": 210,
        "Latitude": 40.4258213271988,
        "Longitude": -3.69230089259031,
        "DistanceUnit": 0
    },
    "Connections": [
        {
            "ID": 121451,
            "ConnectionTypeID": 25,
            "StatusTypeID": 50,
            "LevelID": 2,
            "Amps": 20,
            "Voltage": 230,
            "PowerKW": 4.6,
            "CurrentTypeID": 10,
            "Quantity": 1
        }
    ],
    "NumberOfPoints": 1,
    "StatusTypeID": 50,
    "DateLastStatusUpdate": "2017-04-06T09:04:00Z",
    "DataQualityLevel": 1,
    "DateCreated": "2017-04-03T23:53:00Z",
    "SubmissionStatusTypeID": 200
}