{
    "IsRecentlyVerified": false,
    "ID": 127400,
    "UUID": "9B2F296C-D8D3-4B10-8E8B-57FFB58557BD",
    "DataProviderID": 1,
    "OperatorID": 22,
    "OperatorsReference": "C6M2Y",
    "UsageTypeID": 4,
    "AddressInfo": {
        "ID": 127746,
        "Title": "Menlo Park Hotel",
        "AddressLine1": "Menlo Park Hotel",
        "CountryID": 3,
        "Latitude": 53.2881,
        "Longitude": -9.048,
        "DistanceUnit": 0
    },
    "Connections": [
        {
            "ID": 178368,
            "ConnectionTypeID": 25,
            "StatusTypeID": 50,
            "LevelID": 2,
            "Amps": 32,
            "Voltage": 400,
            "PowerKW": 22,
            "CurrentTypeID": 20,
            "Quantity": 2
        }
    ],
    "NumberOfPoints": 2,
    "StatusTypeID": 50,
    "DateLastStatusUpdate": "2019-06-22T05:42:00Z",
    "DataQualityLevel": 1,
    "DateCreated": "2019-06-03T09:38:00Z",
    "SubmissionStatusTypeID": 200
}