{
    "IsRecentlyVerified": false,
    "ID": 137018,
    "UUID": "4CA9C650-3985-4DD6-AE7F-348DC2986321",
    "DataProviderID": 1,
    "OperatorID": 3315,
    "UsageTypeID": 4,
    "AddressInfo": {
        "ID": 137364,
        "Title": "Croy Park and Ride",
        "AddressLine1": "61 Constarry Road",
        "Town": "Croy Park and Ride",
        "Postcode": "G65 9HT",
        "CountryID": 1,
        "Latitude": 55.95394343267485,
        "Longitude": -4.034499366378782,
        "AccessComments": "",
        "RelatedURL": "",
        "DistanceUnit": 0
    },
    "Connections": [
        {
            "ID": 191795,
            "ConnectionTypeID": 25,
            "Reference": "51497",
            "StatusTypeID": 50,
            "LevelID": 2,
            "Amps": 32,
            "Voltage": 400,
            "PowerKW": 22,
            "CurrentTypeID": 20,
            "Quantity": 1
        },
        {
            "ID": 191796,
            "ConnectionTypeID": 33,
            "Reference": "51497",
            "StatusTypeID": 50,
            "LevelID": 3,
            "Amps": 60,
            "Voltage": 400,
            "PowerKW": 22,
            "CurrentTypeID": 30,
            "Quantity": 1
        },
        {
            "ID": 303838,
            "ConnectionTypeID": 2,
            "Reference": "51497",
            "StatusTypeID": 50,
            "LevelID": 3,
            "Amps": 60,
            "Voltage": 400,
            "PowerKW": 22,
            "CurrentTypeID": 30,
            "Quantity": 1
        }
    ],
    "StatusTypeID": 50,
    "DateLastStatusUpdate": "2021-07-15T13:37:00Z",
    "MetadataValues": [
        {
            "ID": 6870,
            "MetadataFieldID": 4,
            "ItemValue": "Contains public sector information licensed under the Open Government Licence v2.0. http://www.nationalarchives.gov.uk/doc/open-government-licence/version/2/"
        }
    ],
    "DataQualityLevel": 3,
    "DateCreated": "2019-12-24T05:23:00Z",
    "SubmissionStatusTypeID": 100
}