{
    "IsRecentlyVerified": false,
    "ID": 140685,
    "UUID": "C380E555-76B0-41CE-BDD5-EA3FB02A6C0E",
    "DataProviderID": 2,
    "DataProvidersReference": "81110",
    "OperatorID": 5,
    "UsageTypeID": 1,
    "AddressInfo": {
        "ID": 141037,
        "Title": "ESSEX",
        "AddressLine1": "1729 N 1st St",
        "Town": "San Jose",
        "StateOrProvince": "CA",
        "Postcode": "95112",
        "CountryID": 2,
        "Latitude": 37.367741,
        "Longitude": -121.914992,
        "ContactTelephone1": "888-758-4389",
        "AccessComments": "24 hours daily",
        "RelatedURL": "http://www.chargepoint.com/",
        "DistanceUnit": 0
    },
    "Connections": [
        {
            "ID": 196387,
            "ConnectionTypeID": 1,
            "LevelID": 2,
            "Amps": 16,
            "Voltage": 230,
            "PowerKW": 3,
            "CurrentTypeID": 10,
            "Quantity": 8
        }
    ],
    "StatusTypeID": 50,
    "DateLastStatusUpdate": "2019-12-24T09:13:00Z",
    "DataQualityLevel": 3,
    "DateCreated": "2019-12-24T09:13:00Z",
    "SubmissionStatusTypeID": 100
}