{
    "IsRecentlyVerified": false,
    "ID": 18948,
    "UUID": "DAE47A58-A3E9-4AAE-8D56-74054156D98A",
    "DataProviderID": 15,
    "DataProvidersReference": "35147",
    "OperatorID": 5,
    "UsageTypeID": 1,
    "AddressInfo": {
        "ID": 19293,
        "Title": "175 Sandalwood Pkwy. W.",
        "AddressLine1": "175 Sandalwood Pkwy. W.",
        "Town": "Brampton",
        "StateOrProvince": "",
        "Postcode": "ON L7A 1J6",
        "CountryID": 44,
        "Latitude": 43.71389,
        "Longitude": -79.80647,
        "ContactTelephone1": "(905) 840-6300",
        "RelatedURL": "http://carstations.com/35147",
        "DistanceUnit": 0
    },
    "Connections": [
        {
            "ID": 19213,
            "ConnectionTypeID": 1,
            "Reference": "J1772",
            "LevelID": 2
        }
    ],
    "NumberOfPoints": 1,
    "StatusTypeID": 0,
    "DateLastStatusUpdate": "2017-11-04T14:04:00Z",
    "DataQualityLevel": 2,
    "DateCreated": "2013-09-05T03:37:00Z",
    "SubmissionStatusTypeID": 200
}