{
    "IsRecentlyVerified": false,
    "ID": 163827,
    "UUID": "AD7FD1DD-FA4C-4F25-B211-777D94638CEC",
    "DataProviderID": 1,
    "OperatorID": 23,
    "OperatorsReference": "49538",
    "UsageTypeID": 4,
    "AddressInfo": {
        "ID": 164185,
        "Title": "5 Sterne Ferienhaus Emmelsbuell",
        "AddressLine1": "Dorfstrasse 74",
        "Town": "Emmelsbuell-Horsbuell",
        "Postcode": "25924",
        "CountryID": 87,
        "Latitude": 54.809781,
        "Longitude": 8.700606,
        "ContactTelephone1": " +49 466 13781",
        "DistanceUnit": 0
    },
    "Connections": [
        {
            "ID": 235424,
            "ConnectionTypeID": 30,
            "StatusTypeID": 50,
            "LevelID": 2,
            "PowerKW": 17,
            "CurrentTypeID": 20,
            "Quantity": 1
        }
    ],
    "NumberOfPoints": 1,
    "GeneralComments": "1 Tesla Connector, up to 17kW.Available for customers. Self park.",
    "StatusTypeID": 50,
    "DateLastStatusUpdate": "2020-08-24T19:46:00Z",
    "DataQualityLevel": 1,
    "DateCreated": "2020-08-24T19:46:00Z",
    "SubmissionStatusTypeID": 200
}