{
    "IsRecentlyVerified": false,
    "ID": 45013,
    "UUID": "AAAD9745-39E3-4DB4-A428-FF829CC61526",
    "DataProviderID": 1,
    "OperatorID": 45,
    "UsageTypeID": 3,
    "UsageCost": "Spende",
    "AddressInfo": {
        "ID": 45359,
        "Title": "Driller Windenergie und Landwirtschaft",
        "AddressLine1": "Wienackerstraße 25",
        "Town": "Altenbeken",
        "Postcode": "33184 ",
        "CountryID": 87,
        "Latitude": 51.7556879363447,
        "Longitude": 8.937020509268,
        "ContactTelephone1": "+49 176 21728274",
        "AccessComments": "Säule auf landwirtschaftlichen Betrieb, vorne an grüner Maschinenhalle. Festes Ladekabel. Zur Zeit Probebetrieb, deshalb telefonisch anmelden. CEE geplant, weitere Typ2 Steckdose und 11kW CEE-Dosen auf Anfrage verfügbar. Stromspenden werden zur Errichtung weiterer Ladepunkte verwendet!",
        "DistanceUnit": 0
    },
    "Connections": [
        {
            "ID": 55338,
            "ConnectionTypeID": 25,
            "StatusTypeID": 50,
            "LevelID": 3,
            "Amps": 63,
            "Voltage": 400,
            "PowerKW": 43,
            "CurrentTypeID": 20,
            "Quantity": 1
        },
        {
            "ID": 55339,
            "ConnectionTypeID": 25,
            "StatusTypeID": 75,
            "LevelID": 2,
            "Amps": 32,
            "Voltage": 400,
            "PowerKW": 22,
            "CurrentTypeID": 20,
            "Quantity": 1
        },
        {
            "ID": 55340,
            "ConnectionTypeID": 17,
            "StatusTypeID": 150,
            "LevelID": 2,
            "Amps": 32,
            "Voltage": 400,
            "PowerKW": 22,
            "CurrentTypeID": 20,
            "Quantity": 1
        },
        {
            "ID": 55636,
            "ConnectionTypeID": 17,
            "StatusTypeID": 50,
            "LevelID": 2,
            "Amps": 16,
            "Voltage": 400,
            "PowerKW": 11,
            "CurrentTypeID": 20,
            "Quantity": 1
        },
        {
            "ID": 55637,
            "ConnectionTypeID": 28,
            "StatusTypeID": 50,
            "LevelID": 2,
            "Amps": 16,
            "Voltage": 230,
            "PowerKW": 3.7,
            "CurrentTypeID": 10,
            "Quantity": 1
        }
    ],
    "NumberOfPoints": 2,
    "StatusTypeID": 50,
    "DateLastStatusUpdate": "2015-04-25T15:02:00Z",
    "DataQualityLevel": 1,
    "DateCreated": "2015-04-22T07:09:00Z",
    "SubmissionStatusTypeID": 200
}