{
    "IsRecentlyVerified": false,
    "ID": 132215,
    "UUID": "8F01AFBC-5C79-4BF2-910F-F08442D6BD33",
    "DataProviderID": 1,
    "OperatorID": 80,
    "UsageTypeID": 4,
    "AddressInfo": {
        "ID": 132561,
        "Title": "Genova Antiochia | EnelX",
        "AddressLine1": "Via Antiochia, 8",
        "Town": "Genova",
        "StateOrProvince": "GE",
        "Postcode": "16129",
        "CountryID": 112,
        "Latitude": 44.40417276267689,
        "Longitude": 8.949002523161312,
        "RelatedURL": "https://www.enelx.com/it/it/emobility",
        "DistanceUnit": 0
    },
    "Connections": [
        {
            "ID": 185052,
            "ConnectionTypeID": 25,
            "StatusTypeID": 50,
            "LevelID": 2,
            "Amps": 32,
            "Voltage": 400,
            "PowerKW": 22,
            "CurrentTypeID": 20,
            "Quantity": 1
        },
        {
            "ID": 185053,
            "ConnectionTypeID": 36,
            "StatusTypeID": 50,
            "LevelID": 2,
            "Amps": 16,
            "Voltage": 240,
            "PowerKW": 3.7,
            "CurrentTypeID": 10,
            "Quantity": 1
        }
    ],
    "NumberOfPoints": 2,
    "StatusTypeID": 50,
    "DateLastStatusUpdate": "2019-09-24T10:08:00Z",
    "DataQualityLevel": 1,
    "DateCreated": "2019-09-24T10:08:00Z",
    "SubmissionStatusTypeID": 200
}