{
    "MediaItems": [
        {
            "ID": 20665,
            "ChargePointID": 47980,
            "ItemURL": "https://s3-ap-southeast-2.amazonaws.com/openchargemap/images/CZ/OCM47980/OCM-47980.orig.2019122112343515.png",
            "ItemThumbnailURL": "https://s3-ap-southeast-2.amazonaws.com/openchargemap/images/CZ/OCM47980/OCM-47980.thmb.2019122112343515.png",
            "Comment": "#cez #ultrafast #praha #duhova #zadara #hyundai ",
            "IsEnabled": true,
            "IsVideo": false,
            "IsFeaturedItem": false,
            "IsExternalResource": false,
            "User": {
                "ID": 22495,
                "Username": "MAJKL_elektro🔋"
            },
            "DateCreated": "2019-12-21T12:35:00Z"
        },
        {
            "ID": 20666,
            "ChargePointID": 47980,
            "ItemURL": "https://s3-ap-southeast-2.amazonaws.com/openchargemap/images/CZ/OCM47980/OCM-47980.orig.2019122112350516.png",
            "ItemThumbnailURL": "https://s3-ap-southeast-2.amazonaws.com/openchargemap/images/CZ/OCM47980/OCM-47980.thmb.2019122112350516.png",
            "Comment": "#cez #ultrafast #praha #duhova #zadara #hyundai ",
            "IsEnabled": true,
            "IsVideo": false,
            "IsFeaturedItem": false,
            "IsExternalResource": false,
            "User": {
                "ID": 22495,
                "Username": "MAJKL_elektro🔋"
            },
            "DateCreated": "2019-12-21T12:35:00Z"
        },
        {
            "ID": 20663,
            "ChargePointID": 47980,
            "ItemURL": "https://s3-ap-southeast-2.amazonaws.com/openchargemap/images/CZ/OCM47980/OCM-47980.orig.2019122112332801.png",
            "ItemThumbnailURL": "https://s3-ap-southeast-2.amazonaws.com/openchargemap/images/CZ/OCM47980/OCM-47980.thmb.2019122112332801.png",
            "Comment": "#cez #ultrafast #praha #duhova #zadara #hyundai ",
            "IsEnabled": true,
            "IsVideo": false,
            "IsFeaturedItem": false,
            "IsExternalResource": false,
            "User": {
                "ID": 22495,
                "Username": "MAJKL_elektro🔋"
            },
            "DateCreated": "2019-12-21T12:34:00Z"
        },
        {
            "ID": 20664,
            "ChargePointID": 47980,
            "ItemURL": "https://s3-ap-southeast-2.amazonaws.com/openchargemap/images/CZ/OCM47980/OCM-47980.orig.2019122112340334.png",
            "ItemThumbnailURL": "https://s3-ap-southeast-2.amazonaws.com/openchargemap/images/CZ/OCM47980/OCM-47980.thmb.2019122112340334.png",
            "Comment": "#cez #ultrafast #praha #duhova #zadara #hyundai ",
            "IsEnabled": true,
            "IsVideo": false,
            "IsFeaturedItem": false,
            "IsExternalResource": false,
            "User": {
                "ID": 22495,
                "Username": "MAJKL_elektro🔋"
            },
            "DateCreated": "2019-12-21T12:34:00Z"
        },
        {
            "ID": 20572,
            "ChargePointID": 47980,
            "ItemURL": "https://s3-ap-southeast-2.amazonaws.com/openchargemap/images/CZ/OCM47980/OCM-47980.orig.2019121415413204.png",
            "ItemThumbnailURL": "https://s3-ap-southeast-2.amazonaws.com/openchargemap/images/CZ/OCM47980/OCM-47980.thmb.2019121415413204.png",
            "Comment": "#cez #nonstop #mista2 #praha #hyundai ",
            "IsEnabled": true,
            "IsVideo": false,
            "IsFeaturedItem": false,
            "IsExternalResource": false,
            "User": {
                "ID": 22495,
                "Username": "MAJKL_elektro🔋"
            },
            "DateCreated": "2019-12-14T15:42:00Z"
        },
        {
            "ID": 20571,
            "ChargePointID": 47980,
            "ItemURL": "https://s3-ap-southeast-2.amazonaws.com/openchargemap/images/CZ/OCM47980/OCM-47980.orig.2019121415405543.png",
            "ItemThumbnailURL": "https://s3-ap-southeast-2.amazonaws.com/openchargemap/images/CZ/OCM47980/OCM-47980.thmb.2019121415405543.png",
            "Comment": "#cez #nonstop #mista2 #praha #hyundai ",
            "IsEnabled": true,
            "IsVideo": false,
            "IsFeaturedItem": false,
            "IsExternalResource": false,
            "User": {
                "ID": 22495,
                "Username": "MAJKL_elektro🔋"
            },
            "DateCreated": "2019-12-14T15:41:00Z"
        }
    ],
    "IsRecentlyVerified": false,
    "ID": 47980,
    "UUID": "CB375C15-CF49-48C0-9050-738EED8D29BC",
    "DataProviderID": 1,
    "OperatorID": 115,
    "UsageTypeID": 4,
    "AddressInfo": {
        "ID": 48326,
        "Title": "Centrála ČEZ, a.s. rychlodobíjení",
        "AddressLine1": "Duhová 1",
        "Town": "Praha 4",
        "Postcode": "140 00",
        "CountryID": 64,
        "Latitude": 50.0490315504762,
        "Longitude": 14.4510863833976,
        "RelatedURL": "http://www.elektromobilita.cz/",
        "DistanceUnit": 0
    },
    "Connections": [
        {
            "ID": 59207,
            "ConnectionTypeID": 2,
            "StatusTypeID": 50,
            "LevelID": 3,
            "PowerKW": 50,
            "CurrentTypeID": 30,
            "Quantity": 1
        },
        {
            "ID": 59208,
            "ConnectionTypeID": 33,
            "StatusTypeID": 50,
            "LevelID": 3,
            "PowerKW": 50,
            "CurrentTypeID": 30,
            "Quantity": 1
        },
        {
            "ID": 59209,
            "ConnectionTypeID": 25,
            "StatusTypeID": 50,
            "LevelID": 2,
            "Amps": 32,
            "Voltage": 400,
            "PowerKW": 22,
            "CurrentTypeID": 20,
            "Quantity": 1
        }
    ],
    "NumberOfPoints": 1,
    "GeneralComments": "CZ: Za poplatek, je potřeba získat RFID kartu od ČEZ. \r\nEN: Paid, need to get an RFID card from ČEZ.",
    "StatusTypeID": 50,
    "DateLastStatusUpdate": "2019-12-21T12:35:00Z",
    "DataQualityLevel": 1,
    "DateCreated": "2015-06-20T08:34:00Z",
    "SubmissionStatusTypeID": 200
}