{
    "IsRecentlyVerified": false,
    "ID": 156848,
    "UUID": "D704E04D-3FBE-449E-A743-FD50E8B9595E",
    "DataProviderID": 19,
    "DataProvidersReference": "4522",
    "AddressInfo": {
        "ID": 157202,
        "Title": "Järnvägsstationen",
        "AddressLine1": "Stationsvägen 1",
        "Town": "DEGERFORS",
        "StateOrProvince": "ÖREBRO",
        "Postcode": "69332",
        "CountryID": 216,
        "Latitude": 59.22921,
        "Longitude": 14.44066,
        "AccessComments": "",
        "DistanceUnit": 0
    },
    "Connections": [
        {
            "ID": 222191,
            "ConnectionTypeID": 25,
            "Reference": "1",
            "LevelID": 3,
            "Amps": 32,
            "Voltage": 400,
            "PowerKW": 22,
            "CurrentTypeID": 30,
            "Comments": "Mode 3"
        },
        {
            "ID": 222192,
            "ConnectionTypeID": 25,
            "Reference": "2",
            "LevelID": 3,
            "Amps": 32,
            "Voltage": 400,
            "PowerKW": 22,
            "CurrentTypeID": 30,
            "Comments": "Mode 3"
        }
    ],
    "NumberOfPoints": 2,
    "StatusTypeID": 0,
    "DateLastStatusUpdate": "2021-03-24T05:11:00Z",
    "DataQualityLevel": 2,
    "DateCreated": "2020-05-26T08:22:00Z",
    "SubmissionStatusTypeID": 100
}