{
    "IsRecentlyVerified": false,
    "ID": 77095,
    "UUID": "12A07734-B224-4EB6-ADBD-6A8EEBEB725A",
    "DataProviderID": 1,
    "OperatorID": 45,
    "UsageTypeID": 2,
    "AddressInfo": {
        "ID": 77441,
        "Title": "Stadtwerke",
        "AddressLine1": "Am Eiland 12",
        "Town": "Rendsburg",
        "StateOrProvince": "Kreis Rendsburg-Eckernförde",
        "Postcode": "24768",
        "CountryID": 87,
        "Latitude": 54.30607999999999,
        "Longitude": 9.67172000000005,
        "AccessComments": "Die Säule ist nutzbar von Mo-Mi. 07:30-16:00Uhr, Do. 07:30-18:00Uhr, Fr. von 07:30-13:00Uhr. Säule hinter Tor, das außerhalb der Öffnungszeiten verschlossen ist!\r\n",
        "RelatedURL": "http://www.stadtwerke-rendsburg.de/",
        "DistanceUnit": 0
    },
    "Connections": [
        {
            "ID": 110750,
            "ConnectionTypeID": 25,
            "StatusTypeID": 50,
            "LevelID": 2,
            "Amps": 32,
            "Voltage": 400,
            "PowerKW": 22,
            "CurrentTypeID": 20,
            "Quantity": 2
        }
    ],
    "NumberOfPoints": 2,
    "StatusTypeID": 50,
    "DateLastStatusUpdate": "2016-12-30T22:27:00Z",
    "DataQualityLevel": 1,
    "DateCreated": "2016-12-30T22:27:00Z",
    "SubmissionStatusTypeID": 200
}