{
    "IsRecentlyVerified": false,
    "ID": 82267,
    "UUID": "D6B48C08-4310-4356-B419-4D92B08322E4",
    "DataProviderID": 1,
    "OperatorID": 23,
    "OperatorsReference": "23205",
    "UsageTypeID": 4,
    "AddressInfo": {
        "ID": 82613,
        "Title": "Fiesta Inn Queretaro",
        "AddressLine1": "Av. 5 de Febrero #108 Ninos Heroes",
        "Town": "Queretaro",
        "StateOrProvince": "Queretaro",
        "Postcode": "76010",
        "CountryID": 146,
        "Latitude": 20.583605,
        "Longitude": -100.407426,
        "ContactTelephone1": "+52 442 196 0000",
        "DistanceUnit": 0
    },
    "Connections": [
        {
            "ID": 117032,
            "ConnectionTypeID": 30,
            "StatusTypeID": 50,
            "LevelID": 2,
            "PowerKW": 18,
            "CurrentTypeID": 20,
            "Quantity": 2
        }
    ],
    "NumberOfPoints": 2,
    "GeneralComments": "2 Tesla Connectors, up to 18kW.Available for customers. Please see front desk.",
    "StatusTypeID": 50,
    "DateLastStatusUpdate": "2017-02-03T15:22:00Z",
    "DataQualityLevel": 1,
    "DateCreated": "2017-02-03T15:22:00Z",
    "SubmissionStatusTypeID": 200
}