{
    "IsRecentlyVerified": false,
    "ID": 6851,
    "UUID": "631313C4-C3D6-4AF1-9F8E-659C02988212",
    "DataProviderID": 2,
    "DataProvidersReference": "40979",
    "OperatorID": 5,
    "UsageTypeID": 1,
    "AddressInfo": {
        "ID": 6752,
        "Title": "OUC",
        "AddressLine1": "5944 S Orange Blossom Trail",
        "Town": "Orlando",
        "StateOrProvince": "FL",
        "Postcode": "32809",
        "CountryID": 2,
        "Latitude": 28.470548,
        "Longitude": -81.396861,
        "ContactTelephone1": "888-758-4389",
        "AccessComments": "24 hours daily",
        "RelatedURL": "http://www.chargepoint.com/",
        "DistanceUnit": 0
    },
    "Connections": [
        {
            "ID": 16236,
            "ConnectionTypeID": 1,
            "LevelID": 2,
            "Amps": 16,
            "Voltage": 230,
            "PowerKW": 3.7,
            "CurrentTypeID": 10,
            "Quantity": 2
        },
        {
            "ID": 16237,
            "ConnectionTypeID": 1,
            "LevelID": 2,
            "Amps": 16,
            "Voltage": 230,
            "PowerKW": 3,
            "CurrentTypeID": 10,
            "Quantity": 3
        },
        {
            "ID": 21268,
            "ConnectionTypeID": 1,
            "LevelID": 2,
            "Quantity": 1
        }
    ],
    "DateLastConfirmed": "2011-09-25T00:00:00Z",
    "StatusTypeID": 0,
    "DateLastStatusUpdate": "2020-06-26T02:52:00Z",
    "DataQualityLevel": 1,
    "DateCreated": "2011-10-10T12:26:00Z",
    "SubmissionStatusTypeID": 100
}