{
    "IsRecentlyVerified": false,
    "ID": 173564,
    "UUID": "AFC58301-89F8-4552-A5F7-3CCFD18197D8",
    "DataProviderID": 18,
    "DataProvidersReference": "e7ef07aba734d868c88271b1810cb991",
    "OperatorID": 2244,
    "UsageTypeID": 5,
    "AddressInfo": {
        "ID": 173923,
        "Title": "18 Newcourt Street",
        "AddressLine1": "18 Newcourt Street",
        "Town": "London",
        "Postcode": "NW8 7AA",
        "CountryID": 1,
        "Latitude": 51.532464,
        "Longitude": -0.168252,
        "AccessComments": "",
        "RelatedURL": "https://www.ubitricity.com",
        "DistanceUnit": 0
    },
    "Connections": [
        {
            "ID": 266629,
            "ConnectionTypeID": 25,
            "Reference": "suby1100008397",
            "StatusTypeID": 50,
            "LevelID": 2,
            "Amps": 16,
            "Voltage": 230,
            "PowerKW": 3.7,
            "CurrentTypeID": 10
        }
    ],
    "StatusTypeID": 0,
    "DateLastStatusUpdate": "2021-04-25T05:46:00Z",
    "MetadataValues": [
        {
            "ID": 8486,
            "MetadataFieldID": 4,
            "ItemValue": "Contains public sector information licensed under the Open Government Licence v2.0. http://www.nationalarchives.gov.uk/doc/open-government-licence/version/2/"
        }
    ],
    "DataQualityLevel": 3,
    "DateCreated": "2021-03-03T11:25:00Z",
    "SubmissionStatusTypeID": 100
}