{
    "IsRecentlyVerified": true,
    "DateLastVerified": "2021-08-22T11:02:00Z",
    "ID": 188874,
    "UUID": "DD7BE663-953B-43ED-BDE8-DE6C699B1434",
    "DataProviderID": 1,
    "OperatorID": 21,
    "UsageTypeID": 4,
    "UsageCost": "Mobi.E compatible card or App",
    "AddressInfo": {
        "ID": 189233,
        "Title": "FIG-00011 - BP",
        "AddressLine1": "Avenida Dom João Alves",
        "Town": "Figueira da Foz",
        "StateOrProvince": "Coimbra",
        "Postcode": "3080-034",
        "CountryID": 180,
        "Latitude": 40.162169039985486,
        "Longitude": -8.848170642155765,
        "DistanceUnit": 0
    },
    "Connections": [
        {
            "ID": 305202,
            "ConnectionTypeID": 2,
            "StatusTypeID": 50,
            "LevelID": 3,
            "Amps": 120,
            "Voltage": 500,
            "PowerKW": 50,
            "CurrentTypeID": 30,
            "Quantity": 1
        },
        {
            "ID": 305203,
            "ConnectionTypeID": 33,
            "StatusTypeID": 50,
            "LevelID": 3,
            "Amps": 125,
            "Voltage": 500,
            "PowerKW": 50,
            "CurrentTypeID": 30,
            "Quantity": 1
        },
        {
            "ID": 305204,
            "ConnectionTypeID": 1036,
            "StatusTypeID": 50,
            "LevelID": 3,
            "Amps": 64,
            "Voltage": 400,
            "PowerKW": 43,
            "CurrentTypeID": 20,
            "Quantity": 1
        }
    ],
    "NumberOfPoints": 2,
    "StatusTypeID": 50,
    "DateLastStatusUpdate": "2021-08-22T11:02:00Z",
    "DataQualityLevel": 1,
    "DateCreated": "2021-08-22T11:02:00Z",
    "SubmissionStatusTypeID": 200
}