{
    "IsRecentlyVerified": false,
    "ID": 130266,
    "UUID": "1046B07A-2F13-475C-B816-F832BFE4E1F0",
    "DataProviderID": 1,
    "OperatorID": 1,
    "UsageTypeID": 4,
    "AddressInfo": {
        "ID": 130612,
        "Title": "Greenway Polska Hotel & Restauracja Olivia Ryki",
        "AddressLine1": "Warszawska 59e",
        "Town": "Ryki",
        "Postcode": "08-500",
        "CountryID": 179,
        "Latitude": 51.63893955,
        "Longitude": 21.9130226035356,
        "DistanceUnit": 0
    },
    "Connections": [
        {
            "ID": 182329,
            "ConnectionTypeID": 2,
            "StatusTypeID": 50,
            "LevelID": 3,
            "PowerKW": 40,
            "CurrentTypeID": 30,
            "Quantity": 1
        },
        {
            "ID": 182330,
            "ConnectionTypeID": 33,
            "StatusTypeID": 50,
            "LevelID": 3,
            "PowerKW": 40,
            "CurrentTypeID": 30,
            "Quantity": 1
        },
        {
            "ID": 182331,
            "ConnectionTypeID": 1036,
            "StatusTypeID": 50,
            "LevelID": 2,
            "Amps": 32,
            "Voltage": 400,
            "PowerKW": 22,
            "CurrentTypeID": 20,
            "Quantity": 1
        }
    ],
    "NumberOfPoints": 1,
    "StatusTypeID": 50,
    "DateLastStatusUpdate": "2019-08-24T09:58:00Z",
    "DataQualityLevel": 1,
    "DateCreated": "2019-08-02T10:03:00Z",
    "SubmissionStatusTypeID": 200
}