{
    "IsRecentlyVerified": false,
    "ID": 136880,
    "UUID": "B533FE28-E86C-4B68-9F06-4BE73F393986",
    "DataProviderID": 18,
    "DataProvidersReference": "8c54a7fc28e51f7848876a4a90fbf0b2",
    "UsageTypeID": 1,
    "AddressInfo": {
        "ID": 137226,
        "Title": "Castle Road",
        "AddressLine1": "Castle Road",
        "Town": "Antrim",
        "Postcode": "BT41 4NA",
        "CountryID": 1,
        "Latitude": 54.726132,
        "Longitude": -6.247433,
        "AccessComments": "",
        "RelatedURL": "https://www.drdni.gov.uk/",
        "DistanceUnit": 0
    },
    "Connections": [
        {
            "ID": 191557,
            "ConnectionTypeID": 25,
            "Reference": "1",
            "StatusTypeID": 50,
            "LevelID": 2,
            "Amps": 32,
            "Voltage": 230,
            "PowerKW": 7,
            "CurrentTypeID": 10
        },
        {
            "ID": 191558,
            "ConnectionTypeID": 25,
            "Reference": "2",
            "StatusTypeID": 50,
            "LevelID": 2,
            "Amps": 32,
            "Voltage": 230,
            "PowerKW": 7,
            "CurrentTypeID": 10
        }
    ],
    "StatusTypeID": 0,
    "DateLastStatusUpdate": "2020-03-17T08:54:00Z",
    "MetadataValues": [
        {
            "ID": 6732,
            "MetadataFieldID": 4,
            "ItemValue": "Contains public sector information licensed under the Open Government Licence v2.0. http://www.nationalarchives.gov.uk/doc/open-government-licence/version/2/"
        }
    ],
    "DataQualityLevel": 3,
    "DateCreated": "2019-12-24T05:23:00Z",
    "SubmissionStatusTypeID": 100
}