{
    "IsRecentlyVerified": false,
    "ID": 120646,
    "UUID": "8F54616D-7ADA-4570-964B-20463A014C75",
    "DataProviderID": 2,
    "DataProvidersReference": "72859",
    "OperatorID": 1242,
    "UsageTypeID": 2,
    "AddressInfo": {
        "ID": 120992,
        "Title": "CH6 Station A",
        "AddressLine1": "5000  W Chandler Blvd",
        "Town": "Chandler",
        "StateOrProvince": "AZ",
        "Postcode": "85226",
        "CountryID": 2,
        "Latitude": 33.3109467681,
        "Longitude": -111.9347782,
        "ContactTelephone1": "855-443-3873",
        "AccessComments": "",
        "RelatedURL": "https://www.gewattstation.com",
        "DistanceUnit": 0
    },
    "Connections": [
        {
            "ID": 170010,
            "ConnectionTypeID": 1,
            "LevelID": 2,
            "Amps": 16,
            "Voltage": 230,
            "PowerKW": 3.7,
            "CurrentTypeID": 10,
            "Quantity": 1
        }
    ],
    "DateLastStatusUpdate": "2020-06-26T02:55:00Z",
    "DataQualityLevel": 3,
    "DateCreated": "2019-04-01T04:59:00Z",
    "SubmissionStatusTypeID": 100
}