{
    "IsRecentlyVerified": false,
    "ID": 74992,
    "UUID": "EA68BBF0-E7ED-4627-8B6F-6B1EBA4BB15F",
    "DataProviderID": 1,
    "OperatorID": 23,
    "OperatorsReference": "21152",
    "UsageTypeID": 6,
    "UsageCost": "Free",
    "AddressInfo": {
        "ID": 75338,
        "Title": "Hotel Emporda",
        "AddressLine1": "170 Avda. Salvador Dali",
        "Town": "Figueres",
        "Postcode": "17600",
        "CountryID": 210,
        "Latitude": 42.275944,
        "Longitude": 2.953234,
        "ContactTelephone1": "+34 972 500 562",
        "DistanceUnit": 0
    },
    "Connections": [
        {
            "ID": 108185,
            "ConnectionTypeID": 30,
            "StatusTypeID": 50,
            "LevelID": 2,
            "Amps": 16,
            "Voltage": 400,
            "PowerKW": 11,
            "CurrentTypeID": 20,
            "Quantity": 1
        }
    ],
    "NumberOfPoints": 1,
    "GeneralComments": "1 Tesla Connector, up to 11kW.Available for patrons only. Please see front desk.",
    "StatusTypeID": 50,
    "DateLastStatusUpdate": "2020-08-17T12:13:00Z",
    "DataQualityLevel": 1,
    "DateCreated": "2016-12-10T16:27:00Z",
    "SubmissionStatusTypeID": 200
}