{
    "IsRecentlyVerified": false,
    "ID": 127697,
    "UUID": "CF4BA924-F04A-440F-B8FE-6587A56768C5",
    "DataProviderID": 1,
    "OperatorID": 3315,
    "OperatorsReference": "51508",
    "UsageTypeID": 4,
    "UsageCost": "Free",
    "AddressInfo": {
        "ID": 128043,
        "Title": "Cannongate Car Park, Scottish Borders",
        "AddressLine1": "Cannongate Car Park, Scottish Borders",
        "Postcode": "TD8 6AJ",
        "CountryID": 1,
        "Latitude": 55.4775,
        "Longitude": -2.55305,
        "DistanceUnit": 0
    },
    "Connections": [
        {
            "ID": 178752,
            "ConnectionTypeID": 2,
            "StatusTypeID": 50,
            "LevelID": 3,
            "PowerKW": 50,
            "CurrentTypeID": 30,
            "Quantity": 1
        },
        {
            "ID": 178753,
            "ConnectionTypeID": 33,
            "StatusTypeID": 50,
            "LevelID": 3,
            "PowerKW": 50,
            "CurrentTypeID": 30,
            "Quantity": 1
        },
        {
            "ID": 178754,
            "ConnectionTypeID": 1036,
            "StatusTypeID": 50,
            "LevelID": 3,
            "PowerKW": 43,
            "CurrentTypeID": 20,
            "Quantity": 1
        }
    ],
    "NumberOfPoints": 1,
    "StatusTypeID": 50,
    "DateLastStatusUpdate": "2020-05-31T05:13:00Z",
    "DataQualityLevel": 1,
    "DateCreated": "2019-06-08T05:15:00Z",
    "SubmissionStatusTypeID": 200
}