{
    "IsRecentlyVerified": false,
    "ID": 41220,
    "UUID": "EAB9632E-0F1B-49E2-B2A2-79F9493D2F1E",
    "DataProviderID": 15,
    "DataProvidersReference": "28087",
    "OperatorID": 9,
    "AddressInfo": {
        "ID": 41566,
        "Title": "14460 Maxim Dr",
        "AddressLine1": "14460 Maxim Dr",
        "Town": "Dallas",
        "StateOrProvince": "TX",
        "Postcode": "US",
        "CountryID": 2,
        "Latitude": 32.949317,
        "Longitude": -96.833587,
        "ContactTelephone1": "",
        "RelatedURL": "http://carstations.com/28087",
        "DistanceUnit": 0
    },
    "Connections": [
        {
            "ID": 45008,
            "ConnectionTypeID": 1,
            "Reference": "J1772",
            "LevelID": 2
        }
    ],
    "StatusTypeID": 0,
    "DateLastStatusUpdate": "2017-11-04T14:04:00Z",
    "DataQualityLevel": 2,
    "DateCreated": "2015-01-28T11:44:00Z",
    "SubmissionStatusTypeID": 100
}