{
    "IsRecentlyVerified": false,
    "ID": 97862,
    "UUID": "0DC9F77E-F5E1-45A7-A27E-695F32226075",
    "DataProviderID": 1,
    "OperatorID": 23,
    "OperatorsReference": "38150",
    "UsageTypeID": 4,
    "AddressInfo": {
        "ID": 98208,
        "Title": "Logis Aigue Marine Hôtel",
        "AddressLine1": "5 Rue Marcellin Berthelot",
        "Town": "Treguier",
        "Postcode": "22220",
        "CountryID": 80,
        "Latitude": 48.786743,
        "Longitude": -3.223973,
        "ContactTelephone1": "+33 2 96 92 97 00",
        "DistanceUnit": 0
    },
    "Connections": [
        {
            "ID": 138770,
            "ConnectionTypeID": 30,
            "StatusTypeID": 50,
            "LevelID": 2,
            "Amps": 32,
            "Voltage": 400,
            "PowerKW": 22,
            "CurrentTypeID": 20,
            "Quantity": 2
        }
    ],
    "NumberOfPoints": 2,
    "GeneralComments": "2 Tesla Connectors, up to 22kW.Available to the public. Please see front desk.",
    "StatusTypeID": 50,
    "DateLastStatusUpdate": "2018-10-03T16:33:00Z",
    "DataQualityLevel": 1,
    "DateCreated": "2018-01-21T16:50:00Z",
    "SubmissionStatusTypeID": 200
}