{
    "IsRecentlyVerified": false,
    "ID": 122507,
    "UUID": "4563E4CB-BE55-4CD4-8D89-CD71ECA63D8E",
    "DataProviderID": 2,
    "DataProvidersReference": "103024",
    "OperatorID": 5,
    "UsageTypeID": 1,
    "AddressInfo": {
        "ID": 122853,
        "Title": "ONNI BRAND LP",
        "AddressLine1": "611 N Brand Blvd",
        "Town": "Glendale",
        "StateOrProvince": "CA",
        "Postcode": "91203",
        "CountryID": 2,
        "Latitude": 34.155415,
        "Longitude": -118.255336,
        "ContactTelephone1": "888-758-4389",
        "AccessComments": "24 hours daily",
        "RelatedURL": "http://www.chargepoint.com/",
        "DistanceUnit": 0
    },
    "Connections": [
        {
            "ID": 172402,
            "ConnectionTypeID": 1,
            "LevelID": 2,
            "Amps": 16,
            "Voltage": 230,
            "PowerKW": 3,
            "CurrentTypeID": 10,
            "Quantity": 6
        }
    ],
    "DateLastStatusUpdate": "2019-12-24T09:11:00Z",
    "DataQualityLevel": 3,
    "DateCreated": "2019-04-06T05:03:00Z",
    "SubmissionStatusTypeID": 100
}