{
    "IsRecentlyVerified": false,
    "ID": 134302,
    "UUID": "C861BE10-9A58-402D-A1A2-3A1BB0A311AA",
    "DataProviderID": 1,
    "OperatorID": 3315,
    "OperatorsReference": "51911",
    "UsageTypeID": 4,
    "UsageCost": "Free",
    "AddressInfo": {
        "ID": 134648,
        "Title": "Enterprise Park, Forres, Moray",
        "AddressLine1": "Enterprise Park, Forres, Moray",
        "Postcode": "IV36 2AB",
        "CountryID": 1,
        "Latitude": 57.61611,
        "Longitude": -3.57022,
        "DistanceUnit": 0
    },
    "Connections": [
        {
            "ID": 187949,
            "ConnectionTypeID": 25,
            "StatusTypeID": 50,
            "LevelID": 2,
            "Amps": 32,
            "Voltage": 400,
            "PowerKW": 22,
            "CurrentTypeID": 20,
            "Quantity": 2
        }
    ],
    "NumberOfPoints": 4,
    "StatusTypeID": 50,
    "DateLastStatusUpdate": "2020-01-02T08:22:00Z",
    "DataQualityLevel": 1,
    "DateCreated": "2019-11-08T06:15:00Z",
    "SubmissionStatusTypeID": 200
}