{
    "IsRecentlyVerified": false,
    "ID": 181805,
    "UUID": "29AAC3E0-D8FD-4790-884D-E8E0FB351256",
    "DataProviderID": 29,
    "DataProvidersReference": "2508",
    "OperatorID": 72,
    "AddressInfo": {
        "ID": 182164,
        "Title": "Geestemünderstraße 18",
        "AddressLine1": "Geestemünderstraße 18",
        "Town": "Köln ",
        "Postcode": "50735",
        "CountryID": 87,
        "Latitude": 50.998684,
        "Longitude": 6.939453,
        "DistanceUnit": 0
    },
    "Connections": [
        {
            "ID": 286639,
            "ConnectionTypeID": 25,
            "StatusTypeID": 50,
            "LevelID": 2,
            "PowerKW": 22,
            "CurrentTypeID": 20
        },
        {
            "ID": 286640,
            "ConnectionTypeID": 25,
            "StatusTypeID": 50,
            "LevelID": 2,
            "PowerKW": 22,
            "CurrentTypeID": 20
        }
    ],
    "StatusTypeID": 50,
    "DateLastStatusUpdate": "2021-07-12T02:46:00Z",
    "MetadataValues": [
        {
            "ID": 14099,
            "MetadataFieldID": 4,
            "ItemValue": "Data from the German chargepoint registry provided by Bundesnetzagentur.de under the CC-BY 4.0 license"
        }
    ],
    "DataQualityLevel": 3,
    "DateCreated": "2021-07-08T10:02:00Z",
    "SubmissionStatusTypeID": 100
}