{
    "UserComments": [
        {
            "ID": 24861,
            "ChargePointID": 189253,
            "CommentTypeID": 10,
            "UserName": "Carlomanda",
            "Comment": "",
            "Rating": 4,
            "DateCreated": "2021-09-17T11:42:36.307Z",
            "User": {
                "ID": 30566,
                "Username": "Carlomanda"
            },
            "CheckinStatusTypeID": 10,
            "IsActionedByEditor": false
        }
    ],
    "IsRecentlyVerified": true,
    "DateLastVerified": "2021-09-16T22:08:00Z",
    "ID": 189253,
    "UUID": "04493B5D-CBFE-42DD-8547-850F38BE5BBB",
    "DataProviderID": 1,
    "OperatorID": 3330,
    "UsageTypeID": 6,
    "UsageCost": "Free for customers only",
    "AddressInfo": {
        "ID": 189612,
        "Title": "Hotel Le Grotte",
        "AddressLine1": "Frazione Pontebovesecco",
        "Town": "Genga (AN)",
        "CountryID": 112,
        "Latitude": 43.4075798874822,
        "Longitude": 12.930527302513724,
        "ContactTelephone1": "+390732972065",
        "RelatedURL": "http://www.hotellegrotte.it",
        "DistanceUnit": 0
    },
    "Connections": [
        {
            "ID": 306024,
            "ConnectionTypeID": 25,
            "StatusTypeID": 50,
            "LevelID": 2,
            "Amps": 16,
            "Voltage": 220,
            "PowerKW": 3,
            "CurrentTypeID": 10,
            "Quantity": 2
        }
    ],
    "NumberOfPoints": 1,
    "StatusTypeID": 50,
    "DateLastStatusUpdate": "2021-09-17T11:43:00Z",
    "DataQualityLevel": 1,
    "DateCreated": "2021-09-16T22:08:00Z",
    "SubmissionStatusTypeID": 200
}