{
    "IsRecentlyVerified": false,
    "ID": 89789,
    "UUID": "EA8BBEAF-D6CB-477F-B682-1B10F6D8799E",
    "DataProviderID": 2,
    "DataProvidersReference": "82604",
    "OperatorID": 5,
    "UsageTypeID": 1,
    "AddressInfo": {
        "ID": 90135,
        "Title": "SOFI LAKE OSWEG",
        "AddressLine1": "15000 Davis Ln",
        "Town": "Lake Oswego",
        "StateOrProvince": "OR",
        "Postcode": "97035",
        "CountryID": 2,
        "Latitude": 45.4189601,
        "Longitude": -122.7150932,
        "ContactTelephone1": "888-758-4389",
        "AccessComments": "24 hours daily",
        "RelatedURL": "http://www.chargepoint.com/",
        "DistanceUnit": 0
    },
    "Connections": [
        {
            "ID": 127235,
            "ConnectionTypeID": 1,
            "LevelID": 2,
            "Amps": 16,
            "Voltage": 230,
            "PowerKW": 3.7,
            "CurrentTypeID": 10,
            "Quantity": 2
        }
    ],
    "DateLastStatusUpdate": "2020-06-26T03:09:00Z",
    "DataQualityLevel": 3,
    "DateCreated": "2017-06-22T08:16:00Z",
    "SubmissionStatusTypeID": 100
}