{
    "IsRecentlyVerified": false,
    "ID": 129732,
    "UUID": "451CEDA3-094A-451B-81C5-889018D7A276",
    "DataProviderID": 1,
    "OperatorID": 80,
    "UsageTypeID": 4,
    "AddressInfo": {
        "ID": 130078,
        "Title": "Civitavecchia D'Ardia | EnelX",
        "AddressLine1": "Largo Monsignor Giacomo D'Ardia",
        "Town": "Civitavecchia",
        "StateOrProvince": "RM",
        "Postcode": "00053",
        "CountryID": 112,
        "Latitude": 42.09342951189541,
        "Longitude": 11.796916505702143,
        "ContactTelephone1": "800.069.850",
        "RelatedURL": "https://www.enelx.com/it/it/emobility",
        "DistanceUnit": 0
    },
    "Connections": [
        {
            "ID": 181599,
            "ConnectionTypeID": 25,
            "StatusTypeID": 50,
            "LevelID": 2,
            "Amps": 32,
            "Voltage": 400,
            "PowerKW": 22,
            "CurrentTypeID": 20,
            "Quantity": 1
        },
        {
            "ID": 181600,
            "ConnectionTypeID": 36,
            "StatusTypeID": 50,
            "LevelID": 2,
            "Amps": 16,
            "Voltage": 240,
            "PowerKW": 3.7,
            "CurrentTypeID": 10,
            "Quantity": 1
        }
    ],
    "NumberOfPoints": 2,
    "StatusTypeID": 50,
    "DateLastStatusUpdate": "2019-07-24T15:45:00Z",
    "DataQualityLevel": 1,
    "DateCreated": "2019-07-24T15:45:00Z",
    "SubmissionStatusTypeID": 200
}