{
    "IsRecentlyVerified": false,
    "ID": 91849,
    "UUID": "7109A087-C5F6-4687-ACB0-42BDFC72F66A",
    "DataProviderID": 1,
    "OperatorID": 23,
    "OperatorsReference": "32838",
    "UsageTypeID": 4,
    "AddressInfo": {
        "ID": 92195,
        "Title": "Wasserhund Brewing Company",
        "AddressLine1": "1805 Laskin RD",
        "Town": "Virginia Beach",
        "StateOrProvince": "Virginia",
        "Postcode": "23454",
        "CountryID": 2,
        "Latitude": 36.848934,
        "Longitude": -76.027545,
        "ContactTelephone1": "(757) 351-1326",
        "DistanceUnit": 0
    },
    "Connections": [
        {
            "ID": 130198,
            "ConnectionTypeID": 30,
            "StatusTypeID": 50,
            "LevelID": 2,
            "PowerKW": 16,
            "CurrentTypeID": 20,
            "Quantity": 2
        }
    ],
    "NumberOfPoints": 3,
    "GeneralComments": "3 Tesla Connectors, up to 16kW.Available for customers. Self park.",
    "StatusTypeID": 50,
    "DateLastStatusUpdate": "2017-08-26T05:34:00Z",
    "DataQualityLevel": 1,
    "DateCreated": "2017-08-18T07:46:00Z",
    "SubmissionStatusTypeID": 200
}