{
    "IsRecentlyVerified": false,
    "ID": 14692,
    "UUID": "C57531EE-BE0A-431E-9DF8-E18C84434364",
    "DataProviderID": 2,
    "DataProvidersReference": "49779",
    "UsageTypeID": 1,
    "AddressInfo": {
        "ID": 14589,
        "Title": "American Public University",
        "AddressLine1": "393 N Lawrence St",
        "Town": "Charles Town",
        "StateOrProvince": "WV",
        "Postcode": "25414",
        "CountryID": 2,
        "Latitude": 39.290455,
        "Longitude": -77.863391,
        "ContactTelephone1": "703-268-1143",
        "AccessComments": "24 hours daily",
        "RelatedURL": "",
        "DistanceUnit": 0
    },
    "Connections": [
        {
            "ID": 12191,
            "ConnectionTypeID": 1,
            "LevelID": 2,
            "Amps": 16,
            "Voltage": 230,
            "PowerKW": 3.7,
            "CurrentTypeID": 10,
            "Quantity": 14
        },
        {
            "ID": 21956,
            "ConnectionTypeID": 1,
            "LevelID": 2,
            "Quantity": 14
        }
    ],
    "DateLastStatusUpdate": "2020-06-26T03:01:00Z",
    "DataQualityLevel": 3,
    "DateCreated": "2012-12-06T16:50:00Z",
    "SubmissionStatusTypeID": 100
}