{
    "IsRecentlyVerified": false,
    "ID": 161738,
    "UUID": "1E73BA1E-F1AC-456A-99D7-1E41C44D45B9",
    "DataProviderID": 1,
    "OperatorID": 63,
    "UsageTypeID": 5,
    "AddressInfo": {
        "ID": 162095,
        "Title": "Hankar",
        "AddressLine1": "Waversesteenweg",
        "StateOrProvince": "Brussels-Capital",
        "Postcode": "1160",
        "CountryID": 26,
        "Latitude": 50.821724,
        "Longitude": 4.405767,
        "RelatedURL": "https://www.charge.brussels/",
        "DistanceUnit": 0
    },
    "Connections": [
        {
            "ID": 232731,
            "ConnectionTypeID": 25,
            "StatusTypeID": 50,
            "LevelID": 2,
            "PowerKW": 22,
            "CurrentTypeID": 20
        }
    ],
    "NumberOfPoints": 2,
    "GeneralComments": "22kW regional charging station.",
    "StatusTypeID": 50,
    "DateLastStatusUpdate": "2020-07-23T07:42:00Z",
    "DataQualityLevel": 1,
    "DateCreated": "2020-07-22T20:00:00Z",
    "SubmissionStatusTypeID": 200
}