{
    "IsRecentlyVerified": false,
    "ID": 173215,
    "UUID": "D82293CC-6CE8-4CAF-95A1-C1FE66396548",
    "DataProviderID": 19,
    "DataProvidersReference": "7324",
    "AddressInfo": {
        "ID": 173574,
        "Title": "Ospene 1",
        "AddressLine1": "Ospene 1",
        "Town": "SKEI I JØLSTER",
        "StateOrProvince": "Vestland",
        "Postcode": "6843",
        "CountryID": 168,
        "Latitude": 61.56944,
        "Longitude": 6.48219,
        "AccessComments": "Offentleg parkeringsplass nedanfor kommunehuset på Skei.",
        "DistanceUnit": 0
    },
    "Connections": [
        {
            "ID": 265915,
            "ConnectionTypeID": 25,
            "Reference": "1",
            "LevelID": 2,
            "Amps": 32,
            "Voltage": 230,
            "PowerKW": 7.4,
            "CurrentTypeID": 10
        },
        {
            "ID": 265916,
            "ConnectionTypeID": 25,
            "Reference": "2",
            "LevelID": 2,
            "Amps": 32,
            "Voltage": 230,
            "PowerKW": 7.4,
            "CurrentTypeID": 10
        },
        {
            "ID": 265917,
            "ConnectionTypeID": 25,
            "Reference": "3",
            "LevelID": 2,
            "Amps": 32,
            "Voltage": 230,
            "PowerKW": 7.4,
            "CurrentTypeID": 10
        },
        {
            "ID": 265918,
            "ConnectionTypeID": 25,
            "Reference": "4",
            "LevelID": 2,
            "Amps": 32,
            "Voltage": 230,
            "PowerKW": 7.4,
            "CurrentTypeID": 10
        },
        {
            "ID": 265919,
            "ConnectionTypeID": 25,
            "Reference": "5",
            "LevelID": 2,
            "Amps": 32,
            "Voltage": 230,
            "PowerKW": 7.4,
            "CurrentTypeID": 10
        },
        {
            "ID": 265920,
            "ConnectionTypeID": 25,
            "Reference": "6",
            "LevelID": 2,
            "Amps": 32,
            "Voltage": 230,
            "PowerKW": 7.4,
            "CurrentTypeID": 10
        }
    ],
    "NumberOfPoints": 6,
    "StatusTypeID": 0,
    "DateLastStatusUpdate": "2021-03-24T05:12:00Z",
    "DataQualityLevel": 2,
    "DateCreated": "2021-03-03T09:02:00Z",
    "SubmissionStatusTypeID": 100
}