{
    "UserComments": [
        {
            "ID": 11594,
            "ChargePointID": 68501,
            "CommentTypeID": 10,
            "UserName": "Someone_Just_",
            "Comment": "Powered by the sun, great. But only 300 watt for 1 hour ?",
            "Rating": 3,
            "DateCreated": "2016-06-09T21:05:04.737Z",
            "User": {
                "ID": 1107,
                "Username": "Someone_Just_"
            },
            "CheckinStatusTypeID": 140
        }
    ],
    "MediaItems": [
        {
            "ID": 6592,
            "ChargePointID": 68501,
            "ItemURL": "https://s3-ap-southeast-2.amazonaws.com/openchargemap/images/NL/OCM68501/OCM-68501.orig.2016060921021949.jpg",
            "ItemThumbnailURL": "https://s3-ap-southeast-2.amazonaws.com/openchargemap/images/NL/OCM68501/OCM-68501.thmb.2016060921021949.jpg",
            "Comment": "",
            "IsEnabled": true,
            "IsVideo": false,
            "IsFeaturedItem": false,
            "IsExternalResource": false,
            "User": {
                "ID": 1107,
                "Username": "Someone_Just_"
            },
            "DateCreated": "2016-06-09T21:03:00Z"
        },
        {
            "ID": 6591,
            "ChargePointID": 68501,
            "ItemURL": "https://s3-ap-southeast-2.amazonaws.com/openchargemap/images/NL/OCM68501/OCM-68501.orig.2016060921010310.jpg",
            "ItemThumbnailURL": "https://s3-ap-southeast-2.amazonaws.com/openchargemap/images/NL/OCM68501/OCM-68501.thmb.2016060921010310.jpg",
            "Comment": "",
            "IsEnabled": true,
            "IsVideo": false,
            "IsFeaturedItem": false,
            "IsExternalResource": false,
            "User": {
                "ID": 1107,
                "Username": "Someone_Just_"
            },
            "DateCreated": "2016-06-09T21:01:00Z"
        }
    ],
    "IsRecentlyVerified": false,
    "ID": 68501,
    "UUID": "A89B2278-90D4-4187-85CB-8348302EFBA0",
    "DataProviderID": 1,
    "OperatorID": 45,
    "UsageTypeID": 1,
    "UsageCost": "Gratis",
    "AddressInfo": {
        "ID": 68847,
        "Title": "McDonalds Bergen op Zoom",
        "AddressLine1": "De Boulevard Noord 8",
        "Town": "Bergen op Zoom",
        "Postcode": "4617 HD",
        "CountryID": 159,
        "Latitude": 51.48669049630196,
        "Longitude": 4.278136709717515,
        "RelatedURL": "http://www.mcdonaldsrestaurant.nl/bergen-op-zoom-binnenschelde/",
        "DistanceUnit": 0
    },
    "Connections": [
        {
            "ID": 95811,
            "ConnectionTypeID": 28,
            "StatusTypeID": 50,
            "LevelID": 1,
            "Voltage": 240,
            "PowerKW": 0.3,
            "CurrentTypeID": 10,
            "Quantity": 4
        }
    ],
    "NumberOfPoints": 1,
    "GeneralComments": "Powered by the sun but max 1 hour and max 300 w.",
    "StatusTypeID": 50,
    "DateLastStatusUpdate": "2016-06-09T21:05:00Z",
    "DataQualityLevel": 1,
    "DateCreated": "2016-06-09T20:59:00Z",
    "SubmissionStatusTypeID": 200
}