{
    "IsRecentlyVerified": false,
    "ID": 70659,
    "UUID": "1ADD82F5-E1B0-41F2-81C3-F40665DC54D4",
    "DataProviderID": 1,
    "OperatorID": 45,
    "UsageTypeID": 1,
    "AddressInfo": {
        "ID": 71005,
        "Title": "Ingenieurbüro Manfred Lührs 8.2emotion",
        "AddressLine1": "Querstraße 2",
        "Town": "Süderdeich",
        "StateOrProvince": "Kreis Dithmarschen",
        "Postcode": "25764",
        "CountryID": 87,
        "Latitude": 54.19946729999999,
        "Longitude": 8.91112529999998,
        "ContactTelephone1": "+49 4833424111",
        "AccessComments": "24/7 nutzbar mit 3 Parkplätzen.",
        "RelatedURL": "http://8p2.de/",
        "DistanceUnit": 0
    },
    "Connections": [
        {
            "ID": 101179,
            "ConnectionTypeID": 2,
            "StatusTypeID": 50,
            "LevelID": 3,
            "PowerKW": 50,
            "CurrentTypeID": 30,
            "Quantity": 1
        },
        {
            "ID": 101180,
            "ConnectionTypeID": 33,
            "StatusTypeID": 50,
            "LevelID": 3,
            "PowerKW": 50,
            "CurrentTypeID": 30,
            "Quantity": 1
        },
        {
            "ID": 101181,
            "ConnectionTypeID": 1036,
            "StatusTypeID": 50,
            "LevelID": 2,
            "Amps": 63,
            "Voltage": 400,
            "PowerKW": 43,
            "CurrentTypeID": 10,
            "Quantity": 1
        },
        {
            "ID": 101182,
            "ConnectionTypeID": 25,
            "StatusTypeID": 50,
            "LevelID": 2,
            "Amps": 32,
            "Voltage": 400,
            "PowerKW": 22,
            "CurrentTypeID": 20,
            "Quantity": 1
        },
        {
            "ID": 101183,
            "ConnectionTypeID": 30,
            "StatusTypeID": 50,
            "LevelID": 2,
            "CurrentTypeID": 30,
            "Quantity": 1
        },
        {
            "ID": 101184,
            "ConnectionTypeID": 28,
            "StatusTypeID": 50,
            "LevelID": 2,
            "Amps": 16,
            "Voltage": 230,
            "PowerKW": 3.7,
            "CurrentTypeID": 10,
            "Quantity": 1
        }
    ],
    "NumberOfPoints": 6,
    "StatusTypeID": 50,
    "DateLastStatusUpdate": "2016-08-01T08:25:00Z",
    "DataQualityLevel": 1,
    "DateCreated": "2016-08-01T08:25:00Z",
    "SubmissionStatusTypeID": 200
}