{
    "IsRecentlyVerified": false,
    "ID": 63030,
    "UUID": "74E6AFF4-B1E9-44F2-A4AD-21999F9C4DA0",
    "DataProviderID": 26,
    "DataProvidersReference": "73918",
    "OperatorID": 73,
    "OperatorsReference": "EV-Box EVB-P1418263",
    "UsageCost": "0.00 jaarabonnement",
    "AddressInfo": {
        "ID": 63376,
        "Title": "Industrieweg 8",
        "AddressLine1": "Industrieweg 8",
        "Town": "Waalwijk",
        "Postcode": "5165 NH",
        "CountryID": 159,
        "Latitude": 51.70286,
        "Longitude": 4.94223,
        "RelatedURL": "http://www.ev-box.nl",
        "DistanceUnit": 0
    },
    "Connections": [
        {
            "ID": 80139,
            "ConnectionTypeID": 25,
            "LevelID": 2,
            "PowerKW": 5,
            "CurrentTypeID": 10
        },
        {
            "ID": 80140,
            "ConnectionTypeID": 25,
            "LevelID": 2,
            "PowerKW": 5,
            "CurrentTypeID": 10
        },
        {
            "ID": 95402,
            "ConnectionTypeID": 25,
            "LevelID": 2,
            "PowerKW": 11,
            "CurrentTypeID": 10
        },
        {
            "ID": 95403,
            "ConnectionTypeID": 25,
            "LevelID": 2,
            "PowerKW": 5,
            "CurrentTypeID": 10
        },
        {
            "ID": 95404,
            "ConnectionTypeID": 25,
            "LevelID": 2,
            "PowerKW": 5,
            "CurrentTypeID": 10
        }
    ],
    "NumberOfPoints": 1,
    "StatusTypeID": 50,
    "DateLastStatusUpdate": "2016-06-04T02:40:00Z",
    "DataQualityLevel": 3,
    "DateCreated": "2016-03-03T12:29:00Z",
    "SubmissionStatusTypeID": 100
}