{
    "UserComments": [
        {
            "ID": 19559,
            "ChargePointID": 42648,
            "CommentTypeID": 10,
            "UserName": "Ian Atkin",
            "Comment": "Free but slow, maximum rate about 17kWh",
            "Rating": 4,
            "DateCreated": "2018-05-15T11:22:01.477Z",
            "User": {
                "ID": 9337,
                "Username": "Ian Atkin"
            },
            "CheckinStatusTypeID": 10
        }
    ],
    "IsRecentlyVerified": false,
    "ID": 42648,
    "UUID": "2088788F-0111-4657-8B13-895731D484BC",
    "DataProviderID": 1,
    "OperatorID": 7,
    "OperatorsReference": "PP-74044,PG-81571",
    "UsageTypeID": 7,
    "UsageCost": "Free",
    "AddressInfo": {
        "ID": 42994,
        "Title": "Chorley Nissan Wigan",
        "AddressLine1": "Pottery Road",
        "Town": "Wigan",
        "StateOrProvince": "Lancashire",
        "Postcode": "WN3 5AA",
        "CountryID": 1,
        "Latitude": 53.5414294975959,
        "Longitude": -2.642662525177,
        "ContactTelephone1": "+44 1942 820233",
        "AccessComments": "Nissan dealer, open dealership hours only. Type 2 AC charge points are Pod-Point units",
        "RelatedURL": "http://www.chorleynissan.co.uk",
        "DistanceUnit": 0
    },
    "Connections": [
        {
            "ID": 51424,
            "ConnectionTypeID": 2,
            "StatusTypeID": 50,
            "LevelID": 3,
            "Amps": 125,
            "Voltage": 400,
            "PowerKW": 50,
            "CurrentTypeID": 30,
            "Quantity": 1
        },
        {
            "ID": 71570,
            "ConnectionTypeID": 25,
            "StatusTypeID": 50,
            "LevelID": 2,
            "Amps": 32,
            "Voltage": 230,
            "PowerKW": 7,
            "CurrentTypeID": 10,
            "Quantity": 2
        }
    ],
    "NumberOfPoints": 2,
    "StatusTypeID": 50,
    "DateLastStatusUpdate": "2018-07-09T10:56:00Z",
    "DataQualityLevel": 1,
    "DateCreated": "2015-03-19T09:10:00Z",
    "SubmissionStatusTypeID": 200
}