{
    "IsRecentlyVerified": false,
    "ID": 90673,
    "UUID": "6D6DE11B-31B0-4485-AE04-F24D8DC1DB35",
    "DataProviderID": 1,
    "OperatorID": 31,
    "UsageTypeID": 1,
    "UsageCost": "Free",
    "AddressInfo": {
        "ID": 91019,
        "Title": "Phenix City Parks and Recreation",
        "AddressLine1": "1450-1598 Airport Rd",
        "Town": "Phenix City",
        "StateOrProvince": "AL",
        "Postcode": "36867",
        "CountryID": 2,
        "Latitude": 32.4990125133909,
        "Longitude": -85.0157743692398,
        "DistanceUnit": 0
    },
    "Connections": [
        {
            "ID": 128395,
            "ConnectionTypeID": 1,
            "StatusTypeID": 50,
            "LevelID": 2,
            "Quantity": 1
        }
    ],
    "NumberOfPoints": 1,
    "StatusTypeID": 50,
    "DateLastStatusUpdate": "2017-07-22T10:19:00Z",
    "DataQualityLevel": 1,
    "DateCreated": "2017-07-21T21:35:00Z",
    "SubmissionStatusTypeID": 200
}