{
    "IsRecentlyVerified": false,
    "ID": 44598,
    "UUID": "42C4D9E0-1E08-43CA-A29A-3110D98CDF9E",
    "DataProviderID": 2,
    "DataProvidersReference": "66736",
    "OperatorID": 5,
    "UsageTypeID": 1,
    "AddressInfo": {
        "ID": 44944,
        "Title": "EVANSTON, IL",
        "AddressLine1": "821 Davis St",
        "Town": "Evanston",
        "StateOrProvince": "IL",
        "Postcode": "60201",
        "CountryID": 2,
        "Latitude": 42.047672,
        "Longitude": -87.682611,
        "ContactTelephone1": "888-758-4389",
        "AccessComments": "24 hours daily",
        "RelatedURL": "http://www.chargepoint.com/",
        "DistanceUnit": 0
    },
    "Connections": [
        {
            "ID": 54780,
            "ConnectionTypeID": 1,
            "LevelID": 2,
            "Amps": 16,
            "Voltage": 230,
            "PowerKW": 3.7,
            "CurrentTypeID": 10,
            "Quantity": 6
        }
    ],
    "DateLastStatusUpdate": "2020-06-26T03:05:00Z",
    "DataQualityLevel": 3,
    "DateCreated": "2015-04-17T12:30:00Z",
    "SubmissionStatusTypeID": 100
}