{
    "IsRecentlyVerified": false,
    "ID": 140676,
    "UUID": "1F77F91B-19E4-48D8-9B6B-D8B810A27404",
    "DataProviderID": 2,
    "DataProvidersReference": "144132",
    "OperatorID": 9,
    "UsageTypeID": 1,
    "AddressInfo": {
        "ID": 141028,
        "Title": "City of Santa Clara",
        "AddressLine1": "1500 Warburton Ave",
        "Town": "Santa Clara",
        "StateOrProvince": "CA",
        "Postcode": "95050",
        "CountryID": 2,
        "Latitude": 37.355154,
        "Longitude": -121.954894,
        "ContactTelephone1": "888-998-2546",
        "AccessComments": "MON: 24 hours | TUE: 24 hours | WED: 24 hours | THU: 24 hours | FRI: 24 hours | SAT: 24 hours | SUN: 24 hours",
        "RelatedURL": "http://www.blinkcharging.com/",
        "DistanceUnit": 0
    },
    "Connections": [
        {
            "ID": 196378,
            "ConnectionTypeID": 1,
            "LevelID": 2,
            "Amps": 16,
            "Voltage": 230,
            "PowerKW": 3.7,
            "CurrentTypeID": 10,
            "Quantity": 4
        }
    ],
    "StatusTypeID": 50,
    "DateLastStatusUpdate": "2020-06-26T02:59:00Z",
    "DataQualityLevel": 3,
    "DateCreated": "2019-12-24T09:13:00Z",
    "SubmissionStatusTypeID": 100
}