{
    "IsRecentlyVerified": false,
    "ID": 166584,
    "UUID": "83DDFAD8-96B8-4685-B50B-8B1DEF8D2F04",
    "DataProviderID": 28,
    "DataProvidersReference": "FR*S28*PSDE28*PIA1",
    "UsageTypeID": 5,
    "AddressInfo": {
        "ID": 166943,
        "Title": "Saint-Piat | Place Vauvillier",
        "AddressLine1": "Place Vauvillier 28130 Saint-Piat",
        "CountryID": 80,
        "Latitude": 48.547447,
        "Longitude": 1.583772,
        "AccessComments": "24/24 7/7",
        "DistanceUnit": 0
    },
    "Connections": [
        {
            "ID": 249693,
            "ConnectionTypeID": 1036,
            "StatusTypeID": 50,
            "LevelID": 2,
            "PowerKW": 22,
            "CurrentTypeID": 20
        },
        {
            "ID": 249694,
            "ConnectionTypeID": 26,
            "StatusTypeID": 50,
            "LevelID": 2,
            "PowerKW": 22
        },
        {
            "ID": 249695,
            "ConnectionTypeID": 28,
            "StatusTypeID": 50,
            "LevelID": 2,
            "PowerKW": 22,
            "CurrentTypeID": 10
        }
    ],
    "GeneralComments": "",
    "StatusTypeID": 50,
    "DateLastStatusUpdate": "2020-08-27T05:15:00Z",
    "DataQualityLevel": 2,
    "DateCreated": "2020-08-27T05:15:00Z",
    "SubmissionStatusTypeID": 100
}