{
    "IsRecentlyVerified": false,
    "ID": 186788,
    "UUID": "3491498D-1F3A-4FCF-A80B-E7A1CFBCFF08",
    "DataProviderID": 29,
    "DataProvidersReference": "12912",
    "AddressInfo": {
        "ID": 187147,
        "Title": "Sophienstr. 5",
        "AddressLine1": "Sophienstr. 5",
        "Town": "Bad Salzuflen",
        "Postcode": "32105",
        "CountryID": 87,
        "Latitude": 52.091186,
        "Longitude": 8.748014,
        "DistanceUnit": 0
    },
    "Connections": [
        {
            "ID": 300167,
            "ConnectionTypeID": 25,
            "StatusTypeID": 50,
            "LevelID": 2,
            "PowerKW": 22,
            "CurrentTypeID": 20
        },
        {
            "ID": 300168,
            "ConnectionTypeID": 25,
            "StatusTypeID": 50,
            "LevelID": 2,
            "PowerKW": 22,
            "CurrentTypeID": 20
        }
    ],
    "StatusTypeID": 50,
    "DateLastStatusUpdate": "2021-07-12T02:48:00Z",
    "MetadataValues": [
        {
            "ID": 19029,
            "MetadataFieldID": 4,
            "ItemValue": "Data from the German chargepoint registry provided by Bundesnetzagentur.de under the CC-BY 4.0 license"
        }
    ],
    "DataQualityLevel": 3,
    "DateCreated": "2021-07-12T02:48:00Z",
    "SubmissionStatusTypeID": 100
}