{
    "IsRecentlyVerified": false,
    "ID": 100357,
    "UUID": "4623B7CB-006C-4A75-963A-D311E99B40E7",
    "DataProviderID": 1,
    "OperatorID": 23,
    "OperatorsReference": "40909",
    "UsageTypeID": 4,
    "AddressInfo": {
        "ID": 100703,
        "Title": "Home2 Suites By Hilton Nashville Franklin",
        "AddressLine1": "107 International DR",
        "Town": "Franklin",
        "StateOrProvince": "Tennessee",
        "Postcode": "37067",
        "CountryID": 2,
        "Latitude": 35.9559429,
        "Longitude": -86.8054694,
        "ContactTelephone1": "(615) 771-8032",
        "DistanceUnit": 0
    },
    "Connections": [
        {
            "ID": 141776,
            "ConnectionTypeID": 30,
            "StatusTypeID": 50,
            "LevelID": 2,
            "PowerKW": 16,
            "CurrentTypeID": 20,
            "Quantity": 6
        }
    ],
    "NumberOfPoints": 6,
    "GeneralComments": "6 Tesla Connectors, up to 16kW.Available for customers. Please see front desk.",
    "StatusTypeID": 50,
    "DateLastStatusUpdate": "2018-02-23T06:51:00Z",
    "DataQualityLevel": 1,
    "DateCreated": "2018-02-23T06:51:00Z",
    "SubmissionStatusTypeID": 200
}