{
    "IsRecentlyVerified": false,
    "ID": 149546,
    "UUID": "45F8EC5D-C909-4329-8E81-F0AF039E3956",
    "DataProviderID": 1,
    "OperatorID": 3266,
    "UsageTypeID": 4,
    "UsageCost": "0,35€/kWh",
    "AddressInfo": {
        "ID": 149899,
        "Title": "Hackethalstraße",
        "AddressLine1": "Hackethalstraße 47A",
        "Town": "Langenhagen",
        "StateOrProvince": "Region Hannover",
        "Postcode": "30851",
        "CountryID": 87,
        "Latitude": 52.42621863147082,
        "Longitude": 9.722186688494162,
        "ContactTelephone1": "+49 511 430 3113",
        "RelatedURL": "http://www.enercity.de/",
        "DistanceUnit": 0
    },
    "Connections": [
        {
            "ID": 207631,
            "ConnectionTypeID": 25,
            "StatusTypeID": 50,
            "LevelID": 2,
            "Amps": 20,
            "Voltage": 230,
            "PowerKW": 4.6,
            "CurrentTypeID": 10,
            "Quantity": 1
        }
    ],
    "NumberOfPoints": 1,
    "GeneralComments": "24/7 verfügbarer Ladepunkt an einer Straßenlaterne. Freischaltung mit PlugSurfing App oder Keyhanger. Betreiber sind die Stadtwerke Hannover Enercity.",
    "StatusTypeID": 50,
    "DateLastStatusUpdate": "2020-02-28T11:59:00Z",
    "DataQualityLevel": 1,
    "DateCreated": "2020-02-28T11:59:00Z",
    "SubmissionStatusTypeID": 200
}