{
    "UserComments": [
        {
            "ID": 14145,
            "ChargePointID": 70677,
            "CommentTypeID": 10,
            "UserName": "Erna_Schleck",
            "Comment": "Twizy mit Typ2 Adapter / 2kW",
            "Rating": 4,
            "DateCreated": "2016-08-25T18:02:50.597Z",
            "User": {
                "ID": 4573,
                "Username": "Erna_Schleck"
            },
            "CheckinStatusTypeID": 10
        }
    ],
    "MediaItems": [
        {
            "ID": 8137,
            "ChargePointID": 70677,
            "ItemURL": "https://s3-ap-southeast-2.amazonaws.com/openchargemap/images/DE/OCM70677/OCM-70677.orig.2016082518022309.jpg",
            "ItemThumbnailURL": "https://s3-ap-southeast-2.amazonaws.com/openchargemap/images/DE/OCM70677/OCM-70677.thmb.2016082518022309.jpg",
            "Comment": "",
            "IsEnabled": true,
            "IsVideo": false,
            "IsFeaturedItem": false,
            "IsExternalResource": false,
            "User": {
                "ID": 4573,
                "Username": "Erna_Schleck"
            },
            "DateCreated": "2016-08-25T18:03:00Z"
        },
        {
            "ID": 8136,
            "ChargePointID": 70677,
            "ItemURL": "https://s3-ap-southeast-2.amazonaws.com/openchargemap/images/DE/OCM70677/OCM-70677.orig.2016082518020820.jpg",
            "ItemThumbnailURL": "https://s3-ap-southeast-2.amazonaws.com/openchargemap/images/DE/OCM70677/OCM-70677.thmb.2016082518020820.jpg",
            "Comment": "Einfahrt stadteinwärts vor Öz Urfa Grill. Lolo Wallbox an der Gebäudeecke.",
            "IsEnabled": true,
            "IsVideo": false,
            "IsFeaturedItem": false,
            "IsExternalResource": false,
            "User": {
                "ID": 4573,
                "Username": "Erna_Schleck"
            },
            "DateCreated": "2016-08-25T18:02:00Z"
        }
    ],
    "IsRecentlyVerified": false,
    "ID": 70677,
    "UUID": "8E17FCE5-A305-4DA5-8532-145426978792",
    "DataProviderID": 1,
    "OperatorID": 156,
    "UsageTypeID": 4,
    "UsageCost": "",
    "AddressInfo": {
        "ID": 71023,
        "Title": "Eggers Bestattungen",
        "AddressLine1": "Walsroder Straße 30c",
        "AddressLine2": "Brink",
        "Town": "Langenhagen",
        "StateOrProvince": "Region Hannover",
        "Postcode": "30851",
        "CountryID": 87,
        "Latitude": 52.43451,
        "Longitude": 9.731400699999995,
        "ContactTelephone1": "+49 511 77 54 59",
        "ContactTelephone2": "",
        "ContactEmail": "",
        "AccessComments": "Neben dem auffälligen Öz Urfa Grill befindet sich die Trauerhalle des Betattungsinstituts Eggers. Ein Logo mit Pfeil ist an der Hauswand. Die Einfahrt reinfahren, genau auf der Ecke ist die The New Motion Wallbox  mit Typ2 Anschluss, die mit einer The New Motion Karte aktiviert werden kann. 24/7 verfügbar, aber kein reservierter Parkplatz. Kleine Autos (Twizy/Smart) können auf der Ecke parken..",
        "RelatedURL": "http://www.eggers-bestattungen.de/",
        "DistanceUnit": 0
    },
    "Connections": [
        {
            "ID": 101206,
            "ConnectionTypeID": 25,
            "StatusTypeID": 50,
            "LevelID": 2,
            "Amps": 32,
            "Voltage": 400,
            "PowerKW": 22,
            "CurrentTypeID": 20,
            "Quantity": 1
        }
    ],
    "NumberOfPoints": 1,
    "GeneralComments": "",
    "StatusTypeID": 50,
    "DateLastStatusUpdate": "2016-08-25T18:04:00Z",
    "DataQualityLevel": 1,
    "DateCreated": "2016-08-02T06:50:00Z",
    "SubmissionStatusTypeID": 200
}