{
    "UserComments": [
        {
            "ID": 22126,
            "ChargePointID": 148730,
            "CommentTypeID": 10,
            "UserName": "Someone_Just_",
            "Rating": 4,
            "DateCreated": "2020-02-09T19:12:34.663Z",
            "User": {
                "ID": 1107,
                "Username": "Someone_Just_"
            },
            "CheckinStatusTypeID": 140,
            "IsActionedByEditor": false
        }
    ],
    "MediaItems": [
        {
            "ID": 21202,
            "ChargePointID": 148730,
            "ItemURL": "https://s3-ap-southeast-2.amazonaws.com/openchargemap/images/BE/OCM148730/OCM-148730.orig.2020020919111617.jpg",
            "ItemThumbnailURL": "https://s3-ap-southeast-2.amazonaws.com/openchargemap/images/BE/OCM148730/OCM-148730.thmb.2020020919111617.jpg",
            "Comment": "2 places for cars",
            "IsEnabled": true,
            "IsVideo": false,
            "IsFeaturedItem": false,
            "IsExternalResource": false,
            "User": {
                "ID": 1107,
                "Username": "Someone_Just_"
            },
            "DateCreated": "2020-02-09T19:11:00Z"
        }
    ],
    "IsRecentlyVerified": false,
    "ID": 148730,
    "UUID": "A2CDA381-9845-4CC7-BDEA-D1B79913A3F8",
    "DataProviderID": 1,
    "OperatorID": 36,
    "UsageTypeID": 1,
    "AddressInfo": {
        "ID": 149082,
        "Title": "Rustoordlei kerk Brasschaat",
        "AddressLine1": "Rustoordlei ",
        "Town": "Brasschaat",
        "Postcode": "2930",
        "CountryID": 26,
        "Latitude": 51.3016940168373,
        "Longitude": 4.4710013839489875,
        "DistanceUnit": 0
    },
    "Connections": [
        {
            "ID": 206519,
            "ConnectionTypeID": 25,
            "StatusTypeID": 50,
            "LevelID": 2,
            "PowerKW": 22,
            "CurrentTypeID": 20,
            "Quantity": 2
        }
    ],
    "NumberOfPoints": 1,
    "StatusTypeID": 50,
    "DateLastStatusUpdate": "2020-02-09T20:46:00Z",
    "DataQualityLevel": 1,
    "DateCreated": "2020-02-09T19:10:00Z",
    "SubmissionStatusTypeID": 200
}