{
    "IsRecentlyVerified": false,
    "ID": 124178,
    "UUID": "3BD91CB7-0F7B-40AC-8606-C102D44A6193",
    "DataProviderID": 2,
    "DataProvidersReference": "117070",
    "OperatorID": 5,
    "UsageTypeID": 1,
    "AddressInfo": {
        "ID": 124524,
        "Title": "ALAMEDA",
        "AddressLine1": "585 7th St",
        "Town": "Oakland",
        "StateOrProvince": "CA",
        "Postcode": "94607",
        "CountryID": 2,
        "Latitude": 37.800716,
        "Longitude": -122.277412,
        "ContactTelephone1": "888-758-4389",
        "AccessComments": "24 hours daily",
        "RelatedURL": "http://www.chargepoint.com/",
        "DistanceUnit": 0
    },
    "Connections": [
        {
            "ID": 174244,
            "ConnectionTypeID": 1,
            "LevelID": 2,
            "Amps": 16,
            "Voltage": 230,
            "PowerKW": 3,
            "CurrentTypeID": 10,
            "Quantity": 6
        }
    ],
    "DateLastStatusUpdate": "2019-12-24T09:14:00Z",
    "DataQualityLevel": 3,
    "DateCreated": "2019-04-06T05:03:00Z",
    "SubmissionStatusTypeID": 100
}