{
    "IsRecentlyVerified": false,
    "ID": 68207,
    "UUID": "4A74C374-2927-408F-AAC1-BCC5436454E5",
    "DataProviderID": 26,
    "DataProvidersReference": "90849",
    "OperatorID": 177,
    "OperatorsReference": "Nuon EVB-P1552301",
    "UsageCost": "0.00 jaarabonnement",
    "AddressInfo": {
        "ID": 68553,
        "Title": "Langswater 268",
        "AddressLine1": "Langswater 268",
        "Town": "Amsterdam",
        "Postcode": "1069 EC",
        "CountryID": 159,
        "Latitude": 52.355501,
        "Longitude": 4.789584,
        "RelatedURL": "http://www.nuon.nl/ev",
        "DistanceUnit": 0
    },
    "Connections": [
        {
            "ID": 95055,
            "ConnectionTypeID": 25,
            "LevelID": 2,
            "PowerKW": 11,
            "CurrentTypeID": 10
        },
        {
            "ID": 95056,
            "ConnectionTypeID": 25,
            "LevelID": 2,
            "PowerKW": 11,
            "CurrentTypeID": 10
        }
    ],
    "NumberOfPoints": 1,
    "StatusTypeID": 50,
    "DateLastStatusUpdate": "2016-06-04T02:37:00Z",
    "DataQualityLevel": 3,
    "DateCreated": "2016-06-04T02:37:00Z",
    "SubmissionStatusTypeID": 100
}