{
    "IsRecentlyVerified": false,
    "ID": 188400,
    "UUID": "1EFB8E70-D00A-4A8C-A899-54887F0C1BE5",
    "DataProviderID": 1,
    "OperatorID": 3460,
    "UsageTypeID": 4,
    "AddressInfo": {
        "ID": 188759,
        "Title": "MG Hang Dong",
        "AddressLine1": "",
        "Town": "Chiang Mai",
        "StateOrProvince": "Chiang Mai",
        "CountryID": 222,
        "Latitude": 18.744383256688266,
        "Longitude": 98.97711094293481,
        "DistanceUnit": 0
    },
    "Connections": [
        {
            "ID": 304193,
            "ConnectionTypeID": 33,
            "StatusTypeID": 50,
            "LevelID": 3,
            "PowerKW": 50,
            "CurrentTypeID": 30,
            "Quantity": 1
        }
    ],
    "NumberOfPoints": 1,
    "StatusTypeID": 50,
    "DateLastStatusUpdate": "2021-07-22T09:04:00Z",
    "DataQualityLevel": 1,
    "DateCreated": "2021-07-22T08:33:00Z",
    "SubmissionStatusTypeID": 200
}