{
    "IsRecentlyVerified": false,
    "ID": 40719,
    "UUID": "57164520-6AE0-4538-ACE7-4CC55819CEC9",
    "DataProviderID": 1,
    "OperatorID": 82,
    "UsageTypeID": 2,
    "UsageCost": "for hotelguests only",
    "AddressInfo": {
        "ID": 41065,
        "Title": "Hotel Arkadia  ***S",
        "AddressLine1": "strada Burjé",
        "Town": "Corvara in Badia",
        "StateOrProvince": "Bolzano",
        "Postcode": "39033",
        "CountryID": 112,
        "Latitude": 46.5478228228495,
        "Longitude": 11.8725299835205,
        "ContactTelephone1": "0039-0471-836043",
        "ContactEmail": "info@hotelarkadia.it",
        "RelatedURL": "http://www.hotelarkadia.it",
        "DistanceUnit": 0
    },
    "Connections": [],
    "NumberOfPoints": 1,
    "StatusTypeID": 50,
    "DateLastStatusUpdate": "2015-01-12T14:00:00Z",
    "DataQualityLevel": 1,
    "DateCreated": "2015-01-03T23:06:00Z",
    "SubmissionStatusTypeID": 200
}