{
    "IsRecentlyVerified": false,
    "ID": 45597,
    "UUID": "CBE342D9-9BE9-48EE-9F92-C2F2385934F0",
    "DataProviderID": 1,
    "DataProvidersReference": "2767",
    "AddressInfo": {
        "ID": 45943,
        "Title": "Olofströmshus AB",
        "AddressLine1": "Nedre Brogatan 1",
        "Town": "OLOFSTRÖM",
        "StateOrProvince": "BLEKINGE",
        "Postcode": "29331",
        "CountryID": 216,
        "Latitude": 56.27822,
        "Longitude": 14.53061,
        "AccessComments": "På parkering framför hyreshus mellan Nedre Brogatans bro över ån och trafikljus i korsningen mot Östra Storgatan. Stolpen är ceriserosa.",
        "DistanceUnit": 0
    },
    "Connections": [
        {
            "ID": 56260,
            "ConnectionTypeID": 0,
            "Reference": "1",
            "LevelID": 2,
            "Amps": 32,
            "Voltage": 400,
            "PowerKW": 22,
            "Comments": "Mode 3"
        },
        {
            "ID": 87777,
            "ConnectionTypeID": 0,
            "Reference": "2",
            "LevelID": 2,
            "Amps": 32,
            "Voltage": 400,
            "PowerKW": 22,
            "Comments": "Mode 3"
        }
    ],
    "NumberOfPoints": 2,
    "DateLastStatusUpdate": "2020-05-26T08:21:00Z",
    "DataQualityLevel": 2,
    "DateCreated": "2015-05-03T00:54:00Z",
    "SubmissionStatusTypeID": 100
}