{
    "IsRecentlyVerified": false,
    "ID": 35191,
    "UUID": "D5F52B5A-202E-44D9-ADEC-73961732659C",
    "DataProviderID": 26,
    "DataProvidersReference": "46098",
    "OperatorID": 73,
    "OperatorsReference": "EV-Box EVB-P1350065",
    "UsageCost": "0.00 jaarabonnement",
    "AddressInfo": {
        "ID": 35537,
        "Title": "Groenelaan 39",
        "AddressLine1": "Groenelaan 39",
        "Town": "Westland",
        "Postcode": "2675 BT",
        "CountryID": 159,
        "Latitude": 52.01119,
        "Longitude": 4.22205,
        "RelatedURL": "http://www.ev-box.nl",
        "DistanceUnit": 0
    },
    "Connections": [
        {
            "ID": 38702,
            "ConnectionTypeID": 25,
            "LevelID": 2,
            "PowerKW": 5,
            "CurrentTypeID": 10
        }
    ],
    "NumberOfPoints": 1,
    "StatusTypeID": 50,
    "DateLastStatusUpdate": "2016-06-04T02:44:00Z",
    "DataQualityLevel": 3,
    "DateCreated": "2015-01-09T06:04:00Z",
    "SubmissionStatusTypeID": 100
}