{
    "IsRecentlyVerified": false,
    "ID": 128791,
    "UUID": "4263D906-2220-41FD-95ED-747F346E3E94",
    "DataProviderID": 1,
    "OperatorID": 1,
    "UsageTypeID": 1,
    "UsageCost": "$.15/hour + $.18/kWh + parking meter",
    "AddressInfo": {
        "ID": 129137,
        "Title": "Public lot 5, dual head leveling 2 charging station",
        "AddressLine1": "84 Bishop Allen Drive",
        "Town": "Cambridge",
        "StateOrProvince": "massachusetts",
        "Postcode": "02139",
        "CountryID": 2,
        "Latitude": 42.3654667644299,
        "Longitude": -71.101856245888,
        "ContactTelephone1": "617-349-4604",
        "ContactEmail": "bcooke@cambridgema.gov",
        "AccessComments": "Paying at parking meter still required. 4 hour time limit from 8am-6pm. 2 hour time limit 6pm-10pm.",
        "RelatedURL": "https://www.cambridgema.gov/cdd/transportation/programs/currentprograms/electricvehicles",
        "DistanceUnit": 0
    },
    "Connections": [
        {
            "ID": 180187,
            "ConnectionTypeID": 1,
            "StatusTypeID": 50,
            "LevelID": 2,
            "Amps": 32,
            "Voltage": 240,
            "PowerKW": 7.2,
            "CurrentTypeID": 10,
            "Quantity": 2
        }
    ],
    "NumberOfPoints": 2,
    "StatusTypeID": 50,
    "DateLastStatusUpdate": "2019-07-01T04:59:00Z",
    "DataQualityLevel": 1,
    "DateCreated": "2019-06-27T18:07:00Z",
    "SubmissionStatusTypeID": 200
}