{
    "IsRecentlyVerified": false,
    "ID": 121214,
    "UUID": "43BD2BFB-1C62-41A8-940B-208F4172FD06",
    "DataProviderID": 2,
    "DataProvidersReference": "118737",
    "UsageTypeID": 1,
    "AddressInfo": {
        "ID": 121560,
        "Title": "University of Dayton - Fitz Hall",
        "AddressLine1": "1529 Brown St",
        "Town": "Dayton",
        "StateOrProvince": "OH",
        "Postcode": "45409",
        "CountryID": 2,
        "Latitude": 39.738423,
        "Longitude": -84.183588,
        "ContactTelephone1": "937-229-2128",
        "AccessComments": "24 hours daily; must have parking permit",
        "RelatedURL": "",
        "DistanceUnit": 0
    },
    "Connections": [
        {
            "ID": 170654,
            "ConnectionTypeID": 1,
            "LevelID": 2,
            "Amps": 16,
            "Voltage": 230,
            "PowerKW": 3.7,
            "CurrentTypeID": 10,
            "Quantity": 2
        }
    ],
    "DateLastStatusUpdate": "2020-06-26T03:02:00Z",
    "DataQualityLevel": 3,
    "DateCreated": "2019-04-01T05:00:00Z",
    "SubmissionStatusTypeID": 100
}