{
    "MediaItems": [
        {
            "ID": 19413,
            "ChargePointID": 131221,
            "ItemURL": "https://s3-ap-southeast-2.amazonaws.com/openchargemap/images/US/OCM131221/OCM-131221.orig.2019083102080077.jpg",
            "ItemThumbnailURL": "https://s3-ap-southeast-2.amazonaws.com/openchargemap/images/US/OCM131221/OCM-131221.thmb.2019083102080077.jpg",
            "Comment": "",
            "IsEnabled": true,
            "IsVideo": false,
            "IsFeaturedItem": false,
            "IsExternalResource": false,
            "User": {
                "ID": 22109,
                "Username": "Nestor2k"
            },
            "DateCreated": "2019-08-31T02:08:00Z"
        },
        {
            "ID": 19414,
            "ChargePointID": 131221,
            "ItemURL": "https://s3-ap-southeast-2.amazonaws.com/openchargemap/images/US/OCM131221/OCM-131221.orig.2019083102081080.jpg",
            "ItemThumbnailURL": "https://s3-ap-southeast-2.amazonaws.com/openchargemap/images/US/OCM131221/OCM-131221.thmb.2019083102081080.jpg",
            "Comment": "",
            "IsEnabled": true,
            "IsVideo": false,
            "IsFeaturedItem": false,
            "IsExternalResource": false,
            "User": {
                "ID": 22109,
                "Username": "Nestor2k"
            },
            "DateCreated": "2019-08-31T02:08:00Z"
        }
    ],
    "IsRecentlyVerified": false,
    "ID": 131221,
    "UUID": "D1D2A5DE-1301-4354-AC0F-8591A5F212B2",
    "DataProviderID": 1,
    "UsageTypeID": 1,
    "UsageCost": "Free",
    "AddressInfo": {
        "ID": 131567,
        "Title": "Downtown Rock Springs",
        "AddressLine1": "South Main Street",
        "Town": "Rock Springs",
        "StateOrProvince": "Wyoming",
        "Postcode": "82901",
        "CountryID": 2,
        "Latitude": 41.5872686278496,
        "Longitude": -109.219004429265,
        "ContactTelephone1": "307-352-1434",
        "ContactEmail": "info@downtownrs.com",
        "AccessComments": "Free charging while you dine, shop, and tour historical Downtown Rock Springs. \r\n\r\nElectricity provides by the City of Rock Springs. Please consider donating to downtown for future development and beautification projects.",
        "RelatedURL": "https://www.downtownrs.com/about",
        "DistanceUnit": 0
    },
    "Connections": [
        {
            "ID": 183746,
            "ConnectionTypeID": 1,
            "StatusTypeID": 50,
            "LevelID": 2,
            "Amps": 32,
            "Voltage": 240,
            "PowerKW": 7.7,
            "CurrentTypeID": 10,
            "Quantity": 2
        }
    ],
    "NumberOfPoints": 2,
    "GeneralComments": "7.7kW shared between two J1772 plugs.",
    "StatusTypeID": 50,
    "DateLastStatusUpdate": "2019-08-31T09:40:00Z",
    "DataQualityLevel": 1,
    "DateCreated": "2019-08-31T02:08:00Z",
    "SubmissionStatusTypeID": 200
}