{
    "IsRecentlyVerified": false,
    "ID": 89275,
    "UUID": "192BD305-D016-4D09-826E-FAB12C3F6C93",
    "DataProviderID": 2,
    "DataProvidersReference": "81130",
    "UsageTypeID": 2,
    "AddressInfo": {
        "ID": 89621,
        "Title": "Los Angeles Police Department - Main Street Parking",
        "AddressLine1": "260 S Main St",
        "Town": "Los Angeles",
        "StateOrProvince": "CA",
        "Postcode": "90012",
        "CountryID": 2,
        "Latitude": 34.0497723610577,
        "Longitude": -118.245105779098,
        "ContactTelephone1": "",
        "AccessComments": "LAPD fleet use only",
        "RelatedURL": "",
        "DistanceUnit": 0
    },
    "Connections": [
        {
            "ID": 126652,
            "ConnectionTypeID": 1,
            "LevelID": 2,
            "Amps": 16,
            "Voltage": 230,
            "PowerKW": 3,
            "CurrentTypeID": 10,
            "Quantity": 100
        },
        {
            "ID": 126653,
            "ConnectionTypeID": 2,
            "LevelID": 2,
            "Amps": 100,
            "Voltage": 400,
            "PowerKW": 40,
            "CurrentTypeID": 10,
            "Quantity": 1
        },
        {
            "ID": 126654,
            "ConnectionTypeID": 32,
            "LevelID": 2,
            "Amps": 100,
            "Voltage": 400,
            "PowerKW": 40,
            "CurrentTypeID": 10,
            "Quantity": 1
        }
    ],
    "DateLastStatusUpdate": "2019-04-06T04:01:00Z",
    "DataQualityLevel": 3,
    "DateCreated": "2017-06-22T08:16:00Z",
    "SubmissionStatusTypeID": 100
}