{
    "IsRecentlyVerified": false,
    "ID": 51732,
    "UUID": "FBB957D2-45E0-4CDA-B740-70010D03CDD2",
    "DataProviderID": 1,
    "OperatorID": 23,
    "OperatorsReference": "7027",
    "UsageTypeID": 7,
    "UsageCost": "Free",
    "AddressInfo": {
        "ID": 52078,
        "Title": "Dimmitt Automotive Group Collision Center - Tesla",
        "AddressLine1": "25191 US Highway 19 N",
        "Town": "Clearwater",
        "StateOrProvince": "FL",
        "Postcode": "33763",
        "CountryID": 2,
        "Latitude": 28.0013426,
        "Longitude": -82.7280679,
        "ContactTelephone1": "727-797-7070  877-798-3752",
        "AccessComments": "24 hours daily; for Tesla use only; see front desk for access",
        "RelatedURL": "http://www.teslamotors.com/supercharger",
        "DistanceUnit": 0
    },
    "Connections": [
        {
            "ID": 64207,
            "ConnectionTypeID": 30,
            "StatusTypeID": 50,
            "LevelID": 2,
            "Amps": 16,
            "Voltage": 230,
            "PowerKW": 16,
            "CurrentTypeID": 10,
            "Quantity": 2
        }
    ],
    "NumberOfPoints": 2,
    "StatusTypeID": 50,
    "DateLastStatusUpdate": "2017-01-31T22:10:00Z",
    "DataQualityLevel": 3,
    "DateCreated": "2015-08-13T03:43:00Z",
    "SubmissionStatusTypeID": 100
}