{
    "IsRecentlyVerified": false,
    "ID": 171106,
    "UUID": "3C700460-B135-4C1E-9220-DAE5C32BC6AB",
    "DataProviderID": 1,
    "OperatorID": 44,
    "UsageTypeID": 4,
    "UsageCost": "free but parking max 2h",
    "AddressInfo": {
        "ID": 171465,
        "Title": "Tokmanni Parking",
        "AddressLine1": "Kauppakatu 14",
        "Town": "Lohja",
        "StateOrProvince": "Southern Finland",
        "Postcode": "08100",
        "CountryID": 79,
        "Latitude": 60.24995575315637,
        "Longitude": 24.065835807714848,
        "DistanceUnit": 0
    },
    "Connections": [
        {
            "ID": 261454,
            "ConnectionTypeID": 25,
            "StatusTypeID": 50,
            "LevelID": 2,
            "Amps": 16,
            "Voltage": 230,
            "PowerKW": 3.7,
            "CurrentTypeID": 10,
            "Quantity": 2
        }
    ],
    "NumberOfPoints": 2,
    "StatusTypeID": 50,
    "DateLastStatusUpdate": "2020-12-20T18:49:00Z",
    "DataQualityLevel": 1,
    "DateCreated": "2020-12-20T18:17:00Z",
    "SubmissionStatusTypeID": 200
}