{
    "IsRecentlyVerified": false,
    "ID": 141694,
    "UUID": "964C37DE-76D6-4C6C-AC90-4B27CF0FCA69",
    "DataProviderID": 2,
    "DataProvidersReference": "143651",
    "OperatorID": 5,
    "UsageTypeID": 1,
    "AddressInfo": {
        "ID": 142046,
        "Title": "UNDER ARMOUR",
        "AddressLine1": "1000 Hull St",
        "Town": "Baltimore",
        "StateOrProvince": "MD",
        "Postcode": "21230",
        "CountryID": 2,
        "Latitude": 39.2749886,
        "Longitude": -76.5916872,
        "ContactTelephone1": "888-758-4389",
        "AccessComments": "24 hours daily",
        "RelatedURL": "http://www.chargepoint.com/",
        "DistanceUnit": 0
    },
    "Connections": [
        {
            "ID": 197683,
            "ConnectionTypeID": 1,
            "LevelID": 2,
            "Amps": 16,
            "Voltage": 230,
            "PowerKW": 3.7,
            "CurrentTypeID": 10,
            "Quantity": 2
        }
    ],
    "StatusTypeID": 50,
    "DateLastStatusUpdate": "2020-06-26T03:01:00Z",
    "DataQualityLevel": 3,
    "DateCreated": "2019-12-24T09:16:00Z",
    "SubmissionStatusTypeID": 100
}