{
    "IsRecentlyVerified": false,
    "ID": 31132,
    "UUID": "A1917949-A49E-4062-B600-1728E88E682A",
    "DataProviderID": 2,
    "DataProvidersReference": "61767",
    "UsageTypeID": 7,
    "AddressInfo": {
        "ID": 31478,
        "Title": "Fern River Resort",
        "AddressLine1": "5250 Highway 9",
        "Town": "Felton",
        "StateOrProvince": "CA",
        "Postcode": "95018",
        "CountryID": 2,
        "Latitude": 37.039479,
        "Longitude": -122.068751,
        "ContactTelephone1": "831-335-4412",
        "AccessComments": "9am-5pm daily; reservation required for use",
        "RelatedURL": "",
        "DistanceUnit": 0
    },
    "Connections": [
        {
            "ID": 34391,
            "ConnectionTypeID": 1,
            "LevelID": 2,
            "Amps": 16,
            "Voltage": 230,
            "PowerKW": 3,
            "CurrentTypeID": 10,
            "Quantity": 1
        }
    ],
    "DateLastStatusUpdate": "2019-04-06T04:02:00Z",
    "DataQualityLevel": 3,
    "DateCreated": "2014-12-11T07:11:00Z",
    "SubmissionStatusTypeID": 100
}