{
    "IsRecentlyVerified": false,
    "ID": 107490,
    "UUID": "589DA79A-41D8-475C-98F2-2644725AEFE1",
    "DataProviderID": 1,
    "OperatorID": 45,
    "OperatorsReference": "AT*SMA*EDE0301919*001AC,AT*SMA*EDE0301919*002AC",
    "UsageTypeID": 4,
    "UsageCost": "",
    "AddressInfo": {
        "ID": 107836,
        "Title": "Parkplatz Ost",
        "AddressLine1": "Mecklenheidestraße 74",
        "Town": "Hannover",
        "StateOrProvince": "Niedersachsen",
        "Postcode": "30419",
        "CountryID": 87,
        "Latitude": 52.41699307440555,
        "Longitude": 9.67970159824631,
        "DistanceUnit": 0
    },
    "Connections": [
        {
            "ID": 151649,
            "ConnectionTypeID": 25,
            "StatusTypeID": 0,
            "LevelID": 2,
            "Amps": 16,
            "Voltage": 400,
            "PowerKW": 22,
            "CurrentTypeID": 20,
            "Quantity": 18
        },
        {
            "ID": 270299,
            "ConnectionTypeID": 25,
            "StatusTypeID": 50,
            "LevelID": 2,
            "Amps": 32,
            "Voltage": 400,
            "PowerKW": 22,
            "CurrentTypeID": 20,
            "Quantity": 10
        }
    ],
    "NumberOfPoints": 2,
    "GeneralComments": "An der Außenwand des Parkhauses. Ladenetz Volkswagen Group Charging, Aktivierung auch mit EnBW / ADAC möglich",
    "StatusTypeID": 0,
    "DateLastStatusUpdate": "2021-04-02T12:23:00Z",
    "DataQualityLevel": 1,
    "DateCreated": "2018-07-30T05:37:00Z",
    "SubmissionStatusTypeID": 200
}