{
    "UserComments": [
        {
            "ID": 23528,
            "ChargePointID": 118197,
            "CommentTypeID": 10,
            "UserName": "ForumElettrico.it",
            "Comment": "Ricaricato con card Hera su presa tipo 2 senza alcun problema. Leggi la recensione completa qui > https://www.forumelettrico.it/forum/post153863.html#p153863",
            "RelatedURL": "https://www.forumelettrico.it/forum/post153863.html#p153863",
            "DateCreated": "2020-11-19T17:33:55.74Z",
            "User": {
                "ID": 11749,
                "Username": "ForumElettrico.it"
            },
            "CheckinStatusTypeID": 10,
            "IsActionedByEditor": false
        },
        {
            "ID": 20808,
            "ChargePointID": 118197,
            "CommentTypeID": 10,
            "UserName": "ForumElettrico.it",
            "RelatedURL": "https://www.forumelettrico.it/forum/colonnina-enel-x-22-kw-unieuro-reggio-emilia-re-viale-martiri-di-piazza-tien-an-men-2-t5083.html",
            "DateCreated": "2019-03-18T08:06:56.123Z",
            "User": {
                "ID": 11749,
                "Username": "ForumElettrico.it"
            },
            "CheckinStatusTypeID": 10
        }
    ],
    "MediaItems": [
        {
            "ID": 25496,
            "ChargePointID": 118197,
            "ItemURL": "https://s3-ap-southeast-2.amazonaws.com/openchargemap/images/IT/OCM118197/OCM-118197.orig.2020111917340862.jpg",
            "ItemThumbnailURL": "https://s3-ap-southeast-2.amazonaws.com/openchargemap/images/IT/OCM118197/OCM-118197.thmb.2020111917340862.jpg",
            "Comment": "",
            "IsEnabled": true,
            "IsVideo": false,
            "IsFeaturedItem": false,
            "IsExternalResource": false,
            "User": {
                "ID": 11749,
                "Username": "ForumElettrico.it"
            },
            "DateCreated": "2020-11-19T17:34:00Z"
        },
        {
            "ID": 17790,
            "ChargePointID": 118197,
            "ItemURL": "https://s3-ap-southeast-2.amazonaws.com/openchargemap/images/IT/OCM118197/OCM-118197.orig.2019031808072503.jpg",
            "ItemThumbnailURL": "https://s3-ap-southeast-2.amazonaws.com/openchargemap/images/IT/OCM118197/OCM-118197.thmb.2019031808072503.jpg",
            "Comment": "",
            "IsEnabled": true,
            "IsVideo": false,
            "IsFeaturedItem": false,
            "IsExternalResource": false,
            "User": {
                "ID": 11749,
                "Username": "ForumElettrico.it"
            },
            "DateCreated": "2019-03-18T08:08:00Z"
        },
        {
            "ID": 17791,
            "ChargePointID": 118197,
            "ItemURL": "https://s3-ap-southeast-2.amazonaws.com/openchargemap/images/IT/OCM118197/OCM-118197.orig.2019031808073210.jpg",
            "ItemThumbnailURL": "https://s3-ap-southeast-2.amazonaws.com/openchargemap/images/IT/OCM118197/OCM-118197.thmb.2019031808073210.jpg",
            "Comment": "",
            "IsEnabled": true,
            "IsVideo": false,
            "IsFeaturedItem": false,
            "IsExternalResource": false,
            "User": {
                "ID": 11749,
                "Username": "ForumElettrico.it"
            },
            "DateCreated": "2019-03-18T08:08:00Z"
        },
        {
            "ID": 17792,
            "ChargePointID": 118197,
            "ItemURL": "https://s3-ap-southeast-2.amazonaws.com/openchargemap/images/IT/OCM118197/OCM-118197.orig.2019031808073905.jpg",
            "ItemThumbnailURL": "https://s3-ap-southeast-2.amazonaws.com/openchargemap/images/IT/OCM118197/OCM-118197.thmb.2019031808073905.jpg",
            "Comment": "",
            "IsEnabled": true,
            "IsVideo": false,
            "IsFeaturedItem": false,
            "IsExternalResource": false,
            "User": {
                "ID": 11749,
                "Username": "ForumElettrico.it"
            },
            "DateCreated": "2019-03-18T08:08:00Z"
        },
        {
            "ID": 17788,
            "ChargePointID": 118197,
            "ItemURL": "https://s3-ap-southeast-2.amazonaws.com/openchargemap/images/IT/OCM118197/OCM-118197.orig.2019031808070928.jpg",
            "ItemThumbnailURL": "https://s3-ap-southeast-2.amazonaws.com/openchargemap/images/IT/OCM118197/OCM-118197.thmb.2019031808070928.jpg",
            "Comment": "",
            "IsEnabled": true,
            "IsVideo": false,
            "IsFeaturedItem": false,
            "IsExternalResource": false,
            "User": {
                "ID": 11749,
                "Username": "ForumElettrico.it"
            },
            "DateCreated": "2019-03-18T08:07:00Z"
        },
        {
            "ID": 17789,
            "ChargePointID": 118197,
            "ItemURL": "https://s3-ap-southeast-2.amazonaws.com/openchargemap/images/IT/OCM118197/OCM-118197.orig.2019031808071760.jpg",
            "ItemThumbnailURL": "https://s3-ap-southeast-2.amazonaws.com/openchargemap/images/IT/OCM118197/OCM-118197.thmb.2019031808071760.jpg",
            "Comment": "",
            "IsEnabled": true,
            "IsVideo": false,
            "IsFeaturedItem": false,
            "IsExternalResource": false,
            "User": {
                "ID": 11749,
                "Username": "ForumElettrico.it"
            },
            "DateCreated": "2019-03-18T08:07:00Z"
        }
    ],
    "IsRecentlyVerified": false,
    "ID": 118197,
    "UUID": "7B8574EC-D66E-4B1E-8322-501502D3FE14",
    "DataProviderID": 1,
    "OperatorID": 80,
    "UsageTypeID": 1,
    "AddressInfo": {
        "ID": 118543,
        "Title": "Enel X Unieuro",
        "AddressLine1": "Viale Martiri di Piazza Tien An Men 2",
        "Town": "Reggio Emilia ",
        "StateOrProvince": "RE",
        "CountryID": 112,
        "Latitude": 44.717513,
        "Longitude": 10.585683,
        "RelatedURL": "https://www.forumelettrico.it/forum/colonnina-enel-x-22-kw-unieuro-reggio-emilia-re-viale-martiri-di-piazza-tien-an-men-2-t5083.html",
        "DistanceUnit": 0
    },
    "Connections": [
        {
            "ID": 167256,
            "ConnectionTypeID": 25,
            "StatusTypeID": 50,
            "LevelID": 2,
            "Amps": 32,
            "Voltage": 400,
            "PowerKW": 22,
            "CurrentTypeID": 20,
            "Quantity": 2
        }
    ],
    "NumberOfPoints": 2,
    "StatusTypeID": 50,
    "DateLastStatusUpdate": "2020-11-19T17:34:00Z",
    "DataQualityLevel": 1,
    "DateCreated": "2019-03-18T08:06:00Z",
    "SubmissionStatusTypeID": 200
}