{
    "IsRecentlyVerified": false,
    "ID": 113067,
    "UUID": "A5D4128D-0AD6-4DFA-9914-CB743A8333E9",
    "DataProviderID": 2,
    "DataProvidersReference": "104439",
    "OperatorID": 5,
    "UsageTypeID": 1,
    "AddressInfo": {
        "ID": 113413,
        "Title": "MOMENTUM KIA",
        "AddressLine1": "4325 Sonoma Blvd",
        "Town": "Vallejo",
        "StateOrProvince": "CA",
        "Postcode": "94589",
        "CountryID": 2,
        "Latitude": 38.134763,
        "Longitude": -122.256825,
        "ContactTelephone1": "888-758-4389",
        "AccessComments": "24 hours daily",
        "RelatedURL": "http://www.chargepoint.com/",
        "DistanceUnit": 0
    },
    "Connections": [
        {
            "ID": 159232,
            "ConnectionTypeID": 1,
            "LevelID": 2,
            "Amps": 16,
            "Voltage": 230,
            "PowerKW": 3,
            "CurrentTypeID": 10,
            "Quantity": 3
        }
    ],
    "DateLastStatusUpdate": "2019-04-06T04:02:00Z",
    "DataQualityLevel": 3,
    "DateCreated": "2018-11-28T02:04:00Z",
    "SubmissionStatusTypeID": 100
}