{
    "IsRecentlyVerified": false,
    "ID": 91798,
    "UUID": "D63FDBD5-F929-4520-A74D-305E39AD18EB",
    "DataProviderID": 1,
    "OperatorID": 23,
    "OperatorsReference": "32902",
    "UsageTypeID": 7,
    "AddressInfo": {
        "ID": 92144,
        "Title": "Bluesun Hotel Alan",
        "AddressLine1": "Ul. DR. Franje Tudmana 14",
        "Town": "Starigrad",
        "Postcode": "23244",
        "CountryID": 60,
        "Latitude": 44.287665,
        "Longitude": 15.448845,
        "ContactTelephone1": "+385  023 209 050",
        "DistanceUnit": 0
    },
    "Connections": [
        {
            "ID": 130147,
            "ConnectionTypeID": 30,
            "StatusTypeID": 50,
            "LevelID": 2,
            "Amps": 32,
            "Voltage": 400,
            "PowerKW": 22,
            "CurrentTypeID": 20,
            "Quantity": 1
        }
    ],
    "NumberOfPoints": 1,
    "GeneralComments": "1 Tesla Connector, up to 22kW.Available by reservation only. Please see front desk.",
    "StatusTypeID": 50,
    "DateLastStatusUpdate": "2018-10-03T23:53:00Z",
    "DataQualityLevel": 1,
    "DateCreated": "2017-08-18T07:37:00Z",
    "SubmissionStatusTypeID": 200
}