{
    "IsRecentlyVerified": false,
    "ID": 119644,
    "UUID": "9C14B612-F6D6-4303-8974-51306E0BF5C1",
    "DataProviderID": 2,
    "DataProvidersReference": "60632",
    "OperatorID": 5,
    "UsageTypeID": 1,
    "AddressInfo": {
        "ID": 119990,
        "Title": "BMW STATION",
        "AddressLine1": "15235-15245 FL-45",
        "Town": "Fort Myers",
        "StateOrProvince": "FL",
        "Postcode": "33908",
        "CountryID": 2,
        "Latitude": 26.519302,
        "Longitude": -81.8672456,
        "ContactTelephone1": "888-758-4389",
        "AccessComments": "24 hours daily",
        "RelatedURL": "http://www.chargepoint.com/",
        "DistanceUnit": 0
    },
    "Connections": [
        {
            "ID": 168924,
            "ConnectionTypeID": 1,
            "LevelID": 2,
            "Amps": 16,
            "Voltage": 230,
            "PowerKW": 3,
            "CurrentTypeID": 10,
            "Quantity": 2
        }
    ],
    "DateLastStatusUpdate": "2019-12-24T09:08:00Z",
    "DataQualityLevel": 3,
    "DateCreated": "2019-04-01T04:59:00Z",
    "SubmissionStatusTypeID": 100
}