{
    "IsRecentlyVerified": false,
    "ID": 180646,
    "UUID": "DDC0D74A-A8F7-45D6-B9A8-01BD99B4407A",
    "DataProviderID": 29,
    "DataProvidersReference": "9995",
    "OperatorID": 45,
    "AddressInfo": {
        "ID": 181005,
        "Title": "Chiemsee Straße 87",
        "AddressLine1": "Chiemsee Straße 87",
        "Town": "Bernau",
        "Postcode": "83233",
        "CountryID": 87,
        "Latitude": 47.82532,
        "Longitude": 12.384,
        "DistanceUnit": 0
    },
    "Connections": [
        {
            "ID": 283985,
            "ConnectionTypeID": 25,
            "StatusTypeID": 50,
            "LevelID": 3,
            "PowerKW": 50,
            "CurrentTypeID": 30
        },
        {
            "ID": 283986,
            "ConnectionTypeID": 33,
            "StatusTypeID": 50,
            "LevelID": 3,
            "PowerKW": 50,
            "CurrentTypeID": 30
        },
        {
            "ID": 295386,
            "ConnectionTypeID": 2,
            "StatusTypeID": 50,
            "LevelID": 3,
            "PowerKW": 50,
            "CurrentTypeID": 30
        }
    ],
    "StatusTypeID": 50,
    "DateLastStatusUpdate": "2021-07-12T02:39:00Z",
    "MetadataValues": [
        {
            "ID": 12940,
            "MetadataFieldID": 4,
            "ItemValue": "Data from the German chargepoint registry provided by Bundesnetzagentur.de under the CC-BY 4.0 license"
        }
    ],
    "DataQualityLevel": 3,
    "DateCreated": "2021-07-08T10:00:00Z",
    "SubmissionStatusTypeID": 100
}