{
    "IsRecentlyVerified": false,
    "ID": 146392,
    "UUID": "60CBF27A-1881-47FA-963A-3FA85CD004F7",
    "DataProviderID": 1,
    "OperatorID": 3315,
    "OperatorsReference": "52094",
    "UsageTypeID": 4,
    "UsageCost": "Free",
    "AddressInfo": {
        "ID": 146744,
        "Title": "Ruby Street, Glasgow",
        "AddressLine1": "11 Ruby Street",
        "Town": "Glasgow",
        "Postcode": "G40 3BS",
        "CountryID": 1,
        "Latitude": 55.846157,
        "Longitude": -4.220656,
        "DistanceUnit": 0
    },
    "Connections": [
        {
            "ID": 203510,
            "ConnectionTypeID": 25,
            "StatusTypeID": 50,
            "LevelID": 2,
            "Amps": 32,
            "Voltage": 230,
            "PowerKW": 7,
            "CurrentTypeID": 10,
            "Quantity": 2
        }
    ],
    "NumberOfPoints": 2,
    "StatusTypeID": 50,
    "DateLastStatusUpdate": "2020-05-07T05:17:00Z",
    "DataQualityLevel": 1,
    "DateCreated": "2020-01-09T16:36:00Z",
    "SubmissionStatusTypeID": 200
}