{
    "UserComments": [
        {
            "ID": 18068,
            "ChargePointID": 96848,
            "CommentTypeID": 10,
            "UserName": "Simon Hewison",
            "DateCreated": "2018-01-01T20:54:13.167Z",
            "User": {
                "ID": 4575,
                "Username": "Simon Hewison"
            },
            "CheckinStatusTypeID": 140
        }
    ],
    "MediaItems": [
        {
            "ID": 15010,
            "ChargePointID": 96848,
            "ItemURL": "https://s3-ap-southeast-2.amazonaws.com/openchargemap/images/GB/OCM96848/OCM-96848.orig.2018012512332931.jpg",
            "ItemThumbnailURL": "https://s3-ap-southeast-2.amazonaws.com/openchargemap/images/GB/OCM96848/OCM-96848.thmb.2018012512332931.jpg",
            "Comment": "Bays now marked for Electric taxis only",
            "IsEnabled": true,
            "IsVideo": false,
            "IsFeaturedItem": false,
            "IsExternalResource": false,
            "User": {
                "ID": 4575,
                "Username": "Simon Hewison"
            },
            "DateCreated": "2018-01-25T12:34:00Z"
        },
        {
            "ID": 13880,
            "ChargePointID": 96848,
            "ItemURL": "https://s3-ap-southeast-2.amazonaws.com/openchargemap/images/GB/OCM96848/OCM-96848.orig.2018010114200380.jpg",
            "ItemThumbnailURL": "https://s3-ap-southeast-2.amazonaws.com/openchargemap/images/GB/OCM96848/OCM-96848.thmb.2018010114200380.jpg",
            "Comment": "",
            "IsEnabled": true,
            "IsVideo": false,
            "IsFeaturedItem": false,
            "IsExternalResource": false,
            "User": {
                "ID": 4575,
                "Username": "Simon Hewison"
            },
            "DateCreated": "2018-01-01T14:20:00Z"
        }
    ],
    "IsRecentlyVerified": false,
    "ID": 96848,
    "UUID": "D94D6C17-A2ED-47FF-BBB9-94D895C5198F",
    "DataProviderID": 1,
    "OperatorID": 3357,
    "UsageTypeID": 6,
    "AddressInfo": {
        "ID": 97194,
        "Title": "Totteridge and Whetstone Underground Station - Taxi charger",
        "AddressLine1": "Totteridge Lane",
        "Town": "London",
        "StateOrProvince": "England",
        "Postcode": "N20 9QJ",
        "CountryID": 1,
        "Latitude": 51.6309440380849,
        "Longitude": -0.178733577323893,
        "ContactTelephone1": "+44 345 609 0372",
        "AccessComments": "Intended for Taxi use only by TfL. Daily parking charges may apply (beyond ANPR cameras). Operated by ESB",
        "DistanceUnit": 0
    },
    "Connections": [
        {
            "ID": 137170,
            "ConnectionTypeID": 2,
            "StatusTypeID": 50,
            "LevelID": 3,
            "Amps": 125,
            "Voltage": 500,
            "PowerKW": 50,
            "CurrentTypeID": 30,
            "Quantity": 1
        },
        {
            "ID": 137171,
            "ConnectionTypeID": 33,
            "StatusTypeID": 50,
            "LevelID": 3,
            "Amps": 125,
            "Voltage": 500,
            "PowerKW": 50,
            "CurrentTypeID": 30,
            "Quantity": 1
        }
    ],
    "NumberOfPoints": 1,
    "StatusTypeID": 50,
    "DateLastStatusUpdate": "2019-06-03T08:05:00Z",
    "DataQualityLevel": 1,
    "DateCreated": "2018-01-01T14:15:00Z",
    "SubmissionStatusTypeID": 200
}