{
    "IsRecentlyVerified": false,
    "ID": 23204,
    "UUID": "A4CA5A40-D456-493D-97E9-6D007552FBFA",
    "DataProviderID": 1,
    "OperatorID": 62,
    "UsageTypeID": 4,
    "AddressInfo": {
        "ID": 23549,
        "Title": "Auchan BRIVES CHARENSAC",
        "AddressLine1": "Route de Coubon",
        "Town": "Brives-Charensac",
        "StateOrProvince": "Le Puy-en-Velay",
        "Postcode": "43700",
        "CountryID": 80,
        "Latitude": 45.0484642,
        "Longitude": 3.91660980000006,
        "ContactTelephone1": "04.71.07.27.27 ",
        "RelatedURL": "http://www.auchan.fr/magasins/brives-charensac/151/informations-pratiques/",
        "DistanceUnit": 0
    },
    "Connections": [
        {
            "ID": 24994,
            "ConnectionTypeID": 2,
            "StatusTypeID": 50,
            "LevelID": 3,
            "PowerKW": 50,
            "CurrentTypeID": 30,
            "Quantity": 1
        },
        {
            "ID": 24995,
            "ConnectionTypeID": 1036,
            "StatusTypeID": 50,
            "LevelID": 3,
            "Amps": 63,
            "Voltage": 400,
            "PowerKW": 43,
            "CurrentTypeID": 20,
            "Quantity": 1
        }
    ],
    "NumberOfPoints": 1,
    "StatusTypeID": 150,
    "DateLastStatusUpdate": "2020-07-06T16:25:00Z",
    "DataQualityLevel": 1,
    "DateCreated": "2014-04-30T19:59:00Z",
    "SubmissionStatusTypeID": 200
}