{
    "IsRecentlyVerified": false,
    "ID": 176990,
    "UUID": "CFFF7BF7-B152-423E-9D8F-AF9C31A25ACB",
    "DataProviderID": 29,
    "DataProvidersReference": "2254,11709",
    "AddressInfo": {
        "ID": 177349,
        "Title": "Mooswaldstraße 1b",
        "AddressLine1": "Mooswaldstraße 1b",
        "Town": "Freiburg",
        "Postcode": "79108",
        "CountryID": 87,
        "Latitude": 48.049605,
        "Longitude": 7.802535,
        "DistanceUnit": 0
    },
    "Connections": [
        {
            "ID": 275604,
            "ConnectionTypeID": 25,
            "StatusTypeID": 50,
            "LevelID": 2,
            "PowerKW": 22,
            "CurrentTypeID": 20
        },
        {
            "ID": 275605,
            "ConnectionTypeID": 25,
            "StatusTypeID": 50,
            "LevelID": 2,
            "PowerKW": 22,
            "CurrentTypeID": 20
        },
        {
            "ID": 275606,
            "ConnectionTypeID": 25,
            "StatusTypeID": 50,
            "LevelID": 2,
            "PowerKW": 22,
            "CurrentTypeID": 20
        },
        {
            "ID": 275607,
            "ConnectionTypeID": 25,
            "StatusTypeID": 50,
            "LevelID": 2,
            "PowerKW": 22,
            "CurrentTypeID": 20
        }
    ],
    "StatusTypeID": 0,
    "DateLastStatusUpdate": "2021-07-09T03:11:00Z",
    "MetadataValues": [
        {
            "ID": 9284,
            "MetadataFieldID": 4,
            "ItemValue": "Data from the German chargepoint registry provided by Bundesnetzagentur.de under the CC-BY 4.0 license"
        }
    ],
    "DataQualityLevel": 3,
    "DateCreated": "2021-07-08T09:48:00Z",
    "SubmissionStatusTypeID": 100
}