{
    "IsRecentlyVerified": false,
    "ID": 112617,
    "UUID": "4D3BDF03-F925-4138-A617-337AC62E2FD3",
    "DataProviderID": 1,
    "OperatorID": 80,
    "UsageTypeID": 4,
    "AddressInfo": {
        "ID": 112963,
        "Title": "Genova Aspromonte | EnelX",
        "AddressLine1": "Viale Aspromonte, 2",
        "AddressLine2": "Centro Est",
        "Town": "Genova",
        "StateOrProvince": "GE",
        "Postcode": "16128",
        "CountryID": 112,
        "Latitude": 44.399582101121545,
        "Longitude": 8.939973108003983,
        "ContactTelephone1": "800.069.850",
        "RelatedURL": "https://www.enelx.com/it/it/emobility",
        "DistanceUnit": 0
    },
    "Connections": [
        {
            "ID": 158456,
            "ConnectionTypeID": 25,
            "StatusTypeID": 50,
            "LevelID": 2,
            "Amps": 32,
            "Voltage": 400,
            "PowerKW": 22,
            "CurrentTypeID": 20,
            "Quantity": 1
        },
        {
            "ID": 158457,
            "ConnectionTypeID": 36,
            "StatusTypeID": 50,
            "LevelID": 2,
            "Amps": 16,
            "Voltage": 240,
            "PowerKW": 3.7,
            "CurrentTypeID": 10,
            "Quantity": 1
        }
    ],
    "NumberOfPoints": 2,
    "StatusTypeID": 50,
    "DateLastStatusUpdate": "2018-11-09T13:51:00Z",
    "DataQualityLevel": 1,
    "DateCreated": "2018-11-09T13:51:00Z",
    "SubmissionStatusTypeID": 200
}