{
    "IsRecentlyVerified": false,
    "ID": 117678,
    "UUID": "CC38B3EA-99D2-4DCF-B55C-ED056EC6AA37",
    "DataProviderID": 1,
    "OperatorID": 80,
    "UsageTypeID": 4,
    "AddressInfo": {
        "ID": 118024,
        "Title": "Seriate Europa | EnelX",
        "AddressLine1": "Corso Europa",
        "Town": "Seriate",
        "StateOrProvince": "BG",
        "Postcode": "24068",
        "CountryID": 112,
        "Latitude": 45.6788485445868,
        "Longitude": 9.7294382177555,
        "ContactTelephone1": "800.069.850",
        "RelatedURL": "https://www.enelx.com/it/it/emobility",
        "DistanceUnit": 0
    },
    "Connections": [
        {
            "ID": 166468,
            "ConnectionTypeID": 25,
            "StatusTypeID": 50,
            "LevelID": 2,
            "Amps": 32,
            "Voltage": 400,
            "PowerKW": 22,
            "CurrentTypeID": 20,
            "Quantity": 2
        }
    ],
    "NumberOfPoints": 2,
    "StatusTypeID": 50,
    "DateLastStatusUpdate": "2019-04-11T16:24:00Z",
    "DataQualityLevel": 1,
    "DateCreated": "2019-02-22T11:43:00Z",
    "SubmissionStatusTypeID": 200
}