{
    "IsRecentlyVerified": false,
    "ID": 109069,
    "UUID": "36F44F67-5A2E-4B36-AF9B-AB40F21D464F",
    "DataProviderID": 1,
    "OperatorID": 23,
    "OperatorsReference": "45842",
    "UsageTypeID": 4,
    "AddressInfo": {
        "ID": 109415,
        "Title": "Old Barn Tregonetha",
        "AddressLine1": "Pound Lane",
        "Town": "St Columb",
        "StateOrProvince": "Cornwall",
        "Postcode": "TR9 6EL",
        "CountryID": 1,
        "Latitude": 50.441052,
        "Longitude": -4.881115,
        "ContactTelephone1": " +44 163 788 0121",
        "DistanceUnit": 0
    },
    "Connections": [
        {
            "ID": 154187,
            "ConnectionTypeID": 30,
            "StatusTypeID": 50,
            "LevelID": 2,
            "Amps": 32,
            "Voltage": 230,
            "PowerKW": 7,
            "CurrentTypeID": 10,
            "Quantity": 1
        }
    ],
    "NumberOfPoints": 1,
    "GeneralComments": "1 Tesla Connector, up to 7kW.Available for customers. Please call ahead.",
    "StatusTypeID": 50,
    "DateLastStatusUpdate": "2018-10-11T13:31:00Z",
    "DataQualityLevel": 1,
    "DateCreated": "2018-10-11T13:31:00Z",
    "SubmissionStatusTypeID": 200
}