{
    "IsRecentlyVerified": false,
    "ID": 127221,
    "UUID": "A91C4326-FE8C-4A13-81FE-5281552D3D60",
    "DataProviderID": 1,
    "OperatorID": 80,
    "UsageTypeID": 4,
    "AddressInfo": {
        "ID": 127567,
        "Title": "None Palazzetto dello sport | EnelX",
        "AddressLine1": "Via Faunasco, 23",
        "Town": "None",
        "StateOrProvince": "TO",
        "Postcode": "10060",
        "CountryID": 112,
        "Latitude": 44.9292980338855,
        "Longitude": 7.54126157174449,
        "ContactTelephone1": "800.069.850",
        "RelatedURL": "https://www.enelx.com/it/it/emobility",
        "DistanceUnit": 0
    },
    "Connections": [
        {
            "ID": 178140,
            "ConnectionTypeID": 25,
            "StatusTypeID": 50,
            "LevelID": 2,
            "Amps": 32,
            "Voltage": 400,
            "PowerKW": 22,
            "CurrentTypeID": 20,
            "Quantity": 1
        },
        {
            "ID": 178141,
            "ConnectionTypeID": 36,
            "StatusTypeID": 50,
            "LevelID": 2,
            "Amps": 16,
            "Voltage": 240,
            "PowerKW": 3.7,
            "CurrentTypeID": 10,
            "Quantity": 1
        }
    ],
    "NumberOfPoints": 2,
    "StatusTypeID": 50,
    "DateLastStatusUpdate": "2019-05-30T14:40:00Z",
    "DataQualityLevel": 1,
    "DateCreated": "2019-05-30T14:40:00Z",
    "SubmissionStatusTypeID": 200
}