{
    "IsRecentlyVerified": false,
    "ID": 109225,
    "UUID": "F83533C0-060C-4BF6-8D77-A0AAFE825C99",
    "DataProviderID": 1,
    "OperatorID": 23,
    "OperatorsReference": "46157",
    "UsageTypeID": 4,
    "AddressInfo": {
        "ID": 109571,
        "Title": "Zbojnicka Koliba",
        "AddressLine1": "Oravska Jasenica 620",
        "Town": "Oravska Jasenica",
        "Postcode": "029 64",
        "CountryID": 204,
        "Latitude": 49.391236,
        "Longitude": 19.451018,
        "ContactTelephone1": "+42 1948 251200",
        "DistanceUnit": 0
    },
    "Connections": [
        {
            "ID": 154343,
            "ConnectionTypeID": 30,
            "StatusTypeID": 50,
            "LevelID": 2,
            "Amps": 32,
            "Voltage": 400,
            "PowerKW": 22,
            "CurrentTypeID": 20,
            "Quantity": 1
        }
    ],
    "NumberOfPoints": 1,
    "GeneralComments": "1 Tesla Connector, up to 22kW.Available to the public. Self park.",
    "StatusTypeID": 50,
    "DateLastStatusUpdate": "2018-10-11T13:58:00Z",
    "DataQualityLevel": 1,
    "DateCreated": "2018-10-11T13:58:00Z",
    "SubmissionStatusTypeID": 200
}