{
    "IsRecentlyVerified": false,
    "ID": 61436,
    "UUID": "06647D51-A05C-4950-9B50-C642B4546164",
    "DataProviderID": 1,
    "OperatorID": 156,
    "UsageTypeID": 4,
    "AddressInfo": {
        "ID": 61782,
        "Title": "Ladepunkt Rennerod",
        "AddressLine1": "Bahnhofstraße 60",
        "AddressLine2": "Berghof",
        "Town": "Rennerod",
        "StateOrProvince": "Westerwaldkreis",
        "Postcode": "56477",
        "CountryID": 87,
        "Latitude": 50.61847961976416,
        "Longitude": 8.071925188989656,
        "AccessComments": "24/7 nutzbar mit The New Motion Ladekarte (oder WSW Strom, SW LB, PlugSurfing Keyhanger, SUN Ladekarte, ladeticket etc).\r\nWeiße Wallbox an Steinmauer links neben der Eingangstreppe.",
        "DistanceUnit": 0
    },
    "Connections": [
        {
            "ID": 78239,
            "ConnectionTypeID": 25,
            "StatusTypeID": 50,
            "LevelID": 2,
            "Amps": 16,
            "Voltage": 400,
            "PowerKW": 11,
            "CurrentTypeID": 20,
            "Quantity": 1
        }
    ],
    "NumberOfPoints": 1,
    "StatusTypeID": 50,
    "DateLastStatusUpdate": "2016-02-29T07:52:00Z",
    "DataQualityLevel": 1,
    "DateCreated": "2016-02-29T07:52:00Z",
    "SubmissionStatusTypeID": 200
}