{
    "IsRecentlyVerified": false,
    "ID": 127620,
    "UUID": "693B6D41-0317-4E7C-8D6C-26E061C06E39",
    "DataProviderID": 1,
    "OperatorID": 25,
    "OperatorsReference": "bromley-valleyroad",
    "UsageTypeID": 4,
    "UsageCost": "£0.059/minute; min £1.18; other tariffs available",
    "AddressInfo": {
        "ID": 127966,
        "Title": "Valley Road",
        "AddressLine1": "7 Valley Road Bromley (site 2)",
        "Town": "Bromley",
        "Postcode": "BR2 0HB",
        "CountryID": 1,
        "Latitude": 51.405284,
        "Longitude": 0.001402,
        "DistanceUnit": 0
    },
    "Connections": [
        {
            "ID": 178632,
            "ConnectionTypeID": 1,
            "StatusTypeID": 50,
            "LevelID": 2,
            "Voltage": 230,
            "PowerKW": 4,
            "CurrentTypeID": 10,
            "Quantity": 2
        },
        {
            "ID": 178633,
            "ConnectionTypeID": 25,
            "StatusTypeID": 50,
            "LevelID": 2,
            "Amps": 32,
            "Voltage": 230,
            "PowerKW": 7,
            "CurrentTypeID": 10,
            "Quantity": 2
        },
        {
            "ID": 178634,
            "ConnectionTypeID": 1,
            "StatusTypeID": 50,
            "LevelID": 2,
            "Voltage": 230,
            "PowerKW": 4,
            "CurrentTypeID": 10,
            "Quantity": 2
        }
    ],
    "NumberOfPoints": 3,
    "StatusTypeID": 50,
    "DateLastStatusUpdate": "2019-10-07T08:06:00Z",
    "DataQualityLevel": 1,
    "DateCreated": "2019-06-06T05:35:00Z",
    "SubmissionStatusTypeID": 200
}