{
    "IsRecentlyVerified": false,
    "ID": 178658,
    "UUID": "8CD9CFF4-C1CE-4474-8577-6816E94AC189",
    "DataProviderID": 29,
    "DataProvidersReference": "18583",
    "AddressInfo": {
        "ID": 179017,
        "Title": "Regener Str. 116",
        "AddressLine1": "Regener Str. 116",
        "Town": "Schönberg",
        "Postcode": "94513",
        "CountryID": 87,
        "Latitude": 48.851777,
        "Longitude": 13.325817,
        "DistanceUnit": 0
    },
    "Connections": [
        {
            "ID": 279361,
            "ConnectionTypeID": 33,
            "StatusTypeID": 50,
            "LevelID": 3,
            "PowerKW": 22,
            "CurrentTypeID": 30
        },
        {
            "ID": 279362,
            "ConnectionTypeID": 25,
            "StatusTypeID": 50,
            "LevelID": 2,
            "PowerKW": 11,
            "CurrentTypeID": 20
        }
    ],
    "StatusTypeID": 0,
    "DateLastStatusUpdate": "2021-07-09T03:13:00Z",
    "MetadataValues": [
        {
            "ID": 10952,
            "MetadataFieldID": 4,
            "ItemValue": "Data from the German chargepoint registry provided by Bundesnetzagentur.de under the CC-BY 4.0 license"
        }
    ],
    "DataQualityLevel": 3,
    "DateCreated": "2021-07-08T09:50:00Z",
    "SubmissionStatusTypeID": 100
}