{
    "IsRecentlyVerified": false,
    "ID": 171671,
    "UUID": "4831294A-EC14-484D-AC60-14937DB97D5A",
    "DataProviderID": 1,
    "OperatorID": 3327,
    "UsageTypeID": 4,
    "UsageCost": "0,45 EUR/kWh",
    "AddressInfo": {
        "ID": 172030,
        "Title": "BeCharge Castel Maggiore Kennedy",
        "AddressLine1": "Via Fratelli Kennedy",
        "Town": "Castel Maggiore",
        "StateOrProvince": "BO",
        "Postcode": "40013",
        "CountryID": 112,
        "Latitude": 44.57577417493414,
        "Longitude": 11.36161354601984,
        "RelatedURL": "https://www.bec.energy/",
        "DistanceUnit": 0
    },
    "Connections": [
        {
            "ID": 262516,
            "ConnectionTypeID": 25,
            "StatusTypeID": 150,
            "LevelID": 2,
            "Amps": 32,
            "Voltage": 400,
            "PowerKW": 22,
            "CurrentTypeID": 20,
            "Quantity": 2
        }
    ],
    "NumberOfPoints": 2,
    "StatusTypeID": 50,
    "DateLastStatusUpdate": "2021-03-14T10:05:00Z",
    "DataQualityLevel": 1,
    "DateCreated": "2021-01-09T11:51:00Z",
    "SubmissionStatusTypeID": 200
}