{
    "IsRecentlyVerified": false,
    "ID": 174996,
    "UUID": "5AD4AF5F-587A-4543-BC17-CE05697DC92E",
    "DataProviderID": 1,
    "OperatorID": 203,
    "UsageTypeID": 5,
    "UsageCost": "£0.36/kWh contactless £0.31/kWh via osprey app",
    "AddressInfo": {
        "ID": 175355,
        "Title": "Meteor Shopping Park",
        "AddressLine1": "Somerford Road",
        "AddressLine2": "Mudeford",
        "Town": "Christchurch",
        "Postcode": "BH23 3PY",
        "CountryID": 1,
        "Latitude": 50.7414189531809,
        "Longitude": -1.7431327913736823,
        "DistanceUnit": 0
    },
    "Connections": [
        {
            "ID": 271192,
            "ConnectionTypeID": 25,
            "StatusTypeID": 50,
            "LevelID": 2,
            "Amps": 32,
            "Voltage": 400,
            "PowerKW": 22,
            "CurrentTypeID": 20,
            "Quantity": 2
        },
        {
            "ID": 271193,
            "ConnectionTypeID": 2,
            "StatusTypeID": 50,
            "LevelID": 3,
            "Amps": 125,
            "Voltage": 400,
            "PowerKW": 50,
            "CurrentTypeID": 30,
            "Quantity": 2
        },
        {
            "ID": 271194,
            "ConnectionTypeID": 33,
            "StatusTypeID": 50,
            "LevelID": 3,
            "Amps": 125,
            "Voltage": 400,
            "PowerKW": 50,
            "CurrentTypeID": 30,
            "Quantity": 2
        }
    ],
    "NumberOfPoints": 2,
    "StatusTypeID": 50,
    "DateLastStatusUpdate": "2021-04-23T14:55:00Z",
    "DataQualityLevel": 1,
    "DateCreated": "2021-04-23T14:54:00Z",
    "SubmissionStatusTypeID": 200
}