{
    "IsRecentlyVerified": false,
    "ID": 2539,
    "UUID": "4680D715-54ED-48C6-AC9D-FC92EE0BB5C4",
    "DataProviderID": 2,
    "DataProvidersReference": "21388",
    "UsageTypeID": 2,
    "AddressInfo": {
        "ID": 2540,
        "Title": "Tops Auto Park Garage",
        "AddressLine1": "6464 Sunset Blvd",
        "Town": "Hollywood",
        "StateOrProvince": "CA",
        "Postcode": "90028",
        "CountryID": 2,
        "Latitude": 34.097928,
        "Longitude": -118.331,
        "ContactTelephone1": "",
        "AccessComments": "For tenant and guest use only",
        "RelatedURL": "",
        "DistanceUnit": 0
    },
    "Connections": [
        {
            "ID": 12343,
            "ConnectionTypeID": 1,
            "LevelID": 2,
            "Amps": 16,
            "Voltage": 230,
            "PowerKW": 3,
            "CurrentTypeID": 10,
            "Quantity": 4
        },
        {
            "ID": 20157,
            "ConnectionTypeID": 1,
            "LevelID": 2,
            "Quantity": 2
        }
    ],
    "DateLastConfirmed": "2010-08-31T00:00:00Z",
    "StatusTypeID": 0,
    "DateLastStatusUpdate": "2019-04-06T04:01:00Z",
    "DataQualityLevel": 1,
    "DateCreated": "2010-08-31T00:00:00Z",
    "SubmissionStatusTypeID": 100
}