{
    "IsRecentlyVerified": false,
    "ID": 137183,
    "UUID": "FE06F5E9-7D73-4285-87F6-D38471A1161C",
    "DataProviderID": 2,
    "DataProvidersReference": "78965",
    "UsageTypeID": 1,
    "AddressInfo": {
        "ID": 137529,
        "Title": "Target",
        "AddressLine1": "4380 Lawehana St",
        "Town": "Honolulu",
        "StateOrProvince": "HI",
        "Postcode": "96818",
        "CountryID": 2,
        "Latitude": 21.354468,
        "Longitude": -157.929279,
        "ContactTelephone1": "808-441-3118",
        "AccessComments": "8am-12am M-Sat, 8am-11pm Sun; maximum stay of 3 hours",
        "RelatedURL": "",
        "DistanceUnit": 0
    },
    "Connections": [
        {
            "ID": 192045,
            "ConnectionTypeID": 1,
            "LevelID": 2,
            "Amps": 16,
            "Voltage": 230,
            "PowerKW": 3,
            "CurrentTypeID": 10,
            "Quantity": 2
        }
    ],
    "StatusTypeID": 50,
    "DateLastStatusUpdate": "2019-12-24T09:04:00Z",
    "DataQualityLevel": 3,
    "DateCreated": "2019-12-24T09:04:00Z",
    "SubmissionStatusTypeID": 100
}