{
    "IsRecentlyVerified": false,
    "ID": 160221,
    "UUID": "91CF3CDB-A941-441E-A4FE-98BA147F6888",
    "DataProviderID": 2,
    "DataProvidersReference": "158038",
    "UsageTypeID": 2,
    "AddressInfo": {
        "ID": 160578,
        "Title": "Thickson Ridge Center",
        "AddressLine1": "1629 Victoria St",
        "Town": "Whitby",
        "StateOrProvince": "ON",
        "Postcode": "L1N 9W4",
        "CountryID": 44,
        "Latitude": 43.8656864,
        "Longitude": -78.9021249,
        "ContactTelephone1": "",
        "AccessComments": "",
        "RelatedURL": "",
        "DistanceUnit": 0
    },
    "Connections": [
        {
            "ID": 230509,
            "ConnectionTypeID": 2,
            "LevelID": 3,
            "Amps": 100,
            "Voltage": 400,
            "PowerKW": 40,
            "CurrentTypeID": 30,
            "Quantity": 1
        },
        {
            "ID": 230510,
            "ConnectionTypeID": 32,
            "LevelID": 3,
            "Amps": 100,
            "Voltage": 400,
            "PowerKW": 40,
            "CurrentTypeID": 30,
            "Quantity": 1
        }
    ],
    "GeneralComments": "Planned for future date. Not Operational.",
    "DatePlanned": "2020-09-01T00:00:00Z",
    "StatusTypeID": 150,
    "DateLastStatusUpdate": "2020-06-26T03:07:00Z",
    "DataQualityLevel": 3,
    "DateCreated": "2020-06-26T03:07:00Z",
    "SubmissionStatusTypeID": 100
}