{
    "IsRecentlyVerified": false,
    "ID": 89691,
    "UUID": "DDF551A1-7E44-42B0-BF7A-7580D193058F",
    "DataProviderID": 2,
    "DataProvidersReference": "82350",
    "OperatorID": 5,
    "UsageTypeID": 1,
    "AddressInfo": {
        "ID": 90037,
        "Title": "WENDYS",
        "AddressLine1": "4100 S Pulaski Rd",
        "Town": "Chicago",
        "StateOrProvince": "IL",
        "Postcode": "60632",
        "CountryID": 2,
        "Latitude": 41.818127,
        "Longitude": -87.7245934,
        "ContactTelephone1": "888-758-4389",
        "AccessComments": "24 hours daily",
        "RelatedURL": "http://www.chargepoint.com/",
        "DistanceUnit": 0
    },
    "Connections": [
        {
            "ID": 127121,
            "ConnectionTypeID": 1,
            "LevelID": 2,
            "Amps": 16,
            "Voltage": 230,
            "PowerKW": 3.7,
            "CurrentTypeID": 10,
            "Quantity": 2
        }
    ],
    "DateLastStatusUpdate": "2020-06-26T03:05:00Z",
    "DataQualityLevel": 3,
    "DateCreated": "2017-06-22T08:16:00Z",
    "SubmissionStatusTypeID": 100
}