{
    "IsRecentlyVerified": false,
    "ID": 174604,
    "UUID": "FB3D2C1C-DC75-4994-B204-AC0BD6535EB6",
    "DataProviderID": 1,
    "OperatorID": 105,
    "UsageTypeID": 1,
    "AddressInfo": {
        "ID": 174963,
        "Title": "Kapellener Markt 1-3",
        "AddressLine1": "Kapellen an der Fleuth",
        "Town": "Geldern",
        "StateOrProvince": "North Rhine-Westphalia",
        "Postcode": "47608",
        "CountryID": 87,
        "Latitude": 51.57125649106749,
        "Longitude": 6.363750047228336,
        "DistanceUnit": 0
    },
    "Connections": [
        {
            "ID": 270517,
            "ConnectionTypeID": 25,
            "StatusTypeID": 50,
            "LevelID": 2,
            "PowerKW": 22,
            "CurrentTypeID": 20,
            "Quantity": 2
        }
    ],
    "NumberOfPoints": 2,
    "StatusTypeID": 50,
    "DateLastStatusUpdate": "2021-04-08T17:16:00Z",
    "DataQualityLevel": 1,
    "DateCreated": "2021-04-08T09:45:00Z",
    "SubmissionStatusTypeID": 200
}