{
    "IsRecentlyVerified": false,
    "ID": 184354,
    "UUID": "ACA289F9-DB7C-4CC6-96A2-1D7B902CBFD5",
    "DataProviderID": 29,
    "DataProvidersReference": "10717",
    "OperatorID": 103,
    "AddressInfo": {
        "ID": 184713,
        "Title": "Wörther Straße 19",
        "AddressLine1": "Wörther Straße 19",
        "Town": "Berlin",
        "Postcode": "10405",
        "CountryID": 87,
        "Latitude": 52.535955,
        "Longitude": 13.420515,
        "DistanceUnit": 0
    },
    "Connections": [
        {
            "ID": 292545,
            "ConnectionTypeID": 25,
            "StatusTypeID": 50,
            "LevelID": 2,
            "PowerKW": 11,
            "CurrentTypeID": 20
        },
        {
            "ID": 292546,
            "ConnectionTypeID": 25,
            "StatusTypeID": 50,
            "LevelID": 2,
            "PowerKW": 11,
            "CurrentTypeID": 20
        }
    ],
    "StatusTypeID": 50,
    "DateLastStatusUpdate": "2021-07-09T03:28:00Z",
    "MetadataValues": [
        {
            "ID": 16645,
            "MetadataFieldID": 4,
            "ItemValue": "Data from the German chargepoint registry provided by Bundesnetzagentur.de under the CC-BY 4.0 license"
        }
    ],
    "DataQualityLevel": 3,
    "DateCreated": "2021-07-08T10:05:00Z",
    "SubmissionStatusTypeID": 100
}