{
    "IsRecentlyVerified": false,
    "ID": 62107,
    "UUID": "30F60A5C-04D3-4747-91EE-1610BFB0A94B",
    "DataProviderID": 1,
    "OperatorID": 23,
    "OperatorsReference": "13153",
    "UsageTypeID": 1,
    "UsageCost": "Free",
    "AddressInfo": {
        "ID": 62453,
        "Title": "The Cornucopia Cafe",
        "AddressLine1": "146 Casselman Rd",
        "Town": "Grantsville",
        "StateOrProvince": "MD",
        "Postcode": "21536",
        "CountryID": 2,
        "Latitude": 39.696924,
        "Longitude": -79.141057,
        "ContactTelephone1": "301-895-8142  877-798-3752",
        "AccessComments": "24 hours daily; see front desk for access",
        "RelatedURL": "http://www.teslamotors.com/supercharger",
        "DistanceUnit": 0
    },
    "Connections": [
        {
            "ID": 79010,
            "ConnectionTypeID": 30,
            "StatusTypeID": 50,
            "LevelID": 2,
            "Amps": 16,
            "Voltage": 230,
            "PowerKW": 16,
            "CurrentTypeID": 10,
            "Quantity": 1
        }
    ],
    "NumberOfPoints": 1,
    "StatusTypeID": 50,
    "DateLastStatusUpdate": "2017-02-16T10:50:00Z",
    "DataQualityLevel": 3,
    "DateCreated": "2016-03-03T11:38:00Z",
    "SubmissionStatusTypeID": 100
}