{
    "IsRecentlyVerified": false,
    "ID": 126212,
    "UUID": "49F36476-09F1-49B2-A9D3-57E6512543A7",
    "DataProviderID": 1,
    "OperatorID": 3,
    "OperatorsReference": "PG-81771",
    "UsageTypeID": 4,
    "UsageCost": "£1.20/hour for 4 hours,then £5.00/hour",
    "AddressInfo": {
        "ID": 126558,
        "Title": "Royal Wells Park-Twining Close",
        "AddressLine1": "6 Twining Close",
        "Town": "Tunbridge Wells",
        "StateOrProvince": "Kent",
        "Postcode": "TN4 8FJ",
        "CountryID": 1,
        "Latitude": 51.136946,
        "Longitude": 0.260256,
        "DistanceUnit": 0
    },
    "Connections": [
        {
            "ID": 176892,
            "ConnectionTypeID": 25,
            "StatusTypeID": 50,
            "LevelID": 2,
            "Amps": 32,
            "Voltage": 230,
            "PowerKW": 7,
            "CurrentTypeID": 10,
            "Quantity": 2
        }
    ],
    "NumberOfPoints": 2,
    "GeneralComments": "This is an open charge unit installed at the Berkeley Homes - Twining Close site in Tunbridge Wells, Kent",
    "StatusTypeID": 50,
    "DateLastStatusUpdate": "2019-05-13T14:50:00Z",
    "DataQualityLevel": 1,
    "DateCreated": "2019-05-13T14:50:00Z",
    "SubmissionStatusTypeID": 200
}