{
    "IsRecentlyVerified": false,
    "ID": 174257,
    "UUID": "9A913936-08EA-425F-B031-88019328771A",
    "DataProviderID": 19,
    "DataProvidersReference": "7370",
    "AddressInfo": {
        "ID": 174616,
        "Title": "Möller Bil Mått Johanssons väg 48",
        "AddressLine1": "Möller Bil Mått Johanssons väg 48 ",
        "Town": "ESKILSTUNA",
        "StateOrProvince": "SÖDERMANLAND",
        "Postcode": "63107",
        "CountryID": 216,
        "Latitude": 59.38813,
        "Longitude": 16.47118,
        "AccessComments": "På fasaden på fastigheten och närmast infarten från Mått Johanssons väg.",
        "DistanceUnit": 0
    },
    "Connections": [
        {
            "ID": 269603,
            "ConnectionTypeID": 33,
            "Reference": "1",
            "LevelID": 3,
            "Amps": 50,
            "Voltage": 500,
            "PowerKW": 20,
            "CurrentTypeID": 30,
            "Comments": "Mode 3"
        }
    ],
    "NumberOfPoints": 1,
    "StatusTypeID": 0,
    "DateLastStatusUpdate": "2021-03-24T05:11:00Z",
    "DataQualityLevel": 2,
    "DateCreated": "2021-03-24T05:11:00Z",
    "SubmissionStatusTypeID": 100
}