{
    "IsRecentlyVerified": false,
    "ID": 118332,
    "UUID": "83D2AC86-D4DA-4BF2-B9C5-3E74DAD0073F",
    "DataProviderID": 1,
    "OperatorID": 23,
    "OperatorsReference": "34444",
    "UsageTypeID": 4,
    "UsageCost": "$0.24/min >=60kW; $0.12/min <60kW; other tariffs for older cars",
    "AddressInfo": {
        "ID": 118678,
        "Title": "Indianapolis, in - Capitol Avenue Supercharger",
        "AddressLine1": "109 South Capitol Avenue",
        "Town": "Indianapolis",
        "StateOrProvince": "IN",
        "Postcode": "46225",
        "CountryID": 2,
        "Latitude": 39.765443,
        "Longitude": -86.161222,
        "DistanceUnit": 0
    },
    "Connections": [
        {
            "ID": 167410,
            "ConnectionTypeID": 27,
            "StatusTypeID": 50,
            "LevelID": 3,
            "PowerKW": 120,
            "CurrentTypeID": 30,
            "Quantity": 12
        }
    ],
    "NumberOfPoints": 12,
    "GeneralComments": "Charging12 Superchargers, available 24/7, up to 72kW",
    "StatusTypeID": 50,
    "DateLastStatusUpdate": "2019-03-21T06:55:00Z",
    "DataQualityLevel": 1,
    "DateCreated": "2019-03-21T06:55:00Z",
    "SubmissionStatusTypeID": 200
}