{
    "IsRecentlyVerified": false,
    "ID": 170459,
    "UUID": "E91A5F13-1A60-459F-A33F-104A8D79E308",
    "DataProviderID": 1,
    "OperatorID": 3311,
    "UsageTypeID": 1,
    "AddressInfo": {
        "ID": 170818,
        "Title": "Bana J. Jelačića 22",
        "AddressLine1": "Bana J. Jelačića",
        "Town": "Orebić",
        "StateOrProvince": "",
        "Postcode": "20250",
        "CountryID": 60,
        "Latitude": 42.97716847374116,
        "Longitude": 17.18785582700491,
        "DistanceUnit": 0
    },
    "Connections": [
        {
            "ID": 260104,
            "ConnectionTypeID": 33,
            "StatusTypeID": 50,
            "LevelID": 3,
            "PowerKW": 50,
            "CurrentTypeID": 30,
            "Quantity": 1
        },
        {
            "ID": 260105,
            "ConnectionTypeID": 2,
            "StatusTypeID": 50,
            "LevelID": 3,
            "PowerKW": 50,
            "CurrentTypeID": 30,
            "Quantity": 1
        },
        {
            "ID": 260106,
            "ConnectionTypeID": 1036,
            "StatusTypeID": 50,
            "LevelID": 3,
            "Amps": 63,
            "Voltage": 400,
            "PowerKW": 43,
            "CurrentTypeID": 20,
            "Quantity": 1
        }
    ],
    "NumberOfPoints": 1,
    "StatusTypeID": 50,
    "DateLastStatusUpdate": "2020-11-27T09:26:00Z",
    "DataQualityLevel": 1,
    "DateCreated": "2020-11-27T09:15:00Z",
    "SubmissionStatusTypeID": 200
}