{
    "IsRecentlyVerified": false,
    "ID": 114295,
    "UUID": "F0BFF86A-6542-46B5-BEC9-E6C60BA9CD7E",
    "DataProviderID": 1,
    "OperatorID": 45,
    "UsageTypeID": 5,
    "UsageCost": "0.15 €/kWh",
    "AddressInfo": {
        "ID": 114641,
        "Title": "Gasolinera Coopelec",
        "AddressLine1": "Carr. Tabernes Chiva, 11, 46610 Guadasuar, Valencia, España",
        "Town": "Guadassuar",
        "StateOrProvince": "Valencia",
        "Postcode": "46610",
        "CountryID": 210,
        "Latitude": 39.18115986528907,
        "Longitude": -0.4765110931152705,
        "AccessComments": " 6h-22h; S-D (Sat-Sun) 8h-14h, 15h-19h",
        "DistanceUnit": 0
    },
    "Connections": [
        {
            "ID": 160878,
            "ConnectionTypeID": 25,
            "StatusTypeID": 50,
            "LevelID": 2,
            "Amps": 32,
            "Voltage": 400,
            "PowerKW": 22,
            "CurrentTypeID": 20,
            "Quantity": 3
        }
    ],
    "NumberOfPoints": 3,
    "StatusTypeID": 50,
    "DateLastStatusUpdate": "2019-01-05T23:49:00Z",
    "DataQualityLevel": 1,
    "DateCreated": "2019-01-05T17:22:00Z",
    "SubmissionStatusTypeID": 200
}