{
    "IsRecentlyVerified": false,
    "ID": 74107,
    "UUID": "C13E7FF6-AD10-4DDF-AB48-E028DBCD5E62",
    "DataProviderID": 1,
    "OperatorID": 89,
    "OperatorsReference": "AAB-00049",
    "UsageTypeID": 4,
    "UsageCost": "Free",
    "AddressInfo": {
        "ID": 74453,
        "Title": "Tim Hortons #532-Oakville",
        "AddressLine1": "111 Cross Avenue",
        "Town": "Oakville",
        "StateOrProvince": "ON",
        "Postcode": "L6J 2W7",
        "CountryID": 44,
        "Latitude": 43.454605,
        "Longitude": -79.68654,
        "DistanceUnit": 0
    },
    "Connections": [
        {
            "ID": 106432,
            "ConnectionTypeID": 1,
            "StatusTypeID": 50,
            "LevelID": 2,
            "Amps": 32,
            "Voltage": 230,
            "PowerKW": 7,
            "CurrentTypeID": 10,
            "Quantity": 1
        }
    ],
    "NumberOfPoints": 1,
    "StatusTypeID": 50,
    "DateLastStatusUpdate": "2016-11-27T11:50:00Z",
    "DataQualityLevel": 1,
    "DateCreated": "2016-11-24T00:19:00Z",
    "SubmissionStatusTypeID": 200
}