{
    "IsRecentlyVerified": false,
    "ID": 143921,
    "UUID": "878ACC04-613D-48FE-BF48-B1DBCCA3B266",
    "DataProviderID": 2,
    "DataProvidersReference": "145742",
    "OperatorID": 5,
    "UsageTypeID": 1,
    "AddressInfo": {
        "ID": 144273,
        "Title": "DAS OREGON",
        "AddressLine1": "350 Airport Rd SE",
        "Town": "Salem",
        "StateOrProvince": "OR",
        "Postcode": "97301",
        "CountryID": 2,
        "Latitude": 44.928355,
        "Longitude": -123.003653,
        "ContactTelephone1": "888-758-4389",
        "AccessComments": "24 hours daily",
        "RelatedURL": "http://www.chargepoint.com/",
        "DistanceUnit": 0
    },
    "Connections": [
        {
            "ID": 200345,
            "ConnectionTypeID": 1,
            "LevelID": 2,
            "Amps": 16,
            "Voltage": 230,
            "PowerKW": 3.7,
            "CurrentTypeID": 10,
            "Quantity": 16
        }
    ],
    "StatusTypeID": 50,
    "DateLastStatusUpdate": "2020-06-26T03:08:00Z",
    "DataQualityLevel": 3,
    "DateCreated": "2019-12-24T09:22:00Z",
    "SubmissionStatusTypeID": 100
}