{
    "IsRecentlyVerified": false,
    "ID": 42021,
    "UUID": "DB285776-B6F5-4C9C-9650-40EF1998DA3E",
    "DataProviderID": 2,
    "DataProvidersReference": "65716",
    "OperatorID": 5,
    "UsageTypeID": 1,
    "AddressInfo": {
        "ID": 42367,
        "Title": "WHOLE FOODS MKT",
        "AddressLine1": "348 Harrison Avenue",
        "Town": "Boston",
        "StateOrProvince": "MA",
        "Postcode": "02118",
        "CountryID": 2,
        "Latitude": 42.345169,
        "Longitude": -71.062833,
        "ContactTelephone1": "888-758-4389",
        "AccessComments": "24 hours daily",
        "RelatedURL": "http://www.chargepoint.com/",
        "DistanceUnit": 0
    },
    "Connections": [
        {
            "ID": 50398,
            "ConnectionTypeID": 1,
            "LevelID": 2,
            "Amps": 16,
            "Voltage": 230,
            "PowerKW": 3,
            "CurrentTypeID": 10,
            "Quantity": 1
        },
        {
            "ID": 79431,
            "ConnectionTypeID": 32,
            "LevelID": 3,
            "Amps": 100,
            "Voltage": 400,
            "PowerKW": 40,
            "CurrentTypeID": 30,
            "Quantity": 1
        }
    ],
    "DateLastStatusUpdate": "2019-12-24T09:20:00Z",
    "DataQualityLevel": 3,
    "DateCreated": "2015-02-23T02:10:00Z",
    "SubmissionStatusTypeID": 100
}