{
    "IsRecentlyVerified": false,
    "ID": 154535,
    "UUID": "8037776F-D6B6-4425-BB96-483E1C783927",
    "DataProviderID": 1,
    "OperatorID": 3375,
    "UsageTypeID": 5,
    "UsageCost": "$0.20/min",
    "AddressInfo": {
        "ID": 154888,
        "Title": "Petro-Canada Saint-Jean-Port-Joli",
        "AddressLine1": "704 Route de l'Église",
        "Town": "Saint-Jean-Port-Joli",
        "StateOrProvince": "Quebec",
        "Postcode": "G0R 3G0",
        "CountryID": 44,
        "Latitude": 47.19412034151614,
        "Longitude": -70.24016598922077,
        "ContactTelephone1": "1 800-668-0220",
        "RelatedURL": "https://www.petro-canada.ca/ve",
        "DistanceUnit": 0
    },
    "Connections": [
        {
            "ID": 217339,
            "ConnectionTypeID": 2,
            "StatusTypeID": 50,
            "LevelID": 3,
            "Amps": 250,
            "Voltage": 400,
            "PowerKW": 100,
            "CurrentTypeID": 30,
            "Quantity": 2
        },
        {
            "ID": 217340,
            "ConnectionTypeID": 32,
            "StatusTypeID": 50,
            "LevelID": 3,
            "Amps": 500,
            "Voltage": 400,
            "PowerKW": 200,
            "CurrentTypeID": 30,
            "Quantity": 2
        }
    ],
    "NumberOfPoints": 2,
    "StatusTypeID": 50,
    "DateLastStatusUpdate": "2020-03-17T08:18:00Z",
    "DataQualityLevel": 1,
    "DateCreated": "2020-03-16T18:46:00Z",
    "SubmissionStatusTypeID": 200
}