{
    "MediaItems": [
        {
            "ID": 12871,
            "ChargePointID": 88849,
            "ItemURL": "https://s3-ap-southeast-2.amazonaws.com/openchargemap/images/ES/OCM88849/OCM-88849.orig.2017062015200282.jpg",
            "ItemThumbnailURL": "https://s3-ap-southeast-2.amazonaws.com/openchargemap/images/ES/OCM88849/OCM-88849.thmb.2017062015200282.jpg",
            "Comment": "",
            "IsEnabled": true,
            "IsVideo": false,
            "IsFeaturedItem": false,
            "IsExternalResource": false,
            "User": {
                "ID": 15712,
                "Username": "Extremadura Hotel"
            },
            "DateCreated": "2017-06-20T15:20:00Z"
        }
    ],
    "IsRecentlyVerified": false,
    "ID": 88849,
    "UUID": "32DA6292-DEB0-4AEC-AFA1-3E9D29088410",
    "DataProviderID": 1,
    "OperatorID": 23,
    "OperatorsReference": "30614",
    "UsageTypeID": 6,
    "AddressInfo": {
        "ID": 89195,
        "Title": "Hotel Extremadura",
        "AddressLine1": "Avenida Virgen de Guadalupe 28",
        "Town": "Cáceres",
        "StateOrProvince": "Caceres",
        "Postcode": "10001",
        "CountryID": 210,
        "Latitude": 39.469461,
        "Longitude": -6.38433,
        "ContactTelephone1": "+34 927 629 639",
        "DistanceUnit": 0
    },
    "Connections": [
        {
            "ID": 126097,
            "ConnectionTypeID": 30,
            "StatusTypeID": 50,
            "LevelID": 2,
            "Amps": 32,
            "Voltage": 230,
            "PowerKW": 14,
            "CurrentTypeID": 20,
            "Quantity": 1
        }
    ],
    "NumberOfPoints": 1,
    "GeneralComments": "1 Tesla Connector, up to 14kW.Available for patrons only. Please see front desk.",
    "StatusTypeID": 50,
    "DateLastStatusUpdate": "2020-08-17T12:02:00Z",
    "DataQualityLevel": 1,
    "DateCreated": "2017-06-09T14:44:00Z",
    "SubmissionStatusTypeID": 200
}