{
    "IsRecentlyVerified": false,
    "ID": 139264,
    "UUID": "30129A1B-E290-4E54-8E9F-08A00E393D5E",
    "DataProviderID": 2,
    "DataProvidersReference": "93512",
    "OperatorID": 15,
    "UsageTypeID": 4,
    "AddressInfo": {
        "ID": 139616,
        "Title": "Rancho Las Palmas Shopping Center",
        "AddressLine1": "42370 Bob Hope Dr",
        "Town": "Rancho Mirage",
        "StateOrProvince": "CA",
        "Postcode": "92270",
        "CountryID": 2,
        "Latitude": 33.738376,
        "Longitude": -116.407444,
        "ContactTelephone1": "877-455-3833",
        "AccessComments": "24 hours daily\r\nPublic - Card key at all times",
        "RelatedURL": "https://www.evgo.com/",
        "DistanceUnit": 0
    },
    "Connections": [
        {
            "ID": 194562,
            "ConnectionTypeID": 2,
            "LevelID": 3,
            "Amps": 100,
            "Voltage": 400,
            "PowerKW": 40,
            "CurrentTypeID": 30,
            "Quantity": 1
        },
        {
            "ID": 194563,
            "ConnectionTypeID": 32,
            "LevelID": 3,
            "Amps": 100,
            "Voltage": 400,
            "PowerKW": 40,
            "CurrentTypeID": 30,
            "Quantity": 1
        }
    ],
    "StatusTypeID": 50,
    "DateLastStatusUpdate": "2020-06-26T02:56:00Z",
    "DataQualityLevel": 3,
    "DateCreated": "2019-12-24T09:10:00Z",
    "SubmissionStatusTypeID": 100
}