{
    "IsRecentlyVerified": false,
    "ID": 158393,
    "UUID": "44BD60C4-1060-444A-9B0C-4D591263677A",
    "DataProviderID": 2,
    "DataProvidersReference": "154597",
    "OperatorID": 5,
    "UsageTypeID": 1,
    "AddressInfo": {
        "ID": 158748,
        "Title": "UDR",
        "AddressLine1": "945 Market St",
        "Town": "San Diego",
        "StateOrProvince": "CA",
        "Postcode": "92101",
        "CountryID": 2,
        "Latitude": 32.7111868,
        "Longitude": -117.1561324,
        "ContactTelephone1": "888-758-4389",
        "AccessComments": "24 hours daily",
        "RelatedURL": "http://www.chargepoint.com/",
        "DistanceUnit": 0
    },
    "Connections": [
        {
            "ID": 228369,
            "ConnectionTypeID": 1,
            "LevelID": 2,
            "Amps": 16,
            "Voltage": 230,
            "PowerKW": 3.7,
            "CurrentTypeID": 10,
            "Quantity": 2
        }
    ],
    "StatusTypeID": 50,
    "DateLastStatusUpdate": "2020-06-26T02:55:00Z",
    "DataQualityLevel": 3,
    "DateCreated": "2020-06-26T02:55:00Z",
    "SubmissionStatusTypeID": 100
}