{
    "IsRecentlyVerified": false,
    "ID": 84293,
    "UUID": "89BAAFA1-2013-4CAA-A5E4-E59747551D73",
    "DataProviderID": 1,
    "OperatorID": 105,
    "UsageTypeID": 4,
    "AddressInfo": {
        "ID": 84639,
        "Title": "Bauhof",
        "AddressLine1": "Georgstraße 10",
        "Town": "Detmold",
        "StateOrProvince": "Kreis Lippe",
        "Postcode": "32756",
        "CountryID": 87,
        "Latitude": 51.95018561730482,
        "Longitude": 8.87273597784044,
        "AccessComments": "24/7 nutzbar auf dem Kundenparkplatz des Bauhofs.",
        "RelatedURL": "http://www.lz.de/lippe/detmold/21689304_Mehr-Stromtankstellen-fuer-E-Mobile-im-Detmolder-Stadtgebiet.html",
        "DistanceUnit": 0
    },
    "Connections": [
        {
            "ID": 119694,
            "ConnectionTypeID": 25,
            "StatusTypeID": 50,
            "LevelID": 2,
            "Amps": 32,
            "Voltage": 400,
            "PowerKW": 22,
            "CurrentTypeID": 20,
            "Quantity": 2
        }
    ],
    "NumberOfPoints": 2,
    "GeneralComments": "Inbetriebnahme am 01.03.2017.",
    "StatusTypeID": 50,
    "DateLastStatusUpdate": "2017-02-17T06:23:00Z",
    "DataQualityLevel": 1,
    "DateCreated": "2017-02-17T06:23:00Z",
    "SubmissionStatusTypeID": 200
}