{
    "IsRecentlyVerified": false,
    "ID": 178073,
    "UUID": "DE761419-F9F0-49C6-B26A-E9370C21A274",
    "DataProviderID": 29,
    "DataProvidersReference": "2134",
    "OperatorID": 69,
    "AddressInfo": {
        "ID": 178432,
        "Title": "In der Vorstadt 39",
        "AddressLine1": "In der Vorstadt 39",
        "Town": "Reutlingen",
        "Postcode": "72768",
        "CountryID": 87,
        "Latitude": 48.54655,
        "Longitude": 9.20604,
        "DistanceUnit": 0
    },
    "Connections": [
        {
            "ID": 278019,
            "ConnectionTypeID": 25,
            "StatusTypeID": 50,
            "LevelID": 2,
            "PowerKW": 22,
            "CurrentTypeID": 20
        },
        {
            "ID": 278020,
            "ConnectionTypeID": 25,
            "StatusTypeID": 50,
            "LevelID": 2,
            "PowerKW": 22,
            "CurrentTypeID": 20
        }
    ],
    "StatusTypeID": 0,
    "DateLastStatusUpdate": "2021-07-09T03:12:00Z",
    "MetadataValues": [
        {
            "ID": 10367,
            "MetadataFieldID": 4,
            "ItemValue": "Data from the German chargepoint registry provided by Bundesnetzagentur.de under the CC-BY 4.0 license"
        }
    ],
    "DataQualityLevel": 3,
    "DateCreated": "2021-07-08T09:49:00Z",
    "SubmissionStatusTypeID": 100
}