{
    "IsRecentlyVerified": false,
    "ID": 65431,
    "UUID": "03F5B325-344A-4C43-95D7-BE2B89447BA7",
    "DataProviderID": 26,
    "DataProvidersReference": "86421",
    "OperatorID": 179,
    "OperatorsReference": "Ecotap 1500423",
    "UsageCost": "0.00 afhankelijk van pas",
    "AddressInfo": {
        "ID": 65777,
        "Title": "Wesselmanlaan 33",
        "AddressLine1": "Wesselmanlaan 33",
        "Town": "Helmond",
        "Postcode": "5707 HB",
        "CountryID": 159,
        "Latitude": 51.482262,
        "Longitude": 5.64368,
        "RelatedURL": "http://www.ecotap.nl",
        "DistanceUnit": 0
    },
    "Connections": [
        {
            "ID": 90162,
            "ConnectionTypeID": 25,
            "LevelID": 2,
            "PowerKW": 22,
            "CurrentTypeID": 10
        }
    ],
    "NumberOfPoints": 2,
    "StatusTypeID": 50,
    "DateLastStatusUpdate": "2016-06-04T02:39:00Z",
    "DataQualityLevel": 3,
    "DateCreated": "2016-04-27T09:41:00Z",
    "SubmissionStatusTypeID": 100
}