{
    "IsRecentlyVerified": false,
    "ID": 67219,
    "UUID": "6CFD610C-8C7D-4E04-856E-A399E4538EF1",
    "DataProviderID": 1,
    "OperatorID": 23,
    "OperatorsReference": "14009",
    "UsageTypeID": 1,
    "UsageCost": "$0.22/kWh; other tariffs for older cars",
    "AddressInfo": {
        "ID": 67565,
        "Title": "Cascade Parking Garage - Tesla",
        "AddressLine1": "215 N Cascade Ave",
        "Town": "Colorado Springs",
        "StateOrProvince": "CO",
        "Postcode": "80903",
        "CountryID": 2,
        "Latitude": 38.8373289,
        "Longitude": -104.8245869,
        "ContactTelephone1": "877-798-3752",
        "AccessComments": "24 hours daily; for Tesla use only",
        "RelatedURL": "http://www.teslamotors.com/supercharger",
        "DistanceUnit": 0
    },
    "Connections": [
        {
            "ID": 92718,
            "ConnectionTypeID": 27,
            "StatusTypeID": 50,
            "LevelID": 3,
            "Amps": 100,
            "Voltage": 400,
            "PowerKW": 120,
            "CurrentTypeID": 30,
            "Quantity": 8
        }
    ],
    "NumberOfPoints": 8,
    "StatusTypeID": 50,
    "DateLastStatusUpdate": "2018-03-13T13:24:00Z",
    "DataQualityLevel": 3,
    "DateCreated": "2016-05-29T02:04:00Z",
    "SubmissionStatusTypeID": 100
}