{
    "IsRecentlyVerified": false,
    "ID": 71874,
    "UUID": "8D32C5D5-A72B-49B2-AD62-5C2F2B45BD91",
    "DataProviderID": 1,
    "OperatorID": 69,
    "UsageTypeID": 4,
    "AddressInfo": {
        "ID": 72220,
        "Title": "Giselastraße",
        "AddressLine1": "Giselastraße 28",
        "AddressLine2": "Ecke Königinstraße",
        "Town": "München",
        "StateOrProvince": "Bayern",
        "Postcode": "80802",
        "CountryID": 87,
        "Latitude": 48.154575680507314,
        "Longitude": 11.588264838623008,
        "AccessComments": "Light and Charge Straßenlaterne mit Lademöglichkeit. 24/7 verfügbar im Verbund Ladenetz.",
        "RelatedURL": "http://www.swm.de/privatkunden/unternehmen/innovation/elektromobilitaet/swm-ladestationen",
        "DistanceUnit": 0
    },
    "Connections": [
        {
            "ID": 102986,
            "ConnectionTypeID": 25,
            "StatusTypeID": 50,
            "LevelID": 2,
            "Amps": 16,
            "Voltage": 400,
            "PowerKW": 11,
            "CurrentTypeID": 20,
            "Quantity": 1
        }
    ],
    "NumberOfPoints": 1,
    "StatusTypeID": 50,
    "DateLastStatusUpdate": "2016-09-20T06:15:00Z",
    "DataQualityLevel": 1,
    "DateCreated": "2016-09-20T06:15:00Z",
    "SubmissionStatusTypeID": 200
}