{
    "UserComments": [
        {
            "ID": 20167,
            "ChargePointID": 108262,
            "CommentTypeID": 10,
            "UserName": "ForumElettrico.it",
            "RelatedURL": "https://www.forumelettrico.it/forum/colonnina-elektro-ljubljana-22-kw-lubiana-lj-vodnikov-trg-1-t3636.html",
            "DateCreated": "2018-09-17T18:30:55.357Z",
            "User": {
                "ID": 11749,
                "Username": "ForumElettrico.it"
            },
            "CheckinStatusTypeID": 10
        }
    ],
    "MediaItems": [
        {
            "ID": 16559,
            "ChargePointID": 108262,
            "ItemURL": "https://s3-ap-southeast-2.amazonaws.com/openchargemap/images/SI/OCM108262/OCM-108262.orig.2018091718312101.jpg",
            "ItemThumbnailURL": "https://s3-ap-southeast-2.amazonaws.com/openchargemap/images/SI/OCM108262/OCM-108262.thmb.2018091718312101.jpg",
            "Comment": "",
            "IsEnabled": true,
            "IsVideo": false,
            "IsFeaturedItem": false,
            "IsExternalResource": false,
            "User": {
                "ID": 11749,
                "Username": "ForumElettrico.it"
            },
            "DateCreated": "2018-09-17T18:32:00Z"
        },
        {
            "ID": 16560,
            "ChargePointID": 108262,
            "ItemURL": "https://s3-ap-southeast-2.amazonaws.com/openchargemap/images/SI/OCM108262/OCM-108262.orig.2018091718312725.jpg",
            "ItemThumbnailURL": "https://s3-ap-southeast-2.amazonaws.com/openchargemap/images/SI/OCM108262/OCM-108262.thmb.2018091718312725.jpg",
            "Comment": "",
            "IsEnabled": true,
            "IsVideo": false,
            "IsFeaturedItem": false,
            "IsExternalResource": false,
            "User": {
                "ID": 11749,
                "Username": "ForumElettrico.it"
            },
            "DateCreated": "2018-09-17T18:32:00Z"
        },
        {
            "ID": 16557,
            "ChargePointID": 108262,
            "ItemURL": "https://s3-ap-southeast-2.amazonaws.com/openchargemap/images/SI/OCM108262/OCM-108262.orig.2018091718310749.jpg",
            "ItemThumbnailURL": "https://s3-ap-southeast-2.amazonaws.com/openchargemap/images/SI/OCM108262/OCM-108262.thmb.2018091718310749.jpg",
            "Comment": "",
            "IsEnabled": true,
            "IsVideo": false,
            "IsFeaturedItem": false,
            "IsExternalResource": false,
            "User": {
                "ID": 11749,
                "Username": "ForumElettrico.it"
            },
            "DateCreated": "2018-09-17T18:31:00Z"
        },
        {
            "ID": 16558,
            "ChargePointID": 108262,
            "ItemURL": "https://s3-ap-southeast-2.amazonaws.com/openchargemap/images/SI/OCM108262/OCM-108262.orig.2018091718311417.jpg",
            "ItemThumbnailURL": "https://s3-ap-southeast-2.amazonaws.com/openchargemap/images/SI/OCM108262/OCM-108262.thmb.2018091718311417.jpg",
            "Comment": "",
            "IsEnabled": true,
            "IsVideo": false,
            "IsFeaturedItem": false,
            "IsExternalResource": false,
            "User": {
                "ID": 11749,
                "Username": "ForumElettrico.it"
            },
            "DateCreated": "2018-09-17T18:31:00Z"
        }
    ],
    "IsRecentlyVerified": false,
    "ID": 108262,
    "UUID": "AA2A7BC0-BCC6-43EC-9B7C-B41652A78519",
    "DataProviderID": 1,
    "OperatorID": 3258,
    "UsageTypeID": 6,
    "AddressInfo": {
        "ID": 108608,
        "Title": "Elektro Ljubljana ",
        "AddressLine1": "Vodnikov trg 1",
        "Town": "Lubiana",
        "StateOrProvince": "LJ",
        "CountryID": 205,
        "Latitude": 46.050788,
        "Longitude": 14.509648,
        "RelatedURL": "https://www.forumelettrico.it/forum/colonnina-elektro-ljubljana-22-kw-lubiana-lj-vodnikov-trg-1-t3636.html",
        "DistanceUnit": 0
    },
    "Connections": [
        {
            "ID": 153016,
            "ConnectionTypeID": 25,
            "StatusTypeID": 50,
            "LevelID": 2,
            "Amps": 32,
            "Voltage": 400,
            "PowerKW": 22,
            "CurrentTypeID": 20,
            "Quantity": 2
        }
    ],
    "NumberOfPoints": 2,
    "StatusTypeID": 50,
    "DateLastStatusUpdate": "2018-09-19T09:10:00Z",
    "DataQualityLevel": 1,
    "DateCreated": "2018-09-17T18:31:00Z",
    "SubmissionStatusTypeID": 200
}