{
    "IsRecentlyVerified": false,
    "ID": 143209,
    "UUID": "BE998E39-F1AD-41CC-90AB-4FCCAD75F2BD",
    "DataProviderID": 2,
    "DataProvidersReference": "99767",
    "OperatorID": 5,
    "UsageTypeID": 1,
    "AddressInfo": {
        "ID": 143561,
        "Title": "NATIONAL GRID",
        "AddressLine1": "333 Concord Rd",
        "Town": "Westford",
        "StateOrProvince": "MA",
        "Postcode": "01886",
        "CountryID": 2,
        "Latitude": 42.555013,
        "Longitude": -71.4479428,
        "ContactTelephone1": "888-758-4389",
        "AccessComments": "24 hours daily",
        "RelatedURL": "http://www.chargepoint.com/",
        "DistanceUnit": 0
    },
    "Connections": [
        {
            "ID": 199496,
            "ConnectionTypeID": 1,
            "LevelID": 2,
            "Amps": 16,
            "Voltage": 230,
            "PowerKW": 3.7,
            "CurrentTypeID": 10,
            "Quantity": 2
        }
    ],
    "StatusTypeID": 50,
    "DateLastStatusUpdate": "2020-06-26T03:06:00Z",
    "DataQualityLevel": 3,
    "DateCreated": "2019-12-24T09:20:00Z",
    "SubmissionStatusTypeID": 100
}