{
    "IsRecentlyVerified": false,
    "ID": 66167,
    "UUID": "42ED2A04-1E0F-4573-81D5-E0825CB2E111",
    "DataProviderID": 1,
    "OperatorID": 1240,
    "UsageTypeID": 1,
    "AddressInfo": {
        "ID": 66513,
        "Title": "E-Bike Station Verbandsgemeindeverwaltung ",
        "AddressLine1": "Obertor 13",
        "Town": "Meisenheim",
        "StateOrProvince": "Meisenheim",
        "Postcode": "55590",
        "CountryID": 87,
        "Latitude": 49.70495,
        "Longitude": 7.667739999999981,
        "RelatedURL": "https://www.pfalzwerke.de/energieberatung/9244.php",
        "DistanceUnit": 0
    },
    "Connections": [
        {
            "ID": 91458,
            "ConnectionTypeID": 28,
            "StatusTypeID": 50,
            "LevelID": 1,
            "Amps": 10,
            "Voltage": 230,
            "PowerKW": 2.3,
            "CurrentTypeID": 10,
            "Quantity": 4
        }
    ],
    "NumberOfPoints": 4,
    "StatusTypeID": 50,
    "DateLastStatusUpdate": "2016-05-12T07:51:00Z",
    "DataQualityLevel": 1,
    "DateCreated": "2016-05-12T07:51:00Z",
    "SubmissionStatusTypeID": 200
}