{
    "IsRecentlyVerified": false,
    "ID": 125725,
    "UUID": "87ACCD64-728C-44D1-BC27-8A6AE4C55C6C",
    "DataProviderID": 1,
    "OperatorID": 80,
    "UsageTypeID": 4,
    "AddressInfo": {
        "ID": 126071,
        "Title": "Assisi Marconi",
        "AddressLine1": "Viale Guglielmo Marconi",
        "Town": "Assisi",
        "StateOrProvince": "PG",
        "Postcode": "06081",
        "CountryID": 112,
        "Latitude": 43.07195210183272,
        "Longitude": 12.607331092632307,
        "DistanceUnit": 0
    },
    "Connections": [
        {
            "ID": 176174,
            "ConnectionTypeID": 25,
            "StatusTypeID": 30,
            "LevelID": 2,
            "Amps": 32,
            "Voltage": 400,
            "PowerKW": 22,
            "CurrentTypeID": 20,
            "Quantity": 1
        },
        {
            "ID": 176175,
            "ConnectionTypeID": 36,
            "StatusTypeID": 30,
            "LevelID": 2,
            "Amps": 16,
            "Voltage": 240,
            "PowerKW": 3.7,
            "CurrentTypeID": 10,
            "Quantity": 1
        }
    ],
    "NumberOfPoints": 2,
    "StatusTypeID": 30,
    "DateLastStatusUpdate": "2019-04-24T14:03:00Z",
    "DataQualityLevel": 1,
    "DateCreated": "2019-04-24T14:03:00Z",
    "SubmissionStatusTypeID": 200
}