{
    "UserComments": [
        {
            "ID": 24371,
            "ChargePointID": 167214,
            "CommentTypeID": 10,
            "UserName": "ForumElettrico.it",
            "Comment": "Ottima colonnina fast che spezza a metà la traversata cost to cost da Roma a Pescara. Leggi la recensione completa qui > https://www.forumelettrico.it/forum/colonnina-fast-enelx-via-dell-aia-celano-aq-t12395.html",
            "RelatedURL": "https://www.forumelettrico.it/forum/colonnina-fast-enelx-via-dell-aia-celano-aq-t12395.html",
            "DateCreated": "2021-05-20T13:47:02.9Z",
            "User": {
                "ID": 11749,
                "Username": "ForumElettrico.it"
            },
            "CheckinStatusTypeID": 10,
            "IsActionedByEditor": false
        },
        {
            "ID": 23223,
            "ChargePointID": 167214,
            "CommentTypeID": 10,
            "UserName": "TizFlex",
            "Comment": "ottimo, speriamo entrino in funzione presto",
            "DateCreated": "2020-09-17T11:33:35.95Z",
            "User": {
                "ID": 27286,
                "Username": "TizFlex"
            },
            "CheckinStatusTypeID": 10,
            "IsActionedByEditor": false
        }
    ],
    "MediaItems": [
        {
            "ID": 27783,
            "ChargePointID": 167214,
            "ItemURL": "https://s3-ap-southeast-2.amazonaws.com/openchargemap/images/IT/OCM167214/OCM-167214.orig.2021052013471157.jpg",
            "ItemThumbnailURL": "https://s3-ap-southeast-2.amazonaws.com/openchargemap/images/IT/OCM167214/OCM-167214.thmb.2021052013471157.jpg",
            "Comment": "",
            "IsEnabled": true,
            "IsVideo": false,
            "IsFeaturedItem": false,
            "IsExternalResource": false,
            "User": {
                "ID": 11749,
                "Username": "ForumElettrico.it"
            },
            "DateCreated": "2021-05-20T13:47:00Z"
        },
        {
            "ID": 27784,
            "ChargePointID": 167214,
            "ItemURL": "https://s3-ap-southeast-2.amazonaws.com/openchargemap/images/IT/OCM167214/OCM-167214.orig.2021052013471772.jpg",
            "ItemThumbnailURL": "https://s3-ap-southeast-2.amazonaws.com/openchargemap/images/IT/OCM167214/OCM-167214.thmb.2021052013471772.jpg",
            "Comment": "",
            "IsEnabled": true,
            "IsVideo": false,
            "IsFeaturedItem": false,
            "IsExternalResource": false,
            "User": {
                "ID": 11749,
                "Username": "ForumElettrico.it"
            },
            "DateCreated": "2021-05-20T13:47:00Z"
        }
    ],
    "IsRecentlyVerified": false,
    "ID": 167214,
    "UUID": "835E6298-E536-4F15-BF08-441386F53272",
    "DataProviderID": 1,
    "OperatorID": 80,
    "UsageTypeID": 4,
    "AddressInfo": {
        "ID": 167573,
        "Title": "Celano Parcheggio Piazza Aia | EnelX",
        "AddressLine1": "Via dell'Aia 128",
        "Town": "Celano",
        "StateOrProvince": "AQ",
        "Postcode": "67043",
        "CountryID": 112,
        "Latitude": 42.086322,
        "Longitude": 13.545068,
        "AccessComments": "Si trova all'interno del parcheggio  situato vicino piazza Aia",
        "DistanceUnit": 0
    },
    "Connections": [
        {
            "ID": 253221,
            "ConnectionTypeID": 33,
            "StatusTypeID": 50,
            "LevelID": 3,
            "PowerKW": 50,
            "CurrentTypeID": 30,
            "Quantity": 1
        },
        {
            "ID": 253222,
            "ConnectionTypeID": 2,
            "StatusTypeID": 50,
            "LevelID": 3,
            "PowerKW": 50,
            "CurrentTypeID": 30,
            "Quantity": 1
        },
        {
            "ID": 253223,
            "ConnectionTypeID": 1036,
            "StatusTypeID": 50,
            "LevelID": 2,
            "PowerKW": 22,
            "CurrentTypeID": 20,
            "Quantity": 1
        }
    ],
    "NumberOfPoints": 2,
    "GeneralComments": "",
    "StatusTypeID": 50,
    "DateLastStatusUpdate": "2021-05-20T13:47:00Z",
    "DataQualityLevel": 1,
    "DateCreated": "2020-08-29T18:55:00Z",
    "SubmissionStatusTypeID": 200
}