{
    "IsRecentlyVerified": false,
    "ID": 10713,
    "UUID": "A0A6C9F7-884A-425B-A623-717CA36D67BA",
    "DataProviderID": 1,
    "DataProvidersReference": "691",
    "AddressInfo": {
        "ID": 10610,
        "Title": "Sentrumsparken, Sogndal",
        "AddressLine1": "Parkvegen 13",
        "Town": "SOGNDAL",
        "StateOrProvince": "Vestland",
        "Postcode": "6856",
        "CountryID": 168,
        "Latitude": 61.23099,
        "Longitude": 7.1036,
        "AccessComments": "Kommunens nye parkeringsområde midt i sentrum.",
        "DistanceUnit": 0
    },
    "Connections": [
        {
            "ID": 8707,
            "ConnectionTypeID": 0,
            "Reference": "1",
            "LevelID": 2,
            "Amps": 16,
            "Voltage": 230,
            "PowerKW": 3.7,
            "Comments": "Mode 1"
        },
        {
            "ID": 89203,
            "ConnectionTypeID": 0,
            "Reference": "2",
            "LevelID": 2,
            "Amps": 16,
            "Voltage": 230,
            "PowerKW": 3.7,
            "Comments": "Mode 1"
        }
    ],
    "NumberOfPoints": 2,
    "StatusTypeID": 0,
    "DateLastStatusUpdate": "2020-05-26T08:24:00Z",
    "DataQualityLevel": 2,
    "DateCreated": "2012-06-02T11:56:00Z",
    "SubmissionStatusTypeID": 100
}