{
    "IsRecentlyVerified": false,
    "ID": 177431,
    "UUID": "0A422007-4185-49C6-8094-7BD2D17C0739",
    "DataProviderID": 29,
    "DataProvidersReference": "8534",
    "OperatorID": 69,
    "AddressInfo": {
        "ID": 177790,
        "Title": "Waisenhausstr. 52",
        "AddressLine1": "Waisenhausstr. 52",
        "Town": "München",
        "Postcode": "80637",
        "CountryID": 87,
        "Latitude": 48.163195,
        "Longitude": 11.529101,
        "DistanceUnit": 0
    },
    "Connections": [
        {
            "ID": 276562,
            "ConnectionTypeID": 25,
            "StatusTypeID": 50,
            "LevelID": 2,
            "PowerKW": 22,
            "CurrentTypeID": 20
        },
        {
            "ID": 276563,
            "ConnectionTypeID": 25,
            "StatusTypeID": 50,
            "LevelID": 2,
            "PowerKW": 22,
            "CurrentTypeID": 20
        }
    ],
    "StatusTypeID": 0,
    "DateLastStatusUpdate": "2021-07-09T03:11:00Z",
    "MetadataValues": [
        {
            "ID": 9725,
            "MetadataFieldID": 4,
            "ItemValue": "Data from the German chargepoint registry provided by Bundesnetzagentur.de under the CC-BY 4.0 license"
        }
    ],
    "DataQualityLevel": 3,
    "DateCreated": "2021-07-08T09:49:00Z",
    "SubmissionStatusTypeID": 100
}