{
    "IsRecentlyVerified": false,
    "ID": 141189,
    "UUID": "D9EA01AA-4A79-46A1-9C40-8C0A04821AA8",
    "DataProviderID": 1,
    "OperatorID": 5,
    "UsageTypeID": 1,
    "AddressInfo": {
        "ID": 141541,
        "Title": "RMP NTO OFFICE",
        "AddressLine1": "400 N 100 W St",
        "Town": "Moab",
        "StateOrProvince": "UT",
        "Postcode": "84532",
        "CountryID": 2,
        "Latitude": 38.57788721551364,
        "Longitude": -109.55240161985341,
        "ContactTelephone1": "888-758-4389",
        "AccessComments": "24 hours daily",
        "RelatedURL": "http://www.chargepoint.com/",
        "DistanceUnit": 0
    },
    "Connections": [
        {
            "ID": 197050,
            "ConnectionTypeID": 2,
            "LevelID": 3,
            "Amps": 100,
            "Voltage": 400,
            "PowerKW": 50,
            "CurrentTypeID": 30,
            "Quantity": 1
        },
        {
            "ID": 197051,
            "ConnectionTypeID": 32,
            "LevelID": 3,
            "Amps": 100,
            "Voltage": 400,
            "PowerKW": 50,
            "CurrentTypeID": 30,
            "Quantity": 1
        },
        {
            "ID": 305384,
            "ConnectionTypeID": 0,
            "LevelID": 2,
            "PowerKW": 6.6,
            "Quantity": 1
        }
    ],
    "StatusTypeID": 50,
    "DateLastStatusUpdate": "2021-08-27T08:08:00Z",
    "DataQualityLevel": 3,
    "DateCreated": "2019-12-24T09:15:00Z",
    "SubmissionStatusTypeID": 100
}