{
    "IsRecentlyVerified": false,
    "ID": 157198,
    "UUID": "9702BB9A-4F56-49FD-8469-401338D80960",
    "DataProviderID": 19,
    "DataProvidersReference": "2479",
    "AddressInfo": {
        "ID": 157552,
        "Title": "Bavaria Östersund",
        "AddressLine1": "Fagerbacken 65",
        "Town": "ÖSTERSUND",
        "StateOrProvince": "JÄMTLAND",
        "Postcode": "83148",
        "CountryID": 216,
        "Latitude": 63.17013,
        "Longitude": 14.68559,
        "AccessComments": "",
        "DistanceUnit": 0
    },
    "Connections": [
        {
            "ID": 225890,
            "ConnectionTypeID": 25,
            "Reference": "1",
            "LevelID": 2,
            "Amps": 32,
            "Voltage": 230,
            "PowerKW": 7.4,
            "CurrentTypeID": 10,
            "Comments": "Mode 3"
        },
        {
            "ID": 225891,
            "ConnectionTypeID": 1,
            "Reference": "2",
            "LevelID": 2,
            "Amps": 32,
            "Voltage": 230,
            "PowerKW": 7.4,
            "CurrentTypeID": 10,
            "Comments": "Mode 3"
        }
    ],
    "NumberOfPoints": 2,
    "StatusTypeID": 0,
    "DateLastStatusUpdate": "2020-05-26T08:25:00Z",
    "DataQualityLevel": 2,
    "DateCreated": "2020-05-26T08:25:00Z",
    "SubmissionStatusTypeID": 100
}