{
    "IsRecentlyVerified": false,
    "ID": 135595,
    "UUID": "3CF32E6E-7FCA-48E0-9263-61A2DECA1130",
    "DataProviderID": 18,
    "DataProvidersReference": "f9a9d8ff10c0344b8e946c54d70d694a",
    "OperatorID": 3326,
    "UsageTypeID": 5,
    "AddressInfo": {
        "ID": 135941,
        "Title": "Box Hill",
        "AddressLine1": "Box Hill",
        "Town": "Corsham",
        "Postcode": "SN13 8HN",
        "CountryID": 1,
        "Latitude": 51.423117,
        "Longitude": -2.239331,
        "AccessComments": "",
        "RelatedURL": "http://www.alfapower.co.uk/",
        "DistanceUnit": 0
    },
    "Connections": [
        {
            "ID": 190001,
            "ConnectionTypeID": 25,
            "Reference": "A",
            "StatusTypeID": 50,
            "LevelID": 2,
            "Amps": 32,
            "Voltage": 400,
            "PowerKW": 22,
            "CurrentTypeID": 20
        },
        {
            "ID": 190002,
            "ConnectionTypeID": 25,
            "Reference": "B",
            "StatusTypeID": 50,
            "LevelID": 2,
            "Amps": 32,
            "Voltage": 400,
            "PowerKW": 22,
            "CurrentTypeID": 20
        }
    ],
    "StatusTypeID": 0,
    "DateLastStatusUpdate": "2020-03-17T08:53:00Z",
    "MetadataValues": [
        {
            "ID": 5447,
            "MetadataFieldID": 4,
            "ItemValue": "Contains public sector information licensed under the Open Government Licence v2.0. http://www.nationalarchives.gov.uk/doc/open-government-licence/version/2/"
        }
    ],
    "DataQualityLevel": 3,
    "DateCreated": "2019-12-24T05:22:00Z",
    "SubmissionStatusTypeID": 100
}