{
    "IsRecentlyVerified": false,
    "ID": 107425,
    "UUID": "1E6E89F2-326A-49D3-AF87-9EB95264DC2F",
    "DataProviderID": 1,
    "OperatorID": 3319,
    "UsageTypeID": 1,
    "UsageCost": "free",
    "AddressInfo": {
        "ID": 107771,
        "Title": "Budapest, Árpád fejedelem útja 12.",
        "AddressLine1": "Árpád fejedelem útja 12.",
        "Town": "Budapest",
        "StateOrProvince": "Budapest",
        "Postcode": "1023",
        "CountryID": 104,
        "Latitude": 47.5209694908042,
        "Longitude": 19.0379265853195,
        "ContactTelephone1": "+36 80 21-00-12",
        "ContactEmail": "kommunikacio@e-mobi.hu",
        "RelatedURL": "https://e-mobi.hu",
        "DistanceUnit": 0
    },
    "Connections": [
        {
            "ID": 151572,
            "ConnectionTypeID": 25,
            "StatusTypeID": 50,
            "LevelID": 2,
            "Amps": 32,
            "Voltage": 400,
            "PowerKW": 22,
            "CurrentTypeID": 20,
            "Quantity": 2
        }
    ],
    "NumberOfPoints": 2,
    "GeneralComments": "ingyenes, azonnal indul kábel csatlakoztatásakor",
    "StatusTypeID": 50,
    "DateLastStatusUpdate": "2018-07-31T14:12:00Z",
    "DataQualityLevel": 1,
    "DateCreated": "2018-07-29T12:56:00Z",
    "SubmissionStatusTypeID": 200
}