{
    "IsRecentlyVerified": false,
    "ID": 41777,
    "UUID": "B5825B5F-FD09-4946-B674-79C848D6C978",
    "DataProviderID": 2,
    "DataProvidersReference": "65404",
    "UsageTypeID": 1,
    "AddressInfo": {
        "ID": 42123,
        "Title": "Ottawa National Wildlife Refuge",
        "AddressLine1": "14000 W State Route 2",
        "Town": "Oak Harbor",
        "StateOrProvince": "OH",
        "Postcode": "43449",
        "CountryID": 2,
        "Latitude": 41.603862,
        "Longitude": -83.202233,
        "ContactTelephone1": "419-898-0014",
        "AccessComments": "Sunrise to sunset daily",
        "RelatedURL": "",
        "DistanceUnit": 0
    },
    "Connections": [
        {
            "ID": 50023,
            "ConnectionTypeID": 1,
            "LevelID": 2,
            "Amps": 16,
            "Voltage": 230,
            "PowerKW": 3.7,
            "CurrentTypeID": 10,
            "Quantity": 2
        }
    ],
    "DateLastStatusUpdate": "2020-06-26T03:04:00Z",
    "DataQualityLevel": 3,
    "DateCreated": "2015-02-09T05:20:00Z",
    "SubmissionStatusTypeID": 100
}